{"text_format":"1","workbook":"xlsx","n_sheets":12,"sheets":["READ ME","Main_Inputs_Page","DSI86_INPUTS","EDID_Formatting_Space","Calcs","Script_ASSR","Qualcomm_ASSR","Script_NoASSR","Qualcomm_noASSR","CSR","EDID","Raw_EDID_Cals"],"not_rendered":{"charts":0,"images":16,"macros":1,"external_links":0,"defined_names":0,"comments":0,"pivot_tables":0},"unopened":[],"bounds":{"document_bytes":16777216,"sheet_cells":100000,"rows_first":2000,"rows_last":500,"rows_between":2000,"halvings":0,"cell_chars":16384,"cell_head_chars":4096},"cells_cut":0,"cells_raw":0,"read":"whole","date_system":"1900"}

{"sheet":"READ ME","index":0,"n_rows":131,"n_cols":3,"rows_kept":131,"cut":false,"hidden":false,"merged":[[20,2,20,15],[16,2,16,15],[10,1,10,17],[11,1,11,17],[12,1,12,17],[13,1,13,17],[14,1,14,17],[130,2,130,15],[86,2,86,15],[64,2,64,15],[108,2,108,15],[42,2,42,15],[1,1,2,6],[4,1,4,17],[5,1,5,17],[6,1,6,16],[9,1,9,17],[8,1,8,17]]}
[]
[null,"SN65DSI86 Register Calculator"]
[]
[]
[null,"This spreadsheet is intended to take information such as the EDID information and the DSI information and output the register values for the SN65DSI86. "]
[null,"The information is inputted into the Inputs_Page and the settings are automatically calculated and put into the other pages below."]
[null,"The calculated values are outputted into the Script_ASSR, Qualcomm_ASSR, Scrip_NoASSR and Qualcomm_noASSR pages."]
[]
{"$rows_left_out":124}
{"sheet":"Main_Inputs_Page","index":1,"n_rows":30,"n_cols":24,"rows_kept":30,"cut":false,"hidden":false,"merged":[[29,4,29,19],[1,1,2,2],[15,7,15,26],[28,4,28,19]]}
[]
[null,"SN65DSI86 Register Calculator",null,null,"Color Legend"]
[null,null,null,null,"Calculated OUTPUTS"]
[null,null,null,null,"INPUTS"]
[]
[null," Datasheet EDID Information","Manual Inputs",null,"Category's","DP/DSI Settings",null,"EDID Registers Table",0,1,2,3,4,5,6,7,8,9,"A","B","C","D","E","F"]
[null,"Panel Vendor","InfoVision",null,"# of DP Lanes for DSI86",4,null,0,0,"FF","FF","FF","FF","FF","FF",0,26,"CF",14,34,0,0,0,0]
[null,"Panel Model#","M125NWF4 R0",null,"# of DP Lanes for DP Panel",4,null,10,0,"1C",1,4,"A5","1D",11,78,"0A","1D",30,"A7",50,47,97,27]
{"$rows_left_out":23}
{"sheet":"DSI86_INPUTS","index":2,"n_rows":41,"n_cols":8,"rows_kept":41,"cut":false,"hidden":true,"merged":[[14,4,14,5]]}
[]
[null,"Category","EDID page Inputs",null,"Category","DP/DSI Settings",null,"Color Legend"]
[null,"Panel Vendor",{"$f":"EDID!C$3","v":"InfoVision"},null,"# of DP Lanes for DSI86",{"$f":"Main_Inputs_Page!F7","v":4},null,"Calculated OUTPUTS"]
[null,"Panel Model#",{"$f":"EDID!C$4","v":"M125NWF4 R0"},null,"# of DP Lanes for DP Panel",{"$f":"Main_Inputs_Page!F8","v":4},null,"INPUTS"]
[null,"Resolution",{"$f":"EDID!C$5","v":"2160x1440"},null,"Max DP datarate for DP Panel",{"$f":"Main_Inputs_Page!F9","v":"HBR"}]
[null,"Hsync (in pixels)",{"$f":"EDID!C$17","v":48},null,"# of DSI A Lanes",{"$f":"Main_Inputs_Page!F10","v":4}]
[null,"HSync POLARITY",{"$f":"EDID!C$15","v":"NEGATIVE"},null,"# of DSI B Lanes",{"$f":"Main_Inputs_Page!F11","v":0}]
[null,"HBPorch (in pixels)",{"$f":"EDID!C$18","v":88},null,"DSI Video mode",{"$f":"Main_Inputs_Page!F12","v":"RGB666"}]
{"$rows_left_out":34}
{"sheet":"EDID_Formatting_Space","index":3,"n_rows":34,"n_cols":25,"rows_kept":34,"cut":false,"hidden":false,"merged":[[1,1,1,8],[2,1,2,8],[3,1,3,8],[4,1,4,8],[5,1,5,8]]}
[]
[null,"EDID Formatting Space"]
[null,"Use the this space to format the EDIE registers in a way that the script can read. "]
[null,"1. Copy the EDID registers and paste them using \"Matching Destination Formatting (M)\" "]
[null,"2. Select the data and under the \"Data\" section, select \"Text to Columns\"."]
[null,"3. Select \"Fixed Width\" and then click \"Finish\""]
[]
[null,"Step 1:"]
{"$rows_left_out":27}
{"sheet":"Calcs","index":4,"n_rows":37,"n_cols":10,"rows_kept":37,"cut":false,"hidden":true,"merged":[[1,4,1,5]]}
[]
[null,"Category","DSI86_INPUTS and EDID page Inputs",null,{"$f":"DSI86_INPUTS!E15","v":"LEFTRIGHT MODE ONLY"},null,null,"Color Legend"]
[null,{"$f":"DSI86_INPUTS!B3","v":"Panel Vendor"},{"$f":"DSI86_INPUTS!C$3","v":"InfoVision"},null,{"$f":"DSI86_INPUTS!E16","v":"Right Pixel Start"},{"$f":"DSI86_INPUTS!F$16","v":1440},null,"Calculated OUTPUTS"]
[null,{"$f":"DSI86_INPUTS!B4","v":"Panel Model#"},{"$f":"DSI86_INPUTS!C$4","v":"M125NWF4 R0"},null,{"$f":"DSI86_INPUTS!E17","v":"LEFT HACTIVE"},{"$f":"DSI86_INPUTS!F$17","v":1439},null,"INPUTS"]
[null,{"$f":"EDID!$B$5","v":"Resolution"},{"$f":"EDID!$C$5","v":"2160x1440"},null,{"$f":"DSI86_INPUTS!E18","v":"RIGHT HACTIVE"},{"$f":"DSI86_INPUTS!F$18","v":481}]
[null,{"$f":"DSI86_INPUTS!B6","v":"Hsync (in pixels)"},{"$f":"DSI86_INPUTS!C$6","v":48},null,{"$f":"DSI86_INPUTS!E19","v":"LEFT CROP"},{"$f":"DSI86_INPUTS!F$19","v":0},null,"Registers","Binary Value","Hex Values"]
[null,"Hsync (in us)",{"$f":"ROUNDUP(C6/C$28, 3) &\" us\"","v":"0.173 us"},null,{"$f":"DSI86_INPUTS!E20","v":"RIGHT CROP"},{"$f":"DSI86_INPUTS!F$20","v":0},null,"0x10",{"$f":"(IF(DSI86_INPUTS!F10=\"EvenOdd\",\"0\",\"1\")&IF(DSI86_INPUTS!F9=\"Single\",\"01\",\"00\")&IF(DSI86_INPUTS!F6=4,\"00\",IF(DSI86_INPUTS!F6=3,\"01\",IF(DSI86_INPUTS!F6=2,\"10\",\"11\")))&IF(DSI86_INPUTS!F7=4,\"00\",IF(DSI86_INPUTS!F7=3,\"01\",IF(DSI86_INPUTS!F7=2,\"10\",\"11\")))&0)","v":"00100110"},{"$f":"BIN2HEX(I7,2)","v":"26"}]
[null,{"$f":"DSI86_INPUTS!$B$7","v":"HSync POLARITY"},{"$f":"DSI86_INPUTS!C$7","v":"NEGATIVE"},null,{"$f":"DSI86_INPUTS!E21","v":"HACTIVE with Crop"},{"$f":"DSI86_INPUTS!F$21","v":1920},null,"0x3C",{"$f":"IF(DSI86_INPUTS!F12=\"DISABLE\",\"00\",\"10\")&IF(DSI86_INPUTS!F13=\"Horizontal Colors: Stripes\",\"111\",IF(DSI86_INPUTS!F13=\"Horizontal Colors: 3 Color\",\"110\",IF(DSI86_INPUTS!F13=\"Horizontal Colors: 8 Gray Scale\",\"101\",IF(DSI86_INPUTS!F13=\"Horizontal Colors: 8 Color\",\"100\",IF(DSI86_INPUTS!F13=\"Vertical Colors: Stripes\",\"011\",IF(DSI86_INPUTS!F13=\"Vertical Colors: 3 Color\",\"010\",IF(DSI86_INPUTS!F13=\"Vertical Colors: 8 Gray Scale\",\"001\",IF(DSI86_INPUTS!F13=\"Vertical Colors: 8 Color (Default)\",\"000\",\"NAN\"))))))))","v":"10010"},{"$f":"BIN2HEX(I8,2)","v":"12"}]
{"$rows_left_out":30}
{"sheet":"Script_ASSR","index":5,"n_rows":75,"n_cols":11,"rows_kept":75,"cut":false,"hidden":false,"merged":[[59,1,59,8],[62,1,62,8],[65,1,65,8],[68,1,68,8],[71,1,71,8],[22,1,22,8],[1,1,1,8],[38,1,38,8],[41,1,41,8],[44,1,44,8],[7,1,7,8],[10,1,10,8],[13,1,13,8],[16,1,16,8],[19,1,19,8],[56,1,56,8],[25,1,25,8],[29,1,29,8],[32,1,32,8],[35,1,35,8],[50,1,50,8],[53,1,53,8],[47,1,47,8]]}
[]
[null,"This code is meant for an Aardvark USB to I2C to program the SN65DSI86"]
[null,null,"Addr","Data"]
[null,"<aardvark>"]
[null,"<configure i2c=\"1\" spi=\"1\" gpio=\"0\" tpower=\"1\" pullups=\"0\"/>"]
[null,"    <i2c_bitrate khz=\"100\"/>"]
[]
[null,"======REFCLK Frequency  ======",null,null,null,null,null,null,null,null,{"$f":"TRIM(E6)","v":""}]
{"$rows_left_out":68}
{"sheet":"Qualcomm_ASSR","index":6,"n_rows":38,"n_cols":5,"rows_kept":38,"cut":false,"hidden":false,"merged":[]}
[]
[null,null,"Register ","Data"]
[null,"\"<DSIInitSequence>\""]
[null,"\"23",{"$f":"Script_ASSR!C9","v":"0A"},{"$f":"Script_ASSR!D9","v":2},"\\n\""]
[null,"\"23",{"$f":"Script_ASSR!C12","v":10},{"$f":"Script_ASSR!D12","v":"26"},"\\n\""]
[null,"\"23",{"$f":"Script_ASSR!C15","v":12},{"$f":"Script_ASSR!D15","v":"7C"},"\\n\""]
[null,"\"23",{"$f":"Script_ASSR!C18","v":13},{"$f":"Script_ASSR!D18","v":"7C"},"\\n\""]
[null,"\"23",{"$f":"Script_ASSR!C21","v":94},{"$f":"Script_ASSR!D21","v":20},"\\n\""]
{"$rows_left_out":31}
{"sheet":"Script_NoASSR","index":7,"n_rows":76,"n_cols":6,"rows_kept":76,"cut":false,"hidden":false,"merged":[[63,1,63,5],[66,1,66,5],[69,1,69,5],[72,1,72,5],[1,1,1,5],[45,1,45,5],[48,1,48,5],[51,1,51,5],[54,1,54,5],[57,1,57,5],[60,1,60,5],[27,1,27,5],[30,1,30,5],[33,1,33,5],[36,1,36,5],[39,1,39,5],[42,1,42,5],[7,1,7,5],[12,1,12,5],[15,1,15,5],[18,1,18,5],[21,1,21,5],[24,1,24,5]]}
[]
[null,"This code is meant for an Aardvark USB to I2C to program the SN65DSI86"]
[null,null,"Addr","Data"]
[null,"<aardvark>"]
[null,"<configure i2c=\"1\" spi=\"1\" gpio=\"0\" tpower=\"1\" pullups=\"0\"/>"]
[null,"    <i2c_bitrate khz=\"100\"/>"]
[]
[null,"======ASSR RW control  ======"]
{"$rows_left_out":69}
{"sheet":"Qualcomm_noASSR","index":8,"n_rows":35,"n_cols":8,"rows_kept":35,"cut":false,"hidden":false,"merged":[]}
[]
[null,null,null,null,null,"Register","Data"]
[null,null,null,null,"\"<DSIInitSequence>\""]
[null,null,null,null,"\"23",{"$f":"Script_NoASSR!C9","v":"FF"},{"$f":"Script_NoASSR!D9","v":7},"\\n\""]
[null,null,null,null,"\"23",{"$f":"Script_NoASSR!C10","v":16},{"$f":"Script_NoASSR!D10","v":1},"\\n\""]
[null,null,null,null,"\"23",{"$f":"Script_NoASSR!C11","v":"FF"},{"$f":"Script_NoASSR!D11","v":0},"\\n\""]
[null,null,null,null,"\"23",{"$f":"Script_NoASSR!C14","v":"0A"},{"$f":"Script_NoASSR!D14","v":2},"\\n\""]
[null,null,null,null,"\"23",{"$f":"Script_NoASSR!C17","v":10},{"$f":"Script_NoASSR!D17","v":"26"},"\\n\""]
{"$rows_left_out":28}
{"sheet":"CSR","index":9,"n_rows":41,"n_cols":5,"rows_kept":41,"cut":false,"hidden":true,"merged":[]}
[]
[]
[null,{"$f":"DSI86_INPUTS!B$3","v":"Panel Vendor"},{"$f":"DSI86_INPUTS!C$3","v":"InfoVision"},null,"Color Legend"]
[null,{"$f":"DSI86_INPUTS!B$4","v":"Panel Model#"},{"$f":"DSI86_INPUTS!C$4","v":"M125NWF4 R0"},null,"Calculated OUTPUTS"]
[null,{"$f":"EDID!$B$5","v":"Resolution"},{"$f":"EDID!C$5","v":"2160x1440"},null,"INPUTS"]
[]
[null,"RESET AND CLOCK REGISTERS","HEX"]
[null,"REFCLK_FREQ",{"$f":"IF(DSI86_INPUTS!F$11 = 12,0,IF(DSI86_INPUTS!F$11 = 38.4,8,IF(DSI86_INPUTS!F$11=26,4,IF(DSI86_INPUTS!F$11 = 27,6,2))))","v":2}]
{"$rows_left_out":34}
{"sheet":"EDID","index":10,"n_rows":24,"n_cols":22,"rows_kept":24,"cut":false,"hidden":true,"merged":[[4,2,4,3],[11,7,11,26],[2,2,2,3],[3,2,3,3]]}
[]
[null,"Category","Calc. Outputs","Manual Inputs",null,"EDID registers",0,1,2,3,4,5,6,7,8,9,"A","B","C","D","E","F"]
[null,"Panel Vendor",{"$f":"Main_Inputs_Page!C7","v":"InfoVision"},null,null,0,{"$f":"Main_Inputs_Page!I7","v":0},{"$f":"Main_Inputs_Page!J7","v":"FF"},{"$f":"Main_Inputs_Page!K7","v":"FF"},{"$f":"Main_Inputs_Page!L7","v":"FF"},{"$f":"Main_Inputs_Page!M7","v":"FF"},{"$f":"Main_Inputs_Page!N7","v":"FF"},{"$f":"Main_Inputs_Page!O7","v":"FF"},{"$f":"Main_Inputs_Page!P7","v":0},{"$f":"Main_Inputs_Page!Q7","v":26},{"$f":"Main_Inputs_Page!R7","v":"CF"},{"$f":"Main_Inputs_Page!S7","v":14},{"$f":"Main_Inputs_Page!T7","v":34},{"$f":"Main_Inputs_Page!U7","v":0},{"$f":"Main_Inputs_Page!V7","v":0},{"$f":"Main_Inputs_Page!W7","v":0},{"$f":"Main_Inputs_Page!X7","v":0}]
[null,"Panel Model#",{"$f":"Main_Inputs_Page!C8","v":"M125NWF4 R0"},null,null,10,{"$f":"Main_Inputs_Page!I8","v":0},{"$f":"Main_Inputs_Page!J8","v":"1C"},{"$f":"Main_Inputs_Page!K8","v":1},{"$f":"Main_Inputs_Page!L8","v":4},{"$f":"Main_Inputs_Page!M8","v":"A5"},{"$f":"Main_Inputs_Page!N8","v":"1D"},{"$f":"Main_Inputs_Page!O8","v":11},{"$f":"Main_Inputs_Page!P8","v":78},{"$f":"Main_Inputs_Page!Q8","v":"0A"},{"$f":"Main_Inputs_Page!R8","v":"1D"},{"$f":"Main_Inputs_Page!S8","v":30},{"$f":"Main_Inputs_Page!T8","v":"A7"},{"$f":"Main_Inputs_Page!U8","v":50},{"$f":"Main_Inputs_Page!V8","v":47},{"$f":"Main_Inputs_Page!W8","v":97},{"$f":"Main_Inputs_Page!X8","v":27}]
[null,"Resolution",{"$f":"Main_Inputs_Page!C9","v":"2160x1440"},null,null,20,{"$f":"Main_Inputs_Page!I9","v":13},{"$f":"Main_Inputs_Page!J9","v":50},{"$f":"Main_Inputs_Page!K9","v":54},{"$f":"Main_Inputs_Page!L9","v":0},{"$f":"Main_Inputs_Page!M9","v":0},{"$f":"Main_Inputs_Page!N9","v":0},{"$f":"Main_Inputs_Page!O9","v":1},{"$f":"Main_Inputs_Page!P9","v":1},{"$f":"Main_Inputs_Page!Q9","v":1},{"$f":"Main_Inputs_Page!R9","v":1},{"$f":"Main_Inputs_Page!S9","v":1},{"$f":"Main_Inputs_Page!T9","v":1},{"$f":"Main_Inputs_Page!U9","v":1},{"$f":"Main_Inputs_Page!V9","v":1},{"$f":"Main_Inputs_Page!W9","v":1},{"$f":"Main_Inputs_Page!X9","v":1}]
[null,"Pixel Clock",{"$f":"IF(Main_Inputs_Page!$C$22=\"Yes\",D6,Raw_EDID_Cals!Z3)","v":277.60000000000002},{"$f":"Main_Inputs_Page!C10","v":206.02},null,30,{"$f":"Main_Inputs_Page!I10","v":1},{"$f":"Main_Inputs_Page!J10","v":1},{"$f":"Main_Inputs_Page!K10","v":1},{"$f":"Main_Inputs_Page!L10","v":1},{"$f":"Main_Inputs_Page!M10","v":1},{"$f":"Main_Inputs_Page!N10","v":1},{"$f":"Main_Inputs_Page!O10","v":70},{"$f":"Main_Inputs_Page!P10","v":"6C"},{"$f":"Main_Inputs_Page!Q10","v":80},{"$f":"Main_Inputs_Page!R10","v":"A0"},{"$f":"Main_Inputs_Page!S10","v":70},{"$f":"Main_Inputs_Page!T10","v":38},{"$f":"Main_Inputs_Page!U10","v":20},{"$f":"Main_Inputs_Page!V10","v":40},{"$f":"Main_Inputs_Page!W10","v":18},{"$f":"Main_Inputs_Page!X10","v":30}]
[null,"Horizontal Active (pixels)",{"$f":"IF(Main_Inputs_Page!$C$22=\"Yes\",D7,Raw_EDID_Cals!Z4)","v":1920},{"$f":"Main_Inputs_Page!C11","v":2160},null,40,{"$f":"Main_Inputs_Page!I11","v":"3C"},{"$f":"Main_Inputs_Page!J11","v":0},{"$f":"Main_Inputs_Page!K11","v":26},{"$f":"Main_Inputs_Page!L11","v":"A5"},{"$f":"Main_Inputs_Page!M11","v":10},{"$f":"Main_Inputs_Page!N11","v":0},{"$f":"Main_Inputs_Page!O11","v":0},{"$f":"Main_Inputs_Page!P11","v":19},{"$f":"Main_Inputs_Page!Q11","v":0},{"$f":"Main_Inputs_Page!R11","v":0},{"$f":"Main_Inputs_Page!S11","v":0},{"$f":"Main_Inputs_Page!T11","v":"FE"},{"$f":"Main_Inputs_Page!U11","v":0},{"$f":"Main_Inputs_Page!V11","v":"4D"},{"$f":"Main_Inputs_Page!W11","v":31},{"$f":"Main_Inputs_Page!X11","v":33}]
[null,"Horizontal Blanking (pixels)",{"$f":"IF(Main_Inputs_Page!$C$22=\"Yes\",D8,Raw_EDID_Cals!Z5)","v":160},{"$f":"Main_Inputs_Page!C12","v":160},null,50,{"$f":"Main_Inputs_Page!I12","v":33},{"$f":"Main_Inputs_Page!J12","v":"4E"},{"$f":"Main_Inputs_Page!K12","v":56},{"$f":"Main_Inputs_Page!L12","v":46},{"$f":"Main_Inputs_Page!M12","v":33},{"$f":"Main_Inputs_Page!N12","v":20},{"$f":"Main_Inputs_Page!O12","v":52},{"$f":"Main_Inputs_Page!P12","v":32},{"$f":"Main_Inputs_Page!Q12","v":20},{"$f":"Main_Inputs_Page!R12","v":"0A"},{"$f":"Main_Inputs_Page!S12","v":0},{"$f":"Main_Inputs_Page!T12","v":0},{"$f":"Main_Inputs_Page!U12","v":0},{"$f":"Main_Inputs_Page!V12","v":3},{"$f":"Main_Inputs_Page!W12","v":0},{"$f":"Main_Inputs_Page!X12","v":4}]
{"$rows_left_out":17}
{"sheet":"Raw_EDID_Cals","index":11,"n_rows":27,"n_cols":37,"rows_kept":27,"cut":false,"hidden":true,"merged":[[1,28,1,36]]}
[]
[null,null,"EDID registers",0,1,2,3,4,5,6,7,8,9,"A","B","C","D","E","F",null,"Byte #",null,"Data","Data","Raw decimal values","Values for script","Values",null,"Byte 17 Decode Table"]
[null,null,0,{"$f":"SUBSTITUTE(EDID!G3,\" \",\"\")","v":"0"},{"$f":"SUBSTITUTE(EDID!H3,\" \",\"\")","v":"FF"},{"$f":"SUBSTITUTE(EDID!I3,\" \",\"\")","v":"FF"},{"$f":"SUBSTITUTE(EDID!J3,\" \",\"\")","v":"FF"},{"$f":"SUBSTITUTE(EDID!K3,\" \",\"\")","v":"FF"},{"$f":"SUBSTITUTE(EDID!L3,\" \",\"\")","v":"FF"},{"$f":"SUBSTITUTE(EDID!M3,\" \",\"\")","v":"FF"},{"$f":"SUBSTITUTE(EDID!N3,\" \",\"\")","v":"0"},{"$f":"SUBSTITUTE(EDID!O3,\" \",\"\")","v":"26"},{"$f":"SUBSTITUTE(EDID!P3,\" \",\"\")","v":"CF"},{"$f":"SUBSTITUTE(EDID!Q3,\" \",\"\")","v":"14"},{"$f":"SUBSTITUTE(EDID!R3,\" \",\"\")","v":"34"},{"$f":"SUBSTITUTE(EDID!S3,\" \",\"\")","v":"0"},{"$f":"SUBSTITUTE(EDID!T3,\" \",\"\")","v":"0"},{"$f":"SUBSTITUTE(EDID!U3,\" \",\"\")","v":"0"},{"$f":"SUBSTITUTE(EDID!V3,\" \",\"\")","v":"0"},null,"0,1","Pixel Clock",{"$f":"J6","v":"70"},{"$f":"K6","v":"6C"},{"$f":"HEX2DEC(W3)+HEX2DEC(X3)*256","v":27760},{"$f":"Y3/100","v":277.60000000000002},{"$f":"TEXT(Y3/100,\"0.00\")&\" Mhz\"","v":"277.60 Mhz"},null,{"$f":"DEC2HEX(BITWISE_AND(HEX2DEC(X16),BIN2DEC(10000000)),2)","v":"00"},{"$f":"DEC2HEX(BITWISE_AND(HEX2DEC(X16),BIN2DEC(1100001)),2)","v":"01"},{"$f":"DEC2HEX(BITWISE_AND(HEX2DEC(X16),BIN2DEC(11000)),2)","v":"18"},{"$f":"DEC2HEX(BITWISE_AND(HEX2DEC(X16),BIN2DEC(10100)),2)","v":"10"},{"$f":"DEC2HEX(BITWISE_AND(HEX2DEC(X16),BIN2DEC(10010)),2)","v":"10"},{"$f":"DEC2HEX(BITWISE_AND(HEX2DEC(X16),BIN2DEC(11100)),2)","v":"18"},{"$f":"DEC2HEX(BITWISE_AND(HEX2DEC(X16),BIN2DEC(10010)),2)","v":"10"},null,"Detailed Timing Def. Part 2 (Table 3.22)"]
[null,null,10,{"$f":"SUBSTITUTE(EDID!G4,\" \",\"\")","v":"0"},{"$f":"SUBSTITUTE(EDID!H4,\" \",\"\")","v":"1C"},{"$f":"SUBSTITUTE(EDID!I4,\" \",\"\")","v":"1"},{"$f":"SUBSTITUTE(EDID!J4,\" \",\"\")","v":"4"},{"$f":"SUBSTITUTE(EDID!K4,\" \",\"\")","v":"A5"},{"$f":"SUBSTITUTE(EDID!L4,\" \",\"\")","v":"1D"},{"$f":"SUBSTITUTE(EDID!M4,\" \",\"\")","v":"11"},{"$f":"SUBSTITUTE(EDID!N4,\" \",\"\")","v":"78"},{"$f":"SUBSTITUTE(EDID!O4,\" \",\"\")","v":"0A"},{"$f":"SUBSTITUTE(EDID!P4,\" \",\"\")","v":"1D"},{"$f":"SUBSTITUTE(EDID!Q4,\" \",\"\")","v":"30"},{"$f":"SUBSTITUTE(EDID!R4,\" \",\"\")","v":"A7"},{"$f":"SUBSTITUTE(EDID!S4,\" \",\"\")","v":"50"},{"$f":"SUBSTITUTE(EDID!T4,\" \",\"\")","v":"47"},{"$f":"SUBSTITUTE(EDID!U4,\" \",\"\")","v":"97"},{"$f":"SUBSTITUTE(EDID!V4,\" \",\"\")","v":"27"},null,"2,4","H Active",{"$f":"BITWISE_AND(HEX2DEC(N6),BIN2DEC(11110000))/16","v":7},{"$f":"$L$6","v":"80"},{"$f":"W4*256+HEX2DEC(X4)","v":1920},{"$f":"Y4","v":1920},{"$f":"TEXT(Y4,\"0\")&\" Pixels\"","v":"1920 Pixels"},null,{"$f":"DEC2HEX(0,2)","v":"00"},null,null,null,null,null,null,{"$f":"IF(AC4=AC3,\"True\",\"False\")","v":"True"},"Non-Interlaced"]
[null,null,20,{"$f":"SUBSTITUTE(EDID!G5,\" \",\"\")","v":"13"},{"$f":"SUBSTITUTE(EDID!H5,\" \",\"\")","v":"50"},{"$f":"SUBSTITUTE(EDID!I5,\" \",\"\")","v":"54"},{"$f":"SUBSTITUTE(EDID!J5,\" \",\"\")","v":"0"},{"$f":"SUBSTITUTE(EDID!K5,\" \",\"\")","v":"0"},{"$f":"SUBSTITUTE(EDID!L5,\" \",\"\")","v":"0"},{"$f":"SUBSTITUTE(EDID!M5,\" \",\"\")","v":"1"},{"$f":"SUBSTITUTE(EDID!N5,\" \",\"\")","v":"1"},{"$f":"SUBSTITUTE(EDID!O5,\" \",\"\")","v":"1"},{"$f":"SUBSTITUTE(EDID!P5,\" \",\"\")","v":"1"},{"$f":"SUBSTITUTE(EDID!Q5,\" \",\"\")","v":"1"},{"$f":"SUBSTITUTE(EDID!R5,\" \",\"\")","v":"1"},{"$f":"SUBSTITUTE(EDID!S5,\" \",\"\")","v":"1"},{"$f":"SUBSTITUTE(EDID!T5,\" \",\"\")","v":"1"},{"$f":"SUBSTITUTE(EDID!U5,\" \",\"\")","v":"1"},{"$f":"SUBSTITUTE(EDID!V5,\" \",\"\")","v":"1"},null,"3,4","H Blanking",{"$f":"BITWISE_AND(HEX2DEC(N6),BIN2DEC(1111))","v":0},{"$f":"$M$6","v":"A0"},160,160,{"$f":"TEXT(Y5,\"0\")&\" Pixels\"","v":"160 Pixels"},null,{"$f":"BIN2HEX(10000000)","v":"80"},null,null,null,null,null,null,{"$f":"IF(AC5=AC3,\"True\",\"False\")","v":"False"},"Interlaced"]
[null,null,30,{"$f":"SUBSTITUTE(EDID!G6,\" \",\"\")","v":"1"},{"$f":"SUBSTITUTE(EDID!H6,\" \",\"\")","v":"1"},{"$f":"SUBSTITUTE(EDID!I6,\" \",\"\")","v":"1"},{"$f":"SUBSTITUTE(EDID!J6,\" \",\"\")","v":"1"},{"$f":"SUBSTITUTE(EDID!K6,\" \",\"\")","v":"1"},{"$f":"SUBSTITUTE(EDID!L6,\" \",\"\")","v":"1"},{"$f":"SUBSTITUTE(EDID!M6,\" \",\"\")","v":"70"},{"$f":"SUBSTITUTE(EDID!N6,\" \",\"\")","v":"6C"},{"$f":"SUBSTITUTE(EDID!O6,\" \",\"\")","v":"80"},{"$f":"SUBSTITUTE(EDID!P6,\" \",\"\")","v":"A0"},{"$f":"SUBSTITUTE(EDID!Q6,\" \",\"\")","v":"70"},{"$f":"SUBSTITUTE(EDID!R6,\" \",\"\")","v":"38"},{"$f":"SUBSTITUTE(EDID!S6,\" \",\"\")","v":"20"},{"$f":"SUBSTITUTE(EDID!T6,\" \",\"\")","v":"40"},{"$f":"SUBSTITUTE(EDID!U6,\" \",\"\")","v":"18"},{"$f":"SUBSTITUTE(EDID!V6,\" \",\"\")","v":"30"},null,"5,7","V Active",{"$f":"BITWISE_AND(HEX2DEC(Q6),BIN2DEC(11110000))/16","v":4},{"$f":"$O$6","v":"38"},1080,1080,{"$f":"TEXT(Y6,\"0\")&\" Lines\"","v":"1080 Lines"},null,null,{"$f":"BIN2HEX(0,2)","v":"00"},null,null,null,null,null,{"$f":"IF(AD6=AD3,\"True\",\"False\")","v":"False"},"Normal Display"]
[null,null,40,{"$f":"SUBSTITUTE(EDID!G7,\" \",\"\")","v":"3C"},{"$f":"SUBSTITUTE(EDID!H7,\" \",\"\")","v":"0"},{"$f":"SUBSTITUTE(EDID!I7,\" \",\"\")","v":"26"},{"$f":"SUBSTITUTE(EDID!J7,\" \",\"\")","v":"A5"},{"$f":"SUBSTITUTE(EDID!K7,\" \",\"\")","v":"10"},{"$f":"SUBSTITUTE(EDID!L7,\" \",\"\")","v":"0"},{"$f":"SUBSTITUTE(EDID!M7,\" \",\"\")","v":"0"},{"$f":"SUBSTITUTE(EDID!N7,\" \",\"\")","v":"19"},{"$f":"SUBSTITUTE(EDID!O7,\" \",\"\")","v":"0"},{"$f":"SUBSTITUTE(EDID!P7,\" \",\"\")","v":"0"},{"$f":"SUBSTITUTE(EDID!Q7,\" \",\"\")","v":"0"},{"$f":"SUBSTITUTE(EDID!R7,\" \",\"\")","v":"FE"},{"$f":"SUBSTITUTE(EDID!S7,\" \",\"\")","v":"0"},{"$f":"SUBSTITUTE(EDID!T7,\" \",\"\")","v":"4D"},{"$f":"SUBSTITUTE(EDID!U7,\" \",\"\")","v":"31"},{"$f":"SUBSTITUTE(EDID!V7,\" \",\"\")","v":"33"},null,"6,7","V Blanking",{"$f":"BITWISE_AND(HEX2DEC(Q6),BIN2DEC(1111))","v":0},{"$f":"$P$6","v":"20"},32,32,{"$f":"TEXT(Y7,\"0\")&\" Lines\"","v":"32 Lines"},null,null,{"$f":"BIN2HEX(1,2)","v":"01"},null,null,null,null,null,{"$f":"IF(AD7=AD3,\"True\",\"False\")","v":"True"},"Normal Display"]
[null,null,50,{"$f":"SUBSTITUTE(EDID!G8,\" \",\"\")","v":"33"},{"$f":"SUBSTITUTE(EDID!H8,\" \",\"\")","v":"4E"},{"$f":"SUBSTITUTE(EDID!I8,\" \",\"\")","v":"56"},{"$f":"SUBSTITUTE(EDID!J8,\" \",\"\")","v":"46"},{"$f":"SUBSTITUTE(EDID!K8,\" \",\"\")","v":"33"},{"$f":"SUBSTITUTE(EDID!L8,\" \",\"\")","v":"20"},{"$f":"SUBSTITUTE(EDID!M8,\" \",\"\")","v":"52"},{"$f":"SUBSTITUTE(EDID!N8,\" \",\"\")","v":"32"},{"$f":"SUBSTITUTE(EDID!O8,\" \",\"\")","v":"20"},{"$f":"SUBSTITUTE(EDID!P8,\" \",\"\")","v":"0A"},{"$f":"SUBSTITUTE(EDID!Q8,\" \",\"\")","v":"0"},{"$f":"SUBSTITUTE(EDID!R8,\" \",\"\")","v":"0"},{"$f":"SUBSTITUTE(EDID!S8,\" \",\"\")","v":"0"},{"$f":"SUBSTITUTE(EDID!T8,\" \",\"\")","v":"3"},{"$f":"SUBSTITUTE(EDID!U8,\" \",\"\")","v":"0"},{"$f":"SUBSTITUTE(EDID!V8,\" \",\"\")","v":"4"},null,"8,11","H Sync Offset (HFP)",{"$f":"BITWISE_AND(HEX2DEC(E7),BIN2DEC(11000000))/64","v":0},{"$f":"$R$6","v":"18"},24,24,{"$f":"TEXT(Y8,\"0\")&\" Pixels\"","v":"24 Pixels"},null,null,{"$f":"BIN2HEX(100000,2)","v":"20"},null,null,null,null,null,{"$f":"IF(AD8=AD3,\"True\",\"False\")","v":"False"},"Field Sequential Stereo R"]
{"$rows_left_out":19}