{"text_format":"1","workbook":"xlsx","n_sheets":12,"sheets":["READ ME","Main_Inputs_Page","DSI86_INPUTS","EDID_Formatting_Space","Calcs","Script_ASSR","Qualcomm_ASSR","Script_NoASSR","Qualcomm_noASSR","CSR","EDID","Raw_EDID_Cals"],"not_rendered":{"charts":0,"images":16,"macros":1,"external_links":0,"defined_names":0,"comments":0,"pivot_tables":0},"unopened":[],"bounds":{"document_bytes":16777216,"sheet_cells":100000,"rows_first":2000,"rows_last":500,"rows_between":2000,"halvings":0,"cell_chars":16384,"cell_head_chars":4096},"cells_cut":0,"cells_raw":0,"read":"whole","date_system":"1900"}

{"sheet":"READ ME","index":0,"n_rows":131,"n_cols":3,"rows_kept":131,"cut":false,"hidden":false,"merged":[[20,2,20,15],[16,2,16,15],[10,1,10,17],[11,1,11,17],[12,1,12,17],[13,1,13,17],[14,1,14,17],[130,2,130,15],[86,2,86,15],[64,2,64,15],[108,2,108,15],[42,2,42,15],[1,1,2,6],[4,1,4,17],[5,1,5,17],[6,1,6,16],[9,1,9,17],[8,1,8,17]]}
[]
[null,"SN65DSI86 Register Calculator"]
[]
[]
[null,"This spreadsheet is intended to take information such as the EDID information and the DSI information and output the register values for the SN65DSI86. "]
[null,"The information is inputted into the Inputs_Page and the settings are automatically calculated and put into the other pages below."]
[null,"The calculated values are outputted into the Script_ASSR, Qualcomm_ASSR, Scrip_NoASSR and Qualcomm_noASSR pages."]
[]
[null,"Step 1: If you do not have the EDID decoded use the EDID_Formatting_Space Page to get the raw EDID in the correct form for the calculator."]
[null,"Step 2: Enter the EDID information manually by using the panels datasheet or enter use the EDID registers values into the starting page."]
[null,"Step 3: For the category labeled \"EDID Input in Datasheet Table\" select \"Yes\" if the values that were entered are from the datasheet, select \"No\" if the EDID register values were entered."]
[null,"Step 4: Fill in the table labeled \"DP/DSI Settings\" with the parameters from your application. "]
[null,"Step 5: If you are using LeftRight mode next fill out the \"LEFTRIGHT MODE ONLY\" table next if not please ignore that table."]
[null,"Step 6: If you would like the DSI86 to output the color bar pattern enable the color bar pattern in the \"Color Bar\" table. "]
[null,"Step 7: If any of the values in the \"Output Values\" tables read as \"NAN\" or value too large please try to input your numbers again. "]
[]
[null,"Step 1:"," If you do not have the EDID decoded use the EDID_Formatting_Space Page to get the raw EDID in the correct form for the calculator."]
[]
[]
[]
[null,"Step 2:"," Enter the EDID information manually by using the panels datasheet or enter use the EDID registers values into the starting page."]
[]
[]
[]
[]
[]
[]
[]
[]
[]
[]
[]
[]
[]
[]
[]
[]
[]
[]
[]
[]
[]
[null,"Step 3: ","For the category labeled \"EDID Input in Datasheet Table\" select \"Yes\" if the values that were entered are from the datasheet"]
[]
[]
[]
[]
[]
[]
[]
[]
[]
[]
[]
[]
[]
[]
[]
[]
[]
[]
[]
[]
[]
[null,"Step 4:","Fill in the table labeled \"DP/DSI Settings\" with the parameters from your application. "]
[]
[]
[]
[]
[]
[]
[]
[]
[]
[]
[]
[]
[]
[]
[]
[]
[]
[]
[]
[]
[]
[null,"Step 5:","If you are using LeftRight mode next fill out the \"LEFTRIGHT MODE ONLY\" table next if not please ignore that table."]
[]
[]
[]
[]
[]
[]
[]
[]
[]
[]
[]
[]
[]
[]
[]
[]
[]
[]
[]
[]
[]
[null,"Step 6:","If you would like the DSI86 to output the color bar pattern enable the color bar pattern in the \"Color Bar\" table. "]
[]
[]
[]
[]
[]
[]
[]
[]
[]
[]
[]
[]
[]
[]
[]
[]
[]
[]
[]
[]
[]
[null,"Step 7:","If any of the values in the \"Output Values\" tables read as \"NAN\" or value too large please try to input your numbers again. "]

{"sheet":"Main_Inputs_Page","index":1,"n_rows":30,"n_cols":24,"rows_kept":30,"cut":false,"hidden":false,"merged":[[29,4,29,19],[1,1,2,2],[15,7,15,26],[28,4,28,19]]}
[]
[null,"SN65DSI86 Register Calculator",null,null,"Color Legend"]
[null,null,null,null,"Calculated OUTPUTS"]
[null,null,null,null,"INPUTS"]
[]
[null," Datasheet EDID Information","Manual Inputs",null,"Category's","DP/DSI Settings",null,"EDID Registers Table",0,1,2,3,4,5,6,7,8,9,"A","B","C","D","E","F"]
[null,"Panel Vendor","InfoVision",null,"# of DP Lanes for DSI86",4,null,0,0,"FF","FF","FF","FF","FF","FF",0,26,"CF",14,34,0,0,0,0]
[null,"Panel Model#","M125NWF4 R0",null,"# of DP Lanes for DP Panel",4,null,10,0,"1C",1,4,"A5","1D",11,78,"0A","1D",30,"A7",50,47,97,27]
[null,"Resolution","2160x1440",null,"Max DP datarate for DP Panel","HBR",null,20,13,50,54,0,0,0,1,1,1,1,1,1,1,1,1,1]
[null,"Pixel Clock",206.02,null,"# of DSI A Lanes",4,null,30,1,1,1,1,1,1,70,"6C",80,"A0",70,38,20,40,18,30]
[null,"Horizontal Active (pixels)",2160,null,"# of DSI B Lanes",0,null,40,"3C",0,26,"A5",10,0,0,19,0,0,0,"FE",0,"4D",31,33]
[null,"Horizontal Blanking (pixels)",160,null,"DSI Video mode","RGB666",null,50,33,"4E",56,46,33,20,52,32,20,"0A",0,0,0,3,0,4]
[null,"Vertical Active (lines)",1440,null,"DSI Channel Mode","Single",null,60,36,"FF",5,"3C","8D",25,13,31,"8D",0,0,0,0,0,0,3]
[null,"Vertical Blanking (lines)",40,null,"Even/Odd or Left/Right","EvenOdd",null,70,0,6,18,"FF","0F","3C","3B",24,8,31,"3B",1,1,0,0,"BA"]
[null,"Horizontal Sync Offset or FrontPorch (pixels)",48,null,"REFCLK FREQ (MHz)",19.2]
[null,"Horizontal Sync Pulse Width (pixels)",32,null,null,null,null,"Please use the EDID_Formatting_Space to format the EDID and copy and paste the \"Values (V)\" into the Table"]
[null,"Vertical Sync Offset or FrontPorch (lines)",3,null,"LEFTRIGHT MODE ONLY"]
[null,"Vertical Sync Pulse Width (lines)",10,null,"Right Pixel Start",1440]
[null,"Hsync Polarity","NEGATIVE",null,"LEFT HACTIVE",{"$f":"DSI86_INPUTS!F17","v":1439}]
[null,"Vsync Polarity","NEGATIVE",null,"RIGHT HACTIVE",{"$f":"DSI86_INPUTS!F18","v":481}]
[null,null,null,null,"LEFT CROP",0]
[null,"EDID Inputs in Datasheet Table","No",null,"RIGHT CROP",0]
[null,null,null,null,"HACTIVE with Crop",{"$f":"DSI86_INPUTS!F21","v":1920}]
[null,"Category","Output Values"]
[null,"Min DSI A clk rate (MHz)",{"$f":"Calcs!F11","v":624.6},null,"Color Bar"]
[null,"Min DSI B clk rate (MHz)",{"$f":"Calcs!F12","v":624.6},null,"Enable Color Bar","ENABLE"]
[null,"Optimum # of Lanes",{"$f":"Calcs!F23","v":4},null,"Color Bar Pattern","Vertical Colors: 3 Color"]
[null,"Optimum Daterate",{"$f":"Calcs!F24","v":"RBR"}]
[null,null,null,null,"If the above calculations give values that are not a number it means there was an error in either the inputted data or the calculations."]
[null,null,null,null,"Many of the calc. sheets are hidden to unhide them go to \"Format\" in the \"Home\" tab go to \"Hide & Unhide\" click \"Unhide Sheet...\""]

{"sheet":"DSI86_INPUTS","index":2,"n_rows":41,"n_cols":8,"rows_kept":41,"cut":false,"hidden":true,"merged":[[14,4,14,5]]}
[]
[null,"Category","EDID page Inputs",null,"Category","DP/DSI Settings",null,"Color Legend"]
[null,"Panel Vendor",{"$f":"EDID!C$3","v":"InfoVision"},null,"# of DP Lanes for DSI86",{"$f":"Main_Inputs_Page!F7","v":4},null,"Calculated OUTPUTS"]
[null,"Panel Model#",{"$f":"EDID!C$4","v":"M125NWF4 R0"},null,"# of DP Lanes for DP Panel",{"$f":"Main_Inputs_Page!F8","v":4},null,"INPUTS"]
[null,"Resolution",{"$f":"EDID!C$5","v":"2160x1440"},null,"Max DP datarate for DP Panel",{"$f":"Main_Inputs_Page!F9","v":"HBR"}]
[null,"Hsync (in pixels)",{"$f":"EDID!C$17","v":48},null,"# of DSI A Lanes",{"$f":"Main_Inputs_Page!F10","v":4}]
[null,"HSync POLARITY",{"$f":"EDID!C$15","v":"NEGATIVE"},null,"# of DSI B Lanes",{"$f":"Main_Inputs_Page!F11","v":0}]
[null,"HBPorch (in pixels)",{"$f":"EDID!C$18","v":88},null,"DSI Video mode",{"$f":"Main_Inputs_Page!F12","v":"RGB666"}]
[null,"HFPorch (in pixels)",{"$f":"EDID!C$19","v":24},null,"DSI Channel Mode",{"$f":"Main_Inputs_Page!F13","v":"Single"}]
[null,"Hactive (in pixels)",{"$f":"EDID!C$20","v":1920},null,"Even/Odd or Left/Right",{"$f":"Main_Inputs_Page!F14","v":"EvenOdd"}]
[null,"Vsync (in Lines)",{"$f":"EDID!C$21","v":18},null,"REFCLK FREQ (MHz)",{"$f":"Main_Inputs_Page!F15","v":19.2}]
[null,"Vsync Polarity",{"$f":"EDID!C$16","v":"NEGATIVE"},null,"Enable Color Bar",{"$f":"Main_Inputs_Page!F26","v":"ENABLE"}]
[null,"VBPorch (in Lines)",{"$f":"EDID!C$22","v":11},null,"Color Bar Pattern",{"$f":"Main_Inputs_Page!F27","v":"Vertical Colors: 3 Color"}]
[null,"VFPorch (in Lines)",{"$f":"EDID!C$23","v":3}]
[null,"Vactive (in Lines)",{"$f":"EDID!C$24","v":1080},null,"LEFTRIGHT MODE ONLY"]
[null,"Pixel CLK(MHz) - nominal",{"$f":"EDID!C$6","v":277.60000000000002},null,"Right Pixel Start",{"$f":"Main_Inputs_Page!F18","v":1440}]
[null,null,null,null,"LEFT HACTIVE",{"$f":"F$16-1","v":1439}]
[null,null,null,null,"RIGHT HACTIVE",{"$f":"C$10-F$16+1","v":481}]
[null,null,null,null,"LEFT CROP",{"$f":"Main_Inputs_Page!F21","v":0}]
[null,null,null,null,"RIGHT CROP",{"$f":"Main_Inputs_Page!F22","v":0}]
[null,null,null,null,"HACTIVE with Crop",{"$f":"F$17+F$18+F$19+F$20","v":1920}]
[]
[]
[]
[]
[]
[]
[]
[]
[]
[]
[]
[]
[]
[]
[]
[]
[]
[]
[]
[null,{"$f":"IF(F$7=0,1,IF(F$10=\"EvenOdd\",IF(F$6=F$7,1,\"Wrong\"),1))","v":1}]

{"sheet":"EDID_Formatting_Space","index":3,"n_rows":34,"n_cols":25,"rows_kept":34,"cut":false,"hidden":false,"merged":[[1,1,1,8],[2,1,2,8],[3,1,3,8],[4,1,4,8],[5,1,5,8]]}
[]
[null,"EDID Formatting Space"]
[null,"Use the this space to format the EDIE registers in a way that the script can read. "]
[null,"1. Copy the EDID registers and paste them using \"Matching Destination Formatting (M)\" "]
[null,"2. Select the data and under the \"Data\" section, select \"Text to Columns\"."]
[null,"3. Select \"Fixed Width\" and then click \"Finish\""]
[]
[null,"Step 1:"]
[]
[null,null,null,null,null,null,null,null,"[0000]",0,"FF","FF","FF","FF","FF","FF",0,26,"CF",14,34,0,0,0,0]
[null,null,null,null,null,null,null,null,"[0010]",0,"1C",1,4,"A5","1D",11,78,"0A","1D",30,"A7",50,47,97,27]
[null,null,null,null,null,null,null,null,"[0020]",13,50,54,0,0,0,1,1,1,1,1,1,1,1,1,1]
[null,null,null,null,null,null,null,null,"[0030]",1,1,1,1,1,1,70,"6C",80,"A0",70,38,20,40,18,30]
[null,null,null,null,null,null,null,null,"[0040]","3C",0,26,"A5",10,0,0,19,0,0,0,"FE",0,"4D",31,33]
[null,null,null,null,null,null,null,null,"[0050]",33,"4E",56,46,33,20,52,32,20,"0A",0,0,0,3,0,4]
[null,null,null,null,null,null,null,null,"[0060]",36,"FF",5,"3C","8D",25,13,31,"8D",0,0,0,0,0,0,3]
[null,null,null,null,null,null,null,null,"[0070]",0,6,18,"FF","0F","3C","3B",24,8,31,"3B",1,1,0,0,"BA"]
[null,null,null,null,null,null,null,null,"[0080]",0,0,0,0,0,0,0,0,0,"1f","7c","f0","c1",7,"1f","7c"]
[null,null,null,null,null,null,null,null,"[0090]","f0","c1",7,20,80,0," 00"," 04",1,0,0,0,0,0,0,0]
[null,null,null,null,null,null,null,null,"[00a0]",1,"ff","ff",0,0,0,0,0,0,0,0,0,0,0,0,0]
[null,"Step 2:",null,null,null,null,null,null,"[00b0]",4,78,"ac","ac",8,"6c","9c","9c","0c","5c","5c","5c","0c","0c","0c","0c"]
[null,null,null,null,null,null,null,null,"[00c0]","3f","3f","0f",0,0,0,0,0,0,0,0,0,0,0,0,0]
[null,null,null,null,null,null,null,null,"[00d0]",0,0,0,0,0,0,0,0,0,0,0,0,0,0,0,0]
[null,null,null,null,null,null,null,null,"[00e0]",0,0,0,0,0,0,0,0,0,0,0,0,0,0,0,0]
[null,null,null,null,null,null,null,null,"[00f0]",0,0,0,0,9,3,0,0," 02"," 00",0,0,0,0,0,"00 "]
[]
[]
[]
[]
[]
[]
[]
[]
[null,"Step 3:"]

{"sheet":"Calcs","index":4,"n_rows":37,"n_cols":10,"rows_kept":37,"cut":false,"hidden":true,"merged":[[1,4,1,5]]}
[]
[null,"Category","DSI86_INPUTS and EDID page Inputs",null,{"$f":"DSI86_INPUTS!E15","v":"LEFTRIGHT MODE ONLY"},null,null,"Color Legend"]
[null,{"$f":"DSI86_INPUTS!B3","v":"Panel Vendor"},{"$f":"DSI86_INPUTS!C$3","v":"InfoVision"},null,{"$f":"DSI86_INPUTS!E16","v":"Right Pixel Start"},{"$f":"DSI86_INPUTS!F$16","v":1440},null,"Calculated OUTPUTS"]
[null,{"$f":"DSI86_INPUTS!B4","v":"Panel Model#"},{"$f":"DSI86_INPUTS!C$4","v":"M125NWF4 R0"},null,{"$f":"DSI86_INPUTS!E17","v":"LEFT HACTIVE"},{"$f":"DSI86_INPUTS!F$17","v":1439},null,"INPUTS"]
[null,{"$f":"EDID!$B$5","v":"Resolution"},{"$f":"EDID!$C$5","v":"2160x1440"},null,{"$f":"DSI86_INPUTS!E18","v":"RIGHT HACTIVE"},{"$f":"DSI86_INPUTS!F$18","v":481}]
[null,{"$f":"DSI86_INPUTS!B6","v":"Hsync (in pixels)"},{"$f":"DSI86_INPUTS!C$6","v":48},null,{"$f":"DSI86_INPUTS!E19","v":"LEFT CROP"},{"$f":"DSI86_INPUTS!F$19","v":0},null,"Registers","Binary Value","Hex Values"]
[null,"Hsync (in us)",{"$f":"ROUNDUP(C6/C$28, 3) &\" us\"","v":"0.173 us"},null,{"$f":"DSI86_INPUTS!E20","v":"RIGHT CROP"},{"$f":"DSI86_INPUTS!F$20","v":0},null,"0x10",{"$f":"(IF(DSI86_INPUTS!F10=\"EvenOdd\",\"0\",\"1\")&IF(DSI86_INPUTS!F9=\"Single\",\"01\",\"00\")&IF(DSI86_INPUTS!F6=4,\"00\",IF(DSI86_INPUTS!F6=3,\"01\",IF(DSI86_INPUTS!F6=2,\"10\",\"11\")))&IF(DSI86_INPUTS!F7=4,\"00\",IF(DSI86_INPUTS!F7=3,\"01\",IF(DSI86_INPUTS!F7=2,\"10\",\"11\")))&0)","v":"00100110"},{"$f":"BIN2HEX(I7,2)","v":"26"}]
[null,{"$f":"DSI86_INPUTS!$B$7","v":"HSync POLARITY"},{"$f":"DSI86_INPUTS!C$7","v":"NEGATIVE"},null,{"$f":"DSI86_INPUTS!E21","v":"HACTIVE with Crop"},{"$f":"DSI86_INPUTS!F$21","v":1920},null,"0x3C",{"$f":"IF(DSI86_INPUTS!F12=\"DISABLE\",\"00\",\"10\")&IF(DSI86_INPUTS!F13=\"Horizontal Colors: Stripes\",\"111\",IF(DSI86_INPUTS!F13=\"Horizontal Colors: 3 Color\",\"110\",IF(DSI86_INPUTS!F13=\"Horizontal Colors: 8 Gray Scale\",\"101\",IF(DSI86_INPUTS!F13=\"Horizontal Colors: 8 Color\",\"100\",IF(DSI86_INPUTS!F13=\"Vertical Colors: Stripes\",\"011\",IF(DSI86_INPUTS!F13=\"Vertical Colors: 3 Color\",\"010\",IF(DSI86_INPUTS!F13=\"Vertical Colors: 8 Gray Scale\",\"001\",IF(DSI86_INPUTS!F13=\"Vertical Colors: 8 Color (Default)\",\"000\",\"NAN\"))))))))","v":"10010"},{"$f":"BIN2HEX(I8,2)","v":"12"}]
[null,"HBPorch (in pixels)",{"$f":"DSI86_INPUTS!C$8","v":88},null,"Percent Left",{"$f":"(F$4+F$6)/F$8","v":0.7494791666666667}]
[null,"HBPorch (in us)",{"$f":"ROUNDUP(C9/C$28, 3) &\" us\"","v":"0.318 us"},null,"Percent Right",{"$f":"(F$5+F$7)/F$8","v":0.25052083333333336}]
[null,"HFPorch (in pixels)",{"$f":"DSI86_INPUTS!C$9","v":24},null,"Min DSI A clk rate (MHz)",{"$f":"IF((C$28*F$14)/((C$33+C$34)*2)<755,(C$28*F$14)/((C$33+C$34)*2),\"CLK TO FAST\")","v":624.6}]
[null,"HFPorch (in us)",{"$f":"ROUNDUP(C11/C$28, 3) &\" us\"","v":"0.087 us"},null,"Min DSI B clk rate (MHz)",{"$f":"IF((C$28*F$14)/((C$33+C$34)*2)<755,(C$28*F$14)/((C$33+C$34)*2),\"CLK TO FAST\")","v":624.6}]
[null,"Hactive (in pixels)",{"$f":"DSI86_INPUTS!C$10","v":1920}]
[null,"Hactive (in us)",{"$f":"ROUNDUP(C13/C$28, 3) &\" us\"","v":"6.917 us"},null,"bits/pixel(bpp)",{"$f":" IF(C37=\"RGB666\", 18, 24)","v":18}]
[null,"Htotal (in pixels)",{"$f":"SUM(C6:C13)","v":2080},null,"min DSI A CLK rate(MHz) \nsingle based on Panel",{"$f":"IF((C$28*F$14)/((C$33+C$34)*2)<755,(C$28*F$14)/((C$33+C$34)*2),\"CLK TO FAST\")","v":624.6}]
[null,"Htotal (in us)",{"$f":"ROUNDUP(C15/C$28, 3)","v":7.4930000000000003},null,"Total # of bits per line",{"$f":" F14*C15","v":37440}]
[null,"Vsync (in Lines)",{"$f":"DSI86_INPUTS!C$11","v":18},null,"Min DSI CLK rate for non-burst mode\nbased on panel timing(MHz)",{"$f":" IF((F$16/C$16)/(2*(C$33+C$34)) < 755,  (F$16/C$16)/(2*(C$33+C$34)),\"CLK TO FAST\")","v":624.58294408114239}]
[null,"Vsync (in us)",{"$f":"ROUNDUP(C17*C$16, 3) &\" us\"","v":"134.874 us"},null,"1 Lane at Max DP datarate (Mbps)",{"$f":"IF(C$32=\"HBR2\",0.8*5400,IF(C$32=\"HBR\",0.8*2700,IF(C$32=\"RBR\",0.8*1620,0)))","v":2160}]
[null,"Vsync Polarity",{"$f":"DSI86_INPUTS!C$12","v":"NEGATIVE"},null,"1 Lane at Mid DP datarate (Mbps)",{"$f":"IF(C$32=\"HBR2\",0.8*2700,IF(C$32=\"HBR\",0.8*2700,IF(C$32=\"RBR\",0.8*1620,0)))","v":2160}]
[null,"VBPorch (in Lines)",{"$f":"DSI86_INPUTS!C$13","v":11},null,"1 Lane at Min DP datarate (Mbps)",{"$f":"0.8 * 1620","v":1296}]
[null,"VBPorch (in us)",{"$f":"ROUNDUP(C20*C$16, 3) &\" us\"","v":"82.423 us"},null,"# of available DP lanes",{"$f":"IF(C$30=C$31,C$30,IF(C$30<C$31,C$30,C$31))","v":4}]
[null,"VFPorch (in Lines)",{"$f":"DSI86_INPUTS!C$14","v":3},null,"Total available DP datarate (Mbps)",{"$f":"F$18 * F$21","v":8640}]
[null,"VFPorch (in us)",{"$f":"ROUNDUP(C22*C$16, 3) &\" us\"","v":"22.479 us"},null,"Optimum # of Lanes",{"$f":"IF(C$29>F$22,\"Not Enough BW\",IF(F$21<2,1,IF(F$21<4,IF(C$29<F$20,1,IF(C$29<F$19,1,IF(C$29<F$18,1,2))),IF(C$29<F$20,1,IF(C$29<F$19,1,IF(C$29<F$18,1,IF(C$29<F$20*2,2,IF(C$29<F$19*2,2,IF(C$29<F$18*2,2,4)))))))))","v":4}]
[null,"Vactive (in Lines)",{"$f":"DSI86_INPUTS!C$15","v":1080},null,"Optimum Daterate",{"$f":"IF(C$29 < F$23 * F$20, \"RBR\", IF(C$29 < F$23 *F$19, \"HBR\", \"HBR2\" ))","v":"RBR"}]
[null,"Vactive (us)",{"$f":"ROUNDUP(C24*C$16, 3) &\" us\"","v":"8092.44 us"}]
[null,"Vtotal (in Lines)",{"$f":"SUM(C17:C24)","v":1112}]
[null,"Vtotal (in us)",{"$f":"ROUNDUP(C26*C$16, 3)","v":8332.2160000000003}]
[null,"Pixel CLK(MHz) - nominal",{"$f":"DSI86_INPUTS!C$16","v":277.60000000000002}]
[null,"Stream bit Rate (Mbps)",{"$f":"ROUNDUP(C15 * C26 * (1/C27)*F14, 3)","v":4996.6639999999998}]
[null,"# of DP Lanes for DSI86",{"$f":"DSI86_INPUTS!F$3","v":4}]
[null,"# of DP Lanes for DP Panel",{"$f":"DSI86_INPUTS!F$4","v":4}]
[null,"Max DP datarate for DP Panel",{"$f":"DSI86_INPUTS!F$5","v":"HBR"}]
[null,{"$f":"DSI86_INPUTS!$E$6","v":"# of DSI A Lanes"},{"$f":"DSI86_INPUTS!F$6","v":4}]
[null,{"$f":"DSI86_INPUTS!$E$7","v":"# of DSI B Lanes"},{"$f":"DSI86_INPUTS!F$7","v":0}]
[null,{"$f":"DSI86_INPUTS!$E$9","v":"DSI Channel Mode"},{"$f":"DSI86_INPUTS!F$9","v":"Single"}]
[null,{"$f":"DSI86_INPUTS!$E$10","v":"Even/Odd or Left/Right"},{"$f":"DSI86_INPUTS!F$10","v":"EvenOdd"}]
[null,{"$f":"DSI86_INPUTS!$E$8","v":"DSI Video mode"},{"$f":"DSI86_INPUTS!F$8","v":"RGB666"}]

{"sheet":"Script_ASSR","index":5,"n_rows":75,"n_cols":11,"rows_kept":75,"cut":false,"hidden":false,"merged":[[59,1,59,8],[62,1,62,8],[65,1,65,8],[68,1,68,8],[71,1,71,8],[22,1,22,8],[1,1,1,8],[38,1,38,8],[41,1,41,8],[44,1,44,8],[7,1,7,8],[10,1,10,8],[13,1,13,8],[16,1,16,8],[19,1,19,8],[56,1,56,8],[25,1,25,8],[29,1,29,8],[32,1,32,8],[35,1,35,8],[50,1,50,8],[53,1,53,8],[47,1,47,8]]}
[]
[null,"This code is meant for an Aardvark USB to I2C to program the SN65DSI86"]
[null,null,"Addr","Data"]
[null,"<aardvark>"]
[null,"<configure i2c=\"1\" spi=\"1\" gpio=\"0\" tpower=\"1\" pullups=\"0\"/>"]
[null,"    <i2c_bitrate khz=\"100\"/>"]
[]
[null,"======REFCLK Frequency  ======",null,null,null,null,null,null,null,null,{"$f":"TRIM(E6)","v":""}]
[null,"<i2c_write addr=\"0x2D\" count=\"1\" radix=\"16\">","0A",{"$f":"CSR!$C$8","v":2},"</i2c_write>/>"]
[]
[null,"======DSI Mode  ======"]
[null,"<i2c_write addr=\"0x2D\" count=\"1\" radix=\"16\">",10,{"$f":"Calcs!J7","v":"26"},"</i2c_write>/>"]
[]
[null,"======DSIA Clock  ======"]
[null,"<i2c_write addr=\"0x2D\" count=\"1\" radix=\"16\">",12,{"$f":"CSR!C$16","v":"7C"},"</i2c_write>/>"]
[]
[null,"======DSIB Clock  ======"]
[null,"<i2c_write addr=\"0x2D\" count=\"1\" radix=\"16\">",13,{"$f":"CSR!C$17","v":"7C"},"</i2c_write>/>"]
[]
[null,"======DP Datarate  ======"]
[null,"<i2c_write addr=\"0x2D\" count=\"1\" radix=\"16\">",94,{"$f":"CSR!$C$41","v":20},"</i2c_write>/>"]
[]
[null,"======Enable PLL  ======"]
[null,"<i2c_write addr=\"0x2D\" count=\"1\" radix=\"16\">","0D",1,"</i2c_write> <sleep ms=\"10\"/>"]
[]
[null,"======Enable ASSR in Panel  ======"]
[null,"<i2c_write addr=\"0x2D\" count=\"1\" radix=\"16\">",64,1,"</i2c_write>/>"]
[null,"<i2c_write addr=\"0x2D\" count=\"5\" radix=\"16\">",74,0,1,"0A",1,81,"</i2c_write> <sleep ms=\"10\"/>"]
[]
[null,"======Enable enhanced frame and ASSR in DSI86  ======"]
[null,"<i2c_write addr=\"0x2D\" count=\"1\" radix=\"16\">","5A",5,"</i2c_write>/>"]
[]
[null,"======Number of DP lanes  ======"]
[null,"<i2c_write addr=\"0x2D\" count=\"1\" radix=\"16\">",93,{"$f":"CSR!$C$40","v":30},"</i2c_write>/>"]
[]
[null,"======Start Semi-Auto Link Training  ======"]
[null,"<i2c_write addr=\"0x2D\" count=\"1\" radix=\"16\">",96,"0A","</i2c_write> <sleep ms=\"20\"/>"]
[]
[null,"======CHA Active Line Length  ======"]
[null,"<i2c_write addr=\"0x2D\" count=\"2\" radix=\"16\">",20,{"$f":"CSR!$C$20","v":"80"},{"$f":"CSR!$C$21","v":"07"},"</i2c_write>/>"]
[]
[null,"======CHB Active Line Length  ======"]
[null,"<i2c_write addr=\"0x2D\" count=\"2\" radix=\"16\">",22,{"$f":"CSR!$C$22","v":0},{"$f":"CSR!$C$23","v":0},"</i2c_write>/>"]
[]
[null,"======Vertical Active Size   ======"]
[null,"<i2c_write addr=\"0x2D\" count=\"2\" radix=\"16\">",24,{"$f":"CSR!$C$24","v":"38"},{"$f":"CSR!$C$25","v":"04"},"</i2c_write>/>"]
[]
[null,"======Horizontal Pulse Width   ======"]
[null,"<i2c_write addr=\"0x2D\" count=\"2\" radix=\"16\">","2C",{"$f":"CSR!$C$26","v":"30"},{"$f":"CSR!$C$27","v":"00"},"</i2c_write>/>"]
[]
[null,"======Vertical Pulse Width   ======"]
[null,"<i2c_write addr=\"0x2D\" count=\"2\" radix=\"16\">",30,{"$f":"CSR!$C$29","v":"12"},{"$f":"CSR!$C$30","v":"00"},"</i2c_write>/>"]
[]
[null,"======HBP   ======"]
[null,"<i2c_write addr=\"0x2D\" count=\"1\" radix=\"16\">",34,{"$f":"CSR!$C$32","v":"58"},"</i2c_write>/>"]
[]
[null,"======VBP   ======"]
[null,"<i2c_write addr=\"0x2D\" count=\"1\" radix=\"16\">",36,{"$f":"CSR!$C$33","v":"0B"},"</i2c_write>/>"]
[]
[null,"===== HFP  ======"]
[null,"<i2c_write addr=\"0x2D\" count=\"1\" radix=\"16\">",38,{"$f":"CSR!$C$34","v":"18"},"</i2c_write>/>"]
[]
[null,"===== VFP  ======"]
[null,"<i2c_write addr=\"0x2D\" count=\"1\" radix=\"16\">","3A",{"$f":"CSR!$C$35","v":"03"},"</i2c_write>/>"]
[]
[null,"===== DP-18BPP Disable  ======"]
[null,"<i2c_write addr=\"0x2D\" count=\"1\" radix=\"16\">","5B",0,"</i2c_write>/>"]
[]
[null,"===== Color Bar Enable  ======"]
[null,"<i2c_write addr=\"0x2D\" count=\"1\" radix=\"16\">","3C",{"$f":"Calcs!J8","v":"12"},"</i2c_write>/>"]
[]
[null,"===== Enhanced Frame, ASSR, and Vstream Enable  ======"]
[null,"<i2c_write addr=\"0x2D\" count=\"1\" radix=\"16\">","5A","0D","</i2c_write>/>"]
[]
[null,"</aardvark>"]

{"sheet":"Qualcomm_ASSR","index":6,"n_rows":38,"n_cols":5,"rows_kept":38,"cut":false,"hidden":false,"merged":[]}
[]
[null,null,"Register ","Data"]
[null,"\"<DSIInitSequence>\""]
[null,"\"23",{"$f":"Script_ASSR!C9","v":"0A"},{"$f":"Script_ASSR!D9","v":2},"\\n\""]
[null,"\"23",{"$f":"Script_ASSR!C12","v":10},{"$f":"Script_ASSR!D12","v":"26"},"\\n\""]
[null,"\"23",{"$f":"Script_ASSR!C15","v":12},{"$f":"Script_ASSR!D15","v":"7C"},"\\n\""]
[null,"\"23",{"$f":"Script_ASSR!C18","v":13},{"$f":"Script_ASSR!D18","v":"7C"},"\\n\""]
[null,"\"23",{"$f":"Script_ASSR!C21","v":94},{"$f":"Script_ASSR!D21","v":20},"\\n\""]
[null,"\"23",{"$f":"Script_ASSR!C24","v":"0D"},{"$f":"Script_ASSR!D24","v":1},"\\n\""]
[null,"\"23",{"$f":"Script_ASSR!C27","v":64},{"$f":"Script_ASSR!D27","v":1},"\\n\""]
[null,"\"23",74,0,"\\n\""]
[null,"\"23",75,1,"\\n\""]
[null,"\"23",76,"0A","\\n\""]
[null,"\"23",77,1,"\\n\""]
[null,"\"23",78,81,"\\n\""]
[null,"\"FF","0A","\\n\""]
[null,"\"23",{"$f":"Script_ASSR!C31","v":"5A"},{"$f":"Script_ASSR!D31","v":5},"\\n\""]
[null,"\"23",{"$f":"Script_ASSR!C34","v":93},{"$f":"Script_ASSR!D34","v":30},"\\n\""]
[null,"\"23",{"$f":"Script_ASSR!C37","v":96},{"$f":"Script_ASSR!D37","v":"0A"},"\\n\""]
[null,"\"FF",14,"\\n\""]
[null,"\"23",{"$f":"Script_ASSR!C40","v":20},{"$f":"Script_ASSR!D40","v":"80"},"\\n\""]
[null,"\"23",{"$f":"Script_ASSR!C40 + 1","v":21},{"$f":"Script_ASSR!E40","v":"07"},"\\n\""]
[null,"\"23",{"$f":"Script_ASSR!C43","v":22},{"$f":"Script_ASSR!D43","v":0},"\\n\""]
[null,"\"23",{"$f":"Script_ASSR!C43 + 1","v":23},{"$f":"Script_ASSR!E43","v":0},"\\n\""]
[null,"\"23",{"$f":"Script_ASSR!C46","v":24},{"$f":"Script_ASSR!D46","v":"38"},"\\n\""]
[null,"\"23",{"$f":"Script_ASSR!C46 + 1","v":25},{"$f":"Script_ASSR!E46","v":"04"},"\\n\""]
[null,"\"23",{"$f":"Script_ASSR!C49","v":"2C"},{"$f":"Script_ASSR!D49","v":"30"},"\\n\""]
[null,"\"23","2D",{"$f":"Script_ASSR!E49","v":"00"},"\\n\""]
[null,"\"23",{"$f":"Script_ASSR!C52","v":30},{"$f":"Script_ASSR!D52","v":"12"},"\\n\""]
[null,"\"23",{"$f":"Script_ASSR!C52 +1","v":31},{"$f":"Script_ASSR!E52","v":"00"},"\\n\""]
[null,"\"23",{"$f":"Script_ASSR!C55","v":34},{"$f":"Script_ASSR!D55","v":"58"},"\\n\""]
[null,"\"23",{"$f":"Script_ASSR!C58","v":36},{"$f":"Script_ASSR!D58","v":"0B"},"\\n\""]
[null,"\"23",{"$f":"Script_ASSR!C61","v":38},{"$f":"Script_ASSR!D61","v":"18"},"\\n\""]
[null,"\"23",{"$f":"Script_ASSR!C64","v":"3A"},{"$f":"Script_ASSR!D64","v":"03"},"\\n\""]
[null,"\"23",{"$f":"Script_ASSR!C67","v":"5B"},{"$f":"Script_ASSR!D67","v":0},"\\n\""]
[null,"\"23",{"$f":"Script_ASSR!C70","v":"3C"},{"$f":"Script_ASSR!D70","v":"12"},"\\n\""]
[null,"\"23",{"$f":"Script_ASSR!C73","v":"5A"},{"$f":"Script_ASSR!D73","v":"0D"},"\\n\""]
[null,"\"</DSIInitSequence>\""]

{"sheet":"Script_NoASSR","index":7,"n_rows":76,"n_cols":6,"rows_kept":76,"cut":false,"hidden":false,"merged":[[63,1,63,5],[66,1,66,5],[69,1,69,5],[72,1,72,5],[1,1,1,5],[45,1,45,5],[48,1,48,5],[51,1,51,5],[54,1,54,5],[57,1,57,5],[60,1,60,5],[27,1,27,5],[30,1,30,5],[33,1,33,5],[36,1,36,5],[39,1,39,5],[42,1,42,5],[7,1,7,5],[12,1,12,5],[15,1,15,5],[18,1,18,5],[21,1,21,5],[24,1,24,5]]}
[]
[null,"This code is meant for an Aardvark USB to I2C to program the SN65DSI86"]
[null,null,"Addr","Data"]
[null,"<aardvark>"]
[null,"<configure i2c=\"1\" spi=\"1\" gpio=\"0\" tpower=\"1\" pullups=\"0\"/>"]
[null,"    <i2c_bitrate khz=\"100\"/>"]
[]
[null,"======ASSR RW control  ======"]
[null,"<i2c_write addr=\"0x2D\" count=\"1\" radix=\"16\">","FF",7,"</i2c_write>/>"]
[null,"<i2c_write addr=\"0x2D\" count=\"1\" radix=\"16\">",16,1,"</i2c_write>/>"]
[null,"<i2c_write addr=\"0x2D\" count=\"1\" radix=\"16\">","FF",0,"</i2c_write>/>"]
[]
[null,"======REFCLK Frequency  ======"]
[null,"<i2c_write addr=\"0x2D\" count=\"1\" radix=\"16\">","0A",{"$f":"CSR!$C$8","v":2},"</i2c_write>/>"]
[]
[null,"======DSI Mode  ======"]
[null,"<i2c_write addr=\"0x2D\" count=\"1\" radix=\"16\">",10,{"$f":"Calcs!J7","v":"26"},"</i2c_write>/>"]
[]
[null,"======DSIA Clock  ======"]
[null,"<i2c_write addr=\"0x2D\" count=\"1\" radix=\"16\">",12,{"$f":"CSR!C$16","v":"7C"},"</i2c_write>/>"]
[]
[null,"======DSIB Clock  ======"]
[null,"<i2c_write addr=\"0x2D\" count=\"1\" radix=\"16\">",13,{"$f":"CSR!C$17","v":"7C"},"</i2c_write>/>"]
[]
[null,"======DP Datarate  ======"]
[null,"<i2c_write addr=\"0x2D\" count=\"1\" radix=\"16\">",94,{"$f":"CSR!$C$41","v":20},"</i2c_write>/>"]
[]
[null,"======Enable PLL  ======"]
[null,"<i2c_write addr=\"0x2D\" count=\"1\" radix=\"16\">","0D",1,"</i2c_write> <sleep ms=\"10\"/>"]
[]
[null,"======Enable enhanced frame  in DSI86  ======"]
[null,"<i2c_write addr=\"0x2D\" count=\"1\" radix=\"16\">","5A",4,"</i2c_write>/>"]
[]
[null,"======Number of DP lanes  ======"]
[null,"<i2c_write addr=\"0x2D\" count=\"1\" radix=\"16\">",93,{"$f":"CSR!$C$40","v":30},"</i2c_write>/>"]
[]
[null,"======Start Semi-Auto Link Training  ======"]
[null,"<i2c_write addr=\"0x2D\" count=\"1\" radix=\"16\">",96,"0A","</i2c_write> <sleep ms=\"20\"/>"]
[]
[null,"======CHA Active Line Length  ======"]
[null,"<i2c_write addr=\"0x2D\" count=\"2\" radix=\"16\">",20,{"$f":"CSR!$C$20","v":"80"},{"$f":"CSR!$C$21","v":"07"},"</i2c_write>/>"]
[]
[null,"======CHB Active Line Length  ======"]
[null,"<i2c_write addr=\"0x2D\" count=\"2\" radix=\"16\">",22,{"$f":"CSR!$C$22","v":0},{"$f":"CSR!$C$23","v":0},"</i2c_write>/>"]
[]
[null,"======Vertical Active Size   ======"]
[null,"<i2c_write addr=\"0x2D\" count=\"2\" radix=\"16\">",24,{"$f":"CSR!$C$24","v":"38"},{"$f":"CSR!$C$25","v":"04"},"</i2c_write>/>"]
[]
[null,"======Horizontal Pulse Width   ======"]
[null,"<i2c_write addr=\"0x2D\" count=\"2\" radix=\"16\">","2C",{"$f":"CSR!$C$26","v":"30"},{"$f":"CSR!$C$27","v":"00"},"</i2c_write>/>"]
[]
[null,"======Vertical Pulse Width   ======"]
[null,"<i2c_write addr=\"0x2D\" count=\"2\" radix=\"16\">",30,{"$f":"CSR!$C$29","v":"12"},{"$f":"CSR!$C$30","v":"00"},"</i2c_write>/>"]
[]
[null,"======HBP   ======"]
[null,"<i2c_write addr=\"0x2D\" count=\"1\" radix=\"16\">",34,{"$f":"CSR!$C$32","v":"58"},"</i2c_write>/>"]
[]
[null,"======VBP   ======"]
[null,"<i2c_write addr=\"0x2D\" count=\"1\" radix=\"16\">",36,{"$f":"CSR!$C$33","v":"0B"},"</i2c_write>/>"]
[]
[null,"===== HFP  ======"]
[null,"<i2c_write addr=\"0x2D\" count=\"1\" radix=\"16\">",38,{"$f":"CSR!$C$34","v":"18"},"</i2c_write>/>"]
[]
[null,"===== VFP  ======"]
[null,"<i2c_write addr=\"0x2D\" count=\"1\" radix=\"16\">","3A",{"$f":"CSR!$C$35","v":"03"},"</i2c_write>/>"]
[]
[null,"===== DP-18BPP Disable  ======"]
[null,"<i2c_write addr=\"0x2D\" count=\"1\" radix=\"16\">","5B",0,"</i2c_write>/>"]
[]
[null,"===== Color Bar Enable  ======"]
[null,"<i2c_write addr=\"0x2D\" count=\"1\" radix=\"16\">","3C",{"$f":"Calcs!J8","v":"12"},"</i2c_write>/>"]
[]
[null,"===== Enhanced Frame, and Vstream Enable  ======"]
[null,"<i2c_write addr=\"0x2D\" count=\"1\" radix=\"16\">","5A","0C","</i2c_write>/>"]
[]
[null,"</aardvark>"]

{"sheet":"Qualcomm_noASSR","index":8,"n_rows":35,"n_cols":8,"rows_kept":35,"cut":false,"hidden":false,"merged":[]}
[]
[null,null,null,null,null,"Register","Data"]
[null,null,null,null,"\"<DSIInitSequence>\""]
[null,null,null,null,"\"23",{"$f":"Script_NoASSR!C9","v":"FF"},{"$f":"Script_NoASSR!D9","v":7},"\\n\""]
[null,null,null,null,"\"23",{"$f":"Script_NoASSR!C10","v":16},{"$f":"Script_NoASSR!D10","v":1},"\\n\""]
[null,null,null,null,"\"23",{"$f":"Script_NoASSR!C11","v":"FF"},{"$f":"Script_NoASSR!D11","v":0},"\\n\""]
[null,null,null,null,"\"23",{"$f":"Script_NoASSR!C14","v":"0A"},{"$f":"Script_NoASSR!D14","v":2},"\\n\""]
[null,null,null,null,"\"23",{"$f":"Script_NoASSR!C17","v":10},{"$f":"Script_NoASSR!D17","v":"26"},"\\n\""]
[null,null,null,null,"\"23",{"$f":"Script_NoASSR!C20","v":12},{"$f":"Script_NoASSR!D20","v":"7C"},"\\n\""]
[null,null,null,null,"\"23",{"$f":"Script_NoASSR!C23","v":13},{"$f":"Script_NoASSR!D23","v":"7C"},"\\n\""]
[null,null,null,null,"\"23",{"$f":"Script_NoASSR!C26","v":94},{"$f":"Script_NoASSR!D26","v":20},"\\n\""]
[null,null,null,null,"\"23",{"$f":"Script_NoASSR!C29","v":"0D"},{"$f":"Script_NoASSR!D29","v":1},"\\n\""]
[null,null,null,null,"\"FF","0A","\\n\""]
[null,null,null,null,"\"23",{"$f":"Script_NoASSR!C32","v":"5A"},{"$f":"Script_NoASSR!D32","v":4},"\\n\""]
[null,null,null,null,"\"23",{"$f":"Script_NoASSR!C35","v":93},{"$f":"Script_NoASSR!D35","v":30},"\\n\""]
[null,null,null,null,"\"23",{"$f":"Script_NoASSR!C38","v":96},{"$f":"Script_NoASSR!D38","v":"0A"},"\\n\""]
[null,null,null,null,"\"FF",14,"\\n\""]
[null,null,null,null,"\"23",{"$f":"Script_NoASSR!C41","v":20},{"$f":"Script_NoASSR!D41","v":"80"},"\\n\""]
[null,null,null,null,"\"23",{"$f":"Script_NoASSR!C41 + 1","v":21},{"$f":"Script_NoASSR!$E$41","v":"07"},"\\n\""]
[null,null,null,null,"\"23",{"$f":"Script_NoASSR!C44","v":22},{"$f":"Script_NoASSR!D44","v":0},"\\n\""]
[null,null,null,null,"\"23",{"$f":"Script_NoASSR!C44 + 1","v":23},{"$f":"Script_NoASSR!$E$44","v":0},"\\n\""]
[null,null,null,null,"\"23",{"$f":"Script_NoASSR!C47","v":24},{"$f":"Script_NoASSR!D47","v":"38"},"\\n\""]
[null,null,null,null,"\"23",{"$f":"Script_NoASSR!C47 + 1","v":25},{"$f":"Script_NoASSR!$E$47","v":"04"},"\\n\""]
[null,null,null,null,"\"23",{"$f":"Script_NoASSR!C50","v":"2C"},{"$f":"Script_NoASSR!D50","v":"30"},"\\n\""]
[null,null,null,null,"\"23","2D",{"$f":"Script_NoASSR!$E$50","v":"00"},"\\n\""]
[null,null,null,null,"\"23",{"$f":"Script_NoASSR!C53","v":30},{"$f":"Script_NoASSR!D53","v":"12"},"\\n\""]
[null,null,null,null,"\"23",{"$f":"Script_NoASSR!C53 + 1","v":31},{"$f":"Script_NoASSR!$E$53","v":"00"},"\\n\""]
[null,null,null,null,"\"23",{"$f":"Script_NoASSR!C56","v":34},{"$f":"Script_NoASSR!D56","v":"58"},"\\n\""]
[null,null,null,null,"\"23",{"$f":"Script_NoASSR!C59","v":36},{"$f":"Script_NoASSR!D59","v":"0B"},"\\n\""]
[null,null,null,null,"\"23",{"$f":"Script_NoASSR!C62","v":38},{"$f":"Script_NoASSR!D62","v":"18"},"\\n\""]
[null,null,null,null,"\"23",{"$f":"Script_NoASSR!C65","v":"3A"},{"$f":"Script_NoASSR!D65","v":"03"},"\\n\""]
[null,null,null,null,"\"23",{"$f":"Script_NoASSR!C68","v":"5B"},{"$f":"Script_NoASSR!D68","v":0},"\\n\""]
[null,null,null,null,"\"23",{"$f":"Script_NoASSR!C71","v":"3C"},{"$f":"Script_NoASSR!D71","v":"12"},"\\n\""]
[null,null,null,null,"\"23",{"$f":"Script_NoASSR!C74","v":"5A"},{"$f":"Script_NoASSR!D74","v":"0C"},"\\n\""]
[null,null,null,null,"\"</DSIInitSequence>\""]

{"sheet":"CSR","index":9,"n_rows":41,"n_cols":5,"rows_kept":41,"cut":false,"hidden":true,"merged":[]}
[]
[]
[null,{"$f":"DSI86_INPUTS!B$3","v":"Panel Vendor"},{"$f":"DSI86_INPUTS!C$3","v":"InfoVision"},null,"Color Legend"]
[null,{"$f":"DSI86_INPUTS!B$4","v":"Panel Model#"},{"$f":"DSI86_INPUTS!C$4","v":"M125NWF4 R0"},null,"Calculated OUTPUTS"]
[null,{"$f":"EDID!$B$5","v":"Resolution"},{"$f":"EDID!C$5","v":"2160x1440"},null,"INPUTS"]
[]
[null,"RESET AND CLOCK REGISTERS","HEX"]
[null,"REFCLK_FREQ",{"$f":"IF(DSI86_INPUTS!F$11 = 12,0,IF(DSI86_INPUTS!F$11 = 38.4,8,IF(DSI86_INPUTS!F$11=26,4,IF(DSI86_INPUTS!F$11 = 27,6,2))))","v":2}]
[]
[null,"DSI REGISTERS"]
[null,"LEFT_RIGHT_PIXELS",{"$f":"IF(Calcs!C$36=\"EvenOdd\",0,1)","v":0}]
[null,"DSI_CHANNEL_MODE",{"$f":"IF(Calcs!C$35=\"Single\",1,0)","v":1}]
[null,"CHA_DSI_LANES",{"$f":"IF(Calcs!C$33=4,0,IF(Calcs!C$33=3,1,IF(Calcs!C$33=2,2,3)))","v":0}]
[null,"CHB_DSI_LANES",{"$f":"IF(Calcs!C$34=4,0,IF(Calcs!C$34=3,1,IF(Calcs!C$34=2,2,3)))","v":3}]
[null,"DSI_Mode_10h"]
[null,"CHA_DSI_CLK_RANGE",{"$f":"DEC2HEX(ROUNDDOWN(Calcs!F$15/5,0),2)","v":"7C"}]
[null,"CHB_DSI_CLK_RANGE",{"$f":"C$16","v":"7C"}]
[]
[null,"VIDEO REGISTERS"]
[null,"CHA_ACTIVE_LINE_LENGTH_LOW",{"$f":"IF(AND(C$12=1,C$11=0),RIGHT(DEC2HEX(Calcs!C$13,4),2),RIGHT(DEC2HEX(Calcs!C$13/2,4),2))","v":"80"}]
[null,"CHA_ACTIVE_LINE_LENGTH_HIGH",{"$f":"IF(AND(C$12=1,C$11=0),LEFT(DEC2HEX(Calcs!C$13,4),2),LEFT(DEC2HEX(Calcs!C$13/2,4),2))","v":"07"}]
[null,"CHB_ACTIVE_LINE_LENGTH_LOW",{"$f":"IF(AND(C$12=1,C$11=0),0,RIGHT(DEC2HEX(Calcs!C$13/2,4),2))","v":0}]
[null,"CHB_ACTIVE_LINE_LENGTH_HIGH",{"$f":"IF(AND(C$12=1,C$11=0),0,LEFT(DEC2HEX(Calcs!C$13/2,4),2))","v":0}]
[null,"CHA_VERTICAL_DISPLAY_SIZE_LOW",{"$f":"RIGHT(DEC2HEX(Calcs!C$24,4),2)","v":"38"}]
[null,"CHA_VERTICAL_DISPLAY_SIZE_HIGH",{"$f":"LEFT(DEC2HEX(Calcs!C$24,4),2)","v":"04"}]
[null,"CHA_HSYNC_PULSE_WIDTH_LOW",{"$f":"RIGHT(DEC2HEX(Calcs!C$6,4),2)","v":"30"}]
[null,"CHA_HSYNC_PULSE_WIDTH_HIGH",{"$f":"LEFT(DEC2HEX(Calcs!C$6,4),2)","v":"00"}]
[null,"CHA_HSYNC_POLARITY",{"$f":"IF(Calcs!C$8 = \"POSITIVE\",0,1)","v":1}]
[null,"CHA_VSYNC_PULSE_WIDTH_LOW",{"$f":"RIGHT(DEC2HEX(Calcs!C$17,4),2)","v":"12"}]
[null,"CHA_VSYNC_PULSE_WIDTH_HIGH",{"$f":"LEFT(DEC2HEX(Calcs!C$17,4),2)","v":"00"}]
[null,"CHA_VSYNC_POLARITY",{"$f":"IF(Calcs!C$19=\"POSITIVE\",0,1)","v":1}]
[null,"CHA_HORIZONTAL_BACK_PORCH",{"$f":"DEC2HEX(Calcs!C$9,2)","v":"58"}]
[null,"CHA_VERTICAL_BACK_PORCH",{"$f":"DEC2HEX(Calcs!C$20,2)","v":"0B"}]
[null,"CHA_HORIZONTAL_FRONT_PORCH",{"$f":"DEC2HEX(Calcs!C$11,2)","v":"18"}]
[null,"CHA_VERTICAL_FRONT_PORCH",{"$f":"DEC2HEX(Calcs!C$22,2)","v":"03"}]
[null,"RIGHT_CROP"]
[null,"LEFT_CROP"]
[]
[null,"Link Training Registers"]
[null,"DP_NUM_LANES",{"$f":"IF(Calcs!F$23=4,30,IF(Calcs!F$23=2,20,10))","v":30}]
[null,"DP_DATARATE",{"$f":"IF(Calcs!F$24=\"HBR2\",\"E0\",IF(Calcs!F$24=\"HBR\",80,IF(Calcs!F$24=\"RBR\",20,Calcs!F$24)))","v":20}]

{"sheet":"EDID","index":10,"n_rows":24,"n_cols":22,"rows_kept":24,"cut":false,"hidden":true,"merged":[[4,2,4,3],[11,7,11,26],[2,2,2,3],[3,2,3,3]]}
[]
[null,"Category","Calc. Outputs","Manual Inputs",null,"EDID registers",0,1,2,3,4,5,6,7,8,9,"A","B","C","D","E","F"]
[null,"Panel Vendor",{"$f":"Main_Inputs_Page!C7","v":"InfoVision"},null,null,0,{"$f":"Main_Inputs_Page!I7","v":0},{"$f":"Main_Inputs_Page!J7","v":"FF"},{"$f":"Main_Inputs_Page!K7","v":"FF"},{"$f":"Main_Inputs_Page!L7","v":"FF"},{"$f":"Main_Inputs_Page!M7","v":"FF"},{"$f":"Main_Inputs_Page!N7","v":"FF"},{"$f":"Main_Inputs_Page!O7","v":"FF"},{"$f":"Main_Inputs_Page!P7","v":0},{"$f":"Main_Inputs_Page!Q7","v":26},{"$f":"Main_Inputs_Page!R7","v":"CF"},{"$f":"Main_Inputs_Page!S7","v":14},{"$f":"Main_Inputs_Page!T7","v":34},{"$f":"Main_Inputs_Page!U7","v":0},{"$f":"Main_Inputs_Page!V7","v":0},{"$f":"Main_Inputs_Page!W7","v":0},{"$f":"Main_Inputs_Page!X7","v":0}]
[null,"Panel Model#",{"$f":"Main_Inputs_Page!C8","v":"M125NWF4 R0"},null,null,10,{"$f":"Main_Inputs_Page!I8","v":0},{"$f":"Main_Inputs_Page!J8","v":"1C"},{"$f":"Main_Inputs_Page!K8","v":1},{"$f":"Main_Inputs_Page!L8","v":4},{"$f":"Main_Inputs_Page!M8","v":"A5"},{"$f":"Main_Inputs_Page!N8","v":"1D"},{"$f":"Main_Inputs_Page!O8","v":11},{"$f":"Main_Inputs_Page!P8","v":78},{"$f":"Main_Inputs_Page!Q8","v":"0A"},{"$f":"Main_Inputs_Page!R8","v":"1D"},{"$f":"Main_Inputs_Page!S8","v":30},{"$f":"Main_Inputs_Page!T8","v":"A7"},{"$f":"Main_Inputs_Page!U8","v":50},{"$f":"Main_Inputs_Page!V8","v":47},{"$f":"Main_Inputs_Page!W8","v":97},{"$f":"Main_Inputs_Page!X8","v":27}]
[null,"Resolution",{"$f":"Main_Inputs_Page!C9","v":"2160x1440"},null,null,20,{"$f":"Main_Inputs_Page!I9","v":13},{"$f":"Main_Inputs_Page!J9","v":50},{"$f":"Main_Inputs_Page!K9","v":54},{"$f":"Main_Inputs_Page!L9","v":0},{"$f":"Main_Inputs_Page!M9","v":0},{"$f":"Main_Inputs_Page!N9","v":0},{"$f":"Main_Inputs_Page!O9","v":1},{"$f":"Main_Inputs_Page!P9","v":1},{"$f":"Main_Inputs_Page!Q9","v":1},{"$f":"Main_Inputs_Page!R9","v":1},{"$f":"Main_Inputs_Page!S9","v":1},{"$f":"Main_Inputs_Page!T9","v":1},{"$f":"Main_Inputs_Page!U9","v":1},{"$f":"Main_Inputs_Page!V9","v":1},{"$f":"Main_Inputs_Page!W9","v":1},{"$f":"Main_Inputs_Page!X9","v":1}]
[null,"Pixel Clock",{"$f":"IF(Main_Inputs_Page!$C$22=\"Yes\",D6,Raw_EDID_Cals!Z3)","v":277.60000000000002},{"$f":"Main_Inputs_Page!C10","v":206.02},null,30,{"$f":"Main_Inputs_Page!I10","v":1},{"$f":"Main_Inputs_Page!J10","v":1},{"$f":"Main_Inputs_Page!K10","v":1},{"$f":"Main_Inputs_Page!L10","v":1},{"$f":"Main_Inputs_Page!M10","v":1},{"$f":"Main_Inputs_Page!N10","v":1},{"$f":"Main_Inputs_Page!O10","v":70},{"$f":"Main_Inputs_Page!P10","v":"6C"},{"$f":"Main_Inputs_Page!Q10","v":80},{"$f":"Main_Inputs_Page!R10","v":"A0"},{"$f":"Main_Inputs_Page!S10","v":70},{"$f":"Main_Inputs_Page!T10","v":38},{"$f":"Main_Inputs_Page!U10","v":20},{"$f":"Main_Inputs_Page!V10","v":40},{"$f":"Main_Inputs_Page!W10","v":18},{"$f":"Main_Inputs_Page!X10","v":30}]
[null,"Horizontal Active (pixels)",{"$f":"IF(Main_Inputs_Page!$C$22=\"Yes\",D7,Raw_EDID_Cals!Z4)","v":1920},{"$f":"Main_Inputs_Page!C11","v":2160},null,40,{"$f":"Main_Inputs_Page!I11","v":"3C"},{"$f":"Main_Inputs_Page!J11","v":0},{"$f":"Main_Inputs_Page!K11","v":26},{"$f":"Main_Inputs_Page!L11","v":"A5"},{"$f":"Main_Inputs_Page!M11","v":10},{"$f":"Main_Inputs_Page!N11","v":0},{"$f":"Main_Inputs_Page!O11","v":0},{"$f":"Main_Inputs_Page!P11","v":19},{"$f":"Main_Inputs_Page!Q11","v":0},{"$f":"Main_Inputs_Page!R11","v":0},{"$f":"Main_Inputs_Page!S11","v":0},{"$f":"Main_Inputs_Page!T11","v":"FE"},{"$f":"Main_Inputs_Page!U11","v":0},{"$f":"Main_Inputs_Page!V11","v":"4D"},{"$f":"Main_Inputs_Page!W11","v":31},{"$f":"Main_Inputs_Page!X11","v":33}]
[null,"Horizontal Blanking (pixels)",{"$f":"IF(Main_Inputs_Page!$C$22=\"Yes\",D8,Raw_EDID_Cals!Z5)","v":160},{"$f":"Main_Inputs_Page!C12","v":160},null,50,{"$f":"Main_Inputs_Page!I12","v":33},{"$f":"Main_Inputs_Page!J12","v":"4E"},{"$f":"Main_Inputs_Page!K12","v":56},{"$f":"Main_Inputs_Page!L12","v":46},{"$f":"Main_Inputs_Page!M12","v":33},{"$f":"Main_Inputs_Page!N12","v":20},{"$f":"Main_Inputs_Page!O12","v":52},{"$f":"Main_Inputs_Page!P12","v":32},{"$f":"Main_Inputs_Page!Q12","v":20},{"$f":"Main_Inputs_Page!R12","v":"0A"},{"$f":"Main_Inputs_Page!S12","v":0},{"$f":"Main_Inputs_Page!T12","v":0},{"$f":"Main_Inputs_Page!U12","v":0},{"$f":"Main_Inputs_Page!V12","v":3},{"$f":"Main_Inputs_Page!W12","v":0},{"$f":"Main_Inputs_Page!X12","v":4}]
[null,"Vertical Active (lines)",{"$f":"IF(Main_Inputs_Page!$C$22=\"Yes\",D9,Raw_EDID_Cals!Z6)","v":1080},{"$f":"Main_Inputs_Page!C13","v":1440},null,60,{"$f":"Main_Inputs_Page!I13","v":36},{"$f":"Main_Inputs_Page!J13","v":"FF"},{"$f":"Main_Inputs_Page!K13","v":5},{"$f":"Main_Inputs_Page!L13","v":"3C"},{"$f":"Main_Inputs_Page!M13","v":"8D"},{"$f":"Main_Inputs_Page!N13","v":25},{"$f":"Main_Inputs_Page!O13","v":13},{"$f":"Main_Inputs_Page!P13","v":31},{"$f":"Main_Inputs_Page!Q13","v":"8D"},{"$f":"Main_Inputs_Page!R13","v":0},{"$f":"Main_Inputs_Page!S13","v":0},{"$f":"Main_Inputs_Page!T13","v":0},{"$f":"Main_Inputs_Page!U13","v":0},{"$f":"Main_Inputs_Page!V13","v":0},{"$f":"Main_Inputs_Page!W13","v":0},{"$f":"Main_Inputs_Page!X13","v":3}]
[null,"Vertical Blanking (lines)",{"$f":"IF(Main_Inputs_Page!$C$22=\"Yes\",D10,Raw_EDID_Cals!Z7)","v":32},{"$f":"Main_Inputs_Page!C14","v":40},null,70,{"$f":"Main_Inputs_Page!I14","v":0},{"$f":"Main_Inputs_Page!J14","v":6},{"$f":"Main_Inputs_Page!K14","v":18},{"$f":"Main_Inputs_Page!L14","v":"FF"},{"$f":"Main_Inputs_Page!M14","v":"0F"},{"$f":"Main_Inputs_Page!N14","v":"3C"},{"$f":"Main_Inputs_Page!O14","v":"3B"},{"$f":"Main_Inputs_Page!P14","v":24},{"$f":"Main_Inputs_Page!Q14","v":8},{"$f":"Main_Inputs_Page!R14","v":31},{"$f":"Main_Inputs_Page!S14","v":"3B"},{"$f":"Main_Inputs_Page!T14","v":1},{"$f":"Main_Inputs_Page!U14","v":1},{"$f":"Main_Inputs_Page!V14","v":0},{"$f":"Main_Inputs_Page!W14","v":0},{"$f":"Main_Inputs_Page!X14","v":"BA"}]
[null,"Horizontal Sync Offset or FrontPorch (pixels)",{"$f":"IF(Main_Inputs_Page!$C$22=\"Yes\",D11,Raw_EDID_Cals!Z8)","v":24},{"$f":"Main_Inputs_Page!C15","v":48}]
[null,"Horizontal Sync Pulse Width (pixels)",{"$f":"IF(Main_Inputs_Page!$C$22=\"Yes\",D12,Raw_EDID_Cals!Z9)","v":48},{"$f":"Main_Inputs_Page!C16","v":32},null,null,null,"Please use the EDID_Formatting_Space to format the EDID and copy and paste the data only into the table."]
[null,"Vertical Sync Offset or FrontPorch (lines)",{"$f":"IF(Main_Inputs_Page!$C$22=\"Yes\",D13,Raw_EDID_Cals!Z10)","v":3},{"$f":"Main_Inputs_Page!C17","v":3}]
[null,"Vertical Sync Pulse Width (lines)",{"$f":"IF(Main_Inputs_Page!$C$22=\"Yes\",D14,Raw_EDID_Cals!Z11)","v":18},{"$f":"Main_Inputs_Page!C18","v":10}]
[null,"Hsync Polarity",{"$f":"IF(Main_Inputs_Page!$C$22=\"Yes\",D15,Raw_EDID_Cals!AA16)","v":"NEGATIVE"},{"$f":"Main_Inputs_Page!C19","v":"NEGATIVE"},null,"Color Legend"]
[null,"Vsync Polarity",{"$f":"IF(Main_Inputs_Page!$C$22=\"Yes\",D16,Raw_EDID_Cals!AA17)","v":"NEGATIVE"},{"$f":"Main_Inputs_Page!C20","v":"NEGATIVE"},null,"Calculated OUTPUTS"]
[null,"HPW",{"$f":"C$12","v":48},null,null,"INPUTS"]
[null,"HBP",{"$f":" C$8 - C$11 - C$12","v":88}]
[null,"HFP",{"$f":"C$11","v":24}]
[null,"Hactive",{"$f":"C$7","v":1920}]
[null,"VPW",{"$f":"C$14","v":18}]
[null,"VBP",{"$f":"C$10 - C$13 - C$14","v":11}]
[null,"VFP",{"$f":"C$13","v":3}]
[null,"Vactive",{"$f":"C$9","v":1080}]

{"sheet":"Raw_EDID_Cals","index":11,"n_rows":27,"n_cols":37,"rows_kept":27,"cut":false,"hidden":true,"merged":[[1,28,1,36]]}
[]
[null,null,"EDID registers",0,1,2,3,4,5,6,7,8,9,"A","B","C","D","E","F",null,"Byte #",null,"Data","Data","Raw decimal values","Values for script","Values",null,"Byte 17 Decode Table"]
[null,null,0,{"$f":"SUBSTITUTE(EDID!G3,\" \",\"\")","v":"0"},{"$f":"SUBSTITUTE(EDID!H3,\" \",\"\")","v":"FF"},{"$f":"SUBSTITUTE(EDID!I3,\" \",\"\")","v":"FF"},{"$f":"SUBSTITUTE(EDID!J3,\" \",\"\")","v":"FF"},{"$f":"SUBSTITUTE(EDID!K3,\" \",\"\")","v":"FF"},{"$f":"SUBSTITUTE(EDID!L3,\" \",\"\")","v":"FF"},{"$f":"SUBSTITUTE(EDID!M3,\" \",\"\")","v":"FF"},{"$f":"SUBSTITUTE(EDID!N3,\" \",\"\")","v":"0"},{"$f":"SUBSTITUTE(EDID!O3,\" \",\"\")","v":"26"},{"$f":"SUBSTITUTE(EDID!P3,\" \",\"\")","v":"CF"},{"$f":"SUBSTITUTE(EDID!Q3,\" \",\"\")","v":"14"},{"$f":"SUBSTITUTE(EDID!R3,\" \",\"\")","v":"34"},{"$f":"SUBSTITUTE(EDID!S3,\" \",\"\")","v":"0"},{"$f":"SUBSTITUTE(EDID!T3,\" \",\"\")","v":"0"},{"$f":"SUBSTITUTE(EDID!U3,\" \",\"\")","v":"0"},{"$f":"SUBSTITUTE(EDID!V3,\" \",\"\")","v":"0"},null,"0,1","Pixel Clock",{"$f":"J6","v":"70"},{"$f":"K6","v":"6C"},{"$f":"HEX2DEC(W3)+HEX2DEC(X3)*256","v":27760},{"$f":"Y3/100","v":277.60000000000002},{"$f":"TEXT(Y3/100,\"0.00\")&\" Mhz\"","v":"277.60 Mhz"},null,{"$f":"DEC2HEX(BITWISE_AND(HEX2DEC(X16),BIN2DEC(10000000)),2)","v":"00"},{"$f":"DEC2HEX(BITWISE_AND(HEX2DEC(X16),BIN2DEC(1100001)),2)","v":"01"},{"$f":"DEC2HEX(BITWISE_AND(HEX2DEC(X16),BIN2DEC(11000)),2)","v":"18"},{"$f":"DEC2HEX(BITWISE_AND(HEX2DEC(X16),BIN2DEC(10100)),2)","v":"10"},{"$f":"DEC2HEX(BITWISE_AND(HEX2DEC(X16),BIN2DEC(10010)),2)","v":"10"},{"$f":"DEC2HEX(BITWISE_AND(HEX2DEC(X16),BIN2DEC(11100)),2)","v":"18"},{"$f":"DEC2HEX(BITWISE_AND(HEX2DEC(X16),BIN2DEC(10010)),2)","v":"10"},null,"Detailed Timing Def. Part 2 (Table 3.22)"]
[null,null,10,{"$f":"SUBSTITUTE(EDID!G4,\" \",\"\")","v":"0"},{"$f":"SUBSTITUTE(EDID!H4,\" \",\"\")","v":"1C"},{"$f":"SUBSTITUTE(EDID!I4,\" \",\"\")","v":"1"},{"$f":"SUBSTITUTE(EDID!J4,\" \",\"\")","v":"4"},{"$f":"SUBSTITUTE(EDID!K4,\" \",\"\")","v":"A5"},{"$f":"SUBSTITUTE(EDID!L4,\" \",\"\")","v":"1D"},{"$f":"SUBSTITUTE(EDID!M4,\" \",\"\")","v":"11"},{"$f":"SUBSTITUTE(EDID!N4,\" \",\"\")","v":"78"},{"$f":"SUBSTITUTE(EDID!O4,\" \",\"\")","v":"0A"},{"$f":"SUBSTITUTE(EDID!P4,\" \",\"\")","v":"1D"},{"$f":"SUBSTITUTE(EDID!Q4,\" \",\"\")","v":"30"},{"$f":"SUBSTITUTE(EDID!R4,\" \",\"\")","v":"A7"},{"$f":"SUBSTITUTE(EDID!S4,\" \",\"\")","v":"50"},{"$f":"SUBSTITUTE(EDID!T4,\" \",\"\")","v":"47"},{"$f":"SUBSTITUTE(EDID!U4,\" \",\"\")","v":"97"},{"$f":"SUBSTITUTE(EDID!V4,\" \",\"\")","v":"27"},null,"2,4","H Active",{"$f":"BITWISE_AND(HEX2DEC(N6),BIN2DEC(11110000))/16","v":7},{"$f":"$L$6","v":"80"},{"$f":"W4*256+HEX2DEC(X4)","v":1920},{"$f":"Y4","v":1920},{"$f":"TEXT(Y4,\"0\")&\" Pixels\"","v":"1920 Pixels"},null,{"$f":"DEC2HEX(0,2)","v":"00"},null,null,null,null,null,null,{"$f":"IF(AC4=AC3,\"True\",\"False\")","v":"True"},"Non-Interlaced"]
[null,null,20,{"$f":"SUBSTITUTE(EDID!G5,\" \",\"\")","v":"13"},{"$f":"SUBSTITUTE(EDID!H5,\" \",\"\")","v":"50"},{"$f":"SUBSTITUTE(EDID!I5,\" \",\"\")","v":"54"},{"$f":"SUBSTITUTE(EDID!J5,\" \",\"\")","v":"0"},{"$f":"SUBSTITUTE(EDID!K5,\" \",\"\")","v":"0"},{"$f":"SUBSTITUTE(EDID!L5,\" \",\"\")","v":"0"},{"$f":"SUBSTITUTE(EDID!M5,\" \",\"\")","v":"1"},{"$f":"SUBSTITUTE(EDID!N5,\" \",\"\")","v":"1"},{"$f":"SUBSTITUTE(EDID!O5,\" \",\"\")","v":"1"},{"$f":"SUBSTITUTE(EDID!P5,\" \",\"\")","v":"1"},{"$f":"SUBSTITUTE(EDID!Q5,\" \",\"\")","v":"1"},{"$f":"SUBSTITUTE(EDID!R5,\" \",\"\")","v":"1"},{"$f":"SUBSTITUTE(EDID!S5,\" \",\"\")","v":"1"},{"$f":"SUBSTITUTE(EDID!T5,\" \",\"\")","v":"1"},{"$f":"SUBSTITUTE(EDID!U5,\" \",\"\")","v":"1"},{"$f":"SUBSTITUTE(EDID!V5,\" \",\"\")","v":"1"},null,"3,4","H Blanking",{"$f":"BITWISE_AND(HEX2DEC(N6),BIN2DEC(1111))","v":0},{"$f":"$M$6","v":"A0"},160,160,{"$f":"TEXT(Y5,\"0\")&\" Pixels\"","v":"160 Pixels"},null,{"$f":"BIN2HEX(10000000)","v":"80"},null,null,null,null,null,null,{"$f":"IF(AC5=AC3,\"True\",\"False\")","v":"False"},"Interlaced"]
[null,null,30,{"$f":"SUBSTITUTE(EDID!G6,\" \",\"\")","v":"1"},{"$f":"SUBSTITUTE(EDID!H6,\" \",\"\")","v":"1"},{"$f":"SUBSTITUTE(EDID!I6,\" \",\"\")","v":"1"},{"$f":"SUBSTITUTE(EDID!J6,\" \",\"\")","v":"1"},{"$f":"SUBSTITUTE(EDID!K6,\" \",\"\")","v":"1"},{"$f":"SUBSTITUTE(EDID!L6,\" \",\"\")","v":"1"},{"$f":"SUBSTITUTE(EDID!M6,\" \",\"\")","v":"70"},{"$f":"SUBSTITUTE(EDID!N6,\" \",\"\")","v":"6C"},{"$f":"SUBSTITUTE(EDID!O6,\" \",\"\")","v":"80"},{"$f":"SUBSTITUTE(EDID!P6,\" \",\"\")","v":"A0"},{"$f":"SUBSTITUTE(EDID!Q6,\" \",\"\")","v":"70"},{"$f":"SUBSTITUTE(EDID!R6,\" \",\"\")","v":"38"},{"$f":"SUBSTITUTE(EDID!S6,\" \",\"\")","v":"20"},{"$f":"SUBSTITUTE(EDID!T6,\" \",\"\")","v":"40"},{"$f":"SUBSTITUTE(EDID!U6,\" \",\"\")","v":"18"},{"$f":"SUBSTITUTE(EDID!V6,\" \",\"\")","v":"30"},null,"5,7","V Active",{"$f":"BITWISE_AND(HEX2DEC(Q6),BIN2DEC(11110000))/16","v":4},{"$f":"$O$6","v":"38"},1080,1080,{"$f":"TEXT(Y6,\"0\")&\" Lines\"","v":"1080 Lines"},null,null,{"$f":"BIN2HEX(0,2)","v":"00"},null,null,null,null,null,{"$f":"IF(AD6=AD3,\"True\",\"False\")","v":"False"},"Normal Display"]
[null,null,40,{"$f":"SUBSTITUTE(EDID!G7,\" \",\"\")","v":"3C"},{"$f":"SUBSTITUTE(EDID!H7,\" \",\"\")","v":"0"},{"$f":"SUBSTITUTE(EDID!I7,\" \",\"\")","v":"26"},{"$f":"SUBSTITUTE(EDID!J7,\" \",\"\")","v":"A5"},{"$f":"SUBSTITUTE(EDID!K7,\" \",\"\")","v":"10"},{"$f":"SUBSTITUTE(EDID!L7,\" \",\"\")","v":"0"},{"$f":"SUBSTITUTE(EDID!M7,\" \",\"\")","v":"0"},{"$f":"SUBSTITUTE(EDID!N7,\" \",\"\")","v":"19"},{"$f":"SUBSTITUTE(EDID!O7,\" \",\"\")","v":"0"},{"$f":"SUBSTITUTE(EDID!P7,\" \",\"\")","v":"0"},{"$f":"SUBSTITUTE(EDID!Q7,\" \",\"\")","v":"0"},{"$f":"SUBSTITUTE(EDID!R7,\" \",\"\")","v":"FE"},{"$f":"SUBSTITUTE(EDID!S7,\" \",\"\")","v":"0"},{"$f":"SUBSTITUTE(EDID!T7,\" \",\"\")","v":"4D"},{"$f":"SUBSTITUTE(EDID!U7,\" \",\"\")","v":"31"},{"$f":"SUBSTITUTE(EDID!V7,\" \",\"\")","v":"33"},null,"6,7","V Blanking",{"$f":"BITWISE_AND(HEX2DEC(Q6),BIN2DEC(1111))","v":0},{"$f":"$P$6","v":"20"},32,32,{"$f":"TEXT(Y7,\"0\")&\" Lines\"","v":"32 Lines"},null,null,{"$f":"BIN2HEX(1,2)","v":"01"},null,null,null,null,null,{"$f":"IF(AD7=AD3,\"True\",\"False\")","v":"True"},"Normal Display"]
[null,null,50,{"$f":"SUBSTITUTE(EDID!G8,\" \",\"\")","v":"33"},{"$f":"SUBSTITUTE(EDID!H8,\" \",\"\")","v":"4E"},{"$f":"SUBSTITUTE(EDID!I8,\" \",\"\")","v":"56"},{"$f":"SUBSTITUTE(EDID!J8,\" \",\"\")","v":"46"},{"$f":"SUBSTITUTE(EDID!K8,\" \",\"\")","v":"33"},{"$f":"SUBSTITUTE(EDID!L8,\" \",\"\")","v":"20"},{"$f":"SUBSTITUTE(EDID!M8,\" \",\"\")","v":"52"},{"$f":"SUBSTITUTE(EDID!N8,\" \",\"\")","v":"32"},{"$f":"SUBSTITUTE(EDID!O8,\" \",\"\")","v":"20"},{"$f":"SUBSTITUTE(EDID!P8,\" \",\"\")","v":"0A"},{"$f":"SUBSTITUTE(EDID!Q8,\" \",\"\")","v":"0"},{"$f":"SUBSTITUTE(EDID!R8,\" \",\"\")","v":"0"},{"$f":"SUBSTITUTE(EDID!S8,\" \",\"\")","v":"0"},{"$f":"SUBSTITUTE(EDID!T8,\" \",\"\")","v":"3"},{"$f":"SUBSTITUTE(EDID!U8,\" \",\"\")","v":"0"},{"$f":"SUBSTITUTE(EDID!V8,\" \",\"\")","v":"4"},null,"8,11","H Sync Offset (HFP)",{"$f":"BITWISE_AND(HEX2DEC(E7),BIN2DEC(11000000))/64","v":0},{"$f":"$R$6","v":"18"},24,24,{"$f":"TEXT(Y8,\"0\")&\" Pixels\"","v":"24 Pixels"},null,null,{"$f":"BIN2HEX(100000,2)","v":"20"},null,null,null,null,null,{"$f":"IF(AD8=AD3,\"True\",\"False\")","v":"False"},"Field Sequential Stereo R"]
[null,null,60,{"$f":"SUBSTITUTE(EDID!G9,\" \",\"\")","v":"36"},{"$f":"SUBSTITUTE(EDID!H9,\" \",\"\")","v":"FF"},{"$f":"SUBSTITUTE(EDID!I9,\" \",\"\")","v":"5"},{"$f":"SUBSTITUTE(EDID!J9,\" \",\"\")","v":"3C"},{"$f":"SUBSTITUTE(EDID!K9,\" \",\"\")","v":"8D"},{"$f":"SUBSTITUTE(EDID!L9,\" \",\"\")","v":"25"},{"$f":"SUBSTITUTE(EDID!M9,\" \",\"\")","v":"13"},{"$f":"SUBSTITUTE(EDID!N9,\" \",\"\")","v":"31"},{"$f":"SUBSTITUTE(EDID!O9,\" \",\"\")","v":"8D"},{"$f":"SUBSTITUTE(EDID!P9,\" \",\"\")","v":"0"},{"$f":"SUBSTITUTE(EDID!Q9,\" \",\"\")","v":"0"},{"$f":"SUBSTITUTE(EDID!R9,\" \",\"\")","v":"0"},{"$f":"SUBSTITUTE(EDID!S9,\" \",\"\")","v":"0"},{"$f":"SUBSTITUTE(EDID!T9,\" \",\"\")","v":"0"},{"$f":"SUBSTITUTE(EDID!U9,\" \",\"\")","v":"0"},{"$f":"SUBSTITUTE(EDID!V9,\" \",\"\")","v":"3"},null,"9,11","H Sync Pulse Width",{"$f":"BITWISE_AND(HEX2DEC(E7),BIN2DEC(110000))/16","v":0},{"$f":"$S$6","v":"30"},48,48,{"$f":"TEXT(Y9,\"0\")&\" Pixels\"","v":"48 Pixels"},null,null,{"$f":"BIN2HEX(1000000,2)","v":"40"},null,null,null,null,null,{"$f":"IF(AD9=AD3,\"True\",\"False\")","v":"False"},"Field Sequential Stereo L"]
[null,null,70,{"$f":"SUBSTITUTE(EDID!G10,\" \",\"\")","v":"0"},{"$f":"SUBSTITUTE(EDID!H10,\" \",\"\")","v":"6"},{"$f":"SUBSTITUTE(EDID!I10,\" \",\"\")","v":"18"},{"$f":"SUBSTITUTE(EDID!J10,\" \",\"\")","v":"FF"},{"$f":"SUBSTITUTE(EDID!K10,\" \",\"\")","v":"0F"},{"$f":"SUBSTITUTE(EDID!L10,\" \",\"\")","v":"3C"},{"$f":"SUBSTITUTE(EDID!M10,\" \",\"\")","v":"3B"},{"$f":"SUBSTITUTE(EDID!N10,\" \",\"\")","v":"24"},{"$f":"SUBSTITUTE(EDID!O10,\" \",\"\")","v":"8"},{"$f":"SUBSTITUTE(EDID!P10,\" \",\"\")","v":"31"},{"$f":"SUBSTITUTE(EDID!Q10,\" \",\"\")","v":"3B"},{"$f":"SUBSTITUTE(EDID!R10,\" \",\"\")","v":"1"},{"$f":"SUBSTITUTE(EDID!S10,\" \",\"\")","v":"1"},{"$f":"SUBSTITUTE(EDID!T10,\" \",\"\")","v":"0"},{"$f":"SUBSTITUTE(EDID!U10,\" \",\"\")","v":"0"},{"$f":"SUBSTITUTE(EDID!V10,\" \",\"\")","v":"BA"},null,"10,11","V Sync Offset (VFP)",{"$f":"BITWISE_AND(HEX2DEC(E7),BIN2DEC(1100))/4","v":0},{"$f":"BITWISE_AND(HEX2DEC(D7),BIN2DEC(11110000))/16","v":3},3,3,{"$f":"TEXT(Y10,\"0\")&\" Lines\"","v":"3 Lines"},null,null,{"$f":"BIN2HEX(100001,2)","v":"21"},null,null,null,null,null,{"$f":"IF(AD10=AD3,\"True\",\"False\")","v":"False"},"2-way interleaved stereo R"]
[null,null,null,null,null,null,null,null,null,null,null,null,null,null,null,null,null,null,null,null,"10,11","V Sync pulse width",{"$f":"BITWISE_AND(HEX2DEC(E7),BIN2DEC(11))","v":0},{"$f":"BITWISE_AND(HEX2DEC(D7),BIN2DEC(1111))","v":12},18,18,{"$f":"TEXT(Y11,\"0\")&\" Lines\"","v":"18 Lines"},null,null,{"$f":"BIN2HEX(1000001,2)","v":"41"},null,null,null,null,null,{"$f":"IF(AD11=AD3,\"True\",\"False\")","v":"False"},"2-way interleaved stereo L"]
[null,null,null,null,null,null,null,null,null,null,null,null,null,null,null,null,null,null,null,null,"12,14","H Addr Video Img size",{"$f":"BITWISE_AND(HEX2DEC(H7),BIN2DEC(11110000))/16","v":1},{"$f":"F7","v":"26"},{"$f":" W12*256+HEX2DEC(X12)","v":294},294,{"$f":"TEXT(Y12,\"0\")&\"mm\"","v":"294mm"},null,null,{"$f":"BIN2HEX(1100000,2)","v":"60"},null,null,null,null,null,{"$f":"IF(AD12=AD3,\"True\",\"False\")","v":"False"},"4-way interleaved stereo"]
[null,null,null,null,null,null,null,null,null,null,null,null,null,null,null,null,null,null,null,null,"13,14","V Addr Video Img size",{"$f":"BITWISE_AND(HEX2DEC(H7),BIN2DEC(1111))","v":0},{"$f":"G7","v":"A5"},{"$f":" W13*256+HEX2DEC(X13)","v":165},165,{"$f":"TEXT(Y13,\"0\")&\"mm\"","v":"165mm"},null,null,{"$f":"BIN2HEX(1100001,2)","v":"61"},null,null,null,null,null,{"$f":"IF(AD13=AD3,\"True\",\"False\")","v":"False"},"Side-by-Side "]
[null,null,null,null,null,null,null,null,null,null,null,null,null,null,null,null,null,null,null,null,15,"R Horrizontal Border","N/A",{"$f":"I7","v":"0"},null,null,null,null,null,null,{"$f":"BIN2HEX(0,2)","v":"00"},null,null,null,null,{"$f":"IF(AE14=AE3,\"True\",\"False\")","v":"False"},"Analog Composite Sync"]
[null,null,null,null,null,null,null,null,null,null,null,null,null,null,null,null,null,null,null,null,16,"Top Vertical Border","N/A",{"$f":"J7","v":"0"},null,"Polarity","Value",null,null,null,{"$f":"BIN2HEX(1000,2)","v":"08"},null,null,null,null,{"$f":"IF(AE15=AE3,\"True\",\"False\")","v":"False"},"Bipolar Analog Composite"]
[null,null,{"$f":"\"True\"","v":"True"},null,null,null,null,null,null,null,null,null,null,null,null,null,null,null,null,null,17,"See Section Below","N/A",{"$f":"K7","v":"19"},null,"Hsync Polarity",{"$f":"IF(AJ26=\"False\", \"POSITIVE\",\"NEGATIVE\")","v":"NEGATIVE"},null,null,null,null,{"$f":"BIN2HEX(0,2)","v":"00"},null,null,null,{"$f":"IF(AF16=AF3,\"True\",\"False\")","v":"False"},"Without Serrations"]
[null,null,null,null,null,null,null,null,null,null,null,null,null,null,null,null,null,null,null,null,null,null,null,null,null,"Vsync Polarity",{"$f":"IF(AJ24=\"False\", \"POSITIVE\",\"NEGATIVE\")","v":"NEGATIVE"},null,null,null,null,{"$f":"BIN2HEX(100,2)","v":"04"},null,null,null,{"$f":"IF(AF17=AF3,\"True\",\"False\")","v":"False"},"With Serrations"]
[null,null,null,null,null,null,null,null,null,null,null,null,null,null,null,null,null,null,null,null,null,null,null,null,null,null,null,null,null,null,null,null,{"$f":"BIN2HEX(10000000,2)","v":"80"},null,null,{"$f":"IF(AG18=AG3,\"True\",\"False\")","v":"False"},"sync on Green signal only "]
[null,null,null,null,null,null,null,null,null,null,null,null,null,null,null,null,null,null,null,null,null,null,null,null,null,null,null,null,null,null,null,null,{"$f":"BIN2HEX(0,2)","v":"00"},null,null,{"$f":"IF(AG19=AG3,\"True\",\"False\")","v":"False"},"Sync on all three vid signals"]
[null,null,null,null,null,null,null,null,null,null,null,null,null,null,null,null,null,null,null,null,null,null,null,null,null,null,null,null,null,null,{"$f":"BIN2HEX(10000,2)","v":"10"},null,null,null,null,{"$f":"IF(AE20=AE3,\"True\",\"False\")","v":"False"},"Digital Composite Sync"]
[null,null,null,null,null,null,null,null,null,null,null,null,null,null,null,null,null,null,null,null,null,null,null,null,null,null,null,null,null,null,null,null,null,{"$f":"BIN2HEX(10000,2)","v":"10"},null,{"$f":"IF(AH21=AH3,\"True\",\"False\")","v":"False"},"Without serrations"]
[null,null,null,null,null,null,null,null,null,null,null,null,null,null,null,null,null,null,null,null,null,null,null,null,null,null,null,null,null,null,null,null,null,{"$f":"BIN2HEX(10100,2)","v":"14"},null,{"$f":"IF(AH22=AH3,\"True\",\"False\")","v":"False"},"With serrations"]
[null,null,null,null,null,null,null,null,null,null,null,null,null,null,null,null,null,null,null,null,null,null,null,null,null,null,null,null,null,null,{"$f":"BIN2HEX(11000,2)","v":"18"},null,null,null,null,{"$f":"IF(AE23=AE3,\"True\",\"False\")","v":"True"},"Digital Separate Sync"]
[null,null,null,null,null,null,null,null,null,null,null,null,null,null,null,null,null,null,null,null,null,null,null,null,null,null,null,null,null,null,null,null,null,{"$f":"BIN2HEX(11000,2)","v":"18"},null,{"$f":"IF(AH24=AH3,\"True\",\"False\")","v":"True"},"Vertical Sync is Negative"]
[null,null,null,null,null,null,null,null,null,null,null,null,null,null,null,null,null,null,null,null,null,null,null,null,null,null,null,null,null,null,null,null,null,{"$f":"BIN2HEX(11100,2)","v":"1C"},null,{"$f":"IF(AH25=AH3,\"True\",\"False\")","v":"False"},"Vertical Sync is Positive"]
[null,null,null,null,null,null,null,null,null,null,null,null,null,null,null,null,null,null,null,null,null,null,null,null,null,null,null,null,null,null,null,null,null,null,{"$f":"BIN2HEX(10000,2)","v":"10"},{"$f":"IF(AI26=AI3,\"True\",\"False\")","v":"True"},"Horizontal Sync is Neg"]
[null,null,null,null,null,null,null,null,null,null,null,null,null,null,null,null,null,null,null,null,null,null,null,null,null,null,null,null,null,null,null,null,null,null,{"$f":"BIN2HEX(10010,2)","v":"12"},{"$f":"IF(AI27=AI3,\"True\",\"False\")","v":"False"},"Horizontal Sync is Pos"]