{"text_format":"1","workbook":"xlsx","n_sheets":15,"sheets":["Design Regulator","Input Filters","Design Input Filter","BOM & Schematic","EVM","Variable Management","Schematic Management","Stability Calculations","Bode Plot Management","Efficiency Calculations","Efficiency Plot Management","Input Filter Calculations","Standard Value Calculator","Snubber","Parallel Output Caps"],"not_rendered":{"charts":9,"images":35,"macros":1,"external_links":0,"defined_names":301,"comments":3,"pivot_tables":0},"unopened":[],"bounds":{"document_bytes":16777216,"sheet_cells":100000,"rows_first":2000,"rows_last":500,"rows_between":2000,"halvings":0,"cell_chars":16384,"cell_head_chars":4096},"cells_cut":0,"cells_raw":0,"read":"whole","date_system":"1900"}

{"sheet":"Design Regulator","index":0,"n_rows":109,"n_cols":16,"rows_kept":109,"cut":false,"hidden":false,"merged":[[74,5,74,7],[2,13,2,14],[0,0,0,15],[85,5,85,6],[33,10,34,15]]}
["                      LM(2)5149/-Q1 Synchronous Buck Controller Design Tool"]
[null,null,null,null,null,null,null,null,null,null,null,null,null,"http://www.ti.com/product/lm5175"]
["About",null,"xx",null,null,"= Input Box",null,null,null,null,null,null,null,"TERMS OF USE",null,"                "]
[]
["Step 1: Operating Specifications"]
[null,null,null,"Input Voltage – Min, VIN(min) ",52,"V"]
[null,null,null,"Input Voltage – Nom, VIN(nom)",54,"V"]
[null,null,null,"Input Voltage – Max, VIN(max)",56,"V"]
[null,null,null,"Output Voltage, VOUT ",50,"V"]
[null,null,null,"Full Load Output Current, IOUT ",15,"A"]
[null,null,null,"Switching Frequency, FSW",450,"kHz"]
[null,null,null,"Frequency Set Resistor, RT ",{"$f":"'Variable Management'!C442","v":48.7},"kΩ"]
[null,null,null,"Ambient Temperature, TA",25,"°C"]
[]
["Step 2: Current Sense Resistor"]
[null,null,null,"Required IOCP Setpoint at VIN(nom)",20,"A"]
[null,null,null,"Recommended Sense Resistance",{"$f":"Rs_ideal*1000","v":2.9393878352654421},"mΩ"]
[null,null,null,"Sense Resistance, RS",3,"mΩ"]
[null,null,null,"Min Inductor Sat Current, ILO(SAT)",{"$f":"'Variable Management'!B95","v":20},"A"]
[null,null,null,"Max power loss in shunt",{"$f":"'Variable Management'!B105","v":1.1744876961830051},"W"]
[null,null,null,"VIN(min)",{"$f":"'Variable Management'!B97","v":19.785869066299462},"A"]
[null,null,"IOUT(typ) at OCP Inception:","VIN(nom)",{"$f":"'Variable Management'!B98","v":19.587586476290333},"A"]
[null,null,null,"VIN(max)",{"$f":"'Variable Management'!B99","v":19.403455556546824},"A"]
[]
["Step 3: Buck Inductance"]
[null,null,null,"Recommended Inductance",{"$f":"Lopt*1000000","v":13.888888888888889},"µH"]
[null,null,null,"Inductance, LO ",10,"µH"]
[null,null,null,"Inductor DCR ",7,"mΩ"]
[null,null,null,"DIL as a % at VIN(nom)",{"$f":"'Variable Management'!B68*100","v":5.498846982795544},"%"]
[]
["Step 4: Output Capacitors"]
[null,null,null,"Output Voltage Ripple Spec",100,"mVpk-pk"]
[null,null,null,"Minimum Output Capacitance",{"$f":"'Variable Management'!B121","v":2.2911862428314764},"µF"]
[null,null,null,"Output Capacitance (derated), COUT ",470,"µF",null,null,null,null,{"$f":"CHOOSE(SCH_MODE, \"\", \"** For Single-Output Operation in 2-Phase Mode, tie MODE to VDDA and use FB1 to set VOUT **\", \"** For Single-Output Operation in 3-Phase Mode, tie both MODE pins to VDDA. Use FB1 of master IC to set VOUT. Connect FB2 of master IC to AGND. Connect FB2 of slave IC to VDDA to configure it as a slave **\", \"** For Single-Output Operation in 4-Phase Mode, tie both MODE pins to VDDA. Use FB1 of master IC to set VOUT. Connect FB2 of master IC to AGND. Connect FB2 of slave IC to VDDA to configure it as a slave **\")","v":""}]
[null,null,null,"Maximum Permitted ESR",{"$f":"'Variable Management'!B125","v":121.23609681652778},"mΩ"]
[null,null,null,"Output Capacitor ESR",10,"mΩ",null,null,null,null,{"$f":"CHOOSE(SCH_MODE,  \"\", \"** Tie VCCX to GND if not used **\", \"** Slave controller (CNTRL2) not shown **\",\"** Slave controller (CNTRL2) not shown **\")","v":""},null,null,null,null,{"$f":"IF(SCH_MODE=1,  \"** Tie VCCX to GND if not used **\", \"\")","v":"** Tie VCCX to GND if not used **"}]
[null,null,null,"Resulting Output Voltage Ripple (max) ",{"$f":"'Variable Management'!B127*1000","v":8.262663543882935},"mVpk-pk",null,null,null,null,{"$f":"IF(OR(SCH_MODE=3, SCH_MODE=4),\"** Tie VCCX to GND if not used **\", \"\")","v":""}]
[null,null,null,"Output Capacitor RMS Current (max) ",{"$f":"'Variable Management'!B114","v":0.34441509501126755},"A (rms)"]
[]
["Step 5: Input Capacitors and AEF - See Next Tab"]
[null,null,null,"Input Voltage Ripple Spec",300,"mVpk-pk"]
[null,null,null,"Minimum Input Capacitance",{"$f":"'Variable Management'!B148","v":27.777777777777779},"µF"]
[null,null,null,"Input Capacitance (derated), CIN ",470,"µF"]
[null,null,null,"Maximum Permitted ESR",{"$f":"'Variable Management'!B154","v":18.800021525150424},"mΩ",null,null,null,null,null,null,null,null,null," "]
[null,null,null,"Input Capacitor ESR",10,"mΩ"]
[null,null,null,"Resulting Input Voltage Ripple (max)",{"$f":"'Variable Management'!B161*1000","v":173.69594088843249},"mVpk-pk"]
[null,null,null,"Input Capacitor RMS Current (max)",{"$f":"'Variable Management'!B138","v":7.5},"A (rms)"]
[null,null,null,"AEF Filter Inductor",0.68,"µH"]
[{"$f":"\"Recommended Cinj \"&'Standard Value Calculator'!S24&\" µF\"","v":"Recommended Cinj 1,5 µF"},null,null,"CINJ",0.47,"µF"]
[{"$f":"CHOOSE(OSC,\"Cdamp: DNP\",\"Recommended Caefdamp \"&'Standard Value Calculator'!S25&\" µF\")","v":"Recommended Caefdamp 0,68 µF"},null,null,"CDAMP",0,"µF"]
[{"$f":"\"Recommended Raefdamp \"&Rdamp_AEFstd&\" Ω\"","v":"Recommended Raefdamp 41,2 Ω"},null,null,"RDAMP",6.81,"Ω"]
[null,null,null,"Filter Attenuation Fsw",{"$f":"-'Variable Management'!B302","v":0},"dB"]
[null,null,null,"VIN Ripple",{"$f":"VinRipple_dBuV","v":104.79579339020241},"dBµV"]
[null,null,null,"Fsw Conducted EMC",{"$f":"'Variable Management'!B303","v":104.79579339020241},"dBµV"]
[]
["Step 6: Enable, CNFG, FPWM/PFM"]
[]
[]
[null,null,null,"Input Voltage UVLO Turn-ON",5.5,"V"]
[null,null,null,"Input Voltage UVLO Turn-OFF",4.5,"V"]
[null,null,null,"Upper Enable Resistor, RUV1",{"$f":"IF(UVLO_TYPE=1,'Variable Management'!B187,0)","v":0},"kΩ"]
[null,null,null,"Lower Enable Resistor, RUV2",{"$f":"IF(UVLO_TYPE=1,'Variable Management'!B188,\"DNP\")","v":"DNP"},"kΩ"]
[null,null,null,"Configuration Resistor, RCNFG",{"$f":"IF(DITHER=1,\"41.2\",\"29.4\")","v":"41.2"},"kΩ"]
[null,null,null,{"$f":"IF(DEMB=1, \"* Tie PFM to GND\", \"* Tie PFM to VDDA\")","v":"* Tie PFM to GND"}]
[]
["Step 7: Compensation Design"]
[null,null,null,"Load Pole Frequency",{"$f":"Fp_dominant","v":115.60735715570485},"Hz"]
[null,null,null,"ESR Zero Frequency",{"$f":"Fesr/1000","v":33.862753888033275},"kHz"]
[null,null,null,"Desired Crossover Frequency",48,{"$f":"\"     kHz \"","v":"     kHz "}]
[null,null,null,"Error Amp Pole Frequency",{"$f":"Fp1_u","v":16.517473654721982},"Hz"]
[null,null,null,{"$f":"CHOOSE(VOUT_setting, \"Upper Feedback Resistor\",\"\",\"\",\"\")","v":"Upper Feedback Resistor"},100,"kΩ"]
[null,null,null,{"$f":"CHOOSE(VOUT_setting, \"Lower Feedback Resistor\", \"PULLUP FB to VDDA with \"&'Variable Management'!D418,\"TIE FB TO VDDA\",\"PULLUP FB to VDDA with\"&'Variable Management'!D418)","v":"Lower Feedback Resistor"},{"$f":"IF(Vout=Vref,\"OPEN\",Rfb2_u/1000)","v":1.62},{"$f":"IF(Vout=Vref,\"\",\"kΩ\")","v":"kΩ"}]
[]
["Compensation Components"]
[null,"Calculated /","Std Values",{"$f":"C75","v":"Std Values"},null,"Actual P/Z Frequencies"]
["RC1",{"$f":"Rcea1/1000","v":221.48228182499997},{"$f":"'Standard Value Calculator'!S32","v":221},237,"kΩ",{"$f":"Fp1_u","v":16.517473654721982},"Hz   (FPEA)"]
["CC1",{"$f":"Cc1ea*1000000000","v":0.14970624094841972},{"$f":"'Standard Value Calculator'!S33","v":0.15},0.15,"nF",{"$f":"Fz1_u/1000","v":4.4769323002463128},"kHz (FZCOMP)"]
["CC2",{"$f":"IF(Cc2ea<0, \"N/A\", Cc2ea*1000000000000)","v":"N/A"},{"$f":"'Standard Value Calculator'!S34","v":0},0,"pF",{"$f":"Fp2_u/1000","v":21.097046413502113},"kHz (FPCOMP)"]
[null,null,null,null,null,null,null,null,null,null,null,null,"** Specify Inductor Core Loss **",0.1,"W"]
[]
["Efficiency / Power Loss Analyzer"]
[]
["Step 8: Efficiency"]
[null,null,null,null,null,"Power MOSFETs","(Q1, Q2) "]
[null,null,null,null,"IAUC60N04S6L039 / IAUC60N04S6L039"]
[null,null,null,null,"High-side","  Low-side"]
[null,null,null,"On-State Resistance, RDS(on) ",7.5,7.5,"mΩ"]
[null,null,null,"Total Gate Charge, QG ",11,11,"nC"]
[null,null,null,"Gate-Drain Charge, QGD ",3.9,3.9,"nC"]
[null,null,null,"Gate-Source Charge, QGS ",4.3,4.3,"nC"]
[null,null,null,"Output Charge, QOSS ",null,23,"nC"]
[null,null,null,"Output Capacitance, COSS ",220,220,"pF"]
[null,null,null,"Gate Resistance, RG ",1.5,1.5,"Ω"]
[null,null,null,"Transconductance, gFS ",47,47,"S"]
[null,null,null,"Gate-Source Threshold Voltage, VTH ",1.6,1.6,"V"]
[null,null,null,"Body Diode Forward Voltage, VBD ",0.8,0.8,"V"]
[null,null,null,"Body Diode Rev Recovery Charge, QRR ",null,20,"nC"]
[null,null,null,"Thermal Resistance, θJA ",50,50,"°C/W"]
[]
["External Schottky Diode (if applicable)"]
[null,null,null,"Schottky Fwd Voltage, VFWDsch ",null,0,"V"]
[null,null,null,"Schottky Rev Recovery Charge, QRRsch ",null,0,"nC"]
[]
[]
[]
["Step 9: IC Power Loss"]
[null,null,null,"IC Power Dissipation",{"$f":"'Variable Management'!B361","v":4.9499999999999995E-2},"W"]
[null,null,null,"IC Junction Temperature (estimate)",{"$f":"'Variable Management'!B363","v":26.687950000000001},"°C"]
[null,null,null,null,{"$f":"CHOOSE(Ext_VCC, \"\", \"* Tie VCCX to PGND\")","v":""}]

{"sheet":"Input Filters","index":1,"n_rows":17,"n_cols":17,"rows_kept":17,"cut":false,"hidden":false,"merged":[[0,0,0,16],[2,14,2,15]]}
["                           LM(2)5149-Q1 Synchronous Buck Controller Design Tool"]
[null,null,null,null,null,null,null,null,null,null,null,null,null,null,"http://www.ti.com/product/lm5175"]
["About",null,"xx",null,null,"= Input Box",null,null,null,null,null,null,null,null,"TERMS OF USE",null,"                "]
[]
[]
[]
[null,null,null,null,"AEF",null,null,null,null,null,null,null,"Passive"]
[]
[null,"Design tab - LAEF",{"$f":"'Design Regulator'!E48 & \" µH\"","v":"0,68 µH"},null,null,"LAEF",1,"µH",null,"Suggested LIN Inductor","0.1-10","µH",null,"Chosen LIN",0.68,"µH"]
[null,"Design tab - CINJ",{"$f":"'Design Regulator'!E49 & \" µF\"","v":"0,47 µF"},null,null,"CINJ",1,"µF",null,"Suggested CF","0.1-10","µF",null,"Chosen CF",0.47,"µF"]
[null,"Design tab - CDAMP",{"$f":"'Design Regulator'!E50 & \" µF\"","v":"0 µF"},null,null,"CDAMP",1,"µF",null,"Suggested CDAMP","1-10","µF",null,"Chosen CDAMP",1,"µF"]
[null,"Design tab - RDAMP",{"$f":"'Design Regulator'!E51 & \" Ω\"","v":"6,81 Ω"},null,null,"RDAMP",10,"Ω",null,"Suggested RDAMP",{"$f":"Rdamp_PassiveStd","v":6.8100000000000008E-2},"Ω",null,"Chosen RDAMP",0.35,"Ω"]
[]
[null,null,"VIN Ripple at Fsw",null,null,{"$f":"VinRipple_dBuV","v":104.79579339020241},"dBµV","VIN Ripple",{"$f":"VinRipple_dBuV","v":104.79579339020241},"dBµV"]
[]
[null,null,null,"AEF Attenuation at Fsw",{"$f":"-'Input Filter Calculations'!AM97","v":32.349299903264104},"dB",null,null,null,null,null,"Passive Attenuation at Fsw",{"$f":"-'Input Filter Calculations'!AA97","v":14.131342475740208},"dB"]
[null,null,null,"AEF EMI at Fsw",{"$f":"VinRipple_dBuV-E16","v":72.446493486938294},"dB-µV",null,null,null,null,null,"Passive EMI at Fsw",{"$f":"VinRipple_dBuV-M16","v":90.664450914462194},"dB-µV"]

{"sheet":"Design Input Filter","index":2,"n_rows":14,"n_cols":17,"rows_kept":14,"cut":false,"hidden":true,"merged":[[0,0,0,16],[2,14,2,15]]}
["                           LM5149-Q1 Synchronous Buck Controller Design Tool"]
[null,null,null,null,null,null,null,null,null,null,null,null,null,null,"http://www.ti.com/product/lm5175"]
["About",null,"xx",null,null,"= Input Box",null,null,null,null,null,null,null,null,"TERMS OF USE",null,"                "]
[]
[]
[]
[null,"Choose Filter"]
[null,"Suggested Inductor",{"$f":"CHOOSE(INFILTER_TYPE,\"\",\"0.01-1\",\"0.1-10\")","v":""},"µH",null,"Chosen Inductor",1,"µH"]
[null,{"$f":"CHOOSE(INFILTER_TYPE,\"\",\"Suggested Cinj\",\"Suggested Cf\")","v":""},{"$f":"CHOOSE(INFILTER_TYPE,\"\",'Standard Value Calculator'!S24,'Standard Value Calculator'!S23)","v":""},"µF",null,{"$f":"CHOOSE(INFILTER_TYPE,\"\",\"Chosen Cinj\",\"Chosen Cf\")","v":""},6.8000000000000005E-2,"µF"]
[null,"Suggested Cdamp",{"$f":"CHOOSE(INFILTER_TYPE,\"\",CHOOSE(OSC,\"DNP\",'Standard Value Calculator'!S25),'Standard Value Calculator'!S28)","v":""},"µF",null,"Chosen Cdamp",3.3000000000000002E-2,"µF"]
[null,"Suggested Rdamp",{"$f":"CHOOSE(INFILTER_TYPE,\"\",'Standard Value Calculator'!S26,Rdamp_PassiveStd)","v":""},"Ω",null,"Chosen Rdamp",43.2,"Ω"]
[null,null,null,null,null,"Filter Attenuation",{"$f":"-'Variable Management'!B302","v":0},"dB"]
[null,null,null,null,null,"VIN Ripple",{"$f":"VinRipple_dBuV","v":104.79579339020241},"dB-µV"]
[null,null,null,null,null,"Fsw Conducted EMC",{"$f":"'Variable Management'!B303","v":104.79579339020241},"dB-µV"]

{"sheet":"BOM & Schematic","index":3,"n_rows":71,"n_cols":10,"rows_kept":71,"cut":false,"hidden":true,"merged":[[50,3,50,5],[47,3,47,5],[62,3,62,6],[63,3,63,6],[61,3,61,6],[52,3,52,5],[55,3,55,6],[41,3,41,6],[46,3,46,5],[60,3,60,6],[58,3,58,6],[59,3,59,6],[54,3,54,6],[57,3,57,6],[56,3,56,6],[53,3,53,6],[42,3,42,5],[43,3,43,5],[48,3,48,5],[49,3,49,5],[51,3,51,5],[44,3,44,5],[45,3,45,5],[64,0,65,0],[64,9,65,9],[64,3,65,6],[64,2,65,2],[64,1,65,1],[64,7,65,7],[64,8,65,8]]}
[]
[]
[]
[]
[]
[]
[]
[]
[]
[]
[]
[]
[]
[]
[]
[]
[]
[]
[]
[]
[]
[]
[]
[]
[]
[]
[]
[]
[]
[]
[]
[]
[]
[]
[]
["   ** Tie DEMB to VDDA for FPWM, AGND for DEM **"]
["   ** Tie VCCX to GND if not used **",null,null,null,null,null,null,null,{"$f":"IF(OR(SCH_MODE=3, SCH_MODE=4),\"** Tie VCCX to GND if not used **\", \"\")","v":""}]
["   ** Tie DITH to VDDA to disable spread spectrum **"]
["   ** Tie OSC to VDDA for 2.2MHz, AGND for 440kHz **"]
[{"$f":"\"VIN = \"&VIN_min&\" V to \"&VIN_max&\" V, VOUT = \"& Vout &\" V, IOUT = \" &Iout & \" A,  Fsw = \" & Fsw/1000 &\" kHz, Current Limit = \"&ROUNDUP(Ilimit_DC,0)&\" A\"","v":"VIN = 52 V to 56 V, VOUT = 50 V, IOUT = 15 A,  Fsw = 450 kHz, Current Limit = 20 A"}]
["High Efficiency Synchronous Buck Regulator BOM"]
["Count","Ref Des","Value","Description",null,null,null,"Size","Part Number","MFR"]
[1,"CBOOT",0.1,{"$f":"C43","v":0.1},null,null,null,"0603","Std","Std"]
[1,"CC1",{"$f":"'Design Regulator'!D77","v":0.15},0.15,null,null,null,"0603","Std","Std"]
[1,"CC2",{"$f":"'Design Regulator'!D78","v":0},0,null,null,null,"0603","Std","Std"]
[1,"CRES",{"$f":"Cres_u*1000000000","v":82},{"$f":"C46","v":82},null,null,null,"0603","Std","Std"]
[1,"CDITH",{"$f":"Cdither*1000000000","v":{"$error":"#VALUE!"}},{"$f":"C47","v":{"$error":"#VALUE!"}},null,null,null,"0603","Std","Std"]
[{"$f":"ROUNDUP('Design Regulator'!E43/10,0)","v":47},"CIN",10,{"$f":"C48","v":10},null,null,null,1210,"Std","Std"]
[{"$f":"ROUNDUP('Design Regulator'!E34/47,0)","v":10},"COUT",47,{"$f":"C49","v":47},null,null,null,1210,"Std","Std"]
[1,"CSS",{"$f":"'Design Regulator'!#REF!","v":{"$error":"#REF!"}},{"$f":"C50","v":{"$error":"#REF!"}},null,null,null,"0603","Std","Std"]
[2,"CVCC, CVCCX",2.2000000000000002,2.2000000000000002,null,null,null,"0603","Std","Std"]
[1,"CVDDA",0.47,0.47,null,null,null,"0603","Std","Std"]
[1,"DBOOT","See description","Schottky Diode, 60V, 200mA",null,null,null,"-","-","Various"]
[1,"LO",{"$f":"'Design Regulator'!E27","v":10},{"$f":"\"Inductor, \"&Lf*1000000&\"µH, \"&Rdcr*1000&\"mΩ, >\"&ROUNDUP(Ilimit_DC*1.1,0)&\"A\"","v":"Inductor, 10µH, 7mΩ, >22A"},null,null,null,"-","-","Various"]
[2,"Q1, Q2","See description",{"$f":"'Design Regulator'!E87","v":7.5},null,null,null,"Std",{"$f":"'Design Regulator'!E85","v":"IAUC60N04S6L039 / IAUC60N04S6L039"},"-"]
[1,"RC1",{"$f":"'Design Regulator'!D76","v":237},{"$f":"C56","v":237},null,null,null,"0603","Std","Std"]
[1,"RS",{"$f":"Rs*1000","v":3},3,null,null,null,"0508","Std","Std"]
[1,"RT",{"$f":"'Design Regulator'!E12","v":48.7},48.7,null,null,null,"0603","Std","Std"]
[1,"RFB1",{"$f":"'Design Regulator'!E71","v":100},100,null,null,null,"0603","Std","Std"]
[1,"RFB2",{"$f":"'Design Regulator'!E72","v":1.62},1.62,null,null,null,"0603","Std","Std"]
[1,"RPGOOD",100,100,null,null,null,"0603","Std","Std"]
[1,"RCS",100,100,null,null,null,"0603","Std","Std"]
[1,"RDEMB",100,100,null,null,null,"0603","Std","Std"]
[1,"RVIN",2.2000000000000002,2.2000000000000002,null,null,null,"0603","Std","Std"]
[1,"U1","LM5141-Q1","IC, LM5141-Q1, Synchronous Buck PWM Controller, 3.8V–65V Input",null,null,null,"VQFN-24","LM5141QRGEQ1","TI"]
[]
[]
["NOTES:"]
["** For information on TI NexFETTM MOSFETs, see **",null,null,"http://www.ti.com/nexfet","   **"]
["** Inductor saturation current should be higher than the peak inductor current at the OCP setpoint for all input voltages and operating temperatures **"]
["** Effective input and output capacitances should be appropriately derated for applied voltage and temperature, particularly with ceramics **"]

{"sheet":"EVM","index":4,"n_rows":6,"n_cols":2,"rows_kept":6,"cut":false,"hidden":false,"merged":[[0,0,0,16]]}
[" LM25149-Q1 Quickstart Design Tool"]
[]
[]
[]
[]
[null,"LM25149-Q1EVM-2100 PCB Layout"]

{"sheet":"Variable Management","index":5,"n_rows":450,"n_cols":27,"rows_kept":450,"cut":false,"hidden":true,"merged":[[4,4,4,7],[0,0,0,8]]}
["EXCEL Variables Names/Calculations"]
[null,"Input from user ="]
[null,"Output ="]
[null,"Constant"]
["Variable Name","Value","STD Units",null,"Notes",null,null,null,"Iteration"]
["Step 1: Operational Specs"]
["VIN_min",{"$f":"'Design Regulator'!E6","v":52},"V","Minimum input voltage",null,null,null,null,1]
["VIN_nom",{"$f":"'Design Regulator'!E7","v":54},"V","Nominal input voltage",null,null,null,null,null,null,{"$f":"CHOOSE(SCH_MODE, \"Efficiency vs. IOUT (Ch1)\", \"Efficiency vs. IOUT - 2 Ph\", \"Efficiency vs. IOUT - 3 Ph\", \"Efficiency vs. IOUT - 4 Ph\")","v":"Efficiency vs. IOUT (Ch1)"},1,null,"DITHER Enabled",1,null,null,null,null,"Dual  Outputs",1,null,"FPWM",1,null,{"$f":"CHOOSE(SCH_MODE, \"Bode Plot (Ch1)\", \"Bode Plot - 2 Ph\", \"Bode Plot - 3 Ph\", \"Bode Plot - 4 Ph\")","v":"Bode Plot (Ch1)"},1]
["VIN_max",{"$f":"'Design Regulator'!E8","v":56},"V","Maximum input voltage",null,null,null,null,null,null,{"$f":"IF(MODE=1, \"Efficiency vs. IOUT (Ch2)\", \"N/A - Do Not Use\")","v":"Efficiency vs. IOUT (Ch2)"},2,null,"DITHER Disabled",2,null,null,null,null,"Single Output – 2  Phases",2,null,"PFM",2,null,{"$f":"IF(MODE=1, \"AEF Gain\", \"N/A - Do Not Use\")","v":"AEF Gain"},2]
[null,null,null,null,null,null,null,null,null,null,"PLOT_TYPE",1,null,"DITHER Yes/No",1,"1 = Yes, 2 = No",null,null,null,"Single Output – 3  Phases",3,null,"FPWM/PFM",1,null,"BODE_PLOT_TYPE",1]
["Vout",{"$f":"'Design Regulator'!E9","v":50},"V","Output voltage - channel 1",null,null,null,null,null,null,null,null,null,null,null,null,null,null,null,"Single Output – 4  Phases",4]
["Iout",{"$f":"'Design Regulator'!E10","v":15},"A","Output current - channel 1",null,null,null,null,1,null,null,null,null,null,null,null,null,null,null,"Single/Dual Yes/No",1]
[null,null,null,null,null,null,null,null,1,null,"Adjustable",1,null,"3.3V",1,null,null,null,null,"MODE (Single/Dual), DUAL = 1, SINGLE = 2",{"$f":"IF(U12=1, 1, 2)","v":1},null,"VCCX Connected",1]
["Rout",{"$f":"Vout/Iout","v":3.3333333333333335},"W","Load resistance - Channel 1",null,null,null,null,null,null,"5V",2,null,"5V",2,null,null,null,null,"SINGLE OUTPUT (1 = YES)",{"$f":"IF(U12=1, 2, 1)","v":2},null,"No External VCC",2]
[null,null,null,null,null,null,null,null,null,null,"3.3V",3,null,"Adjustable",3,null,null,null,null,"Number of Phases",{"$f":"SCH_MODE","v":1},null,"Ext_VCC",1]
["Pout",{"$f":"Vout*Iout","v":750},"W","Output power",null,null,null,null,null,null,"12V",4,null,"Ch2 Output Setting",{"$f":"IF(Vout2=3.3, 1, IF(Vout2=5, 2, 3))","v":3}]
[null,null,null,null,null,null,null,null,null,null,"Output Voltage Setting",{"$f":"IF(Vout=3.3, 3, IF(Vout=5, 2,  IF(Vout=12,4,1)))","v":1}]
["Efficiency",0.9,null,"Estimate of efficiency"]
["Pin",{"$f":"Pout/Efficiency","v":833.33333333333326},"W","Calculate input power assuming finite efficiency",null,null,null,null,null,null,null,null,null,null,null,null,null,null,null,null,null,null,"2.2 MHz Fsw Setting",1,null,"Internal Compensation",1]
[null,null,null,null,null,null,null,null,null,null,null,null,null,null,null,null,null,null,null,null,null,null,"440 kHz Fsw Setting",2,null,"External Compensation",2]
["Iin_Vinmin",{"$f":"Pin/VIN_min","v":16.025641025641026},"A",null,null,null,null,null,null,null,null,{"$f":"Vout","v":50},null,null,null,null,null,null,null,null,null,null,"OSC",{"$f":"IF(Fsw>1000000,1,2)","v":2},null,"COMP_TYPE",2]
["Iin_Vinnom",{"$f":"Pin/VIN_nom","v":15.432098765432098},"A","Input currents at min, nom, max Vin",null,null,null,{"$f":"AND(OSC=1, OR(Fsw/1000>2530, Fsw/1000<1800))","v":false}]
["Iin_Vinmax",{"$f":"Pin/VIN_max","v":14.88095238095238},"A",null,null,null,null,{"$f":"AND(OSC=2, OR(Fsw/1000>500, Fsw/1000<300))","v":false}]
[null,null,null,null,null,null,null,{"$f":"OR(H22,H23)","v":false}]
["OSC setting",{"$f":"CHOOSE(OSC, 2200, 440)","v":440},"kHz",null,null,null,null,null,null,null,"SetVout_IntComp_nAEF",1,null,null,null,null,null,null,null,null,null,null,"No Input Filter",1,null,"UVLO Divider",1]
["Fsw",{"$f":"'Design Regulator'!E11*1000","v":450000},"Hz","Nominal switching frequency - determines RT resistor (SYNCIN must be 80-120% of this)",null,null,null,null,null,null,"SetVout_IntComp_AEF",2,null,null,null,null,null,null,null,null,null,null,"AEF Input Filter",2,null,"No UVLO Divider",2]
["RT resistor to AGND",{"$f":"((1000000000/Fsw)-53)/45+0.1","v":48.304938271604939},"kΩ",null,null,null,null,null,null,null,"SetVout_ExtComp_nAEF",3,null,null,null,null,null,null,null,null,null,null,"Passive LC Filter",3,null,"UVLO_TYPE",2]
[null,null,"kΩ",null,null,null,null,null,1,null,"SetVout_ExtComp_AEF",4,null,null,null,null,null,null,null,null,null,null,"INFILTER_TYPE",1]
["Tsw",{"$f":"1/Fsw","v":2.2222222222222221E-6},"sec","Switching period",null,null,null,null,null,null,"AdjVout_IntComp_nAEF",5]
["Vref",0.8,"V","Reference voltage",null,null,null,null,null,null,"AdjVout_IntComp_AEF",6]
["Rt",{"$f":"'Standard Value Calculator'!S12/1000","v":48.7},"kΩ","Frequency set resistor",null,{"$f":"IF(OR((Fsw=440000),(Fsw=2200000)),\"N/A\",Rfadj/1000)","v":4.87E-2},null,null,null,null,"AdjVout_ExtComp_nAEF",7]
[null,null,null,null,null,null,null,null,null,null,"AdjVout_ExtComp_AEF",8]
["Step 2: Buck Inductor","Channel 1",null,null,null,null,null,null,null,null,"Schematic setting",{"$f":"(IF(OR(Vout=3.3,Vout=5,Vout=12),CHOOSE(COMP_TYPE,IF(INFILTER_TYPE=1,1,2),IF(INFILTER_TYPE=1,3,4)),CHOOSE(COMP_TYPE,IF(INFILTER_TYPE=1,5,6),IF(INFILTER_TYPE=1,7,8))))","v":7}]
["Don1",{"$f":"Vout/VIN_nom","v":0.92592592592592593},null,null,null,"Ideal Duty Cycle at VIN(nom)"]
["Doff1",{"$f":"1-34:34","v":7.407407407407407E-2},null,null,null,"Ideal 1- Duty Cycle at VIN(nom)"]
[]
["D_Vinmin",{"$f":"Vout/VIN_min","v":0.96153846153846156}]
["D_Vinnom",{"$f":"Vout/VIN_nom","v":0.92592592592592593}]
["D_Vinmax",{"$f":"Vout/VIN_max","v":0.8928571428571429}]
[]
["L_Vinnom",{"$f":"(VIN_nom-Vout)*D1_Vinnom/(Fsw*(Iout/Number_of_Phases)*0.3)","v":1.8289894833104709E-6},"H",null,null,"Calculated inductance for 35% ripple at VIN(nom)"]
["L_slopecomp",{"$f":"1000*Vout*Rs/24/Fsw","v":1.388888888888889E-5},"H",null,null,"Calculated inductance based on one times inductor downslope"]
[]
["Lopt",{"$f":"B42","v":1.388888888888889E-5},"H",null,null,"Slope comp"]
[]
["Lo",{"$f":"'Design Regulator'!E27/1000000","v":1.0000000000000001E-5},"H",null,null,"Chosen inductance"]
["Rdcr",{"$f":"'Design Regulator'!E28/1000","v":7.0000000000000001E-3},"W",null,null,"Chosen inductor DCR"]
[]
["Don2",{"$f":"(Vout+Iout*(Rdcr+Rs))/(Vin+Iout*Rs)","v":0.92793042834674799}]
["Doff2",{"$f":"1-_Don2","v":7.2069571653252007E-2}]
[]
["D_Vinmin_2",{"$f":"CHOOSE(MODE, (Vout+Iout*(Rdcr+Rs))/(VIN_min+Iout*Rs), (Vout+Iout/Number_of_Phases*(Rdcr+Rs))/(VIN_min+Iout/Number_of_Phases*Rs))","v":0.96358920165241613},null,null,null,"Duty cycles adjusted for DCR/shunt voltage drops"]
["D_Vinnom_2",{"$f":"CHOOSE(MODE, (Vout+Iout*(Rdcr+Rs))/(VIN_nom+Iout*Rs), (Vout+Iout/Number_of_Phases*(Rdcr+Rs))/(VIN_nom+Iout/Number_of_Phases*Rs))","v":0.92793042834674799},null,null,null,"need to include RDS(on) later"]
["D_Vinmax_2",{"$f":"CHOOSE(MODE, (Vout+Iout*(Rdcr+Rs))/(VIN_max+Iout*Rs), (Vout+Iout/Number_of_Phases*(Rdcr+Rs))/(VIN_max+Iout/Number_of_Phases*Rs))","v":0.89481666517976621}]
[]
["Iripple_Vinmin",{"$f":"(VIN_min-Vout)*D1_Vinmin_2/(Fsw*Lf)","v":0.42826186740107386},"A"]
["Iripple_Vinnom",{"$f":"(VIN_nom-Vout)*D1_Vinnom_2/(Fsw*Lf)","v":0.82482704741933155},"A"]
["Iripple_Vinmax",{"$f":"(VIN_max-Vout)*D1_Vinmax_2/(Fsw*Lf)","v":1.193088886906355},"A"]
[]
["Ishunt_rms_Vinmin",{"$f":"SQRT((Iout/Number_of_Phases)^2+(Iripple_Vinmin^2)/12)","v":15.000509458645812},"A"]
["Ishunt_rms_Vinnom",{"$f":"SQRT((Iout/Number_of_Phases)^2+(Iripple_Vinnom^2)/12)","v":15.001889713349877},"A"]
["Ishunt_rms_Vinmax",{"$f":"SQRT((Iout/Number_of_Phases)^2+(Iripple_Vinmax^2)/12)","v":15.003953537573743},"A"]
["Max shunt power loss at full load",{"$f":"B61^2*Rs","v":0.67517008491453856},"W",null,null,"Note this is power loss at full load - not loss near OCP!"]
[]
["Max inductor ripple current",{"$f":"MAX(B56:B58)","v":1.193088886906355},"A",null,null,"Ripple current at Vin(max)"]
[]
[null,{"$f":"B56/(Iout/Number_of_Phases)","v":2.855079116007159E-2}]
["% ripple current",{"$f":"B57/(Iout/Number_of_Phases)","v":5.4988469827955438E-2}]
[null,{"$f":"B58/(Iout/Number_of_Phases)","v":7.9539259127090325E-2}]
[]
["Inductor copper temerature",100,"°C"]
["DCR at hot",{"$f":"Rdcr*(1+0.0039*(B71-25))","v":9.0475E-3},"W"]
[]
[]
["Step 3: Sense Resistors, Slope Comp, Current Limit"]
[]
["Ilimit_DC",{"$f":"'Design Regulator'!E16","v":20},"A",null,null,"Chosen OCP level - based on output current"]
[]
["Ilimit_inductor_Vinmin",{"$f":"CHOOSE(MODE, Ilimit_DC+Iripple_Vinmin/2, Ilimit_DC/Number_of_Phases+Iripple_Vinmin/2)","v":20.214130933700538},"A",null,null,"Peak inductor current at current limit inception"]
["Ilimit_inductor_Vinnom",{"$f":"CHOOSE(MODE, Ilimit_DC+Iripple_Vinnom/2, Ilimit_DC/Number_of_Phases+Iripple_Vinnom/2)","v":20.412413523709667},"A"]
["Ilimit_inductor_Vinmax",{"$f":"CHOOSE(MODE, Ilimit_DC+Iripple_Vinmax/2, Ilimit_DC/Number_of_Phases+Iripple_Vinmax/2)","v":20.596544443453176},"A"]
[]
[]
["CS threshold_min",5.1999999999999998E-2,"V"]
["CS threshold",0.06,"V"]
["CS threshold_max",6.8000000000000005E-2,"V"]
[]
["Shunt required to get OCP at VIN(min)",{"$f":"Buck_CS_threshold/B79","v":2.9682206074944022E-3},"W"]
["Shunt required to get OCP at VIN(nom)",{"$f":"Buck_CS_threshold/B80","v":2.9393878352654422E-3},"W"]
["Shunt required to get OCP at VIN(max)",{"$f":"Buck_CS_threshold/B81","v":2.9131100202136875E-3},"W"]
[]
["Rs_ideal",{"$f":"B89","v":2.9393878352654422E-3},"W",null,null,"Ideal Rs for the required OCP -- based on 73mV CL threshold"]
["Rs",{"$f":"'Design Regulator'!E18/1000","v":3.0000000000000001E-3},"W",null,null,"Selected (starndard value) current limit sense resistor"]
[]
["Current limit - peak",{"$f":"Buck_CS_threshold/Rs","v":20},"A",null,null,"Peak inductor current limit = min sat current"]
[]
["Iout_OCP_Vinmin",{"$f":"Number_of_Phases*(Buck_CS_threshold/Rs-Iripple_Vinmin/2)","v":19.785869066299462},"A",null,null,"Current limit setpoints (i.e. IOUT) after standard components are selected"]
["Iout_OCP_Vinnom",{"$f":"Number_of_Phases*(Buck_CS_threshold/Rs-Iripple_Vinnom/2)","v":19.587586476290333},"A"]
["Iout_OCP_Vinmax",{"$f":"Number_of_Phases*(Buck_CS_threshold/Rs-Iripple_Vinmax/2)","v":19.403455556546824},"A"]
[]
["Irms_OCP_Vinmin",{"$f":"SQRT((Iout_OCP_Vinmin/Number_of_Phases)^2+(Iripple_Vinmin^2)/12)","v":19.786255298253593},"A"]
["Irms_OCP_Vinnom",{"$f":"SQRT((Iout_OCP_Vinnom/Number_of_Phases)^2+(Iripple_Vinnom^2)/12)","v":19.589033639709356},"A"]
["Irms_OCP_Vinmax",{"$f":"SQRT((Iout_OCP_Vinmax/Number_of_Phases)^2+(Iripple_Vinmax^2)/12)","v":19.406512033143912},"A"]
[]
["Pshunt_Vinmin",{"$f":"B101^2*Rs","v":1.1744876961830051},"W",null,null,"Max power dissipations in shunt"]
["Pshunt_Vinnom",{"$f":"B102^2*Rs","v":1.1511907168129945},"W"]
["Pshunt_Vinmax",{"$f":"B103^2*Rs","v":1.1298381278776783},"W"]
[]
[]
["Step 4: Output Capacitor"]
["Icoutrms_VINmin",{"$f":"Iripple_Vinmin/SQRT(12)","v":0.12362855221383091},"A",null,null,"Output Cap RMS current"]
["Icoutrms_VINnom",{"$f":"Iripple_Vinnom/SQRT(12)","v":0.23810705893121767},"A"]
["Icoutrms_VINmax",{"$f":"Iripple_Vinmax/SQRT(12)","v":0.34441509501126755},"A"]
["Max Cout rms current",{"$f":"MAX(B111:B113)","v":0.34441509501126755},"A"]
[]
["Vripple1",{"$f":"'Design Regulator'!E32/1000","v":0.1},"V",null,null,"Output voltage ripple spec(pk-pk)"]
[]
["Output Ripple Spec (pk-pk)",{"$f":"Vo1_ripple*1000","v":100},"mV",null,null,"Vout ripple spec at Vin(nom)"]
[]
["Coutmin",{"$f":"Iripple_Vinnom/(Fsw*8*Vo1_ripple)","v":2.2911862428314764E-6},"F",null,null,"Minimum output capacitnace",null,{"$f":"Vo2_ripple","v":0},1]
["Reported Coutmin",{"$f":"IF(Cout_min*1000000<2, 2.2,Cout_min*1000000)","v":2.2911862428314764},"uF"]
["Cout",{"$f":"'Design Regulator'!E34/1000000","v":4.6999999999999999E-4},"F",null,null,"Chosen output capacitance",null,null,1]
["Resrmax",{"$f":"SQRT((Vo1_ripple/Iripple_Vinnom)^2-(1/(Fsw*Cout*8))^2)","v":0.12123609681652778},"W",null,null,"Max ESR before ripple exceeds Vripple1",null,null,1]
[]
["Reported Cout ESR max",{"$f":"IF(OR(CoutEsrMax>0.3, CoutEsrMax<0, (ISERROR(CoutEsrMax))), \"N/A\", CoutEsrMax*1000)","v":121.23609681652778},"mΩ"]
["CoutEsr",{"$f":"'Design Regulator'!E36/1000","v":0.01},"W",null,null,"Chosen ESR",null,null,1,null,{"$f":"ISERROR(CoutEsrMax)","v":false},{"$f":"ISERROR(B125)","v":false}]
["Vripple",{"$f":"Iripple_Vinnom*SQRT(Cout_ESR^2+(1/(8*Fsw*Cout))^2)","v":8.2626635438829352E-3},"Vp-p",null,null,null,null,null,null,null,null,{"$f":"OR(CoutEsrMax>0.3,CoutEsrMax<0)","v":false}]
[null,null,null,null,null,null,null,null,null,null,{"$f":"OR(TRUE, FALSE, TRUE)","v":true}]
["Step 5: Input Capacitor"]
[null,null,null,null,null,null,null,null,null,null,"Two channels operating at full load"]
["Icinrms_VINmin",{"$f":"SQRT(D1_Vinmin_2*(Iout^2*(1-D1_Vinmin_2)+Iripple_Vinmin^2/12))","v":2.8122703000651517},"A",{"$f":"D1_Vinmax","v":0.8928571428571429},null,"Calculate input cap rms current with one output unloaded",null,null,null,null,{"$f":"SQRT(Iout^2*D1_Vinmin*(1-D1_Vinmin)+Iout2^2*D2_Vinmin*(1-D2_Vinmin)-2*Iout*Iout2*D1_Vinmin*D2_Vinmin)","v":{"$error":"#NAME?"}},"A",{"$f":"SQRT(Iout^2*D1_Vinmin*(1-D1_Vinmin)+Iout2^2*D2_Vinmin*(1-D2_Vinmin)-2*Iout*Iout2*(0.5-D2_Vinmin*(1-D1_Vinmin)))","v":{"$error":"#NAME?"}},"A"]
["Icinrms_VINnom",{"$f":"SQRT(D1_Vinnom_2*(Iout^2*(1-D1_Vinnom_2)+Iripple_Vinnom^2/12))","v":3.8858213289559553},"A",{"$f":"D1_Vinmin","v":0.96153846153846156},null,null,null,null,null,null,{"$f":"SQRT(Iout^2*D1_Vinnom*(1-D1_Vinnom)+Iout2^2*D2_Vinnom*(1-D2_Vinnom)-2*Iout*Iout2*D1_Vinnom*D2_Vinnom)","v":{"$error":"#NAME?"}},"A"]
["Icinrms_VINmax",{"$f":"SQRT(D1_Vinmax_2*(Iout^2*(1-D1_Vinmax_2)+Iripple_Vinmax^2/12))","v":4.6133610228651483},"A",null,null,null,null,null,null,null,{"$f":"SQRT(Iout^2*D1_Vinmax*(1-D1_Vinmax)+Iout2^2*D2_Vinmax*(1-D2_Vinmax)-2*Iout*Iout2*D1_Vinmax*D2_Vinmax)","v":{"$error":"#NAME?"}},"A"]
["Icinrms - multiphase",{"$f":"Iout*SQRT((D1_Vinmin-F136/Number_of_Phases)*((F136+1)/Number_of_Phases-D1_Vinmin))","v":2.8846153846153837},"A",null,null,null,null,null,null,null,{"$f":"MAX(K131:K133)","v":{"$error":"#NAME?"}},"A"]
["Max Cin rms current",{"$f":"MAX(B131:B133)","v":4.6133610228651483},"A",null,null,{"$f":"Number_of_Phases*D1_Vinnom","v":0.92592592592592593},"N*D"]
[null,null,null,null,null,{"$f":"FLOOR(Number_of_Phases*D1_Vinnom,1)","v":0},"floor(N*D)"]
["Icinrms - multiphase - max",{"$f":"Iout/2/Number_of_Phases","v":7.5},"A"]
["Final result",{"$f":"IF(D1_Vinmin<0.5, B135, B137)","v":7.5},"A","…report this"]
[]
["Vinripple1",{"$f":"'Design Regulator'!E41/1000","v":0.3},"Vp-p",null,null,"Input voltage ripple spec (pk-pk)"]
[]
["Cinmin_Vinmin",{"$f":"Iout/Number_of_Phases*D1_Vinmin*(1-D1_Vinmin)/(Vinripple1*Fsw)","v":4.1091387245233372E-6},"F"]
["Cinmin_Vinnom",{"$f":"Iout/Number_of_Phases*D1_Vinnom*(1-D1_Vinnom)/(Vinripple1*Fsw)","v":7.6207895137936287E-6},"F"]
["Cinmin_Vinmax",{"$f":"Iout/Number_of_Phases*D1_Vinmax*(1-D1_Vinmax)/(Vinripple1*Fsw)","v":1.0629251700680268E-5},"F",null,null,"Calculate cap at Vinmax and 50% duty cycle (Vin = 2*Vout)"]
[]
["Cinmin_50%D",{"$f":"Iout*0.5*(1-0.5)/(Vinripple1*Fsw)","v":2.7777777777777779E-5},"F",null,null,"Buck 50% typically worst case"]
["Cinmin",{"$f":"IF(D1_Vinmin<0.5, B142,B146)","v":2.7777777777777779E-5},"F",{"$f":"(VIN_min+VIN_max)/2","v":54}]
["Reported Cinmin",{"$f":"IF(Cinmin*1000000<2.2, 2.2,Cinmin*1000000)","v":27.777777777777779},"uF",{"$f":"2*Vout","v":100},null,"…report this"]
[]
["Cin",{"$f":"'Design Regulator'!E43/1000000","v":4.6999999999999999E-4},"F",null,null,"Input capacitance"]
["CinEsrMax_Vinmax",{"$f":"-(Iout/Number_of_Phases*D1_Vinmax*(1-D1_Vinmax)/(Cin*Fsw)-Vinripple1)/(Iout/Number_of_Phases+Iripple_Vinmax/2)","v":1.8800021525150423E-2},"W"]
["CinEsrMax_50%D",{"$f":"-(Iout/Number_of_Phases*0.5*(1-0.5)/(Cin*Fsw)-Vinripple1)/(Iout/Number_of_Phases+Iripple_Vinmax/2)","v":1.8098207879924645E-2},"W",null,null,"Calculate ESR at Vinmax and 50% duty cycle (Vin = 2*Vout)"]
["CinEsrMax",{"$f":"IF(VIN_max<2*Vout, B151,B152)","v":1.8800021525150423E-2},"W"]
["Reported Cin ESR max",{"$f":"IF(OR(CinEsrMax>0.3, CinEsrMax<0), \"N/A\",CinEsrMax*1000)","v":18.800021525150424},"mΩ",null,null,"…report this"]
["RCinEsr",{"$f":"'Design Regulator'!E45/1000","v":0.01},"W",null,null,"Input capacitance series resistance (ESR)"]
[]
["Vinripple2_Vinmin",{"$f":"Iout/Number_of_Phases*D1_Vinmin_2*(1-D1_Vinmin_2)/(Cin*Fsw)+(Iout/Number_of_Phases +Iripple_Vinmin/2)*RCinEsr","v":0.15462961090518093},"Vp-p"]
["Vinripple2_Vinnom",{"$f":"Iout/Number_of_Phases*D1_Vinnom_2*(1-D1_Vinnom_2)/(Cin*Fsw)+(Iout/Number_of_Phases +Iripple_Vinnom/2)*RCinEsr","v":0.1588670819388675},"Vp-p"]
["Vinripple2_Vinmax",{"$f":"Iout/Number_of_Phases*D1_Vinmax_2*(1-D1_Vinmax_2)/(Cin*Fsw)+(Iout/Number_of_Phases +Iripple_Vinmax/2)*RCinEsr","v":0.16264060761866855},"Vp-p"]
["Vinripple2_50%D",{"$f":"Iout/Number_of_Phases*0.5*(1-0.5)/(Cin*Fsw)+(Iout/Number_of_Phases +Iripple_Vinmax/2)*RCinEsr","v":0.17369594088843249},"Vp-p",null,null,"Calculate ripple at Vinmax and 50% duty cycle (Vin = 2*Vout)"]
["Vinripple2",{"$f":"IF(D1_Vinmin<0.5, B157,B160)","v":0.17369594088843249},"Vp-p",null,null,"…report highest of these"]
[]
[null,{"$f":"Iout*D1_Vinmax_2*(1-D1_Vinmax_2)/(Cin*Fsw)","v":6.6751631841367653E-3},"Vp-p"]
[]
["Step 6a: Soft Start"]
["Tss",{"$f":"'Design Regulator'!E57/1000","v":0},"s","Soft-start time"]
["Iss",{"$f":"Cout*Vout/Tss","v":{"$error":"#DIV/0!"}},"A","Load cap current during soft start"]
["Css",{"$f":"0.000022*Tss/1.2","v":0},"F"]
["Css_u",{"$f":"'Standard Value Calculator'!B4","v":0},"F"]
[]
["Step 6b: Other Components - Dither, Hiccup, DEMB, MODE"]
["Tres",{"$f":"'Design Regulator'!E60/1000","v":4.4999999999999997E-3},"s","Hiccup time"]
["Cres",{"$f":"0.00002*Tres/1.2","v":7.4999999999999997E-8},"F"]
["Cres_u",{"$f":"'Standard Value Calculator'!G4","v":8.2000000000000006E-8},"F"]
[]
["RPG1/2",100,"kΩ"]
["RFB1/2",null,"W",null,"Tie to VDDA or AGND for 3.3V/5V output, respectively. "]
["R_MODE",null,"W",null,"Tie to VDDA or AGND for Single/Dual operation, respectively. "]
["R_DEMB",null,"W",null,"Tie to VDDA or AGND for FPWM/DEM, respectively. "]
[]
["Enable Hysteresis Current",1.0000000000000001E-5,"A",null,"10 µA Hysteresis Current"]
["Turn ON Voltage",{"$f":"'Design Regulator'!E59","v":5.5}]
["Hysteresis Voltage",{"$f":"'Design Regulator'!E59-'Design Regulator'!E60","v":1}]
[]
["Upper FB resistor",{"$f":"B183/B181","v":99999.999999999985},"W"]
["Lower FB resister",{"$f":"B185/(B182-1)","v":22222.222222222219},"W"]
["Standard upper FB resistor",{"$f":"'Standard Value Calculator'!S40","v":100},"kΩ"]
["Standard lower FB resistor",{"$f":"'Standard Value Calculator'!S41","v":22.1},"kΩ"]
[]
["Dither Modulation Frequency",{"$f":"'Design Regulator'!E63*1000","v":{"$error":"#VALUE!"}},"Hz"]
["Cdither_calculated",{"$f":"10*10^-6/Fdither/0.12","v":{"$error":"#VALUE!"}},"F"]
["Cdither_stdvalue",{"$f":"'Standard Value Calculator'!S21","v":{"$error":"#VALUE!"}},"F"]
[]
[]
["Step 7: Compensation"]
["Pi",3.1415926500000002,null,"p"]
["CS Amp Gain",10]
["Ri",{"$f":"Rs*CSAmp_gain","v":0.03},"W",null,null,"Current Sense effective resistance = shunt resistor Rs * CS amp gain"]
["gm",{"$f":"IF(COMP_TYPE=1,0.00003,0.0012)","v":1.1999999999999999E-3},"S",null,null,"Error Amp Transconductance"]
[]
["Se_ext",{"$f":"B205/Ri*1000","v":3409090.9090909092},"A/s",null,null,"Slope Comp Slope - referred to inductor current"]
["Sn",{"$f":"(Vin-Vout)/Lf","v":399999.99999999994},"A/s",null,null,"On-time Slope"]
["Sf",{"$f":"Vout/Lf","v":5000000},"A/s",null,null,"Off-time Slope"]
[]
["Se_int",{"$f":"Fsw*0.001*(5/22)","v":102.27272727272727},"mV/μs",null,null,"Slope Comp Slope - referred to IC"]
["Sn_int",{"$f":"Sn*Ri/1000","v":11.999999999999998},"mV/μs",null,null,"etc"]
["Sf_int",{"$f":"Sf*Ri/1000","v":150},"mV/μs",null,null,"etc"]
[]
["mc_buck",{"$f":"1+Se_ext/Sn","v":9.5227272727272734},null,null,null,"mc = 1 + Se/Sn for peak current-mode buck"]
["k_buck",{"$f":"mc_buck*(1-D1_Vinnom_2)","v":0.68629887551619528},null,null,null,"mc*(1-d)"]
[]
["mc",{"$f":"1+Se_ext/Sn","v":9.5227272727272734}]
["k",{"$f":"mc_buck*(1-D1_Vinnom_2)","v":0.68629887551619528}]
["Q",{"$f":"1/Pi/(k-0.5)","v":1.708598002352631},null,null,null,"1/(Pi*(k-0.5))",null,"Q = 2/Pi = 0.636 gives ideal one-cycle damping"]
[]
["Error Amp (EA)"]
["GBW",6,"MHz",null,null,"EA gain-bandwidth product"]
["Cbw",{"$f":"gm/(2*Pi*GBW*1000000)","v":3.1830988654751269E-11},"F",null,null,"EA effective bandwidth limiting capacitance = gm/(2*Pi*GBW)"]
["RoEA",64000000,"W",null,null,"EA output resistance"]
["AEA",{"$f":"gm*RoEA","v":76800},"V/V",null,null,"EA DC gain = gm*RoEA"]
["Afb",{"$f":"IF(VOUT_setting=1,Vref/Vout,SQRT((1+(Fcross*zterm1)^2)/((1+Afbr-pterm4*(Fcross)^2)^2+(Fcross*pterm3)^2)))","v":1.6E-2},"V/V",null,null,"Feedback gain from Vout to FB"]
["Acs",{"$f":"1/Ri","v":33.333333333333336},null,null,null,"Acs = 1/Ri"]
["Am_buck",{"$f":"(Ro/Number_of_Phases)/Ri/((1+Ro/Number_of_Phases*(k-0.5)/(Fsw*Lf)))","v":97.637251703123283}]
["Am",{"$f":"(Ro*Number_of_Phases)/Ri/((1+Ro*Number_of_Phases*(k-0.5)/(Fsw*Lf)))","v":97.637251703123283},null,null,null,"Buck modulator gain"]
[]
["Scaling factor to calculate Rcomp - buck",{"$f":"2*Pi*Ri/gm","v":157.07963250000003},null,null,null,"2*Pi*Ri/gm -- scaling factor to calculate Rcomp given desired buck crossover frequency"]
["DC Gain is Adc = AEA*Afb*Am"]
[]
["Ro",{"$f":"Rout","v":3.3333333333333335},"W",null,null,"Output Resistance"]
[]
["Fp_load_buck",{"$f":"1/(2*Pi*Ro*Cout)+(k-0.5)/(2*Pi*Fsw*Lf*Cout/Number_of_Phases)","v":115.60735715570485},"Hz",null,null,"Buck dominant pole frequency -- note slope comp influence"]
["Fp_dominant",{"$f":"Fload_u","v":115.60735715570485},"Hz"]
[null,{"$f":"Cbw","v":3.1830988654751269E-11}]
["Fp_EA",{"$f":"1/(2*Pi*(RoEA+Rcea1_u)*Cc1ea_u)","v":16.517473654721982},"Hz",null,null,"Error Amp LF pole -- related to amplifier ouptut resistance and comp cap"]
["Fp_HF",{"$f":"1/(2*Pi*Rcea1_u*(Cc2ea_u+Cbw))","v":21097.046413502114},"Hz",null,null,"Error Amp HF pole cancels zero related to Output Cap ESR"]
["Fesr",{"$f":"1/(2*Pi*Cout*Cout_ESR)","v":33862.753888033272},"Hz",null,null,"Cout ESR zero frequency"]
["F_mod",{"$f":"Fsw/2","v":225000},"Hz",null,null,"Zero-order sample-and-hold effects of current-mode control modeled as pole at Fsw/2"]
[null,null,null,"Internal Comp Crossover"]
["Desired Crossover Frequency",{"$f":"CHOOSE(COMP_TYPE,Fcross_Ch2,'Design Regulator'!E69*1000)","v":48000},"Hz",{"$f":"Fsw/50","v":9000}]
["Rcea1",{"$f":"Fcross*Cout/Number_of_Phases*2*Pi*Ri/(gm*Afb)","v":221482.28182499998},"W",null,null,"This component will largely determine the crossover frequency",null,null,null,null,{"$f":"Fcross/Fp_dominant/(gm*Afb*Am)","v":221482.28182500001}]
["Cc1ea, Cc3ea",{"$f":"10/(Rcea1*Fcross*2*Pi)","v":1.4970624094841972E-10},"F",null,null,"This along with Rcea1 will set a zero at Fcrossover/5 to optimize phase margin"]
["Cc2ea, Cc4ea",{"$f":"MAX(1/(Rcea1*2*Pi*Fesr)-Cbw, 1/(Rcea1*2*Pi*(Fsw/2))-Cbw)","v":-1.0610329551583748E-11},"F",null,null,"This along with Rcea1 places a pole at the output cap ESR zero"]
[]
[{"$f":"CHOOSE(COMP_TYPE,\"Internal Compensation\",\"External Compensation\")","v":"External Compensation"}]
["Chosen Compensation Components from the standard value sheet",null,null,"Internal Values"]
["Rcea1_u",{"$f":"CHOOSE(COMP_TYPE,D246,'Design Regulator'!D76*1000)","v":237000},"W",400000,null,null,{"$f":"1/(Rcea1*2*Pi*(Fsw/2))-Cbw","v":-2.8637255514518315E-11}]
["Cc1ea_u",{"$f":"CHOOSE(COMP_TYPE,Cc3ea_u,'Design Regulator'!D77*0.000000001)","v":1.5E-10},"F",{"$f":"50*0.000000000001","v":5.0000000000000002E-11}]
["Cc2ea_u",{"$f":"CHOOSE(COMP_TYPE,Cc4ea_u,'Design Regulator'!D78*0.000000000001)","v":0},"F",{"$f":"0.000000000001","v":9.9999999999999998E-13}]
[]
["Resulting Pole/Zero Locations",null,null,null,null,{"$f":"Cout","v":4.6999999999999999E-4},{"$f":"Cout_ESR","v":0.01}]
["Fz1",{"$f":"1/(2*Pi*Rcea1_u*Cc1ea_u)","v":4476.9323002463125},"Hz",null,null,"This zero is set at or close to the dominant load pole"]
["Fp2",{"$f":"1/(2*Pi*Rcea1_u*(Cc1ea_u*(Cc2ea_u+Cbw)/(Cc1ea_u+Cc2ea_u+Cbw)))","v":25573.978713748424},"Hz",null,null,"This pole cancels the zero from the Output Cap ESR"]
[null,null,null,"Internal Values"]
["Rfb1",{"$f":"IF(VOUT_setting=1,'Design Regulator'!E71*1000,2500000)","v":100000},"W",null,null,"Upper Feedback Resistance - chosen by user"]
["Rfb2",{"$f":"IF(Vout=Vref,100000000,Vref*B254/((Vout-Vref)))","v":1626.0162601626016},"W",null,null,"Lower Feedback Resistance"]
["Rfb2_u",{"$f":"IF(Vout=Vref,\"N/A\",CHOOSE(VOUT_setting,'Standard Value Calculator'!S11,471000,792000,177000))","v":1620},"W",null,null,"Std Value Lower Feedback Resistance"]
[]
["Rff",20000,"W"]
["Cff",3.67E-13,"F"]
["Cfb",2.1999999999999999E-12,"F"]
[]
["wff",{"$f":"1/(2*Pi*Rff*Cff)","v":21683234.778440922},"Hz"]
["wfbt",{"$f":"1/(2*Pi*Rfb1_*Cfb)","v":723431.56033525639},"Hz"]
["wfbb",{"$f":"1/(2*Pi*Rfb2_u*Cfb)","v":44656269.156497292},"Hz"]
["w1",{"$f":"1/(2*Pi*Rff*Cfb)","v":3617157.8016762817},"Hz"]
["wfft",{"$f":"1/(2*Pi*Cff*Rfb1_)","v":4336646.9556881851},"Hz"]
["Cfb*(Rff+RFBT)/(Rff*RFBT))",{"$f":"2*Pi*Cfb*(Rff+Rfb1_)/(Rff*Rfb1_)","v":8.2938045959999999E-16},"Hz"]
[]
[]
[]
[]
["Other Input Variables"]
["Rfets",0,"W","Series resistance due to FETs"]
["Diode loss eq res",{"$f":"0.00000002*Fsw*0.6*4/Iripple1","v":{"$error":"#NAME?"}}]
["Fet loss eq res",{"$f":"_Don2*RdsonTop+Doff2*RdsonBot","v":{"$error":"#NAME?"}}]
["cap loss eq res",{"$f":"B277*Vin^2*Fsw/2/(((Iripple1/SQRT(3))^2))","v":{"$error":"#NAME?"}}]
["Sw cap",5.0000000000000001E-9]
[]
["Step 8: AEF"]
[]
["VinRipple_dBuV",{"$f":"20*LOG10(Vinripple2*1000000)","v":104.79579339020241},"dBuV"]
["CISPR 25 limit",{"$f":"CHOOSE(OSC,35,50)","v":50},"dBuV","Chooses CISPR conducted limit 35 at 2.1MHz and 50 at 440kHz"]
["Attenuation required",{"$f":"VinRipple_dBuV-B282+3","v":57.795793390202405},"dBuV","Margin of attenuation req"]
["Filter Frequency Required",{"$f":"Fsw/(POWER(10,Attn_req/40))","v":16155.39864629311},"Hz","assume 40db/decade drop and set frequency based on attenuation"]
[]
["Lfilter",{"$f":"'Design Regulator'!E48","v":0.68},"uH","user input"]
[]
["Gop_AEF",{"$f":"CHOOSE(OSC,20,100)","v":100}]
["n",2,null,null,null,"n should be 2 or 3"]
[]
["Passive Cf",{"$f":"1000000/(LinfilterPssv*POWER(2*Pi*Fx_infilter,2))","v":142.723666350439},"uF",{"$f":"'Design Input Filter'!G9*0.000001","v":6.8E-8}]
["Cinj_AEF",{"$f":"1000000/(L_infilter*Gop_AEF*0.000001*POWER(2*Pi*Fx_infilter,2))","v":1.4272366635043903},"uF",{"$f":"'Design Regulator'!E49*0.000001","v":4.6999999999999995E-7}]
[]
["Cdamp_AEF",{"$f":"CHOOSE(OSC,0,Cinj_AEF/nAEF)","v":0.71361833175219513},"uF",{"$f":"'Design Regulator'!E50*0.000001","v":0}]
["Rdamp_AEF",{"$f":"CHOOSE(OSC,SQRT(L_infilter*0.00001*Gop_AEF/(CinjSel)),1.09*SQRT(L_infilter*0.00001*Gop_AEF/CinjSel))","v":41.460260388586107},"Ω",{"$f":"'Design Regulator'!E51","v":6.81}]
["Ccomp_AEF",{"$f":"CHOOSE(OSC,5,1)","v":1},"nF",{"$f":"B296*0.000000001","v":1.0000000000000001E-9},null,"AEF Comp network & sense is specifically defined at 2.2MHz at 440kHz"]
["Rcomp_AEF",{"$f":"CHOOSE(OSC,200,1000)","v":1000},"Ω"]
["Csen_AEF",{"$f":"Gop_AEF*B296","v":100},"nF",{"$f":"B298*0.000000001","v":1.0000000000000001E-7}]
[]
["Rd_AEF",{"$f":"SQRT(L_infilter*0.000001/Cin)","v":3.8036936136317527E-2},null,{"$f":"'Standard Value Calculator'!S14","v":3.8300000000000001E-2}]
[]
["Attenuation at Fsw",{"$f":"'Input Filter Calculations'!W97","v":0},"dBuV"]
["Conducted EMC at Fsw",{"$f":"VinRipple_dBuV+B302","v":104.79579339020241},"dBuV"]
[]
[]
["Step 8: Efficiency"]
["VAR",0]
["Design"]
["Ta",{"$f":"'Design Regulator'!E13","v":25},"°C","Ambient Temperature"]
["Components"]
["LTc",{"$f":"4000/1000000","v":4.0000000000000001E-3},"%/°C","Inductor DCR Temp Co"]
["θCA",20,"°C/W","Inductor Core to Ambient Thermal Resistance"]
["RCinEsr",{"$f":"RCinEsr","v":0.01},"W","Input Capacitor ESR"]
[]
["Controller Characteristics"]
["VCC",5,"V","with 170mA current limit"]
["Top Driver"]
["RdsonDRT",1,"W","Drain-Source Resistance of Pullup High-side FET Driver"]
["RdsonDRT2",0.5,"W","Drain-Source Resistance of Pulldown High-side FET Driver"]
["Bottom Driver"]
["RdsonDRB",1,"W","Drain-Source Resistance of Pullup Low-side FET Driver"]
["RdsonDRB2",0.5,"W","Drain-Source Resistance of Pulldown Low-side FET Driver"]
["Deadtime"]
["Deadtime",1.4E-8,"s","Total Deadtime",null,null,"14ns for LM513-Q1"]
["IQ"]
["IQ ",2.2000000000000001E-6,"A","Quiescent Current of LM5143-Q1 Controller (One channel disabled)"]
[]
["High- & low-side MOSFETs - Ch1","Q1: high-side",null,"Q2: low-side"]
["Rdson",{"$f":"'Design Regulator'!E87/1000","v":7.4999999999999997E-3},"W",{"$f":"'Design Regulator'!F87/1000","v":7.4999999999999997E-3},"W","Drain-Source Resistances of Channel 1 FETs"]
["RdsonTopTc",{"$f":"4000/1000000","v":4.0000000000000001E-3},"%/°C",4.0000000000000001E-3,"%/°C","Drain-Source Resistance Temp Co"]
["Qg",{"$f":"'Design Regulator'!E88/1000000000","v":1.0999999999999999E-8},"C",{"$f":"'Design Regulator'!F88/1000000000","v":1.0999999999999999E-8},"C","Gate Charge at VCC = 5V"]
["Qgd",{"$f":"'Design Regulator'!E89/1000000000","v":3.9000000000000002E-9},"C",{"$f":"'Design Regulator'!F89/1000000000","v":3.9000000000000002E-9},"C","Gate to Drain Charge"]
["Qgs",{"$f":"'Design Regulator'!E90/1000000000","v":4.2999999999999996E-9},"C",{"$f":"'Design Regulator'!F90/1000000000","v":4.2999999999999996E-9},"C","Gate to Source Charge"]
["Qoss",{"$f":"'Design Regulator'!E91/1000000000","v":0},"C",{"$f":"'Design Regulator'!F91/1000000000","v":2.3000000000000001E-8},"C","Output Charge"]
["Coss",{"$f":"'Design Regulator'!E92/1000000000000","v":2.1999999999999999E-10},"F",{"$f":"'Design Regulator'!F92/1000000000000","v":2.1999999999999999E-10},"F","Output Capacitance"]
["Rgate",{"$f":"'Design Regulator'!E93","v":1.5},"W",{"$f":"'Design Regulator'!F93","v":1.5},"W","Gate Resistance"]
["Gfs",{"$f":"'Design Regulator'!E94","v":47},"S",{"$f":"'Design Regulator'!F94","v":47},"S","Transconductance"]
["Vth",{"$f":"'Design Regulator'!E95","v":1.6},"V",{"$f":"'Design Regulator'!F95","v":1.6},"V","Threshold Voltage"]
["Vsp",{"$f":"Vth_Q1+(Iout/Number_of_Phases)/Gfs_Q1","v":1.9191489361702128},"V",{"$f":"Vth_Q2+(Iout/Number_of_Phases)/Gfs_Q2","v":1.9191489361702128},"V","Switch Point Voltage of FETs"]
[]
["Vsd - Buck",{"$f":"'Design Regulator'!E96","v":0.8},"V",{"$f":"'Design Regulator'!F96","v":0.8},"V","Diode Forward Voltage of MOSFET Body diode"]
["QrrTop",null,"C",{"$f":"'Design Regulator'!F97/1000000000","v":2E-8},"C","Reverse Recovery Charge of Body Diode"]
["TrrTop",4.0000000000000001E-8,"s",4.0000000000000001E-8,"s","Reverse Recovery Time of Body Diode"]
["θJA-MOSFET",{"$f":"'Design Regulator'!E98","v":50},"°C/W",{"$f":"'Design Regulator'!F98","v":50},"°C/W","Junction-to-Ambient Resistance"]
[]
[]
[]
["Anti-parallel Schottky Diode (optional)"]
["VfdSky",{"$f":"'Design Regulator'!F101","v":0},"V",{"$f":"'Design Regulator'!#REF!","v":{"$error":"#REF!"}},"V","Diode Forward Voltage"]
["QrrSky",{"$f":"'Design Regulator'!F102/1000000000","v":0},"C",{"$f":"'Design Regulator'!#REF!/1000000000","v":{"$error":"#REF!"}},"C","Diode Reverse Recovery Charge"]
["Ireverse",0,"A",0,"A","Reverse Leakage Current"]
[]
["Controller"]
["θJACtrl",34.1,"°C/W",null,null,"Junction-to-ambient thermal resistance of controller"]
["Outputs"]
["Top FET"]
["Tr",{"$f":"(Qgd_Q1+Qgs_Q1/2)*(RdsonDRT+Rgate1)/(VCC-Vsp_Q1)","v":4.9093577348066296E-9},"s"]
["Tf",{"$f":"(Qgd_Q1+Qgs_Q1/2)*(RdsonDRT2+Rgate1)/(Vsp_Q1)","v":6.3048780487804877E-9},"s"]
[]
["IC Power Disipation","Value","Units"]
["Power Dis",{"$f":"CHOOSE(Ext_VCC, (Qg_Q1+Qg_Q2)*Fsw*VCC, (Qg_Q1+Qg_Q2)*Fsw*Vin)","v":4.9499999999999995E-2},"W"]
["Temp rise",{"$f":"B361*ThetaJaCtrl","v":1.6879499999999998},"°C"]
["Junction temperature",{"$f":"B362 + Ta","v":26.687950000000001},"°C"]
[]
["Current (switching)",{"$f":"(Qg_Q1+Qg_Q2)*Fsw+Iq","v":9.9021999999999999E-3},"A"]
["Qrr Current",{"$f":"Qrr_Q2*Fsw","v":9.0000000000000011E-3},"A"]
["Diode Current",{"$f":"C367/Vin","v":{"$error":"#NAME?"}},{"$f":"Deadtime*Fsw*(Ipp/2)*(Vsd_Q1+Vsd_Q2)","v":{"$error":"#NAME?"}}]
["Total Application Switching IQ",{"$f":"SUM(B365:B367)","v":{"$error":"#NAME?"}},"A"]
[]
["Low-side MOSFET/Diode"]
["Part Power"]
["Power Dis"]
[]
["SCHEMATIC LABELS"]
[{"$f":"\"RC1 = \"&'Design Regulator'!D76&\"kΩ\"","v":"RC1 = 237kΩ"},{"$f":"'Design Regulator'!D76&\"kΩ\"","v":"237kΩ"},null,{"$f":"'Design Regulator'!D79&\"kΩ\"","v":"kΩ"}]
[{"$f":"\"RC2 = \"&'Design Regulator'!D79&\"kΩ\"","v":"RC2 = kΩ"},{"$f":"'Design Regulator'!D79&\"kΩ\"","v":"kΩ"}]
[]
[{"$f":"\"Lo = \"&'Design Regulator'!E27&\"µH\"","v":"Lo = 10µH"},{"$f":"'Design Regulator'!E27&\"µH\"","v":"10µH"},null,{"$f":"IF(MODE = 1, 'Design Regulator'!I27&\"µH\", 'Design Regulator'!E27&\"µH\")","v":"µH"}]
[{"$f":"\"Rdcr = \"&Rdcr*1000&\"mΩ\"","v":"Rdcr = 7mΩ"},{"$f":"Rdcr*1000&\"mΩ\"","v":"7mΩ"},null,{"$f":"IF(MODE=1, Rdcr2*1000&\"mΩ\", Rdcr*1000&\"mΩ\")","v":"0mΩ"}]
[{"$f":"\"Rs = \"&'Design Regulator'!E18&\"mΩ\"","v":"Rs = 3mΩ"},{"$f":"'Design Regulator'!E18&\"mΩ\"","v":"3mΩ"},null,{"$f":"IF(MODE = 1, 'Design Regulator'!I18&\"mΩ\", 'Design Regulator'!E18&\"mΩ\")","v":"mΩ"}]
[]
["IC",{"$f":"IF(VIN_max>42,\"LM5149(-Q1)\",\"LM25149(-Q1)\")","v":"LM5149(-Q1)"}]
[]
[{"$f":"IF((INFILTER_TYPE=1),\"AEF IS DISABLED!\",\"AEF\")","v":"AEF IS DISABLED!"},{"$f":"IF((INFILTER_TYPE=1),\"\",\"0.1µF\")","v":""},{"$f":"IF((INFILTER_TYPE=1),\"\",\"0.47Ω\")","v":""},{"$f":"IF((INFILTER_TYPE=1),\"\",\"3Ω\")","v":""},{"$f":"IF((INFILTER_TYPE=1),\"\",\"50kΩ\")","v":""},{"$f":"IF((INFILTER_TYPE=1),\"\",\"2.2µF\")","v":""}]
[{"$f":"\"LAEF =\"&L_infilter&\" uF\"","v":"LAEF =0,68 uF"},{"$f":"IF((INFILTER_TYPE=1),\"\",L_infilter&\"µH\")","v":""}]
[{"$f":"\"Cinj =\"&CinjSel*1000000&\" uF\"","v":"Cinj =0,47 uF"},{"$f":"IF((INFILTER_TYPE=1),\"\",CinjSel*1000000&\"µF\")","v":""}]
[{"$f":"\"Cdamp =\"&CdampSel*1000000&\" uF\"","v":"Cdamp =0 uF"},{"$f":"IF((INFILTER_TYPE=1),\"\",IF(OSC=1,\"DNP\",CdampSel*1000000&\"µF\"))","v":""}]
[{"$f":"\"Rdamp =\"&RdampSel&\"Ω\"","v":"Rdamp =6,81Ω"},{"$f":"IF((INFILTER_TYPE=1),\"\",RdampSel&\"Ω\")","v":""}]
[{"$f":"\"Rcomp =\"&Rcomp_AEF&\"Ω\"","v":"Rcomp =1000Ω"},{"$f":"IF((INFILTER_TYPE=1),\"\",Rcomp_AEF&\"Ω\")","v":""}]
[{"$f":"\"Ccomp =\"&Ccomp_AEF*1000000000000&\"pF\"","v":"Ccomp =1000pF"},{"$f":"IF((INFILTER_TYPE=1),\"\",Ccomp_AEF*1000000000000&\"pF\")","v":""}]
[{"$f":"\"Csen =\"&Csen_AEF*1000000&\"µF\"","v":"Csen =0,1µF"},{"$f":"IF((INFILTER_TYPE=1),\"\",Csen_AEF*1000000&\"µF\")","v":""}]
[null,"CDAMP"]
[]
[{"$f":"\"VOUT = \"&'Design Regulator'!E9&\"V\"","v":"VOUT = 50V"},{"$f":"'Design Regulator'!E9&\"V\"","v":"50V"},null,{"$f":"IF(MODE=1, 'Design Regulator'!I10&\"V\", \"\")","v":"V"}]
[]
[{"$f":"\"COUT = \"&'Design Regulator'!$E$34&\"µF\"","v":"COUT = 470µF"},{"$f":"ROUND('Design Regulator'!$E$34/Number_of_Phases, 0)&\"µF\"","v":"470µF"},null,{"$f":"IF(MODE=1, 'Design Regulator'!$I$34&\"µF\", ROUND('Design Regulator'!$E$34/Number_of_Phases, 0)&\"µF\")","v":"µF"}]
["Capacitance per component (Cout)",{"$f":"\"22µF\"","v":"22µF"}]
["# of output caps",{"$f":"ROUNDUP(Cout*1000000/22,0)&\" x\"","v":"22 x"}]
[]
["CIN",{"$f":"Cin*1000000&\"µF\"","v":"470µF"}]
["Capacitance per component (Cin)",{"$f":"\"10µF\"","v":"10µF"}]
["# of input caps",{"$f":"ROUNDUP(Cin*1000000/10,0)&\" x\"","v":"47 x"}]
["Cd",{"$f":"CHOOSE(INFILTER_TYPE,\"\",4*Cin*1000000&\"µF\")","v":""}]
["Rd",{"$f":"CHOOSE(INFILTER_TYPE,\"\",D300&\"Ω\")","v":""}]
[]
[{"$f":"\"RC1 = \"&Rcea1_u/1000&\"kΩ\"","v":"RC1 = 237kΩ"},{"$f":"IF(COMP_TYPE=1,\"100kΩ\",ROUND(Rcea1_u/1000,2)&\"kΩ\")","v":"237kΩ"}]
[{"$f":"\"CC1 = \"&Cc1ea_u*10^9&\"nF\"","v":"CC1 = 0,15nF"},{"$f":"IF(COMP_TYPE=1,\"\",Cc1ea_u*10^9&\"nF\")","v":"0,15nF"}]
[{"$f":"\"CC2 = \"&IF(Cc2ea_u>0, Cc2ea_u*10^12&\"pF\", \"OPEN\")","v":"CC2 = OPEN"},{"$f":"IF(COMP_TYPE=1,\"\",IF(Cc2ea_u>0, ROUND(Cc2ea_u*10^12,1)&\"pF\", \"N/A\"))","v":"N/A"}]
[]
[{"$f":"\"gm = \"&$B$199*1000&\"mS\"","v":"gm = 1,2mS"},{"$f":"$B$199*1000&\"mS\"","v":"1,2mS"}]
[{"$f":"\"RoEA = \"&RoEA/1000000&\"MΩ\"","v":"RoEA = 64MΩ"},{"$f":"RoEA/1000000&\"MΩ\"","v":"64MΩ"}]
[{"$f":"\"GBW = \"&GBW&\"MHz\"","v":"GBW = 6MHz"},{"$f":"GBW&\"MHz\"","v":"6MHz"}]
[]
[{"$f":"\"Cslope = \"&Cslope&\"pF\"","v":{"$error":"#NAME?"}},{"$f":"ROUND(Cslope*1,0)&\"pF\"","v":{"$error":"#NAME?"}}]
["Cd",{"$f":"IF(DITHER=1, ROUND(Cdither*1000000000,1)&\"nF\", \"\")","v":{"$error":"#VALUE!"}},{"$f":"IF(DITHER=1, \"Cd\", \"\")","v":"Cd"}]
[{"$f":"\"RFB1 = \"&'Design Regulator'!E71&\"kΩ\"","v":"RFB1 = 100kΩ"},{"$f":"IF(VOUT_setting=1, 'Design Regulator'!E71&\"kΩ\", \"\")","v":"100kΩ"},null,{"$f":"'Design Regulator'!I71&\"kΩ\"","v":"kΩ"}]
[{"$f":"\"RFB2 = \"&IF(Vout=Vref,\"OPEN\",'Design Regulator'!E72&\"kΩ\")","v":"RFB2 = 1,62kΩ"},{"$f":"IF(VOUT_setting=1, IF(Vout=Vref,\"OPEN\",Rfb2_u/1000&\"kΩ\"), \"\")","v":"1,62kΩ"},null,{"$f":"IF(Vout2=Vref,\"OPEN\",Rfb4_u/1000&\"kΩ\")","v":"0kΩ"}]
[{"$f":"\"RFBSET = \"&CHOOSE(VOUT_setting,\"\",\"24.9kΩ\",\"0Ω\",\"48.7kΩ\")","v":"RFBSET = "},null,null,{"$f":"CHOOSE(VOUT_setting,\"\",\"24.9kΩ\",\"0Ω\",\"48.7kΩ\")","v":""}]
[]
["RENT",{"$f":"IF((UVLO_TYPE=1),B187&\"kΩ\",\"0Ω\")","v":"0Ω"}]
["RENB",{"$f":"IF((UVLO_TYPE=1),B188&\"kΩ\",\"\")","v":""}]
[]
[{"$f":"CHOOSE(BODE_PLOT_TYPE, \"Crossover Frequency = \"&ROUND('Stability Calculations'!U4,1)&\" kHz\",  \"Fsw Attenuation = \"&ROUND('Input Filter Calculations'!W97,1)&\" dB\")","v":"Crossover Frequency = 38,2 kHz"},{"$f":"CHOOSE(BODE_PLOT_TYPE, ROUND('Stability Calculations'!U4,1)&\" kHz\", ROUND(#REF!,1)&\" kHz\")","v":"38,2 kHz"},null,{"$f":"'Stability Calculations'!U4","v":38.240499999999997}]
[{"$f":"CHOOSE(BODE_PLOT_TYPE, \"Phase Margin = \"&ROUND('Stability Calculations'!U5,0)&\"°\", \"°\")","v":"Phase Margin = 65°"},{"$f":"CHOOSE(BODE_PLOT_TYPE, ROUND('Stability Calculations'!U5,0)&\"°\", ROUND(#REF!,0)&\"°\")","v":"65°"}]
[{"$f":"IF(loopPM<45,CHOOSE(COMP_TYPE,\"Phase Margin too low, Increase COUT\",\"Phase Margin too low, Re-compensate\"),\"\")","v":""}]
[]
["Full-load/high line efficiency",{"$f":"IF(PLOT_TYPE=1, ROUND('Efficiency Calculations'!AZ109,1)&\"%\", ROUND(#REF!,1)&\"%\")","v":"98,7%"}]
["Half-load/mid-line efficiency",{"$f":"IF(PLOT_TYPE=1, ROUND('Efficiency Calculations'!AZ59,1)&\"%\", ROUND(#REF!,1)&\"%\")","v":"99,1%"}]
["OSC pin setting",{"$f":"IF(VOUT_setting=1, \"\", IF(OSC=1, \"Tie OSC to VDDA\", \"Tie OSC to AGND\"))","v":""}]
[]
[{"$f":"\"CDITH = \"&Cdither*1000000000&\"nF\"","v":{"$error":"#VALUE!"}},{"$f":"Cdither*1000000000&\"nF\"","v":{"$error":"#VALUE!"}}]
[{"$f":"\"Rs = \"&Rs&\"Ω\"","v":"Rs = 0,003Ω"},{"$f":"'Standard Value Calculator'!S6&\"Ω\"","v":"Ω"}]
["Rset",{"$f":"'Standard Value Calculator'!S16&\"mΩ\"","v":"2,94mΩ"}]
["Rs",{"$f":"'Standard Value Calculator'!S6&\"mΩ\"","v":"mΩ"}]
[{"$f":"\"Rshunt = \"&ROUND(Rshunt,1)&\"mΩ\"","v":{"$error":"#NAME?"}},{"$f":"IF(Rshunt=\"0\", \"N/A\",ROUND(Rshunt,1)&\"mΩ\")","v":{"$error":"#NAME?"}}]
[]
["Rpgood","20kΩ"]
["RDAMP"]
[]
["VCCX",{"$f":"IF((Ext_VCC=1),\"5V\",\"GND\")","v":"5V"}]
["RCNFG",{"$f":" 'Design Regulator'!E63&\"kΩ\"","v":"41.2kΩ"}]
["Rt",{"$f":" Rfadj&\"kΩ\"","v":"48,7kΩ"},{"$f":"Rfadj","v":48.7},{"$f":"Fsw","v":450000},null,{"$f":"OR((Fsw=440000),(Fsw=2200000))","v":false},null,{"$f":"OR(OR(AND(OSC=1, OR(Fsw/1000>2530, Fsw/1000<1800)), AND(OSC=2, OR(Fsw/1000>500, Fsw/1000<300))), OR((Fsw=440000),(Fsw=2200000)))","v":false}]
["Css",{"$f":"'Standard Value Calculator'!B4*1000000000&\"nF\"","v":"0nF"},{"$f":"IF(MODE=1,\"Css\",\"\")","v":"Css"}]
["Cres",{"$f":"IF(Cres_u = 0, \"N/A\", Cres_u*1000000000 &\"nF\")","v":"82nF"},{"$f":"IF(Cres_u = 0, \"N/A\", Cres_u*1000000 &\"µF\")","v":"0,082µF"},{"$f":"Cres_u","v":8.2000000000000006E-8}]
[]
["Blank out",{"$f":"IF(B76=\"y\",\"\",\"|\")","v":"|"}]
["OUTPUT CURRENT",{"$f":"'Design Regulator'!$E$10&\"A\"","v":"15A"},null,{"$f":"IF(MODE=1,'Design Regulator'!#REF!&\"A\",\"\")","v":{"$error":"#REF!"}}]
["VIN",{"$f":"VIN_nom&\"V\"","v":"54V"}]
["VIN range",{"$f":"VIN_min&\"V\"&\"...\"&VIN_max&\"V\"","v":"52V...56V"}]
[null,{"$f":"IF(INFILTER_TYPE=1,B449,\"\")","v":"52V...56V"},{"$f":"IF(INFILTER_TYPE=1,\"\",B449)","v":""}]

{"sheet":"Schematic Management","index":6,"n_rows":17,"n_cols":14,"rows_kept":17,"cut":false,"hidden":true,"merged":[]}
[null,null,null,null,null,null,null,null,null,null,null,null,null,"3.3V or 5V fixed (FB1/2)"]
[{"$f":"IF(MODE=1, CHOOSE(SCH_SETTING, \"SCH_SetVout_IntComp_nAEF\",\"SCH_SetVout_IntComp_AEF\",\"SCH_SetVout_ExtComp_nAEF\",\"SCH_SetVout_ExtComp_AEF\",\"SCH_AdjVout_IntComp_nAEF\",\"SCH_AdjVout_IntComp_AEF\",\"SCH_AdjVout_ExtComp_nAEF\",\"SCH_AdjVout_ExtComp_AEF\"))","v":"SCH_AdjVout_ExtComp_nAEF"},null,null,null,null,null,null,null,null,"With/without dither (DITH)",null,null,null,"With/without VOUT connected to VCCX"]
[null,null,null,null,null,null,null,null,null,"FPWM or DEM (DEMB)"]
[null,null,null,null,null,null,null,null,null,"Shunt or inductor DCR current sensing"]
[]
[]
[]
[]
[]
[]
[]
[]
[]
[]
[]
[]
[null," "]

{"sheet":"Stability Calculations","index":7,"n_rows":687,"n_cols":35,"rows_kept":687,"cut":false,"hidden":true,"merged":[[9,1,10,1],[1,0,1,3],[1,9,1,11],[9,0,11,0],[9,18,9,19],[1,19,1,21],[10,6,10,7],[1,4,1,6],[9,2,9,7],[9,8,9,13],[9,20,9,22],[9,14,9,17],[1,12,1,14],[1,15,1,18],[9,27,9,28],[9,30,9,31],[10,2,10,3],[10,4,10,5],[10,8,10,9],[10,10,10,11],[10,12,10,13],[10,18,10,19],[10,14,10,15],[10,16,10,17]]}
[]
["Divider Network & EA Poles/Zeros",null,null,null,"Modulator",null,null,null,null,"Power Stage Poles/Zeros",null,null,"Complex Pole Pair",null,null,"Feedback natural frequencies",null,null,null,"Total System"]
[null,"Afb1",{"$f":"Afb","v":1.6E-2},"V/V","Acs",{"$f":"Acs","v":33.333333333333336},"A/V","gm",{"$f":"gm","v":1.1999999999999999E-3},"z_ESR",{"$f":"Fesr","v":33862.753888033272},"Hz","p3",{"$f":"Fsw/2","v":225000},"Hz","zterm1",{"$f":"((1/wffHz)+(1/wfftHz))","v":2.7671148061200001E-7},null,null,"Adc",{"$f":"IF(VOUT_setting=1,Am*Afb*AEA,Am*AEA)","v":119976.6548927979},"V/V"]
[null,"EA zero, z1",{"$f":"Fz1_u","v":4476.9323002463125},"Hz","Am",{"$f":"Am","v":97.637251703123283},"V/V",null,null,"p_dom",{"$f":"Fp_dominant","v":115.60735715570485},"Hz","pterm1",{"$f":"Q*pole3","v":384434.55052934197},null,"pterm3",{"$f":"((1/wfbtHz)+(1/wffHz)+(1/wfftHz)+(Afbr/wffHz))","v":4.5058381788342228E-6},null,null,"Crossover",{"$f":"AI7","v":38.240499999999997},"kHz"]
[null,"EA pole, p1",{"$f":"Fp1_u","v":16.517473654721982},"Hz","Q",{"$f":"Q","v":1.708598002352631},null,null,null,null,null,null,"pterm2",{"$f":"pole3^2","v":50625000000},null,"pterm4",{"$f":"1/(wffHz*wfbtHz)","v":6.3749748601826958E-14},null,null,"Phase Margin",{"$f":"AI9","v":65.031802681286024},"°"]
[null,"Aea",{"$f":"AEA","v":76800},"V/V","mc",{"$f":"mc","v":9.5227272727272734},null,null,null,null,null,null,null,null,null,"Afbr",{"$f":"Rfb1_/Rfb2_u","v":61.728395061728392},null,null,"radconv",{"$f":"180/Pi","v":57.295779578552292},null,null,null,null,null,null,null,null,null,null,null,null,"XOVER SEARCH"]
[null,"EA pole, p2",{"$f":"Fp2_u","v":21097.046413502114},"Hz","k",{"$f":"k","v":0.68629887551619528},null,null,null,null,null,null,null,null,null,null,null,null,null,null,null,null,null,null,null,null,null,null,null,null,null,null,null,"xover",{"$f":"SUM(AH12:AH613)/1000","v":38.240499999999997}]
[]
[null,null,null,null,null,null,null,null,null,null,null,null,null,null,null,null,null,null,null,null,null,null,null,null,null,null,null,null,null,null,null,null,null,"phase margin",{"$f":"SUM(AI13:AI613)","v":65.031802681286024}]
["Freq (Hz)",null,"Power Stage",null,null,null,null,null,"Error Amplifier",null,null,null,null,null,"Feedback Gain",null,null,null,"Sampling Double Pole",null,"System Response",null,null,null,null,null,null,"ERROR AMP Response",null,null,"PLANT Response"]
[null,null,"p_dom",null,"z_ESR",null,"z_RHP",null,"p1",null,"z1",null,"p2",null,"z1",null,"p1p2",null,"p3"]
[null,null,"Gain(V/V)","Phase(rad)","Gain(V/V)","Phase(rad)","Gain(V/V)","Phase(rad)","Gain(V/V)","Phase(rad)","Gain(V/V)","Phase(rad)","Gain(V/V)","Phase(rad)","Gain(V/V)","Phase(rad)","Gain(V/V)","Phase(rad)","Gain(V/V)","Phase(rad)","Gain (dB)","Phase (°)","Phase Margin (°)",null,null,"Fsquare",null,"Gain(dB)","Phase(Deg)",null,"Gain(dB)","Phase(Deg)"]
[1,{"$f":"A13/1000","v":1E-3},{"$f":"SQRT(1+(A13/pole1)^2)","v":1.0000374102779284},{"$f":"ATAN(A13/pole1)","v":8.6497527931635142E-3},{"$f":"SQRT(1+(A13/Zero1)^2)","v":1.000000000436039},{"$f":"ATAN(A13/Zero1)","v":2.9530970901415563E-5},{"$f":"IF(VIN_nom>Vout, 1, SQRT(1+(A13/z_RHP)^2))","v":1},{"$f":"IF(VIN_nom>Vout, 0, -ATAN(A13/z_RHP))","v":0},{"$f":"SQRT(1+(A13/Pole2)^2)","v":1.0018309873624813},{"$f":"ATAN(A13/Pole2)","v":6.0468139682974167E-2},{"$f":"SQRT(1+(A13/Zero2)^2)","v":1.0000000249464611},{"$f":"ATAN(A13/Zero2)","v":2.2336723370018529E-4},{"$f":"SQRT(1+(A13/pole4)^2)","v":1.0000000011233798},{"$f":"ATAN(A13/pole4)","v":4.7399999964501188E-5},{"$f":"IF(VOUT_setting=1,1,SQRT(1+(A13*zterm1)^2))","v":1},{"$f":"IF(VOUT_setting=1,0,ATAN(((A13*zterm1))))","v":0},{"$f":"IF(VOUT_setting=1,1,SQRT((1+Afbr-pterm4*(A13)^2)^2+(A13*$Q$4)^2))","v":1},{"$f":"IF(VOUT_setting=1,0,ATAN(A13*$Q$4/(1+Afbr-$Q$5*(A13)^2)))","v":0},{"$f":"SQRT((1-(Z13/pterm2))^2+(A13/pterm1)^2)","v":0.99999999998363009},{"$f":"IF((ATAN((A13/pterm1)/(1-A13^2/pterm2))>0),ATAN((A13/pterm1)/(1-A13^2/pterm2)),PI()+ATAN((A13/pterm1)/(1-A13^2/pterm2)))","v":2.6012230134897114E-6},{"$f":"20*LOG10(((E13*K13*G13*O13)/(C13*I13*S13*M13*Q13))*Adc)","v":101.56572104462418},{"$f":"((F13+L13+H13+P13)-(D13+J13+T13+N13+R13))*radconv","v":-3.9485383915106027},{"$f":"IF(V13>0,V13,V13+180)","v":176.0514616084894},null,{"$f":"IF(U13<0,A13,1000000000)","v":1000000000},{"$f":"A13^2","v":1},null,{"$f":"20*LOG10((K13/(I13*M13))*AEA)","v":97.691335395433981},{"$f":"(L13-(J13+N13))*radconv","v":-3.4544870229636313},null,{"$f":"20*LOG10((E13*G13/(C13*S13))*Acs*Am)","v":70.249560901678464},{"$f":"(F13+H13-(D13+T13))*radconv","v":-0.49405136854697107},null,{"$f":"SUM((U14<0)*(U13>0))*A13","v":0},{"$f":"IF(AH13>0,W11,0)","v":0}]
[1.0965,{"$f":"A14/1000","v":1.0965E-3},1.0000449786652243,9.4844060845896607E-3,1.0000000005242551,3.2380709591497836E-5,1,0,1.0022010116940268,6.6286985421841263E-2,1.0000000299934355,2.4492217092817592E-4,1.0000000013506536,5.1974099953200658E-5,1,0,{"$f":"IF(VOUT_setting=1,1,SQRT((1+Afbr-pterm4*(A14)^2)^2+(A14*$Q$4)^2))","v":1},0,0.9999999999803183,2.8522410343015653E-6,101.56244782763721,-4.3286339793422206,175.67136602065779,null,1000000000,1.2023122500000001,null,97.688127913120866,-3.7869093955118371,null,70.249495167004611,-0.54172458383038402,null,0,0]
[1.2022999999999999,1.2022999999999999E-3,1.0000540770522146,1.0399482235905876E-2,1.0000000006303056,3.5505086310173635E-5,1,0,1.0026456618472395,7.2661434705980243E-2,1.0000000360607402,2.685544230878736E-4,1.0000000016238741,5.6989019938304655E-5,1,0,{"$f":"IF(VOUT_setting=1,1,SQRT((1+Afbr-$Q$5*(A15)^2)^2+(A15*$Q$4)^2))","v":1},0,0.99999999997633693,3.1274504291430602E-6,101.55851600976874,-4.745063082100728,175.25493691789927,null,1000000000,1.4455252899999997,null,97.684275117968085,-4.1510717420699086,null,70.249416144288915,-0.59399134003081899,null,0,0]
[1.3183,1.3183000000000001E-3,1.0000650149817076,1.1402759266649446E-2,1.0000000007577989,3.8930678930985252E-5,1,0,1.0031799573289777,7.964362320482489E-2,1.0000000433548257,2.9446502057320806E-4,1.0000000019523387,6.2487419918668915E-5,1,0,1,0,0.99999999997155053,3.4291922987277639E-6,101.55379371832896,-5.2012480386831044,174.7987519613169,null,1000000000,1.7379148900000001,null,97.679647825370907,-4.5499521425066556,null,70.249321145446316,-0.65129589617644845,null,0,0]
[1.4454,1.4454000000000001E-3,1.0000781552556508,1.2502013100852458E-2,1.0000000009109646,4.2684065327391547E-5,1,0,1.0038214645116843,8.7284986177258453E-2,1.0000000521176757,3.228549937420064E-4,1.0000000023469442,6.851195989280414E-5,1,0,1,0,0.99999999996580025,3.7598077437696838E-6,101.54812704294143,-5.7005709373562645,174.29942906264372,null,1000000000,2.0891811599999999,null,97.674095275402536,-4.9864885461244199,null,70.249207020027143,-0.71408239123184547,null,0,0]
[1.5849,1.5849E-3,1.000093968519487,1.3708476332161879E-2,1.0000000010952901,4.6803635761083297E-5,1,0,1.0045929349008151,9.5660068111589266E-2,1.0000000626632142,3.5401471978989998E-4,1.0000000028218272,7.5124259858674869E-5,1,0,1,0,0.99999999995888023,4.1226783541889091E-6,101.54131695858308,-6.2479313302296973,173.7520686697703,null,1000000000,2.51190801,null,97.667422529827789,-5.4649389306721377,null,70.24906968124354,-0.78299239955756106,null,0,0]
[1.7378,1.7378000000000001E-3,1.0001129728572531,1.5030783250137186E-2,1.0000000013168158,5.131892120234629E-5,1,0,1.0055193189321148,0.10482415931537593,1.0000000753370342,3.8816756568419152E-4,1.00000000339255,8.2371719813699858E-5,1,0,1,0,0.99999999995056377,4.5204053530021906E-6,101.53314602248039,-6.8469802018039454,173.15301979819606,null,1000000000,3.0199488400000001,null,97.659416644231115,-5.9884611152597964,null,70.248904630737542,-0.85851908654414855,null,0,0]
[1.9055,1.9055000000000001E-3,1.0001358274260417,1.6481022637087461E-2,1.0000000015832275,5.6271265009611522E-5,1,0,1.0066322802049998,0.11485495652906187,1.0000000905788571,4.2562624519245664E-4,1.0000000040789143,9.032069975439305E-5,1,0,1,0,0.99999999994056199,4.9566304524328237E-6,101.5233389843744,-7.5028456084234021,172.4971543915766,null,1000000000,3.63093025,null,97.649808091294574,-6.5614926801704492,null,70.248706145568093,-0.94135292825295169,null,0,0]
[2.0893000000000002,2.0893000000000001E-3,1.000163292113313,1.80704120676295E-2,1.0000000019033868,6.1699057443971556E-5,1,0,1.0079681507687486,0.12582208491525884,1.0000001088956509,4.6668113525146231E-4,1.0000000049037496,9.903281967624521E-5,1,0,1,0,0.99999999992854249,5.4347352424040665E-6,101.5115814857943,-8.2201443850844491,171.77985561491556,null,1000000000,4.3651744900000002,null,97.638289109398869,-7.1880097465669355,null,70.248467628883702,-1.0321346385175136,null,0,0]
[2.2909000000000002,2.2909000000000002E-3,1.0001963218753318,1.9813619666591679E-2,1.0000000022884303,6.7652501154506967E-5,1,0,1.0095724114819222,0.13781633319003664,1.000000130924579,5.117119595302417E-4,1.0000000058957486,1.0858865957319237E-4,1,0,1,0,0.99999999991408706,5.9591418020465462E-6,101.49748154267422,-9.0048990009947296,170.99510099900527,null,1000000000,5.2482228100000006,null,97.624476004100416,-7.873196985043343,null,70.248180791062083,-1.1317020159513864,null,0,0]
[2.5118999999999998,2.5118999999999996E-3,1.0002360220083264,2.1724437653661412E-2,1.0000000027512506,7.41788456927726E-5,1,0,1.0114973560349905,0.15091897447896163,1.0000001574032182,5.6107610478594899E-4,1.0000000070881252,1.1906405943737265E-4,1,0,1,0,0.99999999989671173,6.5340120881918549E-6,101.48059145453244,-9.862537699042738,170.13746230095725,null,1000000000,6.309641609999999,null,97.607930668234886,-8.6216948712463868,null,70.24783603878582,-1.2408428277963499,null,0,0]
[2.7542,2.7542000000000001E-3,1.00028374511667,2.3819237610314018E-2,1.000000003307626,8.1334199900973247E-5,1,0,1.0138065747299725,0.16522453072246215,1.0000001892342996,6.1519796767735572E-4,1.000000008521531,1.3054907925834794E-4,1,0,1,0,0.99999999987582422,7.164288424578923E-6,101.46037028404925,-10.799392122310488,169.20060787768952,null,1000000000,7.5856176399999997,null,97.588123902691635,-9.4388999573600874,null,70.24742163384586,-1.3604921649504025,null,0,0]
[3.02,3.0200000000000001E-3,1.0003411448910302,2.611696521640694E-2,1.0000000039768511,8.9183531911753578E-5,1,0,1.0165772231152996,0.18083922637834793,1.0000002275216804,6.7456895467392591E-4,1.000000010245675,1.4314799902223475E-4,1,0,1,0,0.99999999985069998,7.8556935018551247E-6,101.43616676475156,-11.822608416188137,168.17739158381187,null,1000000000,9.1204000000000001,null,97.56441878974195,-10.330876275791299,null,70.246923227497874,-1.4917321403968355,null,0,0]
[3.3113000000000001,3.3113000000000001E-3,1.0004101163370929,2.8634811795639772E-2,1.0000000047810416,9.7785903662604028E-5,1,0,1.0198966819101478,0.19784988985728544,1.0000002735306195,7.3963579837693194E-4,1.0000000123175332,1.5695561871112928E-4,1,0,1,0,0.99999999982050869,8.6134297660703098E-6,101.40725222091832,-12.938123222272408,167.0618767777276,null,1000000000,10.964707690000001,null,97.536103092082584,-11.302578563764952,null,70.246324381323987,-1.6355446585074556,null,0,0]
[3.6307999999999998,3.6308E-3,1.0004930564665211,3.1395985873632529E-2,1.0000000057481766,1.072210487691443E-4,1,0,1.0238744752512436,0.21637450455347032,1.0000003288618777,8.1100158780138048E-4,1.0000000148091912,1.7209991830089289E-4,1,0,1,0,0.9999999997842004,9.4445205193917184E-6,101.3727218551918,-14.153994853942464,165.84600514605754,null,1000000000,13.182708639999998,null,97.502292801271494,-12.360739550086025,null,70.24560430640858,-1.7932553038564367,null,0,0]
[3.9811000000000001,3.9811000000000004E-3,1.0005927567865276,3.442278704720865E-2,1.0000000069108526,1.1756574774814798E-4,1,0,1.0286361590221524,0.23651255228352414,1.00000039538031,8.892470744790035E-4,1.000000017804626,1.8870413776012889E-4,1,0,1,0,0.99999999974055076,1.0355728941694568E-5,101.33155549365472,-15.477170647040232,164.52282935295977,null,1000000000,15.849157210000001,null,97.46199194533915,-13.511032909510066,null,70.244738800803816,-1.9661377375301647,null,0,0]
[4.3651999999999997,4.3651999999999996E-3,1.0007126111891593,3.7740913274861322E-2,1.0000000083087128,1.2890859350228901E-4,1,0,1.0343320087884265,0.25837070803713857,1.0000004753539862,9.7504235577044909E-4,1.000000021405973,2.0691047704725319E-4,1,0,1,0,0.99999999968807196,1.1354858702072507E-5,101.2825522470774,-16.915200137651762,163.08479986234823,null,1000000000,19.054971039999998,null,97.41402904925117,-14.759540422439796,null,70.243698450314497,-2.1556597152119639,null,0,0]
[4.7862999999999998,4.7862999999999994E-3,1.0008566687152767,4.1377713669904732E-2,1.0000000099890753,1.4134408512526852E-4,1,0,1.0411377256199226,0.2820470196092576,1.0000005714900304,1.0691022011185892E-3,1.0000000257351389,2.2687061610763542E-4,1,0,1,0,0.9999999996249872,1.24502337142386E-5,101.22433839880217,-18.47523083926659,161.5247691607334,null,1000000000,22.908667689999998,null,97.357065472583159,-16.111847551070756,null,70.242448178707278,-2.3633832881958345,null,0,0]
[5.2481,5.2481000000000003E-3,1.0010298635492392,4.536475451661854E-2,1.0000000120096308,1.5498148719192404E-4,1,0,1.049262823127356,0.30764261628744638,1.0000006870890137,1.1722530617162069E-3,1.0000000309407533,2.4875993486878675E-4,1,0,1,0,0.99999999954913088,1.3651478503435536E-5,101.15531440144503,-20.164822635530172,159.83517736446981,null,1000000000,27.542553609999999,null,97.289544390567926,-17.57371127313651,null,70.240945263365361,-2.5911113623936597,null,0,0]
[5.7544000000000004,5.7544000000000007E-3,1.00123802781328,4.9734332215640532E-2,1.0000000144386154,1.6993301736877237E-4,1,0,1.0589477883168343,0.33523317996415003,1.0000008260548119,1.2853437231379837E-3,1.0000000371986153,2.7275855323583969E-4,1,0,1,0,0.99999999945794127,1.4968477717236039E-5,101.07370428867164,-21.990118051951335,158.00988194804867,null,1000000000,33.113119360000006,null,97.209740299779497,-19.149429529943866,null,70.239139241380414,-2.8406885220074662,null,0,0]
[6.3095999999999997,6.3095999999999994E-3,1.0014882629210202,5.4523746936307363E-2,1.0000000173591761,1.8632861189739523E-4,1,0,1.070476778787157,0.36488952994935853,1.0000009931443818,1.4093569880637316E-3,1.0000000447229387,2.9907503108299039E-4,1,0,1,0,0.99999999934829675,1.6412676737060556E-5,100.9774810811233,-23.957260728514392,156.0427392714856,null,1000000000,39.811052159999996,null,97.115687621668798,-20.843015608222792,null,70.236968711942751,-3.1142451202916024,null,0,0]
[6.9183000000000003,6.9183000000000005E-3,1.0017889966902402,5.9771793758486347E-2,1.0000000208700857,2.0430411320409011E-4,1,0,1.0841739247481943,0.39664777361608461,1.0000011940086468,1.5453203285243535E-3,1.0000000537681948,3.2792740824529011E-4,1,0,1,0,0.99999999921648919,1.7996041188982433E-5,100.86444076990418,-26.070488784982931,153.92951121501707,null,1000000000,47.862874890000008,null,97.005255145830318,-22.656491931009896,null,70.234360876562107,-3.413996853973039,null,0,0]
[7.5857999999999999,7.5858000000000002E-3,1.0021504785506572,6.552300071152814E-2,1.0000000250915926,2.240160353817986E-4,1,0,1.1004176099142171,0.43052705904064137,1.0000014355271647,1.6944175679944862E-3,1.0000000646441829,3.5956690450406081E-4,1,0,1,0,0.99999999905800419,1.9732357555253299E-5,100.73213771569135,-28.333388981526124,151.66661101847387,null,1000000000,57.544361639999998,null,96.876085672745589,-24.590902168009325,null,70.23122729543401,-3.7424868135167957,null,0,0]
[8.3176000000000005,8.3176000000000014E-3,1.0025848431259254,7.1823220960129774E-2,1.0000000301662628,2.4562679870125431E-4,1,0,1.119632257002245,0.46649449594948095,1.0000017258563203,1.8578771963037256E-3,1.0000000777181999,3.9425421957284783E-4,1,0,1,0,0.99999999886748947,2.1635932562814381E-5,100.57801883068443,-30.746640100527809,149.2533598994722,null,1000000000,69.182469760000004,null,96.72573067311609,-26.64430639506844,null,70.2274634100566,-4.1023337054593751,null,0,0]
[9.1201000000000008,9.1201000000000008E-3,1.0031068775170495,7.8725534345121015E-2,1.000000036268087,2.693254012843463E-4,1,0,1.1423082244113931,0.50449131321240914,1.0000020749503069,2.0371287239881555E-3,1.000000093438502,4.322927130714776E-4,1,0,1,0,0.99999999863841293,2.3723414039439164E-5,100.39934228566938,-33.309841656487933,146.69015834351205,null,1000000000,83.176224010000013,null,96.551575538862522,-28.813272750771368,null,70.222941999295116,-4.4965689057165639,null,0,0]
[10,0.01,1.0037341259210744,8.628491270096765E-2,1.0000000436039111,2.9530970051556141E-4,1,0,1.1689879058264026,0.54439487232972772,1.0000024946430259,2.2336686593463465E-3,1.0000001123379938,4.739999645011967E-4,1,0,1,0,0.99999999836300935,2.6012230179957205E-5,100.1933819066666,-36.019038749594927,143.98096125040507,null,1000000000,100,null,96.351044732252049,-31.090707019027064,null,70.2175124269028,-4.9283317305678587,null,0,0]
[10.965,1.0964999999999999E-2,1.0044878970664037,9.4564017942995585E-2,1.0000000524255164,3.2380708471098097E-4,1,0,1.200286125910432,0.58604481967911271,1.0000029993391126,2.4492168609013469E-3,1.0000001350653445,5.1974095320067289E-4,1,0,1,0,0.99999999803182615,2.8522410402419967E-5,99.957370442807658,-38.868544547689154,141.13145545231083,null,1000000000,120.23122499999999,null,96.121553556873437,-33.467343985177116,null,70.210992138422469,-5.401200562512031,null,0,0]
[12.023,1.2022999999999999E-2,1.0053933075546553,0.10362604678983578,1.0000000630305559,3.5505084833156183E-4,1,0,1.2368639060579416,0.62920370076687404,1.0000036060675794,2.6855378392873636E-3,1.0000001623874069,5.69890138304679E-4,1,0,1,0,0.99999999763368863,3.1274504369743018E-5,99.688807336700279,-41.848282982237606,138.15171701776239,null,1000000000,144.55252899999999,null,95.860815987964415,-35.92949886480681,null,70.203166601224126,-5.9187841174307909,null,0,0]
[13.183,1.3183E-2,1.0064807097189323,0.11354208491253913,1.0000000757798853,3.8930676983878182E-4,1,0,1.2794540549222309,0.67359628308706609,1.0000043354732695,2.9446417798993582E-3,1.000000195233864,6.248741186689413E-4,1,0,1,0,0.99999999715504972,3.4291923090514509E-5,99.385368613593613,-44.946452681729049,135.05354731827094,null,1000000000,173.79148899999998,null,95.566766461647333,-38.46131126409734,null,70.193777404434528,-6.4851414176317075,null,0,0]
[14.454000000000001,1.4454E-2,1.0077855237869615,0.12438122951639848,1.0000000910964675,4.2684062761069117E-4,1,0,1.3288164889999889,0.71887150703077751,1.0000052117541303,3.2285388320312967E-3,1.0000002346944055,6.8511949280419262E-4,1,0,1,0,0.99999999658003014,3.7598077573764911E-5,99.045316547624765,-48.146793773032329,131.85320622696767,null,1000000000,208.91811600000003,null,95.237967459819231,-41.042576218300944,null,70.182524340293796,-7.1042175547313802,null,0,0]
[15.849,1.5848999999999999E-2,1.0093535490132548,0.13624403722092795,1.0000001095290101,4.6803632377688661E-4,1,0,1.3858919457386778,0.76474782506789374,1.0000062663019817,3.5401325567669863E-3,1.0000002821826823,7.5124245867492655E-4,1,0,1,0,0.99999999588803012,4.1226783721278861E-5,98.666534241267243,-51.438785126111533,128.56121487388847,null,1000000000,251.19080099999999,null,94.872688961359856,-43.657031185938216,null,70.169020532395649,-7.7817539401733127,null,0,0]
[17.378,1.7378000000000001E-2,1.0112348133530988,0.14920206299013741,1.0000001316815752,5.1318916742227488E-4,1,0,1.4515199187646046,0.81078035886090583,1.0000075336753311,3.8816563563769412E-3,1.0000003392549552,8.2371701369994956E-4,1,0,1,0,0.99999999505637216,4.5204053766500302E-5,98.248498410420922,-54.800920651201508,125.19907934879849,null,1000000000,301.99488400000001,null,94.470826892342799,-46.279085709371387,null,70.152846770566356,-8.5218349418301234,null,0,0]
[19.055,1.9054999999999999E-2,1.013492639399671,0.16335639830129819,1.0000001583227511,5.6271259129657999E-4,1,0,1.5267137109071094,0.85661152246371652,1.0000090578451015,4.2562370073935653E-3,1.0000004078913591,9.0320675439318273E-4,1,0,1,0,0.99999999405620132,4.9566304836087192E-5,97.790447444464306,-58.218341566529858,121.78165843347014,null,1000000000,363.09302500000001,null,94.032147415528271,-48.888110493233071,null,70.133475281424296,-9.3302310732967815,null,0,{"$f":"IF(AH45>0,W43,0)","v":0}]
[20.893000000000001,2.0893000000000002E-2,1.0161993353147012,0.17879392702352379,1.0000001903386668,6.1699049693119811E-4,1,0,1.6124451297383928,0.90182910488464951,1.0000108895063904,4.6667778120526877E-3,1.0000004903748516,9.9032787624541482E-4,1,0,1,0,0.99999999285425045,5.4347352834995867E-5,97.292749994679184,-61.672256900998455,118.32774309900154,null,1000000000,436.51744900000006,null,93.557615828761698,-51.460356545840398,null,70.110309418405748,-10.211900355158063,null,0,0]
[22.909000000000002,2.2909000000000002E-2,1.0194450594780782,0.19562775304571722,1.0000002288430201,6.7652490936518858E-4,1,0,1.7098670716001232,0.94611256672683264,1.0000130923730566,5.1170753788531793E-3,1.0000005895746802,1.0858861731926795E-3,1,0,1,0,0.99999999140870865,5.9591418562229885E-5,96.755522154860486,-65.150583884163169,114.84941611583683,null,1000000000,524.82228100000009,null,93.048086021719897,-53.977286951511985,null,70.082611385628837,-11.173296932651203,null,0,0]
[25.119,2.5118999999999999E-2,1.023332776912842,0.21395302370961661,1.0000002751250205,7.4178832223193965E-4,1,0,1.820079703358523,0.98911863861911253,1.0000157401991945,5.6107027609388887E-3,1.000000708812268,1.1906400373731696E-3,1,0,1,0,0.9999999896711762,6.5340121596084473E-5,96.179922195323897,-68.638920215456608,111.36107978454339,null,1000000000,630.96416099999999,null,92.505546827516582,-56.419072555825593,null,70.049550620295562,-12.219847659631027,null,0,0]
[27.542000000000002,2.7542000000000001E-2,1.0279869038383236,0.23387774294113275,1.0000003307625505,8.1334182145454531E-4,1,0,1.944319185877651,1.0305831237923022,1.0000189232527017,6.1519028435914795E-3,1.0000008521527513,1.3054900583487242E-3,1,0,1,0,0.99999998758241537,7.1642885187198581E-5,95.566992051975262,-72.128095888608101,107.8719041113919,null,1000000000,758.56176400000004,null,91.932030129386604,-58.770384499489673,null,70.01013717507692,-13.357711389118437,null,0,0]
[30.2,3.0199999999999998E-2,1.0335572631401364,0.25551893994498365,1.0000003976850411,8.9183508503568802E-4,1,0,2.0839685831800288,1.0703083937477382,1.0000227519118079,6.7455882533245725E-3,1.0000010245669704,1.4314790222359499E-3,1,0,1,0,0.9999999850699911,7.8556936259668804E-5,94.917613069684435,-75.613237233768757,104.38676276623124,null,1000000000,912.04,null,91.329589770096845,-61.019677778083974,null,69.963198552075866,-14.593559455684799,null,0,0]
[33.113,3.3112999999999997E-2,1.0402115587511747,0.27895791190743818,1.0000004781040366,9.7785872806403166E-4,1,0,2.2402955557544058,1.1080920268426142,1.000027352691603,7.3962244615480453E-3,1.0000012317525739,1.5695549111311847E-3,1,0,1,0,0.99999998205087681,8.6134299296719555E-5,94.233626317382573,-79.087171934514259,100.91282806548574,null,1000000000,1096.470769,null,90.701344934245398,-63.155152948487931,null,69.907456635625437,-15.932018986026321,null,0,0]
[36.308,3.6308E-2,1.0481581959666788,0.30430822900930093,1.000000574817504,1.0722100809168729E-3,1,0,2.4149314911816728,1.1438530287391777,1.0000328856524578,8.1098398580086752E-3,1.0000014809180267,1.7209975008959349E-3,1,0,1,0,0.99999997842003019,9.4445207350663516E-5,93.515579946299482,-82.551452714025132,97.448547285974868,null,1000000000,1318.2708640000001,null,90.04940087741582,-65.171897301444119,null,69.841354321371924,-17.37955541258102,null,0,0]
[39.811,3.9810999999999999E-2,1.0576324944735442,0.33164499510121237,1.0000006910850199,1.1756569412454223E-3,1,0,2.6094510466350345,1.1775138386897133,1.0000395372572195,8.8922387058848022E-3,1.0000017804610377,1.8870391601336651E-3,1,0,1,0,0.99999997405507901,1.0355729226010601E-4,92.76459036579331,-86.005636735658271,93.994363264341729,null,1000000000,1584.9157210000001,null,89.376569267362441,-67.065204983183662,null,69.763196350919117,-18.940431752474609,null,0,0]
[43.652000000000001,4.3652000000000003E-2,1.0689120727649013,0.36103804168903769,1.0000008308709378,1.2890852281210383E-3,1,0,2.8256451370315663,1.2090570519455415,1.0000475342801516,9.7501176715791855E-3,1.0000021405950457,2.0691018472607683E-3,1,0,1,0,0.999999968807192,1.1354859076876777E-4,91.981144711651893,-89.452379324583504,90.547620675416496,null,1000000000,1905.497104,null,88.685266287376393,-68.833776556556458,null,69.671053676763762,-20.618602768027028,null,0,0]
[47.863,4.7863000000000003E-2,1.0823156338074797,0.39252825725016799,1.0000009989070344,1.4134399194019758E-3,1,0,3.0654161823319401,1.2384943048106372,1.0000571473864568,1.0690618791220954E-2,1.0000025735105995,2.2687023076473764E-3,1,0,1,0,0.99999996249872702,1.2450234208312419E-4,91.165550442162683,-92.894318249689135,87.105681750310865,null,1000000000,2290.8667689999997,null,87.977909494888735,-70.477956427250803,null,69.562816199762182,-22.416361822438322,null,0,0]
[52.481000000000002,5.2481E-2,1.0982161771440215,0.42614134974610851,1.0000012009623667,1.5498136434825189E-3,1,0,3.3309528966526885,1.2658789205268979,1.0000687065646847,1.1721999069148026E-2,1.0000030940706008,2.4875942688056666E-3,1,0,1,0,0.99999995491309956,1.3651479154761515E-4,90.317389125304913,-96.335551966526026,83.664448033473974,null,1000000000,2754.255361,null,87.25642445642022,-72.000427181665316,null,69.436139921372956,-24.335124784860714,null,0,0]
[57.544000000000004,5.7544000000000005E-2,1.1170312591609244,0.46184902572022851,1.0000014438605052,1.6993285543161958E-3,1,0,3.6245057370780227,1.2912707323497952,1.000082602103759,1.2852736536372785E-2,1.0000037198546841,2.7275788358695659E-3,1,0,1,0,0.99999994579413609,1.496847857583872E-4,89.436350763142769,-99.777446381590337,80.222553618409663,null,1000000000,3311.3119360000005,null,86.52293370326332,-73.404234453143545,null,69.288592312367697,-26.373211928446775,null,0,0]
[63.095999999999997,6.3095999999999999E-2,1.139242764671456,0.4995962931559737,1.000001735916114,1.8632839842010226E-3,1,0,3.9486774231700386,1.3147586934775874,1.0000993095563075,1.4092646192064852E-2,1.0000044722839769,2.9907414830378527E-3,1,0,1,0,0.99999993482968352,1.6412677868933264E-4,88.521415614751078,-103.22143656957689,76.778563430423105,null,1000000000,3981.1052159999995,null,85.779014971195053,-74.694032015366744,null,69.117575896044272,-28.527404554210154,null,0,0]
[69.183000000000007,6.9183000000000008E-2,1.1653837947061942,0.5392648573526081,1.0000020870064139,2.0430383179106792E-3,1,0,4.3061943651431189,1.3364331590826577,1.0001193938085342,1.5451985676696733E-2,1.0000053768051844,3.2792624453652284E-3,1,0,1,0,0.99999992164892582,1.7996042681056153E-4,87.571692006376963,-106.6653879382835,73.334612061716498,null,1000000000,4786.2874890000012,null,85.026342111527029,-75.874534037135163,null,68.920525147338182,-30.790853901148335,null,0,0]
[75.858000000000004,7.5858000000000009E-2,1.1960594324410154,0.58069995245361428,1.0000025091561413,2.2401566440225598E-3,1,0,4.7002012319614357,1.356400784762084,1.0001435425172742,1.6942570584096674E-2,1.0000064643976037,3.5956537041798792E-3,1,0,1,0,0.99999990580042386,1.9732359522216711E-4,86.585763902670593,-110.10592914127697,69.894070858723026,null,1000000000,5754.4361640000006,null,84.266085916936561,-76.951318376298744,null,68.694853238222308,-33.15461076497823,null,0,0]
[83.176000000000002,8.3176E-2,1.2319240100686697,0.6236737696812279,1.0000030166217835,2.4562630966661484E-3,1,0,5.1339691362525857,1.3747620870235049,1.0001725708906148,1.8576656158123765E-2,1.0000077717900875,3.9425219730364978E-3,1,0,1,0,0.99999988674895135,2.1635935155717059E-4,85.562650001494717,-113.53512918978102,66.464870810218983,null,1000000000,6918.2469760000004,null,83.499590628240242,-77.929591384457538,null,68.438234625742723,-35.605537805323486,null,0,0]
[91.201000000000008,9.1201000000000004E-2,1.2737114163736194,0.66792714153184118,1.0000036268021875,2.6932475660462552E-3,1,0,5.6113107163826692,1.3916277895722564,1.0002074737232871,2.036849815353297E-2,1.0000093438069995,4.3229004717765954E-3,1,0,1,0,0.99999986384130879,2.3723417457587723E-4,84.500981232037233,-116.94374113256113,63.056258867438871,null,1000000000,8317.6224010000005,null,82.727658795553069,-78.815054058739918,null,68.148497688972427,-38.128687073821212,null,0,0]
[100,0.1,1.3222025388927066,0.71313633578285718,1.0000043603817079,2.9530885066058436E-3,1,0,6.1362262341637805,1.4070996073228557,1.0002494335052152,2.2333010038387863E-2,1.0000112337369016,4.7399645016705351E-3,1,0,1,0,0.99999983630094769,2.6012234685967141E-4,83.400055987628278,-120.31826839602033,59.681731603979671,null,1000000000,10000,null,81.951265846472623,-79.612861687050639,null,67.823965393643903,-40.705406708969726,null,0,0]
[109.65,0.10965000000000001,1.3782574270754295,0.75895743409454719,1.0000052425380299,3.2380596431829298E-3,1,0,6.7133209669512572,1.4212823255848301,1.0002998893942312,2.448732197271361E-2,1.000013506444142,5.1973632014238914E-3,1,0,1,0,0.99999980318262571,2.8522416342852477E-4,82.259114268701325,-123.64411846236654,56.355881537633465,null,1000000000,12023.122500000001,null,81.170963271633184,-80.328245619761447,null,67.463326249556388,-43.315872842605074,null,0,0]
[120.23,0.12023,1.4427648067404943,0.80499663173414771,1.0000063030359105,3.5504937132528514E-3,1,0,7.3473282362291981,1.4342686844022865,1.0003605424127231,2.6848989565624315E-2,1.0000162386101565,5.6988403058693448E-3,1,0,1,0,0.99999976336888396,3.12745122009863E-4,81.078482163375654,-126.90312835159534,53.096871648404658,null,1000000000,14455.252900000001,null,80.387625581215048,-80.965728107893185,null,67.066031834648868,-45.937400243702129,null,0,0]
[131.83000000000001,0.13183,1.5166878069110263,0.85086709128946936,1.000007577960105,3.8930482274941651E-3,1,0,8.0436476716533214,1.4461521224570839,1.0004334543254416,2.9437996346721632E-2,1.0000195231977136,6.2486606708277766E-3,1,0,1,0,0.99999971550498745,3.4291933414204391E-4,79.858613125345897,-130.07744809051397,49.922551909486032,null,1000000000,17379.148900000004,null,79.601758159692693,-81.529762179897574,null,66.632030218141438,-48.547685910616416,null,0,0]
[144.54,0.14454,1.6009891303366333,0.89615935146142023,1.0000091096056829,4.2683806131630772E-3,1,0,8.8076856292573122,1.4570137679183441,1.0005210410292604,3.2274289871121326E-2,1.0000234691679144,6.8510888071814475E-3,1,0,1,0,0.99999965800303803,3.7598091180576396E-4,78.601333986204807,-133.14722815849598,46.852771841504023,null,1000000000,20891.811599999997,null,78.814308977366579,-82.024097565224679,null,66.16220026132649,-51.12313059327132,null,0,0]
[158.49,0.15849000000000002,1.696896782531363,0.9405905293393293,1.0000109528416359,4.6803294042671983E-3,1,0,9.6472611930191778,1.4669534362729837,1.0006264359504953,3.5386695434219274E-2,1.0000282178740785,7.5122846796641662E-3,1,0,1,0,0.99999958880306261,4.1226801660262816E-4,77.306038781374568,-136.10048038042638,43.899519619573624,null,1000000000,25119.080100000003,null,78.024338018515181,-82.453154642221719,null,65.656876015347649,-53.647325738204678,null,0,0]
[173.78,0.17377999999999999,1.8054320185838264,0.98377428756025476,1.000013168071691,5.1318470737394583E-3,1,0,10.568396636057923,1.4760328266300349,1.0007530868010566,3.8797280526743451E-2,1.0000339249258285,8.2369857074578758E-3,1,0,1,0,0.99999950563727424,4.5204077414350078E-4,75.976492867310213,-138.91745715436832,41.082542845631679,null,1000000000,30199.488400000002,null,77.23328642140693,-82.819475569480602,null,65.118381698391545,-56.097981584887705,null,0,0]
[190.55,0.19055000000000002,1.9278830389137078,1.0254623362083657,1.000015832151034,5.6270671145475541E-3,1,0,11.579528293811267,1.4843293176920784,1.0009053787570301,4.253695316121784E-2,1.0000407883123992,9.0318244050836549E-3,1,0,1,0,0.99999940562021761,4.9566336012000069E-4,74.614152830647186,-141.58675913956532,38.413240860434684,null,1000000000,36309.302500000005,null,76.440913222487183,-83.126102936505774,null,64.548414860648251,-58.460656203059571,null,0,0]
[208.93,0.20893,2.0654561020278441,1.065399648798343,1.0000190336873551,6.1698274625646664E-3,1,0,12.688495956641447,1.4919029640476749,1.0010883642996837,4.6634281414966026E-2,1.0000490362949066,9.9029582642745414E-3,1,0,1,0,0.99999928542516281,5.4347393930544391E-4,73.222606573226116,-144.09573071511102,35.904269284888983,null,1000000000,43651.744900000005,null,75.648043846338879,-83.375193585793795,null,63.949737979375492,-60.720537129317229,null,0,0]
[229.09,0.22909000000000002,2.2196447755049147,1.1034457700493052,1.0000228840427925,6.7651469165762694E-3,1,0,13.905557890794531,1.4988205060629285,1.0013083899340716,5.1126606670729796E-2,1.0000589557475128,1.0858439222571202E-2,1,0,1,0,0.99999914087103614,5.9591472738714868E-4,71.803548355671126,-146.43820794700403,33.561792052995969,null,1000000000,52482.2281,null,74.85430108627007,-83.568893297053819,null,63.324422521889304,-62.869314649950191,null,0,0]
[251.19,0.25119000000000002,2.3918606210259932,1.1394605979491093,1.0000275121273838,7.417748530979343E-3,1,0,15.240374426429453,1.5051339667671302,1.0015727954643661,5.6048850525043444E-2,1.0000708787400205,1.1905843420542073E-2,1,0,1,0,0.99999896711785308,6.5340193012744584E-4,70.360587576431854,-148.60733073778979,31.392669262210205,null,1000000000,63096.416100000002,null,74.060346435383138,-83.708615991087569,null,62.675416393536977,-64.898714746702211,null,0,0]
[275.42,0.27542,2.5837390437716916,1.1733814468525767,1.0000330757135121,8.1332406664044524E-3,1,0,16.704421859411752,1.5108961240486758,1.0018905560734996,6.1442369239095733E-2,1.0000852116809289,1.3054166423796835E-2,1,0,1,0,0.99999875824188689,7.1642979328241467E-4,68.89629665861986,-150.60038426634006,29.399615733659942,null,1000000000,75856.176400000011,null,73.266260965528602,-83.795531486874282,null,62.00521094557952,-66.80485277946579,null,0,0]
[302,0.30199999999999999,2.7971524125390337,1.2051998226970877,1.0000397677212962,8.9181167796783534E-3,1,0,18.310994117418577,1.5161571444370634,1.0022726346291853,6.7354864751227136E-2,1.000102451501365,1.4313822354944765E-2,1,0,1,0,0.99999850699961634,7.8557060371594559E-4,67.412559897166929,-152.41728049661151,27.582719503388489,null,1000000000,91204,null,72.471813558333892,-83.830377680359206,null,61.315921591321299,-68.586902816252291,null,0,0]
[331.13,0.33112999999999998,3.0338109196116401,1.2348969340607054,1.0000478092722169,9.7782787363316793E-3,1,0,20.072180193324645,1.5209554959307925,1.0027315758155719,7.382915891153348E-2,1.0001231677481008,1.5694273319755068E-2,1,0,1,0,0.99999820508841053,8.6134462898639368E-4,65.913328747156186,-154.05692709798873,25.943072902011266,null,1000000000,109647.0769,null,71.677957523060172,-83.813447252947498,null,60.610546476584268,-70.243479845041279,null,0,0]
[363.08,0.36307999999999996,{"$f":"SQRT(1+(A77/pole1)^2)","v":3.2959915620663049},{"$f":"ATAN(A77/pole1)","v":1.262538719688957},{"$f":"SQRT(1+(A77/Zero1)^2)","v":1.0000574801149544},{"$f":"ATAN(A77/Zero1)","v":1.0721694062651815E-2},{"$f":"IF(VIN_nom>Vout, 1, SQRT(1+(A77/z_RHP)^2))","v":1},{"$f":"IF(VIN_nom>Vout, 0, -ATAN(A77/z_RHP))","v":0},{"$f":"SQRT(1+(A77/Pole2)^2)","v":22.004304367784354},{"$f":"ATAN(A77/Pole2)","v":1.5253350151580773},{"$f":"SQRT(1+(A77/Zero2)^2)","v":1.0032832295210394},{"$f":"ATAN(A77/Zero2)","v":8.092306988912043E-2},{"$f":"SQRT(1+(A77/pole4)^2)","v":1.0001480809483363},{"$f":"ATAN(A77/pole4)","v":1.7208293194800758E-2},{"$f":"IF(VOUT_setting=1,1,SQRT(1+(A77*zterm1)^2))","v":1},{"$f":"IF(VOUT_setting=1,0,ATAN(((A77*zterm1))))","v":0},1,{"$f":"IF(VOUT_setting=1,0,ATAN(A77*$Q$4/(1+Afbr-$Q$5*(A77)^2)))","v":0},{"$f":"SQRT((1-(Z77/pterm2))^2+(A77/pterm1)^2)","v":0.99999784200407071},{"$f":"IF((ATAN((A77/pterm1)/(1-A77^2/pterm2))>0),ATAN((A77/pterm1)/(1-A77^2/pterm2)),PI()+ATAN((A77/pterm1)/(1-A77^2/pterm2)))","v":9.4445423025727891E-4},{"$f":"20*LOG10(((E77*K77*G77*O77)/(C77*I77*S77*M77*Q77))*Adc)","v":64.399763218405866},{"$f":"((F77+L77+H77+P77)-(D77+J77+T77+N77+R77))*radconv","v":-155.52261662493308},{"$f":"IF(V77>0,V77,V77+180)","v":24.477383375066921},null,{"$f":"IF(U77<0,A77,1000000000)","v":1000000000},{"$f":"A77^2","v":131827.0864},null,{"$f":"20*LOG10((K77/(I77*M77))*AEA)","v":70.884256466094428},{"$f":"(L77-(J77+N77))*radconv","v":-83.744671010570499},null,{"$f":"20*LOG10((E77*G77/(C77*S77))*Acs*Am)","v":59.890682004799686},{"$f":"(F77+H77-(D77+T77))*radconv","v":-71.777945614362579},null,{"$f":"SUM((U78<0)*(U77>0))*A77","v":0},{"$f":"IF(AH77>0,W75,0)","v":0}]
[398.11,{"$f":"A78/1000","v":0.39811000000000002},3.5858958903784663,1.2881787469468813,1.0000691061380256,1.1756033220858057E-2,1,0,24.123090110482686,1.5293303859214908,1.0039460183512738,8.8691442777432322E-2,1.0001780304148513,1.8868174607319054E-2,1,0,1,0,0.99999740550942373,1.0355757657682155E-3,62.874606450066544,-156.81656668752723,23.183433312472772,null,1000000000,158491.57210000002,null,70.091226636310182,-83.623598112011095,null,59.158555066244617,-73.192968575516119,null,0,0]
[436.52,0.43651999999999996,3.9060596424345309,1.311901387157965,1.0000830836768655,1.2890145449824192E-2,1,0,26.446683044249877,1.5329753856186499,1.0047422963034351,9.7197023486969153E-2,1.0002140368277874,2.0688096011429024E-2,1,0,{"$f":"IF(VOUT_setting=1,1,SQRT((1+Afbr-$Q$5*(A79)^2)^2+(A79*$Q$4)^2))","v":1},0,0.99999688072140225,1.1354896557412234E-3,61.339716885387091,-157.94230168932259,22.057698310677409,null,1000000000,190549.71039999998,null,69.299034991935343,-83.449381149322377,null,58.415857145940002,-74.492920540000213,null,0,0]
[478.63,0.47863,4.2591916038620123,1.3337975706627077,1.000099885764747,1.4133467454983149E-2,1,0,28.99444148608924,1.5363001162214991,1.0056986645480441,0.10650571049509215,1.0002573182847461,2.2683170836961072E-2,1,0,1,0,0.99999624987587743,1.2450283615866248E-3,59.797119323751048,-158.90335351525675,21.096646484743246,null,1000000000,229086.67689999999,null,68.50805216982333,-83.220835069564544,null,57.664242406415973,-75.682518445692182,null,0,0]
[524.80999999999995,0.52481,4.6484273872012754,1.353974947067522,1.0001200890980884,1.5496908175092418E-2,1,0,31.788751469220891,1.5393334678250006,1.0068474487210697,0.11669278226257673,1.000309359687036,2.4870864690936717E-2,1,0,1,0,0.99999549131454446,1.3651544287631861E-3,58.248013547158777,-159.70366299507975,20.296337004920247,null,1000000000,275425.53609999997,null,67.718341811582093,-82.936302720725067,null,56.904846988064939,-76.767360274354687,null,0,0]
[575.44000000000005,0.57544000000000006,5.0769955085920673,1.3725330916098015,1.0001443757325639,1.699166645212587E-2,1,0,34.852606556915504,1.5421001299454908,1.0082267121349917,0.12783353436665046,1.0003719169991392,2.7269094857177739E-2,1,0,1,0,0.99999457942024117,1.4968564436538814E-3,56.694329308966111,-160.34647743612544,19.65352256387456,null,1000000000,331131.19360000006,null,66.930453288438713,-82.593911173838293,null,56.139051273015646,-77.752566262287147,null,0,0]
[630.96,0.63096000000000008,5.54864016544831,1.3895818078579778,1.000173576697641,1.8630705513620595E-2,1,0,38.212633241184491,1.5446239830028541,1.0098826157035845,0.14001362648593754,1.0004471294353889,2.9898591772481942E-2,1,0,1,0,0.99999348297793356,1.6412791056888143E-3,55.137163653405821,-160.83505904341226,19.164940956587742,null,1000000000,398110.52160000004,null,66.144620155558641,-82.191308504650237,null,55.367718750335435,-78.643750538762006,null,0,0]
[691.83,0.69183000000000006,6.0672843098359008,1.4052224517520393,1.0002086790856877,2.0427569753377492E-2,1,0,41.896670405165068,1.5469258148059386,1.0118696493101236,0.15331939990796192,1.0005375374906624,3.278099486791991E-2,1,0,1,0,0.99999216490644816,1.79961918895125E-3,53.578161935561553,-161.17199152844711,18.828008471552891,null,1000000000,478628.74890000006,null,65.361457850154849,-81.725978623568963,null,54.591879337894966,-79.446012904878145,null,0,0]
[758.58,0.75858000000000003,6.6374555812534384,1.4195603238872685,1.00025088445743,2.2397857761302424E-2,1,0,45.936795296289226,1.5490255656380054,1.014253697996838,0.1678477016593479,1.0006462330412196,3.594120806925348E-2,1,0,1,0,0.99999058006241937,1.9732556220276275E-3,52.018269947695366,-161.35951390237139,18.64048609762861,null,1000000000,575443.61640000006,null,64.581331219488703,-81.194941988619675,null,53.812113980694917,-80.164571913751715,null,0,0]
[831.76,0.83175999999999994,7.2638610021370278,1.4326898864488296,1.0003016171468828,2.4557742389607659E-2,1,0,50.366297354475172,1.5509404754679119,1.0171121650015704,0.18369351749902227,1.0007768802573227,3.9405015875607831E-2,1,0,1,0,0.99998867492409127,2.16361944487088E-3,50.459133459327852,-161.39921664342646,18.600783356573544,null,1000000000,691824.69759999996,null,63.80505559415311,-80.595221437129837,null,53.029253117663004,-80.803995206296605,null,0,0]
[912.01,0.91200999999999999,7.9519857406844698,1.4447077399155481,1.0003626151315563,2.6926031667274863E-2,1,0,55.223915069280416,1.5526872402272507,1.0205386073990619,0.20096333763648569,1.0009339489349769,4.3202375628349728E-2,1,0,1,0,0.99998638417272578,2.3723759276760414E-3,48.901626996591588,-161.29222393969869,18.707776060301313,null,1000000000,831762.24009999994,null,63.033160937850354,-79.923388565172701,null,52.243641311229496,-81.368835374526,null,0,0]
[1000,1,8.7075803404523313,1.4556999117197644,1.0004359440978154,2.9522390959911455E-2,1,0,60.550204291017721,1.5542803550315707,1.0246428269159986,0.21975981305929396,1.0011227497165369,4.7364548969716987E-2,1,0,1,0,0.99998363015526937,2.6012685293801637E-3,47.347304320225675,-161.03917815112689,18.96082184887311,null,1000000000,1000000,null,62.266615617770348,-79.176183573500168,null,51.455863954943588,-81.862994577626708,null,0,0]
[1096.5,1.0965,9.5372613222485576,1.4657513446815418,1.0005241178274424,3.2369399547422024E-2,1,0,66.391775398242942,1.5557336505968578,1.029556638661089,0.24019385415950986,1.0013497426328175,5.1927376370965145E-2,1,0,1,0,0.99998031835001366,2.8523010396947317E-3,45.79718693027354,-160.64025850607425,19.359741493925753,null,1000000000,1202312.25,null,61.506227808703684,-78.350097714131181,null,50.666134374058117,-82.29016079194308,null,0,0]
[1202.3,1.2022999999999999,10.447824115905359,1.4749358710448002,1.0006301070600225,3.549017823016299E-2,1,0,72.796450607767184,1.5570589612382137,1.0354329923407561,0.26236399622267342,1.0016225578532865,5.6927444611507554E-2,1,0,1,0,0.99997633701480304,3.1275295342501497E-3,44.253248727101123,-160.09561702904685,19.904382970953151,null,1000000000,1445525.2899999998,null,60.753378350132181,-77.442259655423058,null,49.875045629457198,-82.653357373623749,null,0,{"$f":"IF(AH90>0,W90,0)","v":0}]
[1318.3,1.3183,11.447016657769737,1.4833258224147285,1.0007575119695873,3.891102906636891E-2,1,0,79.818712007707745,1.558267608443159,1.0424536696436708,0.28637113586429902,1.0019504367274144,6.2406278935560125E-2,1,0,1,0,0.9999715506814626,3.4292965810432921E-3,42.717029131845081,-159.40527218253078,20.59472781746922,null,1000000000,1737914.89,null,60.009340561577595,-76.449916341826039,null,49.082863822755733,-82.955355840704698,null,0,0]
[1445.4,1.4454,12.542592217943026,1.4909832818369324,1.0009105501667399,4.2658171202123153E-2,1,0,87.513042538712924,1.5593692099390772,1.0508260342356817,0.31229060283216059,1.0023441967024309,6.8405065053233738E-2,1,0,1,0,0.99996580056784867,3.7599451904886702E-3,41.19121453327076,-158.57000780714858,21.429992192851415,null,1000000000,2089181.1600000001,null,59.276047611488394,-75.371662519272519,null,48.29034217427062,-83.198345287876066,null,0,0]
[1584.9,1.5849000000000002,13.745758220503122,1.4979822864017809,1.0010946909876484,4.6769504935991184E-2,1,0,95.958141148280802,1.5603749275348677,1.060814042280297,0.34024693352611324,1.0028178570610655,7.4983411512198547E-2,1,0,1,0,0.99995888068797623,4.1228595627074904E-3,39.675128792478738,-157.58900772157747,22.410992278422526,null,1000000000,2511908.0100000002,null,58.55393189536791,-74.204417620397578,null,47.496372149599082,-83.384590101179882,null,0,0]
[1737.8,1.7378,15.065141133516372,1.5043690826222915,1.0013159499768276,5.1273940591295954E-2,1,0,105.21454626478241,1.5612917944684965,1.0726947721436453,0.37026458820038571,1.0033868148703959,8.2186174656389943E-2,1,0,1,0,0.9999505642791704,4.5206442307757855E-3,38.172962727238492,-156.46498602978616,23.535013970213839,null,1000000000,3019948.84,null,57.845864152475457,-72.949753229913526,null,46.702273827251297,-83.515232799872635,null,0,0]
[1905.5,1.9055,16.512822326092998,1.5102002504094405,1.0015819763117078,5.6211984173174669E-2,1,0,115.36701240266892,1.5621282291997882,1.0868108034406785,0.40240098491274928,1.0040706294123387,9.0076288273330418E-2,1,0,1,0,0.99994056281934618,4.9569453775158128E-3,36.685915861138248,-155.19987097988246,24.800129020117538,null,1000000000,3630930.25,null,57.153385146502799,-71.60846771807492,null,45.907705967123704,-83.591403261807557,null,0,0]
[2089.3000000000002,2.0893000000000002,18.100024611596684,1.5155196376674138,1.0019015788485093,6.1620944410343909E-2,1,0,126.49424083400251,1.5628907461941506,1.1035358234428214,0.43663906870542585,1.0048917849386332,9.8710957114242631E-2,1,0,1,0,0.99992854366906636,5.4351503757769024E-3,35.217401320853476,-153.7988593404834,26.201140659516597,null,1000000000,4365174.4900000012,null,56.479152144418649,-70.185189104174313,null,45.113424428923082,-83.613670236309076,null,0,0]
[2290.9,2.2909000000000002,19.841428702153138,1.520375369066153,1.002285817981291,6.7549571736815764E-2,1,0,138.69914933201213,1.5635864147754366,1.1233206021596258,0.47297325194936302,1.0058784703335666,0.1081648467963144,1,0,1,0,0.99991408877000865,5.9596890818926357E-3,33.768742398178716,-152.26717228474897,27.732827715251034,null,1000000000,5248222.8100000005,null,55.824912679578759,-68.684920602939982,null,44.319004971088205,-83.582251681809026,null,0,0]
[2511.9,2.5119000000000002,21.750855685270984,1.5248049121798908,1.002747476271318,7.404323686587308E-2,1,0,152.07860226138484,1.5642207323879691,1.1466501041863191,0.51130719366448196,1.0070631809294208,0.11850617032863903,1,0,1,0,0.99989671419392945,6.5347335362954005E-3,32.34325845981477,-150.61433926592585,29.38566073407415,null,1000000000,6309641.6100000003,null,55.193346089378075,-67.117405443822477,null,43.52508762292495,-83.496933822103358,null,0,0]
[2754.2,2.7542,23.844721525549957,1.5288460207762442,1.0033021738752019,8.1155559850125236E-2,1,0,166.74762656697487,1.5647992039880512,1.1740820392658511,0.55151964788474239,1.0084855290428547,0.12981492086117064,1,0,1,0,0.99987582767005156,7.1652394516842684E-3,30.94318581520184,-148.85158071706428,31.14841928293572,null,1000000000,7585617.6399999987,null,54.586606651927703,-65.494489189617326,null,42.731754415762396,-83.35709152744694,null,0,0]
[3020,3.02,26.142038212375361,1.5325344273574604,1.0039689748226432,8.8948207727005096E-2,1,0,182.83941193521099,1.5653270191932838,1.2062518031708098,0.59345355395555166,1.01019371899849,0.14218208299008903,1,0,1,0,0.99985070499440676,7.8569473282949602E-3,29.570118696779591,-146.99224889438889,33.007751105611106,null,1000000000,9120400,null,54.006494317650564,-63.830681129524471,null,41.938799631617286,-83.161567764864429,null,0,0]
[3311.3,3.3113000000000001,28.66009193278142,1.5358975198063989,1.004769666648067,9.7476001053986142E-2,1,0,200.4750402701778,1.5658081539747672,1.2438091950769561,0.63683504229615739,1.0122425927857337,0.15568547119826739,1,0,1,0,0.99982051611527789,8.615082581449985E-3,28.227449751013761,-145.05544923462091,34.944550765379091,null,1000000000,10964707.690000001,null,53.455401325706802,-62.146359082498442,null,41.147223677795211,-82.909090152122445,null,0,0]
[3630.8,3.6308000000000002,31.422222036661069,1.5389663410990231,1.0057317502133787,0.10681297662048145,1,0,219.81797258415739,1.5662470925466332,1.2875262575251305,0.68141342700483654,1.014701129625865,0.17043038336322833,1,0,1,0,0.99978421092229186,9.446699484953228E-3,26.915809912743587,-143.05977584851223,36.940224151487769,null,1000000000,13182708.640000001,null,52.934319458002939,-60.462176343232947,null,40.356665707228892,-82.597599505279277,null,0,0]
[3981.1,3.9811000000000001,34.450906137042558,1.5417654364239217,1.0068871362625211,0.11702854331799691,1,0,241.02561616526728,1.566647378293579,1.3381931012890542,0.72684252586991027,1.0176488846616694,0.18651094049252215,1,0,1,0,0.99974056614225559,1.0358601509123056E-2,25.636944028706314,-141.02847858255046,38.971521417449537,null,1000000000,15849157.209999999,null,52.444376879161403,-58.803563448913188,null,39.567742402033169,-82.224915133637253,null,0,0]
[4365.2,4.3651999999999997,37.772082190760649,1.5443186534424538,1.0082744793273462,0.12820158713022298,1,0,264.27959513420893,1.5670124463716351,1.3966775569579399,0.77276248345272469,1.0211816423799589,0.20403133608927551,1,0,1,0,0.99968809411211457,1.1358645695533917E-2,24.391392015589478,-138.98563901429776,41.01436098570224,null,1000000000,19054971.039999999,null,51.985814856683277,-57.197305265363873,null,38.78075241139446,-81.78833374893388,null,0,0]
[4786.3,4.7862999999999998,41.413419465686076,1.5466472172526617,1.0099396767460835,0.14041394587267467,1,0,289.77364219166884,1.5673453504489725,1.4638922048333887,0.81878313586426177,1.0254122479369867,0.22309421052307038,1,0,1,0,0.99962501934758963,1.2455226090185232E-2,23.179313857580702,-136.95667580073805,43.043324199261946,null,1000000000,22908667.690000001,null,51.558258763805611,-55.67181235905953,null,37.996230346263346,-81.284863441678525,null,0,0]
[5248.1,5.2481,45.406912661050718,1.5487714676922553,1.0119383685565229,0.15375822280782517,1,0,317.73176107715352,1.5676490126971723,1.5408369477698567,0.86452976608016308,1.0304763499221141,0.24381120772422335,1,0,1,0,0.99954917736581383,1.3658060299223094E-2,21.99965393790788,-134.96603918858776,45.033960811412243,null,1000000000,27542553.610000003,null,51.160384901776112,-54.255118588153636,null,37.214444288620022,-80.710920600434164,null,0,0]
[5370.3,5.3703000000000003,46.463688277281548,1.5492724819624613,1.0124973298714923,0.15728032441191905,1,0,325.12995108462201,1.5677206286830527,1.5617035517500539,0.87587320431653715,1.0318899324573956,0.24925849514705786,1,0,1,0,0.99952794076556351,1.3976400443225323E-2,21.709805194584906,-134.47746191770639,45.522538082293607,null,1000000000,28840122.090000004,null,51.065389280415317,-53.921397324520477,null,37.01959116665784,-80.556064593185923,null,0,0]
[5432.85,5.4328500000000002,47.00461992641138,1.5495202171055895,1.0127882989849646,0.15908165205168501,1,0,328.91683210862618,1.5677560398805777,1.5724606446938016,0.88156266036970909,1.0326253200663191,0.25204096245896374,1,0,1,0,0.99951688142528206,1.4139356328595946E-2,21.564713230398596,-134.23325503496446,45.766744965035542,null,1000000000,29515859.122500002,null,51.01824272505791,-53.756868050531558,null,36.921645757828941,-80.476386984432878,null,0,0]
[5495.4,5.4954000000000001,47.545554394700133,1.5497623152072286,1.0130825524810034,0.16088193912590321,1,0,332.70371353568748,1.5677906449674783,1.5832679454353094,0.88717462419078597,1.0333686909740596,0.25481944802856743,1,0,1,0,0.99950569407518763,1.4302318027488626E-2,21.421757366619541,-133.99295078072365,46.007049219276354,null,1000000000,30199421.159999996,null,50.972053834719105,-53.596504430625899,null,36.824878784388694,-80.396446350097776,null,0,0]
[5559.4,5.5593999999999992,48.099031329670886,1.5500043892700583,1.0133870236870173,0.16272287122496795,1,0,336.57838078651059,1.567825246273074,1.5943766772999106,0.89283775269198895,1.0341375393834775,0.25765818593083994,1,0,1,0,0.99949411489270457,1.4469063502902895E-2,21.27763858317174,-133.7510536226857,46.248946377314297,null,1000000000,30906928.359999996,null,50.925752653894669,-53.436661278204376,null,36.727061181765322,-80.31439234448132,null,0,0]
[5623.4,5.6233999999999993,48.65251101910826,1.5502409555905969,1.0136949272231774,0.16456269121272418,1,0,340.45304843113001,1.5678590599895843,1.6055358339246224,0.89842233593028598,1.0349147088995816,0.26049268314409008,1,0,1,0,0.99948240170089986,1.4635815206701925E-2,21.135636543481958,-133.51311718336027,46.486882816639735,null,1000000000,31622627.559999995,null,50.880388727121819,-53.281030338739143,null,36.630423068848394,-80.232086844621108,null,0,0]
[5688.9,5.6888999999999994,49.21896564385861,1.5504775574147704,1.0140135979262372,0.16644446853302122,1,0,344.41852899255019,1.5678928784585702,1.6170076552147064,0.90405781696696375,1.0357186897091795,0.26338918543434453,1,0,1,0,0.9994702752260175,1.4806481677680875E-2,20.992438361521938,-133.27363977228828,46.726360227711723,null,1000000000,32363583.209999997,null,50.834899504058569,-53.126036071758435,null,36.532714109951627,-80.147603700529856,null,0,0]
[5754.4,5.7543999999999995,49.785422961208255,1.5507087751521769,1.0143358570749559,0.16832505681058374,1,0,348.38400993891059,1.5679259270501558,1.6285301060322928,0.90961372616960767,1.0365313463920296,0.26628117015040281,1,0,1,0,0.99945800839110754,1.4977154824877444E-2,20.851338230374104,-133.03817856701946,46.961821432980543,null,1000000000,33113119.359999996,null,50.790327152370253,-52.975297986379985,null,36.436186330492106,-80.062880580639472,null,0,0]
[5821.4,5.8213999999999997,50.364855274620801,1.5509399068673118,1.0146692052933775,0.17024746911650843,1,0,352.440303810746,1.5679589630457427,1.6403676994595513,0.91521593826344771,1.0373715684500948,0.26923467028099307,1,0,1,0,0.99944531542041803,1.5151743505136163E-2,20.709118060965842,-132.80141132793295,47.198588672067046,null,1000000000,33888697.959999993,null,50.745650421963013,-52.825430792687854,null,36.338642891491084,-79.975980535245114,null,0,0]
[5888.4,5.8883999999999999,50.944290217413425,1.5511657808591568,1.0150063009222492,0.17216861160658326,1,0,356.49659805847347,1.5679912472601711,1.6522560368379184,0.92073770334770033,1.0382208249766645,0.27218336421855177,1,0,1,0,0.9994324755924201,1.5326339334145704E-2,20.568974716335788,-132.568706833839,47.431293166160998,null,1000000000,34673254.559999995,null,50.701868832790247,-52.679854424660704,null,36.242281136033796,-79.888852409178327,null,0,0]
[5957,5.9569999999999999,51.537565044268199,1.5513917864769993,1.0153553254123813,0.17413430298097629,1,0,360.64975941072328,1.5680235500071984,1.6644797153734487,0.92630943230419394,1.0390996997878692,0.27519745382750777,1,0,1,0,0.99941917698462479,1.5505112108878245E-2,20.427577327261702,-132.33458197846704,47.665418021532957,null,1000000000,35485849,null,50.657937215089142,-52.535163295436206,null,36.144815364660815,-79.79941868303078,null,0,0]
[6025.6,6.0256000000000007,52.130842443668961,1.5516126479716925,1.015708270472065,0.1760986358380621,1,0,364.80292113073057,1.5680551172418777,1.6767543119698551,0.93179975450380004,1.0399879985406724,0.27820642180470206,1,0,1,0,0.99940572442721742,1.5683892553057861E-2,20.288239178016624,-132.10456933724501,47.89543066275499,null,1000000000,36307855.360000007,null,50.614880341303376,-52.394800840172685,null,36.048534089201503,-79.70976849707229,null,0,0]
[6095.8,6.0958000000000006,52.737959789484329,1.5518335163663262,1.0160735020224323,0.17810736329368157,1,0,369.05294996416444,1.5680866852006725,1.6893667518606326,0.93733536378185867,1.0409067466639106,0.28128022449723694,1,0,1,0,0.99939179873302852,1.5866850835849648E-2,20.147724136847472,-131.87337287933181,48.126627120668189,null,1000000000,37158777.640000001,null,50.571693162230801,-52.255558423492346,null,35.951206227104933,-79.617814455839437,null,0,0]
[6166,6.1660000000000004,53.345079649447811,1.5520493573689622,1.0164428304591626,0.18011463908595893,1,0,373.30297915699856,1.568117534361342,1.7020301908347124,0.94278876606511264,1.0418353121480188,0.28434857690860948,1,0,1,0,0.99937771183022051,1.604981733784874E-2,20.009248172769915,-131.64632866983064,48.353671330169362,null,1000000000,38019556,null,50.529359003596745,-52.120672658459078,null,35.855064421661417,-79.525656011371595,null,0,0]
[6237.8,6.2378,53.966039511409363,1.5522650940830229,1.0168248099996722,0.1821661478827678,1,0,377.64987547119625,1.5681483683721189,1.7150338335674415,0.94828298739595063,1.042795169727861,0.28748118028719022,1,0,1,0,0.99936313709975833,1.6236962617907805E-2,19.869666917423409,-131.41832522898019,48.581674771019806,null,1000000000,38910148.840000004,null,50.486911108862074,-51.98712857550278,null,35.757931061049597,-79.431196653477429,null,0,0]
[6309.6,6.3096000000000005,54.587001827931751,1.5524759225184652,1.01721106581436,0.18421610730221469,1,0,381.99677213626791,1.5681785006374203,1.7280884670731942,0.95369435918055523,1.0437652415897942,0.29060799144069005,1,0,1,0,0.99934839373503326,1.642411669718E-2,19.732102263943389,-131.19450469365509,48.805495306344909,null,1000000000,39811052.160000004,null,50.445293367337804,-51.85795934478007,null,35.66198414909384,-79.336545348875021,null,0,0]
[6383.05,6.3830499999999999,55.222236623317848,1.5526866897525096,1.0176106177135462,0.18631155650838169,1,0,386.44356301692136,1.5682086239276827,1.7414946688687454,0.95914597575375649,1.0447681455950717,0.29380061803180285,1,0,1,0,0.99933313707221627,1.6615580881910813E-2,19.593404933637501,-130.96978580584533,49.030214194154667,null,1000000000,40743327.302500002,null,50.403547379118294,-51.730254690095236,null,35.565032807007462,-79.23953111575014,null,0,0]
[6456.5,6.4565000000000001,55.857473816035721,1.5528926631093449,1.0180146343278613,0.18840535167205411,1,0,390.89035424026031,1.5682380618493954,1.7549518364537806,0.96451414262515711,1.0457816782921805,0.29698708870014617,1,0,1,0,0.99931770394275621,1.6807054490215707E-2,19.456702351754629,-130.74927689728975,49.250723102710253,null,1000000000,41686392.25,null,50.362608788582662,-51.606939374011205,null,35.469268815660214,-79.14233752327857,null,0,0]
[6531.7,6.5316999999999998,56.507848398993069,1.5530987461761316,1.018432896929683,0.19054730230957986,1,0,395.44309386157175,1.5682675152380927,1.768781217835989,0.96992542395210568,1.0468303384706885,0.30024305289333392,1,0,1,0,0.99930172028820141,1.7003099974102199E-2,19.318751680325722,-130.52778941394436,49.472210586055638,null,1000000000,42663104.890000001,null,50.321500842692579,-51.485136353460007,null,35.372426090121401,-79.042653060484369,null,0,0]
[6606.9,6.6068999999999996,57.158225327237162,1.5533001394040948,1.0188558282044504,0.19268748449423678,1,0,399.99583381812175,1.5682962981517332,1.7826615881355534,0.97525259133814701,1.0478900741342307,0.30349246593605084,1,0,1,0,0.99928555166592337,1.7199155566982191E-2,19.182777018752446,-130.31054073186922,49.689459268130776,null,1000000000,43651127.609999992,null,50.281178641988802,-51.367738938062089,null,35.276773629251892,-78.942801793807106,null,0,0]
[6683.85,6.6838500000000005,57.823739702102777,1.5535015295617824,1.0192934284730251,0.19487562264458574,1,0,404.65452218069663,1.5683250804278603,1.7969165222820693,0.98061837764098536,1.0489859012751126,0.30681066460671486,1,0,1,0,0.99926881530899325,1.7399784210344799E-2,19.045626313854548,-130.0925346046387,49.907465395361299,null,1000000000,44673850.822500005,null,50.240701452833456,-51.25206991137,null,35.18010011350934,-78.8404646932687,null,0,0]
[6760.8,6.7608000000000006,58.489256368813706,1.5536983367144621,1.019735904863887,0.19706187233305544,1,0,409.31321087086422,1.5683532075203479,1.8112223774189153,0.98589955118172445,1.0500932540351291,0.3101219014048624,1,0,1,0,0.99925188528406195,1.7600423686343496E-2,18.910430573635686,-129.8787862411196,50.121213758880401,null,1000000000,45708416.640000001,null,50.200987293648716,-51.140812413674141,null,35.084618532475233,-78.737973827445444,null,0,0]
[6839.55,6.83955,59.170342969047923,1.5538951638199232,1.0201937735074444,0.19929728789670784,1,0,414.08087506271056,1.5683813372789517,1.8259143451713171,0.99121842769172841,1.0512384049569388,0.31350333329876862,1,0,1,0,0.99923435872350563,1.7805767829840426E-2,18.774039636283788,-129.66435339573019,50.335646604269812,null,1000000000,46779444.202500001,null,50.161104592516779,-51.03141673045311,null,34.988110296255257,-78.632936665277086,null,0,0]
[6918.3,6.9183000000000003,59.851431809423666,1.5540875112823025,1.0206567355549094,0.20153068667782148,1,0,418.84853957475298,1.5684088266473681,1.8406571433863665,0.99645224690194256,1.0523955495857327,0.31687736770303182,1,0,1,0,0.99921662933809752,1.8011123584217817E-2,18.63958299525251,-129.45419299178974,50.545807008210261,null,1000000000,47862874.890000001,null,50.121962245857645,-50.92643393494135,null,34.89279600188312,-78.527759056848367,null,0,0]
[6998.9,6.9988999999999999,60.548523072885899,1.5542798963998006,1.0211358405970041,0.20381444382509065,1,0,423.72820668450885,1.5684363212241177,1.855797651720176,1.0017227612982795,1.0535922563376117,0.32032295033757613,1,0,1,0,0.99919827343002299,1.8221315732435951E-2,18.503914310355306,-129.24342375918812,50.756576240811881,null,1000000000,48984601.209999993,null,50.082637917017522,-50.823448370180827,null,34.796451645826039,-78.419975389007305,null,0,0]
[7079.5,7.0795000000000003,61.245616526357836,1.5544679020954071,1.0216202664093563,0.20609604706609158,1,0,428.60787410728926,1.5684631897536367,1.8709888758451392,1.0069078314254829,1.0548014429099393,0.32376067392243174,1,0,1,0,0.99917970506615961,1.843152032823191E-2,18.370159569591685,-129.03693716289533,50.963062837104673,null,1000000000,50119320.25,null,50.044031296549292,-50.724872241188038,null,34.701303525530648,-78.312064921707318,null,0,0]
[7161.95,7.16195,61.958712452729912,1.554655845804908,1.0221213086505403,0.20842776942578223,1,0,433.59954413489737,1.5684900492629823,1.88657997981694,1.0121253700955808,1.0560512518460194,0.32726911495573474,1,0,1,0,0.99916049068456436,1.8646562748968209E-2,18.235259267076792,-128.83004357207841,51.169956427921591,null,1000000000,51293527.802499995,null,50.005252576536421,-50.62848709623907,null,34.605181943028626,-78.201556475839368,null,0,0]
[7244.4,7.2443999999999997,62.671810517855555,1.5548395125645318,1.0226279026296972,0.21075719424190775,1,0,438.5912144681983,1.5685162973883902,1.9022215989161451,1.0172572408377134,1.0573140290596705,0.33076921854515068,1,0,1,0,0.99914105399387498,1.8861618500262932E-2,18.102250560122727,-128.62743301406962,51.372566985930376,null,1000000000,52481331.359999992,null,49.967168118867136,-50.536497631941216,null,34.510257693743839,-78.090935382128436,null,0,0]
[7328.75,7.3287500000000003,63.401343544795658,1.5550231363405562,1.0231519072127497,0.21313789859723301,1,0,443.6979145022695,1.5685425392202685,1.9182746537742552,1.022420626833574,1.0586192776430829,0.33434129346544317,1,0,1,0,0.99912093935250534,1.9081644009957877E-2,17.968078957764416,-128.42448424017522,51.575515759824782,null,1000000000,53710576.5625,null,49.928896455780674,-50.446825769529589,null,34.414357754471993,-77.977658470645636,null,0,0]
[7413.1,7.4131,64.130878660845937,1.5552025824160658,1.0236817048123821,0.21551615219450851,1,0,448.80461483493275,1.5685681838694834,1.9343780012706195,1.0274981778186727,1.0599380005430901,0.33790452535676546,1,0,1,0,0.99910059205075041,1.9301683798362234E-2,17.83577704327206,-128.22581443744758,51.774185562552418,null,1000000000,54954051.610000007,null,49.891295760779961,-50.361531006689766,null,34.319656534980354,-77.864283430757794,null,0,0]
[7499.45,7.4994499999999995,64.877713676826332,1.5553821029553314,1.0242300555933264,0.21794823321337164,1,0,454.03239905458071,1.5685938390196303,1.9509139661170152,1.032609158546425,1.0613018962150425,0.34154302418196147,1,0,1,0,0.999079521305832,1.9526955853669033E-2,17.702220083102173,-128.02676230005287,51.973237699947134,null,1000000000,56241750.302499995,null,49.853471060988184,-50.278633939995373,null,34.223924274602233,-77.748128360057478,null,0,0]
[7585.8,7.5857999999999999,65.62455073607164,1.5555575374503317,1.0247844582091792,0.22037769710542066,1,0,459.26018356626338,1.5686189101017582,1.9675000355847816,1.0376340973361746,1.0626798059426397,0.34517213532563523,1,0,1,0,0.99905820675053381,1.9752243223327574E-2,17.570513410114014,-127.83198537808596,52.16801462191404,null,1000000000,57544361.640000001,null,49.816294921477528,-50.200095374051557,null,34.129393741124744,-77.631890004034375,null,0,0]
[7674.15,7.67415,66.388687743447349,1.555732949997646,1.0253579551236625,0.22286069693868324,1,0,464.60905197181512,1.5686439779160761,1.9845208126466221,1.0426883560557512,1.0641040781085205,0.34887552450129633,1,0,1,0,0.99903614617820524,1.9982764633569711E-2,17.437617031924479,-127.63701542583746,52.362984574162539,null,1000000000,58892578.222499996,null,49.778902069176027,-50.124132530387676,null,34.03389021523671,-77.512882895449806,null,0,0]
[7762.5,7.7625000000000002,67.152826747084617,1.5559043704748758,1.0259377665751472,0.22534090550092642,1,0,469.95792066267916,1.5686684751072055,2.0015914224058089,1.0476565292150393,1.0655429054272052,0.35256896267464166,1,0,1,0,0.99901383038589386,2.021330245145447E-2,17.306549656129217,-127.44630710751061,52.553692892489394,null,1000000000,60256406.25,null,49.742134717148744,-50.05249918127528,null,33.939590191468739,-77.39380792623534,null,0,0]
[7852.9,7.8529,67.934698193339486,1.5560757768657274,1.0265375563411683,0.22787574672392025,1,0,475.43090034415201,1.5686929701627803,2.0191083865308923,1.0526528998409352,1.067030122338658,0.35633773739954555,1,0,1,0,0.99899073263310501,2.0449206658689895E-2,17.174280601096676,-127.25547598092953,52.744524019070468,null,1000000000,61668038.409999996,null,49.705135358391942,-49.983566580425467,null,33.844320495192989,-77.271909400504043,null,0,0]
[7943.3,7.9432999999999998,{"$f":"SQRT(1+(A141/pole1)^2)","v":68.716571590105758},{"$f":"ATAN(A141/pole1)","v":1.5562432826565331},{"$f":"SQRT(1+(A141/Zero1)^2)","v":1.027143934314203},{"$f":"ATAN(A141/Zero1)","v":0.23040761129472195},{"$f":"IF(VIN_nom>Vout, 1, SQRT(1+(A141/z_RHP)^2))","v":1},{"$f":"IF(VIN_nom>Vout, 0, -ATAN(A141/z_RHP))","v":0},{"$f":"SQRT(1+(A141/Pole2)^2)","v":480.90388030439414},{"$f":"ATAN(A141/Pole2)","v":1.5687169076809744},{"$f":"SQRT(1+(A141/Zero2)^2)","v":2.0366748873508072},{"$f":"ATAN(A141/Zero2)","v":1.057563203016417},{"$f":"SQRT(1+(A141/pole4)^2)","v":1.0685324526724755},{"$f":"ATAN(A141/pole4)","v":0.36009596777159503},{"$f":"IF(VOUT_setting=1,1,SQRT(1+(A141*zterm1)^2))","v":1},{"$f":"IF(VOUT_setting=1,0,ATAN(((A141*zterm1))))","v":0},1,{"$f":"IF(VOUT_setting=1,0,ATAN(A141*$Q$4/(1+Afbr-$Q$5*(A141)^2)))","v":0},{"$f":"SQRT((1-(Z141/pterm2))^2+(A141/pterm1)^2)","v":0.99896736769581573},{"$f":"IF((ATAN((A141/pterm1)/(1-A141^2/pterm2))>0),ATAN((A141/pterm1)/(1-A141^2/pterm2)),PI()+ATAN((A141/pterm1)/(1-A141^2/pterm2)))","v":2.0685128446405854E-2},{"$f":"20*LOG10(((E141*K141*G141*O141)/(C141*I141*S141*M141*Q141))*Adc)","v":17.043819599574658},{"$f":"((F141+L141+H141+P141)-(D141+J141+T141+N141+R141))*radconv","v":-127.0688881335352},{"$f":"IF(V141>0,V141,V141+180)","v":52.931111866464803},null,{"$f":"IF(U141<0,A141,1000000000)","v":1000000000},{"$f":"A141^2","v":63096014.890000001},null,{"$f":"20*LOG10((K141/(I141*M141))*AEA)","v":49.668738608624992},{"$f":"(L141-(J141+N141))*radconv","v":-49.918929189787669},null,{"$f":"20*LOG10((E141*G141/(C141*S141))*Acs*Am)","v":33.750256243437924},{"$f":"(F141+H141-(D141+T141))*radconv","v":-77.149958943747535},null,{"$f":"SUM((U142<0)*(U141>0))*A141","v":0},0]
[8035.8,{"$f":"A142/1000","v":8.0358000000000001},69.516609925422273,1.5564107793326682,1.0277712058880955,0.23299518179358875,1,0,486.50399835219156,1.5687408437823094,2.0546994103622853,1.0625005422241405,1.0700852599982331,0.36393052337844861,1,0,1,0,0.99894318343126653,2.0926549128397278E-2,16.91214646462095,-126.88224709487301,53.117752905126991,null,1000000000,64574081.640000001,null,49.632094411638434,-49.857115781255452,null,33.655227305470774,-77.025131313617564,null,0,0]
[8128.3,8.1282999999999994,70.316650166657141,1.5565744645666357,1.0284053505042705,0.23557957843635888,1,0,492.10411667238111,1.5687642351005715,2.0727731496141555,1.0673518948026528,1.0716537559292256,0.36775391038794114,1,0,{"$f":"IF(VOUT_setting=1,1,SQRT((1+Afbr-$Q$5*(A143)^2)^2+(A143*$Q$4)^2))","v":1},0,0.99891871944292221,2.1167988648626984E-2,16.782260748184463,-126.69982614826191,53.300173851738094,null,1000000000,66069260.890000001,null,49.596030114592494,-49.799557916413754,null,33.561405886080223,-76.900268231848159,null,0,0]
[8222.9500000000007,8.2229500000000009,71.135287843624909,1.5567381431587755,1.0290613359691387,0.23822072961253121,1,0,497.83440017725133,1.5687876253630058,2.0913165955276698,1.0722290913195449,1.0732748768618918,0.37165453904683893,1,0,1,0,0.99889339729009718,2.1415059734182982E-2,16.651153838297081,-126.51742050221911,53.48257949778089,null,1000000000,67616906.702500015,null,49.559702747466758,-49.744944862999326,null,33.46662634331858,-76.772475639219763,null,0,0]
[8270.2750000000015,8.2702750000000016,71.544607384503777,1.5568185778042718,1.029392018024136,0.23954003828386289,1,0,500.6995420300708,1.5687991197258591,2.1006067261885857,1.0746353703095384,1.0740915471047014,0.37360042317655578,1,0,1,0,0.99888062639121822,2.1538602832319124E-2,16.586266191890953,-126.42779664327544,53.572203356724557,null,1000000000,68397448.575625017,null,49.541749577061154,-49.719224759046256,null,33.419691867318058,-76.708571884229187,null,0,0]
[8317.6,8.3176000000000005,71.953927382990813,1.556898097322774,1.0297244906609253,0.24085849730438949,1,0,503.56468394829011,1.5688104832893075,2.109908912587978,1.077020445357096,1.0749122781687712,0.37554334315999383,1,0,1,0,0.99886778227907769,2.1662151006353155E-2,16.521814010314287,-126.33920689273629,53.660793107263714,null,1000000000,69182469.760000005,null,49.523932770870402,-49.6945422241795,null,33.373056491932132,-76.6446646685568,null,0,0]
[8366.0499999999993,8.3660499999999995,72.37297811680321,1.5569785753572809,1.0300667198929763,0.24220741434474891,1,0,506.49793548741667,1.5688219838023438,2.1194445518947709,1.079440515269793,1.0757567165431006,0.37752937093829547,1,0,1,0,0.99885455699618075,2.1788641430601909E-2,16.45627438129031,-126.24956820691455,53.750431793085454,null,1000000000,69990792.602499992,null,49.505830668819549,-49.670332372579338,null,33.32561896495902,-76.579235834335208,null,0,0]
[8414.5,8.4145000000000003,72.792029313957784,1.5570581267958832,1.0304108221639288,0.24355543290384171,1,0,509.43118709276217,1.5688333518778743,{"$f":"SQRT(1+(A148/Zero2)^2)","v":2.1289924929970665},{"$f":"ATAN(A148/Zero2)","v":1.081838892439148},1.0766053913655131,0.37951227540486376,1,0,1,0,0.99884125498058718,2.1915137236987407E-2,16.391178257879606,-126.16098458056663,53.839015419433366,null,1000000000,70803810.25,null,49.487865421721686,-49.647178882929389,null,33.278488088646178,-76.51380569763721,null,0,0]
[8462.9500000000007,8.4629500000000011,73.211080966498216,1.5571367675487442,1.0307567955979269,0.2449025489848482,1,0,512.36443876318936,1.5688445897904828,2.1385525711243329,1.0842158400096296,1.0774582926253196,0.3814920483653233,1,0,1,0,0.99882787623370417,2.20416384569018E-2,16.326519305751795,-126.0734417398307,53.926558260169301,null,1000000000,71621522.702500015,null,49.47003406758067,-49.62506633898311,null,33.23166049065938,-76.448375400847581,null,0,0]
[8511.4,8.5114000000000001,73.63013306664925,1.5572145131638746,1.0311046383114397,0.2462487586094004,1,0,515.29769049758647,1.5688556997629632,2.1481246242316385,1.086571617412958,1.0783154102937273,0.38346868174935056,1,0,1,0,0.99881442075694804,2.2168145121741107E-2,16.26229131806522,-125.98692560590334,54.013074394096662,null,1000000000,72443929.959999993,null,49.452333714816362,-49.60397954135906,null,33.185132855737109,-76.382946064544271,null,0,0]
[8560.9500000000007,8.5609500000000001,74.058699704620736,1.5572931138827759,1.0314623098328011,0.24762459064600731,1,0,518.29753831162679,1.5688669319077719,2.1579262193060127,1.0889592498978375,1.0791963384242651,0.38548693667178724,1,0,1,0,0.99880058042823461,2.229752963540375E-2,16.19704452403974,-125.89949269193153,54.100507308068472,null,1000000000,73289864.902500018,null,49.434364051369897,-49.583459320453237,null,33.13785572515809,-76.316033371478312,null,0,0]
[8610.5,8.6105,74.487266794867281,1.5573708101339707,1.0318219324676299,0.24899946624151645,1,0,521.29738619030343,1.5688780347800149,2.1677400049737754,1.0913252772049975,1.0800816553211567,0.38750189116084321,1,0,1,0,0.99878665984899562,2.2426919910472805E-2,16.132235749275537,-125.81310446374444,54.186895536255562,null,1000000000,74140710.25,null,49.416525505448313,-49.56398047737185,null,33.090885496315479,-76.249123986372595,null,0,0]
[8660.0499999999993,8.66005,74.915834329626989,1.5574476174389518,1.0321835041765659,0.2503733812005467,1,0,524.29723413250701,1.5688890105986477,2.1775658164143752,1.0936699651302428,1.0809713502011868,0.38951353698424784,1,0,1,0,0.99877265902077195,2.2556315980544365E-2,16.067858748088739,-125.72774647944516,54.272253520554841,null,1000000000,74996466.002499983,null,49.398815200706991,-49.545527438599478,null,33.044218799870009,-76.182219040845695,null,0,0]
[8709.6,8.7096,75.344402301314574,1.5575235509661025,1.032547022912061,0.25174633134808433,1,0,527.29708213715321,1.5688998615321319,2.1874034915685869,1.0959935756351051,1.0818654122633746,0.39152186604385691,1,0,1,0,0.9987585779451138,2.2685717879218834E-2,16.003907400965328,-125.643404500218,54.356595499782003,null,1000000000,75857132.160000011,null,49.381230330030974,-49.528084855100175,null,32.997852323422613,-76.115319645117779,null,0,{"$f":"IF(AH154>0,W154,0)","v":0}]
[8760.3250000000007,8.7603249999999999,75.783133530503719,1.5576003955091113,1.0329211766040107,0.25315083510151509,1,0,530.36806686340617,1.568910842628358,2.1974865743443948,1.0983507233508838,1.0827851880519765,0.39357437546710206,1,0,1,0,0.99874407983620228,2.2818194412217791E-2,15.938874203150979,-125.55810025898496,54.441899741015035,null,1000000000,76743294.105625018,null,49.363355532994532,-49.511259537108891,null,32.950693922644703,-76.046840721876066,null,0,0]
[8811.0499999999993,8.8110499999999998,76.221865202046942,1.5576763554209769,1.0332973663901406,0.25455431895403652,1,0,533.43905165287674,1.5689216972892246,2.2075817551018964,1.1006863256654236,1.0837095176382889,0.39562339221182063,1,0,1,0,0.99872949763216479,2.2950677124804201E-2,15.874274499449772,-125.47383122281171,54.526168777188289,null,1000000000,77634602.102499992,null,49.345606450522453,-49.495461319726438,null,32.90384330141557,-75.978369903085309,null,0,0]
[8861.7749999999996,8.8617749999999997,76.660597308349438,1.5577514458891688,1.0336755900474375,0.25595677849313642,1,0,536.51003650447956,1.568932427685878,2.2176888686267877,1.1030006515012918,1.0846383893800635,0.39766890802397936,1,0,1,0,0.99871483133469385,2.3083166053040238E-2,15.810102115358667,-125.39058276010891,54.609417239891087,null,1000000000,78531056.15062499,null,49.327980284691037,-49.480674446300924,null,32.857297083155885,-75.909908313807975,null,0,0]
[8912.5,8.9124999999999996,77.099329841989231,1.5578256817554998,1.0340558453441324,0.25735820932885861,1,0,539.58102141715381,1.5689430359400374,{"$f":"SQRT(1+(A158/Zero2)^2)","v":2.2278077525094124},{"$f":"ATAN(A158/Zero2)","v":1.105293965815523},1.0855717916177861,0.39971091479491178,1,0,1,0,0.99870008094549167,2.3215661232992912E-2,15.746351001665351,-125.3083404508954,54.6916595491046,null,1000000000,79432656.25,null,49.310474305834475,-49.466883392885677,null,32.811051948319133,-75.841457058009766,null,0,0]
[8964.4,8.9643999999999995,77.548225663533913,1.5579007678328711,1.0344470093595459,0.2587910337990682,1,0,542.72314305577891,1.5689537656684107,2.2381730474159589,1.1076189277649027,1.0865314922475802,0.40179658264237395,1,0,1,0,0.99868490184212733,2.3351232055467821E-2,15.681552989248807,-125.22521963320976,54.774780366790239,null,1000000000,80360467.359999999,null,49.292684434262583,-49.453787618919577,null,32.764043807474479,-75.77143201429017,null,0,0]
[9016.2999999999993,9.0162999999999993,77.997121917256649,1.5579749896259756,1.0348402954721081,0.26022277213056416,1,0,545.86526475616665,1.5689643718713862,2.2485503290717643,1.1099224422126137,1.0874959109466409,0.40387856028780217,1,0,1,0,0.99866963470972481,2.3486809499049879E-2,15.61718356618873,-125.14312224705084,54.85687775294916,null,1000000000,81293665.689999983,null,49.275014811847655,-49.441702185795286,null,32.717344006829336,-75.701420061255561,null,0,0]
[9068.2000000000007,9.0682000000000009,78.446018595738252,1.5580483619712358,1.0352357012632647,0.26165341969480832,1,0,549.00738651725703,1.5689748566698718,2.258939432280012,1.1122047804612984,1.088465035173837,0.40595683951498107,1,0,1,0,0.99865427955013975,2.3622393602387007E-2,15.55323664028611,-125.06203351616141,54.937966483838593,null,1000000000,82232251.24000001,null,49.257462724955531,-49.430611199781033,null,32.670949167818833,-75.631422316380366,null,0,0]
[9120.1,9.1201000000000008,78.894915691728272,1.5581208993674458,1.0356332243051294,0.26308297188817192,1,0,552.14950833801333,1.5689852221364979,2.2693401946825076,1.1144662097308708,1.089438852371581,0.40803141226465323,1,0,1,0,0.99863883636523831,2.3757984404132591E-2,15.489706243424335,-124.98193888366258,55.018061116337421,null,1000000000,83176224.010000005,null,49.240025527032252,-49.420499007295049,null,32.624855968880333,-75.56143987636753,null,0,0]
[9173.2000000000007,9.1732000000000014,79.354192336035609,1.5581942645759566,1.0360421273366847,0.26454443888295986,1,0,555.36428043497347,1.5689957058770558,2.2799933374071011,1.1167585611233815,1.0904400294476091,0.41015010775649852,1,0,1,0,0.99862294501268911,2.3896717226149455E-2,15.425131924708399,-124.90100623875516,55.098993761244841,null,1000000000,84147598.24000001,null,49.222301369467722,-49.411149931176176,null,32.578005807728935,-75.489856307578989,null,0,0]
[9226.2999999999993,9.2262999999999984,79.813469402547568,1.5582667854422136,1.0364532414870804,0.26600474959895887,1,0,558.5790525922705,1.5690060689441414,2.2906583497343571,1.1190295785675826,1.0914460923749849,0.41226490682439587,1,0,1,0,0.99860696152121775,2.4035457141784899E-2,15.360981364590753,-124.82108405540069,55.178915944599311,null,1000000000,85124611.689999983,null,49.204692077592249,-49.402793037528866,null,32.531464539486763,-75.418291017871823,null,0,0]
[9279.4,9.279399999999999,80.272746884017323,1.5583384764580641,1.0368665641262129,0.26746389918702212,1,0,561.79382480886841,1.5690163134093542,2.3013350666433867,1.1212795354012468,1.0924570276553094,0.41437580134304053,1,0,1,0,0.99859088589285794,2.4174204192453926E-2,15.297248554647906,-124.74215743617678,55.257842563823218,null,1000000000,86107264.359999999,null,49.187195023380966,-49.395412318400545,null,32.485228783755197,-75.346745117776251,null,0,0]
[9332.5,9.3324999999999996,80.73202477336288,1.5584093517856181,1.0372820926140531,0.26892188282548857,1,0,565.00859708375526,1.5690264412971466,2.3120233259820604,1.123508700768941,1.0934728217748486,0.4164827833562873,1,0,1,0,0.99857471812965604,2.4312958419577643E-2,15.233927609258831,-124.664211710438,55.335788289562004,null,1000000000,87095556.25,null,49.169807644648742,-49.388992013082508,null,32.439295217098341,-75.27521969735551,null,0,0]
[9386.85,9.3868500000000008,81.202114704273313,1.558481065281077,1.0377096844302178,0.27041297566597117,1,0,568.29904673141186,1.5690366889390777,2.3229749790888223,1.1257690869720682,1.0945175458201464,0.41863530488776013,1,0,1,0,0.99855807435781985,2.4454986464235055E-2,15.169536562487792,-124.5854318280697,55.414568171930298,null,1000000000,88112952.922499999,null,49.152121930139458,-49.38339896926437,null,32.392589884836596,-75.202032858805339,null,0,0]
[9441.2000000000007,9.4412000000000003,81.672205047984704,1.5585519532372483,1.0381395815427819,0.27190283688348937,1,0,571.58949643806091,1.5690468185965101,2.3339383896569523,1.1280082487114422,1.0955673314616015,0.4207837112142499,1,0,1,0,0.99854133406666146,2.4597022115028316E-2,15.105564903245948,-124.50764917668715,55.492350823312847,null,1000000000,89136257.440000013,null,49.13454588746621,-49.37877945375164,null,32.346194268267993,-75.128869722935491,null,0,0]
[9495.5499999999993,9.4955499999999997,82.142295797409787,1.5586220298268079,1.038571781089044,0.27339146139753617,1,0,574.87994620268898,1.5690568322953713,2.344913392773913,1.1302264613881989,1.096622164162965,0.42292799435004819,1,0,1,0,0.99852449725841319,2.4739065416393348E-2,15.042006700205061,-124.43084874116936,55.569151258830644,null,1000000000,90165469.80249998,null,49.117076971949913,-49.375117345751264,null,32.300104980743399,-75.055731395418078,null,0,0]
[9549.9,9.5498999999999992,82.612386945622688,1.5586913088998751,1.0390062801957469,0.27487884415795999,1,0,578.1703960243068,1.569066732015469,2.3558998264273994,1.1324239960990745,1.0976820293741114,0.42506814649173397,1,0,1,0,0.99850756393532092,2.488111641277296E-2,14.978856143708823,-124.35501574060115,55.644984259398854,null,1000000000,91200590.00999999,null,49.099712703566958,-49.372396778895911,null,32.254318692630115,-74.982618961705242,null,0,0]
[9605.5249999999996,9.6055250000000001,83.093506396923985,1.5587614015200459,1.0394533503458583,0.27639982849313705,1,0,581.53803676910604,1.5690767479718482,2.367155661323459,1.134651950092159,1.0987719538123246,0.42725421914681244,1,0,1,0,0.99849013343709281,2.502650780652705E-2,14.914640299383608,-124.27839033007307,55.721609669926934,null,1000000000,92266110.52562499,null,49.082046921991626,-49.370571027014044,null,32.207768629880235,-74.907819303059057,null,0,0]
[9661.15,9.6611499999999992,83.574626251761387,1.5588306871264455,1.0399028230895879,0.27791950152429867,1,0,584.90567757157305,1.5690866485929025,2.3784231350096476,1.1368588056623397,1.0998671187652715,0.42943594875747032,1,0,1,0,0.99847260184741204,2.5171907354785358E-2,14.850839515540669,-124.20274768471134,55.797252315288659,null,1000000000,93337819.32249999,null,49.064485698377858,-49.369698679377152,null,32.16152906965106,-74.833049005334203,null,0,0]
[9716.7749999999996,9.7167750000000002,84.055746503205583,1.5588991795760159,1.0403546953129013,0.27943785793652504,1,0,588.2733184307175,1.5690964358593829,2.3897020828548698,1.1390448399025577,1.1009675085942674,0.4316133275454021,1,0,1,0,0.998454969168729,2.5317315105215055E-2,14.787447940095344,-124.12807269728236,55.871927302717637,null,1000000000,94415716.40062499,null,49.047026572966921,-49.369763527553729,null,32.115596619616674,-74.758309169728619,null,0,0]
[9772.4,9.7723999999999993,84.536867144485043,1.558966892410276,1.0408089638905609,0.28095489244838434,1,0,591.64095934557145,1.5691061117069418,2.4009923431554401,1.1412103254977926,1.102073107648625,0.43378634792831006,1,0,1,0,0.99843723540350804,2.5462731105491056E-2,14.724459841413434,-124.05435050176588,55.945649498234118,null,1000000000,95499801.75999999,null,49.029667149399422,-49.370749624316389,null,32.06996794450226,-74.683600877449479,null,0,0]
[9829.2999999999993,9.8292999999999999,85.029016116006588,1.5590353644855117,1.0412761210220223,0.28250532626846536,1,0,595.08579118748685,1.5691158960310467,2.4125529302383466,1.1434044661420715,1.1032094218931383,0.43600465976707714,1,0,1,0,0.99841899057040928,2.5611488821931417E-2,14.660439573243471,-123.97990904552995,56.020090954470049,null,1000000000,96615138.48999998,null,49.012010546718727,-49.372695132225175,null,32.023604279013,-74.607213913304761,null,0,0]
[9886.2000000000007,9.8862000000000005,85.521165481592064,1.5591030484874149,1.0417457789714701,0.28405436582232896,1,0,598.53062308571589,1.5691255677281608,2.4241250211495839,1.1455776687452657,1.1043511537416775,0.43821839568371668,1,0,1,0,0.99840063996884587,2.5760255271687089E-2,14.596829730807833,-123.90643384927995,56.093566150720051,null,1000000000,97736950.440000013,null,48.994453392012325,-49.375571667443936,null,31.977551591283767,-74.530862181836056,null,0,0]
[9943.1,9.9431000000000012,86.013315234477204,1.5591699579429197,1.0422179343580502,0.28560200556601162,1,0,601.97545503929166,1.5691351287318216,2.4357084519245231,1.1477302113560617,1.1054982864087324,0.44042754819222235,1,0,1,0,0.99838218360150233,2.590903050581243E-2,14.533624550793467,-123.8339097594739,56.166090240526103,null,1000000000,98865237.610000014,null,48.976993314926702,-49.379362980823359,null,31.931806488355026,-74.454546778650524,null,0,0]
[10000,10,86.505465368051716,1.5592361060711573,1.0426925837890699,0.28714823999238759,1,0,605.42028704726943,1.5691445809315592,2.4473030615436446,1.1498623675274615,1.1066508030991529,0.44263211001650193,1,0,1,0,0.99836362147107893,2.6057814575370455E-2,14.470818388821078,-123.76232186991305,56.237678130086948,null,1000000000,100000000,null,48.959628007075352,-49.384053090303709,null,31.886365634233979,-74.378268779609343,null,0,0]
[10058.25,10.058249999999999,87.00929256199143,1.5593030484702328,1.0431810746259125,0.28872969868393478,1,0,608.94685062576445,1.5691541466137662,2.4591841777000605,1.1520242741480322,1.1078362238151913,0.44488421417987656,1,0,1,0,0.99834450938462738,2.6210137876867049E-2,14.406929657754823,-123.68998997230896,56.310010027691035,null,1000000000,101168393.0625,null,48.941946514571626,-49.389769102053975,null,31.840158395671455,-74.300220870255004,null,0,0]
[10116.5,10.1165,87.513120141354989,1.5593692200725642,1.0436721720246189,0.29030967302085375,1,0,612.47341425933791,1.5691636021393984,2.4710766771328947,1.1541653815694788,1.1090272514182913,0.44713149247610851,1,0,1,0,0.99832528646270302,2.6362470546353305E-2,14.343447501165906,-123.6186083883079,56.381391611692095,null,1000000000,102343572.25,null,48.924359637279494,-49.396394006805764,null,31.794263116374665,-74.222214381502155,null,0,0]
[10174.75,10.17475,88.016948099523617,1.5594346341141867,1.0441658723073957,0.29188815721487693,1,0,615.9999779470437,1.5691729494003737,2.4829803962779033,1.1562859691603953,1.1102238678635594,0.44937393777441276,1,0,1,0,0.99830595270825395,2.6514812638642259E-2,14.280366231116039,-123.54816190425635,56.451838095743653,null,1000000000,103525537.5625,null,48.906865089193147,-49.403911497752695,null,31.748676394411149,-74.14425040650363,null,0,0]
[10233,10.233000000000001,88.520776430029287,1.5594993035298224,1.0446621717839262,0.29346514551835245,1,0,619.52654168795755,1.5691821902455327,2.4948951745396037,1.158386311698461,1.1114260550993216,0.45161154316906466,1,0,1,0,0.99828650812424591,2.666716420855671E-2,14.217680277416161,-123.4786355603771,56.5213644396229,null,1000000000,104714289,null,48.889460644994081,-49.412305541555341,null,31.703394884910328,-74.066330018821759,null,0,0]
[10292.5,10.2925,89.035416905119362,1.5595646050786134,1.0451718010708981,0.29507442445265053,1,0,623.12878281636097,1.569191521405048,2.5070768884305989,1.160511105589525,1.112659772958585,0.4538921620911171,1,0,1,0,0.998266531855036,2.6822794967361722E-2,14.154051591744013,-123.40855191076209,56.591448089237915,null,1000000000,105935556.25,null,48.871773487580832,-49.421768294242483,null,31.657453356651438,-73.986783616519588,null,0,0]
[10352,10.352,89.550057755518566,1.5596291560565341,1.0456841344790786,0.29668213061329696,1,0,626.73102399839695,1.5692007452997701,2.5192698116526229,1.1626153414773897,1.1138992651721429,0.45616771730623201,1,0,1,0,0.99824643995490714,2.6978435730582419E-2,14.090823985292227,-123.33939755507058,56.660602444929424,null,1000000000,107163904,null,48.85417583542953,-49.432112658893011,null,31.611823402350957,-73.907284896177572,null,0,0]
[10411.5,10.4115,90.064698974793203,1.5596929693296158,1.0461991680357678,0.29828825800608533,1,0,630.33326523314577,1.5692098637686946,2.531473782235393,1.1646992979159725,1.1151445124852697,0.45843820217248027,1,0,1,0,0.99822623242707575,2.7134086556679086E-2,14.027991882770227,-123.27115734211247,56.728842657887526,null,1000000000,108399332.25,null,48.83666550199591,-49.44332240035525,null,31.566501633262579,-73.827834941757231,null,0,0]
[10471,10.471,90.579340556655765,1.5597560574715126,1.0467168977551691,0.29989280068115698,1,0,633.93550651970895,1.5692188786090175,2.5436886411716397,1.1667632488205508,1.1163954956399456,0.46070361028660223,1,0,1,0,0.99820590927477748,2.7289747504122889E-2,13.965549824389198,-123.20381637845965,56.796183621540351,null,1000000000,109641841,null,48.81924035958064,-49.455381560531862,null,31.521484717296818,-73.748434817927816,null,0,0]
[10532,10.532,91.106956666026321,1.5598199961517774,1.0472504742733049,0.30153614268240092,1,0,637.62856066468657,1.5692280149725852,2.556222577882012,1.168858745652978,1.1176839505881078,0.46302085273264482,1,0,1,0,0.99818495374394578,2.744934324565838E-2,13.901932917042698,-123.13569595921726,56.864304040782741,null,1000000000,110923024,null,48.801462200272255,-49.468610123405192,null,31.475645969258693,-73.66708583581206,null,0,0]
[10593,10.593,91.634573143567096,1.5598831985359396,1.0477868760828237,0.30317780653520948,1,0,641.32161486227619,1.56923704611255,2.5687676296724478,1.170933784030481,1.1189783932262678,0.46533274636173733,1,0,1,0,0.99816387669230511,2.7608949749791136E-2,13.838714705711316,-123.06848981040839,56.931510189591606,null,1000000000,112211649,null,48.783769234926652,-49.482698375897058,null,31.430120723272918,-73.585791434511336,null,0,0]
[10654,10.654,92.162189982954956,1.5599456772690949,1.0483260988468364,0.30481778597362891,1,0,645.01466911157388,1.5692459738362941,2.5813236344874229,1.1729886444927677,1.1202788027987318,0.46763928504442709,1,0,1,0,0.99814267812340396,2.7768567079562892E-2,13.775889666038578,-123.00218269779079,56.997817302209214,null,1000000000,113507716,null,48.766159352562475,-49.497629996629762,null,31.384905565964356,-73.504552701161032,null,0,0]
[10715,10.715,92.689807178010625,1.5600074447084442,1.0488681382145872,0.30645607478079895,1,0,648.70772341169675,1.5692547999100435,2.5938904332690735,1.1750236028316809,1.1215851585506114,0.46994046290753316,1,0,1,0,0.99812135804081115,2.7928195298027668E-2,13.713452388585289,-122.9367596521727,57.063240347827303,null,1000000000,114811225,null,48.748630500029762,-49.513388948583504,null,31.339997141043781,-73.423370703589185,null,0,0]
[10777.5,10.7775,93.230398928967247,1.5600700059016512,1.0494264232017116,0.30813288942733691,1,0,652.49159057429108,1.569263739393133,2.6067772838206076,1.1770882423876645,1.1229297834068923,0.47229266106211804,1,0,1,0,0.99809938766515427,2.8091760160118166E-2,13.649876411578239,-122.87062940714586,57.129370592854144,null,1000000000,116154506.25,null,48.730752565393878,-49.530377037317542,null,31.294299098672617,-73.340252369828349,null,0,0]
[10840,10.84,93.770991040611349,1.5601318457614068,1.0499876557262062,0.30980791621941112,1,0,656.2754577884275,1.5692725757920183,2.6196751370237599,1.179132560265937,1.1242806063683568,0.47463921984251306,1,0,1,0,0.99807728973389909,2.8255336587049183E-2,13.586696361519746,-122.80539625962487,57.194603740375129,null,1000000000,117505600,null,48.712955509880054,-49.548200453787963,null,31.248916104127954,-73.257195805836915,null,0,0]
[10902.5,10.9025,94.311583506740547,1.560192976691249,1.0505518310641138,0.31148114863064091,1,0,660.05932505321948,1.569281310879524,2.6325838311622203,1.1811568381903439,1.125637605120871,0.47698013375602516,1,0,1,0,0.99805506425095281,2.8418924646682175E-2,13.523906776193396,-122.74104494338219,57.258955056617808,null,1000000000,118864506.25,null,48.695237303215279,-49.566842843274706,null,31.203844725466375,-73.174202100107479,null,0,0]
[10965,10.965,94.852176321293911,1.5602534108119701,1.0511189444768767,0.31315258018881059,1,0,663.84319236780118,1.5692899463880565,2.6455032075414384,1.1831613530454028,1.127000757356001,0.47931539758381947,1,0,1,0,0.99803271122024551,2.8582524406892473E-2,13.461502307372601,-122.67756046353577,57.322439536464231,null,1000000000,120231225,null,48.677595971744402,-49.586288141705822,null,31.159081588116457,-73.091272321829919,null,0,0]
[11028.75,11.02875,95.403581344942438,1.5603143480461241,1.051700422033365,0.31485557848365414,1,0,667.70273707908996,1.5692986537761937,2.658691814795028,1.1851858804867066,1.1283974888254416,0.48169154084070592,1,0,1,0,0.9980097797333205,2.874940828664756E-2,13.398241065431904,-122.61368403579499,57.386315964205011,null,1000000000,121633326.5625,null,48.65967902092946,-49.606933140563186,null,31.113737296990706,-73.006750895231789,null,0,0]
[11092.5,11.092499999999999,95.954986718785932,1.5603745849288133,1.052284946358685,0.31655668974101814,1,0,671.56228184042106,1.5693072610796328,2.6718912116545557,1.1871904133600706,1.1298005755177547,0.48406179564111257,1,0,1,0,0.99798671555403795,2.8916304482374942E-2,13.335369608437702,-122.55067879202991,57.449321207970087,null,1000000000,123043556.25,null,48.641838076077605,-49.628380625642684,null,31.068706784848349,-72.922298166387236,null,0,0]
[11156.25,11.15625,96.506392436821713,1.5604341334643292,1.0528725123784033,0.31825590726673159,1,0,675.42182665093674,1.5693157700141067,2.6851012390016789,1.1891752305414962,1.1312099937850011,0.48642615731304994,1,0,1,0,0.99796351868664246,2.9083213066149558E-2,13.27288260852592,-122.48852965991416,57.511470340085836,null,1000000000,124461914.0625,null,48.624071214263303,-49.650614449145358,null,31.023986646750863,-72.837915210768799,null,0,0]
[11220,11.22,97.057798493183483,1.560493005384187,1.0534631150030309,0.31995322442526214,1,0,679.28137150979853,1.5693241822563544,2.6983217407070978,1.1911406060695171,1.1326257199905005,0.48878462147127943,1,0,1,0,0.99794018913540405,2.9250134110061672E-2,13.210774848852916,-122.42722183949547,57.572778160504527,null,1000000000,125888400,null,48.606376566941805,-49.673618754634198,null,30.979573534399361,-72.753603084861297,null,0,0]
[11285.5,11.285500000000001,97.62434153274539,1.5605528007150502,1.0540730876692239,0.32169514835776591,1,0,683.24686470839742,1.5693327264350942,2.7119159067348346,1.1931399665855025,1.1340868544909997,0.49120168089989502,1,0,1,0,0.99791608097233842,2.9421650353963217E-2,13.147351800270535,-122.36509205702788,57.63490794297212,null,1000000000,127362510.25,null,48.588269491290042,-49.698040684844237,null,30.934257561468751,-72.667051372183636,null,0,0]
[11351,11.351000000000001,98.190884917333406,1.5606119060299533,1.0546862550031344,0.32343505214543511,1,0,687.21235795629991,1.5693411720071007,2.7255208053239874,1.1951193746552835,1.1355545974539314,0.49361250611957247,1,0,1,0,0.99789183275006144,2.9593179905821956E-2,13.084318280909127,-122.30381959516976,57.696180404830244,null,1000000000,128845201,null,48.570234819544822,-49.723242962403205,null,30.889258713852552,-72.580576632766565,null,0,0]
[11416.5,11.416499999999999,98.757428641009525,1.5606703332037652,1.055302611436125,0.32517292878450177,1,0,691.17785125265721,1.5693495206695811,2.7391362765532627,1.1970791121853159,1.1370289232875344,0.49601709330326377,1,0,1,0,0.99786744447328668,2.9764722843880733E-2,13.02166897974173,-122.24338926598938,57.756610734010621,null,1000000000,130336472.25,null,48.552270693925273,-49.749209313230097,null,30.844573538304711,-72.494179952759282,null,0,0]
[11482,11.481999999999999,99.323972697971314,1.5607280938404364,1.0559221513836312,0.3269087713364876,1,0,695.14334459663996,1.5693577740810156,2.7527621635422639,1.1990194561113134,1.1385098064181265,0.49841543893224649,1,0,1,0,0.99784291614675524,2.9936279246399914E-2,12.959398697011299,-122.18378616254198,57.816213837458022,null,1000000000,131836324,null,48.534375310352672,-49.775923763493246,null,30.800198639146888,-72.407862399048696,null,0,0]
[11548.75,11.54875,99.901329001433382,1.5607862827809236,1.056556784039612,0.32867564085368522,1,0,699.18451534267422,1.5693660886832299,2.7666586430249587,1.200977158865941,1.1400256704195579,0.50085312982886554,1,0,1,0,0.99781777564301022,3.0111123559457102E-2,12.896324716452408,-122.12388150446971,57.876118495530292,null,1000000000,133373626.5625,null,48.516207320527052,-49.803901449892862,null,30.755292648413608,-72.319980054576817,null,0,0]
[11615.5,11.615500000000001,100.4786856392693,1.5608438030072225,1.0571947111179902,0.33044038356366806,1,0,703.22568613648923,1.5693743077237261,2.7805656199936672,1.2029152861171568,1.1415482908226398,0.50328433225675762,1,0,1,0,0.99779248970312273,3.0285982019947949E-2,12.833633795712824,-122.06480555613385,57.935194443866152,null,1000000000,134919840.25,null,48.49810710196941,-49.832623492863995,null,30.710701946231673,-72.232182063269846,null,0,0]
[11682.25,11.68225,{"$f":"SQRT(1+(A205/pole1)^2)","v":101.056042605748},{"$f":"ATAN(A205/pole1)","v":1.560900665980514},{"$f":"SQRT(1+(A205/Zero1)^2)","v":1.0578359266586697},{"$f":"ATAN(A205/Zero1)","v":0.33220299233218215},{"$f":"IF(VIN_nom>Vout, 1, SQRT(1+(A205/z_RHP)^2))","v":1},{"$f":"IF(VIN_nom>Vout, 0, -ATAN(A205/z_RHP))","v":0},{"$f":"SQRT(1+(A205/Pole2)^2)","v":707.26685697726634},{"$f":"ATAN(A205/Pole2)","v":1.5693824328405601},2.7944829377235556,1.2048341156694704,{"$f":"SQRT(1+(A205/pole4)^2)","v":1.1430776406280645},{"$f":"ATAN(A205/pole4)","v":0.50570904346158863},{"$f":"IF(VOUT_setting=1,1,SQRT(1+(A205*zterm1)^2))","v":1},{"$f":"IF(VOUT_setting=1,0,ATAN(((A205*zterm1))))","v":0},1,{"$f":"IF(VOUT_setting=1,0,ATAN(A205*$Q$4/(1+Afbr-$Q$5*(A205)^2)))","v":0},{"$f":"SQRT((1-(Z205/pterm2))^2+(A205/pterm1)^2)","v":0.99776705833220036},{"$f":"IF((ATAN((A205/pterm1)/(1-A205^2/pterm2))>0),ATAN((A205/pterm1)/(1-A205^2/pterm2)),PI()+ATAN((A205/pterm1)/(1-A205^2/pterm2)))","v":3.0460854710756248E-2},{"$f":"20*LOG10(((E205*K205*G205*O205)/(C205*I205*S205*M205*Q205))*Adc)","v":12.771320769823893},{"$f":"((F205+L205+H205+P205)-(D205+J205+T205+N205+R205))*radconv","v":-122.00654340673921},{"$f":"IF(V205>0,V205,V205+180)","v":57.993456593260788},null,{"$f":"IF(U205<0,A205,1000000000)","v":1000000000},{"$f":"A205^2","v":136474965.0625},null,{"$f":"20*LOG10((K205/(I205*M205))*AEA)","v":48.480072907301874},{"$f":"(L205-(J205+N205))*radconv","v":-49.862073911422634},null,{"$f":"20*LOG10((E205*G205/(C205*S205))*Acs*Am)","v":30.666423115010279},{"$f":"(F205+H205-(D205+T205))*radconv","v":-72.144469495316599},null,{"$f":"SUM((U206<0)*(U205>0))*A205","v":0},0]
[11749,{"$f":"A206/1000","v":11.749000000000001},101.63339989526867,1.5609568829015625,1.0584804246853097,0.33396346009525357,1,0,711.30802786420475,1.5693904656345632,2.8084104424810534,1.2067339203912033,1.1446136928618145,0.50812726100901728,1,0,1,0,0.99774148153538034,3.0635741714785149E-2,12.709380581703972,-121.9490804255685,58.050919574431504,null,1000000000,138039001,null,48.462103040403164,-49.892237023608978,null,30.622452793789058,-72.056843401959483,null,0,0]
[11817.5,11.817500000000001,102.22589422287078,1.5610139134734122,1.0591452260799259,0.33576784917154628,1,0,715.45514709872214,1.5693986146816286,2.8227135208112166,1.2086640342599373,1.1461969561773622,0.51060212404211114,1,0,{"$f":"IF(VOUT_setting=1,1,SQRT((1+Afbr-$Q$5*(A207)^2)^2+(A207*$Q$4)^2))","v":1},0,0.99771508299638223,3.0815228739338899E-2,12.646198928830852,-121.89092674090045,58.109073259099546,null,1000000000,139653306.25,null,48.443727206670275,-49.923915757660176,null,30.577646974648832,-71.967010983240243,null,0,0]
[11886,11.885999999999999,102.81838887912924,1.5610702867640089,1.0598134715279248,0.33756996866188727,1,0,719.6022663802031,1.5694066698016131,2.8370270086549816,1.2105746794036174,1.1477872204955759,0.51307014428931774,1,0,1,0,0.99768853131726143,3.0994731014423509E-2,12.583399465118077,-121.83358433968023,58.166415660319771,null,1000000000,141276996,null,48.425415657709109,-49.956312523113525,null,30.53315905989723,-71.87727181656669,null,0,0]
[11954.5,11.954499999999999,103.41088385839493,1.5611260140707146,1.0604851545186833,0.33936981116253723,1,0,723.74938570784036,1.5694146326091367,2.851350749248287,1.2124661351694082,1.149384456757133,0.5155313201496623,1,0,1,0,0.99766182650366875,3.1174248629699353E-2,12.520977061206297,-121.77703829390745,58.222961706092548,null,1000000000,142910070.25,null,48.407166718791416,-49.989411315337264,null,30.488985594903141,-71.787626978570174,null,0,0]
[12023,12.023,104.00337915514744,1.561181106433468,1.061160268524614,0.34116736934746339,1,0,727.89650508084492,1.5694225046820214,2.8656845888501494,1.2143386758706523,1.150988635936967,0.51798565036270849,1,0,1,0,0.99763496856128897,3.1353781674848771E-2,12.458926695265651,-121.72127396220115,58.278726037798847,null,1000000000,144552529,null,48.388978765428433,-50.023196435519402,null,30.445123182325474,-71.698077526681757,null,0,0]
[12093,12.093,104.6088491238414,1.5612367604730912,1.0618537037740243,0.34300192268226681,1,0,732.13443733290126,1.5694304570038562,2.8803425844032291,1.2162329605171884,1.1526350855961482,0.52048665192819132,1,0,1,0,0.99760736429945596,3.1537262134291567E-2,12.39589679325989,-121.66508114958683,58.334918850413175,null,1000000000,146240649,null,48.370453899530389,-50.058414388852938,null,30.400618146217763,-71.606666760733873,null,0,0]
[12163,12.163,105.21431941281872,1.5612917739752143,1.0625507081117478,0.34483407534252547,1,0,736.37236963072428,1.5694383177921061,2.8950108108473525,1.2181080561930644,1.154288724404098,0.5229805031651793,1,0,1,0,0.99757960014114733,3.1720758896195266E-2,12.333245129468224,-121.60967463835865,58.390325361641345,null,1000000000,147938569,null,48.351989443290726,-50.094316861086305,null,30.356430938665753,-71.515357777272342,null,0,0]
[12233,12.233000000000001,105.81979001658175,1.5613461579344188,1.0632512745187377,0.34666381976130939,1,0,740.61030197352864,1.569446088618095,2.9096891134556584,1.2199642400157826,1.1559495215075959,0.52546720380691558,1,0,1,0,0.99755167609253781,3.1904272056335635E-2,12.270966674757606,-121.55503969458331,58.444960305416686,null,1000000000,149646289,null,48.333583815931824,-50.130888049302314,null,30.312558111314036,-71.424151645280958,null,0,0]
[12303,12.303000000000001,106.42526092975785,1.5613999230951019,1.0639553959586106,0.34849114845606927,1,0,744.84823436054626,1.5694537710173859,2.9243773405025313,1.2218017840623738,1.1576174460973019,0.5279467539419046,1,0,1,0,0.99752359215983821,3.2087801710513002E-2,12.20905650532448,-121.50116187226344,58.498838127736562,null,1000000000,151363809,null,48.315235485019066,-50.168112457687663,null,30.268996272793668,-71.333049414575811,null,0,0]
[12374.5,12.374499999999999,107.04370653361532,1.5614542124531803,1.0646782684991845,0.35035513257550055,1,0,749.17697962929321,1.5694615283105082,{"$f":"SQRT(1+(A215/Zero2)^2)","v":2.9393904062966087},{"$f":"ATAN(A215/Zero2)","v":1.2236597385960708},1.1593284381622362,0.53047205576701839,1,0,1,0,0.99749474137514726,3.2275281270617372E-2,12.146194884648928,-121.44689643113199,58.553103568868011,null,1000000000,153128250.25,null,48.296551582480262,-50.206793101155895,null,30.22481855465692,-71.240103329976094,null,0,0]
[12446,12.446,107.66215244934179,1.5615078781004637,1.0654048351698961,0.35221658081870399,1,0,753.50572494260416,1.56946919647532,2.954413515708505,1.2254988041317179,1.1610468016200552,0.53298989865414959,1,0,1,0,0.99746572379399023,3.2462778241340549E-2,12.08370744192057,-121.39339133409077,58.606608665909235,null,1000000000,154902916,null,48.277924374231382,-50.246123532150264,null,30.180958320177439,-71.147267801940515,null,0,0]
[12517.5,12.5175,108.28059867159354,1.5615609307236407,1.0661350884181424,0.35407548548367429,1,0,757.83447029971592,1.5694767770391214,2.9694465162993415,1.2273192550140577,1.1627725037900793,0.5355002838190186,1,0,1,0,0.99743653942310417,3.265029272485457E-2,12.021589252543299,-121.34063207895606,58.659367921043938,null,1000000000,156687806.25,null,48.259352373880191,-50.286088189038367,null,30.137412131151372,-71.054543889917667,null,0,0]
[12589,12.589,108.89904519514823,1.5616133807666506,1.0668690206737288,0.35593183895975511,1,0,762.16321569988168,1.569484271494515,2.9844892586022431,1.2291213605556992,1.1645055120461902,0.5380032128461435,1,0,1,0,0.99740718826926578,3.2837824823358785E-2,11.959835494882899,-121.28860445186565,58.711395548134348,null,1000000000,158482921,null,48.240834141404569,-50.326671817650407,null,30.094176605966581,-70.961932634215245,null,0,{"$f":"IF(AH218>0,W218,0)","v":0}]
[12662.25,12.66225,109.53262882884621,1.5616665003393824,1.0676247235513496,0.35783097418440918,1,0,766.59790945792292,1.569491861610127,2.9999101289817767,1.2309488256025769,1.1662884790425663,0.5405596723032845,1,0,1,0,0.99737694578161162,3.3029965242176058E-2,11.896943266505296,-121.23604756569476,58.763952434305239,null,1000000000,160332575.0625,null,48.221916965191781,-50.368875002285932,null,30.050201553801763,-70.867172563408829,null,0,0]
[12735.5,12.7355,110.16621276805623,1.5617190089135291,1.0683842715912213,0.35972741593077051,1,0,771.03260325961969,1.5694993644146751,3.0153409154544035,1.2327575928013774,1.1680790450013603,0.54310831070416354,1,0,1,0,0.99734652826142045,3.3222124366048766E-2,11.83442360210438,-121.18422926025383,58.815770739746171,null,1000000000,162192960.25,null,48.203053304301513,-50.41169637863235,null,30.006545550291122,-70.772532881621459,null,0,0]
[12808.75,12.80875,110.79979700753728,1.5617709169703815,1.0691476565982583,0.36162115631287756,1,0,775.46729710422312,1.5695067814060855,3.0307814665610575,1.2345479359985199,1.1698771750305936,0.54564913092693657,1,0,1,0,0.99731593571610888,3.3414302304955942E-2,11.772271635849567,-121.1331351546971,58.866864845302899,null,1000000000,164064076.5625,null,48.184241752430843,-50.455120507176638,null,29.963205135906978,-70.678014647520513,null,0,0]
[12882,12.882,111.43338154216752,1.5618222347528661,1.0699148703594243,0.36351218754472037,1,0,779.90199099100107,1.5695141140482143,3.0462316338186164,1.2363201239624693,1.1716828343055299,0.54818213623590528,1,0,1,0,0.99728516815313772,3.3606499168907428E-2,11.710482603727799,-121.08275115991458,58.917248840085421,null,1000000000,165945924,null,48.165480948216086,-50.499132259523542,null,29.920176907999966,-70.583618900391016,null,0,0]
[12957.25,12.95725,112.08426561532592,1.5618743495523317,1.070707010278009,0.365452021837537,1,0,784.45776871307578,1.5695215605669086,3.0621135092639311,1.238122070920421,1.1735455987537606,0.55077616804115404,1,0,1,0,0.99725337827721794,3.3803963551620492E-2,11.647379531455366,-121.03171644857591,58.968283551424094,null,1000000000,167890327.5625,null,48.146259364088344,-50.544942032435515,null,29.876295419855271,-70.486774416140392,null,0,0]
[13032.5,13.032500000000001,112.73514998938469,1.5619258625749635,1.0715031732551388,0.36738898068550424,1,0,789.01354647814674,1.5695289210929499,3.0780052248075971,1.2399054167446981,1.1754162349313753,0.55336196056801246,1,0,1,0,0.9972214037119902,3.4001448142405126E-2,11.584649608610189,-120.98140193021622,59.018598069783778,null,1000000000,169846056.25,null,48.127088563580251,-50.591340568907796,null,29.832736297518192,-70.390061361308426,null,0,0]
[13107.75,13.107749999999999,113.38603465916199,1.5619767841838599,1.072303350329701,0.36932305597552612,1,0,793.5693242854735,1.5695361971073549,3.0939066288199171,1.2416704368103193,1.1772947053155478,0.55593951859488555,1,0,1,0,0.99718924446568757,3.4198953060633377E-2,11.522287988195956,-120.93179325109506,59.068206748904942,null,1000000000,171813110.0625,null,48.107967209623688,-50.638312449752441,null,29.789496031060526,-70.293480801342625,null,0,0]
[13183,13.183,114.03691961959419,1.5620271245055359,1.0731075325221986,0.37125423970493454,1,0,798.12510213433256,1.5695433900573255,3.1098175726810005,1.2434174013185213,1.1791809724659061,0.55850884730745898,1,0,1,0,0.99715690054659278,3.439647842571248E-2,11.460289924951821,-120.88287635542562,59.117123644574377,null,1000000000,173791489,null,48.088894009095156,-50.685842573615446,null,29.746571168344914,-70.197033781810148,null,0,0]
[13259.75,13.25975,114.70077932533736,1.5620778797664854,1.0739318612625475,0.37322093201386908,1,0,802.77169287272636,1.5695506422901986,3.1260553541532627,1.2451808649395386,1.1811128323312816,0.5611209206619826,1,0,1,0,0.99712372167559393,3.4597962359620309E-2,11.397425702393871,-120.83368270627899,59.166317293721008,null,1000000000,175820970.0625,null,48.069488918093001,-50.734879852190787,null,29.703112036789125,-70.098802854088206,null,0,0]
[13336.5,13.336499999999999,115.36463932316018,1.5621280508903848,1.0747603374597459,0.37518459986904706,1,0,807.41828365285573,1.5695578110516941,3.1423027565568131,1.2469260978224983,1.183052724492873,0.56372444551906087,1,0,1,0,0.99709035071361263,3.4799467814679151E-2,11.334930016002646,-120.78518007901793,59.214819920982066,null,1000000000,177862232.25,null,48.050131335789857,-50.784467099732431,null,29.659973932701046,-70.000712979285524,null,0,0]
[13413.25,13.41325,116.02849960804919,1.5621776479034488,1.0755929515300495,0.37714523513300086,1,0,812.06487447400468,1.5695648977746672,3.1585596314235311,1.2486533707500171,1.1850006095031353,0.5663194286528842,1,0,1,0,0.99705678766959471,3.5000994917694539E-2,11.272798140799086,-120.73735447713814,59.26264552286186,null,1000000000,179915275.5625,null,48.030820022473677,-50.834589271768309,null,29.617153370813668,-69.902765205369832,null,0,0]
[13490,13.49,116.69236017510505,1.562226680603747,1.0764296938715732,0.37910282978663701,1,0,816.71146533547255,1.5695719038593647,3.1748258332405728,1.2503629493888293,1.1869564480114676,0.56890587725342012,1,0,1,0,0.99702303255253832,3.5202543795510993E-2,11.211025450531761,-120.69019219935586,59.309807800644137,null,1000000000,181980100,null,48.011553780105743,-50.88523163889883,null,29.574646922914269,-69.804960560457047,null,0,0]
[13568.5,13.5685,117.37135791495507,1.5622762575338445,1.077289775541177,0.38110190651872056,1,0,821.4640045637675,1.5695789877009982,3.191472425379184,1.2520934762490354,1.1889650688643505,0.57154247952600457,1,0,1,0,0.99698830909202696,3.5408710907802468E-2,11.148211104225625,-120.64262676517303,59.357373234826966,null,1000000000,184104192.25,null,47.991893659997061,-50.937551810236798,null,29.531492696716818,-69.705074954936222,null,0,0]
[13647,13.647,118.05035593997027,1.562325264154258,1.078154155513475,0.38309778580848358,1,0,826.21654383280986,1.5695859900476881,3.2081284758915314,1.2538060389987971,1.1909819270991646,0.57417017015052874,1,0,1,0,0.9969533847187998,3.5614901067744627E-2,11.085763024627271,-120.59572717370887,59.404272826291134,null,1000000000,186240609,null,47.972278282111105,-50.990385980147842,null,29.488659995004419,-69.605341193560974,null,0,0]
[13725.5,13.7255,118.72935424525821,1.5623737102493394,1.0790228234586579,0.38509045945796416,1,0,830.96908314190068,1.5695929122977088,3.224793838220203,1.2555009060234394,1.1930069809383723,0.5767889581290897,1,0,1,0,0.99691825944265766,3.5821114411186024E-2,11.023676565301635,-120.54947968160852,59.450520318391483,null,1000000000,188389350.25,null,47.95270649116727,-51.043719367182952,null,29.44614532662262,-69.505760314425544,null,0,0]
[13804,13.804,119.40835282603767,1.5624216053809015,1.0798957690289919,0.38707991939734254,1,0,835.72162249035671,1.5695997558175292,3.2414683687406689,1.2571783405971546,1.1950401887184212,0.57939885289132675,1,0,1,0,0.99688293327345989,3.6027351074018915E-2,10.961947176688893,-120.50387084094757,59.49612915905243,null,1000000000,190550416,null,47.933177171781836,-51.097537505413449,null,29.403945257395314,-69.406333335534114,null,0,0]
[13884.25,13.88425,120.10248859776013,1.5624700084449177,1.0807925861049887,0.38911040011110393,1,0,840.58011020823267,1.5696066719080684,3.2585239549439251,1.258875419429129,1.197127108151387,0.58205774747028993,1,0,1,0,0.99684661192778856,3.6238209615997392E-2,10.899206115846699,-120.45789170719739,59.54210829280261,null,1000000000,192772398.0625,null,47.913255266606924,-51.153041751247166,null,29.361126101728029,-69.304849955950203,null,0,0]
[13964.5,13.964499999999999,120.79662464763167,1.5625178552300636,1.0816938517293513,0.39113750558403915,1,0,845.43859796585355,1.5696135085091185,3.2755888281990075,1.2605548204733081,1.1992224614471203,0.58470736916727128,1,0,1,0,0.99681008065323051,3.644909281601879E-2,10.836828906876843,-120.41255251209047,59.587447487909529,null,1000000000,195007260.25,null,47.893375512369083,-51.209023008299511,null,29.318628646996014,-69.203529503790932,null,0,0]
[14044.75,14.044750000000001,121.49076097088468,1.5625651552710003,1.0825995547918115,0.39316122760729261,1,0,850.2970857625379,1.5696202669832571,3.292662844109997,1.2622168091853136,1.2013262044745892,0.58734772939756308,1,0,1,0,0.99677333946050828,3.666000081941103E-2,10.774810986400581,-120.36783980321331,59.632160196786685,null,1000000000,197255002.5625,null,47.873536838277808,-51.265466799201732,null,29.276449400611028,-69.102373004011625,null,0,0]
[14125,14.125,122.18489756285992,1.5626119178857325,1.0835096841646386,0.39518155811024175,1,0,855.15557359761988,1.569626948662096,3.3097458611839916,1.2638616459294341,1.2034382932352616,0.58997884001332512,1,0,1,0,0.99673638836040779,3.6870933771550887E-2,10.713147885881487,-120.32374042279001,59.67625957720999,null,1000000000,199515625,null,47.853738211585799,-51.322358961553348,null,29.234584926783931,-69.00138146123669,null,0,0]
[14207.25,14.20725,122.89633378323938,1.5626592977680103,1.0844470773830375,0.39724871187042776,1,0,860.13514528084011,1.5696337185341334,3.3272638186178631,1.2655299441855377,1.2056116341423229,0.59266593806538526,1,0,1,0,0.99669829855239844,3.7087149661014805E-2,10.650311626374009,-120.27916497546681,59.720835024533187,null,1000000000,201845952.5625,null,47.833486676233534,-51.381119775193191,null,29.192000202628726,-68.898045200273657,null,0,0]
[14289.5,14.2895,123.60777027632734,1.5627061322513898,1.0853890965632114,0.39931228623227782,1,0,865.11471700302752,1.5696404104718513,3.3447909395392581,1.2671807628150957,1.2077936487982084,0.59534334630372865,1,0,1,0,0.996659988267111,3.7303392067664698E-2,10.587838882435108,-120.2352067409207,59.764793259079298,null,1000000000,204189810.25,null,47.813275129594089,-51.440322446924213,null,29.149739005329273,-68.794884293996475,null,0,0]
[14371.75,14.37175,124.31920703744194,1.5627524306990641,1.0863357296709122,0.40137227295556371,1,0,870.09428876351308,1.5696470258133099,3.3623270806460415,1.2688143662432345,1.2099842902777302,0.59801107886819949,1,0,1,0,0.9966214575163671,3.7519661148181387E-2,10.525725136662379,-120.19185247310537,59.808147526894629,null,1000000000,206547198.0625,null,47.793102575925829,-51.499952713121317,null,29.107797813224803,-68.691899759984054,null,0,0]
[14454,14.454000000000001,125.03064406200784,1.5627982022611253,1.0872869646549608,0.40342866395047766,1,0,875.07386056164296,1.5696535658661122,3.3798721015371247,1.2704310137763069,1.2121835118100559,0.6006691503475069,1,0,1,0,0.99658270631205892,3.7735957059300974E-2,10.4639659654284,-120.1490892224066,59.850910777593398,null,1000000000,208918116,null,47.772968056052036,-51.559996627416417,null,29.066173161864612,-68.589092594990234,null,0,0]
[14622.5,14.6225,126.4881176761747,1.5628903634852671,1.0892500149869344,0.4076301908928997,1,0,885.27517189822106,1.5696667342745065,3.4158425493597235,1.2736910470822598,1.2167155050965077,0.60608445575554581,1,0,1,0,0.99650263097263314,3.8179152278070963E-2,10.338533229748792,-120.06327561508702,59.936724384912978,null,1000000000,213817506.25,null,47.731834744681663,-51.68423911693408,null,28.981873737555375,-68.3790364981529,null,0,0]
[14706.75,14.70675,127.21685487921626,1.5629356522058953,1.0902387312725941,0.40972526202116422,1,0,890.37582762308807,1.5696732053228064,3.4338411729289375,1.2752954428996524,1.2189948073269232,0.60877696918353397,1,0,1,0,0.99646224639657233,3.840079278265663E-2,10.276356781877944,-120.02124611010075,59.978753889899252,null,1000000000,216288495.5625,null,47.71132414080526,-51.746954427463344,null,28.940207893560942,-68.274291682637383,null,0,0]
[14791,14.791,127.94559234021592,1.5629804250262744,1.0912322242842993,0.41181652747412317,1,0,895.4764833848144,1.5696796026526103,3.4518485433106147,1.2768831033608539,1.2212829137933436,0.61145941300466822,1,0,1,0,0.99642163056703936,3.8622462108948041E-2,10.21453442033093,-119.97978444224916,60.020215557750845,null,1000000000,218773681,null,47.690849713647687,-51.810047433538664,null,28.898859959171503,-68.16973700871047,null,0,0]
[14877.25,14.87725,128.6916294694588,1.5630257354372832,1.0922542362534613,0.41395348672116089,1,0,900.69822300037117,1.5696860767911702,3.4702923069311442,1.2784913808176239,1.2236344059794668,0.61419512280366362,1,0,1,0,0.9963798110240828,3.884942364740851E-2,10.151606789713103,-119.93791378565051,60.062086214349492,null,1000000000,221332567.5625,null,47.669925833595414,-51.875015489324433,null,28.85685620860594,-68.062898296326082,null,0,0]
[14963.5,14.9635,129.43766685986427,1.5630705235388944,1.0932812267664311,0.41608644092234159,1,0,905.91996265324497,1.5696924762956184,3.4887449517378961,1.2800826493748947,1.2259950208080006,0.61692031788678414,1,0,1,0,0.99633774914595341,3.9076415750202383E-2,10.08904126917535,-119.89661223945355,60.103387760546454,null,1000000000,223906332.25,null,47.649038099046379,-51.940351358204069,null,28.815178422617226,-67.956260881249491,null,0,0]
[15049.75,15.04975,130.18370450694241,1.5631147983104487,1.0943131818064242,0.41821538197328223,1,0,911.14170234279425,1.569698802449135,3.5072063375497478,1.2816571695063839,1.2283647056845219,0.61963501851238167,1,0,1,0,0.99629544494694877,3.9303438598530652E-2,10.026833452728068,-119.85586710305978,60.144132896940221,null,1000000000,226494975.0625,null,47.628185666926157,-52.006041350371717,null,28.773823038290168,-67.849825752688048,null,0,0]
[15136,15.135999999999999,130.92974240630571,1.563158568526638,1.0953500873418487,0.42034030194557948,1,0,916.36344206839215,1.5697050565056527,3.5256763270559701,1.2832151965636858,1.2307434082183661,0.62233924540180452,1,0,1,0,0.99625289844145182,3.9530492373664294E-2,9.9649790252967012,-119.81566597239426,60.184334027605743,null,1000000000,229098496,null,47.607367727432447,-52.072072094349615,null,28.732786550352504,-67.743593878044649,null,0,0]
[15224,15.224,131.69091756209201,1.5632027157162787,1.0964131191479571,0.42250418390524053,1,0,921.69113017276584,1.5697113644214351,3.544529797732936,1.284788097072302,1.2331796140991627,0.62508756797818388,1,0,1,0,0.99620923895762448,3.9762185099573223E-2,9.9022294124209154,-119.7751972722584,60.224802727741604,null,1000000000,231770176,null,47.58616213766436,-52.139780235008196,null,28.69124252724481,-67.635417037250207,null,0,0]
[15312,15.311999999999999,132.45209297159056,1.5632463554960505,1.0974812748231904,0.4246638638384741,1,0,927.01881831339188,1.5697175998325235,3.5633919448270155,1.2863443496894034,1.2356250977563705,0.62782503249480703,1,0,1,0,0.99616532726534734,3.9993910401476436E-2,9.8398388779963266,-119.73526970323674,60.264730296763261,null,1000000000,234457344,null,47.564990852108593,-52.207815954378056,null,28.65002327837599,-67.527453748858719,null,0,0]
[15400,15.4,133.21326863045226,1.5632894965637487,1.0985545394212997,0.42681933388553789,1,0,932.34650648964885,1.5697237639818531,3.5822626312830539,1.2878842099105059,1.2380798042129593,0.63055166238685723,1,0,1,0,0.99612116338017354,4.0225668472132249E-2,9.7778031158094514,-119.69587100018791,60.304128999812093,null,1000000000,237160000,null,47.543853110253821,-52.276166027596489,null,28.609125258043882,-67.419704972591447,null,0,0]
[15488,15.488,133.97444453442685,1.5633321474195108,1.0996328979830399,0.428970586373775,1,0,937.67419470092932,1.5697298580841115,3.6011417228572769,1.2894079281879574,1.2405436787205195,0.63326748154878076,1,0,1,0,0.99607674731774842,4.045745950437675E-2,9.7161179078332331,-119.65698918957825,60.343010810421745,null,1000000000,239878144,null,47.522748182736542,-52.344817543448315,null,28.568544977584946,-67.31217164612994,null,0,0]
[15578.25,15.578250000000001,134.75508257255248,1.563375388308895,1.1007441035231282,0.43117245394527964,1,0,943.13810224882297,1.5697360364885409,3.6205121109632907,1.2909540960380197,1.2430800155749839,0.63604153589222456,1,0,1,0,0.99603093370260121,4.0695211450476269E-2,9.6532153064956709,-119.61763788447578,60.382362115524217,null,1000000000,242681873.0625,null,47.501136991772732,-52.415524253818901,null,28.527253567211197,-67.202113630656868,null,0,0]
[15668.5,15.6685,135.53572085973727,1.5634181310935991,1.101860634934781,0.4333698697835075,1,0,948.60200983230402,1.5697421437182724,3.6398910622583851,1.2924838037718993,1.2456258794002353,0.6388042719602165,1,0,1,0,0.99598485488355259,4.0932998476333027E-2,9.5906727024945599,-119.57880564329129,60.42119435670871,null,1000000000,245501892.25,null,47.479558856393062,-52.486521491952857,null,28.486289098589751,-67.092284151338447,null,0,0]
[15758.75,15.758749999999999,136.31635939170243,1.5634603843309054,1.102982476044116,0.43556282621895331,1,0,954.06591745076094,1.5697481809961518,3.6592784406947363,1.2939973057972249,1.2481812119009652,0.64155571696359182,1,0,1,0,0.99593851087778507,4.1170820790213655E-2,9.5284858193666331,-119.54048046033057,60.459519539669429,null,1000000000,248338201.5625,null,47.458013084636121,-52.557796310496627,null,28.445647987218766,-66.982684149833943,null,0,0]
[15849,15.849,137.09699816426658,1.5635021563832012,1.1041096106662258,0.43775131578477167,1,0,959.52982510359629,1.5697541495171718,3.6786741130339813,1.2954948514566953,1.2507459550423339,0.64429589857505487,1,0,1,0,0.99589190170258401,4.1408678600472822E-2,9.4666504679510961,-119.50265062219255,60.497349377807453,null,1000000000,251190801,null,47.436499014213268,-52.629336077163153,null,28.405326706226084,-66.873314545029388,null,0,0]
[15941.25,15.94125,137.89493665541659,1.5635443653417349,1.1052671772540215,0.43998367972175767,1,0,965.11481661745506,1.5697601804610977,3.6985080421536338,1.2970093474552169,1.2533772002204933,0.64708519315094637,1,0,1,0,0.99584398560613696,4.1651844399984712E-2,9.4038038347943029,-119.46448248528404,60.535517514715963,null,1000000000,254123451.5625,null,47.414540280971877,-52.702722203093032,null,28.36443880631068,-66.761760282190991,null,0,0]
[16033.5,16.0335,138.69287538941282,1.5635860886205573,1.1064302403429342,0.4422113614850367,1,0,970.69980816601333,1.5697661420060798,3.7183503640224234,1.2985076831776254,1.2560181559780135,0.64986277948894267,1,0,1,0,0.99579579249422223,4.1895047727044998E-2,9.3413159044567156,-119.4268080466744,60.573191953325605,null,1000000000,257073122.25,null,47.392613360571609,-52.776359435756724,null,28.323877796373367,-66.650448610917707,null,0,0]
[16125.75,16.12575,139.4908143620878,1.5636273345543239,1.1075987826177303,0.44443435374937956,1,0,976.28479974867548,1.5697720353431404,3.7382009449945435,1.2999901092849737,1.2586687611902911,0.65262868856484324,1,0,1,0,0.99574732238563524,4.2138288804458121E-2,9.2791824705766803,-119.38961569757753,60.610384302422474,null,1000000000,260039813.0625,null,47.370717634804855,-52.850235256356925,null,28.283640088260078,-66.539380441220601,null,0,0]
[16218,16.218,140.28875356936879,1.5636681112880721,1.108772786754769,0.44665264940575605,1,0,981.86979136485979,1.5697778616362033,3.7580596541928841,1.3014568714230641,1.2613289550241205,0.65538295180922146,1,0,1,0,0.99569857529928452,4.2381567855127006E-2,9.2173994120500158,-119.35289411781783,60.647105882182174,null,1000000000,263023524,null,47.348852513256276,-52.924337457953015,null,28.243722151282,-66.428556659864768,null,0,0]
[16312.5,16.3125,141.10615494763331,1.5637094043912281,1.1099810703335979,0.44892017279701996,1,0,987.59100232291973,1.5697837617061814,3.7784110162006104,1.3029434181770887,1.2640639106296208,0.65819235016365496,1,0,1,0,0.99564835208601077,4.2630820148101538E-2,9.1544685271897102,-119.31575348519807,60.684246514801927,null,1000000000,266097656.25,null,47.326485239991541,-53.000469320774158,null,28.203158539686424,-66.315284164423957,null,0,0]
[16407,16.407,141.92355656372936,1.5637502218433339,1.1111950486315894,0.4511827532713269,1,0,993.31221331496249,1.5697895938105297,3.7987706383469249,1.3044140337704897,1.2668088000117617,0.66098959584932637,1,0,1,0,0.995597838259625,4.2880112763117456E-2,9.0918968271852272,-119.27908371583702,60.720916284162982,null,1000000000,269189649,null,47.304148912671558,-53.076813781088354,null,28.162923167001921,-66.202269934748671,null,0,0]
[16501.5,16.5015,142.74095841357109,1.5637905718156571,1.1124147030047999,0.45344038388375785,1,0,999.03342434040428,1.5697953591169136,3.8191383885287609,1.3058689666770591,1.2695635587378877,0.66377472405832505,1,0,1,0,0.99554703384082288,4.3129445940113968E-2,9.0296801452035442,-119.24287353633663,60.757126463663369,null,1000000000,272299502.25,null,47.281842980546116,-53.153358685656549,null,28.123012417145681,-66.089514850680061,null,0,0]
[16596,16.596,143.55836049316574,1.5638304622933668,1.1136400148039813,0.45569305792157672,1,0,1004.7546353986746,1.5698010587664031,3.8395141373939756,1.3073084603648795,1.2723281227026932,0.66654777043046487,1,0,1,0,0.99549593885042476,4.3378819919141366E-2,8.9678143983822487,-119.20711196027449,60.792888039725511,null,1000000000,275427216,null,47.259566919020408,-53.230092192174538,null,28.083422731850092,-65.977019768099993,null,0,0]
[16692.5,16.692499999999999,144.39306232071559,1.563870730939029,1.1148970780360794,0.45798828582891921,1,0,1010.5969303221646,1.5698068124463116,3.8603292418120869,1.3087627346394755,1.2751612483918455,0.66936707501445725,1,0,1,0,0.99544346264516925,4.3633514010399083E-2,8.9049973203314892,-119.17104534527235,60.828954654727653,null,1000000000,278639556.25,null,47.236849713088247,-53.308632329475564,null,28.043322859731497,-65.862413015796804,null,0,0]
[16789,16.789000000000001,145.22776437971652,1.5639105366936323,1.1161600013776691,0.46027833172505778,1,0,1016.4392252787254,1.5698124999841545,3.881152422911335,1.3102014069683419,1.2780044646878037,0.67217385743632896,1,0,1,0,0.99539068348311877,4.3888251155325554E-2,8.8425378417626312,-119.13542425167293,60.86457574832707,null,1000000000,281870521,null,47.21416262889187,-53.387345135718164,null,28.003550465359016,-65.748079115954766,null,0,0]
[16885.5,16.8855,146.06246666620052,1.5639498874928919,1.1174287649593793,0.46256318920155715,1,0,1022.2815202677904,1.5698181225139285,3.9019835513865684,1.3116247212254843,1.2808577043939307,0.67496815700844648,1,0,1,0,0.99533760138684735,4.4143031609900123E-2,8.7804318714430156,-119.10023786045669,60.899762139543313,null,1000000000,285120110.25,null,47.191505185771334,-53.466218955357022,null,27.964101938159938,-65.634018905099694,null,0,0]
[16982,16.981999999999999,{"$f":"SQRT(1+(A269/pole1)^2)","v":146.89716917628976},{"$f":"ATAN(A269/pole1)","v":1.5639887910921582},{"$f":"SQRT(1+(A269/Zero1)^2)","v":1.1187033489103013},{"$f":"ATAN(A269/Zero1)","v":0.46484285209567766},{"$f":"IF(VIN_nom>Vout, 1, SQRT(1+(A269/z_RHP)^2))","v":1},{"$f":"IF(VIN_nom>Vout, 0, -ATAN(A269/z_RHP))","v":0},{"$f":"SQRT(1+(A269/Pole2)^2)","v":1028.1238152888054},{"$f":"ATAN(A269/Pole2)","v":1.5698236811438546},3.9228225006303701,1.3130329163547236,{"$f":"SQRT(1+(A269/pole4)^2)","v":1.2837209006751584},{"$f":"ATAN(A269/pole4)","v":0.6777500134740273},{"$f":"IF(VOUT_setting=1,1,SQRT(1+(A269*zterm1)^2))","v":1},{"$f":"IF(VOUT_setting=1,0,ATAN(((A269*zterm1))))","v":0},1,{"$f":"IF(VOUT_setting=1,0,ATAN(A269*$Q$4/(1+Afbr-$Q$5*(A269)^2)))","v":0},{"$f":"SQRT((1-(Z269/pterm2))^2+(A269/pterm1)^2)","v":0.99528421637906506},{"$f":"IF((ATAN((A269/pterm1)/(1-A269^2/pterm2))>0),ATAN((A269/pterm1)/(1-A269^2/pterm2)),PI()+ATAN((A269/pterm1)/(1-A269^2/pterm2)))","v":4.4397855630225816E-2},{"$f":"20*LOG10(((E269*K269*G269*O269)/(C269*I269*S269*M269*Q269))*Adc)","v":8.7186753997955204},{"$f":"((F269+L269+H269+P269)-(D269+J269+T269+N269+R269))*radconv","v":-119.06547563388766},{"$f":"IF(V269>0,V269,V269+180)","v":60.934524366112342},null,{"$f":"IF(U269<0,A269,1000000000)","v":1000000000},{"$f":"A269^2","v":288388324},null,{"$f":"20*LOG10((K269/(I269*M269))*AEA)","v":47.168876927268258},{"$f":"(L269-(J269+N269))*radconv","v":-53.545242438534629},null,{"$f":"20*LOG10((E269*G269/(C269*S269))*Acs*Am)","v":27.924973725015512},{"$f":"(F269+H269-(D269+T269))*radconv","v":-65.520233195353043},null,{"$f":"SUM((U270<0)*(U269>0))*A269","v":0},0]
[17081,{"$f":"A270/1000","v":17.081},147.75349633213622,1.564028245772437,1.120016980844792,0.46717616922416716,1,0,1034.1174651357453,1.5698293185104755,3.9442093164015755,1.314462126870988,1.2866685501839079,0.6805910500350465,1,0,1,0,0.99522913357960652,4.4659326851020406E-2,8.6556780981154304,-119.0302428652831,60.9697571347169,null,1000000000,291760561,null,47.145692319036598,-53.626457109713492,null,27.885161031567087,-65.403785755569629,null,0,0]
[17180,17.18,148.60982371533575,1.5640672457570868,1.1213366962585143,0.46950400678028126,1,0,1040.111115015171,1.5698348909063422,3.9656041018737369,1.3158759188144979,1.2896265374999072,0.68341907649238121,1,0,{"$f":"IF(VOUT_setting=1,1,SQRT((1+Afbr-$Q$5*(A271)^2)^2+(A271*$Q$4)^2))","v":1},0,0.99517373201930193,4.4920844470573401E-2,8.5930403431894078,-118.99543493192496,61.004565068075038,null,1000000000,295152400,null,47.122537527899851,-53.707806053455258,null,27.845678067777811,-65.287628878469704,null,0,0]
[17279,17.279,149.46615132198056,1.5641057988611702,1.1226624736976618,0.47182635890435687,1,0,1046.1047649265236,1.5698403994482033,3.9870067287475681,1.3172745347925379,1.2925947916517224,0.68623413708280645,1,0,1,0,0.99511801172312042,4.5182408765823183E-2,8.5307580590535377,-118.96104133137676,61.038958668623238,null,1000000000,298563841,null,47.099412134133878,-53.789277967951996,null,27.806521177407916,-65.171763363424787,null,0,0]
[17378,17.378,150.32247914825211,1.5641439127216783,1.1239942917113341,0.47414322000098974,1,0,1052.0984148692573,1.5698458452273585,4.0084170714174343,1.3186582124693418,1.2955732420731141,0.68903627646039745,1,0,1,0,0.99506197271618158,4.544402001384857E-2,8.4688272506196363,-118.92705184153368,61.072948158466318,null,1000000000,301994884,null,47.076315740713959,-53.870861857063005,null,27.767686762393929,-65.056189984470677,null,0,0]
[17479.25,17.47925,151.19826919385696,1.5641824462528888,1.125362604027927,0.47650705183532432,1,0,1058.228284160775,1.5698513509670931,4.0303218654577462,1.3200581285842674,1.2986298579351248,0.69188878273782572,1,0,1,0,0.99500433046357895,4.5711625826536414E-2,8.4058483912122757,-118.89269748758018,61.107302512419821,null,1000000000,305524180.5625,null,47.052724034772559,-53.954404598481993,null,27.728299608927966,-64.938292889098193,null,0,0]
[17580.5,17.580500000000001,152.0740594613801,1.5642205359570922,1.1267371892409488,0.47886512921281371,1,0,1064.3581534840016,1.5698567932893306,4.0522344725811061,1.3214429071927525,1.3016969908033473,0.69472786954907861,1,0,1,0,0.99494635490237471,4.5979281337142068E-2,8.3432289621876734,-118.85874506068565,61.141254939314351,null,1000000000,309073980.25,null,47.029161891029858,-54.038042142802375,null,27.689242323646074,-64.820702917883281,null,0,0]
[17681.75,17.681750000000001,152.94984994700954,1.5642581894582339,1.1281180244202706,0.48121744699214847,1,0,1070.4880228383922,1.5698621732835019,4.0741547667208602,1.3228127872748763,1.3047745665108215,0.69755358592219918,1,0,1,0,0.99488804605993308,4.6246986842529932E-2,8.2809649380424961,-118.82518448822421,61.17481551177579,null,1000000000,312644283.0625,null,47.005628952437782,-54.121763668993957,null,27.650511238092967,-64.70342081923026,null,0,0]
[17783,17.783000000000001,153.8256406470199,1.5642954142066403,1.1295050866438887,0.48356400031206243,1,0,1076.6178922234146,1.5698674920142264,4.0960826244651978,1.3241680029196869,1.3078625113373499,0.70036598127861271,1,0,1,0,0.99482940396378372,4.6514742639721718E-2,8.2190523723721398,-118.79200597293899,61.207994027061005,null,1000000000,316235089,null,46.982124882855622,-54.205558657379505,null,27.612102742004772,-64.586447315559482,null,0,0]
[17886.5,17.886500000000002,154.72089358037539,1.5643330306022547,1.1309293847650177,0.48595673645895865,1,0,1082.8839809592228,1.5698728667015596,4.1185054597363875,1.325538416343691,1.311029718184912,0.70322715782502188,1,0,1,0,0.99476911429433201,4.6788500855790775E-2,8.1561232038318145,-118.75847512336009,61.241524876639915,null,1000000000,319926882.25,null,46.958128009999626,-54.291281039545431,null,27.573170446320447,-64.467194083814661,null,0,0]
[17990,17.989999999999998,155.61614673014088,1.5643702141868361,1.1323601413578011,0.48834343971459204,1,0,1089.1500697259526,1.5698781795456835,{"$f":"SQRT(1+(A279/Zero2)^2)","v":4.1409359459226884},{"$f":"ATAN(A279/Zero2)","v":1.3268939858694806},1.3142076057746737,0.70607452035567708,1,0,1,0,0.9947084764540316,4.7062312251833605E-2,8.0935531921677466,-118.72532364629525,61.274676353704749,null,1000000000,323640100,null,46.934160656208476,-54.377058886274888,null,27.534567788447532,-64.348264760020356,null,0,0]
[18093.5,18.093499999999999,156.5114000926028,1.5644069723873857,1.1337973319720998,0.49072410577848863,1,0,1095.4161585230734,1.5698834316078798,4.1633739593644838,1.3282349464727925,1.3173960968128036,0.7089081228360028,1,0,1,0,0.99464749047282797,4.7336177145632846E-2,8.0313383643371878,-118.69254192156696,61.307458078433044,null,1000000000,327374742.25,null,46.910222524461069,-54.462881887247931,null,27.496291092364377,-64.229660034319011,null,0,0]
[18197,18.196999999999999,157.40665366413197,1.564443312461945,1.1352409321719152,0.49309873064563015,1,0,1101.6822473500665,1.5698886239252841,4.1858193790125995,1.3295615283020668,1.3205951144952943,0.71172801959498611,1,0,1,0,0.99458615638084846,4.7610095855147153E-2,7.9694748245094837,-118.66012059842949,61.339879401570514,null,1000000000,331130809,null,46.886313336835812,-54.548740028175381,null,27.458336740161926,-64.111380570254113,null,0,0]
[18303,18.303000000000001,158.32353193106269,1.5644801043297649,1.136726020112274,0.49552444788137817,1,0,1108.099691010078,1.5698938807931084,4.2088145114555422,1.3309054847598629,1.3238822345166656,0.71460188063054531,1,0,1,0,0.99452297999569661,4.7890687072281529E-2,7.9064771228727881,-118.62728022145154,61.372719778548458,null,1000000000,334999809,null,46.861856362654535,-54.636698299979251,null,27.419796012706513,-63.990581921472298,null,0,{"$f":"IF(AH282>0,W282,0)","v":0}]
[18409,18.408999999999999,159.24041040983874,1.564516472515332,1.1382177791900348,0.49794382098566059,1,0,1114.5171347003593,1.5698990771223333,4.2318171633141404,1.3322348330591576,1.327180234368927,0.71746148228320938,1,0,1,0,0.99445943854426921,4.8171335411957644E-2,7.8438398524139563,-118.59479884887129,61.405201151128708,null,1000000000,338891281,null,46.837429215451536,-54.724673086547142,null,27.381585889450676,-63.870125762324157,null,0,0]
[18515,18.515000000000001,160.15728909682181,1.5645524242951188,1.1397161832099139,0.50035684660243518,1,0,1120.9345784203895,1.5699042139527239,4.2548272126329127,1.333549805465273,1.3304890331457075,0.7203068839966611,1,0,1,0,0.99439553205952436,4.8452041216316924E-2,7.7815590662631298,-118.56266726711377,61.437332732886233,null,1000000000,342805225,null,46.813031653520831,-54.812654545502618,null,27.343702665230552,-63.750012721611142,null,0,0]
[18621,18.620999999999999,161.07416798845637,1.5645879667799236,1.1412212059978237,0.50276352168891991,1,0,1127.352022169661,1.5699092923003704,4.277844540041519,1.3348506294459186,1.3338085504798505,0.72313814554544442,1,0,1,0,0.9943312605746214,4.8732804827699226E-2,7.7196308934952462,-118.53087652765797,61.469123472342034,null,1000000000,346741641,null,46.788663452608823,-54.900633126952755,null,27.306142693374674,-63.630243400705211,null,0,0]
[18729.5,18.729500000000002,162.0126715905738,1.5646239308955157,1.1427685520728668,0.50522037816845344,1,0,1133.9208207541058,1.5699144308888329,4.3014121445842717,1.3361677128630853,1.3372173757287518,0.72602160051400499,1,0,1,0,0.99426509527321782,4.9020250448072289E-2,7.6566033736689976,-118.49867993187455,61.501320068125452,null,1000000000,350794170.25,null,46.763750721270767,-54.990674025531426,null,27.268027904886488,-63.508005906343136,null,0,0]
[18838,18.838000000000001,162.95117539982749,1.5646594807464582,1.1443227773842901,0.50767057557313688,1,0,1140.489619368147,1.5699195102845556,4.324987129496547,1.3374704399928752,1.3406372624276262,0.72889036818563546,1,0,1,0,0.99419854762258486,4.9307757360828132E-2,7.5939373238809091,-118.46682229221022,61.533177707789775,null,1000000000,354870244,null,46.738868329335915,-55.080692567165528,null,27.230244247033248,-63.386129725044668,null,0,0]
[18946.5,18.9465,163.88967941265904,1.5646946234494428,1.1458838539400336,0.51011411163973064,1,0,1147.058418011276,1.5699245315044659,4.3485693747443195,1.3387590399392191,1.3440681261412346,0.73174451363356263,1,0,1,0,0.99413161765893854,4.9595325933758531E-2,7.5316288265872799,-118.43529482716687,61.564705172833129,null,1000000000,358969862.25,null,46.714016087934809,-55.170679411853619,null,27.192787991140722,-63.264615415313216,null,0,0]
[19055,19.055,164.82818362559095,1.5647293659590797,1.147451753777309,0.5125509844354742,1,0,1153.627216682996,1.5699294955423295,4.3721587628467136,1.3400337370516078,1.3475098830246106,0.73458410222228165,1,0,1,0,0.99406430541871671,4.9882956534878502E-2,7.4696740387793961,-118.40408901480838,61.595910985191622,null,1000000000,363093025,null,46.689193823972921,-55.260625507365056,null,27.155655467294729,-63.143463507443293,null,0,0]
[19165.75,19.165749999999999,165.78615011029345,1.5647644232653366,1.1490591756542394,0.51503151782280521,1,0,1160.3322347109925,1.569934504556511,4.3962445789817153,1.3413207578291091,1.3510341606480207,0.73746763165758678,1,0,1,0,0.99399520309075162,5.0176616179258136E-2,7.4067953471706325,-118.37255921808324,61.627440781916761,null,1000000000,367325973.0625,null,46.66388756487558,-55.352385710890267,null,27.118083034783304,-63.020173507192951,null,0,0]
[19276.5,19.276499999999999,166.74411679640841,1.5647990777540475,1.15067364796634,0.51750510568527486,1,0,1167.0372527677669,1.56993945601378,4.4203375977904145,1.3425937509008266,1.3545696132636409,0.74033613270621401,1,0,1,0,0.99392570254445112,5.0470341226640555E-2,7.3442773246065993,-118.34134740563024,61.658652594369755,null,1000000000,371583452.25,null,46.638612221949522,-55.444085281855401,null,27.080840355145341,-62.897262123774809,null,0,0]
[19387.25,19.387250000000002,167.70208368048418,1.5648333363281886,1.152295141078671,0.51997174701055215,1,0,1173.7422708528268,1.5699443509005202,4.4444377021370816,1.3438529403040946,1.3581161535991397,0.74318967571208727,1,0,1,0,0.99385580381928162,5.0764132069142293E-2,7.282116111243262,-118.3104453039615,61.689554696038499,null,1000000000,375865462.5625,null,46.613367657102387,-55.535715470792269,null,27.04392370662913,-62.774729833169225,null,0,0]
[19498,19.498000000000001,168.66005075914762,1.5648672057339081,1.1539236253943546,0.52243144113010154,1,0,1180.4472889656899,1.5699491901807043,4.4685447773788916,1.3450985454189004,1.3616736950191259,0.74602833126182966,1,0,1,0,0.99378550695495149,5.1057989099128169E-2,7.2203079195994206,-118.27984489038778,61.720155109612222,null,1000000000,380172004,null,46.588153746204206,-55.627267807700655,null,27.007329425883462,-62.652577082687102,null,0,0]
[19611.75,19.611750000000001,169.64396748374014,1.5649015943964044,1.1556034689406001,0.52495053115634716,1,0,1187.3339328798106,1.5699541036506479,4.493312004786401,1.346363975936872,1.3653389650373648,0.74892845697169819,1,0,1,0,0.99371289146614394,5.1359875452459826E-2,7.1571890567154259,-118.24872145917399,61.751278540826007,null,1000000000,384620738.0625,null,46.562288634323686,-55.721210464184573,null,26.97007567487999,-62.527510994989449,null,0,0]
[19725.5,19.7255,170.62788440663653,1.5649355864580321,1.1572906244161945,0.52746229217522123,1,0,1194.2205768222655,1.5699589604521356,4.518086348507139,1.3476155307906592,1.3690156570060437,0.75181302941026062,1,0,1,0,0.99363985606211491,5.1661832467462011E-2,7.094434726775674,-118.21789990753949,61.78210009246051,null,1000000000,389095350.25,null,46.536455636328178,-55.815053753997233,null,26.933154342935754,-62.402846153542249,null,0,0]
[19839.25,19.83925,171.61180152442594,1.5649691887403123,1.1589850598888156,0.5299667245697639,1,0,1201.107220792567,1.5699637615599065,4.5428676921155313,1.3488534331022486,1.3727036791464509,0.75468212574126359,1,0,1,0,0.99356640078668435,5.1963860570084494E-2,7.0320410515923069,-118.18737232184438,61.812627678155621,null,1000000000,393595840.5625,null,46.510654659091912,-55.908789370195997,null,26.896561644988655,-62.278582951648396,null,0,0]
[19953,19.952999999999999,172.59571883377527,1.5650024079092202,1.1606867434752226,0.53246382908851286,1,0,1207.9938647902393,1.5699685079264725,4.5676559216800872,1.3500779013196107,1.3764029403822269,0.75753582332187286,1,0,1,0,0.9934925256839412,5.226596018656024E-2,6.9700042250107206,-118.1571310362215,61.8428689637785,null,1000000000,398122209,null,46.484885622003176,-56.002409283448074,null,26.860293855495797,-62.154721752773433,null,0,0]
[20069,20.068999999999999,173.59909843765362,1.5650358963580586,1.1624295183234938,0.53500278130584944,1,0,1215.0167281474394,1.5699732927660381,4.5929414439071534,1.3513129761821794,1.3801868548947855,0.76043018939411244,1,0,1,0,0.99341675699555865,5.257410949168239E-2,6.9071039298965475,-118.12657872558215,61.873421274417851,null,1000000000,402764761,null,46.458639690522375,-56.097753817967067,null,26.823639491862426,-62.028824907615068,null,0,0]
[20185,20.184999999999999,174.60247823398169,1.5650689999139666,1.1641797640528437,0.53753411560060615,1,0,1222.0395915321369,1.5699780226102098,4.6182338955273528,1.3525345247451377,1.3839822684416876,0.7633087045329674,1,0,1,0,0.99334055180051561,5.2882334063955427E-2,6.844566965728033,-118.09630880679707,61.903691193202931,null,1000000000,407434225,null,46.432426842777716,-56.192962009777766,null,26.787315375438574,-61.903346797019289,null,0,0]
[20301,20.300999999999998,175.60585821946049,1.5651017251744961,1.1659374470185582,0.54005783391295081,1,0,1229.062454943861,1.5699826984017182,4.6435331633113828,1.3537427644180329,1.3877890866780729,0.76617145128206343,1,0,1,0,0.99326391014643778,5.3190634356330146E-2,6.7823895149389042,-118.06631389943321,61.933686100566788,null,1000000000,412130601,null,46.406247029182822,-56.288026185646544,null,26.751317738244332,-61.778287713786696,null,0,0]
[20417,20.417000000000002,176.60923839086618,1.5651340785872692,1.1677025336359614,0.54257393855945113,1,0,1236.0853183821505,1.5699873210618696,4.6688391364540021,1.3549379080541559,1.3916072160094743,0.76901851231700724,1,0,1,0,0.99318683208124381,5.3499010822071272E-2,6.7205678296738576,-118.03658686030785,61.96341313969215,null,1000000000,416853889,null,46.380100210889601,-56.382938939728461,null,26.715642871272507,-61.653647920579409,null,0,0]
[20536,20.536000000000001,177.63856823936308,1.5651668889329915,1.1695209272489646,0.5451472061280549,1,0,1243.2898076261502,1.5699920090069703,4.6948064284980759,1.356150570530974,1.3955357464289331,0.77192299155434441,1,0,1,0,0.99310730718154017,5.3815442170471912E-2,6.6575131369218932,-118.0063621236938,61.993637876306195,null,1000000000,421727296,null,46.353311438049339,-56.480141499395636,null,26.679376951360808,-61.526220624298162,null,0,0]
[20655,20.655000000000001,178.6678982768878,1.5651993212290289,1.1713470410116327,0.5477124672622643,1,0,1250.4942968971584,1.5699966429346315,4.720780548532975,1.3573498904193912,1.3994759834341566,0.77481113986810346,1,0,1,0,0.99302732310894959,5.4131954650573098E-2,6.5948250758867877,-117.97640479586768,62.02359520413232,null,1000000000,426629025,null,46.326557338396704,-56.577169745097869,null,26.643442989978332,-61.399235050769811,null,0,0]
[20774,20.774000000000001,179.69722850019204,1.5652313819718733,1.1731808388735865,0.55026972566643229,1,0,1257.6987861947109,1.5700012237731387,4.7467613844710872,1.358536083327887,1.4034278284235921,0.77768304682930656,1,0,1,0,0.99294687991616781,5.4448548752766654E-2,6.5324998167559549,-117.9467078966771,62.053292103322903,null,1000000000,431559076,null,46.29983790117717,-56.674016508607664,null,26.607837168067036,-61.272691388069475,null,0,0]
[20893,20.893000000000001,180.72655890610147,1.5652630775100158,1.175022284858271,0.55281898544050889,1,0,1264.9032755183548,1.5700057524296289,4.7727488266367617,1.3597093603186099,1.4073911836142927,0.78053880207609572,1,0,1,0,0.9928659776562172,5.4765224967800785E-2,6.4705335988404631,-117.9172646779639,62.0827353220361,null,1000000000,436517449,null,46.273153124896808,-56.770674884816984,null,26.572555726431915,-61.146589793146909,null,0,0]
[21014.75,21.014749999999999,181.77967654495492,1.5652951340164829,1.1769141631046318,0.55541888333579659,1,0,1272.2742551680346,1.5700103326596679,4.7993435440071632,1.3608965992430793,1.4114579400856131,0.78344392929330742,1,0,1,0,0.99278273075907364,5.508930482395491E-2,6.4075031198316958,-117.88739678857368,62.112603211426318,null,1000000000,441619717.5625,null,46.245887562827122,-56.869365061629267,null,26.536790809492821,-61.018031726944429,null,0,0]
[21136.5,21.136500000000002,182.83279436845677,1.5653268212317026,1.1788139710995955,0.5580104185721535,1,0,1279.6452348440973,1.5700148601238599,4.8259449516616293,1.3620707512923194,1.4155365404234572,0.7863323396239662,1,0,1,0,0.99269900344554252,5.5413471672338656E-2,6.3448407176719881,-117.85778086211494,62.142219137885064,null,1000000000,446751632.25,null,46.218658306184103,-56.967844230852535,null,26.501357663976147,-60.889936631262422,null,0,0]
[21258.25,21.25825,183.88591237343459,1.5653581455004237,1.1807216705657262,0.56059359679095311,1,0,1287.0162145460899,1.5700193357288035,4.8525529395729388,1.3632320284796344,1.4196268825452349,0.78920412916282823,1,0,1,0,0.99261479577346867,5.5737726039687609E-2,6.2825425774989228,-117.82841037936855,62.171589620631451,null,1000000000,451913193.0625,null,46.191465379703686,-57.06610580278749,null,26.466252450283491,-60.762304576581066,null,0,0]
[21380,21.38,184.9390305567882,1.5653891130228799,1.1826372233140805,0.56316842404336032,1,0,1294.3871942735691,1.5700237603604474,4.8791674000870309,1.3643806383330639,1.4237288652492788,0.79205939399854852,1,0,1,0,0.99253010780105555,5.6062068453137555E-2,6.2206049522900599,-117.79927904483286,62.200720955167142,null,1000000000,457104400,null,46.164308815826899,-57.164143443188841,null,26.431471388951419,-60.635135601644052,null,0,0]
[21504.5,21.5045,186.01593598513969,1.565420417405984,1.184604124834209,0.56579278030455948,1,0,1301.9246643288066,1.570028233121179,4.9063895923846523,1.3655423040508097,1.4279354339594243,0.79496216276958698,1,0,1,0,0.99244301032377924,5.6393828477224961E-2,6.1576373118330396,-117.76973069228087,62.230269307719126,null,1000000000,462443520.25,null,46.136576504514153,-57.264157570266832,null,26.396236059807144,-60.505573122014049,null,0,0]
[21629,21.629000000000001,187.09284159368173,1.5654513614133236,1.186579157933416,0.56840841817191035,1,0,1309.4621344097898,1.5700326543900813,4.9336183326236887,1.3666911487910605,1.4321539638087657,0.79784785503789279,1,0,1,0,0.99235541072802536,5.6725681685952906E-2,6.0950389407721284,-117.74041978407679,62.259580215923208,null,1000000000,467813641,null,46.108882307974959,-57.363924923444294,null,26.361331885285427,-60.376494860632512,null,0,0]
[21753.5,21.753499999999999,188.16974737932048,1.5654819512321894,1.1885622820749848,0.57101534540658105,1,0,1316.9996045160772,1.5700370250512508,4.9608535129846754,1.3678273806582188,1.4363843494109818,0.8007165734112357,1,0,1,0,0.99226730907719773,5.7057628644304435E-2,6.0328060407736741,-117.7113402685585,62.288659731441498,null,1000000000,473214762.25,null,46.081226282436191,-57.46343950886444,null,26.326755010825742,-60.247900759694069,null,0,0]
[21878,21.878,189.24665333903272,1.5655121929090405,1.1905534568267755,0.57361357019171644,1,0,1324.5370746472363,1.5700413459686591,4.9880950279777112,1.3689512033424858,1.4406264863231688,0.80356842041137833,1,0,1,0,0.99217870543509401,5.7389669917711321E-2,5.9709348799988469,-117.6824863086771,62.317513691322901,null,1000000000,478646884,null,46.053608490307965,-57.562695579504634,null,26.292501642179133,-60.119790729172458,null,0,0]
[22005.25,22.00525,190.3473465549842,1.5655427489640164,1.1925968906836042,0.5762602015308631,1,0,1332.2410351077599,1.570045711802901,5.0159447018011445,1.3700872336001311,1.444974360840469,0.80646593214979212,1,0,1,0,0.99208762600527878,5.7729143488151363E-2,5.9080670829066415,-117.65322223722924,62.346777762770756,null,1000000000,484231027.5625,null,46.025420247049894,-57.66387117803486,null,26.257822088345005,-59.989351059194384,null,0,0]
[22132.5,22.1325,191.44803994661416,1.5655729536667911,1.1946486496611133,0.57889776033569185,1,0,1339.9449955933849,1.5700500274347617,5.043800777534523,1.3712107170807355,1.4493342939019451,0.80934603517528436,1,0,1,0,0.99199602229897532,5.8068716782057335E-2,5.8455695037603288,-117.62418212165221,62.375817878347789,null,1000000000,489847556.25,null,45.997272094366153,-57.764765331773951,null,26.223472661882429,-59.859416789878253,null,0,0]
[22259.75,22.25975,192.5487335109099,1.5656028130427622,1.1967086909390054,0.58152625666769919,1,0,1347.6489561036803,1.5700542937252016,5.0716631496905071,1.3723218577105181,1.453706177010204,0.81220883855695802,1,0,1,0,0.9919038943855828,5.8408390404634344E-2,5.7834383619109726,-117.59536037978725,62.404639620212748,null,1000000000,495496470.0625,null,45.969164115769559,-57.865372655138927,null,26.189449498629671,-59.729987724648353,null,0,0]
[22387,22.387,193.6494272449271,1.5656323329803368,1.198776971819062,0.58414570102025898,1,0,1355.3529166382259,1.5700585115156047,5.0995317150635806,1.3734208550813598,1.4580899026735077,0.81505445119187803,1,0,1,0,0.99181124233493245,5.8748164961589446E-2,5.7216699418196937,-117.5667516342713,62.433248365728701,null,1000000000,501177769,null,45.941096399482824,-57.965687999907352,null,26.155748794825122,-59.601063634363953,null,0,0]
[22517.5,22.517499999999998,194.77823317292101,1.5656622603397803,1.2009065905189771,0.58682265642450193,1,0,1363.2536384685477,1.5700627875169062,5.1281183779987058,1.3745355133333232,1.4625977784648279,0.81795500048475611,1,0,1,0,0.99171567961090701,5.9096722923317517E-2,5.6586968502302595,-117.53762801528335,62.462371984716654,null,1000000000,507037806.25,null,45.912353740808271,-58.068257016166939,null,26.121518361910244,-59.4693709991164,null,0,0]
[22648,22.648,195.90703927335704,1.5656918428194946,1.2030447845201524,0.58949011528167794,1,0,1371.1543603235079,1.5700670142407553,5.1567113417848187,1.3756378118147849,1.4671178836859156,0.82083770105736931,1,0,1,0,0.99161956578466837,5.9445388333035143E-2,5.5960975324197086,-117.50871758748048,62.491282412519524,null,1000000000,512931904,null,45.883653628541779,-58.170508715380755,null,26.087619156366181,-59.338208872099713,null,0,0]
[22778.5,22.778500000000001,197.03584554327151,1.5657210863468116,1.2051915081809021,0.5921480902780264,1,0,1379.0550822026839,1.5700711925340958,5.1853105021890098,1.3767279523325657,1.4716501056503919,0.82370266968386341,1,0,1,0,0.9915229009329567,5.9794161845720319E-2,5.5338681830294467,-117.48001517764619,62.519984822353805,null,1000000000,518860062.25,null,45.854996170393576,-58.272438274061663,null,26.054047265124119,-59.207576903584552,null,0,0]
[22909,22.908999999999999,198.16465197976817,1.5657499967140105,1.207346716002726,0.59479659454575229,1,0,1386.9558041056609,1.5700753232245732,5.21391575724296,1.3778061323818065,1.4761943327555351,0.82655002287061541,1,0,1,0,0.99142568513299334,6.0143044116920355E-2,5.4720050613789928,-117.45151580990007,62.548484190099927,null,1000000000,524822281,null,45.826381477419666,-58.37404109931591,null,26.020798836447586,-59.077474710584177,null,0,0]
[23042.25,23.042249999999999,199.31724569402374,1.5657791784200703,1.209556047178709,0.59749115211548975,1,0,1395.0230163410772,1.5700794926825357,5.2431299900266808,1.3788948923431152,1.4808465918747362,0.82943932235289097,1,0,1,0,0.99132585231935,6.0499391215571303E-2,5.4092123748577752,-117.42262041459873,62.577379585401275,null,1000000000,530945285.0625,null,45.797208037734052,-58.477443307176074,null,25.987179589611973,-58.945177107422673,null,0,0]
[23175.5,23.1755,200.46983957606056,1.5658080245678885,1.2117741284455998,0.60017586466036066,1,0,1403.0902286004662,1.5700836141950396,5.2723503691261202,1.3799715853350381,1.4855111356868684,0.83231050072692081,1,0,1,0,0.99122544525700984,6.0855853087890585E-2,5.3467938303044882,-117.39392682396974,62.606073176030264,null,1000000000,537103800.25,null,45.768079427519702,-58.580495891358169,null,25.953889655273045,-58.813430932611624,null,0,0]
[23308.75,23.30875,201.62243362300117,1.5658365409121695,1.2140009118419539,0.60285074754833556,1,0,1411.1574408834169,1.5700876885843589,5.3015767929124538,1.3810364084079834,1.4901878488323417,0.83516368104252314,1,0,1,0,0.99112446402973531,6.1212430433608252E-2,5.2847456434496243,-117.36543033449652,62.634569665503477,null,1000000000,543297826.5625,null,45.738995773226883,-58.683194659053491,null,25.920925122711004,-58.682235675443025,null,0,0]
[23442,23.442,202.77502783203366,1.565864733076779,1.2162363495700954,0.60551581659770659,1,0,1419.2246531895273,1.5700917166540718,5.330809161964801,1.3820895543991425,1.4948766170960865,0.83799898598384559,1,0,1,0,0.99102290872181487,6.156912395308882E-2,5.2230640932291141,-117.33712642877762,62.662873571222377,null,1000000000,549527364,null,45.709957203285754,-58.785535636830396,null,25.888282142431621,-58.551590791947199,null,0,0]
[23578.5,23.578499999999998,203.95573426014261,1.5658932824638343,1.2185352339082272,0.60823572853030539,1,0,1427.4886267950001,1.5700957957622705,5.3607605785060199,1.3831564763735251,1.4996921271103645,0.84088503787659352,1,0,1,0,0.99091828128947357,6.1934638505856981E-2,5.1602544492388205,-117.30832733736197,62.691672662638027,null,1000000000,555945662.25,null,45.680257258680676,-58.889997819342042,null,25.855172443046399,-58.418329518019931,null,0,0]
[23715,23.715,205.13644085257567,1.5659215032067244,1.2208430988852115,0.6109453770775698,1,0,1435.7526004239517,1.5700998279130165,5.3907180295077923,1.3842115412797507,1.5045200484809098,0.84375259116577694,1,0,1,0,0.99081305161179212,6.2300276458385304E-2,5.0978218361588157,-117.27972131255932,62.720278687440683,null,1000000000,562401225,null,45.650604902145027,-58.994076779441045,null,25.822392186502046,-58.285644533118315,null,0,0]
[23851.5,23.851500000000001,206.31714760651158,1.5659494009476747,1.2231598936668895,0.61364478065755179,1,0,1444.0165740759787,1.570103813912509,5.4206814149215932,1.3852549433727825,1.5093602621088211,0.84660177642959722,1,0,1,0,0.99070721978109832,6.2666038565642249E-2,5.0357624496956008,-117.25130406340742,62.748695936592583,null,1000000000,568894052.25,null,45.621000275911271,-59.097768914909523,null,25.789937426272587,-58.153535148497916,null,0,0]
[23988,23.988,207.49785451919342,1.5659769812004904,1.2254855676075624,0.61633395814651593,1,0,1452.2805477506874,1.5701077545485971,5.4506506368792529,1.3862868727381605,1.5142126501166999,0.84943272377171042,1,0,1,0,0.99060078589030243,6.3031925583312817E-2,4.9740725482080546,-117.22307147602288,62.776928523977119,null,1000000000,575424144,null,45.591443522919718,-59.201070834179092,null,25.757804277776593,-58.022000641843775,null,0,0]
[24127.75,24.127749999999999,208.70667366287196,1.5660048948355672,1.2278757608405986,0.61907658964625933,1,0,1460.741282726462,1.5701117428169298,5.4813393584194969,1.387331680357847,1.5191930619850862,0.85231231551750852,1,0,1,0,0.99049119422397991,6.3406654393406259E-2,4.9112927821562948,-117.19435387674302,62.805646123256977,null,1000000000,582148320.0625,null,45.561232783953102,-59.306424731986297,null,25.725235250691448,-57.887929144756718,null,0,0]
[24267.5,24.267499999999998,209.91549296729576,1.5660324869837616,1.230275154260422,0.62180854377523398,1,0,1469.2020177252036,1.5701156851505567,5.5120339968839422,1.3883648527399353,1.5241859886904385,0.85517306492893863,1,0,1,0,0.99038097168568862,6.3781515738216166E-2,4.8488925621316996,-117.16582165149092,62.834178348509084,null,1000000000,588911556.25,null,45.531072529190581,-59.411363061700833,null,25.692995285429379,-57.754458589790083,null,0,0]
[24407.25,24.407250000000001,211.12431242970374,1.5660597631671749,1.2326836941431119,0.62452984222198682,1,0,1477.6627527465182,1.5701195823385097,5.542734453972094,1.3893865809982173,1.5291913076470589,0.85801510997518382,1,0,1,0,0.99027011837703682,6.4156510431064601E-2,4.7868680665767442,-117.13747092084367,62.862529079156332,null,1000000000,595713852.5625,null,45.500962912325427,-59.515882823569022,null,25.661080406739572,-57.621588097274639,null,0,0]
[24547,24.547000000000001,{"$f":"SQRT(1+(A333/pole1)^2)","v":212.33313204739767},{"$f":"ATAN(A333/pole1)","v":1.5660867287821605},{"$f":"SQRT(1+(A333/Zero1)^2)","v":1.2351013269798108},{"$f":"ATAN(A333/Zero1)","v":0.62724050713749147},{"$f":"IF(VIN_nom>Vout, 1, SQRT(1+(A333/z_RHP)^2))","v":1},{"$f":"IF(VIN_nom>Vout, 0, -ATAN(A333/z_RHP))","v":0},{"$f":"SQRT(1+(A333/Pole2)^2)","v":1486.1234877900201},{"$f":"ATAN(A333/Pole2)","v":1.5701234351518536},5.573440633530919,1.3903970521315907,{"$f":"SQRT(1+(A333/pole4)^2)","v":1.5342088975667034},{"$f":"ATAN(A333/pole4)","v":0.86083858803585678},{"$f":"IF(VOUT_setting=1,1,SQRT(1+(A333*zterm1)^2))","v":1},{"$f":"IF(VOUT_setting=1,0,ATAN(((A333*zterm1))))","v":0},1,{"$f":"IF(VOUT_setting=1,0,ATAN(A333*$Q$4/(1+Afbr-$Q$5*(A333)^2)))","v":0},{"$f":"SQRT((1-(Z333/pterm2))^2+(A333/pterm1)^2)","v":0.99015863440027641},{"$f":"IF((ATAN((A333/pterm1)/(1-A333^2/pterm2))>0),ATAN((A333/pterm1)/(1-A333^2/pterm2)),PI()+ATAN((A333/pterm1)/(1-A333^2/pterm2)))","v":6.4531639286081063E-2},{"$f":"20*LOG10(((E333*K333*G333*O333)/(C333*I333*S333*M333*Q333))*Adc)","v":4.7252155359747885},{"$f":"((F333+L333+H333+P333)-(D333+J333+T333+N333+R333))*radconv","v":-117.10929797268165},{"$f":"IF(V333>0,V333,V333+180)","v":62.890702027318355},null,{"$f":"IF(U333<0,A333,1000000000)","v":1000000000},{"$f":"A333^2","v":602555209},null,{"$f":"20*LOG10((K333/(I333*M333))*AEA)","v":45.470904086541879},{"$f":"(L333-(J333+N333))*radconv","v":-59.619981218794088},null,{"$f":"20*LOG10((E333*G333/(C333*S333))*Acs*Am)","v":25.629486701921167},{"$f":"(F333+H333-(D333+T333))*radconv","v":-57.489316753887557},null,{"$f":"SUM((U334<0)*(U333>0))*A333","v":0},0]
[24690,{"$f":"A334/1000","v":24.69},213.57006390721833,1.5661140055194491,1.2375845408532422,0.63000322701002553,1,0,1494.7809841361777,1.5701273324169878,5.6048667358154534,1.3914195606046618,1.5393557527862101,0.86370865136174613,1,0,1,0,0.99004390504153428,6.491563179661676E-2,4.6625104082414772,-117.08065016844884,62.919349831551159,null,1000000000,609596100,null,45.440198953871359,-59.726061611244518,null,25.59748670685838,-57.354588557204337,null,0,0]
[24833,24.832999999999998,214.8069959241094,1.5661409681192269,1.2400771628679195,0.63275486138250625,1,0,1503.4384805047775,1.5701311847975998,5.6362986327697602,1.3924306656970684,1.5445152035152128,0.86655956315641791,1,0,{"$f":"IF(VOUT_setting=1,1,SQRT((1+Afbr-$Q$5*(A335)^2)^2+(A335*$Q$4)^2))","v":1},0,0.98992851555888051,6.5299766509288482E-2,4.6001869751717193,-117.05218115739241,62.947818842607589,null,1000000000,616677889,null,45.409547323846496,-59.831695495675064,null,25.565814903813475,-57.220485661717348,null,0,0]
[24976,24.975999999999999,216.04392809537313,1.5661676219771175,1.2425791364054624,0.63549543542500675,1,0,1512.095976895434,1.5701349930646482,5.6677362279863219,1.3934305550796329,1.5496871239491408,0.86939146859396799,1,0,1,0,0.98981246606396656,6.5684044299015726E-2,4.5382414004457843,-117.02388746593854,62.976112534061457,null,1000000000,623800576,null,45.378949357210956,-59.936880481375255,null,25.534467295723079,-57.087006984563295,null,0,0]
[25119,25.119,217.28086041837301,1.5661939723658829,1.2450904050910192,0.63822497477023632,1,0,1520.7534733077709,1.5701387579715349,5.699179427167528,1.3944194123723856,1.5548713896552213,0.87220451213872363,1,0,1,0,0.98969575666915455,6.6068466041626098E-2,4.4766699091338342,-116.9957657774397,63.004234222560299,null,1000000000,630964161,null,45.348405213051464,-60.04161436805537,null,25.503439948570627,-56.954151409384366,null,0,0]
[25265.25,25.265250000000002,218.54590499388604,1.5662206131041621,1.247668303997626,0.64100516255799456,1,0,1529.6077310242472,1.5701425643622469,5.7313429448440454,1.3954195198950889,1.5601861206462266,0.87506212850790777,1,0,1,0,0.98957571233903008,6.6461774453300926E-2,4.4140821271685251,-116.96717957225171,63.032820427748291,null,1000000000,638332857.5625,null,45.317222718849237,-60.14825987561175,null,25.472034660807541,-56.818919696639952,null,0,0]
[25411.5,25.4115,219.81094972272206,1.5662469471996328,1.2502558068743337,0.64377386403739145,1,0,1538.4619887626304,1.5701463269393781,5.7635121311110007,1.3964084641477581,1.5655135055073812,0.87790031919581124,1,0,1,0,0.98945497801270466,6.6855235291460258E-2,4.3518778289676598,-116.93876673648444,63.061233263515561,null,1000000000,645744332.25,null,45.286096851703405,-60.254429471541329,null,25.440956229752519,-56.684337264943068,null,0,0]
[25557.75,25.557749999999999,221.07599460224904,1.5662729799162884,1.2528528542162298,0.64653110805930347,1,0,1547.3162465225441,1.5701500464550757,5.7956868915771969,1.3973864290984213,1.570853415495864,0.88071923634929283,1,0,1,0,0.98933355381268884,6.7248849495999616E-2,4.2900531657542604,-116.91052419243712,63.089475807562877,null,1000000000,653198585.0625,null,45.255027774979766,-60.360121375720198,null,25.410200643262751,-56.550402816716925,null,0,0]
[25704,25.704000000000001,222.34103962989485,1.5662987163983226,1.2554593867921813,0.64927692393315672,1,0,1556.1705043036216,1.5701537236443692,5.8278671339197379,1.3983535947368431,1.5762057233128419,0.88351903128112563,1,0,1,0,0.98921143986227567,6.7642618007833527E-2,4.2286043494674868,-116.88244900849801,63.117550991501986,null,1000000000,660695616,null,45.224015649320052,-60.465333987191897,null,25.379763952635681,-56.417115021306117,null,0,0]
[25853.75,25.853750000000002,223.63635939025187,1.5663247670932066,1.2581380647968157,0.65207664105970142,1,0,1565.2366588736629,1.5701574457270664,5.8608230876390239,1.3993329000692152,1.5816988355214978,0.88636617286502684,1,0,1,0,0.98908568894813476,6.8045970914142676E-2,4.1660705154932201,-116.85387244100363,63.146127558996369,null,1000000000,668416389.0625,null,45.192320529623757,-60.572566380978145,null,25.348925238357719,-56.281306060025507,null,0,0]
[26003.5,26.003499999999999,224.93167930062918,1.5663505177504797,1.2608265626623496,0.65486444012101708,1,0,1574.302813465139,1.5701611249400222,{"$f":"SQRT(1+(A343/Zero2)^2)","v":5.8937845992541451},{"$f":"ATAN(A343/Zero2)","v":1.4003012526182776},1.5872046805131372,0.88919358437091822,1,0,1,0,0.98895921513900775,6.8449487601657436E-2,4.103922883498603,-116.82546556323298,63.174534436767019,null,1000000000,676182012.25,null,45.160685450804792,-60.679293416566686,null,25.318412685182064,-56.146172146666309,null,0,0]
[26153.25,26.15325,226.22699935844986,1.5663759735239322,1.2635248177053899,0.65764035399959098,1,0,1583.3689680776818,1.5701647620196357,5.9267515760347198,1.4012588333240128,1.5927231262408421,0.89200142543916638,1,0,1,0,0.98883201856981051,6.8853169083838872E-2,4.0421575751751533,-116.79722566633021,63.202774333669794,null,1000000000,683992485.5625,null,45.129110575273913,-60.785513915772007,null,25.288222252389492,-56.011711750558248,null,0,0]
[26303,26.303000000000001,227.52231956119567,1.5664011394499897,1.2662327675503129,0.66040441603080768,1,0,1592.4351227109316,1.5701683576855354,5.9597239272869595,1.402205819202198,1.5982540421812921,0.89478985474223793,1,0,1,0,0.98870409937632464,6.9257016375297312E-2,3.9807707726461468,-116.76915017725477,63.230849822745228,null,1000000000,691847809,null,45.097596061715663,-60.891226868831495,null,25.258349963418745,-55.877923308423277,null,0,0]
[26456,26.456,228.84575203565913,1.5664265573165794,1.2690094357208885,0.66321626072407136,1,0,1601.698038651065,1.5701719893474908,5.9934173305651912,1.4031625952804061,1.6039177396011801,0.89761891663957283,1,0,1,0,0.98857265779648429,6.9669800601918144E-2,3.9184387092733584,-116.74063262854754,63.259367371452456,null,1000000000,699919936,null,45.065460096023671,-60.998709023335124,null,25.228153865737948,-55.741923605212371,null,0,{"$f":"IF(AH346>0,W346,0)","v":0}]
[26609,26.609000000000002,230.16918465627228,1.566451682886596,1.2717960934199892,0.66601580529362658,1,0,1610.9609546120801,1.5701755792458276,6.0271161589950299,1.4041086731585459,1.6095941837232015,0.90042804677562338,1,0,1,0,0.988440462175319,7.0082760057920551E-2,3.8564938887019231,-116.71228168059376,63.287718319406238,null,1000000000,708038881,null,45.033387463173241,-61.105659740871538,null,25.198281678016944,-55.606621939722253,null,0,0]
[26762,26.762,231.49261742052849,1.5664765211731464,1.2745926751269285,0.66880308667633681,1,0,1620.223870593619,1.5701791280968409,6.0608203220831536,1.4050442296064973,1.6152832401636068,0.90321741118115406,1,0,1,0,0.98830751266045391,7.0495895829183877E-2,3.7949324251727279,-116.68409499224806,63.315905007751937,null,1000000000,716204644,null,45.001378319466056,-61.212078447175365,null,25.168729358194927,-55.472016545072705,null,0,0]
[26915,26.914999999999999,232.81605032597818,1.5665010770753514,1.2773991156624735,0.67157814224835921,1,0,1629.4867865953313,1.5701826366005387,6.0945297313238713,1.4059694375578216,1.6209847761286962,0.90598717478905966,1,0,1,0,0.98817380940046473,7.0909209002872314E-2,3.7337504926580767,-116.65607034670627,63.343929653293728,null,1000000000,724417225,null,44.96943281659312,-61.317964723949743,null,25.139492928553221,-55.338105622756522,null,0,0]
[27071.75,27.071750000000002,234.17192045636779,1.5665259469926776,1.2802844979652699,0.6744085744533852,1,0,1638.9767348725516,1.5701861899694205,6.1290707016748645,1.4069067669915523,1.6268388605147412,0.90880466873657506,1,0,1,0,0.98803604757339203,7.1332837517296369E-2,3.6714586624112879,-116.62752467885541,63.372475321144591,null,1000000000,732879648.0625,null,44.936770489033734,-61.425893808543186,null,25.109863425865804,-55.201630870312208,null,0,0]
[27228.5,27.2285,235.52779072992809,1.5665505305711411,1.2831800908956779,0.67722625497842981,1,0,1648.466683170228,1.5701897024259959,6.1636169965874181,1.4078335900057712,1.6327057665221891,0.91160193619465502,1,0,1,0,0.98789749491889078,7.1756654551272031E-2,3.609557251582753,-116.59914476072994,63.400855239270058,null,1000000000,741391212.25,null,44.904175267255766,-61.533263630050293,null,25.080557236815238,-55.065881130679685,null,0,0]
[27385.25,27.385249999999999,236.88366114420072,1.5665748327275362,1.2860858254867134,0.68003122536374672,1,0,1657.9566314880094,1.5701931746727964,6.1981685270301332,1.4087500806980271,1.6385853564287463,0.91437915088256916,1,0,1,0,0.98775815159984626,7.2180661278127972E-2,3.5480423317816721,-116.57092857976548,63.429071420234521,null,1000000000,749951917.5625,null,44.871647298694448,-61.640074207049388,null,25.051570285575483,-54.930854372716055,null,0,0]
[27542,27.542000000000002,238.23953169678316,1.5665988582667274,1.2890016331527998,0.68282352757569276,1,0,1667.4465798255521,1.5701966073963607,6.2327252059324705,1.4096564093751176,1.6444774941861138,0.91713648527522995,1,0,1,0,0.98761801778019831,7.2604858872645575E-2,3.486910034414024,-116.54287423763468,63.457125762365322,null,1000000000,758561764,null,44.839186725325099,-61.746325703100041,null,25.022898561577183,-54.796548534534679,null,0,0]
[27702.5,27.702500000000001,239.62783948478562,1.5666231768608738,1.291997563183499,0.68566954914176748,1,0,1677.1635604401001,1.5702000819903714,6.2681138453918486,1.4105740649663399,1.650523453545041,0.91993936403756249,1,0,1,0,0.98747371255509786,7.3039403735092087E-2,3.4247077251533975,-116.51431456361553,63.485685436384472,null,1000000000,767428506.25,null,44.806019558660012,-61.854540113940899,null,24.993863418981633,-54.659774449674657,null,0,0]
[27863,27.863,241.01614741286991,1.5666472152937472,1.2950039097163863,0.68850237950878901,1,0,1686.8805410746629,1.570203516554799,6.3035077039095135,1.4114814161404015,1.6565822849223155,0.92272176186812194,1,0,1,0,0.98732857890523551,7.3474151204363347E-2,3.3628985418852482,-116.48592088122288,63.514079118777119,null,1000000000,776346769,null,44.772923333864242,-61.962169159917487,null,24.965150460509253,-54.523751721305381,null,0,0]
[28023.5,28.023499999999999,242.40445547862922,1.5666709783789703,1.2980206003744572,0.69132206502435345,1,0,1696.5975217288965,1.5702069117774311,6.3389066940622145,1.4123786340225897,1.6626538475982333,0.92548385982189452,1,0,1,0,0.98718261701005239,7.3909102546384609E-2,3.3014785175711028,-116.45769149160466,63.542308508395337,null,1000000000,785316552.25,null,44.739898185179648,-62.06921344936697,null,24.936755584879712,-54.388478042237658,null,0,0]
[28184,28.184000000000001,243.79276367971153,1.5666944708205206,1.3010475632040968,0.69412865244302191,1,0,1706.3145024024648,1.5702102683303896,6.3743107303561439,1.413265886002441,1.6687380026075271,0.92822583756066279,1,0,1,0,0.98703582705015824,7.4344259028719897E-2,3.2404437449997969,-116.4296247997236,63.570375200276402,null,1000000000,794337856,null,44.706944240632858,-62.175673723946993,null,24.908674756855195,-54.253951075776591,null,0,0]
[28348,28.347999999999999,245.21134665185241,1.5667182007802911,1.3041510707676969,0.69698296210508648,1,0,1716.2433798704767,1.5702136588188318,6.4104919426981075,1.4141623622559503,1.6749676983461619,0.93100701153776899,1,0,1,0,0.98688498090441479,7.4789118124609089E-2,3.1784719369801668,-116.40111256374486,63.59888743625514,null,1000000000,803609104,null,44.673345351094618,-62.283853209968861,null,24.880301838373803,-54.117259353775999,null,0,0]
[28512,28.512,246.62992976048611,1.5667416577568232,1.3072651528601931,0.69982369611721995,1,0,1726.1722573579902,1.5702170103033519,6.4466782491265873,1.4150487750664456,1.6812102537676361,0.93376755300402337,1,0,1,0,0.98673327057021154,7.5234194086333181E-2,3.116894303466851,-116.37276714218052,63.627232857819479,null,1000000000,812934144,null,44.639821055340903,-62.391424898249412,null,24.852248500614202,-53.981342243931131,null,0,0]
[28676,28.675999999999998,248.04851300327076,1.5667648464336432,1.3103897340919146,0.70265090558015542,1,0,1736.1011348646714,1.5702203234531473,6.4828695643385341,1.4159252915699272,1.6874655261538705,0.93650764909937434,1,0,1,0,0.98658069624403033,7.5679488271574474E-2,3.0557068608420535,-116.34458713779401,63.655412862205992,null,1000000000,822312976,null,44.606371469721878,-62.49838997327263,null,24.824510643608434,-53.846197164521378,null,0,0]
[28840,28.84,249.46709637791778,1.5667877713877492,1.31352473953756,0.70546464197404923,1,0,1746.0300123901927,1.5702235989221949,6.5190658049135042,1.4167920752519936,1.6937333746065228,0.9392274854301389,1,0,1,0,0.98642725812363796,7.6125002039849038E-2,2.9949056849620543,-116.3165712460207,63.6834287539793,null,1000000000,831745600,null,44.572996703760737,-62.604749739932458,null,24.797084233689574,-53.711821506088249,null,0,0]
[29008,29.007999999999999,250.92027948145653,1.5668109867130691,1.316746939387329,0.70833309028666902,1,0,1756.2010576794403,1.5702269158782676,6.5561499023738907,1.417670075362633,1.700166991925393,0.94199284463259292,1,0,1,0,0.98626918216477955,7.6581611102526426E-2,2.9330180261003762,-116.28804093423368,63.711959065766322,null,1000000000,841464064,null,44.538885605652453,-62.713077498026649,null,24.769307672936186,-53.574963436207028,null,0,0]
[29176,29.175999999999998,252.3734627186717,1.5668339346876168,1.3199799204788063,0.71118751080765086,1,0,1766.3721029877872,1.5702301946352424,6.5932389970108947,1.4185381980689573,1.7066135126963453,0.94473733308844909,1,0,1,0,0.98611020018581819,7.7038453484263011E-2,2.8715275554052653,-116.25968034506744,63.740319654932563,null,1000000000,851238976,null,44.504853232211865,-62.820773195357489,null,24.741849575681663,-53.438907149709934,null,0,0]
[29344,29.344000000000001,253.82664608726739,1.5668566199031992,1.3232236037878209,0.71402796001376134,1,0,1776.5431483149057,1.5702334358492103,6.6303330049641316,1.4193966078315057,1.7130727912471668,0.94746114530371539,1,0,1,0,0.98595031240355835,7.749553065256265E-2,2.8104302400715819,-116.23148834888433,63.768511651115674,null,1000000000,861070336,null,44.47089967899749,-62.927838590994774,null,24.714705813562347,-53.303649757889545,null,0,0]
[29512,29.512,255.27982958499993,1.5668790468470686,1.3264779108028428,0.71685449473205309,1,0,1786.7141936604755,1.5702366401613228,6.6674318442284477,1.4202454655084487,1.7195446838083153,0.95016447409200799,1,0,1,0,0.98578951903623158,7.7952844077002148E-2,2.7497221071252347,-116.20346389868268,63.796536101317315,null,1000000000,870958144,null,44.437025034152917,-63.034275552585974,null,24.687872325460578,-53.169188346096732,null,0,0]
[29684,29.684000000000001,256.7676128213173,1.5669017447758555,1.3298206260087932,0.71973397220885382,1,0,1797.1274067711561,1.5702398831905995,6.7054189106807103,1.4211048024333748,1.7261835889807779,0.95291114663062904,1,0,1,0,0.9856239593007049,7.8421292213887897E-2,2.6879676473119392,-116.17494476579378,63.825055234206218,null,1000000000,881139856,null,44.402425683338869,-63.142597729789586,null,24.660717216461325,-53.032347036004204,null,0,0]
[29856,29.856000000000002,258.25539618839622,1.5669241811836836,1.3331743119316537,0.72259898631882813,1,0,1807.5406199005197,1.5702430888537946,6.7434108730264004,1.4219544570770344,1.7328354170016722,0.95563675231992884,1,0,1,0,0.98545745081117941,7.8889991115309838E-2,2.6266128815273904,-116.14659927786433,63.853400722135675,null,1000000000,891380736,null,44.367909206545171,-63.250265478372569,null,24.633878927470473,-52.896333799491707,null,0,0]
[30028,30.027999999999999,259.74317968398958,1.5669463605644292,1.33653888598721,0.72544959908058693,1,0,1817.9538330482453,1.5702462577930054,6.7814076489796857,1.4227945909540658,1.7395000196205344,0.95834149257229129,1,0,1,0,0.98528999380651827,7.9358942365177071E-2,2.565653732634066,-116.11842655248283,63.881573447517169,null,1000000000,901680784,null,44.333475674541994,-63.357281121096833,null,24.607353310580326,-52.761145431386034,null,0,0]
[30200,30.2,261.2309633059017,1.5669682873095943,1.3399142661539589,0.72828587282704094,1,0,1828.3670462140192,1.5702493906357007,6.8194091580783587,1.4236253620333592,1.7461772505676505,0.96102556694937291,1,0,1,0,0.98512158852716647,7.9828147549737327E-2,2.5050861836494804,-116.09042577977792,63.909574220222083,null,1000000000,912040000,null,44.299125150203487,-63.463647077003628,null,24.581136285934242,-52.62677870277431,null,0,0]
[30375.75,30.37575,262.75118419898058,1.5669904356161859,1.343374314784191,0.73116923774315534,1,0,1839.0072916619056,1.570252555134058,6.8582439956501711,1.4244647353850841,1.753012954855526,0.96374701945835883,1,0,1,0,0.98494853236095559,8.0307846450962936E-2,2.4435985030076597,-116.06199137104514,63.938008628954861,null,1000000000,922686188.0625,null,44.264111503824154,-63.571663581947796,null,24.554662251671754,-52.4903277890973,null,0,0]
[30551.5,30.551500000000001,264.27140521946859,1.5670123291065607,1.3468454745127332,0.73403776409141341,1,0,1849.6475371279962,1.5702556832243553,6.8970836107656925,1.4252946557731463,1.75986154157343,0.96644731050771737,1,0,1,0,0.98477448663274114,8.0787813836302402E-2,2.3825113910126499,-116.03373499930605,63.966265000693951,null,1000000000,933394152.25,null,44.229184631945046,-63.6790071534598,null,24.528502011555865,-52.354727845846249,null,0,0]
[30727.25,30.727250000000002,265.79162636517941,1.5670339721530362,1.3503276596528366,0.73689151927868124,1,0,1860.2877826119782,1.5702587755313195,6.9359279231654538,1.42611528086712,1.7667228609076528,0.96912664703933304,1,0,1,0,0.98459945160418239,8.1268051405701328E-2,2.3218207484899551,-116.00565600923655,63.994343990763454,null,1000000000,944163892.5625,null,44.194344576643132,-63.785680650429271,null,24.502651424335077,-52.219975358807297,null,0,0]
[30903,30.902999999999999,267.31184763397658,1.5670553690284683,1.3538207851285657,0.73973057098178641,1,0,1870.9280281135466,1.570261832665466,6.9747768543683319,1.4269267648744701,1.7735967650863707,0.97178523399928951,1,0,1,0,0.98442342753867973,8.1748560861723177E-2,2.2615225363774374,-115.97775380769505,64.022246192304948,null,1000000000,954995409,null,44.159591371775953,-63.891687014944914,null,24.477106417089733,-52.086066792750138,null,0,0]
[31083,31.082999999999998,268.86883113567512,1.5670770325155827,1.357409633750835,0.74262310670914133,1,0,1881.8255768670681,1.5702649278919605,7.0145699409130877,1.4277485545095754,1.7806497872657721,0.97448681488509059,1,0,1,0,0.98424212192119509,8.2240973644428672E-2,2.2001688094396603,-115.94935956744813,64.050640432551873,null,1000000000,966152889,null,44.12408781525852,-63.999568463513441,null,24.451256246669395,-51.949791103934686,null,0,0]
[31263,31.263000000000002,270.42581476210256,1.5670984465465321,1.3610097795472171,0.74550036372134842,1,0,1892.7231256384107,1.5702679874762833,7.0543677112186964,1.4285610723065285,1.7877157029859192,0.97716705929977687,1,0,1,0,0.98405977941935274,8.2733675245798124E-2,2.1392183337610451,-115.92114969370468,64.078850306295323,null,1000000000,977375169,null,44.088675406358846,-64.106756617385017,null,24.425718179890453,-51.814393076319647,null,0,0]
[31443,31.443000000000001,271.98279851111687,1.5671196154053817,1.3646211331050435,0.74836241549205096,1,0,1903.6206744272679,1.5702710120305496,7.0941700864584991,1.4293644732444126,1.7947943599652967,0.97982618095938223,1,0,1,0,0.9838764003218341,8.322666750357513E-2,2.078666957983506,-115.89312372793988,64.10687627206012,null,1000000000,988662249,null,44.053354155387801,-64.213254877010684,null,24.400488055083965,-51.679868850929168,null,0,0]
[31623,31.623000000000001,273.53978238062484,1.5671405432786589,1.3682436056787401,0.75120933571681714,1,0,1914.5182232333414,1.5702740021529396,7.1339769895560012,1.4301589088909166,1.8018856080428745,0.98246439141960362,1,0,1,0,0.98369198491925403,8.3719952258461697E-2,2.0185105914797759,-115.86528126437632,64.134718735623679,null,1000000000,1000014129,null,44.018124064132124,-64.319066713723302,null,24.375561779835909,-51.546214550653033,null,0,0]
[31807,31.806999999999999,275.13136601408723,1.5671616913978019,1.3719579783298346,0.75410395811645614,1,0,1925.6579398081508,1.5702770237430548,7.1746730919314547,1.4309618866582927,1.8091472991559419,0.98513983340497269,1,0,1,0,0.98350240059680538,8.4224503135749404E-2,1.9574214935609191,-115.83700937269171,64.16299062730829,null,1000000000,1011685249,null,43.982205295924302,-64.426524135187364,null,24.350391450124867,-51.410485237504332,null,0,0]
[31991,31.991,276.72294976918465,1.5671825962483499,1.3756837842640275,0.75698292534337297,1,0,1936.7976564003388,1.5702800105751171,7.2153737681592967,1.431755806015188,1.8164218365312501,0.98779386465473662,1,0,1,0,0.98331173401984062,8.4729363553587608E-2,1.8967367008286296,-115.8089285258486,64.1910714741514,null,1000000000,1023424081,null,43.946381761122865,-64.533271829064091,null,24.325530192194023,-51.275656696784537,null,0,0]
[32175,32.174999999999997,278.31453364383043,1.5672032620037897,1.3794209308376781,0.75984631671952085,1,0,1947.9373730096079,1.5702829632454418,7.2560789412727988,1.4325408183999526,1.8237090664426163,0.99042670421565016,1,0,1,0,0.98311998550508273,8.5234535487854854E-2,1.836452032514325,-115.7810384392093,64.218961560790703,null,1000000000,1035230625,null,43.910653434949857,-64.639313703196066,null,24.300973850052724,-51.141724736013188,null,0,0]
[32359,32.359000000000002,279.90611763598531,1.5672236927426844,1.3831693261279185,0.76269421173255625,1,0,1959.0770896356664,1.5702858823367811,7.2967885360142626,1.4333170719158446,1.8310088373450193,0.99303856882564245,1,0,1,0,0.98292715537138797,8.5740020917748003E-2,1.7765633688296445,-115.75333887141669,64.246661128583312,null,1000000000,1047104881,null,43.875020283958378,-64.744653723449531,null,24.276718337359519,-51.008685147967121,null,0,0]
[32547.5,32.547499999999999,281.53662635641541,1.5672443836049053,1.3870209635225867,0.7655957701281052,1,0,1970.4892450006707,1.5702888385934455,7.3384982540720349,1.4341033785078281,1.8384999838869318,0.99569278404630412,1,0,1,0,0.9827284879975694,8.6258195925585965E-2,1.7156164429840624,-115.72515922335614,64.274840776643856,null,1000000000,1059339756.25,null,43.838614321252138,-64.851846385541364,null,24.252177374220185,-50.873312837814751,null,0,0]
[32736,32.735999999999997,283.16713519598665,1.5672648361864194,1.3908842135725681,0.76848123425892922,1,0,1981.9014003826978,1.5702917608047631,7.3802124580757322,1.4348807969013335,1.8460039772289112,0.99832543895543147,1,0,1,0,0.98252868613696087,8.6776704166536073E-2,1.6550765659917013,-115.69717913986071,64.302820860139292,null,1000000000,1071645696,null,43.802308147729683,-64.958311038382078,null,24.227943670750275,-50.73886810147863,null,0,0]
[32924.5,32.924500000000002,284.79764415265265,1.5672850545797876,1.3947589797825035,0.77135069001114664,1,0,1993.3135557814549,1.5702946495554848,7.4219310723869558,1.4356494760301119,1.8535206613398432,1.0009367591412341,1,0,1,0,0.98232775013939411,8.7295547779570867E-2,1.5949394993838528,-115.66939848253951,64.330601517460494,null,1000000000,1084022700.25,null,43.766101700233399,-65.064052107452341,null,24.204013051638707,-50.605346375087208,null,0,0]
[33113,33.113,286.42815322441379,1.5673050427843822,1.3986451664402839,0.77420422337504347,1,0,2004.7257111966569,1.5702975054170467,7.4636540230505402,1.4364095615395061,1.8610498824476571,1.0035269677143888,1,0,1,0,0.98212568035707593,8.7814728907418316E-2,1.535201066545848,-115.64181714760615,64.358182852393853,null,1000000000,1096470769,null,43.729994906810163,-65.169074063929727,null,24.180381412223944,-50.472743083676441,null,0,0]
[33305.75,33.305750000000003,288.09542455403107,1.5673252476911037,1.4026306833772964,0.77710571845164422,1,0,2016.395169867377,1.5703003922400358,7.5063220856190958,1.4371780462076829,1.8687616668332807,1.006153975119872,1,0,1,0,0.98191788257709434,8.8345966962139172E-2,1.4745236748092232,-115.61381999149005,64.386180008509953,null,1000000000,1109272983.0625,null,43.693177000179787,-65.275724975801836,null,24.156521927117698,-50.338095015688218,null,0,0]
[33498.5,33.4985,289.76269599990638,1.5673452200829892,1.4066279416316885,0.77999074716448558,1,0,2028.064628554708,1.5703032458415376,7.5489945310729372,1.4379378432440948,1.8764862418028034,1.0087593721764099,1,0,1,0,0.98170890006290901,8.8877562466264659E-2,1.4142544550206231,-115.58603112613973,64.41396887386027,null,1000000000,1122149502.25,null,43.656463112484431,-65.381633567067794,null,24.132966595024449,-50.204397559071921,null,0,0]
[33691.25,33.691249999999997,291.42996756004453,1.5673649639506764,1.4106368413909327,0.78285940167057766,1,0,2039.7340872583645,1.5703060667917395,7.5916712855040558,1.4386890982771767,1.8842234500471438,1.0113433895104393,1,0,1,0,0.98149873319883896,8.9409517723096368E-2,1.3543891342802654,-115.55845053465966,64.441549465340344,null,1000000000,1135100326.5625,null,43.619853139527002,-65.486804740423736,null,24.10971124724152,-50.071645794235963,null,0,0]
[33884,33.884,293.0972392324955,1.5673844831940014,1.4146572836848583,0.78571177416181515,1,0,2051.403545978068,1.5703088556478542,7.6343522766496745,1.439431953717796,1.8919731365752948,1.0139062551210389,1,0,1,0,0.98128738237183011,8.994183504015503E-2,1.2949235020405134,-115.53107822626812,64.468921773731878,null,1000000000,1148125456,null,43.583346968347158,-65.591243431638873,null,24.086751786181612,-49.93983479462922,null,0,0]
[34081.5,34.081499999999998,294.80559812940896,1.5674042544460667,1.4187886731157215,0.78861764618923524,1,0,2063.3605789238263,1.570311680509918,7.6780893898561553,1.4401845485882749,1.8999265847557396,1.0165105739279661,1,0,1,0,0.98106959547850503,9.0487648394757716E-2,1.2344026844726317,-115.50324745323543,64.496752546764569,null,1000000000,1161548642.25,null,43.546048707096141,-65.697501250816075,null,24.063529229864749,-49.805746202419343,null,0,0]
[34279,34.279000000000003,296.5139571402346,1.5674237978748224,1.4229319733016901,0.79150661982893533,1,0,2075.3176118858605,1.5703144728208496,7.7218308026589995,1.4409286175140841,1.9078928116550884,1.0190931619534149,1,0,1,0,0.98085056638067381,9.1033846792909198E-2,1.1742927426428964,-115.4756354480953,64.524364551904696,null,1000000000,1175049841,null,43.508859159303668,-65.803000623531659,null,24.040608835827481,-49.672634824563687,null,0,0]
[34476.5,34.476500000000001,298.22231626301505,1.5674431173954944,1.4270870805003233,0.79437879425110369,1,0,2087.27464486389,1.5703172331400603,7.7655764424027831,1.4416643037513057,1.9158716578709569,1.0216542560311161,1,0,1,0,0.98063029550322911,9.1580432730938868E-2,1.1145893426825184,-115.44824228982587,64.55175771017413,null,1000000000,1188629052.25,null,43.47177817623151,-65.907746943441794,null,24.017986418939262,-49.540495346384034,null,0,0]
[34674,34.673999999999999,299.93067549583708,1.5674622168341061,1.431253891879968,0.79723426858464841,1,0,2099.2316778576424,1.5703199620142159,7.809326238053119,1.4423917473825589,1.9238629663948936,1.0241940901969866,1,0,1,0,0.98040878327399272,9.2127408709956213E-2,1.0552882141644937,-115.42106807572596,64.578931924274045,null,1000000000,1202286276,null,43.434805600430984,-66.011745624995612,null,23.995657866221766,-49.409322450730357,null,0,0]
[34875.75,34.875749999999996,301.67579700104045,1.5674815039245003,1.4355223475159862,0.80013404984840453,1,0,2111.446014108988,1.5703227176991859,7.8540217037953894,1.44312647673842,1.9320389464297301,1.0267668684297768,1,0,1,0,0.9801812230657122,9.2686560385344605E-2,0.99512195884164001,-115.39353528006151,64.606464719938486,null,1000000000,1216317938.0625,null,43.397149171240812,-66.117215957421365,null,23.973148040089075,-49.276319322640141,null,0,0]
[35077.5,35.077500000000001,303.42091861717381,1.5675005691559831,1.4398028024436231,0.80301661344908704,1,0,2123.6603503761835,1.5703254416852424,7.8987213613685103,1.4438528906682793,1.9402276071642339,1.0293179467944038,1,0,1,0,0.97995236841739641,9.3246124360286287E-2,0.93536666303472582,-115.36623120700857,64.633768792991432,null,1000000000,1230431006.25,null,43.359605506236164,-66.221917601585304,null,23.950936409286825,-49.144313605423285,null,0,0]
[35279.25,35.279249999999998,305.16604034233421,1.5675194163347064,1.4440951499612704,0.80588206480053748,1,0,2135.8746866589568,1.570328134516211,7.9434251400070135,1.4445711287909109,1.9484287887189005,1.0318475658879154,1,0,1,0,0.97972221979460705,9.3806103316520409E-2,0.87601797175390939,-115.33915600531559,64.660843994684413,null,1000000000,1244625480.5625,null,43.322174410957587,-66.325856374275261,null,23.929018813284578,-49.013299631040347,null,0,0]
[35481,35.481000000000002,{"$f":"SQRT(1+(A397/pole1)^2)","v":306.9111621746618},{"$f":"ATAN(A397/pole1)","v":1.567538049180254},{"$f":"SQRT(1+(A397/Zero1)^2)","v":1.4483992843374607},{"$f":"ATAN(A397/Zero1)","v":0.8087305091928253},{"$f":"IF(VIN_nom>Vout, 1, SQRT(1+(A397/z_RHP)^2))","v":1},{"$f":"IF(VIN_nom>Vout, 0, -ATAN(A397/z_RHP))","v":0},{"$f":"SQRT(1+(A397/Pole2)^2)","v":2148.0890229570414},{"$f":"ATAN(A397/Pole2)","v":1.5703307967235483},7.9881329705230693,1.445281327633601,{"$f":"SQRT(1+(A397/pole4)^2)","v":1.9566423336523102},{"$f":"ATAN(A397/pole4)","v":1.0343559633752695},{"$f":"IF(VOUT_setting=1,1,SQRT(1+(A397*zterm1)^2))","v":1},{"$f":"IF(VOUT_setting=1,0,ATAN(((A397*zterm1))))","v":0},1,{"$f":"IF(VOUT_setting=1,0,ATAN(A397*$Q$4/(1+Afbr-$Q$5*(A397)^2)))","v":0},{"$f":"SQRT((1-(Z397/pterm2))^2+(A397/pterm1)^2)","v":0.97949077766613379},{"$f":"IF((ATAN((A397/pterm1)/(1-A397^2/pterm2))>0),ATAN((A397/pterm1)/(1-A397^2/pterm2)),PI()+ATAN((A397/pterm1)/(1-A397^2/pterm2)))","v":9.4366499941137133E-2},{"$f":"20*LOG10(((E397*K397*G397*O397)/(C397*I397*S397*M397*Q397))*Adc)","v":0.81707159384024908},{"$f":"((F397+L397+H397+P397)-(D397+J397+T397+N397+R397))*radconv","v":-115.31230983459322},{"$f":"IF(V397>0,V397,V397+180)","v":64.687690165406778},null,{"$f":"IF(U397<0,A397,1000000000)","v":1000000000},{"$f":"A397^2","v":1258901361},null,{"$f":"20*LOG10((K397/(I397*M397))*AEA)","v":43.284855682483617},{"$f":"(L397-(J397+N397))*radconv","v":-66.429038100703153},null,{"$f":"20*LOG10((E397*G397/(C397*S397))*Acs*Am)","v":23.907391163844892},{"$f":"(F397+H397-(D397+T397))*radconv","v":-48.883271733890076},null,{"$f":"SUM((U398<0)*(U397>0))*A397","v":0},0]
[35687.75,{"$f":"A398/1000","v":35.687750000000001},308.69953372797795,1.5675569252419383,1.4528222077764685,0.81163201258072049,1,0,2160.6060689683381,1.5703334936805844,8.0339529347850807,1.4460009264824445,1.9650721006925984,1.0369047553718422,1,0,1,0,0.9792522581784131,9.4941221097801495E-2,0.75707730905569803,-115.28503612306972,64.714963876930284,null,1000000000,1273615500.0625,null,43.246728436068622,-66.533997672357913,null,23.885524125475332,-48.751038450711768,null,0,0]
[35894.5,35.894500000000001,310.48790539001834,1.5675755838561012,1.4572572878176964,0.81451587900169753,1,0,2173.12311499517,1.5703361595690308,8.0797770120233743,1.4467123633538155,1.973514524405759,1.0394317569046729,1,0,{"$f":"IF(VOUT_setting=1,1,SQRT((1+Afbr-$Q$5*(A399)^2)^2+(A399*$Q$4)^2))","v":1},0,0.97901238128351331,9.5516386612844659E-2,0.69749660150107584,-115.25800330150521,64.741996698494788,null,1000000000,1288415130.25,null,43.208718737423212,-66.638174609168331,null,23.863953116566119,-48.619828692336881,null,0,0]
[36101.25,36.10125,312.27627715891521,1.567594028758623,1.4617044138050475,0.81738222124621773,1,0,2185.6401610372686,1.5703387949226717,8.125605132652975,1.4474157756211528,1.9819694430541963,1.0419372143617718,1,0,1,0,0.97877114749656557,9.6091999395868613E-2,0.638325053626973,-115.23121156489897,64.76878843510103,null,1000000000,1303300251.5625,null,43.170826342145872,-66.741575187792819,null,23.842673963969347,-48.489636377106144,null,0,0]
[36308,36.308,314.06464903284291,1.5676122636002925,1.4661634761262463,0.82023115188999962,1,0,2198.1572070943735,1.5703414002631337,8.1714372286438621,1.4481112976080599,1.9904366974110577,1.0444213710298584,1,0,1,0,0.97852855733630584,9.666806236254348E-2,0.57955831298623517,-115.2046611123814,64.795338887618598,null,1000000000,1318270864,null,43.133050997600762,-66.844205681245072,null,23.821682567873729,-48.360455431136351,null,0,0]
[36519.5,36.519500000000001,315.89410815458621,1.5676307037446957,1.4707372212849792,0.82312763649548848,1,0,2210.9618273808701,1.5703440349363442,8.2183263430914817,1.4488147716048638,1.9991110842548216,1.0469408101909978,1,0,1,0,0.97827899083260461,9.7257829012574432E-2,0.51985582294561827,-115.17775054673835,64.822249453261648,null,1000000000,1333673880.25,null,43.094528623012003,-66.948403776678703,null,23.800502452421867,-48.229346770059671,null,0,0]
[36731,36.731000000000002,317.72356738250875,1.567648931531598,1.475323228809025,0.82600613781729837,1,0,2223.7664476825375,1.5703466392682477,8.2652194784423827,1.4495102635529196,2.0077980509105888,1.0494384638118883,1,0,1,0,0.97802800602512785,9.7848072961550694E-2,0.46056794350222702,-115.15109290714436,64.84890709285564,null,1000000000,1349166361,null,43.056128179264036,-67.051809251877032,null,23.779615016726442,-48.09928365526735,null,0,0]
[36942.5,36.942500000000003,319.55302671478694,1.5676669506082637,1.4799213847018609,0.82886677555584887,1,0,2236.5710679991148,1.5703492137799666,8.3121165666443062,1.4501979078781577,2.0164974347988269,1.0519145824832292,1,0,1,0,0.97777560348097947,9.8438797350745275E-2,0.40169021870333599,-115.12468840983428,64.875311590165722,null,1000000000,1364748306.25,null,43.017849370892762,-67.154428792449224,null,23.759016100298833,-47.970259617385082,null,0,0]
[37154,37.154000000000003,321.38248614963857,1.5676847645389098,1.4845315760792086,0.83170966909998678,1,0,2249.3756883303477,1.570351758980757,8.359017541166514,1.4508778360196188,2.0252090759030681,1.054369413549473,1,0,1,0,0.97752178377126309,9.9030005328265669E-2,0.34321825856982946,-115.09853726898804,64.901462731011961,null,1000000000,1380419716,null,42.979691894572689,-67.256269068464377,null,23.7387016164854,-47.842268200523698,null,0,0]
[37370.25,37.370249999999999,323.25303283915912,1.5677027700655624,1.4892576335714534,0.83459818772035055,1,0,2262.4678828919509,1.570354331555927,8.4069757977360968,1.4515651902177149,2.0341288777004816,1.0568576209394049,1,0,1,0,0.97726079895364237,9.9634994314233935E-2,0.28384812959120737,-115.07206098431355,64.927939015686448,null,1000000000,1396535585.0625,null,42.940802579822986,-67.359597753697003,null,23.718220802256475,-47.712463230616549,null,0,0]
[37586.5,37.586500000000001,325.12357963227208,1.5677205684083542,1.4939960380698409,0.8374684075304718,1,0,2275.5600774683553,1.570356874529018,{"$f":"SQRT(1+(A407/Zero2)^2)","v":8.4549379811697687},{"$f":"ATAN(A407/Zero2)","v":1.4522447464488153},2.0430611631373177,1.0593240865495723,1,0,1,0,0.97699833382081025,0.10024049553209208,0.22489311964386163,-115.04585000450483,64.954149995495172,null,1000000000,1412744982.25,null,42.902039442943021,-67.46212582123259,null,23.698028929189093,-47.58372418327226,null,0,0]
[37802.75,37.802750000000003,326.99412652719968,1.567738163122816,1.4987466724663077,0.84032045502235064,1,0,2288.6522720593071,1.5703593884080445,8.5029040250169459,1.4529166360481085,2.052005769191481,1.0617690644880244,1,0,1,0,0.97673438899627918,0.10084651236933243,0.16634874212428952,-115.01990454338389,64.980095456616112,null,1000000000,1429047907.5625,null,42.863402136021165,-67.563860334544913,null,23.678121858591375,-47.456044208838975,null,0,0]
[38019,38.018999999999998,328.86467352220455,1.5677555576835853,1.5035094208325359,0.84315445627391838,1,0,2301.7444666645565,1.5703618736894625,8.5508738643127735,1.4535809874317009,2.0609625354480268,1.0641928054822347,1,0,1,0,0.97646896510799297,0.10145304822113119,0.10821057718915859,-114.99422480719866,65.005775192801337,null,1000000000,1445444361,null,42.82489030375303,-67.664808330003979,null,23.658495525924383,-47.329416477194655,null,0,0]
[38240.5,38.240499999999997,330.78063274276445,1.5677731705872451,1.5084002353739852,0.84603868244525304,1,0,2315.1545064713255,1.5703643901667796,8.6000121577092923,1.4542537838502352,2.0701491908652594,1.0666536306974392,1,0,1,0,0.97619556470221536,0.1020748508452551,4.9077540160770421E-2,-114.96819731871398,65.031802681286024,null,1000000000,1462335840.25,null,42.78557320428768,-67.767399017347799,null,23.638679588361349,-47.200798301366177,null,38240.5,{"$f":"IF(AH410>0,W410,0)","v":65.031802681286024}]
[38462,38.462000000000003,332.69659206475546,1.5677905806297583,1.5133035167678508,0.84890424186198099,1,0,2328.5645462925863,1.5703668776596644,8.649154299710835,1.4549189352745351,2.079348271589307,1.0690926970885763,1,0,1,0,0.97592061389303741,0.10269720522603112,-9.6384986746325292E-3,-114.94244902315789,65.057550976842109,null,38462,1479325444,null,42.746386968723364,-67.869179381122805,null,23.619149785090265,-47.073269642035065,null,0,0]
[38683.5,38.683500000000002,334.61255148643517,1.5678077912958046,1.5182191442242914,0.85175126855035144,1,0,2341.9745861280908,1.5703693366660072,8.6983002250878698,1.4555765706950414,2.0885596134380289,1.0715102633364915,1,0,1,0,0.97564411336982004,0.10332011503739963,-6.7942079299810998E-2,-114.91698011079053,65.083019889209467,null,38683.5,1496413172.25,null,42.707331192990956,-67.970156880568936,null,23.599901980197483,-46.946823230221618,null,0,0]
[38905,38.905000000000001,336.52851100610076,1.5678248059907072,1.523146998210573,0.85457989601041828,1,0,2355.3846259775951,1.5703717676723599,8.7474498700718097,1.4562268162294816,2.0977830548960488,1.0739065845869837,1,0,1,0,0.97536606382687241,0.10394358396200341,-0.12583767363390219,-114.89179075937412,65.108209240625882,null,38905,1513599025,null,42.668405466123943,-68.070338936327431,null,23.580932112730405,-46.821451823046687,null,0,0]
[39131.5,39.131500000000003,338.48772027591838,1.5678420055750446,1.5281986108368972,0.85745348671644583,1,0,2369.0973755444779,1.5703742250948916,8.7977127694029882,1.4568842264768731,2.1072270472959502,1.0763352912815447,1,0,1,0,0.97508013663487592,0.10458170871062976,-0.18462285090039529,-114.86632206896158,65.13367793103842,null,39131.5,1531274292.25,null,42.628735105037165,-68.171967547072455,null,23.561817296550693,-46.694354521889117,null,0,0]
[39358,39.357999999999997,340.44692964471687,1.5678590071985077,1.5332627593866088,0.86030811874344493,1,0,2382.8101251255034,1.5703766542331554,8.8479794278019117,1.4575341673159874,2.1166833584616853,1.078742311509556,1,0,1,0,0.97479259118498274,0.10522042591612492,-0.24299066014335641,-114.84114603579303,65.158853964206969,null,39358,1549052164,null,42.589199840394542,-68.272779959811231,null,23.542984751950364,-46.5683660759818,null,0,0]
[39584.5,39.584499999999998,342.4061391107972,1.5678758142592162,1.5383393200565099,0.86314393302926462,1,0,2396.5228747204278,1.570379055572674,8.8982497815630932,1.4581767647875072,2.1261518240257651,1.0811279069236444,1,0,1,0,0.97450342823576008,0.10585973954483353,-0.30094567048627985,-114.81626280448779,65.183737195512208,null,39584.5,1566932640.25,null,42.549799212297394,-68.372783972354284,null,23.524430369704582,-46.443478832133536,null,0,0]
[39811,39.811,344.3653486724989,1.5678924300779582,1.5434281703707771,0.8659610698704473,1,0,2410.2356243290151,1.5703814295879199,8.9485237684079326,1.4588121421242357,2.1356322823262337,1.0834923355147441,1,0,1,0,0.97421264855126521,0.10649965357289351,-0.35849238210500711,-114.7916725029866,65.2083274970134,null,39811,1584915721,null,42.510532754566825,-68.471987332958975,null,23.506150115816421,-46.319685170027618,null,0,0]
[40042.75,40.042749999999998,346.36997047363838,1.5679092364739633,1.548647568037284,0.86882431838783081,1,0,2424.2662191411036,1.5703838308320097,8.9999667432105195,1.4594548993166077,2.1453447334389688,1.0858899256056085,1,0,1,0,0.97391345636246085,0.10715502563835486,-0.41695497655145475,-114.76681553612291,65.233184463877095,null,40042.75,1603421827.5625,null,42.470494525912471,-68.57266943306027,null,23.487725750024332,-46.194146103062636,null,0,0]
[40274.5,40.274500000000003,348.37459237148596,1.5679258494547801,1.5538795764624271,0.87166830862136546,1,0,2438.2968139670102,1.5703862044413319,9.0514133939653743,1.4600903501300837,2.1550694057333022,1.0882658911759615,1,0,1,0,0.97361257325779793,0.1078110347121993,-0.47499944130835325,-114.74226545122208,65.257734548777918,null,40274.5,1622035350.25,null,42.430595753280762,-68.672529580720067,null,23.469580057899137,-46.069735870502015,null,0,0]
[40506.25,40.506250000000001,350.37921436438154,1.5679422723401544,1.5591240686910894,0.87449318867267534,1,0,2452.3274088064964,1.5703885508902102,9.1028636583463651,1.4607186179361531,2.1648061345104463,1.0906204970023627,1,0,1,0,0.97331000007369173,0.10846768508581062,-0.53263038103994831,-114.71802232786213,65.28197767213787,null,40506.25,1640756289.0625,null,42.390835918832536,-68.771575905028797,null,23.451708952615775,-45.946446422833375,null,0,0]
[40738,40.738,352.38383645070326,1.5679585083742911,1.5643809191696918,0.87729910587978388,1,0,2466.3580036593316,1.5703908706421745,9.154317475424202,1.4613398233555364,2.1745547578190432,1.0929540040695636,1,0,1,0,0.97300573765266862,0.10912498106162193,-0.58985233039254703,-114.69408622541165,65.305913774588348,null,40738,1659584644,null,42.351214499119571,-68.869816474811358,null,23.434108422976138,-45.824269750600294,null,0,0]
[40975.25,40.975250000000003,354.43603326634332,1.567974939484216,1.5697751997346574,0.88015212421244404,1,0,2480.721579201876,1.5703932182657225,9.20699603666956,1.4619685788548646,2.1845468950931042,1.0953213037975642,1,0,1,0,0.97269250537159135,0.10979854956504674,-0.64801329523972107,-114.6699001374807,65.330099862519305,null,40975.25,1678971112.5625,null,42.310795594246031,-68.969562230646275,null,23.416366363002506,-45.700337906834399,null,0,0]
[41212.5,41.212499999999999,356.48823017657281,1.5679911814161016,1.575182170245385,0.88298557893483087,1,0,2495.0851547579359,1.5703955388599178,9.2596781963336223,1.4625901800946319,2.1945511632806034,1.0976670330225731,1,0,1,0,0.97237750452930383,0.11047280383874306,-0.70575502514956745,-114.64603587591701,65.353964124082992,null,41212.5,1698470156.25,null,42.27052062499601,-69.068480447907376,null,23.398899602342681,-45.577555428009568,null,0,0]
[41449.75,41.449750000000002,358.54042717976745,1.5680072374183642,1.5806017004714188,0.88579962555403513,1,0,2509.4487303272776,1.5703978328888921,9.3123638933451698,1.4632047480183279,2.2045673972322599,1.0999914597634786,1,0,1,0,0.9720607360498178,0.11114774853531217,-0.76308216583527666,-114.6224934369079,65.377506563092098,null,41449.75,1718081775.0625,null,42.230389013433189,-69.166579579987143,null,23.38170407321979,-45.455913856920766,null,0,0]
[41687,41.686999999999998,360.59262427433998,1.5680231106654721,1.5860336616618587,0.88859441868370015,1,0,2523.8123059096761,1.570400100806211,9.365053068003224,1.4638124008691846,2.2145954345908057,1.1022948481141288,1,0,1,0,0.97174220086396579,0.11182338831985243,-0.8199992917539598,-114.5992727935305,65.400727206469497,null,41687,1737805969,null,42.190400176739907,-69.263868009497628,null,23.364775783994386,-45.335404784032832,null,0,0]
[41929.75,41.929749999999999,362.69239610474153,1.568039165967346,1.5916042820068352,0.89143423368334096,1,0,2538.508862182714,1.570402394734717,9.4189672374025868,1.4644271036954324,2.2248679954417567,1.1046301300822896,1,0,1,0,0.97141445366329826,0.1125154153110928,-0.87781620283680306,-114.57584686194147,65.424153138058529,null,41929.75,1758103935.0625,null,42.14963147225339,-69.362581365182194,null,23.347727577398064,-45.213265496759291,null,0,0]
[42172.5,42.172499999999999,364.79216802755894,1.5680550364381063,1.5971876483277692,0.89425421673466199,1,0,2553.2054184689564,1.5704046622549683,9.4728849253359684,1.465034809228227,2.2351525781369488,1.1069439339584497,1,0,1,0,0.97108485888773965,0.113208179912811,-0.93521333499349368,-114.55275768749341,65.447242312506589,null,42172.5,1778519756.25,null,42.109010990249132,-69.460463519143502,null,23.330950927245627,-45.092294168349916,null,0,0]
[42415.25,42.41525,366.89194004120554,1.568070725251185,1.6027836274211844,0.89705453047644601,1,0,2567.9019747681759,1.5704069038203825,9.5268060720631276,1.4656356358276303,2.2454490174894022,1.1092365302578464,1,0,1,0,0.97075341755673128,0.11390168716335952,-0.99219536529602037,-114.53000516599928,65.469994834000715,null,42415.25,1799053432.5625,null,42.068538092492219,-69.557523215209869,null,23.314441794700013,-44.972481950789422,null,0,0]
[42658,42.658000000000001,368.9917121441307,1.5680862355077796,1.6083920876385696,0.89983533652059122,1,0,2582.5985310801516,1.5704091198740555,9.5807306191849317,1.4662296992090975,2.2557571511394214,1.1115081854513167,1,0,1,0,0.97042013069731614,0.11459594211519895,-1.0487668984674867,-114.50758916798425,65.49241083201575,null,42658,1819704964,null,42.028212136668948,-69.653769116415987,null,23.298196217351823,-44.853820051568334,null,0,0]
[42906.5,42.906500000000001,371.14122147324042,1.5681019313677527,1.6141461872685254,0.90266197264290227,1,0,2597.6432035690432,1.5704113624459337,9.6359359353450493,1.4668309468134195,2.2663213992233335,1.1138122321471524,1,0,1,0,0.97007703876026175,0.11530742159582906,-1.1062579723962003,-114.48499061711972,65.51500938288028,null,42906.5,1840967742.25,null,41.987082512647824,-69.75146080773392,null,23.281834767444231,-44.733529809385779,null,0,0]
[43155,43.155000000000001,373.2907308927314,1.5681174464656795,1.6199130920379734,0.90546850535770951,1,0,2612.6878760708482,1.5704135791909541,9.6911446951966518,1.4674253442252578,2.27689756669223,1.1160948863173379,1,0,1,0,0.9697320150321479,0.11601969537920416,-1.1633284108510387,-114.46274436586722,65.537255634132777,null,43155,1862354025,null,41.946105500234097,-69.848317804966271,null,23.265741341403121,-44.614426560900988,null,0,0]
[43403.5,43.403500000000001,375.44024040105137,1.5681327839063057,1.6256926656738926,0.90825510462860837,1,0,2627.7325485853448,1.5704157705527191,9.7463568402188212,1.4680130074379749,2.2874854882186266,1.1183564210622863,1,0,1,0,0.96938506063971341,0.1167327689320222,-1.2199829268419777,-114.44085019412525,65.559149805874753,null,43403.5,1883863812.25,null,41.905280399007985,-69.944349135100452,null,23.249911926638287,-44.496501059024787,null,0,0]
[43652,43.652000000000001,377.58974999668328,1.5681479467236794,1.6314847735370057,0.91102193925178909,1,0,2642.7772211123165,1.5704179369647306,9.8015723132056731,1.4685940498500651,2.2980850013398193,1.1205971053164359,1,0,1,0,0.96903617671819153,0.11744664773694395,-1.2762261597951952,-114.41930785494691,65.580692145053092,null,43652,1905497104,null,41.864606505325554,-70.039563734527505,null,23.234342587367504,-44.379744120419353,null,0,0]
[43906,43.905999999999999,379.78683434006206,1.5681632677599815,1.6374178918919684,0.91382976050219433,1,0,2658.1548743316312,1.570420125982354,9.8580132400837144,1.4691812255430741,2.3089309244001557,1.1228661100515602,1,0,1,0,0.96867757815002276,0.11817716458409915,-1.3332939291547086,-114.39765203801669,65.602347961983313,null,43906,1927736836,null,41.823187913557433,-70.136050862084616,null,23.218693409776108,-44.261601175932064,null,0,0]
[44160,44.16,381.98391877156422,1.5681784125500702,1.6433638261482508,0.91661728536872433,1,0,2673.5325275635369,1.5704222898183469,9.9144575270631883,1.4697617157002398,2.3197886235293073,1.1251138862556249,1,0,1,0,0.96831696612146345,0.11890853435717579,-1.3899415805007616,-114.37636319406515,65.623636805934851,null,44160,1950105600,null,41.781925801087596,-70.231703294592236,null,23.203307870899899,-44.144659899472927,null,0,0]
[44414,44.414000000000001,384.18100328967796,1.5681933841177302,1.6493224376989282,0.91938469027464187,1,0,2688.9101808078167,1.5704244289047444,9.9709051170805143,1.4703356334720616,2.3306579341458407,1.127340708060556,1,0,1,0,0.96795434187256979,0.11964076296348379,-1.4461738388289833,-114.35544097480806,65.644559025191938,null,44414,1972603396,null,41.740819407927603,-70.326530280360487,null,23.188182005731662,-44.028910694447596,null,0,0]
[44668,44.667999999999999,386.37808789292569,1.5682081854179699,1.6552935896394594,0.92213215033839313,1,0,2704.2878340642606,1.5704265436637546,10.027355954353727,1.4709030894785764,2.3415386945498549,1.1295468453423294,1,0,1,0,0.9675897066528395,0.1203738563282904,-1.501995354772897,-114.33488500438381,65.665114995616193,null,44668,1995230224,null,41.699867971790354,-70.420540968273329,null,23.173311925925006,-43.914344036110492,null,0,0]
[44928.25,44.928249999999998,388.62923470410834,1.5682231773397906,1.661424535182555,0.92492670993907367,1,0,2720.043874470321,1.5704286856579603,10.085199148891508,1.4714779193448848,2.3526988999361778,1.1317860910704522,1,0,1,0,0.96721401462294032,0.12112589156103841,-1.558769191152868,-114.31420268383647,65.68579731616353,null,44928.25,2018547648.0625,null,41.658068796415073,-70.516027699846774,null,23.15833726492032,-43.798174983989711,null,0,0]
[45188.5,45.188499999999998,390.88038160163239,1.5682379965795361,1.6675683602597653,0.92770069906887376,1,0,2735.799914888717,1.5704308029797864,10.14304563786653,1.4720461928084241,2.3638707908508891,1.1340041820324867,1,0,1,0,0.96683621412586829,0.12187884728524023,-1.615121474279348,-114.29390397254566,65.706096027454336,null,45188.5,2042000532.25,null,41.616430671313367,-70.610676593190021,null,23.143623106895539,-43.68322737935565,null,0,0]
[45448.75,45.448749999999997,393.13152858401457,1.5682526461036332,1.6737249230384625,0.93045430179688604,1,0,2751.5559553192379,1.570432896053072,10.200895365233233,1.4726080210439534,2.375054202393192,1.1362013950817311,1,0,1,0,0.96645630653677794,0.12263272993397359,-1.6710569729084699,-114.27398837964641,65.726011620353589,null,45448.75,2065588876.5625,null,41.574952770835708,-70.704497165268364,null,23.12916550874407,-43.569491214378068,null,0,0]
[45709,45.709000000000003,395.38267564980538,1.5682671288109493,1.6798940834732894,0.93318770073333812,1,0,2767.3119957616755,1.5704349652920031,10.258748276207132,1.4731635127348945,2.3862489725851237,1.1383780026905934,1,0,1,0,0.96607429324142657,0.12338754596071973,-1.7265803799518711,-114.2544553863423,65.7455446136577,null,45709,2089312681,null,41.533634267987971,-70.79749882423053,null,23.114960604548415,-43.456956562111749,null,0,0]
[45975.25,45.975250000000003,397.6857224446025,1.5682817757376408,1.6862183648605034,0.93596339855406296,1,0,2783.4312878690866,1.5704370579938773,10.317938210577546,1.4737253645859527,2.3977134240273421,1.1405837475771989,1,0,1,0,0.96568129509368306,0.12416073674159447,-1.7829622291950431,-114.23486742746653,65.765132572533474,null,45975.25,2113723612.5625,null,41.491527265967314,-70.891806860231284,null,23.100685757325902,-43.34306056723522,null,0,0]
[46241.5,46.241500000000002,399.98876932373366,1.5682962539968057,1.6925555405703017,0.93871833223011092,1,0,2799.5505799885464,1.5704391265969744,10.377131364931632,1.4742808067885178,2.4091894300321028,1.1427684891848702,1,0,1,0,0.96528609599578497,0.12493491816493578,-1.8389224664907289,-114.21567872795099,65.784321272049013,null,46241.5,2138276322.25,null,41.449585341813993,-70.985277362040819,null,23.086667444183533,-43.230401365910211,null,0,0]
[46507.75,46.507750000000001,402.29181628575043,1.5683105664852102,1.6989054663093388,0.9414526925363258,1,0,2815.6698721198491,1.57044117151518,10.436327684479718,1.4748299480662002,2.420676826264923,1.1449325055232837,1,0,1,0,0.96488869746635197,0.12571009720827478,-1.8944658798445748,-114.19688864604905,65.803111353950953,null,46507.75,2162970810.0625,null,41.407807607382743,-71.077920052750144,null,23.072901765260937,-43.118968593298888,null,0,0]
[46774,46.774000000000001,404.59486332923746,1.568324716033664,1.7052679996453368,0.94416666863949339,1,0,2831.7891642627915,1.5704431931529561,10.495527115665325,1.4753728947050102,2.4321754513344138,1.1470760701290001,1,0,1,0,0.96448910103584862,0.1264862808721933,-1.949597180416667,-114.17849651252389,65.821503487476107,null,46774,2187807076,null,41.366193174196077,-71.169744538283879,null,23.059384897875507,-43.008751974240042,null,0,0]
[47046.25,47.046250000000001,406.94981010721244,1.5683390188380972,1.7117868045199991,0.94692092173822828,1,0,2848.271708071491,1.5704452366872674,10.556063781608696,1.4759217794017427,2.4439446464803698,1.1492470725378223,1,0,1,0,0.9640782284679047,0.12728100215135188,-2.0055495577529179,-114.16010068441626,65.839899315583736,null,47046.25,2213349639.0625,null,41.323808888005871,-71.262802123057696,null,23.045816806729462,-42.897298561358596,null,0,0]
[47318.5,47.3185,409.30475696747931,1.5683531570593283,1.7183184962721281,0.94965425644452894,1,0,2864.7542518919477,1.5704472567063723,10.616603591555105,1.4764644043723079,2.4557252501103632,1.1513972555373722,1,0,1,0,0.96366506109704642,0.12807678871873884,-2.06108076216137,-114.14211944279138,65.857880557208617,null,47318.5,2239040442.25,null,41.281593467209994,-71.35502415211549,null,23.032501023116893,-42.78709529067585,null,0,0]
[47590.75,47.59075,411.65970390862572,1.5683671335219032,1.7248629285020767,0.95236686978745999,1,0,2881.2367957239599,1.5704492536138375,10.67714649202472,1.4770008757784758,2.4675170988227015,1.1535268975796564,1,0,1,0,0.96324960059836562,0.12887364813490301,-2.1161955908698133,-114.12455198836348,65.875448011636522,null,47590.75,2264879485.5625,null,41.239545962480612,-71.446420520083393,null,23.019433699137831,-42.67813146828005,null,0,0]
[47863,47.863,414.01465092927162,1.5683809509861029,1.7314199567402326,0.95505895703992905,1,0,2897.7193395673312,1.5704512278040474,10.737692430741159,1.4775312974019394,2.4793200321697957,1.1556362725672302,1,0,1,0,0.96283184866016858,0.12967158798639047,-2.1708987634473118,-114.10739749545264,65.892602504547355,null,47863,2290866769,null,41.197665425207248,-71.537000996765386,null,23.006611063833695,-42.570396498687238,null,0,0]
[48141.75,48.141750000000002,416.42582266130677,1.5683949364230834,1.7381464365996642,0.95779425323917378,1,0,2914.5954060484655,1.5704532259934803,10.799687005249037,1.4780682206897688,2.4914160821446707,1.1577752918320969,1,0,1,0,0.96240175046845056,0.13048970613044394,-2.2264863134480026,-114.0902604164894,65.9097395835106,null,48141.75,2317628093.0625,null,41.154956990230545,-71.628908822550713,null,22.99373194880971,-42.461351593938709,null,0,0]
[48420.5,48.420499999999997,418.83699447385379,1.5684087608366044,1.7448858206811304,0.96050844019630088,1,0,2931.471472541104,1.5704552011763253,10.861684657621243,1.4785990146963213,2.5035234211696298,1.1598936316047224,1,0,1,0,0.96196925373905717,0.13130897309725334,-2.2816520864062824,-114.07355442087977,65.926445579120227,null,48420.5,2344544820.25,null,41.112421581330324,-71.719981664475426,null,22.981101584751642,-42.353572756404375,null,0,0]
[48699.25,48.699249999999999,421.24816636553038,1.5684224269916953,1.7516379600386038,0.96320172180273911,1,0,2948.3475390450476,1.5704571537476455,10.923685335452285,1.4791237834856921,2.5156418862480803,1.1619915715898055,1,0,1,0,0.9615343603276465,0.13212939711588861,-2.3364009048276686,-114.05727854252164,65.942721457478356,null,48699.25,2371616950.5625,null,41.070058184217935,-71.810229608640256,null,22.968716163442654,-42.247048933881366,null,0,0]
[48978,48.978000000000002,423.65933833498531,1.5684359375904393,1.7584027077340763,0.96587430003438857,1,0,2965.2236055601038,1.5704590840935098,10.9856889875172,1.479642628786056,2.5277713173607772,1.1640693868491325,1,0,1,0,0.96109707210470985,0.13295098644490391,-2.3907375123760231,-114.04143179045106,65.958568209548943,null,48978,2398844484,null,41.027865786411219,-71.899662608449731,null,22.956571953701015,-42.141769182001305,null,0,0]
[49263.25,49.263249999999999,426.12673502143554,1.5684496049498078,1.7653380999780834,0.96858797403476093,1,0,2982.4931947137247,1.5704610368366465,11.049141491487912,1.4801675441823485,2.5401947759161696,1.1661751014842918,1,0,1,0,0.96064710976615664,0.13379294894497692,-2.4459192887609076,-114.02565871159342,65.974341288406578,null,49263.25,2426867800.5625,null,40.984865502756875,-71.990347617138127,null,22.944390460970471,-42.035311094455317,null,0,0]
[49548.5,49.548499999999997,428.59413178656843,1.5684631149444566,1.7722863904188269,0.97128038968753616,1,0,2999.7627838785879,1.5704629670959578,11.112597005129052,1.4806864649422531,2.5526293881175164,1.1682603101737483,1,0,1,0,0.96019464363870211,0.13463614932899914,-2.5006792105266822,-114.01033283051734,65.989667169482658,null,49548.5,2455053852.25,null,40.942042147786218,-72.0801999008183,null,22.932453894175353,-41.930132929699049,null,0,0]
[49833.75,49.833750000000002,431.06152862903264,1.568476470276648,1.779247427946778,0.9739517572380697,1,0,3017.0323730544997,1.5704648752575379,11.176055477175616,1.4811994928978636,2.5650749917575628,1.1703252931323633,1,0,1,0,0.95973967577553421,0.13548059654426323,-2.5550221145935619,-113.99545301122288,66.004546988777122,null,49833.75,2483402639.0625,null,40.899394643856979,-72.169229702191572,null,22.920758494037713,-41.826223309031313,null,0,0]
[50119,50.119,433.52892554750798,1.5684896735871263,1.7862210635328768,0.97660228485906797,1,0,3034.3019622412717,1.5704667616986911,11.239516857518002,1.4817067275939559,2.5775314276199155,1.1723703258553801,1,0,1,0,0.95928220824646682,0.13632629957144066,-2.6089527580711169,-113.98101809498776,66.01898190501224,null,50119,2511914161,null,40.856921916253775,-72.25744712409508,null,22.909300578163361,-41.723570970892681,null,0,0]
[50410.75,50.41075,436.05254718821072,1.5685030231942434,1.7933664863089342,0.97929186728378481,1,0,3051.965074067356,1.5704686690420637,11.304427291575724,1.4822196293060681,2.5902827510480781,1.1744416037681884,1,0,1,0,0.95881173281166121,0.13719258211604612,-2.6636907380994601,-113.96671324511915,66.033286754880848,null,50410.75,2541243715.5625,null,40.813661040147394,-72.34684478611608,null,22.897823474241406,-41.619868459003051,null,0,0]
[50702.5,50.702500000000001,438.57616890572888,1.5685162191707698,1.80052477901426,0.98196008309701288,1,0,3069.6281859044152,1.5704705544351432,11.369340665511203,1.4827266743145164,2.603045078384592,1.1764925800979742,1,0,1,0,0.95833864692651061,0.13806019746844356,-2.7180072724500732,-113.95287128550676,66.04712871449324,null,50702.5,2570743506.25,null,40.770580732530057,-72.43541355985414,null,22.886587247508132,-41.517457725652655,null,0,0]
[50994.25,50.994250000000001,441.09979069874407,1.5685292641535566,1.8076957887580016,0.98460714835975438,1,0,3087.2912977522615,1.5704724182546774,11.434256929254536,1.4832279621079847,2.6158182485684094,1.1785235348634273,1,0,1,0,0.95786295286016543,0.13892915534745207,-2.7719072020297881,-113.93949090988843,66.060509090111566,null,50994.25,2600413533.0625,null,40.727679854368148,-72.523163810502794,null,22.87558819609032,-41.416327099385647,null,0,0]
[51286,51.286000000000001,{"$f":"SQRT(1+(A461/pole1)^2)","v":443.62341256596795},{"$f":"ATAN(A461/pole1)","v":1.5685421607194547},{"$f":"SQRT(1+(A461/Zero1)^2)","v":1.8148793647962507},{"$f":"ATAN(A461/Zero1)","v":0.98723327690690976},{"$f":"IF(VIN_nom>Vout, 1, SQRT(1+(A461/z_RHP)^2))","v":1},{"$f":"IF(VIN_nom>Vout, 0, -ATAN(A461/z_RHP))","v":0},{"$f":"SQRT(1+(A461/Pole2)^2)","v":3104.9544096107102},{"$f":"ATAN(A461/Pole2)","v":1.5704742608688422},11.49917603386425,1.4837235899402101,{"$f":"SQRT(1+(A461/pole4)^2)","v":2.6286021035335412},{"$f":"ATAN(A461/pole4)","v":1.1805347433035327},{"$f":"IF(VOUT_setting=1,1,SQRT(1+(A461*zterm1)^2))","v":1},{"$f":"IF(VOUT_setting=1,0,ATAN(((A461*zterm1))))","v":0},1,{"$f":"IF(VOUT_setting=1,0,ATAN(A461*$Q$4/(1+Afbr-$Q$5*(A461)^2)))","v":0},{"$f":"SQRT((1-(Z461/pterm2))^2+(A461/pterm1)^2)","v":0.95738465290039054},{"$f":"IF((ATAN((A461/pterm1)/(1-A461^2/pterm2))>0),ATAN((A461/pterm1)/(1-A461^2/pterm2)),PI()+ATAN((A461/pterm1)/(1-A461^2/pterm2)))","v":0.139799465509614},{"$f":"20*LOG10(((E461*K461*G461*O461)/(C461*I461*S461*M461*Q461))*Adc)","v":-2.8253952871800903},{"$f":"((F461+L461+H461+P461)-(D461+J461+T461+N461+R461))*radconv","v":-113.92657079197654},{"$f":"IF(V461>0,V461,V461+180)","v":66.073429208023455},null,{"$f":"IF(U461<0,A461,1000000000)","v":51286},{"$f":"A461^2","v":2630253796},null,{"$f":"20*LOG10((K461/(I461*M461))*AEA)","v":40.684957270694838},{"$f":"(L461-(J461+N461))*radconv","v":-72.610105756960465},null,{"$f":"20*LOG10((E461*G461/(C461*S461))*Acs*Am)","v":22.864822694613324},{"$f":"(F461+H461-(D461+T461))*radconv","v":-41.316465035016108},null,{"$f":"SUM((U462<0)*(U461>0))*A461","v":0},0]
[51584.75,{"$f":"A462/1000","v":51.58475},446.20758413369788,1.5685552155438662,1.8222481643442421,0.98990093932624457,1,0,3123.0413150806753,1.5704761260942977,11.565655645908153,1.4842253434570594,2.6417035937485722,1.1825740268655027,1,0,1,0,0.95689217900094381,0.14069206872151929,-2.8797448240972914,-113.91381622933794,66.086183770662061,null,51584.75,2660986432.5625,null,40.641393219388469,-72.698306609067657,null,22.854037209002492,-41.215509620270261,null,0,0]
[51883.5,51.883499999999998,448.79175577659856,1.5685681200272517,1.8296298272711555,0.99254709501998828,1,0,3141.1282205613797,1.5704779698394733,11.632138136399631,1.4847213616389878,2.6548159614987266,1.184593174356487,1,0,{"$f":"IF(VOUT_setting=1,1,SQRT((1+Afbr-$Q$5*(A463)^2)^2+(A463*$Q$4)^2))","v":1},0,0.95639697757633546,0.14158611071477048,-2.9336723674590042,-113.90154140137209,66.098458598627914,null,51883.5,2691897572.25,null,40.59801372605888,-72.785681129046111,null,22.843489158970375,-41.115860272325911,null,0,0]
[52182.25,52.182250000000003,451.37592749337881,1.5685808767517579,1.8370241985113305,0.99517196641212269,1,0,3159.2151260526407,1.5704797924733012,11.698623456264611,1.4852117420245454,2.6679390464015138,1.1865924663266332,1,0,1,0,0.95589905114438301,0.142481602090161,-2.9871827763733987,-113.88974482638075,66.110255173619251,null,52182.25,2722987215.0625,null,40.554817586534675,-72.872239823826291,null,22.833174889580185,-41.017505002554451,null,0,0]
[52481,52.481000000000002,453.96009928277698,1.5685934882407373,1.8444311252209211,0.99777577353615776,1,0,3177.3020315542767,1.5704815943563124,11.765111557536237,1.4856965799583937,2.6810726910847378,1.1885721784704966,1,0,1,0,0.95539840224386086,0.14337855349133574,-3.0402808283014804,-113.87842500573059,66.121574994269409,null,52481,2754255361,null,40.511803601895117,-72.957993047352815,null,22.823090822291661,-40.920431958377776,null,0,0]
[52786.5,52.786499999999997,456.60265829102053,1.5686062370499994,1.8520182323195515,1.0004168546828534,1,0,3195.797595182396,1.5704834158590393,11.833104727957592,1.4861867377912061,2.6945138386759138,1.1905766543731438,1,0,1,0,0.95488362884695233,0.14429729175582437,-3.0941570416420934,-113.86734087931812,66.132659120681879,null,52786.5,2786414582.25,null,40.468004884479605,-73.044861446112648,null,22.813013326366558,-40.822479433205523,null,0,0]
[53092,53.091999999999999,459.24521737262268,1.5686188391425187,1.859618152354191,1.0030363667439244,1,0,3214.2931588209958,1.5704852163993226,11.901100708852896,1.4866712947846867,2.7079657051182608,1.1925612236463965,1,0,1,0,0.95436601400516885,0.14521757941772137,-3.1476119039866224,-113.85675207570996,66.143247924290037,null,53092,2818760464,null,40.424394127980676,-73.130908982418774,null,22.803169220520957,-40.725843093291161,null,0,0]
[53397.5,53.397500000000001,461.88777652632422,1.5686312970364851,1.867230728872908,1.0056345373566031,1,0,3232.7887224698975,1.5704869963369559,11.969099452323579,1.4871503461676492,2.7214281314637447,1.1945261659646149,1,0,1,0,0.95384556050211122,0.14613942799988547,-3.2006502697673089,-113.84665694531211,66.153343054687895,null,53397.5,2851293006.25,null,40.38097006846283,-73.216146244837276,null,22.793554914258113,-40.630510700474851,null,0,0]
[53703,53.703000000000003,464.53033575089478,1.5686436131927879,1.8748558077063269,1.0082115916166641,1,0,3251.2842861289246,1.5704887560235454,12.037100911551473,1.4876239850272337,2.7349009617704323,1.196471756103906,1,0,1,0,0.95332227114486701,0.14706284907360617,-3.2532769111904929,-113.83705382522798,66.162946174772017,null,53703,2884012209,null,40.337731448416001,-73.300583663524677,null,22.784166892881753,-40.536470161703292,null,0,0]
[54015.75,54.015749999999997,467.23560717324557,1.5686560773188454,1.8826746340460236,1.0108281618476158,1,0,3270.2187788867318,1.5704905368514099,12.106718918780352,1.4881033523732083,2.7487041412449065,1.1984437535165677,1,0,1,0,0.95278362865431898,0.14800982543890229,-3.3067308677034601,-113.82773072214889,66.172269277851115,null,54015.75,2917701248.0625,null,40.293657494090894,-73.386207100738673,null,22.774786890693896,-40.441523621410212,null,0,0]
[54328.5,54.328499999999998,469.94087866734787,1.568668397942407,1.8905062433342528,1.0134230709196013,1,0,3289.1532716547913,1.5704922971760815,{"$f":"SQRT(1+(A471/Zero2)^2)","v":12.17633967623623},{"$f":"ATAN(A471/Zero2)","v":1.4885772380618145},2.7625179029658447,1.2003960368104305,1,0,1,0,0.95224202014348558,0.14895847451587405,-3.359763190917024,-113.81891969457209,66.181080305427912,null,54328.5,2951585912.25,null,40.24977523938783,-73.471013903233299,null,22.76563682218341,-40.347905791338782,null,0,0]
[54641.25,54.641249999999999,472.6461502319695,1.5686805775275527,1.8983504773635778,1.0159965521895584,1,0,3308.0877644329257,1.5704940373496221,12.245963137012325,1.4890457353749733,2.7763420889765293,1.202328885477927,1,0,1,0,0.95169744870155359,0.14990880887972882,-3.4123787439931204,-113.81061892306556,66.189381076934438,null,54641.25,2985666201.5625,null,40.20608335697343,-73.555014760256597,null,22.756713151521701,-40.255604162809,null,0,0]
[54954,54.954000000000001,475.35142186590645,1.5686926184822694,1.9062071802777716,1.0185488363117636,1,0,3327.0222572209645,1.5704957577160794,12.315589255260772,1.4895089354947155,2.7901765443326623,1.2042425740554263,1,0,1,0,0.95114991744417243,0.15086084116067747,-3.4645823069837571,-113.80282657888036,66.197173421119643,null,54954,3019942116,null,40.162580527157779,-73.638220196950797,null,22.748012418346718,-40.164606381929552,null,0,0]
[55274,55.274000000000001,478.11940570256201,1.5687047975301236,1.9142587586637199,1.0211385839494305,1,0,3346.3956791084888,1.5704974978126798,12.386832112075824,1.4899774834206365,2.8043421731582181,1.2061810745016959,1,0,1,0,0.95058663336340032,0.15183671358053116,-3.5175744983329462,-113.79537792396268,66.204622076037325,null,55274,3055215076,null,40.118263547284116,-73.72254197273891,null,22.739337206871198,-40.072835951223773,null,0,{"$f":"IF(AH474>0,W474,0)","v":0}]
[55594,55.594000000000001,480.88738960932017,1.5687168363729787,1.9223230679891301,1.0237066202655407,1,0,3365.7691010060294,1.570499217877231,12.458077657158443,1.490440672361663,2.8185182341456225,1.2081000822778565,1,0,1,0,0.95002025733571849,0.15281439048027157,-3.57014524253557,-113.78845764380182,66.21154235619818,null,55594,3090692836,null,40.074141716456197,-73.806052800262421,null,22.730888293496498,-39.982404843539371,null,0,0]
[55914,55.914000000000001,483.65537358497744,1.5687287374180316,1.9303999487022532,1.0262531836986799,1,0,3385.1425229134138,1.5705009182536682,12.529325844649712,1.4908985935391601,2.8327045706739273,1.2099998760040387,1,0,1,0,0.94945079278568045,0.15379388557085005,-3.6222994007448288,-113.78206375723943,66.217936242760572,null,55914,3126375396,null,40.030213646672699,-73.888763436385801,null,22.722662205070726,-39.893300320853598,null,0,0]
[56234,56.234000000000002,486.42335762835756,1.5687405030176875,1.9384892436638188,1.0287785098307389,1,0,3404.5159448304744,1.5705025992780972,12.60057662972625,1.491351336120176,2.8469010291315988,1.2118807293037015,1,0,1,0,0.94887824316762137,0.15477521262557867,-3.6740417503624716,-113.7761942781942,66.223805721805803,null,56234,3162262756,null,39.986477958790957,-73.970684468940306,null,22.714655543334828,-39.805509809253877,null,0,0]
[56561.5,56.561500000000002,489.25621636667734,1.5687524065281397,1.946780824084662,1.031341276400872,1,0,3424.3434313335633,1.5705043000066186,12.673499998980317,1.4918094187284185,2.8614405404320404,1.2137863339961101,1,0,1,0,0.94828908367924736,0.15578145084420408,-3.7265753112030024,-113.7707281446055,66.229271855394501,null,56561.5,3199203282.25,null,39.941914984129269,-74.053718819776279,null,22.706684957155979,-39.717009324829213,null,0,0]
[56889,56.889000000000003,492.08907517352327,1.5687641729863151,1.9550850820184946,1.0338822887506594,1,0,3444.1709178464434,1.5705059811535498,12.746425997207854,1.4922622597839879,2.8759903374820222,1.2156726643579161,1,0,1,0,0.94769670023313413,0.15678963730011106,-3.7786873977212259,-113.7658070683938,66.234192931606202,null,56889,3236358321,null,39.897550620825854,-74.135948029718634,null,22.69893723394118,-39.629859038675171,null,0,0]
[57216.5,57.216500000000003,494.92193404771888,1.5687758047456108,1.9634018566057356,1.0364017903035063,1,0,3463.998404368946,1.5705076430551383,12.819354579542216,1.4927099485562461,2.8905502649593222,1.2175399981217339,1,0,1,0,0.94710109663046993,0.15779978696433739,-3.8303828699556535,-113.76142891245694,66.238571087543065,null,57216.5,3273727872.25,null,39.853383419898037,-74.217382916181919,null,22.691408962634561,-39.54404599627501,null,0,0]
[57544,57.543999999999997,497.75479298811405,1.5687873041058482,1.9717309894604063,1.0389000214713491,1,0,3483.8258909009069,1.5705092860399772,12.892285702130369,1.4931525723029522,2.9051201705484333,1.2193886079843352,1,0,1,0,0.94650227670602705,0.1588119148787254,-3.8816665035343219,-113.75759153950952,66.242408460490481,null,57544,3311311936,null,39.80941194245456,-74.298034122865928,null,22.684096806499376,-39.45955741664357,null,0,0]
[57879,57.878999999999998,500.65252662805159,1.5687989321713913,1.9802634892743824,1.0414337049230997,1,0,3504.1074420195541,1.5705109474136647,12.966889586594503,1.4936001810454782,2.9200339058738951,1.2212604595469858,1,0,1,0,0.94588641973194687,0.15984928377520322,-3.9337033697061061,-113.75422356203948,66.245776437960515,null,57879,3349978641,null,39.764634493339869,-74.379732415254736,null,22.676837389442284,-39.374491146784756,null,0,0]
[58214,58.213999999999999,503.55026033490424,1.5688104264070479,1.9888085923661454,1.0439456319667955,1,0,3524.3889931477615,1.5705125896661738,13.041496039297876,1.4940426686074608,2.9349577684970116,1.223113281323523,1,0,1,0,0.94526720566218125,0.1608887546334159,-3.9853191637712122,-113.75141690061658,66.248583099383424,null,58214,3388869796,null,39.720058821833675,-74.460632707681711,null,22.669797266883368,-39.290784192934844,null,0,0]
[58549,58.548999999999999,506.44799410752336,1.5688217891100107,1.9973661369782159,1.0464360503388006,1,0,3544.6705442853658,1.5705142131257217,13.116105016414847,1.4944801222073103,2.9498916047120707,1.2249473495103138,1,0,1,0,0.94464463871166671,0.16193034378644738,-4.0365187343558082,-113.74916927487367,66.250830725126335,null,58549,3427985401,null,39.675683421109277,-74.540745846591705,null,22.662973097023169,-39.208423428281939,null,0,0]
[58884,58.884,509.34572794478652,1.5688330225251963,2.0059359638798964,1.0489052046183784,1,0,3564.9520954322061,1.5705158181130561,13.190716475109854,1.4949126270978887,2.9648352638085234,1.2267629352455371,1,0,1,0,0.94401872313316948,0.16297406764764127,-4.0873068452614003,-113.74747840931236,66.252521590687635,null,58884,3467325456,null,39.631506795646764,-74.620082500806333,null,22.656361611580088,-39.127395908506031,null,0,0]
[59227,59.226999999999997,512.31266146190637,1.5688443925363236,2.0147230054338316,1.0514115440696659,1,0,3585.7179821382283,1.5705174426166248,13.267112227436025,1.495350420103071,2.9801458096301325,1.2286030064368982,1,0,1,0,0.94337439526473621,0.16404494526817187,-4.1388863786002092,-113.7463216573768,66.253678342623203,null,59227,3507837529,null,39.586479608316097,-74.700520199867839,null,22.64980926557195,-39.045801457508915,null,0,0]
[59570,59.57,515.2795950444937,1.5688556316124487,2.0235225929868652,1.0538961006391634,1,0,3606.4838688536038,1.5705190484126335,13.343510493455899,1.4957832000229261,2.9954663426458317,1.2304242613833341,1,0,1,0,0.9427265660699784,0.16511809585546369,-4.1900444084199231,-113.74574376736027,66.254256232639733,null,59570,3548584900,null,39.541657666806216,-74.780165964275312,null,22.643473177262116,-38.96557780308494,null,0,0]
[59913,59.912999999999997,518.24652869142449,1.5688667420023561,2.0323345635742744,1.0563591267962318,1,0,3627.249755578172,1.5705206358223822,13.419911230238831,1.4962110523137448,3.01079671039518,1.2322269753352149,1,0,1,0,0.94207524023877298,0.16619353729323186,-4.2407857832917237,-113.74574232015007,66.254257679849928,null,59913,3589567569,null,39.49703940297249,-74.859030686837571,null,22.637350066224041,-38.886711633312522,null,0,0]
[60256,60.256,521.21346240159949,1.5688777259036275,2.0411587568181417,1.0588008716985295,1,0,3648.0156423117764,1.5705222051598562,13.496314395824891,1.4966340605040427,3.0261367634102982,1.2340114184491493,1,0,1,0,0.94142042250381952,0.16727128755656101,-4.2911152662928229,-113.74631490686481,66.253685093135189,null,60256,3630785536,null,39.452623261238749,-74.937125078546799,null,22.631436724956686,-38.809189828317997,null,0,0]
[60607,60.606999999999999,524.24959579619099,1.5688888372814314,2.0502012510879464,1.0612777918568037,1,0,3669.2658646052137,1.5705237927106195,13.574502031091471,1.4970620050632784,3.0418444757868928,1.2358188428344463,1,0,1,0,0.94074672201569076,0.16837658393131488,-4.3421970822387248,-113.74749261995863,66.252507380041365,null,60607,3673208449,null,39.407378813175328,-75.016254410552463,null,22.625599357074201,-38.731238209406193,null,0,0]
[60958,60.957999999999998,527.28572925476237,1.5688998206996729,2.0592562131053493,1.06373294393956,1,0,3690.5160869077922,1.5705253619789501,13.652692123871189,1.4974850479517439,3.0575620230903962,1.2376076907064524,1,0,1,0,0.94006937500302146,0.1694843364701929,-4.3928573943515863,-113.74926638993553,66.250733610064472,null,60958,3715877764,null,39.36234277000235,-75.094599184289066,null,22.619975088134325,-38.65466720564649,null,0,0]
[61309,61.308999999999997,530.32186277621486,1.5689106783560844,2.0683234791218204,1.0661665844383801,1,0,3711.7663092193548,1.5705269132788535,13.730884632181345,1.49790327275653,3.0732892544262014,1.239378235717979,1,0,1,0,0.93938838667886382,0.17059456473810455,-4.4431010406233078,-113.75163367577272,66.248366324227277,null,61309,3758793481,null,39.317513505687927,-75.172170307711397,null,22.614560706177024,-38.57946336806129,null,0,0]
[61660,61.66,533.35799635947444,1.5689214123983564,2.077402888027116,1.0685789663891787,1,0,3733.016531539748,1.5705284469171861,13.809079514988854,1.4983167611782866,3.0890260218806826,1.241130746409616,1,0,1,0,0.93870376230469177,0.17170728840380159,-4.4929327731403603,-113.75459195229176,66.245408047708239,null,61660,3801955600,null,39.272889408004815,-75.248978503541124,null,22.609353071343079,-38.505613448750665,null,0,0]
[62019,62.018999999999998,536.46332963140583,1.5689322654063798,2.0867016310002588,1.0710246007118314,1,0,3754.7510894205825,1.5705299975528226,13.889059031839311,1.4987348575320127,3.1051311755931272,1.2429048194642041,1,0,1,0,0.9379997781875703,0.17284797526204179,-4.5434790334186062,-113.75822638860855,66.241773611391451,null,62019,3846356361,null,39.227458805056351,-75.326759090584972,null,22.604237414013294,-38.43146729802357,null,0,0]
[62378,62.378,539.56866296579869,1.5689429934916286,2.0960127440182514,1.0734485209527274,1,0,3776.4856473103409,1.5705315303399179,13.96904094875892,1.4991481662058781,3.1212460013231635,1.2446605791092225,1,0,1,0,0.9372920016759585,0.17399131452131528,-4.5936041777932353,-113.7624737741305,66.237526225869502,null,62378,3891014884,null,39.182239460232026,-75.403763687754719,null,22.599331614463001,-38.358710086375758,null,0,0]
[62737,62.737000000000002,542.67399636158075,1.5689535987986301,2.1053360629568725,1.0758509869161417,1,0,3798.2202052088701,1.5705330455848758,14.049025224756479,1.4995567688294873,3.1373703500324019,1.2463982967979446,1,0,1,0,0.93658043855905715,0.17513732756941738,-4.6433130238628584,-113.76733146512264,66.232668534877362,null,62737,3935931169,null,39.137229693236016,-75.48000318870109,null,22.59463253538938,-38.287328276421526,null,0,0]
[63096,63.095999999999997,545.77932981770425,1.5689640834231047,2.1146714263730453,1.0782322548183221,1,0,3819.9547631160212,1.5705345435871274,14.129011819767799,1.4999607451903396,3.1535040756434989,1.2481182388692689,1,0,1,0,0.93586509468076606,0.17628603591197353,-4.69261030315797,-113.77279683949673,66.227203160503265,null,63096,3981105216,null,39.092427838778441,-75.555488299188042,null,22.590137110551851,-38.217308540308714,null,0,0]
[63463.25,63.463250000000002,548.95602545501072,1.5689746862504947,2.1242336183902268,1.0806465745140268,1,0,3842.1887920701965,1.5705360584776933,14.210838905572754,1.5003692994893563,3.1700181156863758,1.2498595854798111,1,0,1,0,0.9351294059071249,0.17746395361094974,-4.742619441293968,-113.77901389182387,66.220986108176135,null,63463.25,4027584100.5625,null,39.046809828940297,-75.631938470529164,null,22.585745982253997,-38.147075421294723,null,0,0]
[63830.5,63.830500000000001,552.13272115332074,1.5689851670711477,2.1338080814202804,1.0830392417977091,1,0,3864.4228210330875,1.5705375559363566,14.292668336242398,1.5007731756852052,3.1865416684889731,1.2515828780482114,1,0,1,0,0.93438977315674254,0.17864473781636531,-4.7922076283592325,-113.785861400602,66.214138599397998,null,63830.5,4074332730.25,null,39.00140591973426,-75.7076212582447,null,22.581561704394765,-38.078240142357316,null,0,0]
[64197.75,64.197749999999999,555.30941691158728,1.5689955279789118,2.1433946510207584,1.0854105196176298,1,0,3886.6568500045455,1.5705390362622806,14.374500071731047,1.501172453540075,3.2030745868321921,1.2532883858210846,1,0,1,0,0.9336462028663669,0.17982841194068408,-4.8413796621875775,-113.79333663520832,66.20666336479168,null,64197.75,4121351105.0625,null,38.956214376848095,-75.782547536133379,null,22.577581213452582,-38.01078909907492,null,0,0]
[64565,64.564999999999998,558.48611272878725,1.5690057710199956,2.1529931654719521,1.0877606672040008,1,0,3908.8908789844231,1.5705404997478218,14.456334072898622,1.501567211016035,3.2196167264382569,1.2549763729301435,1,0,1,0,0.9328987015346536,0.18101499953023603,-4.8901402543880996,-113.80143689267574,66.198563107324262,null,64565,4168639225,null,38.911233482177515,-75.856727987680841,null,22.573801515922639,-37.944708904994911,null,0,0]
[64941,64.941000000000003,561.73849570851951,1.5690161380846364,2.1628325806173994,1.0901451842313654,1,0,3931.6546499839687,1.570541980953309,14.540120136375982,1.5019667702379507,3.2365624004136793,1.2566866963348569,1,0,1,0,0.93212932464150366,0.18223290158297248,-4.9396411721578808,-113.81037488980711,66.189625110192893,null,64941,4217333481,null,38.865397343870129,-75.931914110200978,null,22.570136736460245,-37.878460779606101,null,0,0]
[65317,65.316999999999993,564.9908787479302,1.5690263857927844,2.1726841820335125,1.0925080903626547,1,0,3954.4184209920404,1.5705434451055564,14.623908494548797,1.5023617509363441,3.2535174433627425,1.2583791986440154,1,0,1,0,0.93135584114303649,0.18345390797247707,-4.9887205354531163,-113.81996240628149,66.180037593718509,null,65317,4266310489,null,38.81977841798124,-76.006340512154225,null,22.566676299053899,-37.813621894127238,null,0,0]
[65693,65.692999999999998,568.24326184599454,1.5690365161938749,2.182547804700846,1.0948496520316164,1,0,3977.1821920084926,1.5705448924973817,14.707699108199085,1.5027522312392492,3.2704817095717313,1.2600541474035318,1,0,1,0,0.93057825821871654,0.18467804441285965,-5.0373831321435922,-113.83019663692581,66.169803363074195,null,65693,4315570249,null,38.774374912961193,-76.080018063162825,null,22.563417207383466,-37.75017857376298,null,0,0]
[66069,66.069000000000003,571.49564500171095,1.56904653129069,2.1924232863700532,1.097170131816565,1,0,3999.9459630331821,1.5705463234149364,14.791491938996463,1.5031382875099006,3.2874550562561846,1.261711805032377,1,0,1,0,0.92979658311838909,0.18590533677089791,-5.0856336635054138,-113.84107481052276,66.158925189477245,null,66069,4365112761,null,38.729185054716091,-76.152957439830502,null,22.560356534266749,-37.688117370692254,null,0,0]
[66453.75,66.453749999999999,574.82371532409888,1.5690566621329369,2.2025406928696047,1.0995230585705205,1,0,4023.2394760781303,1.570547770869692,14.87723699199578,1.5035288260064097,3.3048326483363808,1.2633904075787514,1,0,1,0,0.92899248894887365,0.18716448387054191,-5.1345853010747629,-113.85286987397889,66.147130126021111,null,66453.75,4416100889.0625,null,38.683162900615557,-76.226841006763252,null,22.557427050797937,-37.626028867215645,null,0,0]
[66838.5,66.838499999999996,578.15178570480407,1.5690666763409138,2.2126701816649867,1.1018544549813045,1,0,4046.5329891314104,1.5705492016601543,14.962984288069965,1.5039148884995879,3.3222194550324344,1.2650514448609851,1,0,1,0,0.92818412551429075,0.18842699077681868,-5.1831151620008695,-113.86533344112462,66.134666558875381,null,66838.5,4467385082.25,null,38.637360749705188,-76.299973659500125,null,22.554699340782204,-37.565359781624458,null,0,0]
[67223.25,67.223249999999993,581.47985614282527,1.5690765759172696,2.2228115875769143,1.1041645902218278,1,0,4069.8265021928796,1.5705506160724558,15.048733788876071,1.5042965513877802,3.3396153324241098,1.2666951821306118,1,0,1,0,0.9273715008154213,0.18969288571063359,-5.2312280143499281,-113.87846265805506,66.121537341944943,null,67223.25,4518965340.5625,null,38.59177675720219,-76.372366234925991,null,22.552170480936141,-37.506096423129058,null,0,0]
[67608,67.608000000000004,584.80792663718364,1.5690863628190663,2.2329647482342905,1.1064537294857117,1,0,4093.1200152623983,1.5705520143862159,15.134485456939155,1.5046738893430402,3.3570201395000052,1.2683218795165287,1,0,1,0,0.92655462293298574,0.19096219706671824,-5.2789285394867225,-113.89225471124014,66.107745288759858,null,67608,4570841664,null,38.546409096980682,-76.444029374956287,null,22.549837616020852,-37.448225336283848,null,0,0]
[68001.75,68.001750000000001,588.21384679108098,1.5690962639909389,2.2433674136002035,1.1087749500449995,1,0,4116.95840583881,1.570553429026385,15.222245217651132,1.5050556522035405,3.3748411778572183,1.2699692520424093,1,0,1,0,0.92571424173065164,0.19226476696016462,-5.3273227544966648,-113.90705276791516,66.092947232084839,null,68001.75,4624238003.0625,null,38.500202301014077,-76.516624520287706,null,22.547650196977518,-37.390428247627433,null,0,0]
[68395.5,68.395499999999998,591.61976700197886,1.569106051161884,2.2537820547550536,1.1110747303566062,1,0,4140.7967964233667,1.5705548273785079,15.31000717146272,1.5054330383400938,3.3926712787478963,1.271599313501351,1,0,1,0,0.92486942342204115,0.19357097571562096,-5.375294777321967,-113.92253920345765,66.077460796542354,null,68395.5,4677944420.25,null,38.454218265925903,-76.588477649117763,null,22.545662209240387,-37.334061554339883,null,0,0]
[68789.25,68.789249999999996,595.02568726889854,1.5691157262895195,2.2642085064443522,1.1133533421149651,1,0,4164.635187015926,1.5705562097222832,15.397771280874199,1.5058061224835373,3.4105103000356412,1.2732123268041771,1,0,1,0,0.92402017693314364,0.19488085434383184,-5.4228493561338702,-113.93871113781589,66.061288862184114,null,68789.25,4731960915.5625,null,38.408455094227108,-76.65959955939104,null,22.54387080212728,-37.279111578424882,null,0,0]
[69183,69.183000000000007,598.43160759088346,1.5691252912868974,2.2746466062578654,1.1156110529151668,1,0,4188.4735776163543,1.5705575763310415,15.485537509235057,1.5061749776753759,3.4283581024720324,1.2748085497458947,1,0,1,0,0.92316651128089988,0.19619443405365816,-5.469991152326255,-113.955565737923,66.044434262077004,null,69183,4786287489,null,38.362910908282622,-76.730000852364114,null,22.542273191879381,-37.225564885558903,null,0,0]
[69586,69.585999999999999,601.91754006536655,1.5691349688954244,2.2853418138021229,1.117900433799025,1,0,4212.8719812103236,1.5705589590291893,15.575367704223806,1.5065481934024532,3.4466341372528877,1.276425148399648,1,0,1,0,0.92228822466194826,0.19754273776365713,-5.5178177401128963,-113.97352029059506,66.026479709404938,null,69586,4842211396,null,38.316521619379039,-76.801320669230975,null,22.54083589299632,-37.172199621364072,null,0,0]
[69989,69.989000000000004,605.4034725955737,1.5691445350559943,2.2960488878016134,1.1201684745193923,1,0,4237.2703848122537,1.5705603258040541,15.665200043823631,1.5069171287573455,3.4649190844026871,1.2780246890836755,1,0,1,0,0.92140532821882226,0.19889498528667507,-5.5652215339159126,-113.99218410816528,66.007815891834724,null,69989,4898460121,null,38.270357808947693,-76.871907471348678,null,22.539595909624648,-37.120276636816634,null,0,0]
[70392,70.391999999999996,608.8894051805479,1.5691539916827464,2.3067676630186171,1.1224154490606915,1,0,4261.6687884220091,1.5705616769291226,15.755034491349992,1.5072818568581781,3.4832128035663619,1.2796074323116322,1,0,1,0,0.92051783192060221,0.20025121074050822,-5.6122072617548291,-114.01155430960317,65.98844569039683,null,70392,4955033664,null,38.224417527417707,-76.941772011359845,null,22.538550463315723,-37.069782298243325,null,0,0]
[70795,70.795000000000002,612.37533781935372,1.5691633406462353,2.31749797709349,1.1246416271922253,1,0,4286.0671920394561,1.5705630126716532,15.844871010949435,1.5076424491693645,3.5015151572553558,1.2811736334909369,1,0,1,0,0.91962574584002377,0.20161144846896434,-5.6587795648356281,-114.03162806766689,65.968371932333113,null,70795,5011932025,null,38.178698846263217,-77.010924843735083,null,22.537696841389408,-37.020703223931783,null,0,0]
[71207.25,71.207250000000002,615.94128261441699,1.5691727947025762,2.3284863553473945,1.1268976614880521,1,0,4311.0256086509817,1.57056436342939,15.936771642455616,1.5080071116560143,3.5202463958534658,1.2827589285817083,1,0,1,0,0.91870844543562835,0.20300709505260853,-5.7059978176197399,-114.05288764983547,65.947112350164531,null,71207.25,5070472452.5625,null,38.132158090368669,-77.0809393330848,null,22.537019344499846,-36.971948316750698,null,0,0]
[71619.5,71.619500000000002,619.50722746389874,1.5691821399219519,2.3394864735127952,1.1291324916069898,1,0,4335.9840252702825,1.5705656986368968,16.028674368911755,1.5083675924997566,3.5389863877322965,1.2843274383559546,1,0,1,0,0.91778636379283896,0.20440701364645897,-5.7527930045577342,-114.07487764583762,65.925122354162383,null,71619.5,5129352780.25,null,38.085845208438499,-77.150230794166461,null,22.536537039492025,-36.924646851671156,null,0,0]
[72031.75,72.031750000000002,623.07317236686481,1.5691913781730333,2.3504981667645355,1.1313463930817051,1,0,4360.9424418972249,1.5705670185611633,16.120579154488198,1.5087239631257945,3.5577349945709136,1.2858794204008837,1,0,1,0,0.9168595120373626,0.20581124176264359,-5.7991698246621413,-114.09759520676251,65.902404793237494,null,72031.75,5188573008.0625,null,38.039758203159401,-77.218809908574698,null,22.536247224666717,-36.878785298187822,null,0,0]
[72444,72.444000000000003,626.63911732240206,1.5692005112819569,2.3615212731799216,1.1335396371290996,1,0,4385.9008585316788,1.5705683234631025,16.212485964166923,1.5090762933439552,3.5764920808858722,1.2874151272222019,1,0,1,0,0.91592790141294622,0.2072198171707206,-5.8451328903511381,-114.12103754434452,65.878962455655483,null,72444,5248133136,null,37.993895099392454,-77.286687158961485,null,22.536147262744656,-36.83435038538304,null,0,0]
[72865.75,72.865750000000006,630.28723692711162,1.5692097479131566,2.372810043865123,1.1357623242880461,1,0,4411.4344236468514,1.5705696431558509,16.306512758030912,1.5094326327614216,3.5956900470029249,1.2889696392695531,1,0,1,0,0.9149699097227737,0.20866539054425851,-5.8917316960555421,-114.14576727189733,65.854232728102673,null,72865.75,5309417523.0625,null,37.947204777728956,-77.355413006685239,null,22.536238778703755,-36.790354265212081,null,0,0]
[73287.5,73.287499999999994,633.93535658497558,1.5692188782359282,2.3841104259888422,1.1379639517255788,1,0,4436.9679887696202,1.570570947659641,16.400541598717826,1.5097848862383321,3.6148966098294215,1.2905076362248604,1,0,1,0,0.91400696149760685,0.2101155946862463,-5.9379069554935526,-114.17124985688314,65.828750143116864,null,73287.5,5371057656.25,null,37.900744683788133,-77.423425846221818,null,22.536523613206569,-36.747824010661347,null,0,0]
[73709.25,73.709249999999997,637.58347629508148,1.5692279040750943,2.3954222552205269,1.1401447962952325,1,0,4462.5015538998514,1.5705722372351976,16.494572451223348,1.5101331235648585,3.6341116330625285,1.2920293727197856,1,0,1,0,0.91303906916792332,0.21157047089133396,-5.9836633388914429,-114.19748251290233,65.802517487097674,null,73709.25,5433053535.5625,null,37.854512773288739,-77.49073628314683,null,22.536999140308069,-36.706746229755545,null,0,0]
[74131,74.131,{"$f":"SQRT(1+(A525/pole1)^2)","v":641.23159605653746},{"$f":"ATAN(A525/pole1)","v":1.5692368272139499},{"$f":"SQRT(1+(A525/Zero1)^2)","v":2.4067453701541619},{"$f":"ATAN(A525/Zero1)","v":1.1423051304391312},{"$f":"IF(VIN_nom>Vout, 1, SQRT(1+(A525/z_RHP)^2))","v":1},{"$f":"IF(VIN_nom>Vout, 0, -ATAN(A525/z_RHP))","v":0},{"$f":"SQRT(1+(A525/Pole2)^2)","v":4488.0351190374204},{"$f":"ATAN(A525/Pole2)","v":1.5705735121373123},16.58860528133609,1.5104774129526917,{"$f":"SQRT(1+(A525/pole4)^2)","v":3.6533349832075839},{"$f":"ATAN(A525/pole4)","v":1.293535098331426},{"$f":"IF(VOUT_setting=1,1,SQRT(1+(A525*zterm1)^2))","v":1},{"$f":"IF(VOUT_setting=1,0,ATAN(((A525*zterm1))))","v":0},1,{"$f":"IF(VOUT_setting=1,0,ATAN(A525*$Q$4/(1+Afbr-$Q$5*(A525)^2)))","v":0},{"$f":"SQRT((1-(Z525/pterm2))^2+(A525/pterm1)^2)","v":0.91206624529885028},{"$f":"IF((ATAN((A525/pterm1)/(1-A525^2/pterm2))>0),ATAN((A525/pterm1)/(1-A525^2/pterm2)),PI()+ATAN((A525/pterm1)/(1-A525^2/pterm2)))","v":0.21303006074764877},{"$f":"20*LOG10(((E525*K525*G525*O525)/(C525*I525*S525*M525*Q525))*Adc)","v":-6.0290054301406499},{"$f":"((F525+L525+H525+P525)-(D525+J525+T525+N525+R525))*radconv","v":-114.22446252124146},{"$f":"IF(V525>0,V525,V525+180)","v":65.775537478758537},null,{"$f":"IF(U525<0,A525,1000000000)","v":74131},{"$f":"A525^2","v":5495405161},null,{"$f":"20*LOG10((K525/(I525*M525))*AEA)","v":37.808507025240679},{"$f":"(L525-(J525+N525))*radconv","v":-77.557354723531205},null,{"$f":"20*LOG10((E525*G525/(C525*S525))*Acs*Am)","v":22.537662797106929},{"$f":"(F525+H525-(D525+T525))*radconv","v":-36.667107797710223},null,{"$f":"SUM((U526<0)*(U525>0))*A525","v":0},0]
[74562.75,{"$f":"A526/1000","v":74.562749999999994},644.96621544968104,1.5692458573645527,2.4183484891551656,1.1444957219006686,1,0,4514.1741036285175,1.5705748023287989,16.684869712000889,1.5108258458360575,3.673022621910722,1.2950601963525608,1,0,1,0,0.91106526000662436,0.21452918489680547,-6.0749981692658208,-114.2528536209424,65.747146379057597,null,74562.75,5559603687.5625,null,37.761642631313826,-77.624846592429606,null,22.538534451908614,-36.628007028512776,null,0,0]
[74994.5,74.994500000000002,648.70083489481181,1.5692547835406452,2.4299631022035824,1.1466653827374855,1,0,4540.3130882270443,1.5705760776647919,16.781136145060092,1.5111702811303402,3.6927187126783005,1.2965690288256322,1,0,{"$f":"IF(VOUT_setting=1,1,SQRT((1+Afbr-$Q$5*(A527)^2)^2+(A527*$Q$4)^2))","v":1},0,0.91005913362837909,0.21603333803118424,-6.1205661900215889,-114.28202238600124,65.717977613998755,null,74994.5,5624175030.25,null,37.715011039472913,-77.691634707897322,null,22.539598022993754,-36.590387678103937,null,0,0]
[75426.25,75.426249999999996,652.43545439103718,1.569263607527714,2.4415890452682358,1.1488143913672826,1,0,4566.4520728328698,1.5705773384003963,16.87740454624954,1.5115107871596289,3.7124231209841985,1.29806184782316,1,0,1,0,0.90904788009216009,0.21754256574318481,-6.165714141997972,-114.31196612143772,65.68803387856228,null,75426.25,5689119189.0625,null,37.668610155713338,-77.75772961256034,null,22.540850954776946,-36.554236508877402,null,0,0]
[75858,75.858000000000004,656.17007393748474,1.5692723310705972,2.4532261572688445,1.1509430216957106,1,0,4592.5910574458721,1.5705785847849085,16.973674882081713,1.5118474307016383,3.7321357150870913,1.2995389003808973,1,0,1,0,0.90803151348022604,0.21905691396083321,-6.2104465885611546,-114.34268220737647,65.65731779262353,null,75858,5754436164,null,37.622437910480222,-77.823141648727159,null,22.542290753446885,-36.519540558649297,null,0,0]
[76299.75,76.299750000000003,659.99119311919139,1.569281154481917,2.4651441978318243,1.1531001436844344,1,0,4619.3354615129138,1.5705798454381859,17.072176956526189,1.5121879417882098,3.7523132212871593,1.3010340978390329,1,0,1,0,0.90698632900433152,0.22061168486929969,-6.2557897267994713,-114.37490646282306,65.625093537176937,null,76299.75,5821651850.0625,null,37.575430754484515,-77.889372534666975,null,22.54395477120427,-36.485533928156087,null,0,0]
[76741.5,76.741500000000002,663.81231235168855,1.5692898763123957,2.4770735987325585,1.1552364984585612,1,0,4646.0798655872113,1.5705810915779714,17.170680987740731,1.5125245460544465,3.7724990264701734,1.3025132976350318,1,0,1,0,0.90593582218347202,0.22217191459273256,-6.3007072865649851,-114.40793395315657,65.592066046843428,null,76741.5,5889257822.25,null,37.528658644817781,-77.954909834838119,null,22.545809321105491,-36.453024118318474,null,0,0]
[77183.25,77.183250000000001,667.633431634104,1.5692984983061891,2.4890141966268375,1.1573523652569984,1,0,4672.824269668642,1.5705823234534648,17.269186942240893,1.5128573102786262,3.7926929981273987,1.3039767487794618,1,0,1,0,0.90488000861347995,0.22373765343853808,-6.3452038885239004,-114.44176211692027,65.558237883079727,null,77183.25,5957254080.5625,null,37.482119442373119,-78.019764004659891,null,22.547851921591239,-36.421998112260404,null,0,0]
[77625,77.625,671.45455096558567,1.5693070221677503,2.5009658311380685,1.1594480187222422,1,0,4699.5686737570832,1.5705835413081921,17.36769478730125,1.5131862997274348,3.8128950065042435,1.3054246952785642,1,0,1,0,0.90381890406667953,0.22530895209733276,-6.3892840674939837,-114.47638847524971,65.523611524750294,null,77625,6025640625,null,37.435811033579952,-78.083945299107384,null,22.550080151414321,-36.392443176142315,null,0,0]
[78077,78.076999999999998,675.36433242541852,1.5693156439732077,2.5132060409229466,1.1615716574354027,1,0,4726.9336327862302,1.5705847731567149,17.468490250067546,1.5135190821397111,3.8335739515705232,1.3068904396665417,1,0,1,0,0.90272771861829393,0.22692251796293739,-6.4339606599900794,-114.51264196622427,65.487358033775735,null,78077,6096017929,null,37.388664833273864,-78.148929818459479,null,22.552549759224313,-36.363712147764808,null,0,0]
[78529,78.528999999999996,679.27411393487705,1.5693241665274948,2.5254574749715593,1.1636747012739459,1,0,4754.2985918224676,1.5705859908246036,{"$f":"SQRT(1+(A535/Zero2)^2)","v":17.569287625169618},{"$f":"ATAN(A535/Zero2)","v":1.5138480461528157},3.8542610443255079,1.3083404528728955,1,0,1,0,0.90163102779258353,0.2285420132630403,-6.4782106197082969,-114.54972613684625,65.450273863153754,null,78529,6166803841,null,37.341755864749906,-78.213230973163562,null,22.555208768030049,-36.336495163682677,null,0,0]
[78981,78.980999999999995,683.18389549310928,1.5693325915346192,2.5377199707206715,1.1657574300483684,1,0,4781.6635508656736,1.5705871945553211,17.670086879881229,1.5141732570412652,3.8749561542758588,1.3097749807990486,1,0,1,0,0.90052884907219721,0.23016749357130975,-6.5220385385799871,-114.58763860003289,65.412361399967111,null,78981,6237998361,null,37.295081944830166,-78.276859126328432,null,22.558054769078101,-36.310779473704493,null,0,0]
[79433,79.433000000000007,687.09367709928244,1.5693409206598026,2.5499933685886322,1.1678201188944137,1,0,4809.02850991573,1.5705883845867885,17.770887982218063,1.5144947786017777,3.8956591536511036,1.3111942643771559,1,0,1,0,0.89942120014210136,0.23179901489925034,-6.5654489231300248,-114.62637705904521,65.373622940954789,null,79433,6309601489,null,37.248640916941291,-78.339824440698877,null,22.561085412416936,-36.28655261834632,null,0,0]
[79895.5,79.895499999999998,691.09428332694119,1.5693493457199772,2.5625630001172381,1.1699102627455074,1,0,4837.0291593931652,1.5705895883250278,17.874032582979709,1.5148200152996636,3.916851121498095,1.3126309846236723,1,0,1,0,0.89828217679591893,0.23347474865330611,-6.6094401521831747,-114.66686811538924,65.333131884610765,null,79895.5,6383290920.25,null,37.201359907850801,-78.403576726227243,null,22.564375192454285,-36.263291389162013,null,0,{"$f":"IF(AH538>0,W538,0)","v":0}]
[80358,80.358000000000004,695.09488960309011,1.5693576737995842,2.5751437174004499,1.171979993008808,1,0,4865.0298088775289,1.570590778207051,17.977179052741068,1.5151415198531064,3.9380510873462056,1.3140522389990488,1,0,1,0,0.89713746426232932,0.23515692742779382,-6.6530035040939026,-114.7082194131316,65.291780586868398,null,80358,6457408164,null,37.154318252174498,-78.466655924834413,null,22.567853496219858,-36.241563488297125,null,0,0]
[80820.5,80.820499999999996,699.095495926897,1.5693659065635501,2.5877353587524055,1.1740295898123236,1,0,4893.0304583687011,1.570591954470737,18.080327359514769,1.5154593560707423,3.959258922718857,1.3154582702445048,1,0,1,0,0.89598708216079226,0.23684561268286997,-6.6961435423450855,-114.75042878463167,65.249571215368334,null,80820.5,6531953220.25,null,37.107513723775384,-78.529072302231768,null,22.571517986367784,-36.221356482399891,null,0,0]
[81283,81.283000000000001,703.09610229754821,1.5693740456389074,2.6003377654799302,1.1760593285372631,1,0,4921.0311078665663,1.5705931173485503,18.183477472038689,1.515773586316332,3.9804745018303578,1.3168493161697543,1,0,1,0,0.89483105034306132,0.23854086637924002,-6.7388647455320516,-114.79349416064944,65.206505839350555,null,81283,6606926089,null,37.060944124168962,-78.590835924051163,null,22.575366382787244,-36.202658236598296,null,0,0]
[81756.25,81.756249999999994,707.18969578285385,1.5693822785710343,2.6132440741587435,1.1781159715618597,1,0,4949.6825832784898,1.5705942936362085,18.289026965041987,1.5160914512060168,4.0021910871595141,1.3182574257105601,1,0,1,0,0.89364232133276567,0.24028238765843438,-6.7821499621835812,-114.83844454038461,65.161555459615386,null,81756.25,6684084414.0625,null,37.013533014303334,-78.653369737586857,null,22.579492276001343,-36.18507480279775,null,0,0]
[82229.5,82.229500000000002,711.28328931554188,1.5693904167384507,2.6261613276146694,1.1801523911819927,1,0,4978.3340586971817,1.5705954563842464,18.39457828472684,1.5164056681980593,4.0239155222607348,1.3196503337008443,1,0,1,0,0.89244771972902304,0.24203091915600236,-6.8250058713794992,-114.8842871108412,65.1157128891588,null,82229.5,6761690670.25,null,36.966363310971708,-78.715240799810772,null,22.583806070137044,-36.169046311030449,null,0,0]
[82702.75,82.702749999999995,715.376882894799,1.569398461767969,2.6390893651372096,1.1821688675860975,1,0,5006.9855341225284,1.5705966058250969,18.500131399827211,1.5167162996694792,4.0456476806782273,1.3210282796678285,1,0,1,0,0.89124726757380401,0.24378652891687375,-6.8674370086071406,-114.93101997357758,65.068980026422423,null,82702.75,6839744857.5625,null,36.919432746267859,-78.776459273999222,null,22.588305497613259,-36.154560699578326,null,0,0]
[83176,83.176000000000002,719.47047651983019,1.5694064152493765,2.6520280290167038,1.1841656761502986,1,0,5035.6370095544144,1.5705977421859036,18.605686279786038,1.5170234065845769,4.067387438614344,1.3223914982477545,1,0,1,0,0.89004098717621094,0.24554928555851896,-6.9094478250739879,-114.97864133696712,65.021358663032885,null,83176,6918246976,null,36.87273908096379,-78.837035123835847,null,22.592988346450479,-36.141606213131247,null,0,0]
[83660.5,83.660499999999999,723.66138224277756,1.5694144645831007,2.6652851147874457,1.1861898603016052,1,0,5064.9695818732744,1.5705988922416714,18.713752185375405,1.5173342249651887,4.0896517356321773,1.3237721062674839,1,0,1,0,0.88880001720063473,0.2473614220783483,-6.9520264480805221,-115.02831342016474,64.971686579835264,null,83660.5,6999079260.25,null,36.825178528845079,-78.898395448535936,null,22.597970275562655,-36.129917971628771,null,0,0]
[84145,84.144999999999996,727.85228801207245,1.5694224212221959,2.6785530129632193,1.1881939994793371,1,0,5094.3021541987555,1.5706000290535862,18.821819878103884,1.5176414741746156,4.111923743423386,1.3251377608926806,1,0,1,0,0.88755298678615746,0.24918119671771566,-6.9941737090973479,-115.07891328998383,64.921086710016169,null,84145,7080381025,null,36.777861613697567,-78.959102746467536,null,22.603139929693349,-36.11981054351633,null,0,0]
[84629.5,84.629499999999993,732.0431938269187,1.5694302867586751,2.6918315636626793,1.1901783741037741,1,0,5123.6347265307459,1.5706011528491095,18.929889327364002,1.5179452152828112,4.1342033373682634,1.3264886987433939,1,0,1,0,0.88629992076284703,0.25100868501032975,-7.0358941232360426,-115.13043936981649,64.869560630183514,null,84629.5,7162152270.25,null,36.730786023556412,-79.019167088942794,null,22.608495105695798,-36.111272280873685,null,0,0]
[85114,85.114000000000004,736.23409968653834,1.5694380627483033,2.7051206100165848,1.192143259714149,1,0,5152.9672988691318,1.5706022638505235,19.037960503242772,1.5182455079756698,4.1564903954770482,1.327825151582126,1,0,1,0,0.88504084426908836,0.25284396314642976,-7.0771921218680589,-115.18289019894463,64.817109801055366,null,85114,7244392996,null,36.683949476197569,-79.078598347960963,null,22.614033654422631,-36.104291850983643,null,0,0]
[85609.5,85.609499999999997,740.52015515711594,1.5694459242474885,2.7187220638678267,1.1941328801185458,1,0,5182.9658326087019,1.570603387069168,19.148487062868288,1.5185491125084429,4.1792910507446219,1.3291772015262147,1,0,1,0,0.88374699174580273,0.25472904634048932,-7.1189953652643387,-115.23748694158259,64.762513058417412,null,85609.5,7328986490.25,null,36.636294457856074,-79.138734200835728,null,22.619885429367844,-36.098752740746875,null,0,0]
[86105,86.105000000000004,744.80621067293316,1.5694536952672409,2.7323341728499084,1.1961026842315057,1,0,5212.9643663547358,1.5706044973604605,19.259015367260353,1.5188492322700868,4.2020992630028378,1.3305145765423934,1,0,1,0,0.88244690691908889,0.25662244043172383,-7.160365910331393,-115.29304817989075,64.706951820109254,null,86105,7414071025,null,36.588884724982158,-79.198228164271413,null,22.625924617174704,-36.094820015619348,null,0,0]
[86600.5,86.600499999999997,749.09226623321365,1.5694613773606387,2.7459567785057142,1.198052951576194,1,0,5242.9629001071216,1.5706055949462996,19.36954538655052,1.5191459268623708,4.2249149098624086,1.3318375095528945,1,0,1,0,0.88114061770513952,0.25852422909600709,-7.2013082388341711,-115.34957272487554,64.650427275124457,null,86600.5,7499646600.25,null,36.541717930058077,-79.257090181512922,null,22.632149083596012,-36.092482543362621,null,0,0]
[87096,87.096000000000004,753.37832183719854,1.5694689720454176,2.7595897253860029,1.1999839567530384,1,0,5272.961433865753,1.5706066800435337,19.48007709154777,1.5194392545367654,4.2477378715241079,1.3331462286786764,1,0,1,0,0.8798281523750805,0.26043449675920377,-7.2418267498013558,-115.40705951252619,64.592940487473811,null,87096,7585713216,null,36.494791756220607,-79.315329997789505,null,22.638556746466293,-36.091729514736713,null,0,0]
[87603.25,87.603250000000003,757.76601452573448,1.569476657832334,2.773556508835076,1.2019410815556164,1,0,5303.6713354847543,1.5706077781570438,19.593231597732576,1.519736109826253,4.2711094983008095,1.3344714917926117,1,0,1,0,0.87847819635832636,0.26239893532550951,-7.2828715894019522,-115.46690526876976,64.533094731230236,null,87603.25,7674329410.5625,null,36.446999662753946,-79.374316343085525,null,22.645304000332359,-36.09258892568419,null,0,0]
[88110.5,88.110500000000002,762.15370725851722,1.5694842551256278,2.7875338094595423,1.2038785868190085,1,0,5334.3812371100785,1.5706088636269286,19.706387810704349,1.5200295559909107,4.2944885448655334,1.3357823278151797,1,0,1,0,0.87712182895663093,0.26437244128694554,-7.3234813457467851,-115.52775758755902,64.472242412440977,null,88110.5,7763460210.25,null,36.399454920348532,-79.432670680973104,null,22.652238986392934,-36.095086906585948,null,0,0]
[88617.75,88.617750000000001,766.5414000347871,1.5694917654449143,2.8015214698430975,1.2057967517608954,1,0,5365.0911387416154,1.5706099366703059,19.819545701229284,1.5203196513720263,4.3178748906954008,1.3370789666233645,1,0,1,0,0.87575908168708838,0.26635510771551041,-7.3636604823747014,-115.58961573131104,64.410384268688958,null,88617.75,7853105615.0625,null,36.352155140213036,-79.490402852163498,null,22.659359629900521,-36.099212879147544,null,0,0]
[89125,89.125,770.92909285380142,1.5694991902752129,2.8155193355821271,1.2076958506216977,1,0,5395.8010403792596,1.5706109974993498,19.932705240736993,1.5206064529883399,4.3412684178273278,1.3383616333325374,1,0,1,0,0.87438998647767563,0.26834702854362036,-7.4034133808963194,-115.65247909760767,64.347520902392333,null,89125,7943265625,null,36.305097965220327,-79.54752250004104,null,22.66666390637161,-36.104956597566641,null,0,0]
[89644,89.644000000000005,775.41842276040745,1.5695067001264591,2.8298518543010043,1.2096194876883966,1,0,5427.2223098777094,1.5706120704758144,20.048487699024186,1.5208965471402802,4.3652111477654039,1.3396597804910479,1,0,1,0,0.87298264091052535,0.27039476778742338,-7.4436504440594842,-115.71783857126489,64.282161428735108,null,89644,8036046736,null,36.257199426203883,-79.605341159931953,null,22.674325382224897,-36.112497411332896,null,0,0]
[90163,90.162999999999997,779.90775271024199,1.5695141235208139,2.8441947389867672,1.2115237304656858,1,0,5458.6435793823366,1.5706131310996565,20.164271825108738,1.5211833098496399,4.3891611536336228,1.3409437627895593,1,0,1,0,0.87156871887230714,0.27245239688229717,-7.4834503201120297,-115.78424953211551,64.21575046788449,null,90163,8129366569,null,36.209549969034519,-79.662538402973297,null,22.682174963341701,-36.121711129142255,null,0,0]
[90682,90.682000000000002,784.39708270256278,1.5695214619427293,2.8585478336043888,1.2134088571814066,1,0,5490.0648488930328,1.5706141795829687,20.280057590424988,1.5214667981298735,4.413118316972505,1.3422138066467986,1,0,1,0,0.87014825593385181,0.27452001929970432,-7.5228174495667286,-115.85171177076882,64.148288229231184,null,90682,8223225124,null,36.162147168708366,-79.719123947524139,null,22.690210634213162,-36.132587823244641,null,0,0]
[91201,91.200999999999993,788.88641273664439,1.5695287168428671,2.8729109851270791,1.2152751410488032,1,0,5521.4861184096962,1.5706152161330165,20.395844967055524,1.5217470677019049,4.4370825218459427,1.3434701337721031,1,0,1,0,0.86872128814141436,0.27659773949633937,-7.561756192147592,-115.9202252236143,64.079774776385705,null,91201,8317622401,null,36.114988632803268,-79.775107315895525,null,22.698430427537389,-36.145117907718735,null,0,0]
[91732,91.731999999999999,793.4795423515676,1.5695360545240442,2.8876164845131846,1.2171653543858905,1,0,5553.6338912738547,1.5706162645104571,20.514311147637322,1.5220305430905292,4.4616079816777088,1.3447415392124318,1,0,1,0,0.86725463277864001,0.27873406014215235,-7.6011563581133768,-115.99141084197524,64.008589158024762,null,91732,8414759824,null,36.066990065951202,-79.831771605979753,null,22.707028828423677,-36.159639235995506,null,0,0]
[92263,92.263000000000005,798.07267200872116,1.5695433077444394,2.902332196511558,1.2190364064321204,1,0,5585.7816641440468,1.5706173008204729,20.63277895778397,1.522310763224153,4.4861405747103413,1.3459990412301361,1,0,1,0,0.86578124617151253,0.28088117533342011,-7.6401170813850561,-116.06369717760674,63.936302822393259,null,92263,8512461169,null,36.019242225216693,-79.887825109586387,null,22.715815945886501,-36.175872068020354,null,0,0]
[92794,92.793999999999997,802.6658017073803,1.5695504779539933,2.9170579665631968,1.220888574174652,1,0,5617.9294370201696,1.5706183252702262,20.751248369586161,1.5225877838113924,4.5106801845561328,1.3472428627332382,1,0,1,0,0.86430116851383998,0.28303920021482254,-7.6786427822871817,-116.13708463238304,63.862915367616964,null,92794,8610726436,null,35.971742650906215,-79.943277418405273,null,22.724789819294855,-36.193807213977749,null,0,0]
[93325,93.325000000000003,807.2589314468363,1.5695575665696462,2.9317936431097782,1.2227221295558985,1,0,5650.0772099021215,1.5706193380621642,20.869719355767938,1.522861659297889,4.5352266973134867,1.3484732219752786,1,0,1,0,0.86281444055036582,0.28520825105915604,-7.7167378016862642,-116.21157376537738,63.788426234622619,null,93325,8709555625,null,35.924488916794168,-79.998137929537023,null,22.733948534007816,-36.21343583584035,null,0,0]
[93868.5,93.868499999999997,811.96018575087544,1.5695647390023539,2.9468863086359849,1.2245798516410833,1,0,5682.9817571045523,1.570620362829517,20.990980809558931,1.5231387804566827,4.560358079231893,1.3497188261555693,1,0,1,0,0.86128587041961402,0.28743990332827241,-7.7552880374457729,-116.28895804146674,63.711041958533258,null,93868.5,8811295292.25,null,35.876374898036126,-80.05368663410664,null,22.743512317006356,-36.235271407360131,null,0,0]
[94412,94.412000000000006,816.66144009620382,1.5695718288563367,2.9619890405911735,1.2264186355331994,1,0,5715.8863043128831,1.5706213757983474,21.112243856858242,1.5234127182175901,4.5854964591186231,1.3509507750516703,1,0,1,0,0.85975042137305002,0.28968335694784514,-7.7933960326802527,-116.36749816135897,63.632501838641033,null,94412,8913625744,null,35.828513391745098,-80.108634667781303,null,22.753265828062908,-36.258863493577643,null,0,0]
[94955.5,94.955500000000001,821.36269448211283,1.5695788375495672,2.9771016857754304,1.2282387571099798,1,0,5748.7908515270119,1.5706223771712506,21.23350847036463,1.5236835270803182,4.6106417225096212,1.3521692883105252,1,0,1,0,0.85820813894672721,0.29193874035069473,-7.8310661973314346,-116.44719523217407,63.552804767825933,null,94955.5,9016546980.25,null,35.780901901692147,-80.162991504408538,null,22.763207153464677,-36.284203727765529,null,0,0]
[95499,95.498999999999995,826.06394890790932,1.5695857664677393,2.9922240939843188,1.2300404871722279,1,0,5781.6953987468396,1.5706233671462091,21.354774623396636,1.5239512603084964,4.6357937573933068,1.3533745809737538,1,0,1,0,0.85665906931728231,0.294206183263508,-7.8683028632995402,-116.5280505308947,63.471949469105297,null,95499,9120059001,null,35.733537966032223,-80.216766424528004,null,22.773334423156491,-36.311284106366713,null,0,0]
[96611.5,96.611500000000007,835.68703191575275,1.5695997062893017,3.0232082539860685,1.2336722419779473,1,0,5849.0483128066317,1.5706253588097832,21.60300120156716,1.5244899149810849,4.6872985710430264,1.3558013702280596,1,0,1,0,0.85346728314065645,0.29888561225367943,-7.9431892715550187,-116.69717278970667,63.30282721029333,null,96611.5,9333781932.25,null,35.637349663141286,-80.325062681253854,null,22.794636317791948,-36.372110108452809,null,0,0]
[97724,97.724000000000004,845.31011508228835,1.5696133287266076,3.0542314796842605,1.237230264133524,1,0,5916.4012268890974,1.5706273051267554,21.851233905413785,1.5250163314369141,4.7388303894768962,1.3581753935789744,1,0,1,0,0.85024766665872209,0.30361726073544915,-8.0163126767361668,-116.87116872632187,63.128831273678131,null,97724,9549980176,null,35.542168052988302,-80.43103427441072,null,22.81669452276379,-36.44013445191117,null,0,0]
[98862,98.861999999999995,855.15377244854926,1.5696269461991177,3.0860049903536293,1.2407957796844351,1,0,5985.2979605979117,1.5706292507343169,22.105162560278696,1.5255425813971901,4.791570418668333,1.3605509862254608,1,0,1,0,0.8469258980084744,0.30851260822003462,-8.0893238706854582,-117.05421371338991,62.945786286610087,null,98862,9773695044,null,35.445825652391619,-80.537105280427014,null,22.840025729411177,-36.517108432962843,null,0,0]
[100000,100,864.99742996977716,1.5696402537383722,3.1178169331878136,1.2442885790176574,1,0,6054.1946943288676,1.5706311520598515,22.359097197876523,1.5260568781440178,4.8443368999275842,1.3628748399132904,1,0,1,0,0.84357591571374224,0.31346508866052047,-8.1605617299671582,-117.24239865975771,62.757601340242289,null,100000,10000000000,null,35.350495244028146,-80.640894193982263,null,22.864118278492953,-36.601504465775456,null,0,0]
[101165,101.16500000000001,875.0746366382258,1.5696535668795919,3.1504222361230561,1.2477911356302109,1,0,6124.7260606045938,1.5706330541857141,22.619062633694945,1.526571415073346,4.8983818184009493,1.3652019540585278,1,0,1,0,0.84011772696076736,0.31859561089251121,-8.2316886388265633,-117.44039901427128,62.559600985728721,null,101165,10234357225,null,35.253930398105993,-80.744856202398225,null,22.8895562155557,-36.695542811873011,null,0,0]
[102330,102.33,885.15184345824116,1.5696665768880156,3.1830653960657074,1.2512218943647144,1,0,6195.2574269019742,1.5706349130011776,22.879033921783059,1.527074258909815,4.9524526848183008,1.367478265454549,1,0,1,0,0.83663100172925342,0.3237887972532405,-8.3010286229943056,-117.64384280630452,62.356157193695481,null,102330,10471428900,null,35.15838420431691,-80.84657491106114,null,22.915762425177036,-36.797267895243351,null,0,0]
[103520,103.52,895.44529950280673,1.5696795637626766,3.2164469388015666,1.2546543393675267,1,0,6267.3023418539424,1.5706367685113325,23.144589829816042,1.5275762306658003,5.0077097854312598,1.3697526620178055,1,0,1,0,0.83304056015836814,0.32915963542686111,-8.3700475516283923,-117.8573074212415,62.142692578758499,null,103520,10716390400,null,35.061818210509351,-80.948233685038957,null,22.943309490350515,-36.909073736202551,null,0,0]
[104710,104.71,905.73875569496431,1.5696922554532713,3.249865597931783,1.2580162310243408,1,0,6339.347256826999,1.5706385818467758,23.410151437411979,1.5280668139429754,5.0629922248129109,1.3719774019436197,1,0,1,0,0.82942151369898676,0.33459896186593502,-8.4372735415398985,-118.07652660048443,61.923473399515572,null,104710,10964184100,null,34.966272809571578,-81.047697438601929,null,22.971628901376778,-37.02882916188252,null,0,0]
[105930,105.93,916.29171093073569,1.5697049710764281,3.2841640898621778,1.2613918089064908,1,0,6413.2084301818677,1.5706403986015534,23.682413591635893,1.5285583429321941,5.1196937848590114,1.3742083388397675,1,0,1,0,0.8256821829444595,0.34024821193634208,-8.5043690673231822,-118.30729179697217,61.692708203027834,null,105930,11221164900,null,34.869356811680412,-81.147462263015797,null,23.001449373484665,-37.159829533956376,null,0,0]
[107150,107.15,926.84466631128601,1.569717397142105,3.3184992294971924,1.2646975723919789,1,0,6487.069603557421,1.5706421739855276,23.954681337485628,1.5290386986459914,5.1764202677236311,1.3763903903674519,1,0,1,0,0.82191412525848095,0.34597293828796782,-8.5696523570105576,-118.54420183155023,61.455798168449775,null,107150,11481122500,null,34.77347062477817,-81.245063973286875,null,23.032052270699523,-37.29913785826335,null,0,0]
[108400,108.4,937.65712073968768,1.5697298386645901,3.353715509362921,1.2680143823961663,1,0,6562.747035315394,1.570643951577859,24.233649794326183,1.529519671180648,5.2345666664586474,1.3785770361484755,1,0,1,0,0.81802435807400142,0.35191863080678237,-8.6346979133416752,-118.79336827827143,61.20663172172857,null,108400,11750560000,null,34.676272956367342,-81.342893700182145,null,23.064204382779238,-37.45047457808927,null,0,0]
[109650,109.65,948.46957530992154,1.5697419965229509,3.3889679172010991,1.2712622238870381,1,0,6638.4244670936314,1.5706456886414102,24.512623729645995,1.5299896960913577,5.2927375438519517,1.3807156264438247,1,0,1,0,0.8141059685948252,0.35794748643608321,-8.6979142922523689,-119.04910652622553,60.950893473774471,null,109650,12023122500,null,34.580112839102,-81.438594981083185,null,23.097148121133891,-37.610511545142323,null,0,0]
[110925,110.925,959.49827911270302,1.5697541152528822,3.4249614353026008,1.2745061094810237,1,0,6715.615447527598,1.5706474201144129,24.79718259584514,1.5304582262324229,5.3520962289578637,1.3828490868325272,1,0,1,0,0.81008057035742698,0.36418472760769738,-8.7605474776916008,-119.31680020225829,60.683199797741707,null,110925,12304355625,null,34.483076546073669,-81.534087663660983,null,23.131551228722987,-37.782712538597266,null,0,0]
[112200,112.2,970.52698305319734,1.5697659585574291,3.4609902437292326,1.2776824904115733,1,0,6792.8064279812425,1.5706491122357575,25.081746782017763,1.530916125083523,5.411478740455328,1.3849357337671979,1,0,1,0,0.8060271363114182,0.37051286634491798,-8.8213514000476092,-119.59147853679788,60.408521463202121,null,112200,12588840000,null,34.387076071929634,-81.627505006257849,null,23.16674778051101,-37.963973530540073,null,0,0]
[113510,113.51,981.85843586787053,1.5697778498573343,3.4980436888714901,1.2808778825043021,1,0,6872.1163765455667,1.5706508112144355,25.374127886991339,1.5313758964071893,5.4725153613193251,1.387032485495314,1,0,1,0,0.80183420316001297,0.3771117969438712,-8.8819569095001185,-119.88105766287151,60.118942337128487,null,113510,12884520100,null,34.289496992853394,-81.721394418993441,null,23.203721350134742,-38.1596632438781,null,0,0]
[114820,114.82,993.18988881821349,1.5697894698179795,3.5351321019537068,1.284006257840139,1,0,6951.426325129275,1.5706524714252679,25.666514233588259,1.5318251926300643,5.5335755105558997,1.3890829729272154,1,0,1,0,0.79761368842256164,0.38381163643556476,-8.9407073103965828,-120.17818988227143,59.821810117728575,null,114820,13183632400,null,34.192966926483628,-81.813231040642819,null,23.241501015608044,-38.364958841628606,null,0,0]
[116155,116.155,1004.7375910054876,1.569801041882646,3.5729631570427745,1.2871274859634851,1,0,7032.2498223693401,1.5706541247928874,25.964485681582001,1.5322726525469714,5.5958243385589741,1.3911265451745622,1,0,1,0,0.79328536603556132,0.39074584225677644,-8.9987089255453832,-120.48886567370684,59.51113432629316,null,116155,13491984025,null,34.095651613708533,-81.904776271897006,null,23.280814713234342,-38.584089401809841,null,0,0]
[117490,117.49,1016.2852933242513,1.5698123509684856,3.6108282906002831,1.2901832815054119,1,0,7113.0733196281917,1.5706557405871691,26.262462210228165,1.5327099586996515,5.6580960215143028,1.393125143458569,1,0,1,0,0.7889306930023372,0.39779036008440349,-9.0548613216999723,-120.80759861748514,59.192401382514859,null,117490,13803900100,null,33.999381235564258,-81.994324299904221,null,23.320932695224023,-38.813274317580884,null,0,0]
[118860,118.86,1028.1357445250042,1.569823692429255,3.6497204609678171,1.2932532402294381,1,0,7196.0157849988409,1.5706573610070085,26.568255960521451,1.5331485313717637,5.7220232744454993,1.3951309048464118,1,0,1,0,0.78443573637627473,0.40513727745166994,-9.1106031613715803,-121.14318625744359,58.856813742556412,null,118860,14127699600,null,33.901650787207672,-82.084210442336669,null,23.362921303909001,-39.058975815106905,null,0,0]
[120230,120.23,{"$f":"SQRT(1+(A589/pole1)^2)","v":1039.9861958549911},{"$f":"ATAN(A589/pole1)","v":1.5698347754223088},{"$f":"SQRT(1+(A589/Zero1)^2)","v":3.6886463031203007},{"$f":"ATAN(A589/Zero1)","v":1.2962584329678639},{"$f":"IF(VIN_nom>Vout, 1, SQRT(1+(A589/z_RHP)^2))","v":1},{"$f":"IF(VIN_nom>Vout, 0, -ATAN(A589/z_RHP))","v":0},{"$f":"SQRT(1+(A589/Pole2)^2)","v":7278.9582503879528},{"$f":"ATAN(A589/Pole2)","v":1.5706589444980421},26.874054704813808,1.5335771231245783,{"$f":"SQRT(1+(A589/pole4)^2)","v":5.7859730387899306},{"$f":"ATAN(A589/pole4)","v":1.3970923364189294},{"$f":"IF(VOUT_setting=1,1,SQRT(1+(A589*zterm1)^2))","v":1},{"$f":"IF(VOUT_setting=1,0,ATAN(((A589*zterm1))))","v":0},1,{"$f":"IF(VOUT_setting=1,0,ATAN(A589*$Q$4/(1+Afbr-$Q$5*(A589)^2)))","v":0},{"$f":"SQRT((1-(Z589/pterm2))^2+(A589/pterm1)^2)","v":0.77991568105871856},{"$f":"IF((ATAN((A589/pterm1)/(1-A589^2/pterm2))>0),ATAN((A589/pterm1)/(1-A589^2/pterm2)),PI()+ATAN((A589/pterm1)/(1-A589^2/pterm2)))","v":0.41260659276478884},{"$f":"20*LOG10(((E589*K589*G589*O589)/(C589*I589*S589*M589*Q589))*Adc)","v":-9.1644780331988507},{"$f":"((F589+L589+H589+P589)-(D589+J589+T589+N589+R589))*radconv","v":-121.48751262901409},{"$f":"IF(V589>0,V589,V589+180)","v":58.512487370985909},null,{"$f":"IF(U589<0,A589,1000000000)","v":120230},{"$f":"A589^2","v":14455252900},null,{"$f":"20*LOG10((K589/(I589*M589))*AEA)","v":33.804975657527905},{"$f":"(L589-(J589+N589))*radconv","v":-82.172126422128827},null,{"$f":"20*LOG10((E589*G589/(C589*S589))*Acs*Am)","v":23.405721561761503},{"$f":"(F589+H589-(D589+T589))*radconv","v":-39.315386206885236},null,{"$f":"SUM((U590<0)*(U589>0))*A589","v":0},0]
[126030,{"$f":"A590/1000","v":126.03},1090.1559911414474,1.5698790267494298,3.8537913644182771,1.3083077107161136,1,0,7630.10153470774,1.5706652669396228,28.168728707293774,1.5352885062067747,6.0569422390909411,1.404937119729843,1,0,1,0,0.76053524753739232,0.44566109114935842,-9.3727909258939697,-123.04533873166717,56.954661268332828,null,126030,15883560900,null,33.406894356921718,-82.523906618919654,null,23.595489969672563,-40.521432112747462,null,0,0]
[131830,131.83000000000001,1140.3257883747865,1.5699193843119974,4.0194499170394158,1.3193652820234016,1,0,7981.244819305688,1.570671033056231,29.463477960613456,1.5368494827778563,6.3282522533922414,1.4121096575086409,1,0,{"$f":"IF(VOUT_setting=1,1,SQRT((1+Afbr-$Q$5*(A591)^2)^2+(A591*$Q$4)^2))","v":1},0,0.74085033481262919,0.48123298693793359,-9.5513292175734872,-124.77406752986836,55.225932470131639,null,131830,17379148900,null,33.025816317694535,-82.845755767114738,null,23.798029717220235,-41.928311762753601,null,0,0]
[144540,144.54,1250.2668496989149,1.569996497456974,4.3839815636998072,1.3406673016992252,1,0,8750.7329489492349,1.570682050652771,32.300983611569755,1.5398325697069364,6.9237913479838475,1.4258598830993583,1,0,1,0,0.69735855647535239,0.56942737767010165,-9.8533207346685323,-129.22867920038829,50.771320799611715,null,144540,20891811600,null,32.243771306217475,-83.463298632346479,null,24.278083211602247,-45.765380568041834,null,0,0]
[158490,158.49,1370.9338753438444,1.5700668969466283,4.7860007560125286,1.3603026386595869,1,0,9595.2930922579853,1.5706921090297701,35.415594347555917,1.5425564243976493,7.5786901510403482,1.4384614897801213,1,0,1,0,0.65099923609482568,0.68579008190762958,-10.079706737894668,-135.34131251206111,44.658687487938892,null,158490,25119080100,null,31.458067159649509,-84.029828435651439,null,24.837401354944078,-51.311484076409691,null,0,0]
[173780,173.78,1503.1918619150617,1.5701310756722051,5.2284143657486046,1.3783480181503884,1,0,10520.97944380847,1.5707012786098065,38.829637415807419,1.5450399551099929,8.2976504239202526,1.449986628349401,1,0,1,0,0.60590938393574467,0.84211484747426235,-10.276066345922047,-143.78638625607709,36.213613743922906,null,173780,30199488400,null,30.670264978196911,-84.548399784694737,null,25.428843928369297,-59.237986471382328,null,0,0]
[190550,190.55,1648.2518047104188,1.5701896233418864,5.7152911321001154,1.3949218265627215,1,0,11536.267876015001,1.5707096436481458,42.574372863892329,1.5473058581005474,9.0872596796228926,1.4605288313750491,1,0,1,0,0.57065395462313995,1.0523452526022141,-10.572225911311286,-155.36012281373419,24.639877186265807,null,190550,36309302500,null,29.880224174228456,-85.023076128624297,null,25.922725166948513,-70.337046685109911,null,0,0]
[208930,208.93,1807.2381994092689,1.5702429962757896,6.2504189452672039,1.4101165380772971,1,0,12649.028841840242,1.5707172693420641,46.678829636316486,1.5493716999495353,9.9536422666039162,1.4701608119293466,1,0,1,0,0.56065737409310645,1.3225733434588482,-11.232526239155849,-170.40946188114455,9.5905381188554486,null,208930,43651744900,null,29.088839352131085,-85.457020864222343,null,26.053809661201317,-84.95244101692218,null,0,0]
[229090,229.09,1981.6215404123623,1.5702916895460328,6.8387578743699295,1.4240447684059132,1,0,13869.554472088786,1.5707242264254955,51.180970607860125,1.5512565715962485,10.904814111481036,1.4789646933566392,1,0,1,0,0.59704235340359579,1.6322812645932354,-12.59048275382292,-187.75600843905187,-7.7560084390518682,null,229090,52482228100,null,28.29577920711294,-85.853849535031046,null,25.488913291552397,-101.90215890402081,null,0,0]
[251190,251.19,2172.7858224903002,1.5703360881349457,7.4849857504855555,1.4367948675154096,1,0,15207.53147811192,1.5707305699031775,56.116527104810757,1.5529753213811837,11.948326403176134,1.4870045804387932,1,0,1,0,0.69829861068541765,1.9313416513323165,-14.760907722359686,-204.52546136567864,-24.525461365678638,null,251190,63096416100,null,27.501724075124841,-86.216387478797316,null,24.112543455003724,-118.30907388688138,null,0,0]
[275420,275.42,2382.3745394690268,1.570376577501577,8.194664180249152,1.4484607837069483,1,0,16674.462829644413,1.570736354847925,{"$f":"SQRT(1+(A599/Zero2)^2)","v":61.527931456100454},{"$f":"ATAN(A599/Zero2)","v":1.5545428300975517},13.093151755343857,1.4943460732416947,1,0,1,0,0.87273505404911511,2.1786061546879294,-17.505765767070596,-218.35774232710679,-38.357742327106791,null,275420,75856176400,null,26.706749620828532,-86.547543851228511,null,22.162659864589127,-131.81019847587828,null,0,0]
[302000,302,2612.2906842411194,1.570413520995199,8.9742422557166481,1.4591344101440471,1,0,18283.667754806138,1.570741633173578,67.464317431723117,1.5559731334360107,14.349686374273128,1.5010518634497265,1,0,1,0,1.1223272379383669,2.3662696599984061,-20.497561320040305,-228.80319767956968,-48.803197679569678,null,302000,91204000000,null,25.910592414028176,-86.850109409860281,null,19.967021518419777,-141.95308826970944,null,0,0]
[331130,331.13,2864.2642503712582,1.5704471969895075,9.829589521474281,1.4688863704039086,1,0,20047.254642800697,1.5707464446530157,73.97035309892641,1.5572769853174921,15.727385876102993,1.5071700481550909,1,0,1,0,1.4495379779240181,2.5052984071511255,-23.525286139983471,-236.48825808811361,-56.488258088113611,null,331130,109647076900,null,25.114149250272042,-87.126226039620548,null,17.735739862232737,-149.36203204849309,null,0,0]
[363080,363.08,3140.6307292027,1.5704779194101637,10.768636583739831,1.4778000749797691,1,0,21981.569819057364,1.5707508341386134,81.106341541008305,1.5584665222593239,17.239020408366127,1.5127558089858966,1,0,1,0,1.8613918096691533,2.6094391242160606,-26.502273611234305,-242.19826084457361,-62.19826084457361,null,363080,131827086400,null,24.316894878758404,-87.378362613540446,null,15.556006762495546,-154.81989823103316,null,0,{"$f":"IF(AH602>0,W602,0)","v":0}]
[398110,398.11,3443.6391124264414,1.5705059363151144,11.799027574737186,1.4859417867632296,1,0,24102.354189548943,1.570754837071842,88.930353442321206,1.5595513352191901,18.896891927811723,1.5178528414104302,1,0,1,0,2.3690259590517977,2.6891872155992411,-29.400886229352146,-246.5327220301962,-66.532722030196197,null,398110,158491572100,null,23.519227897079102,-87.608475206788739,null,13.455061126057007,-158.9242468234074,null,0,0]
[436520,436.52,3775.8843904780479,1.5705314881747812,12.929588416817817,1.4933770289285679,1,0,26427.770338093484,1.5707584878100922,97.509394322290802,1.5605407248938989,20.715198945178003,1.5225038241385658,1,0,1,0,2.9880963092030211,2.751793002372414,-32.220700082032167,-249.90522840738421,-69.905228407384215,null,436520,190549710400,null,22.721160925296317,-87.81847820717833,null,11.433314245159767,-162.08675020020587,null,0,0]
[478630,478.63,4140.1345531768247,1.5705547887489999,14.169739117564406,1.5001646837284499,1,0,28977.191687433289,1.5707618168944555,106.91493756122011,1.5614429604284186,22.709090298641286,1.5267468535332904,1,0,1,0,3.7385691318931547,2.8020866241319049,-34.969578247686329,-252.59087585633375,-72.590875856333753,null,478630,229086676900,null,21.922871515649565,-88.01008233829387,null,9.4827254891523634,-164.58079351803988,null,0,0]
[524810,524.80999999999995,4539.5900887726502,1.5705760425867341,15.530377251321724,1.5063618132681398,1,0,31773.018757617188,1.5707648535500094,117.22962507884802,1.5622659563590933,24.896085585650521,1.530618561122524,1,0,1,0,4.6456117064423221,2.8433326253446016,-37.658659270087,-254.77509833612399,-74.775098336123989,null,524810,275425536100,null,21.124180972549283,-88.184934637028519,null,7.5923350098519746,-166.59016369909551,null,0,0]
[575440,575.44000000000005,4977.5379852155856,1.5705954242584022,17.02269982934115,1.5120173981116856,1,0,34838.257488157324,1.5707676227186242,128.53833304713234,1.5630164679460568,27.294181074594192,1.5341502792555988,1,0,1,0,5.7394875170812805,2.877743773429315,-40.297126762851164,-256.58329129613776,-76.583291296137759,null,575440,331131193600,null,20.32534780764707,-88.344444695931486,null,5.7527006819900182,-168.23884660020633,null,0,0]
[630960,630.96,5457.7842285698916,1.5706131022547325,18.659676421413664,1.5171791433089885,1,0,38199.546335333325,1.5707701484735277,140.93933978954854,1.5637010162015976,29.924217542151638,1.5373723545050422,1,0,1,0,7.0574103728944682,2.9068841635257066,-42.894193034764719,-258.10371362586295,-78.103713625862952,null,630960,398110521600,null,19.526248886395425,-88.489978998344981,null,3.9547333313281152,-169.613734627518,null,0,0]
[691830,691.83,5984.3078042812031,1.5706292230901142,20.454870284018977,1.5218887191492869,1,0,41884.734594348745,1.5707724517480621,154.53539139948683,1.564325272041228,32.807985733332728,1.5403112212720773,1,0,1,0,8.6438053235659797,2.9318626599313746,-45.45665601213792,-259.39871029211889,-79.398710292118892,null,691830,478628748900,null,18.727076824008066,-88.622728403761712,null,2.1914424163422721,-170.77598188835725,null,0,0]
[758580,758.58,6561.6931955945965,1.5706439271056605,22.423912635193844,1.5261862817364589,1,0,45925.909496635773,1.570774552593557,169.44486979622948,1.5648946680066691,35.970594929509623,1.5429922591128149,1,0,1,0,10.552911545477704,2.9535005795718638,-47.991140767823559,-260.51419058270909,-80.514190582709091,null,758580,575443616400,null,17.927685160257578,-88.743836940777939,null,0.45634932440711617,-171.77035364193117,null,0,0]
[831760,831.76,7194.6978851350768,1.5706573355517361,24.58302802075087,1.5301066284228604,1,0,50356.369112550325,1.5707764683337389,185.79062461325071,1.5654138978885863,39.43810413267574,1.5454374205021761,1,0,1,0,12.849140410877975,2.9724023393322487,-50.502023092400563,-261.48378808230319,-81.483788082303192,null,831760,691824697600,null,17.128291543610636,-88.854294451739051,null,-1.2551393835229412,-172.62949363056421,null,0,0]
[912010,912.01,7888.8578526963665,1.5706695657324778,26.95109928827365,1.5336835698847144,1,0,55214.860287599186,1.5707782157285126,203.71560861165355,1.5658875030532198,43.240838689450449,1.5476679789346921,1,0,1,0,15.61117982186391,2.9890373413111613,-52.994048092108621,-262.33342670266421,-82.333426702664212,null,912010,831762240100,null,16.328708787046253,-88.955060577251245,null,-2.9475816266666151,-173.37836612541295,null,0,0]
[1000000,1000,8649.9685771355234,1.5706807194382559,29.547897435981231,1.5369465073254052,1,0,60541.946125673734,1.5707798093212435,223.36947586993386,1.5663194244045602,47.41054734971955,1.5497024095413421,1,0,1,0,18.932633504940597,3.0037630586117139,-55.470194943820744,-263.08274299434271,-83.082742994342709,null,1000000,1000000000000,null,15.529073973477875,-89.046968900453905,null,-4.624093664810359,-174.03577409388885,null,0,0]
[]
[]
["Pole/Zero Locations for Chart"]
[{"$f":"U4*1000","v":38240.5},null,{"$f":"SQRT(1+(A617/pole1)^2)","v":330.78063274276445},{"$f":"ATAN(A617/pole1)","v":1.5677731705872451},{"$f":"SQRT(1+(A617/Zero1)^2)","v":1.5084002353739852},{"$f":"ATAN(A617/Zero1)","v":0.84603868244525304},{"$f":"IF(VIN_nom>Vout, 1, SQRT(1+(A617/z_RHP)^2))","v":1},{"$f":"IF(VIN_nom>Vout, 0, -ATAN(A617/z_RHP))","v":0},{"$f":"SQRT(1+(A617/Pole2)^2)","v":2315.1545064713255},{"$f":"ATAN(A617/Pole2)","v":1.5703643901667796},{"$f":"SQRT(1+(A617/Zero2)^2)","v":8.6000121577092923},{"$f":"ATAN(A617/Zero2)","v":1.4542537838502352},{"$f":"SQRT(1+(A617/pole4)^2)","v":2.0701491908652594},{"$f":"ATAN(A617/pole4)","v":1.0666536306974392},{"$f":"IF(VOUT_setting=1,1,SQRT(1+(A617*zterm1)^2))","v":1},{"$f":"IF(VOUT_setting=1,0,ATAN(((A617*zterm1))))","v":0},{"$f":"IF(VOUT_setting=1,1,SQRT((1+Afbr-$Q$5*(A617)^2)^2+(A617*$Q$4)^2))","v":1},{"$f":"IF(VOUT_setting=1,0,ATAN(A617*$Q$4/(1+Afbr-$Q$5*(A617)^2)))","v":0},{"$f":"SQRT((1-(A617^2/(pole3^2)))^2+(A617/(Q*pole3))^2)","v":0.97619556470221536},{"$f":"ATAN((A617/(Q*pole3))/(1-A617^2/pole3^2))","v":0.1020748508452551},{"$f":"20*LOG10(((E617*K617*G617*O617)/(C617*I617*S617*M617*Q617))*Adc)","v":4.9077540160770421E-2},{"$f":"((F617+L617+H617+P617)-(D617+J617+T617+N617+R617))*radconv","v":-114.96819731871398},{"$f":"IF(V617>0,V617,V617+180)","v":65.031802681286024},"crossover",null,null,null,{"$f":"20*LOG10((K617/(I617*M617))*AEA)","v":42.78557320428768},{"$f":"(L617-(J617+N617))*radconv","v":-67.767399017347799},null,{"$f":"20*LOG10((E617*G617/(C617*S617))*Acs*Am)","v":23.638679588361349},{"$f":"(F617+H617-(D617+T617))*radconv","v":-47.200798301366177}]
[{"$f":"A617","v":38240.5},null,null,null,null,null,null,null,null,null,null,null,null,null,null,null,null,null,null,null,null,-135]
[{"$f":"A618","v":38240.5}]
[1000000,null,null,null,null,null,null,null,null,null,null,null,null,null,null,null,null,null,null,null,null,{"$f":"V617","v":-114.96819731871398}]
[]
[{"$f":"pole1","v":115.60735715570485},null,1.4142135623730951,0.78539816339744828,1.0000058276724879,3.4139842374283332E-3,{"$f":"IF(VIN_nom>Vout, 1, SQRT(1+(A622/z_RHP)^2))","v":1},{"$f":"IF(VIN_nom>Vout, 0, -ATAN(A622/z_RHP))","v":0},7.0701713025850879,1.428881157648018,1.0003333554158087,2.581715853004616E-2,1.0000150139295492,{"$f":"ATAN(A622/pole4)","v":5.479733880982233E-3},{"$f":"IF(VOUT_setting=1,1,SQRT(1+(A622*zterm1)^2))","v":1},{"$f":"IF(VOUT_setting=1,0,ATAN(((A622*zterm1))))","v":0},{"$f":"IF(VOUT_setting=1,1,SQRT((1+Afbr-$Q$5*(A622)^2)^2+(A622*$Q$4)^2))","v":1},{"$f":"IF(VOUT_setting=1,0,ATAN(A622*$Q$4/(1+Afbr-$Q$5*(A622)^2)))","v":0},{"$f":"SQRT((1-(A622^2/(pole3^2)))^2+(A622/(Q*pole3))^2)","v":0.99999978121522037},{"$f":"ATAN((A622/(Q*pole3))/(1-A622^2/pole3^2))","v":3.0072058828247306E-4},{"$f":"20*LOG10(((E622*K622*G622*O622)/(C622*I622*S622*M622*Q622))*Adc)","v":81.585853412745394},{"$f":"((F622+L622+H622+P622)-(D622+J622+T622+N622+R622))*radconv","v":-125.52523443626791},54.474765563732092,"p1",null,null,null,{"$f":"20*LOG10((K622/(I622*M622))*AEA)","v":80.721390269943853},{"$f":"(L622-(J622+N622))*radconv","v":-80.703611252659286},null,{"$f":"20*LOG10((E622*G622/(C622*S622))*Acs*Am)","v":67.239638395289802},{"$f":"(F622+H622-(D622+T622))*radconv","v":-44.821623183608608}]
[{"$f":"Zero1","v":33862.753888033272},null,292.91346210314651,1.5673823425574682,1.4142135623730951,0.78539816339744828,1,0,2050.1172651650982,1.5703085497995772,7.6296475049800927,1.4393504791116793,1.8911183104228424,1.0136247902832993,{"$f":"IF(VOUT_setting=1,1,SQRT(1+(A623*zterm1)^2))","v":1},{"$f":"IF(VOUT_setting=1,0,ATAN(((A623*zterm1))))","v":0},{"$f":"IF(VOUT_setting=1,1,SQRT((1+Afbr-$Q$5*(A623)^2)^2+(A623*$Q$4)^2))","v":1},{"$f":"IF(VOUT_setting=1,0,ATAN(A623*$Q$4/(1+Afbr-$Q$5*(A623)^2)))","v":0},0.98131073683084424,8.9883141866028429E-2,1.3014587050736353,-115.53408515884584,64.465914841154159,"z1",null,null,null,{"$f":"20*LOG10((K623/(I623*M623))*AEA)","v":43.587365820557025},{"$f":"(L623-(J623+N623))*radconv","v":-65.57976731159448},null,24.089268137004861,-49.95431784725136]
[{"$f":"Pole2","v":16.517473654721982},null,1.0101551587891981,0.14191516914687866,1.0000001189632104,4.8777699531927485E-4,1,0,1.4142135623730951,0.78539816339744828,1.0000068060434584,3.6894457189821563E-3,1.0000003064882763,7.8292809126163606E-4,1,0,1,0,0.99999999553384877,4.2965632799731465E-5,98.483930829227205,-52.939123294592513,127.06087670540748,"p2",null,null,{"$f":"Pole2","v":16.517473654721982},{"$f":"20*LOG10((K624/(I624*M624))*AEA)","v":94.696980898208665},{"$f":"(L624-(J624+N624))*radconv","v":-44.833468858080948},null,70.162125183506788,-8.1056544365115695]
[{"$f":"Zero2","v":4476.9323002463125},null,38.738232756614948,1.5449791682648504,1.0087016391956805,0.13144584768321732,1,0,271.04403881777904,1.5671068810759146,1.4142135623730951,0.78539816339744828,1.0222678891940626,0.20910464405576565,1,0,1,0,0.9996719237959264,1.1649584691993609E-2,24.055451898783954,-138.42638957708743,41.573610422912566,"z2",null,null,{"$f":"Zero2","v":4476.9323002463125},{"$f":"20*LOG10((K625/(I625*M625))*AEA)","v":51.865432770425848},{"$f":"(L625-(J625+N625))*radconv","v":-56.769423977408948},null,38.56519438084635,-81.656965599678486]
[{"$f":"pole3","v":225000},null,1946.2431737548864,1.5702825163638645,6.7192976601850178,1.4214163141357026,1,0,13621.937913123873,1.5707229158010074,50.267576172314627,1.550901475148609,10.711779730745024,1.4773050225736848,1,0,1,0,0.58527517802494411,{"$error":"#DIV/0!"},-12.258983278540889,{"$error":"#DIV/0!"},{"$error":"#DIV/0!"},"p3",null,null,null,{"$f":"20*LOG10((K626/(I626*M626))*AEA)","v":28.450972693070362},{"$f":"(L626-(J626+N626))*radconv","v":-85.779027838219221},null,25.665219280877004,{"$error":"#DIV/0!"}]
[{"$f":"Fp2_u","v":21097.046413502114},null,{"$f":"SQRT(1+(A627/pole1)^2)","v":182.49152720147254},{"$f":"ATAN(A627/pole1)","v":1.5653165929139143},{"$f":"SQRT(1+(A627/Zero1)^2)","v":1.1781974643980024},{"$f":"ATAN(A627/Zero1)","v":0.55717153651159723},1,0,{"$f":"SQRT(1+(A627/Pole2)^2)","v":1277.2566386669139},{"$f":"ATAN(A627/Pole2)","v":1.5700133987036349},{"$f":"SQRT(1+(A627/Zero2)^2)","v":4.8173239305346236},{"$f":"ATAN(A627/Zero2)","v":1.361691682739131},{"$f":"SQRT(1+(A627/pole4)^2)","v":1.4142135623730951},0.78539816339744828,1,0,1,0,0.9927261882370535,5.5308414516766463E-2,6.3651066483808192,-117.86735083257418,{"$f":"IF(V627>0,V627,V627+180)","v":62.132649167425825},"p4",null,null,null,null,null,null,26.51280382004709,-60.93139566182618]
[{"$f":"z_RHP","v":0},null,{"$f":"SQRT(1+(A628/pole1)^2)","v":1},{"$f":"ATAN(A628/pole1)","v":0},{"$f":"SQRT(1+(A628/Zero1)^2)","v":1},{"$f":"ATAN(A628/Zero1)","v":0},1,0,{"$f":"SQRT(1+(A628/Pole2)^2)","v":1},{"$f":"ATAN(A628/Pole2)","v":0},{"$f":"SQRT(1+(A628/Zero2)^2)","v":1},{"$f":"ATAN(A628/Zero2)","v":0},{"$f":"SQRT(1+(A628/pole4)^2)","v":1},0,1,0,1,0,1,0,101.58193498135836,0,{"$f":"IF(V628>0,V628,V628+180)","v":180},"z_RHP",null,null,null,null,null,null,70.249885833216382,0]
[{"$f":"Fp2_u","v":21097.046413502114},null,null,null,null,null,null,null,null,null,null,null,null,null,null,null,null,null,null,null,-25]
[]
[null,null,null,"System","Plant"]
["p1","p-dom",{"$f":"pole1","v":115.60735715570485},{"$f":"U622","v":81.585853412745394},{"$f":"AE622","v":67.239638395289802}]
["z1","ESR zero",{"$f":"Zero1","v":33862.753888033272},{"$f":"U623","v":1.3014587050736353},{"$f":"AE623","v":24.089268137004861}]
["p2","EA pole",{"$f":"Pole2","v":16.517473654721982},{"$f":"U624","v":98.483930829227205},{"$f":"AE624","v":70.162125183506788}]
["z2","EA zero",{"$f":"Zero2","v":4476.9323002463125},{"$f":"U625","v":24.055451898783954},{"$f":"AE625","v":38.56519438084635}]
["p3","p_sampling",{"$f":"pole3","v":225000},{"$f":"U626","v":-12.258983278540889},{"$f":"AE626","v":25.665219280877004}]
[]
[]
[{"$f":"U4*1000","v":38240.5}]
[{"$f":"U4*1000","v":38240.5}]
[]
[]
[]
[]
[]
[]
[]
[]
[]
[]
[]
[]
[]
[]
[]
[]
[]
[]
[]
[]
[]
[]
[]
[]
[]
[]
[]
[]
[]
[]
[]
[]
[]
[]
[]
[]
[]
[]
[]
[]
[]
[]
[]
[]
[]
[]
[null,null,null,null,null,null,null,null,null,null,null,null,null,null,null,null,null,null,null,null,null,null,null,null,null,null,null,null,null,null,null,null,null,"phase margin",{"$f":"SUM(AI689:AI1306)","v":0}]

{"sheet":"Bode Plot Management","index":8,"n_rows":6,"n_cols":14,"rows_kept":6,"cut":false,"hidden":true,"merged":[]}
[null,null,null,null,null,null,null,null,null,"Single or dual output (MODE)",null,null,null,"3.3V or 5V fixed (FB1/2)"]
[{"$f":"CHOOSE(BODE_PLOT_TYPE, \"BODE_PLOT_Ch1\", \"BODE_PLOT_Ch2\")","v":"BODE_PLOT_Ch1"},null,null,null,null,null,null,null,null,"With/without dither (DITH)",null,null,null,"With/without VOUT connected to VCCX"]
[null,null,null,null,null,null,null,null,null,"FPWM or DEM (DEMB)"]
[null,null,null,null,null,null,null,null,null,"Shunt or inductor DCR current sensing"]
[]
[null,null,null,null,null,{"$f":"INDIRECT(A2)","v":0}]

{"sheet":"Efficiency Calculations","index":9,"n_rows":109,"n_cols":57,"rows_kept":109,"cut":false,"hidden":true,"merged":[[6,24,6,26],[0,0,3,3],[5,0,6,3],[6,6,6,13],[6,17,6,20],[6,21,6,23],[6,51,6,56],[6,27,6,32],[6,33,6,36],[6,40,6,44],[6,45,6,49]]}
["BUCK CONTROLLER POWER DESIGN TOOL"]
[null,null,null,null,null,null,null,{"$f":"AV19","v":0.98636342140140987},"10% load"]
[null,null,null,null,null,null,null,{"$f":"AV59","v":0.99119138739622714},"50% load",null,null,null,null,null,null,null,null,null,null,null,null,null,null,null,null,null,null,null,null,null,null,null,null,null,null,null,null,null,null,null,null,{"$f":"IF(MODE=1, (Qg_Q1+Qg_Q2)*Fsw*Vin, (Qg_Q1+Qg_Q2+Qg_Q3+Qg_Q4)*Fsw*Vin)","v":0.53459999999999996}]
[null,null,null,null,null,null,null,{"$f":"AV109","v":0.98712317598782406},"100% load",null,null,null,null,null,null,null,null,null,null,null,null,null,null,null,null,null,null,null,null,null,null,null,null,null,null,null,null,null,null,null,"I_VCC",{"$f":"(Qg_Q1+Qg_Q2)*Fsw*1000","v":9.8999999999999986},"mA",{"$f":"AP4*5/1000","v":4.9499999999999995E-2}]
[]
["Enter the values of your design and MOSFET datasheet specifications below. Note that thermal resistance (θJA) will change when components are placed on the PCB"]
[null,null,null,null,null,null,"Operating Point Condtions",null,null,null,null,null,null,null,null,null,null,"Filter Inductor",null,null,null,"Cout",null,null,"Cin",null,null,"High-side BUCK \"Control\" MOSFET Losses ",null,null,null,null,null,"Low-side BUCK \"Sync\" MOSFET Losses ",null,null,null,"External Diode","Diode/FET","Sense Rs","Controller IC Losses",null,null,null,null,"RESULTS",null,null,null,null,null,"Consolidated Buck/Boost Efficiency & Losses"]
["Input Parameters",null,null,null,null,null,"Step","Vin","Mode","Iout","Iout/ phase","Iin","Duty Cycle BUCK Leg","Ripple Current pk-pk","Peak Inductor Current","Valley Inductor Current","SW node voltage at Q1 turn-on","Irms Lf","DCR    Loss","Core Loss","Total Inductor Loss","Irms Cout","Cout ESR Loss","Total Cout Loss","Irms Cin","Cin ESR Loss","Total Cin Loss","Irms","RDS(on) Loss","Transition Loss (not including capacitive loss)","MOSFET Output Capacitance Loss","Dead Time Loss ","Total Control MOSFET Loss","Irms","RDS(on) Loss","Deadtime Loss","Total Sync MOSFET Loss","Deadtime Loss","Reverse Recovery Loss","Isense Shunt Loss","IQ Loss","Switching Current Loss","Switching Current Diss","LDO Loss Saved from Gate Drive Current (ext VCC)","Total IC Loss","Total Loss","Pout","EFF, h",{"$f":"IF(Vin>Vout, \"Buck ''CONTROL'' MOSFET Temp Rise\", \"Boost ''CONTROL'' MOSFET Temp Rise\")","v":"Buck ''CONTROL'' MOSFET Temp Rise"},{"$f":"IF(Vin>Vout, \"Buck ''SYNC'' MOSFET Temp Rise\", \"Boost ''SYNC'' MOSFET Temp Rise\")","v":"Buck ''SYNC'' MOSFET Temp Rise"},null,"h","Inductor Cu & Core Loss","Total MOSFET Loss","Control MOSFET Loss","SYNC MOSFET Loss","Shunt Loss"]
["Design","Input Value","Units","Description",null,null,0,{"$f":"Vin","v":54},{"$f":"MODE","v":1},0,{"$f":"Iout*G9/100/Number_of_Phases","v":0},{"$f":"Vout*K9/(Vin*Efficiency)","v":0},{"$f":"(Vout+(Rdson2+Rs+Rdcr)*K9)/(Vin+(Rs+Rdson2-Rdson1)*K9)","v":0.92592592592592593},{"$f":"(Vin-(Rdson1+Rdcr)*K9-Vout)*M9/(Fsw*Lf)","v":0.82304526748971196},{"$f":"K9+N9/2","v":0.41152263374485598},{"$f":"K9-N9/2","v":-0.41152263374485598},{"$f":"IF(MIN(Vin, -P9/(Coss_Q1+Coss_Q2)*0.00000002)<0, 0, MIN(Vin, -P9/(Coss_Q1+Coss_Q2)*0.00000002))","v":18.705574261129819},{"$f":"SQRT(K9^2+(N9^2)/12)","v":0.23759270337021637},{"$f":"R9^2*Rdcr","v":3.9515204886337338E-4},{"$f":"Core_Loss_Ch1","v":0.1},{"$f":"(T9+S9*(1+Ltc*(Ta-25)))/(1-S9*Ltc*ThetaCa)","v":0.10039832585719657},{"$f":"N9/SQRT(12)","v":0.23759270337021637},{"$f":"RCoutEsr*V9^2","v":5.6450292694767621E-4},{"$f":"W9","v":5.6450292694767621E-4},{"$f":"SQRT(M9*(1-M9))*SQRT(K9^2+(N9^2)/12)","v":6.2223485819823669E-2},{"$f":"RCinEsr*Y9^2","v":3.8717621875697973E-5},{"$f":"Z9","v":3.8717621875697973E-5},{"$f":"SQRT(M9)*SQRT(K9^2+(N9^2)/12)","v":0.22862368541380887},{"$f":"Rdson1*AB9^2","v":3.9201592149144181E-4},{"$f":"(Vin*K9/2)*Fsw*(Tr_buck+Tf_buck)","v":0},{"$f":"(0.5*Coss_Q1*(Vin-Q9)^2-0.5*Coss_Q2*(Vin-Q9)^2+(Qoss_Q2*(Vin-Q9)/Vin)*Vin)*Fsw","v":0.3652973063973064},{"$f":"IF(K9>N9/2,0,ABS(K9-N9/2)*Vsd_Q1*Deadtime*Fsw)","v":2.0740740740740741E-3},{"$f":"(AF9+AE9+AD9+AC9*(1+RdsonTopTc*Ta-RdsonTopTc*25))/(1-AC9*RdsonTopTc*ThetaJA_Q1)","v":0.36779223247505816},{"$f":"SQRT((1-M9))*SQRT(K9^2+(N9^2)/12)","v":6.4664543318385698E-2},{"$f":"Rdson2*AH9^2","v":3.1361273719315355E-5},{"$f":"IF(K9<N9/2,Deadtime*Fsw*IF(VfdSky_Q2>0,0,Vsd_Q2)*(K9+N9/2),2*Deadtime*Fsw*IF(VfdSky_Q2>0,0,Vsd_Q2)*K9)","v":2.0740740740740741E-3},{"$f":"(AJ9+AI9*(1+RdsonBotTc*Ta-RdsonBotTc*25))/(1-AI9*RdsonBotTc*ThetaJA_Q2)","v":2.105448553703068E-3},{"$f":"2*Deadtime*Fsw*IF(VfdSky_Q2>0,VfdSky_Q2,Vsd_Q2)*K9","v":0},{"$f":"IF(QrrSky_Q2>0,QrrSky_Q2,Qrr_Q2*K9/(Iout/Number_of_Phases))*Fsw*Vin","v":0},{"$f":"Rs*R9^2","v":1.6935087808430288E-4},{"$f":"Iq*Vin","v":1.188E-4},{"$f":"IF(Ext_VCC=1,  (Qg_Q1+Qg_Q2)*Fsw*VCC, (Qg_Q1+Qg_Q2)*Fsw*Vin)","v":4.9499999999999995E-2},{"$f":"(Vin-VCC)*Fsw*(Qg_Q1+Qg_Q2)+(RdsonDRT+RdsonDRT2)*Fsw*Qg_Q1*VCC/(RdsonDRT+2*Rgate1+RdsonDRT2)+(RdsonDRB+RdsonDRB2)*Fsw*Qg_Q2*VCC/(RdsonDRB+2*Rgate2+RdsonDRB2)","v":0.50159999999999993},{"$f":"(Qg_Q1+Qg_Q2)*Fsw*(Vin-VCC)","v":0.48509999999999998},{"$f":"SUM(AO9:AP9)","v":4.9618799999999998E-2},{"$f":" SUM(U9,X9,AA9,AG9,AK9,AL9,AM9,AS9,AN9)","v":0.52068737831286549},{"$f":"Vout*K9","v":0},{"$f":"AU9/(AU9+AT9)","v":0},{"$f":"ThetaJA_Q1*BC9","v":18.389611623752909},{"$f":"ThetaJA_Q2*BD9","v":0.10527242768515339},null,{"$f":"AV9*100","v":0},{"$f":"U9","v":0.10039832585719657},{"$f":"AG9+AK9+AM9","v":0.36989768102876125},{"$f":"AG9+AM9*0.66","v":0.36779223247505816},{"$f":"AK9+AM9*0.33","v":2.105448553703068E-3},{"$f":"AN9","v":1.6935087808430288E-4}]
[null,null,null,null,null,null,1,54,1,{"$f":"Iout*G10/100","v":0.15},0.15,0.15432098765432098,0.92596682064686497,0.82263406772278935,{"$f":"K10+N10/2","v":0.56131703386139464},{"$f":"K10-N10/2","v":-0.26131703386139471},11.87804699369976,{"$f":"SQRT(K10^2+(N10^2)/12)","v":0.28088058099753338},5.5225730547058341E-4,0.1,0.10055669995924391,{"$f":"N10/SQRT(12)","v":0.23747400022215465},5.6393900781511906E-4,{"$f":"W10","v":5.6393900781511906E-4},{"$f":"SQRT(M10*(1-M10))*SQRT(K10^2+(N10^2)/12)","v":7.3541524371627753E-2},5.4083558069027192E-5,{"$f":"Z10","v":5.4083558069027192E-5},{"$f":"SQRT(M10)*SQRT(K10^2+(N10^2)/12)","v":0.27028343359348866},5.4789850856314343E-4,2.0437944715587523E-2,0.43596221361520743,1.3170378506614296E-3,0.45831531674571885,7.642490632265185E-2,4.380574729819583E-5,2.8290378506614293E-3,2.8728687675922764E-3,1.5120000000000001E-3,4.8600000000000006E-3,2.3668170234453575E-4,1.188E-4,4.9499999999999995E-2,0.50159999999999993,0.48509999999999998,4.9618799999999998E-2,0.61859038974078373,7.5,{"$f":"AU10/(AU10+AT10)","v":0.92380569039146543},23.076145837285942,0.22383343837961384,null,{"$f":"AV10*100","v":92.380569039146536},0.10055669995924391,0.46604818551331112,0.46152291674571883,4.4766687675922767E-3,2.3668170234453575E-4]
["Vin",{"$f":"Vin","v":54},"V","Vin",null,null,2,54,1,0.3,0.3,0.30864197530864196,0.92600771468623666,0.82222282781912426,0.71111141390956212,-0.11111141390956214,5.0505188140710064,0.38254088872812858,1.024362720842345E-3,0.1,0.10103264224662679,0.23735528548761337,5.6337531548906442E-4,5.6337531548906442E-4,0.10013326689633191,1.002667113933204E-4,1.002667113933204E-4,0.36811639893168019,1.0163226237182093E-3,4.0875889431175046E-2,0.50662713027436512,5.6000152610419316E-4,0.54919097489786872,0.10405694780493291,8.1208862898588994E-5,3.584001526104193E-3,3.6652699194832578E-3,3.0240000000000002E-3,9.7200000000000012E-3,4.3901259464671931E-4,1.188E-4,4.9499999999999995E-2,0.50159999999999993,0.48509999999999998,4.9618799999999998E-2,0.71735434168550782,15,0.95435909084374693,27.780308744893432,0.34364349597416294,null,95.435909084374686,0.10103264224662679,0.56257624481735191,0.55560617489786868,6.8728699194832588E-3,4.3901259464671931E-4]
["Vout",{"$f":"Vout","v":50},"V","Vout",null,null,3,54,1,0.45,0.45,0.46296296296296297,0.92604860804405809,0.82181154777972032,0.86090577388986023,3.9094226110139851E-2,0,0.50870540099879191,1.811468295037392E-3,0.1,0.10182622469324822,0.23723655916688227,5.628118500534163E-4,5.628118500534163E-4,0.13312401786312852,1.7722004132022563E-4,1.7722004132022563E-4,0.48953442796415098,1.7973296712164139E-3,6.1313834146762565E-2,0.55890000000000006,0,0.62223483604463659,0.1383373732696741,1.4352921632364857E-4,4.5360000000000001E-3,4.6796635500120478E-3,4.5360000000000001E-3,1.4580000000000003E-2,7.7634355501602509E-4,1.188E-4,4.9499999999999995E-2,0.50159999999999993,0.48509999999999998,4.9618799999999998E-2,0.79899189973428641,22.5,0.96570701843355733,31.59288180223183,0.47455317750060244,null,96.570701843355735,0.10182622469324822,0.64149449959464866,0.63185763604463663,9.491063550012049E-3,7.7634355501602509E-4]
["Fsw",{"$f":"Fsw/1000","v":450},"kHz","Switching Frequency",null,null,4,54,1,0.6,0.6,0.61728395061728392,0.92608950072034635,0.8214002276055824,1.0107001138027911,0.18929988619720878,0,0.64515491252815282,2.9135740281144599E-3,0.1,0.10293756732592871,0.23711782126025144,5.6224861159208546E-4,5.6224861159208546E-4,0.16878877328169697,2.8489649985940103E-4,2.8489649985940103E-4,0.62085543716579217,2.8909610539374518E-3,8.1751778862350091E-2,0.55890000000000006,0,0.64391504658062937,0.17539494662299029,2.3072540475661211E-4,6.0480000000000004E-3,6.2790151504190234E-3,6.0480000000000004E-3,1.9440000000000002E-2,1.2486745834776256E-3,1.188E-4,4.9499999999999995E-2,0.50159999999999993,0.48509999999999998,4.9618799999999998E-2,0.83033424875190631,30,0.97306762093292842,32.837272329031471,0.63471075752095119,null,97.306762093292846,0.10293756732592871,0.66963406173104845,0.65674544658062939,1.2694215150419024E-2,1.2486745834776256E-3]
["Iout",{"$f":"Iout","v":15},"A","Max Output Current",null,null,5,54,1,0.75,0.75,0.77160493827160492,0.92613039271511843,0.8209888672977107,1.1604944336488554,0.33950556635114465,0,0.78655486777395134,4.3306799201322859E-3,0.1,0.1043668382697981,0.23699907176800963,5.6168560018898187E-4,5.6168560018898187E-4,0.205730170747803,4.2324903155920176E-4,4.2324903155920176E-4,0.75694633657267862,4.2972581733809918E-3,0.10218972357793761,0.55890000000000006,0,0.66595934159608128,0.21377746272256856,3.427560267607439E-4,7.5600000000000007E-3,7.903297807351696E-3,7.5600000000000007E-3,2.4300000000000002E-2,1.8560056800566941E-3,1.188E-4,4.9499999999999995E-2,0.50159999999999993,0.48509999999999998,4.9618799999999998E-2,0.86254921798503592,37.5,0.97751585242461791,34.099867079804064,0.79611489036758487,null,97.751585242461786,0.1043668382697981,0.69816263940343293,0.68199734159608127,1.5922297807351698E-2,1.8560056800566941E-3]
["Ta",{"$f":"Ta","v":25},"°C","Ambient Temperature",null,null,6,54,1,0.9,0.9,0.92592592592592593,0.92617128402839122,0.82057746685710997,1.3102887334285551,0.48971126657144504,0,0.93065153607180096,6.0627859711496184E-3,0.1,0.1061142538118976,0.23688031069044685,5.6112281592802626E-4,5.6112281592802626E-4,0.24335787916304852,5.9223057350736921E-4,5.9223057350736921E-4,0.89563850071084228,6.0162624296667411E-3,0.12262766829352513,0.55890000000000006,0,0.68837221630370671,0.25287142511014776,4.7957968227927794E-4,9.0720000000000002E-3,9.552495918870826E-3,9.0720000000000002E-3,2.9160000000000005E-2,2.598336844778408E-3,1.188E-4,4.9499999999999995E-2,0.50159999999999993,0.48509999999999998,4.9618799999999998E-2,0.89564145626868885,45,0.98048526117404644,35.380890815185332,0.95876479594354147,null,98.048526117404649,0.1061142538118976,0.72708471222257753,0.70761781630370668,1.9175295918870829E-2,2.598336844778408E-3]
["Vcc",{"$f":"VCC","v":5},"V","Subregulated VCC Voltage",null,null,7,54,1,1.05,1.05,1.0802469135802468,0.92621217466018191,0.82016602628478341,1.4600830131423916,0.63991698685760834,0,1.0763624045317239,8.109892181225202E-3,0.1,0.10818007848303753,0.23676153802785271,5.6056025889314345E-4,5.6056025889314345E-4,0.28138835358481229,7.9179405533171346E-4,7.9179405533171346E-4,1.035890291587193,8.0480152215344995E-3,0.14306561300911266,0.55890000000000006,0,0.71115831081271563,0.29238216375954695,6.4115497263535898E-4,1.0584000000000001E-2,1.1226594570022227E-2,1.0584000000000001E-2,3.4020000000000002E-2,3.475668077667944E-3,1.188E-4,4.9499999999999995E-2,0.50159999999999993,0.48509999999999998,4.9618799999999998E-2,0.92961580625766815,52.5,0.98260111377875958,36.680575540635779,1.1226597285011113,null,98.260111377875958,0.10818007848303753,0.75640490538273786,0.73361151081271558,2.2453194570022227E-2,3.475668077667944E-3]
["Components","Input Value","Units","Description",null,null,8,54,1,1.2,1.2,1.2345679012345678,0.92625306461050749,0.81975454558173455,1.6098772727908672,0.79012272720913268,0,1.22311070345935,1.0471998550417782E-2,0.1,0.11056462515796832,0.23664275378051691,5.599979291682635E-4,5.599979291682635E-4,0.31967051775238903,1.0218923992008047E-3,1.0218923992008047E-3,1.1771467167884786,1.0392557946344208E-2,0.16350355772470018,0.55890000000000006,0,0.73432241331738446,0.33215267584490621,8.2744050053198492E-4,1.2096000000000001E-2,1.2925579530131201E-2,1.2096000000000001E-2,3.8880000000000005E-2,4.4879993787504784E-3,1.188E-4,4.9499999999999995E-2,0.50159999999999993,0.48509999999999998,4.9618799999999998E-2,0.96447730771260343,60,0.9841796838043162,37.999160665869226,1.2877989765065601,null,98.417968380431617,0.11056462515796832,0.78612799284751567,0.7599832133173845,2.5755979530131201E-2,4.4879993787504784E-3]
["L",{"$f":"Lf*1000000","v":10},"uH","Filter Inductance",null,null,9,54,1,1.35,1.35,1.3888888888888888,0.92629395387938507,0.81934302474896625,1.7596715123744833,0.94032848762551691,0,1.3705632355654853,1.3149105078786125E-2,0.1,0.11326825517393596,0.23652395794872894,5.5943582683732089E-4,5.5943582683732089E-4,0.35811709255837787,1.2824785198246578E-3,1.2824785198246578E-3,1.3190871591155271,1.304993200007604E-2,0.18394150244028773,0.55890000000000006,0,0.75786946343291062,0.37209225917809724,1.0383948700519521E-3,1.3608000000000002E-2,1.4649437250149895E-2,1.3608000000000002E-2,4.3740000000000001E-2,5.6353307480511965E-3,1.188E-4,4.9499999999999995E-2,0.50159999999999993,0.48509999999999998,4.9618799999999998E-2,1.0002312009517096,67.5,0.98539813394180475,39.336893171645535,1.4541818625074949,null,98.53981339418047,0.11326825517393596,0.81625890068306051,0.78673786343291063,2.9083637250149896E-2,5.6353307480511965E-3]
["Rdcr",{"$f":"Rdcr*1000","v":7},"mW","Inductor DCR at 25°C",null,null,10,54,1,1.5,1.5,1.5432098765432098,0.9263348424668314,0.81893146378748327,1.9094657318937416,1.0905342681062584,0,1.518514864990931,1.6141211766388979E-2,0.1,0.11629137846770519,0.23640515053277888,5.5887395198425845E-4,5.5887395198425845E-4,0.39667434054340139,1.5735053244554237E-3,1.5735053244554237E-3,1.4615142274289996,1.6020178777330391E-2,0.20437944715587522,0.55890000000000006,0,0.78180455568340157,0.41214506938824319,1.2739766866577983E-3,1.5120000000000001E-2,1.6398154860056986E-2,1.5120000000000001E-2,4.8600000000000004E-2,6.9176621855952759E-3,1.188E-4,4.9499999999999995E-2,0.50159999999999993,0.48509999999999998,4.9618799999999998E-2,1.0368829304731988,75,0.98636342140140987,40.694027784170075,1.6218077430028497,null,98.636342140140982,0.11629137846770519,0.84680271054345857,0.81388055568340156,3.2436154860056993E-2,6.9176621855952759E-3]
["LTc",{"$f":"Ltc*1000000","v":4000},"ppm","Inductor Series Resistance Temp Co",null,null,11,54,1,1.65,1.65,1.6975308641975309,0.92637573037286391,0.81851986269828592,2.0592599313491426,1.240740068650857,0,1.6668326942045808,1.9448318613285113E-2,0.1,0.1196344537311483,0.23628633153295547,5.583123046930175E-4,5.583123046930175E-4,0.43530744455936693,1.8949257128880632E-3,1.8949257128880632E-3,1.6043000414023982,1.9303339671328024E-2,0.22481739187146274,0.55890000000000006,0,0.80613294314715422,0.45227492482511633,1.5341445571917347E-3,1.6632000000000001E-2,1.8171720166309326E-2,1.6632000000000001E-2,5.3460000000000001E-2,8.3349936914079055E-3,1.188E-4,4.9499999999999995E-2,0.50159999999999993,0.48509999999999998,4.9618799999999998E-2,1.0744381487536008,82.5,0.98714393811608747,42.070827157357712,1.7906760083154665,null,98.714393811608744,0.1196344537311483,0.87776466331346348,0.84141654314715419,3.5813520166309329E-2,8.3349936914079055E-3]
["ThetaCa",{"$f":"ThetaCa","v":20},"°C/W","Core to Ambient Thermal Resistance",null,null,12,54,1,1.8,1.8,1.8518518518518519,0.92641661759749949,0.81810822148237861,2.2090541107411892,1.3909458892588107,0,1.8154269714050069,2.3070425619533288E-2,0.1,0.12329798858550929,0.23616750094954864,5.5775088504755063E-4,5.5775088504755063E-4,0.47399288786447513,2.2466925774610488E-3,2.2466925774610488E-3,1.747358237412888,2.2899456073910061E-2,0.24525533658705026,0.55890000000000006,0,0.83086004126466184,0.49245738764900304,1.8188570898756034E-3,1.8144E-2,1.9970121649345123E-2,1.8144E-2,5.8320000000000011E-2,9.8873252655142657E-3,1.188E-4,4.9499999999999995E-2,0.50159999999999993,0.48509999999999998,4.9618799999999998E-2,1.112902720227539,90,0.98778545423314157,43.467562063233096,1.9607860824672565,null,98.778545423314156,0.12329798858550929,0.90915016291400697,0.8693512412646619,3.9215721649345128E-2,9.8873252655142657E-3]
["Cin",{"$f":"Cin*1000000","v":470},"μF","Input Capacitance",null,null,13,54,1,1.95,1.95,2.0061728395061729,0.92645750414075512,0.81769654014076443,2.3588482700703821,1.5411517299296178,0,1.9642349577668099,2.7007532785192273E-2,0.1,0.1272825397744676,0.236048658782848,5.5718969313181402E-4,5.5718969313181402E-4,0.51271422869441097,2.6287588030570476E-3,2.6287588030570476E-3,1.8906284449194153,2.6808569375538049E-2,0.26569328130263781,0.55890000000000006,0,0.85599143181511228,0.53267537260021203,2.1280728943108103E-3,1.9656E-2,2.1793348461138094E-2,1.9656E-2,6.3179999999999986E-2,1.1574656907939546E-2,1.188E-4,4.9499999999999995E-2,0.50159999999999993,0.48509999999999998,4.9618799999999998E-2,1.1522827254548462,97.5,0.98831975608043854,44.884511590755615,2.1321374230569048,null,98.831975608043848,0.1272825397744676,0.94096478027625041,0.89769023181511232,4.2642748461138094E-2,1.1574656907939546E-2]
["RCinEsr",{"$f":"RCinEsr*1000","v":10},"mW","Input Capacitor ESR",null,null,14,54,1,2.1,2.1,2.1604938271604937,0.92649839000264778,0.81728481867444636,2.5086424093372233,1.6913575906627769,0,2.1132115069019894,3.1259640110320834E-2,0.1,0.13158871337613831,0.23592980503314306,5.5662872902976894E-4,5.5662872902976894E-4,0.55145963289288968,3.0410772671036067E-3,3.0410772671036067E-3,2.0340672216126996,3.1030720965294051E-2,0.28613122601822533,0.55890000000000006,0,0.88153286706746048,0.57291658281443558,2.4617505814782748E-3,2.1168000000000003E-2,2.3641390422802333E-2,2.1168000000000003E-2,6.8040000000000003E-2,1.339698861870893E-2,1.188E-4,4.9499999999999995E-2,0.50159999999999993,0.48509999999999998,4.9618799999999998E-2,1.1925844654812434,105,0.98876960692232796,46.321963353373022,2.3047295211401169,null,98.876960692232799,0.13158871337613831,0.9732142574902628,0.92643926706746049,4.609459042280234E-2,1.339698861870893E-2]
["Cout",{"$f":"Cout*1000000","v":470},"μF","Output Capcitance",null,null,15,54,1,2.25,2.25,2.3148148148148149,0.92653927518319479,0.8168730570844277,2.658436528542214,1.8415634714577862,0,2.2623233189096861,3.5826747594977761E-2,0.1,0.13621716503416034,0.23581093970072345,5.5606799282538228E-4,5.5606799282538228E-4,0.59022036897872476,3.4836008395738201E-3,3.4836008395738201E-3,2.1776425244096935,3.5565952230880674E-2,0.30656917073381285,0.55890000000000006,0,0.90749027411250838,0.6131719458399203,2.8198487637383558E-3,2.2680000000000002E-2,2.551423802224731E-2,2.2680000000000002E-2,7.2900000000000006E-2,1.5354320397847612E-2,1.188E-4,4.9499999999999995E-2,0.50159999999999993,0.48509999999999998,4.9618799999999998E-2,1.2338144663991628,112.5,0.98915173581236315,47.780213705625421,2.4785619011123656,null,98.915173581236317,0.13621716503416034,1.0059045121347556,0.95560427411250837,4.9571238022247312E-2,1.5354320397847612E-2]
["RCoutEsr",{"$f":"Cout_ESR*1000","v":10},"mW","Output Capacitor ESR",null,null,16,54,1,2.4,2.4,2.4691358024691357,0.92658015968241281,0.81646125537171244,2.8082306276858562,1.9917693723141436,0,2.4115453030080656,4.0708855239221839E-2,0.1,0.14116860020803723,0.23569206278587898,5.5550748460262724E-4,5.5550748460262724E-4,0.62898985548155439,3.9562823829870667E-3,3.9562823829870667E-3,2.3213302094164643,4.0414304558621141E-2,0.32700711544940037,0.55890000000000006,0,0.93386975938277805,0.65343462359349858,3.2023260548308284E-3,2.4192000000000002E-2,2.7411882411882738E-2,2.4192000000000002E-2,7.776000000000001E-2,1.7446652245380789E-2,1.188E-4,4.9499999999999995E-2,0.50159999999999993,0.48509999999999998,4.9618799999999998E-2,1.2759794841156686,120,0.98947871219392802,49.259567969138899,2.6536341205941372,null,98.947871219392809,0.14116860020803723,1.0390416417946609,0.98519135938277802,5.3072682411882746E-2,1.7446652245380789E-2]
["Top Driver","Input Value","Units","Description",null,null,17,54,1,2.5499999999999998,2.5499999999999998,2.6234567901234565,0.92662104350031904,0.81604941353730076,2.9580247067686503,2.1419752932313494,0,2.5608581999877593,4.5905963043111828E-2,0.1,0.14644377444290943,0.23557317428889843,5.5494720444547712E-4,5.5494720444547712E-4,0.66776303824108429,4.4590747524096384E-3,4.4590747524096384E-3,2.4651117441462791,4.5575819333459326E-2,0.34744506016498783,0.55890000000000006,0,0.96067761336735302,0.69369936522721265,3.6091410698747828E-3,2.5703999999999998E-2,2.9334315406372741E-2,2.5703999999999998E-2,8.2619999999999999E-2,1.9673984161333639E-2,1.188E-4,4.9499999999999995E-2,0.50159999999999993,0.48509999999999998,4.9618799999999998E-2,1.3190865093348239,127.49999999999999,0.98976016252654264,50.760340668367654,2.8299457703186368,null,98.976016252654262,0.14644377444290943,1.0726319287737258,1.0152068133673531,5.6598915406372741E-2,1.9673984161333639E-2]
["RdsonDRT",0.7,"W","Drain to Source Resistance of pullup Top FET Driver",null,null,18,54,1,2.7,2.7,2.7777777777777777,0.92666192663693037,0.81563753158219698,3.1078187657910985,2.2921812342089019,0,2.7102469841776031,5.1418071006706548E-2,0.1,0.15204349365895167,0.23545427421007167,5.5438715243791628E-4,5.5438715243791628E-4,0.70653597186947781,4.9919307954554753E-3,4.9919307954554753E-3,2.6089726698187761,5.105053793895984E-2,0.36788300488057546,0.55890000000000006,0,0.98792031552925441,0.73396207216891063,4.0402524253686086E-3,2.7216000000000004E-2,3.1281529480439128E-2,2.7216000000000004E-2,8.7480000000000002E-2,2.2036316145731379E-2,1.188E-4,4.9499999999999995E-2,0.50159999999999993,0.48509999999999998,4.9618799999999998E-2,1.3631427727622698,135,0.99000358348271689,52.282855776462725,3.0074964740219565,null,99.000358348271689,0.15204349365895167,1.1066818450096936,1.0456571155292544,6.0149929480439131E-2,2.2036316145731379E-2]
["RdsonDRT2",{"$f":"RdsonDRT2","v":0.5},"W","Drain to Source Resistance of pulldown Top FET Driver",null,null,19,54,1,2.85,2.85,2.9320987654320985,0.9267028090922641,0.81522560950740397,3.2576128047537019,2.4423871952462983,0,2.85969976271398,5.7245179130064758E-2,0.1,0.15796861446060279,0.23533536254968823,5.5382732866393202E-4,5.5382732866393202E-4,0.74530553146255318,5.5548033522867888E-3,5.5548033522867888E-3,2.7529015421867906,5.6838501757308077E-2,0.38832094959616292,0.55890000000000006,0,1.0156045394333333,0.77421949852221172,4.4956187391898871E-3,2.8728000000000004E-2,3.3253517766713099E-2,2.8728000000000004E-2,9.2340000000000005E-2,2.453364819859918E-2,1.188E-4,4.9499999999999995E-2,0.50159999999999993,0.48509999999999998,4.9618799999999998E-2,1.4081557505401991,142.5,0.99021489961290876,53.82744697166666,3.1862858883356546,null,99.021489961290882,0.15796861446060279,1.1411980572000464,1.0765489394333332,6.3725717766713097E-2,2.453364819859918E-2]
["Bottom Driver","Input Value","Units","Description",null,null,20,54,1,3,3,3.0864197530864197,0.92674369086633712,0.81481364731392469,3.4074068236569621,2.5925931763430379,0,3.0092070007430118,6.3387287413245272E-2,0.1,0.16422004446585109,0.23521643930803762,5.5326773320751746E-4,5.5326773320751746E-4,0.7840692096757037,6.1476452556148264E-3,6.1476452556148264E-3,2.8968891859903847,6.2939752169310248E-2,0.40875889431175044,0.55890000000000006,0,1.043737158093117,0.81446904018060684,4.975198630595392E-3,3.0240000000000003E-2,3.5250274053635351E-2,3.0240000000000003E-2,9.7200000000000009E-2,2.7165980319962257E-2,1.188E-4,4.9499999999999995E-2,0.50159999999999993,0.48509999999999998,4.9618799999999998E-2,1.454133169921388,150,0.99039885449484599,55.394457904655845,3.3663137026817682,null,99.039885449484601,0.16422004446585109,1.1761874321467523,1.1078891580931169,6.7326274053635365E-2,2.7165980319962257E-2]
["RdsonDRB",0.7,"W","Drain to Source Resistance of pullup Bottom FET Driver",null,null,21,54,1,3.15,3.15,3.2407407407407405,0.9267845719591663,0.81440164500276169,3.5572008225013807,2.7427991774986191,0,3.1587609654127466,6.9844395856306876E-2,0.1,0.17079874265581185,0.23509750448540925,5.527083661526702E-4,5.527083661526702E-4,0.82282497110263508,6.7704093307005232E-3,6.7704093307005232E-3,3.0409281599405031,6.9354330554393509E-2,0.42919683902733796,0.55890000000000006,0,1.0723252495454916,0.85470858349272139,5.4789507202210068E-3,3.1752000000000002E-2,3.7271792783403916E-2,3.1752000000000002E-2,0.10205999999999998,2.9933312509845801E-2,1.188E-4,4.9499999999999995E-2,0.50159999999999993,0.48509999999999998,4.9618799999999998E-2,1.5010830151914063,157.5,0.99055929062415271,56.984242477274584,3.5475796391701953,null,99.055929062415274,0.17079874265581185,1.2116570423288955,1.1396848495454917,7.0951592783403905E-2,2.9933312509845801E-2]
["RdsonDRB2",0.5,"W","Drain to Source Resistance of pulldown Bottom FET Driver",null,null,22,54,1,3.3,3.3,3.3950617283950617,0.92682545237076897,0.81398960257491948,3.7069948012874594,2.8930051987125402,0,3.3083553199072102,7.6616504459308371E-2,0.1,0.17770571974485044,0.23497855808209314,5.5214922758339618E-4,5.5214922758339618E-4,0.86157114595111284,7.4230483953551373E-3,7.4230483953551373E-3,3.1850123660797283,7.6082278290605918E-2,0.44963478374292548,0.55890000000000006,0,1.1013761026626112,0.89493639476643827,6.0068336300816271E-3,3.3264000000000002E-2,3.9318069049969477E-2,3.3264000000000002E-2,0.10692,3.2835644768275017E-2,1.188E-4,4.9499999999999995E-2,0.50159999999999993,0.48509999999999998,4.9618799999999998E-2,1.5490135338486444,165,0.99069935329557612,58.597165133130559,3.7300834524984743,null,99.069935329557609,0.17770571974485044,1.2476141717125806,1.1719433026626112,7.4601669049969482E-2,3.2835644768275017E-2]
["Deadtime","Input Value","Units","Description",null,null,23,54,1,3.45,3.45,3.5493827160493825,0.92686633210116209,0.81357752003139761,3.8567887600156991,3.0432112399843012,0,3.4579848223724712,8.3703613222308598E-2,0.1,0.18494203857151947,0.23485960009837778,5.5159031758369938E-4,5.5159031758369938E-4,0.90030635119058366,8.1055152599410259E-3,8.1055152599410259E-3,3.3291367600749315,8.3123636754616578E-2,0.470072728458513,0.55890000000000006,0,1.1308972232109278,0.93515103832277069,6.5588059835711707E-3,3.4776000000000001E-2,4.1389098597077796E-2,3.4776000000000001E-2,0.11178000000000002,3.5872977095275115E-2,1.188E-4,4.9499999999999995E-2,0.50159999999999993,0.48509999999999998,4.9618799999999998E-2,1.5979332430523245,172.5,0.99082164151356411,60.233601160546392,3.9138249298538903,null,99.082164151356409,0.18494203857151947,1.2840663218080055,1.2046720232109278,7.8276498597077804E-2,3.5872977095275115E-2]
["Deadtime",{"$f":"Deadtime*1000000000","v":14},"ns","Total Deadtime",null,null,24,54,1,3.6,3.6,3.7037037037037037,0.92690721115036245,0.81316539737320037,4.0065826986866,3.1934173013133997,0,3.6076450994552887,9.1105722145366316E-2,0.1,0.19250881451059318,0.23474063053455313,5.5103163623759581E-4,5.5103163623759581E-4,0.93902943124123073,8.8177627273722924E-3,8.8177627273722924E-3,3.4732971333055795,9.0478447321715672E-2,0.49051067317410052,0.55890000000000006,0,1.160896340167785,0.97535131485788285,7.1348264054625068E-3,3.6288000000000001E-2,4.3484877816359006E-2,3.6288000000000001E-2,0.11664000000000002,3.9045309490871281E-2,1.188E-4,4.9499999999999995E-2,0.50159999999999993,0.48509999999999998,4.9618799999999998E-2,1.6478509363492186,180,0.99092832132141973,61.893937008389258,4.0988038908179512,null,99.092832132141979,0.19250881451059318,1.3210212179841441,1.2378787401677851,8.1976077816359016E-2,3.9045309490871281E-2]
["IQ","Input Value","Units","Description",null,null,25,54,1,3.75,3.75,3.8580246913580245,0.92694808951838736,0.81275323460133042,4.1563766173006655,3.3436233826993349,0,3.7573324737588649,9.8822831228540381E-2,0.1,0.20040721590650115,0.2346216493909086,5.5047318362910443E-4,5.5047318362910443E-4,0.97773941278417487,9.5597435931154308E-3,9.5597435931154308E-3,3.6174899468335684,9.8146751365814494E-2,0.51094861788968804,0.55890000000000006,0,1.1913814123066047,1.0155362144803,7.7348535219073332E-3,3.78E-2,4.5605403745463055E-2,3.78E-2,0.12150000000000001,4.2352641955088734E-2,1.188E-4,4.9499999999999995E-2,0.50159999999999993,0.48509999999999998,4.9618799999999998E-2,1.6987756906904021,187.5,0.99102121203221927,63.578570615330236,4.2850201872731528,null,99.102121203221927,0.20040721590650115,1.3584868160520676,1.2715714123066046,8.5700403745463061E-2,4.2352641955088734E-2]
["IQ ",{"$f":"Iq*1000","v":2.2000000000000001E-3},"mA","Quiescent Current Of Controller (Not Switching!)",null,null,26,54,1,3.9,3.9,4.0123456790123457,0.9269889672052537,0.81234103171679028,4.3061705158583949,3.4938294841416049,0,3.9070438308245565,0.10685494047188959,0.1,0.20863846452847654,0.23450265666773362,5.499149598422495E-4,5.499149598422495E-4,1.0164354699236982,1.0331410645190092E-2,1.0331410645190092E-2,3.7617122034067676,0.10612859025944549,0.53138656260527561,0.55890000000000006,0,1.2223606350622811,1.0557048805063032,8.3588459604362082E-3,3.9312E-2,4.7750674066241547E-2,3.9312E-2,0.12635999999999997,4.579497448795268E-2,1.188E-4,4.9499999999999995E-2,0.50159999999999993,0.48509999999999998,4.9618799999999998E-2,1.7507168737499841,195,0.99110185263074102,65.287911753114059,4.4724737033120769,null,99.110185263074101,0.20863846452847654,1.3964713091285226,1.3057582350622812,8.9449474066241541E-2,4.579497448795268E-2]
["High-side FET","Input Value","Units","Description",null,null,27,54,1,4.05,4.05,4.166666666666667,0.92702984421097845,0.81192878872058261,4.4559643943602909,3.6440356056397087,0,4.0567765154733513,0.11520204987547274,0.1,0.21720383604775415,0.23438365236531758,5.4935696496106047E-4,5.4935696496106047E-4,1.0551168970388876,1.1132716664169704E-2,1.1132716664169704E-2,3.905961347713899,0.11442400537376234,0.55182450732086308,0.55890000000000006,0,1.2538424476890706,1.0958565812464354,9.0067623499584387E-3,4.0823999999999999E-2,4.9920687102975064E-2,4.0823999999999999E-2,0.13122,4.9372307089488317E-2,1.188E-4,4.9499999999999995E-2,0.50159999999999993,0.48509999999999998,4.9618799999999998E-2,1.8036841515584188,202.5,0.99117155346929331,67.022382384453522,4.6611643551487534,null,99.117155346929337,0.21720383604775415,1.4349831347920459,1.3404476476890705,9.3223287102975061E-2,4.9372307089488317E-2]
["RdsonTop",{"$f":"Rdson1*1000","v":7.5},"mW","Drain-Source Resistance of Top FET ",null,null,28,54,1,4.2,4.2,4.3209876543209873,0.92707072053557882,0.81151650561371147,4.6057582528068561,3.7942417471931442,0,4.2065282502209538,0.12386415943934873,0.1,0.22610466053716921,0.23426463648395041,5.4879919906957429E-4,5.4879919906957429E-4,1.0937830874164296,1.1963614423182169E-2,1.1963614423182169E-2,4.0502351878796734,0.1230330380785402,0.57226245203645065,0.55890000000000006,0,1.2858355407239161,1.135990687799979,9.6785613207620216E-3,4.2336000000000006E-2,5.211544182064598E-2,4.2336000000000006E-2,0.13608000000000001,5.3084639759720879E-2,1.188E-4,4.9499999999999995E-2,0.50159999999999993,0.48509999999999998,4.9618799999999998E-2,1.8576874964637038,210,0.9912314369215669,68.78241703619581,4.8510920910322994,null,99.123143692156688,0.22610466053716921,1.4740309825445621,1.3756483407239162,9.7021841820645993E-2,5.3084639759720879E-2]
["RdsonTopTc",{"$f":"RdsonTopTc*1000000","v":4000},"ppm","Drain to Source Resistance Temp Co",null,null,29,54,1,4.3499999999999996,4.3499999999999996,4.4753086419753076,0.92711159617907146,0.8111041823971763,4.755552091198588,3.9444479088014113,0,4.3562970704745538,0.13284126916357628,0.1,0.23534232299352542,0.23414560902392054,5.482416622518266E-4,5.482416622518266E-4,1.1324335162785777,1.2824056687910637E-2,1.2824056687910637E-2,4.1945318331080399,0.1319557297421752,0.59270039675203812,0.55890000000000006,0,1.3183488637688916,1.1761066564170475,1.0374201504513651E-2,4.3847999999999998E-2,5.4334937823256386E-2,4.3847999999999998E-2,0.14093999999999998,5.6931972498675543E-2,1.188E-4,4.9499999999999995E-2,0.50159999999999993,0.48509999999999998,4.9618799999999998E-2,1.9127371954345116,217.49999999999997,0.99128246965110867,70.568463188444568,5.0422568911628192,null,99.128246965110861,0.23534232299352542,1.5136238015921482,1.4113692637688915,0.10084513782325638,5.6931972498675543E-2]
["QgTop",{"$f":"Qg_Q1*1000000000","v":11},"nC","Gate Charge Of Top FET",null,null,30,54,1,4.5,4.5,4.6296296296296298,0.92715247114147392,0.81069181907198118,4.9053459095359901,4.0946540904640099,0,4.5060812726202784,0.14213337904821433,0.1,0.24491826388312077,0.23402656998551788,5.4768435459186498E-4,5.4768435459186498E-4,1.1710677271872014,1.3713996216593976E-2,1.3713996216593976E-2,4.3388496437294739,0.14119212173168538,0.61313834146762569,0.55890000000000006,0,1.3513916336072009,1.2162040143692185,1.1093641534258517E-2,4.5360000000000004E-2,5.6579175352190751E-2,4.5360000000000004E-2,0.14580000000000001,6.0914305306377564E-2,1.188E-4,4.9499999999999995E-2,0.50159999999999993,0.48509999999999998,4.9618799999999998E-2,1.9688438587200758,225,0.99132548844481228,72.380981680360051,5.2346587676095373,null,99.132548844481221,0.24491826388312077,1.5537708089593916,1.4476196336072009,0.10469317535219075,6.0914305306377564E-2]
["QgdTop",{"$f":"Qgd_Q1*1000000000","v":3.9000000000000004},"nC","Gate to Drain Charge",null,null,31,54,1,4.6500000000000004,4.6500000000000004,4.783950617283951,0.92719334542280285,0.81027941563912864,5.0551397078195643,4.2448602921804364,0,4.6558793721076341,0.15174048909332163,0.1,0.25483397971083521,0.23390751936903181,5.4712727617373992E-4,5.4712727617373992E-4,1.2096853210660916,1.463338576002773E-2,1.463338576002773E-2,4.4831871908678229,0.15074225541270989,0.63357628618321327,0.55890000000000006,0,1.3849733426679729,1.256282348541147,1.1836840044420448E-2,4.6872000000000004E-2,5.8848155284623109E-2,4.6872000000000004E-2,0.15066000000000002,6.5031638182852139E-2,1.188E-4,4.9499999999999995E-2,0.50159999999999993,0.48509999999999998,4.9618799999999998E-2,2.0260184288824847,232.50000000000003,0.99136122106001279,74.22044713339865,5.4282977642311563,null,99.136122106001281,0.25483397971083521,1.5944814979525961,1.484408942667973,0.10856595528462312,6.5031638182852139E-2]
["QgsTop",{"$f":"Qgs_Q1*1000000000","v":4.3},"nC",null,null,null,32,{"$f":"Vin","v":54},{"$f":"MODE","v":1},4.8,{"$f":"Iout*G41/100/Number_of_Phases","v":4.8},{"$f":"Vout*K41/(Vin*Efficiency)","v":4.9382716049382713},{"$f":"(Vout+(Rdson2+Rs+Rdcr)*K41)/(Vin+(Rs+Rdson2-Rdson1)*K41)","v":0.92723421902307535},{"$f":"(Vin-(Rdson1+Rdcr)*K41-Vout)*M41/(Fsw*Lf)","v":0.809866972099621},5.2049334860498107,4.395066513950189,{"$f":"IF(MIN(Vin, -P41/(Coss_Q1+Coss_Q2)*0.00000002)<0, 0, MIN(Vin, -P41/(Coss_Q1+Coss_Q2)*0.00000002))","v":0},4.8056900693561326,{"$f":"R41^2*Rdcr","v":0.16166259929895704},{"$f":"Core_Loss_Ch1","v":0.1},{"$f":"(T41+S41*(1+Ltc*(Ta-25)))/(1-S41*Ltc*ThetaCa)","v":0.26509102361320769},0.23378845717475166,5.465704270815069E-4,5.465704270815069E-4,1.2482859472718826,1.5582178061564611E-2,1.5582178061564611E-2,4.6275432236340333,{"$f":"Rdson1*AB41^2","v":0.16060617214950945},{"$f":"(Vin*K41/2)*Fsw*(Tr_buck+Tf_buck)","v":0.65401423089880073},{"$f":"(0.5*Coss_Q1*(Vin-Q41)^2-0.5*Coss_Q2*(Vin-Q41)^2+(Qoss_Q2*(Vin-Q41)/Vin)*Vin)*Fsw","v":0.55890000000000006},{"$f":"IF(K41>N41/2,0,ABS(K41-N41/2)*Vsd_Q1*Deadtime*Fsw)","v":0},{"$f":"(AF41+AE41+AD41+AC41*(1+RdsonTopTc*Ta-RdsonTopTc*25))/(1-AC41*RdsonTopTc*ThetaJA_Q1)","v":1.419103767855969},{"$f":"SQRT((1-M41))*SQRT(K41^2+(N41^2)/12)","v":1.2963412961511687},{"$f":"Rdson2*AH41^2","v":1.260375567080169E-2},{"$f":"IF(K41<N41/2,Deadtime*Fsw*IF(VfdSky_Q2>0,0,Vsd_Q2)*(K41+N41/2),2*Deadtime*Fsw*IF(VfdSky_Q2>0,0,Vsd_Q2)*K41)","v":4.8384000000000003E-2},{"$f":"(AJ41+AI41*(1+RdsonBotTc*Ta-RdsonBotTc*25))/(1-AI41*RdsonBotTc*ThetaJA_Q2)","v":6.1141879131968301E-2},{"$f":"2*Deadtime*Fsw*IF(VfdSky_Q2>0,VfdSky_Q2,Vsd_Q2)*K41","v":4.8384000000000003E-2},{"$f":"IF(QrrSky_Q2>0,QrrSky_Q2,Qrr_Q2*K41/(Iout/Number_of_Phases))*Fsw*Vin","v":0.15552000000000002},{"$f":"Rs*R41^2","v":6.9283971128124455E-2},{"$f":"Iq*Vin","v":1.188E-4},{"$f":"IF(Ext_VCC=1,  (Qg_Q1+Qg_Q2)*Fsw*VCC, (Qg_Q1+Qg_Q2)*Fsw*Vin)","v":4.9499999999999995E-2},0.50159999999999993,{"$f":"(Qg_Q1+Qg_Q2)*Fsw*(Vin-VCC)","v":0.48509999999999998},{"$f":"SUM(AO41:AP41)","v":4.9618799999999998E-2},{"$f":" SUM(U41,X41,AA41,AG41,AK41,AL41,AM41,AS41,AN41)","v":2.084272190217916},{"$f":"Vout*K41","v":240},0.99139030317268939,{"$f":"ThetaJA_Q1*BC41","v":76.087348392798447},{"$f":"ThetaJA_Q2*BD41","v":5.6231739565984151},null,99.139030317268933,{"$f":"U41","v":0.26509102361320769},{"$f":"AG41+AK41+AM41","v":1.6357656469879374},{"$f":"AG41+AM41*0.66","v":1.521746967855969},{"$f":"AK41+AM41*0.33","v":0.1124634791319683},{"$f":"AN41","v":6.9283971128124455E-2}]
["RGateTop",{"$f":"Rgate1","v":1.5},"W","Gate Resistance",null,null,33,54,1,{"$f":"Iout*G42/100","v":4.95},4.95,5.0925925925925926,0.92727509194230839,0.80945448845446044,5.35472724422723,4.5452727557727703,0,4.9555122218333718,0.17189970966517945,0.1,0.27569100597594476,0.23366938340296678,5.4601380739922683E-4,5.4601380739922683E-4,1.2868692962813,1.6560325857115282E-2,1.6560325857115282E-2,4.7719166422583488,0.17078391330496645,0.67445217561438831,0.55890000000000006,0,1.4537929797632045,1.3363805371516462,1.3394347050582917E-2,4.9896000000000003E-2,6.3460349038377162E-2,4.9896000000000003E-2,{"$f":"IF(QrrSky_Q2>0,QrrSky_Q2,Qrr_Q2*K42/(Iout/Number_of_Phases))*Fsw*Vin","v":0.16037999999999999},7.3671304142219771E-2,1.188E-4,4.9499999999999995E-2,0.50159999999999993,0.48509999999999998,4.9618799999999998E-2,2.1436167785842613,247.5,0.99141329225138775,77.982188988160232,5.819287451918858,null,99.141329225138776,0.27569100597594476,1.6776333288015817,1.5596437797632046,0.11638574903837716,7.3671304142219771E-2]
["GfsTop",{"$f":"Gfs_Q1","v":47},"S","Transconductance of Top FET",null,null,34,54,1,5.0999999999999996,5.0999999999999996,5.2469135802469129,0.9273159641805192,0.80904196470464973,5.5045209823523242,4.6954790176476751,0,5.105344821040112,0.18245182019204767,0.1,0.28663559507632824,0.23355029805396663,5.4545741721096646E-4,5.4545741721096646E-4,1.3254350936635462,1.7567781875148934E-2,1.7567781875148934E-2,4.9163064759442472,0.18127552024058508,0.69489012032997566,0.55890000000000006,0,1.4890513522804789,1.3763997879648746,1.4208572822323138E-2,5.1407999999999995E-2,6.5803567779275235E-2,5.1407999999999995E-2,0.16524,7.8193637225163287E-2,1.188E-4,4.9499999999999995E-2,0.50159999999999993,0.48509999999999998,4.9618799999999998E-2,2.2040641916536057,254.99999999999997,0.99143067898798343,79.90548761402394,6.016638388963762,null,99.143067898798336,0.28663559507632824,1.7200949200597542,1.5981097522804788,0.12033276777927523,7.8193637225163287E-2]
["VthTop",{"$f":"Vth_Q1","v":1.6},"V","Threshold Voltage of Top FET",null,null,35,54,1,5.25,5.25,5.4012345679012341,0.92735683573772476,0.80862940085119261,5.654314700425596,4.845685299574404,0,5.2551869734254062,0.19331893087962057,0.1,0.29792651775100559,0.23343120112804094,5.4490125660079907E-4,5.4490125660079907E-4,1.3639830950819771,1.86044988366941E-2,1.86044988366941E-2,5.0607118645040563,0.1920810343164909,0.71532806504556334,0.55890000000000006,0,1.5248895726278107,1.4163987962886577,1.504639162595969E-2,5.2920000000000002E-2,6.8171538759944972E-2,5.2920000000000002E-2,0.1701,8.2850970376980249E-2,1.188E-4,4.9499999999999995E-2,0.50159999999999993,0.48509999999999998,4.9618799999999998E-2,2.2656267996090365,262.5,0.99144289677253383,81.857778631390531,6.2152269379972491,null,99.144289677253383,0.29792651775100559,1.7631611113877554,1.6371555726278106,0.12430453875994497,8.2850970376980249E-2]
["VspTop",{"$f":"Vsp_Q1","v":1.9191489361702128},"V",null,null,null,36,54,1,5.4,5.4,5.5555555555555554,0.92739770661394172,0.80821679689508807,5.8041083984475446,4.9958916015524562,0,5.4050378844708655,0.20450104172795702,0.1,0.3095655600896719,0.23331209262547811,5.4434532565279684E-4,5.4434532565279684E-4,1.4025130821257736,1.967042945533937E-2,1.967042945533937E-2,5.2051320430440757,0.20320049689143144,0.73576600976115092,0.55890000000000006,0,1.5613186518238766,1.456377336764445,1.5907762102808233E-2,5.4432000000000008E-2,7.0564266014150709E-2,5.4432000000000008E-2,0.17496,8.7643303597695871E-2,1.188E-4,4.9499999999999995E-2,0.50159999999999993,0.48509999999999998,4.9618799999999998E-2,2.3283173563063873,270,0.9914503295914685,83.839612591193841,6.4150533007075348,null,99.145032959146846,0.3095655600896719,1.8068429178380274,1.6767922518238767,0.1283010660141507,8.7643303597695871E-2]
["VsdTop",{"$f":"Vsd_Q1","v":0.8},"V",null,null,null,37,54,1,5.55,5.55,5.7098765432098766,0.92743857680918751,0.80780415283734019,5.9539020764186699,5.1460979235813298,0,5.5548968453469145,0.2159981527371157,0.1,0.32155456815517158,0.23319297254656798,5.4378962445104408E-4,5.4378962445104408E-4,1.4410248588152039,2.0765526437233787E-2,2.0765526437233787E-2,5.3495663291245812,0.21463394932277585,0.75620395447673838,0.55890000000000006,0,1.5983499356157151,1.4963352073454859,1.6792642895562433E-2,5.5944000000000001E-2,7.2981754202806323E-2,5.5944000000000001E-2,0.17982000000000001,9.25706368873353E-2,1.188E-4,4.9499999999999995E-2,0.50159999999999993,0.48509999999999998,4.9618799999999998E-2,2.3921490109227133,277.5,0.99145331864657138,85.851556780785756,6.6161177101403164,null,99.145331864657138,0.32155456815517158,1.8511516898185216,1.7170311356157151,0.13232235420280633,9.25706368873353E-2]
["θJATop",{"$f":"ThetaJA_Q1","v":50},"°C/W","Junction to Ambient Resistance",null,null,38,54,1,5.7,5.7,5.8641975308641969,0.92747944632347912,0.80739146867895117,6.1036957343394755,5.2963042656605248,0,5.7047632216690607,0.2278102639071557,0.1,0.33389544873057253,0.23307384089159988,5.4323415307962815E-4,5.4323415307962815E-4,1.4795182486569018,2.1889742481087861E-2,2.1889742481087861E-2,5.4940141119405643,0.2263814329665155,0.77664189919232585,0.55890000000000006,0,1.6359951158911743,1.5362722262365796,1.7700992648294219E-2,5.7456000000000007E-2,7.5424008612685833E-2,5.7456000000000007E-2,0.18468000000000001,9.7632970245923878E-2,1.188E-4,4.9499999999999995E-2,0.50159999999999993,0.48509999999999998,4.9618799999999998E-2,2.4571353201145247,285,0.99145216792973945,87.894195794558712,6.8184204306342924,null,99.14521679297394,0.33389544873057253,1.8960991245038601,1.7578839158911743,0.13636840861268584,9.7632970245923878E-2]
["Low-side FET","Input Value","Units","Description",null,null,39,54,1,5.85,5.85,6.0185185185185182,0.92752031515683331,0.80697874442092288,6.2534893722104608,5.4465106277895385,0,5.8546364439785892,0.23993737523813582,0.1,0.34659017009378723,0.23295469766086302,5.4267891162264098E-4,5.4267891162264098E-4,1.5179930921507581,2.3043030278174198E-2,2.3043030278174198E-2,5.6384748431617968,0.23844298917726336,0.79707984390791342,0.55890000000000006,0,1.6742662425979025,1.5761882293031553,1.8632770006453619E-2,5.8968E-2,7.7891035155175814E-2,5.8968E-2,0.18953999999999996,0.10283030367348678,1.188E-4,4.9499999999999995E-2,0.50159999999999993,0.48509999999999998,4.9618799999999998E-2,2.5232902607101493,292.5,0.99144714894040964,89.96813212989511,7.0219617577587909,null,99.144714894040959,0.34659017009378723,1.9416972777530783,1.7993626425979024,0.14043923515517581,0.10283030367348678]
["RdsonBot",{"$f":"Rdson2*1000","v":7.5},"mW","Drain-Source Resistance of Low-side FET",null,null,40,54,1,6,6,6.1728395061728394,0.92756118330926718,0.80656598006425773,6.4032829900321291,5.5967170099678709,0,6.0045159996469675,0.25237948673011495,0.1,0.35964076282034096,0.23283554285464678,5.4212390016418054E-4,5.4212390016418054E-4,1.5564492446696752,2.4225342512328024E-2,2.4225342512328024E-2,5.782948029142859,0.25081865930825459,0.81751778862350089,0.55890000000000006,0,1.7131757361940818,1.6160830678678457,1.958793361686861E-2,6.0480000000000006E-2,8.0382840365069888E-2,6.0480000000000006E-2,0.19440000000000002,0.10816263717004927,1.188E-4,4.9499999999999995E-2,0.50159999999999993,0.48509999999999998,4.9618799999999998E-2,2.5906282429620342,300,0.99143850469525463,92.073986809704095,7.2267420182534963,null,99.143850469525461,0.35964076282034096,1.9879585765591519,1.8414797361940818,0.14453484036506992,0.10816263717004927]
["RdsonBotTc",{"$f":"RdsonBotTc*1000000","v":4000},"ppm","Drain To Source Resitance Temp Co",null,null,41,54,1,6.15,6.15,6.3271604938271606,0.92760205078079805,0.80615317560995925,6.5530765878049797,5.746923412195021,0,6.1544014259616544,0.26513659838315196,0.1,0.37304932061491058,0.23271637647324084,5.4156911878835165E-4,5.4156911878835165E-4,1.5948865746487386,2.5436631859947868E-2,2.5436631859947868E-2,5.9274332242699712,0.2635084847113463,0.83795573333908846,0.55890000000000006,0,1.7527364006575741,1.6559566068286149,2.0566442127745048E-2,6.1992000000000005E-2,8.289943139940481E-2,6.1992000000000005E-2,0.19926000000000002,0.11362997073563655,1.188E-4,4.9499999999999995E-2,0.50159999999999993,0.48509999999999998,4.9618799999999998E-2,2.6591641243862632,307.5,0.99142645315061573,94.212400032878705,7.432761569970241,null,99.142645315061571,0.37304932061491058,2.034895832056979,1.8842480006575741,0.14865523139940481,0.11362997073563655]
["QgBot",{"$f":"Qg_Q2*1000000000","v":11},"nC","Gate Charge Of Top FET",null,null,42,54,1,6.3,6.3,6.481481481481481,0.92764291757144257,0.80574033105902676,6.7028701655295135,5.8971298344704861,0,6.3042923041970322,0.27820871019730548,0.1,0.38681800117228482,0.23259719851693367,5.4101456757925848E-4,5.4101456757925848E-4,1.6333049620323989,2.6676850989996562E-2,2.6676850989996562E-2,6.071930025255754,0.27651250673701755,0.85839367805467592,0.55890000000000006,0,1.7929614370817495,1.6958087230450203,2.1568254188666865E-2,6.3504000000000005E-2,8.5440816036338643E-2,6.3504000000000005E-2,0.20411999999999997,0.11923230437027378,1.188E-4,4.9499999999999995E-2,0.50159999999999993,0.48509999999999998,4.9618799999999998E-2,2.7289132242182226,315,0.99141119013524448,96.384031854087468,7.6400208018169327,null,99.141119013524445,0.38681800117228482,2.0825222531180883,1.9276806370817494,0.15280041603633865,0.11923230437027378]
["RGateBot",{"$f":"Rgate2","v":1.5},"W","Gate Resistance",null,null,43,54,1,6.45,6.45,6.6358024691358022,0.92768378368121795,0.80532744641246357,6.8526637232062324,6.047336276793768,0,6.4541882545105622,0.29159582217263469,0.1,0.40094902706842139,0.23247800898601489,5.4046024662101624E-4,5.4046024662101624E-4,1.6717042969377554,2.794595256400155E-2,2.794595256400155E-2,6.2164380662280658,0.28983076673436997,0.8788316227702635,0.55890000000000006,0,1.8338644578879486,1.7356393039490563,2.2593328450595734E-2,6.5016000000000004E-2,8.8007002674069287E-2,6.5016000000000004E-2,0.20898000000000003,0.1249696380739863,1.188E-4,4.9499999999999995E-2,0.50159999999999993,0.48509999999999998,4.9618799999999998E-2,2.7998913385150481,322.5,0.99139289187280599,98.589562894397432,7.8485201337034658,null,99.139289187280596,0.40094902706842139,2.1308514605620181,1.9717912578879486,0.15697040267406931,0.1249696380739863]
["VsdBot",{"$f":"Vsd_Q2","v":0.8},"V","Diode Forward Voltage of Bottom FET Body Diode",null,null,44,54,1,6.6,6.6,6.7901234567901234,0.92772464911014108,0.80491452167127187,7.0024572608356355,6.1975427391643638,0,6.6040889315332336,0.30529793430919838,0.1,0.41544468668230555,0.23235880788077384,5.3990615599774374E-4,5.3990615599774374E-4,1.7100844784996974,2.9243889236055819E-2,2.9243889236055819E-2,6.3609570144869139,0.30346330605112704,0.89926956748585096,0.55890000000000006,0,1.8754595016863242,1.7754482463449863,2.3641623565871156E-2,6.6528000000000004E-2,9.059800032979469E-2,6.6528000000000004E-2,0.21384,0.1308419718467993,1.188E-4,4.9499999999999995E-2,0.50159999999999993,0.48509999999999998,4.9618799999999998E-2,2.8721147559372775,330,0.99137171715917649,100.8296950843162,8.0582600164897347,null,99.137171715917646,0.41544468668230555,2.1798975020161189,2.0165939016863241,0.1611652003297947,0.1308419718467993]
["QrrBot",{"$f":"Qrr_Q2*1000000000","v":20},"nC","Reverse Recovery Charge of Body Diode",null,null,45,54,1,6.75,6.75,6.9444444444444446,0.92776551385822914,0.80450155683645341,7.1522507784182263,6.3477492215817737,0,6.7539940205466102,0.31931504660705556,0.1,0.43030733514934111,0.2322395952014997,5.3935229579356444E-4,5.3935229579356444E-4,1.7484454138696579,3.0570613652818397E-2,3.0570613652818397E-2,6.5054865668258302,0.31741016603363498,0.91970751220143854,0.55890000000000006,0,1.9177610488187533,1.8152354553688177,2.471309818821029E-2,6.8040000000000003E-2,9.32138186387136E-2,6.8040000000000003E-2,0.21869999999999998,0.1368493056887381,1.188E-4,4.9499999999999995E-2,0.50159999999999993,0.48509999999999998,4.9618799999999998E-2,2.9456002742441583,337.5,0.99134780924802279,103.10515244093767,8.2692409319356805,null,99.134780924802286,0.43030733514934111,2.2296748674574669,2.0621030488187535,0.1653848186387136,0.1368493056887381]
["TrrBot",{"$f":"Trr_Q2*1000000000","v":40},"ns","Reverse Recovery Time of Body Diode",null,null,46,54,1,6.9,6.9,7.098765432098765,0.92780637792549903,0.80408855190901052,7.3020442759545059,6.4979557240454948,0,6.9039032341574185,0.33364715906626485,0.1,0.44553939534703602,0.23212037094848181,5.3879866609260799E-4,5.3879866609260799E-4,1.7867870173446865,3.1926078453515208E-2,3.1926078453515208E-2,6.6500264463319887,0.33167138802686141,0.940145456917026,0.55890000000000006,0,1.9607840376195236,1.8550008435832057,2.5807710972708033E-2,6.9552000000000003E-2,9.5854467853066977E-2,6.9552000000000003E-2,0.22356000000000004,0.1429916395998278,1.188E-4,4.9499999999999995E-2,0.50159999999999993,0.48509999999999998,4.9618799999999998E-2,3.0203652175390623,345,0.99132129748886655,105.41668188097617,8.4814633926533496,null,99.132129748886655,0.44553939534703602,2.2801985054725904,2.1083336376195234,0.16962926785306698,0.1429916395998278]
["θJABot",{"$f":"ThetaJA_Q2","v":50},"°C/W","Junction to Ambient Resistance",null,null,47,54,1,7.05,7.05,7.2530864197530862,0.92784724131196772,0.80367550688994616,7.4518377534449733,6.6481622465550263,0,7.0538163093957804,0.34829427168688537,0.1,0.46114335891377478,0.23200113512200968,5.3824526697900988E-4,5.3824526697900988E-4,1.8251092096074608,3.3310236269939703E-2,3.3310236269939703E-2,6.7945763995939918,0.34624701337439739,0.96058340163261358,0.55890000000000006,0,2.0045438814317436,1.8947443301876523,2.6925420575836911E-2,7.1064000000000002E-2,9.851995884121971E-2,7.1064000000000002E-2,0.22842000000000001,0.14926897358009372,1.188E-4,4.9499999999999995E-2,0.50159999999999993,0.48509999999999998,4.9618799999999998E-2,3.0964274543037504,352.5,0.99129229875431846,107.76505407158719,8.6949279420609855,null,99.129229875431847,0.46114335891377478,2.3314838402729632,2.1553010814317437,0.17389855884121971,0.14926897358009372]
["Bottom Schottky","Input Value","Units","Std Units",null,null,48,54,1,7.2,7.2,7.4074074074074074,0.9278881040176522,0.80326242178025942,7.6016312108901296,6.7983687891098707,0,7.2037330051754207,0.3632563844689759,0.1,0.47712178730149729,0.23188188772237175,5.3769209853690627E-4,5.3769209853690627E-4,1.8634119170611074,3.4723039726453513E-2,3.4723039726453513E-2,6.9391361942579541,0.36113708341845574,0.98102134634820104,0.55890000000000006,0,2.0490564864197136,1.934465840327229,2.8066185655446992E-2,7.2576000000000002E-2,0.10121030308678254,7.2576000000000002E-2,0.23328000000000004,0.15568130762956112,1.188E-4,4.9499999999999995E-2,0.50159999999999993,0.48509999999999998,4.9618799999999998E-2,3.1738054162625451,360,0.99126091868706001,110.1510643209857,8.9096351543391279,null,99.126091868705998,0.47712178730149729,2.3835467895064961,2.2030212864197138,0.17819270308678256,0.15568130762956112]
["VfdSky",{"$f":"VfdSky_Q2","v":0},"V","Diode Forward Voltage",null,null,49,54,1,7.35,7.35,7.5617283950617278,0.92792896604256969,0.80284929658095394,7.7514246482904765,6.9485753517095228,0,7.3536531000642826,0.37853349741259523,0.1,0.49347731286314361,0.23176262874985773,5.3713916085044381E-4,5.3713916085044381E-4,1.9016950712453096,3.6164441439987031E-2,3.6164441439987031E-2,7.0837056168822823,0.37634163949987193,1.0014592910637887,0.55890000000000006,0,2.0943382702200486,1.9741653044857794,2.9229964870765724E-2,7.4088000000000001E-2,0.10392551268777371,7.4088000000000001E-2,0.23813999999999999,0.1622286417482551,1.188E-4,4.9499999999999995E-2,0.50159999999999993,0.48509999999999998,4.9618799999999998E-2,3.2525181181200593,367.5,0.99122725279216084,112.57553351100242,9.1255856343886865,null,99.122725279216084,0.49347731286314361,2.4364037829078224,2.2515106702200485,0.18251171268777372,0.1622286417482551]
["QrrSky",{"$f":"QrrSky_Q2*1000000000","v":0},"nC","Diode Reverse Recovery Charge",null,null,50,54,1,7.5,7.5,7.716049382716049,0.92796982738673706,0.80243613129303115,7.9012180656465159,7.0987819343534841,0,7.5035763903221762,0.3941256105178027,0.1,0.51021263997575006,0.23164335820475673,5.3658645400377232E-4,5.3658645400377232E-4,1.9399586083223628,3.7634394020040388E-2,3.7634394020040388E-2,7.2282844710494034,0.39186072295810465,1.0218972357793761,0.55890000000000006,0,2.1404061814769948,2.0138426579518134,3.0416716882398182E-2,7.5600000000000001E-2,0.10666560035582098,7.5600000000000001E-2,0.24300000000000002,0.16891097593620116,1.188E-4,4.9499999999999995E-2,0.50159999999999993,0.48509999999999998,4.9618799999999998E-2,3.3325851782188112,375,0.99119138739622714,115.03930907384974,9.3427800177910498,null,99.119138739622713,0.51021263997575006,2.4900717818328157,2.3007861814769948,0.18685560035582099,0.16891097593620116]
["Ireverse",{"$f":"Ireverse","v":0},"mA","Reverse Leakage Current",null,null,51,54,1,7.65,7.65,7.8703703703703702,0.92801068805017128,0.80202292591749291,8.0510114629587477,7.2489885370412539,0,7.6535026881688699,0.41003272378465683,0.1,0.52733054620011965,0.23152407608735792,5.3603397808104703E-4,5.3603397808104703E-4,1.9782024686235702,3.9132850068683875E-2,3.9132850068683875E-2,7.3728725756992359,0.40769437513123413,1.0423351804949637,0.55890000000000006,0,2.1872777203102713,2.0534978403471067,3.1626400352326736E-2,7.7112E-2,0.10943057941540246,7.7112E-2,0.24786000000000002,0.17572831019342436,1.188E-4,4.9499999999999995E-2,0.50159999999999993,0.48509999999999998,4.9618799999999998E-2,3.4140268401659828,382.5,0.9911534004915038,117.54326601551357,9.5612189707701241,null,99.115340049150376,0.52733054620011965,2.544568299725674,2.3508653203102714,0.19122437941540249,0.17572831019342436]
["Controller","Input Value","Units","Std Units",null,null,52,54,1,7.8,7.8,8.0246913580246915,0.92805154803288936,0.80160968045534109,8.2008048402276703,7.3991951597723293,0,7.8034318202516921,0.4262548372132165,0.1,0.5448338834780303,0.23140478239795054,5.3548173316642848E-4,5.3548173316642848E-4,2.0164265962478956,4.0659762180558737E-2,4.0659762180558737E-2,7.5174697636546455,0.42384263735596373,1.0627731252105512,0.55890000000000006,0,2.234970959766827,2.0931307952096088,3.2858973943911074E-2,7.8623999999999999E-2,0.11222046380312718,7.8623999999999999E-2,0.25271999999999994,0.18268064451994992,1.188E-4,4.9499999999999995E-2,0.50159999999999993,0.48509999999999998,4.9618799999999998E-2,3.4968639954816596,390,0.99111336248026161,120.08830798834136,9.7809031901563586,null,99.111336248026163,0.5448338834780303,2.5999114235699543,2.4017661597668272,0.19561806380312718,0.18268064451994992]
["θJA",30,"°C/W","Junction to Ambient Resistance",null,null,53,54,1,7.95,7.95,8.1790123456790127,0.9280924073349085,0.80119639490757899,8.35059819745379,7.5494018025462104,0,7.9533636262863281,0.44279195080354089,0.1,0.56272557936797274,0.23128547713682424,5.3492971934408448E-4,5.3492971934408448E-4,2.0546309387059698,4.2215082942877749E-2,4.2215082942877749E-2,7.6620758803135498,0.44030555096761992,1.0832110699261388,0.55890000000000006,0,2.2835045683112294,2.1327414696234865,3.4114396321888119E-2,8.0135999999999999E-2,0.11503526806705495,8.0135999999999999E-2,0.25757999999999998,0.18976797891580324,1.188E-4,4.9499999999999995E-2,0.50159999999999993,0.48509999999999998,4.9618799999999998E-2,3.5811182073242822,397.5,0.99107133683248305,122.67536841556146,10.001833403352748,null,99.107133683248307,0.56272557936797274,2.6561198363782843,2.4535073683112292,0.20003666806705495,0.18976797891580324]
["Theta Ja",2,"°C/W","Junction to Ambient Resistance",null,null,54,54,1,8.1,8.1,8.3333333333333339,0.92813326595624568,0.80078306927520526,8.5003915346376022,7.6996084653623971,0,8.103297957848385,0.45964406455568863,0.1,0.58100863832045502,0.23116616030426726,5.3437793669818196E-4,5.3437793669818196E-4,2.0928154466035944,4.3798764935426025E-2,4.3798764935426025E-2,7.8066907824861058,0.45708315730015148,1.1036490146417262,0.55890000000000006,0,2.3328978334128867,2.1723298138902098,3.5392626152372049E-2,8.1647999999999998E-2,0.11787500736605501,8.1647999999999998E-2,0.26244000000000001,0.19699031338100939,1.188E-4,4.9499999999999995E-2,0.50159999999999993,0.48509999999999998,4.9618799999999998E-2,3.6668117353525309,405,0.99102738066792873,125.30541167064433,10.224010368302752,null,99.102738066792867,0.58100863832045502,2.713212840778942,2.5061082334128866,0.20448020736605502,0.19699031338100939]
[null,null,null,null,null,null,55,54,1,8.25,8.25,8.4876543209876534,0.92817412389691756,0.80036970355922277,8.6501848517796116,7.8498151482203884,0,8.2532346772966108,0.47681117846971904,0.1,0.59968614299395162,0.23104683190056913,5.338263853128985E-4,5.338263853128985E-4,2.1309800733597193,4.5410760730561946E-2,4.5410760730561946E-2,7.9513143373585757,0.47417549768613032,1.1240869593573137,0.55890000000000006,0,2.3831706862921602,2.2118957812354658,3.6693622102854387E-2,8.3159999999999998E-2,0.12073969746920397,8.3159999999999998E-2,0.26730000000000004,0.20434764791559387,1.188E-4,4.9499999999999995E-2,0.50159999999999993,0.48509999999999998,4.9618799999999998E-2,3.7539675617867849,412.5,0.99098154527204696,127.97943431460801,10.447434873460198,null,99.098154527204699,0.59968614299395162,2.7712103837613644,2.5595886862921602,0.20894869746920397,0.20434764791559387]
[null,null,null,null,null,null,56,54,1,8.4,8.4,8.6419753086419746,0.92821498115694157,0.79995629776063337,8.7999781488803173,8.0000218511196834,0,8.4031736568112905,0.49429329254569071,0.1,0.61876125561260764,0.23092749192601905,5.3327506527241599E-4,5.3327506527241599E-4,2.1691247749545677,4.705102289321704E-2,4.705102289321704E-2,8.0959464215680264,0.49158261345675092,1.1445249040729013,0.55890000000000006,0,2.4343437278914366,2.2514393275474056,3.8017342842203358E-2,8.4672000000000011E-2,0.12362935475522129,8.4672000000000011E-2,0.27216000000000001,0.21183998251958172,1.188E-4,4.9499999999999995E-2,0.50159999999999993,0.48509999999999998,4.9618799999999998E-2,3.8426094187373367,420,0.99093387655382947,130.69846639457182,10.672107737761065,null,99.093387655382941,0.61876125561260764,2.830133082646658,2.6139693278914367,0.2134421547552213,0.21183998251958172]
["Outputs",null,null,null,null,null,57,54,1,8.5500000000000007,8.5500000000000007,8.7962962962962976,0.92825583773633458,0.79954285188043883,8.9497714259402201,8.1502285740597813,0,8.5531147775337431,0.51209040678366258,0.1,0.63823721936686673,0.23080814038090625,5.3272397666092122E-4,5.3272397666092122E-4,2.2072495097042739,4.8719503980897576E-2,4.8719503980897576E-2,8.2405869203743105,0.50930454594183117,1.1649628487884889,0.55890000000000006,0,2.4864382561416436,2.2909604111424384,3.9363747040664476E-2,8.6184000000000011E-2,0.12654399621194484,8.6184000000000011E-2,0.27702000000000004,0.21946731719299825,1.188E-4,4.9499999999999995E-2,0.50159999999999993,0.48509999999999998,4.9618799999999998E-2,3.9327618168710123,427.50000000000006,0.99088441545257444,133.46357280708219,10.898029810597244,null,99.088441545257439,0.63823721936686673,2.8900022523535887,2.6692714561416437,0.21796059621194486,0.21946731719299825]
["Design","Value","Units",null,null,null,58,54,1,8.6999999999999993,8.6999999999999993,8.9506172839506153,0.92829669363511347,0.79912936591964046,9.0995646829598194,8.3004353170401792,0,8.7030579287946974,0.53020252118369371,0.1,0.65811735985822051,0.2306887772655197,5.3217311956260563E-4,5.3217311956260563E-4,2.2453542380587703,5.0416156543684816E-2,5.0416156543684816E-2,8.385235726917573,0.52734133646981163,1.1854007935040762,0.55890000000000006,0,2.5394762945993756,2.3304589925551955,4.0732793369860326E-2,8.7695999999999996E-2,0.12948363943584387,8.7695999999999996E-2,0.28187999999999996,0.22722965193586875,1.188E-4,4.9499999999999995E-2,0.50159999999999993,0.48509999999999998,4.9618799999999998E-2,4.0244500754925561,434.99999999999994,0.99083319829954686,136.27585472996878,11.125201971792192,null,99.083319829954689,0.65811735985822051,2.9508399340352196,2.7255170945993754,0.22250403943584385,0.22722965193586875]
["Dmax",{"$f":"D1_Vinmin","v":0.96153846153846156},"index",null,null,null,59,54,1,8.85,8.85,9.1049382716049383,0.92833754885329522,0.798715839879241,9.2493579199396194,8.4506420800603799,0,8.8530030074210497,0.548629635745843,0.1,0.67840508658933363,0.23056940258014894,5.3162249406166792E-4,5.3162249406166792E-4,2.2834389224202103,5.2140933124235719E-2,5.2140933124235719E-2,8.5298927415511763,0.54569302636775574,1.2058387382196638,0.55890000000000006,0,2.5934806225348548,2.3699350343498238,4.2124440502790253E-2,8.9207999999999996E-2,0.13244830263157009,8.9207999999999996E-2,0.28673999999999994,0.23512698674821844,1.188E-4,4.9499999999999995E-2,0.50159999999999993,0.48509999999999998,4.9618799999999998E-2,4.1177003541222748,442.5,0.99078025713970275,139.13645112674274,11.353625131578504,null,99.078025713970277,0.67840508658933363,3.0126689251664249,2.7827290225348547,0.22707250263157008,0.23512698674821844]
["Dprime",{"$f":"1-B68","v":3.8461538461538436E-2},"index",null,null,null,60,54,1,9,9,9.2592592592592595,0.92837840339089706,0.79830227376023954,9.3991511368801195,8.6008488631198805,0,9.0029499171118488,0.56737175047016974,0.1,0.69910389450084631,0.23045001632508233,5.3107210024230713E-4,5.3107210024230713E-4,2.3215035269795199,5.3893786257783509E-2,5.3893786257783509E-2,8.6745578712412499,0.56435965696135149,1.2262766829352514,0.55890000000000006,0,2.6484748065563921,2.4093885009501332,4.3538647113830473E-2,9.0720000000000009E-2,0.13543800461154717,9.0720000000000009E-2,0.29160000000000003,0.24315932163007276,1.188E-4,4.9499999999999995E-2,0.50159999999999993,0.48509999999999998,4.9618799999999998E-2,4.2125396856568846,450,0.99072562001794962,142.0465403278196,11.583300230577359,null,99.072562001794964,0.69910389450084631,3.0755128111679393,2.8409308065563921,0.23166600461154718,0.24315932163007276]
["Ipp",{"$f":"Iripple_Vinnom","v":0.82482704741933155},"A",null,null,null,61,54,1,9.15,9.15,9.4135802469135808,0.92841925724793595,0.79788866756363885,9.5489443337818205,8.7510556662181802,0,9.1528985678755816,0.58642886535673211,0.1,0.72021736555619897,0.23033061850060937,5.3052193818873259E-4,5.3052193818873259E-4,2.3595480175690118,5.5674668472138533E-2,5.5674668472138533E-2,8.8192310290252074,0.58334126957490762,1.246714627650839,0.55890000000000006,0,2.7044832338628702,2.4488193584864248,4.4975371878733988E-2,9.2232000000000008E-2,0.13845276479559818,9.2232000000000008E-2,0.29646,0.25132665658145659,1.188E-4,4.9499999999999995E-2,0.50159999999999993,0.48509999999999998,4.9618799999999998E-2,4.3089960112064514,457.5,0.99066931123381174,145.0073416931435,11.814228239779908,null,99.066931123381181,0.72021736555619897,3.1393959986584683,2.9001468338628702,0.23628456479559817,0.25132665658145659]
["Top FET","Value","Units",null,null,null,62,54,1,9.3000000000000007,9.3000000000000007,9.567901234567902,0.92846011042442889,0.79747502129044034,9.6987375106452216,8.9012624893547798,0,9.302848875521871,0.60580098040558983,0.1,0.7417491703758895,0.23021120910701914,5.2997200798515689E-4,5.2997200798515689E-4,2.3975723615292428,5.7483532287689106E-2,5.7483532287689106E-2,8.9639121335226424,0.60263790553135843,1.2671525723664265,0.55890000000000006,0,2.7615311472220911,2.488227574657127,4.6434573474630661E-2,9.3744000000000008E-2,0.14149260321061063,9.3744000000000008E-2,0.30132000000000003,0.25962899160239561,1.188E-4,4.9499999999999995E-2,0.50159999999999993,0.48509999999999998,4.9618799999999998E-2,4.4070982167066619,465.00000000000006,0.99061135156786206,148.02011736110455,12.046410160530533,null,99.061135156786207,0.7417491703758895,3.2043437504327019,2.9604023472220913,0.24092820321061065,0.25962899160239561]
["Tr",{"$f":"(Qgd_Q1+Qgs_Q1/2)*(RdsonDRT+Rgate1)/(VCC-Vsp_Q1)*1000000000","v":4.9093577348066297},"ns","Turn on of MOSFET -> Rise time of current",null,null,63,54,1,9.4499999999999993,9.4499999999999993,9.7222222222222214,0.92850096292039264,0.79706133494164499,9.848530667470822,9.0514693325291766,0,9.4528007612014946,0.62548809561680097,0.1,0.76370306992260872,0.2300917881446006,5.294223097157977E-4,5.294223097157977E-4,2.435576527588529,5.9320330217401969E-2,5.9320330217401969E-2,9.1086011084927083,0.62224960615225944,1.2875905170820137,0.55890000000000006,0,2.8196446817796081,2.5276131186035866,4.791621058002711E-2,9.5255999999999993E-2,0.14455754049023933,9.5255999999999993E-2,0.30618000000000001,0.26806632669291469,1.188E-4,4.9499999999999995E-2,0.50159999999999993,0.48509999999999998,4.9618799999999998E-2,4.5068761714124888,472.49999999999994,0.99055175848284216,151.08617408898039,12.279847024511966,null,99.055175848284222,0.76370306992260872,3.2703822222698475,3.0217234817796079,0.24559694049023933,0.26806632669291469]
["Tf",{"$f":"(Qgd_Q1+Qgs_Q1/2)*(RdsonDRT2+Rgate1)/(Vsp_Q1)*1000000000","v":6.3048780487804876},"ns","Turn off of MOSFET -> Fall time of current",null,null,64,{"$f":"Vin","v":54},{"$f":"MODE","v":1},9.6,{"$f":"Iout*G73/100/Number_of_Phases","v":9.6},{"$f":"Vout*K73/(Vin*Efficiency)","v":9.8765432098765427},{"$f":"(Vout+(Rdson2+Rs+Rdcr)*K73)/(Vin+(Rs+Rdson2-Rdson1)*K73)","v":0.92854181473584463},{"$f":"(Vin-(Rdson1+Rdcr)*K73-Vout)*M73/(Fsw*Lf)","v":0.79664760851825489},9.9983238042591278,9.2016761957408715,{"$f":"IF(MIN(Vin, -P73/(Coss_Q1+Coss_Q2)*0.00000002)<0, 0, MIN(Vin, -P73/(Coss_Q1+Coss_Q2)*0.00000002))","v":0},9.6027541509895205,{"$f":"R73^2*Rdcr","v":0.64549021099042525},{"$f":"Core_Loss_Ch1","v":0.1},{"$f":"(T73+S73*(1+Ltc*(Ta-25)))/(1-S73*Ltc*ThetaCa)","v":0.78608291723877954},0.22997235561364304,5.28872843464879E-4,5.28872843464879E-4,2.4735604857537385,6.1185014766822705E-2,6.1185014766822705E-2,9.2532978824329959,{"$f":"Rdson1*AB73^2","v":0.64217641275779225},{"$f":"(Vin*K73/2)*Fsw*(Tr_buck+Tf_buck)","v":1.3080284617976015},{"$f":"(0.5*Coss_Q1*(Vin-Q73)^2-0.5*Coss_Q2*(Vin-Q73)^2+(Qoss_Q2*(Vin-Q73)/Vin)*Vin)*Fsw","v":0.55890000000000006},{"$f":"IF(K73>N73/2,0,ABS(K73-N73/2)*Vsd_Q1*Deadtime*Fsw)","v":0},{"$f":"(AF73+AE73+AD73+AC73*(1+RdsonTopTc*Ta-RdsonTopTc*25))/(1-AC73*RdsonTopTc*ThetaJA_Q1)","v":2.8788509038100467},{"$f":"SQRT((1-M73))*SQRT(K73^2+(N73^2)/12)","v":2.5669759607965763},{"$f":"Rdson2*AH73^2","v":4.9420241874806294E-2},{"$f":"IF(K73<N73/2,Deadtime*Fsw*IF(VfdSky_Q2>0,0,Vsd_Q2)*(K73+N73/2),2*Deadtime*Fsw*IF(VfdSky_Q2>0,0,Vsd_Q2)*K73)","v":9.6768000000000007E-2},{"$f":"(AJ73+AI73*(1+RdsonBotTc*Ta-RdsonBotTc*25))/(1-AI73*RdsonBotTc*ThetaJA_Q2)","v":0.14764759787464612},{"$f":"2*Deadtime*Fsw*IF(VfdSky_Q2>0,VfdSky_Q2,Vsd_Q2)*K73","v":9.6768000000000007E-2},{"$f":"IF(QrrSky_Q2>0,QrrSky_Q2,Qrr_Q2*K73/(Iout/Number_of_Phases))*Fsw*Vin","v":0.31104000000000004},{"$f":"Rs*R73^2","v":0.27663866185303942},{"$f":"Iq*Vin","v":1.188E-4},{"$f":"IF(Ext_VCC=1,  (Qg_Q1+Qg_Q2)*Fsw*VCC, (Qg_Q1+Qg_Q2)*Fsw*Vin)","v":4.9499999999999995E-2},{"$f":"(Vin-VCC)*Fsw*(Qg_Q1+Qg_Q2)+(RdsonDRT+RdsonDRT2)*Fsw*Qg_Q1*VCC/(RdsonDRT+2*Rgate1+RdsonDRT2)+(RdsonDRB+RdsonDRB2)*Fsw*Qg_Q2*VCC/(RdsonDRB+2*Rgate2+RdsonDRB2)","v":0.50159999999999993},{"$f":"(Qg_Q1+Qg_Q2)*Fsw*(Vin-VCC)","v":0.48509999999999998},4.9618799999999998E-2,{"$f":" SUM(U73,X73,AA73,AG73,AK73,AL73,AM73,AS73,AN73)","v":4.6083607683867998},{"$f":"Vout*K73","v":480},0.99049054630200806,{"$f":"ThetaJA_Q1*BC73","v":154.20686519050233},{"$f":"ThetaJA_Q2*BD73","v":12.514539893732307},null,99.0490546302008,{"$f":"U73","v":0.78608291723877954},3.3375385016846932,3.0841373038100466,0.25029079787464614,0.27663866185303942]
["Part Power","Value","Units",null,null,null,65,54,1,{"$f":"Iout*G74/100","v":9.75},9.75,10.030864197530864,0.92858266587080152,0.79623384202127212,{"$f":"K74+N74/2","v":10.148116921010637},{"$f":"K74-N74/2","v":9.3518830789893634},0,{"$f":"SQRT(K74^2+(N74^2)/12)","v":9.7527089755068399},0.66580732652652175,0.1,0.80889265923805942,{"$f":"N74/SQRT(12)","v":0.22985291151443571},{"$f":"RCoutEsr*V74^2","v":5.2832360931663017E-4},{"$f":"W74","v":5.2832360931663017E-4},{"$f":"SQRT(M74*(1-M74))*SQRT(K74^2+(N74^2)/12)","v":2.5115242072111741},{"$f":"RCinEsr*Y74^2","v":6.3077538434077166E-2},{"$f":"Z74","v":6.3077538434077166E-2},{"$f":"SQRT(M74)*SQRT(K74^2+(N74^2)/12)","v":9.3980023882153407},0.66241836666675935,1.328466406513189,0.55890000000000006,0,2.9391778515307743,2.6063160729332928,5.0946626040228163E-2,9.8280000000000006E-2,0.15076279721027833,9.8280000000000006E-2,0.31590000000000001,0.28534599708279501,1.188E-4,4.9499999999999995E-2,0.50159999999999993,0.48509999999999998,4.9618799999999998E-2,4.7115839671053017,487.5,{"$f":"AU74/(AU74+AT74)","v":0.99042772636691911},157.38359257653872,12.750489860513916,null,{"$f":"AV74*100","v":99.042772636691907},0.80889265923805942,{"$f":"AG74+AK74+AM74","v":3.4058406487410529},{"$f":"AG74+AM74*0.66","v":3.1476718515307742},{"$f":"AK74+AM74*0.33","v":0.25500979721027833},{"$f":"AN74","v":0.28534599708279501}]
["Power Dis",{"$f":"AS9","v":4.9618799999999998E-2},"W",null,null,null,66,54,1,9.9,9.9,10.185185185185185,0.9286235163252804,0.79582003545169544,10.297910017725847,9.5020899822741534,0,9.9026651695760943,0.68643944222514874,0.1,0.83213633855244618,0.22973345584726695,5.2777460735528158E-4,5.2777460735528158E-4,2.5494676642364267,6.499785370987142E-2,6.499785370987142E-2,9.5427145627547567,0.68297550919658778,1.3489043512287766,0.55890000000000006,0,3.0006545781064267,2.6456334278436708,5.2495321758928883E-2,9.9792000000000006E-2,0.15390316094968287,9.9792000000000006E-2,0.32075999999999999,0.2941883323822066,1.188E-4,4.9499999999999995E-2,0.50159999999999993,0.48509999999999998,{"$f":"SUM(AO75:AP75)","v":4.9618799999999998E-2},4.8165788383079891,495,0.99036330717659893,160.61780890532134,12.987698047484141,null,99.036330717659894,0.83213633855244618,3.4753177390561096,3.2123561781064267,0.25975396094968284,0.2941883323822066]
["Temp rise",{"$f":"B75*B62","v":1.488564},"°C",null,null,null,67,54,1,10.050000000000001,10.050000000000001,10.339506172839506,0.92866436609929826,0.79540618881052749,10.447703094405265,9.6522969055947367,0,10.052622671908388,0.70738655808636575,0.1,0.85581809543668452,0.22961398861242618,5.2722583766507379E-4,5.2722583766507379E-4,2.5873908301123123,6.69459130774928E-2,6.69459130774928E-2,9.687434346707958,0.70384788166332779,1.3693422959443642,0.55890000000000006,0,3.0633111969819518,2.6849279994051045,5.4066287714921224E-2,0.10130400000000001,0.15706871215135873,0.10130400000000001,0.32562000000000002,0.30316566775129961,1.188E-4,4.9499999999999995E-2,0.50159999999999993,0.48509999999999998,4.9618799999999998E-2,4.9233796112364523,502.50000000000006,0.99029729450974746,163.91101984909758,13.226165607567935,null,99.029729450974742,0.85581809543668452,3.5459999091333101,3.2782203969819519,0.26452331215135871,0.30316566775129961]
["Current (switching)",{"$f":"(Qg_Q1+Qg_Q2)*Fsw+Iq","v":9.9021999999999999E-3},"A",null,null,null,68,54,1,10.199999999999999,10.199999999999999,10.493827160493826,0.92870521519287219,0.79499230209876959,10.597496151049384,9.8025038489506144,0,10.202581424817595,0.72864867411023126,0.1,0.87994216973172756,0.22949450981020247,5.2667730033025125E-4,5.2667730033025125E-4,2.6252936790540304,6.8921669012810466E-2,6.8921669012810466E-2,9.8321616841984678,0.72503552538165339,1.3897802406599513,0.55890000000000006,0,3.1271789296919299,2.7241997624646697,5.5659482593594219E-2,0.10281599999999999,0.16025947447964589,0.10281599999999999,0.33048,0.31227800319009907,1.188E-4,4.9499999999999995E-2,0.50159999999999993,0.48509999999999998,4.9618799999999998E-2,5.0320217234065421,509.99999999999994,0.99022969153147344,167.2647864845965,13.465893723982294,null,99.022969153147343,0.87994216973172756,3.6179184041715757,3.3452957296919301,0.26931787447964589,0.31227800319009907]
["Qrr Current",{"$f":"Qrr_Q2*Fsw","v":9.0000000000000011E-3},"A",null,null,null,69,54,1,10.35,10.35,10.648148148148147,0.92874606360601919,0.7945783753174227,10.74728918765871,9.9527108123412891,0,10.352541373959511,0.75022579029680436,0.1,0.90451290288909458,0.22937501944088476,5.2612899543506256E-4,5.2612899543506256E-4,2.6631761861408303,7.092507398427618E-2,7.092507398427618E-2,9.9768965225656068,0.7465384816648627,1.4102181853755391,0.55890000000000006,0,3.1922901563046784,2.7634486927681112,5.7274865081713366E-2,0.104328,0.16347547220465153,0.104328,0.33533999999999997,0.32152533869863043,1.188E-4,4.9499999999999995E-2,0.50159999999999993,0.48509999999999998,4.9618799999999998E-2,5.142541873076766,517.5,0.99016049888582236,170.68072781523392,13.706883610232575,null,99.016049888582231,0.90451290288909458,3.6911056285093298,3.4136145563046782,0.27413767220465152,0.32152533869863043]
["Diode Current",{"$f":"Deadtime*Fsw*(Iripple_Vinnom/2)*(Vsd_Q2)/Vin","v":3.8491928879568804E-5},null,null,null,null,70,54,1,10.5,10.5,10.802469135802468,0.92878691133875613,0.79416440846748815,10.897082204233744,10.102917795766256,0,10.502502468093324,0.77211790664614455,0.1,0.92953474005802195,0.22925551750476211,5.255809230637629E-4,5.255809230637629E-4,2.7010383272535239,7.2956080452925148E-2,7.2956080452925148E-2,10.121638812134966,0.76835679182487693,1.4306561300911267,0.55890000000000006,0,3.2586784686714418,2.8026747668949059,5.8912393867420608E-2,0.10584,0.16671673020221286,0.10584,0.3402,0.33090767427691908,1.188E-4,4.9499999999999995E-2,0.50159999999999993,0.48509999999999998,4.9618799999999998E-2,5.2549780745845851,525,0.99008971477520857,174.16052343357208,13.949136510110643,null,99.008971477520859,0.92953474005802195,3.7655951988736547,3.4832104686714418,0.27898273020221287,0.33090767427691908]
["Total",{"$f":"SUM(B77:B79)","v":1.894069192887957E-2},"A",null,null,null,71,54,1,10.65,10.65,10.956790123456789,0.92882775839109999,0.7937504015499669,11.046875200774984,10.253124799225017,0,10.652464658863229,0.79432502315831066,0.1,0.95501223223738518,0.22913600400212347,5.2503308330061147E-4,5.2503308330061147E-4,2.7388800790172678,7.5014640872376359E-2,7.5014640872376359E-2,10.266388506008278,0.79049049717224162,1.451094074806714,0.55890000000000006,0,3.3263787266636609,2.8418779621987986,6.0572027640233971E-2,0.107352,0.16998327395389656,0.107352,0.34506000000000003,0.34042500992499025,1.188E-4,4.9499999999999995E-2,0.50159999999999993,0.48509999999999998,4.9618799999999998E-2,5.3693697167356094,532.5,0.99001733502771627,177.70591633318304,14.19265369769483,null,99.001733502771629,0.95501223223738518,3.8414220006175577,3.5541183266636609,0.28385307395389658,0.34042500992499025]
[null,null,null,null,null,null,72,54,1,10.8,10.8,11.111111111111111,0.9288686047630681,0.79333635456586182,11.196668177282932,10.403331822717069,0,10.802427900598227,0.8168471398333611,0.1,0.9809500384944505,0.22901647893325838,5.2448547622987584E-4,5.2448547622987584E-4,2.7767014187491066,7.7100707688833009E-2,7.7100707688833009E-2,10.411145559870763,0.81293963901612509,1.4715320195223018,0.55890000000000006,0,3.3954271175950894,2.8810582567532914,6.225372509104736E-2,0.10886400000000002,0.17327512954703472,0.10886400000000002,0.34992000000000001,0.35007734564286908,1.188E-4,4.9499999999999995E-2,0.50159999999999993,0.48509999999999998,4.9618799999999998E-2,5.4857576244445063,540,0.98994335315309667,181.31871587975448,14.437436477351737,null,98.994335315309669,0.9809500384944505,3.9186222471421241,3.6263743175950895,0.28874872954703473,0.35007734564286908]
[null,null,null,null,null,null,73,54,1,10.95,10.95,11.265432098765432,0.9289094504546771,0.79292226751617079,11.346461133758085,10.553538866241913,0,10.952392150128372,0.83968425667135504,0.1,1.0073529282525944,0.22889694229845484,5.239381019358216E-4,5.239381019358216E-4,2.8145023244098466,7.9214233341084295E-2,7.9214233341084295E-2,10.555909931814314,0.83570425866432052,1.491969964237889,0.55890000000000006,0,3.4658612190405496,2.9202156293016297,6.3957444912131345E-2,0.110376,0.1765923236747986,0.110376,0.35478000000000004,0.35986468143058076,1.188E-4,4.9499999999999995E-2,0.50159999999999993,0.48509999999999998,4.9618799999999998E-2,5.6041841238415424,547.5,0.98986776038818269,185.00080095202748,14.68348618373993,null,98.986776038818263,1.0073529282525944,3.9972335427153478,3.7000160190405498,0.2936697236747986,0.35986468143058076]
[null,null,null,null,null,null,74,54,1,11.1,11.1,11.419753086419753,0.9289502954659441,0.79250814040189621,11.496254070200948,10.703745929799052,0,11.102357366615896,0.86283637367235178,0.1,1.0342257836502069,0.22877739409800227,5.2339096050272639E-4,5.2339096050272639E-4,2.8522827745597912,8.1355170260505011E-2,8.1355170260505011E-2,10.700681582175001,0.85878439742324464,1.5124079089534768,0.55890000000000006,0,3.537720065279327,2.9593500592108022,6.5683145797132331E-2,0.111888,0.17993488363630708,0.111888,0.35964000000000002,0.36978701728815078,1.188E-4,4.9499999999999995E-2,0.50159999999999993,0.48509999999999998,4.9618799999999998E-2,5.7246931110750001,555,0.9897905457323225,188.75412326396633,14.930804181815354,null,98.979054573232247,1.0342257836502069,4.0772949489156343,3.7750824652793269,0.29861608363630709,0.36978701728815078]
[null,null,null,null,null,null,75,54,1,11.25,11.25,11.574074074074074,0.92899113979688619,0.79209397322403929,11.646046986612019,10.853953013387981,0,11.252323511399833,0.88630349083641036,0.1,1.061573601973093,0.22865783433218967,5.2284405201487099E-4,5.2284405201487099E-4,2.8900427483180353,8.3523470871056632E-2,8.3523470871056632E-2,10.845460473383559,0.88218009659793839,1.5328458536690641,0.55890000000000006,0,3.611044217608939,2.9984615264292365,6.7430786441072602E-2,0.1134,0.1833028373367723,0.1134,0.36450000000000005,0.37984435321560445,1.188E-4,4.9499999999999995E-2,0.50159999999999993,0.48509999999999998,4.9618799999999998E-2,5.8473301250574812,562.5,0.98971169597335684,192.58071088044696,15.179391866838616,null,98.971169597335688,1.061573601973093,4.1588470549457117,3.851614217608939,0.3035878373367723,0.37984435321560445]
[null,null,null,null,null,null,76,54,1,11.4,11.4,11.728395061728394,0.92903198344752036,0.79167976598360101,11.795839882991801,11.004160117008199,0,11.402290547852903,0.91008560816358974,0.1,1.0894014981627733,0.228538263001306,5.2229737655654117E-4,5.2229737655654117E-4,2.9277822253249624,8.5719087589287896E-2,8.5719087589287896E-2,10.990246569827674,0.90589139749206715,1.5532837983846517,0.55890000000000006,0,3.685875838794229,3.0375500114478329,6.920032554035048E-2,0.11491200000000001,0.18669621328768218,0.11491200000000001,0.36936000000000002,0.39003668921296702,1.188E-4,4.9499999999999995E-2,0.50159999999999993,0.48509999999999998,4.9618799999999998E-2,5.9721424244234971,570,0.98963119570456115,196.48267193971145,15.429250664384108,null,98.963119570456115,1.0894014981627733,4.2419320520819115,3.929653438794229,0.30858501328768217,0.39003668921296702]
[null,null,null,null,null,null,77,54,1,11.55,11.55,11.882716049382715,0.92907282641786337,0.7912655186815819,11.945632759340791,11.15436724065921,0,11.552258441249538,0.93418272565394844,0.1,1.117714707403181,0.22841868010564009,5.2175093421202737E-4,5.2175093421202737E-4,2.9655011857076716,8.7941972824336065E-2,8.7941972824336065E-2,11.135039837724987,0.92991834140791885,1.5737217431002393,0.55890000000000006,0,3.7622587719376974,3.0766154952640297,7.0991721792740478E-2,0.11642400000000001,0.19011504060701828,0.11642400000000001,0.37422000000000005,0.4003640252802636,1.188E-4,4.9499999999999995E-2,0.50159999999999993,0.48509999999999998,4.9618799999999998E-2,6.09917906898671,577.5,0.98954902733290906,200.46219859688486,15.680382030350914,null,98.954902733290908,1.117714707403181,4.3265938125447159,4.0092439719376971,0.31360764060701829,0.4003640252802636]
[null,null,null,null,null,null,78,54,1,11.7,11.7,12.037037037037036,0.92911366870793244,0.79085123131898483,12.095425615659492,11.304574384340507,0,11.702227158644057,0.95859484330754596,0.1,1.1465185877883597,0.22829908564548146,5.2120472506562879E-4,5.2120472506562879E-4,3.0031996100480303,9.0192078977926415E-2,9.0192078977926415E-2,11.279840245005877,0.95426096964640683,1.5941596878158268,0.55890000000000006,0,3.8402386240798347,3.1156579593486073,7.2804933897392454E-2,0.117936,0.19355934901951,0.117936,0.37907999999999992,0.41082636141751966,1.188E-4,4.9499999999999995E-2,0.50159999999999993,0.48509999999999998,4.9618799999999998E-2,6.228491006008217,585,0.98946517107893417,204.52157120399175,15.9327874509755,null,98.946517107893413,1.1465185877883597,4.412877973099345,4.090431424079835,0.31865574901950999,0.41082636141751966]
[null,null,null,null,null,null,79,54,1,11.85,11.85,12.191358024691358,0.92915451031774454,0.79043690389680732,12.245218451948404,11.454781548051596,0,11.852196668758081,0.98332196112444115,0.1,1.1758186230738505,0.22817947962111804,5.2065874920164225E-4,5.2065874920164225E-4,3.0408774793531892,9.2469358444374067E-2,9.2469358444374067E-2,11.42464776120512,0.97891932350706889,1.6145976325314142,0.55890000000000006,0,3.9198628548630978,3.1546773856150443,7.4639920554832276E-2,0.119448,0.19702916885692537,0.119448,0.38394,0.42142369762476051,1.188E-4,4.9499999999999995E-2,0.50159999999999993,0.48509999999999998,4.9618799999999998E-2,6.3601311616122107,592.5,0.98937960496839983,208.66316274315491,16.18646844284627,null,98.937960496839978,1.1758186230738505,4.5008320237200232,4.1732632548630981,0.32372936885692538,0.42142369762476051]
[null,null,null,null,null,null,80,54,1,12,12,12.345679012345679,0.92919535124731656,0.79002253641605191,12.395011268208027,11.604988731791973,0,12.002166941876389,1.0083640791046931,0.1,1.2056204255146001,0.22805986203283926,5.2011300670437685E-4,5.2011300670437685E-4,3.0785347750282797,9.4773763610584205E-2,9.4773763610584205E-2,11.569462357361679,1.0038934442880665,1.6350355772470018,0.55890000000000006,0,4.0011808706203951,3.1936737563911493,7.6496640466961641E-2,0.12096000000000001,0.20052453105839771,0.12096000000000001,0.38880000000000003,0.43215603390201135,1.188E-4,4.9499999999999995E-2,0.50159999999999993,0.48509999999999998,4.9618799999999998E-2,6.4941545377126921,600,0.98929230481592567,212.88944353101977,16.441426552919886,null,98.929230481592569,1.2056204255146001,4.5905054016787927,4.257788870620395,0.32882853105839771,0.43215603390201135]
[null,null,null,null,null,null,81,54,1,12.15,12.15,12.5,0.9292361914966657,0.78960812887771936,12.544804064438861,11.75519593556114,0,12.152137949750481,1.0337211972483609,0.1,1.2359297387922994,0.22794023288093401,5.1956749765814426E-4,5.1956749765814426E-4,3.1161714788511303,9.7105246856052416E-2,9.7105246856052416E-2,11.714284005925904,1.0291833732861859,1.6554735219625893,0.55890000000000006,0,4.0842441242786531,3.2326470543927854,7.8375052337057646E-2,0.12247200000000001,0.20404546717078761,0.12247200000000001,0.39365999999999995,0.4430233702492975,1.188E-4,4.9499999999999995E-2,0.50159999999999993,0.48509999999999998,4.9618799999999998E-2,6.6306183148447477,607.5,0.98920324420065731,217.20298621393263,16.69766335853938,null,98.920324420065725,1.2359297387922994,4.68194959144944,4.3440597242786527,0.3339532671707876,0.4430233702492975]
[null,null,null,null,null,null,82,54,1,12.3,12.3,12.654320987654321,0.92927703106580861,0.7891936812828102,12.694596840641406,11.905403159358595,0,12.302109665509194,1.0593933155555033,0.1,1.2667524410352089,0.22782059216569112,5.1902222214726158E-4,5.1902222214726158E-4,3.1537875729488567,9.9463760552866404E-2,9.9463760552866404E-2,11.859112680673526,1.0547891517968373,1.6759114666781769,0.55890000000000006,0,4.1691062215004999,3.2715972626995398,8.0275114869773415E-2,0.12398400000000001,0.20759200934908237,0.12398400000000001,0.39852000000000004,0.45402570666664421,1.188E-4,4.9499999999999995E-2,0.50159999999999993,0.48509999999999998,4.9618799999999998E-2,6.7695819613264492,615,0.98911239443400834,221.60647107502501,16.955180467454117,null,98.911239443400831,1.2667524410352089,4.7752182308495827,4.4321294215005,0.33910360934908235,0.45402570666664421]
[null,null,null,null,null,null,83,54,1,12.45,12.45,12.808641975308642,0.92931786995476284,0.78877919363232563,12.844389596816162,12.055610403183836,0,12.452082063575777,1.085380434026179,0.1,1.2980945479336372,0.22770093988739959,5.1847718025605156E-4,5.1847718025605156E-4,3.1913830397760918,0.1018492570657049,0.1018492570657049,12.003948356625859,1.0807108211140548,1.6963494113937645,0.55890000000000006,0,4.255823033522705,3.3105243647321041,8.2196786771136746E-2,0.125496,0.21116419035682871,0.125496,0.40337999999999991,0.46516304315407675,1.188E-4,4.9499999999999995E-2,0.50159999999999993,0.48509999999999998,4.9618799999999998E-2,6.9111073492132089,622.5,0.98901972451944864,226.10269167613524,17.213979517841434,null,98.901972451944857,1.2980945479336372,4.8703672238795344,4.5220538335227047,0.34427959035682865,0.46516304315407675]
[null,null,null,null,null,null,84,54,1,12.6,12.6,12.962962962962962,0.92935870816354482,0.78836466592726717,12.994182332963634,12.205817667036365,0,12.602055119590887,1.1116825526604481,0.1,1.3299622159543769,0.22758127604634856,5.179323720688431E-4,5.179323720688431E-4,3.2289578620948416,0.1042616887518409,0.1042616887518409,12.148791009975707,1.1069484225304991,1.7167873561093518,0.55890000000000006,0,4.3444528171889489,3.3494283442313417,8.4140026748552296E-2,0.12700800000000001,0.21476204356660591,0.12700800000000001,0.40823999999999994,0.47643537971162064,1.188E-4,4.9499999999999995E-2,0.50159999999999993,0.48509999999999998,4.9618799999999998E-2,7.0552588775454623,630,0.98892520110425519,230.69456085944745,17.474062178330296,null,98.892520110425522,1.3299622159543769,4.9674548607555549,4.6138912171889492,0.34948124356660593,0.47643537971162064]
[null,null,null,null,null,null,85,54,1,12.75,12.75,13.117283950617283,0.92939954569217187,0.78795009816863315,13.143975049084316,12.356024950915684,0,12.752028810341004,1.1382996714583691,0.1,1.3623617456575217,0.22746160064282622,5.1738779766996568E-4,5.1738779766996568E-4,3.2665120229556752,0.10670100796113978,0.10670100796113978,12.293640618018481,1.1335019973374536,1.7372253008249394,0.55890000000000006,0,4.4350563427172149,3.3883091852387373,8.6104793510798958E-2,0.12852,0.21838560296052847,0.12852,0.41309999999999997,0.4878427163393011,1.188E-4,4.9499999999999995E-2,0.50159999999999993,0.48509999999999998,4.9618799999999998E-2,7.2021036034333754,637.5,0.9888287884230893,235.38511713586075,17.735430148026424,null,98.882878842308926,1.3623617456575217,5.0665419456777432,4.7077023427172149,0.35470860296052847,0.4878427163393011]
[null,null,null,null,null,null,86,54,1,12.9,12.9,13.271604938271604,0.92944038254066064,0.78753549035742509,13.293767745178712,12.506232254821288,0,12.902003113691856,1.1652317904200005,0.1,1.3952995851192649,0.22734191367712167,5.1684345714375841E-4,5.1684345714375841E-4,3.3040455056802975,0.10916716703606173,0.10916716703606173,12.438497159088129,1.1603715868248261,1.757663245540527,0.55890000000000006,0,4.5276970297890209,3.427166872078292,8.8091045768031784E-2,0.13003200000000001,0.2220349031307908,0.13003200000000001,0.41796000000000005,0.49938505303714309,1.188E-4,4.9499999999999995E-2,0.50159999999999993,0.48509999999999998,4.9618799999999998E-2,7.3517113815694248,645,0.98873044823320877,240.17753148945101,17.998085156539538,null,98.873044823320882,1.3952995851192649,5.1676919329198112,4.8035506297890205,0.35996170313079079,0.49938505303714309]
[null,null,null,null,null,null,87,54,1,13.05,13.05,13.425925925925926,0.92948121870902856,0.78712084249464398,13.443560421247323,12.656439578752678,0,13.051978008526428,1.1924789095454025,0.1,1.4287823334643908,0.22722221514952387,5.1629935057456516E-4,5.1629935057456516E-4,3.3415582938452704,0.11166011831166114,0.11166011831166114,12.583360612497499,1.1875572322811507,1.7781011902561146,0.55890000000000006,0,4.6224410925992236,3.4660013893396018,9.0098742231780368E-2,0.13154400000000002,0.22570997928024261,0.13154400000000002,0.42282000000000003,0.51106238980517249,1.188E-4,4.9499999999999995E-2,0.50159999999999993,0.48509999999999998,4.9618799999999998E-2,7.5041550128112657,652.5,0.98863013974106639,245.07511462996118,18.262028964012131,null,98.863013974106636,1.4287823334643908,5.2709710718794662,4.9015022925992238,0.36524057928024262,0.51106238980517249]
[null,null,null,null,null,null,88,54,1,13.2,13.2,13.580246913580247,0.92952205419729239,0.78670615458129023,13.593353077290644,12.806646922709355,0,13.201953474687171,1.2200410288346326,0.1,1.4628167445123419,0.22710250506032165,5.1575547804673415E-4,5.1575547804673415E-4,3.3790503712668802,0.11417981411558842,0.11417981411558842,12.728230958482721,1.2150589749935847,1.7985391349717019,0.55890000000000006,0,4.7193576945617428,3.5048127218621392,9.2127841614950218E-2,0.13305600000000001,0.22941086722300408,0.13305600000000001,0.42768,0.52287472664341395,1.188E-4,4.9499999999999995E-2,0.50159999999999993,0.48509999999999998,4.9618799999999998E-2,7.6595104025341376,660,0.98852781951998825,250.08132472808714,18.527263361150204,null,98.852781951998821,1.4628167445123419,5.3764485617847466,5.0016264945617426,0.37054526722300407,0.52287472664341395]
[null,null,null,null,null,null,89,54,1,13.35,13.35,13.734567901234568,0.92956288900546913,0.78629142661836449,13.743145713309183,12.956854286690817,0,13.351929492922155,1.2479181482877513,0.1,1.4974097305409269,0.22698278340980382,5.1521183964461914E-4,5.1521183964461914E-4,3.4165217219870025,0.11672620676809034,0.11672620676809034,12.873108178151391,1.2428768562479116,1.8189770796872895,0.55890000000000006,0,4.8185191134290299,3.5436008547205557,9.4178302631821892E-2,0.13456799999999999,0.23313760338511408,0.13456799999999999,0.43253999999999998,0.53482206355189343,1.188E-4,4.9499999999999995E-2,0.50159999999999993,0.48509999999999998,4.9618799999999998E-2,7.8178567295147001,667.5,0.98842344141857041,255.1997756714515,18.793790169255704,null,98.842344141857041,1.4974097305409269,5.4841967168141448,5.1039955134290302,0.37587580338511406,0.53482206355189343]
[null,null,null,null,null,null,90,54,1,13.5,13.5,13.888888888888889,0.92960372313357564,0.78587665860686851,13.892938329303433,13.107061670696567,0,13.501906044834753,1.2761102679048166,0.1,1.5325683661718581,0.22686305019825959,5.1466843545258049E-4,5.1466843545258049E-4,3.453972330259905,0.11929924858201039,0.11929924858201039,13.017992253434159,1.2710109173285382,1.8394150244028771,0.55890000000000006,0,4.9200009176517838,3.5823657732109782,9.625008399805117E-2,0.13608000000000001,0.23689022480521499,0.13608000000000001,0.43739999999999996,0.54690440053063571,1.188E-4,4.9499999999999995E-2,0.50159999999999993,0.48509999999999998,4.9618799999999998E-2,7.9792766261769561,675,0.98831695645936213,260.43424588258921,19.061611240260749,null,98.831695645936207,1.5325683661718581,5.5942911424569992,5.2086849176517838,0.38123222480521501,0.54690440053063571]
[null,null,null,null,null,null,91,54,1,13.65,13.65,14.043209876543209,0.92964455658162926,0.78546185054780004,14.042730925273901,13.2572690747261,0,13.651883112836687,1.3046173876858886,0.1,1.5682998923825426,0.22674330542597698,5.1412526555497887E-4,5.1412526555497887E-4,3.4914021805399211,0.12189889186278917,0.12189889186278917,13.162883167039547,1.2994611995184979,1.8598529691184646,0.55890000000000006,0,5.0238821548812851,3.621107462838193,9.8343144430668411E-2,0.13759200000000002,0.24066876913527269,0.13759200000000002,0.44226000000000004,0.55912173757966654,1.188E-4,4.9499999999999995E-2,0.50159999999999993,0.48509999999999998,4.9618799999999998E-2,8.1438563711071108,682.5,0.9882083127273471,265.78868774406425,19.330728456763634,null,98.820831272734708,1.5682998923825426,5.7068109240165574,5.3157737548812847,0.3866145691352727,0.55912173757966654]
[null,null,null,null,null,null,92,54,1,13.8,13.8,14.19753086419753,0.92968538934964673,0.78504700244216075,14.192523501221082,13.407476498778919,0,13.801860680104101,1.3334395076310255,0.1,1.6046117206486863,0.22662354909324517,5.1358233003618507E-4,5.1358233003618507E-4,3.5288112574699468,0.12452508890846627,0.12452508890846627,13.307780902411679,1.3282277440994474,1.880290913834052,0.55890000000000006,0,5.1302455536005027,3.6598259093036947,0.10045744264807961,0.13910400000000001,0.24447327464133362,0.13910400000000001,0.44712000000000007,0.5714740746990109,1.188E-4,4.9499999999999995E-2,0.50159999999999993,0.48509999999999998,4.9618799999999998E-2,8.3116860948280369,690,0.98809745524765669,271.26723768002512,19.601143732066685,null,98.809745524765674,1.6046117206486863,5.8218388282418365,5.4253447536005028,0.39202287464133367,0.5714740746990109]
[null,null,null,null,null,null,93,54,1,13.95,13.95,14.351851851851851,0.92972622143764505,0.78463211429095114,14.342316057145474,13.557683942854524,0,13.95183873053649,1.3625766277402866,0.1,1.641511437222507,0.22650378120035294,5.1303962898057364E-4,5.1303962898057364E-4,3.566199545870647,0.1271777920096801,0.1271777920096801,13.452685443690761,1.3573105923516695,1.9007288585496396,0.55890000000000006,0,5.2391777389627512,3.6985210984944712,0.10259293737006561,0.14061599999999999,0.24830378020431598,0.14061599999999999,0.45198000000000005,0.58396141188869422,1.188E-4,4.9499999999999995E-2,0.50159999999999993,0.48509999999999998,4.9618799999999998E-2,8.4828599999169292,697.5,0.98798432585187979,276.87422694813756,19.872859010215798,null,98.798432585187982,1.641511437222507,5.9394615191670672,5.5374845389627509,0.39745718020431597,0.58396141188869422]
[null,null,null,null,null,null,94,54,1,14.1,14.1,14.506172839506172,0.92976705284564132,0.78421718609517166,14.492108593047586,13.707891406952413,0,14.101817248718239,1.3920287480137308,0.1,1.6790068075515299,0.2263840017475891,5.1249716247252425E-4,5.1249716247252425E-4,3.6035670307303613,0.12985695344966833,0.12985695344966833,13.597596775676072,1.3867097855540722,1.9211668032652272,0.55890000000000006,0,5.3507694640191552,3.7371930164725131,0.1047495873177819,0.142128,0.25216032532083699,0.142128,0.45684000000000002,0.59658374914874179,1.188E-4,4.9499999999999995E-2,0.50159999999999993,0.48509999999999998,4.9618799999999998E-2,8.657476596652403,705,0.98786886303225063,282.6141932009578,20.145876266041853,null,98.78688630322506,1.6790068075515299,6.0597697893399918,5.6522838640191555,0.40291752532083702,0.59658374914874179]
[null,null,null,null,null,null,95,54,1,14.25,14.25,14.660493827160494,0.92980788357365241,0.78380221785582249,14.641901108927911,13.858098891072089,0,14.251796219882589,1.4217958684514176,0.1,1.7171057808431662,0.22626421073524242,5.1195493059642187E-4,5.1195493059642187E-4,3.6409136971956553,0.13256252550426936,0.13256252550426936,13.742514883791289,1.4164253649841883,1.9416047479808147,0.55890000000000006,0,5.4651158576298506,3.7758416494649976,0.10692735121375914,0.14364000000000002,0.25604295010407629,0.14364000000000002,0.4617,0.60934108647917895,1.188E-4,4.9499999999999995E-2,0.50159999999999993,0.48509999999999998,4.9618799999999998E-2,8.8356389554911363,712.5,0.98775100178290742,288.4918928814925,20.420197505203813,null,98.775100178290742,1.7171057808431662,6.1828588077339273,5.7698378576298506,0.40840395010407626,0.60934108647917895]
[null,null,null,null,null,null,96,54,1,14.4,14.4,{"$f":"Vout*K105/(Vin*Efficiency)","v":14.814814814814815},0.9298487136216953,{"$f":"(Vin-(Rdson1+Rdcr)*K105-Vout)*M105/(Fsw*Lf)","v":0.78338720957390551},14.791693604786953,14.008306395213047,{"$f":"IF(MIN(Vin, -P105/(Coss_Q1+Coss_Q2)*0.00000002)<0, 0, MIN(Vin, -P105/(Coss_Q1+Coss_Q2)*0.00000002))","v":0},14.401775629877855,{"$f":"R105^2*Rdcr","v":1.4518779890534059},0.1,{"$f":"(T105+S105*(1+Ltc*(Ta-25)))/(1-S105*Ltc*ThetaCa)","v":1.7558164947805033},0.22614440816360207,5.1141293343665852E-4,5.1141293343665852E-4,3.6782395305624469,0.1352944604419225,0.1352944604419225,13.887439754051981,{"$f":"Rdson1*AB105^2","v":1.446457371918175},1.9620426926964021,0.55890000000000006,0,{"$f":"(AF105+AE105+AD105+AC105*(1+RdsonTopTc*Ta-RdsonTopTc*25))/(1-AC105*RdsonTopTc*ThetaJA_Q1)","v":5.5823166904798738},3.8144669838550676,{"$f":"Rdson2*AH105^2","v":0.10912618778190282},0.145152,{"$f":"(AJ105+AI105*(1+RdsonBotTc*Ta-RdsonBotTc*25))/(1-AI105*RdsonBotTc*ThetaJA_Q2)","v":0.25995169528467471},0.145152,0.46656000000000009,0.62223342388003111,1.188E-4,4.9499999999999995E-2,0.50159999999999993,0.48509999999999998,4.9618799999999998E-2,{"$f":" SUM(U105,X105,AA105,AG105,AK105,AL105,AM105,AS105,AN105)","v":9.0174549778004405},720,0.98763067342732558,294.51231452399372,20.695824764233738,null,98.763067342732555,1.7558164947805033,6.3088283857645484,5.8902462904798742,0.41391649528467478,0.62223342388003111]
[null,null,null,null,null,null,97,54,1,14.55,14.55,{"$f":"Vout*K106/(Vin*Efficiency)","v":14.969135802469136},0.92988954298978688,{"$f":"(Vin-(Rdson1+Rdcr)*K106-Vout)*M106/(Fsw*Lf)","v":0.78297216125041769},14.941486080625209,14.158513919374792,{"$f":"IF(MIN(Vin, -P106/(Coss_Q1+Coss_Q2)*0.00000002)<0, 0, MIN(Vin, -P106/(Coss_Q1+Coss_Q2)*0.00000002))","v":0},14.551755465135736,{"$f":"R106^2*Rdcr","v":1.4822751098197544},0.1,{"$f":"(T106+S106*(1+Ltc*(Ta-25)))/(1-S106*Ltc*ThetaCa)","v":1.7951472803949604},0.22602459403295588,5.1087117107762514E-4,5.1087117107762514E-4,3.7155445162676872,0.13805271052366883,0.13805271052366883,14.032371373035115,{"$f":"Rdson1*AB106^2","v":1.4768058476308155},1.9824806374119897,0.55890000000000006,0,{"$f":"(AF106+AE106+AD106+AC106*(1+RdsonTopTc*Ta-RdsonTopTc*25))/(1-AC106*RdsonTopTc*ThetaJA_Q1)","v":5.7024766607607491},3.8530690061731838,{"$f":"Rdson2*AH106^2","v":0.11134605574749304},0.14666400000000002,{"$f":"(AJ106+AI106*(1+RdsonBotTc*Ta-RdsonBotTc*25))/(1-AI106*RdsonBotTc*ThetaJA_Q2)","v":0.26388660221166843},0.14666400000000002,0.47142000000000001,0.63526076135132337,1.188E-4,4.9499999999999995E-2,0.50159999999999993,0.48509999999999998,4.9618799999999998E-2,{"$f":" SUM(U106,X106,AA106,AG106,AK106,AL106,AM106,AS106,AN106)","v":9.2030376864134471},727.5,0.98750780543091654,300.68069303803748,20.972760110583422,null,98.750780543091651,1.7951472803949604,6.4377832629724177,6.0136138607607492,0.41945520221166843,0.63526076135132337]
[null,null,null,null,null,null,98,54,1,14.7,14.7,{"$f":"Vout*K107/(Vin*Efficiency)","v":15.123456790123456},0.92993037167794446,{"$f":"(Vin-(Rdson1+Rdcr)*K107-Vout)*M107/(Fsw*Lf)","v":0.78255707288636112},15.091278536443181,14.308721463556818,{"$f":"IF(MIN(Vin, -P107/(Coss_Q1+Coss_Q2)*0.00000002)<0, 0, MIN(Vin, -P107/(Coss_Q1+Coss_Q2)*0.00000002))","v":0},14.701735712641563,{"$f":"R107^2*Rdcr","v":1.5129872307505223},0.1,{"$f":"(T107+S107*(1+Ltc*(Ta-25)))/(1-S107*Ltc*ThetaCa)","v":1.8351066671017273},0.2259047683435931,5.1032964360372469E-4,5.1032964360372469E-4,3.7528286398815371,0.1408372280031511,0.1408372280031511,14.17730972785043,{"$f":"Rdson1*AB107^2","v":1.5074708333955182},2.0029185821275775,0.55890000000000006,0,{"$f":"(AF107+AE107+AD107+AC107*(1+RdsonTopTc*Ta-RdsonTopTc*25))/(1-AC107*RdsonTopTc*ThetaJA_Q1)","v":5.8257057012344919},3.8916477030889989,{"$f":"Rdson2*AH107^2","v":0.11358691383718411},0.148176,{"$f":"(AJ107+AI107*(1+RdsonBotTc*Ta-RdsonBotTc*25))/(1-AI107*RdsonBotTc*ThetaJA_Q2)","v":0.2678477128534586},0.148176,0.47627999999999998,0.64842309889308103,1.188E-4,4.9499999999999995E-2,0.50159999999999993,0.48509999999999998,4.9618799999999998E-2,{"$f":" SUM(U107,X107,AA107,AG107,AK107,AL107,AM107,AS107,AN107)","v":9.3925055377295124},735,0.98738232119767966,307.00252506172461,21.251005642672929,null,98.738232119767972,1.8351066671017273,6.5698334140879506,6.1400505012344917,0.42502011285345859,0.64842309889308103]
[null,null,null,null,null,null,99,54,1,14.85,14.85,{"$f":"Vout*K108/(Vin*Efficiency)","v":15.277777777777777},0.9299711996861848,{"$f":"(Vin-(Rdson1+Rdcr)*K108-Vout)*M108/(Fsw*Lf)","v":0.78214194448273588},15.241070972241367,14.458929027758632,{"$f":"IF(MIN(Vin, -P108/(Coss_Q1+Coss_Q2)*0.00000002)<0, 0, MIN(Vin, -P108/(Coss_Q1+Coss_Q2)*0.00000002))","v":0},14.85171635990635,{"$f":"R108^2*Rdcr","v":1.5440143518457694},0.1,{"$f":"(T108+S108*(1+Ltc*(Ta-25)))/(1-S108*Ltc*ThetaCa)","v":1.8757033879041485},0.22578493109580247,5.0978835109936264E-4,5.0978835109936264E-4,3.7900918871000471,0.14364796512661598,0.14364796512661598,14.322254806113543,{"$f":"Rdson1*AB108^2","v":1.5384523704843187},2.0233565268431648,0.55890000000000006,0,{"$f":"(AF108+AE108+AD108+AC108*(1+RdsonTopTc*Ta-RdsonTopTc*25))/(1-AC108*RdsonTopTc*ThetaJA_Q1)","v":5.9521193095702527},3.930203061403756,{"$f":"Rdson2*AH108^2","v":0.1158487207790059},0.14968800000000002,{"$f":"(AJ108+AI108*(1+RdsonBotTc*Ta-RdsonBotTc*25))/(1-AI108*RdsonBotTc*ThetaJA_Q2)","v":0.27183506979881894},0.14968800000000002,0.48113999999999996,0.66172043650532975,1.188E-4,4.9499999999999995E-2,0.50159999999999993,0.48509999999999998,4.9618799999999998E-2,{"$f":" SUM(U108,X108,AA108,AG108,AK108,AL108,AM108,AS108,AN108)","v":9.5859827572562644},742.5,0.98725413984965837,313.48358547851262,21.530563489940945,null,98.72541398496584,1.8757033879041485,6.7050943793690712,6.269671709570253,0.43061126979881892,0.66172043650532975]
[null,null,null,null,null,null,100,54,1,15,15,{"$f":"Vout*K109/(Vin*Efficiency)","v":15.432098765432098},0.93001202701452501,{"$f":"(Vin-(Rdson1+Rdcr)*K109-Vout)*M109/(Fsw*Lf)","v":0.78172677604054219},15.390863388020271,14.609136611979729,{"$f":"IF(MIN(Vin, -P109/(Coss_Q1+Coss_Q2)*0.00000002)<0, 0, MIN(Vin, -P109/(Coss_Q1+Coss_Q2)*0.00000002))","v":0},15.001697394940511,{"$f":"R109^2*Rdcr","v":1.5753564731055545},0.1,{"$f":"(T109+S109*(1+Ltc*(Ta-25)))/(1-S109*Ltc*ThetaCa)","v":1.9169463847734916},0.22566508228987267,5.092472936489501E-4,5.092472936489501E-4,3.8273342437382363,0.14648487413291336,0.14648487413291336,14.467206595920649,{"$f":"Rdson1*AB109^2","v":1.5697505001678744},2.0437944715587522,0.55890000000000006,0,{"$f":"(AF109+AE109+AD109+AC109*(1+RdsonTopTc*Ta-RdsonTopTc*25))/(1-AC109*RdsonTopTc*ThetaJA_Q1)","v":6.0818389040371903},3.9687350680430855,{"$f":"Rdson2*AH109^2","v":0.11813143530236216},0.1512,{"$f":"(AJ109+AI109*(1+RdsonBotTc*Ta-RdsonBotTc*25))/(1-AI109*RdsonBotTc*ThetaJA_Q2)","v":0.27584871625793494},0.1512,0.48600000000000004,0.67515277418809472,1.188E-4,4.9499999999999995E-2,0.50159999999999993,0.48509999999999998,4.9618799999999998E-2,{"$f":" SUM(U109,X109,AA109,AG109,AK109,AL109,AM109,AS109,AN109)","v":9.783599700683272},750,0.98712317598782406,320.12994520185953,21.811435812896747,null,98.712317598782406,1.9169463847734916,6.8436876202951247,6.4025989040371902,0.43622871625793497,0.67515277418809472]

{"sheet":"Efficiency Plot Management","index":10,"n_rows":2,"n_cols":1,"rows_kept":2,"cut":false,"hidden":true,"merged":[]}
[]
[{"$f":"IF(PLOT_TYPE=1, \"EFF_Ch1\", \"EFF_Ch2\")","v":"EFF_Ch1"}]

{"sheet":"Input Filter Calculations","index":11,"n_rows":97,"n_cols":40,"rows_kept":97,"cut":false,"hidden":true,"merged":[[10,29,10,30],[10,31,10,34],[9,0,11,0],[9,1,10,1],[10,8,10,9],[10,11,10,14],[10,16,10,19],[11,17,11,19]]}
[]
[null,null,null,null,null,null,null,null,null,null,null,null,null,null,null,null,null,null,null,null,null,null,null,null,null,null,null,null,null,"AEF comparison Values"]
[null,null,null,{"$f":"L_infilter*0.000001","v":6.8000000000000005E-7},null,null,null,null,null,null,null,"Lfilter Passive",{"$f":"'Input Filters'!O9*0.000001","v":6.8000000000000005E-7},null,null,null,null,null,null,null,null,null,null,null,null,null,null,null,null,"Lfilter",{"$f":"'Input Filters'!G9*0.000001","v":9.9999999999999995E-7}]
[null,null,null,null,null,null,null,null,null,null,null,"Cfilter Passive",{"$f":"'Input Filters'!O10*0.000001","v":4.6999999999999995E-7},null,null,null,null,null,null,null,null,null,null,null,null,null,null,null,null,"Cinj",{"$f":"'Input Filters'!G10*0.000001","v":9.9999999999999995E-7}]
[null,null,null,null,null,null,null,null,null,null,null,"Cdamp passive",{"$f":"'Input Filters'!O11*0.000001","v":9.9999999999999995E-7},null,null,null,null,null,null,null,null,null,null,null,null,null,null,null,null,"Cdamp",{"$f":"'Input Filters'!G11*0.000001","v":9.9999999999999995E-7}]
[null,null,null,null,null,null,null,null,null,null,null,"Rdamp passive",{"$f":"'Input Filters'!O12","v":0.35},null,null,null,null,null,null,null,null,null,null,null,null,null,null,null,null,"Rdamp",{"$f":"'Input Filters'!G12","v":10}]
[]
[]
[]
["Freq (Hz)","(kHz)",null,null,null,null,null,null,null,null,null,null,null,null,null,null,null,null,null,null,null,null,"AEF",null,null,null,"Passive",null,null,"AEFCompare"]
[null,null,null,null,null,null,null,null,"AEF Numerator",null,null,"AEF Denominator",null,null,null,null,"Passive",null,null,null,null,null,"Magnitude","Phase",null,null,"Magnitude","Phase",null,"AEF Numerator",null,"AEF Denominator"]
[null,null,"jω","-ω^2","-jω^3",null,"Gop",null,null,null,null,null,null,null,null,null,"Numerator","Denominator",null,null,null,null,null,null,null,null,null,null,null,null,null,null,null,null,null,null,null,null,"Magnitude","Phase"]
[1,{"$f":"A13/1000","v":1E-3},{"$f":"COMPLEX(0,2*Pi*A13)","v":"6,2831853i"},{"$f":"COMPLEX(-POWER(2*Pi*A13,2),0)","v":"-39,4784175141361"},{"$f":"COMPLEX(0,-POWER(2*Pi*A13,3))","v":"-248,050212592082i"},null,{"$f":"IMSUM(IMPRODUCT(C13,Rcomp_AEF*Csen_AEF),Csen_AEF/Ccomp_AEF)","v":"100+0,00062831853i"},null,{"$f":"IMPRODUCT((RdampSel*CdampSel+RdampSel*CinjSel),C13)","v":"0,00002011059118971i"},{"$f":"IMSUM(1,I13)","v":"1+0,00002011059118971i"},null,{"$f":"IMPRODUCT(G13,L_infilterStd*RdampSel*CinjSel*CdampSel,E13)","v":"0"},{"$f":"IMPRODUCT(G13,L_infilterStd*CinjSel,D13)","v":"-1,26173022375179E-09-7,92768479444296E-15i"},{"$f":"J13","v":"1+0,00002011059118971i"},{"$f":"IMSUM(L13:N13)","v":"0,99999999873827+0,0000201105911817823i"},0,{"$f":"IMSUM(IMPRODUCT(C13,RdampPssv*CdampPssv),1)","v":"1+0,000002199114855i"},{"$f":"IMPRODUCT(RdampPssv*CdampPssv*CfilterPssv*LinfilterPssv,E13)","v":"-2,77468967805503E-17i"},{"$f":"IMPRODUCT(D13,LinfilterPssv*(CfilterPssv+CdampPssv))","v":"-3,94626261471304E-11"},{"$f":"IMSUM(S13,R13,Q13)","v":"0,999999999960537+2,19911485497225E-06i"},1,{"$f":"CHOOSE(INFILTER_TYPE,U13,IMDIV(J13,O13))","v":1},{"$f":"20*LOG10(IMABS(V13))","v":0},{"$f":"IMARGUMENT(V13)*180/Pi","v":0},null,{"$f":"IMDIV(Q13,T13)","v":"1,00000000003946-5,9033537744459E-17i"},{"$f":"20*LOG10(IMABS(Z13))","v":3.4274512546547312E-10},{"$f":"IMARGUMENT(Z13)*180/Pi","v":-3.3823725662152017E-15},null,{"$f":"IMPRODUCT((RdampCom*CdampCom+RdampCom*CinjCom),C13)","v":"0,000125663706i"},{"$f":"IMSUM(1,AD13)","v":"1+0,000125663706i"},{"$f":"IMPRODUCT(G13,L_infilterStd*RdampSel*CinjSel*CdampSel,E13)","v":"0"},{"$f":"IMPRODUCT(G13,LAEFCom*CinjCom,D13)","v":"-3,94784175141361E-09-2,48050212592082E-14i"},{"$f":"AE13","v":"1+0,000125663706i"},{"$f":"IMSUM(AF13:AH13)","v":"0,999999996052158+0,000125663705975195i"},null,{"$f":"IMDIV(AE13,AI13)","v":"1,00000000394784-4,71295468853202E-13i"},null,{"$f":"20*LOG10(IMABS(AK13))","v":3.429050295758723E-8},{"$f":"IMARGUMENT(AK13)*180/Pi","v":-2.7003241193179047E-11}]
[2,{"$f":"A14/1000","v":2E-3},"12,5663706i","-157,913670056544","-1984,40170073666i",null,"100+0,00125663706i",null,"0,00004022118237942i",{"$f":"IMSUM(1,I14)","v":"1+0,00004022118237942i"},null,"0","-5,04692089500715E-09-6,34214783555435E-14i",{"$f":"J14","v":"1+0,00004022118237942i"},{"$f":"IMSUM(L14:N14)","v":"0,999999994953079+0,0000402211823159985i"},0,"1+0,00000439822971i","-2,21975174244403E-16i","-1,57850504588521E-10",{"$f":"IMSUM(S14,R14,Q14)","v":"0,999999999842149+4,39822970977802E-06i"},1,{"$f":"CHOOSE(INFILTER_TYPE,U14,IMDIV(J14,O14),IMDIV(Q14,T14))","v":1},{"$f":"20*LOG10(IMABS(V14))","v":0},0,null,"1,00000000015785-4,72284395630731E-16i",{"$f":"20*LOG10(IMABS(Z14))","v":1.3710672912527204E-9},-2.7059902626176745E-14,null,"0,000251327412i",{"$f":"IMSUM(1,AD14)","v":"1+0,000251327412i"},"0","-1,57913670056544E-08-1,98440170073665E-13i",{"$f":"AE14","v":"1+0,000251327412i"},{"$f":"IMSUM(AF14:AH14)","v":"0,999999984208633+0,00025132741180156i"},null,{"$f":"IMDIV(AE14,AI14)","v":"1,00000001579137-3,77036329160179E-12i"},null,{"$f":"20*LOG10(IMABS(AK14))","v":1.371620958789241E-7},-2.1602590067533612E-10]
[3,3.0000000000000001E-3,"18,8495559i","-355,305757627225","-6697,35573998623i",null,"100+0,00188495559i",null,"0,00006033177356913i","1+0,00006033177356913i",null,"0","-1,13555720137661E-08-2,1404748944996E-13i","1+0,00006033177356913i","0,999999988644428+0,0000603317733550825i",0,"1+0,000006597344565i","-7,4916621307486E-16i","-3,55163635324174E-10","0,999999999644836+6,59734456425083E-06i",1,1,0,0,null,"1,00000000035516-1,59396947052946E-15i",3.0848797076462865E-9,-9.1327723405961694E-14,null,"0,000376991118i","1+0,000376991118i","0","-3,55305757627225E-08-6,69735573998623E-13i","1+0,000376991118i","0,999999964469424+0,000376991117330264i",null,"1,00000003553057-1,27249747186445E-11i",null,3.0861460467700118E-7,-7.2908732071721767E-10]
[4,4.0000000000000001E-3,"25,1327412i","-631,654680226178","-15875,2136058933i",null,"100+0,00251327412i",null,"0,00008044236475884i","1+0,00008044236475884i",null,"0","-2,01876835800286E-08-5,0737182684435E-13i","1+0,00008044236475884i","0,999999979812316+0,0000804423642514682i",0,"1+0,00000879645942i","-1,77580139395522E-15i","-6,31402018354088E-10","0,999999999368598+0,0000087964594182242i",1,1,0,0,null,"1,0000000006314-3,77830227167012E-15i",5.484271092367277E-9,-2.1648077400206861E-13,null,"0,000502654824i","1+0,000502654824i","0","-6,31654680226178E-08-1,58752136058933E-12i","1+0,000502654824i","0,999999936834532+0,000502654822412479i",null,"1,00000006316546-3,01629023712536E-11i",null,5.486481969408996E-7,-1.728206896549755E-9]
[5,5.0000000000000001E-3,"31,4159265i","-986,960437853402","-31006,2765740103i",null,"100+0,00314159265i",null,"0,00010055295594855i","1+0,00010055295594855i",null,"0","-3,15432555937947E-08-9,90960599305369E-13i","1+0,00010055295594855i","0,999999968456744+0,000100552954957589i",0,"1+0,000010995574275i","-3,46836209756879E-15i","-9,86565653678261E-10","0,999999999013434+0,0000109955742715316i",1,1,0,0,null,"1,00000000098657-7,37945946308484E-15i",8.5692375875376739E-9,-4.2281188238863731E-13,null,"0,00062831853i","1+0,00062831853i","0","-9,86960437853402E-08-3,10062765740103E-12i","1+0,00062831853i","0,999999901303956+0,000628318526899372i",null,"1,00000009869602-5,89119136628583E-11i",null,8.5726269533465554E-7,-3.3754036866389222E-9]
[6,6.0000000000000001E-3,"37,6991118i","-1421,2230305089","-53578,8459198898i",null,"100+0,00376991118i",null,"0,00012066354713826i","1+0,00012066354713826i",null,"0","-4,54222880550644E-08-1,71237991559968E-12i","1+0,00012066354713826i","0,999999954577712+0,00012066354542588i",0,"1+0,00001319468913i","-5,99332970459887E-15i","-1,4206545412967E-09","0,999999998579345+0,0000131946891240067i",1,1,0,0,null,"1,00000000142066-1,27518015159367E-14i",1.2339696260264985E-8,-7.3062440784858933E-13,null,"0,000753982236i","1+0,000753982236i","0","-1,4212230305089E-07-5,35788459198898E-12i","1+0,000753982236i","0,999999857877697+0,000753982230642115i",null,"1,00000014212225-1,01799777989694E-10i",null,1.2344580906194608E-6,-5.8326968118870736E-9]
[7,7.0000000000000001E-3,"43,9822971i","-1934,44245819267","-85081,2229190843i",null,"100+0,00439822971i",null,"0,00014077413832797i","1+0,00014077413832797i",null,"0","-6,18247809638377E-08-2,71919588449394E-12i","1+0,00014077413832797i","0,999999938175219+0,000140774135608774i",0,"1+0,000015393803985i","-9,51718559572877E-15i","-1,93366868120939E-09","0,999999998066331+0,0000153938039754828i",1,1,0,0,null,"1,00000000193367-2,02493221373488E-14i",1.6795643252346658E-8,-1.1602006955531912E-12,null,"0,000879645942i","1+0,000879645942i","0","-1,93444245819267E-07-8,50812229190843E-12i","1+0,000879645942i","0,999999806555754+0,000879645933491878i",null,"1,00000019344414-1,61654261344709E-10i",null,1.6802342889998863E-6,-9.2621051342401712E-9]
[8,8.0000000000000002E-3,"50,2654824i","-2526,61872090471","-127001,708847146i",null,"100+0,00502654824i",null,"0,00016088472951768i","1+0,00016088472951768i",null,"0","-8,07507343201145E-08-4,05897461475479E-12i","1+0,00016088472951768i","0,999999919249266+0,000160884725458705i",0,"1+0,00001759291884i","-1,42064111516417E-14i","-2,52560807341635E-09","0,999999997474392+0,0000175929188257936i",1,1,0,0,null,"1,00000000252561-3,02264148354676E-14i",2.1937169209509332E-8,-1.7318459974888673E-12,null,"0,001005309648i","1+0,001005309648i","0","-2,52661872090471E-07-1,27001708847146E-11i","1+0,001005309648i","0,999999747338128+0,00100530963529983i",null,"1,00000025266169-2,41303125593538E-10i",null,2.1945912779881903E-6,-1.3825647202411687E-8]
[9,8.9999999999999993E-3,"56,5486677i","-3197,75181864502","-180828,604979628i",null,"100+0,00565486677i",null,"0,00018099532070739i","1+0,00018099532070739i",null,"0","-1,02200148123895E-07-5,77928221514891E-12i","1+0,00018099532070739i","0,999999897799852+0,000180995314928108i",0,"1+0,000019792033695i","-2,02274877530212E-14i","-3,19647271791756E-09","0,999999996803527+0,0000197920336747725i",1,1,0,0,null,"1,00000000319647-4,30372020696133E-14i",2.7764185412408903E-8,-2.4658500355761629E-12,null,"0,001130973354i","1+0,001130973354i","0","-3,19775181864502E-07-1,80828604979628E-11i","1+0,001130973354i","0,999999680224818+0,00113097333591714i",null,"1,0000003197749-3,43574130298358E-10i",null,2.777529045400815E-6,-1.9685341343589465E-8]
[10,0.01,"62,831853i","-3947,84175141361","-248050,212592082i",null,"100+0,0062831853i",null,"0,0002011059118971i","1+0,0002011059118971i",null,"0","-1,26173022375179E-07-7,92768479444296E-12i","1+0,0002011059118971i","0,999999873826978+0,000201105903969415i",0,"1+0,00002199114855i","-2,77468967805503E-14i","-3,94626261471304E-09","0,999999996053737+0,0000219911485222531i",1,1,0,0,null,"1,00000000394626-5,90359570729332E-14i",3.4276778649137416E-8,-3.3825111703113878E-12,null,"0,00125663706i","1+0,00125663706i","0","-3,94784175141361E-07-2,48050212592082E-11i","1+0,00125663706i","0,999999605215825+0,00125663703519498i",null,"1,00000039478374-4,71295032915428E-10i",null,3.4290473189900757E-6,-2.7003205661962389E-8]
[20,0.02,"125,663706i","-15791,3670056544","-1984401,70073666i",null,"100+0,0125663706i",null,"0,0004022118237942i","1+0,0004022118237942i",null,"0","-5,04692089500715E-07-6,34214783555435E-11i","1+0,0004022118237942i","0,999999495307911+0,000402211760372722i",0,"1+0,0000439822971i","-2,21975174244403E-13i","-1,57850504588521E-08","0,99999998421495+0,0000439822968780248i",1,1,0,0,null,"1,00000001578505-4,72287580174405E-13i",1.3710720057442979E-7,-2.7060084664215768E-11,null,"0,00251327412i","1+0,00251327412i","0","-1,57913670056544E-06-1,98440170073665E-10i","1+0,00251327412i","0,999998420863299+0,00251327392155983i",null,"1,00000157912972-3,77035132439892E-09i",null,1.3716135643178051E-5,-2.1602487728515923E-7]
[30,0.03,"188,495559i","-35530,5757627225","-6697355,73998623i",null,"100+0,0188495559i",null,"0,0006033177356913i","1+0,0006033177356913i",null,"0","-1,13555720137661E-06-2,1404748944996E-10i","1+0,0006033177356913i","0,999998864442799+0,000603317521643811i",0,"1+0,00006597344565i","-7,4916621307486E-13i","-3,55163635324174E-08","0,999999964483636+0,0000659734449008338i",1,1,0,0,null,"1,00000003551637-1,59397081397336E-12i",3.0849126526975555E-7,-9.1327797168431367E-11,null,"0,00376991118i","1+0,00376991118i","0","-3,55305757627225E-06-6,69735573998623E-10i","1+0,00376991118i","0,999996446942424+0,00376991051026443i",null,"1,00000355302223-1,27248854845565E-08i",null,3.0861104146180268E-5,-7.2907964344928818E-7]
[40,0.04,"251,327412i","-63165,4680226178","-15875213,6058933i",null,"100+0,0251327412i",null,"0,0008044236475884i","1+0,0008044236475884i",null,"0","-2,01876835800286E-06-5,07371826844349E-10i","1+0,0008044236475884i","0,999997981231642+0,000804423140216573i",0,"1+0,0000879645942i","-1,77580139395522E-12i","-6,31402018354088E-08","0,999999936859798+0,0000879645924241986i",1,1,0,0,null,"1,00000006314021-3,77830129983406E-12i",5.4842887803037698E-7,-2.1648070478801279E-10,null,"0,00502654824i","1+0,00502654824i","0","-6,31654680226178E-06-1,58752136058933E-09i","1+0,00502654824i","0,999993683453198+0,00502654665247864i",null,"1,00000631643509-3,01625248040398E-08i",null,5.4863684831035115E-5,-1.7281744568030996E-6]
[50,0.05,"314,159265i","-98696,0437853402","-31006276,5740103i",null,"100+0,0314159265i",null,"0,0010055295594855i","1+0,0010055295594855i",null,"0","-3,15432555937947E-06-9,90960599305369E-10i","1+0,0010055295594855i","0,999996845674441+0,0010055285685249i",0,"1+0,00010995574275i","-3,46836209756879E-12i","-9,86565653678261E-08","0,999999901343435+0,000109955739281638i",1,1,0,0,null,"1,00000009865657-7,37949525076775E-12i",8.5692003703246746E-7,-4.2281389157559421E-10,null,"0,0062831853i","1+0,0062831853i","0","-9,86960437853402E-06-3,10062765740103E-09i","1+0,0062831853i","0,999990130395621+0,00628318219937234i",null,"1,00000986933164-5,89107626360051E-08i",null,8.57235024252127E-5,-3.3753047587949084E-6]
[60,0.06,"376,991118i","-142122,30305089","-53578845,9198898i",null,"100+0,0376991118i",null,"0,0012066354713826i","1+0,0012066354713826i",null,"0","-4,54222880550644E-06-1,71237991559968E-09i","1+0,0012066354713826i","0,999995457771194+0,00120663375900268i",0,"1+0,0001319468913i","-5,99332970459887E-12i","-1,4206545412967E-07","0,999999857934546+0,00013194688530667i",1,1,0,0,null,"1,00000014206547-1,27517683815965E-11i",1.2339649066219747E-6,-7.3062240663248992E-10,null,"0,00753982236i","1+0,00753982236i","0","-0,000014212230305089-5,35788459198898E-09i","1+0,00753982236i","0,999985787769695+0,00753981700211541i",null,"1,00001421166475-1,0179691371395E-07i",null,1.2344007449476715E-4,-5.8324506410981843E-6]
[70,7.0000000000000007E-2,"439,822971i","-193444,245819267","-85081222,9190843i",null,"100+0,0439822971i",null,"0,0014077413832797i","1+0,0014077413832797i",null,"0","-6,18247809638377E-06-2,71919588449394E-09i","1+0,0014077413832797i","0,999993817521904+0,00140773866408382i",0,"1+0,00015393803985i","-9,51718559572877E-12i","-1,93366868120939E-07","0,999999806633132+0,000153938030332814i",1,1,0,0,null,"1,0000001933669-2,02493379799158E-11i",1.6795633910819215E-6,-1.1602013811643187E-9,null,"0,00879645942i","1+0,00879645942i","0","-0,0000193444245819267-8,50812229190843E-09i","1+0,00879645942i","0,999980655575418+0,00879645091187771i",null,"1,00001934337684-1,61648069534687E-07i",null,1.6801281161176417E-4,-9.2615730112609531E-6]
[80,0.08,"502,654824i","-252661,872090471","-127001708,847146i",null,"100+0,0502654824i",null,"0,0016088472951768i","1+0,0016088472951768i",null,"0","-8,07507343201145E-06-4,05897461475479E-09i","1+0,0016088472951768i","0,999991924926568+0,00160884323620219i",0,"1+0,0001759291884i","-1,42064111516417E-11i","-2,52560807341635E-07","0,999999747439193+0,000175929174193589i",1,1,0,0,null,"1,00000025256087-3,02264211687963E-11i",2.1937155666510632E-6,-1.731845927339326E-9,null,"0,01005309648i","1+0,01005309648i","0","-0,0000252661872090471-1,27001708847146E-08i","1+0,01005309648i","0,999974733812791+0,0100530837798291i",null,"1,00002526439982-2,41291053691115E-07i",null,2.1944101684982364E-4,-1.3824609756094254E-5]
[90,0.09,"565,486677i","-319775,181864502","-180828604,979628i",null,"100+0,0565486677i",null,"0,0018099532070739i","1+0,0018099532070739i",null,"0","-0,0000102200148123895-5,77928221514891E-09i","1+0,0018099532070739i","0,999989779985188+0,00180994742779168i",0,"1+0,00019792033695i","-2,02274877530212E-11i","-3,19647271791756E-07","0,999999680352728+0,000197920316722512i",1,1,0,0,null,"1,00000031964737-4,30372335896138E-11i",2.7764213343660625E-6,-2.4658510612183728E-9,null,"0,01130973354i","1+0,01130973354i","0","-0,0000319775181864502-1,80828604979628E-08i","1+0,01130973354i","0,999968022481814+0,0113097154571395i",null,"1,00003197465518-3,43552377337812E-07i",null,2.7772388658268553E-4,-1.968347191340695E-5]
[100,0.1,"628,31853i","-394784,175141361","-248050212,592082i",null,"100+0,062831853i",null,"0,002011059118971i","1+0,002011059118971i",null,"0","-0,0000126173022375179-7,92768479444295E-09i","1+0,002011059118971i","0,999987382697762+0,00201105119128621i",0,"1+0,0002199114855i","-2,77468967805503E-11i","-3,94626261471305E-07","0,999999605373739+0,000219911457753103i",1,1,0,0,null,"1,0000003946264-5,90359940073355E-11i",3.4276806823585146E-6,-3.382511965016509E-9,null,"0,0125663706i","1+0,0125663706i","0","-0,0000394784175141361-2,48050212592082E-08i","1+0,0125663706i","0,999960521582486+0,0125663457949787i",null,"1,00003947405389-4,71258194387049E-07i",null,3.4286050961765565E-4,-2.7000039829157664E-5]
[200,0.2,"1256,63706i","-1579136,70056544","-1984401700,73666i",null,"100+0,125663706i",null,"0,004022118237942i","1+0,004022118237942i",null,"0","-0,0000504692089500715-6,34214783555435E-08i","1+0,004022118237942i","0,99994953079105+0,00402205481646364i",0,"1+0,000439822971i","-2,21975174244403E-10i","-1,57850504588521E-06","0,999998421494954+0,000439822749024826i",1,1,0,0,null,"1,00000157850733-4,72289004721146E-10i",1.3710729639650269E-5,-2.7060123997272546E-8,null,"0,0251327412i","1+0,0251327412i","0","-0,000157913670056544-1,98440170073665E-07i","1+0,0251327412i","0,999842086329943+0,0251325427598299i",null,"1,00015784386687-3,76917276718269E-06i",null,1.3709062776326368E-3,-2.1592360984343289E-4]
[300,0.3,"1884,95559i","-3553057,57627225","-6697355739,98623i",null,"100+0,188495559i",null,"0,006033177356913i","1+0,006033177356913i",null,"0","-0,000113555720137661-2,1404748944996E-07i","1+0,006033177356913i","0,999886444279862+0,00603296330942355i",0,"1+0,0006597344565i","-7,4916621307486E-10i","-3,55163635324174E-06","0,999996448363647+0,000659733707333787i",1,1,0,0,null,"1,00000355164792-1,59398129480179E-09i",3.084916708360373E-5,-9.1328076554125626E-8,null,"0,0376991118i","1+0,0376991118i","0","-0,000355305757627225-6,69735573998623E-07i","1+0,0376991118i","0,999644694242373+0,037698442064426i",null,"1,00035495250321-0,0000127159388502096i",null,3.0825319276416713E-3,-7.2831111360382875E-4]
[400,0.4,"2513,27412i","-6316546,80226177","-15875213605,8933i",null,"100+0,251327412i",null,"0,008044236475884i","1+0,008044236475884i",null,"0","-0,000201876835800286-5,07371826844349E-07i","1+0,008044236475884i","0,9997981231642+0,00804372910405716i",0,"1+0,000879645942i","-1,77580139395522E-09i","-6,31402018354087E-06","0,999993685979816+0,000879644166198606i",1,1,0,0,null,"1,00000631405673-3,77834562794476E-09i",5.4843026783634755E-5,-2.1648189139136651E-7,null,"0,0502654824i","1+0,0502654824i","0","-0,000631654680226177-1,58752136058933E-06i","1+0,0502654824i","0,999368345319774+0,0502638948786394i",null,"1,00063053877112-0,0000301248416450087i",null,5.4750681759544841E-3,-1.7249386455159413E-3]
[500,0.5,"3141,59265i","-9869604,37853402","-31006276574,0103i",null,"100+0,314159265i",null,"0,010055295594855i","1+0,010055295594855i",null,"0","-0,000315432555937947-9,90960599305369E-07i","1+0,010055295594855i","0,999684567444062+0,0100543046342557i",0,"1+0,0010995574275i","-3,46836209756879E-09i","-9,86565653678261E-06","0,999990134343463+0,0010995539591379i",1,1,0,0,null,"1,00000986574575-7,37963050952798E-09i",8.5692356072072088E-5,-4.228175116350063E-7,null,"0,062831853i","1+0,062831853i","0","-0,000986960437853402-3,10062765740103E-06i","1+0,062831853i","0,999013039562147+0,0628287523723426i",null,"1,00098423777278-0,0000587958328047741i",null,8.5447912994648569E-3,-3.3654406788073783E-3]
[600,0.6,"3769,91118i","-14212230,305089","-53578845919,8898i",null,"100+0,376991118i",null,"0,012066354713826i","1+0,012066354713826i",null,"0","-0,000454222880550644-1,71237991559968E-06i","1+0,012066354713826i","0,999545777119449+0,0120646423339104i",0,"1+0,001319468913i","-5,99332970459887E-09i","-0,000014206545412967","0,999985793454587+0,0013194629196703i",1,1,0,0,null,"1,00001420673042-1,27521054564846E-08i",1.2339721601309145E-4,-7.3063144351324126E-7,null,"0,0753982236i","1+0,0753982236i","0","-0,0014212230305089-5,35788459198898E-06i","1+0,0753982236i","0,998578776969491+0,075392865715408i",null,"1,00141558167171-0,000101511144268809i",null,1.2286936300638407E-2,-5.8079385155581347E-3]
[700,0.7,"4398,22971i","-19344424,5819267","-85081222919,0843i",null,"100+0,439822971i",null,"0,014077413832797i","1+0,014077413832797i",null,"0","-0,000618247809638377-2,71919588449394E-06i","1+0,014077413832797i","0,999381752190362+0,0140746946369125i",0,"1+0,0015393803985i","-9,51718559572877E-09i","-0,0000193366868120939","0,999980663313188+0,0015393708813144i",1,1,0,0,null,"1,00001933702955-2,02500661951286E-08i",1.6795768070547058E-4,-1.1602208939414706E-6,null,"0,0879645942i","1+0,0879645942i","0","-0,00193444245819267-8,50812229190843E-06i","1+0,0879645942i","0,998065557541807+0,0879560860777081i",null,"1,00192400067453-0,000161030951761084i",null,1.669571367825648E-2,-9.2086763384969812E-3]
[800,0.8,"5026,54824i","-25266187,2090471","-127001708847,146i",null,"100+0,502654824i",null,"0,016088472951768i","1+0,016088472951768i",null,"0","-0,000807507343201145-4,05897461475479E-06i","1+0,016088472951768i","0,999192492656799+0,0160844139771532i",0,"1+0,001759291884i","-1,42064111516417E-08i","-0,0000252560807341635","0,999974743919266+0,00175927767758885i",1,1,0,0,null,"1,00002525666544-3,02278400042037E-08i",2.1937383832667357E-4,-1.7318839164039424E-6,null,"0,1005309648i","1+0,1005309648i","0","-0,00252661872090471-0,0000127001708847146i","1+0,1005309648i","0,997473381279095+0,100518264629115i",null,"1,00250882422347-0,000240089099932661i",null,2.1764329689366806E-2,-1.3721666636319331E-2]
[900,0.9,"5654,86677i","-31977518,1864502","-180828604979,628i",null,"100+0,565486677i",null,"0,018099532070739i","1+0,018099532070739i",null,"0","-0,00102200148123895-5,77928221514891E-06i","1+0,018099532070739i","0,998977998518761+0,0180937527885239i",0,"1+0,0019792033695i","-2,02274877530212E-08i","-0,0000319647271791756","0,999968035272821+0,00197918314201225i",1,1,0,0,null,"1,00003196566377-4,30397908600739E-08i",2.7764579017865241E-4,-2.4659195454707077E-6,null,"0,1130973354i","1+0,1130973354i","0","-0,00319775181864502-0,0000180828604979628i","1+0,1130973354i","0,996802248181355+0,113079252539502i",null,"1,00316928239546-0,000341388900845323i",null,2.7485009967052262E-2,-1.949834669139414E-2]
[1000,1,"6283,1853i","-39478417,5141361","-248050212592,082i",null,"100+0,62831853i",null,"0,02011059118971i","1+0,02011059118971i",null,"0","-0,00126173022375179-7,92768479444296E-06i","1+0,02011059118971i","0,998738269776248+0,0201026635049156i",0,"1+0,002199114855i","-2,77468967805503E-08i","-0,0000394626261471304","0,999960537373853+0,00219908710810322i",1,1,0,0,null,"1,00003946405367-5,90403247598128E-08i",3.4277365128982361E-4,-3.3826279414737456E-6,null,"0,125663706i","1+0,125663706i","0","-0,00394784175141361-0,0000248050212592082i","1+0,125663706i","0,996052158248586+0,125638900978741i",null,"1,00390450750254-0,000467599017146001i",null,3.3849026334450388E-2,-2.6687247721115491E-2]
[2000,2,"12566,3706i","-157913670,056544","-1984401700736,66i",null,"100+1,25663706i",null,"0,04022118237942i","1+0,04022118237942i",null,"0","-0,00504692089500715-0,0000634214783555435i","1+0,04022118237942i","0,994953079104993+0,0401577609010645i",0,"1+0,00439822971i","-2,21975174244403E-07i","-0,000157850504588521","0,999842149495412+0,00439800773482576i",1,1,0,0,null,"1,00015787334724-4,72427600959129E-07i",1.3711622397485389E-3,-2.7063835033150666E-5,null,"0,251327412i","1+0,251327412i","0","-0,0157913670056544-0,000198440170073665i","1+0,251327412i","0,984208632994346+0,251128971829926i",null,"1,01511228483668-0,00365440036023725i",null,0.13033795641275839,-0.20626369726729271]
[3000,3,"18849,5559i","-355305757,627225","-6697355739986,23i",null,"100+1,88495559i",null,"0,06033177356913i","1+0,06033177356913i",null,"0","-0,0113555720137661-0,00021404748944996i","1+0,06033177356913i","0,988644427986234+0,06011772607968i",0,"1+0,006597344565i","-7,4916621307486E-07i","-0,000355163635324174","0,999644836364676+0,00659659539878692i",1,1,0,0,null,"1,00035527929582-1,59503405307709E-06i",3.0853687138606856E-3,-9.135626253668961E-5,null,"0,376991118i","1+0,376991118i","0","-0,0355305757627225-0,000669735573998623i","1+0,376991118i","0,964469424237278+0,376321382426001i",null,"1,032207105914-0,0118723173174254i",null,0.27591139401100195,-0.65897984797945142]
[4000,4,"25132,7412i","-631654680,226177","-15875213605893,3i",null,"100+2,51327412i",null,"0,08044236475884i","1+0,08044236475884i",null,"0","-0,0201876835800286-0,000507371826844349i","1+0,08044236475884i","0,979812316419971+0,0799349929319956i",0,"1+0,00879645942i","-1,77580139395522E-06i","-0,000631402018354087","0,999368597981646+0,00879468361860604i",1,1,0,0,null,"1,00063176764934-3,78278365967147E-06i",5.4857314697180446E-3,-2.1660069744338419E-4,null,"0,502654824i","1+0,502654824i","0","-0,0631654680226177-0,00158752136058933i","1+0,502654824i","0,936834531977382+0,501067302639411i",null,"1,05313156008286-0,0267229326851488i",null,0.4524479795061449,-1.4535532215637728]
[5000,5,"31415,9265i","-986960437,853402","-31006276574010,3i",null,"100+3,14159265i",null,"0,10055295594855i","1+0,10055295594855i",null,"0","-0,0315432555937947-0,000990960599305369i","1+0,10055295594855i","0,968456744406205+0,0995619953492446i",0,"1+0,010995574275i","-3,46836209756879E-06i","-0,000986565653678261","0,999013434346322+0,0109921059129024i",1,1,0,0,null,"1,00098745857977-7,39318105431537E-06i",8.5727245740982051E-3,-4.2318019914624398E-4,null,"0,62831853i","1+0,62831853i","0","-0,0986960437853402-0,00310062765740103i","1+0,62831853i","0,90130395621466+0,625217902342599i",null,"1,07554039988132-0,0489608221446789i",null,0.64152495616497218,-2.6064229165320709]
[6000,6,{"$f":"COMPLEX(0,2*Pi*A45)","v":"37699,1118i"},{"$f":"COMPLEX(-POWER(2*Pi*A45,2),0)","v":"-1421223030,5089"},{"$f":"COMPLEX(0,-POWER(2*Pi*A45,3))","v":"-53578845919889,8i"},null,{"$f":"IMSUM(IMPRODUCT(C45,Rcomp_AEF*Csen_AEF),Csen_AEF/Ccomp_AEF)","v":"100+3,76991118i"},null,{"$f":"IMPRODUCT((RdampSel*CdampSel+RdampSel*CinjSel),C45)","v":"0,12066354713826i"},"1+0,12066354713826i",null,{"$f":"IMPRODUCT(G45,L_infilterStd*RdampSel*CinjSel*CdampSel,E45)","v":"0"},{"$f":"IMPRODUCT(G45,L_infilterStd*CinjSel,D45)","v":"-0,0454222880550644-0,00171237991559968i"},"1+0,12066354713826i","0,954577711944936+0,11895116722266i",0,{"$f":"IMSUM(IMPRODUCT(C45,RdampPssv*CdampPssv),1)","v":"1+0,01319468913i"},{"$f":"IMPRODUCT(RdampPssv*CdampPssv*CfilterPssv*LinfilterPssv,E45)","v":"-5,99332970459887E-06i"},{"$f":"IMPRODUCT(D45,LinfilterPssv*(CfilterPssv+CdampPssv))","v":"-0,0014206545412967"},"0,998579345458703+0,0131886958002954i",1,{"$f":"CHOOSE(INFILTER_TYPE,U45,IMDIV(J45,O45),IMDIV(Q45,T45))","v":1},0,{"$f":"IMARGUMENT(V45)*180/Pi","v":0},null,{"$f":"IMDIV(Q45,T45)","v":"1,00142250680344-0,000012785844067251i"},1.2346958077157324E-2,{"$f":"IMARGUMENT(Z45)*180/Pi","v":-7.3153429085745297E-4},null,{"$f":"IMPRODUCT((RdampCom*CdampCom+RdampCom*CinjCom),C45)","v":"0,753982236i"},"1+0,753982236i",{"$f":"IMPRODUCT(G45,L_infilterStd*RdampSel*CinjSel*CdampSel,E45)","v":"0"},{"$f":"IMPRODUCT(G45,LAEFCom*CinjCom,D45)","v":"-0,14212230305089-0,00535788459198898i"},"1+0,753982236i","0,85787769694911+0,748624351408011i",null,"1,09714233215486-0,0785254483841624i",null,0.82745005273081085,{"$f":"IMARGUMENT(AK45)*180/Pi","v":-4.0938332284652752}]
[7000,7,"43982,2971i","-1934442458,19267","-85081222919084,3i",null,"100+4,39822971i",null,"0,14077413832797i","1+0,14077413832797i",null,"0","-0,0618247809638377-0,00271919588449394i","1+0,14077413832797i","0,938175219036162+0,138054942443476i",0,"1+0,015393803985i","-9,51718559572877E-06i","-0,00193366868120939","0,998066331318791+0,0153842867994043i",1,1,0,0,null,"1,00193710173868-0,0000203230411399365i",1.680917841515581E-2,-1.1621732375608322E-3,null,"0,879645942i","1+0,879645942i","0","-0,193444245819267-0,00850812229190843i","1+0,879645942i","0,806555754180733+0,871137819708092i",null,"1,11595982410557-0,114696182593257i",null,0.99860654182809094,-5.8681444123703139]
[8000,8,"50265,4824i","-2526618720,90471","-127001708847146i",null,"100+5,02654824i",null,"0,16088472951768i","1+0,16088472951768i",null,"0","-0,0807507343201145-0,00405897461475479i","1+0,16088472951768i","0,919249265679886+0,156825754902925i",0,"1+0,01759291884i","-0,0000142064111516418i","-0,00252560807341635","0,997474391926584+0,0175787124288484i",1,1,0,0,null,"1,00253146769905-0,0000303702348632679i",2.1960268903701091E-2,-1.7356924326137229E-3,null,"1,005309648i","1+1,005309648i","0","-0,252661872090471-0,0127001708847146i","1+1,005309648i","0,747338127909529+0,992609477115285i",null,"1,13047787639307-0,156305963009907i",null,1.1474831668084364,-7.872111887186036]
[9000,9,"56548,6677i","-3197751818,64502","-180828604979628i",null,"100+5,65486677i",null,"0,18099532070739i","1+0,18099532070739i",null,"0","-0,102200148123895-0,00577928221514891i","1+0,18099532070739i","0,897799851876105+0,175216038492241i",0,"1+0,019792033695i","-0,0000202274877530212i","-0,00319647271791756","0,996803527282082+0,019771806207247i",1,1,0,0,null,"1,00320586412249-0,0000432966329094656i",2.7801250322054171E-2,-2.4727869152797537E-3,null,"1,130973354i","1+1,130973354i","0","-0,319775181864502-0,0180828604979628i","1+1,130973354i","0,680224818135498+1,11289049350204i",null,"1,13968899635933-0,201956311993631i",null,1.2700021815613578,-10.048671571412687]
[10000,10,"62831,853i","-3947841751,41361","-248050212592082i",null,"100+6,2831853i",null,"0,2011059118971i","1+0,2011059118971i",null,"0","-0,126173022375179-0,00792768479444296i","1+0,2011059118971i","0,873826977624821+0,193178227102657i",0,"1+0,02199114855i","-0,0000277468967805503i","-0,00394626261471305","0,996053737385287+0,0219634016532194i",1,1,0,0,null,"1,0039605858368-0,0000594757476545141i",3.4333281589256678E-2,-3.394266041884357E-3,null,"1,25663706i","1+1,25663706i","0","-0,394784175141361-0,0248050212592082i","1+1,25663706i","0,605215824858639+1,23183203874079i",null,"1,14306193658665-0,250197118999478i",null,1.3646346140011791,-12.346373457561011]
[11000,11,"69115,0383i","-4776888519,21047","-330154832960062i",null,"100+6,91150383i",null,"0,22121650308681i","1+0,22121650308681i",null,"0","-0,152669357073967-0,0105517484614036i",{"$f":"J50","v":"1+0,22121650308681i"},{"$f":"IMSUM(L50:N50)","v":"0,847330642926033+0,210664754625406i"},0,"1+0,024190263405i","-0,0000369311196149125i","-0,00477497776380279",{"$f":"IMSUM(S50,R50,Q50)","v":"0,995225022236197+0,0241533322853851i"},1,1,0,0,null,"1,00479596336193-0,0000792859658181959i",4.1557660533084087E-2,-4.5210683336785549E-3,null,"1,382300766i","1+1,382300766i","0","-0,477688851921047-0,0330154832960062i","1+1,382300766i","0,522311148078953+1,34928528270399i",null,"1,1404664032261-0,299656187441126i",null,1.4315770260471383,-14.721639743100599]
[12000,12,"75398,2236i","-5684892122,0356","-428630767359119i",null,"100+7,53982236i",null,"0,24132709427652i","1+0,24132709427652i",null,"0","-0,181689152220258-0,0136990393247974i",{"$f":"J51","v":"1+0,24132709427652i"},{"$f":"IMSUM(L51:N51)","v":"0,818310847779742+0,227628054951723i"},0,"1+0,02638937826i","-0,000047946637636791i","-0,00568261816518679",{"$f":"IMSUM(S51,R51,Q51)","v":"0,994317381834813+0,0263414316223632i"},1,1,0,0,null,"1,00571236324959-0,000103111129481765i",4.9475824752593413E-2,-5.8742765248443194E-3,null,"1,507964472i","1+1,507964472i","0","-0,56848921220356-0,0428630767359119i","1+1,507964472i","0,43151078779644+1,46510139526409i",null,"1,13208078901019-0,349119131643989i",null,1.4720965707233038,-17.139088569805107]
[13000,13,"81681,4089i","-6671852559,889","-544966317064805i",null,"100+8,16814089i",null,"0,26143768546623i","1+0,26143768546623i",null,"0","-0,213232407814052-0,0174171234933912i",{"$f":"J52","v":"1+0,26143768546623i"},{"$f":"IMSUM(L52:N52)","v":"0,786767592185948+0,244020561972839i"},0,"1+0,028588493115i","-0,0000609599322268691i","-0,00666918381886504",{"$f":"IMSUM(S52,R52,Q52)","v":"0,993330816181135+0,0285275331827731i"},1,1,0,0,null,"1,00671018846073-0,00013134112988737i",5.808935257490936E-2,-7.4751328348372729E-3,null,"1,633628178i","1+1,633628178i","0","-0,6671852559889-0,0544966317064805i","1+1,633628178i","0,3328147440111+1,57913154629352i",null,"1,11830126965405-0,397568429739991i",null,1.4880568505564558,-19.570860716239107]
[15000,15,"94247,7795i","-8882643940,68062","-837169467498278i",null,"100+9,42477795i",null,"0,30165886784565i","1+0,30165886784565i",null,"0","-0,283889300344153-0,026755936181245i",{"$f":"J53","v":"1+0,30165886784565i"},{"$f":"IMSUM(L53:N53)","v":"0,716110699655847+0,274902931664405i"},0,"1+0,032986722825i","-0,0000936457766343574i","-0,00887909088310435",{"$f":"IMSUM(S53,R53,Q53)","v":"0,991120909116896+0,0328930770483656i"},1,1,0,0,null,"1,00895191127968-0,00020260911556929i",7.7409522394356958E-2,-1.1505649516535831E-2,null,"1,88495559i","1+1,88495559i","0","-0,888264394068062-0,0837169467498278i","1+1,88495559i","0,111735605931938+1,80123864325017i",null,"1,07677284136923-0,48837844858316i",null,1.4549265148801958,-24.397026703211008]
[16000,16,"100530,9648i","-10106474883,6188","-1016013670777170i",null,"100+10,05309648i",null,"0,32176945903536i","1+0,32176945903536i",null,"0","-0,323002937280457-0,0324717969180382i",{"$f":"J54","v":"1+0,32176945903536i"},{"$f":"IMSUM(L54:N54)","v":"0,676997062719543+0,289297662117322i"},0,"1+0,03518583768i","-0,000113651289213134i","-0,0101024322936654",{"$f":"IMSUM(S54,R54,Q54)","v":"0,989897567706335+0,0350721863907869i"},1,1,0,0,null,"1,01019680079824-0,000246462681525396i",8.8120034652894183E-2,-1.3978732840646416E-2,null,"2,010619296i","1+2,010619296i","0","-1,01064748836188-0,101601367077717i","1+2,010619296i","-0,0106474883618799+1,90901792892228i",null,"1,05026748328463-0,529687382965538i",null,1.410201299755701,-26.763440052318561]
[17500,17.5,"109955,74275i","-12090265363,7042","-1329394108110690i",null,"100+10,995574275i",null,"0,351935345819925i","1+0,351935345819925i",null,"0","-0,386404881023986-0,0424874356952178i","1+0,351935345819925i","0,613595118976014+0,309447910124707i",0,"1+0,0384845099625i","-0,000148706024933262i","-0,0120854292575587","0,987914570742441+0,0383358039375667i",1,1,0,0,null,"1,01222071263725-0,000323696833892721i",0.10550484102978921,-1.8322547228315767E-2,null,"2,199114855i","1+2,199114855i","0","-1,20902653637042-0,132939410811069i","1+2,199114855i","-0,20902653637042+2,06617544418893i",null,"1,00509127575334-0,585666987530125i",null,1.3136657623189221,-30.229368068378868]
[19000,19,"119380,5207i","-14251708722,6031","-1701376408169090i",null,"100+11,93805207i",null,"0,38210123260449i","1+0,38210123260449i",null,"0","-0,455484610774395-0,0543759900050841i","1+0,38210123260449i","0,544515389225605+0,327725242599406i",0,"1+0,041783182245i","-0,000190315965017794i","-0,0142460080391141","0,985753991960886+0,0415928662799822i",1,1,0,0,null,"1,01443433812182-0,000415975520938413i",0.12447955922984369,-2.3494512681856306E-2,null,"2,387610414i","1+2,387610414i","0","-1,42517087226031-0,170137640816909i","1+2,387610414i","-0,42517087226031+2,21747277318309i",null,"0,955145637394447-0,634100278835996i",null,1.1872304101453335,-33.579313338061688]
[20000,20,"125663,706i","-15791367005,6544","-1984401700736660i",null,"100+12,5663706i",null,"0,4022118237942i","1+0,4022118237942i",null,"0","-0,504692089500715-0,0634214783555435i","1+0,4022118237942i","0,495307910499285+0,338790345438656i",0,"1+0,0439822971i","-0,000221975174244403i","-0,0157850504588521","0,984214949541148+0,0437603219257556i",1,1,0,0,null,"1,01601657935512-0,000486596443905099i",0.13801689257265934,-2.744041881657654E-2,null,"2,51327412i","1+2,51327412i","0","-1,57913670056544-0,198440170073665i","1+2,51327412i","-0,57913670056544+2,31483394992634i",null,"0,920057687958595-0,662181049220824i",null,1.0889971113148,-35.743202548086629]
[25000,25,"157079,6325i","-24674010946,3351","-3875784571751290i",null,"100+15,70796325i",null,"0,50276477974275i","1+0,50276477974275i",null,"0","-0,78858138984487-0,123870074913171i","1+0,50276477974275i","0,21141861015513+0,378894704829579i",0,"1+0,054977871375i","-0,000433545262196099i","-0,0246641413419566","0,975335858658043+0,0545443261128039i",1,1,0,0,null,"1,02523378537434-0,000966656304033977i",0.21646204909008521,-5.4022127344881758E-2,null,"3,14159265i","1+3,14159265i","0","-2,46740109463351-0,387578457175129i","1+3,14159265i","-1,46740109463351+2,75401419282487i",null,"0,737799633925998-0,756222678833395i",null,0.47750204333977153,-45.70648831057828]
[30000,30,"188495,559i","-35530575762,7225","-6697355739986230i",null,"100+18,8495559i",null,"0,6033177356913i","1+0,6033177356913i",null,"0","-1,13555720137661-0,21404748944996i","1+0,6033177356913i","-0,13555720137661+0,38927024624134i",0,"1+0,06597344565i","-0,00074916621307486i","-0,0355163635324174","0,964483636467583+0,0652242794369251i",1,1,0,0,null,"1,03670887459481-0,00170572482425677i",0.31314808208663503,-9.4270192682177109E-2,null,"3,76991118i","1+3,76991118i","0","-3,55305757627225-0,669735573998623i","1+3,76991118i","-2,55305757627225+3,10017560600138i",null,"0,566322803257668-0,788940703467892i",null,-0.25419713919222264,-54.328200462835866]
[35000,35,"219911,4855i","-48361061454,8167","-10635152864885500i",null,"100+21,99114855i",null,"0,70387069163985i","1+0,70387069163985i",null,"0","-1,54561952409594-0,339899485561742i","1+0,70387069163985i","-0,54561952409594+0,363971206078108i",0,"1+0,076969019925i","-0,00118964819946609i","-0,0483417170302348","0,951658282969765+0,0757793717255339i",1,1,0,0,null,"1,05057619978726-0,00277724104542023i",0.42858150735745315,-0.15146337803870516,null,"4,39822971i","1+4,39822971i","0","-4,83610614548167-1,06351528648855i","1+4,39822971i","-3,83610614548167+3,33471442351145i",null,"0,41921044508987-0,782116677299459i",null,-1.0378038016062252,-61.808924675077051]
[40000,40,"251327,412i","-63165468022,6178","-15875213605893300i",null,"100+25,1327412i",null,"0,8044236475884i","1+0,8044236475884i",null,"0","-2,01876835800286-0,50737182684435i","1+0,8044236475884i","-1,01876835800286+0,29705182074405i",0,"1+0,0879645942i","-0,00177580139395522i","-0,0631402018354088","0,936859798164591+0,0861887928060448i",1,1,0,0,null,"1,06700286965865-0,00426861635465528i",0.56338125510820847,-0.22921437604912545,null,"5,02654824i","1+5,02654824i","0","-6,31654680226178-1,58752136058933i","1+5,02654824i","-5,31654680226178+3,43902687941067i",null,"0,298556215795346-0,752331454537946i",null,-1.8366692340590198,-68.354776184826349]
[45000,45,"282743,3385i","-79943795466,1256","-22603575622453500i",null,"100+28,27433385i",null,"0,90497660353695i","1+0,90497660353695i",null,"0","-2,55500370309737-0,722410276893614i","1+0,90497660353695i","-1,55500370309737+0,182566326643336i",0,"1+0,098960168475i","-0,00252843596912765i","-0,0799118179479392","0,920088182052061+0,0964317325058724i",1,1,0,0,null,"1,08619356566251-0,00628565719175738i",0.71828994959670589,-0.33155932819996564,null,"5,65486677i","1+5,65486677i","0","-7,99437954661256-2,26035756224535i","1+5,65486677i","-6,99437954661256+3,39450920775465i",null,"0,201858085193628-0,710521584942778i",null,-2.6313550144756443,-74.140233708338556]
[50000,50,"314159,265i","-98696043785,3402","-31006276574010300i",null,"100+31,4159265i",null,"1,0055295594855i","1+1,0055295594855i",null,"0","-3,15432555937947-0,990960599305369i","1+1,0055295594855i","-2,15432555937947+0,0145689601801311i",0,"1+0,10995574275i","-0,00346836209756879i","-0,0986565653678261","0,901343434632174+0,106487380652431i",1,1,0,0,null,"1,10839666057698-0,00895831050462997i",0.89418785513768861,-0.46306726345210286,null,"6,2831853i","1+6,2831853i","0","-9,86960437853402-3,10062765740103i","1+6,2831853i","-8,86960437853402+3,18255764259897i",null,"0,125306037022006-0,663433380236561i",null,-3.4118237294483897,-79.304252936556608]
[55000,55,"345575,1915i","-119422212980,262","-41269354120007700i",null,"100+34,55751915i",null,"1,10608251543405i","1+1,10608251543405i",null,"0","-3,81673392684917-1,31896855767545i","1+1,10608251543405i","-2,81673392684917-0,2128860422414i",0,"1+0,120951317025i","-0,00461638995186406i","-0,11937444409507","0,88062555590493+0,116334927073136i",1,1,0,0,null,"1,1339119415625-0,0124482487823856i",1.0921099587044569,-0.628976061964027,null,"6,91150383i","1+6,91150383i","0","-11,9422212980262-4,12693541200078i","1+6,91150383i","-10,9422212980262+2,78456841799922i",null,"0,0651313254047545-0,615061696793639i",null,-4.1731976284511543,-83.955249656096086]
[60000,60,"376991,118i","-142122303050,89","-53578845919889800i",null,"100+37,6991118i",null,"1,2066354713826i","1+1,2066354713826i",null,"0","-4,54222880550644-1,71237991559968i","1+1,2066354713826i","-3,54222880550644-0,50574444421708i",0,"1+0,1319468913i","-0,00599332970459887i","-0,14206545412967","0,85793454587033+0,125953561595401i",1,1,0,0,null,"1,1631003258263-0,0169590294511739i",1.3132667689997053,-0.83536384612322845,null,"7,53982236i","1+7,53982236i","0","-14,212230305089-5,35788459198898i","1+7,53982236i","-13,212230305089+2,18193776801102i",null,"0,0180633657330593-0,567686836127938i",null,-4.9134286749267133,-88.177506638453309]
[65000,65,"408407,0445i","-166796313997,225","-68120789633100600i",null,"100+40,84070445i",null,"1,30718842733115i","1+1,30718842733115i",null,"0","-5,33081019535131-2,1771404366739i","1+1,30718842733115i","-4,33081019535131-0,86995200934275i",0,"1+0,142942465575i","-0,00761999152835863i","-0,166729595471626","0,833270404528374+0,135322474046641i",1,1,0,0,null,"1,19639605981863-0,0227498889631618i",1.5590695347266561,-1.0893679748558442,null,"8,16814089i","1+8,16814089i","0","-16,6796313997225-6,81207896331006i","1+8,16814089i","-15,6796313997225+1,35606192668994i",null,"-0,0185842434899328-0,522546867726625i",null,-5.6320053178456675,-92.036851125435149]
[70000,70,"439822,971i","-193444245819,267","-85081222919084300i",null,"100+43,9822971i",null,"1,4077413832797i","1+1,4077413832797i",null,"0","-6,18247809638377-2,71919588449394i","1+1,4077413832797i","-5,18247809638377-1,31145450121424i",0,"1+0,15393803985i","-0,00951718559572877i","-0,193366868120939","0,806633131879061+0,144420854254271i",1,1,0,0,null,"1,23432201043572-0,0301547238275632i",1.8311607132208529,-1.3994685289579945,null,"8,79645942i","1+8,79645942i","0","-19,3444245819267-8,50812229190843i","1+8,79645942i","-18,3444245819267+0,28833712809157i",null,"-0,0469638423973967-0,480254957035873i",null,-6.3292296272173934,-95.585161782986702]
[75000,75,"471238,8975i","-222066098517,016","-104646183437285000i",null,"100+47,12388975i",null,"1,50829433922825i","1+1,50829433922825i",null,"0","-7,09723250860383-3,34449202265563i","1+1,50829433922825i","-6,09723250860383-1,83619768342738i",0,"1+0,164933614125i","-0,0117057220792947i","-0,221977272077609","0,778022727922391+0,153227892045705i",1,1,0,0,null,"1,27750877655212-0,0396085636961541i",2.1314506343374608,-1.775860031243816,null,"9,42477795i","1+9,42477795i","0","-22,2066098517016-10,4646183437285i","1+9,42477795i","-21,2066098517016-1,0398403937285i",null,"-0,0687816475530221-0,441053807276823i",null,-7.0058123415237104,-98.863791432479545]
[80000,80,"502654,824i","-252661872090,471","-127001708847146000i",null,"100+50,2654824i",null,"1,6088472951768i","1+1,6088472951768i",null,"0","-8,07507343201145-4,05897461475479i","1+1,6088472951768i","-7,07507343201145-2,45012731957799i",0,"1+0,1759291884i","-0,0142064111516417i","-0,252560807341635","0,747439192658365+0,161722777248358i",1,1,0,0,null,"1,32671843606306-0,0516850094110243i",2.4621613570964245,-2.2309452403961947,null,"10,05309648i","1+10,05309648i","0","-25,2661872090471-12,7001708847146i","1+10,05309648i","-24,2661872090471-2,6470744047146i",null,"-0,0853856976294546-0,404969849635569i",null,-7.662647035234011,-101.90611829270394]
[90000,90,"565486,677i","-319775181864,502","-180828604979628000i",null,"100+56,5486677i",null,"1,8099532070739i","1+1,8099532070739i",null,"0","-10,2200148123895-5,77928221514891i","1+1,8099532070739i","-9,2200148123895-3,96932900807501i",0,"1+0,19792033695i","-0,0202274877530212i","-0,319647271791756","0,680352728208244+0,177692849196979i",1,1,0,0,null,"1,44709298035524-0,0870397594174791i",3.2256122149724868,-3.4420800766964819,null,"11,30973354i","1+11,30973354i","0","-31,9775181864502-18,0828604979628i","1+11,30973354i","-30,9775181864502-6,7731269579628i",null,"-0,106993254938712-0,34170118396652i",null,-8.9208739577809553,-107.38634842152236]
[100000,100,"628318,53i","-394784175141,361","-248050212592082000i",null,"100+62,831853i",null,"2,011059118971i","1+2,011059118971i",null,"0","-12,6173022375179-7,92768479444296i","1+2,011059118971i","-11,6173022375179-5,91662567547196i",0,"1+0,2199114855i","-0,0277468967805503i","-0,394626261471305","0,605373738528695+0,19216458871945i",1,1,0,0,null,"1,60541786286688-0,146344269997555i",4.1477004385549856,-5.208487782900634,null,"12,5663706i","1+12,5663706i","0","-39,4784175141361-24,8050212592082i","1+12,5663706i","-38,4784175141361-12,2386506592082i",null,"-0,117932409087248-0,289072102294643i",null,-10.111257659867539,-112.19392888840346]
[110000,110,"691150,383i","-477688851921,047","-330154832960062000i",null,"100+69,1150383i",null,"2,2121650308681i","1+2,2121650308681i",null,"0","-15,2669357073967-10,5517484614036i",{"$f":"J72","v":"1+2,2121650308681i"},{"$f":"IMSUM(L72:N72)","v":"-14,2669357073967-8,3395834305355i"},1,"1+0,24190263405i","-0,0369311196149125i","-0,477497776380279",{"$f":"IMSUM(S72,R72,Q72)","v":"0,522502223619721+0,204971514435088i"},1,1,0,0,null,"1,81601781079008-0,249432980334241i",5.2635704959533189,-7.8207323086855629,null,"13,82300766i","1+13,82300766i","0","-47,7688851921047-33,0154832960062i","1+13,82300766i","-46,7688851921047-19,1924756360062i",null,"-0,122107092549173-0,245451013298995i",null,-11.240343660971192,-116.449449539292]
[120000,120,"753982,236i","-568489212203,56","-428630767359118000i",null,"100+75,3982236i",null,"2,4132709427652i","1+2,4132709427652i",null,"0","-18,1689152220258-13,6990393247974i","1+2,4132709427652i","-17,1689152220258-11,2857683820322i",2,"1+0,2638937826i","-0,0479466376367909i","-0,568261816518679","0,431738183481321+0,215947144963209i",1,1,0,0,null,"2,09725415352119-0,43777055480966i",6.6182385434260986,-11.79034914070173,null,"15,07964472i","1+15,07964472i","0","-56,848921220356-42,8630767359119i","1+15,07964472i","-55,848921220356-27,7834320159119i",null,"-0,122027918482203-0,209301989857343i",null,-12.313756909852316,-120.2431780938296]
[130000,130,"816814,089i","-667185255988,9","-544966317064805000i",null,"100+81,6814089i",null,"2,6143768546623i","1+2,6143768546623i",null,"0","-21,3232407814052-17,4171234933912i","1+2,6143768546623i","-20,3232407814052-14,8027466387289i",3,"1+0,28588493115i","-0,0609599322268691i","-0,666918381886505","0,333081618113495+0,224924998923131i",1,1,0,0,null,"2,4600564712321-0,802936137717432i",8.2585333921617039,-18.076129196132914,null,"16,33628178i","1+16,33628178i","0","-66,71852559889-54,4966317064805i","1+16,33628178i","-65,71852559889-38,1603499264805i",null,"-0,11932474764744-0,179292026829703i",null,-13.336315558743205,-123.64507291847876]
[150000,150,"942477,795i","-888264394068,062","-837169467498278000i",null,"100+94,2477795i",null,"3,0165886784565i","1+3,0165886784565i",null,"0","-28,3889300344153-26,755936181245i","1+3,0165886784565i","-27,3889300344153-23,7393475027885i",4,"1+0,32986722825i","-0,0936457766343574i","-0,887909088310435","0,112090911689565+0,236221451615643i",1,1,0,0,null,"2,77938675294686-2,91445167327342i",12.100245900170394,-46.358872275853109,null,"18,8495559i","1+18,8495559i","0","-88,8264394068062-83,7169467498278i","1+18,8495559i","-87,8264394068062-64,8673908498278i",null,"-0,109933660153476-0,133427317313791i",null,-15.244993872337629,-129.48585010818474]
[160000,160,"1005309,648i","-1010647488361,88","-1016013670777170000i",null,"100+100,5309648i",null,"3,2176945903536i","1+3,2176945903536i",null,"0","-32,3002937280457-32,4717969180382i","1+3,2176945903536i","-31,3002937280457-29,2541023276846i",5,"1+0,3518583768i","-0,113651289213134i","-1,01024322936654","-0,01024322936654+0,238207087586866i",1,1,0,0,null,"1,29419724044521-4,25368014631354i",12.959790177872241,-73.077431398381563,null,"20,10619296i","1+20,10619296i","0","-101,064748836188-101,601367077717i","1+20,10619296i","-100,064748836188-81,495174117717i",null,"-0,104394071971608-0,115910748017805i",null,-16.13796780534383,-132.00752440008375]
[175000,175,{"$f":"COMPLEX(0,2*Pi*A77)","v":"1099557,4275i"},{"$f":"COMPLEX(-POWER(2*Pi*A77,2),0)","v":"-1209026536370,42"},{"$f":"COMPLEX(0,-POWER(2*Pi*A77,3))","v":"-1329394108110690000i"},null,"100+109,95574275i",null,{"$f":"IMPRODUCT((RdampSel*CdampSel+RdampSel*CinjSel),C77)","v":"3,51935345819925i"},"1+3,51935345819925i",null,{"$f":"IMPRODUCT(G77,L_infilterStd*RdampSel*CinjSel*CdampSel,E77)","v":"0"},{"$f":"IMPRODUCT(G77,L_infilterStd*CinjSel,D77)","v":"-38,6404881023986-42,4874356952178i"},"1+3,51935345819925i","-37,6404881023986-38,9680822370185i",6,{"$f":"IMSUM(IMPRODUCT(C77,RdampPssv*CdampPssv),1)","v":"1+0,384845099625i"},{"$f":"IMPRODUCT(RdampPssv*CdampPssv*CfilterPssv*LinfilterPssv,E77)","v":"-0,148706024933262i"},{"$f":"IMPRODUCT(D77,LinfilterPssv*(CfilterPssv+CdampPssv))","v":"-1,20854292575587"},"-0,20854292575587+0,236139074691738i",1,1,0,0,null,{"$f":"IMDIV(Q77,T77)","v":"-1,18552956082797-3,18780870043445i"},10.632434371784214,{"$f":"IMARGUMENT(Z77)*180/Pi","v":-110.39990747553254},null,{"$f":"IMPRODUCT((RdampCom*CdampCom+RdampCom*CinjCom),C77)","v":"21,99114855i"},"1+21,99114855i",{"$f":"IMPRODUCT(G77,L_infilterStd*RdampSel*CinjSel*CdampSel,E77)","v":"0"},{"$f":"IMPRODUCT(G77,LAEFCom*CinjCom,D77)","v":"-120,902653637042-132,939410811069i"},"1+21,99114855i","-119,902653637042-110,948262261069i",null,"-0,0959217084374499-0,0946501294300461i",null,-17.408932160508265,{"$f":"IMARGUMENT(AK77)*180/Pi","v":-135.38229708831528}]
[190000,190,"1193805,207i","-1425170872260,31","-1701376408169090000i",null,"100+119,3805207i",null,"3,8210123260449i","1+3,8210123260449i",null,"0","-45,5484610774395-54,3759900050841i","1+3,8210123260449i","-44,5484610774395-50,5549776790392i",7,"1+0,41783182245i","-0,190315965017794i","-1,42460080391141","-0,42460080391141+0,227515857432206i",1,1,0,0,null,"-1,42011816933091-1,74500664759685i",{"$f":"20*LOG10(IMABS(Z78))","v":7.0430359282769261},-129.13932379003126,null,"23,87610414i",{"$f":"IMSUM(1,AD78)","v":"1+23,87610414i"},"0","-142,517087226031-170,137640816909i",{"$f":"AE78","v":"1+23,87610414i"},{"$f":"IMSUM(AF78:AH78)","v":"-141,517087226031-146,261536676909i"},null,{"$f":"IMDIV(AE78,AI78)","v":"-0,0877285033166008-0,0780456879875425i"},null,{"$f":"20*LOG10(IMABS(AK78))","v":-18.605170037005653},-138.34282945364629]
[200000,200,"1256637,06i","-1579136700565,44","-1984401700736660000i",null,"100+125,663706i",null,"4,022118237942i","1+4,022118237942i",null,"0","-50,4692089500715-63,4214783555435i","1+4,022118237942i","-49,4692089500715-59,3993601176015i",0,"1+0,439822971i","-0,221975174244403i","-1,57850504588521","-0,57850504588521+0,217847796755597i",1,1,0,0,null,"-1,26317208366406-1,23594812428182i",4.9459582998103908,-135.6241223057485,null,"25,1327412i","1+25,1327412i","0","-157,913670056544-198,440170073665i","1+25,1327412i","-156,913670056544-173,307428873665i",null,"-0,0825616904205737-0,0689817968431073i",null,-19.364819636227516,-140.12062877346483]
[300000,300,"1884955,59i","-3553057576272,25","-6697355739986230000i",null,"100+188,495559i",null,"6,033177356913i","1+6,033177356913i",null,"0","-113,555720137661-214,04748944996i","1+6,033177356913i","-112,555720137661-208,014312093047i",0,"1+0,6597344565i","-0,74916621307486i","-3,55163635324174","-2,55163635324174-0,08943175657486i",1,1,0,0,null,"-0,400475408867723-0,244517302172491i",-6.5724330903943216,-148.59311414511541,null,"37,6991118i","1+37,6991118i","0","-355,305757627225-669,735573998623i","1+37,6991118i","-354,305757627225-632,036462198623i",null,"-0,0460598028849817-0,0242379265652396i",null,-25.671937963299285,-152.24542915960262]
[400000,400,"2513274,12i","-6316546802261,78","-15875213605893300000i",null,"100+251,327412i",null,"8,044236475884i","1+8,044236475884i",null,"0","-201,876835800286-507,371826844349i","1+8,044236475884i","-200,876835800286-499,327590368465i",0,"1+0,879645942i","-1,77580139395522i","-6,31402018354088","-5,31402018354088-0,89615545195522i",1,1,0,0,null,"-0,210121191022436-0,130098243366712i",-12.141260868793136,-148.23594278994108,null,"50,2654824i","1+50,2654824i","0","-631,654680226178-1587,52136058933i","1+50,2654824i","-630,654680226178-1537,25587818933i",null,"-0,0282161976840051-0,0109251019078142i",null,-30.383361185005448,-158.83396742600908]
[500000,500,"3141592,65i","-9869604378534,03","-31006276574010300000i",null,"100+314,159265i",null,"10,055295594855i","1+10,055295594855i",null,"0","-315,432555937948-990,96059930537i","1+10,055295594855i","-314,432555937948-980,905303710515i",0,"1+1,0995574275i","-3,46836209756879i","-9,86565653678262","-8,86565653678262-2,36880467006879i",1,1,0,0,null,"-0,136208802833546-0,0876308907321328i",-15.811684145573038,-147.2445124058745,null,"62,831853i","1+62,831853i","0","-986,960437853403-3100,62765740103i","1+62,831853i","-985,960437853403-3037,79580440103i",null,"-0,0188088486212507-0,00577549702211999i",null,-34.121441234097951,-162.9302277217661]
[600000,600,"3769911,18i","-14212230305089","-53578845919889800000i",null,{"$f":"IMSUM(IMPRODUCT(C83,Rcomp_AEF*Csen_AEF),Csen_AEF/Ccomp_AEF)","v":"100+376,991118i"},null,"12,066354713826i","1+12,066354713826i",null,"0","-454,222880550644-1712,37991559968i","1+12,066354713826i","-453,222880550644-1700,31356088585i",0,"1+1,319468913i","-5,99332970459887i","-14,206545412967","-13,206545412967-4,67386079159887i",1,{"$f":"CHOOSE(INFILTER_TYPE,U83,IMDIV(J83,O83),IMDIV(Q83,T83))","v":1},0,{"$f":"IMARGUMENT(V83)*180/Pi","v":0},null,"-0,0987148424567274-0,0649745603002369i",-18.549182102928064,-146.64690503853296,null,"75,3982236i","1+75,3982236i","0","-1421,2230305089-5357,88459198898i","1+75,3982236i","-1420,2230305089-5282,48636838898i",null,"-0,0133585447682531-0,00340220715788393i",null,-37.211875861380371,-165.71145151158905]
[700000,700,"4398229,71i","-19344424581926,7","-85081222919084300000i",null,"100+439,822971i",null,"14,077413832797i","1+14,077413832797i",null,"0","-618,247809638377-2719,19588449394i","1+14,077413832797i","-617,247809638377-2705,11847066114i",0,"1+1,5393803985i","-9,51718559572877i","-19,3366868120939","-18,3366868120939-7,97780519722877i",1,1,0,0,null,"-0,0765669830392885-0,050638587700621i",-20.743388875708668,-146.52081538204177,null,"87,9645942i","1+87,9645942i","0","-1934,44245819267-8508,12229190843i","1+87,9645942i","-1933,44245819267-8420,15769770843i",null,"-0,00994957804279849-0,00216586639867937i",null,-39.842837308671257,-167.71920050928796]
[800000,800,"5026548,24i","-25266187209047,1","-127001708847146000000i",null,"100+502,654824i",null,"16,088472951768i","1+16,088472951768i",null,"0","-807,507343201145-4058,97461475479i","1+16,088472951768i","-806,507343201145-4042,88614180302i",0,"1+1,759291884i","-14,2064111516417i","-25,2560807341635","-24,2560807341635-12,4471192676417i",1,1,0,0,null,"-0,0620946151681225-0,040665794855093i",-22.588919033913939,-146.77919071706401,null,"100,5309648i","1+100,5309648i","0","-2526,61872090471-12700,1708847146i","1+100,5309648i","-2525,61872090471-12599,6399199146i",null,"-0,00768595691869674-0,00146129546550187i",null,-42.131824580506304,-169.23509992014019]
[900000,900,"5654866,77i","-31977518186450,2","-180828604979628000000i",null,"100+565,486677i",null,"18,099532070739i","1+18,099532070739i",null,"0","-1022,00148123895-5779,28221514891i","1+18,099532070739i","-1021,00148123895-5761,18268307817i",0,"1+1,9792033695i","-20,2274877530212i","-31,9647271791756","-30,9647271791756-18,2482843835212i",1,1,0,0,null,"-0,0519283597315569-0,033315323192724i",-24.194781244722876,-147.31726418522518,null,"113,0973354i","1+113,0973354i","0","-3197,75181864502-18082,8604979628i","1+113,0973354i","-3196,75181864502-17969,7631625628i",null,"-0,00611028500534033-0,00103134718780667i",null,-44.15677146419398,-170.41942019561682]
[1000000,1000,"6283185,3i","-39478417514136,1","-248050212592083000000i",null,"100+628,31853i",null,"20,11059118971i","1+20,11059118971i",null,"0","-1261,73022375179-7927,68479444296i","1+20,11059118971i","-1260,73022375179-7907,57420325325i",0,"1+2,199114855i","-27,7468967805504i","-39,4626261471305","-38,4626261471305-25,5477819255504i",1,1,0,0,null,"-0,044391344457259-0,0276895930961649i",-25.626768047686518,-148.04569057314714,null,"125,663706i","1+125,663706i","0","-3947,84175141361-24805,0212592082i","1+125,663706i","-3946,84175141361-24679,3575532082i",null,"-0,00497119199214965-0,00075449727849535i",null,-45.971882987428131,-171.36985914706423]
[2000000,2000,"12566370,6i","-157913670056544","-1,98440170073666E+21i",null,"100+1256,63706i",null,"40,22118237942i","1+40,22118237942i",null,"0","-5046,92089500715-63421,4783555435i","1+40,22118237942i","-5045,92089500715-63381,2571731641i",0,"1+4,39822971i","-221,975174244403i","-157,850504588521","-156,850504588521-217,576944534403i",1,1,0,0,null,"-0,0154820114155727-0,00656485596685991i",-35.485359346827785,-157.02154019060663,null,"251,327412i","1+251,327412i","0","-15791,3670056544-198440,170073666i","1+251,327412i","-15790,3670056544-198188,842661666i",null,"-0,00126052131053976-0,0000953842499809288i",null,-57.964199285629583,-175.67264811214119]
[3000000,3000,"18849555,9i","-355305757627225","-6,69735573998623E+21i",null,"100+1884,95559i",null,"60,33177356913i","1+60,33177356913i",null,"0","-11355,5720137661-214047,48944996i","1+60,33177356913i","-11354,5720137661-213987,157676391i",0,"1+6,597344565i","-749,16621307486i","-355,163635324174","-354,163635324174-742,56886850986i",1,1,0,0,null,"-0,00776127767315144-0,00235501700871593i",-41.818827844809874,-163.12054420169724,null,"376,991118i","1+376,991118i","0","-35530,5757627225-669735,573998623i","1+376,991118i","-35529,5757627225-669358,582880623i",null,"-0,000561709185605723-0,0000283215746409225i",null,-64.998742805673388,-177.11357116894575]
[4000000,4000,"25132741,2i","-631654680226178","-1,58752136058933E+22i",null,"100+2513,27412i",null,"80,44236475884i","1+80,44236475884i",null,"0","-20187,6835800286-507371,82684435i","1+80,44236475884i","-20186,6835800286-507291,384479591i",0,"1+8,79645942i","-1775,80139395522i","-631,402018354088","-630,402018354088-1767,00493453522i",1,1,0,0,null,"-0,00459520096124435-0,00107346840047734i",-46.523147642689807,-166.85114049434898,null,"502,654824i","1+502,654824i","0","-63165,4680226178-1587521,36058933i","1+502,654824i","-63164,4680226178-1587018,70576533i",null,"-0,000316253088643544-0,0000119569845243432i",null,-69.993100827945995,-177.8347767851734]
[5000000,5000,"31415926,5i","-986960437853403","-3,10062765740103E+22i",null,"100+3141,59265i",null,"100,55295594855i","1+100,55295594855i",null,"0","-31543,2555937948-990960,59930537i","1+100,55295594855i","-31542,2555937948-990860,046349421i",0,"1+10,995574275i","-3468,36209756879i","-986,565653678262","-985,565653678262-3457,36652329379i",1,1,0,0,null,"-0,00301757308495533-0,000570959537178404i",-50.254080822840123,-169.28564289756036,null,"628,31853i","1+628,31853i","0","-98696,0437853403-3100627,65740103i","1+628,31853i","-98695,0437853403-3099999,33887103i",null,"-0,00020248846731198-6,12406845038108E-06i",null,-73.868023454622971,-178.26767265695185]
[6000000,6000,"37699111,8i","-1421223030508900","-5,35788459198898E+22i",null,"100+3769,91118i",null,"120,66354713826i","1+120,66354713826i",null,"0","-45422,2880550644-1712379,91559968i","1+120,66354713826i","-45421,2880550644-1712259,25205254i",0,"1+13,19468913i","-5993,32970459887i","-1420,6545412967","-1419,6545412967-5980,13501546887i",1,1,0,0,null,"-0,00212628728062533-0,000337549802608077i",-53.339467507298949,-170.979524286046,null,"753,982236i","1+753,982236i","0","-142122,30305089-5357884,59198898i","1+753,982236i","-142121,30305089-5357130,60975298i",null,"-0,000140649634377957-3,54467917523894E-06i",null,-77.034470301132089,-178.55632653163246]
[7000000,7000,"43982297,1i","-1934442458192670","-8,50812229190843E+22i",null,"100+4398,22971i",null,"140,77413832797i","1+140,77413832797i",null,"0","-61824,7809638377-2719195,88449393i","1+140,77413832797i","-61823,7809638377-2719055,1103556i",0,"1+15,393803985i","-9517,18559572877i","-1933,66868120939","-1932,66868120939-9501,79179174377i",1,1,0,0,null,"-0,00157628762603077-0,000215374297002146i",-55.966960551322785,-172.21963347996476,null,"879,645942i","1+879,645942i","0","-193444,245819267-8508122,29190843i","1+879,645942i","-193443,245819267-8507242,64596643i",null,"-0,000103348890208371-2,23246774120533E-06i",null,-79.711857641141364,-178.76253079634645]
[8000000,8000,"50265482,4i","-2526618720904710","-1,27001708847146E+23i",null,"100+5026,54824i",null,"160,88472951768i","1+160,88472951768i",null,"0","-80750,7343201145-4058974,61475479i","1+160,88472951768i","-80749,7343201145-4058813,73002527i",0,"1+17,59291884i","-14206,4111516417i","-2525,60807341635","-2524,60807341635-14188,8182328017i",1,1,0,0,null,"-0,00121401992445827-0,000145531817287078i",-58.253518683206799,-173.1642323462458,null,"1005,309648i","1+1005,309648i","0","-252661,872090471-12700170,8847146i","1+1005,309648i","-252660,872090471-12699165,5750666i",null,"-0,0000791336832571841-1,49568767421883E-06i",null,-82.031221200579111,-178.91719468931896]
[9000000,9000,"56548667,7i","-3197751818645020","-1,80828604979628E+23i",null,"100+5654,86677i",null,"180,99532070739i","1+180,99532070739i",null,"0","-102200,148123895-5779282,21514891i","1+180,99532070739i","-102199,148123895-5779101,2198282i",0,"1+19,792033695i","-20227,4877530212i","-3196,47271791756","-3195,47271791756-20207,6957193262i",1,1,0,0,null,"-0,000963171180292813-0,000102821581350465i",-60.27671706539698,-173.90657129969617,null,"1130,973354i","1+1130,973354i","0","-319775,181864502-18082860,4979628i","1+1130,973354i","-319774,181864502-18081729,5246088i",null,"-0,0000625292742474978-1,05052160465196E-06i",null,-84.077106590161321,-179.03749435627418]
[10000000,10000,"62831853i","-3947841751413610","-2,48050212592082E+23i",null,"100+6283,1853i",null,"201,1059118971i","1+201,1059118971i",null,"0","-126173,022375179-7927684,79444296i","1+201,1059118971i","-126172,022375179-7927483,68853106i",0,"1+21,99114855i","-27746,8967805503i","-3946,26261471304","-3945,26261471304-27724,9056320003i",1,1,0,0,null,"-0,000782478973720499-0,0000752783461022707i",-62.09053569388221,-174.50477476720093,null,"1256,63706i","1+1256,63706i","0","-394784,175141361-24805021,2592083i","1+1256,63706i","-394783,175141361-24803764,6221483i",null,"-0,0000506509689744292-7,65857548041287E-07i",null,-85.907252054879265,-179.13373717891864]
[{"$f":"Fsw","v":450000},{"$f":"A97/1000","v":450},"2827433,385i","-7994379546612,56","-22603575622453500000i",null,"100+282,7433385i",null,"9,0497660353695i",{"$f":"IMSUM(1,I97)","v":"1+9,0497660353695i"},null,"0","-255,500370309737-722,410276893614i",{"$f":"J97","v":"1+9,0497660353695i"},{"$f":"IMSUM(L97:N97)","v":"-254,500370309737-713,360510858244i"},2,"1+0,98960168475i","-2,52843596912765i","-7,99118179479392",{"$f":"IMSUM(S97,R97,Q97)","v":"-6,99118179479392-1,53883428437765i"},1,1,{"$f":"20*LOG10(IMABS(V97))","v":0},0,null,"-0,166144514200464-0,104979791926394i",-14.131342475740208,-147.71291517811633,null,"56,5486677i","1+56,5486677i","0","-799,437954661256-2260,35756224535i","1+56,5486677i","-798,437954661256-2203,80889454535i",null,"-0,02282755294614-0,00781664178181449i",null,-32.349299903264104,-161.09770080058954]

{"sheet":"Standard Value Calculator","index":12,"n_rows":159,"n_cols":20,"rows_kept":159,"cut":false,"hidden":true,"merged":[]}
[]
["Capacitors","Css","Cc1ea","Cc2ea","Cout","Cin","Cres","Cdither","Cc3ea","Cc4ea","Cin_Passive","Cdamp_Pssv","Cinj_AEF","Cdamp_AEF"]
["Inputs",{"$f":"Css","v":0},{"$f":"Cc1ea","v":1.4970624094841972E-10},{"$f":"Cc2ea","v":-1.0610329551583748E-11},{"$f":"Cout","v":4.6999999999999999E-4},{"$f":"Cin","v":4.6999999999999999E-4},{"$f":"Cres","v":7.4999999999999997E-8},{"$f":"Cdither_init","v":{"$error":"#VALUE!"}},{"$f":"Cc3ea","v":0},{"$f":"Cc4ea","v":0},{"$f":"'Variable Management'!B291*0.000001","v":1.42723666350439E-4},{"$f":"K3*4","v":5.7089466540175601E-4},{"$f":"Cinj_AEF*0.000001","v":1.4272366635043901E-6},{"$f":"'Variable Management'!B294*0.000001","v":7.1361833175219505E-7},null,null,"Resistors","inputs","Standard Result"]
["Standard Result",{"$f":"SUM(B6:B158)/1000000000000","v":0},{"$f":"IF(C3=\"OPEN\",\"OPEN\",SUM(C6:C158)/1000000000000)","v":1.5E-10},{"$f":"SUM(D6:D158)/1000000000000","v":0},{"$f":"SUM(E6:E158)/1000000000000","v":4.6999999999999999E-4},{"$f":"SUM(F6:F158)/1000000000000","v":4.6999999999999999E-4},{"$f":"SUM(G6:G158)/1000000000000","v":8.2000000000000006E-8},{"$f":"IF(H3=\"OPEN\",\"OPEN\",SUM(H6:H158)/1000000000000)","v":{"$error":"#VALUE!"}},0,0,1.4999999999999999E-4,5.5999999999999995E-4,1.5E-6,6.7999999999999995E-7,null,null,"Rt",{"$f":"Rfadj","v":48.7},{"$f":"IF(R4>(INT(0.5+100*POWER(10,IF(96*(LOG(R4)-INT(LOG(R4)))-ROUND(96*(LOG(R4)-INT(LOG(R4))),0)<0,ROUND(96*(LOG(R4)-INT(LOG(R4))),0)-1,ROUND(96*(LOG(R4)-INT(LOG(R4))),0))/96))*POWER(10,INT(LOG(R4))-2)+INT(0.5+100*POWER(10,(IF(96*(LOG(R4)-INT(LOG(R4)))-ROUND(96*(LOG(R4)-INT(LOG(R4))),0)<0,ROUND(96*(LOG(R4)-INT(LOG(R4))),0)-1,ROUND(96*(LOG(R4)-INT(LOG(R4))),0))+1)/96))*POWER(10,INT(LOG(R4))-2))/2,INT(0.5+100*POWER(10,(IF(96*(LOG(R4)-INT(LOG(R4)))-ROUND(96*(LOG(R4)-INT(LOG(R4))),0)<0,ROUND(96*(LOG(R4)-INT(LOG(R4))),0)-1,ROUND(96*(LOG(R4)-INT(LOG(R4))),0))+1)/96))*POWER(10,INT(LOG(R4))-2),INT(0.5+100*POWER(10,IF(96*(LOG(R4)-INT(LOG(R4)))-ROUND(96*(LOG(R4)-INT(LOG(R4))),0)<0,ROUND(96*(LOG(R4)-INT(LOG(R4))),0)-1,ROUND(96*(LOG(R4)-INT(LOG(R4))),0))/96))*POWER(10,INT(LOG(R4))-2))","v":48.7},"Ω"]
["(pF)"]
[0.47,{"$f":"IF(IF((B$3*10^12-$A7)*(B$3*10^12-$A6)*-1<0,0,1)*IF(ABS(B$3*10^12-$A7)>(B$3*10^12-$A6),$A6,$A7)=B7,0,IF((B$3*10^12-$A7)*(B$3*10^12-$A6)*-1<0,0,1)*IF(ABS(B$3*10^12-$A7)>(B$3*10^12-$A6),$A6,$A7))","v":0},0,0,0,0,0,{"$error":"#VALUE!"},0,0,0,0,0,0]
[0.56000000000000005,{"$f":"IF(IF((B$3*10^12-$A8)*(B$3*10^12-$A7)*-1<0,0,1)*IF(ABS(B$3*10^12-$A8)>(B$3*10^12-$A7),$A7,$A8)=B8,0,IF((B$3*10^12-$A8)*(B$3*10^12-$A7)*-1<0,0,1)*IF(ABS(B$3*10^12-$A8)>(B$3*10^12-$A7),$A7,$A8))","v":0},{"$f":"IF(IF((C$3*10^12-$A8)*(C$3*10^12-$A7)*-1<0,0,1)*IF(ABS(C$3*10^12-$A8)>(C$3*10^12-$A7),$A7,$A8)=C8,0,IF((C$3*10^12-$A8)*(C$3*10^12-$A7)*-1<0,0,1)*IF(ABS(C$3*10^12-$A8)>(C$3*10^12-$A7),$A7,$A8))","v":0},{"$f":"IF(IF((D$3*10^12-$A8)*(D$3*10^12-$A7)*-1<0,0,1)*IF(ABS(D$3*10^12-$A8)>(D$3*10^12-$A7),$A7,$A8)=D8,0,IF((D$3*10^12-$A8)*(D$3*10^12-$A7)*-1<0,0,1)*IF(ABS(D$3*10^12-$A8)>(D$3*10^12-$A7),$A7,$A8))","v":0},{"$f":"IF(IF((E$3*10^12-$A8)*(E$3*10^12-$A7)*-1<0,0,1)*IF(ABS(E$3*10^12-$A8)>(E$3*10^12-$A7),$A7,$A8)=E8,0,IF((E$3*10^12-$A8)*(E$3*10^12-$A7)*-1<0,0,1)*IF(ABS(E$3*10^12-$A8)>(E$3*10^12-$A7),$A7,$A8))","v":0},{"$f":"IF(IF((F$3*10^12-$A8)*(F$3*10^12-$A7)*-1<0,0,1)*IF(ABS(F$3*10^12-$A8)>(F$3*10^12-$A7),$A7,$A8)=F8,0,IF((F$3*10^12-$A8)*(F$3*10^12-$A7)*-1<0,0,1)*IF(ABS(F$3*10^12-$A8)>(F$3*10^12-$A7),$A7,$A8))","v":0},{"$f":"IF(IF((G$3*10^12-$A8)*(G$3*10^12-$A7)*-1<0,0,1)*IF(ABS(G$3*10^12-$A8)>(G$3*10^12-$A7),$A7,$A8)=G8,0,IF((G$3*10^12-$A8)*(G$3*10^12-$A7)*-1<0,0,1)*IF(ABS(G$3*10^12-$A8)>(G$3*10^12-$A7),$A7,$A8))","v":0},{"$error":"#VALUE!"},0,0,{"$f":"IF(IF((K$3*10^12-$A8)*(K$3*10^12-$A7)*-1<0,0,1)*IF(ABS(K$3*10^12-$A8)>(K$3*10^12-$A7),$A7,$A8)=K8,0,IF((K$3*10^12-$A8)*(K$3*10^12-$A7)*-1<0,0,1)*IF(ABS(K$3*10^12-$A8)>(K$3*10^12-$A7),$A7,$A8))","v":0},0,0,0,null,null,"Rc1ea",{"$f":"Rcea1","v":221482.28182499998},{"$f":"IF(R7>(INT(0.5+100*POWER(10,IF(96*(LOG(R7)-INT(LOG(R7)))-ROUND(96*(LOG(R7)-INT(LOG(R7))),0)<0,ROUND(96*(LOG(R7)-INT(LOG(R7))),0)-1,ROUND(96*(LOG(R7)-INT(LOG(R7))),0))/96))*POWER(10,INT(LOG(R7))-2)+INT(0.5+100*POWER(10,(IF(96*(LOG(R7)-INT(LOG(R7)))-ROUND(96*(LOG(R7)-INT(LOG(R7))),0)<0,ROUND(96*(LOG(R7)-INT(LOG(R7))),0)-1,ROUND(96*(LOG(R7)-INT(LOG(R7))),0))+1)/96))*POWER(10,INT(LOG(R7))-2))/2,INT(0.5+100*POWER(10,(IF(96*(LOG(R7)-INT(LOG(R7)))-ROUND(96*(LOG(R7)-INT(LOG(R7))),0)<0,ROUND(96*(LOG(R7)-INT(LOG(R7))),0)-1,ROUND(96*(LOG(R7)-INT(LOG(R7))),0))+1)/96))*POWER(10,INT(LOG(R7))-2),INT(0.5+100*POWER(10,IF(96*(LOG(R7)-INT(LOG(R7)))-ROUND(96*(LOG(R7)-INT(LOG(R7))),0)<0,ROUND(96*(LOG(R7)-INT(LOG(R7))),0)-1,ROUND(96*(LOG(R7)-INT(LOG(R7))),0))/96))*POWER(10,INT(LOG(R7))-2))","v":221000},"Ω"]
[0.68,0,0,0,0,0,0,{"$error":"#VALUE!"},0,0,0,0,0,0,null,null,"Rc1ea",{"$f":"Rcea2","v":0},{"$f":"IF(R8>(INT(0.5+100*POWER(10,IF(96*(LOG(R8)-INT(LOG(R8)))-ROUND(96*(LOG(R8)-INT(LOG(R8))),0)<0,ROUND(96*(LOG(R8)-INT(LOG(R8))),0)-1,ROUND(96*(LOG(R8)-INT(LOG(R8))),0))/96))*POWER(10,INT(LOG(R8))-2)+INT(0.5+100*POWER(10,(IF(96*(LOG(R8)-INT(LOG(R8)))-ROUND(96*(LOG(R8)-INT(LOG(R8))),0)<0,ROUND(96*(LOG(R8)-INT(LOG(R8))),0)-1,ROUND(96*(LOG(R8)-INT(LOG(R8))),0))+1)/96))*POWER(10,INT(LOG(R8))-2))/2,INT(0.5+100*POWER(10,(IF(96*(LOG(R8)-INT(LOG(R8)))-ROUND(96*(LOG(R8)-INT(LOG(R8))),0)<0,ROUND(96*(LOG(R8)-INT(LOG(R8))),0)-1,ROUND(96*(LOG(R8)-INT(LOG(R8))),0))+1)/96))*POWER(10,INT(LOG(R8))-2),INT(0.5+100*POWER(10,IF(96*(LOG(R8)-INT(LOG(R8)))-ROUND(96*(LOG(R8)-INT(LOG(R8))),0)<0,ROUND(96*(LOG(R8)-INT(LOG(R8))),0)-1,ROUND(96*(LOG(R8)-INT(LOG(R8))),0))/96))*POWER(10,INT(LOG(R8))-2))","v":{"$error":"#NUM!"}},"Ω"]
[0.82,0,0,0,0,0,0,{"$error":"#VALUE!"},0,0,0,0,0,0]
[1,0,0,0,0,0,0,{"$error":"#VALUE!"},0,0,0,0,0,0,null,null,"Rfb1",{"$f":"Rfb1_","v":100000},{"$f":"IF(R10>(INT(0.5+100*POWER(10,IF(96*(LOG(R10)-INT(LOG(R10)))-ROUND(96*(LOG(R10)-INT(LOG(R10))),0)<0,ROUND(96*(LOG(R10)-INT(LOG(R10))),0)-1,ROUND(96*(LOG(R10)-INT(LOG(R10))),0))/96))*POWER(10,INT(LOG(R10))-2)+INT(0.5+100*POWER(10,(IF(96*(LOG(R10)-INT(LOG(R10)))-ROUND(96*(LOG(R10)-INT(LOG(R10))),0)<0,ROUND(96*(LOG(R10)-INT(LOG(R10))),0)-1,ROUND(96*(LOG(R10)-INT(LOG(R10))),0))+1)/96))*POWER(10,INT(LOG(R10))-2))/2,INT(0.5+100*POWER(10,(IF(96*(LOG(R10)-INT(LOG(R10)))-ROUND(96*(LOG(R10)-INT(LOG(R10))),0)<0,ROUND(96*(LOG(R10)-INT(LOG(R10))),0)-1,ROUND(96*(LOG(R10)-INT(LOG(R10))),0))+1)/96))*POWER(10,INT(LOG(R10))-2),INT(0.5+100*POWER(10,IF(96*(LOG(R10)-INT(LOG(R10)))-ROUND(96*(LOG(R10)-INT(LOG(R10))),0)<0,ROUND(96*(LOG(R10)-INT(LOG(R10))),0)-1,ROUND(96*(LOG(R10)-INT(LOG(R10))),0))/96))*POWER(10,INT(LOG(R10))-2))","v":100000},"Ω"]
[1.2,0,0,0,0,0,0,{"$error":"#VALUE!"},0,0,0,0,{"$f":"IF(IF((M$3*10^12-$A12)*(M$3*10^12-$A11)*-1<0,0,1)*IF(ABS(M$3*10^12-$A12)>(M$3*10^12-$A11),$A11,$A12)=M12,0,IF((M$3*10^12-$A12)*(M$3*10^12-$A11)*-1<0,0,1)*IF(ABS(M$3*10^12-$A12)>(M$3*10^12-$A11),$A11,$A12))","v":0},0,null,null,"Rfb2",{"$f":"Rfb2_","v":1626.0162601626016},{"$f":"IF(R11=\"OPEN\",\"OPEN\",IF(R11>(INT(0.5+100*POWER(10,IF(96*(LOG(R11)-INT(LOG(R11)))-ROUND(96*(LOG(R11)-INT(LOG(R11))),0)<0,ROUND(96*(LOG(R11)-INT(LOG(R11))),0)-1,ROUND(96*(LOG(R11)-INT(LOG(R11))),0))/96))*POWER(10,INT(LOG(R11))-2)+INT(0.5+100*POWER(10,(IF(96*(LOG(R11)-INT(LOG(R11)))-ROUND(96*(LOG(R11)-INT(LOG(R11))),0)<0,ROUND(96*(LOG(R11)-INT(LOG(R11))),0)-1,ROUND(96*(LOG(R11)-INT(LOG(R11))),0))+1)/96))*POWER(10,INT(LOG(R11))-2))/2,INT(0.5+100*POWER(10,(IF(96*(LOG(R11)-INT(LOG(R11)))-ROUND(96*(LOG(R11)-INT(LOG(R11))),0)<0,ROUND(96*(LOG(R11)-INT(LOG(R11))),0)-1,ROUND(96*(LOG(R11)-INT(LOG(R11))),0))+1)/96))*POWER(10,INT(LOG(R11))-2),INT(0.5+100*POWER(10,IF(96*(LOG(R11)-INT(LOG(R11)))-ROUND(96*(LOG(R11)-INT(LOG(R11))),0)<0,ROUND(96*(LOG(R11)-INT(LOG(R11))),0)-1,ROUND(96*(LOG(R11)-INT(LOG(R11))),0))/96))*POWER(10,INT(LOG(R11))-2)))","v":1620},"Ω"]
[1.5,0,0,0,0,0,0,{"$error":"#VALUE!"},0,0,0,0,0,0,null,null,"Rt1",{"$f":"'Variable Management'!B27*1000","v":48304.938271604937},{"$f":"IF(R12>(INT(0.5+100*POWER(10,IF(96*(LOG(R12)-INT(LOG(R12)))-ROUND(96*(LOG(R12)-INT(LOG(R12))),0)<0,ROUND(96*(LOG(R12)-INT(LOG(R12))),0)-1,ROUND(96*(LOG(R12)-INT(LOG(R12))),0))/96))*POWER(10,INT(LOG(R12))-2)+INT(0.5+100*POWER(10,(IF(96*(LOG(R12)-INT(LOG(R12)))-ROUND(96*(LOG(R12)-INT(LOG(R12))),0)<0,ROUND(96*(LOG(R12)-INT(LOG(R12))),0)-1,ROUND(96*(LOG(R12)-INT(LOG(R12))),0))+1)/96))*POWER(10,INT(LOG(R12))-2))/2,INT(0.5+100*POWER(10,(IF(96*(LOG(R12)-INT(LOG(R12)))-ROUND(96*(LOG(R12)-INT(LOG(R12))),0)<0,ROUND(96*(LOG(R12)-INT(LOG(R12))),0)-1,ROUND(96*(LOG(R12)-INT(LOG(R12))),0))+1)/96))*POWER(10,INT(LOG(R12))-2),INT(0.5+100*POWER(10,IF(96*(LOG(R12)-INT(LOG(R12)))-ROUND(96*(LOG(R12)-INT(LOG(R12))),0)<0,ROUND(96*(LOG(R12)-INT(LOG(R12))),0)-1,ROUND(96*(LOG(R12)-INT(LOG(R12))),0))/96))*POWER(10,INT(LOG(R12))-2))","v":48700},"Ω"]
[1.8,0,0,0,0,0,0,{"$error":"#VALUE!"},0,0,0,0,0,0,null,null,"Rd",{"$f":"'Variable Management'!B28*1000","v":0},{"$f":"IF(R13=\"OPEN\",\"OPEN\",IF(R13>(INT(0.5+100*POWER(10,IF(96*(LOG(R13)-INT(LOG(R13)))-ROUND(96*(LOG(R13)-INT(LOG(R13))),0)<0,ROUND(96*(LOG(R13)-INT(LOG(R13))),0)-1,ROUND(96*(LOG(R13)-INT(LOG(R13))),0))/96))*POWER(10,INT(LOG(R13))-2)+INT(0.5+100*POWER(10,(IF(96*(LOG(R13)-INT(LOG(R13)))-ROUND(96*(LOG(R13)-INT(LOG(R13))),0)<0,ROUND(96*(LOG(R13)-INT(LOG(R13))),0)-1,ROUND(96*(LOG(R13)-INT(LOG(R13))),0))+1)/96))*POWER(10,INT(LOG(R13))-2))/2,INT(0.5+100*POWER(10,(IF(96*(LOG(R13)-INT(LOG(R13)))-ROUND(96*(LOG(R13)-INT(LOG(R13))),0)<0,ROUND(96*(LOG(R13)-INT(LOG(R13))),0)-1,ROUND(96*(LOG(R13)-INT(LOG(R13))),0))+1)/96))*POWER(10,INT(LOG(R13))-2),INT(0.5+100*POWER(10,IF(96*(LOG(R13)-INT(LOG(R13)))-ROUND(96*(LOG(R13)-INT(LOG(R13))),0)<0,ROUND(96*(LOG(R13)-INT(LOG(R13))),0)-1,ROUND(96*(LOG(R13)-INT(LOG(R13))),0))/96))*POWER(10,INT(LOG(R13))-2)))","v":{"$error":"#NUM!"}},"Ω"]
[2.2000000000000002,{"$f":"IF(IF((B$3*10^12-$A15)*(B$3*10^12-$A14)*-1<0,0,1)*IF(ABS(B$3*10^12-$A15)>(B$3*10^12-$A14),$A14,$A15)=B15,0,IF((B$3*10^12-$A15)*(B$3*10^12-$A14)*-1<0,0,1)*IF(ABS(B$3*10^12-$A15)>(B$3*10^12-$A14),$A14,$A15))","v":0},0,0,0,0,0,{"$error":"#VALUE!"},0,0,0,0,0,0,null,null,"Rd_AEF",{"$f":"'Variable Management'!B300","v":3.8036936136317527E-2},{"$f":"IF(R14=\"OPEN\",\"OPEN\",IF(R14>(INT(0.5+100*POWER(10,IF(96*(LOG(R14)-INT(LOG(R14)))-ROUND(96*(LOG(R14)-INT(LOG(R14))),0)<0,ROUND(96*(LOG(R14)-INT(LOG(R14))),0)-1,ROUND(96*(LOG(R14)-INT(LOG(R14))),0))/96))*POWER(10,INT(LOG(R14))-2)+INT(0.5+100*POWER(10,(IF(96*(LOG(R14)-INT(LOG(R14)))-ROUND(96*(LOG(R14)-INT(LOG(R14))),0)<0,ROUND(96*(LOG(R14)-INT(LOG(R14))),0)-1,ROUND(96*(LOG(R14)-INT(LOG(R14))),0))+1)/96))*POWER(10,INT(LOG(R14))-2))/2,INT(0.5+100*POWER(10,(IF(96*(LOG(R14)-INT(LOG(R14)))-ROUND(96*(LOG(R14)-INT(LOG(R14))),0)<0,ROUND(96*(LOG(R14)-INT(LOG(R14))),0)-1,ROUND(96*(LOG(R14)-INT(LOG(R14))),0))+1)/96))*POWER(10,INT(LOG(R14))-2),INT(0.5+100*POWER(10,IF(96*(LOG(R14)-INT(LOG(R14)))-ROUND(96*(LOG(R14)-INT(LOG(R14))),0)<0,ROUND(96*(LOG(R14)-INT(LOG(R14))),0)-1,ROUND(96*(LOG(R14)-INT(LOG(R14))),0))/96))*POWER(10,INT(LOG(R14))-2)))","v":3.8300000000000001E-2},"Ω"]
[2.7,0,0,0,0,0,0,{"$error":"#VALUE!"},0,0,{"$f":"IF(IF((K$3*10^12-$A16)*(K$3*10^12-$A15)*-1<0,0,1)*IF(ABS(K$3*10^12-$A16)>(K$3*10^12-$A15),$A15,$A16)=K16,0,IF((K$3*10^12-$A16)*(K$3*10^12-$A15)*-1<0,0,1)*IF(ABS(K$3*10^12-$A16)>(K$3*10^12-$A15),$A15,$A16))","v":0},0,0,0]
[3.3,0,0,0,0,0,0,{"$error":"#VALUE!"},0,0,0,0,0,0,null,null,"Rs",{"$f":"Rs_ideal*1000","v":2.9393878352654421},{"$f":"IF(R16=0,0,IF(R16>(INT(0.5+100*POWER(10,IF(96*(LOG(R16)-INT(LOG(R16)))-ROUND(96*(LOG(R16)-INT(LOG(R16))),0)<0,ROUND(96*(LOG(R16)-INT(LOG(R16))),0)-1,ROUND(96*(LOG(R16)-INT(LOG(R16))),0))/96))*POWER(10,INT(LOG(R16))-2)+INT(0.5+100*POWER(10,(IF(96*(LOG(R16)-INT(LOG(R16)))-ROUND(96*(LOG(R16)-INT(LOG(R16))),0)<0,ROUND(96*(LOG(R16)-INT(LOG(R16))),0)-1,ROUND(96*(LOG(R16)-INT(LOG(R16))),0))+1)/96))*POWER(10,INT(LOG(R16))-2))/2,INT(0.5+100*POWER(10,(IF(96*(LOG(R16)-INT(LOG(R16)))-ROUND(96*(LOG(R16)-INT(LOG(R16))),0)<0,ROUND(96*(LOG(R16)-INT(LOG(R16))),0)-1,ROUND(96*(LOG(R16)-INT(LOG(R16))),0))+1)/96))*POWER(10,INT(LOG(R16))-2),INT(0.5+100*POWER(10,IF(96*(LOG(R16)-INT(LOG(R16)))-ROUND(96*(LOG(R16)-INT(LOG(R16))),0)<0,ROUND(96*(LOG(R16)-INT(LOG(R16))),0)-1,ROUND(96*(LOG(R16)-INT(LOG(R16))),0))/96))*POWER(10,INT(LOG(R16))-2)))","v":2.94},"mΩ"]
[3.9,0,0,0,0,0,0,{"$error":"#VALUE!"},0,0,0,0,0,0,null,null,"Cres",{"$f":"Cres","v":7.4999999999999997E-8},{"$f":"G4*1000000000000","v":82000},"pF"]
[4.7,0,0,0,0,0,0,{"$error":"#VALUE!"},0,0,0,0,0,0]
[5.6,0,0,0,0,0,0,{"$error":"#VALUE!"},0,0,0,0,0,0]
[6.8,0,0,0,0,0,0,{"$error":"#VALUE!"},0,0,0,0,0,0]
[8.1999999999999993,0,0,0,0,0,0,{"$error":"#VALUE!"},0,0,0,0,0,0,null,null,"Cdither",{"$f":"Cdither_init","v":{"$error":"#VALUE!"}},{"$f":"H4","v":{"$error":"#VALUE!"}}]
[10,0,0,0,0,0,0,{"$error":"#VALUE!"},0,0,{"$f":"IF(IF((K$3*10^12-$A23)*(K$3*10^12-$A22)*-1<0,0,1)*IF(ABS(K$3*10^12-$A23)>(K$3*10^12-$A22),$A22,$A23)=K23,0,IF((K$3*10^12-$A23)*(K$3*10^12-$A22)*-1<0,0,1)*IF(ABS(K$3*10^12-$A23)>(K$3*10^12-$A22),$A22,$A23))","v":0},0,0,0]
[12,0,0,0,0,0,0,{"$error":"#VALUE!"},0,0,0,0,0,0,null,null,"Cin_Passive",{"$f":"K4","v":1.4999999999999999E-4},{"$f":"R23*1000000","v":150},"uF"]
[15,0,0,0,0,0,0,{"$error":"#VALUE!"},0,0,0,0,0,0,null,null,"Cinj_AEF",{"$f":"Cinj_AEF","v":1.4272366635043903},{"$f":"M4*1000000","v":1.5},"uF"]
[18,0,0,0,0,0,0,{"$error":"#VALUE!"},0,0,0,0,0,0,null,null,"Cdamp_AEF",{"$f":"'Variable Management'!B294","v":0.71361833175219513},{"$f":"N4*1000000","v":0.67999999999999994},"uF"]
[22,0,0,0,0,0,0,{"$error":"#VALUE!"},0,0,0,0,0,0,null,null,"Rdamp_AEF",{"$f":"'Variable Management'!B295","v":41.460260388586107},{"$f":"IF(R26=\"OPEN\",\"OPEN\",IF(R26>(INT(0.5+100*POWER(10,IF(96*(LOG(R26)-INT(LOG(R26)))-ROUND(96*(LOG(R26)-INT(LOG(R26))),0)<0,ROUND(96*(LOG(R26)-INT(LOG(R26))),0)-1,ROUND(96*(LOG(R26)-INT(LOG(R26))),0))/96))*POWER(10,INT(LOG(R26))-2)+INT(0.5+100*POWER(10,(IF(96*(LOG(R26)-INT(LOG(R26)))-ROUND(96*(LOG(R26)-INT(LOG(R26))),0)<0,ROUND(96*(LOG(R26)-INT(LOG(R26))),0)-1,ROUND(96*(LOG(R26)-INT(LOG(R26))),0))+1)/96))*POWER(10,INT(LOG(R26))-2))/2,INT(0.5+100*POWER(10,(IF(96*(LOG(R26)-INT(LOG(R26)))-ROUND(96*(LOG(R26)-INT(LOG(R26))),0)<0,ROUND(96*(LOG(R26)-INT(LOG(R26))),0)-1,ROUND(96*(LOG(R26)-INT(LOG(R26))),0))+1)/96))*POWER(10,INT(LOG(R26))-2),INT(0.5+100*POWER(10,IF(96*(LOG(R26)-INT(LOG(R26)))-ROUND(96*(LOG(R26)-INT(LOG(R26))),0)<0,ROUND(96*(LOG(R26)-INT(LOG(R26))),0)-1,ROUND(96*(LOG(R26)-INT(LOG(R26))),0))/96))*POWER(10,INT(LOG(R26))-2)))","v":41.2},"Ω"]
[27,0,0,0,0,0,0,{"$error":"#VALUE!"},0,0,0,0,{"$f":"IF(IF((M$3*10^12-$A28)*(M$3*10^12-$A27)*-1<0,0,1)*IF(ABS(M$3*10^12-$A28)>(M$3*10^12-$A27),$A27,$A28)=M28,0,IF((M$3*10^12-$A28)*(M$3*10^12-$A27)*-1<0,0,1)*IF(ABS(M$3*10^12-$A28)>(M$3*10^12-$A27),$A27,$A28))","v":0},0,null,null,"Rdamp_Passive",{"$f":"SQRT(L_infilterStd/K4)","v":6.7330032922413852E-2},{"$f":"IF(R27=\"OPEN\",\"OPEN\",IF(R27>(INT(0.5+100*POWER(10,IF(96*(LOG(R27)-INT(LOG(R27)))-ROUND(96*(LOG(R27)-INT(LOG(R27))),0)<0,ROUND(96*(LOG(R27)-INT(LOG(R27))),0)-1,ROUND(96*(LOG(R27)-INT(LOG(R27))),0))/96))*POWER(10,INT(LOG(R27))-2)+INT(0.5+100*POWER(10,(IF(96*(LOG(R27)-INT(LOG(R27)))-ROUND(96*(LOG(R27)-INT(LOG(R27))),0)<0,ROUND(96*(LOG(R27)-INT(LOG(R27))),0)-1,ROUND(96*(LOG(R27)-INT(LOG(R27))),0))+1)/96))*POWER(10,INT(LOG(R27))-2))/2,INT(0.5+100*POWER(10,(IF(96*(LOG(R27)-INT(LOG(R27)))-ROUND(96*(LOG(R27)-INT(LOG(R27))),0)<0,ROUND(96*(LOG(R27)-INT(LOG(R27))),0)-1,ROUND(96*(LOG(R27)-INT(LOG(R27))),0))+1)/96))*POWER(10,INT(LOG(R27))-2),INT(0.5+100*POWER(10,IF(96*(LOG(R27)-INT(LOG(R27)))-ROUND(96*(LOG(R27)-INT(LOG(R27))),0)<0,ROUND(96*(LOG(R27)-INT(LOG(R27))),0)-1,ROUND(96*(LOG(R27)-INT(LOG(R27))),0))/96))*POWER(10,INT(LOG(R27))-2)))","v":6.8100000000000008E-2},"Ω"]
[33,0,0,0,0,0,0,{"$error":"#VALUE!"},0,0,0,0,0,0,null,null,"Cdamp_Passive",{"$f":"L4","v":5.5999999999999995E-4},{"$f":"R28*1000000","v":560},"uF"]
[39,0,0,0,0,0,0,{"$error":"#VALUE!"},0,0,0,0,0,0]
[47,0,0,0,0,0,0,{"$error":"#VALUE!"},0,0,0,0,0,0]
[56,0,0,0,0,0,0,{"$error":"#VALUE!"},0,0,0,0,0,0]
[68,0,0,0,0,0,0,{"$error":"#VALUE!"},0,0,0,0,0,0,null,null,"Rc1",{"$f":"S7/1000&\" kΩ\"","v":"221 kΩ"},{"$f":"S7/1000","v":221},"kΩ"]
[82,0,0,0,0,0,0,{"$error":"#VALUE!"},0,0,0,0,0,0,null,null,"Cc1",{"$f":"C4*1000000000&\" nF\"","v":"0,15 nF"},{"$f":"C4*1000000000","v":0.15},"nF"]
[{"$f":"A22*10","v":100},0,0,0,0,0,0,{"$error":"#VALUE!"},0,0,0,0,0,0,null,null,"Cc2",{"$f":"D4*1000000000000&\" pF\"","v":"0 pF"},{"$f":"D4*1000000000000","v":0},"pF"]
[{"$f":"A23*10","v":120},0,150,0,0,0,0,{"$error":"#VALUE!"},0,0,0,0,0,0]
[150,0,0,0,0,0,0,{"$error":"#VALUE!"},0,0,0,0,0,0,null,null,"Rc2",{"$f":"S8/1000&\" kΩ\"","v":{"$error":"#NUM!"}},{"$f":"S8/1000","v":{"$error":"#NUM!"}},"kΩ"]
[180,0,0,0,0,0,0,{"$error":"#VALUE!"},0,0,0,0,0,0,null,null,"Cc3",{"$f":"I4*1000000000&\" nF\"","v":"0 nF"},{"$f":"I4*1000000000","v":0},"nF"]
[220,0,0,0,0,0,0,{"$error":"#VALUE!"},0,0,0,0,0,0,null,null,"Cc4",{"$f":"J4*1000000000000&\" pF\"","v":"0 pF"},{"$f":"J4*1000000000000","v":0},"pF"]
[270,0,{"$f":"IF(IF((C$3*10^12-$A40)*(C$3*10^12-$A39)*-1<0,0,1)*IF(ABS(C$3*10^12-$A40)>(C$3*10^12-$A39),$A39,$A40)=C40,0,IF((C$3*10^12-$A40)*(C$3*10^12-$A39)*-1<0,0,1)*IF(ABS(C$3*10^12-$A40)>(C$3*10^12-$A39),$A39,$A40))","v":0},0,0,0,0,{"$error":"#VALUE!"},0,0,0,0,0,0]
[330,0,0,0,0,0,0,{"$error":"#VALUE!"},0,0,0,0,0,0,null,null,"Rent",{"$f":"'Variable Management'!B185/1000","v":99.999999999999986},{"$f":"IF(R40>(INT(0.5+100*POWER(10,IF(96*(LOG(R40)-INT(LOG(R40)))-ROUND(96*(LOG(R40)-INT(LOG(R40))),0)<0,ROUND(96*(LOG(R40)-INT(LOG(R40))),0)-1,ROUND(96*(LOG(R40)-INT(LOG(R40))),0))/96))*POWER(10,INT(LOG(R40))-2)+INT(0.5+100*POWER(10,(IF(96*(LOG(R40)-INT(LOG(R40)))-ROUND(96*(LOG(R40)-INT(LOG(R40))),0)<0,ROUND(96*(LOG(R40)-INT(LOG(R40))),0)-1,ROUND(96*(LOG(R40)-INT(LOG(R40))),0))+1)/96))*POWER(10,INT(LOG(R40))-2))/2,INT(0.5+100*POWER(10,(IF(96*(LOG(R40)-INT(LOG(R40)))-ROUND(96*(LOG(R40)-INT(LOG(R40))),0)<0,ROUND(96*(LOG(R40)-INT(LOG(R40))),0)-1,ROUND(96*(LOG(R40)-INT(LOG(R40))),0))+1)/96))*POWER(10,INT(LOG(R40))-2),INT(0.5+100*POWER(10,IF(96*(LOG(R40)-INT(LOG(R40)))-ROUND(96*(LOG(R40)-INT(LOG(R40))),0)<0,ROUND(96*(LOG(R40)-INT(LOG(R40))),0)-1,ROUND(96*(LOG(R40)-INT(LOG(R40))),0))/96))*POWER(10,INT(LOG(R40))-2))","v":100},"kΩ"]
[390,0,0,0,0,0,0,{"$error":"#VALUE!"},0,0,0,0,0,0,null,null,"Renb",{"$f":"'Variable Management'!B186/1000","v":22.222222222222218},{"$f":"IF(R41>(INT(0.5+100*POWER(10,IF(96*(LOG(R41)-INT(LOG(R41)))-ROUND(96*(LOG(R41)-INT(LOG(R41))),0)<0,ROUND(96*(LOG(R41)-INT(LOG(R41))),0)-1,ROUND(96*(LOG(R41)-INT(LOG(R41))),0))/96))*POWER(10,INT(LOG(R41))-2)+INT(0.5+100*POWER(10,(IF(96*(LOG(R41)-INT(LOG(R41)))-ROUND(96*(LOG(R41)-INT(LOG(R41))),0)<0,ROUND(96*(LOG(R41)-INT(LOG(R41))),0)-1,ROUND(96*(LOG(R41)-INT(LOG(R41))),0))+1)/96))*POWER(10,INT(LOG(R41))-2))/2,INT(0.5+100*POWER(10,(IF(96*(LOG(R41)-INT(LOG(R41)))-ROUND(96*(LOG(R41)-INT(LOG(R41))),0)<0,ROUND(96*(LOG(R41)-INT(LOG(R41))),0)-1,ROUND(96*(LOG(R41)-INT(LOG(R41))),0))+1)/96))*POWER(10,INT(LOG(R41))-2),INT(0.5+100*POWER(10,IF(96*(LOG(R41)-INT(LOG(R41)))-ROUND(96*(LOG(R41)-INT(LOG(R41))),0)<0,ROUND(96*(LOG(R41)-INT(LOG(R41))),0)-1,ROUND(96*(LOG(R41)-INT(LOG(R41))),0))/96))*POWER(10,INT(LOG(R41))-2))","v":22.1},"kΩ"]
[470,0,0,0,0,0,0,{"$error":"#VALUE!"},0,0,0,0,0,0]
[560,0,0,0,0,0,0,{"$error":"#VALUE!"},0,0,0,0,{"$f":"IF(IF((M$3*10^12-$A44)*(M$3*10^12-$A43)*-1<0,0,1)*IF(ABS(M$3*10^12-$A44)>(M$3*10^12-$A43),$A43,$A44)=M44,0,IF((M$3*10^12-$A44)*(M$3*10^12-$A43)*-1<0,0,1)*IF(ABS(M$3*10^12-$A44)>(M$3*10^12-$A43),$A43,$A44))","v":0},0]
[680,0,0,0,0,0,0,{"$error":"#VALUE!"},0,0,0,0,0,0]
[{"$f":"A33*10","v":820},0,0,0,0,0,0,{"$error":"#VALUE!"},0,0,0,0,0,0]
[1000,0,0,0,0,0,0,{"$error":"#VALUE!"},0,0,0,0,0,0]
[1200,0,0,0,0,0,0,{"$error":"#VALUE!"},0,0,0,0,0,0]
[1500,0,0,0,0,0,0,{"$error":"#VALUE!"},0,0,0,0,0,0]
[1800,0,0,0,0,0,0,{"$error":"#VALUE!"},0,0,0,0,0,0]
[2200,0,0,0,0,0,0,{"$error":"#VALUE!"},0,0,0,0,0,0]
[2700,0,0,0,0,0,0,{"$error":"#VALUE!"},0,0,0,0,0,0]
[3300,0,0,0,0,0,0,{"$error":"#VALUE!"},0,0,0,0,0,0]
[3900,0,0,0,0,0,0,{"$error":"#VALUE!"},0,0,0,0,0,0]
[4700,0,0,0,0,0,0,{"$error":"#VALUE!"},0,0,0,0,0,0]
[5600,0,0,0,0,0,0,{"$error":"#VALUE!"},0,0,0,0,0,0]
[6800,0,0,0,0,0,0,{"$error":"#VALUE!"},0,0,0,0,0,0]
[8200,0,0,0,0,0,0,{"$error":"#VALUE!"},0,0,0,0,0,0]
[10000,0,0,0,0,0,0,{"$error":"#VALUE!"},0,0,0,0,0,0]
[12000,0,0,0,0,0,0,{"$error":"#VALUE!"},0,0,0,0,{"$f":"IF(IF((M$3*10^12-$A60)*(M$3*10^12-$A59)*-1<0,0,1)*IF(ABS(M$3*10^12-$A60)>(M$3*10^12-$A59),$A59,$A60)=M60,0,IF((M$3*10^12-$A60)*(M$3*10^12-$A59)*-1<0,0,1)*IF(ABS(M$3*10^12-$A60)>(M$3*10^12-$A59),$A59,$A60))","v":0},0]
[15000,0,0,0,0,0,0,{"$error":"#VALUE!"},0,0,0,0,0,0]
[18000,0,0,0,0,0,0,{"$error":"#VALUE!"},0,0,0,0,0,0]
[22000,0,0,0,0,0,0,{"$error":"#VALUE!"},0,0,0,0,0,0]
[27000,0,0,0,0,0,0,{"$error":"#VALUE!"},0,0,0,0,0,0]
[33000,0,0,0,0,0,0,{"$error":"#VALUE!"},0,0,0,0,0,0]
[39000,0,0,0,0,0,0,{"$error":"#VALUE!"},0,0,0,0,0,0]
[47000,0,0,0,0,0,0,{"$error":"#VALUE!"},0,0,0,0,0,0]
[56000,0,0,0,0,0,0,{"$error":"#VALUE!"},0,0,0,0,0,0]
[68000,0,0,0,0,0,82000,{"$error":"#VALUE!"},0,0,0,0,0,0]
[82000,0,0,0,0,0,0,{"$error":"#VALUE!"},0,{"$f":"IF(IF((J$3*10^12-$A70)*(J$3*10^12-$A69)*-1<0,0,1)*IF(ABS(J$3*10^12-$A70)>(J$3*10^12-$A69),$A69,$A70)=J70,0,IF((J$3*10^12-$A70)*(J$3*10^12-$A69)*-1<0,0,1)*IF(ABS(J$3*10^12-$A70)>(J$3*10^12-$A69),$A69,$A70))","v":0},0,0,0,0]
[100000,0,0,{"$f":"IF(IF((D$3*10^12-$A71)*(D$3*10^12-$A70)*-1<0,0,1)*IF(ABS(D$3*10^12-$A71)>(D$3*10^12-$A70),$A70,$A71)=D71,0,IF((D$3*10^12-$A71)*(D$3*10^12-$A70)*-1<0,0,1)*IF(ABS(D$3*10^12-$A71)>(D$3*10^12-$A70),$A70,$A71))","v":0},0,0,0,{"$error":"#VALUE!"},0,0,0,0,0,0]
[120000,{"$f":"IF(IF((B$3*10^12-$A72)*(B$3*10^12-$A71)*-1<0,0,1)*IF(ABS(B$3*10^12-$A72)>(B$3*10^12-$A71),$A71,$A72)=B72,0,IF((B$3*10^12-$A72)*(B$3*10^12-$A71)*-1<0,0,1)*IF(ABS(B$3*10^12-$A72)>(B$3*10^12-$A71),$A71,$A72))","v":0},{"$f":"IF(IF((C$3*10^12-$A72)*(C$3*10^12-$A71)*-1<0,0,1)*IF(ABS(C$3*10^12-$A72)>(C$3*10^12-$A71),$A71,$A72)=C72,0,IF((C$3*10^12-$A72)*(C$3*10^12-$A71)*-1<0,0,1)*IF(ABS(C$3*10^12-$A72)>(C$3*10^12-$A71),$A71,$A72))","v":0},0,0,{"$f":"IF(IF((F$3*10^12-$A72)*(F$3*10^12-$A71)*-1<0,0,1)*IF(ABS(F$3*10^12-$A72)>(F$3*10^12-$A71),$A71,$A72)=F72,0,IF((F$3*10^12-$A72)*(F$3*10^12-$A71)*-1<0,0,1)*IF(ABS(F$3*10^12-$A72)>(F$3*10^12-$A71),$A71,$A72))","v":0},{"$f":"IF(IF((G$3*10^12-$A72)*(G$3*10^12-$A71)*-1<0,0,1)*IF(ABS(G$3*10^12-$A72)>(G$3*10^12-$A71),$A71,$A72)=G72,0,IF((G$3*10^12-$A72)*(G$3*10^12-$A71)*-1<0,0,1)*IF(ABS(G$3*10^12-$A72)>(G$3*10^12-$A71),$A71,$A72))","v":0},{"$f":"IF(IF((H$3*10^12-$A72)*(H$3*10^12-$A71)*-1<0,0,1)*IF(ABS(H$3*10^12-$A72)>(H$3*10^12-$A71),$A71,$A72)=H72,0,IF((H$3*10^12-$A72)*(H$3*10^12-$A71)*-1<0,0,1)*IF(ABS(H$3*10^12-$A72)>(H$3*10^12-$A71),$A71,$A72))","v":{"$error":"#VALUE!"}},{"$f":"IF(IF((I$3*10^12-$A72)*(I$3*10^12-$A71)*-1<0,0,1)*IF(ABS(I$3*10^12-$A72)>(I$3*10^12-$A71),$A71,$A72)=I72,0,IF((I$3*10^12-$A72)*(I$3*10^12-$A71)*-1<0,0,1)*IF(ABS(I$3*10^12-$A72)>(I$3*10^12-$A71),$A71,$A72))","v":0},0,0,0,0,0]
[150000,0,0,0,0,0,0,{"$error":"#VALUE!"},0,0,0,0,0,0]
[180000,0,0,0,0,0,0,{"$error":"#VALUE!"},0,0,0,0,0,0]
[220000,0,0,0,0,0,0,{"$error":"#VALUE!"},0,0,0,0,0,0]
[270000,0,0,0,0,0,0,{"$error":"#VALUE!"},0,0,0,0,0,0]
[330000,0,0,0,0,0,0,{"$error":"#VALUE!"},0,0,0,0,0,0]
[390000,0,0,0,0,0,0,{"$error":"#VALUE!"},0,0,0,0,0,0]
[470000,0,0,0,0,0,0,{"$error":"#VALUE!"},0,0,0,0,0,0]
[560000,0,0,0,0,0,0,{"$error":"#VALUE!"},0,0,0,0,0,0]
[680000,0,0,0,0,0,0,{"$error":"#VALUE!"},0,0,0,0,0,680000]
[820000,0,0,0,0,0,0,{"$error":"#VALUE!"},0,0,0,0,0,0]
[1000000,0,0,0,0,0,0,{"$error":"#VALUE!"},0,0,0,0,0,0]
[1200000,0,0,0,0,0,0,{"$error":"#VALUE!"},0,0,0,0,1500000,0]
[1500000,0,0,0,0,0,0,{"$error":"#VALUE!"},0,0,0,0,0,0]
[1800000,0,0,0,0,0,0,{"$error":"#VALUE!"},0,0,0,{"$f":"IF(IF((L$3*10^12-$A86)*(L$3*10^12-$A85)*-1<0,0,1)*IF(ABS(L$3*10^12-$A86)>(L$3*10^12-$A85),$A85,$A86)=L86,0,IF((L$3*10^12-$A86)*(L$3*10^12-$A85)*-1<0,0,1)*IF(ABS(L$3*10^12-$A86)>(L$3*10^12-$A85),$A85,$A86))","v":0},0,0]
[2200000,0,0,0,0,0,0,{"$error":"#VALUE!"},0,0,0,0,0,0]
[2700000,0,0,0,0,0,0,{"$error":"#VALUE!"},0,0,0,0,0,0]
[3300000,0,0,0,0,0,0,{"$error":"#VALUE!"},0,0,0,0,0,0]
[3900000,0,0,0,0,0,0,{"$error":"#VALUE!"},0,0,0,0,0,0]
[4700000,0,0,0,0,0,0,{"$error":"#VALUE!"},0,0,0,0,0,0]
[5600000,0,0,0,0,0,0,{"$error":"#VALUE!"},0,0,0,0,0,0]
[6800000,0,0,0,0,0,0,{"$error":"#VALUE!"},0,0,0,0,0,0]
[8200000,0,0,0,0,0,0,{"$error":"#VALUE!"},0,0,0,0,0,0]
[10000000,0,0,0,0,0,0,{"$error":"#VALUE!"},0,0,0,0,0,0]
[12000000,0,0,0,0,0,0,{"$error":"#VALUE!"},0,0,0,0,0,0]
[15000000,0,0,0,0,0,0,{"$error":"#VALUE!"},0,0,0,0,0,0]
[18000000,0,0,0,0,0,0,{"$error":"#VALUE!"},0,0,0,0,0,0]
[22000000,0,0,0,0,0,0,{"$error":"#VALUE!"},0,0,0,0,0,0]
[{"$f":"A87*10","v":27000000},0,0,0,0,0,0,{"$error":"#VALUE!"},0,0,0,0,0,0]
[33000000,0,0,0,0,0,0,{"$error":"#VALUE!"},0,0,0,0,0,0]
[39000000,0,0,0,0,0,0,{"$error":"#VALUE!"},0,0,0,0,0,0]
[47000000,0,0,0,0,0,0,{"$error":"#VALUE!"},0,0,0,0,0,0]
[56000000,0,0,0,0,{"$f":"IF(IF((F$3*10^12-$A104)*(F$3*10^12-$A103)*-1<0,0,1)*IF(ABS(F$3*10^12-$A104)>(F$3*10^12-$A103),$A103,$A104)=F104,0,IF((F$3*10^12-$A104)*(F$3*10^12-$A103)*-1<0,0,1)*IF(ABS(F$3*10^12-$A104)>(F$3*10^12-$A103),$A103,$A104))","v":0},{"$f":"IF(IF((G$3*10^12-$A104)*(G$3*10^12-$A103)*-1<0,0,1)*IF(ABS(G$3*10^12-$A104)>(G$3*10^12-$A103),$A103,$A104)=G104,0,IF((G$3*10^12-$A104)*(G$3*10^12-$A103)*-1<0,0,1)*IF(ABS(G$3*10^12-$A104)>(G$3*10^12-$A103),$A103,$A104))","v":0},{"$f":"IF(IF((H$3*10^12-$A104)*(H$3*10^12-$A103)*-1<0,0,1)*IF(ABS(H$3*10^12-$A104)>(H$3*10^12-$A103),$A103,$A104)=H104,0,IF((H$3*10^12-$A104)*(H$3*10^12-$A103)*-1<0,0,1)*IF(ABS(H$3*10^12-$A104)>(H$3*10^12-$A103),$A103,$A104))","v":{"$error":"#VALUE!"}},{"$f":"IF(IF((I$3*10^12-$A104)*(I$3*10^12-$A103)*-1<0,0,1)*IF(ABS(I$3*10^12-$A104)>(I$3*10^12-$A103),$A103,$A104)=I104,0,IF((I$3*10^12-$A104)*(I$3*10^12-$A103)*-1<0,0,1)*IF(ABS(I$3*10^12-$A104)>(I$3*10^12-$A103),$A103,$A104))","v":0},0,0,0,0,0]
[68000000,0,0,0,0,0,0,{"$error":"#VALUE!"},0,0,0,0,0,0]
[82000000,0,0,0,0,0,0,{"$error":"#VALUE!"},0,0,0,0,0,0]
[100000000,0,0,0,0,0,0,{"$error":"#VALUE!"},0,0,0,0,0,0]
[120000000,0,0,0,0,0,0,{"$error":"#VALUE!"},0,0,150000000,0,0,0]
[150000000,0,0,0,0,0,0,{"$error":"#VALUE!"},0,0,0,0,0,0]
[180000000,0,0,0,0,0,0,{"$error":"#VALUE!"},0,0,0,0,0,0]
[220000000,0,0,0,0,0,0,{"$error":"#VALUE!"},0,0,0,0,0,0]
[270000000,0,0,0,0,0,0,{"$error":"#VALUE!"},0,0,0,0,0,0]
[330000000,0,0,0,0,0,0,{"$error":"#VALUE!"},0,0,0,0,0,0]
[390000000,0,0,0,0,0,0,{"$error":"#VALUE!"},0,0,0,0,0,0]
[470000000,0,0,0,470000000,470000000,0,{"$error":"#VALUE!"},0,0,0,0,0,0]
[560000000,0,0,0,0,0,0,{"$error":"#VALUE!"},0,0,0,560000000,0,0]
[680000000,0,0,0,0,0,0,{"$error":"#VALUE!"},0,0,0,0,0,0]
[820000000,0,0,0,0,0,0,{"$error":"#VALUE!"},0,0,0,0,0,0]
[1000000000,0,0,0,0,0,0,{"$error":"#VALUE!"},0,0,0,0,0,0]
[1200000000,0,0,0,0,0,0,{"$error":"#VALUE!"},0,0,0,0,0,0]
[1500000000,0,0,0,0,0,0,{"$error":"#VALUE!"},0,0,0,0,0,0]
[1800000000,0,0,0,0,0,0,{"$error":"#VALUE!"},0,0,0,0,0,0]
[2200000000,0,0,0,0,0,0,{"$error":"#VALUE!"},0,0,0,0,0,0]
[2700000000,0,0,0,0,0,0,{"$error":"#VALUE!"},0,0,0,0,0,0]
[3300000000,0,0,0,0,0,0,{"$error":"#VALUE!"},0,0,0,0,0,0]
[3900000000,0,0,0,0,0,0,{"$error":"#VALUE!"},0,0,0,0,0,0]
[4700000000,0,0,0,0,0,0,{"$error":"#VALUE!"},0,0,0,0,0,0]
[5600000000,0,0,0,0,0,0,{"$error":"#VALUE!"},0,0,0,0,0,0]
[6800000000,0,0,0,0,0,0,{"$error":"#VALUE!"},0,0,0,0,0,0]
[8200000000,0,0,0,0,0,0,{"$error":"#VALUE!"},0,0,0,0,0,0]
[10000000000,0,0,0,0,0,0,{"$error":"#VALUE!"},0,0,0,0,0,0]
[12000000000,0,0,0,0,0,0,{"$error":"#VALUE!"},0,0,0,0,0,0]
[15000000000,0,0,0,0,0,0,{"$error":"#VALUE!"},0,0,{"$f":"IF(IF((K$3*10^12-$A133)*(K$3*10^12-$A132)*-1<0,0,1)*IF(ABS(K$3*10^12-$A133)>(K$3*10^12-$A132),$A132,$A133)=K133,0,IF((K$3*10^12-$A133)*(K$3*10^12-$A132)*-1<0,0,1)*IF(ABS(K$3*10^12-$A133)>(K$3*10^12-$A132),$A132,$A133))","v":0},{"$f":"IF(IF((L$3*10^12-$A133)*(L$3*10^12-$A132)*-1<0,0,1)*IF(ABS(L$3*10^12-$A133)>(L$3*10^12-$A132),$A132,$A133)=L133,0,IF((L$3*10^12-$A133)*(L$3*10^12-$A132)*-1<0,0,1)*IF(ABS(L$3*10^12-$A133)>(L$3*10^12-$A132),$A132,$A133))","v":0},0,0]
[18000000000,0,0,0,0,0,0,{"$error":"#VALUE!"},0,{"$f":"IF(IF((J$3*10^12-$A134)*(J$3*10^12-$A133)*-1<0,0,1)*IF(ABS(J$3*10^12-$A134)>(J$3*10^12-$A133),$A133,$A134)=J134,0,IF((J$3*10^12-$A134)*(J$3*10^12-$A133)*-1<0,0,1)*IF(ABS(J$3*10^12-$A134)>(J$3*10^12-$A133),$A133,$A134))","v":0},0,0,{"$f":"IF(IF((M$3*10^12-$A134)*(M$3*10^12-$A133)*-1<0,0,1)*IF(ABS(M$3*10^12-$A134)>(M$3*10^12-$A133),$A133,$A134)=M134,0,IF((M$3*10^12-$A134)*(M$3*10^12-$A133)*-1<0,0,1)*IF(ABS(M$3*10^12-$A134)>(M$3*10^12-$A133),$A133,$A134))","v":0},{"$f":"IF(IF((N$3*10^12-$A134)*(N$3*10^12-$A133)*-1<0,0,1)*IF(ABS(N$3*10^12-$A134)>(N$3*10^12-$A133),$A133,$A134)=N134,0,IF((N$3*10^12-$A134)*(N$3*10^12-$A133)*-1<0,0,1)*IF(ABS(N$3*10^12-$A134)>(N$3*10^12-$A133),$A133,$A134))","v":0}]
[22000000000,0,0,0,{"$f":"IF(IF((E$3*10^12-$A135)*(E$3*10^12-$A134)*-1<0,0,1)*IF(ABS(E$3*10^12-$A135)>(E$3*10^12-$A134),$A134,$A135)=E135,0,IF((E$3*10^12-$A135)*(E$3*10^12-$A134)*-1<0,0,1)*IF(ABS(E$3*10^12-$A135)>(E$3*10^12-$A134),$A134,$A135))","v":0},0,0,{"$error":"#VALUE!"},0,0,0,0,{"$f":"IF(IF((M$3*10^12-$A135)*(M$3*10^12-$A134)*-1<0,0,1)*IF(ABS(M$3*10^12-$A135)>(M$3*10^12-$A134),$A134,$A135)=M135,0,IF((M$3*10^12-$A135)*(M$3*10^12-$A134)*-1<0,0,1)*IF(ABS(M$3*10^12-$A135)>(M$3*10^12-$A134),$A134,$A135))","v":0},{"$f":"IF(IF((N$3*10^12-$A135)*(N$3*10^12-$A134)*-1<0,0,1)*IF(ABS(N$3*10^12-$A135)>(N$3*10^12-$A134),$A134,$A135)=N135,0,IF((N$3*10^12-$A135)*(N$3*10^12-$A134)*-1<0,0,1)*IF(ABS(N$3*10^12-$A135)>(N$3*10^12-$A134),$A134,$A135))","v":0}]
[27000000000,{"$f":"IF(IF((B$3*10^12-$A136)*(B$3*10^12-$A135)*-1<0,0,1)*IF(ABS(B$3*10^12-$A136)>(B$3*10^12-$A135),$A135,$A136)=B136,0,IF((B$3*10^12-$A136)*(B$3*10^12-$A135)*-1<0,0,1)*IF(ABS(B$3*10^12-$A136)>(B$3*10^12-$A135),$A135,$A136))","v":0},{"$f":"IF(IF((C$3*10^12-$A136)*(C$3*10^12-$A135)*-1<0,0,1)*IF(ABS(C$3*10^12-$A136)>(C$3*10^12-$A135),$A135,$A136)=C136,0,IF((C$3*10^12-$A136)*(C$3*10^12-$A135)*-1<0,0,1)*IF(ABS(C$3*10^12-$A136)>(C$3*10^12-$A135),$A135,$A136))","v":0},0,0,0,0,{"$error":"#VALUE!"},0,0,0,0,0,0]
[33000000000,0,0,0,0,0,0,{"$error":"#VALUE!"},0,0,0,0,0,0]
[39000000000,0,0,0,0,0,0,{"$error":"#VALUE!"},0,0,0,0,0,0]
[47000000000,0,0,0,0,0,0,{"$error":"#VALUE!"},0,0,0,0,0,0]
[56000000000,0,0,0,0,0,0,{"$error":"#VALUE!"},0,0,0,0,0,0]
[68000000000,0,0,0,0,0,0,{"$error":"#VALUE!"},0,0,0,0,0,0]
[82000000000,0,0,0,0,0,0,{"$error":"#VALUE!"},0,0,0,0,0,0]
[100000000000,0,0,0,0,0,0,{"$error":"#VALUE!"},0,0,0,0,0,0]
[120000000000,0,0,0,0,0,0,{"$error":"#VALUE!"},0,0,0,0,0,0]
[150000000000,0,0,0,0,0,0,{"$error":"#VALUE!"},0,0,0,0,0,0]
[180000000000,0,0,0,0,0,0,{"$error":"#VALUE!"},0,0,0,0,0,0]
[220000000000,0,0,0,0,0,0,{"$error":"#VALUE!"},0,0,0,0,0,0]
[270000000000,0,0,0,0,0,0,{"$error":"#VALUE!"},0,0,0,0,0,0]
[330000000000,0,0,0,0,0,0,{"$error":"#VALUE!"},0,0,0,0,0,0]
[390000000000,0,0,0,0,0,0,{"$error":"#VALUE!"},0,0,0,0,0,0]
[470000000000,0,0,0,0,0,0,{"$error":"#VALUE!"},0,0,0,0,0,0]
[560000000000,0,0,0,0,0,0,{"$error":"#VALUE!"},0,0,0,0,0,0]
[680000000000,0,0,0,0,0,0,{"$error":"#VALUE!"},0,0,0,0,0,0]
[820000000000,0,0,0,0,0,0,{"$error":"#VALUE!"},0,0,0,0,0,0]
[1000000000000,0,0,0,0,0,0,{"$error":"#VALUE!"},0,0,0,0,0,0]
[1200000000000,0,0,0,0,0,0,{"$error":"#VALUE!"},0,0,0,0,0,0]
[1500000000000,0,0,0,0,0,0,{"$error":"#VALUE!"},0,0,0,0,0,0]
[1800000000000,0,0,0,0,0,0,{"$error":"#VALUE!"},0,0,0,0,0,0]
[2200000000000,0,0,0,0,0,0,{"$error":"#VALUE!"},0,0,0,0,0,0]
[2700000000000,2700000000000,2700000000000,0,2700000000000,2700000000000,2700000000000,{"$error":"#VALUE!"},2700000000000,2700000000000,2700000000000,2700000000000,2700000000000,2700000000000]

{"sheet":"Snubber","index":13,"n_rows":6,"n_cols":5,"rows_kept":6,"cut":false,"hidden":true,"merged":[]}
[null,null,"UNITS","STD UNITS"]
["Frequency of Ringing",85,"MHz",{"$f":"B2*1000000","v":85000000},"Hz"]
["SW capacitance",3000,"pF",{"$f":"B3*0.000000000001","v":3E-9},"F"]
["Lpar",{"$f":"1000000000*1/((D2*2*3.14159)^2*D3)","v":1.1686430773614742},"nH",{"$f":"B4/1000000000","v":1.1686430773614743E-9},"H"]
["Csnub",{"$f":"4*B3","v":12000},"pF",{"$f":"B5*0.000000000001","v":1.2E-8},"F"]
["Rsnub",{"$f":"SQRT(D4/D3)","v":0.62413755891936573},"Ω",{"$f":"B6","v":0.62413755891936573},"Ω"]

{"sheet":"Parallel Output Caps","index":14,"n_rows":17,"n_cols":5,"rows_kept":17,"cut":false,"hidden":true,"merged":[]}
[]
[]
[]
["Fsw",{"$f":"Fsw","v":450000}]
[]
["C1",20,"uF",{"$f":"B6/1000000","v":2.0000000000000002E-5},"F"]
["R1",0.5,"mOhms",{"$f":"B7/1000","v":5.0000000000000001E-4},"Ohms"]
[]
["C2",68,"uF",{"$f":"B9/1000000","v":6.7999999999999999E-5},"F"]
["R2",20,"mOhms",{"$f":"B10/1000","v":0.02},"Ohms"]
[]
[]
["I1 ",{"$f":"(D6/(D6+D9))*SQRT((D10*D9*B4)^2+1)/SQRT((((D7+D10)*D6*D9/(D9+D6))*B4)^2+1)","v":0.26378933722328435},"%"]
["I2 ",{"$f":"1-B13","v":0.73621066277671565},"%"]
[]
["I1 ",{"$f":"B13*(Iripple1/(2*SQRT(3)))","v":{"$error":"#NAME?"}},"A"]
["I2 ",{"$f":"B14*(Iripple1/(2*SQRT(3)))","v":{"$error":"#NAME?"}},"A"]