{"text_format":"1","workbook":"xlsx","n_sheets":13,"sheets":["Instructions","Design Converter","Fsw & Ripple","Losses","Variable Mgmt","Standard Value Calculator","Efficiency","Design EMI Filter","EVM","BOM & Schematic","Schematic Mgmt","sch_frank","Efficiency Plots"],"not_rendered":{"charts":6,"images":28,"macros":1,"external_links":0,"defined_names":209,"comments":4,"pivot_tables":0},"unopened":[],"bounds":{"document_bytes":16777216,"sheet_cells":100000,"rows_first":2000,"rows_last":500,"rows_between":2000,"halvings":0,"cell_chars":16384,"cell_head_chars":4096},"cells_cut":0,"cells_raw":0,"read":"whole","date_system":"1900"}

{"sheet":"Instructions","index":0,"n_rows":74,"n_cols":3,"rows_kept":74,"cut":false,"hidden":true,"merged":[[0,0,0,16],[7,1,9,15],[16,2,17,15],[11,1,14,15],[18,2,19,15],[65,1,66,15],[69,1,70,15],[73,1,74,15],[77,1,78,15],[20,2,21,15],[50,1,52,15],[54,1,55,15],[56,1,57,15],[60,1,62,15],[24,1,26,15],[38,1,39,15],[41,1,43,15],[46,1,47,15],[28,1,28,15],[29,1,31,15],[33,1,35,15]]}
["                         LM5164 Low IQ DC/DC Converter Design Tool  "]
[]
[]
[null,"Design Regulator tab"]
[null,"Start with Step 1, and then work down towards the bottom of the worksheet."]
[]
[null,"Step 1. Operating Specifications"]
[null,"First, enter the values in the yellow shaded cells to define the power supply parameters.  If a particular specification is not known, enter an estimate. It can be changed later, if necessary, to optimize component values.  Cells  with a red mark in the upper right corner have a comment to provide additional information.  Hold the cursor over the cell to read the comment.  A red font indicates an erroneous entry and requires an adjustment to the entry.  Consult the entry's comments for the entry specific requirements."]
[]
[]
[]
[null,"Second, select a desired mode of operation. PFM mode requires the fewest external components and the lowest inductance.  As a result, it can provide the smallest solution size. At light loads, a PFM converter has a relatively longer sleep time interval and thus operates at lower input quiescent current levels.  COT mode offers nearly constant switching frequency, relatively higher conversion efficiencies at medium to heavy loads, and enables the lowest output voltage ripple.  Options COT1, COT2, and COT3 enable you to select a ripple generation method (a requirement for the stable operation in COT mode):"]
[]
[]
[]
[]
[null,"-COT1: ","Type 1 ripple generation method requires a single resistor in series with the output capacitor.  It is the simplest, the most compact, and the most economical method that works with fixed and adjustable device options, however, the output voltage ripple is the highest."]
[]
[null,"-COT2: ","Type 2 ripple generation method requires a feedforward capacitor in addition to the series resistor.  The feedforward capacitor reduces the required minimum value of the series resistor and ultimately the output voltage ripple by the VOUT / 1.223V factor.  It only works with an adjustable device option (i.e. external feedback resistor network)."]
[]
[null,"-COT3:","Type 3 ripple generation method three external components to generate and inject required voltage ripple into the FB node.  In return, it provides the lowest output voltage ripple. It also only works with an adjustable device option (i.e. external feedback resistor network)."]
[]
[]
[null,"Step 2. Filter Inductor"]
[null,"First, select an inductor current limit level.  In PFM Mode, 1.25A, 0.75A, 0.5A, and 1.25A - MOD options are available.  For the 500mA max load, select either 1.25A or 1.25A - MOD option.  The 1.25A - MOD option enables higher efficiency at the expense of slightly worse transient operation.  For the 300mA and 200mA max loads, select 0.75A and 0.5A options respectively. In COT Mode, 0.75A and 0.5A options are available.   For the 500mA and 300mA max loads, select 0.75A and 0.5A options respectively."]
[]
[]
[]
[null,"Second, select the filter inductance value based on the suggested value. Enter the inductor RDC for accurate efficiency estimates."]
[null,"In PFM mode, selected inductance defines the switching frequency.  You may select lower or higher inductance to increase or decrease the switching frequency.  Watch the minimum output capacitance.  At very low switching frequencies, the required minimum capacitance may become excessive."]
[]
[]
[]
[null,"In COT mode, the suggested inductance is  derived based on the target inductor (peak-to-peak) ripple current of 40% of the DC full load output current at nominal input voltage. It may be acceptable to use higher ripple current with the proviso that peak inductor current remains below the ILIM setting.  Pk-to-Pk Ripple Current value will turn red if this is violated.  If this happens, increase the selected inductance or decrease the Input Voltage (max) or both."]
[]
[]
[]
[null,"Step 3. Output Capacitors and Ripple Generation"]
[null,"First, select the output capacitance based on the minimum recommended value.  Make sure that the nominal capacitance is appropriately derated for applied voltage, especially with ceramics.  For PFM and COT3 modes, ensure that the capacitor ESR does not exceed the maximum allowable value.  "]
[]
[]
[null,"Second, for COT modes, select the values for the ripple generation components based on the minimum recommended values.  Ensure that the output voltage ripple meets any of your minimum ripple requirements by reviewing the VOUT Ripple vs. IOUT plot in the fSW&Ripple tab.  For accurate output voltage ripple estimates in COT3 mode, ensure that the Output Capacitor ESR is set to the levels of a typical ceramic capacitor ESR (e.g. 10 mW)."]
[]
[]
[]
[null,"Step 4. Input Capacitors"]
[null,"Select the input capacitance based on the minimum recommended value.  Make sure that the nominal capacitance is appropriately derated for applied voltage, especially with ceramics.  "]
[]
[]
[null,"Step 5. Feedback, Soft-Start, UVLO"]
[null,"First, review the feedback resistor network. With an adjustable device option, an external feedback resistor network is required. The resistor values are automatically calculated based on the selected VOUT in Step 1.  For lowering the leakage current through the resistors, adjust the upper FB resistor (R1) until the lower FB resistor (R2) reaches its upper end of the range (100kW).  Keeping the upper FB resistor below 1MW is recommended."]
[]
[]
[]
[null,"Second, select one out of three soft-start configurations.  If the external soft-start option is selected, enter a desired soft start time.  "]
[]
[null,"Third, select one out of the two UVLO options.  If the external UVLO option is selected, define desired UVLO thresholds and hysteresis.  Keeping the upper UVLO resistor at 1MW or higher is recommended for the minimum leakage current."]
[]
[]
[null,"Step 6. Efficiency and Thermals"]
[null,"Enter the LM5166's junction-to-ambient thermal impedance (dependent on your PCB design, air flow, etc.) and ambient temperature. Device power dissipation and junction temperature are derived at the maximum load.  Ensure that the junction temperature is within the recommended range."]
[]
[]
[]
[null,"BOM & Schematic tab"]
[null,"This tab summarizes the converter schematic and BOM.  It also helps you estimate the total solution size. Select a package size for each external component (i.e. inductor, capacitors, and resistors) for accurate solution size estimates."]
[]
[]
[null,"Design EMI Filter tab"]
[null,"In case an EMI filter is needed, a simple EMI filter design aid is given in this tab.  It is based on the guidelines documented in TI's literature number SNVA489C (aka AN-2162).  Suggest reviewing the note before using the design aid."]
[]
[]
[null,"fSW & Ripple tab"]
[null,"In this tab, the switching/burst frequency (COT/PFM mode) and the output voltage ripple as a function of the load current are plotted."]

{"sheet":"Design Converter","index":1,"n_rows":58,"n_cols":17,"rows_kept":58,"cut":false,"hidden":false,"merged":[[2,14,2,15],[0,0,0,16]]}
["                          LM5168/9 Low IQ DC/DC Converter Design Tool  "]
[null,null,null,null,null,null,null,null,null,null,null,null,null,null,"http://www.ti.com/ww/en/analog/power_management/widevin"]
["About",null,"xx",null,null,"= Input Box",null,null,null,null,null,null,null,null,"Terms Of Use",null,"                "]
[]
["Step 1: Operating Specifications"]
[null,null,null,"Input Voltage - Min, VIN(min) ",18,"V"]
[null,null,null,"Input Voltage - Nom, VIN(nom)",48,"V"]
[null,null,null,"Input Voltage - Max, VIN(max)",60,"V"]
[null,null,null,"Output Voltage, VOUT ",12,"V"]
[null,null,null,"Full Load Current, IOUT",0.3,{"$f":"IF('Variable Mgmt'!B84>'Variable Mgmt'!B86,\"CURRENT LIMIT\",\"A\")","v":"A"}]
[null,null,null,"Mode of Operation",null,null,{"$f":"MODE","v":2}]
[null,null,null,"Switching Frequency at VIN(nom)",600,"kHz"]
[null,null,null,"Timing Resistance, RT",{"$f":"'Standard Value Calculator'!J4/1000","v":49.9},"kΩ"]
[]
["Step 2: Buck Inductor"]
[null,null,null,"Recommended Buck Inductance ",{"$f":"Lopt*1000000","v":125},"µH"]
[null,null,null,"Inductance, LF ",100,"µH"]
[null,null,null,"Inductor DCR ",170,"mΩ"]
[null,null,null,{"$f":"CHOOSE(MODE, \"Pk-to-Pk Ripple Current\",\"Pk-to-Pk Ripple Current\",\"Pk-to-Pk Ripple Current\", \"Resulting PFM Switching Frequency\")","v":"Pk-to-Pk Ripple Current"},{"$f":"Iripple_Vinnom*1000","v":150.24239265712504},"mApk-pk"]
[null,null,null,{"$f":"CHOOSE(MODE, 'Variable Mgmt'!H88,'Variable Mgmt'!H88,'Variable Mgmt'!H88, 'Variable Mgmt'!H89)","v":"% Ripple Current at Nom VIN"},{"$f":"IF(OR(MODE=1,MODE=2,MODE=3), 'Variable Mgmt'!B96*100, Ilim/2*1000)","v":50.080797552375024},{"$f":"IF(OR(MODE=1,MODE=2,MODE=3), \"%\", \"mA\")","v":"%"}]
[]
[{"$f":"IF(MODE=4, \"Step 3: Output Capacitors\", \"Step 3: Output Capacitors, Ripple Generation\")","v":"Step 3: Output Capacitors, Ripple Generation"}]
[null,null,null,"Minimum Output Capacitance ",{"$f":"'Variable Mgmt'!B116","v":2.2000000000000002},"µF"]
[null,null,null,"Output Capacitance, COUT ",12,"µF"]
[null,null,null,{"$f":"IF(OR(MODE=1,MODE=2),\"Recommended Series Resistance\",IF(MODE=3,\"Maximum Allowable ESR\",\"*Higher Cout Improves Light-Load Eff\"))","v":"Recommended Series Resistance"},{"$f":"'Variable Mgmt'!B272","v":">0.133"},"Ω"]
[null,null,null,{"$f":"IF(OR(MODE=1,MODE=2),\"Total ESR & Series Resistance, Rser\",IF(MODE=3,\"Output Capacitor ESR\",\"*PFM Hysteresis Sets Output Ripple\"))","v":"Total ESR & Series Resistance, Rser"},1,"Ω"]
[null,null,null,{"$f":"CHOOSE(MODE, \"Resulting Output Voltage Ripple\",\"Resulting Output Voltage Ripple\", \"Output Voltage Ripple\",\"Output Voltage Ripple\")","v":"Resulting Output Voltage Ripple"},{"$f":"CHOOSE(MODE, Vripple2*1000,Vripple2*1000,Vripple2*1000, PFM_Ripple)","v":150.26503309424098},"mVpk-pk"]
[null,null,null,{"$f":"IF(MODE=1,\"\",IF(MODE=2,\"Minimum Feedforward Capacitance\", IF(MODE=3,\"Minimum Coupling Capacitance\",\"\")))","v":"Minimum Feedforward Capacitance"},{"$f":"'Variable Mgmt'!B140","v":">47"},"pF"]
[null,null,null,{"$f":"IF(MODE=1,\"\",IF(MODE=2,\"Feedforward Capacitance, Cff\", IF(MODE=3,\"Coupling Capacitance, Cb\",\"\")))","v":"Feedforward Capacitance, Cff"},56,"pF"]
[null,null,null,{"$f":"IF(MODE=3,\"Minimum Ripple Generation Capacitance\",\"\")","v":""},{"$f":"'Variable Mgmt'!B144","v":""},"pF"]
[null,null,null,{"$f":"IF(MODE=3,\"Ripple Generation Capacitance, Ca\",\"\")","v":""},3300,"pF"]
[null,null,null,{"$f":"IF(MODE=3,\"Ripple Generation Resistance, Ra\",\"\")","v":""},{"$f":"Ra","v":226},"kΩ"]
[null,null,null,{"$f":"IF(MODE=3,\"Amplitude of Injected Ripple\",\"\")","v":""},20,"mVpk-pk"]
[]
["Step 4: Input Capacitors"]
[null,null,null,"Minimum Input Capacitance ",{"$f":"'Variable Mgmt'!B157","v":2.2000000000000002},"µF"]
[null,null,null,"Input Capacitance, CIN ",2.2000000000000002,"µF"]
[null,null,null,"Maximum Allowable ESR",{"$f":"'Variable Mgmt'!B159","v":6.2830338029937325},"Ω"]
[null,null,null,"Input Capacitor ESR ",3,"mΩ"]
[null,null,null,"Resulting Input Voltage Ripple ",{"$f":"CHOOSE(MODE, Vinripple2*1000,Vinripple2*1000,Vinripple2*1000, 'Variable Mgmt'!B165*1000)","v":44.226206837179376},"mVpk-pk"]
[]
["Step 5: Feedback, PGOOD, UVLO"]
[null,null,null,"Upper Feedback Resistor, RFB1 ",453,"kΩ"]
[null,null,null,"Lower Feedback Resistor, RFB2",{"$f":"IF(Vout=Vref,\"OPEN\",Rfb2_u/1000)","v":49.9},{"$f":"IF(Vout=Vref,\"\",\"kΩ\")","v":"kΩ"}]
[null,null,null,"Acutal Output Voltage Setpoint",{"$f":"'Variable Mgmt'!B201","v":12.0937875751503},"V"]
[null,null,null,"PGOOD Pull-up Resistance",20,{"$f":"\"kΩ\"","v":"kΩ"},null,null,null,null,null,null,null,null,null,null," "]
[null,null,null,"BST Capacitance, CBST ",2.2000000000000002,"nF"]
[null,null,null,{"$f":"\"Required Input Voltage UVLO Turn-on\"","v":"Required Input Voltage UVLO Turn-on"},6,"V"]
[null,null,null,"Upper UVLO Resistor, RUV1",1,"MΩ"]
[null,null,null,"Lower UVLO Resistor, RUV2",{"$f":"'Variable Mgmt'!F276","v":332},{"$f":"'Variable Mgmt'!G276","v":"kΩ"}]
[null,null,null,"Actual UVLO Turn-on Threshold",{"$f":"'Variable Mgmt'!B186","v":6.0180722891566267},"V"]
[null,null,null,"Actual UVLO Turn-off Threshold",{"$f":"'Variable Mgmt'!B187","v":5.6168674698795176},"V"]
[]
["Step 6: Efficiency & Thermals"]
[null,null,null,"Estimated Thermal Impedance, JJA",33,"°C/W"]
[null,null,null,"Ambient Temp, TA",25,"°C"]
[null,null,null,"IC Power Dissipation at Full Load, PD",{"$f":"'Variable Mgmt'!B26","v":0.54365085955032511},"W"]
[null,null,null,"IC Junction Temp at Full Load, TJ",{"$f":"E56+E55*'Variable Mgmt'!B26","v":42.940478365160729},"°C"]

{"sheet":"Fsw & Ripple","index":2,"n_rows":1,"n_cols":1,"rows_kept":1,"cut":false,"hidden":true,"merged":[[0,0,0,16]]}
["                         LM5164 Low IQ DC/DC Converter Design Tool  "]

{"sheet":"Losses","index":3,"n_rows":42,"n_cols":6,"rows_kept":42,"cut":false,"hidden":true,"merged":[[0,0,0,16]]}
["                         LM5166 Low IQ DC/DC Converter Design Tool  "]
[]
[]
[]
[null,null,null,"Load Current",500,"mA"]
[]
[]
[]
[]
[]
[]
[]
[]
[]
[]
[]
[]
[]
[]
[]
[]
[]
[]
[]
[]
[]
[]
[]
[]
[]
[]
[]
[]
[]
[]
[]
[]
[]
[]
[]
[]
[null,null,null,"Inductor Core Loss Constant",0]

{"sheet":"Variable Mgmt","index":4,"n_rows":320,"n_cols":21,"rows_kept":320,"cut":false,"hidden":true,"merged":[[4,4,4,7],[0,0,0,8]]}
["EXCEL Variables Names/Calculations",null,null,null,null,null,null,null,null,null,null,"LM5166"]
[null,"Input from user ="]
[null,"Output ="]
[null,"Constant"]
["Variable Name","Value","STD Units",null,"Notes",null,null,null,"Iteration"]
["Step 1: Operational Specs"]
["VIN_min",{"$f":"'Design Converter'!E6","v":18},"V","Minimum input voltage",null,null,null,null,1]
["VIN_nom",{"$f":"'Design Converter'!E7","v":48},"V","Nominal input voltage"]
["VIN_max",{"$f":"'Design Converter'!E8","v":60},"V","Maximum input voltage"]
[]
["Vout",{"$f":"'Design Converter'!E9","v":12},"V","Output Voltage",null,null,null,null,1]
["Iout",{"$f":"'Design Converter'!E10","v":0.3},"A","Maximum Output Current",null,null,null,null,1]
["Rout",{"$f":"Vout/Iout","v":40},"W","Load resistance"]
["Pout",{"$f":"Vout*Iout","v":3.5999999999999996},"W","Output power"]
[]
["Efficiency",0.9,null,"Estimate of efficiency"]
["Pin",{"$f":"Pout/Efficiency","v":3.9999999999999996},"W","Calculate input power assuming 90% efficiency"]
["Iin_Vinmin",{"$f":"Pin/VIN_min","v":0.22222222222222221},"A"]
["Iin_Vinnom",{"$f":"Pin/VIN_nom","v":8.3333333333333329E-2},"A","Input currents at min, nom, max Vin"]
["Iin_Vinmax",{"$f":"Pin/VIN_max","v":6.6666666666666666E-2},"A"]
[]
["Fsw",{"$f":"'Design Converter'!E12*1000","v":600000},"Hz","Nominal Switching Frequency",null,null,null,null,1]
["Vref",1.2,"V","Reference Voltage"]
["Rt",{"$f":"Vout*2500000000/Fsw","v":50000},"W","Frequency Set Resistor"]
[null,null,null,null,null,null,null,null,null,null,{"$f":"B34&\"_\"&F35&\"_\"&F39&\"_\"&I41&\"_\"&I36","v":"COT2_VOUTadj_UVLOadj_SSAdj_RsetGND"},null,null,null,null,null,"Vout<5V",100,1]
["Internal PD at Full Load",{"$f":" IF(OR(MODE=1,MODE=2,MODE=3), Efficiency!AZ106,#REF!)","v":0.54365085955032511},"W",null,null,null,null,null,null,null,null,null,null,null,null,null,"Vout<=8V",47,2]
[null,null,null,null,null,null,null,null,null,null,{"$f":"\"SCH_\"&B34&\"_\"&B41","v":"SCH_COT2_LM5168"},null,null,null,null,null,"Vout<=12V",22,3]
[null,null,null,null,null,null,null,null,null,null,null,null,null,null,null,null,"Vout<=20V",22,4]
["Step 2: Circuit Configuration for COT / PFM, Fixed / Adj Vout, ILIM, UVLO, SS",null,null,null,null,null,null,null,null,null,null,null,null,null,null,null,"Vout>20V",10,5]
[null,"COT Type I",1,null,null,null,null,null,null,null,null,null,null,null,null,null,"Cout Capacitance",{"$f":"CHOOSE(S30,\"100\", \"47\",\"22\",\"22\",\"10\")","v":"22"},{"$f":"IF(Vout<5, 1, IF(Vout<=8, 2, IF(Vout<=12, 3, IF(Vout<=20, 4, 5))))","v":3}]
[null,"COT Type II",2]
["COT/PFM ","COT Type III",3]
[null,null,null,null,"VOUT Fixed/Adjustable","Fixed",1,null,"ILIM shorted",1,{"$f":"B34&\", \"&F35&\", \"&I36&\", \"&F39&\", \"&I41","v":"COT2, VOUTadj, RsetGND, UVLOadj, SSAdj"},null,null,null,null,null,"Vout<=5V","6.3V",1]
["MODE",{"$f":"CHOOSE(C34, \"COT1\", \"COT2\",\"COT3\")","v":"COT2"},2,null,null,"Adjustable",2,null,"ILIM resistor needed",2,{"$f":"C34&\", \"&G35&\", \"&J36&\", \"&G39&\", \"&J41","v":"2, 2, 1, 1, 1"},null,null,null,null,null,"Vout<=8V","10V",2]
[null,{"$f":"IF(MODE=4, \"PFM\", \"COT\")","v":"COT"},null,null,"MODE_VOUT",{"$f":"CHOOSE(G35, \"VOUTfixed\", \"VOUTadj\")","v":"VOUTadj"},{"$f":"IF(AND(OR(MODE=1,MODE=4),OR(Vout=3.3,Vout=5)),1,2)","v":2},null,null,null,{"$f":"C34&G35&J36&G39&J41","v":"22111"},null,null,null,null,null,"Vout<=12V","16V",3]
[null,null,null,null,null,null,null,"MODE_RSET",{"$f":"CHOOSE(J36, \"RsetGND\",\"Rset\")","v":"RsetGND"},1,null,null,null,null,null,null,"Vout<=20V","25V",4]
[null,null,null,null,"UVLO","Adjustable",1,null,null,null,null,null,null,null,null,null,"Vout>20V","50V",5]
[null,null,null,null,null,"Internal",2,"Soft Start","Adjustable",1,null,"Iout Linear Axis",1,null,null,null,"Cout Voltage Rating",{"$f":"CHOOSE(S38,\"6.3V\", \"10V\",\"16V\",\"25V\",\"50V\")","v":"16V"},{"$f":"IF(Vout<=5, 1, IF(Vout<=8, 2, IF(Vout<=12, 3, IF(Vout<=20, 4, 5))))","v":3}]
[null,"LM5168",1,null,"MODE_UVLO",{"$f":"CHOOSE(G39, \"UVLOadj\", \"UVLOint\")","v":"UVLOadj"},1,null,"3ms Fixed",2,null,"Iout Log Axis",2]
[null,"LM5169",2,null,null,null,null,null,null,null,null,"PLOT_TYPE",1]
["VARIANT",{"$f":"CHOOSE(VARIANT, \"LM5168\", \"LM5169\")","v":"LM5168"},1,null,"ESR","NO",1,"MODE_SS",{"$f":"CHOOSE(J41, \"SSAdj\", \"SSfix\")","v":"SSAdj"},1,null,null,null,null,null,null,null,"0402",1,"1.0 x 0.5",0.5]
[null,null,null,null,null,"YES",2,null,null,null,null,null,null,null,null,null,null,"0603",2,"1.6 x 0.8",1.3]
[null,null,null,null,"MODE_ESR",null,2,null,null,null,null,null,null,null,null,null,null,"0805",3,"2.0 x 1.25",2.5]
[null,null,null,null,null,{"$f":"CHOOSE(G44, \"\", \"_ESR\")","v":""},{"$f":"IF(MODE=2, 1, MODE_ESR)","v":1},null,null,null,null,null,null,null,null,null,null,"1206",4,"3.2 x 1.6",5.0999999999999996]
[null,null,null,null,null,null,null,null,null,null,null,null,null,null,null,null,null,"1210",5,"3.2 x 2.5",8]
["Step 3: Buck Inductor",null,null,null,null,null,null,null,null,null,null,null,null,null,null,null,"Component Size",{"$f":"CHOOSE(S46,\"0402\", \"0603\",\"0805\",\"1206\",\"1210\")","v":"1210"},5,{"$f":"CHOOSE(S46,T41,T42,T43,T44,T45)","v":"3.2 x 2.5"}]
["Don1",{"$f":"Vout/VIN_nom","v":0.25},{"$f":"(Vout-VIN_nom)/Vout","v":-3},null,"Ideal Duty Cycle at VIN(nom)",null,null,null,1]
["Doff1",{"$f":"1-47:47","v":0.75},null,null,"Ideal 1- Duty Cycle at VIN(nom)",null,null,null,1]
[]
["Don_Vinmin",{"$f":"Vout/VIN_min","v":0.66666666666666663},{"$f":"IF(VIN_min>Vout, \"BUCK\", \"BOOST\")","v":"BUCK"},null,null,null,null,null,null,null,null,null,null,null,null,null,null,"3mm x 3mm",1,"3.0 x 3.0",9]
["Don_Vinnom",{"$f":"Vout/VIN_nom","v":0.25},{"$f":"IF(VIN_nom>Vout, \"BUCK\", \"BOOST\")","v":"BUCK"},null,null,null,null,null,null,null,null,null,null,null,null,null,null,"4mm x 4mm",2,"4.0 x 4.0",16]
["Don_Vinmax",{"$f":"Vout/VIN_max","v":0.2},{"$f":"IF(VIN_max>Vout, \"BUCK\", \"BOOST\")","v":"BUCK"},null,null,null,null,null,null,null,null,null,null,null,null,null,null,"5mm x 5mm",3,"5.0 x 5.0",25]
[null,null,null,null,null,null,null,null,null,null,null,null,null,null,null,null,null,"6mm x 6mm",4,"6.0 x 6.0",36]
["Lf_Vinmin",{"$f":"(VIN_min-Vout)*Don_Vinmin/(Fsw*Iout*0.4)","v":5.5555555555555558E-5},"H","COT",null,null,null,null,null,null,null,null,null,null,null,null,null,"7mm x 7mm",5,"7.0 x 7.0",49]
["Lf_Vinnom",{"$f":"(VIN_nom-Vout)*Don_Vinnom/(Fsw*Iout*0.4)","v":1.25E-4},"H","COT",null,null,null,null,1,null,null,null,null,null,null,null,"Inductor Size","8mm x 8mm",6,"8.0 x 8.0",64]
["Lf_Vinmax",{"$f":"(VIN_max-Vout)*Don_Vinmax/(Fsw*Iout*0.7)","v":7.6190476190476212E-5},"H","COT",null,null,null,null,null,null,null,null,null,null,null,null,null,"10mm x 10mm",7,"10.0 x 10.0",100]
[]
["L_Vinmin_COT",{"$f":"(VIN_min-Vout)*Don_Vinmin/(Fsw*Iout*0.3)","v":7.4074074074074073E-5},"H","COT","Calculated Inductance for 30% ripple at VIN(min)"]
["L_Vinnom_COT",{"$f":"(VIN_nom-Vout)*Don_Vinnom/(Fsw*Iout*0.4)","v":1.25E-4},"H","COT","Calculated Inductance for 40% ripple at VIN(nom)",null,null,null,null,null,"Pk-to-Pk Ripple Current at VIN(nom), DIL"]
["L_Vinmax_COT",{"$f":"(VIN_max-Vout)*Don_Vinmax/(Fsw*Iout*0.7)","v":7.6190476190476212E-5},"H","COT","Calculated Inductance for 70% ripple at VIN(max)"]
[]
[]
["Lopt",{"$f":"B59","v":1.25E-4},"H"]
[]
["Lf",{"$f":"'Design Converter'!E17/1000000","v":1E-4},"H",null,"Chosen Inductance"]
["Rdcr",{"$f":"'Design Converter'!E18/1000","v":0.17},"W",null,"Chosen Inductor DCR"]
[]
["Don2",{"$f":"(Vout+Iout*Rdcr)/Vin","v":0.25106250000000002},null,null,"**Edit to add Rdson**"]
["Doff2",{"$f":"1-_Don2","v":0.74893750000000003}]
[]
["Rdson1",1.85,"W"]
["Rdson2",0.7,"W"]
[]
["Don_Vinmin_2",{"$f":"(Vout+Iout*(Rdcr+Rdson2))/(VIN_min+Iout*Rdson2)","v":0.67331136738056008},null,null,"Duty cycles adjusted for DCR and shunt voltage drops"]
["Don_Vinnom_2",{"$f":"(Vout+Iout*(Rdcr+Rdson2))/(VIN_nom+Iout*Rdson2)","v":0.25432482887367763},null,null,"need to include RDS(on) later"]
["Don_Vinmax_2",{"$f":"(Vout+Iout*(Rdcr+Rdson2))/(VIN_max+Iout*Rdson2)","v":0.20363726955655206}]
[]
["Iripple_Vinmin",{"$f":"(VIN_min-Vout-Rdson1*Iout)*Don_Vinmin_2/(Fsw*Lf)","v":6.1103006589785833E-2},"A","COT"]
["Iripple_Vinnom",{"$f":"(VIN_nom-Vout-Rdson1*Iout)*Don_Vinnom_2/(Fsw*Lf)","v":0.15024239265712505},"A","COT"]
["Iripple_Vinmax",{"$f":"(VIN_max-Vout)*Don_Vinmax_2/(Fsw*Lf)","v":0.16290981564524165},"A","COT"]
[]
["ILpk_Vinmin",{"$f":"Iout+Iripple_Vinmin/2","v":0.33055150329489291},"A","COT"]
["ILpk_Vinnom",{"$f":"Iout+Iripple_Vinnom/2","v":0.3751211963285625},"A","COT"]
["ILpk_Vinmax",{"$f":"Iout+Iripple_Vinmax/2","v":0.38145490782262081},"A","COT"]
[]
["ILIM_Typ",{"$f":"CHOOSE(VARIANT, 0.42, 0.84)","v":0.42},"A",null,"Isat_min",{"$f":"B86*1.2","v":0.504}]
[]
["Ripple current",{"$f":"IF(OR(MODE=1,MODE=2,MODE=3), Iripple_Vinnom, Iripple)","v":0.15024239265712505},"A",null,null,null,null,"% Ripple Current at Nom VIN"]
[null,null,null,null,null,null,null,"Maximum Load Current"]
["Max inductor ripple current",{"$f":"MAX(B78:B80)","v":0.16290981564524165},"A"]
[null,null,null,null,null,"Ripple I","Iin"]
["% Ripple Current",{"$f":"B78/Iout","v":0.20367668863261945},null,"COT",null,{"$f":"B78","v":6.1103006589785833E-2},{"$f":"Iin_Vinmin","v":0.22222222222222221}]
[null,{"$f":"B79/Iout","v":0.50080797552375023},null,"COT",null,{"$f":"B79","v":0.15024239265712505},{"$f":"Iin_Vinnom","v":8.3333333333333329E-2}]
[null,{"$f":"B80/Iout","v":0.54303271881747217},null,"COT",null,{"$f":"B80","v":0.16290981564524165},{"$f":"Iin_Vinmax","v":6.6666666666666666E-2}]
[]
[null,{"$f":"IF(OR(MODE=1, MODE=2,MODE=3), B93, Ilim/Iout)","v":0.50080797552375023}]
[]
["Iripple1",{"$f":"(Vin-Vout)*Don_Vinnom_2/(Fsw*Lf)","v":0.15259489732420659},"A","inductor ripple current with chosen inductance (pk-pk)",null,null,null,null,1]
["Temp",100]
["DCR at hot",{"$f":"Rdcr*(1+0.0039*(B99-25))","v":0.219725},"W"]
["Ipk based on line 100",{"$f":"'Design Converter'!E10+0.5*Iripple1","v":0.3762974486621033}]
[]
[]
["Step 4: Output Capacitor"]
["Icoutrms_VINmin",{"$f":"Iripple_Vinmin/SQRT(12)","v":1.7638918651454165E-2},"A","Output Cap RMS current"]
["Icoutrms_VINnom",{"$f":"Iripple_Vinnom/SQRT(12)","v":4.3371242922142304E-2},"A"]
["Icoutrms_VINmax",{"$f":"Iripple_Vinmax/SQRT(12)","v":4.7028012958206293E-2},"A",null,null,null,{"$f":"Vripple1","v":0.06}]
[]
["Output Ripple Spec (pk-pk)",{"$f":"Vout*0.005","v":0.06},"V","Vout capacitive ripple spec at Vin(nom) = Vripple1"]
[]
["Coutmin"]
["COT",{"$f":"Iripple_Vinnom/(Fsw*8*Vripple1)","v":5.2167497450390644E-7},"F","COT","Min recommended Cout based on ripple spec above",null,null,null,1]
[null,{"$f":"Lf*B83^2/((1.05*Vout)^2-Vout^2)","v":9.533598369578014E-7},"F","COT","Min recommended Cout based on 5% load-off transient spec"]
["CoutMinCOT",{"$f":"MAX(B112:B113, 0.0000022)","v":2.2000000000000001E-6},"F","COT","max of 2 results and 2.2uF"]
[]
["Reported Countmin",{"$f":"CoutMinCOT*1000000","v":2.2000000000000002},"µF"]
[]
["Cout",{"$f":"'Design Converter'!E24/1000000","v":1.2E-5},"F","Chosen Output Capacitance",null,null,null,null,1]
["Resrmax",{"$f":"SQRT((Vripple1/Iripple_Vinnom)^2-(1/(Fsw*Cout*8))^2)","v":0.39897711489951831},"W","Max ESR before ripple exceeds Vripple1",null,null,null,null,1]
["Type1 ESR for sufficient (20mV) COT ripple at FB pin",{"$f":"0.02*Vout/Vref/Iripple_Vinnom","v":1.3311822080498215},"W","(a)"]
["Type2 ESR for sufficient (20mV) COT ripple at FB pin",{"$f":"0.02/Iripple_Vinnom","v":0.13311822080498215},"W","(b)"]
[]
["Type 1 Output Cap RC Time Constant",{"$f":"Cout*B130*1000000","v":0},"µs"]
["Type 2 Output Cap RC Time Constant",{"$f":"Cout*B131*1000000","v":1.597418649659786},"µs"]
["Ton @ Vin(min)",{"$f":"Vout/VIN_min/(Fsw)","v":1.111111111111111E-6},"s"]
["Ton @ Vin(nom)",{"$f":"Vout/VIN_nom/(Fsw)","v":4.1666666666666667E-7},"s"]
["ESR so that RC > Ton/2",{"$f":"B125/2/Cout","v":4.6296296296296294E-2},"W","(c)"]
[]
[]
["Type1: Need ESR of…",{"$f":"IF(MODE=1, MAX(B120,B127), 0)","v":0},"W","Max of (a) and (c)"]
["Type2: Need ESR of…",{"$f":"IF(MODE=2, MAX(B121,B127), 0)","v":0.13311822080498215},"W","Max of (b) and (c)"]
[]
["Reported Cout ESR max",{"$f":"IF(OR(CoutEsrMax>0.5, CoutEsrMax<0, (ISERROR(CoutEsrMax))), \"N/A\", CoutEsrMax*1000)","v":398.97711489951831},"mW"]
[]
["CoutEsr",{"$f":" 'Design Converter'!E26","v":1},"W","Chosen ESR",null,null,null,null,1]
[]
["Actual Output Ripple",{"$f":"Iripple_Vinnom*SQRT(CoutEsr^2+(1/(8*Fsw*Cout))^2)","v":0.15026503309424097},"Vp-p","Vripple2"]
[]
["Minimum Feedforward / Coupling Capacitance",{"$f":"MAX(1000000000000*0.00005/(3*Rfb1_),47)","v":47},"pF",null,null,null,null,{"$f":"0.00005/3/Rfb1_","v":3.6791758646063281E-11}]
["Recommended Cff / Cb",{"$f":"IF(OR(MODE=2,MODE=3), \">\"&ROUND(B139,0),\"\")","v":">47"},"pF"]
["Selected Cff / Cb",{"$f":"'Design Converter'!$E$29","v":56},"pF"]
[]
["Minimum Ripple Generation Capacitance",{"$f":"10/(Fsw*Rfb)","v":3.7079309465140727E-10},"F",{"$f":"1000000000000*B143","v":370.79309465140727},"pF",{"$f":"Rfb","v":44948.697554185725}]
["Recommended Ca",{"$f":"IF(MODE=3, \">\"&ROUND(D143,0),\"\")","v":""},"pF"]
["Selected Ca",{"$f":"'Design Converter'!E31","v":3300},"pF",{"$f":"B145/1000000000000","v":3.3000000000000002E-9},"F"]
[]
["Maximum Ripple Generation Resistance",{"$f":"(VIN_nom-Vout)*B126/((B149/1000)*Ca)","v":227272.72727272726},"W",{"$f":"B147/1000","v":227.27272727272725},"kW"]
["Recommended Ra",{"$f":"IF(MODE=3, \"<\"&ROUND(D147,0),\"\")","v":""},"kW",null,null,null,null,null,null,null,null,"Lf_emi",{"$f":"'Design EMI Filter'!$E$9","v":22},"uH",{"$f":"M148/1000000","v":2.1999999999999999E-5},"H"]
["Ripple amplitude",{"$f":"'Design Converter'!E33","v":20},"mVp-p",null,null,null,null,null,null,null,null,"Cf_emi",{"$f":"'Design EMI Filter'!$E$11","v":4.7},"uF",{"$f":"M149/1000000","v":4.6999999999999999E-6},"F"]
[null,null,null,null,null,null,null,null,null,null,null,"Cd_emi",{"$f":"'Design EMI Filter'!$E$13","v":10},"uF",{"$f":"M150/1000000","v":1.0000000000000001E-5},"F"]
[null,null,null,null,null,null,null,null,null,null,null,"ESR_Cd",{"$f":"'Design EMI Filter'!$E$15","v":3.3},"Ω",{"$f":"M151","v":3.3},"Ω",{"$f":"ESR_Cd&ohm","v":"3.3Ω"}]
["Step 5: Input Capacitor",null,null,null,null,null,null,null,null,null,null,"Min Noise",{"$f":"'Design EMI Filter'!$E$8","v":50},"dB","noise limit"]
["Vinripple1",{"$f":"0.05*VIN_nom","v":2.4000000000000004},"Vp-p","Input voltage ripple spec (pk-pk) at Vin(nom)",null,null,null,null,null,null,null,"Duty Cycle",{"$f":"Vout/VIN_nom/Efficiency_COT_Full_Load","v":0.28901734104046245},null,"calculated duty cycle"]
[null,null,null,null,null,null,null,null,null,null,null,"Target Atten.",{"$f":"20*LOG(Iout/(PI()^2*Fsw*Cin)*SIN(PI()*Duty_Cycle)/0.000001) - Min_Noise","v":35.178331823319667},"dB","calculated attenuation"]
["Icinrms",{"$f":"Iout*SQRT(Don_Vinnom_2*(1-Don_Vinnom_2))","v":0.13064430307627156},"A"]
["Cinmin",{"$f":"Iout*Don_Vinnom_2*(1-Don_Vinnom_2)/(Vinripple1*Fsw-Iout*RCinEsr)*1000000","v":3.9509106335537399E-2},"µF"]
["Reported Cinmin",{"$f":"IF(Cinmin<2.2, 2.2,Cinmin)","v":2.2000000000000002},"µF",null,null,null,null,null,null,null,null,"Filter Inductor"]
["Cin",{"$f":"'Design Converter'!E37/1000000","v":2.2000000000000001E-6},"F","Input capacitance",null,null,null,null,null,null,null,"Irms rating",{"$f":"Iout*1.5","v":0.44999999999999996},"A","calculated suggested IRMS rating"]
["CinEsrMax",{"$f":"-(Iout*Don_Vinnom_2*(1-Don_Vinnom_2)/(Cin*Fsw)-Vinripple1)/(Iout+Iripple_Vinnom/2)","v":6.2830338029937325},"W"]
["RCinEsr",{"$f":"'Design Converter'!E39/1000","v":3.0000000000000001E-3},"W","Input capacitance series resistance (ESR)"]
["Reported Cin ESR max",{"$f":"IF(OR(CinEsrMax>12, CinEsrMax<0), \"N/A\",CinEsrMax*1000)","v":6283.0338029937329},"mΩ",null,null,null,null,null,null,null,null,"Filter Capacitor"]
[null,null,null,null,null,null,null,null,null,null,null,"Cfa calculation",{"$f":"Cin/(Cin*Lf_emi*0.000001*(2*PI()*Fsw/10)^2 - 1) / 0.000001","v":-2.2000151332869611},"uF","calculated value"]
["COT input voltage ripple - Vinripple2",{"$f":"Iout*Don_Vinnom_2*(1-Don_Vinnom_2)/(Cin*Fsw)+(Iout +Iripple_Vinnom/2)*RCinEsr","v":4.4226206837179378E-2},"Vp-p",null,{"$f":"Iout*Don_Vinmax_2*(1-Don_Vinmax_2)/(Cin*Fsw)","v":3.6856620910023681E-2},"Vp-p",null,null,null,null,null,"Cfb calculation",{"$f":"1/(Lf_emi)*(10^(Target_Att/40)/(2*PI()*Fsw))^2/0.000001","v":0.18358266618563782},"uF","calculated value"]
[null,null,null,null,null,null,null,null,null,null,null,"Cf",{"$f":"MAX(M162,M163)","v":0.18358266618563782},"uF","calculated value"]
[]
[]
[null,null,null,null,null,null,null,null,null,null,null,"Damping Capacitor"]
["Step 6: Soft Start",null,null,null,null,null,null,null,null,null,null,"Cd ≥",{"$f":"4*Cin*1000000","v":8.8000000000000007},"uF","calculated value"]
["Tss",{"$f":"'Design Converter'!#REF!/1000","v":{"$error":"#REF!"}},"s","Soft-start time",null,null,null,null,null,null,null,"Cd ESR ≥",{"$f":"SQRT(Lf_emi/Cin)","v":3.1622776601683795},"Ω","calculated value"]
["Iss",1.0000000000000001E-5,"A","Soft-start current"]
["Css",{"$f":"8.16*Tss/1000000","v":{"$error":"#NAME?"}},"F","Required soft-start cap"]
["Css_u",{"$f":"'Standard Value Calculator'!B4","v":{"$error":"#NAME?"}},"F","User selected SS cap",null,null,null,null,null,null,null,"CIN and Cd Capacitors Current Sharing and Rating"]
[null,null,null,null,null,null,null,null,null,null,null,"Cd impedance",{"$f":" 1/(2*PI()*Fsw*Cd_emi) + ESR_Cd","v":3.326525823848649},"Ω","calculated Cd impedance at the sw. frequency"]
["Step 7: Other Components - UVLO, PGOOD",null,null,null,null,null,null,null,null,null,null,"Cin impedance",{"$f":" 1/(2*PI()*Fsw*Cin) + RCinEsr","v":0.12357192658476919},"Ω","calculated CIN impedance at the sw. frequency"]
[]
["Rising UVLO/EN Threshold",1.5,"V",null,null,null,null,null,null,null,null,"IRMS Total Input Cap",{"$f":"Iout*SQRT(Duty_Cycle*(1-Duty_Cycle))","v":0.1359917960233363},"A","calculated total IRMS current for CIN and Cd combined"]
["Falling UVLO/EN Threshold",1.4,"V",null,null,null,null,null,null,null,null,"IRMS Cd Act",{"$f":"IRMSTOT*(ZCIN/(ZCIN+ZCd))","v":4.8708093074219484E-3},"A","Calculated min IRMS current rating for Cd"]
["Voltage Hysteresis",{"$f":"B176-B177","v":0.10000000000000009},"V",null,null,null,null,null,null,null,null,"IRMS CIN",{"$f":"IRMSTOT*(ZCd/(ZCIN+ZCd))","v":0.13112098671591435},"A","Calculated min IRMS current rating for CIN"]
[]
["VINUVLO_ON",{"$f":"'Design Converter'!E48","v":6},"V"]
["VINUVLO_OFF",null,"V"]
[]
["RUV1",{"$f":"'Design Converter'!E49*1000","v":1000},"kΩ",{"$f":"'Standard Value Calculator'!J16","v":1000},"kΩ",{"$f":"IF(Ruvlo1<0,\"N/A\",D183)","v":1000},{"$f":"IF(Ruvlo1<0,\"N/A\",D183&\"kΩ\")","v":"1000kΩ"}]
["RUV2",{"$f":"Vuvlo_on*Ruvlo1/(VINuvlo_on-Vuvlo_on)","v":333.33333333333331},"kΩ",{"$f":"'Standard Value Calculator'!J17","v":332},"kΩ",{"$f":"IF(F183=\"N/A\",\"N/A\",D184)","v":332},{"$f":"IF(G183=\"N/A\",\"N/A\",D184&\"kΩ\")","v":"332kΩ"}]
[]
["VINUVLO_ON_ACTUAL",{"$f":"(D183+D184)/D184*Vuvlo_on","v":6.0180722891566267},"V"]
["VINUVLO_OFF_ACTUAL",{"$f":"(D183+D184)/D184*Vuvlo_off","v":5.6168674698795176},"V"]
[]
["RPG",20,"kΩ"]
[]
[]
["Step 8: FB Divider"]
["Pi",3.1415926500000002,null,"p"]
["Toff_Vinmax",{"$f":"(1-Don_Vinmax_2)/Fsw","v":1.3272712174057466E-6},"sec"]
["Ton_Vinmin",{"$f":"IF(VIN_min>Vout, (1-Don_Vinmin_2)/Fsw, Don_Vinmin_2/Fsw)","v":5.4448105436573318E-7},"sec"]
[]
["Rfb1",{"$f":"'Design Converter'!E43*1000","v":453000},"W","Lower Feedback Resistance - chosen by user",null,null,null,null,1]
["Rfb2",{"$f":"IF(Vout=Vref,100000000,Vref*B197/((Vout-Vref)))","v":50333.333333333328},"W","Upper Feedback Resistance"]
["Rfb2_u",{"$f":"IF(Vout=Vref,\"N/A\",'Standard Value Calculator'!J10)","v":49900},"W","Std Value Upper Feedback Resistance"]
["Rfb",{"$f":"Rfb1_*Rfb2_u/(Rfb1_+Rfb2_u)","v":44948.697554185725},"W","Rfb1 || Rfb2_u"]
[null,{"$f":"1.2/Rfb2_u*(Rfb2_u+Rfb1_)","v":12.0937875751503},"V"]
["Ifb",{"$f":"CHOOSE(MODE_VOUT, IF(Vout=5, 0.000007, 0.0000038), Vout/(Rfb1_+Rfb2_u))","v":2.3861602704314974E-5}]
[]
["Other Input Variables"]
["Rfets",0,"W","Series resistance due to FETs",null,null,null,{"$f":"_Don2*RdsonTop+Doff2*RdsonBot+B209*Vin^2*Fsw/2/(((Iripple1/SQRT(3))^2))","v":446.28748505910738}]
["Diode loss eq res",{"$f":"0.00000002*Fsw*0.6*4/Iripple1","v":0.18873501345730365}]
["Fet loss eq res",{"$f":"_Don2*RdsonTop+Doff2*RdsonBot","v":1.0261687500000001}]
["cap loss eq res",{"$f":"B209*Vin^2*Fsw/2/(((Iripple1/SQRT(3))^2))","v":445.26131630910737}]
["Sw cap",5.0000000000000001E-9]
[]
["Step 8: Efficiency"]
[]
["Design"]
["Ta",25,"°C","Ambient Temperature"]
["Components"]
["LTc",{"$f":"4000/1000000","v":4.0000000000000001E-3},"%/°C","Inductor DCR Temp Co"]
["θCA",40,"°C/W","Inductor Core to Ambient Thermal Resistance"]
["RCinEsr",{"$f":"RCinEsr","v":3.0000000000000001E-3},"W","Input Capacitor ESR"]
["Part Characteristics"]
["Vcc",{"$f":"IF(Vin>7.7,7.5,Vin-0.2)","v":7.5},"V"]
["Deadtime"]
["Deadtime",6.9999999999999998E-9,"s","Total Deadtime",null,null,"20ns for LM5166"]
["IQ"]
["IQ ",1.0000000000000001E-5,"A","Quiescent Current Of Controller (Not Switching!)"]
[]
[]
["IC Power Disipation","Value","Units"]
["Power Dis",{"$f":"Efficiency!AZ106","v":0.54365085955032511},"W"]
["Temp rise",{"$f":"B228*ThetaJA","v":22.344050327518364},"°C"]
["Current (switching)",{"$f":"(Qg_Q1+Qg_Q2)*Fsw+Iq","v":{"$error":"#NAME?"}},"A"]
["Qrr Current",{"$f":"Qrr_Q2*Fsw","v":{"$error":"#NAME?"}},"A"]
["Diode Current",{"$f":"C232/Vin","v":{"$error":"#NAME?"}},{"$f":"Deadtime*Fsw*(Ipp/2)*(Vsd_Q1+Vsd_Q2)","v":{"$error":"#NAME?"}}]
["Total Application Switching IQ",{"$f":"SUM(B230:B232)","v":{"$error":"#NAME?"}},"A"]
[]
[]
["SCHEMATIC LABELS"]
[]
[]
[{"$f":"\"RUV1 = \"&'Design Converter'!E49&\"MΩ\"","v":"RUV1 = 1MΩ"},{"$f":"C275","v":"1MΩ"}]
[{"$f":"\"RUV2 = \"&'Design Converter'!E50&\"kΩ\"","v":"RUV2 = 332kΩ"},{"$f":"C276","v":"332kΩ"}]
[{"$f":"\"Rhys = \"&'Design Converter'!E52&\"kΩ\"","v":"Rhys = 5.61686746987952kΩ"},{"$f":"C277","v":{"$error":"#REF!"}}]
[]
[{"$f":"\"LF = \"&'Design Converter'!E17&\"µH\"","v":"LF = 100µH"},{"$f":"'Design Converter'!E17&\"µH\"","v":"100µH"}]
[{"$f":"\"Rdcr = \"&Rdcr*1000&\"mΩ\"","v":"Rdcr = 170mΩ"},{"$f":"Rdcr*1000&\"mΩ\"","v":"170mΩ"}]
[{"$f":"\"Rt = \"&'Design Converter'!I43&\"kΩ\"","v":"Rt = kΩ"},{"$f":"'Design Converter'!I43&\"kΩ\"","v":"kΩ"}]
[{"$f":"\"Css = \"&ROUND(Css_u*1000000000,1)&\"nF\"","v":{"$error":"#NAME?"}},{"$f":"ROUND(Css_u*1000000000,1)&\"nF\"","v":{"$error":"#NAME?"}}]
[]
["VIN",{"$f":"VIN_nom&\"V\"","v":"48V"}]
["VIN range",{"$f":"VIN_min&\"V...\"&VIN_max&\"V\"","v":"18V...60V"}]
[]
[{"$f":"\"VOUT = \"&'Design Converter'!E9&\"V\"","v":"VOUT = 12V"},{"$f":"'Design Converter'!E9&\"V\"","v":"12V"}]
[null,null,{"$f":"R30","v":"22"},{"$f":"ROUNDUP('Design Converter'!$E$24/C252,0)","v":1}]
[{"$f":"\"COUT = \"&'Design Converter'!$E$24&\"µF\"","v":"COUT = 12µF"},{"$f":"'Design Converter'!$E$24&\"µF\"","v":"12µF"},{"$f":"IF('Design Converter'!$E$24=OR(10, 22, 47, 100), 'Design Converter'!$E$24,C252)","v":"22"},{"$f":"IF(D252=1, \"\",B255)","v":""},{"$f":"D253&C253&\"µF\"","v":"22µF"},{"$f":"C253&\"µF\"","v":"22µF"}]
["Capacitance per component (Cout)",{"$f":"C252&\"µF\"","v":"22µF"}]
["# of output caps",{"$f":"D252&\" x \"","v":"1 x "}]
[]
["CIN",{"$f":"Cin*1000000&\"µF\"","v":"2.2µF"}]
["Capacitance per component (Cin)",{"$f":"\"2.2µF\"","v":"2.2µF"}]
["# of input caps",{"$f":"ROUNDUP(Cin*1000000/2.2,0)&\" x \"","v":"1 x "}]
[]
["Fixed VOUT?",{"$f":"IF(MODE_VOUT=1, \"YES\", \"NO\")","v":"NO"}]
["FB resistor ref des shown or not?",{"$f":"IF(MODE_VOUT=2, \"YES\", \"NO\")","v":"YES"},{"$f":"IF(MODE_VOUT=2, \"R1\", \"\")","v":"R1"},{"$f":"IF(MODE_VOUT=2, \"R2\", \"\")","v":"R2"}]
[{"$f":"\"RFB1 = \"&'Design Converter'!E43&\"kΩ\"","v":"RFB1 = 453kΩ"},{"$f":"'Design Converter'!E43&\"kΩ\"","v":"453kΩ"},{"$f":"IF(MODE=1,'Design Converter'!E43&\"kΩ\", \"\")","v":""}]
[{"$f":"\"RFB2 = \"&IF(Vout=Vref,\"OPEN\",'Design Converter'!E44&\"kΩ\")","v":"RFB2 = 49.9kΩ"},{"$f":"IF(Vout=Vref,\"OPEN\",Rfb2_u/1000&\"kΩ\")","v":"49.9kΩ"},{"$f":"IF(MODE=1, IF(Vout=Vref, \"OPEN\",Rfb2_u/1000&\"kΩ\" ), \"\")","v":""}]
[]
[]
["Show Rt resistor ref des?",{"$f":"IF(OR(MODE=1,MODE=2,MODE=3), \"YES\", \"NO\")","v":"YES"},{"$f":"IF(MODE=4,\"\", \"Rt\")","v":"Rt"}]
["Rt",{"$f":"IF(MODE=4, \"\", 'Standard Value Calculator'!J4/1000&\"kΩ\")","v":"49.9kΩ"}]
[]
["Show ESR resistor ref des?",{"$f":"IF(OR(MODE=3, MODE=4), \"NO\", \"YES\")","v":"YES"},{"$f":"IF(OR(MODE=3, MODE=4),\"\",\"Resr\")","v":"Resr"}]
[{"$f":"\"RESR = \"&'Design Converter'!E26&\"mΩ\"","v":"RESR = 1mΩ"},{"$f":"IF(OR(MODE=3,MODE=4), \"\", 'Design Converter'!E26&\"Ω\")","v":"1Ω"},null,null,null,{"$f":"B120","v":1.3311822080498215}]
["Resr",{"$f":"IF(MODE=1, \">\"&ROUND(B130,3), IF(MODE=2,  \">\"&ROUND(B131,3),IF(MODE=3,ROUND(B119,3),\"\")))","v":">0.133"}]
[]
["Adjustable UVLO?",{"$f":"IF(MODE_UVLO=1, \"YES\", \"NO\")","v":"YES"},{"$f":"IF(MODE_UVLO=1,\"Ren1\", \"\")","v":"Ren1"},{"$f":"IF(MODE_UVLO=1, \"Ren2\", \"\")","v":"Ren2"},{"$f":"IF(MODE_UVLO=1, \"Rhys\", \"\")","v":"Rhys"},"Value","Units","BOM display"]
[{"$f":"\"RUV1 = \"&C275","v":"RUV1 = 1MΩ"},{"$f":"'Design Converter'!E49&\" MΩ\"","v":"1 MΩ"},{"$f":"IF(MODE_UVLO=1,'Design Converter'!E49&\"MΩ\", \"\")","v":"1MΩ"},null,null,{"$f":"IF(MODE_UVLO=1,'Design Converter'!E49, \"\")","v":1},{"$f":"IF(MODE_UVLO=1,\"MΩ\", \"\")","v":"MΩ"},{"$f":"IF(MODE_UVLO=1,'Design Converter'!E49&\"M\", \"\")","v":"1M"}]
[{"$f":"\"RUV2 = \"&C276","v":"RUV2 = 332kΩ"},{"$f":"IF(D184>=1000, D184/1000&\" MΩ\", D184&\" kΩ\")","v":"332 kΩ"},{"$f":"IF(MODE_UVLO=1, IF(D184<1, D184*1000&\"Ω\", IF(D184<1000, D184&\"kΩ\", D184/1000&\"MΩ\")), \"\")","v":"332kΩ"},null,null,{"$f":"IF(MODE_UVLO=1, IF(D184<1, D184*1000, IF(D184<1000, D184, D184/1000)), \"\")","v":332},{"$f":"IF(MODE_UVLO=1, IF(D184<1, \"Ω\", IF(D184<1000,\"kΩ\", \"MΩ\")), \"\")","v":"kΩ"},{"$f":"IF(MODE_UVLO=1, IF(D184<1, D184*1000, IF(D184<1000, D184&\"k\", D184/1000&\"M\")), \"\")","v":"332k"}]
[{"$f":"\"RHYS = \"&C277","v":{"$error":"#REF!"}},{"$f":"IF(#REF!<1000,#REF!& \" kΩ\",#REF!& \" MΩ\")","v":{"$error":"#REF!"}},{"$f":"IF(MODE_UVLO=1, IF(#REF!<1,#REF!* 1000&\"Ω\", IF(#REF!<1000,#REF!& \"kΩ\",#REF!/ 1000&\"MΩ\")), \"\")","v":{"$error":"#REF!"}},null,null,{"$f":"IF(MODE_UVLO=1, IF(#REF!<1,#REF!* 1000, IF(#REF!<1000,#REF!,#REF!/ 1000)), \"\")","v":{"$error":"#REF!"}},{"$f":"IF(MODE_UVLO=1, IF(#REF!<1, \"Ω\", IF(#REF!<1000,\"kΩ\", \"MΩ\")), \"\")","v":{"$error":"#REF!"}},{"$f":"IF(MODE_UVLO=1, IF(#REF!<1,#REF!* 1000, IF(#REF!<1000,#REF!& \"k\",#REF!& \"M\")), \"\")","v":{"$error":"#REF!"}}]
[]
[{"$f":"\"Css = \"&Css*1000000000&\"nF\"","v":{"$error":"#NAME?"}},{"$f":"Css*1000000000&\"nF\"","v":{"$error":"#NAME?"}}]
["Cbst",{"$f":"\"2.2nF\"","v":"2.2nF"},null,{"$f":"B280","v":"2.2nF"}]
[]
[]
["Rset resistor ref des?",{"$f":"IF(MODE_RSET=2, \"YES\", \"NO\")","v":"NO"},{"$f":"IF(MODE_RSET=2, \"R3\", \"\")","v":""},null,null,{"$f":"MODE_RSET","v":1}]
["Rset",{"$f":"IF(MODE_RSET=2, C284&\"kΩ\", \"\")","v":""},{"$f":"IF(MODE_ILIM=3,100,IF(MODE_ILIM=2,56.2,IF(MODE_ILIM=4,24.9,0)))","v":{"$error":"#REF!"}}]
[]
[]
["Rpgood","100kΩ"]
[]
["Cff / Cb?",{"$f":"IF(MODE=2, \"Cff\", IF(MODE=3,\"Cb\",\"\"))","v":"Cff"}]
[{"$f":"\"Cff / Cb=\"&B290","v":"Cff / Cb=56pF"},{"$f":"IF(OR(MODE=2,MODE=3),B141&\"pF\",\"\")","v":"56pF"}]
[]
["Ca?",{"$f":"IF(MODE=3, \"Ca\",\"\")","v":""},null,{"$f":"Ca","v":3.3000000000000002E-9},{"$f":"Ton_Vinmin","v":5.4448105436573318E-7}]
["Ca=",{"$f":"IF(MODE=3,B145&\"pF\",\"\")","v":""}]
[]
["Ra?",{"$f":"IF(MODE=3, \"Ra\",\"\")","v":""},"Injected Ripple"]
["Ra=",{"$f":"IF(MODE=3,Ra&\"kΩ\",\"\")","v":""},{"$f":"(VIN_nom-Vout)*Ton_Vin_nom/(Ra*Ca)/1000","v":2.0112630732099759E-2},{"$f":"ROUNDUP(1000*C296,0)","v":21},null,{"$f":"IF(MODE=3,Ra&\"k\",\"\")","v":""}]
[]
["Lf(emi)",{"$f":"M148&\"µH\"","v":"22µH"}]
["Cf(emi)",{"$f":"M149&\"µF\"","v":"4.7µF"}]
["Df(emi)",{"$f":"M150&\"µF\"","v":"10µF"}]
[]
["Full-load efficiency",{"$f":"ROUND(Efficiency!CE106,1)&\"%\"","v":"86.5%"}]
["Full-load efficiency",{"$f":"ROUND(Efficiency!CE107,1)&\"%\"","v":"87.2%"}]
["10% load efficiency",{"$f":"ROUND(Efficiency!CE16,1)&\"%\"","v":"71.8%"},"linear scale only"]
["1% load efficiency",{"$f":"ROUND(Efficiency!CE56,1)&\"%\"","v":"81.9%"},"log scale only"]
[]
["Blank out",{"$f":"IF(C307=\"y\",\"\",\"|\")","v":"|"},"n"]
[]
["OUTPUT CURRENT",{"$f":"'Design Converter'!$E$10&\"A\"","v":"0.3A"}]
[]
["VIN ",2]
["RT",5]
["EN",7]
["PGOOD",6]
["SS",4]
["ILIM",3]
["GND",10]
["FB",8]
["SW",1]
["HYS",9]

{"sheet":"Standard Value Calculator","index":5,"n_rows":159,"n_cols":11,"rows_kept":159,"cut":false,"hidden":true,"merged":[]}
[]
["Capacitors","Css","Cout","Cin","Cb"]
["Inputs",{"$f":"Css","v":{"$error":"#NAME?"}},{"$f":"Cout","v":1.2E-5},{"$f":"Cin","v":2.2000000000000001E-6},{"$f":"Cb","v":0},null,null,"Resistors","inputs","Standard Result"]
["Standard Result",{"$f":"SUM(B6:B158)/1000000000000","v":{"$error":"#NAME?"}},{"$f":"SUM(C6:C158)/1000000000000","v":1.2E-5},{"$f":"SUM(D6:D158)/1000000000000","v":2.2000000000000001E-6},{"$f":"IF(E3=\"OPEN\",\"OPEN\",SUM(E6:E158)/1000000000000)","v":0},null,null,"Rt",{"$f":"Rt","v":50000},{"$f":"IF(I4>(INT(0.5+100*POWER(10,IF(96*(LOG(I4)-INT(LOG(I4)))-ROUND(96*(LOG(I4)-INT(LOG(I4))),0)<0,ROUND(96*(LOG(I4)-INT(LOG(I4))),0)-1,ROUND(96*(LOG(I4)-INT(LOG(I4))),0))/96))*POWER(10,INT(LOG(I4))-2)+INT(0.5+100*POWER(10,(IF(96*(LOG(I4)-INT(LOG(I4)))-ROUND(96*(LOG(I4)-INT(LOG(I4))),0)<0,ROUND(96*(LOG(I4)-INT(LOG(I4))),0)-1,ROUND(96*(LOG(I4)-INT(LOG(I4))),0))+1)/96))*POWER(10,INT(LOG(I4))-2))/2,INT(0.5+100*POWER(10,(IF(96*(LOG(I4)-INT(LOG(I4)))-ROUND(96*(LOG(I4)-INT(LOG(I4))),0)<0,ROUND(96*(LOG(I4)-INT(LOG(I4))),0)-1,ROUND(96*(LOG(I4)-INT(LOG(I4))),0))+1)/96))*POWER(10,INT(LOG(I4))-2),INT(0.5+100*POWER(10,IF(96*(LOG(I4)-INT(LOG(I4)))-ROUND(96*(LOG(I4)-INT(LOG(I4))),0)<0,ROUND(96*(LOG(I4)-INT(LOG(I4))),0)-1,ROUND(96*(LOG(I4)-INT(LOG(I4))),0))/96))*POWER(10,INT(LOG(I4))-2))","v":49900},"Ω"]
["(pF)"]
[0.47,{"$f":"IF(IF((B$3*10^12-$A7)*(B$3*10^12-$A6)*-1<0,0,1)*IF(ABS(B$3*10^12-$A7)>(B$3*10^12-$A6),$A6,$A7)=B7,0,IF((B$3*10^12-$A7)*(B$3*10^12-$A6)*-1<0,0,1)*IF(ABS(B$3*10^12-$A7)>(B$3*10^12-$A6),$A6,$A7))","v":{"$error":"#NAME?"}},{"$f":"IF(IF((C$3*10^12-$A7)*(C$3*10^12-$A6)*-1<0,0,1)*IF(ABS(C$3*10^12-$A7)>(C$3*10^12-$A6),$A6,$A7)=C7,0,IF((C$3*10^12-$A7)*(C$3*10^12-$A6)*-1<0,0,1)*IF(ABS(C$3*10^12-$A7)>(C$3*10^12-$A6),$A6,$A7))","v":0},{"$f":"IF(IF((D$3*10^12-$A7)*(D$3*10^12-$A6)*-1<0,0,1)*IF(ABS(D$3*10^12-$A7)>(D$3*10^12-$A6),$A6,$A7)=D7,0,IF((D$3*10^12-$A7)*(D$3*10^12-$A6)*-1<0,0,1)*IF(ABS(D$3*10^12-$A7)>(D$3*10^12-$A6),$A6,$A7))","v":0},{"$f":"IF(IF((E$3*10^12-$A7)*(E$3*10^12-$A6)*-1<0,0,1)*IF(ABS(E$3*10^12-$A7)>(E$3*10^12-$A6),$A6,$A7)=E7,0,IF((E$3*10^12-$A7)*(E$3*10^12-$A6)*-1<0,0,1)*IF(ABS(E$3*10^12-$A7)>(E$3*10^12-$A6),$A6,$A7))","v":0},null,null,"Rshunt",{"$f":"Rshunt","v":{"$error":"#NAME?"}},{"$error":"#NAME?"},"Ω"]
[0.56000000000000005,{"$f":"IF(IF((B$3*10^12-$A8)*(B$3*10^12-$A7)*-1<0,0,1)*IF(ABS(B$3*10^12-$A8)>(B$3*10^12-$A7),$A7,$A8)=B8,0,IF((B$3*10^12-$A8)*(B$3*10^12-$A7)*-1<0,0,1)*IF(ABS(B$3*10^12-$A8)>(B$3*10^12-$A7),$A7,$A8))","v":{"$error":"#NAME?"}},{"$f":"IF(IF((C$3*10^12-$A8)*(C$3*10^12-$A7)*-1<0,0,1)*IF(ABS(C$3*10^12-$A8)>(C$3*10^12-$A7),$A7,$A8)=C8,0,IF((C$3*10^12-$A8)*(C$3*10^12-$A7)*-1<0,0,1)*IF(ABS(C$3*10^12-$A8)>(C$3*10^12-$A7),$A7,$A8))","v":0},{"$f":"IF(IF((D$3*10^12-$A8)*(D$3*10^12-$A7)*-1<0,0,1)*IF(ABS(D$3*10^12-$A8)>(D$3*10^12-$A7),$A7,$A8)=D8,0,IF((D$3*10^12-$A8)*(D$3*10^12-$A7)*-1<0,0,1)*IF(ABS(D$3*10^12-$A8)>(D$3*10^12-$A7),$A7,$A8))","v":0},{"$f":"IF(IF((E$3*10^12-$A8)*(E$3*10^12-$A7)*-1<0,0,1)*IF(ABS(E$3*10^12-$A8)>(E$3*10^12-$A7),$A7,$A8)=E8,0,IF((E$3*10^12-$A8)*(E$3*10^12-$A7)*-1<0,0,1)*IF(ABS(E$3*10^12-$A8)>(E$3*10^12-$A7),$A7,$A8))","v":0},null,null,"Rc1ea",{"$f":"Rcea1","v":{"$error":"#NAME?"}},{"$error":"#NAME?"},"Ω"]
[0.68,{"$error":"#NAME?"},0,0,0]
[0.82,{"$error":"#NAME?"},0,0,0,null,null,"Rfb1",{"$f":"Rfb1_","v":453000},453000,"Ω"]
[1,{"$error":"#NAME?"},0,0,0,null,null,"Rfb2",{"$f":"Rfb2_","v":50333.333333333328},{"$f":"IF(I10=\"OPEN\",\"OPEN\",IF(I10>(INT(0.5+100*POWER(10,IF(96*(LOG(I10)-INT(LOG(I10)))-ROUND(96*(LOG(I10)-INT(LOG(I10))),0)<0,ROUND(96*(LOG(I10)-INT(LOG(I10))),0)-1,ROUND(96*(LOG(I10)-INT(LOG(I10))),0))/96))*POWER(10,INT(LOG(I10))-2)+INT(0.5+100*POWER(10,(IF(96*(LOG(I10)-INT(LOG(I10)))-ROUND(96*(LOG(I10)-INT(LOG(I10))),0)<0,ROUND(96*(LOG(I10)-INT(LOG(I10))),0)-1,ROUND(96*(LOG(I10)-INT(LOG(I10))),0))+1)/96))*POWER(10,INT(LOG(I10))-2))/2,INT(0.5+100*POWER(10,(IF(96*(LOG(I10)-INT(LOG(I10)))-ROUND(96*(LOG(I10)-INT(LOG(I10))),0)<0,ROUND(96*(LOG(I10)-INT(LOG(I10))),0)-1,ROUND(96*(LOG(I10)-INT(LOG(I10))),0))+1)/96))*POWER(10,INT(LOG(I10))-2),INT(0.5+100*POWER(10,IF(96*(LOG(I10)-INT(LOG(I10)))-ROUND(96*(LOG(I10)-INT(LOG(I10))),0)<0,ROUND(96*(LOG(I10)-INT(LOG(I10))),0)-1,ROUND(96*(LOG(I10)-INT(LOG(I10))),0))/96))*POWER(10,INT(LOG(I10))-2)))","v":49900},"Ω"]
[1.2,{"$error":"#NAME?"},0,0,0]
[1.5,{"$error":"#NAME?"},0,0,0]
[1.8,{"$error":"#NAME?"},0,0,0,null,null,"Rs",{"$f":"Rs_ideal*1000","v":{"$error":"#NAME?"}},{"$f":"IF(I13=0,0,IF(I13>(INT(0.5+100*POWER(10,IF(96*(LOG(I13)-INT(LOG(I13)))-ROUND(96*(LOG(I13)-INT(LOG(I13))),0)<0,ROUND(96*(LOG(I13)-INT(LOG(I13))),0)-1,ROUND(96*(LOG(I13)-INT(LOG(I13))),0))/96))*POWER(10,INT(LOG(I13))-2)+INT(0.5+100*POWER(10,(IF(96*(LOG(I13)-INT(LOG(I13)))-ROUND(96*(LOG(I13)-INT(LOG(I13))),0)<0,ROUND(96*(LOG(I13)-INT(LOG(I13))),0)-1,ROUND(96*(LOG(I13)-INT(LOG(I13))),0))+1)/96))*POWER(10,INT(LOG(I13))-2))/2,INT(0.5+100*POWER(10,(IF(96*(LOG(I13)-INT(LOG(I13)))-ROUND(96*(LOG(I13)-INT(LOG(I13))),0)<0,ROUND(96*(LOG(I13)-INT(LOG(I13))),0)-1,ROUND(96*(LOG(I13)-INT(LOG(I13))),0))+1)/96))*POWER(10,INT(LOG(I13))-2),INT(0.5+100*POWER(10,IF(96*(LOG(I13)-INT(LOG(I13)))-ROUND(96*(LOG(I13)-INT(LOG(I13))),0)<0,ROUND(96*(LOG(I13)-INT(LOG(I13))),0)-1,ROUND(96*(LOG(I13)-INT(LOG(I13))),0))/96))*POWER(10,INT(LOG(I13))-2)))","v":{"$error":"#NAME?"}},"mΩ"]
[2.2000000000000002,{"$f":"IF(IF((B$3*10^12-$A15)*(B$3*10^12-$A14)*-1<0,0,1)*IF(ABS(B$3*10^12-$A15)>(B$3*10^12-$A14),$A14,$A15)=B15,0,IF((B$3*10^12-$A15)*(B$3*10^12-$A14)*-1<0,0,1)*IF(ABS(B$3*10^12-$A15)>(B$3*10^12-$A14),$A14,$A15))","v":{"$error":"#NAME?"}},{"$f":"IF(IF((C$3*10^12-$A15)*(C$3*10^12-$A14)*-1<0,0,1)*IF(ABS(C$3*10^12-$A15)>(C$3*10^12-$A14),$A14,$A15)=C15,0,IF((C$3*10^12-$A15)*(C$3*10^12-$A14)*-1<0,0,1)*IF(ABS(C$3*10^12-$A15)>(C$3*10^12-$A14),$A14,$A15))","v":0},{"$f":"IF(IF((D$3*10^12-$A15)*(D$3*10^12-$A14)*-1<0,0,1)*IF(ABS(D$3*10^12-$A15)>(D$3*10^12-$A14),$A14,$A15)=D15,0,IF((D$3*10^12-$A15)*(D$3*10^12-$A14)*-1<0,0,1)*IF(ABS(D$3*10^12-$A15)>(D$3*10^12-$A14),$A14,$A15))","v":0},{"$f":"IF(IF((E$3*10^12-$A15)*(E$3*10^12-$A14)*-1<0,0,1)*IF(ABS(E$3*10^12-$A15)>(E$3*10^12-$A14),$A14,$A15)=E15,0,IF((E$3*10^12-$A15)*(E$3*10^12-$A14)*-1<0,0,1)*IF(ABS(E$3*10^12-$A15)>(E$3*10^12-$A14),$A14,$A15))","v":0},null,null,"Cslope_ideal",{"$f":"Cslope_ideal","v":{"$error":"#NAME?"}},{"$f":"#REF!*1000000000000","v":{"$error":"#REF!"}},"pF"]
[2.7,{"$error":"#NAME?"},0,0,0]
[3.3,{"$error":"#NAME?"},0,0,0,null,null,"Ruv1",{"$f":"Ruvlo1","v":1000},{"$f":"IF(I16=\"OPEN\",\"OPEN\",IF(I16>(INT(0.5+100*POWER(10,IF(96*(LOG(I16)-INT(LOG(I16)))-ROUND(96*(LOG(I16)-INT(LOG(I16))),0)<0,ROUND(96*(LOG(I16)-INT(LOG(I16))),0)-1,ROUND(96*(LOG(I16)-INT(LOG(I16))),0))/96))*POWER(10,INT(LOG(I16))-2)+INT(0.5+100*POWER(10,(IF(96*(LOG(I16)-INT(LOG(I16)))-ROUND(96*(LOG(I16)-INT(LOG(I16))),0)<0,ROUND(96*(LOG(I16)-INT(LOG(I16))),0)-1,ROUND(96*(LOG(I16)-INT(LOG(I16))),0))+1)/96))*POWER(10,INT(LOG(I16))-2))/2,INT(0.5+100*POWER(10,(IF(96*(LOG(I16)-INT(LOG(I16)))-ROUND(96*(LOG(I16)-INT(LOG(I16))),0)<0,ROUND(96*(LOG(I16)-INT(LOG(I16))),0)-1,ROUND(96*(LOG(I16)-INT(LOG(I16))),0))+1)/96))*POWER(10,INT(LOG(I16))-2),INT(0.5+100*POWER(10,IF(96*(LOG(I16)-INT(LOG(I16)))-ROUND(96*(LOG(I16)-INT(LOG(I16))),0)<0,ROUND(96*(LOG(I16)-INT(LOG(I16))),0)-1,ROUND(96*(LOG(I16)-INT(LOG(I16))),0))/96))*POWER(10,INT(LOG(I16))-2)))","v":1000},"kΩ"]
[3.9,{"$error":"#NAME?"},0,0,0,null,null,"Ruv2",{"$f":"Ruvlo2","v":333.33333333333331},{"$f":"IF(I17=\"OPEN\",\"OPEN\",IF(I17>(INT(0.5+100*POWER(10,IF(96*(LOG(I17)-INT(LOG(I17)))-ROUND(96*(LOG(I17)-INT(LOG(I17))),0)<0,ROUND(96*(LOG(I17)-INT(LOG(I17))),0)-1,ROUND(96*(LOG(I17)-INT(LOG(I17))),0))/96))*POWER(10,INT(LOG(I17))-2)+INT(0.5+100*POWER(10,(IF(96*(LOG(I17)-INT(LOG(I17)))-ROUND(96*(LOG(I17)-INT(LOG(I17))),0)<0,ROUND(96*(LOG(I17)-INT(LOG(I17))),0)-1,ROUND(96*(LOG(I17)-INT(LOG(I17))),0))+1)/96))*POWER(10,INT(LOG(I17))-2))/2,INT(0.5+100*POWER(10,(IF(96*(LOG(I17)-INT(LOG(I17)))-ROUND(96*(LOG(I17)-INT(LOG(I17))),0)<0,ROUND(96*(LOG(I17)-INT(LOG(I17))),0)-1,ROUND(96*(LOG(I17)-INT(LOG(I17))),0))+1)/96))*POWER(10,INT(LOG(I17))-2),INT(0.5+100*POWER(10,IF(96*(LOG(I17)-INT(LOG(I17)))-ROUND(96*(LOG(I17)-INT(LOG(I17))),0)<0,ROUND(96*(LOG(I17)-INT(LOG(I17))),0)-1,ROUND(96*(LOG(I17)-INT(LOG(I17))),0))/96))*POWER(10,INT(LOG(I17))-2)))","v":332},"kΩ"]
[4.7,{"$error":"#NAME?"},0,0,0,null,null,"Rhys",{"$f":"Rhys","v":{"$error":"#NAME?"}},{"$f":"IF(I18=\"OPEN\",\"OPEN\",IF(I18>(INT(0.5+100*POWER(10,IF(96*(LOG(I18)-INT(LOG(I18)))-ROUND(96*(LOG(I18)-INT(LOG(I18))),0)<0,ROUND(96*(LOG(I18)-INT(LOG(I18))),0)-1,ROUND(96*(LOG(I18)-INT(LOG(I18))),0))/96))*POWER(10,INT(LOG(I18))-2)+INT(0.5+100*POWER(10,(IF(96*(LOG(I18)-INT(LOG(I18)))-ROUND(96*(LOG(I18)-INT(LOG(I18))),0)<0,ROUND(96*(LOG(I18)-INT(LOG(I18))),0)-1,ROUND(96*(LOG(I18)-INT(LOG(I18))),0))+1)/96))*POWER(10,INT(LOG(I18))-2))/2,INT(0.5+100*POWER(10,(IF(96*(LOG(I18)-INT(LOG(I18)))-ROUND(96*(LOG(I18)-INT(LOG(I18))),0)<0,ROUND(96*(LOG(I18)-INT(LOG(I18))),0)-1,ROUND(96*(LOG(I18)-INT(LOG(I18))),0))+1)/96))*POWER(10,INT(LOG(I18))-2),INT(0.5+100*POWER(10,IF(96*(LOG(I18)-INT(LOG(I18)))-ROUND(96*(LOG(I18)-INT(LOG(I18))),0)<0,ROUND(96*(LOG(I18)-INT(LOG(I18))),0)-1,ROUND(96*(LOG(I18)-INT(LOG(I18))),0))/96))*POWER(10,INT(LOG(I18))-2)))","v":{"$error":"#NAME?"}},"kΩ"]
[5.6,{"$error":"#NAME?"},0,0,0]
[6.8,{"$error":"#NAME?"},0,0,0,null,null,"Ra",{"$f":"'Variable Mgmt'!D147","v":227.27272727272725},{"$f":"IF(I20=\"OPEN\",\"OPEN\",IF(I20>(INT(0.5+100*POWER(10,IF(96*(LOG(I20)-INT(LOG(I20)))-ROUND(96*(LOG(I20)-INT(LOG(I20))),0)<0,ROUND(96*(LOG(I20)-INT(LOG(I20))),0)-1,ROUND(96*(LOG(I20)-INT(LOG(I20))),0))/96))*POWER(10,INT(LOG(I20))-2)+INT(0.5+100*POWER(10,(IF(96*(LOG(I20)-INT(LOG(I20)))-ROUND(96*(LOG(I20)-INT(LOG(I20))),0)<0,ROUND(96*(LOG(I20)-INT(LOG(I20))),0)-1,ROUND(96*(LOG(I20)-INT(LOG(I20))),0))+1)/96))*POWER(10,INT(LOG(I20))-2))/2,INT(0.5+100*POWER(10,(IF(96*(LOG(I20)-INT(LOG(I20)))-ROUND(96*(LOG(I20)-INT(LOG(I20))),0)<0,ROUND(96*(LOG(I20)-INT(LOG(I20))),0)-1,ROUND(96*(LOG(I20)-INT(LOG(I20))),0))+1)/96))*POWER(10,INT(LOG(I20))-2),INT(0.5+100*POWER(10,IF(96*(LOG(I20)-INT(LOG(I20)))-ROUND(96*(LOG(I20)-INT(LOG(I20))),0)<0,ROUND(96*(LOG(I20)-INT(LOG(I20))),0)-1,ROUND(96*(LOG(I20)-INT(LOG(I20))),0))/96))*POWER(10,INT(LOG(I20))-2)))","v":226},"kΩ"]
[8.1999999999999993,{"$error":"#NAME?"},0,0,0]
[10,{"$error":"#NAME?"},0,0,0]
[12,{"$error":"#NAME?"},0,0,0]
[15,{"$error":"#NAME?"},0,0,0]
[18,{"$error":"#NAME?"},0,0,0]
[22,{"$error":"#NAME?"},0,0,0]
[27,{"$error":"#NAME?"},0,0,0]
[33,{"$error":"#NAME?"},0,0,0]
[39,{"$error":"#NAME?"},0,0,0]
[47,{"$error":"#NAME?"},0,0,0]
[56,{"$error":"#NAME?"},0,0,0]
[68,{"$error":"#NAME?"},0,0,0]
[82,{"$error":"#NAME?"},0,0,0]
[{"$f":"A22*10","v":100},{"$error":"#NAME?"},0,0,0]
[{"$f":"A23*10","v":120},{"$error":"#NAME?"},0,0,0]
[150,{"$error":"#NAME?"},0,0,0]
[180,{"$error":"#NAME?"},0,0,0]
[220,{"$error":"#NAME?"},0,0,{"$f":"IF(IF((E$3*10^12-$A39)*(E$3*10^12-$A38)*-1<0,0,1)*IF(ABS(E$3*10^12-$A39)>(E$3*10^12-$A38),$A38,$A39)=E39,0,IF((E$3*10^12-$A39)*(E$3*10^12-$A38)*-1<0,0,1)*IF(ABS(E$3*10^12-$A39)>(E$3*10^12-$A38),$A38,$A39))","v":0}]
[270,{"$error":"#NAME?"},0,0,0]
[330,{"$error":"#NAME?"},0,0,0]
[390,{"$error":"#NAME?"},0,0,0]
[470,{"$error":"#NAME?"},0,0,0]
[560,{"$error":"#NAME?"},0,0,0]
[680,{"$error":"#NAME?"},0,0,0]
[{"$f":"A33*10","v":820},{"$error":"#NAME?"},0,0,0]
[1000,{"$error":"#NAME?"},0,0,0]
[1200,{"$error":"#NAME?"},0,0,0]
[1500,{"$error":"#NAME?"},0,0,0]
[1800,{"$error":"#NAME?"},0,0,0]
[2200,{"$error":"#NAME?"},0,0,0]
[2700,{"$error":"#NAME?"},0,0,0]
[3300,{"$error":"#NAME?"},0,0,0]
[3900,{"$error":"#NAME?"},0,0,0]
[4700,{"$error":"#NAME?"},0,0,0]
[5600,{"$error":"#NAME?"},0,0,0]
[6800,{"$error":"#NAME?"},0,0,0]
[8200,{"$error":"#NAME?"},0,0,0]
[10000,{"$error":"#NAME?"},0,0,0]
[12000,{"$error":"#NAME?"},0,0,0]
[15000,{"$error":"#NAME?"},0,0,0]
[18000,{"$error":"#NAME?"},0,0,0]
[22000,{"$error":"#NAME?"},0,0,0]
[27000,{"$error":"#NAME?"},0,0,0]
[33000,{"$error":"#NAME?"},0,0,0]
[39000,{"$error":"#NAME?"},0,0,0]
[47000,{"$error":"#NAME?"},0,0,0]
[56000,{"$error":"#NAME?"},0,0,0]
[68000,{"$error":"#NAME?"},0,0,0]
[82000,{"$error":"#NAME?"},0,0,0]
[100000,{"$error":"#NAME?"},{"$f":"IF(IF((C$3*10^12-$A71)*(C$3*10^12-$A70)*-1<0,0,1)*IF(ABS(C$3*10^12-$A71)>(C$3*10^12-$A70),$A70,$A71)=C71,0,IF((C$3*10^12-$A71)*(C$3*10^12-$A70)*-1<0,0,1)*IF(ABS(C$3*10^12-$A71)>(C$3*10^12-$A70),$A70,$A71))","v":0},{"$f":"IF(IF((D$3*10^12-$A71)*(D$3*10^12-$A70)*-1<0,0,1)*IF(ABS(D$3*10^12-$A71)>(D$3*10^12-$A70),$A70,$A71)=D71,0,IF((D$3*10^12-$A71)*(D$3*10^12-$A70)*-1<0,0,1)*IF(ABS(D$3*10^12-$A71)>(D$3*10^12-$A70),$A70,$A71))","v":0},{"$f":"IF(IF((E$3*10^12-$A71)*(E$3*10^12-$A70)*-1<0,0,1)*IF(ABS(E$3*10^12-$A71)>(E$3*10^12-$A70),$A70,$A71)=E71,0,IF((E$3*10^12-$A71)*(E$3*10^12-$A70)*-1<0,0,1)*IF(ABS(E$3*10^12-$A71)>(E$3*10^12-$A70),$A70,$A71))","v":0}]
[120000,{"$f":"IF(IF((B$3*10^12-$A72)*(B$3*10^12-$A71)*-1<0,0,1)*IF(ABS(B$3*10^12-$A72)>(B$3*10^12-$A71),$A71,$A72)=B72,0,IF((B$3*10^12-$A72)*(B$3*10^12-$A71)*-1<0,0,1)*IF(ABS(B$3*10^12-$A72)>(B$3*10^12-$A71),$A71,$A72))","v":{"$error":"#NAME?"}},{"$f":"IF(IF((C$3*10^12-$A72)*(C$3*10^12-$A71)*-1<0,0,1)*IF(ABS(C$3*10^12-$A72)>(C$3*10^12-$A71),$A71,$A72)=C72,0,IF((C$3*10^12-$A72)*(C$3*10^12-$A71)*-1<0,0,1)*IF(ABS(C$3*10^12-$A72)>(C$3*10^12-$A71),$A71,$A72))","v":0},{"$f":"IF(IF((D$3*10^12-$A72)*(D$3*10^12-$A71)*-1<0,0,1)*IF(ABS(D$3*10^12-$A72)>(D$3*10^12-$A71),$A71,$A72)=D72,0,IF((D$3*10^12-$A72)*(D$3*10^12-$A71)*-1<0,0,1)*IF(ABS(D$3*10^12-$A72)>(D$3*10^12-$A71),$A71,$A72))","v":0},0]
[150000,{"$error":"#NAME?"},0,0,0]
[180000,{"$error":"#NAME?"},0,0,0]
[220000,{"$error":"#NAME?"},0,0,0]
[270000,{"$error":"#NAME?"},0,0,0]
[330000,{"$error":"#NAME?"},0,0,0]
[390000,{"$error":"#NAME?"},0,0,0]
[470000,{"$error":"#NAME?"},0,0,0]
[560000,{"$error":"#NAME?"},0,0,0]
[680000,{"$error":"#NAME?"},0,0,0]
[820000,{"$error":"#NAME?"},0,0,0]
[1000000,{"$error":"#NAME?"},0,0,0]
[1200000,{"$error":"#NAME?"},0,0,0]
[1500000,{"$error":"#NAME?"},0,0,0]
[1800000,{"$error":"#NAME?"},0,0,0]
[2200000,{"$error":"#NAME?"},0,2200000,0]
[2700000,{"$error":"#NAME?"},0,0,0]
[3300000,{"$error":"#NAME?"},0,0,0]
[3900000,{"$error":"#NAME?"},0,0,0]
[4700000,{"$error":"#NAME?"},0,0,0]
[5600000,{"$error":"#NAME?"},0,0,0]
[6800000,{"$error":"#NAME?"},0,0,0]
[8200000,{"$error":"#NAME?"},0,0,0]
[10000000,{"$error":"#NAME?"},0,0,0]
[12000000,{"$error":"#NAME?"},12000000,0,0]
[15000000,{"$error":"#NAME?"},0,0,0]
[18000000,{"$error":"#NAME?"},0,0,0]
[22000000,{"$error":"#NAME?"},0,0,0]
[{"$f":"A87*10","v":27000000},{"$error":"#NAME?"},0,0,0]
[33000000,{"$error":"#NAME?"},0,0,0]
[39000000,{"$error":"#NAME?"},0,0,0]
[47000000,{"$error":"#NAME?"},0,0,{"$f":"IF(IF((E$3*10^12-$A103)*(E$3*10^12-$A102)*-1<0,0,1)*IF(ABS(E$3*10^12-$A103)>(E$3*10^12-$A102),$A102,$A103)=E103,0,IF((E$3*10^12-$A103)*(E$3*10^12-$A102)*-1<0,0,1)*IF(ABS(E$3*10^12-$A103)>(E$3*10^12-$A102),$A102,$A103))","v":0}]
[56000000,{"$error":"#NAME?"},0,{"$f":"IF(IF((D$3*10^12-$A104)*(D$3*10^12-$A103)*-1<0,0,1)*IF(ABS(D$3*10^12-$A104)>(D$3*10^12-$A103),$A103,$A104)=D104,0,IF((D$3*10^12-$A104)*(D$3*10^12-$A103)*-1<0,0,1)*IF(ABS(D$3*10^12-$A104)>(D$3*10^12-$A103),$A103,$A104))","v":0},0]
[68000000,{"$error":"#NAME?"},0,0,0]
[82000000,{"$error":"#NAME?"},0,0,0]
[100000000,{"$error":"#NAME?"},0,0,0]
[120000000,{"$error":"#NAME?"},0,0,0]
[150000000,{"$error":"#NAME?"},0,0,0]
[180000000,{"$error":"#NAME?"},0,0,0]
[220000000,{"$error":"#NAME?"},0,0,0]
[270000000,{"$error":"#NAME?"},0,0,0]
[330000000,{"$error":"#NAME?"},0,0,0]
[390000000,{"$error":"#NAME?"},0,0,0]
[470000000,{"$error":"#NAME?"},0,0,0]
[560000000,{"$error":"#NAME?"},0,0,0]
[680000000,{"$error":"#NAME?"},0,0,0]
[820000000,{"$error":"#NAME?"},0,0,0]
[1000000000,{"$error":"#NAME?"},0,0,0]
[1200000000,{"$error":"#NAME?"},0,0,0]
[1500000000,{"$error":"#NAME?"},0,0,0]
[1800000000,{"$error":"#NAME?"},0,0,0]
[2200000000,{"$error":"#NAME?"},0,0,0]
[2700000000,{"$error":"#NAME?"},0,0,0]
[3300000000,{"$error":"#NAME?"},0,0,0]
[3900000000,{"$error":"#NAME?"},0,0,0]
[4700000000,{"$error":"#NAME?"},0,0,0]
[5600000000,{"$error":"#NAME?"},0,0,0]
[6800000000,{"$error":"#NAME?"},0,0,0]
[8200000000,{"$error":"#NAME?"},0,0,0]
[10000000000,{"$error":"#NAME?"},0,0,0]
[12000000000,{"$error":"#NAME?"},0,0,0]
[15000000000,{"$error":"#NAME?"},0,0,0]
[18000000000,{"$error":"#NAME?"},0,0,0]
[22000000000,{"$error":"#NAME?"},{"$f":"IF(IF((C$3*10^12-$A135)*(C$3*10^12-$A134)*-1<0,0,1)*IF(ABS(C$3*10^12-$A135)>(C$3*10^12-$A134),$A134,$A135)=C135,0,IF((C$3*10^12-$A135)*(C$3*10^12-$A134)*-1<0,0,1)*IF(ABS(C$3*10^12-$A135)>(C$3*10^12-$A134),$A134,$A135))","v":0},0,{"$f":"IF(IF((E$3*10^12-$A135)*(E$3*10^12-$A134)*-1<0,0,1)*IF(ABS(E$3*10^12-$A135)>(E$3*10^12-$A134),$A134,$A135)=E135,0,IF((E$3*10^12-$A135)*(E$3*10^12-$A134)*-1<0,0,1)*IF(ABS(E$3*10^12-$A135)>(E$3*10^12-$A134),$A134,$A135))","v":0}]
[27000000000,{"$f":"IF(IF((B$3*10^12-$A136)*(B$3*10^12-$A135)*-1<0,0,1)*IF(ABS(B$3*10^12-$A136)>(B$3*10^12-$A135),$A135,$A136)=B136,0,IF((B$3*10^12-$A136)*(B$3*10^12-$A135)*-1<0,0,1)*IF(ABS(B$3*10^12-$A136)>(B$3*10^12-$A135),$A135,$A136))","v":{"$error":"#NAME?"}},0,0,0]
[33000000000,{"$error":"#NAME?"},0,0,0]
[39000000000,{"$error":"#NAME?"},0,0,0]
[47000000000,{"$error":"#NAME?"},0,0,0]
[56000000000,{"$error":"#NAME?"},0,0,0]
[68000000000,{"$error":"#NAME?"},0,0,0]
[82000000000,{"$error":"#NAME?"},0,0,0]
[100000000000,{"$error":"#NAME?"},0,0,0]
[120000000000,{"$error":"#NAME?"},0,0,0]
[150000000000,{"$error":"#NAME?"},0,0,0]
[180000000000,{"$error":"#NAME?"},0,0,0]
[220000000000,{"$error":"#NAME?"},0,0,0]
[270000000000,{"$error":"#NAME?"},0,0,0]
[330000000000,{"$error":"#NAME?"},0,0,0]
[390000000000,{"$error":"#NAME?"},0,0,0]
[470000000000,{"$error":"#NAME?"},0,0,0]
[560000000000,{"$error":"#NAME?"},0,0,0]
[680000000000,{"$error":"#NAME?"},0,0,0]
[820000000000,{"$error":"#NAME?"},0,0,0]
[1000000000000,{"$error":"#NAME?"},0,0,0]
[1200000000000,{"$error":"#NAME?"},0,0,0]
[1500000000000,{"$error":"#NAME?"},0,0,0]
[1800000000000,{"$error":"#NAME?"},0,0,0]
[2200000000000,{"$error":"#NAME?"},0,0,0]
[2700000000000,{"$error":"#NAME?"},2700000000000,2700000000000,2700000000000]

{"sheet":"Efficiency","index":6,"n_rows":114,"n_cols":88,"rows_kept":114,"cut":false,"hidden":true,"merged":[[0,0,2,4],[1,6,1,7],[3,0,3,4],[3,10,3,21]]}
["LM5169 (COT) Efficiency Calculator"]
[null,null,null,null,null,null,"TERMS OF USE",null,null,{"$f":"CoutEsr","v":1},null,null,null,null,null,null,null,null,null,null,null,null,null,null,null,null,null,null,null,null,null,null,null,null,null,null,null,null,null,null,null,null,null,null,null,null,null,null,"didn't include FB"]
[]
[null,null,null,null,null,null,null,"Currents",null,null,"Miscellaneous",null,null,null,null,null,null,null,null,null,null,null,"Inductor",null,null,null,"Cout",null,null,"Cin",null,null,"High-side MOSFET Losses ",null,null,null,null,null,null,null,null,"Low-side MOSFET Losses ",null,null,"Diode",null,null,null,null,null,null,null,"RESULTS"]
["Input Parameters",null,null,null,null,null,null,"Step","Iout (A)","Ripple Current pk-pk (A)","Peak Current (A)","Valley Current (A)","VOUT Hysteresis +Undershoot (2us Delay) (mV)","Vout Rise per Pulse (mV)","Number of Pulses in DCM","VOUT Ripple (mV)","Off Time (sec)","Duty Cycle","Switching Frequency (Hz)","Active Mode Duration (sec)","Sleep Mode Duration (sec)","Operating Quiescent Current (A)","Irms (A)","Inductor DCR Loss @ 25°C (W)","Inductor Core Loss  (W)","Total Inductor Loss (W)","Irms (A)","Cout ESR Loss (W)","Total Cout Loss (W)","Irms (A)","Cin ESR Loss (W)","Total Cin Loss (W)","Irms (A)","Rdson HS Loss @ 25°C (W)","HS Gate Qg Loss (W)     ","SW Rise Time (ns)","SW Fall Time (ns)","HS Switching  Loss (W)","Coss Loss (W)","Total HS FET AC Loss (W)","Total HS FET Loss (W)","Irms (A)","Rdson LS Loss @ 25°C (W)","LS Gate Qg Loss (W)","Reverse Recovery & Leakage Losses","DeadTime Loss @ 25°C (W)","Total LS FET AC Loss (W)","Total LS FET Loss (W)","Quiescent Loss (W)","LDO + Quiescent Loss (W)","Total Gate Drive Loss (W)","Total Power Loss in IC (W)","Total Converter Power Loss (W)","Pout (W)","EFF (%)","High-side MOSFET Rdson %","Low-side MOSFET Rdson %","Gate Drive (Qg) Loss from Vin %","High-side MOSFET AC Loss %","Reverse Recovery & Leakage Loss %","Deadtime Loss %","Low-side MOSFET AC Loss %","Inductor Cu Loss %","Inductor Core Loss %","Cin ESR %","Cout ESR %","LDO + Quiescent Current Loss %","Total Loss %","Overall Eff %","Overall Eff","Current (mA)","Keep for \"previous\" data series","Keep for \"previous\" data series","Frequency (kHz)",null,"Coss",null,"Total Power Loss in IC (mW)","LDO + Quiescent Loss (mW)","Total Inductor Loss (mW)",null,null,"Overall Eff","Total Power Loss in IC (W)","LDO + Quiescent Loss (mW)","Total Inductor Loss (mW)","Fsw (kHz)","Ripple (mV)"]
["Design","Input Value","Units","Std Units","Description",null,null,0.04,{"$f":"IF(PLOT_TYPE=1, H6/100*Iout, min_I*EXP(H6*rr/100))","v":1.2E-4},{"$f":"IF(I6<Icrit, (Vin-(Rdcr+RdsonTop)*Iripple/2-Vout)/L*OnTime, (Vin-(Rdcr+RdsonTop)*I6-Vout)/L*OnTime)","v":0.14937937604166668},{"$f":"IF(I6<Icrit, (Vin-(Rdcr+RdsonTop)*Iripple/2-Vout)/L*OnTime, I6+((Vin-(Rdcr+RdsonTop)*J6-Vout)/L*OnTime)/2)","v":0.14937937604166668},{"$f":"IF(I6<Icrit, 0, I6-((Vin-(Rdcr+RdsonTop)*K6-Vout)/L*OnTime)/2)","v":0},{"$f":"1000*((((J6/2)-I6)*0.000002/Cout+Vout/306))","v":51.643967611315361},{"$f":"IF(I6<Icrit, 1000*SQRT((J6*CoutEsr)^2+(((J6/2)-I6)*(OnTime+OffTime)/Cout)^2), 1000*J6*SQRT(CoutEsr^2+(1/(8*Fsw*Cout))^2))","v":149.71736657605726},{"$f":"ROUNDUP(M6/N6,0)","v":1},{"$f":"IF(I6<Icrit, 1000*((N6/1000)*O6), 1000*J6*SQRT(CoutEsr^2+(1/(8*Fsw*Cout))^2))","v":149.71736657605726},{"$f":"IF(I6<Icrit, L*J6/(Vout+J6/2*(RdsonBot+Rdcr)), L*J6/(Vout+I6*(RdsonBot+Rdcr)))","v":1.2377405719641333E-6},{"$f":"OnTime*S6","v":4.0463825333951714E-4},{"$f":"IF(I6<Icrit,I6/((OnTime+Q6)*J6/2),1/(OnTime+Q6))","v":971.13180801484111},{"$f":"IF(1/S6-OnTime-Q6>Tsleep, OnTime+Q6+Tsleep, 1/S6)","v":6.6544072386308002E-6},{"$f":"IF(1/S6-OnTime-Q6>Tsleep, 1/S6-OnTime-Q6-Tsleep, 0)","v":1.0230719303675594E-3},{"$f":"S6*(T6*Iq_active+U6*Iq_sleep)","v":1.4200499246397076E-5},{"$f":"IF(I6<Icrit,Iripple*SQRT((OnTime+OffTime)*S6/3), SQRT(I6^2+Iripple^2/12))","v":3.3750901867561612E-3},{"$f":"W6^2*Rdcr","v":1.9365097406854159E-6},{"$f":"Core_Loss/1000*S6/$S$106","v":0},{"$f":"(Y6+X6*(1+Ltc*(Ta-25)))/(1-X6*Ltc*ThetaCa)","v":1.9365103406967979E-6},{"$f":"Iripple/SQRT(12)*SQRT((OnTime+Q6)*S6)","v":1.7064284459822865E-3},{"$f":"RCoutEsr*AA6^2","v":2.9118980412575213E-6},{"$f":"AB6","v":2.9118980412575213E-6},{"$f":"SQRT($R6)*SQRT($I6^2*(1-R6)+(Iripple^2)/12)","v":8.5637301735262445E-4},{"$f":"RCinEsr*AD6^2","v":2.2001242345489152E-9},{"$f":"AE6","v":2.2001242345489152E-9},{"$f":"IF(I6<Icrit,Iripple*SQRT((OnTime)*S6/3), SQRT(OnTime*S6*(I6^2+Iripple^2/12)))","v":1.7127392334112428E-3},{"$f":"RdsonTop*AG6^2","v":5.4269300110823445E-6},{"$f":"QgTop*S6*Vdd","v":2.9133954240445237E-6},{"$f":"5*VIN_nom/24","v":10},{"$f":"IF(I6<Icrit, Csw*Vin/Iripple*1000000000, Csw*Vin/(I6+Iripple/2)*1000000000)","v":52.076623156467207},{"$f":"IF(I6<Icrit, Vin*(I6+Iripple/2)*AK6/1000000000/2*S6, Vin*(I6-Iripple/2)*AJ6/1000000000/2*S6 + Vin*(I6+Iripple/2)*AK6/1000000000/2*S6)","v":8.9645158430427346E-5},{"$f":"IF(I6<Icrit, Csw*(Vin)^2*S6/2, Csw*Vin^2*S6/2)","v":1.7899901485329551E-4},{"$f":"AI6+AL6+AM6","v":2.7155756870776736E-4},{"$f":"(AI6+AL6+AM6+AH6*(1+RdsonTopTc*(Ta-25)))/(1-AH6*RdsonTopTc*ThetaJA)","v":2.7698479526562763E-4},{"$f":"IF(I6<Icrit,Iripple*SQRT((OffTime)*S6/3), SQRT(OffTime*S6*(I6^2+Iripple^2/12)))","v":2.9082224961428939E-3},{"$f":"RdsonBot*AP6^2","v":6.3433185653037039E-6},{"$f":"QgBot*S6*Vdd","v":7.8661676449202142E-6},{"$f":"IF(I6<Icrit, Vin*Idss*R6, QrrBot*(I6-Iripple/2)/1*S6*Vin+Vin*Idss*R6)","v":0},{"$f":"IF(I6<Icrit, dead1*S6*(I6+Iripple/2)*((I6+Iripple/2)*BDserR+VSD), dead1*S6*(I6+Iripple/2)*((I6+Iripple/2)*BDserR+VSD)+dead2*S6*(I6-Iripple/2)*((I6-Iripple/2)*BDserR+VSD))","v":4.0537027749018663E-7},{"$f":"AR6+AS6+AT6","v":8.2715379224104006E-6},{"$f":"(AR6+AS6+AT6+AQ6*(1+RdsonBotTc*(Ta-25)))/(1-AQ6*RdsonBotTc*ThetaJA)","v":1.4614874776912892E-5},{"$f":"Vin*V6+Vout*Ifb/0.8","v":1.0395480043917842E-3},{"$f":"(Vin-Vdd)*(S6*QgBot+S6*QgTop)+AW6","v":1.132252246784881E-3},{"$f":"AI6+AR6","v":1.0779563068964738E-5},{"$f":"AO6+AV6+AX6+AY6","v":1.4346314798963863E-3},{"$f":"SUM(Z6,AC6,AF6,AZ6)","v":1.4394820884025751E-3},{"$f":"Vout*I6","v":1.4400000000000001E-3},{"$f":"BB6/(BB6+BA6)","v":0.50008993138028379},{"$f":"(AO6-AN6)/($BB6+$BA6)","v":1.8847926089622189E-3},{"$f":"(AV6-AU6)/($BB6+$BA6)","v":2.2029436752015112E-3},{"$f":"Vin*S6*(QgBot+QgTop)/($BB6+$BA6)","v":3.5938339703120104E-2},{"$f":"AN6/($BB6+$BA6)","v":9.4307781875600044E-2},{"$f":"AS6/(BA6+BB6)","v":0},{"$f":"AT6/($BB6+$BA6)","v":1.4077888489838472E-4},{"$f":"AU6/($BB6+$BA6)","v":2.8725783555747443E-3},{"$f":"X6/($BB6+$BA6)","v":6.7252015509487544E-4},{"$f":"Y6/($BB6+$BA6)","v":0},{"$f":"(AF6)/($BB6+$BA6)","v":7.6406942880810159E-7},{"$f":"(AC6)/($BB6+$BA6)","v":1.0112575636380947E-3},{"$f":"AX6/($BB6+$BA6)","v":0.39321385305543283},{"$f":"SUM(BD6:BO6)","v":0.53224560994695158},{"$f":"BC6","v":0.50008993138028379},{"$f":"100*BQ6","v":50.00899313802838},{"$f":"I6*1000","v":0.12000000000000001},8.7924221262065743,{"$f":"BT6/100","v":8.7924221262065741E-2},{"$f":"S6/1000","v":0.97113180801484111},null,{"$f":"AM6/($BB6+$BA6)","v":6.2163614621613156E-2},null,{"$f":"AZ6","v":1.4346314798963863E-3},{"$f":"AX6","v":1.132252246784881E-3},{"$f":"Z6","v":1.9365103406967979E-6},null,null,{"$f":"IF(OR(MODE=1,MODE=2,MODE=3), BR6, IF(MODE_ILIM=4,#REF!,#REF!))","v":50.00899313802838},{"$f":"IF(OR(MODE=1,MODE=2,MODE=3), BZ6, IF(MODE_ILIM=4,#REF!,#REF!))","v":1.4346314798963863E-3},{"$f":"IF(OR(MODE=1,MODE=2,MODE=3), CA6, IF(MODE_ILIM=4,#REF!,#REF!))","v":1.132252246784881E-3},{"$f":"IF(OR(MODE=1,MODE=2,MODE=3), CB6, IF(MODE_ILIM=4,#REF!,#REF!))","v":1.9365103406967979E-6},{"$f":"(IF(OR(MODE=1,MODE=2,MODE=3), S6, IF(MODE_ILIM=4,#REF!,#REF!)))/1000","v":0.97113180801484111},{"$f":"IF(OR(MODE=1,MODE=2,MODE=3), P6, IF(MODE_ILIM=4,#REF!,#REF!))","v":149.71736657605726}]
[null,null,null,null,null,null,null,1,3.0000000000000001E-3,0.14937937604166668,0.14937937604166668,0,{"$f":"IF(I7<Icrit, 1000*((((J7/2)-I7)*0.000002/Cout+Vout/306)), 1000*J7*SQRT(CoutEsr^2+(1/(8*Fsw*Cout))^2))","v":51.163967611315357},149.69178998291216,{"$f":"ROUNDUP(M7/N7,0)","v":1},149.69178998291216,1.2377405719641333E-6,{"$f":"OnTime*S7","v":1.0115956333487929E-2},24278.295200371031,{"$f":"IF(1/S7-OnTime-Q7>Tsleep, OnTime+Q7+Tsleep, 1/S7)","v":6.6544072386308002E-6},{"$f":"IF(1/S7-OnTime-Q7>Tsleep, 1/S7-OnTime-Q7-Tsleep, 0)","v":3.4534646265616798E-5},1.1501248115992687E-4,{"$f":"IF(I7<Icrit,Iripple*SQRT((OnTime+OffTime)*S7/3), SQRT(I7^2+Iripple^2/12))","v":1.6875450933780806E-2},4.8412743517135396E-5,0,4.8413118527037813E-5,{"$f":"Iripple/SQRT(12)*SQRT((OnTime+Q7)*S7)","v":8.5321422299114331E-3},{"$f":"RCoutEsr*AA7^2","v":7.2797451031438043E-5},{"$f":"AB7","v":7.2797451031438043E-5},{"$f":"SQRT($R7)*SQRT($I7^2*(1-R7)+(Iripple^2)/12)","v":4.2923589812901069E-3},{"$f":"RCinEsr*AD7^2","v":5.5273036872785534E-8},{"$f":"AE7","v":5.5273036872785534E-8},{"$f":"IF(I7<Icrit,Iripple*SQRT((OnTime)*S7/3), SQRT(OnTime*S7*(I7^2+Iripple^2/12)))","v":8.5636961670562152E-3},{"$f":"RdsonTop*AG7^2","v":1.3567325027705865E-4},{"$f":"QgTop*S7*Vdd","v":7.2834885601113088E-5},10,52.076623156467207,{"$f":"IF(I7<Icrit, Vin*(I7+Iripple/2)*AK7/1000000000/2*S7, Vin*(I7-Iripple/2)*AJ7/1000000000/2*S7 + Vin*(I7+Iripple/2)*AK7/1000000000/2*S7)","v":2.3285195630284397E-3},{"$f":"IF(I7<Icrit, Csw*(Vin)^2*S7/2, Csw*Vin^2*S7/2)","v":4.4749753713323884E-3},{"$f":"AI7+AL7+AM7","v":6.8763298199619408E-3},7.012190755863827E-3,1.4541112480714472E-2,{"$f":"RdsonBot*AP7^2","v":1.5858296413259263E-4},1.9665419112300538E-4,0,1.0533188161015505E-5,{"$f":"AR7+AS7+AT7","v":2.0718737928402089E-4},3.6578178699022762E-4,5.8785231362412146E-3,8.1961291960686335E-3,2.6948907672411847E-4,{"$f":"AO7+AV7+AX7+AY7","v":1.5843590815646805E-2},1.5964856658242155E-2,3.6000000000000004E-2,{"$f":"BB7/(BB7+BA7)","v":0.69277589346125978},{"$f":"(AO7-AN7)/($BB7+$BA7)","v":2.6144772571086699E-3},{"$f":"(AV7-AU7)/($BB7+$BA7)","v":3.0519550693507403E-3},4.9785476241493633E-2,{"$f":"AN7/($BB7+$BA7)","v":0.1323265426321788},{"$f":"AS7/(BA7+BB7)","v":0},{"$f":"AT7/($BB7+$BA7)","v":2.0269830109008552E-4},{"$f":"AU7/($BB7+$BA7)","v":3.987067272149568E-3},9.3164393458317442E-4,0,{"$f":"(AF7)/($BB7+$BA7)","v":1.0636618751072542E-6},{"$f":"(AC7)/($BB7+$BA7)","v":1.4008977550001886E-3},{"$f":"AX7/($BB7+$BA7)","v":0.157724464631399},{"$f":"SUM(BD7:BO7)","v":0.35202628675622893},0.69277589346125978,{"$f":"100*BQ7","v":69.277589346125978},3,9.5725635821403898,{"$f":"BT7/100","v":9.5725635821403893E-2},24.27829520037103,null,8.6115418363664653E-2,null,{"$f":"AZ7","v":1.5843590815646805E-2},{"$f":"AX7","v":8.1961291960686335E-3},{"$f":"Z7","v":4.8413118527037813E-5},null,null,{"$f":"IF(OR(MODE=1,MODE=2,MODE=3), BR7, IF(MODE_ILIM=4,#REF!,#REF!))","v":69.277589346125978},{"$f":"IF(OR(MODE=1,MODE=2,MODE=3), BZ7, IF(MODE_ILIM=4,#REF!,#REF!))","v":1.5843590815646805E-2},{"$f":"IF(OR(MODE=1,MODE=2,MODE=3), CA7, IF(MODE_ILIM=4,#REF!,#REF!))","v":8.1961291960686335E-3},{"$f":"IF(OR(MODE=1,MODE=2,MODE=3), CB7, IF(MODE_ILIM=4,#REF!,#REF!))","v":4.8413118527037813E-5},{"$f":"(IF(OR(MODE=1,MODE=2,MODE=3), S7, IF(MODE_ILIM=4,#REF!,#REF!)))/1000","v":24.27829520037103},{"$f":"IF(OR(MODE=1,MODE=2,MODE=3), P7, IF(MODE_ILIM=4,#REF!,#REF!))","v":149.69178998291216}]
["Vin",{"$f":"Vin","v":48},"V",{"$f":"B8","v":48},"Vin",null,null,2,6.0000000000000001E-3,0.14937937604166668,0.14937937604166668,0,50.663967611315357,149.66621441676034,1,149.66621441676034,1.2377405719641333E-6,{"$f":"OnTime*S8","v":2.0231912666975858E-2},48556.590400742061,6.6544072386308002E-6,1.3940119513493E-5,2.2002496231985375E-4,2.3865491581714526E-2,9.6825487034270791E-5,0,9.6826987085500018E-5,1.2066271257636971E-2,1.4559490206287609E-4,{"$f":"AB8","v":1.4559490206287609E-4},6.1140869299014609E-3,1.1214617695917562E-7,{"$f":"AE8","v":1.1214617695917562E-7},1.2110895263493389E-2,2.7134650055411725E-4,1.4566977120222618E-4,10,52.076623156467207,4.8391028807813711E-3,8.9499507426647768E-3,1.3934723394648374E-2,1.420683040441683E-2,2.056423848221909E-2,3.1716592826518537E-4,3.9330838224601076E-4,0,2.1898082614977684E-5,4.1520646486098846E-4,7.3241822089631023E-4,1.0919122231917704E-2,1.5554334351572541E-2,5.3897815344823693E-4,{"$f":"AO8+AV8+AX8+AY8","v":3.1032561130333917E-2},3.1275095165659253E-2,7.2000000000000008E-2,{"$f":"BB8/(BB8+BA8)","v":0.69716711356700101},2.6347785914114167E-3,3.0715222825647912E-3,5.0101045802023923E-2,0.13492820676946624,0,2.1203643124077383E-4,4.0203929533540791E-3,9.3754924049168947E-4,0,1.0858975901139247E-6,1.4097774669617432E-3,0.1506106997686372,0.34792709520374199,0.69716711356700101,{"$f":"100*BQ8","v":69.716711356700102},6,10.507357436577642,0.10507357436577643,48.55659040074206,null,8.6661268414311654E-2,null,3.1032561130333917E-2,1.5554334351572541E-2,9.6826987085500018E-5,null,null,{"$f":"IF(OR(MODE=1,MODE=2,MODE=3), BR8, IF(MODE_ILIM=4,#REF!,#REF!))","v":69.716711356700102},{"$f":"IF(OR(MODE=1,MODE=2,MODE=3), BZ8, IF(MODE_ILIM=4,#REF!,#REF!))","v":3.1032561130333917E-2},{"$f":"IF(OR(MODE=1,MODE=2,MODE=3), CA8, IF(MODE_ILIM=4,#REF!,#REF!))","v":1.5554334351572541E-2},{"$f":"IF(OR(MODE=1,MODE=2,MODE=3), CB8, IF(MODE_ILIM=4,#REF!,#REF!))","v":9.6826987085500018E-5},{"$f":"(IF(OR(MODE=1,MODE=2,MODE=3), S8, IF(MODE_ILIM=4,#REF!,#REF!)))/1000","v":48.55659040074206},{"$f":"IF(OR(MODE=1,MODE=2,MODE=3), P8, IF(MODE_ILIM=4,#REF!,#REF!))","v":149.66621441676034}]
["Vout",{"$f":"Vout","v":12},"V",{"$f":"B9","v":12},"Vout",null,null,3,8.9999999999999993E-3,0.14937937604166668,0.14937937604166668,0,50.163967611315364,149.64172788917691,1,149.64172788917691,1.2377405719641333E-6,3.0347869000463785E-2,72834.885601113085,6.6544072386308002E-6,7.0752772627850663E-6,3.2503744347978059E-4,2.9229138417944008E-2,1.4523823055140618E-4,{"$f":"Core_Loss/1000*S9/$S$106","v":0},1.452416056928163E-4,1.477810383961062E-2,2.1839235309431413E-4,2.1839235309431413E-4,7.5753710123594026E-3,1.7215873792468535E-7,1.7215873792468535E-7,1.4832756861924215E-2,4.0701975083117583E-4,2.1850465680333926E-4,{"$f":"15*VIN_nom/24","v":30},52.076623156467207,7.5317499532587913E-3,1.3424926113997164E-2,2.1175180724059293E-2,2.1583933596907998E-2,2.518594561517138E-2,4.7574889239777787E-4,5.8996257336901608E-4,0,3.4095601081445107E-5,6.2405817445046116E-4,1.0999102997449966E-3,1.5959721327594194E-2,2.2912539507076449E-2,8.0846723017235535E-4,4.6404850633901797E-2,4.676865675142685E-2,0.10799999999999998,{"$f":"BB9/(BB9+BA9)","v":0.69781570937491721},2.6410571844995771E-3,3.0746026700922986E-3,5.0147656331475256E-2,0.13681827553797696,0,2.2030042643715568E-4,4.032199978660782E-3,9.3842147111654892E-4,0,1.112361776203748E-6,1.4110890258941316E-3,0.1480437963862164,0.34732851137414528,0.69781570937491721,69.781570937491722,9,11.516667783884284,0.11516667783884284,72.834885601113086,null,8.6741892032822066E-2,null,4.6404850633901797E-2,2.2912539507076449E-2,1.452416056928163E-4,null,null,{"$f":"IF(OR(MODE=1,MODE=2,MODE=3), BR9, IF(MODE_ILIM=4,#REF!,#REF!))","v":69.781570937491722},{"$f":"IF(OR(MODE=1,MODE=2,MODE=3), BZ9, IF(MODE_ILIM=4,#REF!,#REF!))","v":4.6404850633901797E-2},{"$f":"IF(OR(MODE=1,MODE=2,MODE=3), CA9, IF(MODE_ILIM=4,#REF!,#REF!))","v":2.2912539507076449E-2},{"$f":"IF(OR(MODE=1,MODE=2,MODE=3), CB9, IF(MODE_ILIM=4,#REF!,#REF!))","v":1.452416056928163E-4},{"$f":"(IF(OR(MODE=1,MODE=2,MODE=3), S9, IF(MODE_ILIM=4,#REF!,#REF!)))/1000","v":72.834885601113086},{"$f":"IF(OR(MODE=1,MODE=2,MODE=3), P9, IF(MODE_ILIM=4,#REF!,#REF!))","v":149.64172788917691}]
["Iout",{"$f":"Iout","v":0.3},"A",{"$f":"B10","v":0.3},"Iout(max)",null,null,4,1.2E-2,0.14937937604166668,0.14937937604166668,0,49.663967611315364,149.61833093485774,1,149.61833093485774,1.2377405719641333E-6,4.0463825333951715E-2,97113.180801484123,6.6544072386308002E-6,3.6428561374310982E-6,4.3004992463970752E-4,3.3750901867561613E-2,1.9365097406854158E-4,0,1.9365697436641698E-4,1.7064284459822866E-2,2.9118980412575217E-4,2.9118980412575217E-4,8.8841380359947018E-3,2.3678372592782339E-7,2.3678372592782339E-7,1.712739233411243E-2,5.4269300110823461E-4,2.9133954240445235E-4,30,52.076623156467207,1.0406460780460708E-2,1.7899901485329554E-2,2.8597701808194716E-2,2.9143514986155104E-2,2.9082224961428944E-2,6.3433185653037052E-4,7.8661676449202152E-4,0,4.7126661279976357E-5,8.3374342577199792E-4,1.4682590216879461E-3,2.1000320423270685E-2,3.0270744662580361E-2,1.0779563068964739E-3,6.1960474977319879E-2,6.2445558539537975E-2,0.14400000000000002,0.6975204553621891,2.643860114122318E-3,3.0735250513729368E-3,5.0126438269798138E-2,0.13852418046919496,0,2.2827645997019967E-4,4.0385631527758018E-3,9.3802441398347627E-4,0,1.1469548078578551E-6,1.410491977573759E-3,0.14662821945274726,0.34761272631634671,0.6975204553621891,69.752045536218915,12,12.603144523181673,0.12603144523181672,97.11318080148412,null,8.6705190520731903E-2,null,6.1960474977319879E-2,3.0270744662580361E-2,1.9365697436641698E-4,null,null,{"$f":"IF(OR(MODE=1,MODE=2,MODE=3), BR10, IF(MODE_ILIM=4,#REF!,#REF!))","v":69.752045536218915},{"$f":"IF(OR(MODE=1,MODE=2,MODE=3), BZ10, IF(MODE_ILIM=4,#REF!,#REF!))","v":6.1960474977319879E-2},{"$f":"IF(OR(MODE=1,MODE=2,MODE=3), CA10, IF(MODE_ILIM=4,#REF!,#REF!))","v":3.0270744662580361E-2},{"$f":"IF(OR(MODE=1,MODE=2,MODE=3), CB10, IF(MODE_ILIM=4,#REF!,#REF!))","v":1.9365697436641698E-4},{"$f":"(IF(OR(MODE=1,MODE=2,MODE=3), S10, IF(MODE_ILIM=4,#REF!,#REF!)))/1000","v":97.11318080148412},{"$f":"IF(OR(MODE=1,MODE=2,MODE=3), P10, IF(MODE_ILIM=4,#REF!,#REF!))","v":149.61833093485774}]
["Rt",{"$f":"Vout*2500/(Fsw/1000)","v":50},"kW",{"$f":"B11*1000","v":50000},"RT pin resistance to get Fsw",null,null,5,1.4999999999999999E-2,0.14937937604166668,0.14937937604166668,0,49.163967611315364,149.59602406503367,1,149.59602406503367,1.2377405719641333E-6,5.0579781667439636E-2,121391.47600185513,6.6544072386308002E-6,1.58340346221872E-6,5.3506240579963423E-4,3.7734655438896182E-2,2.4206371758567693E-4,0,2.4207309312373278E-4,1.9078450019778603E-2,3.6398725515719016E-4,3.6398725515719016E-4,1.0123040314386642E-2,3.0742783562009162E-7,3.0742783562009162E-7,1.9149006768192089E-2,6.7836625138529292E-4,3.6417442800556538E-4,30,52.076623156467207,1.3463235362387109E-2,2.2374876856661938E-2,3.6202286647054611E-2,3.6885589226544863E-2,3.2514915975348155E-2,7.9291482066296297E-4,9.8327095561502663E-4,0,6.099218093012999E-5,1.0442631365451566E-3,1.8374653850017457E-3,2.6040919518947169E-2,3.7628949818084262E-2,1.347445383620592E-3,7.769944981325147E-2,7.8305817589368013E-2,0.18,0.69684841665528519,2.6453240034125204E-3,3.070787394024368E-3,5.0078143045625766E-2,0.14015281182944878,0,2.3612391505285424E-4,4.04273951818319E-3,9.3712065738483933E-4,0,1.1901700027090118E-6,1.4091330135499514E-3,0.14567596722851778,0.34824934077520275,0.69684841665528519,69.684841665528523,15,13.76888730592373,0.1376888730592373,121.39147600185512,null,8.6621652835676979E-2,null,7.769944981325147E-2,3.7628949818084262E-2,2.4207309312373278E-4,null,null,{"$f":"IF(OR(MODE=1,MODE=2,MODE=3), BR11, IF(MODE_ILIM=4,#REF!,#REF!))","v":69.684841665528523},{"$f":"IF(OR(MODE=1,MODE=2,MODE=3), BZ11, IF(MODE_ILIM=4,#REF!,#REF!))","v":7.769944981325147E-2},{"$f":"IF(OR(MODE=1,MODE=2,MODE=3), CA11, IF(MODE_ILIM=4,#REF!,#REF!))","v":3.7628949818084262E-2},{"$f":"IF(OR(MODE=1,MODE=2,MODE=3), CB11, IF(MODE_ILIM=4,#REF!,#REF!))","v":2.4207309312373278E-4},{"$f":"(IF(OR(MODE=1,MODE=2,MODE=3), S11, IF(MODE_ILIM=4,#REF!,#REF!)))/1000","v":121.39147600185512},{"$f":"IF(OR(MODE=1,MODE=2,MODE=3), P11, IF(MODE_ILIM=4,#REF!,#REF!))","v":149.59602406503367}]
["Tamb",{"$f":"'Design Converter'!E56","v":25},"°C",{"$f":"B12","v":25},"Ambient temperature",null,null,6,1.7999999999999999E-2,0.14937937604166668,0.14937937604166668,0,48.663967611315364,149.57480776741457,1,149.57480776741457,1.2377405719641333E-6,6.069573800092757E-2,145669.77120222617,6.6544072386308002E-6,2.1043501207713345E-7,6.4007488695956116E-4,4.1336243967136886E-2,2.9047646110281236E-4,0,2.9048996198219513E-4,2.0899394876135246E-2,4.3678470618862815E-4,4.3678470618862815E-4,1.1334776135798265E-2,3.8543145014598549E-7,3.8543145014598549E-7,2.0976685921515813E-2,8.1403950166235154E-4,4.3700931360667853E-4,30,52.076623156467207,1.6702073699038006E-2,2.6849852227994329E-2,4.3988935240639016E-2,4.4810170974033232E-2,3.5618305870166553E-2,9.5149778479555573E-4,1.1799251467380322E-3,0,7.5693077751464618E-5,1.2556182244894969E-3,2.2075303880879338E-3,3.108151861462366E-2,4.498715497358817E-2,1.6169344603447107E-3,9.3621790796054052E-2,9.4349450895675022E-2,0.21599999999999997,0.69598963161242744,2.6461646090370499E-3,3.067226833658634E-3,5.0016427528744641E-2,0.14174001311645962,0,2.438962837956143E-4,4.045820673649515E-3,9.3596576460661107E-4,0,1.2419272824025378E-6,1.4073964201581745E-3,0.14495645100629082,0.34906060416368306,0.69598963161242744,69.59896316124275,18,15.015319606822954,0.15015319606822955,145.66977120222617,null,8.651490167134207E-2,null,9.3621790796054052E-2,4.498715497358817E-2,2.9048996198219513E-4,null,null,{"$f":"IF(OR(MODE=1,MODE=2,MODE=3), BR12, IF(MODE_ILIM=4,#REF!,#REF!))","v":69.59896316124275},{"$f":"IF(OR(MODE=1,MODE=2,MODE=3), BZ12, IF(MODE_ILIM=4,#REF!,#REF!))","v":9.3621790796054052E-2},{"$f":"IF(OR(MODE=1,MODE=2,MODE=3), CA12, IF(MODE_ILIM=4,#REF!,#REF!))","v":4.498715497358817E-2},{"$f":"IF(OR(MODE=1,MODE=2,MODE=3), CB12, IF(MODE_ILIM=4,#REF!,#REF!))","v":2.9048996198219513E-4},{"$f":"(IF(OR(MODE=1,MODE=2,MODE=3), S12, IF(MODE_ILIM=4,#REF!,#REF!)))/1000","v":145.66977120222617},{"$f":"IF(OR(MODE=1,MODE=2,MODE=3), P12, IF(MODE_ILIM=4,#REF!,#REF!))","v":149.57480776741457}]
["VDD",5,"V",{"$f":"B13","v":5},"Gate drive rail",null,null,7,2.1000000000000001E-2,0.14937937604166668,0.14937937604166668,0,48.163967611315364,149.55468250613652,1,149.55468250613652,1.2377405719641333E-6,7.0811694334415504E-2,169948.06640259721,5.8841505006067999E-6,0,6.6E-4,4.4648246432856739E-2,3.3888920461994782E-4,0,3.3890758095923596E-4,2.2573926490977732E-2,5.0958215722006624E-4,5.0958215722006624E-4,1.2544170507224912E-2,4.7206864114299389E-7,4.7206864114299389E-7,2.2657410361547788E-2,9.4971275193941028E-4,5.0984419920779161E-4,30,52.076623156467207,2.0122975790413392E-2,3.132482759932672E-2,5.19576475889479E-2,5.2917274886145498E-2,3.8472167410187996E-2,1.1100807489281485E-3,1.3765793378610377E-3,0,9.1230269463538782E-5,1.4678096073245765E-3,2.5784550294730146E-3,3.2037924040564728E-2,4.8261166459356658E-2,1.8864235370688294E-3,0.10564331991204401,0.10649228171886445,0.252,0.70294400423834669,2.6768422812242106E-3,3.0981013505317935E-3,5.0516194850919155E-2,0.14493379701182504,0,2.5448321795414015E-4,4.0943966779057664E-3,9.4531799400275607E-4,0,1.3168167495254413E-6,1.4214592146217779E-3,0.13462260952441887,0.34256451894015305,0.70294400423834669,70.294400423834674,21,16.343061169118954,0.16343061169118955,169.94806640259722,null,8.7379364066454759E-2,null,0.10564331991204401,4.8261166459356658E-2,3.3890758095923596E-4,null,null,{"$f":"IF(OR(MODE=1,MODE=2,MODE=3), BR13, IF(MODE_ILIM=4,#REF!,#REF!))","v":70.294400423834674},{"$f":"IF(OR(MODE=1,MODE=2,MODE=3), BZ13, IF(MODE_ILIM=4,#REF!,#REF!))","v":0.10564331991204401},{"$f":"IF(OR(MODE=1,MODE=2,MODE=3), CA13, IF(MODE_ILIM=4,#REF!,#REF!))","v":4.8261166459356658E-2},{"$f":"IF(OR(MODE=1,MODE=2,MODE=3), CB13, IF(MODE_ILIM=4,#REF!,#REF!))","v":3.3890758095923596E-4},{"$f":"(IF(OR(MODE=1,MODE=2,MODE=3), S13, IF(MODE_ILIM=4,#REF!,#REF!)))/1000","v":169.94806640259722},{"$f":"IF(OR(MODE=1,MODE=2,MODE=3), P13, IF(MODE_ILIM=4,#REF!,#REF!))","v":149.55468250613652}]
["K1",400,"pC",4,"RT constant",null,null,8,2.4E-2,0.14937937604166668,0.14937937604166668,0,47.663967611315364,149.53564872171094,1,149.53564872171094,1.2377405719641333E-6,8.0927650667903431E-2,194226.36160296825,5.1486316880309496E-6,0,6.6E-4,4.7730983163429053E-2,3.8730194813708317E-4,0,3.8732595007228749E-4,2.4132542515273941E-2,5.8237960825150434E-4,5.8237960825150434E-4,1.3766470968039202E-2,5.6854716874159867E-7,5.6854716874159867E-7,2.4221790526986777E-2,1.085386002216469E-3,5.826790848089047E-4,30,52.076623156467207,2.372594163651327E-2,3.5799802970659107E-2,6.0108423691981286E-2,6.1206915621976631E-2,4.1128476964438179E-2,1.2686637130607415E-3,1.573233528984043E-3,0,1.0760467378591105E-4,1.6808382027699541E-3,2.9502403078084808E-3,3.2037924040564728E-2,5.0578772519184079E-2,2.1559126137929477E-3,0.11689184106276214,0.11786211516825468,0.28800000000000003,0.70960059891425542,2.706564345233239E-3,3.1276683819387325E-3,5.0994562731809107E-2,0.14810060226257546,0,2.6512618390435954E-4,4.1414020672344443E-3,9.5426977207893073E-4,0,1.4008382342015367E-6,1.4349198569816558E-3,0.12462058080541979,0.33634709724540995,0.70960059891425542,70.960059891425544,24,17.75180413241851,0.17751804132418511,194.22636160296824,null,8.8206811211777911E-2,null,0.11689184106276214,5.0578772519184079E-2,3.8732595007228749E-4,null,null,{"$f":"IF(OR(MODE=1,MODE=2,MODE=3), BR14, IF(MODE_ILIM=4,#REF!,#REF!))","v":70.960059891425544},{"$f":"IF(OR(MODE=1,MODE=2,MODE=3), BZ14, IF(MODE_ILIM=4,#REF!,#REF!))","v":0.11689184106276214},{"$f":"IF(OR(MODE=1,MODE=2,MODE=3), CA14, IF(MODE_ILIM=4,#REF!,#REF!))","v":5.0578772519184079E-2},{"$f":"IF(OR(MODE=1,MODE=2,MODE=3), CB14, IF(MODE_ILIM=4,#REF!,#REF!))","v":3.8732595007228749E-4},{"$f":"(IF(OR(MODE=1,MODE=2,MODE=3), S14, IF(MODE_ILIM=4,#REF!,#REF!)))/1000","v":194.22636160296824},{"$f":"IF(OR(MODE=1,MODE=2,MODE=3), P14, IF(MODE_ILIM=4,#REF!,#REF!))","v":149.53564872171094}]
["Outputs",null,null,null,null,null,null,9,2.7E-2,0.14937937604166668,0.14937937604166668,0,47.163967611315357,149.51770683097683,1,149.51770683097683,1.2377405719641333E-6,9.1043607001391358E-2,218504.65680333925,4.5765615004719558E-6,0,6.6E-4,5.0626352801342415E-2,4.3571469165421851E-4,0,4.3574506933878284E-4,2.5596426689734299E-2,6.5517705928294244E-4,6.5517705928294244E-4,1.5011201168519414E-2,6.7600848156527583E-7,6.7600848156527583E-7,2.5691088501168639E-2,1.221059252493527E-3,6.5551397041001768E-4,30,52.076623156467207,2.7510971237337634E-2,4.0274778341991488E-2,6.8441263549739145E-2,6.9679107842191321E-2,4.3623337442143417E-2,1.4272466771933338E-3,1.7698877201070481E-3,0,1.2481720843814003E-4,1.8947049285451881E-3,3.322887221870833E-3,3.2037924040564728E-2,5.2896378579011492E-2,2.425401690517066E-3,0.12832377533359071,0.12941537347069401,0.32400000000000001,0.71457656479515319,2.7300448217646993E-3,3.1498320897095779E-3,5.135215431875681E-2,0.15094605863460597,0,2.752822593612553E-4,4.1787399356181072E-3,9.6096144318842864E-4,0,1.4909253658311805E-6,1.444982013441344E-3,0.11666207560214185,0.33170162204395387,0.71457656479515319,71.457656479515322,27,19.240199150848532,0.19240199150848533,218.50465680333926,null,8.8825348010822577E-2,null,0.12832377533359071,5.2896378579011492E-2,4.3574506933878284E-4,null,null,{"$f":"IF(OR(MODE=1,MODE=2,MODE=3), BR15, IF(MODE_ILIM=4,#REF!,#REF!))","v":71.457656479515322},{"$f":"IF(OR(MODE=1,MODE=2,MODE=3), BZ15, IF(MODE_ILIM=4,#REF!,#REF!))","v":0.12832377533359071},{"$f":"IF(OR(MODE=1,MODE=2,MODE=3), CA15, IF(MODE_ILIM=4,#REF!,#REF!))","v":5.2896378579011492E-2},{"$f":"IF(OR(MODE=1,MODE=2,MODE=3), CB15, IF(MODE_ILIM=4,#REF!,#REF!))","v":4.3574506933878284E-4},{"$f":"(IF(OR(MODE=1,MODE=2,MODE=3), S15, IF(MODE_ILIM=4,#REF!,#REF!)))/1000","v":218.50465680333926},{"$f":"IF(OR(MODE=1,MODE=2,MODE=3), P15, IF(MODE_ILIM=4,#REF!,#REF!))","v":149.51770683097683}]
["Design","Value","Units","Std Units","Description",null,null,10,0.03,0.14937937604166668,0.14937937604166668,0,46.663967611315357,149.50085722705512,1,149.50085722705512,1.2377405719641333E-6,0.10115956333487927,242782.95200371026,4.1189053504247605E-6,0,6.6E-4,5.3364861493162656E-2,4.8412743517135386E-4,0,4.8416493877615537E-4,2.6981002767028143E-2,7.2797451031438032E-4,7.2797451031438032E-4,1.6284222596637258E-2,7.9552771673049445E-7,7.9552771673049445E-7,2.7080785077551441E-2,1.3567325027705858E-3,7.2834885601113077E-4,30,52.076623156467207,3.147806459288649E-2,4.4749753713323875E-2,7.6956167162221506E-2,7.8333866209024383E-2,4.5983035151758972E-2,1.5858296413259259E-3,1.9665419112300533E-3,0,1.4286879113978423E-4,2.1094107023698376E-3,3.6963967705615987E-3,3.2037924040564728E-2,5.5213984638838906E-2,2.6948907672411839E-3,0.1399391383856661,0.14115207336247337,0.36,0.71834482811691203,2.7490638471456843E-3,3.1666756510531796E-3,5.1622955866339248E-2,0.15355851297967321,0,2.8508071448494251E-4,4.2091229678384318E-3,9.6602899779124347E-4,0,1.5873978359361291E-6,1.452602012459102E-3,0.11017411195843486,0.32818574239305581,0.71834482811691203,71.834482811691203,30,20.80575856495858,0.20805758564958579,242.78295200371025,null,8.9293761498532728E-2,null,0.1399391383856661,5.5213984638838906E-2,4.8416493877615537E-4,null,null,{"$f":"IF(OR(MODE=1,MODE=2,MODE=3), BR16, IF(MODE_ILIM=4,#REF!,#REF!))","v":71.834482811691203},{"$f":"IF(OR(MODE=1,MODE=2,MODE=3), BZ16, IF(MODE_ILIM=4,#REF!,#REF!))","v":0.1399391383856661},{"$f":"IF(OR(MODE=1,MODE=2,MODE=3), CA16, IF(MODE_ILIM=4,#REF!,#REF!))","v":5.5213984638838906E-2},{"$f":"IF(OR(MODE=1,MODE=2,MODE=3), CB16, IF(MODE_ILIM=4,#REF!,#REF!))","v":4.8416493877615537E-4},{"$f":"(IF(OR(MODE=1,MODE=2,MODE=3), S16, IF(MODE_ILIM=4,#REF!,#REF!)))/1000","v":242.78295200371025},{"$f":"IF(OR(MODE=1,MODE=2,MODE=3), P16, IF(MODE_ILIM=4,#REF!,#REF!))","v":149.50085722705512}]
["On-Time",{"$f":"(Rt*k_RT/10000)/Vin","v":0.41666666666666669},"µs",{"$f":"B17/1000000","v":4.1666666666666667E-7},"On Time - fixed",null,null,11,3.3000000000000002E-2,0.14937937604166668,0.14937937604166668,0,46.163967611315357,149.48510027930567,1,149.48510027930567,1.2377405719641333E-6,0.11127551966836723,267061.24720408133,3.7444594094770544E-6,0,6.6E-4,5.5969538915403606E-2,5.3254017868848943E-4,0,5.3258555840183955E-4,2.8297914434562459E-2,8.0077196134581842E-4,8.0077196134581842E-4,1.7588952023421943E-2,9.2811369984671657E-7,9.2811369984671657E-7,2.8402567004730161E-2,1.4924057530476451E-3,8.0118374161224407E-4,30,52.076623156467207,3.5627221703159843E-2,4.922472908465627E-2,8.5653134529428354E-2,8.7171205386280814E-2,4.8227414132883929E-2,1.7444126054585193E-3,2.1631961023530588E-3,0,1.6176033961040235E-4,2.324956441963461E-3,4.070769952907353E-3,3.2037924040564728E-2,5.7531590698666334E-2,2.9643798439653027E-3,0.1517379458818198,0.1530722315152673,0.39600000000000002,0.72121658548851419,2.7647926260322081E-3,3.1795698466229E-3,5.1829331131045576E-2,0.15599611419621887,0,2.9460666616484046E-4,4.2343362284909397E-3,9.6989093259887763E-4,0,1.6903307917892945E-6,1.4584091406989181E-3,0.10477963990256287,0.32550838100122781,0.72121658548851419,72.121658548851414,33,22.444784059665849,0.22444784059665848,267.06124720408133,null,8.9650734929376127E-2,null,0.1517379458818198,5.7531590698666334E-2,5.3258555840183955E-4,null,null,{"$f":"IF(OR(MODE=1,MODE=2,MODE=3), BR17, IF(MODE_ILIM=4,#REF!,#REF!))","v":72.121658548851414},{"$f":"IF(OR(MODE=1,MODE=2,MODE=3), BZ17, IF(MODE_ILIM=4,#REF!,#REF!))","v":0.1517379458818198},{"$f":"IF(OR(MODE=1,MODE=2,MODE=3), CA17, IF(MODE_ILIM=4,#REF!,#REF!))","v":5.7531590698666334E-2},{"$f":"IF(OR(MODE=1,MODE=2,MODE=3), CB17, IF(MODE_ILIM=4,#REF!,#REF!))","v":5.3258555840183955E-4},{"$f":"(IF(OR(MODE=1,MODE=2,MODE=3), S17, IF(MODE_ILIM=4,#REF!,#REF!)))/1000","v":267.06124720408133},{"$f":"IF(OR(MODE=1,MODE=2,MODE=3), P17, IF(MODE_ILIM=4,#REF!,#REF!))","v":149.48510027930567}]
["Off Time",{"$f":"L*Iripple*1000000/(Vout+(Rdcr+RdsonBot)*Iout)","v":1.2013277940697293},"µs",{"$f":"B18/1000000","v":1.2013277940697293E-6},"Off Time - depends on Vout, L, Iout, DCR, etc.",null,null,12,3.5999999999999997E-2,0.14937937604166668,0.14937937604166668,0,45.663967611315357,149.47043633328695,1,149.47043633328695,1.2377405719641333E-6,0.12139147600185514,291339.54240445234,3.4324211253539668E-6,0,6.6E-4,5.8458276835888015E-2,5.8095292220562472E-4,0,5.8100692823326934E-4,2.9556207679221239E-2,8.7356941237725651E-4,8.7356941237725651E-4,1.8927131716281419E-2,1.0747089450163981E-6,1.0747089450163981E-6,2.966551372384843E-2,1.6280790033247033E-3,8.7401862721335705E-4,30,52.076623156467207,3.9958442568157691E-2,5.3699704455988657E-2,9.4532165651359704E-2,9.6191140039336098E-2,5.0371891230342761E-2,1.9029955695911115E-3,2.3598502934760643E-3,0,1.8149277156955283E-4,2.5413430650456171E-3,4.4460077680597348E-3,3.2037924040564728E-2,5.9849196758493747E-2,3.2338689206894214E-3,0.16372021348657897,0.1651758645361345,0.43199999999999994,0.72340498947585996,2.7780332168397806E-3,3.1894535866642823E-3,5.1986598056392039E-2,0.15829870439387067,0,3.0391846413707646E-4,4.2556024380182283E-3,9.7283389484752343E-4,0,1.7996523450444448E-6,1.46283442492408E-3,0.10022038785003901,0.32347016597807776,0.72340498947585996,72.340498947585999,36,24.152326085424395,0.24152326085424394,291.33954240445235,null,8.9922764205651096E-2,null,0.16372021348657897,5.9849196758493747E-2,5.8100692823326934E-4,null,null,{"$f":"IF(OR(MODE=1,MODE=2,MODE=3), BR18, IF(MODE_ILIM=4,#REF!,#REF!))","v":72.340498947585999},{"$f":"IF(OR(MODE=1,MODE=2,MODE=3), BZ18, IF(MODE_ILIM=4,#REF!,#REF!))","v":0.16372021348657897},{"$f":"IF(OR(MODE=1,MODE=2,MODE=3), CA18, IF(MODE_ILIM=4,#REF!,#REF!))","v":5.9849196758493747E-2},{"$f":"IF(OR(MODE=1,MODE=2,MODE=3), CB18, IF(MODE_ILIM=4,#REF!,#REF!))","v":5.8100692823326934E-4},{"$f":"(IF(OR(MODE=1,MODE=2,MODE=3), S18, IF(MODE_ILIM=4,#REF!,#REF!)))/1000","v":291.33954240445235},{"$f":"IF(OR(MODE=1,MODE=2,MODE=3), P18, IF(MODE_ILIM=4,#REF!,#REF!))","v":149.47043633328695}]
["DIL",{"$f":"(Vin-Vout-(Rdcr+RdsonTop)*Iout)/L*OnTime*1000","v":147.47499999999997},"mA",{"$f":"B19/1000","v":0.14747499999999997},"Inductor pk-pk ripple current in CCM",null,null,13,3.9E-2,0.14937937604166668,0.14937937604166668,0,45.163967611315357,149.45686571071832,1,149.45686571071832,1.2377405719641333E-6,0.13150743233534307,315617.83760482335,3.1683887310959696E-6,0,6.6E-4,6.0845303638323356E-2,6.2936566572276012E-4,0,6.2942904828788024E-4,3.0763076299497333E-2,9.463668634086945E-4,9.463668634086945E-4,2.0299340340965012E-2,1.2361896548349886E-6,1.2361896548349886E-6,3.0876845637815609E-2,1.7637522536017617E-3,9.4685351281447003E-4,30,52.076623156467207,4.4471727187880027E-2,5.8174679827321038E-2,0.10359326052801554,0.10539368483513631,5.2428726651505393E-2,2.0615785337237038E-3,2.5565044845990694E-3,0,2.0206700473679429E-4,2.758571489335864E-3,4.8221112152954694E-3,3.2037924040564728E-2,6.2166802818321168E-2,3.5033579974135393E-3,0.17588595686616648,0.17746298896751789,0.46799999999999997,0.7250609376513012,2.7893532826734585E-3,3.1969915568055142E-3,5.2105600708366069E-2,0.16049450130939846,0,3.1305746137361108E-4,4.2737872449487352E-3,9.7506081135572624E-4,0,1.9151983552339644E-6,1.4661830028744208E-3,9.6313505004776714E-2,0.32192995558092796,0.7250609376513012,72.506093765130117,39,25.922181532084487,0.25922181532084487,315.61783760482336,null,9.0128606630687239E-2,null,0.17588595686616648,6.2166802818321168E-2,6.2942904828788024E-4,null,null,{"$f":"IF(OR(MODE=1,MODE=2,MODE=3), BR19, IF(MODE_ILIM=4,#REF!,#REF!))","v":72.506093765130117},{"$f":"IF(OR(MODE=1,MODE=2,MODE=3), BZ19, IF(MODE_ILIM=4,#REF!,#REF!))","v":0.17588595686616648},{"$f":"IF(OR(MODE=1,MODE=2,MODE=3), CA19, IF(MODE_ILIM=4,#REF!,#REF!))","v":6.2166802818321168E-2},{"$f":"IF(OR(MODE=1,MODE=2,MODE=3), CB19, IF(MODE_ILIM=4,#REF!,#REF!))","v":6.2942904828788024E-4},{"$f":"(IF(OR(MODE=1,MODE=2,MODE=3), S19, IF(MODE_ILIM=4,#REF!,#REF!)))/1000","v":315.61783760482336},{"$f":"IF(OR(MODE=1,MODE=2,MODE=3), P19, IF(MODE_ILIM=4,#REF!,#REF!))","v":149.45686571071832}]
["CCM Freq",{"$f":"'Design Converter'!E12","v":600},"kHz",{"$f":"B20*1000","v":600000},"Frequency in CCM",{"$f":"10000*Vout/(k_RT*Rt/1000+Vin*0.75)","v":508.47457627118644},null,14,4.2000000000000003E-2,0.14937937604166668,0.14937937604166668,0,44.663967611315357,149.44438870944455,1,149.44438870944455,1.2377405719641333E-6,0.14162338866883101,339896.13280519441,2.9420752503034E-6,0,6.6E-4,6.314215564152216E-2,6.7777840923989553E-4,0,6.7785191858310795E-4,3.1924352999553998E-2,1.0191643144401323E-3,1.0191643144401323E-3,2.1705342816849889E-2,1.4133657203909312E-6,1.4133657203909312E-6,3.2042417021553568E-2,1.8994255038788197E-3,1.0196883984155832E-3,30,52.076623156467207,4.9167075562326856E-2,6.2649655198653439E-2,0.11283641915939588,0.11477885444219847,5.4407860925376049E-2,2.2201614978562961E-3,2.7531586757220754E-3,0,2.2348395683168543E-4,2.9766426325537609E-3,5.1990812940163889E-3,3.2037924040564728E-2,6.4484408878148602E-2,3.7728470741376589E-3,0.18823519168850111,0.18993362128724475,0.504,0.72629425140848702,2.7991658326042505E-3,3.2026675077942049E-3,5.2194231264562116E-2,0.16260405274799145,0,3.2205379589062618E-4,4.2895206994468691E-3,9.7671936976135936E-4,0,2.0367448370193418E-6,1.4686769500367853E-3,9.2925903717606617E-2,0.32078502863053127,0.72629425140848702,72.629425140848696,42,27.746934669307642,0.27746934669307644,339.89613280519444,null,9.0281913538702047E-2,null,0.18823519168850111,6.4484408878148602E-2,6.7785191858310795E-4,null,null,{"$f":"IF(OR(MODE=1,MODE=2,MODE=3), BR20, IF(MODE_ILIM=4,#REF!,#REF!))","v":72.629425140848696},{"$f":"IF(OR(MODE=1,MODE=2,MODE=3), BZ20, IF(MODE_ILIM=4,#REF!,#REF!))","v":0.18823519168850111},{"$f":"IF(OR(MODE=1,MODE=2,MODE=3), CA20, IF(MODE_ILIM=4,#REF!,#REF!))","v":6.4484408878148602E-2},{"$f":"IF(OR(MODE=1,MODE=2,MODE=3), CB20, IF(MODE_ILIM=4,#REF!,#REF!))","v":6.7785191858310795E-4},{"$f":"(IF(OR(MODE=1,MODE=2,MODE=3), S20, IF(MODE_ILIM=4,#REF!,#REF!)))/1000","v":339.89613280519444},{"$f":"IF(OR(MODE=1,MODE=2,MODE=3), P20, IF(MODE_ILIM=4,#REF!,#REF!))","v":149.44438870944455}]
["Icrit_Skip",{"$f":"1000*Iripple/2","v":73.737499999999983},"mA",{"$f":"Iripple/2","v":7.3737499999999984E-2},"CCM-DCM (critical conduction) boundary",null,null,15,4.4999999999999998E-2,0.14937937604166668,0.14937937604166668,0,44.163967611315357,149.43300560340342,1,149.43300560340342,1.2377405719641333E-6,0.15173934500231892,364174.42800556542,2.7459369002831736E-6,0,6.6E-4,6.5358340426273462E-2,7.2619115275703093E-4,0,7.262755391363885E-4,3.3044844763919994E-2,1.0919617654715707E-3,1.0919617654715707E-3,2.314433495311297E-2,1.6069807212656601E-6,1.6069807212656601E-6,3.3167052636989006E-2,2.0350987541558792E-3,1.0925232840166962E-3,30,52.076623156467207,5.404448769149816E-2,6.7124630569985813E-2,0.12226164154550068,0.12434666353061058,5.6317486473135961E-2,2.3787444619888889E-3,2.9498128668450805E-3,0,2.457445455737845E-4,3.195557412418865E-3,5.5769190037494492E-3,3.2037924040564728E-2,6.6802014937976009E-2,4.0423361508617767E-3,0.20076793362319781,0.20258777790852703,0.54,0.72718675968636526,2.8077784837535241E-3,3.2068418874838032E-3,5.2258370259701856E-2,0.16464267953594172,0,3.3092996260444195E-4,4.3032722965344822E-3,9.7791961349313265E-4,0,2.1640279695845062E-6,1.4704817369160634E-3,8.9958408857901739E-2,0.31995884666230034,0.72718675968636526,72.718675968636532,45,29.618044224570543,0.29618044224570544,364.1744280055654,null,9.0392856665430218E-2,null,0.20076793362319781,6.6802014937976009E-2,7.262755391363885E-4,null,null,{"$f":"IF(OR(MODE=1,MODE=2,MODE=3), BR21, IF(MODE_ILIM=4,#REF!,#REF!))","v":72.718675968636532},{"$f":"IF(OR(MODE=1,MODE=2,MODE=3), BZ21, IF(MODE_ILIM=4,#REF!,#REF!))","v":0.20076793362319781},{"$f":"IF(OR(MODE=1,MODE=2,MODE=3), CA21, IF(MODE_ILIM=4,#REF!,#REF!))","v":6.6802014937976009E-2},{"$f":"IF(OR(MODE=1,MODE=2,MODE=3), CB21, IF(MODE_ILIM=4,#REF!,#REF!))","v":7.262755391363885E-4},{"$f":"(IF(OR(MODE=1,MODE=2,MODE=3), S21, IF(MODE_ILIM=4,#REF!,#REF!)))/1000","v":364.1744280055654},{"$f":"IF(OR(MODE=1,MODE=2,MODE=3), P21, IF(MODE_ILIM=4,#REF!,#REF!))","v":149.43300560340342}]
["Tr",null,"ns",{"$f":"B22/1000000000","v":0},"Switch rise time",null,null,16,4.8000000000000001E-2,0.14937937604166668,0.14937937604166668,0,43.663967611315357,149.42271664259556,1,149.42271664259556,1.2377405719641333E-6,0.16185530133580686,388452.72320593649,2.5743158440154748E-6,0,6.6E-4,6.7501803735123225E-2,7.7460389627416633E-4,0,7.7469990996515868E-4,3.4128568919645733E-2,1.1647592165030087E-3,1.1647592165030087E-3,2.4615116802035878E-2,1.817711925533607E-6,1.817711925533607E-6,3.4254784668224861E-2,2.1707720044329385E-3,1.1653581696178094E-3,30,52.076623156467207,5.9103963575393971E-2,7.1599605941318215E-2,0.13186892768632999,0.13409712677203206,5.8164449922857887E-2,2.5373274261214821E-3,3.1464670579680861E-3,0,2.6884968868265044E-4,3.4153167466507367E-3,5.955625344146751E-3,3.2037924040564728E-2,6.911962099780343E-2,4.3118252275858955E-3,0.21348419834156812,0.21542547517996183,0.57600000000000007,0.72780068125684694,2.8154250217879346E-3,3.209788763646223E-3,5.2302488968291226E-2,0.16662204063666813,0,3.3970310169952116E-4,4.3153990536811179E-3,9.7874521425789273E-4,0,2.2967569057848159E-6,1.4717231792900709E-3,8.7335602865306242E-2,0.31939321356153416,0.72780068125684694,72.780068125684693,48,31.525976771075946,0.31525976771075948,388.45272320593648,null,9.0469170107314548E-2,null,0.21348419834156812,6.911962099780343E-2,7.7469990996515868E-4,null,null,{"$f":"IF(OR(MODE=1,MODE=2,MODE=3), BR22, IF(MODE_ILIM=4,#REF!,#REF!))","v":72.780068125684693},{"$f":"IF(OR(MODE=1,MODE=2,MODE=3), BZ22, IF(MODE_ILIM=4,#REF!,#REF!))","v":0.21348419834156812},{"$f":"IF(OR(MODE=1,MODE=2,MODE=3), CA22, IF(MODE_ILIM=4,#REF!,#REF!))","v":6.911962099780343E-2},{"$f":"IF(OR(MODE=1,MODE=2,MODE=3), CB22, IF(MODE_ILIM=4,#REF!,#REF!))","v":7.7469990996515868E-4},{"$f":"(IF(OR(MODE=1,MODE=2,MODE=3), S22, IF(MODE_ILIM=4,#REF!,#REF!)))/1000","v":388.45272320593648},{"$f":"IF(OR(MODE=1,MODE=2,MODE=3), P22, IF(MODE_ILIM=4,#REF!,#REF!))","v":149.42271664259556}]
["Tf",null,"ns",{"$f":"B23/1000000000","v":0},"Switch fall time",null,null,17,5.1000000000000004E-2,0.14937937604166668,0.14937937604166668,0,43.163967611315357,149.41352205305711,1,149.41352205305711,1.2377405719641333E-6,0.1719712576692948,412731.0184063075,2.4228855002498587E-6,0,6.6E-4,6.9579266679906437E-2,8.2301663979130152E-4,0,8.231250310868556E-4,3.5178923626717838E-2,1.2375566675344465E-3,1.2375566675344465E-3,2.611621648045644E-2,2.0461702897621938E-6,2.0461702897621938E-6,3.5309023842469874E-2,2.3064452547099964E-3,1.2381930552189224E-3,30,52.076623156467207,6.4345503214014277E-2,7.6074581312650602E-2,0.14165827758188382,0.14403025883969375,5.9954542671973018E-2,2.6959103902540753E-3,3.3431212490910912E-3,0,2.9280030387784158E-4,3.6359215529689327E-3,6.3352013149855571E-3,3.2037924040564728E-2,7.1437227057630837E-2,4.5813143043100133E-3,0.22638400151662016,0.22844672938553123,0.6120000000000001,0.72818416516112383,2.822286261431634E-3,3.2117202288241705E-3,5.2330047561171787E-2,0.16855116764563202,0,3.483865111735448E-4,4.3261772886274818E-3,9.7926092281068987E-4,0,2.4346222291306824E-6,1.4724986418107079E-3,8.4999113637886523E-2,0.31904309332159769,0.72818416516112383,72.818416516112379,51.000000000000007,33.460383546927204,0.33460383546927203,412.7310184063075,null,9.0516839024729581E-2,null,0.22638400151662016,7.1437227057630837E-2,8.231250310868556E-4,null,null,{"$f":"IF(OR(MODE=1,MODE=2,MODE=3), BR23, IF(MODE_ILIM=4,#REF!,#REF!))","v":72.818416516112379},{"$f":"IF(OR(MODE=1,MODE=2,MODE=3), BZ23, IF(MODE_ILIM=4,#REF!,#REF!))","v":0.22638400151662016},{"$f":"IF(OR(MODE=1,MODE=2,MODE=3), CA23, IF(MODE_ILIM=4,#REF!,#REF!))","v":7.1437227057630837E-2},{"$f":"IF(OR(MODE=1,MODE=2,MODE=3), CB23, IF(MODE_ILIM=4,#REF!,#REF!))","v":8.231250310868556E-4},{"$f":"(IF(OR(MODE=1,MODE=2,MODE=3), S23, IF(MODE_ILIM=4,#REF!,#REF!)))/1000","v":412.7310184063075},{"$f":"IF(OR(MODE=1,MODE=2,MODE=3), P23, IF(MODE_ILIM=4,#REF!,#REF!))","v":149.41352205305711}]
[null,null,null,null,null,null,null,18,5.3999999999999999E-2,0.14937937604166668,0.14937937604166668,0,42.663967611315357,149.40542203683486,1,149.40542203683486,1.2377405719641333E-6,0.18208721400278272,437009.31360667851,2.2882807502359779E-6,0,6.6E-4,7.1596474745143579E-2,8.7142938330843703E-4,0,8.7155090251891769E-4,3.6198813772910912E-2,1.3103541185658847E-3,1.3103541185658847E-3,2.7645978966279083E-2,2.2929004590118362E-6,2.2929004590118362E-6,3.6332685790480164E-2,2.4421185049870548E-3,1.3110279408200354E-3,30,52.076623156467207,6.9769106607359063E-2,8.0549556683982976E-2,0.15162969123216208,0.15414607440839817,6.1692715446657262E-2,2.8544933543866676E-3,3.5397754402140963E-3,0,3.1759730887891661E-4,3.8573727490930129E-3,6.7156479161683165E-3,3.2037924040564728E-2,7.3754833117458257E-2,4.8508033810341321E-3,0.23946735882305889,0.2416515567446027,0.64800000000000002,0.7283750532299974,2.8285042128673357E-3,3.2128029737105769E-3,5.2343765494355363E-2,0.1704371673186329,0,3.5699067401293949E-4,4.3358241997663027E-3,9.7951762878621391E-4,0,2.5773016880923326E-6,1.4728846463897723E-3,8.2903056323917021E-2,0.31887309077412651,0.7283750532299974,72.837505322999746,54,35.410314704487,0.35410314704487,437.00931360667852,null,9.0540567341587636E-2,null,0.23946735882305889,7.3754833117458257E-2,8.7155090251891769E-4,null,null,{"$f":"IF(OR(MODE=1,MODE=2,MODE=3), BR24, IF(MODE_ILIM=4,#REF!,#REF!))","v":72.837505322999746},{"$f":"IF(OR(MODE=1,MODE=2,MODE=3), BZ24, IF(MODE_ILIM=4,#REF!,#REF!))","v":0.23946735882305889},{"$f":"IF(OR(MODE=1,MODE=2,MODE=3), CA24, IF(MODE_ILIM=4,#REF!,#REF!))","v":7.3754833117458257E-2},{"$f":"IF(OR(MODE=1,MODE=2,MODE=3), CB24, IF(MODE_ILIM=4,#REF!,#REF!))","v":8.7155090251891769E-4},{"$f":"(IF(OR(MODE=1,MODE=2,MODE=3), S24, IF(MODE_ILIM=4,#REF!,#REF!)))/1000","v":437.00931360667852},{"$f":"IF(OR(MODE=1,MODE=2,MODE=3), P24, IF(MODE_ILIM=4,#REF!,#REF!))","v":149.40542203683486}]
["Components","Input Value","Units","Std Units","Description",null,null,19,5.6999999999999995E-2,0.14937937604166668,0.14937937604166668,0,42.163967611315364,149.39841677196404,1,149.39841677196404,1.2377405719641333E-6,0.19220317033627063,461287.60880704952,2.1678449212761895E-6,0,6.6E-4,7.3558385247029623E-2,9.1984212682557232E-4,0,9.199775242787827E-4,3.7190745752099706E-2,1.3831515695973224E-3,1.3831515695973224E-3,2.9202629829269057E-2,2.5583807668359451E-6,2.5583807668359451E-6,3.7328286175384646E-2,2.5777917552641133E-3,1.3838628264211486E-3,30,52.076623156467207,7.5374773755428337E-2,8.5024532055315363E-2,0.16178316863716485,0.16444458815451984,6.3383239830092419E-2,3.0130763185192604E-3,3.7364296313371014E-3,0,3.4324162140543404E-4,4.0796712527425352E-3,7.096966147722681E-3,3.2037924040564728E-2,7.6072439177285678E-2,5.12029245775825E-3,0.25273428593728647,0.25503997341192941,0.68399999999999994,0.72840349651435887,2.8341919329428838E-3,3.2131698121614966E-3,5.2345809535539793E-2,0.17228571010596938,0,3.6552397248680699E-4,4.3445128729923651E-3,9.7955587927039652E-4,0,2.724464175407002E-6,1.4729421630175633E-3,8.1010863574723382E-2,0.31885500431327951,0.72840349651435887,72.840349651435886,56.999999999999993,37.364462120689176,0.37364462120689174,461.28760880704954,null,9.0544102980393129E-2,null,0.25273428593728647,7.6072439177285678E-2,9.199775242787827E-4,null,null,{"$f":"IF(OR(MODE=1,MODE=2,MODE=3), BR25, IF(MODE_ILIM=4,#REF!,#REF!))","v":72.840349651435886},{"$f":"IF(OR(MODE=1,MODE=2,MODE=3), BZ25, IF(MODE_ILIM=4,#REF!,#REF!))","v":0.25273428593728647},{"$f":"IF(OR(MODE=1,MODE=2,MODE=3), CA25, IF(MODE_ILIM=4,#REF!,#REF!))","v":7.6072439177285678E-2},{"$f":"IF(OR(MODE=1,MODE=2,MODE=3), CB25, IF(MODE_ILIM=4,#REF!,#REF!))","v":9.199775242787827E-4},{"$f":"(IF(OR(MODE=1,MODE=2,MODE=3), S25, IF(MODE_ILIM=4,#REF!,#REF!)))/1000","v":461.28760880704954},{"$f":"IF(OR(MODE=1,MODE=2,MODE=3), P25, IF(MODE_ILIM=4,#REF!,#REF!))","v":149.39841677196404}]
["L",{"$f":"'Design Converter'!E17","v":100},"µH",{"$f":"B26/1000000","v":1E-4},"Filter inductance",null,null,20,0.06,0.14937937604166668,0.14937937604166668,0,41.663967611315364,149.39250641244882,1,149.39250641244882,1.2377405719641333E-6,0.20231912666975854,485565.90400742053,2.0594526752123803E-6,0,6.6E-4,7.5469310877792364E-2,9.6825487034270772E-4,0,9.6840489638388972E-4,3.8156900039557205E-2,1.4559490206287606E-3,1.4559490206287606E-3,3.0784320875411678E-2,2.8430232352809217E-6,2.8430232352809217E-6,3.8298013536384179E-2,2.7134650055411717E-3,1.4566977120222615E-3,30,52.076623156467207,8.1162504658222098E-2,8.9499507426647751E-2,0.17211870979689212,0.17492581475600533,6.502983195069631E-2,3.1716592826518519E-3,3.9330838224601065E-3,0,3.6973415917695252E-4,4.3028179816370594E-3,7.4791570098015226E-3,3.2037924040564728E-2,7.8390045237113098E-2,5.3897815344823678E-3,0.26618479853740235,0.2686119954776503,0.72,0.72829381323876241,2.8394405206027778E-3,3.2129278652236132E-3,5.23379272836271E-2,0.17410137706627013,0,3.7399319537723656E-4,4.3523829382205127E-3,9.7940837737346405E-4,0,2.8757725460404799E-6,1.4727203668263356E-3,7.9293034674578031E-2,0.31896608806064525,0.72829381323876241,72.829381323876248,60,39.311419610679415,0.39311419610679416,485.5659040074205,null,9.0530468814922535E-2,null,0.26618479853740235,7.8390045237113098E-2,9.6840489638388972E-4,null,null,{"$f":"IF(OR(MODE=1,MODE=2,MODE=3), BR26, IF(MODE_ILIM=4,#REF!,#REF!))","v":72.829381323876248},{"$f":"IF(OR(MODE=1,MODE=2,MODE=3), BZ26, IF(MODE_ILIM=4,#REF!,#REF!))","v":0.26618479853740235},{"$f":"IF(OR(MODE=1,MODE=2,MODE=3), CA26, IF(MODE_ILIM=4,#REF!,#REF!))","v":7.8390045237113098E-2},{"$f":"IF(OR(MODE=1,MODE=2,MODE=3), CB26, IF(MODE_ILIM=4,#REF!,#REF!))","v":9.6840489638388972E-4},{"$f":"(IF(OR(MODE=1,MODE=2,MODE=3), S26, IF(MODE_ILIM=4,#REF!,#REF!)))/1000","v":485.5659040074205},{"$f":"IF(OR(MODE=1,MODE=2,MODE=3), P26, IF(MODE_ILIM=4,#REF!,#REF!))","v":149.39250641244882}]
["Rdcr",{"$f":"'Design Converter'!E18","v":170},"mW",{"$f":"B27/1000","v":0.17},"Inductor DCR at 25°C",null,null,21,6.3E-2,0.14937937604166668,0.14937937604166668,0,41.163967611315364,149.38769108824539,1,149.38769108824539,1.2377405719641333E-6,0.21243508300324648,509844.19920779159,1.9613835002022666E-6,0,6.5999999999999989E-4,7.7333031290563764E-2,1.0166676138598433E-3,0,1.0168330188516784E-3,3.9099187608698453E-2,1.5287464716601986E-3,1.5287464716601986E-3,3.2389162667401404E-2,3.1471735748861669E-6,3.1471735748861669E-6,3.9243785914138289E-2,2.8491382558182301E-3,1.5295325976233747E-3,30,52.076623156467207,8.7132299315740375E-2,9.3974482797980152E-2,0.18263631471134389,0.18558976889237366,6.6635748631741154E-2,3.3302422467844451E-3,4.1297380135831121E-3,0,3.9707583991303066E-4,4.5268138534961429E-3,7.8622215026829603E-3,3.2037924040564721E-2,8.0707651296940519E-2,5.6592706112064866E-3,0.2798189123032036,0.28236763896729039,0.75600000000000001,0.72806583297595884,2.8443241778674166E-3,3.212164482036488E-3,5.2321543766151293E-2,0.17588791084917191,0,3.8240390494829253E-4,4.3595482790645228E-3,9.7910178987373978E-4,0,3.0308856485706657E-6,1.4722593562147362E-3,7.7725507101905053E-2,0.31918779459288199,0.72806583297595884,72.806583297595878,63,41.239947953148963,0.41239947953148964,509.84419920779158,null,9.050212975766711E-2,null,0.2798189123032036,8.0707651296940519E-2,1.0168330188516784E-3,null,null,{"$f":"IF(OR(MODE=1,MODE=2,MODE=3), BR27, IF(MODE_ILIM=4,#REF!,#REF!))","v":72.806583297595878},{"$f":"IF(OR(MODE=1,MODE=2,MODE=3), BZ27, IF(MODE_ILIM=4,#REF!,#REF!))","v":0.2798189123032036},{"$f":"IF(OR(MODE=1,MODE=2,MODE=3), CA27, IF(MODE_ILIM=4,#REF!,#REF!))","v":8.0707651296940519E-2},{"$f":"IF(OR(MODE=1,MODE=2,MODE=3), CB27, IF(MODE_ILIM=4,#REF!,#REF!))","v":1.0168330188516784E-3},{"$f":"(IF(OR(MODE=1,MODE=2,MODE=3), S27, IF(MODE_ILIM=4,#REF!,#REF!)))/1000","v":509.84419920779158},{"$f":"IF(OR(MODE=1,MODE=2,MODE=3), P27, IF(MODE_ILIM=4,#REF!,#REF!))","v":149.38769108824539}]
["Kcore",0,null,{"$f":"B28","v":0},"Core loss constant - consult inductor vendor",null,null,22,6.6000000000000003E-2,0.14937937604166668,0.14937937604166668,0,40.663967611315364,149.38397090524762,1,149.38397090524762,1.2377405719641333E-6,0.22255103933673445,534122.49440816266,1.8722297047385272E-6,0,6.6E-4,7.9152881013932502E-2,1.0650803573769786E-3,0,1.0652618916995886E-3,4.00192943802316E-2,1.6015439226916366E-3,1.6015439226916366E-3,3.4015247486404609E-2,3.4711111846840651E-6,3.4711111846840651E-6,4.0167295464299965E-2,2.9848115060952893E-3,1.6023674832244881E-3,30,52.076623156467207,9.3284157727983139E-2,9.844945816931254E-2,0.19333598338052016,0.19643646524471631,6.8203863144908325E-2,3.4888252109170383E-3,4.3263922047061176E-3,0,4.252675813332269E-4,4.7516597860393448E-3,8.2461606267703741E-3,3.2037924040564728E-2,8.302525735676794E-2,5.9287596879306053E-3,0.29363664291618519,0.29630691984176111,0.79200000000000004,0.72773588549373192,2.8489039329520705E-3,3.210951595565639E-3,5.2297832501523887E-2,0.17764840033235388,0,3.9076070691074943E-4,4.3661027044928019E-3,9.7865807701731818E-4,0,3.189459812668251E-6,1.4715921524458373E-3,7.6288458561707698E-2,0.31950485002478257,0.72773588549373192,72.773588549373187,66,43.139231734149426,0.43139231734149425,534.12249440816265,null,9.0461115678311596E-2,null,0.29363664291618519,8.302525735676794E-2,1.0652618916995886E-3,null,null,{"$f":"IF(OR(MODE=1,MODE=2,MODE=3), BR28, IF(MODE_ILIM=4,#REF!,#REF!))","v":72.773588549373187},{"$f":"IF(OR(MODE=1,MODE=2,MODE=3), BZ28, IF(MODE_ILIM=4,#REF!,#REF!))","v":0.29363664291618519},{"$f":"IF(OR(MODE=1,MODE=2,MODE=3), CA28, IF(MODE_ILIM=4,#REF!,#REF!))","v":8.302525735676794E-2},{"$f":"IF(OR(MODE=1,MODE=2,MODE=3), CB28, IF(MODE_ILIM=4,#REF!,#REF!))","v":1.0652618916995886E-3},{"$f":"(IF(OR(MODE=1,MODE=2,MODE=3), S28, IF(MODE_ILIM=4,#REF!,#REF!)))/1000","v":534.12249440816265},{"$f":"IF(OR(MODE=1,MODE=2,MODE=3), P28, IF(MODE_ILIM=4,#REF!,#REF!))","v":149.38397090524762}]
["Cin",{"$f":"'Design Converter'!E37","v":2.2000000000000002},"µF",{"$f":"B29/1000000","v":2.2000000000000001E-6},"Input capacitance",null,null,23,6.9000000000000006E-2,0.14937937604166668,0.14937937604166668,0,40.163967611315364,149.38134594527551,1,149.38134594527551,1.2377405719641333E-6,0.23266699567022239,558400.78960853373,1.7908284132281563E-6,0,6.6E-4,8.0931819558343054E-2,1.1134931008941139E-3,0,1.1136915149450603E-3,4.091871666759693E-2,1.6743413737230748E-3,1.6743413737230748E-3,3.5660665315348991E-2,3.8150491522000043E-6,3.8150491522000043E-6,4.1070044034040507E-2,3.1204847563723486E-3,1.6752023688256011E-3,30,52.076623156467207,9.961807989495039E-2,0.10292443354064494,0.20421771580442094,0.20746591849569757,6.9736725619046494E-2,3.6474081750496319E-3,4.523046395829124E-3,0,4.5431030115709994E-4,4.9773566969862236E-3,8.6309753825924186E-3,3.2037924040564728E-2,8.534286341659536E-2,6.1982487646547249E-3,0.30763800605954011,0.31042985399736045,0.82800000000000007,0.72731753923410358,2.8532304207160714E-3,3.2093489755010115E-3,5.2267768568921701E-2,0.17938541851072576,0,3.9906745203657779E-4,4.3721241844715047E-3,9.7809548562374196E-4,0,3.351149953424227E-6,1.4707461929639072E-3,7.4965412332548706E-2,0.31990456327346239,0.72731753923410358,72.731753923410352,69,44.999115697666738,0.44999115697666736,558.40078960853373,null,9.0409113200296987E-2,null,0.30763800605954011,8.534286341659536E-2,1.1136915149450603E-3,null,null,{"$f":"IF(OR(MODE=1,MODE=2,MODE=3), BR29, IF(MODE_ILIM=4,#REF!,#REF!))","v":72.731753923410352},{"$f":"IF(OR(MODE=1,MODE=2,MODE=3), BZ29, IF(MODE_ILIM=4,#REF!,#REF!))","v":0.30763800605954011},{"$f":"IF(OR(MODE=1,MODE=2,MODE=3), CA29, IF(MODE_ILIM=4,#REF!,#REF!))","v":8.534286341659536E-2},{"$f":"IF(OR(MODE=1,MODE=2,MODE=3), CB29, IF(MODE_ILIM=4,#REF!,#REF!))","v":1.1136915149450603E-3},{"$f":"(IF(OR(MODE=1,MODE=2,MODE=3), S29, IF(MODE_ILIM=4,#REF!,#REF!)))/1000","v":558.40078960853373},{"$f":"IF(OR(MODE=1,MODE=2,MODE=3), P29, IF(MODE_ILIM=4,#REF!,#REF!))","v":149.38134594527551}]
["RCinESR",{"$f":"'Design Converter'!E39","v":3},"mW",{"$f":"B30/1000","v":3.0000000000000001E-3},"Input capacitor ESR",null,null,24,7.1999999999999995E-2,0.14937937604166668,0.14937937604166668,0,39.663967611315364,149.37981626606611,1,149.37981626606611,1.2377405719641333E-6,0.24278295200371028,582679.08480890468,1.7162105626769834E-6,0,6.6E-4,8.2672487934273772E-2,1.1619058444112494E-3,0,1.1621218886055356E-3,4.1798789752270492E-2,1.7471388247545126E-3,1.7471388247545126E-3,3.732351472129581E-2,4.1791342534523554E-6,4.1791342534523554E-6,4.1953371843031627E-2,3.2561580066494062E-3,1.7480372544267141E-3,30,52.076623156467207,0.10613406581664209,0.10739940891197731,0.21528151198304613,0.21867814332955449,7.1236611740333106E-2,3.8059911391822229E-3,4.7197005869521287E-3,0,4.8420491710420797E-4,5.2039055040563366E-3,9.0166667708030564E-3,3.2037924040564728E-2,8.7660469476422781E-2,6.4677378413788428E-3,0.32182301741815916,0.32473645726577266,0.86399999999999988,0.72682216038641312,2.8573459876220122E-3,3.2074066908963986E-3,5.2232168785376967E-2,0.18110112688746655,0,4.0732738879560712E-4,4.3776780566029778E-3,9.7742930092660192E-4,0,3.5156104012026634E-6,1.4697444619248309E-3,7.3742559959885226E-2,0.32037630312989834,0.72682216038641312,72.682216038641315,72,46.810309970062292,0.46810309970062292,582.67908480890469,null,9.0347535196327725E-2,null,0.32182301741815916,8.7660469476422781E-2,1.1621218886055356E-3,null,null,{"$f":"IF(OR(MODE=1,MODE=2,MODE=3), BR30, IF(MODE_ILIM=4,#REF!,#REF!))","v":72.682216038641315},{"$f":"IF(OR(MODE=1,MODE=2,MODE=3), BZ30, IF(MODE_ILIM=4,#REF!,#REF!))","v":0.32182301741815916},{"$f":"IF(OR(MODE=1,MODE=2,MODE=3), CA30, IF(MODE_ILIM=4,#REF!,#REF!))","v":8.7660469476422781E-2},{"$f":"IF(OR(MODE=1,MODE=2,MODE=3), CB30, IF(MODE_ILIM=4,#REF!,#REF!))","v":1.1621218886055356E-3},{"$f":"(IF(OR(MODE=1,MODE=2,MODE=3), S30, IF(MODE_ILIM=4,#REF!,#REF!)))/1000","v":582.67908480890469},{"$f":"IF(OR(MODE=1,MODE=2,MODE=3), P30, IF(MODE_ILIM=4,#REF!,#REF!))","v":149.37981626606611}]
["Cout",{"$f":"'Design Converter'!E24","v":12},"µF",{"$f":"B31/1000000","v":1.2E-5},"Output capacitance",null,null,25,7.4999999999999997E-2,0.14936874999999999,0.14937140651041667,6.2860466906466961E-4,149.3912587855142,149.3912587855142,1,149.3912587855142,1.2376232496478582E-6,0.25187040225387386,604488.96540929726,1.6542899163145248E-6,0,6.6E-4,8.6240398318208927E-2,1.2643590713541668E-3,0,1.2646148997254047E-3,4.2572365474370023E-2,1.8124063020833329E-3,1.8124063020833329E-3,3.8941235627113574E-2,4.549259496499139E-6,4.549259496499139E-6,4.3281202814053413E-2,3.4655356565077666E-3,1.8134668962278917E-3,30,51.634591142112797,0.11196888657379873,0.11141940610424167,0.2252017595742683,0.22882373764379257,7.3491261967098598E-2,4.050724189137535E-3,4.8963606198153082E-3,5.1284843825325334E-5,5.1713251591028802E-4,5.4647779795509218E-3,9.5231123436295487E-3,3.2037924040564728E-2,8.9742440678536248E-2,6.7098275160432002E-3,0.33479911818200159,0.33788068864330684,0.89999999999999991,0.7270490672137252,2.9259508632402133E-3,3.278453570938636E-3,5.2035987591511415E-2,0.18192525470373488,4.1429553183782621E-5,4.1775634813162425E-4,4.4146241472917819E-3,1.0213900927236209E-3,0,3.6750387482698672E-6,1.4641203459355159E-3,7.2496841983125393E-2,0.32002548423856514,0.7270490672137252,72.704906721372524,75,48.564555994658186,0.48564555994658187,604.48896540929729,null,9.0008194752884615E-2,null,0.33479911818200159,8.9742440678536248E-2,1.2646148997254047E-3,null,null,{"$f":"IF(OR(MODE=1,MODE=2,MODE=3), BR31, IF(MODE_ILIM=4,#REF!,#REF!))","v":72.704906721372524},{"$f":"IF(OR(MODE=1,MODE=2,MODE=3), BZ31, IF(MODE_ILIM=4,#REF!,#REF!))","v":0.33479911818200159},{"$f":"IF(OR(MODE=1,MODE=2,MODE=3), CA31, IF(MODE_ILIM=4,#REF!,#REF!))","v":8.9742440678536248E-2},{"$f":"IF(OR(MODE=1,MODE=2,MODE=3), CB31, IF(MODE_ILIM=4,#REF!,#REF!))","v":1.2646148997254047E-3},{"$f":"(IF(OR(MODE=1,MODE=2,MODE=3), S31, IF(MODE_ILIM=4,#REF!,#REF!)))/1000","v":604.48896540929729},{"$f":"IF(OR(MODE=1,MODE=2,MODE=3), P31, IF(MODE_ILIM=4,#REF!,#REF!))","v":149.3912587855142}]
["RCoutESR",{"$f":"'Design Converter'!E26","v":1},"mW",{"$f":"B32","v":1},"Output capacitor ESR",null,null,26,7.8E-2,0.14934350000000002,0.15237151277083333,3.6412301162439265E-3,149.36600498052263,149.36600498052263,1,149.36600498052263,1.2371311225537952E-6,0.25194535231726706,604668.84556144092,1.653797789220462E-6,0,6.6E-4,8.8861725743333009E-2,1.3423890713541665E-3,0,1.3426774546408007E-3,4.2572365474370023E-2,1.8124063020833329E-3,1.8124063020833329E-3,4.0040880132765355E-2,4.8098162454194495E-6,4.8098162454194495E-6,4.4603395249898557E-2,3.6805063054645456E-3,1.8140065366843228E-3,30,50.613724359502442,0.11330829030091287,0.1114525616138848,0.22657485845148201,0.23042267242059108,7.5736337989848607E-2,4.3019946690844389E-3,4.897817649047672E-3,1.732013441226198E-4,5.3799183447217867E-4,5.6090108276424704E-3,9.9194240872336852E-3,3.2037924040564728E-2,8.9759612037859884E-2,6.7118241857319948E-3,0.33681353273141668,0.33997342630438621,0.93599999999999994,0.73355759665853359,3.0155909909922942E-3,3.3781371702038543E-3,5.0497534552617247E-2,0.17757020152662029,1.357405574066417E-4,4.2163247555269983E-4,4.3958680580738286E-3,1.0520509625675674E-3,0,3.7695269715374608E-6,1.4204106956463996E-3,7.0345988550742394E-2,0.31223692506739475,0.73355759665853359,73.355759665853356,78,50.254747979561841,0.50254747979561842,604.66884556144089,null,8.7347086793716319E-2,null,0.33681353273141668,8.9759612037859884E-2,1.3426774546408007E-3,null,null,{"$f":"IF(OR(MODE=1,MODE=2,MODE=3), BR32, IF(MODE_ILIM=4,#REF!,#REF!))","v":73.355759665853356},{"$f":"IF(OR(MODE=1,MODE=2,MODE=3), BZ32, IF(MODE_ILIM=4,#REF!,#REF!))","v":0.33681353273141668},{"$f":"IF(OR(MODE=1,MODE=2,MODE=3), CA32, IF(MODE_ILIM=4,#REF!,#REF!))","v":8.9759612037859884E-2},{"$f":"IF(OR(MODE=1,MODE=2,MODE=3), CB32, IF(MODE_ILIM=4,#REF!,#REF!))","v":1.3426774546408007E-3},{"$f":"(IF(OR(MODE=1,MODE=2,MODE=3), S32, IF(MODE_ILIM=4,#REF!,#REF!)))/1000","v":604.66884556144089},{"$f":"IF(OR(MODE=1,MODE=2,MODE=3), P32, IF(MODE_ILIM=4,#REF!,#REF!))","v":149.36600498052263}]
["Controller",null,"Units","Std Units","Description",null,null,27,8.1000000000000003E-2,0.14931824999999999,0.15537161903125002,6.6538555634231833E-3,149.34075117553101,149.34075117553101,1,149.34075117553101,1.236639220441061E-6,0.25202031270545949,604848.75049310282,1.6533058871077277E-6,0,6.600000000000001E-4,9.1506318372467227E-2,1.4234790713541668E-3,0,1.4238033520379029E-3,4.2572365474370023E-2,1.8124063020833329E-3,1.8124063020833329E-3,4.1152783126258877E-2,5.0806546771106921E-6,5.0806546771106921E-6,4.5937658567464089E-2,3.9039966781226777E-3,1.8145462514793085E-3,30,49.632442038936922,0.11464847580721717,0.11148572169088872,0.22794874374958518,0.23203144651500054,7.8001910308288416E-2,4.5632235088067033E-3,4.8992748789941339E-3,2.9519038419065468E-4,5.5887873724636613E-4,5.7533440004311548E-3,1.0325863189285774E-2,3.2037924040564734E-2,8.9776785762636341E-2,6.7138211304734428E-3,0.33884791659739605,0.34208920690619438,0.97199999999999998,0.73967581111819125,3.1068688061348677E-3,3.4796109463678337E-3,4.9047418176645874E-2,0.17346519745508965,2.2463496590587756E-4,4.2529741079158059E-4,4.3781989610708781E-3,1.0832438649317519E-3,0,3.8662935898181924E-6,1.3792110098448671E-3,6.8318638712512467E-2,0.30491218660288549,0.73967581111819125,73.967581111819129,81,51.875007795911799,0.51875007795911798,604.84875049310278,null,8.483877738663069E-2,null,0.33884791659739605,8.9776785762636341E-2,1.4238033520379029E-3,null,null,{"$f":"IF(OR(MODE=1,MODE=2,MODE=3), BR33, IF(MODE_ILIM=4,#REF!,#REF!))","v":73.967581111819129},{"$f":"IF(OR(MODE=1,MODE=2,MODE=3), BZ33, IF(MODE_ILIM=4,#REF!,#REF!))","v":0.33884791659739605},{"$f":"IF(OR(MODE=1,MODE=2,MODE=3), CA33, IF(MODE_ILIM=4,#REF!,#REF!))","v":8.9776785762636341E-2},{"$f":"IF(OR(MODE=1,MODE=2,MODE=3), CB33, IF(MODE_ILIM=4,#REF!,#REF!))","v":1.4238033520379029E-3},{"$f":"(IF(OR(MODE=1,MODE=2,MODE=3), S33, IF(MODE_ILIM=4,#REF!,#REF!)))/1000","v":604.84875049310278},{"$f":"IF(OR(MODE=1,MODE=2,MODE=3), P33, IF(MODE_ILIM=4,#REF!,#REF!))","v":149.34075117553101}]
["Deadtime1",7,"ns",{"$f":"B34/1000000000","v":6.9999999999999998E-9},"PMOS off to NMOS on deadtime",null,null,28,8.4000000000000005E-2,0.14929300000000001,0.15837172529166665,9.6664810106024263E-3,149.31549737053948,149.31549737053948,1,149.31549737053948,1.2361475431554126E-6,0.25209528342058463,605028.68020940304,1.6528142098220792E-6,0,6.6E-4,9.417221618971984E-2,1.5076290713541664E-3,0,1.5079928303670391E-3,4.2572365474370023E-2,1.8124063020833329E-3,1.8124063020833329E-3,4.2276001028533662E-2,5.3617807888937377E-6,5.3617807888937377E-6,4.7283013865579641E-2,4.1360142903933035E-3,1.8150860406282092E-3,30,48.688485616926862,0.11598944325426445,0.11151888633619716,0.22932341563108982,0.23365007737952131,8.028631675321582E-2,4.8344194933482776E-3,4.9007323096961651E-3,4.1725197901961358E-4,5.7979324038598835E-4,5.8977775291017666E-3,1.0742442458047943E-2,3.2037924040564728E-2,8.9793961853354337E-2,6.7158183503243738E-3,0.34090230004124794,0.34422806095448721,1.008,0.74543638688320857,3.199653870056109E-3,3.5827276987038035E-3,4.7678241581235736E-2,0.16958930394420227,3.0856627744072331E-4,4.2876882763158604E-4,4.3615257658081328E-3,1.1149221901888262E-3,0,3.9651453358459794E-6,1.3403111164576951E-3,6.6404450880846344E-2,0.29801243729790705,0.74543638688320857,74.543638688320854,84,53.420714247122767,0.53420714247122769,605.02868020940309,null,8.2470471924299626E-2,null,0.34090230004124794,8.9793961853354337E-2,1.5079928303670391E-3,null,null,{"$f":"IF(OR(MODE=1,MODE=2,MODE=3), BR34, IF(MODE_ILIM=4,#REF!,#REF!))","v":74.543638688320854},{"$f":"IF(OR(MODE=1,MODE=2,MODE=3), BZ34, IF(MODE_ILIM=4,#REF!,#REF!))","v":0.34090230004124794},{"$f":"IF(OR(MODE=1,MODE=2,MODE=3), CA34, IF(MODE_ILIM=4,#REF!,#REF!))","v":8.9793961853354337E-2},{"$f":"IF(OR(MODE=1,MODE=2,MODE=3), CB34, IF(MODE_ILIM=4,#REF!,#REF!))","v":1.5079928303670391E-3},{"$f":"(IF(OR(MODE=1,MODE=2,MODE=3), S34, IF(MODE_ILIM=4,#REF!,#REF!)))/1000","v":605.02868020940309},{"$f":"IF(OR(MODE=1,MODE=2,MODE=3), P34, IF(MODE_ILIM=4,#REF!,#REF!))","v":149.31549737053948}]
["Deadtime2",7,"ns",{"$f":"B35/1000000000","v":6.9999999999999998E-9},"NMOS off to PMOS on deadtime",null,null,29,8.6999999999999994E-2,0.14926775,0.16137183155208332,1.2679106457781683E-2,149.29024356554791,149.29024356554791,1,149.29024356554791,1.2356560905427466E-6,0.25217026446477664,605208.63471546397,1.6523227572094131E-6,0,6.5999999999999989E-4,9.6857660007267019E-2,1.5948390713541665E-3,0,1.5952461370930245E-3,4.2572365474370023E-2,1.8124063020833329E-3,1.8124063020833329E-3,4.340967855247E-2,5.6532005760863219E-6,5.6532005760863219E-6,4.8638582506564436E-2,4.376566660258571E-3,1.8156259041463918E-3,30,47.779765145034617,0.1173311928036523,0.11155205555075431,0.23069887425855301,0.23527858258116202,8.2588065402323385E-2,5.1155914101738342E-3,4.9021899411952593E-3,5.3938614360381058E-4,6.0073536004863481E-4,6.0423114448477045E-3,1.1169174829522165E-2,3.2037924040564721E-2,8.9811140310502913E-2,6.7178158453416511E-3,0.34297671356652876,0.34639001920628121,1.044,0.75086845099476363,3.2938299752923897E-3,3.6873562912952901E-3,4.6383411290664492E-2,0.16592385666739026,3.8793873384658273E-4,4.3206248013170499E-4,4.3457672749240691E-3,1.1470443899364274E-3,0,4.0659099231117253E-6,1.3035236710904788E-3,6.459420671170564E-2,0.29150306339620041,0.75086845099476363,75.086845099476363,87,54.888490199331855,0.54888490199331852,605.20863471546397,null,8.0230765475743981E-2,null,0.34297671356652876,8.9811140310502913E-2,1.5952461370930245E-3,null,null,{"$f":"IF(OR(MODE=1,MODE=2,MODE=3), BR35, IF(MODE_ILIM=4,#REF!,#REF!))","v":75.086845099476363},{"$f":"IF(OR(MODE=1,MODE=2,MODE=3), BZ35, IF(MODE_ILIM=4,#REF!,#REF!))","v":0.34297671356652876},{"$f":"IF(OR(MODE=1,MODE=2,MODE=3), CA35, IF(MODE_ILIM=4,#REF!,#REF!))","v":8.9811140310502913E-2},{"$f":"IF(OR(MODE=1,MODE=2,MODE=3), CB35, IF(MODE_ILIM=4,#REF!,#REF!))","v":1.5952461370930245E-3},{"$f":"(IF(OR(MODE=1,MODE=2,MODE=3), S35, IF(MODE_ILIM=4,#REF!,#REF!)))/1000","v":605.20863471546397},{"$f":"IF(OR(MODE=1,MODE=2,MODE=3), P35, IF(MODE_ILIM=4,#REF!,#REF!))","v":149.29024356554791}]
["Sleep delay",5,"µs",{"$f":"B36/1000000","v":5.0000000000000004E-6},"Delay time to enter sleep mode",null,null,30,0.09,0.14924249999999997,0.16437193781249998,1.5691731904960926E-2,149.26498976055632,149.26498976055632,1,149.26498976055632,1.235164862449101E-6,0.25224525584017038,605388.61401640892,1.6518315291157677E-6,0,6.6E-4,9.9561068204812531E-2,1.6851090713541667E-3,0,1.6855635286969748E-3,4.2572365474370023E-2,1.8124063020833329E-3,1.8124063020833329E-3,4.4553039671837831E-2,5.9549200320010674E-6,5.9549200320010674E-6,5.0003574508836142E-2,4.6256613077723463E-3,1.8161658420492266E-3,30,46.90434384304146,0.11867372461702264,0.11158522933550449,0.23207511979457635,0.23691697980191148,8.4905814870907287E-2,5.4067480491695854E-3,4.9036477735329128E-3,6.6159289294169272E-4,6.2170511239634805E-4,6.1869457788709531E-3,1.1606073367917089E-2,3.2037924040564728E-2,8.9828321134571135E-2,6.7198136155821389E-3,0.34507118791998187,0.34857511267079416,1.08,0.75599805037964363,3.3892932645893789E-3,3.7933795297013118E-3,4.5157031042619387E-2,0.16245216491326106,4.6311383074902585E-4,4.3519245637286695E-4,4.3308508765101906E-3,1.1795733079822237E-3,0,4.1684332725550846E-6,1.2686811396951656E-3,6.2879662635752134E-2,0.28535311143050529,0.75599805037964363,75.599805037964359,90,56.276153038808332,0.5627615303880833,605.38861401640895,null,7.8109459100747042E-2,null,0.34507118791998187,8.9828321134571135E-2,1.6855635286969748E-3,null,null,{"$f":"IF(OR(MODE=1,MODE=2,MODE=3), BR36, IF(MODE_ILIM=4,#REF!,#REF!))","v":75.599805037964359},{"$f":"IF(OR(MODE=1,MODE=2,MODE=3), BZ36, IF(MODE_ILIM=4,#REF!,#REF!))","v":0.34507118791998187},{"$f":"IF(OR(MODE=1,MODE=2,MODE=3), CA36, IF(MODE_ILIM=4,#REF!,#REF!))","v":8.9828321134571135E-2},{"$f":"IF(OR(MODE=1,MODE=2,MODE=3), CB36, IF(MODE_ILIM=4,#REF!,#REF!))","v":1.6855635286969748E-3},{"$f":"(IF(OR(MODE=1,MODE=2,MODE=3), S36, IF(MODE_ILIM=4,#REF!,#REF!)))/1000","v":605.38861401640895},{"$f":"IF(OR(MODE=1,MODE=2,MODE=3), P36, IF(MODE_ILIM=4,#REF!,#REF!))","v":149.26498976055632}]
["IQ(active)",660,"µA",{"$f":"B37/1000000","v":6.6E-4},"LM5164 quiescent current - active state ",null,null,31,9.2999999999999999E-2,0.14921725,0.16737204407291667,1.8704357352140197E-2,149.23973595556478,149.23973595556478,1,149.23973595556478,1.234673858720655E-6,0.25232025754890114,605568.61811736273,1.6513405253873214E-6,0,6.5999999999999989E-4,0.10228101633286274,1.7784390713541671E-3,0,1.7789452706781952E-3,4.2572365474370023E-2,1.8124063020833329E-3,1.8124063020833329E-3,4.5705379508118947E-2,6.2669451479435384E-6,6.2669451479435384E-6,5.1377278367634109E-2,4.8833057550609228E-3,1.8167058543520883E-3,30,46.060424319664143,0.12001703885606201,0.11161840769139229,0.23345215240180639,0.23856528683921543,8.7238357027507332E-2,5.7078982026441284E-3,4.9051058067506393E-3,7.8387224203583963E-4,6.4270251359562413E-4,6.3316805623821037E-3,1.205315126611943E-2,3.2037924040564721E-2,8.9845504326048167E-2,6.7218116611027275E-3,0.34718575409248575,0.35078337261039522,1.1160000000000001,0.76084854849007766,3.4859506406248221E-3,3.9006923657410823E-3,4.3993812004934942E-2,0.15915925743440751,5.3441582218156935E-4,4.3817139299297042E-4,4.3167114385226366E-3,1.2124756147113436E-3,0,4.2725771678134196E-6,1.2356332475039185E-3,6.12534243322874E-2,0.27953481687107601,0.76084854849007766,76.084854849007769,93,57.582635216683897,0.57582635216683897,605.56861811736269,null,7.6097404549076653E-2,null,0.34718575409248575,8.9845504326048167E-2,1.7789452706781952E-3,null,null,{"$f":"IF(OR(MODE=1,MODE=2,MODE=3), BR37, IF(MODE_ILIM=4,#REF!,#REF!))","v":76.084854849007769},{"$f":"IF(OR(MODE=1,MODE=2,MODE=3), BZ37, IF(MODE_ILIM=4,#REF!,#REF!))","v":0.34718575409248575},{"$f":"IF(OR(MODE=1,MODE=2,MODE=3), CA37, IF(MODE_ILIM=4,#REF!,#REF!))","v":8.9845504326048167E-2},{"$f":"IF(OR(MODE=1,MODE=2,MODE=3), CB37, IF(MODE_ILIM=4,#REF!,#REF!))","v":1.7789452706781952E-3},{"$f":"(IF(OR(MODE=1,MODE=2,MODE=3), S37, IF(MODE_ILIM=4,#REF!,#REF!)))/1000","v":605.56861811736269},{"$f":"IF(OR(MODE=1,MODE=2,MODE=3), P37, IF(MODE_ILIM=4,#REF!,#REF!))","v":149.23973595556478}]
["IQ(sleep)",10,"µA",{"$f":"B38/1000000","v":1.0000000000000001E-5},"LM5164 quiescent current - sleep state","QRR",2.0000000000000001E-10,32,{"$f":"IF(PLOT_TYPE=1, H38/100*Iout, min_I*EXP(H38*rr/100))","v":9.6000000000000002E-2},{"$f":"IF(I38<Icrit, (Vin-(Rdcr+RdsonTop)*Iripple/2-Vout)/L*OnTime, (Vin-(Rdcr+RdsonTop)*I38-Vout)/L*OnTime)","v":0.14919199999999999},{"$f":"IF(I38<Icrit, (Vin-(Rdcr+RdsonTop)*Iripple/2-Vout)/L*OnTime, I38+((Vin-(Rdcr+RdsonTop)*J38-Vout)/L*OnTime)/2)","v":0.17037215033333336},{"$f":"IF(I38<Icrit, 0, I38-((Vin-(Rdcr+RdsonTop)*K38-Vout)/L*OnTime)/2)","v":2.1716982799319454E-2},149.21448215057319,{"$f":"IF(I38<Icrit, 1000*SQRT((J38*CoutEsr)^2+(((J38/2)-I38)*(OnTime+OffTime)/Cout)^2), 1000*J38*SQRT(CoutEsr^2+(1/(8*Fsw*Cout))^2))","v":149.21448215057319},1,{"$f":"IF(I38<Icrit, 1000*((N38/1000)*O38), 1000*J38*SQRT(CoutEsr^2+(1/(8*Fsw*Cout))^2))","v":149.21448215057319},{"$f":"IF(I38<Icrit, L*J38/(Vout+J38/2*(RdsonBot+Rdcr)), L*J38/(Vout+I38*(RdsonBot+Rdcr)))","v":1.2341830792037272E-6},0.25239526959310482,{"$f":"IF(I38<Icrit,I38/((OnTime+Q38)*J38/2),1/(OnTime+Q38))","v":605748.64702345151},1.6508497458703942E-6,0,{"$f":"S38*(T38*Iq_active+U38*Iq_sleep)","v":6.6E-4},0.10501621923342762,{"$f":"W38^2*Rdcr","v":1.8748290713541669E-3},{"$f":"Core_Loss/1000*S38/$S$106","v":0},{"$f":"(Y38+X38*(1+Ltc*(Ta-25)))/(1-X38*Ltc*ThetaCa)","v":1.8753916375561293E-3},4.2572365474370023E-2,1.8124063020833329E-3,1.8124063020833329E-3,4.6866057060557492E-2,6.5892819132102925E-6,6.5892819132102925E-6,5.2759052131332113E-2,5.149507526323747E-3,1.8172459410703546E-3,30,{"$f":"IF(I38<Icrit, Csw*Vin/Iripple*1000000000, Csw*Vin/(I38+Iripple/2)*1000000000)","v":45.246336254510645},{"$f":"IF(I38<Icrit, Vin*(I38+Iripple/2)*AK38/1000000000/2*S38, Vin*(I38-Iripple/2)*AJ38/1000000000/2*S38 + Vin*(I38+Iripple/2)*AK38/1000000000/2*S38)","v":0.12136113568250149},{"$f":"IF(I38<Icrit, Csw*(Vin)^2*S38/2, Csw*Vin^2*S38/2)","v":0.11165159061936258},0.23482997224293445,{"$f":"(AI38+AL38+AM38+AH38*(1+RdsonTopTc*(Ta-25)))/(1-AH38*RdsonTopTc*ThetaJA)","v":0.24022352160645627},{"$f":"IF(I38<Icrit,Iripple*SQRT((OffTime)*S38/3), SQRT(OffTime*S38*(I38^2+Iripple^2/12)))","v":8.9584601841531303E-2},6.0190506653292697E-3,{"$f":"QgBot*S38*Vdd","v":4.9065640408899576E-3},{"$f":"IF(I38<Icrit, Vin*Idss*R38, QrrBot*(I38-Iripple/2)/1*S38*Vin+Vin*Idss*R38)","v":9.0622420589296518E-4},{"$f":"IF(I38<Icrit, dead1*S38*(I38+Iripple/2)*((I38+Iripple/2)*BDserR+VSD), dead1*S38*(I38+Iripple/2)*((I38+Iripple/2)*BDserR+VSD)+dead2*S38*(I38-Iripple/2)*((I38-Iripple/2)*BDserR+VSD))","v":6.6372757981741437E-4},6.4765158266003372E-3,{"$f":"(AR38+AS38+AT38+AQ38*(1+RdsonBotTc*(Ta-25)))/(1-AQ38*RdsonBotTc*ThetaJA)","v":1.2510421846169767E-2},{"$f":"Vin*V38+Vout*Ifb/0.8","v":3.2037924040564728E-2},{"$f":"(Vin-Vdd)*(S38*QgBot+S38*QgTop)+AW38","v":8.9862689885423411E-2},{"$f":"AI38+AR38","v":6.7238099819603124E-3},0.34932044332000972,{"$f":"SUM(Z38,AC38,AF38,AZ38)","v":0.35301483054156241},{"$f":"Vout*I38","v":1.1520000000000001},0.7654409621900311,3.58371841530692E-3,4.0092003727286839E-3,{"$f":"Vin*S38*(QgBot+QgTop)/($BB38+$BA38)","v":4.2888996518121968E-2},0.1560316665839323,6.0213639593629164E-4,4.410106574023457E-4,4.3032903697499359E-3,{"$f":"X38/($BB38+$BA38)","v":1.2457213266659512E-3},{"$f":"Y38/($BB38+$BA38)","v":0},4.3782172637057761E-6,1.2042448122794637E-3,5.970884011361359E-2,0.27402320378300116,{"$f":"BC38","v":0.7654409621900311},76.544096219003109,{"$f":"I38*1000","v":96},58.807882255999409,0.58807882255999411,{"$f":"S38/1000","v":605.74864702345155},null,{"$f":"AM38/($BB38+$BA38)","v":7.4186372355670424E-2},null,0.34932044332000972,8.9862689885423411E-2,1.8753916375561293E-3,null,null,{"$f":"IF(OR(MODE=1,MODE=2,MODE=3), BR38, IF(MODE_ILIM=4,#REF!,#REF!))","v":76.544096219003109},{"$f":"IF(OR(MODE=1,MODE=2,MODE=3), BZ38, IF(MODE_ILIM=4,#REF!,#REF!))","v":0.34932044332000972},{"$f":"IF(OR(MODE=1,MODE=2,MODE=3), CA38, IF(MODE_ILIM=4,#REF!,#REF!))","v":8.9862689885423411E-2},{"$f":"IF(OR(MODE=1,MODE=2,MODE=3), CB38, IF(MODE_ILIM=4,#REF!,#REF!))","v":1.8753916375561293E-3},{"$f":"(IF(OR(MODE=1,MODE=2,MODE=3), S38, IF(MODE_ILIM=4,#REF!,#REF!)))/1000","v":605.74864702345155},{"$f":"IF(OR(MODE=1,MODE=2,MODE=3), P38, IF(MODE_ILIM=4,#REF!,#REF!))","v":149.21448215057319}]
["High-side N-ch MOSFET",null,"Units","Std Units","Description","QG_high",1.81E-9,33,9.9000000000000005E-2,0.14916675000000001,0.17337225659375,2.472960824649871E-2,{"$f":"IF(I39<Icrit, 1000*((((J39/2)-I39)*0.000002/Cout+Vout/306)), 1000*J39*SQRT(CoutEsr^2+(1/(8*Fsw*Cout))^2))","v":149.18922834558165},149.18922834558165,1,149.18922834558165,1.2336925237447772E-6,0.25247029197491805,605928.70073980337,{"$f":"IF(1/S39-OnTime-Q39>Tsleep, OnTime+Q39+Tsleep, 1/S39)","v":1.650359190411444E-6},{"$f":"IF(1/S39-OnTime-Q39>Tsleep, 1/S39-OnTime-Q39-Tsleep, 0)","v":0},6.600000000000001E-4,{"$f":"IF(I39<Icrit,Iripple*SQRT((OnTime+OffTime)*S39/3), SQRT(I39^2+Iripple^2/12))","v":0.10776551536592462},1.9742790713541667E-3,0,1.9749029128723812E-3,{"$f":"Iripple/SQRT(12)*SQRT((OnTime+Q39)*S39)","v":4.2572365474370023E-2},1.8124063020833329E-3,1.8124063020833329E-3,{"$f":"SQRT($R39)*SQRT($I39^2*(1-R39)+(Iripple^2)/12)","v":4.8034488703732232E-2},6.9219363150869389E-6,6.9219363150869389E-6,{"$f":"IF(I39<Icrit,Iripple*SQRT((OnTime)*S39/3), SQRT(OnTime*S39*(I39^2+Iripple^2/12)))","v":5.4148315577775205E-2},{"$f":"RdsonTop*AG39^2","v":5.4242741478341162E-3},{"$f":"QgTop*S39*Vdd","v":1.8177861022194101E-3},30,44.460525363629792,0.12270601525811686,0.11168477812036055,0.23620857948069685,0.241891702133437,9.1943564098714986E-2,{"$f":"RdsonBot*AP39^2","v":6.3402142343808839E-3},4.9080224759924084E-3,1.0286487995239207E-3,6.8478032723712787E-4,6.6214516027534569E-3,1.2977898559742978E-2,3.2037924040564734E-2,8.9879877813186376E-2,6.7258085782118185E-3,0.3514752870845782,0.35526951823584901,1.1880000000000002,0.76979424913286265,3.6825211575724475E-3,4.1188184447883986E-3,4.1838293044654001E-2,0.15305724417515412,6.6653866182738797E-4,4.4372050322092656E-4,4.2905348187804605E-3,1.2792833967271093E-3,0,4.4852413873887569E-6,1.1743938959898209E-3,5.8239909977571752E-2,0.26879574331767386,0.76979424913286265,76.979424913286266,99,59.95273560232264,0.59952735602322638,605.92870073980339,null,7.2368939320482578E-2,null,0.3514752870845782,8.9879877813186376E-2,1.9749029128723812E-3,null,null,{"$f":"IF(OR(MODE=1,MODE=2,MODE=3), BR39, IF(MODE_ILIM=4,#REF!,#REF!))","v":76.979424913286266},{"$f":"IF(OR(MODE=1,MODE=2,MODE=3), BZ39, IF(MODE_ILIM=4,#REF!,#REF!))","v":0.3514752870845782},{"$f":"IF(OR(MODE=1,MODE=2,MODE=3), CA39, IF(MODE_ILIM=4,#REF!,#REF!))","v":8.9879877813186376E-2},{"$f":"IF(OR(MODE=1,MODE=2,MODE=3), CB39, IF(MODE_ILIM=4,#REF!,#REF!))","v":1.9749029128723812E-3},{"$f":"(IF(OR(MODE=1,MODE=2,MODE=3), S39, IF(MODE_ILIM=4,#REF!,#REF!)))/1000","v":605.92870073980339},{"$f":"IF(OR(MODE=1,MODE=2,MODE=3), P39, IF(MODE_ILIM=4,#REF!,#REF!))","v":149.18922834558165}]
["RdsonTop",1850,"mW",{"$f":"B40/1000","v":1.85},"Drain-source resistance of high-side MOSFET @ VDD, 25°C","QG_low",1.92E-9,34,0.10200000000000001,0.14914149999999998,0.17637236285416669,2.7742233693677967E-2,149.16397454059006,149.16397454059006,1,149.16397454059006,1.2332021921904041E-6,0.25254532469647806,606108.77927154733,1.6498688588570707E-6,0,6.6E-4,0.11052785306013745,2.0767890713541673E-3,0,2.0774793891927975E-3,4.2572365474370023E-2,1.8124063020833329E-3,1.8124063020833329E-3,4.9210142378870607E-2,7.264914338846151E-6,7.264914338846151E-6,5.5544543352013767E-2,5.7076131479399132E-3,1.818326337814642E-3,30,43.701543495269938,0.12405167774472836,0.1117179701953316,0.23758797427787459,0.24356984656686817,9.431435174902926E-2,6.6713977093797146E-3,4.9094811120995339E-3,1.1511460379436944E-3,7.058607720346324E-4,6.766487922077861E-3,1.3455594988633085E-2,3.2037924040564728E-2,8.9897068109826644E-2,6.7278074499141759E-3,0.35365031711524209,0.35754746772085705,1.2240000000000002,0.7739255539158032,3.7822907064648265E-3,4.2294696827498883E-3,4.0837820449519176E-2,0.15022500375550463,7.2786056785421221E-4,4.4631020341857783E-4,4.2783969878747545E-3,1.3131373630833824E-3,0,4.5935480832045485E-6,1.1459702216179213E-3,5.6841207706130929E-2,0.26383206119230146,0.7739255539158032,77.392555391580316,102.00000000000001,61.018807215515402,0.61018807215515403,606.10877927154729,null,7.0638392128898025E-2,null,0.35365031711524209,8.9897068109826644E-2,2.0774793891927975E-3,null,null,{"$f":"IF(OR(MODE=1,MODE=2,MODE=3), BR40, IF(MODE_ILIM=4,#REF!,#REF!))","v":77.392555391580316},{"$f":"IF(OR(MODE=1,MODE=2,MODE=3), BZ40, IF(MODE_ILIM=4,#REF!,#REF!))","v":0.35365031711524209},{"$f":"IF(OR(MODE=1,MODE=2,MODE=3), CA40, IF(MODE_ILIM=4,#REF!,#REF!))","v":8.9897068109826644E-2},{"$f":"IF(OR(MODE=1,MODE=2,MODE=3), CB40, IF(MODE_ILIM=4,#REF!,#REF!))","v":2.0774793891927975E-3},{"$f":"(IF(OR(MODE=1,MODE=2,MODE=3), S40, IF(MODE_ILIM=4,#REF!,#REF!)))/1000","v":606.10877927154729},{"$f":"IF(OR(MODE=1,MODE=2,MODE=3), P40, IF(MODE_ILIM=4,#REF!,#REF!))","v":149.16397454059006}]
["RdsonTopTc",4800,"ppm/°C",{"$f":"B41/1000000","v":4.7999999999999996E-3},"Drain to Source Resistance Temp Co","Qoss_hs",1.4499999999999999E-10,35,0.105,0.14911625000000001,0.17937246911458332,3.075485914085721E-2,149.13872073559853,149.13872073559853,1,149.13872073559853,1.2327120843873487E-6,0.2526203677599223,606288.88262381358,1.649378751054015E-6,0,6.5999999999999989E-4,0.11330227845053836,2.1823590713541661E-3,0,2.1831213681096158E-3,4.2572365474370023E-2,1.8124063020833329E-3,1.8124063020833329E-3,5.039253240889878E-2,7.6182219677457421E-6,7.6182219677457421E-6,5.6947258942953834E-2,5.9995320570642953E-3,1.8188666478714407E-3,{"$f":"15*VIN_nom/24","v":30},42.968039723057558,0.12539812330420075,0.11175116684522132,0.23896815679729352,0.24525797317085904,9.6696155679063242E-2,7.012609892332225E-3,4.9109399492528903E-3,1.2737159361714129E-3,7.2696893039425527E-4,6.9116248158185584E-3,1.3943524845242812E-2,3.2037924040564721E-2,8.9914260775833976E-2,6.7298065971243305E-3,0.3558455653890602,0.35984871128122092,1.26,0.77785041974901581,3.8829653224779115E-3,4.341084436127597E-3,3.9884060086878906E-2,0.14752498497732014,7.8631783777138419E-4,4.4878816480290834E-4,4.2668335429620471E-3,1.3472610473777066E-3,0,4.703045361390634E-6,1.1188738117708587E-3,5.5507813877702317E-2,0.25911368615055319,0.77785041974901581,77.785041974901574,105,62.00835196729512,0.62008351967295117,606.28888262381361,null,6.8988644474601346E-2,null,0.3558455653890602,8.9914260775833976E-2,2.1831213681096158E-3,null,null,{"$f":"IF(OR(MODE=1,MODE=2,MODE=3), BR41, IF(MODE_ILIM=4,#REF!,#REF!))","v":77.785041974901574},{"$f":"IF(OR(MODE=1,MODE=2,MODE=3), BZ41, IF(MODE_ILIM=4,#REF!,#REF!))","v":0.3558455653890602},{"$f":"IF(OR(MODE=1,MODE=2,MODE=3), CA41, IF(MODE_ILIM=4,#REF!,#REF!))","v":8.9914260775833976E-2},{"$f":"IF(OR(MODE=1,MODE=2,MODE=3), CB41, IF(MODE_ILIM=4,#REF!,#REF!))","v":2.1831213681096158E-3},{"$f":"(IF(OR(MODE=1,MODE=2,MODE=3), S41, IF(MODE_ILIM=4,#REF!,#REF!)))/1000","v":606.28888262381361},{"$f":"IF(OR(MODE=1,MODE=2,MODE=3), P41, IF(MODE_ILIM=4,#REF!,#REF!))","v":149.13872073559853}]
["QgTop",0.6,"nC",{"$f":"B42/1000000000","v":6E-10},"Gate charge of high-side MOSFET @ VDD",null,null,36,0.108,0.149091,0.18237257537500001,3.3767484588036453E-2,149.11346693060693,149.11346693060693,1,149.11346693060693,1.2322222001824889E-6,0.2526954211673893,606469.01080173429,1.6488888668491557E-6,0,6.6E-4,0.11608792487629079,2.2909890713541667E-3,0,2.2918291602436911E-3,4.2572365474370023E-2,1.8124063020833329E-3,1.8124063020833329E-3,5.1581214872040065E-2,7.9818651830267012E-6,7.9818651830267012E-6,5.8356029391381715E-2,6.3000384077064424E-3,1.819407032405203E-3,30,42.258752321342598,0.12674535209844365,0.11178436807097566,0.24034912720182453,0.24695610032741253,9.9088240726276935E-2,7.3638595876714553E-3,4.9123989874940484E-3,1.3963585092303457E-3,7.4810481850478606E-4,7.0568623152291801E-3,1.4441701973077724E-2,3.2037924040564728E-2,8.9931455811698285E-2,6.7318060198992514E-3,0.35806106413208777,0.36217328145959782,1.296,0.78158297114714281,3.9844889550820937E-3,4.4535994762550258E-3,3.8973814446067248E-2,0.14494813653628438,8.4210650650528435E-4,4.5116202683369186E-4,4.2558051044082777E-3,1.3816342941779499E-3,0,4.8136496180910045E-6,1.0930138136636552E-3,5.4235258050073398E-2,0.25462383285896911,0.78158297114714281,78.158297114714287,108,62.924142868481049,0.62924142868481048,606.46901080173427,null,6.7414165528332529E-2,null,0.35806106413208777,8.9931455811698285E-2,2.2918291602436911E-3,null,null,{"$f":"IF(OR(MODE=1,MODE=2,MODE=3), BR42, IF(MODE_ILIM=4,#REF!,#REF!))","v":78.158297114714287},{"$f":"IF(OR(MODE=1,MODE=2,MODE=3), BZ42, IF(MODE_ILIM=4,#REF!,#REF!))","v":0.35806106413208777},{"$f":"IF(OR(MODE=1,MODE=2,MODE=3), CA42, IF(MODE_ILIM=4,#REF!,#REF!))","v":8.9931455811698285E-2},{"$f":"IF(OR(MODE=1,MODE=2,MODE=3), CB42, IF(MODE_ILIM=4,#REF!,#REF!))","v":2.2918291602436911E-3},{"$f":"(IF(OR(MODE=1,MODE=2,MODE=3), S42, IF(MODE_ILIM=4,#REF!,#REF!)))/1000","v":606.46901080173427},{"$f":"IF(OR(MODE=1,MODE=2,MODE=3), P42, IF(MODE_ILIM=4,#REF!,#REF!))","v":149.11346693060693}]
["Coss",145,"pF",{"$f":"B43/1000000000000","v":1.4499999999999999E-10},"Capacitance (Coss)",null,null,37,0.111,0.14906574999999997,0.18537268163541665,3.6780110035215724E-2,149.08821312561534,149.08821312561534,1,149.08821312561534,1.2317325394228448E-6,0.25277048492101784,606649.16381044278,1.6483992060895117E-6,0,6.6E-4,0.11888400355844067,2.4026790713541669E-3,0,2.4036030852467691E-3,4.2572365474370023E-2,1.8124063020833329E-3,1.8124063020833329E-3,5.2775783474087262E-2,8.3558499639112268E-6,8.3558499639112268E-6,5.9770460635362128E-2,6.6091397344422414E-3,1.8199474914313283E-3,30,41.572501522430471,0.1280933642894112,0.11181757387354081,0.24173088565438333,0.24866424653692371,0.101489937775511,7.7251556022578226E-3,4.9138582268645863E-3,1.5190737721479019E-3,7.6926845255947767E-4,7.2022004515719662E-3,1.4950140347244956E-2,3.2037924040564728E-2,8.9948653217909597E-2,6.7338057182959148E-3,0.36029684582037419,0.36452121105766822,1.3320000000000001,0.78513607216828518,4.0868106082905279E-3,4.5669572800935768E-3,3.8104171332664451E-2,0.14248621477811066,8.9540511621476291E-4,4.5343874721135368E-4,4.24527580594284E-3,1.4162387453182834E-3,0,4.9252846999194955E-6,1.0683074813744402E-3,5.3019468681934474E-2,0.25034721386185532,0.78513607216828518,78.513607216828518,111,63.769353027551922,0.63769353027551923,606.64916381044281,null,6.5909917980824989E-2,null,0.36029684582037419,8.9948653217909597E-2,2.4036030852467691E-3,null,null,{"$f":"IF(OR(MODE=1,MODE=2,MODE=3), BR43, IF(MODE_ILIM=4,#REF!,#REF!))","v":78.513607216828518},{"$f":"IF(OR(MODE=1,MODE=2,MODE=3), BZ43, IF(MODE_ILIM=4,#REF!,#REF!))","v":0.36029684582037419},{"$f":"IF(OR(MODE=1,MODE=2,MODE=3), CA43, IF(MODE_ILIM=4,#REF!,#REF!))","v":8.9948653217909597E-2},{"$f":"IF(OR(MODE=1,MODE=2,MODE=3), CB43, IF(MODE_ILIM=4,#REF!,#REF!))","v":2.4036030852467691E-3},{"$f":"(IF(OR(MODE=1,MODE=2,MODE=3), S43, IF(MODE_ILIM=4,#REF!,#REF!)))/1000","v":606.64916381044281},{"$f":"IF(OR(MODE=1,MODE=2,MODE=3), P43, IF(MODE_ILIM=4,#REF!,#REF!))","v":149.08821312561534}]
["Low-side N-ch MOSFET",null,"Units","Std Units","Description",null,null,38,0.11399999999999999,0.14904049999999999,0.18837278789583334,3.9792735482394953E-2,149.06295932062378,149.06295932062378,1,149.06295932062378,1.2312431019555751E-6,0.25284555902294747,606829.34165507392,1.6479097686222414E-6,0,6.5999999999999989E-4,0.1216897953900956,2.5174290713541668E-3,0,2.5184434718038438E-3,4.2572365474370023E-2,1.8124063020833329E-3,1.8124063020833329E-3,5.3975865864911515E-2,8.7401822876007594E-6,8.7401822876007594E-6,6.1190193411111211E-2,6.9268435739250163E-3,1.8204880249652216E-3,30,40.908182968240233,0.12944216003910217,0.11185078425386323,0.24311343231793064,0.25038243041868219,0.10390063679869004,8.0965067453799763E-3,4.9153176674060998E-3,1.6418617399556342E-3,7.904598487560473E-4,7.3476392561177819E-3,1.5468854074956694E-2,3.2037924040564721E-2,8.9965852994958073E-2,6.735805692371321E-3,0.36255294318096826,0.36689253313714304,1.3679999999999999,0.78852146393546074,4.1898837892899799E-3,4.6811054078108308E-3,3.7272472739182071E-2,0.14013169558019681,9.4637662483146171E-4,4.5562467625973784E-4,4.2352129113330805E-3,1.4510576437849966E-3,0,5.0378810909954207E-6,1.0446792913483952E-3,5.185672961095527E-2,0.24626987615608362,0.78852146393546074,78.852146393546079,113.99999999999999,64.547447140017496,0.645474471400175,606.8293416550739,null,6.4471304197504117E-2,null,0.36255294318096826,8.9965852994958073E-2,2.5184434718038438E-3,null,null,{"$f":"IF(OR(MODE=1,MODE=2,MODE=3), BR44, IF(MODE_ILIM=4,#REF!,#REF!))","v":78.852146393546079},{"$f":"IF(OR(MODE=1,MODE=2,MODE=3), BZ44, IF(MODE_ILIM=4,#REF!,#REF!))","v":0.36255294318096826},{"$f":"IF(OR(MODE=1,MODE=2,MODE=3), CA44, IF(MODE_ILIM=4,#REF!,#REF!))","v":8.9965852994958073E-2},{"$f":"IF(OR(MODE=1,MODE=2,MODE=3), CB44, IF(MODE_ILIM=4,#REF!,#REF!))","v":2.5184434718038438E-3},{"$f":"(IF(OR(MODE=1,MODE=2,MODE=3), S44, IF(MODE_ILIM=4,#REF!,#REF!)))/1000","v":606.8293416550739},{"$f":"IF(OR(MODE=1,MODE=2,MODE=3), P44, IF(MODE_ILIM=4,#REF!,#REF!))","v":149.06295932062378}]
["RdsonBot",750,"mW",{"$f":"B45/1000","v":0.75},"Drain-source resistance of low-side MOSFET @ VDD, 25°C",null,null,39,0.11699999999999999,0.14901524999999999,0.19137289415625,4.280536092957421E-2,149.03770551563221,149.03770551563221,1,149.03770551563221,1.2307538876279769E-6,0.25292064347531823,607009.54434076371,1.6474205542946437E-6,0,6.600000000000001E-4,0.12450464369686511,2.6352390713541667E-3,0,2.6363506576355731E-3,4.2572365474370023E-2,1.8124063020833329E-3,1.8124063020833329E-3,5.5181120350092108E-2,9.1348681292740485E-6,9.1348681292740485E-6,6.2614899638147384E-2,7.2531574648862481E-3,1.8210286330222912E-3,30,40.26476177993316,0.13079173950956002,0.11188399921288956,0.24449676735547188,0.25211067071137805,0.10631978071682704,8.4779218287556399E-3,4.9167773091601859E-3,1.7647224276892423E-3,8.1167902329667909E-4,7.4931787601461072E-3,1.5997857396038335E-2,3.2037924040564734E-2,8.9983055143334045E-2,6.7378059421824774E-3,0.3648293891929329,0.36928728102078107,1.4039999999999999,0.79174988453748829,4.2936660277195912E-3,4.7959959601111936E-3,3.6476287704334906E-2,0.13787769752384901,9.9517007005959666E-4,4.5772562177823862E-4,4.2255864801741027E-3,1.4860756627302989E-3,0,5.1513752041438107E-6,1.022060171231834E-3,5.0743642108308534E-2,0.24237905870550142,0.79174988453748829,79.174988453748824,117,65.262084299350803,0.65262084299350809,607.00954434076368,null,6.3094119272363067E-2,null,0.3648293891929329,8.9983055143334045E-2,2.6363506576355731E-3,null,null,{"$f":"IF(OR(MODE=1,MODE=2,MODE=3), BR45, IF(MODE_ILIM=4,#REF!,#REF!))","v":79.174988453748824},{"$f":"IF(OR(MODE=1,MODE=2,MODE=3), BZ45, IF(MODE_ILIM=4,#REF!,#REF!))","v":0.3648293891929329},{"$f":"IF(OR(MODE=1,MODE=2,MODE=3), CA45, IF(MODE_ILIM=4,#REF!,#REF!))","v":8.9983055143334045E-2},{"$f":"IF(OR(MODE=1,MODE=2,MODE=3), CB45, IF(MODE_ILIM=4,#REF!,#REF!))","v":2.6363506576355731E-3},{"$f":"(IF(OR(MODE=1,MODE=2,MODE=3), S45, IF(MODE_ILIM=4,#REF!,#REF!)))/1000","v":607.00954434076368},{"$f":"IF(OR(MODE=1,MODE=2,MODE=3), P45, IF(MODE_ILIM=4,#REF!,#REF!))","v":149.03770551563221}]
["RdsonBotTc",4800,"ppm/°C",{"$f":"B46/1000000","v":4.7999999999999996E-3},"Drain To Source Resitance Temp Co",null,null,40,0.12,0.14898999999999998,0.19437300041666666,4.5817986376753467E-2,149.01245171064065,149.01245171064065,1,149.01245171064065,1.2302648962874883E-6,0.25299573828027078,607189.7718726499,1.6469315629541549E-6,0,6.6E-4,0.12732794784368173,2.7561090713541674E-3,0,2.757324989500765E-3,4.2572365474370023E-2,1.8124063020833329E-3,1.8124063020833329E-3,5.6391232953610676E-2,9.5399134620851605E-6,9.5399134620851605E-6,6.40442792269168E-2,7.5880889481362802E-3,1.8215693156179496E-3,30,39.641267178527649,0.13214210286287292,0.11191721875156684,0.24588089093005772,0.25384898627361241,0.10874685997938785,8.8694096665324386E-3,4.9182371521684651E-3,1.8876558503885695E-3,8.3292599238802471E-4,7.6388189949450598E-3,1.653716468344139E-2,3.2037924040564728E-2,9.0000259663527898E-2,6.7398064677864147E-3,0.36712621708836818,0.37170548829341438,1.44,0.7948311738882281,4.3981184552575698E-3,4.9115851036463836E-3,3.5713388577134318E-2,0.13571791470459801,1.0419220246259224E-3,4.597469057581882E-4,4.21636907560547E-3,1.5212787559364077E-3,0,5.2657087610147631E-6,1.0003868254495265E-3,4.9677091693477241E-2,0.2386630678302501,0.7948311738882281,79.483117388822805,120,65.91703305041338,0.65917033050413376,607.18977187264989,null,6.1774509971259363E-2,null,0.36712621708836818,9.0000259663527898E-2,2.757324989500765E-3,null,null,{"$f":"IF(OR(MODE=1,MODE=2,MODE=3), BR46, IF(MODE_ILIM=4,#REF!,#REF!))","v":79.483117388822805},{"$f":"IF(OR(MODE=1,MODE=2,MODE=3), BZ46, IF(MODE_ILIM=4,#REF!,#REF!))","v":0.36712621708836818},{"$f":"IF(OR(MODE=1,MODE=2,MODE=3), CA46, IF(MODE_ILIM=4,#REF!,#REF!))","v":9.0000259663527898E-2},{"$f":"IF(OR(MODE=1,MODE=2,MODE=3), CB46, IF(MODE_ILIM=4,#REF!,#REF!))","v":2.757324989500765E-3},{"$f":"(IF(OR(MODE=1,MODE=2,MODE=3), S46, IF(MODE_ILIM=4,#REF!,#REF!)))/1000","v":607.18977187264989},{"$f":"IF(OR(MODE=1,MODE=2,MODE=3), P46, IF(MODE_ILIM=4,#REF!,#REF!))","v":149.01245171064065}]
["QgBot",1.62,"nC",{"$f":"B47/1000000000","v":1.6200000000000002E-9},"Gate charge of low-side MOSFET at VDD",null,null,41,0.12299999999999998,0.14896474999999998,0.1973731066770833,4.883061182393271E-2,148.98719790564908,148.98719790564908,1,148.98719790564908,1.2297761277816852E-6,0.2530708434399464,607370.02425587131,1.6464427944483519E-6,0,6.6E-4,0.13015915758056876,2.8800390713541661E-3,0,2.8813668231989207E-3,4.2572365474370023E-2,1.8124063020833329E-3,1.8124063020833329E-3,5.7605914792266254E-2,9.9553242571615203E-6,9.9553242571615203E-6,6.5478057255290129E-2,7.9316455665650477E-3,1.8221100727676138E-3,30,39.03678759768728,0.13349325026117367,0.1119504428708422,0.24726580320478347,0.25559739608441079,0.11118140776999684,9.2709790752887357E-3,4.9196971964725585E-3,2.0106620230976066E-3,8.5420077224120507E-4,7.7845599918113699E-3,1.7086790443761157E-2,3.2037924040564728E-2,9.0017466556030212E-2,6.7418072692401725E-3,0.36944346035344233,0.37414718880298176,1.4759999999999998,0.79777436570057458,4.5032054368699904E-3,5.0278326547458082E-3,3.4981730197681964E-2,0.13364655779887485,1.0867578727065904E-3,4.6169341412985671E-4,4.2075355079440289E-3,1.556654026654771E-3,0,5.3808282483743744E-6,9.7960114365599929E-4,4.8654219026903589E-2,0.23511116790841585,0.79777436570057458,79.777436570057461,122.99999999999999,66.516098897051677,0.66516098897051679,607.37002425587127,null,6.0508938720314744E-2,null,0.36944346035344233,9.0017466556030212E-2,2.8813668231989207E-3,null,null,{"$f":"IF(OR(MODE=1,MODE=2,MODE=3), BR47, IF(MODE_ILIM=4,#REF!,#REF!))","v":79.777436570057461},{"$f":"IF(OR(MODE=1,MODE=2,MODE=3), BZ47, IF(MODE_ILIM=4,#REF!,#REF!))","v":0.36944346035344233},{"$f":"IF(OR(MODE=1,MODE=2,MODE=3), CA47, IF(MODE_ILIM=4,#REF!,#REF!))","v":9.0017466556030212E-2},{"$f":"IF(OR(MODE=1,MODE=2,MODE=3), CB47, IF(MODE_ILIM=4,#REF!,#REF!))","v":2.8813668231989207E-3},{"$f":"(IF(OR(MODE=1,MODE=2,MODE=3), S47, IF(MODE_ILIM=4,#REF!,#REF!)))/1000","v":607.37002425587127},{"$f":"IF(OR(MODE=1,MODE=2,MODE=3), P47, IF(MODE_ILIM=4,#REF!,#REF!))","v":148.98719790564908}]
["VSD",0.8,"V",{"$f":"B48","v":0.8},"Body diode forward voltage",null,null,42,0.126,0.1489395,0.20037321293749999,5.184323727111198E-2,148.96194410065755,148.96194410065755,1,148.96194410065755,1.2292875819582833E-6,0.25314595895648684,607550.30149556836,1.6459542486249499E-6,0,6.5999999999999989E-4,0.13299776803421678,3.007029071354167E-3,0,3.0084765235728664E-3,4.2572365474370023E-2,1.8124063020833329E-3,1.8124063020833329E-3,5.8824899726793625E-2,1.0381106483601975E-5,1.0381106483601975E-5,6.6915981467455518E-2,8.2838348651427737E-3,1.822650904486705E-3,30,38.450466236935981,0.13484518186663991,0.11198367157166315,0.24865150434278976,0.25735591924374146,0.11362299575957019,9.6826388740344788E-3,4.9211574421141038E-3,2.1337409608644968E-3,8.7550337907181259E-4,7.9304017820504124E-3,1.7646749317759218E-2,3.2037924040564721E-2,9.0034675821331678E-2,6.7438083466008093E-3,0.37178115272943318,0.37661241666157297,1.512,0.80058776838537571,4.6088942464638421E-3,5.1447017132737151E-3,3.4279431584913096E-2,0.13165830222715649,1.1297929326527611E-3,4.6356964051915214E-4,4.1990626091872657E-3,1.5921896122390088E-3,0,5.4966844398663091E-6,9.5964968041831113E-4,4.767239430760626E-2,0.23171348523886975,0.80058776838537571,80.058776838537568,126,67.063063929713536,0.6706306392971354,607.55030149556831,null,5.9294151930660476E-2,null,0.37178115272943318,9.0034675821331678E-2,3.0084765235728664E-3,null,null,{"$f":"IF(OR(MODE=1,MODE=2,MODE=3), BR48, IF(MODE_ILIM=4,#REF!,#REF!))","v":80.058776838537568},{"$f":"IF(OR(MODE=1,MODE=2,MODE=3), BZ48, IF(MODE_ILIM=4,#REF!,#REF!))","v":0.37178115272943318},{"$f":"IF(OR(MODE=1,MODE=2,MODE=3), CA48, IF(MODE_ILIM=4,#REF!,#REF!))","v":9.0034675821331678E-2},{"$f":"IF(OR(MODE=1,MODE=2,MODE=3), CB48, IF(MODE_ILIM=4,#REF!,#REF!))","v":3.0084765235728664E-3},{"$f":"(IF(OR(MODE=1,MODE=2,MODE=3), S48, IF(MODE_ILIM=4,#REF!,#REF!)))/1000","v":607.55030149556831},{"$f":"IF(OR(MODE=1,MODE=2,MODE=3), P48, IF(MODE_ILIM=4,#REF!,#REF!))","v":148.96194410065755}]
["BDserR",100,"mW",{"$f":"B49*0.001","v":0.1},"Series resistance of body diode",null,null,43,0.129,0.14891425,0.20337331919791668,5.4855862718291237E-2,148.93669029566598,148.93669029566598,1,148.93669029566598,1.2287992586651352E-6,0.2532210848320347,607730.60359688324,1.645465925331802E-6,0,6.6E-4,0.13584331526462143,3.1370790713541661E-3,0,3.1386544645114192E-3,4.2572365474370023E-2,1.8124063020833329E-3,1.8124063020833329E-3,6.0047942258595305E-2,1.0817266108474787E-5,1.0817266108474787E-5,6.8357820054912866E-2,8.6446643909207175E-3,1.8231918107906497E-3,30,37.881497009680011,0.13619789784149394,0.11201690485497752,0.25003799450726211,0.25912457497303704,0.11607123033845516,1.0104397884212036E-2,4.9226178891347543E-3,2.2568926787415299E-3,8.9683382909991208E-4,8.0763443969761959E-3,1.8217056080890755E-2,3.2037924040564728E-2,9.0051887459923208E-2,6.7458096999254043E-3,0.37413932821377638,0.37910120624647958,1.548,0.80327903640054499,4.7151547808292641E-3,5.262158339709712E-3,3.3604759786031183E-2,0.1297482424362521,1.1711334471827782E-3,4.6537972483901057E-4,4.1909290341356452E-3,1.6278745823964413E-3,0,5.6132319742273259E-6,9.4048319632026786E-4,4.6729194693060354E-2,0.22846092325273099,0.80327903640054499,80.327903640054501,129,67.561637846160409,0.67561637846160405,607.73060359688327,null,5.8127152062324203E-2,null,0.37413932821377638,9.0051887459923208E-2,3.1386544645114192E-3,null,null,{"$f":"IF(OR(MODE=1,MODE=2,MODE=3), BR49, IF(MODE_ILIM=4,#REF!,#REF!))","v":80.327903640054501},{"$f":"IF(OR(MODE=1,MODE=2,MODE=3), BZ49, IF(MODE_ILIM=4,#REF!,#REF!))","v":0.37413932821377638},{"$f":"IF(OR(MODE=1,MODE=2,MODE=3), CA49, IF(MODE_ILIM=4,#REF!,#REF!))","v":9.0051887459923208E-2},{"$f":"IF(OR(MODE=1,MODE=2,MODE=3), CB49, IF(MODE_ILIM=4,#REF!,#REF!))","v":3.1386544645114192E-3},{"$f":"(IF(OR(MODE=1,MODE=2,MODE=3), S49, IF(MODE_ILIM=4,#REF!,#REF!)))/1000","v":607.73060359688327},{"$f":"IF(OR(MODE=1,MODE=2,MODE=3), P49, IF(MODE_ILIM=4,#REF!,#REF!))","v":148.93669029566598}]
["QrrBot",1.4,"nC",{"$f":"B50*0.000000001","v":1.3999999999999999E-9},"Reverse recovery charge of body diode at 100mA",null,null,44,0.13200000000000001,0.14888899999999999,0.20637342545833331,5.786848816547048E-2,148.91143649067439,148.91143649067439,1,148.91143649067439,1.2283111577502343E-6,0.2532962210687329,607910.93056495895,1.6449778244169011E-6,0,6.6E-4,0.13869537231675516,3.2701890713541671E-3,0,3.271901028952156E-3,4.2572365474370023E-2,1.8124063020833329E-3,1.8124063020833329E-3,6.1274815644536178E-2,1.1263809096815688E-5,1.1263809096815688E-5,6.9803359684620245E-2,9.0141416930318644E-3,1.8237327916948768E-3,30,37.329120845737897,0.1375513983480027,0.11205014272173323,0.25142527386143082,0.26090338261571988,0.118525749268233,1.0536264929697028E-2,4.9240785375761686E-3,2.3801171917851504E-3,9.1819213855004217E-4,8.222387867911362E-3,1.8797725643836746E-2,3.2037924040564728E-2,9.0069101472295715E-2,6.7478113292710456E-3,0.37651802106112342,0.38161359220125574,1.5840000000000001,0.80585523334019404,4.8219593066990826E-3,5.3801712696147216E-3,3.295611559566862E-2,0.12791185147425854,1.2108774589413066E-3,4.6712748741311618E-4,4.183115084538694E-3,1.663698849218854E-3,0,5.7304289823319485E-6,9.2205625219229947E-4,4.5822384333142979E-2,0.22534508754067056,0.80585523334019404,80.585523334019399,132,68.015419380100283,0.68015419380100284,607.9109305649589,null,5.7005172922237612E-2,null,0.37651802106112342,9.0069101472295715E-2,3.271901028952156E-3,null,null,{"$f":"IF(OR(MODE=1,MODE=2,MODE=3), BR50, IF(MODE_ILIM=4,#REF!,#REF!))","v":80.585523334019399},{"$f":"IF(OR(MODE=1,MODE=2,MODE=3), BZ50, IF(MODE_ILIM=4,#REF!,#REF!))","v":0.37651802106112342},{"$f":"IF(OR(MODE=1,MODE=2,MODE=3), CA50, IF(MODE_ILIM=4,#REF!,#REF!))","v":9.0069101472295715E-2},{"$f":"IF(OR(MODE=1,MODE=2,MODE=3), CB50, IF(MODE_ILIM=4,#REF!,#REF!))","v":3.271901028952156E-3},{"$f":"(IF(OR(MODE=1,MODE=2,MODE=3), S50, IF(MODE_ILIM=4,#REF!,#REF!)))/1000","v":607.9109305649589},{"$f":"IF(OR(MODE=1,MODE=2,MODE=3), P50, IF(MODE_ILIM=4,#REF!,#REF!))","v":148.91143649067439}]
["TrrBot",20,"ns",{"$f":"B51*0.000000001","v":2E-8},"Reverse recovery time of body diode (not used)",null,null,45,0.13500000000000001,0.14886374999999999,0.20937353171875001,6.0881113612649765E-2,148.8861826856828,148.8861826856828,1,148.8861826856828,1.2278232790617112E-6,0.25337136766872509,608091.28240494023,1.6444899457283782E-6,0,6.6E-4,0.14155354570650405,3.4063590713541664E-3,0,3.4082166088842164E-3,4.2572365474370023E-2,1.8124063020833329E-3,1.8124063020833329E-3,6.2505310205416151E-2,1.1720741411625901E-5,1.1720741411625901E-5,7.1252403743963508E-2,9.392274322691652E-3,1.8242738472148206E-3,30,36.792622312713334,0.1389056835484781,0.11208338517287858,0.25281334256857146,0.26269236163773207,0.12098621870168613,1.0978248836799171E-2,4.9255393874800164E-3,2.5034145150559552E-3,9.3957832365121688E-4,8.3685322261871885E-3,1.9388773053041073E-2,3.2037924040564728E-2,9.0086317858940321E-2,6.7498132346948368E-3,0.37891726578440832,0.3841496094367875,1.62,0.80832288785828599,4.929282236537642E-3,5.49871166052859E-3,3.2332020897022869E-2,0.12614494515687272,1.2491155866150494E-3,4.6881645922394987E-4,4.1756025532140488E-3,1.6996530874316474E-3,0,5.8482367565960809E-6,9.0432684942750403E-4,4.4949896671764265E-2,0.22235821939539491,0.80832288785828599,80.832288785828595,135,68.427867006324419,0.68427867006324417,608.09128240494022,null,5.5925657767823329E-2,null,0.37891726578440832,9.0086317858940321E-2,3.4082166088842164E-3,null,null,{"$f":"IF(OR(MODE=1,MODE=2,MODE=3), BR51, IF(MODE_ILIM=4,#REF!,#REF!))","v":80.832288785828595},{"$f":"IF(OR(MODE=1,MODE=2,MODE=3), BZ51, IF(MODE_ILIM=4,#REF!,#REF!))","v":0.37891726578440832},{"$f":"IF(OR(MODE=1,MODE=2,MODE=3), CA51, IF(MODE_ILIM=4,#REF!,#REF!))","v":9.0086317858940321E-2},{"$f":"IF(OR(MODE=1,MODE=2,MODE=3), CB51, IF(MODE_ILIM=4,#REF!,#REF!))","v":3.4082166088842164E-3},{"$f":"(IF(OR(MODE=1,MODE=2,MODE=3), S51, IF(MODE_ILIM=4,#REF!,#REF!)))/1000","v":608.09128240494022},{"$f":"IF(OR(MODE=1,MODE=2,MODE=3), P51, IF(MODE_ILIM=4,#REF!,#REF!))","v":148.8861826856828}]
["Idss",0,"μA",{"$f":"B52/1000000","v":0},"Leakage current of low-side device",null,null,46,0.13800000000000001,0.14883850000000001,0.2123736379791667,6.3893739059829008E-2,148.86092888069126,148.86092888069126,1,148.86092888069126,1.2273356224478354E-6,0.25344652463415551,608271.65912197321,1.6440022891145019E-6,0,6.6E-4,0.14441747228809723,3.5455890713541665E-3,0,3.5476016053511989E-3,4.2572365474370023E-2,1.8124063020833329E-3,1.8124063020833329E-3,6.3739231806557398E-2,1.2188069013870174E-5,1.2188069013870174E-5,7.2704770776207808E-2,9.7790698331987041E-3,1.8248149773659194E-3,30,36.271326524588233,0.14026075360527671,0.1121166322093621,0.25420220079200473,0.26449153162806954,0.12345233052620283,1.1430358434263124E-2,4.9270004388879841E-3,2.6267846636186948E-3,9.6099240063692785E-4,8.5147775031436061E-3,1.9990213491252583E-2,3.2037924040564728E-2,9.0103536620348298E-2,6.7518154162539033E-3,0.38133709715592434,0.38670929313237273,1.6560000000000001,0.81068804335864297,5.0370999293231486E-3,5.6177528670817763E-3,3.173110741403825E-2,0.12444365022797776,1.2859317145371561E-3,4.7044990878917641E-4,4.1683745855420782E-3,1.7357286635325466E-3,0,5.9666194572309879E-6,8.8725611039058611E-4,4.4109818721282605E-2,0.21949313676195234,0.81068804335864297,81.0688043358643,138,68.802277733330541,0.68802277733330541,608.27165912197324,null,5.4886239851309401E-2,null,0.38133709715592434,9.0103536620348298E-2,3.5476016053511989E-3,null,null,{"$f":"IF(OR(MODE=1,MODE=2,MODE=3), BR52, IF(MODE_ILIM=4,#REF!,#REF!))","v":81.0688043358643},{"$f":"IF(OR(MODE=1,MODE=2,MODE=3), BZ52, IF(MODE_ILIM=4,#REF!,#REF!))","v":0.38133709715592434},{"$f":"IF(OR(MODE=1,MODE=2,MODE=3), CA52, IF(MODE_ILIM=4,#REF!,#REF!))","v":9.0103536620348298E-2},{"$f":"IF(OR(MODE=1,MODE=2,MODE=3), CB52, IF(MODE_ILIM=4,#REF!,#REF!))","v":3.5476016053511989E-3},{"$f":"(IF(OR(MODE=1,MODE=2,MODE=3), S52, IF(MODE_ILIM=4,#REF!,#REF!)))/1000","v":608.27165912197324},{"$f":"IF(OR(MODE=1,MODE=2,MODE=3), P52, IF(MODE_ILIM=4,#REF!,#REF!))","v":148.86092888069126}]
["Csw",160,"pF",{"$f":"B53/1000000000000","v":1.5999999999999999E-10},"Effective SW node capacitance (CossHS + CossLS)",null,null,47,0.14099999999999999,0.14881324999999998,0.21537374423958333,6.6906364507008237E-2,148.83567507569967,148.83567507569967,1,148.83567507569967,1.2268481877570133E-6,0.25352169196716895,608452.06072120543,1.6435148544236799E-6,0,6.6E-4,0.14728681645715386,3.6878790713541663E-3,0,3.6900564284541039E-3,4.2572365474370023E-2,1.8124063020833329E-3,1.8124063020833329E-3,6.4976400491447192E-2,1.2665797862474815E-5,1.2665797862474815E-5,7.4160293083532322E-2,1.0174535779935512E-2,1.8253561821636162E-3,30,35.764596309447583,0.14161660868079984,0.11214988383213259,0.25559184869509605,0.26630091229931896,0.12592379999173739,1.1892602553269311E-2,4.9284616918417647E-3,2.7502276525422776E-3,9.8243438574514516E-4,8.6611237301291878E-3,2.0602062278072077E-2,3.2037924040564728E-2,9.0120757757011005E-2,6.7538178740053807E-3,0.38377755020840743,0.38929267873680734,1.6919999999999997,0.81295630224717863,5.145390513131739E-3,5.7372702407189396E-3,3.1152106694481228E-2,0.12280437600454236,1.321403606825478E-3,4.7203086609683901E-4,4.1614155561176805E-3,1.771917572684895E-3,0,6.085543850642876E-6,8.7080799380091572E-4,4.3300377057832989E-2,0.21674318165008369,0.81295630224717863,81.295630224717868,141,69.1417728033842,0.69141772803384205,608.45206072120538,null,5.3884725093156713E-2,null,0.38377755020840743,9.0120757757011005E-2,3.6900564284541039E-3,null,null,{"$f":"IF(OR(MODE=1,MODE=2,MODE=3), BR53, IF(MODE_ILIM=4,#REF!,#REF!))","v":81.295630224717868},{"$f":"IF(OR(MODE=1,MODE=2,MODE=3), BZ53, IF(MODE_ILIM=4,#REF!,#REF!))","v":0.38377755020840743},{"$f":"IF(OR(MODE=1,MODE=2,MODE=3), CA53, IF(MODE_ILIM=4,#REF!,#REF!))","v":9.0120757757011005E-2},{"$f":"IF(OR(MODE=1,MODE=2,MODE=3), CB53, IF(MODE_ILIM=4,#REF!,#REF!))","v":3.6900564284541039E-3},{"$f":"(IF(OR(MODE=1,MODE=2,MODE=3), S53, IF(MODE_ILIM=4,#REF!,#REF!)))/1000","v":608.45206072120538},{"$f":"IF(OR(MODE=1,MODE=2,MODE=3), P53, IF(MODE_ILIM=4,#REF!,#REF!))","v":148.83567507569967}]
["ThetaJA",41.1,"°C/W",null,"Thermal resistance",null,null,48,0.14399999999999999,0.14878799999999998,0.21837385049999997,6.9918989954187494E-2,148.8104212707081,148.8104212707081,1,148.8104212707081,1.2263609748377907E-6,0.25359686966991074,608632.48720778583,1.643027641504457E-6,0,6.5999999999999989E-4,0.15016126764942858,3.8332290713541657E-3,0,3.8355814973543585E-3,4.2572365474370023E-2,1.8124063020833329E-3,1.8124063020833329E-3,6.6216649251593609E-2,1.3153933914325717E-5,1.3153933914325717E-5,7.5618815477721021E-2,1.0578679720369199E-2,1.8258974616233575E-3,30,35.271829611343939,0.14297324893749377,0.11218314004213908,0.2569822864412562,0.26812052348820037,0.12840036358948931,1.236499002743479E-2,4.9299231463830655E-3,2.8737434968997698E-3,1.0039042952183197E-3,8.8075709385011559E-3,2.1224334870504374E-2,3.2037924040564721E-2,9.0137981269419964E-2,6.755820608006423E-3,0.38623866023613113,0.39189980196948315,1.7279999999999998,0.81513286542817232,5.2541337267904076E-3,5.857240950948475E-3,3.0593841169572079E-2,0.1212237890689494,1.3556034555170635E-3,4.7356214396814753E-4,4.1547109586587642E-3,1.8082123823932254E-3,0,6.2049790759474177E-6,8.5494904070443573E-4,4.2519925321790067E-2,0.214102173198368,0.81513286542817232,81.513286542817227,144,69.449289175978407,0.69449289175978413,608.63248720778586,null,5.2919076617638186E-2,null,0.38623866023613113,9.0137981269419964E-2,3.8355814973543585E-3,null,null,{"$f":"IF(OR(MODE=1,MODE=2,MODE=3), BR54, IF(MODE_ILIM=4,#REF!,#REF!))","v":81.513286542817227},{"$f":"IF(OR(MODE=1,MODE=2,MODE=3), BZ54, IF(MODE_ILIM=4,#REF!,#REF!))","v":0.38623866023613113},{"$f":"IF(OR(MODE=1,MODE=2,MODE=3), CA54, IF(MODE_ILIM=4,#REF!,#REF!))","v":9.0137981269419964E-2},{"$f":"IF(OR(MODE=1,MODE=2,MODE=3), CB54, IF(MODE_ILIM=4,#REF!,#REF!))","v":3.8355814973543585E-3},{"$f":"(IF(OR(MODE=1,MODE=2,MODE=3), S54, IF(MODE_ILIM=4,#REF!,#REF!)))/1000","v":608.63248720778586},{"$f":"IF(OR(MODE=1,MODE=2,MODE=3), P54, IF(MODE_ILIM=4,#REF!,#REF!))","v":148.8104212707081}]
["Inductor",null,"Units","Std Units","Description",null,null,49,0.14699999999999999,0.14876275,0.22137395676041666,7.2931615401366751E-2,148.78516746571657,148.78516746571657,1,148.78516746571657,1.2258739835388505E-6,0.25367205774452689,608812.9385868645,1.6425406502055171E-6,0,6.6E-4,0.15304053810047627,3.981639071354166E-3,0,3.9841772402769001E-3,4.2572365474370023E-2,1.8124063020833329E-3,1.8124063020833329E-3,6.7459822917709952E-2,1.3652483124266356E-5,1.3652483124266356E-5,7.708019416114692E-2,1.09915092140522E-2,1.8264388157605935E-3,30,34.792457104026283,0.1443306745378494,0.11221640084033087,0.25837351419394083,0.26995038515611253,0.1308817771518202,1.2847529692814042E-2,4.931384802553603E-3,2.997332211768395E-3,1.0254021453033823E-3,8.9541191596253806E-3,2.1857046863515344E-2,3.2037924040564728E-2,9.0155207158066825E-2,6.7578236183141963E-3,0.38872046279600886,0.39453069882149339,1.7639999999999998,0.81722256763042678,5.3633107782494784E-3,5.977643825466397E-3,3.0055216157563368E-2,0.11969879063337237,1.3885983708292256E-3,4.7504635716472679E-4,4.1482473075384659E-3,1.8446061821256689E-3,0,6.3248964361360678E-6,8.3964814726650132E-4,4.1766933037963951E-2,0.2115643656939763,0.81722256763042678,81.722256763042679,147,69.727575757335345,0.69727575757335347,608.81293858686445,null,5.1987400921190689E-2,null,0.38872046279600886,9.0155207158066825E-2,3.9841772402769001E-3,null,null,{"$f":"IF(OR(MODE=1,MODE=2,MODE=3), BR55, IF(MODE_ILIM=4,#REF!,#REF!))","v":81.722256763042679},{"$f":"IF(OR(MODE=1,MODE=2,MODE=3), BZ55, IF(MODE_ILIM=4,#REF!,#REF!))","v":0.38872046279600886},{"$f":"IF(OR(MODE=1,MODE=2,MODE=3), CA55, IF(MODE_ILIM=4,#REF!,#REF!))","v":9.0155207158066825E-2},{"$f":"IF(OR(MODE=1,MODE=2,MODE=3), CB55, IF(MODE_ILIM=4,#REF!,#REF!))","v":3.9841772402769001E-3},{"$f":"(IF(OR(MODE=1,MODE=2,MODE=3), S55, IF(MODE_ILIM=4,#REF!,#REF!)))/1000","v":608.81293858686445},{"$f":"IF(OR(MODE=1,MODE=2,MODE=3), P55, IF(MODE_ILIM=4,#REF!,#REF!))","v":148.78516746571657}]
["Ltc",4000,"ppm",{"$f":"Ltc","v":4.0000000000000001E-3},"Inductor DCR Temp Co",null,null,50,0.15,0.14873749999999999,0.22437406302083335,7.5944240848546007E-2,148.75991366072498,148.75991366072498,1,148.75991366072498,1.225387213709013E-6,0.25374725619316396,608993.41486359353,1.64205388037568E-6,0,6.6E-4,0.15592436083589803,4.1331090713541668E-3,0,4.1358440945133247E-3,4.2572365474370023E-2,1.8124063020833329E-3,1.8124063020833329E-3,6.8705777159071224E-2,1.416145144509586E-5,1.416145144509586E-5,7.8544295722904237E-2,1.1413031822623012E-2,1.8269802445907805E-3,30,34.325939996647861,0.14568888564440263,0.11224966622765756,0.25976553211665099,0.27179051738968368,0.1333678141476915,1.3340230387899884E-2,4.9328466603951087E-3,3.1209938122295387E-3,1.0469279522517497E-3,9.1007684248763966E-3,2.2500213990594115E-2,3.2037924040564728E-2,9.0172435423443387E-2,6.7598269049858892E-3,0.39122299370870706,0.39718540555674881,1.7999999999999998,0.81922990906809456,5.4729042176509734E-3,6.098459206869895E-3,2.9535212697000799E-2,0.11822649625274956,1.4204508205527173E-3,4.764859395133597E-4,4.1420120495340431E-3,1.8810925381633284E-3,0,6.4452692109100664E-6,8.2487636113898362E-4,4.1039975595775643E-2,0.2091244109481602,0.81922990906809456,81.92299090680946,150,69.979193442852676,0.69979193442852672,608.99341486359356,null,5.1087935475893263E-2,null,0.39122299370870706,9.0172435423443387E-2,4.1358440945133247E-3,null,null,{"$f":"IF(OR(MODE=1,MODE=2,MODE=3), BR56, IF(MODE_ILIM=4,#REF!,#REF!))","v":81.92299090680946},{"$f":"IF(OR(MODE=1,MODE=2,MODE=3), BZ56, IF(MODE_ILIM=4,#REF!,#REF!))","v":0.39122299370870706},{"$f":"IF(OR(MODE=1,MODE=2,MODE=3), CA56, IF(MODE_ILIM=4,#REF!,#REF!))","v":9.0172435423443387E-2},{"$f":"IF(OR(MODE=1,MODE=2,MODE=3), CB56, IF(MODE_ILIM=4,#REF!,#REF!))","v":4.1358440945133247E-3},{"$f":"(IF(OR(MODE=1,MODE=2,MODE=3), S56, IF(MODE_ILIM=4,#REF!,#REF!)))/1000","v":608.99341486359356},{"$f":"IF(OR(MODE=1,MODE=2,MODE=3), P56, IF(MODE_ILIM=4,#REF!,#REF!))","v":148.75991366072498}]
["ThetaCA",20,"°C/W",{"$f":"ThetaCa","v":40},"Inductor Core-to-Ambient thermal resistance",null,null,51,0.153,0.14871224999999999,0.22737416928124998,7.8956866295725264E-2,148.73465985573341,148.73465985573341,1,148.73465985573341,1.2249006651972364E-6,0.25382246501796923,609173.91604312614,1.6415673318639034E-6,0,6.6E-4,0.15881248786566921,4.2876390713541658E-3,0,4.2905825064251122E-3,4.2572365474370023E-2,1.8124063020833329E-3,1.8124063020833329E-3,6.9954377579407617E-2,1.468084482756698E-5,1.468084482756698E-5,8.0010996236858187E-2,1.184325510980689E-2,1.8275217481293782E-3,30,33.871768013672202,0.14704788241973418,0.112282936205069,0.26115834037293256,0.27364094040132492,0.1358582641511574,1.3843100953624243E-2,4.9343087199493225E-3,3.244728313368749E-3,1.0684817323193215E-3,9.2475187656373917E-3,2.3153852124320296E-2,3.2037924040564728E-2,9.0189666066041549E-2,6.7618304680787007E-3,0.3937462890597655,0.39986395871310149,1.8359999999999999,0.82115908387232484,5.5828978233438574E-3,6.2196688239864947E-3,2.9032881110941072E-2,0.11680421760689221,1.4512190246298887E-3,4.7788315928412237E-4,4.1359934845767608E-3,1.9176654530546691E-3,0,6.5660724886038454E-6,8.10606698596502E-4,4.0337725251384307E-2,0.20677732450917852,0.82115908387232484,82.11590838723248,153,70.206518151218702,0.702065181512187,609.17391604312616,null,5.0219037597303465E-2,null,0.3937462890597655,9.0189666066041549E-2,4.2905825064251122E-3,null,null,{"$f":"IF(OR(MODE=1,MODE=2,MODE=3), BR57, IF(MODE_ILIM=4,#REF!,#REF!))","v":82.11590838723248},{"$f":"IF(OR(MODE=1,MODE=2,MODE=3), BZ57, IF(MODE_ILIM=4,#REF!,#REF!))","v":0.3937462890597655},{"$f":"IF(OR(MODE=1,MODE=2,MODE=3), CA57, IF(MODE_ILIM=4,#REF!,#REF!))","v":9.0189666066041549E-2},{"$f":"IF(OR(MODE=1,MODE=2,MODE=3), CB57, IF(MODE_ILIM=4,#REF!,#REF!))","v":4.2905825064251122E-3},{"$f":"(IF(OR(MODE=1,MODE=2,MODE=3), S57, IF(MODE_ILIM=4,#REF!,#REF!)))/1000","v":609.17391604312616},{"$f":"IF(OR(MODE=1,MODE=2,MODE=3), P57, IF(MODE_ILIM=4,#REF!,#REF!))","v":148.73465985573341}]
[null,null,null,null,null,null,null,52,0.156,0.14868699999999999,0.23037427554166667,8.1969491742904507E-2,148.70940605074185,148.70940605074185,1,148.70940605074185,1.2244143378526158E-6,0.25389768422109044,609354.4421306171,1.6410810045192824E-6,0,6.6E-4,0.16170468855937151,4.4452290713541667E-3,0,4.4483929314469151E-3,4.2572365474370023E-2,1.8124063020833329E-3,1.8124063020833329E-3,7.1205498899041444E-2,1.5210669220384178E-5,1.5210669220384178E-5,8.1480180450040268E-2,1.228218664141658E-2,1.828063326391851E-3,30,33.429457533054034,0.14840766502646968,0.11231621077351535,0.26255193912637687,0.27550167452978941,0.13835293146326433,1.4356150233359037E-2,4.9357709812579992E-3,3.3685357302757368E-3,1.0900635017664852E-3,9.3943702133002203E-3,2.3817977276936426E-2,3.2037924040564728E-2,9.0206899086353445E-2,6.7638343076498499E-3,0.39629038520072912,0.40256639510347975,1.8719999999999999,0.82301400567154448,5.693276499331823E-3,6.3412556761087702E-3,2.8547335216602677E-2,0.11542944610963192,1.4809573101613011E-3,4.7924013302627443E-4,4.1301806944496026E-3,1.9543193291361072E-3,0,6.6872830149643444E-6,7.9681398001172818E-4,3.9658943032194735E-2,0.20451845526366991,0.82301400567154448,82.301400567154445,156,70.411746141009829,0.70411746141009823,609.35444213061714,null,4.9379174428718142E-2,null,0.39629038520072912,9.0206899086353445E-2,4.4483929314469151E-3,null,null,{"$f":"IF(OR(MODE=1,MODE=2,MODE=3), BR58, IF(MODE_ILIM=4,#REF!,#REF!))","v":82.301400567154445},{"$f":"IF(OR(MODE=1,MODE=2,MODE=3), BZ58, IF(MODE_ILIM=4,#REF!,#REF!))","v":0.39629038520072912},{"$f":"IF(OR(MODE=1,MODE=2,MODE=3), CA58, IF(MODE_ILIM=4,#REF!,#REF!))","v":9.0206899086353445E-2},{"$f":"IF(OR(MODE=1,MODE=2,MODE=3), CB58, IF(MODE_ILIM=4,#REF!,#REF!))","v":4.4483929314469151E-3},{"$f":"(IF(OR(MODE=1,MODE=2,MODE=3), S58, IF(MODE_ILIM=4,#REF!,#REF!)))/1000","v":609.35444213061714},{"$f":"IF(OR(MODE=1,MODE=2,MODE=3), P58, IF(MODE_ILIM=4,#REF!,#REF!))","v":148.70940605074185}]
[null,null,null,null,null,null,null,53,0.159,0.14866175000000001,0.23337438180208331,8.4982117190083778E-2,148.68415224575031,148.68415224575031,1,148.68415224575031,1.2239282315243844E-6,0.25397291380467579,609534.99313122185,1.6405948981910512E-6,0,6.5999999999999989E-4,0.16460074818202783,4.6058790713541676E-3,0,4.6092758340899008E-3,4.2572365474370023E-2,1.8124063020833329E-3,1.8124063020833329E-3,7.2459024214152845E-2,1.5750930570201564E-5,1.5750930570201564E-5,8.2951741051252623E-2,1.2729833985353029E-2,1.8286049793936655E-3,30,32.998549868413988,0.1497682336272794,0.11234948993394681,0.26394632854061983,0.27737274024073416,0.14085163387014482,1.4879387072916996E-2,4.9372334443628981E-3,3.4924160780443747E-3,1.1116732768581142E-3,9.5413227992653879E-3,2.449260560092556E-2,3.2037924040564721E-2,9.0224134484871168E-2,6.7658384237565634E-3,0.3988553187502874,0.40529275181703084,1.9079999999999999,0.8247983306485166,5.804026182837531E-3,6.4632039286494688E-3,2.8077747106173608E-2,0.1140998381347527,1.5097164313946749E-3,4.8055883803938096E-4,4.1245634785181985E-3,1.9910489356508685E-3,0,6.8088790568464032E-6,7.8347468155932074E-4,3.9002471439899891E-2,0.20234345803653248,0.8247983306485166,82.479833064851661,159,70.596901007914624,0.70596901007914625,609.53499313122188,null,4.8566913913381367E-2,null,0.3988553187502874,9.0224134484871168E-2,4.6092758340899008E-3,null,null,{"$f":"IF(OR(MODE=1,MODE=2,MODE=3), BR59, IF(MODE_ILIM=4,#REF!,#REF!))","v":82.479833064851661},{"$f":"IF(OR(MODE=1,MODE=2,MODE=3), BZ59, IF(MODE_ILIM=4,#REF!,#REF!))","v":0.3988553187502874},{"$f":"IF(OR(MODE=1,MODE=2,MODE=3), CA59, IF(MODE_ILIM=4,#REF!,#REF!))","v":9.0224134484871168E-2},{"$f":"IF(OR(MODE=1,MODE=2,MODE=3), CB59, IF(MODE_ILIM=4,#REF!,#REF!))","v":4.6092758340899008E-3},{"$f":"(IF(OR(MODE=1,MODE=2,MODE=3), S59, IF(MODE_ILIM=4,#REF!,#REF!)))/1000","v":609.53499313122188},{"$f":"IF(OR(MODE=1,MODE=2,MODE=3), P59, IF(MODE_ILIM=4,#REF!,#REF!))","v":148.68415224575031}]
[null,null,null,null,null,null,null,54,0.16200000000000001,0.14863649999999998,0.2363744880625,8.7994742637263021E-2,148.65889844075869,148.65889844075869,1,148.65889844075869,1.223442346061911E-6,0.25404815377087436,609715.56905009842,1.640109012728578E-6,0,6.6E-4,0.16750046657273326,4.7695890713541668E-3,0,4.7732316879451854E-3,4.2572365474370023E-2,1.8124063020833329E-3,1.8124063020833329E-3,7.3714844325099602E-2,1.6301634821621006E-5,1.6301634821621006E-5,8.4425578010990224E-2,1.3186204711606123E-2,1.8291467071502952E-3,30,32.578609682379771,0.15112958838487886,0.11238277368731414,0.26534150877934326,0.27925415812728799,0.14335420152220874,1.5412820320552524E-2,4.9386961093057973E-3,3.6163693717727063E-3,1.1333110738635736E-3,9.6883765549420769E-3,2.5177753389594132E-2,3.2037924040564728E-2,9.024137226208713E-2,6.7678428164560924E-3,0.4014411265954253,0.40804306622027542,1.944,0.82651547835984174,5.9151337608381056E-3,6.5854988189240201E-3,2.7623342434110749E-2,0.11281320167565898,1.5375438586608017E-3,4.8184112363418595E-4,4.1191322956986758E-3,2.0278493790587254E-3,0,6.9308402791355658E-6,7.7056680131110989E-4,3.836722786164995E-2,0.20024826884982447,0.82651547835984174,82.651547835984175,162,70.763841860106652,0.70763841860106647,609.71556905009845,null,4.778091664278615E-2,null,0.4014411265954253,9.024137226208713E-2,4.7732316879451854E-3,null,null,{"$f":"IF(OR(MODE=1,MODE=2,MODE=3), BR60, IF(MODE_ILIM=4,#REF!,#REF!))","v":82.651547835984175},{"$f":"IF(OR(MODE=1,MODE=2,MODE=3), BZ60, IF(MODE_ILIM=4,#REF!,#REF!))","v":0.4014411265954253},{"$f":"IF(OR(MODE=1,MODE=2,MODE=3), CA60, IF(MODE_ILIM=4,#REF!,#REF!))","v":9.024137226208713E-2},{"$f":"IF(OR(MODE=1,MODE=2,MODE=3), CB60, IF(MODE_ILIM=4,#REF!,#REF!))","v":4.7732316879451854E-3},{"$f":"(IF(OR(MODE=1,MODE=2,MODE=3), S60, IF(MODE_ILIM=4,#REF!,#REF!)))/1000","v":609.71556905009845},{"$f":"IF(OR(MODE=1,MODE=2,MODE=3), P60, IF(MODE_ILIM=4,#REF!,#REF!))","v":148.65889844075869}]
[null,null,null,null,null,null,null,55,0.16500000000000001,0.14861124999999997,0.23937459432291669,9.1007368084442292E-2,148.63364463576713,148.63364463576713,1,148.63364463576713,1.2229566813147022E-6,0.25412340412183565,609896.16989240563,1.639623347981369E-6,0,6.5999999999999989E-4,0.1704036569504403,4.9363590713541678E-3,0,4.9402609756873184E-3,4.2572365474370023E-2,1.8124063020833329E-3,1.8124063020833329E-3,7.4972857126629627E-2,1.6862787917190055E-5,1.6862787917190055E-5,8.5901597984870223E-2,1.3651306392255381E-2,1.8296885096772168E-3,30,32.169223519555999,0.1524917294620283,0.11241606203456821,0.26673748000627373,0.28114594891062167,0.14586047592116941,1.5956458826962533E-2,4.9401589761284862E-3,3.7403956265629414E-3,1.1549769090567184E-3,9.8355315117481471E-3,2.5873437077660055E-2,3.2037924040564721E-2,9.0258612418493769E-2,6.7698474858057028E-3,0.40404784589258119,0.41081737595826906,1.98,0.8281686505672109,6.02658699457245E-3,6.7081265709321332E-3,2.7183396154499564E-2,0.11156748427903744,1.5644840397162265E-3,4.8308872131807619E-4,4.1138782119675473E-3,2.0647160761811069E-3,0,7.0531476334244234E-6,7.5806973811912257E-4,3.7752198610450954E-2,0.19822908254442806,0.8281686505672109,82.816865056721085,165,70.914272258910415,0.70914272258910416,609.89616989240562,null,4.7019928483458699E-2,null,0.40404784589258119,9.0258612418493769E-2,4.9402609756873184E-3,null,null,{"$f":"IF(OR(MODE=1,MODE=2,MODE=3), BR61, IF(MODE_ILIM=4,#REF!,#REF!))","v":82.816865056721085},{"$f":"IF(OR(MODE=1,MODE=2,MODE=3), BZ61, IF(MODE_ILIM=4,#REF!,#REF!))","v":0.40404784589258119},{"$f":"IF(OR(MODE=1,MODE=2,MODE=3), CA61, IF(MODE_ILIM=4,#REF!,#REF!))","v":9.0258612418493769E-2},{"$f":"IF(OR(MODE=1,MODE=2,MODE=3), CB61, IF(MODE_ILIM=4,#REF!,#REF!))","v":4.9402609756873184E-3},{"$f":"(IF(OR(MODE=1,MODE=2,MODE=3), S61, IF(MODE_ILIM=4,#REF!,#REF!)))/1000","v":609.89616989240562},{"$f":"IF(OR(MODE=1,MODE=2,MODE=3), P61, IF(MODE_ILIM=4,#REF!,#REF!))","v":148.63364463576713}]
[null,null,null,null,null,null,null,56,0.16800000000000001,0.148586,0.24237470058333332,9.4019993531621535E-2,148.60839083077556,148.60839083077556,1,148.60839083077556,1.2224712371324013E-6,0.25419866485970988,610076.7956633037,1.6391379037990681E-6,0,6.6E-4,0.1733101448331382,5.1061890713541679E-3,0,5.1103641890778333E-3,4.2572365474370023E-2,1.8124063020833329E-3,1.8124063020833329E-3,7.6232967053631182E-2,1.7434395797400052E-5,1.7434395797400052E-5,8.737971377369784E-2,1.4125146601470717E-2,1.830230386989911E-3,30,31.769998448730547,0.15385465702153292,0.11244935497666014,0.26813424238518296,0.28304813344052376,0.14837030900323805,1.6510311445287258E-2,4.9416220448727614E-3,3.8644948575214588E-3,1.1766707987158967E-3,9.9827877011101178E-3,2.6579673241846069E-2,3.2037924040564728E-2,9.0275854954583706E-2,6.7718524318626724E-3,0.40667551406881625,0.41361571895577481,2.016,0.8297608482984532,6.1383744511459793E-3,6.8310743181514855E-3,2.6757228659115777E-2,0.11036076211279389,1.590578636518857E-3,4.843032540230758E-4,4.1087928528058017E-3,2.1016447298705977E-3,0,7.1757832571535981E-6,7.4596418188399246E-4,3.7156433525785459E-2,0.19628233250535204,0.8297608482984532,82.97608482984532,168,71.049749591014816,0.71049749591014821,610.07679566330364,null,4.6282773896848914E-2,null,0.40667551406881625,9.0275854954583706E-2,5.1103641890778333E-3,null,null,{"$f":"IF(OR(MODE=1,MODE=2,MODE=3), BR62, IF(MODE_ILIM=4,#REF!,#REF!))","v":82.97608482984532},{"$f":"IF(OR(MODE=1,MODE=2,MODE=3), BZ62, IF(MODE_ILIM=4,#REF!,#REF!))","v":0.40667551406881625},{"$f":"IF(OR(MODE=1,MODE=2,MODE=3), CA62, IF(MODE_ILIM=4,#REF!,#REF!))","v":9.0275854954583706E-2},{"$f":"IF(OR(MODE=1,MODE=2,MODE=3), CB62, IF(MODE_ILIM=4,#REF!,#REF!))","v":5.1103641890778333E-3},{"$f":"(IF(OR(MODE=1,MODE=2,MODE=3), S62, IF(MODE_ILIM=4,#REF!,#REF!)))/1000","v":610.07679566330364},{"$f":"IF(OR(MODE=1,MODE=2,MODE=3), P62, IF(MODE_ILIM=4,#REF!,#REF!))","v":148.60839083077556}]
[null,1500,null,null,null,"Eff (%)","Iout (mA)",57,0.17099999999999999,0.14856074999999999,0.24537480684374999,9.7032618978800778E-2,148.583137025784,148.583137025784,1,148.583137025784,1.2219860133647875E-6,0.25427393598664771,610257.44636795449,1.6386526800314541E-6,0,6.6E-4,0.17621976705830514,5.2790790713541655E-3,0,5.2835418289688746E-3,4.2572365474370023E-2,1.8124063020833329E-3,1.8124063020833329E-3,7.7495084576773968E-2,1.8016464400684051E-5,1.8016464400684051E-5,8.8859843834114965E-2,1.4607732915513105E-2,1.8307723391038633E-3,30,31.380560804944079,0.15521837122624288,0.11248265251454137,0.26953179607988809,0.28496073269598055,0.15088356230820796,1.7074387031111155E-2,4.9430853155804314E-3,3.988667079758805E-3,1.1983927591239503E-3,1.0130145154463187E-2,2.729647860147854E-2,3.2037924040564728E-2,9.0293099870849658E-2,6.7738576546842949E-3,0.40932416882299305,0.41643813341844593,2.0519999999999996,0.83129488732952905,6.2504854414663878E-3,6.9543300334784395E-3,2.6344202272921877E-2,0.10919123004578762,1.6158667400892291E-3,4.8548624447976015E-4,4.1038683600444692E-3,2.1386313069322789E-3,0,7.2987303820872914E-6,7.3423201397938246E-4,3.6579041073962912E-2,0.19440467226352443,0.83129488732952905,83.129488732952908,170.99999999999997,71.171694607053283,0.71171694607053282,610.25744636795446,null,4.5568349877486473E-2,null,0.40932416882299305,9.0293099870849658E-2,5.2835418289688746E-3,null,null,{"$f":"IF(OR(MODE=1,MODE=2,MODE=3), BR63, IF(MODE_ILIM=4,#REF!,#REF!))","v":83.129488732952908},{"$f":"IF(OR(MODE=1,MODE=2,MODE=3), BZ63, IF(MODE_ILIM=4,#REF!,#REF!))","v":0.40932416882299305},{"$f":"IF(OR(MODE=1,MODE=2,MODE=3), CA63, IF(MODE_ILIM=4,#REF!,#REF!))","v":9.0293099870849658E-2},{"$f":"IF(OR(MODE=1,MODE=2,MODE=3), CB63, IF(MODE_ILIM=4,#REF!,#REF!))","v":5.2835418289688746E-3},{"$f":"(IF(OR(MODE=1,MODE=2,MODE=3), S63, IF(MODE_ILIM=4,#REF!,#REF!)))/1000","v":610.25744636795446},{"$f":"IF(OR(MODE=1,MODE=2,MODE=3), P63, IF(MODE_ILIM=4,#REF!,#REF!))","v":148.583137025784}]
[null,null,null,null,null,{"$f":"BR56","v":81.92299090680946},{"$f":"I56*1000","v":150},58,0.17399999999999999,0.14853549999999999,0.24837491310416665,0.10004524442598003,148.55788322079243,148.55788322079243,1,148.55788322079243,1.2215010098617771E-6,0.25434921750480044,610438.12201152102,1.6381676765284436E-6,0,6.5999999999999989E-4,0.17913237089393791,5.4550290713541666E-3,0,5.459794405306897E-3,4.2572365474370023E-2,1.8124063020833329E-3,1.8124063020833329E-3,7.8759125743020866E-2,1.8608999663414915E-5,1.8608999663414915E-5,9.0341911834491306E-2,1.5099072912735351E-2,1.831314366034563E-3,30,31.000555022957769,0.15658287223905326,0.11251595464916356,0.27093014125425141,0.28688376778576008,0.1534001062253596,1.7648694442463708E-2,4.9445487882933212E-3,4.1129123083897042E-3,1.2201428065682167E-3,1.0277603903251243E-2,2.8023870019091554E-2,3.2037924040564721E-2,9.0310347167784522E-2,6.7758631543278838E-3,0.41199384812696405,0.41928465783401769,2.0880000000000001,0.83277341225538093,6.3629099638373805E-3,7.0778824655557378E-3,2.5943718068989149E-2,0.10805719263176977,1.6403850657877631E-3,4.8663912282790754E-4,4.0990973526435623E-3,2.1756720180574284E-3,0,7.4219732511308775E-6,7.2285621675243948E-4,3.6019183895059377E-2,0.19259295877453161,0.83277341225538093,83.277341225538095,174,71.281400919850697,0.71281400919850701,610.43812201152105,null,4.4875620443656908E-2,null,0.41199384812696405,9.0310347167784522E-2,5.459794405306897E-3,null,null,{"$f":"IF(OR(MODE=1,MODE=2,MODE=3), BR64, IF(MODE_ILIM=4,#REF!,#REF!))","v":83.277341225538095},{"$f":"IF(OR(MODE=1,MODE=2,MODE=3), BZ64, IF(MODE_ILIM=4,#REF!,#REF!))","v":0.41199384812696405},{"$f":"IF(OR(MODE=1,MODE=2,MODE=3), CA64, IF(MODE_ILIM=4,#REF!,#REF!))","v":9.0310347167784522E-2},{"$f":"IF(OR(MODE=1,MODE=2,MODE=3), CB64, IF(MODE_ILIM=4,#REF!,#REF!))","v":5.459794405306897E-3},{"$f":"(IF(OR(MODE=1,MODE=2,MODE=3), S64, IF(MODE_ILIM=4,#REF!,#REF!)))/1000","v":610.43812201152105},{"$f":"IF(OR(MODE=1,MODE=2,MODE=3), P64, IF(MODE_ILIM=4,#REF!,#REF!))","v":148.55788322079243}]
[null,null,null,null,null,{"$f":"BR81","v":85.135819389378781},{"$f":"I81*1000","v":224.99999999999997},59,0.17699999999999999,0.14851024999999998,0.25137501936458334,0.10305786987315929,148.53262941580087,148.53262941580087,1,148.53262941580087,1.2210162264734224E-6,0.25442450941631994,610618.82259916782,1.6376828931400892E-6,0,6.6E-4,0.18204781323070962,5.6340390713541678E-3,0,5.6391224371364042E-3,4.2572365474370023E-2,1.8124063020833329E-3,1.8124063020833329E-3,8.0025011756540324E-2,1.9212007519903254E-5,1.9212007519903254E-5,9.1825846251338647E-2,1.5599174173582794E-2,1.8318564677975036E-3,30,30.629642554464336,0.15794816022290414,0.11254926138147861,0.27232927807218027,0.28881725994900037,0.15591981930817417,1.8233242539820262E-2,4.9460124630532594E-3,4.2372305585330495E-3,1.2419209573405307E-3,1.042516397892684E-2,2.8761864501036412E-2,3.2037924040564728E-2,9.0327596845881292E-2,6.7778689308507631E-3,0.41468459022676885,0.42215533097350849,2.1239999999999997,0.83419890929745444,6.4756386526174789E-3,7.2017210808182058E-3,2.5555212969386717E-2,0.10695705590281356,1.6641681310593757E-3,4.8776323354384241E-4,4.094472890992411E-3,2.2127632995587996E-3,0,7.5454970426166612E-6,7.1182079114959944E-4,3.5476074749667783E-2,0.1908442371986504,0.83419890929745444,83.419890929745449,177,71.3800443047935,0.713800443047935,610.61882259916786,null,4.4203611622722967E-2,null,0.41468459022676885,9.0327596845881292E-2,5.6391224371364042E-3,null,null,{"$f":"IF(OR(MODE=1,MODE=2,MODE=3), BR65, IF(MODE_ILIM=4,#REF!,#REF!))","v":83.419890929745449},{"$f":"IF(OR(MODE=1,MODE=2,MODE=3), BZ65, IF(MODE_ILIM=4,#REF!,#REF!))","v":0.41468459022676885},{"$f":"IF(OR(MODE=1,MODE=2,MODE=3), CA65, IF(MODE_ILIM=4,#REF!,#REF!))","v":9.0327596845881292E-2},{"$f":"IF(OR(MODE=1,MODE=2,MODE=3), CB65, IF(MODE_ILIM=4,#REF!,#REF!))","v":5.6391224371364042E-3},{"$f":"(IF(OR(MODE=1,MODE=2,MODE=3), S65, IF(MODE_ILIM=4,#REF!,#REF!)))/1000","v":610.61882259916786},{"$f":"IF(OR(MODE=1,MODE=2,MODE=3), P65, IF(MODE_ILIM=4,#REF!,#REF!))","v":148.53262941580087}]
[null,null,null,null,null,{"$f":"BR106","v":86.514265083555713},{"$f":"I106*1000","v":300},60,0.18,0.14848500000000001,0.25437512562499998,0.10607049532033853,148.50737561080933,148.50737561080933,1,148.50737561080933,1.2205316630499114E-6,0.25449981172335884,610799.54813606117,1.6371983297165782E-6,0,6.600000000000001E-4,0.18496595984689543,5.8161090713541664E-3,0,5.8215264526037848E-3,4.2572365474370023E-2,1.8124063020833329E-3,1.8124063020833329E-3,8.129266859603744E-2,1.9825493902395515E-5,1.9825493902395515E-5,9.3311580002072958E-2,1.6108044280594036E-2,1.8323986444081836E-3,30,30.26750086211144,0.15931423534078071,0.11258257271243879,0.27372920669762768,0.29076123055580322,0.15844258765076566,1.8828040186102922E-2,4.9474763399020962E-3,4.3616218453119103E-3,1.2637272277372269E-3,1.0572825412951233E-2,2.9510479198096691E-2,3.2037924040564734E-2,9.0344848905633143E-2,6.77987498431028E-3,0.41739643364384332,0.42505019189243282,2.16,0.83557371797826985,6.5886627314214489E-3,7.3258360106663173E-3,2.5178157102524464E-2,0.10588931988869402,1.6872484174548681E-3,4.8885984175498442E-4,4.0899884443679618E-3,2.2499017967215476E-3,0,7.6692878012871007E-6,7.0111068162917488E-4,3.4948972824196713E-2,0.18915572702723277,0.83557371797826985,83.557371797826988,180,71.468691685531624,0.71468691685531627,610.79954813606116,null,4.3551406880042311E-2,null,0.41739643364384332,9.0344848905633143E-2,5.8215264526037848E-3,null,null,{"$f":"IF(OR(MODE=1,MODE=2,MODE=3), BR66, IF(MODE_ILIM=4,#REF!,#REF!))","v":83.557371797826988},{"$f":"IF(OR(MODE=1,MODE=2,MODE=3), BZ66, IF(MODE_ILIM=4,#REF!,#REF!))","v":0.41739643364384332},{"$f":"IF(OR(MODE=1,MODE=2,MODE=3), CA66, IF(MODE_ILIM=4,#REF!,#REF!))","v":9.0344848905633143E-2},{"$f":"IF(OR(MODE=1,MODE=2,MODE=3), CB66, IF(MODE_ILIM=4,#REF!,#REF!))","v":5.8215264526037848E-3},{"$f":"(IF(OR(MODE=1,MODE=2,MODE=3), S66, IF(MODE_ILIM=4,#REF!,#REF!)))/1000","v":610.79954813606116},{"$f":"IF(OR(MODE=1,MODE=2,MODE=3), P66, IF(MODE_ILIM=4,#REF!,#REF!))","v":148.50737561080933}]
[null,null,null,null,null,null,null,61,0.183,0.14845974999999997,0.25737523188541667,0.1090831207675178,148.48212180581774,148.48212180581774,1,148.48212180581774,1.220047319441568E-6,0.25457512442807023,610980.29862736852,1.6367139861082348E-6,0,6.6E-4,0.18788668473865658,6.0012390713541659E-3,0,6.0070069889612146E-3,4.2572365474370023E-2,1.8124063020833329E-3,1.8124063020833329E-3,8.2562026664950341E-2,2.0449464741071913E-5,2.0449464741071913E-5,9.4799050110424249E-2,1.6625690818401647E-2,1.8329408958821054E-3,30,29.913822484054727,0.16068109775571301,0.11261588864299657,0.27512992729459168,0.29271570110783091,0.16096830431974826,1.9433096246681318E-2,4.9489404188816852E-3,4.4860861838535359E-3,1.2855616340591393E-3,1.0720588236794362E-2,3.026973140610863E-2,3.2037924040564728E-2,9.0362103347533335E-2,6.7818813147637906E-3,0.4201294171762367,0.42796927993202233,2.1959999999999997,0.83690004177826749,6.7019739704021267E-3,7.4502180032461045E-3,2.4812051390868062E-2,0.10485257178838592,1.7096565185282027E-3,4.8993013900393062E-4,4.0856378612298743E-3,2.2870843486054978E-3,0,7.7933323752943048E-6,6.9071170761964332E-4,3.4437180358252634E-2,0.18752480941851726,0.83690004177826749,83.690004177826751,183,71.54830972155635,0.71548309721556347,610.98029862736848,null,4.2918142946366374E-2,null,0.4201294171762367,9.0362103347533335E-2,6.0070069889612146E-3,null,null,{"$f":"IF(OR(MODE=1,MODE=2,MODE=3), BR67, IF(MODE_ILIM=4,#REF!,#REF!))","v":83.690004177826751},{"$f":"IF(OR(MODE=1,MODE=2,MODE=3), BZ67, IF(MODE_ILIM=4,#REF!,#REF!))","v":0.4201294171762367},{"$f":"IF(OR(MODE=1,MODE=2,MODE=3), CA67, IF(MODE_ILIM=4,#REF!,#REF!))","v":9.0362103347533335E-2},{"$f":"IF(OR(MODE=1,MODE=2,MODE=3), CB67, IF(MODE_ILIM=4,#REF!,#REF!))","v":6.0070069889612146E-3},{"$f":"(IF(OR(MODE=1,MODE=2,MODE=3), S67, IF(MODE_ILIM=4,#REF!,#REF!)))/1000","v":610.98029862736848},{"$f":"IF(OR(MODE=1,MODE=2,MODE=3), P67, IF(MODE_ILIM=4,#REF!,#REF!))","v":148.48212180581774}]
[null,null,null,null,null,null,null,62,0.186,0.1484345,0.26037533814583336,0.11209574621469705,148.45686800082615,148.45686800082615,1,148.45686800082615,1.219563195498853E-6,0.25465044753260774,611161.07407825859,1.6362298621655196E-6,0,6.6E-4,0.19080986950910933,6.1894290713541663E-3,0,6.1955645925706E-3,4.2572365474370023E-2,1.8124063020833329E-3,1.8124063020833329E-3,8.3833020471340308E-2,2.1083925964044489E-5,2.1083925964044489E-5,9.6288197401210793E-2,1.7152121373732895E-2,1.8334832222347758E-3,30,29.568314163337991,0.1620487476307762,0.11264920917410462,0.2765314400271156,0.29468069323890833,0.16349686883596487,2.0048419589373524E-2,4.9504047000338948E-3,4.6106235892893459E-3,1.3074241926116037E-3,1.0868452481934845E-2,3.1039638566587206E-2,3.2037924040564728E-2,9.037936017207529E-2,6.7838879222686709E-3,0.42288357989983949,0.43091263472045749,2.2320000000000002,0.83817995787695332,6.815564647203667E-3,7.574858379373702E-3,2.4456425345931728E-2,0.10384547972830689,1.7314212750255515E-3,4.9097524851725066E-4,4.0814153420680177E-3,2.3243079741532371E-3,0,7.9176183586127293E-6,6.806105008674429E-4,3.394003956181723E-2,0.1859490156216233,0.83817995787695332,83.817995787695338,186,71.619772941093288,0.71619772941093285,611.16107407825859,null,4.2303006003773791E-2,null,0.42288357989983949,9.037936017207529E-2,6.1955645925706E-3,null,null,{"$f":"IF(OR(MODE=1,MODE=2,MODE=3), BR68, IF(MODE_ILIM=4,#REF!,#REF!))","v":83.817995787695338},{"$f":"IF(OR(MODE=1,MODE=2,MODE=3), BZ68, IF(MODE_ILIM=4,#REF!,#REF!))","v":0.42288357989983949},{"$f":"IF(OR(MODE=1,MODE=2,MODE=3), CA68, IF(MODE_ILIM=4,#REF!,#REF!))","v":9.037936017207529E-2},{"$f":"IF(OR(MODE=1,MODE=2,MODE=3), CB68, IF(MODE_ILIM=4,#REF!,#REF!))","v":6.1955645925706E-3},{"$f":"(IF(OR(MODE=1,MODE=2,MODE=3), S68, IF(MODE_ILIM=4,#REF!,#REF!)))/1000","v":611.16107407825859},{"$f":"IF(OR(MODE=1,MODE=2,MODE=3), P68, IF(MODE_ILIM=4,#REF!,#REF!))","v":148.45686800082615}]
[null,null,null,null,null,null,null,63,0.189,0.14840924999999999,0.26337544440624999,0.11510837166187632,148.43161419583458,148.43161419583458,1,148.43161419583458,1.2190792910723614E-6,0.25472578103912574,611341.87449390173,1.635745957739028E-6,0,6.5999999999999989E-4,0.19373540281033649,6.3806790713541676E-3,0,6.3871998189076176E-3,4.2572365474370023E-2,1.8124063020833329E-3,1.8124063020833329E-3,8.5105588334638979E-2,2.1728883497355115E-5,2.1728883497355115E-5,9.7778966221560265E-2,1.7687343535410495E-2,1.834025623481705E-3,30,29.230696036918982,0.16341718512909037,0.11268253430671597,0.27793374505928803,0.29665622871562963,0.1660281867011216,2.0674019084446868E-2,4.9518691834006048E-3,4.7352340767549449E-3,1.3293149197044594E-3,1.1016418179860009E-2,3.1820218267357737E-2,3.2037924040564721E-2,9.0396619379752588E-2,6.7858948068823099E-3,0.42565896116962226,0.43388029617411056,2.2679999999999998,0.83941542606884201,6.9294275112235099E-3,7.6997489921948499E-3,2.4110835050063308E-2,0.10286678704931711,1.752569898622113E-3,4.9199623002794859E-4,4.077315414550144E-3,2.3615698594750011E-3,0,8.0421340383300604E-6,6.707944480922114E-4,3.3456929793579351E-2,0.18442601638118383,0.83941542606884201,83.941542606884198,189,71.68387138413388,0.71683871384133879,611.34187449390174,null,4.1705228194704104E-2,null,0.42565896116962226,9.0396619379752588E-2,6.3871998189076176E-3,null,null,{"$f":"IF(OR(MODE=1,MODE=2,MODE=3), BR69, IF(MODE_ILIM=4,#REF!,#REF!))","v":83.941542606884198},{"$f":"IF(OR(MODE=1,MODE=2,MODE=3), BZ69, IF(MODE_ILIM=4,#REF!,#REF!))","v":0.42565896116962226},{"$f":"IF(OR(MODE=1,MODE=2,MODE=3), CA69, IF(MODE_ILIM=4,#REF!,#REF!))","v":9.0396619379752588E-2},{"$f":"IF(OR(MODE=1,MODE=2,MODE=3), CB69, IF(MODE_ILIM=4,#REF!,#REF!))","v":6.3871998189076176E-3},{"$f":"(IF(OR(MODE=1,MODE=2,MODE=3), S69, IF(MODE_ILIM=4,#REF!,#REF!)))/1000","v":611.34187449390174},{"$f":"IF(OR(MODE=1,MODE=2,MODE=3), P69, IF(MODE_ILIM=4,#REF!,#REF!))","v":148.43161419583458}]
[null,null,null,null,null,null,null,64,{"$f":"IF(PLOT_TYPE=1, H70/100*Iout, min_I*EXP(H70*rr/100))","v":0.192},{"$f":"IF(I70<Icrit, (Vin-(Rdcr+RdsonTop)*Iripple/2-Vout)/L*OnTime, (Vin-(Rdcr+RdsonTop)*I70-Vout)/L*OnTime)","v":0.14838400000000002},{"$f":"IF(I70<Icrit, (Vin-(Rdcr+RdsonTop)*Iripple/2-Vout)/L*OnTime, I70+((Vin-(Rdcr+RdsonTop)*J70-Vout)/L*OnTime)/2)","v":0.26637555066666668},{"$f":"IF(I70<Icrit, 0, I70-((Vin-(Rdcr+RdsonTop)*K70-Vout)/L*OnTime)/2)","v":0.11812099710905556},148.40636039084305,{"$f":"IF(I70<Icrit, 1000*SQRT((J70*CoutEsr)^2+(((J70/2)-I70)*(OnTime+OffTime)/Cout)^2), 1000*J70*SQRT(CoutEsr^2+(1/(8*Fsw*Cout))^2))","v":148.40636039084305},1,{"$f":"IF(I70<Icrit, 1000*((N70/1000)*O70), 1000*J70*SQRT(CoutEsr^2+(1/(8*Fsw*Cout))^2))","v":148.40636039084305},{"$f":"IF(I70<Icrit, L*J70/(Vout+J70/2*(RdsonBot+Rdcr)), L*J70/(Vout+I70*(RdsonBot+Rdcr)))","v":1.2185956060128245E-6},0.25480112494977902,{"$f":"IF(I70<Icrit,I70/((OnTime+Q70)*J70/2),1/(OnTime+Q70))","v":611522.6998794697},1.6352622726794911E-6,0,{"$f":"S70*(T70*Iq_active+U70*Iq_sleep)","v":6.5999999999999989E-4},0.19666317983314349,{"$f":"W70^2*Rdcr","v":6.5749890713541672E-3},{"$f":"Core_Loss/1000*S70/$S$106","v":0},{"$f":"(Y70+X70*(1+Ltc*(Ta-25)))/(1-X70*Ltc*ThetaCa)","v":6.5819132325658026E-3},4.2572365474370023E-2,1.8124063020833329E-3,1.8124063020833329E-3,8.6379672116714767E-2,2.2384343264973454E-5,2.2384343264973454E-5,9.9271304185980944E-2,1.8231364894353282E-2,1.834568099638409E-3,30,{"$f":"IF(I70<Icrit, Csw*Vin/Iripple*1000000000, Csw*Vin/(I70+Iripple/2)*1000000000)","v":28.900700879627454},{"$f":"IF(I70<Icrit, Vin*(I70+Iripple/2)*AK70/1000000000/2*S70, Vin*(I70-Iripple/2)*AJ70/1000000000/2*S70 + Vin*(I70+Iripple/2)*AK70/1000000000/2*S70)","v":0.16478641041382081},{"$f":"IF(I70<Icrit, Csw*(Vin)^2*S70/2, Csw*Vin^2*S70/2)","v":0.11271586404178385},0.27933684255524305,{"$f":"(AI70+AL70+AM70+AH70*(1+RdsonTopTc*(Ta-25)))/(1-AH70*RdsonTopTc*ThetaJA)","v":0.29864232943796898},{"$f":"IF(I70<Icrit,Iripple*SQRT((OffTime)*S70/3), SQRT(OffTime*S70*(I70^2+Iripple^2/12)))","v":0.16856216896492035},2.1309903604618766E-2,{"$f":"QgBot*S70*Vdd","v":4.9533338690237053E-3},{"$f":"IF(I70<Icrit, Vin*Idss*R70, QrrBot*(I70-Iripple/2)/1*S70*Vin+Vin*Idss*R70)","v":4.8599176613901172E-3},{"$f":"IF(I70<Icrit, dead1*S70*(I70+Iripple/2)*((I70+Iripple/2)*BDserR+VSD), dead1*S70*(I70+Iripple/2)*((I70+Iripple/2)*BDserR+VSD)+dead2*S70*(I70-Iripple/2)*((I70-Iripple/2)*BDserR+VSD))","v":1.3512338316520511E-3},1.1164485362065874E-2,{"$f":"(AR70+AS70+AT70+AQ70*(1+RdsonBotTc*(Ta-25)))/(1-AQ70*RdsonBotTc*ThetaJA)","v":3.2611488243193008E-2},{"$f":"Vin*V70+Vout*Ifb/0.8","v":3.2037924040564721E-2},{"$f":"(Vin-Vdd)*(S70*QgBot+S70*QgTop)+AW70","v":9.0413880971058902E-2},{"$f":"AI70+AR70","v":6.7879019686621148E-3},0.428455600620883,{"$f":"SUM(Z70,AC70,AF70,AZ70)","v":0.4368723044987971},{"$f":"Vout*I70","v":2.3040000000000003},0.84060829693461969,7.0435557508601917E-3,7.824882190215347E-3,{"$f":"Vin*S70*(QgBot+QgTop)/($BB70+$BA70)","v":2.3774861306817548E-2},0.1019153070709448,1.7731280853227542E-3,4.9299408419508294E-4,4.0733329107455222E-3,{"$f":"X70/($BB70+$BA70)","v":2.3988673461956436E-3},{"$f":"Y70/($BB70+$BA70)","v":0},8.1668683463408239E-6,6.6125163843222317E-4,3.2987264974970155E-2,0.18295361222704562,{"$f":"BC70","v":0.84060829693461969},84.060829693461969,{"$f":"I70*1000","v":192},71.741317737155555,0.71741317737155552,{"$f":"S70/1000","v":611.52269987946966},null,{"$f":"AM70/($BB70+$BA70)","v":4.1124084422603319E-2},null,0.428455600620883,9.0413880971058902E-2,6.5819132325658026E-3,null,null,{"$f":"IF(OR(MODE=1,MODE=2,MODE=3), BR70, IF(MODE_ILIM=4,#REF!,#REF!))","v":84.060829693461969},{"$f":"IF(OR(MODE=1,MODE=2,MODE=3), BZ70, IF(MODE_ILIM=4,#REF!,#REF!))","v":0.428455600620883},{"$f":"IF(OR(MODE=1,MODE=2,MODE=3), CA70, IF(MODE_ILIM=4,#REF!,#REF!))","v":9.0413880971058902E-2},{"$f":"IF(OR(MODE=1,MODE=2,MODE=3), CB70, IF(MODE_ILIM=4,#REF!,#REF!))","v":6.5819132325658026E-3},{"$f":"(IF(OR(MODE=1,MODE=2,MODE=3), S70, IF(MODE_ILIM=4,#REF!,#REF!)))/1000","v":611.52269987946966},{"$f":"IF(OR(MODE=1,MODE=2,MODE=3), P70, IF(MODE_ILIM=4,#REF!,#REF!))","v":148.40636039084305}]
[null,null,null,null,null,null,null,65,0.19500000000000001,0.14835874999999998,0.26937565692708332,0.12113362255623482,{"$f":"IF(I71<Icrit, 1000*((((J71/2)-I71)*0.000002/Cout+Vout/306)), 1000*J71*SQRT(CoutEsr^2+(1/(8*Fsw*Cout))^2))","v":148.38110658585146},148.38110658585146,{"$f":"ROUNDUP(M71/N71,0)","v":1},148.38110658585146,1.2181121401711087E-6,0.25487647926672319,611703.55024013564,{"$f":"IF(1/S71-OnTime-Q71>Tsleep, OnTime+Q71+Tsleep, 1/S71)","v":1.6347788068377751E-6},{"$f":"IF(1/S71-OnTime-Q71>Tsleep, 1/S71-OnTime-Q71-Tsleep, 0)","v":0},6.6E-4,{"$f":"IF(I71<Icrit,Iripple*SQRT((OnTime+OffTime)*S71/3), SQRT(I71^2+Iripple^2/12))","v":0.19959310183992665},6.7723590713541669E-3,0,6.7797054072607221E-3,{"$f":"Iripple/SQRT(12)*SQRT((OnTime+Q71)*S71)","v":4.2572365474370023E-2},{"$f":"RCoutEsr*AA71^2","v":1.8124063020833329E-3},1.8124063020833329E-3,{"$f":"SQRT($R71)*SQRT($I71^2*(1-R71)+(Iripple^2)/12)","v":8.7655216974984851E-2},{"$f":"RCinEsr*AD71^2","v":2.3050311188795016E-5},2.3050311188795016E-5,{"$f":"IF(I71<Icrit,Iripple*SQRT((OnTime)*S71/3), SQRT(OnTime*S71*(I71^2+Iripple^2/12)))","v":0.10076516194297001},{"$f":"RdsonTop*AG71^2","v":1.8784193043577001E-2},{"$f":"QgTop*S71*Vdd","v":1.8351106507204069E-3},30,28.578073398762736,0.16615642364817781,0.1127491983802618,{"$f":"AI71+AL71+AM71","v":0.28074073267916},0.30063901743989657,0.17109873182876056,{"$f":"RdsonBot*AP71^2","v":2.1956082025057593E-2},4.9547987569450993E-3,4.9846743583388271E-3,1.37318094477323E-3,{"$f":"AR71+AS71+AT71","v":1.1312654060057156E-2},3.3413466376456216E-2,3.2037924040564728E-2,9.0431144946488073E-2,6.7899094076655057E-3,0.43127353817050634,0.43988870019103921,2.34,0.84176031933911266,{"$f":"(AO71-AN71)/($BB71+$BA71)","v":7.1579429634607769E-3},{"$f":"(AV71-AU71)/($BB71+$BA71)","v":7.9502507833785763E-3},2.3448107943713485E-2,{"$f":"AN71/($BB71+$BA71)","v":0.10098991828696846},{"$f":"AS71/(BA71+BB71)","v":1.7931201195199905E-3},{"$f":"AT71/($BB71+$BA71)","v":4.9396975665927292E-4},{"$f":"AU71/($BB71+$BA71)","v":4.0694629462250517E-3},2.4361979207616325E-3,0,{"$f":"(AF71)/($BB71+$BA71)","v":8.2918108150196655E-6},{"$f":"(AC71)/($BB71+$BA71)","v":6.5197081521960968E-4},{"$f":"AX71/($BB71+$BA71)","v":3.253049121724675E-2},{"$f":"SUM(BD71:BO71)","v":0.18152972456396863},0.84176031933911266,84.176031933911261,195,71.792753953912452,{"$f":"BT71/100","v":0.71792753953912447},611.70355024013566,null,4.055888941615305E-2,null,{"$f":"AZ71","v":0.43127353817050634},{"$f":"AX71","v":9.0431144946488073E-2},{"$f":"Z71","v":6.7797054072607221E-3},null,null,{"$f":"IF(OR(MODE=1,MODE=2,MODE=3), BR71, IF(MODE_ILIM=4,#REF!,#REF!))","v":84.176031933911261},{"$f":"IF(OR(MODE=1,MODE=2,MODE=3), BZ71, IF(MODE_ILIM=4,#REF!,#REF!))","v":0.43127353817050634},{"$f":"IF(OR(MODE=1,MODE=2,MODE=3), CA71, IF(MODE_ILIM=4,#REF!,#REF!))","v":9.0431144946488073E-2},{"$f":"IF(OR(MODE=1,MODE=2,MODE=3), CB71, IF(MODE_ILIM=4,#REF!,#REF!))","v":6.7797054072607221E-3},{"$f":"(IF(OR(MODE=1,MODE=2,MODE=3), S71, IF(MODE_ILIM=4,#REF!,#REF!)))/1000","v":611.70355024013566},{"$f":"IF(OR(MODE=1,MODE=2,MODE=3), P71, IF(MODE_ILIM=4,#REF!,#REF!))","v":148.38110658585146}]
[null,null,null,null,null,null,null,66,0.19800000000000001,0.14833349999999998,0.27237576318750001,0.12414624800341408,148.35585278085989,148.35585278085989,1,148.35585278085989,1.2176288933982151E-6,{"$f":"OnTime*S72","v":0.25495184399211424},611884.4255810742,1.6342955600648816E-6,0,6.6E-4,0.20252507573652043,6.9727890713541674E-3,0,6.9805769258342006E-3,4.2572365474370023E-2,1.8124063020833329E-3,{"$f":"AB72","v":1.8124063020833329E-3},8.8932171135532895E-2,2.3726793188639129E-5,{"$f":"AE72","v":2.3726793188639129E-5},0.10226049296109384,1.9345835578194956E-2,1.8356532767432225E-3,30,28.262569575417459,0.16752722499541675,0.1127825373231036,0.28214541559526357,0.30264631488999855,0.17363779628250503,2.261256322338354E-2,4.9562638472067013E-3,5.1095041827492263E-3,1.3951562753913558E-3,1.1460924305347283E-2,3.4226170697749532E-2,3.2037924040564728E-2,9.0448411306534082E-2,6.7919171239499239E-3,{"$f":"AO72+AV72+AX72+AY72","v":0.4341128140182321},0.44292952403933827,2.3760000000000003,0.84287314731989116,7.2725831277110284E-3,8.0758480119010427E-3,2.3130200252927415E-2,0.10008955995145559,1.8125689695951128E-3,4.949241417686064E-4,4.0657009008598904E-3,2.4735592046170149E-3,0,8.4169515364968081E-6,6.4294133167482493E-4,3.2086084641423568E-2,0.18015238748547058,0.84287314731989116,{"$f":"100*BQ72","v":84.287314731989113},198,71.838757366287027,0.71838757366287032,611.8844255810742,null,4.0008995032090662E-2,null,0.4341128140182321,9.0448411306534082E-2,6.9805769258342006E-3,null,null,{"$f":"IF(OR(MODE=1,MODE=2,MODE=3), BR72, IF(MODE_ILIM=4,#REF!,#REF!))","v":84.287314731989113},{"$f":"IF(OR(MODE=1,MODE=2,MODE=3), BZ72, IF(MODE_ILIM=4,#REF!,#REF!))","v":0.4341128140182321},{"$f":"IF(OR(MODE=1,MODE=2,MODE=3), CA72, IF(MODE_ILIM=4,#REF!,#REF!))","v":9.0448411306534082E-2},{"$f":"IF(OR(MODE=1,MODE=2,MODE=3), CB72, IF(MODE_ILIM=4,#REF!,#REF!))","v":6.9805769258342006E-3},{"$f":"(IF(OR(MODE=1,MODE=2,MODE=3), S72, IF(MODE_ILIM=4,#REF!,#REF!)))/1000","v":611.8844255810742},{"$f":"IF(OR(MODE=1,MODE=2,MODE=3), P72, IF(MODE_ILIM=4,#REF!,#REF!))","v":148.35585278085989}]
[null,null,null,null,null,null,null,67,0.20100000000000001,0.14830825,0.2753758694479167,0.12715887345059332,148.33059897586836,148.33059897586836,1,148.33059897586836,1.2171458655452806E-6,0.25502721912810883,612065.32590746123,1.6338125322119472E-6,0,6.6E-4,0.20545901367933056,7.1762790713541681E-3,0,7.1845283802586162E-3,4.2572365474370023E-2,1.8124063020833329E-3,1.8124063020833329E-3,9.0210485684401778E-2,2.4413795182246975E-5,2.4413795182246975E-5,0.10375725333269621,1.9916300095418806E-2,1.8361959777223836E-3,{"$f":"15*VIN_nom/24","v":30},27.953956048955824,0.16889881461883802,0.11281588087126325,0.28355089146782364,0.30466424409210163,0.17617928777117697,2.327935607966939E-2,4.9577291398504369E-3,5.2344071497736448E-3,1.4171598398342966E-3,1.160929612945838E-2,3.5049619386568309E-2,3.2037924040564728E-2,9.0465680051690978E-2,6.7939251175728205E-3,0.43697346864793374,0.44599481712545791,2.4119999999999999,{"$f":"BB73/(BB73+BA73)","v":0.8439483464235128},7.3874705782404427E-3,8.2016675176080165E-3,2.2820783557017915E-2,9.9213228018732474E-2,1.8314963758535988E-3,4.9585808600578979E-4,4.0620424011597375E-3,2.5109489451670863E-3,0,8.5422811251988634E-6,6.3415311015372407E-4,3.1653549373011264E-2,0.17881974024407524,0.8439483464235128,84.394834642351285,201,71.879846296152991,0.71879846296152994,612.06532590746122,null,3.9473787774301258E-2,null,0.43697346864793374,9.0465680051690978E-2,7.1845283802586162E-3,null,null,{"$f":"IF(OR(MODE=1,MODE=2,MODE=3), BR73, IF(MODE_ILIM=4,#REF!,#REF!))","v":84.394834642351285},{"$f":"IF(OR(MODE=1,MODE=2,MODE=3), BZ73, IF(MODE_ILIM=4,#REF!,#REF!))","v":0.43697346864793374},{"$f":"IF(OR(MODE=1,MODE=2,MODE=3), CA73, IF(MODE_ILIM=4,#REF!,#REF!))","v":9.0465680051690978E-2},{"$f":"IF(OR(MODE=1,MODE=2,MODE=3), CB73, IF(MODE_ILIM=4,#REF!,#REF!))","v":7.1845283802586162E-3},{"$f":"(IF(OR(MODE=1,MODE=2,MODE=3), S73, IF(MODE_ILIM=4,#REF!,#REF!)))/1000","v":612.06532590746122},{"$f":"IF(OR(MODE=1,MODE=2,MODE=3), P73, IF(MODE_ILIM=4,#REF!,#REF!))","v":148.33059897586836}]
[null,null,null,null,null,null,null,68,0.20400000000000001,0.14828299999999997,0.27837597570833333,0.13017149889777258,148.30534517087673,148.30534517087673,1,148.30534517087673,1.2166630564635762E-6,0.25510260467686441,612246.25122447452,1.6333297231302428E-6,0,6.6E-4,0.20839483271444939,7.3828290713541696E-3,0,7.3915603716412769E-3,4.2572365474370023E-2,1.8124063020833329E-3,1.8124063020833329E-3,9.149011437541496E-2,2.5111323085279532E-5,2.5111323085279532E-5,0.10525540159358385,2.0495594194559236E-2,1.8367387536734237E-3,30,27.652009541383503,0.17027119268178739,0.11284922902569514,0.28495716046115593,0.30669282748590387,0.17872313588878744,2.3956469476441485E-2,4.959194634918244E-3,5.3593832745686097E-3,1.439191654434434E-3,1.1757769563921286E-2,3.5883830771961313E-2,3.2037924040564728E-2,9.0482951182453072E-2,6.7959333885916681E-3,0.43985554282890998,0.44908462082571987,2.4480000000000004,0.84498739954039637,7.5025999822376233E-3,8.3277033175384683E-3,2.2519521888140492E-2,9.8359971404610932E-2,1.8499229315024602E-3,4.9677239114411474E-4,4.0584833040086055E-3,2.5483650074570254E-3,0,8.6677906833533792E-6,6.2559660461928971E-4,3.1232415695425505E-2,0.17753002031736786,0.84498739954039637,84.498739954039635,204.00000000000003,71.916485184007442,0.71916485184007439,612.24625122447446,null,3.8952686509215982E-2,null,0.43985554282890998,9.0482951182453072E-2,7.3915603716412769E-3,null,null,{"$f":"IF(OR(MODE=1,MODE=2,MODE=3), BR74, IF(MODE_ILIM=4,#REF!,#REF!))","v":84.498739954039635},{"$f":"IF(OR(MODE=1,MODE=2,MODE=3), BZ74, IF(MODE_ILIM=4,#REF!,#REF!))","v":0.43985554282890998},{"$f":"IF(OR(MODE=1,MODE=2,MODE=3), CA74, IF(MODE_ILIM=4,#REF!,#REF!))","v":9.0482951182453072E-2},{"$f":"IF(OR(MODE=1,MODE=2,MODE=3), CB74, IF(MODE_ILIM=4,#REF!,#REF!))","v":7.3915603716412769E-3},{"$f":"(IF(OR(MODE=1,MODE=2,MODE=3), S74, IF(MODE_ILIM=4,#REF!,#REF!)))/1000","v":612.24625122447446},{"$f":"IF(OR(MODE=1,MODE=2,MODE=3), P74, IF(MODE_ILIM=4,#REF!,#REF!))","v":148.30534517087673}]
[null,null,null,null,null,null,null,69,0.20699999999999999,0.14825774999999999,0.28137608196874997,0.1331841243449518,148.2800913658852,148.2800913658852,1,148.2800913658852,1.2161804660045083E-6,0.25517800064053858,612427.20153729257,1.6328471326711751E-6,0,6.6E-4,0.21133245444579338,7.5924390713541668E-3,0,7.601673510228845E-3,4.2572365474370023E-2,1.8124063020833329E-3,1.8124063020833329E-3,9.2771013453045781E-2,2.5819382811315604E-5,2.5819382811315604E-5,0.10675489855721082,2.108372547702669E-2,1.8372816046118776E-3,30,27.356516318625051,0.17164435934765543,0.11288258178735376,0.28636422273962109,0.30873208764760729,0.18126927409678098,2.4643912298680435E-2,4.9606603324520698E-3,5.4844325722948235E-3,1.4612517355286595E-3,1.1906344640275552E-2,3.6728823333196513E-2,3.2037924040564728E-2,9.050022469931468E-2,6.7979419370639473E-3,0.44275907761718242,0.45219897681230592,2.484,0.84599171228400971,7.6179663178923751E-3,8.45394977961254E-3,2.2226096770411624E-2,9.7528888539602093E-2,1.8678681573034998E-3,4.9766781715695314E-4,4.0550196816707953E-3,2.5858053665003739E-3,0,8.7934717691872859E-6,6.1726276604420652E-4,3.0822238347609041E-2,0.17628155701557269,0.84599171228400971,84.599171228400976,207,71.94908925319227,0.71949089253192267,612.4272015372926,null,3.8445140359630911E-2,null,0.44275907761718242,9.050022469931468E-2,7.601673510228845E-3,null,null,{"$f":"IF(OR(MODE=1,MODE=2,MODE=3), BR75, IF(MODE_ILIM=4,#REF!,#REF!))","v":84.599171228400976},{"$f":"IF(OR(MODE=1,MODE=2,MODE=3), BZ75, IF(MODE_ILIM=4,#REF!,#REF!))","v":0.44275907761718242},{"$f":"IF(OR(MODE=1,MODE=2,MODE=3), CA75, IF(MODE_ILIM=4,#REF!,#REF!))","v":9.050022469931468E-2},{"$f":"IF(OR(MODE=1,MODE=2,MODE=3), CB75, IF(MODE_ILIM=4,#REF!,#REF!))","v":7.601673510228845E-3},{"$f":"(IF(OR(MODE=1,MODE=2,MODE=3), S75, IF(MODE_ILIM=4,#REF!,#REF!)))/1000","v":612.4272015372926},{"$f":"IF(OR(MODE=1,MODE=2,MODE=3), P75, IF(MODE_ILIM=4,#REF!,#REF!))","v":148.2800913658852}]
[null,null,null,null,null,null,null,70,0.21,0.14823249999999999,0.28437618822916666,0.13619674979213109,148.25483756089363,148.25483756089363,1,148.25483756089363,1.2156980940196174E-6,0.25525340702128996,612608.17685109586,1.6323647606862842E-6,0,6.6E-4,0.21427180472960816,7.8051090713541675E-3,0,7.8148684154118585E-3,4.2572365474370023E-2,1.8124063020833329E-3,1.8124063020833329E-3,9.4053141489000555E-2,2.6537980271849876E-5,2.6537980271849876E-5,0.1082557071620361,2.1680701546332153E-2,1.8378245305532876E-3,30,27.06727168597736,0.17301831477987817,0.11291593915719399,0.28777207846762543,0.31078204729055847,0.18381763946484964,2.5341693433822088E-2,4.9621262324938773E-3,5.6095550581171886E-3,1.4833400994583815E-3,1.2055021390069448E-2,3.7584615700432984E-2,3.2037924040564728E-2,9.0517500602770348E-2,6.7999507630471644E-3,0.44568411435680899,0.45533792705457604,2.52,0.8469626179553541,7.7335648545009726E-3,8.580401600176037E-3,2.1940206096144513E-2,9.671912418785461E-2,1.8853505704712827E-3,4.9854508490294685E-4,4.0516478079527822E-3,2.6232681001988924E-3,0,8.9193163675767897E-6,6.0914301048066747E-4,3.0422594952895919E-2,0.1750727655819462,0.8469626179553541,84.696261795535406,210,71.978028730187987,0.71978028730187982,612.60817685109589,null,3.7950626760898609E-2,null,0.44568411435680899,9.0517500602770348E-2,7.8148684154118585E-3,null,null,{"$f":"IF(OR(MODE=1,MODE=2,MODE=3), BR76, IF(MODE_ILIM=4,#REF!,#REF!))","v":84.696261795535406},{"$f":"IF(OR(MODE=1,MODE=2,MODE=3), BZ76, IF(MODE_ILIM=4,#REF!,#REF!))","v":0.44568411435680899},{"$f":"IF(OR(MODE=1,MODE=2,MODE=3), CA76, IF(MODE_ILIM=4,#REF!,#REF!))","v":9.0517500602770348E-2},{"$f":"IF(OR(MODE=1,MODE=2,MODE=3), CB76, IF(MODE_ILIM=4,#REF!,#REF!))","v":7.8148684154118585E-3},{"$f":"(IF(OR(MODE=1,MODE=2,MODE=3), S76, IF(MODE_ILIM=4,#REF!,#REF!)))/1000","v":612.60817685109589},{"$f":"IF(OR(MODE=1,MODE=2,MODE=3), P76, IF(MODE_ILIM=4,#REF!,#REF!))","v":148.25483756089363}]
[null,null,null,null,null,null,null,71,0.21299999999999999,0.14820725000000001,0.28737629448958335,0.13920937523931035,148.22958375590207,148.22958375590207,1,148.22958375590207,1.2152159403605786E-6,0.25532882382127758,612789.17717106617,1.6318826070272453E-6,0,6.6E-4,0.21721281339295648,8.0208390713541675E-3,0,8.0311457157292813E-3,4.2572365474370023E-2,1.8124063020833329E-3,1.8124063020833329E-3,9.5336459231311899E-2,2.7267121376290788E-5,2.7267121376290788E-5,0.10975779233086255,2.228653000808779E-2,1.8383675315131985E-3,30,26.784079515236062,0.17439305914193654,0.11294930113617091,0.28918072780962067,0.31284272926589157,0.18636817243209136,2.6049821771758304E-2,4.9635923350856365E-3,5.7347507472047931E-3,1.5054567625695232E-3,1.2203799844859954E-2,3.8451226655398504E-2,3.2037924040564728E-2,9.053477889331471E-2,6.801959866598835E-3,0.44863069468120365,0.45850151382039256,2.556,0.84790138212957267,7.8493911340860936E-3,8.7070537832552568E-3,2.1661563087620791E-2,9.5929866508221093E-2,1.902387748326895E-3,4.9940487860681171E-4,4.0483641454183957E-3,2.6607513828012818E-3,0,9.0453168629310544E-6,6.0122918956056559E-4,3.003308456746354E-2,0.17390214174222365,0.84790138212957267,84.79013821295726,213,72.003632642003467,0.72003632642003468,612.78917717106617,null,3.7468649665073801E-2,null,0.44863069468120365,9.053477889331471E-2,8.0311457157292813E-3,null,null,{"$f":"IF(OR(MODE=1,MODE=2,MODE=3), BR77, IF(MODE_ILIM=4,#REF!,#REF!))","v":84.79013821295726},{"$f":"IF(OR(MODE=1,MODE=2,MODE=3), BZ77, IF(MODE_ILIM=4,#REF!,#REF!))","v":0.44863069468120365},{"$f":"IF(OR(MODE=1,MODE=2,MODE=3), CA77, IF(MODE_ILIM=4,#REF!,#REF!))","v":9.053477889331471E-2},{"$f":"IF(OR(MODE=1,MODE=2,MODE=3), CB77, IF(MODE_ILIM=4,#REF!,#REF!))","v":8.0311457157292813E-3},{"$f":"(IF(OR(MODE=1,MODE=2,MODE=3), S77, IF(MODE_ILIM=4,#REF!,#REF!)))/1000","v":612.78917717106617},{"$f":"IF(OR(MODE=1,MODE=2,MODE=3), P77, IF(MODE_ILIM=4,#REF!,#REF!))","v":148.22958375590207}]
[null,null,null,null,null,null,null,72,0.216,0.14818200000000001,0.29037640074999999,0.1422220006864896,148.20432995091051,148.20432995091051,1,148.20432995091051,1.2147340048792006E-6,0.25540425104266112,612970.20250238676,1.6314006715458672E-6,0,6.6E-4,0.22015541397404545,8.2396290713541674E-3,0,8.2505060488731567E-3,4.2572365474370023E-2,1.8124063020833329E-3,1.8124063020833329E-3,9.6620929464856994E-2,2.8006812031958611E-5,2.8006812031958611E-5,0.11126112084108711,2.2901218470007728E-2,1.8389106075071603E-3,30,26.506751801199364,0.17576859259735692,0.11298266772523993,0.29059017093010397,0.31491415656317739,0.18892081658669535,2.6768306204837836E-2,4.9650586402693328E-3,5.8600196547309172E-3,1.5276017412125253E-3,1.2352680036212775E-2,3.9328675132073304E-2,3.2037924040564728E-2,9.0552059571442578E-2,6.8039692477764929E-3,0.45159886051446979,0.46168977967745822,2.5920000000000001,0.84880920689781925,7.9654409543993051E-3,8.8339016213722366E-3,2.1389895336897471E-2,9.5160344336220407E-2,1.9189963871673545E-3,5.0024784815367728E-4,4.0451653335649273E-3,2.6982534788535287E-3,0,9.1714660141138463E-6,5.9351356321294877E-4,2.9653326337885904E-2,0.17276825666374185,0.84880920689781925,84.880920689781931,216,72.026192211331946,0.72026192211331941,612.97020250238677,null,3.6998737880038872E-2,null,0.45159886051446979,9.0552059571442578E-2,8.2505060488731567E-3,null,null,{"$f":"IF(OR(MODE=1,MODE=2,MODE=3), BR78, IF(MODE_ILIM=4,#REF!,#REF!))","v":84.880920689781931},{"$f":"IF(OR(MODE=1,MODE=2,MODE=3), BZ78, IF(MODE_ILIM=4,#REF!,#REF!))","v":0.45159886051446979},{"$f":"IF(OR(MODE=1,MODE=2,MODE=3), CA78, IF(MODE_ILIM=4,#REF!,#REF!))","v":9.0552059571442578E-2},{"$f":"IF(OR(MODE=1,MODE=2,MODE=3), CB78, IF(MODE_ILIM=4,#REF!,#REF!))","v":8.2505060488731567E-3},{"$f":"(IF(OR(MODE=1,MODE=2,MODE=3), S78, IF(MODE_ILIM=4,#REF!,#REF!)))/1000","v":612.97020250238677},{"$f":"IF(OR(MODE=1,MODE=2,MODE=3), P78, IF(MODE_ILIM=4,#REF!,#REF!))","v":148.20432995091051}]
[null,null,null,null,null,null,null,73,0.219,0.14815675,0.29337650701041668,0.14523462613366883,148.17907614591894,148.17907614591894,1,148.17907614591894,1.214252287427427E-6,0.25547968868760085,613151.25285024208,1.6309189540940938E-6,0,6.6E-4,0.22309954348246286,8.4614790713541683E-3,0,8.4729500616933118E-3,4.2572365474370023E-2,1.8124063020833329E-3,1.8124063020833329E-3,9.7906516882319022E-2,2.8757058144083457E-5,2.8757058144083457E-5,0.11276566120489748,2.3524774541908784E-2,1.8394537585507261E-3,30,26.235108245441737,0.1771449153097106,0.11301603892535662,0.29200040799361793,0.31699635231107687,0.19147551846251656,2.7497155627867143E-2,4.9665251480869605E-3,5.9853617958730374E-3,1.5497750517423476E-3,1.2501661995702346E-2,4.0216980217379655E-2,3.2037924040564728E-2,9.0569342637648834E-2,6.8059789066376867E-3,0.45458865407274307,0.4649027674946638,2.6280000000000001,0.84968723479424224,8.0817103531858978E-3,8.9609406777851862E-3,2.1124943916891022E-2,9.4409824667765513E-2,1.9351923567650156E-3,5.0107461121311225E-4,4.0420481778769383E-3,2.7357727375982785E-3,0,9.2977569312266032E-6,5.8598877440671428E-4,2.9282958258339459E-2,0.17166975228875839,0.84968723479424224,84.968723479424227,219,72.045963869077937,0.72045963869077934,613.15125285024203,null,3.6540443531919604E-2,null,0.45458865407274307,9.0569342637648834E-2,8.4729500616933118E-3,null,null,{"$f":"IF(OR(MODE=1,MODE=2,MODE=3), BR79, IF(MODE_ILIM=4,#REF!,#REF!))","v":84.968723479424227},{"$f":"IF(OR(MODE=1,MODE=2,MODE=3), BZ79, IF(MODE_ILIM=4,#REF!,#REF!))","v":0.45458865407274307},{"$f":"IF(OR(MODE=1,MODE=2,MODE=3), CA79, IF(MODE_ILIM=4,#REF!,#REF!))","v":9.0569342637648834E-2},{"$f":"IF(OR(MODE=1,MODE=2,MODE=3), CB79, IF(MODE_ILIM=4,#REF!,#REF!))","v":8.4729500616933118E-3},{"$f":"(IF(OR(MODE=1,MODE=2,MODE=3), S79, IF(MODE_ILIM=4,#REF!,#REF!)))/1000","v":613.15125285024203},{"$f":"IF(OR(MODE=1,MODE=2,MODE=3), P79, IF(MODE_ILIM=4,#REF!,#REF!))","v":148.17907614591894}]
[null,null,null,null,null,null,null,74,0.222,0.1481315,0.29637661327083331,0.14824725158084812,148.15382234092735,148.15382234092735,1,148.15382234092735,1.2137707878573349E-6,0.25555513675825764,613332.3282198183,1.6304374545240015E-6,0,6.6E-4,0.22604514217758218,8.6863890713541683E-3,0,8.6984784102021352E-3,4.2572365474370023E-2,1.8124063020833329E-3,1.8124063020833329E-3,9.9193187964703847E-2,2.9517865615803203E-5,2.9517865615803203E-5,0.1142713835585463,2.4157205835711151E-2,1.8399969846594549E-3,30,25.968975865421193,0.17852202744261431,0.11304941473747691,0.29341143916475065,0.31908933977799953,0.19403222735106412,2.8236378938111276E-2,4.9679918585805293E-3,6.110777185812823E-3,1.5719767105184719E-3,1.2650745754911824E-2,4.1116161151877675E-2,3.2037924040564728E-2,9.0586628092428595E-2,6.807988843239984E-3,0.45760011786554577,0.46814052044344706,2.6640000000000001,0.85053655243502047,8.1981955936042752E-3,9.0881667700323122E-3,2.0866462557641147E-2,9.3677610327396674E-2,1.9509907508708012E-3,5.018857552074043E-4,4.0390096396826849E-3,2.7733075877848395E-3,0,9.4241830540936506E-6,5.786478257452936E-4,2.892163601893678E-2,0.17060533700995628,0.85053655243502047,85.05365524350205,222,72.063171902227168,0.72063171902227163,613.33232821981835,null,3.6093340640244144E-2,null,0.45760011786554577,9.0586628092428595E-2,8.6984784102021352E-3,null,null,{"$f":"IF(OR(MODE=1,MODE=2,MODE=3), BR80, IF(MODE_ILIM=4,#REF!,#REF!))","v":85.05365524350205},{"$f":"IF(OR(MODE=1,MODE=2,MODE=3), BZ80, IF(MODE_ILIM=4,#REF!,#REF!))","v":0.45760011786554577},{"$f":"IF(OR(MODE=1,MODE=2,MODE=3), CA80, IF(MODE_ILIM=4,#REF!,#REF!))","v":9.0586628092428595E-2},{"$f":"IF(OR(MODE=1,MODE=2,MODE=3), CB80, IF(MODE_ILIM=4,#REF!,#REF!))","v":8.6984784102021352E-3},{"$f":"(IF(OR(MODE=1,MODE=2,MODE=3), S80, IF(MODE_ILIM=4,#REF!,#REF!)))/1000","v":613.33232821981835},{"$f":"IF(OR(MODE=1,MODE=2,MODE=3), P80, IF(MODE_ILIM=4,#REF!,#REF!))","v":148.15382234092735}]
[null,null,null,null,null,null,null,75,0.22499999999999998,0.14810624999999997,0.29937671953125,0.15125987702802732,148.12856853593576,148.12856853593576,1,148.12856853593576,1.2132895060211351E-6,0.25563059525679294,613513.42861630302,1.6299561726878014E-6,0,6.5999999999999989E-4,0.22899215336356685,8.9143590713541658E-3,0,8.9270917595794166E-3,4.2572365474370023E-2,1.8124063020833329E-3,1.8124063020833329E-3,0.10048091087060847,3.0289240348161489E-5,3.0289240348161489E-5,0.11577825955991852,2.479851996543915E-2,1.8405402858489089E-3,30,25.708188627139211,0.17989992915972991,0.11308279516255697,0.29482326460813579,0.32119314237276697,0.19659089512757111,2.8985985035294745E-2,4.9694587717920551E-3,6.2362658397361413E-3,1.5942067339048992E-3,1.2799931345433096E-2,4.2026237330467106E-2,3.2037924040564721E-2,9.0603915936277007E-2,6.8099990576409638E-3,0.46063329469715203,0.47140308199916292,2.6999999999999997,0.85135819389378786,8.3148931507023554E-3,9.2155759546688008E-3,2.0614216882245722E-2,9.2963037805426973E-2,1.9664059340589956E-3,5.0268183913725539E-4,4.0360468267453351E-3,2.8108565328551064E-3,0,9.5507381323057828E-6,5.7148405775680935E-4,2.8569031937486441E-2,0.16957378165921611,0.85135819389378786,85.135819389378781,224.99999999999997,72.078010752951272,0.72078010752951271,613.51342861630303,null,3.5657023796316918E-2,null,0.46063329469715203,9.0603915936277007E-2,8.9270917595794166E-3,null,null,{"$f":"IF(OR(MODE=1,MODE=2,MODE=3), BR81, IF(MODE_ILIM=4,#REF!,#REF!))","v":85.135819389378781},{"$f":"IF(OR(MODE=1,MODE=2,MODE=3), BZ81, IF(MODE_ILIM=4,#REF!,#REF!))","v":0.46063329469715203},{"$f":"IF(OR(MODE=1,MODE=2,MODE=3), CA81, IF(MODE_ILIM=4,#REF!,#REF!))","v":9.0603915936277007E-2},{"$f":"IF(OR(MODE=1,MODE=2,MODE=3), CB81, IF(MODE_ILIM=4,#REF!,#REF!))","v":8.9270917595794166E-3},{"$f":"(IF(OR(MODE=1,MODE=2,MODE=3), S81, IF(MODE_ILIM=4,#REF!,#REF!)))/1000","v":613.51342861630303},{"$f":"IF(OR(MODE=1,MODE=2,MODE=3), P81, IF(MODE_ILIM=4,#REF!,#REF!))","v":148.12856853593576}]
[null,null,null,null,null,null,null,76,0.22799999999999998,0.14808099999999999,0.30237682579166664,0.15427250247520657,148.10331473094422,148.10331473094422,1,148.10331473094422,1.2128084417711732E-6,0.25570606418536856,613694.55404488451,1.62947510843784E-6,0,6.6E-4,0.23194052319955502,9.1453890713541659E-3,0,9.1587907841772752E-3,4.2572365474370023E-2,1.8124063020833329E-3,1.8124063020833329E-3,0.1017696553335125,3.1071188240105782E-5,3.1071188240105782E-5,0.11728626229368333,2.5448724547221965E-2,1.8410836621346536E-3,30,25.452587099714155,0.18127862062476441,0.11311618020155312,0.29623588448845217,0.32330778364528096,0.19915147608994271,2.974598282160227E-2,4.9709258877635651E-3,6.3618277728330523E-3,1.6164651382701556E-3,1.2949218798866772E-2,4.2947228303095178E-2,3.2037924040564728E-2,9.0621206169689411E-2,6.8120095498982189E-3,0.4636882276679638,0.47469049594246454,2.7359999999999998,0.85215314383545893,8.4317996988626312E-3,9.3431645130973018E-3,2.036798369748399E-2,9.2265475249894882E-2,1.9814515852190867E-3,5.0346339527680293E-4,4.0331569845276118E-3,2.8484181464740136E-3,0,9.6774162066920619E-6,5.6449112873812528E-4,2.8224833967712765E-2,0.16857391578349393,0.85215314383545893,85.215314383545888,227.99999999999997,72.090646982404948,0.72090646982404949,613.69455404488451,null,3.5231106936188521E-2,null,0.4636882276679638,9.0621206169689411E-2,9.1587907841772752E-3,null,null,{"$f":"IF(OR(MODE=1,MODE=2,MODE=3), BR82, IF(MODE_ILIM=4,#REF!,#REF!))","v":85.215314383545888},{"$f":"IF(OR(MODE=1,MODE=2,MODE=3), BZ82, IF(MODE_ILIM=4,#REF!,#REF!))","v":0.4636882276679638},{"$f":"IF(OR(MODE=1,MODE=2,MODE=3), CA82, IF(MODE_ILIM=4,#REF!,#REF!))","v":9.0621206169689411E-2},{"$f":"IF(OR(MODE=1,MODE=2,MODE=3), CB82, IF(MODE_ILIM=4,#REF!,#REF!))","v":9.1587907841772752E-3},{"$f":"(IF(OR(MODE=1,MODE=2,MODE=3), S82, IF(MODE_ILIM=4,#REF!,#REF!)))/1000","v":613.69455404488451},{"$f":"IF(OR(MODE=1,MODE=2,MODE=3), P82, IF(MODE_ILIM=4,#REF!,#REF!))","v":148.10331473094422}]
[null,null,null,null,null,null,null,77,0.23099999999999998,0.14805574999999999,0.30537693205208333,0.15728512792238583,148.07806092595266,148.07806092595266,1,148.07806092595266,1.2123275949599263E-6,0.25578154354614746,613875.70451075386,1.6289942616265929E-6,0,6.6E-4,0.23489020052374115,9.379479071354167E-3,0,9.3935761675251229E-3,4.2572365474370023E-2,1.8124063020833329E-3,1.8124063020833329E-3,0.10305939256643121,3.1863715188485328E-5,3.1863715188485328E-5,0.11879536618338955,2.6107827199294387E-2,1.8416271135322617E-3,30,25.202018130358095,0.18265810200147031,0.11314956985542216,0.29764929897042469,0.32543328728719761,0.20171392680949518,3.0516381201679786E-2,4.9723932065371072E-3,6.4874630002978266E-3,1.638751939987295E-3,1.3098608146822229E-2,4.387915377547099E-2,3.2037924040564728E-2,9.0638498793161298E-2,6.8140203200693691E-3,0.4667649601758993,0.47800280636069625,2.7719999999999998,0.85292234042838988,8.5489121001360042E-3,9.4709289384018562E-3,2.0127550334615316E-2,9.1584320600549843E-2,1.9961407379713589E-3,5.0423093074874743E-4,4.0303374880743112E-3,2.8859910683760813E-3,0,9.8042115921019275E-6,5.5766299602455981E-4,2.7888744777625877E-2,0.16760462418411606,0.85292234042838988,85.292234042838984,230.99999999999997,72.101220909974245,0.7210122090997424,613.87570451075385,null,3.4815222200415677E-2,null,0.4667649601758993,9.0638498793161298E-2,9.3935761675251229E-3,null,null,{"$f":"IF(OR(MODE=1,MODE=2,MODE=3), BR83, IF(MODE_ILIM=4,#REF!,#REF!))","v":85.292234042838984},{"$f":"IF(OR(MODE=1,MODE=2,MODE=3), BZ83, IF(MODE_ILIM=4,#REF!,#REF!))","v":0.4667649601758993},{"$f":"IF(OR(MODE=1,MODE=2,MODE=3), CA83, IF(MODE_ILIM=4,#REF!,#REF!))","v":9.0638498793161298E-2},{"$f":"IF(OR(MODE=1,MODE=2,MODE=3), CB83, IF(MODE_ILIM=4,#REF!,#REF!))","v":9.3935761675251229E-3},{"$f":"(IF(OR(MODE=1,MODE=2,MODE=3), S83, IF(MODE_ILIM=4,#REF!,#REF!)))/1000","v":613.87570451075385},{"$f":"IF(OR(MODE=1,MODE=2,MODE=3), P83, IF(MODE_ILIM=4,#REF!,#REF!))","v":148.07806092595266}]
[null,null,null,null,null,null,null,78,0.23399999999999999,0.14803050000000001,0.30837703831249996,0.16029775336956509,148.05280712096112,148.05280712096112,1,148.05280712096112,1.2118469654400065E-6,0.25585703334129267,614056.88001910236,1.6285136321066731E-6,0,6.6E-4,0.23784113669019352,9.6166290713541654E-3,0,9.6314486023347193E-3,4.2572365474370023E-2,1.8124063020833329E-3,1.8124063020833329E-3,0.10435009517332991,3.2666827088049032E-5,3.2666827088049032E-5,0.120305546909924,2.6775835541997459E-2,1.842170640057307E-3,30,24.956334538364679,0.18403837345364518,0.11318296412512095,0.29906350821882344,0.3275696771326051,0.20427820599249813,3.1297189082635124E-2,4.9738607281547302E-3,6.6131715373289254E-3,1.6610671554338936E-3,1.324809942091755E-2,4.4822033609785622E-2,3.2037924040564728E-2,9.0655793807188245E-2,6.8160313682120374E-3,0.46986353591779101,0.4813400576492971,2.8079999999999998,0.85366667805295771,8.6662273933919096E-3,9.5988659231031753E-3,1.9892714036260948E-2,9.0918999853285762E-2,2.0104858182571068E-3,5.0498492898936188E-4,4.0275858344622504E-3,2.9235740005022831E-3,0,9.9311188613907382E-6,5.509938985689901E-4,2.7560480892320615E-2,0.1666648436980038,0.85366667805295771,85.366667805295776,234,72.109847935853821,0.72109847935853821,614.05688001910232,null,3.440901887353244E-2,null,0.46986353591779101,9.0655793807188245E-2,9.6314486023347193E-3,null,null,{"$f":"IF(OR(MODE=1,MODE=2,MODE=3), BR84, IF(MODE_ILIM=4,#REF!,#REF!))","v":85.366667805295776},{"$f":"IF(OR(MODE=1,MODE=2,MODE=3), BZ84, IF(MODE_ILIM=4,#REF!,#REF!))","v":0.46986353591779101},{"$f":"IF(OR(MODE=1,MODE=2,MODE=3), CA84, IF(MODE_ILIM=4,#REF!,#REF!))","v":9.0655793807188245E-2},{"$f":"IF(OR(MODE=1,MODE=2,MODE=3), CB84, IF(MODE_ILIM=4,#REF!,#REF!))","v":9.6314486023347193E-3},{"$f":"(IF(OR(MODE=1,MODE=2,MODE=3), S84, IF(MODE_ILIM=4,#REF!,#REF!)))/1000","v":614.05688001910232},{"$f":"IF(OR(MODE=1,MODE=2,MODE=3), P84, IF(MODE_ILIM=4,#REF!,#REF!))","v":148.05280712096112}]
[null,null,null,null,null,null,null,79,0.23699999999999999,0.14800524999999998,0.31137714457291665,0.16331037881674434,148.02755331596953,148.02755331596953,1,148.02755331596953,1.2113665530641575E-6,0.25593253357296819,614238.08057512366,1.6280332197308243E-6,0,6.6E-4,0.24079328541735404,9.8568390713541648E-3,0,9.8724087905053062E-3,4.2572365474370023E-2,1.8124063020833329E-3,1.8124063020833329E-3,0.10564173706675414,3.348052983144365E-5,3.348052983144365E-5,0.12181678133580714,2.7452757197779325E-2,1.8427142417253709E-3,30,24.715394826823285,0.18541943514513204,0.1132163630116068,0.30047851239846418,0.32971697715870751,0.20684427435162919,3.2088415374039038E-2,4.975328452658502E-3,6.7389533991290204E-3,1.6834108009920606E-3,1.3397692652779583E-2,4.577588782543901E-2,3.2037924040564728E-2,9.0673091212266035E-2,6.8180426943838732E-3,0.4729839988907964,0.4847022945132165,2.8439999999999999,0.85438700982296811,8.7837427842188918E-3,9.7269723477612334E-3,1.9663281385653909E-2,9.0268965444506855E-2,2.0244986793312839E-3,5.0572585111226948E-4,4.0248996357719752E-3,2.9611657034038282E-3,0,1.0058132830511894E-5,5.4447834072478263E-4,2.7239771896010276E-2,0.16575356020132576,0.85438700982296811,85.438700982296808,237,72.116619551864289,0.72116619551864292,614.23808057512372,null,3.401216239680676E-2,null,0.4729839988907964,9.0673091212266035E-2,9.8724087905053062E-3,null,null,{"$f":"IF(OR(MODE=1,MODE=2,MODE=3), BR85, IF(MODE_ILIM=4,#REF!,#REF!))","v":85.438700982296808},{"$f":"IF(OR(MODE=1,MODE=2,MODE=3), BZ85, IF(MODE_ILIM=4,#REF!,#REF!))","v":0.4729839988907964},{"$f":"IF(OR(MODE=1,MODE=2,MODE=3), CA85, IF(MODE_ILIM=4,#REF!,#REF!))","v":9.0673091212266035E-2},{"$f":"IF(OR(MODE=1,MODE=2,MODE=3), CB85, IF(MODE_ILIM=4,#REF!,#REF!))","v":9.8724087905053062E-3},{"$f":"(IF(OR(MODE=1,MODE=2,MODE=3), S85, IF(MODE_ILIM=4,#REF!,#REF!)))/1000","v":614.23808057512372},{"$f":"IF(OR(MODE=1,MODE=2,MODE=3), P85, IF(MODE_ILIM=4,#REF!,#REF!))","v":148.02755331596953}]
[null,null,null,null,null,null,null,80,0.24,0.14798,0.31437725083333334,0.1663230042639236,148.00229951097793,148.00229951097793,1,148.00229951097793,1.210886357685258E-6,0.2560080442433384,614419.30618401209,1.6275530243519246E-6,0,6.6E-4,0.24374660264726425,1.0100109071354165E-2,0,1.0116457443128776E-2,4.2572365474370023E-2,1.8124063020833329E-3,1.8124063020833329E-3,0.10693429339117791,3.4304829309211549E-5,3.4304829309211549E-5,0.12332904743484784,2.8138599791195852E-2,1.8432579185520364E-3,30,24.479062910872944,0.18680128723981904,0.11324976651583711,0.30189431167420816,0.3318752114865135,0.20941209448652789,3.2890068987925861E-2,4.9767963800904993E-3,6.8648086009049768E-3,1.7057828930484315E-3,1.3547387874043908E-2,4.6740736599772792E-2,3.2037924040564728E-2,9.0690391008890536E-2,6.8200542986425359E-3,0.47612639339381935,0.48808956196834069,2.88,0.85508414993480841,8.9014556355158925E-3,9.8552452703574798E-3,1.9439067774879963E-2,8.9633694745866119E-2,2.0381906343645813E-3,5.0645413717904735E-4,4.022276612539572E-3,2.9987649928915707E-3,0,1.0185248544627035E-5,5.3811107713660296E-4,2.6926359688573806E-2,0.16486980581784921,0.85508414993480841,85.508414993480841,240,72.121604042494241,0.72121604042494236,614.41930618401204,null,3.3624333448441013E-2,null,0.47612639339381935,9.0690391008890536E-2,1.0116457443128776E-2,null,null,{"$f":"IF(OR(MODE=1,MODE=2,MODE=3), BR86, IF(MODE_ILIM=4,#REF!,#REF!))","v":85.508414993480841},{"$f":"IF(OR(MODE=1,MODE=2,MODE=3), BZ86, IF(MODE_ILIM=4,#REF!,#REF!))","v":0.47612639339381935},{"$f":"IF(OR(MODE=1,MODE=2,MODE=3), CA86, IF(MODE_ILIM=4,#REF!,#REF!))","v":9.0690391008890536E-2},{"$f":"IF(OR(MODE=1,MODE=2,MODE=3), CB86, IF(MODE_ILIM=4,#REF!,#REF!))","v":1.0116457443128776E-2},{"$f":"(IF(OR(MODE=1,MODE=2,MODE=3), S86, IF(MODE_ILIM=4,#REF!,#REF!)))/1000","v":614.41930618401204},{"$f":"IF(OR(MODE=1,MODE=2,MODE=3), P86, IF(MODE_ILIM=4,#REF!,#REF!))","v":148.00229951097793}]
[null,null,null,null,null,null,null,81,0.24299999999999999,0.14795475,0.31737735709374998,0.16933562971110286,147.97704570598637,147.97704570598637,1,147.97704570598637,1.2104063791563179E-6,0.25608356535456828,614600.55685096385,1.6270730458229844E-6,0,6.6E-4,0.24670104641465007,1.0346439071354166E-2,0,1.0363595280494936E-2,4.2572365474370023E-2,1.8124063020833329E-3,1.8124063020833329E-3,0.10822774045161879,3.5139731409788885E-5,3.5139731409788885E-5,0.12484232422672405,2.8833370948911408E-2,1.8438016705528916E-3,30,24.247207861399421,0.18818392990163976,0.11328317463876966,0.30331090621096235,0.3340444043815301,0.21198163077271437,3.3702158838794551E-2,4.9782645104928074E-3,6.9907371578678771E-3,1.7281834479941755E-3,1.369718511635486E-2,4.7716600268809854E-2,3.2037924040564728E-2,9.070769319755774E-2,6.8220661810456992E-3,0.47929076402894338,0.49150190534293142,2.9159999999999999,0.85575887585792365,9.0193634587196897E-3,9.9836819163953705E-3,1.9219896909037127E-2,8.9012688660679448E-2,2.0515724868433579E-3,5.0717020738400757E-4,4.0197145876507958E-3,3.0363707369117083E-3,0,1.0312461265154426E-5,5.3188709865180026E-4,2.6619997792320799E-2,0.16401265631585923,0.85575887585792365,85.575887585792358,243,72.124846875437001,0.72124846875436999,614.60055685096381,null,3.3245227085902052E-2,null,0.47929076402894338,9.070769319755774E-2,1.0363595280494936E-2,null,null,{"$f":"IF(OR(MODE=1,MODE=2,MODE=3), BR87, IF(MODE_ILIM=4,#REF!,#REF!))","v":85.575887585792358},{"$f":"IF(OR(MODE=1,MODE=2,MODE=3), BZ87, IF(MODE_ILIM=4,#REF!,#REF!))","v":0.47929076402894338},{"$f":"IF(OR(MODE=1,MODE=2,MODE=3), CA87, IF(MODE_ILIM=4,#REF!,#REF!))","v":9.070769319755774E-2},{"$f":"IF(OR(MODE=1,MODE=2,MODE=3), CB87, IF(MODE_ILIM=4,#REF!,#REF!))","v":1.0363595280494936E-2},{"$f":"(IF(OR(MODE=1,MODE=2,MODE=3), S87, IF(MODE_ILIM=4,#REF!,#REF!)))/1000","v":614.60055685096381},{"$f":"IF(OR(MODE=1,MODE=2,MODE=3), P87, IF(MODE_ILIM=4,#REF!,#REF!))","v":147.97704570598637}]
[null,null,null,null,null,"Eff (%)","Iout (mA)",82,0.24599999999999997,0.14792949999999996,0.32037746335416661,0.17234825515828209,147.95179190099478,147.95179190099478,1,147.95179190099478,1.2099266173304802E-6,0.25615909690882355,614781.83258117654,1.6265932839971468E-6,0,6.6E-4,0.24965657672507513,1.0595829071354167E-2,0,1.0613823032096839E-2,4.2572365474370023E-2,1.8124063020833329E-3,1.8124063020833329E-3,0.10952205564710611,3.5985242019503425E-5,3.5985242019503425E-5,0.12635659171609484,2.9537078299699593E-2,1.8443454977435298E-3,30,24.019703663161188,0.18956736329457319,0.11331658738136247,0.30472829617367919,0.33622458025446184,0.21455284925820148,3.4524693843609393E-2,4.9797328439075313E-3,7.1167390852330033E-3,1.750612482224994E-3,1.3847084411365529E-2,4.8703499327999965E-2,3.2037924040564728E-2,9.0724997778763847E-2,6.8240783416510607E-3,0.48247715570287669,0.49493937027907636,2.9519999999999995,0.85641193037897723,9.1374639056191458E-3,1.0112279669663103E-2,1.9005600343514652E-2,8.8405470314091239E-2,2.0646545589389953E-3,5.0787446315983748E-4,4.0172114806430216E-3,3.0739818526301184E-3,0,1.043976645768212E-5,5.2580161917283573E-4,2.6320450705060835E-2,0.16318122867895146,0.85641193037897723,85.641193037897722,245.99999999999997,72.126370778645395,0.72126370778645399,614.78183258117656,null,3.2874551945538857E-2,null,0.48247715570287669,9.0724997778763847E-2,1.0613823032096839E-2,null,null,{"$f":"IF(OR(MODE=1,MODE=2,MODE=3), BR88, IF(MODE_ILIM=4,#REF!,#REF!))","v":85.641193037897722},{"$f":"IF(OR(MODE=1,MODE=2,MODE=3), BZ88, IF(MODE_ILIM=4,#REF!,#REF!))","v":0.48247715570287669},{"$f":"IF(OR(MODE=1,MODE=2,MODE=3), CA88, IF(MODE_ILIM=4,#REF!,#REF!))","v":9.0724997778763847E-2},{"$f":"IF(OR(MODE=1,MODE=2,MODE=3), CB88, IF(MODE_ILIM=4,#REF!,#REF!))","v":1.0613823032096839E-2},{"$f":"(IF(OR(MODE=1,MODE=2,MODE=3), S88, IF(MODE_ILIM=4,#REF!,#REF!)))/1000","v":614.78183258117656},{"$f":"IF(OR(MODE=1,MODE=2,MODE=3), P88, IF(MODE_ILIM=4,#REF!,#REF!))","v":147.95179190099478}]
[null,null,null,null,null,{"$f":"BT51","v":68.427867006324419},{"$f":"I56*1000","v":150},83,0.24899999999999997,0.14790424999999999,0.3233775696145833,0.17536088060546134,147.92653809600324,147.92653809600324,1,147.92653809600324,1.2094470720610218E-6,0.25623463890827031,614963.13337984867,1.6261137387276886E-6,0,6.6E-4,0.25261315544144436,1.0848279071354168E-2,0,1.0867141436636168E-2,4.2572365474370023E-2,1.8124063020833329E-3,1.8124063020833329E-3,0.11081721740862689,3.6841367022572641E-5,3.6841367022572641E-5,0.12787183083588449,3.0249729474443966E-2,1.844889400139546E-3,30,23.796428986405363,0.19095158758264341,0.11335000474457371,0.3061464817273567,0.33841576366191495,0.21712571756719171,3.5357682921800929E-2,4.9812013803767746E-3,7.242814398219841E-3,1.773070012141123E-3,1.3997085790737739E-2,4.9701454432972206E-2,3.2037924040564728E-2,9.0742304753005085E-2,6.8260907805163208E-3,0.48568561362840856,0.49840200273415064,2.9879999999999995,0.85704402351097564,9.255754760710791E-3,1.0241036063607678E-2,1.8796017051838986E-2,8.7811583829766796E-2,2.0774467180031992E-3,5.0856728821020171E-4,4.0147653023835939E-3,3.1115973037092663E-3,0,1.0567159780679461E-5,5.1985006337822908E-4,2.6027493295908505E-2,0.16237467883729792,0.85704402351097564,85.704402351097571,248.99999999999997,72.126175499523185,0.72126175499523182,614.96313337984873,null,3.2512029495072842E-2,null,0.48568561362840856,9.0742304753005085E-2,1.0867141436636168E-2,null,null,{"$f":"IF(OR(MODE=1,MODE=2,MODE=3), BR89, IF(MODE_ILIM=4,#REF!,#REF!))","v":85.704402351097571},{"$f":"IF(OR(MODE=1,MODE=2,MODE=3), BZ89, IF(MODE_ILIM=4,#REF!,#REF!))","v":0.48568561362840856},{"$f":"IF(OR(MODE=1,MODE=2,MODE=3), CA89, IF(MODE_ILIM=4,#REF!,#REF!))","v":9.0742304753005085E-2},{"$f":"IF(OR(MODE=1,MODE=2,MODE=3), CB89, IF(MODE_ILIM=4,#REF!,#REF!))","v":1.0867141436636168E-2},{"$f":"(IF(OR(MODE=1,MODE=2,MODE=3), S89, IF(MODE_ILIM=4,#REF!,#REF!)))/1000","v":614.96313337984873},{"$f":"IF(OR(MODE=1,MODE=2,MODE=3), P89, IF(MODE_ILIM=4,#REF!,#REF!))","v":147.92653809600324}]
[null,null,null,null,null,{"$f":"BT81","v":72.078010752951272},{"$f":"I81*1000","v":224.99999999999997},84,0.252,0.14787899999999998,0.326377675875,0.17837350605264063,147.90128429101168,147.90128429101168,1,147.90128429101168,1.2089677432013499E-6,0.2563101913550756,615144.45925218146,1.6256344098680162E-6,0,6.6E-4,0.25557074617820275,1.1103789071354168E-2,0,1.112355124202871E-2,4.2572365474370023E-2,1.8124063020833329E-3,1.8124063020833329E-3,0.11211320514120486,3.7708112301101651E-5,3.7708112301101651E-5,0.12938802339441177,3.0971332106138772E-2,1.8454333777565444E-3,30,23.577266971104031,0.19233660292992033,0.11338342672936208,0.30756546303703897,0.34061797930710724,0.219700204810303,3.6201134995266809E-2,4.9826701199426702E-3,7.3689631120521029E-3,1.795556054147337E-3,1.4147189286142111E-2,5.0710486400293783E-2,3.2037924040564728E-2,9.0759614120777987E-2,6.8281034976992146E-3,0.48891618332587822,0.50188984898229139,3.024,0.85765583427764869,9.3742339340545516E-3,1.0369948773273576E-2,1.8590993021756673E-2,8.7230593186515534E-2,2.089958401332098E-3,5.0924904947487345E-4,4.0123741500959079E-3,3.1492160977629954E-3,0,1.0694637074945967E-5,5.1402805524581653E-4,2.5740910240566572E-2,0.16159219954715359,0.85765583427764869,85.765583427764867,252,72.124237241864293,0.72124237241864297,615.14445925218149,null,3.2157393334930451E-2,null,0.48891618332587822,9.0759614120777987E-2,1.112355124202871E-2,null,null,{"$f":"IF(OR(MODE=1,MODE=2,MODE=3), BR90, IF(MODE_ILIM=4,#REF!,#REF!))","v":85.765583427764867},{"$f":"IF(OR(MODE=1,MODE=2,MODE=3), BZ90, IF(MODE_ILIM=4,#REF!,#REF!))","v":0.48891618332587822},{"$f":"IF(OR(MODE=1,MODE=2,MODE=3), CA90, IF(MODE_ILIM=4,#REF!,#REF!))","v":9.0759614120777987E-2},{"$f":"IF(OR(MODE=1,MODE=2,MODE=3), CB90, IF(MODE_ILIM=4,#REF!,#REF!))","v":1.112355124202871E-2},{"$f":"(IF(OR(MODE=1,MODE=2,MODE=3), S90, IF(MODE_ILIM=4,#REF!,#REF!)))/1000","v":615.14445925218149},{"$f":"IF(OR(MODE=1,MODE=2,MODE=3), P90, IF(MODE_ILIM=4,#REF!,#REF!))","v":147.90128429101168}]
[null,null,null,null,null,{"$f":"BT106","v":71.049894896969974},{"$f":"I106*1000","v":300},85,0.255,0.14785375000000001,0.32937778213541669,0.18138613149981989,147.87603048602014,147.87603048602014,1,147.87603048602014,1.2084886306050056E-6,0.25638575425140664,615325.81020337588,1.6251552972716723E-6,0,6.6E-4,0.2585293142026322,1.1362359071354165E-2,0,1.1383053205409875E-2,4.2572365474370023E-2,1.8124063020833329E-3,1.8124063020833329E-3,0.11340999916979853,3.8585483735081116E-5,3.8585483735081116E-5,0.13090515202606562,3.1701893829889603E-2,1.8459774306101276E-3,30,23.362105023004673,0.19372240950051864,0.11341685333668625,0.30898524026781504,0.34283125204058212,0.22227628150081627,3.7055058988372587E-2,4.9841390626473459E-3,7.4951852419576897E-3,1.8180706246529441E-3,1.4297394929257979E-2,5.1730616208235297E-2,3.2037924040564728E-2,9.077692588257899E-2,6.8301164932574737E-3,0.49216891062465395,0.50540295561588222,3.06,0.85824801238249393,9.4928994545921044E-3,1.0499015607763515E-2,1.8390380877424676E-2,8.666208114881685E-2,2.1021986393296695E-3,5.0992009803247989E-4,4.0100362027069309E-3,3.1868372839757879E-3,0,1.0822194353741965E-5,5.0833140731781901E-4,2.5460495493109931E-2,0.16083301840742351,0.85824801238249393,85.824801238249393,255,72.120507778355574,0.72120507778355569,615.32581020337591,null,3.1810388544734572E-2,null,0.49216891062465395,9.077692588257899E-2,1.1383053205409875E-2,null,null,{"$f":"IF(OR(MODE=1,MODE=2,MODE=3), BR91, IF(MODE_ILIM=4,#REF!,#REF!))","v":85.824801238249393},{"$f":"IF(OR(MODE=1,MODE=2,MODE=3), BZ91, IF(MODE_ILIM=4,#REF!,#REF!))","v":0.49216891062465395},{"$f":"IF(OR(MODE=1,MODE=2,MODE=3), CA91, IF(MODE_ILIM=4,#REF!,#REF!))","v":9.077692588257899E-2},{"$f":"IF(OR(MODE=1,MODE=2,MODE=3), CB91, IF(MODE_ILIM=4,#REF!,#REF!))","v":1.1383053205409875E-2},{"$f":"(IF(OR(MODE=1,MODE=2,MODE=3), S91, IF(MODE_ILIM=4,#REF!,#REF!)))/1000","v":615.32581020337591},{"$f":"IF(OR(MODE=1,MODE=2,MODE=3), P91, IF(MODE_ILIM=4,#REF!,#REF!))","v":147.87603048602014}]
[null,null,null,null,null,null,null,86,0.25800000000000001,0.14782849999999997,0.33237788839583332,0.18439875694699914,147.85077668102852,147.85077668102852,1,147.85077668102852,1.208009734125661E-6,0.25646132759943169,615507.18623863603,1.6246764007923276E-6,0,6.6E-4,0.26148882634270115,1.1623989071354165E-2,0,1.1645648093140325E-2,4.2572365474370023E-2,1.8124063020833329E-3,1.8124063020833329E-3,0.11470758068873124,3.9473487202385369E-5,3.9473487202385369E-5,0.13242320014525566,3.2441422282914308E-2,1.846521558715908E-3,30,23.150834620746824,0.19510900745859899,0.11345028456750539,0.31040581358482028,0.34505560686093023,0.22485391947648339,3.7919463827952658E-2,4.9856082085329529E-3,7.6214808031687363E-3,1.840613740071796E-3,1.4447702751773487E-2,5.2761864997543026E-2,3.2037924040564728E-2,9.0794240038904933E-2,6.832129767248861E-3,0.49544384166462702,0.50894136954705305,3.0960000000000001,0.85882117977108752,9.611749463893102E-3,1.0628234503182383E-2,1.8194039525760718E-2,8.6105648265736301E-2,2.1141760771899447E-3,5.1058076994552114E-4,4.0077497164922784E-3,3.2244599508742286E-3,0,1.0949827793550234E-5,5.0275611065237792E-4,2.5186051791547689E-2,0.16009639600306808,0.85882117977108752,85.882117977108749,258,72.229662267470047,0.72229662267470052,615.507186238636,null,3.1470771071586107E-2,null,0.49544384166462702,9.0794240038904933E-2,1.1645648093140325E-2,null,null,{"$f":"IF(OR(MODE=1,MODE=2,MODE=3), BR92, IF(MODE_ILIM=4,#REF!,#REF!))","v":85.882117977108749},{"$f":"IF(OR(MODE=1,MODE=2,MODE=3), BZ92, IF(MODE_ILIM=4,#REF!,#REF!))","v":0.49544384166462702},{"$f":"IF(OR(MODE=1,MODE=2,MODE=3), CA92, IF(MODE_ILIM=4,#REF!,#REF!))","v":9.0794240038904933E-2},{"$f":"IF(OR(MODE=1,MODE=2,MODE=3), CB92, IF(MODE_ILIM=4,#REF!,#REF!))","v":1.1645648093140325E-2},{"$f":"(IF(OR(MODE=1,MODE=2,MODE=3), S92, IF(MODE_ILIM=4,#REF!,#REF!)))/1000","v":615.507186238636},{"$f":"IF(OR(MODE=1,MODE=2,MODE=3), P92, IF(MODE_ILIM=4,#REF!,#REF!))","v":147.85077668102852}]
[null,null,null,null,null,null,null,87,0.26100000000000001,0.14780325,0.33537799465625001,0.1874113823941784,147.82552287603698,147.82552287603698,1,147.82552287603698,1.2075310536171215E-6,0.25653691140131912,615688.58736316592,1.6241977202837881E-6,0,6.5999999999999989E-4,0.26444925090096838,1.1888679071354165E-2,0,1.1911336680811608E-2,4.2572365474370023E-2,1.8124063020833329E-3,1.8124063020833329E-3,0.11600593171438868,4.0372128578770229E-5,4.0372128578770229E-5,0.13394215190338701,3.3189925104543501E-2,1.8470657620894978E-3,30,22.943351133350756,0.19649639696836707,0.11348372042277874,0.31182718315323532,0.34729106891551376,0.22743309182647112,3.8794358443311028E-2,4.987077557641645E-3,7.7478498109215749E-3,1.8631854168222823E-3,1.4598112785385503E-2,5.3804254072217395E-2,3.2037924040564721E-2,9.0811556590252557E-2,6.8341433197311426E-3,0.49874102289771488,0.51250513800918862,3.1320000000000001,0.85937593209454366,9.7307822102977153E-3,1.0757603516028585E-2,1.8001833825169809E-2,8.5560911933182507E-2,2.1258989952072996E-3,5.1123138705191885E-4,4.005513020996789E-3,3.262083224239425E-3,0,1.1077533725421912E-5,4.9729832541088419E-4,2.4917390194669441E-2,0.15938162416597976,0.85937593209454366,85.937593209454363,261,72.361493645121143,0.72361493645121144,615.68858736316588,null,3.1138307157050474E-2,null,0.49874102289771488,9.0811556590252557E-2,1.1911336680811608E-2,null,null,{"$f":"IF(OR(MODE=1,MODE=2,MODE=3), BR93, IF(MODE_ILIM=4,#REF!,#REF!))","v":85.937593209454363},{"$f":"IF(OR(MODE=1,MODE=2,MODE=3), BZ93, IF(MODE_ILIM=4,#REF!,#REF!))","v":0.49874102289771488},{"$f":"IF(OR(MODE=1,MODE=2,MODE=3), CA93, IF(MODE_ILIM=4,#REF!,#REF!))","v":9.0811556590252557E-2},{"$f":"IF(OR(MODE=1,MODE=2,MODE=3), CB93, IF(MODE_ILIM=4,#REF!,#REF!))","v":1.1911336680811608E-2},{"$f":"(IF(OR(MODE=1,MODE=2,MODE=3), S93, IF(MODE_ILIM=4,#REF!,#REF!)))/1000","v":615.68858736316588},{"$f":"IF(OR(MODE=1,MODE=2,MODE=3), P93, IF(MODE_ILIM=4,#REF!,#REF!))","v":147.82552287603698}]
[null,null,null,null,null,null,null,88,0.26400000000000001,0.14777799999999999,0.33837810091666665,0.19042400784135766,147.80026907104542,147.80026907104542,1,147.80026907104542,1.207052588933323E-6,0.25661250565923838,615870.01358217211,1.6237192555999897E-6,0,6.6E-4,0.26741055757408561,1.2156429071354171E-2,0,1.2180119753251931E-2,4.2572365474370023E-2,1.8124063020833329E-3,1.8124063020833329E-3,0.11730503504094379,4.1281413737871152E-5,4.1281413737871152E-5,0.13546199214863364,3.3947409936221487E-2,1.8476100407465164E-3,30,22.739553647433286,0.19788457819407415,0.11351716090346596,0.31324934913828661,0.34953766350119814,0.23001377282305585,3.9679751766222265E-2,4.988547110015595E-3,7.8742922804567635E-3,1.8857856713273371E-3,1.4748625061799695E-2,5.4857804900298693E-2,3.2037924040564728E-2,9.0828875537118881E-2,6.8361571507621118E-3,0.50206050108937783,0.51609430855845095,3.1680000000000001,0.8599128400813405,9.8499960434266873E-3,1.0887120817000289E-2,1.7813634275012761E-2,8.5027505514878615E-2,2.1373753278150728E-3,5.1187225770700365E-4,4.0033245152105469E-3,3.2997062651501062E-3,0,1.1205308626864156E-5,4.9195437203465868E-4,2.4654329647890934E-2,0.15868802434475354,0.8599128400813405,85.991284008134045,264,72.477313046906502,0.724773130469065,615.87001358217208,null,3.0812772800022072E-2,null,0.50206050108937783,9.0828875537118881E-2,1.2180119753251931E-2,null,null,{"$f":"IF(OR(MODE=1,MODE=2,MODE=3), BR94, IF(MODE_ILIM=4,#REF!,#REF!))","v":85.991284008134045},{"$f":"IF(OR(MODE=1,MODE=2,MODE=3), BZ94, IF(MODE_ILIM=4,#REF!,#REF!))","v":0.50206050108937783},{"$f":"IF(OR(MODE=1,MODE=2,MODE=3), CA94, IF(MODE_ILIM=4,#REF!,#REF!))","v":9.0828875537118881E-2},{"$f":"IF(OR(MODE=1,MODE=2,MODE=3), CB94, IF(MODE_ILIM=4,#REF!,#REF!))","v":1.2180119753251931E-2},{"$f":"(IF(OR(MODE=1,MODE=2,MODE=3), S94, IF(MODE_ILIM=4,#REF!,#REF!)))/1000","v":615.87001358217208},{"$f":"IF(OR(MODE=1,MODE=2,MODE=3), P94, IF(MODE_ILIM=4,#REF!,#REF!))","v":147.80026907104542}]
[null,null,null,null,null,null,null,89,0.26700000000000002,0.14775274999999999,0.34137820717708334,0.19343663328853691,147.77501526605383,147.77501526605383,1,147.77501526605383,1.2065743399283335E-6,0.25668811037535927,616051.46490086219,1.6232410065950003E-6,0,6.6E-4,0.27037271737748125,1.242723907135417E-2,0,1.2451998104531941E-2,4.2572365474370023E-2,1.8124063020833329E-3,1.8124063020833329E-3,0.11860487419888638,4.2201348551200988E-5,4.2201348551200988E-5,0.13698270638829979,3.471388442150683E-2,1.8481543947025864E-3,30,22.539344803551117,0.199273551300017,0.11355060601052692,0.31467231170524651,0.35179541606508907,0.23259593785771418,4.0575652730932228E-2,4.9900168656969845E-3,8.0008082270190736E-3,1.908414520014438E-3,1.4899239612730496E-2,5.5922539114659095E-2,3.2037924040564728E-2,9.0846196880001034E-2,6.8381712603995705E-3,0.50540232332014878,0.5197089290753153,3.2040000000000002,0.860432450824138,9.9693894090323275E-3,1.1016784685186349E-2,1.7629316724316967E-2,8.4505077517803479E-2,2.1486126814444281E-3,5.1250367747952363E-4,4.0011826639818294E-3,3.3373282681469266E-3,0,1.1333149114230196E-5,4.8672072296837549E-4,2.4396696576002325E-2,0.15801494607547675,0.860432450824138,86.043245082413804,267,72.230234640211876,0.72230234640211877,616.05146490086224,null,3.0493953252872588E-2,null,0.50540232332014878,9.0846196880001034E-2,1.2451998104531941E-2,null,null,{"$f":"IF(OR(MODE=1,MODE=2,MODE=3), BR95, IF(MODE_ILIM=4,#REF!,#REF!))","v":86.043245082413804},{"$f":"IF(OR(MODE=1,MODE=2,MODE=3), BZ95, IF(MODE_ILIM=4,#REF!,#REF!))","v":0.50540232332014878},{"$f":"IF(OR(MODE=1,MODE=2,MODE=3), CA95, IF(MODE_ILIM=4,#REF!,#REF!))","v":9.0846196880001034E-2},{"$f":"IF(OR(MODE=1,MODE=2,MODE=3), CB95, IF(MODE_ILIM=4,#REF!,#REF!))","v":1.2451998104531941E-2},{"$f":"(IF(OR(MODE=1,MODE=2,MODE=3), S95, IF(MODE_ILIM=4,#REF!,#REF!)))/1000","v":616.05146490086224},{"$f":"IF(OR(MODE=1,MODE=2,MODE=3), P95, IF(MODE_ILIM=4,#REF!,#REF!))","v":147.77501526605383}]
[null,null,null,null,null,null,null,90,0.27,0.14772750000000001,0.34437831343750003,0.19644925873571617,147.74976146106229,147.74976146106229,1,147.74976146106229,1.2060963064563535E-6,0.25676372555185206,616232.94132444495,1.6227629731230203E-6,0,6.6E-4,0.27333570257484358,1.2701109071354171E-2,0,1.2726972537970635E-2,4.2572365474370023E-2,1.8124063020833329E-3,1.8124063020833329E-3,0.11990543341615525,4.3131938888148127E-5,4.3131938888148127E-5,0.13850428075358029,3.5489356206073193E-2,1.8486988239733346E-3,30,22.342630641114219,0.2006633164505377,0.1135840557449217,0.31609607101943271,0.35406435220527344,0.23517956338128537,4.1482070274159018E-2,4.9914868247280045E-3,8.1273976658574956E-3,1.9310719793156073E-3,1.5049956469901107E-2,5.6998478513801916E-2,3.2037924040564728E-2,9.0863520619396246E-2,6.8401856487013395E-3,0.508766536987173,0.52334904776611513,3.24,0.86093528898767191,1.008896084416573E-2,1.1146593502614649E-2,1.7448762098352631E-2,8.3993290818204613E-2,2.1596183512878867E-3,5.1312592980496221E-4,3.9990859946500588E-3,3.3749484595093342E-3,0,1.1461051935576051E-5,4.8159399489110857E-4,2.4144324500894192E-2,0.15736176554631076,0.86093528898767191,86.09352889876719,270,72.8349974854723,0.72834997485472297,616.23294132444494,null,3.0181642548501846E-2,null,0.508766536987173,9.0863520619396246E-2,1.2726972537970635E-2,null,null,{"$f":"IF(OR(MODE=1,MODE=2,MODE=3), BR96, IF(MODE_ILIM=4,#REF!,#REF!))","v":86.09352889876719},{"$f":"IF(OR(MODE=1,MODE=2,MODE=3), BZ96, IF(MODE_ILIM=4,#REF!,#REF!))","v":0.508766536987173},{"$f":"IF(OR(MODE=1,MODE=2,MODE=3), CA96, IF(MODE_ILIM=4,#REF!,#REF!))","v":9.0863520619396246E-2},{"$f":"IF(OR(MODE=1,MODE=2,MODE=3), CB96, IF(MODE_ILIM=4,#REF!,#REF!))","v":1.2726972537970635E-2},{"$f":"(IF(OR(MODE=1,MODE=2,MODE=3), S96, IF(MODE_ILIM=4,#REF!,#REF!)))/1000","v":616.23294132444494},{"$f":"IF(OR(MODE=1,MODE=2,MODE=3), P96, IF(MODE_ILIM=4,#REF!,#REF!))","v":147.74976146106229}]
[null,null,null,null,null,null,null,91,0.27300000000000002,0.14770225000000001,0.34737841969791672,0.1994618841828954,147.72450765607073,147.72450765607073,1,147.72450765607073,1.2056184883717135E-6,0.25683935119088797,616414.44285813114,1.6222851550383801E-6,0,6.5999999999999989E-4,0.27629948661205173,1.2978039071354169E-2,0,1.3005043866141283E-2,4.2572365474370023E-2,1.8124063020833329E-3,1.8124063020833329E-3,0.12120669758168534,4.4073190615974383E-5,4.4073190615974383E-5,0.14002670196654299,3.6273832937710047E-2,1.8492433285743934E-3,30,22.149320451350082,0.20205387381002393,0.11361751010761073,0.31752062724620905,0.35634449767156828,0.23776462684790836,4.2399013335093827E-2,4.9929569871508626E-3,8.2540606122252363E-3,1.9537580656674167E-3,1.5200775665043516E-2,5.8085645062667578E-2,3.2037924040564721E-2,9.0880846755801936E-2,6.8422003157252564E-3,0.51215318980576308,0.52701471316460369,3.2760000000000002,0.86142185794331083,1.020870897263837E-2,1.1276545749132342E-2,1.7271856141809105E-2,8.3491821934601584E-2,2.1703993370451049E-3,5.1373928659919255E-4,3.9970330938831657E-3,3.4125660956369924E-3,0,1.1589013963950652E-5,4.765709414190445E-4,2.3897053682492127E-2,0.15672788424922096,0.86142185794331083,86.142185794331084,273,73.305168165960453,0.73305168165960455,616.41444285813111,null,2.9875643056102234E-2,null,0.51215318980576308,9.0880846755801936E-2,1.3005043866141283E-2,null,null,{"$f":"IF(OR(MODE=1,MODE=2,MODE=3), BR97, IF(MODE_ILIM=4,#REF!,#REF!))","v":86.142185794331084},{"$f":"IF(OR(MODE=1,MODE=2,MODE=3), BZ97, IF(MODE_ILIM=4,#REF!,#REF!))","v":0.51215318980576308},{"$f":"IF(OR(MODE=1,MODE=2,MODE=3), CA97, IF(MODE_ILIM=4,#REF!,#REF!))","v":9.0880846755801936E-2},{"$f":"IF(OR(MODE=1,MODE=2,MODE=3), CB97, IF(MODE_ILIM=4,#REF!,#REF!))","v":1.3005043866141283E-2},{"$f":"(IF(OR(MODE=1,MODE=2,MODE=3), S97, IF(MODE_ILIM=4,#REF!,#REF!)))/1000","v":616.41444285813111},{"$f":"IF(OR(MODE=1,MODE=2,MODE=3), P97, IF(MODE_ILIM=4,#REF!,#REF!))","v":147.72450765607073}]
[null,null,null,null,null,null,null,92,0.27600000000000002,0.147677,0.35037852595833335,0.20247450963007468,147.69925385107913,147.69925385107913,1,147.69925385107913,1.2051408855288756E-6,0.25691498729463857,616595.96950713254,1.6218075521955426E-6,0,6.6E-4,0.27926404405523342,1.3258029071354172E-2,0,1.3286212910877471E-2,4.2572365474370023E-2,1.8124063020833329E-3,1.8124063020833329E-3,0.12250865221119821,4.5025109599812959E-5,4.5025109599812959E-5,0.14154995730917355,3.706732226632338E-2,1.8497879085213977E-3,30,21.959326637835517,0.20344522354290889,0.11365096909955467,0.31894598055098494,0.35863587836627331,0.24035110666245951,4.3326490855401745E-2,4.9944273530077741E-3,8.3807970813797265E-3,1.9764727955109843E-3,1.5351697229898483E-2,5.9184060893446529E-2,3.2037924040564728E-2,9.089817528971561E-2,6.8442152615291723E-3,0.51556232981096461,0.53070597413352527,3.3120000000000003,0.86189264083542283,1.0328632500756935E-2,1.1406639997594822E-2,1.7098489177407191E-2,8.3000360344484242E-2,2.1809623577222752E-3,5.1434400883524538E-4,3.9950226047050265E-3,3.4501804615284584E-3,0,1.1717032191089111E-5,4.7164844624678949E-4,2.3654730781272389E-2,0.15611272771274445,0.86189264083542283,86.189264083542284,276,73.638455592594738,0.73638455592594743,616.59596950713251,null,2.9575765063623253E-2,null,0.51556232981096461,9.089817528971561E-2,1.3286212910877471E-2,null,null,{"$f":"IF(OR(MODE=1,MODE=2,MODE=3), BR98, IF(MODE_ILIM=4,#REF!,#REF!))","v":86.189264083542284},{"$f":"IF(OR(MODE=1,MODE=2,MODE=3), BZ98, IF(MODE_ILIM=4,#REF!,#REF!))","v":0.51556232981096461},{"$f":"IF(OR(MODE=1,MODE=2,MODE=3), CA98, IF(MODE_ILIM=4,#REF!,#REF!))","v":9.089817528971561E-2},{"$f":"IF(OR(MODE=1,MODE=2,MODE=3), CB98, IF(MODE_ILIM=4,#REF!,#REF!))","v":1.3286212910877471E-2},{"$f":"(IF(OR(MODE=1,MODE=2,MODE=3), S98, IF(MODE_ILIM=4,#REF!,#REF!)))/1000","v":616.59596950713251},{"$f":"IF(OR(MODE=1,MODE=2,MODE=3), P98, IF(MODE_ILIM=4,#REF!,#REF!))","v":147.69925385107913}]
[null,null,null,null,null,null,null,93,0.27900000000000003,0.14765174999999997,0.35337863221875004,0.20548713507725391,147.67400004608754,147.67400004608754,1,147.67400004608754,1.2046634977824335E-6,0.25699063386527615,616777.52127666282,1.6213301644491E-6,0,6.6E-4,0.28222935053265341,1.3541079071354172E-2,0,1.3570480503279159E-2,4.2572365474370023E-2,1.8124063020833329E-3,1.8124063020833329E-3,0.1238112834150783,4.5987701702666525E-5,4.5987701702666525E-5,0.14307403459433435,3.7869831843936448E-2,1.8503325638299884E-3,30,21.772564584145432,0.20483736581367126,0.1136844327217145,0.32037213109921575,0.36093852034493018,0.24293898213124132,4.4264511779222693E-2,4.9958979223409692E-3,8.5076070885826277E-3,1.9992161852919813E-3,1.5502721196215579E-2,6.0293748306399324E-2,3.2037924040564728E-2,9.0915506221634967E-2,6.8462304861709577E-3,0.51899400535913542,0.53442287986620063,3.3480000000000003,0.86234810158428232,1.0448730213312689E-2,1.1536874909342017E-2,1.692855587887588E-2,8.2518607841672489E-2,2.1913138655508396E-3,5.1494034708575583E-4,3.9930532236997964E-3,3.4877908693503362E-3,0,1.1845103721481105E-5,4.6682351669681934E-4,2.3417208540860487E-2,0.1555157443101686,0.86234810158428232,86.234810158428232,279,73.832411821820315,0.73832411821820321,616.77752127666281,null,2.9281826385082602E-2,null,0.51899400535913542,9.0915506221634967E-2,1.3570480503279159E-2,null,null,{"$f":"IF(OR(MODE=1,MODE=2,MODE=3), BR99, IF(MODE_ILIM=4,#REF!,#REF!))","v":86.234810158428232},{"$f":"IF(OR(MODE=1,MODE=2,MODE=3), BZ99, IF(MODE_ILIM=4,#REF!,#REF!))","v":0.51899400535913542},{"$f":"IF(OR(MODE=1,MODE=2,MODE=3), CA99, IF(MODE_ILIM=4,#REF!,#REF!))","v":9.0915506221634967E-2},{"$f":"IF(OR(MODE=1,MODE=2,MODE=3), CB99, IF(MODE_ILIM=4,#REF!,#REF!))","v":1.3570480503279159E-2},{"$f":"(IF(OR(MODE=1,MODE=2,MODE=3), S99, IF(MODE_ILIM=4,#REF!,#REF!)))/1000","v":616.77752127666281},{"$f":"IF(OR(MODE=1,MODE=2,MODE=3), P99, IF(MODE_ILIM=4,#REF!,#REF!))","v":147.67400004608754}]
[null,null,null,null,null,null,null,94,0.28199999999999997,0.14762649999999999,0.35637873847916662,0.20849976052443314,147.64874624109601,147.64874624109601,1,147.64874624109601,1.2041863249871121E-6,0.2570662909049734,616959.09817193612,1.6208529916537786E-6,0,6.6E-4,0.2851953826801607,1.3827189071354162E-2,0,1.3857847483718861E-2,4.2572365474370023E-2,1.8124063020833329E-3,1.8124063020833329E-3,0.12511457786818841,4.6960972785404941E-5,4.6960972785404941E-5,0.14459892213850165,3.8681369324690455E-2,1.8508772945158083E-3,30,21.588952528198465,0.20623030078683491,0.11371790097505126,0.32179907905640198,0.3632524498170861,0.2455282334156898,4.5213085053172092E-2,4.9973686951926832E-3,8.6344906490998068E-3,2.0219882514606268E-3,1.5653847595753115E-2,6.1414729770683366E-2,3.2037924040564728E-2,9.0932839552057748E-2,6.8482459897084916E-3,0.52244826512953568,0.53816547988812324,3.3839999999999995,0.86278868582988144,1.0569000969807767E-2,1.1667249229942117E-2,1.6761955057305947E-2,8.2046277931542316E-2,2.2014600590860587E-3,5.1552854203344397E-4,3.9911236983809339E-3,3.5253966570907083E-3,0,1.1973225766788523E-5,4.6209327764901718E-4,2.3184345489331966E-2,0.15493640413793705,0.86278868582988144,86.278868582988139,282,73.8844086186851,0.73884408618685105,616.95909817193615,null,2.8993651991015685E-2,null,0.52244826512953568,9.0932839552057748E-2,1.3857847483718861E-2,null,null,{"$f":"IF(OR(MODE=1,MODE=2,MODE=3), BR100, IF(MODE_ILIM=4,#REF!,#REF!))","v":86.278868582988139},{"$f":"IF(OR(MODE=1,MODE=2,MODE=3), BZ100, IF(MODE_ILIM=4,#REF!,#REF!))","v":0.52244826512953568},{"$f":"IF(OR(MODE=1,MODE=2,MODE=3), CA100, IF(MODE_ILIM=4,#REF!,#REF!))","v":9.0932839552057748E-2},{"$f":"IF(OR(MODE=1,MODE=2,MODE=3), CB100, IF(MODE_ILIM=4,#REF!,#REF!))","v":1.3857847483718861E-2},{"$f":"(IF(OR(MODE=1,MODE=2,MODE=3), S100, IF(MODE_ILIM=4,#REF!,#REF!)))/1000","v":616.95909817193615},{"$f":"IF(OR(MODE=1,MODE=2,MODE=3), P100, IF(MODE_ILIM=4,#REF!,#REF!))","v":147.64874624109601}]
[null,null,null,null,null,null,null,95,0.28499999999999998,0.14760124999999999,0.35937884473958331,0.21151238597161237,147.62349243610444,147.62349243610444,1,147.62349243610444,1.2037093669977655E-6,0.25714195841590387,617140.70019816933,1.6203760336644321E-6,0,6.6E-4,0.28816211808994485,1.4116359071354166E-2,0,1.4148314701847894E-2,4.2572365474370023E-2,1.8124063020833329E-3,1.8124063020833329E-3,0.12641852278149154,4.794492870676349E-5,4.794492870676349E-5,0.14612460873615651,3.9501942364845437E-2,1.8514221005945081E-3,30,21.408411442907422,0.20762402862696988,0.11375137386052657,0.32322682458809093,0.36557769314706645,0.24811884148889099,4.6172219626342062E-2,4.9988396716051722E-3,8.7614477782013769E-3,2.0447890104716981E-3,1.5805076460278247E-2,6.2547027925187529E-2,3.2037924040564728E-2,9.0950175281481985E-2,6.8502617721996808E-3,0.52592515812593565,0.5419338240585736,3.42,0.86321482182066811,1.0689443700902511E-2,1.1797761785184791E-2,1.6598589459969913E-2,8.1583095261540728E-2,2.2114068955412839E-3,5.1610882495180916E-4,3.9892328247137787E-3,3.5629971872910989E-3,0,1.2101395640588738E-5,4.5745496582442113E-4,2.29560056579424E-2,0.1543741979595033,0.86321482182066811,86.321482182066816,285,73.791636151568156,0.73791636151568152,617.14070019816938,null,2.8711073660488494E-2,null,0.52592515812593565,9.0950175281481985E-2,1.4148314701847894E-2,null,null,{"$f":"IF(OR(MODE=1,MODE=2,MODE=3), BR101, IF(MODE_ILIM=4,#REF!,#REF!))","v":86.321482182066816},{"$f":"IF(OR(MODE=1,MODE=2,MODE=3), BZ101, IF(MODE_ILIM=4,#REF!,#REF!))","v":0.52592515812593565},{"$f":"IF(OR(MODE=1,MODE=2,MODE=3), CA101, IF(MODE_ILIM=4,#REF!,#REF!))","v":9.0950175281481985E-2},{"$f":"IF(OR(MODE=1,MODE=2,MODE=3), CB101, IF(MODE_ILIM=4,#REF!,#REF!))","v":1.4148314701847894E-2},{"$f":"(IF(OR(MODE=1,MODE=2,MODE=3), S101, IF(MODE_ILIM=4,#REF!,#REF!)))/1000","v":617.14070019816938},{"$f":"IF(OR(MODE=1,MODE=2,MODE=3), P101, IF(MODE_ILIM=4,#REF!,#REF!))","v":147.62349243610444}]
[null,null,null,null,null,null,null,96,{"$f":"IF(PLOT_TYPE=1, H102/100*Iout, min_I*EXP(H102*rr/100))","v":0.28799999999999998},{"$f":"IF(I102<Icrit, (Vin-(Rdcr+RdsonTop)*Iripple/2-Vout)/L*OnTime, (Vin-(Rdcr+RdsonTop)*I102-Vout)/L*OnTime)","v":0.14757599999999998},{"$f":"IF(I102<Icrit, (Vin-(Rdcr+RdsonTop)*Iripple/2-Vout)/L*OnTime, I102+((Vin-(Rdcr+RdsonTop)*J102-Vout)/L*OnTime)/2)","v":0.36237895099999995},{"$f":"IF(I102<Icrit, 0, I102-((Vin-(Rdcr+RdsonTop)*K102-Vout)/L*OnTime)/2)","v":0.21452501141879166},147.59823863111288,{"$f":"IF(I102<Icrit, 1000*SQRT((J102*CoutEsr)^2+(((J102/2)-I102)*(OnTime+OffTime)/Cout)^2), 1000*J102*SQRT(CoutEsr^2+(1/(8*Fsw*Cout))^2))","v":147.59823863111288},1,{"$f":"IF(I102<Icrit, 1000*((N102/1000)*O102), 1000*J102*SQRT(CoutEsr^2+(1/(8*Fsw*Cout))^2))","v":147.59823863111288},1.2032326236693799E-6,0.25721763640024164,617322.32736057998,1.6198992903360465E-6,0,{"$f":"S102*(T102*Iq_active+U102*Iq_sleep)","v":6.6E-4},0.29112953526236962,{"$f":"W102^2*Rdcr","v":1.4408589071354167E-2},{"$f":"Core_Loss/1000*S102/$S$106","v":0},{"$f":"(Y102+X102*(1+Ltc*(Ta-25)))/(1-X102*Ltc*ThetaCa)","v":1.4441883016602614E-2},4.2572365474370023E-2,1.8124063020833329E-3,1.8124063020833329E-3,0.12772310587535407,4.8939575323340719E-5,4.8939575323340719E-5,0.14765108363571336,4.0331558622780782E-2,1.85196698208174E-3,30,21.230864922768586,{"$f":"IF(I102<Icrit, Vin*(I102+Iripple/2)*AK102/1000000000/2*S102, Vin*(I102-Iripple/2)*AJ102/1000000000/2*S102 + Vin*(I102+Iripple/2)*AK102/1000000000/2*S102)","v":0.20901854949869142},0.1137848513791021,0.32465536785987525,{"$f":"(AI102+AL102+AM102+AH102*(1+RdsonTopTc*(Ta-25)))/(1-AH102*RdsonTopTc*ThetaJA)","v":0.3679142768547487},0.25071078809470732,4.7141924450301922E-2,5.0003108516206984E-3,{"$f":"IF(I102<Icrit, Vin*Idss*R102, QrrBot*(I102-Iripple/2)/1*S102*Vin+Vin*Idss*R102)","v":8.8884784911616686E-3},2.0676184787845261E-3,1.5956407821566893E-2,{"$f":"(AR102+AS102+AT102+AQ102*(1+RdsonBotTc*(Ta-25)))/(1-AQ102*RdsonBotTc*ThetaJA)","v":6.3690665579373043E-2},{"$f":"Vin*V102+Vout*Ifb/0.8","v":3.2037924040564728E-2},{"$f":"(Vin-Vdd)*(S102*QgBot+S102*QgTop)+AW102","v":9.0967513410405695E-2},6.8522778337024382E-3,0.52942473367822984,{"$f":"SUM(Z102,AC102,AF102,AZ102)","v":0.5457279625722391},3.4559999999999995,0.86362692125092511,1.0810057405068435E-2,1.1928411477306776E-2,1.6438365580767767E-2,8.1128795084609559E-2,2.2211601024094388E-3,5.1668141815804449E-4,3.9873794447812493E-3,3.6005918458516567E-3,0,1.2229610753421441E-5,4.5290592439930642E-4,2.2732058316111376E-2,0.15382863621021703,0.86362692125092511,86.362692125092508,288,73.551124384272143,0.73551124384272137,617.32232736057995,null,2.8433929653219919E-2,null,0.52942473367822984,9.0967513410405695E-2,1.4441883016602614E-2,null,null,{"$f":"IF(OR(MODE=1,MODE=2,MODE=3), BR102, IF(MODE_ILIM=4,#REF!,#REF!))","v":86.362692125092508},{"$f":"IF(OR(MODE=1,MODE=2,MODE=3), BZ102, IF(MODE_ILIM=4,#REF!,#REF!))","v":0.52942473367822984},{"$f":"IF(OR(MODE=1,MODE=2,MODE=3), CA102, IF(MODE_ILIM=4,#REF!,#REF!))","v":9.0967513410405695E-2},{"$f":"IF(OR(MODE=1,MODE=2,MODE=3), CB102, IF(MODE_ILIM=4,#REF!,#REF!))","v":1.4441883016602614E-2},{"$f":"(IF(OR(MODE=1,MODE=2,MODE=3), S102, IF(MODE_ILIM=4,#REF!,#REF!)))/1000","v":617.32232736057995},{"$f":"IF(OR(MODE=1,MODE=2,MODE=3), P102, IF(MODE_ILIM=4,#REF!,#REF!))","v":147.59823863111288}]
[null,null,null,null,null,null,null,97,{"$f":"IF(PLOT_TYPE=1, H103/100*Iout, min_I*EXP(H103*rr/100))","v":0.29099999999999998},0.14755075000000001,0.36537905726041664,0.21753763686597091,147.57298482612131,147.57298482612131,1,147.57298482612131,1.2027560948570721E-6,0.25729332486016121,617503.97966438695,{"$f":"IF(1/S103-OnTime-Q103>Tsleep, OnTime+Q103+Tsleep, 1/S103)","v":1.6194227615237385E-6},0,6.5999999999999989E-4,0.29409761356067365,1.4703879071354169E-2,0,1.4738553296210839E-2,4.2572365474370023E-2,1.8124063020833329E-3,1.8124063020833329E-3,0.12902831535441653,4.9944918489596285E-5,4.9944918489596285E-5,0.14917833651688117,{"$f":"RdsonTop*AG103^2","v":4.1170225758996114E-2},1.8525119389931608E-3,30,21.056239076047845,0.2104138635666602,0.1138183335317398,0.32608470903739317,0.37026222761634531,0.25330405570933712,{"$f":"RdsonBot*AP103^2","v":4.8122208479099218E-2},5.0017822352815345E-3,9.0155828032592346E-3,2.0904766728629958E-3,1.6107841711403764E-2,6.4845665714122244E-2,3.2037924040564721E-2,9.0984853939327093E-2,6.8542941742746957E-3,0.53294704144406946,0.54954794596085321,3.492,0.86402538005021701,1.0930841145433745E-2,1.2059197281434541E-2,1.6281193481522151E-2,8.0683122753321318E-2,2.2307251884193186E-3,5.1724653544002377E-4,3.9855624445831539E-3,3.6381800409047015E-3,0,1.235786860811871E-5,4.4844359792753726E-4,2.2512377721575192E-2,0.15329924805916981,0.86402538005021701,86.402538005021697,291,73.159788011658193,0.73159788011658189,617.50397966438697,null,2.8162064400470744E-2,null,0.53294704144406946,9.0984853939327093E-2,1.4738553296210839E-2,null,null,{"$f":"IF(OR(MODE=1,MODE=2,MODE=3), BR103, IF(MODE_ILIM=4,#REF!,#REF!))","v":86.402538005021697},{"$f":"IF(OR(MODE=1,MODE=2,MODE=3), BZ103, IF(MODE_ILIM=4,#REF!,#REF!))","v":0.53294704144406946},{"$f":"IF(OR(MODE=1,MODE=2,MODE=3), CA103, IF(MODE_ILIM=4,#REF!,#REF!))","v":9.0984853939327093E-2},{"$f":"IF(OR(MODE=1,MODE=2,MODE=3), CB103, IF(MODE_ILIM=4,#REF!,#REF!))","v":1.4738553296210839E-2},{"$f":"(IF(OR(MODE=1,MODE=2,MODE=3), S103, IF(MODE_ILIM=4,#REF!,#REF!)))/1000","v":617.50397966438697},{"$f":"IF(OR(MODE=1,MODE=2,MODE=3), P103, IF(MODE_ILIM=4,#REF!,#REF!))","v":147.57298482612131}]
[null,null,null,null,null,null,null,98,{"$f":"IF(PLOT_TYPE=1, H104/100*Iout, min_I*EXP(H104*rr/100))","v":0.29399999999999998},0.1475255,0.36837916352083333,0.22055026231315017,147.54773102112972,147.54773102112972,1,147.54773102112972,1.2022797804160882E-6,0.25736902379783788,617685.65711481089,{"$f":"IF(1/S104-OnTime-Q104>Tsleep, OnTime+Q104+Tsleep, 1/S104)","v":1.618946447082755E-6},0,6.5999999999999989E-4,0.29706633316834025,1.5002229071354168E-2,0,1.5038326418198265E-2,4.2572365474370023E-2,1.8124063020833329E-3,1.8124063020833329E-3,0.13033413988392692,5.0960964057849088E-5,5.0960964057849088E-5,0.15070635746935876,{"$f":"RdsonTop*AG104^2","v":4.2017951436111971E-2},1.8530569713444327E-3,30,20.884462422244134,0.21180997099558269,0.11385182031940194,0.32751484828632904,0.37262157226519155,0.25589862750513953,{"$f":"RdsonBot*AP104^2","v":4.9113080669260616E-2},5.0032538226299685E-3,9.1427607297768689E-3,2.1133636091755529E-3,1.6259378161582391E-2,6.601205148259448E-2,3.2037924040564721E-2,9.100219686874457E-2,6.856310793974401E-3,0.536492131410505,0.55339382509484447,3.5279999999999996,0.86441057912807895,1.1051794046808092E-2,1.2190118242229644E-2,1.6126986623405476E-2,8.0245833242695755E-2,2.2401074538707147E-3,5.1780438245908357E-4,3.9837807519602824E-3,3.675761201752086E-3,0,1.2486166795399816E-5,4.4406552755080328E-4,2.2296842884704918E-2,0.15278558052423225,0.86441057912807895,86.441057912807892,294,72.614496083320674,0.72614496083320679,617.68565711481085,null,2.7895328213458113E-2,null,0.536492131410505,9.100219686874457E-2,1.5038326418198265E-2,null,null,{"$f":"IF(OR(MODE=1,MODE=2,MODE=3), BR104, IF(MODE_ILIM=4,#REF!,#REF!))","v":86.441057912807892},{"$f":"IF(OR(MODE=1,MODE=2,MODE=3), BZ104, IF(MODE_ILIM=4,#REF!,#REF!))","v":0.536492131410505},{"$f":"IF(OR(MODE=1,MODE=2,MODE=3), CA104, IF(MODE_ILIM=4,#REF!,#REF!))","v":9.100219686874457E-2},{"$f":"IF(OR(MODE=1,MODE=2,MODE=3), CB104, IF(MODE_ILIM=4,#REF!,#REF!))","v":1.5038326418198265E-2},{"$f":"(IF(OR(MODE=1,MODE=2,MODE=3), S104, IF(MODE_ILIM=4,#REF!,#REF!)))/1000","v":617.68565711481085},{"$f":"IF(OR(MODE=1,MODE=2,MODE=3), P104, IF(MODE_ILIM=4,#REF!,#REF!))","v":147.54773102112972}]
[null,null,null,null,null,null,null,99,{"$f":"IF(PLOT_TYPE=1, H105/100*Iout, min_I*EXP(H105*rr/100))","v":0.29699999999999999},0.14750025000000003,0.37137926978124997,0.2235628877603294,147.52247721613818,147.52247721613818,1,147.52247721613818,1.2018036802018053E-6,0.25744473321544759,617867.3597170742,{"$f":"IF(1/S105-OnTime-Q105>Tsleep, OnTime+Q105+Tsleep, 1/S105)","v":1.6184703468684718E-6},0,6.6E-4,0.30003567504895701,1.5303639071354166E-2,0,1.5341203269394981E-2,4.2572365474370023E-2,1.8124063020833329E-3,1.8124063020833329E-3,0.13164056856743825,5.1987717878275233E-5,5.1987717878275233E-5,0.15223513697277397,{"$f":"RdsonTop*AG105^2","v":4.2874743318870617E-2},1.8536020791512227E-3,30,20.715465794531173,0.21320687195021107,0.11388531174305111,0.3289457857724134,0.37499233779253976,0.25849448731657104,{"$f":"RdsonBot*AP105^2","v":5.0114549979792672E-2},5.0047256137083019E-3,9.270012286001595E-3,2.1362793041952042E-3,1.6411017203905101E-2,6.7189846211089282E-2,3.2037924040564728E-2,9.1019542199156644E-2,6.8583276928595241E-3,0.54006005389564526,0.55726565118500182,3.5640000000000001,0.86478288507687695,1.1172915292875245E-2,1.2321173470723385E-2,1.5975661707834883E-2,7.9816690699817047E-2,2.2493120003890445E-3,5.1835515713017733E-4,3.9820333346350491E-3,3.7133347778621978E-3,0,1.2614502989713128E-5,4.3976934647787272E-4,2.2085337346061513E-2,0.15228719763679613,0.86478288507687695,86.478288507687694,297,71.912167665597565,0.71912167665597559,617.86735971707424,null,2.7633577008146819E-2,null,0.54006005389564526,9.1019542199156644E-2,1.5341203269394981E-2,null,null,{"$f":"IF(OR(MODE=1,MODE=2,MODE=3), BR105, IF(MODE_ILIM=4,#REF!,#REF!))","v":86.478288507687694},{"$f":"IF(OR(MODE=1,MODE=2,MODE=3), BZ105, IF(MODE_ILIM=4,#REF!,#REF!))","v":0.54006005389564526},{"$f":"IF(OR(MODE=1,MODE=2,MODE=3), CA105, IF(MODE_ILIM=4,#REF!,#REF!))","v":9.1019542199156644E-2},{"$f":"IF(OR(MODE=1,MODE=2,MODE=3), CB105, IF(MODE_ILIM=4,#REF!,#REF!))","v":1.5341203269394981E-2},{"$f":"(IF(OR(MODE=1,MODE=2,MODE=3), S105, IF(MODE_ILIM=4,#REF!,#REF!)))/1000","v":617.86735971707424},{"$f":"IF(OR(MODE=1,MODE=2,MODE=3), P105, IF(MODE_ILIM=4,#REF!,#REF!))","v":147.52247721613818}]
[null,null,null,null,null,null,null,100,{"$f":"IF(PLOT_TYPE=1, H106/100*Iout, min_I*EXP(H106*rr/100))","v":0.3},0.14747499999999997,0.37437937604166666,0.22657551320750868,147.49722341114656,147.49722341114656,1,147.49722341114656,1.2013277940697293E-6,0.25752045311516686,618049.08747640043,{"$f":"IF(1/S106-OnTime-Q106>Tsleep, OnTime+Q106+Tsleep, 1/S106)","v":1.6179944607363959E-6},0,6.6E-4,0.30300562090839722,1.5608109071354168E-2,0,1.5647184745942056E-2,4.2572365474370023E-2,1.8124063020833329E-3,1.8124063020833329E-3,0.13294759092578032,5.3025185798905878E-5,5.3025185798905878E-5,0.15376466587778317,{"$f":"RdsonTop*AG106^2","v":4.3740609074136648E-2},1.8541472624292012E-3,30,20.549182246897892,0.21460456659534305,0.11391880780365013,0.33037752166142237,0.37737455134835807,0.26109161960809285,{"$f":"RdsonBot*AP106^2","v":5.1126625372182793E-2},5.0061976085588435E-3,9.3973374872246725E-3,2.1592237743995159E-3,1.656275887018303E-2,6.8379073399917015E-2,3.2037924040564728E-2,9.1036889931061918E-2,6.8603448709880447E-3,0.54365085955032511,0.56116347578414938,3.5999999999999996,0.86514265083555719,1.129420412354248E-2,1.2452362141328627E-2,1.5827138526220579E-2,7.9395468018512411E-2,2.2583437401371967E-3,5.1889904998087628E-4,3.9803191983611907E-3,3.7509002379227368E-3,0,1.2742874945309271E-5,4.3555277571540122E-4,2.1877748966328821E-2,{"$f":"SUM(BD106:BO106)","v":0.15180367965299565},0.86514265083555719,86.514265083555713,300,71.049894896969974,0.71049894896969978,618.04908747640047,null,2.7376672045354513E-2,null,0.54365085955032511,9.1036889931061918E-2,1.5647184745942056E-2,null,null,{"$f":"IF(OR(MODE=1,MODE=2,MODE=3), BR106, IF(MODE_ILIM=4,#REF!,#REF!))","v":86.514265083555713},{"$f":"IF(OR(MODE=1,MODE=2,MODE=3), BZ106, IF(MODE_ILIM=4,#REF!,#REF!))","v":0.54365085955032511},{"$f":"IF(OR(MODE=1,MODE=2,MODE=3), CA106, IF(MODE_ILIM=4,#REF!,#REF!))","v":9.1036889931061918E-2},{"$f":"IF(OR(MODE=1,MODE=2,MODE=3), CB106, IF(MODE_ILIM=4,#REF!,#REF!))","v":1.5647184745942056E-2},{"$f":"(IF(OR(MODE=1,MODE=2,MODE=3), S106, IF(MODE_ILIM=4,#REF!,#REF!)))/1000","v":618.04908747640047},{"$f":"IF(OR(MODE=1,MODE=2,MODE=3), P106, IF(MODE_ILIM=4,#REF!,#REF!))","v":147.49722341114656}]
[null,null,null,null,null,null,null,null,{"$f":"Losses!$E$5/1000","v":0.5},0.14579166666666665,0.57438646006944438,0.42741720968612557,145.81363641170876,145.81363641170876,1,145.81363641170876,{"$f":"IF(I107<Icrit, L*J107/(Vout+J107/2*(RdsonBot+Rdcr)), L*J107/(Vout+I107*(RdsonBot+Rdcr)))","v":1.1700775815944354E-6},{"$f":"OnTime*S107","v":0.26259220231822972},{"$f":"IF(I107<Icrit,I107/((OnTime+Q107)*J107/2),1/(OnTime+Q107))","v":630221.28556375136},{"$f":"IF(1/S107-OnTime-Q107>Tsleep, OnTime+Q107+Tsleep, 1/S107)","v":1.5867442482611021E-6},{"$f":"IF(1/S107-OnTime-Q107>Tsleep, 1/S107-OnTime-Q107-Tsleep, 0)","v":0},6.6E-4,{"$f":"IF(I107<Icrit,Iripple*SQRT((OnTime+OffTime)*S107/3), SQRT(I107^2+Iripple^2/12))","v":0.5018091333386463},4.2808109071354163E-2,0,4.3103336645185591E-2,{"$f":"Iripple/SQRT(12)*SQRT((OnTime+Q107)*S107)","v":4.2572365474370023E-2},{"$f":"RCoutEsr*AA107^2","v":1.8124063020833329E-3},{"$f":"AB107","v":1.8124063020833329E-3},{"$f":"SQRT($R107)*SQRT($I107^2*(1-R107)+(Iripple^2)/12)","v":0.22110022198616719},{"$f":"RCinEsr*AD107^2","v":1.4665592448699722E-4},{"$f":"AE107","v":1.4665592448699722E-4},{"$f":"IF(I107<Icrit,Iripple*SQRT((OnTime)*S107/3), SQRT(OnTime*S107*(I107^2+Iripple^2/12)))","v":0.25714582310805073},{"$f":"RdsonTop*AG107^2","v":0.1223293525325463},{"$f":"QgTop*S107*Vdd","v":1.8906638566912541E-3},30,{"$f":"IF(I107<Icrit, Csw*Vin/Iripple*1000000000, Csw*Vin/(I107+Iripple/2)*1000000000)","v":13.385912547114316},0.30958297188619605,{"$f":"IF(I107<Icrit, Csw*(Vin)^2*S107/2, Csw*Vin^2*S107/2)","v":0.11616238735511066},0.42763602309799792,0.56356598955045634,{"$f":"IF(I107<Icrit,Iripple*SQRT((OffTime)*S107/3), SQRT(OffTime*S107*(I107^2+Iripple^2/12)))","v":0.43663229811262966},{"$f":"RdsonBot*AP107^2","v":0.14298582281633723},{"$f":"QgBot*S107*Vdd","v":5.1047924130663861E-3},1.8052587889567966E-2,{"$f":"IF(I107<Icrit, dead1*S107*(I107+Iripple/2)*((I107+Iripple/2)*BDserR+VSD), dead1*S107*(I107+Iripple/2)*((I107+Iripple/2)*BDserR+VSD)+dead2*S107*(I107-Iripple/2)*((I107-Iripple/2)*BDserR+VSD))","v":3.7546139606289045E-3},2.6911994263263257E-2,0.17482944867322059,3.2037924040564728E-2,9.2198847960480432E-2,{"$f":"AI107+AR107","v":6.9954562697576404E-3},{"$f":"AO107+AV107+AX107+AY107","v":0.83758974245391493},0.88265214132567082,{"$f":"Vout*I107","v":6},{"$f":"BB107/(BB107+BA107)","v":0.87175697344546277},1.9749649359189738E-2,2.149134539603027E-2,{"$f":"Vin*S107*(QgBot+QgTop)/($BB107+$BA107)","v":9.7573404569504113E-3},6.2132447538694111E-2,{"$f":"AS107/(BA107+BB107)","v":2.6229115635779975E-3},{"$f":"AT107/($BB107+$BA107)","v":5.4551848379565593E-4},3.9101197780540059E-3,{"$f":"X107/($BB107+$BA107)","v":6.2197112671611605E-3},{"$f":"Y107/($BB107+$BA107)","v":0},{"$f":"(AF107)/($BB107+$BA107)","v":2.1308054144771837E-5},{"$f":"(AC107)/($BB107+$BA107)","v":2.6332963875960822E-4},1.33958314421978E-2,{"$f":"SUM(BD107:BO107)","v":0.14010951297855551},{"$f":"BC107","v":0.87175697344546277},{"$f":"100*BQ107","v":87.175697344546279},{"$f":"I107*1000","v":500},72.049894896970002,{"$f":"BT107/100","v":0.72049894896970001},{"$f":"S107/1000","v":630.22128556375139},null,{"$f":"AM107/($BB107+$BA107)","v":1.6877561871481792E-2},null,0.83758974245391493,9.2198847960480432E-2,4.3103336645185591E-2,null,null,{"$f":"IF(OR(MODE=1,MODE=2,MODE=3), BR107, IF(MODE_ILIM=4,#REF!,#REF!))","v":87.175697344546279},{"$f":"IF(OR(MODE=1,MODE=2,MODE=3), BZ107, IF(MODE_ILIM=4,#REF!,#REF!))","v":0.83758974245391493},{"$f":"IF(OR(MODE=1,MODE=2,MODE=3), CA107, IF(MODE_ILIM=4,#REF!,#REF!))","v":9.2198847960480432E-2},{"$f":"IF(OR(MODE=1,MODE=2,MODE=3), CB107, IF(MODE_ILIM=4,#REF!,#REF!))","v":4.3103336645185591E-2},{"$f":"(IF(OR(MODE=1,MODE=2,MODE=3), S107, IF(MODE_ILIM=4,#REF!,#REF!)))/1000","v":630.22128556375139},{"$f":"IF(OR(MODE=1,MODE=2,MODE=3), P107, IF(MODE_ILIM=4,#REF!,#REF!))","v":145.81363641170876}]
[null,null,null,null,null,null,null,null,null,null,null,null,null,null,null,null,null,null,null,null,null,null,null,null,null,null,null,null,null,null,null,null,null,null,null,null,null,null,null,null,null,null,null,null,null,null,null,null,null,null,null,null,null,null,null,{"$f":"IF(OR(MODE=1, MODE=2,MODE=3),Efficiency!BD107,IF(AND(MODE=4,MODE_ILIM=4),#REF!,#REF!))","v":1.9749649359189738E-2},{"$f":"IF(OR(MODE=1, MODE=2,MODE=3),Efficiency!BE107,IF(AND(MODE=4,MODE_ILIM=4),#REF!,#REF!))","v":2.149134539603027E-2},null,{"$f":"IF(OR(MODE=1, MODE=2,MODE=3),Efficiency!BG107,IF(AND(MODE=4,MODE_ILIM=4),#REF!,#REF!))","v":6.2132447538694111E-2},null,null,{"$f":"IF(OR(MODE=1, MODE=2,MODE=3),Efficiency!BJ107,IF(AND(MODE=4,MODE_ILIM=4),#REF!,#REF!))","v":3.9101197780540059E-3},{"$f":"IF(OR(MODE=1, MODE=2,MODE=3),Efficiency!BK107,IF(AND(MODE=4,MODE_ILIM=4),#REF!,#REF!))","v":6.2197112671611605E-3},{"$f":"IF(OR(MODE=1, MODE=2,MODE=3),Efficiency!BL107,IF(AND(MODE=4,MODE_ILIM=4),#REF!,#REF!))","v":0},null,null,{"$f":"IF(OR(MODE=1, MODE=2,MODE=3),Efficiency!BO107,IF(AND(MODE=4,MODE_ILIM=4),#REF!,#REF!))","v":1.33958314421978E-2}]
[null,null,null,null,null,null,null,1.0000000000000001E-5,"A","min_I",null,null,null,null,null,null,null,null,null,null,null,null,null,null,null,null,null,null,null,null,null,null,null,null,null,null,null,null,null,null,null,null,null,null,null,null,null,null,null,null,null,null,null,null,"Load (A)","High-side MOSFET Rdson %","Low-side MOSFET Rdson %","Gate Drive (Qg) Loss from Vin %","High-side MOSFET Switching Loss %","Reverse Recovery & Leakage Loss %","Deadtime Loss %",null,"Inductor Cu Loss %","Inductor Core Loss %","Cin ESR %","Cout ESR %","Quiescent Current Loss %","Total Loss %","Overall Eff %"]
[null,null,null,null,null,null,null,{"$f":"Iout","v":0.3},"A","max_I",null,null,null,null,null,null,null,null,null,null,null,null,null,null,null,null,null,null,null,null,null,null,null,null,null,null,null,null,null,null,null,null,null,null,null,null,null,null,null,null,null,null,null,null,{"$f":"I107","v":0.5},{"$f":"BD107","v":1.9749649359189738E-2},{"$f":"BE107","v":2.149134539603027E-2},9.7573404569504113E-3,6.2132447538694111E-2,2.6229115635779975E-3,5.4551848379565593E-4,null,6.2197112671611605E-3,0,2.1308054144771837E-5,2.6332963875960822E-4,1.33958314421978E-2,0.14010951297855551,0.87175697344546277]
[null,null,null,null,null,null,null,{"$f":"LOG(max_I/min_I,EXP(1))","v":10.308952660644293},null,"rr",null,null,null,null,null,null,null,null,null,null,null,null,null,null,null,null,null,null,null,null,null,null,null,null,null,null,null,null,null,null,null,null,null,null,null,null,null,null,null,null,null,null,null,null,"10mA",{"$f":"BD70","v":7.0435557508601917E-3},{"$f":"BE70","v":7.824882190215347E-3},2.3774861306817548E-2,0.1019153070709448,1.7731280853227542E-3,4.9299408419508294E-4,null,2.3988673461956436E-3,0,8.1668683463408239E-6,6.6125163843222317E-4,3.2987264974970155E-2,0.18295361222704562,0.84060829693461969]
[null,null,null,null,null,null,null,null,null,null,null,null,null,null,null,null,null,null,null,null,null,null,null,null,null,null,null,null,null,null,null,null,null,null,null,null,null,null,null,null,null,null,null,null,null,null,null,null,null,null,null,null,null,null,"50ma",{"$f":"BD85","v":8.7837427842188918E-3},{"$f":"BE85","v":9.7269723477612334E-3},1.9663281385653909E-2,9.0268965444506855E-2,2.0244986793312839E-3,5.0572585111226948E-4,null,2.9611657034038282E-3,0,1.0058132830511894E-5,5.4447834072478263E-4,2.7239771896010276E-2,0.16575356020132576,0.85438700982296811]
[null,null,null,null,null,null,null,null,null,null,null,null,null,null,null,null,null,null,null,null,null,null,null,null,null,null,null,null,null,null,null,null,null,null,null,null,null,null,null,null,null,null,null,null,null,null,null,null,null,null,null,null,null,null,"100mA",{"$f":"BD91","v":9.4928994545921044E-3},{"$f":"BE91","v":1.0499015607763515E-2},1.8390380877424676E-2,8.666208114881685E-2,2.1021986393296695E-3,5.0992009803247989E-4,null,3.1868372839757879E-3,0,1.0822194353741965E-5,5.0833140731781901E-4,2.5460495493109931E-2,0.16083301840742351,0.85824801238249393]
[null,null,null,null,null,null,null,null,null,null,null,null,null,null,null,null,null,null,null,null,null,null,null,null,null,null,null,null,null,null,null,null,null,null,null,null,null,null,null,null,null,null,null,null,null,null,null,null,null,null,null,null,null,null,"500mA",{"$f":"BD106","v":1.129420412354248E-2},{"$f":"BE106","v":1.2452362141328627E-2},1.5827138526220579E-2,7.9395468018512411E-2,2.2583437401371967E-3,5.1889904998087628E-4,null,3.7509002379227368E-3,0,1.2742874945309271E-5,4.3555277571540122E-4,2.1877748966328821E-2,0.15180367965299565,0.86514265083555719]

{"sheet":"Design EMI Filter","index":7,"n_rows":33,"n_cols":15,"rows_kept":33,"cut":false,"hidden":false,"merged":[[0,0,0,22],[32,10,32,12],[29,10,29,12],[31,10,31,12]]}
["                         LM5168/9 100V, Low IQ DC/DC Converter Design Tool  "]
[]
[]
[]
[]
[]
["Step 7: EMI Filter (Optional)"]
[null,null,null,"Desired Maximum Noise Level, Vnoise(MAX)",50,"dBmV"]
[null,null,null,"EMI Filter Inductance, LF(EMI)",22,"mH"]
[null,null,null,"Minimum EMI Filter Capacitance",{"$f":"'Variable Mgmt'!M164","v":0.18358266618563782},"mF"]
[null,null,null,"EMI Filter Capacitance, CF(EMI)",4.7,"mF"]
[null,null,null,"Minimum EMI Filter Damping Capacitance",{"$f":"'Variable Mgmt'!M168","v":8.8000000000000007},"mF"]
[null,null,null,"EMI Filter Damping Capacitance, CD(EMI)",10,"mF"]
[null,null,null,"Minimum Damping Capacitor ESR",{"$f":"'Variable Mgmt'!M169","v":3.1622776601683795},"Ω"]
[null,null,null,"Damping Capacitor ESR, ESR CD(EMI)",3.3,"Ω"]
[]
[]
[]
[]
[]
[]
[]
[]
[]
[]
[]
[]
[]
[null,null,null,null,null,null,null,"EMI Filter BOM"]
[null,null,null,null,null,null,null,"Count","Ref Des","Value","Description",null,null,"Part Number","MFR"]
[null,null,null,null,null,null,null,1,"LF(EMI)",{"$f":"'Variable Mgmt'!B298","v":"22µH"},{"$f":"\"Inductor, \"&Lf_emi*1000000&\" µH, \"&ROUNDUP(Isat_min,2)&\"A\"","v":"Inductor, 22 µH, 0.51A"},null,null,"Std","Std"]
[null,null,null,null,null,null,null,1,"CF(EMI)",{"$f":"'Variable Mgmt'!B299","v":"4.7µF"},{"$f":"IF(VIN_max>35, \"Capacitor, Ceramic, \"&'Variable Mgmt'!B299&\", 120V, X7R, 10%\", \"Capacitor, Ceramic, \"&'Variable Mgmt'!B299&\", 50V, X7R, 10%\")","v":"Capacitor, Ceramic, 4.7µF, 120V, X7R, 10%"},null,null,"Std","Std"]
[null,null,null,null,null,null,null,1,"CD(EMI)",{"$f":"'Variable Mgmt'!B300","v":"10µF"},{"$f":"IF(VIN_max>35, \"Capacitor, Electrolytic, \"&'Variable Mgmt'!B300&\", 120V, ESR>\"&ESR_Cd&ohm, \"Capacitor, Electrolytic, \"&'Variable Mgmt'!B300&\", 50V, ESR>\"&ESR_Cd&ohm)","v":"Capacitor, Electrolytic, 10µF, 120V, ESR>3.3Ω"},null,null,"Std","Std"]

{"sheet":"EVM","index":8,"n_rows":85,"n_cols":15,"rows_kept":85,"cut":false,"hidden":true,"merged":[[0,0,0,16]]}
["LM5163/4 100V, Low IQ DC/DC Converter Design Tool  "]
[]
[null,"LM5164-Q1EVM-041 PCB Layout"]
[]
[null,null,null,null,null,null,null,null,null,null,null,null,null,null,"Top"]
[null,null,null,null,null,null,null,null,null,null,null,null,null,null,"Layer"]
[]
[]
[]
[]
[]
[]
[]
[]
[]
[]
[]
[]
[]
[]
[]
[]
[]
[]
[]
[]
[]
[]
[]
[]
[null,null,null,null,null,null,null,null,null,null,null,null,null,null,"Layer 2"]
[]
[]
[]
[]
[]
[]
[]
[]
[]
[]
[]
[]
[]
[]
[]
[]
[]
[]
[]
[]
[]
[]
[]
[]
[]
[null,null,null,null,null,null,null,null,null,null,null,null,null,null,"Layer 3"]
[]
[]
[]
[]
[]
[]
[]
[]
[]
[]
[]
[]
[]
[]
[]
[]
[]
[]
[]
[]
[]
[]
[]
[]
[]
[]
[null,null,null,null,null,null,null,null,null,null,null,null,null,null,"Bottom"]
[null,null,null,null,null,null,null,null,null,null,null,null,null,null,"Layer"]

{"sheet":"BOM & Schematic","index":9,"n_rows":53,"n_cols":13,"rows_kept":53,"cut":false,"hidden":true,"merged":[[33,3,33,5],[0,0,0,16],[29,3,29,5],[41,3,41,5],[47,7,47,9],[30,3,30,5],[43,3,43,5],[44,3,44,5],[42,3,42,5],[39,3,39,5],[40,3,40,5],[38,3,38,5],[37,3,37,5],[36,3,36,5],[31,3,31,5],[34,3,34,5],[32,3,32,5]]}
["                         LM5163/4 100V Low IQ DC/DC Converter Design Tool  "]
[]
[]
[]
[]
[]
[]
[]
[]
[]
[]
[]
[]
[]
[]
[]
[]
[]
[]
[]
[]
[]
[]
[]
[]
[]
[]
[{"$f":"\"VIN = \"&Vin&\" V, VOUT = \"&Vout&\" V, IOUT = \"&Iout&\" A \"&'Variable Mgmt'!B35&\" Converter\"","v":"VIN = 48 V, VOUT = 12 V, IOUT = 0.3 A COT Converter"}]
["Low IQ, High Efficiency, Synchronous Buck Converter BOM"]
["Count","Ref Des","Value","Description",null,null,"Size","Part Number","MFR","Footprint (mm)","Area (mm2)"]
[{"$f":"ROUNDUP('Design Converter'!E37/10,0)","v":1},"CIN",{"$f":"Cin*1000000","v":2.2000000000000002},{"$f":"IF(VIN_max>35, \"Capacitor, Ceramic, \"&'Variable Mgmt'!B257&\", 100V, X7R, 10%\", \"Capacitor, Ceramic, \"&'Variable Mgmt'!B257&\", 50V, X7R, 10%\")","v":"Capacitor, Ceramic, 2.2µF, 100V, X7R, 10%"},null,null,5,"Std","Std",{"$f":"CHOOSE(G31,'Variable Mgmt'!T$41,'Variable Mgmt'!T$42,'Variable Mgmt'!T$43,'Variable Mgmt'!T$44,'Variable Mgmt'!T$45)","v":"3.2 x 2.5"},{"$f":"CHOOSE(G31,'Variable Mgmt'!U$41,'Variable Mgmt'!U$42,'Variable Mgmt'!U$43,'Variable Mgmt'!U$44,'Variable Mgmt'!U$45)","v":8}]
[{"$f":"'Variable Mgmt'!D252","v":1},"COUT",{"$f":"'Variable Mgmt'!F253","v":"22µF"},{"$f":"CHOOSE(Cout_Voltage_Rating, \"Capacitor, Ceramic, \"&'Variable Mgmt'!F253&\", 6.3V, X7R, 10%\", \"Capacitor, Ceramic, \"&'Variable Mgmt'!F253&\", 10V, X7R, 10%\", \"Capacitor, Ceramic, \"&'Variable Mgmt'!F253&\", 16V, X7R, 10%\", \"Capacitor, Ceramic, \"&'Variable Mgmt'!F253&\", 25V, X7R, 10%\",  \"Capacitor, Ceramic, \"&'Variable Mgmt'!F253&\", 50V, X7R, 10%\")","v":"Capacitor, Ceramic, 22µF, 16V, X7R, 10%"},null,null,5,"Std","Std",{"$f":"CHOOSE(G32,'Variable Mgmt'!T$41,'Variable Mgmt'!T$42,'Variable Mgmt'!T$43,'Variable Mgmt'!T$44,'Variable Mgmt'!T$45)","v":"3.2 x 2.5"},{"$f":"(CHOOSE(G32,'Variable Mgmt'!U$41,'Variable Mgmt'!U$42,'Variable Mgmt'!U$43,'Variable Mgmt'!U$44,'Variable Mgmt'!U$45))*A32","v":8}]
[{"$f":"CHOOSE(MODE, \"-\", \"-\", \"1\",\"-\")","v":"-"},{"$f":"CHOOSE(MODE,\"-\",\"-\",\"Ca\",\"-\")","v":"-"},{"$f":"CHOOSE(MODE, \"-\",\"-\",'Variable Mgmt'!B293, \"-\")","v":"-"},{"$f":"CHOOSE(MODE,\"-\",\"-\", \"Capacitor, Ceramic, \"&'Variable Mgmt'!B293&\", 16V, X7R, 10%\", \"-\")","v":"-"},null,null,1,{"$f":"CHOOSE(MODE, \"-\", \"-\", \"Std\", \"-\")","v":"-"},{"$f":"H33","v":"-"},{"$f":"CHOOSE(MODE,\"\",\"\",CHOOSE(G33,'Variable Mgmt'!T$41,'Variable Mgmt'!T$42,'Variable Mgmt'!T$43,'Variable Mgmt'!T$44,'Variable Mgmt'!T$45),\"\")","v":""},{"$f":"CHOOSE(MODE,\"\",\"\",CHOOSE(G33,'Variable Mgmt'!U$41,'Variable Mgmt'!U$42,'Variable Mgmt'!U$43,'Variable Mgmt'!U$44,'Variable Mgmt'!U$45),\"\")","v":""}]
[{"$f":"CHOOSE(MODE, \"-\", \"1\", \"1\",\"-\")","v":"1"},{"$f":"CHOOSE(MODE,\"-\",\"Cff\",\"Cb\",\"-\")","v":"Cff"},{"$f":"CHOOSE(MODE, \"-\",'Variable Mgmt'!B290,'Variable Mgmt'!B290, \"-\")","v":"56pF"},{"$f":"CHOOSE(MODE,\"-\",\"Capacitor, Ceramic, \"&'Variable Mgmt'!B290&\", 50V, X7R, 10%\", \"Capacitor, Ceramic, \"&'Variable Mgmt'!B290&\", 50V, X7R, 10%\", \"-\")","v":"Capacitor, Ceramic, 56pF, 50V, X7R, 10%"},null,null,1,{"$f":"CHOOSE(MODE, \"-\", \"Std\", \"Std\", \"-\")","v":"Std"},{"$f":"H34","v":"Std"},{"$f":"CHOOSE(MODE,\"\",CHOOSE(G34,'Variable Mgmt'!T$41,'Variable Mgmt'!T$42,'Variable Mgmt'!T$43,'Variable Mgmt'!T$44,'Variable Mgmt'!T$45),CHOOSE(G34,'Variable Mgmt'!T$41,'Variable Mgmt'!T$42,'Variable Mgmt'!T$43,'Variable Mgmt'!T$44,'Variable Mgmt'!T$45),\"\")","v":"1.0 x 0.5"},{"$f":"CHOOSE(MODE,\"\",CHOOSE(G34,'Variable Mgmt'!U$41,'Variable Mgmt'!U$42,'Variable Mgmt'!U$43,'Variable Mgmt'!U$44,'Variable Mgmt'!U$45),CHOOSE(G34,'Variable Mgmt'!U$41,'Variable Mgmt'!U$42,'Variable Mgmt'!U$43,'Variable Mgmt'!U$44,'Variable Mgmt'!U$45),\"\")","v":0.5}]
[1,"CBST","2.2nF","Capacitor, Ceramic, 2.2nF, 25V, X7R, 10%",null,null,1,{"$f":"CHOOSE(MODE, \"-\", \"Std\", \"Std\", \"-\")","v":"Std"},{"$f":"H35","v":"Std"},{"$f":"CHOOSE(MODE,\"\",CHOOSE(G35,'Variable Mgmt'!T$41,'Variable Mgmt'!T$42,'Variable Mgmt'!T$43,'Variable Mgmt'!T$44,'Variable Mgmt'!T$45),CHOOSE(G35,'Variable Mgmt'!T$41,'Variable Mgmt'!T$42,'Variable Mgmt'!T$43,'Variable Mgmt'!T$44,'Variable Mgmt'!T$45),\"\")","v":"1.0 x 0.5"},{"$f":"CHOOSE(MODE,\"\",CHOOSE(G35,'Variable Mgmt'!U$41,'Variable Mgmt'!U$42,'Variable Mgmt'!U$43,'Variable Mgmt'!U$44,'Variable Mgmt'!U$45),CHOOSE(G35,'Variable Mgmt'!U$41,'Variable Mgmt'!U$42,'Variable Mgmt'!U$43,'Variable Mgmt'!U$44,'Variable Mgmt'!U$45),\"\")","v":0.5}]
[]
[1,"LF",{"$f":"'Design Converter'!E17","v":100},{"$f":"\"Inductor, \"&Lf*1000000&\" µH, \"&Rdcr*1000&\" mΩ, >\"&ROUNDUP(Isat_min,2)&\"A\"","v":"Inductor, 100 µH, 170 mΩ, >0.51A"},null,null,4,"Various","Various",{"$f":"CHOOSE(G37,'Variable Mgmt'!T50,'Variable Mgmt'!T51,'Variable Mgmt'!T52,'Variable Mgmt'!T53,'Variable Mgmt'!T54,'Variable Mgmt'!T55,'Variable Mgmt'!T56)","v":"6.0 x 6.0"},{"$f":"CHOOSE(G37,'Variable Mgmt'!U50,'Variable Mgmt'!U51,'Variable Mgmt'!U52,'Variable Mgmt'!U53,'Variable Mgmt'!U54,'Variable Mgmt'!U55,'Variable Mgmt'!U56)","v":36}]
[null,null,null,null,null,null,null,null,null,null,{"$f":"IF(MODE_RSET=2,CHOOSE(G38,'Variable Mgmt'!U$41,'Variable Mgmt'!U$42,'Variable Mgmt'!U$43,'Variable Mgmt'!U$44,'Variable Mgmt'!U$45),\"\")","v":""}]
[{"$f":"CHOOSE(MODE, \"1\",\"1\",\"1\", \"-\")","v":"1"},"RT",{"$f":"CHOOSE(MODE, 'Design Converter'!E13, 'Design Converter'!E13,'Design Converter'!E13,\"-\")","v":49.9},{"$f":"C39","v":49.9},null,null,1,{"$f":"CHOOSE(MODE, \"Std\",\"Std\",\"Std\",\"-\")","v":"Std"},{"$f":"H39","v":"Std"},{"$f":"CHOOSE(MODE,CHOOSE(G39,'Variable Mgmt'!T$41,'Variable Mgmt'!T$42,'Variable Mgmt'!T$43,'Variable Mgmt'!T$44,'Variable Mgmt'!T$45),CHOOSE(G39,'Variable Mgmt'!T$41,'Variable Mgmt'!T$42,'Variable Mgmt'!T$43,'Variable Mgmt'!T$44,'Variable Mgmt'!T$45),CHOOSE(G39,'Variable Mgmt'!T$41,'Variable Mgmt'!T$42,'Variable Mgmt'!T$43,'Variable Mgmt'!T$44,'Variable Mgmt'!T$45),\"\")","v":"1.0 x 0.5"},{"$f":"CHOOSE(MODE,CHOOSE(G39,'Variable Mgmt'!U$41,'Variable Mgmt'!U$42,'Variable Mgmt'!U$43,'Variable Mgmt'!U$44,'Variable Mgmt'!U$45),CHOOSE(G39,'Variable Mgmt'!U$41,'Variable Mgmt'!U$42,'Variable Mgmt'!U$43,'Variable Mgmt'!U$44,'Variable Mgmt'!U$45),CHOOSE(G39,'Variable Mgmt'!U$41,'Variable Mgmt'!U$42,'Variable Mgmt'!U$43,'Variable Mgmt'!U$44,'Variable Mgmt'!U$45),\"\")","v":0.5}]
[1,"RFB1",{"$f":"Rfb1_/1000","v":453},453,null,null,1,{"$f":"CHOOSE(MODE_VOUT,\"-\",\"Std\")","v":"Std"},{"$f":"H40","v":"Std"},{"$f":"(CHOOSE(MODE_VOUT,\"\",CHOOSE(G40,'Variable Mgmt'!T$41,'Variable Mgmt'!T$42,'Variable Mgmt'!T$43,'Variable Mgmt'!T$44,'Variable Mgmt'!T$45)))","v":"1.0 x 0.5"},{"$f":"CHOOSE(MODE_VOUT,\"\",CHOOSE(G40,'Variable Mgmt'!U$41,'Variable Mgmt'!U$42,'Variable Mgmt'!U$43,'Variable Mgmt'!U$44,'Variable Mgmt'!U$45))","v":0.5}]
[1,"RFB2",{"$f":"Rfb2_u/1000","v":49.9},49.9,null,null,1,{"$f":"CHOOSE(MODE_VOUT,\"-\",\"Std\")","v":"Std"},{"$f":"H41","v":"Std"},{"$f":"CHOOSE(MODE_VOUT,\"\",CHOOSE(G41,'Variable Mgmt'!T$41,'Variable Mgmt'!T$42,'Variable Mgmt'!T$43,'Variable Mgmt'!T$44,'Variable Mgmt'!T$45))","v":"1.0 x 0.5"},{"$f":"CHOOSE(MODE_VOUT,\"\",CHOOSE(G41,'Variable Mgmt'!U$41,'Variable Mgmt'!U$42,'Variable Mgmt'!U$43,'Variable Mgmt'!U$44,'Variable Mgmt'!U$45))","v":0.5}]
[{"$f":"IF(MODE=3,\"1\",\"-\")","v":"-"},{"$f":"CHOOSE(MODE,\"-\",\"-\",\"Ra\",\"-\")","v":"-"},{"$f":"'Variable Mgmt'!F296","v":""},{"$f":"\"Resistor, Chip, \"&'Variable Mgmt'!B296&\", 1/16W, 1%\"","v":"Resistor, Chip, , 1/16W, 1%"},null,null,1,{"$f":"CHOOSE(MODE, \"-\", \"-\", \"Std\", \"-\")","v":"-"},{"$f":"H42","v":"-"},{"$f":"CHOOSE(MODE,\"\",\"\",CHOOSE(G42,'Variable Mgmt'!T$41,'Variable Mgmt'!T$42,'Variable Mgmt'!T$43,'Variable Mgmt'!T$44,'Variable Mgmt'!T$45),\"\")","v":""},{"$f":"CHOOSE(MODE,\"\",\"\",CHOOSE(G42,'Variable Mgmt'!U$41,'Variable Mgmt'!U$42,'Variable Mgmt'!U$43,'Variable Mgmt'!U$44,'Variable Mgmt'!U$45),\"\")","v":""}]
[1,"RPGOOD",100,100,null,null,1,"Std","Std",{"$f":"CHOOSE(G43,'Variable Mgmt'!T$41,'Variable Mgmt'!T$42,'Variable Mgmt'!T$43,'Variable Mgmt'!T$44,'Variable Mgmt'!T$45)","v":"1.0 x 0.5"},{"$f":"CHOOSE(G43,'Variable Mgmt'!U$41,'Variable Mgmt'!U$42,'Variable Mgmt'!U$43,'Variable Mgmt'!U$44,'Variable Mgmt'!U$45)","v":0.5}]
[{"$f":"CHOOSE(MODE_UVLO, \"1\", \"-\")","v":"1"},"RUV1",{"$f":"CHOOSE(MODE_UVLO, 'Variable Mgmt'!H275, \"-\")","v":"1M"},{"$f":"CHOOSE(MODE_UVLO, \"Resistor, Chip, \"&'Variable Mgmt'!C275&\", 1/16W, 1%\", \"-\")","v":"Resistor, Chip, 1MΩ, 1/16W, 1%"},null,null,2,{"$f":"CHOOSE(MODE_UVLO,\"Std\",\"-\")","v":"Std"},{"$f":"H44","v":"Std"},{"$f":"CHOOSE(MODE_UVLO,CHOOSE(G44,'Variable Mgmt'!T$41,'Variable Mgmt'!T$42,'Variable Mgmt'!T$43,'Variable Mgmt'!T$44,'Variable Mgmt'!T$45),\"\")","v":"1.6 x 0.8"},{"$f":"CHOOSE(MODE_UVLO,CHOOSE(G44,'Variable Mgmt'!U$41,'Variable Mgmt'!U$42,'Variable Mgmt'!U$43,'Variable Mgmt'!U$44,'Variable Mgmt'!U$45),\"\")","v":1.3}]
[{"$f":"CHOOSE(MODE_UVLO, \"1\", \"-\")","v":"1"},"RUV2",{"$f":"CHOOSE(MODE_UVLO, 'Variable Mgmt'!H276, \"-\")","v":"332k"},{"$f":"CHOOSE(MODE_UVLO, \"Resistor, Chip, \"&'Variable Mgmt'!C276&\", 1/16W, 1%\", \"-\")","v":"Resistor, Chip, 332kΩ, 1/16W, 1%"},null,null,1,{"$f":"CHOOSE(MODE_UVLO,\"Std\",\"-\")","v":"Std"},{"$f":"H45","v":"Std"},{"$f":"CHOOSE(MODE_UVLO,CHOOSE(G45,'Variable Mgmt'!T$41,'Variable Mgmt'!T$42,'Variable Mgmt'!T$43,'Variable Mgmt'!T$44,'Variable Mgmt'!T$45),\"\")","v":"1.0 x 0.5"},{"$f":"CHOOSE(MODE_UVLO,CHOOSE(G45,'Variable Mgmt'!U$41,'Variable Mgmt'!U$42,'Variable Mgmt'!U$43,'Variable Mgmt'!U$44,'Variable Mgmt'!U$45),\"\")","v":0.5}]
[1,"U1",{"$f":"CHOOSE(VARIANT, \"LM5163-Q1\", \"LM5164-Q1\")","v":"LM5163-Q1"},{"$f":"CHOOSE(VARIANT, \"IC, LM51643-Q1, Buck Converter, 6V–100V Input\", \"IC, LM5164-Q1, Buck Converter, 6V–100V Input\")","v":"IC, LM51643-Q1, Buck Converter, 6V–100V Input"},null,null,"SOIC-8",{"$f":"CHOOSE(VARIANT, \"LM5163QDDATQ1\", \"LM5164QDDATQ1\")","v":"LM5163QDDATQ1"},"TI","5.0 x 6.0",30]
[]
[null,{"$f":"\"Total Solution Size (padded by 15%) = \"&ROUND(K48,1)&\" mm^2 = \"&ROUND(M48,3)&\" in^2\"","v":"Total Solution Size (padded by 15%) = 99.8 mm^2 = 0.155 in^2"},null,null,null,null,null,null,null,null,{"$f":"SUM(K31:K46)*1.15","v":99.82},null,{"$f":"K48/25.4/25.4","v":0.15472130944261889}]
[]
["NOTES:"]
["* Inductor saturation current should be higher than the peak inductor current setting for all operating temperatures *"]
["** Effective input and output capacitances should be appropriately derated for applied voltage and temperature, particularly with ceramics **"]
["***Estimated total solution size does not include EMI filter***"]

{"sheet":"Schematic Mgmt","index":10,"n_rows":2,"n_cols":1,"rows_kept":2,"cut":false,"hidden":true,"merged":[]}
[]
[{"$f":"'Variable Mgmt'!K27","v":"SCH_COT2_LM5168"}]

{"sheet":"sch_frank","index":11,"n_rows":2,"n_cols":1,"rows_kept":2,"cut":false,"hidden":true,"merged":[]}
[]
[{"$f":"CHOOSE(MODE,\"cot1_sch\",\"cot2_sch\",\"cot3_sch\")","v":"cot2_sch"}]

{"sheet":"Efficiency Plots","index":12,"n_rows":2,"n_cols":1,"rows_kept":2,"cut":false,"hidden":true,"merged":[]}
[]
[{"$f":"IF(PLOT_TYPE=1, \"EFF_LINEAR\", \"EFF_LOG\")","v":"EFF_LINEAR"}]