{"text_format":"1","workbook":"xlsx","n_sheets":13,"sheets":["Instructions","Design Converter","Fsw & Ripple","Losses","Variable Mgmt","Standard Value Calculator","Efficiency","Design EMI Filter","EVM","BOM & Schematic","Schematic Mgmt","sch_frank","Efficiency Plots"],"not_rendered":{"charts":6,"images":28,"macros":1,"external_links":0,"defined_names":209,"comments":4,"pivot_tables":0},"unopened":[],"bounds":{"document_bytes":16777216,"sheet_cells":100000,"rows_first":2000,"rows_last":500,"rows_between":2000,"halvings":0,"cell_chars":16384,"cell_head_chars":4096},"cells_cut":0,"cells_raw":0,"read":"whole","date_system":"1900"}

{"sheet":"Instructions","index":0,"n_rows":74,"n_cols":3,"rows_kept":74,"cut":false,"hidden":true,"merged":[[0,0,0,16],[7,1,9,15],[16,2,17,15],[11,1,14,15],[18,2,19,15],[65,1,66,15],[69,1,70,15],[73,1,74,15],[77,1,78,15],[20,2,21,15],[50,1,52,15],[54,1,55,15],[56,1,57,15],[60,1,62,15],[24,1,26,15],[38,1,39,15],[41,1,43,15],[46,1,47,15],[28,1,28,15],[29,1,31,15],[33,1,35,15]]}
["                         LM5164 Low IQ DC/DC Converter Design Tool  "]
[]
[]
[null,"Design Regulator tab"]
[null,"Start with Step 1, and then work down towards the bottom of the worksheet."]
[]
[null,"Step 1. Operating Specifications"]
[null,"First, enter the values in the yellow shaded cells to define the power supply parameters.  If a particular specification is not known, enter an estimate. It can be changed later, if necessary, to optimize component values.  Cells  with a red mark in the upper right corner have a comment to provide additional information.  Hold the cursor over the cell to read the comment.  A red font indicates an erroneous entry and requires an adjustment to the entry.  Consult the entry's comments for the entry specific requirements."]
{"$rows_left_out":67}
{"sheet":"Design Converter","index":1,"n_rows":58,"n_cols":17,"rows_kept":58,"cut":false,"hidden":false,"merged":[[2,14,2,15],[0,0,0,16]]}
["                          LM5168/9 Low IQ DC/DC Converter Design Tool  "]
[null,null,null,null,null,null,null,null,null,null,null,null,null,null,"http://www.ti.com/ww/en/analog/power_management/widevin"]
["About",null,"xx",null,null,"= Input Box",null,null,null,null,null,null,null,null,"Terms Of Use",null,"                "]
[]
["Step 1: Operating Specifications"]
[null,null,null,"Input Voltage - Min, VIN(min) ",18,"V"]
[null,null,null,"Input Voltage - Nom, VIN(nom)",48,"V"]
[null,null,null,"Input Voltage - Max, VIN(max)",60,"V"]
{"$rows_left_out":51}
{"sheet":"Fsw & Ripple","index":2,"n_rows":1,"n_cols":1,"rows_kept":1,"cut":false,"hidden":true,"merged":[[0,0,0,16]]}
["                         LM5164 Low IQ DC/DC Converter Design Tool  "]

{"sheet":"Losses","index":3,"n_rows":42,"n_cols":6,"rows_kept":42,"cut":false,"hidden":true,"merged":[[0,0,0,16]]}
["                         LM5166 Low IQ DC/DC Converter Design Tool  "]
[]
[]
[]
[null,null,null,"Load Current",500,"mA"]
[]
[]
[]
{"$rows_left_out":35}
{"sheet":"Variable Mgmt","index":4,"n_rows":320,"n_cols":21,"rows_kept":320,"cut":false,"hidden":true,"merged":[[4,4,4,7],[0,0,0,8]]}
["EXCEL Variables Names/Calculations",null,null,null,null,null,null,null,null,null,null,"LM5166"]
[null,"Input from user ="]
[null,"Output ="]
[null,"Constant"]
["Variable Name","Value","STD Units",null,"Notes",null,null,null,"Iteration"]
["Step 1: Operational Specs"]
["VIN_min",{"$f":"'Design Converter'!E6","v":18},"V","Minimum input voltage",null,null,null,null,1]
["VIN_nom",{"$f":"'Design Converter'!E7","v":48},"V","Nominal input voltage"]
{"$rows_left_out":313}
{"sheet":"Standard Value Calculator","index":5,"n_rows":159,"n_cols":11,"rows_kept":159,"cut":false,"hidden":true,"merged":[]}
[]
["Capacitors","Css","Cout","Cin","Cb"]
["Inputs",{"$f":"Css","v":{"$error":"#NAME?"}},{"$f":"Cout","v":1.2E-5},{"$f":"Cin","v":2.2000000000000001E-6},{"$f":"Cb","v":0},null,null,"Resistors","inputs","Standard Result"]
["Standard Result",{"$f":"SUM(B6:B158)/1000000000000","v":{"$error":"#NAME?"}},{"$f":"SUM(C6:C158)/1000000000000","v":1.2E-5},{"$f":"SUM(D6:D158)/1000000000000","v":2.2000000000000001E-6},{"$f":"IF(E3=\"OPEN\",\"OPEN\",SUM(E6:E158)/1000000000000)","v":0},null,null,"Rt",{"$f":"Rt","v":50000},{"$f":"IF(I4>(INT(0.5+100*POWER(10,IF(96*(LOG(I4)-INT(LOG(I4)))-ROUND(96*(LOG(I4)-INT(LOG(I4))),0)<0,ROUND(96*(LOG(I4)-INT(LOG(I4))),0)-1,ROUND(96*(LOG(I4)-INT(LOG(I4))),0))/96))*POWER(10,INT(LOG(I4))-2)+INT(0.5+100*POWER(10,(IF(96*(LOG(I4)-INT(LOG(I4)))-ROUND(96*(LOG(I4)-INT(LOG(I4))),0)<0,ROUND(96*(LOG(I4)-INT(LOG(I4))),0)-1,ROUND(96*(LOG(I4)-INT(LOG(I4))),0))+1)/96))*POWER(10,INT(LOG(I4))-2))/2,INT(0.5+100*POWER(10,(IF(96*(LOG(I4)-INT(LOG(I4)))-ROUND(96*(LOG(I4)-INT(LOG(I4))),0)<0,ROUND(96*(LOG(I4)-INT(LOG(I4))),0)-1,ROUND(96*(LOG(I4)-INT(LOG(I4))),0))+1)/96))*POWER(10,INT(LOG(I4))-2),INT(0.5+100*POWER(10,IF(96*(LOG(I4)-INT(LOG(I4)))-ROUND(96*(LOG(I4)-INT(LOG(I4))),0)<0,ROUND(96*(LOG(I4)-INT(LOG(I4))),0)-1,ROUND(96*(LOG(I4)-INT(LOG(I4))),0))/96))*POWER(10,INT(LOG(I4))-2))","v":49900},"Ω"]
["(pF)"]
[0.47,{"$f":"IF(IF((B$3*10^12-$A7)*(B$3*10^12-$A6)*-1<0,0,1)*IF(ABS(B$3*10^12-$A7)>(B$3*10^12-$A6),$A6,$A7)=B7,0,IF((B$3*10^12-$A7)*(B$3*10^12-$A6)*-1<0,0,1)*IF(ABS(B$3*10^12-$A7)>(B$3*10^12-$A6),$A6,$A7))","v":{"$error":"#NAME?"}},{"$f":"IF(IF((C$3*10^12-$A7)*(C$3*10^12-$A6)*-1<0,0,1)*IF(ABS(C$3*10^12-$A7)>(C$3*10^12-$A6),$A6,$A7)=C7,0,IF((C$3*10^12-$A7)*(C$3*10^12-$A6)*-1<0,0,1)*IF(ABS(C$3*10^12-$A7)>(C$3*10^12-$A6),$A6,$A7))","v":0},{"$f":"IF(IF((D$3*10^12-$A7)*(D$3*10^12-$A6)*-1<0,0,1)*IF(ABS(D$3*10^12-$A7)>(D$3*10^12-$A6),$A6,$A7)=D7,0,IF((D$3*10^12-$A7)*(D$3*10^12-$A6)*-1<0,0,1)*IF(ABS(D$3*10^12-$A7)>(D$3*10^12-$A6),$A6,$A7))","v":0},{"$f":"IF(IF((E$3*10^12-$A7)*(E$3*10^12-$A6)*-1<0,0,1)*IF(ABS(E$3*10^12-$A7)>(E$3*10^12-$A6),$A6,$A7)=E7,0,IF((E$3*10^12-$A7)*(E$3*10^12-$A6)*-1<0,0,1)*IF(ABS(E$3*10^12-$A7)>(E$3*10^12-$A6),$A6,$A7))","v":0},null,null,"Rshunt",{"$f":"Rshunt","v":{"$error":"#NAME?"}},{"$error":"#NAME?"},"Ω"]
[0.56000000000000005,{"$f":"IF(IF((B$3*10^12-$A8)*(B$3*10^12-$A7)*-1<0,0,1)*IF(ABS(B$3*10^12-$A8)>(B$3*10^12-$A7),$A7,$A8)=B8,0,IF((B$3*10^12-$A8)*(B$3*10^12-$A7)*-1<0,0,1)*IF(ABS(B$3*10^12-$A8)>(B$3*10^12-$A7),$A7,$A8))","v":{"$error":"#NAME?"}},{"$f":"IF(IF((C$3*10^12-$A8)*(C$3*10^12-$A7)*-1<0,0,1)*IF(ABS(C$3*10^12-$A8)>(C$3*10^12-$A7),$A7,$A8)=C8,0,IF((C$3*10^12-$A8)*(C$3*10^12-$A7)*-1<0,0,1)*IF(ABS(C$3*10^12-$A8)>(C$3*10^12-$A7),$A7,$A8))","v":0},{"$f":"IF(IF((D$3*10^12-$A8)*(D$3*10^12-$A7)*-1<0,0,1)*IF(ABS(D$3*10^12-$A8)>(D$3*10^12-$A7),$A7,$A8)=D8,0,IF((D$3*10^12-$A8)*(D$3*10^12-$A7)*-1<0,0,1)*IF(ABS(D$3*10^12-$A8)>(D$3*10^12-$A7),$A7,$A8))","v":0},{"$f":"IF(IF((E$3*10^12-$A8)*(E$3*10^12-$A7)*-1<0,0,1)*IF(ABS(E$3*10^12-$A8)>(E$3*10^12-$A7),$A7,$A8)=E8,0,IF((E$3*10^12-$A8)*(E$3*10^12-$A7)*-1<0,0,1)*IF(ABS(E$3*10^12-$A8)>(E$3*10^12-$A7),$A7,$A8))","v":0},null,null,"Rc1ea",{"$f":"Rcea1","v":{"$error":"#NAME?"}},{"$error":"#NAME?"},"Ω"]
[0.68,{"$error":"#NAME?"},0,0,0]
{"$rows_left_out":152}
{"sheet":"Efficiency","index":6,"n_rows":114,"n_cols":88,"rows_kept":114,"cut":false,"hidden":true,"merged":[[0,0,2,4],[1,6,1,7],[3,0,3,4],[3,10,3,21]]}
["LM5169 (COT) Efficiency Calculator"]
[null,null,null,null,null,null,"TERMS OF USE",null,null,{"$f":"CoutEsr","v":1},null,null,null,null,null,null,null,null,null,null,null,null,null,null,null,null,null,null,null,null,null,null,null,null,null,null,null,null,null,null,null,null,null,null,null,null,null,null,"didn't include FB"]
[]
[null,null,null,null,null,null,null,"Currents",null,null,"Miscellaneous",null,null,null,null,null,null,null,null,null,null,null,"Inductor",null,null,null,"Cout",null,null,"Cin",null,null,"High-side MOSFET Losses ",null,null,null,null,null,null,null,null,"Low-side MOSFET Losses ",null,null,"Diode",null,null,null,null,null,null,null,"RESULTS"]
["Input Parameters",null,null,null,null,null,null,"Step","Iout (A)","Ripple Current pk-pk (A)","Peak Current (A)","Valley Current (A)","VOUT Hysteresis +Undershoot (2us Delay) (mV)","Vout Rise per Pulse (mV)","Number of Pulses in DCM","VOUT Ripple (mV)","Off Time (sec)","Duty Cycle","Switching Frequency (Hz)","Active Mode Duration (sec)","Sleep Mode Duration (sec)","Operating Quiescent Current (A)","Irms (A)","Inductor DCR Loss @ 25°C (W)","Inductor Core Loss  (W)","Total Inductor Loss (W)","Irms (A)","Cout ESR Loss (W)","Total Cout Loss (W)","Irms (A)","Cin ESR Loss (W)","Total Cin Loss (W)","Irms (A)","Rdson HS Loss @ 25°C (W)","HS Gate Qg Loss (W)     ","SW Rise Time (ns)","SW Fall Time (ns)","HS Switching  Loss (W)","Coss Loss (W)","Total HS FET AC Loss (W)","Total HS FET Loss (W)","Irms (A)","Rdson LS Loss @ 25°C (W)","LS Gate Qg Loss (W)","Reverse Recovery & Leakage Losses","DeadTime Loss @ 25°C (W)","Total LS FET AC Loss (W)","Total LS FET Loss (W)","Quiescent Loss (W)","LDO + Quiescent Loss (W)","Total Gate Drive Loss (W)","Total Power Loss in IC (W)","Total Converter Power Loss (W)","Pout (W)","EFF (%)","High-side MOSFET Rdson %","Low-side MOSFET Rdson %","Gate Drive (Qg) Loss from Vin %","High-side MOSFET AC Loss %","Reverse Recovery & Leakage Loss %","Deadtime Loss %","Low-side MOSFET AC Loss %","Inductor Cu Loss %","Inductor Core Loss %","Cin ESR %","Cout ESR %","LDO + Quiescent Current Loss %","Total Loss %","Overall Eff %","Overall Eff","Current (mA)","Keep for \"previous\" data series","Keep for \"previous\" data series","Frequency (kHz)",null,"Coss",null,"Total Power Loss in IC (mW)","LDO + Quiescent Loss (mW)","Total Inductor Loss (mW)",null,null,"Overall Eff","Total Power Loss in IC (W)","LDO + Quiescent Loss (mW)","Total Inductor Loss (mW)","Fsw (kHz)","Ripple (mV)"]
["Design","Input Value","Units","Std Units","Description",null,null,0.04,{"$f":"IF(PLOT_TYPE=1, H6/100*Iout, min_I*EXP(H6*rr/100))","v":1.2E-4},{"$f":"IF(I6<Icrit, (Vin-(Rdcr+RdsonTop)*Iripple/2-Vout)/L*OnTime, (Vin-(Rdcr+RdsonTop)*I6-Vout)/L*OnTime)","v":0.14937937604166668},{"$f":"IF(I6<Icrit, (Vin-(Rdcr+RdsonTop)*Iripple/2-Vout)/L*OnTime, I6+((Vin-(Rdcr+RdsonTop)*J6-Vout)/L*OnTime)/2)","v":0.14937937604166668},{"$f":"IF(I6<Icrit, 0, I6-((Vin-(Rdcr+RdsonTop)*K6-Vout)/L*OnTime)/2)","v":0},{"$f":"1000*((((J6/2)-I6)*0.000002/Cout+Vout/306))","v":51.643967611315361},{"$f":"IF(I6<Icrit, 1000*SQRT((J6*CoutEsr)^2+(((J6/2)-I6)*(OnTime+OffTime)/Cout)^2), 1000*J6*SQRT(CoutEsr^2+(1/(8*Fsw*Cout))^2))","v":149.71736657605726},{"$f":"ROUNDUP(M6/N6,0)","v":1},{"$f":"IF(I6<Icrit, 1000*((N6/1000)*O6), 1000*J6*SQRT(CoutEsr^2+(1/(8*Fsw*Cout))^2))","v":149.71736657605726},{"$f":"IF(I6<Icrit, L*J6/(Vout+J6/2*(RdsonBot+Rdcr)), L*J6/(Vout+I6*(RdsonBot+Rdcr)))","v":1.2377405719641333E-6},{"$f":"OnTime*S6","v":4.0463825333951714E-4},{"$f":"IF(I6<Icrit,I6/((OnTime+Q6)*J6/2),1/(OnTime+Q6))","v":971.13180801484111},{"$f":"IF(1/S6-OnTime-Q6>Tsleep, OnTime+Q6+Tsleep, 1/S6)","v":6.6544072386308002E-6},{"$f":"IF(1/S6-OnTime-Q6>Tsleep, 1/S6-OnTime-Q6-Tsleep, 0)","v":1.0230719303675594E-3},{"$f":"S6*(T6*Iq_active+U6*Iq_sleep)","v":1.4200499246397076E-5},{"$f":"IF(I6<Icrit,Iripple*SQRT((OnTime+OffTime)*S6/3), SQRT(I6^2+Iripple^2/12))","v":3.3750901867561612E-3},{"$f":"W6^2*Rdcr","v":1.9365097406854159E-6},{"$f":"Core_Loss/1000*S6/$S$106","v":0},{"$f":"(Y6+X6*(1+Ltc*(Ta-25)))/(1-X6*Ltc*ThetaCa)","v":1.9365103406967979E-6},{"$f":"Iripple/SQRT(12)*SQRT((OnTime+Q6)*S6)","v":1.7064284459822865E-3},{"$f":"RCoutEsr*AA6^2","v":2.9118980412575213E-6},{"$f":"AB6","v":2.9118980412575213E-6},{"$f":"SQRT($R6)*SQRT($I6^2*(1-R6)+(Iripple^2)/12)","v":8.5637301735262445E-4},{"$f":"RCinEsr*AD6^2","v":2.2001242345489152E-9},{"$f":"AE6","v":2.2001242345489152E-9},{"$f":"IF(I6<Icrit,Iripple*SQRT((OnTime)*S6/3), SQRT(OnTime*S6*(I6^2+Iripple^2/12)))","v":1.7127392334112428E-3},{"$f":"RdsonTop*AG6^2","v":5.4269300110823445E-6},{"$f":"QgTop*S6*Vdd","v":2.9133954240445237E-6},{"$f":"5*VIN_nom/24","v":10},{"$f":"IF(I6<Icrit, Csw*Vin/Iripple*1000000000, Csw*Vin/(I6+Iripple/2)*1000000000)","v":52.076623156467207},{"$f":"IF(I6<Icrit, Vin*(I6+Iripple/2)*AK6/1000000000/2*S6, Vin*(I6-Iripple/2)*AJ6/1000000000/2*S6 + Vin*(I6+Iripple/2)*AK6/1000000000/2*S6)","v":8.9645158430427346E-5},{"$f":"IF(I6<Icrit, Csw*(Vin)^2*S6/2, Csw*Vin^2*S6/2)","v":1.7899901485329551E-4},{"$f":"AI6+AL6+AM6","v":2.7155756870776736E-4},{"$f":"(AI6+AL6+AM6+AH6*(1+RdsonTopTc*(Ta-25)))/(1-AH6*RdsonTopTc*ThetaJA)","v":2.7698479526562763E-4},{"$f":"IF(I6<Icrit,Iripple*SQRT((OffTime)*S6/3), SQRT(OffTime*S6*(I6^2+Iripple^2/12)))","v":2.9082224961428939E-3},{"$f":"RdsonBot*AP6^2","v":6.3433185653037039E-6},{"$f":"QgBot*S6*Vdd","v":7.8661676449202142E-6},{"$f":"IF(I6<Icrit, Vin*Idss*R6, QrrBot*(I6-Iripple/2)/1*S6*Vin+Vin*Idss*R6)","v":0},{"$f":"IF(I6<Icrit, dead1*S6*(I6+Iripple/2)*((I6+Iripple/2)*BDserR+VSD), dead1*S6*(I6+Iripple/2)*((I6+Iripple/2)*BDserR+VSD)+dead2*S6*(I6-Iripple/2)*((I6-Iripple/2)*BDserR+VSD))","v":4.0537027749018663E-7},{"$f":"AR6+AS6+AT6","v":8.2715379224104006E-6},{"$f":"(AR6+AS6+AT6+AQ6*(1+RdsonBotTc*(Ta-25)))/(1-AQ6*RdsonBotTc*ThetaJA)","v":1.4614874776912892E-5},{"$f":"Vin*V6+Vout*Ifb/0.8","v":1.0395480043917842E-3},{"$f":"(Vin-Vdd)*(S6*QgBot+S6*QgTop)+AW6","v":1.132252246784881E-3},{"$f":"AI6+AR6","v":1.0779563068964738E-5},{"$f":"AO6+AV6+AX6+AY6","v":1.4346314798963863E-3},{"$f":"SUM(Z6,AC6,AF6,AZ6)","v":1.4394820884025751E-3},{"$f":"Vout*I6","v":1.4400000000000001E-3},{"$f":"BB6/(BB6+BA6)","v":0.50008993138028379},{"$f":"(AO6-AN6)/($BB6+$BA6)","v":1.8847926089622189E-3},{"$f":"(AV6-AU6)/($BB6+$BA6)","v":2.2029436752015112E-3},{"$f":"Vin*S6*(QgBot+QgTop)/($BB6+$BA6)","v":3.5938339703120104E-2},{"$f":"AN6/($BB6+$BA6)","v":9.4307781875600044E-2},{"$f":"AS6/(BA6+BB6)","v":0},{"$f":"AT6/($BB6+$BA6)","v":1.4077888489838472E-4},{"$f":"AU6/($BB6+$BA6)","v":2.8725783555747443E-3},{"$f":"X6/($BB6+$BA6)","v":6.7252015509487544E-4},{"$f":"Y6/($BB6+$BA6)","v":0},{"$f":"(AF6)/($BB6+$BA6)","v":7.6406942880810159E-7},{"$f":"(AC6)/($BB6+$BA6)","v":1.0112575636380947E-3},{"$f":"AX6/($BB6+$BA6)","v":0.39321385305543283},{"$f":"SUM(BD6:BO6)","v":0.53224560994695158},{"$f":"BC6","v":0.50008993138028379},{"$f":"100*BQ6","v":50.00899313802838},{"$f":"I6*1000","v":0.12000000000000001},8.7924221262065743,{"$f":"BT6/100","v":8.7924221262065741E-2},{"$f":"S6/1000","v":0.97113180801484111},null,{"$f":"AM6/($BB6+$BA6)","v":6.2163614621613156E-2},null,{"$f":"AZ6","v":1.4346314798963863E-3},{"$f":"AX6","v":1.132252246784881E-3},{"$f":"Z6","v":1.9365103406967979E-6},null,null,{"$f":"IF(OR(MODE=1,MODE=2,MODE=3), BR6, IF(MODE_ILIM=4,#REF!,#REF!))","v":50.00899313802838},{"$f":"IF(OR(MODE=1,MODE=2,MODE=3), BZ6, IF(MODE_ILIM=4,#REF!,#REF!))","v":1.4346314798963863E-3},{"$f":"IF(OR(MODE=1,MODE=2,MODE=3), CA6, IF(MODE_ILIM=4,#REF!,#REF!))","v":1.132252246784881E-3},{"$f":"IF(OR(MODE=1,MODE=2,MODE=3), CB6, IF(MODE_ILIM=4,#REF!,#REF!))","v":1.9365103406967979E-6},{"$f":"(IF(OR(MODE=1,MODE=2,MODE=3), S6, IF(MODE_ILIM=4,#REF!,#REF!)))/1000","v":0.97113180801484111},{"$f":"IF(OR(MODE=1,MODE=2,MODE=3), P6, IF(MODE_ILIM=4,#REF!,#REF!))","v":149.71736657605726}]
[null,null,null,null,null,null,null,1,3.0000000000000001E-3,0.14937937604166668,0.14937937604166668,0,{"$f":"IF(I7<Icrit, 1000*((((J7/2)-I7)*0.000002/Cout+Vout/306)), 1000*J7*SQRT(CoutEsr^2+(1/(8*Fsw*Cout))^2))","v":51.163967611315357},149.69178998291216,{"$f":"ROUNDUP(M7/N7,0)","v":1},149.69178998291216,1.2377405719641333E-6,{"$f":"OnTime*S7","v":1.0115956333487929E-2},24278.295200371031,{"$f":"IF(1/S7-OnTime-Q7>Tsleep, OnTime+Q7+Tsleep, 1/S7)","v":6.6544072386308002E-6},{"$f":"IF(1/S7-OnTime-Q7>Tsleep, 1/S7-OnTime-Q7-Tsleep, 0)","v":3.4534646265616798E-5},1.1501248115992687E-4,{"$f":"IF(I7<Icrit,Iripple*SQRT((OnTime+OffTime)*S7/3), SQRT(I7^2+Iripple^2/12))","v":1.6875450933780806E-2},4.8412743517135396E-5,0,4.8413118527037813E-5,{"$f":"Iripple/SQRT(12)*SQRT((OnTime+Q7)*S7)","v":8.5321422299114331E-3},{"$f":"RCoutEsr*AA7^2","v":7.2797451031438043E-5},{"$f":"AB7","v":7.2797451031438043E-5},{"$f":"SQRT($R7)*SQRT($I7^2*(1-R7)+(Iripple^2)/12)","v":4.2923589812901069E-3},{"$f":"RCinEsr*AD7^2","v":5.5273036872785534E-8},{"$f":"AE7","v":5.5273036872785534E-8},{"$f":"IF(I7<Icrit,Iripple*SQRT((OnTime)*S7/3), SQRT(OnTime*S7*(I7^2+Iripple^2/12)))","v":8.5636961670562152E-3},{"$f":"RdsonTop*AG7^2","v":1.3567325027705865E-4},{"$f":"QgTop*S7*Vdd","v":7.2834885601113088E-5},10,52.076623156467207,{"$f":"IF(I7<Icrit, Vin*(I7+Iripple/2)*AK7/1000000000/2*S7, Vin*(I7-Iripple/2)*AJ7/1000000000/2*S7 + Vin*(I7+Iripple/2)*AK7/1000000000/2*S7)","v":2.3285195630284397E-3},{"$f":"IF(I7<Icrit, Csw*(Vin)^2*S7/2, Csw*Vin^2*S7/2)","v":4.4749753713323884E-3},{"$f":"AI7+AL7+AM7","v":6.8763298199619408E-3},7.012190755863827E-3,1.4541112480714472E-2,{"$f":"RdsonBot*AP7^2","v":1.5858296413259263E-4},1.9665419112300538E-4,0,1.0533188161015505E-5,{"$f":"AR7+AS7+AT7","v":2.0718737928402089E-4},3.6578178699022762E-4,5.8785231362412146E-3,8.1961291960686335E-3,2.6948907672411847E-4,{"$f":"AO7+AV7+AX7+AY7","v":1.5843590815646805E-2},1.5964856658242155E-2,3.6000000000000004E-2,{"$f":"BB7/(BB7+BA7)","v":0.69277589346125978},{"$f":"(AO7-AN7)/($BB7+$BA7)","v":2.6144772571086699E-3},{"$f":"(AV7-AU7)/($BB7+$BA7)","v":3.0519550693507403E-3},4.9785476241493633E-2,{"$f":"AN7/($BB7+$BA7)","v":0.1323265426321788},{"$f":"AS7/(BA7+BB7)","v":0},{"$f":"AT7/($BB7+$BA7)","v":2.0269830109008552E-4},{"$f":"AU7/($BB7+$BA7)","v":3.987067272149568E-3},9.3164393458317442E-4,0,{"$f":"(AF7)/($BB7+$BA7)","v":1.0636618751072542E-6},{"$f":"(AC7)/($BB7+$BA7)","v":1.4008977550001886E-3},{"$f":"AX7/($BB7+$BA7)","v":0.157724464631399},{"$f":"SUM(BD7:BO7)","v":0.35202628675622893},0.69277589346125978,{"$f":"100*BQ7","v":69.277589346125978},3,9.5725635821403898,{"$f":"BT7/100","v":9.5725635821403893E-2},24.27829520037103,null,8.6115418363664653E-2,null,{"$f":"AZ7","v":1.5843590815646805E-2},{"$f":"AX7","v":8.1961291960686335E-3},{"$f":"Z7","v":4.8413118527037813E-5},null,null,{"$f":"IF(OR(MODE=1,MODE=2,MODE=3), BR7, IF(MODE_ILIM=4,#REF!,#REF!))","v":69.277589346125978},{"$f":"IF(OR(MODE=1,MODE=2,MODE=3), BZ7, IF(MODE_ILIM=4,#REF!,#REF!))","v":1.5843590815646805E-2},{"$f":"IF(OR(MODE=1,MODE=2,MODE=3), CA7, IF(MODE_ILIM=4,#REF!,#REF!))","v":8.1961291960686335E-3},{"$f":"IF(OR(MODE=1,MODE=2,MODE=3), CB7, IF(MODE_ILIM=4,#REF!,#REF!))","v":4.8413118527037813E-5},{"$f":"(IF(OR(MODE=1,MODE=2,MODE=3), S7, IF(MODE_ILIM=4,#REF!,#REF!)))/1000","v":24.27829520037103},{"$f":"IF(OR(MODE=1,MODE=2,MODE=3), P7, IF(MODE_ILIM=4,#REF!,#REF!))","v":149.69178998291216}]
["Vin",{"$f":"Vin","v":48},"V",{"$f":"B8","v":48},"Vin",null,null,2,6.0000000000000001E-3,0.14937937604166668,0.14937937604166668,0,50.663967611315357,149.66621441676034,1,149.66621441676034,1.2377405719641333E-6,{"$f":"OnTime*S8","v":2.0231912666975858E-2},48556.590400742061,6.6544072386308002E-6,1.3940119513493E-5,2.2002496231985375E-4,2.3865491581714526E-2,9.6825487034270791E-5,0,9.6826987085500018E-5,1.2066271257636971E-2,1.4559490206287609E-4,{"$f":"AB8","v":1.4559490206287609E-4},6.1140869299014609E-3,1.1214617695917562E-7,{"$f":"AE8","v":1.1214617695917562E-7},1.2110895263493389E-2,2.7134650055411725E-4,1.4566977120222618E-4,10,52.076623156467207,4.8391028807813711E-3,8.9499507426647768E-3,1.3934723394648374E-2,1.420683040441683E-2,2.056423848221909E-2,3.1716592826518537E-4,3.9330838224601076E-4,0,2.1898082614977684E-5,4.1520646486098846E-4,7.3241822089631023E-4,1.0919122231917704E-2,1.5554334351572541E-2,5.3897815344823693E-4,{"$f":"AO8+AV8+AX8+AY8","v":3.1032561130333917E-2},3.1275095165659253E-2,7.2000000000000008E-2,{"$f":"BB8/(BB8+BA8)","v":0.69716711356700101},2.6347785914114167E-3,3.0715222825647912E-3,5.0101045802023923E-2,0.13492820676946624,0,2.1203643124077383E-4,4.0203929533540791E-3,9.3754924049168947E-4,0,1.0858975901139247E-6,1.4097774669617432E-3,0.1506106997686372,0.34792709520374199,0.69716711356700101,{"$f":"100*BQ8","v":69.716711356700102},6,10.507357436577642,0.10507357436577643,48.55659040074206,null,8.6661268414311654E-2,null,3.1032561130333917E-2,1.5554334351572541E-2,9.6826987085500018E-5,null,null,{"$f":"IF(OR(MODE=1,MODE=2,MODE=3), BR8, IF(MODE_ILIM=4,#REF!,#REF!))","v":69.716711356700102},{"$f":"IF(OR(MODE=1,MODE=2,MODE=3), BZ8, IF(MODE_ILIM=4,#REF!,#REF!))","v":3.1032561130333917E-2},{"$f":"IF(OR(MODE=1,MODE=2,MODE=3), CA8, IF(MODE_ILIM=4,#REF!,#REF!))","v":1.5554334351572541E-2},{"$f":"IF(OR(MODE=1,MODE=2,MODE=3), CB8, IF(MODE_ILIM=4,#REF!,#REF!))","v":9.6826987085500018E-5},{"$f":"(IF(OR(MODE=1,MODE=2,MODE=3), S8, IF(MODE_ILIM=4,#REF!,#REF!)))/1000","v":48.55659040074206},{"$f":"IF(OR(MODE=1,MODE=2,MODE=3), P8, IF(MODE_ILIM=4,#REF!,#REF!))","v":149.66621441676034}]
{"$rows_left_out":107}
{"sheet":"Design EMI Filter","index":7,"n_rows":33,"n_cols":15,"rows_kept":33,"cut":false,"hidden":false,"merged":[[0,0,0,22],[32,10,32,12],[29,10,29,12],[31,10,31,12]]}
["                         LM5168/9 100V, Low IQ DC/DC Converter Design Tool  "]
[]
[]
[]
[]
[]
["Step 7: EMI Filter (Optional)"]
[null,null,null,"Desired Maximum Noise Level, Vnoise(MAX)",50,"dBmV"]
{"$rows_left_out":26}
{"sheet":"EVM","index":8,"n_rows":85,"n_cols":15,"rows_kept":85,"cut":false,"hidden":true,"merged":[[0,0,0,16]]}
["LM5163/4 100V, Low IQ DC/DC Converter Design Tool  "]
[]
[null,"LM5164-Q1EVM-041 PCB Layout"]
[]
[null,null,null,null,null,null,null,null,null,null,null,null,null,null,"Top"]
[null,null,null,null,null,null,null,null,null,null,null,null,null,null,"Layer"]
[]
[]
{"$rows_left_out":78}
{"sheet":"BOM & Schematic","index":9,"n_rows":53,"n_cols":13,"rows_kept":53,"cut":false,"hidden":true,"merged":[[33,3,33,5],[0,0,0,16],[29,3,29,5],[41,3,41,5],[47,7,47,9],[30,3,30,5],[43,3,43,5],[44,3,44,5],[42,3,42,5],[39,3,39,5],[40,3,40,5],[38,3,38,5],[37,3,37,5],[36,3,36,5],[31,3,31,5],[34,3,34,5],[32,3,32,5]]}
["                         LM5163/4 100V Low IQ DC/DC Converter Design Tool  "]
[]
[]
[]
[]
[]
[]
[]
{"$rows_left_out":46}
{"sheet":"Schematic Mgmt","index":10,"n_rows":2,"n_cols":1,"rows_kept":2,"cut":false,"hidden":true,"merged":[]}
[]
[{"$f":"'Variable Mgmt'!K27","v":"SCH_COT2_LM5168"}]

{"sheet":"sch_frank","index":11,"n_rows":2,"n_cols":1,"rows_kept":2,"cut":false,"hidden":true,"merged":[]}
[]
[{"$f":"CHOOSE(MODE,\"cot1_sch\",\"cot2_sch\",\"cot3_sch\")","v":"cot2_sch"}]

{"sheet":"Efficiency Plots","index":12,"n_rows":2,"n_cols":1,"rows_kept":2,"cut":false,"hidden":true,"merged":[]}
[]
[{"$f":"IF(PLOT_TYPE=1, \"EFF_LINEAR\", \"EFF_LOG\")","v":"EFF_LINEAR"}]