{"text_format":"1","workbook":"xlsx","n_sheets":13,"sheets":["Design the Converter","Schematic & BOM","EVMs","Variable Management","MOSFET Parameters","Schematic Management","Stability Calculations","Bode Plot Management","Efficiency Calculations","Efficiency Plot Management","Standard Value Calculator","Snubber","Parallel Output Caps"],"not_rendered":{"charts":10,"images":18,"macros":1,"external_links":0,"defined_names":240,"comments":2,"pivot_tables":0},"unopened":[],"bounds":{"document_bytes":16777216,"sheet_cells":100000,"rows_first":2000,"rows_last":500,"rows_between":2000,"halvings":0,"cell_chars":16384,"cell_head_chars":4096},"cells_cut":0,"cells_raw":0,"read":"whole","date_system":"1900"}

{"sheet":"Design the Converter","index":0,"n_rows":73,"n_cols":17,"rows_kept":73,"cut":false,"hidden":false,"merged":[[2,14,2,15],[0,0,0,16],[39,11,40,16],[41,11,42,16]]}
["                           LM76005/-Q1 60VIN, 5AOUT Converter Design Tool"]
[null,null,null,null,null,null,null,null,null,null,null,null,null,null,"http://www.ti.com/product/lm5175"]
["About",null,"xx",null,null,"= Input Box",null,null,null,null,null,null,null,null,"TERMS OF USE",null,"                "]
[]
["Step 1: Operating Specifications"]
[null,null,null,"Input Voltage – Min, VIN(min) ",{"$f":"E7*0.7","v":16.799999999999997},"V"]
[null,null,null,"Input Voltage – Nom, VIN(nom)",24,"V"]
[null,null,null,"Input Voltage – Max, VIN(max)",{"$f":"E7*1.2","v":28.799999999999997},"V"]
[null,null,null,"Output Voltage, VOUT ",5,"V"]
[null,null,null,"Full Load Output Current, IOUT ",5,"A"]
[null,null,null,"Switching Frequency, FSW",400,"kHz"]
[null,null,null,"Frequency Set Resistor, RT ",{"$f":"'Variable Management'!C344","v":100},{"$f":"'Variable Management'!E344","v":"kΩ"}]
[null,null,null,"Ambient Temperature, TA",25,"°C"]
[]
["Step 2: Buck Inductor"]
[null,null,null,"Inductance for 35% Ripple Current at VIN(nom)",{"$f":"Lopt*1000000","v":5.6547619047619051},"µH"]
[null,null,null,"Buck Inductance, LO ",6.8,"µH"]
[null,null,null,"Inductor DCR at 25°C",50,"mΩ"]
[null,null,null,"Inductor Pk-Pk Ripple Current at VIN(nom)",{"$f":"'Variable Management'!B60","v":1.5355683265528202},"APK-PK"]
[null,null,null,"DIL as a % of Full Load at VIN(nom)",{"$f":"'Variable Management'!D60*100","v":30.711366531056406},"%"]
[null,null,null,"Peak Inductor Current at VIN(max) and Full Load",{"$f":"'Variable Management'!B97","v":5.8056975326425828},"APK"]
[null,null,null,"Peak Inductor Current Limit at VIN(nom)",{"$f":"Ipk_OCP_Vinnom","v":6.8},"APK"]
[null,null,null,"Estimate Inductor Core Loss at VIN(nom)",0.1,"W"]
[]
["Step 3: Output Capacitors"]
[null,null,null,"Desired Output Voltage Ripple",60,"mVPK-PK"]
[null,null,null,"Effective COUT Value to Meet Ripple Spec",{"$f":"'Variable Management'!B111","v":7.9977517007959387},"µF"]
[null,null,null,"Desired Crossover Frequency",{"$f":"E11/10","v":40},{"$f":"\"     kHz \"","v":"     kHz "}]
[null,null,null,"Effective COUT Value to Meet Crossover Spec",{"$f":"'Variable Management'!B204","v":78.781696920509404},"µF"]
[null,null,null,"Output Capacitance (derated), COUT ",{"$f":"47*4*0.5","v":94},"µF"]
[null,null,null,"Output Cap ESR (Max) to Meet Ripple Spec",{"$f":"'Variable Management'!B115","v":38.9317972609824},"mΩ"]
[null,null,null,"Output Capacitor ESR",1,"mΩ"]
[null,null,null,"Resulting Output Voltage Ripple (max) ",{"$f":"'Variable Management'!B117*1000","v":5.3308970246333018},"mVPK-PK"]
[null,null,null,"Output Capacitor RMS Current (max) ",{"$f":"'Variable Management'!B104","v":0.46516968735661263},"ARMS"]
[]
["Step 4: Input Capacitors"]
[null,null,null,"Input Voltage Ripple Spec",240,"mVPK-PK"]
[null,null,null,"Minimum Input Capacitance",{"$f":"'Variable Management'!B134","v":13.020833333333334},"µF"]
[null,null,null,"Input Capacitance (derated), CIN ",22,"µF"]
[null,null,null,"Maximum Permitted ESR",{"$f":"'Variable Management'!B139","v":16.872140669367493},"mΩ",null,null,null,null,null,{"$f":"CHOOSE(SCH_MODE, \"\", \"** For Single-Output Operation in 2-Phase Mode, tie MODE to VDDA and use FB1 to set VOUT **\", \"** For Single-Output Operation in 3-Phase Mode, tie both MODE pins to VDDA. Use FB1 of master IC to set VOUT. Connect FB2 of master IC to AGND. Connect FB2 of slave IC to VDDA to configure it as a slave **\", \"** For Single-Output Operation in 4-Phase Mode, tie both MODE pins to VDDA. Use FB1 of master IC to set VOUT. Connect FB2 of master IC to AGND. Connect FB2 of slave IC to VDDA to configure it as a slave **\")","v":""}]
[null,null,null,"Input Capacitor ESR",10,"mΩ"]
[null,null,null,"Resulting Input Voltage Ripple (max)",{"$f":"'Variable Management'!B144*1000","v":200.10242987188036},"mVPK-PK",null,null,null,null,null,{"$f":"CHOOSE(SCH_MODE, \"\", \"** For Single-Output Operation in 2-Phase Mode, tie MODE to VDDA and use FB1 to set VOUT **\", \"** For Single-Output Operation in 3-Phase Mode, tie both MODE pins to VDDA. Use FB1 of master IC to set VOUT. Connect FB2 of master IC to AGND. Connect FB2 of slave IC to VDDA to configure it as a slave **\", \"** For Single-Output Operation in 4-Phase Mode, tie both MODE pins to VDDA. Use FB1 of master IC to set VOUT. Connect FB2 of master IC to AGND. Connect FB2 of slave IC to VDDA to configure it as a slave **\")","v":""}]
[null,null,null,"Input Capacitor RMS Current (max)",{"$f":"'Variable Management'!B127","v":2.3539187979347291},"ARMS"]
[]
["Step 5: Feedback Network"]
[null,null,null,{"$f":"CHOOSE(LM64k_Fixed_Vout, \"Upper Feedback Resistance\", \"* Tie FB to VOUT for a Fixed 5V Output\", \"* Tie FB to VOUT for a Fixed 3.3V Output\")","v":"Upper Feedback Resistance"},40,"kΩ"]
[null,null,null,"Lower Feedback Resistance (E96), RFBB",{"$f":"IF(Vout=Vref,\"OPEN\",Rfb2_u/1000)","v":10},{"$f":"IF(Vout=Vref,\"\",\"kΩ\")","v":"kΩ"}]
[null,null,null,"Feedforward Capacitance, CFF",100,"pF"]
[]
["Step 6: VIN UVLO, VOUT Soft Start",null,null,null,null,null,null,null,null,null,null,null,null,null,null,null," "]
[null,null,null,"Desired VIN UVLO Turn-On Threshold",12,"V"]
[null,null,null,"UVLO Divider Lower Resistance, RENB",100,"kΩ"]
[null,null,null,"UVLO Divider Upper Resistance (E96), RENT",{"$f":"Rent1_u/1000","v":887},{"$f":"IF(Vout=Vref,\"\",\"kΩ\")","v":"kΩ"}]
[null,null,null,"Actual VIN UVLO Turn-On Threshold",{"$f":"'Variable Management'!B232","v":12.021660000000001},"V"]
[null,null,null,"Actual VIN UVLO Turn-Off Threshold",{"$f":"'Variable Management'!B233","v":9.7713000000000001},"V"]
[null,null,null,"Soft-start Time, tSS",7,"ms"]
[null,null,null,"Soft-start Capacitance",{"$f":"IF(Css_u > 12, Css_u, \"N/A\")","v":14.999999999999998},"nF"]
[]
["Step 7: Power Loss & Thermals"]
[null,null,null,"IC Power Dissipation",{"$f":"'Efficiency Calculations'!BE109","v":1.571491727795703},"W"]
[null,null,null,"Thermal Impedance, RqJA",15,"°C/W"]
[null,null,null,"Junction Temperature (estimate)",{"$f":"'Variable Management'!B286","v":48.572375916935542},"°C"]
[null,null,null,null,{"$f":"CHOOSE(Ext_VCC, \"* Connect a 1µF Capacitor From BIAS to GND\", \"* Tie BIAS to GND\")","v":"* Connect a 1µF Capacitor From BIAS to GND"}]
[]
[]
[]
[]
["Pole/Zero Frequencies"]
[null,null,null,"Load Pole Frequency, FP-LOAD",{"$f":"Fp_dominant/1000","v":2.2210055700450431},"kHz"]
[null,null,null,"Output Cap ESR Zero Frequency, FZ-ESR",{"$f":"Fesr/1000000","v":1.6931376944016634},"MHz"]
[null,null,null,"Error Amp Dominant Pole Frequency, FP-EA",{"$f":"Fp1_u","v":148.60405534431035},"Hz"]
[null,null,null,"Compensator Zero Frequency, FZ-COMP",{"$f":"Fz1_u/1000","v":7.5788068225598275},"kHz"]
[null,null,null,"Compensator Pole Frequency, FP-COMP",{"$f":"Fp2_u/1000","v":275.5627260504076},"kHz"]

{"sheet":"Schematic & BOM","index":1,"n_rows":54,"n_cols":10,"rows_kept":54,"cut":false,"hidden":false,"merged":[[49,0,50,0],[49,9,50,9],[49,3,50,6],[49,2,50,2],[49,1,50,1],[49,7,50,7],[49,8,50,8],[48,3,48,6],[44,3,44,6],[45,3,45,6],[43,3,43,6],[42,3,42,6],[38,3,38,5],[36,3,36,5],[46,3,46,6],[47,3,47,6],[35,3,35,6],[37,3,37,5],[41,3,41,5],[39,3,39,5],[40,3,40,5]]}
[]
[]
[]
[]
[]
[]
[]
[]
[]
[]
[]
[]
[]
[]
[]
[]
[]
[]
[]
[]
[]
[]
[]
[]
[]
[]
[]
[]
[]
[]
[]
[]
[]
[{"$f":"\"VIN = \"&VIN_min&\" V to \"&VIN_max&\" V, VOUT = \"&Vout&\" V, IOUT = \"&Iout&\" A,  Fsw = \"&Fsw/1000&\" kHz\"","v":"VIN = 16.8 V to 28.8 V, VOUT = 5 V, IOUT = 5 A,  Fsw = 400 kHz"}]
["High-Efficiency Synchronous Buck DC/DC Converter BOM"]
["Count","Ref Des","Value","Description",null,null,null,"Size","Part Number","MFR"]
[{"$f":"ROUNDUP('Design the Converter'!E39/10,0)","v":3},"CIN1",10,{"$f":"C37","v":10},null,null,null,1210,"Std","Std"]
[2,"COUT",22,{"$f":"C38","v":22},null,null,null,1210,"Std","Std"]
[1,"CVCC",2.2000000000000002,{"$f":"C39","v":2.2000000000000002},null,null,null,"0402","Std","Std"]
[1,"CSYNC",1,{"$f":"C40","v":1},null,null,null,"0402","Std","Std"]
[1,"CSS",{"$f":"'Design the Converter'!E57","v":14.999999999999998},14.999999999999998,null,null,null,"0402","Std","Std"]
[1,"CFF",{"$f":"'Variable Management'!D300","v":100},100,null,null,null,"0402","Std","Std"]
[1,"LO",{"$f":"'Design the Converter'!E17","v":6.8},{"$f":"\"Buck Inductor, \"&Lf*1000000&\" µH, \"&Rdcr*1000&\" mΩ, >\"&ROUNDUP(Ipk_OCP_Vinmin*1.05,0)&\" A\"","v":"Buck Inductor, 6.8 µH, 50 mΩ, >8 A"},null,null,null,"--","--","Various"]
[1,"RT",{"$f":"'Design the Converter'!E12","v":100},{"$f":"C44","v":100},null,null,null,"0402","Std","Std"]
[1,"RFBT",{"$f":"'Design the Converter'!E46","v":40},{"$f":"C45","v":40},null,null,null,"0402","Std","Std"]
[1,"RFBB",{"$f":"'Design the Converter'!E47","v":10},10,null,null,null,"0402","Std","Std"]
[1,"RENB",{"$f":"'Variable Management'!D305","v":100},{"$f":"C47","v":100},null,null,null,"0402","Std","Std"]
[1,"RENT",{"$f":"'Variable Management'!D306","v":887},887,null,null,null,"0402","Std","Std"]
[1,"RPG",100,100,null,null,null,"0402","Std","Std"]
[1,"U1",{"$f":"'Variable Management'!N19","v":"LM76005-Q1"},{"$f":"CHOOSE(GPN, \"IC, LM76005-Q1 Synchronous Buck DC/DC Converter, 3.5V–60V Input, 5A Output\", \"IC, LM76005 Synchronous Buck DC/DC Converter,60V Input, 5A Output\", \"IC, LM76005 Synchronous Buck DC/DC Converter, 3V–36V Input, 6A Output\")","v":"IC, LM76005-Q1 Synchronous Buck DC/DC Converter, 3.5V–60V Input, 5A Output"},null,null,null,"VQFN-22",{"$f":"CHOOSE(VARIANT, \"LM76005QRNPRQ1\", \"LM76005\", \"LM76005\", \"LM76005\", \"LM76005\")","v":"LM76005QRNPRQ1"},"TI"]
[]
[]
["NOTES:"]
["** Effective input and output capacitances should be appropriately derated for applied voltage and temperature, particularly with ceramics **"]

{"sheet":"EVMs","index":2,"n_rows":6,"n_cols":2,"rows_kept":6,"cut":false,"hidden":true,"merged":[[0,0,0,16]]}
["LM63460-Q1 & LM64460-Q1 Converter Design Tool"]
[]
[]
[]
[]
[null,"LM64460EVM-2MHZ (BSR173) PCB Layout"]

{"sheet":"Variable Management","index":3,"n_rows":349,"n_cols":27,"rows_kept":349,"cut":false,"hidden":true,"merged":[[4,4,4,7],[0,0,0,8]]}
["EXCEL Variables Names/Calculations"]
[null,"Input from user ="]
[null,"Output ="]
[null,"Constant"]
["Variable Name","Value","STD Units",null,"Notes",null,null,null,"Iteration"]
["Step 1: Operational Specs"]
["VIN_min",{"$f":"'Design the Converter'!E6","v":16.799999999999997},"V","Minimum input voltage",null,null,null,null,1]
["VIN_nom",{"$f":"'Design the Converter'!E7","v":24},"V","Nominal input voltage",null,null,null,null,null,null,"Use CFF",1,null,"LM64460-Q1 3.3Vout",{"$f":"IF(Vout = 3.3, 1, 0)","v":0},null,null,null,null,"Dual  Outputs",1,null,"FPWM",1,null,{"$f":"CHOOSE(SCH_MODE, \"Bode Plot (Ch1)\", \"Bode Plot - 2 Ph\", \"Bode Plot - 3 Ph\", \"Bode Plot - 4 Ph\")","v":"Bode Plot (Ch1)"},1]
["VIN_max",{"$f":"'Design the Converter'!E8","v":28.799999999999997},"V","Maximum input voltage",null,null,null,null,null,null,"No CFF",2,null,"LM64460-Q1 5Vout",{"$f":"IF(Vout = 5, 1, 0)","v":1},null,null,null,null,"Single Output – 2  Phases",2,null,"DEM",2,null,{"$f":"IF(MODE=1, \"Bode Plot (Ch2)\", \"N/A - Do Not Use\")","v":"Bode Plot (Ch2)"},2]
[null,null,null,null,null,null,null,null,null,null,null,1,null,"LM64460 Fixed Vout",{"$f":"IF(AND(GPN=3,Vout=3.3),3,IF(AND(GPN=3,Vout=5),2,1))","v":1},"1 = No, 2 = 5V, 3 = 3.3V",null,null,null,"Single Output – 3  Phases",3,null,"FPWM/DEM",2,null,"BODE_PLOT_TYPE",1]
["Vout",{"$f":"'Design the Converter'!E9","v":5},"V","Output voltage",null,null,null,null,null,null,"NO_FF_CAP",{"$f":"IF(L10=2, TRUE, FALSE)","v":false},null,null,{"$f":"AND(GPN=3, OR(O8,O9))","v":false},null,null,null,null,"Single Output – 4  Phases",4]
["Iout",{"$f":"'Design the Converter'!E10","v":5},"A","Output current",null,"Iout-max",{"$f":"CHOOSE(GPN, 6, 6)","v":6},"A",1,null,null,null,null,null,null,null,null,null,null,"Single/Dual Yes/No",1]
[null,null,null,null,null,null,null,null,1,null,null,null,null,null,null,null,null,null,null,"MODE (Single/Dual), DUAL = 1, SINGLE = 2",{"$f":"IF(U12=1, 1, 2)","v":1},null,"External BIAS",1]
["Rout",{"$f":"Vout/Iout","v":1},"W","Load resistance",null,null,null,null,null,null,null,null,null,"LM63460-Q1 AUTO",1,null,null,null,null,"SINGLE OUTPUT (1 = YES)",{"$f":"IF(U12=1, 2, 1)","v":2},null,"No External BIAS",2]
["Pout",{"$f":"Vout*Iout","v":25},"W","Output power",null,null,null,null,null,null,null,null,null,"LM63460-Q1 FPWM",2,null,null,null,null,"Number of Phases",{"$f":"SCH_MODE","v":1},null,"Ext_VCC",1]
[null,null,null,null,null,null,null,null,null,null,null,null,null,"LM64460-Q1",3]
["Efficiency",0.9,null,"Estimate of efficiency",null,null,null,null,null,null,null,null,null,"LM64460-Q1 5V",4]
["Pin",{"$f":"Pout/Efficiency","v":27.777777777777779},"W","Calculate input power assuming finite efficiency",null,null,null,null,null,null,null,null,null,"LM64460-Q1 3.3V",5]
[null,null,null,null,null,null,null,null,null,null,null,"GPN",null,{"$f":"CHOOSE(GPN, \"LM76005-Q1\", \"LM76003-Q1\", \"LM76002-Q1\")","v":"LM76005-Q1"},1,null,null,null,null,null,null,null,"2.2 MHz Fsw Setting",1]
["Iin_Vinmin",{"$f":"Pin/VIN_min","v":1.6534391534391537},"A",null,null,null,null,null,null,null,null,null,null,null,null,null,null,null,null,null,null,null,"440 kHz Fsw Setting",2]
["Iin_Vinnom",{"$f":"Pin/VIN_nom","v":1.1574074074074074},"A","Input currents at min, nom, max Vin",null,null,null,{"$f":"AND(OSC=1, OR(Fsw/1000>2530, Fsw/1000<1800))","v":false},null,null,"Variant","VARIANT",null,{"$f":"CHOOSE(VARIANT, \"LM63460AAS\",\"LM63460AFS\", \"LM64460APP\", \"LM64460BPP\", \"LM63460CPP\")","v":"LM63460AAS"},{"$f":"IF(AND(GPN=3,Vout=5),4,IF(AND(GPN=3,Vout=3.3),5,GPN))","v":1},null,null,null,null,null,null,null,"OSC",2]
["Iin_Vinmax",{"$f":"Pin/VIN_max","v":0.96450617283950635},"A",null,null,null,null,{"$f":"AND(OSC=2, OR(Fsw/1000>500, Fsw/1000<300))","v":false}]
[null,null,null,null,null,null,null,{"$f":"OR(H21,H22)","v":false}]
["Fsw",{"$f":"'Design the Converter'!E11*1000","v":400000},"Hz","Nominal switching frequency - determines RT resistor"]
["RT resistor to AGND",{"$f":"38400/((Fsw/1000)-14.33)","v":99.566987320766458},"kΩ",null,null,null,null,null,1]
["Tsw",{"$f":"1/Fsw","v":2.5000000000000002E-6},"sec","Switching period"]
["Max crossover frequency = 20% Fsw",{"$f":"Fsw*0.2/1000","v":80},"kHz",null,null,"Min Crossover",10,null,null,null,"Adjustable",1]
["Vref",1,"V","Reference voltage",null,null,null,null,null,null,"5V",2]
["Rt",{"$f":"'Standard Value Calculator'!L12/1000","v":100},"kΩ","Frequency set resistor",null,{"$f":"IF(OR((Fsw=440000),(Fsw=2200000)),\"N/A\",Rfadj/1000)","v":0.1},null,null,null,null,"3.3V",3]
[null,null,null,null,null,null,null,null,null,null,"Adjustable_NoRT",4]
[null,null,null,null,null,null,null,null,null,null,"5V_NoRT",5]
[null,null,null,null,null,null,null,null,null,null,"3.3V_NoRT",6]
["Step 2: Buck Inductor","Channel 1",null,null,null,null,null,null,null,null,"Schematic setting",{"$f":"IF(No_RT, IF(Vout=3.3, 6, IF(Vout=5, 5, 4)),IF(Vout=3.3, 3, IF(Vout=5, 2, 1)))","v":2}]
["Don1",{"$f":"Vout/VIN_nom","v":0.20833333333333334},null,null,null,"Ideal Duty Cycle at VIN(nom)"]
["Doff1",{"$f":"1-34:34","v":0.79166666666666663},null,null,null,"Ideal 1- Duty Cycle at VIN(nom)"]
[]
["D_Vinmin",{"$f":"Vout/VIN_min","v":0.29761904761904767}]
["D_Vinnom",{"$f":"Vout/VIN_nom","v":0.20833333333333334}]
["D_Vinmax",{"$f":"Vout/VIN_max","v":0.17361111111111113}]
[]
["L_Vinnom",{"$f":"(VIN_nom-Vout)*D1_Vinnom/(Fsw*Iout*0.35)","v":5.6547619047619048E-6},"H",null,null,"Calculated inductance for 35% ripple at VIN(nom)"]
["L_slopecomp",null,"H",null,null,"Calculated inductance based on one times inductor downslope"]
[]
["Lopt",{"$f":"B41","v":5.6547619047619048E-6},"H",null,null,"min of calculated inductances at VIN(min) and VIN(nom)"]
["L_actual_TPSM63602-03",{"$f":"-0.0238*Iout^2-0.0868*Iout+2.0073","v":0.97829999999999973},"uH",null,null,"Calculate TOKO chip inductance based on entered load current value"]
["L_actual_TPSM63604-06",{"$f":"-0.1304*Iout+2.32","v":1.6679999999999999},"uH",null,null,"Calculate MagLayers inductance based on entered load current value"]
[]
["Lo",{"$f":"'Design the Converter'!E17*0.000001","v":6.7999999999999993E-6},"H",null,null,"Chosen inductance"]
["Rdcr",{"$f":"'Design the Converter'!E18/1000","v":0.05},"W",null,null,"Chosen inductor DCR"]
[]
["Don2",{"$f":"(Vout+Iout*(Rdcr+Rdson2))/(Vin+Iout*(Rdson2-Rdson1))","v":0.22724406138322473}]
["Doff2",{"$f":"1-_Don2","v":0.77275593861677527}]
[]
["D_Vinmin_2",{"$f":"(Vout+Iout*(Rdcr+Rdson2))/(VIN_min+Iout*(Rdson2-Rdson1))","v":0.32589689478444384},null,{"$f":"Vout/VIN_min","v":0.29761904761904767},null,"Duty cycles adjusted for DCR/Rdson voltage drops"]
["D_Vinnom_2",{"$f":"(Vout+Iout*(Rdcr+Rdson2))/(VIN_nom+Iout*(Rdson2-Rdson1))","v":0.22724406138322473},null,{"$f":"Vout/VIN_nom","v":0.20833333333333334}]
["D_Vinmax_2",{"$f":"(Vout+Iout*(Rdcr+Rdson2))/(VIN_max+Iout*(Rdson2-Rdson1))","v":0.1890851845373448},null,{"$f":"Vout/VIN_max","v":0.17361111111111113},null,{"$f":"(Ts-0.000000085)/Ts","v":0.96599999999999997},"Dmax = [Ts-toff(min)]/Ts"]
[]
[]
["Iripple_Vinmin",{"$f":"(VIN_min-Vout-Iout*(Rdcr+Rdson1))*D1_Vinmin_2/(Fsw*Lf)","v":1.3395320895919418},"A",{"$f":"B59/Iout","v":0.26790641791838837},null,"Ripple calculations include DCR and Rdson"]
["Iripple_Vinnom",{"$f":"(VIN_nom-Vout-Iout*(Rdcr+Rdson1))*D1_Vinnom_2/(Fsw*Lf)","v":1.5355683265528202},"A",{"$f":"B60/Iout","v":0.30711366531056405},null,"% ripple current at Vin-nom"]
["Iripple_Vinmax",{"$f":"(VIN_max-Vout-Iout*(Rdcr+Rdson1))*D1_Vinmax_2/(Fsw*Lf)","v":1.6113950652851661},"A",{"$f":"B61/Iout","v":0.32227901305703321},null,"Max inductor ripple current - it's at Vin-max"]
[]
["Iinductor_rms_Vinmin",{"$f":"SQRT(Iout^2+(Iripple_Vinmin^2)/12)","v":5.0149305928982919},"A"]
["Iinductor_rms_Vinnom",{"$f":"SQRT(Iout^2+(Iripple_Vinnom^2)/12)","v":5.0196112904413246},"A"]
["Iinudctor_rms_Vinmax",{"$f":"SQRT(Iout^2+(Iripple_Vinmax^2)/12)","v":5.0215916638089411},"A"]
[]
[]
["Core loss estimate - Vin(nom)",{"$f":"'Design the Converter'!E23","v":0.1},"W"]
[]
[]
["Inductor copper temperature",125,"°C"]
["Inductor DCR at hot",{"$f":"Rdcr*(1+Ltc*(B71-25))*1000","v":69.650000000000006},"mW"]
[]
[]
["Step 2b: Sense Resistors, Slope Comp, Current Limit"]
[]
["Ilimit_inductor_Vinmin",{"$f":"Ipk_OCP_Vinmin","v":6.8},"A",null,null,"Peak inductor current at current limit inception"]
["Ilimit_inductor_Vinnom",{"$f":"Ipk_OCP_Vinmin","v":6.8},"A"]
["Ilimit_inductor_Vinmax",{"$f":"Ipk_OCP_Vinmin","v":6.8},"A"]
[]
["CS threshold_min",6.8000000000000005E-2,"V","not applicable here"]
["CS threshold",7.4999999999999997E-2,"V"]
["CS threshold_max",8.2000000000000003E-2,"V"]
[]
["Rs",0.01,"W",null,null,"Current sense resistance Rs = high-side MOSFET Rdson"]
[]
["Current limit setpoint - peak - Vin(min)",6.8,"A",null,null,"Peak current limit (10.3A trimmed at ATE minus slope comp contribution) = min inductor sat current at hot"]
["Current limit setpoint - peak - Vin(nom)",6.8,"A"]
["Current limit setpoint - peak - Vin(max)",6.8,"A"]
[]
["Iout_OCP_Vinmin",{"$f":"Ipk_OCP_Vinmin-Iripple_Vinmin/2","v":6.1302339552040293},"A",null,null,"Current limit setpoints (i.e. IOUT) assuming no CS delay"]
["Iout_OCP_Vinnom",{"$f":"Ipk_OCP_Vinnom-Iripple_Vinnom/2","v":6.0322158367235899},"A"]
["Iout_OCP_Vinmax",{"$f":"Ipk_OCP_Vinmax-Iripple_Vinmax/2","v":5.994302467357417},"A"]
[]
["Ipk_full-load_Vinmin",{"$f":"Iout+Iripple_Vinmin/2","v":5.6697660447959706},"A"]
["Ipk_full-load_Vinnom",{"$f":"Iout+Iripple_Vinnom/2","v":5.76778416327641},"A"]
["Ipk_full-load_Vinmax",{"$f":"Iout+Iripple_Vinmax/2","v":5.8056975326425828},"A"]
[]
[]
["Step 3: Output Capacitor"]
["Icoutrms_VINmin",{"$f":"Iripple_Vinmin/SQRT(12)","v":0.38668960625702475},"A",null,null,"Output cap RMS current"]
["Icoutrms_VINnom",{"$f":"Iripple_Vinnom/SQRT(12)","v":0.44328039334716696},"A"]
["Icoutrms_VINmax",{"$f":"Iripple_Vinmax/SQRT(12)","v":0.46516968735661263},"A"]
["Max Cout rms current",{"$f":"MAX(B101:B103)","v":0.46516968735661263},"A"]
[]
["Vripple1",{"$f":"'Design the Converter'!E26/1000","v":0.06},"V",null,null,"Output voltage ripple spec(pk-pk)"]
[]
["Output Ripple Spec (pk-pk)",{"$f":"Vo1_ripple*1000","v":60},"mV",null,null,"Vout ripple spec at Vin(nom)"]
[]
["Coutmin",{"$f":"Iripple_Vinnom/(Fsw*8*Vo1_ripple)","v":7.9977517007959387E-6},"F",null,null,"Minimum output capacitnace",null,{"$f":"Vo2_ripple","v":0},1]
["Reported Coutmin",{"$f":"IF(Cout_min*1000000<2, 2.2,Cout_min*1000000)","v":7.9977517007959387},"uF"]
["Cout",{"$f":"'Design the Converter'!E30/1000000","v":9.3999999999999994E-5},"F",null,null,"Chosen output capacitance",null,null,1]
["Resrmax",{"$f":"SQRT((Vo1_ripple/Iripple_Vinnom)^2-(1/(Fsw*Cout*8))^2)","v":3.89317972609824E-2},"W",null,null,"Max ESR before ripple exceeds Vripple1",null,null,1]
[]
["Reported Cout ESR max",{"$f":"IF(OR(CoutEsrMax>0.3, CoutEsrMax<0, (ISERROR(CoutEsrMax))), \"N/A\", CoutEsrMax*1000)","v":38.9317972609824},"mΩ"]
["CoutEsr",{"$f":"'Design the Converter'!E32/1000","v":1E-3},"W",null,null,"Chosen ESR",null,null,1,null,{"$f":"ISERROR(CoutEsrMax)","v":false},{"$f":"ISERROR(B115)","v":false}]
["Vripple",{"$f":"Iripple_Vinnom*SQRT(Cout_ESR^2+(1/(8*Fsw*Cout))^2)","v":5.3308970246333017E-3},"Vp-p",null,null,null,null,null,null,null,null,{"$f":"OR(CoutEsrMax>0.3,CoutEsrMax<0)","v":false}]
[null,null,null,null,null,null,null,null,null,null,{"$f":"OR(TRUE, FALSE, TRUE)","v":true}]
["Step 4: Input Capacitor"]
[]
["Icinrms_VINmin",{"$f":"SQRT(D1_Vinmin_2*(Iout^2*(1-D1_Vinmin_2)+Iripple_Vinmin^2/12))","v":2.3539187979347291},"A",null,null,"Calculate input cap rms current",null,null,null,null,null,null,null,"A"]
["Icinrms_VINnom",{"$f":"SQRT(D1_Vinnom_2*(Iout^2*(1-D1_Vinnom_2)+Iripple_Vinnom^2/12))","v":2.1058864737452119},"A"]
["Icinrms_VINmax",{"$f":"SQRT(D1_Vinmax_2*(Iout^2*(1-D1_Vinmax_2)+Iripple_Vinmax^2/12))","v":1.968302371843875},"A"]
["Max Cin rms current",{"$f":"MAX(B121:B123)","v":2.3539187979347291},"A"]
[]
["Icinrms - max at D = 0.5",{"$f":"Iout/2","v":2.5},"A"]
["Final result",{"$f":"IF(VIN_min<2*Vout, Iout/2, B121)","v":2.3539187979347291},"A","…report this"]
[]
["Vinripple1",{"$f":"'Design the Converter'!E37/1000","v":0.24},"Vp-p",null,null,"Input voltage ripple spec (pk-pk)"]
[null,null,null,null,null,{"$f":"Number_of_Phases","v":1}]
["Cinmin_Vinmax",{"$f":"Iout*D1_Vinmax*(1-D1_Vinmax)/(Vinripple1*Fsw)","v":7.4724111046810707E-6},"F",null,null,"Calculate cap at Vinmax and 50% duty cycle (Vin = 2*Vout)"]
["Cinmin_50%D",{"$f":"Iout*0.5*(1-0.5)/(Vinripple1*Fsw)","v":1.3020833333333334E-5},"F",null,null,"Buck 50% typically worst case"]
["Cinmin",{"$f":"IF(VIN_max<2*Vout, B131,B132)","v":1.3020833333333334E-5},"F"]
["Reported Cinmin",{"$f":"IF(Cinmin*1000000<4.7, 4.7,Cinmin*1000000)","v":13.020833333333334},"uF",null,null,"…report this"]
["Cin",{"$f":"'Design the Converter'!E39/1000000","v":2.1999999999999999E-5},"F",null,null,"Input capacitance"]
["CinEsrMax_Vinmax",{"$f":"-(Iout*D1_Vinmax*(1-D1_Vinmax)/(Cin*Fsw)-Vinripple1)/(Iout+Iripple_Vinmax/2)","v":2.7297803073250537E-2},"W"]
["CinEsrMax_50%D",{"$f":"-(Iout*0.5*(1-0.5)/(Cin*Fsw)-Vinripple1)/(Iout+Iripple_Vinmax/2)","v":1.6872140669367493E-2},"W",null,null,"Calculate ESR at Vinmax and 50% duty cycle (Vin = 2*Vout)"]
["CinEsrMax",{"$f":"IF(VIN_max<2*Vout, B136,B137)","v":1.6872140669367493E-2},"W"]
["Reported Cin ESR max",{"$f":"IF(OR(CinEsrMax>0.3, CinEsrMax<0), \"N/A\",CinEsrMax*1000)","v":16.872140669367493},"mΩ",null,null,"…report this"]
["RCinEsr",{"$f":"'Design the Converter'!E41/1000","v":0.01},"W",null,null,"Input capacitance series resistance (ESR)"]
[]
["Vinripple2_Vinmax",{"$f":"Iout*D1_Vinmax_2*(1-D1_Vinmax_2)/(Cin*Fsw)+(Iout +Iripple_Vinmax/2)*RCinEsr","v":0.14517741710246168},"Vp-p"]
["Vinripple2_50%D",{"$f":"Iout*0.5*(1-0.5)/(Cin*Fsw)+(Iout +Iripple_Vinmax/2)*RCinEsr","v":0.20010242987188037},"Vp-p",null,null,"Calculate ripple at Vinmax and 50% duty cycle (Vin = 2*Vout)"]
["Vinripple2",{"$f":"IF(VIN_max<2*Vout, B142,B143)","v":0.20010242987188037},"Vp-p",null,null,"…report highest of these"]
[]
[null,{"$f":"Iout*D1_Vinmax_2*(1-D1_Vinmax_2)/(Cin*Fsw)","v":8.712044177603584E-2},"Vp-p"]
[]
["Step ?: Other Components - Soft start, SYNC, PG"]
[]
["RPG",100,"kΩ","PGOOd pull-up resistance"]
["RSYNC",100,"W","SYNC termination resistance"]
["Soft-start time",{"$f":"'Design the Converter'!E56","v":7},"ms"]
["Css",{"$f":"2*B152*0.000000001","v":1.4000000000000001E-8},"F","Soft-start capacitance based on 2uA charging current to 1V"]
["Css - std value",{"$f":"'Standard Value Calculator'!L22*1000000000","v":14.999999999999998},"nF","Standard value for Css"]
[]
["Step 5: Feedback Network and Internal Compensation"]
["Pi",3.1415926500000002,null,"p"]
["CS Amp Gain (effective value)",3.2759999999999998,null,null,null,"Effective CS gain - depending on control architecture = 1/(Imod*Rdson_HS*0.73) = 1/(6*1.7*41mΩ*0.73)"]
["Ri",0.2,"W","Use slightly higher value to match bench",null,"Current Sense effective resistance = shunt resistor Rs * CS amp gain = 0.1343Ω"]
[]
["Se_ext",{"$f":"B165/Ri*1000","v":2080000},"A/s",null,null,"Slope Comp Slope - referred to inductor current"]
["Sn",{"$f":"(Vin-Vout)/Lf","v":2794117.6470588236},"A/s",null,null,"On-time Slope"]
["Sf",{"$f":"Vout/Lf","v":735294.11764705891},"A/s",null,null,"Off-time Slope"]
[]
["Se_int",{"$f":"5.2*Ri*Fsw/1000","v":416},"mV/μs",null,null,"Slope Comp Slope - referred to IC"]
["Sn_int",{"$f":"Sn*Ri/1000","v":558.82352941176475},"mV/μs",null,null,"Upslope"]
["Sf_int",{"$f":"Sf*Ri/1000","v":147.05882352941177},"mV/μs",null,null,"Downslope"]
[]
["mc_buck",{"$f":"1+Se_ext/Sn","v":1.7444210526315789},null,null,null,"mc = 1 + Se/Sn for peak current-mode buck"]
["k_buck",{"$f":"mc_buck*(1-D1_Vinnom_2)","v":1.3480117278691788},null,null,null,"mc*(1-d)"]
[]
["mc",{"$f":"1+Se_ext/Sn","v":1.7444210526315789}]
["k",{"$f":"mc_buck*(1-D1_Vinnom_2)","v":1.3480117278691788}]
["Q",{"$f":"1/Pi/(k-0.5)","v":0.37536024100437659},null,null,null,"1/(Pi*(k-0.5))",null,"Q = 2/Pi = 0.636 gives ideal one-cycle damping"]
[]
["Error Amp (EA)"]
["gm",{"$f":"33/1000000","v":3.3000000000000003E-5},"S",null,null,"Error amp transconductance"]
["GBW",20,"MHz",null,null,"EA gain-bandwidth product"]
["Cbw",{"$f":"gm/(2*Pi*GBW*1000000)","v":2.6260565640169807E-13},"F",null,null,"EA effective bandwidth limiting capacitance = gm/(2*Pi*GBW)"]
[]
["RoEA",{"$f":"30000000","v":30000000},"W",null,null,"EA output resistance"]
["AEA",{"$f":"gm*RoEA","v":990.00000000000011},"V/V",null,null,"EA DC gain = gm*RoEA"]
["Afb",{"$f":"Vref/Vout","v":0.2},"V/V",null,null,"Feedback gain from Vout to FB"]
["Acs",{"$f":"1/Ri","v":5},null,null,null,"Acs = 1/Ri"]
["Am_buck",{"$f":"(Ro/Number_of_Phases)/Ri/((1+Ro/Number_of_Phases*(k-0.5)/(Fsw*Lf)))","v":3.8116466640993747}]
["Am",{"$f":"Ro/Ri/((1+Ro*(k-0.5)/(Fsw*Lf)))","v":3.8116466640993747},null,null,null,"Buck modulator gain"]
[]
["Scaling factor to calculate Rcomp - buck",{"$f":"2*Pi*Ri/gm","v":38079.910909090911},null,null,null,"2*Pi*Ri/gm -- scaling factor to calculate Rcomp given desired buck crossover frequency"]
["DC Gain is Adc = AEA*Afb*Am"]
[]
["Rout",{"$f":"Rout","v":1},"W",null,null,"Output Resistance (Load)"]
[]
["Fp_load_buck",{"$f":"1/(2*Pi*Ro*Cout)+(k-0.5)/(2*Pi*Fsw*Lf*Cout)","v":2221.005570045043},"Hz",null,null,"Buck dominant pole frequency -- note slope comp influence"]
["Fp_dominant",{"$f":"Fload_u","v":2221.005570045043},"Hz"]
["Cbw",{"$f":"Cbw","v":2.6260565640169807E-13},"F",null,null,"Cbw"]
["Fp_EA",{"$f":"1/(2*Pi*(RoEA+Rcea1_u)*Cc1ea_u)","v":148.60405534431035},"Hz",null,null,"Error Amp LF pole -- related to amplifier ouptut resistance and comp cap"]
["Fp_HF",{"$f":"1/(2*Pi*Rcea1_u*(Cc2ea_u+Cbw))","v":275562.72605040763},"Hz",null,null,"Error Amp HF pole cancels zero related to Output Cap ESR"]
["Fesr",{"$f":"1/(2*Pi*Cout*Cout_ESR)","v":1693137.6944016635},"Hz",null,null,"Cout ESR zero frequency"]
["F_mod",{"$f":"Fsw/2","v":200000},"Hz",null,null,"Zero-order sample-and-hold effects of current-mode control modeled as pole at Fsw/2"]
["Fz_ff",{"$f":"IF(NO_FF_CAP=TRUE, 1000000000, 1/(2*Pi*Rfb1_*Cff_u*0.000000000001))","v":39788.735818439091},"Hz",{"$f":"Fz_ff/1000","v":39.788735818439093},"kHz"]
["Fp_ff",{"$f":"IF(NO_FF_CAP=TRUE, 1000000000, 1/(2*Pi*Rfb4_u*Cff_u*0.000000000001))","v":198943.6790921955},"Hz",{"$f":"Fp_ff/1000","v":198.94367909219551},"kHz"]
[]
["Desired Crossover Frequency",{"$f":"'Design the Converter'!E28*1000","v":40000},"Hz"]
["Cout - for the Fc spec",{"$f":"Rcea1_u/Fcross/(2*Pi*Ri/(gm*Afb))*1000000","v":78.781696920509404},"uF",null,null,"Output cap to meet the crossover frequeny spec"]
["Rcea1",{"$f":"Fcross*Cout*2*Pi*Ri/(gm*Afb)","v":715902.32509090903},"W",null,null,"This component will largely determine the crossover frequency",null,null,null,null,{"$f":"Fcross/Fp_dominant/(gm*Afb*Am)","v":715902.32509090891}]
["Cc1ea, Cc3ea",{"$f":"10/(Rcea1*Fcross*2*Pi)","v":5.5578441952100817E-11},"F",null,null,"This along with Rcea1 will set a zero at Fcrossover/5 to optimize phase margin"]
["Cc2ea, Cc4ea",{"$f":"MAX(1/(Rcea1*2*Pi*Fesr)-Cbw, 1/(Rcea1*2*Pi*(Fsw/2))-Cbw)","v":8.4896318264031821E-13},"F",null,null,"This along with Rcea1 places a pole at the output cap ESR zero"]
[]
["Chosen Compensation Components from the standard value sheet"]
["Rcea1_u",600000,"W",null,null,{"$f":"1/(Rcea1*2*Pi*(Fsw/2))-Cbw","v":8.4896318264031821E-13}]
["Cc1ea_u",3.5000000000000002E-11,"F"]
["Cc2ea_u",7.0000000000000005E-13,"F"]
[]
["Resulting Pole/Zero Locations",null,null,null,null,{"$f":"Cout","v":9.3999999999999994E-5},{"$f":"Cout_ESR","v":1E-3}]
["Fz1",{"$f":"1/(2*Pi*Rcea1_u*Cc1ea_u)","v":7578.8068225598272},"Hz",null,null,"This zero is set at or close to the dominant load pole"]
["Fp2",{"$f":"1/(2*Pi*Rcea1_u*(Cc1ea_u*(Cc2ea_u+Cbw)/(Cc1ea_u+Cc2ea_u+Cbw)))","v":283141.53287296748},"Hz",null,null,"This pole cancels the zero from the Output Cap ESR"]
[]
["Rfb1",{"$f":"'Design the Converter'!E46*1000","v":40000},"W",null,null,"Lower Feedback Resistance - chosen by user"]
["Rfb2",{"$f":"IF(Vout=Vref, \"N/A\", Vref/(Vout-Vref)*B218)","v":10000},"W",{"$f":"Rfb2_u","v":10000},null,"Upper Feedback Resistance"]
["Rfb2_u",{"$f":"IF(Vout=Vref,\"N/A\",'Standard Value Calculator'!L11)","v":10000},"W",null,null,"Std Value Upper Feedback Resistance"]
["Cff",{"$f":"1/(2*Pi*200000)/Rfb1_","v":1.9894367909219548E-11},"F",{"$f":"1/(1/Rfb1_+1/Rfb2_u)","v":8000},"W","Based on a 200kHz zero frequency"]
["Cff_u",{"$f":"IF('Design the Converter'!E48<0.1, 0.1, 'Design the Converter'!E48)","v":100},"pF"]
[]
["Fcross based on datasheet equation",{"$f":"15.46/(Vout*Cout)","v":32893.617021276601},"Hz"]
[]
[]
["Step 6: UVLO Divider"]
["VIN UVLO turn-on voltage",{"$f":"'Design the Converter'!E51","v":12},"V"]
["Renb",{"$f":"'Design the Converter'!E52*1000","v":100000},"W"]
["Rent",{"$f":"(B228/1.218 - 1)*Renb","v":885221.6748768473},"W"]
["Rent_u",{"$f":"'Standard Value Calculator'!L7","v":887000},"W"]
["Actual VIN UVLO turn-on voltage",{"$f":"1.218/Renb*(Renb+Rent1_u)","v":12.021660000000001},"V"]
["Actual VIN UVLO turn-off voltage",{"$f":"0.99/Renb*(Renb+Rent1_u)","v":9.7713000000000001},"V"]
[]
["Step 7: Efficiency"]
["VAR",0]
["Design"]
["Ta",{"$f":"'Design the Converter'!E13","v":25},"°C","Ambient Temperature"]
["Components"]
["LTc",{"$f":"3930/1000000","v":3.9300000000000003E-3},"%/°C","Inductor DCR Temp Co"]
["θCA",22,"°C/W","Inductor Core-to-Ambient Thermal Resistance"]
["RCinEsr",{"$f":"RCinEsr","v":0.01},"W","Input Capacitor ESR"]
[]
["Controller Characteristics"]
["VCC",3.3,"V"]
["Top Driver"]
["RdsonDRT",0.5,"W","Drain-Source Resistance of Pullup High-side FET Driver"]
["RdsonDRT2",0.5,"W","Drain-Source Resistance of Pulldown High-side FET Driver"]
["Bottom Driver"]
["RdsonDRB",0.5,"W","Drain-Source Resistance of Pullup Low-side FET Driver"]
["RdsonDRB2",0.5,"W","Drain-Source Resistance of Pulldown Low-side FET Driver"]
["Deadtime"]
["Deadtime",8.0000000000000005E-9,"s","Total Deadtime",null,null,"8ns"]
["IQ"]
["IQ ",3.4999999999999997E-5,"A","Quiescent Current of LM5143-Q1 Controller (One channel disabled)"]
[]
["High- & low-side MOSFETs - Ch1","Q1: high-side",null,"Q2: low-side"]
["Rdson",{"$f":"'MOSFET Parameters'!E6/1000","v":7.3999999999999996E-2},"W",{"$f":"'MOSFET Parameters'!F6/1000","v":3.1E-2},"W","Drain-Source Resistances of Channel 1 FETs"]
["RdsonTopTc",{"$f":"4000/1000000","v":4.0000000000000001E-3},"%/°C",4.0000000000000001E-3,"%/°C","Drain-Source Resistance Temp Co"]
["Qg",{"$f":"'MOSFET Parameters'!E7/1000000000","v":4.0999999999999995E-9},"C",{"$f":"'MOSFET Parameters'!F7/1000000000","v":8.5999999999999993E-9},"C","Gate Charge at VCC = 5V"]
["Qgd",{"$f":"'MOSFET Parameters'!E8/1000000000","v":1.6999999999999999E-9},"C",{"$f":"'MOSFET Parameters'!F8/1000000000","v":8.5600000000000002E-9},"C","Gate to Drain Charge"]
["Qgs",{"$f":"'MOSFET Parameters'!E9/1000000000","v":2.3900000000000002E-9},"C",{"$f":"'MOSFET Parameters'!F9/1000000000","v":5.7999999999999998E-9},"C","Gate to Source Charge"]
["Qoss",{"$f":"'MOSFET Parameters'!E10/1000000000","v":0},"C",{"$f":"'MOSFET Parameters'!F10/1000000000","v":6.8800000000000002E-9},"C","Output Charge"]
["Coss",{"$f":"'MOSFET Parameters'!E11/1000000000000","v":5.3000000000000003E-10},"F",{"$f":"'MOSFET Parameters'!F11/1000000000000","v":5.09E-10},"F","Output Capacitance"]
["Rgate",{"$f":"'MOSFET Parameters'!E12","v":0.158},"W",{"$f":"'MOSFET Parameters'!F12","v":0.24},"W","Gate Resistance"]
["Gfs",{"$f":"'MOSFET Parameters'!E13","v":100},"S",{"$f":"'MOSFET Parameters'!F13","v":100},"S","Transconductance"]
["Vth",{"$f":"'MOSFET Parameters'!E14","v":1.5},"V",{"$f":"'MOSFET Parameters'!F14","v":1.5},"V","Threshold Voltage"]
["Vsp",{"$f":"Vth_Q1+Iout/Gfs_Q1","v":1.55},"V",{"$f":"Vth_Q2+Iout/Gfs_Q2","v":1.55},"V","Switch Point Voltage of FETs"]
[]
["Vsd - Buck",{"$f":"'MOSFET Parameters'!E15","v":0.7},"V",{"$f":"'MOSFET Parameters'!F15","v":0.7},"V","Diode Forward Voltage of MOSFET Body diode"]
["QrrTop",null,"C",{"$f":"'MOSFET Parameters'!F16/1000000000","v":2.3000000000000001E-8},"C","Reverse Recovery Charge of Body Diode"]
["TrrTop",4.0000000000000001E-8,"s",4.0000000000000001E-8,"s","Reverse Recovery Time of Body Diode"]
["θJA-MOSFET",23,"°C/W",23,"°C/W","Junction-to-Ambient Resistance"]
[]
[]
["Controller"]
["θJACtrl",{"$f":"'Design the Converter'!E61","v":15},"°C/W",null,null,"Junction-to-ambient thermal resistance of controller"]
["Outputs"]
["Top FET"]
["Tr",{"$f":"(Qgd_Q1+Qgs_Q1/2)*(RdsonDRT+Rgate1)/(VCC-Vsp_Q1)","v":1.0885200000000003E-9},"s"]
["Tf",{"$f":"(Qgd_Q1+Qgs_Q1/2)*(RdsonDRT2+Rgate1)/(Vsp_Q1)","v":1.2289741935483873E-9},"s"]
[]
["IC Power Disipation","Value","Units"]
["Power Dis",{"$f":"'Efficiency Calculations'!BE109","v":1.571491727795703},"W"]
["Temp rise",{"$f":"B284*ThetaJaCtrl","v":23.572375916935545},"°C"]
["Junction temperature",{"$f":"B285 + Ta","v":48.572375916935542},"°C"]
[]
["Current (switching)",{"$f":"(Qg_Q1+Qg_Q2)*Fsw+Iq","v":5.1149999999999998E-3},"A"]
["Qrr Current",{"$f":"Qrr_Q2*Fsw","v":9.1999999999999998E-3},"A"]
["Diode Current",{"$f":"C290/Vin","v":{"$error":"#NAME?"}},{"$f":"Deadtime*Fsw*(Ipp/2)*(Vsd_Q1+Vsd_Q2)","v":{"$error":"#NAME?"}}]
["Total Application Switching IQ",{"$f":"SUM(B288:B290)","v":{"$error":"#NAME?"}},"A"]
[]
["Low-side MOSFET/Diode"]
["Part Power"]
["Power Dis"]
[]
["SCHEMATIC LABELS"]
[{"$f":"\"RFBT = \"&'Design the Converter'!E46&\"kΩ\"","v":"RFBT = 40kΩ"},{"$f":"IF(VARIANT<4, 'Design the Converter'!E46&\" kΩ\", \"\")","v":"40 kΩ"},null,{"$f":"'Design the Converter'!E46&\"kΩ\"","v":"40kΩ"}]
[{"$f":"\"RFBB = \"&'Design the Converter'!E47&\"kΩ\"","v":"RFBB = 10kΩ"},{"$f":"IF(VARIANT<4, 'Design the Converter'!E47&\" kΩ\", \"\")","v":"10 kΩ"},null,{"$f":"'Design the Converter'!E47&\"kΩ\"","v":"10kΩ"}]
[{"$f":"\"CFF = \"&'Design the Converter'!E48&\"pF\"","v":"CFF = 100pF"},{"$f":"IF(VARIANT< 4, IF(NO_FF_CAP=TRUE,\"N/A\",IF(Cff_u>0.1,ROUND(Cff_u,1)&\" pF\",\"N/A\")), \"\")","v":"100 pF"},null,{"$f":"IF(Cff_u>0, ROUND(Cff_u,1), \"N/A\")","v":100}]
[{"$f":"\"CSS = \"&Css_u&\"nF\"","v":"CSS = 15nF"},{"$f":"IF(Css_u > 12, Css_u&\" nF\", \"N/A\")","v":"15 nF"}]
[]
[{"$f":"\"RRT = \"&'Design the Converter'!E12&\"kΩ\"","v":"RRT = 100kΩ"},{"$f":"CHOOSE(GPN, 'Design the Converter'!E12&\" kΩ\",  'Design the Converter'!E12&\" kΩ\", \"\")","v":"100 kΩ"},null,{"$f":"'Design the Converter'!E12&\"kΩ\"","v":"100kΩ"},{"$f":"GPN","v":1}]
[]
[{"$f":"\"RENB = \"&'Design the Converter'!E52&\"kΩ\"","v":"RENB = 100kΩ"},{"$f":"'Design the Converter'!E52&\" kΩ\"","v":"100 kΩ"},null,{"$f":"'Design the Converter'!E52","v":100}]
[{"$f":"\"RENT = \"&Rent1_u/1000&\"kΩ\"","v":"RENT = 887kΩ"},{"$f":"Rent1_u/1000&\" kΩ\"","v":"887 kΩ"},null,{"$f":"Rent1_u/1000","v":887}]
["Rsync",{"$f":"100&\" Ω\"","v":"100 Ω"}]
[{"$f":"\"Lo = \"&'Design the Converter'!E17&\"µH\"","v":"Lo = 6.8µH"},{"$f":"'Design the Converter'!E17&\" µH\"","v":"6.8 µH"},null,{"$f":"IF(MODE = 1, 'Design the Converter'!J31&\"µH\", 'Design the Converter'!E17&\"µH\")","v":"µH"}]
[{"$f":"\"Rdcr = \"&Rdcr*1000&\"mΩ\"","v":"Rdcr = 50mΩ"},{"$f":"Rdcr*1000&\"mΩ\"","v":"50mΩ"},null,{"$f":"Rdcr*1000&\"mΩ\"","v":"50mΩ"}]
[]
[{"$f":"\"VOUT = \"&'Design the Converter'!E9&\" V\"","v":"VOUT = 5 V"},{"$f":"'Design the Converter'!E9&\"V\"","v":"5V"},null,{"$f":"IF(MODE=1, 'Design the Converter'!J10&\"V\", \"\")","v":"V"}]
[]
[{"$f":"\"COUT = \"&'Design the Converter'!$E$30&\" µF\"","v":"COUT = 94 µF"},{"$f":"ROUND('Design the Converter'!$E$30, 0)&\" µF\"","v":"94 µF"},null,{"$f":"IF(MODE=1, 'Design the Converter'!$J$40&\"µF\", ROUND('Design the Converter'!$E$30/Number_of_Phases, 0)&\"µF\")","v":"µF"}]
["Capacitance per component (Cout)",{"$f":"\"22µF\"","v":"22µF"}]
["# of output caps",{"$f":"ROUNDUP(Cout*1000000/22,0)&\" x\"","v":"5 x"}]
[]
["CIN",{"$f":"Cin*1000000&\" µF\"","v":"22 µF"},{"$f":"Cin*1000000&\" µF\"","v":"22 µF"}]
["Capacitance per component (Cin)",{"$f":"\"10 µF\"","v":"10 µF"}]
["# of input caps",{"$f":"ROUNDUP(Cin*1000000/10,0)&\" x\"","v":"3 x"}]
[]
[{"$f":"\"CVCC = 2.2µF\"","v":"CVCC = 2.2µF"},{"$f":"CHOOSE(GPN, \"\", \"\", \"2.2 µF\", \"2.2 µF\")","v":""},null,{"$f":"IF(MODE=1, 'Design the Converter'!$J$40&\"µF\", ROUND('Design the Converter'!$E$30/Number_of_Phases, 0)&\"µF\")","v":"µF"}]
[]
[{"$f":"\"RC1 = \"&Rcea1_u/1000&\"kΩ\"","v":"RC1 = 600kΩ"},{"$f":"ROUND(Rcea1_u/1000,2)&\" kΩ\"","v":"600 kΩ"}]
[{"$f":"\"CC1 = \"&Cc1ea_u*10^9&\"nF\"","v":"CC1 = 0.035nF"},{"$f":"Cc1ea_u*10^9&\" nF\"","v":"0.035 nF"}]
[{"$f":"\"CC2 = \"&IF(Cc2ea_u>0, Cc2ea_u*10^12&\"pF\", \"OPEN\")","v":"CC2 = 0.7pF"},{"$f":"IF(Cc2ea_u>0, ROUND(Cc2ea_u*10^12,1)&\" pF\", \"N/A\")","v":"0.7 pF"}]
[]
[{"$f":"\"gm = \"&$B$177*1000&\"mS\"","v":"gm = 0.033mS"},{"$f":"$B$177*1000&\"mS\"","v":"0.033mS"}]
[{"$f":"\"RoEA = \"&RoEA/1000000&\"MΩ\"","v":"RoEA = 30MΩ"},{"$f":"RoEA/1000000&\"MΩ\"","v":"30MΩ"}]
[{"$f":"\"GBW = \"&GBW&\"MHz\"","v":"GBW = 20MHz"},{"$f":"GBW&\"MHz\"","v":"20MHz"}]
[]
[{"$f":"\"RPGOOD = 100 kΩ\"","v":"RPGOOD = 100 kΩ"},{"$f":"CHOOSE(GPN, \"100 kΩ\", \"100 kΩ\", \"\", \"\")","v":"100 kΩ"}]
[{"$f":"\"RFB1 = \"&'Design the Converter'!E46&\"kΩ\"","v":"RFB1 = 40kΩ"},{"$f":"IF(VOUT_setting=1, 'Design the Converter'!E46&\"kΩ\", \"\")","v":{"$error":"#NAME?"}},null,{"$f":"'Design the Converter'!#REF!&\"kΩ\"","v":{"$error":"#REF!"}}]
[{"$f":"\"RFB2 = \"&IF(Vout=Vref,\"OPEN\",'Design the Converter'!E47&\"kΩ\")","v":"RFB2 = 10kΩ"},{"$f":"IF(VOUT_setting=1, IF(Vout=Vref,\"OPEN\",Rfb2_u/1000&\"kΩ\"), \"\")","v":{"$error":"#NAME?"}},null,{"$f":"IF(Vout2=Vref,\"OPEN\",Rfb4_u/1000&\"kΩ\")","v":"8kΩ"}]
[{"$f":"CHOOSE(BODE_PLOT_TYPE, \"Crossover Frequency = \"&ROUND('Stability Calculations'!Q4,1)&\" kHz\",  \"Crossover Frequency = \"&ROUND(#REF!,1)&\" kHz\")","v":"Crossover Frequency = 42.4 kHz"},{"$f":"CHOOSE(BODE_PLOT_TYPE, ROUND('Stability Calculations'!Q4,1)&\" kHz\", ROUND(#REF!,1)&\" kHz\")","v":"42.4 kHz"},null,{"$f":"'Stability Calculations'!Q4","v":42.41525}]
[{"$f":"CHOOSE(BODE_PLOT_TYPE, \"Phase Margin = \"&ROUND('Stability Calculations'!Q5,0)&\"°\", \"Phase Margin = \"&ROUND(#REF!,0)&\"°\")","v":"Phase Margin = 57°"},{"$f":"CHOOSE(BODE_PLOT_TYPE, ROUND('Stability Calculations'!Q5,0)&\"°\", ROUND(#REF!,0)&\"°\")","v":"57°"}]
[]
["Full-load/high line efficiency",{"$f":"ROUND('Efficiency Calculations'!AZ109,1)&\"%\"","v":"89%"}]
["Half-load/mid-line efficiency",{"$f":"ROUND('Efficiency Calculations'!AZ59,1)&\"%\"","v":"92.9%"}]
[]
[]
["Rpgood","100 kΩ"]
[]
[]
["Rt",{"$f":"IF(No_RT,\"\", Rfadj&\"kΩ\")","v":"100kΩ"},{"$f":"Rfadj","v":100},{"$f":"Fsw","v":400000},{"$f":"\"kΩ\"","v":"kΩ"},{"$f":"OR((Fsw=440000),(Fsw=2200000))","v":false},null,{"$f":"OR(OR(AND(OSC=1, OR(Fsw/1000>2530, Fsw/1000<1800)), AND(OSC=2, OR(Fsw/1000>500, Fsw/1000<300))), OR((Fsw=440000),(Fsw=2200000)))","v":false}]
[]
["Blank out",{"$f":"IF(B76=\"y\",\"\",\"|\")","v":"|"}]
["OUTPUT CURRENT",{"$f":"'Design the Converter'!$E$10&\"A\"","v":"5A"},null,{"$f":"IF(MODE=1,'Design the Converter'!$J$11&\"A\",\"\")","v":"A"}]
["VIN",{"$f":"VIN_nom&\" V\"","v":"24 V"}]
["VIN range",{"$f":"VIN_min&\"V\"&\"...\"&VIN_max&\"V\"","v":"16.8V...28.8V"}]

{"sheet":"MOSFET Parameters","index":4,"n_rows":17,"n_cols":7,"rows_kept":17,"cut":false,"hidden":true,"merged":[]}
[]
[]
["MOSFET Parameters"]
[null,null,null,null,"Internal Power MOSFETs"]
[null,null,null,null,"High-side","  Low-side"]
[null,null,null,"On-State Resistance, RDS(on) ",74,31,"mΩ"]
[null,null,null,"Total Gate Charge, QG ",4.0999999999999996,8.6,"nC"]
[null,null,null,"Gate-Drain Charge, QGD ",1.7,8.56,"nC"]
[null,null,null,"Gate-Source Charge, QGS ",2.39,5.8,"nC"]
[null,null,null,"Output Charge, QOSS ",null,6.88,"nC"]
[null,null,null,"Output Capacitance, COSS ",530,509,"pF"]
[null,null,null,"Gate Resistance, RGATE ",0.158,0.24,"Ω"]
[null,null,null,"Transconductance, gFS ",100,100,"S"]
[null,null,null,"Gate-Source Miller Plateau Voltage, VTH ",1.5,1.5,"V"]
[null,null,null,"Body Diode Forward Voltage, VBD ",0.7,0.7,"V"]
[null,null,null,"Body Diode Rev Recovery Charge, QRR ",null,23,"nC"]
[null,null,null,"Thermal Resistance, θJA ",23,23,"°C/W"]

{"sheet":"Schematic Management","index":5,"n_rows":15,"n_cols":14,"rows_kept":15,"cut":false,"hidden":true,"merged":[]}
[{"$f":"VARIANT","v":1},null,null,null,null,null,null,null,null,null,null,null,null,"3.3V or 5V fixed (FB1/2)"]
[{"$f":"CHOOSE(VARIANT, \"LM63460_sch\", \"LM63460_sch\", \"LM64460_sch\", \"LM64460_fixed_VOUT_sch\", \"LM64460_fixed_VOUT_sch\")","v":"LM63460_sch"},null,null,null,null,null,null,null,null,null,null,null,null,"With/without VOUT connected to VCCX"]
[]
[]
[]
[]
[]
[]
[]
[]
[]
[]
[]
[]
[null," "]

{"sheet":"Stability Calculations","index":6,"n_rows":687,"n_cols":36,"rows_kept":687,"cut":false,"hidden":true,"merged":[[9,20,9,22],[10,14,10,15],[10,16,10,17],[9,27,9,28],[9,30,9,31],[10,18,10,19],[9,18,9,19],[9,1,10,1],[1,0,1,3],[1,9,1,11],[1,12,1,14],[9,0,11,0],[10,6,10,7],[1,4,1,6],[9,2,9,7],[9,8,9,13],[10,2,10,3],[10,4,10,5],[10,8,10,9],[10,10,10,11],[10,12,10,13]]}
[]
["Divider Network & EA Poles/Zeros",null,null,null,"Modulator",null,null,null,null,"Power Stage Poles/Zeros",null,null,"Complex Pole Pair",null,null,"Total System"]
[null,"Afb1",{"$f":"Afb","v":0.2},"V/V","Acs",{"$f":"Acs","v":5},"A/V","gm",{"$f":"gm","v":3.3000000000000003E-5},"z_ESR",{"$f":"Fesr","v":1693137.6944016635},"Hz","p3",{"$f":"Fsw/2","v":200000},"Hz","Adc",{"$f":"Am*Afb*AEA","v":754.70603949167639},"V/V"]
[null,"EA zero, z1",{"$f":"Fz1_u","v":7578.8068225598272},"Hz","Am",{"$f":"Am","v":3.8116466640993747},"V/V",null,null,"p_dom",{"$f":"Fp_dominant","v":2221.005570045043},"Hz","pterm1",{"$f":"Q*pole3","v":75072.048200875317},null,"Crossover",{"$f":"AJ7","v":42.41525},"kHz"]
[null,"EA pole, p1",{"$f":"Fp1_u","v":148.60405534431035},"Hz","Q",{"$f":"Q","v":0.37536024100437659},null,null,null,null,null,null,"pterm2",{"$f":"pole3^2","v":40000000000},null,"Phase Margin",{"$f":"AJ9","v":57.178792753728501},"°"]
[null,"Aea",{"$f":"AEA","v":990.00000000000011},"V/V","mc",{"$f":"mc","v":1.7444210526315789},null,"FF zero, z5",{"$f":"Fz_ff","v":39788.735818439091},null,null,null,null,null,null,"radconv",{"$f":"180/Pi","v":57.295779578552292},null,null,null,{"$f":"AB13+AE13","v":57.555359044333557},null,null,null,null,null,null,{"$f":"Adc","v":754.70603949167639},null,null,null,null,null,null,"XOVER SEARCH"]
[null,"EA pole, p2",{"$f":"Fp2_u","v":275562.72605040763},"Hz","k",{"$f":"k","v":1.3480117278691788},null,"FF pole, p5",{"$f":"Fp_ff","v":198943.6790921955},null,null,null,null,null,null,null,null,null,null,null,null,null,null,null,null,null,null,null,null,null,null,null,null,null,"xover",{"$f":"SUM(AI12:AI613)/1000","v":42.41525}]
[]
[null,null,null,null,null,null,null,null,null,null,null,null,null,null,null,null,null,null,null,null,null,null,null,null,null,null,null,null,null,null,null,null,null,null,"phase margin",{"$f":"SUM(AJ13:AJ613)","v":57.178792753728501}]
["Freq (Hz)",null,"Power Stage",null,null,null,null,null,"Error Amplifier",null,null,null,null,null,null,"FF Network",null,null,"Sampling Double Pole",null,"System Response",null,null,null,null,null,null,"Compensator Response",null,null,"PLANT Response",null,"total"]
[null,null,"p_dom",null,"z_ESR",null,"z_RHP",null,"p1",null,"z1",null,"p2",null,"z3",null,"p3",null,"p3"]
[null,null,"Gain(V/V)","Phase(rad)","Gain(V/V)","Phase(rad)","Gain(V/V)","Phase(rad)","Gain(V/V)","Phase(rad)","Gain(V/V)","Phase(rad)","Gain(V/V)","Phase(rad)","Gain(V/V)","Phase(rad)","Gain(V/V)","Phase(rad)","Gain(V/V)","Phase(rad)","Gain (dB)","Phase (°)","Phase Margin (°)",null,null,"Fsquare",null,"Gain(dB)","Phase(Deg)",null,"Gain(dB)","Phase(Deg)"]
[1,{"$f":"A13/1000","v":1E-3},{"$f":"SQRT(1+(A13/pole1)^2)","v":1.0000001013609534},{"$f":"ATAN(A13/pole1)","v":4.5024647660192737E-4},{"$f":"SQRT(1+(A13/Zero1)^2)","v":1.0000000000001745},{"$f":"ATAN(A13/Zero1)","v":5.9061941819993136E-7},{"$f":"IF(VIN_nom>Vout, 1, SQRT(1+(A13/z_RHP)^2))","v":1},{"$f":"IF(VIN_nom>Vout, 0, -ATAN(A13/z_RHP))","v":0},{"$f":"SQRT(1+(A13/Pole2)^2)","v":1.000022641425435},{"$f":"ATAN(A13/Pole2)","v":6.7291898840759912E-3},{"$f":"SQRT(1+(A13/Zero2)^2)","v":1.000000008704991},{"$f":"ATAN(A13/Zero2)","v":1.3194689053426899E-4},{"$f":"SQRT(1+(A13/pole4)^2)","v":1.0000000000065845},{"$f":"ATAN(A13/pole4)","v":3.6289378259840706E-6},{"$f":"SQRT(1+(A13/Zero3)^2)","v":1.0000000003158274},{"$f":"ATAN(A13/Zero3)","v":2.5132741194708266E-5},{"$f":"SQRT(1+(A13/pole5)^2)","v":1.000000000012633},{"$f":"ATAN(A13/pole5)","v":5.0265482399576659E-6},{"$f":"SQRT((1-(Z13/pterm2))^2+(A13/pterm1)^2)","v":1.0000000000637184},{"$f":"IF((ATAN((A13/pterm1)/(1-A13^2/pterm2))>0),ATAN((A13/pterm1)/(1-A13^2/pterm2)),PI()+ATAN((A13/pterm1)/(1-A13^2/pterm2)))","v":1.3320537056483223E-5},{"$f":"20*LOG10(((E13*K13*G13*O13)/(C13*I13*S13*M13*Q13))*Adc)","v":57.555359046967062},{"$f":"((F13+L13+H13+R13)-(D13+J13+T13+N13))*radconv","v":-0.40444069664035937},{"$f":"IF(V13>0,V13,V13+180)","v":179.59555930335964},null,{"$f":"IF(U13<0,A13,1000000000)","v":1000000000},{"$f":"A13^2","v":1},null,{"$f":"20*LOG10((K13/(I13*M13))*AEA*Afb)","v":45.933107222087756},{"$f":"(L13-(J13+N13))*radconv","v":-0.37820210320589687},null,{"$f":"20*LOG10((E13*G13/(C13*S13))*Am)","v":11.622251822245797},{"$f":"(F13+H13-(D13+T13))*radconv","v":-2.6526593434460038E-2},{"$f":"AB13+AE13","v":57.555359044333557},{"$f":"AC13+AF13","v":-0.40472869664035693},{"$f":"SUM((U14<0)*(U13>0))*A13","v":0},{"$f":"IF(AI13>0,W11,0)","v":0}]
[1.0965,{"$f":"A14/1000","v":1.0965E-3},1.0000001218675147,4.9369525484468588E-4,1.0000000000002096,6.4761419205620961E-7,1,0,1.0000272220008122,7.3785341763122261E-3,1.0000000104661173,1.4467976530095975E-4,1.0000000000079168,3.9791303261879996E-6,1.0000000003797229,2.7558050718823719E-5,1.000000000015189,5.5116101451041899E-6,1.0000000000766094,1.4605968882332957E-5,{"$f":"20*LOG10(((E14*K14*G14*O14)/(C14*I14*S14*M14*Q14))*Adc)","v":57.55531909917557},-0.44346793252489825,179.5565320674751,null,1000000000,1.2023122500000001,null,45.933067451992848,-0.41469731521072328,null,11.622251644016423,-2.9086409314171668E-2,{"$f":"AB14+AE14","v":57.555319096009271},{"$f":"AC14+AF14","v":-0.44378372452489495},{"$f":"SUM((U15<0)*(U14>0))*A14","v":0},0]
[1.2022999999999999,1.2022999999999999E-3,1.0000001465198183,5.4133132252122645E-4,1.0000000000002522,7.1010172650174071E-7,1,0,1.0000327285880004,8.0904505920859557E-3,1.0000000125832846,1.5863974607918397E-4,1.0000000000095182,4.3630719481721146E-6,1.0000000004565364,3.0217094735563201E-5,1.0000000000182614,6.043418948878425E-6,1.0000000000921065,1.6015281702766144E-5,57.555271075755314,-0.48625593145267887,179.51374406854731,null,1000000000,1.4455252899999997,null,45.933019642193486,-0.45470927150020224,null,11.622251429755028,{"$f":"(F15+H15-(D15+T15))*radconv","v":-3.1892922352472507E-2},57.555271071948511,-0.48660219385267472,0,0]
[1.3183,1.3183000000000001E-3,1.0000001761567037,5.9355990050715117E-4,1.0000000000003031,7.7861357901290272E-7,1,0,1.0000393485416974,8.8709922200739914E-3,1.0000000151285333,1.7394558504642895E-4,1.0000000000114435,4.7840287359793039E-6,1.0000000005488809,3.3132492711836141E-5,1.0000000000219553,6.6264985446950081E-6,1.0000000001107372,1.7560464001119372E-5,57.55521334291722,-0.53316850766971935,179.46683149233027,null,1000000000,1.7379148900000001,null,45.932962166169432,-0.49857817164088325,null,11.622251172170973,-3.4970006428830407E-2,57.555213338340408,-0.53354817806971366,0,0]
[1.4454,1.4454000000000001E-3,1.0000002117613827,6.5078620938237839E-4,1.0000000000003644,8.5368130706607273E-7,1,0,1.000047301456233,9.7262111621185306E-3,1.0000000181863031,1.9071603437274029E-4,1.0000000000137566,5.2452667336522974E-6,1.0000000006598204,3.6326864114500532E-5,1.0000000000263927,7.2653728259681637E-6,1.0000000001331193,1.92535042607248E-5,57.555143985784241,-0.584569418864063,179.41543058113595,null,1000000000,2.0891811599999999,null,45.932893117563516,-0.5466441586582842,null,11.622250862718843,-3.8341535405771544E-2,57.555143980282359,-0.58498569406405576,0,0]
[1.5849,1.5849E-3,1.0000002546093714,7.1359556786147261E-4,1.0000000000004381,9.3607271590490673E-7,1,0,1.0000568722045287,1.0664849674181765E-2,1.0000000218661365,2.0912262497290078E-4,1.0000000000165399,5.7515035603639812E-6,1.0000000007933292,3.9832881506812946E-5,1.0000000000317333,7.9665763054074635E-6,1.0000000001600546,2.1111719179730371E-5,57.555060520296138,-0.64098411178229653,179.3590158882177,null,1000000000,2.51190801,null,45.932810023368297,-0.59939856922521795,null,11.622250490312712,-4.2041993757068935E-2,57.555060513681013,-0.64144056298228691,0,0]
[1.7378,1.7378000000000001E-3,1.0000003061048623,7.8243822023919829E-4,1.0000000000005267,1.0263784249475998E-6,1,0,1.0000683743830143,1.169362966416394E-2,1.0000000262886273,2.2929730368253243E-4,1.000000000019885,6.3063681539391989E-6,1.0000000009537824,4.3675677629588608E-5,1.0000000000381513,8.735135531249828E-6,1.0000000001924261,2.3148429295159946E-5,57.554960212057019,-0.70281660977225391,179.29718339022776,null,1000000000,3.0199488400000001,null,45.932710161355672,-0.65721918822109615,null,11.622250042748281,-4.6097907951145066E-2,{"$f":"AB19+AE19","v":57.554960204103949},-0.70331709617224125,0,0]
[1.9055,1.9055000000000001E-3,1.0000003680345029,8.5794450863758043E-4,1.0000000000006333,1.125425301379625E-6,1,0,1.0000822069881894,1.2821962168643392E-2,1.0000000316072148,2.5142479607425836E-4,1.0000000000239082,6.9149410273327852E-6,1.0000000011467469,4.789043831998786E-5,1.00000000004587,9.5780876710271022E-6,1.0000000002313567,2.5382283358848581E-5,57.554839582140119,-0.77063256646964962,179.22936743353034,null,1000000000,3.63093025,null,45.932590068080813,-0.72063493541957568,null,11.622249504497217,-5.0546415050057129E-2,57.554839572578032,-0.77118135046963276,0,0]
[2.0893000000000002,2.0893000000000001E-3,1.0000004424581728,9.4069974965104613E-4,1.0000000000007614,1.2339811504446338E-6,1,0,1.000098830007909,1.4058582369494303E-2,1.0000000379988041,2.7567663300950178E-4,1.0000000000287428,7.5819397997165173E-6,1.0000000013786414,5.2509836140898518E-5,1.0000000000551457,1.0501967237445909E-5,1.0000000002781417,2.7830598068912505E-5,57.554694620061291,-0.84495702318726307,179.15504297681272,null,1000000000,4.3651744900000002,null,45.93244575090911,-0.79013674218113961,null,11.622248857656439,-5.5421999406101388E-2,57.554694608565548,-0.84555874158724098,0,0]
[2.2909000000000002,2.2909000000000002E-3,1.0000005319647531,1.0314693571442989E-3,1.0000000000009153,1.3530500251535547E-6,1,0,1.000118821531349,1.541491271971695E-2,1.0000000456857316,3.0227712407266902E-4,1.0000000000345575,8.3135336653918727E-6,1.0000000016575321,5.7576596751456639E-5,1.0000000000663012,1.1515319362507013E-5,1.0000000003344081,3.051601833827083E-5,57.554520285901418,-0.92647654506475374,179.07352345493524,null,1000000000,5.2482228100000006,null,45.932272192355008,-0.86636656833142922,null,11.622248079725154,-6.0769755933295456E-2,57.554520272080161,-0.9271363242647247,0,0]
[2.5118999999999998,2.5118999999999996E-3,1.0000006395511172,1.1309737187904648E-3,1.0000000000011005,1.4835769165754915E-6,1,0,1.0001428506941419,1.6901697603920348E-2,1.0000000549253723,3.3143738412025553E-4,1.0000000000415463,9.1155289248769227E-6,1.0000000019927573,6.3130932536410261E-5,1.0000000000797102,1.2626186523385039E-5,1.00000000040204,3.3459857026113907E-5,57.554310746469611,-1.0158369580468318,178.98416304195317,null,1000000000,6.309641609999999,null,45.932063585196516,-0.94992825844894113,null,11.622247144656582,-6.6632126797852215E-2,57.5543107298531,-1.0165603852467933,0,0]
[2.7542,2.7542000000000001E-3,1.0000007688851795,1.2400682940066628E-3,1.0000000000013229,1.6266840016050053E-6,1,0,1.0001717363938021,1.8531692830353878E-2,1.0000000660327315,3.6340811202057322E-4,1.0000000000499483,9.9948205600363848E-6,1.0000000023957454,6.9220595702483386E-5,1.0000000000958298,1.3844119161723545E-5,1.0000000004833431,3.6687423152716212E-5,57.554058863608404,-1.1138049999958111,178.88619500000419,null,1000000000,7.5856176399999997,null,45.931812823059872,-1.0415386975777401,null,11.622246020571723,-7.3059512018020328E-2,57.554058843631594,-1.1145982095957605,0,0]
[3.02,3.0200000000000001E-3,1.0000009244520591,1.3597436132093141E-3,1.0000000000015907,1.7836706429621085E-6,1,0,1.0002064798772803,2.0319663149571909E-2,1.0000000793929973,3.9847959063500735E-4,1.0000000000600542,1.0959392234081231E-5,1.0000000028804716,7.5900878278246464E-5,1.0000000001152189,1.518017568363397E-5,1.0000000005811367,4.0228021899425085E-5,57.553755910520309,-1.2212681784799699,178.77873182152004,null,1000000000,9.1204000000000001,null,45.931511218012616,-1.1420276690584874,null,11.622244668489021,-8.0110269421415858E-2,57.553755886501634,-1.2221379384799032,0,0]
[3.3113000000000001,3.3113000000000001E-3,1.0000011113926641,1.4909001540677821E-3,1.0000000000019125,1.9557180794831669E-6,1,0,1.0002482286132977,2.2279015970253269E-2,1.0000000954476778,4.3691571335996329E-4,1.0000000000721982,1.2016501822655422E-5,1.0000000034629544,8.3222045743430579E-5,1.0000000001385181,1.6644409185574962E-5,1.0000000006986531,4.4108294340125032E-5,57.553391887471207,-1.3390324536106188,178.66096754638937,null,1000000000,10.964707690000001,null,45.931148814868251,-1.2521486566913353,null,11.622243043727272,-8.7837451319195153E-2,57.553391858595525,-1.3399861080105304,0,0]
[3.6307999999999998,3.6308E-3,1.0000013362110913,1.6347535614626594E-3,1.0000000000022993,2.1444209835972732E-6,1,0,1.0002984341621806,2.4427851397626266E-2,1.0000001147553543,4.7907273628126576E-4,1.0000000000868028,1.3175947457878329E-5,1.0000000041634598,9.1251956495677432E-5,1.0000000001665383,1.8250391347765737E-5,1.0000000008399805,4.8364205924560478E-5,57.552954146224799,-1.4681858774703245,178.53181412252968,null,1000000000,13.182708639999998,null,45.930713021750556,-1.3729188695372447,null,11.622241089757416,-9.6312678332963392E-2,57.552954111507972,-1.469231547870208,0,0]
[3.9811000000000001,3.9811000000000004E-3,1.0000016064844766,1.7924744494031849E-3,1.0000000000027645,2.3513149657916868E-6,1,0,1.0003587872094541,2.6783575890304251E-2,1.0000001379667625,5.252937206390477E-4,1.0000000001043603,1.4447164378083462E-5,1.000000005005597,1.0005595565742681E-4,1.0000000002002238,2.0011191195592855E-5,1.0000000010098822,5.3030390048677214E-5,57.552427957972647,-1.6097748701188477,178.39022512988114,null,1000000000,15.849157210000001,null,45.930189175509327,-1.5053165088503091,null,11.622238740724368,-0.10560491806838568,57.552427916233697,-1.6109214269186949,0,0]
[4.3651999999999997,4.3651999999999996E-3,1.0000019314282644,1.9654135217703653E-3,1.0000000000033236,2.5781718843209279E-6,1,0,1.0004313435614456,2.936625855538437E-2,1.0000001658733388,5.7597450621021745E-4,1.0000000001254694,1.5841039396730161E-5,1.0000000060180807,1.0970944144607982E-4,1.0000000002407232,2.1941888373726716E-5,1.0000000012141512,5.8146808323113219E-5,57.551795416847128,-1.7650059642561027,178.23499403574391,null,1000000000,19.054971039999998,null,45.929559450131563,-1.6504693935869625,null,11.622235916534079,-0.11579374826893878,57.551795366665644,-1.7662631418559014,0,0]
[4.7862999999999998,4.7862999999999994E-3,1.0000023220418202,2.1550115205650443E-3,1.0000000000039955,2.82688172132313E-6,1,0,1.0005185563128727,3.2197277155392293E-2,1.0000001994197276,6.3153732186852353E-4,1.0000000001508442,1.7369185114837107E-5,1.0000000072351836,1.2029283862533284E-4,1.0000000002894074,2.4058567836470179E-5,1.0000000014597026,6.3756086465750742E-5,57.551035162488674,-1.9351644496940394,178.06483555030596,null,1000000000,22.908667689999998,null,45.928802580570363,-1.8095788527373045,null,11.622232521588064,-0.12696405135646879,57.551035102158423,-1.9365429040937732,0,0]
[5.2481,5.2481000000000003E-3,1.0000027917357377,2.3629342957360395E-3,1.0000000000048037,3.0996297686454937E-6,1,0,1.0006234154100859,3.5301323203958665E-2,1.0000002397576544,6.9247036954814994E-4,1.0000000001813567,1.9045028602327976E-5,1.0000000086986913,1.3189913832682007E-4,1.0000000003479477,2.6379827812224797E-5,1.0000000017549662,6.9907510462771696E-5,57.550121167748294,-2.1217349226016111,177.8782650773984,null,1000000000,27.542553609999999,null,45.927892655883305,-1.9840324032278061,null,11.622228439331357,-0.13921397217345469,57.550121095214664,-2.1232463754012607,0,0]
[5.7544000000000004,5.7544000000000007E-3,1.000003356371886,2.5908927027031106E-3,1.0000000000057754,3.3986603800769949E-6,1,0,1.0007494558683132,3.8703697430175203E-2,1.0000002882493664,7.5927504538968768E-4,1.0000000002180365,2.0882359822898996E-5,1.0000000104580284,1.4462384495295984E-4,1.0000000004183212,2.8924769184189439E-5,1.0000000021099134,7.6651698353776901E-5,57.549022673331137,-2.3262387722030686,177.67376122779694,null,1000000000,33.113119360000006,null,45.926799054222769,-2.1752517322796492,null,11.62222353190457,-0.15264430712295746,57.549022586127336,-2.3278960394026065,0,0]
[6.3095999999999997,6.3095999999999994E-3,1.0000040352782658,2.8408677182765853E-3,1.0000000000069438,3.7265722810574697E-6,1,0,1.0009009832877733,4.2433650131216014E-2,1.0000003465547933,8.3253191300119891E-4,1.0000000002621396,2.2897146102928104E-5,1.0000000125734188,1.5857754254627879E-4,1.0000000005029368,3.1715508764470064E-5,1.0000000025366946,8.4047260500204975E-5,57.547702231213052,-2.5504350117348347,177.44956498826517,null,1000000000,39.811052159999996,null,45.925484495046533,-2.3848804094882232,null,11.62221763132365,-0.16737176704600193,57.547702126370183,-2.5522521765342252,0,0]
[6.9183000000000003,6.9183000000000005E-3,1.0000048514151094,3.1149303350188873E-3,1.000000000008348,4.0860823209103207E-6,1,0,1.0010831094179855,4.6521666257339549E-2,1.0000004166458114,9.128479245246175E-4,1.0000000003151577,2.5106080556340891E-5,1.0000000151164044,1.7387584169170834E-4,1.0000000006046561,3.4775168674773982E-5,1.0000000030497436,9.2155471370404421E-5,57.546115407791035,-2.796157170274026,177.20384282972597,null,1000000000,47.862874890000008,null,45.923904743707098,-2.6146312744928366,null,11.622210538036503,-0.18351836618038581,57.546115281743603,-2.7981496406732225,0,0]
[7.5857999999999999,7.5858000000000002E-3,1.0000058327346442,3.4154666719998132E-3,1.0000000000100366,4.4803207825515823E-6,1,0,1.0013020534512751,5.1002788810659914E-2,1.0000005009230282,1.000922393766828E-3,1.0000000003789062,2.7528396553517018E-5,1.0000000181740825,1.9065194588501058E-4,1.0000000007269632,3.8130389620512403E-5,1.0000000036666319,1.0104692980797516E-4,57.544208177365952,-3.0655131520228243,176.93448684797718,null,1000000000,57.544361639999998,null,45.922006016716907,-2.866473177679604,null,11.622202009105303,-0.20122468474216176,57.544208025822208,-3.0676978624217659,0,0]
[8.3176000000000005,8.3176000000000014E-3,1.0000070123768627,3.7449528395036803E-3,1.0000000000120663,4.9125360727808021E-6,1,0,1.0015651825648868,5.5913214731310272E-2,1.0000006022325996,1.0974810224509896E-3,1.0000000004555385,3.0184053252370942E-5,1.0000000218497151,2.0904408516008422E-4,1.0000000008739887,4.1808817616663714E-5,1.0000000044081931,1.1079489876306004E-4,57.5419165961167,-3.3606807510209857,176.63931924897901,null,1000000000,69.182469760000004,null,45.919724657418364,-3.1424396148813551,null,11.622191756505497,-0.22063660493823495,57.541916413923857,-3.36307621981959,0,0]
[9.1201000000000008,9.1201000000000008E-3,1.0000084307862547,4.1062700893519464E-3,1.0000000000145073,5.3865081558737247E-6,1,0,1.0018814796105979,6.1294932381847793E-2,1.0000007240480244,1.2033682624808689E-3,1.0000000005476817,3.3096275854818456E-5,1.0000000262693252,2.2921310900393761E-4,1.000000001050773,4.5842622571510545E-5,1.0000000052998519,1.2148462966795239E-4,57.539162767611998,-3.6841865787509289,176.31581342124906,null,1000000000,83.176224010000013,null,45.916983119836907,-3.4448892892399381,null,11.62217942872954,-0.24192387830915138,57.539162548566445,-3.6868131675490896,0,0]
[10,0.01,1.0000101360444849,4.5024346456937273E-3,1.0000000000174416,5.9061941819313249E-6,1,0,1.0022616107336364,6.7191614669171479E-2,1.0000008704987273,1.3194681472697937E-3,1.0000000006584595,3.6289378244069954E-5,1.0000000315827335,2.5132740670826242E-4,1.0000000012633092,5.0265482357666099E-5,1.0000000063718353,1.332053701145433E-4,57.535854310794434,-4.0386594242555907,175.9613405757444,null,1000000000,100,null,45.913689439546658,-3.7762752157018937,null,11.622164607896607,-0.26526420855127131,57.535854047443266,-4.0415394242531653,0,0]
[10.965,1.0964999999999999E-2,1.0000121866779554,4.9369128398546597E-3,1.0000000000209703,6.4761419204724633E-6,1,0,1.0027185418980673,7.3653206670749774E-2,1.0000010466111913,1.4467966536154892E-3,1.0000000007916738,3.9791303241088848E-5,1.0000000379723073,2.7558050028171508E-4,1.0000000015188923,5.5116101395789712E-5,1.0000000076609357,1.4605968822969771E-4,57.531879074530792,-4.4271063242161013,175.57289367578389,null,1000000000,120.23122499999999,null,45.909731972547398,-4.1394024262399398,null,11.62214678535306,-0.29086181797296318,57.531878757900458,-4.4302642442129034,0,0]
[12.023,1.2022999999999999E-2,1.0000146518755608,5.4132608777266939E-3,1.0000000000252123,7.101017264899246E-6,1,0,1.0032675738386572,8.0730428528742654E-2,1.0000012583276812,1.5863961432958356E-3,1.0000000009518197,4.3630719454312282E-5,1.0000000456536398,3.0217093825079795E-4,1.0000000018261457,6.0434189415945573E-5,1.0000000092106491,1.6015281624507952E-4,57.527104950394005,-4.8525824907931874,175.1474175092068,null,1000000000,144.55252899999999,null,45.904979209930971,-4.5371188905990731,null,11.622125359782263,-0.31892622418989847,57.527104569713231,-4.8560451147889712,0,0]
[13.183,1.3183E-2,1.0000176155167588,5.9355299972240465E-3,1.000000000030312,7.7861357899732595E-6,1,0,1.0039272200564437,8.848062424854429E-2,1.0000015128522139,1.739454113649984E-3,1.0000000011443464,4.7840287323660764E-5,1.0000000548881023,3.313249151157362E-4,1.000000002195524,6.626498535092908E-5,1.0000000110737075,1.7560463897953979E-4,57.521372402269463,-5.3185434173684216,174.68145658263157,null,1000000000,173.79148899999998,null,45.899272342388372,-4.9726440109920782,null,11.622099602199171,-0.34969611037078607,57.521371944587543,-5.3223401213628643,0,0]
[14.454000000000001,1.4454E-2,1.0000211759162854,6.5077711406199557E-3,1.0000000000364386,8.5368130704554229E-6,1,0,1.0047191224363972,9.696018187574848E-2,1.0000018186286788,1.907158054575452E-3,1.0000000013756412,5.2452667288899984E-5,1.0000000659820507,3.6326862532532758E-4,1.0000000026392821,7.2653728133124213E-5,1.0000000133119185,1.9253504124750939E-4,57.514495436044712,-5.8283898083485282,174.17161019165147,null,1000000000,208.91811600000003,null,45.892426227682449,-5.4491424175961019,null,11.622068658173983,-0.38341014274510149,57.514494885856436,-5.8325525603412034,0,0]
[15.849,1.5848999999999999E-2,1.0000254606162455,7.1358357681209125E-3,1.0000000000438116,9.3607271587783967E-6,1,0,1.0056713003514128,0.10625089541312564,1.0000021866112869,2.0912232317523744E-3,1.0000000016539896,5.7515035540854494E-5,1.0000000793329193,3.9832879421174269E-4,1.0000000031733169,7.9665762887223517E-5,1.0000000160054641,2.1111719000464809E-4,57.506233734397078,-6.3870535421894559,173.61294645781055,null,1000000000,251.19080099999999,null,45.884201653604208,-5.9712049870770292,null,11.622031419279002,-0.42041306710277049,57.506233072883212,-6.3916180541797996,0,0]
[17.378,1.7378000000000001E-2,1.0000306100224312,7.8242241328250247E-3,1.0000000000526725,1.0263784249119188E-5,1,0,1.0068144536648596,0.1164128862905356,1.0000026288593105,2.2929690584163804E-3,1.000000001988514,6.3063681456626008E-5,1.0000000953782364,4.3675674880220791E-4,1.0000000038151295,8.7351355092548841E-5,1.0000000192426168,2.3148429058845291E-4,57.496325250892738,-6.9981680647160207,173.00183193528397,null,1000000000,301.99488400000001,null,45.874337790267241,-6.5422029060462856,null,11.621986665318492,-0.46097002265700632,57.496324455585736,-7.0031729287032922,0,0]
[19.055,1.9054999999999999E-2,1.0000368027798328,8.5792366984823037E-3,1.0000000000633291,1.1254253013325852E-5,1,0,1.0081875189848271,0.12753073064960793,1.0000031607165423,2.5142427158496962E-3,1.0000000023908204,6.9149410164214128E-5,1.0000001146746977,4.7890434695385941E-4,1.0000000045869881,9.5780876420302835E-5,1.0000000231356896,2.5382283047305481E-4,57.484438703689349,-7.6668434762921764,172.33315652370783,null,1000000000,363.09302500000001,null,45.862504903677809,-7.1668791057001116,null,11.621932843801899,-0.50545221057528444,57.48443774747971,-7.6723313162753959,0,{"$f":"IF(AI45>0,W43,0)","v":0}]
[20.893000000000001,2.0893000000000002E-2,1.0000442448482489,9.4067228057061972E-3,1.0000000000761355,1.233981150382627E-5,1,0,1.0098351243241803,0.13967954064649543,1.0000037998732725,2.7567594163741683E-3,1.0000000028742906,7.5819397853333368E-5,1.0000001378641354,5.2509831363011699E-4,1.0000000055145657,1.0501967199222806E-4,1.000000027814173,2.7830597658241835E-4,57.470196652854789,-8.3976286953746495,171.60237130462536,null,1000000000,436.51744900000006,null,45.848327338370325,-7.8494416241505487,null,11.621868164910797,-0.55420425520197913,57.470195503281118,-8.4036458793525277,0,0]
[22.909000000000002,2.2909000000000002E-2,1.0000531950746099,1.0314331449039779E-2,1.0000000000915372,1.3530500250718107E-5,1,0,1.0118130845790805,0.15295721043353566,1.0000045685628292,3.0227621263406411E-3,1.0000000034557421,8.3135336464304507E-5,1.0000001657532114,5.7576590452743548E-4,1.0000000066301289,1.1515319312117298E-4,1.0000000334408112,3.0516017796881532E-4,57.453129392072391,-9.1964534243207137,170.80354657567929,null,1000000000,524.82228100000009,null,45.831337630665828,-8.5953744053541374,null,11.621790379281149,-0.60767681093741333,57.45312800994698,-9.2030512162915503,0,0]
[25.119,2.5118999999999999E-2,1.0000639530871678,1.1309259836315675E-2,1.00000000011005,1.483576916467735E-5,1,0,1.014185475867434,0.16745023866552258,1.0000054925222981,3.3143618264294323E-3,1.0000000041546433,9.1155288998815551E-5,1.0000001992757128,6.3130924233306771E-4,1.0000000079710292,1.2626186456960199E-4,1.0000000402039968,3.3459856312442499E-4,57.432702286714132,-10.068575479027682,169.93142452097231,null,1000000000,630.96416099999999,null,45.811003741802061,-9.4095158336509819,null,11.621696883260874,-0.66629391733825705,57.432700625062935,-10.075809750989238,0,0]
[27.542000000000002,2.7542000000000001E-2,1.0000768855918176,1.2400053707850918E-2,1.0000000001323051,1.6266840014629615E-5,1,0,1.0170301018648957,0.18325870169406758,1.000006603251574,3.6340652824232576E-3,1.0000000049948219,9.9948205270876373E-5,1.0000002395745156,6.9220584757381397E-4,1.0000000095829817,1.3844119074162705E-4,1.0000000483343059,3.6687422211958721E-4,57.40827145930804,-11.020087156399253,168.97991284360074,null,1000000000,758.56176400000004,null,45.786684971190461,-10.297460185057641,null,11.621584490436751,-0.73055906729093523,57.408269461627214,-11.028019252348576,0,0]
[30.2,3.0199999999999998E-2,1.0000924409759644,1.3596606592404395E-2,1.0000000001590741,1.7836706427748431E-5,1,0,1.0204411981344321,0.20049420723343139,1.0000079392685322,3.9847750264662644E-3,1.0000000060054139,1.0959392190642878E-4,1.0000002880471257,7.59008638486497E-4,1.0000000115218866,1.5180175568197158E-4,1.0000000581136859,4.0228020659166948E-4,57.379064739005599,-12.05779794647674,167.94220205352326,null,1000000000,912.04,null,45.757613032323491,-11.265440382029439,null,11.62144930481476,-0.80105516438049229,57.379062337138251,-12.066495546409932,0,0]
[33.113,3.3112999999999997E-2,1.0001111331528736,1.4907908082719955E-2,1.0000000001912417,1.9557180792363169E-5,1,0,1.0245251994967979,0.21924521632565966,1.0000095447226929,4.3691296102053865E-3,1.0000000072198159,1.2016501765395849E-4,1.0000003462953866,8.3222026722624292E-4,1.0000000138518179,1.6644409033408453E-4,1.0000000698653104,4.4108292705241419E-4,57.34422349761482,-13.187153167332418,166.81284683266759,null,1000000000,1096.470769,null,45.722933748687787,-12.318377849515111,null,11.621286861359403,-0.87831186172924125,57.344220610047188,-13.196689711244352,0,0]
[36.308,3.6308E-2,1.0001336122722773,1.6346094157760133E-2,1.0000000002299272,2.1444209832718533E-5,1,0,1.0294152411592821,0.23963239117065238,1.0000114754702452,4.7906910790457991E-3,1.0000000086802796,1.3175947382393531E-4,1.000000416345894,9.1251931420715724E-4,1.000000016653839,1.8250391147165947E-4,1.0000000839980463,4.8364203769307653E-4,57.302686507835425,-14.415575034886929,165.58442496511307,null,1000000000,1318.2708640000001,null,45.681591524474868,-13.462987546070776,null,11.621091511680229,-0.9630441927000587,57.302683036155095,-14.426031738770835,0,0]
[39.811,3.9810999999999999E-2,1.0001606356747834,1.7922844336060059E-2,1.000000000276434,2.3513149653626978E-5,1,0,1.035263403543746,0.26175332414689151,1.0000137965820124,5.2528893749538104E-3,1.0000000104360278,1.4447164278574596E-4,1.0000005005595911,1.0005592260201941E-3,1.0000000200223884,2.001119093114944E-4,1.0000001009882162,5.3030387207485784E-4,57.253267159651742,-15.749144728073125,164.25085527192687,null,1000000000,1584.9157210000001,null,45.632406309013902,-14.704669987896175,null,11.620856676745824,-1.0559403080239036,57.253262985759726,-15.760610295920078,0,0]
[43.652000000000001,4.3652000000000003E-2,1.000193124364456,1.965163040193426E-2,1.0000000003323484,2.5781718837554059E-5,1,0,1.0422510820411421,0.28571029877242371,1.0000165871976912,5.7596820077400815E-3,1.0000000125469264,1.5841039265550969E-4,1.0000006018079008,1.0970939787025261E-3,1.000000024072323,2.1941888025119854E-4,1.0000001214151324,5.8146804577666146E-4,57.194580050844479,-17.194287267342894,162.8057127326571,null,1000000000,1905.497104,null,45.574000676160509,-16.049065077969622,null,11.620574356538071,-1.1577939651715208,57.19457503269858,-17.206859043141144,0,0]
[47.863,4.7863000000000003E-2,1.0002321774984093,2.1546813468133991E-2,1.000000000399563,2.8268817205776486E-5,1,0,1.050589431052624,0.31159229004302741,1.0000199417759108,6.31529009961439E-3,1.0000000150844295,1.7369184941914306E-4,1.0000007235180965,1.2029278118289206E-3,1.000000028940734,2.4058567376930267E-4,1.0000001459702503,6.3756081528434331E-4,57.125057372726992,-18.756702300455647,161.24329769954434,null,1000000000,2290.8667689999997,null,45.504816334961404,-17.50103550907842,null,11.620235004745535,-1.2694513351112722,57.125051339706943,-18.770486844189691,0,0]
[52.481000000000002,5.2481E-2,1.0002791350052929,2.3624990601590054E-2,1.0000000004803853,3.0996297676627427E-5,1,0,1.0605290880944951,0.3394871367306091,1.0000239754808877,6.9245941220877341E-3,1.0000000181356556,1.9045028374367888E-4,1.0000008698687664,1.3189906260180568E-3,1.0000000347947651,2.6379827206424069E-4,1.0000001754966044,6.9907503954022999E-4,57.042894436355311,-20.442117953598412,159.55788204640157,null,1000000000,2754.255361,null,45.423060197488297,-19.065342134858795,null,11.619826985509674,-1.3918903463890067,57.042887182997973,-20.457232481247804,0,0]
[57.544000000000004,5.7544000000000005E-2,1.0003355814444215,2.5903189978556267E-2,1.0000000005775445,3.3986603787814955E-5,1,0,1.0723559773099913,0.36944981897125945,1.0000288245253792,7.5926060109309454E-3,1.0000000218036473,2.0882359522393336E-4,1.0000010458022941,1.4462374512938725E-3,1.0000000418321129,2.8924768385599886E-4,1.0000002109913264,7.6651689773697196E-4,56.946119702709446,-22.254397509478618,157.74560249052138,null,1000000000,3311.3119360000005,null,45.326774441182842,-20.74485582336699,null,11.619336541157153,-1.5261143576494476,56.946110982339995,-22.270970181016438,0,0]
[63.095999999999997,6.3095999999999999E-2,1.000403447255918,2.8401114808842439E-2,1.000000000694367,3.7265722793496472E-5,1,0,1.0864059253534704,0.40152448640419713,1.0000346548848411,8.3251287161023469E-3,1.0000000262139646,2.2897145706779625E-4,1.0000012573410806,1.5857741095159676E-3,1.0000000502936737,3.1715507711711067E-4,1.0000002536694432,8.4047249189318535E-4,56.83251946690298,-24.196895551139566,155.80310444886044,null,1000000000,3981.1052159999995,null,45.213762068364822,-22.541782826659354,null,11.618746914264445,-1.6732843718709305,56.832508982629264,-24.215067198530285,0,0]
[69.183000000000007,6.9183000000000008E-2,1.0004850250631008,3.1139335352972447E-2,1.0000000008348033,4.0860823186590106E-5,1,0,1.1030590175499366,0.43571190958994854,1.0000416637218783,9.1282282371849995E-3,1.0000000315157636,2.5106080034124288E-4,1.0000015116393042,1.7387566821910612E-3,1.0000000604656161,3.4775167286990729E-4,1.00000030497432,9.2155456460004097E-4,56.699741236841916,-26.270517128766432,153.72948287123356,null,1000000000,4786.2874890000012,null,45.081690423456699,-24.455829302872495,null,11.618038208660623,-1.8346125290907656,56.699728632117321,-26.29044183196326,0,0]
[75.858000000000004,7.5858000000000009E-2,1.0005831051596552,3.4141527720581766E-2,1.0000000010036636,4.4803207795837372E-5,1,0,1.122755638852021,0.47198895224237913,1.0000500910608165,1.0008893043413361E-2,1.0000000378906302,2.7528395865091963E-4,1.0000018174066161,1.9065171720051258E-3,1.0000000726963281,3.8130387791032554E-4,1.0000003666631423,1.0104691015196956E-3,56.545235022907725,-28.474927174572475,151.52507282542751,null,1000000000,5754.4361640000006,null,44.928033652416786,-26.485280250566856,null,11.617186216144255,-2.0114940269468136,56.545219868561041,-28.496774277513669,0,0]
[83.176000000000002,8.3176E-2,1.0007009944483296,3.7432210695745122E-2,1.0000000012066506,4.9125360688685118E-5,1,0,1.1459849443267114,0.51027175041486028,1.0000602214647774,1.0974374036400211E-2,1.0000000455538525,3.0184052344871026E-4,1.0000021849691536,2.0904378370232945E-3,1.0000000873988577,4.1808815204995542E-4,1.0000004408192258,1.1079487285200135E-3,56.366428707251842,-30.806345726082071,149.19365427391793,null,1000000000,6918.2469760000004,null,44.750248230544436,-28.624926609229103,null,11.616162257464012,-2.2053738034572241,56.366410488008448,-30.830300412686327,0,0]
[91.201000000000008,9.1201000000000004E-2,1.0008427270849105,4.1039875391596314E-2,1.0000000014507235,5.3865081507162646E-5,1,0,1.1733072567201228,0.55044533056538558,1.0000724022076168,1.2033107619148891E-2,1.0000000547681722,3.309627465848763E-4,1.0000026269291085,2.2921271160112576E-3,1.0000001050772969,4.5842619392278327E-4,1.0000005299850876,1.214845955101579E-3,56.160650314921853,-33.259375889339474,146.74062411066052,null,1000000000,8317.6224010000005,null,44.545697049882349,-30.867710816902971,null,11.614931360542915,-2.4179309585965356,56.160628410425261,-33.285641775499506,0,0]
[100,0.1,1.0010130964032884,4.4994262710981434E-2,1.0000000017441564,5.9061941751324496E-5,1,0,1.2053354865091801,0.59232564369137453,1.000087046122105,1.3193923478971963E-2,1.0000000658459465,3.6289376666994442E-4,1.0000031582684139,2.5132688282821867E-3,1.0000001263309282,5.0265478166610354E-4,1.0000006371833656,1.3320532508568181E-3,55.925378745270024,-35.824714059968528,144.17528594003147,null,1000000000,10000,null,44.311900415500546,-33.202595669503189,null,11.613451994738336,-2.6509183880397882,55.925352410238879,-35.853514057542981,0,0]
[109.65,0.10965000000000001,1.0012179335402491,4.9329477769733489E-2,1.0000000020970206,6.4761419115092646E-5,1,0,1.2427579919753498,0.63569053569038725,1.0001046556974906,1.4466967267532615E-2,1.0000000791673875,3.979130116197444E-4,1.0000037972235896,2.7557980963265239E-3,1.0000001518892205,5.5116095870572795E-4,1.0000007660933241,1.4605962886656523E-3,55.65818613466493,-38.491054516794044,141.50894548320596,null,1000000000,12023.122500000001,null,44.046480803916012,-35.616287381562778,null,11.611673667839423,-2.9063463320335714,55.658154471755438,-38.522633713596349,0,0]
[120.23,0.12023,1.0014641264568129,5.4080353129323577E-2,1.0000000025212223,7.1010172530831052E-5,1,0,1.2863057457737348,0.68024260828570871,1.0001258249313347,1.5862644135839814E-2,1.0000000951819796,4.363071671342603E-4,1.0000045653536529,3.0217002777237997E-3,1.0000001826145462,6.0434182132079533E-4,1.0000009210645588,1.6015273798696762E-3,55.357086472201722,-41.242808474810396,138.7571915251896,null,1000000000,14455.252900000001,null,43.747511619531409,-38.091166541614029,null,11.609536784772494,-3.1862681689808623,55.357048404303903,-41.277434710594889,0,0]
[131.83000000000001,0.13183,1.0017600183588875,5.9286437617893345E-2,1.0000000030311955,7.7861357743964015E-5,1,0,1.3367820753682798,0.72565472929543839,1.0001512738939418,1.7392804637400013E-2,1.0000001144346482,4.7840283710434006E-4,1.0000054887953072,3.3132371486112103E-3,1.0000002195523907,6.6264975748830848E-4,1.0000011073702386,1.756045358142774E-3,55.020419380005691,-44.062878070481339,135.93712192951867,null,1000000000,17379.148900000004,null,43.413404389031797,-40.607829582592665,null,11.606969223042086,-3.4930155223315111,55.020373612073882,-44.100845104924176,0,0]
[144.54,0.14454,1.0021153766403512,6.498698860584895E-2,1.0000000036438588,8.5368130499248384E-5,1,0,1.3950094977943259,0.77153537161445995,1.0001818464991696,1.9069291893198139E-2,1.0000001375641061,5.2452662526601603E-4,1.0000065981835198,3.6326704337007226E-3,1.0000002639281766,7.2653715477384996E-4,1.0000013311910922,1.9253490527385494E-3,54.647280345139471,-46.930459609259522,133.06954039074049,null,1000000000,20891.811599999997,null,43.043338675913915,-43.143183805951097,null,11.603886650771479,-3.8289033159839754,54.647225326685394,-46.972087121935076,0,0]
[158.49,0.15849000000000002,1.0025428609657578,7.1238812185510314E-2,1.0000000043811605,9.3607271317112359E-5,1,0,1.4620110926563372,0.81757896145451037,1.000218637466582,2.0909215132461439E-2,1.0000001653989523,5.7515029262323659E-4,1.0000079332607859,3.9832670859291904E-3,1.0000003173316399,7.966574620211893E-4,1.0000016005453478,2.1111701073941091E-3,54.236433881976858,-49.830403872177023,130.16959612782298,null,1000000000,25119.080100000003,null,42.636187867148195,-45.678767866559966,null,11.600179863981497,-4.1972811159606298,54.23636773112969,-49.876048982520594,0,0]
[173.78,0.17377999999999999,1.0030563783674287,7.808474980282816E-2,1.0000000052672633,1.0263784213438232E-4,1,0,1.5386794373250599,0.86333301169285037,1.0002628517310788,2.2925713429665293E-2,1.0000001988513767,6.3063673180029252E-4,1.0000095377786096,4.367539994658472E-3,1.0000003815128911,8.7351333097613866E-4,1.0000019242601184,2.3148405427431758E-3,53.788430566270868,-52.738552004869355,127.26144799513065,null,1000000000,30199.488400000002,null,42.192621879558018,-48.187924140673474,null,11.595729156793764,-4.6006764914664071,53.788351036351784,-52.788600632139882,0,0]
[190.55,0.19055000000000002,1.0036735980442033,8.5584894508190332E-2,1.0000000063329104,1.1254252966286218E-4,1,0,1.6261018860077932,0.90845142877508978,1.0003160222187037,2.5137184253829485E-2,1.0000002390820184,6.9149399252844794E-4,1.0000114674046792,4.7890072240180962E-3,1.0000004586987119,9.5780847423499545E-4,1.0000023135667166,2.5382251893078067E-3,53.30356944038202,-55.637554186832588,124.36244581316741,null,1000000000,36309.302500000005,null,41.713091158583609,-50.649797940061376,null,11.590382661963508,-5.0426346299894576,53.303473820547119,-55.692432570050833,0,0]
[208.93,0.20893,1.0044148373109822,9.3793986407979965E-2,1.0000000076135473,1.2339811441819444E-4,1,0,1.7253109377394129,0.95255162247967995,1.000379915881151,2.7560683593421762E-2,1.0000002874290144,7.5819383470157717E-4,1.0000137863194518,5.2509353582233321E-3,1.0000005514564272,1.0501963376915269E-3,1.0000027814140504,2.7830556591305522E-3,52.783334253510134,-58.507733158999116,121.49226684100088,null,1000000000,43651.744900000005,null,41.199253078007047,-53.041518253416058,null,11.583966219767579,-5.5263867234616226,52.783219297774622,-58.567904976877678,0,0]
[229.09,0.22909000000000002,1.0053055743870025,0.10278348604342333,1.0000000091537218,1.3530500168974178E-4,1,0,1.8375450504799429,0.99535589526945989,1.0004567530148591,3.0218511870362619E-2,1.0000003455741504,8.3135317502889769E-4,1.0000165751851355,5.7575960593960716E-3,1.0000006630126803,1.1515314273149858E-3,1.0000033440764444,3.0515963658158652E-3,52.228907429787114,-61.336105067531555,118.66389493246845,null,1000000000,52482.2281,null,40.652507297329166,-55.34593181052378,null,11.576261922275338,-6.0561511478449948,52.228769219604501,-61.402082958368773,0,0]
[251.19,0.25119000000000002,1.0063751916821548,0.11261887670616016,1.0000000110050022,1.4835769056920686E-4,1,0,1.963980128729756,1.0365760406952551,1.0005491029811444,3.3131611403151948E-2,1.0000004154642517,9.1155264003458668E-4,1.0000199273747175,6.3130093942811794E-3,1.000000797102613,1.2626179814482228E-3,1.0000040203929232,3.3459784945628558E-3,51.642512141092439,-64.108812790528958,115.89118720947104,null,1000000000,63096.416100000002,null,40.075326548595747,-57.545358959184213,null,11.567019430786248,-6.6357965129017238,51.642345979381993,-64.181155472085933,0,0]
[275.42,0.27542,1.0076595206233687,0.12337704686045578,1.0000000132305042,1.6266839872585407E-4,1,0,2.1059493844658319,1.0760081752722075,1.0006601094652963,3.6324827578403662E-2,1.0000004994820655,9.9948172322146208E-4,1.0000239571674505,6.9219490278643221E-3,1.0000009582977178,1.3844110318088733E-3,1.0000048334207987,3.6687328136729451E-3,51.026206982446389,-66.817279872013785,113.18272012798622,null,1000000000,75856.176400000011,null,39.470072635071112,-59.626734005462019,null,11.555934584219557,-7.2698667758764053,51.026007219290669,-66.896600781338421,0,0]
[302,0.30199999999999999,1.009202184760946,0.13514560776491841,1.0000000159074047,1.7836706240482864E-4,1,0,2.2649556033184202,1.113515710537514,1.0007936150923491,3.9826890248896102E-2,1.0000006005412103,1.0959387846810728E-3,1.0000288043018839,7.5899420938843696E-3,1.0000011521880054,1.5180164024531841E-3,1.0000058113544483,4.0227896634176478E-3,50.381874140531338,-69.457196860522288,110.54280313947771,null,1000000000,91204,null,38.838995236668133,-61.580630650251173,null,11.542638724251251,-7.9635421434626865,50.381633960919388,-69.544172793713855,0,0]
[331.13,0.33112999999999998,1.0110528500689127,0.14799997660489062,1.0000000191241658,1.9557180545513427E-4,1,0,2.4423735259774126,1.1489585882549935,1.0009540217456288,4.3663804186199182E-2,1.0000007219813196,1.2016496039443496E-3,1.0000346289450666,8.3220124721026002E-3,1.0000013851808265,1.6644393816782584E-3,1.0000069865105843,4.4108129218185972E-3,49.712342212328778,-72.023499979291273,107.97650002070873,null,1000000000,109647.0769,null,38.185338435601317,-63.397575768167442,null,11.526715030259574,-8.7212895630583223,49.71205346586089,-72.118865331225763,0,0]
[363.08,0.36307999999999996,{"$f":"SQRT(1+(A77/pole1)^2)","v":1.0132740200357371},{"$f":"ATAN(A77/pole1)","v":0.16204216262855983},{"$f":"SQRT(1+(A77/Zero1)^2)","v":1.0000000229927064},{"$f":"ATAN(A77/Zero1)","v":2.1444209507298658E-4},{"$f":"IF(VIN_nom>Vout, 1, SQRT(1+(A77/z_RHP)^2))","v":1},{"$f":"IF(VIN_nom>Vout, 0, -ATAN(A77/z_RHP))","v":0},{"$f":"SQRT(1+(A77/Pole2)^2)","v":2.6399950517192812},{"$f":"ATAN(A77/Pole2)","v":1.1823093314649107},{"$f":"SQRT(1+(A77/Zero2)^2)","v":1.0011468959236942},{"$f":"ATAN(A77/Zero2)","v":4.7870676901795042E-2},{"$f":"SQRT(1+(A77/pole4)^2)","v":1.0000008680275805},{"$f":"ATAN(A77/pole4)","v":1.3175939833921574E-3},{"$f":"SQRT(1+(A77/Zero3)^2)","v":1.0000416337313689},{"$f":"ATAN(A77/Zero3)","v":9.124942404980246E-3},{"$f":"SQRT(1+(A77/pole5)^2)","v":1.0000016653825354},{"$f":"ATAN(A77/pole5)","v":1.8250371087226941E-3},{"$f":"SQRT((1-(Z77/pterm2))^2+(A77/pterm1)^2)","v":1.0000083997750768},{"$f":"IF((ATAN((A77/pterm1)/(1-A77^2/pterm2))>0),ATAN((A77/pterm1)/(1-A77^2/pterm2)),PI()+ATAN((A77/pterm1)/(1-A77^2/pterm2)))","v":4.8363988246092806E-3},{"$f":"20*LOG10(((E77*K77*G77*O77)/(C77*I77*S77*M77*Q77))*Adc)","v":49.019179055764326},{"$f":"((F77+L77+H77+R77)-(D77+J77+T77+N77))*radconv","v":-74.518623394175108},{"$f":"IF(V77>0,V77,V77+180)","v":105.48137660582489},null,{"$f":"IF(U77<0,A77,1000000000)","v":1000000000},{"$f":"A77^2","v":131827.0864},null,{"$f":"20*LOG10((K77/(I77*M77))*AEA*Afb)","v":37.511190111850382},{"$f":"(L77-(J77+N77))*radconv","v":-65.074039671684162},null,{"$f":"20*LOG10((E77*G77/(C77*S77))*Am)","v":11.507641790762623},{"$f":"(F77+H77-(D77+T77))*radconv","v":-9.549150646395006},49.018831902613002,-74.623190318079168,0,{"$f":"IF(AI77>0,W75,0)","v":0}]
[398.11,{"$f":"A78/1000","v":0.39811000000000002},1.0159378501358749,0.17736409121581909,1.00000002764341,2.3513149224637788E-4,1,0,2.8595509213332999,1.213539845222394,1.0013787172878319,5.2481141338759175E-2,1.0000010436022484,1.444715432770046E-3,1.0000500547189093,1.0005261725980175E-2,1.0000020022368614,2.0011164486871667E-3,1.0000100987789133,5.303010309162126E-3,48.304544963938191,-76.944466088587717,103.05553391141228,null,1000000000,158491.57210000002,null,36.819305186422561,-66.606539672466084,null,11.484822409823094,-10.452581943076632,{"$f":"AB78+AE78","v":48.304127596245657},-77.059121615542722,{"$f":"SUM((U79<0)*(U78>0))*A78","v":0},0]
[436.52,0.43651999999999996,1.0191312980147418,0.19406797946022769,1.0000000332348509,2.5781718272032029E-4,1,0,3.1030197874962298,1.2426733479646555,1.001657360104615,5.7533890914127229E-2,1.0000012546918589,1.5841026147651394E-3,1.000060178997439,1.0970504060216348E-2,1.0000024072294305,2.1941853164534359E-3,1.000012141451492,5.8146430038153842E-3,47.570032270327388,-79.306192778821668,100.69380722117833,null,1000000000,190549.71039999998,null,36.111985737372841,-67.9942514952576,null,11.457544749455659,-11.437658841810089,47.569530486828498,-79.431910337067691,0,0]
[478.63,0.47863,1.0229569347342642,0.21225543928045057,1.0000000399563005,2.8268816460295053E-4,1,0,3.3725087492766646,1.2697546809079612,1.001992213018452,6.3069980246658067E-2,1.0000015084418203,1.7369167649665435E-3,1.0000723492186159,1.2028703743743891E-2,1.0000028940692449,2.4058521423098518E-3,1.0000145969357814,6.3755587805025141E-3,46.817098435459307,-81.610050091139527,98.389949908860473,null,1000000000,229086.67689999999,null,35.391515930932073,-69.237458630013194,null,11.424979247460275,-12.510436635170706,46.816495178392344,-81.747895265183899,0,0]
[524.80999999999995,0.52481,1.0275382195780867,0.23203776152422123,1.0000000480385223,3.0996296693876674E-4,1,0,3.6704488376020374,1.2948617857351066,1.0023947095131343,6.9136681970949534E-2,1.0000018135639281,1.9045005578408574E-3,1.0000869831314332,1.3189149089063606E-2,1.0000034794705253,2.6379766626604129E-3,1.0000175495314521,6.990685309220355E-3,46.046546141683322,-83.864411916882744,96.135588083117256,null,1000000000,275425.53609999997,null,34.659679873516708,-70.337995213338559,null,11.386140997388111,-13.677561632941337,46.045820870904819,-84.015556846279893,0,0]
[575.44000000000005,0.57544000000000006,1.0330186592578363,0.25351535008572817,1.0000000577544601,3.3986602492315558E-4,1,0,3.9993417217395453,1.3180735727466446,1.0028783516265503,7.5782114669303305E-2,1.0000021803623824,2.0882329471906187E-3,1.0001045748161572,1.4461376402456348E-2,1.0000041832026145,2.8924688527045468E-3,1.0000210989462113,7.6650831786408292E-3,45.259258286612145,-86.077041876842031,93.922958123157969,null,1000000000,331131.19360000006,null,33.918479723583047,-71.297704488968577,null,11.339906619967943,-14.945063645695839,45.258386343550988,-86.242768134664416,0,0]
[630.96,0.63096000000000008,1.0395699727062198,0.27679503751015522,1.0000000694367024,3.7265721085674686E-4,1,0,4.3620847612481155,1.3394911028097143,1.0034595642397985,8.306166113332733E-2,1.0000026213930633,2.2897106092056381E-3,1.0001257262835588,1.5856425346835082E-2,1.0000050293548373,3.1715402436446722E-3,1.0000253666748387,8.4046118133452221E-3,44.455403299472039,-88.256963788041233,91.743036211958767,null,1000000000,398110.52160000004,null,33.169396564822577,-72.11929510065751,null,11.284958442980674,-16.319384558108087,44.454355007803251,-88.438679658765594,0,0]
[691.83,0.69183000000000006,1.0473913010672498,0.30196814517959353,1.0000000834803402,4.086082093528046E-4,1,0,4.7617139372103319,1.3592127593840253,1.0041578152672288,9.1032521730059102E-2,1.0000031515714396,2.5106027812661202E-3,1.0001511526211093,1.7385832410462671E-2,1.0000060465435063,3.4775028509671708E-3,1.0000304970424883,9.2153965471916711E-3,43.635119419970962,-90.412068158583679,89.587931841416321,null,1000000000,478628.74890000006,null,32.414049857657105,-72.805222306062419,null,11.219809285992966,-17.806092089354049,43.633859143650071,-90.611314395416471,0,0]
[758.58,0.75858000000000003,1.0567189943848605,0.32912544146917544,1.0000001003663666,4.4803204827992369E-4,1,0,5.2017326399384434,1.3773484078031735,1.0049967477931163,9.9760010866516452E-2,1.0000037890559075,2.7528327022899503E-3,1.0001817243148894,1.9062885373627343E-2,1.0000072696066464,3.8130204844643066E-3,1.0000366657511996,1.0104494463374258E-2,42.79786347204481,-92.550452187674736,87.449547812325264,null,1000000000,575443.61640000006,null,31.653603492320777,-73.3581488787257,null,11.142744828554727,-19.410773290155408,42.796348320875502,-92.768922168881105,0,0]
[831.76,0.83175999999999994,1.0678239691014666,0.35832964147842644,1.000000120665046,4.9125356776394261E-4,1,0,5.685784841369709,1.3939995245186749,1.0060043019878064,0.10931067727170496,1.0000045553749808,3.018396159537588E-3,1.0002184732887787,2.0901364582771056E-2,1.0000087398479702,4.1808574040707652E-3,1.0000440811088067,1.107922818766152E-2,41.943151658349464,-94.678067310266002,85.321932689733998,null,1000000000,691824.69759999996,null,30.889452569674425,-73.780190379924434,null,11.051877574084102,-21.137422414614548,41.941330143758528,-94.917612794538982,0,0]
[912.01,0.91200999999999999,1.0810256407116616,0.38963586459224697,1.0000001450723401,5.3865076349703122E-4,1,0,6.2181180325891239,1.4092745479720197,1.0072144586587992,0.11976101483642436,1.0000054768023836,3.3096155026190841E-3,1.000262658761085,2.2917298384138887E-2,1.0000105076750303,4.5842301473065462E-3,1.0000529973324823,1.2148117993751061E-2,41.069779635360739,-96.800317207392723,83.199682792607277,null,1000000000,831762.24009999994,null,30.122516032471754,-74.073310158425087,null,10.945073745469568,-22.989664089025091,41.067589777941322,-97.062974247450171,0,0]
[1000,1,1.0966867907884621,0.42305890266994345,1.0000001744156333,5.9061934952450181E-4,1,0,6.803187745743327,1.4232718850178159,1.0086674288999988,0.13118906096873223,1.0000065845731942,3.6289218960689367E-3,1.0003157774824039,2.5127451466757551E-2,1.0000126330138079,5.0265059067388087E-3,1.0000637166363378,1.3320082252728536E-2,40.176638626741564,-98.919651155308429,81.080348844691571,null,1000000000,1000000,null,29.353957430998673,-74.238814593014609,null,10.820048548618594,-24.968834136776625,40.174005979617263,-99.207648729791231,0,0]
[1096.5,1.0965,1.1152286959456641,0.45859113612300523,1.0000002097020488,6.476141015189647E-4,1,0,7.4461226596034757,1.4360912320605708,1.0104119134192977,0.14368276803419527,1.0000079167077394,3.9791093252508156E-3,1.0003796510124572,2.7551077617679293E-2,1.0000151888078461,5.511554335895094E-3,1.0000766068746838,1.4605369307281199E-2,39.262075975100871,-101.03680496642674,78.963195033573257,null,1000000000,1202312.25,null,28.58460048469075,-74.277536651129068,null,10.674310436733203,-27.075057117662318,39.258910921423954,-101.35259376879139,0,0]
[1202.3,1.2022999999999999,1.1371190166340233,0.49616348509820218,1.0000002521221991,7.1010160714694186E-4,1,0,8.1521927823777833,1.4478202145168269,1.0125050960159685,0.15732868212642376,1.000009518153115,4.3630442627930234E-3,1.0004564322422111,3.0207902977301866E-2,1.000018261289559,6.0433453761435715E-3,1.0000921029032819,1.6014491299914918E-2,38.324818146265869,-103.1483948411466,76.851605158853403,null,1000000000,1445525.2899999998,null,27.815676660998019,-74.189702410201178,null,10.505336483774443,-29.304950615534011,38.321013144772465,-103.49465302573519,0,{"$f":"IF(AI90>0,W90,0)","v":0}]
[1318.3,1.3183,1.1628901230296333,0.53567072768294333,1.0000003031195068,7.7861342167111745E-4,1,0,8.9274090139632616,1.4585461648426277,1.0150157965113011,0.1722224022716343,1.0000114433999978,4.7839922392718679E-3,1.0005487304844793,3.31203768385308E-2,1.000021955000471,6.626401556430116E-3,1.0001107318888189,1.7559422059297926E-2,37.363245935061641,-105.24850194164826,74.751498058351743,null,1000000000,1737914.89,null,27.048151779471429,-73.975025331768492,null,10.310519946983556,-31.653141452855966,37.358671726454986,-105.62816678462445,0,0]
[1445.4,1.4454,1.1931147513560014,0.57692778211296092,1.0000003643858206,8.5368109968675734E-4,1,0,9.7777885993530127,1.4683445783326177,1.0180238733196987,0.18845294406492336,1.0000137563169358,5.2452186304625401E-3,1.0006596029907244,3.6310897297068399E-2,1.0000263924728698,7.2652449943541872E-3,1.0001331116887864,1.9252130997591547E-2,36.376484262933246,-107.32633054277113,72.673669457228868,null,1000000000,2089181.1600000001,null,26.283530705009586,-73.632917851927175,null,10.087455446903874,-34.109680566624647,36.370986151913456,-107.74259841855182,0,0]
[1584.9,1.5849000000000002,1.228502668837421,0.61979242820392522,1.0000004381159688,9.3607244249966075E-4,1,0,10.712032650483181,1.4773072364325501,1.0216321615682253,0.20615173197901179,1.0000165397598209,5.7514401421699807E-3,1.0007930147891793,3.981183450154948E-2,1.0000317326655352,7.9664077755186198E-3,1.0001600438079155,2.1109908749287143E-2,35.3615676135624,-109.37230332505467,70.627696674945327,null,1000000000,2511908.0100000002,null,25.52161351522517,-73.161378839878381,null,9.8333444111700743,-36.667366029115279,35.354957926395244,-109.82874486899365,0,0]
[1737.8,1.7378,1.269728245869252,0.66394053038259249,1.0000005267261969,1.0263780645344903E-3,1,0,11.736841188526677,1.4854911033049691,1.0259518776818879,0.2254008981337865,1.0000198849419415,6.3062845540100641E-3,1.0009533279922844,4.3647938004177857E-2,1.0000381505686438,8.7349133704797532E-3,1.0001924105075986,2.3146042805439616E-2,34.318962095846388,-111.36705418064876,68.632945819351235,null,1000000000,3019948.84,null,24.764646338097592,-72.559174134347003,null,9.5463705658372557,-39.308353717414491,34.311016903934849,-111.86752785176149,0,0]
[1905.5,1.9055,1.3175997651410294,0.70908833887438583,1.000000633290854,1.1254248262326106E-3,1,0,12.861599215020279,1.4929669475790706,1.03112289798308,0.24631920243802624,1.0000239079189122,6.9148308147212248E-3,1.001146090281527,4.7853876510339323E-2,1.0000458688297449,9.5777947902754082E-3,1.0002313342602065,2.5379137293511943E-2,33.247534955117118,-113.29248235008694,66.707517649913058,null,1000000000,3630930.25,null,24.013405326644449,-71.823845039883764,null,9.224578917430728,-42.017404529355424,33.237984244075179,-113.84124956923918,0,0]
[2089.3000000000002,2.0893000000000002,1.3729226274793165,0.75485169723095524,1.0000007613544499,1.233980524114234E-3,1,0,14.095026895622627,1.4997896642087805,1.0373030462877664,0.26899516883259367,1.000028742492499,7.5817945202195716E-3,1.0013776924300903,5.2461654383522197E-2,1.0000551441374943,1.0501581171450931E-2,1.0002781090145989,2.7826451202111632E-2,32.148251100714013,-115.1254914586407,64.874508541359305,null,1000000000,4365174.4900000012,null,23.269849042565461,-70.953734941209888,null,8.8669227719365384,-44.773452797456549,32.136771814501998,-115.72718773866643,0,0]
[2290.9,2.2909000000000002,1.4366383641536662,0.80088803540697762,1.0000009153717664,1.3530491994590483E-3,1,0,15.448533304308651,1.5060199721639542,1.0446872571748318,0.2935445960465175,1.0000345568239175,8.3133421440035864E-3,1.0016561608160788,5.7513099688160839E-2,1.0000662990922313,1.1514810416488816E-2,1.0003343608263973,3.0510551853230986E-2,31.021189738646253,-116.84439746286844,63.155602537131557,null,1000000000,5248222.8100000005,null,22.534984530893695,-69.946041313490852,null,8.4724077241817959,-47.558106188889546,31.007392255075491,-117.50414750238039,0,0]
[2511.9,2.5119000000000002,1.5096697133245334,0.84678306957970029,1.0000011004996281,1.4835758281268553E-3,1,0,16.932861382664623,1.5117051799913517,1.0534945408673309,0.32004324159812436,1.0000415455707752,9.1152764592368363E-3,1.0019907757327442,6.3047262857221981E-2,1.0000797071164578,1.2625515630208611E-2,1.0004019716266188,3.3452651540330239E-2,29.86869648296787,-118.4248670853456,61.575132914654404,null,1000000000,6309641.6100000003,null,21.810981679238406,-68.799466625134713,null,8.0411326341449492,-50.34878922082487,29.852114313383353,-119.14825584595958,0,0]
[2754.2,2.7542,1.5930382764678737,0.89216099845663221,1.0000013230495453,1.6266825668187497E-3,1,0,18.560772639984616,1.5168931600369633,1.0639856519285782,0.34856940844606304,1.000049946971667,9.9944877646584458E-3,1.0023928824990289,6.9110355949936308E-2,1.0000958252264573,1.3843234811358773E-2,1.0004832442873697,3.66779258050694E-2,28.693135176646205,-119.84485140778352,60.155148592216477,null,1000000000,7585617.6399999987,null,21.099664393374589,-67.512662115503915,null,7.57354358504461,-53.125348222685368,28.6732079784192,-120.63801033818928,0,0]
[3020,3.02,1.6878699513370954,0.93668391736816736,1.0000015907392161,1.783668751396213E-3,1,0,20.347048643485152,1.5216293429288836,1.0764692289895257,0.37919501080473145,1.0000600523359335,1.0958953494893705E-2,1.0028763350211902,7.575562661338725E-2,1.0001152122299817,1.5179009817563698E-2,1.0005809940906878,4.0215502362707017E-2,27.497175051573809,-121.08489139117791,58.915108608822095,null,1000000000,9120400,null,20.402786145408143,-66.084567460211062,null,7.0704419024294705,-55.870017131694667,27.473228047837615,-121.95458459190573,0,0]
[3311.3,3.3113000000000001,1.7952121220755857,0.97998231162575,1.0000019124147745,1.9557155860595648E-3,1,0,22.305130442109817,1.525948559522458,1.0912815241150511,0.41191994209763938,1.0000721955519352,1.2015923493806395E-2,1.0034569791125578,8.3030710972516186E-2,1.0001385085862797,1.6642872407054032E-2,1.0006984467795785,4.4091793549089521E-2,26.285978974709678,-122.12710341618067,57.872896583819326,null,1000000000,10964707.690000001,null,19.723317447125936,-64.517599812105644,null,6.5338893574607013,-58.563069953063561,26.257206804586637,-123.0806697651692,0,0]
[3630.8,3.6308000000000002,1.9163569521199169,1.0218092114034896,1.0000022992680342,2.1444176965401047E-3,1,0,24.453167224517749,1.5298904217460263,1.1088330450364445,0.44676610453237692,1.0000867990286806,1.317518506533559E-2,1.0041548285053028,9.0999932139576148E-2,1.0001665245270013,1.8248365494080824E-2,1.0008396822666947,4.8342456582852807E-2,25.063192298711069,-122.96008830853584,57.039911691464155,null,1000000000,13182708.640000001,null,19.063170757731271,-62.813334634653309,null,5.9654542158669273,-61.192308000900233,25.028624973598198,-124.00564263555354,0,0]
[3981.1,3.9811000000000001,2.0525524436345957,1.0619176973234394,1.0000027643372134,2.3513106325860982E-3,1,0,26.808639412879806,1.5334862630841284,1.1295722835225508,0.48367726785671761,1.0001043548343325,1.4446159364872766E-2,1.004993131483662,9.9724054155773179E-2,1.0002002038457967,2.0008520694221779E-2,1.0010094512084409,5.3001724238874143E-2,23.834333527245505,-123.57638221142453,56.42361778857547,null,1000000000,15849157.209999999,null,18.425182521618979,-60.977328752857574,null,5.3676279075231514,-63.745457249955976,23.792810429142129,-124.72278600281355,0,0]
[4365.2,4.3651999999999997,2.2051893930729061,1.1001350171237165,1.0000033234796097,2.5781661720054709E-3,1,0,29.391719584932677,1.5367665713315881,1.1540133037251648,0.52256638651042264,1.0001254613943247,1.5839714555146055E-2,1.0060000803374671,0.10927243332301696,1.000240694265915,2.1938368112547815E-2,1.0012135285257662,5.8109027952338632E-2,22.604629933403686,-123.97474059222999,56.025259407770008,null,1000000000,19054971.039999999,null,17.811930528717998,-59.01693903177933,null,4.7428294889146407,-66.21477746414034,22.554760017632638,-125.23171649591967,0,0]
[4786.3,4.7862999999999998,2.3757291579833257,1.1363332707564078,1.0000039956221507,2.8268741912509062E-3,1,0,32.22392785485291,1.5397585035879635,1.1827254520646213,0.5632865649039912,1.000150832920522,1.7367438737692024E-2,1.0072091973190747,0.11971759819231534,1.000289365477093,2.4053927635029032E-2,1.0014588025414211,6.3706297633363648E-2,21.379670821999216,-124.15984800490541,55.840151995094587,null,1000000000,22908667.690000001,null,17.226103112200832,-56.942801905237324,null,4.0936870853640164,-68.595234635443148,21.319790197564849,-125.53803654068048,0,0]
[5248.1,5.2481,2.5658291582586785,1.1704497234338349,1.0000048038408129,3.0996198419368094E-3,1,0,35.330149546038086,1.5424881088977567,1.2163533064007701,0.60565469985795606,1.0001813401151569,1.9042726478402699E-2,1.0086611833976447,0.13114212560854097,1.0003478871451299,2.6373711172531917E-2,1.0017536655625259,6.9841897089935323E-2,20.164420011100844,-124.14244619045398,55.857553809546019,null,1000000000,27542553.610000003,null,16.670014133527907,-54.76766836504936,null,3.42252090006345,-70.885880167414442,20.092535033591357,-125.6535485324638,0,0]
[5370.3,5.3703000000000003,2.6165864860905064,1.1786449995292794,1.0000050301559482,3.1717928251528797E-3,1,0,36.152146991518634,1.5431319237699934,1.2256043448165508,0.61647075280168995,1.0001898824923554,1.9486018120120515E-2,1.0090673902651115,0.13415961842347535,1.0003642736142959,2.6987518198966796E-2,1.0018362191735852,7.1464982438906005E-2,19.862878524295688,-124.10826553399535,55.89173446600465,null,1000000000,28840122.090000004,null,16.535978618462167,-54.210240794877173,null,3.2516599414351681,-71.444295633218331,19.787638559897335,-125.6545364280955,0,0]
[5432.85,5.4328500000000002,2.6426334490179491,1.1827179285835254,1.0000051480144612,3.2087356937579247E-3,1,0,36.572904967640568,1.5434502724902945,1.2303944813308358,0.62194386030178561,1.0001943310923485,1.9712920995544697E-2,1.0092788665951664,0.13570322277656158,1.0003728071185387,2.7301697178612038E-2,1.0018792084859245,7.2295700524755507E-2,19.711551988618158,-124.08676067395103,55.913239326048966,null,1000000000,29515859.122500002,null,16.469314371293237,-53.927895449185506,null,3.1652515832188111,-71.723137248431655,19.634565954512048,-125.65103269761715,0,0]
[5495.4,5.4954000000000001,2.6687233937896924,1.1867112873583303,1.0000052672377564,3.2456785536045325E-3,1,0,36.993666565962357,1.5437613795199701,1.2352211876998851,0.62737435637740946,1.0001988311868018,1.9939821840887981E-2,1.0094927467376056,0.13724617672118694,1.0003814393663215,2.7615870767195006E-2,1.0019226940257118,7.3126361015645888E-2,19.562218520380185,-124.06272020231283,55.937279797687168,null,1000000000,30199421.159999996,null,16.4039240444542,-53.647576523652965,null,3.0795429272352499,-71.997416523006848,19.483466971689449,-125.64499304665981,0,0]
[5559.4,5.5593999999999992,2.6954613275836992,1.1907171386207154,1.000005390637426,3.2834777935176799E-3,1,0,37.424185651965487,1.5440724577240088,1.2401971900658089,0.63288682157451037,1.0002034888981377,2.0171980452372871E-2,1.0097140713835819,0.13882421815449214,1.0003903739231004,2.7937321712118723E-2,1.0019677011823132,7.3976217130449912E-2,19.411445252759826,-124.0356324084639,55.964367591536103,null,1000000000,30906928.359999996,null,16.338304185489992,-53.362860709626631,null,2.9925629777594724,-72.273462325669911,19.330867163249465,-125.63632303529654,0,0]
[5623.4,5.6233999999999993,2.7222416649487577,1.1946442359098597,1.0000055154658853,3.321277024048044E-3,1,0,37.854708277118995,1.5443764601551877,1.2452105767801278,0.63835506396162645,1.0002082005175583,2.0404136889139682E-2,1.0099379093287484,0.14040156401474321,1.0003994118490738,2.8258766882077267E-2,1.002013227723261,7.4826011565314932E-2,19.262676442578307,-124.0061573855907,55.993842614409303,null,1000000000,31622627.559999995,null,16.273953531072031,-53.08027313944924,null,2.9062979798518889,-72.544992324578672,19.18025151092392,-125.6252654640279,0,0]
[5688.9,5.6888999999999994,2.7496922795523089,1.1985841069326564,1.0000056446994245,3.3599621642160294E-3,1,0,38.295324816287291,1.5446805101386836,1.2503797043882623,0.64390589459179148,1.0002130783828613,2.0641732214541183E-2,1.0101695940798683,0.14201515099561374,1.0004087686301733,2.8587739874474716E-2,1.0020603590166894,7.5695658462233237E-2,19.11245464934936,-123.97365202683858,56.026347973161421,null,1000000000,32363583.209999997,null,16.209376392732512,-52.793267961413761,null,2.8187422065824514,-72.818340907921723,19.028118599314965,-125.61160886933548,0,0]
[5754.4,5.7543999999999995,2.7771847323298022,1.202446032227322,1.0000057754295117,3.3986472943273432E-3,1,0,38.735944815179899,1.5449776430335658,1.2555870404391209,0.64941085139982035,1.0002180127111788,2.0879325209119455E-2,1.0104039077619564,0.1436279937892822,1.0004182336767085,2.8916706677587549E-2,1.0021080341983972,7.6565239272455829E-2,18.964248777560627,-123.93890919840638,56.061090801593622,null,1000000000,33113119.359999996,null,16.14606379906321,-52.508494706248968,null,2.7319166067004508,-73.087219744094156,18.877980405763662,-125.59571445034312,0,0]
[5821.4,5.8213999999999997,2.8053487872511775,1.2063180256117778,1.000005910701766,3.438218332923368E-3,1,0,39.18665880620923,1.5452746671815853,1.260952665915823,0.65499466115938199,1.0002231184559001,2.1122356825212778E-2,1.0106463054269803,0.14527699376334044,1.0004280274896982,2.9253200594051156E-2,1.002157363823861,7.7454664992235953E-2,18.81469217389844,-123.90118566593982,56.098814334060179,null,1000000000,33888697.959999993,null,16.082577011403963,-52.219508889077289,null,2.6438483124866679,-73.357761710066455,18.726425323890631,-125.57727059914374,0,0]
[5888.4,5.8883999999999999,2.8335540644478945,1.2101129910890516,1.000006047539896,3.4777893607517672E-3,1,0,39.637376175793804,1.5455649364200899,1.2663572726767431,0.66053098073093908,1.0002282832775609,2.1365385945803388E-2,1.0108914499200681,0.14692519844158888,1.0004379345770831,2.9589687884183289E-2,1.0022072623941307,7.8344019979338153E-2,18.667159899120744,-123.8613789036314,56.138621096368595,null,1000000000,34673254.559999995,null,16.020348198663935,-51.932856888461252,null,2.5565242528999916,-73.623886249980501,18.576872451563926,-125.55674313844176,0,0]
[5957,5.9569999999999999,2.8624743385474347,1.2139210390733266,1.0000061892682151,3.5183053570633839E-3,1,0,40.098860326811035,1.5458553764900622,1.2719308144453159,0.66615058619871736,1.0002336326472643,2.1614216131339466E-2,1.0111452925285511,0.1486119304763171,1.0004481956123994,2.9934203746740232E-2,1.0022589419842078,7.9254539171914898E-2,18.518158733408349,-123.81859042149907,56.181409578500933,null,1000000000,35485849,null,15.957903923495502,-51.641775121953884,null,2.4678756292930877,-73.89191883927792,18.42577955278859,-125.5336939612318,0,0]
[6025.6,6.0256000000000007,2.8914352913392101,1.2176528565696825,1.0000063326380899,3.5588213418240359E-3,1,0,40.560347783413313,1.5461392074464488,1.2775441725313144,0.67172098270914504,1.00023904394723,2.1863043639935964E-2,1.0114020104622687,0.15029781103989007,1.0004585753896484,3.0278712501469029E-2,1.0023112178638205,8.0164982515245037E-2,18.371193213314331,-123.77387095408353,56.226129045916466,null,1000000000,36307855.360000007,null,15.896712846064109,-51.353133993327603,null,2.3799863377342998,-74.155579398162459,18.276699183798407,-125.50871339149006,0,0]
[6095.8,6.0958000000000006,2.921112568850774,1.2213950540944825,1.0000064810513003,3.600282293724093E-3,1,0,41.032602101623908,1.5464230488382142,1.2833291294333684,0.67737067256677075,1.0002446455709886,2.211767190216158E-2,1.0116676904042106,0.15202212162318599,1.0004693201854375,3.0631249002294511E-2,1.0023653302368558,8.1096581269846812E-2,18.22286345424741,-123.72623401813243,56.27376598186757,null,1000000000,37158777.640000001,null,15.83535896692435,-51.060282647162708,null,2.2908223910199332,-74.420992662020936,18.126181357944283,-125.48127530918364,0,0]
[6166,6.1660000000000004,2.950829930583371,1.2250619279023527,1.0000066311835321,3.641743233246255E-3,1,0,41.504859650434952,1.5467004309485344,1.2891546805222034,0.68296947911399586,1.0002503120454318,2.2372297295928881E-2,1.0119363766994056,0.15374552166082728,1.0004801893188595,3.0983777887077849E-2,1.0024200668710899,8.2028098777914532E-2,18.076577450675661,-123.67682227811231,56.323177721887689,null,1000000000,38019556,null,15.775251496843348,-50.769976446018262,null,2.2024316633705356,-74.682085540422861,17.977683160213882,-125.45206198644112,0,0]
[6237.8,6.2378,2.981264826730091,1.2287367053110048,1.0000067865158178,3.6841491384941288E-3,1,0,41.987884132329576,1.5469776804978177,1.295154429300317,0.68864361003745123,1.0002561747537873,2.2632723115841514E-2,1.0122142943186898,0.15550724964925811,1.0004914347983811,3.1344333648771261E-2,1.0024766967394967,8.2980762451543011E-2,17.929026912630011,-123.62456989427581,56.375430105724192,null,1000000000,38910148.840000004,null,15.715030285675704,-50.475679220766381,null,2.1128148058815781,-74.944788705286044,17.827845091557283,-125.42046792605242,0,0]
[6309.6,6.3096000000000005,3.0117391678631553,1.2323371639112113,1.0000069436463759,3.7265550304918255E-3,1,0,42.470911768306827,1.5472486236715199,1.3011954912435881,0.69426523397022188,1.0002621053003269,2.2893145865290784E-2,1.0124953518024626,0.15726800502769114,1.0005028103393132,3.1704881258423995E-2,1.002533979465891,8.3933339189798437E-2,17.783525142170763,-123.57070176751365,56.429298232486346,null,1000000000,39811052.160000004,null,15.656046789641696,-50.18402891984929,null,2.0239838476845846,-75.20322873581118,17.680030637326279,-125.38725765566048,0,0]
[6383.05,6.3830499999999999,3.0429534040770174,1.2359456948711769,1.0000071062486073,3.769935417280202E-3,1,0,42.965042774268447,1.5475194895572062,1.3074175308592006,0.69996210592362906,1.000268242327071,2.3159550046207775E-2,1.0127861143294823,0.15906820652004897,1.0005145818703216,3.2073705900276514E-2,1.0025932540143707,8.4907715640650652E-2,17.636754441948867,-123.51404199947119,56.485958000528811,null,1000000000,40743327.302500002,null,15.596955304984505,-49.888405507429894,null,1.9339128211691512,-75.463324475570843,17.530868126153656,-125.35172998300074,0,0]
[6456.5,6.4565000000000001,3.074206459150294,1.2394809008588645,1.0000072707327092,3.8133157898795501E-3,1,0,43.459176860820577,1.5477841959312486,1.3136815991234192,0.7056048304211987,1.0002744503431664,2.3425950939256014E-2,1.0130801571279819,0.16086736883643574,1.0005264894997326,3.2442521813266435E-2,1.0026532115703519,8.5881999037347168E-2,17.492037307434732,-123.45592550760101,56.544074492398991,null,1000000000,41686392.25,null,15.539092695791473,-49.595531413302439,null,1.844640256861684,-75.719213673083857,17.383732952653155,-125.3147450863863,0,0]
[6531.7,6.5316999999999998,3.1062431347703807,1.2430265897436306,1.0000074410854247,3.8577297167307748E-3,1,0,43.965087136681419,1.548049044572861,1.32013783124259,0.71132633143322821,1.0002808798149678,2.3698695582803402E-2,1.013384601164212,0.16270830968906549,1.0005388218330511,3.2820115887532794E-2,1.0027153051619906,8.6879397946969916E-2,17.34595388801241,-123.39502995258761,56.604970047412394,null,1000000000,42663104.890000001,null,15.481091228397091,-49.298515378828149,null,1.754055532074136,-75.976968699394092,17.235146760471228,-125.27548407822223,0,0]
[6606.9,6.6068999999999996,3.1383180642240349,1.2464998446926168,1.0000076134107512,3.9021436283624379E-3,1,0,44.471000426297969,1.5483078672627217,1.3266368573844662,0.71699195858658615,1.0002873836963446,2.3971436699861359E-2,1.0136924775552034,0.16454813852105127,1.0005512968169501,3.319770059986394E-2,1.0027781144743466,8.7876697090137817E-2,17.201931219615162,-123.33283493246478,56.667165067535223,null,1000000000,43651127.609999992,null,15.4243111694764,-49.004355216988245,null,1.6642827604152486,-76.230567851561077,17.088593929891648,-125.23492306854932,0,0]
[6683.85,6.6838500000000005,3.1711778068290704,1.2499811515344039,1.0000077917883097,3.9475910924786466E-3,1,0,44.988689977718174,1.5485666871960737,1.333330770745986,0.72273206853083805,1.000294115956962,2.4250521158091988E-2,1.0140110684582089,0.16642961944892032,1.0005642097727814,3.3584062387258508E-2,1.0028431262192004,8.889710020836683E-2,17.056643718108482,-123.26795864369781,56.73204135630219,null,1000000000,44673850.822500005,null,15.367440617257538,-48.706290794320182,null,1.5732484712218089,-76.485892885270331,16.940689088479346,-125.19218367959051,0,0]
[6760.8,6.7608000000000006,3.2040751939373258,1.2533910113506874,1.0000079722313555,3.993038540287497E-3,1,0,45.506382474261031,1.548819618339681,1.3400681761039572,0.72841464552146906,1.0003009261275702,2.4529601837977436E-2,1.0143332466681669,0.16830991181643168,1.000577272084398,3.3970414144591878E-2,1.0029088871418284,8.9917396481205863E-2,16.913420903948669,-123.2019419718774,56.798058028122597,null,1000000000,45708416.640000001,null,15.311782007787333,-48.411185147798861,null,1.4830383604349253,-76.737118185099206,16.794820368222258,-125.14830333289807,0,0]
[6839.55,6.83955,3.2377798889255316,1.2568088514397981,1.0000081590338159,4.0395490692108158E-3,1,0,46.036187682398747,1.5490725762361717,1.3470075305371303,0.73417110174354705,1.0003079762637439,2.4815206763668562E-2,1.0146666718035477,0.17023294435703187,1.0005907945782608,3.4365792865258794E-2,1.0029769618714615,9.0961447454579139E-2,16.768938452245138,-123.13330783954952,56.866692160450484,null,1000000000,46779444.202500001,null,15.256042603960347,-48.112221877694033,null,1.3915579979824191,-76.990100854905535,16.647600601942766,-125.10232273259956,0,0]
[6918.3,6.9183000000000003,3.2715216268786382,1.2601562282953671,1.0000083479995221,4.0860595806571044E-3,1,0,46.565995769255395,1.5493197780535475,1.3539910620921463,0.73986836455025551,1.0003151079940593,2.5100807640224564E-2,1.015003846757907,0.17215470637300648,1.0006044734845703,3.4761160837567445E-2,1.0030458209728039,9.2005383976890079E-2,16.626524109639853,-123.06369202243926,56.936307977560745,null,1000000000,47862874.890000001,null,15.201505306110422,-47.816320109430151,null,1.3009138436280736,-77.239039722252983,16.502419149738493,-125.05535983168313,0,0]
[6998.9,6.9988999999999999,3.3060932027357071,1.2635114507578276,1.0000085436444934,4.1336627016836328E-3,1,0,47.108253020916486,1.5495670293010806,1.3611836876058792,0.74563874012861497,1.0003224917534925,2.5393113629236533E-2,1.0153528217389802,0.17412028541293559,1.0006186356972033,3.5165805560774782E-2,1.0031171098020675,9.3073724862900359E-2,16.482858024988076,-122.99152782547885,57.008472174521145,null,1000000000,48984601.209999993,null,15.146897866480749,-47.516616294702104,null,1.208992296687307,-77.489763774889127,16.355890163168056,-125.00638006959123,0,0]
[7079.5,7.0795000000000003,3.3407012264377149,1.2667971926607313,1.0000087415555403,4.1812658039758312E-3,1,0,47.650513086909427,1.5498086531534887,1.3684211594411277,0.75134826602601634,1.0003299609820058,2.5685415278063142E-2,1.0157057168322265,0.17608450620228211,1.0006329617438288,3.5570438763649639E-2,1.0031892199981385,9.4141943129280287E-2,16.341262871752814,-122.91854007648824,57.081459923511758,null,1000000000,50119320.25,null,15.093482264475835,-47.220076235216681,null,1.1179187667720951,-77.736499860186001,16.211401031247931,-124.95657609540268,0,0]
[7161.95,7.16195,3.3761401467395702,1.2700886156152855,1.0000089463539008,4.2299615136965549E-3,1,0,48.205222381755782,1.5500501983085802,1.3758704161747133,0.75712649736987814,1.000337690082864,2.5984421541108683E-2,1.0160707637274879,0.17809239177370484,1.0006477861246037,3.5984347395560827E-2,1.0032638350352816,9.5234551742628654E-2,16.1985122630375,-122.84312435195061,57.156875648049393,null,1000000000,51293527.802499995,null,15.040039999502694,-46.91997928068934,null,1.0256179363373681,-77.984896307915406,16.065657935840061,-124.90487558860474,0,0]
[7244.4,7.2443999999999997,3.4116148822411487,1.2733116229780059,1.0000091535235538,4.2786572033563872E-3,1,0,48.759934425098919,1.5502862476532817,1.383365114786173,0.76284230804419861,1.0003455086172721,2.6283423156919422E-2,1.01643990406617,0.18009882702236199,1.0006627819316165,3.6398243692813359E-2,1.0033393092589864,9.6327029126654487E-2,16.057832248444456,-122.76704317964605,57.232956820353948,null,1000000000,52481331.359999992,null,14.987777408051112,-46.623143614077534,null,0.9341756535520489,-78.229365313238389,15.921953061603162,-124.85250892731592,0,0]
[7328.75,7.3287500000000003,3.447943017039818,1.2765402368893719,1.0000093679211677,4.3284750285997953E-3,1,0,49.327432149667956,1.5505222426571788,1.3910787820280246,0.76862590638819051,1.0003535998705975,2.6589310181729865E-2,1.0168217823509436,0.18214998307556446,1.0006783006953504,3.6821665016190296E-2,1.0034174116739911,9.7444544517651874E-2,15.916004383877079,-122.68861521761303,57.311384782386966,null,1000000000,53710576.5625,null,14.93549738955284,-46.322815391463699,null,0.8414998200603484,-78.475525828632257,15.776997209613189,-124.79834122009595,0,0]
[7413.1,7.4131,3.4843063433395596,1.2797014935050384,1.0000095848006194,4.3782928323581249E-3,1,0,49.894932558968186,1.5507528693024051,1.3988384667848024,0.77434552834286352,1.0003617847223609,2.6895192229691337E-2,1.0172079354275838,0.18419959042438899,1.0006939988607275,3.7245073130819865E-2,1.0034964129818906,9.8561919444574347E-2,15.776246201582055,-122.60967838450351,57.390321615496489,null,1000000000,54954051.610000007,null,14.884384482582957,-46.02584487650298,null,0.74969283519565955,-78.717819008491063,15.634077317778617,-124.74366388499405,0,0]
[7499.45,7.4994499999999995,3.5215671854749617,1.2828700474899755,1.0000098093932439,4.4292918300525589E-3,1,0,50.475891503170807,1.5509835924916908,1.4068290114203779,0.78013521484837889,1.0003702605942077,2.7208321749143904E-2,1.0176076674252637,0.18629617510962615,1.0007102550649252,3.7678506720467859E-2,1.0035782183969553,9.9705641002988593E-2,15.635268914470579,-122.52843349384645,57.47156650615355,null,1000000000,56241750.302499995,null,14.833234708189396,-45.725280739577116,null,0.65659380118450272,-78.961972170174278,15.489828509373899,-124.68725290975139,0,0]
[7585.8,7.5857999999999999,3.5588626426676093,1.2859722217213305,1.0000100365867908,4.4802908047065831E-3,1,0,51.056853073217276,1.5512090650242047,1.4148661800587665,0.78585931461793668,1.0003788345507869,2.7521445931813476E-2,1.0180118689634881,0.18839110409981943,1.0007266992611026,3.8111926146955404E-2,1.003660965454827,0.10084921202057147,15.496362129099676,-122.44683420783333,57.553165792166666,null,1000000000,57544361.640000001,null,14.783240361564385,-45.428173299569771,null,0.56437467567651789,-79.202313428093603,15.347615037240903,-124.63048672766337,0,0]
[7674.15,7.67415,3.5970566244683813,1.2890796356222214,1.0000102717344728,4.5324709706312796E-3,1,0,51.651273240137442,1.5514345101350446,1.4231369344073439,0.79164888165575642,1.0003877086096085,2.7841816968942557E-2,1.0184300529073307,0.19053282412386474,1.0007437188943997,3.8555369411823102E-2,1.003746603468151,0.10201911234815653,15.356331357853058,-122.36306433506194,57.636935664938065,null,1000000000,58892578.222499996,null,14.733250029906447,-45.127728504420048,null,0.47091465813603461,-79.444395778031364,15.204164688042482,-124.57212428245141,0,0]
[7762.5,7.7625000000000002,3.6352846094834992,1.2921217243978607,1.0000105096049512,4.5846511118740703E-3,1,0,52.245695972523272,1.5516548252764468,1.4314548388450665,0.79737135457086461,1.0003966853439972,2.8162182289462007E-2,1.0188529045065449,0.19267277621320011,1.000760935309156,3.8998797506488436E-2,1.0038332268305095,0.10318885151242459,15.21836873366809,-122.27909320186816,57.720906798131836,null,1000000000,60256406.25,null,14.684401565496772,-44.830833666200469,null,0.37834429768430045,-79.682726041428054,15.062745863181073,-124.51355970762853,0,0]
[7852.9,7.8529,3.6744336937341173,1.2951688518667339,1.000010755813072,4.6380419719197243E-3,1,0,52.853913761313024,1.5518751230470129,1.4400136965750856,0.80315798495362478,1.0004059766409943,2.8489975115177694E-2,1.0192903929116786,0.19486053389459423,1.0007787548720655,3.9452498654915125E-2,1.0039228798139306,0.10438556363701963,15.079295534568802,-122.19304684691922,57.806953153080784,null,1000000000,61668038.409999996,null,14.635567674828419,-44.530687445280925,null,0.28453078840129969,-79.922821068393475,14.920098463229719,-124.45350851367439,0,0]
[7943.3,7.9432999999999998,{"$f":"SQRT(1+(A141/pole1)^2)","v":3.7136161755401478},{"$f":"ATAN(A141/pole1)","v":1.2981517058698384},{"$f":"SQRT(1+(A141/Zero1)^2)","v":1.0000110048718061},{"$f":"ATAN(A141/Zero1)","v":4.6914328055229449E-3},{"$f":"IF(VIN_nom>Vout, 1, SQRT(1+(A141/z_RHP)^2))","v":1},{"$f":"IF(VIN_nom>Vout, 0, -ATAN(A141/z_RHP))","v":0},{"$f":"SQRT(1+(A141/Pole2)^2)","v":53.462134056798348},{"$f":"ATAN(A141/Pole2)","v":1.5520904083240277},{"$f":"SQRT(1+(A141/Zero2)^2)","v":1.4486202025768367},{"$f":"ATAN(A141/Zero2)","v":0.80887604615296627},{"$f":"SQRT(1+(A141/pole4)^2)","v":1.0004153754277461},{"$f":"ATAN(A141/pole4)","v":2.881776181696153E-2},{"$f":"SQRT(1+(A141/Zero3)^2)","v":1.0197327557300928},{"$f":"ATAN(A141/Zero3)","v":0.19704640392029721},{"$f":"SQRT(1+(A141/pole5)^2)","v":1.0007967804326487},{"$f":"ATAN(A141/pole5)","v":3.9906183553314718E-2},{"$f":"SQRT((1-(Z141/pterm2))^2+(A141/pterm1)^2)","v":1.0040135639447094},{"$f":"IF((ATAN((A141/pterm1)/(1-A141^2/pterm2))>0),ATAN((A141/pterm1)/(1-A141^2/pterm2)),PI()+ATAN((A141/pterm1)/(1-A141^2/pterm2)))","v":0.10558210321780538},{"$f":"20*LOG10(((E141*K141*G141*O141)/(C141*I141*S141*M141*Q141))*Adc)","v":14.942287389547825},{"$f":"((F141+L141+H141+R141)-(D141+J141+T141+N141))*radconv","v":-122.10695011940177},{"$f":"IF(V141>0,V141,V141+180)","v":57.893049880598227},null,{"$f":"IF(U141<0,A141,1000000000)","v":1000000000},{"$f":"A141^2","v":63096014.890000001},null,{"$f":"20*LOG10((K141/(I141*M141))*AEA*Afb)","v":14.58786159007316},{"$f":"(L141-(J141+N141))*radconv","v":-44.234182403579318},null,{"$f":"20*LOG10((E141*G141/(C141*S141))*Am)","v":0.19161639307052056},{"$f":"(F141+H141-(D141+T141))*radconv","v":-80.15922361251441},14.77947798314368,-124.39340601609373,0,0]
[8035.8,{"$f":"A142/1000","v":8.0358000000000001},3.7537423492270037,1.3011393664454289,1.0000112626669067,4.7460638852271676E-3,1,0,54.084485870074197,1.5523056825709167,1.4574750793783546,0.81465684208827394,1.0004251038102374,2.9153156620567701E-2,1.0201904336393346,0.19928107874666134,1.0008154379482606,4.0370390577509595E-2,1.0041074217859354,0.1068062579069332,14.804183630428088,-122.01887792763661,57.981122072363391,null,1000000000,64574081.640000001,null,14.540180826608966,-43.934518206419234,null,9.745778521936406E-2,-80.397412721246411,{"$f":"AB142+AE142","v":14.637638611828329},-124.33193092766564,{"$f":"SUM((U143<0)*(U142>0))*A142","v":0},0]
[8128.3,8.1282999999999994,3.793901320320983,1.3040638030642504,1.0000115234465943,4.8006949366014157E-3,1,0,54.706840132760291,1.5525160588349127,1.4663780723344233,0.82036763169569893,1.000434944728027,2.948854486358549E-2,1.020653201562731,0.20151373829443001,1.0008343111196829,4.0834580194217936E-2,1.0042023587359412,0.10803022786448636,14.66814105498676,-121.93090374212868,58.069096257871323,null,1000000000,66069260.890000001,null,14.493613286174199,-43.638584066748393,null,4.2074379406555045E-3,-80.631968781370915,14.497820724114854,-124.27055284811931,0,0]
[8222.9500000000007,8.2229500000000009,3.835026591096788,1.3069927882917831,1.0000117933770953,4.8565957611258932E-3,1,0,55.343662376228899,1.5527264272012153,1.4755368978621701,0.82613962954433073,1.0004451308664226,2.9831721747516648E-2,1.0211319873459312,0.20379618566141974,1.0008538461849672,4.1309540856361099E-2,1.004300619082404,0.1092824534833159,14.531019191229209,-121.84105804460755,58.15894195539245,null,1000000000,67616906.702500015,null,14.447081884821312,-43.339588756929452,null,-9.0287061184736617E-2,-80.868331635075322,14.356794823636575,-124.20792039200478,0,0]
[8270.2750000000015,8.2702750000000016,3.8556013667530897,1.3084338435024141,1.0000119295141976,4.8845461620275945E-3,1,0,55.662074400660778,1.5528298062851233,1.4801345739528715,0.82899879375895291,1.000450268118493,3.0003307558822908E-2,1.0213733737024491,0.2049366039231281,1.0008636983827182,4.1547014207861679E-2,1.0043501727628303,0.10990849226338134,14.463232549008611,-121.79622243086223,58.20377756913777,null,1000000000,68397448.575625017,null,14.424230022236724,-43.191525042337609,null,-0.13718936216510541,-80.985165956725226,14.287040660071618,-124.17669099906283,0,0]
[8317.6,8.3176000000000005,3.8761840640971847,1.309859597522403,1.000012066432534,4.9124965552973764E-3,1,0,55.980487013199138,1.5529320093458969,1.4847442748828397,0.83184022732837037,1.0004554348252077,3.0174891602920861E-2,1.0216160877812712,0.20607648178886701,1.000873607021656,4.1784482870786004E-2,1.004400008734438,0.11053448132352665,14.395953832066702,-121.75145595252552,58.248544047474482,null,1000000000,69182469.760000005,null,14.401648588205109,-43.044409736469333,null,-0.18386448074823589,-81.101120736424505,14.217784107456874,-124.14553047289384,0,0]
[8366.0499999999993,8.3660499999999995,3.8972641243595638,1.3113036402815397,1.0000122074149758,4.9411113715171701E-3,1,0,56.306469462578946,1.5530354444965861,1.4894758970978683,0.83473096318662066,1.0004607548665683,3.0350552665778352E-2,1.021865946061473,0.20724289408516303,1.0008838096746318,4.2027591704185185E-2,1.0044513217961097,0.11117529947058129,14.327595611645144,-121.70570513570217,58.294294864297825,null,1000000000,69990792.602499992,null,14.378806317092661,-42.894773807047798,null,-0.23141595092745382,-81.218934959154751,14.147390366165206,-124.11370876620255,0,0]
[8414.5,8.4145000000000003,3.9183522239774766,1.3127321426644916,1.0000123492162349,4.969726179645262E-3,1,0,56.632452507437009,1.553137688878619,{"$f":"SQRT(1+(A148/Zero2)^2)","v":1.4942198870128705},{"$f":"ATAN(A148/Zero2)","v":0.83760336736050844},1.0004661057786262,3.0526211855038104E-2,1.0221171939275158,0.20840873453251743,1.000894071480539,4.2270695566937661E-2,1.0045029306542053,0.11181606492247362,14.259756957859098,-121.66004318173955,58.339956818260447,null,1000000000,70803810.25,null,14.356239061286127,-42.746119872405075,null,-0.27873364667179412,-81.335855765169782,14.077505414614333,-124.08197563757486,0,0]
[8462.9500000000007,8.4629500000000011,3.9394482338454866,1.3141453484531795,1.0000124918363114,4.998340979634793E-3,1,0,56.958436137549249,1.553238762934805,1.4989761272032105,0.84045756672482652,1.0004714875608864,3.0701869159889931E-2,1.0223698303549258,0.20957400038451643,1.0009043924375587,4.2513794430462118E-2,1.0045548352702598,0.11245677738439711,14.192431550550426,-121.61447794433903,58.385522055660971,null,1000000000,71621522.702500015,null,14.333942673147861,-42.598441833818363,null,-0.32581972337745241,-81.451897105256322,14.008122949770408,-124.05033893907469,0,0]
[8511.4,8.5114000000000001,3.960552027560976,1.3155434964808888,1.0000126352752043,5.0269557714389072E-3,1,0,57.284420342924285,1.5533386866427208,1.5037445014285635,0.8432936877377315,1.0004769002128509,3.0877524569524337E-2,1.022623854314582,0.21073868890369438,1.0009147725438607,4.2756888266180813E-2,1.0046070356055958,0.11309743656172172,14.125613169365302,-121.5690169908918,58.430983009108203,null,1000000000,72443929.959999993,null,14.311913079233715,-42.451733589780467,null,-0.37267631075942698,-81.5670726466752,13.939236768474288,-124.01880623645567,0,0]
[8560.9500000000007,8.5609500000000001,3.982142879944703,1.3169580572021558,1.0000127828176208,5.0562202197637039E-3,1,0,57.617806219316087,1.553439709525368,1.5086335664446178,0.84617563217761449,1.0004824676811106,3.1057166056161548E-2,1.0228850796540188,0.21192922031294481,1.0009254494951922,4.3005496030086902E-2,1.0046607269137675,0.11375258572880712,14.057795799889782,-121.52263935787629,58.477360642123713,null,1000000000,73289864.902500018,null,14.289655109298691,-42.302691220233378,null,-0.42036155056714347,-81.683981558849084,13.869293558731547,-123.98667277908245,0,0]
[8610.5,8.6105,4.0037416145758593,1.3183573586136739,1.0000129312164561,5.0854846594280542E-3,1,0,57.9511926769678,1.5535395700632839,1.5135350805625365,0.84903893418044929,1.0004880674356438,3.1236805537680861E-2,1.0231477540534921,0.2131191421138699,1.00093618830822,4.3254098474847298E-2,1.0047147274390633,0.11440767854155137,13.990495892574586,-121.47638592783942,58.523614072160584,null,1000000000,74140710.25,null,14.267667798748931,-42.154650271317884,null,-0.46781118690751711,-81.800012948605357,13.799856611841415,-123.95466321992325,0,0]
[8660.0499999999993,8.66005,4.0253481045735686,1.3197416409090648,1.0000130804717093,5.1147490903818383E-3,1,0,58.284579705905045,1.5536382882002493,1.518448923226182,0.85188372755493136,1.0004936994759084,3.1416443002521992E-2,1.0234118763972317,0.2143084514075147,1.000946988980953,4.3502695569904881E-2,1.0047690371394236,0.11506271468537647,13.9237071055916,-121.43026392195019,58.569736078049814,null,1000000000,74996466.002499983,null,14.245947021134157,-42.007604218392586,null,-0.5150274165401667,-81.915180560003748,13.730919604593989,-123.92278477839633,0,0]
[8709.6,8.7096,4.0469622257215123,1.3211111393836354,1.0000132305833807,5.1440135125749376E-3,1,0,58.617967296380364,1.5537358834264172,1.5233749751336108,0.85471014558380165,1.0004993638013593,3.159607843912543E-2,1.0236774455644706,0.21549714530483885,1.0009578515113891,4.3751287284706473E-2,1.0048236559725576,0.11571769384590153,13.857423198323712,-121.38428028488013,58.615719715119866,null,1000000000,75857132.160000011,null,14.224488724552804,-41.861546540960155,null,-0.56201240948733755,-82.029497856462427,13.662476315065467,-123.89104439742258,0,{"$f":"IF(AI154>0,W154,0)","v":0}]
[8760.3250000000007,8.7603249999999999,4.0690966693955586,1.3224980401527864,1.0000133851418342,5.1739718851984947E-3,1,0,58.95926121879851,1.5538346496862456,1.5284303642938379,0.85758469211042632,1.0005051958894222,3.1779971533404928E-2,1.023950809803768,0.21671338673583579,1.0009690357028591,4.4005768354405644E-2,1.0048798901762526,0.11638814544862382,13.790084042010005,-121.33735651717464,58.662643482825359,null,1000000000,76743294.105625018,null,14.202789315966342,-41.713042344831159,null,-0.60987428838875002,-82.145658976162323,13.592915027577591,-123.85870132099348,0,0]
[8811.0499999999993,8.8110499999999998,4.0912388552527803,1.3238699314510995,1.0000135405978039,5.2039302485346493E-3,1,0,59.300555709730752,1.5539322790814363,1.533498299571189,0.86044026238747329,1.0005110618108444,3.1963862477600066E-2,1.0242256879055227,0.217928977142956,1.0009802847162483,4.4260243720869522E-2,1.0049364482573129,0.11705853666735379,13.723261075641792,-121.29059163596852,58.709408364031475,null,1000000000,77634602.102499992,null,14.181356623882991,-41.565560146978733,null,-0.65749835161464554,-82.260956657313713,13.523858272268345,-123.82651680429245,0,0]
[8861.7749999999996,8.8617749999999997,4.11338865826571,1.3252270505417099,1.0000136969512887,5.2338886025296329E-3,1,0,59.641850759417309,1.5540287911269239,1.5385786569884341,0.8632769975917467,1.0005169615650304,3.2147751259311894E-2,1.0245020786512085,0.21914391345920964,1.0009915985493714,4.4514713351332454E-2,1.0049933301696152,0.11772886716545958,13.656947921271396,-121.24399224660884,58.75600775339116,null,1000000000,78531056.15062499,null,14.160186533886311,-41.419092975980831,null,-0.70488684240005473,-82.375404474808377,13.455299691486257,-123.79449745078921,0,0]
[8912.5,8.9124999999999996,4.1355459560428924,1.3265696298232366,1.0000138542022885,5.2638469471296707E-3,1,0,59.983146358320489,1.5541242048935795,{"$f":"SQRT(1+(A158/Zero2)^2)","v":1.5436713138985285},{"$f":"ATAN(A158/Zero2)","v":0.86609503825641143},1.000522895151382,3.233163786614237E-2,1.0247799808169116,0.22035819262863021,1.0010029772000304,4.4769177213033237E-2,1.0050505358667832,0.11839913660653041,13.591138303897647,-121.19756468717372,58.802435312826276,null,1000000000,79432656.25,null,14.139275006715334,-41.273633871850279,null,-0.75204197610866208,-82.489015724834559,13.387233030606671,-123.76264959668484,0,0]
[8964.4,8.9643999999999995,4.1582241403583842,1.3279284972775891,1.0000140160248101,5.2944992406467172E-3,1,0,60.332348328245274,1.5542207115401441,1.5488945413398907,0.86895915312110983,1.0005290012001944,3.2519781780482961E-2,1.0250658834012119,0.22159991617448277,1.0010146865119034,4.5029529501309597E-2,1.0051094017569835,0.11908486870397834,13.524318993768629,-121.15024585986443,58.849754140135573,null,1000000000,80360467.359999999,null,14.118142562865978,-41.125841453669395,null,-0.80005017084542773,-82.604406403027994,13.318092392020551,-123.73024785669739,0,0]
[9016.2999999999993,9.0162999999999993,4.1809099196158135,1.3292726206565584,1.0000141787869077,5.3251515242146415E-3,1,0,60.681550853610183,1.5543161074590648,1.5541303891359017,0.87180399285023791,1.0005351426654319,3.2707923391760763E-2,1.0253533656285674,0.2228409453394409,1.0010264636742794,4.5289875681098636E-2,1.0051686065071332,0.11977053617116701,13.458013850068314,-121.10311951873835,58.896880481261647,null,1000000000,81293665.689999983,null,14.097272478362724,-40.979089647445456,null,-0.84781867661474974,-82.718948605457143,13.249453801747974,-123.69803825290259,0,0]
[9068.2000000000007,9.0682000000000009,4.2036031708512631,1.3306022338523675,1.0000143424885806,5.3558037977758507E-3,1,0,61.030753924880983,1.5544104117145279,1.5593787301623698,0.87462970578485166,1.0005413195464423,3.289606268669891E-2,1.0256424261706811,0.22408127688626192,1.0010383086847632,4.5550215717324004E-2,1.0052281500667355,0.12045613864848821,13.392216473469245,-121.05619163846195,58.943808361538046,null,1000000000,82232251.24000001,null,14.076660660695705,-40.833371045398749,null,-0.89534977815131034,-82.832655712558505,13.181310882544395,-123.66602675795725,0,0]
[9120.1,9.1201000000000008,4.2263037737017735,1.3319175659397593,1.0000145071298285,5.3864560612727477E-3,1,0,61.379957532740306,1.5545036429369565,1.5646394386994713,0.87743643949985106,1.0005475318425696,3.3084199652021515E-2,1.025933063693464,0.22532090758992715,1.0010502215409467,4.5810549574914296E-2,1.0052880323850182,0.12114167577658091,13.326920569030223,-121.00946793673916,58.990532063260844,null,1000000000,83176224.010000005,null,14.05630309290785,-40.688678258794255,null,-0.9426457312708163,-82.945540828761523,13.113657361637033,-123.63421908755578,0,0]
[9173.2000000000007,9.1732000000000014,4.249536731659485,1.3332487640871626,1.0000146765502227,5.4178170371489455E-3,1,0,61.737235758303513,1.5545979382477901,1.5700344522059229,0.88028857935237581,1.0005539244277672,3.3276684180102753E-2,1.0262320518567367,0.2265884715873947,1.00106248005323,4.607689628130273E-2,1.0053496498104175,0.12184299546643979,13.260627473210914,-120.9618809351111,59.038119064888903,null,1000000000,84147598.24000001,null,14.03573385382543,-40.541693956914827,null,-0.99079418846828426,-83.060198671193589,13.044939665357147,-123.60189262810842,0,0]
[9226.2999999999993,9.2262999999999984,4.2727771382708202,1.3345654832924716,1.0000148469541419,5.4491780023680787E-3,1,0,62.094514526492851,1.554691148448698,1.575442149941628,0.88312116220248138,1.000560354083307,3.3469166241483224E-2,1.0265326879239767,0.22785529516762834,1.0010748095797122,4.6343236445779173E-2,1.0054116217323292,0.12254424598996391,13.194846301882109,-120.91451898385294,59.085481016147057,null,1000000000,85124611.689999983,null,14.015422486068601,-40.395767875184568,null,-1.0387011839294962,-83.17402296902246,12.976721302139104,-123.56979084420703,0,0]
[9279.4,9.279399999999999,4.2960248726497952,1.3358679540088452,1.0000150183415852,5.4805389568684656E-3,1,0,62.451793827995466,1.5547832921614024,1.5808624017387596,0.8859343435251017,1.0005668208084741,3.3661645821947958E-2,1.0268349704477671,0.22912137491665416,1.0010872101177692,4.6609570030799269E-2,1.0054739480954795,0.12324542696309719,13.12957063950275,-120.86738742518199,59.132612574818012,null,1000000000,86107264.359999999,null,13.995364922677304,-40.250892171677549,null,-1.0863690422196377,-83.287026904240207,12.908995880457667,-123.53791907591776,0,0]
[9332.5,9.3324999999999996,4.3192798164752979,1.3371564019221436,1.0000151907125527,5.5118999005884257E-3,1,0,62.80907365371035,1.5548743875839905,1.5862950789084516,0.88872827790105469,1.0005733246025503,3.3854122907283082E-2,1.0271388979744729,0.23038670743404477,1.0010996816647624,4.6875896998824211E-2,1.0055366288442935,0.12394653800206024,13.064794176259509,-120.82049135514175,59.179508644858245,null,1000000000,87095556.25,null,13.975557172577158,-40.107059031424519,null,-1.1338000579708893,-83.399223385708737,12.841757114606269,-123.50628241713326,0,0]
[9386.85,9.3868500000000008,4.3430895382090577,1.3384608893592904,1.0000153681597419,5.5439990850507364E-3,1,0,63.17476455504697,1.5549665604024379,1.5918683787455989,0.89156821134384134,1.0005800198864789,3.4051128398692031E-2,1.0274516821252695,0.23168104913966858,1.0011125203312972,4.7148486542428009E-2,1.0056011520677781,0.12466408071493582,12.999003331072668,-120.77274026686,59.227259733140002,null,1000000000,88112952.922499999,null,13.955537754342869,-39.960911527569273,null,-1.1821047157802365,-83.513238031688019,12.773433038562633,-123.47414955925728,0,0]
[9441.2000000000007,9.4412000000000003,4.3669065699251366,1.3397511496690144,1.0000155466373042,5.5760982580883292E-3,1,0,63.540455986927611,1.5550576722657794,1.5974544277089577,0.89438830579052364,1.0005867540035618,3.4248131245986635E-2,1.0277661865374932,0.23297460085413269,1.0011254333836459,4.7421069074273597E-2,1.0056660464393516,0.12538154934962545,12.933722418478947,-120.72524593325416,59.274754066745842,null,1000000000,89136257.440000013,null,13.935771824987533,-39.815839774715414,null,-1.2301660192900494,-83.626433279597606,12.705605805697484,-123.44227305431302,0,0]
[9495.5499999999993,9.4955499999999997,4.3907307926669725,1.3410274101103354,1.0000157261452391,5.6081974196350651E-3,1,0,63.906147940244452,1.5551477413858892,1.6030530925205204,0.89718872401307082,1.0005935269530151,3.4445131433929028E-2,1.0280824096323899,0.23426735897550033,1.0011384208189302,4.7693644554126641E-2,1.0057313118984403,0.1260989434955137,12.868945003209236,-120.67801307053296,59.321986929467045,null,1000000000,90165469.80249998,null,13.916255341302131,-39.671835489306524,null,-1.2779863344194546,-83.738822126897489,12.638269006882677,-123.41065761620402,0,0]
[9549.9,9.5498999999999992,4.4145620900103815,1.3422898932196481,1.0000159066835459,5.6402965696248017E-3,1,0,64.271840406096942,1.5552367855602243,1.6086642414587624,0.89996962775453848,1.0006003387340499,3.4642128947282594E-2,1.0284003498245249,0.23555931991686316,1.0011514826342556,4.7966212941759102E-2,1.0057969483841402,0.12681626274229521,12.804664757152322,-120.63104615954424,59.36895384045576,null,1000000000,91200590.00999999,null,13.896984336363904,-39.528890422994309,null,-1.3255679961192388,-83.850417300478895,12.571416340244665,-123.3793077234732,0,0]
[9605.5249999999996,9.6055250000000001,4.4389596538133738,1.3435679544691403,1.0000160925240242,5.6731487235167849E-3,1,0,64.64611219568144,1.555326875483211,1.6144198137032382,0.90279573004849434,1.0006073505209436,3.4843745052105517E-2,1.0287275249257097,0.23688075987123966,1.00116492788231,4.8245168142286306E-2,1.0058645087609099,0.12755033164233873,12.739384864016625,-120.58325726979581,59.416742730204192,null,1000000000,92266110.52562499,null,13.877511374678271,-39.383680213164489,null,-1.374021166620385,-83.963821576241969,12.503490208057887,-123.34750178940646,0,0]
[9661.15,9.6611499999999992,4.4633643891180954,1.3448320414258472,1.0000162794437837,5.7060008651629917E-3,1,0,65.020384503905987,1.5554159282502227,1.6201881884130129,0.90560173101166785,1.0006144029810085,3.5045358323090837E-2,1.0290564952504611,0.23820135725060698,1.0011784510349224,4.8524115828692718E-2,1.0059324576462059,0.12828432121928618,12.674612662151352,-120.53575573278928,59.464244267210717,null,1000000000,93337819.32249999,null,13.858287373939078,-39.239562137725329,null,-1.4222292067637334,-84.076420639828854,12.436058167175345,-123.31598277755418,0,0]
[9716.7749999999996,9.7167750000000002,4.4877761789276711,1.346082378061116,1.0000164674428236,5.7388529944925144E-3,1,0,65.394657321865594,1.5555039616676785,1.6259692293319767,0.90838780062869695,1.0006214961133841,3.5246968743908313E-2,1.0293872590776332,0.23952110825880504,1.0011920520889359,4.8803055957872862E-2,1.0060007949736656,0.12901823103429252,12.610341702501485,-120.48854563836207,59.511454361637931,null,1000000000,94415716.40062499,null,13.839308318935068,-39.096527476571524,null,-1.4701945219558294,-84.18822729871259,12.369113796979239,-123.28475477528411,0,0]
[9772.4,9.7723999999999993,4.5121949087436635,1.3473191836720955,1.000016656521143,5.7717051114344504E-3,1,0,65.768930640858002,1.5555909931367355,1.6317628018378598,0.91115410771571403,1.000628629917206,3.5448576298229124E-2,1.0297198146789135,0.2408400091163313,1.0012057310411757,4.9081988486728283E-2,1.0060695206765657,0.12975206064885991,12.54656564447777,-120.44163085229009,59.558369147709911,null,1000000000,95499801.75999999,null,13.820570271056241,-38.954567553328431,null,-1.5179194856361615,-84.299254092574273,12.302650785420079,-123.2538216459027,0,0]
[9829.2999999999993,9.8292999999999999,4.5371804123925479,1.3485705625849698,1.0000168510500631,5.8053102303010102E-3,1,0,66.151783318484746,1.555679000552513,1.6377019979205578,0.91396354985934614,1.0006359693170197,3.5654801986697592E-2,1.0300618449432581,0.24218825743309341,1.0012198041271039,4.9367306616673205E-2,1.0061402234258969,0.13050262719187603,12.481833301625031,-120.39395005897801,59.606049941021993,null,1000000000,96615138.48999998,null,13.801648050951481,-38.810456690613783,null,-1.5664921328390171,-84.412031686659958,12.235155918112465,-123.22248837727375,0,0]
[9886.2000000000007,9.8862000000000005,4.56217294320557,1.3498082327911989,1.0000170467083058,5.838915336055509E-3,1,0,66.534636502580753,1.555765995145528,1.6436540268525728,0.91675266668202038,1.0006433512722901,3.5861024641196344E-2,1.0304057463817153,0.24353560823271075,1.0012339587164722,4.9652616702676282E-2,1.0062113324165056,0.13125310888865499,12.417605724941755,-120.34658576574166,59.653414234258335,null,1000000000,97736950.440000013,null,13.78296991426059,-38.66745217870519,null,-1.6148182075026607,-84.524018969131376,12.16815170675793,-123.19147114783657,0,0]
[9943.1,9.9431000000000012,4.5871723863233331,1.351032414599227,1.0000172434958705,5.8725204286220502E-3,1,0,66.917490184453044,1.5558519942983804,1.6496187497263772,0.91952163503208917,1.0006507757820746,3.6067244244252318E-2,1.0307515171213815,0.24488205752414985,1.0012481948058238,4.9937918698630096E-2,1.0062828475758052,0.13200350527098895,12.353876466005147,-120.2995414334291,59.700458566570902,null,1000000000,98865237.610000014,null,13.764531883219476,-38.525544879886894,null,-1.6629001494110249,-84.635228535910557,12.101631733808452,-123.16077341579745,0,0]
[10000,10,4.6121786293453129,1.3522433237033389,1.0000174414127563,5.9061255079247438E-3,1,0,67.300344355606512,1.5559370149981879,1.6555960293421224,0.92227063044797464,1.0006582428454269,3.6273460778394037E-2,1.0310991552816915,0.24622760133479116,1.0012625123916827,5.0223212558435149E-2,1.0063547688308165,0.13275381587105797,12.290639185845988,-120.25282031093241,59.747179689067593,null,1000000000,100000000,null,13.746330056755882,-38.384725708837301,null,-1.7107403654780238,-84.745672718569978,12.035589691277858,-123.13039842740727,0,0]
[10058.25,10.058249999999999,4.6377850953374438,1.3534694343149452,1.0000176451952152,5.9405278819684802E-3,1,0,67.69228255974059,1.556023056666769,1.6617279905884181,0.92506434059869536,1.0006659311500687,3.6484566774720867E-2,1.0314569738815524,0.24760412720673394,1.001277254090372,5.0515266777110227E-2,1.0064288170634854,0.13352183886915492,12.226404668916546,-120.20532867181453,59.794671328185473,null,1000000000,101168393.0625,null,13.727937059837444,-38.241683214946086,null,-1.7594677130043408,-84.85795704748152,11.968469346833103,-123.09964026242761,0,0]
[10116.5,10.1165,4.6633984569569318,1.3546820780942201,1.0000178501612176,5.9749302419505514E-3,1,0,68.084221259242298,1.5561081077082168,1.667872825892784,0.92783748689175471,1.0006736640494436,3.6695669517730657E-2,1.0318167455526095,0.2489796957553915,1.0012920811911534,5.0807312371236035E-2,1.0065032907343414,0.13428977097524464,12.162672650544273,-120.15818200436797,59.841817995632027,null,1000000000,102343572.25,null,13.709783573943133,-38.099761998155522,null,-1.8079467298271292,-84.969464576813465,11.901836844116003,-123.06922657496898,0,0]
[10174.75,10.17475,4.6890186012034594,1.3558814721879171,1.000018056310763,6.0093325877895324E-3,1,0,68.476160445605586,1.5561921851315432,1.6740303934854588,0.93059025335801027,1.0006814415425176,3.6906768988683718E-2,1.0321784682526003,0.25035430277886639,1.0013069936902326,5.109934929137934E-2,1.0065781897638089,0.13505761168868921,12.099436671877172,-120.11138315361723,59.888616846382774,null,1000000000,103525537.5625,null,13.691865652463493,-37.958952487745023,null,-1.8561798946017807,-85.080207719478523,11.835685757861713,-123.03916020722355,0,0]
[10233,10.233000000000001,4.714645417503359,1.3570678291758829,1.000018263643851,6.0437349194040011E-3,1,0,68.868100110518043,1.5562753055586105,1.6802005533832911,0.93332282256891463,1.0006892636282509,3.7117865168842121E-2,1.032542139931057,0.25172794409566823,1.0013219915837943,5.1391377488115716E-2,1.0066535140718829,0.1358253605092854,12.036690384753832,-120.06493476438247,59.935065235617529,null,1000000000,104714289,null,13.674179425745489,-37.819245174429867,null,-1.9041696521350242,-85.19019862674989,11.770009773610465,-123.00944380117976,0,0]
[10292.5,10.2925,4.7408289413334179,1.3582664011018741,1.0000184766480575,6.0788754837076842E-3,1,0,69.268450983470174,1.556359238554881,1.6865159769715552,0.93609336688154965,1.0006972996071268,3.7333487892986961E-2,1.0329156257447536,0.2531300613533895,1.0013373994794696,5.1689663326758638E-2,1.0067308937635313,0.13660948923487357,11.973096690165972,-120.01785400047582,59.982145999524178,null,1000000000,105935556.25,null,13.656348927317556,-37.67766795670893,null,-1.9529404418187499,-85.30178560022641,11.703408485498805,-122.97945355693534,0,0]
[10352,10.352,4.7670192008966765,1.359451804678137,1.0000186908871456,6.114016032998079E-3,1,0,69.668802338792759,1.5564422069108099,1.6928442494658356,0.93884321820431815,1.0007053821108329,3.7549107144070462E-2,1.0332911407308729,0.25453116225899713,1.0013528964658345,5.1987939959367437E-2,1.006808717011815,0.13739352102779182,11.910000883663452,-119.97114387237393,60.028856127626071,null,1000000000,107163904,null,13.638752250818433,-37.537220891162072,null,-2.0014623163236629,-85.41261252986682,11.63728993449477,-122.9498334210289,0,0]
[10411.5,10.4115,4.7932160857804655,1.3606242524568979,1.0000189063611145,6.1491565671884059E-3,1,0,70.069154168217466,1.5565242271601467,1.6991852273066654,0.94157256638177578,1.0007135111382421,3.7764722902128019E-2,1.0336686826779191,0.2559312424222156,1.0013684825387525,5.2286207333296052E-2,1.0068869837300811,0.13817745535635848,11.847396542701567,-119.92480659985908,60.075193400140918,null,1000000000,108399332.25,null,13.621385509730541,-37.397894046667638,null,-2.0497377753962369,-85.522691563558425,11.571647734334304,-122.92058561022606,0,0]
[10471,10.471,4.819419487945158,1.3617839525119957,1.0000191230699633,6.1842970861918879E-3,1,0,70.469506463663905,1.5566053154609656,1.7055387687834269,0.94428159965999225,1.0007216866882207,3.7980335147196988E-2,1.0340482493656979,0.25733029747517111,1.0013841576940643,5.2584465395908275E-2,1.0069656938312117,0.13896129168937485,11.78527735558847,-119.87884421620967,60.121155783790329,null,1000000000,109641841,null,13.604244894011625,-37.259677562166004,null,-2.0977692842858211,-85.632034592623626,11.506475609725804,-122.89171215478963,0,0]
[10532,10.532,4.8462901352156535,1.3629598680994559,1.000019346524029,6.2203234847756257E-3,1,0,70.87995214964738,1.5566874970489066,1.7120653798703247,0.9470380337116483,1.0007301166399172,3.8201379327237814E-2,1.0344394845782139,0.25876355407399654,1.0014003204963426,5.2890232847866633E-2,1.0070468484192538,0.13976478631423292,11.722089299630143,-119.83211424122656,60.167885758773437,null,1000000000,110923024,null,13.586903000280433,-37.119119081084328,null,-2.146760963864645,-85.74338228325189,11.440142036415788,-122.86250136433623,0,0]
[10593,10.593,4.8731674099191924,1.3641228140836625,1.0000195712760209,6.2563498672124299E-3,1,0,71.290398308828557,1.5567687323355628,1.7186049002504085,0.94977351121891662,1.0007385954869921,3.8422419772445551E-2,1.0348328431523359,0.26019572399974361,1.0014165769202494,5.3195990401102788E-2,1.0071284688404498,0.14056817681116132,11.659398079796624,-119.7857820531914,60.214217946808603,null,1000000000,112211649,null,13.569790905954743,-36.979706888490625,null,-2.1955013769921674,-85.853980905185153,11.374289528962576,-122.83368779367578,0,0]
[10654,10.654,4.9000512029993599,1.3652730007633194,1.0000197973259377,6.2923762334087937E-3,1,0,71.700844933081143,1.5568490375709654,1.7251571831186507,0.95248822979362047,1.0007471232282024,3.8643456461315825E-2,1.0352283226676056,0.2616268026194139,1.0014329269612257,5.3501737998931091E-2,1.0072105549994037,0.14137146260936237,11.597197242819375,-119.73984927938395,60.260150720616053,null,1000000000,113507716,null,13.552904744611515,-36.841430591887502,null,-2.2439930709075284,-85.963842474952656,11.308911673703987,-122.80527306684016,0,0]
[10715,10.715,4.9269414077538425,1.36641063398278,1.0000200246737785,6.3284025832712112E-3,1,0,72.111292014463743,1.5569284286352227,1.7317220836075298,0.95518238528367572,1.000755699862298,3.8864489372346468E-2,1.03562592069422,0.26305678532494647,1.0014493706146856,5.3807475584677002E-2,1.0072931068002082,0.14217464313858252,11.535480447976267,-119.69431737176855,60.305682628231452,null,1000000000,114811225,null,13.536240726874659,-36.704279878647156,null,-2.2922385572239405,-86.072978753899349,11.244002169650718,-122.77725863254651,0,0]
[10777.5,10.7775,4.9544993879937378,1.3675634321813146,1.00002025895833,6.3653148099435597E-3,1,0,72.531832522878503,1.557008839999322,1.7384613534397741,0.95792166566545278,1.0007645381070114,3.9090953578083641E-2,1.0360354904645754,0.26452079007878065,1.0014663157091639,5.4120720864117608E-2,1.0073781714204464,0.14299746422927287,11.472741555012389,-119.64808294185633,60.35191705814367,null,1000000000,116154506.25,null,13.519393459490093,-36.564913348696408,null,-2.3414176340130979,-86.184058486422757,11.177975825476995,-122.74897183511916,0,0]
[10840,10.84,4.9820638796384884,1.3687034756028118,1.0000204946054212,6.4022270192700412E-3,1,0,72.952373494876113,1.5570883242858491,1.7452135672858609,0.96063976981492083,1.0007734276760636,3.9317413772208168E-2,1.0364472790223269,0.26598363464494351,1.0014833590667951,5.4433955512605221E-2,1.0074637246590319,0.14382017359992144,11.410497677833,-119.60227188732406,60.397728112675935,null,1000000000,117505600,null,13.502771581660104,-36.42670678000362,null,-2.390343471825739,-86.294401023959395,11.112428109834365,-122.72110780396301,0,0]
[10902.5,10.9025,5.0096347752050683,1.3698309718496973,1.0000207316150505,6.4391392111500792E-3,1,0,73.372914922485407,1.5571668974345996,1.7519785754851487,0.96333690264243133,1.0007823685680863,3.9543869931599605E-2,1.036861283723906,0.26744531414875744,1.0015005006825626,5.4747179469217519E-2,1.0075497664111386,0.14464277063895972,11.348742348650392,-119.5568852428307,60.443114757169297,null,1000000000,118864506.25,null,13.486371257777542,-36.289649344028795,null,-2.4390186597021586,-86.404018226217588,11.047352598075383,-122.69366757024639,0,0]
[10965,10.965,5.0372119695389683,1.3709461241073522,1.0000209699872176,6.4760513854831012E-3,1,0,73.793456797916946,1.5572445750220565,1.7587562303982445,0.96601326712912727,1.0007913607817043,3.9770322033139967E-2,1.037277501915749,0.26890582374321936,1.0015177405514208,5.5060392673044745E-2,1.0076362965713794,0.14546525473543104,11.287469213543059,-119.51192387971062,60.488076120289378,null,1000000000,120231225,null,13.470188729584731,-36.153730301951285,null,-2.4874457500329616,-86.51292169986263,10.982742979551769,-122.66665200181392,0,0]
[11028.75,11.02875,5.0653470900592179,1.3720710688662623,1.000021214530513,6.513701785121547E-3,1,0,74.222409964309392,1.5573228993399959,1.7656823160193418,0.96872197186107611,1.0008005857096678,4.0001298972340636E-2,1.0377043220468354,0.27039433329117568,1.0015354264327285,5.537985900027495E-2,1.0077250603830075,0.14630407152743652,11.225460898767135,-119.46650215479761,60.53349784520239,null,1000000000,121633326.5625,null,13.45390310512375,-36.016254609338631,null,-2.5365884015435936,-86.623279739829997,10.917314703580157,-122.63953434916863,0,0]
[11092.5,11.092499999999999,5.0934885499585123,1.3731835844089608,1.0000214604913904,6.5513521662927095E-3,1,0,74.651363580801188,1.5574003235409042,1.7726212553033323,0.97140948969298457,1.000809864029703,4.0232271641176064E-2,1.0381334394850141,0.27188161556705348,1.0015532145258581,5.5699314012339324E-2,1.0078143321111963,0.14714276953196068,11.163941256749917,-119.42152423397388,60.578475766026116,null,1000000000,123043556.25,null,13.437836415068645,-35.879941019099725,null,-2.5854781827362898,-86.732918833201737,10.852358232332355,-122.61285985230145,0,0]
[11156.25,11.15625,5.1216362447393609,1.3742838728855646,1.0000217078698486,6.5890025288898625E-3,1,0,75.080317639677759,1.5574768630516775,1.779572897892594,0.97407602986483044,1.0008191957403254,4.0463240015121318E-2,1.03856485138266,0.27336766551644742,1.0015711048253637,5.601875764464076E-2,1.0079041116423084,0.14798134810263838,11.102903895357962,-119.37699056018462,60.623009439815377,null,1000000000,124461914.0625,null,13.421984908437787,-35.74477842515779,null,-2.6341176884238866,-86.841850525298469,10.787867220013901,-122.58662895045626,0,0]
[11220,11.22,5.1497900721660184,1.3753721321454777,1.0000219566658868,6.6266528728062745E-3,1,0,75.50927213339979,1.5575525329487043,1.786537095496614,0.97672179955622085,1.0008285808400414,4.0694204069654231E-2,1.0389985548816636,0.27485247811509572,1.0015890973257684,5.6338189832596045E-2,1.0079943988621025,0.14881980659377989,11.042342535512084,-119.33290142796798,60.667098572032018,null,1000000000,125888400,null,13.406344910452736,-35.61075581940414,null,-2.6825094764312474,-86.950086115066881,10.723835434021488,-122.56084193447103,0,0]
[11285.5,11.285500000000001,5.1787230321056512,1.3764779396434594,1.0000222137681041,6.6653367360061302E-3,1,0,75.950002293688584,1.5576293897957052,1.7937053901592621,0.97941878024994911,1.0008382791759507,4.0931503789249514E-2,1.0394465477766364,0.27637675625961328,1.0016076901798381,5.6666378759516016E-2,1.0080876932186769,0.14968115584533484,10.980608005152742,-119.28806517900722,60.711934820992781,null,1000000000,127362510.25,null,13.390492092962409,-35.474230053441524,null,-2.7319743053388561,-87.060579472485657,10.658517787623554,-122.53480952592719,0,0]
[11351,11.351000000000001,5.2076622542704323,1.3775714584185126,1.000022472366795,6.7040205792571299E-3,1,0,76.390732897435413,1.5577053598035226,1.8008866277861348,0.98209427124873194,1.0008480338691275,4.1168798896557751E-2,1.0398969536623965,0.27789971753260728,1.001626390911029,5.6994555466967453E-2,1.0081815232731428,0.15054237695450798,10.91936288573471,-119.24369838975332,60.75630161024668,null,1000000000,128845201,null,13.374854930207814,-35.338884479896748,null,-2.7811829869863569,-87.170361397069527,10.593671943221457,-122.50924587696628,0,0]
[11416.5,11.416499999999999,5.2366076348389941,1.3786528896114703,1.0000227324619584,6.7427044024435138E-3,1,0,76.831463937008806,1.5577804582328922,1.8080806541587282,0.98474849053044455,1.0008578449179237,4.1406089364990489E-2,1.0403497694049255,0.27942135658430278,1.0016451995132982,5.7322719884947526E-2,1.0082758888996022,0.15140346922321218,10.858600723787859,-119.19980093238732,60.800199067612681,null,1000000000,130336472.25,null,13.359429676118072,-35.20470748240988,null,-2.8301381779241233,-87.279443373348542,10.529291498193949,-122.48415085575843,0,0]
[11482,11.481999999999999,5.265559072250988,1.3797224300539712,1.0000229940535932,6.7813882054495222E-3,1,0,77.272195404951418,1.5578546999964247,1.815287317230748,0.98738165381957477,1.0008677123206822,4.1643375167962425E-2,1.0408049918589046,0.28094166809870164,1.0016641159805699,5.765087194346924E-2,1.0083707899714884,0.15226443195412789,10.798315181294484,-119.15637254139828,60.843627458601716,null,1000000000,131836324,null,13.344212661833382,-35.071687553784606,null,-2.8788424963166865,-87.387836638998024,10.465370165516696,-122.45952419278262,0,0]
[11548.75,11.54875,5.2950691464778714,1.3808003476993529,1.0000232621770155,6.8208102280893261E-3,1,0,77.721338211935418,1.5579294923307558,1.8226443575834266,0.99004362676134727,1.000877826008338,4.1885184498567388E-2,1.04127137454025,0.28248962194180677,1.0016835044151808,5.7985273657900911E-2,1.0084680528713628,0.15314169128082217,10.737363056683771,-119.11259753207942,60.88740246792058,null,1000000000,133373626.5625,null,13.328915765152875,-34.937307678077133,null,-2.9282208582441833,-87.497601312307438,10.400694906908692,-122.43490899038457,0,0]
[11615.5,11.615500000000001,5.3245853048798581,1.3818663159743552,1.0000235318545689,6.8602322295284275E-3,1,0,78.170481448688264,1.5580034251985853,1.8300142094774974,0.9926841776398605,1.0008879982178893,4.2126988928205072E-2,1.041740250038022,0.28403618605494085,1.0017030048582121,5.8319662389933836E-2,1.0085658715810066,0.15401881461861022,10.676892981847315,-119.06930869693686,60.930691303063142,null,1000000000,134919840.25,null,13.313827675977752,-34.804105671576274,null,-2.9773440522158867,-87.606673546749803,10.336483623761865,-122.41077921832607,0,0]
[11682.25,11.68225,{"$f":"SQRT(1+(A205/pole1)^2)","v":5.3541074468343082},{"$f":"ATAN(A205/pole1)","v":1.3829205300999947},{"$f":"SQRT(1+(A205/Zero1)^2)","v":1.0000238030862525},{"$f":"ATAN(A205/Zero1)","v":6.8996542096443122E-3},{"$f":"IF(VIN_nom>Vout, 1, SQRT(1+(A205/z_RHP)^2))","v":1},{"$f":"IF(VIN_nom>Vout, 0, -ATAN(A205/z_RHP))","v":0},{"$f":"SQRT(1+(A205/Pole2)^2)","v":78.619625107844314},{"$f":"ATAN(A205/Pole2)","v":1.5580765133291576},1.8373967187505669,0.99530352762621377,{"$f":"SQRT(1+(A205/pole4)^2)","v":1.0008982289475523},{"$f":"ATAN(A205/pole4)","v":4.2368788428749041E-2},{"$f":"SQRT(1+(A205/Zero3)^2)","v":1.0422116149877778},{"$f":"ATAN(A205/Zero3)","v":0.28558135492043935},{"$f":"SQRT(1+(A205/pole5)^2)","v":1.0017226173031222},{"$f":"ATAN(A205/pole5)","v":5.8654038065548475E-2},{"$f":"SQRT((1-(Z205/pterm2))^2+(A205/pterm1)^2)","v":1.008664245964328},{"$f":"IF((ATAN((A205/pterm1)/(1-A205^2/pterm2))>0),ATAN((A205/pterm1)/(1-A205^2/pterm2)),PI()+ATAN((A205/pterm1)/(1-A205^2/pterm2)))","v":0.15489580123196725},{"$f":"20*LOG10(((E205*K205*G205*O205)/(C205*I205*S205*M205*Q205))*Adc)","v":10.616898603068574},{"$f":"((F205+L205+H205+R205)-(D205+J205+T205+N205))*radconv","v":-119.02650535355787},{"$f":"IF(V205>0,V205,V205+180)","v":60.973494646442134},null,{"$f":"IF(U205<0,A205,1000000000)","v":1000000000},{"$f":"A205^2","v":136474965.0625},null,{"$f":"20*LOG10((K205/(I205*M205))*AEA*Afb)","v":13.298944747265843},{"$f":"(L205-(J205+N205))*radconv","v":-34.672069704423564},null,{"$f":"20*LOG10((E205*G205/(C205*S205))*Am)","v":-3.0262147304873892},{"$f":"(F205+H205-(D205+T205))*radconv","v":-87.715064485530021},10.272730016778453,-122.38713418995358,0,0]
[11749,{"$f":"A206/1000","v":11.749000000000001},5.3836354739055361,1.3839631811201283,1.0000240758720647,6.9390761683144654E-3,1,0,79.068769182205273,1.5581487711170807,1.8447917334452966,0.99790189551796804,1.0009085181955319,4.2610582972076289E-2,1.0426854660133111,0.28712512305723814,1.0017423417433327,5.8988400610742772E-2,1.0087631758845172,0.15577265038621255,10.557373680635198,-118.9841866970643,61.015813302935697,null,1000000000,138039001,null,13.284263407613606,-34.54118806358106,null,-3.0748355068017306,-87.822785032567694,{"$f":"AB206+AE206","v":10.209427900811875},-122.36397309614875,{"$f":"SUM((U207<0)*(U206>0))*A206","v":0},0]
[11817.5,11.817500000000001,5.4139436615966341,1.3850213418170885,1.0000243574253436,6.9795316390566303E-3,1,0,79.529688993675492,1.5582220747751936,1.8523934693614239,1.0005467979463736,1.000919138036894,4.2858711514829818E-2,1.0431743212435169,0.28870790251143097,1.0017626997348599,5.933151548628509E-2,1.0088652769035356,0.1566723444134106,10.49676983293355,-118.94126150975855,61.058738490241453,null,1000000000,139653306.25,null,13.269403082333124,-34.408063025566648,null,-3.1244738709273987,-87.932643917555509,10.144929211405724,-122.34070694312216,0,0]
[11886,11.885999999999999,5.444257843804019,1.3860677197817524,1.0000246406153064,7.0199870869524054E-3,1,0,79.990609227567731,1.558294533656047,1.8600080577392246,1.0031700629492812,1.0009298195013094,4.3106834777031242E-2,1.0436657873724207,0.29028919525041452,1.0017831756569222,5.9674616376042794E-2,1.008967962676292,0.15757189211446712,10.436647423174916,-118.89884466882228,61.101155331177722,null,1000000000,141276996,null,13.254747670832568,-34.276129015989206,null,-3.1738545136682648,-88.041819319149482,10.080893157164304,-122.31794833513868,0,0]
[11954.5,11.954499999999999,5.4745779209480379,1.3871025084738589,1.0000249254419522,7.0604425118693864E-3,1,0,80.45152987662162,1.5583661622784961,1.8676353413753106,1.0057719192975423,1.0009405625868051,4.3354952728298597E-2,1.0441598607133222,0.2918689954710938,1.0018037695022886,6.0017703200097479E-2,1.0090712330525824,0.15847129269818869,10.377000066110289,-118.85693494046085,61.143065059539154,null,1000000000,142910070.25,null,13.240293550093135,-34.145373757372845,null,-3.2229801378156786,-88.150322276451732,10.017313412277456,-122.29569603382458,0,0]
[12023,12.023,5.5049037956237532,1.388125897190684,1.000025211905279,7.1008979136751712E-3,1,0,80.912450933742221,1.5584369748306015,1.8752751653638842,1.0083525932027297,1.0009513672913968,4.3603065338253873E-2,1.0446565375669556,0.29344729741112296,1.0018244812636867,6.0360775878550557E-2,1.0091750878814105,0.15937054537433593,10.31782149215257,-118.81553098012424,61.184469019875763,null,1000000000,144552529,null,13.22603717321716,-34.015785099924592,null,-3.2718534064672369,-88.258163590127467,9.9541837667499227,-122.27394869005207,0,0]
[12093,12.093,5.535899630751139,1.3891601114673502,1.0000255063323571,7.1422391761783869E-3,1,0,81.38346556705072,1.5585085093795086,1.8830950812036182,1.0109681276646576,1.0009624722511374,4.385660552140952E-2,1.0451667763472792,0.29505860690024976,1.0018457683771522,6.0711346400654224E-2,1.0092818205356249,0.16028933609226889,10.257824924526894,-118.77374135676956,61.226258643230437,null,1000000000,146240649,null,13.211669286136017,-33.884551424108686,null,-3.3215389181535668,-88.36769385394993,9.8901303679824508,-122.25224527805861,0,0]
[12163,12.163,5.566901321131521,1.3901828078914842,1.0000258024685782,7.1835804142676004E-3,1,0,81.85448061202122,1.5585792206666014,1.8909277727350646,1.0135620113650967,1.0009736415539425,4.4110140062637665E-2,1.045679726060907,0.29666833973572904,1.001867178611912,6.1061901982222264E-2,1.0093891631977552,0.16120797068854206,10.198305016257976,-118.73247672596322,61.267523274036776,null,1000000000,147938569,null,13.197500644391635,-33.754510752864661,null,-3.370966400491878,-88.476555249719127,9.8265342438997578,-122.23106600258379,0,0]
[12233,12.233000000000001,5.5979087694842473,1.3911941757018804,1.0000261003139399,7.2249216278015204E-3,1,0,82.325496061587884,1.5586491228217481,1.8987730818539468,1.0161344775508205,1.0009848751976587,4.4363668929533424E-2,1.0461953827203259,0.29827648990041,1.0018887119600726,6.1412442538056285E-2,1.0094971157041164,0.16212644832297554,10.13925543470905,-118.69173533070958,61.308264669290423,null,1000000000,149646289,null,13.183527697529701,-33.625650529861971,null,-3.4201385715930108,-88.584758571888614,9.7633891259366905,-122.21040910175059,0,0]
[12303,12.303000000000001,5.6289218806543122,1.3921944000606798,1.0000263998684413,7.266262816638858E-3,1,0,82.796511908845673,1.5587182296533182,1.9066308528056211,1.0186857567666372,1.0009961731801191,4.4617192089696306E-2,1.0467137423248589,0.29988305142171195,1.0019103684136961,6.176296798297997E-2,1.009605677890165,0.16304476815644997,10.080669962515291,-118.65151531688865,61.348484683111352,null,1000000000,151363809,null,13.169746970337888,-33.497958335160959,null,-3.469058109382142,-88.692314381397708,9.7006888609557471,-122.19027271655867,0,0]
[12374.5,12.374499999999999,5.6606053078536895,1.3932047419797586,1.0000267076064349,7.3084898624511596E-3,1,0,83.277621356379584,1.5587880103060971,{"$f":"SQRT(1+(A215/Zero2)^2)","v":1.9146697102871737},{"$f":"ATAN(A215/Zero2)","v":1.0212700703156499},1.0010077796814858,4.487614196384801E-2,1.0472459959079614,0.30152239302631967,1.0019326160165714,6.212098899881164E-2,1.0097171956533073,0.16398260249135016,10.021301874370327,-118.61096968174577,61.389030318254228,null,1000000000,153128250.25,null,13.155865847530047,-33.368722947506619,null,-3.5187678544466388,-88.801517227116747,9.6370979930834082,-122.17024017462336,0,0]
[12446,12.446,5.6922944490192302,1.3942038357133586,1.0000270171275982,7.3507168821991351E-3,1,0,83.758731204762057,1.5588569893195758,1.9227212482505809,1.0238327568511736,1.0010194533039074,4.5135085815753859E-2,1.0477810610390332,0.30316006471952739,1.0019549920405024,6.2478994069618821E-2,1.0098293491554757,0.16492027042364396,9.9624052434966153,-118.57096381495583,61.429036185044168,null,1000000000,154902916,null,13.142178173679522,-33.240680420852165,null,-3.5682195457461168,-88.910066066606234,9.5739586279334041,-122.15074648745841,0,0]
[12517.5,12.5175,5.7239892092499804,1.3951918660998586,1.0000273284319297,7.3929438757322176E-3,1,0,84.239841447125102,1.5589251804280493,1.9307853080598059,1.0263740534814956,1.0010311940450356,4.5394023610899774E-2,1.0483189334130072,0.30479606028069839,1.0019774964768857,6.2836983104703537E-2,1.0099421382185618,0.16585777106256394,9.9039738002133184,-118.53149546078141,61.468504539218586,null,1000000000,156687806.25,null,13.128680476752685,-33.113817954833074,null,-3.6174159119975249,-89.01797143929663,9.5112645647551588,-122.1317893941297,0,0]
[12589,12.589,5.7556894957186984,1.3961690139930298,1.0000276415194278,7.4351708428998372E-3,1,0,84.720952076756774,1.5589925970538669,1.9388617334733158,1.0288941944784886,1.0010430019025089,4.5652955314776561E-2,1.0488596087110829,0.30643037353781155,1.0020001293170688,6.3194956013392353E-2,1.010055562663531,0.16679510351851901,9.8460013894302953,-118.49256227989142,61.507437720108584,null,1000000000,158482921,null,13.115369358887017,-32.988122893726491,null,-3.666359641340998,-89.125243656384541,9.4490097175460193,-122.11336655011104,0,{"$f":"IF(AI218>0,W218,0)","v":0}]
[12662.25,12.66225,5.78817129917815,1.3971589778064788,1.0000279641190717,7.4784313097371619E-3,1,0,85.213838536124186,1.5590608743024112,1.9471484960552874,1.0314543205554245,1.0010551683615136,4.5918218155111636E-2,1.0494164194593789,0.3081029364966611,1.0020234492551747,6.3561673678719524E-2,1.0101724219422841,0.16775520234125132,9.7870797789028217,-118.45322864218151,61.546771357818486,null,1000000000,160332575.0625,null,13.101922453026729,-32.860548913742107,null,-3.7162420749173397,-89.234495373179186,9.3856803781093898,-122.09504428692129,0,0]
[12735.5,12.7355,5.8206587118955291,1.3981378918063503,1.0000282885902345,7.5216917485826928E-3,1,0,85.70672538817098,1.5591283662463111,1.9554479125121187,1.0339927315046926,1.0010674052574238,4.6183474529045587E-2,1.0499761627968756,0.30977372083537602,1.0020469039409612,6.3928374226004059E-2,1.0102899477027718,0.16871512276115155,9.7286272253553818,-118.41445147748362,61.585548522516376,null,1000000000,162192960.25,null,13.088664382330489,-32.734173753786806,null,-3.7658649378311337,-89.343103762165157,9.3227994444993545,-122.07727751595196,0,0]
[12808.75,12.80875,5.8531516404697301,1.3991059381250655,1.0000286149329147,7.5649521592745387E-3,1,0,86.199612626161155,1.5591950863560038,1.963759822407021,1.0365096701427174,1.0010797125876567,4.6448724399488862E-2,1.050538834035986,0.31144272007640805,1.0020704933649665,6.4295057557831492E-2,1.0104081397494757,0.16967486382557395,9.6706374680674152,-118.37622802954274,61.623771970457256,null,1000000000,164064076.5625,null,13.075591723681146,-32.608984271178358,null,-3.8152309929072317,-89.451079204188261,9.2603607307739146,-122.06006347536662,0,0]
[12882,12.882,5.885649993546525,1.4000632949548799,1.0000289431471103,7.6082125416508028E-3,1,0,86.692500243511873,1.559261047795611,1.9720840677685432,1.0390053762836384,1.0010920903496145,4.6713967729357375E-2,1.0511044284746676,0.31310992779582292,1.0020942175176755,6.4661723576815058E-2,1.010526997885864,0.17063442458319317,9.6131043615045257,-118.33855547089107,61.661444529108934,null,1000000000,165945924,null,13.062701127878867,-32.484967477702554,null,-3.8643429615421572,-89.558431854414991,9.1983581663367104,-122.04339933211754,0,0]
[12957.25,12.95725,5.9190412284694078,1.401035843140539,1.0000292822716461,7.6526540652209979E-3,1,0,87.198845931526762,1.559328033723534,1.9806482781177919,1.0415473634250259,1.001104879410752,4.6986446348076923E-2,1.0516885048195397,0.31482078428924015,1.0021187297155874,6.5038382824017929E-2,1.0106497947061051,0.17161999619509563,9.55446956981773,-118.30042492515267,61.699575074847331,null,1000000000,167890327.5625,null,13.049644714518173,-32.358772228597267,null,-3.9145341005396865,-89.668077542985856,9.1351106139784868,-122.02684977158313,0,0]
[13032.5,13.032500000000001,5.952437999102413,1.4019974790623873,1.0000296233712871,7.6970955585618887E-3,1,0,87.705192006295022,1.5593942461955648,1.9892251765698177,1.0440674462735677,1.0011177427966163,4.7258917984856978E-2,1.0522756560655915,0.31652973652471,1.0021433840793097,6.5415023591788357E-2,1.010773294062334,0.17260537548859894,9.4963039196068237,-118.26286950198595,61.737130498014054,null,1000000000,169846056.25,null,13.036773507838378,-32.233787287232708,null,-3.9644627801614534,-89.777086987594132,9.0723107276769248,-122.01087427482685,0,0]
[13107.75,13.107749999999999,5.9858402127894568,1.4029483836048384,1.0000299664460317,7.7415370214979603E-3,1,0,88.211538461156621,1.5594596985303497,1.99781459970921,1.0465658751392906,1.0011306805043421,4.7531382599510445E-2,1.0528658770684867,0.31823677771439884,1.0021681805983504,6.5791645774634921E-2,1.0108974957381491,0.17359056143669913,9.4386011107105041,-118.22588593160715,61.774114068392848,null,1000000000,171813110.0625,null,13.024084108434096,-32.10999907270044,null,-4.0141318194151152,-89.885470493320355,9.0099522890189796,-121.9954695660208,0,0]
[13183,13.183,6.0192477789161991,1.403888733715196,1.0000303114958777,7.7859784538536949E-3,1,0,88.717885289603529,1.5595244037425036,2.0064163866822655,1.0490428971305026,1.0011436925310484,4.7803840151856458E-2,1.0534591626685519,0.31994190113019561,1.0021931192621576,6.6168249267097717E-2,1.0110223995160301,0.17457555301388983,9.3813549599139598,-118.18947088476239,61.810529115237614,null,1000000000,173791489,null,13.011573191284638,-31.987394170117614,null,-4.0635439945844327,-89.993238139751099,8.9480291967002046,-121.98063230986871,0,0]
[13259.75,13.25975,6.0533266982441347,1.4048371357278131,1.0000306654583417,7.8313057302546781E-3,1,0,89.23432578854721,1.5595896423368798,2.0152022096468878,1.0515474967138774,1.0011570404866053,4.80817214352229E-2,1.0540674260320755,0.32167903130565068,1.0022187014543658,6.6552340443653185E-2,1.0111505160781333,0.17557997769157416,9.3234318003021706,-118.15291208256006,61.847087917439936,null,1000000000,175820970.0625,null,12.998993369174766,-31.8635505053402,null,-4.11367936980092,-90.102529805716159,8.8853139993738459,-121.96608031105636,0,0]
[13336.5,13.336499999999999,6.0874110013706435,1.4057749180933576,1.0000310214754293,7.8766329744752173E-3,1,0,89.750766662908077,1.5596541301440312,2.0240005642192713,1.0540303367111103,1.0011704657474494,4.8359595287511235E-2,1.054678866497375,0.32341415254120848,1.0022444314923618,6.6936411955768313E-2,1.0112793625514449,0.1765841980220354,9.2659710533918869,-118.11693752944214,61.88306247055786,null,1000000000,177862232.25,null,12.986592457406999,-31.740910130305334,null,-4.1635532399113764,-90.211201304333699,8.8230392174956229,-121.95211143463904,0,0]
[13413.25,13.41325,6.1215005983653175,1.406702256565493,1.0000313795471383,7.9219601863290967E-3,1,0,90.267207906242575,1.5597178800497402,2.0328112876826037,1.0564916692461404,1.0011839683104706,4.8637461666109841E-2,1.0552934785419814,0.32514725789026622,1.0022703093647589,6.7320463691652441E-2,1.0114089387015897,0.17758821292206961,9.2089665176285713,-118.08154352992653,61.918456470073465,null,1000000000,179915275.5625,null,12.974367155348414,-31.619459335234861,null,-4.213168418434579,-90.319262643494525,8.7611987369138351,-121.93872197872939,0,0]
[13490,13.49,6.1555954012760621,1.4076193230767642,1.0000317396734661,7.9672873656300956E-3,1,0,90.783649512253746,1.5597809046466,2.0416342199021176,1.0589317431362406,1.0011975481725419,4.8915320528413991E-2,1.0559112566276712,0.32687834047079267,1.0022963350601064,6.7704495539549797E-2,1.0115392442929914,0.178592021310123,9.1524121067273203,-118.04672634234949,61.953273657650513,null,1000000000,181980100,null,12.962314235018562,-31.499184583010535,null,-4.2625276761137041,-90.426723612250072,8.699786558904858,-121.9259081952606,0,0]
[13568.5,13.5685,6.1904729057808501,1.4085468492587978,1.0000321101365666,8.0136480298085514E-3,1,0,91.31186702853114,1.5598446288089669,2.0506707917110907,1.0614057185558843,1.0012115176328054,4.9199507115088852E-2,1.0565463902186087,0.32864679440700523,1.0023231070804259,6.8097263124132681E-2,1.0116732753540423,0.17961850308294924,9.0950275927411397,-118.01170802334151,61.988291976658488,null,1000000000,184104192.25,null,12.950161524350195,-31.377370050273974,null,-4.3127504928566758,-90.536023750930553,8.6374110314935191,-121.91339380120453,0,0]
[13647,13.647,6.2253556763023399,1.4094639817375378,1.0000324827490457,8.0600086595386516E-3,1,0,91.840084911339659,1.5599076199530546,2.0597198045858898,1.06385797093245,1.0012255679506694,4.9483685748665449E-2,1.0571848241074138,0.33041311792314837,1.0023500337172244,6.8490009667071236E-2,1.0118080689976658,0.18064476653558847,9.0381014430867577,-117.97728507190182,62.022714928098182,null,1000000000,186240609,null,12.938182540157467,-31.256757701692667,null,-4.3627113147540317,-90.644715867426598,8.5754712254034349,-121.90147356911926,0,0]
[13725.5,13.7255,6.2602436248120492,1.4103708927274723,1.000032857510901,8.1063692546211458E-3,1,0,92.368303154391157,1.5599698906538946,2.0687810952718917,1.0662887560194578,1.0012396991227299,4.9767856383580465E-2,1.0578265523185646,0.33217730386507011,1.0023771149580416,6.8882735048903826E-2,1.0119436249679141,0.18167081051621176,8.9816275026818975,-117.94345336034314,62.056546639656858,null,1000000000,188389350.25,null,12.926374052609473,-31.137333601554953,null,-4.4124129728821613,-90.752809762917963,8.5139610797273129,-121.89014336447292,0,0]
[13804,13.804,6.2951366652200029,1.4112677506929585,1.0000332344221299,8.1527298148567854E-3,1,0,92.89652175154049,1.5600314532005295,2.0778545031426239,1.0686983261270571,1.0012539111455634,5.0052018974278314E-2,1.058471568860234,0.3339393451491463,1.0024043507903473,6.927543915020791E-2,1.0120799430075349,0.18269663387482901,8.9255997312778383,-117.91020872711972,62.089791272880277,null,1000000000,190550416,null,12.914732903577249,-31.01908399505427,null,-4.4618582550311467,-90.86031502382319,8.4528746485461035,-121.87939901887746,0,0]
[13884.25,13.88425,6.3308127517125774,1.4121743822292088,1.0000336219576178,8.200123854538206E-3,1,0,93.436516282284529,1.5600936686565894,2.0871425452559449,1.0711399422849561,1.0012685235678183,5.0342508037157986E-2,1.0591343576027556,0.33573844339844755,1.00243235357713,6.9676875679792569E-2,1.0122200874570371,0.18374509665710034,8.8687779599673959,-117.87682546205933,62.12317453794067,null,1000000000,192772398.0625,null,12.903001998672394,-30.899398174229372,null,-4.5121436664478587,-90.969618198501564,8.3908583322245356,-121.86901637273094,0,0]
[13964.5,13.964499999999999,6.3664939836874348,1.4130708520009367,1.0000340117393747,8.2475178573806762E-3,1,0,93.976511170542778,1.5601551691251114,2.0964429195546557,1.0735599094552144,1.0012832204785416,5.0632988596908138E-2,1.0598005702088467,0.33753528555670526,1.0024605178981365,7.0078289717189615E-2,1.0123610277844066,0.18479332644652438,8.8124100622428276,-117.84404685475221,62.155953145247793,null,1000000000,195007260.25,null,12.891439523269018,-30.780911296066634,null,-4.562166900765007,-91.078325799563629,8.3292726225040106,-121.85923709563026,0,0]
[14044.75,14.044750000000001,6.4021802751127197,1.4139573284826423,1.0000344037673974,8.2949118231713265E-3,1,0,94.516506410187603,1.5602159668603071,2.1057554626381085,1.0759584863279898,1.001298001874013,5.0923460604883383E-2,1.0604702002256499,0.33932986428415701,1.0024888437397521,7.0479681134937952E-2,1.0125027637105906,0.18584132202048667,8.7564899398221812,-117.81186837281389,62.18813162718611,null,1000000000,197255002.5625,null,12.880042323890287,-30.663609238039214,null,-4.6119308015370759,-91.186447409848739,8.2681115223532107,-121.85005664788795,0,0]
[14125,14.125,6.4378715418520747,1.4148339764763884,1.0000347980416839,8.3423057516972855E-3,1,0,95.056501995230533,1.5602760738379546,2.1150800137714931,1.0783359280250411,1.0013128677504908,5.1213924012446989E-2,1.0611432411835364,0.34112217231783487,1.002517331088286,7.0881049805620031E-2,1.0126452949551243,0.18688908215841718,8.7010116085203819,-117.78028546206102,62.219714537938984,null,1000000000,199515625,null,12.868807317615641,-30.547478066121933,null,-4.6614381686296325,-91.293992401898279,8.2073691489860074,-121.84147046802022,0,0]
[14207.25,14.20725,6.4744573873264644,1.4157224421075041,1.0000352044730514,8.3908807984284083E-3,1,0,95.609955766462704,1.5603369742596376,2.1246492477256544,1.0807509519974017,1.0013281917775763,5.1511617407965504E-2,1.0618365884733931,0.34295678466123014,1.0025466959822034,7.1292397696066004E-2,1.0127922033821373,0.18796270911310625,8.6446029395151118,-117.74852867424971,62.251471325750288,null,1000000000,201845952.5625,null,12.857457464606242,-30.429653297233248,null,-4.7119160452407192,-91.403628881036738,8.1455414193655216,-121.83328217826998,0,0]
[14289.5,14.2895,6.511048286113545,1.4166009223973601,1.0000356132640353,8.4394558055614771E-3,1,0,96.163409888217188,1.5603971736750064,2.1342307621953962,1.0831443055833829,1.0013436045410049,5.1809301665621886E-2,1.0625335050241511,0.34478899651744399,1.0025762305041728,7.1703721420617081E-2,1.0129399466624027,0.18903608616073961,8.5886459838389477,-117.71738777019674,62.282612229803263,null,1000000000,204189810.25,null,12.846271651598332,-30.31302946176174,null,-4.7621302606669094,-91.512678925912581,8.084141390931423,-121.82570838767433,0,0]
[14371.75,14.37175,6.5476441534934136,1.4174695834077455,1.0000360244146327,8.4880307728673124E-3,1,0,96.716864354476499,1.5604566841179774,2.1438243925227352,1.0855162521044117,1.0013591060366793,5.2106976733080179E-2,1.063233983817194,0.34661880031746795,1.0026059346392038,7.211502084223359E-2,1.0130885244893622,0.1901092119939409,8.5331346544399516,-117.68685779678711,62.313142203212891,null,1000000000,206547198.0625,null,12.835246778315234,-30.197592158994976,null,-4.8120836920617354,-91.621151976271463,8.0231630862534988,-121.81874413526644,0,0]
[14454,14.454000000000001,6.5842449066183217,1.418328587568036,1.0000364379248405,8.5366057001167363E-3,1,0,97.270319159360099,1.5605155173486014,2.1534299767775571,1.0878670511560586,1.001374696260479,5.2404642558014171E-2,1.0639380178165623,0.34844618857667636,1.0026358083722211,7.252629582392503E-2,1.0132379365549138,0.19118208530762937,8.4780629787187429,-117.65693379069768,62.343066209302322,null,1000000000,208918116,null,12.824379814552627,-30.083327186005558,null,-4.8617791720577799,-91.729057263868597,7.9626006424948468,-121.81238444987416,0,0]
[14622.5,14.6225,6.6592413062135583,1.4200588809446169,1.0000372924236673,8.6361177350554475E-3,1,0,98.404145537683817,1.5606339783799581,2.17314494720299,1.0926180098309894,1.0014069119546776,5.3014421274742742E-2,1.0653913968758628,0.35218226078477555,1.0026975382145327,7.3368770105069564E-2,1.0135466307491461,0.19337921409844069,8.3665897248875574,-117.59750184824115,62.402498151758849,null,1000000000,213817506.25,null,12.802598107299016,-29.852842369066543,null,-4.9627931188065997,-91.948380359064174,7.8398049884924159,-121.80122272813071,0,0]
[14706.75,14.70675,6.6967468568641211,1.4209094932855246,1.0000377233867064,8.6858736885061637E-3,1,0,98.971059235787095,1.5606921910655478,2.1830205773909803,1.0949612831400006,1.0014231594274807,5.3319295864031065E-2,1.0661236516001003,0.35404646401704321,1.0027286699900653,7.3789968197954581E-2,1.0137022894751919,0.1944773755279082,8.3115204838673371,-117.56871837887034,62.431281621129656,null,1000000000,216288495.5625,null,12.791943409652317,-29.739386066530329,null,-5.0129058394213422,-92.057186065318405,7.7790375702309751,-121.79657213184873,0,0]
[14791,14.791,6.7342571989146194,1.4217506302741636,1.0000381568254917,8.7356295989493831E-3,1,0,99.537973265454937,1.5607497406558892,2.1929080863897346,1.0972834381356333,1.0014394999780543,5.3624160532340093E-2,1.066859606280957,0.35590810173472337,1.0027599796464548,7.4211140063014255E-2,1.0138588221706497,0.19557526645590698,8.2568881972916675,-117.54054944765879,62.45945055234121,null,1000000000,218773681,null,12.781442165590738,-29.627101193233084,null,-5.0627595526341054,-92.165433377749267,7.7186826129566324,-121.79253457098235,0,0]
[14877.25,14.87725,6.7726628744312203,1.4226020826295207,1.0000386031182225,8.7865666137937407E-3,1,0,100.11834553252056,1.560807981275246,2.2030424518522738,1.0996391131362071,1.0014563248484543,5.3936252008406876E-2,1.0676168564552218,0.35781126712302147,1.0027922168063996,7.4642282750660052E-2,1.0140199757575483,0.19669893841560324,8.2014055451843895,-117.51234283319985,62.487657166800147,null,1000000000,221332567.5625,null,12.770847564365331,-29.513349423751745,null,-5.1135313726220266,-92.275681189169887,7.6573161917433046,-121.78903061292164,0,0]
[14963.5,14.9635,6.81107340455873,1.42344393218795,1.0000390520056304,8.8375035830420747E-3,1,0,100.69871813527008,1.560865550560335,2.2131889304493075,1.1019732015637391,1.0014732472585084,5.4248332967728519E-2,1.0683779680890046,0.35971172775962329,1.0028246403573855,7.5073397638834916E-2,1.014182044578563,0.19782232393347962,8.1463685786362205,-117.48476895484771,62.515231045152291,null,1000000000,223906332.25,null,12.760407703428797,-29.400795406615941,null,-5.164037665734968,-92.385362391559482,7.5963700376938288,-121.78615779817542,0,0]
[15049.75,15.04975,6.849488707626155,1.4242763393176761,1.0000395034877123,8.8884405064301262E-3,1,0,101.27909106793263,1.5609224600518772,2.2233473563421682,1.1042859736965647,1.0014902672032719,5.4560403350049719E-2,1.0691429329355078,0.36160947570770235,1.0028572502813338,7.5504484569988983E-2,1.0143450282657778,0.19894542152395139,8.0917712705547657,-117.45782209692356,62.542177903076436,null,1000000000,226494975.0625,null,12.750119609788262,-29.289424313799945,null,-5.2142813585322942,-92.494486088237906,7.5358382512559681,-121.78391040203785,0,0]
[15136,15.135999999999999,6.887908703774456,1.4250994608618701,1.0000399575644645,8.9393773836936412E-3,1,0,101.85946432486891,1.5609787210275847,2.2335175665157303,1.1065776958110767,1.0015073846777727,5.4872463095127513E-2,1.0699117427298284,0.36350450313122978,1.0028900465600639,7.5935543386634344E-2,1.0145089264494465,0.20006822970430638,8.0376077079537964,-117.43149655616459,62.568503443835411,null,1000000000,229098496,null,12.73998037885449,-29.179221531503902,null,-5.2642653317563868,-92.603061180718925,7.4757150470981033,-121.78228271222282,0,0]
[15224,15.224,6.927112991931244,1.4259298724873857,1.0000404235285372,8.991347715002658E-3,1,0,102.45161359956786,1.5610354665789665,2.2439061078785558,1.1088944938132934,1.00152494997627,5.5190843461535868E-2,1.0707001057286045,0.36543516847759339,1.0029237003163749,7.6375319184896248E-2,1.014677092235146,0.20121351968662185,7.9827861909861362,-117.40527132638829,62.594728673611712,null,1000000000,231770176,null,12.729785903943618,-29.06797191574076,null,-5.3149987372821847,-92.713282863906883,7.4147871666614336,-121.78125477964764,0,0]
[15312,15.311999999999999,6.9663220031437865,1.4267509369523654,1.0000408921936319,9.0433179977406769E-3,1,0,103.04376320037532,1.5610915599444162,2.2543065824812198,1.1111899264714982,1.0015426167918362,5.5509212628007676E-2,1.071492453846969,0.36736298562101438,1.0029575480278514,7.6815065385181791E-2,1.0148462092203656,0.2023585052863843,7.9284041149318725,-117.37968093737912,62.620319062620879,null,1000000000,234457344,null,12.719740494959822,-28.957908434808253,null,-5.365467693691393,-92.822951557192368,7.3542728012684293,-121.78085999200061,0,0]
[15400,15.4,7.0055356581092187,1.4275628101032447,1.0000413635597445,9.0952882316270266E-3,1,0,103.63591312170139,1.5611470123028639,2.2647188259174165,1.1134642641156554,1.0015603851190991,5.5827570530598204E-2,1.0722887782507287,0.36928794656191682,1.0029915896748576,7.7254781820422766E-2,1.0150162770065336,0.20350318493810957,7.8744555493966875,-117.35471938644876,62.645280613551236,null,1000000000,237160000,null,12.709841275490955,-28.849016236782067,null,-5.415675119059129,-92.932076100238788,7.2941661564318263,-121.78109233702085,0,0]
[15488,15.488,7.044753879281104,1.4283656443651498,1.0000418376268718,9.1472584163810444E-3,1,0,104.22806335808316,1.5612018345792129,2.2751426766061278,1.1157177730028729,1.0015782549526562,5.6145917105376399E-2,1.0730890700876461,0.37121004340907876,1.0030258252376469,7.7694468323619661E-2,1.0151872951931165,0.20464755707947868,7.8209346761734357,-117.33038069386301,62.669619306136994,null,1000000000,239878144,null,12.700085435636232,-28.741280688541512,null,-5.4656238856908654,-93.040665136864433,7.2344615499453671,-121.78194582540594,0,0]
[15578.25,15.578250000000001,7.0849795024542468,1.4291797732955238,1.0000423266205167,9.2005573329412508E-3,1,0,104.83535412102181,1.5612574152923386,2.2858449360734014,1.118007540307147,1.0015966871121458,5.6472391390342033E-2,1.0739139355302096,0.37317830175115352,1.0030611375370093,7.8145365546618994E-2,1.0153636727432376,0.20582086769800639,7.7664836272754485,-117.3060604175117,62.693939582488298,null,1000000000,242681873.0625,null,12.690226206880567,-28.63197682474717,null,-5.5165840495915299,-93.151483232208989,7.173642157289037,-121.78346005695616,0,0]
[15668.5,15.6685,7.1252097685694213,1.4299847093061884,1.0000428184550536,9.2538561972266113E-3,1,0,105.44264520408899,1.5613123557775461,2.2965590685665753,1.1202759545187591,1.001615226023342,5.6798853624667869E-2,1.0747429549636951,0.37514353120442928,1.00309665375265,7.859623093182605E-2,1.0155410490554666,0.20699385156198152,7.712470375862428,-117.28238260045042,62.717617399549582,null,1000000000,245501892.25,null,12.680512003966726,-28.523859030234838,null,-5.5672781344154911,-93.2617558933905,7.1132338695512347,-121.78561492362533,0,0]
[15758.75,15.758749999999999,7.1654445994234743,1.430780606203228,1.0000433131304785,9.3071550089343924E-3,1,0,106.04993660178505,1.561366667033232,2.3072849086845304,1.122523289920101,1.001633871680317,5.7125303739437867E-2,1.0755761187828154,0.37710572361028155,1.0031323738629097,7.9047064299328826E-2,1.0157194236913596,0.20816650699661754,7.6588889961111626,-117.25934088047578,62.740659119524224,null,1000000000,248338201.5625,null,12.670940002335149,-28.416912215994138,null,-5.6177090944666102,-93.371491836907623,7.0532309078685387,-121.78840405290177,0,0]
[15849,15.849,7.2056839185511459,1.4315676144034717,1.0000438106467868,9.3604537677618466E-3,1,0,106.65722830873568,1.5614203598073142,2.3180222939084145,1.1247498165715255,1.0016526240771102,5.7451741665751427E-2,1.0764134173640778,0.37906487092882779,1.0031682978460077,7.9497865469292953E-2,1.0158987962103272,0.20933883233068731,7.6057336747401614,-117.23692892894816,62.76307107105184,null,1000000000,251190801,null,12.661507443385268,-28.311121520569259,null,-5.6678798373955619,-93.480699585272916,6.9936276059897065,-121.79182110584217,0,0]
[15941.25,15.94125,7.2468195284725665,1.4323630300309798,1.0000443221243978,9.4149336075527081E-3,1,0,107.27797831779445,1.5614746141916624,2.3290093921933233,1.1270044557890972,1.0016719023474074,5.778540100521122E-2,1.0772735342217794,0.38106427895117423,1.0032052286054869,7.9958623230014472E-2,1.0160831745813486,0.21053679428284369,7.5518347843390536,-117.21466461895558,62.785335381044419,null,1000000000,254123451.5625,null,12.652007159932236,-28.204166028144911,null,-5.7188964458184319,-93.591790242802077,6.9331107141138038,-121.79595627094699,0,0]
[16033.5,16.0335,7.2879596715956954,1.4331494659939104,1.0000448365701899,9.4694133914539312E-3,1,0,107.89872863899666,1.561528244316235,2.3400082185464628,1.1292379111448578,1.0016912921280903,5.8119047464498322E-2,1.0781379507417261,0.38306048882021254,1.0032423723274364,8.0419346970647176E-2,1.0162685946153016,0.21173440782233308,7.4983691109840542,-117.1930450423619,62.806954957638098,null,1000000000,257073122.25,null,12.642646942849661,-28.098387776167478,null,-5.7696471742941196,-93.702346444075772,6.8729997685555411,-121.80073422024324,0,0]
[16125.75,16.12575,7.329104271582457,1.4339270725430544,1.0000453539841594,9.5238931191422051E-3,1,0,108.51947926698577,1.5615812608933499,2.3510186083647362,1.1314504578263307,1.0017107934126832,5.8452680970079822E-2,1.0790066565902494,0.38505349233223773,1.0032797289882034,8.0880036499388172E-2,1.0164550558347396,0.21293167117596534,7.445330793388651,-117.17206355978897,62.827936440211033,null,1000000000,260039813.0625,null,12.633424048282905,-27.993771607110752,null,-5.8201349830568017,-93.812376696252429,6.8132890652261029,-121.80614830336319,0,0]
[16218,16.218,7.370253253791236,1.4346959966169908,1.000045874366301,9.5783727902942258E-3,1,0,109.1402301965271,1.5616336743916275,2.3620403999427118,1.1336423667116549,1.0017304061946746,5.8786301448440076E-2,1.0798796414157377,0.38704328141176336,1.0033172985640024,8.1340691624521164E-2,1.0166425577598999,0.21412858257449877,7.3927140816068837,-117.15171357525159,62.848286424748409,null,1000000000,263023524,null,12.624335796858599,-27.890302596396214,null,-5.8703627854406717,-93.92188931694092,6.7539730114179273,-121.81219191333713,0,0]
[16312.5,16.3125,7.4124103372741166,1.4354748224360143,1.0000464105183318,9.6341811749539388E-3,1,0,109.77612169996956,1.5616867516398039,2.3733426719460509,1.1358666165105882,1.0017506129400915,5.912804542710802E-2,1.0807783445126615,0.38907826063549544,1.0033560052138528,8.1812546367689407E-2,1.016835711488689,0.21535432015253905,7.3392452949565898,-117.13151519131613,62.868484808683874,null,1000000000,266097656.25,null,12.615162755098828,-27.785484060175097,null,-5.9215490570631086,-94.033544754584227,6.693613698035719,-121.81902881475932,0,0]
[16407,16.407,7.454571866045443,1.4362448389596845,1.0000469497850795,9.6899894995990856E-3,1,0,110.41201350911048,1.5617392175164779,2.3846565742228449,1.1380697714049475,1.0017709366741798,5.9469775579214061E-2,1.0816815158165973,0.39110984996861287,1.0033949352405422,8.2284364601567531E-2,1.0170299562818337,0.21657968465185512,7.286207062742001,-117.11196561915852,62.888034380841475,null,1000000000,269189649,null,12.606125512505823,-27.681838351746201,null,-5.9724685265650894,-94.14467408438496,6.6336569859407337,-121.82651243613117,0,0]
[16501.5,16.5015,7.4967377651045313,1.437006193912485,1.0000474921665392,9.7457977638821247E-3,1,0,111.04790561869827,1.5617910825240233,2.3959819420175461,1.1402521089895647,1.0017913773898197,5.9811491825788016E-2,1.082589144144477,0.39313804114622058,1.003434088618071,8.2756146120351939E-2,1.0172252916160922,0.21780467418355678,7.2335935498933477,-117.09305791855911,62.906942081440889,null,1000000000,272299502.25,null,12.597221387966155,-27.579350163314253,null,-6.0231241788024565,-94.255285662127037,6.574097209163698,-121.8346358254413,0,0]
[16596,16.596,7.5389079611209544,1.4377590317542903,1.0000480376627059,9.8016059674555182E-3,1,0,111.68379802360099,1.5618423569256377,2.4073186135096094,1.1424139024313293,1.00181193507985,6.0153194087879093E-2,1.0835012182956079,0.395162826042876,1.0034734653202957,8.3227890718336417E-2,1.0174217169657047,0.21902928686317105,7.181399032404002,-117.07478520249728,62.925214797502719,null,1000000000,275427216,null,12.588447763895832,-27.478004427083729,null,-6.0735189510921215,-94.365387656799186,6.5149288128037108,-121.84339208388292,0,0]
[16692.5,16.692499999999999,7.5819750078774293,1.4385191600819307,1.0000485979180438,9.8585952340187553E-3,1,0,112.3331487683633,1.5618941174354304,2.4189067144637222,1.1446005265199739,1.0018330485598443,6.0502113630281011E-2,1.0844371719013775,0.39722694005105541,1.003513905828942,8.3709581014141235E-2,1.0176234237796888,0.22027942641760334,7.1285264241900483,-117.05677394664136,62.943226053358643,null,1000000000,278639556.25,null,12.579620471442322,-27.375677371231671,null,-6.1247140630965671,-94.477302277808917,6.4549064083457548,-121.85297964904059,0,0]
[16789,16.789000000000001,7.62504638597352,1.4392707014101074,1.0000491614213125,9.9155844365429614E-3,1,0,112.98249981062359,1.5619452829728449,2.4305062706805747,1.1467662896176403,1.0018542840027005,6.0851018423664409E-2,1.0853777378440379,0.39928748538849645,1.0035545791596476,8.4191232376585462E-2,1.0178262661193833,0.22152916904213604,7.0760790127105526,-117.03941049621346,62.960589503786537,null,1000000000,281870521,null,12.570923939944613,-27.274510627657726,null,-6.1756431791346378,-94.588702161251248,6.3952807608099755,-121.86321278890898,0,0]
[16885.5,16.8855,7.6681220224226045,1.4400137995949012,1.0000497281725063,9.9725735746580713E-3,1,0,113.6318511452817,1.5619958637375528,2.4421171189297155,1.1489114688069579,1.0018756414006631,6.1199908384022318E-2,1.0863229041431539,0.40134445384999329,1.0035954852841062,8.4672844586941687E-2,1.0180302434168582,0.22277851274446792,7.0240510440039658,-117.02268769588241,62.977312304117589,null,1000000000,285120110.25,null,12.562355576030411,-27.174488900281542,null,-6.2263092797708177,-94.699595435343269,6.3360462962595934,-121.87408433562481,0,0]
[16982,16.981999999999999,{"$f":"SQRT(1+(A269/pole1)^2)","v":7.7112018458617788},{"$f":"ATAN(A269/pole1)","v":1.4407485953154719},{"$f":"SQRT(1+(A269/Zero1)^2)","v":1.0000502981716195},{"$f":"ATAN(A269/Zero1)","v":1.0029562647994017E-2},{"$f":"IF(VIN_nom>Vout, 1, SQRT(1+(A269/z_RHP)^2))","v":1},{"$f":"IF(VIN_nom>Vout, 0, -ATAN(A269/z_RHP))","v":0},{"$f":"SQRT(1+(A269/Pole2)^2)","v":114.28120276735335},{"$f":"ATAN(A269/Pole2)","v":1.5620458696974187},2.4537390989128438,1.1510363366864784,{"$f":"SQRT(1+(A269/pole4)^2)","v":1.0018971207459331},{"$f":"ATAN(A269/pole4)","v":6.1548783427369337E-2},{"$f":"SQRT(1+(A269/Zero3)^2)","v":1.0872726588014541},{"$f":"ATAN(A269/Zero3)","v":0.40339783737987445},{"$f":"SQRT(1+(A269/pole5)^2)","v":1.0036366241738528},{"$f":"ATAN(A269/pole5)","v":8.5154417426590689E-2},{"$f":"SQRT((1-(Z269/pterm2))^2+(A269/pterm1)^2)","v":1.0182353551014813},{"$f":"IF((ATAN((A269/pterm1)/(1-A269^2/pterm2))>0),ATAN((A269/pterm1)/(1-A269^2/pterm2)),PI()+ATAN((A269/pterm1)/(1-A269^2/pterm2)))","v":0.22402745553717518},{"$f":"20*LOG10(((E269*K269*G269*O269)/(C269*I269*S269*M269*Q269))*Adc)","v":6.9724368734634004},{"$f":"((F269+L269+H269+R269)-(D269+J269+T269+N269))*radconv","v":-117.00659845220444},{"$f":"IF(V269>0,V269,V269+180)","v":62.993401547795557},null,{"$f":"IF(U269<0,A269,1000000000)","v":1000000000},{"$f":"A269^2","v":288388324},null,{"$f":"20*LOG10((K269/(I269*M269))*AEA*Afb)","v":12.553912848081518},{"$f":"(L269-(J269+N269))*radconv","v":-27.075597136661152},null,{"$f":"20*LOG10((E269*G269/(C269*S269))*Am)","v":-6.2767152980059491},{"$f":"(F269+H269-(D269+T269))*radconv","v":-94.809990046557289},6.2771975500755692,-121.88558718321843,0,0]
[17081,{"$f":"A270/1000","v":17.081},7.7554020048701275,1.4414939435056773,1.0000508863127677,1.0088028054487478E-2,1,0,114.94737726388107,1.5620965840241701,2.4656735695181977,1.1531954266151438,1.0019192832698196,6.1906681094573215E-2,1.0882517741134472,0.4055006836422515,1.0036790706966259,8.5648425103637196E-2,1.0184469588095835,0.22530833565923833,6.9199097615333311,-116.99074340903817,63.009256590961826,null,1000000000,291760561,null,12.545379366734144,-26.975302138756877,null,-6.3281599202704433,-94.922734556269418,{"$f":"AB270+AE270","v":6.2172194464637007},-121.89803669502629,{"$f":"SUM((U271<0)*(U270>0))*A270","v":0},0]
[17180,17.18,7.7996064235116291,1.4422308435511464,1.0000514778722895,1.0146493392012805E-2,1,0,115.6135520526399,1.5621467139108116,2.4776194235146756,1.1553337063068472,1.0019415741246016,6.2264562882846014E-2,1.0892356929700702,0.4075997401232625,1.003721762140086,8.6142390877823827E-2,1.0186597552173093,0.22658878960826537,6.867806471919474,-116.975540252728,63.024459747272005,null,1000000000,295152400,null,12.536972909442882,-26.876165083855117,null,-6.3793369142207208,-95.034970608978156,6.1576359952221615,-121.91113569283327,0,0]
[17279,17.279,7.8438150297698206,1.4429594374887567,1.0000520728501789,1.0204958660170439E-2,1,0,116.27972712860721,1.5621962694019897,2.4895764970378731,1.157451455911876,1.0019639933017139,6.2622428701576027E-2,1.0902244023658405,0.40969499861170083,1.0037646984729829,8.6636314513455132E-2,1.0188737436997104,0.2278688152544599,6.8161212512576084,-116.96098153178148,63.039018468218515,null,1000000000,298563841,null,12.528690934223787,-26.778170490850918,null,-6.4302492970854761,-95.146706220791629,6.0984416371383112,-121.92487671164255,0,0]
[17378,17.378,7.8880277532359635,1.4436798642066235,1.0000526712464297,1.0263423858560806E-2,1,0,116.9459024868748,1.5622452603134878,2.5015446292039503,1.1595489509633903,1.0019865407925435,6.2980278460176023E-2,1.0912178892792042,0.41178645105943512,1.0038078796638918,8.7130195774958119E-2,1.0190889236288849,0.22914841047351062,6.7648484558235573,-116.94705986603319,63.052940133966814,null,1000000000,301994884,null,12.52053096018799,-26.681303130069786,null,-6.4809000376358972,-95.257949227721539,6.0396309225520932,-121.93925235779133,0,0]
[17479.25,17.47925,7.9332494982163251,1.4444083580397273,1.0000532867783685,1.0323217738879915E-2,1,0,117.62721848119227,1.5622947906790796,2.5137960382579987,1.1616734484828175,1.0020097334385056,6.3346244461669962E-2,1.0922388834749341,0.41392149152485164,1.0038522954812541,8.763525753555991E-2,1.0193102257255073,0.2304566399819693,6.7128311915432413,-116.93347312005395,63.066526879946053,null,1000000000,305524180.5625,null,12.5123092007107,-26.583384576745733,null,-6.5324343461473457,-95.371218942375293,5.979874854563354,-121.95460351912102,0,0]
[17580.5,17.580500000000001,7.9784754056702267,1.445128593331553,1.0000539058858013,1.0383011545379123E-2,1,0,118.30853476075593,1.5623437505729392,2.5260586832185474,1.1637773288548647,1.0020330602785252,6.3712193473154613E-2,1.0932648472172906,0.41605253447341584,1.003896967345973,8.8140274476038852E-2,1.0195327727031223,0.23176441479929863,6.6612337111140842,-116.92053733131802,63.079462668681984,null,1000000000,309073980.25,null,12.504209990410192,-26.486613639875053,null,-6.5837011145868987,-95.483989429815153,5.9205088758232938,-121.97060306969021,0,0]
[17681.75,17.681750000000001,8.023705405211869,1.4458407089898233,1.0000545285687219,1.0442805277631008E-2,1,0,118.98985132066595,1.5623921497941153,2.5383324012441246,1.1658608723917809,1.0020565213032304,6.4078125397805066E-2,1.0942957665285862,0.41817957182049809,1.0039418952238697,8.8645246344794093E-2,1.0197565638805208,0.23307173267096651,6.6100503157102146,-116.90824483910436,63.091755160895644,null,1000000000,312644283.0625,null,12.496230862716317,-26.3909748146454,null,-6.6347033679703546,-95.596268519716759,5.8615274947459621,-121.98724333436216,0,0]
[17783,17.783000000000001,8.0689394280273241,1.4465448408407897,1.0000551548271235,1.0502598935208149E-2,1,0,119.67116815613409,1.5624399979185142,2.5506170324820299,1.1679243547191109,1.0020801165031963,6.4444040138823849E-2,1.0953316274163691,0.42030259565681088,1.0039870790805745,8.9150172890361576E-2,1.0199815985733101,0.23437859134853078,6.5592754150259944,-116.89658806222248,63.103411937777523,null,1000000000,316235089,null,12.488369410697402,-26.296452851989212,null,-6.6854440825776926,-95.708063865549278,5.8029253281197093,-122.00451671753849,0,0]
[17886.5,17.886500000000002,8.1151827396746565,1.4472565064504492,1.0000557986979177,1.0563721263104064E-2,1,0,120.36762564566298,1.5624883494756105,2.5631857718227251,1.1700132395160763,1.0021043747119698,6.4818068457109385E-2,1.0963956003666659,0.42246864146244761,1.0040335315616382,8.9666272918989515E-2,1.020212918594058,0.2357140143813255,6.5077886852630273,-116.88532149829754,63.114678501702457,null,1000000000,319926882.25,null,12.480452441490687,-26.200969153335599,null,-6.7370450963582922,-95.821851353758632,5.743407345132395,-122.02282050709422,0,0]
[17990,17.989999999999998,8.1614301148245882,1.4479601069966326,1.0000564463048545,1.062484351206631E-2,1,0,121.06408341335838,1.5625361447188957,{"$f":"SQRT(1+(A279/Zero2)^2)","v":2.5757655862914799},{"$f":"ATAN(A279/Zero2)","v":1.1720817294031594},1.0021287731055237,6.5192078615106064E-2,1.0974647073477435,0.42463047724109004,1.0040802514515235,9.0182325056756635E-2,1.0204455365553105,0.23704895285301381,6.4567173299287397,-116.87470345275345,63.125296547246549,null,1000000000,323640100,null,12.472653533538821,-26.106621082001713,null,-6.7883789559478434,-95.935148989084993,5.684274577590978,-122.0417700710867,0,0]
[18093.5,18.093499999999999,8.2076814847879316,1.4486557781198406,1.0000570976479268,1.0685965681638342E-2,1,0,121.76054145444704,1.5625833931943263,2.5883563144077617,1.1741301041748404,1.0021533116736192,6.5566070509508328E-2,1.098538933370161,0.42678809510716792,1.0041272387129043,9.069832903550748E-2,1.0206794517157873,0.23838340438177641,6.4060557121181372,-116.86472608612188,63.135273913878123,null,1000000000,327374742.25,null,12.464970298346783,-26.013393147968731,null,-6.8394486890999477,-96.04796440671457,5.6255216092468352,-122.0613575546833,0,0]
[18197,18.196999999999999,8.2539367824092427,1.4493436524511358,1.000057752727127,1.0747087771363623E-2,1,0,122.45699976426428,1.5626301042307038,2.600957797679075,1.1761586388855165,1.0021779904059596,6.5940044037041193E-2,1.0996182634314193,0.4289414873629358,1.0041744933082484,9.1214284587239236E-2,1.0209146633307842,0.23971736659253939,6.3557983021008244,-116.85538164603044,63.144618353969562,null,1000000000,331130809,null,12.457400405477079,-25.921270120364309,null,-6.8902572746641582,-96.160305069791931,5.5671431308129211,-122.08157519015624,0,0]
[18303,18.303000000000001,8.3013133602598721,1.4500401960514442,1.0000584275020736,1.0809686156827709E-2,1,0,123.17028101235033,1.5626773960103102,2.6138746500443188,1.1782158898366701,1.0022034105156752,6.6323031595997256E-2,1.1007289390352766,0.43114250613286104,1.0042231663774686,9.1742652357842222E-2,1.0211568994097675,0.24108304044855763,6.3047402479147525,-116.84645952933919,63.153540470660815,null,1000000000,334999809,null,12.449762771236148,-25.828051513468722,null,-6.9420254972894488,-96.274874803317132,5.5077372739466997,-122.10292631678585,0,{"$f":"IF(AI282>0,W282,0)","v":0}]
[18409,18.408999999999999,8.3486939199715966,1.450728833925554,1.0000591061958017,1.0872284457571851E-2,1,0,123.88356253273609,1.5627241432084507,2.6268024562382535,1.1802528998206425,1.0022289776205866,6.6705999670912966E-2,1.1018449363370031,0.43333907694773532,1.0042721197709612,9.2270968765193903E-2,1.0214004937382855,0.2424481960417528,6.2540947571707566,-116.83818510480253,63.161814895197466,null,1000000000,338891281,null,12.442239252709212,-25.73596030999429,null,-6.9935259757686206,-96.388961882678274,5.4487132769405919,-122.12492219267256,0,0]
[18515,18.515000000000001,8.3960783941333688,1.4514096992660419,1.0000597888083034,1.093488267310563E-2,1,0,124.59684432074505,1.5627703551776451,2.6397410553258096,1.1822699494386117,1.0022546917094444,6.7088948150948083E-2,1.1029662391828854,0.43553119214473707,1.0043213534477347,9.2799233521901253E-2,1.0216454455052757,0.24381283084290922,6.2038562221123605,-116.83055032762014,63.169449672379855,null,1000000000,342805225,null,12.434827525236344,-25.644980962187006,null,-7.0447617571727523,-96.502573794362604,5.3900657680635913,-122.14755475654961,0,0]
[18621,18.620999999999999,8.4434667168418756,1.4520829223045495,1.0000604753395705,1.0997480802938636E-2,1,0,125.31012637180714,1.562816041057479,2.6526902893787279,1.1842673144692257,1.0022805527709358,6.7471876925296673E-2,1.1040928314081906,0.43771884426338559,1.004370867366571,9.3327446340742692E-2,1.0218917538959682,0.24517694233033646,6.1540191416033068,-116.82354724787625,63.176452752123751,null,1000000000,346741641,null,12.427525321057901,-25.555098186405221,null,-7.0957358391450533,-96.615717855639389,5.331789481912848,-122.17081604204461,0,0]
[18729.5,18.729500000000002,8.4919766071886595,1.452764241365462,1.0000611821210954,1.1061555214489906E-2,1,0,126.04023138052365,1.5628622689098099,2.6659557822969626,1.1862916836079729,1.0023071759642614,6.7863816514737885E-2,1.1052514552962467,0.43995346216334275,1.00442183925748,9.3868062919729461E-2,1.022145275587262,0.24657268166156626,6.1034167939392381,-116.81702502318022,63.182974976819779,null,1000000000,350794170.25,null,12.420162014430973,-25.464215523608214,null,-7.1476441877097772,-96.731053342086497,5.2725178267211961,-122.19526886569471,0,0]
[18838,18.838000000000001,8.5404903946927551,1.4534378203449412,1.0000618930083958,1.1125629535210501E-2,1,0,126.77033665548743,1.5629079642843766,2.6792320922766528,1.1882959983142809,1.0023339531204563,6.8255735223202205E-2,1.1064155867013108,0.44218338880693114,1.0044731046771855,9.4408624473658581E-2,1.022400216909283,0.24796786738123239,6.0532237282281374,-116.81114809200625,63.188851907993751,null,1000000000,354870244,null,12.412908825867232,-25.374450190031361,null,-7.1992845482586478,-96.845913640131968,5.2136242776085844,-122.22036383016334,0,0]
[18946.5,18.9465,8.5890080133165512,1.4541037897931295,1.0000626080014632,1.11897037645745E-2,1,0,127.50044219212462,1.5629531363283662,2.6925190593070578,1.1902805392563813,1.0023608842271816,6.8647632931970237E-2,1.1075852082572963,0.44440861684451854,1.0045246635807477,9.4949130695067357E-2,1.0226565769762739,0.24936249680964506,6.0034343748730468,-116.80590823462607,63.194091765373926,null,1000000000,358969862.25,null,12.405763498118459,-25.285786621862613,null,-7.2506599813743318,-96.960306076243199,5.155103516744127,-122.24609269810581,0,0]
[19055,19.055,8.637529398501032,1.4547622773540525,1.0000633271002886,1.1253777902055983E-2,1,0,128.23054798596559,1.5629977939806483,2.7058165263931899,1.1922455822149138,1.0023879692720288,6.9039509522361195E-2,1.1087603025896673,0.44662913914353719,1.004576515922978,9.5489581276685359E-2,1.022914354898476,0.25075656727548762,5.9540432700798416,-116.80129733337671,63.198702666623291,null,1000000000,363093025,null,12.398723829529818,-25.198209523394837,null,-7.3017734978123903,-97.074237810859117,5.0969503317174274,-122.27244733425395,0,0]
[19165.75,19.165749999999999,8.687060806518021,1.4554268335617708,1.0000640653456467,1.131918067058427E-2,1,0,128.97579448325976,1.5630428562816041,2.7194004163788255,1.1942315476168417,1.0024157747349736,6.943949068279516E-2,1.1099653913764893,0.44889084883134273,1.0046297461264735,9.6041181657475438E-2,1.0231789397815312,0.25217896780160248,5.9040330816997475,-116.797231146093,63.202768853907003,null,1000000000,367325973.0625,null,12.391644915589151,-25.109921199542004,null,-7.3536799274002282,-97.190064321261374,5.0379649881889224,-122.29998552080338,0,0]
[19276.5,19.276499999999999,8.7365960075421754,1.4560838541870396,1.0000648078687948,1.1384583342272471E-2,1,0,129.72104123944433,1.5630874008172462,2.7329949251961434,1.1961977634652265,1.002443740560423,6.9839449590144043E-2,1.1111761456710241,0.45114764125647222,1.0046832819691649,9.6592723420590929E-2,1.0234450000486044,0.25360078034453404,5.8544266524774784,-116.79380350216861,63.206196497831385,null,1000000000,371583452.25,null,12.38467162324036,-25.022733500980607,null,-7.4053196494914308,-97.305425391186276,4.9793519737489289,-122.32815889216688,0,0]
[19387.25,19.387250000000002,8.7861349374198987,1.4567334661215583,1.0000655546697232,1.1449985916561285E-2,1,0,130.46628825008287,1.5631314364601032,2.7465998951689601,1.1981445079249109,1.0024718667349564,7.0239386118315025E-2,1.1123925469738549,0.4533995095245219,1.0047371234021958,9.714420623987266E-2,1.0237125347406402,0.25502200209047626,5.805218495901161,-116.79100609292529,63.208993907074714,null,1000000000,375865462.5625,null,12.377801780047427,-24.936630991173001,null,-7.4566957121421948,-97.420328129805483,4.9211060679052325,-122.35695912097849,0,0]
[19498,19.498000000000001,8.8356775334315856,1.4573757934363782,1.0000663057484225,1.1515388392891408E-2,1,0,131.21153551083967,1.5631749718811376,2.760215171609659,1.2000720542690295,1.002500153245077,7.0639300141258105E-2,1.1136145767802992,0.45564644697089929,1.0047912703764412,9.7695629789374586E-2,1.023981542894316,0.25644263023483194,5.7564032292797584,-116.78883071731656,63.211169282683443,null,1000000000,380172004,null,12.371033267253486,-24.851598502309304,null,-7.507811113746909,-97.534779485207082,4.8632221535065767,-122.38637798751638,0,0]
[19611.75,19.611750000000001,8.8865658931085854,1.4580280642790204,1.0000670816255133,1.1582562391300155E-2,1,0,131.97697031223444,1.5632191747617017,2.7742098287774684,1.2020321108182324,1.0025293728761253,7.1050023489422881E-2,1.1148755487987101,0.45794910980081927,1.0048472021020753,9.8261928277977112E-2,1.0242593708062075,0.25790111953087597,5.7066691040553055,-116.78723544990214,63.212764550097859,null,1000000000,384620738.0625,null,12.364184723158278,-24.765360887230429,null,-7.5600428814295402,-97.651868346250197,4.8041418417287378,-122.41722923348063,0,0]
[19725.5,19.7255,8.9374579905834857,1.458672907010238,1.0000678620152457,1.1649736285175332E-2,1,0,132.74240536852437,1.5632628678665288,2.7882150369511547,1.2039724840259647,1.0025587616176566,7.1460722827196149E-2,1.116142418797734,0.46024655754527322,1.0049034560402239,9.8828163546000339E-2,1.02453875101356,0.25935897666340724,5.6573382573478188,-116.78627917971521,63.213720820284792,null,1000000000,389095350.25,null,12.357438710056456,-24.680220460853459,null,-7.612005930525692,-97.768495393546502,4.7454327795307645,-122.44871585439996,0,0]
[19839.25,19.83925,8.988353762366005,1.4593104472722498,1.0000686469176094,1.1716910073910961E-2,1,0,133.50784067532535,1.5633060599634827,2.8022306379327864,1.2058934545143689,1.0025883194548,7.1871398018146904E-2,1.1174151667168561,0.46253878373030838,1.0049600321367782,9.9394335240996043E-2,1.0248196824586977,0.2608161986242164,5.6084051822790268,-116.78595336947566,63.214046630524336,null,1000000000,393595840.5625,null,12.350793099056602,-24.596161639258646,null,-7.6637033529989962,-97.884667653541868,4.6870897460576062,-122.48082929280051,0,0]
[19953,19.952999999999999,9.0392531463912604,1.4599408079013982,1.0000694363325937,1.178408375690107E-2,1,0,134.27327622835321,1.5633487596205076,2.8162564765573999,1.207795297894267,1.0026180463726,7.2282048925892808E-2,1.1186937724939896,0.46482578213084919,1.005016930337332,9.996044301075821E-2,1.0251021640792835,0.26227278241547219,5.5598644763847247,-116.78624959739514,63.213750402604859,null,1000000000,398122209,null,12.344245814355336,-24.513169114201997,null,-7.7151381900907818,-98.000391992511979,4.6291076242645541,-122.51356110671398,0,0]
[20069,20.068999999999999,9.0911629886485823,1.4605763676399224,1.000070246009763,1.1852586040572285E-2,1,0,135.05385251408822,1.5633918054186779,2.8305701349869437,1.2097153423975817,1.0026485354101895,7.2700797449070098E-2,1.1200036813849443,0.4671526277492617,1.0050752856640308,0.10053768231734063,1.0253918286152213,0.26375751742827186,5.5107622178663522,-116.78718368929228,63.212816310707723,null,1000000000,402764761,null,12.337668187624605,-24.429617533205626,null,-7.7673230928260617,-98.117951041479515,4.5703450947985429,-122.54756857468514,0,0]
[20185,20.184999999999999,9.1430764614562907,1.4612047103407253,1.0000710603798173,1.1921088213000461E-2,1,0,135.83442904719388,1.5634343564890414,2.8448941234863949,1.2116160590733078,1.0026792002518159,7.3119520432575191E-2,1.1213196400249017,0.46947402443132363,1.005133975848107,0.10111485440574261,1.0256831030126323,0.2652415825117781,5.4620569770876344,-116.78874734277606,63.211252657223937,null,1000000000,407434225,null,12.331188617339437,-24.347143546027702,null,-7.8192411510144746,-98.235058206897207,4.5119474663249628,-122.5822017529249,0,0]
[20301,20.300999999999998,9.1949935033218537,1.4618259577505492,1.0000718794427448,1.1989590273542971E-2,1,0,136.61500582343004,1.563476421311617,2.8592282868028844,1.2134977247722663,1.0027100408813503,7.3538217731929492E-2,1.1226416271393456,0.47178996636332565,1.0051930008309067,0.10169195890322801,1.0259759861300539,0.266724974520272,5.4137433435488012,-116.79093198978534,63.209068010214665,null,1000000000,412130601,null,12.324805062834681,-24.265731767875899,null,-7.8708954338454866,-98.351720284139972,4.4539096289891944,-122.61745205201586,0,0]
[20417,20.417000000000002,9.2469140541295598,1.4624402289039409,1.0000727031985344,1.2058092221557194E-2,1,0,137.39558283865281,1.563518008173723,2.8735724726721279,1.2153606113629138,1.0027410572825726,7.395688920270814E-2,1.1239696214566182,0.47410044799290191,1.0052523605534549,0.10226899543732815,1.0262704768210815,0.26820769031939484,5.3658160087932947,-116.79372918192756,63.20627081807244,null,1000000000,416853889,null,12.318515534431418,-24.18536708838846,null,-7.9222889601768518,-98.467943913836223,4.3962265742545661,-122.65331100222468,0,0]
[20536,20.536000000000001,9.3001809624468095,1.463063259136872,1.0000735531348228,1.212836565407048E-2,1,0,138.19634743456945,1.5635601823845597,2.8882978870695948,1.2172524419628947,1.0027730584642065,7.4386361393441486E-2,1.125338180414017,0.47646500396137337,1.0053136032163801,0.10286088431734881,1.0265742529179374,0.2697280462759421,5.3170451289307259,-116.79722649789436,63.202773502105643,null,1000000000,421727296,null,12.31215901777092,-24.103996527595378,null,-7.974743782235322,-98.586724525400768,4.3374152355355982,-122.69072105299614,0,0]
[20655,20.655000000000001,9.3534514396661734,1.4636791929497279,1.0000744080098214,1.2198638966789738E-2,1,0,138.99711227345878,1.5636018706627106,2.9030335338600679,1.2191250735416115,1.0028052445918589,7.481580609462371E-2,1.1267130159723819,0.47882380254368723,1.0053751980302992,0.10345270087994486,1.0268797183539824,0.27124768394886828,5.2686697882184799,-116.80135082063079,63.198649179369212,null,1000000000,426629025,null,12.305897369796719,-24.023696572765445,null,-8.0269304642271209,-98.705057394288573,4.2789669055695985,-122.72875396705402,0,0]
[20774,20.774000000000001,9.4067254251553543,1.4642881504406071,1.0000752678235174,1.2268912159021209E-2,1,0,139.79787735114556,1.5636430813583264,2.9177792580137329,1.2209787839460755,1.0028376156477226,7.5245223150510562E-2,1.1280941051833773,0.48117683858950588,1.0054371449304922,0.1040444447238817,1.0271868718754975,0.27276659999177655,5.220684573856726,-116.80609341258918,63.193906587410822,null,1000000000,431559076,null,12.299728600040748,-23.944451773942447,null,-8.0788521071816284,-98.822949209919116,4.2208764928591194,-122.76740098386156,0,0]
[20893,20.893000000000001,9.460002859643911,1.4648902490230686,1.000076132575898,1.2339185230071143E-2,1,0,140.59864266354964,1.5636838226313345,2.9325349075139715,1.2228138459570128,1.0028701716138899,7.5674612405418645E-2,1.1294814251067797,0.48352410722887018,1.0054994438518847,0.10463611544822699,1.0274957122234019,0.27428479107099873,5.1730841751720629,-116.81144566250231,63.188554337497692,null,1000000000,436517449,null,12.293650768147453,-23.866246960551443,null,-8.1305117609940556,-98.940406508628442,4.1631390071533971,-122.80665346917988,0,0]
[21014.75,21.014749999999999,9.5145150044008275,1.4654992828656106,1.0000770224232365,1.2411082132507315E-2,1,0,141.41791329546049,1.5637250279005526,2.947641665510174,1.2246722943481065,1.0029036712744162,7.611389558686936E-2,1.1309072293864408,0.48591964581693614,1.0055635467036086,0.10524138314399149,1.0278134340682035,0.2758373126472381,5.1247765908215515,-116.81754370275206,63.182456297247938,null,1000000000,441619717.5625,null,12.28752462396386,-23.787295671536782,null,-8.1830972179407642,-99.060135122375399,4.1044274060230954,-122.84743079391218,0,0]
[21136.5,21.136500000000002,9.5690306380928813,1.4661013774875111,1.0000779174401282,1.2482978906627277E-2,1,0,142.23718416471516,1.563765758494009,2.9627585003205197,1.2265117843762092,1.0029373644520265,7.6553149338081827E-2,1.1323395071308766,0.48830913793326758,1.005628017895472,0.10584657345356227,1.0281329189193775,0.27738906834716753,5.0768608832984334,-116.82426206576039,63.175737934239606,null,1000000000,446751632.25,null,12.281489714448334,-23.709401733562967,null,-8.2354147366179724,-99.179422273937789,4.0460749778303615,-122.88882400750076,0,0]
[21258.25,21.25825,9.6235497014275531,1.4666966503841112,1.0000788176265596,1.2554875551688082E-2,1,0,143.05645526723592,1.5638060225668404,2.9778852584842292,1.2283325924052899,1.002971251127218,7.6992373492527938E-2,1.1337782338067195,0.49069257925833243,1.0056928573566362,0.10645168594855665,1.0284541654112864,0.27894005464222166,5.0293316806910582,-116.83159192915414,63.168408070845857,null,1000000000,451913193.0625,null,12.275544114981539,-23.63254976985451,null,-8.2874674241427755,-99.298274493173395,3.9880766908387635,-122.9308242630279,0,0]
[21380,21.38,9.6780721364446727,1.4672852164226515,1.0000797229825167,1.2626772066946795E-2,1,0,143.8757265990379,1.563845828088438,2.9930217895431643,1.2301349897097409,1.0030053312803786,7.743156788374779E-2,1.1352233848947875,0.49306996576943157,1.0057580650158762,0.10705672020093004,1.0287771721725447,0.28049026801793703,4.9821837121929367,-116.8395246017424,63.160475398257603,null,1000000000,457104400,null,12.269685949630231,-23.556724684608643,null,-8.3392583362567585,-99.416698160169005,3.9304276133734728,-122.97342284477764,0,0]
[21504.5,21.5045,9.7338295121129086,1.4678802577628853,1.0000806541339702,1.2700292393128289E-2,1,0,144.71350326584084,1.5638860666181165,3.0085101663097515,1.2319593364834358,1.0030403812731099,7.7880651524232528E-2,1.136707796184306,0.49549478556498378,1.0058251262303239,0.10767533916556844,1.0291092936974389,0.28207469352947684,4.9343596592758319,-116.84825091842002,63.151749081579979,null,1000000000,462443520.25,null,12.263783978007234,-23.480233409192742,null,-8.391951483429807,-99.537360008103548,3.8718324945774274,-123.0175934172963,0,0]
[21629,21.629000000000001,9.7895902950187068,1.4684685206864296,1.000081590691088,1.2773812582006439E-2,1,0,145.55128016425775,1.563925841930901,3.0240084535346332,1.2337649893668508,1.0030756335409687,7.8329703689924937E-2,1.1381988735767132,0.49791326636467986,1.0058925723119998,0.10829387540887341,1.0294432529903834,0.28365830342331655,4.8869234221573121,-116.85758961369848,63.14241038630152,null,1000000000,467813641,null,12.257969616990829,-23.404784871047973,null,-8.4443771991899617,-99.6575867577845,3.8135924178008676,-123.06237162883247,0,0]
[21753.5,21.753499999999999,9.8453544272697169,1.4690501199615942,1.0000825326538547,1.2847332632786852E-2,1,0,146.38905729031208,1.5639651619795651,3.0395164996195598,1.2355522226315303,1.0031110880626297,7.8778724203052181E-2,1.1396965909080057,0.50032540481260557,1.0059604031834917,0.10891232847424331,1.0297790485665199,0.28524109398742187,4.8398696765546534,-116.86753180771322,63.13246819228678,null,1000000000,473214762.25,null,12.252241009347927,-23.33036380104711,null,-8.4965385914611051,-99.777384772313241,3.7557024178868215,-123.10774857336035,0,0]
[21878,21.878,9.9011218522743754,1.4696251677892547,1.0000834800222553,1.2920852544675133E-2,1,0,147.2268346401178,1.5640040345358699,3.0550341559499774,1.2373213054524734,1.0031467448166476,7.9227712885917498E-2,1.1412009220353252,0.5027311978656418,1.0060286187669669,0.10953069790545385,1.0301166789348506,0.28682306152534209,4.7931931980842455,-116.87806875601159,63.121931243988413,null,1000000000,478646884,null,12.246596345019572,-23.256955211706558,null,-8.5484387166652436,-99.896760268580934,3.6981576283543287,-123.15371548028749,0,0]
[22005.25,22.00525,9.9581244329381793,1.470206261551616,1.0000844539025029,1.2995996246005347E-2,1,0,148.08311733937418,1.5640433112010579,3.0709043511025347,1.2391109831479228,1.0031833981293621,7.9686585911945176E-2,1.1427452887107363,0.50518357090047128,1.0060987385912097,0.11016263919910241,1.0304636614746798,0.28843911779383247,4.7458702354865547,-116.88944409001456,63.110555909985436,null,1000000000,484231027.5625,null,12.240911908055095,-23.182956107856448,null,-8.6012183718780371,-100.01834227550148,3.6396935361770577,-123.20129838335794,0,0]
[22132.5,22.1325,10.015130337883813,1.4707807403599094,1.0000854334297919,1.3071139800561829E-2,1,0,148.93940026444523,1.5640821362472213,3.0867842810386499,1.240882252511186,1.0032202626613798,8.0145425310902574E-2,1.1442965094339264,0.50762930968433706,1.006169260144687,0.11079449216058906,1.0308125575879101,0.2900543065175753,4.6989306631566095,-116.90142269507434,63.098577304925655,null,1000000000,489847556.25,null,12.235311484908653,-23.109983921196406,null,-8.653731387151387,-100.13949557522872,3.581580097757266,-123.24947949642512,0,0]
[22259.75,22.25975,10.07213951066735,1.4713487161553127,1.0000864186041063,1.3146283207496405E-2,1,0,149.79568341145844,1.5641205174190664,3.1026737962862669,1.2426353851618634,1.0032573383894172,8.0604230893305095E-2,1.1458545563685334,0.51006841196136299,1.006240183342934,0.11142625630401952,1.0311633656628985,0.29166862380044922,4.6523692104048182,-116.91399565983058,63.086004340169424,null,1000000000,495496470.0625,null,12.229793286713786,-23.038023521951974,null,-8.7059808662491349,-100.26022635833698,3.523812420464651,-123.29824988028895,0,0]
[22387,22.387,10.129151896112385,1.4719102983757417,1.0000874094254288,1.3221426465960917E-2,1,0,150.65196677662934,1.5641584622852263,3.1185727503303329,1.2443706476314946,1.0032946252900607,8.106300246975294E-2,1.1474194017072241,0.51250087580375292,1.0063115081010285,0.11205793114391968,1.031516084081463,0.29328206576351062,4.6061807050747285,-116.92715421189762,63.072845788102384,null,1000000000,501177769,null,12.22435557019887,-22.967060061789748,null,-8.7579698614152939,-100.38054067295849,3.4663857087835765,-123.34760073474824,0,0]
[22517.5,22.517499999999998,10.187623673853256,1.4724796950283154,1.0000884314177727,1.3298488748819835E-2,1,0,151.5301200771793,1.5641969308583088,3.1348874210838598,1.2461319425001307,1.0033330838153307,8.1533455680317696E-2,1.1490312456018881,0.5149885688437269,1.0063850714983689,0.11270564587098182,1.0318797934762816,0.29493580229395988,4.559194572993098,-116.9412480046942,63.058751995305798,null,1000000000,507037806.25,null,12.218860784704145,-22.895304369562123,null,-8.8110192657050099,-100.50350147821422,3.4078415189991347,-123.39880584777634,0,0]
[22648,22.648,10.246098716850749,1.4730425927062869,1.0000894593492247,1.3375550873721078E-2,1,0,152.40827359938419,1.5642349561311963,3.1512117160439814,1.2478749945763006,1.0033717643874711,8.2003872722495014E-2,1.1506501804627349,0.51746927696120204,1.0064590570470102,0.11335326564173356,1.0322455085740232,0.29658861001399578,4.5125899710257391,-116.95593942989375,63.044060570106254,null,1000000000,512931904,null,12.213447071980333,-22.824566440824313,null,-8.8638010512673322,-100.62603671178728,3.349646020713001,-123.45060315261159,0,0]
[22778.5,22.778500000000001,10.304576969517131,1.4735991016944956,1.0000904932197667,1.3452612839749852E-2,1,0,153.28642733943454,1.5642725457225686,3.1675454864124712,1.2496000753982042,1.0034106669808025,8.2474253392280525E-2,1.1522761764015856,0.51994299912966324,1.0065334646538615,0.11400078993393624,1.0326132276081692,0.29824048479637166,4.466361627522077,-116.97121946668949,63.02878053331051,null,1000000000,518860062.25,null,12.208112692340718,-22.754831142413089,null,-8.9163183486016706,-100.74815245611207,3.2917943437390473,-123.50298359852516,0,0]
[22909,22.908999999999999,10.363058377516367,1.4741493298043522,1.0000915330293807,1.3529674645991384E-2,1,0,154.1645812936076,1.5643097070775194,3.1838885863590312,1.2513074513614635,1.0034497915695029,8.2944597485765811E-2,1.1539092035687333,0.52240973467035967,1.0066082942253283,0.11464821822582549,1.0329829488051534,0.29989142253302065,4.4205043693450943,-116.98707923833724,63.012920761662755,null,1000000000,524822281,null,12.20285595073385,-22.686083625872982,null,-8.968574235984093,-100.86985465300495,3.2342817147497573,-123.55593827887793,0,0]
[23042.25,23.042249999999999,10.422775352933181,1.4747047814660676,1.000092600878792,1.3608360194203294E-2,1,0,155.06124062489306,1.5643472172183233,3.200585559178037,1.2530328096410712,1.0034899696574886,8.3424815092477622E-2,1.1555838672522865,0.52492124186145317,1.0066851359636488,0.1153091900448618,1.0333625251057923,0.30157617902377704,4.3740583929394887,-117.00386233259478,62.996137667405222,null,1000000000,530945285.0625,null,12.197566828146549,-22.616891493093906,null,-9.0216647153232756,-100.99370077569267,3.1759021128232732,-123.61059226878658,0,0]
[23175.5,23.1755,10.482495507413711,1.4752539043333723,1.0000936749201788,1.3687045573895138E-2,1,0,155.9579001718426,1.5643842960398826,3.2172919607866031,1.2547402544563,1.0035303791406809,8.3904994135759414E-2,1.1572657988531323,0.52742546452823902,1.0067624174390932,0.11597006067705003,1.033744185081267,0.30325994996534056,4.3279887092070801,-117.02123159668069,62.978768403319307,null,1000000000,537103800.25,null,12.192355214978608,-22.548698803927227,null,-9.0744889761117378,-101.11712782701703,3.1178662388668705,-123.66582663094425,0,0]
[23308.75,23.30875,10.542218786931141,1.4757968056330197,1.0000947551535211,1.3765730784093115E-2,1,0,156.85455993075769,1.5644209509390097,3.2340076450615682,1.2564300535427244,1.0035710199911281,8.4385134398851397E-2,1.1589549667286099,0.52992240304548222,1.0068401385504038,0.11663082956848667,1.0341279268210679,0.30494273104660297,4.2822901133386591,-117.03917803028736,62.96082196971264,null,1000000000,543297826.5625,null,12.187219442247859,-22.481490629641172,null,-9.1270501340264669,-101.2401417036659,3.0601693082213917,-123.72163233330707,0,0]
[23442,23.442,10.601945138673242,1.4763335901903649,1.000095841578799,1.3844415823823444E-2,1,0,157.75121989802392,1.5644571891443466,3.2507324688049426,1.2581024695336778,1.0036118921807231,8.4865235665100264E-2,1.1606513392845219,0.5324120581490851,1.0069182991957779,0.11729149616579417,1.0345137484072309,0.30662451797748758,4.2369574973312387,-117.05769277939987,62.942307220600128,null,1000000000,549527364,null,12.182157883884887,-22.415252324211554,null,-9.179351252735632,-101.36274816594226,3.0028066311492552,-123.77800049015381,0,0]
[23578.5,23.578499999999998,10.663131362274962,1.4768772318292402,1.000096960922545,1.3925019833091393E-2,1,0,158.66974983293275,1.564493886530075,3.2678745449511934,1.2597979212157591,1.0036540010950314,8.5357006056816842E-2,1.1623965242169534,0.53495488564605709,1.0069988218366823,0.11796816993762752,1.0349111348202615,0.30834628882206577,4.1908934458028737,-117.07723928030882,62.922760719691183,null,1000000000,555945662.25,null,12.177048168491213,-22.348389071639787,null,-9.2326615272859733,-101.48792847070055,2.9443866412052397,-123.83631754234034,0,0]
[23715,23.715,10.724320701364075,1.4774146699555804,1.0000980867639124,1.4005623661406169E-2,1,0,159.58827997906207,1.5645301614831386,3.285025916734313,1.2614756735127239,1.0036963527107343,8.5848735066305457E-2,1.164149202609436,0.53749007281470385,1.0070798054957946,0.11864473519065902,1.035310699674669,0.31006700738395809,4.1452028944794703,-117.0973638082438,62.902636191756201,null,1000000000,562401225,null,12.172013009981788,-22.282513344500479,null,-9.2857052689091564,-101.61269305938303,2.8863077410726312,-123.89520640388352,0,0]
[23851.5,23.851500000000001,10.78551310291539,1.4779460098444992,1.0000992191028799,1.408622730772102E-2,1,0,160.5068103327857,1.5645660212557913,3.3021864393112494,1.2631359928410151,1.0037389469971101,8.6340422461021818E-2,1.1659093406678531,0.54001762159683564,1.0071612500619063,0.11932119133175827,1.0357124408847109,0.3117866691203966,4.099880652918845,-117.11805730644889,62.88194269355111,null,1000000000,568894052.25,null,12.167050792110301,-22.21761028045556,null,-9.3384856084603101,-101.73704770358799,2.8285651836499905,-123.95465798404355,0,0]
[23988,23.988,10.846708515097676,1.4784713544092809,1.000100357939425,1.4166830770989217E-2,1,0,161.42534089055991,1.5646014729352271,3.3193559707577234,1.264779140493745,1.0037817839232663,8.6832068008541555E-2,1.1676769046584514,0.54253753431296003,1.0072431554232124,0.11999753776838565,1.0361163563566693,0.31350526951196173,4.0549216270761255,-117.13931086824401,62.86068913175599,null,1000000000,575424144,null,12.162159940403587,-22.153665301261846,null,-9.3910056243314095,-101.86099804092856,2.7711543160721774,-124.0146633421904,0,0]
[24127.75,24.127749999999999,10.909364027005994,1.4790031010882339,1.0001015306225782,1.4249353173606295E-2,1,0,162.36574143129894,1.564637353150752,3.3369434885310709,1.2664438884822611,1.0038258921180607,8.7335375806254334E-2,1.1694942115946041,0.54510953681969077,1.0073274881775696,0.12068987341989723,1.0365321391994726,0.3152636847148913,4.0092632183357866,-117.16164154610753,62.838358453892468,null,1000000000,582148320.0625,null,12.1572249734763,-22.089175465015852,null,-9.4445095826372221,-101.98748646592146,2.7127153908390778,-124.07666193093732,0,0]
[24267.5,24.267499999999998,10.972022588355996,1.4795287745616388,1.0001027101163542,1.4331875382136018E-2,1,0,163.30614217865858,1.5646728201328572,3.3545401572753426,1.2680911756999271,1.0038702545783813,8.7838639247662942E-2,1.1713192309292093,0.54767354142746083,1.0074123036918816,0.12138209282566211,1.0369501966062298,0.31702097791904399,3.9639750204263633,-117.18454085115903,62.815459148840972,null,1000000000,588911556.25,null,12.152361600311576,-22.025659839287798,null,-9.4977470399897594,-102.11356264719375,2.6546145603218161,-124.13922248648154,0,0]
[24407.25,24.407250000000001,11.034684147200487,1.4800484779983889,1.0001038964207281,1.4414397395455133E-2,1,0,164.24654312908984,1.5647078809794119,3.3721458337346339,1.2697212666195152,1.0039148712705201,8.8341858083737429E-2,1.1731519266687798,0.55022955182872924,1.0074976018442261,0.12207419535174424,1.0373705263044921,0.31877714435078869,3.9190518653791924,-117.20799969665391,62.792000303346086,null,1000000000,595713852.5625,null,12.147568259207592,-21.963103663313618,null,-9.5507211363754205,-102.23923222244298,2.5968471228321715,-124.2023358857566,0,0]
[24547,24.547000000000001,{"$f":"SQRT(1+(A333/pole1)^2)","v":11.097348652763102},{"$f":"ATAN(A333/pole1)","v":1.4805623122501481},{"$f":"SQRT(1+(A333/Zero1)^2)","v":1.0001050895356762},{"$f":"ATAN(A333/Zero1)","v":1.4496919212440408E-2},{"$f":"IF(VIN_nom>Vout, 1, SQRT(1+(A333/z_RHP)^2))","v":1},{"$f":"IF(VIN_nom>Vout, 0, -ATAN(A333/z_RHP))","v":0},{"$f":"SQRT(1+(A333/Pole2)^2)","v":165.18694427912445},{"$f":"ATAN(A333/Pole2)","v":1.5647425426266586},3.3897603775566223,1.2713344205863593,{"$f":"SQRT(1+(A333/pole4)^2)","v":1.0039597421605824},{"$f":"ATAN(A333/pole4)","v":8.8845032065582349E-2},{"$f":"SQRT(1+(A333/Zero3)^2)","v":1.1749922628934681},{"$f":"ATAN(A333/Zero3)","v":0.55277757211078504},{"$f":"SQRT(1+(A333/pole5)^2)","v":1.0075833825120284},{"$f":"ATAN(A333/pole5)","v":0.1227661803648696},{"$f":"SQRT((1-(Z333/pterm2))^2+(A333/pterm1)^2)","v":1.0377931260133137},{"$f":"IF((ATAN((A333/pterm1)/(1-A333^2/pterm2))>0),ATAN((A333/pterm1)/(1-A333^2/pterm2)),PI()+ATAN((A333/pterm1)/(1-A333^2/pterm2)))","v":0.32053217926233785},{"$f":"20*LOG10(((E333*K333*G333*O333)/(C333*I333*S333*M333*Q333))*Adc)","v":3.8744886810157535},{"$f":"((F333+L333+H333+R333)-(D333+J333+T333+N333))*radconv","v":-117.23200914905064},{"$f":"IF(V333>0,V333,V333+180)","v":62.76799085094936},null,{"$f":"IF(U333<0,A333,1000000000)","v":1000000000},{"$f":"A333^2","v":602555209},null,{"$f":"20*LOG10((K333/(I333*M333))*AEA*Afb)","v":12.142843429006668},{"$f":"(L333-(J333+N333))*radconv","v":-21.901492460856971},null,{"$f":"20*LOG10((E333*G333/(C333*S333))*Am)","v":-9.603434958993148},{"$f":"(F333+H333-(D333+T333))*radconv","v":-102.36450069808005},2.5394084700135195,-124.26599315893702,0,0]
[24690,{"$f":"A334/1000","v":24.69},11.161473470941193,1.4810821234675016,1.000106317447452,1.4581359937041093E-2,1,0,166.14921542643054,1.5647776041968839,3.4077935975786406,1.2729678226936805,1.0040059196581939,8.9359861077393438E-2,1.1768832693230986,0.55537658234592047,1.007671657428403,0.12347413574877542,1.0382279010448838,0.32232685271583306,3.8292565754966237,-117.25713776229414,62.742862237705864,null,1000000000,609596100,null,12.138078092775368,-21.839411823333435,null,-9.6571084273163112,-102.49227280447477,{"$f":"AB334+AE334","v":2.4809696654590567},-124.3316846278082,{"$f":"SUM((U335<0)*(U334>0))*A334","v":0},0]
[24833,24.832999999999998,11.225601270534696,1.4815959958354634,1.0001075524902043,1.4665800453690475E-2,1,0,167.11148677563392,1.5648122619798939,3.4258358138696652,1.2745840244013102,1.0040523632419629,8.98746425976336E-2,1.178782199890569,0.55796723640879731,1.0077604373020177,0.12418196675102454,1.0386650480375563,0.32412033143340685,3.7843909300245522,-117.2828244436041,62.717175556395901,null,1000000000,616677889,null,12.133381393268266,-21.778290839749413,null,-9.7105157510882396,-102.61963619845251,2.4228656421800263,-124.39792703820193,0,0]
[24976,24.975999999999999,11.289732000738612,1.4821040302862702,1.0001087946639065,1.4750240761185175E-2,1,0,168.07375832326679,1.5648465229110047,3.4438868850377453,1.2761832876656147,1.0040990728749668,9.038937636007767E-2,1.1806890163621349,0.56054953992733692,1.0078497219994296,0.12488967269529916,1.0391045645203301,0.32591261041259012,3.7398866065188709,-117.3090601012871,62.690939898712898,null,1000000000,623800576,null,12.12875182460972,-21.71811488322146,null,-9.7636600736925203,-102.74659637645304,2.3650917509172,-124.4647112596745,0,0]
[25119,25.119,11.353865611893504,1.4826063254838608,1.0001100439685324,1.4834680858321828E-2,1,0,169.03603006594034,1.5648803937676146,3.4619466725712043,1.2777658693274296,1.0041460485200782,9.0904062098651095E-2,1.1826036805923756,0.56312349893870739,1.0079395113864846,0.12559725290602156,1.0395464480131857,0.32770368467943767,3.6957385619063765,-117.33583579933649,62.664164200663507,null,1000000000,630964161,null,12.124187920167152,-21.658869610925048,null,-9.8165444855249469,-102.87315870658654,2.3076434346422054,-124.53202831751159,0,0]
[25265.25,25.265250000000002,11.419459734441975,1.4831142006047797,1.0001113290422823,1.4921039829737441E-2,1,0,170.02017181923623,1.5649146378456742,3.4804257841757202,1.2793674265924662,1.0041943669039832,9.1430395289782751E-2,1.1845699375813583,0.56574733259896626,1.0080318633261847,0.126320783729476,1.0400008200336071,0.32953421393258514,3.6509505107227955,-117.36376947336107,62.636230526638926,null,1000000000,638332857.5625,null,12.119586721712718,-21.599225850537415,null,-9.8703651437580859,-103.00219140357771,2.2492215779546321,-124.60141725411512,0,0]
[25411.5,25.4115,11.485056768847722,1.4836162743847325,1.0001126215747149,1.50073985785787E-2,1,0,171.00431376961262,1.564948487769579,3.4989137287128216,1.2809520629181079,1.0042429634496532,9.1956677686882773E-2,1.1865443226846777,0.56836245220381498,1.0081247428705487,0.12704418161232706,1.0404576626025459,0.33136347265954286,3.6065247414587147,-117.39224959369257,62.607750406307431,null,1000000000,645744332.25,null,12.115051223668088,-21.540526094910387,null,-9.9239203165147156,-103.13081892517967,2.1911309071533722,-124.67134502009006,0,0]
[25557.75,25.557749999999999,11.55065666550078,1.4841126454114615,1.0001139215658019,1.5093757103558373E-2,1,0,171.98845591368635,1.5649819503054667,3.5174103669015477,1.282520037223841,1.0042918381167081,9.248290900581381E-2,1.1885267953949734,0.57096886550102866,1.008218149873763,0.12776744583430558,1.0409169730382439,0.33319145563233227,3.5624561526846992,-117.42126708719108,62.578732912808917,null,1000000000,653198585.0625,null,12.11057997678618,-21.482755880441445,null,-9.9772131451637041,-103.25904662058664,2.1333668316224763,-124.74180250102809,0,0]
[25704,25.704000000000001,11.616259375909694,1.4846034100570029,1.000115229015514,1.5180115403389248E-2,1,0,172.9725982481512,1.5650150320654936,3.5359155623104797,1.2840716033404851,1.0043409908645451,9.3009088962606817E-2,1.1905173153093227,0.57356658066004207,1.0083120841892419,0.12849057567596789,1.0413787486494104,0.33501815765436899,3.518739737042436,-117.4508130382637,62.549186961736297,null,1000000000,660695616,null,12.106171569706108,-21.425901026274282,null,-10.030246718003188,-103.38687971384095,2.0759248517029203,-124.81278074011524,0,0]
[25853.75,25.853750000000002,11.683434931776524,1.4851002086490082,1.0001165754830965,1.5268540162935105E-2,1,0,173.98029290076533,1.5650485177208551,3.5548723443731376,1.2856435589477211,1.004391608017617,9.3547807743217359E-2,1.1925637678930254,0.5762174594601629,1.0084088127439428,0.12923087119579707,1.0418541268548784,0.3368872429272774,3.4743368991472972,-117.48160450149474,62.518395498505257,null,1000000000,668416389.0625,null,12.101721340351094,-21.368619503532138,null,-10.084284004726269,-103.51736850874127,2.017437335624825,-124.8859880122734,0,0]
[26003.5,26.003499999999999,11.750613338248503,1.4855913269532877,1.0001179297705076,1.5356964683695514E-2,1,0,174.98798774621488,1.5650816177118116,{"$f":"SQRT(1+(A343/Zero2)^2)","v":3.5738378174817891},{"$f":"ATAN(A343/Zero2)","v":1.2871988344052068},1.0044425166337088,9.4086472071887722E-2,1.1946185720649363,0.57885923748102508,1.0085060938382566,0.12997102430250543,1.0423320838979073,0.33875497427942081,3.4302929591414899,-117.51293159299314,62.487068407006859,null,1000000000,676182012.25,null,12.097334116375327,-21.312268466164337,null,-10.13805586605206,-103.64745428686379,1.9592782503232673,-124.95972275302813,0,0]
[26153.25,26.15325,11.817794546712728,1.486076861603933,1.0001192918777153,1.5445388964288676E-2,1,0,175.99568278118747,1.5651143386628634,3.5928118440034575,1.2887376863977209,1.004493716668506,9.4625081644323872E-2,1.1966816848038953,0.58149192482413903,1.008603927312304,0.13071103422646743,1.0428126168588179,0.34062134623471907,3.3866028332188378,-117.54478523507022,62.455214764929778,null,1000000000,683992485.5625,null,12.09300849862813,-21.256833569337498,null,-10.191565451865509,-103.77714227125702,1.9014430467626209,-125.03397584059452,0,0]
[26303,26.303000000000001,11.884978509653447,1.4865569070606732,1.0001206618046881,1.5533813003332828E-2,1,0,177.0033780024462,1.5651466870476585,3.611794289135879,1.2902603665286227,1.0045452080774488,9.5163636156420761E-2,1.1987530632115511,0.58411553202567601,1.0087023130053598,0.13145090019898256,1.0432957228078299,0.34248635335178107,3.3432615311910348,-117.5771565099018,62.422843490098202,null,1000000000,691847809,null,12.088743124688232,-21.20230075072978,null,-10.244815858656516,-103.90643756237519,1.8439272660317165,-125.10873831310496,0,0]
[26456,26.456,11.953623351743914,1.4870417977352881,1.0001220695391035,1.5624155844070545E-2,1,0,178.03294325901302,1.5651793592825873,3.631197264512775,1.291799647552198,1.0045981178777281,9.5713821647977204E-2,1.2008778886123295,0.58678671247959535,1.0088034041052401,0.13220667389262977,1.043791967824595,0.34439042120118796,3.2993347660654337,-117.61075582605069,62.389244173949308,null,1000000000,699919936,null,12.084446019164801,-21.14750173231592,null,-10.29895743949959,-104.03813853990043,1.7854885796652109,-125.18564027221635,0,{"$f":"IF(AI346>0,W346,0)","v":0}]
[26609,26.609000000000002,12.022270972262472,1.4875211510334707,1.0001234854363212,1.5714498429744858E-2,1,0,179.06250870344013,1.5652116558028981,3.6506087521286967,1.2933225624251339,1.0046513317418675,9.6263949022150519E-2,1.2030112522190952,0.58944843797776558,1.0089050713117811,0.13296229569941698,1.0442908925087961,0.34629305295512847,3.2557618878714285,-117.64487716339779,62.355122836602206,null,1000000000,708038881,null,12.080209037912402,-21.093615568518924,null,-10.352834838773493,-104.16943998153094,1.7273741991389091,-125.26305555004987,0,0]
[26762,26.762,12.090921323884569,1.4879950610540924,1.0001249094963063,1.5804840758882131E-2,1,0,180.09207433250558,1.5652435830522744,3.6700286169150353,1.2948293638299535,1.0047048496215529,9.681401795522053E-2,1.2051531086888185,0.59210072111634116,1.0090073144508382,0.13371776480252123,1.0447924937036863,0.34819424292263823,3.2125378625868928,-117.67951150723385,62.320488492766145,null,1000000000,716204644,null,12.076030839425353,-21.040628132344739,null,-10.406451193765269,-104.30034695275107,1.6695796456600842,-125.34097508509581,0,0]
[26915,26.914999999999999,12.159574360352529,1.4884636197807999,1.000126341719024,1.5895182830008774E-2,1,0,181.12164014306072,1.5652751473278894,3.6894567265892961,1.2963202994229657,1.0047586714682049,9.7364028123677351E-2,1.2073034128203688,0.5947435749336526,1.0091101333473509,0.13447308038614678,1.0452967682419343,0.35009398545071951,3.1696577485890352,-117.71465000337129,62.28534999662871,null,1000000000,724417225,null,12.071910117481163,-20.988525576397755,null,-10.459809588513764,-104.43086440002713,1.6121005289673995,-125.4193899764249,0,0]
[27071.75,27.071750000000002,12.229912806369404,1.4889382071596322,1.000127817510488,1.5987738898470102E-2,1,0,182.17644059475634,1.5653071152444888,3.70936943045804,1.2978315774497349,1.0048141276602178,9.7927457652770583E-2,1.2095151341513639,0.59744143984902531,1.0092160692288088,0.13524674854507754,1.0458161715586689,0.35203878333634586,3.1260782379609635,-117.75116348390739,62.248836516092609,null,1000000000,732879648.0625,null,12.067746674620546,-20.936049484504117,null,-10.514211435192639,-104.56418189275793,1.5535352394279069,-125.50023137726205,0,0]
[27228.5,27.2285,12.30025397546417,1.4894073666200773,1.0001293018696475,1.6080294692986948E-2,1,0,183.23124123048325,1.5653387151040301,3.7292905158978957,1.2993267130023931,1.004869902798057,9.8490824814564087E-2,1.2117356267339308,0.60012943665207796,1.0093226090620635,0.13602025383662938,1.0463383741068883,0.35398205007000338,3.0828494905276522,-117.78818782053102,62.211812179468978,null,1000000000,741391212.25,null,12.06364089348048,-20.884473626749859,null,-10.568348908688382,-104.69710067582341,1.4952919847920985,-125.58157430257327,0,0]
[27385.25,27.385249999999999,12.370597821185271,1.4898711905493414,1.0001307947964642,1.6172850211974756E-2,1,0,184.28604204708145,1.5653699532264105,3.7492198493050757,1.3008059567631338,1.0049259968286159,9.9054129261866408E-2,1.213964842436942,0.60280758075604346,1.0094297526558833,0.13679359538692626,1.0468633724467495,0.35592377969697619,3.0399664795690806,-117.82571399479836,62.174286005201637,null,1000000000,749951917.5625,null,12.059591477598834,-20.83378398231412,null,-10.622225159065861,-104.82962570153126,1.4373663185329733,-125.66340968384537,0,0]
[27542,27.542000000000002,12.440944298130001,1.490329769254344,1.0001322962908998,1.6265405453849018E-2,1,0,185.34084304146282,1.565400835787661,3.7691572998467637,1.3022695543915803,1.0049824096984972,9.9617370647722636E-2,1.2162027332937653,0.60547588802671393,1.0095374998180351,0.13756677232324541,1.0473911631272232,0.35786396630452505,2.9974242706089145,-117.86373315095577,62.136266849044233,null,1000000000,758561764,null,12.0555971647655,-20.783966809918713,null,-10.675843282710336,-104.96176180540262,1.379753882055164,-125.74572861532133,0,0]
[27702.5,27.702500000000001,12.512976385194506,1.4907939759859976,1.0001338425837358,1.6360174647167484E-2,1,0,186.42087869045594,1.5654320950475131,3.7895799998227244,1.303752205669918,1.0050405024746556,0.10019402100329709,1.2185031012319161,0.608197854792079,1.0096484498618674,0.13835827483688865,1.047934470106294,0.35984896389579973,2.9542123755393712,-117.90316358810999,62.09683641189001,null,1000000000,767428506.25,null,12.051563106974626,-20.733847804412381,null,-10.730479851877714,-105.09666100162073,1.3210832550969123,-125.83050880603311,0,0]
[27863,27.863,12.585011137787156,1.4912528687134945,1.000135397858946,1.6454943546592646E-2,1,0,187.50091451951008,1.5654629941905316,3.8100109409434331,1.305218958897618,1.0050989294138455,0.10077060450859368,1.2208124631233583,0.61090954351508631,1.0097600322872227,0.13914960291795397,1.0484806972707057,0.36183233134447434,2.9113476000390226,-117.9430925938432,62.056907406156796,null,1000000000,776346769,null,12.047584247443288,-20.684615226697613,null,-10.784852198898836,-105.23116234437578,1.2627320485444518,-125.91577757107339,0,0]
[28023.5,28.023499999999999,12.657048510397184,1.4917065379755843,1.0001369621164886,1.6549712150423598E-2,1,0,188.58095052553151,1.5654935394040126,3.830449991338476,1.3066700622057497,1.0051576904577952,0.10134712079193471,1.2231307680243344,0.61361097264626019,1.0098722468844819,0.13994075563336689,1.0490298408801058,0.36381406244021758,2.8688249331690674,-117.9835111697239,62.016488830276103,null,1000000000,785316552.25,null,12.043659335964033,-20.636255193121734,null,-10.838963480410586,-105.36527066542762,1.2046958555534477,-126.00152585854934,0,0]
[28184,28.184000000000001,12.729088458542421,1.492155072270122,1.0001385353563215,1.6644480456959494E-2,1,0,189.66098670549695,1.5655237367343193,3.8508970218853174,1.308105758722176,1.0052167855479133,0.10192356948190795,1.2254579651800495,0.61630216109574965,1.0099850934429324,0.14073173205134459,1.0495818971823792,0.36579415101896201,2.8266394559011894,-118.02441048156564,61.975589518434361,null,1000000000,794337856,null,12.039787155485019,-20.588754098635032,null,-10.892816799072165,-105.49899068225233,1.1469703564128544,-126.08774478088736,0,0]
[28348,28.347999999999999,12.802701986446989,1.4926081735347105,1.0001401521817599,1.6741315053220296E-2,1,0,190.76457525290402,1.5655542393758757,3.8717980493705908,1.3095570967048773,1.0052775143070516,0.10251251849746461,1.2278450438121111,0.61904147795170683,1.0101010533924606,0.14153977410204244,1.0501489968399531,0.36781571609967278,2.7838773212356416,-118.0666892305611,61.933310769438904,null,1000000000,803609104,null,12.035883770623563,-20.541090523089728,null,-10.947581199906484,-105.63523040602011,1.0883025707170795,-126.17632092910983,0,0]
[28512,28.512,12.876318112702624,1.4930560939745954,1.0001417783854212,1.68381493354882E-2,1,0,191.86816397575876,1.5655843911268219,3.8927071447532522,1.3109928463941249,1.0053385917154996,0.10310139615633472,1.2302413002225463,0.62177014396795405,1.0102176727175833,0.14234763011969012,1.050719129651335,0.36983555338186552,2.7414571428676777,-118.10945177194009,61.890548228059913,null,1000000000,812934144,null,12.032032973972107,-20.494295897982095,null,-11.00208264673727,-105.77107431282508,1.0299503272348378,-126.26537021080718,0,0]
[28676,28.675999999999998,12.949936792997011,1.4934989217654036,1.0001434139672598,1.6934983301948734E-2,1,0,192.97175287105111,1.5656141980072424,3.9136241787216259,1.3124132517656557,1.0054000177097162,0.10369020206314192,1.232646680886748,0.62448818074515067,1.0103349511899729,0.1431552991144262,1.0512922915763756,0.37185365643919116,2.6993739560944485,-118.15268918990203,61.847310810097966,null,1000000000,822312976,null,12.028233567777937,-20.448356566804144,null,-11.0563242826224,-105.90652708665976,0.97190928515553665,-126.3548836534639,0,0]
[28840,28.84,13.023557984018264,1.4939367430970549,1.0001450589272292,1.7031816950787468E-2,1,0,194.07534193583942,1.5656436659002941,3.9345490246652699,1.313818551855757,1.0054617922258144,0.10427893582280526,1.2350611324940681,0.62719561034420734,1.0104528885801165,0.14396278009782329,1.0518684785626966,0.37387001889582294,2.6576228870825744,-118.19639273286742,61.803607267132577,null,1000000000,831745600,null,12.02448438610543,-20.403259148229047,null,-11.110309196796218,-106.04159330063885,0.91417518930921204,-126.44485244886789,0,0]
[29008,29.007999999999999,13.098977372922478,1.4943801399520416,1.0001467537321482,1.7131012064706141E-2,1,0,195.20584797982846,1.5656735070420935,3.9559922032284871,1.3152427099519655,1.0055254347466267,0.10488195372165632,1.237543823170614,0.62995809994481977,1.010574385471307,0.14478975976192668,1.0524618512754766,0.3759337495140494,2.6151928650958585,-118.2416365537472,61.758363446252801,null,1000000000,841464064,null,12.020694651561527,-20.357921051961075,null,-11.165347799725964,-106.17955766233703,0.85534685183556292,-126.5374787142981,0,0]
[29176,29.175999999999998,13.174399307610198,1.4948184600994507,1.0001484583781484,1.7230206841465947E-2,1,0,196.33635419564527,1.5657030045328775,3.9774433189155127,1.3166515093636688,1.0055894428608829,0.10548489507273967,1.2400359201173725,0.63270950693596872,1.0106965733231974,0.1456165400364425,1.0530583897657233,0.37799564020689619,2.5731012885676847,-118.28735143643451,61.712648563565494,null,1000000000,851238976,null,12.016955242622858,-20.313438867878265,null,-11.220123399757702,-106.31712574947568,0.7968318428651564,-126.63056461735394,0,0]
[29344,29.344000000000001,13.24982374460736,1.4952517900666653,1.0001501728651796,1.7329401279116537E-2,1,0,197.46686058033868,1.5657321642748454,3.9989022439961754,1.3180451917067735,1.0056538164987752,0.10608775945232926,1.2425373667372452,0.63544985646879981,1.0108194518852183,0.14644311986356612,1.0536580896383223,0.38005568428554193,2.5313432008270755,-118.33352848638307,61.666471513616926,null,1000000000,861070336,null,12.013265003388149,-20.269799066302312,null,-11.274639149694037,-106.45430213657912,0.73862585369411171,-126.72410120288143,0,0]
[29512,29.512,13.325250641422766,1.4956802144295263,1.0001518971931909,1.7428595375707609E-2,1,0,198.5973671310247,1.5657609920358071,4.0203688534213571,1.3194239936745182,1.0057185555901145,0.10669054643703098,1.2450481066764871,0.63817917415700087,1.010943020905505,0.14726949818710136,1.0542609464853603,0.3821138751168448,2.4899137359998447,-118.38015897469668,61.619841025303316,null,1000000000,870958144,null,12.009622808786011,-20.226988391922024,null,-11.328898148130488,-106.59109128954684,0.68072466065552284,-126.81807968146886,0,0]
[29684,29.684000000000001,13.402475921733082,1.4961138435009071,1.0001536727718114,1.7530150881129834E-2,1,0,199.75479067337119,1.5657901681261677,4.0423544057231755,1.3208204503425065,1.0057852146236406,0.10730760487010266,1.2476281954076784,0.64096207385432558,1.0110702470941615,0.14811534232654203,1.0548814230691148,0.38421914366373694,2.4478333199819908,-118.42836052915146,61.571639470848538,null,1000000000,881139856,null,12.005942525934374,-20.1840038292926,null,-11.384186213445853,-106.73074070600227,0.6217563124885217,-126.91474453529486,0,0]
[29856,29.856000000000002,13.479703693290984,1.496542503966219,1.0001554586655006,1.7631706024921156E-2,1,0,200.91221438379861,1.5658190080588046,4.06434775569228,1.3222017964258956,1.0058522565702173,0.10792458128185638,1.2502179065098431,0.64373346590068259,1.0111981964730328,0.14896097301741196,1.0555051993580835,0.38632245577056457,2.4060873220733838,-118.47701937094193,61.522980629058068,null,1000000000,891380736,null,12.002310311007642,-20.141861079493466,null,-11.439211559624951,-106.86999336726076,0.56309875138269128,-127.01185444675423,0,0]
[30028,30.027999999999999,13.556933913521911,1.49696628058102,1.0001572548742035,1.7733260804988753E-2,1,0,202.06963825941884,1.565847517610049,4.0863487774239822,1.3235682706776373,1.005919681353284,0.10854147521902251,1.2528171803114807,0.64649337921869332,1.0113268687676327,0.14980638913154964,1.0561322705813581,0.38842380450041136,2.3646708023187122,-118.52612664895906,61.473873351040936,null,1000000000,901680784,null,11.998725050852379,-20.100546767977118,null,-11.493977343029746,-107.00885373212203,0.50474770782263256,-127.10940050009916,0,0]
[30200,30.2,13.634166540814618,1.4973852561875385,1.0001590613978644,1.7834815219239842E-2,1,0,203.22706229740933,1.5658757024246441,4.1083573476671154,1.3249201069595027,1.0059874888958638,0.10915828622870363,1.2554259574158417,0.6492418431913719,1.0114562637020641,0.15065158954259292,1.0567626319547152,0.39052318297752392,2.3235789113178602,-118.57567367859528,61.42432632140472,null,1000000000,912040000,null,11.995185662105353,-20.060047792921885,null,-11.548486665564738,-107.14732615326434,0.44669899654061496,-127.20737394618624,0,0]
[30375.75,30.37575,13.713085463031231,1.4978084915253405,1.000160917962629,1.7938583375850355E-2,1,0,204.40972103596113,1.5659041720392124,4.1308534275600248,1.3262865345865251,1.0060571700880927,0.10978845902280281,1.2581013667704719,0.6520384346111644,1.0115892259028805,0.15151499330954457,1.0574101302119421,0.39266629054267627,2.281921490853251,-118.62674632067915,61.373253679320854,null,1000000000,922686188.0625,null,11.991615391910839,-20.01949468706206,null,-11.603922680774216,-107.28842129312658,0.38769271113662285,-127.30791598018864,0,0]
[30551.5,30.551500000000001,13.792006813535817,1.4982268832181265,1.0001627852969166,1.8042351146101615E-2,1,0,205.59237993828472,1.5659323141140069,4.1533571367112616,1.327638157565022,1.0061272507480497,0.11041854427913926,1.2607865738357376,0.65482313544373982,1.0117229420105973,0.15237816949332716,1.058061053508206,0.39480732668742785,2.2405930520705781,-118.67826028207855,61.321739717921446,null,1000000000,933394152.25,null,11.988090819370786,-19.97976604288985,null,-11.659097309430704,-107.42912025106166,0.32899350994008181,-127.40888629395151,0,0]
[30727.25,30.727250000000002,13.870930550879734,1.4986405137972258,1.0001646634006669,1.8146118527761112E-2,1,0,206.77503900157009,1.5659601342691178,4.1758683517788553,1.3289752103422392,1.0061977307922674,0.11104854151575919,1.2634815161440507,0.65759597844956585,1.0118574117263295,0.15324111689816283,1.058715396697641,0.39694628427421336,2.1995887006358696,-118.73020681273476,61.269793187265236,null,1000000000,944163892.5625,null,11.98461087909763,-19.940848721961071,null,-11.714013692300574,-107.56942734694201,0.27059718679705647,-127.51027606890308,0,0]
[30903,30.902999999999999,13.949856634551104,1.4990494639327729,1.0001665522738192,1.8249885518596368E-2,1,0,207.95769822307102,1.5659876379967912,4.1983869520255102,1.3302979225463709,1.0062686101368261,0.11167845025112288,1.266186131534129,0.66035699684007454,1.0119926347496677,0.15410383433027042,1.0593731546206966,0.39908315623205876,2.1589036318703747,-118.78257732846156,61.217422671538444,null,1000000000,954995409,null,11.981174534254626,-19.902729854641652,null,-11.768674915874907,-107.70934679781681,0.21249961837971831,-127.61207665245846,0,0]
[31083,31.082999999999998,14.030693705587819,1.4994635341379534,1.000168497986974,1.83561614033271E-2,1,0,209.16895676190722,1.56601548443234,4.2214576305209999,1.3316379907397287,1.006341617303933,0.11232349924782838,1.2689661122941356,0.66317256056529128,1.0121319082837157,0.15498717443449478,1.060050352685951,0.40126953298208229,2.1175607425497898,-118.83664496098103,61.163355039018967,null,1000000000,966152889,null,11.977699226623212,-19.864503671180646,null,-11.824396641383121,-107.85225227370185,0.1533025852400911,-127.71675594488249,0,0]
[31263,31.263000000000002,14.111533154683841,1.4998728603204332,1.0001704549965518,1.8462436873363207E-2,1,0,210.38021546107041,1.5660430102176317,4.2445358074201129,1.3329634889889284,1.0064150431370682,0.11296845439014085,1.2717561086292062,0.66597579278565278,1.01227197135623,0.15587027078081783,1.0607311216341873,0.40345370721426599,2.0765428419941241,-118.89113962304604,61.108860376953956,null,1000000000,977375169,null,11.974267534816425,-19.827088534661531,null,-11.879857101914792,-107.99475976589149,9.4410432901632646E-2,-127.82184830055301,0,0]
[31443,31.443000000000001,14.192374941203049,1.5002775234097481,1.0001724233024858,1.8568711926306474E-2,1,0,211.59147431780713,1.5660702208593273,4.267621361074653,1.3342746490449977,1.0064888875446034,0.11361331516209974,1.2745560547672232,0.66876673057018488,1.0124128236395229,0.15675312209331374,1.0614154558791558,0.40563567154914582,2.0358450472437677,-118.94605260959801,61.053947390401987,null,1000000000,988662249,null,11.970878432271281,-19.790471452674577,null,-11.935059444050625,-108.13687348863185,3.5818988220656323E-2,-127.92734494130643,0,0]
[31623,31.623000000000001,14.273219025428801,1.5006776025080688,1.0001744029047097,1.8674986559758754E-2,1,0,212.80273332942676,1.5660971217387154,4.2907141724159912,1.3355716978693835,1.0065631504344155,0.11425808104820939,1.2773658852792158,0.67154541142960267,1.0125544648042426,0.15763572709829263,1.0621033498204753,0.40781541868035787,1.9954625649779358,-119.0013753822046,60.9986246177954,null,1000000000,1000014129,null,11.967530920033946,-19.754639700076151,null,-11.990006759778833,-108.27859755565704,-2.2475839744886983E-2,-128.03323725573318,0,0]
[31807,31.806999999999999,14.355861979304795,1.5010819148350893,1.000176438173646,1.8783622415657609E-2,1,0,214.0409093653173,1.5661243057268774,4.3143275373962275,1.3368832163429798,1.006639496049242,0.11491707645671842,1.2802483049965878,0.67437321174283238,1.0127000685779899,0.15853768964538115,1.062810203679786,0.41004130544762069,1.9545036956287973,-119.058342376505,60.941657623495004,null,1000000000,1011685249,null,11.964150993395119,-19.718810410162785,null,-12.04591470031353,-108.42307248715692,-8.1763706918410506E-2,-128.1418828973197,0,0]
[31991,31.991,14.438507253046803,1.5014815987008465,1.0001784852463658,1.8892257828146929E-2,1,0,215.27908555755803,1.5661511770180143,4.3379482425691664,1.3381804542426585,1.0067162787559683,0.11557597162757603,1.2831409161194356,0.67718828494476091,1.0128464959828776,0.15943939213207733,1.0635207653237195,0.41226486016831809,1.9138644572035235,-119.11572004605272,60.884279953947285,null,1000000000,1023424081,null,11.960812499714395,-19.68377567745064,null,-12.101562518289173,-108.56714863633995,-0.14075001857477787,-128.25092431379059,0,0]
[32175,32.174999999999997,14.52115480704518,1.5018767330055871,1.0001805441227964,1.900089279466528E-2,1,0,216.51726190346665,1.5661777409766573,4.3615761686793917,1.3394636392525874,1.0067934984545901,0.11623476601167249,1.2860436498792416,0.67999067244750577,1.0129937466617396,0.16034083320518533,1.0642350287259126,0.41448607527455866,1.8735400065966274,-119.17349978613134,60.826500213868655,null,1000000000,1035230625,null,11.957514455814904,-19.649522732501179,null,-12.156953347322935,-108.71083009039586,-0.19943889150803074,-128.36035282289703,0,0]
[32359,32.359000000000002,14.603804602585846,1.5022673948691792,1.0001826148028652,1.9109527312651305E-2,1,0,217.75543840042187,1.5662040028453275,4.3852111990056573,1.3407329943356958,1.0068711550445653,0.11689345906041594,1.2889564378873806,0.68278041608780482,1.0131418202556111,0.16124201151399312,1.0649529878455992,0.41670494327799318,1.8335255896826466,-119.23167315797723,60.768326842022773,null,1000000000,1047104881,null,11.954255905005095,-19.616039069421866,null,-12.212090266547529,-108.85412083906351,-0.25783436154243411,-128.47015990848539,0,0]
[32547.5,32.547499999999999,14.688478009533297,1.5026630519179609,1.0001847483646711,1.9220818185289628E-2,1,0,219.02389654174658,1.5662305990815764,4.4094315074931432,1.3420192802721806,1.0069511637882198,0.11756815579393061,1.291950817556524,0.68562531984248476,1.0132943681869542,0.162164955617906,1.0656923318173122,0.41897563542227706,1.7928491804926874,-119.29166878629739,60.708331213702607,null,1000000000,1059339756.25,null,11.950957641879249,-19.582521441345591,null,-12.268315505675272,-109.00051489740106,-0.3173578637960226,-128.58303633874664,0,0]
[32736,32.735999999999997,14.773153689522628,1.5030541734312166,1.0001868943143708,1.9332108581746374E-2,1,0,220.29235483621582,1.5662568890319855,4.4336590318084337,1.3432915105947025,1.0070316308388771,0.1182427450109509,1.2949556051937223,0.68845704391806928,1.0134477790083245,0.16308762108594557,1.0664355416058144,0.42124384860109121,1.752488331432869,-119.35206012348957,60.647939876510435,null,1000000000,1071645696,null,11.947698876124996,-19.549785431501466,null,-12.324280635715839,-109.14650708171889,-0.37658175959084339,-128.69629251322036,0,0]
[32924.5,32.924500000000002,14.857831603691228,1.5034408368351664,1.0001890526518842,1.9443398499267829E-2,1,0,221.56081328119927,1.5662828779570721,4.4578936543029348,1.3445499103842034,1.0071125560866825,0.11891722612335061,1.2979707285159907,0.69127563459112784,1.0136020523279208,0.16401000647403483,1.0671826106708737,0.42350957502225456,1.7124382080331997,-119.41283861370781,60.587161386292195,null,1000000000,1084022700.25,null,11.944478660183492,-19.517818411409731,null,-12.37998879721847,-109.29210138191134,-0.43551013703497787,-128.80991979332106,0,0]
[33113,33.113,14.942511714056398,1.5038231178063153,1.0001912233771313,1.9554687935100356E-2,1,0,222.82927187412653,1.5663085709975728,4.4821352598384276,1.3457947000295893,1.0071939394211911,0.11959159854358542,1.3009961156629355,0.69408113854468168,1.0137571877519793,0.16493211034087968,1.0679335324575383,0.42577280698079373,1.6726940649632884,-119.47399586769647,60.526004132303527,null,1000000000,1096470769,null,11.941296072116682,-19.486608014594886,null,-12.435443075887648,-109.43730169261809,-0.49414700377096565,-128.92390970721297,0,0]
[33305.75,33.305750000000003,15.029103290032239,1.5042095631471679,1.0001934558542065,1.9668486048223667E-2,1,0,224.12632981646638,1.5663345425915578,4.5069305303564686,1.3470537061512711,1.0072776312382417,0.12028106263979758,1.3041002535847777,0.69693641297904896,1.0139167119916681,0.16587471173553825,1.0687053619956171,0.42808447932099786,1.6323653873345265,-119.53691509865476,60.46308490134524,null,1000000000,1109272983.0625,null,11.93807970355077,-19.455463722967131,null,-12.491888275026774,-109.58537229694294,-0.55380857147600437,-129.04083601991007,0,0]
[33498.5,33.4985,15.115697084739185,1.5045915808600716,1.0001957012837395,1.9782283651869358E-2,1,0,225.42338790824499,1.5663602153109273,4.531732866611792,1.3482989330576196,1.0073618017958383,0.12097041184670329,1.3072149727606734,0.69977810388510409,1.0140771368098127,0.16681701573219179,1.069481206035823,0.4303935274323909,1.5923468841654658,-119.60021314078202,60.399786859217983,null,1000000000,1122149502.25,null,11.934900807546667,-19.42508521529739,null,-12.54807436925439,-109.73303888882816,-0.61317356170772364,-129.15812410412556,0,0]
[33691.25,33.691249999999997,15.202293060262887,1.504969246495113,1.0001979596656434,1.9896080743093535E-2,1,0,226.72044614689759,1.5663855942851947,4.5565421532229653,1.3495306019287312,1.0074464509739876,0.12165964553802079,1.3103401977347202,0.70260626239707913,1.0142384617790723,0.16775902079894695,1.0702610575238969,0.43269994335908013,1.5526337576676066,-119.66388154021007,60.33611845978993,null,1000000000,1135100326.5625,null,11.93175847627373,-19.395460076915818,null,-12.604004487670524,-109.88030534130448,-0.67224601139679407,-129.27576541822029,0,0]
[33884,33.884,15.288891179547038,1.5053426338957101,1.0002002309998299,2.0009877318952388E-2,1,0,228.01750452991777,1.5664106845271601,4.5813582772758528,1.3507489293189459,1.0075315786520531,0.12234876308811719,1.313475853515859,0.70542094002927624,1.0144006864699808,0.16870072540700431,1.0710449093907546,0.43500371923995623,1.5132212987228932,-119.72791200892561,60.272087991074386,null,1000000000,1148125456,null,11.928651826492448,-19.36657615153883,null,-12.659681704588072,-110.02717543504836,-0.73102987809562414,-129.3937515865872,0,0]
[34081.5,34.081499999999998,15.37762554980729,1.505720860602703,1.0002025717421368,2.0126477682635553E-2,1,0,229.34652688538685,1.5664360987060495,4.6067929297310535,1.3519836633694011,1.0076193003648783,0.12305474165952955,1.3166995238806667,0.70829105162697226,1.014567841717597,0.16966532349149149,1.0718522200296596,0.43736152124971733,1.4731446253277822,-119.79388746704788,60.206112532952119,null,1000000000,1161548642.25,null,11.92550473119911,-19.337736819352447,null,-12.716471824932682,-110.17725762458771,-0.79096709373357221,-129.51499444394017,0,0]
[34279,34.279000000000003,15.466362094678168,1.5060947472947297,1.0002049260827792,2.0243077498982499E-2,1,0,230.67554938727946,1.5664612200406054,4.6322345284221633,1.3532048362172304,1.0077075241933693,0.12376059696719768,1.3199339875791805,0.71114712038906291,1.0147359406577985,0.17062960288652002,1.0726637155691618,0.43971653508576553,1.4333738875873014,-119.86022595940364,60.139774040596365,null,1000000000,1175049841,null,11.92239329601078,-19.309650645605849,null,-12.773002789350155,-110.32693143035976,-0.85060949333937508,-129.63658207596561,0,0]
[34476.5,34.476500000000001,15.555100776943437,1.5064643681430578,1.0002072940216604,2.0359676764826636E-2,1,0,232.00457203307928,1.5664860535634133,4.6576829595221927,1.3544126664752929,1.0077962500056588,0.12446632834022735,1.3231791654596585,0.71398920287300083,1.0149049828216732,0.1715935619576501,1.0734793883582363,0.44206875259997452,1.3939042959700398,-119.92691908698048,60.073080913019524,null,1000000000,1188629052.25,null,11.919316646046759,-19.282305354611331,null,-12.829277733992887,-110.47620063539331,-0.90996108794612773,-129.75850599000464,0,0]
[34674,34.673999999999999,15.643841560230403,1.5068297956407117,1.0002096755586842,2.0476275477001458E-2,1,0,233.33359482032733,1.5665106041924015,4.6831381116480806,1.3556073681610155,1.0078854776691752,0.12517193510845376,1.3264349788840393,0.71681735598746943,1.0150749677379913,0.17255719907390904,1.0742992307309291,0.44441816574794918,1.3547311499056609,-119.9939586171257,60.006041382874301,null,1000000000,1202286276,null,11.916273930214727,-19.255688927452496,null,-12.88529973984388,-110.62506893250423,-0.9690258096291533,-129.88075785995673,0,0]
[34875.75,34.875749999999996,15.734494087668009,1.507198830773032,1.0002121223840907,2.0595382700425716E-2,1,0,234.69121697565893,1.5665353960331292,4.7091478590553031,1.3568144411142604,1.0079771434494733,0.12589259646793771,1.3297717541819845,0.71969204540982468,1.0152495834664546,0.17354123857101056,1.0751410124309175,0.4468152320942318,1.3150163230576242,-120.06279004277468,59.937209957225321,null,1000000000,1216317938.0625,null,11.913199914555083,-19.229240063833604,null,-12.942269268271449,-110.77673053189464,-1.0290693537163662,-130.00597059572826,0,0]
[35077.5,35.077500000000001,15.825148733387941,1.5075636379059352,1.0002145833989673,2.0714489339416154E-2,1,0,236.04883927358071,1.5665599026959749,4.7351643924261548,1.3580082516881709,1.0080693326301544,0.12661312639083816,1.3331194634364985,0.72255232061792618,1.0154251819566662,0.17452493867852342,1.0759871288786353,0.4492093554421967,1.2756011968924783,-120.1319660877072,59.868033912292802,null,1000000000,1230431006.25,null,11.910159586516304,-19.203527208327145,null,-12.998981183220565,-110.92798129686507,-1.0888215967042605,-130.13150850519222,0,0]
[35279.25,35.279249999999998,15.915805461193703,1.5079242891897746,1.0002170586032098,2.0833595390597714E-2,1,0,237.40646171164653,1.5665841290733269,4.7611876005191167,1.3591890139161922,1.0081620450676352,0.12733352416516944,1.3364780244830285,0.72539824330376657,1.0156017626988654,0.17550829766919973,1.0768375718565617,0.45160052755077684,1.2364810351909243,-120.20147848911934,59.798521510880661,null,1000000000,1244625480.5625,null,11.907152110906017,-19.17853833723947,null,-13.055438598447903,-111.07882488934128,-1.1482864875418866,-130.25736322658074,0,0]
[35481,35.481000000000002,{"$f":"SQRT(1+(A397/pole1)^2)","v":16.006464235708002},{"$f":"ATAN(A397/pole1)","v":1.5082808551446796},{"$f":"SQRT(1+(A397/Zero1)^2)","v":1.0002195479967124},{"$f":"ATAN(A397/Zero1)","v":2.0952700850595429E-2},{"$f":"IF(VIN_nom>Vout, 1, SQRT(1+(A397/z_RHP)^2))","v":1},{"$f":"IF(VIN_nom>Vout, 0, -ATAN(A397/z_RHP))","v":0},{"$f":"SQRT(1+(A397/Pole2)^2)","v":238.76408428746578},{"$f":"ATAN(A397/Pole2)","v":1.5666080799463018},4.7872173744832631,1.3603569373240052,{"$f":"SQRT(1+(A397/pole4)^2)","v":1.0082552806175697},{"$f":"ATAN(A397/pole4)","v":0.12805378907975576},{"$f":"SQRT(1+(A397/Zero3)^2)","v":1.3398473557158497},{"$f":"ATAN(A397/Zero3)","v":0.72822987547174478},{"$f":"SQRT(1+(A397/pole5)^2)","v":1.0157793251807945},{"$f":"ATAN(A397/pole5)","v":0.17649131381962818},{"$f":"SQRT((1-(Z397/pterm2))^2+(A397/pterm1)^2)","v":1.0776923331324704},{"$f":"IF((ATAN((A397/pterm1)/(1-A397^2/pterm2))>0),ATAN((A397/pterm1)/(1-A397^2/pterm2)),PI()+ATAN((A397/pterm1)/(1-A397^2/pterm2)))","v":0.45398874029089908},{"$f":"20*LOG10(((E397*K397*G397*O397)/(C397*I397*S397*M397*Q397))*Adc)","v":1.1976511899349638},{"$f":"((F397+L397+H397+R397)-(D397+J397+T397+N397))*radconv","v":-120.27131914894606},{"$f":"IF(V397>0,V397,V397+180)","v":59.728680851053937},null,{"$f":"IF(U397<0,A397,1000000000)","v":1000000000},{"$f":"A397^2","v":1258901361},null,{"$f":"20*LOG10((K397/(I397*M397))*AEA*Afb)","v":11.904176675257808},{"$f":"(L397-(J397+N397))*radconv","v":-19.154261678823769},null,{"$f":"20*LOG10((E397*G397/(C397*S397))*Am)","v":-13.111644572838472},{"$f":"(F397+H397-(D397+T397))*radconv","v":-111.22926488426083},-1.2074678975806634,-130.38352656308459,0,0]
[35687.75,{"$f":"A398/1000","v":35.687750000000001},16.099371907253921,1.5086420915719636,1.0002221138062102,2.1074757501898751E-2,1,0,240.15535316424905,1.5666323434540181,4.8138989487315467,1.3615407000602908,1.0083513694057555,0.12879176584328908,1.3433112786778356,0.73111692341561307,1.0159623062185541,0.17749833471501802,1.0785727496123791,0.45643306178270449,1.1581554455491359,-120.34322294058654,59.656777059413457,null,1000000000,1273615500.0625,null,11.901159913092979,-19.130110220579663,null,-13.168985786178792,-111.38301818139868,{"$f":"AB398+AE398","v":-1.2678258730858136},-130.51312840197835,{"$f":"SUM((U399<0)*(U398>0))*A398","v":0},0]
[35894.5,35.894500000000001,16.192281655526756,1.5089991825659381,1.0002246945167665,2.1196813525176182E-2,1,0,241.54662218078735,1.5666563274540806,4.8405871942979131,1.3627114112327006,1.0084480072470554,0.12952960157049823,1.3467863405516975,0.73398909651517275,1.016146317162969,0.17850499191404534,1.0794576835340344,0.45887425847741919,1.1189549776567238,-120.4154547570903,59.584545242909698,null,1000000000,1288415130.25,null,11.898175141109736,-19.106682466467475,null,-13.226069274192687,-111.53635496100125,-1.3278941330829515,-130.64303742746873,0,0]
[36101.25,36.10125,16.285193444982283,1.5093521989874732,1.0002272901282663,2.1318868916795897E-2,1,0,242.93789133467962,1.5666800367485576,4.8672820014419935,1.3638692823509919,1.0085451939836401,0.13026729549868318,1.3502724553361103,0.73684646241133089,1.0163313574546327,0.17951128357460305,1.0803471259923421,0.46131232199078021,1.0800450591733637,-120.48800639667861,59.511993603321386,null,1000000000,1303300251.5625,null,11.895221554508826,-19.083966529309517,null,-13.282898157463329,-111.68927880292256,-1.3876766029545031,-130.77324533223208,0,0]
[36308,36.308,16.37810724088207,1.5097012100935656,1.000229900640593,2.144092367312618E-2,1,0,244.32916062357947,1.5667034760301422,4.8939832627910977,1.3650145204484088,1.0086429294568451,0.13100484686605451,1.3537695376434673,0.73968908901653463,1.0165174265314179,0.18051720785888281,1.0812410680677107,0.46374724406082085,1.0414210516135884,-120.56086982270912,59.439130177290878,null,1000000000,1318270864,null,11.892298370474661,-19.061950772198877,null,-13.339475501306421,-111.84179320212849,-1.4471771308317596,-130.90374397432737,0,0]
[36519.5,36.519500000000001,16.473157735449526,1.5100541657657227,1.0002325865465638,2.1565781928380382E-2,1,0,245.75239391494659,1.5667271792120991,4.9213045439236422,1.3661732095191403,1.0087434779897848,0.13175919488156709,1.357358224034952,0.74258184380104719,1.0167088343937083,0.1815458608128909,1.0821601946661774,0.46623484848954877,1.0022007665209633,-120.63572166045608,59.364278339543915,null,1000000000,1333673880.25,null,11.889338691861099,-19.040141828513207,null,-13.397095552448274,-111.99739145647682,-1.5077568605871754,-131.03753328499002,0,0]
[36731,36.731000000000002,16.568210258658564,1.5104030716376835,1.0002352880456606,2.1690639511130819E-2,1,0,247.17562734279741,1.5667506094289614,4.9486323592436401,1.3673191028649001,1.0088446004244382,0.13251339210069041,1.3609582088842298,0.7454593188212465,1.0169013176573107,0.18257412543926776,1.0830840110832787,0.46871914836978523,0.9632701361468905,-120.71088327442065,59.289116725579348,null,1000000000,1349166361,null,11.886409239031071,-19.019041746120493,null,-13.454458690837576,-112.15256837621541,-1.5680494518065053,-131.17161012233589,0,0]
[36942.5,36.942500000000003,16.663264775793149,1.510747996929235,1.0002380051377568,2.1815496417490032E-2,1,0,248.59886090478776,1.5667737713688947,4.9759666010945836,1.3684524083218006,1.0089462965882463,0.13326743771090011,1.3645694027690791,0.74832158754746947,1.0170948757116725,0.18360199978467784,1.0840125077261415,0.47120013525200555,0.92462446960975231,-120.78634657254882,59.213653427451177,null,1000000000,1364748306.25,null,11.883509240847243,-18.998638838946537,null,-13.511568026393689,-112.30732744344658,-1.6280587855464468,-131.30596628239311,0,0]
[37154,37.154000000000003,16.758321252924169,1.5110890092934894,1.0002407378227256,2.1940352643570714E-2,1,0,250.02209459862695,1.5667966696133186,5.0033071641475289,1.3695733293140229,1.0090485663077404,0.13402133090068802,1.3681917169343962,0.75116872367223775,1.0172895079432971,0.1846294819005668,1.0849456749879134,0.47367780081909588,0.88625916441727748,-120.86210362706245,59.137896372937547,null,1000000000,1380419716,null,11.880637947280558,-18.978921667644293,null,-13.56842661377468,-112.4616720580953,-1.6877886664941215,-131.4405937257396,0,0]
[37370.25,37.370249999999999,16.8555145601708,1.5114337034733747,1.0002435480020155,2.2068012261874999E-2,1,0,251.47729230374284,1.5668198141392762,5.0312681871568472,1.3707068272616649,1.0091537257055021,0.13479199705995709,1.3719067892561547,0.75406423334434614,1.01748962134082,0.18567963228934936,1.0859046190258068,0.47620766879102761,0.84731740005381284,-120.93985771743328,59.060142282566716,null,1000000000,1396535585.0625,null,11.877731087357169,-18.959459021131305,null,-13.626306033858134,-112.61905798017922,-1.7485749465009643,-131.57851700131053,0,0]
[37586.5,37.586500000000001,16.952709847126247,1.5117744452102424,1.000246374482161,2.2195671160782734E-2,1,0,252.93249014201731,1.5668426923501977,{"$f":"SQRT(1+(A407/Zero2)^2)","v":5.0592356029708112},{"$f":"ATAN(A407/Zero2)","v":1.3718277947002939},1.0092594843411231,0.13556250216309995,1.375633301430385,0.75694407951107789,1.0176908564000025,0.18672936852840261,1.0868684254751388,0.47873404742501457,0.80865927448712893,-121.01790265413099,58.982097345869008,null,1000000000,1412744982.25,null,11.874852714688572,-18.940689833336815,null,-13.68392960340274,-112.77601756083983,-1.8090768887141682,-131.71670739417664,0,0]
[37802.75,37.802750000000003,17.049907079933739,1.5121113020199357,1.0002492172630237,2.2323329336139165E-2,1,0,254.38768811116518,1.5668653088163402,5.0872093061542714,1.3729364354987286,1.0093658420262437,0.13633284534602211,1.3793711607392982,0.75980834154704058,1.0178932124555951,0.18777868855053911,1.0878370840248937,0.48125692825755717,0.77028014171991765,-121.09623047080933,58.903769529190669,null,1000000000,1429047907.5625,null,11.8720020916672,-18.922602635785413,null,-13.741300416307347,-112.93255418376525,-1.8692983246401464,-131.85515681955067,0,0]
[38019,38.018999999999998,17.147106225503471,1.5124443398910039,1.0002520763444647,2.2450986783789692E-2,1,0,255.84288620895327,1.5668876680039825,5.115189193555028,1.3740329491878829,1.0094727985715173,0.13710302574576086,1.3831202751865748,0.76265709899294876,1.0180966888391729,0.18882759029387663,1.0888105843508515,0.48377630296801033,0.73217544377942601,-121.17483336414651,58.825166635853492,null,1000000000,1445444361,null,11.869178500908383,-18.905186202652619,null,-13.798421511334762,-113.08867115332103,-1.9292430104263794,-131.99385735597366,0,0]
[38240.5,38.240499999999997,17.246667068298851,1.5127815713434314,1.0002550217359725,2.2581742670828811E-2,1,0,257.33341294655582,1.5669103078539,5.1438546672362415,1.3751437152226966,1.0095829723955965,0.13789173450698025,1.3869719815325732,0.76555902653040397,1.0183062658661468,0.18990152092035759,1.0898127275076674,0.48635319830762103,0.6934254971439463,-121.25562172283823,58.744378277161772,null,1000000000,1462335840.25,null,11.866313656021802,-18.888030847943654,null,-13.856673595178759,-113.24814655917922,-1.9903599391569564,-132.13617740712289,0,{"$f":"IF(AI410>0,W410,0)","v":0}]
[38462,38.462000000000003,17.346229849957073,1.513114931594326,1.0002579842288413,2.2712497785576508E-2,1,0,258.82393981453868,1.5669326869450704,5.1725264170639953,1.376242168460817,1.0096937741051013,0.13868027065608698,1.3908353030751945,0.76844485689649977,1.0185170168491102,0.1909750083502213,1.0908199284200495,0.48892639800538412,0.65495406663304723,-121.33668261184825,58.663317388151754,null,1000000000,1479325444,null,11.863475710561303,-18.871556134198766,null,-13.914669970548912,-113.40718846109598,-2.051194259987609,-132.27874459529474,0,0]
[38683.5,38.683500000000002,17.445794537282989,1.5134444868488188,1.0002609638229194,2.2843252123568639E-2,1,0,260.31446681066222,1.5669548097566839,5.2012043392461154,1.3773285098967982,1.009805203493346,0.13946863326945658,1.3947101432927969,0.771314675990455,1.0187289410594718,0.19204805038517883,1.0918321759537568,0.49149589358264034,0.61675652838530459,-121.41800815244765,58.581991847552345,null,1000000000,1496413172.25,null,11.860663955400925,-18.855750748997199,null,-13.972413731055402,-113.56580016681038,-2.1117497756544772,-132.42155091580759,0,0]
[38905,38.905000000000001,17.545361097834309,1.5137703018125852,1.0002639605180541,2.2974005680341244E-2,1,0,261.80499393273794,1.5669766806659264,5.2298883322448901,1.37840293623145,1.0099172603525657,0.14025682142473389,1.3985964064472027,0.77416856981591775,1.0189420377651917,0.19312064483286764,1.0928494589623041,0.49406167671570422,0.57882834683750828,-121.49959062877622,58.500409371223782,null,1000000000,1513599025,null,11.857877700922337,-18.840603620159939,null,-14.029907914916457,-113.72398490702818,-2.1720302139941197,-132.56458852718811,0,0]
[39131.5,39.131500000000003,17.647177114637739,1.5140996695157183,1.0002670425429729,2.3107709972149261E-2,1,0,263.32916739326487,1.5669987892359099,5.2592259938707668,1.3794894949605956,1.0100324953714312,0.14106262026833119,1.4025821093289834,0.77707050676437561,1.0191611565088172,0.19421698621022768,1.0938949011033821,0.49668153059967662,0.54031790922556588,-121.58327252446283,58.416727475537172,null,1000000000,1531274292.25,null,11.855054223205483,-18.825783991395628,null,-14.088444953759836,-113.88530216537914,-2.233390730554353,-132.71108615677477,0,0]
[39358,39.357999999999997,17.748995023897333,1.5144252583885118,1.0002701424493929,2.3241413437629747E-2,1,0,264.85334098102265,1.5670206433458445,5.2885697956982183,1.3805639973335817,1.0101483860664124,0.14186823474211133,1.4065795566924355,0.77995597350108492,1.0193814997203958,0.19531285494754244,1.0949455850097405,0.49929748543251073,0.50207980775868666,-121.6672072727953,58.332792727204705,null,1000000000,1549052164,null,11.852256011689004,-18.811629997857086,null,-14.146727274857158,-114.0461795608704,-2.2944712631681536,-132.8578095587275,0,0]
[39584.5,39.584499999999998,17.850814793230377,1.5147471330238713,1.0002732602371478,2.3375116072010076E-2,1,0,266.37751469382744,1.5670422473636605,5.3179196360840058,1.3816266404672368,1.0102649322118653,0.14267366386399277,1.4105886486899977,0.78282506220540615,1.0196030666060802,0.19640824871997145,1.0960014987268818,0.50190953281277662,0.46410946620362015,-121.75138712681762,58.248612873182381,null,1000000000,1566932640.25,null,11.84948238823705,-18.798130539576778,null,-14.204757955192155,-114.20662031330978,-2.3552755669551058,-133.00475085288656,0,0]
[39811,39.811,17.952636390988232,1.5150653565524199,1.0002763959060703,2.3508817870517802E-2,1,0,267.90168852954486,1.5670636055578866,5.3472754155957789,1.3826776172582895,1.0103821335809737,0.1434789066533077,1.4146092863167896,0.78567786509182447,1.0198258563683056,0.19750316520924827,1.0970626302894186,0.50451766450577029,0.42640239631757293,-121.8358045011466,58.164195498853402,null,1000000000,1584915721,null,11.846732693401592,-18.785274752766838,null,-14.262540016481257,-114.36662756827528,-2.4158073230796653,-133.15190232104212,0,0]
[40042.75,40.042749999999998,18.056819952230097,1.5153872414496057,1.0002796227635526,2.3645617847198729E-2,1,0,269.46119102292192,1.5670852087240268,5.3773176728428513,1.3837410762315792,1.0105027294809268,0.1443026201281363,1.4187349652971357,0.78858003232696194,1.0200550750181416,0.19862296414079308,1.0981537457877897,0.50718218828687167,0.38808922617771557,-121.9224166654555,58.077583334544499,null,1000000000,1603421827.5625,null,11.84394336205659,-18.772776117777429,null,-14.32140716228826,-114.52989812032764,-2.4774638002316696,-133.30267423810508,0,0]
[40274.5,40.274500000000003,18.161005362871879,1.5157054332237496,1.0002828683403804,2.378241693870118E-2,1,0,271.02069364060833,1.5671065632730423,5.4073659439617314,1.3847927172816963,1.0106240108470099,0.14512613645980763,1.4228725243245508,0.79146534537106294,1.0202855721900161,0.19974225851801014,1.0992502984461607,0.50984259584486213,0.35004244092885228,-122.0092619236774,57.9907380763226,null,1000000000,1622035350.25,null,11.841177742031949,-18.760929059726326,null,-14.38002025841959,-114.69272128052116,-2.5388425163876409,-133.45365034024749,0,0]
[40506.25,40.506250000000001,18.265192591266423,1.5160199950081428,1.0002861326363717,2.3919215139913678E-2,1,0,272.58019638047062,1.5671276734721247,5.4374201292508468,1.3858327340262082,1.0107459774324719,0.14594945460250716,1.4270218600627194,0.794333902994658,1.0205173470176165,0.20086104587918555,1.1003522754163413,0.51249887889627999,0.31225750602775487,-122.09633265091657,57.903667349083435,null,1000000000,1640756289.0625,null,11.83843518382157,-18.749722669715386,null,-14.438382370002664,-114.85510019181244,-2.5999471861810939,-133.60482286152782,0,0]
[40738,40.738,18.369381606484005,1.5163309885066492,1.0002894156513429,2.4056012445724952E-2,1,0,274.13969924042362,1.5671485434913666,5.4674801311814099,1.3868613159265208,1.010868628989287,0.14677257351199843,1.4311828700812816,0.79718580392748906,1.020750398630617,0.20197932376991218,1.1014596638409337,0.51515102933714507,0.27472997482677519,-122.1836213828996,57.816378617100398,null,1000000000,1659584644,null,11.835715055860977,-18.739146271504023,null,-14.496496506901655,-115.01703792554153,-2.6607814510406786,-133.75618419704554,0,0]
[40975.25,40.975250000000003,18.476045103788465,1.5166457292965829,1.0002927959708001,2.4196055356673372E-2,1,0,275.73621307800903,1.5671696642649591,5.498259456953531,1.3879026570486013,1.0109949006585863,0.1476150195962351,1.4354546183055232,0.80008823619519975,1.0209903028180956,0.20312361085220954,1.1025989255145503,0.5178618326961697,0.23657390959283719,-122.27319989030507,57.726800109694935,null,1000000000,1678971112.5625,null,11.832952966426213,-18.728960556444743,null,-14.555736049538226,-115.18236496844816,-2.722783083112013,-133.9113255248929,0,0]
[41212.5,41.212499999999999,18.582710410351215,1.5169568568741842,1.000296195907884,2.4336097318376087E-2,1,0,277.33272703718075,1.5671905418677656,5.5290446786048157,1.3889324030902641,1.0111218896670329,0.1484572546688035,1.4397383871453173,0.80297342096980762,1.0212315432539243,0.2042673588130697,1.1037438312485695,0.52056828834754187,0.19867845327345651,-122.36299154079867,57.637008459201326,null,1000000000,1698470156.25,null,11.830213100137179,-18.719413167819479,null,-14.614721919349648,-115.34723593862591,-2.7845088192124692,-134.0666491064454,0,0]
[41449.75,41.449750000000002,18.689377495194478,1.5172644330444536,1.000299615462394,2.447613832534986E-2,1,0,278.92924111585074,1.5672111804752957,5.5598356981975048,1.3899507444940626,1.0112495957443834,0.14929927761452838,1.4440340696221565,0.80584146392559852,1.021474118991363,0.20541056504311905,1.1048943672227325,0.5232703881754035,0.16103910835975421,-122.45298882415162,57.547011175848382,null,1000000000,1718081775.0625,null,11.827494834083121,-18.710493369417911,null,-14.673457173712276,-115.51165391255014,-2.8459623396291551,-134.22214728196806,0,0]
[41687,41.686999999999998,18.796046328043158,1.5175685182121241,1.0003030546341292,2.4616178372111698E-2,1,0,280.52575531197903,1.5672315841680053,5.590632419933212,1.3909578676020455,1.0113780186190071,0.15014108731999928,1.448341559730935,0.80869247061296312,1.0217180290793313,0.20655322694111913,1.1060505196096491,0.52596812425717587,0.12365146532709109,-122.54318439011024,57.456815609889759,null,1000000000,1737805969,null,11.8247975626116,-18.702190654626289,null,-14.731944814637652,-115.67562189754099,-2.9071472520260517,-134.37781255216728,0,0]
[41929.75,41.929749999999999,18.905189767869569,1.5178761010147492,1.0003065938382096,2.4759463869272559E-2,1,0,282.15928049410843,1.5672522218776368,5.6221488846440701,1.3919769169029195,1.0115101602614889,0.15100219023608596,1.4527610191997469,0.81159204687241837,1.0219689736759388,0.20772181225553515,1.1072392730594844,0.52872387533541898,8.5653103769226316E-2,-122.63566862448239,57.364331375517608,null,1000000000,1758103935.0625,null,11.822058878262514,-18.694323447040329,null,-14.791535117551092,-115.84292834609259,-2.9694762392885785,-134.53725179313292,0,0]
[42172.5,42.172499999999999,19.014334975729621,1.5181801527006564,1.0003101535791727,2.4902748349572928E-2,1,0,283.79280579503023,1.5672726220039401,5.653671122644143,1.39298460375161,1.011643051740702,0.15186306755792778,1.45719261867127,0.81447401091553606,1.0222213131785118,0.20888982222421421,1.1084338770360165,0.53147504183374716,4.7909183164591362E-2,-122.72834536926911,57.271654630730893,null,1000000000,1778519756.25,null,11.819340943296947,-18.68708072189003,null,-14.8508723798303,-116.00976985774062,-3.0315314365333528,-134.69685057963065,0,0]
[42415.25,42.41525,19.123481921350731,1.5184807336745054,1.0003137338567993,2.5046031807140302E-2,1,0,285.42633121270489,1.567292788626043,5.6851990379014401,1.3939811151197292,1.0117766927611851,0.15272371809865984,1.4616362477220772,0.81733847528341874,1.0224750465542927,0.21005725408740561,1.1096343167093743,0.53422161588736339,1.0415253199045538E-2,-122.8212072462715,57.178792753728501,null,1000000000,1799053432.5625,null,11.816643161463903,-18.680451932205546,null,-14.909959645267882,-116.17614944313392,-3.0933164838039797,-134.85660137533947,42415.25,57.178792753728501]
[42658,42.658000000000001,19.232630575147031,1.5187779029722683,1.0003173346708689,2.5189314236102434E-2,1,0,287.0598567451392,1.5673127257302235,5.7167325364853356,1.3949666339434463,1.0119110830259674,0.15358414067338641,1.4660917969695513,0.82018555230333412,1.0227301727658455,0.21122410509439304,1.1108405772451093,0.53696358983876313,-2.6833048570736564E-2,-122.91424703623682,57.085752963763184,null,42658,1819704964,null,11.813964953073906,-18.674426757023845,null,-14.96879990232391,-116.34207004637827,-3.1548349492500041,-135.01649680340211,0,0]
[42906.5,42.906500000000001,19.344366363610305,1.5190786376804877,1.000321042048776,2.5335989513026305E-2,1,0,288.73207558415805,1.5673329014127362,5.7490186539046366,1.3959642973343582,1.0120494323461013,0.15446470664479076,1.4706651184201085,0.82308217483080159,1.0229927837582753,0.21241799068925518,1.1120814242003219,0.53976574009571709,-6.4713687735240194E-2,-123.00966756255829,56.990332437441708,null,42906.5,1840967742.25,null,11.811242992193183,-18.668873550544618,null,-15.028781113046033,-116.5114483850642,-3.2175381208528506,-135.18032193560882,0,0]
[43155,43.155000000000001,19.456103881509382,1.5193759181420612,1.0003247709470671,2.5482663699586416E-2,1,0,290.40429453935417,1.567352844742228,5.7813104295924198,1.3969508167084217,1.0121885661908756,0.15534503121621893,1.4752507028059025,0.82596081399691113,1.0232568521369267,0.21361126178032827,1.1133283395698876,0.54256305416613138,-0.10234590247153104,-123.10525971407991,56.894740285920093,null,43155,1862354025,null,11.808540364525273,-18.663931705151064,null,-15.08850964042548,-116.68035177939096,-3.279969275900207,-135.34428348454202,0,0]
[43403.5,43.403500000000001,19.567843099217662,1.5196698034788525,1.0003285213655013,2.5629336789484099E-2,1,0,292.076513608732,1.5673725597095391,5.8136077692618651,1.3979263758601053,1.0123284842368161,0.15622511312303439,1.4798484361300117,0.82882158948878837,1.0235223767737849,0.21480391544637045,1.1145813074303781,0.54535552450257485,-0.13973409948654994,-123.20101623908732,56.798983760912677,null,43403.5,1883863812.25,null,11.8058564986727,-18.659590846395783,null,-15.147988518304224,-116.84878318471674,-3.3421320196315243,-135.50837403111251,0,0]
[43652,43.652000000000001,19.679583987780973,1.5199603514723241,1.0003322933038368,2.5776008776420965E-2,1,0,293.74873279034159,1.567392050214637,5.845910580693733,1.3988911546059994,1.0124691861588053,0.15710495110280145,1.4844582055076618,0.83166462068233271,1.0237893565357872,0.21599594877618786,1.1158403118568549,0.54814314377993345,-0.17688259757589181,-123.29693004406403,56.703069955935973,null,43652,1905497104,null,11.803190839158763,-18.655840822666502,null,-15.207220725130487,-117.01674549233827,-3.404029885971724,-135.67258631500476,0,0]
[43906,43.905999999999999,19.793799711998975,1.5202539399386061,1.0003361709650787,2.5925925878233006E-2,1,0,295.45796297327189,1.5674117440976743,5.8789339045462636,1.3998663288053301,1.0126138119597514,0.15800400896083119,1.4891823241980156,0.8345523623008041,1.0240637479122832,0.21721372103442199,1.1171334034464897,0.55098744017507961,-0.2146099866375431,-123.39512200659021,56.604877993409787,null,43906,1927736836,null,11.800484434208482,-18.652608053934539,null,-15.267512029714744,-117.18794343448106,-3.4670275955062628,-135.8405514884156,0,0]
[44160,44.16,19.908017122750877,1.5205441596446934,1.000340071108839,2.6075841814415447E-2,1,0,297.16719326947708,1.5674312114322824,5.9119627565973047,1.4008306077401813,1.0127592560273817,0.15890280931475675,1.4939187826569684,0.83742181659475257,1.0243396571289287,0.21843083907496341,1.118432768126693,0.55382665362914651,-0.2520958006079474,-123.4934637915063,56.506536208493699,null,44160,1950105600,null,11.797795925586545,-18.649971803707402,null,-15.327551744086314,-117.35865719659623,-3.529755818499769,-136.00862900030364,0,0]
[44414,44.414000000000001,20.022236191174041,1.520831068193673,1.0003439937348546,2.622575657824331E-2,1,0,298.87642367701369,1.567450456105238,5.9449970447071729,1.4017841712258294,1.0129055180092086,0.15980135082364064,1.4986674638869866,0.84027310992273785,1.0246170829595505,0.21964729982175876,1.1197383888923238,0.55666077703083627,-0.28934437966006915,-123.59194831161837,56.408051688381633,null,44414,1972603396,null,11.795124768365744,-18.647921915194466,null,-15.387342877563551,-117.52888967203556,-3.5922181091978072,-136.17681158723002,0,0]
[44668,44.667999999999999,20.136456889060273,1.5211147218838652,1.0003479388428611,2.6375670162991922E-2,1,0,300.58565419398258,1.5674694819149126,5.9780366787578192,1.4027271951812452,1.0130525975509672,0.16069963214898933,1.5034282520686928,0.84310636823014118,1.024896024172566,0.22086310020985722,1.1210502487403786,0.55948980350534538,-0.32635997656947274,-123.69056863620534,56.309431363794658,null,44668,1995230224,null,11.792470432828894,-18.646448449921795,null,-15.446888384359713,-117.69864369294322,-3.6544179515308191,-136.34509214286501,0,0]
[44928.25,44.928249999999998,20.253489796885155,1.5214020368006826,1.0003520043436922,2.6529271336275747E-2,1,0,302.33694266003891,1.5674887527533485,6.0118947486356973,1.4036826717093291,1.0132041437867323,0.16161974559076797,1.5083186232219707,0.84599076764717007,1.0251833995760606,0.22210812882063971,1.1224008420795519,0.56238314831482383,-0.36404909580061012,-123.79174941309087,56.208250586909131,null,44928.25,2018547648.0625,null,11.789767693115383,-18.645526432034949,null,-15.507647351360133,-117.872081372568,-3.7178796582447493,-136.51760780460296,0,0]
[45188.5,45.188499999999998,20.37052435742164,1.5216860503259482,1.0003560934459568,2.6682871257448827E-2,1,0,304.08823123707953,1.5675078016246402,6.0457582455079901,1.4046274454629706,1.0133565475530009,0.16253958305015712,1.5132214620537399,0.84885649986481071,1.0254723632203855,0.22335245769635353,1.123757949191754,0.56527112842018856,-0.40150239265652465,-123.89305851627485,56.106941483725151,null,45188.5,2042000532.25,null,11.787081534040373,-18.645189107546706,null,-15.568154562170998,-118.04502259322634,-3.7810730281306242,-136.69021170077303,0,0]
[45448.75,45.448749999999997,20.487560542346539,1.5219668189915241,1.000360206149365,2.6836469919278818E-2,1,0,305.83951992319766,1.5675266323418373,6.0796270786896915,1.4055616936127218,1.0135098084629268,0.163459143095459,1.518136647770495,0.85170369889864384,1.0257629137632893,0.2245960835766683,1.1251215518008106,0.56815373718854367,-0.43872416919358248,-123.99448897729154,56.005511022708461,null,45448.75,2065588876.5625,null,11.784411432302306,-18.645426461773592,null,-15.628413022656613,-118.21747021433285,-3.8440015903543063,-136.86289667610643,0,0]
[45709,45.709000000000003,20.604598323979786,1.5222443980469025,1.0003643424536259,2.6990067314533725E-2,1,0,307.59080871653038,1.5675452486311514,6.1135011594912445,1.4064855894768504,1.0136639261277223,0.16437842429771593,1.5230640608357722,0.85453249823842825,1.0260550498566741,0.22583900321363445,1.1264916316370082,0.57103096824045796,-0.47571863976980344,-124.09603398391501,55.903966016084993,null,45709,2089312681,null,11.781756879269054,-18.646228695933271,null,-15.688425683348243,-118.38942703635013,-3.9066688040791888,-137.0356557322834,0,0]
[45975.25,45.975250000000003,20.724336007140273,1.5225251321653146,1.0003685985423558,2.7147204541857806E-2,1,0,309.38247315305534,1.5675640760114198,6.1481615389665567,1.4074202492975652,1.0138224831410412,0.1653186092555371,1.5281176043026554,0.85740761260431075,1.0263555604678076,0.22710984382998636,1.1278999822292555,0.57396896164235822,-0.5133350866070121,-124.20003167913565,55.799968320864352,null,45975.25,2113723612.5625,null,11.779056701187541,-18.647623992400963,null,-15.749570575955666,-118.56484323893697,-3.970513874768125,-137.21246723133794,0,0]
[46241.5,46.241500000000002,20.844075304854677,1.522802640937442,1.000372879332085,2.7304340428220483E-2,1,0,311.17413769798435,1.567582686584797,6.1828272291870023,1.4083444290728211,1.0139819360397375,0.16625849934792408,1.5331836962888794,0.8602637499952116,1.0266577277080426,0.22837993842565057,1.1293150734937374,0.57690131380196441,-0.55072227688503816,-124.30413532262951,55.695864677370494,null,46241.5,2138276322.25,null,11.776371764995844,-18.649590434578464,null,-15.81046428002406,-118.73975150025051,-4.0340925150282168,-137.38934193482896,0,0]
[46507.75,46.507750000000001,20.963816189457386,1.5230769795876591,1.000377184822496,2.7461474965879119E-2,1,0,312.96580234945566,1.5676010840747945,6.2174981413223289,1.409258302531603,1.0141422844012336,0.16719809305376943,1.5382622128130774,0.86310105153780903,1.026961550115068,0.22964928356327574,1.130736885895357,0.57982801869977241,-0.58788445134952483,-124.40833810326833,55.591661896731665,null,46507.75,2162970810.0625,null,11.773701570658663,-18.652118194716611,null,-15.871109783297396,-118.91415463996562,-4.097408212638733,-137.56627283468222,0,0]
[46774,46.774000000000001,21.083558633910929,1.5233482020877045,1.0003815150132702,2.7618608147091477E-2,1,0,314.75746710564977,1.5676192721201436,6.2521741884994526,1.41016203961846,1.0143035278008452,0.168137388855018,1.5433530312236887,0.86591965771662571,1.0272670262202976,0.23091787581922638,1.1321653999105061,0.58274907058566405,-0.62482576331998851,-124.5126333649512,55.487366635048801,null,46774,2187807076,null,11.771045632199947,-18.655197657215769,null,-15.931510018314238,-119.08805542142132,-4.1604643861142918,-137.74325307863708,0,0]
[47046.25,47.046250000000001,21.206001085093334,1.5236223693218403,1.0003859683270511,2.7779280947031571E-2,1,0,316.58950751208249,1.5676376571639095,6.2876368891381809,1.4110758342221283,1.0144693299300787,0.16909754225700052,1.5485711667504174,0.86878259538614833,1.0275810947753126,0.23221427399489378,1.1336330153123961,0.58573009774727247,-0.66237540878784096,-124.61936779699124,55.380632203008759,null,47046.25,2213349639.0625,null,11.768344090937063,-18.658907206120652,null,-15.99302076278793,-119.26535844867556,-4.224676671850867,-137.92426565479622,0,0]
[47318.5,47.3185,21.328445111979654,1.5238933886542108,1.0003904474663141,2.7939952312329562E-2,1,0,318.42154802429422,1.5676558306507362,6.3231047811885901,1.4119793781636907,1.0146360669869072,0.17005738097597575,1.5538019096921278,0.87162628055733571,1.0278968892756297,0.23350987777787319,1.1351075965301485,0.58870520293551543,-0.69970263727598292,-124.7261853293609,55.273814670639098,null,47318.5,2239040442.25,null,11.765656470634131,-18.663173923374131,null,-16.054281090386297,-119.44214189256249,-4.2886246197521665,-138.10531581593662,0,0]
[47590.75,47.59075,21.450890687587023,1.5241613139510404,1.000394952430713,2.8100622234709223E-2,1,0,320.25358864046956,1.5676737962113054,6.3585777777782218,1.412872841513408,1.014803738510492,0.17101690339891287,1.5590451331516386,0.87445086125118399,1.0282144081309854,0.23480468355254652,1.1365891227345839,0.59167438086253432,-0.73681161878686496,-124.83307932432396,55.166920675676039,null,47590.75,2264879485.5625,null,11.762982294374755,-18.667988180270871,null,-16.115293965531816,-119.61840853689155,-4.3523116711570609,-138.28639671716243,0,0]
[47863,47.863,21.573337785544826,1.5244261978574067,1.0003994832198981,2.8261290705894775E-2,1,0,322.08562935883452,1.5676915573936931,6.3940557939500584,1.4137563906321333,1.0149723440377159,0.17197610791617363,1.5643007116323484,0.87725648472592432,1.0285336497444013,0.2360986877184513,1.1380775731137898,0.59463762652551555,-0.77370643638554382,-124.94004329763622,55.059956702363777,null,47863,2290866769,null,11.760321098688438,-18.673340556100431,null,-16.17606229769731,-119.79416111183765,-4.4157411990088722,-138.46750166793808,0,0]
[48141.75,48.141750000000002,21.698709872410163,1.5246943084527496,1.0004041489388305,2.8425793643050944E-2,1,0,323.96141036370767,1.5677095344916812,6.4303859658407667,1.4146509324217866,1.0151459422742235,0.17295788249261462,1.5696944390570411,0.8801096042250276,1.0288622965588077,0.2374227520932051,1.1396087128226611,0.5976654686860654,-0.8112644021925941,-125.04962693801572,54.95037306198428,null,48141.75,2317628093.0625,null,11.757609345429444,-18.679368638468016,null,-16.238031092456229,-119.97357997041325,-4.4804217470267851,-138.65294860888127,0,0]
[48420.5,48.420499999999997,21.824083501129341,1.5249593386170326,1.0004088417296628,2.8590295041333907E-2,1,0,325.83719147207188,1.5677273046083866,6.4667212255397013,1.415535422396927,1.0153205186557925,0.17393932039793386,1.5751008566790112,0.8829431604135981,1.0291927459657098,0.23874596853511146,1.141147067188595,0.60068708222490863,-0.84860624802408513,-125.15927065766466,54.840729342335337,null,48420.5,2344544820.25,null,11.75491025794123,-18.685941498395984,null,-16.299749529746379,-120.15246554772443,-4.5448392718051487,-138.83840704612041,0,0]
[48699.25,48.699249999999999,21.949458645281513,1.5252213410988988,1.0004135615920144,2.8754794891862338E-2,1,0,327.71297268215011,1.5677448712979902,6.5030614877638753,1.4164100276758846,1.0154960726779565,0.17492041991557286,1.5805198342717937,0.88575730878064463,1.0295249962293589,0.24006833322925583,1.1426926139369415,0.60370246268513383,-0.88573608630276635,-125.26896797269583,54.731032027304167,null,48699.25,2371616950.5625,null,11.75222337974281,-18.693049665997318,null,-16.36122056161258,-120.33082061119242,-4.6089971818697695,-139.02387027718973,0,0]
[48978,48.978000000000002,22.074835279045747,1.5254803674503072,1.0004183085255021,2.891929318575541E-2,1,0,329.58875399220574,1.5677622380337621,6.5394066691144044,1.4172749117229615,1.0156726038337744,0.17590117933276242,1.5859512430883083,0.88855220392215284,1.0298590456067926,0.24138984237754865,1.1442453308170624,0.60671160591226381,-0.92265794259635725,-125.37871255196289,54.621287448037108,null,48978,2398844484,null,11.74954826727838,-18.700683876326664,null,-16.422447085137254,-120.50864787700175,-4.672898817858874,-139.2093317533284,0,0]
[49263.25,49.263249999999999,22.203137009300505,1.5257424054043831,1.0004231941747921,2.9087625693533573E-2,1,0,331.50827559597565,1.5677798062728376,6.5766043688562279,1.4181500663808704,1.0158542624567632,0.1769044546045348,1.5915220402229788,0.89139249995500858,1.0302027451820446,0.24274127733759393,1.14584165423568,0.60978445638960177,-0.96022955461339832,-125.49105867900624,54.508941320993756,null,49263.25,2426867800.5625,null,11.746822506335175,-18.709031232731707,null,-16.484851151409508,-120.69007816722555,-4.7380286450743334,-139.39910939995727,0,0]
[49548.5,49.548499999999997,22.331440246590784,1.5260014323461164,1.0004281081716295,2.9255956552418621E-2,1,0,333.42779730088529,1.5677971722335453,6.6138070489300516,1.419015376201334,1.0160369432330738,0.17790737011297877,1.5971055869857256,0.8942129590257476,1.0305483250382976,0.24409180839350883,1.1474454390147051,0.61285076751352596,-0.99759163145826135,-125.60344135978379,54.396558640216213,null,49548.5,2455053852.25,null,11.744108166081977,-18.717910454155856,null,-16.547005140793388,-120.87096135627267,-4.8028969747114107,-139.58887181042854,0,0]
[49833.75,49.833750000000002,22.459744965089371,1.5262574998430483,1.0004330505155965,2.9424285752895511E-2,1,0,335.34731910519776,1.5678143393893873,6.6510146257629001,1.419871005101597,1.0162206456114649,0.1789099240351151,1.602701750123793,0.89701374382026211,1.0308957832846126,0.24544143153024889,1.1490566613964888,0.61591053579752297,-1.0347482176555638,-125.7158542825276,54.284145717472398,null,49833.75,2483402639.0625,null,11.741404810523628,-18.727312243400796,null,-16.608911987286305,-121.05130019952827,-4.8675071767626772,-139.77861244292907,0,0]
[50119,50.119,22.588051139555578,1.5265106582926236,1.0004380212062731,2.9592613285449779E-2,1,0,337.26684100721582,1.5678313111347899,6.6882270176306315,1.4207171134082721,1.016405369038011,0.17991211455218617,1.6083103979400439,0.8997950159974426,1.0312451180223268,0.24679014275139613,1.1506752976550703,0.61896375807441251,-1.0717032712055237,-125.82829128709633,54.171708712903666,null,50119,2511914161,null,11.738712016060459,-18.737227504707437,null,-16.670574570053088,-121.23109740363236,-4.9318625539926284,-139.96832490833981,0,0]
[50410.75,50.41075,22.719282510930682,1.5267666275729894,1.0004431344867566,2.9764774767074249E-2,1,0,339.23010320967353,1.5678484709329055,6.7262922669175289,1.4215728169712976,1.016595357395687,0.18093676420151492,1.6140596291743421,0.90261964787852222,1.0316043521918743,0.24816863962614177,1.1523384623419339,0.62207977979323359,-1.1092959840442735,-125.94330904247037,54.056690957529625,null,50410.75,2541243715.5625,null,11.735968356680456,-18.747890586439368,null,-16.73339252848432,-121.41443413035958,-4.9974241718038641,-140.16232471679893,0,0]
[50702.5,50.702500000000001,22.850515353781443,1.527019656754349,1.0004482774196464,2.9936934483764995E-2,1,0,341.19336551087099,1.5678654332524808,6.7643623859546294,1.4224188892759926,1.0167864126843282,0.18196102986029236,1.6198216467820976,0.9054242064841953,1.0319655453043743,0.24954617415540054,1.1540093325380616,0.6251889480850803,-1.1466859818669419,-126.05833942432606,53.941660575673936,null,50702.5,2570743506.25,null,11.733234886801053,-18.759072182900763,null,-16.7959608865349,-121.59720983050413,-5.0627259997338463,-140.35628201340489,0,0]
[50994.25,50.994250000000001,22.981749642900127,1.5272697961711799,1.0004534500044855,3.0109092425344031E-2,1,0,343.15662790911335,1.5678822014829394,6.8024372929806676,1.4232554908263044,1.0169785343026161,0.18298490959638714,1.6255963147972556,0.90820886138156121,1.0323286953036308,0.25092274212402554,1.155687882969676,0.62829126057739637,-1.1838772317957849,-126.17337631007035,53.826623689929647,null,50994.25,2600413533.0625,null,11.73051119083719,-18.770763181389533,null,-16.858282554943411,-121.77942725266489,-5.1277713641062217,-140.55019043405443,0,0]
[51286,51.286000000000001,{"$f":"SQRT(1+(A461/pole1)^2)","v":23.11298535365124},{"$f":"ATAN(A461/pole1)","v":1.5275170950162265},{"$f":"SQRT(1+(A461/Zero1)^2)","v":1.0004586522408137},{"$f":"ATAN(A461/Zero1)","v":3.0281248581634029E-2},{"$f":"IF(VIN_nom>Vout, 1, SQRT(1+(A461/z_RHP)^2))","v":1},{"$f":"IF(VIN_nom>Vout, 0, -ATAN(A461/z_RHP))","v":0},{"$f":"SQRT(1+(A461/Pole2)^2)","v":345.1198904027446},{"$f":"ATAN(A461/Pole2)","v":1.5678987789365808},6.8405169080445631,1.4240827786059296,{"$f":"SQRT(1+(A461/pole4)^2)","v":1.017171721646331},{"$f":"ATAN(A461/pole4)","v":0.18400840148236014},{"$f":"SQRT(1+(A461/Zero3)^2)","v":1.6313834988824885},{"$f":"ATAN(A461/Zero3)","v":0.9109737809742412},{"$f":"SQRT(1+(A461/pole5)^2)","v":1.032693800125208},{"$f":"ATAN(A461/pole5)","v":0.25229833933743556},{"$f":"SQRT((1-(Z461/pterm2))^2+(A461/pterm1)^2)","v":1.1573740884033368},{"$f":"IF((ATAN((A461/pterm1)/(1-A461^2/pterm2))>0),ATAN((A461/pterm1)/(1-A461^2/pterm2)),PI()+ATAN((A461/pterm1)/(1-A461^2/pterm2)))","v":0.63138671523316436},{"$f":"20*LOG10(((E461*K461*G461*O461)/(C461*I461*S461*M461*Q461))*Adc)","v":-1.2208736149982675},{"$f":"((F461+L461+H461+R461)-(D461+J461+T461+N461))*radconv","v":-126.28841372728569},{"$f":"IF(V461>0,V461,V461+180)","v":53.711586272714314},null,{"$f":"IF(U461<0,A461,1000000000)","v":51286},{"$f":"A461^2","v":2630253796},null,{"$f":"20*LOG10((K461/(I461*M461))*AEA*Afb)","v":11.727796865065612},{"$f":"(L461-(J461+N461))*radconv","v":-18.78295466674906},null,{"$f":"20*LOG10((E461*G461/(C461*S461))*Am)","v":-16.920360389880358},{"$f":"(F461+H461-(D461+T461))*radconv","v":-121.96108909924912},-5.1925635248147461,-140.74404376599819,0,0]
[51584.75,{"$f":"A462/1000","v":51.58475},23.247371269872076,1.5277674339367313,1.0004640100218409,3.0457533444827611E-2,1,0,347.13025783485551,1.5679155598189061,6.879514969996932,1.4249204243506735,1.0173706479151126,0.18505604622860958,1.6373223672039856,0.91378476310737811,1.0330696885330914,0.25370593112229944,1.1591086576008045,0.63454933117975298,-1.2585596877479908,-126.40620571999236,53.593794280007643,null,51584.75,2660986432.5625,null,11.725026714540178,-18.795948196985872,null,-16.983677915613889,-122.1465366303611,{"$f":"AB462+AE462","v":-5.258651201073711},-140.94248482734696,{"$f":"SUM((U463<0)*(U462>0))*A462","v":0},0]
[51883.5,51.883499999999998,23.381758626248736,1.5280148952117441,1.0004693988933075,3.063381641443786E-2,1,0,349.14062536359194,1.5679321474510755,6.918517804544229,1.425748626290269,1.0175706903714326,0.18610328021455946,1.6432740794527241,0.91657540517853997,1.0334476222857392,0.255112496174354,1.1608512001252718,0.63770475299956442,-1.2960494002302871,-126.52398606153436,53.476013938465641,null,51883.5,2691897572.25,null,11.722265568873011,-18.809448210150943,null,-17.046745658595583,-122.33140719992348,-5.3244800897225719,-141.14085541007441,0,0]
[52182.25,52.182250000000003,23.516147398091114,1.5282595281457201,1.0004748188547108,3.0810097479539226E-2,1,0,351.15099298729433,1.5679485451521979,6.9575253314231205,1.4265675421196329,1.0177718483571332,0.18715010138609298,1.6492384965766089,0.91934588416388285,1.0338275991400168,0.2565180300571156,1.1626016890235427,0.64085297957594178,-1.3333466528361406,-126.64174880491257,53.358251195087433,null,52182.25,2722987215.0625,null,11.719513030742227,-18.82344574346978,null,-17.10956651594153,-122.51570356951974,-5.3900534851993029,-141.33914931298952,0,0]
[52481,52.481000000000002,23.650537561270017,1.5285013809238293,1.0004802699055457,3.0986376629206884E-2,1,0,353.16136070434078,1.5679647561658063,6.9965374721506768,1.4273773260669618,1.0179741212109077,0.18819650769433147,1.6552154812330901,0.92209637572958525,1.0342096168439683,0.25792252835689938,1.1643600973927544,0.64399401014541513,-1.3704552602341737,-126.75948815252559,53.240511847474409,null,52481,2754255361,null,11.71676871422938,-18.837932028766264,null,-17.17214333023086,-122.69942845683913,-5.45537461600148,-141.5373604856054,0,0]
[52786.5,52.786499999999997,23.787965569189858,1.5287458721358866,1.0004858762686946,3.1166636662838292E-2,1,0,355.21715105046013,1.567981143693743,7.036435750170984,1.4281961198467525,1.0181821164908622,0.18926612549686189,1.6613403660685195,0.9248885240277418,1.0346023740921666,0.25935768457176411,1.1661663974068908,0.64719856745173909,-1.4082111050078963,-126.87985763699747,53.120142363002529,null,52786.5,2786414582.25,null,11.713970504047362,-18.853242122874658,null,-17.235884543692283,-122.88671624135029,-5.5219140396449209,-141.73995836422495,0,0]
[53092,53.091999999999999,23.925394982722544,1.5289875546074625,1.0004915151409461,3.1346894670399007E-2,1,0,357.27294149087561,1.5679973426301654,7.0763386923838096,1.4290056799309923,1.0183912761782898,0.19033530516077113,1.6674781076590217,0.92766013882722942,1.0349972606634688,0.26079174861688043,1.1679809220692199,0.65039559940088298,-1.4457774863271928,-127.00019085688332,52.999809143116678,null,53092,2818760464,null,11.711180109871314,-18.869045359776351,null,-17.299376404697732,-123.07341204176494,-5.5881962948264174,-141.94245740154128,0,0]
[53397.5,53.397500000000001,24.062825777784564,1.5292264764350292,1.0004971865217507,3.152715064020916E-2,1,0,359.32873202396877,1.5680133562119727,7.1162462203285468,1.4298061605957149,1.0186015995558924,0.19140404451226237,1.6736285645548656,0.9304114036878135,1.0353942741215827,0.26222471584683604,1.1698036427845189,0.65358510629616562,-1.4831582185269188,-127.12048207366432,52.87951792633568,null,53397.5,2851293006.25,null,11.708397153626963,-18.885332961016967,null,-17.362621784223965,-123.25951863185615,-5.6542246305970014,-142.14485159287312,0,0]
[53703,53.703000000000003,24.200257930839214,1.5294626846237864,1.0005028904105555,3.170740456058968E-2,1,0,361.384522648158,1.5680291876024102,7.1561582572858642,1.4305977127223177,1.0188130859029745,0.19247234138335226,1.6797915970870576,0.93314250071604599,1.035793412020839,0.26365658164133943,1.1716345310188625,0.6567670888094882,-1.5203570309922996,-127.24072569658648,52.75927430341352,null,53703,2884012209,null,11.705621268141908,-18.902096338753541,null,-17.425623499064191,-123.44503874398968,-5.7200022309222831,-142.34713508274322,0,0]
[54015.75,54.015749999999997,24.340952949767861,1.5297017353696671,1.0005087633354703,3.1891934057510937E-2,1,0,363.4891005403037,1.5680452091961681,7.1970220627120884,1.4313989548158674,1.0190307950964395,0.19356553002162963,1.6861137710250866,0.93591770818186715,1.0362042201967803,0.26512128213300096,1.1735172999733792,0.6600167915542976,-1.5582539902210701,-127.36376790427265,52.636232095727351,null,54015.75,2917701248.0625,null,11.702786458654408,-18.919741613333432,null,-17.489870822876693,-123.63435683361486,-5.7870843642222844,-142.5540984469483,0,0]
[54328.5,54.328499999999998,24.481649343678829,1.5299380384727137,1.0005146703284438,3.2076461381808037E-2,1,0,365.59367852467972,1.5680610463299927,{"$f":"SQRT(1+(A471/Zero2)^2)","v":7.2378904363728571},{"$f":"ATAN(A471/Zero2)","v":1.4321911490692165},1.0192497215731831,0.19465825034940992,1.692448833956987,0.93867216078247584,1.0366172496261552,0.26658481857283151,1.1754085683881961,0.66325861113773332,-1.5959679386299004,-127.48674883355065,52.513251166449351,null,54328.5,2951585912.25,null,11.69995831423379,-18.937867889980414,null,-17.55386858540416,-123.82306594750756,-5.8539102711703705,-142.76093383748798,0,0]
[54641.25,54.641249999999999,24.622347089001451,1.5301716410082939,1.0005206113888723,3.2260986520953133E-2,1,0,367.69825659970235,1.5680767021712312,7.2787633013198034,1.4329744469001755,1.0194698645489877,0.19575050005974129,1.6987966416878941,0.94140604914803383,1.0370324976549206,0.26804718608583528,1.1773083058588003,0.66649254945185821,-1.6335026141618048,-127.60966294377754,52.390337056222464,null,54641.25,2985666201.5625,null,11.697136474146371,-18.956466542390032,null,-17.617619640589414,-124.01116889201271,-5.9204831664430433,-142.96763543440272,0,0]
[54954,54.954000000000001,24.76304616270053,1.5304025889830752,1.000526586516149,3.2445509462419274E-2,1,0,369.80283476382397,1.5680921798151288,7.3196405823149195,1.4337489963883496,1.0196912232359563,0.19684227685215008,1.7051570518821855,0.94411956230258887,1.0374499616190371,0.26950837982479875,1.1792164820545479,0.66971860877382439,-1.6708616702797607,-127.73250484105567,52.267495158944328,null,54954,3019942116,null,11.694320588126629,-18.975529131762915,null,-17.681126788328669,-124.19866843430715,-5.9868062002020395,-143.17419756607006,0,0]
[55274,55.274000000000001,24.907008197065192,1.5306361899863237,1.0005327354155127,3.2634307626366557E-2,1,0,371.95620020224993,1.5681078349667674,7.3614699522121718,1.4345325972146514,1.0199189708244218,0.19795887073692159,1.7116778031665238,0.94687508493741801,1.0378793937997415,0.27100222622968356,1.1811775954191457,0.67301130053925007,-1.708908714667507,-127.85811417293101,52.14188582706899,null,55274,3055215076,null,11.691445233753416,-18.995505202759738,null,-17.745856535026661,-124.38989278952421,-6.0544113012732446,-143.38539799228394,0,{"$f":"IF(AI474>0,W474,0)","v":0}]
[55594,55.594000000000001,25.050971574969463,1.530867106077086,1.0005389199781731,3.2823103463033042E-2,1,0,374.10956573078693,1.5681233098970684,7.4033037911943609,1.4353073427278862,1.0201479894607031,0.19907496467208738,1.7182114523541385,0.94960967197322999,1.0383111401694758,0.27249483363270516,1.1831474792886916,0.676295749821751,-1.7467793793988879,-127.98363693522974,52.01636306477026,null,55594,3090692836,null,11.688575402895427,-19.015949674897701,null,-17.810336697565155,-124.58049118444579,-6.121761294669728,-143.59644085934349,0,0]
[55914,55.914000000000001,25.19493627338246,1.5310953832555589,1.0005451402034693,3.3011896959003188E-2,1,0,376.26293134788773,1.568138607700263,7.4451420239268682,1.4360733812782871,1.0203782782889594,0.20019055621466092,1.7247578528672856,0.95232352066456816,1.0387451978426157,0.27398619693227849,1.18512610142428,0.67957196027975098,-1.7844773167254773,-128.10906780372042,51.890932196279579,null,55914,3126375396,null,11.685710752181178,-19.036854085648123,null,-17.874570107702553,-124.77046646506993,-6.1888593555213749,-143.80732055071806,0,0]
[56234,56.234000000000002,25.338902269796506,1.5313210664776309,1.0005513960907355,3.3200688100862449E-2,1,0,378.41629705204048,1.5681537314001521,7.4869845767511682,1.4368308579411435,1.0206098364493785,0.20130564292885664,1.7313168600612456,0.95501682650745279,1.0391815639229236,0.27547631105745612,1.1871134296747488,0.68283993597173309,-1.8220060951526187,-128.23440159952114,51.765598400478865,null,56234,3162262756,null,11.682850948268339,-19.058210156499999,null,-17.938559543431285,-124.95982144048187,-6.2557085951629468,-144.01803159698187,0,0]
[56561.5,56.561500000000002,25.486243790288281,1.5315493991348805,1.0005578355251683,3.339390158359256E-2,1,0,380.62013235347888,1.5681690323733861,7.5298122124103264,1.4375973707659644,1.0208481351585517,0.20244633923880351,1.7380424983952958,0.95775218816642727,1.039630544496037,0.27700005103923125,1.1891563170549539,0.68617598296193372,-1.8602429400724199,-128.36256713856227,51.63743286143773,null,56561.5,3199203282.25,null,11.679928798557981,-19.080525972175469,null,-18.003798956730122,-125.15297503397835,-6.3238701581721415,-144.23350100615383,0,0]
[56889,56.889000000000003,25.633586624250565,1.5317751068741334,1.0005643123113939,3.3587112572142162E-2,1,0,382.8239677430019,1.5681841571777879,7.5726442221068231,1.4383552130092223,1.0210877615621359,0.20358650164004108,1.7447810408038551,0.960466441449218,1.040081936778994,0.27852247195648738,1.1912082555789545,0.68950341451911712,-1.8983099071787146,-128.49062047594902,51.509379524050985,null,56889,3236358321,null,11.677011049783147,-19.103297891134677,null,-18.068788545992568,-125.34548474570677,-6.3917774962094214,-144.44878263684146,0,0]
[57216.5,57.216500000000003,25.780930749163161,1.5319982346782772,1.0005708264486872,3.3780321052134507E-2,1,0,385.02780321909717,1.5681991088384346,7.615480532037509,1.4391045301064345,1.0213287147256112,0.20472612754506295,1.751532338352221,0.96315979021859166,1.0405357376331406,0.28004356847326439,1.1932692110775895,0.69282223625924877,-1.9362105627684807,-128.6185565095634,51.381443490436595,null,57216.5,3273727872.25,null,11.674097375123138,-19.126517605607251,null,-18.133531122515684,-125.53735347559159,-6.4594337473925467,-144.66387108119883,0,0]
[57544,57.543999999999997,25.928276143017595,1.5322188265087242,1.0005773779363192,3.3973527009193982E-2,1,0,387.23163878028646,1.5682138903115372,7.6583210700431641,1.4398454642776475,1.021570993710168,0.20586521437437139,1.758296244113376,0.96583243642243854,1.0409919439085626,0.28156333528739658,1.1953391494849557,0.69613245421276515,-1.9739483901265533,-128.74637028131855,51.253629718681452,null,57544,3311311936,null,11.671187457374872,-19.150176988568838,null,-18.198029444084753,-125.72858408877839,-6.526841986709881,-144.87876107734724,0,0]
[57879,57.878999999999998,26.078997149310112,1.532441891097809,1.0005841181004129,3.4171154904909934E-2,1,0,389.48594394467784,1.5682288372250806,7.7021469899438282,1.4405948383068314,1.0218201917974306,0.20702982674593354,1.7652279420078814,0.96854507764437225,1.0414610830414237,0.28311652470147702,1.1974657494953493,0.69950958380656691,-2.0123855247992122,-128.876979570598,51.123020429402004,null,57879,3349978641,null,11.668214466301814,-19.174824788170067,null,-18.263754937285327,-125.92353677676952,-6.5955404709835133,-145.09836156493958,0,0]
[58214,58.213999999999999,26.229719438323489,1.53266239213199,1.0005908973435786,3.4368780130391678E-2,1,0,391.74024919508281,1.5682436121118528,7.7459771861284326,1.4413357321627069,1.0220707751249587,0.20819386963454414,1.772172527526745,0.97123647856997164,1.0419327323262386,0.2846683116989337,1.1996016767900026,0.70287772510038382,-2.0506594038457013,-129.007450885656,50.992549114344001,null,58214,3388869796,null,11.665244764241811,-19.199915980534335,null,-18.329230531443066,-126.1178277452224,-6.6639857672012557,-145.31774372575674,0,0]
[58549,58.548999999999999,26.380442988071607,1.5328803735299279,1.0005977156650214,3.4566402670256853E-2,1,0,393.99455453002508,1.5682582179246871,7.78981158641409,1.44206828818244,1.0223227426741364,0.20935734030558215,1.7791298497548347,0.97390684916061898,1.042406888355764,0.28621869071493727,1.2017468952547361,0.70623688585450151,-2.088773499222583,-129.1377793643843,50.862220635615699,null,58549,3427985401,null,11.662278040903205,-19.225442422845386,null,-18.394459012681942,-126.31145995600383,-6.7321809717787371,-145.53690237884922,0,0]
[58884,58.884,26.531167777067754,1.5330958782132387,1.0006045730639426,3.4764022509124345E-2,1,0,396.24885994806175,1.5682726575492203,7.8336501202267073,1.4427926455532738,1.0225760934217274,0.2105202360333111,1.7860997598537898,0.97655639730908173,1.0428835477108604,0.28776765622182648,1.2039013688955624,0.70958707425599687,-2.1267312008671668,-129.26796028700841,50.732039712991593,null,58884,3467325456,null,11.659313995197644,-19.251396149423247,null,-18.459443114007566,-126.50443633830756,-6.800129118809922,-145.7558324877308,0,0]
[59227,59.226999999999997,26.685493226072552,1.5333140069456115,1.0006116347092162,3.4966358813144E-2,1,0,398.55699960995724,1.5682872727569428,7.8785397551102907,1.4435259484833276,1.0228369264031976,0.21171030386578246,1.7932490046465606,0.97924785894050281,1.0433741801034924,0.28935214167070422,1.206116844534622,0.71300797983938224,-2.1654367709244551,-129.40109234063101,50.59890765936899,null,59227,3507837529,null,11.65628163552846,-19.278404240311534,null,-18.525728670741746,-126.70134463006619,-6.8694470352132857,-145.97974887037773,0,0]
[59570,59.57,26.839819930175711,1.5335296272444654,1.0006187373189308,3.5168692252992788E-2,1,0,400.86513935600578,1.5683017196589788,7.9234335785410908,1.444250942075769,1.0230992072493499,0.21289976321255832,1.8004111364532664,0.98191792622919094,1.0438674295189967,0.29093513368500667,1.2083419466910965,0.7164194981354266,-2.2039853264128011,-129.53406013436492,50.465939865635079,null,59570,3548584900,null,11.653251472352151,-19.30584391430833,null,-18.591763669818505,-126.8975715113294,-6.9385121974663537,-146.20341542563773,0,0]
[59913,59.912999999999997,26.994147867850877,1.5337427821123881,1.0006258808922142,3.5371022812165281E-2,1,0,403.17327918476218,1.5683160011459383,7.9683315197238995,1.4449677660200162,1.0233629348469508,0.21408861117706363,1.8075860020886843,0.98456681563879833,1.0443632922493389,0.2925166264528824,1.2105766371328952,0.71982163927834208,-2.2423802521800011,-129.66685904270886,50.333140957291135,null,59913,3589567569,null,11.650223210532772,-19.3337071674577,null,-18.657550879965637,-127.09312002755726,-7.0073276694328648,-146.42682719501497,0,0]
[60256,60.256,27.148477018060998,1.533953513575059,1.000633065428189,3.5573350474157488E-2,1,0,405.48141909481393,1.5683301200426143,8.0132335094437401,1.4456765569085153,1.0236281080777774,0.21527684487261287,1.814773450519902,0.98719474140165153,1.0448617645738962,0.29409661420348154,1.2128208777672869,0.72321441384161089,-2.2806248518234487,-129.7994845812469,50.200515418753099,null,60256,3630785536,null,11.647196563774585,-19.361986170042801,null,-18.723093017011671,-127.28799319340533,-7.0758964532370854,-146.64997936344813,0,0]
[60607,60.606999999999999,27.30640691581527,1.5341666940585577,1.0006404599395256,3.5780394132129661E-2,1,0,407.84339325458564,1.5683444028002249,8.0591868965695763,1.4463937024296578,1.0239009615376486,0.21649215354581841,1.8221414073164544,0.98986247830396445,1.0453745607820613,0.29571188892233241,1.2151273095199644,0.72667663483656508,-2.3196091911611503,-129.93501941006519,50.064980589934805,null,60607,3673208449,null,11.644100706951246,-19.391347157929399,null,-18.789912899179917,-127.48671545858713,-7.1458121922286715,-146.87806261651653,0,0]
[60958,60.957999999999998,27.464338040262263,1.5343774228024099,1.0006478973447579,3.5987434721235841E-2,1,0,410.20536749659811,1.5683585210767845,8.1051443815160233,1.4471027156488627,1.0241753264667355,0.21770681287748622,1.8295222274624008,0.9925087090730712,1.0458900818112578,0.29732557550462108,1.2174436618936291,0.73012907101149493,-2.3584428583584276,-130.07036362299291,49.929636377007085,null,60958,3715877764,null,11.641005961906137,-19.42112746379561,null,-18.856481733124518,-127.68473679637631,-7.2154757712183812,-147.10586426017193,0,0]
[61309,61.308999999999997,27.622270370361019,1.5345857418417346,1.0006553776429299,3.6194472223794731E-2,1,0,412.56734181943887,1.5683724776972809,8.1511058949702022,1.4478037334136424,1.0244512016506491,0.21892081980656494,1.8369157559009874,0.99513365610836924,1.0464083236342743,0.29893766789977255,1.2197698945318354,0.73357173507715057,-2.3971291428237507,-130.20551285011243,49.794487149887573,null,61309,3758793481,null,11.637912048723742,-19.451319233331095,null,-18.92280226542432,-127.88206034449318,-7.2848902167005782,-147.33337957782427,0,0]
[61660,61.66,27.780203885548904,1.5347916922566009,1.0006629008330794,3.6401506622126628E-2,1,0,414.9293162217275,1.5683862754223774,8.1970713691677979,1.4484968895338319,1.0247285858696267,0.22013417128298268,1.8443218397969823,0.99773753941940924,1.0469292822106395,0.30054816010230512,1.2221059672382664,0.73700464019331302,-2.435671253755749,-130.34046286091922,49.659537139080783,null,61660,3801955600,null,11.634818695960988,-19.481914783215153,null,-18.988877190124278,-128.07868921166519,-7.35405849416329,-147.56060399488035,0,0]
[62019,62.018999999999998,27.941738229981983,1.5349999283250173,1.0006706398604526,3.6613256523597315E-2,1,0,417.34512487920608,1.5684002260684937,8.2440885176301091,1.4491978479978471,1.0250138519770331,0.22137449629479372,1.8519095542826542,1.0003792080044493,1.0474649206010362,0.30219369715187566,1.224505421076487,0.74050570721622355,-2.4749459404592469,-130.4782783094484,49.521721690551601,null,62019,3846356361,null,11.63165514481596,-19.513617523194561,null,-19.056206782087969,-128.27908424829545,-7.4245516372720086,-147.79270177149002,0,0]
[62378,62.378,28.103273772103488,1.5352057705511892,1.0006784237552215,3.6825003140319161E-2,1,0,419.76093361697366,1.568414016137055,8.2911096708235021,1.4498908561443875,1.0253006940931584,0.22261412921646301,1.859510086637961,1.0029992997198507,1.0480033924049734,0.30383754767091986,1.2269150841074108,0.74399659461742806,-2.5140763496216332,-130.61587683621926,49.384123163780743,null,62378,3891014884,null,11.628491631479651,-19.545726928551183,null,-19.123284981081476,-128.47875906670893,-7.4947933496018244,-148.02448599526011,0,0]
[62737,62.737000000000002,28.264810491378778,1.5354092599607929,1.0006862525163391,3.703674645338105E-2,1,0,422.1767424336519,1.5684276483846595,8.3381347609964624,1.4505760478157894,1.0255891108956436,0.22385306682043504,1.8671232803291111,1.0055980423105864,1.04854469325722,0.30547970538044522,1.2293349138539962,0.74747731788187111,-2.5530656679563144,-130.75325434431028,49.246745655689722,null,62737,3935931169,null,11.625327891240747,-19.578235303700154,null,-19.190114507317261,-128.67771690580918,-7.564786616076514,-148.25595220950933,0,0]
[63096,63.095999999999997,28.426348367739834,1.5356104366477505,1.0006941261427527,3.7248486443873616E-2,1,0,424.592551327894,1.5684411255051691,8.3851637219117112,1.451253553881457,1.0258791010563613,0.22509130589131213,1.8747489811063369,1.0081756609788364,1.0490888187786436,0.30712016405090403,1.2317648680216831,0.75094789295026054,-2.5919170032610239,-130.89040687413319,49.109593125866809,null,63096,3981105216,null,11.622163667491151,-19.611135120495131,null,-19.256698028975407,-128.87596097722749,-7.6345343614842562,-148.48709609772263,0,0]
[63463.25,63.463250000000002,28.591599642321782,1.5358138842762097,1.0007022271316277,3.7465088867820288E-2,1,0,427.0638768006803,1.5684547545661267,8.4332773696012442,1.4519388102333708,1.026177381954088,0.22635727418059357,1.8825627073552804,1.0107908891222006,1.0496483667805108,0.30879655678583062,1.2342610959396345,0.75448773997156771,-2.6315215457047798,-131.03047445675227,48.969525543247727,null,63463.25,4027584100.5625,null,11.618925968648311,-19.645188351329661,null,-19.324559852641681,-129.07802555763945,-7.7056338839933698,-148.72321390896911,0,0]
[63830.5,63.830500000000001,28.75685208673562,1.5360149936724263,1.0007103750692974,3.7681687774708462E-2,1,0,429.53520235188148,1.5684682267978143,8.4813949324269124,1.4526162915601937,1.0264773065240256,0.22762250469461984,1.8903892027466496,1.0133844800070368,1.0502108614532819,0.31047115846524992,1.2367678300071043,0.75801700218542267,-2.6709880257549083,-131.17029864423179,48.829701355768208,null,63830.5,4074332730.25,null,11.615687245392728,-19.67963580122435,null,-19.392169722576476,-129.27934990393018,-7.7764824771837482,-148.95898570515453,0,0]
[64197.75,64.197749999999999,28.922105680929111,1.5362138049001941,1.0007185699546151,3.7898283144300784E-2,1,0,432.0065279801517,1.568481544891688,8.5295163441293411,1.4532861288289796,1.0267788733258125,0.22888699403090768,1.8982283093369083,1.0159566665896174,1.0507762980647795,0.31214396258091642,1.2392850255497736,0.76153569807982369,-2.7103195274572656,-131.30987562079852,48.690124379201478,null,64197.75,4121351105.0625,null,11.612447247629696,-19.714469925580868,null,-19.459530334388063,-129.47993737202975,-7.8470830867583672,-149.19440729761061,0,0]
[64565,64.564999999999998,29.087360405305581,1.5364103571135812,1.0007268117864274,3.8114874956361879E-2,1,0,434.47785368417595,1.5684947114779673,8.5776415399308021,1.453948450095391,1.027082080912896,0.23015073880043985,1.906079871528388,1.0185076791300045,1.0513446718682826,0.31381496267878967,1.2418126381002637,0.76504384660318625,-2.7495190572618435,-131.44920170590345,48.550798294096552,null,64565,4168639225,null,11.609205733020719,-19.749683343874288,null,-19.526644332140947,-129.67979129212472,-7.9174385991202278,-149.42947463599901,0,0]
[64941,64.941000000000003,29.256553595318177,1.5366092918958165,1.0007352986223239,3.8336623520034301E-2,1,0,437.00806060873168,1.5685080374866425,8.6269172080201955,1.4546188956519643,1.027394211015966,0.23144381830124414,1.9141312471584093,1.021097772269761,1.051929625618524,0.3155238998912302,1.244411218907246,0.76862467227979903,-2.7895188788657155,-131.59158370263222,48.408416297367779,null,64941,4217333481,null,11.605885170283067,-19.786121165156789,null,-19.595104580575882,-129.88365035740856,-7.9892194102928151,-149.66977152256536,0,0]
[65317,65.316999999999993,29.425747929845596,1.5368059389860098,1.0007438346659665,3.8558368311713311E-2,1,0,439.53826760999885,1.5685212100726811,8.6761967098371482,1.4552817254423576,1.0277080579330942,0.23273611018683293,1.9221953562723229,1.0236661502916899,1.0525176480738911,0.31723093258013241,1.2470206253590332,0.77219448363515797,-2.8293865025931901,-131.73369532118238,48.266304678817619,null,65317,4266310489,null,11.602562527274722,-19.822941420202323,null,-19.663311772523191,-130.08674748958995,-8.0607492452484681,-149.90968890979227,0,0]
[65693,65.692999999999998,29.594943389258248,1.537000337605297,1.0007524199160958,3.878010930968899E-2,1,0,442.06847468666041,1.5685342318704512,8.7254799804256251,1.4559370679253103,1.0280236200918946,0.2340276108642452,1.9302720392798784,1.0262130516798014,1.0531087340939813,0.31893605399567987,1.2496408104182128,0.77575330244190432,-2.869124915518424,-131.87553302915302,48.124466970846981,null,65693,4315570249,null,11.599237567547753,-19.860136693943907,null,-19.731268585894568,-130.28908618459883,-8.1320310183468152,-150.14922287854273,0,0]
[66069,66.069000000000003,29.764139954372773,1.5371925260836812,1.0007610543714454,3.9001846492253661E-2,1,0,444.59868183742913,1.5685471054543523,8.7747669562839814,1.4565850486994603,1.0283408959133225,0.23531831675547571,1.9383611390039428,1.0287387120609788,1.0537028785231757,0.32063925744761734,1.2522717272816177,0.77930115093652286,-2.9087370282755289,-132.01709342754097,47.982906572459029,null,66069,4365112761,null,11.595910062102778,-19.897699732607343,null,-19.798977647405707,-130.49066991388301,-8.2030675853029287,-150.38836964649036,0,0]
[66453.75,66.453749999999999,29.937275064593717,1.5373869382223693,1.0007699406964112,3.9228739809853752E-2,1,0,447.18777021404958,1.5685601278197931,8.8252046738409433,1.4572406162441975,1.0286673274392508,0.23663823255871186,1.9466511744345243,1.0313014024056211,1.0543140100544488,0.32238010426820385,1.2549749296853867,0.78292022984542264,-2.9491431807198709,-132.16165764276519,47.838342357234808,null,66453.75,4416100889.0625,null,11.592502254750183,-19.936510210569583,null,-19.868008605854467,-130.69616682685731,-8.2755063511042835,-150.6326770374269,0,0]
[66838.5,66.838499999999996,30.11041129331387,1.5375791146110458,1.0007788785406753,3.9455629086416359E-2,1,0,449.77685866563201,1.5685730002617559,8.8756461410878984,1.4578887327112602,1.0289955499476249,0.23795730862196382,1.9549538857926598,1.0338423417697413,1.0549283330269563,0.32411892883698312,1.2576892707944207,0.7865278704663512,-2.9894230162862803,-132.30592470311589,47.694075296884108,null,66838.5,4467385082.25,null,11.589091319508873,-19.975690900296289,null,-19.936785553356554,-130.90088050669982,-8.3476942338476814,-150.87657140699611,0,0]
[67223.25,67.223249999999993,30.283548621349272,1.537769093582132,1.000787867902857,3.9682514298690116E-2,1,0,452.36594719088924,1.5685857253544697,8.9260912944561994,1.4585295238791556,1.0293255617251653,0.2392755411604594,1.9632691122579671,1.0363617735056785,1.0555458418684842,0.32585572417927805,1.2604147012331082,0.79012409806516615,-3.0295794183379927,-132.44989137752111,47.550108622478888,null,67223.25,4518965340.5625,null,11.585677033664876,-20.015234525850843,null,-20.005311146058041,-131.10481459865568,-8.4196341123931653,-151.12004912450652,0,0]
[67608,67.608000000000004,30.456687029952075,1.5379569125970525,1.0007969087815685,3.9909395423426169E-2,1,0,454.95503578856352,1.5685983056135653,8.9765400718015318,1.459163112723229,1.0296573610514552,0.24059292640599206,1.9715966954827271,1.0388599379557644,1.0561665309909873,0.32759048338564911,1.2631511718891593,0.79370893837088585,-3.0696151952135322,-132.59355456600474,47.406445433995259,null,67608,4570841664,null,11.582259181641692,-20.055133969497636,null,-20.073587989397851,-131.30797272460265,-8.4913288077561582,-151.36310669410028,0,0]
[68001.75,68.001750000000001,30.63387655946898,1.5381469269045005,1.0008062144795871,4.0141579452640352E-2,1,0,457.60468793590189,1.5686110327577454,9.0281726262411279,1.4598041908077659,1.0299987707217169,0.24194024651186286,1.980131707011981,1.0413947673317179,1.0568050260500124,0.32936370647728452,1.2659630332010505,0.79736587194837416,-3.1104654445964757,-132.74026097853982,47.259739021460177,null,68001.75,4624238003.0625,null,11.578757469882353,-20.096327868328693,null,-20.143207073143369,-131.51508343770863,-8.564449603261016,-151.61141130603733,0,0]
[68395.5,68.395499999999998,30.811067182313934,1.5383347557212732,1.0008155741294869,4.037375915159043E-2,1,0,460.25434015650978,1.56862361336336,9.0798088488895949,1.4604379776200054,1.0303420488782902,0.24328667128959094,1.9886793323431622,1.0439078226284721,1.0574468400234378,0.3311347826279768,1.2687863540466719,0.80101093522458555,-3.1511950789898475,-132.88664337684347,47.113356623156534,null,68395.5,4677944420.25,null,11.575251588201876,-20.137879831724902,null,-20.212570998157176,-131.72138906136294,-8.6373194099552997,-151.85926889308786,0,0]
[68789.25,68.789249999999996,30.988258879732015,1.5385204365240859,1.0008249877297539,4.0605934495365821E-2,1,0,462.90399244912891,1.568636049946756,9.1314486775183266,1.4610645963464082,1.0306871936542346,0.24463219675445363,1.9972394095256587,1.0463993518670291,1.0580919668717346,0.3329037046440127,1.2716210826518759,0.80464415721044291,-3.1918068776515085,-133.03269884177737,46.967301158222625,null,68789.25,4731960915.5625,null,11.571741327249999,-20.179782717490202,null,-20.281682400270782,-131.92689340645398,-8.7099410730207829,-152.1066761239442,0,0]
[69183,69.183000000000007,31.165451633394714,1.5387040059379509,1.0008344552788659,4.083810545905877E-2,1,0,465.5536448125298,1.5686483449669935,9.1830920512941496,1.461684167425165,1.0310342031749646,0.24597681894007459,2.0058117791395209,1.0488695999067397,1.0587404005389582,0.3346704654030907,1.2744671675373405,0.80826556737610533,-3.2323035462826883,-133.17842458285787,46.821575417142128,null,69183,4786287489,null,11.56822648451919,-20.222029538661715,null,-20.350543865100953,-132.1316002613832,-8.7823173805817625,-152.35362980004493,0,0]
[69586,69.585999999999999,31.346808085539781,1.5388897387572398,1.0008442011034311,4.1075726036143623E-2,1,0,468.26554304952509,1.568660784739895,9.2359522434723065,1.4623111184560893,1.0313912936704468,0.24735208959702459,2.01459809662571,1.051376094449558,1.0594074851713657,0.33647648564810234,1.2773918190031064,0.81195985185890129,-3.2736350951367532,-133.32722950771176,46.672770492288237,null,69586,4842211396,null,11.564624121986959,-20.265617841494958,null,-20.420766861304003,-132.34029422127645,-8.8561427393170433,-152.60591206277141,0,0]
[69989,69.989000000000004,31.528165606605224,1.5390733348239358,1.0008540034380988,4.1313341972147026E-2,1,0,470.97744135814906,1.5686730812558349,9.2888160246844151,1.4629309336192697,1.0317503335553788,0.24872640568804236,2.0233969608880358,1.0538608052030141,1.0600780209273455,0.338280227030544,1.2803282584131426,0.81564182692406184,-3.314851549106848,-133.47568351758923,46.524316482410768,null,69989,4898460121,null,11.561016551616634,-20.309552098815018,null,-20.490733364195307,-132.54816074249888,-8.9297168125786737,-152.85771284131391,0,0]
[70392,70.391999999999996,31.709524178250486,1.539254830788205,1.0008638622812094,4.1550953240373487E-2,1,0,473.68933973717139,1.5686852369752722,9.3416833340003702,1.4635437335862553,1.0321113207953625,0.25009976302057529,2.0322082089549447,1.0563239846369128,1.0607520012621963,0.34008168214632339,1.2832764315418923,0.81931152558414577,-3.3559555829115224,-133.62378401641101,46.376215983588992,null,70392,4955033664,null,11.557403577112627,-20.35382529740976,null,-20.560445990693445,-132.75520381796028,-9.0030424135808182,-153.10902911537005,0,0]
[70795,70.795000000000002,31.890883782552109,1.5394342624670734,1.0008737776310923,4.1788559814130703E-2,1,0,476.40123818539001,1.5686972543026414,9.3945541118575733,1.4641496363334761,1.0324742533478182,0.25147215742238499,2.0410316804417108,1.05876588190961,1.0614294196142617,0.34188084366946114,1.2862362844926454,0.82296898130336571,-3.3969497992396751,-133.77152853413745,46.228471465862555,null,70795,5011932025,null,11.553785008742194,-20.398430576439967,null,-20.629907308002284,-132.96142741871245,-9.0761222992600903,-153.35985799515242,0,0]
[71207.25,71.207250000000002,32.076407157519647,1.5396157132082882,1.0008839790319433,4.2031615251629947E-2,1,0,479.17538251203507,1.5687094067185134,9.44864195310622,1.4647624300305486,1.0328475269004895,0.25287505152592449,2.0500701587065278,1.061242063540488,1.0621259370831504,0.34371892036377788,1.2892761036942004,0.82669775373694421,-3.4387739626720126,-133.92229343224,46.077706567760004,null,71207.25,5070472452.5625,null,11.550077404805519,-20.444396277314976,null,-20.700705558765815,-133.17154065306605,-9.1506281539602963,-153.61593693038103,0,0]
[71619.5,71.619500000000002,32.261931576436467,1.5397950770658395,1.0008942395597549,4.2274665720189487E-2,1,0,481.94952690863067,1.5687214192336114,9.5027333020809284,1.4653682476785233,1.0332228317415466,0.25427692922054368,2.0591210965302817,1.0636964918270617,1.0628260382616914,0.34555458170978776,1.2923280320068069,0.83041378699066482,-3.4804884970362737,-134.07268097994455,45.92731902005545,null,71619.5,5129352780.25,null,11.546363565725208,-20.490695424696039,null,-20.771246112014623,-133.38080470125132,-9.2248825462894146,-153.87150012594736,0,0]
[72031.75,72.031750000000002,32.447457021395671,1.5399723898247304,1.0009045592127079,4.2517711191246893E-2,1,0,484.72367137397589,1.5687332942499492,9.5568280992208372,1.4659672072891048,1.0336001656582798,0.25567778610633168,2.0681843303337097,1.0661294229856051,1.0635297160726238,0.34738782011859243,1.2953920128119032,0.83411711827012269,-3.5220959674819974,-134.22268891970896,45.777311080291042,null,72031.75,5188573008.0625,null,11.542643308335194,-20.537321142539504,null,-20.841531562454424,-133.58922374695811,-9.2988882541192304,-154.12654488949761,0,0]
[72444,72.444000000000003,32.632983474897429,1.5401476864567005,1.0009149379889744,4.2760751636243252E-2,1,0,487.49781590689685,1.5687450341148663,9.6109262863022806,1.4665594242368685,1.0339795264292555,0.25707761780580862,2.0772596991720813,1.0685411097819288,1.0642369634212954,0.34921862808645643,1.2984679898554954,0.83780778521985755,-3.5635988688877851,-134.37231511691363,45.627684883086374,null,72444,5248133136,null,11.538916455750812,-20.584266704050616,null,-20.91156445570466,-133.79680195242901,-9.3726479999538483,-154.38106865647961,0,0]
[72865.75,72.865750000000006,32.82278627578588,1.5403249719580741,1.0009256171173295,4.300938753978837E-2,1,0,490.33588864211788,1.5687569070494338,9.666274575241399,1.4671584284902017,1.0343697244198991,0.25850864216717728,2.0865565958577084,1.0709866478008405,1.0649641952238076,0.35108910285266381,1.3016272063555705,0.84157043514087815,-3.6059524929796769,-134.52499220034898,45.475007799651024,null,72865.75,5309417523.0625,null,11.535096717571957,-20.632618213807465,null,-20.982952455925354,-134.00829783601938,-9.4478557383533968,-154.64091604982684,0,0]
[73287.5,73.287499999999994,33.012590096436909,1.5405002188811137,1.0009363581213959,4.3258018122501608E-2,1,0,493.17396144566436,1.568768643333428,9.7216262930055706,1.4677506118906596,1.0347620390246008,0.25993858435186346,2.0958658607685172,1.0734104753821099,1.0656951478980272,0.35295701825614162,1.3047988604159355,0.84531991138176399,-3.6482017390257044,-134.67726560354538,45.322734396454621,null,73287.5,5371057656.25,null,11.531269721451181,-20.681290695989421,null,-21.054081362895637,-134.21892242626288,-9.5228116414444557,-154.9002131222523,0,0]
[73709.25,73.709249999999997,33.202394919361886,1.5406734621761748,1.000947160999182,4.3506643353815468E-2,1,0,496.01203431636338,1.5687802453124999,9.7769813813586151,1.4683360898737827,1.0351564678368301,0.26136743974590371,2.1051873298254091,1.0758128522480566,1.0664298137928709,0.35482236653833038,1.3079828929934125,0.84905625558789644,-3.6903490629883713,-134.82913341746533,45.170866582534671,null,73709.25,5433053535.5625,null,11.527435297076714,-20.730277406662424,null,-21.124953750880874,-134.42868011352331,-9.5975184538041596,-155.15895752018574,0,0]
[74131,74.131,{"$f":"SQRT(1+(A525/pole1)^2)","v":33.392200727469728},{"$f":"ATAN(A525/pole1)","v":1.5408447359994497},{"$f":"SQRT(1+(A525/Zero1)^2)","v":1.0009580257486841},{"$f":"ATAN(A525/Zero1)","v":4.3755263203166431E-2},{"$f":"IF(VIN_nom>Vout, 1, SQRT(1+(A525/z_RHP)^2))","v":1},{"$f":"IF(VIN_nom>Vout, 0, -ATAN(A525/z_RHP))","v":0},{"$f":"SQRT(1+(A525/Pole2)^2)","v":498.85010725306893},{"$f":"ATAN(A525/Pole2)","v":1.5687917152789217},9.8323397833723014,1.4689149752940214,{"$f":"SQRT(1+(A525/pole4)^2)","v":1.0355530084407636},{"$f":"ATAN(A525/pole4)","v":0.26279520376009585},{"$f":"SQRT(1+(A525/Zero3)^2)","v":2.1145208416293135},{"$f":"ATAN(A525/Zero3)","v":1.0781940345347623},{"$f":"SQRT(1+(A525/pole5)^2)","v":1.0671681852395101},{"$f":"ATAN(A525/pole5)","v":0.35668514003343987},{"$f":"SQRT((1-(Z525/pterm2))^2+(A525/pterm1)^2)","v":1.3111792454476092},{"$f":"IF((ATAN((A525/pterm1)/(1-A525^2/pterm2))>0),ATAN((A525/pterm1)/(1-A525^2/pterm2)),PI()+ATAN((A525/pterm1)/(1-A525^2/pterm2)))","v":0.85277950982655659},{"$f":"20*LOG10(((E525*K525*G525*O525)/(C525*I525*S525*M525*Q525))*Adc)","v":-3.7323968523642832},{"$f":"((F525+L525+H525+R525)-(D525+J525+T525+N525))*radconv","v":-134.98059385267254},{"$f":"IF(V525>0,V525,V525+180)","v":45.019406147327459},null,{"$f":"IF(U525<0,A525,1000000000)","v":74131},{"$f":"A525^2","v":5495405161},null,{"$f":"20*LOG10((K525/(I525*M525))*AEA*Afb)","v":11.523593280151408},{"$f":"(L525-(J525+N525))*radconv","v":-20.779571748138416},null,{"$f":"20*LOG10((E525*G525/(C525*S525))*Am)","v":-21.19557214569079},{"$f":"(F525+H525-(D525+T525))*radconv","v":-134.63757526683517},-9.6719788655393817,-155.41714701497358,0,0]
[74562.75,{"$f":"A526/1000","v":74.562749999999994},33.586507972736996,1.5410180656279686,1.0009692121968585,4.4009772403619127E-2,1,0,501.75547303555993,1.5688033228004186,9.8890141478060816,1.4695008728104768,1.0359611362731547,0.26425568583207076,2.1240879665050527,1.0806099857435016,1.0679278943721167,0.35858940625423324,1.3144640864598014,0.85657753027941486,-3.7753409456823972,-135.1352217967781,44.864778203221903,null,74562.75,5559603687.5625,null,11.51965213605671,-20.83034681404741,null,-21.267604443467889,-134.85053456267715,{"$f":"AB526+AE526","v":-9.7479523074111789},-155.68088137672456,{"$f":"SUM((U527<0)*(U526>0))*A526","v":0},0]
[74994.5,74.994500000000002,33.780816215441043,1.5411894012674021,1.0009804634812951,4.426427589905587E-2,1,0,504.66083888487628,1.5688147966713779,9.9456918682112683,1.4700800927912374,1.0363714720756767,0.26571501450263846,2.1336673780766811,1.0830042572906691,1.0686914705427122,0.36049095817971677,1.3177617154317687,0.86036192317011373,-3.8181855805141791,-135.28941938843468,44.710580611565319,null,74994.5,5624175030.25,null,11.515702705112203,-20.881430731925153,null,-21.339375767083887,-135.06259913643572,-9.8236730619716841,-155.94402986836087,0,0]
[75426.25,75.426249999999996,33.975125438468439,1.5413587771194392,1.0009917795998076,4.4518773656700178E-2,1,0,507.56620479987055,1.568826139186889,10.002372887538751,1.4706527483642315,1.036784013226735,0.26717318492928371,2.1432589115960501,1.0853771126035909,1.0694589054682913,0.36238978788690412,1.3210720707676917,0.86413273491033415,-3.8609331080776075,-135.44318507457029,44.556814925429705,null,75426.25,5689119189.0625,null,11.511744829371413,-20.93281687406208,null,-21.410888676528764,-135.27377360879461,-9.899143847157351,-156.20659048285668,0,0]
[75858,75.858000000000004,34.169435625094955,1.5415262266082503,1.0010031605501968,4.4773265643780029E-2,1,0,510.4715707794212,1.5688373525897903,10.059057150021991,1.4712189501248629,1.0371987570948271,0.2686301922968769,2.152862405044357,1.0877288113827936,1.0702301908478076,0.36428588755399799,1.3243950913163109,0.8678900123128005,-3.9035858128263827,-135.59651741842274,44.403482581577265,null,75858,5754436164,null,11.507778356662186,-20.984498756426852,null,-21.482145683862303,-135.48406257886703,-9.9743673272001168,-156.46856133529388,0,0]
[76299.75,76.299750000000003,34.368247317467478,1.5416955947497504,1.0010148722004293,4.5033646053435697E-2,1,0,513.44422960934833,1.5688486943656197,10.117057607831994,1.4717916990014399,1.0376253841549221,0.2701197374443145,2.1627005427796435,1.0901133489332122,1.0710233169775412,0.36622307015927946,1.3278081234922547,0.87172035513858426,-3.9471305925165368,-135.75295128320994,44.247048716790061,null,76299.75,5821651850.0625,null,11.503710963477687,-21.037677149368477,null,-21.554790823783257,-135.69831043826824,-10.05107986030557,-156.73598758763671,0,0]
[76741.5,76.741500000000002,34.567059984372214,1.5418630146521057,1.0010266517158346,4.5294020352725117E-2,1,0,516.41688850456251,1.5688599055677548,10.175061346617683,1.4723579180618163,1.0380543115455378,0.27160805492195905,2.1725508662590247,1.0924762768801082,1.0718204563541944,0.36815737855321007,1.3312342862771886,0.87553662978191149,-3.9905807388210945,-135.9089288142039,44.091071185796096,null,76741.5,5889257822.25,null,11.499634265877148,-21.091151851600351,null,-21.627173242236381,-135.91164097440594,-10.127538976359233,-157.0027928260063,0,0]
[77183.25,77.183250000000001,34.765873609090228,1.542028519729703,1.0010384990940178,4.5554388506560579E-2,1,0,519.38954746394268,1.5688709884381578,10.233068310586745,1.4729177179841577,1.0384855364163459,0.27309513966159876,2.1824132104814153,1.0948178616190738,1.0726216000302025,0.37008880468542621,1.3346735156182399,0.87933888758954581,-4.0339384942597682,-136.06444882779911,43.935551172200888,null,77183.25,5957254080.5625,null,11.495548118419876,-21.144916359798518,null,-21.699295482069111,-136.12405904574666,-10.203747363649235,-157.26897540554518,0,0]
[77625,77.625,34.964688175282788,1.5421921426373562,1.0010504143325689,4.5814750479859383E-2,1,0,522.36220648639346,1.5688819451677569,10.291078445201721,1.4734712069673888,1.0389190559064967,0.27458098662522284,2.1922874132153019,1.0971383656912423,1.0734267390398329,0.37201734061555314,1.3381257479504518,0.88312718028231429,-4.0772060365043652,-136.2195102528562,43.780489747143804,null,77625,6025640625,null,11.491452381196879,-21.198964311495441,null,-21.77116003884603,-136.33556948866874,-10.279707657649151,-157.53453380016418,0,0]
[78077,78.076999999999998,35.168116827337492,1.5423576472172413,1.0010626762803878,4.6081147242180077E-2,1,0,525.40384068332162,1.5688930277964395,10.350437825031948,1.4740311166920632,1.0393650065283908,0.27610002353434704,2.2024028368115447,1.0994911626303223,1.0742546859212769,0.37398762495100335,1.3416714762795159,0.88698897276957489,-4.1213863510219726,-136.37769391834556,43.622306081654443,null,78077,6096017929,null,11.48725154344846,-21.254553239093607,null,-21.844427914836523,-136.55105320355091,-10.357176371388062,-157.80560644264452,0,0]
[78529,78.528999999999996,35.371546431628559,1.542521248094513,1.0010750092691136,4.6347537459525058E-2,1,0,528.44547494403946,1.5689039828460081,{"$f":"SQRT(1+(A535/Zero2)^2)","v":10.409800412706494},{"$f":"ATAN(A535/Zero2)","v":1.4745846407428214},1.039813353396734,0.27761775398598576,2.2125303406291219,1.101822433272807,1.0750867966486133,0.37595486693700292,1.3452306849432381,0.89083625523890797,-4.1654766304043225,-136.53539554362393,43.464604456376065,null,78529,6166803841,null,11.483040386349451,-21.310425874612044,null,-21.917431150627809,-136.76559685651836,-10.434390764278358,-158.07602273113039,0,0]
[78981,78.980999999999995,35.574976971820377,1.5426829779185101,1.0010874132961207,4.6613921094328832E-2,1,0,531.48710926745184,1.5689148125068182,10.469166153657707,1.4751318874080619,1.040264093413227,0.27913417268169749,2.2226697595389369,1.1041324467014424,1.0759230615609812,0.37791905842343776,1.3488033074337371,0.89466908420889524,-4.2094790090976737,-136.69261432420802,43.307385675791977,null,78981,6237998361,null,11.478818776841322,-21.366575835502307,null,-21.990172273736665,-136.97920555866898,-10.511353496895342,-158.3457813941713,0,0]
[79433,79.433000000000007,35.778408431948776,1.5428428685964091,1.0010998883587683,4.6880298109031493E-2,1,0,534.52874365248852,1.5689255189193696,10.528534994545801,1.4756729625489284,1.0407172234684161,0.28064927435632647,2.2328209312188267,1.1064214680217002,1.0767634709793772,0.379880191379601,1.3523892777769273,0.89848751653974224,-4.2533955586664343,-136.8493495639454,43.150650436054605,null,79433,6309601489,null,11.474586587165867,-21.422996877338051,null,-22.062653765050293,-137.19188439815122,-10.588067177884426,-158.61488127548927,0,0]
[79895.5,79.895499999999998,35.986566558864816,1.5430046023480459,1.0011127267455089,4.7152856193619259E-2,1,0,537.6410355361578,1.5689363486487169,10.589286133264421,1.4762203266274194,1.0411833504845049,0.28219820325144729,2.2432199145472067,1.1087422066953443,1.0776276831080607,0.38188370744535338,1.3560722988303602,0.9023798088687599,-4.2982455475070722,-137.00922464059877,42.990775359401226,null,79895.5,6383290920.25,null,11.470245003768767,-21.481002812090889,null,-22.136552799314533,-137.4085465549372,-10.666307795545766,-158.88954936702808,0,{"$f":"IF(AI538>0,W538,0)","v":0}]
[80358,80.358000000000004,36.194725616283193,1.5431644758137015,1.0011256395009103,4.7425407267416501E-2,1,0,540.75332748215749,1.5689470537176049,10.650040408416022,1.476761445874635,1.0416519732484826,0.28374574217934523,2.2536308679376331,1.111041515723552,1.0784962139742786,0.38388400460035116,1.3597691570378434,0.9062571493920577,-4.3430098680543452,-137.16859230774403,42.831407692255965,null,80358,6457408164,null,11.465892088554206,-21.539279767546159,null,-22.210185110144032,-137.62424585151155,-10.744293021589826,-159.16352561905771,0,0]
[80820.5,80.820499999999996,36.402885588241496,1.5433225208977457,1.0011386266220952,4.7697951290202864E-2,1,0,543.86561948941755,1.5689576362661539,10.710797766628747,1.4772964262430002,1.0421230883934793,0.2852918856078327,2.2640536262618349,1.113319666584772,1.0793690531526159,0.38588107462726862,1.3634797834515595,0.91011960002897541,-4.3876905474380159,-137.32745214922835,42.67254785077165,null,80820.5,6531953220.25,null,11.46152772076729,-21.597821478725937,null,-22.283553211575576,-137.83898766588126,-10.822025490808286,-159.4368091446072,0,0]
[81283,81.283000000000001,36.611046459140297,1.5434787687793199,1.0011516881061693,4.7970488221764251E-2,1,0,546.97791155689208,1.5689680983857754,10.771558155732247,1.4778253713085447,1.0425966925408201,0.28683662804138277,2.2744880272327848,1.1155769266626963,1.0802461901997207,0.38787490943823788,1.3672041097058514,0.91396722300225131,-4.4322895519206273,-137.48580385277918,42.514196147220815,null,81283,6606926089,null,11.457151784732282,-21.656621816119419,null,-22.3566595716756,-138.052777351884,-10.899507786943317,-159.70939916800342,0,0]
[81756.25,81.756249999999994,36.824046578417274,1.5436368198065951,1.0011651301540871,4.8249352413200726E-2,1,0,550.16254344719914,1.5689786811508044,10.83373389752385,1.4783604690419112,1.0430838777012181,0.28841581938600441,2.2851768428656514,1.1178653026997643,1.0811481527185702,0.3899117302500032,1.3710291118592686,0.91788899378702804,-4.4778426265964741,-137.64730995170771,42.352690048292288,null,81756.25,6684084414.0625,null,11.452662047538137,-21.717050321301706,null,-22.431196750686077,-138.27055618190221,-10.97853470314794,-159.98760650320392,0,0]
[82229.5,82.229500000000002,37.037047606983258,1.5437930529265602,1.0011786500557549,4.8528209094766246E-2,1,0,553.34717539841245,1.568989142103659,10.895912705931137,1.4788894597289031,1.0435736617188744,0.28999353232751263,2.29587751374177,1.1201323591009504,1.082054593042423,0.39194514698433031,1.3748683151489647,0.92179537232310182,-4.5233141636328957,-137.80828367328596,42.191716326714044,null,82229.5,6761690670.25,null,11.448159968603822,-21.777737048884536,null,-22.505464965594566,-138.48734937289888,-11.057304996990744,-160.26508642178342,0,0]
[82702.75,82.702749999999995,37.250049529239938,1.543947499316803,1.0011922478080182,4.8807058223397544E-2,1,0,556.53180740948631,1.5689994833354677,10.958094528752014,1.4794124470344121,1.0440660409363232,0.29156976109764676,2.3065898748655522,1.1223783694402405,1.0829654999275329,0.3939751513945276,1.3787216482161475,0.92568642614937913,-4.5687060837549902,-137.96872499827521,42.031275001724794,null,82702.75,6839744857.5625,null,11.443645439441921,-21.83867584862297,null,-22.579466718858022,-138.70316258337982,-11.135821279416101,-160.54183843200281,0,0]
[83176,83.176000000000002,37.46305232994365,1.5441001894461939,1.0012059234077053,4.9085899756038415E-2,1,0,559.71643947939901,1.5690097068897673,11.020279314960076,1.4799295322968131,1.0445610116836326,0.29314449996849273,2.317313764113742,1.1246036030851718,1.0838808621126401,0.39600173537405203,1.3825890403349728,0.92956222306386138,-4.6140202488814923,-138.12863400652984,41.871365993470164,null,83176,6918246976,null,11.439118356432335,-21.899860703156541,null,-22.653204467627251,-138.91800144608914,-11.214086111194916,-160.81786214924568,0,0]
[83660.5,83.660499999999999,37.681119483131226,1.5442547210028783,1.0012200047428352,4.937136193732005E-2,1,0,562.97677601658972,1.5690200536545842,11.083945362710429,1.4804528988749608,1.0450704295971358,0.29475512381735347,2.3283043555366394,1.1268604880195623,1.0848225877443902,0.3980729432045067,1.3865628584422953,0.93351442040777743,-4.6603329476292004,-138.29179307375989,41.708206926240109,null,83660.5,6999079260.25,null,11.434470548264706,-21.962748782040794,null,-22.728424121155445,-139.1369439017501,-11.293953572890739,-161.09969268379089,0,0]
[84145,84.144999999999996,37.899187525789038,1.5444074742456817,1.0012341676637397,4.9656816065872952E-2,1,0,566.23711261335632,1.5690302812681307,11.147614411813658,1.4809702872287605,1.0455825558916598,0.29636417406987259,2.33930669477644,1.1290961548737946,1.085768959074183,0.40014054930481774,1.390551263970192,0.93745077141498423,-4.7065679191083625,-138.45439468794891,41.545605312051094,null,84145,7080381025,null,11.429809377452036,-22.025882400655508,null,-22.80337214082914,-139.35487700070303,-11.373562763377103,-161.38075940135855,0,0]
[84629.5,84.629499999999993,38.117256442651168,1.5445584796886274,1.0012484121669569,4.9942262095519906E-2,1,0,569.49744926867538,1.5690403917768048,11.211286411135591,1.4814817989347981,1.0460973865894685,0.29797164471149418,2.3503206168512318,1.1313108794335245,1.0867199639648837,0.40220454542983258,1.3945541830788237,0.94137134956413004,-4.7527269814927315,-138.61643923522769,41.383560764772312,null,84629.5,7162152270.25,null,11.425134747632795,-22.089255511732286,null,-22.878051023310334,-139.57180670393493,-11.45291627567754,-161.66106221566722,0,0]
[85114,85.114000000000004,38.335326218798976,1.5447077671517484,1.0012627382490047,5.0227699980091613E-2,1,0,572.75778598154727,1.5690503871804096,11.274961310694771,1.4819875332875223,1.0466149176996675,0.29957752977211832,2.361345959685099,1.1335049331636526,1.0876755902624853,0.40426492348619419,1.3985715426158318,0.94527622854273619,-4.7988118961381145,-138.77792719586884,41.222072804131159,null,85114,7244392996,null,11.420446567118903,-22.152862198637052,null,-22.952463220531676,-139.78773894463711,-11.532016653412773,-161.94060114327416,0,0]
[85609.5,85.609499999999997,38.558347885113406,1.5448586974506484,1.0012774739622503,5.0519609921882827E-2,1,0,576.09214484548033,1.5690604924997507,11.340084822449109,1.4824988753007693,1.0471469876423511,0.30121822839264978,2.3726332666218859,1.1357276986272069,1.0886576802260817,0.40636832949868235,1.4026949719665815,0.94925360231369582,-4.845868200246108,-138.94250646033751,41.057493539662488,null,85609.5,7328986490.25,null,11.415637840523939,-22.218148558023135,null,-23.028291532229282,-140.00754813697537,-11.612653691705344,-162.2256966949985,0,0]
[86105,86.105000000000004,38.781370419682837,1.5450078918236558,1.0012922949932499,5.0811511246901711E-2,1,0,579.42650376756546,1.5690704815152596,11.405211265441091,1.4830043776782356,1.0476818735240847,0.30285725612952669,2.3839321849563051,1.1379294047824005,1.0896445780614987,0.40846793465082604,1.4068333523254302,0.95321471244368106,-4.8928505036384351,-139.10650488073583,40.893495119264173,null,86105,7414071025,null,11.410814761274331,-22.283667105593437,null,-23.103845960765973,-140.22632652380258,-11.693031199491642,-162.50999362939604,0,0]
[86600.5,86.600499999999997,39.004393807613546,1.5451553800416451,1.0013072013382149,5.1103403905788304E-2,1,0,582.76086274680449,1.5690803562232871,11.470340589741662,1.4835041396328223,1.0482195710341125,0.30449460674116224,2.3952425503673429,1.140110328458392,1.0906362707170572,0.41056373077425118,1.4109866076594371,0.95715963831520368,-4.9397605175591632,-139.26992325421907,40.730076745780934,null,86600.5,7499646600.25,null,11.405977245476187,-22.349411913633315,null,-23.179128991281321,-140.44408036197527,-11.773151745805134,-162.79349227560857,0,0]
[87096,87.096000000000004,39.227418034350428,1.5453011911987524,1.0013221929933354,5.1395287849191458E-2,1,0,586.09522178222176,1.5690901185747539,11.535472746547187,1.4839982581483266,1.0487600758478834,0.30613027403470611,2.4065642014581639,1.1422707420737124,1.0916327451252086,0.41265570986403793,1.415154662677047,0.96108845946203014,-4.9865998986955073,-139.43276246637626,40.567237533623739,null,87096,7585713216,null,11.401125213703708,-22.415377182335838,null,-23.25414306494806,-140.66081587824135,-11.853017851244353,-163.0761930605772,0,0]
[87603.25,87.603250000000003,39.455731782449583,1.5454487525363538,1.0013376285165161,5.1694084279905538E-2,1,0,589.50864993369839,1.5690999980307621,11.60215229384356,1.4844983471197579,1.0493163012996267,0.30780297851345112,2.4181658524136025,1.1444614209777142,1.0926577888758988,0.414793334868515,1.4194368089767231,0.96509384747382798,-5.0344785109329502,-139.59886424216046,40.40113575783954,null,87603.25,7674329410.5625,null,11.396143008882396,-22.483129153107079,null,-23.330659883335198,-140.88164257433237,-11.934516874452802,-163.36477172743946,0,0]
[88110.5,88.110500000000002,39.684046379786025,1.5455946159450378,1.0013531534356659,5.1992871472250617E-2,1,0,592.92207814205074,1.5691097637355209,11.668834709548886,1.4849927206231044,1.0498754595600066,0.30947390591563806,2.4297789974716046,1.1466311694826419,1.0936878160892918,0.41692694320782814,1.4237343078712648,0.96908252699308273,-5.0822864467019491,-139.76436121070543,40.235638789294569,null,88110.5,7763460210.25,null,11.391145436743127,-22.551100259624619,null,-23.406899878964378,-141.10141518947614,-12.015754442221251,-163.65251544910075,0,0]
[88617.75,88.617750000000001,39.912361811785807,1.5457388105571377,1.0013687677466263,5.2291649373309886E-2,1,0,596.3355064063021,1.5691194176423675,11.735519944767397,1.4854814758463566,1.050437545945534,0.31114304975615453,2.4414034726084717,1.1487802659854578,1.0947228126985333,0.41905652682173627,1.428047080979266,0.97305458372067732,-5.1300253170122723,-139.92925458820642,40.070745411793581,null,88617.75,7853105615.0625,null,11.38613242567946,-22.619284673775184,null,-23.482865535092404,-141.32014030616313,-12.096733109412945,-163.93942497993831,0,0]
[89125,89.125,40.14067806420654,1.545881364842461,1.001384471445216,5.2590417930176492E-2,1,0,599.74893472549797,1.5691289616601691,11.802207951706364,1.4859647077917515,1.0510025557582396,0.31281040360347739,2.4530391167510892,1.1509089843717875,1.0957627646221779,0.42118207782639822,1.4323750507196653,0.97701010344505179,-5.1776966803904791,-140.09354567356462,39.90645432643538,null,89125,7943265625,null,11.381103908372809,-22.687676693202437,null,-23.558559291592715,-141.53782447394013,-12.177455383219906,-164.22550116714257,0,0]
[89644,89.644000000000005,40.374283896385364,1.5460255525293412,1.0014006314192718,5.2896097471276819E-2,1,0,603.24143216466155,1.5691386149656326,11.870443547704994,1.4864535135667418,1.0515836744005966,0.3145145209150827,2.4649556854659069,1.1530662020182072,1.096831920237749,0.42335268350252092,1.4368189227240837,0.98104022281651526,-5.2264040106218888,-140.26102047427622,39.738979525723778,null,89644,8036046736,null,11.375942794835517,-22.757862008785647,null,-23.635727507819539,-141.75948050343962,-12.259784712984022,-164.51734251222527,0,0]
[90163,90.162999999999997,40.607890558291636,1.5461680812704268,1.0014168849611595,5.3201767118246999E-2,1,0,606.73392965939195,1.5691481571378851,11.938681947500358,1.4869367316828268,1.0521678434801198,0.31621675089577284,2.4768836146623996,1.1552026524997905,1.0979062335296776,0.42551905144602065,1.4412785417823788,0.98505321208037711,-5.2750438102592776,-140.42786775832508,39.572132241674922,null,90163,8129366569,null,11.370765318918242,-22.828252970081788,null,-23.712616115307949,-141.98006056636916,-12.341850796389707,-164.80831353645095,0,0]
[90682,90.682000000000002,40.841498035687664,1.5463089795266689,1.0014332320663228,5.3507426814450365E-2,1,0,610.22642720873489,1.5691575900850647,12.006923103288388,1.487414457184508,1.0527550579187879,0.31791708683088116,2.4888227410018757,1.1573186150382502,1.0989856893723065,0.4276811737803794,1.445753827372634,0.98904916329056036,-5.3236175891067745,-140.59408916419846,39.405910835801535,null,90682,8223225124,null,11.36557142154469,-22.898843856048238,null,-23.789227593766157,-142.19957157096741,-12.423656172221467,-165.09841542701565,0,0]
[91201,91.200999999999993,41.07510631465955,1.5464482751118118,1.0014496727301805,5.381307650326133E-2,1,0,613.71892481175803,1.5691669156718755,12.075166968343735,1.4878867829778375,1.0533453126234587,0.3196155220644824,2.5007729041129956,1.1594143642595278,1.1000702726270852,0.42983904281869806,1.4502446998326162,0.99302816851774689,-5.3721268066977634,-140.75968640679801,39.240313593201989,null,91201,8317622401,null,11.360361047743428,-22.969629069043577,null,-23.865564380187692,-142.41802038935043,-12.505203332444264,-165.38764945839401,0,0]
[91732,91.731999999999999,41.314116756531504,1.546589161068719,1.001466590348701,5.4125782820711232E-2,1,0,617.29217385905258,1.5691763476671243,12.144991482555895,1.4883645358878039,1.0539523560297386,0.32135125346702259,2.5130106298638704,1.161537932032588,1.1011852237622661,0.43204239501767444,1.4548554569301926,0.99708173165200131,-5.4216922782826762,-140.92846837516061,39.071531624839395,null,91732,8414759824,null,11.355013097434057,-23.042246340989415,null,-23.943384384642343,-142.64042786769363,-12.588371287208286,-165.68267420868304,0,0]
[92263,92.263000000000005,41.553128009007679,1.5467284262921823,1.0014836058925594,5.4438478542765928E-2,1,0,620.86542296063089,1.5691856710949863,12.214818737143421,1.4888368266582697,1.0545625710839925,0.32308498135084224,2.5252595782696181,1.1636409081842614,1.1023055100586669,0.43424127928719675,1.4594823640402685,1.0011177510720324,-5.4711931055668419,-141.09660084604724,38.903399153952762,null,92263,8512461169,null,11.349647796132714,-23.115055556856042,null,-24.020921876544968,-142.86173791113902,-12.671274080412253,-165.97679346799507,0,0]
[92794,92.793999999999997,41.792140058180422,1.5468660985840019,1.001500719356764,5.475116360881712E-2,1,0,624.43867211556119,1.5691948878192377,12.284648685376556,1.4893037482224658,1.0551759522836675,0.32481669877843306,2.5375195868104492,1.1657235724427326,1.1034311152663163,0.43643568800462879,1.4641253386091633,1.0051363253180639,-5.5206306990394127,-141.26408588315493,38.735914116845066,null,92794,8610726436,null,11.344265097435674,-23.188051101258111,null,-24.098179334265502,-143.08195776202388,-12.753914236829829,-166.27000886328199,0,0]
[93325,93.325000000000003,42.031152890458387,1.5470022051138366,1.0015179307362958,5.5063837958268996E-2,1,0,628.01192132293249,1.5692039996612368,12.354481281580261,1.4897653914219229,1.0557924941104797,0.32654639887659909,2.5497904959469673,1.1677861998635266,1.1045620231244866,0.43862561375074477,1.4687842990038846,1.009137552869481,-5.5700064211516018,-141.43092561992049,38.569074380079513,null,93325,8709555625,null,11.338864958866782,-23.261227479910335,null,-24.175159194119487,-143.30109462298006,-12.836294235252705,-166.56232210289039,0,0]
[93868.5,93.868499999999997,42.275792998950322,1.5471399218865287,1.0015356486747791,5.5383861653794324E-2,1,0,631.66928661963766,1.5692132192433856,12.425960466902115,1.4902325283963098,1.0564268169649202,0.32831472073408852,2.5623613933644482,1.1698769149049129,1.1057250274856691,0.44086244137955422,1.4735694040930782,1.013215109951956,-5.620481772004938,-141.60102687709494,38.398973122905062,null,93868.5,8811295292.25,null,11.333319597525612,-23.336308125310133,null,-24.253666220431374,-143.52427601753021,-12.920346622905761,-166.86058414284034,0,0]
[94412,94.412000000000006,42.520433900014844,1.5472760539575652,1.0015534691820667,5.5703873993814948E-2,1,0,635.32665196941684,1.5692223326773669,12.497442332761347,1.4906943216854929,1.0570644392554398,0.330080914801958,2.5749433817041774,1.1719472071313888,1.1068935525872783,0.44309455740969361,1.4783710863688027,1.0172747025226498,-5.6708950453495168,-141.77045682758936,38.229543172410644,null,94412,8913625744,null,11.327755887560656,-23.411566946112423,null,-24.331887460062624,-143.74633797527886,-13.004131572501969,-167.15790492139129,0,0]
[94955.5,94.955500000000001,42.765075580050059,1.5474106285181664,1.0015713922526834,5.6023874913395159E-2,1,0,638.98401737135885,1.5692313417858659,12.568926833423786,1.4911508622658229,1.0577053550149877,0.33184497391924539,2.5875362991761333,1.1739973568442306,1.1080675809634377,0.44532195454008761,1.4831892612554995,1.0213164358631477,-5.721247556229363,-141.93921796515579,38.060782034844209,null,94955.5,9016546980.25,null,11.322173795370201,-23.486998423895557,null,-24.409825395699901,-143.96728809007919,-13.0876516003297,-167.45428651397475,0,0]
[95499,95.498999999999995,43.009718025763469,1.547543672141118,1.0015894178811235,5.6343864347613265E-2,1,0,642.64138282457304,1.5692402483500754,12.640413924188145,1.4916022390644785,1.0583495582601825,0.33360689099543983,2.6001399869854178,1.1760276395942686,1.1092470951401319,0.44754462568779174,1.4880238451625454,1.0253404151095646,-5.7715405738138292,-142.10731284634767,37.892687153652332,null,95499,9120059001,null,11.316573291114702,-23.562597159305987,null,-24.487482468548222,-144.1871339120151,-13.17090917743352,-167.74973107132109,0,0]
[96611.5,96.611500000000007,43.510483414974317,1.547811336085364,1.0016266346592366,5.6998820430837101E-2,1,0,650.12771061044452,1.5692581668641596,12.78675004007289,1.4925104312710851,1.0596784159847772,0.33720668180458246,2.6259716376450544,1.1801226436033898,1.1116784974391876,0.45207948541065668,1.4979706659529743,1.0335222482410418,-5.8743058448513441,-142.44932272134722,37.550677278652785,null,96611.5,9333781932.25,null,11.305051994986799,-23.717841054784191,null,-24.645574352996441,-144.63372821463733,-13.340522358009641,-168.35156926942153,0,0]
[97724,97.724000000000004,44.011251850512316,1.548072908984963,1.001664281070558,5.7653727563420229E-2,1,0,657.6140386003018,1.5692756774068082,12.933096463963077,1.4933980706214602,1.0610209710455683,0.34079740910900957,2.6518464650574352,1.1841378015931583,1.114132661297345,0.45659445925382547,1.507985197550092,1.0416310313651325,-5.9768368870052111,-142.78857524602924,37.211424753970761,null,97724,9549980176,null,11.29345326916437,-23.87371986657288,null,-24.802519556120757,-145.07579087365178,-13.509066286956386,-168.94951074022467,0,0]
[98862,98.861999999999995,44.523501618490172,1.548334389652362,1.0017032348556107,5.8323594824082406E-2,1,0,665.2719635254856,1.5692931815679807,13.082807649693079,1.4942855085956503,1.062408417014824,0.34446100269969254,2.6783577463897532,1.1881646597675177,1.1166664715598118,0.46119229301272691,1.5182986244907679,1.0498510299414654,-6.0814853816956997,-143.13277608961411,36.867223910385889,null,98862,9773695044,null,11.281508445865887,-24.033784781411466,null,-24.961895998112094,-145.52336327198688,-13.680387552246208,-169.55714805339835,0,0]
[100000,100,45.035754361384477,1.5485899219880415,1.0017426380920147,5.8993409687243287E-2,1,0,672.92988864986648,1.5693102873353346,13.232528905592467,1.4951528651637307,1.063810085235958,0.3481149909796627,2.7049116071069261,1.1921125183465748,1.119223781060102,0.46576921202112048,1.5286814824719377,1.0579964789327785,-6.1859076730220766,-143.47414348116391,36.525856518836093,null,100000,10000000000,null,11.269482402915465,-24.194427106018345,null,-25.120113038358085,-145.96632648158371,-13.85063063544262,-170.16075358760204,0,0]
[101165,101.16500000000001,45.560163705092513,1.5488455647875403,1.0017834417209857,5.967906156916622E-2,1,0,680.76950463996695,1.5693274003039059,13.385812501867719,1.4960207009476927,1.0652596829946521,0.35184566125242939,2.7321382908406822,1.1960744881872738,1.1218659392329877,0.47043300712894853,1.5393818825627876,1.066258950314066,-6.2925820653606115,-143.82070357281492,36.179296427185079,null,101165,10234357225,null,11.257086881289775,-24.35943594073397,null,-25.280903252176373,-146.41509351501671,-14.023816370886598,-170.77452945575067,0,0]
[102330,102.33,46.08457595854108,1.5490953895082276,1.001824716268396,6.0364657276526866E-2,1,0,688.60912082489403,1.5693441236200614,13.539105951241824,1.4968688856116874,1.0667240665163134,0.35556614036713802,2.759407014802393,1.1999582128625905,1.124532384119562,0.47507478560518318,1.5501536008366543,1.0744452943233698,-6.3990368337773527,-144.16435290506928,35.835647094930721,null,102330,10471428900,null,11.244606259472999,-24.524964465903032,null,-25.44051903917282,-146.85916863852881,-14.195912779699821,-171.38413310443184,0,0]
[103520,103.52,46.620244595795064,1.5493447726975149,1.0018673626603725,6.1064906679523724E-2,1,0,696.61696931109668,1.5693608171999509,13.695698788121577,1.4977156683437138,1.0682350764503166,0.35935587325677515,2.7873030246621697,1.2038467653463056,1.1272809437099676,0.47979339790793335,1.5612293707863387,1.0827297578361741,-6.5075574689909201,-144.51240349402522,35.487596505974778,null,103520,10716390400,null,11.231770047623842,-24.694539561117892,null,-25.60236792875401,-147.30800070268489,-14.370597881130168,-172.00254026380279,0,0]
[104710,104.71,47.155916066582328,1.5495884901243573,1.0019105002752733,6.1765096126856468E-2,1,0,704.62481798701708,1.5693771313448373,13.852301223346567,1.4985433056351991,1.0697613849881302,0.36313484610146968,2.8152403452683115,1.2076581976302521,1.1300544801314039,0.48448895218772148,1.5723780890987775,1.0909368976429696,-6.6158649080955358,-144.8574824070505,35.142517592949503,null,104710,10964184100,null,11.21884528615827,-24.864573364086329,null,-25.763032121277483,-147.75208125575563,-14.544186835119213,-172.61665461984197,0,0]
[105930,105.93,47.705094701822496,1.5498326696461853,1.0019552352813255,6.2482874456477475E-2,1,0,712.83454539124466,1.5693934762534019,14.012861246600268,1.4993726030174055,1.0713419854218995,0.36699785222125214,2.8439235796122775,1.2114879205298783,1.1329236748638403,0.48927890585378575,1.5838828547515087,1.0992717684561228,-6.7266889546496822,-145.2082111870464,34.791788812953598,null,105930,11221164900,null,11.205502971814225,-25.039328565498376,null,-25.926537320120051,-148.20249896378178,-14.721034348305826,-173.24182752928016,0,0]
[107150,107.15,48.254276116671164,1.5500712911727732,1.002000486454208,6.3200588324911919E-2,1,0,721.04427298157384,1.569409448959453,14.173430688630061,1.5001831108849382,1.0729385260525348,0.37084941931087817,2.872647691829799,1.2152411094106583,1.1358187313365644,0.49404455044218687,1.5954628037962659,1.1075275956374038,-6.8373035654749925,-145.5558889778803,34.444111022119699,null,107150,11481122500,null,11.192068059376048,-25.214483593017938,null,-26.088838421032033,-148.64807304898287,-14.896770361655985,-173.86255664200081,0,0]
[108400,108.4,48.816964777419848,1.5503102118796794,1.0020473856495493,6.3935883272683555E-2,1,0,729.45587930565762,1.569425441534265,14.337957997701906,1.5009947200361404,1.0745907845546123,0.37478376674881186,2.9021192634484398,1.2190094771550786,1.1388115949405944,0.49890213835170694,1.6074047297441918,1.1159056147807698,-6.9504278398814883,-145.90899071238252,34.091009287617482,null,108400,11750560000,null,11.178207064908555,-25.394319624617324,null,-26.253902417031568,-149.09965803803294,-15.075695352123013,-174.49397766265025,0,0]
[109650,109.65,49.379656161284323,1.5505436874980283,1.0020948265596064,6.4671108997649607E-2,1,0,737.86748581205518,1.569441069481966,14.502494537025838,1.5017879136460253,1.0762596255223744,0.37870597359725616,2.9316312179497714,1.222702026141492,1.1418311888901556,0.50373414781380799,1.6194240694605608,1.1242030066565187,-7.0633456273957185,-146.25896900405962,33.741030995940378,null,109650,12023122500,null,11.164249573396432,-25.574494292878949,null,-26.417743924819423,-149.54631541051049,-15.25349435142299,-175.12080970338943,0,0]
[110925,110.925,49.953604082747098,1.5507764138982725,1.0021437742825747,6.5420967109710793E-2,1,0,746.44732463000832,1.5694566471334828,14.670330994061317,1.5025786410122295,1.0779788466919276,0.38269405097714049,2.9617737620720708,1.22639256523956,1.1449384929802744,0.50863642338984416,1.6317627885723105,1.1325844988519103,-7.1783152286242231,-146.61277116332187,33.387228836678133,null,110925,12304355625,null,11.149913966019064,-25.758581488185889,null,-26.58362369062904,-149.99691007530362,-15.433709724609976,-175.7554915634895,0,0]
[112200,112.2,50.527554648310144,1.5510038531578809,1.0021932854429207,6.6170751553142115E-2,1,0,755.02716362498018,1.569471870748093,14.83817641620923,1.5033514798661107,1.0797151580991691,0.38666936480182923,2.9919558326650666,1.2300086943723663,1.1480731632543026,0.51351204550633933,1.6441805340350377,1.1408845540011061,-7.2930820056647789,-146.96340909792906,33.036590902070941,null,112200,12588840000,null,11.135478910349562,-25.942942037086215,null,-26.748273174931111,-150.44254003110558,-15.612794264581549,-176.38548206819181,0,0]
[113510,113.51,51.117263379951197,1.5512322161769361,1.0022447424954153,6.6941040710285518E-2,1,0,763.84252779007534,1.5694871560571166,15.010638381291173,1.5041275318420455,1.0815168468266347,0.39074044385367379,3.0230063552088771,1.2336488326007597,1.151322151678378,0.51849373346612992,1.6570207015759397,1.1493289090303183,-7.4107935733805057,-147.32042215528006,32.679577844719944,null,113510,12884520100,null,11.120544588760467,-26.132608965829512,null,-26.916182152719657,-150.89531585498656,-15.79563756395919,-177.02792482081608,0,0]
[114820,114.82,51.706974716535761,1.5514553703062135,1.0022967941639369,6.7711250318475261E-2,1,0,772.65789212956292,1.5695020925815921,15.183109181254036,1.5048859533180212,1.0833364004793626,0.39479791453324642,3.0540961196140297,1.2372149062961459,1.1545995514955212,0.5234472621421562,1.6699427558417845,1.1576898770650048,-7.528301904014727,-147.67418747536621,32.32581252463379,null,114820,13183632400,null,11.105506490113473,-26.322486361631615,null,-27.082834729070942,-151.34302006642829,-15.977328238957469,-177.6655064280599,0,0]
[116155,116.155,52.307942675030276,1.5516776065324347,1.0023504508347538,6.8496075809496348E-2,1,0,781.64148878624133,1.5695169675398675,15.358880189940768,1.5056413241344526,1.0852089649746623,0.39891875037020141,3.0858183444473966,1.2407750619369493,1.1579684772035561,0.52846635028389866,1.6831948913217127,1.166125945260388,-7.6478486392926825,-148.03141123516056,31.968588764839438,null,116155,13491984025,null,11.090075335411754,-26.516165575957441,null,-27.251396365056841,-151.7941371797514,-16.161321029645087,-178.31030275570885,0,0]
[117490,117.49,52.908913158270494,1.5518947941902439,1.0024047248380665,6.9280816796963504E-2,1,0,790.62508561193863,1.5695315044602305,15.534659763857405,1.5063796008462536,1.0870998940472583,0.40302531996853103,3.1175788848944306,1.2442627223950637,1.1613664039146232,0.53345619381228915,1.696530537724326,1.174478086428582,-7.7671939204930496,-148.38536016010056,31.614639839899439,null,117490,13803900100,null,11.074537857044033,-26.709987446924863,null,-27.418695633031103,-152.24016120865804,-16.344157775987071,-178.95014865558289,0,0]
[118860,118.86,53.525641957683781,1.5521126053852381,1.0024610634719349,7.0086042663258866E-2,1,0,799.8442076177987,1.569546082996174,15.715056394600824,1.5071200616595244,1.0890593908012491,0.40722465334252334,3.1502107188519148,1.2477686606223686,1.1648833001321548,0.538546461476762,1.7103018611804253,1.1829633265857822,-7.8894630627919859,-148.74523546260241,31.254764537397591,null,118860,14127699600,null,11.05848331684679,-26.909001535336259,null,-27.589090092946051,-152.69267327684798,-16.530606776099262,-179.60167481218423,0,0]
[120230,120.23,{"$f":"SQRT(1+(A589/pole1)^2)","v":54.142373238594566},{"$f":"ATAN(A589/pole1)","v":1.5523254544516421},{"$f":"SQRT(1+(A589/Zero1)^2)","v":1.0025180520169246},{"$f":"ATAN(A589/Zero1)","v":7.0891177504763897E-2},{"$f":"IF(VIN_nom>Vout, 1, SQRT(1+(A589/z_RHP)^2))","v":1},{"$f":"IF(VIN_nom>Vout, 0, -ATAN(A589/z_RHP))","v":0},{"$f":"SQRT(1+(A589/Pole2)^2)","v":809.06332978977866},{"$f":"ATAN(A589/Pole2)","v":1.5695603292928533},15.895461446056052,1.5078437151875768,{"$f":"SQRT(1+(A589/pole4)^2)","v":1.0910380232841017},{"$f":"ATAN(A589/pole4)","v":0.41140882902827086},{"$f":"SQRT(1+(A589/Zero3)^2)","v":3.182880479712995},{"$f":"ATAN(A589/Zero3)","v":1.2512026689520861},{"$f":"SQRT(1+(A589/pole5)^2)","v":1.1684301972841684},{"$f":"ATAN(A589/pole5)","v":0.54360595545290602},{"$f":"SQRT((1-(Z589/pterm2))^2+(A589/pterm1)^2)","v":1.7241595911326211},{"$f":"IF((ATAN((A589/pterm1)/(1-A589^2/pterm2))>0),ATAN((A589/pterm1)/(1-A589^2/pterm2)),PI()+ATAN((A589/pterm1)/(1-A589^2/pterm2)))","v":1.1913629793083049},{"$f":"20*LOG10(((E589*K589*G589*O589)/(C589*I589*S589*M589*Q589))*Adc)","v":-8.0115285864941619},{"$f":"((F589+L589+H589+R589)-(D589+J589+T589+N589))*radconv","v":-149.10176655412289},{"$f":"IF(V589>0,V589,V589+180)","v":30.898233445877111},null,{"$f":"IF(U589<0,A589,1000000000)","v":120230},{"$f":"A589^2","v":14455252900},null,{"$f":"20*LOG10((K589/(I589*M589))*AEA*Afb)","v":11.042318529874414},{"$f":"(L589-(J589+N589))*radconv","v":-27.108091102784609},null,{"$f":"20*LOG10((E589*G589/(C589*S589))*Am)","v":-27.75819828138431},{"$f":"(F589+H589-(D589+T589))*radconv","v":-153.1400024525563},-16.715879751509895,-180.24809355534092,0,0]
[126030,{"$f":"A590/1000","v":126.03},56.753378012785426,1.5531753183742341,1.0027665147740954,7.4298745501154395E-2,1,0,848.09319179554541,1.5696172108187361,16.659307048321086,1.5107337141571868,1.0996243118983611,0.42895351431592549,3.3215847996314225,1.2649911345270124,1.1837723696917835,0.56468539404126006,1.7837680331331258,1.2260068702361309,-8.5261255225499966,-150.57531752507015,29.424682474929853,null,126030,15883560900,null,10.972684259134102,-27.95100185122519,null,-28.46035269107535,-154.97840554206093,{"$f":"AB590+AE590","v":-17.487668431941248},-182.92940739328611,{"$f":"SUM((U591<0)*(U590>0))*A590","v":0},0]
[131830,131.83000000000001,59.364420172345319,1.5539504232035877,1.0030266153269489,7.7704585755992206E-2,1,0,887.12305630387323,1.5696690872257386,17.423279590097604,1.5133702933522817,1.1085437787792818,0.44622111199427328,3.4608699399186653,1.2776719992346812,1.1996269543659417,0.58521657571251928,1.8448613159306344,1.2592418588266425,-9.0373483730812136,-151.99372991826314,28.006270081736858,null,131830,17379148900,null,10.901167606504929,-28.792269760432312,null,-29.141297247571686,-156.73190008557054,-18.240129641066758,-185.52416984600285,0,0]
[144540,144.54,65.086312685793857,1.5554315088156794,1.0036372440978583,8.5161653193811568E-2,1,0,972.65230115204974,1.5697682099899641,19.097802661259724,1.5184103247805423,1.1292157593111427,0.48307587460435897,3.7678124390080177,1.3021713345328785,1.2360648943408035,0.62831509755329851,1.9837278174342738,1.3275943334144416,-10.146406026084726,-154.92680543208633,25.073194567913674,null,144540,20891811600,null,10.738280851421456,-30.620798901627339,null,-30.56564694594282,-160.30580986574935,-19.827366094521366,-190.92660876737671,0,0]
[158490,158.49,71.366575323513032,1.5567837064357908,1.0043716051813796,9.3335294392882129E-2,1,0,1066.5258717209708,1.5698587028956192,20.936158566118163,1.5230138921582417,1.1536021550153635,0.52194726902898914,4.106894752503556,1.3248307333444354,1.2785395497698337,0.67269958663127094,2.1436996008469569,1.3963707039864184,-11.346351609946151,-157.90210409665815,22.09789590334185,null,158490,25119080100,null,10.550694709768063,-32.589385628320073,null,-32.033034449301468,-163.85556570654657,-21.482339739533405,-196.44495133486663,0,0]
[173780,173.78,78.250228009776933,1.5580164634415063,1.005253463914443,0.10227968986714957,1,0,1169.4166968394811,1.5699411995125716,22.95152616254337,1.5272124424123217,1.1822448109172354,0.5626424905644275,4.4805856970150861,1.3457155446122584,1.3277898657287026,0.71798749779166537,2.3277734118034106,1.4653447090762135,-12.640652206252799,-160.91320491669879,19.086795083301212,null,173780,30199488400,null,10.336001053161221,-34.685217569388541,null,-33.540762031134918,-167.36564076093779,-23.204760977973699,-202.05085833032632,0,0]
[190550,190.55,85.800299597361303,1.5591410919553734,1.0063129836635643,0.1120709608208408,1,0,1282.2668769324512,1.5700164578617162,25.162358940493853,1.5310439559581774,1.2157977192486193,0.60499446762303777,4.8923349088010166,1.3649441911956453,1.3847012798415843,0.7638512666744367,2.5399047948120299,1.5344612077161977,-14.034472998857019,-163.96029813302388,16.039701866976117,null,190550,36309302500,null,10.091535906177004,-36.896589541863037,null,-35.089210620162831,-170.82916239733734,-24.997674713985827,-207.72575193920039,0,0]
[208930,208.93,94.075317753633428,1.5601663458724169,1.0075847829322067,0.1227774442615866,1,0,1405.9512195959192,1.5700850645047277,27.58579522831991,1.5345378416473414,1.2549335087116307,0.64872466347072699,5.3453558315723173,1.3826092526888278,1.4501424614998923,0.80987712998153882,2.784556772010883,1.6035878958558973,-15.530237086979238,-167.03848593686845,12.961514063131546,null,208930,43651744900,null,9.8151945944760453,-39.205891170855779,null,-36.676750711580993,-174.23513629114547,-26.861556117104946,-213.44102746200124,0,0]
[229090,229.09,103.15181963291398,1.5611017264675044,1.0091122057064332,0.13448825916901505,1,0,1541.6137040592678,1.5701476558162357,30.244249916880584,1.5377261630900927,1.3004416250212409,0.69356863280249281,5.8438553205963961,1.398830093266324,1.5251314042804678,0.85571184365525788,3.0675156914052071,1.6727017416451306,-17.131556331702541,-170.14517408775436,9.8548259122456443,null,229090,52482228100,null,9.5048316793333179,-41.596170208494229,null,-38.304231841580922,-177.57768105608838,-28.799400162247604,-219.17385126458259,0,0]
[251190,251.19,113.10184098101051,1.5619546225331971,1.0109451046787796,0.14728339240338381,1,0,1690.3310167080731,1.5702047266595105,33.158821999170648,1.5406338667074948,1.3531181307811626,0.73916137327885478,6.3918030738644749,1.4137005838880554,1.6106538614496082,0.90094957153660482,3.3954415176555712,1.7416813887526703,-18.838954842299856,-173.27018845164878,6.729811548351222,null,251190,63096416100,null,9.1591361946748382,-44.045112590124212,null,-39.970514399659429,-180.84568392367706,-30.811378204984592,-224.89079651380126,0,0]
[275420,275.42,124.01092493372242,1.5627324337278523,1.0131441202567497,0.16125596790872096,1,0,1853.3817226712945,1.5702567725108074,{"$f":"SQRT(1+(A599/Zero2)^2)","v":36.354568833900572},{"$f":"ATAN(A599/Zero2)","v":1.5432859978435587},1.4138473681199784,0.78513912433784228,6.9939194195474208,1.4273232682908612,1.7078045420612102,0.94524153103225828,3.7766666584575002,1.8104367398510217,-20.652909848540382,-176.4011904139569,3.5988095860431031,null,275420,75856176400,null,8.7771356986169504,-46.53046976695606,null,-41.675694747354697,-184.02907105751837,-32.898559048737745,-230.55954082447442,0,0]
[302000,302,135.97812223393473,1.5634421362997806,1.0157828555482298,0.1765108001292385,1,0,2032.2462658357892,1.5703042604261863,39.860506891069981,1.5457062061533098,1.4836046580880544,0.83114009191486782,7.6556798166686875,1.4398000253165708,1.8177946358744519,0.98829181358574492,4.2215629190485444,1.8788756274098781,-22.573527265419891,-179.52219022184039,0.47780977815961023,null,302000,91204000000,null,8.3582696994945387,-49.030184200931963,null,-43.420575847503386,-187.1169559314049,-35.062306148008844,-236.14714013233686,0,0]
[331130,331.13,149.09347951024304,1.5640890750680254,1.0189447149204274,0.19313407968037402,1,0,2228.270504313904,1.5703475482324953,43.703016471963224,1.5479126138740691,1.5633179972986344,0.87673380630640974,8.3820695115827224,1.4512092135699652,1.9417424061600403,1.0297870789149042,4.7420579273102188,1.9467690575194927,-24.596824825875636,-182.6077065205362,-2.6077065205361976,null,331130,109647076900,null,7.9032272999566047,-51.518573969056895,null,-45.203244979726392,-190.0915860378289,-37.300017679769788,-241.61016000688579,0,0]
[363080,363.08,163.47856030496285,1.5646792785743742,1.0227342829635975,0.21124284686331915,1,0,2443.2713465970764,1.5703870394558901,47.917712984322826,1.5499257021643205,1.6541027520467493,0.92158625961581042,9.179825494264076,1.4616451859568498,2.0810496976779835,1.0695410985713245,5.3536060549069706,2.0139708891712962,-26.721054115165323,-185.63338803944333,-5.6333880394433322,null,363080,131827086400,null,7.4125417216528087,-53.975351464910126,null,-47.024635311266216,-192.93822760847851,-39.612093589613409,-246.91357907338863,0,{"$f":"IF(AI602>0,W602,0)","v":0}]
[398110,398.11,179.25042632781518,1.5652175105672106,1.027271541844591,0.23093657148393235,1,0,2678.9984083045151,1.5704230529548964,52.538894516572213,1.5517616592751005,1.7570445600394047,0.96533977785579417,10.055443465773635,1.4711830455984929,2.2370690046877826,1.1073724416061348,6.0743214130709822,2.0802199226089542,-28.940946712075547,-188.56783564600701,-8.567835646007012,null,398110,158491572100,null,6.8878177890010708,-56.379114229340395,null,-48.883201462568266,-195.636488742295,-41.995383673567197,-252.01560297163539,0,0]
[436520,436.52,196.54414922152355,1.5657083894612664,1.0327001997924294,0.25232237710881056,1,0,2937.4704767185576,1.5704558978349323,57.606137275004777,1.5534361933419119,1.8733353389362439,1.0076997261666416,11.016424846106052,1.4798976516369382,2.4113201064139345,1.1431715888594747,6.9264906546604283,2.1452590008572927,-31.251115178035711,-191.37895357050456,-11.378953570504564,null,436520,190549710400,null,6.3308981812202898,-58.712098628935586,null,-50.77772953103868,-198.16576231732483,-44.446831349818389,-256.8778609462604,0,0]
[478630,478.63,215.5038058154,1.5661560208617129,1.039188434627683,0.27549970051679362,1,0,3220.8409249678339,1.5704858488671249,63.16165727412978,1.554963275141384,2.0042170331931528,1.0484119170076036,12.070777590584097,1.4878565647150717,2.6054072360485003,1.1768697972916369,7.9369070040572929,2.2088000960478138,-33.644699614511843,-194.03336704718842,-14.03336704718842,null,478630,229086676900,null,5.7440936487300052,-60.958956067076997,null,-52.705985922107544,-200.50408347838854,-46.961892273377536,-261.46303954546556,0,0]
[524810,524.80999999999995,236.29598535249048,1.5665643336720534,1.0469369833124382,0.30057189253841393,1,0,3531.5995907597098,1.570513168982788,69.254268171144943,1.5563562817299821,2.1510767409629947,1.0872933474147202,13.227767344921403,1.4951255839265651,2.8211616680464733,1.2084556357529725,9.1384539003011547,2.2705795586166033,-36.115058915848984,-196.49969188706348,-16.499691887063477,null,524810,275425536100,null,5.1296874476052743,-63.10844986225527,null,-54.665917832335651,-202.6306497613698,-49.536230384730374,-265.73909962362507,0,0]
[575440,575.44000000000005,259.09177982880419,1.5669366810605705,1.0561765590051411,0.32761842121234586,1,0,3872.3036047353812,1.5705380825782262,75.934104071798387,1.5576266328923305,2.3153249273045868,1.124192650218619,14.496915817039172,1.5017613154889125,3.0604611953515795,1.2379355243066417,10.570155446699857,2.3303099988573446,-38.653527876408852,-198.74741882103001,-18.74741882103001,null,575440,331131193600,null,4.4904143092718476,-65.151265865997189,null,-56.653716979400684,-204.52463388816571,-52.163302670128836,-269.67589975416291,0,0]
[630960,630.96,284.08929608911797,1.5672762995398468,1.0671801205329607,0.3567151529479789,1,0,4245.9138550273283,1.5705608062348031,83.259216092432823,1.5587853556226576,2.4985581839174396,1.159027617583021,15.889253419085643,1.5078190866609877,3.3254676315725864,1.2653597357859363,12.279714419249887,2.3877575217973979,-41.252102942008655,-200.75077529345799,-20.750775293457991,null,630960,398110521600,null,3.8287372393282109,-67.082074525202984,null,-58.665855515501917,-206.16847327742116,-54.837118276173705,-273.25054780262417,0,0]
[691830,691.83,311.4956461194065,1.5675860035362703,1.0802595462824742,0.38790516918765661,1,0,4655.5258156112841,1.5705815282850621,91.29029500584484,1.5598420408041143,2.7024346082122745,1.1917477960763758,17.416316755660052,1.5133473098278825,3.6184421472975625,1.2907896917243231,14.323871558122558,2.4427006443068451,-43.901422036775003,-202.48781543588174,-22.487815435881743,null,691830,478628748900,null,3.1473173515453983,-68.89744634471252,null,-60.697433015410589,-207.54717075047347,-57.550115663865192,-276.444617095186,0,0]
[758580,758.58,341.54945922040457,1.5678684889614254,1.0957795139298427,0.42121619615505229,1,0,5104.7060108688893,1.5706004291263009,100.09726806831871,1.56080587796111,2.9288438285278047,1.2223566596803315,19.091402607072567,1.5183927472119274,3.9419875875265618,1.3143144027376852,16.771769051060804,2.4949851200564312,-46.593072302160351,-203.942850380273,-23.942850380273001,null,758580,575443616400,null,2.4484092911167696,-70.597064184051376,null,-62.743933270581913,-208.65045451239669,-60.295523979465145,-279.24751869644808,0,0]
[831760,831.76,374.49836980634461,1.568126085028869,1.1141499480175947,0.45662604447390459,1,0,5597.1555510231774,1.5706176646161873,109.7527020987351,1.5616848077375862,3.1797438124719086,1.2508761960945529,20.92831355210209,1.5229959671795277,4.2988105710072864,1.3360230524641556,19.705386173581118,2.5444801993523205,-49.317435460582992,-205.1054974536342,-25.1054974536342,null,831760,691824697600,null,1.7344180821007571,-72.181741810214547,null,-64.799572047048713,-209.47223796927051,-63.065153964947953,-281.65397977948504,0,0]
[912010,912.01,410.63053451498035,1.5683610451867849,1.1358453684980865,0.4940880905147737,1,0,6137.1811825307914,1.5706333855398344,120.34103926482422,1.5624865139909407,3.4574028927189264,1.2773693249700881,22.943114692529754,1.5271964534337372,4.692063562206183,1.3560231288602995,23.224767088692509,2.5911292546227198,-52.066445189260484,-205.97232739630147,-25.972327396301466,null,912010,831762240100,null,1.0072002442736356,-73.65465264041049,null,-66.859415221530455,-210.01207705048952,-65.852214977256821,-283.66672969090001,0,0]
[1000000,1000,450.24761752828425,1.5685753248768148,1.1613919653393967,0.53349346058453129,1,0,6729.2915306020268,1.5706477227406461,131.95068064899863,1.563217665071962,3.7641984199791607,1.3019070292634429,25.152627700226027,1.5310285681469391,5.1250548493696231,1.3744166661445592,27.448801567377402,2.6349016700285697,-54.831270804967701,-206.54578241374347,-26.545782413743467,null,1000000,1000000000000,null,0.26869947025733404,-75.019489126886924,null,-68.917667173961718,-210.27456763936394,-68.648967703704386,-285.29405676625083,0,0]
[]
[]
["Pole/Zero Locations for Chart"]
[{"$f":"Q4*1000","v":42415.25},null,{"$f":"SQRT(1+(A617/pole1)^2)","v":19.123481921350731},{"$f":"ATAN(A617/pole1)","v":1.5184807336745054},{"$f":"SQRT(1+(A617/Zero1)^2)","v":1.0003137338567993},{"$f":"ATAN(A617/Zero1)","v":2.5046031807140302E-2},{"$f":"IF(VIN_nom>Vout, 1, SQRT(1+(A617/z_RHP)^2))","v":1},{"$f":"IF(VIN_nom>Vout, 0, -ATAN(A617/z_RHP))","v":0},{"$f":"SQRT(1+(A617/Pole2)^2)","v":285.42633121270489},{"$f":"ATAN(A617/Pole2)","v":1.567292788626043},{"$f":"SQRT(1+(A617/Zero2)^2)","v":5.6851990379014401},{"$f":"ATAN(A617/Zero2)","v":1.3939811151197292},{"$f":"SQRT(1+(A617/pole4)^2)","v":1.0117766927611851},{"$f":"ATAN(A617/pole4)","v":0.15272371809865984},{"$f":"SQRT(1+(A617/Zero3)^2)","v":1.4616362477220772},{"$f":"ATAN(A617/Zero3)","v":0.81733847528341874},{"$f":"SQRT(1+(A617/pole5)^2)","v":1.0224750465542927},{"$f":"ATAN(A617/pole5)","v":0.21005725408740561},{"$f":"SQRT((1-(A617^2/(pole3^2)))^2+(A617/(Q*pole3))^2)","v":1.1096343167093743},{"$f":"ATAN((A617/(Q*pole3))/(1-A617^2/pole3^2))","v":0.53422161588736339},{"$f":"20*LOG10(((E617*K617*G617*O617)/(C617*I617*S617*M617*Q617))*Adc)","v":1.0415253199045538E-2},{"$f":"((F617+L617+H617+R617)-(D617+J617+T617+N617))*radconv","v":-122.8212072462715},{"$f":"IF(V617>0,V617,V617+180)","v":57.178792753728501},"crossover",null,null,null,11.816643161463903,{"$f":"(L617-(J617+N617))*radconv","v":-18.680451932205546},null,{"$f":"20*LOG10((E617*G617/(C617*S617))*Am)","v":-14.909959645267882},{"$f":"(F617+H617-(D617+T617))*radconv","v":-116.17614944313392}]
[{"$f":"A617","v":42415.25},null,null,null,null,null,null,null,null,null,null,null,null,null,null,null,null,null,null,null,null,-180]
[{"$f":"A618","v":42415.25}]
[1000000]
[]
[{"$f":"pole1","v":2221.005570045043},null,1.4142135623730951,0.78539816339744828,1.0000008603686077,1.3117682651961604E-3,{"$f":"IF(VIN_nom>Vout, 1, SQRT(1+(A622/z_RHP)^2))","v":1},{"$f":"IF(VIN_nom>Vout, 0, -ATAN(A622/z_RHP))","v":0},14.979210677413381,1.5039874465726708,1.0420561906106498,0.28507291708984728,1.0000324803949845,8.0597166032296066E-3,{"$f":"SQRT(1+(A622/Zero3)^2)","v":1.0015567221745205},{"$f":"ATAN(A622/Zero3)","v":5.5762090473272782E-2},{"$f":"SQRT(1+(A622/pole5)^2)","v":1.0000623154130541},{"$f":"ATAN(A622/pole5)","v":1.1163527866869959E-2},{"$f":"SQRT((1-(A622^2/(pole3^2)))^2+(A622/(Q*pole3))^2)","v":1.0003142723048974},{"$f":"ATAN((A622/(Q*pole3))/(1-A622^2/pole3^2))","v":2.9580005625901597E-2},{"$f":"20*LOG10(((E622*K622*G622*O622)/(C622*I622*S622*M622*Q622))*Adc)","v":31.403266537161379},{"$f":"((F622+L622+H622+R622)-(D622+J622+T622+N622))*radconv","v":-116.28047366864084},63.719526331359162,"p1",null,null,null,22.781065867880855,{"$f":"(L622-(J622+N622))*radconv","v":-70.300445952306873},null,{"$f":"20*LOG10((E622*G622/(C622*S622))*Am)","v":8.6092309139249874},{"$f":"(F622+H622-(D622+T622))*radconv","v":-46.619650748313163}]
[{"$f":"Zero1","v":1693137.6944016635},null,762.32998870410142,1.5694845585297004,1.4142135623730951,0.78539816339744828,1,0,11393.617065160814,1.5707085583544125,223.40649340317637,1.5663201662137505,6.2251359102497892,1.4094582362825174,42.564939867575113,1.5473006513203889,8.5691869064229991,1.4538326358968727,74.179579156259337,-0.30892977123560322,-70.594736045343566,-24.933439717632368,155.06656028236762,"z1",null,null,null,-4.1009894866606089,{"$f":"(L623-(J623+N623))*radconv","v":-81.007444780013827},null,-80.415994731951329,-27.22446918807147]
[{"$f":"Pole2","v":148.60405534431035},null,1.0022358712388457,6.6808880222225767E-2,1.0000000038516494,8.7768440484248337E-5,1,0,1.4142135623730951,0.78539816339744828,1.0001922152828902,1.960533085720469E-2,1.0000001454086862,5.3927482525913638E-4,1.0000069744430256,3.7348098987638337E-3,1.0000002789786551,7.4696531392288794E-4,1.0000014071020986,1.9794843334116205E-3,54.527571804245476,-47.801051759530928,132.19894824046906,"p2",null,null,{"$f":"Pole2","v":148.60405534431035},42.924671985884046,{"$f":"(L624-(J624+N624))*radconv","v":-43.907595507581313},null,11.602841662507739,-3.9362542119289601]
[{"$f":"Zero2","v":7578.8068225598272},null,3.5558409548385468,1.2857234097050494,1.0000100180904086,4.4761605811462031E-3,1,0,51.009802979427384,1.5511909959376919,1.4142135623730951,0.78539816339744828,1.0003781365266842,2.7496087325038724E-2,1.017978967925331,0.18822150530477078,1.0007253605088324,3.8076825589803395E-2,1.0036542290293236,0.1007566039392051,15.507535784420599,-122.45345383047852,57.546546169521477,"z2",null,null,{"$f":"Zero2","v":7578.8068225598272},14.787247008305025,{"$f":"(L625-(J625+N625))*radconv","v":-45.452107094709049},null,0.57181078749620839,-79.182988141813823]
[{"$f":"pole3","v":200000},null,90.054853748123122,1.5596917554076588,1.0069524576096909,0.11757903377318329,1,0,1345.858662770087,1.5700533066549103,26.408318480156222,1.5329204151490212,1.2356243724526255,0.62782422372778623,5.125054849369624,1.3744166661445592,1.4179730210275101,0.78804595178116543,2.6641074113876124,{"$error":"#DIV/0!"},-14.807733719908667,{"$error":"#DIV/0!"},{"$error":"#DIV/0!"},"p3",null,null,null,9.9504003761869075,{"$f":"(L626-(J626+N626))*radconv","v":-38.099236303618653},null,-35.918745092297314,{"$error":"#DIV/0!"}]
[{"$f":"Fp2_u","v":275562.72605040763},null,{"$f":"SQRT(1+(A627/pole1)^2)","v":124.07518475111435},{"$f":"ATAN(A627/pole1)","v":1.5627366101916671},{"$f":"SQRT(1+(A627/Zero1)^2)","v":1.0131576581956181},{"$f":"ATAN(A627/Zero1)","v":0.1613380905123793},1,0,{"$f":"SQRT(1+(A627/Pole2)^2)","v":1854.3421677231647},{"$f":"ATAN(A627/Pole2)","v":1.5702570519696375},{"$f":"SQRT(1+(A627/Zero2)^2)","v":36.373393970399469},{"$f":"ATAN(A627/Zero2)","v":1.5433002394698578},{"$f":"SQRT(1+(A627/pole4)^2)","v":1.4142135623730951},{"$f":"ATAN(A627/pole4)","v":0.78539816339744828},6.997469679187148,1.427396564490601,1.7083861613949403,0.94548742557938414,3.7789804322780989,-1.3307699484701134,-20.663415635676664,3.58120844379259,{"$f":"IF(V627>0,V627,V627+180)","v":3.58120844379259},"p4",null,null,null,null,null,null,-41.685398140304564,-4.0467190479489394]
[{"$f":"z_RHP","v":0},null,{"$f":"SQRT(1+(A628/pole1)^2)","v":1},{"$f":"ATAN(A628/pole1)","v":0},{"$f":"SQRT(1+(A628/Zero1)^2)","v":1},{"$f":"ATAN(A628/Zero1)","v":0},1,0,{"$f":"SQRT(1+(A628/Pole2)^2)","v":1},{"$f":"ATAN(A628/Pole2)","v":0},{"$f":"SQRT(1+(A628/Zero2)^2)","v":1},{"$f":"ATAN(A628/Zero2)","v":0},{"$f":"SQRT(1+(A628/pole4)^2)","v":1},{"$f":"ATAN(A628/pole4)","v":0},1,0,1,0,1,0,57.555556508438372,0,{"$f":"IF(V628>0,V628,V628+180)","v":180},"z_RHP",null,null,null,null,null,null,11.622252703207742,0]
[{"$f":"Fp2_u","v":275562.72605040763},null,null,null,null,null,null,null,null,null,null,null,null,null,null,null,null,null,null,null,-25]
[]
[null,null,null,"System","Plant"]
["p1","p-dom",{"$f":"pole1","v":2221.005570045043},{"$f":"U622","v":31.403266537161379},{"$f":"AE622","v":8.6092309139249874}]
["z1","ESR zero",{"$f":"Zero1","v":1693137.6944016635},{"$f":"U623","v":-70.594736045343566},{"$f":"AE623","v":-80.415994731951329}]
["p2","EA pole",{"$f":"Pole2","v":148.60405534431035},{"$f":"U624","v":54.527571804245476},{"$f":"AE624","v":11.602841662507739}]
["z2","EA zero",{"$f":"Zero2","v":7578.8068225598272},{"$f":"U625","v":15.507535784420599},{"$f":"AE625","v":0.57181078749620839}]
["p3","p_sampling",{"$f":"pole3","v":200000},{"$f":"U626","v":-14.807733719908667},{"$f":"AE626","v":-35.918745092297314}]
[]
[]
[{"$f":"Q4*1000","v":42415.25}]
[{"$f":"Q4*1000","v":42415.25}]
[]
[]
[]
[]
[]
[]
[]
[]
[]
[]
[]
[]
[]
[]
[]
[]
[]
[]
[]
[]
[]
[]
[]
[]
[]
[]
[]
[]
[]
[]
[]
[]
[]
[]
[]
[]
[]
[]
[]
[]
[]
[]
[]
[]
[]
[]
[null,null,null,null,null,null,null,null,null,null,null,null,null,null,null,null,null,null,null,null,null,null,null,null,null,null,null,null,null,null,null,null,null,null,"phase margin",{"$f":"SUM(AJ689:AJ1306)","v":0}]

{"sheet":"Bode Plot Management","index":7,"n_rows":6,"n_cols":6,"rows_kept":6,"cut":false,"hidden":true,"merged":[]}
[]
[{"$f":"CHOOSE(BODE_PLOT_TYPE, \"BODE_PLOT_Ch1\", \"BODE_PLOT_Ch2\")","v":"BODE_PLOT_Ch1"}]
[]
[]
[]
[null,null,null,null,null,{"$f":"INDIRECT(A2)","v":0}]

{"sheet":"Efficiency Calculations","index":8,"n_rows":109,"n_cols":57,"rows_kept":109,"cut":false,"hidden":true,"merged":[[6,51,6,56],[6,27,6,32],[6,33,6,36],[6,38,6,42],[6,45,6,49],[6,24,6,26],[0,0,3,3],[5,0,6,3],[6,6,6,13],[6,17,6,20],[6,21,6,23]]}
["BUCK CONTROLLER POWER DESIGN TOOL",null,null,null,null,null,null,null,null,null,null,null,null,null,null,null,null,null,null,null,null,null,null,null,null,null,null,null,null,null,null,null,null,null,null,null,null,null,null,null,{"$f":"Ext_VCC","v":1}]
[null,null,null,null,null,null,null,{"$f":"AV19","v":0.90858065249145392},"10% load"]
[null,null,null,null,null,null,null,{"$f":"AV59","v":0.92933105353037038},"50% load",null,null,null,null,null,null,null,null,null,null,null,null,null,null,null,null,null,null,null,null,null,null,null,null,null,null,null,null,null,null,{"$f":"IF(MODE=1, (Qg_Q1+Qg_Q2)*Fsw*Vin, (Qg_Q1+Qg_Q2+Qg_Q3+Qg_Q4)*Fsw*Vin)","v":0.12191999999999999}]
[null,null,null,null,null,null,null,{"$f":"AV109","v":0.8897519290781879},"100% load",null,null,null,null,null,null,null,null,null,null,null,3,null,null,null,null,null,null,null,null,null,null,null,1,null,null,null,2,null,"I_VCC",{"$f":"(Qg_Q1+Qg_Q2)*Fsw*1000","v":5.0799999999999992},"mA",{"$f":"AN4*5/1000","v":2.5399999999999995E-2}]
[null,null,null,null,null,null,null,null,null,null,null,null,null,null,null,null,null,null,null,null,null,null,null,null,null,null,null,null,null,null,null,null,null,null,null,null,null,null,null,null,null,{"$f":"VCC","v":3.3}]
["Enter the values of your design and MOSFET datasheet specifications below. Note that thermal resistance (θJA) will change when components are placed on the PCB"]
[null,null,null,null,null,null,"Operating Point Condtions",null,null,null,null,null,null,null,null,null,null,"Filter Inductor",null,null,null,"Cout",null,null,"Cin",null,null,"High-side BUCK \"Control\" MOSFET Losses ",null,null,null,null,null,"Low-side BUCK \"Sync\" MOSFET Losses ",null,null,null,"Diode/FET","\"Controller\" Losses",null,null,null,null,null,null,"RESULTS",null,null,null,null,null,"Consolidated Buck Efficiency & Losses"]
["Input Parameters",null,null,null,null,null,"Step","Vin","Mode","Iout","Iout/ phase","Iin","Duty Cycle BUCK Leg","Ripple Current pk-pk","Peak Inductor Current","Valley Inductor Current","SW node voltage at Q1 turn-on","Irms Lf","DCR    Loss","Core Loss","Total Inductor Loss","Irms Cout","Cout ESR Loss","Total Cout Loss","Irms Cin","Cin ESR Loss","Total Cin Loss","Irms","RDS(on) Loss","Transition Loss (not including capacitive loss)","MOSFET Output Capacitance Loss","Dead Time Loss ","Total Control MOSFET Loss","Irms","RDS(on) Loss","Deadtime Loss","Total Sync MOSFET Loss","Reverse Recovery Loss","IQ Loss","Switching Current Loss","Switching Current Diss from VCC","LDO Loss Saved from Gate Drive Current (ext VCC = Vout)","Total \"Control\" Loss","Total Loss (not considering total loss)","Total Loss (considering total loss)","Total Loss","Pout","EFF, h",{"$f":"IF(Vin>Vout, \"Buck ''CONTROL'' MOSFET Temp Rise\", \"Boost ''CONTROL'' MOSFET Temp Rise\")","v":"Buck ''CONTROL'' MOSFET Temp Rise"},{"$f":"IF(Vin>Vout, \"Buck ''SYNC'' MOSFET Temp Rise\", \"Boost ''SYNC'' MOSFET Temp Rise\")","v":"Buck ''SYNC'' MOSFET Temp Rise"},null,"h","Inductor Cu & Core Loss","Total MOSFET Loss","Control MOSFET Loss","SYNC MOSFET Loss","IC Power Loss"]
["Design","Input Value","Units","Description",null,null,0,{"$f":"Vin","v":24},{"$f":"MODE","v":1},0,{"$f":"Iout*G9/100/Number_of_Phases","v":0},{"$f":"Vout*K9/(Vin*Efficiency)","v":0},{"$f":"(Vout+(Rdson2+Rs+Rdcr)*K9)/(Vin+(Rs+Rdson2-Rdson1)*K9)","v":0.20833333333333334},{"$f":"(Vin-(Rdson1+Rdcr)*K9-Vout)*M9/(Fsw*Lf)","v":1.4552696078431375},{"$f":"K9+N9/2","v":0.72763480392156876},{"$f":"K9-N9/2","v":-0.72763480392156876},{"$f":"IF(MIN(Vin, -P9/(Coss_Q1+Coss_Q2)*0.00000002)<0, 0, MIN(Vin, -P9/(Coss_Q1+Coss_Q2)*0.00000002))","v":14.00644473381268},{"$f":"SQRT(K9^2+(N9^2)/12)","v":0.42010014991585831},{"$f":"R9^2*Rdcr","v":8.8242067979663313E-3},{"$f":"Core_Loss","v":0.1},{"$f":"(T9+S9*(1+Ltc*(Ta-25)))/(1-S9*Ltc*ThetaCa)","v":0.10890729663102573},{"$f":"N9/SQRT(12)","v":0.42010014991585831},{"$f":"RCoutEsr*V9^2","v":1.7648413595932664E-4},{"$f":"W9","v":1.7648413595932664E-4},{"$f":"SQRT(M9*(1-M9))*SQRT(K9^2+(N9^2)/12)","v":0.17060957356055356},{"$f":"RCinEsr*Y9^2","v":2.9107626590513935E-4},{"$f":"Z9","v":2.9107626590513935E-4},{"$f":"SQRT(M9)*SQRT(K9^2+(N9^2)/12)","v":0.19174860710018135},{"$f":"Rdson1*AB9^2","v":2.720797096039619E-3},{"$f":"(Vin*K9/2)*Fsw*(Tr_buck+Tf_buck)","v":0},{"$f":"(0.5*Coss_Q1*(Vin-Q9)^2-0.5*Coss_Q2*(Vin-Q9)^2+(Qoss_Q2*(Vin-Q9)/Vin)*Vin)*Fsw","v":2.7921722909352534E-2},{"$f":"IF(K9>N9/2,0,ABS(K9-N9/2)*Vsd_Q1*Deadtime*Fsw)","v":1.6299019607843141E-3},{"$f":"(AF9+AE9+AD9+AC9*(1+RdsonTC*(Ta-25))/(1-AC9*RdsonTC*ThetaJA_Q1))","v":3.2273103188484573E-2},{"$f":"SQRT((1-M9))*SQRT(K9^2+(N9^2)/12)","v":0.37378684786180871},{"$f":"Rdson2*AH9^2","v":4.3312148366684749E-3},{"$f":"IF(K9<N9/2,Deadtime*Fsw*Vsd_Q2*(K9+N9/2),2*Deadtime*Fsw*Vsd_Q2*K9)","v":1.6299019607843139E-3},{"$f":"(AJ9+AI9*(1+RdsonTC*(Ta-25)))/(1-AI9*RdsonTC*ThetaJA_Q2)","v":5.9634930810662087E-3},{"$f":"Qrr_Q2*K9/Iout*Fsw*Vin","v":0},{"$f":"Iq*Vin","v":8.3999999999999993E-4},{"$f":"IF(Ext_VCC=1,  (Qg_Q1+Qg_Q2)*Fsw*Vout, (Qg_Q1+Qg_Q2)*Fsw*Vin)","v":2.5399999999999999E-2},{"$f":"(Vin-VCC)*Fsw*(Qg_Q1+Qg_Q2)","v":0.10515599999999999},{"$f":"(Qg_Q1+Qg_Q2)*Fsw*(Vin-Vout)","v":9.6519999999999995E-2},{"$f":"SUM(AM9:AN9)","v":2.6239999999999999E-2},{"$f":"SUM(S9,T9,AC9,AD9,AE9,AF9,AI9,AJ9,AQ9, AL9)","v":0.17329774556159555},{"$f":"U9 + ((AF9+AE9+AD9+AC9*(1+RdsonTC*(Ta-25))) + (AJ9+AI9*(1+RdsonTC*(Ta-25))) + AQ9 + AL9) / (1-AC9*RdsonTC*ThetaJA_Q1 -AI9*RdsonTC*ThetaJA_Q2)","v":0.17342269202176375},{"$f":"AS9","v":0.17342269202176375},{"$f":"Vout*K9","v":0},{"$f":"AU9/(AU9+AT9)","v":0},{"$f":"ThetaJA_Q1*BC9","v":0.74228137333514521},{"$f":"ThetaJA_Q2*BD9","v":0.13716034086452281},null,{"$f":"AV9*100","v":0},{"$f":"U9","v":0.10890729663102573},{"$f":"AG9+AK9+AL9","v":3.8236596269550782E-2},{"$f":"AG9+AL9*0.66","v":3.2273103188484573E-2},{"$f":"AK9+AL9*0.33","v":5.9634930810662087E-3},{"$f":"AS9-BA9","v":6.4515395390738015E-2}]
[null,null,null,null,null,null,1,24,1,{"$f":"Iout*G10/100","v":0.05},0.05,1.1574074074074073E-2,0.20853725360285189,1.4562187086330325,{"$f":"K10+N10/2","v":0.77810935431651629},{"$f":"K10-N10/2","v":-0.6781093543165162},13.053115578758733,{"$f":"SQRT(K10^2+(N10^2)/12)","v":0.42333723036653031},8.9607205307202387E-3,0.1,0.10904520263596898,{"$f":"N10/SQRT(12)","v":0.4203741317141253},1.7671441061440477E-4,{"$f":"W10","v":1.7671441061440477E-4},{"$f":"SQRT(M10*(1-M10))*SQRT(K10^2+(N10^2)/12)","v":0.17198617105318936},2.9579243033536914E-4,{"$f":"Z10","v":2.9579243033536914E-4},{"$f":"SQRT(M10)*SQRT(K10^2+(N10^2)/12)","v":0.19332066882664603},2.7655931936730496E-3,5.5619860645161304E-4,3.0629129897090428E-2,1.5189649536689962E-3,{"$f":"(AF10+AE10+AD10+AC10*(1+RdsonTopTc*Ta-RdsonTopTc*25))/(1-AC10*RdsonTopTc*ThetaJA_Q1)","v":3.5478913713174215E-2},0.37661854656777455,4.3970874181835113E-3,1.7429649536689963E-3,{"$f":"(AJ10+AI10*(1+RdsonBotTc*Ta-RdsonBotTc*25))/(1-AI10*RdsonBotTc*ThetaJA_Q2)","v":6.1425372249820955E-3},2.2080000000000003E-3,8.3999999999999993E-4,2.5399999999999999E-2,0.10515599999999999,9.6519999999999995E-2,2.6239999999999999E-2,{"$f":"SUM(S10,T10,AC10,AD10,AE10,AF10,AI10,AJ10,AQ10, AL10)","v":0.1790186595534568},0.17914933794353721,{"$f":"AS10","v":0.17914933794353721},0.25,{"$f":"AU10/(AU10+AT10)","v":0.5825477937307042},0.84953245540300693,0.1580370761745882,null,{"$f":"AV10*100","v":58.25477937307042},0.10904520263596898,4.3829450938156309E-2,3.6936193713174213E-2,6.8711772249820955E-3,{"$f":"AS10-BA10","v":7.0104135307568233E-2}]
["Vin",{"$f":"Vin","v":24},"V","Vin",null,null,2,24,1,0.1,0.1,2.3148148148148147E-2,0.20874120191526335,1.4571670755464172,0.82858353777320859,-0.62858353777320863,12.099779360408252,0.43237097170297506,9.3472328585687443E-3,0.1,0.10943567458517697,0.42064790166049187,1.7694465717137483E-4,1.7694465717137483E-4,0.17571947405747254,3.0877333563034766E-4,3.0877333563034766E-4,0.19754253321649404,2.8877058797896339E-3,1.1123972129032261E-3,3.3344191255494544E-2,1.4080271246119872E-3,3.8762619496869204E-2,0.38460577835204873,4.5855697469953417E-3,1.8560271246119871E-3,6.4443155505827824E-3,4.4160000000000007E-3,8.3999999999999993E-4,2.5399999999999999E-2,0.10515599999999999,9.6519999999999995E-2,2.6239999999999999E-2,0.1851971512029755,0.1853377787653413,0.1853377787653413,0.5,0.72956725207935647,0.95857512842799175,0.18173669766340403,null,72.956725207935648,0.10943567458517697,4.9622935047451987E-2,4.1677179496869207E-2,7.9015955505827833E-3,7.5902104180164326E-2]
["Vout",{"$f":"Vout","v":5},"V","Vout",null,null,3,24,1,0.15,0.15,3.4722222222222217E-2,0.20894517827635284,1.4581147084318986,0.87905735421594933,-0.57905735421594928,11.146436077304125,0.44684994712481885,9.9837437622726719E-3,0.1,0.11007876314360938,0.42092145971125472,1.7717487524545342E-4,1.7717487524545342E-4,0.1816691476984271,3.3003679225472918E-4,3.3003679225472918E-4,0.20425744149349803,3.0873615780047628E-3,1.6685958193548387E-3,3.6066907158421334E-2,1.2970884734437263E-3,4.2131920064576431E-2,0.39743398551203901,4.8965669580394921E-3,1.9690884734437264E-3,6.8687496944205189E-3,6.6239999999999997E-3,8.3999999999999993E-4,2.5399999999999999E-2,0.10515599999999999,9.6519999999999995E-2,2.6239999999999999E-2,0.19183335222298056,0.19198853608748731,0.19198853608748731,0.75,0.79618803336513599,1.069586481485258,0.20825740297167195,null,79.618803336513594,0.11007876314360938,5.562466975899695E-2,4.6503760064576433E-2,9.0546696944205189E-3,8.1909772943877926E-2]
["Fsw",{"$f":"Fsw/1000","v":400},"kHz","Switching Frequency",null,null,4,24,1,0.2,0.2,4.6296296296296294E-2,0.20914918269190694,1.4590616071380416,0.92953080356902085,-0.52953080356902071,10.19308572798885,0.46626715995448403,1.0870253222601021E-2,0.1,0.11097455177768298,0.42119480582269819,1.7740506445202043E-4,1.7740506445202043E-4,0.18963137678145586,3.5960059060030479E-4,3.5960059060030479E-4,0.21323717204845269,3.364786774198384E-3,2.2247944258064522E-3,3.879727777977629E-2,1.1861489999946064E-3,4.5587119946096426E-2,0.41465042253541595,5.3299841601727677E-3,2.0821489999946065E-3,7.4157695461152719E-3,8.8320000000000013E-3,8.3999999999999993E-4,2.5399999999999999E-2,0.10515599999999999,9.6519999999999995E-2,2.6239999999999999E-2,0.19892739436254414,0.19910218788164596,0.19910218788164596,1,0.83395728079407216,1.1825735187602178,0.23759757956065125,null,83.39572807940722,0.11097455177768298,6.1834889492211699E-2,5.1416239946096426E-2,1.0330329546115272E-2,8.8127636103962986E-2]
["Iout",{"$f":"Iout","v":5},"A","Max Output Current",null,null,5,24,1,0.25,0.25,5.7870370370370364E-2,0.20935321516771391,1.4600077715133697,0.98000388575668484,-0.48000388575668484,9.2397283110045212,0.49003594195387307,1.2006761220330984E-2,0.1,0.11212315678236251,0.42146793995109483,1.7763522440661966E-4,1.7763522440661966E-4,0.19936963183256282,3.9748250097051643E-4,3.9748250097051643E-4,0.22421659462347188,3.7202080165364272E-3,2.780993032258065E-3,4.1535303293514E-2,1.075208704094974E-3,4.9128527733933378E-2,0.43573173295282658,5.8857264361642748E-3,2.1952087040949739E-3,8.085313230907408E-3,1.1039999999999999E-2,8.3999999999999993E-4,2.5399999999999999E-2,0.10515599999999999,9.6519999999999995E-2,2.6239999999999999E-2,0.20647940940699372,0.20667936864015979,0.20667936864015979,1.25,0.8581160871159319,1.2975433378804677,0.26975580431087037,null,85.811608711593195,0.11212315678236251,6.8253840964840787E-2,5.6414927733933376E-2,1.1728513230907407E-2,9.4556211857797279E-2]
["Ta",{"$f":"Ta","v":25},"°C","Ambient Temperature",null,null,6,24,1,0.3,0.3,6.9444444444444434E-2,0.20955727570956353,1.4609532014063646,1.0304766007031823,-0.43047660070318233,8.2863638248928257,0.51755710286398238,1.3393267736247941E-2,0.1,0.11352472731891843,0.42174086205270511,1.7786535472495886E-4,1.7786535472495886E-4,0.21064194111452803,4.4370027356496289E-4,4.4370027356496289E-4,0.23692432123599771,4.1538519154922298E-3,3.3371916387096774E-3,4.4280983873638234E-2,9.6426758557512852E-4,5.2756456123997195E-2,0.46014369574277619,6.5636988426864386E-3,2.308267585575128E-3,8.8773270936060474E-3,1.3247999999999999E-2,8.3999999999999993E-4,2.5399999999999999E-2,0.10515599999999999,9.6519999999999995E-2,2.6239999999999999E-2,0.21448952917792477,0.21472076954274882,0.21472076954274882,1.5,0.87477799688633462,1.4145031308519356,0.30473084315293908,null,87.477799688633468,0.11352472731891843,7.4881783217603234E-2,6.1500136123997198E-2,1.3249167093606047E-2,0.1011960422238304]
["Vcc",{"$f":"VCC","v":3.3},"V","Subregulated VCC Voltage",null,null,7,24,1,0.35,0.35,8.1018518518518517E-2,0.20976136432324724,1.4618978966654665,1.0809489483327333,-0.38094894833273329,7.3329922681950581,0.54826586162454938,1.5029772751145476E-2,0.1,0.11517944546337421,0.42201357208377743,1.7809545502290962E-4,1.7809545502290962E-4,0.22321998980017291,4.9827163846389297E-4,4.9827163846389297E-4,0.25110418705185461,4.6659451438679864E-3,3.8933902451612906E-3,4.7034319694201805E-2,8.5332564426532256E-4,5.6471221956891346E-2,0.48738295237722123,7.3638064103060379E-3,2.4213256442653223E-3,9.7917656839272196E-3,1.5455999999999998E-2,8.3999999999999993E-4,2.5399999999999999E-2,0.10515599999999999,9.6519999999999995E-2,2.6239999999999999E-2,0.22295788553321325,0.22322713864069504,0.22322713864069504,1.75,0.88687205123558643,1.5334601850085008,0.34252165073032603,null,88.687205123558641,0.11517944546337421,8.1718987640818558E-2,6.6672181956891341E-2,1.4892245683927219E-2,0.10804769317732084]
["Components","Input Value","Units","Description",null,null,8,24,1,0.4,0.4,9.2592592592592587E-2,0.20996548101455803,1.4628418571390738,1.1314209285695369,-0.33142092856953687,6.3796136394521046,0.58165756671473634,1.6916276245825399E-2,0.1,0.11708752626567299,0.42228607000054819,1.783255249165079E-4,1.783255249165079E-4,0.23689962127717559,5.6121430561269225E-4,5.6121430561269225E-4,0.26652707475713872,5.2567144368162082E-3,4.4495888516129043E-3,4.9795310929306745E-2,7.4238287999576255E-4,6.0273146259796469E-2,0.51699984848925296,8.2859541434752264E-3,2.5343828799957624E-3,1.0828591743216277E-2,1.7664000000000003E-2,8.3999999999999993E-4,2.5399999999999999E-2,0.10515599999999999,9.6519999999999995E-2,2.6239999999999999E-2,0.23188461036702801,0.23219928105860238,0.23219928105860238,2,0.89597735156133385,1.6544218839753189,0.38312737009397441,null,89.597735156133382,0.11708752626567299,8.876573800301274E-2,7.1931386259796476E-2,1.6657711743216279E-2,0.11511175479292939]
["L",{"$f":"Lf*1000000","v":6.7999999999999989},"uH","Filter Inductance",null,null,9,24,1,0.45,0.45,0.10416666666666666,0.21016962578929044,1.4637850826755427,1.1818925413377714,-0.28189254133777136,5.4262279372044544,0.61729698202887229,1.9052778201097697E-2,0.1,0.119249217819599,0.42255835575924161,1.7855556402195382E-4,1.7855556402195382E-4,0.25150466492817891,6.3254596480635545E-4,6.3254596480635545E-4,0.28299523899779844,5.9263865918611578E-3,5.0057874580645171E-3,5.2563957753104219E-2,6.3143929259660788E-4,6.416255428895877E-2,0.54860665209832515,9.330047020522517E-3,2.6474392925966077E-3,1.1987776192549539E-2,1.9872000000000001E-2,8.3999999999999993E-4,2.5399999999999999E-2,0.10515599999999999,9.6519999999999995E-2,2.6239999999999999E-2,0.24126983560984333,0.24163805921383838,0.24163805921383838,2.25,0.90302040124957794,1.7773957086460519,0.4265473324286394,null,90.302040124957799,0.119249217819599,9.6022330481508308E-2,7.7278074288958776E-2,1.854553619254954E-2,0.12238884139423938]
["Rdcr",{"$f":"Rdcr*1000","v":50},"mW","Inductor DCR at 25°C",null,null,10,24,1,0.5,0.5,0.11574074074074073,0.21037379865324077,1.4647275731231888,1.2323637865615944,-0.2323637865615944,4.4728351599921927,0.65481720499358609,2.1439278597780609E-2,0.1,0.12166480134349657,0.42283042931607018,1.7878557195561223E-4,1.7878557195561223E-4,0.26688654624651914,7.122842856739541E-4,7.122842856739541E-4,0.30034188782120391,6.6751884689203421E-3,5.56198606451613E-3,5.5340260339794611E-2,5.2049488189797146E-4,6.8139775572793465E-2,0.58187655252261838,1.0495989993643831E-2,2.7604948818979714E-3,1.3269298122210636E-2,2.2079999999999999E-2,8.3999999999999993E-4,2.5399999999999999E-2,0.10515599999999999,9.6519999999999995E-2,2.6239999999999999E-2,0.25111369322845151,0.25154439305377441,0.25154439305377441,2.5,0.90858065249145392,1.9023892381742495,0.47278105681084459,null,90.858065249145398,0.12166480134349657,0.10348907369500411,8.2712575572793462E-2,2.0555698122210635E-2,0.12987959171027785]
["LTc",3930,"ppm","Inductor Series Resistance Temp Co",null,null,11,24,1,0.55000000000000004,0.55000000000000004,0.1273148148148148,0.21057799961220672,1.4656693283302851,1.2828346641651427,-0.18283466416514249,3.5194353063550046,0.69391321383441928,2.4075777416700625E-2,0.1,0.12433459127183569,0.42310229062723403,1.7901554833401243E-4,1.7901554833401243E-4,0.28292170607132472,8.004469176630906E-4,8.004469176630906E-4,0.31842829797358019,7.5033469903259863E-3,6.1181846709677428E-3,5.812421886362746E-2,4.0954964772991917E-4,7.2205143955612963E-2,0.61653788803581344,1.1783687988893498E-2,2.8735496477299192E-3,1.4673144782537279E-2,2.4288000000000004E-2,8.3999999999999993E-4,2.5399999999999999E-2,0.10515599999999999,9.6519999999999995E-2,2.6239999999999999E-2,0.26141631522597519,0.26191926031095147,0.26191926031095147,2.75,0.91303908316456306,2.029410150979098,0.52182824999835742,null,91.303908316456301,0.12433459127183569,0.11116628873815025,8.8235223955612965E-2,2.2688184782537278E-2,0.13758466903911579]
["ThetaCa",{"$f":"ThetaCa","v":22},"°C/W","Core to Ambient Thermal Resistance",null,null,12,24,1,0.6,0.6,0.13888888888888887,0.2107822286719877,1.4666103481450627,1.3333051740725312,-0.1333051740725314,2.5660283748321731,0.73433336624032586,2.696227463869243E-2,0.1,0.12725893535767985,0.42337393964892139,1.7924549277384855E-4,1.7924549277384855E-4,0.29950817852344885,8.9705149002434104E-4,8.9705149002434104E-4,0.33713998096962045,8.4110891408465064E-3,6.6743832774193547E-3,6.0915833498901568E-2,2.9860358992247029E-4,7.6358997641990181E-2,0.65236655800680998,1.3193045906175231E-2,2.9866035899224698E-3,1.6199311576134762E-2,2.6495999999999999E-2,8.3999999999999993E-4,2.5399999999999999E-2,0.10515599999999999,9.6519999999999995E-2,2.6239999999999999E-2,0.27217783364188008,0.27276369677630935,0.27276369677630935,3,0.91665646467388306,2.1584662257657738,0.57368880625109953,null,91.665646467388314,0.12725893535767985,0.11905430921812493,9.3846357641990175E-2,2.4942991576134763E-2,0.1455047614186295]
["Cin",{"$f":"Cin*1000000","v":22},"μF","Input Capacitance",null,null,13,24,1,0.65,0.65,0.15046296296296297,0.21098648583838472,1.4675506324157119,1.3837753162078559,-8.3775316207855943E-2,1.6126143639625783,0.77587073980913834,3.0098770244598984E-2,0.1,0.13043821478611847,0.42364537633730842,1.7947540489197968E-4,1.7947540489197968E-4,0.31656209687764186,1.0021156117956951E-3,1.0021156117956951E-3,0.35638276507050332,9.3986419677080189E-3,7.2305818838709702E-3,6.3715104419964946E-2,1.8765670830559733E-4,8.0601679241766977E-2,0.68917830033503091,1.4723968619233143E-2,3.099656708305597E-3,1.7847802051452904E-2,2.8704E-2,8.3999999999999993E-4,2.5399999999999999E-2,0.10515599999999999,9.6519999999999995E-2,2.6239999999999999E-2,0.28339838055198724,0.28407879659062713,0.28407879659062713,3.25,0.91961729974309514,2.2895653425606404,0.62836280718341686,null,91.96172997430952,0.13043821478611847,0.12715348129321988,9.9546319241766976E-2,2.7320122051452907E-2,0.15364058180450865]
["RCinEsr",{"$f":"RCinEsr*1000","v":10},"mW","Input Capacitor ESR",null,null,14,24,1,0.7,0.7,0.16203703703703703,0.2111907711172003,1.4684901809903796,1.4342450904951898,-3.4245090495189867E-2,0.65919327228469426,0.81835523112242015,3.3485264215271489E-2,0.1,0.13387284429873328,0.42391660064855902,1.7970528430542987E-4,1.7970528430542987E-4,0.33401450144970879,1.1156568717869751E-3,1.1156568717869751E-3,0.37607921428035285,1.0466232580615839E-2,7.7867804903225812E-3,6.6522031801214881E-2,7.67090027092253E-5,8.4933535815718733E-2,0.72682164861243792,1.6376360975642767E-2,3.212709002709225E-3,1.9618627897723586E-2,3.0911999999999995E-2,8.3999999999999993E-4,2.5399999999999999E-2,0.10515599999999999,9.6519999999999995E-2,2.6239999999999999E-2,0.29507808806848601,0.2958657125543348,0.2958657125543348,3.5,0.92205580097952433,2.422715483761531,0.68585052164764249,null,92.205580097952435,0.13387284429873328,0.13546416371344233,0.10533545581571874,2.9819587897723585E-2,0.16199286825560152]
["Cout",{"$f":"Cout*1000000","v":94},"μF","Output Capcitance",null,null,15,24,1,0.75,0.75,0.1736111111111111,0.21139508451423863,1.4694289937171727,1.4847144968585864,1.5285503141413637E-2,0,0.86164675513309308,3.7121756531569426E-2,0.1,0.13756327232917456,0.42418761253882531,1.7993513063138859E-4,1.7993513063138859E-4,0.35180858979909174,1.2376928385642561E-3,1.2376928385642561E-3,0.39616554265377768,1.1614088151776E-2,8.3429790967741949E-3,6.846720000000002E-2,0,8.8518849294680027E-2,0.76517187183352886,1.8150127796802015E-2,3.3599999999999997E-3,2.154610573748662E-2,3.3119999999999997E-2,8.3999999999999993E-4,2.5399999999999999E-2,0.10515599999999999,9.6519999999999995E-2,2.6239999999999999E-2,0.3064161515769217,0.30732252045922298,0.30732252045922298,3.75,0.92425484567481719,2.5386951337776407,0.74694123196219231,null,92.425484567481718,0.13756327232917456,0.14318495503216666,0.11037804929468002,3.2475705737486621E-2,0.16975924813004842]
["RCoutEsr",{"$f":"Cout_ESR*1000","v":1},"mW","Output Capacitor ESR",null,null,16,24,1,0.8,0.8,0.18518518518518517,0.21159942603530549,1.4703670704441552,1.5351835352220777,6.4816464777922467E-2,0,0.90562958403930838,4.1008247174360538E-2,0.1,0.14150998114993013,0.42445841196424722,1.801649434872106E-4,1.801649434872106E-4,0.36989742638118867,1.368241060434269E-3,1.368241060434269E-3,0.41658904365834271,1.2842435915916769E-2,8.8991777032258086E-3,6.846720000000002E-2,0,9.0315521778803032E-2,0.8041259305550581,2.0045173877922182E-2,3.5839999999999999E-3,2.3672830269824769E-2,3.5328000000000005E-2,8.3999999999999993E-4,2.5399999999999999E-2,0.10515599999999999,9.6519999999999995E-2,2.6239999999999999E-2,0.31641423467142538,0.31744829819311537,0.31744829819311537,4,0.92647316742021679,2.6135360409124697,0.81261461620596975,null,92.647316742021673,0.14150998114993013,0.14931635204862781,0.11363200177880303,3.5331070269824773E-2,0.17593831704318524]
["Top Driver","Input Value","Units","Description",null,null,17,24,1,0.85,0.85,0.19675925925925924,0.21180379568620827,1.4713044110193498,1.5856522055096749,0.11434779449032506,0,0.95020772596859904,4.5144736124520815E-2,0.1,0.14571348703037709,0.42472899888095272,1.8039472249041635E-4,1.8039472249041635E-4,0.38824207209275929,1.507319065428793E-3,1.507319065428793E-3,0.43730599050152036,1.415150317031017E-2,9.4553763096774206E-3,6.846720000000002E-2,0,9.2194110522743497E-2,0.84359836009910572,2.2061403988018913E-2,3.8079999999999998E-3,2.5922016587389816E-2,3.7536E-2,8.3999999999999993E-4,2.5399999999999999E-2,0.10515599999999999,9.6519999999999995E-2,2.6239999999999999E-2,0.32686421959252732,0.32804040858358929,0.32804040858358929,4.25,0.92834479836208283,2.6902610220231007,0.88110462150996582,null,92.834479836208288,0.14571348703037709,0.15565212711013332,0.1169678705227435,3.8308896587389819E-2,0.1823269215532122]
["RdsonDRT",1,"W","Drain to Source Resistance of pullup Top FET Driver",null,null,18,24,1,0.9,0.9,0.20833333333333331,0.21200819347275585,1.4722410152907361,1.636120507645368,0.16387949235463195,0,0.99530119424156804,4.9531223362934584E-2,0.1,0.15017434040621325,0.42499937324505727,1.8062446725869151E-4,1.8062446725869151E-4,0.40681007378001915,1.6549443612890464E-3,1.6549443612890464E-3,0.45827994033497294,1.5541517274793549E-2,1.0011574916129034E-2,6.846720000000002E-2,0,9.4154916735297856E-2,0.88351794749471002,2.4198722869903221E-2,4.032E-3,2.8293712667388712E-2,3.9744000000000002E-2,8.3999999999999993E-4,2.5399999999999999E-2,0.10515599999999999,9.6519999999999995E-2,2.6239999999999999E-2,0.33776623842376036,0.33910008728568564,0.33910008728568564,4.5,0.92992496927752299,2.7688770049118507,0.9524123513499404,null,92.992496927752299,0.15017434040621325,0.16219262940268658,0.12038595673529785,4.1409232667388711E-2,0.18892574687947239]
["RdsonDRT2",1,"W","Drain to Source Resistance of pulldown Top FET Driver",null,null,19,24,1,0.95,0.95,0.21990740740740738,0.21221261940075892,1.4731768831062539,1.6865884415531269,0.21341155844687298,0,1.0408430128553912,5.4167708870494408E-2,0.1,0.15489312606037253,0.42526953501266479,1.8085417740988814E-4,1.8085417740988814E-4,0.42557425150613337,1.8111344354500567E-3,1.8111344354500567E-3,0.47948037261905391,1.70127056517911E-2,1.0567773522580644E-2,6.846720000000002E-2,0,9.6198245678663155E-2,0.92382506443751633,2.6457035240172417E-2,4.2559999999999994E-3,3.0787974624897865E-2,4.1952000000000003E-2,8.3999999999999993E-4,2.5399999999999999E-2,0.10515599999999999,9.6519999999999995E-2,2.6239999999999999E-2,0.34912042328503856,0.35062862906200987,0.35062862906200987,4.75,0.93125776162878782,2.8493910106092528,1.0265390963726508,null,93.125776162878779,0.15489312606037253,0.16893822030356104,0.12388656567866316,4.4632134624897866E-2,0.19573550300163733]
["Bottom Driver","Input Value","Units","Description",null,null,20,24,1,1,1,0.23148148148148145,0.21241707347602956,1.4741120143137996,1.7370560071568999,0.26294399284310022,0,1.0867768181931485,5.9054192628101188E-2,0.1,0.15987046331553528,0.42553948413986686,1.81083852562024E-4,1.81083852562024E-4,0.4445117270697172,1.9759067550250277E-3,1.9759067550250277E-3,0.50088159827550016,1.8565295786335447E-2,1.112397212903226E-2,6.846720000000002E-2,0,9.8324406711179757E-2,0.96446953143736192,2.8836245789201138E-2,4.4799999999999996E-3,3.3404866716342428E-2,4.4159999999999998E-2,8.3999999999999993E-4,2.5399999999999999E-2,0.10515599999999999,9.6519999999999995E-2,2.6239999999999999E-2,0.36092690633266999,0.36262738817401763,0.36262738817401763,5,0.93237878339753666,2.9318101543571342,1.1034863344758759,null,93.237878339753664,0.15987046331553528,0.1758892734275222,0.12747000671117975,4.7977666716342432E-2,0.20275692485848235]
["RdsonDRB",1,"W","Drain to Source Resistance of pullup Bottom FET Driver",null,null,21,24,1,1.05,1.05,0.24305555555555555,0.21262155570438154,1.4750464087612278,1.787523204380614,0.31247679561938613,0,1.1330549379148758,6.4190674616664153E-2,0.1,0.16510700623835325,0.42580922058274284,1.8131349233328295E-4,1.8131349233328295E-4,0.46360314567415239,2.1492787667896939E-3,2.1492787667896939E-3,0.52246188566648355,2.0199515226089152E-2,1.1680170735483875E-2,6.846720000000002E-2,0,0.10053371333070364,1.0054089070418588,3.1336259181132253E-2,4.7039999999999998E-3,3.6144461344327895E-2,4.6368000000000006E-2,8.3999999999999993E-4,2.5399999999999999E-2,0.10515599999999999,9.6519999999999995E-2,2.6239999999999999E-2,0.37318581975936943,0.37509777879259826,0.37509777879259826,5.25,0.93331710957865133,3.0161416466061839,1.1832557309195417,null,93.331710957865127,0.16510700623835325,0.18304617467503154,0.13113659333070365,5.1445901344327902E-2,0.209990772554245]
["RdsonDRB2",1,"W","Drain to Source Resistance of pulldown Bottom FET Driver",null,null,22,24,1,1.1000000000000001,1.1000000000000001,0.25462962962962959,0.21282606609163027,1.475980066296352,1.8379900331481762,0.36200996685182407,0,1.1796368493489915,6.9577154817100764E-2,0.1,0.17060344385551454,0.42607874429736031,1.8154309634201536E-4,1.8154309634201536E-4,0.4828320512524687,2.3312678971666658E-3,2.3312678971666658E-3,0.54420275908105942,2.1915591581366384E-2,1.2236369341935486E-2,6.846720000000002E-2,0,0.1028264832186189,1.0466071150869258,3.3956980053867908E-2,4.9280000000000001E-3,3.9006839063824947E-2,4.8576000000000008E-2,8.3999999999999993E-4,2.5399999999999999E-2,0.10515599999999999,9.6519999999999995E-2,2.6239999999999999E-2,0.38589729579427051,0.38804127542819378,0.38804127542819378,5.5,0.93409671276464101,3.1023927940282348,1.2658491384679738,null,93.409671276464096,0.17060344385551454,0.19040932228244384,0.1348866432186189,5.5036919063824949E-2,0.21743783157267924]
["Deadtime","Input Value","Units","Description",null,null,23,24,1,1.1499999999999999,1.1499999999999999,0.26620370370370366,0.21303060464359269,1.476912986766943,1.8884564933834715,0.41154350661652839,0,1.2264879388753636,7.5213633210336875E-2,0.1,0.17636050038178319,0.42634805523977443,1.8177266420673775E-4,1.8177266420673775E-4,0.50218438368887608,2.5218915522097628E-3,2.5218915522097628E-3,0.5660884340849841,2.3713752525154414E-2,1.2792567948387099E-2,6.846720000000002E-2,0,0.10520303828450064,1.0880333400231577,3.6698313019060388E-2,5.1519999999999995E-3,4.1992088589708196E-2,5.0783999999999996E-2,8.3999999999999993E-4,2.5399999999999999E-2,0.10515599999999999,9.6519999999999995E-2,2.6239999999999999E-2,0.39906146670293879,0.40145941338069913,0.40145941338069913,5.75,0.93473753358309708,3.1905710005435144,1.3512685975632885,null,93.473753358309708,0.17636050038178319,0.19797912687420882,0.13872047828450063,5.8750808589708194E-2,0.22509891299891593]
["Deadtime",15,"ns","Total Deadtime",null,null,24,24,1,1.2,1.2,0.27777777777777773,0.21323517136608738,1.4778451700207305,1.9389225850103653,0.46107741498963473,0,1.2735784999544133,8.1100109777306681E-2,0.1,0.18237893546015491,0.42661715336602851,1.8200219554613352E-4,1.8200219554613352E-4,0.52164807270691083,2.7211671175883449E-3,2.7211671175883449E-3,0.58810536141362446,2.5594225793135288E-2,1.3348766554838709E-2,6.846720000000002E-2,0,0.10766370471144014,1.1296611347756831,3.9560162662103202E-2,5.3759999999999997E-3,4.5100306805650692E-2,5.2991999999999997E-2,8.3999999999999993E-4,2.5399999999999999E-2,0.10515599999999999,9.6519999999999995E-2,2.6239999999999999E-2,0.41267846478738385,0.41535378920940841,0.41535378920940841,6,0.93525629250439291,3.2806837683631231,1.4395163365299661,null,93.525629250439295,0.18237893546015491,0.20575601151709083,0.14263842471144014,6.2587666805650699E-2,0.2329748537492535]
["IQ","Input Value","Units","Description",null,null,25,24,1,1.25,1.25,0.28935185185185186,0.21343976626493452,1.4787766159054012,1.9893883079527006,0.51061169204729939,0,1.3208829206175134,8.7236584498952621E-2,0.1,0.18865954441427843,0.42688603863215363,1.8223168997905255E-4,1.8223168997905255E-4,0.54121270851409375,2.9291119585716143E-3,2.9291119585716143E-3,0.61024185705681733,2.7557239183707328E-2,1.3904965161290325E-2,6.846720000000002E-2,0,0.11020881300204224,1.1714676973245568,4.254243354212188E-2,5.5999999999999991E-3,4.833159877437547E-2,5.5199999999999999E-2,8.3999999999999993E-4,2.5399999999999999E-2,0.10515599999999999,9.6519999999999995E-2,2.6239999999999999E-2,0.42674842238607225,0.42972606122327683,0.42972606122327683,6.25,0.93566711309945849,3.3727386990469714,1.5305947718106356,null,93.566711309945845,0.18865954441427843,0.2137404117764177,0.14664081300204224,6.6547598774375466E-2,0.2410665168089984]
["IQ ",{"$f":"Iq*1000","v":3.4999999999999996E-2},"mA","Quiescent Current Of Controller (Not Switching!)",null,null,26,24,1,1.3,1.3,0.30092592592592593,0.21364438934595587,1.4797073242686007,2.0398536621343002,0.56014633786569967,0,1.368379021735028,9.3623057356225614E-2,0.1,0.19520315851330042,0.4271547109941688,1.8246114712451187E-4,1.8246114712451187E-4,0.5608692735400056,3.1457434200129366E-3,3.1457434200129366E-3,0.63248780095069379,2.9603020558006888E-2,1.446116376774194E-2,6.846720000000002E-2,0,0.11283869802510743,1.2134332815499449,4.5645030191965107E-2,5.8239999999999993E-3,5.1686077749267104E-2,5.7408000000000001E-2,8.3999999999999993E-4,2.5399999999999999E-2,0.10515599999999999,9.6519999999999995E-2,2.6239999999999999E-2,0.44127147187393956,0.44457794999178857,0.44457794999178857,6.5,0.93598200593423897,3.4667434945774707,1.6245065082331434,null,93.598200593423897,0.19520315851330042,0.22193277577437454,0.15072797802510743,7.0630717749267102E-2,0.24937479147848815]
["High-side FET","Input Value","Units","Description",null,null,27,24,1,1.35,1.35,0.3125,0.21384904061497487,1.4806372949579325,2.0903186474789663,0.60968135252103384,0,1.4160475156581771,0.10025952833008477,0.1,0.20201064524929971,0.42742317040808087,1.8269056660169533E-4,1.8269056660169533E-4,0.5806099229546563,3.3710788263341192E-3,3.3710788263341192E-3,0.65483439045148695,3.1731797839929812E-2,1.5017362374193554E-2,6.846720000000002E-2,0,0.11555369906300916,1.2555407152632385,4.8867857118195461E-2,6.0479999999999996E-3,5.5163865187345222E-2,5.9616000000000002E-2,8.3999999999999993E-4,2.5399999999999999E-2,0.10515599999999999,9.6519999999999995E-2,2.6239999999999999E-2,0.45624774566240356,0.45991123887672625,0.45991123887672625,6.75,0.9362112481500704,3.5627059584492109,1.7212543393089399,null,93.621124815007036,0.20201064524929971,0.23033356425035439,0.15490025906300917,7.4837145187345216E-2,0.25790059362742657]
["RdsonTop",{"$f":"Rdson1*1000","v":74},"mW","Drain-Source Resistance of Top FET ",null,null,28,24,1,1.4,1.4,0.32407407407407407,0.21405372007781645,1.4815665278209571,2.1407832639104782,0.65921673608952136,0,1.4638715613160718,0.10714599740149769,0.1,0.20908290862748538,0.42769141682988437,1.8291994802995391E-4,1.8291994802995391E-4,0.60042780427872522,3.6051354815097116E-3,3.6051354815097116E-3,0.67727393771263089,3.3943799016153173E-2,1.5573560980645162E-2,6.846720000000002E-2,0,0.1183541598597789,1.2977750041225102,5.2210818801080625E-2,6.2719999999999989E-3,5.8765090763603881E-2,6.182399999999999E-2,8.3999999999999993E-4,2.5399999999999999E-2,0.10515599999999999,9.6519999999999995E-2,2.6239999999999999E-2,0.47167737619937666,0.47572777458515936,0.47572777458515936,7,0.93636368405461923,3.6606339967749149,1.8208412475628895,null,93.636368405461923,0.20908290862748538,0.23894325062338279,0.15915799985977891,7.9167010763603884E-2,0.266644865957674]
["RdsonTopTc",{"$f":"RdsonTopTc*1000000","v":4000},"ppm","Drain to Source Resistance Temp Co",null,null,29,24,1,1.45,1.45,0.33564814814814814,0.21425842774030723,1.482495022705195,2.1912475113525973,0.70875248864740248,0,1.5118363969123136,0.11428246455144034,0.1,0.21642088946934118,0.42795945021556236,1.8314929102880641E-4,1.8314929102880641E-4,0.62031690844690557,3.8479306690512661E-3,3.8479306690512661E-3,0.6997997023874617,3.6239252136156919E-2,1.6129759587096774E-2,6.846720000000002E-2,0,0.12124042866991085,1.3401230046407033,5.5673819694584022E-2,6.4959999999999992E-3,6.248989238671946E-2,6.4031999999999992E-2,8.3999999999999993E-4,2.5399999999999999E-2,0.10515599999999999,9.6519999999999995E-2,2.6239999999999999E-2,0.48756049596927803,0.49202946774397432,0.49202946774397432,7.25,0.93644696525711468,3.7605356194079493,1.9232704048945475,null,93.644696525711467,0.21642088946934118,0.24776232105663032,0.16350154866991085,8.362045238671946E-2,0.27560857827463314]
["QgTop",{"$f":"Qg_Q1*1000000000","v":4.0999999999999996},"nC","Gate Charge Of Top FET",null,null,30,24,1,1.5,1.5,0.34722222222222221,0.21446316360827539,1.4834227794581225,2.241711389729061,0.75828861027093875,0,1.5599290353147282,0.12166892976089692,0.1,0.22402556572890789,0.42822727052108495,1.8337859521793849E-4,1.8337859521793849E-4,0.6402719462846711,4.0994816519916077E-3,4.0994816519916077E-3,0.72240575287514153,3.8618385312245408E-2,1.668595819354839E-2,6.846720000000002E-2,0,0.12421285830789783,1.3825731530124683,5.9256764226355979E-2,6.7199999999999994E-3,6.6338416216131957E-2,6.6239999999999993E-2,8.3999999999999993E-4,2.5399999999999999E-2,0.10515599999999999,9.6519999999999995E-2,2.6239999999999999E-2,0.50389723749304671,0.50881829349628971,0.50881829349628971,7.5,0.93646774407286959,3.8624189410816498,2.0285451729710351,null,93.646774407286955,0.22402556572890789,0.25679127452402978,0.16793125830789782,8.8197616216131952E-2,0.28479272776738185]
["QgdTop",{"$f":"Qgd_Q1*1000000000","v":1.7},"nC","Gate to Drain Charge",null,null,31,24,1,1.55,1.55,0.35879629629629628,0.21466792768755075,1.4843497979271756,2.2921748989635877,0.80782510103641225,0,1.6081380103141658,0.12930539301086019,0.1,0.23189795282240502,0.42849487770241074,1.8360786021720394E-4,1.8360786021720394E-4,0.66028824560710564,4.3598056728690951E-3,4.3598056728690951E-3,0.74508685072903635,4.1081426719569179E-2,1.7242156800000005E-2,6.846720000000002E-2,0,0.12727180619851186,1.4251152392308106,6.2959556797724608E-2,6.9439999999999997E-3,7.0310816680503346E-2,6.8448000000000009E-2,8.3999999999999993E-4,2.5399999999999999E-2,0.10515599999999999,9.6519999999999995E-2,2.6239999999999999E-2,0.5206877333281541,0.52609629212011011,0.52609629212011011,7.75,0.93643183047289813,3.9662921825657729,2.136669103651577,null,93.64318304728981,0.23189795282240502,0.26603062287901524,0.17244748619851186,9.2898656680503344E-2,0.29419833929770511]
["QgsTop",{"$f":"Qgs_Q1*1000000000","v":2.39},"nC",null,null,null,32,{"$f":"Vin","v":24},{"$f":"MODE","v":1},1.6,{"$f":"Iout*G41/100/Number_of_Phases","v":1.6},{"$f":"Vout*K41/(Vin*Efficiency)","v":0.37037037037037035},{"$f":"(Vout+(Rdson2+Rs+Rdcr)*K41)/(Vin+(Rs+Rdson2-Rdson1)*K41)","v":0.21487271998396473},{"$f":"(Vin-(Rdson1+Rdcr)*K41-Vout)*M41/(Fsw*Lf)","v":1.4852760779597471},2.3426380389798735,0.85736196102012652,{"$f":"IF(MIN(Vin, -P41/(Coss_Q1+Coss_Q2)*0.00000002)<0, 0, MIN(Vin, -P41/(Coss_Q1+Coss_Q2)*0.00000002))","v":0},1.6564531643383777,{"$f":"R41^2*Rdcr","v":0.13719185428233124},{"$f":"Core_Loss","v":0.1},{"$f":"(T41+S41*(1+Ltc*(Ta-25)))/(1-S41*Ltc*ThetaCa)","v":0.24003910397140044},0.42876227171548581,1.8383708564662408E-4,1.8383708564662408E-4,0.68036166512464891,4.6289199537118495E-3,4.6289199537118495E-3,0.76783835394291489,{"$f":"Rdson1*AB41^2","v":4.3628604596146606E-2},{"$f":"(Vin*K41/2)*Fsw*(Tr_buck+Tf_buck)","v":1.7798355406451617E-2},{"$f":"(0.5*Coss_Q1*(Vin-Q41)^2-0.5*Coss_Q2*(Vin-Q41)^2+(Qoss_Q2*(Vin-Q41)/Vin)*Vin)*Fsw","v":6.846720000000002E-2},{"$f":"IF(K41>N41/2,0,ABS(K41-N41/2)*Vsd_Q1*Deadtime*Fsw)","v":0},{"$f":"(AF41+AE41+AD41+AC41*(1+RdsonTopTc*Ta-RdsonTopTc*25))/(1-AC41*RdsonTopTc*ThetaJA_Q1)","v":0.13041763442784141},{"$f":"SQRT((1-M41))*SQRT(K41^2+(N41^2)/12)","v":1.4677402181111137},{"$f":"Rdson2*AH41^2","v":6.6782101783686654E-2},{"$f":"IF(K41<N41/2,Deadtime*Fsw*Vsd_Q2*(K41+N41/2),2*Deadtime*Fsw*Vsd_Q2*K41)","v":7.1679999999999999E-3},{"$f":"(AJ41+AI41*(1+RdsonBotTc*Ta-RdsonBotTc*25))/(1-AI41*RdsonBotTc*ThetaJA_Q2)","v":7.4407256497558208E-2},{"$f":"Qrr_Q2*K41/Iout*Fsw*Vin","v":7.065600000000001E-2},{"$f":"Iq*Vin","v":8.3999999999999993E-4},{"$f":"IF(Ext_VCC=1,  (Qg_Q1+Qg_Q2)*Fsw*Vout, (Qg_Q1+Qg_Q2)*Fsw*Vin)","v":2.5399999999999999E-2},{"$f":"(Vin-VCC)*Fsw*(Qg_Q1+Qg_Q2)","v":0.10515599999999999},{"$f":"(Qg_Q1+Qg_Q2)*Fsw*(Vin-Vout)","v":9.6519999999999995E-2},{"$f":"SUM(AM41:AN41)","v":2.6239999999999999E-2},0.53793211606861613,{"$f":"U41 + ((AF41+AE41+AD41+AC41*(1+RdsonTC*(Ta-25))) + (AJ41+AI41*(1+RdsonTC*(Ta-25))) + AQ41 + AL41) / (1-AC41*RdsonTC*ThetaJA_Q1 -AI41*RdsonTC*ThetaJA_Q2)","v":0.54386556966959088},0.54386556966959088,{"$f":"Vout*K41","v":8},0.93634432035069759,{"$f":"ThetaJA_Q1*BC41","v":4.072163671840352},{"$f":"ThetaJA_Q2*BD41","v":2.2476459394438386},null,93.634432035069764,{"$f":"U41","v":0.24003910397140044},{"$f":"AG41+AK41+AL41","v":0.27548089092539962},{"$f":"AG41+AL41*0.66","v":0.17705059442784141},{"$f":"AK41+AL41*0.33","v":9.7723736497558208E-2},0.30382646569819044]
["RGateTop",{"$f":"Rgate1","v":0.158},"W","Gate Resistance",null,null,33,24,1,{"$f":"Iout*G42/100","v":1.65},1.65,0.38194444444444442,0.21507754050335029,1.4862016194031877,2.3931008097015938,0.90689919029840604,0,1.7048654700962149,0.14532831355631939,0.1,0.24845011055974733,0.42902945251624414,1.840662711263882E-4,1.840662711263882E-4,0.70048852210596579,4.9068416960220016E-3,4.9068416960220016E-3,0.79065613568975579,4.6260147242885456E-2,1.8354554012903226E-2,6.846720000000002E-2,0,0.13365070979509855,1.510440050522539,7.0724303532898436E-2,7.3919999999999993E-3,7.8627906695311792E-2,7.2863999999999998E-2,8.3999999999999993E-4,2.5399999999999999E-2,0.10515599999999999,9.6519999999999995E-2,2.6239999999999999E-2,0.55563051834500654,0.5621282986392947,0.5621282986392947,8.25,0.93620970104054269,4.180041845287267,2.3614796139921714,null,93.620970104054265,0.24845011055974733,0.28514261649041034,0.18174094979509856,0.10267302669531179,0.31367818807954739]
["GfsTop",{"$f":"Gfs_Q1","v":100},"S","Transconductance of Top FET",null,null,34,24,1,1.7,1.7,0.39351851851851849,0.21528238925154217,1.4871264221048075,2.4435632110524037,0.95643678894759621,0,1.7533668801129025,0.15371477081384269,0.1,0.25713210250451846,0.42929642006060786,1.842954162768539E-4,1.842954162768539E-4,0.72066553135000955,5.193588080759916E-3,5.193588080759916E-3,0.81353651576382568,4.8976283023604759E-2,1.8910752619354841E-2,6.846720000000002E-2,0,0.13697140386520917,1.5532075694496559,7.4786066367666923E-2,7.6159999999999995E-3,8.2972946634691264E-2,7.5072E-2,8.3999999999999993E-4,2.5399999999999999E-2,0.10515599999999999,9.6519999999999995E-2,2.6239999999999999E-2,0.57378307282446916,0.58088671865184593,0.58088671865184593,8.5,0.93603193865873002,4.2899352488998108,2.4781742525978991,null,93.603193865872996,0.25713210250451846,0.29501635049990044,0.18651892386520919,0.10774670663469127,0.32375461614732748]
["VthTop",{"$f":"Vth_Q1","v":1.5},"V","Threshold Voltage of Top FET",null,null,35,24,1,1.75,1.75,0.40509259259259256,0.21548726623437647,1.4880504859118728,2.4940252429559364,1.0059747570440636,0,1.8019501992892442,0.16235122603592733,0.1,0.26608624864117325,0.42956317430448665,1.8452452071854677E-4,1.8452452071854677E-4,0.74088975349429664,5.4891762683283961E-3,5.4891762683283961E-3,0.83647620251004517,5.1777240365056335E-2,1.9466951225806457E-2,6.846720000000002E-2,0,0.14038009302219973,1.5960363665508754,7.8967294583940528E-2,7.8399999999999997E-3,8.7442564033556117E-2,7.7279999999999988E-2,8.3999999999999993E-4,2.5399999999999999E-2,0.10515599999999999,9.6519999999999995E-2,2.6239999999999999E-2,0.59238991221073067,0.6001431371693926,0.6001431371693926,8.75,0.9358145508186223,4.4018525395105934,2.5977341727717906,null,93.581455081862231,0.26608624864117325,0.30510265705575579,0.19138489302219971,0.11294496403355611,0.33405688852821935]
["VspTop",{"$f":"Vsp_Q1","v":1.55},"V",null,null,null,36,24,1,1.8,1.8,0.41666666666666663,0.21569217145769112,1.4889738106716086,2.5444869053358046,1.0555130946641957,0,1.8506089765458724,0.17123767920360808,0.1,0.27531375712321043,0.42982971520377805,1.8475358407216095E-4,1.8475358407216095E-4,0.7611585510625819,5.793623398556891E-3,5.793623398556891E-3,0.85947224344712547,5.466324775694658E-2,2.0023149832258069E-2,6.846720000000002E-2,0,0.14387715852339422,1.6389206957068199,8.3267892451299924E-2,8.064E-3,9.2036954992124234E-2,7.9488000000000003E-2,8.3999999999999993E-4,2.5399999999999999E-2,0.10515599999999999,9.6519999999999995E-2,2.6239999999999999E-2,0.61145116924411269,0.619899930229315,0.619899930229315,9,0.93556066749911215,4.5158024860380666,2.7201638848188572,null,93.55606674991121,0.27531375712321043,0.31540211351551845,0.19633923852339422,0.11826799499212423,0.34458617310610457]
["VsdTop",{"$f":"Vsd_Q1","v":0.7},"V",null,null,null,37,24,1,1.85,1.85,0.4282407407407407,0.21589710492732558,1.489896396231198,2.5949481981155991,1.1050518018844011,0,1.8993374123516231,0.18037413029792801,0.1,0.28481587583656093,0.43009604271436774,1.8498260595855925E-4,1.8498260595855925E-4,0.78146955095420678,6.1069465906856959E-3,6.1069465906856959E-3,0.88252198312684382,5.763453375195815E-2,2.0579348438709687E-2,6.846720000000002E-2,0,0.14746298655443557,1.6818553907088512,8.768776421294909E-2,8.2880000000000002E-3,9.6756324019811102E-2,8.1695999999999991E-2,8.3999999999999993E-4,2.5399999999999999E-2,0.10515599999999999,9.6519999999999995E-2,2.6239999999999999E-2,0.63096697670154489,0.64015954320462476,0.64015954320462476,9.25,0.93527308225836769,4.6317939707520184,2.8454680924556555,null,93.527308225836777,0.28481587583656093,0.32591531057424666,0.20138234655443557,0.1237160040198111,0.35534366736806383]
["θJATop",{"$f":"ThetaJA_Q1","v":23},"°C/W","Junction to Ambient Resistance",null,null,38,24,1,1.9,1.9,0.43981481481481477,0.21610206664912082,1.4908182424377805,2.6454091212188899,1.1545908787811097,0,1.948130279524132,0.18976057929993864,0.1,0.29459389282899395,0.43036215679212869,1.8521158599877277E-4,1.8521158599877277E-4,0.80182061231612889,6.4291629433501189E-3,6.4291629433501189E-3,0.90562302703996123,6.0691326965771647E-2,2.1135547045161289E-2,6.846720000000002E-2,0,0.15113796828514547,1.724835794762432,9.2226814085706266E-2,8.5119999999999987E-3,0.1016008840634892,8.3904000000000006E-2,8.3999999999999993E-4,2.5399999999999999E-2,0.10515599999999999,9.6519999999999995E-2,2.6239999999999999E-2,0.65093746739657787,0.66092449158952471,0.66092449158952471,9.5,0.93495429553318798,4.7498359905583456,2.9736516934602517,null,93.4954295533188,0.29459389282899395,0.33664285234863467,0.20651460828514548,0.1292892040634892,0.36633059876053076]
["Low-side FET","Input Value","Units","Description",null,null,39,24,1,1.95,1.95,0.45138888888888884,0.21630705662891964,1.4917393491384559,2.6958696745692281,1.204130325430772,0,1.9969828551627582,0.1993970261907001,0.1,0.30464913675481503,0.43062805739292231,1.8544052381400201E-4,1.8544052381400201E-4,0.82220979892997392,6.7602895345646816E-3,6.7602895345646816E-3,0.92877321059416806,6.3833856077087511E-2,2.1691745651612908E-2,6.846720000000002E-2,0,0.1549024999262375,1.7678576999002502,9.6884946259994692E-2,8.735999999999999E-3,0.10657085653717538,8.6111999999999994E-2,8.3999999999999993E-4,2.5399999999999999E-2,0.10515599999999999,9.6519999999999995E-2,2.6239999999999999E-2,0.67136277417939516,0.6821973618106123,0.6821973618106123,9.75,0.93460655141476257,4.8699376583034617,3.1047197803550337,null,93.460655141476252,0.30464913675481503,0.34758535646341282,0.21173641992623748,0.13498781653717537,0.37754822505579727]
["RdsonBot",{"$f":"Rdson2*1000","v":31},"mW","Drain-Source Resistance of Low-side FET",null,null,40,24,1,2,2,0.46296296296296291,0.21651207487256624,1.4926597161802804,2.7463298580901401,1.2536701419098599,0,2.0458908619536906,0.20928347095128075,0.1,0.31498297733514796,0.43089374447259765,1.856694190256163E-4,1.856694190256163E-4,0.84263535540038015,7.1003434217072493E-3,7.1003434217072493E-3,0.95197057236234195,6.7062349827647486E-2,2.224794425806452E-2,6.846720000000002E-2,0,0.15875698278689779,1.8109172947381476,0.10166206489983366,8.9599999999999992E-3,0.11166647135315493,8.8319999999999996E-2,8.3999999999999993E-4,2.5399999999999999E-2,0.10515599999999999,9.6519999999999995E-2,2.6239999999999999E-2,0.6922430299368264,0.70398081206422636,0.70398081206422636,10,0.934231869019161,4.9921082040986491,3.2386776411225635,null,93.423186901916097,0.31498297733514796,0.35874345414005271,0.2170481827868978,0.14081207135315493,0.3889978347290784]
["RdsonBotTc",{"$f":"RdsonBotTc*1000000","v":4000},"ppm","Drain To Source Resitance Temp Co",null,null,41,24,1,2.0499999999999998,2.0499999999999998,0.47453703703703698,0.21671712138590651,1.4935793434102671,2.7967896717051333,1.3032103282948664,0,2.0948504173938418,0.21941991356275767,0.1,0.32559682583410399,0.43115921798699114,1.8589827125515374E-4,1.8589827125515374E-4,0.86309568655527491,7.4493416415032133E-3,7.4493416415032133E-3,0.97521333093908502,7.0377037022256589E-2,2.2804142864516135E-2,6.846720000000002E-2,0,0.16270182333324953,1.854011119279992,0.10655807414282931,9.1839999999999977E-3,0.11688796695455088,9.0527999999999997E-2,8.3999999999999993E-4,2.5399999999999999E-2,0.10515599999999999,9.6519999999999995E-2,2.6239999999999999E-2,0.71357836759235971,0.72627757318046227,0.72627757318046227,10.25,0.93383206935700536,5.116356976664739,3.3755307599546702,null,93.383206935700542,0.32559682583410399,0.3701177902878004,0.22245030333324953,0.14676220695455089,0.40068074734635828]
["QgBot",{"$f":"Qg_Q2*1000000000","v":8.6},"nC","Gate Charge Of Top FET",null,null,42,24,1,2.1,2.1,0.4861111111111111,0.216922196174788,1.4944982306753887,2.8472491153376946,1.3527508846623058,0,2.1438579897288723,0.22980635400621607,0.1,0.33649213555115326,0.43142447789192756,1.8612708012432231E-4,1.8612708012432231E-4,0.88358933956955454,7.8073012100096165E-3,7.8073012100096165E-3,0.99849986485676789,7.3778146528804794E-2,2.3360341470967751E-2,6.846720000000002E-2,0,0.16673743324771537,1.8971360256990897,0.11157287810016546,9.4079999999999997E-3,0.12223559034934803,9.2736000000000013E-2,8.3999999999999993E-4,2.5399999999999999E-2,0.10515599999999999,9.6519999999999995E-2,2.6239999999999999E-2,0.73536892010615407,0.7490904495143923,0.7490904495143923,10.5,0.93340879843785685,5.242693444697454,3.5152848180350045,null,93.340879843785686,0.33649213555115326,0.38170902359706338,0.22794319324771539,0.15283847034934803,0.41259831396323904]
["RGateBot",{"$f":"Rgate2","v":0.24},"W","Gate Resistance",null,null,43,24,1,2.15,2.15,0.49768518518518517,0.21712729924505986,1.4954163778225751,2.8977081889112872,1.4022918110887124,0,2.1929103596031916,0.24044279226274995,0.1,0.34767040233002638,0.43168952414321943,1.8635584525499924E-4,1.8635584525499924E-4,0.90411498840574944,8.1742391225992847E-3,8.1742391225992847E-3,1.0218286951045352,7.7265907278288748E-2,2.3916540077419356E-2,6.846720000000002E-2,0,0.17086422948929456,1.9402891442040182,0.11670638085659481,9.6319999999999982E-3,0.12770959714588137,9.4944000000000001E-2,8.3999999999999993E-4,2.5399999999999999E-2,0.10515599999999999,9.6519999999999995E-2,2.6239999999999999E-2,0.75761482047505291,0.77242231986505261,0.77242231986505261,10.75,0.93296354721060959,5.3711271982537747,3.6579456943552717,null,93.296354721060965,0.34767040233002638,0.39351782663517598,0.23352726948929456,0.15904111714588137,0.42475191753502622]
["VsdBot",{"$f":"Vsd_Q2","v":0.7},"V","Diode Forward Voltage of Bottom FET Body Diode",null,null,44,24,1,2.2000000000000002,2.2000000000000002,0.50925925925925919,0.21733243060257279,1.4963337846987137,2.9481668923493571,1.4518331076506432,0,2.2420045865852352,0.25132922831346155,0.1,0.35913316508448417,0.43195435669666699,1.8658456626923143E-4,1.8658456626923143E-4,0.92467142023234217,8.5501723539449671E-3,8.5501723539449671E-3,1.0451984698690824,8.0840548264833667E-2,2.4472738683870971E-2,6.846720000000002E-2,0,0.17508263435477062,1.9834678532440499,0.12195848647042937,9.8560000000000002E-3,0.1333102515897987,9.7152000000000016E-2,8.3999999999999993E-4,2.5399999999999999E-2,0.10515599999999999,9.6519999999999995E-2,2.6239999999999999E-2,0.78031620173259564,0.79627613842277456,0.79627613842277456,11,0.9324976688338833,5.5016679501597245,3.80351946656537,null,93.249766883388332,0.35913316508448417,0.40554488594456933,0.23920295435477062,0.1653704115897987,0.43714297333829039]
["QrrBot",{"$f":"Qrr_Q2*1000000000","v":23},"nC","Reverse Recovery Charge of Body Diode",null,null,45,24,1,2.25,2.25,0.52083333333333326,0.21753759025317909,1.4972504511506493,2.9986252255753247,1.5013747744246753,0,2.291137979867043,0.26246566213946176,0.1,0.37088200634131058,0.43221897550805799,1.8681324278923522E-4,1.8681324278923522E-4,0.94525752353543457,8.9351178580034264E-3,8.9351178580034264E-3,1.0686079511778261,8.450229854571488E-2,2.5028937290322587E-2,6.846720000000002E-2,0,0.17939307554086517,2.0266697534301841,0.12732909897353167,1.0079999999999999E-2,0.13903782660250896,9.935999999999999E-2,8.3999999999999993E-4,2.5399999999999999E-2,0.10515599999999999,9.6519999999999995E-2,2.6239999999999999E-2,0.80347319694903097,0.82065493574546444,0.82065493574546444,11.25,0.93201239368418898,5.6343255374398984,3.9520124118577065,null,93.201239368418896,0.37088200634131058,0.41779090214337411,0.24497067554086516,0.17182662660250897,0.44977292940415387]
["TrrBot",{"$f":"Trr_Q2*1000000000","v":40},"ns","Reverse Recovery Time of Body Diode",null,null,46,24,1,2.2999999999999998,2.2999999999999998,0.53240740740740733,0.2177427782027328,1.4981663770251854,3.0490831885125926,1.550916811487407,0,2.3403080725488681,0.27385209372186992,0.1,0.38291855280089293,0.43248338053316859,1.8704187443739751E-4,1.8704187443739751E-4,0.96587227768476469,9.3290925679995525E-3,9.3290925679995525E-3,1.0920560031759827,8.8251387241379944E-2,2.5585135896774198E-2,6.846720000000002E-2,0,0.18379598620735627,2.0698926446472279,0.13281812237130555,1.0303999999999999E-2,0.14489260382112662,0.10156799999999999,8.3999999999999993E-4,2.5399999999999999E-2,0.10515599999999999,9.6519999999999995E-2,2.6239999999999999E-2,0.82708593923132956,0.84556181976445122,0.84556181976445122,11.5,0.93150884243998022,5.7691099227691947,4.1034310078859129,null,93.150884243998021,0.38291855280089293,0.43025659002848288,0.25083086620735628,0.17841004382112663,0.46264326696355829]
["θJABot",{"$f":"ThetaJA_Q2","v":23},"°C/W","Junction to Ambient Resistance",null,null,47,24,1,2.35,2.35,0.5439814814814814,0.21794799445708946,1.4990815621690825,3.0995407810845412,1.6004592189154589,0,2.3895125990118311,0.28548852304181377,0.1,0.39524447591576989,0.43274757172776229,1.8727046083627478E-4,1.8727046083627478E-4,0.98651474375249226,9.7321133964104554E-3,9.7321133964104554E-3,1.1155415818110939,9.2088043535470204E-2,2.6141334503225817E-2,6.846720000000002E-2,0,0.18829180504117643,2.1131345059145379,0.13842546064268701,1.0527999999999999E-2,0.15087487363992427,0.10377600000000001,8.3999999999999993E-4,2.5399999999999999E-2,0.10515599999999999,9.6519999999999995E-2,2.6239999999999999E-2,0.85115456172319692,0.87099997682054764,0.87099997682054764,11.75,0.93098803752315928,5.9060311959470582,4.2577819337182587,null,93.098803752315931,0.39524447591576989,0.44294267868110071,0.25678396504117645,0.18512095363992428,0.47575550090477775]
[null,null,null,null,null,null,48,24,1,2.4,2.4,0.55555555555555547,0.21815323902210629,1.4999960064290592,3.1499980032145296,1.6500019967854702,0,2.4387494749581382,0.29737495008042975,0.1,0.40786149248754139,0.43301154904759048,1.8749900160859386E-4,1.8749900160859386E-4,1.0071840564141956,1.0144197234949538E-2,1.0144197234949538E-2,1.1390637257334018,9.6012496674842698E-2,2.6697533109677419E-2,6.846720000000002E-2,0,0.19288097632150938,2.1563934776211267,0.14415101774013503,1.0751999999999999E-2,0.15698493525330529,0.10598399999999999,8.3999999999999993E-4,2.5399999999999999E-2,0.10515599999999999,9.6519999999999995E-2,2.6239999999999999E-2,0.87567919760508495,0.89697267273099368,0.89697267273099368,12,0.93045091313347283,6.0450995753947154,4.4150720708260209,null,93.045091313347285,0.40786149248754139,0.45584991157481469,0.26283041632150939,0.19195965525330527,0.48911118024345229]
[null,null,null,null,null,null,49,24,1,2.4500000000000002,2.4500000000000002,0.56712962962962954,0.21835851190364208,1.5009097096517916,3.200454854825896,1.6995451451741044,0,2.4880167797619963,0.30951137481886271,0.1,0.42077136528254805,0.43327531244839251,1.8772749637725218E-4,1.8772749637725218E-4,1.0278794167873282,1.056536095455058E-2,1.056536095455058E-2,1.1626215482494486,0.10002497596959194,2.7253731716129038E-2,6.846720000000002E-2,0,0.19756394998590235,2.199667845817479,0.14999469758962256,1.0976E-2,0.16322309670030941,0.10819200000000001,8.3999999999999993E-4,2.5399999999999999E-2,0.10515599999999999,9.6519999999999995E-2,2.6239999999999999E-2,0.90065998009420634,0.92348325388797026,0.92348325388797026,12.25,0.92989832407344386,6.1863254096757538,4.5753085041071158,null,92.98983240734438,0.42077136528254805,0.46897904668621176,0.26897066998590236,0.1989264567003094,0.50271188860542226]
[null,null,null,null,null,null,50,24,1,2.5,2.5,0.57870370370370372,0.21856381310755724,1.5018226716839138,3.2509113358419568,1.7490886641580432,0,2.5373127408274523,0.32189779723826595,0.1,0.43397590366674427,0.4335388618858953,1.8795594476531742E-4,1.8795594476531742E-4,1.0486000860839075,1.0995621405351784E-2,1.0995621405351784E-2,1.1862142301904719,0.10412571079307166,2.780993032258065E-2,6.846720000000002E-2,0,0.202341181697412,2.2429560282936767,0.15595640409062728,1.1199999999999998E-2,0.1695896749106641,0.1104,8.3999999999999993E-4,2.5399999999999999E-2,0.10515599999999999,9.6519999999999995E-2,2.6239999999999999E-2,0.9260970424445456,0.95053514838940178,0.95053514838940178,12.5,0.92933105353037038,6.3297191790404757,4.7384985229452736,null,92.933105353037035,0.43397590366674427,0.48233085660807612,0.27520518169741198,0.20602167491066409,0.51655924472265746]
[null,null,null,null,null,null,51,24,1,2.5499999999999998,2.5499999999999998,0.59027777777777779,0.21876914263971384,1.502734892372017,3.3013674461860081,1.7986325538139913,0,2.5866357196938319,0.33453421731980137,0.1,0.44747696426020356,0.43380219731581365,1.8818434639602814E-4,1.8818434639602814E-4,1.069345379972245,1.143499541667985E-2,1.143499541667985E-2,1.2098410135774094,0.10831493058191698,2.8366128929032265E-2,6.846720000000002E-2,0,0.20721313291280358,2.2862565622130022,0.16203604111612246,1.1423999999999998E-2,0.17608499575239586,0.112608,8.3999999999999993E-4,2.5399999999999999E-2,0.10515599999999999,9.6519999999999995E-2,2.6239999999999999E-2,0.95199051794687317,0.978131867202786,0.978131867202786,12.75,0.92874981995623218,6.4752914969944824,4.9046496223051044,null,92.874981995623216,0.44747696426020356,0.4959061286651994,0.28153441291280357,0.21324563575239586,0.53065490294258244]
["Controller","Input Value","Units","Std Units",null,null,52,24,1,2.6,2.6,0.60185185185185186,0.21897450050597553,1.50364637156265,3.351823185781325,1.8481768142186752,0,2.635984199666757,0.34742063504463971,0.1,0.46127645161171155,0.43406531869385007,1.8841270089279364E-4,1.8841270089279364E-4,1.0901146635576453,1.1883499797033983E-2,1.1883499797033983E-2,1.2335011959813318,0.1125928648360658,2.8922327535483881E-2,6.846720000000002E-2,0,0.21218027095182024,2.3295680931034015,0.16823351251256796,1.1647999999999999E-2,0.18270939408101483,0.114816,8.3999999999999993E-4,2.5399999999999999E-2,0.10515599999999999,9.6519999999999995E-2,2.6239999999999999E-2,0.97834053992875736,1.0062770053628181,1.0062770053628181,13,0.92815528316500318,6.6230531118918652,5.0737695038633408,null,92.81552831650032,0.46127645161171155,0.5097056650328351,0.28795883095182023,0.22059867408101483,0.54500055375110645]
["θJA",23,"°C/W","Junction to Ambient Resistance",null,null,53,24,1,2.65,2.65,0.61342592592592593,0.21917988671220762,1.5045571091023209,3.4022785545511605,1.8977214454488394,0,2.6853567747841618,0.3605570503939598,0.1,0.47537631889391629,0.43432822597569509,1.8864100787919447E-4,1.8864100787919447E-4,1.1109073469047703,1.2341151334069957E-2,1.2341151334069957E-2,1.2571941254924461,0.116959743118781,2.9478526141935486E-2,6.846720000000002E-2,0,0.21724306906754429,2.3728893650371643,0.17454872209990077,1.1871999999999999E-2,0.18946321379028799,0.117024,8.3999999999999993E-4,2.5399999999999999E-2,0.10515599999999999,9.6519999999999995E-2,2.6239999999999999E-2,1.005147241754577,1.0349742432036004,1.0349742432036004,13.25,0.9275480497491263,6.7730149085535176,5.2458660771766237,null,92.754804974912631,0.47537631889391629,0.5237302828578323,0.29447890906754426,0.22808113379028799,0.55959792430968414]
["Theta JC",2,"°C/W","Junction to Ambient Resistance",null,null,54,24,1,2.7,2.7,0.625,0.21938530126427697,1.5054671048374937,3.452733552418747,1.9472664475812533,0,2.7347521399532688,0.37394346334894918,0.1,0.48977856861952834,0.4345909191170268,1.8886926697898212E-4,1.8886926697898212E-4,1.1317228810351108,1.2807966794584114E-2,1.2807966794584114E-2,1.2809191962229023,0.12141579505667212,3.0034724748387108E-2,6.846720000000002E-2,0,0.22240200651786732,2.4162192118528187,0.18098157367152634,1.2095999999999999E-2,0.1963468078646165,0.119232,8.3999999999999993E-4,2.5399999999999999E-2,0.10515599999999999,9.6519999999999995E-2,2.6239999999999999E-2,1.0324107568255347,1.064227347626264,1.064227347626264,13.5,0.92692867790204359,6.9251879099109477,5.4209474608861798,null,92.69286779020436,0.48977856861952834,0.5379808143824838,0.3010951265178673,0.2356933678646165,0.57444877900673563]
[null,null,null,null,null,null,55,24,1,2.75,2.75,0.63657407407407407,0.21959074416805213,1.50637635861459,3.503188179307295,1.996811820692705,0,2.7841690821169749,0.38757987389080395,0.1,0.5044852533790718,0.43485339807351092,1.8909747781607937E-4,1.8909747781607937E-4,1.1525607543421459,1.3283962924497364E-2,1.3283962924497364E-2,1.3046758442788879,0.12596125033971733,3.0590923354838716E-2,6.846720000000002E-2,0,0.22765756863809183,2.4595565492932359,0.18753197099430874,1.2319999999999999E-2,0.20336053843303126,0.12144000000000001,8.3999999999999993E-4,2.5399999999999999E-2,0.10515599999999999,9.6519999999999995E-2,2.6239999999999999E-2,1.060131218579669,1.0940401734028415,1.0940401734028415,13.75,0.92629768172123961,7.0795832786761128,5.5990219839597186,null,92.62976817212396,0.5044852533790718,0.55245810707112308,0.30780796863809184,0.24343573843303126,0.58955492002376975]
[null,null,null,null,null,null,56,24,1,2.8,2.8,0.64814814814814814,0.21979621542940322,1.5072848702799899,3.5536424351399947,2.046357564860005,0,2.8336064723271965,0.40146628200072904,0.1,0.51949847660071602,0.43511566280080122,1.8932564001458057E-4,1.8932564001458057E-4,1.1734204893745135,1.3769156448839229E-2,1.3769156448839229E-2,1.3284635441461972,0.13059633872128515,3.1147121961290325E-2,6.846720000000002E-2,0,0.23301024691468272,2.5029003679509705,0.19419981780856221,1.2543999999999998E-2,0.21050477682482582,0.12364799999999998,8.3999999999999993E-4,2.5399999999999999E-2,0.10515599999999999,9.6519999999999995E-2,2.6239999999999999E-2,1.0883087604918669,1.1244166645172813,1.1244166645172813,14,0.92565553505576026,7.2362123190377021,5.7800981869709931,null,92.56555350557602,0.51949847660071602,0.56716302373950855,0.31461792691468271,0.2513086168248258,0.60491818791656526]
["Outputs",null,null,null,null,null,57,24,1,2.85,2.85,0.65972222222222221,0.22000171505420199,1.5081926396800307,3.6040963198400155,2.0959036801599846,0,2.8830632586189906,0.41560268765993763,0.1,0.53482039333272513,0.435377713254539,1.895537531987516E-4,1.895537531987516E-4,1.1943016399441047,1.4263564071731778E-2,1.4263564071731778E-2,1.3522818054408785,0.13532129001815671,3.1703320567741944E-2,6.846720000000002E-2,0,0.2384605390601913,2.5462497269263102,0.2009850178280416,1.2768E-2,0.21777990362684033,0.125856,8.3999999999999993E-4,2.5399999999999999E-2,0.10515599999999999,9.6519999999999995E-2,2.6239999999999999E-2,1.1169435160738781,1.1553608555445021,1.1553608555445021,14.25,0.92500267495333099,7.3950864783843997,5.9641848234173276,null,92.500267495333105,0.53482039333272513,0.58209644268703165,0.32152549906019129,0.25931238362684034,0.62054046221177694]
["Design","Value","Units",null,null,null,58,24,1,2.9,2.9,0.67129629629629628,0.22020724304832184,1.509099666661007,3.6545498333305035,2.1454501666694963,0,2.932538459593161,0.42998909084965153,0.1,0.55045321104909506,0.43563954939035349,1.8978181699303023E-4,1.8978181699303023E-4,1.2152037885216476,1.4767202476373651E-2,1.4767202476373651E-2,1.3761301699828845,0.14013633411054707,3.2259519174193549E-2,6.846720000000002E-2,0,0.24400894908937137,2.589603748115898,0.20788747473993313,1.2991999999999998E-2,0.22518630874241616,0.12806399999999998,8.3999999999999993E-4,2.5399999999999999E-2,0.10515599999999999,9.6519999999999995E-2,2.6239999999999999E-2,1.1460356188743253,1.1868768730684347,1.1868768730684347,14.5,0.92433950475469784,7.556217349055542,6.1512908610755721,null,92.433950475469786,0.55045321104909506,0.59725925783178746,0.3285311890893714,0.26744742874241617,0.63642366201933964]
["Dmax",{"$f":"D1_Vinmin","v":0.29761904761904767},"index",null,null,null,59,24,1,2.95,2.95,0.68287037037037035,0.22041279941763778,1.5100059510691715,3.7050029755345859,2.1949970244654144,0,2.9820311586269561,0.44462549155110137,0.1,0.56639919047895582,0.43590117116386151,1.9000983102202609E-4,1.9000983102202609E-4,1.236126543887154,1.5280088325024001E-2,1.5280088325024001E-2,1.4000082091560855,0.14504170094212779,3.2815717780645175E-2,6.846720000000002E-2,0,0.24965598739651162,2.6329616110603657,0.2149070922048455,1.3216E-2,0.23272439145203869,0.130272,8.3999999999999993E-4,2.5399999999999999E-2,0.10515599999999999,9.6519999999999995E-2,2.6239999999999999E-2,1.1755852024787197,1.2189689371400232,1.2189689371400232,14.75,0.92366639687644514,7.719616670119767,6.3414254833968897,null,92.366639687644508,0.56639919047895582,0.61265237884855028,0.3356355073965116,0.2757141514520387,0.65256974666106737]
["Dprime",{"$f":"1-B68","v":0.70238095238095233},"index",null,null,null,60,24,1,3,3,0.69444444444444442,0.22061838416802643,1.5109114927507343,3.7554557463753673,2.2445442536246327,0,3.0315404986426491,0.45951188974552609,0.1,0.58266064646034377,0.43616257853066792,1.9023779491052106E-4,1.9023779491052106E-4,1.2570695390067508,1.580223825898645E-2,1.580223825898645E-2,1.4239155215226378,0.15003762052004832,3.337191638709678E-2,6.846720000000002E-2,0,0.25540217083400329,2.6763225482884971,0.22204377385680049,1.3439999999999999E-2,0.24039456047568597,0.13247999999999999,8.3999999999999993E-4,2.5399999999999999E-2,0.10515599999999999,9.6519999999999995E-2,2.6239999999999999E-2,1.2055924005094716,1.2516413627761875,1.2516413627761875,15,0.92298369531812163,7.8852963291820757,6.5345980909407775,null,92.29836953181217,0.58266064646034377,0.62827673130968931,0.34283897083400328,0.28411296047568596,0.66898071631584377]
["Ipp",{"$f":"Iripple_Vinnom","v":1.5355683265528202},"A",null,null,null,61,24,1,3.05,3.05,0.70601851851851849,0.22082399730536606,1.5118162915518627,3.8059081457759314,2.2940918542240682,0,3.0810656773725982,0.47464828541417337,0.1,0.59923994881897213,0.43642377144636485,1.9046570828346889E-4,1.9046570828346889E-4,1.2780324291109779,1.6333668898593067E-2,1.6333668898593067E-2,1.4478517306637171,0.15512432291495815,3.3928114993548392E-2,6.846720000000002E-2,0,0.26124802279216919,2.7196858411032601,0.22929742330322397,1.3663999999999997E-2,0.24819723403690372,0.134688,8.3999999999999993E-4,2.5399999999999999E-2,0.10515599999999999,9.6519999999999995E-2,2.6239999999999999E-2,1.2360573466259037,1.2848985615007975,1.2848985615007975,15.25,0.92229171792486808,8.0532683642198908,6.7308183028487862,null,92.22917179248681,0.59923994881897213,0.64413325682907296,0.35014210279216917,0.29264427403690374,0.68565861268182537]
["Top FET","Value","Units",null,null,null,62,24,1,3.1,3.1,0.71759259259259256,0.22102963883553647,1.5127203473186812,3.8563601736593407,2.3436398263406595,0,3.1306059430669322,0.49003467853829979,0.1,0.61613952327264376,0.43668474986653244,1.9069357076599599E-4,1.9069357076599599E-4,1.2990148899527008,1.6874396843188273E-2,1.6874396843188273E-2,1.4718164832220668,0.16030203826102876,3.4484313600000011E-2,6.846720000000002E-2,0,0.26719407328037498,2.763050815761777,0.23666794412493647,1.3887999999999999E-2,0.25613283992862507,0.13689600000000002,8.3999999999999993E-4,2.5399999999999999E-2,0.10515599999999999,9.6519999999999995E-2,2.6239999999999999E-2,1.266980174524265,1.3187450429287275,1.3187450429287275,15.5,0.92159075843276539,8.2235449654486263,6.9300959583583763,null,92.15907584327654,0.61613952327264376,0.66022291320900006,0.35754543328037502,0.30130851992862506,0.70260551965608375]
["Tr",{"$f":"(Qgd_Q1+Qgs_Q1/2)*(RdsonDRT+Rgate1)/(VCC-Vsp_Q1)*1000000000","v":1.0885200000000004},"ns","Turn on of MOSFET -> Rise time of current",null,null,63,24,1,3.15,3.15,0.72916666666666663,0.22123530876441924,1.5136236598972734,3.9068118299486367,2.3931881700513631,0,3.1801605905965502,0.50567106909916992,0.1,0.63336185236197873,0.43694551374673873,1.9092138198340144E-4,1.9092138198340144E-4,1.3200166162254467,1.7424438671112784E-2,1.7424438671112784E-2,1.4958094471247922,0.16557099675597545,3.5040512206451616E-2,6.846720000000002E-2,0,0.27324085900944717,2.8064168400071332,0.24415523987614432,1.4111999999999998E-2,0.26420181558075689,0.13910400000000001,8.3999999999999993E-4,2.5399999999999999E-2,0.10515599999999999,9.6519999999999995E-2,2.6239999999999999E-2,1.2983610179377414,1.3531854163941106,1.3531854163941106,15.75,0.92088108832071558,8.3961384772172849,7.1324411183574083,null,92.088108832071555,0.63336185236197873,0.67654667459020412,0.36504949900944716,0.31010613558075689,0.71982356403213188]
["Tf",{"$f":"(Qgd_Q1+Qgs_Q1/2)*(RdsonDRT2+Rgate1)/(Vsp_Q1)*1000000000","v":1.2289741935483873},"ns","Turn off of MOSFET -> Fall time of current",null,null,64,{"$f":"Vin","v":24},{"$f":"MODE","v":1},3.2,{"$f":"Iout*G73/100/Number_of_Phases","v":3.2},{"$f":"Vout*K73/(Vin*Efficiency)","v":0.7407407407407407},{"$f":"(Vout+(Rdson2+Rs+Rdcr)*K73)/(Vin+(Rs+Rdson2-Rdson1)*K73)","v":0.22144100709789741},{"$f":"(Vin-(Rdson1+Rdcr)*K73-Vout)*M73/(Fsw*Lf)","v":1.5145262291336785},3.9572631145668393,2.442736885433161,{"$f":"IF(MIN(Vin, -P73/(Coss_Q1+Coss_Q2)*0.00000002)<0, 0, MIN(Vin, -P73/(Coss_Q1+Coss_Q2)*0.00000002))","v":0},3.2297289579098054,{"$f":"R73^2*Rdcr","v":0.5215574570780579},{"$f":"Core_Loss","v":0.1},{"$f":"(T73+S73*(1+Ltc*(Ta-25)))/(1-S73*Ltc*ThetaCa)","v":0.65090947640815389},0.43720606304253906,1.9114914156115665E-4,1.9114914156115665E-4,1.3410373201252652,1.7983810939687532E-2,1.7983810939687532E-2,1.5198303099674222,{"$f":"Rdson1*AB73^2","v":0.17093142866107963},{"$f":"(Vin*K73/2)*Fsw*(Tr_buck+Tf_buck)","v":3.5596710812903234E-2},{"$f":"(0.5*Coss_Q1*(Vin-Q73)^2-0.5*Coss_Q2*(Vin-Q73)^2+(Qoss_Q2*(Vin-Q73)/Vin)*Vin)*Fsw","v":6.846720000000002E-2},{"$f":"IF(K73>N73/2,0,ABS(K73-N73/2)*Vsd_Q1*Deadtime*Fsw)","v":0},{"$f":"(AF73+AE73+AD73+AC73*(1+RdsonTopTc*Ta-RdsonTopTc*25))/(1-AC73*RdsonTopTc*ThetaJA_Q1)","v":0.27938892347542255},{"$f":"SQRT((1-M73))*SQRT(K73^2+(N73^2)/12)","v":2.8497833199149523},{"$f":"Rdson2*AH73^2","v":0.25175921408443014},{"$f":"IF(K73<N73/2,Deadtime*Fsw*Vsd_Q2*(K73+N73/2),2*Deadtime*Fsw*Vsd_Q2*K73)","v":1.4336E-2},{"$f":"(AJ73+AI73*(1+RdsonBotTc*Ta-RdsonBotTc*25))/(1-AI73*RdsonBotTc*ThetaJA_Q2)","v":0.27240460812955208},{"$f":"Qrr_Q2*K73/Iout*Fsw*Vin","v":0.14131200000000002},{"$f":"Iq*Vin","v":8.3999999999999993E-4},{"$f":"IF(Ext_VCC=1,  (Qg_Q1+Qg_Q2)*Fsw*Vout, (Qg_Q1+Qg_Q2)*Fsw*Vin)","v":2.5399999999999999E-2},{"$f":"(Vin-VCC)*Fsw*(Qg_Q1+Qg_Q2)","v":0.10515599999999999},{"$f":"(Qg_Q1+Qg_Q2)*Fsw*(Vin-Vout)","v":9.6519999999999995E-2},2.6239999999999999E-2,1.3302000106364711,{"$f":"U73 + ((AF73+AE73+AD73+AC73*(1+RdsonTC*(Ta-25))) + (AJ73+AI73*(1+RdsonTC*(Ta-25))) + AQ73 + AL73) / (1-AC73*RdsonTC*ThetaJA_Q1 -AI73*RdsonTC*ThetaJA_Q2)","v":1.3882243926239486},1.3882243926239486,{"$f":"Vout*K73","v":16},0.92016295848972196,{"$f":"ThetaJA_Q1*BC73","v":8.5710613999347185},{"$f":"ThetaJA_Q2*BD73","v":7.337864066979698},null,92.016295848972192,{"$f":"U73","v":0.65090947640815389},{"$f":"AG73+AK73+AL73","v":0.69310553160497468},{"$f":"AG73+AL73*0.66","v":0.37265484347542255},{"$f":"AK73+AL73*0.33","v":0.31903756812955208},0.7373149162157947]
["Part Power","Value","Units",null,null,null,65,24,1,{"$f":"Iout*G74/100","v":3.25},3.25,0.75231481481481477,0.22164673384185579,1.5154280548738945,{"$f":"K74+N74/2","v":4.0077140274369469},{"$f":"K74-N74/2","v":2.4922859725630526},0,{"$f":"SQRT(K74^2+(N74^2)/12)","v":3.2793104228061281},0.5376938424562453,0.1,0.66878499449836692,{"$f":"N74/SQRT(12)","v":0.43746639770947704},{"$f":"RCoutEsr*V74^2","v":1.9137684912490637E-4},{"$f":"W74","v":1.9137684912490637E-4},{"$f":"SQRT(M74*(1-M74))*SQRT(K74^2+(N74^2)/12)","v":1.3620767300412104},{"$f":"RCinEsr*Y74^2","v":1.8552530185197563E-2},{"$f":"Z74","v":1.8552530185197563E-2},{"$f":"SQRT(M74)*SQRT(K74^2+(N74^2)/12)","v":1.5438787775424867},0.17638356430121016,3.6152909419354846E-2,6.846720000000002E-2,0,0.28563881704465177,2.8931496970220576,0.25947977025074354,1.4559999999999998E-2,0.28074167448879028,0.14352000000000004,8.3999999999999993E-4,2.5399999999999999E-2,0.10515599999999999,9.6519999999999995E-2,2.6239999999999999E-2,{"$f":"SUM(S74,T74,AC74,AD74,AE74,AF74,AI74,AJ74,AQ74, AL74)","v":1.362497286427554},1.4238667854582618,{"$f":"AS74","v":1.4238667854582618},16.25,{"$f":"AU74/(AU74+AT74)","v":0.9194366007879049},8.7483263920269909,7.5463753132421765,null,{"$f":"AV74*100","v":91.943660078790487},0.66878499449836692,0.70990049153344215,0.38036201704465178,0.32810327448879029,{"$f":"AS74-BA74","v":0.75508179095989492}]
["Power Dis",{"$f":"AQ9","v":2.6239999999999999E-2},"W",null,null,null,66,24,1,3.3,3.3,0.76388888888888884,0.22185248900218071,1.5163291369638756,4.0581645684819376,2.541835431518062,0,3.3289043999941583,0.55408022521502331,0.1,0.68699106549978117,0.4377265177030833,1.9160450430046768E-4,1.9160450430046768E-4,1.3831345893612788,1.913061292287593E-2,1.913061292287593E-2,1.5679545724978246,0.18192763406484583,3.6709108025806451E-2,6.846720000000002E-2,0,0.29199109704028575,2.9365154457083369,0.2673168118493926,1.4783999999999999E-2,0.28921348142279057,0.145728,8.3999999999999993E-4,2.5399999999999999E-2,0.10515599999999999,9.6519999999999995E-2,{"$f":"SUM(AM75:AN75)","v":2.6239999999999999E-2},1.3952529791550681,1.4601175136180262,1.4601175136180262,16.5,0.91870222939739055,8.9279462719265723,7.7579855927241832,null,91.870222939739051,0.68699106549978117,0.72693257846307635,0.38817157704028576,0.33730372142279058,0.77312644811824505]
["Temp rise",{"$f":"B75*B62","v":0.60351999999999995},"°C",null,null,null,67,24,1,3.35,3.35,0.77546296296296291,0.22205827258476021,1.517229475249535,4.1086147376247677,2.5913852623752325,0,3.3785103384056461,0.57071660533569168,0.1,0.70553040910271336,0.43798642297887685,1.9183210671383163E-4,1.9183210671383163E-4,1.4042106553821476,1.9718075646887604E-2,1.9718075646887604E-2,1.5920574331115196,0.18756386840409742,3.7265306632258077E-2,6.846720000000002E-2,0,0.29844632783016734,2.9798800708062383,0.27527024232803393,1.5007999999999999E-2,0.29782050562127554,0.14793600000000001,8.3999999999999993E-4,2.5399999999999999E-2,0.10515599999999999,9.6519999999999995E-2,2.6239999999999999E-2,1.4284672227000812,1.4969816025221672,1.4969816025221672,16.75,0.91796004209730497,9.1099340200938492,7.9727058692893378,null,91.796004209730498,0.70553040910271336,0.744202833451443,0.39608408783016735,0.34663938562127555,0.7914511934194538]
["Current (switching)",{"$f":"(Qg_Q1+Qg_Q2)*Fsw+Iq","v":5.1149999999999998E-3},"A",null,null,null,68,24,1,3.4,3.4,0.78703703703703698,0.22226408459548391,1.518129069576742,4.1590645347883708,2.640935465211629,0,3.4281277187396566,0.58760298279955814,0.1,0.72440580689386824,0.43824611349236409,1.9205965599116206E-4,1.9205965599116206E-4,1.4253046983123752,2.0314934830313307E-2,2.0314934830313307E-2,1.616187112171853,0.19329249783472913,3.7821505238709682E-2,6.846720000000002E-2,0,0.30500508091615502,3.0232431054152378,0.2833399651076639,1.5231999999999999E-2,0.30656323377611427,0.150144,8.3999999999999993E-4,2.5399999999999999E-2,0.10515599999999999,9.6519999999999995E-2,2.6239999999999999E-2,1.4621401509806609,1.5344641861549286,1.5344641861549286,17,0.91721022141545594,9.2943027810715666,8.1905473368506279,null,91.721022141545589,0.72440580689386824,0.7617123146922693,0.40410012091615505,0.35611075377611429,0.81005837926106039]
["Qrr Current",{"$f":"Qrr_Q2*Fsw","v":9.1999999999999998E-3},"A",null,null,null,69,24,1,3.45,3.45,0.79861111111111105,0.22246992504024299,1.5190279197913239,4.2095139598956619,2.6904860401043384,0,3.4777560512144605,0.60473935758793995,0.1,0.74362010346045071,0.43850558919903909,1.9228715175879644E-4,1.9228715175879644E-4,1.446416500359887,2.0921206925133433E-2,2.0921206925133433E-2,1.6403433759519601,0.19911375293618103,3.8377703845161301E-2,6.846720000000002E-2,0,0.31166793502490892,3.0666041089011347,0.291525883582609,1.5455999999999999E-2,0.31544216265996533,0.15235200000000004,8.3999999999999993E-4,2.5399999999999999E-2,0.10515599999999999,9.6519999999999995E-2,2.6239999999999999E-2,1.4962718979518912,1.5725705089849997,1.5725705089849997,17.25,0.91645293567983566,9.481065865572905,8.4115214211792022,null,91.645293567983572,0.74362010346045071,0.77946209768487429,0.41222025502490894,0.36571832265996534,0.82895040552454902]
["Diode Current",{"$f":"Deadtime*Fsw*(Iripple_Vinnom/2)*(Vsd_Q2)/Vin","v":7.1659855239131602E-5},null,null,null,null,70,24,1,3.5,3.5,0.81018518518518512,0.22267579392493042,1.5199260257390654,4.2599630128695329,2.7400369871304671,0,3.5273948735069691,0.6221257296821624,0.1,0.76317620752600845,0.43876485005438376,1.9251459364324586E-4,1.9251459364324586E-4,1.4675458548955751,2.1536908362211844E-2,2.1536908362211844E-2,1.6645260032700129,0.20502786435159118,3.8933902451612913E-2,6.846720000000002E-2,0,0.31843547620016138,3.1099626650622678,0.29982790112051733,1.5679999999999999E-2,0.32445779920684747,0.15455999999999998,8.3999999999999993E-4,2.5399999999999999E-2,0.10515599999999999,9.6519999999999995E-2,2.6239999999999999E-2,1.5308625976058838,1.6113059279377988,1.6113059279377988,17.5,0.91568833997982746,9.6702367526037118,8.6356397817574919,null,91.56883399798275,0.76317620752600845,0.79745327540700894,0.42044507620016136,0.37546259920684749,0.84812972041179036]
["Total",{"$f":"SUM(B77:B79)","v":1.4386659855239131E-2},"A",null,null,null,71,24,1,3.55,3.55,0.82175925925925919,0.22288169125544061,1.5208233872657084,4.3104116936328545,2.7895883063671456,0,3.5770437488617879,0.63976209906355974,0.1,0.78307709311889906,0.43902389601386765,1.9274198127119528E-4,1.9274198127119528E-4,1.488692565685735,2.2162055551279765E-2,2.2162055551279765E-2,1.6887347846267449,0.21103506278781706,3.9490101058064518E-2,6.846720000000002E-2,0,0.32530829789650434,3.1533183804466773,0.30824592106234855,1.5903999999999998E-2,0.33361066059466077,0.15676799999999999,8.3999999999999993E-4,2.5399999999999999E-2,0.10515599999999999,9.6519999999999995E-2,2.6239999999999999E-2,1.5659123839717897,1.6506759144223917,1.6506759144223917,17.75,0.91491657704589113,9.8618290916195992,8.862914313677198,null,91.491657704589116,0.78307709311889906,0.81568695849116513,0.42877517789650432,0.38534410059466079,0.86759882130349264]
[null,null,null,null,null,null,72,24,1,3.6,3.6,0.83333333333333326,0.22308761703766983,1.5217200042169527,4.3608600021084767,2.8391399978915235,0,3.6267022643538724,0.65764846571347535,0.1,0.80332580077430005,0.43928272703294807,1.9296931426950357E-4,1.9296931426950357E-4,1.5098564461868422,2.2796664880919609E-2,2.2796664880919609E-2,1.7129695214130281,0.21713557901545841,4.0046299664516137E-2,6.846720000000002E-2,0,0.33228700107472015,3.1966708828059742,0.31677984672236531,1.6128E-2,0.34290127432968698,0.15897600000000001,8.3999999999999993E-4,2.5399999999999999E-2,0.10515599999999999,9.6519999999999995E-2,2.6239999999999999E-2,1.6014213911158151,1.6906860564145552,1.6906860564145552,18,0.91413777805553975,10.055856704718563,9.0933571495828005,null,91.413777805553977,0.80332580077430005,0.83416427540440719,0.43721116107472013,0.395363354329687,0.88736025564025511]
[null,null,null,null,null,null,73,24,1,3.65,3.65,0.84490740740740733,0.22329357127751573,1.5226158764384543,4.4113079382192275,2.8886920617807728,0,3.6763700292904691,0.67578482961326025,0.1,0.823925438770715,0.43954134306706982,1.9319659226520359E-4,1.9319659226520359E-4,1.5310373188968562,2.344075271854874E-2,2.344075271854874E-2,1.7372300251809623,0.22332964386887824,4.0602498270967749E-2,6.846720000000002E-2,0,0.3393721942986847,3.2400198196731695,0.32542958138812367,1.6351999999999998E-2,0.3523301783330951,0.16118399999999999,8.3999999999999993E-4,2.5399999999999999E-2,0.10515599999999999,9.6519999999999995E-2,2.6239999999999999E-2,1.6373897531412298,1.7313420605975547,1.7313420605975547,18.25,0.91335206337257513,10.252333588869748,9.3269806616611888,null,91.335206337257517,0.823925438770715,0.8528863726317798,0.4457536342986847,0.40552089833309513,0.90741662182683969]
[null,null,null,null,null,null,74,24,1,3.7,3.7,0.8564814814814814,0.22349955398087773,1.5235110037758275,4.4617555018879136,2.9382444981120863,0,3.7260466737395417,0.69417119074427514,0.1,0.84487918440196952,0.4397997440716655,1.9342381488550247E-4,1.9342381488550247E-4,1.5522350147578616,2.4094335410403393E-2,2.4094335410403393E-2,1.7615161169726508,0.22961748824622599,4.1158696877419375E-2,6.846720000000002E-2,0,0.34656449383387561,3.2833648570530651,0.33419502832046394,1.6576E-2,0.36189792102947982,0.16339199999999998,8.3999999999999993E-4,2.5399999999999999E-2,0.10515599999999999,9.6519999999999995E-2,2.6239999999999999E-2,1.6738176041883843,1.7726497545622693,1.7726497545622693,18.5,0.91255954322580135,10.451273918179139,9.5637974636780356,null,91.255954322580138,0.84487918440196952,0.87185441486335535,0.45440321383387561,0.41581728102947979,0.92777057016029973]
[null,null,null,null,null,null,75,24,1,3.75,3.75,0.86805555555555547,0.22370556515365686,1.5244053860746436,4.512202693037322,2.987797306962678,0,3.7757318471731787,0.71280754908788924,0.1,0.86619028528571607,0.44005793000215548,1.9365098175778197E-4,1.9365098175778197E-4,1.573449372605372,2.475742928152239E-2,2.475742928152239E-2,1.7858276267014086,0.23599934310945894,4.1714895483870973E-2,6.846720000000002E-2,0,0.35386452374751215,3.3267056782149815,0.34307609075350182,1.6799999999999999E-2,0.3716050614374623,0.16560000000000002,8.3999999999999993E-4,2.5399999999999999E-2,0.10515599999999999,9.6519999999999995E-2,2.6239999999999999E-2,1.7107050784347209,1.8146150890683348,1.8146150890683348,18.75,0.91176031833277837,10.652692046192779,9.8038204130616329,null,91.176031833277833,0.86619028528571607,0.89106958518497437,0.46316052374751215,0.42625306143746233,0.94842480378261873]
[null,null,null,null,null,null,76,24,1,3.8,3.8,0.87962962962962954,0.22391160480175581,1.5252990231804315,4.5626495115902159,3.0373504884097842,0,3.8254252172156753,0.73169390462547979,0.1,0.88786206070951124,0.44031590081394772,1.9387809250959826E-4,1.9387809250959826E-4,1.5946802386601193,2.5430050635730953E-2,2.5430050635730953E-2,1.8101643925807072,0.24247543948436395,4.2271094090322578E-2,6.846720000000002E-2,0,0.36127291601036027,3.3700419825786319,0.35207267189461794,1.7023999999999997E-2,0.38145216926238074,0.16780800000000001,8.3999999999999993E-4,2.5399999999999999E-2,0.10515599999999999,9.6519999999999995E-2,2.6239999999999999E-2,1.748052310094784,1.8572441403680524,1.8572441403680524,19,0.91095448047359917,10.856602508238286,10.047062613034758,null,91.095448047359923,0.88786206070951124,0.91053308527274091,0.47202619601036028,0.43682880926238077,0.96938207965854117]
[null,null,null,null,null,null,77,24,1,3.85,3.85,0.89120370370370361,0.2241176729310789,1.5261919149386776,4.6130959574693389,3.0869040425306613,0,3.8751264684870201,0.75083025733843423,0.1,0.90989790301557172,0.44057365646243796,1.941051467686823E-4,1.941051467686823E-4,1.6159274660585652,2.6112215755624557E-2,2.6112215755624557E-2,1.8345262605966315,0.24904600846058081,4.2827292696774204E-2,6.846720000000002E-2,0,0.36879031060023632,3.4133734846849131,0.36118467492445083,1.7247999999999999E-2,0.3914398249911053,0.170016,8.3999999999999993E-4,2.5399999999999999E-2,0.10515599999999999,9.6519999999999995E-2,2.6239999999999999E-2,1.78585943342024,1.9005431125948768,1.9005431125948768,19.25,0.9101421130191627,11.063020023805436,10.293537414795422,null,91.014211301916276,0.90989790301557172,0.93024613559134162,0.48100087060023633,0.44754510499110528,0.99064520957930513]
[null,null,null,null,null,null,78,24,1,3.9,3.9,0.90277777777777768,0.22432376954753194,1.527084061194824,4.6635420305974122,3.136457969402588,0,3.9248353015334208,0.77021660720814689,0.1,0.93230127902533622,0.44083119690300931,1.9433214416293977E-4,1.9433214416293977E-4,1.6371909144187353,2.6803940902552545E-2,2.6803940902552545E-2,1.8589130840200263,0.25571128119162256,4.3383491303225816E-2,6.846720000000002E-2,0,0.3764173556072366,3.4566999132441469,0.37041200299688493,1.7471999999999998E-2,0.4015686199890004,0.17222399999999999,8.3999999999999993E-4,2.5399999999999999E-2,0.10515599999999999,9.6519999999999995E-2,2.6239999999999999E-2,1.82412658269988,1.9445183402183224,1.9445183402183224,19.5,0.90932329141795376,11.271959498966442,10.543258419747009,null,90.932329141795378,0.93230127902533622,0.95020997559623699,0.49008519560723662,0.45840253998900038,1.0122170611929862]
[null,null,null,null,null,null,79,24,1,3.95,3.95,0.91435185185185175,0.22452989465702261,1.5279754617942722,4.7139877308971361,3.1860122691028643,0,3.9745514318373654,0.78985295421602264,0.1,0.95507573150503422,0.44108852209103294,1.9455908432045165E-4,1.9455908432045165E-4,1.6584704494383407,2.7505242316602115E-2,2.7505242316602115E-2,1.8833247229549219,0.26247148889489924,4.3939689909677435E-2,6.846720000000002E-2,0,0.3841547073407337,3.5000210102551121,0.37975455923904372,1.7696E-2,0.41183915659907661,0.17443200000000003,8.3999999999999993E-4,2.5399999999999999E-2,0.10515599999999999,9.6519999999999995E-2,2.6239999999999999E-2,1.8628538922596429,1.9891762905672612,1.9891762905672612,19.75,0.90849808364494589,11.483436028836875,10.796239481778761,null,90.849808364494592,0.95507573150503422,0.97042586393981034,0.49927982734073373,0.46940171659907659,1.034100559062227]
[null,null,null,null,null,null,80,24,1,4,4,0.92592592592592582,0.22473604826546004,1.5288661165823798,4.76443305829119,3.23556694170881,0,4.0242745889003988,0.8097392983434738,0.1,0.97822488067346824,0.44134563198186738,1.9478596686947391E-4,1.9478596686947391E-4,1.6797659425224047,2.8216136216581828E-2,2.8216136216581828E-2,1.9077610439201167,0.26932686285173879,4.449588851612904E-2,6.846720000000002E-2,0,0.3920030304381662,3.5433365301887854,0.38921224675127936,1.7919999999999998E-2,0.42225204824335494,0.17663999999999999,8.3999999999999993E-4,2.5399999999999999E-2,0.10515599999999999,9.6519999999999995E-2,2.6239999999999999E-2,1.9020414964626207,2.0345235664235775,2.0345235664235775,20,0.90766655061587975,11.697464900077822,11.052494709597163,null,90.766655061587969,0.97822488067346824,0.99089507868152116,0.50858543043816618,0.48054324824335493,1.0562986857501091]
[null,null,null,null,null,null,81,24,1,4.05,4.05,0.93749999999999989,0.22494223037875502,1.5297560254044615,4.8148780127022306,3.2851219872977691,0,4.0740045153924944,0.82987563957192167,0.1,1.0017524257532961,0.44160252653085896,1.95012791438438E-4,1.95012791438438E-4,1.7010772704379276,2.8936638800005503E-2,2.8936638800005503E-2,1.9322219194611363,0.27627763440740977,4.5052087122580645E-2,6.846720000000002E-2,0,0.39996299797566193,3.5866462392313458,0.39878496860716306,1.8143999999999997E-2,0.43280791952648262,0.17884799999999998,8.3999999999999993E-4,2.5399999999999999E-2,0.10515599999999999,9.6519999999999995E-2,2.6239999999999999E-2,1.941689529709075,2.0805669086882812,2.0805669086882812,20.25,0.90682874656985157,11.914061593440223,11.312038469109099,null,90.682874656985163,1.0017524257532961,1.0116189175021444,0.51800267797566191,0.49182775952648261,1.0788144829349851]
[null,null,null,null,null,null,82,24,1,4.0999999999999996,4.0999999999999996,0.94907407407407396,0.22514844100282008,1.5306451881057896,4.8653225940528948,3.3346774059471049,0,4.1237409663624538,0.85026197788279723,0.1,1.0256621465671241,0.44185920569334153,1.9523955765595071E-4,1.9523955765595071E-4,1.7224043149933161,2.9666766243075945E-2,2.9666766243075945E-2,1.9567072277900242,0.28332403497114339,4.560828572903227E-2,6.846720000000002E-2,0,0.40803529158052815,3.6299499145814975,0.40847262785347688,1.8367999999999995E-2,0.44350740634163482,0.18105599999999999,8.3999999999999993E-4,2.5399999999999999E-2,0.10515599999999999,9.6519999999999995E-2,2.6239999999999999E-2,1.9817981264364497,2.1273131991222227,2.1273131991222227,20.5,0.90598471942286329,12.133241786352148,11.574885385857602,null,90.598471942286324,1.0256621465671241,1.0325986979221629,0.52753225158052819,0.50325588634163487,1.1016510525550987]
[null,null,null,null,null,null,83,24,1,4.1500000000000004,4.1500000000000004,0.96064814814814814,0.22535468014356924,1.5315336045315939,4.9157668022657974,3.3842331977342033,0,4.1734837085042988,0.87089831325753986,0.1,1.0499579051797754,0.44211566942463681,1.9546626515079475E-4,1.9546626515079475E-4,1.7437469627405404,3.0406534700668595E-2,3.0406534700668595E-2,1.9812168524506693,0.2904662960161557,4.6164484335483882E-2,6.846720000000002E-2,0,0.41622060154564494,3.6732473437976183,0.41827512751020401,1.8592000000000001E-2,0.4543511559787341,0.18326400000000001,8.3999999999999993E-4,2.5399999999999999E-2,0.10515599999999999,9.6519999999999995E-2,2.6239999999999999E-2,2.0223674211193829,2.1747694631636216,2.1747694631636216,20.75,0.90513451109472998,12.355021355549834,11.841050347510885,null,90.513451109472996,1.0499579051797754,1.0538357575243791,0.53717484154564499,0.51482827597873415,1.1248115579838462]
[null,null,null,null,null,null,84,24,1,4.2,4.2,0.97222222222222221,0.22556094780691829,1.5324212745270605,4.9662106372635302,3.4337893627364702,0,4.2232325194750917,0.89178464567759663,0.1,1.0746436475881551,0.44237191768005391,1.9569291355192838E-4,1.9569291355192838E-4,1.7651051046981674,3.1155960306315286E-2,3.1155960306315286E-2,2.005750682007589,0.2977046490796692,4.6720682941935501E-2,6.846720000000002E-2,0,0.4245196269457992,3.7165383241906738,0.42819237057051868,1.8815999999999999E-2,0.46533982723502565,0.18547200000000003,8.3999999999999993E-4,2.5399999999999999E-2,0.10515599999999999,9.6519999999999995E-2,2.6239999999999999E-2,2.06339754826972,2.2229428728247376,2.2229428728247376,21,0.90427815781151477,12.579416379753383,12.110548506405589,null,90.42781578115148,1.0746436475881551,1.075331454180825,0.54693114694579925,0.52654558723502565,1.1482992252365825]
[null,null,null,null,null,null,85,24,1,4.25,4.25,0.98379629629629628,0.22576724399878459,1.533308197937334,5.016654098968667,3.483345901031333,0,4.2729871872600418,0.91292097512442416,0.1,1.0997234054601854,0.44262795041488989,1.9591950248848622E-4,1.9591950248848622E-4,1.7864786360935831,3.1915059172187892E-2,3.1915059172187892E-2,2.0303086097562812,0.3050393257629358,4.7276881548387106E-2,6.846720000000002E-2,0,0.4329330757559986,3.7598226622592188,0.43822426000077797,1.9039999999999998E-2,0.47647409052804818,0.18768000000000001,8.3999999999999993E-4,2.5399999999999999E-2,0.10515599999999999,9.6519999999999995E-2,2.6239999999999999E-2,2.1048886424365247,2.2718407496700683,2.2718407496700683,21.25,0.90341569038545866,12.806443142387968,12.383395282145107,null,90.34156903854587,1.0997234054601854,1.0970871662840469,0.5568018757559986,0.53840849052804818,1.1721173442098829]
[null,null,null,null,null,null,86,24,1,4.3,4.3,0.99537037037037035,0.22597356872508709,1.5341943746075142,5.0670971873037569,3.5329028126962427,0,4.3227475095811201,0.93430730157948882,0.1,1.1252012979243298,0.44288376758442893,1.9614603158977847E-4,1.9614603158977847E-4,1.8078674561228794,3.2683847389082116E-2,3.2683847389082116E-2,2.0548905334534164,0.31247055773125854,4.7833080154838711E-2,6.846720000000002E-2,0,0.4414616649718025,3.8031001731631142,0.44837069874051261,1.9263999999999996E-2,0.48775462801103336,0.189888,8.3999999999999993E-4,2.5399999999999999E-2,0.10515599999999999,9.6519999999999995E-2,2.6239999999999999E-2,2.1468408382060988,2.3214705678785492,2.3214705678785492,21.5,0.90254713447418833,13.036118134351458,12.659606364253767,null,90.254713447418837,1.1252012979243298,1.1191042929828359,0.56678774497180251,0.55041766801103331,1.1962692699542194]
[null,null,null,null,null,null,87,24,1,4.3499999999999996,4.3499999999999996,1.0069444444444444,0.2261799219917465,1.5350798043826603,5.1175399021913295,3.5824600978086694,0,4.3725132933457491,0.95594362502426444,0.1,1.1510815334112885,0.44313936914394353,1.9637250048529226E-4,1.9637250048529226E-4,1.8292714677270037,3.3462341026401062E-2,3.3462341026401062E-2,2.0794963550653098,0.31999857671401322,4.838927876129033E-2,6.846720000000002E-2,0,0.45010612073170958,3.8463706802329103,0.4586315897024168,1.9487999999999998E-2,0.49918213369077613,0.19209599999999999,8.3999999999999993E-4,2.5399999999999999E-2,0.10515599999999999,9.6519999999999995E-2,2.6239999999999999E-2,2.1892542702019844,2.371839957392321,2.371839957392321,21.75,0.90167251082082345,13.268458056829319,12.93919771488785,null,90.167251082082345,1.1510815334112885,1.1413842544224857,0.57688948073170954,0.56257381369077608,1.2207584239810325]
[null,null,null,null,null,null,88,24,1,4.4000000000000004,4.4000000000000004,1.0185185185185184,0.22638630380468502,1.5359644871077867,5.1679822435538938,3.6320177564461069,0,4.4222843541324535,0.9778299454402346,0.1,1.1773684115495164,0.44339475504869308,1.9659890880469052E-4,1.9659890880469052E-4,1.8506905773829125,3.4250556132138982E-2,3.4250556132138982E-2,2.1041259805332548,0.32762361450467226,4.8945477367741942E-2,6.846720000000002E-2,0,0.45886717844164659,3.8896340145121187,0.46900683577233948,1.9712E-2,0.51075731354801512,0.19430400000000003,8.3999999999999993E-4,2.5399999999999999E-2,0.10515599999999999,9.6519999999999995E-2,2.6239999999999999E-2,2.2321290730849883,2.4229567071547446,2.4229567071547446,22,0.90079183547645825,13.503479824157871,13.222185571604347,null,90.079183547645826,1.1773684115495164,1.1639284919896618,0.58710781844164661,0.57487763354801513,1.2455882956052282]
[null,null,null,null,null,null,89,24,1,4.45,4.45,1.0300925925925926,0.22659271416982665,1.5368484226278663,5.2184242113139332,3.6815757886860672,0,4.4720605157106066,0.99996626280889078,0.1,1.2040663251162553,0.44364992525392521,1.9682525617781345E-4,1.9682525617781345E-4,1.8721246949085653,3.5048508732864886E-2,3.5048508732864886E-2,2.1287793195544,0.33534590296082456,4.9501675974193568E-2,6.846720000000002E-2,0,0.46774558290159274,3.9328900143298338,0.47949633980927492,1.9935999999999999E-2,0.52248088566036455,0.19651200000000002,8.3999999999999993E-4,2.5399999999999999E-2,0.10515599999999999,9.6519999999999995E-2,2.6239999999999999E-2,2.2754653815531842,2.4748287684404042,2.4748287684404042,22.25,0.89990512000635747,13.741200566736634,13.508586450188385,null,89.990512000635746,1.2040663251162553,1.1867384685619573,0.59744350290159276,0.58732984566036461,1.2707624433241489]
[null,null,null,null,null,null,90,24,1,4.5,4.5,1.0416666666666665,0.22679915309309684,1.5377316107878281,5.2688658053939141,3.7311341946060859,0,4.5218416095916805,1.0223525771117339,0.1,1.2311797620458611,0.44390487971487469,1.9705154223467736E-4,1.9705154223467736E-4,1.8935737332807017,3.5856214833706143E-2,3.5856214833706143E-2,2.1534562853770041,0.34316567400419962,5.0057874580645173E-2,6.846720000000002E-2,0,0.47674208843439048,3.9761385249013843,0.49010000464535364,2.0159999999999997E-2,0.53435358032783964,0.19871999999999998,8.3999999999999993E-4,2.5399999999999999E-2,0.10515599999999999,9.6519999999999995E-2,2.6239999999999999E-2,2.3192633303419328,2.527464258279982,2.527464258279982,22.5,0.89901237168109005,13.981637633990982,13.798417147540311,null,89.901237168109006,1.2311797620458611,1.2098156687622301,0.6078972884343905,0.59993118032783965,1.2962844962341209]
[null,null,null,null,null,null,91,24,1,4.55,4.55,1.0532407407407407,0.22700562058042292,1.5386140514325592,5.3193070257162791,3.7806929742837201,0,4.5716274746096142,1.044988888330274,0.1,1.2587133074972561,0.44415961838676443,1.9727776660547622E-4,1.9727776660547622E-4,1.9150376084644465,3.6673690418332267E-2,3.6673690418332267E-2,2.1781567946089653,0.35108315962068892,5.0614073187096778E-2,6.846720000000002E-2,0,0.48585745901677968,4.0193793979548973,0.50081773308583244,2.0383999999999996E-2,0.5463761402010171,0.200928,8.3999999999999993E-4,2.5399999999999999E-2,0.10515599999999999,9.6519999999999995E-2,2.6239999999999999E-2,2.3635230542238919,2.5808714629829623,2.5808714629829623,22.75,0.89811359365371635,14.224808597385934,14.091694744623393,null,89.811359365371629,1.2587133074972561,1.2331615992177969,0.61846993901677971,0.61268238020101706,1.3221581554857063]
[null,null,null,null,null,null,92,24,1,4.5999999999999996,4.5999999999999996,1.0648148148148147,0.22721211663773366,1.5394957444069031,5.3697478722034511,3.8302521277965482,0,4.6214179565281235,1.0678751964460289,0.1,1.2866716459824077,0.44441414122480444,1.9750392892058043E-4,1.9750392892058043E-4,1.9365162392538413,3.7500951448938412E-2,3.7500951448938412E-2,2.2028807670386423,0.35909859186036802,5.1170271793548397E-2,6.846720000000002E-2,0,0.49509246841270255,4.0626124913818478,0.51164942790908663,2.0607999999999998E-2,0.55854932041187932,0.20313599999999998,8.3999999999999993E-4,2.5399999999999999E-2,0.10515599999999999,9.6519999999999995E-2,2.6239999999999999E-2,2.4082446880090327,2.6350588417612464,2.6350588417612464,23,0.89720878512404434,14.470731253492158,14.388436609473224,null,89.72087851240444,1.2866716459824077,1.2567777888245819,0.62916222841270253,0.62558420041187934,1.3483871957788387]
[null,null,null,null,null,null,93,24,1,4.6500000000000004,4.6500000000000004,1.0763888888888888,0.22741864127095951,1.5403766895556603,5.4201883447778307,3.87981165522217,0,4.6712129076729676,1.0910115014405271,0.1,1.315059563557833,0.44466844818419254,1.9773002881053793E-4,1.9773002881053793E-4,1.9580095471225112,3.8338013866229016E-2,3.8338013866229016E-2,2.2276281254670587,0.36721220283751921,5.1726470400000009E-2,6.846720000000002E-2,0,0.50444790030892583,4.1058376689097997,0.52259499186659841,2.0832E-2,0.57087388870737987,0.20534400000000003,8.3999999999999993E-4,2.5399999999999999E-2,0.10515599999999999,9.6519999999999995E-2,2.6239999999999999E-2,2.453428366544645,2.6900350304568863,2.6900350304568863,23.25,0.89629794149088682,14.719423627105295,14.688660400269736,null,89.629794149088681,1.315059563557833,1.2806657890163058,0.63997494030892588,0.63863740870737984,1.3749754668990533]
[null,null,null,null,null,null,94,24,1,4.7,4.7,1.0879629629629628,0.22762519448603266,1.5412568867235887,5.4706284433617949,3.9293715566382059,0,4.7210121865873296,1.1143978032953041,0.1,1.343881950081155,0.44492253922011427,1.9795606590607414E-4,1.9795606590607414E-4,1.9795174560837152,3.9184893589401436E-2,3.9184893589401436E-2,2.252398795550651,0.37542422473065373,5.2282669006451635E-2,6.846720000000002E-2,0,0.51392454845302404,4.1490547997957385,0.53365432768294974,2.1055999999999998E-2,0.58335062558578754,0.20755200000000001,8.3999999999999993E-4,2.5399999999999999E-2,0.10515599999999999,9.6519999999999995E-2,2.6239999999999999E-2,2.4990742247153599,2.7458088453772325,2.7458088453772325,23.5,0.89538105449316863,14.970903974419555,14.992384068473115,null,89.538105449316859,1.343881950081155,1.3048271740388115,0.65090886845302409,0.65184278558578757,1.4019268952960775]
[null,null,null,null,null,null,95,24,1,4.75,4.75,1.099537037037037,0.22783177628888676,1.5421363357554025,5.5210681678777016,3.9789318321222988,0,4.770815657708658,1.1380341019919047,0.1,1.3731438015348765,0.44517641428774241,1.9818203983809165E-4,1.9818203983809165E-4,2.0010398925591035,4.004160651612948E-2,4.004160651612948E-2,2.2771927056538002,0.38373488978253273,5.283886761290324E-2,6.846720000000002E-2,0,0.5235232167937719,4.1922637585384841,0.54482733805581163,2.1279999999999997E-2,0.59598032443584548,0.20976,8.3999999999999993E-4,2.5399999999999999E-2,0.10515599999999999,9.6519999999999995E-2,2.6239999999999999E-2,2.5451823974431527,2.8023892872409562,2.8023892872409562,23.75,0.89445811234066341,15.225190786256755,15.299625862024445,null,89.44581123406634,1.3731438015348765,1.3292635412296174,0.66196481679377195,0.66520112443584545,1.4292454857060797]
[null,null,null,null,null,null,96,24,1,4.8,4.8,{"$f":"Vout*K105/(Vin*Efficiency)","v":1.1111111111111109},0.22803838668545734,{"$f":"(Vin-(Rdson1+Rdcr)*K105-Vout)*M105/(Fsw*Lf)","v":1.5430150364957744},5.5715075182478868,4.0284924817521128,{"$f":"IF(MIN(Vin, -P105/(Coss_Q1+Coss_Q2)*0.00000002)<0, 0, MIN(Vin, -P105/(Coss_Q1+Coss_Q2)*0.00000002))","v":0},4.8206231910654118,{"$f":"R105^2*Rdcr","v":1.1619203975118839},0.1,{"$f":"(T105+S105*(1+Ltc*(Ta-25)))/(1-S105*Ltc*ThetaCa)","v":1.4028502224195736},0.44543007334223783,1.984079502376714E-4,1.984079502376714E-4,2.0225767852555583,4.0908168522547091E-2,4.0908168522547091E-2,2.3020097867104528,{"$f":"Rdson1*AB105^2","v":0.39214443030019208},5.3395066219354838E-2,6.846720000000002E-2,0,{"$f":"(AF105+AE105+AD105+AC105*(1+RdsonTopTc*Ta-RdsonTopTc*25))/(1-AC105*RdsonTopTc*ThetaJA_Q1)","v":0.53324471962400044},4.2354644246088258,{"$f":"Rdson2*AH105^2","v":0.55611392565593609},2.1503999999999999E-2,{"$f":"(AJ105+AI105*(1+RdsonBotTc*Ta-RdsonBotTc*25))/(1-AI105*RdsonBotTc*ThetaJA_Q2)","v":0.60876379167880379},0.21196799999999999,8.3999999999999993E-4,2.5399999999999999E-2,0.10515599999999999,9.6519999999999995E-2,2.6239999999999999E-2,2.5917530196873675,2.8597855452385215,2.8597855452385215,24,0.8935290998350699,15.482302791352012,15.610404328612487,null,89.35290998350699,1.4028502224195736,1.3539765113028042,0.6731435996240005,0.67871323167880382,1.4569353228189479]
[null,null,null,null,null,null,97,24,1,4.8499999999999996,4.8499999999999996,1.1226851851851851,0.22824502568168137,1.5438929887893322,5.621946494394666,4.0780535056053333,0,4.8704346619923022,1.1860566898368037,0.1,1.4330064282188106,0.44568351633874842,1.9863379673607144E-4,1.9863379673607144E-4,2.0441280650495419,4.1784595463231843E-2,4.1784595463231843E-2,2.3268499720941667,0.40065307865496219,5.3951264825806464E-2,6.846720000000002E-2,0,0.54308988172595618,4.2786566821961127,0.56751399312714479,2.1727999999999997E-2,0.62170184691336672,0.21417599999999998,8.3999999999999993E-4,2.5399999999999999E-2,0.10515599999999999,9.6519999999999995E-2,2.6239999999999999E-2,2.6387862264447173,2.9180070012107753,2.9180070012107753,24.25,0.89259399848208476,15.742258959696992,15.924738319007433,null,89.259399848208474,1.4330064282188106,1.3789677286393227,0.68444604172595613,0.69237992691336669,1.4850005729919646]
[null,null,null,null,null,null,98,24,1,4.9000000000000004,4.9000000000000004,1.1342592592592591,0.22845169328349757,1.5447701924806621,5.6723850962403315,4.1276149037596692,0,4.9202499508627335,1.2104429789482367,0.1,1.4636177479381904,0.44593674323241017,1.9885957896472852E-4,1.9885957896472852E-4,2.065693664878423,4.2670903171188511E-2,4.2670903171188511E-2,2.3517131974960113,0.40926106728249151,5.4507463432258076E-2,6.846720000000002E-2,0,0.5530595385192224,4.3218404199701563,0.57902744308632237,2.1951999999999999E-2,0.63479532306361708,0.21638400000000002,8.3999999999999993E-4,2.5399999999999999E-2,0.10515599999999999,9.6519999999999995E-2,2.6239999999999999E-2,2.686282152749309,2.9770632339495648,2.9770632339495648,24.5,0.8916527865950673,16.005078505942116,16.242646990463193,null,89.165278659506725,1.4636177479381904,1.4042388615828396,0.69587297851922236,0.70620204306361711,1.5134454860113744]
[null,null,null,null,null,null,99,24,1,4.95,4.95,1.1458333333333333,0.22865838949684625,1.5456466474143069,5.7228233237071535,4.1771766762928468,0,4.970068942837238,1.2350792648277631,0.1,1.4946896267210075,0.44618975397834637,1.9908529655525726E-4,1.9908529655525726E-4,2.087273519638301,4.3567107457832606E-2,4.3567107457832606E-2,2.3765994008097584,0.41796862868276841,5.5063662038709695E-2,6.846720000000002E-2,0,0.56315453621125433,4.3650155308573595,0.59065417812340459,2.2175999999999998E-2,0.64804506652995697,0.21859200000000001,8.3999999999999993E-4,2.5399999999999999E-2,0.10515599999999999,9.6519999999999995E-2,2.6239999999999999E-2,2.7342409336726461,3.0369640236243232,3.0369640236243232,24.75,0.89070543939084845,16.270780892858852,16.564149810189011,null,89.070543939084843,1.4946896267210075,1.4297916027412114,0.70742525621125441,0.72018042652995695,1.5422743969033157]
[null,null,null,null,null,null,100,24,1,5,5,1.1574074074074074,0.2288651143276694,1.5465223534347661,5.7732611767173827,4.2267388232826173,0,5.0198915276268128,1.2599655474569729,0.1,1.526227628543112,0.44644254853166793,1.9931094913945067E-4,1.9931094913945067E-4,2.1088675660878753,4.4473224112973997E-2,4.4473224112973997E-2,2.4015085220238741,0.42677599542014361,5.56198606451613E-2,6.846720000000002E-2,0,0.57337573195057734,4.40818191183011,0.60239410080137112,2.2399999999999996E-2,0.66145193734313201,0.2208,8.3999999999999993E-4,2.5399999999999999E-2,0.10515599999999999,9.6519999999999995E-2,2.6239999999999999E-2,2.7826627043236494,3.097719356338815,3.097719356338815,25,0.8897519290781879,16.539385834863278,16.889266558892036,null,88.975192907818794,1.526227628543112,1.4556276692937096,0.71910373195057731,0.73431593734313205,1.571491727795703]

{"sheet":"Efficiency Plot Management","index":9,"n_rows":3,"n_cols":1,"rows_kept":3,"cut":false,"hidden":true,"merged":[]}
[]
[{"$f":"\"EFF_Ch1\"","v":"EFF_Ch1"}]
[{"$f":"\"EFF_Ch2\"","v":"EFF_Ch2"}]

{"sheet":"Standard Value Calculator","index":10,"n_rows":159,"n_cols":13,"rows_kept":159,"cut":false,"hidden":true,"merged":[]}
[]
["Capacitors","Css","Cc1ea","Cc2ea","Cout","Cin","Css"]
["Inputs",{"$f":"Css","v":1.4000000000000001E-8},{"$f":"Cc1ea","v":5.5578441952100817E-11},{"$f":"Cc2ea","v":8.4896318264031821E-13},{"$f":"Cout","v":9.3999999999999994E-5},{"$f":"Cin","v":2.1999999999999999E-5},{"$f":"Css","v":1.4000000000000001E-8},null,null,"Resistors","inputs","Standard Result"]
["Standard Result",{"$f":"SUM(B6:B158)/1000000000000","v":1.4999999999999999E-8},{"$f":"IF(C3=\"OPEN\",\"OPEN\",SUM(C6:C158)/1000000000000)","v":5.6E-11},{"$f":"SUM(D6:D158)/1000000000000","v":8.1999999999999994E-13},{"$f":"SUM(E6:E158)/1000000000000","v":1E-4},{"$f":"SUM(F6:F158)/1000000000000","v":2.1999999999999999E-5},{"$f":"SUM(G6:G158)/1000000000000","v":1.4999999999999999E-8},null,null,"Rt",{"$f":"Rfadj","v":100},{"$f":"IF(K4>(INT(0.5+100*POWER(10,IF(96*(LOG(K4)-INT(LOG(K4)))-ROUND(96*(LOG(K4)-INT(LOG(K4))),0)<0,ROUND(96*(LOG(K4)-INT(LOG(K4))),0)-1,ROUND(96*(LOG(K4)-INT(LOG(K4))),0))/96))*POWER(10,INT(LOG(K4))-2)+INT(0.5+100*POWER(10,(IF(96*(LOG(K4)-INT(LOG(K4)))-ROUND(96*(LOG(K4)-INT(LOG(K4))),0)<0,ROUND(96*(LOG(K4)-INT(LOG(K4))),0)-1,ROUND(96*(LOG(K4)-INT(LOG(K4))),0))+1)/96))*POWER(10,INT(LOG(K4))-2))/2,INT(0.5+100*POWER(10,(IF(96*(LOG(K4)-INT(LOG(K4)))-ROUND(96*(LOG(K4)-INT(LOG(K4))),0)<0,ROUND(96*(LOG(K4)-INT(LOG(K4))),0)-1,ROUND(96*(LOG(K4)-INT(LOG(K4))),0))+1)/96))*POWER(10,INT(LOG(K4))-2),INT(0.5+100*POWER(10,IF(96*(LOG(K4)-INT(LOG(K4)))-ROUND(96*(LOG(K4)-INT(LOG(K4))),0)<0,ROUND(96*(LOG(K4)-INT(LOG(K4))),0)-1,ROUND(96*(LOG(K4)-INT(LOG(K4))),0))/96))*POWER(10,INT(LOG(K4))-2))","v":100},"Ω"]
["(pF)"]
[0.47,{"$f":"IF(IF((B$3*10^12-$A7)*(B$3*10^12-$A6)*-1<0,0,1)*IF(ABS(B$3*10^12-$A7)>(B$3*10^12-$A6),$A6,$A7)=B7,0,IF((B$3*10^12-$A7)*(B$3*10^12-$A6)*-1<0,0,1)*IF(ABS(B$3*10^12-$A7)>(B$3*10^12-$A6),$A6,$A7))","v":0},0,0,0,0,0]
[0.56000000000000005,{"$f":"IF(IF((B$3*10^12-$A8)*(B$3*10^12-$A7)*-1<0,0,1)*IF(ABS(B$3*10^12-$A8)>(B$3*10^12-$A7),$A7,$A8)=B8,0,IF((B$3*10^12-$A8)*(B$3*10^12-$A7)*-1<0,0,1)*IF(ABS(B$3*10^12-$A8)>(B$3*10^12-$A7),$A7,$A8))","v":0},{"$f":"IF(IF((C$3*10^12-$A8)*(C$3*10^12-$A7)*-1<0,0,1)*IF(ABS(C$3*10^12-$A8)>(C$3*10^12-$A7),$A7,$A8)=C8,0,IF((C$3*10^12-$A8)*(C$3*10^12-$A7)*-1<0,0,1)*IF(ABS(C$3*10^12-$A8)>(C$3*10^12-$A7),$A7,$A8))","v":0},{"$f":"IF(IF((D$3*10^12-$A8)*(D$3*10^12-$A7)*-1<0,0,1)*IF(ABS(D$3*10^12-$A8)>(D$3*10^12-$A7),$A7,$A8)=D8,0,IF((D$3*10^12-$A8)*(D$3*10^12-$A7)*-1<0,0,1)*IF(ABS(D$3*10^12-$A8)>(D$3*10^12-$A7),$A7,$A8))","v":0},{"$f":"IF(IF((E$3*10^12-$A8)*(E$3*10^12-$A7)*-1<0,0,1)*IF(ABS(E$3*10^12-$A8)>(E$3*10^12-$A7),$A7,$A8)=E8,0,IF((E$3*10^12-$A8)*(E$3*10^12-$A7)*-1<0,0,1)*IF(ABS(E$3*10^12-$A8)>(E$3*10^12-$A7),$A7,$A8))","v":0},{"$f":"IF(IF((F$3*10^12-$A8)*(F$3*10^12-$A7)*-1<0,0,1)*IF(ABS(F$3*10^12-$A8)>(F$3*10^12-$A7),$A7,$A8)=F8,0,IF((F$3*10^12-$A8)*(F$3*10^12-$A7)*-1<0,0,1)*IF(ABS(F$3*10^12-$A8)>(F$3*10^12-$A7),$A7,$A8))","v":0},{"$f":"IF(IF((G$3*10^12-$A8)*(G$3*10^12-$A7)*-1<0,0,1)*IF(ABS(G$3*10^12-$A8)>(G$3*10^12-$A7),$A7,$A8)=G8,0,IF((G$3*10^12-$A8)*(G$3*10^12-$A7)*-1<0,0,1)*IF(ABS(G$3*10^12-$A8)>(G$3*10^12-$A7),$A7,$A8))","v":0},null,null,"Rent",{"$f":"Rent","v":885221.6748768473},887000,"Ω"]
[0.68,0,0,0,0,0,0,null,null,"Rc1ea",{"$f":"Rcea2","v":0},{"$f":"IF(K8>(INT(0.5+100*POWER(10,IF(96*(LOG(K8)-INT(LOG(K8)))-ROUND(96*(LOG(K8)-INT(LOG(K8))),0)<0,ROUND(96*(LOG(K8)-INT(LOG(K8))),0)-1,ROUND(96*(LOG(K8)-INT(LOG(K8))),0))/96))*POWER(10,INT(LOG(K8))-2)+INT(0.5+100*POWER(10,(IF(96*(LOG(K8)-INT(LOG(K8)))-ROUND(96*(LOG(K8)-INT(LOG(K8))),0)<0,ROUND(96*(LOG(K8)-INT(LOG(K8))),0)-1,ROUND(96*(LOG(K8)-INT(LOG(K8))),0))+1)/96))*POWER(10,INT(LOG(K8))-2))/2,INT(0.5+100*POWER(10,(IF(96*(LOG(K8)-INT(LOG(K8)))-ROUND(96*(LOG(K8)-INT(LOG(K8))),0)<0,ROUND(96*(LOG(K8)-INT(LOG(K8))),0)-1,ROUND(96*(LOG(K8)-INT(LOG(K8))),0))+1)/96))*POWER(10,INT(LOG(K8))-2),INT(0.5+100*POWER(10,IF(96*(LOG(K8)-INT(LOG(K8)))-ROUND(96*(LOG(K8)-INT(LOG(K8))),0)<0,ROUND(96*(LOG(K8)-INT(LOG(K8))),0)-1,ROUND(96*(LOG(K8)-INT(LOG(K8))),0))/96))*POWER(10,INT(LOG(K8))-2))","v":{"$error":"#NUM!"}},"Ω"]
[0.82,0,0,0.82,0,0,0]
[1,0,0,0,0,0,0,null,null,"Rfb1",{"$f":"Rfb1_","v":40000},{"$f":"IF(K10>(INT(0.5+100*POWER(10,IF(96*(LOG(K10)-INT(LOG(K10)))-ROUND(96*(LOG(K10)-INT(LOG(K10))),0)<0,ROUND(96*(LOG(K10)-INT(LOG(K10))),0)-1,ROUND(96*(LOG(K10)-INT(LOG(K10))),0))/96))*POWER(10,INT(LOG(K10))-2)+INT(0.5+100*POWER(10,(IF(96*(LOG(K10)-INT(LOG(K10)))-ROUND(96*(LOG(K10)-INT(LOG(K10))),0)<0,ROUND(96*(LOG(K10)-INT(LOG(K10))),0)-1,ROUND(96*(LOG(K10)-INT(LOG(K10))),0))+1)/96))*POWER(10,INT(LOG(K10))-2))/2,INT(0.5+100*POWER(10,(IF(96*(LOG(K10)-INT(LOG(K10)))-ROUND(96*(LOG(K10)-INT(LOG(K10))),0)<0,ROUND(96*(LOG(K10)-INT(LOG(K10))),0)-1,ROUND(96*(LOG(K10)-INT(LOG(K10))),0))+1)/96))*POWER(10,INT(LOG(K10))-2),INT(0.5+100*POWER(10,IF(96*(LOG(K10)-INT(LOG(K10)))-ROUND(96*(LOG(K10)-INT(LOG(K10))),0)<0,ROUND(96*(LOG(K10)-INT(LOG(K10))),0)-1,ROUND(96*(LOG(K10)-INT(LOG(K10))),0))/96))*POWER(10,INT(LOG(K10))-2))","v":40200},"Ω"]
[1.2,0,0,0,0,0,0,null,null,"Rfb2",{"$f":"Rfb2_","v":10000},{"$f":"IF(K11=\"OPEN\",\"OPEN\",IF(K11>(INT(0.5+100*POWER(10,IF(96*(LOG(K11)-INT(LOG(K11)))-ROUND(96*(LOG(K11)-INT(LOG(K11))),0)<0,ROUND(96*(LOG(K11)-INT(LOG(K11))),0)-1,ROUND(96*(LOG(K11)-INT(LOG(K11))),0))/96))*POWER(10,INT(LOG(K11))-2)+INT(0.5+100*POWER(10,(IF(96*(LOG(K11)-INT(LOG(K11)))-ROUND(96*(LOG(K11)-INT(LOG(K11))),0)<0,ROUND(96*(LOG(K11)-INT(LOG(K11))),0)-1,ROUND(96*(LOG(K11)-INT(LOG(K11))),0))+1)/96))*POWER(10,INT(LOG(K11))-2))/2,INT(0.5+100*POWER(10,(IF(96*(LOG(K11)-INT(LOG(K11)))-ROUND(96*(LOG(K11)-INT(LOG(K11))),0)<0,ROUND(96*(LOG(K11)-INT(LOG(K11))),0)-1,ROUND(96*(LOG(K11)-INT(LOG(K11))),0))+1)/96))*POWER(10,INT(LOG(K11))-2),INT(0.5+100*POWER(10,IF(96*(LOG(K11)-INT(LOG(K11)))-ROUND(96*(LOG(K11)-INT(LOG(K11))),0)<0,ROUND(96*(LOG(K11)-INT(LOG(K11))),0)-1,ROUND(96*(LOG(K11)-INT(LOG(K11))),0))/96))*POWER(10,INT(LOG(K11))-2)))","v":10000},"Ω"]
[1.5,0,0,0,0,0,0,null,null,"Rt1",{"$f":"'Variable Management'!B25*1000","v":99566.987320766464},{"$f":"IF(K12>(INT(0.5+100*POWER(10,IF(96*(LOG(K12)-INT(LOG(K12)))-ROUND(96*(LOG(K12)-INT(LOG(K12))),0)<0,ROUND(96*(LOG(K12)-INT(LOG(K12))),0)-1,ROUND(96*(LOG(K12)-INT(LOG(K12))),0))/96))*POWER(10,INT(LOG(K12))-2)+INT(0.5+100*POWER(10,(IF(96*(LOG(K12)-INT(LOG(K12)))-ROUND(96*(LOG(K12)-INT(LOG(K12))),0)<0,ROUND(96*(LOG(K12)-INT(LOG(K12))),0)-1,ROUND(96*(LOG(K12)-INT(LOG(K12))),0))+1)/96))*POWER(10,INT(LOG(K12))-2))/2,INT(0.5+100*POWER(10,(IF(96*(LOG(K12)-INT(LOG(K12)))-ROUND(96*(LOG(K12)-INT(LOG(K12))),0)<0,ROUND(96*(LOG(K12)-INT(LOG(K12))),0)-1,ROUND(96*(LOG(K12)-INT(LOG(K12))),0))+1)/96))*POWER(10,INT(LOG(K12))-2),INT(0.5+100*POWER(10,IF(96*(LOG(K12)-INT(LOG(K12)))-ROUND(96*(LOG(K12)-INT(LOG(K12))),0)<0,ROUND(96*(LOG(K12)-INT(LOG(K12))),0)-1,ROUND(96*(LOG(K12)-INT(LOG(K12))),0))/96))*POWER(10,INT(LOG(K12))-2))","v":100000},"Ω"]
[1.8,0,0,0,0,0,0]
[2.2000000000000002,{"$f":"IF(IF((B$3*10^12-$A15)*(B$3*10^12-$A14)*-1<0,0,1)*IF(ABS(B$3*10^12-$A15)>(B$3*10^12-$A14),$A14,$A15)=B15,0,IF((B$3*10^12-$A15)*(B$3*10^12-$A14)*-1<0,0,1)*IF(ABS(B$3*10^12-$A15)>(B$3*10^12-$A14),$A14,$A15))","v":0},0,0,0,0,0]
[2.7,0,0,0,0,0,0]
[3.3,0,0,0,0,0,0,null,null,"Rs",{"$f":"Rs_ideal*1000","v":{"$error":"#NAME?"}},{"$f":"IF(K16=0,0,IF(K16>(INT(0.5+100*POWER(10,IF(96*(LOG(K16)-INT(LOG(K16)))-ROUND(96*(LOG(K16)-INT(LOG(K16))),0)<0,ROUND(96*(LOG(K16)-INT(LOG(K16))),0)-1,ROUND(96*(LOG(K16)-INT(LOG(K16))),0))/96))*POWER(10,INT(LOG(K16))-2)+INT(0.5+100*POWER(10,(IF(96*(LOG(K16)-INT(LOG(K16)))-ROUND(96*(LOG(K16)-INT(LOG(K16))),0)<0,ROUND(96*(LOG(K16)-INT(LOG(K16))),0)-1,ROUND(96*(LOG(K16)-INT(LOG(K16))),0))+1)/96))*POWER(10,INT(LOG(K16))-2))/2,INT(0.5+100*POWER(10,(IF(96*(LOG(K16)-INT(LOG(K16)))-ROUND(96*(LOG(K16)-INT(LOG(K16))),0)<0,ROUND(96*(LOG(K16)-INT(LOG(K16))),0)-1,ROUND(96*(LOG(K16)-INT(LOG(K16))),0))+1)/96))*POWER(10,INT(LOG(K16))-2),INT(0.5+100*POWER(10,IF(96*(LOG(K16)-INT(LOG(K16)))-ROUND(96*(LOG(K16)-INT(LOG(K16))),0)<0,ROUND(96*(LOG(K16)-INT(LOG(K16))),0)-1,ROUND(96*(LOG(K16)-INT(LOG(K16))),0))/96))*POWER(10,INT(LOG(K16))-2)))","v":{"$error":"#NAME?"}},"mΩ"]
[3.9,0,0,0,0,0,0,null,null,"Cres",{"$f":"Cres","v":{"$error":"#NAME?"}},{"$f":"G4*1000000000000","v":14999.999999999998},"pF"]
[4.7,0,0,0,0,0,0]
[5.6,0,0,0,0,0,0]
[6.8,0,0,0,0,0,0]
[8.1999999999999993,0,0,0,0,0,0]
[10,0,0,0,0,0,0,null,null,"Css",{"$f":"Css","v":1.4000000000000001E-8},{"$f":"G4","v":1.4999999999999999E-8}]
[12,0,0,0,0,0,0]
[15,0,0,0,0,0,0]
[18,0,0,0,0,0,0]
[22,0,0,0,0,0,0]
[27,0,0,0,0,0,0]
[33,0,0,0,0,0,0]
[39,0,0,0,0,0,0]
[47,0,56,0,0,0,0,null,null,"Rc1",{"$f":"L7/1000&\" kΩ\"","v":"887 kΩ"},{"$f":"L7/1000","v":887},"kΩ"]
[56,0,0,0,0,0,0,null,null,"Cc1",{"$f":"C4*1000000000&\" nF\"","v":"0.056 nF"},{"$f":"C4*1000000000","v":5.6000000000000001E-2},"nF"]
[68,0,0,0,0,0,0,null,null,"Cc2",{"$f":"D4*1000000000000&\" pF\"","v":"0.82 pF"},{"$f":"D4*1000000000000","v":0.82},"pF"]
[82,0,0,0,0,0,0]
[{"$f":"A22*10","v":100},0,0,0,0,0,0]
[{"$f":"A23*10","v":120},0,0,0,0,0,0]
[150,0,0,0,0,0,0]
[180,0,0,0,0,0,0]
[220,0,0,0,0,0,0]
[270,0,{"$f":"IF(IF((C$3*10^12-$A40)*(C$3*10^12-$A39)*-1<0,0,1)*IF(ABS(C$3*10^12-$A40)>(C$3*10^12-$A39),$A39,$A40)=C40,0,IF((C$3*10^12-$A40)*(C$3*10^12-$A39)*-1<0,0,1)*IF(ABS(C$3*10^12-$A40)>(C$3*10^12-$A39),$A39,$A40))","v":0},0,0,0,0]
[330,0,0,0,0,0,0]
[390,0,0,0,0,0,0]
[470,0,0,0,0,0,0]
[560,0,0,0,0,0,0]
[680,0,0,0,0,0,0]
[{"$f":"A33*10","v":820},0,0,0,0,0,0]
[1000,0,0,0,0,0,0]
[1200,0,0,0,0,0,0]
[1500,0,0,0,0,0,0]
[1800,0,0,0,0,0,0]
[2200,0,0,0,0,0,0]
[2700,0,0,0,0,0,0]
[3300,0,0,0,0,0,0]
[3900,0,0,0,0,0,0]
[4700,0,0,0,0,0,0]
[5600,0,0,0,0,0,0]
[6800,0,0,0,0,0,0]
[8200,0,0,0,0,0,0]
[10000,0,0,0,0,0,0]
[12000,15000,0,0,0,0,15000]
[15000,0,0,0,0,0,0]
[18000,0,0,0,0,0,0]
[22000,0,0,0,0,0,0]
[27000,0,0,0,0,0,0]
[33000,0,0,0,0,0,0]
[39000,0,0,0,0,0,0]
[47000,0,0,0,0,0,0]
[56000,0,0,0,0,0,0]
[68000,0,0,0,0,0,0]
[82000,0,0,0,0,0,0]
[100000,0,0,{"$f":"IF(IF((D$3*10^12-$A71)*(D$3*10^12-$A70)*-1<0,0,1)*IF(ABS(D$3*10^12-$A71)>(D$3*10^12-$A70),$A70,$A71)=D71,0,IF((D$3*10^12-$A71)*(D$3*10^12-$A70)*-1<0,0,1)*IF(ABS(D$3*10^12-$A71)>(D$3*10^12-$A70),$A70,$A71))","v":0},0,0,0]
[120000,{"$f":"IF(IF((B$3*10^12-$A72)*(B$3*10^12-$A71)*-1<0,0,1)*IF(ABS(B$3*10^12-$A72)>(B$3*10^12-$A71),$A71,$A72)=B72,0,IF((B$3*10^12-$A72)*(B$3*10^12-$A71)*-1<0,0,1)*IF(ABS(B$3*10^12-$A72)>(B$3*10^12-$A71),$A71,$A72))","v":0},{"$f":"IF(IF((C$3*10^12-$A72)*(C$3*10^12-$A71)*-1<0,0,1)*IF(ABS(C$3*10^12-$A72)>(C$3*10^12-$A71),$A71,$A72)=C72,0,IF((C$3*10^12-$A72)*(C$3*10^12-$A71)*-1<0,0,1)*IF(ABS(C$3*10^12-$A72)>(C$3*10^12-$A71),$A71,$A72))","v":0},0,0,{"$f":"IF(IF((F$3*10^12-$A72)*(F$3*10^12-$A71)*-1<0,0,1)*IF(ABS(F$3*10^12-$A72)>(F$3*10^12-$A71),$A71,$A72)=F72,0,IF((F$3*10^12-$A72)*(F$3*10^12-$A71)*-1<0,0,1)*IF(ABS(F$3*10^12-$A72)>(F$3*10^12-$A71),$A71,$A72))","v":0},{"$f":"IF(IF((G$3*10^12-$A72)*(G$3*10^12-$A71)*-1<0,0,1)*IF(ABS(G$3*10^12-$A72)>(G$3*10^12-$A71),$A71,$A72)=G72,0,IF((G$3*10^12-$A72)*(G$3*10^12-$A71)*-1<0,0,1)*IF(ABS(G$3*10^12-$A72)>(G$3*10^12-$A71),$A71,$A72))","v":0}]
[150000,0,0,0,0,0,0]
[180000,0,0,0,0,0,0]
[220000,0,0,0,0,0,0]
[270000,0,0,0,0,0,0]
[330000,0,0,0,0,0,0]
[390000,0,0,0,0,0,0]
[470000,0,0,0,0,0,0]
[560000,0,0,0,0,0,0]
[680000,0,0,0,0,0,0]
[820000,0,0,0,0,0,0]
[1000000,0,0,0,0,0,0]
[1200000,0,0,0,0,0,0]
[1500000,0,0,0,0,0,0]
[1800000,0,0,0,0,0,0]
[2200000,0,0,0,0,0,0]
[2700000,0,0,0,0,0,0]
[3300000,0,0,0,0,0,0]
[3900000,0,0,0,0,0,0]
[4700000,0,0,0,0,0,0]
[5600000,0,0,0,0,0,0]
[6800000,0,0,0,0,0,0]
[8200000,0,0,0,0,0,0]
[10000000,0,0,0,0,0,0]
[12000000,0,0,0,0,0,0]
[15000000,0,0,0,0,0,0]
[18000000,0,0,0,0,0,0]
[22000000,0,0,0,0,22000000,0]
[{"$f":"A87*10","v":27000000},0,0,0,0,0,0]
[33000000,0,0,0,0,0,0]
[39000000,0,0,0,0,0,0]
[47000000,0,0,0,0,0,0]
[56000000,0,0,0,0,{"$f":"IF(IF((F$3*10^12-$A104)*(F$3*10^12-$A103)*-1<0,0,1)*IF(ABS(F$3*10^12-$A104)>(F$3*10^12-$A103),$A103,$A104)=F104,0,IF((F$3*10^12-$A104)*(F$3*10^12-$A103)*-1<0,0,1)*IF(ABS(F$3*10^12-$A104)>(F$3*10^12-$A103),$A103,$A104))","v":0},{"$f":"IF(IF((G$3*10^12-$A104)*(G$3*10^12-$A103)*-1<0,0,1)*IF(ABS(G$3*10^12-$A104)>(G$3*10^12-$A103),$A103,$A104)=G104,0,IF((G$3*10^12-$A104)*(G$3*10^12-$A103)*-1<0,0,1)*IF(ABS(G$3*10^12-$A104)>(G$3*10^12-$A103),$A103,$A104))","v":0}]
[68000000,0,0,0,0,0,0]
[82000000,0,0,0,100000000,0,0]
[100000000,0,0,0,0,0,0]
[120000000,0,0,0,0,0,0]
[150000000,0,0,0,0,0,0]
[180000000,0,0,0,0,0,0]
[220000000,0,0,0,0,0,0]
[270000000,0,0,0,0,0,0]
[330000000,0,0,0,0,0,0]
[390000000,0,0,0,0,0,0]
[470000000,0,0,0,0,0,0]
[560000000,0,0,0,0,0,0]
[680000000,0,0,0,0,0,0]
[820000000,0,0,0,0,0,0]
[1000000000,0,0,0,0,0,0]
[1200000000,0,0,0,0,0,0]
[1500000000,0,0,0,0,0,0]
[1800000000,0,0,0,0,0,0]
[2200000000,0,0,0,0,0,0]
[2700000000,0,0,0,0,0,0]
[3300000000,0,0,0,0,0,0]
[3900000000,0,0,0,0,0,0]
[4700000000,0,0,0,0,0,0]
[5600000000,0,0,0,0,0,0]
[6800000000,0,0,0,0,0,0]
[8200000000,0,0,0,0,0,0]
[10000000000,0,0,0,0,0,0]
[12000000000,0,0,0,0,0,0]
[15000000000,0,0,0,0,0,0]
[18000000000,0,0,0,0,0,0]
[22000000000,0,0,0,{"$f":"IF(IF((E$3*10^12-$A135)*(E$3*10^12-$A134)*-1<0,0,1)*IF(ABS(E$3*10^12-$A135)>(E$3*10^12-$A134),$A134,$A135)=E135,0,IF((E$3*10^12-$A135)*(E$3*10^12-$A134)*-1<0,0,1)*IF(ABS(E$3*10^12-$A135)>(E$3*10^12-$A134),$A134,$A135))","v":0},0,0]
[27000000000,{"$f":"IF(IF((B$3*10^12-$A136)*(B$3*10^12-$A135)*-1<0,0,1)*IF(ABS(B$3*10^12-$A136)>(B$3*10^12-$A135),$A135,$A136)=B136,0,IF((B$3*10^12-$A136)*(B$3*10^12-$A135)*-1<0,0,1)*IF(ABS(B$3*10^12-$A136)>(B$3*10^12-$A135),$A135,$A136))","v":0},{"$f":"IF(IF((C$3*10^12-$A136)*(C$3*10^12-$A135)*-1<0,0,1)*IF(ABS(C$3*10^12-$A136)>(C$3*10^12-$A135),$A135,$A136)=C136,0,IF((C$3*10^12-$A136)*(C$3*10^12-$A135)*-1<0,0,1)*IF(ABS(C$3*10^12-$A136)>(C$3*10^12-$A135),$A135,$A136))","v":0},0,0,0,0]
[33000000000,0,0,0,0,0,0]
[39000000000,0,0,0,0,0,0]
[47000000000,0,0,0,0,0,0]
[56000000000,0,0,0,0,0,0]
[68000000000,0,0,0,0,0,0]
[82000000000,0,0,0,0,0,0]
[100000000000,0,0,0,0,0,0]
[120000000000,0,0,0,0,0,0]
[150000000000,0,0,0,0,0,0]
[180000000000,0,0,0,0,0,0]
[220000000000,0,0,0,0,0,0]
[270000000000,0,0,0,0,0,0]
[330000000000,0,0,0,0,0,0]
[390000000000,0,0,0,0,0,0]
[470000000000,0,0,0,0,0,0]
[560000000000,0,0,0,0,0,0]
[680000000000,0,0,0,0,0,0]
[820000000000,0,0,0,0,0,0]
[1000000000000,0,0,0,0,0,0]
[1200000000000,0,0,0,0,0,0]
[1500000000000,0,0,0,0,0,0]
[1800000000000,0,0,0,0,0,0]
[2200000000000,0,0,0,0,0,0]
[2700000000000,2700000000000,2700000000000,2700000000000,2700000000000,2700000000000,2700000000000]

{"sheet":"Snubber","index":11,"n_rows":6,"n_cols":5,"rows_kept":6,"cut":false,"hidden":true,"merged":[]}
[null,null,"UNITS","STD UNITS"]
["Frequency of Ringing",85,"MHz",{"$f":"B2*1000000","v":85000000},"Hz"]
["SW capacitance",3000,"pF",{"$f":"B3*0.000000000001","v":3E-9},"F"]
["Lpar",{"$f":"1000000000*1/((D2*2*3.14159)^2*D3)","v":1.1686430773614742},"nH",{"$f":"B4/1000000000","v":1.1686430773614743E-9},"H"]
["Csnub",{"$f":"4*B3","v":12000},"pF",{"$f":"B5*0.000000000001","v":1.2E-8},"F"]
["Rsnub",{"$f":"SQRT(D4/D3)","v":0.62413755891936573},"Ω",{"$f":"B6","v":0.62413755891936573},"Ω"]

{"sheet":"Parallel Output Caps","index":12,"n_rows":17,"n_cols":5,"rows_kept":17,"cut":false,"hidden":true,"merged":[]}
[]
[]
[]
["Fsw",{"$f":"Fsw","v":400000}]
[]
["C1",20,"uF",{"$f":"B6/1000000","v":2.0000000000000002E-5},"F"]
["R1",0.5,"mOhms",{"$f":"B7/1000","v":5.0000000000000001E-4},"Ohms"]
[]
["C2",68,"uF",{"$f":"B9/1000000","v":6.7999999999999999E-5},"F"]
["R2",20,"mOhms",{"$f":"B10/1000","v":0.02},"Ohms"]
[]
[]
["I1 ",{"$f":"(D6/(D6+D9))*SQRT((D10*D9*B4)^2+1)/SQRT((((D7+D10)*D6*D9/(D9+D6))*B4)^2+1)","v":0.25667257397349275},"%"]
["I2 ",{"$f":"1-B13","v":0.74332742602650725},"%"]
[]
["I1 ",{"$f":"B13*(Iripple1/(2*SQRT(3)))","v":{"$error":"#NAME?"}},"A"]
["I2 ",{"$f":"B14*(Iripple1/(2*SQRT(3)))","v":{"$error":"#NAME?"}},"A"]