{"text_format":"1","workbook":"xlsx","n_sheets":4,"sheets":["Enter Parameters and See Result","Intermediate Calculations","DCR sense calculations","Datasheet Parameters"],"not_rendered":{"charts":4,"images":3,"macros":1,"external_links":0,"defined_names":307,"comments":1,"pivot_tables":0},"unopened":[],"bounds":{"document_bytes":16777216,"sheet_cells":100000,"rows_first":2000,"rows_last":500,"rows_between":2000,"halvings":0,"cell_chars":16384,"cell_head_chars":4096},"cells_cut":0,"cells_raw":0,"read":"whole","date_system":"1900"}

{"sheet":"Enter Parameters and See Result","index":0,"n_rows":135,"n_cols":17,"rows_kept":135,"cut":false,"hidden":false,"merged":[[105,10,106,12],[106,15,107,16],[80,1,80,2],[35,1,35,2],[33,1,33,2],[26,1,26,2],[20,8,23,8],[27,1,27,2],[91,9,95,9],[32,6,32,8],[80,4,81,4],[58,4,60,4],[73,4,74,4]]}
["TPS53632 Design Procedure with DCR Sensing Temperature Compensation"]
[]
["INSTRUCTIONS"]
["1. When you open this file Click on 'Enable Macros' when the prompt appears"]
["2. This Program has a Macro to calculate an optimized set of DCR sense component values."]
["3. You need the Excel Add-in \"Solver\" to use this Program. Go to Tools -> Add-in. Check the box \"Solver\" and \"Analysis Tool-pak'"]
["4. Enter the parameters in Green Cells"]
["5. DO NOT CHANGE ANY CELLS OTHER THAN GREEN CELLS"]
["6. The Program automatically selects the TRIPSEL selection"]
["7. Run the Macro (By pressing CTRL+q) for correct DCR sense values. The DCR sense and some of the results will update only after running the macro.",null,null,null,null,null,null,null,null,null,null,"LOADLINE vs Temperature"]
["8. Use the 'PASS' / 'FAIL' criteria as a guideline only. Judgement should be made based on actual numbers."]
["9. When you get an 'ERROR!' in the results, the input parameters must be adjusted to get a correct result."]
["10. The Bode Plot at the end is based on Linearized model and is valid only << switching frequency. "]
[]
["Enter the parameters in Green Cells",null,null,null,null,null,"RUN MACRO (CTRL+q) for Correct DCR sense values"]
["DO NOT CHANGE any other cells",null,null,null,null,null,"CPU"]
[null,null,null,null,null,null,"Rsequ",{"$f":"'DCR sense calculations'!$D$10/1000","v":1.4084471507898382},"kW"]
["Processor Requirements",null,null,null,null,null,"Rseries",{"$f":"'DCR sense calculations'!$D$11/1000","v":1.7277200500675662},"kW"]
[null,null,null,null,null,null,"Rpar",{"$f":"IF(('DCR sense calculations'!$D$12/1000)<(15*RNTC_25C),'DCR sense calculations'!$D$12/1000,\"OPEN\")","v":"OPEN"},"kW"]
["Number of phases",2,null,null,null,null,"Csense",{"$f":"'DCR sense calculations'!$D$15/0.000000001","v":603.30816713477554},"nF"]
["Output Voltage",0.9,null,"V",null,null,"Divider Ratio",{"$f":"Rcs_eff/L_DCR","v":0.8845427948275717},"If Divide Ratio is lower than 0.75, try increasing OCL and run macro again."]
["R_Loadline (DC Loadline)",2,null,"mV/A",null,null,"TEMP COMPENSATION",{"$f":"IF(('DCR sense calculations'!I6<0.00001)*AND('DCR sense calculations'!I14<4),\"PASS\",\"FAIL\")","v":"PASS"}]
["Maximum Current (Icc_max)",41,null,"A"]
["Per phase Maximum Current ",{"$f":"Icc_max/N_ph","v":20.5},null,"A"]
["Thermal Design Current (I_TDC_total)",35,null,"A"]
["Per phase Thermal Design Current ",{"$f":"I_TDC/N_ph","v":17.5},null,"A"]
["Slew Rate ",24,null,"mV/ms"]
["PMBus Address",0]
[]
[]
[]
[null,null,null,null,null,null,null,null,null,null,null,"CPU-Vcore OVER-CURRENT LIMIT Vs Temperature"]
["System Requirements"]
["Vin max",14,null,"V",null,null,"Pin 1, 31",null,null,"I2C lines. Pull-up to I2C Interface voltage through 1k resistor"]
[null,null,null,null,null,null,"Pin 2 (VDD) to GND",1,"mF","3.3V supply by-pass capacitor"]
["Vin_min",10,null,"V",null,null,"Pin 3 PGOOD",null,null,"PGOOD  need external pull-up"]
[null,null,null,null,null,null,"Pin 4,5,6 (CPWM1-CPWM3)",null,null,"PWM outputs,"]
[null,null,null,null,null,null,"Pin 4 to GND","open","kW"]
["Freq",600,null,"kHz",null,null,"Pin 7 (SKIP) ",null,null,"Connect to driver"]
[null,null,null,null,null,null,"Pin 8",null,null,"VR_ON logic"]
[null,null,null,null,null,null,"Pin 9 (PU) to GND",150,"kW"]
[null,null,null,null,null,null,"Pin 9 (PU) to VREF",9.31,"kW"]
[null,null,null,null,null,null,"Pin 10 (F-IMAX) to GND",{"$f":"VLOOKUP(Freq,B128:C135,2,FALSE)","v":39},"kW","Selects the Switching Frequency "]
[null,null,null,null,null,null,"Pin 10 (F-IMAX) to VREF",{"$f":"H43*(1-(Icc_max/255))/(Icc_max/255)","v":203.56097560975607},"kW","Sets the Icc_max"]
[null,null,null,null,null,null,"Pin 11 (B-RAMP) to GND",{"$f":"VLOOKUP(B98,P109:Q112,2)","v":150},"kW","Ramp setting"]
[null,null,null,null,null,null,"Pin 11 (B-RAMP) to VREF","open","kW","For now, set the BOOT to OTP BOOT"]
[null,null,null,null,null,null,"Pin 12 (COCP-I) to GND",{"$f":"'Intermediate Calculations'!B18","v":24},"kW","Selects the OCP level for CPU-Vcore"]
[null,null,null,null,null,null,"Pin 13 (CIMON) to COCP-I",{"$f":"H47*((V_IMON/(10*Icc_max*Rcs_eff*0.001)-1))","v":363.9354423857045},"kW","Sets IMON voltage for CPU-Vcore on CIMON pin"]
[null,null,null,null,null,null,"Pin 14 THERM to GND",{"$f":"(V_THRMSD)/((VREF-V_THRMSD)/(VLOOKUP(TEMP_SD,C115:D125,2,FALSE)))","v":8.9615864144780115},"kW","Sets the Thermal Shutdown Level for CPU-Vcore"]
[null,null,null,null,null,null,"Pin 14 THERM to VREF",100,"kW","NTC for VR_HOT flag and Thermal Shutdown. "]
[null,null,null,null,null,null,"Pin 15 (SLEWA) to GND",{"$f":"VLOOKUP(Slew_rate,H114:I121,2,FALSE)","v":39},"kW","This resistor sets the SLEW rate"]
[null,null,null,null,null,null,"Pin 15 (SLEWA) to VREF",{"$f":"VLOOKUP(PM_address,K108:M115,3)","v":"open"},"kW","DNP for default I2C device address (0100 0000b)"]
[null,null,null,null,null,null,"Pin 16 (VBAT)",null,null,"Connect to Converter Input Voltage, VIN (VBAT)"]
[null,null,null,null,null,null,"Pin 17 to Pin 22(CCSP-N)",null,null,"See DCR sensing for CPU"]
[null,null,null,null,null,null,"Pin 23, Pin 24",null,null,"Voltage sense  Feedback, CPU"]
[null,null,null,null,null,null,"Pin 25-26 (DROOP to COMP)",4.0199999999999996,"kW","FIX first. Adjust as needed for compensation"]
[null,null,null,null,null,null,"Pin 25-26 (DROOP to COMP)","10pF",null,"FIX first. Adjust as needed for compensation"]
["Inductor",null,null,null,null,null,"Pin 26-27 (COMP) to VREF",{"$f":"H56/(Droop_Gain-1)","v":14.225704838335787},"kW","FIX first. Adjust as needed for compensation"]
["Minimum Recommended Inductance",{"$f":"((Vin_max-Vcore_HFM)*(Vcore_HFM/(Freq*1000*Vin_max))/(0.4*Icc_max_N))*1000000","v":0.17116724738675954},null,"mH","DO NOT     CHANGE",null,"Pin 27 (VREF) to Pin 29 (GND)",0.33,"mF","VREF to Analog Ground By-pass capacitor"]
[null,null,null,null,null,null,"Pin 28 (V5) to Pin 29 (GND)",1,"mF","V5 to Analog Ground by-pass cap"]
["Maximum Recommended Inductance",{"$f":"((Vin_max-Vcore_HFM)*(Vcore_HFM/(Freq*1000*Vin_max))/(0.2*Icc_max_N))*1000000","v":0.34233449477351907},null,"mH",null,null,"Pin 30, 32","open",null,"No connect pins"]
["Chosen Inductance, L",0.22,null,"mH",{"$f":"IF(AND(L_min<=L_chosen,L_chosen<=L_max),\"PASS\",\"FAIL\")","v":"PASS"}]
["Inductor DCR, L_DCR",0.28999999999999998,null,"mW",{"$f":"IF(DCR_Ploss<DCR_Pmax,\"PASS\",\"FAIL, DCR too high\")","v":"PASS"}]
[]
["Bulk Capacitor"]
["Output Capacitor, Bulk",330,null,"mF"]
["Ceramic (account for DC voltage factor)",15,null,"mF"]
["ESR of Bulk Output capacitor",9,null,"mW"]
["Total No. of ceramic Capacitors",16]
["Total No. of Bulk Capacitors",2]
["ESL of Bulk Capacitor",1,null,"nH"]
[]
["DCR power loss"]
["Max. allowed DCR power loss",{"$f":"0.03*Vcore_HFM*I_TDC/N_ph","v":0.47249999999999998},null,"W","DO NOT     CHANGE"]
["DCR Power loss (TDC)",{"$f":"I_TDC_N^2*(1.4*L_DCR/1000)","v":0.12433749999999999},null,"W"]
[]
[]
["DCR Temperature Compensation"]
["B value of DCR thermal compensation NTC",3380,null,"K"]
["Resistance of NTC at 25C",10,null,"kW"]
["TCR_cu",3.8999999999999998E-3,null,"ppm/C","DO NOT     CHANGE"]
[]
[]
["Over Current Limit (TRIPSEL)"]
["Min. Over Current Limit (OCL) Target",50,null,"A"]
[]
[]
["Thermal Shutdown"]
["IMVP-7 Thermal Shutdown voltage \n(Voltage at which VR_HOT is active)",105,null,"oC"]
["Resistance of Thermal Shutdown NTC at 25C",100,null,"kW"]
["B value of Thermal shutdown NTC",4250]
[null,null,null,null,null,null,"R_sequ",{"$f":"H17","v":1.4084471507898382},"kW","CPU-Vcore Current sensing parts.\nFor C_sense, use the next higher available standard value but make sure it is not too high."]
[null,null,null,null,null,null,"R_series (with NTC)",{"$f":"H18","v":1.7277200500675662},"kW"]
["Current Monitor (IMON)",null,null,null,null,null,"R_NTC",{"$f":"RNTC_25C","v":10},"kW"]
["IMON voltage at Icc_max",1.7,null,"V",null,null,"R_par",{"$f":"H19","v":"OPEN"},"kW"]
[null,null,null,null,null,null,"C_sense",{"$f":"H20","v":603.30816713477554},"nF"]
["RAMP"]
["Ramp amplitude",40,null,"mV"]
[]
[]
[]
[]
[]
[]
[null,null,25,{"$f":"RNTC_25C_TH","v":100},{"$f":"RNTC_25C_TH_G","v":0}]
[null,null,30,{"$f":"D105/(EXP(B_NTC_TH*(C106-C105)/((C106+273)*(C105+273))))","v":79.030026284772319},{"$f":"E105/(EXP(B_NTC_TH_G*(C106-C105)/((C106+273)*(C105+273))))","v":0},null,null,null,null,null,"PMBus"]
[null,null,35,62.936514895336408,0,null,null,null,null,null,null,null,null,null,null,"Ramp"]
[null,null,40,50.486197390785549,0,null,null,null,null,null,0,0,"open"]
[null,null,45,40.780543544446843,0,null,null,null,null,null,1,0.4,{"$f":"(1.7*H51-H51*L109)/L109","v":126.74999999999999},null,null,40,150]
[null,null,50,33.159191771994017,0,null,null,null,null,null,2,0.6,{"$f":"(1.7*H51-H51*L110)/L110","v":71.5},null,null,60,30]
[null,null,55,27.132771906396599,0,null,null,null,null,null,3,0.8,{"$f":"(1.7*H51-H51*L111)/L111","v":43.874999999999993},null,null,120,56]
[null,null,60,22.335737681479618,0,null,null,null,null,null,4,1,{"$f":"(1.7*H51-H51*L112)/L112","v":27.299999999999997},null,null,160,100]
[null,null,65,18.49295255597012,0,null,null,null,null,null,5,1.2,{"$f":"(1.7*H51-H51*L113)/L113","v":16.25}]
[null,null,70,15.395815835065527,0,null,null,6,20,null,6,1.4,{"$f":"(1.7*H51-H51*L114)/L114","v":8.3571428571428594}]
[null,null,75,12.885065115822817,0,null,null,12,24,null,7,1.6,{"$f":"(1.7*H51-H51*L115)/L115","v":2.4374999999999947}]
[null,null,80,10.83829045208727,0,null,null,18,30]
[null,null,85,9.1608008090490376,0,null,null,24,39]
[null,null,90,7.7788942454997789,0,null,null,30,56]
[null,null,95,6.634864615793524,0,null,null,36,75]
[null,null,100,5.6832718465881058,0,null,null,42,100]
{"$rows_left_out":16}
{"sheet":"Intermediate Calculations","index":1,"n_rows":35,"n_cols":5,"rows_kept":35,"cut":false,"hidden":false,"merged":[[15,3,15,4]]}
["Intermediate Calculations"]
[]
[null,"CPU"]
["System"]
["Dmin",{"$f":"Vcore_HFM/Vin_max","v":6.4285714285714293E-2}]
["Iin_DC_at_Dmin",{"$f":"(Vcore_HFM*Icc_max)/(Vin_max*0.8)","v":3.2946428571428568},"A"]
[]
["Inductor"]
["Inductor current ripple",{"$f":"(((Vin_max-Vcore_HFM)*(Vcore_HFM/(Freq*1000*Vin_max)))/L_chosen)*1000000","v":6.3798701298701292},"A"]
["Inductor Saturation Current rating",{"$f":"(Icc_max_N+I_ripple/2)*1.2*1.25","v":35.534902597402592},"A"]
[null,null,null,null,"Icl_Valley*L_DCR*(IF(B_NTC>4199,0.95,0.89))"]
["Over Current Limit"]
["Min. Over Current Limit (OCL) Target in single phase",{"$f":"(OCL_Tar/N_ph)","v":25},"A"]
["Valley current limit",{"$f":"OCL_N-I_ripple/2","v":21.810064935064936},"A"]
["DCR * Valley current",{"$f":"Icl_Valley*L_DCR","v":6.3249188311688309}]
["TRIPSEL voltage target",{"$f":"Icl_Valley*L_DCR*0.95","v":6.0086728896103887},"mV"]
["TRIPSEL closest match",{"$f":"VLOOKUP(TRIPSEL,'Datasheet Parameters'!D4:D11,1,TRUE)","v":5.9},"mV"]
["TRIPSEL Setting",{"$f":"VLOOKUP(TRIPSEL,'Datasheet Parameters'!D4:E11,2,TRUE)","v":24},"kW"]
[]
["DROOP"]
["Gain",{"$f":"(Acs*Rcs_eff)/(R_LL)","v":1.282587052499979}]
[]
[]
["Output capacitor"]
["Effective bulk Capacitor",{"$f":"Cout*nc+Ccerm*ncerm","v":900}]
["Effective ESR",{"$f":"(((ESR/nc)*(Cout*nc))+((2/ncerm)*(Ccerm*ncerm)))/(Cout*nc+Ccerm*ncerm)","v":3.3333333333333335}]
["Effective ESL",{"$f":"ESL/nc","v":0.5}]
["Load resistance for Bode Plot",{"$f":"Vcore_HFM/I_load","v":{"$error":"#REF!"}}]
[]
[]
[]
["Input Capacitors"]
["RMS Current_at_Dmin",{"$f":"SQRT(((Icc_max-(N_ph*Iin_DC))^2)*Dmin+(Iin_DC^2)*((1/N_ph)-Dmin))","v":8.9916668897219267}]
["Input Capacitor Current Rating",3]
["Number of Input Capacitors",{"$f":"ROUNDUP(Irms_Cin/Irating_Cin,0)","v":3}]

{"sheet":"DCR sense calculations","index":2,"n_rows":52,"n_cols":19,"rows_kept":52,"cut":false,"hidden":false,"merged":[]}
[]
[null,null,null,null,null,null,"Coming from other sheets"]
[null,null,null,null,null,null,"Calculated in this sheet"]
[]
[null,null,"F",{"$f":"Freq*1000","v":600000},"Hz",null,null,null,"result","target",null,"Vin(min)",{"$f":"Vin_min","v":10},"V"]
[null,null,"B:Rth",{"$f":"B_NTC","v":3380},"K",null,null,"V Slope",{"$f":"SLOPE($K$27:$K$44,$A$27:$A$44)","v":5.3420892785350564E-7},0,null,"TRIPSELmin",{"$f":"TRIPSEL_V","v":5.9},"mV"]
[null,null,"Rth25",{"$f":"RNTC_25C*1000","v":10000},"ohm",null,null,"Rcs_eff",{"$f":"INTERCEPT($K$27:$K$44,$A$27:$A$44)","v":0.25651741049999577},{"$f":"Rcs_max*0.95","v":0.25699144026795678},null,"OCL Target",{"$f":"OCL_N","v":25},"A/phase"]
[null,null,"LDCR",{"$f":"L_DCR/1000","v":2.9E-4},"ohm",null,null,"Σ Sq. Err.",{"$f":"SUM($M$27:$M$44)","v":8.4853135673359139E-5},null,null,"Vcore",{"$f":"Vcore_HFM","v":0.9},"V"]
[null,null,"TCR_cu",{"$f":"TCR_Cu","v":3.8999999999999998E-3},"3900ppm/degC",null,null,"RMSE",{"$f":"SQRT(I8/85)","v":9.9913571870515177E-4},1E-3,null,"Ip-p",{"$f":"I_ripple","v":6.3798701298701292},"A "]
[null,null,"Rsequ",1408.4471507898381,"ohm",null,null,null,null,null,null,"Ivalley",{"$f":"Icl_Valley","v":21.810064935064936},"A"]
[null,null,"Rseries",1727.7200500675663,"ohm",null,null,"Max",{"$f":"MAX($K$27:$K$44)","v":0.25927907110472365},null,null,"Rcs(max)",{"$f":"(TRIPSEL_V/Icl_Valley)","v":0.27051730554521769},"mΩ"]
[null,null,"Rpar",191167599265102.66,"ohm",null,null,"Min",{"$f":"MIN($K$27:$K$44)","v":0.25120876793157709},null,null,"Vcs_p-p",{"$f":"I_ripple*Rcs_eff","v":1.6365477650405573},"mV"]
[null,null,"I",1,"A",null,null,"R",{"$f":"ABS(I11-I12)","v":8.0703031731465535E-3}]
[null,null,"L",{"$f":"L_chosen*0.000001","v":2.1999999999999998E-7},"H",null,null,"R%",{"$f":"I13/I7*100","v":3.1461034778949974},null,null,"Rsequ_guess",{"$f":"D7*0.2","v":2000}]
[null,null,"Csense",{"$f":"D14/(D8*(I32*D10/(I32+D10)))","v":6.0330816713477564E-7},"F",null,null,null,null,null,null,"Rseries_guess",2000]
[null,null,"Rseqmin",1000,null,null,null,null,null,null,null,"Rpar_guess",{"$f":"D7*2","v":20000}]
[]
["Temp","B","Rth","R1","R2","R3","DCR","V1","Rnet1","Rnet2","Vout","Vapp","SqrErr",null,"Loadline","OCL",null,"LL Target","OCL Target"]
[-40,null,{"$f":"C20*(EXP($D$6*(A20-A19)/((A20+273)*(A19+273))))","v":236687.56541516655},{"$f":"$D$10","v":1408.4471507898381},{"$f":"$D$11","v":1727.7200500675663},{"$f":"$D$12","v":191167599265102.66},{"$f":"G20*(1-$D$9)^5","v":2.2495160922544861E-4},{"$f":"G19*$D$13*1000","v":0.2249516092254486},{"$f":"(E19*F19+C19*F19)/(C19+E19+F19)","v":238415.28516789374},{"$f":"D19+I19","v":239823.73231868359},{"$f":"I19*H19/J19","v":0.22363050372010118},{"$f":"A19*$I$6+$I$7","v":0.25649604214288163},{"$f":"(K19-L19)^2","v":1.080143615819258E-3},null,{"$f":"R_LL*K19/Rcs_eff","v":1.7435892813997111},{"$f":"((TRIPSEL_V/K19)+I_ripple/2)*N_ph","v":59.145480382973311},null,{"$f":"R_LL","v":2},{"$f":"OCL_N*N_ph","v":50}]
[-35,null,174510.32100752127,1408.4471507898381,1727.7200500675663,191167599265102.66,2.2938995902027366E-4,0.22938995902027365,176238.04089511439,177646.48804590423,0.22757127046776809,0.25649871318752088,8.3679694230457823E-4,null,1.774314421966082,58.231758005458914,null,2,50]
[-30,null,130290.71648761853,1408.4471507898381,1727.7200500675663,191167599265102.66,2.3391587853273288E-4,0.23391587853273288,132018.43644651546,133426.88359730531,0.23144667484782733,0.25650138423216018,6.2773846233337663E-4,null,1.8045299490330786,57.363536271361774,null,2,50]
[-25,null,98428.999584495337,1408.4471507898381,1727.7200500675663,191167599265102.66,2.3853109553458851E-4,0.23853109553458851,100156.71958208868,101565.16673287853,0.23522328388333552,0.25650405527679943,4.5287123110087166E-4,null,1.833975194314067,56.544972007507745,null,2,50]
[-20,null,75187.651467696167,1408.4471507898381,1727.7200500675663,191167599265102.66,2.4323737188695864E-4,0.24323737188695863,76915.371486817196,78323.818637607037,0.23886338975280225,0.25650672632143867,3.1128732527418334E-4,null,1.8623561596635265,55.780492017601539,null,2,50]
[-15,null,58036.864739616976,1408.4471507898381,1727.7200500675663,191167599265102.66,2.4803650421290839E-4,0.24803650421290838,59764.584771000387,61173.031921790229,0.24232571472486758,0.25650939736607797,2.0117685326657305E-4,null,1.889351013270669,55.074660995946871,null,2,50]
[-10,null,45241.474357960033,1408.4471507898381,1727.7200500675663,191167599265102.66,2.5293032458331162E-4,0.25293032458331161,46969.194396487437,48377.641547277279,0.24556661309151476,0.25651206841071722,1.1980299214465749E-4,null,1.9146194608222806,54.432004951644622,null,2,50]
[-5,null,35596.364516021655,1408.4471507898381,1727.7200500675663,191167599265102.66,2.5792070121624471E-4,0.25792070121624472,37324.084558801966,38732.531709591807,0.24854182354613935,0.25651473945535652,6.3567388095448271E-5,null,1.9378164083419471,53.856789030843132,null,2,50]
[0,null,28254.580746096068,1408.4471507898381,1727.7200500675663,191167599265102.66,2.6300953919017973E-4,0.26300953919017972,29982.300791461279,31390.747942251117,0.25120876793157709,0.25651741049999577,2.8181685919226833E-5,null,1.95860988493474,53.352752872617472,null,2,50]
[5,null,22614.167606121209,1408.4471507898381,1727.7200500675663,191167599265102.66,2.6819878117124887E-4,0.26819878117124885,24341.887653089256,25750.334803879094,0.25352930941241764,0.25652008154463501,8.9447179468480847E-6,null,1.976702547544404,52.92281235358309,null,2,50]
[10,null,18242.720273465933,1408.4471507898381,1727.7200500675663,191167599265102.66,2.7349040815485826E-4,0.27349040815485826,19970.440321447277,21378.887472237115,0.25547278274594581,0.25652275258927432,1.1024366718992792E-6,null,1.9918553071932716,52.568743453939554,null,2,50]
[15,null,14826.473382107537,1408.4471507898381,1727.7200500675663,191167599265102.66,2.7888644022193367E-4,0.27888644022193365,16554.19343074159,17962.640581531428,0.25701900874148842,0.25652542363391356,2.4362625841968269E-7,null,2.0039108319432586,52.290871256905547,null,2,50]
[20,null,{"$f":"C32*(EXP($D$6*(A32-A31)/((A32+273)*(A31+273))))","v":12135.552787266106},1408.4471507898381,1727.7200500675663,191167599265102.66,2.8438893731008729E-4,0.2843889373100873,13863.272836328324,15271.719987118162,0.25816092967189019,0.25652809467855286,2.6661501154669142E-6,null,2.0128140945185042,52.087793536394962,null,2,50]
[25,null,{"$f":"D7","v":10000},1408.4471507898381,1727.7200500675663,191167599265102.66,{"$f":"$D$8","v":2.9E-4},0.28999999999999998,11727.720049348096,13136.167200137934,0.25890648029169694,0.25653076572319211,5.6440197110060789E-6,null,2.0186269601509266,51.956172378873447,null,2,50]
[30,null,{"$f":"C32/(EXP($D$6*(A33-A32)/((A33+273)*(A32+273))))","v":8293.0575526370103},1408.4471507898381,1727.7200500675663,191167599265102.66,{"$f":"G32*(1+$D$9)^5","v":2.9569928136081059E-4},0.29569928136081058,10020.777602179298,11429.224752969136,0.25925964356166398,0.25653343676783136,7.4322034827391306E-6,null,2.0213804829568733,51.894088378007979,null,2,50]
[35,null,{"$f":"C33/(EXP($D$6*(A34-A33)/((A34+273)*(A33+273))))","v":6919.4008798518353},1408.4471507898381,1727.7200500675663,191167599265102.66,3.0151056895620632E-4,0.30151056895620632,8647.1209295282642,10055.568080318102,0.25927907110472365,0.25653610781247066,7.5238476226473441E-6,null,2.02153195449264,51.890678039367543,null,2,50]
[40,null,5806.7745309822658,1408.4471507898381,1727.7200500675663,191167599265102.66,3.0743606401048047E-4,0.30743606401048046,7534.4945807528738,8942.9417315427127,0.2590171587549156,0.25653877885710991,6.1423669178473608E-6,null,2.0194898915441835,51.936697549034541,null,2,50]
[45,null,4899.9942488385695,1408.4471507898381,1727.7200500675663,191167599265102.66,3.1347801100791464E-4,0.31347801100791461,6627.7142986763556,8036.1614494661935,0.25853670423903546,0.25654144990174915,3.9810398704598394E-6,null,2.0157439117688249,52.021358578218518,null,2,50]
[50,null,4156.6085884851136,1408.4471507898381,1727.7200500675663,191167599265102.66,3.1963869854295391E-4,0.3196386985429539,5884.328638371554,7292.7757891613919,0.25790716760598487,0.25654412094638845,1.8578961962369367E-6,null,2.0108355772286974,52.132766838919075,null,2,50]
[55,null,3543.7350244488252,1408.4471507898381,1727.7200500675663,191167599265102.66,3.2592046018709052E-4,0.32592046018709053,5271.4550743710306,6679.9022251608685,0.25720063045581543,0.2565467919910277,4.2750473803597044E-7,null,2.0053268895431926,52.258451294651238,null,2,50]
[60,null,3035.7343750282021,1408.4471507898381,1727.7200500675663,191167599265102.66,3.3232567537278397E-4,0.33232567537278396,4763.4544249770743,6171.9015757669122,0.25648792182679592,0.256549463035667,3.7873203893145584E-9,null,1.9997700844309758,52.385935117087882,null,2,50]
[65,null,2612.4884959037472,1408.4471507898381,1727.7200500675663,191167599265102.66,3.3885677029475258E-4,0.33885677029475259,4340.2085458727743,5748.6556966626122,0.25583529921855547,0.25655213408030625,5.1385221902126187E-7,null,1.9946817545046105,52.503294207950432,null,2,50]
[70,null,2258.1155071502753,1408.4471507898381,1727.7200500675663,191167599265102.66,3.4551621882897797E-4,0.34551621882897798,3985.835557134737,5394.2827079245753,0.25530193820804531,0.2565548051249455,1.5696755114629776E-6,null,1.9905232764545588,52.599652411288581,null,2,50]
[75,null,1960.0047406928338,1408.4471507898381,1727.7200500675663,191167599265102.66,3.523065434697702E-4,0.35230654346977019,3687.7247906892621,5096.1719414791005,0.25493833198619203,0.2565574761695848,2.6216278866146149E-6,null,1.9876883326498125,52.665573452974606,null,2,50]
[80,null,1708.0870076724962,1408.4471507898381,1727.7200500675663,191167599265102.66,3.5923031628524906E-4,0.35923031628524904,3435.8070576783116,4844.25420846815,0.25478556717096068,0.25656014721422404,3.1491343299485989E-6,null,1.9864972648393773,52.693325523056593,null,2,50]
[85,null,1494.2792684603821,1408.4471507898381,1727.7200500675663,191167599265102.66,3.6629015989160291E-4,0.36629015989160291,3221.9993184736436,4630.446469263482,0.25487534590202632,0.25656281825886329,2.8475629550889249E-6,null,1.9871972464187224,52.677011810006981,null,2,50]
[90,null,1312.0594206680166,1408.4471507898381,1727.7200500675663,191167599265102.66,3.7348874844649445E-4,0.37348874844649443,3039.7794706872469,4448.2266214770852,0.25523057314092729,0.25656548930350259,1.7820011611047804E-6,null,1.9899668614573942,52.612575933044226,null,2,50]
[95,null,1156.138788725865,1408.4471507898381,1727.7200500675663,191167599265102.66,3.8082880866198958E-4,0.38082880866198959,2883.8588387499271,4292.3059895397655,0.25586631721664421,0.25656816034814184,4.9258378123039379E-7,null,1.9949235938248209,52.497702787026164,null,2,50]
[100,null,1022.2084279089581,1408.4471507898381,1727.7200500675663,191167599265102.66,3.8831312083739298E-4,0.388313120837393,2749.9284779369668,4158.3756287268052,0.25679096952438385,0.25657083139278114,4.8460796985531874E-8,null,2.0021328690622195,52.331641805702048,null,2,50]
[105,null,906.74152774613231,1408.4471507898381,1727.7200500675663,191167599265102.66,3.9594451991238177E-4,0.39594451991238178,2634.4615777773934,4042.9087285672313,0.25800746310945061,0.25657350243742039,2.0562432089293636E-6,null,2.0116175553663238,52.114981268861733,null,2,50]
[110,null,806.83869574407788,1408.4471507898381,1727.7200500675663,191167599265102.66,4.0372589654083605E-4,0.40372589654083607,2534.5587457780402,3943.0058965678782,0.25951444882832703,0.25657617348205963,8.6334620104827737E-6,null,2.0233671338135646,51.849400066547716,null,2,50]
[115,null,720.10619844030271,1408.4471507898381,1727.7200500675663,191167599265102.66,4.1166019818577308E-4,0.4116601981857731,2447.8262484765255,3856.2733992663634,0.2613073644529168,0.25657884452669893,2.2358900692639421E-5,null,2.0373460338897433,51.537418692287943,null,2,50]
[120,null,644.55966815805618,1408.4471507898381,1727.7200500675663,191167599265102.66,4.1975043023579988E-4,0.41975043023579989,2372.2797181961841,3780.7268689860221,0.26337936245036692,0.25658151557133818,4.6210722190720711E-5,null,2.0535008671496882,51.182165534559161,null,2,50]
[125,null,578.54758803990967,1408.4471507898381,1727.7200500675663,191167599265102.66,4.2799965714350718E-4,0.42799965714350718,2306.2676380796529,3714.7147888694908,0.26572208486554061,0.25658418661597748,8.350118441936884E-5,null,2.0717664687757713,50.787168853162093,null,2,50]

{"sheet":"Datasheet Parameters","index":3,"n_rows":16,"n_cols":5,"rows_kept":16,"cut":false,"hidden":false,"merged":[[3,0,10,0],[3,1,10,1]]}
["Datasheet Values",null,"Typ","Min","R-OCP"]
[null,null,"mV","mV","kohm"]
[]
["V_OCP","Valley current limit\n OCP voltage set",4,3.7,20]
[null,null,8,5.9,24]
[null,null,13,10.6,30]
[null,null,19,15.4,39]
[null,null,25,21.3,56]
[null,null,32,28.4,75]
[null,null,40,36.299999999999997,100]
[null,null,49,45,150]
[]
[]
["Acs","Current Sense Amplifier Gain",10,"V/V"]
["VREF","Reference Voltage",1.7,"V"]
["V_THRMSD","Voltage at Thermal Shutdown due to THERM pin.",1.1000000000000001,"V"]