{"text_format":"1","workbook":"xlsx","n_sheets":12,"sheets":["Instructions","Design Converter","BOM & Schematic","Fsw & Ripple","Losses","EVM","Design EMI Filter","Variable Mgmt","Standard Value Calculator","Efficiency","Schematic Mgmt","Efficiency Plots"],"not_rendered":{"charts":6,"images":24,"macros":1,"external_links":0,"defined_names":205,"comments":4,"pivot_tables":0},"unopened":[],"bounds":{"document_bytes":16777216,"sheet_cells":100000,"rows_first":2000,"rows_last":500,"rows_between":2000,"halvings":0,"cell_chars":16384,"cell_head_chars":4096},"cells_cut":0,"cells_raw":0,"read":"whole","date_system":"1900"}

{"sheet":"Instructions","index":0,"n_rows":74,"n_cols":3,"rows_kept":74,"cut":false,"hidden":true,"merged":[[0,0,0,16],[7,1,9,15],[16,2,17,15],[11,1,14,15],[18,2,19,15],[65,1,66,15],[69,1,70,15],[73,1,74,15],[77,1,78,15],[20,2,21,15],[50,1,52,15],[54,1,55,15],[56,1,57,15],[60,1,62,15],[24,1,26,15],[38,1,39,15],[41,1,43,15],[46,1,47,15],[28,1,28,15],[29,1,31,15],[33,1,35,15]]}
["                         LM5164 Low IQ DC/DC Converter Design Tool  "]
[]
[]
[null,"Design Regulator tab"]
[null,"Start with Step 1, and then work down towards the bottom of the worksheet."]
[]
[null,"Step 1. Operating Specifications"]
[null,"First, enter the values in the yellow shaded cells to define the power supply parameters.  If a particular specification is not known, enter an estimate. It can be changed later, if necessary, to optimize component values.  Cells  with a red mark in the upper right corner have a comment to provide additional information.  Hold the cursor over the cell to read the comment.  A red font indicates an erroneous entry and requires an adjustment to the entry.  Consult the entry's comments for the entry specific requirements."]
[]
[]
[]
[null,"Second, select a desired mode of operation. PFM mode requires the fewest external components and the lowest inductance.  As a result, it can provide the smallest solution size. At light loads, a PFM converter has a relatively longer sleep time interval and thus operates at lower input quiescent current levels.  COT mode offers nearly constant switching frequency, relatively higher conversion efficiencies at medium to heavy loads, and enables the lowest output voltage ripple.  Options COT1, COT2, and COT3 enable you to select a ripple generation method (a requirement for the stable operation in COT mode):"]
[]
[]
[]
[]
[null,"-COT1: ","Type 1 ripple generation method requires a single resistor in series with the output capacitor.  It is the simplest, the most compact, and the most economical method that works with fixed and adjustable device options, however, the output voltage ripple is the highest."]
[]
[null,"-COT2: ","Type 2 ripple generation method requires a feedforward capacitor in addition to the series resistor.  The feedforward capacitor reduces the required minimum value of the series resistor and ultimately the output voltage ripple by the VOUT / 1.223V factor.  It only works with an adjustable device option (i.e. external feedback resistor network)."]
[]
[null,"-COT3:","Type 3 ripple generation method three external components to generate and inject required voltage ripple into the FB node.  In return, it provides the lowest output voltage ripple. It also only works with an adjustable device option (i.e. external feedback resistor network)."]
[]
[]
[null,"Step 2. Filter Inductor"]
[null,"First, select an inductor current limit level.  In PFM Mode, 1.25A, 0.75A, 0.5A, and 1.25A - MOD options are available.  For the 500mA max load, select either 1.25A or 1.25A - MOD option.  The 1.25A - MOD option enables higher efficiency at the expense of slightly worse transient operation.  For the 300mA and 200mA max loads, select 0.75A and 0.5A options respectively. In COT Mode, 0.75A and 0.5A options are available.   For the 500mA and 300mA max loads, select 0.75A and 0.5A options respectively."]
[]
[]
[]
[null,"Second, select the filter inductance value based on the suggested value. Enter the inductor RDC for accurate efficiency estimates."]
[null,"In PFM mode, selected inductance defines the switching frequency.  You may select lower or higher inductance to increase or decrease the switching frequency.  Watch the minimum output capacitance.  At very low switching frequencies, the required minimum capacitance may become excessive."]
[]
[]
[]
[null,"In COT mode, the suggested inductance is  derived based on the target inductor (peak-to-peak) ripple current of 40% of the DC full load output current at nominal input voltage. It may be acceptable to use higher ripple current with the proviso that peak inductor current remains below the ILIM setting.  Pk-to-Pk Ripple Current value will turn red if this is violated.  If this happens, increase the selected inductance or decrease the Input Voltage (max) or both."]
[]
[]
[]
[null,"Step 3. Output Capacitors and Ripple Generation"]
[null,"First, select the output capacitance based on the minimum recommended value.  Make sure that the nominal capacitance is appropriately derated for applied voltage, especially with ceramics.  For PFM and COT3 modes, ensure that the capacitor ESR does not exceed the maximum allowable value.  "]
[]
[]
[null,"Second, for COT modes, select the values for the ripple generation components based on the minimum recommended values.  Ensure that the output voltage ripple meets any of your minimum ripple requirements by reviewing the VOUT Ripple vs. IOUT plot in the fSW&Ripple tab.  For accurate output voltage ripple estimates in COT3 mode, ensure that the Output Capacitor ESR is set to the levels of a typical ceramic capacitor ESR (e.g. 10 mW)."]
[]
[]
[]
[null,"Step 4. Input Capacitors"]
[null,"Select the input capacitance based on the minimum recommended value.  Make sure that the nominal capacitance is appropriately derated for applied voltage, especially with ceramics.  "]
[]
[]
[null,"Step 5. Feedback, Soft-Start, UVLO"]
[null,"First, review the feedback resistor network. With an adjustable device option, an external feedback resistor network is required. The resistor values are automatically calculated based on the selected VOUT in Step 1.  For lowering the leakage current through the resistors, adjust the upper FB resistor (R1) until the lower FB resistor (R2) reaches its upper end of the range (100kW).  Keeping the upper FB resistor below 1MW is recommended."]
[]
[]
[]
[null,"Second, select one out of three soft-start configurations.  If the external soft-start option is selected, enter a desired soft start time.  "]
[]
[null,"Third, select one out of the two UVLO options.  If the external UVLO option is selected, define desired UVLO thresholds and hysteresis.  Keeping the upper UVLO resistor at 1MW or higher is recommended for the minimum leakage current."]
[]
[]
[null,"Step 6. Efficiency and Thermals"]
[null,"Enter the LM5166's junction-to-ambient thermal impedance (dependent on your PCB design, air flow, etc.) and ambient temperature. Device power dissipation and junction temperature are derived at the maximum load.  Ensure that the junction temperature is within the recommended range."]
[]
[]
[]
[null,"BOM & Schematic tab"]
[null,"This tab summarizes the converter schematic and BOM.  It also helps you estimate the total solution size. Select a package size for each external component (i.e. inductor, capacitors, and resistors) for accurate solution size estimates."]
[]
[]
[null,"Design EMI Filter tab"]
[null,"In case an EMI filter is needed, a simple EMI filter design aid is given in this tab.  It is based on the guidelines documented in TI's literature number SNVA489C (aka AN-2162).  Suggest reviewing the note before using the design aid."]
[]
[]
[null,"fSW & Ripple tab"]
[null,"In this tab, the switching/burst frequency (COT/PFM mode) and the output voltage ripple as a function of the load current are plotted."]

{"sheet":"Design Converter","index":1,"n_rows":58,"n_cols":17,"rows_kept":58,"cut":false,"hidden":false,"merged":[[2,14,2,15],[0,0,0,16]]}
["                          LM5163/4 Low IQ DC/DC Converter Design Tool  "]
[null,null,null,null,null,null,null,null,null,null,null,null,null,null,"http://www.ti.com/ww/en/analog/power_management/widevin"]
["About",null,"xx",null,null,"= Input Box",null,null,null,null,null,null,null,null,"Terms Of Use",null,"                "]
[]
["Step 1: Operating Specifications"]
[null,null,null,"Input Voltage - Min, VIN(min) ",12,"V"]
[null,null,null,"Input Voltage - Nom, VIN(nom)",48,"V"]
[null,null,null,"Input Voltage - Max, VIN(max)",90,"V"]
[null,null,null,"Output Voltage, VOUT ",12,"V"]
[null,null,null,"Full Load Current, IOUT",0.25,"A"]
[null,null,null,"Mode of Operation",null,null,{"$f":"MODE","v":3}]
[null,null,null,"Switching Frequency at VIN(nom)",1200,"kHz"]
[null,null,null,"Timing Resistance, RT",{"$f":"'Standard Value Calculator'!J4/1000","v":24.9},"kΩ"]
[]
["Step 2: Buck Inductor"]
[null,null,null,"Recommended Buck Inductance ",{"$f":"Lopt*1000000","v":75},"µH"]
[null,null,null,"Inductance, LF ",33,"µH"]
[null,null,null,"Inductor DCR ",120,"mΩ"]
[null,null,null,{"$f":"CHOOSE(MODE, \"Pk-to-Pk Ripple Current\",\"Pk-to-Pk Ripple Current\",\"Pk-to-Pk Ripple Current\", \"Resulting PFM Switching Frequency\")","v":"Pk-to-Pk Ripple Current"},{"$f":"Iripple_Vinnom*1000","v":227.81703913255149},"mApk-pk"]
[null,null,null,{"$f":"CHOOSE(MODE, 'Variable Mgmt'!H88,'Variable Mgmt'!H88,'Variable Mgmt'!H88, 'Variable Mgmt'!H89)","v":"% Ripple Current at Nom VIN"},{"$f":"IF(OR(MODE=1,MODE=2,MODE=3), 'Variable Mgmt'!B96*100, Ilim/2*1000)","v":91.1268156530206},{"$f":"IF(OR(MODE=1,MODE=2,MODE=3), \"%\", \"mA\")","v":"%"}]
[]
[{"$f":"IF(MODE=4, \"Step 3: Output Capacitors\", \"Step 3: Output Capacitors, Ripple Generation\")","v":"Step 3: Output Capacitors, Ripple Generation"}]
[null,null,null,"Minimum Output Capacitance ",{"$f":"'Variable Mgmt'!B116","v":2.2000000000000002},"µF"]
[null,null,null,"Output Capacitance, COUT ",33,"µF"]
[null,null,null,{"$f":"IF(OR(MODE=1,MODE=2),\"Recommended Series Resistance\",IF(MODE=3,\"Maximum Allowable ESR\",\"*Higher Cout Improves Light-Load Eff\"))","v":"Maximum Allowable ESR"},{"$f":"'Variable Mgmt'!B272","v":0.26300000000000001},"Ω"]
[null,null,null,{"$f":"IF(OR(MODE=1,MODE=2),\"Total ESR & Series Resistance, Rser\",IF(MODE=3,\"Output Capacitor ESR\",\"*PFM Hysteresis Sets Output Ripple\"))","v":"Output Capacitor ESR"},5.0000000000000001E-3,"Ω"]
[null,null,null,{"$f":"CHOOSE(MODE, \"Resulting Output Voltage Ripple\",\"Resulting Output Voltage Ripple\", \"Output Voltage Ripple\",\"Output Voltage Ripple\")","v":"Output Voltage Ripple"},{"$f":"CHOOSE(MODE, Vripple2*1000,Vripple2*1000,Vripple2*1000, PFM_Ripple)","v":1.3470886587073709},"mVpk-pk"]
[null,null,null,{"$f":"IF(MODE=1,\"\",IF(MODE=2,\"Minimum Feedforward Capacitance\", IF(MODE=3,\"Minimum Coupling Capacitance\",\"\")))","v":"Minimum Coupling Capacitance"},{"$f":"'Variable Mgmt'!B140","v":">47"},"pF"]
[null,null,null,{"$f":"IF(MODE=1,\"\",IF(MODE=2,\"Feedforward Capacitance, Cff\", IF(MODE=3,\"Coupling Capacitance, Cb\",\"\")))","v":"Coupling Capacitance, Cb"},56,"pF",null,null,null,null,null,"** Specify Inductor Core Loss **",100,"mW"]
[null,null,null,{"$f":"IF(MODE=3,\"Minimum Ripple Generation Capacitance\",\"\")","v":"Minimum Ripple Generation Capacitance"},{"$f":"'Variable Mgmt'!B144","v":">185"},"pF"]
[null,null,null,{"$f":"IF(MODE=3,\"Ripple Generation Capacitance, Ca\",\"\")","v":"Ripple Generation Capacitance, Ca"},2200,"pF"]
[null,null,null,{"$f":"IF(MODE=3,\"Ripple Generation Resistance, Ra\",\"\")","v":"Ripple Generation Resistance, Ra"},{"$f":"Ra","v":169},"kΩ"]
[null,null,null,{"$f":"IF(MODE=3,\"Amplitude of Injected Ripple\",\"\")","v":"Amplitude of Injected Ripple"},20,"mVpk-pk"]
[]
["Step 4: Input Capacitors"]
[null,null,null,"Minimum Input Capacitance ",{"$f":"'Variable Mgmt'!B157","v":2.2000000000000002},"µF"]
[null,null,null,"Input Capacitance, CIN ",2.2000000000000002,"µF"]
[null,null,null,"Maximum Allowable ESR",{"$f":"'Variable Mgmt'!B159","v":6.5460247930080966},"Ω"]
[null,null,null,"Input Capacitor ESR ",3,"mΩ"]
[null,null,null,"Resulting Input Voltage Ripple ",{"$f":"CHOOSE(MODE, Vinripple2*1000,Vinripple2*1000,Vinripple2*1000, 'Variable Mgmt'!B165*1000)","v":18.937534090986134},"mVpk-pk"]
[]
["Step 5: Feedback, PGOOD, UVLO"]
[null,null,null,"Upper Feedback Resistor, RFB1 ",453,"kΩ"]
[null,null,null,"Lower Feedback Resistor, RFB2",{"$f":"IF(Vout=Vref,\"OPEN\",Rfb2_u/1000)","v":49.9},{"$f":"IF(Vout=Vref,\"\",\"kΩ\")","v":"kΩ"}]
[null,null,null,"Acutal Output Voltage Setpoint",{"$f":"'Variable Mgmt'!B201","v":12.0937875751503},"V"]
[null,null,null,"PGOOD Pull-up Resistance",20,{"$f":"\"kΩ\"","v":"kΩ"},null,null,null,null,null,null,null,null,null,null," "]
[null,null,null,"BST Capacitance, CBST ",2.2000000000000002,"nF"]
[null,null,null,{"$f":"\"Required Input Voltage UVLO Turn-on\"","v":"Required Input Voltage UVLO Turn-on"},6,"V"]
[null,null,null,"Upper UVLO Resistor, RUV1",1,"MΩ"]
[null,null,null,"Lower UVLO Resistor, RUV2",{"$f":"'Variable Mgmt'!F276","v":332},{"$f":"'Variable Mgmt'!G276","v":"kΩ"}]
[null,null,null,"Actual UVLO Turn-on Threshold",{"$f":"'Variable Mgmt'!B186","v":6.0180722891566267},"V"]
[null,null,null,"Actual UVLO Turn-off Threshold",{"$f":"'Variable Mgmt'!B187","v":5.6168674698795176},"V"]
[]
["Step 6: Efficiency & Thermals"]
[null,null,null,"Estimated Thermal Impedance, JJA",41,"°C/W"]
[null,null,null,"Ambient Temp, TA",25,"°C"]
[null,null,null,"IC Power Dissipation at Full Load, PD",{"$f":"'Variable Mgmt'!B26","v":0.89407497215228726},"W"]
[null,null,null,"IC Junction Temp at Full Load, TJ",{"$f":"E56+E55*'Variable Mgmt'!B26","v":61.657073858243777},"°C"]

{"sheet":"BOM & Schematic","index":2,"n_rows":53,"n_cols":13,"rows_kept":53,"cut":false,"hidden":false,"merged":[[33,3,33,5],[0,0,0,16],[29,3,29,5],[41,3,41,5],[47,7,47,9],[30,3,30,5],[43,3,43,5],[44,3,44,5],[42,3,42,5],[39,3,39,5],[40,3,40,5],[38,3,38,5],[37,3,37,5],[36,3,36,5],[31,3,31,5],[34,3,34,5],[32,3,32,5]]}
["                         LM5163/4 100V Low IQ DC/DC Converter Design Tool  "]
[]
[]
[]
[]
[]
[]
[]
[]
[]
[]
[]
[]
[]
[]
[]
[]
[]
[]
[]
[]
[]
[]
[]
[]
[]
[]
[{"$f":"\"VIN = \"&Vin&\" V, VOUT = \"&Vout&\" V, IOUT = \"&Iout&\" A \"&'Variable Mgmt'!B35&\" Converter\"","v":"VIN = 48 V, VOUT = 12 V, IOUT = 0.25 A COT Converter"}]
["Low IQ, High Efficiency, Synchronous Buck Converter BOM"]
["Count","Ref Des","Value","Description",null,null,"Size","Part Number","MFR","Footprint (mm)","Area (mm2)"]
[{"$f":"ROUNDUP('Design Converter'!E37/10,0)","v":1},"CIN",{"$f":"Cin*1000000","v":2.2000000000000002},{"$f":"IF(VIN_max>35, \"Capacitor, Ceramic, \"&'Variable Mgmt'!B257&\", 100V, X7R, 10%\", \"Capacitor, Ceramic, \"&'Variable Mgmt'!B257&\", 50V, X7R, 10%\")","v":"Capacitor, Ceramic, 2.2µF, 100V, X7R, 10%"},null,null,5,"Std","Std",{"$f":"CHOOSE(G31,'Variable Mgmt'!T$41,'Variable Mgmt'!T$42,'Variable Mgmt'!T$43,'Variable Mgmt'!T$44,'Variable Mgmt'!T$45)","v":"3.2 x 2.5"},{"$f":"CHOOSE(G31,'Variable Mgmt'!U$41,'Variable Mgmt'!U$42,'Variable Mgmt'!U$43,'Variable Mgmt'!U$44,'Variable Mgmt'!U$45)","v":8}]
[{"$f":"'Variable Mgmt'!D252","v":2},"COUT",{"$f":"'Variable Mgmt'!F253","v":"22µF"},{"$f":"CHOOSE(Cout_Voltage_Rating, \"Capacitor, Ceramic, \"&'Variable Mgmt'!F253&\", 6.3V, X7R, 10%\", \"Capacitor, Ceramic, \"&'Variable Mgmt'!F253&\", 10V, X7R, 10%\", \"Capacitor, Ceramic, \"&'Variable Mgmt'!F253&\", 16V, X7R, 10%\", \"Capacitor, Ceramic, \"&'Variable Mgmt'!F253&\", 25V, X7R, 10%\",  \"Capacitor, Ceramic, \"&'Variable Mgmt'!F253&\", 50V, X7R, 10%\")","v":"Capacitor, Ceramic, 22µF, 16V, X7R, 10%"},null,null,5,"Std","Std",{"$f":"CHOOSE(G32,'Variable Mgmt'!T$41,'Variable Mgmt'!T$42,'Variable Mgmt'!T$43,'Variable Mgmt'!T$44,'Variable Mgmt'!T$45)","v":"3.2 x 2.5"},{"$f":"(CHOOSE(G32,'Variable Mgmt'!U$41,'Variable Mgmt'!U$42,'Variable Mgmt'!U$43,'Variable Mgmt'!U$44,'Variable Mgmt'!U$45))*A32","v":16}]
[{"$f":"CHOOSE(MODE, \"-\", \"-\", \"1\",\"-\")","v":"1"},{"$f":"CHOOSE(MODE,\"-\",\"-\",\"Ca\",\"-\")","v":"Ca"},{"$f":"CHOOSE(MODE, \"-\",\"-\",'Variable Mgmt'!B293, \"-\")","v":"2200pF"},{"$f":"CHOOSE(MODE,\"-\",\"-\", \"Capacitor, Ceramic, \"&'Variable Mgmt'!B293&\", 16V, X7R, 10%\", \"-\")","v":"Capacitor, Ceramic, 2200pF, 16V, X7R, 10%"},null,null,1,{"$f":"CHOOSE(MODE, \"-\", \"-\", \"Std\", \"-\")","v":"Std"},{"$f":"H33","v":"Std"},{"$f":"CHOOSE(MODE,\"\",\"\",CHOOSE(G33,'Variable Mgmt'!T$41,'Variable Mgmt'!T$42,'Variable Mgmt'!T$43,'Variable Mgmt'!T$44,'Variable Mgmt'!T$45),\"\")","v":"1.0 x 0.5"},{"$f":"CHOOSE(MODE,\"\",\"\",CHOOSE(G33,'Variable Mgmt'!U$41,'Variable Mgmt'!U$42,'Variable Mgmt'!U$43,'Variable Mgmt'!U$44,'Variable Mgmt'!U$45),\"\")","v":0.5}]
[{"$f":"CHOOSE(MODE, \"-\", \"1\", \"1\",\"-\")","v":"1"},{"$f":"CHOOSE(MODE,\"-\",\"Cff\",\"Cb\",\"-\")","v":"Cb"},{"$f":"CHOOSE(MODE, \"-\",'Variable Mgmt'!B290,'Variable Mgmt'!B290, \"-\")","v":"56pF"},{"$f":"CHOOSE(MODE,\"-\",\"Capacitor, Ceramic, \"&'Variable Mgmt'!B290&\", 50V, X7R, 10%\", \"Capacitor, Ceramic, \"&'Variable Mgmt'!B290&\", 50V, X7R, 10%\", \"-\")","v":"Capacitor, Ceramic, 56pF, 50V, X7R, 10%"},null,null,1,{"$f":"CHOOSE(MODE, \"-\", \"Std\", \"Std\", \"-\")","v":"Std"},{"$f":"H34","v":"Std"},{"$f":"CHOOSE(MODE,\"\",CHOOSE(G34,'Variable Mgmt'!T$41,'Variable Mgmt'!T$42,'Variable Mgmt'!T$43,'Variable Mgmt'!T$44,'Variable Mgmt'!T$45),CHOOSE(G34,'Variable Mgmt'!T$41,'Variable Mgmt'!T$42,'Variable Mgmt'!T$43,'Variable Mgmt'!T$44,'Variable Mgmt'!T$45),\"\")","v":"1.0 x 0.5"},{"$f":"CHOOSE(MODE,\"\",CHOOSE(G34,'Variable Mgmt'!U$41,'Variable Mgmt'!U$42,'Variable Mgmt'!U$43,'Variable Mgmt'!U$44,'Variable Mgmt'!U$45),CHOOSE(G34,'Variable Mgmt'!U$41,'Variable Mgmt'!U$42,'Variable Mgmt'!U$43,'Variable Mgmt'!U$44,'Variable Mgmt'!U$45),\"\")","v":0.5}]
[1,"CBST","2.2nF","Capacitor, Ceramic, 2.2nF, 25V, X7R, 10%",null,null,1,{"$f":"CHOOSE(MODE, \"-\", \"Std\", \"Std\", \"-\")","v":"Std"},{"$f":"H35","v":"Std"},{"$f":"CHOOSE(MODE,\"\",CHOOSE(G35,'Variable Mgmt'!T$41,'Variable Mgmt'!T$42,'Variable Mgmt'!T$43,'Variable Mgmt'!T$44,'Variable Mgmt'!T$45),CHOOSE(G35,'Variable Mgmt'!T$41,'Variable Mgmt'!T$42,'Variable Mgmt'!T$43,'Variable Mgmt'!T$44,'Variable Mgmt'!T$45),\"\")","v":"1.0 x 0.5"},{"$f":"CHOOSE(MODE,\"\",CHOOSE(G35,'Variable Mgmt'!U$41,'Variable Mgmt'!U$42,'Variable Mgmt'!U$43,'Variable Mgmt'!U$44,'Variable Mgmt'!U$45),CHOOSE(G35,'Variable Mgmt'!U$41,'Variable Mgmt'!U$42,'Variable Mgmt'!U$43,'Variable Mgmt'!U$44,'Variable Mgmt'!U$45),\"\")","v":0.5}]
[]
[1,"LF",{"$f":"'Design Converter'!E17","v":33},{"$f":"\"Inductor, \"&Lf*1000000&\" µH, \"&Rdcr*1000&\" mΩ, >\"&ROUNDUP(Isat_min,2)&\"A\"","v":"Inductor, 33 µH, 120 mΩ, >1.8A"},null,null,4,"Various","Various",{"$f":"CHOOSE(G37,'Variable Mgmt'!T50,'Variable Mgmt'!T51,'Variable Mgmt'!T52,'Variable Mgmt'!T53,'Variable Mgmt'!T54,'Variable Mgmt'!T55,'Variable Mgmt'!T56)","v":"6.0 x 6.0"},{"$f":"CHOOSE(G37,'Variable Mgmt'!U50,'Variable Mgmt'!U51,'Variable Mgmt'!U52,'Variable Mgmt'!U53,'Variable Mgmt'!U54,'Variable Mgmt'!U55,'Variable Mgmt'!U56)","v":36}]
[null,null,null,null,null,null,null,null,null,null,{"$f":"IF(MODE_RSET=2,CHOOSE(G38,'Variable Mgmt'!U$41,'Variable Mgmt'!U$42,'Variable Mgmt'!U$43,'Variable Mgmt'!U$44,'Variable Mgmt'!U$45),\"\")","v":""}]
[{"$f":"CHOOSE(MODE, \"1\",\"1\",\"1\", \"-\")","v":"1"},"RT",{"$f":"CHOOSE(MODE, 'Design Converter'!E13, 'Design Converter'!E13,'Design Converter'!E13,\"-\")","v":24.9},{"$f":"C39","v":24.9},null,null,1,{"$f":"CHOOSE(MODE, \"Std\",\"Std\",\"Std\",\"-\")","v":"Std"},{"$f":"H39","v":"Std"},{"$f":"CHOOSE(MODE,CHOOSE(G39,'Variable Mgmt'!T$41,'Variable Mgmt'!T$42,'Variable Mgmt'!T$43,'Variable Mgmt'!T$44,'Variable Mgmt'!T$45),CHOOSE(G39,'Variable Mgmt'!T$41,'Variable Mgmt'!T$42,'Variable Mgmt'!T$43,'Variable Mgmt'!T$44,'Variable Mgmt'!T$45),CHOOSE(G39,'Variable Mgmt'!T$41,'Variable Mgmt'!T$42,'Variable Mgmt'!T$43,'Variable Mgmt'!T$44,'Variable Mgmt'!T$45),\"\")","v":"1.0 x 0.5"},{"$f":"CHOOSE(MODE,CHOOSE(G39,'Variable Mgmt'!U$41,'Variable Mgmt'!U$42,'Variable Mgmt'!U$43,'Variable Mgmt'!U$44,'Variable Mgmt'!U$45),CHOOSE(G39,'Variable Mgmt'!U$41,'Variable Mgmt'!U$42,'Variable Mgmt'!U$43,'Variable Mgmt'!U$44,'Variable Mgmt'!U$45),CHOOSE(G39,'Variable Mgmt'!U$41,'Variable Mgmt'!U$42,'Variable Mgmt'!U$43,'Variable Mgmt'!U$44,'Variable Mgmt'!U$45),\"\")","v":0.5}]
[1,"RFB1",{"$f":"Rfb1_/1000","v":453},453,null,null,1,{"$f":"CHOOSE(MODE_VOUT,\"-\",\"Std\")","v":"Std"},{"$f":"H40","v":"Std"},{"$f":"(CHOOSE(MODE_VOUT,\"\",CHOOSE(G40,'Variable Mgmt'!T$41,'Variable Mgmt'!T$42,'Variable Mgmt'!T$43,'Variable Mgmt'!T$44,'Variable Mgmt'!T$45)))","v":"1.0 x 0.5"},{"$f":"CHOOSE(MODE_VOUT,\"\",CHOOSE(G40,'Variable Mgmt'!U$41,'Variable Mgmt'!U$42,'Variable Mgmt'!U$43,'Variable Mgmt'!U$44,'Variable Mgmt'!U$45))","v":0.5}]
[1,"RFB2",{"$f":"Rfb2_u/1000","v":49.9},49.9,null,null,1,{"$f":"CHOOSE(MODE_VOUT,\"-\",\"Std\")","v":"Std"},{"$f":"H41","v":"Std"},{"$f":"CHOOSE(MODE_VOUT,\"\",CHOOSE(G41,'Variable Mgmt'!T$41,'Variable Mgmt'!T$42,'Variable Mgmt'!T$43,'Variable Mgmt'!T$44,'Variable Mgmt'!T$45))","v":"1.0 x 0.5"},{"$f":"CHOOSE(MODE_VOUT,\"\",CHOOSE(G41,'Variable Mgmt'!U$41,'Variable Mgmt'!U$42,'Variable Mgmt'!U$43,'Variable Mgmt'!U$44,'Variable Mgmt'!U$45))","v":0.5}]
[{"$f":"IF(MODE=3,\"1\",\"-\")","v":"1"},{"$f":"CHOOSE(MODE,\"-\",\"-\",\"Ra\",\"-\")","v":"Ra"},{"$f":"'Variable Mgmt'!F296","v":"169k"},{"$f":"\"Resistor, Chip, \"&'Variable Mgmt'!B296&\", 1/16W, 1%\"","v":"Resistor, Chip, 169kΩ, 1/16W, 1%"},null,null,1,{"$f":"CHOOSE(MODE, \"-\", \"-\", \"Std\", \"-\")","v":"Std"},{"$f":"H42","v":"Std"},{"$f":"CHOOSE(MODE,\"\",\"\",CHOOSE(G42,'Variable Mgmt'!T$41,'Variable Mgmt'!T$42,'Variable Mgmt'!T$43,'Variable Mgmt'!T$44,'Variable Mgmt'!T$45),\"\")","v":"1.0 x 0.5"},{"$f":"CHOOSE(MODE,\"\",\"\",CHOOSE(G42,'Variable Mgmt'!U$41,'Variable Mgmt'!U$42,'Variable Mgmt'!U$43,'Variable Mgmt'!U$44,'Variable Mgmt'!U$45),\"\")","v":0.5}]
[1,"RPGOOD",100,100,null,null,1,"Std","Std",{"$f":"CHOOSE(G43,'Variable Mgmt'!T$41,'Variable Mgmt'!T$42,'Variable Mgmt'!T$43,'Variable Mgmt'!T$44,'Variable Mgmt'!T$45)","v":"1.0 x 0.5"},{"$f":"CHOOSE(G43,'Variable Mgmt'!U$41,'Variable Mgmt'!U$42,'Variable Mgmt'!U$43,'Variable Mgmt'!U$44,'Variable Mgmt'!U$45)","v":0.5}]
[{"$f":"CHOOSE(MODE_UVLO, \"1\", \"-\")","v":"1"},"RUV1",{"$f":"CHOOSE(MODE_UVLO, 'Variable Mgmt'!H275, \"-\")","v":"1M"},{"$f":"CHOOSE(MODE_UVLO, \"Resistor, Chip, \"&'Variable Mgmt'!C275&\", 1/16W, 1%\", \"-\")","v":"Resistor, Chip, 1MΩ, 1/16W, 1%"},null,null,2,{"$f":"CHOOSE(MODE_UVLO,\"Std\",\"-\")","v":"Std"},{"$f":"H44","v":"Std"},{"$f":"CHOOSE(MODE_UVLO,CHOOSE(G44,'Variable Mgmt'!T$41,'Variable Mgmt'!T$42,'Variable Mgmt'!T$43,'Variable Mgmt'!T$44,'Variable Mgmt'!T$45),\"\")","v":"1.6 x 0.8"},{"$f":"CHOOSE(MODE_UVLO,CHOOSE(G44,'Variable Mgmt'!U$41,'Variable Mgmt'!U$42,'Variable Mgmt'!U$43,'Variable Mgmt'!U$44,'Variable Mgmt'!U$45),\"\")","v":1.3}]
[{"$f":"CHOOSE(MODE_UVLO, \"1\", \"-\")","v":"1"},"RUV2",{"$f":"CHOOSE(MODE_UVLO, 'Variable Mgmt'!H276, \"-\")","v":"332k"},{"$f":"CHOOSE(MODE_UVLO, \"Resistor, Chip, \"&'Variable Mgmt'!C276&\", 1/16W, 1%\", \"-\")","v":"Resistor, Chip, 332kΩ, 1/16W, 1%"},null,null,1,{"$f":"CHOOSE(MODE_UVLO,\"Std\",\"-\")","v":"Std"},{"$f":"H45","v":"Std"},{"$f":"CHOOSE(MODE_UVLO,CHOOSE(G45,'Variable Mgmt'!T$41,'Variable Mgmt'!T$42,'Variable Mgmt'!T$43,'Variable Mgmt'!T$44,'Variable Mgmt'!T$45),\"\")","v":"1.0 x 0.5"},{"$f":"CHOOSE(MODE_UVLO,CHOOSE(G45,'Variable Mgmt'!U$41,'Variable Mgmt'!U$42,'Variable Mgmt'!U$43,'Variable Mgmt'!U$44,'Variable Mgmt'!U$45),\"\")","v":0.5}]
[1,"U1",{"$f":"CHOOSE(VARIANT, \"LM5163-Q1\", \"LM5164-Q1\")","v":"LM5164-Q1"},{"$f":"CHOOSE(VARIANT, \"IC, LM51643-Q1, Buck Converter, 6V–100V Input\", \"IC, LM5164-Q1, Buck Converter, 6V–100V Input\")","v":"IC, LM5164-Q1, Buck Converter, 6V–100V Input"},null,null,"SOIC-8",{"$f":"CHOOSE(VARIANT, \"LM5163QDDATQ1\", \"LM5164QDDATQ1\")","v":"LM5164QDDATQ1"},"TI","5.0 x 6.0",30]
[]
[null,{"$f":"\"Total Solution Size (padded by 15%) = \"&ROUND(K48,1)&\" mm^2 = \"&ROUND(M48,3)&\" in^2\"","v":"Total Solution Size (padded by 15%) = 110.2 mm^2 = 0.171 in^2"},null,null,null,null,null,null,null,null,{"$f":"SUM(K31:K46)*1.15","v":110.16999999999999},null,{"$f":"K48/25.4/25.4","v":0.17076384152768304}]
[]
["NOTES:"]
["* Inductor saturation current should be higher than the peak inductor current setting for all operating temperatures *"]
["** Effective input and output capacitances should be appropriately derated for applied voltage and temperature, particularly with ceramics **"]
["***Estimated total solution size does not include EMI filter***"]

{"sheet":"Fsw & Ripple","index":3,"n_rows":1,"n_cols":1,"rows_kept":1,"cut":false,"hidden":true,"merged":[[0,0,0,16]]}
["                         LM5164 Low IQ DC/DC Converter Design Tool  "]

{"sheet":"Losses","index":4,"n_rows":42,"n_cols":6,"rows_kept":42,"cut":false,"hidden":true,"merged":[[0,0,0,16]]}
["                         LM5166 Low IQ DC/DC Converter Design Tool  "]
[]
[]
[]
[null,null,null,"Load Current",500,"mA"]
[]
[]
[]
[]
[]
[]
[]
[]
[]
[]
[]
[]
[]
[]
[]
[]
[]
[]
[]
[]
[]
[]
[]
[]
[]
[]
[]
[]
[]
[]
[]
[]
[]
[]
[]
[]
[null,null,null,"Inductor Core Loss Constant",0]

{"sheet":"EVM","index":5,"n_rows":85,"n_cols":15,"rows_kept":85,"cut":false,"hidden":false,"merged":[[0,0,0,16]]}
["LM5163/4 100V, Low IQ DC/DC Converter Design Tool  "]
[]
[null,"LM5164-Q1EVM-041 PCB Layout"]
[]
[null,null,null,null,null,null,null,null,null,null,null,null,null,null,"Top"]
[null,null,null,null,null,null,null,null,null,null,null,null,null,null,"Layer"]
[]
[]
[]
[]
[]
[]
[]
[]
[]
[]
[]
[]
[]
[]
[]
[]
[]
[]
[]
[]
[]
[]
[]
[]
[null,null,null,null,null,null,null,null,null,null,null,null,null,null,"Layer 2"]
[]
[]
[]
[]
[]
[]
[]
[]
[]
[]
[]
[]
[]
[]
[]
[]
[]
[]
[]
[]
[]
[]
[]
[]
[]
[null,null,null,null,null,null,null,null,null,null,null,null,null,null,"Layer 3"]
[]
[]
[]
[]
[]
[]
[]
[]
[]
[]
[]
[]
[]
[]
[]
[]
[]
[]
[]
[]
[]
[]
[]
[]
[]
[]
[null,null,null,null,null,null,null,null,null,null,null,null,null,null,"Bottom"]
[null,null,null,null,null,null,null,null,null,null,null,null,null,null,"Layer"]

{"sheet":"Design EMI Filter","index":6,"n_rows":33,"n_cols":15,"rows_kept":33,"cut":false,"hidden":false,"merged":[[0,0,0,22],[32,10,32,12],[29,10,29,12],[31,10,31,12]]}
["                         LM5163/4 100V, Low IQ DC/DC Converter Design Tool  "]
[]
[]
[]
[]
[]
["Step 7: EMI Filter (Optional)"]
[null,null,null,"Desired Maximum Noise Level, Vnoise(MAX)",50,"dBmV"]
[null,null,null,"EMI Filter Inductance, LF(EMI)",22,"mH"]
[null,null,null,"Minimum EMI Filter Capacitance",{"$f":"'Variable Mgmt'!M164","v":2.1009806785294793E-2},"mF"]
[null,null,null,"EMI Filter Capacitance, CF(EMI)",4.7,"mF"]
[null,null,null,"Minimum EMI Filter Damping Capacitance",{"$f":"'Variable Mgmt'!M168","v":8.8000000000000007},"mF"]
[null,null,null,"EMI Filter Damping Capacitance, CD(EMI)",10,"mF"]
[null,null,null,"Minimum Damping Capacitor ESR",{"$f":"'Variable Mgmt'!M169","v":3.1622776601683795},"Ω"]
[null,null,null,"Damping Capacitor ESR, ESR CD(EMI)",3.3,"Ω"]
[]
[]
[]
[]
[]
[]
[]
[]
[]
[]
[]
[]
[]
[null,null,null,null,null,null,null,"EMI Filter BOM"]
[null,null,null,null,null,null,null,"Count","Ref Des","Value","Description",null,null,"Part Number","MFR"]
[null,null,null,null,null,null,null,1,"LF(EMI)",{"$f":"'Variable Mgmt'!B298","v":"22µH"},{"$f":"\"Inductor, \"&Lf_emi*1000000&\" µH, \"&ROUNDUP(Isat_min,2)&\"A\"","v":"Inductor, 22 µH, 1.8A"},null,null,"Std","Std"]
[null,null,null,null,null,null,null,1,"CF(EMI)",{"$f":"'Variable Mgmt'!B299","v":"4.7µF"},{"$f":"IF(VIN_max>35, \"Capacitor, Ceramic, \"&'Variable Mgmt'!B299&\", 100V, X7R, 10%\", \"Capacitor, Ceramic, \"&'Variable Mgmt'!B299&\", 50V, X7R, 10%\")","v":"Capacitor, Ceramic, 4.7µF, 100V, X7R, 10%"},null,null,"Std","Std"]
[null,null,null,null,null,null,null,1,"CD(EMI)",{"$f":"'Variable Mgmt'!B300","v":"10µF"},{"$f":"IF(VIN_max>35, \"Capacitor, Electrolytic, \"&'Variable Mgmt'!B300&\", 100V, ESR>\"&ESR_Cd&ohm, \"Capacitor, Electrolytic, \"&'Variable Mgmt'!B300&\", 50V, ESR>\"&ESR_Cd&ohm)","v":"Capacitor, Electrolytic, 10µF, 100V, ESR>3.3Ω"},null,null,"Std","Std"]

{"sheet":"Variable Mgmt","index":7,"n_rows":320,"n_cols":21,"rows_kept":320,"cut":false,"hidden":true,"merged":[[4,4,4,7],[0,0,0,8]]}
["EXCEL Variables Names/Calculations",null,null,null,null,null,null,null,null,null,null,"LM5166"]
[null,"Input from user ="]
[null,"Output ="]
[null,"Constant"]
["Variable Name","Value","STD Units",null,"Notes",null,null,null,"Iteration"]
["Step 1: Operational Specs"]
["VIN_min",{"$f":"'Design Converter'!E6","v":12},"V","Minimum input voltage",null,null,null,null,1]
["VIN_nom",{"$f":"'Design Converter'!E7","v":48},"V","Nominal input voltage"]
["VIN_max",{"$f":"'Design Converter'!E8","v":90},"V","Maximum input voltage"]
[]
["Vout",{"$f":"'Design Converter'!E9","v":12},"V","Output Voltage",null,null,null,null,1]
["Iout",{"$f":"'Design Converter'!E10","v":0.25},"A","Maximum Output Current",null,null,null,null,1]
["Rout",{"$f":"Vout/Iout","v":48},"W","Load resistance"]
["Pout",{"$f":"Vout*Iout","v":3},"W","Output power"]
[]
["Efficiency",0.9,null,"Estimate of efficiency"]
["Pin",{"$f":"Pout/Efficiency","v":3.333333333333333},"W","Calculate input power assuming 90% efficiency"]
["Iin_Vinmin",{"$f":"Pin/VIN_min","v":0.27777777777777773},"A"]
["Iin_Vinnom",{"$f":"Pin/VIN_nom","v":6.9444444444444434E-2},"A","Input currents at min, nom, max Vin"]
["Iin_Vinmax",{"$f":"Pin/VIN_max","v":3.7037037037037035E-2},"A"]
[]
["Fsw",{"$f":"'Design Converter'!E12*1000","v":1200000},"Hz","Nominal Switching Frequency",null,null,null,null,1]
["Vref",1.2,"V","Reference Voltage"]
["Rt",{"$f":"Vout*2500000000/Fsw","v":25000},"W","Frequency Set Resistor"]
[null,null,null,null,null,null,null,null,null,null,{"$f":"B34&\"_\"&F35&\"_\"&F39&\"_\"&I41&\"_\"&I36","v":"COT3_VOUTadj_UVLOadj_SSAdj_RsetGND"},null,null,null,null,null,"Vout<5V",100,1]
["Internal PD at Full Load",{"$f":" IF(OR(MODE=1,MODE=2,MODE=3), Efficiency!AZ106,#REF!)","v":0.89407497215228726},"W",null,null,null,null,null,null,null,null,null,null,null,null,null,"Vout<=8V",47,2]
[null,null,null,null,null,null,null,null,null,null,{"$f":"\"SCH_\"&B34&\"_\"&B41","v":"SCH_COT3_LM5164"},null,null,null,null,null,"Vout<=12V",22,3]
[null,null,null,null,null,null,null,null,null,null,null,null,null,null,null,null,"Vout<=20V",22,4]
["Step 2: Circuit Configuration for COT / PFM, Fixed / Adj Vout, ILIM, UVLO, SS",null,null,null,null,null,null,null,null,null,null,null,null,null,null,null,"Vout>20V",10,5]
[null,"COT Type I",1,null,null,null,null,null,null,null,null,null,null,null,null,null,"Cout Capacitance",{"$f":"CHOOSE(S30,\"100\", \"47\",\"22\",\"22\",\"10\")","v":"22"},{"$f":"IF(Vout<5, 1, IF(Vout<=8, 2, IF(Vout<=12, 3, IF(Vout<=20, 4, 5))))","v":3}]
[null,"COT Type II",2]
["COT/PFM ","COT Type III",3]
[null,null,null,null,"VOUT Fixed/Adjustable","Fixed",1,null,"ILIM shorted",1,{"$f":"B34&\", \"&F35&\", \"&I36&\", \"&F39&\", \"&I41","v":"COT3, VOUTadj, RsetGND, UVLOadj, SSAdj"},null,null,null,null,null,"Vout<=5V","6.3V",1]
["MODE",{"$f":"CHOOSE(C34, \"COT1\", \"COT2\",\"COT3\")","v":"COT3"},3,null,null,"Adjustable",2,null,"ILIM resistor needed",2,{"$f":"C34&\", \"&G35&\", \"&J36&\", \"&G39&\", \"&J41","v":"3, 2, 1, 1, 1"},null,null,null,null,null,"Vout<=8V","10V",2]
[null,{"$f":"IF(MODE=4, \"PFM\", \"COT\")","v":"COT"},null,null,"MODE_VOUT",{"$f":"CHOOSE(G35, \"VOUTfixed\", \"VOUTadj\")","v":"VOUTadj"},{"$f":"IF(AND(OR(MODE=1,MODE=4),OR(Vout=3.3,Vout=5)),1,2)","v":2},null,null,null,{"$f":"C34&G35&J36&G39&J41","v":"32111"},null,null,null,null,null,"Vout<=12V","16V",3]
[null,null,null,null,null,null,null,"MODE_RSET",{"$f":"CHOOSE(J36, \"RsetGND\",\"Rset\")","v":"RsetGND"},1,null,null,null,null,null,null,"Vout<=20V","25V",4]
[null,null,null,null,"UVLO","Adjustable",1,null,null,null,null,null,null,null,null,null,"Vout>20V","50V",5]
[null,null,null,null,null,"Internal",2,"Soft Start","Adjustable",1,null,"Iout Linear Axis",1,null,null,null,"Cout Voltage Rating",{"$f":"CHOOSE(S38,\"6.3V\", \"10V\",\"16V\",\"25V\",\"50V\")","v":"16V"},{"$f":"IF(Vout<=5, 1, IF(Vout<=8, 2, IF(Vout<=12, 3, IF(Vout<=20, 4, 5))))","v":3}]
[null,"LM5163",1,null,"MODE_UVLO",{"$f":"CHOOSE(G39, \"UVLOadj\", \"UVLOint\")","v":"UVLOadj"},1,null,"3ms Fixed",2,null,"Iout Log Axis",2]
[null,"LM5164",2,null,null,null,null,null,null,null,null,"PLOT_TYPE",1]
["VARIANT",{"$f":"CHOOSE(VARIANT, \"LM5163\", \"LM5164\")","v":"LM5164"},2,null,"ESR","NO",1,"MODE_SS",{"$f":"CHOOSE(J41, \"SSAdj\", \"SSfix\")","v":"SSAdj"},1,null,null,null,null,null,null,null,"0402",1,"1.0 x 0.5",0.5]
[null,null,null,null,null,"YES",2,null,null,null,null,null,null,null,null,null,null,"0603",2,"1.6 x 0.8",1.3]
[null,null,null,null,"MODE_ESR",null,2,null,null,null,null,null,null,null,null,null,null,"0805",3,"2.0 x 1.25",2.5]
[null,null,null,null,null,{"$f":"CHOOSE(G44, \"\", \"_ESR\")","v":"_ESR"},{"$f":"IF(MODE=2, 1, MODE_ESR)","v":2},null,null,null,null,null,null,null,null,null,null,"1206",4,"3.2 x 1.6",5.0999999999999996]
[null,null,null,null,null,null,null,null,null,null,null,null,null,null,null,null,null,"1210",5,"3.2 x 2.5",8]
["Step 3: Buck Inductor",null,null,null,null,null,null,null,null,null,null,null,null,null,null,null,"Component Size",{"$f":"CHOOSE(S46,\"0402\", \"0603\",\"0805\",\"1206\",\"1210\")","v":"1210"},5,{"$f":"CHOOSE(S46,T41,T42,T43,T44,T45)","v":"3.2 x 2.5"}]
["Don1",{"$f":"Vout/VIN_nom","v":0.25},{"$f":"(Vout-VIN_nom)/Vout","v":-3},null,"Ideal Duty Cycle at VIN(nom)",null,null,null,1]
["Doff1",{"$f":"1-47:47","v":0.75},null,null,"Ideal 1- Duty Cycle at VIN(nom)",null,null,null,1]
[]
["Don_Vinmin",{"$f":"Vout/VIN_min","v":1},{"$f":"IF(VIN_min>Vout, \"BUCK\", \"BOOST\")","v":"BOOST"},null,null,null,null,null,null,null,null,null,null,null,null,null,null,"3mm x 3mm",1,"3.0 x 3.0",9]
["Don_Vinnom",{"$f":"Vout/VIN_nom","v":0.25},{"$f":"IF(VIN_nom>Vout, \"BUCK\", \"BOOST\")","v":"BUCK"},null,null,null,null,null,null,null,null,null,null,null,null,null,null,"4mm x 4mm",2,"4.0 x 4.0",16]
["Don_Vinmax",{"$f":"Vout/VIN_max","v":0.13333333333333333},{"$f":"IF(VIN_max>Vout, \"BUCK\", \"BOOST\")","v":"BUCK"},null,null,null,null,null,null,null,null,null,null,null,null,null,null,"5mm x 5mm",3,"5.0 x 5.0",25]
[null,null,null,null,null,null,null,null,null,null,null,null,null,null,null,null,null,"6mm x 6mm",4,"6.0 x 6.0",36]
["Lf_Vinmin",{"$f":"(VIN_min-Vout)*Don_Vinmin/(Fsw*Iout*0.4)","v":0},"H","COT",null,null,null,null,null,null,null,null,null,null,null,null,null,"7mm x 7mm",5,"7.0 x 7.0",49]
["Lf_Vinnom",{"$f":"(VIN_nom-Vout)*Don_Vinnom/(Fsw*Iout*0.4)","v":7.4999999999999993E-5},"H","COT",null,null,null,null,1,null,null,null,null,null,null,null,"Inductor Size","8mm x 8mm",6,"8.0 x 8.0",64]
["Lf_Vinmax",{"$f":"(VIN_max-Vout)*Don_Vinmax/(Fsw*Iout*0.7)","v":4.9523809523809525E-5},"H","COT",null,null,null,null,null,null,null,null,null,null,null,null,null,"10mm x 10mm",7,"10.0 x 10.0",100]
[]
["L_Vinmin_COT",{"$f":"(VIN_min-Vout)*Don_Vinmin/(Fsw*Iout*0.3)","v":0},"H","COT","Calculated Inductance for 30% ripple at VIN(min)"]
["L_Vinnom_COT",{"$f":"(VIN_nom-Vout)*Don_Vinnom/(Fsw*Iout*0.4)","v":7.4999999999999993E-5},"H","COT","Calculated Inductance for 40% ripple at VIN(nom)",null,null,null,null,null,"Pk-to-Pk Ripple Current at VIN(nom), DIL"]
["L_Vinmax_COT",{"$f":"(VIN_max-Vout)*Don_Vinmax/(Fsw*Iout*0.7)","v":4.9523809523809525E-5},"H","COT","Calculated Inductance for 70% ripple at VIN(max)"]
[]
[]
["Lopt",{"$f":"B59","v":7.4999999999999993E-5},"H"]
[]
["Lf",{"$f":"'Design Converter'!E17/1000000","v":3.3000000000000003E-5},"H",null,"Chosen Inductance"]
["Rdcr",{"$f":"'Design Converter'!E18/1000","v":0.12},"W",null,"Chosen Inductor DCR"]
[]
["Don2",{"$f":"(Vout+Iout*Rdcr)/Vin","v":0.25062499999999999},null,null,"**Edit to add Rdson**"]
["Doff2",{"$f":"1-_Don2","v":0.74937500000000001}]
[]
["Rdson1",0.75,"W"]
["Rdson2",0.33,"W"]
[]
["Don_Vinmin_2",{"$f":"(Vout+Iout*(Rdcr+Rdson2))/(VIN_min+Iout*Rdson2)","v":1.0024829298572315},null,null,"Duty cycles adjusted for DCR and shunt voltage drops"]
["Don_Vinnom_2",{"$f":"(Vout+Iout*(Rdcr+Rdson2))/(VIN_nom+Iout*Rdson2)","v":0.25191077834971143},null,null,"need to include RDS(on) later"]
["Don_Vinmax_2",{"$f":"(Vout+Iout*(Rdcr+Rdson2))/(VIN_max+Iout*Rdson2)","v":0.13446007826159356}]
[]
["Iripple_Vinmin",{"$f":"(VIN_min-Vout-Rdson1*Iout)*Don_Vinmin_2/(Fsw*Lf)","v":-4.7466047815209822E-3},"A","COT"]
["Iripple_Vinnom",{"$f":"(VIN_nom-Vout-Rdson1*Iout)*Don_Vinnom_2/(Fsw*Lf)","v":0.2278170391325515},"A","COT"]
["Iripple_Vinmax",{"$f":"(VIN_max-Vout)*Don_Vinmax_2/(Fsw*Lf)","v":0.26484560869707824},"A","COT"]
[]
["ILpk_Vinmin",{"$f":"Iout+Iripple_Vinmin/2","v":0.2476266976092395},"A","COT"]
["ILpk_Vinnom",{"$f":"Iout+Iripple_Vinnom/2","v":0.36390851956627573},"A","COT"]
["ILpk_Vinmax",{"$f":"Iout+Iripple_Vinmax/2","v":0.38242280434853915},"A","COT"]
[]
["ILIM_Typ",{"$f":"CHOOSE(VARIANT, 0.75, 1.5)","v":1.5},"A",null,"Isat_min",{"$f":"B86*1.2","v":1.7999999999999998}]
[]
["Ripple current",{"$f":"IF(OR(MODE=1,MODE=2,MODE=3), Iripple_Vinnom, Iripple)","v":0.2278170391325515},"A",null,null,null,null,"% Ripple Current at Nom VIN"]
[null,null,null,null,null,null,null,"Maximum Load Current"]
["Max inductor ripple current",{"$f":"MAX(B78:B80)","v":0.26484560869707824},"A"]
[null,null,null,null,null,"Ripple I","Iin"]
["% Ripple Current",{"$f":"B78/Iout","v":-1.8986419126083929E-2},null,"COT",null,{"$f":"B78","v":-4.7466047815209822E-3},{"$f":"Iin_Vinmin","v":0.27777777777777773}]
[null,{"$f":"B79/Iout","v":0.91126815653020599},null,"COT",null,{"$f":"B79","v":0.2278170391325515},{"$f":"Iin_Vinnom","v":6.9444444444444434E-2}]
[null,{"$f":"B80/Iout","v":1.059382434788313},null,"COT",null,{"$f":"B80","v":0.26484560869707824},{"$f":"Iin_Vinmax","v":3.7037037037037035E-2}]
[]
[null,{"$f":"IF(OR(MODE=1, MODE=2,MODE=3), B93, Ilim/Iout)","v":0.91126815653020599}]
[]
["Iripple1",{"$f":"(Vin-Vout)*Don_Vinnom_2/(Fsw*Lf)","v":0.22900979849973765},"A","inductor ripple current with chosen inductance (pk-pk)",null,null,null,null,1]
["Temp",100]
["DCR at hot",{"$f":"Rdcr*(1+0.0039*(B99-25))","v":0.15509999999999999},"W"]
[]
[]
[]
["Step 4: Output Capacitor"]
["Icoutrms_VINmin",{"$f":"Iripple_Vinmin/SQRT(12)","v":-1.3702267741739519E-3},"A","Output Cap RMS current"]
["Icoutrms_VINnom",{"$f":"Iripple_Vinnom/SQRT(12)","v":6.5765114434581065E-2},"A"]
["Icoutrms_VINmax",{"$f":"Iripple_Vinmax/SQRT(12)","v":7.6454341737474216E-2},"A",null,null,null,{"$f":"Vripple1","v":0.06}]
[]
["Output Ripple Spec (pk-pk)",{"$f":"Vout*0.005","v":0.06},"V","Vout capacitive ripple spec at Vin(nom) = Vripple1"]
[]
["Coutmin"]
["COT",{"$f":"Iripple_Vinnom/(Fsw*8*Vripple1)","v":3.9551569293845748E-7},"F","COT","Min recommended Cout based on ripple spec above",null,null,null,1]
[null,{"$f":"Lf*B83^2/((1.05*Vout)^2-Vout^2)","v":2.9608201559798757E-7},"F","COT","Min recommended Cout based on 5% load-off transient spec"]
["CoutMinCOT",{"$f":"MAX(B112:B113, 0.0000022)","v":2.2000000000000001E-6},"F","COT","max of 2 results and 2.2uF"]
[]
["Reported Countmin",{"$f":"CoutMinCOT*1000000","v":2.2000000000000002},"µF"]
[]
["Cout",{"$f":"'Design Converter'!E24/1000000","v":3.3000000000000003E-5},"F","Chosen Output Capacitance",null,null,null,null,1]
["Resrmax",{"$f":"SQRT((Vripple1/Iripple_Vinnom)^2-(1/(Fsw*Cout*8))^2)","v":0.26335032109059592},"W","Max ESR before ripple exceeds Vripple1",null,null,null,null,1]
["Type1 ESR for sufficient (20mV) COT ripple at FB pin",{"$f":"0.02*Vout/Vref/Iripple_Vinnom","v":0.87789746000356628},"W","(a)"]
["Type2 ESR for sufficient (20mV) COT ripple at FB pin",{"$f":"0.02/Iripple_Vinnom","v":8.7789746000356619E-2},"W","(b)"]
[]
["Type 1 Output Cap RC Time Constant",{"$f":"Cout*B130*1000000","v":0},"µs"]
["Type 2 Output Cap RC Time Constant",{"$f":"Cout*B131*1000000","v":0},"µs"]
["Ton @ Vin(min)",{"$f":"Vout/VIN_min/(Fsw)","v":8.3333333333333333E-7},"s"]
["Ton @ Vin(nom)",{"$f":"Vout/VIN_nom/(Fsw)","v":2.0833333333333333E-7},"s"]
["ESR so that RC > Ton/2",{"$f":"B125/2/Cout","v":1.2626262626262626E-2},"W","(c)"]
[]
[]
["Type1: Need ESR of…",{"$f":"IF(MODE=1, MAX(B120,B127), 0)","v":0},"W","Max of (a) and (c)"]
["Type2: Need ESR of…",{"$f":"IF(MODE=2, MAX(B121,B127), 0)","v":0},"W","Max of (b) and (c)"]
[]
["Reported Cout ESR max",{"$f":"IF(OR(CoutEsrMax>0.5, CoutEsrMax<0, (ISERROR(CoutEsrMax))), \"N/A\", CoutEsrMax*1000)","v":263.35032109059591},"mW"]
[]
["CoutEsr",{"$f":" 'Design Converter'!E26","v":5.0000000000000001E-3},"W","Chosen ESR",null,null,null,null,1]
[]
["Actual Output Ripple",{"$f":"Iripple_Vinnom*SQRT(CoutEsr^2+(1/(8*Fsw*Cout))^2)","v":1.347088658707371E-3},"Vp-p","Vripple2"]
[]
["Minimum Feedforward / Coupling Capacitance",{"$f":"MAX(1000000000000*0.00005/(3*Rfb1_),47)","v":47},"pF",null,null,null,null,{"$f":"0.00005/3/Rfb1_","v":3.6791758646063281E-11}]
["Recommended Cff / Cb",{"$f":"IF(OR(MODE=2,MODE=3), \">\"&ROUND(B139,0),\"\")","v":">47"},"pF"]
["Selected Cff / Cb",{"$f":"'Design Converter'!$E$29","v":56},"pF"]
[]
["Minimum Ripple Generation Capacitance",{"$f":"10/(Fsw*Rfb)","v":1.8539654732570364E-10},"F",{"$f":"1000000000000*B143","v":185.39654732570364},"pF",{"$f":"Rfb","v":44948.697554185725}]
["Recommended Ca",{"$f":"IF(MODE=3, \">\"&ROUND(D143,0),\"\")","v":">185"},"pF"]
["Selected Ca",{"$f":"'Design Converter'!E31","v":2200},"pF",{"$f":"B145/1000000000000","v":2.1999999999999998E-9},"F"]
[]
["Maximum Ripple Generation Resistance",{"$f":"(VIN_nom-Vout)*B126/((B149/1000)*Ca)","v":170454.54545454547},"W",{"$f":"B147/1000","v":170.45454545454547},"kW"]
["Recommended Ra",{"$f":"IF(MODE=3, \"<\"&ROUND(D147,0),\"\")","v":"<170"},"kW",null,null,null,null,null,null,null,null,"Lf_emi",{"$f":"'Design EMI Filter'!$E$9","v":22},"uH",{"$f":"M148/1000000","v":2.1999999999999999E-5},"H"]
["Ripple amplitude",{"$f":"'Design Converter'!E33","v":20},"mVp-p",null,null,null,null,null,null,null,null,"Cf_emi",{"$f":"'Design EMI Filter'!$E$11","v":4.7},"uF",{"$f":"M149/1000000","v":4.6999999999999999E-6},"F"]
[null,null,null,null,null,null,null,null,null,null,null,"Cd_emi",{"$f":"'Design EMI Filter'!$E$13","v":10},"uF",{"$f":"M150/1000000","v":1.0000000000000001E-5},"F"]
[null,null,null,null,null,null,null,null,null,null,null,"ESR_Cd",{"$f":"'Design EMI Filter'!$E$15","v":3.3},"Ω",{"$f":"M151","v":3.3},"Ω",{"$f":"ESR_Cd&ohm","v":"3.3Ω"}]
["Step 5: Input Capacitor",null,null,null,null,null,null,null,null,null,null,"Min Noise",{"$f":"'Design EMI Filter'!$E$8","v":50},"dB","noise limit"]
["Vinripple1",{"$f":"0.05*VIN_nom","v":2.4000000000000004},"Vp-p","Input voltage ripple spec (pk-pk) at Vin(nom)",null,null,null,null,null,null,null,"Duty Cycle",{"$f":"Vout/VIN_nom/Efficiency_COT_Full_Load","v":0.33333333333333331},null,"calculated duty cycle"]
[null,null,null,null,null,null,null,null,null,null,null,"Target Atten.",{"$f":"20*LOG(Iout/(PI()^2*Fsw*Cin)*SIN(PI()*Duty_Cycle)/0.000001) - Min_Noise","v":28.391339362195779},"dB","calculated attenuation"]
["Icinrms",{"$f":"Iout*SQRT(Don_Vinnom_2*(1-Don_Vinnom_2))","v":0.10852757083483268},"A"]
["Cinmin",{"$f":"Iout*Don_Vinnom_2*(1-Don_Vinnom_2)/(Vinripple1*Fsw-Iout*RCinEsr)*1000000","v":1.635865782552343E-2},"µF"]
["Reported Cinmin",{"$f":"IF(Cinmin<2.2, 2.2,Cinmin)","v":2.2000000000000002},"µF",null,null,null,null,null,null,null,null,"Filter Inductor"]
["Cin",{"$f":"'Design Converter'!E37/1000000","v":2.2000000000000001E-6},"F","Input capacitance",null,null,null,null,null,null,null,"Irms rating",{"$f":"Iout*1.5","v":0.375},"A","calculated suggested IRMS rating"]
["CinEsrMax",{"$f":"-(Iout*Don_Vinnom_2*(1-Don_Vinnom_2)/(Cin*Fsw)-Vinripple1)/(Iout+Iripple_Vinnom/2)","v":6.5460247930080966},"W"]
["RCinEsr",{"$f":"'Design Converter'!E39/1000","v":3.0000000000000001E-3},"W","Input capacitance series resistance (ESR)"]
["Reported Cin ESR max",{"$f":"IF(OR(CinEsrMax>12, CinEsrMax<0), \"N/A\",CinEsrMax*1000)","v":6546.0247930080968},"mΩ",null,null,null,null,null,null,null,null,"Filter Capacitor"]
[null,null,null,null,null,null,null,null,null,null,null,"Cfa calculation",{"$f":"Cin/(Cin*Lf_emi*0.000001*(2*PI()*Fsw/10)^2 - 1) / 0.000001","v":-2.2000605343970503},"uF","calculated value"]
["COT input voltage ripple - Vinripple2",{"$f":"Iout*Don_Vinnom_2*(1-Don_Vinnom_2)/(Cin*Fsw)+(Iout +Iripple_Vinnom/2)*RCinEsr","v":1.8937534090986134E-2},"Vp-p",null,{"$f":"Iout*Don_Vinmax_2*(1-Don_Vinmax_2)/(Cin*Fsw)","v":1.1020886895405275E-2},"Vp-p",null,null,null,null,null,"Cfb calculation",{"$f":"1/(Lf_emi)*(10^(Target_Att/40)/(2*PI()*Fsw))^2/0.000001","v":2.1009806785294793E-2},"uF","calculated value"]
[null,null,null,null,null,null,null,null,null,null,null,"Cf",{"$f":"MAX(M162,M163)","v":2.1009806785294793E-2},"uF","calculated value"]
[]
[]
[null,null,null,null,null,null,null,null,null,null,null,"Damping Capacitor"]
["Step 6: Soft Start",null,null,null,null,null,null,null,null,null,null,"Cd ≥",{"$f":"4*Cin*1000000","v":8.8000000000000007},"uF","calculated value"]
["Tss",{"$f":"'Design Converter'!#REF!/1000","v":{"$error":"#REF!"}},"s","Soft-start time",null,null,null,null,null,null,null,"Cd ESR ≥",{"$f":"SQRT(Lf_emi/Cin)","v":3.1622776601683795},"Ω","calculated value"]
["Iss",1.0000000000000001E-5,"A","Soft-start current"]
["Css",{"$f":"8.16*Tss/1000000","v":{"$error":"#NAME?"}},"F","Required soft-start cap"]
["Css_u",{"$f":"'Standard Value Calculator'!B4","v":{"$error":"#NAME?"}},"F","User selected SS cap",null,null,null,null,null,null,null,"CIN and Cd Capacitors Current Sharing and Rating"]
[null,null,null,null,null,null,null,null,null,null,null,"Cd impedance",{"$f":" 1/(2*PI()*Fsw*Cd_emi) + ESR_Cd","v":3.3132629119243244},"Ω","calculated Cd impedance at the sw. frequency"]
["Step 7: Other Components - UVLO, PGOOD",null,null,null,null,null,null,null,null,null,null,"Cin impedance",{"$f":" 1/(2*PI()*Fsw*Cin) + RCinEsr","v":6.3285963292384589E-2},"Ω","calculated CIN impedance at the sw. frequency"]
[]
["Rising UVLO/EN Threshold",1.5,"V",null,null,null,null,null,null,null,null,"IRMS Total Input Cap",{"$f":"Iout*SQRT(Duty_Cycle*(1-Duty_Cycle))","v":0.11785113019775792},"A","calculated total IRMS current for CIN and Cd combined"]
["Falling UVLO/EN Threshold",1.4,"V",null,null,null,null,null,null,null,null,"IRMS Cd Act",{"$f":"IRMSTOT*(ZCIN/(ZCIN+ZCd))","v":2.2088595709080813E-3},"A","Calculated min IRMS current rating for Cd"]
["Voltage Hysteresis",{"$f":"B176-B177","v":0.10000000000000009},"V",null,null,null,null,null,null,null,null,"IRMS CIN",{"$f":"IRMSTOT*(ZCd/(ZCIN+ZCd))","v":0.11564227062684984},"A","Calculated min IRMS current rating for CIN"]
[]
["VINUVLO_ON",{"$f":"'Design Converter'!E48","v":6},"V"]
["VINUVLO_OFF",null,"V"]
[]
["RUV1",{"$f":"'Design Converter'!E49*1000","v":1000},"kΩ",{"$f":"'Standard Value Calculator'!J16","v":1000},"kΩ",{"$f":"IF(Ruvlo1<0,\"N/A\",D183)","v":1000},{"$f":"IF(Ruvlo1<0,\"N/A\",D183&\"kΩ\")","v":"1000kΩ"}]
["RUV2",{"$f":"Vuvlo_on*Ruvlo1/(VINuvlo_on-Vuvlo_on)","v":333.33333333333331},"kΩ",{"$f":"'Standard Value Calculator'!J17","v":332},"kΩ",{"$f":"IF(F183=\"N/A\",\"N/A\",D184)","v":332},{"$f":"IF(G183=\"N/A\",\"N/A\",D184&\"kΩ\")","v":"332kΩ"}]
[]
["VINUVLO_ON_ACTUAL",{"$f":"(D183+D184)/D184*Vuvlo_on","v":6.0180722891566267},"V"]
["VINUVLO_OFF_ACTUAL",{"$f":"(D183+D184)/D184*Vuvlo_off","v":5.6168674698795176},"V"]
[]
["RPG",20,"kΩ"]
[]
[]
["Step 8: FB Divider"]
["Pi",3.1415926500000002,null,"p"]
["Toff_Vinmax",{"$f":"(1-Don_Vinmax_2)/Fsw","v":7.2128326811533874E-7},"sec"]
["Ton_Vinmin",{"$f":"IF(VIN_min>Vout, (1-Don_Vinmin_2)/Fsw, Don_Vinmin_2/Fsw)","v":8.3540244154769292E-7},"sec"]
[]
["Rfb1",{"$f":"'Design Converter'!E43*1000","v":453000},"W","Lower Feedback Resistance - chosen by user",null,null,null,null,1]
["Rfb2",{"$f":"IF(Vout=Vref,100000000,Vref*B197/((Vout-Vref)))","v":50333.333333333328},"W","Upper Feedback Resistance"]
["Rfb2_u",{"$f":"IF(Vout=Vref,\"N/A\",'Standard Value Calculator'!J10)","v":49900},"W","Std Value Upper Feedback Resistance"]
["Rfb",{"$f":"Rfb1_*Rfb2_u/(Rfb1_+Rfb2_u)","v":44948.697554185725},"W","Rfb1 || Rfb2_u"]
[null,{"$f":"1.2/Rfb2_u*(Rfb2_u+Rfb1_)","v":12.0937875751503},"V"]
["Ifb",{"$f":"CHOOSE(MODE_VOUT, IF(Vout=5, 0.000007, 0.0000038), Vout/(Rfb1_+Rfb2_u))","v":2.3861602704314974E-5}]
[]
["Other Input Variables"]
["Rfets",0,"W","Series resistance due to FETs",null,null,null,{"$f":"_Don2*RdsonTop+Doff2*RdsonBot+B209*Vin^2*Fsw/2/(((Iripple1/SQRT(3))^2))","v":395.78195389330659}]
["Diode loss eq res",{"$f":"0.00000002*Fsw*0.6*4/Iripple1","v":0.2515176222910217}]
["Fet loss eq res",{"$f":"_Don2*RdsonTop+Doff2*RdsonBot","v":0.39998937499999998}]
["cap loss eq res",{"$f":"B209*Vin^2*Fsw/2/(((Iripple1/SQRT(3))^2))","v":395.38196451830657}]
["Sw cap",5.0000000000000001E-9]
[]
["Step 8: Efficiency"]
[]
["Design"]
["Ta",25,"°C","Ambient Temperature"]
["Components"]
["LTc",{"$f":"4000/1000000","v":4.0000000000000001E-3},"%/°C","Inductor DCR Temp Co"]
["θCA",40,"°C/W","Inductor Core to Ambient Thermal Resistance"]
["RCinEsr",{"$f":"RCinEsr","v":3.0000000000000001E-3},"W","Input Capacitor ESR"]
["Part Characteristics"]
["Vcc",{"$f":"IF(Vin>7.7,7.5,Vin-0.2)","v":7.5},"V"]
["Deadtime"]
["Deadtime",2E-8,"s","Total Deadtime",null,null,"20ns for LM5166"]
["IQ"]
["IQ ",1.0000000000000001E-5,"A","Quiescent Current Of Controller (Not Switching!)"]
[]
[]
["IC Power Disipation","Value","Units"]
["Power Dis",{"$f":"Efficiency!AZ106","v":0.89407497215228726},"W"]
["Temp rise",{"$f":"B228*ThetaJA","v":36.746481355459011},"°C"]
["Current (switching)",{"$f":"(Qg_Q1+Qg_Q2)*Fsw+Iq","v":{"$error":"#NAME?"}},"A"]
["Qrr Current",{"$f":"Qrr_Q2*Fsw","v":{"$error":"#NAME?"}},"A"]
["Diode Current",{"$f":"C232/Vin","v":{"$error":"#NAME?"}},{"$f":"Deadtime*Fsw*(Ipp/2)*(Vsd_Q1+Vsd_Q2)","v":{"$error":"#NAME?"}}]
["Total Application Switching IQ",{"$f":"SUM(B230:B232)","v":{"$error":"#NAME?"}},"A"]
[]
[]
["SCHEMATIC LABELS"]
[]
[]
[{"$f":"\"RUV1 = \"&'Design Converter'!E49&\"MΩ\"","v":"RUV1 = 1MΩ"},{"$f":"C275","v":"1MΩ"}]
[{"$f":"\"RUV2 = \"&'Design Converter'!E50&\"kΩ\"","v":"RUV2 = 332kΩ"},{"$f":"C276","v":"332kΩ"}]
[{"$f":"\"Rhys = \"&'Design Converter'!E52&\"kΩ\"","v":"Rhys = 5.61686746987952kΩ"},{"$f":"C277","v":{"$error":"#REF!"}}]
[]
[{"$f":"\"LF = \"&'Design Converter'!E17&\"µH\"","v":"LF = 33µH"},{"$f":"'Design Converter'!E17&\"µH\"","v":"33µH"}]
[{"$f":"\"Rdcr = \"&Rdcr*1000&\"mΩ\"","v":"Rdcr = 120mΩ"},{"$f":"Rdcr*1000&\"mΩ\"","v":"120mΩ"}]
[{"$f":"\"Rt = \"&'Design Converter'!I43&\"kΩ\"","v":"Rt = kΩ"},{"$f":"'Design Converter'!I43&\"kΩ\"","v":"kΩ"}]
[{"$f":"\"Css = \"&ROUND(Css_u*1000000000,1)&\"nF\"","v":{"$error":"#NAME?"}},{"$f":"ROUND(Css_u*1000000000,1)&\"nF\"","v":{"$error":"#NAME?"}}]
[]
["VIN",{"$f":"VIN_nom&\"V\"","v":"48V"}]
["VIN range",{"$f":"VIN_min&\"V...\"&VIN_max&\"V\"","v":"12V...90V"}]
[]
[{"$f":"\"VOUT = \"&'Design Converter'!E9&\"V\"","v":"VOUT = 12V"},{"$f":"'Design Converter'!E9&\"V\"","v":"12V"}]
[null,null,{"$f":"R30","v":"22"},{"$f":"ROUNDUP('Design Converter'!$E$24/C252,0)","v":2}]
[{"$f":"\"COUT = \"&'Design Converter'!$E$24&\"µF\"","v":"COUT = 33µF"},{"$f":"'Design Converter'!$E$24&\"µF\"","v":"33µF"},{"$f":"IF('Design Converter'!$E$24=OR(10, 22, 47, 100), 'Design Converter'!$E$24,C252)","v":"22"},{"$f":"IF(D252=1, \"\",B255)","v":"2 x "},{"$f":"D253&C253&\"µF\"","v":"2 x 22µF"},{"$f":"C253&\"µF\"","v":"22µF"}]
["Capacitance per component (Cout)",{"$f":"C252&\"µF\"","v":"22µF"}]
["# of output caps",{"$f":"D252&\" x \"","v":"2 x "}]
[]
["CIN",{"$f":"Cin*1000000&\"µF\"","v":"2.2µF"}]
["Capacitance per component (Cin)",{"$f":"\"2.2µF\"","v":"2.2µF"}]
["# of input caps",{"$f":"ROUNDUP(Cin*1000000/2.2,0)&\" x \"","v":"1 x "}]
[]
["Fixed VOUT?",{"$f":"IF(MODE_VOUT=1, \"YES\", \"NO\")","v":"NO"}]
["FB resistor ref des shown or not?",{"$f":"IF(MODE_VOUT=2, \"YES\", \"NO\")","v":"YES"},{"$f":"IF(MODE_VOUT=2, \"R1\", \"\")","v":"R1"},{"$f":"IF(MODE_VOUT=2, \"R2\", \"\")","v":"R2"}]
[{"$f":"\"RFB1 = \"&'Design Converter'!E43&\"kΩ\"","v":"RFB1 = 453kΩ"},{"$f":"'Design Converter'!E43&\"kΩ\"","v":"453kΩ"},{"$f":"IF(MODE=1,'Design Converter'!E43&\"kΩ\", \"\")","v":""}]
[{"$f":"\"RFB2 = \"&IF(Vout=Vref,\"OPEN\",'Design Converter'!E44&\"kΩ\")","v":"RFB2 = 49.9kΩ"},{"$f":"IF(Vout=Vref,\"OPEN\",Rfb2_u/1000&\"kΩ\")","v":"49.9kΩ"},{"$f":"IF(MODE=1, IF(Vout=Vref, \"OPEN\",Rfb2_u/1000&\"kΩ\" ), \"\")","v":""}]
[]
[]
["Show Rt resistor ref des?",{"$f":"IF(OR(MODE=1,MODE=2,MODE=3), \"YES\", \"NO\")","v":"YES"},{"$f":"IF(MODE=4,\"\", \"Rt\")","v":"Rt"}]
["Rt",{"$f":"IF(MODE=4, \"\", 'Standard Value Calculator'!J4/1000&\"kΩ\")","v":"24.9kΩ"}]
[]
["Show ESR resistor ref des?",{"$f":"IF(OR(MODE=3, MODE=4), \"NO\", \"YES\")","v":"NO"},{"$f":"IF(OR(MODE=3, MODE=4),\"\",\"Resr\")","v":""}]
[{"$f":"\"RESR = \"&'Design Converter'!E26&\"mΩ\"","v":"RESR = 0.005mΩ"},{"$f":"IF(OR(MODE=3,MODE=4), \"\", 'Design Converter'!E26&\"Ω\")","v":""},null,null,null,{"$f":"B120","v":0.87789746000356628}]
["Resr",{"$f":"IF(MODE=1, \">\"&ROUND(B130,3), IF(MODE=2,  \">\"&ROUND(B131,3),IF(MODE=3,ROUND(B119,3),\"\")))","v":0.26300000000000001}]
[]
["Adjustable UVLO?",{"$f":"IF(MODE_UVLO=1, \"YES\", \"NO\")","v":"YES"},{"$f":"IF(MODE_UVLO=1,\"Ren1\", \"\")","v":"Ren1"},{"$f":"IF(MODE_UVLO=1, \"Ren2\", \"\")","v":"Ren2"},{"$f":"IF(MODE_UVLO=1, \"Rhys\", \"\")","v":"Rhys"},"Value","Units","BOM display"]
[{"$f":"\"RUV1 = \"&C275","v":"RUV1 = 1MΩ"},{"$f":"'Design Converter'!E49&\" MΩ\"","v":"1 MΩ"},{"$f":"IF(MODE_UVLO=1,'Design Converter'!E49&\"MΩ\", \"\")","v":"1MΩ"},null,null,{"$f":"IF(MODE_UVLO=1,'Design Converter'!E49, \"\")","v":1},{"$f":"IF(MODE_UVLO=1,\"MΩ\", \"\")","v":"MΩ"},{"$f":"IF(MODE_UVLO=1,'Design Converter'!E49&\"M\", \"\")","v":"1M"}]
[{"$f":"\"RUV2 = \"&C276","v":"RUV2 = 332kΩ"},{"$f":"IF(D184>=1000, D184/1000&\" MΩ\", D184&\" kΩ\")","v":"332 kΩ"},{"$f":"IF(MODE_UVLO=1, IF(D184<1, D184*1000&\"Ω\", IF(D184<1000, D184&\"kΩ\", D184/1000&\"MΩ\")), \"\")","v":"332kΩ"},null,null,{"$f":"IF(MODE_UVLO=1, IF(D184<1, D184*1000, IF(D184<1000, D184, D184/1000)), \"\")","v":332},{"$f":"IF(MODE_UVLO=1, IF(D184<1, \"Ω\", IF(D184<1000,\"kΩ\", \"MΩ\")), \"\")","v":"kΩ"},{"$f":"IF(MODE_UVLO=1, IF(D184<1, D184*1000, IF(D184<1000, D184&\"k\", D184/1000&\"M\")), \"\")","v":"332k"}]
[{"$f":"\"RHYS = \"&C277","v":{"$error":"#REF!"}},{"$f":"IF(#REF!<1000,#REF!& \" kΩ\",#REF!& \" MΩ\")","v":{"$error":"#REF!"}},{"$f":"IF(MODE_UVLO=1, IF(#REF!<1,#REF!* 1000&\"Ω\", IF(#REF!<1000,#REF!& \"kΩ\",#REF!/ 1000&\"MΩ\")), \"\")","v":{"$error":"#REF!"}},null,null,{"$f":"IF(MODE_UVLO=1, IF(#REF!<1,#REF!* 1000, IF(#REF!<1000,#REF!,#REF!/ 1000)), \"\")","v":{"$error":"#REF!"}},{"$f":"IF(MODE_UVLO=1, IF(#REF!<1, \"Ω\", IF(#REF!<1000,\"kΩ\", \"MΩ\")), \"\")","v":{"$error":"#REF!"}},{"$f":"IF(MODE_UVLO=1, IF(#REF!<1,#REF!* 1000, IF(#REF!<1000,#REF!& \"k\",#REF!& \"M\")), \"\")","v":{"$error":"#REF!"}}]
[]
[{"$f":"\"Css = \"&Css*1000000000&\"nF\"","v":{"$error":"#NAME?"}},{"$f":"Css*1000000000&\"nF\"","v":{"$error":"#NAME?"}}]
["Cbst",{"$f":"\"2.2nF\"","v":"2.2nF"},null,{"$f":"B280","v":"2.2nF"}]
[]
[]
["Rset resistor ref des?",{"$f":"IF(MODE_RSET=2, \"YES\", \"NO\")","v":"NO"},{"$f":"IF(MODE_RSET=2, \"R3\", \"\")","v":""},null,null,{"$f":"MODE_RSET","v":1}]
["Rset",{"$f":"IF(MODE_RSET=2, C284&\"kΩ\", \"\")","v":""},{"$f":"IF(MODE_ILIM=3,100,IF(MODE_ILIM=2,56.2,IF(MODE_ILIM=4,24.9,0)))","v":{"$error":"#REF!"}}]
[]
[]
["Rpgood","100kΩ"]
[]
["Cff / Cb?",{"$f":"IF(MODE=2, \"Cff\", IF(MODE=3,\"Cb\",\"\"))","v":"Cb"}]
[{"$f":"\"Cff / Cb=\"&B290","v":"Cff / Cb=56pF"},{"$f":"IF(OR(MODE=2,MODE=3),B141&\"pF\",\"\")","v":"56pF"}]
[]
["Ca?",{"$f":"IF(MODE=3, \"Ca\",\"\")","v":"Ca"},null,{"$f":"Ca","v":2.1999999999999998E-9},{"$f":"Ton_Vinmin","v":8.3540244154769292E-7}]
["Ca=",{"$f":"IF(MODE=3,B145&\"pF\",\"\")","v":"2200pF"}]
[]
["Ra?",{"$f":"IF(MODE=3, \"Ra\",\"\")","v":"Ra"},"Injected Ripple"]
["Ra=",{"$f":"IF(MODE=3,Ra&\"kΩ\",\"\")","v":"169kΩ"},{"$f":"(VIN_nom-Vout)*Ton_Vin_nom/(Ra*Ca)/1000","v":2.0172135556750941E-2},{"$f":"ROUNDUP(1000*C296,0)","v":21},null,{"$f":"IF(MODE=3,Ra&\"k\",\"\")","v":"169k"}]
[]
["Lf(emi)",{"$f":"M148&\"µH\"","v":"22µH"}]
["Cf(emi)",{"$f":"M149&\"µF\"","v":"4.7µF"}]
["Df(emi)",{"$f":"M150&\"µF\"","v":"10µF"}]
[]
["Full-load efficiency",{"$f":"ROUND(Efficiency!CE106,1)&\"%\"","v":"75%"}]
["Full-load efficiency",{"$f":"ROUND(Efficiency!CE107,1)&\"%\"","v":"80.3%"}]
["10% load efficiency",{"$f":"ROUND(Efficiency!CE16,1)&\"%\"","v":"62.8%"},"linear scale only"]
["1% load efficiency",{"$f":"ROUND(Efficiency!CE56,1)&\"%\"","v":"65.2%"},"log scale only"]
[]
["Blank out",{"$f":"IF(C307=\"y\",\"\",\"|\")","v":"|"},"n"]
[]
["OUTPUT CURRENT",{"$f":"'Design Converter'!$E$10&\"A\"","v":"0.25A"}]
[]
["VIN ",2]
["RT",5]
["EN",7]
["PGOOD",6]
["SS",4]
["ILIM",3]
["GND",10]
["FB",8]
["SW",1]
["HYS",9]

{"sheet":"Standard Value Calculator","index":8,"n_rows":159,"n_cols":11,"rows_kept":159,"cut":false,"hidden":true,"merged":[]}
[]
["Capacitors","Css","Cout","Cin","Cb"]
["Inputs",{"$f":"Css","v":{"$error":"#NAME?"}},{"$f":"Cout","v":3.3000000000000003E-5},{"$f":"Cin","v":2.2000000000000001E-6},{"$f":"Cb","v":0},null,null,"Resistors","inputs","Standard Result"]
["Standard Result",{"$f":"SUM(B6:B158)/1000000000000","v":{"$error":"#NAME?"}},{"$f":"SUM(C6:C158)/1000000000000","v":3.3000000000000003E-5},{"$f":"SUM(D6:D158)/1000000000000","v":2.2000000000000001E-6},{"$f":"IF(E3=\"OPEN\",\"OPEN\",SUM(E6:E158)/1000000000000)","v":0},null,null,"Rt",{"$f":"Rt","v":25000},{"$f":"IF(I4>(INT(0.5+100*POWER(10,IF(96*(LOG(I4)-INT(LOG(I4)))-ROUND(96*(LOG(I4)-INT(LOG(I4))),0)<0,ROUND(96*(LOG(I4)-INT(LOG(I4))),0)-1,ROUND(96*(LOG(I4)-INT(LOG(I4))),0))/96))*POWER(10,INT(LOG(I4))-2)+INT(0.5+100*POWER(10,(IF(96*(LOG(I4)-INT(LOG(I4)))-ROUND(96*(LOG(I4)-INT(LOG(I4))),0)<0,ROUND(96*(LOG(I4)-INT(LOG(I4))),0)-1,ROUND(96*(LOG(I4)-INT(LOG(I4))),0))+1)/96))*POWER(10,INT(LOG(I4))-2))/2,INT(0.5+100*POWER(10,(IF(96*(LOG(I4)-INT(LOG(I4)))-ROUND(96*(LOG(I4)-INT(LOG(I4))),0)<0,ROUND(96*(LOG(I4)-INT(LOG(I4))),0)-1,ROUND(96*(LOG(I4)-INT(LOG(I4))),0))+1)/96))*POWER(10,INT(LOG(I4))-2),INT(0.5+100*POWER(10,IF(96*(LOG(I4)-INT(LOG(I4)))-ROUND(96*(LOG(I4)-INT(LOG(I4))),0)<0,ROUND(96*(LOG(I4)-INT(LOG(I4))),0)-1,ROUND(96*(LOG(I4)-INT(LOG(I4))),0))/96))*POWER(10,INT(LOG(I4))-2))","v":24900},"Ω"]
["(pF)"]
[0.47,{"$f":"IF(IF((B$3*10^12-$A7)*(B$3*10^12-$A6)*-1<0,0,1)*IF(ABS(B$3*10^12-$A7)>(B$3*10^12-$A6),$A6,$A7)=B7,0,IF((B$3*10^12-$A7)*(B$3*10^12-$A6)*-1<0,0,1)*IF(ABS(B$3*10^12-$A7)>(B$3*10^12-$A6),$A6,$A7))","v":{"$error":"#NAME?"}},{"$f":"IF(IF((C$3*10^12-$A7)*(C$3*10^12-$A6)*-1<0,0,1)*IF(ABS(C$3*10^12-$A7)>(C$3*10^12-$A6),$A6,$A7)=C7,0,IF((C$3*10^12-$A7)*(C$3*10^12-$A6)*-1<0,0,1)*IF(ABS(C$3*10^12-$A7)>(C$3*10^12-$A6),$A6,$A7))","v":0},{"$f":"IF(IF((D$3*10^12-$A7)*(D$3*10^12-$A6)*-1<0,0,1)*IF(ABS(D$3*10^12-$A7)>(D$3*10^12-$A6),$A6,$A7)=D7,0,IF((D$3*10^12-$A7)*(D$3*10^12-$A6)*-1<0,0,1)*IF(ABS(D$3*10^12-$A7)>(D$3*10^12-$A6),$A6,$A7))","v":0},{"$f":"IF(IF((E$3*10^12-$A7)*(E$3*10^12-$A6)*-1<0,0,1)*IF(ABS(E$3*10^12-$A7)>(E$3*10^12-$A6),$A6,$A7)=E7,0,IF((E$3*10^12-$A7)*(E$3*10^12-$A6)*-1<0,0,1)*IF(ABS(E$3*10^12-$A7)>(E$3*10^12-$A6),$A6,$A7))","v":0},null,null,"Rshunt",{"$f":"Rshunt","v":{"$error":"#NAME?"}},{"$error":"#NAME?"},"Ω"]
[0.56000000000000005,{"$f":"IF(IF((B$3*10^12-$A8)*(B$3*10^12-$A7)*-1<0,0,1)*IF(ABS(B$3*10^12-$A8)>(B$3*10^12-$A7),$A7,$A8)=B8,0,IF((B$3*10^12-$A8)*(B$3*10^12-$A7)*-1<0,0,1)*IF(ABS(B$3*10^12-$A8)>(B$3*10^12-$A7),$A7,$A8))","v":{"$error":"#NAME?"}},{"$f":"IF(IF((C$3*10^12-$A8)*(C$3*10^12-$A7)*-1<0,0,1)*IF(ABS(C$3*10^12-$A8)>(C$3*10^12-$A7),$A7,$A8)=C8,0,IF((C$3*10^12-$A8)*(C$3*10^12-$A7)*-1<0,0,1)*IF(ABS(C$3*10^12-$A8)>(C$3*10^12-$A7),$A7,$A8))","v":0},{"$f":"IF(IF((D$3*10^12-$A8)*(D$3*10^12-$A7)*-1<0,0,1)*IF(ABS(D$3*10^12-$A8)>(D$3*10^12-$A7),$A7,$A8)=D8,0,IF((D$3*10^12-$A8)*(D$3*10^12-$A7)*-1<0,0,1)*IF(ABS(D$3*10^12-$A8)>(D$3*10^12-$A7),$A7,$A8))","v":0},{"$f":"IF(IF((E$3*10^12-$A8)*(E$3*10^12-$A7)*-1<0,0,1)*IF(ABS(E$3*10^12-$A8)>(E$3*10^12-$A7),$A7,$A8)=E8,0,IF((E$3*10^12-$A8)*(E$3*10^12-$A7)*-1<0,0,1)*IF(ABS(E$3*10^12-$A8)>(E$3*10^12-$A7),$A7,$A8))","v":0},null,null,"Rc1ea",{"$f":"Rcea1","v":{"$error":"#NAME?"}},{"$error":"#NAME?"},"Ω"]
[0.68,{"$error":"#NAME?"},0,0,0]
[0.82,{"$error":"#NAME?"},0,0,0,null,null,"Rfb1",{"$f":"Rfb1_","v":453000},453000,"Ω"]
[1,{"$error":"#NAME?"},0,0,0,null,null,"Rfb2",{"$f":"Rfb2_","v":50333.333333333328},{"$f":"IF(I10=\"OPEN\",\"OPEN\",IF(I10>(INT(0.5+100*POWER(10,IF(96*(LOG(I10)-INT(LOG(I10)))-ROUND(96*(LOG(I10)-INT(LOG(I10))),0)<0,ROUND(96*(LOG(I10)-INT(LOG(I10))),0)-1,ROUND(96*(LOG(I10)-INT(LOG(I10))),0))/96))*POWER(10,INT(LOG(I10))-2)+INT(0.5+100*POWER(10,(IF(96*(LOG(I10)-INT(LOG(I10)))-ROUND(96*(LOG(I10)-INT(LOG(I10))),0)<0,ROUND(96*(LOG(I10)-INT(LOG(I10))),0)-1,ROUND(96*(LOG(I10)-INT(LOG(I10))),0))+1)/96))*POWER(10,INT(LOG(I10))-2))/2,INT(0.5+100*POWER(10,(IF(96*(LOG(I10)-INT(LOG(I10)))-ROUND(96*(LOG(I10)-INT(LOG(I10))),0)<0,ROUND(96*(LOG(I10)-INT(LOG(I10))),0)-1,ROUND(96*(LOG(I10)-INT(LOG(I10))),0))+1)/96))*POWER(10,INT(LOG(I10))-2),INT(0.5+100*POWER(10,IF(96*(LOG(I10)-INT(LOG(I10)))-ROUND(96*(LOG(I10)-INT(LOG(I10))),0)<0,ROUND(96*(LOG(I10)-INT(LOG(I10))),0)-1,ROUND(96*(LOG(I10)-INT(LOG(I10))),0))/96))*POWER(10,INT(LOG(I10))-2)))","v":49900},"Ω"]
[1.2,{"$error":"#NAME?"},0,0,0]
[1.5,{"$error":"#NAME?"},0,0,0]
[1.8,{"$error":"#NAME?"},0,0,0,null,null,"Rs",{"$f":"Rs_ideal*1000","v":{"$error":"#NAME?"}},{"$f":"IF(I13=0,0,IF(I13>(INT(0.5+100*POWER(10,IF(96*(LOG(I13)-INT(LOG(I13)))-ROUND(96*(LOG(I13)-INT(LOG(I13))),0)<0,ROUND(96*(LOG(I13)-INT(LOG(I13))),0)-1,ROUND(96*(LOG(I13)-INT(LOG(I13))),0))/96))*POWER(10,INT(LOG(I13))-2)+INT(0.5+100*POWER(10,(IF(96*(LOG(I13)-INT(LOG(I13)))-ROUND(96*(LOG(I13)-INT(LOG(I13))),0)<0,ROUND(96*(LOG(I13)-INT(LOG(I13))),0)-1,ROUND(96*(LOG(I13)-INT(LOG(I13))),0))+1)/96))*POWER(10,INT(LOG(I13))-2))/2,INT(0.5+100*POWER(10,(IF(96*(LOG(I13)-INT(LOG(I13)))-ROUND(96*(LOG(I13)-INT(LOG(I13))),0)<0,ROUND(96*(LOG(I13)-INT(LOG(I13))),0)-1,ROUND(96*(LOG(I13)-INT(LOG(I13))),0))+1)/96))*POWER(10,INT(LOG(I13))-2),INT(0.5+100*POWER(10,IF(96*(LOG(I13)-INT(LOG(I13)))-ROUND(96*(LOG(I13)-INT(LOG(I13))),0)<0,ROUND(96*(LOG(I13)-INT(LOG(I13))),0)-1,ROUND(96*(LOG(I13)-INT(LOG(I13))),0))/96))*POWER(10,INT(LOG(I13))-2)))","v":{"$error":"#NAME?"}},"mΩ"]
[2.2000000000000002,{"$f":"IF(IF((B$3*10^12-$A15)*(B$3*10^12-$A14)*-1<0,0,1)*IF(ABS(B$3*10^12-$A15)>(B$3*10^12-$A14),$A14,$A15)=B15,0,IF((B$3*10^12-$A15)*(B$3*10^12-$A14)*-1<0,0,1)*IF(ABS(B$3*10^12-$A15)>(B$3*10^12-$A14),$A14,$A15))","v":{"$error":"#NAME?"}},{"$f":"IF(IF((C$3*10^12-$A15)*(C$3*10^12-$A14)*-1<0,0,1)*IF(ABS(C$3*10^12-$A15)>(C$3*10^12-$A14),$A14,$A15)=C15,0,IF((C$3*10^12-$A15)*(C$3*10^12-$A14)*-1<0,0,1)*IF(ABS(C$3*10^12-$A15)>(C$3*10^12-$A14),$A14,$A15))","v":0},{"$f":"IF(IF((D$3*10^12-$A15)*(D$3*10^12-$A14)*-1<0,0,1)*IF(ABS(D$3*10^12-$A15)>(D$3*10^12-$A14),$A14,$A15)=D15,0,IF((D$3*10^12-$A15)*(D$3*10^12-$A14)*-1<0,0,1)*IF(ABS(D$3*10^12-$A15)>(D$3*10^12-$A14),$A14,$A15))","v":0},{"$f":"IF(IF((E$3*10^12-$A15)*(E$3*10^12-$A14)*-1<0,0,1)*IF(ABS(E$3*10^12-$A15)>(E$3*10^12-$A14),$A14,$A15)=E15,0,IF((E$3*10^12-$A15)*(E$3*10^12-$A14)*-1<0,0,1)*IF(ABS(E$3*10^12-$A15)>(E$3*10^12-$A14),$A14,$A15))","v":0},null,null,"Cslope_ideal",{"$f":"Cslope_ideal","v":{"$error":"#NAME?"}},{"$f":"#REF!*1000000000000","v":{"$error":"#REF!"}},"pF"]
[2.7,{"$error":"#NAME?"},0,0,0]
[3.3,{"$error":"#NAME?"},0,0,0,null,null,"Ruv1",{"$f":"Ruvlo1","v":1000},{"$f":"IF(I16=\"OPEN\",\"OPEN\",IF(I16>(INT(0.5+100*POWER(10,IF(96*(LOG(I16)-INT(LOG(I16)))-ROUND(96*(LOG(I16)-INT(LOG(I16))),0)<0,ROUND(96*(LOG(I16)-INT(LOG(I16))),0)-1,ROUND(96*(LOG(I16)-INT(LOG(I16))),0))/96))*POWER(10,INT(LOG(I16))-2)+INT(0.5+100*POWER(10,(IF(96*(LOG(I16)-INT(LOG(I16)))-ROUND(96*(LOG(I16)-INT(LOG(I16))),0)<0,ROUND(96*(LOG(I16)-INT(LOG(I16))),0)-1,ROUND(96*(LOG(I16)-INT(LOG(I16))),0))+1)/96))*POWER(10,INT(LOG(I16))-2))/2,INT(0.5+100*POWER(10,(IF(96*(LOG(I16)-INT(LOG(I16)))-ROUND(96*(LOG(I16)-INT(LOG(I16))),0)<0,ROUND(96*(LOG(I16)-INT(LOG(I16))),0)-1,ROUND(96*(LOG(I16)-INT(LOG(I16))),0))+1)/96))*POWER(10,INT(LOG(I16))-2),INT(0.5+100*POWER(10,IF(96*(LOG(I16)-INT(LOG(I16)))-ROUND(96*(LOG(I16)-INT(LOG(I16))),0)<0,ROUND(96*(LOG(I16)-INT(LOG(I16))),0)-1,ROUND(96*(LOG(I16)-INT(LOG(I16))),0))/96))*POWER(10,INT(LOG(I16))-2)))","v":1000},"kΩ"]
[3.9,{"$error":"#NAME?"},0,0,0,null,null,"Ruv2",{"$f":"Ruvlo2","v":333.33333333333331},{"$f":"IF(I17=\"OPEN\",\"OPEN\",IF(I17>(INT(0.5+100*POWER(10,IF(96*(LOG(I17)-INT(LOG(I17)))-ROUND(96*(LOG(I17)-INT(LOG(I17))),0)<0,ROUND(96*(LOG(I17)-INT(LOG(I17))),0)-1,ROUND(96*(LOG(I17)-INT(LOG(I17))),0))/96))*POWER(10,INT(LOG(I17))-2)+INT(0.5+100*POWER(10,(IF(96*(LOG(I17)-INT(LOG(I17)))-ROUND(96*(LOG(I17)-INT(LOG(I17))),0)<0,ROUND(96*(LOG(I17)-INT(LOG(I17))),0)-1,ROUND(96*(LOG(I17)-INT(LOG(I17))),0))+1)/96))*POWER(10,INT(LOG(I17))-2))/2,INT(0.5+100*POWER(10,(IF(96*(LOG(I17)-INT(LOG(I17)))-ROUND(96*(LOG(I17)-INT(LOG(I17))),0)<0,ROUND(96*(LOG(I17)-INT(LOG(I17))),0)-1,ROUND(96*(LOG(I17)-INT(LOG(I17))),0))+1)/96))*POWER(10,INT(LOG(I17))-2),INT(0.5+100*POWER(10,IF(96*(LOG(I17)-INT(LOG(I17)))-ROUND(96*(LOG(I17)-INT(LOG(I17))),0)<0,ROUND(96*(LOG(I17)-INT(LOG(I17))),0)-1,ROUND(96*(LOG(I17)-INT(LOG(I17))),0))/96))*POWER(10,INT(LOG(I17))-2)))","v":332},"kΩ"]
[4.7,{"$error":"#NAME?"},0,0,0,null,null,"Rhys",{"$f":"Rhys","v":{"$error":"#NAME?"}},{"$f":"IF(I18=\"OPEN\",\"OPEN\",IF(I18>(INT(0.5+100*POWER(10,IF(96*(LOG(I18)-INT(LOG(I18)))-ROUND(96*(LOG(I18)-INT(LOG(I18))),0)<0,ROUND(96*(LOG(I18)-INT(LOG(I18))),0)-1,ROUND(96*(LOG(I18)-INT(LOG(I18))),0))/96))*POWER(10,INT(LOG(I18))-2)+INT(0.5+100*POWER(10,(IF(96*(LOG(I18)-INT(LOG(I18)))-ROUND(96*(LOG(I18)-INT(LOG(I18))),0)<0,ROUND(96*(LOG(I18)-INT(LOG(I18))),0)-1,ROUND(96*(LOG(I18)-INT(LOG(I18))),0))+1)/96))*POWER(10,INT(LOG(I18))-2))/2,INT(0.5+100*POWER(10,(IF(96*(LOG(I18)-INT(LOG(I18)))-ROUND(96*(LOG(I18)-INT(LOG(I18))),0)<0,ROUND(96*(LOG(I18)-INT(LOG(I18))),0)-1,ROUND(96*(LOG(I18)-INT(LOG(I18))),0))+1)/96))*POWER(10,INT(LOG(I18))-2),INT(0.5+100*POWER(10,IF(96*(LOG(I18)-INT(LOG(I18)))-ROUND(96*(LOG(I18)-INT(LOG(I18))),0)<0,ROUND(96*(LOG(I18)-INT(LOG(I18))),0)-1,ROUND(96*(LOG(I18)-INT(LOG(I18))),0))/96))*POWER(10,INT(LOG(I18))-2)))","v":{"$error":"#NAME?"}},"kΩ"]
[5.6,{"$error":"#NAME?"},0,0,0]
[6.8,{"$error":"#NAME?"},0,0,0,null,null,"Ra",{"$f":"'Variable Mgmt'!D147","v":170.45454545454547},{"$f":"IF(I20=\"OPEN\",\"OPEN\",IF(I20>(INT(0.5+100*POWER(10,IF(96*(LOG(I20)-INT(LOG(I20)))-ROUND(96*(LOG(I20)-INT(LOG(I20))),0)<0,ROUND(96*(LOG(I20)-INT(LOG(I20))),0)-1,ROUND(96*(LOG(I20)-INT(LOG(I20))),0))/96))*POWER(10,INT(LOG(I20))-2)+INT(0.5+100*POWER(10,(IF(96*(LOG(I20)-INT(LOG(I20)))-ROUND(96*(LOG(I20)-INT(LOG(I20))),0)<0,ROUND(96*(LOG(I20)-INT(LOG(I20))),0)-1,ROUND(96*(LOG(I20)-INT(LOG(I20))),0))+1)/96))*POWER(10,INT(LOG(I20))-2))/2,INT(0.5+100*POWER(10,(IF(96*(LOG(I20)-INT(LOG(I20)))-ROUND(96*(LOG(I20)-INT(LOG(I20))),0)<0,ROUND(96*(LOG(I20)-INT(LOG(I20))),0)-1,ROUND(96*(LOG(I20)-INT(LOG(I20))),0))+1)/96))*POWER(10,INT(LOG(I20))-2),INT(0.5+100*POWER(10,IF(96*(LOG(I20)-INT(LOG(I20)))-ROUND(96*(LOG(I20)-INT(LOG(I20))),0)<0,ROUND(96*(LOG(I20)-INT(LOG(I20))),0)-1,ROUND(96*(LOG(I20)-INT(LOG(I20))),0))/96))*POWER(10,INT(LOG(I20))-2)))","v":169},"kΩ"]
[8.1999999999999993,{"$error":"#NAME?"},0,0,0]
[10,{"$error":"#NAME?"},0,0,0]
[12,{"$error":"#NAME?"},0,0,0]
[15,{"$error":"#NAME?"},0,0,0]
[18,{"$error":"#NAME?"},0,0,0]
[22,{"$error":"#NAME?"},0,0,0]
[27,{"$error":"#NAME?"},0,0,0]
[33,{"$error":"#NAME?"},0,0,0]
[39,{"$error":"#NAME?"},0,0,0]
[47,{"$error":"#NAME?"},0,0,0]
[56,{"$error":"#NAME?"},0,0,0]
[68,{"$error":"#NAME?"},0,0,0]
[82,{"$error":"#NAME?"},0,0,0]
[{"$f":"A22*10","v":100},{"$error":"#NAME?"},0,0,0]
[{"$f":"A23*10","v":120},{"$error":"#NAME?"},0,0,0]
[150,{"$error":"#NAME?"},0,0,0]
[180,{"$error":"#NAME?"},0,0,0]
[220,{"$error":"#NAME?"},0,0,{"$f":"IF(IF((E$3*10^12-$A39)*(E$3*10^12-$A38)*-1<0,0,1)*IF(ABS(E$3*10^12-$A39)>(E$3*10^12-$A38),$A38,$A39)=E39,0,IF((E$3*10^12-$A39)*(E$3*10^12-$A38)*-1<0,0,1)*IF(ABS(E$3*10^12-$A39)>(E$3*10^12-$A38),$A38,$A39))","v":0}]
[270,{"$error":"#NAME?"},0,0,0]
[330,{"$error":"#NAME?"},0,0,0]
[390,{"$error":"#NAME?"},0,0,0]
[470,{"$error":"#NAME?"},0,0,0]
[560,{"$error":"#NAME?"},0,0,0]
[680,{"$error":"#NAME?"},0,0,0]
[{"$f":"A33*10","v":820},{"$error":"#NAME?"},0,0,0]
[1000,{"$error":"#NAME?"},0,0,0]
[1200,{"$error":"#NAME?"},0,0,0]
[1500,{"$error":"#NAME?"},0,0,0]
[1800,{"$error":"#NAME?"},0,0,0]
[2200,{"$error":"#NAME?"},0,0,0]
[2700,{"$error":"#NAME?"},0,0,0]
[3300,{"$error":"#NAME?"},0,0,0]
[3900,{"$error":"#NAME?"},0,0,0]
[4700,{"$error":"#NAME?"},0,0,0]
[5600,{"$error":"#NAME?"},0,0,0]
[6800,{"$error":"#NAME?"},0,0,0]
[8200,{"$error":"#NAME?"},0,0,0]
[10000,{"$error":"#NAME?"},0,0,0]
[12000,{"$error":"#NAME?"},0,0,0]
[15000,{"$error":"#NAME?"},0,0,0]
[18000,{"$error":"#NAME?"},0,0,0]
[22000,{"$error":"#NAME?"},0,0,0]
[27000,{"$error":"#NAME?"},0,0,0]
[33000,{"$error":"#NAME?"},0,0,0]
[39000,{"$error":"#NAME?"},0,0,0]
[47000,{"$error":"#NAME?"},0,0,0]
[56000,{"$error":"#NAME?"},0,0,0]
[68000,{"$error":"#NAME?"},0,0,0]
[82000,{"$error":"#NAME?"},0,0,0]
[100000,{"$error":"#NAME?"},{"$f":"IF(IF((C$3*10^12-$A71)*(C$3*10^12-$A70)*-1<0,0,1)*IF(ABS(C$3*10^12-$A71)>(C$3*10^12-$A70),$A70,$A71)=C71,0,IF((C$3*10^12-$A71)*(C$3*10^12-$A70)*-1<0,0,1)*IF(ABS(C$3*10^12-$A71)>(C$3*10^12-$A70),$A70,$A71))","v":0},{"$f":"IF(IF((D$3*10^12-$A71)*(D$3*10^12-$A70)*-1<0,0,1)*IF(ABS(D$3*10^12-$A71)>(D$3*10^12-$A70),$A70,$A71)=D71,0,IF((D$3*10^12-$A71)*(D$3*10^12-$A70)*-1<0,0,1)*IF(ABS(D$3*10^12-$A71)>(D$3*10^12-$A70),$A70,$A71))","v":0},{"$f":"IF(IF((E$3*10^12-$A71)*(E$3*10^12-$A70)*-1<0,0,1)*IF(ABS(E$3*10^12-$A71)>(E$3*10^12-$A70),$A70,$A71)=E71,0,IF((E$3*10^12-$A71)*(E$3*10^12-$A70)*-1<0,0,1)*IF(ABS(E$3*10^12-$A71)>(E$3*10^12-$A70),$A70,$A71))","v":0}]
[120000,{"$f":"IF(IF((B$3*10^12-$A72)*(B$3*10^12-$A71)*-1<0,0,1)*IF(ABS(B$3*10^12-$A72)>(B$3*10^12-$A71),$A71,$A72)=B72,0,IF((B$3*10^12-$A72)*(B$3*10^12-$A71)*-1<0,0,1)*IF(ABS(B$3*10^12-$A72)>(B$3*10^12-$A71),$A71,$A72))","v":{"$error":"#NAME?"}},{"$f":"IF(IF((C$3*10^12-$A72)*(C$3*10^12-$A71)*-1<0,0,1)*IF(ABS(C$3*10^12-$A72)>(C$3*10^12-$A71),$A71,$A72)=C72,0,IF((C$3*10^12-$A72)*(C$3*10^12-$A71)*-1<0,0,1)*IF(ABS(C$3*10^12-$A72)>(C$3*10^12-$A71),$A71,$A72))","v":0},{"$f":"IF(IF((D$3*10^12-$A72)*(D$3*10^12-$A71)*-1<0,0,1)*IF(ABS(D$3*10^12-$A72)>(D$3*10^12-$A71),$A71,$A72)=D72,0,IF((D$3*10^12-$A72)*(D$3*10^12-$A71)*-1<0,0,1)*IF(ABS(D$3*10^12-$A72)>(D$3*10^12-$A71),$A71,$A72))","v":0},0]
[150000,{"$error":"#NAME?"},0,0,0]
[180000,{"$error":"#NAME?"},0,0,0]
[220000,{"$error":"#NAME?"},0,0,0]
[270000,{"$error":"#NAME?"},0,0,0]
[330000,{"$error":"#NAME?"},0,0,0]
[390000,{"$error":"#NAME?"},0,0,0]
[470000,{"$error":"#NAME?"},0,0,0]
[560000,{"$error":"#NAME?"},0,0,0]
[680000,{"$error":"#NAME?"},0,0,0]
[820000,{"$error":"#NAME?"},0,0,0]
[1000000,{"$error":"#NAME?"},0,0,0]
[1200000,{"$error":"#NAME?"},0,0,0]
[1500000,{"$error":"#NAME?"},0,0,0]
[1800000,{"$error":"#NAME?"},0,0,0]
[2200000,{"$error":"#NAME?"},0,2200000,0]
[2700000,{"$error":"#NAME?"},0,0,0]
[3300000,{"$error":"#NAME?"},0,0,0]
[3900000,{"$error":"#NAME?"},0,0,0]
[4700000,{"$error":"#NAME?"},0,0,0]
[5600000,{"$error":"#NAME?"},0,0,0]
[6800000,{"$error":"#NAME?"},0,0,0]
[8200000,{"$error":"#NAME?"},0,0,0]
[10000000,{"$error":"#NAME?"},0,0,0]
[12000000,{"$error":"#NAME?"},0,0,0]
[15000000,{"$error":"#NAME?"},0,0,0]
[18000000,{"$error":"#NAME?"},0,0,0]
[22000000,{"$error":"#NAME?"},0,0,0]
[{"$f":"A87*10","v":27000000},{"$error":"#NAME?"},0,0,0]
[33000000,{"$error":"#NAME?"},33000000,0,0]
[39000000,{"$error":"#NAME?"},0,0,0]
[47000000,{"$error":"#NAME?"},0,0,{"$f":"IF(IF((E$3*10^12-$A103)*(E$3*10^12-$A102)*-1<0,0,1)*IF(ABS(E$3*10^12-$A103)>(E$3*10^12-$A102),$A102,$A103)=E103,0,IF((E$3*10^12-$A103)*(E$3*10^12-$A102)*-1<0,0,1)*IF(ABS(E$3*10^12-$A103)>(E$3*10^12-$A102),$A102,$A103))","v":0}]
[56000000,{"$error":"#NAME?"},0,{"$f":"IF(IF((D$3*10^12-$A104)*(D$3*10^12-$A103)*-1<0,0,1)*IF(ABS(D$3*10^12-$A104)>(D$3*10^12-$A103),$A103,$A104)=D104,0,IF((D$3*10^12-$A104)*(D$3*10^12-$A103)*-1<0,0,1)*IF(ABS(D$3*10^12-$A104)>(D$3*10^12-$A103),$A103,$A104))","v":0},0]
[68000000,{"$error":"#NAME?"},0,0,0]
[82000000,{"$error":"#NAME?"},0,0,0]
[100000000,{"$error":"#NAME?"},0,0,0]
[120000000,{"$error":"#NAME?"},0,0,0]
[150000000,{"$error":"#NAME?"},0,0,0]
[180000000,{"$error":"#NAME?"},0,0,0]
[220000000,{"$error":"#NAME?"},0,0,0]
[270000000,{"$error":"#NAME?"},0,0,0]
[330000000,{"$error":"#NAME?"},0,0,0]
[390000000,{"$error":"#NAME?"},0,0,0]
[470000000,{"$error":"#NAME?"},0,0,0]
[560000000,{"$error":"#NAME?"},0,0,0]
[680000000,{"$error":"#NAME?"},0,0,0]
[820000000,{"$error":"#NAME?"},0,0,0]
[1000000000,{"$error":"#NAME?"},0,0,0]
[1200000000,{"$error":"#NAME?"},0,0,0]
[1500000000,{"$error":"#NAME?"},0,0,0]
[1800000000,{"$error":"#NAME?"},0,0,0]
[2200000000,{"$error":"#NAME?"},0,0,0]
[2700000000,{"$error":"#NAME?"},0,0,0]
[3300000000,{"$error":"#NAME?"},0,0,0]
[3900000000,{"$error":"#NAME?"},0,0,0]
[4700000000,{"$error":"#NAME?"},0,0,0]
[5600000000,{"$error":"#NAME?"},0,0,0]
[6800000000,{"$error":"#NAME?"},0,0,0]
[8200000000,{"$error":"#NAME?"},0,0,0]
[10000000000,{"$error":"#NAME?"},0,0,0]
[12000000000,{"$error":"#NAME?"},0,0,0]
[15000000000,{"$error":"#NAME?"},0,0,0]
[18000000000,{"$error":"#NAME?"},0,0,0]
[22000000000,{"$error":"#NAME?"},{"$f":"IF(IF((C$3*10^12-$A135)*(C$3*10^12-$A134)*-1<0,0,1)*IF(ABS(C$3*10^12-$A135)>(C$3*10^12-$A134),$A134,$A135)=C135,0,IF((C$3*10^12-$A135)*(C$3*10^12-$A134)*-1<0,0,1)*IF(ABS(C$3*10^12-$A135)>(C$3*10^12-$A134),$A134,$A135))","v":0},0,{"$f":"IF(IF((E$3*10^12-$A135)*(E$3*10^12-$A134)*-1<0,0,1)*IF(ABS(E$3*10^12-$A135)>(E$3*10^12-$A134),$A134,$A135)=E135,0,IF((E$3*10^12-$A135)*(E$3*10^12-$A134)*-1<0,0,1)*IF(ABS(E$3*10^12-$A135)>(E$3*10^12-$A134),$A134,$A135))","v":0}]
[27000000000,{"$f":"IF(IF((B$3*10^12-$A136)*(B$3*10^12-$A135)*-1<0,0,1)*IF(ABS(B$3*10^12-$A136)>(B$3*10^12-$A135),$A135,$A136)=B136,0,IF((B$3*10^12-$A136)*(B$3*10^12-$A135)*-1<0,0,1)*IF(ABS(B$3*10^12-$A136)>(B$3*10^12-$A135),$A135,$A136))","v":{"$error":"#NAME?"}},0,0,0]
[33000000000,{"$error":"#NAME?"},0,0,0]
[39000000000,{"$error":"#NAME?"},0,0,0]
[47000000000,{"$error":"#NAME?"},0,0,0]
[56000000000,{"$error":"#NAME?"},0,0,0]
[68000000000,{"$error":"#NAME?"},0,0,0]
[82000000000,{"$error":"#NAME?"},0,0,0]
[100000000000,{"$error":"#NAME?"},0,0,0]
[120000000000,{"$error":"#NAME?"},0,0,0]
[150000000000,{"$error":"#NAME?"},0,0,0]
[180000000000,{"$error":"#NAME?"},0,0,0]
[220000000000,{"$error":"#NAME?"},0,0,0]
[270000000000,{"$error":"#NAME?"},0,0,0]
[330000000000,{"$error":"#NAME?"},0,0,0]
[390000000000,{"$error":"#NAME?"},0,0,0]
[470000000000,{"$error":"#NAME?"},0,0,0]
[560000000000,{"$error":"#NAME?"},0,0,0]
[680000000000,{"$error":"#NAME?"},0,0,0]
[820000000000,{"$error":"#NAME?"},0,0,0]
[1000000000000,{"$error":"#NAME?"},0,0,0]
[1200000000000,{"$error":"#NAME?"},0,0,0]
[1500000000000,{"$error":"#NAME?"},0,0,0]
[1800000000000,{"$error":"#NAME?"},0,0,0]
[2200000000000,{"$error":"#NAME?"},0,0,0]
[2700000000000,{"$error":"#NAME?"},2700000000000,2700000000000,2700000000000]

{"sheet":"Efficiency","index":9,"n_rows":114,"n_cols":88,"rows_kept":114,"cut":false,"hidden":true,"merged":[[0,0,2,4],[1,6,1,7],[3,0,3,4],[3,10,3,21]]}
["LM5164 (COT) Efficiency Calculator"]
[null,null,null,null,null,null,"TERMS OF USE",null,null,{"$f":"CoutEsr","v":5.0000000000000001E-3}]
[]
[null,null,null,null,null,null,null,"Currents",null,null,"Miscellaneous",null,null,null,null,null,null,null,null,null,null,null,"Inductor",null,null,null,"Cout",null,null,"Cin",null,null,"High-side MOSFET Losses ",null,null,null,null,null,null,null,null,"Low-side MOSFET Losses ",null,null,"Diode",null,null,null,null,null,null,null,"RESULTS"]
["Input Parameters",null,null,null,null,null,null,"Step","Iout (A)","Ripple Current pk-pk (A)","Peak Current (A)","Valley Current (A)","VOUT Hysteresis +Undershoot (2us Delay) (mV)","Vout Rise per Pulse (mV)","Number of Pulses in DCM","VOUT Ripple (mV)","Off Time (sec)","Duty Cycle","Switching Frequency (Hz)","Active Mode Duration (sec)","Sleep Mode Duration (sec)","Operating Quiescent Current (A)","Irms (A)","Inductor DCR Loss @ 25°C (W)","Inductor Core Loss  (W)","Total Inductor Loss (W)","Irms (A)","Cout ESR Loss (W)","Total Cout Loss (W)","Irms (A)","Cin ESR Loss (W)","Total Cin Loss (W)","Irms (A)","Rdson HS Loss @ 25°C (W)","HS Gate Qg Loss (W)     ","SW Rise Time (ns)","SW Fall Time (ns)","HS Switching  Loss (W)","Coss Loss (W)","Total HS FET AC Loss (W)","Total HS FET Loss (W)","Irms (A)","Rdson LS Loss @ 25°C (W)","LS Gate Qg Loss (W)","Reverse Recovery & Leakage Losses","DeadTime Loss @ 25°C (W)","Total LS FET AC Loss (W)","Total LS FET Loss (W)","Quiescent Loss (W)","LDO + Quiescent Loss (W)","Total Gate Drive Loss (W)","Total Power Loss in IC (W)","Total Converter Power Loss (W)","Pout (W)","EFF (%)","High-side MOSFET Rdson %","Low-side MOSFET Rdson %","Gate Drive (Qg) Loss from Vin %","High-side MOSFET AC Loss %","Reverse Recovery & Leakage Loss %","Deadtime Loss %","Low-side MOSFET AC Loss %","Inductor Cu Loss %","Inductor Core Loss %","Cin ESR %","Cout ESR %","LDO + Quiescent Current Loss %","Total Loss %","Overall Eff %","Overall Eff","Current (mA)","Keep for \"previous\" data series","Keep for \"previous\" data series","Frequency (kHz)",null,"Coss",null,"Total Power Loss in IC (mW)","LDO + Quiescent Loss (mW)","Total Inductor Loss (mW)",null,null,"Overall Eff","Total Power Loss in IC (W)","LDO + Quiescent Loss (mW)","Total Inductor Loss (mW)","Fsw (kHz)","Ripple (mV)"]
["Design","Input Value","Units","Std Units","Description",null,null,0.04,{"$f":"IF(PLOT_TYPE=1, H6/100*Iout, min_I*EXP(H6*rr/100))","v":1E-4},{"$f":"IF(I6<Icrit, (Vin-(Rdcr+RdsonTop)*Iripple/2-Vout)/L*OnTime, (Vin-(Rdcr+RdsonTop)*I6-Vout)/L*OnTime)","v":0.22669702892741328},{"$f":"IF(I6<Icrit, (Vin-(Rdcr+RdsonTop)*Iripple/2-Vout)/L*OnTime, I6+((Vin-(Rdcr+RdsonTop)*J6-Vout)/L*OnTime)/2)","v":0.22669702892741328},{"$f":"IF(I6<Icrit, 0, I6-((Vin-(Rdcr+RdsonTop)*K6-Vout)/L*OnTime)/2)","v":0},{"$f":"1000*((((J6/2)-I6)*0.000002/Cout+Vout/306))","v":46.07923260564354},{"$f":"IF(I6<Icrit, 1000*SQRT((J6*CoutEsr)^2+(((J6/2)-I6)*(OnTime+OffTime)/Cout)^2), 1000*J6*SQRT(CoutEsr^2+(1/(8*Fsw*Cout))^2))","v":3.0477342964217957},{"$f":"ROUNDUP(M6/N6,0)","v":16},{"$f":"IF(I6<Icrit, 1000*((N6/1000)*O6), 1000*J6*SQRT(CoutEsr^2+(1/(8*Fsw*Cout))^2))","v":48.763748742748732},{"$f":"IF(I6<Icrit, L*J6/(Vout+J6/2*(RdsonBot+Rdcr)), L*J6/(Vout+I6*(RdsonBot+Rdcr)))","v":6.2093001672768886E-7},{"$f":"OnTime*S6","v":2.2164118228895622E-4},{"$f":"IF(I6<Icrit,I6/((OnTime+Q6)*J6/2),1/(OnTime+Q6))","v":1063.8776749869899},{"$f":"IF(1/S6-OnTime-Q6>Tsleep, OnTime+Q6+Tsleep, 1/S6)","v":5.8292633500610224E-6},{"$f":"IF(1/S6-OnTime-Q6>Tsleep, 1/S6-OnTime-Q6-Tsleep, 0)","v":9.3412842493607493E-4},{"$f":"S6*(T6*Iq_active+U6*Iq_sleep)","v":1.4031055040837365E-5},{"$f":"IF(I6<Icrit,Iripple*SQRT((OnTime+OffTime)*S6/3), SQRT(I6^2+Iripple^2/12))","v":3.864184987085747E-3},{"$f":"W6^2*Rdcr","v":1.7918310737302651E-6},{"$f":"Core_Loss/1000*S6/$S$106","v":8.7704895148403548E-5},{"$f":"(Y6+X6*(1+Ltc*(Ta-25)))/(1-X6*Ltc*ThetaCa)","v":8.949675188022358E-5},{"$f":"Iripple/SQRT(12)*SQRT((OnTime+Q6)*S6)","v":1.9377961112489865E-3},{"$f":"RCoutEsr*AA6^2","v":1.8775268843858473E-8},{"$f":"AB6","v":1.8775268843858473E-8},{"$f":"SQRT($R6)*SQRT($I6^2*(1-R6)+(Iripple^2)/12)","v":9.7127393787291739E-4},{"$f":"RCinEsr*AD6^2","v":2.8301191871734912E-9},{"$f":"AE6","v":2.8301191871734912E-9},{"$f":"IF(I6<Icrit,Iripple*SQRT((OnTime)*S6/3), SQRT(OnTime*S6*(I6^2+Iripple^2/12)))","v":1.9425455942866196E-3},{"$f":"RdsonTop*AG6^2","v":2.5923830861011791E-6},{"$f":"QgTop*S6*Vdd","v":4.2714688650727641E-6},{"$f":"20*VIN_nom/24","v":40},{"$f":"IF(I6<Icrit, Csw*Vin/Iripple*1000000000, Csw*Vin/(I6+Iripple/2)*1000000000)","v":33.982443275858451},{"$f":"IF(I6<Icrit, Vin*(I6+Iripple/2)*AK6/1000000000/2*S6, Vin*(I6-Iripple/2)*AJ6/1000000000/2*S6 + Vin*(I6+Iripple/2)*AK6/1000000000/2*S6)","v":9.8133734117383437E-5},{"$f":"IF(I6<Icrit, Csw*(Vin)^2*S6/2, Csw*Vin^2*S6/2)","v":1.9609393305360196E-4},{"$f":"AI6+AL6+AM6","v":2.9849913603605815E-4},{"$f":"(AI6+AL6+AM6+AH6*(1+RdsonTopTc*(Ta-25)))/(1-AH6*RdsonTopTc*ThetaJA)","v":3.0109166348394521E-4},{"$f":"IF(I6<Icrit,Iripple*SQRT((OffTime)*S6/3), SQRT(OffTime*S6*(I6^2+Iripple^2/12)))","v":3.3404254562160963E-3},{"$f":"RdsonBot*AP6^2","v":3.3921664374751008E-6},{"$f":"QgBot*S6*Vdd","v":1.1702654424856889E-5},{"$f":"IF(I6<Icrit, Vin*Idss*R6, QrrBot*(I6-Iripple/2)/1*S6*Vin+Vin*Idss*R6)","v":0},{"$f":"IF(I6<Icrit, dead1*S6*(I6+Iripple/2)*((I6+Iripple/2)*BDserR+VSD), dead1*S6*(I6+Iripple/2)*((I6+Iripple/2)*BDserR+VSD)+dead2*S6*(I6-Iripple/2)*((I6-Iripple/2)*BDserR+VSD))","v":1.9524021697024252E-6},{"$f":"AR6+AS6+AT6","v":1.3655056594559314E-5},{"$f":"(AR6+AS6+AT6+AQ6*(1+RdsonBotTc*(Ta-25)))/(1-AQ6*RdsonBotTc*ThetaJA)","v":1.704723372714807E-5},{"$f":"Vin*V6+Vout*Ifb/0.8","v":1.0314146825249181E-3},{"$f":"(Vin-Vdd)*(S6*QgBot+S6*QgTop)+AW6","v":1.168792142818313E-3},{"$f":"AI6+AR6","v":1.5974123289929654E-5},{"$f":"AO6+AV6+AX6+AY6","v":1.502905163319336E-3},{"$f":"SUM(Z6,AC6,AF6,AZ6)","v":1.5924235205875908E-3},{"$f":"Vout*I6","v":1.2000000000000001E-3},{"$f":"BB6/(BB6+BA6)","v":0.42973424022280554},{"$f":"(AO6-AN6)/($BB6+$BA6)","v":9.2841484422876276E-4},{"$f":"(AV6-AU6)/($BB6+$BA6)","v":1.2147788856451697E-3},{"$f":"Vin*S6*(QgBot+QgTop)/($BB6+$BA6)","v":5.4917021881786737E-2},{"$f":"AN6/($BB6+$BA6)","v":0.10689608285968276},{"$f":"AS6/(BA6+BB6)","v":0},{"$f":"AT6/($BB6+$BA6)","v":6.9917838583869049E-4},{"$f":"AU6/($BB6+$BA6)","v":4.8900378090519642E-3},{"$f":"X6/($BB6+$BA6)","v":6.4167597089757433E-4},{"$f":"Y6/($BB6+$BA6)","v":3.1408163733683346E-2},{"$f":"(AF6)/($BB6+$BA6)","v":1.01349926553332E-6},{"$f":"(AC6)/($BB6+$BA6)","v":6.7236465763286935E-6},{"$f":"AX6/($BB6+$BA6)","v":0.41855833622701044},{"$f":"SUM(BD6:BO6)","v":0.62016142774366734},{"$f":"BC6","v":0.42973424022280554},{"$f":"100*BQ6","v":42.973424022280554},{"$f":"I6*1000","v":0.1},8.7924221262065743,{"$f":"BT6/100","v":8.7924221262065741E-2},{"$f":"S6/1000","v":1.0638776749869898},null,{"$f":"AM6/($BB6+$BA6)","v":7.022356444424277E-2},null,{"$f":"AZ6","v":1.502905163319336E-3},{"$f":"AX6","v":1.168792142818313E-3},{"$f":"Z6","v":8.949675188022358E-5},null,null,{"$f":"IF(OR(MODE=1,MODE=2,MODE=3), BR6, IF(MODE_ILIM=4,#REF!,#REF!))","v":42.973424022280554},{"$f":"IF(OR(MODE=1,MODE=2,MODE=3), BZ6, IF(MODE_ILIM=4,#REF!,#REF!))","v":1.502905163319336E-3},{"$f":"IF(OR(MODE=1,MODE=2,MODE=3), CA6, IF(MODE_ILIM=4,#REF!,#REF!))","v":1.168792142818313E-3},{"$f":"IF(OR(MODE=1,MODE=2,MODE=3), CB6, IF(MODE_ILIM=4,#REF!,#REF!))","v":8.949675188022358E-5},{"$f":"(IF(OR(MODE=1,MODE=2,MODE=3), S6, IF(MODE_ILIM=4,#REF!,#REF!)))/1000","v":1.0638776749869898},{"$f":"IF(OR(MODE=1,MODE=2,MODE=3), P6, IF(MODE_ILIM=4,#REF!,#REF!))","v":48.763748742748732}]
[null,null,null,null,null,null,null,1,2.5000000000000001E-3,0.22669702892741328,0.22669702892741328,0,{"$f":"IF(I7<Icrit, 1000*((((J7/2)-I7)*0.000002/Cout+Vout/306)), 1000*J7*SQRT(CoutEsr^2+(1/(8*Fsw*Cout))^2))","v":45.933778060188992},2.9921625280173365,{"$f":"ROUNDUP(M7/N7,0)","v":16},47.874600448277384,6.2093001672768886E-7,{"$f":"OnTime*S7","v":5.5410295572239044E-3},26596.941874674743,{"$f":"IF(1/S7-OnTime-Q7>Tsleep, OnTime+Q7+Tsleep, 1/S7)","v":5.8292633500610224E-6},{"$f":"IF(1/S7-OnTime-Q7>Tsleep, 1/S7-OnTime-Q7-Tsleep, 0)","v":3.1769044181384415E-5},1.1077637602093411E-4,{"$f":"IF(I7<Icrit,Iripple*SQRT((OnTime+OffTime)*S7/3), SQRT(I7^2+Iripple^2/12))","v":1.9320924935428734E-2},4.479577684325662E-5,2.1926223787100884E-3,2.2374341919697877E-3,{"$f":"Iripple/SQRT(12)*SQRT((OnTime+Q7)*S7)","v":9.6889805562449301E-3},{"$f":"RCoutEsr*AA7^2","v":4.6938172109646163E-7},{"$f":"AB7","v":4.6938172109646163E-7},{"$f":"SQRT($R7)*SQRT($I7^2*(1-R7)+(Iripple^2)/12)","v":4.8599085076464045E-3},{"$f":"RCinEsr*AD7^2","v":7.0856132108081707E-8},{"$f":"AE7","v":7.0856132108081707E-8},{"$f":"IF(I7<Icrit,Iripple*SQRT((OnTime)*S7/3), SQRT(OnTime*S7*(I7^2+Iripple^2/12)))","v":9.7127279714330963E-3},{"$f":"RdsonTop*AG7^2","v":6.4809577152529445E-5},{"$f":"QgTop*S7*Vdd","v":1.0678672162681911E-4},40,33.982443275858451,2.5054039072840706E-3,4.9023483263400487E-3,{"$f":"AI7+AL7+AM7","v":7.5145389552509385E-3},7.579439383590833E-3,1.6702127281080479E-2,{"$f":"RdsonBot*AP7^2","v":8.4804160936877482E-5},2.9256636062142223E-4,0,4.9860560982033179E-5,{"$f":"AR7+AS7+AT7","v":3.4242692160345539E-4},4.2723778356398059E-4,5.6751900895695619E-3,9.1096265969044382E-3,3.9935308224824134E-4,{"$f":"AO7+AV7+AX7+AY7","v":1.7515656846307494E-2},1.9753631276130487E-2,0.03,{"$f":"BB7/(BB7+BA7)","v":0.60297106423250402},{"$f":"(AO7-AN7)/($BB7+$BA7)","v":1.3044360115083849E-3},{"$f":"(AV7-AU7)/($BB7+$BA7)","v":1.7046165231604626E-3},7.70554729624809E-2,{"$f":"AN7/($BB7+$BA7)","v":0.15103498503547561},{"$f":"AS7/(BA7+BB7)","v":0},{"$f":"AT7/($BB7+$BA7)","v":1.0021491839522071E-3},{"$f":"AU7/($BB7+$BA7)","v":6.8824508447031911E-3},9.0035190787667355E-4,4.4069594971694222E-2,{"$f":"(AF7)/($BB7+$BA7)","v":1.4241399128202976E-6},{"$f":"(AC7)/($BB7+$BA7)","v":9.4341198633605969E-6},{"$f":"AX7/($BB7+$BA7)","v":0.18309470812987313},{"$f":"SUM(BD7:BO7)","v":0.46705962383050093},0.60297106423250402,{"$f":"100*BQ7","v":60.297106423250405},2.5,9.5725635821403898,{"$f":"BT7/100","v":9.5725635821403893E-2},26.596941874674744,null,9.853247291905648E-2,null,{"$f":"AZ7","v":1.7515656846307494E-2},{"$f":"AX7","v":9.1096265969044382E-3},{"$f":"Z7","v":2.2374341919697877E-3},null,null,{"$f":"IF(OR(MODE=1,MODE=2,MODE=3), BR7, IF(MODE_ILIM=4,#REF!,#REF!))","v":60.297106423250405},{"$f":"IF(OR(MODE=1,MODE=2,MODE=3), BZ7, IF(MODE_ILIM=4,#REF!,#REF!))","v":1.7515656846307494E-2},{"$f":"IF(OR(MODE=1,MODE=2,MODE=3), CA7, IF(MODE_ILIM=4,#REF!,#REF!))","v":9.1096265969044382E-3},{"$f":"IF(OR(MODE=1,MODE=2,MODE=3), CB7, IF(MODE_ILIM=4,#REF!,#REF!))","v":2.2374341919697877E-3},{"$f":"(IF(OR(MODE=1,MODE=2,MODE=3), S7, IF(MODE_ILIM=4,#REF!,#REF!)))/1000","v":26.596941874674744},{"$f":"IF(OR(MODE=1,MODE=2,MODE=3), P7, IF(MODE_ILIM=4,#REF!,#REF!))","v":47.874600448277384}]
["Vin",{"$f":"Vin","v":48},"V",{"$f":"B8","v":48},"Vin",null,null,2,5.0000000000000001E-3,0.22669702892741328,0.22669702892741328,0,45.782262908673843,2.9344587977427277,16,46.951340763883643,6.2093001672768886E-7,{"$f":"OnTime*S8","v":1.1082059114447809E-2},53193.883749349487,5.8292633500610224E-6,1.2969890415661699E-5,2.115527520418682E-4,2.7323914081275831E-2,8.959155368651324E-5,4.3852447574201769E-3,4.4749004572322186E-3,1.3702287708210796E-2,9.3876344219292336E-7,{"$f":"AB8","v":9.3876344219292336E-7},6.8878533303588299E-3,1.4232757050160566E-7,{"$f":"AE8","v":1.4232757050160566E-7},1.3735871624841205E-2,1.2961915430505892E-4,2.1357344325363822E-4,40,33.982443275858451,5.1192673027962337E-3,9.8046966526800974E-3,1.5137537398729969E-2,1.526752256230899E-2,2.3620374921385683E-2,1.6960832187375499E-4,5.8513272124284445E-4,0,1.0191098092145273E-4,6.8704370216429722E-4,8.5667889724903596E-4,1.0512456138574398E-2,1.7381329153244147E-2,7.9870616449648267E-4,{"$f":"AO8+AV8+AX8+AY8","v":3.4304236777298658E-2},3.878021832554357E-2,0.06,{"$f":"BB8/(BB8+BA8)","v":0.60740906445723664},1.3159027767142334E-3,1.7172992524240331E-3,7.7622618264485813E-2,0.15324462382581669,0,1.0316942263236483E-3,6.9552762062142018E-3,9.069786967999216E-4,4.4393956925343189E-2,1.4408509407475281E-6,9.5035570694843122E-6,0.17595961466658869,0.46315890924872061,0.60740906445723664,{"$f":"100*BQ8","v":60.740906445723667},5,10.507357436577642,0.10507357436577643,53.193883749349489,null,9.9257693684856957E-2,null,3.4304236777298658E-2,1.7381329153244147E-2,4.4749004572322186E-3,null,null,{"$f":"IF(OR(MODE=1,MODE=2,MODE=3), BR8, IF(MODE_ILIM=4,#REF!,#REF!))","v":60.740906445723667},{"$f":"IF(OR(MODE=1,MODE=2,MODE=3), BZ8, IF(MODE_ILIM=4,#REF!,#REF!))","v":3.4304236777298658E-2},{"$f":"IF(OR(MODE=1,MODE=2,MODE=3), CA8, IF(MODE_ILIM=4,#REF!,#REF!))","v":1.7381329153244147E-2},{"$f":"IF(OR(MODE=1,MODE=2,MODE=3), CB8, IF(MODE_ILIM=4,#REF!,#REF!))","v":4.4749004572322186E-3},{"$f":"(IF(OR(MODE=1,MODE=2,MODE=3), S8, IF(MODE_ILIM=4,#REF!,#REF!)))/1000","v":53.193883749349489},{"$f":"IF(OR(MODE=1,MODE=2,MODE=3), P8, IF(MODE_ILIM=4,#REF!,#REF!))","v":46.951340763883643}]
["Vout",{"$f":"Vout","v":12},"V",{"$f":"B9","v":12},"Vout",null,null,3,7.4999999999999997E-3,0.22669702892741328,0.22669702892741328,0,45.630747757158687,2.8769534594332398,16,46.031255350931836,6.2093001672768886E-7,1.6623088671671712E-2,79790.825624024219,5.8292633500610224E-6,6.7035058270874599E-6,3.1232912806280225E-4,3.3464823637386988E-2,1.3438733052976979E-4,6.5778671361302644E-3,6.7123987964769483E-3,1.6781806596963184E-2,1.4081451632893851E-6,1.4081451632893851E-6,8.4659505564936531E-3,2.1501695647498561E-7,2.1501695647498561E-7,1.6822938326617517E-2,1.9442873145758834E-4,3.2036016488045727E-4,40,33.982443275858451,7.8415901865364884E-3,1.4707044979020143E-2,2.286899533043709E-2,2.3064253443081707E-2,2.8928933045313621E-2,2.5441248281063249E-4,8.7769908186426646E-4,0,1.5615325458889925E-4,1.0338523364531657E-3,1.2883254395991395E-3,1.5349722187579233E-2,2.5653031709583857E-2,1.1980592467447236E-3,5.1203669839009425E-2,5.7917691797606134E-2,0.09,{"$f":"BB9/(BB9+BA9)","v":0.60844648740967266},1.3200456975206538E-3,1.7203696194378565E-3,7.7755193641653925E-2,0.1546062208821406,0,1.0556766583578233E-3,6.9893758068356859E-3,9.0852776903556766E-4,4.4469779484733137E-2,1.4536256877858162E-6,9.519788648514959E-6,0.17342774483450274,0.46226390780855425,0.60844648740967266,60.844648740967266,7.5,11.516667783884284,0.11516667783884284,79.790825624024222,null,9.9427220640676314E-2,null,5.1203669839009425E-2,2.5653031709583857E-2,6.7123987964769483E-3,null,null,{"$f":"IF(OR(MODE=1,MODE=2,MODE=3), BR9, IF(MODE_ILIM=4,#REF!,#REF!))","v":60.844648740967266},{"$f":"IF(OR(MODE=1,MODE=2,MODE=3), BZ9, IF(MODE_ILIM=4,#REF!,#REF!))","v":5.1203669839009425E-2},{"$f":"IF(OR(MODE=1,MODE=2,MODE=3), CA9, IF(MODE_ILIM=4,#REF!,#REF!))","v":2.5653031709583857E-2},{"$f":"IF(OR(MODE=1,MODE=2,MODE=3), CB9, IF(MODE_ILIM=4,#REF!,#REF!))","v":6.7123987964769483E-3},{"$f":"(IF(OR(MODE=1,MODE=2,MODE=3), S9, IF(MODE_ILIM=4,#REF!,#REF!)))/1000","v":79.790825624024222},{"$f":"IF(OR(MODE=1,MODE=2,MODE=3), P9, IF(MODE_ILIM=4,#REF!,#REF!))","v":46.031255350931836}]
["Iout",{"$f":"Iout","v":0.25},"A",{"$f":"B10","v":0.25},"Iout(max)",null,null,4,0.01,0.22669702892741328,0.22669702892741328,0,45.479232605643539,2.8196586513896813,17,47.934197073624581,6.2093001672768886E-7,2.2164118228895618E-2,106387.76749869897,5.8292633500610224E-6,3.5703135328003376E-6,4.1310550408373649E-4,3.8641849870857468E-2,1.7918310737302648E-4,8.7704895148403537E-3,8.949929210393651E-3,1.937796111248986E-2,1.8775268843858465E-6,1.8775268843858465E-6,9.8236638611193319E-3,2.8951311496878596E-7,2.8951311496878596E-7,1.9425455942866193E-2,2.5923830861011778E-4,4.2714688650727643E-4,40,33.982443275858451,1.0672372558504837E-2,1.9609393305360195E-2,3.0708912750372311E-2,3.0969635933023574E-2,3.3404254562160958E-2,3.3921664374750993E-4,1.1702654424856889E-3,0,2.1258937675501332E-4,1.3828548192407022E-3,1.7221795092899328E-3,2.0186988236584075E-2,3.3924734265923573E-2,1.5974123289929653E-3,6.8213962037230041E-2,7.7166058287623046E-2,0.12,0.60862402505884505,1.3223532737613682E-3,1.7210096554967317E-3,7.7777881708025812E-2,0.15575151736093737,0,1.0782250180448958E-3,7.0136555513191489E-3,9.0879286693268835E-4,4.4482755252154449E-2,1.4683719778302224E-6,9.5225664127592242E-6,0.17206173598315108,0.46212891760821406,0.60862402505884505,60.862402505884504,10,12.603144523181673,0.12603144523181672,106.38776749869898,null,9.9456232353919108E-2,null,6.8213962037230041E-2,3.3924734265923573E-2,8.949929210393651E-3,null,null,{"$f":"IF(OR(MODE=1,MODE=2,MODE=3), BR10, IF(MODE_ILIM=4,#REF!,#REF!))","v":60.862402505884504},{"$f":"IF(OR(MODE=1,MODE=2,MODE=3), BZ10, IF(MODE_ILIM=4,#REF!,#REF!))","v":6.8213962037230041E-2},{"$f":"IF(OR(MODE=1,MODE=2,MODE=3), CA10, IF(MODE_ILIM=4,#REF!,#REF!))","v":3.3924734265923573E-2},{"$f":"IF(OR(MODE=1,MODE=2,MODE=3), CB10, IF(MODE_ILIM=4,#REF!,#REF!))","v":8.949929210393651E-3},{"$f":"(IF(OR(MODE=1,MODE=2,MODE=3), S10, IF(MODE_ILIM=4,#REF!,#REF!)))/1000","v":106.38776749869898},{"$f":"IF(OR(MODE=1,MODE=2,MODE=3), P10, IF(MODE_ILIM=4,#REF!,#REF!))","v":47.934197073624581}]
["Rt",{"$f":"Vout*2500/(Fsw/1000)","v":25},"kW",{"$f":"B11*1000","v":25000},"RT pin resistance to get Fsw",null,null,5,1.2500000000000001E-2,0.22669702892741328,0.22669702892741328,0,45.327717454128383,2.7625874725490704,17,46.963987033334199,6.2093001672768886E-7,2.7705147786119523E-2,132984.70937337371,5.8292633500610224E-6,1.6903981562280649E-6,5.1388188010467056E-4,4.3202901543789377E-2,2.2397888421628301E-4,1.0963111893550441E-2,1.1187491699672016E-2,2.1665219156437394E-2,2.3469086054823091E-6,2.3469086054823091E-6,1.1051260178062978E-2,3.6639105456972167E-7,3.6639105456972167E-7,2.1718319991088038E-2,3.240478857626472E-4,5.3393360813409549E-4,40,33.982443275858451,1.361161441870128E-2,2.4511741631700244E-2,3.8657289658535619E-2,3.8983673939436483E-2,3.734709196934969E-2,4.2402080468438742E-4,1.4628318031071111E-3,0,2.7122134219043558E-4,1.7340531452975467E-3,2.1582432051287337E-3,2.5024254285588913E-2,4.2196436822263289E-2,1.9967654112412066E-3,8.5335119378069715E-2,9.6525324377401786E-2,0.15000000000000002,0.60845675947825684,1.3239381460105389E-3,1.7206753947184789E-3,7.7756506339973969E-2,0.15680859463896604,0,1.1001763931369054E-3,7.0339757170054928E-3,9.0854310721196819E-4,4.4470530243648242E-2,1.4862207584354264E-6,9.519949365889335E-6,0.17116471473602207,0.46229866088681804,0.60845675947825684,60.845675947825683,12.5,13.76888730592373,0.1376888730592373,132.9847093733737,null,9.9428899215950717E-2,null,8.5335119378069715E-2,4.2196436822263289E-2,1.1187491699672016E-2,null,null,{"$f":"IF(OR(MODE=1,MODE=2,MODE=3), BR11, IF(MODE_ILIM=4,#REF!,#REF!))","v":60.845675947825683},{"$f":"IF(OR(MODE=1,MODE=2,MODE=3), BZ11, IF(MODE_ILIM=4,#REF!,#REF!))","v":8.5335119378069715E-2},{"$f":"IF(OR(MODE=1,MODE=2,MODE=3), CA11, IF(MODE_ILIM=4,#REF!,#REF!))","v":4.2196436822263289E-2},{"$f":"IF(OR(MODE=1,MODE=2,MODE=3), CB11, IF(MODE_ILIM=4,#REF!,#REF!))","v":1.1187491699672016E-2},{"$f":"(IF(OR(MODE=1,MODE=2,MODE=3), S11, IF(MODE_ILIM=4,#REF!,#REF!)))/1000","v":132.9847093733737},{"$f":"IF(OR(MODE=1,MODE=2,MODE=3), P11, IF(MODE_ILIM=4,#REF!,#REF!))","v":46.963987033334199}]
["Tamb",{"$f":"'Design Converter'!E56","v":25},"°C",{"$f":"B12","v":25},"Ambient temperature",null,null,6,1.4999999999999999E-2,0.22669702892741328,0.22669702892741328,0,45.176202302613241,2.7057540736604353,17,45.997819252227401,6.2093001672768886E-7,3.3246177343343425E-2,159581.65124804844,5.8292633500610224E-6,4.3712123851321872E-7,6.1465825612560469E-4,4.7326407450416413E-2,2.6877466105953963E-4,1.3155734272260529E-2,1.3425086265001759E-2,2.3733058490547611E-2,2.8162903265787703E-6,2.8162903265787703E-6,1.2195791179892879E-2,4.4621196751065881E-7,4.4621196751065881E-7,2.3791227540468633E-2,3.8885746291517667E-4,6.4072032976091454E-4,40,33.982443275858451,1.6659315767125808E-2,2.9414089958040287E-2,4.6714126054927009E-2,4.7106371369809712E-2,4.0911689457665726E-2,5.0882496562126497E-4,1.7553981637285329E-3,0,3.3205114566580649E-4,2.0874493093943395E-3,2.5965186260545475E-3,2.9861520334593748E-2,5.0468139378602991E-2,2.3961184934894473E-3,0.1025671478679567,0.11599549663525255,0.18,0.60811736004824846,1.3251732520986837E-3,1.7198549384942865E-3,7.7713133473258103E-2,0.15782039451935176,0,1.1218114783515926E-3,7.0523009070190294E-3,9.0803631850772234E-4,4.4445724417462994E-2,1.507495798358426E-6,9.5146391029361197E-6,0.17050306491923947,0.46262051635868495,0.60811736004824846,60.811736004824844,15,15.015319606822954,0.15015319606822955,159.58165124804844,null,9.9373437408361978E-2,null,0.1025671478679567,5.0468139378602991E-2,1.3425086265001759E-2,null,null,{"$f":"IF(OR(MODE=1,MODE=2,MODE=3), BR12, IF(MODE_ILIM=4,#REF!,#REF!))","v":60.811736004824844},{"$f":"IF(OR(MODE=1,MODE=2,MODE=3), BZ12, IF(MODE_ILIM=4,#REF!,#REF!))","v":0.1025671478679567},{"$f":"IF(OR(MODE=1,MODE=2,MODE=3), CA12, IF(MODE_ILIM=4,#REF!,#REF!))","v":5.0468139378602991E-2},{"$f":"IF(OR(MODE=1,MODE=2,MODE=3), CB12, IF(MODE_ILIM=4,#REF!,#REF!))","v":1.3425086265001759E-2},{"$f":"(IF(OR(MODE=1,MODE=2,MODE=3), S12, IF(MODE_ILIM=4,#REF!,#REF!)))/1000","v":159.58165124804844},{"$f":"IF(OR(MODE=1,MODE=2,MODE=3), P12, IF(MODE_ILIM=4,#REF!,#REF!))","v":45.997819252227401}]
["VDD",5,"V",{"$f":"B13","v":5},"Gate drive rail",null,null,7,1.7500000000000002E-2,0.22669702892741328,0.22669702892741328,0,45.024687151098085,2.649173758229463,17,45.035953889900874,6.2093001672768886E-7,3.8787206900567341E-2,186178.59312272322,5.3711867902064906E-6,0,6.6E-4,5.1118362478891115E-2,3.1357043790279632E-4,1.534835665097062E-2,1.5662712907072617E-2,2.5634633009564353E-2,3.2856720476752319E-6,3.2856720476752319E-6,1.328562167245244E-2,5.2952322967061394E-7,5.2952322967061394E-7,2.5697462764432837E-2,4.536670400677062E-4,7.4750705138773381E-4,40,33.982443275858451,1.9815476603778439E-2,3.4316438284380343E-2,5.4879421939546515E-2,5.5337732131819917E-2,4.4189675151486356E-2,5.936291265581428E-4,2.0479645243499556E-3,0,3.9508078195176692E-4,2.4430453063017223E-3,3.0370078711380792E-3,3.2037924040564728E-2,5.6078979591908856E-2,2.7954715757376892E-3,0.11724919117060455,0.13291571927295451,0.21000000000000002,0.61239537354904383,1.3365097209457339E-3,1.7320948893671854E-3,7.8259833594039596E-2,0.16003763856582942,0,1.1521221097400029E-3,7.1243316330946724E-3,9.1442421644485807E-4,4.4758393355405254E-2,1.5441789335096749E-6,9.5815731475986922E-6,0.16353575074017251,0.45886222457712034,0.61239537354904383,61.239537354904385,17.5,16.343061169118954,0.16343061169118955,186.17859312272321,null,0.10007251448588479,null,0.11724919117060455,5.6078979591908856E-2,1.5662712907072617E-2,null,null,{"$f":"IF(OR(MODE=1,MODE=2,MODE=3), BR13, IF(MODE_ILIM=4,#REF!,#REF!))","v":61.239537354904385},{"$f":"IF(OR(MODE=1,MODE=2,MODE=3), BZ13, IF(MODE_ILIM=4,#REF!,#REF!))","v":0.11724919117060455},{"$f":"IF(OR(MODE=1,MODE=2,MODE=3), CA13, IF(MODE_ILIM=4,#REF!,#REF!))","v":5.6078979591908856E-2},{"$f":"IF(OR(MODE=1,MODE=2,MODE=3), CB13, IF(MODE_ILIM=4,#REF!,#REF!))","v":1.5662712907072617E-2},{"$f":"(IF(OR(MODE=1,MODE=2,MODE=3), S13, IF(MODE_ILIM=4,#REF!,#REF!)))/1000","v":186.17859312272321},{"$f":"IF(OR(MODE=1,MODE=2,MODE=3), P13, IF(MODE_ILIM=4,#REF!,#REF!))","v":45.035953889900874}]
["K1",400,"pC",4,"RT constant",null,null,8,0.02,0.22669702892741328,0.22669702892741328,0,44.873171999582937,2.5928630943360256,18,46.671535698048459,6.2093001672768886E-7,4.4328236457791236E-2,212775.53499739795,4.69978844143068E-6,0,6.6E-4,5.4647828162551662E-2,3.5836621474605296E-4,1.7540979029680707E-2,1.7900371626574339E-2,2.7404575416421592E-2,3.7550537687716935E-6,3.7550537687716935E-6,1.4339437466590209E-2,6.1685840057475309E-7,6.1685840057475309E-7,2.747174324968241E-2,5.1847661722023567E-4,8.5429377301455287E-4,40,33.982443275858451,2.3080096928659154E-2,3.9218786610720389E-2,6.3153177312394101E-2,6.3677760133331082E-2,4.7240749842771365E-2,6.7843328749501997E-4,2.3405308849713778E-3,0,4.6031224581895731E-4,2.8008431307903351E-3,3.4797130395817387E-3,3.2037924040564728E-2,5.9513416099243731E-2,3.1948246579859307E-3,0.12986571393014248,0.14777045746888617,0.24,0.61892285855545626,1.3528179128475049E-3,1.7507004355685723E-3,7.9094000396164404E-2,0.16286227095436059,0,1.1870740458764621E-3,7.2229409869756997E-3,9.2417100850135663E-4,4.5235470345463734E-2,1.5907823525319704E-6,9.6837025524900662E-6,0.153475890060601,0.45311661063126429,0.61892285855545626,61.892285855545623,20,17.75180413241851,0.17751804132418511,212.77553499739795,null,0.10113918132576466,null,0.12986571393014248,5.9513416099243731E-2,1.7900371626574339E-2,null,null,{"$f":"IF(OR(MODE=1,MODE=2,MODE=3), BR14, IF(MODE_ILIM=4,#REF!,#REF!))","v":61.892285855545623},{"$f":"IF(OR(MODE=1,MODE=2,MODE=3), BZ14, IF(MODE_ILIM=4,#REF!,#REF!))","v":0.12986571393014248},{"$f":"IF(OR(MODE=1,MODE=2,MODE=3), CA14, IF(MODE_ILIM=4,#REF!,#REF!))","v":5.9513416099243731E-2},{"$f":"IF(OR(MODE=1,MODE=2,MODE=3), CB14, IF(MODE_ILIM=4,#REF!,#REF!))","v":1.7900371626574339E-2},{"$f":"(IF(OR(MODE=1,MODE=2,MODE=3), S14, IF(MODE_ILIM=4,#REF!,#REF!)))/1000","v":212.77553499739795},{"$f":"IF(OR(MODE=1,MODE=2,MODE=3), P14, IF(MODE_ILIM=4,#REF!,#REF!))","v":46.671535698048459}]
["Outputs",null,null,null,null,null,null,9,2.2499999999999999E-2,0.22669702892741328,0.22669702892741328,0,44.721656848067781,2.5368400385449137,18,45.663120693808445,6.2093001672768886E-7,4.9869266015015137E-2,239372.47687207267,4.1775897257161599E-6,0,6.6E-4,5.7962774806286192E-2,4.0316199158930944E-4,1.9733601408390797E-2,2.0138062424196697E-2,2.9066941668734792E-2,4.2244354898681546E-6,4.2244354898681546E-6,1.5370287607311231E-2,7.087372233943956E-7,7.087372233943956E-7,2.9138183914299291E-2,5.8328619437276509E-4,9.6108049464137181E-4,40,33.982443275858451,2.6453176741767965E-2,4.4121134937060436E-2,7.153539217346977E-2,7.2126459282394598E-2,5.0106381843241433E-2,7.6323744843189724E-4,2.6330972455927996E-3,0,5.277475320380182E-4,3.1608447776308177E-3,3.9246362307196582E-3,3.2037924040564728E-2,6.2947852606578605E-2,3.5941777402341713E-3,0.14259312585992706,0.16273612145683702,0.27,0.62393682110711202,1.3658834555686237E-3,1.7650281897371592E-3,7.9734749643934302E-2,0.16530950070135297,0,1.2195596943960177E-3,7.3043238613629208E-3,9.3165782008683678E-4,4.5601927895356227E-2,1.6378046302406676E-6,9.7621512982237095E-6,0.14546475204025069,0.44870878325797425,0.62393682110711202,62.393682110711204,22.5,19.240199150848532,0.19240199150848533,239.37247687207267,null,0.10195852102321268,null,0.14259312585992706,6.2947852606578605E-2,2.0138062424196697E-2,null,null,{"$f":"IF(OR(MODE=1,MODE=2,MODE=3), BR15, IF(MODE_ILIM=4,#REF!,#REF!))","v":62.393682110711204},{"$f":"IF(OR(MODE=1,MODE=2,MODE=3), BZ15, IF(MODE_ILIM=4,#REF!,#REF!))","v":0.14259312585992706},{"$f":"IF(OR(MODE=1,MODE=2,MODE=3), CA15, IF(MODE_ILIM=4,#REF!,#REF!))","v":6.2947852606578605E-2},{"$f":"IF(OR(MODE=1,MODE=2,MODE=3), CB15, IF(MODE_ILIM=4,#REF!,#REF!))","v":2.0138062424196697E-2},{"$f":"(IF(OR(MODE=1,MODE=2,MODE=3), S15, IF(MODE_ILIM=4,#REF!,#REF!)))/1000","v":239.37247687207267},{"$f":"IF(OR(MODE=1,MODE=2,MODE=3), P15, IF(MODE_ILIM=4,#REF!,#REF!))","v":45.663120693808445}]
["Design","Value","Units","Std Units","Description",null,null,10,2.5000000000000001E-2,0.22669702892741328,0.22669702892741328,0,44.570141696552632,2.4811240732530733,18,44.660233318555314,6.2093001672768886E-7,5.5410295572239046E-2,265969.41874674743,3.7598307531445441E-6,0,6.6E-4,6.1098129297096467E-2,4.4795776843256608E-4,2.1926223787100883E-2,2.2375785300629482E-2,3.0639246762819143E-2,4.6938172109646166E-6,4.6938172109646166E-6,1.6387654143155139E-2,8.0566562494700941E-7,8.0566562494700941E-7,3.0714342683355426E-2,6.4809577152529472E-4,1.067867216268191E-3,40,33.982443275858451,2.9934716043104874E-2,4.9023483263400489E-2,8.0026066522773553E-2,8.0683833487249279E-2,5.2816763978249637E-2,8.4804160936877507E-4,2.9256636062142223E-3,0,5.9738863537959032E-4,3.5230522415938127E-3,4.3717795440176982E-3,3.2037924040564728E-2,6.6382289113913473E-2,3.9935308224824132E-3,0.15543143296766285,0.17781271775112825,0.30000000000000004,0.62786106115379059,1.3766208810254556E-3,1.776276082433516E-3,8.0236239998533687E-2,0.1674841701565081,0,1.250256875102148E-3,7.3732910630244378E-3,9.3751746613384963E-4,4.588874044688214E-2,1.6861535807145369E-6,9.8235501831272308E-6,0.1389295149495981,0.44526413762300526,0.62786106115379059,62.786106115379056,25,20.80575856495858,0.20805758564958579,265.96941874674741,null,0.10259978741071239,null,0.15543143296766285,6.6382289113913473E-2,2.2375785300629482E-2,null,null,{"$f":"IF(OR(MODE=1,MODE=2,MODE=3), BR16, IF(MODE_ILIM=4,#REF!,#REF!))","v":62.786106115379056},{"$f":"IF(OR(MODE=1,MODE=2,MODE=3), BZ16, IF(MODE_ILIM=4,#REF!,#REF!))","v":0.15543143296766285},{"$f":"IF(OR(MODE=1,MODE=2,MODE=3), CA16, IF(MODE_ILIM=4,#REF!,#REF!))","v":6.6382289113913473E-2},{"$f":"IF(OR(MODE=1,MODE=2,MODE=3), CB16, IF(MODE_ILIM=4,#REF!,#REF!))","v":2.2375785300629482E-2},{"$f":"(IF(OR(MODE=1,MODE=2,MODE=3), S16, IF(MODE_ILIM=4,#REF!,#REF!)))/1000","v":265.96941874674741},{"$f":"IF(OR(MODE=1,MODE=2,MODE=3), P16, IF(MODE_ILIM=4,#REF!,#REF!))","v":44.660233318555314}]
["On-Time",{"$f":"(Rt*k_RT/10000)/Vin","v":0.20833333333333334},"µs",{"$f":"B17/1000000","v":2.0833333333333333E-7},"On Time - fixed",null,null,11,2.75E-2,0.22669702892741328,0.22669702892741328,0,44.418626545037476,2.4257363589442038,19,46.088990819939866,6.2093001672768886E-7,6.0951325129462955E-2,292566.36062142218,3.4180279574041307E-6,0,6.5999999999999989E-4,6.4080258613438731E-2,4.9275354527582261E-4,2.4118846165810975E-2,2.4613540256562514E-2,3.2134713106113391E-2,5.1631989320610794E-6,5.1631989320610794E-6,1.7398617911548928E-2,9.0813571569621365E-7,9.0813571569621365E-7,3.221347437203332E-2,7.1290534867782392E-4,1.17465393789501E-3,40,33.982443275858451,3.3524714832669875E-2,5.3925831589740535E-2,8.8625200360305412E-2,8.934988665632132E-2,5.539468939210275E-2,9.3284577030565245E-4,3.2182299668356445E-3,0,6.6923755061431428E-4,3.8874675174499587E-3,4.8211450790734542E-3,3.2037924040564721E-2,6.9816725621248354E-2,4.3928839047306543E-3,0.16838064126137378,0.19300025285258404,0.33,0.63097483834872203,1.3856327832793087E-3,1.7852334803491333E-3,8.0634158885007343E-2,0.16945536809383882,0,1.2796122888356412E-3,7.4330126921481679E-3,9.4216693507930861E-4,4.6116318365546284E-2,1.7363963224549073E-6,9.8722685197561634E-6,0.13349271867546744,0.44253583086439374,0.63097483834872203,63.0974838348722,27.5,22.444784059665849,0.22444784059665848,292.56636062142218,null,0.10310861475805133,null,0.16838064126137378,6.9816725621248354E-2,2.4613540256562514E-2,null,null,{"$f":"IF(OR(MODE=1,MODE=2,MODE=3), BR17, IF(MODE_ILIM=4,#REF!,#REF!))","v":63.0974838348722},{"$f":"IF(OR(MODE=1,MODE=2,MODE=3), BZ17, IF(MODE_ILIM=4,#REF!,#REF!))","v":0.16838064126137378},{"$f":"IF(OR(MODE=1,MODE=2,MODE=3), CA17, IF(MODE_ILIM=4,#REF!,#REF!))","v":6.9816725621248354E-2},{"$f":"IF(OR(MODE=1,MODE=2,MODE=3), CB17, IF(MODE_ILIM=4,#REF!,#REF!))","v":2.4613540256562514E-2},{"$f":"(IF(OR(MODE=1,MODE=2,MODE=3), S17, IF(MODE_ILIM=4,#REF!,#REF!)))/1000","v":292.56636062142218},{"$f":"IF(OR(MODE=1,MODE=2,MODE=3), P17, IF(MODE_ILIM=4,#REF!,#REF!))","v":46.088990819939866}]
["Off Time",{"$f":"L*Iripple*1000000/(Vout+(Rdcr+RdsonBot)*Iout)","v":0.61605557161737989},"µs",{"$f":"B18/1000000","v":6.1605557161737987E-7},"Off Time - depends on Vout, L, Iout, DCR, etc.",null,null,12,0.03,0.22669702892741328,0.22669702892741328,0,44.26711139352232,2.3706999029502738,19,45.043298156055201,6.2093001672768886E-7,6.649235468668685E-2,319163.30249609688,3.1331922942871206E-6,0,6.6E-4,6.6929647274773976E-2,5.3754932211907914E-4,2.6311468544521058E-2,2.6851327292685606E-2,3.3563613193926367E-2,5.6325806531575406E-6,5.6325806531575406E-6,1.8408564942726868E-2,1.0166257897517779E-6,1.0166257897517779E-6,3.3645876653235034E-2,7.7771492583035334E-4,1.2814406595218291E-3,40,33.982443275858451,3.7223173110462957E-2,5.8828179916080574E-2,9.7332793686065358E-2,9.8124622698224348E-2,5.7857866090627243E-2,1.0176499312425299E-3,3.5107963274570659E-3,0,7.4329627251283029E-4,4.2540925999698959E-3,5.2727349356162766E-3,3.2037924040564728E-2,7.3251162128583222E-2,4.7922369869788945E-3,0.18144075674940274,0.20829873324853126,0.36,0.63346965062222482,1.3933323546802688E-3,1.7924416790858883E-3,8.0952978395744654E-2,0.17127047447332475,0,1.3079323057152907E-3,7.4856626472708946E-3,9.4589217020829683E-4,4.6298657739598369E-2,1.7888932884655616E-6,9.911302495714472E-6,0.12889552244795988,0.44035459440937247,0.63346965062222482,63.34696506222248,30,24.152326085424395,0.24152326085424394,319.16330249609689,null,0.10351629605050262,null,0.18144075674940274,7.3251162128583222E-2,2.6851327292685606E-2,null,null,{"$f":"IF(OR(MODE=1,MODE=2,MODE=3), BR18, IF(MODE_ILIM=4,#REF!,#REF!))","v":63.34696506222248},{"$f":"IF(OR(MODE=1,MODE=2,MODE=3), BZ18, IF(MODE_ILIM=4,#REF!,#REF!))","v":0.18144075674940274},{"$f":"IF(OR(MODE=1,MODE=2,MODE=3), CA18, IF(MODE_ILIM=4,#REF!,#REF!))","v":7.3251162128583222E-2},{"$f":"IF(OR(MODE=1,MODE=2,MODE=3), CB18, IF(MODE_ILIM=4,#REF!,#REF!))","v":2.6851327292685606E-2},{"$f":"(IF(OR(MODE=1,MODE=2,MODE=3), S18, IF(MODE_ILIM=4,#REF!,#REF!)))/1000","v":319.16330249609689},{"$f":"IF(OR(MODE=1,MODE=2,MODE=3), P18, IF(MODE_ILIM=4,#REF!,#REF!))","v":45.043298156055201}]
["DIL",{"$f":"(Vin-Vout-(Rdcr+RdsonTop)*Iout)/L*OnTime*1000","v":225.99905303030303},"mA",{"$f":"B19/1000","v":0.22599905303030304},"Inductor pk-pk ripple current in CCM",null,null,13,3.2500000000000001E-2,0.22669702892741328,0.22669702892741328,0,44.115596242007172,2.3160397464442593,20,46.320794928885185,6.2093001672768886E-7,7.2033384243910772E-2,345760.24437077169,2.8921775024188798E-6,0,6.6E-4,6.9662585544079073E-2,5.8234509896233622E-4,2.8504090923231151E-2,2.9089146409688637E-2,3.4934116202514708E-2,6.1019623742540034E-6,6.1019623742540034E-6,1.9421640205962896E-2,1.1316003248696235E-6,1.1316003248696235E-6,3.5019738725635373E-2,8.4252450298288309E-4,1.3882273811486484E-3,40,33.982443275858451,4.103009087648414E-2,6.3730528242420634E-2,0.10614884650005342,0.10700804552175944,6.0220376321261621E-2,1.1024540921794077E-3,3.8033626880784894E-3,0,8.1956679584577977E-4,4.6229294839242692E-3,5.726551213507276E-3,3.2037924040564728E-2,7.6685598635918117E-2,5.1915900692271373E-3,0.19461178544041197,0.22370816541279973,0.39,0.63548119770848011,1.4000123676504975E-3,1.7982842526474707E-3,8.1210040005019399E-2,0.17296306694673733,0,1.3354340744260963E-3,7.532781449656514E-3,9.4889579735448414E-4,4.6445676511503456E-2,1.8438736660909066E-6,9.9427752768282436E-6,0.12495450273883342,0.43860048079277153,0.63548119770848011,63.548119770848011,32.5,25.922181532084487,0.25922181532084487,345.76024437077172,null,0.10384500620022458,null,0.19461178544041197,7.6685598635918117E-2,2.9089146409688637E-2,null,null,{"$f":"IF(OR(MODE=1,MODE=2,MODE=3), BR19, IF(MODE_ILIM=4,#REF!,#REF!))","v":63.548119770848011},{"$f":"IF(OR(MODE=1,MODE=2,MODE=3), BZ19, IF(MODE_ILIM=4,#REF!,#REF!))","v":0.19461178544041197},{"$f":"IF(OR(MODE=1,MODE=2,MODE=3), CA19, IF(MODE_ILIM=4,#REF!,#REF!))","v":7.6685598635918117E-2},{"$f":"IF(OR(MODE=1,MODE=2,MODE=3), CB19, IF(MODE_ILIM=4,#REF!,#REF!))","v":2.9089146409688637E-2},{"$f":"(IF(OR(MODE=1,MODE=2,MODE=3), S19, IF(MODE_ILIM=4,#REF!,#REF!)))/1000","v":345.76024437077172},{"$f":"IF(OR(MODE=1,MODE=2,MODE=3), P19, IF(MODE_ILIM=4,#REF!,#REF!))","v":46.320794928885185}]
["CCM Freq",{"$f":"'Design Converter'!E12","v":1200},"kHz",{"$f":"B20*1000","v":1200000},"Frequency in CCM",{"$f":"10000*Vout/(k_RT*Rt/1000+Vin*0.75)","v":882.35294117647061},null,14,3.5000000000000003E-2,0.22669702892741328,0.22669702892741328,0,43.964081090492023,2.2617831715014893,20,45.235663430029788,6.2093001672768886E-7,7.7574413801134681E-2,372357.18624544644,2.6855933951032453E-6,0,6.6E-4,7.2292281503951755E-2,6.2714087580559253E-4,3.069671330194124E-2,3.1326997608261457E-2,3.6252845668582938E-2,6.5713440953504638E-6,6.5713440953504638E-6,2.0441053319662218E-2,1.2535099824518213E-6,1.2535099824518213E-6,3.6341700360038531E-2,9.0733408013541272E-4,1.4950141027754676E-3,40,33.982443275858451,4.4945468130733426E-2,6.8632876568760687E-2,0.11507335880226957,0.11600015903591507,6.2493637916093352E-2,1.1872582531162852E-3,4.0959290486999112E-3,0,8.9805111538380242E-4,4.9939801640837139E-3,6.1825960127393264E-3,3.2037924040564728E-2,8.0120035143252985E-2,5.5909431514753784E-3,0.20789373334338276,0.23922855580572203,0.42000000000000004,0.63710832351105884,1.4058860549703339E-3,1.8030405967515513E-3,8.1417975270448306E-2,0.17455760644595358,0,1.3622758108319303E-3,7.5754912618734693E-3,9.5132540949942421E-4,4.6564598926427142E-2,1.901480103391087E-6,9.9682333804834026E-6,0.12153605064229767,0.43718612013253733,0.63710832351105884,63.710832351105886,35,27.746934669307642,0.27746934669307644,372.35718624544643,null,0.10411089744872511,null,0.20789373334338276,8.0120035143252985E-2,3.1326997608261457E-2,null,null,{"$f":"IF(OR(MODE=1,MODE=2,MODE=3), BR20, IF(MODE_ILIM=4,#REF!,#REF!))","v":63.710832351105886},{"$f":"IF(OR(MODE=1,MODE=2,MODE=3), BZ20, IF(MODE_ILIM=4,#REF!,#REF!))","v":0.20789373334338276},{"$f":"IF(OR(MODE=1,MODE=2,MODE=3), CA20, IF(MODE_ILIM=4,#REF!,#REF!))","v":8.0120035143252985E-2},{"$f":"IF(OR(MODE=1,MODE=2,MODE=3), CB20, IF(MODE_ILIM=4,#REF!,#REF!))","v":3.1326997608261457E-2},{"$f":"(IF(OR(MODE=1,MODE=2,MODE=3), S20, IF(MODE_ILIM=4,#REF!,#REF!)))/1000","v":372.35718624544643},{"$f":"IF(OR(MODE=1,MODE=2,MODE=3), P20, IF(MODE_ILIM=4,#REF!,#REF!))","v":45.235663430029788}]
["Icrit_Skip",{"$f":"1000*Iripple/2","v":112.99952651515152},"mA",{"$f":"Iripple/2","v":0.11299952651515152},"CCM-DCM (critical conduction) boundary",null,null,15,3.7499999999999999E-2,0.22669702892741328,0.22669702892741328,0,43.812565938976874,2.2079599301576289,20,44.159198603152582,6.2093001672768886E-7,8.3115443358358576E-2,398954.12812012114,2.5065538354296962E-6,0,6.6E-4,7.4829620508239089E-2,6.7193665264884907E-4,3.2889335680651326E-2,3.3564880889093963E-2,3.7525260336064098E-2,7.0407258164469274E-6,7.0407258164469274E-6,2.1469292858612373E-2,1.3827916075465928E-6,1.3827916075465928E-6,3.7617233679603339E-2,9.7214365728794225E-4,1.6018008244022865E-3,40,33.982443275858451,4.8969304873210787E-2,7.3535224895100726E-2,0.1241063305927138,0.12510096714986718,6.4687060805861271E-2,1.2720624140531629E-3,4.388495409321333E-3,0,9.7875122589753953E-4,5.3672466352188723E-3,6.6408714334370896E-3,3.2037924040564728E-2,8.3554471650587853E-2,5.9902962337236194E-3,0.22128660646761575,0.25485991087413373,0.44999999999999996,0.63842473242935804,1.4111123952557966E-3,1.8069190467063568E-3,8.158620309733533E-2,0.17607233533653949,0,1.3885755322412064E-3,7.614628882159958E-3,9.5329106150404447E-4,4.6660811848220365E-2,1.9617963601188789E-6,9.9888299899413418E-6,0.11854053601511763,0.43604636384143025,0.63842473242935804,63.842473242935803,37.5,29.618044224570543,0.29618044224570544,398.95412812012114,null,0.10432601395063856,null,0.22128660646761575,8.3554471650587853E-2,3.3564880889093963E-2,null,null,{"$f":"IF(OR(MODE=1,MODE=2,MODE=3), BR21, IF(MODE_ILIM=4,#REF!,#REF!))","v":63.842473242935803},{"$f":"IF(OR(MODE=1,MODE=2,MODE=3), BZ21, IF(MODE_ILIM=4,#REF!,#REF!))","v":0.22128660646761575},{"$f":"IF(OR(MODE=1,MODE=2,MODE=3), CA21, IF(MODE_ILIM=4,#REF!,#REF!))","v":8.3554471650587853E-2},{"$f":"IF(OR(MODE=1,MODE=2,MODE=3), CB21, IF(MODE_ILIM=4,#REF!,#REF!))","v":3.3564880889093963E-2},{"$f":"(IF(OR(MODE=1,MODE=2,MODE=3), S21, IF(MODE_ILIM=4,#REF!,#REF!)))/1000","v":398.95412812012114},{"$f":"IF(OR(MODE=1,MODE=2,MODE=3), P21, IF(MODE_ILIM=4,#REF!,#REF!))","v":44.159198603152582}]
["Tr",null,"ns",{"$f":"B22/1000000000","v":0},"Switch rise time",null,null,16,0.04,0.22669702892741328,0.22669702892741328,0,43.661050787461718,2.154602497444162,21,45.246652446327403,6.2093001672768886E-7,8.8656472915582471E-2,425551.06999479589,2.34989422071534E-6,0,6.6E-4,7.7283699741714937E-2,7.1673242949210592E-4,3.5081958059361415E-2,3.5802796252876072E-2,3.8755922224979721E-2,7.5101075375433861E-6,7.5101075375433861E-6,2.2508281652525972E-2,1.519868228848312E-6,1.519868228848312E-6,3.8850911885732385E-2,1.0369532344404711E-3,1.7085875460291057E-3,40,33.982443275858451,5.3101601103916256E-2,7.8437573221440779E-2,0.13324776187138615,0.13431047377297928,6.6808509124321916E-2,1.3568665749900397E-3,4.6810617699427556E-3,0,1.0616691221576311E-3,5.7427308921003863E-3,7.1013795758570145E-3,3.2037924040564728E-2,8.6988908157922734E-2,6.3896493159718614E-3,0.23479041082273089,0.27060223705137337,0.48,0.63948650337841639,1.4158123292675349E-3,1.8100781168650291E-3,8.1721889977702716E-2,0.17752113608777625,0,1.414423072236284E-3,7.6508310375676871E-3,9.5487648998713367E-4,4.6738413939686009E-2,2.0248650401294869E-6,1.0005442519123977E-5,0.11589215148045044,0.43513164283909839,0.63948650337841639,63.948650337841642,40,31.525976771075946,0.31525976771075948,425.55106999479591,null,0.10449951965180765,null,0.23479041082273089,8.6988908157922734E-2,3.5802796252876072E-2,null,null,{"$f":"IF(OR(MODE=1,MODE=2,MODE=3), BR22, IF(MODE_ILIM=4,#REF!,#REF!))","v":63.948650337841642},{"$f":"IF(OR(MODE=1,MODE=2,MODE=3), BZ22, IF(MODE_ILIM=4,#REF!,#REF!))","v":0.23479041082273089},{"$f":"IF(OR(MODE=1,MODE=2,MODE=3), CA22, IF(MODE_ILIM=4,#REF!,#REF!))","v":8.6988908157922734E-2},{"$f":"IF(OR(MODE=1,MODE=2,MODE=3), CB22, IF(MODE_ILIM=4,#REF!,#REF!))","v":3.5802796252876072E-2},{"$f":"(IF(OR(MODE=1,MODE=2,MODE=3), S22, IF(MODE_ILIM=4,#REF!,#REF!)))/1000","v":425.55106999479591},{"$f":"IF(OR(MODE=1,MODE=2,MODE=3), P22, IF(MODE_ILIM=4,#REF!,#REF!))","v":45.246652446327403}]
["Tf",null,"ns",{"$f":"B23/1000000000","v":0},"Switch fall time",null,null,17,4.2500000000000003E-2,0.22669702892741328,0.22669702892741328,0,43.50953563594657,2.1017463503763141,21,44.136673357902595,6.2093001672768886E-7,9.419750247280638E-2,452148.01186947065,2.2116651489085552E-6,0,6.6E-4,7.9662214293402742E-2,7.6152820633536235E-4,3.7274580438071504E-2,3.8040743700297711E-2,3.9948690237953603E-2,7.9794892586398489E-6,7.9794892586398489E-6,2.3559492486734515E-2,1.6651490586975001E-6,1.6651490586975001E-6,4.004660333910981E-2,1.1017628115930008E-3,1.8153742676559246E-3,40,33.982443275858451,5.7342356822849799E-2,8.3339921547780832E-2,0.14249765263828656,0.14362868281480212,6.8864634952405135E-2,1.4416707359269179E-3,4.9736281305641774E-3,0,1.1468067989347183E-3,6.1204349294988955E-3,7.5641225403873542E-3,3.2037924040564728E-2,9.0423344665257602E-2,6.7890023982201016E-3,0.24840515241866717,0.28645554075728225,0.51,0.64033706076686236,1.4200794879776419E-3,1.8126405518075475E-3,8.183058524640828E-2,0.17891476089525046,0,1.4398880292104147E-3,7.6845908105297274E-3,9.561465359526404E-4,4.6800578978495475E-2,2.0906993215393424E-6,1.0018750388819981E-5,0.11353219362286274,0.43440357360820536,0.64033706076686236,64.033706076686229,42.5,33.460383546927204,0.33460383546927203,452.14801186947062,null,0.10463851060479779,null,0.24840515241866717,9.0423344665257602E-2,3.8040743700297711E-2,null,null,{"$f":"IF(OR(MODE=1,MODE=2,MODE=3), BR23, IF(MODE_ILIM=4,#REF!,#REF!))","v":64.033706076686229},{"$f":"IF(OR(MODE=1,MODE=2,MODE=3), BZ23, IF(MODE_ILIM=4,#REF!,#REF!))","v":0.24840515241866717},{"$f":"IF(OR(MODE=1,MODE=2,MODE=3), CA23, IF(MODE_ILIM=4,#REF!,#REF!))","v":9.0423344665257602E-2},{"$f":"IF(OR(MODE=1,MODE=2,MODE=3), CB23, IF(MODE_ILIM=4,#REF!,#REF!))","v":3.8040743700297711E-2},{"$f":"(IF(OR(MODE=1,MODE=2,MODE=3), S23, IF(MODE_ILIM=4,#REF!,#REF!)))/1000","v":452.14801186947062},{"$f":"IF(OR(MODE=1,MODE=2,MODE=3), P23, IF(MODE_ILIM=4,#REF!,#REF!))","v":44.136673357902595}]
[null,null,null,null,null,null,null,18,4.4999999999999998E-2,0.22669702892741328,0.22669702892741328,0,43.358020484431414,2.0494302747749895,22,45.087466045049766,6.2093001672768886E-7,9.9738532030030275E-2,478744.95374414534,2.08879486285808E-6,0,6.6E-4,8.1971742243827486E-2,8.0632398317861899E-4,3.9467202816781594E-2,4.0278723232048827E-2,4.1106863124632388E-2,8.4488709797363109E-6,8.4488709797363109E-6,2.4624036313331692E-2,1.8190294930808336E-6,1.8190294930808336E-6,4.1207614874523617E-2,1.1665723887455304E-3,1.9221609892827436E-3,40,33.982443275858451,6.1691572030011438E-2,8.8242269874120871E-2,0.15185600289341505,0.15305559818507419,7.0861124764157041E-2,1.5264748968637947E-3,5.2661944911855992E-3,0,1.2341662509994411E-3,6.5003607421850402E-3,8.0291024275481702E-3,3.2037924040564728E-2,9.3857781172592469E-2,7.1883554804683426E-3,0.2621308372656832,0.30241982839820486,0.54,0.64101055292913456,1.4239874836992799E-3,1.8147028759637723E-3,8.1916652821087774E-2,0.180261667370956,0,1.465025168443757E-3,7.7162959881238368E-3,9.5715218943953476E-4,4.6849802778058273E-2,2.1592909280632381E-6,1.0029287885829059E-5,0.11141449667804669,0.4338319719326329,0.64101055292913456,64.101055292913458,45,35.410314704487,0.35410314704487,478.74495374414533,null,0.10474856704394839,null,0.2621308372656832,9.3857781172592469E-2,4.0278723232048827E-2,null,null,{"$f":"IF(OR(MODE=1,MODE=2,MODE=3), BR24, IF(MODE_ILIM=4,#REF!,#REF!))","v":64.101055292913458},{"$f":"IF(OR(MODE=1,MODE=2,MODE=3), BZ24, IF(MODE_ILIM=4,#REF!,#REF!))","v":0.2621308372656832},{"$f":"IF(OR(MODE=1,MODE=2,MODE=3), CA24, IF(MODE_ILIM=4,#REF!,#REF!))","v":9.3857781172592469E-2},{"$f":"IF(OR(MODE=1,MODE=2,MODE=3), CB24, IF(MODE_ILIM=4,#REF!,#REF!))","v":4.0278723232048827E-2},{"$f":"(IF(OR(MODE=1,MODE=2,MODE=3), S24, IF(MODE_ILIM=4,#REF!,#REF!)))/1000","v":478.74495374414533},{"$f":"IF(OR(MODE=1,MODE=2,MODE=3), P24, IF(MODE_ILIM=4,#REF!,#REF!))","v":45.087466045049766}]
["Components","Input Value","Units","Std Units","Description",null,null,19,4.7500000000000001E-2,0.22669702892741328,0.22669702892741328,0,43.206505332916265,1.9976967015853573,22,43.949327434877858,6.2093001672768886E-7,0.10527956158725418,505341.8956188201,1.9788582911287073E-6,0,6.5999999999999989E-4,8.4217959289268951E-2,8.5111976002187552E-4,4.1659825195491676E-2,4.2516734848819383E-2,4.2233287110602154E-2,8.9182527008327695E-6,8.9182527008327695E-6,2.5702730799347213E-2,1.9818911116311358E-6,1.9818911116311358E-6,4.2336799693577676E-2,1.2313819658980596E-3,2.0289477109095627E-3,40,33.982443275858451,6.6149246725401178E-2,9.3144618200460924E-2,0.16132281263677167,0.16259122379372137,7.2802884960383563E-2,1.6112790578006724E-3,5.5587608518070219E-3,0,1.3237494731224411E-3,6.8825103249294632E-3,8.4963213379913496E-3,3.2037924040564721E-2,9.7292217679927351E-2,7.5877085627165846E-3,0.27596747137435668,0.31849510636698852,0.57000000000000006,0.64153420307591913,1.4275949837654922E-3,1.816342038911928E-3,8.1983571637131991E-2,0.18156860007525813,0,1.4898781812487246E-3,7.7462557481849268E-3,9.5793409994351128E-4,4.6888075012406751E-2,2.2306156752342598E-6,1.0037480946067393E-5,0.10950225497330007,0.43339277484677285,0.64153420307591913,64.153420307591915,47.5,37.364462120689176,0.37364462120689174,505.3418956188201,null,0.10483413755797097,null,0.27596747137435668,9.7292217679927351E-2,4.2516734848819383E-2,null,null,{"$f":"IF(OR(MODE=1,MODE=2,MODE=3), BR25, IF(MODE_ILIM=4,#REF!,#REF!))","v":64.153420307591915},{"$f":"IF(OR(MODE=1,MODE=2,MODE=3), BZ25, IF(MODE_ILIM=4,#REF!,#REF!))","v":0.27596747137435668},{"$f":"IF(OR(MODE=1,MODE=2,MODE=3), CA25, IF(MODE_ILIM=4,#REF!,#REF!))","v":9.7292217679927351E-2},{"$f":"IF(OR(MODE=1,MODE=2,MODE=3), CB25, IF(MODE_ILIM=4,#REF!,#REF!))","v":4.2516734848819383E-2},{"$f":"(IF(OR(MODE=1,MODE=2,MODE=3), S25, IF(MODE_ILIM=4,#REF!,#REF!)))/1000","v":505.3418956188201},{"$f":"IF(OR(MODE=1,MODE=2,MODE=3), P25, IF(MODE_ILIM=4,#REF!,#REF!))","v":43.949327434877858}]
["L",{"$f":"'Design Converter'!E17","v":33},"µH",{"$f":"B26/1000000","v":3.3000000000000003E-5},"Filter inductance",null,null,20,0.05,0.22669702892741328,0.22669702892741328,0,43.054990181401109,1.9465920739596005,23,44.771617701070809,6.2093001672768886E-7,0.11082059114447809,531938.83749349485,1.8799153765722721E-6,0,6.6E-4,8.6405803087578753E-2,8.9591553686513205E-4,4.3852447574201765E-2,4.475477855129939E-2,4.3330438312874787E-2,9.3876344219292366E-6,9.3876344219292366E-6,2.6796154435710744E-2,2.1541016776273819E-6,2.1541016776273819E-6,4.3436639982176076E-2,1.2961915430505888E-3,2.135734432536382E-3,40,33.982443275858451,7.0715380909019021E-2,9.8046966526800977E-2,0.17089808186835637,0.17223556355085703,7.4694183938699379E-2,1.6960832187375497E-3,5.8513272124284445E-3,0,1.4155584600743579E-3,7.2668856725028024E-3,8.9657813725006075E-3,3.2037924040564728E-2,0.10072665418726223,7.9870616449648265E-3,0.28991506075558471,0.33468138104298367,0.60000000000000009,0.64192997974398247,1.4309493155926693E-3,1.8176201371445497E-3,8.203414911945936E-2,0.18284100372006573,0,1.5144823560032591E-3,7.7747196209192659E-3,9.585250707202555E-4,4.6917001305052317E-2,2.3046374104763729E-6,1.0043673290521577E-5,0.10776576513684727,0.43306656409250566,0.64192997974398247,64.192997974398253,50,39.311419610679415,0.39311419610679416,531.93883749349482,null,0.10489881206084711,null,0.28991506075558471,0.10072665418726223,4.475477855129939E-2,null,null,{"$f":"IF(OR(MODE=1,MODE=2,MODE=3), BR26, IF(MODE_ILIM=4,#REF!,#REF!))","v":64.192997974398253},{"$f":"IF(OR(MODE=1,MODE=2,MODE=3), BZ26, IF(MODE_ILIM=4,#REF!,#REF!))","v":0.28991506075558471},{"$f":"IF(OR(MODE=1,MODE=2,MODE=3), CA26, IF(MODE_ILIM=4,#REF!,#REF!))","v":0.10072665418726223},{"$f":"IF(OR(MODE=1,MODE=2,MODE=3), CB26, IF(MODE_ILIM=4,#REF!,#REF!))","v":4.475477855129939E-2},{"$f":"(IF(OR(MODE=1,MODE=2,MODE=3), S26, IF(MODE_ILIM=4,#REF!,#REF!)))/1000","v":531.93883749349482},{"$f":"IF(OR(MODE=1,MODE=2,MODE=3), P26, IF(MODE_ILIM=4,#REF!,#REF!))","v":44.771617701070809}]
["Rdcr",{"$f":"'Design Converter'!E18","v":120},"mW",{"$f":"B27/1000","v":0.12},"Inductor DCR at 25°C",null,null,21,5.2499999999999998E-2,0.22669702892741328,0.22669702892741328,0,42.903475029885968,1.8961672457344734,23,43.61184665189289,6.2093001672768886E-7,0.116361620701702,558535.77936816961,1.7903955967354971E-6,0,6.5999999999999989E-4,8.8539601013161939E-2,9.407113137083888E-4,4.6045069952911855E-2,4.6992854340178844E-2,4.4400486805947742E-2,9.8570161430256986E-6,9.8570161430256986E-6,2.7904689796966021E-2,2.3360151379946987E-6,2.3360151379946987E-6,4.4509311133607045E-2,1.3610011202031184E-3,2.2425211541632008E-3,40,33.982443275858451,7.5389974580864938E-2,0.10294931485314102,0.18058181058816916,0.18198862136678212,7.6538762532338267E-2,1.7808873796744272E-3,6.1438935730498663E-3,0,1.5095952066258322E-3,7.653488779675699E-3,9.4374846319915055E-3,3.2037924040564721E-2,0.10416109069459711,8.3864147272130676E-3,0.30397361142058382,0.35097865879204371,0.63,0.64221580597458527,1.4340890762550096E-3,1.8185878319846235E-3,8.2070675707036522E-2,0.18408332227179516,0,1.5388665116167926E-3,7.8018912145347208E-3,9.5895186432165688E-4,4.6937891604707058E-2,2.3813108644699957E-6,1.0048145344123407E-5,0.10618079176448025,0.43283749730294041,0.64221580597458527,64.221580597458527,52.5,41.239947953148963,0.41239947953148964,558.53577936816964,null,0.10494551938562111,null,0.30397361142058382,0.10416109069459711,4.6992854340178844E-2,null,null,{"$f":"IF(OR(MODE=1,MODE=2,MODE=3), BR27, IF(MODE_ILIM=4,#REF!,#REF!))","v":64.221580597458527},{"$f":"IF(OR(MODE=1,MODE=2,MODE=3), BZ27, IF(MODE_ILIM=4,#REF!,#REF!))","v":0.30397361142058382},{"$f":"IF(OR(MODE=1,MODE=2,MODE=3), CA27, IF(MODE_ILIM=4,#REF!,#REF!))","v":0.10416109069459711},{"$f":"IF(OR(MODE=1,MODE=2,MODE=3), CB27, IF(MODE_ILIM=4,#REF!,#REF!))","v":4.6992854340178844E-2},{"$f":"(IF(OR(MODE=1,MODE=2,MODE=3), S27, IF(MODE_ILIM=4,#REF!,#REF!)))/1000","v":558.53577936816964},{"$f":"IF(OR(MODE=1,MODE=2,MODE=3), P27, IF(MODE_ILIM=4,#REF!,#REF!))","v":43.61184665189289}]
["Kcore",0,null,{"$f":"B28","v":0},"Core loss constant - consult inductor vendor",null,null,22,5.5E-2,0.22669702892741328,0.22669702892741328,0,42.751959878370812,1.8464779109717975,24,44.315469863323145,6.2093001672768886E-7,0.12190265025892591,585132.72124284436,1.7090139787020653E-6,0,6.5999999999999989E-4,9.0623170811500398E-2,9.8550709055164522E-4,4.8237692331621951E-2,4.9230962216147783E-2,4.5445347097634002E-2,1.0326397864122157E-5,1.0326397864122157E-5,2.9028558485879406E-2,2.5279716233043638E-6,2.5279716233043638E-6,4.5556732348087645E-2,1.4258106973556478E-3,2.3493078757900201E-3,40,33.982443275858451,8.0173027740938957E-2,0.10785166317948107,0.19037399879621003,0.19185040115198504,7.8339921021756728E-2,1.8656915406113049E-3,6.436459933671289E-3,0,1.6058617075475051E-3,8.0423216412187949E-3,9.911433217511454E-3,3.2037924040564721E-2,0.107595527201932,8.7857678094613086E-3,0.31814312938088979,0.36738694596652499,0.66,0.64240644928488766,1.4370460531655553E-3,1.8192868652173431E-3,8.2095038584981891E-2,0.18529921909521022,0,1.5630544205881202E-3,7.8279383174884483E-3,9.5923653149448875E-4,4.6951825230991069E-2,2.4605837491210753E-6,1.0051128160293578E-5,0.10472736452837678,0.43269252133942332,0.64240644928488766,64.240644928488763,55,43.139231734149426,0.43139231734149425,585.13272124284435,null,0.10497667271606073,null,0.31814312938088979,0.107595527201932,4.9230962216147783E-2,null,null,{"$f":"IF(OR(MODE=1,MODE=2,MODE=3), BR28, IF(MODE_ILIM=4,#REF!,#REF!))","v":64.240644928488763},{"$f":"IF(OR(MODE=1,MODE=2,MODE=3), BZ28, IF(MODE_ILIM=4,#REF!,#REF!))","v":0.31814312938088979},{"$f":"IF(OR(MODE=1,MODE=2,MODE=3), CA28, IF(MODE_ILIM=4,#REF!,#REF!))","v":0.107595527201932},{"$f":"IF(OR(MODE=1,MODE=2,MODE=3), CB28, IF(MODE_ILIM=4,#REF!,#REF!))","v":4.9230962216147783E-2},{"$f":"(IF(OR(MODE=1,MODE=2,MODE=3), S28, IF(MODE_ILIM=4,#REF!,#REF!)))/1000","v":585.13272124284435},{"$f":"IF(OR(MODE=1,MODE=2,MODE=3), P28, IF(MODE_ILIM=4,#REF!,#REF!))","v":44.315469863323145}]
["Cin",{"$f":"'Design Converter'!E37","v":2.2000000000000002},"µF",{"$f":"B29/1000000","v":2.2000000000000001E-6},"Input capacitance",null,null,23,5.7500000000000002E-2,0.22669702892741328,0.22669702892741328,0,42.600444726855663,1.7975850628367729,24,43.142041508082549,6.2093001672768886E-7,0.12744367981614982,611729.66311751911,1.6347090231063234E-6,0,6.6E-4,9.2659900864887887E-2,1.0303028673949021E-3,5.043031471033204E-2,5.1469102179896253E-2,4.6466718380403449E-2,1.0795779585218619E-5,1.0795779585218619E-5,3.0167849596183249E-2,2.7302974477738011E-6,2.7302974477738011E-6,4.6580606982760051E-2,1.4906202745081775E-3,2.4560945974168393E-3,40,33.982443275858451,8.5064540389241064E-2,0.11275401150582112,0.20027464649247903,0.20182090681714185,8.0100588520987129E-2,1.9504957015481824E-3,6.7290262942927117E-3,0,1.7043599576100172E-3,8.4333862519027289E-3,1.0387629230239732E-2,3.2037924040564728E-2,0.11102996370926686,9.1851208917095514E-3,0.33242362064835795,0.38390624890528718,0.69000000000000006,0.64251418659996484,1.4398466590906205E-3,1.8197519386157861E-3,8.2108806658213643E-2,0.18649174143146471,0,1.5870658722280445E-3,7.8530004462675478E-3,9.5939740405195202E-4,4.695969947259309E-2,2.5423983243947011E-6,1.0052813824506154E-5,0.10338887945055537,0.43262078454522962,0.64251418659996484,64.251418659996489,57.5,44.999115697666738,0.44999115697666736,611.72966311751907,null,0.10499427824426917,null,0.33242362064835795,0.11102996370926686,5.1469102179896253E-2,null,null,{"$f":"IF(OR(MODE=1,MODE=2,MODE=3), BR29, IF(MODE_ILIM=4,#REF!,#REF!))","v":64.251418659996489},{"$f":"IF(OR(MODE=1,MODE=2,MODE=3), BZ29, IF(MODE_ILIM=4,#REF!,#REF!))","v":0.33242362064835795},{"$f":"IF(OR(MODE=1,MODE=2,MODE=3), CA29, IF(MODE_ILIM=4,#REF!,#REF!))","v":0.11102996370926686},{"$f":"IF(OR(MODE=1,MODE=2,MODE=3), CB29, IF(MODE_ILIM=4,#REF!,#REF!))","v":5.1469102179896253E-2},{"$f":"(IF(OR(MODE=1,MODE=2,MODE=3), S29, IF(MODE_ILIM=4,#REF!,#REF!)))/1000","v":611.72966311751907},{"$f":"IF(OR(MODE=1,MODE=2,MODE=3), P29, IF(MODE_ILIM=4,#REF!,#REF!))","v":43.142041508082549}]
["RCinESR",{"$f":"'Design Converter'!E39","v":3},"mW",{"$f":"B30/1000","v":3.0000000000000001E-3},"Input capacitor ESR",null,null,24,0.06,0.22669702892741328,0.22669702892741328,0,42.448929575340507,1.7495554781365443,25,43.738886953413612,6.2093001672768886E-7,0.1329847093733737,638326.60499219375,1.5665961471435603E-6,0,6.6E-4,9.4652814900832827E-2,1.0750986442381585E-3,5.2622937089042116E-2,5.3707274232114306E-2,4.7466116981095222E-2,1.1265161306315081E-5,1.1265161306315081E-5,3.1322543049517294E-2,2.9433051092665922E-6,2.9433051092665922E-6,4.7582455080937267E-2,1.5554298516607067E-3,2.5628813190436582E-3,40,33.982443275858451,9.0064512525771259E-2,0.11765635983216115,0.21028375367697605,0.21190014227311604,8.1823378915331452E-2,2.0352998624850599E-3,7.0215926549141317E-3,0,1.8050919515840088E-3,8.8266846064981412E-3,1.0866074771487487E-2,3.2037924040564728E-2,0.11446440021660172,9.584473973957789E-3,0.34681509123516302,0.40053657393369291,0.72,0.64254930784847852,1.4425130189776774E-3,1.8200121374262479E-3,8.2113294907444484E-2,0.18766344496794574,0,1.6109174779071727E-3,7.8771945618086123E-3,9.5944984683898123E-4,4.6962266393775064E-2,2.6266925843696384E-6,1.0053363333575303E-5,0.10215141823953983,0.43261319160758177,0.64254930784847852,64.254930784847858,60,46.810309970062292,0.46810309970062292,638.32660499219378,null,0.10500001746406484,null,0.34681509123516302,0.11446440021660172,5.3707274232114306E-2,null,null,{"$f":"IF(OR(MODE=1,MODE=2,MODE=3), BR30, IF(MODE_ILIM=4,#REF!,#REF!))","v":64.254930784847858},{"$f":"IF(OR(MODE=1,MODE=2,MODE=3), BZ30, IF(MODE_ILIM=4,#REF!,#REF!))","v":0.34681509123516302},{"$f":"IF(OR(MODE=1,MODE=2,MODE=3), CA30, IF(MODE_ILIM=4,#REF!,#REF!))","v":0.11446440021660172},{"$f":"IF(OR(MODE=1,MODE=2,MODE=3), CB30, IF(MODE_ILIM=4,#REF!,#REF!))","v":5.3707274232114306E-2},{"$f":"(IF(OR(MODE=1,MODE=2,MODE=3), S30, IF(MODE_ILIM=4,#REF!,#REF!)))/1000","v":638.32660499219378},{"$f":"IF(OR(MODE=1,MODE=2,MODE=3), P30, IF(MODE_ILIM=4,#REF!,#REF!))","v":43.738886953413612}]
["Cout",{"$f":"'Design Converter'!E24","v":33},"µF",{"$f":"B31/1000000","v":3.3000000000000003E-5},"Output capacitance",null,null,25,6.25E-2,0.22669702892741328,0.22669702892741328,0,42.297414423825359,1.7024622211778724,25,42.561555529446807,6.2093001672768886E-7,0.13852573893059761,664923.54686686851,1.5039323012578179E-6,0,6.6E-4,9.6604624677143647E-2,1.1198944210814149E-3,5.4815559467752205E-2,5.594547837349205E-2,4.8444902781224652E-2,1.173454302741154E-5,1.173454302741154E-5,3.2492528829934975E-2,3.1672932892924668E-6,3.1672932892924668E-6,4.8563639857165483E-2,1.6202394288132363E-3,2.669668040670477E-3,40,33.982443275858451,9.5172944150529556E-2,0.1225587081585012,0.22040132034970122,0.22208811143095877,8.3510636405402391E-2,2.120104023421937E-3,7.3141590155355544E-3,0,1.9080596842401204E-3,9.2222186997756757E-3,1.1346771942697755E-2,3.2037924040564728E-2,0.1178988367239366,9.9838270562060318E-3,0.36131754715379916,0.41727792736360791,0.75,0.64252050211720857,1.4450638033285731E-3,1.8200920218893846E-3,8.2109613737022358E-2,0.1888164893578477,0,1.634623288516753E-3,7.9006194528194375E-3,9.5940683433532186E-4,4.6960161057407808E-2,2.7134011661182148E-6,1.0052912637451269E-5,0.10100322636119805,0.43266206222816894,0.64252050211720857,64.252050211720857,62.5,48.564555994658186,0.48564555994658187,664.92354686686849,null,0.1049953102731155,null,0.36131754715379916,0.1178988367239366,5.594547837349205E-2,null,null,{"$f":"IF(OR(MODE=1,MODE=2,MODE=3), BR31, IF(MODE_ILIM=4,#REF!,#REF!))","v":64.252050211720857},{"$f":"IF(OR(MODE=1,MODE=2,MODE=3), BZ31, IF(MODE_ILIM=4,#REF!,#REF!))","v":0.36131754715379916},{"$f":"IF(OR(MODE=1,MODE=2,MODE=3), CA31, IF(MODE_ILIM=4,#REF!,#REF!))","v":0.1178988367239366},{"$f":"IF(OR(MODE=1,MODE=2,MODE=3), CB31, IF(MODE_ILIM=4,#REF!,#REF!))","v":5.594547837349205E-2},{"$f":"(IF(OR(MODE=1,MODE=2,MODE=3), S31, IF(MODE_ILIM=4,#REF!,#REF!)))/1000","v":664.92354686686849},{"$f":"IF(OR(MODE=1,MODE=2,MODE=3), P31, IF(MODE_ILIM=4,#REF!,#REF!))","v":42.561555529446807}]
["RCoutESR",{"$f":"'Design Converter'!E26","v":5.0000000000000001E-3},"mW",{"$f":"B32","v":5.0000000000000001E-3},"Output capacitor ESR",null,null,26,6.5000000000000002E-2,0.22669702892741328,0.22669702892741328,0,42.145899272310203,1.6563851570558079,26,43.066014083451002,6.2093001672768886E-7,0.14406676848782154,691520.48874154338,1.4460887512094399E-6,0,6.6E-4,9.851777326641252E-2,1.1646901979246718E-3,5.7008181846462301E-2,5.8183714604719605E-2,4.9404300923113979E-2,1.2203924748508005E-5,1.2203924748508005E-5,3.3677622902095791E-2,3.4025468530073011E-6,3.4025468530073011E-6,4.9525389456555824E-2,1.6850490059657657E-3,2.7764547622972967E-3,40,33.982443275858451,0.10038983526351594,0.12746105648484127,0.2306273465106545,0.23238481820190879,8.5164472924739776E-2,2.2049081843588153E-3,7.6067253761569788E-3,0,2.0132651503489934E-3,9.6199905265059726E-3,1.1829722845445466E-2,3.2037924040564728E-2,0.12133327323127149,1.0383180138454275E-2,0.37593099441708006,0.4341303154934012,0.78,0.64243515712151689,1.447514874496879E-3,1.8200124737363941E-3,8.2098707245155514E-2,0.18995271229755237,0,1.6581952733227307E-3,7.9233591351325228E-3,9.5927939782259881E-4,4.6953923412492327E-2,2.8024560540064979E-6,1.0051577324752446E-5,9.9934308272307482E-2,0.43276086641539757,0.64243515712151689,64.243515712151691,65,50.254747979561841,0.50254747979561842,691.52048874154343,null,0.10498136390988914,null,0.37593099441708006,0.12133327323127149,5.8183714604719605E-2,null,null,{"$f":"IF(OR(MODE=1,MODE=2,MODE=3), BR32, IF(MODE_ILIM=4,#REF!,#REF!))","v":64.243515712151691},{"$f":"IF(OR(MODE=1,MODE=2,MODE=3), BZ32, IF(MODE_ILIM=4,#REF!,#REF!))","v":0.37593099441708006},{"$f":"IF(OR(MODE=1,MODE=2,MODE=3), CA32, IF(MODE_ILIM=4,#REF!,#REF!))","v":0.12133327323127149},{"$f":"IF(OR(MODE=1,MODE=2,MODE=3), CB32, IF(MODE_ILIM=4,#REF!,#REF!))","v":5.8183714604719605E-2},{"$f":"(IF(OR(MODE=1,MODE=2,MODE=3), S32, IF(MODE_ILIM=4,#REF!,#REF!)))/1000","v":691.52048874154343},{"$f":"IF(OR(MODE=1,MODE=2,MODE=3), P32, IF(MODE_ILIM=4,#REF!,#REF!))","v":43.066014083451002}]
["Controller",null,"Units","Std Units","Description",null,null,27,6.7500000000000004E-2,0.22669702892741328,0.22669702892741328,0,41.994384120795047,1.6114114598724585,27,43.50810941655638,6.2093001672768886E-7,0.14960779804504545,718117.43061621813,1.3925299085720533E-6,0,6.6E-4,0.100394470912161,1.2094859747679289E-3,5.9200804225172397E-2,6.0421982926487088E-2,5.0345419790889551E-2,1.2673306469604467E-5,1.2673306469604467E-5,3.4877580426462718E-2,3.6493368492131259E-6,3.6493368492131259E-6,5.0468814979852561E-2,1.7498585831182956E-3,2.883241483924116E-3,40,33.982443275858451,0.10571518586473042,0.13236340481118133,0.24096183215983585,0.24279026649739224,8.6786799135940881E-2,2.2897123452956933E-3,7.8992917367783997E-3,0,2.1207103446812671E-3,1.0020002081459667E-2,1.2314929581437446E-2,3.2037924040564728E-2,0.12476770973860636,1.0782533220702516E-2,0.39065543903813854,0.45109374460794444,0.81,0.64229959387501134,1.4498797931353016E-3,1.8197913595164471E-3,8.2081383213049419E-2,0.1910736875748657,0,1.6816436952040903E-3,7.9454855154917434E-3,9.5907697579131223E-4,4.6944015445558381E-2,2.8937871310650671E-6,1.0049456294420374E-5,9.8936110239286626E-2,0.4329040170553245,0.64229959387501134,64.22995938750114,67.5,51.875007795911799,0.51875007795911798,718.11743061621814,null,0.10495921130140184,null,0.39065543903813854,0.12476770973860636,6.0421982926487088E-2,null,null,{"$f":"IF(OR(MODE=1,MODE=2,MODE=3), BR33, IF(MODE_ILIM=4,#REF!,#REF!))","v":64.22995938750114},{"$f":"IF(OR(MODE=1,MODE=2,MODE=3), BZ33, IF(MODE_ILIM=4,#REF!,#REF!))","v":0.39065543903813854},{"$f":"IF(OR(MODE=1,MODE=2,MODE=3), CA33, IF(MODE_ILIM=4,#REF!,#REF!))","v":0.12476770973860636},{"$f":"IF(OR(MODE=1,MODE=2,MODE=3), CB33, IF(MODE_ILIM=4,#REF!,#REF!))","v":6.0421982926487088E-2},{"$f":"(IF(OR(MODE=1,MODE=2,MODE=3), S33, IF(MODE_ILIM=4,#REF!,#REF!)))/1000","v":718.11743061621814},{"$f":"IF(OR(MODE=1,MODE=2,MODE=3), P33, IF(MODE_ILIM=4,#REF!,#REF!))","v":43.50810941655638}]
["Deadtime1",20,"ns",{"$f":"B34/1000000000","v":2E-8},"PMOS off to NMOS on deadtime",null,null,28,7.0000000000000007E-2,0.22669702892741328,0.22669702892741328,0,41.842868969279905,1.567636095533137,27,42.326174579394703,6.2093001672768886E-7,0.15514882760226936,744714.37249089289,1.3427966975516227E-6,0,6.6E-4,0.10223672495778223,1.2542817516111853E-3,6.139342660388248E-2,6.2660283339484618E-2,5.1269266019128706E-2,1.3142688190700928E-5,1.3142688190700928E-5,3.6092106756455411E-2,3.9079205103581234E-6,3.9079205103581234E-6,5.1394925528865675E-2,1.8146681602708248E-3,2.9900282055509353E-3,40,33.982443275858451,0.111148995954173,0.13726575313752137,0.25140477729724531,0.25330446022902314,8.8379350302972712E-2,2.3745165062325712E-3,8.1918580973998224E-3,0,2.230397262007583E-3,1.0422255359407405E-2,1.2802394252512452E-2,3.2037924040564728E-2,0.12820214624594123,1.1181886302950757E-2,0.40549088703042757,0.46816822097861327,0.84000000000000008,0.64211925234784684,1.4521702188704155E-3,1.8194440553864811E-3,8.2058336830735629E-2,0.19218077099379055,0,1.7049774075226115E-3,7.9670604990012169E-3,9.5880769116443081E-4,4.6930834749949309E-2,2.9873226146975878E-6,1.0046634660540183E-5,9.800126940099177E-2,0.43308670580468767,0.64211925234784684,64.211925234784687,70,53.420714247122767,0.53420714247122769,744.71437249089286,null,0.10492974140193967,null,0.40549088703042757,0.12820214624594123,6.2660283339484618E-2,null,null,{"$f":"IF(OR(MODE=1,MODE=2,MODE=3), BR34, IF(MODE_ILIM=4,#REF!,#REF!))","v":64.211925234784687},{"$f":"IF(OR(MODE=1,MODE=2,MODE=3), BZ34, IF(MODE_ILIM=4,#REF!,#REF!))","v":0.40549088703042757},{"$f":"IF(OR(MODE=1,MODE=2,MODE=3), CA34, IF(MODE_ILIM=4,#REF!,#REF!))","v":0.12820214624594123},{"$f":"IF(OR(MODE=1,MODE=2,MODE=3), CB34, IF(MODE_ILIM=4,#REF!,#REF!))","v":6.2660283339484618E-2},{"$f":"(IF(OR(MODE=1,MODE=2,MODE=3), S34, IF(MODE_ILIM=4,#REF!,#REF!)))/1000","v":744.71437249089286},{"$f":"IF(OR(MODE=1,MODE=2,MODE=3), P34, IF(MODE_ILIM=4,#REF!,#REF!))","v":42.326174579394703}]
["Deadtime2",20,"ns",{"$f":"B35/1000000000","v":2E-8},"NMOS off to PMOS on deadtime",null,null,29,7.2499999999999995E-2,0.22669702892741328,0.22669702892741328,0,41.69135381776475,1.5251622515473773,28,42.704543043326566,6.2093001672768886E-7,0.16068985715949324,771311.31436556752,1.2964933631532911E-6,0,6.6E-4,0.10404636500355829,1.2990775284544417E-3,6.3586048982592555E-2,6.4898615844402402E-2,5.2176757108500699E-2,1.3612069911797393E-5,1.3612069911797393E-5,3.7320866605410903E-2,4.1785412525366242E-6,4.1785412525366242E-6,5.2304640853032415E-2,1.8794777374233542E-3,3.0968149271777537E-3,40,33.982443275858451,0.11669126553184363,0.14216810146386141,0.26195618192288278,0.26392740330860287,8.9943708038355705E-2,2.4593206671694478E-3,8.4844244580212433E-3,0,2.3423278970985807E-3,1.0826752355119824E-2,1.3292118960641149E-2,3.2037924040564728E-2,0.13163658275327611,1.1581239385198998E-2,0.42043734440771913,0.48535375086328586,0.86999999999999988,0.64189883965411809,1.4543962301093204E-3,1.8189838659840806E-3,8.2030169634381353E-2,0.19327513703048455,0,1.7282040910770687E-3,7.9881376712343764E-3,9.5847857256970792E-4,4.6914725356455272E-2,3.0829894039656609E-6,1.0043186070889061E-5,9.7123413477426715E-2,0.43330477210519724,0.64189883965411809,64.189883965411809,72.5,54.888490199331855,0.54888490199331852,771.31131436556757,null,0.10489372340859952,null,0.42043734440771913,0.13163658275327611,6.4898615844402402E-2,null,null,{"$f":"IF(OR(MODE=1,MODE=2,MODE=3), BR35, IF(MODE_ILIM=4,#REF!,#REF!))","v":64.189883965411809},{"$f":"IF(OR(MODE=1,MODE=2,MODE=3), BZ35, IF(MODE_ILIM=4,#REF!,#REF!))","v":0.42043734440771913},{"$f":"IF(OR(MODE=1,MODE=2,MODE=3), CA35, IF(MODE_ILIM=4,#REF!,#REF!))","v":0.13163658275327611},{"$f":"IF(OR(MODE=1,MODE=2,MODE=3), CB35, IF(MODE_ILIM=4,#REF!,#REF!))","v":6.4898615844402402E-2},{"$f":"(IF(OR(MODE=1,MODE=2,MODE=3), S35, IF(MODE_ILIM=4,#REF!,#REF!)))/1000","v":771.31131436556757},{"$f":"IF(OR(MODE=1,MODE=2,MODE=3), P35, IF(MODE_ILIM=4,#REF!,#REF!))","v":42.704543043326566}]
["Sleep delay",5,"µs",{"$f":"B36/1000000","v":5.0000000000000004E-6},"Delay time to enter sleep mode",null,null,30,7.4999999999999997E-2,0.22669702892741328,0.22669702892741328,0,41.539838666249601,1.4841016776448801,28,41.554846974056645,6.2093001672768886E-7,0.16623088671671715,797908.25624024228,1.2532769177148481E-6,0,6.6E-4,0.10582506418998361,1.3438733052976981E-3,6.5778671361302651E-2,6.713698044193063E-2,5.3068732098843011E-2,1.4081451632893853E-5,1.4081451632893853E-5,3.8563491696547714E-2,4.4614286754891134E-6,4.4614286754891134E-6,5.3198802048653002E-2,1.9442873145758838E-3,3.2036016488045729E-3,40,33.982443275858451,0.12234199459774241,0.14707044979020145,0.27261604603674844,0.27465909964812074,9.1481318701702063E-2,2.5441248281063244E-3,8.7769908186426659E-3,0,2.4565042447249026E-3,1.1233495063367568E-2,1.3784105807926151E-2,3.2037924040564728E-2,0.13507101926061099,1.1980592467447239E-2,0.43549481718410515,0.50265034050634416,0.89999999999999991,0.64164244930429926,1.4565665814010207E-3,1.8184223615115909E-3,8.1997404745914521E-2,0.19435780833185876,0,1.7513304447907716E-3,8.0087636518965787E-3,9.5809573240653273E-4,4.6895986449165337E-2,3.1807133585969675E-6,1.0039174572766709E-5,9.6296999587118473E-2,0.43355459777399485,0.64164244930429926,64.16424493042993,75,56.276153038808332,0.5627615303880833,797.90825624024228,null,0.10485182624852205,null,0.43549481718410515,0.13507101926061099,6.713698044193063E-2,null,null,{"$f":"IF(OR(MODE=1,MODE=2,MODE=3), BR36, IF(MODE_ILIM=4,#REF!,#REF!))","v":64.16424493042993},{"$f":"IF(OR(MODE=1,MODE=2,MODE=3), BZ36, IF(MODE_ILIM=4,#REF!,#REF!))","v":0.43549481718410515},{"$f":"IF(OR(MODE=1,MODE=2,MODE=3), CA36, IF(MODE_ILIM=4,#REF!,#REF!))","v":0.13507101926061099},{"$f":"IF(OR(MODE=1,MODE=2,MODE=3), CB36, IF(MODE_ILIM=4,#REF!,#REF!))","v":6.713698044193063E-2},{"$f":"(IF(OR(MODE=1,MODE=2,MODE=3), S36, IF(MODE_ILIM=4,#REF!,#REF!)))/1000","v":797.90825624024228},{"$f":"IF(OR(MODE=1,MODE=2,MODE=3), P36, IF(MODE_ILIM=4,#REF!,#REF!))","v":41.554846974056645}]
["IQ(active)",660,"µA",{"$f":"B37/1000000","v":6.6E-4},"LM5164 quiescent current - active state ",null,null,31,7.7499999999999999E-2,0.22669702892741328,0.22669702892741328,0,41.388323514734445,1.4445748911524892,29,41.892671843422185,6.2093001672768886E-7,0.17177191627394106,824505.19811491703,1.2128486300466271E-6,0,6.6E-4,0.10757435731239405,1.3886690821409552E-3,6.7971293740012748E-2,6.9375377132759486E-2,5.3945960653213533E-2,1.4550833353990313E-5,1.4550833353990313E-5,3.9819587150891025E-2,4.7567985626022171E-6,4.7567985626022171E-6,5.4078180665207531E-2,2.0090968917284135E-3,3.3103883704313922E-3,40,33.982443275858451,0.12810118315186927,0.15197279811654152,0.28338436963884217,0.28549955315975328,9.2993509059050974E-2,2.6289289890432019E-3,9.0695571792640886E-3,0,2.5729282996571879E-3,1.1642485478921277E-2,1.4278356896602017E-2,3.2037924040564728E-2,0.13850545576794587,1.237994554969548E-2,0.45066331137399662,0.52005799613867265,0.92999999999999994,0.64135365790642607,1.4586889121287478E-3,1.8177696510758496E-3,8.1960499230756934E-2,0.19542967963589053,0,1.7743623403398911E-3,8.028979192503883E-3,9.5766451123942037E-4,4.6874879433106816E-2,3.28041952478383E-6,1.0034656125987654E-5,9.5517183544912676E-2,0.43383302152760556,0.64135365790642607,64.135365790642609,77.5,57.582635216683897,0.57582635216683897,824.50519811491699,null,0.10480463438098789,null,0.45066331137399662,0.13850545576794587,6.9375377132759486E-2,null,null,{"$f":"IF(OR(MODE=1,MODE=2,MODE=3), BR37, IF(MODE_ILIM=4,#REF!,#REF!))","v":64.135365790642609},{"$f":"IF(OR(MODE=1,MODE=2,MODE=3), BZ37, IF(MODE_ILIM=4,#REF!,#REF!))","v":0.45066331137399662},{"$f":"IF(OR(MODE=1,MODE=2,MODE=3), CA37, IF(MODE_ILIM=4,#REF!,#REF!))","v":0.13850545576794587},{"$f":"IF(OR(MODE=1,MODE=2,MODE=3), CB37, IF(MODE_ILIM=4,#REF!,#REF!))","v":6.9375377132759486E-2},{"$f":"(IF(OR(MODE=1,MODE=2,MODE=3), S37, IF(MODE_ILIM=4,#REF!,#REF!)))/1000","v":824.50519811491699},{"$f":"IF(OR(MODE=1,MODE=2,MODE=3), P37, IF(MODE_ILIM=4,#REF!,#REF!))","v":41.892671843422185}]
["IQ(sleep)",10,"µA",{"$f":"B38/1000000","v":1.0000000000000001E-5},"LM5164 quiescent current - sleep state",null,null,32,{"$f":"IF(PLOT_TYPE=1, H38/100*Iout, min_I*EXP(H38*rr/100))","v":0.08},{"$f":"IF(I38<Icrit, (Vin-(Rdcr+RdsonTop)*Iripple/2-Vout)/L*OnTime, (Vin-(Rdcr+RdsonTop)*I38-Vout)/L*OnTime)","v":0.22669702892741328},{"$f":"IF(I38<Icrit, (Vin-(Rdcr+RdsonTop)*Iripple/2-Vout)/L*OnTime, I38+((Vin-(Rdcr+RdsonTop)*J38-Vout)/L*OnTime)/2)","v":0.22669702892741328},{"$f":"IF(I38<Icrit, 0, I38-((Vin-(Rdcr+RdsonTop)*K38-Vout)/L*OnTime)/2)","v":0},41.236808363219296,{"$f":"IF(I38<Icrit, 1000*SQRT((J38*CoutEsr)^2+(((J38/2)-I38)*(OnTime+OffTime)/Cout)^2), 1000*J38*SQRT(CoutEsr^2+(1/(8*Fsw*Cout))^2))","v":1.4067111904099934},30,{"$f":"IF(I38<Icrit, 1000*((N38/1000)*O38), 1000*J38*SQRT(CoutEsr^2+(1/(8*Fsw*Cout))^2))","v":42.201335712299795},{"$f":"IF(I38<Icrit, L*J38/(Vout+J38/2*(RdsonBot+Rdcr)), L*J38/(Vout+I38*(RdsonBot+Rdcr)))","v":6.2093001672768886E-7},0.17731294583116494,{"$f":"IF(I38<Icrit,I38/((OnTime+Q38)*J38/2),1/(OnTime+Q38))","v":851102.13998959179},1.17494711035767E-6,0,{"$f":"S38*(T38*Iq_active+U38*Iq_sleep)","v":6.6E-4},0.10929565632510332,{"$f":"W38^2*Rdcr","v":1.4334648589842118E-3},{"$f":"Core_Loss/1000*S38/$S$106","v":7.016391611872283E-2},{"$f":"(Y38+X38*(1+Ltc*(Ta-25)))/(1-X38*Ltc*ThetaCa)","v":7.1613805917579196E-2},5.4809150832843184E-2,1.5020215075086774E-5,1.5020215075086774E-5,4.1088736822105426E-2,5.0648528809087272E-6,5.0648528809087272E-6,5.494348649936482E-2,2.0739064688809427E-3,3.4171750920582115E-3,{"$f":"20*VIN_nom/24","v":40},{"$f":"IF(I38<Icrit, Csw*Vin/Iripple*1000000000, Csw*Vin/(I38+Iripple/2)*1000000000)","v":33.982443275858451},{"$f":"IF(I38<Icrit, Vin*(I38+Iripple/2)*AK38/1000000000/2*S38, Vin*(I38-Iripple/2)*AJ38/1000000000/2*S38 + Vin*(I38+Iripple/2)*AK38/1000000000/2*S38)","v":0.13396883119422417},{"$f":"IF(I38<Icrit, Csw*(Vin)^2*S38/2, Csw*Vin^2*S38/2)","v":0.15687514644288156},0.29426115272916398,{"$f":"(AI38+AL38+AM38+AH38*(1+RdsonTopTc*(Ta-25)))/(1-AH38*RdsonTopTc*ThetaJA)","v":0.29644876775586509},{"$f":"IF(I38<Icrit,Iripple*SQRT((OffTime)*S38/3), SQRT(OffTime*S38*(I38^2+Iripple^2/12)))","v":9.448149968554273E-2},2.7137331499800799E-3,{"$f":"QgBot*S38*Vdd","v":9.3621235398855113E-3},{"$f":"IF(I38<Icrit, Vin*Idss*R38, QrrBot*(I38-Iripple/2)/1*S38*Vin+Vin*Idss*R38)","v":0},{"$f":"IF(I38<Icrit, dead1*S38*(I38+Iripple/2)*((I38+Iripple/2)*BDserR+VSD), dead1*S38*(I38+Iripple/2)*((I38+Iripple/2)*BDserR+VSD)+dead2*S38*(I38-Iripple/2)*((I38-Iripple/2)*BDserR+VSD))","v":2.6916020566660776E-3},1.2053725596551589E-2,{"$f":"(AR38+AS38+AT38+AQ38*(1+RdsonBotTc*(Ta-25)))/(1-AQ38*RdsonBotTc*ThetaJA)","v":1.4774874329035253E-2},{"$f":"Vin*V38+Vout*Ifb/0.8","v":3.2037924040564728E-2},{"$f":"(Vin-Vdd)*(S38*QgBot+S38*QgTop)+AW38","v":0.14193989227528075},{"$f":"AI38+AR38","v":1.2779298631943723E-2},0.4659428329921248,{"$f":"SUM(Z38,AC38,AF38,AZ38)","v":0.53757672397765999},{"$f":"Vout*I38","v":0.96},0.64103560413931793,1.4607699169433344E-3,1.8170346059172965E-3,{"$f":"Vin*S38*(QgBot+QgTop)/($BB38+$BA38)","v":8.1919854190048047E-2},0.1964915373067414,0,1.7973049484349686E-3,8.0488200728281341E-3,{"$f":"X38/($BB38+$BA38)","v":9.5718959572023594E-4},{"$f":"Y38/($BB38+$BA38)","v":4.685163370619367E-2},3.3820323191563449E-6,1.0029679838500773E-5,9.4779713120994077E-2,0.43413726917597878,{"$f":"BC38","v":0.64103560413931793},64.103560413931788,{"$f":"I38*1000","v":80},58.807882255999409,0.58807882255999411,{"$f":"S38/1000","v":851.10213998959182},null,{"$f":"AM38/($BB38+$BA38)","v":0.10475266070255893},null,0.4659428329921248,0.14193989227528075,7.1613805917579196E-2,null,null,{"$f":"IF(OR(MODE=1,MODE=2,MODE=3), BR38, IF(MODE_ILIM=4,#REF!,#REF!))","v":64.103560413931788},{"$f":"IF(OR(MODE=1,MODE=2,MODE=3), BZ38, IF(MODE_ILIM=4,#REF!,#REF!))","v":0.4659428329921248},{"$f":"IF(OR(MODE=1,MODE=2,MODE=3), CA38, IF(MODE_ILIM=4,#REF!,#REF!))","v":0.14193989227528075},{"$f":"IF(OR(MODE=1,MODE=2,MODE=3), CB38, IF(MODE_ILIM=4,#REF!,#REF!))","v":7.1613805917579196E-2},{"$f":"(IF(OR(MODE=1,MODE=2,MODE=3), S38, IF(MODE_ILIM=4,#REF!,#REF!)))/1000","v":851.10213998959182},{"$f":"IF(OR(MODE=1,MODE=2,MODE=3), P38, IF(MODE_ILIM=4,#REF!,#REF!))","v":42.201335712299795}]
["High-side N-ch MOSFET",null,"Units","Std Units","Description",null,null,33,8.2500000000000004E-2,0.22669702892741328,0.22669702892741328,0,{"$f":"IF(I39<Icrit, 1000*((((J39/2)-I39)*0.000002/Cout+Vout/306)), 1000*J39*SQRT(CoutEsr^2+(1/(8*Fsw*Cout))^2))","v":41.085293211704141},1.3706484088991497,30,41.119452266974491,6.2093001672768886E-7,0.18285397538838885,877699.08186426654,{"$f":"IF(1/S39-OnTime-Q39>Tsleep, OnTime+Q39+Tsleep, 1/S39)","v":1.1393426524680437E-6},{"$f":"IF(1/S39-OnTime-Q39>Tsleep, 1/S39-OnTime-Q39-Tsleep, 0)","v":0},6.6E-4,{"$f":"IF(I39<Icrit,Iripple*SQRT((OnTime+OffTime)*S39/3), SQRT(I39^2+Iripple^2/12))","v":0.11099026368062907},1.4782606358274683E-3,7.2356538497432926E-2,7.3852266797080041E-2,{"$f":"Iripple/SQRT(12)*SQRT((OnTime+Q39)*S39)","v":5.5658955786437883E-2},1.5489596796183236E-5,1.5489596796183236E-5,{"$f":"SQRT($R39)*SQRT($I39^2*(1-R39)+(Iripple^2)/12)","v":4.2370507750429325E-2},5.3857797810875743E-6,5.3857797810875743E-6,{"$f":"IF(I39<Icrit,Iripple*SQRT((OnTime)*S39/3), SQRT(OnTime*S39*(I39^2+Iripple^2/12)))","v":5.579537430067965E-2},{"$f":"RdsonTop*AG39^2","v":2.1387160460334719E-3},{"$f":"QgTop*S39*Vdd","v":3.5239618136850299E-3},40,33.982443275858451,0.13994493872480723,0.1617774947692216,0.30524639530771386,0.30750674734900812,9.5946416496618697E-2,{"$f":"RdsonBot*AP39^2","v":2.7985373109169578E-3},9.6546899005069322E-3,0,2.812527510522213E-3,1.2467217411029146E-2,1.5273660207724337E-2,3.2037924040564728E-2,0.14537432878261558,1.3178651714191962E-2,0.48133338805354003,0.55520653022719735,0.99,0.64069105367710077,1.4628154858767773E-3,1.8162250429284363E-3,8.1875823057543567E-2,0.19754407539478389,0,1.8201628426386968E-3,8.0683178378724851E-3,9.566751155330118E-4,4.6826451404391928E-2,3.4854756796139628E-6,1.0024288982202103E-5,9.4080840288217435E-2,0.43446489623444812,0.64069105367710077,64.06910536771008,82.5,59.95273560232264,0.59952735602322638,877.69908186426653,null,0.10469635715649925,null,0.48133338805354003,0.14537432878261558,7.3852266797080041E-2,null,null,{"$f":"IF(OR(MODE=1,MODE=2,MODE=3), BR39, IF(MODE_ILIM=4,#REF!,#REF!))","v":64.06910536771008},{"$f":"IF(OR(MODE=1,MODE=2,MODE=3), BZ39, IF(MODE_ILIM=4,#REF!,#REF!))","v":0.48133338805354003},{"$f":"IF(OR(MODE=1,MODE=2,MODE=3), CA39, IF(MODE_ILIM=4,#REF!,#REF!))","v":0.14537432878261558},{"$f":"IF(OR(MODE=1,MODE=2,MODE=3), CB39, IF(MODE_ILIM=4,#REF!,#REF!))","v":7.3852266797080041E-2},{"$f":"(IF(OR(MODE=1,MODE=2,MODE=3), S39, IF(MODE_ILIM=4,#REF!,#REF!)))/1000","v":877.69908186426653},{"$f":"IF(OR(MODE=1,MODE=2,MODE=3), P39, IF(MODE_ILIM=4,#REF!,#REF!))","v":41.119452266974491}]
["RdsonTop",687,"mW",{"$f":"B40/1000","v":0.68700000000000006},"Drain-source resistance of high-side MOSFET @ VDD, 25°C",null,null,34,8.5000000000000006E-2,0.22669702892741328,0.22669702892741328,0,40.933778060188999,1.3365323336632886,31,41.43250234356195,6.2093001672768886E-7,0.18839500494561276,904296.02373894129,1.1058325744542776E-6,0,6.6E-4,0.11265938386240198,1.5230564126707247E-3,7.4549160876143009E-2,7.6090759771952246E-2,5.6495979533555653E-2,1.5958978517279698E-5,1.5958978517279698E-5,4.3664453878274348E-2,5.7197535974638437E-6,5.7197535974638437E-6,5.6634449569144769E-2,2.2035256231860015E-3,3.6307485353118491E-3,40,33.982443275858451,0.14602950574361837,0.16667984309556166,0.31634009737449187,0.31867349585192206,9.7389300717563618E-2,2.8833414718538353E-3,9.9472562611283549E-3,0,2.9357066559962332E-3,1.2882962917124588E-2,1.5774716635299731E-2,3.2037924040564728E-2,0.14880876528995046,1.3578004796440203E-2,0.49683498257361247,0.57294742107767949,1.02,0.64032245289674261,1.4648308202486525E-3,1.815347876465866E-3,8.1828718463061917E-2,0.19858790892198924,0,1.8429400852478448E-3,8.087500407520579E-3,9.5612472358963909E-4,4.6799511327064475E-2,3.5906731896990354E-6,1.0018521833246036E-5,9.3417248630388944E-2,0.43481374045060017,0.64032245289674261,64.032245289674265,85,61.018807215515402,0.61018807215515403,904.29602373894124,null,0.10463612350921003,null,0.49683498257361247,0.14880876528995046,7.6090759771952246E-2,null,null,{"$f":"IF(OR(MODE=1,MODE=2,MODE=3), BR40, IF(MODE_ILIM=4,#REF!,#REF!))","v":64.032245289674265},{"$f":"IF(OR(MODE=1,MODE=2,MODE=3), BZ40, IF(MODE_ILIM=4,#REF!,#REF!))","v":0.49683498257361247},{"$f":"IF(OR(MODE=1,MODE=2,MODE=3), CA40, IF(MODE_ILIM=4,#REF!,#REF!))","v":0.14880876528995046},{"$f":"IF(OR(MODE=1,MODE=2,MODE=3), CB40, IF(MODE_ILIM=4,#REF!,#REF!))","v":7.6090759771952246E-2},{"$f":"(IF(OR(MODE=1,MODE=2,MODE=3), S40, IF(MODE_ILIM=4,#REF!,#REF!)))/1000","v":904.29602373894124},{"$f":"IF(OR(MODE=1,MODE=2,MODE=3), P40, IF(MODE_ILIM=4,#REF!,#REF!))","v":41.43250234356195}]
["RdsonTopTc",4500,"ppm/°C",{"$f":"B41/1000000","v":4.4999999999999997E-3},"Drain to Source Resistance Temp Co",null,null,35,8.7499999999999994E-2,0.22669702892741328,0.22669702892741328,0,40.782262908673843,1.3045157061353072,32,41.744502596329831,6.2093001672768886E-7,0.19393603450283664,930892.96561361593,1.0742373580412984E-6,0,6.6E-4,0.11430413340127518,1.5678521895139816E-3,7.6741783254853091E-2,7.8329284842886107E-2,5.7320781987645911E-2,1.642836023837616E-5,1.642836023837616E-5,4.4970119145972057E-2,6.0669348480087673E-6,6.0669348480087673E-6,5.7461273590541491E-2,2.2683352003385312E-3,3.737535256938668E-3,40,33.982443275858451,0.1522225322506576,0.17158219142190168,0.32754225892949795,0.32994901717753444,9.8811117542356774E-2,2.9681456327907115E-3,1.0239822621749776E-2,0,3.0611414878587793E-3,1.3300964109608555E-2,1.6278045714523869E-2,3.2037924040564728E-2,0.15224320179728534,1.3977357878688444E-2,0.51244762256803211,0.59079940270600462,1.0499999999999998,0.63993197356626352,1.4668205291074987E-3,1.814409244667882E-3,8.1778817943323992E-2,0.1996235849362912,0,1.8656402987533688E-3,8.1063925838055651E-3,9.555416627579713E-4,4.6770972203116747E-2,3.6975481816992286E-6,1.001241237123961E-5,9.2785992941127382E-2,0.43518188230350457,0.63993197356626352,63.993197356626354,87.5,62.00835196729512,0.62008351967295117,930.89296561361596,null,0.10457231465280188,null,0.51244762256803211,0.15224320179728534,7.8329284842886107E-2,null,null,{"$f":"IF(OR(MODE=1,MODE=2,MODE=3), BR41, IF(MODE_ILIM=4,#REF!,#REF!))","v":63.993197356626354},{"$f":"IF(OR(MODE=1,MODE=2,MODE=3), BZ41, IF(MODE_ILIM=4,#REF!,#REF!))","v":0.51244762256803211},{"$f":"IF(OR(MODE=1,MODE=2,MODE=3), CA41, IF(MODE_ILIM=4,#REF!,#REF!))","v":0.15224320179728534},{"$f":"IF(OR(MODE=1,MODE=2,MODE=3), CB41, IF(MODE_ILIM=4,#REF!,#REF!))","v":7.8329284842886107E-2},{"$f":"(IF(OR(MODE=1,MODE=2,MODE=3), S41, IF(MODE_ILIM=4,#REF!,#REF!)))/1000","v":930.89296561361596},{"$f":"IF(OR(MODE=1,MODE=2,MODE=3), P41, IF(MODE_ILIM=4,#REF!,#REF!))","v":41.744502596329831}]
["QgTop",0.80300000000000005,"nC",{"$f":"B42/1000000000","v":8.0300000000000002E-10},"Gate charge of high-side MOSFET @ VDD",null,null,36,0.09,0.22669702892741328,0.22669702892741328,0,40.630747757158694,1.2747567245151354,32,40.792215184484334,6.2093001672768886E-7,0.19947706406006055,957489.90748829069,1.04439743142904E-6,0,6.6E-4,0.11592554961257238,1.6126479663572378E-3,7.8934405633563187E-2,8.0567842010571961E-2,5.8133883337469584E-2,1.6897741959472618E-5,1.6897741959472618E-5,4.6287040066451061E-2,6.4274702343397374E-6,6.4274702343397374E-6,5.8276367828598581E-2,2.3331447774910604E-3,3.8443219785654873E-3,40,33.982443275858451,0.15852401824592488,0.17648453974824174,0.33885287997273211,0.34133331523896032,0.10021276368648287,3.052949793727589E-3,1.0532388982371198E-2,0,3.1888340008804925E-3,1.372122298325169E-2,1.6783649548291202E-2,3.2037924040564728E-2,0.15567763830462023,1.4376710960936685E-2,0.52817131405280848,0.60876248127557431,1.08,0.6395215502325956,1.468788709916542E-3,1.8134146151366215E-3,8.172636871985936E-2,0.20065159176013081,0,1.8882667256273173E-3,8.1250164753113342E-3,9.5492882168909563E-4,4.6740975423578572E-2,3.8060238225359384E-6,1.0005990864215098E-5,9.2184448689925952E-2,0.43556761195586235,0.6395215502325956,63.952155023259557,90,62.924142868481049,0.62924142868481048,957.48990748829067,null,0.10450524671470528,null,0.52817131405280848,0.15567763830462023,8.0567842010571961E-2,null,null,{"$f":"IF(OR(MODE=1,MODE=2,MODE=3), BR42, IF(MODE_ILIM=4,#REF!,#REF!))","v":63.952155023259557},{"$f":"IF(OR(MODE=1,MODE=2,MODE=3), BZ42, IF(MODE_ILIM=4,#REF!,#REF!))","v":0.52817131405280848},{"$f":"IF(OR(MODE=1,MODE=2,MODE=3), CA42, IF(MODE_ILIM=4,#REF!,#REF!))","v":0.15567763830462023},{"$f":"IF(OR(MODE=1,MODE=2,MODE=3), CB42, IF(MODE_ILIM=4,#REF!,#REF!))","v":8.0567842010571961E-2},{"$f":"(IF(OR(MODE=1,MODE=2,MODE=3), S42, IF(MODE_ILIM=4,#REF!,#REF!)))/1000","v":957.48990748829067},{"$f":"IF(OR(MODE=1,MODE=2,MODE=3), P42, IF(MODE_ILIM=4,#REF!,#REF!))","v":40.792215184484334}]
["Coss",100,"pF",{"$f":"B43/1000000000000","v":1E-10},"Capacitance (Coss)",null,null,37,9.2499999999999999E-2,0.22669702892741328,0.22669702892741328,0,40.479232605643539,1.2474169777408077,33,41.164760265446652,6.2093001672768886E-7,0.20501809361728446,984086.84936296544,1.0161704738228498E-6,0,6.6E-4,0.11752459824793043,1.6574437432004942E-3,8.112702801227327E-2,8.2806431275700115E-2,5.893576788431467E-2,1.736712368056908E-5,1.736712368056908E-5,4.7614747861421711E-2,6.8014926417202896E-6,6.8014926417202896E-6,5.9080217771612674E-2,2.3979543546435896E-3,3.951108700192307E-3,40,33.982443275858451,0.16493396372942029,0.18138688807458178,0.3502719605041944,0.35282639394950238,0.10159507400162802,3.1377539546644673E-3,1.0824955342992621E-2,0,3.318786189832014E-3,1.4143741532824635E-2,1.7291530239628178E-2,3.2037924040564728E-2,0.15911207481195511,1.4776064043184928E-2,0.54400606304427057,0.62683666293629292,1.1099999999999999,0.6390929116635734,1.4707390164078293E-3,1.8123688738133253E-3,8.1671591717072348E-2,0.20167236676822867,0,1.9108222786023415E-3,8.1433918540810002E-3,9.542887817662847E-4,4.6709647339618035E-2,3.9160231856354865E-6,9.9992843605732356E-6,9.1610269524688939E-2,0.43596940146182495,0.6390929116635734,63.909291166357342,92.5,63.769353027551922,0.63769353027551923,984.08684936296549,null,0.10443520219565693,null,0.54400606304427057,0.15911207481195511,8.2806431275700115E-2,null,null,{"$f":"IF(OR(MODE=1,MODE=2,MODE=3), BR43, IF(MODE_ILIM=4,#REF!,#REF!))","v":63.909291166357342},{"$f":"IF(OR(MODE=1,MODE=2,MODE=3), BZ43, IF(MODE_ILIM=4,#REF!,#REF!))","v":0.54400606304427057},{"$f":"IF(OR(MODE=1,MODE=2,MODE=3), CA43, IF(MODE_ILIM=4,#REF!,#REF!))","v":0.15911207481195511},{"$f":"IF(OR(MODE=1,MODE=2,MODE=3), CB43, IF(MODE_ILIM=4,#REF!,#REF!))","v":8.2806431275700115E-2},{"$f":"(IF(OR(MODE=1,MODE=2,MODE=3), S43, IF(MODE_ILIM=4,#REF!,#REF!)))/1000","v":984.08684936296549},{"$f":"IF(OR(MODE=1,MODE=2,MODE=3), P43, IF(MODE_ILIM=4,#REF!,#REF!))","v":41.164760265446652}]
["Low-side N-ch MOSFET",null,"Units","Std Units","Description",null,null,38,9.5000000000000001E-2,0.22669702892741328,0.22669702892741328,0,40.32771745412839,1.2226587653683512,33,40.347739257155588,6.2093001672768886E-7,0.21055912317450837,1010683.7912376402,9.8942914556435366E-7,0,6.5999999999999989E-4,0.11910218022226934,1.7022395200437513E-3,8.3319650390983352E-2,8.5045052638960908E-2,5.9726887415410393E-2,1.7836505401665542E-5,1.7836505401665542E-5,4.8952770228252014E-2,7.1891211390601106E-6,7.1891211390601106E-6,5.9873276314130634E-2,2.4627639317961188E-3,4.0578954218191254E-3,40,33.982443275858451,0.1714523687011438,0.18628923640092185,0.36179950052388477,0.36442825722265132,0.10295882729086267,3.2225581156013448E-3,1.1117521703614044E-2,0,3.4510000494839821E-3,1.4568521753098026E-2,1.780168989169326E-2,3.2037924040564721E-2,0.16254651131928996,1.5175417125433169E-2,0.55995187555906767,0.64502195382456928,1.1400000000000001,0.63864760741874793,1.4726747159239178E-3,1.8112764000845377E-3,8.161468495780537E-2,0.20268630296041845,0,1.9333095831622156E-3,8.1615364572316107E-3,9.5362385678033289E-4,4.6677101204533389E-2,4.0274693113195467E-6,9.9923171048116425E-6,9.1061351358183287E-2,0.43638588128053923,0.63864760741874793,63.86476074187479,95,64.547447140017496,0.645474471400175,1010.6837912376402,null,0.10436243431167917,null,0.55995187555906767,0.16254651131928996,8.5045052638960908E-2,null,null,{"$f":"IF(OR(MODE=1,MODE=2,MODE=3), BR44, IF(MODE_ILIM=4,#REF!,#REF!))","v":63.86476074187479},{"$f":"IF(OR(MODE=1,MODE=2,MODE=3), BZ44, IF(MODE_ILIM=4,#REF!,#REF!))","v":0.55995187555906767},{"$f":"IF(OR(MODE=1,MODE=2,MODE=3), CA44, IF(MODE_ILIM=4,#REF!,#REF!))","v":0.16254651131928996},{"$f":"IF(OR(MODE=1,MODE=2,MODE=3), CB44, IF(MODE_ILIM=4,#REF!,#REF!))","v":8.5045052638960908E-2},{"$f":"(IF(OR(MODE=1,MODE=2,MODE=3), S44, IF(MODE_ILIM=4,#REF!,#REF!)))/1000","v":1010.6837912376402},{"$f":"IF(OR(MODE=1,MODE=2,MODE=3), P44, IF(MODE_ILIM=4,#REF!,#REF!))","v":40.347739257155588}]
["RdsonBot",304,"mW",{"$f":"B45/1000","v":0.30399999999999999},"Drain-source resistance of low-side MOSFET @ VDD, 25°C",null,null,39,9.7500000000000003E-2,0.22669702892741328,0.22669702892741328,0,40.176202302613234,1.2006417980499871,34,40.821821133699558,6.2093001672768886E-7,0.21610015273173228,1037280.7331123149,9.6405916747296013E-7,0,6.600000000000001E-4,0.12065913754895814,1.7470352968870081E-3,8.5512272769693448E-2,8.7283706101044717E-2,6.0507664180270593E-2,1.8305887122762004E-5,1.8305887122762004E-5,5.0300632795605524E-2,7.5904609789150379E-6,7.5904609789150379E-6,6.0655966740587826E-2,2.5275735089486488E-3,4.1646821434459446E-3,40,33.982443275858451,0.17807923316109542,0.19119158472726189,0.37343550003180326,0.3761389089720853,0.10430475143934287,3.3073622765382215E-3,1.1410088064235466E-2,0,3.5854775746070391E-3,1.4995565638842506E-2,1.8314130607776945E-2,3.2037924040564734E-2,0.16598094782662487,1.5574770207681412E-2,0.57600875761416848,0.6633183600633149,1.17,0.6381870304073064,1.4745987380984245E-3,1.8101411305452863E-3,8.1555826446083196E-2,0.20369375454184968,0,1.9557310136157761E-3,8.179466243017729E-3,9.5293612661287756E-4,4.6643438822453191E-2,4.1402852577404484E-6,9.9851108904673799E-6,9.0535801878345118E-2,0.43681582033676958,0.6381870304073064,63.818703040730639,97.5,65.262084299350803,0.65262084299350809,1037.2807331123149,null,0.10428717068030614,null,0.57600875761416848,0.16598094782662487,8.7283706101044717E-2,null,null,{"$f":"IF(OR(MODE=1,MODE=2,MODE=3), BR45, IF(MODE_ILIM=4,#REF!,#REF!))","v":63.818703040730639},{"$f":"IF(OR(MODE=1,MODE=2,MODE=3), BZ45, IF(MODE_ILIM=4,#REF!,#REF!))","v":0.57600875761416848},{"$f":"IF(OR(MODE=1,MODE=2,MODE=3), CA45, IF(MODE_ILIM=4,#REF!,#REF!))","v":0.16598094782662487},{"$f":"IF(OR(MODE=1,MODE=2,MODE=3), CB45, IF(MODE_ILIM=4,#REF!,#REF!))","v":8.7283706101044717E-2},{"$f":"(IF(OR(MODE=1,MODE=2,MODE=3), S45, IF(MODE_ILIM=4,#REF!,#REF!)))/1000","v":1037.2807331123149},{"$f":"IF(OR(MODE=1,MODE=2,MODE=3), P45, IF(MODE_ILIM=4,#REF!,#REF!))","v":40.821821133699558}]
["RdsonBotTc",4500,"ppm/°C",{"$f":"B46/1000000","v":4.4999999999999997E-3},"Drain To Source Resitance Temp Co",null,null,40,0.1,0.22669702892741328,0.22669702892741328,0,40.024687151098078,1.18151933053757,34,40.171657238277376,6.2093001672768886E-7,0.22164118228895618,1063877.6749869897,9.3995768828613603E-7,0,6.6E-4,0.12219625859419293,1.7918310737302643E-3,8.7704895148403531E-2,8.952239166264192E-2,6.1278493525638286E-2,1.8775268843858466E-5,1.8775268843858466E-5,5.1657860316661273E-2,8.0056035974870629E-6,8.0056035974870629E-6,6.1428685366710853E-2,2.5923830861011789E-3,4.2714688650727639E-3,40,33.982443275858451,0.18481455710927511,0.19609393305360195,0.38517995902794983,0.38795835311167026,0.10563352795649927,3.3921664374751003E-3,1.1702654424856889E-2,0,3.7222207599718268E-3,1.5424875184828716E-2,1.882885449130178E-2,3.2037924040564728E-2,0.16941538433395975,1.5974123289929653E-2,0.59217671522686144,0.68172588776194476,1.2000000000000002,0.6377124361227956,1.4765137163654351E-3,1.8089666133687678E-3,8.14951766251754E-2,0.20469504168116037,0,1.9780887238570644E-3,8.1971956091726472E-3,9.5222746595754278E-4,4.6608751954152303E-2,4.2543941439890752E-6,9.977685361064504E-6,9.0031914550240968E-2,0.43725810901895551,0.6377124361227956,63.771243612279562,100,65.91703305041338,0.65917033050413376,1063.8776749869896,null,0.10420961646376073,null,0.59217671522686144,0.16941538433395975,8.952239166264192E-2,null,null,{"$f":"IF(OR(MODE=1,MODE=2,MODE=3), BR46, IF(MODE_ILIM=4,#REF!,#REF!))","v":63.771243612279562},{"$f":"IF(OR(MODE=1,MODE=2,MODE=3), BZ46, IF(MODE_ILIM=4,#REF!,#REF!))","v":0.59217671522686144},{"$f":"IF(OR(MODE=1,MODE=2,MODE=3), CA46, IF(MODE_ILIM=4,#REF!,#REF!))","v":0.16941538433395975},{"$f":"IF(OR(MODE=1,MODE=2,MODE=3), CB46, IF(MODE_ILIM=4,#REF!,#REF!))","v":8.952239166264192E-2},{"$f":"(IF(OR(MODE=1,MODE=2,MODE=3), S46, IF(MODE_ILIM=4,#REF!,#REF!)))/1000","v":1063.8776749869896},{"$f":"IF(OR(MODE=1,MODE=2,MODE=3), P46, IF(MODE_ILIM=4,#REF!,#REF!))","v":40.171657238277376}]
["QgBot",2.2000000000000002,"nC",{"$f":"B47/1000000000","v":2.2000000000000003E-9},"Gate charge of low-side MOSFET at VDD",null,null,41,0.10249999999999999,0.22669702892741328,0.22669702892741328,0,39.873171999582937,1.1654338506152058,35,40.790184771532196,6.2093001672768886E-7,0.22718221184618009,1090474.6168616645,9.1703189101086439E-7,0,6.6E-4,0.12371428274366442,1.8366268505735212E-3,8.9897517527113627E-2,9.1761109324442938E-2,6.2039746235707523E-2,1.9244650564954928E-5,1.9244650564954928E-5,5.30239776410142E-2,8.4346266146243216E-6,8.4346266146243216E-6,6.2191803885475253E-2,2.6571926632537081E-3,4.3782555866995832E-3,40,33.982443275858451,0.19165834054568287,0.20099628137994199,0.39703287751232441,0.39988659355545986,0.10694579601017483,3.4769705984119773E-3,1.199522078547831E-2,0,3.8612316003489825E-3,1.5856452385827294E-2,1.9345863645822334E-2,3.2037924040564728E-2,0.17284982084129463,1.6373476372177894E-2,0.60845575441475475,0.70024454301637729,1.23,0.63722495911211807,1.4784220234996585E-3,1.8077560548582961E-3,8.1432880482218847E-2,0.20569045458451829,0,2.0003846737030881E-3,8.2147375798553197E-3,9.5149956891132535E-4,4.6573123520728371E-2,4.3697191866910296E-6,9.9700582677889459E-6,8.9548146356203992E-2,0.43771174462195178,0.63722495911211807,63.722495911211809,102.5,66.516098897051677,0.66516098897051679,1090.4746168616643,null,0.10412995706017993,null,0.60845575441475475,0.17284982084129463,9.1761109324442938E-2,null,null,{"$f":"IF(OR(MODE=1,MODE=2,MODE=3), BR47, IF(MODE_ILIM=4,#REF!,#REF!))","v":63.722495911211809},{"$f":"IF(OR(MODE=1,MODE=2,MODE=3), BZ47, IF(MODE_ILIM=4,#REF!,#REF!))","v":0.60845575441475475},{"$f":"IF(OR(MODE=1,MODE=2,MODE=3), CA47, IF(MODE_ILIM=4,#REF!,#REF!))","v":0.17284982084129463},{"$f":"IF(OR(MODE=1,MODE=2,MODE=3), CB47, IF(MODE_ILIM=4,#REF!,#REF!))","v":9.1761109324442938E-2},{"$f":"(IF(OR(MODE=1,MODE=2,MODE=3), S47, IF(MODE_ILIM=4,#REF!,#REF!)))/1000","v":1090.4746168616643},{"$f":"IF(OR(MODE=1,MODE=2,MODE=3), P47, IF(MODE_ILIM=4,#REF!,#REF!))","v":40.790184771532196}]
["VSD",0.8,"V",{"$f":"B48","v":0.8},"Body diode forward voltage",null,null,42,0.105,0.22669702892741328,0.22669702892741328,0,39.721656848067781,1.1525125259198785,35,40.337938407195743,6.2093001672768886E-7,0.232723241403404,1117071.5587363392,8.9519779836774854E-7,0,6.5999999999999989E-4,0.12521390455991624,1.8814226274167776E-3,9.2090139905823709E-2,9.3999859087138163E-2,6.2791770616938955E-2,1.9714032286051394E-5,1.9714032286051394E-5,5.4398510499893624E-2,8.8775938338211107E-6,8.8775938338211107E-6,6.2945671457030894E-2,2.7220022404062373E-3,4.4850423083264016E-3,40,33.982443275858451,0.19861058347031876,0.20589862970628203,0.40899425548492718,0.41192363421769579,0.10824215602048649,3.5617747593488553E-3,1.2287787146099733E-2,0,4.0025120905091494E-3,1.6290299236608883E-2,1.9865160175025272E-2,3.2037924040564721E-2,0.17628425734862949,1.6772829454426135E-2,0.62484588119577666,0.71887433190903471,1.26,0.63672562713190017,1.4803258021658266E-3,1.8065123594623081E-3,8.1369069357301996E-2,0.206680256997607,0,2.0226206515336909E-3,8.2321039663461153E-3,9.5075397011277379E-4,4.6536628638253988E-2,4.4861837311603458E-6,9.9622456909798414E-6,8.9083098661736013E-2,0.43817581883394185,0.63672562713190017,63.672562713190018,105,67.063063929713536,0.6706306392971354,1117.0715587363393,null,0.10404836041692961,null,0.62484588119577666,0.17628425734862949,9.3999859087138163E-2,null,null,{"$f":"IF(OR(MODE=1,MODE=2,MODE=3), BR48, IF(MODE_ILIM=4,#REF!,#REF!))","v":63.672562713190018},{"$f":"IF(OR(MODE=1,MODE=2,MODE=3), BZ48, IF(MODE_ILIM=4,#REF!,#REF!))","v":0.62484588119577666},{"$f":"IF(OR(MODE=1,MODE=2,MODE=3), CA48, IF(MODE_ILIM=4,#REF!,#REF!))","v":0.17628425734862949},{"$f":"IF(OR(MODE=1,MODE=2,MODE=3), CB48, IF(MODE_ILIM=4,#REF!,#REF!))","v":9.3999859087138163E-2},{"$f":"(IF(OR(MODE=1,MODE=2,MODE=3), S48, IF(MODE_ILIM=4,#REF!,#REF!)))/1000","v":1117.0715587363393},{"$f":"IF(OR(MODE=1,MODE=2,MODE=3), P48, IF(MODE_ILIM=4,#REF!,#REF!))","v":40.337938407195743}]
["BDserR",100,"mW",{"$f":"B49*0.001","v":0.1},"Series resistance of body diode",null,null,43,0.1075,0.22669702892741328,0.22669702892741328,0,39.570141696552632,1.1428626842981828,35,40.000193950436397,6.2093001672768886E-7,0.23826427096062791,1143668.500611014,8.7437924491733576E-7,0,6.6E-4,0.12669577749672753,1.9262184042600349E-3,9.4282762284533805E-2,9.6238640951418097E-2,6.3534894360733535E-2,2.0183414007147849E-5,2.0183414007147849E-5,5.5780986133920421E-2,9.3345552422178675E-6,9.3345552422178675E-6,6.3690616575941009E-2,2.7868118175587665E-3,4.5918290299532209E-3,40,33.982443275858451,0.20567128588318273,0.2108009780326221,0.42106409294575808,0.42406947901280712,0.10952317287075257,3.6465789202857323E-3,1.2580353506721155E-2,0,4.1460642252229675E-3,1.6726417731944124E-2,2.0386746182729298E-2,3.2037924040564728E-2,0.1797186938559644,1.7172182536674376E-2,0.64134710158817521,0.73761526050884263,1.29,0.63621537336243283,1.4822269912758554E-3,1.805238164298779E-3,8.1303862504321034E-2,0.20766468922713147,0,2.04479829382547E-3,8.2493055056936798E-3,9.4999206297975789E-4,4.6499335510462154E-2,4.6037112779844147E-6,9.954262231229554E-6,8.8635500706807091E-2,0.43864950694030447,0.63621537336243283,63.621537336243286,107.5,67.561637846160409,0.67561637846160405,1143.668500611014,null,0.10396497902650439,null,0.64134710158817521,0.1797186938559644,9.6238640951418097E-2,null,null,{"$f":"IF(OR(MODE=1,MODE=2,MODE=3), BR49, IF(MODE_ILIM=4,#REF!,#REF!))","v":63.621537336243286},{"$f":"IF(OR(MODE=1,MODE=2,MODE=3), BZ49, IF(MODE_ILIM=4,#REF!,#REF!))","v":0.64134710158817521},{"$f":"IF(OR(MODE=1,MODE=2,MODE=3), CA49, IF(MODE_ILIM=4,#REF!,#REF!))","v":0.1797186938559644},{"$f":"IF(OR(MODE=1,MODE=2,MODE=3), CB49, IF(MODE_ILIM=4,#REF!,#REF!))","v":9.6238640951418097E-2},{"$f":"(IF(OR(MODE=1,MODE=2,MODE=3), S49, IF(MODE_ILIM=4,#REF!,#REF!)))/1000","v":1143.668500611014},{"$f":"IF(OR(MODE=1,MODE=2,MODE=3), P49, IF(MODE_ILIM=4,#REF!,#REF!))","v":40.000193950436397}]
["QrrBot",3,"nC",{"$f":"B50*0.000000001","v":3.0000000000000004E-9},"Reverse recovery charge of body diode at 100mA",null,null,44,0.11,0.22669702892741328,0.22669702892741328,0,39.418626545037476,1.1365676567793372,35,39.779867987276802,6.2093001672768886E-7,0.24380530051785182,1170265.4424856887,8.5450698935103266E-7,0,6.5999999999999989E-4,0.12816051722687746,1.9710141811032904E-3,9.6475384663243902E-2,9.8477454917973162E-2,6.4269426212226782E-2,2.0652795728244318E-5,2.0652795728244318E-5,5.717093378807446E-2,9.8055470106011812E-6,9.8055470106011812E-6,6.4426948744066639E-2,2.8516213947112957E-3,4.6986157515800401E-3,40,33.982443275858451,0.21284044778427474,0.21570332635896214,0.43324238989481689,0.43632413185541086,0.1107893787842055,3.7313830812226098E-3,1.2872919867342578E-2,0,4.2918899992610759E-3,1.7164809866603653E-2,2.0910623772885207E-2,3.2037924040564721E-2,0.18315313036329925,1.7571535618922617E-2,0.65795942161051801,0.75646733487123008,1.32,0.63569504698317747,1.4841273488104619E-3,1.8039358690484029E-3,8.1237368442455202E-2,0.20864397075703764,0,2.0669191020658327E-3,8.2663519807635727E-3,9.4921511550073126E-4,4.6461306201682533E-2,4.7222255057574795E-6,9.9461211748486646E-6,8.820419531167692E-2,0.4391320584757219,0.63569504698317747,63.569504698317743,110,68.015419380100283,0.68015419380100284,1170.2654424856887,null,0.10387995165468794,null,0.65795942161051801,0.18315313036329925,9.8477454917973162E-2,null,null,{"$f":"IF(OR(MODE=1,MODE=2,MODE=3), BR50, IF(MODE_ILIM=4,#REF!,#REF!))","v":63.569504698317743},{"$f":"IF(OR(MODE=1,MODE=2,MODE=3), BZ50, IF(MODE_ILIM=4,#REF!,#REF!))","v":0.65795942161051801},{"$f":"IF(OR(MODE=1,MODE=2,MODE=3), CA50, IF(MODE_ILIM=4,#REF!,#REF!))","v":0.18315313036329925},{"$f":"IF(OR(MODE=1,MODE=2,MODE=3), CB50, IF(MODE_ILIM=4,#REF!,#REF!))","v":9.8477454917973162E-2},{"$f":"(IF(OR(MODE=1,MODE=2,MODE=3), S50, IF(MODE_ILIM=4,#REF!,#REF!)))/1000","v":1170.2654424856887},{"$f":"IF(OR(MODE=1,MODE=2,MODE=3), P50, IF(MODE_ILIM=4,#REF!,#REF!))","v":39.779867987276802}]
["TrrBot",20,"ns",{"$f":"B51*0.000000001","v":2E-8},"Reverse recovery time of body diode (not used)",null,null,45,0.1125,0.22669702892741328,0.22669702892741328,0,39.267111393522327,1.1336833297835398,35,39.678916542423892,6.2093001672768886E-7,0.24934633007507573,1196862.3843603635,8.3551794514323196E-7,0,6.6E-4,0.12960870463136814,2.0158099579465475E-3,9.8668007041953984E-2,0.10071630098749383,6.4995657469312185E-2,2.1122177449340783E-5,2.1122177449340783E-5,5.8567885094716658E-2,1.0290591493403802E-5,1.0290591493403802E-5,6.515495997326412E-2,2.9164309718638253E-3,4.8054024732068594E-3,40,33.982443275858451,0.22011806917359489,0.22060567468530221,0.44552914633210394,0.44868759666031199,0.11204127590804908,3.8161872421594877E-3,1.3165486227964001E-2,0,4.4399914073941175E-3,1.7605477635358118E-2,2.14367950495759E-2,3.2037924040564728E-2,0.18658756687063416,1.7970888701170862E-2,0.67468284728169303,0.77543056103812957,1.35,0.63516542236064211,1.4860284716454633E-3,1.8026076619254228E-3,8.1169686130313098E-2,0.20961830252148675,0,2.0889844574482268E-3,8.2832523245356133E-3,9.4842428395400518E-4,4.6422597308359639E-2,4.8416502905545606E-6,9.9378346376199766E-6,8.7788126458245103E-2,0.43962278910284147,0.63516542236064211,63.516542236064211,112.5,68.427867006324419,0.68427867006324417,1196.8623843603634,null,0.1037934048419588,null,0.67468284728169303,0.18658756687063416,0.10071630098749383,null,null,{"$f":"IF(OR(MODE=1,MODE=2,MODE=3), BR51, IF(MODE_ILIM=4,#REF!,#REF!))","v":63.516542236064211},{"$f":"IF(OR(MODE=1,MODE=2,MODE=3), BZ51, IF(MODE_ILIM=4,#REF!,#REF!))","v":0.67468284728169303},{"$f":"IF(OR(MODE=1,MODE=2,MODE=3), CA51, IF(MODE_ILIM=4,#REF!,#REF!))","v":0.18658756687063416},{"$f":"IF(OR(MODE=1,MODE=2,MODE=3), CB51, IF(MODE_ILIM=4,#REF!,#REF!))","v":0.10071630098749383},{"$f":"(IF(OR(MODE=1,MODE=2,MODE=3), S51, IF(MODE_ILIM=4,#REF!,#REF!)))/1000","v":1196.8623843603634},{"$f":"IF(OR(MODE=1,MODE=2,MODE=3), P51, IF(MODE_ILIM=4,#REF!,#REF!))","v":39.678916542423892}]
["Idss",0,"μA",{"$f":"B52/1000000","v":0},"Leakage current of low-side device",null,null,46,0.115,0.2266868371212121,0.22805891326528782,1.9445818907989076E-3,1.3404057419364364,1.3404057419364364,1,1.3404057419364364,6.2086601650294299E-7,0.25124637805669808,1205982.6146721507,8.2919934983627638E-7,0,6.6E-4,0.13221685847204259,2.097755719705937E-3,9.9419868709917245E-2,0.10155170933828082,6.5240307051822988E-2,2.128148832108072E-5,2.128148832108072E-5,5.96430046399401E-2,1.067186400743975E-5,1.067186400743975E-5,6.6273016544181246E-2,3.017381439921476E-3,4.8420201979086849E-3,40,33.684280478054553,0.22460275033045715,0.2222867155363708,0.45173148606473668,0.45500278849809811,0.11396389983099119,3.948282221265211E-3,1.3265808761393659E-2,3.4740521911294319E-4,4.5634087541406446E-3,1.8176622734647246E-2,2.2141073137956796E-2,3.2037924040564728E-2,0.18776525309056491,1.8107828959302345E-2,0.68301694368592214,0.78460060637653151,1.3800000000000001,0.63753100499684023,1.5112729912967564E-3,1.8314927897696131E-3,8.0308190572068949E-2,0.2086904552895418,1.6049391194363925E-4,2.1081989632164228E-3,8.3972177967159955E-3,9.6911906682753326E-4,4.5929890445860468E-2,4.9301769462700509E-6,9.8316004617152972E-6,8.6743601816169497E-2,0.43666469542081854,0.63753100499684023,63.753100499684024,115,68.802277733330541,0.68802277733330541,1205.9826146721507,null,0.10269179214010812,null,0.68301694368592214,0.18776525309056491,0.10155170933828082,null,null,{"$f":"IF(OR(MODE=1,MODE=2,MODE=3), BR52, IF(MODE_ILIM=4,#REF!,#REF!))","v":63.753100499684024},{"$f":"IF(OR(MODE=1,MODE=2,MODE=3), BZ52, IF(MODE_ILIM=4,#REF!,#REF!))","v":0.68301694368592214},{"$f":"IF(OR(MODE=1,MODE=2,MODE=3), CA52, IF(MODE_ILIM=4,#REF!,#REF!))","v":0.18776525309056491},{"$f":"IF(OR(MODE=1,MODE=2,MODE=3), CB52, IF(MODE_ILIM=4,#REF!,#REF!))","v":0.10155170933828082},{"$f":"(IF(OR(MODE=1,MODE=2,MODE=3), S52, IF(MODE_ILIM=4,#REF!,#REF!)))/1000","v":1205.9826146721507},{"$f":"IF(OR(MODE=1,MODE=2,MODE=3), P52, IF(MODE_ILIM=4,#REF!,#REF!))","v":1.3404057419364364}]
["Csw",160,"pF",{"$f":"B53/1000000000000","v":1.5999999999999999E-10},"Effective SW node capacitance (CossHS + CossLS)",null,null,47,0.11749999999999999,0.22667410037878785,0.23055894571020932,4.4509503446595461E-3,1.3403304292147282,1.3403304292147282,1,1.3403304292147282,6.2077651886086256E-7,0.25127349865882076,1206112.7935623396,8.2910985219419584E-7,0,6.6E-4,0.13439697788349314,2.1675057197059373E-3,9.943060051319029E-2,0.10163335277264784,6.5240307051822988E-2,2.128148832108072E-5,2.128148832108072E-5,6.0555226115422744E-2,1.100080622966993E-5,1.100080622966993E-5,6.7369425901363453E-2,3.11804536829388E-3,4.8425428661527936E-3,40,33.318940459928314,0.22752166561068776,0.22231071010941045,0.45467491858625098,0.45805711747400862,0.11584929893716246,4.0800022595265375E-3,1.3267240729185737E-2,7.8164332519159126E-4,4.6631945836111237E-3,1.8712078637988454E-2,2.2809292708087334E-2,3.2037924040564728E-2,0.18778206296047611,1.8109783595338533E-2,0.68675825673791069,0.7884238918051093,1.41,0.64136857557632321,1.5384653070616651E-3,1.863705214163538E-3,7.9081164994299513E-2,0.20681858502407413,3.5554713906870333E-4,2.1211535232098528E-3,8.5115881007934765E-3,9.8593620993002169E-4,4.5228129517619356E-2,5.0039513629181179E-6,9.6803389011600721E-6,8.5416676765775898E-2,0.43193563608626029,0.64136857557632321,64.136857557632325,117.5,69.1417728033842,0.69141772803384205,1206.1127935623397,null,0.10112276842427909,null,0.68675825673791069,0.18778206296047611,0.10163335277264784,null,null,{"$f":"IF(OR(MODE=1,MODE=2,MODE=3), BR53, IF(MODE_ILIM=4,#REF!,#REF!))","v":64.136857557632325},{"$f":"IF(OR(MODE=1,MODE=2,MODE=3), BZ53, IF(MODE_ILIM=4,#REF!,#REF!))","v":0.68675825673791069},{"$f":"IF(OR(MODE=1,MODE=2,MODE=3), CA53, IF(MODE_ILIM=4,#REF!,#REF!))","v":0.18778206296047611},{"$f":"IF(OR(MODE=1,MODE=2,MODE=3), CB53, IF(MODE_ILIM=4,#REF!,#REF!))","v":0.10163335277264784},{"$f":"(IF(OR(MODE=1,MODE=2,MODE=3), S53, IF(MODE_ILIM=4,#REF!,#REF!)))/1000","v":1206.1127935623397},{"$f":"IF(OR(MODE=1,MODE=2,MODE=3), P53, IF(MODE_ILIM=4,#REF!,#REF!))","v":1.3403304292147282}]
["ThetaJA",41.1,"°C/W",null,"Thermal resistance",null,null,48,0.12,0.22666136363636363,0.23305897815513082,6.9573187985201568E-3,1.3402551164930201,1.3402551164930201,1,1.3402551164930201,6.2068703696327586E-7,0.25130062034397932,1206242.9776511008,8.2902037029660914E-7,0,6.6E-4,0.13658805827822629,2.2387557197059366E-3,9.944133274502788E-2,0.10171652341650779,6.5240307051822988E-2,2.128148832108072E-5,2.128148832108072E-5,6.147316772894966E-2,1.1336851051894733E-5,1.1336851051894733E-5,6.8471447891361614E-2,3.2208890141452017E-3,4.8430655552691698E-3,40,32.961440372285836,0.23044120674272883,0.22233470564065091,0.45761897793864892,0.46111455447136446,0.11774434959621878,4.2145744859983219E-3,1.3268672754162112E-2,1.2159751653116932E-3,4.7630621797119721E-3,1.9247710099185775E-2,2.3480587363767496E-2,3.2037924040564728E-2,0.18779887350167374,1.8111738309431281E-2,0.69050575364623701,0.7922548954021178,1.44,0.64508762102662953,1.5659396872263758E-3,1.8962338366018952E-3,7.7891054524585973E-2,0.2050030123715838,5.4472953237387684E-4,2.1337447571613253E-3,8.6225413320097106E-3,1.0029122231144877E-3,4.4547481091810774E-2,5.0786543576388997E-6,9.5336282451055288E-6,8.4129672596302524E-2,0.42735193423537354,0.64508762102662953,64.508762102662956,120,69.449289175978407,0.69449289175978413,1206.2429776511008,null,9.9600948842627393E-2,null,0.69050575364623701,0.18779887350167374,0.10171652341650779,null,null,{"$f":"IF(OR(MODE=1,MODE=2,MODE=3), BR54, IF(MODE_ILIM=4,#REF!,#REF!))","v":64.508762102662956},{"$f":"IF(OR(MODE=1,MODE=2,MODE=3), BZ54, IF(MODE_ILIM=4,#REF!,#REF!))","v":0.69050575364623701},{"$f":"IF(OR(MODE=1,MODE=2,MODE=3), CA54, IF(MODE_ILIM=4,#REF!,#REF!))","v":0.18779887350167374},{"$f":"IF(OR(MODE=1,MODE=2,MODE=3), CB54, IF(MODE_ILIM=4,#REF!,#REF!))","v":0.10171652341650779},{"$f":"(IF(OR(MODE=1,MODE=2,MODE=3), S54, IF(MODE_ILIM=4,#REF!,#REF!)))/1000","v":1206.2429776511008},{"$f":"IF(OR(MODE=1,MODE=2,MODE=3), P54, IF(MODE_ILIM=4,#REF!,#REF!))","v":1.3402551164930201}]
["Inductor",null,"Units","Std Units","Description",null,null,49,0.1225,0.22664862689393936,0.23555901060005235,9.4636872523808091E-3,1.3401798037713117,1.3401798037713117,1,1.3401798037713117,6.2059757080602788E-7,0.25132774311223899,1206373.166938747,8.2893090413936106E-7,0,6.6E-4,0.13878958053188337,2.3115057197059365E-3,9.9452065405455786E-2,0.10180122138204134,6.5240307051822988E-2,2.128148832108072E-5,2.128148832108072E-5,6.2396581067840878E-2,1.1679999986866917E-5,1.1679999986866917E-5,6.9578823150721461E-2,3.3259130775240495E-3,4.8435882652590693E-3,40,32.611530535310379,0.23336137376407076,0.22235870213014985,0.46056366415947969,0.46417510416580443,0.11964860580355274,4.3519998167031223E-3,1.327010483632622E-2,1.650400745088132E-3,4.8630115632567594E-3,1.9783517144671109E-2,2.4154959345304299E-2,3.2037924040564728E-2,0.18781568471419824,1.8113693101585289E-2,0.69425944132689232,0.79609362419724161,1.47,0.64869340979711021,1.5936852598506755E-3,1.9290651339181821E-3,7.6736217744233504E-2,0.20324123383147213,7.2830209990674272E-4,2.1459888114638112E-3,8.7302293839158444E-3,1.0200398143412023E-3,4.3887006407639692E-2,5.1542442298713631E-6,9.3912661391559391E-6,8.2880814238525349E-2,0.42290712823563614,0.64869340979711021,64.869340979711026,122.5,69.727575757335345,0.69727575757335347,1206.3731669387471,null,9.8124234478140726E-2,null,0.69425944132689232,0.18781568471419824,0.10180122138204134,null,null,{"$f":"IF(OR(MODE=1,MODE=2,MODE=3), BR55, IF(MODE_ILIM=4,#REF!,#REF!))","v":64.869340979711026},{"$f":"IF(OR(MODE=1,MODE=2,MODE=3), BZ55, IF(MODE_ILIM=4,#REF!,#REF!))","v":0.69425944132689232},{"$f":"IF(OR(MODE=1,MODE=2,MODE=3), CA55, IF(MODE_ILIM=4,#REF!,#REF!))","v":0.18781568471419824},{"$f":"IF(OR(MODE=1,MODE=2,MODE=3), CB55, IF(MODE_ILIM=4,#REF!,#REF!))","v":0.10180122138204134},{"$f":"(IF(OR(MODE=1,MODE=2,MODE=3), S55, IF(MODE_ILIM=4,#REF!,#REF!)))/1000","v":1206.3731669387471},{"$f":"IF(OR(MODE=1,MODE=2,MODE=3), P55, IF(MODE_ILIM=4,#REF!,#REF!))","v":1.3401798037713117}]
["Ltc",4000,"ppm",{"$f":"Ltc","v":4.0000000000000001E-3},"Inductor DCR Temp Co",null,null,50,0.125,0.22663589015151508,0.23805904304497388,1.1970055706241475E-2,1.3401044910496034,1.3401044910496034,1,1.3401044910496034,6.2050812038496626E-7,0.25135486696366433,1206503.3614255888,8.2884145371829954E-7,0,6.6E-4,0.14100105554291478,2.3857557197059366E-3,9.9462798494499599E-2,0.10188744678363439,6.5240307051822988E-2,2.128148832108072E-5,2.128148832108072E-5,6.3325230746068259E-2,1.2030254547128367E-5,1.2030254547128367E-5,7.0691307311819176E-2,3.4331182585349393E-3,4.8441109961237395E-3,40,32.268971759954638,0.23628216671220614,0.22238269957796453,0.46350897728629442,0.4672387712425114,0.12156164734157272,4.4922791677366554E-3,1.327153697568148E-2,2.0849200701362411E-3,4.963042755060711E-3,2.0319499800878431E-2,2.4832410903513485E-2,3.2037924040564728E-2,0.18783249659808959,1.8115647971805218E-2,0.6980193267159196,0.79994008524242222,1.5,0.65219090254774803,1.6216917910815236E-3,1.9621863767635395E-3,7.5615109126201133E-2,0.20153089215688802,9.0651060152137949E-4,2.1579008892040714E-3,8.8347952763024595E-3,1.0373121173956447E-3,4.324582154670166E-2,5.2306817139805336E-6,9.2530620504566623E-6,8.1668430322736574E-2,0.41859513394856046,0.65219090254774803,65.219090254774798,125,69.979193442852676,0.69979193442852672,1206.5033614255888,null,9.6690649032504933E-2,null,0.6980193267159196,0.18783249659808959,0.10188744678363439,null,null,{"$f":"IF(OR(MODE=1,MODE=2,MODE=3), BR56, IF(MODE_ILIM=4,#REF!,#REF!))","v":65.219090254774798},{"$f":"IF(OR(MODE=1,MODE=2,MODE=3), BZ56, IF(MODE_ILIM=4,#REF!,#REF!))","v":0.6980193267159196},{"$f":"IF(OR(MODE=1,MODE=2,MODE=3), CA56, IF(MODE_ILIM=4,#REF!,#REF!))","v":0.18783249659808959},{"$f":"IF(OR(MODE=1,MODE=2,MODE=3), CB56, IF(MODE_ILIM=4,#REF!,#REF!))","v":0.10188744678363439},{"$f":"(IF(OR(MODE=1,MODE=2,MODE=3), S56, IF(MODE_ILIM=4,#REF!,#REF!)))/1000","v":1206.5033614255888},{"$f":"IF(OR(MODE=1,MODE=2,MODE=3), P56, IF(MODE_ILIM=4,#REF!,#REF!))","v":1.3401044910496034}]
["ThetaCA",20,"°C/W",{"$f":"ThetaCa","v":40},"Inductor Core-to-Ambient thermal resistance",null,null,51,0.1275,0.22662315340909089,0.24055907548989541,1.4476424160102114E-2,1.3400291783278955,1.3400291783278955,1,1.3400291783278955,6.2041868569593978E-7,0.25138199189832033,1206633.5611119375,8.2875201902927306E-7,0,6.5999999999999989E-4,0.14322202227386729,2.4615057197059365E-3,9.9473532012184979E-2,0.10197519973787858,6.5240307051822988E-2,2.128148832108072E-5,2.128148832108072E-5,6.4258893664638814E-2,1.2387616245010076E-5,1.2387616245010076E-5,7.1808670024864629E-2,3.5425052573383061E-3,4.8446337478644293E-3,40,31.933534802681447,0.23920358562463104,0.22240669798415233,0.46645491735664779,0.470305560396238,0.12348307809792745,4.6354134552678101E-3,1.3272969172231313E-2,2.5195331460718014E-3,5.0631557759407151E-3,2.0855658094243827E-2,2.5512944299738115E-2,3.2037924040564721E-2,0.1878493091533881,1.8117602920095743E-2,0.70178541676945994,0.80379428561190458,1.53,0.65558477430192386,1.6499496392333463E-3,1.9955855724761024E-3,7.4526272133413923E-2,0.19986976582828789,1.0795866463488223E-3,2.1694953180559319E-3,8.9363737938777318E-3,1.054722661239419E-3,4.2623093485766983E-2,5.307929804002468E-6,9.1188364168527655E-6,8.0490945715095588E-2,0.41441021756001661,0.65558477430192386,65.558477430192383,127.5,70.206518151218702,0.702065181512187,1206.6335611119375,null,9.5298330000769052E-2,null,0.70178541676945994,0.1878493091533881,0.10197519973787858,null,null,{"$f":"IF(OR(MODE=1,MODE=2,MODE=3), BR57, IF(MODE_ILIM=4,#REF!,#REF!))","v":65.558477430192383},{"$f":"IF(OR(MODE=1,MODE=2,MODE=3), BZ57, IF(MODE_ILIM=4,#REF!,#REF!))","v":0.70178541676945994},{"$f":"IF(OR(MODE=1,MODE=2,MODE=3), CA57, IF(MODE_ILIM=4,#REF!,#REF!))","v":0.1878493091533881},{"$f":"IF(OR(MODE=1,MODE=2,MODE=3), CB57, IF(MODE_ILIM=4,#REF!,#REF!))","v":0.10197519973787858},{"$f":"(IF(OR(MODE=1,MODE=2,MODE=3), S57, IF(MODE_ILIM=4,#REF!,#REF!)))/1000","v":1206.6335611119375},{"$f":"IF(OR(MODE=1,MODE=2,MODE=3), P57, IF(MODE_ILIM=4,#REF!,#REF!))","v":1.3400291783278955}]
[null,null,null,null,null,null,null,52,0.13,0.22661041666666668,0.24305910793481691,1.6982792613962766E-2,1.3399538656061876,1.3399538656061876,1,1.3399538656061876,6.203292667347982E-7,0.25140911791627191,1206763.7659981051,8.2866260006813159E-7,0,6.600000000000001E-4,0.14545204592653946,2.5387557197059374E-3,9.9484265958537668E-2,0.10206448036357191,6.5240307051822988E-2,2.128148832108072E-5,2.128148832108072E-5,6.5197358312107739E-2,1.2752086592632093E-5,1.2752086592632093E-5,7.2930694046708919E-2,3.6540747741505143E-3,4.8451565204823913E-3,40,31.604999853862417,0.24212563053884434,0.22243069734877072,0.46940148440809748,0.47337547633132998,0.12541252449860826,4.7814035955386618E-3,1.3274401425979156E-2,2.954239978511043E-3,5.1633506467153303E-3,2.1391992051205531E-2,2.6196561805867179E-2,3.2037924040564734E-2,0.18786612238013406,1.8119557946461549E-2,0.70555771846379278,0.80765623240227835,1.56,0.6588794347130319,1.6784497127779385E-3,2.0292514128146129E-3,7.3468332904705294E-2,0.198255759423247,1.2477486968256381E-3,2.1807856123929256E-3,9.0350920705666478E-3,1.0722653419707208E-3,4.2018036485642445E-2,5.3859535933109393E-6,8.9884198684908046E-6,7.9346874689456406E-2,0.41034697072386145,0.6588794347130319,65.887943471303188,130,70.411746141009829,0.70411746141009823,1206.7637659981051,null,9.3945520597425336E-2,null,0.70555771846379278,0.18786612238013406,0.10206448036357191,null,null,{"$f":"IF(OR(MODE=1,MODE=2,MODE=3), BR58, IF(MODE_ILIM=4,#REF!,#REF!))","v":65.887943471303188},{"$f":"IF(OR(MODE=1,MODE=2,MODE=3), BZ58, IF(MODE_ILIM=4,#REF!,#REF!))","v":0.70555771846379278},{"$f":"IF(OR(MODE=1,MODE=2,MODE=3), CA58, IF(MODE_ILIM=4,#REF!,#REF!))","v":0.18786612238013406},{"$f":"IF(OR(MODE=1,MODE=2,MODE=3), CB58, IF(MODE_ILIM=4,#REF!,#REF!))","v":0.10206448036357191},{"$f":"(IF(OR(MODE=1,MODE=2,MODE=3), S58, IF(MODE_ILIM=4,#REF!,#REF!)))/1000","v":1206.7637659981051},{"$f":"IF(OR(MODE=1,MODE=2,MODE=3), P58, IF(MODE_ILIM=4,#REF!,#REF!))","v":1.3399538656061876}]
[null,null,null,null,null,null,null,53,0.13250000000000001,0.2265976799242424,0.24555914037973844,1.9489161067823405E-2,1.3398785528844792,1.3398785528844792,1,1.3398785528844792,6.2023986349739308E-7,0.25143624501758388,1206893.9760844028,8.2857319683072657E-7,0,6.600000000000001E-4,0.14769071624247798,2.6175057197059376E-3,9.9495000333583328E-2,0.10215528878171876,6.5240307051822988E-2,2.128148832108072E-5,2.128148832108072E-5,6.6140424103829878E-2,1.3123667101903441E-5,1.3123667101903441E-5,7.4057174392205771E-2,3.7678275092438568E-3,4.8456793139788771E-3,40,31.283156057435459,0.24504830149234808,0.22245469767187712,0.47234867847820405,0.47644852376175029,0.12734963404861946,4.9302505048644581E-3,1.3275833736928432E-2,3.3890405730706459E-3,5.2636273882047712E-3,2.1928501698203848E-2,2.6883265704354179E-2,3.2037924040564734E-2,0.18788293627836761,1.8121513050907308E-2,0.70933623879537933,0.81152593273252105,1.59,0.66207904662967987,1.7071834318613077E-3,2.0631732260799145E-3,7.2439994470834795E-2,0.19668689479474119,1.4112029884326522E-3,2.1917845301864694E-3,9.1310701247573067E-3,1.0899343971387679E-3,4.1429908783194039E-2,5.4647201277443541E-6,8.8616525147684212E-6,7.8234814672431763E-2,0.40640028779230081,0.66207904662967987,66.207904662967991,132.5,70.596901007914624,0.70596901007914625,1206.8939760844028,null,9.2630562360308213E-2,null,0.70933623879537933,0.18788293627836761,0.10215528878171876,null,null,{"$f":"IF(OR(MODE=1,MODE=2,MODE=3), BR59, IF(MODE_ILIM=4,#REF!,#REF!))","v":66.207904662967991},{"$f":"IF(OR(MODE=1,MODE=2,MODE=3), BZ59, IF(MODE_ILIM=4,#REF!,#REF!))","v":0.70933623879537933},{"$f":"IF(OR(MODE=1,MODE=2,MODE=3), CA59, IF(MODE_ILIM=4,#REF!,#REF!))","v":0.18788293627836761},{"$f":"IF(OR(MODE=1,MODE=2,MODE=3), CB59, IF(MODE_ILIM=4,#REF!,#REF!))","v":0.10215528878171876},{"$f":"(IF(OR(MODE=1,MODE=2,MODE=3), S59, IF(MODE_ILIM=4,#REF!,#REF!)))/1000","v":1206.8939760844028},{"$f":"IF(OR(MODE=1,MODE=2,MODE=3), P59, IF(MODE_ILIM=4,#REF!,#REF!))","v":1.3398785528844792}]
[null,null,null,null,null,null,null,54,0.13500000000000001,0.22658494318181818,0.24805917282465995,2.1995529521684029E-2,1.3398032401627711,1.3398032401627711,1,1.3398032401627711,6.2015047597957744E-7,0.25146337320232137,1207024.1913711426,8.2848380931291072E-7,0,6.6E-4,0.14993764592061642,2.6977557197059372E-3,9.9505735137347645E-2,0.10224762511553066,6.5240307051822988E-2,2.128148832108072E-5,2.128148832108072E-5,6.7087900758438013E-2,1.3502359284522085E-5,1.3502359284522085E-5,7.5187917544039348E-2,3.8837641629465621E-3,4.8462021283551373E-3,40,30.967801059615294,0.24797159852264727,0.22247869895352901,0.47529649960453141,0.47952470741110403,0.12929407397318865,5.0819550996336511E-3,1.327726610508257E-2,3.8239349353677383E-3,5.3639860212309175E-3,2.2465187061681227E-2,2.757305828823604E-2,3.2037924040564728E-2,0.18789975084812904,1.8123468233437707E-2,0.7131209847809068,0.81540339374404303,1.62,0.66518754312381456,1.7361426930067765E-3,2.0973409332005069E-3,7.1440031449380312E-2,0.19516130297980699,1.5701443732855484E-3,2.2025041251932591E-3,9.2244213502324958E-3,1.1077243821848214E-3,4.0858009557247721E-2,5.5441982708927601E-6,8.7383832903196527E-6,7.7153440506323362E-2,0.40256534493142293,0.66518754312381456,66.518754312381461,135,70.763841860106652,0.70763841860106647,1207.0241913711427,null,9.1351888366839953E-2,null,0.7131209847809068,0.18789975084812904,0.10224762511553066,null,null,{"$f":"IF(OR(MODE=1,MODE=2,MODE=3), BR60, IF(MODE_ILIM=4,#REF!,#REF!))","v":66.518754312381461},{"$f":"IF(OR(MODE=1,MODE=2,MODE=3), BZ60, IF(MODE_ILIM=4,#REF!,#REF!))","v":0.7131209847809068},{"$f":"IF(OR(MODE=1,MODE=2,MODE=3), CA60, IF(MODE_ILIM=4,#REF!,#REF!))","v":0.18789975084812904},{"$f":"IF(OR(MODE=1,MODE=2,MODE=3), CB60, IF(MODE_ILIM=4,#REF!,#REF!))","v":0.10224762511553066},{"$f":"(IF(OR(MODE=1,MODE=2,MODE=3), S60, IF(MODE_ILIM=4,#REF!,#REF!)))/1000","v":1207.0241913711427},{"$f":"IF(OR(MODE=1,MODE=2,MODE=3), P60, IF(MODE_ILIM=4,#REF!,#REF!))","v":1.3398032401627711}]
[null,null,null,null,null,null,null,55,0.13750000000000001,0.22657220643939391,0.25055920526958148,2.4501897975544695E-2,1.3397279274410627,1.3397279274410627,1,1.3397279274410627,6.2006110417720579E-7,0.25149050247054905,1207154.4118586355,8.2839443751053907E-7,0,6.6E-4,0.15219246914422588,2.7795057197059375E-3,9.9516470369856294E-2,0.10234148949042653,6.5240307051822988E-2,2.128148832108072E-5,2.128148832108072E-5,6.8039607709957803E-2,1.3888164651974849E-5,1.3888164651974849E-5,7.632274071711366E-2,4.0018854356427989E-3,4.8467249636124218E-3,40,30.65874058462731,0.25089552166724971,0.22250270119378368,0.47824494782464583,0.48260403201266161,0.13124552995280159,5.2365182963078887E-3,1.3278698530444992E-2,4.2589230710198944E-3,5.4644265666173109E-3,2.3002048168082198E-2,2.8265941861151885E-2,3.2037924040564728E-2,0.18791656608945845,1.8125423494057415E-2,0.71691196345732944,0.81928862260072899,1.6500000000000001,0.66820864312822636,1.765319836700444E-3,2.1317450074044386E-3,7.0467285172879007E-2,0.19367721676899149,1.7247570948325469E-3,2.2129557948807185E-3,9.3152529670086723E-3,1.1256301488071811E-3,4.0301676142273951E-2,5.6243585803863698E-6,8.6184693544112389E-6,7.6101499180577389E-2,0.39883758094229066,0.66820864312822636,66.820864312822636,137.5,70.914272258910415,0.70914272258910416,1207.1544118586355,null,9.0108017004280838E-2,null,0.71691196345732944,0.18791656608945845,0.10234148949042653,null,null,{"$f":"IF(OR(MODE=1,MODE=2,MODE=3), BR61, IF(MODE_ILIM=4,#REF!,#REF!))","v":66.820864312822636},{"$f":"IF(OR(MODE=1,MODE=2,MODE=3), BZ61, IF(MODE_ILIM=4,#REF!,#REF!))","v":0.71691196345732944},{"$f":"IF(OR(MODE=1,MODE=2,MODE=3), CA61, IF(MODE_ILIM=4,#REF!,#REF!))","v":0.18791656608945845},{"$f":"IF(OR(MODE=1,MODE=2,MODE=3), CB61, IF(MODE_ILIM=4,#REF!,#REF!))","v":0.10234148949042653},{"$f":"(IF(OR(MODE=1,MODE=2,MODE=3), S61, IF(MODE_ILIM=4,#REF!,#REF!)))/1000","v":1207.1544118586355},{"$f":"IF(OR(MODE=1,MODE=2,MODE=3), P61, IF(MODE_ILIM=4,#REF!,#REF!))","v":1.3397279274410627}]
[null,null,null,null,null,null,null,56,0.14000000000000001,0.22655946969696966,0.253059237714503,2.7008266429405348E-2,1.3396526147193544,1.3396526147193544,1,1.3396526147193544,6.1997174808613393E-7,0.25151763282233192,1207284.6375471933,8.2830508141946732E-7,0,6.6E-4,0.15445484020973946,2.8627557197059379E-3,9.9527206031134963E-2,0.1024368820340332,6.5240307051822988E-2,2.128148832108072E-5,2.128148832108072E-5,6.8995373553926084E-2,1.4281084715537409E-5,1.4281084715537409E-5,7.7461471173794344E-2,4.1221920277726889E-3,4.8472478197519814E-3,40,30.355788035595641,0.25382007096366627,0.22252670439269867,0.48119402317611693,0.48568650230938432,0.13320370494568334,5.3939410114220267E-3,1.3280131013019128E-2,4.6940049856451409E-3,5.564949045189161E-3,2.3539085043853429E-2,2.8961918737362077E-2,3.2037924040564728E-2,0.18793338200239629,1.8127378832771109E-2,0.7207091818819138,0.82318162648898363,1.6800000000000002,0.6711458658141416,1.7947076175885159E-3,2.1663764371404525E-3,6.9520659209492047E-2,0.19223296387447919,1.8752155001349434E-3,2.2231503244911069E-3,9.4036664358510234E-3,1.1436468250693021E-3,3.9760281466564594E-2,5.7051731941514622E-6,8.5017755387293213E-6,7.5077804987725025E-2,0.39521267962726903,0.6711458658141416,67.114586581414159,140,71.049749591014816,0.71049749591014821,1207.2846375471934,null,8.8897546241907904E-2,null,0.7207091818819138,0.18793338200239629,0.1024368820340332,null,null,{"$f":"IF(OR(MODE=1,MODE=2,MODE=3), BR62, IF(MODE_ILIM=4,#REF!,#REF!))","v":67.114586581414159},{"$f":"IF(OR(MODE=1,MODE=2,MODE=3), BZ62, IF(MODE_ILIM=4,#REF!,#REF!))","v":0.7207091818819138},{"$f":"IF(OR(MODE=1,MODE=2,MODE=3), CA62, IF(MODE_ILIM=4,#REF!,#REF!))","v":0.18793338200239629},{"$f":"IF(OR(MODE=1,MODE=2,MODE=3), CB62, IF(MODE_ILIM=4,#REF!,#REF!))","v":0.1024368820340332},{"$f":"(IF(OR(MODE=1,MODE=2,MODE=3), S62, IF(MODE_ILIM=4,#REF!,#REF!)))/1000","v":1207.2846375471934},{"$f":"IF(OR(MODE=1,MODE=2,MODE=3), P62, IF(MODE_ILIM=4,#REF!,#REF!))","v":1.3396526147193544}]
[null,1500,null,null,null,"Eff (%)","Iout (mA)",57,0.14249999999999999,0.22654673295454544,0.25555927015942448,2.9514634883265958E-2,1.3395773019976462,1.3395773019976462,1,1.3395773019976462,6.1988240770221934E-7,0.25154476425773492,1207414.8684371277,8.2821574103555262E-7,0,6.6E-4,0.1567244322504189,2.9475057197059372E-3,9.9537942121209325E-2,0.10253380287618578,6.5240307051822988E-2,2.128148832108072E-5,2.128148832108072E-5,6.9955035525862866E-2,1.4681120986274209E-5,1.4681120986274209E-5,7.860394558649475E-2,4.2446846398322994E-3,4.8477706967750677E-3,40,30.05876411886252,0.25674524644941099,0.22255070855033138,0.48414372569651742,0.48877212305394807,0.13516831809169369,5.5542241615841349E-3,1.3281563552808406E-2,5.1291806848619455E-3,5.6655534777733333E-3,2.4076297715443687E-2,2.966099124176725E-2,3.2037924040564728E-2,0.18795019858698259,1.8129334249583476E-2,0.72451264713228147,0.8270824126177746,1.71,0.6740025438257693,1.8242991770436984E-3,2.2012266919470102E-3,6.8599115239786138E-2,0.19082696064136737,2.0216846955198554E-3,2.2330979276024331E-3,9.4897578398336849E-3,1.1617697970893607E-3,3.923323169408028E-2,5.7866157257091834E-6,8.3881738390683065E-6,7.4081235064435536E-2,0.39168655355827015,0.6740025438257693,67.400254382576932,142.5,71.171694607053283,0.71171694607053282,1207.4148684371278,null,8.7719148358567686E-2,null,0.72451264713228147,0.18795019858698259,0.10253380287618578,null,null,{"$f":"IF(OR(MODE=1,MODE=2,MODE=3), BR63, IF(MODE_ILIM=4,#REF!,#REF!))","v":67.400254382576932},{"$f":"IF(OR(MODE=1,MODE=2,MODE=3), BZ63, IF(MODE_ILIM=4,#REF!,#REF!))","v":0.72451264713228147},{"$f":"IF(OR(MODE=1,MODE=2,MODE=3), CA63, IF(MODE_ILIM=4,#REF!,#REF!))","v":0.18795019858698259},{"$f":"IF(OR(MODE=1,MODE=2,MODE=3), CB63, IF(MODE_ILIM=4,#REF!,#REF!))","v":0.10253380287618578},{"$f":"(IF(OR(MODE=1,MODE=2,MODE=3), S63, IF(MODE_ILIM=4,#REF!,#REF!)))/1000","v":1207.4148684371278},{"$f":"IF(OR(MODE=1,MODE=2,MODE=3), P63, IF(MODE_ILIM=4,#REF!,#REF!))","v":1.3395773019976462}]
[null,null,null,null,null,{"$f":"BR56","v":65.219090254774798},{"$f":"I56*1000","v":125},58,0.14499999999999999,0.22653399621212117,0.25805930260434601,3.2021003337126597E-2,1.3395019892759379,1.3395019892759379,1,1.3395019892759379,6.1979308302132075E-7,0.25157189677682296,1207545.1045287503,8.2812641635465393E-7,0,6.5999999999999989E-4,0.15900093604823887,3.0337557197059372E-3,9.9548678640105109E-2,0.10263225214892834,6.5240307051822988E-2,2.128148832108072E-5,2.128148832108072E-5,7.091843901045386E-2,1.508827497503839E-5,1.508827497503839E-5,7.9750009444302383E-2,4.3693639723736619E-3,4.8482935946829323E-3,40,29.76749649014948,0.25967104816200087,0.22257471366673925,0.48709405542342304,0.49186089900876856,0.13713910369195434,5.717368663475512E-3,1.3282996149816255E-2,5.5644501742892431E-3,5.7662398851983654E-3,2.4613686209303862E-2,3.0363161709927519E-2,3.2037924040564721E-2,0.18796701584325773,1.8131289744499186E-2,0.72832236630645297,0.83099098821867745,1.7399999999999998,0.67678183547643112,1.8540880178845916E-3,2.2362876909993402E-3,6.7701669257032582E-2,0.18945770625236938,2.1643211507888626E-3,2.242808283506871E-3,9.5736182359618324E-3,1.1799946921664975E-3,3.8719964051323982E-2,5.8686611676894167E-6,8.2775429469030139E-6,7.3110725282429526E-2,0.38825532911857802,0.67678183547643112,67.678183547643116,145,71.281400919850697,0.71281400919850701,1207.5451045287502,null,8.6571565083917765E-2,null,0.72832236630645297,0.18796701584325773,0.10263225214892834,null,null,{"$f":"IF(OR(MODE=1,MODE=2,MODE=3), BR64, IF(MODE_ILIM=4,#REF!,#REF!))","v":67.678183547643116},{"$f":"IF(OR(MODE=1,MODE=2,MODE=3), BZ64, IF(MODE_ILIM=4,#REF!,#REF!))","v":0.72832236630645297},{"$f":"IF(OR(MODE=1,MODE=2,MODE=3), CA64, IF(MODE_ILIM=4,#REF!,#REF!))","v":0.18796701584325773},{"$f":"IF(OR(MODE=1,MODE=2,MODE=3), CB64, IF(MODE_ILIM=4,#REF!,#REF!))","v":0.10263225214892834},{"$f":"(IF(OR(MODE=1,MODE=2,MODE=3), S64, IF(MODE_ILIM=4,#REF!,#REF!)))/1000","v":1207.5451045287502},{"$f":"IF(OR(MODE=1,MODE=2,MODE=3), P64, IF(MODE_ILIM=4,#REF!,#REF!))","v":1.3395019892759379}]
[null,null,null,null,null,{"$f":"BR81","v":71.459521783602653},{"$f":"I81*1000","v":187.5},59,0.14749999999999999,0.22652125946969692,0.26055933504926754,3.4527371790987235E-2,1.3394266765542298,1.3394266765542298,1,1.3394266765542298,6.1970377403929841E-7,0.25159903037966092,1207675.3458223725,8.2803710737263169E-7,0,6.5999999999999989E-4,0.16128405892776923,3.1215057197059365E-3,9.9559415587847963E-2,0.10273222998651406,6.5240307051822988E-2,2.128148832108072E-5,2.128148832108072E-5,7.1885437079823464E-2,1.5502548192471775E-5,1.5502548192471775E-5,8.0899516500542168E-2,4.4962307260047671E-3,4.8488165134768259E-3,40,29.481819421093288,0.26259747613895568,0.2225987197419797,0.49004501239441223,0.4949528349460251,0.13911581025887204,5.8833754338506756E-3,1.3284428804046098E-2,5.9998134595463971E-3,5.8670082882944534E-3,2.5151250551886949E-2,3.10684324880817E-2,3.2037924040564721E-2,0.18798383377126185,1.8133245317522924E-2,0.73213834652289156,0.83490736054591919,1.77,0.67948673600010678,1.8840679810526251E-3,2.2715517740925215E-3,6.6827388061791851E-2,0.18812377738136218,2.3032732566308986E-3,2.2522905716942212E-3,9.6553339795607609E-3,1.1983173632139272E-3,3.8219944822522577E-2,5.9512858028175147E-6,8.1697678172404139E-6,7.2165266457639182E-2,0.38491533270318079,0.67948673600010678,67.948673600010679,147.5,71.3800443047935,0.713800443047935,1207.6753458223725,null,8.5453603115977578E-2,null,0.73213834652289156,0.18798383377126185,0.10273222998651406,null,null,{"$f":"IF(OR(MODE=1,MODE=2,MODE=3), BR65, IF(MODE_ILIM=4,#REF!,#REF!))","v":67.948673600010679},{"$f":"IF(OR(MODE=1,MODE=2,MODE=3), BZ65, IF(MODE_ILIM=4,#REF!,#REF!))","v":0.73213834652289156},{"$f":"IF(OR(MODE=1,MODE=2,MODE=3), CA65, IF(MODE_ILIM=4,#REF!,#REF!))","v":0.18798383377126185},{"$f":"IF(OR(MODE=1,MODE=2,MODE=3), CB65, IF(MODE_ILIM=4,#REF!,#REF!))","v":0.10273222998651406},{"$f":"(IF(OR(MODE=1,MODE=2,MODE=3), S65, IF(MODE_ILIM=4,#REF!,#REF!)))/1000","v":1207.6753458223725},{"$f":"IF(OR(MODE=1,MODE=2,MODE=3), P65, IF(MODE_ILIM=4,#REF!,#REF!))","v":1.3394266765542298}]
[null,null,null,null,null,{"$f":"BR106","v":74.957194519232743},{"$f":"I106*1000","v":250},60,0.15,0.22650852272727273,0.26305936749418901,3.7033740244847888E-2,1.3393513638325218,1.3393513638325218,1,1.3393513638325218,6.1961448075201435E-7,0.25162616506631375,1207805.592318306,8.2794781408534763E-7,0,6.6E-4,0.16357352372623188,3.2107557197059368E-3,9.9570152964463601E-2,0.10283373652540598,6.5240307051822988E-2,2.128148832108072E-5,2.128148832108072E-5,7.2855890059314574E-2,1.5923942149004795E-5,1.5923942149004795E-5,8.2052328258371041E-2,4.6252856013895794E-3,4.8493394531579984E-3,40,29.201573484800747,0.26552453041779833,0.22262272677611017,0.49299659664706652,0.49804793564768612,0.14109819963156062,6.0522453895373906E-3,1.3285861515501367E-2,6.4352705462532283E-3,5.967858707893456E-3,2.5688990769648052E-2,3.1776805933166681E-2,3.2037924040564728E-2,0.18800065237103525,1.8135200968659365E-2,0.73596059492054744,0.83883153687642353,1.7999999999999998,0.68212008794265588,1.9142332240726732E-3,2.3070116748433122E-3,6.5975386024531554E-2,0.18682382325573729,2.4386818394139089E-3,2.2615535036986829E-3,9.734987023861337E-3,1.216733874382333E-3,3.7732667498102009E-2,6.034467121707176E-6,8.064739269514548E-6,7.1243900849226258E-2,0.38166307797426058,0.68212008794265588,68.212008794265586,150,71.468691685531624,0.71468691685531627,1207.805592318306,null,8.436412998141897E-2,null,0.73596059492054744,0.18800065237103525,0.10283373652540598,null,null,{"$f":"IF(OR(MODE=1,MODE=2,MODE=3), BR66, IF(MODE_ILIM=4,#REF!,#REF!))","v":68.212008794265586},{"$f":"IF(OR(MODE=1,MODE=2,MODE=3), BZ66, IF(MODE_ILIM=4,#REF!,#REF!))","v":0.73596059492054744},{"$f":"IF(OR(MODE=1,MODE=2,MODE=3), CA66, IF(MODE_ILIM=4,#REF!,#REF!))","v":0.18800065237103525},{"$f":"IF(OR(MODE=1,MODE=2,MODE=3), CB66, IF(MODE_ILIM=4,#REF!,#REF!))","v":0.10283373652540598},{"$f":"(IF(OR(MODE=1,MODE=2,MODE=3), S66, IF(MODE_ILIM=4,#REF!,#REF!)))/1000","v":1207.805592318306},{"$f":"IF(OR(MODE=1,MODE=2,MODE=3), P66, IF(MODE_ILIM=4,#REF!,#REF!))","v":1.3393513638325218}]
[null,null,null,null,null,null,null,61,0.1525,0.22649578598484849,0.26555939993911054,3.954010869870854E-2,1.3392760511108137,1.3392760511108137,1,1.3392760511108137,6.1952520315533134E-7,0.25165330083684639,1207935.8440168628,8.2785853648866473E-7,0,6.6E-4,0.16586906783428954,3.3015057197059369E-3,9.9580890769977712E-2,0.10293677190427725,6.5240307051822988E-2,2.128148832108072E-5,2.128148832108072E-5,7.3829665119237844E-2,1.6352458354856415E-5,1.6352458354856415E-5,8.3208313491688196E-2,4.7565292992480385E-3,4.8498624137277039E-3,40,28.92660525916877,0.26845221103605482,0.22264673476918814,0.49594880821897069,0.5011462059055336,0.14308604615199227,6.2239794474366582E-3,1.3287294284185493E-2,6.8708214400300064E-3,6.0687911648289036E-3,2.6226906889044402E-2,3.2488284412836917E-2,3.2037924040564728E-2,0.18801747164261823,1.8137156697913197E-2,0.73978911865890185,0.84276352450985503,1.83,0.68468459076849864,1.9445782011395997E-3,2.3426604959152749E-3,6.5144822092667976E-2,0.18555656109154675,2.5706806371094924E-3,2.2706053525411792E-3,9.8126551969666027E-3,1.2352404877686977E-3,3.7257651062953416E-2,6.1181837468599894E-6,7.9623536186140636E-6,7.0345718922925599E-2,0.37849525407890006,0.68468459076849864,68.468459076849868,152.5,71.54830972155635,0.71548309721556347,1207.9358440168628,null,8.3302070208406576E-2,null,0.73978911865890185,0.18801747164261823,0.10293677190427725,null,null,{"$f":"IF(OR(MODE=1,MODE=2,MODE=3), BR67, IF(MODE_ILIM=4,#REF!,#REF!))","v":68.468459076849868},{"$f":"IF(OR(MODE=1,MODE=2,MODE=3), BZ67, IF(MODE_ILIM=4,#REF!,#REF!))","v":0.73978911865890185},{"$f":"IF(OR(MODE=1,MODE=2,MODE=3), CA67, IF(MODE_ILIM=4,#REF!,#REF!))","v":0.18801747164261823},{"$f":"IF(OR(MODE=1,MODE=2,MODE=3), CB67, IF(MODE_ILIM=4,#REF!,#REF!))","v":0.10293677190427725},{"$f":"(IF(OR(MODE=1,MODE=2,MODE=3), S67, IF(MODE_ILIM=4,#REF!,#REF!)))/1000","v":1207.9358440168628},{"$f":"IF(OR(MODE=1,MODE=2,MODE=3), P67, IF(MODE_ILIM=4,#REF!,#REF!))","v":1.3392760511108137}]
[null,null,null,null,null,null,null,62,0.155,0.22648304924242421,0.26805943238403207,4.2046477152569178E-2,1.3392007383891054,1.3392007383891054,1,1.3392007383891054,6.1943594124511417E-7,0.25168043769132392,1208066.1009183547,8.2776927457844745E-7,0,6.6E-4,0.16817044230249306,3.3937557197059377E-3,9.9591629004416038E-2,0.10304133626401191,6.5240307051822988E-2,2.128148832108072E-5,2.128148832108072E-5,7.4806635891107351E-2,1.678809832003413E-5,1.678809832003413E-5,8.4367347798828762E-2,4.889962520356065E-3,4.8503853951871942E-3,40,28.656767046809712,0.27138051803125418,0.22267074372127113,0.49890164714771246,0.50424765052118781,0.1450791358975238,6.3985785245227423E-3,1.3288727110101903E-2,7.3064661464974524E-3,6.1698056799359838E-3,2.6764998936535341E-2,3.3202870305483932E-2,3.2037924040564728E-2,0.18803429158605095,1.8139112505289098E-2,0.74362392491801177,0.84670333076866477,1.8599999999999999,0.68718280975099955,1.9750976446898457E-3,2.3784916860911864E-3,6.4334897020769319E-2,0.18432077186901441,2.699396739731547E-3,2.2794539799763903E-3,9.8884124581671336E-3,1.2538336511161569E-3,3.6794438412329974E-2,6.2024153623317681E-6,7.8625123334211459E-6,6.9469856355721088E-2,0.3754087147453028,0.68718280975099955,68.718280975099958,155,71.619772941093288,0.71619772941093285,1208.0661009183548,null,8.2266401784799909E-2,null,0.74362392491801177,0.18803429158605095,0.10304133626401191,null,null,{"$f":"IF(OR(MODE=1,MODE=2,MODE=3), BR68, IF(MODE_ILIM=4,#REF!,#REF!))","v":68.718280975099958},{"$f":"IF(OR(MODE=1,MODE=2,MODE=3), BZ68, IF(MODE_ILIM=4,#REF!,#REF!))","v":0.74362392491801177},{"$f":"IF(OR(MODE=1,MODE=2,MODE=3), CA68, IF(MODE_ILIM=4,#REF!,#REF!))","v":0.18803429158605095},{"$f":"IF(OR(MODE=1,MODE=2,MODE=3), CB68, IF(MODE_ILIM=4,#REF!,#REF!))","v":0.10304133626401191},{"$f":"(IF(OR(MODE=1,MODE=2,MODE=3), S68, IF(MODE_ILIM=4,#REF!,#REF!)))/1000","v":1208.0661009183548},{"$f":"IF(OR(MODE=1,MODE=2,MODE=3), P68, IF(MODE_ILIM=4,#REF!,#REF!))","v":1.3392007383891054}]
[null,null,null,null,null,null,null,63,0.1575,0.22647031249999999,0.2705594648289536,4.4552845606429817E-2,1.3391254256673972,1.3391254256673972,1,1.3391254256673972,6.1934669501722921E-7,0.25170757562981105,1208196.363023093,8.2768002835056238E-7,0,6.5999999999999989E-4,0.17047741100866162,3.4875057197059369E-3,9.9602367667804212E-2,0.10314742974770504,6.5240307051822988E-2,2.128148832108072E-5,2.128148832108072E-5,7.5786682106937175E-2,1.7230863554333855E-5,1.7230863554333855E-5,8.5529313186682818E-2,5.0255859655455593E-3,4.8509083975377182E-3,40,28.391916610507707,0.27430945144092805,0.2226947536324165,0.5018551134708823,0.50735227430613239,0.14707726596574242,6.5760435378431504E-3,1.3290159993254023E-2,7.742204671276732E-3,6.2709022740515506E-3,2.7303266938582305E-2,3.3920566000256017E-2,3.2037924040564721E-2,0.18805111220137369,1.8141068390791742E-2,0.74746502089855393,0.85065096299813436,1.8900000000000001,0.68961718420810325,2.0057865483302821E-3,2.4144990190340465E-3,6.3544850804746297E-2,0.18311529641916824,2.8249509973379276E-3,2.288106861733133E-3,9.9623291353795381E-3,1.2725099864197157E-3,3.6342594884408129E-2,6.2871426485786997E-6,7.7651217204980533E-6,6.8615491261118197E-2,0.37240046818204459,0.68961718420810325,68.961718420810328,157.5,71.68387138413388,0.71683871384133879,1208.196363023093,null,8.1256152877198062E-2,null,0.74746502089855393,0.18805111220137369,0.10314742974770504,null,null,{"$f":"IF(OR(MODE=1,MODE=2,MODE=3), BR69, IF(MODE_ILIM=4,#REF!,#REF!))","v":68.961718420810328},{"$f":"IF(OR(MODE=1,MODE=2,MODE=3), BZ69, IF(MODE_ILIM=4,#REF!,#REF!))","v":0.74746502089855393},{"$f":"IF(OR(MODE=1,MODE=2,MODE=3), CA69, IF(MODE_ILIM=4,#REF!,#REF!))","v":0.18805111220137369},{"$f":"IF(OR(MODE=1,MODE=2,MODE=3), CB69, IF(MODE_ILIM=4,#REF!,#REF!))","v":0.10314742974770504},{"$f":"(IF(OR(MODE=1,MODE=2,MODE=3), S69, IF(MODE_ILIM=4,#REF!,#REF!)))/1000","v":1208.196363023093},{"$f":"IF(OR(MODE=1,MODE=2,MODE=3), P69, IF(MODE_ILIM=4,#REF!,#REF!))","v":1.3391254256673972}]
[null,null,null,null,null,null,null,64,{"$f":"IF(PLOT_TYPE=1, H70/100*Iout, min_I*EXP(H70*rr/100))","v":0.16},{"$f":"IF(I70<Icrit, (Vin-(Rdcr+RdsonTop)*Iripple/2-Vout)/L*OnTime, (Vin-(Rdcr+RdsonTop)*I70-Vout)/L*OnTime)","v":0.22645757575757575},{"$f":"IF(I70<Icrit, (Vin-(Rdcr+RdsonTop)*Iripple/2-Vout)/L*OnTime, I70+((Vin-(Rdcr+RdsonTop)*J70-Vout)/L*OnTime)/2)","v":0.27305949727387513},{"$f":"IF(I70<Icrit, 0, I70-((Vin-(Rdcr+RdsonTop)*K70-Vout)/L*OnTime)/2)","v":4.7059214060290469E-2},1.3390501129456891,{"$f":"IF(I70<Icrit, 1000*SQRT((J70*CoutEsr)^2+(((J70/2)-I70)*(OnTime+OffTime)/Cout)^2), 1000*J70*SQRT(CoutEsr^2+(1/(8*Fsw*Cout))^2))","v":1.3390501129456891},1,{"$f":"IF(I70<Icrit, 1000*((N70/1000)*O70), 1000*J70*SQRT(CoutEsr^2+(1/(8*Fsw*Cout))^2))","v":1.3390501129456891},{"$f":"IF(I70<Icrit, L*J70/(Vout+J70/2*(RdsonBot+Rdcr)), L*J70/(Vout+I70*(RdsonBot+Rdcr)))","v":6.1925746446754346E-7},0.2517347146523729,{"$f":"IF(I70<Icrit,I70/((OnTime+Q70)*J70/2),1/(OnTime+Q70))","v":1208326.6303313898},8.2759079780087674E-7,0,{"$f":"S70*(T70*Iq_active+U70*Iq_sleep)","v":6.6E-4},0.17278974988180329,{"$f":"W70^2*Rdcr","v":3.5827557197059367E-3},{"$f":"Core_Loss/1000*S70/$S$106","v":9.9613106760167991E-2},{"$f":"(Y70+X70*(1+Ltc*(Ta-25)))/(1-X70*Ltc*ThetaCa)","v":0.10325505250066358},6.5240307051822988E-2,2.128148832108072E-5,2.128148832108072E-5,7.6769689260236695E-2,1.7680755567339905E-5,1.7680755567339905E-5,8.6694097683047366E-2,5.1634003357044203E-3,4.85143142078053E-3,{"$f":"20*VIN_nom/24","v":40},{"$f":"IF(I70<Icrit, Csw*Vin/Iripple*1000000000, Csw*Vin/(I70+Iripple/2)*1000000000)","v":28.131916923210337},{"$f":"IF(I70<Icrit, Vin*(I70+Iripple/2)*AK70/1000000000/2*S70, Vin*(I70-Iripple/2)*AJ70/1000000000/2*S70 + Vin*(I70+Iripple/2)*AK70/1000000000/2*S70)","v":0.27723901130261153},{"$f":"IF(I70<Icrit, Csw*(Vin)^2*S70/2, Csw*Vin^2*S70/2)","v":0.22271876450268177},0.50480920722607381,{"$f":"(AI70+AL70+AM70+AH70*(1+RdsonTopTc*(Ta-25)))/(1-AH70*RdsonTopTc*ThetaJA)","v":0.51046008208173943},{"$f":"IF(I70<Icrit,Iripple*SQRT((OffTime)*S70/3), SQRT(OffTime*S70*(I70^2+Iripple^2/12)))","v":0.14908024380786142},6.7563754045186662E-3,{"$f":"QgBot*S70*Vdd","v":1.3291592933645289E-2},{"$f":"IF(I70<Icrit, Vin*Idss*R70, QrrBot*(I70-Iripple/2)/1*S70*Vin+Vin*Idss*R70)","v":8.1780370199894606E-3},{"$f":"IF(I70<Icrit, dead1*S70*(I70+Iripple/2)*((I70+Iripple/2)*BDserR+VSD), dead1*S70*(I70+Iripple/2)*((I70+Iripple/2)*BDserR+VSD)+dead2*S70*(I70-Iripple/2)*((I70-Iripple/2)*BDserR+VSD))","v":6.3720809680141268E-3},2.7841710921648877E-2,{"$f":"(AR70+AS70+AT70+AQ70*(1+RdsonBotTc*(Ta-25)))/(1-AQ70*RdsonBotTc*ThetaJA)","v":3.464137389707795E-2},{"$f":"Vin*V70+Vout*Ifb/0.8","v":3.2037924040564728E-2},{"$f":"(Vin-Vdd)*(S70*QgBot+S70*QgTop)+AW70","v":0.18806793348862677},{"$f":"AI70+AR70","v":1.8143024354425819E-2},0.75131241382187008,{"$f":"SUM(Z70,AC70,AF70,AZ70)","v":0.8546064285664221},{"$f":"Vout*I70","v":1.92},0.69199003513879331,2.0366401510088423E-3,2.4506765735932893E-3,{"$f":"Vin*S70*(QgBot+QgTop)/($BB70+$BA70)","v":6.2773960302715537E-2},0.18193903179518603,2.9474583983483643E-3,2.2965711109184019E-3,1.0034472145310381E-2,{"$f":"X70/($BB70+$BA70)","v":1.2912662793609499E-3},{"$f":"Y70/($BB70+$BA70)","v":3.5901706899610947E-2},6.3723472220437276E-6,7.6700926307867007E-6,6.7781841616289099E-2,0.36946766771219469,{"$f":"BC70","v":0.69199003513879331},69.199003513879333,{"$f":"I70*1000","v":160},71.741317737155555,0.71741317737155552,{"$f":"S70/1000","v":1208.3266303313899},null,{"$f":"AM70/($BB70+$BA70)","v":8.0270398788687178E-2},null,0.75131241382187008,0.18806793348862677,0.10325505250066358,null,null,{"$f":"IF(OR(MODE=1,MODE=2,MODE=3), BR70, IF(MODE_ILIM=4,#REF!,#REF!))","v":69.199003513879333},{"$f":"IF(OR(MODE=1,MODE=2,MODE=3), BZ70, IF(MODE_ILIM=4,#REF!,#REF!))","v":0.75131241382187008},{"$f":"IF(OR(MODE=1,MODE=2,MODE=3), CA70, IF(MODE_ILIM=4,#REF!,#REF!))","v":0.18806793348862677},{"$f":"IF(OR(MODE=1,MODE=2,MODE=3), CB70, IF(MODE_ILIM=4,#REF!,#REF!))","v":0.10325505250066358},{"$f":"(IF(OR(MODE=1,MODE=2,MODE=3), S70, IF(MODE_ILIM=4,#REF!,#REF!)))/1000","v":1208.3266303313899},{"$f":"IF(OR(MODE=1,MODE=2,MODE=3), P70, IF(MODE_ILIM=4,#REF!,#REF!))","v":1.3390501129456891}]
[null,null,null,null,null,null,null,65,0.16250000000000001,0.22644483901515147,0.2755595297187966,4.9565582514151107E-2,{"$f":"IF(I71<Icrit, 1000*((((J71/2)-I71)*0.000002/Cout+Vout/306)), 1000*J71*SQRT(CoutEsr^2+(1/(8*Fsw*Cout))^2))","v":1.3389748002239807},1.3389748002239807,{"$f":"ROUNDUP(M71/N71,0)","v":1},1.3389748002239807,6.1916824959192638E-7,0.25176185475907431,1208456.9028435566,{"$f":"IF(1/S71-OnTime-Q71>Tsleep, OnTime+Q71+Tsleep, 1/S71)","v":8.2750158292525987E-7},{"$f":"IF(1/S71-OnTime-Q71>Tsleep, 1/S71-OnTime-Q71-Tsleep, 0)","v":0},6.6E-4,{"$f":"IF(I71<Icrit,Iripple*SQRT((OnTime+OffTime)*S71/3), SQRT(I71^2+Iripple^2/12))","v":0.17510724617849527},3.6795057197059372E-3,9.9623846281533021E-2,0.10336420467040658,{"$f":"Iripple/SQRT(12)*SQRT((OnTime+Q71)*S71)","v":6.5240307051822988E-2},{"$f":"RCoutEsr*AA71^2","v":2.128148832108072E-5},2.128148832108072E-5,{"$f":"SQRT($R71)*SQRT($I71^2*(1-R71)+(Iripple^2)/12)","v":7.7755548287405052E-2},{"$f":"RCinEsr*AD71^2","v":1.8137775868424936E-5},1.8137775868424936E-5,{"$f":"IF(I71<Icrit,Iripple*SQRT((OnTime)*S71/3), SQRT(OnTime*S71*(I71^2+Iripple^2/12)))","v":8.7861594975174331E-2},{"$f":"RdsonTop*AG71^2","v":5.3034063317765456E-3},{"$f":"QgTop*S71*Vdd","v":4.8519544649168796E-3},40,27.87663593163245,0.28016919765384235,0.22274277633212436,{"$f":"AI71+AL71+AM71","v":0.50776392845088358},0.5135710786792943,0.15108788660716285,{"$f":"RdsonBot*AP71^2","v":6.9395750417433457E-3},1.3293025931279123E-2,8.6139631982577024E-3,6.4733417826638925E-3,{"$f":"AR71+AS71+AT71","v":2.838033091220072E-2},3.5365296406670861E-2,3.2037924040564728E-2,0.18808475544785036,1.8144980396196005E-2,0.75516611093001151,0.85856973486460764,1.9500000000000002,0.69430357231062434,{"$f":"(AO71-AN71)/($BB71+$BA71)","v":2.0676539223230869E-3},{"$f":"(AV71-AU71)/($BB71+$BA71)","v":2.4870187155267001E-3},6.2021537026880666E-2,{"$f":"AN71/($BB71+$BA71)","v":0.18079092790457676},{"$f":"AS71/(BA71+BB71)","v":3.067028420667986E-3},{"$f":"AT71/($BB71+$BA71)","v":2.3048534997390591E-3},{"$f":"AU71/($BB71+$BA71)","v":1.0104905197794153E-2},1.3100994695021573E-3,3.5471380697739939E-2,{"$f":"(AF71)/($BB71+$BA71)","v":6.4580115790855736E-6},{"$f":"(AC71)/($BB71+$BA71)","v":7.5773401873913712E-6},{"$f":"AX71/($BB71+$BA71)","v":6.6968162874160339E-2},{"$f":"SUM(BD71:BO71)","v":0.36660760308067736},0.69430357231062434,69.43035723106243,162.5,71.792753953912452,{"$f":"BT71/100","v":0.71792753953912447},1208.4569028435567,null,7.9308259135271952E-2,null,{"$f":"AZ71","v":0.75516611093001151},{"$f":"AX71","v":0.18808475544785036},{"$f":"Z71","v":0.10336420467040658},null,null,{"$f":"IF(OR(MODE=1,MODE=2,MODE=3), BR71, IF(MODE_ILIM=4,#REF!,#REF!))","v":69.43035723106243},{"$f":"IF(OR(MODE=1,MODE=2,MODE=3), BZ71, IF(MODE_ILIM=4,#REF!,#REF!))","v":0.75516611093001151},{"$f":"IF(OR(MODE=1,MODE=2,MODE=3), CA71, IF(MODE_ILIM=4,#REF!,#REF!))","v":0.18808475544785036},{"$f":"IF(OR(MODE=1,MODE=2,MODE=3), CB71, IF(MODE_ILIM=4,#REF!,#REF!))","v":0.10336420467040658},{"$f":"(IF(OR(MODE=1,MODE=2,MODE=3), S71, IF(MODE_ILIM=4,#REF!,#REF!)))/1000","v":1208.4569028435567},{"$f":"IF(OR(MODE=1,MODE=2,MODE=3), P71, IF(MODE_ILIM=4,#REF!,#REF!))","v":1.3389748002239807}]
[null,null,null,null,null,null,null,66,0.16500000000000001,0.22643210227272725,0.27805956216371819,5.207195096801176E-2,1.3388994875022726,1.3388994875022726,1,1.3388994875022726,6.1907905038624814E-7,{"$f":"OnTime*S72","v":0.25178899594998039},1208587.1805599059,8.2741238371958153E-7,0,6.600000000000001E-4,0.17742969780793785,3.7777557197059375E-3,9.9634586231925087E-2,0.10347488640666602,6.5240307051822988E-2,2.128148832108072E-5,{"$f":"AB72","v":2.128148832108072E-5},7.8744155268290428E-2,1.8601925966749894E-5,{"$f":"AE72","v":1.8601925966749894E-5},8.9031704072624854E-2,5.4456046547618304E-3,4.852477529948023E-3,40,27.625946332615154,0.28310001053216172,0.22276678912080186,0.51071927718291155,0.51668526894002165,0.15310002069923767,7.125643366784529E-3,1.3294458986158966E-2,9.04998321170398E-3,6.5746847388427022E-3,2.891912693670565E-2,3.6092335950572187E-2,3.2037924040564734E-2,0.18810157807908484,1.8146936516106989E-2,{"$f":"AO72+AV72+AX72+AY72","v":0.75902611948578558},0.86254088930673944,1.98,0.6965599008438178,2.0988235488725482E-3,2.5235200805206336E-3,6.1286925092259588E-2,0.1796699843805834,3.1837653578700707E-3,2.3129604796806235E-3,1.0173688985616903E-2,1.329006641177037E-3,3.5051241164810377E-2,6.5441190438905784E-6,7.4867835326974004E-6,6.6173745745117668E-2,0.36381769237908534,0.6965599008438178,{"$f":"100*BQ72","v":69.655990084381784},165,71.838757366287027,0.71838757366287032,1208.5871805599058,null,7.8368895222869397E-2,null,0.75902611948578558,0.18810157807908484,0.10347488640666602,null,null,{"$f":"IF(OR(MODE=1,MODE=2,MODE=3), BR72, IF(MODE_ILIM=4,#REF!,#REF!))","v":69.655990084381784},{"$f":"IF(OR(MODE=1,MODE=2,MODE=3), BZ72, IF(MODE_ILIM=4,#REF!,#REF!))","v":0.75902611948578558},{"$f":"IF(OR(MODE=1,MODE=2,MODE=3), CA72, IF(MODE_ILIM=4,#REF!,#REF!))","v":0.18810157807908484},{"$f":"IF(OR(MODE=1,MODE=2,MODE=3), CB72, IF(MODE_ILIM=4,#REF!,#REF!))","v":0.10347488640666602},{"$f":"(IF(OR(MODE=1,MODE=2,MODE=3), S72, IF(MODE_ILIM=4,#REF!,#REF!)))/1000","v":1208.5871805599058},{"$f":"IF(OR(MODE=1,MODE=2,MODE=3), P72, IF(MODE_ILIM=4,#REF!,#REF!))","v":1.3388994875022726}]
[null,null,null,null,null,null,null,67,0.16750000000000001,0.22641936553030298,0.28055959460863966,5.4578319421872426E-2,1.3388241747805643,1.3388241747805643,1,1.3388241747805643,6.1898986684638073E-7,0.25181613822515603,1208717.4634807489,8.2732320017971412E-7,0,6.6E-4,0.17975691270217162,3.877505719705937E-3,9.964532661136985E-2,0.10358709786138702,6.5240307051822988E-2,2.128148832108072E-5,2.128148832108072E-5,7.973541114474364E-2,1.9073207371263924E-5,1.9073207371263924E-5,9.0204328992677496E-2,5.5899960057161895E-3,4.8530006158752073E-3,40,27.379725361444258,0.28603144997511332,0.22279080286877165,0.51367525345976017,0.51980265771510914,0.15511648103100953,7.3145812969828364E-3,1.3295892098288239E-2,9.4860970659512468E-3,6.6761098573940667E-3,2.9458099021633551E-2,3.6822494961155694E-2,3.2037924040564728E-2,0.1881184013823704,1.8148892714163447E-2,0.76289244677279877,0.86651989932987816,2.0100000000000002,{"$f":"BB73/(BB73+BA73)","v":0.69876102733315182},2.1301449215687415E-3,2.5601755584022806E-3,6.0569499309411357E-2,0.17857524767321351,3.2977686224806417E-3,2.3208982002694825E-3,1.0240881361014116E-2,1.3479850150208421E-3,3.4640930742242906E-2,6.6306537200411062E-6,7.398345593242207E-6,6.5397914134435492E-2,0.36109547453737267,0.69876102733315182,69.876102733315179,167.5,71.879846296152991,0.71879846296152994,1208.7174634807488,null,7.7451507608438094E-2,null,0.76289244677279877,0.1881184013823704,0.10358709786138702,null,null,{"$f":"IF(OR(MODE=1,MODE=2,MODE=3), BR73, IF(MODE_ILIM=4,#REF!,#REF!))","v":69.876102733315179},{"$f":"IF(OR(MODE=1,MODE=2,MODE=3), BZ73, IF(MODE_ILIM=4,#REF!,#REF!))","v":0.76289244677279877},{"$f":"IF(OR(MODE=1,MODE=2,MODE=3), CA73, IF(MODE_ILIM=4,#REF!,#REF!))","v":0.1881184013823704},{"$f":"IF(OR(MODE=1,MODE=2,MODE=3), CB73, IF(MODE_ILIM=4,#REF!,#REF!))","v":0.10358709786138702},{"$f":"(IF(OR(MODE=1,MODE=2,MODE=3), S73, IF(MODE_ILIM=4,#REF!,#REF!)))/1000","v":1208.7174634807488},{"$f":"IF(OR(MODE=1,MODE=2,MODE=3), P73, IF(MODE_ILIM=4,#REF!,#REF!))","v":1.3388241747805643}]
[null,null,null,null,null,null,null,68,0.17,0.22640662878787876,0.28305962705356119,5.7084687875733037E-2,1.3387488620588561,1.3387488620588561,1,1.3387488620588561,6.1890069896819774E-7,0.25184328158466618,1208847.7516063976,8.2723403230153112E-7,0,6.6E-4,0.18208870822820439,3.9787557197059377E-3,9.965606741989301E-2,0.10370083918872862,6.5240307051822988E-2,2.128148832108072E-5,2.128148832108072E-5,8.0729221456059264E-2,1.9551621590704377E-5,1.9551621590704377E-5,9.1379378466666092E-2,5.7365810857515354E-3,4.8535237226996868E-3,40,27.137854591388582,0.288963516020244,0.2228148175760912,0.51663185731903494,0.52292324986573391,0.15713711065575009,7.5063897497521844E-3,1.3297325267670374E-2,9.9223047666229212E-3,6.7776171591631667E-3,2.9997247193456464E-2,3.7555775881651668E-2,3.2037924040564728E-2,0.18813522535774724,1.8150848990370061E-2,0.76676510009550292,0.87050677239414331,2.04,0.70090886554506238,2.1616141238261942E-3,2.5969802784474067E-3,5.9868663409505987E-2,0.17750580834211926,3.4091330282186457E-3,2.3286725265332371E-3,1.0306537499921754E-2,1.3670319400882437E-3,3.4240108411744838E-2,6.7176004454445852E-6,7.31195286090156E-6,6.4640023222825138E-2,0.35843860233653713,0.70090886554506238,70.090886554506241,170,71.916485184007442,0.71916485184007439,1208.8477516063977,null,7.6555333830337316E-2,null,0.76676510009550292,0.18813522535774724,0.10370083918872862,null,null,{"$f":"IF(OR(MODE=1,MODE=2,MODE=3), BR74, IF(MODE_ILIM=4,#REF!,#REF!))","v":70.090886554506241},{"$f":"IF(OR(MODE=1,MODE=2,MODE=3), BZ74, IF(MODE_ILIM=4,#REF!,#REF!))","v":0.76676510009550292},{"$f":"IF(OR(MODE=1,MODE=2,MODE=3), CA74, IF(MODE_ILIM=4,#REF!,#REF!))","v":0.18813522535774724},{"$f":"IF(OR(MODE=1,MODE=2,MODE=3), CB74, IF(MODE_ILIM=4,#REF!,#REF!))","v":0.10370083918872862},{"$f":"(IF(OR(MODE=1,MODE=2,MODE=3), S74, IF(MODE_ILIM=4,#REF!,#REF!)))/1000","v":1208.8477516063977},{"$f":"IF(OR(MODE=1,MODE=2,MODE=3), P74, IF(MODE_ILIM=4,#REF!,#REF!))","v":1.3387488620588561}]
[null,null,null,null,null,null,null,69,0.17249999999999999,0.22639389204545457,0.28555965949848267,5.9591056329593661E-2,1.3386735493371484,1.3386735493371484,1,1.3386735493371484,6.1881154674757367E-7,0.2518704260285759,1208978.0449371643,8.2714488008090684E-7,0,6.6E-4,0.18442491063903524,4.0815057197059355E-3,9.9666808657520325E-2,0.10381611054506423,6.5240307051822988E-2,2.128148832108072E-5,2.128148832108072E-5,8.1725496090258781E-2,2.0037170133596713E-5,2.0037170133596713E-5,9.2556765665743543E-2,5.8853605960358111E-3,4.8540468504227148E-3,40,26.900219743770467,0.29189620870510391,0.22283883324281811,0.51958908879834476,0.52604705026308818,0.15916176026149884,7.7010696425798041E-3,1.3298758494308808E-2,1.0358606319342866E-2,6.8792066649968498E-3,3.0536571478648522E-2,3.8292181166167116E-2,3.2037924040564728E-2,0.18815205000525581,1.8152805344731522E-2,0.77064408677924257,0.87450151598276149,2.0699999999999998,0.70300524172395051,2.1932274205632403E-3,2.6339295956959528E-3,5.9183848391145773E-2,0.17646079853517274,3.5179490528757843E-3,2.3362890552633443E-3,1.0370710054960387E-2,1.3861448865118639E-3,3.3848448749823581E-2,6.8049447503541451E-6,7.2275351890854024E-6,6.3899457678648158E-2,0.35584483590060023,0.70300524172395051,70.300524172395058,172.5,71.94908925319227,0.71949089253192267,1208.9780449371642,null,7.567964629437221E-2,null,0.77064408677924257,0.18815205000525581,0.10381611054506423,null,null,{"$f":"IF(OR(MODE=1,MODE=2,MODE=3), BR75, IF(MODE_ILIM=4,#REF!,#REF!))","v":70.300524172395058},{"$f":"IF(OR(MODE=1,MODE=2,MODE=3), BZ75, IF(MODE_ILIM=4,#REF!,#REF!))","v":0.77064408677924257},{"$f":"IF(OR(MODE=1,MODE=2,MODE=3), CA75, IF(MODE_ILIM=4,#REF!,#REF!))","v":0.18815205000525581},{"$f":"IF(OR(MODE=1,MODE=2,MODE=3), CB75, IF(MODE_ILIM=4,#REF!,#REF!))","v":0.10381611054506423},{"$f":"(IF(OR(MODE=1,MODE=2,MODE=3), S75, IF(MODE_ILIM=4,#REF!,#REF!)))/1000","v":1208.9780449371642},{"$f":"IF(OR(MODE=1,MODE=2,MODE=3), P75, IF(MODE_ILIM=4,#REF!,#REF!))","v":1.3386735493371484}]
[null,null,null,null,null,null,null,70,0.17499999999999999,0.2263811553030303,0.28805969194340419,6.2097424783454327E-2,1.3385982366154399,1.3385982366154399,1,1.3385982366154399,6.1872241018038464E-7,0.25189757155695008,1209108.3434733604,8.2705574351371803E-7,0,6.600000000000001E-4,0.18676535456078608,4.1857557197059365E-3,9.9677550324277456E-2,0.10393291208898213,6.5240307051822988E-2,2.128148832108072E-5,2.128148832108072E-5,8.27241490502309E-2,2.0529854508254452E-5,2.0529854508254452E-5,9.3736407944678357E-2,6.0363352377929879E-3,4.854569999045542E-3,40,26.666710507928421,0.29482952806724577,0.22286284986900978,0.5225469479353011,0.52917406378840348,0.16119028773049229,7.8986218930262239E-3,1.3300191778206965E-2,1.0795001729735397E-2,6.980878395743623E-3,3.1076071903685984E-2,3.9031713279706136E-2,3.2037924040564734E-2,0.18816887532493629,1.8154761777252507E-2,0.77452941417029841,0.87850413760210988,2.0999999999999996,0.70505189953861769,2.2249812479487254E-3,2.6710190781957296E-3,5.8514510979305039E-2,0.17543938963804348,3.6243030833679082E-3,2.3437531301748289E-3,1.0433449298044037E-2,1.4053214386587167E-3,3.3465641046422856E-2,6.8926728182363133E-6,7.1450256027556539E-6,6.3175629991376991E-2,0.35331203662995925,0.70505189953861769,70.505189953861773,175,71.978028730187987,0.71978028730187982,1209.1083434733605,null,7.4823750303207218E-2,null,0.77452941417029841,0.18816887532493629,0.10393291208898213,null,null,{"$f":"IF(OR(MODE=1,MODE=2,MODE=3), BR76, IF(MODE_ILIM=4,#REF!,#REF!))","v":70.505189953861773},{"$f":"IF(OR(MODE=1,MODE=2,MODE=3), BZ76, IF(MODE_ILIM=4,#REF!,#REF!))","v":0.77452941417029841},{"$f":"IF(OR(MODE=1,MODE=2,MODE=3), CA76, IF(MODE_ILIM=4,#REF!,#REF!))","v":0.18816887532493629},{"$f":"IF(OR(MODE=1,MODE=2,MODE=3), CB76, IF(MODE_ILIM=4,#REF!,#REF!))","v":0.10393291208898213},{"$f":"(IF(OR(MODE=1,MODE=2,MODE=3), S76, IF(MODE_ILIM=4,#REF!,#REF!)))/1000","v":1209.1083434733605},{"$f":"IF(OR(MODE=1,MODE=2,MODE=3), P76, IF(MODE_ILIM=4,#REF!,#REF!))","v":1.3385982366154399}]
[null,null,null,null,null,null,null,71,0.17749999999999999,0.22636841856060602,0.29055972438832572,6.4603793237314952E-2,1.3385229238937315,1.3385229238937315,1,1.3385229238937315,6.1863328926250858E-7,0.25192471816985385,1209238.6472152984,8.2696662259584186E-7,0,6.6E-4,0.18910988251335822,4.2915057197059382E-3,9.9688292420190172E-2,0.10405124398128622,6.5240307051822988E-2,2.128148832108072E-5,2.128148832108072E-5,8.3725098233801504E-2,2.1029676222779136E-5,2.1029676222779136E-5,9.4918226602395059E-2,6.189505712303066E-3,4.8550931685694227E-3,40,26.437220370476009,0.2977634741442256,0.2228868674547238,0.52550543476751876,0.53230429533297763,0.16322255772738664,8.0990474187252991E-3,1.3301625119368284E-2,1.1231491003425274E-2,7.0826323722536708E-3,3.1615748495047225E-2,3.9774374698190389E-2,3.2037924040564728E-2,0.18818570131682899,1.8156718287937707E-2,0.7784210896359347,0.88251464478176478,2.13,0.70705050469698316,2.2568722038366698E-3,2.7082444951015993E-3,5.7860132187616008E-2,0.17444079008139987,3.728277644352801E-3,2.3510698560493658E-3,1.0494803253425366E-2,1.4245592887455747E-3,3.3091388482664748E-2,6.9807714492629743E-6,7.0643601211845432E-6,6.2467978916816755E-2,0.35083816154157926,0.70705050469698316,70.705050469698321,177.5,72.003632642003467,0.72003632642003468,1209.2386472152984,null,7.3986982217930555E-2,null,0.7784210896359347,0.18818570131682899,0.10405124398128622,null,null,{"$f":"IF(OR(MODE=1,MODE=2,MODE=3), BR77, IF(MODE_ILIM=4,#REF!,#REF!))","v":70.705050469698321},{"$f":"IF(OR(MODE=1,MODE=2,MODE=3), BZ77, IF(MODE_ILIM=4,#REF!,#REF!))","v":0.7784210896359347},{"$f":"IF(OR(MODE=1,MODE=2,MODE=3), CA77, IF(MODE_ILIM=4,#REF!,#REF!))","v":0.18818570131682899},{"$f":"IF(OR(MODE=1,MODE=2,MODE=3), CB77, IF(MODE_ILIM=4,#REF!,#REF!))","v":0.10405124398128622},{"$f":"(IF(OR(MODE=1,MODE=2,MODE=3), S77, IF(MODE_ILIM=4,#REF!,#REF!)))/1000","v":1209.2386472152984},{"$f":"IF(OR(MODE=1,MODE=2,MODE=3), P77, IF(MODE_ILIM=4,#REF!,#REF!))","v":1.3385229238937315}]
[null,null,null,null,null,null,null,72,0.18,0.2263556818181818,0.29305975683324725,6.7110161691175618E-2,1.3384476111720236,1.3384476111720236,1,1.3384476111720236,6.1854418398982466E-7,0.25195186586735197,1209368.9561632895,8.2687751732315805E-7,0,6.6E-4,0.19145834446222537,4.3987557197059371E-3,9.9699034945284148E-2,0.10417110638499634,6.5240307051822988E-2,2.128148832108072E-5,2.128148832108072E-5,8.4728265226861652E-2,2.1536636785060241E-5,2.1536636785060241E-5,9.6102146658065407E-2,6.3448727209020712E-3,4.8556163589956076E-3,40,26.211646453301878,0.3006980469736022,0.22291088600001752,0.52846454933261533,0.53543774979819947,0.16525844131422127,8.3023471373841976E-3,1.3303058517796186E-2,1.16680741460377E-2,7.1844686153788306E-3,3.2155601279212714E-2,4.0520167908479544E-2,3.2037924040564728E-2,0.18820252798097414,1.8158674876791792E-2,0.78231912056444497,0.88653304507454744,2.16,0.70900264925475165,2.2888970388350105E-3,2.7456018055639214E-3,5.722021597600481E-2,0.17346424329353827,3.829951611685927E-3,2.3582441119403743E-3,1.0554817821917266E-2,1.4438562308777781E-3,3.2725407363124313E-2,7.0692280262245593E-6,6.9854775924677251E-6,6.1775968025440831E-2,0.34842125798454721,0.70900264925475165,70.90026492547517,180,72.026192211331946,0.72026192211331941,1209.3689561632896,null,7.3168707741544603E-2,null,0.78231912056444497,0.18820252798097414,0.10417110638499634,null,null,{"$f":"IF(OR(MODE=1,MODE=2,MODE=3), BR78, IF(MODE_ILIM=4,#REF!,#REF!))","v":70.90026492547517},{"$f":"IF(OR(MODE=1,MODE=2,MODE=3), BZ78, IF(MODE_ILIM=4,#REF!,#REF!))","v":0.78231912056444497},{"$f":"IF(OR(MODE=1,MODE=2,MODE=3), CA78, IF(MODE_ILIM=4,#REF!,#REF!))","v":0.18820252798097414},{"$f":"IF(OR(MODE=1,MODE=2,MODE=3), CB78, IF(MODE_ILIM=4,#REF!,#REF!))","v":0.10417110638499634},{"$f":"(IF(OR(MODE=1,MODE=2,MODE=3), S78, IF(MODE_ILIM=4,#REF!,#REF!)))/1000","v":1209.3689561632896},{"$f":"IF(OR(MODE=1,MODE=2,MODE=3), P78, IF(MODE_ILIM=4,#REF!,#REF!))","v":1.3384476111720236}]
[null,null,null,null,null,null,null,73,0.1825,0.22634294507575756,0.29555978927816873,6.9616530145036229E-2,1.3383722984503152,1.3383722984503152,1,1.3383722984503152,6.1845509435821345E-7,0.25197901464950967,1209499.2703176464,8.2678842769154673E-7,0,6.6E-4,0.19381059739915188,4.5075057197059357E-3,9.9709777899585128E-2,0.10429249946534905,6.5240307051822988E-2,2.128148832108072E-5,2.128148832108072E-5,8.5733575108734722E-2,2.2050737702775173E-5,2.2050737702775173E-5,9.7288096641646893E-2,6.5024369649820911E-3,4.856139570325351E-3,40,25.989889359792979,0.30363324659293756,0.2229349055049486,0.53142429166821148,0.53857443209557443,0.16729781559022605,8.5085219667834309E-3,1.3304491973494112E-2,1.2104751163198344E-2,7.2863871459726134E-3,3.2695630282665068E-2,4.1269095408392104E-2,3.2037924040564728E-2,0.18821935531741207,1.8160631543819462E-2,0.786223514365198,0.89055934605657083,2.19,0.71090985564145115,2.3210526479601362E-3,2.7830871483459463E-3,5.6594287996380395E-2,0.17250902578730989,3.9294004118744395E-3,2.365280563511925E-3,1.0613536896966065E-2,1.4632101554790695E-3,3.2367426398463572E-2,7.1580304826791791E-6,6.9083195388925677E-6,6.1099084345949045E-2,0.34605945870226207,0.71090985564145115,71.090985564145114,182.5,72.045963869077937,0.72045963869077934,1209.4992703176465,null,7.2368320315051859E-2,null,0.786223514365198,0.18821935531741207,0.10429249946534905,null,null,{"$f":"IF(OR(MODE=1,MODE=2,MODE=3), BR79, IF(MODE_ILIM=4,#REF!,#REF!))","v":71.090985564145114},{"$f":"IF(OR(MODE=1,MODE=2,MODE=3), BZ79, IF(MODE_ILIM=4,#REF!,#REF!))","v":0.786223514365198},{"$f":"IF(OR(MODE=1,MODE=2,MODE=3), CA79, IF(MODE_ILIM=4,#REF!,#REF!))","v":0.18821935531741207},{"$f":"IF(OR(MODE=1,MODE=2,MODE=3), CB79, IF(MODE_ILIM=4,#REF!,#REF!))","v":0.10429249946534905},{"$f":"(IF(OR(MODE=1,MODE=2,MODE=3), S79, IF(MODE_ILIM=4,#REF!,#REF!)))/1000","v":1209.4992703176465},{"$f":"IF(OR(MODE=1,MODE=2,MODE=3), P79, IF(MODE_ILIM=4,#REF!,#REF!))","v":1.3383722984503152}]
[null,null,null,null,null,null,null,74,0.185,0.22633020833333328,0.29805982172309026,7.2122898598896881E-2,1.3382969857286069,1.3382969857286069,1,1.3382969857286069,6.1836602036355677E-7,0.25200616451639185,1209629.589678681,8.2669935369689016E-7,0,6.6E-4,0.1961665049497904,4.6177557197059375E-3,9.9720521283118854E-2,0.10441542338979819,6.5240307051822988E-2,2.128148832108072E-5,2.128148832108072E-5,8.6740956269014333E-2,2.2571980483389172E-5,2.2571980483389172E-5,9.8476008397846329E-2,6.6621991459912466E-3,4.8566628025599043E-3,40,25.771853028798411,0.30656907303979658,0.22295892596957448,0.53438466181193101,0.5417143471467516,0.16934056335471509,8.7175728247768508E-3,1.3305925486465493E-2,1.2541522060533314E-2,7.3883879848901952E-3,3.3235835531889003E-2,4.2021159706725972E-2,3.2037924040564728E-2,0.18823618332618314,1.8162588289025398E-2,0.79013427846868611,0.89459355532728879,2.2199999999999998,0.71277358042523697,2.3533360628335246E-3,2.8206968321148368E-3,5.5981894419710757E-2,0.17157444537117997,4.0266962085893816E-3,2.3721836745770209E-3,1.0671002473193171E-2,1.4826190440828462E-3,3.2017186034612469E-2,7.2471672731684113E-6,6.8328300123398974E-6,6.0436837096840029E-2,0.34375097721501957,0.71277358042523697,71.277358042523701,185,72.063171902227168,0.72063171902227163,1209.629589678681,null,7.1585239617612151E-2,null,0.79013427846868611,0.18823618332618314,0.10441542338979819,null,null,{"$f":"IF(OR(MODE=1,MODE=2,MODE=3), BR80, IF(MODE_ILIM=4,#REF!,#REF!))","v":71.277358042523701},{"$f":"IF(OR(MODE=1,MODE=2,MODE=3), BZ80, IF(MODE_ILIM=4,#REF!,#REF!))","v":0.79013427846868611},{"$f":"IF(OR(MODE=1,MODE=2,MODE=3), CA80, IF(MODE_ILIM=4,#REF!,#REF!))","v":0.18823618332618314},{"$f":"IF(OR(MODE=1,MODE=2,MODE=3), CB80, IF(MODE_ILIM=4,#REF!,#REF!))","v":0.10441542338979819},{"$f":"(IF(OR(MODE=1,MODE=2,MODE=3), S80, IF(MODE_ILIM=4,#REF!,#REF!)))/1000","v":1209.629589678681},{"$f":"IF(OR(MODE=1,MODE=2,MODE=3), P80, IF(MODE_ILIM=4,#REF!,#REF!))","v":1.3382969857286069}]
[null,null,null,null,null,null,null,75,0.1875,0.22631747159090906,0.30055985416801179,7.4629267052757547E-2,1.3382216730068988,1.3382216730068988,1,1.3382216730068988,6.1827696200173847E-7,0.25203331546806351,1209759.9142467049,8.2661029533507186E-7,0,6.6E-4,0.19852593700626664,4.7295057197059374E-3,9.9731265095911001E-2,0.1045398783280153,6.5240307051822988E-2,2.128148832108072E-5,2.128148832108072E-5,8.7750340235152866E-2,2.3100366634155262E-5,2.3100366634155262E-5,9.9665816902564333E-2,6.8241599654337137E-3,4.85718605570052E-3,40,25.557444595882799,0.30950552635174711,0.22298294739395264,0.53734565980140025,0.54485749988354792,0.17138657279144184,8.929500629291643E-3,1.3307359056713756E-2,1.2978386843669167E-2,7.49047115298842E-3,3.3776217053371346E-2,4.2776363323279422E-2,3.2037924040564728E-2,0.18825301200732752,1.8164545112414276E-2,0.79405142032656906,0.89863568050953957,2.25,0.71459521783602653,2.3857444443785374E-3,2.8584273263560279E-3,5.5382600838391513E-2,0.17065983947512223,4.1219080772053286E-3,2.3789577178952147E-3,1.0727254747969249E-2,1.5020809644577767E-3,3.1674437825011129E-2,7.3366273453450039E-6,6.7589554589677919E-6,5.9788756499406369E-2,0.34149410349899767,0.71459521783602653,71.459521783602653,187.5,72.078010752951272,0.72078010752951271,1209.759914246705,null,7.0818910162978144E-2,null,0.79405142032656906,0.18825301200732752,0.1045398783280153,null,null,{"$f":"IF(OR(MODE=1,MODE=2,MODE=3), BR81, IF(MODE_ILIM=4,#REF!,#REF!))","v":71.459521783602653},{"$f":"IF(OR(MODE=1,MODE=2,MODE=3), BZ81, IF(MODE_ILIM=4,#REF!,#REF!))","v":0.79405142032656906},{"$f":"IF(OR(MODE=1,MODE=2,MODE=3), CA81, IF(MODE_ILIM=4,#REF!,#REF!))","v":0.18825301200732752},{"$f":"IF(OR(MODE=1,MODE=2,MODE=3), CB81, IF(MODE_ILIM=4,#REF!,#REF!))","v":0.1045398783280153},{"$f":"(IF(OR(MODE=1,MODE=2,MODE=3), S81, IF(MODE_ILIM=4,#REF!,#REF!)))/1000","v":1209.759914246705},{"$f":"IF(OR(MODE=1,MODE=2,MODE=3), P81, IF(MODE_ILIM=4,#REF!,#REF!))","v":1.3382216730068988}]
[null,null,null,null,null,null,null,76,0.19,0.22630473484848485,0.30305988661293332,7.7135635506618172E-2,1.3381463602851909,1.3381463602851909,1,1.3381463602851909,6.1818791926864325E-7,0.25206046750458971,1209890.2440220306,8.2652125260197674E-7,0,6.600000000000001E-4,0.20088876938299996,4.842755719705937E-3,9.9742009337987311E-2,0.10466586445189043,6.5240307051822988E-2,2.128148832108072E-5,2.128148832108072E-5,8.8761661510125406E-2,2.3635897662114234E-5,2.3635897662114234E-5,0.10085746009094569,6.9883201248697362E-3,4.8577093297484525E-3,40,25.346574261448431,0.31244260656636014,0.22300696977814069,0.54030728567424924,0.5480038952479751,0.17343573717291288,9.1443062983283616E-3,1.330879268424234E-2,1.3415345518232914E-2,7.5926366711257945E-3,3.4316774873601047E-2,4.3534708788872001E-2,3.2037924040564734E-2,0.18826984136088556,1.8166502013990792E-2,0.79797494741172348,0.90268572924959711,2.2800000000000002,0.71637610306486987,2.4182750759813615E-3,2.8962752528646071E-3,5.4795991238327728E-2,0.16976457358284036,4.2151021682545883E-3,2.3856067852844397E-3,1.0782332216537176E-2,1.5215940660430036E-3,3.1338943842722462E-2,7.4264001138708173E-6,6.6866445924896253E-6,5.91543926661195E-2,0.33928719993968154,0.71637610306486987,71.637610306486991,190,72.090646982404948,0.72090646982404949,1209.8902440220306,null,7.0068799985074398E-2,null,0.79797494741172348,0.18826984136088556,0.10466586445189043,null,null,{"$f":"IF(OR(MODE=1,MODE=2,MODE=3), BR82, IF(MODE_ILIM=4,#REF!,#REF!))","v":71.637610306486991},{"$f":"IF(OR(MODE=1,MODE=2,MODE=3), BZ82, IF(MODE_ILIM=4,#REF!,#REF!))","v":0.79797494741172348},{"$f":"IF(OR(MODE=1,MODE=2,MODE=3), CA82, IF(MODE_ILIM=4,#REF!,#REF!))","v":0.18826984136088556},{"$f":"IF(OR(MODE=1,MODE=2,MODE=3), CB82, IF(MODE_ILIM=4,#REF!,#REF!))","v":0.10466586445189043},{"$f":"(IF(OR(MODE=1,MODE=2,MODE=3), S82, IF(MODE_ILIM=4,#REF!,#REF!)))/1000","v":1209.8902440220306},{"$f":"IF(OR(MODE=1,MODE=2,MODE=3), P82, IF(MODE_ILIM=4,#REF!,#REF!))","v":1.3381463602851909}]
[null,null,null,null,null,null,null,77,0.1925,0.2262919981060606,0.30555991905785485,7.9642003960478838E-2,1.3380710475634825,1.3380710475634825,1,1.3380710475634825,6.1809889216015748E-7,0.25208762062603551,1210020.5790049704,8.2643222549349087E-7,0,6.6E-4,0.20325488349413931,4.9575057197059373E-3,9.975275400937357E-2,0.10479338193553275,6.5240307051822988E-2,2.128148832108072E-5,2.128148832108072E-5,8.9774857419536891E-2,2.4178575074094533E-5,2.4178575074094533E-5,0.10205087869622646,7.1546803259156149E-3,4.8582326247049558E-3,40,25.139155165332483,0.31538031372120956,0.22303099312219613,0.54326953946811063,0.55115353819226609,0.17548795458326705,9.3619907499609151E-3,1.3310226369054677E-2,1.3852398089852017E-2,7.6948845601624979E-3,3.4857509019069192E-2,4.4296198645365631E-2,3.2037924040564728E-2,0.18828667138689759,1.8168458993759632E-2,0.80190486721828891,0.90674370921721681,2.31,0.71811751535596557,2.4509253570823039E-3,2.9342373777714826E-3,5.4221667035617302E-2,0.16888803976251915,4.3063418606087674E-3,2.3921347970973484E-3,1.0836271761156764E-2,1.541156575670223E-3,3.101047612949185E-2,7.516475435955171E-6,6.615848275416227E-6,5.8533314558876212E-2,0.33712869753960284,0.71811751535596557,71.811751535596557,192.5,72.101220909974245,0.7210122090997424,1210.0205790049704,null,6.9334399406183939E-2,null,0.80190486721828891,0.18828667138689759,0.10479338193553275,null,null,{"$f":"IF(OR(MODE=1,MODE=2,MODE=3), BR83, IF(MODE_ILIM=4,#REF!,#REF!))","v":71.811751535596557},{"$f":"IF(OR(MODE=1,MODE=2,MODE=3), BZ83, IF(MODE_ILIM=4,#REF!,#REF!))","v":0.80190486721828891},{"$f":"IF(OR(MODE=1,MODE=2,MODE=3), CA83, IF(MODE_ILIM=4,#REF!,#REF!))","v":0.18828667138689759},{"$f":"IF(OR(MODE=1,MODE=2,MODE=3), CB83, IF(MODE_ILIM=4,#REF!,#REF!))","v":0.10479338193553275},{"$f":"(IF(OR(MODE=1,MODE=2,MODE=3), S83, IF(MODE_ILIM=4,#REF!,#REF!)))/1000","v":1210.0205790049704},{"$f":"IF(OR(MODE=1,MODE=2,MODE=3), P83, IF(MODE_ILIM=4,#REF!,#REF!))","v":1.3380710475634825}]
[null,null,null,null,null,null,null,78,0.19500000000000001,0.22627926136363638,0.30805995150277632,8.2148372414339477E-2,1.3379957348417746,1.3379957348417746,1,1.3379957348417746,6.1800988067216893E-7,0.25211477483246586,1210150.9191958362,8.2634321400550221E-7,0,6.6E-4,0.20562416605111411,5.0737557197059382E-3,9.9763499110095452E-2,0.10492243095527094,6.5240307051822988E-2,2.128148832108072E-5,2.128148832108072E-5,9.0789867967580762E-2,2.4728400376712244E-5,2.4728400376712244E-5,0.10324601609862881,7.3232412702437261E-3,4.8587559405712825E-3,40,24.935103267511664,0.31831864785387237,0.22305501742617653,0.54623242122062021,0.55430643367889998,0.17754312765843336,9.582554902336584E-3,1.33116601111542E-2,1.4289544564154379E-2,7.797214840960371E-3,3.5398419516268945E-2,4.506083544568569E-2,3.2037924040564728E-2,0.18830350208540386,1.8170416051725483E-2,0.80584118726171505,0.91080962810568378,2.34,0.71982068090636486,2.4836927971647071E-3,2.9723106040654992E-3,5.3659246173148628E-2,0.16802965528895689,4.3956879051330984E-3,2.398545511108251E-3,1.0889108734705071E-2,1.5607667935518342E-3,3.0688816179072834E-2,7.6068435884146225E-6,6.5465194076842634E-6,5.7925109012037825E-2,0.33501709236194072,0.71982068090636486,71.982068090636488,195,72.109847935853821,0.72109847935853821,1210.1509191958362,null,6.8615219881748499E-2,null,0.80584118726171505,0.18830350208540386,0.10492243095527094,null,null,{"$f":"IF(OR(MODE=1,MODE=2,MODE=3), BR84, IF(MODE_ILIM=4,#REF!,#REF!))","v":71.982068090636488},{"$f":"IF(OR(MODE=1,MODE=2,MODE=3), BZ84, IF(MODE_ILIM=4,#REF!,#REF!))","v":0.80584118726171505},{"$f":"IF(OR(MODE=1,MODE=2,MODE=3), CA84, IF(MODE_ILIM=4,#REF!,#REF!))","v":0.18830350208540386},{"$f":"IF(OR(MODE=1,MODE=2,MODE=3), CB84, IF(MODE_ILIM=4,#REF!,#REF!))","v":0.10492243095527094},{"$f":"(IF(OR(MODE=1,MODE=2,MODE=3), S84, IF(MODE_ILIM=4,#REF!,#REF!)))/1000","v":1210.1509191958362},{"$f":"IF(OR(MODE=1,MODE=2,MODE=3), P84, IF(MODE_ILIM=4,#REF!,#REF!))","v":1.3379957348417746}]
[null,null,null,null,null,null,null,79,0.19750000000000001,0.22626652462121211,0.3105599839476979,8.4654740868200101E-2,1.3379204221200662,1.3379204221200662,1,1.3379204221200662,6.1792088480056673E-7,0.25214193012394581,1210281.26459494,8.2625421813390011E-7,0,6.6E-4,0.20799650877891232,5.191505719705938E-3,9.9774244640178714E-2,0.10505301168965411,6.5240307051822988E-2,2.128148832108072E-5,2.128148832108072E-5,9.1806635701295311E-2,2.5285375076371054E-5,2.5285375076371054E-5,0.10444281818361023,7.4940036595825153E-3,4.8592792773486842E-3,40,24.734337234569779,0.3212576090019284,0.22307904269013934,0.54919593096941643,0.55746258668062876,0.17960116334237447,9.8059996736760188E-3,1.3313093910544343E-2,1.4726784946768365E-2,7.8996275343829279E-3,3.5939506391695637E-2,4.582862175384235E-2,3.2037924040564728E-2,0.18832033345644478,1.8172373187893026E-2,0.80978391507880898,0.9148834936318605,2.37,0.72148677558717944,2.5165750101147342E-3,3.0104919645758958E-3,5.3108362272809531E-2,0.16718886135051622,4.4831985594977718E-3,2.4048425308530121E-3,1.0940877039130511E-2,1.5804230895160492E-3,3.0373754452358209E-2,7.6974952461448862E-6,6.4786128221403985E-6,5.7329379815608761E-2,0.33295094219304905,0.72148677558717944,72.148677558717949,197.5,72.116619551864289,0.72116619551864292,1210.28126459494,null,6.7910792916279911E-2,null,0.80978391507880898,0.18832033345644478,0.10505301168965411,null,null,{"$f":"IF(OR(MODE=1,MODE=2,MODE=3), BR85, IF(MODE_ILIM=4,#REF!,#REF!))","v":72.148677558717949},{"$f":"IF(OR(MODE=1,MODE=2,MODE=3), BZ85, IF(MODE_ILIM=4,#REF!,#REF!))","v":0.80978391507880898},{"$f":"IF(OR(MODE=1,MODE=2,MODE=3), CA85, IF(MODE_ILIM=4,#REF!,#REF!))","v":0.18832033345644478},{"$f":"IF(OR(MODE=1,MODE=2,MODE=3), CB85, IF(MODE_ILIM=4,#REF!,#REF!))","v":0.10505301168965411},{"$f":"(IF(OR(MODE=1,MODE=2,MODE=3), S85, IF(MODE_ILIM=4,#REF!,#REF!)))/1000","v":1210.28126459494},{"$f":"IF(OR(MODE=1,MODE=2,MODE=3), P85, IF(MODE_ILIM=4,#REF!,#REF!))","v":1.3379204221200662}]
[null,null,null,null,null,null,null,80,0.2,0.22625378787878783,0.31306001639261938,8.7161109322060767E-2,1.3378451093983577,1.3378451093983577,1,1.3378451093983577,6.1783190454124182E-7,0.25216908650054048,1210411.6152025943,8.261652378745751E-7,0,6.6E-4,0.21037180814979975,5.3107557197059384E-3,9.9784990599649098E-2,0.10518512431945223,6.5240307051822988E-2,2.128148832108072E-5,2.128148832108072E-5,9.2825105582599293E-2,2.5849500679262118E-5,2.5849500679262118E-5,0.10564123320882519,7.6669681957165165E-3,4.8598026350384167E-3,40,24.536778331606296,0.3241971972029607,0.22310306891414219,0.5521600687521413,0.56062200218050406,0.18166197265831233,1.0032325982273263E-2,1.3314527767228539E-2,1.5164119243322779E-2,8.0021226612953418E-3,3.6480769671846658E-2,4.6599560144951896E-2,3.2037924040564728E-2,0.18833716550006052,1.8174330402266955E-2,0.81373305822778341,0.91896531353623601,2.4000000000000004,0.72311692749897649,2.5495697089244012E-3,3.0487786153824054E-3,5.256866383935406E-2,0.16636512183486332,4.5689297147748628E-3,2.4110293134607581E-3,1.0991609199126498E-2,1.6001238994714055E-3,3.0065089922055206E-2,7.7884214619044682E-6,6.4120851863938494E-6,5.6745746854279154E-2,0.33092886340834032,0.72311692749897649,72.311692749897645,200,72.121604042494241,0.72121604042494236,1210.4116152025942,null,6.7220669045327863E-2,null,0.81373305822778341,0.18833716550006052,0.10518512431945223,null,null,{"$f":"IF(OR(MODE=1,MODE=2,MODE=3), BR86, IF(MODE_ILIM=4,#REF!,#REF!))","v":72.311692749897645},{"$f":"IF(OR(MODE=1,MODE=2,MODE=3), BZ86, IF(MODE_ILIM=4,#REF!,#REF!))","v":0.81373305822778341},{"$f":"IF(OR(MODE=1,MODE=2,MODE=3), CA86, IF(MODE_ILIM=4,#REF!,#REF!))","v":0.18833716550006052},{"$f":"IF(OR(MODE=1,MODE=2,MODE=3), CB86, IF(MODE_ILIM=4,#REF!,#REF!))","v":0.10518512431945223},{"$f":"(IF(OR(MODE=1,MODE=2,MODE=3), S86, IF(MODE_ILIM=4,#REF!,#REF!)))/1000","v":1210.4116152025942},{"$f":"IF(OR(MODE=1,MODE=2,MODE=3), P86, IF(MODE_ILIM=4,#REF!,#REF!))","v":1.3378451093983577}]
[null,null,null,null,null,null,null,81,0.20250000000000001,0.22624105113636361,0.31556004883754085,8.966747777592142E-2,1.3377697966766497,1.3377697966766497,1,1.3377697966766497,6.1774293989008641E-7,0.25219624396231471,1210541.9710191106,8.2607627322341979E-7,0,6.5999999999999989E-4,0.21274996513329011,5.4315057197059395E-3,9.979573698853228E-2,0.10531876902765679,6.5240307051822988E-2,2.128148832108072E-5,2.128148832108072E-5,9.3845224867622881E-2,2.642077869136411E-5,2.642077869136411E-5,0.10684121167920436,7.8421355804863414E-3,4.8603260136417291E-3,40,24.342350319283842,0.32713741249455497,0.22312709609824247,0.55512483460643913,0.56378468517190261,0.18372547049391288,1.0261534746495734E-2,1.3315961681210218E-2,1.560154745944687E-2,8.1047002425644592E-3,3.7022209383221545E-2,4.7373653205258187E-2,3.2037924040564721E-2,0.18835399821629145,1.8176287694851946E-2,0.81768862428830413,0.92305509558297338,2.4300000000000002,0.72471221937303487,2.582674700714349E-3,3.0871678296228249E-3,5.2039813512292102E-2,0.16555792218795118,4.6529350143989607E-3,2.4171091770131947E-3,1.1041336431361185E-2,1.6198677220845366E-3,2.9762629644825879E-2,7.8796136473178067E-6,6.346894910589189E-6,5.6173845298400499E-2,0.32894952802722266,0.72471221937303487,72.471221937303483,202.5,72.124846875437001,0.72124846875436999,1210.5419710191106,null,6.6544416878855026E-2,null,0.81768862428830413,0.18835399821629145,0.10531876902765679,null,null,{"$f":"IF(OR(MODE=1,MODE=2,MODE=3), BR87, IF(MODE_ILIM=4,#REF!,#REF!))","v":72.471221937303483},{"$f":"IF(OR(MODE=1,MODE=2,MODE=3), BZ87, IF(MODE_ILIM=4,#REF!,#REF!))","v":0.81768862428830413},{"$f":"IF(OR(MODE=1,MODE=2,MODE=3), CA87, IF(MODE_ILIM=4,#REF!,#REF!))","v":0.18835399821629145},{"$f":"IF(OR(MODE=1,MODE=2,MODE=3), CB87, IF(MODE_ILIM=4,#REF!,#REF!))","v":0.10531876902765679},{"$f":"(IF(OR(MODE=1,MODE=2,MODE=3), S87, IF(MODE_ILIM=4,#REF!,#REF!)))/1000","v":1210.5419710191106},{"$f":"IF(OR(MODE=1,MODE=2,MODE=3), P87, IF(MODE_ILIM=4,#REF!,#REF!))","v":1.3377697966766497}]
[null,null,null,null,null,"Eff (%)","Iout (mA)",82,0.20499999999999999,0.22622831439393937,0.31806008128246238,9.217384622978203E-2,1.3376944839549416,1.3376944839549416,1,1.3376944839549416,6.1765399084299397E-7,0.25222340250933378,1210672.3320448021,8.2598732417632715E-7,0,6.5999999999999989E-4,0.21513088496126292,5.5537557197059368E-3,9.9806483806854085E-2,0.10545394599948166,6.5240307051822988E-2,2.128148832108072E-5,2.128148832108072E-5,9.4866942992880066E-2,2.6999210618443069E-5,2.6999210618443069E-5,0.10804270622960106,8.0195065157887078E-3,4.8608494131598809E-3,40,24.15097935573208,0.33007825491430032,0.22315112424249792,0.55809022856995816,0.56695064065855405,0.18579157539948343,1.0493626884784269E-2,1.3317395652492825E-2,1.6039069600770357E-2,8.2073602990587954E-3,3.7563825552321975E-2,4.8150903532154309E-2,3.2037924040564721E-2,0.18837083160517798,1.8178245065652705E-2,0.82165062086153906,0.92715284755996019,2.46,0.7262736908291979,2.615887882053732E-3,3.1256569916704707E-3,5.1521487362455598E-2,0.16476676834114398,4.7352659660235275E-3,2.4230853074644152E-3,1.109008870957277E-2,1.6396531156563411E-3,2.9466188358979063E-2,7.9710635550128121E-6,6.2830020606868964E-6,5.561332484327558E-2,0.32701166094391115,0.7262736908291979,72.627369082919785,205,72.126370778645395,0.72126370778645399,1210.672332044802,null,6.5881622201741402E-2,null,0.82165062086153906,0.18837083160517798,0.10545394599948166,null,null,{"$f":"IF(OR(MODE=1,MODE=2,MODE=3), BR88, IF(MODE_ILIM=4,#REF!,#REF!))","v":72.627369082919785},{"$f":"IF(OR(MODE=1,MODE=2,MODE=3), BZ88, IF(MODE_ILIM=4,#REF!,#REF!))","v":0.82165062086153906},{"$f":"IF(OR(MODE=1,MODE=2,MODE=3), CA88, IF(MODE_ILIM=4,#REF!,#REF!))","v":0.18837083160517798},{"$f":"IF(OR(MODE=1,MODE=2,MODE=3), CB88, IF(MODE_ILIM=4,#REF!,#REF!))","v":0.10545394599948166},{"$f":"(IF(OR(MODE=1,MODE=2,MODE=3), S88, IF(MODE_ILIM=4,#REF!,#REF!)))/1000","v":1210.672332044802},{"$f":"IF(OR(MODE=1,MODE=2,MODE=3), P88, IF(MODE_ILIM=4,#REF!,#REF!))","v":1.3376944839549416}]
[null,null,null,null,null,{"$f":"BT51","v":68.427867006324419},{"$f":"I56*1000","v":125},83,0.20749999999999999,0.22621557765151509,0.32056011372738391,9.4680214683642669E-2,1.3376191712332333,1.3376191712332333,1,1.3376191712332333,6.1756505739585927E-7,0.25225056214166264,1210802.6982799806,8.2589839072919255E-7,0,6.600000000000001E-4,0.2175144769072076,5.6775057197059383E-3,9.9817231054640215E-2,0.10559065542236343,6.5240307051822988E-2,2.128148832108072E-5,2.128148832108072E-5,9.589021146785949E-2,2.7584797966052436E-5,2.7584797966052436E-5,0.10924567151449402,8.1990817035764267E-3,4.8613728335941218E-3,40,23.962593903042571,0.33301972449978867,0.22317515334696603,0.56105625068034881,0.5701198736545654,0.18786020939830411,1.0728603315653099E-2,1.3318829681079787E-2,1.6476685672923402E-2,8.3101028516485292E-3,3.8105618205651719E-2,4.8931313734204167E-2,3.2037924040564734E-2,0.18838766566676035,1.8180202514673907E-2,0.82561905557020376,0.9312585772788543,2.4899999999999998,0.72780234050021919,2.6492072345567839E-3,3.1642435916559154E-3,5.1013374230159593E-2,0.16399118570178137,4.8159720467630847E-3,2.4289607651515445E-3,1.1137894825815696E-2,1.6594786951828768E-3,2.9175588105951129E-2,8.0627632618147184E-6,6.2203682768717387E-6,5.5063848993430108E-2,0.32511403732198674,0.72780234050021919,72.780234050021917,207.5,72.126175499523185,0.72126175499523182,1210.8026982799806,null,6.5231887127476795E-2,null,0.82561905557020376,0.18838766566676035,0.10559065542236343,null,null,{"$f":"IF(OR(MODE=1,MODE=2,MODE=3), BR89, IF(MODE_ILIM=4,#REF!,#REF!))","v":72.780234050021917},{"$f":"IF(OR(MODE=1,MODE=2,MODE=3), BZ89, IF(MODE_ILIM=4,#REF!,#REF!))","v":0.82561905557020376},{"$f":"IF(OR(MODE=1,MODE=2,MODE=3), CA89, IF(MODE_ILIM=4,#REF!,#REF!))","v":0.18838766566676035},{"$f":"IF(OR(MODE=1,MODE=2,MODE=3), CB89, IF(MODE_ILIM=4,#REF!,#REF!))","v":0.10559065542236343},{"$f":"(IF(OR(MODE=1,MODE=2,MODE=3), S89, IF(MODE_ILIM=4,#REF!,#REF!)))/1000","v":1210.8026982799806},{"$f":"IF(OR(MODE=1,MODE=2,MODE=3), P89, IF(MODE_ILIM=4,#REF!,#REF!))","v":1.3376191712332333}]
[null,null,null,null,null,{"$f":"BT81","v":72.078010752951272},{"$f":"I81*1000","v":187.5},84,0.21,0.22620284090909093,0.32306014617230538,9.7186583137503293E-2,1.3375438585115254,1.3375438585115254,1,1.3375438585115254,6.1747613954457926E-7,0.25227772285936617,1210933.0697249577,8.2580947287791264E-7,0,6.6E-4,0.21990065407864556,5.8027557197059369E-3,9.9827978731916373E-2,0.1057288974859623,6.5240307051822988E-2,2.128148832108072E-5,2.128148832108072E-5,9.6914983773636929E-2,2.8177542239532929E-5,2.8177542239532929E-5,0.11045006410427355,8.3808618458584005E-3,4.8618962749457052E-3,40,23.777124638106059,0.33596182128861485,0.22319918341170419,0.56402290097526475,0.57329238918444936,0.18993129780828044,1.0966464957689865E-2,1.3320263766974537E-2,1.69143956815366E-2,8.4129279212055083E-3,3.8647587369716643E-2,4.971488643116425E-2,3.2037924040564728E-2,0.18840450040107881,1.8182160041920241E-2,0.82959393605861265,0.93537229257513554,2.52,0.7292991280317167,2.6826308207375444E-3,3.2029252203095143E-3,5.0515175102116401E-2,0.16323071820284915,4.8951008022730461E-3,2.4347384909241508E-3,1.1184782448120609E-2,1.6793431295883318E-3,2.8890657873950544E-2,8.1547051529239013E-6,6.1589566967386232E-6,5.4525094388792855E-2,0.32325548014151184,0.7292991280317167,72.929912803171675,210,72.124237241864293,0.72124237241864297,1210.9330697249577,null,6.4594829301407572E-2,null,0.82959393605861265,0.18840450040107881,0.1057288974859623,null,null,{"$f":"IF(OR(MODE=1,MODE=2,MODE=3), BR90, IF(MODE_ILIM=4,#REF!,#REF!))","v":72.929912803171675},{"$f":"IF(OR(MODE=1,MODE=2,MODE=3), BZ90, IF(MODE_ILIM=4,#REF!,#REF!))","v":0.82959393605861265},{"$f":"IF(OR(MODE=1,MODE=2,MODE=3), CA90, IF(MODE_ILIM=4,#REF!,#REF!))","v":0.18840450040107881},{"$f":"IF(OR(MODE=1,MODE=2,MODE=3), CB90, IF(MODE_ILIM=4,#REF!,#REF!))","v":0.1057288974859623},{"$f":"(IF(OR(MODE=1,MODE=2,MODE=3), S90, IF(MODE_ILIM=4,#REF!,#REF!)))/1000","v":1210.9330697249577},{"$f":"IF(OR(MODE=1,MODE=2,MODE=3), P90, IF(MODE_ILIM=4,#REF!,#REF!))","v":1.3375438585115254}]
[null,null,null,null,null,{"$f":"BT106","v":71.049894896969974},{"$f":"I106*1000","v":250},85,0.21249999999999999,0.22619010416666666,0.32556017861722697,9.969295159136396E-2,1.337468545789817,1.337468545789817,1,1.337468545789817,6.1738723728505145E-7,0.25230488466250983,1211063.4463800471,8.2572057061838462E-7,0,6.6E-4,0.22228933322185332,5.9295057197059371E-3,9.9838726838708411E-2,0.10586867238216278,6.5240307051822988E-2,2.128148832108072E-5,2.128148832108072E-5,9.7941215267139586E-2,2.8777444944012528E-5,2.8777444944012528E-5,0.11165584238767277,8.5648476446996673E-3,4.8624197372158888E-3,40,23.594504367558603,0.3389045453183771,0.22322321443677029,0.5669901794923633,0.57646819228315138,0.19200476907416261,1.1207212729555643E-2,1.3321697910180522E-2,1.7352199632241022E-2,8.515835528603256E-3,3.9189733071024802E-2,5.0501624254005645E-2,3.2037924040564728E-2,0.18842133580817383,1.818411764739641E-2,0.83357526999272713,0.93949400130815497,2.5499999999999998,0.73076497596615608,2.7161567801047737E-3,3.2416995641030471E-3,5.0026602524481482E-2,0.16248492740775822,4.9726979400841389E-3,2.4404213119182342E-3,1.1230778174810789E-2,1.6992451391184685E-3,2.8611233262266816E-2,8.246881907011254E-6,6.0987318829327789E-6,5.3996750169949488E-2,0.32143485788838544,0.73076497596615608,73.07649759661561,212.5,72.120507778355574,0.72120507778355569,1211.063446380047,null,6.3970081150186098E-2,null,0.83357526999272713,0.18842133580817383,0.10586867238216278,null,null,{"$f":"IF(OR(MODE=1,MODE=2,MODE=3), BR91, IF(MODE_ILIM=4,#REF!,#REF!))","v":73.07649759661561},{"$f":"IF(OR(MODE=1,MODE=2,MODE=3), BZ91, IF(MODE_ILIM=4,#REF!,#REF!))","v":0.83357526999272713},{"$f":"IF(OR(MODE=1,MODE=2,MODE=3), CA91, IF(MODE_ILIM=4,#REF!,#REF!))","v":0.18842133580817383},{"$f":"IF(OR(MODE=1,MODE=2,MODE=3), CB91, IF(MODE_ILIM=4,#REF!,#REF!))","v":0.10586867238216278},{"$f":"(IF(OR(MODE=1,MODE=2,MODE=3), S91, IF(MODE_ILIM=4,#REF!,#REF!)))/1000","v":1211.063446380047},{"$f":"IF(OR(MODE=1,MODE=2,MODE=3), P91, IF(MODE_ILIM=4,#REF!,#REF!))","v":1.337468545789817}]
[null,null,null,null,null,null,null,86,0.215,0.22617736742424241,0.32806021106214844,0.10219932004522461,1.3373932330681089,1.3373932330681089,1,1.3373932330681089,6.1729835061317525E-7,0.25233204755115834,1211193.8282455602,8.2563168394650842E-7,0,6.6E-4,0.22468043453807041,6.0577557197059369E-3,9.9849475375041977E-2,0.10600998030507414,6.5240307051822988E-2,2.128148832108072E-5,2.128148832108072E-5,9.896886309071555E-2,2.9384507584406396E-5,2.9384507584406396E-5,0.11286296647993604,8.7510398022213522E-3,4.8629432204059242E-3,40,23.414667946617396,0.34184789662667614,0.22324724642222166,0.56995808626930367,0.57964728799607368,0.194080554609631,1.1450847549984917E-2,1.3323132110701163E-2,1.7790097530668167E-2,8.6188256947169525E-3,3.9732055336086286E-2,5.1291529844935839E-2,3.2037924040564728E-2,0.18843817188808565,1.8186075331107089E-2,0.83756306506020217,0.94362371136118184,2.58,0.73220077151863117,2.7497833254808749E-3,3.2805644006703846E-3,4.9547380049609506E-2,0.16175339166653746,5.0488074175763283E-3,2.4460119469985869E-3,1.1275907585698963E-2,1.7191834928837549E-3,2.8337156164859031E-2,8.3392864821695479E-6,6.0396597549457524E-6,5.3478517379851452E-2,0.31965108237640344,0.73220077151863117,73.220077151863123,215,72.229662267470047,0.72229662267470052,1211.1938282455601,null,6.3357289174325843E-2,null,0.83756306506020217,0.18843817188808565,0.10600998030507414,null,null,{"$f":"IF(OR(MODE=1,MODE=2,MODE=3), BR92, IF(MODE_ILIM=4,#REF!,#REF!))","v":73.220077151863123},{"$f":"IF(OR(MODE=1,MODE=2,MODE=3), BZ92, IF(MODE_ILIM=4,#REF!,#REF!))","v":0.83756306506020217},{"$f":"IF(OR(MODE=1,MODE=2,MODE=3), CA92, IF(MODE_ILIM=4,#REF!,#REF!))","v":0.18843817188808565},{"$f":"IF(OR(MODE=1,MODE=2,MODE=3), CB92, IF(MODE_ILIM=4,#REF!,#REF!))","v":0.10600998030507414},{"$f":"(IF(OR(MODE=1,MODE=2,MODE=3), S92, IF(MODE_ILIM=4,#REF!,#REF!)))/1000","v":1211.1938282455601},{"$f":"IF(OR(MODE=1,MODE=2,MODE=3), P92, IF(MODE_ILIM=4,#REF!,#REF!))","v":1.3373932330681089}]
[null,null,null,null,null,null,null,87,0.2175,0.22616463068181819,0.33056024350707003,0.10470568849908525,1.3373179203464007,1.3373179203464007,1,1.3373179203464007,6.1720947952485165E-7,0.25235921152537688,1211324.2153218091,8.2554281285818504E-7,0,6.6E-4,0.22707388151043736,6.1875057197059375E-3,9.9860224340942827E-2,0.10615282145103136,6.5240307051822988E-2,2.128148832108072E-5,2.128148832108072E-5,9.9997886086684917E-2,2.9998731665416838E-5,2.9998731665416838E-5,0.11407139813634813,8.9394390206007177E-3,4.863466724517063E-3,40,23.237552201600252,0.34479187525111576,0.22327127936811583,0.57292662134374861,0.58282968137910518,0.19615858864859972,1.1697370337785607E-2,1.3324566368539903E-2,1.8228089382449991E-2,8.7218984404234517E-3,4.0274554191413348E-2,5.2084605857420967E-2,3.2037924040564728E-2,0.18845500864085463,1.8188033093056964E-2,0.84155732897043767,0.94776143064145546,2.61,0.73360736825162098,2.7835087395309344E-3,3.3195175944887058E-3,4.9077241714283813E-2,0.16103570532003081,5.1234715249480669E-3,2.4515130118915578E-3,1.1320195290371662E-2,1.7391570065422701E-3,2.8068274471944647E-2,8.4319121026639906E-6,5.9817075247914316E-6,5.2970108399560865E-2,0.31790310669322075,0.73360736825162098,73.360736825162093,217.5,72.361493645121143,0.72361493645121144,1211.3242153218091,null,6.2756113281002265E-2,null,0.84155732897043767,0.18845500864085463,0.10615282145103136,null,null,{"$f":"IF(OR(MODE=1,MODE=2,MODE=3), BR93, IF(MODE_ILIM=4,#REF!,#REF!))","v":73.360736825162093},{"$f":"IF(OR(MODE=1,MODE=2,MODE=3), BZ93, IF(MODE_ILIM=4,#REF!,#REF!))","v":0.84155732897043767},{"$f":"IF(OR(MODE=1,MODE=2,MODE=3), CA93, IF(MODE_ILIM=4,#REF!,#REF!))","v":0.18845500864085463},{"$f":"IF(OR(MODE=1,MODE=2,MODE=3), CB93, IF(MODE_ILIM=4,#REF!,#REF!))","v":0.10615282145103136},{"$f":"(IF(OR(MODE=1,MODE=2,MODE=3), S93, IF(MODE_ILIM=4,#REF!,#REF!)))/1000","v":1211.3242153218091},{"$f":"IF(OR(MODE=1,MODE=2,MODE=3), P93, IF(MODE_ILIM=4,#REF!,#REF!))","v":1.3373179203464007}]
[null,null,null,null,null,null,null,88,0.22,0.22615189393939392,0.3330602759519915,0.1072120569529459,1.3372426076246924,1.3372426076246924,1,1.3372426076246924,6.171206240159824E-7,0.25238637658523072,1211454.6076091074,8.2545395734931557E-7,0,6.5999999999999989E-4,0.2294696007409612,6.3187557197059369E-3,9.9870973736436816E-2,0.10629719601859575,6.5240307051822988E-2,2.128148832108072E-5,2.128148832108072E-5,0.10102824471656964,3.0620118691533247E-5,3.0620118691533247E-5,0.11528110067077284,9.1300460020711603E-3,4.8639902495505663E-3,40,23.063095855935277,0.34773648122930351,0.22329531327451066,0.57589578475336478,0.58601537749864763,0.19823880810513472,1.1946782011839106E-2,1.3326000683700184E-2,1.866617519321892E-2,8.8250537866012869E-3,4.0817229663520388E-2,5.2880854956208034E-2,3.2037924040564721E-2,0.18847184606652118,1.8189990933250751E-2,0.84555806945462764,0.95190716708023604,2.64,0.73498558765536925,2.8173313714866376E-3,3.3585570928031079E-3,4.8615931547349604E-2,0.16033147794894009,5.1967309635098805E-3,2.4569270240285563E-3,1.1363664973752538E-2,1.7591645401131794E-3,2.780444178840491E-2,8.5247522464294388E-6,5.9248436363069663E-6,5.2471246415793316E-2,0.31618992326206463,0.73498558765536925,73.498558765536927,220,72.477313046906502,0.724773130469065,1211.4546076091074,null,6.2166226154453025E-2,null,0.84555806945462764,0.18847184606652118,0.10629719601859575,null,null,{"$f":"IF(OR(MODE=1,MODE=2,MODE=3), BR94, IF(MODE_ILIM=4,#REF!,#REF!))","v":73.498558765536927},{"$f":"IF(OR(MODE=1,MODE=2,MODE=3), BZ94, IF(MODE_ILIM=4,#REF!,#REF!))","v":0.84555806945462764},{"$f":"IF(OR(MODE=1,MODE=2,MODE=3), CA94, IF(MODE_ILIM=4,#REF!,#REF!))","v":0.18847184606652118},{"$f":"IF(OR(MODE=1,MODE=2,MODE=3), CB94, IF(MODE_ILIM=4,#REF!,#REF!))","v":0.10629719601859575},{"$f":"(IF(OR(MODE=1,MODE=2,MODE=3), S94, IF(MODE_ILIM=4,#REF!,#REF!)))/1000","v":1211.4546076091074},{"$f":"IF(OR(MODE=1,MODE=2,MODE=3), P94, IF(MODE_ILIM=4,#REF!,#REF!))","v":1.3372426076246924}]
[null,null,null,null,null,null,null,89,0.2225,0.22613915719696967,0.33556030839691298,0.10971842540680654,1.3371672949029842,1.3371672949029842,1,1.3371672949029842,6.1703178408247155E-7,0.25241354273078465,1211585.0051077663,8.2536511741580483E-7,0,6.6E-4,0.23186752179685741,6.4515057197059369E-3,9.988172356154959E-2,0.10644310420855549,6.5240307051822988E-2,2.128148832108072E-5,2.128148832108072E-5,0.10205990098471913,3.124867016703202E-5,3.124867016703202E-5,0.11649203887887562,9.3228614489221824E-3,4.8645137955076814E-3,40,22.89123945947853,0.35068171459884878,0.22331934814146348,0.57886557653581994,0.58920438143164067,0.20032115244142648,1.2199083491100214E-2,1.332743505618543E-2,1.9104354968607788E-2,8.9282917541306343E-3,4.1360081778923849E-2,5.3680279817347021E-2,3.2037924040564728E-2,0.18848868416512549,1.8191948851693111E-2,0.84956529426580629,0.95606092863284986,2.67,0.73633622064003279,2.8512496340536721E-3,3.3976809217787503E-3,4.8163203104835926E-2,0.15964033366479374,5.2686249196068503E-3,2.462256407119146E-3,1.1406339439121898E-2,1.7792049959122938E-3,2.7545517167911586E-2,8.6178006332656558E-6,5.8690377078425366E-6,5.1981664918187752E-2,0.31451056201166272,0.73633622064003279,73.633622064003276,222.5,72.230234640211876,0.72230234640211877,1211.5850051077662,null,6.1587312661528441E-2,null,0.84956529426580629,0.18848868416512549,0.10644310420855549,null,null,{"$f":"IF(OR(MODE=1,MODE=2,MODE=3), BR95, IF(MODE_ILIM=4,#REF!,#REF!))","v":73.633622064003276},{"$f":"IF(OR(MODE=1,MODE=2,MODE=3), BZ95, IF(MODE_ILIM=4,#REF!,#REF!))","v":0.84956529426580629},{"$f":"IF(OR(MODE=1,MODE=2,MODE=3), CA95, IF(MODE_ILIM=4,#REF!,#REF!))","v":0.18848868416512549},{"$f":"IF(OR(MODE=1,MODE=2,MODE=3), CB95, IF(MODE_ILIM=4,#REF!,#REF!))","v":0.10644310420855549},{"$f":"(IF(OR(MODE=1,MODE=2,MODE=3), S95, IF(MODE_ILIM=4,#REF!,#REF!)))/1000","v":1211.5850051077662},{"$f":"IF(OR(MODE=1,MODE=2,MODE=3), P95, IF(MODE_ILIM=4,#REF!,#REF!))","v":1.3371672949029842}]
[null,null,null,null,null,null,null,90,0.22500000000000001,0.22612642045454545,0.33806034084183456,0.11222479386066718,1.3370919821812761,1.3370919821812761,1,1.3370919821812761,6.1694295972022434E-7,0.25244070996210377,1211715.4078180981,8.2527629305355783E-7,0,6.6E-4,0.23426757706566256,6.5857557197059376E-3,9.9892473816306893E-2,0.10659054622392655,6.5240307051822988E-2,2.128148832108072E-5,2.128148832108072E-5,0.10309281836606693,3.1884387595976604E-5,3.1884387595976604E-5,0.11770417896572861,9.5178860634994381E-3,4.8650373623896643E-3,40,22.721925320968545,0.35362757539736456,0.22334338396903183,0.58183599672878605,0.59239669826559138,0.20240556354329858,1.2454275694597205E-2,1.332886948599908E-2,1.9542628714249916E-2,9.0316123638933613E-3,4.1903110564142358E-2,5.4482883128213533E-2,3.2037924040564728E-2,0.18850552293670791,1.8193906848388744E-2,0.85357901117890145,0.96022272327874503,2.7,0.73766002894528804,2.8852620004897649E-3,3.4368871828658822E-3,4.7718819030792232E-2,0.15896191044013586,5.3391911344520772E-3,2.4675034954711843E-3,1.1448240648756613E-2,1.7992773166018066E-3,2.7291364861760505E-2,8.7110512136855108E-6,5.8142604781211896E-6,5.1501107224384668E-2,0.31286408864740239,0.73766002894528804,73.76600289452881,225,72.8349974854723,0.72834997485472297,1211.7154078180981,null,6.101906929012392E-2,null,0.85357901117890145,0.18850552293670791,0.10659054622392655,null,null,{"$f":"IF(OR(MODE=1,MODE=2,MODE=3), BR96, IF(MODE_ILIM=4,#REF!,#REF!))","v":73.76600289452881},{"$f":"IF(OR(MODE=1,MODE=2,MODE=3), BZ96, IF(MODE_ILIM=4,#REF!,#REF!))","v":0.85357901117890145},{"$f":"IF(OR(MODE=1,MODE=2,MODE=3), CA96, IF(MODE_ILIM=4,#REF!,#REF!))","v":0.18850552293670791},{"$f":"IF(OR(MODE=1,MODE=2,MODE=3), CB96, IF(MODE_ILIM=4,#REF!,#REF!))","v":0.10659054622392655},{"$f":"(IF(OR(MODE=1,MODE=2,MODE=3), S96, IF(MODE_ILIM=4,#REF!,#REF!)))/1000","v":1211.7154078180981},{"$f":"IF(OR(MODE=1,MODE=2,MODE=3), P96, IF(MODE_ILIM=4,#REF!,#REF!))","v":1.3370919821812761}]
[null,null,null,null,null,null,null,91,0.22750000000000001,0.22611368371212118,0.34056037328675604,0.11473116231452783,1.3370166694595678,1.3370166694595678,1,1.3370166694595678,6.1685415092514663E-7,0.25246787827925349,1211845.8157404168,8.2518748425848002E-7,0,6.6E-4,0.23666970161855563,6.721505719705939E-3,9.9903224500734619E-2,0.10673952226995355,6.5240307051822988E-2,2.128148832108072E-5,2.128148832108072E-5,0.10412696173777036,3.2527272482217279E-5,3.2527272482217279E-5,0.11891748847751624,9.7151205482047427E-3,4.8655609501977734E-3,40,22.555097443456376,0.35657406366246736,0.22336742075727362,0.58480704536993877,0.59559233309860116,0.20449198560276788,1.2712359541431838E-2,1.3330303973144587E-2,1.9980996435779066E-2,9.1350156367730074E-3,4.244631604569666E-2,5.5288667587531239E-2,3.2037924040564728E-2,0.18852236238130904,1.819586492334236E-2,0.85759922799078381,0.96439255902154064,2.73,0.73895774647268131,2.9193670018431571E-3,3.476174049364119E-3,4.7282550642195616E-2,0.15829585947542749,5.4084659701325918E-3,2.4726705380741713E-3,1.148938976234257E-2,1.8193804833469371E-3,2.7041854081471507E-2,8.8044981583744102E-6,5.7604837550661158E-6,5.1029326031134914E-2,0.31124960301724652,0.73895774647268131,73.895774647268127,227.5,73.305168165960453,0.73305168165960455,1211.8458157404168,null,6.0461203618391988E-2,null,0.85759922799078381,0.18852236238130904,0.10673952226995355,null,null,{"$f":"IF(OR(MODE=1,MODE=2,MODE=3), BR97, IF(MODE_ILIM=4,#REF!,#REF!))","v":73.895774647268127},{"$f":"IF(OR(MODE=1,MODE=2,MODE=3), BZ97, IF(MODE_ILIM=4,#REF!,#REF!))","v":0.85759922799078381},{"$f":"IF(OR(MODE=1,MODE=2,MODE=3), CA97, IF(MODE_ILIM=4,#REF!,#REF!))","v":0.18852236238130904},{"$f":"IF(OR(MODE=1,MODE=2,MODE=3), CB97, IF(MODE_ILIM=4,#REF!,#REF!))","v":0.10673952226995355},{"$f":"(IF(OR(MODE=1,MODE=2,MODE=3), S97, IF(MODE_ILIM=4,#REF!,#REF!)))/1000","v":1211.8458157404168},{"$f":"IF(OR(MODE=1,MODE=2,MODE=3), P97, IF(MODE_ILIM=4,#REF!,#REF!))","v":1.3370166694595678}]
[null,null,null,null,null,null,null,92,0.23,0.22610094696969696,0.34306040573167756,0.1172375307683885,1.3369413567378596,1.3369413567378596,1,1.3369413567378596,6.1676535769314705E-7,0.25249504768229863,1211976.2288750333,8.2509869102648043E-7,0,6.6E-4,0.23907383308136454,6.8587557197059383E-3,9.9913975614858389E-2,0.10689003255410995,6.5240307051822988E-2,2.128148832108072E-5,2.128148832108072E-5,0.10516229731450215,3.3177326329391234E-5,3.3177326329391234E-5,0.12013193623708023,9.9145656054960285E-3,4.8660845589332587E-3,40,22.390701462559445,0.35952117943177575,0.22339145850624614,0.58777872249695517,0.5987912910393911,0.206580365007207,1.2973335950779307E-2,1.3331738517625369E-2,2.0419458138829442E-2,9.2385015936547604E-3,4.2989698250109572E-2,5.6097635905394405E-2,3.2037924040564728E-2,0.18853920249896894,1.8197823076558629E-2,0.86162595252031304,0.96857044388907343,2.7600000000000002,0.74023008054561279,2.9535632243410975E-3,3.5155397631733199E-3,4.6854177536402794E-2,0.15764184460033279,5.4764844720302484E-3,2.47775970246081E-3,1.1529807173300795E-2,1.8395135140726845E-3,2.6796858774282253E-2,8.8981358482222301E-6,5.7076803674072823E-6,5.0566082989788902E-2,0.30966623756640133,0.74023008054561279,74.023008054561274,230,73.638455592594738,0.73638455592594743,1211.9762288750333,null,5.9913433812782788E-2,null,0.86162595252031304,0.18853920249896894,0.10689003255410995,null,null,{"$f":"IF(OR(MODE=1,MODE=2,MODE=3), BR98, IF(MODE_ILIM=4,#REF!,#REF!))","v":74.023008054561274},{"$f":"IF(OR(MODE=1,MODE=2,MODE=3), BZ98, IF(MODE_ILIM=4,#REF!,#REF!))","v":0.86162595252031304},{"$f":"IF(OR(MODE=1,MODE=2,MODE=3), CA98, IF(MODE_ILIM=4,#REF!,#REF!))","v":0.18853920249896894},{"$f":"IF(OR(MODE=1,MODE=2,MODE=3), CB98, IF(MODE_ILIM=4,#REF!,#REF!))","v":0.10689003255410995},{"$f":"(IF(OR(MODE=1,MODE=2,MODE=3), S98, IF(MODE_ILIM=4,#REF!,#REF!)))/1000","v":1211.9762288750333},{"$f":"IF(OR(MODE=1,MODE=2,MODE=3), P98, IF(MODE_ILIM=4,#REF!,#REF!))","v":1.3369413567378596}]
[null,null,null,null,null,null,null,93,0.23250000000000001,0.22608821022727274,0.34556043817659909,0.11974389922224912,1.3368660440161517,1.3368660440161517,1,1.3368660440161517,6.1667658002013474E-7,0.25252221817130432,1212106.6472222607,8.2500991335346812E-7,0,6.6E-4,0.24147991151277193,6.9975057197059392E-3,9.9924727158704013E-2,0.10704207728609934,6.5240307051822988E-2,2.128148832108072E-5,2.128148832108072E-5,0.10619879258717663,3.3834550640922482E-5,3.3834550640922482E-5,0.12134749228306192,1.0116221937887401E-2,4.866608188597377E-3,40,22.228684587396103,0.36246892274291176,0.22341549721600709,0.59075102814751623,0.60199357720733127,0.20867065023469264,1.3237205841888307E-2,1.3333173119444871E-2,2.0858013829035706E-2,9.342070255425489E-3,4.3533257203906064E-2,5.6909790803290776E-2,3.2037924040564728E-2,0.18855604328972808,1.819978130804225E-2,0.8656591926083923,0.97275638593345359,2.79,0.74147771310149935,2.9878493069186601E-3,3.5549826317194063E-3,4.6433487219731888E-2,0.1569995417072329,5.5432804278827399E-3,2.4827730783607282E-3,1.1569512543158295E-2,1.8596754618144162E-3,2.6556257410726574E-2,8.9919588648917812E-6,5.6558241188929029E-6,5.0111148304636165E-2,0.30811315587516552,0.74147771310149935,74.147771310149935,232.5,73.832411821820315,0.73832411821820321,1212.1066472222608,null,5.9375488153103707E-2,null,0.8656591926083923,0.18855604328972808,0.10704207728609934,null,null,{"$f":"IF(OR(MODE=1,MODE=2,MODE=3), BR99, IF(MODE_ILIM=4,#REF!,#REF!))","v":74.147771310149935},{"$f":"IF(OR(MODE=1,MODE=2,MODE=3), BZ99, IF(MODE_ILIM=4,#REF!,#REF!))","v":0.8656591926083923},{"$f":"IF(OR(MODE=1,MODE=2,MODE=3), CA99, IF(MODE_ILIM=4,#REF!,#REF!))","v":0.18855604328972808},{"$f":"IF(OR(MODE=1,MODE=2,MODE=3), CB99, IF(MODE_ILIM=4,#REF!,#REF!))","v":0.10704207728609934},{"$f":"(IF(OR(MODE=1,MODE=2,MODE=3), S99, IF(MODE_ILIM=4,#REF!,#REF!)))/1000","v":1212.1066472222608},{"$f":"IF(OR(MODE=1,MODE=2,MODE=3), P99, IF(MODE_ILIM=4,#REF!,#REF!))","v":1.3368660440161517}]
[null,null,null,null,null,null,null,94,0.23499999999999999,0.22607547348484847,0.34806047062152057,0.12225026767610973,1.3367907312944431,1.3367907312944431,1,1.3367907312944431,6.1658781790202022E-7,0.25254938974633584,1212237.0707824121,8.249211512353534E-7,0,6.5999999999999989E-4,0.24388787928926714,7.1377557197059372E-3,9.9935479132297306E-2,0.10719565667785605,6.5240307051822988E-2,2.128148832108072E-5,2.128148832108072E-5,0.10723641626490785,3.4498946920021778E-5,3.4498946920021778E-5,0.12256412781241476,1.0320090247949127E-2,4.8671318391913842E-3,40,22.068995544066123,0.36541729363350062,0.22343953688661419,0.59372396235930625,0.60519919673246803,0.21076279175514928,1.3503970134081025E-2,1.3334607778606533E-2,2.1296663512032969E-2,9.4457216429737444E-3,4.4076992933613252E-2,5.7725135014124372E-2,3.2037924040564721E-2,0.1885728847536268,1.8201739617797918E-2,0.86969895611801706,0.97695039323111421,2.82,0.74270130182033989,3.0222239388797041E-3,3.5945010250441741E-3,4.6020274755858293E-2,0.15636863821496003,5.6088864236938357E-3,2.4877126811592765E-3,1.1608524834085279E-2,1.8798654131564456E-3,2.63199327835449E-2,9.0859619818904188E-6,5.6048897449436205E-6,4.9664300352672178E-2,0.30658955127478094,0.74270130182033989,74.270130182033995,235,73.8844086186851,0.73884408618685105,1212.237070782412,null,5.8847104582915678E-2,null,0.86969895611801706,0.1885728847536268,0.10719565667785605,null,null,{"$f":"IF(OR(MODE=1,MODE=2,MODE=3), BR100, IF(MODE_ILIM=4,#REF!,#REF!))","v":74.270130182033995},{"$f":"IF(OR(MODE=1,MODE=2,MODE=3), BZ100, IF(MODE_ILIM=4,#REF!,#REF!))","v":0.86969895611801706},{"$f":"IF(OR(MODE=1,MODE=2,MODE=3), CA100, IF(MODE_ILIM=4,#REF!,#REF!))","v":0.1885728847536268},{"$f":"IF(OR(MODE=1,MODE=2,MODE=3), CB100, IF(MODE_ILIM=4,#REF!,#REF!))","v":0.10719565667785605},{"$f":"(IF(OR(MODE=1,MODE=2,MODE=3), S100, IF(MODE_ILIM=4,#REF!,#REF!)))/1000","v":1212.237070782412},{"$f":"IF(OR(MODE=1,MODE=2,MODE=3), P100, IF(MODE_ILIM=4,#REF!,#REF!))","v":1.3367907312944431}]
[null,null,null,null,null,null,null,95,0.23749999999999999,0.22606273674242422,0.35056050306644215,0.1247566361299704,1.336715418572735,1.336715418572735,1,1.336715418572735,6.1649907133471615E-7,0.25257656240745807,1212367.4995557987,8.2483240466804964E-7,0,6.600000000000001E-4,0.2462976809964238,7.2795057197059358E-3,9.9946231535663926E-2,0.10735077094354561,6.5240307051822988E-2,2.128148832108072E-5,2.128148832108072E-5,0.10827513822000963,3.5170516669686571E-5,3.5170516669686571E-5,0.12378181512607694,1.0526171238307623E-2,4.8676555107165318E-3,40,21.911584521550012,0.36836629214117,0.22346357751812482,0.5966975251700114,0.60840815475554977,0.2128567419369273,1.3773629746753113E-2,1.3336042495113788E-2,2.1735407193456784E-2,9.5494557771897172E-3,4.4620905465760294E-2,5.8543671282238377E-2,3.2037924040564734E-2,0.18858972689070549,1.820369800583032E-2,0.87374525093432398,0.98115247388286031,2.8499999999999996,0.743901481193604,3.0566858576812749E-3,3.6340933730490258E-3,4.5614342432802463E-2,0.15574883256088748,5.673333896687234E-3,2.492580455173421E-3,1.1646862339711883E-2,1.9000824867531783E-3,2.6087771817227823E-2,9.1801401561137489E-6,5.554852871598714E-6,4.9225325323471257E-2,0.30509464553647275,0.743901481193604,74.390148119360404,237.5,73.791636151568156,0.73791636151568152,1212.3674995557988,null,5.8328030283703446E-2,null,0.87374525093432398,0.18858972689070549,0.10735077094354561,null,null,{"$f":"IF(OR(MODE=1,MODE=2,MODE=3), BR101, IF(MODE_ILIM=4,#REF!,#REF!))","v":74.390148119360404},{"$f":"IF(OR(MODE=1,MODE=2,MODE=3), BZ101, IF(MODE_ILIM=4,#REF!,#REF!))","v":0.87374525093432398},{"$f":"IF(OR(MODE=1,MODE=2,MODE=3), CA101, IF(MODE_ILIM=4,#REF!,#REF!))","v":0.18858972689070549},{"$f":"IF(OR(MODE=1,MODE=2,MODE=3), CB101, IF(MODE_ILIM=4,#REF!,#REF!))","v":0.10735077094354561},{"$f":"(IF(OR(MODE=1,MODE=2,MODE=3), S101, IF(MODE_ILIM=4,#REF!,#REF!)))/1000","v":1212.3674995557988},{"$f":"IF(OR(MODE=1,MODE=2,MODE=3), P101, IF(MODE_ILIM=4,#REF!,#REF!))","v":1.336715418572735}]
[null,null,null,null,null,null,null,96,{"$f":"IF(PLOT_TYPE=1, H102/100*Iout, min_I*EXP(H102*rr/100))","v":0.24},{"$f":"IF(I102<Icrit, (Vin-(Rdcr+RdsonTop)*Iripple/2-Vout)/L*OnTime, (Vin-(Rdcr+RdsonTop)*I102-Vout)/L*OnTime)","v":0.22605},{"$f":"IF(I102<Icrit, (Vin-(Rdcr+RdsonTop)*Iripple/2-Vout)/L*OnTime, I102+((Vin-(Rdcr+RdsonTop)*J102-Vout)/L*OnTime)/2)","v":0.35306053551136363},{"$f":"IF(I102<Icrit, 0, I102-((Vin-(Rdcr+RdsonTop)*K102-Vout)/L*OnTime)/2)","v":0.12726300458383102},1.3366401058510271,{"$f":"IF(I102<Icrit, 1000*SQRT((J102*CoutEsr)^2+(((J102/2)-I102)*(OnTime+OffTime)/Cout)^2), 1000*J102*SQRT(CoutEsr^2+(1/(8*Fsw*Cout))^2))","v":1.3366401058510271},1,{"$f":"IF(I102<Icrit, 1000*((N102/1000)*O102), 1000*J102*SQRT(CoutEsr^2+(1/(8*Fsw*Cout))^2))","v":1.3366401058510271},6.1641034031413611E-7,0.2526037361547363,1212497.9335427342,8.2474367364746949E-7,0,{"$f":"S102*(T102*Iq_active+U102*Iq_sleep)","v":6.6E-4},0.24870926332610963,{"$f":"W102^2*Rdcr","v":7.422755719705936E-3},{"$f":"Core_Loss/1000*S102/$S$106","v":9.9956984368829743E-2},{"$f":"(Y102+X102*(1+Ltc*(Ta-25)))/(1-X102*Ltc*ThetaCa)","v":0.10750742029956599},6.5240307051822988E-2,2.128148832108072E-5,2.128148832108072E-5,0.10931492943585969,3.584926139270095E-5,3.584926139270095E-5,0.1250005275776086,1.0734465611645497E-2,4.8681792031740776E-3,{"$f":"20*VIN_nom/24","v":40},21.756403119907176,{"$f":"IF(I102<Icrit, Vin*(I102+Iripple/2)*AK102/1000000000/2*S102, Vin*(I102-Iripple/2)*AJ102/1000000000/2*S102 + Vin*(I102+Iripple/2)*AK102/1000000000/2*S102)","v":0.37131591830355126},0.22348761911059678,0.5996717166173221,{"$f":"(AI102+AL102+AM102+AH102*(1+RdsonTopTc*(Ta-25)))/(1-AH102*RdsonTopTc*ThetaJA)","v":0.6116204564280574},0.21495245495847876,1.4046185599373758E-2,1.3337477268970077E-2,{"$f":"IF(I102<Icrit, Vin*Idss*R102, QrrBot*(I102-Iripple/2)/1*S102*Vin+Vin*Idss*R102)","v":2.2174244878943174E-2},9.6532726789653051E-3,4.5164994826878559E-2,{"$f":"(AR102+AS102+AT102+AQ102*(1+RdsonBotTc*(Ta-25)))/(1-AQ102*RdsonBotTc*ThetaJA)","v":5.9365402363438319E-2},{"$f":"Vin*V102+Vout*Ifb/0.8","v":3.2037924040564728E-2},{"$f":"(Vin-Vdd)*(S102*QgBot+S102*QgTop)+AW102","v":0.18860656970100448},1.8205656472144154E-2,0.8777980849646444,{"$f":"SUM(Z102,AC102,AF102,AZ102)","v":0.98536263601392415},2.88,0.74507886353709385,3.0912338468344052E-3,3.6737581628831697E-3,4.5215499447373027E-2,0.15513983371964327,5.7366531854847937E-3,2.4973782767559538E-3,1.1684542714329654E-2,1.9203258319277646E-3,2.5859665387542613E-2,9.2744885198325828E-6,5.5056899766141528E-6,4.8794016877935456E-2,0.3036276876292065,0.74507886353709385,74.507886353709381,240,73.551124384272143,0.73551124384272137,1212.4979335427342,null,5.7818021271366093E-2,null,0.8777980849646444,0.18860656970100448,0.10750742029956599,null,null,{"$f":"IF(OR(MODE=1,MODE=2,MODE=3), BR102, IF(MODE_ILIM=4,#REF!,#REF!))","v":74.507886353709381},{"$f":"IF(OR(MODE=1,MODE=2,MODE=3), BZ102, IF(MODE_ILIM=4,#REF!,#REF!))","v":0.8777980849646444},{"$f":"IF(OR(MODE=1,MODE=2,MODE=3), CA102, IF(MODE_ILIM=4,#REF!,#REF!))","v":0.18860656970100448},{"$f":"IF(OR(MODE=1,MODE=2,MODE=3), CB102, IF(MODE_ILIM=4,#REF!,#REF!))","v":0.10750742029956599},{"$f":"(IF(OR(MODE=1,MODE=2,MODE=3), S102, IF(MODE_ILIM=4,#REF!,#REF!)))/1000","v":1212.4979335427342},{"$f":"IF(OR(MODE=1,MODE=2,MODE=3), P102, IF(MODE_ILIM=4,#REF!,#REF!))","v":1.3366401058510271}]
[null,null,null,null,null,null,null,97,{"$f":"IF(PLOT_TYPE=1, H103/100*Iout, min_I*EXP(H103*rr/100))","v":0.24249999999999999},0.22603726325757573,0.3555605679562851,0.1297693730376917,1.3365647931293185,1.3365647931293185,1,1.3365647931293185,6.1632162483619518E-7,0.25263091098823559,1212628.3727435309,{"$f":"IF(1/S103-OnTime-Q103>Tsleep, OnTime+Q103+Tsleep, 1/S103)","v":8.2465495816952856E-7},0,6.5999999999999989E-4,0.25112257497926416,7.5675057197059376E-3,9.9967737631820486E-2,0.10766560496454798,6.5240307051822988E-2,2.128148832108072E-5,2.128148832108072E-5,0.1103557619574614,3.6535182591635654E-5,3.6535182591635654E-5,0.12622023952461012,{"$f":"RdsonTop*AG103^2","v":1.0944974070701517E-2},4.8687029165652767E-3,40,21.60340430065995,0.37426617215827823,0.22351166166408762,0.60264653673893109,0.61483610691222901,0.21704988672481579,{"$f":"RdsonBot*AP103^2","v":1.4321638611485631E-2},1.3338912100178842E-2,2.2613176574128598E-2,9.7571723691940431E-3,4.5709261043501481E-2,6.0190331025015177E-2,3.2037924040564721E-2,0.18862341318456413,1.820761501674412E-2,0.88185746613855243,0.9895808877740131,2.91,0.74623403995117721,3.1258667339135651E-3,3.7134939364675888E-3,4.4823561606006382E-2,0.15454136074683095,5.7988735776774237E-3,2.5021079572383744E-3,1.1721583000575625E-2,1.9405946273435748E-3,2.5635508150437362E-2,9.3690023730962869E-6,5.4573783525820826E-6,4.8370175824775749E-2,0.30218795254199227,0.74623403995117721,74.623403995117727,242.5,73.159788011658193,0.73159788011658189,1212.6283727435309,null,5.7316842013674485E-2,null,0.88185746613855243,0.18862341318456413,0.10766560496454798,null,null,{"$f":"IF(OR(MODE=1,MODE=2,MODE=3), BR103, IF(MODE_ILIM=4,#REF!,#REF!))","v":74.623403995117727},{"$f":"IF(OR(MODE=1,MODE=2,MODE=3), BZ103, IF(MODE_ILIM=4,#REF!,#REF!))","v":0.88185746613855243},{"$f":"IF(OR(MODE=1,MODE=2,MODE=3), CA103, IF(MODE_ILIM=4,#REF!,#REF!))","v":0.18862341318456413},{"$f":"IF(OR(MODE=1,MODE=2,MODE=3), CB103, IF(MODE_ILIM=4,#REF!,#REF!))","v":0.10766560496454798},{"$f":"(IF(OR(MODE=1,MODE=2,MODE=3), S103, IF(MODE_ILIM=4,#REF!,#REF!)))/1000","v":1212.6283727435309},{"$f":"IF(OR(MODE=1,MODE=2,MODE=3), P103, IF(MODE_ILIM=4,#REF!,#REF!))","v":1.3365647931293185}]
[null,null,null,null,null,null,null,98,{"$f":"IF(PLOT_TYPE=1, H104/100*Iout, min_I*EXP(H104*rr/100))","v":0.245},0.22602452651515148,0.35806060040120669,0.1322757414915523,1.3364894804076104,1.3364894804076104,1,1.3364894804076104,6.1623292489680992E-7,0.25265808690802116,1212758.8171585016,{"$f":"IF(1/S104-OnTime-Q104>Tsleep, OnTime+Q104+Tsleep, 1/S104)","v":8.245662582301432E-7},0,6.6E-4,0.2535375665739027,7.7137557197059364E-3,9.9978491324661953E-2,0.10782532515935622,6.5240307051822988E-2,2.128148832108072E-5,2.128148832108072E-5,0.11139760884454671,3.7228281768847895E-5,3.7228281768847895E-5,0.12744092628275228,{"$f":"RdsonTop*AG104^2","v":1.1157697318270654E-2},4.8692266508913841E-3,40,21.452542339256308,0.37721705374298814,0.22353570517865501,0.60562198557253455,0.61805511138109037,0.21914899478846017,{"$f":"RdsonBot*AP104^2","v":1.4599989702704933E-2},1.3340346988743519E-2,2.3052202284649968E-2,9.8611548687711614E-3,4.6253704142164648E-2,6.1018460045768642E-2,3.2037924040564728E-2,0.18864025734142487,1.8209573639634904E-2,0.88592340240791878,0.99380723733736498,2.94,0.747367581231552,3.1605833886693704E-3,3.7532992881465291E-3,4.4438351041018016E-2,0.15395314234625682,5.8600233549453411E-3,2.5067712457221922E-3,1.1757999655690276E-2,1.9608880797441072E-3,2.5415198379759286E-2,9.4636771765273931E-6,5.4098960719502112E-6,4.7953609813659259E-2,0.30077474016685962,0.747367581231552,74.736758123155198,245,72.614496083320674,0.72614496083320679,1212.7588171585016,null,5.6824265067435611E-2,null,0.88592340240791878,0.18864025734142487,0.10782532515935622,null,null,{"$f":"IF(OR(MODE=1,MODE=2,MODE=3), BR104, IF(MODE_ILIM=4,#REF!,#REF!))","v":74.736758123155198},{"$f":"IF(OR(MODE=1,MODE=2,MODE=3), BZ104, IF(MODE_ILIM=4,#REF!,#REF!))","v":0.88592340240791878},{"$f":"IF(OR(MODE=1,MODE=2,MODE=3), CA104, IF(MODE_ILIM=4,#REF!,#REF!))","v":0.18864025734142487},{"$f":"IF(OR(MODE=1,MODE=2,MODE=3), CB104, IF(MODE_ILIM=4,#REF!,#REF!))","v":0.10782532515935622},{"$f":"(IF(OR(MODE=1,MODE=2,MODE=3), S104, IF(MODE_ILIM=4,#REF!,#REF!)))/1000","v":1212.7588171585016},{"$f":"IF(OR(MODE=1,MODE=2,MODE=3), P104, IF(MODE_ILIM=4,#REF!,#REF!))","v":1.3364894804076104}]
[null,null,null,null,null,null,null,99,{"$f":"IF(PLOT_TYPE=1, H105/100*Iout, min_I*EXP(H105*rr/100))","v":0.2475},0.22601178977272726,0.36056063284612816,0.13478210994541295,1.3364141676859023,1.3364141676859023,1,1.3364141676859023,6.1614424049189838E-7,0.25268526391415791,1212889.2667879581,{"$f":"IF(1/S105-OnTime-Q105>Tsleep, OnTime+Q105+Tsleep, 1/S105)","v":8.2447757382523177E-7},0,6.6E-4,0.25595419055802965,7.8615057197059385E-3,9.9989245447379846E-2,0.10798658110708977,6.5240307051822988E-2,2.128148832108072E-5,2.128148832108072E-5,0.11244044412707464,3.7928560426481386E-5,3.7928560426481386E-5,0.12866256408225862,{"$f":"RdsonTop*AG105^2","v":1.1372636057204039E-2},4.8697504061536515E-3,40,21.303772779510751,0.38016856309532066,0.22355974965435643,0.60859806315583076,0.62127747501847996,0.22124973827461009,{"$f":"RdsonBot*AP105^2","v":1.4881239792721374E-2},1.334178193466754E-2,2.349132201614464E-2,9.9652201985935378E-3,4.6798324149405712E-2,6.1849792216030527E-2,3.2037924040564728E-2,0.18865710217162696,1.8211532340821193E-2,0.88999590174695853,0.99804169290279587,2.9699999999999998,0.748480038733493,3.1953827212368984E-3,3.7931728624590157E-3,4.4059695941346615E-2,0.15337491645926096,5.9201298358737033E-3,2.5113698317276363E-3,1.1793808576434261E-2,1.9812054227572656E-3,2.5198637813261825E-2,9.558508544484317E-6,5.3632219538279053E-6,4.7544133044029602E-2,0.29938737423888612,0.748480038733493,74.848003873349299,247.5,71.912167665597565,0.71912167665597559,1212.8892667879581,null,5.6340070734189472E-2,null,0.88999590174695853,0.18865710217162696,0.10798658110708977,null,null,{"$f":"IF(OR(MODE=1,MODE=2,MODE=3), BR105, IF(MODE_ILIM=4,#REF!,#REF!))","v":74.848003873349299},{"$f":"IF(OR(MODE=1,MODE=2,MODE=3), BZ105, IF(MODE_ILIM=4,#REF!,#REF!))","v":0.88999590174695853},{"$f":"IF(OR(MODE=1,MODE=2,MODE=3), CA105, IF(MODE_ILIM=4,#REF!,#REF!))","v":0.18865710217162696},{"$f":"IF(OR(MODE=1,MODE=2,MODE=3), CB105, IF(MODE_ILIM=4,#REF!,#REF!))","v":0.10798658110708977},{"$f":"(IF(OR(MODE=1,MODE=2,MODE=3), S105, IF(MODE_ILIM=4,#REF!,#REF!)))/1000","v":1212.8892667879581},{"$f":"IF(OR(MODE=1,MODE=2,MODE=3), P105, IF(MODE_ILIM=4,#REF!,#REF!))","v":1.3364141676859023}]
[null,null,null,null,null,null,null,100,{"$f":"IF(PLOT_TYPE=1, H106/100*Iout, min_I*EXP(H106*rr/100))","v":0.25},0.22599905303030304,0.36306066529104969,0.13728847839927361,1.3363388549641941,1.3363388549641941,1,1.3363388549641941,6.1605557161737987E-7,0.25271244200671128,1213019.721632214,{"$f":"IF(1/S106-OnTime-Q106>Tsleep, OnTime+Q106+Tsleep, 1/S106)","v":8.2438890495071325E-7},0,6.6E-4,0.25837240112716403,8.0107557197059368E-3,0.1,0.10814937303308314,6.5240307051822988E-2,2.128148832108072E-5,2.128148832108072E-5,0.11348424276298787,3.8636020066466291E-5,3.8636020066466291E-5,0.12988513002669314,{"$f":"RdsonTop*AG106^2","v":1.1589790990409026E-2},4.8702741823533399E-3,40,21.157052389927671,0.38312070025291922,0.22358379509124968,0.61157476952652223,0.62450320301908036,0.22335207781027058,{"$f":"RdsonBot*AP106^2","v":1.516538980129821E-2},1.3343216937954356E-2,2.3930535774250434E-2,1.0069368379559743E-2,4.7343121091764528E-2,6.2684330337688346E-2,3.2037924040564728E-2,0.1886739476752109,1.8213491120307696E-2,0.89407497215228726,1.002284262693758,3,0.74957194519232739,3.2302636804354759E-3,3.8331133520232113E-3,4.3687430296935115E-2,0.15280642987484819,5.9792194165998258E-3,2.5159053477082369E-3,1.1829025122743281E-2,2.0015459157601808E-3,2.4985731506410914E-2,9.6534922385703107E-6,5.317335532473425E-6,4.714156598867441E-2,{"$f":"SUM(BD106:BO106)","v":0.29802520132990989},0.74957194519232739,74.957194519232743,250,71.049894896969974,0.71049894896969978,1213.019721632214,null,5.5864046733343588E-2,null,0.89407497215228726,0.1886739476752109,0.10814937303308314,null,null,{"$f":"IF(OR(MODE=1,MODE=2,MODE=3), BR106, IF(MODE_ILIM=4,#REF!,#REF!))","v":74.957194519232743},{"$f":"IF(OR(MODE=1,MODE=2,MODE=3), BZ106, IF(MODE_ILIM=4,#REF!,#REF!))","v":0.89407497215228726},{"$f":"IF(OR(MODE=1,MODE=2,MODE=3), CA106, IF(MODE_ILIM=4,#REF!,#REF!))","v":0.1886739476752109},{"$f":"IF(OR(MODE=1,MODE=2,MODE=3), CB106, IF(MODE_ILIM=4,#REF!,#REF!))","v":0.10814937303308314},{"$f":"(IF(OR(MODE=1,MODE=2,MODE=3), S106, IF(MODE_ILIM=4,#REF!,#REF!)))/1000","v":1213.019721632214},{"$f":"IF(OR(MODE=1,MODE=2,MODE=3), P106, IF(MODE_ILIM=4,#REF!,#REF!))","v":1.3363388549641941}]
[null,null,null,null,null,null,null,null,{"$f":"Losses!$E$5/1000","v":0.5},0.22472537878787877,0.61306390978320136,0.38792532378533789,1.328807582793375,1.328807582793375,1,1.328807582793375,{"$f":"IF(I107<Icrit, L*J107/(Vout+J107/2*(RdsonBot+Rdcr)), L*J107/(Vout+I107*(RdsonBot+Rdcr)))","v":6.0726641827710443E-7},{"$f":"OnTime*S107","v":0.25543574887310838},{"$f":"IF(I107<Icrit,I107/((OnTime+Q107)*J107/2),1/(OnTime+Q107))","v":1226091.5945909203},{"$f":"IF(1/S107-OnTime-Q107>Tsleep, OnTime+Q107+Tsleep, 1/S107)","v":8.1559975161043771E-7},{"$f":"IF(1/S107-OnTime-Q107>Tsleep, 1/S107-OnTime-Q107-Tsleep, 0)","v":0},6.6E-4,{"$f":"IF(I107<Icrit,Iripple*SQRT((OnTime+OffTime)*S107/3), SQRT(I107^2+Iripple^2/12))","v":0.50423833418753095},3.0510755719705938E-2,0.10107763070340826,0.13223391549407421,{"$f":"Iripple/SQRT(12)*SQRT((OnTime+Q107)*S107)","v":6.5240307051822988E-2},{"$f":"RCoutEsr*AA107^2","v":2.128148832108072E-5},{"$f":"AB107","v":2.128148832108072E-5},{"$f":"SQRT($R107)*SQRT($I107^2*(1-R107)+(Iripple^2)/12)","v":0.22053183976236082},{"$f":"RCinEsr*AD107^2","v":1.4590287704691478E-4},{"$f":"AE107","v":1.4590287704691478E-4},{"$f":"IF(I107<Icrit,Iripple*SQRT((OnTime)*S107/3), SQRT(OnTime*S107*(I107^2+Iripple^2/12)))","v":0.25484534094144828},{"$f":"RdsonTop*AG107^2","v":4.4618003538299797E-2},{"$f":"QgTop*S107*Vdd","v":4.9227577522825442E-3},40,{"$f":"IF(I107<Icrit, Csw*Vin/Iripple*1000000000, Csw*Vin/(I107+Iripple/2)*1000000000)","v":12.528557801113037},0.68151130925177827,{"$f":"IF(I107<Icrit, Csw*(Vin)^2*S107/2, Csw*Vin^2*S107/2)","v":0.22599320271499843},0.9124272697190593,0.96500862065890058,{"$f":"IF(I107<Icrit,Iripple*SQRT((OffTime)*S107/3), SQRT(OffTime*S107*(I107^2+Iripple^2/12)))","v":0.43823520373611224},{"$f":"RdsonBot*AP107^2","v":5.8383228513264065E-2},{"$f":"QgBot*S107*Vdd","v":1.3487007540500126E-2},6.8327715980516984E-2,{"$f":"IF(I107<Icrit, dead1*S107*(I107+Iripple/2)*((I107+Iripple/2)*BDserR+VSD), dead1*S107*(I107+Iripple/2)*((I107+Iripple/2)*BDserR+VSD)+dead2*S107*(I107-Iripple/2)*((I107-Iripple/2)*BDserR+VSD))","v":2.0906180437527712E-2},0.10272090395854483,0.16286272056396828,3.2037924040564728E-2,0.19036190555849569,{"$f":"AI107+AR107","v":1.8409765292782671E-2},{"$f":"AO107+AV107+AX107+AY107","v":1.3366430120741473},1.4690441119335895,{"$f":"Vout*I107","v":6},{"$f":"BB107/(BB107+BA107)","v":0.80331564656494137},7.0399036545827822E-3,8.0521437153293109E-3,{"$f":"Vin*S107*(QgBot+QgTop)/($BB107+$BA107)","v":2.3662164014848847E-2},0.12216118368630838,{"$f":"AS107/(BA107+BB107)","v":9.1481205568657801E-3},{"$f":"AT107/($BB107+$BA107)","v":2.7990436425626504E-3},1.3752884896532281E-2,{"$f":"X107/($BB107+$BA107)","v":4.08496124302676E-3},{"$f":"Y107/($BB107+$BA107)","v":1.3532873710293464E-2},{"$f":"(AF107)/($BB107+$BA107)","v":1.9534344001771248E-5},{"$f":"(AC107)/($BB107+$BA107)","v":2.8492920917522014E-6},2.5486782874176214E-2,{"$f":"SUM(BD107:BO107)","v":0.22974244563061999},{"$f":"BC107","v":0.80331564656494137},{"$f":"100*BQ107","v":80.331564656494137},{"$f":"I107*1000","v":500},72.049894896970002,{"$f":"BT107/100","v":0.72049894896970001},{"$f":"S107/1000","v":1226.0915945909203},null,{"$f":"AM107/($BB107+$BA107)","v":3.0257312626380137E-2},null,1.3366430120741473,0.19036190555849569,0.13223391549407421,null,null,{"$f":"IF(OR(MODE=1,MODE=2,MODE=3), BR107, IF(MODE_ILIM=4,#REF!,#REF!))","v":80.331564656494137},{"$f":"IF(OR(MODE=1,MODE=2,MODE=3), BZ107, IF(MODE_ILIM=4,#REF!,#REF!))","v":1.3366430120741473},{"$f":"IF(OR(MODE=1,MODE=2,MODE=3), CA107, IF(MODE_ILIM=4,#REF!,#REF!))","v":0.19036190555849569},{"$f":"IF(OR(MODE=1,MODE=2,MODE=3), CB107, IF(MODE_ILIM=4,#REF!,#REF!))","v":0.13223391549407421},{"$f":"(IF(OR(MODE=1,MODE=2,MODE=3), S107, IF(MODE_ILIM=4,#REF!,#REF!)))/1000","v":1226.0915945909203},{"$f":"IF(OR(MODE=1,MODE=2,MODE=3), P107, IF(MODE_ILIM=4,#REF!,#REF!))","v":1.328807582793375}]
[null,null,null,null,null,null,null,null,null,null,null,null,null,null,null,null,null,null,null,null,null,null,null,null,null,null,null,null,null,null,null,null,null,null,null,null,null,null,null,null,null,null,null,null,null,null,null,null,null,null,null,null,null,null,null,{"$f":"IF(OR(MODE=1, MODE=2,MODE=3),Efficiency!BD107,IF(AND(MODE=4,MODE_ILIM=4),#REF!,#REF!))","v":7.0399036545827822E-3},{"$f":"IF(OR(MODE=1, MODE=2,MODE=3),Efficiency!BE107,IF(AND(MODE=4,MODE_ILIM=4),#REF!,#REF!))","v":8.0521437153293109E-3},null,{"$f":"IF(OR(MODE=1, MODE=2,MODE=3),Efficiency!BG107,IF(AND(MODE=4,MODE_ILIM=4),#REF!,#REF!))","v":0.12216118368630838},null,null,{"$f":"IF(OR(MODE=1, MODE=2,MODE=3),Efficiency!BJ107,IF(AND(MODE=4,MODE_ILIM=4),#REF!,#REF!))","v":1.3752884896532281E-2},{"$f":"IF(OR(MODE=1, MODE=2,MODE=3),Efficiency!BK107,IF(AND(MODE=4,MODE_ILIM=4),#REF!,#REF!))","v":4.08496124302676E-3},{"$f":"IF(OR(MODE=1, MODE=2,MODE=3),Efficiency!BL107,IF(AND(MODE=4,MODE_ILIM=4),#REF!,#REF!))","v":1.3532873710293464E-2},null,null,{"$f":"IF(OR(MODE=1, MODE=2,MODE=3),Efficiency!BO107,IF(AND(MODE=4,MODE_ILIM=4),#REF!,#REF!))","v":2.5486782874176214E-2}]
[null,null,null,null,null,null,null,1.0000000000000001E-5,"A","min_I",null,null,null,null,null,null,null,null,null,null,null,null,null,null,null,null,null,null,null,null,null,null,null,null,null,null,null,null,null,null,null,null,null,null,null,null,null,null,null,null,null,null,null,null,"Load (A)","High-side MOSFET Rdson %","Low-side MOSFET Rdson %","Gate Drive (Qg) Loss from Vin %","High-side MOSFET Switching Loss %","Reverse Recovery & Leakage Loss %","Deadtime Loss %",null,"Inductor Cu Loss %","Inductor Core Loss %","Cin ESR %","Cout ESR %","Quiescent Current Loss %","Total Loss %","Overall Eff %"]
[null,null,null,null,null,null,null,{"$f":"Iout","v":0.25},"A","max_I",null,null,null,null,null,null,null,null,null,null,null,null,null,null,null,null,null,null,null,null,null,null,null,null,null,null,null,null,null,null,null,null,null,null,null,null,null,null,null,null,null,null,null,null,{"$f":"I107","v":0.5},{"$f":"BD107","v":7.0399036545827822E-3},{"$f":"BE107","v":8.0521437153293109E-3},2.3662164014848847E-2,0.12216118368630838,9.1481205568657801E-3,2.7990436425626504E-3,null,4.08496124302676E-3,1.3532873710293464E-2,1.9534344001771248E-5,2.8492920917522014E-6,2.5486782874176214E-2,0.22974244563061999,0.80331564656494137]
[null,null,null,null,null,null,null,{"$f":"LOG(max_I/min_I,EXP(1))","v":10.126631103850338},null,"rr",null,null,null,null,null,null,null,null,null,null,null,null,null,null,null,null,null,null,null,null,null,null,null,null,null,null,null,null,null,null,null,null,null,null,null,null,null,null,null,null,null,null,null,null,"10mA",{"$f":"BD70","v":2.0366401510088423E-3},{"$f":"BE70","v":2.4506765735932893E-3},6.2773960302715537E-2,0.18193903179518603,2.9474583983483643E-3,2.2965711109184019E-3,null,1.2912662793609499E-3,3.5901706899610947E-2,6.3723472220437276E-6,7.6700926307867007E-6,6.7781841616289099E-2,0.36946766771219469,0.69199003513879331]
[null,null,null,null,null,null,null,null,null,null,null,null,null,null,null,null,null,null,null,null,null,null,null,null,null,null,null,null,null,null,null,null,null,null,null,null,null,null,null,null,null,null,null,null,null,null,null,null,null,null,null,null,null,null,"50ma",{"$f":"BD85","v":2.5165750101147342E-3},{"$f":"BE85","v":3.0104919645758958E-3},5.3108362272809531E-2,0.16718886135051622,4.4831985594977718E-3,2.4048425308530121E-3,null,1.5804230895160492E-3,3.0373754452358209E-2,7.6974952461448862E-6,6.4786128221403985E-6,5.7329379815608761E-2,0.33295094219304905,0.72148677558717944]
[null,null,null,null,null,null,null,null,null,null,null,null,null,null,null,null,null,null,null,null,null,null,null,null,null,null,null,null,null,null,null,null,null,null,null,null,null,null,null,null,null,null,null,null,null,null,null,null,null,null,null,null,null,null,"100mA",{"$f":"BD91","v":2.7161567801047737E-3},{"$f":"BE91","v":3.2416995641030471E-3},5.0026602524481482E-2,0.16248492740775822,4.9726979400841389E-3,2.4404213119182342E-3,null,1.6992451391184685E-3,2.8611233262266816E-2,8.246881907011254E-6,6.0987318829327789E-6,5.3996750169949488E-2,0.32143485788838544,0.73076497596615608]
[null,null,null,null,null,null,null,null,null,null,null,null,null,null,null,null,null,null,null,null,null,null,null,null,null,null,null,null,null,null,null,null,null,null,null,null,null,null,null,null,null,null,null,null,null,null,null,null,null,null,null,null,null,null,"500mA",{"$f":"BD106","v":3.2302636804354759E-3},{"$f":"BE106","v":3.8331133520232113E-3},4.3687430296935115E-2,0.15280642987484819,5.9792194165998258E-3,2.5159053477082369E-3,null,2.0015459157601808E-3,2.4985731506410914E-2,9.6534922385703107E-6,5.317335532473425E-6,4.714156598867441E-2,0.29802520132990989,0.74957194519232739]

{"sheet":"Schematic Mgmt","index":10,"n_rows":2,"n_cols":1,"rows_kept":2,"cut":false,"hidden":true,"merged":[]}
[]
[{"$f":"'Variable Mgmt'!K27","v":"SCH_COT3_LM5164"}]

{"sheet":"Efficiency Plots","index":11,"n_rows":2,"n_cols":1,"rows_kept":2,"cut":false,"hidden":true,"merged":[]}
[]
[{"$f":"IF(PLOT_TYPE=1, \"EFF_LINEAR\", \"EFF_LOG\")","v":"EFF_LINEAR"}]