{"text_format":"1","workbook":"xlsx","n_sheets":15,"sheets":["Design Regulator","Input Filters","Design Input Filter","BOM & Schematic","EVM","Variable Management","Schematic Management","Stability Calculations","Bode Plot Management","Efficiency Calculations","Efficiency Plot Management","Input Filter Calculations","Standard Value Calculator","Snubber","Parallel Output Caps"],"not_rendered":{"charts":9,"images":31,"macros":1,"external_links":0,"defined_names":301,"comments":3,"pivot_tables":0},"unopened":[],"bounds":{"document_bytes":16777216,"sheet_cells":100000,"rows_first":2000,"rows_last":500,"rows_between":2000,"halvings":0,"cell_chars":16384,"cell_head_chars":4096},"cells_cut":0,"cells_raw":0,"read":"whole","date_system":"1900"}

{"sheet":"Design Regulator","index":0,"n_rows":102,"n_cols":16,"rows_kept":102,"cut":false,"hidden":false,"merged":[[67,5,67,7],[2,13,2,14],[0,0,0,15],[78,5,78,6],[33,10,34,15]]}
["                      LM(2)5148/-Q1 Synchronous Buck Controller Design Tool"]
[null,null,null,null,null,null,null,null,null,null,null,null,null,"http://www.ti.com/product/lm5175"]
["About",null,"xx",null,null,"= Input Box",null,null,null,null,null,null,null,"TERMS OF USE",null,"                "]
[]
["Step 1: Operating Specifications"]
[null,null,null,"Input Voltage – Min, VIN(min) ",9,"V"]
[null,null,null,"Input Voltage – Nom, VIN(nom)",16.8,"V"]
[null,null,null,"Input Voltage – Max, VIN(max)",36,"V"]
[null,null,null,"Output Voltage, VOUT ",7.4,"V"]
[null,null,null,"Full Load Output Current, IOUT ",12,"A"]
[null,null,null,"Switching Frequency, FSW",100,"kHz"]
[null,null,null,"Frequency Set Resistor, RT ",{"$f":"'Variable Management'!C442","v":221},"kΩ"]
[null,null,null,"Ambient Temperature, TA",25,"°C"]
[]
["Step 2: Current Sense Resistor"]
[null,null,null,"Required IOCP Setpoint at VIN(nom)",15,"A"]
[null,null,null,"Recommended Sense Resistance",{"$f":"Rs_ideal*1000","v":2.7991092450658877},"mΩ"]
[null,null,null,"Sense Resistance, RS",3.5,"mΩ"]
[null,null,null,"Min Inductor Sat Current, ILO(SAT)",{"$f":"'Variable Management'!B95","v":17.142857142857142},"A"]
[null,null,null,"Max power loss in shunt",{"$f":"'Variable Management'!B105","v":0.80316091100421949},"W"]
[null,null,null,"VIN(min)",{"$f":"'Variable Management'!B97","v":15.102546940635857},"A"]
[null,null,"IOUT(typ) at OCP Inception:","VIN(nom)",{"$f":"'Variable Management'!B98","v":10.707466542878013},"A"]
[null,null,null,"VIN(max)",{"$f":"'Variable Management'!B99","v":7.9933463868872536},"A"]
[]
["Step 3: Buck Inductance"]
[null,null,null,"Recommended Inductance",{"$f":"Lopt*1000000","v":10.791666666666668},"µH"]
[null,null,null,"Inductance, LO ",3.3,"µH"]
[null,null,null,"Inductor DCR ",14,"mΩ"]
[null,null,null,"DIL as a % at VIN(nom)",{"$f":"'Variable Management'!B68*100","v":107.25650999965215},"%"]
[]
["Step 4: Output Capacitors"]
[null,null,null,"Output Voltage Ripple Spec",100,"mVpk-pk"]
[null,null,null,"Minimum Output Capacitance",{"$f":"'Variable Management'!B121","v":160.88476499947819},"µF"]
[null,null,null,"Output Capacitance (derated), COUT ",150,"µF",null,null,null,null,{"$f":"CHOOSE(SCH_MODE, \"\", \"** For Single-Output Operation in 2-Phase Mode, tie MODE to VDDA and use FB1 to set VOUT **\", \"** For Single-Output Operation in 3-Phase Mode, tie both MODE pins to VDDA. Use FB1 of master IC to set VOUT. Connect FB2 of master IC to AGND. Connect FB2 of slave IC to VDDA to configure it as a slave **\", \"** For Single-Output Operation in 4-Phase Mode, tie both MODE pins to VDDA. Use FB1 of master IC to set VOUT. Connect FB2 of master IC to AGND. Connect FB2 of slave IC to VDDA to configure it as a slave **\")","v":""}]
[null,null,null,"Maximum Permitted ESR",{"$f":"'Variable Management'!B125","v":{"$error":"#NUM!"}},"mΩ"]
[null,null,null,"Output Capacitor ESR",20,"mΩ",null,null,null,null,{"$f":"CHOOSE(SCH_MODE,  \"\", \"** Tie VCCX to GND if not used **\", \"** Slave controller (CNTRL2) not shown **\",\"** Slave controller (CNTRL2) not shown **\")","v":""},null,null,null,null,{"$f":"IF(SCH_MODE=1,  \"** Tie VCCX to GND if not used **\", \"\")","v":"** Tie VCCX to GND if not used **"}]
[null,null,null,"Resulting Output Voltage Ripple (max) ",{"$f":"'Variable Management'!B127*1000","v":278.8669259990956},"mVpk-pk",null,null,null,null,{"$f":"IF(OR(SCH_MODE=3, SCH_MODE=4),\"** Tie VCCX to GND if not used **\", \"\")","v":""}]
[null,null,null,"Output Capacitor RMS Current (max) ",{"$f":"'Variable Management'!B114","v":5.2824724979125923},"A (rms)"]
[]
["Step 5: Input Capacitors"]
[null,null,null,"Input Voltage Ripple Spec",300,"mVpk-pk"]
[null,null,null,"Minimum Input Capacitance",{"$f":"'Variable Management'!B148","v":100},"µF"]
[null,null,null,"Input Capacitance (derated), CIN ",160,"µF"]
[null,null,null,"Maximum Permitted ESR",{"$f":"'Variable Management'!B154","v":5.3192719821305801},"mΩ",null,null,null,null,null,null,null,null,null," "]
[null,null,null,"Input Capacitor ESR",0.05,"mΩ"]
[null,null,null,"Resulting Input Voltage Ripple (max)",{"$f":"'Variable Management'!B161*1000","v":188.5574755377985},"mVpk-pk"]
[null,null,null,"Input Capacitor RMS Current (max)",{"$f":"'Variable Management'!B138","v":6},"A (rms)"]
[null,null,null,"AEF Filter Inductor",0.68,"µH"]
["Step 6: Enable, CNFG, FPWM/PFM"]
[]
[]
[null,null,null,"Input Voltage UVLO Turn-ON",5.5,"V"]
[null,null,null,"Input Voltage UVLO Turn-OFF",4.5,"V"]
[null,null,null,"Upper Enable Resistor, RUV1",{"$f":"IF(UVLO_TYPE=1,'Variable Management'!B187,0)","v":0},"kΩ"]
[null,null,null,"Lower Enable Resistor, RUV2",{"$f":"IF(UVLO_TYPE=1,'Variable Management'!B188,\"DNP\")","v":"DNP"},"kΩ"]
[null,null,null,"Configuration Resistor, RCNFG",{"$f":"IF(DITHER=1,\"41.2\",\"29.4\")","v":"41.2"},"kΩ"]
[null,null,null,{"$f":"IF(DEMB=1, \"* Tie PFM to GND\", \"* Tie PFM to VDDA\")","v":"* Tie PFM to GND"}]
[]
["Step 7: Compensation Design"]
[null,null,null,"Load Pole Frequency",{"$f":"Fp_dominant","v":2277.1939080607376},"Hz"]
[null,null,null,"ESR Zero Frequency",{"$f":"Fesr/1000","v":53.051647757918794},"kHz"]
[null,null,null,"Desired Crossover Frequency",34,{"$f":"\"     kHz \"","v":"     kHz "}]
[null,null,null,"Error Amp Pole Frequency",{"$f":"Fp1_u","v":0.24866677698455608},"Hz"]
[null,null,null,{"$f":"CHOOSE(VOUT_setting, \"Upper Feedback Resistor\",\"\",\"\",\"\")","v":"Upper Feedback Resistor"},100,"kΩ"]
[null,null,null,{"$f":"CHOOSE(VOUT_setting, \"Lower Feedback Resistor\", \"PULLUP FB to VDDA with \"&'Variable Management'!D418,\"TIE FB TO VDDA\",\"PULLUP FB to VDDA with\"&'Variable Management'!D418)","v":"Lower Feedback Resistor"},{"$f":"IF(Vout=Vref,\"OPEN\",Rfb2_u/1000)","v":12.1},{"$f":"IF(Vout=Vref,\"\",\"kΩ\")","v":"kΩ"}]
[]
["Compensation Components"]
[null,"Calculated /","Std Values",{"$f":"C68","v":"Std Values"},null,"Actual P/Z Frequencies"]
["RC1",{"$f":"Rcea1/1000","v":8.6452702737187526},{"$f":"'Standard Value Calculator'!S32","v":8.66},3.3,"kΩ",{"$f":"Fp1_u","v":0.24866677698455608},"Hz   (FPEA)"]
["CC1",{"$f":"Cc1ea*1000000000","v":5.4145533860010113},{"$f":"'Standard Value Calculator'!S33","v":5.6},10,"nF",{"$f":"Fz1_u/1000","v":4.8228770689017084},"kHz (FZCOMP)"]
["CC2",{"$f":"IF(Cc2ea<0, \"N/A\", Cc2ea*1000000000000)","v":336.35864159331754},{"$f":"'Standard Value Calculator'!S34","v":330},10,"pF",{"$f":"Fp2_u/1000","v":1152.9436009048077},"kHz (FPCOMP)"]
[null,null,null,null,null,null,null,null,null,null,null,null,"** Specify Inductor Core Loss **",0.2,"W"]
[]
["Efficiency / Power Loss Analyzer"]
[]
["Step 8: Efficiency"]
[null,null,null,null,null,"Power MOSFETs","(Q1, Q2) "]
[null,null,null,null,"NVMFS6H858NLT1G, NVMFS6H848NLT1G"]
[null,null,null,null,"High-side","  Low-side"]
[null,null,null,"On-State Resistance, RDS(on) ",25,11,"mΩ"]
[null,null,null,"Total Gate Charge, QG ",6.5,14,"nC"]
[null,null,null,"Gate-Drain Charge, QGD ",2.1,4.3,"nC"]
[null,null,null,"Gate-Source Charge, QGS ",2.2000000000000002,4.5999999999999996,"nC"]
[null,null,null,"Output Charge, QOSS ",null,10,"nC"]
[null,null,null,"Output Capacitance, COSS ",82,192,"pF"]
[null,null,null,"Gate Resistance, RG ",0.5,0.5,"Ω"]
[null,null,null,"Transconductance, gFS ",45,84,"S"]
[null,null,null,"Gate-Source Threshold Voltage, VTH ",2,2,"V"]
[null,null,null,"Body Diode Forward Voltage, VBD ",0.8,0.8,"V"]
[null,null,null,"Body Diode Rev Recovery Charge, QRR ",null,60,"nC"]
[null,null,null,"Thermal Resistance, θJA ",43,38,"°C/W"]
[]
["External Schottky Diode (if applicable)"]
[null,null,null,"Schottky Fwd Voltage, VFWDsch ",null,0,"V"]
[null,null,null,"Schottky Rev Recovery Charge, QRRsch ",null,0,"nC"]
[]
[]
[]
["Step 9: IC Power Loss"]
[null,null,null,"IC Power Dissipation",{"$f":"'Variable Management'!B361","v":3.4439999999999998E-2},"W"]
[null,null,null,"IC Junction Temperature (estimate)",{"$f":"'Variable Management'!B363","v":26.174403999999999},"°C"]
[null,null,null,null,{"$f":"CHOOSE(Ext_VCC, \"\", \"* Tie VCCX to PGND\")","v":"* Tie VCCX to PGND"}]

{"sheet":"Input Filters","index":1,"n_rows":17,"n_cols":17,"rows_kept":17,"cut":false,"hidden":true,"merged":[[0,0,0,16],[2,14,2,15]]}
["                           LM(2)5149-Q1 Synchronous Buck Controller Design Tool"]
[null,null,null,null,null,null,null,null,null,null,null,null,null,null,"http://www.ti.com/product/lm5175"]
["About",null,"xx",null,null,"= Input Box",null,null,null,null,null,null,null,null,"TERMS OF USE",null,"                "]
[]
[]
[]
[null,null,null,null,"AEF",null,null,null,null,null,null,null,"Passive"]
[]
[null,"Design tab - LAEF",{"$f":"'Design Regulator'!E48 & \" µH\"","v":"0.68 µH"},null,null,"LAEF",1,"µH",null,"Suggested LIN Inductor","0.1-10","µH",null,"Chosen LIN",0.68,"µH"]
[null,"Design tab - CINJ",{"$f":"'Design Regulator'!#REF! & \" µF\"","v":{"$error":"#REF!"}},null,null,"CINJ",1,"µF",null,"Suggested CF","0.1-10","µF",null,"Chosen CF",0.47,"µF"]
[null,"Design tab - CDAMP",{"$f":"'Design Regulator'!#REF! & \" µF\"","v":{"$error":"#REF!"}},null,null,"CDAMP",1,"µF",null,"Suggested CDAMP","1-10","µF",null,"Chosen CDAMP",1,"µF"]
[null,"Design tab - RDAMP",{"$f":"'Design Regulator'!#REF! & \" Ω\"","v":{"$error":"#REF!"}},null,null,"RDAMP",10,"Ω",null,"Suggested RDAMP",{"$f":"Rdamp_PassiveStd","v":1.43E-2},"Ω",null,"Chosen RDAMP",0.35,"Ω"]
[]
[null,null,"VIN Ripple at Fsw",null,null,{"$f":"VinRipple_dBuV","v":105.5088751018927},"dBµV","VIN Ripple",{"$f":"VinRipple_dBuV","v":105.5088751018927},"dBµV"]
[]
[null,null,null,"AEF Attenuation at Fsw",{"$f":"-'Input Filter Calculations'!AM97","v":{"$error":"#REF!"}},"dB",null,null,null,null,null,"Passive Attenuation at Fsw",{"$f":"-'Input Filter Calculations'!AA97","v":-4.1477004385549856},"dB"]
[null,null,null,"AEF EMI at Fsw",{"$f":"VinRipple_dBuV-E16","v":{"$error":"#REF!"}},"dB-µV",null,null,null,null,null,"Passive EMI at Fsw",{"$f":"VinRipple_dBuV-M16","v":109.65657554044769},"dB-µV"]

{"sheet":"Design Input Filter","index":2,"n_rows":14,"n_cols":17,"rows_kept":14,"cut":false,"hidden":true,"merged":[[0,0,0,16],[2,14,2,15]]}
["                           LM5149-Q1 Synchronous Buck Controller Design Tool"]
[null,null,null,null,null,null,null,null,null,null,null,null,null,null,"http://www.ti.com/product/lm5175"]
["About",null,"xx",null,null,"= Input Box",null,null,null,null,null,null,null,null,"TERMS OF USE",null,"                "]
[]
[]
[]
[null,"Choose Filter"]
[null,"Suggested Inductor",{"$f":"CHOOSE(INFILTER_TYPE,\"\",\"0.01-1\",\"0.1-10\")","v":""},"µH",null,"Chosen Inductor",1,"µH"]
[null,{"$f":"CHOOSE(INFILTER_TYPE,\"\",\"Suggested Cinj\",\"Suggested Cf\")","v":""},{"$f":"CHOOSE(INFILTER_TYPE,\"\",'Standard Value Calculator'!S24,'Standard Value Calculator'!S23)","v":""},"µF",null,{"$f":"CHOOSE(INFILTER_TYPE,\"\",\"Chosen Cinj\",\"Chosen Cf\")","v":""},6.8000000000000005E-2,"µF"]
[null,"Suggested Cdamp",{"$f":"CHOOSE(INFILTER_TYPE,\"\",CHOOSE(OSC,\"DNP\",'Standard Value Calculator'!S25),'Standard Value Calculator'!S28)","v":""},"µF",null,"Chosen Cdamp",3.3000000000000002E-2,"µF"]
[null,"Suggested Rdamp",{"$f":"CHOOSE(INFILTER_TYPE,\"\",'Standard Value Calculator'!S26,Rdamp_PassiveStd)","v":""},"Ω",null,"Chosen Rdamp",43.2,"Ω"]
[null,null,null,null,null,"Filter Attenuation",{"$f":"-'Variable Management'!B302","v":0},"dB"]
[null,null,null,null,null,"VIN Ripple",{"$f":"VinRipple_dBuV","v":105.5088751018927},"dB-µV"]
[null,null,null,null,null,"Fsw Conducted EMC",{"$f":"'Variable Management'!B303","v":105.5088751018927},"dB-µV"]

{"sheet":"BOM & Schematic","index":3,"n_rows":71,"n_cols":10,"rows_kept":71,"cut":false,"hidden":true,"merged":[[50,3,50,5],[47,3,47,5],[62,3,62,6],[63,3,63,6],[61,3,61,6],[52,3,52,5],[55,3,55,6],[41,3,41,6],[46,3,46,5],[60,3,60,6],[58,3,58,6],[59,3,59,6],[54,3,54,6],[57,3,57,6],[56,3,56,6],[53,3,53,6],[42,3,42,5],[43,3,43,5],[48,3,48,5],[49,3,49,5],[51,3,51,5],[44,3,44,5],[45,3,45,5],[64,0,65,0],[64,9,65,9],[64,3,65,6],[64,2,65,2],[64,1,65,1],[64,7,65,7],[64,8,65,8]]}
[]
[]
[]
[]
[]
[]
[]
[]
[]
[]
[]
[]
[]
[]
[]
[]
[]
[]
[]
[]
[]
[]
[]
[]
[]
[]
[]
[]
[]
[]
[]
[]
[]
[]
[]
["   ** Tie DEMB to VDDA for FPWM, AGND for DEM **"]
["   ** Tie VCCX to GND if not used **",null,null,null,null,null,null,null,{"$f":"IF(OR(SCH_MODE=3, SCH_MODE=4),\"** Tie VCCX to GND if not used **\", \"\")","v":""}]
["   ** Tie DITH to VDDA to disable spread spectrum **"]
["   ** Tie OSC to VDDA for 2.2MHz, AGND for 440kHz **"]
[{"$f":"\"VIN = \"&VIN_min&\" V to \"&VIN_max&\" V, VOUT = \"& Vout &\" V, IOUT = \" &Iout & \" A,  Fsw = \" & Fsw/1000 &\" kHz, Current Limit = \"&ROUNDUP(Ilimit_DC,0)&\" A\"","v":"VIN = 9 V to 36 V, VOUT = 7.4 V, IOUT = 12 A,  Fsw = 100 kHz, Current Limit = 15 A"}]
["High Efficiency Synchronous Buck Regulator BOM"]
["Count","Ref Des","Value","Description",null,null,null,"Size","Part Number","MFR"]
[1,"CBOOT",0.1,{"$f":"C43","v":0.1},null,null,null,"0603","Std","Std"]
[1,"CC1",{"$f":"'Design Regulator'!D70","v":10},10,null,null,null,"0603","Std","Std"]
[1,"CC2",{"$f":"'Design Regulator'!D71","v":10},10,null,null,null,"0603","Std","Std"]
[1,"CRES",{"$f":"Cres_u*1000000000","v":82},{"$f":"C46","v":82},null,null,null,"0603","Std","Std"]
[1,"CDITH",{"$f":"Cdither*1000000000","v":2.1999999999999997},{"$f":"C47","v":2.1999999999999997},null,null,null,"0603","Std","Std"]
[{"$f":"ROUNDUP('Design Regulator'!E43/10,0)","v":16},"CIN",10,{"$f":"C48","v":10},null,null,null,1210,"Std","Std"]
[{"$f":"ROUNDUP('Design Regulator'!E34/47,0)","v":4},"COUT",47,{"$f":"C49","v":47},null,null,null,1210,"Std","Std"]
[1,"CSS",{"$f":"'Design Regulator'!#REF!","v":{"$error":"#REF!"}},{"$f":"C50","v":{"$error":"#REF!"}},null,null,null,"0603","Std","Std"]
[2,"CVCC, CVCCX",2.2000000000000002,2.2000000000000002,null,null,null,"0603","Std","Std"]
[1,"CVDDA",0.47,0.47,null,null,null,"0603","Std","Std"]
[1,"DBOOT","See description","Schottky Diode, 60V, 200mA",null,null,null,"-","-","Various"]
[1,"LO",{"$f":"'Design Regulator'!E27","v":3.3},{"$f":"\"Inductor, \"&Lf*1000000&\"µH, \"&Rdcr*1000&\"mΩ, >\"&ROUNDUP(Ilimit_DC*1.1,0)&\"A\"","v":"Inductor, 3.3µH, 14mΩ, >17A"},null,null,null,"-","-","Various"]
[2,"Q1, Q2","See description",{"$f":"'Design Regulator'!E80","v":25},null,null,null,"Std",{"$f":"'Design Regulator'!E78","v":"NVMFS6H858NLT1G, NVMFS6H848NLT1G"},"-"]
[1,"RC1",{"$f":"'Design Regulator'!D69","v":3.3},{"$f":"C56","v":3.3},null,null,null,"0603","Std","Std"]
[1,"RS",{"$f":"Rs*1000","v":3.5},3.5,null,null,null,"0508","Std","Std"]
[1,"RT",{"$f":"'Design Regulator'!E12","v":221},221,null,null,null,"0603","Std","Std"]
[1,"RFB1",{"$f":"'Design Regulator'!E64","v":100},100,null,null,null,"0603","Std","Std"]
[1,"RFB2",{"$f":"'Design Regulator'!E65","v":12.1},12.1,null,null,null,"0603","Std","Std"]
[1,"RPGOOD",100,100,null,null,null,"0603","Std","Std"]
[1,"RCS",100,100,null,null,null,"0603","Std","Std"]
[1,"RDEMB",100,100,null,null,null,"0603","Std","Std"]
[1,"RVIN",2.2000000000000002,2.2000000000000002,null,null,null,"0603","Std","Std"]
[1,"U1","LM5141-Q1","IC, LM5141-Q1, Synchronous Buck PWM Controller, 3.8V–65V Input",null,null,null,"VQFN-24","LM5141QRGEQ1","TI"]
[]
[]
["NOTES:"]
["** For information on TI NexFETTM MOSFETs, see **",null,null,"http://www.ti.com/nexfet","   **"]
["** Inductor saturation current should be higher than the peak inductor current at the OCP setpoint for all input voltages and operating temperatures **"]
["** Effective input and output capacitances should be appropriately derated for applied voltage and temperature, particularly with ceramics **"]

{"sheet":"EVM","index":4,"n_rows":6,"n_cols":2,"rows_kept":6,"cut":false,"hidden":false,"merged":[[0,0,0,16]]}
[" LM25149-Q1 Quickstart Design Tool"]
[]
[]
[]
[]
[null,"LM25149-Q1EVM-2100 PCB Layout"]

{"sheet":"Variable Management","index":5,"n_rows":450,"n_cols":27,"rows_kept":450,"cut":false,"hidden":true,"merged":[[4,4,4,7],[0,0,0,8]]}
["EXCEL Variables Names/Calculations"]
[null,"Input from user ="]
[null,"Output ="]
[null,"Constant"]
["Variable Name","Value","STD Units",null,"Notes",null,null,null,"Iteration"]
["Step 1: Operational Specs"]
["VIN_min",{"$f":"'Design Regulator'!E6","v":9},"V","Minimum input voltage",null,null,null,null,1]
["VIN_nom",{"$f":"'Design Regulator'!E7","v":16.8},"V","Nominal input voltage",null,null,null,null,null,null,{"$f":"CHOOSE(SCH_MODE, \"Efficiency vs. IOUT (Ch1)\", \"Efficiency vs. IOUT - 2 Ph\", \"Efficiency vs. IOUT - 3 Ph\", \"Efficiency vs. IOUT - 4 Ph\")","v":"Efficiency vs. IOUT (Ch1)"},1,null,"DITHER Enabled",1,null,null,null,null,"Dual  Outputs",1,null,"FPWM",1,null,{"$f":"CHOOSE(SCH_MODE, \"Bode Plot (Ch1)\", \"Bode Plot - 2 Ph\", \"Bode Plot - 3 Ph\", \"Bode Plot - 4 Ph\")","v":"Bode Plot (Ch1)"},1]
["VIN_max",{"$f":"'Design Regulator'!E8","v":36},"V","Maximum input voltage",null,null,null,null,null,null,{"$f":"IF(MODE=1, \"Efficiency vs. IOUT (Ch2)\", \"N/A - Do Not Use\")","v":"Efficiency vs. IOUT (Ch2)"},2,null,"DITHER Disabled",2,null,null,null,null,"Single Output – 2  Phases",2,null,"PFM",2,null,{"$f":"IF(MODE=1, \"AEF Gain\", \"N/A - Do Not Use\")","v":"AEF Gain"},2]
[null,null,null,null,null,null,null,null,null,null,"PLOT_TYPE",1,null,"DITHER Yes/No",1,"1 = Yes, 2 = No",null,null,null,"Single Output – 3  Phases",3,null,"FPWM/PFM",1,null,"BODE_PLOT_TYPE",1]
["Vout",{"$f":"'Design Regulator'!E9","v":7.4},"V","Output voltage - channel 1",null,null,null,null,null,null,null,null,null,null,null,null,null,null,null,"Single Output – 4  Phases",4]
["Iout",{"$f":"'Design Regulator'!E10","v":12},"A","Output current - channel 1",null,null,null,null,1,null,null,null,null,null,null,null,null,null,null,"Single/Dual Yes/No",1]
[null,null,null,null,null,null,null,null,1,null,"Adjustable",1,null,"3.3V",1,null,null,null,null,"MODE (Single/Dual), DUAL = 1, SINGLE = 2",{"$f":"IF(U12=1, 1, 2)","v":1},null,"VCCX Connected",1]
["Rout",{"$f":"Vout/Iout","v":0.6166666666666667},"W","Load resistance - Channel 1",null,null,null,null,null,null,"5V",2,null,"5V",2,null,null,null,null,"SINGLE OUTPUT (1 = YES)",{"$f":"IF(U12=1, 2, 1)","v":2},null,"No External VCC",2]
[null,null,null,null,null,null,null,null,null,null,"3.3V",3,null,"Adjustable",3,null,null,null,null,"Number of Phases",{"$f":"SCH_MODE","v":1},null,"Ext_VCC",2]
["Pout",{"$f":"Vout*Iout","v":88.800000000000011},"W","Output power",null,null,null,null,null,null,"12V",4,null,"Ch2 Output Setting",{"$f":"IF(Vout2=3.3, 1, IF(Vout2=5, 2, 3))","v":3}]
[null,null,null,null,null,null,null,null,null,null,"Output Voltage Setting",{"$f":"IF(Vout=3.3, 3, IF(Vout=5, 2,  IF(Vout=12,4,1)))","v":1}]
["Efficiency",0.9,null,"Estimate of efficiency"]
["Pin",{"$f":"Pout/Efficiency","v":98.666666666666671},"W","Calculate input power assuming finite efficiency",null,null,null,null,null,null,null,null,null,null,null,null,null,null,null,null,null,null,"2.2 MHz Fsw Setting",1,null,"Internal Compensation",1]
[null,null,null,null,null,null,null,null,null,null,null,null,null,null,null,null,null,null,null,null,null,null,"440 kHz Fsw Setting",2,null,"External Compensation",2]
["Iin_Vinmin",{"$f":"Pin/VIN_min","v":10.962962962962964},"A",null,null,null,null,null,null,null,null,{"$f":"Vout","v":7.4},null,null,null,null,null,null,null,null,null,null,"OSC",{"$f":"IF(Fsw>1000000,1,2)","v":2},null,"COMP_TYPE",2]
["Iin_Vinnom",{"$f":"Pin/VIN_nom","v":5.8730158730158735},"A","Input currents at min, nom, max Vin",null,null,null,{"$f":"AND(OSC=1, OR(Fsw/1000>2530, Fsw/1000<1800))","v":false}]
["Iin_Vinmax",{"$f":"Pin/VIN_max","v":2.7407407407407409},"A",null,null,null,null,{"$f":"AND(OSC=2, OR(Fsw/1000>500, Fsw/1000<300))","v":true}]
[null,null,null,null,null,null,null,{"$f":"OR(H22,H23)","v":true}]
["OSC setting",{"$f":"CHOOSE(OSC, 2200, 440)","v":440},"kHz",null,null,null,null,null,null,null,"SetVout_IntComp_nAEF",1,null,null,null,null,null,null,null,null,null,null,"No Input Filter",1,null,"UVLO Divider",1]
["Fsw",{"$f":"'Design Regulator'!E11*1000","v":100000},"Hz","Nominal switching frequency - determines RT resistor (SYNCIN must be 80-120% of this)",null,null,null,null,null,null,"SetVout_IntComp_AEF",2,null,null,null,null,null,null,null,null,null,null,"AEF Input Filter",2,null,"No UVLO Divider",2]
["RT resistor to AGND",{"$f":"((1000000000/Fsw)-53)/45+0.1","v":221.14444444444445},"kΩ",null,null,null,null,null,null,null,"SetVout_ExtComp_nAEF",3,null,null,null,null,null,null,null,null,null,null,"Passive LC Filter",3,null,"UVLO_TYPE",2]
[null,null,"kΩ",null,null,null,null,null,1,null,"SetVout_ExtComp_AEF",4,null,null,null,null,null,null,null,null,null,null,"INFILTER_TYPE",1]
["Tsw",{"$f":"1/Fsw","v":1.0000000000000001E-5},"sec","Switching period",null,null,null,null,null,null,"AdjVout_IntComp_nAEF",5]
["Vref",0.8,"V","Reference voltage",null,null,null,null,null,null,"AdjVout_IntComp_AEF",6]
["Rt",{"$f":"'Standard Value Calculator'!S12/1000","v":221},"kΩ","Frequency set resistor",null,{"$f":"IF(OR((Fsw=440000),(Fsw=2200000)),\"N/A\",Rfadj/1000)","v":0.221},null,null,null,null,"AdjVout_ExtComp_nAEF",7]
[null,null,null,null,null,null,null,null,null,null,"AdjVout_ExtComp_AEF",8]
["Step 2: Buck Inductor","Channel 1",null,null,null,null,null,null,null,null,"Schematic setting",{"$f":"(IF(OR(Vout=3.3,Vout=5,Vout=12),CHOOSE(COMP_TYPE,IF(INFILTER_TYPE=1,1,2),IF(INFILTER_TYPE=1,3,4)),CHOOSE(COMP_TYPE,IF(INFILTER_TYPE=1,5,6),IF(INFILTER_TYPE=1,7,8))))","v":7}]
["Don1",{"$f":"Vout/VIN_nom","v":0.44047619047619047},null,null,null,"Ideal Duty Cycle at VIN(nom)"]
["Doff1",{"$f":"1-34:34","v":0.55952380952380953},null,null,null,"Ideal 1- Duty Cycle at VIN(nom)"]
[]
["D_Vinmin",{"$f":"Vout/VIN_min","v":0.8222222222222223}]
["D_Vinnom",{"$f":"Vout/VIN_nom","v":0.44047619047619047}]
["D_Vinmax",{"$f":"Vout/VIN_max","v":0.20555555555555557}]
[]
["L_Vinnom",{"$f":"(VIN_nom-Vout)*D1_Vinnom/(Fsw*(Iout/Number_of_Phases)*0.3)","v":1.1501322751322752E-5},"H",null,null,"Calculated inductance for 35% ripple at VIN(nom)"]
["L_slopecomp",{"$f":"1000*Vout*Rs/24/Fsw","v":1.0791666666666669E-5},"H",null,null,"Calculated inductance based on one times inductor downslope"]
[]
["Lopt",{"$f":"B42","v":1.0791666666666669E-5},"H",null,null,"Slope comp"]
[]
["Lo",{"$f":"'Design Regulator'!E27/1000000","v":3.2999999999999997E-6},"H",null,null,"Chosen inductance"]
["Rdcr",{"$f":"'Design Regulator'!E28/1000","v":1.4E-2},"W",null,null,"Chosen inductor DCR"]
[]
["Don2",{"$f":"(Vout+Iout*(Rdcr+Rs))/(Vin+Iout*Rs)","v":0.45184657404108769}]
["Doff2",{"$f":"1-_Don2","v":0.54815342595891225}]
[]
["D_Vinmin_2",{"$f":"CHOOSE(MODE, (Vout+Iout*(Rdcr+Rs))/(VIN_min+Iout*Rs), (Vout+Iout/Number_of_Phases*(Rdcr+Rs))/(VIN_min+Iout/Number_of_Phases*Rs))","v":0.84162795841627969},null,null,null,"Duty cycles adjusted for DCR/shunt voltage drops"]
["D_Vinnom_2",{"$f":"CHOOSE(MODE, (Vout+Iout*(Rdcr+Rs))/(VIN_nom+Iout*Rs), (Vout+Iout/Number_of_Phases*(Rdcr+Rs))/(VIN_nom+Iout/Number_of_Phases*Rs))","v":0.45184657404108769},null,null,null,"need to include RDS(on) later"]
["D_Vinmax_2",{"$f":"CHOOSE(MODE, (Vout+Iout*(Rdcr+Rs))/(VIN_max+Iout*Rs), (Vout+Iout/Number_of_Phases*(Rdcr+Rs))/(VIN_max+Iout/Number_of_Phases*Rs))","v":0.2111425559069974}]
[]
["Iripple_Vinmin",{"$f":"(VIN_min-Vout)*D1_Vinmin_2/(Fsw*Lf)","v":4.080620404442568},"A"]
["Iripple_Vinnom",{"$f":"(VIN_nom-Vout)*D1_Vinnom_2/(Fsw*Lf)","v":12.870781199958257},"A"]
["Iripple_Vinmax",{"$f":"(VIN_max-Vout)*D1_Vinmax_2/(Fsw*Lf)","v":18.299021511939777},"A"]
[]
["Ishunt_rms_Vinmin",{"$f":"SQRT((Iout/Number_of_Phases)^2+(Iripple_Vinmin^2)/12)","v":12.057678960193627},"A"]
["Ishunt_rms_Vinnom",{"$f":"SQRT((Iout/Number_of_Phases)^2+(Iripple_Vinnom^2)/12)","v":12.562036089932498},"A"]
["Ishunt_rms_Vinmax",{"$f":"SQRT((Iout/Number_of_Phases)^2+(Iripple_Vinmax^2)/12)","v":13.11123623809757},"A"]
["Max shunt power loss at full load",{"$f":"B61^2*Rs","v":0.55231662753668298},"W",null,null,"Note this is power loss at full load - not loss near OCP!"]
[]
["Max inductor ripple current",{"$f":"MAX(B56:B58)","v":18.299021511939777},"A",null,null,"Ripple current at Vin(max)"]
[]
[null,{"$f":"B56/(Iout/Number_of_Phases)","v":0.34005170037021398}]
["% ripple current",{"$f":"B57/(Iout/Number_of_Phases)","v":1.0725650999965215}]
[null,{"$f":"B58/(Iout/Number_of_Phases)","v":1.5249184593283147}]
[]
["Inductor copper temerature",100,"°C"]
["DCR at hot",{"$f":"Rdcr*(1+0.0039*(B71-25))","v":1.8095E-2},"W"]
[]
[]
["Step 3: Sense Resistors, Slope Comp, Current Limit"]
[]
["Ilimit_DC",{"$f":"'Design Regulator'!E16","v":15},"A",null,null,"Chosen OCP level - based on output current"]
[]
["Ilimit_inductor_Vinmin",{"$f":"CHOOSE(MODE, Ilimit_DC+Iripple_Vinmin/2, Ilimit_DC/Number_of_Phases+Iripple_Vinmin/2)","v":17.040310202221285},"A",null,null,"Peak inductor current at current limit inception"]
["Ilimit_inductor_Vinnom",{"$f":"CHOOSE(MODE, Ilimit_DC+Iripple_Vinnom/2, Ilimit_DC/Number_of_Phases+Iripple_Vinnom/2)","v":21.435390599979129},"A"]
["Ilimit_inductor_Vinmax",{"$f":"CHOOSE(MODE, Ilimit_DC+Iripple_Vinmax/2, Ilimit_DC/Number_of_Phases+Iripple_Vinmax/2)","v":24.149510755969889},"A"]
[]
[]
["CS threshold_min",5.1999999999999998E-2,"V"]
["CS threshold",0.06,"V"]
["CS threshold_max",6.8000000000000005E-2,"V"]
[]
["Shunt required to get OCP at VIN(min)",{"$f":"Buck_CS_threshold/B79","v":3.5210626618862088E-3},"W"]
["Shunt required to get OCP at VIN(nom)",{"$f":"Buck_CS_threshold/B80","v":2.7991092450658874E-3},"W"]
["Shunt required to get OCP at VIN(max)",{"$f":"Buck_CS_threshold/B81","v":2.4845223825152515E-3},"W"]
[]
["Rs_ideal",{"$f":"B89","v":2.7991092450658874E-3},"W",null,null,"Ideal Rs for the required OCP -- based on 73mV CL threshold"]
["Rs",{"$f":"'Design Regulator'!E18/1000","v":3.5000000000000001E-3},"W",null,null,"Selected (starndard value) current limit sense resistor"]
[]
["Current limit - peak",{"$f":"Buck_CS_threshold/Rs","v":17.142857142857142},"A",null,null,"Peak inductor current limit = min sat current"]
[]
["Iout_OCP_Vinmin",{"$f":"Number_of_Phases*(Buck_CS_threshold/Rs-Iripple_Vinmin/2)","v":15.102546940635857},"A",null,null,"Current limit setpoints (i.e. IOUT) after standard components are selected"]
["Iout_OCP_Vinnom",{"$f":"Number_of_Phases*(Buck_CS_threshold/Rs-Iripple_Vinnom/2)","v":10.707466542878013},"A"]
["Iout_OCP_Vinmax",{"$f":"Number_of_Phases*(Buck_CS_threshold/Rs-Iripple_Vinmax/2)","v":7.9933463868872536},"A"]
[]
["Irms_OCP_Vinmin",{"$f":"SQRT((Iout_OCP_Vinmin/Number_of_Phases)^2+(Iripple_Vinmin^2)/12)","v":15.148417277102105},"A"]
["Irms_OCP_Vinnom",{"$f":"SQRT((Iout_OCP_Vinnom/Number_of_Phases)^2+(Iripple_Vinnom^2)/12)","v":11.333780944222392},"A"]
["Irms_OCP_Vinmax",{"$f":"SQRT((Iout_OCP_Vinmax/Number_of_Phases)^2+(Iripple_Vinmax^2)/12)","v":9.5811326132126151},"A"]
[]
["Pshunt_Vinmin",{"$f":"B101^2*Rs","v":0.80316091100421949},"W",null,null,"Max power dissipations in shunt"]
["Pshunt_Vinnom",{"$f":"B102^2*Rs","v":0.44959106672066512},"W"]
["Pshunt_Vinmax",{"$f":"B103^2*Rs","v":0.32129335753188237},"W"]
[]
[]
["Step 4: Output Capacitor"]
["Icoutrms_VINmin",{"$f":"Iripple_Vinmin/SQRT(12)","v":1.1779736444827982},"A",null,null,"Output Cap RMS current"]
["Icoutrms_VINnom",{"$f":"Iripple_Vinnom/SQRT(12)","v":3.7154744952383374},"A"]
["Icoutrms_VINmax",{"$f":"Iripple_Vinmax/SQRT(12)","v":5.2824724979125923},"A"]
["Max Cout rms current",{"$f":"MAX(B111:B113)","v":5.2824724979125923},"A"]
[]
["Vripple1",{"$f":"'Design Regulator'!E32/1000","v":0.1},"V",null,null,"Output voltage ripple spec(pk-pk)"]
[]
["Output Ripple Spec (pk-pk)",{"$f":"Vo1_ripple*1000","v":100},"mV",null,null,"Vout ripple spec at Vin(nom)"]
[]
["Coutmin",{"$f":"Iripple_Vinnom/(Fsw*8*Vo1_ripple)","v":1.6088476499947821E-4},"F",null,null,"Minimum output capacitnace",null,{"$f":"Vo2_ripple","v":0},1]
["Reported Coutmin",{"$f":"IF(Cout_min*1000000<2, 2.2,Cout_min*1000000)","v":160.88476499947819},"uF"]
["Cout",{"$f":"'Design Regulator'!E34/1000000","v":1.4999999999999999E-4},"F",null,null,"Chosen output capacitance",null,null,1]
["Resrmax",{"$f":"SQRT((Vo1_ripple/Iripple_Vinnom)^2-(1/(Fsw*Cout*8))^2)","v":{"$error":"#NUM!"}},"W",null,null,"Max ESR before ripple exceeds Vripple1",null,null,1]
[]
["Reported Cout ESR max",{"$f":"IF(OR(CoutEsrMax>0.3, CoutEsrMax<0, (ISERROR(CoutEsrMax))), \"N/A\", CoutEsrMax*1000)","v":{"$error":"#NUM!"}},"mΩ"]
["CoutEsr",{"$f":"'Design Regulator'!E36/1000","v":0.02},"W",null,null,"Chosen ESR",null,null,1,null,{"$f":"ISERROR(CoutEsrMax)","v":true},{"$f":"ISERROR(B125)","v":true}]
["Vripple",{"$f":"Iripple_Vinnom*SQRT(Cout_ESR^2+(1/(8*Fsw*Cout))^2)","v":0.27886692599909557},"Vp-p",null,null,null,null,null,null,null,null,{"$f":"OR(CoutEsrMax>0.3,CoutEsrMax<0)","v":{"$error":"#NUM!"}}]
[null,null,null,null,null,null,null,null,null,null,{"$f":"OR(TRUE, FALSE, TRUE)","v":true}]
["Step 5: Input Capacitor"]
[null,null,null,null,null,null,null,null,null,null,"Two channels operating at full load"]
["Icinrms_VINmin",{"$f":"SQRT(D1_Vinmin_2*(Iout^2*(1-D1_Vinmin_2)+Iripple_Vinmin^2/12))","v":4.5123907265219998},"A",{"$f":"D1_Vinmax","v":0.20555555555555557},null,"Calculate input cap rms current with one output unloaded",null,null,null,null,{"$f":"SQRT(Iout^2*D1_Vinmin*(1-D1_Vinmin)+Iout2^2*D2_Vinmin*(1-D2_Vinmin)-2*Iout*Iout2*D1_Vinmin*D2_Vinmin)","v":{"$error":"#NAME?"}},"A",{"$f":"SQRT(Iout^2*D1_Vinmin*(1-D1_Vinmin)+Iout2^2*D2_Vinmin*(1-D2_Vinmin)-2*Iout*Iout2*(0.5-D2_Vinmin*(1-D1_Vinmin)))","v":{"$error":"#NAME?"}},"A"]
["Icinrms_VINnom",{"$f":"SQRT(D1_Vinnom_2*(Iout^2*(1-D1_Vinnom_2)+Iripple_Vinnom^2/12))","v":6.4733089660798218},"A",{"$f":"D1_Vinmin","v":0.8222222222222223},null,null,null,null,null,null,{"$f":"SQRT(Iout^2*D1_Vinnom*(1-D1_Vinnom)+Iout2^2*D2_Vinnom*(1-D2_Vinnom)-2*Iout*Iout2*D1_Vinnom*D2_Vinnom)","v":{"$error":"#NAME?"}},"A"]
["Icinrms_VINmax",{"$f":"SQRT(D1_Vinmax_2*(Iout^2*(1-D1_Vinmax_2)+Iripple_Vinmax^2/12))","v":5.4659554563903852},"A",null,null,null,null,null,null,null,{"$f":"SQRT(Iout^2*D1_Vinmax*(1-D1_Vinmax)+Iout2^2*D2_Vinmax*(1-D2_Vinmax)-2*Iout*Iout2*D1_Vinmax*D2_Vinmax)","v":{"$error":"#NAME?"}},"A"]
["Icinrms - multiphase",{"$f":"Iout*SQRT((D1_Vinmin-F136/Number_of_Phases)*((F136+1)/Number_of_Phases-D1_Vinmin))","v":4.5879068090894002},"A",null,null,null,null,null,null,null,{"$f":"MAX(K131:K133)","v":{"$error":"#NAME?"}},"A"]
["Max Cin rms current",{"$f":"MAX(B131:B133)","v":6.4733089660798218},"A",null,null,{"$f":"Number_of_Phases*D1_Vinnom","v":0.44047619047619047},"N*D"]
[null,null,null,null,null,{"$f":"FLOOR(Number_of_Phases*D1_Vinnom,1)","v":0},"floor(N*D)"]
["Icinrms - multiphase - max",{"$f":"Iout/2/Number_of_Phases","v":6},"A"]
["Final result",{"$f":"IF(D1_Vinmin<0.5, B135, B137)","v":6},"A","…report this"]
[]
["Vinripple1",{"$f":"'Design Regulator'!E41/1000","v":0.3},"Vp-p",null,null,"Input voltage ripple spec (pk-pk)"]
[]
["Cinmin_Vinmin",{"$f":"Iout/Number_of_Phases*D1_Vinmin*(1-D1_Vinmin)/(Vinripple1*Fsw)","v":5.8469135802469116E-5},"F"]
["Cinmin_Vinnom",{"$f":"Iout/Number_of_Phases*D1_Vinnom*(1-D1_Vinnom)/(Vinripple1*Fsw)","v":9.85827664399093E-5},"F"]
["Cinmin_Vinmax",{"$f":"Iout/Number_of_Phases*D1_Vinmax*(1-D1_Vinmax)/(Vinripple1*Fsw)","v":6.532098765432099E-5},"F",null,null,"Calculate cap at Vinmax and 50% duty cycle (Vin = 2*Vout)"]
[]
["Cinmin_50%D",{"$f":"Iout*0.5*(1-0.5)/(Vinripple1*Fsw)","v":1E-4},"F",null,null,"Buck 50% typically worst case"]
["Cinmin",{"$f":"IF(D1_Vinmin<0.5, B142,B146)","v":1E-4},"F",{"$f":"(VIN_min+VIN_max)/2","v":22.5}]
["Reported Cinmin",{"$f":"IF(Cinmin*1000000<2.2, 2.2,Cinmin*1000000)","v":100},"uF",{"$f":"2*Vout","v":14.8},null,"…report this"]
[]
["Cin",{"$f":"'Design Regulator'!E43/1000000","v":1.6000000000000001E-4},"F",null,null,"Input capacitance"]
["CinEsrMax_Vinmax",{"$f":"-(Iout/Number_of_Phases*D1_Vinmax*(1-D1_Vinmax)/(Cin*Fsw)-Vinripple1)/(Iout/Number_of_Phases+Iripple_Vinmax/2)","v":8.393723627769429E-3},"W"]
["CinEsrMax_50%D",{"$f":"-(Iout/Number_of_Phases*0.5*(1-0.5)/(Cin*Fsw)-Vinripple1)/(Iout/Number_of_Phases+Iripple_Vinmax/2)","v":5.3192719821305804E-3},"W",null,null,"Calculate ESR at Vinmax and 50% duty cycle (Vin = 2*Vout)"]
["CinEsrMax",{"$f":"IF(VIN_max<2*Vout, B151,B152)","v":5.3192719821305804E-3},"W"]
["Reported Cin ESR max",{"$f":"IF(OR(CinEsrMax>0.3, CinEsrMax<0), \"N/A\",CinEsrMax*1000)","v":5.3192719821305801},"mΩ",null,null,"…report this"]
["RCinEsr",{"$f":"'Design Regulator'!E45/1000","v":5.0000000000000002E-5},"W",null,null,"Input capacitance series resistance (ESR)"]
[]
["Vinripple2_Vinmin",{"$f":"Iout/Number_of_Phases*D1_Vinmin_2*(1-D1_Vinmin_2)/(Cin*Fsw)+(Iout/Number_of_Phases +Iripple_Vinmin/2)*RCinEsr","v":0.10066976903135458},"Vp-p"]
["Vinripple2_Vinnom",{"$f":"Iout/Number_of_Phases*D1_Vinnom_2*(1-D1_Vinnom_2)/(Cin*Fsw)+(Iout/Number_of_Phases +Iripple_Vinnom/2)*RCinEsr","v":0.18668270520631358},"Vp-p"]
["Vinripple2_Vinmax",{"$f":"Iout/Number_of_Phases*D1_Vinmax_2*(1-D1_Vinmax_2)/(Cin*Fsw)+(Iout/Number_of_Phases +Iripple_Vinmax/2)*RCinEsr","v":0.12597850828184193},"Vp-p"]
["Vinripple2_50%D",{"$f":"Iout/Number_of_Phases*0.5*(1-0.5)/(Cin*Fsw)+(Iout/Number_of_Phases +Iripple_Vinmax/2)*RCinEsr","v":0.1885574755377985},"Vp-p",null,null,"Calculate ripple at Vinmax and 50% duty cycle (Vin = 2*Vout)"]
["Vinripple2",{"$f":"IF(D1_Vinmin<0.5, B157,B160)","v":0.1885574755377985},"Vp-p",null,null,"…report highest of these"]
[]
[null,{"$f":"Iout*D1_Vinmax_2*(1-D1_Vinmax_2)/(Cin*Fsw)","v":0.12492103274404343},"Vp-p"]
[]
["Step 6a: Soft Start"]
["Tss",{"$f":"'Design Regulator'!E50/1000","v":0},"s","Soft-start time"]
["Iss",{"$f":"Cout*Vout/Tss","v":{"$error":"#DIV/0!"}},"A","Load cap current during soft start"]
["Css",{"$f":"0.000022*Tss/1.2","v":0},"F"]
["Css_u",{"$f":"'Standard Value Calculator'!B4","v":0},"F"]
[]
["Step 6b: Other Components - Dither, Hiccup, DEMB, MODE"]
["Tres",{"$f":"'Design Regulator'!E53/1000","v":4.4999999999999997E-3},"s","Hiccup time"]
["Cres",{"$f":"0.00002*Tres/1.2","v":7.4999999999999997E-8},"F"]
["Cres_u",{"$f":"'Standard Value Calculator'!G4","v":8.2000000000000006E-8},"F"]
[]
["RPG1/2",100,"kΩ"]
["RFB1/2",null,"W",null,"Tie to VDDA or AGND for 3.3V/5V output, respectively. "]
["R_MODE",null,"W",null,"Tie to VDDA or AGND for Single/Dual operation, respectively. "]
["R_DEMB",null,"W",null,"Tie to VDDA or AGND for FPWM/DEM, respectively. "]
[]
["Enable Hysteresis Current",1.0000000000000001E-5,"A",null,"10 µA Hysteresis Current"]
["Turn ON Voltage",{"$f":"'Design Regulator'!E52","v":5.5}]
["Hysteresis Voltage",{"$f":"'Design Regulator'!E52-'Design Regulator'!E53","v":1}]
[]
["Upper FB resistor",{"$f":"B183/B181","v":99999.999999999985},"W"]
["Lower FB resister",{"$f":"B185/(B182-1)","v":22222.222222222219},"W"]
["Standard upper FB resistor",{"$f":"'Standard Value Calculator'!S40","v":100},"kΩ"]
["Standard lower FB resistor",{"$f":"'Standard Value Calculator'!S41","v":22.1},"kΩ"]
[]
["Dither Modulation Frequency",{"$f":"'Design Regulator'!E56*1000","v":41200},"Hz"]
["Cdither_calculated",{"$f":"10*10^-6/Fdither/0.12","v":2.0226537216828479E-9},"F"]
["Cdither_stdvalue",{"$f":"'Standard Value Calculator'!S21","v":2.1999999999999998E-9},"F"]
[]
[]
["Step 7: Compensation"]
["Pi",3.1415926500000002,null,"p"]
["CS Amp Gain",10]
["Ri",{"$f":"Rs*CSAmp_gain","v":3.5000000000000003E-2},"W",null,null,"Current Sense effective resistance = shunt resistor Rs * CS amp gain"]
["gm",{"$f":"IF(COMP_TYPE=1,0.00003,0.0012)","v":1.1999999999999999E-3},"S",null,null,"Error Amp Transconductance"]
[]
["Se_ext",{"$f":"B205/Ri*1000","v":649350.64935064933},"A/s",null,null,"Slope Comp Slope - referred to inductor current"]
["Sn",{"$f":"(Vin-Vout)/Lf","v":2848484.8484848486},"A/s",null,null,"On-time Slope"]
["Sf",{"$f":"Vout/Lf","v":2242424.2424242427},"A/s",null,null,"Off-time Slope"]
[]
["Se_int",{"$f":"Fsw*0.001*(5/22)","v":22.727272727272727},"mV/μs",null,null,"Slope Comp Slope - referred to IC"]
["Sn_int",{"$f":"Sn*Ri/1000","v":99.696969696969717},"mV/μs",null,null,"etc"]
["Sf_int",{"$f":"Sf*Ri/1000","v":78.484848484848499},"mV/μs",null,null,"etc"]
[]
["mc_buck",{"$f":"1+Se_ext/Sn","v":1.2279635258358663},null,null,null,"mc = 1 + Se/Sn for peak current-mode buck"]
["k_buck",{"$f":"mc_buck*(1-D1_Vinnom_2)","v":0.67311241363951535},null,null,null,"mc*(1-d)"]
[]
["mc",{"$f":"1+Se_ext/Sn","v":1.2279635258358663}]
["k",{"$f":"mc_buck*(1-D1_Vinnom_2)","v":0.67311241363951535}]
["Q",{"$f":"1/Pi/(k-0.5)","v":1.8387467418157124},null,null,null,"1/(Pi*(k-0.5))",null,"Q = 2/Pi = 0.636 gives ideal one-cycle damping"]
[]
["Error Amp (EA)"]
["GBW",6,"MHz",null,null,"EA gain-bandwidth product"]
["Cbw",{"$f":"gm/(2*Pi*GBW*1000000)","v":3.1830988654751269E-11},"F",null,null,"EA effective bandwidth limiting capacitance = gm/(2*Pi*GBW)"]
["RoEA",64000000,"W",null,null,"EA output resistance"]
["AEA",{"$f":"gm*RoEA","v":76800},"V/V",null,null,"EA DC gain = gm*RoEA"]
["Afb",{"$f":"IF(VOUT_setting=1,Vref/Vout,SQRT((1+(Fcross*zterm1)^2)/((1+Afbr-pterm4*(Fcross)^2)^2+(Fcross*pterm3)^2)))","v":0.10810810810810811},"V/V",null,null,"Feedback gain from Vout to FB"]
["Acs",{"$f":"1/Ri","v":28.571428571428569},null,null,null,"Acs = 1/Ri"]
["Am_buck",{"$f":"(Ro/Number_of_Phases)/Ri/((1+Ro/Number_of_Phases*(k-0.5)/(Fsw*Lf)))","v":13.312536619270954}]
["Am",{"$f":"(Ro*Number_of_Phases)/Ri/((1+Ro*Number_of_Phases*(k-0.5)/(Fsw*Lf)))","v":13.312536619270954},null,null,null,"Buck modulator gain"]
[]
["Scaling factor to calculate Rcomp - buck",{"$f":"2*Pi*Ri/gm","v":183.25957125000005},null,null,null,"2*Pi*Ri/gm -- scaling factor to calculate Rcomp given desired buck crossover frequency"]
["DC Gain is Adc = AEA*Afb*Am"]
[]
["Ro",{"$f":"Rout","v":0.6166666666666667},"W",null,null,"Output Resistance"]
[]
["Fp_load_buck",{"$f":"1/(2*Pi*Ro*Cout)+(k-0.5)/(2*Pi*Fsw*Lf*Cout/Number_of_Phases)","v":2277.1939080607376},"Hz",null,null,"Buck dominant pole frequency -- note slope comp influence"]
["Fp_dominant",{"$f":"Fload_u","v":2277.1939080607376},"Hz"]
[null,{"$f":"Cbw","v":3.1830988654751269E-11}]
["Fp_EA",{"$f":"1/(2*Pi*(RoEA+Rcea1_u)*Cc1ea_u)","v":0.24866677698455608},"Hz",null,null,"Error Amp LF pole -- related to amplifier ouptut resistance and comp cap"]
["Fp_HF",{"$f":"1/(2*Pi*Rcea1_u*(Cc2ea_u+Cbw))","v":1152943.6009048077},"Hz",null,null,"Error Amp HF pole cancels zero related to Output Cap ESR"]
["Fesr",{"$f":"1/(2*Pi*Cout*Cout_ESR)","v":53051.647757918792},"Hz",null,null,"Cout ESR zero frequency"]
["F_mod",{"$f":"Fsw/2","v":50000},"Hz",null,null,"Zero-order sample-and-hold effects of current-mode control modeled as pole at Fsw/2"]
[null,null,null,"Internal Comp Crossover"]
["Desired Crossover Frequency",{"$f":"CHOOSE(COMP_TYPE,Fcross_Ch2,'Design Regulator'!E62*1000)","v":34000},"Hz",{"$f":"Fsw/50","v":2000}]
["Rcea1",{"$f":"Fcross*Cout/Number_of_Phases*2*Pi*Ri/(gm*Afb)","v":8645.2702737187519},"W",null,null,"This component will largely determine the crossover frequency",null,null,null,null,{"$f":"Fcross/Fp_dominant/(gm*Afb*Am)","v":8645.2702737187537}]
["Cc1ea, Cc3ea",{"$f":"10/(Rcea1*Fcross*2*Pi)","v":5.4145533860010111E-9},"F",null,null,"This along with Rcea1 will set a zero at Fcrossover/5 to optimize phase margin"]
["Cc2ea, Cc4ea",{"$f":"MAX(1/(Rcea1*2*Pi*Fesr)-Cbw, 1/(Rcea1*2*Pi*(Fsw/2))-Cbw)","v":3.3635864159331752E-10},"F",null,null,"This along with Rcea1 places a pole at the output cap ESR zero"]
[]
[{"$f":"CHOOSE(COMP_TYPE,\"Internal Compensation\",\"External Compensation\")","v":"External Compensation"}]
["Chosen Compensation Components from the standard value sheet",null,null,"Internal Values"]
["Rcea1_u",{"$f":"CHOOSE(COMP_TYPE,D246,'Design Regulator'!D69*1000)","v":3300},"W",400000,null,null,{"$f":"1/(Rcea1*2*Pi*(Fsw/2))-Cbw","v":3.3635864159331752E-10}]
["Cc1ea_u",{"$f":"CHOOSE(COMP_TYPE,Cc3ea_u,'Design Regulator'!D70*0.000000001)","v":1E-8},"F",{"$f":"50*0.000000000001","v":5.0000000000000002E-11}]
["Cc2ea_u",{"$f":"CHOOSE(COMP_TYPE,Cc4ea_u,'Design Regulator'!D71*0.000000000001)","v":9.9999999999999994E-12},"F",{"$f":"0.000000000001","v":9.9999999999999998E-13}]
[]
["Resulting Pole/Zero Locations",null,null,null,null,{"$f":"Cout","v":1.4999999999999999E-4},{"$f":"Cout_ESR","v":0.02}]
["Fz1",{"$f":"1/(2*Pi*Rcea1_u*Cc1ea_u)","v":4822.8770689017083},"Hz",null,null,"This zero is set at or close to the dominant load pole"]
["Fp2",{"$f":"1/(2*Pi*Rcea1_u*(Cc1ea_u*(Cc2ea_u+Cbw)/(Cc1ea_u+Cc2ea_u+Cbw)))","v":1157766.4779737096},"Hz",null,null,"This pole cancels the zero from the Output Cap ESR"]
[null,null,null,"Internal Values"]
["Rfb1",{"$f":"IF(VOUT_setting=1,'Design Regulator'!E64*1000,2500000)","v":100000},"W",null,null,"Upper Feedback Resistance - chosen by user"]
["Rfb2",{"$f":"IF(Vout=Vref,100000000,Vref*B254/((Vout-Vref)))","v":12121.21212121212},"W",null,null,"Lower Feedback Resistance"]
["Rfb2_u",{"$f":"IF(Vout=Vref,\"N/A\",CHOOSE(VOUT_setting,'Standard Value Calculator'!S11,471000,792000,177000))","v":12100},"W",null,null,"Std Value Lower Feedback Resistance"]
[]
["Rff",20000,"W"]
["Cff",3.67E-13,"F"]
["Cfb",2.1999999999999999E-12,"F"]
[]
["wff",{"$f":"1/(2*Pi*Rff*Cff)","v":21683234.778440922},"Hz"]
["wfbt",{"$f":"1/(2*Pi*Rfb1_*Cfb)","v":723431.56033525639},"Hz"]
["wfbb",{"$f":"1/(2*Pi*Rfb2_u*Cfb)","v":5978773.2259112094},"Hz"]
["w1",{"$f":"1/(2*Pi*Rff*Cfb)","v":3617157.8016762817},"Hz"]
["wfft",{"$f":"1/(2*Pi*Cff*Rfb1_)","v":4336646.9556881851},"Hz"]
["Cfb*(Rff+RFBT)/(Rff*RFBT))",{"$f":"2*Pi*Cfb*(Rff+Rfb1_)/(Rff*Rfb1_)","v":8.2938045959999999E-16},"Hz"]
[]
[]
[]
[]
["Other Input Variables"]
["Rfets",0,"W","Series resistance due to FETs"]
["Diode loss eq res",{"$f":"0.00000002*Fsw*0.6*4/Iripple1","v":{"$error":"#NAME?"}}]
["Fet loss eq res",{"$f":"_Don2*RdsonTop+Doff2*RdsonBot","v":{"$error":"#NAME?"}}]
["cap loss eq res",{"$f":"B277*Vin^2*Fsw/2/(((Iripple1/SQRT(3))^2))","v":{"$error":"#NAME?"}}]
["Sw cap",5.0000000000000001E-9]
[]
["Step 8: AEF"]
[]
["VinRipple_dBuV",{"$f":"20*LOG10(Vinripple2*1000000)","v":105.5088751018927},"dBuV"]
["CISPR 25 limit",{"$f":"CHOOSE(OSC,35,50)","v":50},"dBuV","Chooses CISPR conducted limit 35 at 2.1MHz and 50 at 440kHz"]
["Attenuation required",{"$f":"VinRipple_dBuV-B282+3","v":58.508875101892698},"dBuV","Margin of attenuation req"]
["Filter Frequency Required",{"$f":"Fsw/(POWER(10,Attn_req/40))","v":3445.7052329654111},"Hz","assume 40db/decade drop and set frequency based on attenuation"]
[]
["Lfilter",{"$f":"'Design Regulator'!E48","v":0.68},"uH","user input"]
[]
["Gop_AEF",{"$f":"CHOOSE(OSC,20,100)","v":100}]
["n",3,null,null,null,"n should be 2 or 3"]
[]
["Passive Cf",{"$f":"1000000/(LinfilterPssv*POWER(2*Pi*Fx_infilter,2))","v":3137.4376701032284},"uF",{"$f":"'Design Input Filter'!G9*0.000001","v":6.8E-8}]
["Cinj_AEF",{"$f":"1000000/(L_infilter*Gop_AEF*0.000001*POWER(2*Pi*Fx_infilter,2))","v":31.374376701032286},"uF",{"$f":"'Design Regulator'!#REF!*0.000001","v":{"$error":"#REF!"}}]
[]
["Cdamp_AEF",{"$f":"CHOOSE(OSC,0,Cinj_AEF/nAEF)","v":10.458125567010763},"uF",{"$f":"'Design Regulator'!#REF!*0.000001","v":{"$error":"#REF!"}}]
["Rdamp_AEF",{"$f":"CHOOSE(OSC,SQRT(L_infilter*Gop_AEF/(Cinj_AEF)),1.09*SQRT(L_infilter*Gop_AEF/Cinj_AEF))","v":1.604698331160848},"Ω",{"$f":"'Design Regulator'!#REF!","v":{"$error":"#REF!"}}]
["Ccomp_AEF",{"$f":"CHOOSE(OSC,5,1)","v":1},"nF",{"$f":"B296*0.000000001","v":1.0000000000000001E-9},null,"AEF Comp network & sense is specifically defined at 2.2MHz at 440kHz"]
["Rcomp_AEF",{"$f":"CHOOSE(OSC,200,1000)","v":1000},"Ω"]
["Csen_AEF",{"$f":"Gop_AEF*B296","v":100},"nF",{"$f":"B298*0.000000001","v":1.0000000000000001E-7}]
[]
["Rd_AEF",{"$f":"SQRT(L_infilter*0.000001/Cin)","v":6.5192024052026495E-2},null,{"$f":"'Standard Value Calculator'!S14","v":6.4899999999999999E-2}]
[]
["Attenuation at Fsw",{"$f":"'Input Filter Calculations'!W97","v":0},"dBuV"]
["Conducted EMC at Fsw",{"$f":"VinRipple_dBuV+B302","v":105.5088751018927},"dBuV"]
[]
[]
["Step 8: Efficiency"]
["VAR",0]
["Design"]
["Ta",{"$f":"'Design Regulator'!E13","v":25},"°C","Ambient Temperature"]
["Components"]
["LTc",{"$f":"4000/1000000","v":4.0000000000000001E-3},"%/°C","Inductor DCR Temp Co"]
["θCA",20,"°C/W","Inductor Core to Ambient Thermal Resistance"]
["RCinEsr",{"$f":"RCinEsr","v":5.0000000000000002E-5},"W","Input Capacitor ESR"]
[]
["Controller Characteristics"]
["VCC",5,"V","with 170mA current limit"]
["Top Driver"]
["RdsonDRT",1,"W","Drain-Source Resistance of Pullup High-side FET Driver"]
["RdsonDRT2",0.5,"W","Drain-Source Resistance of Pulldown High-side FET Driver"]
["Bottom Driver"]
["RdsonDRB",1,"W","Drain-Source Resistance of Pullup Low-side FET Driver"]
["RdsonDRB2",0.5,"W","Drain-Source Resistance of Pulldown Low-side FET Driver"]
["Deadtime"]
["Deadtime",1.4E-8,"s","Total Deadtime",null,null,"14ns for LM513-Q1"]
["IQ"]
["IQ ",2.2000000000000001E-6,"A","Quiescent Current of LM5143-Q1 Controller (One channel disabled)"]
[]
["High- & low-side MOSFETs - Ch1","Q1: high-side",null,"Q2: low-side"]
["Rdson",{"$f":"'Design Regulator'!E80/1000","v":2.5000000000000001E-2},"W",{"$f":"'Design Regulator'!F80/1000","v":1.0999999999999999E-2},"W","Drain-Source Resistances of Channel 1 FETs"]
["RdsonTopTc",{"$f":"4000/1000000","v":4.0000000000000001E-3},"%/°C",4.0000000000000001E-3,"%/°C","Drain-Source Resistance Temp Co"]
["Qg",{"$f":"'Design Regulator'!E81/1000000000","v":6.5000000000000003E-9},"C",{"$f":"'Design Regulator'!F81/1000000000","v":1.4E-8},"C","Gate Charge at VCC = 5V"]
["Qgd",{"$f":"'Design Regulator'!E82/1000000000","v":2.1000000000000002E-9},"C",{"$f":"'Design Regulator'!F82/1000000000","v":4.2999999999999996E-9},"C","Gate to Drain Charge"]
["Qgs",{"$f":"'Design Regulator'!E83/1000000000","v":2.2000000000000003E-9},"C",{"$f":"'Design Regulator'!F83/1000000000","v":4.5999999999999998E-9},"C","Gate to Source Charge"]
["Qoss",{"$f":"'Design Regulator'!E84/1000000000","v":0},"C",{"$f":"'Design Regulator'!F84/1000000000","v":1E-8},"C","Output Charge"]
["Coss",{"$f":"'Design Regulator'!E85/1000000000000","v":8.2000000000000001E-11},"F",{"$f":"'Design Regulator'!F85/1000000000000","v":1.9200000000000001E-10},"F","Output Capacitance"]
["Rgate",{"$f":"'Design Regulator'!E86","v":0.5},"W",{"$f":"'Design Regulator'!F86","v":0.5},"W","Gate Resistance"]
["Gfs",{"$f":"'Design Regulator'!E87","v":45},"S",{"$f":"'Design Regulator'!F87","v":84},"S","Transconductance"]
["Vth",{"$f":"'Design Regulator'!E88","v":2},"V",{"$f":"'Design Regulator'!F88","v":2},"V","Threshold Voltage"]
["Vsp",{"$f":"Vth_Q1+(Iout/Number_of_Phases)/Gfs_Q1","v":2.2666666666666666},"V",{"$f":"Vth_Q2+(Iout/Number_of_Phases)/Gfs_Q2","v":2.1428571428571428},"V","Switch Point Voltage of FETs"]
[]
["Vsd - Buck",{"$f":"'Design Regulator'!E89","v":0.8},"V",{"$f":"'Design Regulator'!F89","v":0.8},"V","Diode Forward Voltage of MOSFET Body diode"]
["QrrTop",null,"C",{"$f":"'Design Regulator'!F90/1000000000","v":5.9999999999999995E-8},"C","Reverse Recovery Charge of Body Diode"]
["TrrTop",4.0000000000000001E-8,"s",4.0000000000000001E-8,"s","Reverse Recovery Time of Body Diode"]
["θJA-MOSFET",{"$f":"'Design Regulator'!E91","v":43},"°C/W",{"$f":"'Design Regulator'!F91","v":38},"°C/W","Junction-to-Ambient Resistance"]
[]
[]
[]
["Anti-parallel Schottky Diode (optional)"]
["VfdSky",{"$f":"'Design Regulator'!F94","v":0},"V",{"$f":"'Design Regulator'!#REF!","v":{"$error":"#REF!"}},"V","Diode Forward Voltage"]
["QrrSky",{"$f":"'Design Regulator'!F95/1000000000","v":0},"C",{"$f":"'Design Regulator'!#REF!/1000000000","v":{"$error":"#REF!"}},"C","Diode Reverse Recovery Charge"]
["Ireverse",0,"A",0,"A","Reverse Leakage Current"]
[]
["Controller"]
["θJACtrl",34.1,"°C/W",null,null,"Junction-to-ambient thermal resistance of controller"]
["Outputs"]
["Top FET"]
["Tr",{"$f":"(Qgd_Q1+Qgs_Q1/2)*(RdsonDRT+Rgate1)/(VCC-Vsp_Q1)","v":1.75609756097561E-9},"s"]
["Tf",{"$f":"(Qgd_Q1+Qgs_Q1/2)*(RdsonDRT2+Rgate1)/(Vsp_Q1)","v":1.4117647058823532E-9},"s"]
[]
["IC Power Disipation","Value","Units"]
["Power Dis",{"$f":"CHOOSE(Ext_VCC, (Qg_Q1+Qg_Q2)*Fsw*VCC, (Qg_Q1+Qg_Q2)*Fsw*Vin)","v":3.4439999999999998E-2},"W"]
["Temp rise",{"$f":"B361*ThetaJaCtrl","v":1.174404},"°C"]
["Junction temperature",{"$f":"B362 + Ta","v":26.174403999999999},"°C"]
[]
["Current (switching)",{"$f":"(Qg_Q1+Qg_Q2)*Fsw+Iq","v":2.0521999999999997E-3},"A"]
["Qrr Current",{"$f":"Qrr_Q2*Fsw","v":5.9999999999999993E-3},"A"]
["Diode Current",{"$f":"C367/Vin","v":{"$error":"#NAME?"}},{"$f":"Deadtime*Fsw*(Ipp/2)*(Vsd_Q1+Vsd_Q2)","v":{"$error":"#NAME?"}}]
["Total Application Switching IQ",{"$f":"SUM(B365:B367)","v":{"$error":"#NAME?"}},"A"]
[]
["Low-side MOSFET/Diode"]
["Part Power"]
["Power Dis"]
[]
["SCHEMATIC LABELS"]
[{"$f":"\"RC1 = \"&'Design Regulator'!D69&\"kΩ\"","v":"RC1 = 3.3kΩ"},{"$f":"'Design Regulator'!D69&\" kΩ\"","v":"3.3 kΩ"},null,{"$f":"'Design Regulator'!D72&\"kΩ\"","v":"kΩ"}]
[{"$f":"\"RC2 = \"&'Design Regulator'!D72&\"kΩ\"","v":"RC2 = kΩ"},{"$f":"'Design Regulator'!D72&\"kΩ\"","v":"kΩ"}]
[]
[{"$f":"\"Lo = \"&'Design Regulator'!E27&\"µH\"","v":"Lo = 3.3µH"},{"$f":"'Design Regulator'!E27&\" µH\"","v":"3.3 µH"},null,{"$f":"IF(MODE = 1, 'Design Regulator'!I27&\"µH\", 'Design Regulator'!E27&\"µH\")","v":"µH"}]
[{"$f":"\"Rdcr = \"&Rdcr*1000&\"mΩ\"","v":"Rdcr = 14mΩ"},{"$f":"Rdcr*1000&\" mΩ\"","v":"14 mΩ"},null,{"$f":"IF(MODE=1, Rdcr2*1000&\"mΩ\", Rdcr*1000&\"mΩ\")","v":"0mΩ"}]
[{"$f":"\"Rs = \"&'Design Regulator'!E18&\"mΩ\"","v":"Rs = 3.5mΩ"},{"$f":"'Design Regulator'!E18&\" mΩ\"","v":"3.5 mΩ"},null,{"$f":"IF(MODE = 1, 'Design Regulator'!I18&\"mΩ\", 'Design Regulator'!E18&\"mΩ\")","v":"mΩ"}]
[]
["IC",{"$f":"IF(VIN_max>42,\"LM5148(-Q1)\",\"LM25148(-Q1)\")","v":"LM25148(-Q1)"}]
[]
[{"$f":"IF((INFILTER_TYPE=1),\"AEF IS DISABLED!\",\"AEF\")","v":"AEF IS DISABLED!"},{"$f":"IF((INFILTER_TYPE=1),\"\",\"0.1µF\")","v":""},{"$f":"IF((INFILTER_TYPE=1),\"\",\"0.47Ω\")","v":""},{"$f":"IF((INFILTER_TYPE=1),\"\",\"3Ω\")","v":""},{"$f":"IF((INFILTER_TYPE=1),\"\",\"50kΩ\")","v":""}]
[{"$f":"\"LAEF =\"&L_infilter&\" uF\"","v":"LAEF =0.68 uF"},{"$f":"IF((INFILTER_TYPE=1),\"\",L_infilter&\"µH\")","v":""}]
[{"$f":"\"Cinj =\"&CinjSel*1000000&\" uF\"","v":{"$error":"#REF!"}},{"$f":"IF((INFILTER_TYPE=1),\"\",CinjSel*1000000&\"µF\")","v":""}]
[{"$f":"\"Cdamp =\"&CdampSel*1000000&\" uF\"","v":{"$error":"#REF!"}},{"$f":"IF((INFILTER_TYPE=1),\"\",IF(OSC=1,\"DNP\",CdampSel*1000000&\"µF\"))","v":""}]
[{"$f":"\"Rdamp =\"&RdampSel&\"Ω\"","v":{"$error":"#REF!"}},{"$f":"IF((INFILTER_TYPE=1),\"\",RdampSel&\"Ω\")","v":""}]
[{"$f":"\"Rcomp =\"&Rcomp_AEF&\"Ω\"","v":"Rcomp =1000Ω"},{"$f":"IF((INFILTER_TYPE=1),\"\",Rcomp_AEF&\"Ω\")","v":""}]
[{"$f":"\"Ccomp =\"&Ccomp_AEF*1000000000000&\"pF\"","v":"Ccomp =1000pF"},{"$f":"IF((INFILTER_TYPE=1),\"\",Ccomp_AEF*1000000000000&\"pF\")","v":""}]
[{"$f":"\"Csen =\"&Csen_AEF*1000000&\"µF\"","v":"Csen =0.1µF"},{"$f":"IF((INFILTER_TYPE=1),\"\",Csen_AEF*1000000&\"µF\")","v":""}]
[null,"CDAMP"]
[]
[{"$f":"\"VOUT = \"&'Design Regulator'!E9&\"V\"","v":"VOUT = 7.4V"},{"$f":"'Design Regulator'!E9&\" V\"","v":"7.4 V"},null,{"$f":"IF(MODE=1, 'Design Regulator'!I10&\"V\", \"\")","v":"V"}]
[]
[{"$f":"\"COUT = \"&'Design Regulator'!$E$34&\"µF\"","v":"COUT = 150µF"},{"$f":"ROUND('Design Regulator'!$E$34/Number_of_Phases, 0)&\" µF\"","v":"150 µF"},null,{"$f":"IF(MODE=1, 'Design Regulator'!$I$34&\"µF\", ROUND('Design Regulator'!$E$34/Number_of_Phases, 0)&\"µF\")","v":"µF"}]
["Capacitance per component (Cout)",{"$f":"\"22µF\"","v":"22µF"}]
["# of output caps",{"$f":"ROUNDUP(Cout*1000000/22,0)&\" x\"","v":"7 x"}]
[]
["CIN",{"$f":"Cin*1000000&\"µF\"","v":"160µF"}]
["Capacitance per component (Cin)",{"$f":"\"10µF\"","v":"10µF"}]
["# of input caps",{"$f":"ROUNDUP(Cin*1000000/10,0)&\" x\"","v":"16 x"}]
["Cd",{"$f":"CHOOSE(INFILTER_TYPE,\"\",4*Cin*1000000&\"µF\")","v":""}]
["Rd",{"$f":"CHOOSE(INFILTER_TYPE,\"\",D300&\"Ω\")","v":""}]
[]
[{"$f":"\"RC1 = \"&Rcea1_u/1000&\"kΩ\"","v":"RC1 = 3.3kΩ"},{"$f":"IF(COMP_TYPE=1,\"100 kΩ\",ROUND(Rcea1_u/1000,2)&\" kΩ\")","v":"3.3 kΩ"}]
[{"$f":"\"CC1 = \"&Cc1ea_u*10^9&\"nF\"","v":"CC1 = 10nF"},{"$f":"IF(COMP_TYPE=1,\"\",Cc1ea_u*10^9&\" nF\")","v":"10 nF"}]
[{"$f":"\"CC2 = \"&IF(Cc2ea_u>0, Cc2ea_u*10^12&\"pF\", \"OPEN\")","v":"CC2 = 10pF"},{"$f":"IF(COMP_TYPE=1,\"\",IF(Cc2ea_u>0, ROUND(Cc2ea_u*10^12,1)&\" pF\", \"N/A\"))","v":"10 pF"}]
[]
[{"$f":"\"gm = \"&$B$199*1000&\"mS\"","v":"gm = 1.2mS"},{"$f":"$B$199*1000&\"mS\"","v":"1.2mS"}]
[{"$f":"\"RoEA = \"&RoEA/1000000&\"MΩ\"","v":"RoEA = 64MΩ"},{"$f":"RoEA/1000000&\"MΩ\"","v":"64MΩ"}]
[{"$f":"\"GBW = \"&GBW&\"MHz\"","v":"GBW = 6MHz"},{"$f":"GBW&\"MHz\"","v":"6MHz"}]
[]
[{"$f":"\"Cslope = \"&Cslope&\"pF\"","v":{"$error":"#NAME?"}},{"$f":"ROUND(Cslope*1,0)&\"pF\"","v":{"$error":"#NAME?"}}]
["Cd",{"$f":"IF(DITHER=1, ROUND(Cdither*1000000000,1)&\"nF\", \"\")","v":"2.2nF"},{"$f":"IF(DITHER=1, \"Cd\", \"\")","v":"Cd"}]
[{"$f":"\"RFB1 = \"&'Design Regulator'!E64&\"kΩ\"","v":"RFB1 = 100kΩ"},{"$f":"IF(VOUT_setting=1, 'Design Regulator'!E64&\" kΩ\", \"\")","v":"100 kΩ"},null,{"$f":"'Design Regulator'!I64&\"kΩ\"","v":"kΩ"}]
[{"$f":"\"RFB2 = \"&IF(Vout=Vref,\"OPEN\",'Design Regulator'!E65&\"kΩ\")","v":"RFB2 = 12.1kΩ"},{"$f":"IF(VOUT_setting=1, IF(Vout=Vref,\"OPEN\",Rfb2_u/1000&\" kΩ\"), \"\")","v":"12.1 kΩ"},null,{"$f":"IF(Vout2=Vref,\"OPEN\",Rfb4_u/1000&\"kΩ\")","v":"0kΩ"}]
[{"$f":"\"RFBSET = \"&CHOOSE(VOUT_setting,\"\",\"24.9kΩ\",\"0Ω\",\"48.7kΩ\")","v":"RFBSET = "},null,null,{"$f":"CHOOSE(VOUT_setting,\"\",\"24.9kΩ\",\"0Ω\",\"48.7kΩ\")","v":""}]
[]
["RENT",{"$f":"IF((UVLO_TYPE=1),B187&\" kΩ\",\"0Ω\")","v":"0Ω"}]
["RENB",{"$f":"IF((UVLO_TYPE=1),B188&\" kΩ\",\"\")","v":""}]
[]
[{"$f":"CHOOSE(BODE_PLOT_TYPE, \"Crossover Frequency = \"&ROUND('Stability Calculations'!U4,1)&\" kHz\",  \"Fsw Attenuation = \"&ROUND('Input Filter Calculations'!W97,1)&\" dB\")","v":"Crossover Frequency = 15.1 kHz"},{"$f":"CHOOSE(BODE_PLOT_TYPE, ROUND('Stability Calculations'!U4,1)&\" kHz\", ROUND(#REF!,1)&\" kHz\")","v":"15.1 kHz"},null,{"$f":"'Stability Calculations'!U4","v":15.135999999999999}]
[{"$f":"CHOOSE(BODE_PLOT_TYPE, \"Phase Margin = \"&ROUND('Stability Calculations'!U5,0)&\"°\", \"°\")","v":"Phase Margin = 86°"},{"$f":"CHOOSE(BODE_PLOT_TYPE, ROUND('Stability Calculations'!U5,0)&\"°\", ROUND(#REF!,0)&\"°\")","v":"86°"}]
[{"$f":"IF(loopPM<45,CHOOSE(COMP_TYPE,\"Phase Margin too low, Increase COUT\",\"Phase Margin too low, Re-compensate\"),\"\")","v":""}]
[]
["Full-load/high line efficiency",{"$f":"IF(PLOT_TYPE=1, ROUND('Efficiency Calculations'!AZ109,1)&\"%\", ROUND(#REF!,1)&\"%\")","v":"92%"}]
["Half-load/mid-line efficiency",{"$f":"IF(PLOT_TYPE=1, ROUND('Efficiency Calculations'!AZ59,1)&\"%\", ROUND(#REF!,1)&\"%\")","v":"94.8%"}]
["OSC pin setting",{"$f":"IF(VOUT_setting=1, \"\", IF(OSC=1, \"Tie OSC to VDDA\", \"Tie OSC to AGND\"))","v":""}]
[]
[{"$f":"\"CDITH = \"&Cdither*1000000000&\"nF\"","v":"CDITH = 2.2nF"},{"$f":"Cdither*1000000000&\"nF\"","v":"2.2nF"}]
[{"$f":"\"Rs = \"&Rs&\"Ω\"","v":"Rs = 0.0035Ω"},{"$f":"'Standard Value Calculator'!S6&\"Ω\"","v":"Ω"}]
["Rset",{"$f":"'Standard Value Calculator'!S16&\"mΩ\"","v":"2.8mΩ"}]
["Rs",{"$f":"'Standard Value Calculator'!S6&\"mΩ\"","v":"mΩ"}]
[{"$f":"\"Rshunt = \"&ROUND(Rshunt,1)&\"mΩ\"","v":{"$error":"#NAME?"}},{"$f":"IF(Rshunt=\"0\", \"N/A\",ROUND(Rshunt,1)&\"mΩ\")","v":{"$error":"#NAME?"}}]
[]
["Rpgood","20kΩ"]
["RDAMP"]
[]
["VCCX",{"$f":"IF((Ext_VCC=1),\"5V\",\"GND\")","v":"GND"}]
["RCNFG",{"$f":" 'Design Regulator'!E56&\" kΩ\"","v":"41.2 kΩ"}]
["Rt",{"$f":" Rfadj&\" kΩ\"","v":"221 kΩ"},{"$f":"Rfadj","v":221},{"$f":"Fsw","v":100000},null,{"$f":"OR((Fsw=440000),(Fsw=2200000))","v":false},null,{"$f":"OR(OR(AND(OSC=1, OR(Fsw/1000>2530, Fsw/1000<1800)), AND(OSC=2, OR(Fsw/1000>500, Fsw/1000<300))), OR((Fsw=440000),(Fsw=2200000)))","v":true}]
["Css",{"$f":"'Standard Value Calculator'!B4*1000000000&\"nF\"","v":"0nF"},{"$f":"IF(MODE=1,\"Css\",\"\")","v":"Css"}]
["Cres",{"$f":"IF(Cres_u = 0, \"N/A\", Cres_u*1000000000 &\"nF\")","v":"82nF"},{"$f":"IF(Cres_u = 0, \"N/A\", Cres_u*1000000 &\"µF\")","v":"0.082µF"},{"$f":"Cres_u","v":8.2000000000000006E-8}]
[]
["Blank out",{"$f":"IF(B76=\"y\",\"\",\"|\")","v":"|"}]
["OUTPUT CURRENT",{"$f":"'Design Regulator'!$E$10&\" A\"","v":"12 A"},null,{"$f":"IF(MODE=1,'Design Regulator'!#REF!&\"A\",\"\")","v":{"$error":"#REF!"}}]
["VIN",{"$f":"VIN_nom&\" V\"","v":"16.8 V"}]
["VIN range",{"$f":"VIN_min&\"V\"&\"...\"&VIN_max&\"V\"","v":"9V...36V"}]
[null,{"$f":"IF(INFILTER_TYPE=1,B449,\"\")","v":"9V...36V"},{"$f":"IF(INFILTER_TYPE=1,\"\",B449)","v":""}]

{"sheet":"Schematic Management","index":6,"n_rows":17,"n_cols":14,"rows_kept":17,"cut":false,"hidden":true,"merged":[]}
[null,null,null,null,null,null,null,null,null,null,null,null,null,"3.3V or 5V fixed (FB1/2)"]
[{"$f":"IF(MODE=1, CHOOSE(SCH_SETTING, \"SCH_SetVout_IntComp_nAEF\",\"SCH_SetVout_IntComp_AEF\",\"SCH_SetVout_ExtComp_nAEF\",\"SCH_SetVout_ExtComp_AEF\",\"SCH_AdjVout_IntComp_nAEF\",\"SCH_AdjVout_IntComp_AEF\",\"SCH_AdjVout_ExtComp_nAEF\",\"SCH_AdjVout_ExtComp_AEF\"))","v":"SCH_AdjVout_ExtComp_nAEF"},null,null,null,null,null,null,null,null,"With/without dither (DITH)",null,null,null,"With/without VOUT connected to VCCX"]
[null,null,null,null,null,null,null,null,null,"FPWM or DEM (DEMB)"]
[null,null,null,null,null,null,null,null,null,"Shunt or inductor DCR current sensing"]
[]
[]
[]
[]
[]
[]
[]
[]
[]
[]
[]
[]
[null," "]

{"sheet":"Stability Calculations","index":7,"n_rows":687,"n_cols":35,"rows_kept":687,"cut":false,"hidden":true,"merged":[[9,1,10,1],[1,0,1,3],[1,9,1,11],[9,0,11,0],[9,18,9,19],[1,19,1,21],[10,6,10,7],[1,4,1,6],[9,2,9,7],[9,8,9,13],[9,20,9,22],[9,14,9,17],[1,12,1,14],[1,15,1,18],[9,27,9,28],[9,30,9,31],[10,2,10,3],[10,4,10,5],[10,8,10,9],[10,10,10,11],[10,12,10,13],[10,18,10,19],[10,14,10,15],[10,16,10,17]]}
[]
["Divider Network & EA Poles/Zeros",null,null,null,"Modulator",null,null,null,null,"Power Stage Poles/Zeros",null,null,"Complex Pole Pair",null,null,"Feedback natural frequencies",null,null,null,"Total System"]
[null,"Afb1",{"$f":"Afb","v":0.10810810810810811},"V/V","Acs",{"$f":"Acs","v":28.571428571428569},"A/V","gm",{"$f":"gm","v":1.1999999999999999E-3},"z_ESR",{"$f":"Fesr","v":53051.647757918792},"Hz","p3",{"$f":"Fsw/2","v":50000},"Hz","zterm1",{"$f":"((1/wffHz)+(1/wfftHz))","v":2.7671148061200001E-7},null,null,"Adc",{"$f":"IF(VOUT_setting=1,Am*Afb*AEA,Am*AEA)","v":110530.03376864965},"V/V"]
[null,"EA zero, z1",{"$f":"Fz1_u","v":4822.8770689017083},"Hz","Am",{"$f":"Am","v":13.312536619270954},"V/V",null,null,"p_dom",{"$f":"Fp_dominant","v":2277.1939080607376},"Hz","pterm1",{"$f":"Q*pole3","v":91937.337090785615},null,"pterm3",{"$f":"((1/wfbtHz)+(1/wffHz)+(1/wfftHz)+(Afbr/wffHz))","v":2.0401575367111736E-6},null,null,"Crossover",{"$f":"AI7","v":15.135999999999999},"kHz"]
[null,"EA pole, p1",{"$f":"Fp1_u","v":0.24866677698455608},"Hz","Q",{"$f":"Q","v":1.8387467418157124},null,null,null,null,null,null,"pterm2",{"$f":"pole3^2","v":2500000000},null,"pterm4",{"$f":"1/(wffHz*wfbtHz)","v":6.3749748601826958E-14},null,null,"Phase Margin",{"$f":"AI9","v":85.781830926800794},"°"]
[null,"Aea",{"$f":"AEA","v":76800},"V/V","mc",{"$f":"mc","v":1.2279635258358663},null,null,null,null,null,null,null,null,null,"Afbr",{"$f":"Rfb1_/Rfb2_u","v":8.2644628099173545},null,null,"radconv",{"$f":"180/Pi","v":57.295779578552292},null,null,null,null,null,null,null,null,null,null,null,null,"XOVER SEARCH"]
[null,"EA pole, p2",{"$f":"Fp2_u","v":1152943.6009048077},"Hz","k",{"$f":"k","v":0.67311241363951535},null,null,null,null,null,null,null,null,null,null,null,null,null,null,null,null,null,null,null,null,null,null,null,null,null,null,null,"xover",{"$f":"SUM(AH12:AH613)/1000","v":15.135999999999999}]
[]
[null,null,null,null,null,null,null,null,null,null,null,null,null,null,null,null,null,null,null,null,null,null,null,null,null,null,null,null,null,null,null,null,null,"phase margin",{"$f":"SUM(AI13:AI613)","v":85.781830926800794}]
["Freq (Hz)",null,"Power Stage",null,null,null,null,null,"Error Amplifier",null,null,null,null,null,"Feedback Gain",null,null,null,"Sampling Double Pole",null,"System Response",null,null,null,null,null,null,"ERROR AMP Response",null,null,"PLANT Response"]
[null,null,"p_dom",null,"z_ESR",null,"z_RHP",null,"p1",null,"z1",null,"p2",null,"z1",null,"p1p2",null,"p3"]
[null,null,"Gain(V/V)","Phase(rad)","Gain(V/V)","Phase(rad)","Gain(V/V)","Phase(rad)","Gain(V/V)","Phase(rad)","Gain(V/V)","Phase(rad)","Gain(V/V)","Phase(rad)","Gain(V/V)","Phase(rad)","Gain(V/V)","Phase(rad)","Gain(V/V)","Phase(rad)","Gain (dB)","Phase (°)","Phase Margin (°)",null,null,"Fsquare",null,"Gain(dB)","Phase(Deg)",null,"Gain(dB)","Phase(Deg)"]
[1,{"$f":"A13/1000","v":1E-3},{"$f":"SQRT(1+(A13/pole1)^2)","v":1.0000000964206284},{"$f":"ATAN(A13/pole1)","v":4.3913692732964809E-4},{"$f":"SQRT(1+(A13/Zero1)^2)","v":1.000000000177653},{"$f":"ATAN(A13/Zero1)","v":1.8849555897767548E-5},{"$f":"IF(VIN_nom>Vout, 1, SQRT(1+(A13/z_RHP)^2))","v":1},{"$f":"IF(VIN_nom>Vout, 0, -ATAN(A13/z_RHP))","v":0},{"$f":"SQRT(1+(A13/Pole2)^2)","v":4.1439145050468813},{"$f":"ATAN(A13/Pole2)","v":1.3270728548941362},{"$f":"SQRT(1+(A13/Zero2)^2)","v":1.0000000214959981},{"$f":"ATAN(A13/Zero2)","v":2.073451119286066E-4},{"$f":"SQRT(1+(A13/pole4)^2)","v":1.0000000000003761},{"$f":"ATAN(A13/pole4)","v":8.6734511489978235E-7},{"$f":"IF(VOUT_setting=1,1,SQRT(1+(A13*zterm1)^2))","v":1},{"$f":"IF(VOUT_setting=1,0,ATAN(((A13*zterm1))))","v":0},{"$f":"IF(VOUT_setting=1,1,SQRT((1+Afbr-pterm4*(A13)^2)^2+(A13*$Q$4)^2))","v":1},{"$f":"IF(VOUT_setting=1,0,ATAN(A13*$Q$4/(1+Afbr-$Q$5*(A13)^2)))","v":0},{"$f":"SQRT((1-(Z13/pterm2))^2+(A13/pterm1)^2)","v":0.9999999996591542},{"$f":"IF((ATAN((A13/pterm1)/(1-A13^2/pterm2))>0),ATAN((A13/pterm1)/(1-A13^2/pterm2)),PI()+ATAN((A13/pterm1)/(1-A13^2/pterm2)))","v":1.087697373019507E-5},{"$f":"20*LOG10(((E13*K13*G13*O13)/(C13*I13*S13*M13*Q13))*Adc)","v":88.521389673720478},{"$f":"((F13+L13+H13+P13)-(D13+J13+T13+N13+R13))*radconv","v":-76.048547371361835},{"$f":"IF(V13>0,V13,V13+180)","v":103.95145262863817},null,{"$f":"IF(U13<0,A13,1000000000)","v":1000000000},{"$f":"A13^2","v":1},null,{"$f":"20*LOG10((K13/(I13*M13))*AEA)","v":85.359008853219777},{"$f":"(L13-(J13+N13))*radconv","v":-76.0238434740793},null,{"$f":"20*LOG10((E13*G13/(C13*S13))*Acs*Am)","v":51.603854588275844},{"$f":"(F13+H13-(D13+T13))*radconv","v":-2.4703897282537125E-2},null,{"$f":"SUM((U14<0)*(U13>0))*A13","v":0},{"$f":"IF(AH13>0,W11,0)","v":0}]
[1.0965,{"$f":"A14/1000","v":1.0965E-3},1.0000001159277014,4.8151363455501187E-4,1.0000000002135943,2.0668538041406881E-5,1,0,4.521485008332915,1.3477861275212253,1.0000000258449018,2.2735391457055697E-4,1.0000000000004521,9.5104391848756312E-7,1,0,{"$f":"IF(VOUT_setting=1,1,SQRT((1+Afbr-pterm4*(A14)^2)^2+(A14*$Q$4)^2))","v":1},0,0.99999999959019703,1.1926601696028895E-5,87.763983372876027,-77.23657277552546,102.76342722447454,null,1000000000,1.2023122500000001,null,84.601602720900473,-77.209484952513861,null,51.603854419750718,-2.7087823011597029E-2,null,0,0]
[1.2022999999999999,1.2022999999999999E-3,1.0000001393784537,5.279743126080181E-4,1.0000000002568017,2.2662821054690099E-5,1,0,4.9373145163753209,1.3668461017535078,1.0000000310730088,2.4929102648012187E-4,1.0000000000005436,1.0428090316438918E-6,1,0,{"$f":"IF(VOUT_setting=1,1,SQRT((1+Afbr-$Q$5*(A15)^2)^2+(A15*$Q$4)^2))","v":1},0,0.99999999950729879,1.3077385517914286E-5,86.999789250109558,-78.329990883561379,101.67000911643862,null,1000000000,1.4455252899999997,null,83.837408800729278,-78.300289388724735,null,51.60385421715543,-2.9701494836647139E-2,null,0,0]
[1.3183,1.3183000000000001E-3,1.0000001675708394,5.7891418383876608E-4,1.0000000003087455,2.4849369537855247E-5,1,0,5.3949612847207327,1.3843600192883516,1.000000037358215,2.7334305816493094E-4,1.0000000000006537,1.1434210649721716E-6,1,0,1,0,0.99999999940763917,1.43391144723313E-5,86.229838281946598,-79.334957778311718,100.66504222168828,null,1000000000,1.7379148900000001,null,83.067458076125405,-79.302390632097143,null,51.60385397359633,-3.2567146214574814E-2,null,0,0]
[1.4454,1.4454000000000001E-3,1.0000002014401494,6.3472847032302335E-4,1.0000000003711489,2.724514809111866E-5,1,0,5.8979907608948903,1.4004240321582255,1.0000000449090336,2.9969662010373633E-4,1.0000000000007858,1.2536606290758029E-6,1,0,1,0,0.99999999928791161,1.5721577835798118E-5,85.455522945892852,-80.256994151608836,99.743005848391164,null,1000000000,2.0891811599999999,null,82.29314303267472,-80.221287141022287,null,51.603853680993268,-3.5707010586552811E-2,null,0,0]
[1.5849,1.5849E-3,1.0000002421997307,6.9598804848442246E-4,1.0000000004462477,2.9874661137022335E-5,1,0,6.4515614565114126,1.4151676223127549,1.0000000539959688,3.2862126077552782E-4,1.0000000000009448,1.3746552726041438E-6,1,0,1,0,0.99999999914382687,1.7238915674383773E-5,84.676307657770749,-81.103535508287251,98.896464491712749,null,1000000000,2.51190801,null,81.513928096681965,-81.064382305358819,null,51.60385332886392,-3.9153202928432204E-2,null,0,0]
[1.7378,1.7378000000000001E-3,1.0000002911853361,7.6313205322600924E-4,1.0000000005365026,3.2756758231303945E-5,1,0,7.059652644641484,1.4286682742679131,1.0000000649168133,3.603243250791488E-4,1.000000000001136,1.5072723406720785E-6,1,0,1,0,0.99999999897066338,1.8902004962099704E-5,83.893937441753337,-81.879034257583854,98.120965742416146,null,1000000000,3.0199488400000001,null,80.73155830385997,-81.836103830562308,null,51.603852905668496,-4.2930427021537911E-2,null,0,0]
[1.9055,1.9055000000000001E-3,1.0000003500965313,8.3677527351350687E-4,1.0000000006450451,3.5917828752004253E-5,1,0,7.7278395157872524,1.4410301658660325,1.0000000780504676,3.9509609588366012E-4,1.0000000000013658,1.652726116440445E-6,1,0,1,0,0.99999999876241297,2.0726073462547837E-5,83.108441817544062,-82.589477373079546,97.410522626920454,null,1000000000,3.63093025,null,79.946063188595062,-82.542404104914027,null,51.60385239672415,-4.7073268165536704E-2,null,0,0]
[2.0893000000000002,2.0893000000000001E-3,1.0000004208927984,9.1748858380350884E-4,1.0000000007754857,3.938237712150969E-5,1,0,8.4613073202545088,1.4523344073754136,1.0000000938337792,4.3320612146099176E-4,1.0000000000016418,1.8121441485585863E-6,1,0,1,0,0.99999999851214882,2.2725261242070484E-5,82.320853849003356,-83.239528866317059,96.760471133682941,null,1000000000,4.3651744900000002,null,79.158475831675915,-83.18791502509346,null,51.603851785102577,-5.1613841223601194E-2,null,0,0]
[2.2909000000000002,2.2909000000000002E-3,1.0000005060368367,1.0060185120985218E-3,1.0000000009323617,4.3182447584468892E-5,1,0,9.2668442965528719,1.4626741842167241,1.0000001128157825,4.7500688799889435E-4,1.000000000001974,1.9870009237217947E-6,1,0,1,0,0.9999999982111657,2.4918059156672254E-5,81.530965342749141,-83.834549753481738,96.165450246518262,null,1000000000,5.2482228100000006,null,78.36858806099616,-83.777955610934086,null,51.603851049528124,-5.6594142547643944E-2,null,0,0]
[2.5118999999999998,2.5118999999999996E-3,1.0000006083794521,1.1030676712758909E-3,1.000000001120926,4.7348199429827444E-5,1,0,10.150847115374729,1.4721223350289441,1.0000001356320365,5.2083014702314129E-4,1.0000000000023732,2.1786841941138624E-6,1,0,1,0,0.99999999784938565,2.7321870365183745E-5,80.739556240309156,-84.378733978607542,95.621266021392458,null,1000000000,6.309641609999999,null,77.577179842712113,-84.316680280589736,null,51.603850165372187,-6.2053698017795034E-2,null,0,0]
[2.7542,2.7542000000000001E-3,1.0000007314097861,1.2094704132509645E-3,1.0000000013476067,5.1915446813138924E-5,1,0,11.120917970684349,1.4807540704029145,1.000000163060411,5.7106985337832385E-4,1.0000000000028533,2.3888419154530356E-6,1,0,1,0,0.99999999741447465,2.9957361118838074E-5,79.946788404660353,-84.876415250532702,95.123584749467298,null,1000000000,7.5856176399999997,null,76.78441306994398,-84.808375805966207,null,51.603849102491509,-6.8039444566500198E-2,null,0,0]
[3.02,3.0200000000000001E-3,1.0000008793943533,1.3261928282861785E-3,1.0000000016202653,5.6925658756510226E-5,1,0,12.18586717998469,1.488641666017039,1.0000001960520839,6.2618216515512165E-4,1.0000000000034306,2.619382246992009E-6,1,0,1,0,0.99999999689135066,3.2848460761366853E-5,79.152471355419252,-85.331762981937175,94.668237018062825,null,1000000000,9.1204000000000001,null,75.990097299167388,-85.257157251798219,null,51.603847824027007,-7.4605730138942825E-2,null,0,0]
[3.3113000000000001,3.3113000000000001E-3,1.0000010572234959,1.45411317605602E-3,1.0000000019479118,6.2416534370615404E-5,1,0,13.353709352509544,1.4958405986706749,1.0000002356973106,6.8658177108471975E-4,1.0000000000041243,2.8720398789604729E-6,1,0,1,0,0.99999999626272629,3.6016923242200601E-5,78.357560578777424,-85.747981505747219,94.252018494252781,null,1000000000,10.964707690000001,null,75.19518805882231,-85.666179544029816,null,51.603846287730249,-8.1801961717401173E-2,null,0,0]
[3.6307999999999998,3.6308E-3,1.000001271084302,1.5944171071460523E-3,1.0000000023419462,6.843896745486642E-5,1,0,14.635269921107803,1.5024149600022383,1.0000002833754429,7.5282850095684814E-4,1.0000000000049587,3.149156643168509E-6,1,0,1,0,0.99999999550673013,3.9492116393067053E-5,77.561582801917112,-86.12877776007069,93.87122223992931,null,1000000000,13.182708639999998,null,74.399212129542164,-86.039082921341318,null,51.603844440150091,-8.9694838729383164E-2,null,0,0]
[3.9811000000000001,3.9811000000000004E-3,1.0000015281846009,1.7482463526748309E-3,1.0000000028156484,7.5041966852628804E-5,1,0,16.040978931020472,1.508415541978023,1.000000340693399,8.2546144944221434E-4,1.0000000000059615,3.4529876369146658E-6,1,0,1,0,0.99999999459788258,4.3302320349123184E-5,76.764978443095387,-86.477095380277902,93.522904619722098,null,1000000000,15.849157210000001,null,73.602609991853456,-86.378746790395994,null,51.603842219017075,-9.8348589881899068E-2,null,0,0]
[4.3651999999999997,4.3651999999999996E-3,1.0000018372906792,1.9169182904425716E-3,1.0000000033851704,8.2282081228987427E-5,1,0,17.582875596559543,1.5138921031237977,1.0000004096055419,9.0510264840477613E-4,1.0000000000071674,3.7861348955433878E-6,1,0,1,0,0.99999999350519475,4.7480166036141927E-5,75.967795671875109,-86.79582393898103,93.20417606101897,null,1000000000,19.054971039999998,null,72.805429891052171,-86.687986614003535,null,51.603839548598089,-0.10783732497749211,null,0,0]
[4.7862999999999998,4.7862999999999994E-3,1.0000022088657974,2.1018381152664639E-3,1.0000000040697907,9.0219629159386656E-5,1,0,19.273806114933585,1.5188891324035076,1.0000004924445614,9.9241559763943313E-4,1.0000000000086171,4.1513739234220208E-6,1,0,1,0,0.99999999219167868,5.2060459776082834E-5,75.170241531004351,-87.08755365932673,92.91244634067327,null,1000000000,22.908667689999998,null,72.007878960279754,-86.969313565322494,null,51.60383633849974,-0.11824009400422067,null,0,0]
[5.2481,5.2481000000000003E-3,1.0000026556669237,2.3046305762411635E-3,1.000000004893014,9.8924353996097846E-5,1,0,21.128628264495823,1.5234494898062325,1.0000005920545114,1.0881674680037264E-3,1.0000000000103599,4.551913897475251E-6,1,0,1,0,0.99999999061223854,5.7083446379741549E-5,74.372162209104843,-87.35478786714603,92.64521213285397,null,1000000000,27.542553609999999,null,71.209803498366824,-87.225139569059877,null,51.603832478513169,-0.12964829808615233,null,0,0]
[5.7544000000000004,5.7544000000000007E-3,1.0000031927828279,2.5269643183621041E-3,1.0000000058826408,1.0846788404557493E-4,1,0,23.162605087118028,1.52760986702755,1.0000007117993053,1.1931461629935002E-3,1.0000000000124554,4.9910507291391157E-6,1,0,1,0,0.9999999887135349,6.2590458357758699E-5,73.573836599738186,-87.599677757532561,92.400322242467439,null,1000000000,33.113119360000006,null,70.411482529228266,-87.457521949814648,null,51.603827838285063,-0.14215580771790121,null,0,0]
[6.3095999999999997,6.3095999999999994E-3,1.0000038385994769,2.7707714441989697E-3,1.0000000070725479,1.1893315734586637E-4,1,0,25.393413070225847,1.53140584999431,1.0000008557779447,1.3082639905840818E-3,1.0000000000149747,5.4726007369184048E-6,1,0,1,0,0.9999999864305732,6.862935440842845E-5,72.775158778511752,-87.824318892594277,92.175681107405723,null,1000000000,39.811052159999996,null,69.612810287309287,-87.668447578269976,null,51.603822258977601,-0.15587131432430482,null,0,0]
[6.9183000000000003,6.9183000000000005E-3,1.0000046149580388,3.038071852585849E-3,1.0000000085029774,1.3040688184373883E-4,1,0,27.839535293661534,1.5348684581310295,1.0000010288597496,1.4344747244971667E-3,1.0000000000180034,6.0005537083406495E-6,1,0,1,0,0.99999998368614396,7.5250168629114917E-5,71.976335488799691,-88.030547766251644,91.969452233748356,null,1000000000,47.862874890000008,null,68.813993704671148,-87.859639317924703,null,51.603815551903679,-0.1709084483269403,null,0,0]
[7.5857999999999999,7.5858000000000002E-3,1.0000055484483747,3.3311927955032676E-3,1.0000000102229214,1.4298896017171005E-4,1,0,30.522270469349678,1.5380275001957568,1.0000012369727371,1.5728772755376013E-3,1.0000000000216449,6.5795065725134764E-6,1,0,1,0,0.9999999803862506,8.2510549004726508E-5,71.177232134636895,-88.220140515672213,91.779859484327787,null,1000000000,57.544361639999998,null,68.014898415059434,-88.032742385242869,null,51.603807487352604,-0.18739813042933209,null,0,0]
[8.3176000000000005,8.3176000000000014E-3,1.0000066705952693,3.6525492984304064E-3,1.0000000122904649,1.5678306486921552E-4,1,0,33.46372361673901,1.5409087714040921,1.000001487145149,1.7246120178600608E-3,1.0000000000260225,7.2142297275670846E-6,1,0,1,0,0.99999997641945126,9.0470318922404713E-5,70.378076049447401,-88.3946458909368,91.6053541090632,null,1000000000,69.182469760000004,null,67.215752024240828,-88.189169671909156,null,51.603797792981695,-0.20547621902764734,null,0,0]
[9.1201000000000008,9.1201000000000008E-3,1.0000080198719994,4.0049515355870501E-3,1.0000000147764956,1.7190983307010678E-4,1,0,36.689619455768913,1.5435372854603804,1.0000017879543746,1.8910059283780765E-3,1.0000000000312861,7.9102741822345003E-6,1,0,1,0,0.99999997164974008,9.9199091055998567E-5,69.57868815330778,-88.555579447245123,91.444420552754877,null,1000000000,83.176224010000013,null,66.416375784661327,-88.330278645486771,null,51.60378613642159,-0.22530080175834682,null,0,0]
[10,0.01,1.0000096420168025,4.3913413279933616E-3,1.0000000177652877,1.8849555676754817E-4,1,0,40.226890788548317,1.5459347726461579,1.0000021495975233,2.0734481776141685E-3,1.0000000000376144,8.6734511487825012E-6,1,0,1,0,0.99999996591542806,1.0876974118457552E-4,68.779212097467422,-88.704272470773219,91.295727529226781,null,1000000000,100,null,65.616913742699367,-88.457235098746693,null,51.603772122543191,-0.24703737202653242,null,0,0]
[10.965,1.0964999999999999E-2,1.0000115927036095,4.8150995043553524E-3,1.0000000213594229,2.0668537750037974E-4,1,0,44.106492357224809,1.5481219847803227,1.0000025844868727,2.2735352675974686E-3,1.0000000000452243,9.5104391845917638E-6,1,0,1,0,0.99999995901970173,1.1926602207889067E-4,67.979477928294443,-88.842013052886358,91.157986947113642,null,1000000000,120.23122499999999,null,64.817196425683022,-88.571136933155145,null,51.603755270386543,-0.2708761197312119,null,0,0]
[12.023,1.2022999999999999E-2,1.0000139377491983,5.2796945586521902E-3,1.0000000256801727,2.2662820670579906E-4,1,0,48.360184691138713,1.5501166853804109,1.0000031072960953,2.4929051523136046E-3,1.0000000000543725,1.0428090316064698E-5,1,0,1,0,0.99999995072988945,1.3077386192697041E-4,67.179753617449222,-88.96992063430362,91.03007936569638,null,1000000000,144.55252899999999,null,64.017492373851027,-88.672908468039097,null,51.603735011373324,-0.29701216626452354,null,0,0]
[13.183,1.3183E-2,1.000016756944959,5.7890778136458288E-3,1.0000000308745578,2.4849369031494482E-4,1,0,53.024152292738805,1.5519358783897064,1.0000037358145804,2.7334238420177858E-3,1.0000000000653706,1.1434210649228389E-5,1,0,1,0,0.9999999407639153,1.4339115361876854E-4,66.38001905540338,-89.089085284927606,90.910914715072394,null,1000000000,173.79148899999998,null,63.217782166971418,-88.763417490329545,null,51.603710656207099,-0.32566779459804801,null,0,0]
[14.454000000000001,1.4454E-2,1.0000201438140757,6.3472003178040451E-3,1.000000037114904,2.7245147423725981E-4,1,0,58.134580944220708,1.5535940126920842,1.0000044908933898,2.9969573180887374E-3,1.0000000000785834,1.2536606290107821E-5,1,0,1,0,0.99999992879115507,1.5721579008235329E-4,65.580780111343444,-89.200450666482254,90.799549333517746,null,1000000000,208.91811600000003,null,62.418572482143055,-88.843385394491349,null,51.603681396975531,-0.35706527199089444,null,0,0]
[15.849,1.5848999999999999E-2,1.0000242196827065,6.9597692331206983E-3,1.0000000446247679,2.9874660257143482E-4,1,0,63.743741047371593,1.5551078685081137,1.0000053995824627,3.2862008966437427E-3,1.000000000094484,1.3746552725184214E-5,1,0,1,0,0.99999991438269165,1.723891722010455E-4,64.780692755023182,-89.305145488562985,90.694854511437015,null,1000000000,251.19080099999999,null,61.618520337202447,-88.913619832143141,null,51.603646185595878,-0.39152565641985937,null,0,0]
[17.378,1.7378000000000001E-2,1.000029118113906,7.6311738768961579E-3,1.0000000536502591,3.2756757071414333E-4,1,0,69.891841772122092,1.556488017030166,1.0000064916604532,3.6032278127812439E-3,1.0000000001135936,1.5072723405590754E-5,1,0,1,0,0.99999989706633785,1.8902006999727401E-4,63.980881184974436,-89.403904066637836,90.596095933362164,null,1000000000,301.99488400000001,null,60.818751084449467,-88.974608197323803,null,51.603603868300112,-0.42929586931401548,null,0,0]
[19.055,1.9054999999999999E-2,1.0000350090464438,8.3675593948600961E-3,1.0000000645045191,3.5917827222875227E-4,1,0,76.635177028413622,1.5577471185899121,1.0000078050166021,3.9509406063201642E-3,1.0000000001365752,1.6527261162914689E-5,1,0,1,0,0.99999987624129894,2.0726076148834299E-4,63.180808102712788,-89.497631872546364,90.502368127453636,null,1000000000,363.09302500000001,null,60.018728893374217,-89.026910266057527,null,51.603552977113701,-0.4707216064888437,null,0,{"$f":"IF(AH45>0,W43,0)","v":0}]
[20.893000000000001,2.0893000000000002E-2,1.0000420884029737,9.1746309824478345E-3,1.0000000775485784,3.9382375105838537E-4,1,0,84.026020712510544,1.5588949705369535,1.000009383334334,4.3320343863295138E-3,1.0000000001641933,1.8121441483622085E-5,1,0,1,0,0.99999985121489943,2.2725264783086472E-4,62.381048017323707,-89.587057426060312,90.412942573939688,null,1000000000,436.51744900000006,null,59.219029965448556,-89.0709336127901,null,51.603491819650301,-0.51612381327020751,null,0,0]
[22.909000000000002,2.2909000000000002E-2,1.000050602416175,1.0059849146991607E-2,1.0000000932361848,4.3182444927199074E-4,1,0,92.132732086134567,1.5599422078195533,1.0000112815152431,4.7500335122072201E-3,1.0000000001974088,1.9870009234629091E-5,1,0,1,0,0.99999982111657715,2.4918063824812384E-4,61.580987892816822,-89.673008668854209,90.326991331145791,null,1000000000,524.82228100000009,null,58.419043391601988,-89.107086489072501,null,51.603418268989969,-0.56592217978170822,null,0,0]
[25.119,2.5118999999999999E-2,1.0000608361132044,1.1030233829854701E-2,1.0000001120925934,4.7348195926955305E-4,1,0,101.01965014773684,1.5608971009396331,1.0000135631125762,5.2082548477631746E-3,1.0000000002373333,2.1786841937725936E-5,1,0,1,0,0.99999978493857422,2.7321876518830181E-4,60.781081098377314,-89.756165122974977,90.243834877025023,null,1000000000,630.96416099999999,null,57.619225002950067,-89.135653512585506,null,51.60332986320239,-0.62051161038946945,null,0,0]
[27.542000000000002,2.7542000000000001E-2,1.0000731383307468,1.2094120335554912E-2,1.0000001347606722,5.1915442195673439E-4,1,0,110.76317822755455,1.5617679330502683,1.0000163059094758,5.7106370765220623E-3,1.0000000002853282,2.388841915003177E-5,1,0,1,0,0.99999974144748105,2.9957369230539213E-4,59.981207672764754,-89.837245551164614,90.162754448835386,null,1000000000,758.56176400000004,null,56.819457851232556,-89.156884547307968,null,51.603223589307333,-0.68036100385664011,null,0,0]
[30.2,3.0199999999999998E-2,1.0000879356076655,1.3261158641421071E-2,1.0000001620265184,5.6925652669023155E-4,1,0,121.45178423070945,1.5625625136343619,1.0000196050181445,6.2617406290077183E-3,1.000000000343058,2.6193822463989324E-5,1,0,1,0,0.99999968913508663,3.2848471455519283E-4,59.180938691664636,-89.916980057321794,90.083019942678206,null,1000000000,912.04,null,56.01931669608841,-89.17096684352353,null,51.603095763351369,-0.74601321379825791,null,0,0]
[33.113,3.3112999999999997E-2,1.0001057168174456,1.4540117256373695E-2,1.0000001947911696,6.2416526346211268E-4,1,0,133.16589408377089,1.5632868259147388,1.0000235694560666,6.8657109090540297E-3,1.0000000004124305,2.8720398781786912E-5,1,0,1,0,0.99999962627265626,3.601693733902061E-4,58.381037325642204,-89.99596819744859,90.00403180255141,null,1000000000,1096.470769,null,55.219568930132404,-89.178006694408325,null,51.602942163284936,-0.81796150304028803,null,0,0]
[36.308,3.6308E-2,1.0001271004337384,1.5942833694054723E-2,1.0000002341945866,6.8438956876364619E-4,1,0,146.01408345213923,1.5639476188218921,1.0000283371468026,7.5281442145050271E-3,1.0000000004958594,3.1491566421378937E-5,1,0,1,0,0.99999955067305457,3.9492134976783872E-4,57.580859272891658,-90.074943260640794,89.925056739359206,null,1000000000,1318.2708640000001,null,54.419575592590604,-89.17807148271929,null,51.60275744807619,-0.89687177792149608,null,0,0]
[39.811,3.9810999999999999E-2,1.000152806901887,1.7480700565640401E-2,1.0000002815648008,7.5041952907375128E-4,1,0,160.10090726333897,1.5645502253866024,1.0000340687653617,8.2544288906960875E-3,1.0000000005961562,3.4529876355560427E-5,1,0,1,0,0.99999945978831295,4.3302344847363799E-4,56.780706076900032,-90.154544241855916,89.845455758144084,null,1000000000,1584.9157210000001,null,53.619644448031771,-89.171159331241469,null,51.602535396643404,-0.98338491061444622,null,0,0]
[43.652000000000001,4.3652000000000003E-2,1.0001837123615802,1.9166858939091713E-2,1.0000003385169887,8.228206284542945E-4,1,0,175.54700631001634,1.5650998160459357,1.0000409597237283,9.0507818109372244E-3,1.0000000007167409,3.7861348937523606E-5,1,0,1,0,0.99999935051954481,4.7480198331352502E-4,55.980506282636917,-90.235451899857111,89.764548100142889,null,1000000000,1905.497104,null,52.819711606243239,-89.157211774450914,null,51.602268444168821,-1.0782401254061915,null,0,0]
[47.863,4.7863000000000003E-2,1.0002208624335764,2.1015317797140689E-2,1.0000004069789936,9.021960492584765E-4,1,0,192.48106456377766,1.5656009871864383,1.0000492432558064,9.9238334470807665E-3,1.0000000008616952,4.1513739210610563E-5,1,0,1,0,0.99999921916797874,5.2060502348223053E-4,55.180365660395708,-90.318339319067306,89.681660680932694,null,1000000000,2290.8667689999997,null,52.019891864607068,-89.136113858091122,null,51.601947563563783,-1.1822254609761707,null,0,0]
[52.481000000000002,5.2481E-2,1.000265531791422,2.304226763097689E-2,1.0000004893012742,9.8924322049592653E-4,1,0,211.05187332484209,1.5660581374294302,1.0000592037161182,1.0881249502310047E-2,1.000000001035996,4.5519138943628469E-5,1,0,1,0,0.99999906122401105,5.7083502501607927E-4,54.380042370016717,-90.403931894315107,89.596068105684893,null,1000000000,2754.255361,null,51.21995438607776,-89.107680230882721,null,51.601561751714101,-1.2962516634323888,null,0,0]
[57.544000000000004,5.7544000000000005E-2,1.0003192278392863,2.5264320311547146E-2,1.0000005882639251,1.084678419324819E-3,1,0,231.41224566167324,1.5664750208526448,1.0000711774227549,1.1930901152618618E-2,1.0000000012455292,4.991050725036226E-5,1,0,1,0,0.99999887135373511,6.2590532339750653E-4,53.579740101695947,-90.492930054480922,89.507069945519078,null,1000000000,3311.3119360000005,null,50.42011587060518,-89.071676888889385,null,51.601097998865903,-1.4212531655915255,null,0,0]
[63.095999999999997,6.3095999999999999E-2,1.0003837870381962,2.7700697992609526E-2,1.0000007072545525,1.1893310182932285E-3,1,0,253.73912338366679,1.5668552609658037,1.0000855741696311,1.3081901056645692E-2,1.0000000014974679,5.4726007315096761E-5,1,0,1,0,0.9999986430576685,6.8629451936908512E-4,52.779285631459125,-90.58610273162833,89.41389726837167,null,1000000000,3981.1052159999995,null,49.620218940909744,-89.027791513634071,null,51.600540458324517,-1.5583112179942769,null,0,0]
[69.183000000000007,6.9183000000000008E-2,1.0004613904282147,3.0371470069578528E-2,1.0000008502973896,1.3040680865992612E-3,1,0,278.21749142838343,1.5672020087379828,1.0001028807356784,1.4343773288867993E-2,1.0000000018003321,6.0005537012106758E-5,1,0,1,0,0.99999836861489055,7.5250297194559882E-4,51.978825887894935,-90.684215940405025,89.315784059594975,null,1000000000,4786.2874890000012,null,48.820429340863065,-88.975661239054276,null,51.599870314807006,-1.7085547013507545,null,0,0]
[75.858000000000004,7.5858000000000009E-2,1.0005546925348283,3.3299737325135616E-2,1.000001022291628,1.4298886369534451E-3,1,0,305.0604849212915,1.5675182824713607,1.0001236897006376,1.572748884583933E-2,1.0000000021644952,6.5795065631142112E-5,1,0,1,0,0.99999803862578074,8.2510718489382665E-4,51.178170451890907,-90.788116028206616,89.211883971793384,null,1000000000,5754.4361640000006,null,48.020579544971213,-88.914833043172351,null,51.599064674694837,-1.8732829850342561,null,0,0]
[83.176000000000002,8.3176E-2,1.0006668394143619,3.6509425160250658E-2,1.0000012290457363,1.5678293769157787E-3,1,0,334.48928208501627,1.5678066899269441,1.0001487035691115,1.7244427746759775E-2,1.0000000026022555,7.2142297151767264E-5,1,0,1,0,0.99999764194616825,9.047054234159734E-4,50.37749442441541,-90.898648818501528,89.101351181498472,null,1000000000,6918.2469760000004,null,47.220871776970299,-88.844807045853145,null,51.598096415220247,-2.05384177264839,null,0,0]
[91.201000000000008,9.1201000000000004E-2,1.0008016690792068,4.0028337068378841E-2,1.0000014776484727,1.7190966541556199E-3,1,0,366.7612541980323,1.5680697540514894,1.0001787796162194,1.8907828281233628E-2,1.0000000031286218,7.910274165900651E-5,1,0,1,0,0.99999716497550928,9.9199385583180933E-4,49.576566804083456,-91.016767339570436,88.983232660429564,null,1000000000,8317.6224010000005,null,46.421108110704949,-88.764972483668316,null,51.596932461153642,-2.2517948559021184,null,0,0]
[100,0.1,1.0009637419294286,4.3885500263087705E-2,1.0000017765272102,1.8849533575528458E-3,1,0,402.1458370434529,1.5683096641504826,1.0002149368844324,2.0731540862744903E-2,1.0000000037614376,8.6734511272502349E-5,1,0,1,0,0.99999659154497844,1.0877012944830165E-3,48.775479304076946,-91.143439325217741,88.856560674782259,null,1000000000,10000,null,45.621419539268487,-88.674664553923563,null,51.595533532583602,-2.4687747712941768,null,0,0]
[109.65,0.10965000000000001,1.0011586058966897,4.8114205009792917E-2,1.0000021359400433,2.0668508613221979E-3,1,0,440.95268091462265,1.5685285078191882,1.0002584156319396,2.2731475770060492E-2,1.0000000045224227,9.5104391562050148E-5,1,0,1,0,0.9999959019733069,1.1926653394103339E-3,47.974006996894644,-91.279748845587193,88.720251154412807,null,1000000000,12023.122500000001,null,44.821628893421675,-88.573095101723041,null,51.593851871248106,-2.7066537438641478,null,0,0]
[120.23,0.12023,1.0013928146665398,5.2748459219814157E-2,1.0000025680139943,2.2662782259678664E-3,1,0,483.49947914770775,1.5687280707655205,1.0003106818306913,2.4923940940808853E-2,1.0000000054372533,1.0428090278642587E-4,1,0,1,0,0.99999507299347767,1.3077453671284883E-3,47.172359608142138,-91.426780195683563,88.573219804316437,null,1000000000,14455.252900000001,null,44.022002270922357,-88.459435990515715,null,51.591831104994917,-2.9673442051678656,null,0,0]
[131.83000000000001,0.13183,1.0016743068838776,5.7826881818057764E-2,1.0000030874510673,2.4849318395605536E-3,1,0,530.14816102327075,1.5689100605272364,1.0003735124000868,2.7327501808106003E-2,1.0000000065370587,1.1434210599895962E-4,1,0,1,0,0.99999407639807625,1.433920431692744E-3,46.370452079097824,-91.585743563016493,88.414256436983507,null,1000000000,17379.148900000004,null,43.222522840272369,-88.332725806613809,null,51.589403006600591,-3.2530177564026928,null,0,0]
[144.54,0.14454,1.0020123768659095,6.3387821128768909E-2,1.0000037114835869,2.7245080684755152E-3,1,0,581.26065595050795,1.5690759273784582,1.0004489895515902,2.9960695015804784E-2,1.0000000078583249,1.2536606225086781E-4,1,0,1,0,0.99999287912497037,1.5721696252740851E-3,45.568718800346566,-91.757820543629322,88.242179456370678,null,1000000000,20891.811599999997,null,42.423704777492979,-88.191990045712231,null,51.58648779062873,-3.5658304979170814,null,0,0]
[158.49,0.15849000000000002,1.0024190716464931,6.9486762800786347E-2,1.0000044624669362,2.9874572269729233E-3,1,0,637.3597510601345,1.569227353528831,1.000539814004463,3.2850305436519907E-2,1.0000000094483856,1.3746552639461613E-4,1,0,1,0,0.99999143828285142,1.7239071793425712E-3,44.765727492342897,-91.944699051589339,88.055300948410661,null,1000000000,25119.080100000003,null,41.624219127737689,-88.035796891543853,null,51.582982132380351,-3.9089021600455029,null,0,0]
[173.78,0.17377999999999999,1.0029076266374917,7.6165593675281251E-2,1.0000053650116614,3.2756641083200025E-3,1,0,698.84759041577513,1.5693653991434695,1.0006489575794379,3.6016852131444427E-2,1.0000000113593495,1.5072723292587975E-4,1,0,1,0,0.99998970665357834,1.8902210764467269E-3,43.962508787977569,-92.147623429124266,87.852376570875734,null,1000000000,30199.488400000002,null,40.825209805948781,-87.863036401008628,null,51.578772749803932,-4.284587028115638,null,0,0]
[190.55,0.19055000000000002,1.0034948589066635,8.3483061799161234E-2,1.0000064504313129,3.5917674311155838E-3,1,0,766.28717581441333,1.5694913326420554,1.0007802003498445,3.9489072585879872E-2,1.000000013657518,1.6527261013938587E-4,1,0,1,0,0.99998762415848885,2.0726344780604145E-3,43.158409363883976,-92.368328870465021,87.631671129534979,null,1000000000,36309.302500000005,null,40.026167224109514,-87.672141669906395,null,51.573715907549598,-4.6961872005586374,null,0,0]
[208.93,0.20893,1.0042001084137149,9.149273361042122E-2,1.0000077548280781,3.9382173540599202E-3,1,0,840.2012947371154,1.5696061355367346,1.0009378980094152,4.3293545748162722E-2,1.0000000164193319,1.8121441287244391E-4,1,0,1,0,0.99998512153127805,2.2725618889635037E-3,42.353872955865519,-92.608365003151633,87.391634996848367,null,1000000000,43651.744900000005,null,39.227699989848766,-87.461652533551714,null,51.567646733791896,-5.1467124695999225,null,0,0]
[229.09,0.22909000000000002,1.0050476303616003,0.10026454279976309,1.0000093235754439,4.3182179203189661E-3,1,0,921.27359246075468,1.5697108726968394,1.0011275222347358,4.7465015138942072E-2,1.0000000197408632,1.9870008975743345E-4,1,0,1,0,0.99998211171746432,2.4918530646670296E-3,41.548124927284476,-92.869739941146662,87.130260058853338,null,1000000000,52482.2281,null,38.429239792751986,-87.229647795546583,null,51.560358902307627,-5.6400921456000992,null,0,0]
[251.19,0.25119000000000002,1.006065401822442,0.1098626604826215,1.00001120919714,4.7347845644451544E-3,1,0,1010.1474999212317,1.5698063721957782,1.0013554018983684,5.203600173687184E-2,1.0000000237333238,2.1786841596456986E-4,1,0,1,0,0.99997849394378169,2.7322491895907671E-3,40.741434763356054,-93.15424949089909,86.84575050910091,null,1000000000,63096.416100000002,null,37.631293228262741,-86.974319537409386,null,51.551615302868456,-6.1799299534896983,null,0,0]
[275.42,0.27542,1.0072875463694051,0.12036247681149211,1.0000134759773123,5.1914980456590305E-3,1,0,1107.5870914320467,1.5698934631342454,1.0016292769699813,5.7045033467144415E-2,1.0000000285328281,2.3888418700173037E-4,1,0,1,0,0.99997414487293046,2.995818042035863E-3,39.933460635708002,-93.463975961095684,86.536024038904316,null,1000000000,75856.176400000011,null,36.833806645882547,-86.693517217688438,null,51.541127757600592,-6.770458743407235,null,0,0]
[302,0.30199999999999999,1.008755616985709,0.13184996517657618,1.0000162025218984,5.6925043932151498E-3,1,0,1214.477084708592,1.5699729270571916,1.0019586029694814,6.2536573810149668E-2,1.0000000343058162,2.6193821870913037E-4,1,0,1,0,0.99996891368911067,3.2849540901997549E-3,39.123506260720312,-93.80125304949263,86.19874695050737,null,1000000000,91204,null,36.036433178374089,-86.384748978781559,null,51.528546850121366,-7.4165040707110572,null,0,0]
[331.13,0.33112999999999998,1.0105169375590335,0.14439934625498677,1.0000194789291506,6.2415723924553468E-3,1,0,1331.6217686389061,1.5700453627317204,1.0023542022485252,6.8550608327010598E-2,1.0000000412430645,2.8720398000005548E-4,1,0,1,0,0.9999626275264355,3.6018347070520835E-3,38.312034146172138,-94.167995348401647,85.832004651598353,null,1000000000,109647.0769,null,35.240030628137731,-86.045768062656933,null,51.51347728580955,-8.1222272857447084,null,0,0]
[363.08,0.36307999999999996,{"$f":"SQRT(1+(A77/pole1)^2)","v":1.0126310790212356},{"$f":"ATAN(A77/pole1)","v":0.1581109927569451},{"$f":"SQRT(1+(A77/Zero1)^2)","v":1.0000234191871755},{"$f":"ATAN(A77/Zero1)","v":6.8437899055908856E-3},{"$f":"IF(VIN_nom>Vout, 1, SQRT(1+(A77/z_RHP)^2))","v":1},{"$f":"IF(VIN_nom>Vout, 0, -ATAN(A77/z_RHP))","v":0},{"$f":"SQRT(1+(A77/Pole2)^2)","v":1460.1069332883903},{"$f":"ATAN(A77/Pole2)","v":1.5701114453965699},{"$f":"SQRT(1+(A77/Zero2)^2)","v":1.0028297510843533},{"$f":"ATAN(A77/Zero2)","v":7.5141123875547972E-2},{"$f":"SQRT(1+(A77/pole4)^2)","v":1.0000000495859365},{"$f":"ATAN(A77/pole4)","v":3.1491565390763353E-4},{"$f":"IF(VOUT_setting=1,1,SQRT(1+(A77*zterm1)^2))","v":1},{"$f":"IF(VOUT_setting=1,0,ATAN(((A77*zterm1))))","v":0},1,{"$f":"IF(VOUT_setting=1,0,ATAN(A77*$Q$4/(1+Afbr-$Q$5*(A77)^2)))","v":0},{"$f":"SQRT((1-(Z77/pterm2))^2+(A77/pterm1)^2)","v":0.99995506768246567},{"$f":"IF((ATAN((A77/pterm1)/(1-A77^2/pterm2))>0),ATAN((A77/pterm1)/(1-A77^2/pterm2)),PI()+ATAN((A77/pterm1)/(1-A77^2/pterm2)))","v":3.94939934269196E-3},{"$f":"20*LOG10(((E77*K77*G77*O77)/(C77*I77*S77*M77*Q77))*Adc)","v":37.498025207462405},{"$f":"((F77+L77+H77+P77)-(D77+J77+T77+N77+R77))*radconv","v":-94.56678958247997},{"$f":"IF(V77>0,V77,V77+180)","v":85.43321041752003},null,{"$f":"IF(U77<0,A77,1000000000)","v":1000000000},{"$f":"A77^2","v":131827.0864},null,{"$f":"20*LOG10((K77/(I77*M77))*AEA)","v":34.444074900794497},{"$f":"(L77-(J77+N77))*radconv","v":-85.673533356238053},null,{"$f":"20*LOG10((E77*G77/(C77*S77))*Acs*Am)","v":51.495424074443051},{"$f":"(F77+H77-(D77+T77))*radconv","v":-8.8932562262419044},null,{"$f":"SUM((U78<0)*(U77>0))*A77","v":0},{"$f":"IF(AH77>0,W75,0)","v":0}]
[398.11,{"$f":"A78/1000","v":0.39811000000000002},1.0151668411509061,0.1730756804412861,1.0000281560876687,7.5040558429117412E-3,1,0,1600.9781543339143,1.5701717086123701,1.0034011506573057,8.2359440233479492E-2,1.0000000596156162,3.4529874996937378E-4,1,0,1,0,0.9999459793762433,4.330479479576951E-3,36.681354624071624,-94.999821449552343,85.000178550447657,null,1000000000,158491.57210000002,null,33.649007658761924,-85.265147944369801,null,51.473820733084835,-9.734673505182549,null,0,0]
[436.52,0.43651999999999996,1.0182071730935862,0.18939454710080486,1.0000338511316602,8.2280224564298659E-3,1,0,1755.4418652979912,1.57022666961977,1.0040877016055609,9.0264340509109101E-2,1.0000000716740847,3.786134714649653E-4,1,0,{"$f":"IF(VOUT_setting=1,1,SQRT((1+Afbr-$Q$5*(A79)^2)^2+(A79*$Q$4)^2))","v":1},0,0.99993505274218153,4.7483428049486217E-3,35.861444475074279,-95.469425613044038,84.530574386955962,null,1000000000,190549.71039999998,null,32.854927701160854,-84.817288347291822,null,51.447990541688561,-10.652137265752213,null,0,0]
[478.63,0.47863,1.0218499717359353,0.20716853194459031,1.000040697079523,9.0217181690278678E-3,1,0,1924.7849286506048,1.5702767882064022,1.0049123810815992,9.891769757448382E-2,1.0000000861695235,4.1513736849646082E-4,1,0,1,0,0.99992191793642871,5.20647598745774E-3,35.037814034137604,-95.977737023741213,84.022262976258787,null,1000000000,229086.67689999999,null,32.062143403956753,-84.326451756905726,null,51.417144397955987,-11.65128526683548,null,0,0]
[524.80999999999995,0.52481,1.0262131401407988,0.22650852352343262,1.0000489289423662,9.8921127586618831E-3,1,0,2110.4952791684987,1.5703225043479627,1.0059031234326898,0.10839031238103181,1.0000001035995953,4.5519135831224199E-4,1,0,1,0,0.99990612404688006,5.708911518327908E-3,34.209529576855793,-96.526927833722013,83.473072166277987,null,1000000000,275425.53609999997,null,31.270658933447187,-83.788625173458996,null,51.380344411183749,-12.73830266026302,null,0,0]
[575.44000000000005,0.57544000000000006,1.0314338362195681,0.24751537236370225,1.0000588246796365,1.0846363092040606E-2,1,0,2314.1010661200303,1.5703641935377266,1.0070928413872986,0.11875327288065549,1.0000001245529291,4.9910503147472703E-4,1,0,1,0,0.99988713775236537,6.2597931323513682E-3,33.37601250946728,-97.11857107147884,82.88142892852116,null,1000000000,331131.19360000006,null,30.48096704894375,-83.199775955656818,null,51.33651922829867,-13.918795115822014,null,0,0]
[630.96,0.63096000000000008,1.0376763160486535,0.27029694666933529,1.0000707229793784,1.1892755064605017E-2,1,0,2537.3717255363213,1.5704022181919581,1.0085214753390586,0.13008765642567532,1.000000149746783,5.47260019063686E-4,1,0,1,0,0.99986430920547964,6.8639206028422578E-3,32.536180695782974,-97.754044630428254,82.245955369571746,null,1000000000,398110.52160000004,null,29.69324418674972,-82.555301344164505,null,51.284410276808394,-15.198743286263751,null,0,0]
[691.83,0.69183000000000006,1.04513127106392,0.29494681042494447,1.0000850261604011,1.3039949102522449E-2,1,0,2782.1571223908727,1.570436893456828,1.0102362127642526,0.14247562613936676,1.0000001800332079,6.0005529882134717E-4,1,0,1,0,0.99983686645941861,7.5263155709869092E-3,31.689168795041439,-98.433834161072539,81.566165838927461,null,1000000000,478628.74890000006,null,28.908048416186887,-81.850534655067662,null,51.222594146629696,-16.583299506004895,null,0,0]
[758.58,0.75858000000000003,1.0540252726317727,0.32155900274125082,1.0001022239901762,1.4297921724202039E-2,1,0,3050.5886228794197,1.5704685212001306,1.0122941618135051,0.1560097040421386,1.0000002164495103,6.5795056231879128E-4,1,0,1,0,0.99980386976280633,8.2527670078684605E-3,30.833637002322646,-99.15783029163282,80.84216970836718,null,1000000000,575443.61640000006,null,28.125684239042236,-81.0802184012163,null,51.149426531055546,-18.077611890416506,null,0,0]
[831.76,0.83175999999999994,1.0646184059806858,0.35020122957318506,1.0001228970973146,1.567702218029831E-2,1,0,3344.8780221369748,1.5704973622262999,1.014762496891487,0.17078141722599074,1.0000002602255189,7.2142284761413501E-4,1,0,1,0,0.99976420500202023,9.049288921153505E-3,29.968522591965659,-99.924462055624375,80.075537944375625,null,1000000000,691824.69759999996,null,27.34690460929297,-80.239150741782566,null,51.063091750447825,-19.685311313841801,null,0,0]
[912.01,0.91200999999999999,1.0772177510478518,0.38093500603099439,1.0001477540408139,1.7189290293297552E-2,1,0,3667.5990454371326,1.5705236688516477,1.0177225159438197,0.18689395131383707,1.0000003128621393,7.910272532516315E-4,1,0,1,0,0.99971651256305094,9.9228846148152108E-3,29.092229916820223,-100.73109959874758,79.268900401252424,null,1000000000,831762.24009999994,null,26.572172320485947,-79.321465837523903,null,50.961531364109412,-21.409633761223677,null,0,0]
[1000,1,1.0921727270612267,0.41378358457659903,1.0001776371013438,1.8847323923887733E-2,1,0,4021.4460614482869,1.5705476600230375,1.0212697962208097,0.20444809137979539,1.0000003761437033,8.6734489740245468E-4,1,0,1,0,0.99965917619828915,1.0880896825778487E-2,28.203444698731907,-101.57304537348091,78.426954626519091,null,1000000000,1000000,null,25.802385932493998,-78.321434969398709,null,50.842532534013046,-23.251610404082193,null,0,0]
[1096.5,1.0965,1.1098898216040758,0.44874947588625924,1.0002135714260683,2.0665595678133898E-2,1,0,4409.5155834376301,1.5705695445124328,1.0255192851681434,0.22355380322029308,1.000000452242165,9.5104363175316665E-4,1,0,1,0,0.99959022870206771,1.1931773986947588E-2,27.300478571294686,-102.44384772208255,77.556152277917448,null,1000000000,1202312.25,null,25.03827947345561,-77.232807788209172,null,50.703672865614216,-25.211039933873387,null,0,0]
[1202.3,1.2022999999999999,1.1308213504252183,0.48577583623375786,1.0002567687640673,2.2658942352679495E-2,1,0,4834.9845536061921,1.5705895008999962,1.0306046858317035,0.24431128756214573,1.0000005437251904,1.0428086536433876E-3,1,0,1,0,0.99950734469874913,1.3084204654915338E-2,26.382171957855665,-103.33420588278618,76.665794117213821,null,1000000000,1445525.2899999998,null,24.281160112973129,-76.049892706003376,null,50.542485612657671,-27.284313176782753,null,0,{"$f":"IF(AH90>0,W90,0)","v":0}]
[1318.3,1.3183,1.1554833218742975,0.5247709657184767,1.0003086979361338,2.4844256681727548E-2,1,0,5301.4722732119972,1.5706076999466563,1.0366853096136037,0.26682511998232089,1.0000006537056523,1.143420566665689E-3,1,0,1,0,0.99940770536718349,1.4348104775012728E-2,25.447162782772217,-104.23252886770578,75.767471132294219,null,1000000000,1737914.89,null,23.532227722850408,-74.766752492746051,null,50.356408827696946,-29.465776374959727,null,0,0]
[1445.4,1.4454,1.1844324967033579,0.5655645627064404,1.0003710801971808,2.7238409758210309E-2,1,0,5812.5980435259316,1.5706242866852167,1.0439435183379382,0.29117844929598108,1.0000007858321776,1.2536599722989131E-3,1,0,1,0,0.99928800724803146,1.57334285517041E-2,24.4949362129043,-105.12395176219434,74.876048237805662,null,1000000000,2089181.1600000001,null,22.79335179073005,-73.378676107189207,null,50.1430581899494,-31.745275655005159,null,0,0]
[1584.9,1.5849000000000002,1.2183593558805601,0.60802837713702462,1.0004461481651987,2.986577823652856E-2,1,0,6373.5897441821326,1.5706394293408339,1.0526119611749318,0.31750372183673836,1.0000009448381129,1.37465440672112E-3,1,0,1,0,0.99914396527937166,1.7254541567863133E-2,23.523086639918315,-105.99303841261904,74.006961587380957,null,1000000000,2511908.0100000002,null,22.06490010207834,-71.878149175052016,null,49.899660305615114,-34.114889237567013,null,0,0]
[1737.8,1.7378,1.2579231919177907,0.65185287724454288,1.0005363587649334,3.2745049722652533E-2,1,0,6988.4688210647046,1.570653233933067,1.0629363247540236,0.34584267968038357,1.0000011359343093,1.5072711992325505E-3,1,0,1,0,0.99897086340561925,1.8922606960496496E-2,22.532619117786773,-106.81928695885331,73.180713041146689,null,1000000000,3019948.84,null,21.349718873281198,-70.262835820342545,null,49.624374012280711,-36.556451138510788,null,0,0]
[1905.5,1.9055,1.3039145620823578,0.69676626454323665,1.0006448373041095,3.5902394963317832E-2,1,0,7662.8652984221872,1.5706658273062726,1.0752213452250243,0.37627175583503514,1.0000013657508753,1.6527246116352949E-3,1,0,1,0,0.99876270219945984,2.0753239223481882E-2,21.523098067303984,-107.58221721696769,72.417782783032308,null,1000000000,3630930.25,null,20.649346257828402,-68.52843359399796,null,49.315225577250715,-39.053783622969746,null,0,0]
[2089.3000000000002,2.0893000000000002,1.3571240819511148,0.74239385164821048,1.0007751853585023,3.9362035751321418E-2,1,0,8402.0070559237538,1.5706773076134433,1.089801618254755,0.40880074606357142,1.0000016419318596,1.8121421649513751E-3,1,0,1,0,0.99851256710400349,2.2761079102975885E-2,20.496148644424764,-108.25932119768736,71.740678802312644,null,1000000000,4365174.4900000012,null,19.966498269750222,-66.674451466095746,null,48.971124142449682,-41.584869731591603,null,0,0]
[2290.9,2.2909000000000002,1.4184759178593125,0.78839855066754361,1.0009319276462829,4.3155636489787236E-2,1,0,9212.7305516092492,1.5706877813428874,1.1070824619630317,0.44345398554229309,1.0000019740843868,1.9869983087230231E-3,1,0,1,0,0.99821177033563957,2.4965291401313542E-2,19.452618719213636,-108.82926529125591,71.170734708744092,null,1000000000,5248222.8100000005,null,19.303039284088335,-64.699585714805238,null,48.59105320290044,-44.129679576450677,null,0,0]
[2511.9,2.5119000000000002,1.4888785291000688,0.83436743792702739,1.0011202984619767,4.7312864430824331E-2,1,0,10101.470098936665,1.5706973313029693,1.1275034772027424,0.48017256024093902,1.0000023733295924,2.1786807469659228E-3,1,0,1,0,0.99785025988933573,2.7384154157920094E-2,18.39548409063589,-109.27119793947871,70.728802060521289,null,1000000000,6309641.6100000003,null,18.661869931688457,-62.60729611957148,null,48.175087926722576,-46.663901819907224,null,0,0]
[2754.2,2.7542,1.5693374739327535,0.87992159400585146,1.0013467000108656,5.1868881066272562E-2,1,0,11075.866445145053,1.5707060404045441,1.1515732058105241,0.51887570105054104,1.0000028532787779,2.388837371445361E-3,1,0,1,0,0.99741573880879397,3.0039496861368975E-2,17.327696266340467,-109.56737168797211,70.432628312027887,null,1000000000,7585617.6399999987,null,18.045476439206741,-60.402309577144152,null,47.723693594908866,-49.165062110827961,null,0,0]
[3020,3.02,1.6609604089266754,0.9247160829084482,1.0016189548085954,5.6864288317294794E-2,1,0,12144.766771256993,1.5707139868027038,1.1798746570951781,0.55944901879623776,1.0000034305757934,2.6193762563528318E-3,1,0,1,0,0.99689317905113584,3.2956798675235183E-2,16.252402724221643,-109.70382450928427,70.296175490715726,null,1000000000,9120400,null,17.456128480530168,-58.091293907027499,null,47.237748011466614,-51.612530602256761,null,0,0]
[3311.3,3.3113000000000001,1.7647799039451819,0.96837053982717725,1.0019460183926858,6.2335668784462901E-2,1,0,13316.213969116779,1.5707212303746034,1.2130105838481944,0.60166363329957795,1.0000041242980282,2.872031982225561E-3,1,0,1,0,0.99626537055542286,3.6159816695403343E-2,15.174821522316336,-109.67124494105445,70.328755058945546,null,1000000000,10964707.690000001,null,16.896865083502735,-55.687465792328346,null,46.719430206588733,-53.983779148726086,null,0,0]
[3630.8,3.6308000000000002,1.8820654133082642,1.0106252210053763,1.0023392101883046,6.8332413271137482E-2,1,0,14601.065942720856,1.5707278386444625,1.2516992314412492,0.64530898381548163,1.0000049585814879,3.1491462329818311E-3,1,0,1,0,0.99551055531295651,3.9680625816401395E-2,14.098554184423186,-109.46596091325478,70.534039086745224,null,1000000000,13182708.640000001,null,16.369489795045812,-53.203027512543123,null,46.170538157152514,-56.262933400711646,null,0,0]
[3981.1,3.9811000000000001,2.0140435787814783,1.0512186582922773,1.0028116955890831,7.4901579829710574E-2,1,0,16009.778451479042,1.570733864968602,1.2966830430141736,0.69007466419234287,1.0000059615440404,3.4529739135604125E-3,1,0,1,0,0.99460341668610308,4.3551038473033349E-2,13.02853606760252,-109.09003511087775,70.90996488912225,null,1000000000,15849157.209999999,null,15.876142808932352,-50.655896283742422,null,45.593867026445309,-58.434138827135335,null,0,0]
[4365.2,4.3651999999999997,2.1620787991937811,1.0899633825888531,1.0033794600857304,8.2097139526184248E-2,1,0,17554.415833176823,1.5707393610712836,1.3487813950206222,0.73562723829205745,1.000007167383038,3.7861168045328917E-3,1,0,1,0,0.99351320273625743,4.7808380913154223E-2,11.969048405824044,-108.55102918601645,71.44897081398355,null,1000000000,19054971.039999999,null,15.418265843481542,-48.06532862402662,null,44.992256330117641,-60.48570056198983,null,0,0]
[4786.3,4.7862999999999998,2.3276031606941037,1.1267172084531138,1.0040615427003594,8.9976034614834235E-2,1,0,19247.846714789979,1.5707443729314194,1.4088610169597706,0.78159170921483967,1.0000086169156006,4.1513500755638996E-3,1,0,1,0,0.9922032686925476,5.2493655455378471E-2,10.924266058680171,-107.86153060150691,72.138469398493086,null,1000000000,22908667.690000001,null,14.996869575726382,-45.452971913015467,null,44.368870250728925,-62.408558688491475,null,0,0]
[5248.1,5.2481,2.5122382251219455,1.161404568849373,1.0048811013634347,9.8603543736295318E-2,1,0,21104.950446263832,1.5707489445466929,1.4778732601830682,0.82759570883780764,1.0000103599064014,4.5518824594667261E-3,1,0,1,0,0.99062901817954374,5.7655371094662365E-2,9.8974294354603902,-107.03777034482702,72.962229655172976,null,1000000000,27542553.610000003,null,14.612191506910055,-42.840347640329291,null,43.726711696325474,-64.197422704497725,null,0,0]
[5370.3,5.3703000000000003,2.5615553181273802,1.1697435245639751,1.0051104722513089,0.10088411804950957,1,0,21596.371139240189,1.5707500227193689,1.4966276868143069,0.83905145933429237,1.0000108479735312,4.6578697849275581E-3,1,0,1,0,0.99018837399338655,5.9025682273547646E-2,9.6440164056346251,-106.8131713232914,73.1868286767086,null,1000000000,28840122.090000004,null,14.521790033861325,-42.190115886157528,null,43.563700139548438,-64.623055437133885,null,0,0]
[5432.85,5.4328500000000002,2.5868659865711821,1.1738887759654351,1.0052299014093931,0.10205106023127428,1,0,21847.912582340166,1.5707505558318089,1.5063020006599388,0.844804503251818,1.0000111021450195,4.7121210310633469E-3,1,0,1,0,0.98995892903029248,5.9727847759415191E-2,9.5170375098104341,-106.69756076709481,73.302439232905186,null,1000000000,29515859.122500002,null,14.477170038781635,-41.863629662486559,null,43.481341238803935,-64.83393110460824,null,0,0]
[5495.4,5.4954000000000001,2.6122202435858499,1.1779536283186369,1.005350699117058,0.10321772357403257,1,0,22099.454025446215,1.5707510768082142,1.5160255321181271,0.850483935042601,1.0000113592597366,4.7663722494615379E-3,1,0,1,0,0.98972684809050615,6.0430529453173114E-2,9.3918556535262301,-106.58160620483797,73.418393795162032,null,1000000000,30199421.159999996,null,14.433625157843725,-41.541360406070929,null,43.399704263457643,-65.040245798767032,null,0,0]
[5559.4,5.5593999999999992,2.6382060543038146,1.1820317732987231,1.0054757130815641,0.10441114005348059,1,0,22356.826565161107,1.5707515977275839,1.5260244300870478,0.85621992208269848,1.0000116253811067,4.821881060986217E-3,1,0,1,0,0.98948665960514093,6.1150041224742005E-2,9.2655902248173998,-106.46267637901879,73.537323620981212,null,1000000000,30906928.359999996,null,14.390149995036216,-41.215922824067235,null,43.316913997556313,-65.246753554951567,null,0,0]
[5623.4,5.6233999999999993,2.6642348853995212,1.186030299025522,1.005602158730464,0.10560425810856032,1,0,22614.199104881929,1.5707521067897712,1.5360728820103857,0.86188104771675023,1.0000118945837391,4.877389842796051E-3,1,0,1,0,0.9892437130924604,6.1870106826497136E-2,9.1411227003887561,-106.34352209815286,73.65647790184714,null,1000000000,31622627.559999995,null,14.347733297859087,-40.894773803614243,null,43.234863170304806,-65.448748294538618,null,0,0]
[5688.9,5.6888999999999994,2.6909170091216685,1.1900423795164612,1.0057330497959986,0.10682502744369071,1,0,22877.603813508387,1.5707526159234055,1.5464071461575877,0.86759849019207647,1.0000121732862399,4.9341995805549516E-3,1,0,1,0,0.98899221762263678,6.2607629519835575E-2,9.015557460824148,-106.22140819014463,73.778591809855371,null,1000000000,32363583.209999997,null,14.30538492943932,-40.57047260921594,null,43.151646299159971,-65.650935580928689,null,0,0]
[5754.4,5.7543999999999995,2.7176415970214802,1.1939756147534659,1.0058654392917601,0.10804547724801428,1,0,23141.008522140644,1.5707531134665167,1.5567912889511775,0.87323984182220482,1.0000124552161245,4.9910092864648703E-3,1,0,1,0,0.98873783506230184,6.3345746747121109E-2,8.8917911183754015,-106.09918817228035,73.90081182771965,null,1000000000,33113119.359999996,null,14.264078427750231,-40.25053043319916,null,43.06918645840031,-65.84865773908119,null,0,0]
[5821.4,5.8213999999999997,2.7450208394042281,1.1979196254863251,1.0060024102872109,0.10929354203568355,1,0,23410.445399678665,1.5707536108199021,1.5674638081770935,0.87893286617467192,1.0000127469415101,5.0491199446726816E-3,1,0,1,0,0.98847464085688319,6.4101390174582357E-2,8.7670091134701806,-105.97412139945094,74.025878600549063,null,1000000000,33888697.959999993,null,14.22287059259096,-39.927702156478659,null,42.985612288654366,-66.046419242972277,null,0,0]
[5888.4,5.8883999999999999,2.7724419374532094,1.2017856781506771,1.0061409478700498,0.11054126506931283,1,0,23679.882277222347,1.5707540968552123,1.5781864416734588,0.8845487105365275,1.0000130420437856,5.1072305687799961E-3,1,0,1,0,0.98820842771851491,6.485767120702654E-2,8.6440243793358835,-105.84906550874885,74.150934491251149,null,1000000000,34673254.559999995,null,14.182686499813,-39.60929531705635,null,42.902811647298023,-66.239770191692514,null,0,0]
[5957,5.9569999999999999,2.8005599505972429,1.205665554263643,1.006284416287955,0.11181842647151331,1,0,23955.753468265273,1.5707545831694409,1.5892160023555093,0.89021996343227383,1.000013347692092,5.1667288735423363E-3,1,0,1,0,0.98793273034224149,6.5632681538193002E-2,8.5199219923432743,-105.72109290788725,74.278907092112746,null,1000000000,35485849,null,14.142570353004363,-39.28779332671526,null,42.818825407114048,-66.433299581171994,null,0,0]
[6025.6,6.0256000000000007,2.8287192833144412,1.2094682398987988,1.0064295256283495,0.11309522166767019,1,0,24231.624659313733,1.5707550584105294,1.6002959716368232,0.89581286203941757,1.0000136568804918,5.226227141723435E-3,1,0,1,0,0.98765387022032702,6.640837703086297E-2,8.3976179721285558,-105.59324659085539,74.406753409144613,null,1000000000,36307855.360000007,null,14.103461353738831,-38.970780069882814,null,42.735630386164864,-66.622466520972566,null,0,0]
[6095.8,6.0958000000000006,2.8575768954331631,1.213281973689081,1.0065797174798834,0.11440141304916948,1,0,24513.930163861573,1.570755533662437,1.6116854670399234,0.90145641524038711,1.0000139769451877,5.2871130863038334E-3,1,0,1,0,0.98736523294463319,6.7202882733765235E-2,8.2742799290590021,-105.46260396896632,74.53739603103368,null,1000000000,37158777.640000001,null,14.064449904487816,-38.650944027228888,null,42.651303792346326,-66.811659941737446,null,0,0]
[6166,6.1660000000000004,2.8864752383788606,1.2170193974973653,1.0067316261791077,0.11570721246785583,1,0,24796.235668414822,1.5707559980928452,1.6231255727937117,0.90702058985846834,1.0000143007170308,5.3479989916841962E-3,1,0,1,0,0.98707328597581689,6.7998123965732224E-2,8.1527386873379033,-105.33220114321135,74.66779885678865,null,1000000000,38019556,null,14.026427485321557,-38.335655420091136,null,42.567784969791482,-66.996545723120235,null,0,0]
[6237.8,6.2378,2.9160731047584587,1.2207653235770852,1.0068887723641495,0.11704236377615103,1,0,25084.975486467574,1.5707564622950965,1.6348776680446457,0.91263085192453908,1.0000146357031363,5.4102725689868349E-3,1,0,1,0,0.98677126247999103,6.8812260764265942E-2,8.0302424951089915,-105.19912523695713,74.80087476304287,null,1000000000,38910148.840000004,null,13.988528888881959,-38.017805691364202,null,42.483187374002171,-67.181319545592899,null,0,0]
[6309.6,6.3096000000000005,2.9457110667596922,1.224435921820459,1.0070477128962887,0.11837709601408913,1,0,25373.715304525609,1.5707569159325827,1.646680485706665,0.91816086126859786,1.0000149745672944,5.4725461043270349E-3,1,0,1,0,0.98646577923572853,6.9627186404007502E-2,7.9095390511130184,-105.06640010638046,74.933599893619544,null,1000000000,39811052.160000004,null,13.951599856391958,-37.704553497187526,null,42.3994129624962,-67.361846609192924,null,0,0]
[6383.05,6.3830499999999999,2.9760703633020449,1.2281151728939019,1.007212161749186,0.11974206269092924,1,0,25669.090508379944,1.5707573694348793,1.6588058933557355,0.9237363500906971,1.0000153252314725,5.5362506728093052E-3,1,0,1,0,0.9861496972730337,7.0461665955335206E-2,7.7878731155131886,-104.93103499957382,75.068965000426175,null,1000000000,40743327.302500002,null,13.914793055527007,-37.388777505275378,null,42.314553827761323,-67.54225749429844,null,0,0]
[6456.5,6.4565000000000001,3.0064691326325397,1.2317200692517125,1.0073784865586182,0.12110658117941418,1,0,25964.465712239442,1.5707578126189714,1.6709821174737218,0.92923075195897264,1.0000156799539819,5.5999551963559248E-3,1,0,1,0,0.98582999750457578,7.1296991902655163E-2,7.6679959702221439,-104.7961292020579,75.203870797942102,null,1000000000,41686392.25,null,13.878936445769217,-37.077646859832015,null,42.230533292228067,-67.718482342225883,null,0,0]
[6531.7,6.5316999999999998,3.0376318320742151,1.2353360564907028,1.0075507167411828,0.12250314091333921,1,0,26266.878446488772,1.57075825603585,1.68349994460535,0.9347735488346266,1.0000160473325328,5.6651774797001654E-3,1,0,1,0,0.98549893402608557,7.2153108061150079E-2,7.5470719560572128,-104.65852837333914,75.341471626660862,null,1000000000,42663104.890000001,null,13.843177858371599,-36.763830359281684,null,42.145367865460756,-67.89469801405744,null,0,0]
[6606.9,6.6068999999999996,3.0688334427159174,1.2388785599428549,1.0077249113556506,0.12389922055271531,1,0,26569.291180743152,1.5707586893587515,1.6960687288483332,0.94023436118845427,1.0000164189650949,5.7303997148452062E-3,1,0,1,0,0.98516408135950506,7.3010133958095053E-2,7.427935154977952,-104.52149365131973,75.47850634868027,null,1000000000,43651127.609999992,null,13.808351359574285,-36.454710644718894,null,42.061057563178807,-68.066783006600872,null,0,0]
[6683.85,6.6838500000000005,3.1008002092892228,1.2424296560044794,1.0079051921746478,0.12532728634843074,1,0,26878.741445387488,1.570759122671993,1.7089815815058664,0.9457389362219778,1.0000168036496737,5.7971397041909397E-3,1,0,1,0,0.98481751541072859,7.3888057625662737E-2,7.3078318228727435,-104.38189547536187,75.618104524638127,null,1000000000,44673850.822500005,null,13.773647496138015,-36.143170473663126,null,41.975658094509868,-68.238725001698739,null,0,0]
[6760.8,6.7608000000000006,3.1328052795637258,1.2459082384422233,1.0080875277495582,0.12675483845817473,1,0,27188.191710036754,1.5707595461214745,1.7219454393534488,0.95116078987667385,1.0000171927885504,5.8638796418925918E-3,1,0,1,0,0.98446698523613052,7.4766958156785843E-2,7.1895116440634377,-104.24296699476774,75.757033005232259,null,1000000000,45708416.640000001,null,13.739856326111449,-35.836369320384286,null,41.89112908572713,-68.406597674383463,null,0,0]
[6839.55,6.83955,3.1655974523703074,1.2493953218830374,1.0082762547356501,0.12821524597052242,1,0,27504.880577372805,1.5707599696110359,1.7352641613062032,0.95662542976513443,1.0000175956418926,5.9321806936370224E-3,1,0,1,0,0.98410415293480058,7.566744204972492E-2,7.0702256399957406,-104.10151772233107,75.898482277668933,null,1000000000,46779444.202500001,null,13.706188241779314,-35.527206144029179,null,41.805511165991561,-68.574311578301902,null,0,0]
[6918.3,6.9183000000000003,3.1984273284801223,1.2528108606439865,1.008467131355806,0.12967510376108451,1,0,27821.569444713681,1.5707603834595574,1.7486339119512786,0.96200666494000253,1.0000180031603469,6.0004816900332044E-3,1,0,1,0,0.98373717248973691,7.6568975239109507E-2,6.9527186666239,-103.96083904120665,76.039160958793346,null,1000000000,47862874.890000001,null,13.673413452823082,-35.22282115019776,null,41.720778981575961,-68.73801789100888,null,0,0]
[6998.9,6.9988999999999999,3.2320662893769794,1.2562347453332672,1.0086647167641913,0.13116868121267763,1,0,28145.697987038177,1.5707607973864353,1.762369374519249,0.96742960924736743,1.0000184250830335,6.0703871597944268E-3,1,0,1,0,0.9833572774546091,7.7492787759796913E-2,6.8342489723404061,-103.81768524072166,76.182314759278341,null,1000000000,48984601.209999993,null,13.640762644893146,-34.916138333146151,null,41.634960095222404,-68.901546907575536,null,0,0]
[7079.5,7.0795000000000003,3.2657423589217536,1.2595880550200713,1.0088645513909127,0.13266167030179579,1,0,28469.82652936739,1.5707612018882109,1.7761558629342524,0.97276852295822036,1.0000188518925808,6.1402925702257428E-3,1,0,1,0,0.98297304117698192,7.8417727725773101E-2,6.7175540851370741,-103.67540015411215,76.324599845887846,null,1000000000,50119320.25,null,13.608985712776692,-34.614269571212198,null,41.550042140135517,-69.061130582899963,null,0,0]
[7161.95,7.16195,3.300228602008823,1.2629474844332085,1.0090712986490302,0.13418831240377585,1,0,28801.394746680329,1.5707616062541383,1.79031035762688,0.97814474456409173,1.0000192935550176,6.2118024472079215E-3,1,0,1,0,0.98257549592768434,7.9365079246539766E-2,6.5999725767636175,-103.53077595033868,76.469224049661321,null,1000000000,51293527.802499995,null,13.577352913817261,-34.310355145727058,null,41.464093430721498,-69.220420804611621,null,0,0]
[7244.4,7.2443999999999997,3.3347513201124244,1.2662373939460629,1.0092803967184492,0.13571432549574058,1,0,29132.96296399787,1.5707620014157229,1.8045157863588166,0.98343647221942299,1.000019740331211,6.2833122606592174E-3,1,0,1,0,0.98217341235672329,8.0313641038545852E-2,6.4841594006692747,-103.38711454849145,76.612885451508546,null,1000000000,52481331.359999992,null,13.546573519886229,-34.011281335997715,null,41.379059648558183,-69.375833212493745,null,0,0]
[7328.75,7.3287500000000003,3.3701061656484952,1.2695333303590686,1.0094967444712906,0.13727484652329275,1,0,29472.171928595981,1.5707623964825119,1.8191000326739126,0.98876446566664333,1.0000202026949065,6.3564698989996577E-3,1,0,1,0,0.98175736908262501,8.1285330326456934E-2,6.3674627832361876,-103.24116294258523,76.758837057414766,null,1000000000,53710576.5625,null,13.515937716822089,-33.710224057430324,null,41.292998834189241,-69.53093888515491,null,0,0]
[7413.1,7.4131,3.4054968609313794,1.2727607969916648,1.009715549519753,0.13883469501921183,1,0,29811.380893198588,1.5707627825587618,1.8337350964572765,0.99400756041112515,1.0000206704107455,6.4296274692990816E-3,1,0,1,0,0.98133658085781716,8.225831917094259E-2,6.2525280283258446,-103.09626511790431,76.903734882095691,null,1000000000,54954051.610000007,null,13.486134935854077,-33.414030597203109,null,41.207866860246909,-69.682234520701201,null,0,0]
[7499.45,7.4994499999999995,3.4417626756594109,1.2759960010695435,1.0099420863106512,0.14043082455447489,1,0,30158.632749675337,1.5707631687930574,1.8487685474073889,0.99928883839333915,1.0000211547604627,6.5045195876322886E-3,1,0,1,0,0.98090090305832545,8.3255741878851694E-2,6.1366485242761843,-102.94904347596709,77.050956524032912,null,1000000000,56241750.302499995,null,13.45645855911174,-33.115748789940383,null,41.121663732939588,-69.833294686026733,null,0,0]
[7585.8,7.5857999999999999,3.4780637623034254,1.2791637050827589,1.0101711949019707,0.14202623414278936,1,0,30505.884606156491,1.5707635462342575,1.8638527313526414,1.0044847764543445,1.0000216447191226,6.5794116329990571E-3,1,0,1,0,0.98046025807862303,8.4254562008599876E-2,6.0225264027830665,-102.80296479082563,77.197035209174373,null,1000000000,57544361.640000001,null,13.427595825400997,-32.822356092004533,null,41.036404345157209,-69.980608698821115,null,0,0]
[7674.15,7.67415,3.5152410055221397,1.2823370306016935,1.0104082700195827,0.14365784278317573,1,0,30861.179354511896,1.5707639236262203,1.8793375234374163,1.0097145870636932,1.0000221518312915,6.6560382179586307E-3,1,0,1,0,0.98000426892881309,8.5277981551470539E-2,5.9075353595875226,-102.65470220879378,77.345297791206221,null,1000000000,58892578.222499996,null,13.398877325868291,-32.527122018982126,null,40.950131801494365,-70.127580189811638,null,0,0]
[7762.5,7.7625000000000002,3.5524529060881473,1.2854439057714719,1.0106480337261583,0.14528868160557448,1,0,31216.474102871594,1.5707642924275023,1.8948728762163867,1.0148587819424648,1.000022664815218,6.7326647247534961E-3,1,0,1,0,0.97954308584112082,8.6302902337535986E-2,5.7942950686944661,-102.507667347764,77.492332652236001,null,1000000000,60256406.25,null,13.370952163207825,-32.236792869299059,null,40.864816673261771,-70.270874478464918,null,0,0]
[7852.9,7.8529,3.5905629896247007,1.2885561827405438,1.0108961416034041,0.14695655576475233,1,0,31580.012815402395,1.5707646611965951,1.9108197461159522,1.0200356176007532,1.0000231957796912,6.8110691275070148E-3,1,0,1,0,0.97906582896676631,8.7353178777916138E-2,5.6801948674869855,-102.35850447570606,77.641495524293944,null,1000000000,61668038.409999996,null,13.343171300071333,-31.944695404798193,null,40.778497335190792,-70.413809070907817,null,0,0]
[7943.3,7.9432999999999998,{"$f":"SQRT(1+(A141/pole1)^2)","v":3.6287071215940836},{"$f":"ATAN(A141/pole1)","v":1.2916030576330519},{"$f":"SQRT(1+(A141/Zero1)^2)","v":1.0111470602111989},{"$f":"ATAN(A141/Zero1)","v":0.14862360678535513},{"$f":"IF(VIN_nom>Vout, 1, SQRT(1+(A141/z_RHP)^2))","v":1},{"$f":"IF(VIN_nom>Vout, 0, -ATAN(A141/z_RHP))","v":0},{"$f":"SQRT(1+(A141/Pole2)^2)","v":31943.551527937398},{"$f":"ATAN(A141/Pole2)","v":1.5707650215720166},{"$f":"SQRT(1+(A141/Zero2)^2)","v":1.9268169768360885},{"$f":"ATAN(A141/Zero2)","v":1.0251266273596915},{"$f":"SQRT(1+(A141/pole4)^2)","v":1.0000237328915507},{"$f":"ATAN(A141/pole4)","v":6.8894734465206357E-3},{"$f":"IF(VOUT_setting=1,1,SQRT(1+(A141*zterm1)^2))","v":1},{"$f":"IF(VOUT_setting=1,0,ATAN(((A141*zterm1))))","v":0},1,{"$f":"IF(VOUT_setting=1,0,ATAN(A141*$Q$4/(1+Afbr-$Q$5*(A141)^2)))","v":0},{"$f":"SQRT((1-(Z141/pterm2))^2+(A141/pterm1)^2)","v":0.97858314093651599},{"$f":"IF((ATAN((A141/pterm1)/(1-A141^2/pterm2))>0),ATAN((A141/pterm1)/(1-A141^2/pterm2)),PI()+ATAN((A141/pterm1)/(1-A141^2/pterm2)))","v":8.8405068339803314E-2},{"$f":"20*LOG10(((E141*K141*G141*O141)/(C141*I141*S141*M141*Q141))*Adc)","v":5.5678387400894849},{"$f":"((F141+L141+H141+P141)-(D141+J141+T141+N141+R141))*radconv","v":-102.21065090419735},{"$f":"IF(V141>0,V141,V141+180)","v":77.789349095802649},null,{"$f":"IF(U141<0,A141,1000000000)","v":1000000000},{"$f":"A141^2","v":63096014.890000001},null,{"$f":"20*LOG10((K141/(I141*M141))*AEA)","v":13.316163545909339},{"$f":"(L141-(J141+N141))*radconv","v":-31.657514916388731},null,{"$f":"20*LOG10((E141*G141/(C141*S141))*Acs*Am)","v":40.693148961955288},{"$f":"(F141+H141-(D141+T141))*radconv","v":-70.553135987808588},null,{"$f":"SUM((U142<0)*(U141>0))*A141","v":0},0]
[8035.8,{"$f":"A142/1000","v":8.0358000000000001},3.6677714810522808,1.2946550834803272,1.011406714927374,0.15032852248320369,1,0,32315.535276940347,1.5707653819260714,1.9432366564631491,1.0302490013228125,1.0000242888438076,6.969699017117581E-3,1,0,1,0,0.97808362171039165,8.9483085135043189E-2,5.4546334267848344,-102.06072726693505,77.939272733064954,null,1000000000,64574081.640000001,null,13.289300237627963,-31.368641740254819,null,40.606806956932012,-70.692085526680231,null,0,0]
[8128.3,8.1282999999999994,3.7068692850292386,1.2976427548434875,1.0116693080233246,0.15203255806207661,1,0,32687.5190259474,1.5707657340784729,1.9597064689293291,1.0352854064343446,1.000024851232356,7.0499244979972267E-3,1,0,{"$f":"IF(VOUT_setting=1,1,SQRT((1+Afbr-$Q$5*(A143)^2)^2+(A143*$Q$4)^2))","v":1},0,0.97757842334652922,9.0562835599723709E-2,5.3431654524688463,-101.91219132569169,78.087808674308306,null,1000000000,66069260.890000001,null,13.263189892718586,-31.084693741431611,null,40.521449327525403,-70.827497584260072,null,0,0]
[8222.9500000000007,8.2229500000000009,3.7469093762309296,1.3006353005487028,1.0119410438678438,0.15377528030821436,1,0,33068.148883719259,1.5707660862149455,1.9766096802316027,1.0403518631870243,1.0000254333550571,7.1320145852966591E-3,1,0,1,0,0.97705560778298994,9.166950130302047E-2,5.2308606205154788,-101.76164521145373,78.238354788546275,null,1000000000,67616906.702500015,null,13.237224165064724,-30.799130743567027,null,40.435110223225891,-70.96251446788672,null,0,0]
[8270.2750000000015,8.2702750000000016,3.7669418042307088,1.302107710236267,1.0120780638300249,0.15464628917716258,1,0,33258.4638126067,1.5707662592606357,1.9850800693165309,1.0428527033543264,1.0000257269435131,7.1730595929691233E-3,1,0,1,0,0.97679197292395015,9.222353144843809E-2,5.1753598452689236,-101.68692056280042,78.313079437199576,null,1000000000,68397448.575625017,null,13.224517810194802,-30.658204777080218,null,40.392315802849261,-71.028715785720223,null,0,0]
[8317.6,8.3176000000000005,3.7869823125129103,1.3035645392274646,1.0122158514035431,0.15551706157494602,1,0,33448.778741495124,1.5707664303371551,1.9935627679470052,1.045332276546411,1.0000260222167041,7.2141045764723844E-3,1,0,1,0,0.97652685403378336,9.2778030552388591E-2,5.1202863330520021,-101.61256201786129,78.387437982138707,null,1000000000,69182469.760000005,null,13.211991344977632,-30.51849720430781,null,40.34976875584951,-71.094064813553501,null,0,0]
[8366.0499999999993,8.3660499999999995,3.8075074570323482,1.3050401094633679,1.0123577093066269,0.15640828754431493,1,0,33643.617797061765,1.5707666034754195,2.0022597041093118,1.0478490129224276,1.0000263262543507,7.2561252475549839E-3,1,0,1,0,0.97625389596809642,9.334620012300783E-2,5.0643407584620883,-101.53681535117843,78.463184648821567,null,1000000000,69990792.602499992,null,13.19935006838152,-30.376716358850157,null,40.306464457855711,-71.160098992328273,null,0,0]
[8414.5,8.4145000000000003,3.828040802756266,1.3064998531361487,1.0125003710832754,0.15729926307289221,1,0,33838.456852629417,1.5707667746198521,{"$f":"SQRT(1+(A148/Zero2)^2)","v":2.0109692127668772},{"$f":"ATAN(A148/Zero2)","v":1.0503439650145916},1.0000266320577798,7.2981458930123366E-3,1,0,1,0,0.97597938358319036,9.3914867755921505E-2,5.0088319588383214,-101.46145280711079,78.538547192889212,null,1000000000,70803810.25,null,13.186890525016775,-30.236183545212047,null,40.263415201596686,-71.225269261898731,null,0,0]
[8462.9500000000007,8.4629500000000011,3.8485822184169742,1.3079440173925243,1.0126438363937378,0.15818998685224539,1,0,34033.295908198044,1.5707669438046967,2.0196911312706947,1.052817383782146,1.0000269396269894,7.34016651269607E-3,1,0,1,0,0.97570331744491423,9.4484036772701896E-2,4.9537544971599914,-101.38647443444998,78.61352556555002,null,1000000000,71621522.702500015,null,13.174609382073857,-30.096884386441509,null,40.220618882861274,-71.289590048008449,null,0,0]
[8511.4,8.5114000000000001,3.8691315754833644,1.3093728443917709,1.0127881048965433,0.15908045757627914,1,0,34228.134963767625,1.5707671110634172,2.0284252995394483,1.0552695169250554,1.0000272489619779,7.3821871064578114E-3,1,0,1,0,0.97542569812317725,9.5053710502904468E-2,4.899103034015849,-101.31188018324998,78.688119816750017,null,1000000000,72443929.959999993,null,13.162503379908419,-29.958804692284826,null,40.178073421882566,-71.353075490965168,null,0,0]
[8560.9500000000007,8.5609500000000001,3.8901555641702421,1.3108184949532589,1.0129364792402236,0.15999088228869654,1,0,34427.397609867126,1.5707672801614139,2.0373702726910361,1.0577555616081462,1.0000275671464192,7.4251617011820113E-3,1,0,1,0,0.97514016990242225,9.5636843512187569E-2,4.8436459256426758,-101.23598950921145,78.76401049078855,null,1000000000,73289864.902500018,null,13.150300353457244,-29.818836775608361,null,40.134819339960572,-71.417152733603103,null,0,0]
[8610.5,8.6105,3.9111875955012034,1.3122486007859038,1.0130856929334244,0.16090103956906979,1,0,34626.660255967588,1.5707674473132271,2.0463277275143428,1.0602198569273531,1.0000278871777257,7.4681362684799113E-3,1,0,1,0,0.97485301838996508,9.6220511482688301E-2,4.7886233863789442,-101.16050019524259,78.839499804757409,null,1000000000,74140710.25,null,13.138273841050099,-29.680114892611456,null,40.091823313103987,-71.480385302631134,null,0,0]
[8660.0499999999993,8.66005,3.932227540424861,1.3136634055154521,1.0132357456053269,0.16181092802795966,1,0,34825.922902069011,1.5707676125522634,2.0552975008154668,1.0626626575127822,1.0000282090558961,7.5111108081928083E-3,1,0,1,0,0.97456424420869503,9.6804718002221277E-2,4.7340300079305049,-101.08541189792057,78.914588102079435,null,1000000000,74996466.002499983,null,13.126420581512651,-29.542624455968635,null,40.049083194192995,-71.54278744195193,null,0,0]
[8709.6,8.7096,3.9532752725891096,1.315063147827235,1.0133866368832467,0.16272054627852797,1,0,35025.185548171379,1.5707677759111687,2.0642794320144779,1.0650842145980948,1.0000285327809286,7.5540853201619971E-3,1,0,1,0,0.97427384798600958,9.7389466667592975E-2,4.6798604797381422,-101.01072418568219,78.989275814317807,null,1000000000,75857132.160000011,null,13.114737385872552,-29.406351072912802,null,40.00659686164073,-71.604373112769409,null,0,{"$f":"IF(AH154>0,W154,0)","v":0}]
[8760.3250000000007,8.7603249999999999,3.9748300557515943,1.3164807245287087,1.0135419745896113,0.16365145334861803,1,0,35229.173393248871,1.5707679412296445,2.0734867843456279,1.0675414487539492,1.0000288660956613,7.5980788759125797E-3,1,0,1,0,0.97397488594158099,9.7988647071309998E-2,4.6248400085138366,-100.93467978050606,79.065320219493941,null,1000000000,76743294.105625018,null,13.102950047079513,-29.268092043470187,null,39.963363729209462,-71.666587737035897,null,0,0]
[8811.0499999999993,8.8110499999999998,3.99639274025771,1.3178830068480107,1.0136981903496312,0.16458207431046493,1,0,35433.161238327317,1.5707681046446513,2.0827065456497094,1.0699769420538772,1.0000292013458818,7.6420724022514706E-3,1,0,1,0,0.9736742253604701,9.8588403295361643E-2,4.5702527695622912,-100.85905400519316,79.140945994806842,null,1000000000,77634602.102499992,null,13.09133439406583,-29.131078562570675,null,39.920392143271599,-71.727975442622494,null,0,0]
[8861.7749999999996,8.8617749999999997,4.0179631988980979,1.3192702355493415,1.0138552837574326,0.16551240768475578,1,0,35637.149083406694,1.570768266188876,2.0919385518572331,1.0723909532487079,1.0000295385315876,7.6860658990084091E-3,1,0,1,0,0.9733718669305691,9.9188739228267042E-2,4.5160933699112844,-100.78384613860274,79.21615386139726,null,1000000000,78531056.15062499,null,13.079887228830216,-28.995295806746856,null,39.877679908856209,-71.788550331855873,null,0,0]
[8912.5,8.9124999999999996,4.0395413071351225,1.3206426464870635,1.0140132544051135,0.16644245199508315,1,0,35841.136928486994,1.5707684258942605,{"$f":"SQRT(1+(A158/Zero2)^2)","v":2.1011826415662083},{"$f":"ATAN(A158/Zero2)","v":1.0747837375463638},1.0000298776527772,7.7300593660131313E-3,1,0,1,0,0.97306781134479814,9.978965876871608E-2,4.4623565147443438,-100.70905538164823,79.290944618351773,null,1000000000,79432656.25,null,13.068605424831894,-28.860729155482257,null,39.835224857687585,-71.848326226166009,null,0,0]
[8964.4,8.9643999999999995,4.0616270435464141,1.3220317524918561,1.0141757918322754,0.16739373924143261,1,0,36049.849972542492,1.5707685874284114,2.1106532034830696,1.0772102409576039,1.0000302266326622,7.7750718720064824E-3,1,0,1,0,0.97275495672600931,0.10040510620102314,4.4078068104044501,-100.63296296640077,79.367037033599232,null,1000000000,80360467.359999999,null,13.057230251065668,-28.724289032732013,null,39.79205032711392,-71.908673933668766,null,0,0]
[9016.2999999999993,9.0162999999999993,4.0837205325545778,1.3234058306156606,1.0143392467405961,0.16834472075925419,1,0,36258.563016598913,1.570768747102903,2.1201360816871766,1.079615052046091,1.0000305776387328,7.8200843464926745E-3,1,0,1,0,0.97244032689824733,0.10102117288180823,4.3536885440341946,-100.55730528446247,79.442694715537527,null,1000000000,81293665.689999983,null,13.046021787415391,-28.58909168016892,null,39.749140524393944,-71.968213604293553,null,0,0]
[9068.2000000000007,9.0682000000000009,4.1058216490090871,1.3247651183069153,1.014503618686607,0.16929539497667026,1,0,36467.276060656266,1.5707689049496658,2.1296311116516589,1.0819984329579828,1.0000309306709867,7.8650967892893425E-3,1,0,1,0,0.97212392262018499,0.10163786302057258,4.2999963492844167,-100.48208125382587,79.517918746174132,null,1000000000,82232251.24000001,null,13.034976905433581,-28.455122079743532,null,39.706493211625975,-72.026959174082336,null,0,0]
[9120.1,9.1201000000000008,4.1279302703969156,1.3261098481483604,1.01466890722464,0.17024576032504063,1,0,36675.989104714499,1.5707690609999028,2.1391381315618268,1.084360642162024,1.0000312857294218,7.9101092002141146E-3,1,0,1,0,0.9718057446560957,0.10225518083830057,4.2467249580824236,-100.40728972483062,79.592710275169381,null,1000000000,83176224.010000005,null,13.024092547175005,-28.322365424064987,null,39.664106178682552,-72.084924300765607,null,0,0]
[9173.2000000000007,9.1732000000000014,4.1505577159312015,1.3274708409617866,1.0148389656222185,0.17121777814229858,1,0,36889.527883896386,1.5707692188307267,2.1488772099787643,1.0867558230340326,1.0000316510942935,7.9561623273484358E-3,1,0,1,0,0.97147837510379831,0.10288742593063348,4.1926519753419438,-100.33121526349049,79.668784736509508,null,1000000000,84147598.24000001,null,13.013119544192746,-28.187779361632916,null,39.621006198924334,-72.143435901857558,null,0,0]
[9226.2999999999993,9.2262999999999984,4.1731927661702226,1.3288170724228536,1.0150099825367427,0.17218946933086271,1,0,37103.066663079175,1.5707693748448273,2.1586285049905856,1.0891293776477091,1.0000320185801213,8.0022154207337725E-3,1,0,1,0,0.97114915053369488,0.1035203370393024,4.1390086293095072,-100.25559090063638,79.744409099363622,null,1000000000,85124611.689999983,null,13.002308315962861,-28.05443228650708,null,39.57817408112178,-72.201158614129284,null,0,0]
[9279.4,9.279399999999999,4.1958352980398894,1.3301487765878248,1.0151819574837988,0.17316083222135972,1,0,37316.605442262859,1.5707695290733925,2.1683918517825926,1.0914815711988719,1.0000323881869027,8.0482684801748139E-3,1,0,1,0,0.97081807178266,0.10415391872278654,4.0857895831870703,-100.18041521070862,79.819584789291383,null,1000000000,86107264.359999999,null,12.991655804826552,-27.922309005862097,null,39.535607546135651,-72.258106204846527,null,0,0]
[9332.5,9.3324999999999996,4.2184851910682424,1.3314661826947891,1.015354889976589,0.17413186514802204,1,0,37530.144221447423,1.5707696815469003,2.1781670882932445,1.093812665077051,1.0000327599146352,8.0943215054762527E-3,1,0,1,0,0.97048513969380745,0.10478817555253171,4.0329895984729278,-100.10568671066643,79.894313289333567,null,1000000000,87095556.25,null,12.981159022601251,-27.791394544916127,null,39.49330434364682,-72.314292165750317,null,0,0]
[9386.85,9.3868500000000008,4.2416757737176152,1.3328000286196704,1.015532884497051,0.17512541322392758,1,0,37748.709808052488,1.5707698358232793,2.188184585194541,1.0961770523603809,1.00003314258945,8.1414586059843884E-3,1,0,1,0,0.97014245181305969,0.10543806705684539,3.9793752845080057,-100.02966056527563,79.970339434724366,null,1000000000,88112952.922499999,null,12.970573364153811,-27.658634728598223,null,39.450275688129338,-72.371025836677404,null,0,0]
[9441.2000000000007,9.4412000000000003,4.2648738208452723,1.33411936641993,1.015711881136464,0.17611861209844715,1,0,37967.275394658434,1.5707699883234176,2.1982142032328702,1.0985198770358984,1.0000335274862429,8.1885956703126352E-3,1,0,1,0,0.96979782411798288,0.10608867560129139,3.9261891946457279,-99.954099599293713,80.045900400706287,null,1000000000,89136257.440000013,null,12.960144733188553,-27.527110254860617,null,39.407518229232316,-72.426989344433082,null,0,0]
[9495.5499999999993,9.4955499999999997,4.2880792113051456,1.3354244270016025,1.0158918793651182,0.17711145999721487,1,0,38185.840981265246,1.5707701390778157,2.2082557772502311,1.1008414073625614,1.000033914605011,8.2357326982515668E-3,1,0,1,0,0.96945125753313155,0.10674000613066786,3.8734260172324357,-99.879002059271102,80.120997940728898,null,1000000000,90165469.80249998,null,12.949870139865183,-27.396805755332746,null,39.365029645142386,-72.48219630393838,null,0,0]
[9549.9,9.5498999999999992,4.311291826521483,1.3367154364947003,1.016072878650716,0.17810395514988661,1,0,38404.406567872917,1.5707702881162793,2.2183091448839831,1.1031419076631634,1.0000343039457524,8.2828696895917639E-3,1,0,1,0,0.96910275299002913,0.10739206360444337,3.8210805390090874,-99.804366144208288,80.195633855791712,null,1000000000,91200590.00999999,null,12.939746662852333,-27.267706087129838,null,39.322807643931895,-72.53666005707845,null,0,0]
[9605.5249999999996,9.6055250000000001,4.3350563477689796,1.3380224135599561,1.0162591600097017,0.17911936620849872,1,0,38628.099498049545,1.5707704389046533,2.2286104003927107,1.1054748714802001,1.0000347047208324,8.331112432402003E-3,1,0,1,0,0.96874406715128769,0.10806017565028982,3.7679342579209014,-99.72845541084024,80.27154458915976,null,1000000000,92266110.52562499,null,12.929539195442391,-27.136809851599924,null,39.279868830253648,-72.591645559240305,null,0,0]
[9661.15,9.6611499999999992,4.3588281933591144,1.3393151370292302,1.0164464888077749,0.18013440403741346,1,0,38851.79242822704,1.5707705879566705,2.2389236739487393,1.1077863548702691,1.0000351078233531,8.3793551364323444E-3,1,0,1,0,0.96838335335928383,0.1087290597066517,3.7152147600704586,-99.653024260110357,80.346975739889643,null,1000000000,93337819.32249999,null,12.919484037842587,-27.007144252170971,null,39.237204490003009,-72.645880007939368,null,0,0]
[9716.7749999999996,9.7167750000000002,4.3826072441072599,1.34059383455688,1.0166348644659209,0.18114906675193879,1,0,39075.485358405378,1.5707707353021503,2.2492488002363351,1.1100766287782087,1.0000355132533123,8.4275978014582767E-3,1,0,1,0,0.9680206126355293,0.10939872113875843,3.6629167623002563,-99.578070628742353,80.421929371257647,null,1000000000,94415716.40062499,null,12.909578269495016,-26.878693766542895,null,39.194812260580377,-72.699376862199458,null,0,0]
[9772.4,9.7723999999999993,4.4063933833657609,1.3418587290673714,1.0168242864023196,0.18216335247186491,1,0,39299.178288584561,1.5707708809702343,2.2595856167731232,1.1123459600895083,1.000035921010707,8.4758404272552938E-3,1,0,1,0,0.96765584600932275,0.11006916532843775,3.6110350798338549,-99.503592415696076,80.496407584303924,null,1000000000,95499801.75999999,null,12.899819037307626,-26.751443104960359,null,39.152689810301368,-72.752149310735732,null,0,0]
[9829.2999999999993,9.8292999999999999,4.4307319480764127,1.3431385630232697,1.0170191320616582,0.18320049497710339,1,0,39527.998562332745,1.5707710282714076,2.2701712958526485,1.1146459134394091,1.0000363405225168,8.5251887982597634E-3,1,0,1,0,0.96728062343225163,0.11075579250726381,3.5583896330647731,-99.427896723995701,80.572103276004299,null,1000000000,96615138.48999998,null,12.88998481757295,-26.622501377906673,null,39.109878583266962,-72.805395346089,null,0,0]
[9886.2000000000007,9.8862000000000005,4.4550776909119314,1.3444044111706808,1.017215071272668,0.18423723904177988,1,0,39756.818836081788,1.5707711738769978,2.2807688721427488,1.1169245053157919,1.0000367624696749,8.5745371277411338E-3,1,0,1,0,0.9669032832193456,0.11144325018418028,3.5061691361006346,-99.352693940242389,80.647306059757611,null,1000000000,97736950.440000013,null,12.880298097820004,-26.494783473602297,null,39.067344806055772,-72.857910466640092,null,0,0]
[9943.1,9.9431000000000012,4.4794304948328056,1.3456564975245657,1.0174121034035406,0.18527358266807861,1,0,39985.639109831653,1.570771317816114,2.2913781805703781,1.1191820086097126,1.000037186852178,8.623885415459099E-3,1,0,1,0,0.96652382649784307,0.11213154417439264,3.454368344353794,-99.277981713349504,80.722018286650496,null,1000000000,98865237.610000014,null,12.870756031766184,-26.3682737581955,null,39.025086080362748,-72.909707955153991,null,0,0]
[10000,10,4.5037902452973624,1.34689504142806,1.017610227819435,0.18630952386316746,1,0,40214.45938358234,1.5707714601172034,2.3019990589245301,1.1214186920441729,1.0000376136700229,8.6732336611733667E-3,1,0,1,0,0.96614225440366897,0.11282068031185297,3.4029821113235865,-99.203757664116907,80.796242335883093,null,1000000000,100000000,null,12.861355839364609,-26.24295683660856,null,38.983100039734119,-72.960800827508365,null,0,0]
[10058.25,10.058249999999999,4.5287350298605196,1.3481491668253442,1.0178141837020156,0.18736962468602211,1,0,40448.708609347283,1.5707716041267452,2.3128837450129338,1.1236871522455236,1.0000380531371726,8.7237526914517496E-3,1,0,1,0,0.96574943913663713,0.11352704524556433,3.3508008533912559,-99.128275765593202,80.871724234406798,null,1000000000,101168393.0625,null,12.851876747378629,-26.115886419291556,null,38.940397873787767,-73.012389346301632,null,0,0]
[10116.5,10.1165,4.5536868593119451,1.3493895502493487,1.0180192829591013,0.18842929954459522,1,0,40682.957835113048,1.5707717464778963,2.3237802214633181,1.125934349771744,1.0000384951565897,8.7742716771999994E-3,1,0,1,0,0.96535440936544392,0.11423430519589195,3.2990434490445049,-99.053300360605149,80.946699639394851,null,1000000000,102343572.25,null,12.842540649885061,-25.990034165951904,null,38.897976566934588,-73.063266194653252,null,0,0]
[10174.75,10.17475,4.5786456184759761,1.3506164125793023,1.0182255248997689,0.18948854631717171,1,0,40917.207060879628,1.570771887199139,2.3346883231914672,1.1281605597961275,1.0000389397282705,8.8247906181603102E-3,1,0,1,0,0.9649571663373705,0.11494246648398623,3.2477046814739325,-98.978828823689781,81.021171176310219,null,1000000000,103525537.5625,null,12.833344768441064,-25.865384311938371,null,38.855833680808011,-73.113444511751382,null,0,0]
[10233,10.233000000000001,4.603611194643034,1.3518299700679022,1.0184329088298065,0.19054736288759291,1,0,41151.456286647008,1.5707720263183076,2.3456078880095204,1.1303660532082069,1.0000393868522119,8.8753095140748778E-3,1,0,1,0,0.96455771130942847,0.11565153545224466,3.1967794319004259,-98.904858510606473,81.095141489393527,null,1000000000,104714289,null,12.824286389774377,-25.741921338004012,null,38.813966809901189,-73.162937172602469,null,0,0]
[10292.5,10.2925,4.629119436106075,1.3530560535385807,1.0186459213451295,0.19162845450016741,1,0,41390.732319835108,1.5707721667971375,2.3567734472878801,1.1325977638482423,1.0000398462060867,8.926912459694146E-3,1,0,1,0,0.96414740189155557,0.11637676421635137,3.1451830672345387,-98.829815558488676,81.170184441511324,null,1000000000,105935556.25,null,12.815172830787615,-25.617018416931327,null,38.77148400422206,-73.21279714155736,null,0,0]
[10352,10.352,4.6546345601571595,1.3542686968701674,1.0188601239134896,0.19270909280338894,1,0,41630.008353024015,1.5707723056611123,2.3679506338229173,1.1348084171974455,1.000040308222929,8.9785153577698895E-3,1,0,1,0,0.96373478720204997,0.11710295348039525,3.0940076652700315,-98.755289947074999,81.244710052925001,null,1000000000,107163904,null,12.806197216982905,-25.493321894504238,null,38.729284216062261,-73.261968052570808,null,0,0]
[10411.5,10.4115,4.6801564542294827,1.3554681163426507,1.019075515784464,0.19378927556001022,1,0,41869.284386213709,1.5707724429379175,2.3791392837402259,1.1369982885810825,1.0000407729027352,9.0301182080273473E-3,1,0,1,0,0.9633198686123613,0.11783011007367079,3.0432480727054845,-98.68127881436547,81.31872118563453,null,1000000000,108399332.25,null,12.797356855924779,-25.370815997317536,null,38.687364984555842,-73.310462817047906,null,0,0]
[10471,10.471,4.7056850081687767,1.3566545236967698,1.0192920962041003,0.19486900053892212,1,0,42108.560419404188,1.5707725786546103,2.3903392360671312,1.1391676489694982,1.0000412402455019,9.0817210101917685E-3,1,0,1,0,0.96290264750475085,0.1185582408493496,2.9928992332878055,-98.607779288778929,81.392220711221071,null,1000000000,109641841,null,12.788649118679764,-25.249485201448593,null,38.64572388238318,-73.358294087330336,null,0,0]
[10532,10.532,4.7318639400836844,1.3578575491753344,1.0195153697127979,0.19597546791202231,1,0,42353.86862149943,1.5707727162008083,2.4018331080146607,1.1413706851354193,1.0000417221345215,9.1346246731205324E-3,1,0,1,0,0.96247251935682676,0.11930574639351854,2.9417023184039506,-98.532954936459092,81.467045063540908,null,1000000000,110923024,null,12.779856852730413,-25.126299564309111,null,38.603319233448673,-73.406655372150013,null,0,0]
[10593,10.593,4.7580496449200487,1.35904733477059,1.0197398908361608,0.19708144940597164,1,0,42599.176823595459,1.5707728521628812,2.4133385258740585,1.143552726174675,1.0000422068224528,9.1875282849159922E-3,1,0,1,0,0.96203997411167397,0.1200542905232051,2.8909266682776873,-98.45866217855145,81.54133782144855,null,1000000000,112211649,null,12.771198583098659,-25.004316765625873,null,38.561201852954163,-73.454345412925576,null,0,0]
[10654,10.654,4.7842420114666986,1.3602240945398913,1.0199656587502914,0.19818694263686912,1,0,42844.485025692258,1.5707729865680391,2.4248553252967113,1.1457140503072363,1.0000426943092917,9.2404318452820912E-3,1,0,1,0,0.96160501329451598,0.12080388070249207,2.8405671374097636,-98.384897904598759,81.615102095401241,null,1000000000,113507716,null,12.762671673577444,-24.883520866110786,null,38.519369231607456,-73.501377038487959,null,0,0]
[10715,10.715,4.8104409309066103,1.3613880380234322,1.0201926726274477,0.19929194522769186,1,0,43089.793227789829,1.5707731194428725,2.4363833448804622,1.1478549312693858,1.0000431845950339,9.2933353539227746E-3,1,0,1,0,0.9611676384427762,0.12155452442270163,2.7906186777320978,-98.311659003357178,81.688340996642822,null,1000000000,114811225,null,12.75427355069181,-24.763896183336726,null,38.477818894815428,-73.547762820020466,null,0,0]
[10777.5,10.7775,4.8372907713131701,1.3625675246601066,1.0204265602408498,0.20042360864921227,1,0,43341.133598792221,1.5707732540250576,2.4482063120255346,1.1500275350525109,1.0000436898399667,9.3475397145550976E-3,1,0,1,0,0.96071700628560686,0.12232472717709851,2.7398631565375204,-98.237160803618835,81.762839196381165,null,1000000000,116154506.25,null,12.745799865600489,-24.642528547957454,null,38.435537058712171,-73.594632255661352,null,0,0]
[10840,10.84,4.8641472670047774,1.3637339882670196,1.0206617540759728,0.20155475197429396,1,0,43592.473969795385,1.5707733870553264,2.4600407241032487,1.1521792456078117,1.0000441980231376,9.4017440202576238E-3,1,0,1,0,0.9602638432182995,0.12309605193352569,2.6895287463101951,-98.163207526260379,81.836792473739621,null,1000000000,117505600,null,12.737456103631366,-24.522357914288797,null,38.393546410453972,-73.640849611971575,null,0,0]
[10902.5,10.9025,4.8910103083490943,1.3648876402237957,1.0208982532300377,0.20268537266883732,1,0,43843.814340799319,1.5707735185603686,2.4718864167322114,1.1543103432383393,1.0000447091445419,9.4559482707119256E-3,1,0,1,0,0.95980815093479321,0.12386850684008634,2.6396103206656236,-98.089795835816375,81.910204164183625,null,1000000000,118864506.25,null,12.729239690464635,-24.403368223659879,null,38.35184439797613,-73.686427612156535,null,0,0]
[10965,10.965,4.9178797880827378,1.3660286874285634,1.0211360567960934,0.20381546820642868,1,0,44095.154711803996,1.5707736485662653,2.4837432285117549,1.1564211036513232,1.0000452232041757,9.5101524655995685E-3,1,0,1,0,0.95934993114277078,0.12464210007589784,2.5901028507239414,-98.016922404673721,81.983077595326279,null,1000000000,120231225,null,12.721148113535826,-24.285543680686132,null,38.310428504963255,-73.731378723987618,null,0,0]
[11028.75,11.02875,4.9452931814035184,1.3671797801801318,1.021379959293802,0.2049676220260549,1,0,44351.521890229524,1.570773779654292,2.4958484671325811,1.158553409095695,1.0000457505719607,9.5654406868099628E-3,1,0,1,0,0.95887994490102424,0.12543234639811268,2.5400234818491834,-97.943142578834113,82.056857421165887,null,1000000000,121633326.5625,null,12.713020768222867,-24.166546870477699,null,38.268476481401457,-73.776595708356425,null,0,0]
[11092.5,11.092499999999999,4.972713055058839,1.3683181800208324,1.0216252169825069,0.20611922418738507,1,0,44607.889068655808,1.5707739092355599,2.5079649441172562,1.1606651208817202,1.0000462809966699,9.6207288495395987E-3,1,0,1,0,0.95840733267229294,0.12622379432699904,2.4903614024756102,-97.869915797482093,82.130084202517907,null,1000000000,123043556.25,null,12.705018211014703,-24.048729900296991,null,38.226816959236054,-73.821185897185089,null,0,0]
[11156.25,11.15625,5.0001393024376997,1.3694440928410319,1.0218718288864368,0.20727027203425016,1,0,44864.256247082834,1.5707740373358989,2.5200924973653338,1.1627565173501757,1.0000468144782981,9.6760169534505606E-3,1,0,1,0,0.95793209631348364,0.12701645264368913,2.4411115746405008,-97.797238566284506,82.202761433715494,null,1000000000,124461914.0625,null,12.697137963196246,-23.932076823852796,null,38.185447379219397,-73.865161742431738,null,0,0]
[11220,11.22,5.027571819230908,1.3705577201656129,1.022119794025377,0.20842076291891296,1,0,45120.623425510588,1.5707741639805521,2.5322309677349688,1.1648278722230279,1.0000473510168408,9.7313049982049402E-3,1,0,1,0,0.95745423769672455,0.12781033016401239,2.3922690561763553,-97.72510740689421,82.27489259310579,null,1000000000,125888400,null,12.689377605718331,-23.816571959458599,null,38.144365218233162,-73.908535447435611,null,0,0]
[11285.5,11.285500000000001,5.0557638081668452,1.3716893289743386,1.0223759744818348,0.2096022530264596,1,0,45384.028134327302,1.5707742926114803,2.5447138575720953,1.1669354963367913,1.0000479054678264,9.7881106920218851E-3,1,0,1,0,0.95696053215512666,0.12862727956928738,2.3425049014045864,-97.651561301907762,82.348438698092238,null,1000000000,127362510.25,null,12.681526609735535,-23.699076089323022,null,38.102452059444197,-73.952485212584733,null,0,0]
[11351,11.351000000000001,5.083962199396777,1.3728083861795695,1.0226335813760161,0.21078314953433827,1,0,45647.43284314475,1.5707744197579003,2.5572079408429786,1.1690225346597869,1.0000484631458497,9.8449163226666317E-3,1,0,1,0,0.9564640624691324,0.12944553501587752,2.2931604482502879,-97.578584274679912,82.421415725320088,null,1000000000,128845201,null,12.673797185549141,-23.582759609442171,null,38.060837030476286,-73.995824665237734,null,0,0]
[11416.5,11.416499999999999,5.1121668869767491,1.3739150967030411,1.0228926136302119,0.21196344959871796,1,0,45910.837551962934,1.5707745454453634,2.5697130542783895,1.1710892694099249,1.0000490240509055,9.9017218897726762E-3,1,0,1,0,0.95596483072012317,0.13026510618211767,2.2442306372624885,-97.506172615376272,82.493827384623728,null,1000000000,130336472.25,null,12.666186895272851,-23.467606351363866,null,38.019517509764775,-74.038566264012402,null,0,0]
[11482,11.481999999999999,5.1403777672646243,1.375009661090461,1.0231530701618445,0.21314315038528694,1,0,46174.24226078183,1.5707746696988381,2.5822290376290411,1.1731359780345636,1.0000495881829883,9.9585273929735166E-3,1,0,1,0,0.95546283900685236,0.13108600278632507,2.1957105058298381,-97.434322638479046,82.565677361520954,null,1000000000,131836324,null,12.658693360316571,-23.353600419934967,null,37.978490913288411,-74.080722218544082,null,0,0]
[11548.75,11.54875,5.1691332892623967,1.3761128212714038,1.0234199614201784,0.21434474507923004,1,0,46442.673777021664,1.5707747948735244,2.5949948958383011,1.1752014253329572,1.000050166400936,1.0016416904537279E-2,1,0,1,0,0.95494843001672702,0.13192393908134814,2.1466808595644835,-97.361675553115631,82.638324446884369,null,1000000000,133373626.5625,null,12.651174535033096,-23.238583003470808,null,37.936980092306527,-74.123092549644824,null,0,0]
[11615.5,11.615500000000001,5.1978950322950022,1.3772037744375034,1.0236883295510262,0.21554571149097757,1,0,46711.105293262211,1.5707749186095454,2.6077717160701432,1.1772466418995815,1.0000507479702438,1.007430634896493E-2,1,0,1,0,0.95443115917135757,0.13276327239260666,2.0980665696556842,-97.289604147645008,82.710395852354992,null,1000000000,134919840.25,null,12.643772157082516,-23.124724636278735,null,37.895768180348306,-74.164879511366252,null,0,0]
[11682.25,11.68225,{"$f":"SQRT(1+(A205/pole1)^2)","v":5.2266628936614596},{"$f":"ATAN(A205/pole1)","v":1.378282719534625},{"$f":"SQRT(1+(A205/Zero1)^2)","v":1.0239581733931715},{"$f":"ATAN(A205/Zero1)","v":0.21674604665153804},{"$f":"IF(VIN_nom>Vout, 1, SQRT(1+(A205/z_RHP)^2))","v":1},{"$f":"IF(VIN_nom>Vout, 0, -ATAN(A205/z_RHP))","v":0},{"$f":"SQRT(1+(A205/Pole2)^2)","v":46979.536809503479},{"$f":"ATAN(A205/Pole2)","v":1.5707750409315615},2.6205593379849947,1.1792719066598585,{"$f":"SQRT(1+(A205/pole4)^2)","v":1.0000513328909055},{"$f":"ATAN(A205/pole4)","v":1.0132195725868591E-2},{"$f":"IF(VOUT_setting=1,1,SQRT(1+(A205*zterm1)^2))","v":1},{"$f":"IF(VOUT_setting=1,0,ATAN(((A205*zterm1))))","v":0},1,{"$f":"IF(VOUT_setting=1,0,ATAN(A205*$Q$4/(1+Afbr-$Q$5*(A205)^2)))","v":0},{"$f":"SQRT((1-(Z205/pterm2))^2+(A205/pterm1)^2)","v":0.95391102874833489},{"$f":"IF((ATAN((A205/pterm1)/(1-A205^2/pterm2))>0),ATAN((A205/pterm1)/(1-A205^2/pterm2)),PI()+ATAN((A205/pterm1)/(1-A205^2/pterm2)))","v":0.13360401313584838},{"$f":"20*LOG10(((E205*K205*G205*O205)/(C205*I205*S205*M205*Q205))*Adc)","v":2.0498626795088328},{"$f":"((F205+L205+H205+P205)-(D205+J205+T205+N205+R205))*radconv","v":-97.218104607855906},{"$f":"IF(V205>0,V205,V205+180)","v":82.781895392144094},null,{"$f":"IF(U205<0,A205,1000000000)","v":1000000000},{"$f":"A205^2","v":136474965.0625},null,{"$f":"20*LOG10((K205/(I205*M205))*AEA)","v":12.636483888523735},{"$f":"(L205-(J205+N205))*radconv","v":-23.012009338499979},null,{"$f":"20*LOG10((E205*G205/(C205*S205))*Acs*Am)","v":37.854852558760243},{"$f":"(F205+H205-(D205+T205))*radconv","v":-74.206095269355927},null,{"$f":"SUM((U206<0)*(U205>0))*A205","v":0},0]
[11749,{"$f":"A206/1000","v":11.749000000000001},5.2554367728878857,1.3793498512648898,1.0242294917802408,0.21794574760231619,1,0,47247.968325745423,1.5707751618636729,2.633357604223483,1.1812774937784161,1.0000519211629153,1.0190085034860385E-2,1,0,1,0,0.95338804104445463,0.13444617177143142,2.0020643272274845,-97.147173151090101,82.852826848909899,null,1000000000,138039001,null,12.629307448400784,-22.900421403017067,null,37.814230646601843,-74.246751748073038,null,0,0]
[11817.5,11.817500000000001,5.2849711769807293,1.3804328780670003,1.0245094551941933,0.21917623892659954,1,0,47523.437372376451,1.5707752845459482,2.6465023101555527,1.1833154861923276,1.0000525283420749,1.0249491970078984E-2,1,0,{"$f":"IF(VOUT_setting=1,1,SQRT((1+Afbr-$Q$5*(A207)^2)^2+(A207*$Q$4)^2))","v":1},0,0.95284837385383503,0.13531189462966042,1.9534294585795973,-97.074968754105285,82.925031245894715,null,1000000000,139653306.25,null,12.622056792795444,-22.787063834729153,null,37.772846433559295,-74.28790491937616,null,0,0]
[11886,11.885999999999999,5.3145117111612636,1.3815038661777763,1.0247909689781025,0.22040605607127936,1,0,47798.906419008192,1.5707754058141674,2.6596578994277609,1.1853333256853571,1.0000531390505996,1.0308898832950452E-2,1,0,1,0,0.952305702562108,0.13617913316799901,1.9052115924522053,-97.003354652782932,82.996645347217068,null,1000000000,141276996,null,12.614919216202766,-22.674860858589334,null,37.731766144024576,-74.328493794193605,null,0,0]
[11954.5,11.954499999999999,5.3440582737730011,1.3825630128005451,1.0250740318546443,0.22163519587326522,1,0,48074.375465640624,1.5707755256926381,2.6728242113373408,1.187331293522579,1.0000537532884828,1.0368305623055607E-2,1,0,1,0,0.95176002971538753,0.13704789884036103,1.8574057705976834,-96.932326869600971,83.067673130399029,null,1000000000,142910070.25,null,12.607892430179353,-22.563796360664597,null,37.690987108193468,-74.368530508936388,null,0,0]
[12023,12.023,5.3736107653747514,1.38361051090811,1.02535864254088,0.22286365518113643,1,0,48349.844512273739,1.5707756442051146,2.6860010882027661,1.1893096660911537,1.0000543710557181,1.0427712339975271E-2,1,0,1,0,0.95121135788164124,0.13791820315186565,1.8100071299536455,-96.861881466363741,83.138118533636259,null,1000000000,144552529,null,12.600974202553312,-22.453854506474123,null,37.650506695175473,-74.408026959889597,null,0,0]
[12093,12.093,5.4038164157626865,1.3846691095102526,1.0256510832582599,0.22411830878132091,1,0,48631.345727811924,1.5707757639257203,2.6994772633326423,1.1913113996935254,1.0000550059968223,1.0488419857864631E-2,1,0,1,0,0.95064757581859327,0.13880916679588559,1.7619862527984278,-96.790491055763638,83.209508944236362,null,1000000000,146240649,null,12.594014365426174,-22.342648763266837,null,37.609445655147397,-74.447842292496787,null,0,0]
[12163,12.163,5.4340280545084934,1.3857159382649313,1.0259451375881814,0.22537224514187784,1,0,48912.846943350793,1.5707758822683038,2.7129641476143269,1.1932932388446149,1.0000556446235269,1.0549127298443151E-2,1,0,1,0,0.95008066748043674,0.13970176166007972,1.7143806110739535,-96.71970062412376,83.28029937587624,null,1000000000,147938569,null,12.5871633529572,-22.232582804770622,null,37.568691025891894,-74.487117819353173,null,0,0]
[12233,12.233000000000001,5.4642455822838576,1.3867511901219562,1.0262408041435731,0.22662546093778277,1,0,49194.348158890345,1.5707759992565209,2.7264615821241578,1.1952554633241548,1.0000562869358256,1.060983466126352E-2,1,0,1,0,0.94951063567923233,0.14059600019069315,1.6671853084315718,-96.64950610141301,83.35049389858699,null,1000000000,149646289,null,12.580418954906897,-22.123640602117312,null,37.528240121299817,-74.525865499295705,null,0,0]
[12303,12.303000000000001,5.4944689019263873,1.3877750538862221,1.0265380815313612,0.22787795285688495,1,0,49475.84937443056,1.5707761149134896,2.7399694109468804,1.1971983480053803,1.0000569329337106,1.0670541945878425E-2,1,0,1,0,0.9489374832515155,0.14149189489179242,1.620395542549173,-96.579903463780127,83.420096536219873,null,1000000000,151363809,null,12.573779015624751,-22.01580640752956,null,37.48809029469956,-74.564097056250546,null,0,0]
[12374.5,12.374499999999999,5.5253457446754943,1.3888092929263449,1.0268433906731871,0.22915653314776932,1,0,49763.382758875872,1.5707762316979674,{"$f":"SQRT(1+(A215/Zero2)^2)","v":2.7537772650078498},{"$f":"ATAN(A215/Zero2)","v":1.1991631808282799},1.0000575965792982,1.0732550019675689E-2,1,0,1,0,0.94834883031226491,0.14240871018330328,1.573016906486195,-96.509416252047686,83.490583747952314,null,1000000000,153128250.25,null,12.567102446363494,-21.906789271386089,null,37.447388227897839,-74.602626980661597,null,0,0]
[12446,12.446,5.5562284319214745,1.3898320360137366,1.0271503774657567,0.23043435126209483,1,0,50050.916143321876,1.5707763471406342,2.767595644109452,1.2011084005987394,1.0000582640701032,1.0794558010936558E-2,1,0,1,0,0.94775692763343788,0.14332727994209127,1.5260515356791826,-96.439538227332434,83.560461772667566,null,1000000000,154902916,null,12.560530481840733,-21.798895798762974,null,37.406994821613594,-74.64064242856945,null,0,0]
[12517.5,12.5175,5.5871168667482731,1.3908434716573659,1.0274590404053117,0.2317114037120224,1,0,50338.449527768527,1.570776461264483,2.7814243913835033,1.2030342850229596,1.0000589354061182,1.0856565919184356E-2,1,0,1,0,0.94716177831803638,0.14424761768357539,1.4794946015822705,-96.370265254514379,83.629734745485621,null,1000000000,156687806.25,null,12.554060991189008,-21.692110079557064,null,37.366907378168399,-74.678155174957311,null,0,0]
[12589,12.589,5.618010954353422,1.3918437843133742,1.0277693779816952,0.23298768702388103,1,0,50625.982912215826,1.5707765740919852,2.7952633529495134,1.2049411068875264,1.0000596105873354,1.0918573743942415E-2,1,0,1,0,0.94656338549645025,0.14516973698837715,1.4333413683383802,-96.301593251031079,83.698406748968921,null,1000000000,158482921,null,12.547691896369242,-21.586416485508458,null,37.327123239744282,-74.715176765522614,null,0,{"$f":"IF(AH218>0,W218,0)","v":0}]
[12662.25,12.66225,5.6496669560091712,1.3928572341596781,1.0280890462673482,0.23429440681645719,1,0,50920.553827052361,1.5707766883596301,2.8094514649026348,1.2068751112214202,1.0000603062814826,1.0982099155654741E-2,1,0,1,0,0.94594698644099451,0.14611628741815558,1.386472297351252,-96.231859464639172,83.768140535360828,null,1000000000,160332575.0625,null,12.541268907793683,-21.479252484530626,null,37.286677157332704,-74.752606980108567,null,0,0]
[12735.5,12.7355,5.6813286956606035,1.3938593892226245,1.0284104689390461,0.23560031202502776,1,0,51215.124741889551,1.5707768013128227,2.8236499796247521,1.2087896726616016,1.0000610060113455,1.1045624478727591E-2,1,0,1,0,0.94532718990367381,0.14706473675614981,1.3400171564449246,-96.16274792184312,83.83725207815688,null,1000000000,162192960.25,null,12.534947037693859,-21.373202398914049,null,37.246543886526204,-74.78954552292906,null,0,0]
[12808.75,12.80875,5.7129960779068512,1.394850435294742,1.0287336443523416,0.23690539896107529,1,0,51509.695656727388,1.5707769129741136,2.8378587409729294,1.2106850691095097,1.0000617097769158,1.1109149712648439E-2,1,0,1,0,0.94470399934111549,0.14801509982151834,1.2939711414358879,-96.09425440686546,83.90574559313454,null,1000000000,164064076.5625,null,12.528724214302336,-21.268250307341862,null,37.206720694908689,-74.82600409952363,null,0,0]
[12882,12.882,5.7446690094338129,1.3958305541595162,1.0290585708558915,0.23820966395185303,1,0,51804.266571565859,1.5707770233655414,2.8520775958042157,1.2125615734815602,1.0000624175781845,1.1172674856904772E-2,1,0,1,0,0.94407741824099378,0.14896739150786492,1.2483295405744883,-96.026374763180883,83.973625236819117,null,1000000000,165945924,null,12.522598417551842,-21.164380574088575,null,37.167204890797784,-74.861994189092286,null,0,0]
[12957.25,12.95725,5.7772124136164544,1.396826242028592,1.0293941907903295,0.2395486805158854,1,0,52106.880378277703,1.5707771354713553,2.8666950315612785,1.2144699222316437,1.0000631489075638,1.1237934382180846E-2,1,0,1,0,0.94343020215945894,0.14994770838992602,1.201858024832295,-95.957276687165162,84.042723312834838,null,1000000000,167890327.5625,null,12.516404330541111,-21.058785763310414,null,37.12692746206632,-74.898490923854766,null,0,0]
[13032.5,13.032500000000001,5.8097614811262659,1.3978107742236006,1.0297316551878468,0.2408868218309119,1,0,52409.494184990195,1.5707772462825655,2.8813228012848895,1.2163589013650977,1.0000638844960115,1.1303193811732675E-2,1,0,1,0,0.94277941542756716,0.1509300927575106,1.1558035178558024,-95.888817762001054,84.111182237998946,null,1000000000,169846056.25,null,12.51030848006614,-20.954300670157249,null,37.086968805564801,-74.934517091843787,null,0,0]
[13107.75,13.107749999999999,5.8423161173076288,1.3987843353052056,1.0300709622356348,0.24222408396731374,1,0,52712.10799170332,1.5707773558214684,2.8959607483815462,1.2182287910156606,1.0000646243435178,1.1368453145004617E-2,1,0,1,0,0.942125061930432,0.15191456100775005,1.1101612012224931,-95.820993677637276,84.179006322362724,null,1000000000,171813110.0625,null,12.504308836646379,-20.850909245393808,null,37.047326132351252,-74.970084432243482,null,0,0]
[13183,13.183,5.874876229586981,1.3997471058267783,1.0304121101133801,0.24356046301321194,1,0,53014.721798417071,1.5707774641098511,2.9106087193000247,1.2200798662177184,1.000065368450074,1.1433712381441035E-2,1,0,1,0,0.94146714558879208,0.15290112962377178,1.0649263496563208,-95.753800190474777,84.246199809525223,null,1000000000,173791489,null,12.49840342190531,-20.748595731927008,null,37.007996695526153,-75.005204458547752,null,0,0]
[13259.75,13.25975,5.908090927689468,1.4007181356017326,1.0307619526228207,0.24492256713556163,1,0,53323.367774036051,1.5707775732907239,2.9255588457510187,1.2219487391783506,1.0000661317765516,1.1500272366117959E-2,1,0,1,0,0.94079244865610456,0.15390954482660607,1.0192047308717287,-95.685912544654158,84.314087455345842,null,1000000000,175820970.0625,null,12.492475356339394,-20.645337060528334,null,36.968203142307473,-75.04057548412581,null,0,0]
[13336.5,13.336499999999999,5.9413111342349225,1.4016783074550954,1.0311137062336315,0.24628374444687945,1,0,53632.013749655656,1.5707776812149501,2.9405190863392701,1.2237986023183864,1.0000668995335471,1.1566832248892808E-2,1,0,1,0,0.94011405377574842,0.15492017987727272,0.97389734057562249,-95.618672180675645,84.381327819324355,null,1000000000,177862232.25,null,12.486641312383163,-20.543167493781272,null,36.928729795967598,-75.075504686894377,null,0,0]
[13413.25,13.41325,5.9745367573375869,1.4026278007508941,1.0314673689906264,0.24764399085395727,1,0,53940.65972527588,1.5707777879041016,2.9554892874760759,1.2256297317471054,1.0000676717210502,1.1633392029176067E-2,1,0,1,0,0.93943196522393413,0.1559330525460105,0.92899945004903417,-95.552074809330037,84.447925190669963,null,1000000000,179915275.5625,null,12.480899345717383,-20.442071212991596,null,36.889573872106794,-75.110003596338473,null,0,0]
[13490,13.49,6.0077677071295614,1.4035667909626606,1.0318229389306957,0.24900330228296275,1,0,54249.305700896715,1.5707778933792587,2.9704692985676444,1.2274423985122289,1.0000684483390505,1.1699951706378229E-2,1,0,1,0,0.93874618731663551,0.15694818069963151,0.884506421742006,-95.486116212900086,84.513883787099914,null,1000000000,181980100,null,12.47524756106689,-20.342032689442863,null,36.850732628450253,-75.144083523457212,null,0,0]
[13568.5,13.5685,6.0417617845177896,1.4045165052657862,1.0321885871824656,0.25039263635854486,1,0,54564.98920690691,1.5707780000250284,2.9858008675526024,1.229277574847375,1.0000692472481227,1.176802892369538E-2,1,0,1,0,0.93804096082248623,0.1579888070361829,0.8394129683259246,-95.419310141325624,84.580689858674376,null,1000000000,184104192.25,null,12.469558272615666,-20.240791478246802,null,36.811328463485403,-75.178518663078833,null,0,0]
[13647,13.647,6.0757612503348035,1.4054555913600451,1.0325562264020787,0.25178098377412733,1,0,54880.672712917716,1.5707781054439069,3.0011423895719762,1.2310939947939004,1.0000700507920164,1.1836106031929637E-2,1,0,1,0,0.93733188407224644,0.15903183100730628,0.79473351920869217,-95.353163609396901,84.646836390603099,null,1000000000,186240609,null,12.463959465886497,-20.140624852413158,null,36.772247821097338,-75.212538756983747,null,0,0]
[13725.5,13.7255,6.1097660146244426,1.4063842250335155,1.0329258544636575,0.2531683402339921,1,0,55196.356218929126,1.5707782096569449,3.0164937127659823,1.2328919326343939,1.0000708589707197,1.1904183030450254E-2,1,0,1,0,0.93661896181506976,0.16007727204953337,0.75046339382770322,-95.287672334721819,84.712327665278181,null,1000000000,188389350.25,null,12.458449262919487,-20.041517097877161,null,36.733487898683357,-75.246155236844658,null,0,0]
[13804,13.804,6.1437759894082511,1.4073025782548729,1.0332974692328745,0.25455470146381004,1,0,55512.039724941133,1.5707783126847141,3.0318546882544695,1.2346716575761023,1.0000716717842217,1.1972259918626493E-2,1,0,1,0,0.93590219884504167,0.16112514970912961,0.70659800185314048,-95.222832111902704,84.777167888097296,null,1000000000,190550416,null,12.453025833331351,-19.943452791342278,null,36.695045936296928,-75.279379320560423,null,0,0]
[13884.25,13.88425,6.178549444764954,1.4082309527297654,1.0336794198121648,0.25597093564964679,1,0,55834.760761342543,1.570778416805019,3.0475679313394868,1.2364725066055302,1.0000725075086936,1.2041854329718759E-2,1,0,1,0,0.93516549202383392,0.16219892687168977,0.66216839894106971,-95.157215091709247,84.842784908290753,null,1000000000,192772398.0625,null,12.447569338090359,-19.844265173989804,null,36.656072828625852,-75.312949917719436,null,0,0]
[13964.5,13.964499999999999,6.2133281656765194,1.4091489349508384,1.0340634421281587,0.25738612077245704,1,0,56157.481797744556,1.5707785197286244,3.0632909564483448,1.2382548748461168,1.0000733480768909,1.211144862415898E-2,1,0,1,0,0.93442478161644205,0.16327529216726203,0.61815235352954079,-95.092269831168537,84.907730168831463,null,1000000000,195007260.25,null,12.44219980590006,-19.746136352591719,null,36.617426315404622,-75.346133478576789,null,0,0]
[14044.75,14.044750000000001,6.2481120642143422,1.4100566969221962,1.0344495338735618,0.25880025233523019,1,0,56480.202834147152,1.5707786214760437,3.0790236137254192,1.2400190341754487,1.0000741934888011,1.2181042801273308E-2,1,0,1,0,0.93368007289282118,0.16435426684119506,0.57454523949646108,-95.027992084016788,84.972007915983212,null,1000000000,197255002.5625,null,12.436915426369378,-19.649050750846492,null,36.57910358090222,-75.378941333170275,null,0,0]
[14125,14.125,6.282901054384058,1.4109544069065625,1.034837692732099,0.26021332586450369,1,0,56802.92387055033,1.5707787220673244,3.0947657562714515,1.2417652513977362,1.0000750437444117,1.2250636860387906E-2,1,0,1,0,0.93293137117365665,0.16543587226334938,0.53134251983176384,-94.964377686066072,85.035622313933928,null,1000000000,199515625,null,12.431714435141689,-19.552993083108873,null,36.541101852465211,-75.411384602957185,null,0,0]
[14207.25,14.20725,6.3185622554433332,1.4118642310642135,1.0352376679290645,0.26166051360901282,1,0,57133.687798827072,1.5707788239863334,3.1109099184971849,1.2435366435780395,1.0000759202164582,1.2321965227729686E-2,1,0,1,0,0.93215987233613606,0.16654718598676926,0.48747807871770521,-94.899861964611716,85.100138035388284,null,1000000000,201845952.5625,null,12.426468556656658,-19.455592441141039,null,36.502483289836185,-75.444269523470709,null,0,0]
[14289.5,14.2895,6.3542286281716782,1.4127638422485609,1.0356398096011159,0.26310658048649749,1,0,57464.451727104395,1.570778924732056,3.1270637414205198,1.2452897398545875,1.0000768017766182,1.2393293469683526E-2,1,0,1,0,0.93138419047814525,0.16766130908242846,0.44402906673518328,-94.836034472672893,85.163965527327107,null,1000000000,204189810.25,null,12.42130666412317,-19.359240002833396,null,36.464196170387154,-75.476794469839533,null,0,0]
[14371.75,14.37175,6.3899000859693018,1.4136534100321714,1.0360441152254942,0.2645515217579209,1,0,57795.215655382301,1.5707790243246367,3.1432270760953016,1.247024811615429,1.0000776884248779,1.2464621585523968E-2,1,0,1,0,0.93060433149693889,0.16877826497324067,0.40099087622818114,-94.772890991325738,85.227109008674262,null,1000000000,206547198.0625,null,12.416226999629224,-19.263920219908744,null,36.426237644374098,-75.508970771416983,null,0,0]
[14454,14.454000000000001,6.4255765441472272,1.4145331002859591,1.036450582269812,0.26599533271042208,1,0,58125.979583660774,1.5707791227837606,3.1593997765365698,1.2487421251307824,1.000078580161224,1.2535949574525555E-2,1,0,1,0,0.92982030134771021,0.16989807722494868,0.3583589884304853,-94.710427389444646,85.289572610555354,null,1000000000,208918116,null,12.411227850234077,-19.169617837293668,null,36.388604905971548,-75.540809552151018,null,0,0]
[14622.5,14.6225,6.4986797537531729,1.4163050968754272,1.0372900226321085,0.26894962090550018,1,0,58803.593223965509,1.5707793210313843,3.1925603388669939,1.252205909787925,1.0000804228898639,1.2682073991754672E-2,1,0,1,0,0.9282011117623844,0.17220118050326871,0.27227213182064575,-94.584568596922878,85.415431403077122,null,1000000000,213817506.25,null,12.40123087300657,-18.979541266223197,null,36.31251502658921,-75.605027330699656,null,0,0]
[14706.75,14.70675,6.5352388822815728,1.4171762276334694,1.0377131336655072,0.27042496619958545,1,0,59142.400044118724,1.5707794184516555,3.2091547612429498,1.2539109481399795,1.0000813522619352,1.2755135997654899E-2,1,0,1,0,0.92738497808695308,0.17335732916341209,0.2298495943884391,-94.522692317602932,85.477307682397068,null,1000000000,216288495.5625,null,12.396352149934639,-18.886041490986926,null,36.274971212228941,-75.636650826616005,null,0,0]
[14791,14.791,6.5718029150182193,1.4180376654881222,1.0381385015866631,0.27189910568121134,1,0,59481.206864272506,1.5707795147621091,3.2257584171274853,1.2555984389750359,1.0000822869724877,1.2828197867372717E-2,1,0,1,0,0.92656449401275953,0.17451657707094512,0.18783496502907987,-94.461512664862596,85.538487335137404,null,1000000000,218773681,null,12.391551043818893,-18.793547043026177,null,36.237757688985326,-75.667965621836444,null,0,0]
[14877.25,14.87725,6.6092399319006585,1.4189096787635807,1.0385763022548575,0.27340698534463587,1,0,59828.056576299932,1.5707796122289008,3.2427656418942972,1.2573080831109935,1.0000832494020784,1.2902994001609321E-2,1,0,1,0,0.92572003305938622,0.17570658198047298,0.1452409038855188,-94.39959815713479,85.60040184286521,null,1000000000,221332567.5625,null,12.386714679842372,-18.69988273671094,null,36.199999991818288,-75.699715420423829,null,0,0]
[14963.5,14.9635,6.6466819178801728,1.419771868265068,1.0390164623419686,0.27491359086061595,1,0,60174.906288327911,1.5707797085720903,3.2597822459685779,1.2589998828969728,1.0000842174265858,1.2977789991467582E-2,1,0,1,0,0.92487102704652757,0.17689989063422434,0.10306509376432947,-94.338405415783953,85.661594584216047,null,1000000000,223906332.25,null,12.38195627769954,-18.607240763688853,null,36.162582583839928,-75.731164652095075,null,0,0]
[15049.75,15.04975,6.6841287894517016,1.4206243978086872,1.0394589788507005,0.27641891701256138,1,0,60521.756000356458,1.5707798038109957,3.2768080832288997,1.260674106722568,1.0000851910459936,1.3052585836111033E-2,1,0,1,0,0.92401748333788836,0.17809653143514412,6.1302988577014217E-2,-94.277930376506802,85.722069623493198,null,1000000000,226494975.0625,null,12.377274191436967,-18.515605747427809,null,36.125502564915188,-75.762324629078989,null,0,0]
[15136,15.135999999999999,6.7215804649602822,1.4214674276163879,1.0399038487728265,0.27792295861592997,1,0,60868.605712385543,1.5707798979644947,3.2938430104965639,1.2623310178238567,1.0000861702602852,1.3127381534703225E-2,1,0,1,0,0.92315940937251695,0.17929653297320047,1.9950129979983043E-2,-94.218169073199206,85.781830926800794,null,1000000000,229098496,null,12.372666817623671,-18.424962606645206,null,36.088757080131451,-75.793206466553997,null,15136,85.781830926800794]
[15224,15.224,6.7597968978200962,1.4223179341646328,1.0403601674319694,0.27945618775143843,1,0,61222.492954804169,1.5707799929288324,3.3112327969304887,1.2640039720997969,1.000087175108991,1.3203694675785631E-2,1,0,1,0,0.92227926394229354,0.18052437594306539,-2.1824522785383584E-2,-94.157926813011386,85.842073186988614,null,15224,231770176,null,12.368041341804233,-18.333487249172105,null,36.05160790318552,-75.824439563839306,null,0,0]
[15312,15.311999999999999,6.7980181654762024,1.423158877516862,1.0408189296132093,0.28098806888138728,1,0,61576.380197223349,1.5707800868016257,3.3286317539168575,1.2656594417049143,1.0000881857818882,1.3280007663070812E-2,1,0,1,0,0.92139441844153647,0.18175577814181687,-6.3182260050998432E-2,-94.098419512368451,85.901580487631549,null,15312,234457344,null,12.363490398559424,-18.24301361819165,null,36.014801109164715,-75.855405894176783,null,0,0]
[15400,15.4,6.8362441868349304,1.4239904168962902,1.0412801320868812,0.28251859660263018,1,0,61930.267439643059,1.5707801796015874,3.3460397383987521,1.2672976903891899,1.0000892022789589,1.3356320495670398E-2,1,0,1,0,0.92050488101853845,0.18299077054961455,-0.10412754863665055,-94.03964326795888,85.96035673204112,null,15400,237160000,null,12.359012413541928,-18.15352660296433,null,35.978333805596563,-75.886116664994546,null,0,0]
[15488,15.488,6.8744748825963473,1.4248127080368926,1.0417437716118743,0.28404776554692712,1,0,62284.154682063294,1.5707802713470038,3.363456610207427,1.2689189768135467,1.0000902246001859,1.343263317269602E-2,1,0,1,0,0.91961065990642743,0.18422938435772554,-0.14466476946794077,-93.981594278205321,86.018405721794679,null,15488,239878144,null,12.354605853120724,-18.065011384307748,null,35.942203145186475,-75.916582893897584,null,0,0]
[15578.25,15.578250000000001,6.9136878417124379,1.4256465772718971,1.0422217934637836,0.28561461564099472,1,0,62647.090177841412,1.5707803643615705,3.3813278869809023,1.2705643639529935,1.0000912791097185,1.3510896863600855E-2,1,0,1,0,0.91868871905093941,0.1855034616405408,-0.1858191027506404,-93.922812589293443,86.077187410706557,null,15578.25,242681873.0625,null,12.350159247284758,-17.975227153969819,null,35.905495417739743,-75.947585435323631,null,0,0]
[15668.5,15.6685,6.952905553950858,1.4264710402323135,1.0427023716405384,0.28718002526286873,1,0,63010.025673620061,1.5707804563046159,3.3992082217482991,1.2721924455052984,1.0000923397450028,1.3589160388981938E-2,1,0,1,0,0.91776186975550533,0.18678141501928891,-0.22655329988134357,-93.864788043690481,86.135211956309519,null,15668.5,245501892.25,null,12.345784623858705,-17.886434389860792,null,35.869135844035092,-75.9783536538297,null,0,0]
[15758.75,15.758749999999999,6.992127939333133,1.4272862540814339,1.0431855026091699,0.28874398873657858,1,0,63372.961169399234,1.57078054719455,3.4170974723188001,1.2738034845666755,1.0000934065060187,1.3667423747881033E-2,1,0,1,0,0.91683012118464835,0.18806327884583873,-0.26687181892376666,-93.807516866313293,86.192483133686707,null,15758.75,248338201.5625,null,12.341480453973038,-17.798618018677882,null,35.833121494878334,-76.008898847635422,null,0,0]
[15849,15.849,7.0313549196559064,1.4280923725251824,1.0436711828245018,0.29030650042493383,1,0,63735.896665178923,1.5707806370493629,3.4349954993935046,1.275397739107869,1.0000944793927473,1.3745686939339929E-2,1,0,1,0,0.91589348260053882,0.18934908771548734,-0.30677903211950569,-93.750995389355282,86.249004610644718,null,15849,251190801,null,12.337245248537181,-17.711763260762048,null,35.797449487118456,-76.039232128593255,null,0,0]
[15941.25,15.94125,7.0714558651386819,1.4289071116161498,1.044170256944843,0.2919021321821022,1,0,64106.87505283238,1.5707807278439383,3.4532990869716729,1.2770102401522478,1.0000955823861797,1.3825684321107685E-2,1,0,1,0,0.91493104346611676,0.19066750438889649,-0.34715000108476274,-93.693992456480146,86.306007543519854,null,15941.25,254123451.5625,null,12.332985952004407,-17.62396247085174,null,35.761337814685973,-76.070029985628437,null,0,0]
[16033.5,16.0335,7.1115614517127801,1.4297126618093376,1.0446719870211092,0.29349623530987112,1,0,64477.853440486353,1.5707808175937263,3.4716115589827337,1.2786057336819057,1.0000966917797907,1.3905681525907381E-2,1,0,1,0,0.91396351507040818,0.19199011677367744,-0.38710020502301212,-93.637765407923581,86.362234592076419,null,16033.5,257073122.25,null,12.328795686238323,-17.537136069754631,null,35.725577876513803,-76.100629338168943,null,0,0]
[16125.75,16.12575,7.151671601298407,1.4305091766581886,1.0451763692283775,0.29508880391376263,1,0,64848.831828140836,1.5707809063166576,3.4899327755707605,1.2801844793640533,1.0000978075735591,1.3985678552715717E-2,1,0,1,0,0.91299090762796442,0.19331696262183343,-0.42663404913955616,-93.582310665542295,86.417689334457705,null,16125.75,260039813.0625,null,12.324672982023269,-17.451269180604172,null,35.690166736612319,-76.131041484938109,null,0,0]
[16218,16.218,7.1917862375488486,1.4312968063366045,1.0456833997289059,0.29667983214177734,1,0,65219.810215795835,1.5707809940302546,3.5082625997352181,1.2817467317769513,1.0000989297674636,1.40656754005094E-2,1,0,1,0,0.9120132314644025,0.19464807996255581,-0.46575585404535963,-93.527624762559554,86.472375237440446,null,16218,263023524,null,12.320616408469132,-17.366347218085789,null,35.655101505260646,-76.161277544473791,null,0,0]
[16312.5,16.3125,7.2328838536733038,1.4320945871360296,1.0462055387717726,0.29830806267460092,1,0,65599.836856808775,1.5707810828545463,3.5270482775495071,1.2833302472081076,1.0001000859681193,1.4147623204245343E-2,1,0,1,0,0.91100646478250846,0.19601613266412954,-0.50540904261171238,-93.472398745179007,86.527601254820993,null,16312.5,266097656.25,null,12.316528007176704,-17.280318819539872,null,35.619536717986719,-76.192079925639135,null,0,0]
[16407,16.407,7.273986021177496,1.4328833526001785,1.0467304486749929,0.29993466448001926,1,0,65979.86349782224,1.5707811706556289,3.5458427057873787,1.2848969799639658,1.0001012488848742,1.4229570817953946E-2,1,0,1,0,0.90999440140701826,0.19738874945640558,-0.5446387628524072,-93.417972516428136,86.582027483571864,null,16407,269189649,null,12.312506080307138,-17.195251927945225,null,35.58432892461559,-76.222720588482929,null,0,0]
[16501.5,16.5015,7.315092663341316,1.4336632537223266,1.0472581252721089,0.30155963140615782,1,0,66359.890138836199,1.5707812574510815,3.5646457460402359,1.2864471878707771,1.0001024185177048,1.4311518240535254E-2,1,0,1,0,0.90897705280797836,0.19876597214407465,-0.58344939690130393,-93.364342703881377,86.635657296118623,null,16501.5,272299502.25,null,12.308549207220006,-17.111131771890019,null,35.549475163653831,-76.25321093199139,null,0,0]
[16596,16.596,7.3562037051512483,1.4344344381640584,1.0477885643831188,0.30318295734803757,1,0,66739.916779850639,1.5707813432580826,3.5834572627417387,1.2879811236623364,1.0001035948665873,1.4393465470889317E-2,1,0,1,0,0.90795443058305436,0.2001478428504494,-0.62184524279632258,-93.311506051543319,86.688493948456681,null,16596,275427216,null,12.304656004503594,-17.027943871715632,null,35.514972520475226,-76.283562179827669,null,0,0]
[16692.5,16.692499999999999,7.3981892859987566,1.435213098688837,1.0483330761920659,0.30483893965241565,1,0,67127.986312738925,1.570781429878499,3.6026755162291151,1.2895309888288564,1.0001048030424822,1.4477146834645084E-2,1,0,1,0,0.90690473552373663,0.20156380022669268,-0.66063003136293086,-93.258366416961238,86.741633583038762,null,16692.5,278639556.25,null,12.300744711852168,-16.943942690715105,null,35.48009902456004,-76.314423726246147,null,0,0]
[16789,16.789000000000001,7.440179301831801,1.4359829706491845,1.0488804598316652,0.3064931980604485,1,0,67516.055845627707,1.5707815155031599,3.62190233178905,1.2910644027731082,1.0001060182216646,1.4560827995632689E-2,1,0,1,0,0.90584956611037548,0.20298469425554008,-0.69899108840647206,-93.206047373007721,86.793952626992279,null,16789,281870521,null,12.296897011215655,-16.860884026649089,null,35.445585668153015,-76.345163346358632,null,0,0]
[16885.5,16.8855,7.4821736779828631,1.4367442011045579,1.0494307108080716,0.30814572622280861,1,0,67904.125378516968,1.5707816001491375,3.6411375737869656,1.2925816189495785,1.0001072404041091,1.4644508952680914E-2,1,0,1,0,0.90478893511383518,0.20441057084313999,-0.73693273272090054,-93.154545818625877,86.845454181374123,null,16885.5,285120110.25,null,12.293111542351989,-16.778753358556273,null,35.411429492702247,-76.37579246006959,null,0,0]
[16982,16.981999999999999,{"$f":"SQRT(1+(A269/pole1)^2)","v":7.5241723414437134},{"$f":"ATAN(A269/pole1)","v":1.4374969338715433},{"$f":"SQRT(1+(A269/Zero1)^2)","v":1.0499838246133439},{"$f":"ATAN(A269/Zero1)","v":0.30979651784124351},{"$f":"IF(VIN_nom>Vout, 1, SQRT(1+(A269/z_RHP)^2))","v":1},{"$f":"IF(VIN_nom>Vout, 0, -ATAN(A269/z_RHP))","v":0},{"$f":"SQRT(1+(A269/Pole2)^2)","v":68292.19491140671},{"$f":"ATAN(A269/Pole2)","v":1.5707816838331154},3.6603811093804888,1.294082885784666,{"$f":"SQRT(1+(A269/pole4)^2)","v":1.0001084695897902},{"$f":"ATAN(A269/pole4)","v":1.4728189704618555E-2},{"$f":"IF(VOUT_setting=1,1,SQRT(1+(A269*zterm1)^2))","v":1},{"$f":"IF(VOUT_setting=1,0,ATAN(((A269*zterm1))))","v":0},1,{"$f":"IF(VOUT_setting=1,0,ATAN(A269*$Q$4/(1+Afbr-$Q$5*(A269)^2)))","v":0},{"$f":"SQRT((1-(Z269/pterm2))^2+(A269/pterm1)^2)","v":0.90372285544999453},{"$f":"IF((ATAN((A269/pterm1)/(1-A269^2/pterm2))>0),ATAN((A269/pterm1)/(1-A269^2/pterm2)),PI()+ATAN((A269/pterm1)/(1-A269^2/pterm2)))","v":0.20584147625755533},{"$f":"20*LOG10(((E269*K269*G269*O269)/(C269*I269*S269*M269*Q269))*Adc)","v":-0.77445920056354511},{"$f":"((F269+L269+H269+P269)-(D269+J269+T269+N269+R269))*radconv","v":-93.103858772831714},{"$f":"IF(V269>0,V269,V269+180)","v":86.896141227168286},null,{"$f":"IF(U269<0,A269,1000000000)","v":16982},{"$f":"A269^2","v":288388324},null,{"$f":"20*LOG10((K269/(I269*M269))*AEA)","v":12.28938698071296},{"$f":"(L269-(J269+N269))*radconv","v":-16.69753645354124},null,{"$f":"20*LOG10((E269*G269/(C269*S269))*Acs*Am)","v":35.377627586498633},{"$f":"(F269+H269-(D269+T269))*radconv","v":-76.406322319290467},null,{"$f":"SUM((U270<0)*(U269>0))*A269","v":0},0]
[17081,{"$f":"A270/1000","v":17.081},7.5672634337116573,1.4382604841430957,1.0505542380914226,0.31148826492522502,1,0,68690.318059138648,1.5707817687024566,3.6801316644644317,1.2956067262720787,1.0001097378973656,1.4814038137306482E-2,1,0,1,0,0.90262350860322449,0.20731472657837,-0.81253076254797518,-93.052702025358542,86.947297974641458,null,17081,291760561,null,12.285627870498086,-16.615150440393084,null,35.343315134729075,-76.437551584965433,null,0,0]
[17180,17.18,7.6103588878004622,1.4390153872832292,1.0511276549960493,0.31317817105911028,1,0,69088.441206871081,1.5707818525936761,3.6998906738979112,1.2971142943003253,1.0001110135756845,1.4899886351621448E-2,1,0,{"$f":"IF(VOUT_setting=1,1,SQRT((1+Afbr-$Q$5*(A271)^2)^2+(A271*$Q$4)^2))","v":1},0,0.90151845513315865,0.20879336950312047,-0.85017413271274123,-93.002396560546472,86.997603439453528,null,17180,295152400,null,12.281930150512013,-16.533696701924416,null,35.30936948455038,-76.468699858622045,null,0,0]
[17279,17.279,7.65345863002789,1.4397617885107423,1.0517040704145817,0.3148662296100137,1,0,69486.564354603994,1.5707819355235866,3.7196580029511472,1.298605842391106,1.0001122966247187,1.4985734346298905E-2,1,0,1,0,0.90040770947248772,0.21027745620399052,-0.88739362787946485,-92.952939543269451,87.047060456730549,null,17279,298563841,null,12.278292500542211,-16.453160770598412,null,35.27578763935346,-76.499778772671064,null,0,0]
[17378,17.378,7.6965625883548983,1.4404998298296703,1.0522834794194795,0.31655243400166277,1,0,69884.687502337372,1.5707820175086169,3.739433519687049,1.3000816180129078,1.0001135870444395,1.507158212007432E-2,1,0,1,0,0.89929128622202459,0.2117670382722589,-0.92419348237356713,-92.904328264483567,87.095671735516433,null,17378,301994884,null,12.274713635220266,-16.373528468384031,null,35.242566650181303,-76.530799796099572,null,0,0]
[17479.25,17.47925,7.7406504696140184,1.4412461424680676,1.0528791480736031,0.3182750365779462,1,0,70291.858903428816,1.5707821003963403,3.7596668142578444,1.3015748724894778,1.0001149144157155,1.5159380749809662E-2,1,0,1,0,0.89814363250058848,0.21329621281905742,-0.96139997090471063,-92.855484279877302,87.144515720122698,null,17479.25,305524180.5625,null,12.271112931688597,-16.293006529093123,null,35.208960865181837,-76.562477750784197,null,0,0]
[17580.5,17.580500000000001,7.7847426134448243,1.4419840014063932,1.0534779374602907,0.31999568602502115,1,0,70699.030304520726,1.5707821823293258,3.779908402406885,1.3030521373341364,1.0001162494964564,1.5247179145812534E-2,1,0,1,0,0.89699007162234456,0.21483124587571778,-0.99817623086501839,-92.807519578216642,87.192480421783358,null,17580.5,309073980.25,null,12.267571102662441,-16.213400660133438,null,35.175726434247679,-76.594118918083211,null,0,0]
[17681.75,17.681750000000001,7.8288389478267035,1.4427135486820379,1.0540798422611743,0.32171437549170134,1,0,71106.201705613115,1.570782263323975,3.8001581516066398,1.3045136616570556,1.000117592286631,1.5334977306730278E-2,1,0,1,0,0.89583061976508205,0.21637219402302871,-1.0345265375801158,-92.760431659929765,87.239568340070235,null,17681.75,312644283.0625,null,12.264086879284037,-16.134696589405664,null,35.142860350910986,-76.625735070524101,null,0,0]
[17783,17.783000000000001,7.8729394023458257,1.4434349231857357,1.0546848571423872,0.32343109818871607,1,0,71513.373106705971,1.5707823433963155,3.8204159320865054,1.305959689556961,1.0001189427862083,1.5422775231210257E-2,1,0,1,0,0.89466529329940958,0.2179191143214794,-1.0704550849732317,-92.714218156205419,87.285781843794581,null,17783,316235089,null,12.26065902627032,-16.056880331923885,null,35.110359656531585,-76.657337824281512,null,0,0]
[17886.5,17.886500000000002,7.9180240537760671,1.4441640224323957,1.0553065257465017,0.32518393046029592,1,0,71929.592761156906,1.5707824243110697,3.8411320541295395,1.3074220836588493,1.0001203312651414,1.5512523974892885E-2,1,0,1,0,0.89346801606085435,0.21950664324549765,-1.1067504062414109,-92.667879131958102,87.332120868041898,null,17886.5,319926882.25,null,12.257212009869935,-15.978238182114533,null,35.077511351663794,-76.68964094984355,null,0,0]
[17990,17.989999999999998,7.9631128666521551,1.4448848654333577,1.0559314328729166,0.3269346934304655,1,0,72345.812415608292,1.5707825042947872,{"$f":"SQRT(1+(A279/Zero2)^2)","v":3.8618563026626394},{"$f":"ATAN(A279/Zero2)","v":1.3088687852565972},1.0001217277998582,1.5602272468654458E-2,1,0,1,0,0.89226463543832024,0.2211005348304127,-1.1426136258033088,-92.622449222125226,87.377550777874774,null,17990,323640100,null,12.253821389627923,-15.900495078899544,null,35.045038752343906,-76.721954143225673,null,0,0]
[18093.5,18.093499999999999,8.0082057706831922,1.4455975909018315,1.0565595727753139,0.32868338004769482,1,0,72762.032070060159,1.570782583363445,3.8825885475545303,1.3103000396299707,1.0001231323903252,1.5692020711050216E-2,1,0,1,0,0.89105516955835973,0.22270085161630068,-1.1780489729676171,-92.577926309030914,87.422073690969086,null,18093.5,327374742.25,null,12.250485948158754,-15.823636969616166,null,35.012938846648765,-76.75428933941474,null,0,0]
[18197,18.196999999999999,8.0533026971462967,1.4463023344773713,1.0571909396913413,0.33042998332796397,1,0,73178.251724512476,1.5707826615326572,3.9033286613889904,1.3117160871017894,1.0001245450365082,1.5781768700635419E-2,1,0,1,0,0.88983963676858324,0.2243076566916137,-1.2130605969055934,-92.534308410434548,87.465691589565452,null,18197,331130809,null,12.247204500353057,-15.747650085592914,null,34.981208670516487,-76.786658324841625,null,0,0]
[18303,18.303000000000001,8.0994930204919484,1.4470159660077118,1.0578408958542493,0.33221660843886502,1,0,73604.524993807063,1.5707827406736614,3.9245777701490638,1.3131508223295956,1.0001260001544841,1.5873684252502379E-2,1,0,1,0,0.88858847419429998,0.22596006525122408,-1.2484829663817019,-92.490573077637833,87.509426922362167,null,18303,334999809,null,12.243898550806538,-15.670716719872097,null,34.949092250586901,-76.819856357765772,null,0,{"$f":"IF(AH282>0,W282,0)","v":0}]
[18409,18.408999999999999,8.1456874218849915,1.447721503848707,1.0584942245231979,0.33400103374193885,1,0,74030.798263102144,1.5707828189032691,3.9458348704963386,1.31457010196973,1.0001274637219686,1.5965599536130939E-2,1,0,1,0,0.88733098775983577,0.2276194150645402,-1.2834694560506985,-92.447783227203615,87.552216772796385,null,18409,338891281,null,12.240646818116382,-15.594668826507665,null,34.917357493608058,-76.853114400695929,null,0,0]
[18515,18.515000000000001,8.1918858323365686,1.4484190842258216,1.0591509194572775,0.335783251954693,1,0,74457.071532397647,1.5707828962371342,3.9670998339657082,1.3159741687990378,1.0001289357389245,1.6057514549969211E-2,1,0,1,0,0.88606719791408106,0.22928577573378806,-1.3180242749141657,-92.405937160165195,87.594062839834805,null,18515,342805225,null,12.237448127981081,-15.519492496219014,null,34.886001364879888,-76.886444663946151,null,0,0]
[18621,18.620999999999999,8.2380881843994267,1.4491088403398791,1.0598109743989312,0.33756325586872132,1,0,74883.344801693602,1.5707829726905538,3.9883725347848182,1.3173632606575962,1.0001304162053144,1.6149429292465316E-2,1,0,1,0,0.88479712536170385,0.23095921749329731,-1.352151552524961,-92.365033319064437,87.634966680935563,null,18621,346741641,null,12.234301337348734,-15.44517410256104,null,34.855020877901445,-76.919859216503411,null,0,0]
[18729.5,18.729500000000002,8.2853842279006624,1.4498068969924389,1.0604900699355417,0.33938294031013078,1,0,75319.671685831898,1.5707830500508848,4.0101548349482323,1.3187698484077579,1.0001319403390283,1.6243511552855191E-2,1,0,1,0,0.88349061343195712,0.23267953477074932,-1.386645162471378,-92.324139107222294,87.675860892777706,null,18729.5,350794170.25,null,12.231132918620883,-15.36997750974391,null,34.823695686682875,-76.954161597478375,null,0,0]
[18838,18.838000000000001,8.3326842628969082,1.4504970290158685,1.0611726725202539,0.34120028972758126,1,0,75755.99856997063,1.5707831265200813,4.0319449834239007,1.3201612354266303,1.0001334733253546,1.6337593525662681E-2,1,0,1,0,0.8821775636792194,0.23440742206014548,-1.4206993353902653,-92.284229234543943,87.715770765456057,null,18838,354870244,null,12.228016548996202,-15.295651787140658,null,34.792757883388674,-76.988577447403273,null,0,0]
[18946.5,18.9465,8.3799882217993389,1.4511793699476883,1.0618587753896829,0.34301529663127134,1,0,76192.325454109799,1.5707832021134531,4.0537428536503519,1.3215376614960548,1.000135015164253,1.6431675209223603E-2,1,0,1,0,0.88085799916250418,0.23614295679041467,-1.4543182545084572,-92.245302479944854,87.754697520055146,null,18946.5,358969862.25,null,12.224951098048496,-15.22218319704559,null,34.762204415218186,-77.023119282899287,null,0,0]
[19055,19.055,8.4272960385311393,1.4518540503562865,1.0625483717632744,0.34482795361242957,1,0,76628.652338249405,1.5707832768459609,4.0755483217293706,1.3228993614957296,1.000136565855682,1.6525756601873793E-2,1,0,1,0,0.87953194323662853,0.23788621711803248,-1.4875060245200085,-92.207357770116658,87.792642229883342,null,19055,363093025,null,12.221935465525032,-15.149558282605126,null,34.732032277730099,-77.057799487511545,null,0,0]
[19165.75,19.165749999999999,8.4755888045144925,1.4525349539497707,1.0632558643878383,0.34667576912086079,1,0,77074.027475747163,1.5707833522555767,4.0978136868055177,1.3242743511298827,1.0001381578340649,1.6621788689395296E-2,1,0,1,0,0.87817171829422247,0.23967367750646681,-1.5209415497231629,-92.169638029642016,87.830361970357984,null,19165.75,367325973.0625,null,12.218907563572053,-15.076283733575735,null,34.701624654479922,-77.093354296066281,null,0,0]
[19276.5,19.276499999999999,8.5238854555053187,1.4532081418024179,1.0639669825814266,0.34852112089301945,1,0,77519.402613245358,1.5707834267986851,4.1200867154508467,1.3256344770313313,1.0001397590358545,1.6717820470311888E-2,1,0,1,0,0.87680478005243245,0.24146935413648649,-1.5539362593543127,-92.13293968937667,87.86706031062333,null,19276.5,371583452.25,null,12.215929343210831,-15.003860746484685,null,34.671608165209996,-77.129078942891994,null,0,0]
[19387.25,19.387250000000002,8.5721859258379212,1.4538737437232037,1.0646817190793108,0.35036400131020384,1,0,77964.77775074399,1.570783500490136,4.1423672840469905,1.3269799739696235,1.0001413694610064,1.6813851942853824E-2,1,0,1,0,0.87543115432889718,0.24327333253082656,-1.5864942786199319,-92.097262072883552,87.902737927116448,null,19387.25,375865462.5625,null,12.212999725539737,-14.932275870777177,null,34.641979763615467,-77.164986202106348,null,0,0]
[19498,19.498000000000001,8.6204901513131666,1.454531886638841,1.0654000665993411,0.35220440284125026,1,0,78410.152888243043,1.5707835733444417,4.1646552715795728,1.3283110719030731,1.0001429891094757,1.6909883105251378E-2,1,0,1,0,0.87405086728013082,0.2450856990408885,-1.6186196560177244,-92.062604656691505,87.937395343308495,null,19498,380172004,null,12.210117660460924,-14.861515931542433,null,34.612736451296485,-77.201088725149077,null,0,0]
[19611.75,19.611750000000001,8.6701066865652958,1.4552002228969083,1.0661416241458914,0.35409206889932987,1,0,78867.592363552889,1.5707836473156573,4.1875545955974252,1.3296634739039184,1.0001446622324583,1.7008515238525507E-2,1,0,1,0,0.87262628437155443,0.24695598261036855,-1.6511690406197543,-92.028070076646628,87.971929923353372,null,19611.75,384620738.0625,null,12.207205954569833,-14.789684447806307,null,34.583098772585551,-77.238385628840348,null,0,0]
[19725.5,19.7255,8.7197270504495208,1.4558609529963016,1.066886975367966,0.35597710413464606,1,0,79325.031838863142,1.5707837204337411,4.2104614952979444,1.3310011629176408,1.0001463450851131,1.7107147040841032E-2,1,0,1,0,0.87119473141730441,0.24883530226901932,-1.6832704443717972,-91.994611084849225,88.005388915150775,null,19725.5,389095350.25,null,12.204342256290266,-14.718695888293933,null,34.553861067113075,-77.275915196555303,null,0,0]
[19839.25,19.83925,8.769351177974217,1.4565142054806786,1.0676361123201028,0.35785950067484462,1,0,79782.471314173832,1.5707837927133677,4.233375847704524,1.3323243730323207,1.0001480376673915,1.7205778510280604E-2,1,0,1,0,0.86975623790544432,0.25072375437482552,-1.7149280141312602,-91.962227606738807,88.037772393261193,null,19839.25,393595840.5625,null,12.201525516841032,-14.648536841477192,null,34.525020236802845,-77.313690765261583,null,0,0]
[19953,19.952999999999999,8.8189790056057173,1.4571601060260939,1.0683890270388259,0.35973925074439483,1,0,80239.910789484915,1.5707838641688769,4.2562975324492172,1.3336333334987227,1.0001497399792436,1.730440964492691E-2,1,0,1,0,0.86831083372273654,0.25262143625401473,-1.7461458200386837,-91.930919730520472,88.069080269479528,null,19953,398122209,null,12.198754715614564,-14.579194172966565,null,34.496573232121889,-77.351725557553891,null,0,0]
[20069,20.068999999999999,8.8695922288029259,1.4578113384928375,1.0691607168955719,0.36165344921356457,1,0,80706.398518154238,1.570783936203588,4.2796800423479127,1.3349537430050642,1.0001514859833038,1.7404991378313951E-2,1,0,1,0,0.8668297534665842,0.25456626204231059,-1.7775323647302519,-91.900100562597089,88.099899437402911,null,20069,402764761,null,12.19597538793813,-14.509307317048497,null,34.467966015106761,-77.390793245548565,null,0,0]
[20185,20.184999999999999,8.9202091709394118,1.4584551805073869,1.0699363186642867,0.36356487945548671,1,0,81172.886246823953,1.570784007410355,4.3030699326902919,1.3362598002563442,1.0001532421055463,1.7505572759505032E-2,1,0,1,0,0.86534155051313744,0.25652089390549426,-1.8084698905169287,-91.870400663422672,88.129599336577328,null,20185,407434225,null,12.193241775707286,-14.440242717155849,null,34.439762101550926,-77.430157946266846,null,0,0]
[20301,20.300999999999998,8.970829769064034,1.4590917566399162,1.0707158238438752,0.36547353353402695,1,0,81639.373975494076,1.5707840778033704,4.3264670837751549,1.3375517336075176,1.0001550083459176,1.7606153786466922E-2,1,0,1,0,0.86384625787632463,0.25848543824919196,-1.8389624803137554,-91.841820638564371,88.158179361435629,null,20301,412130601,null,12.190552881410785,-14.371987290210125,null,34.411958406050601,-77.469833348354243,null,0,0]
[20417,20.417000000000002,9.0214539616340552,1.4597211886883397,1.0714992239152581,0.36737940361699395,1,0,82105.861704164621,1.5707841473965045,4.3498713784399428,1.3388297666898128,1.0001567847043644,1.7706734457166438E-2,1,0,1,0,0.86234390902678804,0.26046000257921537,-1.8690141425825302,-91.814361262462029,88.185638737537971,null,20417,416853889,null,12.187907734308059,-14.304528223763976,null,34.384551890884552,-77.509833038698048,null,0,0]
[20536,20.536000000000001,9.0733910725930489,1.460359600348603,1.072306922675295,0.36933166241766502,1,0,82584.413770646002,1.5707842179724885,4.3738882594895667,1.340126637727669,1.0001586175170298,1.7809915979775243E-2,1,0,1,0,0.860795409591807,0.26249615912209734,-1.8993889478751569,-91.787357215128893,88.212642784871107,null,20536,421727296,null,12.185238647060892,-14.236138896119154,null,34.356846172839091,-77.551218319009735,null,0,0]
[20655,20.655000000000001,9.1253318394931711,1.4609907446723476,1.0731187021729653,0.37128097499749185,1,0,83062.965837127791,1.5707842877352514,4.3979124165176486,1.3414093422566526,1.0001604609777714,1.7913097123121419E-2,1,0,1,0,0.85923955711212774,0.26454309344449178,-1.9293080383096979,-91.761534720229307,88.238465279770693,null,20655,426629025,null,12.182613612249192,-14.168561181319804,null,34.329552117216252,-77.59297353890949,null,0,0]
[20774,20.774000000000001,9.1772762002596711,1.4616147445541272,1.0739345531544673,0.37322733324032625,1,0,83541.517903609987,1.5707843566987683,4.4219437309343164,1.3426781069872415,1.0001623150865304,1.8016277885010056E-2,1,0,1,0,0.85767638926640322,0.26660092531168633,-1.95877551021767,-91.736895157290462,88.263104842709538,null,20774,431559076,null,12.180031664180021,-14.10178209048733,null,34.302666593377452,-77.635113066803143,null,0,0]
[20893,20.893000000000001,9.2292240942110411,1.4622317201441277,1.0747544663477553,0.37517072914413724,1,0,84020.069970092576,1.5707844248766956,4.4459820866787423,1.3439331539085546,1.0001641798432477,1.8119458263246308E-2,1,0,1,0,0.85610594427004372,0.2686697757698927,-1.9877953860745525,-91.71344008594771,88.28655991405229,null,20893,436517449,null,12.177491863202333,-14.035788905238777,null,34.276186518498257,-77.677651180708907,null,0,0]
[21014.75,21.014749999999999,9.2823760594410789,1.4628558064231825,1.0755975215347351,0.37715596141541585,1,0,84509.681012901841,1.5707844938310511,4.4705831194746262,1.3452032337175388,1.0001660987129208,1.8225022662645349E-2,1,0,1,0,0.85449171655620915,0.27079796687776359,-2.0170267780588964,-91.690670666390744,88.309329333609256,null,21014.75,441619717.5625,null,12.174936035146956,-13.969071037808915,null,34.249510954569288,-77.721599628581828,null,0,0]
[21136.5,21.136500000000002,9.3355315988364271,1.4634727859764165,1.0764448091601286,0.37913807626955404,1,0,84999.292055711499,1.5707845619910279,4.4951912848400628,1.3464594098596721,1.0001680287282446,1.8330586655807418E-2,1,0,1,0,0.8528699541508421,0.27293795223782918,-2.0457979380842777,-91.669144989798042,88.330855010201958,null,21136.5,446751632.25,null,12.1724224146942,-13.90314972302007,null,34.223253414996663,-77.765995266777978,null,0,0]
[21258.25,21.25825,9.3886906516899948,1.4640827790455664,1.0772963192375671,0.38111706550588387,1,0,85488.903098521536,1.5707846293702745,4.519806466274856,1.347701905498814,1.0001699698891544,1.8436150240382108E-2,1,0,1,0,0.85124069977914041,0.27508986575339789,-2.0741129470384245,-91.648865301771735,88.351134698228265,null,21258.25,451913193.0625,null,12.169950074847231,-13.838012175172253,null,34.197410745889478,-77.810853126599483,null,0,0]
[21380,21.38,9.4418531586578887,1.4646859031853425,1.0781520417625421,0.38309292104750892,1,0,85978.51414133198,1.570784695982129,4.5444285497700703,1.3489309391333804,1.0001719221955852,1.8541713414019077E-2,1,0,1,0,0.84960399679162646,0.27725384280403581,-2.1019758135218876,-91.629834038742928,88.370165961257072,null,21380,457104400,null,12.167518113658755,-13.773645875857964,null,34.171979840594496,-77.85618816288499,null,0,0]
[21504.5,21.5045,9.496219973051728,1.4652956665908039,1.0790314385235618,0.3851101568170831,1,0,86479.1841604691,1.5707847633185557,4.5696138003106439,1.3501740346327979,1.0001739301252033,1.8649660544040519E-2,1,0,1,0,0.84792266810516947,0.27947931614386612,-2.1300045523141047,-91.611666689673896,88.388333310326104,null,21504.5,462443520.25,null,12.165072063777785,-13.708610523189144,null,34.146397151683253,-77.903056166484731,null,0,0]
[21629,21.629000000000001,9.5505902780494996,1.4658984876060708,1.0799152189611254,0.38712409904206857,1,0,86979.854179606627,1.570784829879784,4.5948060347969557,1.3514035008176888,1.0001759497093841,1.8757607239379886E-2,1,0,1,0,0.84623364424449932,0.28171769526986856,-2.157568748137551,-91.594810557110975,88.405189442889025,null,21629,467813641,null,12.162666406390443,-13.644356003400215,null,34.121238613247144,-77.950454553710742,null,0,0]
[21753.5,21.753499999999999,9.6049640143739836,1.4664944836919469,1.0808033723215447,0.38913473948506494,1,0,87480.524198744533,1.5707848956791233,4.620005138981603,1.3526195569574064,1.0001779809480569,1.8865553497524126E-2,1,0,1,0,0.84453697365828007,0.28396912985712147,-2.1846724660138266,-91.579268856191149,88.420731143808851,null,21753.5,473214762.25,null,12.160300253186534,-13.580869753901219,null,34.09650104857478,-77.998399102289909,null,0,0]
[21878,21.878,9.6593411240789688,1.4670837696839063,1.0816958878333274,0.39114207004244278,1,0,87981.194217882818,1.570784960729581,4.6452110010654177,1.3538224177227023,1.0001800238411509,1.8973499315960238E-2,1,0,1,0,0.84283270552360035,0.28623377127928623,-2.2113197005899417,-91.565045004751312,88.434954995248688,null,21878,478646884,null,12.157972739895023,-13.518139475565365,null,34.072181327290174,-78.046905529185935,null,0,0]
[22005.25,22.00525,9.7149227616059406,1.4676792548502828,1.0826126140567103,0.39319031057247211,1,0,88492.923213347836,1.5707850264562513,4.6709804887067499,1.3550384306914542,1.0001821239017199,1.9083829022783539E-2,1,0,1,0,0.8410829937516705,0.28856224191266572,-2.2380878964571411,-91.551872575220784,88.448127424779216,null,22005.25,484231027.5625,null,12.155632869903418,-13.454792256967018,null,34.047753001414584,-78.097080318253774,null,0,0]
[22132.5,22.1325,9.7705078048743843,1.4682679647171131,1.0835338744567475,0.39523507668971597,1,0,89004.652208813204,1.5707850914271355,4.6967568074710186,1.3562410981960844,1.0001842361370989,1.9194158264951071E-2,1,0,1,0,0.83932545135048819,0.29090483454339755,-2.2643874425306669,-91.540084718502044,88.459915281497956,null,22132.5,489847556.25,null,12.153331613520965,-13.392209607213204,null,34.023754711723512,-78.147875111288855,null,0,0]
[22259.75,22.25975,9.8260961960866915,1.4688500138609117,1.0844596574779406,0.39727636017205581,1,0,89516.381204278965,1.5707851556551951,4.722539845502399,1.3574306353102013,1.0001863605472108,1.9304487039779803E-2,1,0,1,0,0.83756013326555845,0.29326171644336624,-2.2902223893232958,-91.529685732190359,88.470314267809641,null,22259.75,495496470.0625,null,12.151068120873008,-13.33037920408276,null,34.00018325757884,-78.199306528107627,null,0,0]
[22387,22.387,9.8816878787423477,1.4694255142981754,1.0853899515475842,0.39931415294144879,1,0,90028.110199745075,1.5707852191530967,4.7483294933456905,1.358607252585357,1.0001884971319777,1.9414815344586788E-2,1,0,1,0,0.8357870952908879,0.2956330568355211,-2.3155967192645752,-91.52068012981357,88.47931987018643,null,22387,501177769,null,12.148841565104782,-13.269288984432389,null,33.977035483405785,-78.251391145381177,null,0,0]
[22517.5,22.517499999999998,9.9387027490229158,1.4700090261601277,1.0863486787837975,0.40140035760632037,1,0,90552.9088945064,1.5707852835273504,4.7747845688922528,1.3598007178765885,1.0001907009306674,1.9527960973652208E-2,1,0,1,0,0.8339608146314208,0.29808015837300506,-2.3411448050001846,-91.512896695636456,88.487103304363544,null,22517.5,507037806.25,null,12.146595663855011,-13.207394915567598,null,33.953733298919943,-78.305501780068852,null,0,0]
[22648,22.648,9.9957209646888128,1.4705858812070323,1.0873121257311054,0.4034828742275699,1,0,91077.707589268073,1.5707853471597424,4.8012463704947796,1.3609810293988158,1.0001929175336757,1.9641106102664962E-2,1,0,1,0,0.83212653636980505,0.30054283328764625,-2.3662167179417168,-91.506589036464007,88.493410963535993,null,22648,512931904,null,12.144386919980461,-13.146254430995839,null,33.930870129852963,-78.360334605468196,null,0,0]
[22778.5,22.778500000000001,10.052742468815905,1.471156192328706,1.0882802798545259,0.40556169456100682,1,0,91602.506284030111,1.5707854100630234,4.8277147875521482,1.3621484001865043,1.0001951469409167,1.9754250728731462E-2,1,0,1,0,0.83028432356077597,0.30302127066330181,-2.3908165438911508,-91.50176272105972,88.49823727894028,null,22778.5,518860062.25,null,12.142214512307536,-13.085855325306126,null,33.908442711576456,-78.415907395753592,null,0,0]
[22909,22.908999999999999,10.109767205761067,1.4717200698851671,1.0892531286025087,0.40763681051946676,1,0,92127.304978792527,1.5707854722496535,4.8541897118481838,1.3633030387693588,1.0001973891523055,1.9867394848958185E-2,1,0,1,0,0.82843424026291712,0.30551566185571116,-2.4149483022899165,-91.498423552499588,88.501576447500412,null,22909,524822281,null,12.140077641997271,-13.026185651174583,null,33.886447823487956,-78.472237901325002,null,0,0]
[23042.25,23.042249999999999,10.16799689261377,1.4722893036693285,1.0902513089961114,0.40975182444552738,1,0,92663.162649881706,1.5707855350199191,4.8812291411995679,1.3644690834256585,1.0001996918249889,1.998292270730704E-2,1,0,1,0,0.82653711714793054,0.30807927973109084,-2.4391097270595417,-91.496554776496168,88.503445223503832,null,23042.25,530945285.0625,null,12.137931602931211,-12.965999068746916,null,33.864432437784387,-78.53055570774923,null,0,0]
[23175.5,23.1755,10.226229836651305,1.4728520546663637,1.0912543574585569,0.41186295968540931,1,0,93199.020320971234,1.5707855970683762,4.9082751342347173,1.3656222791596495,1.0002020078469622,2.0098450032175752E-2,1,0,1,0,0.82463192659700779,0.31065994147114911,-2.4627914166277689,-91.496249455110316,88.503750544889684,null,23175.5,537103800.25,null,12.135820999600874,-12.906548603416939,null,33.842861351546496,-78.589700851693351,null,0,0]
[23308.75,23.30875,10.284465982544946,1.4734084326437988,1.0922622605784811,0.41397020813253627,1,0,93734.877992061127,1.5707856584074038,4.935327583045086,1.3667628341684803,1.0002043372181326,2.0213976820484262E-2,1,0,1,0,0.82271874015826929,0.31325785830926689,-2.4859974494696351,-91.497514516526721,88.502485483473279,null,23308.75,543297826.5625,null,12.13374504910492,-12.847822326899511,null,33.821731269200583,-78.649692189627217,null,0,0]
[23442,23.442,10.342705276209106,1.4739585449127635,1.0932750049291862,0.41607356184822741,1,0,94270.735663151354,1.5707857190490995,4.9623863820497007,1.3678909522414693,1.0002066799384064,2.0329503069152589E-2,1,0,1,0,0.82079763054929189,0.31587324407831635,-2.5087318410088022,-91.50035714004305,88.49964285995695,null,23442,549527364,null,12.1317029898303,-12.789808563443417,null,33.801038936936031,-78.710548576599635,null,0,0]
[23578.5,23.578499999999998,10.402368249054017,1.4745156874110554,1.0943174561000595,0.41822417037138432,1,0,94819.663033536854,1.5707857804591681,4.9901116281864839,1.3690338982530783,1.0002090936395573,2.0447846468439973E-2,1,0,1,0,0.81882152647380402,0.31857075926960954,-2.5315358265051535,-91.504912610833216,88.495087389166784,null,23578.5,555945662.25,null,12.12964549099631,-12.731106676549976,null,33.780292450273677,-78.773805934283217,null,0,0]
[23715,23.715,10.462034414045752,1.4750664751853899,1.0953649589698879,0.42037067553168878,1,0,95368.590403922659,1.5707858411623024,5.0178433209927578,1.3701642124804188,1.000211521348729,2.0566189294899565E-2,1,0,1,0,0.81683726634772569,0.32128706868771589,-2.5538532199093944,-91.511139592612665,88.488860407387335,null,23715,562401225,null,12.127622004387463,-12.673128464258717,null,33.759998543478282,-78.838011128353969,null,0,0]
[23851.5,23.851500000000001,10.521703716878514,1.4756110160129345,1.0964174990596913,0.42251306933846516,1,0,95917.517774308857,1.5707859011706393,5.045581354171321,1.3712821003405422,1.0002139630658198,2.068453154522076E-2,1,0,1,0,0.81484493229615229,0.32402241090232931,-2.5756881460115078,-91.519046618402612,88.480953381597388,null,23851.5,568894052.25,null,12.125631776370424,-12.615862157545216,null,33.740153845393209,-78.903184460857375,null,0,0]
[23988,23.988,10.581376104468626,1.4761494152546839,1.097475061876541,0.42465134398258131,1,0,96466.445144695375,1.5707859604960399,5.0733256237256246,1.372387762882858,1.0002164187907265,2.0802873216093056E-2,1,0,1,0,0.81284460782714241,0.32677702749528781,-2.5970446695773313,-91.528642495200543,88.471357504799457,null,23988,575424144,null,12.123674073863359,-12.559296237616762,null,33.720755024334451,-78.96934625758378,null,0,0]
[24127.75,24.127749999999999,10.642472404810183,1.4766943784098958,1.0985629931466028,0.42683625451989715,1,0,97028.442214377152,1.5707860205385331,5.1017368257543376,1.373507290794205,1.0002189474972321,2.0924031942031088E-2,1,0,1,0,0.81078846721087172,0.32961745387887337,-2.6184182417089206,-91.540225974854394,88.459774025145606,null,24127.75,582148320.0625,null,12.121702711134441,-12.502097337013019,null,33.701352814931774,-79.038128637841368,null,0,0]
[24267.5,24.267499999999998,10.703571829721968,1.4772331200742326,1.0996561583826256,0.42901683142231867,1,0,97590.439284059292,1.570786079889489,5.1301543511797911,1.3746144172516508,1.0002214908863141,2.1045190053576565E-2,1,0,1,0,0.80872413285028832,0.33247860570790555,-2.6392987987104437,-91.55359924502693,88.44640075497307,null,24267.5,588911556.25,null,12.119763949240719,-12.445608912554171,null,33.682411019823981,-79.107990332472752,null,0,0]
[24407.25,24.407250000000001,10.764674325999554,1.477765745875639,1.1007545419909708,0.43119306689514797,1,0,98152.436353741767,1.5707861385607869,5.1585780954991849,1.3757093445143316,1.0002240489578607,2.1166347547177149E-2,1,0,1,0,0.80665169903526845,0.33536075229926626,-2.6596905218624665,-91.568772646959857,88.431227353040143,null,24407.25,595713852.5625,null,12.117857064169232,-12.389819376122432,null,33.663926181743435,-79.178953270837411,null,0,0]
[24547,24.547000000000001,{"$f":"SQRT(1+(A333/pole1)^2)","v":10.825779841637047},{"$f":"ATAN(A333/pole1)","v":1.4782923590712758},{"$f":"SQRT(1+(A333/Zero1)^2)","v":1.1018581283658873},{"$f":"ATAN(A333/Zero1)","v":0.43336495333918074},{"$f":"IF(VIN_nom>Vout, 1, SQRT(1+(A333/z_RHP)^2))","v":1},{"$f":"IF(VIN_nom>Vout, 0, -ATAN(A333/z_RHP))","v":0},{"$f":"SQRT(1+(A333/Pole2)^2)","v":98714.433423424562},{"$f":"ATAN(A333/Pole2)","v":1.5707861965640344},5.1870079564777107,1.3767922705255369,{"$f":"SQRT(1+(A333/pole4)^2)","v":1.0002266217117592},{"$f":"ATAN(A333/pole4)","v":2.1287504419280626E-2},{"$f":"IF(VOUT_setting=1,1,SQRT(1+(A333*zterm1)^2))","v":1},{"$f":"IF(VOUT_setting=1,0,ATAN(((A333*zterm1))))","v":0},1,{"$f":"IF(VOUT_setting=1,0,ATAN(A333*$Q$4/(1+Afbr-$Q$5*(A333)^2)))","v":0},{"$f":"SQRT((1-(Z333/pterm2))^2+(A333/pterm1)^2)","v":0.80457126169088422},{"$f":"IF((ATAN((A333/pterm1)/(1-A333^2/pterm2))>0),ATAN((A333/pterm1)/(1-A333^2/pterm2)),PI()+ATAN((A333/pterm1)/(1-A333^2/pterm2)))","v":0.33826416645012775},{"$f":"20*LOG10(((E333*K333*G333*O333)/(C333*I333*S333*M333*Q333))*Adc)","v":-2.67959753632464},{"$f":"((F333+L333+H333+P333)-(D333+J333+T333+N333+R333))*radconv","v":-91.585756821528108},{"$f":"IF(V333>0,V333,V333+180)","v":88.414243178471892},null,{"$f":"IF(U333<0,A333,1000000000)","v":24547},{"$f":"A333^2","v":602555209},null,{"$f":"20*LOG10((K333/(I333*M333))*AEA)","v":12.115981351694726},{"$f":"(L333-(J333+N333))*radconv","v":-12.334717386864291},null,{"$f":"20*LOG10((E333*G333/(C333*S333))*Acs*Am)","v":33.645894879755772},{"$f":"(F333+H333-(D333+T333))*radconv","v":-79.251039434663838},null,{"$f":"SUM((U334<0)*(U333>0))*A333","v":0},0]
[24690,{"$f":"A334/1000","v":24.69},10.888309488251458,1.4788251004093189,1.1029927489141085,0.43558283913183399,1,0,99289.500192402658,1.5707862552364933,5.2161052043655411,1.3778881597982864,1.0002292694955228,2.1411478246010137E-2,1,0,1,0,0.8024342590112451,0.34125740533615634,-2.6994700033132721,-91.605021820258713,88.394978179741287,null,24690,609596100,null,12.114093571895948,-12.279034095384414,null,33.627910192565921,-79.325987724874324,null,0,0]
[24833,24.832999999999998,10.950842189821957,1.4793517576592385,1.1041327839363808,0.43779615578697695,1,0,99864.56696138109,1.5707863132332256,5.2452086471498367,1.3789718891090639,1.0002319326522382,2.1535451414474705E-2,1,0,{"$f":"IF(VOUT_setting=1,1,SQRT((1+Afbr-$Q$5*(A335)^2)^2+(A335*$Q$4)^2))","v":1},0,0.80028908480562866,0.34427350172764282,-2.7188435241251838,-91.626206295376107,88.373793704623893,null,24833,616677889,null,12.112237000283596,-12.224047441973282,null,33.61039324336636,-79.402158853402838,null,0,0]
[24976,24.975999999999999,11.013377894311468,1.4798724341656111,1.1052782166784882,0.44000489579162066,1,0,100439.63373035986,1.5707863705658376,5.2743181822811458,1.3800436572274095,1.000234611181783,2.1659423920868826E-2,1,0,1,0,0.79813584736994592,0.34731275950197094,-2.7377223514884115,-91.649322621233694,88.350677378766306,null,24976,623800576,null,12.110410942584286,-12.169746038422078,null,33.59334047370244,-79.479576582811589,null,0,0]
[25119,25.119,11.075916550855665,1.4803872309520685,1.1064290303764319,0.44220905184243137,1,0,101014.70049933896,1.570786427245672,5.303433709440279,1.3811036586692258,1.0002373050840334,2.1783395761387124E-2,1,0,1,0,0.79597465693335068,0.35037548654481748,-2.7561106869551728,-91.674383500550832,88.325616499449168,null,25119,630964161,null,12.10861472353016,-12.11611874022241,null,33.576748357289802,-79.558264760328427,null,0,0]
[25265.25,25.265250000000002,11.139879542143087,1.4809077489028073,1.1076115472378372,0.44445855354712244,1,0,101602.83696761336,1.5707864845500354,5.3332170486982857,1.3821757785816362,1.0002400761119508,2.1910184451021497E-2,1,0,1,0,0.7937562392971147,0.35353242156516412,-2.7744139270710173,-91.70203887548837,88.29796112451163,null,25265.25,638332857.5625,null,12.106807860409585,-12.061958534151689,null,33.560251980294538,-79.64008034133667,null,0,0]
[25411.5,25.4115,11.203845517194914,1.4814223234183919,1.108799656927965,0.44670324578294163,1,0,102190.97343588807,1.5707865411947952,5.3630064500830406,1.3832359892886152,1.0002428632190101,2.2036972436118324E-2,1,0,1,0,0.79152974261625153,0.35671456920165928,-2.7922128631364003,-91.731756124490985,88.268243875509015,null,25411.5,645744332.25,null,12.105030837194942,-12.008480597130781,null,33.544230067443792,-79.723275527360201,null,0,0]
[25557.75,25.557749999999999,11.26781442519577,1.4819310554490277,1.1099933414875347,0.44894312140967824,1,0,102779.10990416314,1.5707865971912744,5.3928018131344491,1.3842844857827052,1.0002456664050769,2.2163759712607228E-2,1,0,1,0,0.7892952913304051,0.35992227214070088,-2.8095118400833541,-91.763549903333526,88.236450096666474,null,25557.75,653198585.0625,null,12.103282989266335,-11.955673757325524,null,33.528678938425443,-79.807876146007999,null,0,0]
[25704,25.704000000000001,11.331786216475404,1.4824340436775814,1.111192582950348,0.45117817351105027,1,0,103367.2463724385,1.5707866525505387,5.4226030395805109,1.3853214588742497,1.000248485670016,2.2290546276417966E-2,1,0,1,0,0.78705301216468126,0.36315587766814722,-2.826315157865102,-91.797435228188903,88.202564771811097,null,25704,660695616,null,12.10156367021658,-11.903527082509331,null,33.513594939693462,-79.893908145679561,null,0,0]
[25853.75,25.853750000000002,11.397291893504248,1.4829432183502489,1.1124262634108859,0.45346170899003785,1,0,103969.45790149346,1.5707867085856628,5.4531234329219949,1.386371503066641,1.0002513890650684,2.2420366305876821E-2,1,0,1,0,0.78474909530204406,0.366494076081118,-2.8430114590234363,-91.834314772770085,88.165685227229915,null,25853.75,668416389.0625,null,12.099832109602991,-11.850805332283214,null,33.498630199148714,-79.98350944048687,null,0,0]
[26003.5,26.003499999999999,11.462800491609663,1.4834465734017539,1.1136657317868714,0.45574017334872824,1,0,104571.66943054872,1.5707867639753925,{"$f":"SQRT(1+(A343/Zero2)^2)","v":5.483649771905835},{"$f":"ATAN(A343/Zero2)","v":1.3874098576375986},1.0002543093174994,2.2550185579501805E-2,1,0,1,0,0.78243724785315882,0.36986018363355477,-2.8591970848155523,-91.873420193002332,88.126579806997668,null,26003.5,676182012.25,null,12.098129144018037,-11.798753267745655,null,33.484147538941549,-80.074666925256665,null,0,0]
[26153.25,26.15325,11.528311960995385,1.4839442077876039,1.1149109687746876,0.4580135598827888,1,0,105173.8809596043,1.5707868187308136,5.5141819577873594,1.3884367145065788,1.0002572464271615,2.2680004092923846E-2,1,0,1,0,0.78011761361159382,0.3732545884864078,-2.8748765225337962,-91.91476878694273,88.08523121305727,null,26153.25,683992485.5625,null,12.09645413508297,-11.747359893106621,null,33.470143110158375,-80.167408893836097,null,0,0]
[26303,26.303000000000001,11.593826252988494,1.4844362182380797,1.1161619550672208,0.46028186212768374,1,0,105776.09248866017,1.5707868728627605,5.544719893978157,1.389452261463207,1.0002602003939063,2.2809821841774047E-2,1,0,1,0,0.77779033909088935,0.37667768409126706,-2.8900542219645668,-91.958378251151785,88.041621748848215,null,26303,691847809,null,12.094806461949958,-11.696614449183588,null,33.456613083860617,-80.2617638019682,null,0,0]
[26456,26.456,11.660765256720929,1.4849331967313528,1.1174460090487051,0.46259413549134976,1,0,106391.37371701142,1.5707869275366195,5.575926430630548,1.3904783590547833,1.0002632358797801,2.2942456210018686E-2,1,0,1,0,0.77540482062128213,0.38020511698736692,-2.90504772321417,-92.005287994756571,87.994712005243429,null,26456,699919936,null,12.093150633661828,-11.645425909859405,null,33.44327541089914,-80.359862084897145,null,0,{"$f":"IF(AH346>0,W346,0)","v":0}]
[26609,26.609000000000002,11.727707107640168,1.4854245018299719,1.1187360238426389,0.46490108859973683,1,0,107006.65494536299,1.5707869815817366,5.6071387726925161,1.3914930340856175,1.0002662889620531,2.3075089770924914E-2,1,0,1,0,0.7730116447668961,0.38376334697053094,-2.9195267554144229,-92.054596430318782,87.945403569681218,null,26609,708038881,null,12.09152208387666,-11.594891752776382,null,33.430424928484058,-80.459704677542405,null,0,0]
[26762,26.762,11.794651757267649,1.485910229898687,1.1200319788526383,0.46720271532304147,1,0,107621.93617371484,1.5707870350088948,5.6383568237527655,1.3924964741796737,1.0002693596405645,2.3207722519833662E-2,1,0,1,0,0.77061097695197356,0.38735281115440107,-2.9334959624316848,-92.106323725400287,87.893676274599713,null,26762,716204644,null,12.089920203505336,-11.54500122822412,null,33.418057601838115,-80.561322497176192,null,0,0]
[26915,26.914999999999999,11.861599158217208,1.4863904751373633,1.121333853482912,0.46949900978546261,1,0,108237.21740206701,1.5707870878286332,5.6695804895060133,1.3934888629194027,1.0002724479151524,2.3340354452086019E-2,1,0,1,0,0.76820298581571944,0.39097395266622598,-2.946959960274615,-92.160490485072856,87.839509514927144,null,26915,724417225,null,12.088344400184099,-11.495743818039866,null,33.406169407316426,-80.664746667032972,null,0,0]
[27071.75,27.071750000000002,11.930190231709981,1.4868769013170788,1.1226737543046157,0.47184605019523246,1,0,108867.57905268302,1.5707871413238068,5.7015751675422894,1.394494301743034,1.0002756301308504,2.3476236315194923E-2,1,0,1,0,0.76572856029925984,0.39471716879229179,-2.9602348236360667,-92.218536749447452,87.781463250552548,null,27071.75,732879648.0625,null,12.086756415509344,-11.445924939146456,null,33.39448252862973,-80.772611810301001,null,0,0]
[27228.5,27.2285,11.998784095736617,1.4873577660707602,1.1240198247213671,0.47418748207886097,1,0,109497.94070329936,1.5707871942030542,5.7335755450124672,1.3954885184009955,1.0002788308154007,2.3612117311225218E-2,1,0,1,0,0.76324681706361885,0.39849459532415921,-2.9729891425172736,-92.279188722090254,87.720811277909746,null,27228.5,741391212.25,null,12.085194594567941,-11.396748958013729,null,33.383290030689928,-80.882439764076508,null,0,0]
[27385.25,27.385249999999999,12.067380702710944,1.487833164015308,1.1253720425945963,0.47652329993486292,1,0,110128.30235391598,1.5707872464769526,5.7655815270168222,1.3964716978012013,1.000282049968626,2.3747997435167523E-2,1,0,1,0,0.7607579483992376,0.40230672880225332,-2.9852278112988113,-92.342469994908811,87.657530005091189,null,27385.25,749951917.5625,null,12.083658351475076,-11.348205280517632,null,33.37258760500125,-80.994264714391178,null,0,0]
[27542,27.542000000000002,12.135980006120791,1.4883031876383264,1.1267303857911457,0.47885349853314385,1,0,110758.6640045329,1.5707872981558371,5.7975930207347908,1.3974440208541086,1.0002852875903478,2.3883876682012674E-2,1,0,1,0,0.75826215044532874,0.40615407264771025,-2.9969557082396747,-92.408404645520847,87.591595354479153,null,27542,758561764,null,12.082147116475582,-11.300283541557624,null,33.362370943059886,-81.1081211039632,null,0,0]
[27702.5,27.702500000000001,12.206223187678145,1.4887789815504646,1.1281275490111415,0.48123361581597862,1,0,111404.10607741369,1.5707873504650716,5.8303759559212107,1.3984285410494226,1.0002886218034741,2.4023005714488621E-2,1,0,1,0,0.75569967345973665,0.41013047526759172,-3.008440011724729,-92.478691692826146,87.521308307173854,null,27702.5,767428506.25,null,12.080625061516843,-11.251849192932365,null,33.352408694533572,-81.226842499893792,null,0,0]
[27863,27.863,12.276469100856771,1.4892493305858709,1.1295310871954756,0.48360783152564485,1,0,112049.54815029478,1.5707874021716695,5.8631644791750617,1.3994020507322718,1.0002919753789457,2.4162133816770605E-2,1,0,1,0,0.75313036058378069,0.41414488369035585,-3.0193991276534575,-92.551813247085022,87.448186752914978,null,27863,776346769,null,12.07912806611138,-11.204045612377621,null,33.342946574010305,-81.347767634707424,null,0,0]
[28023.5,28.023499999999999,12.346717699032476,1.4897143274730955,1.130940976609472,0.4859761409177894,1,0,112694.99022317615,1.5707874532859853,5.8959584972674932,1.4003647317671768,1.0002953483165677,2.4301260983481902E-2,1,0,1,0,0.75055443546094958,0.41819786114229757,-3.0298382647000515,-92.627796743788821,87.372203256211179,null,28023.5,785316552.25,null,12.077655567810137,-11.156862380109104,null,33.333979935264949,-81.470934363679717,null,0,0]
[28184,28.184000000000001,12.416968936634413,1.490174062851553,1.1323571935295265,0.48833853953665568,1,0,113340.43229605783,1.5707875038181376,5.9287579190169266,1.4013167620754716,1.0002987406161445,2.4440387209246007E-2,1,0,1,0,0.74797212633955124,0.42228997865825402,-3.0397626303653031,-92.706670155505776,87.293329844494224,null,28184,794337856,null,12.076207019678444,-11.110289302256978,null,33.325504117731391,-81.596380853248817,null,0,0]
[28348,28.347999999999999,12.488754812735319,1.4906384809290674,1.1338108049991653,0.49074634477785423,1,0,113999.94942971916,1.5707875548611807,5.9622780818639693,1.4022787326268602,1.0003022268907895,2.4582546362701487E-2,1,0,1,0,0.74532715324654453,0.42651236439612228,-3.0493771045286087,-92.790278346871077,87.209721653128923,null,28348,803609104,null,12.074751069184973,-11.063320493655961,null,33.317345594061557,-81.726957853215112,null,0,0]
[28512,28.512,12.560543351673198,1.4910975904338029,1.1352709729112955,0.49314797014927675,1,0,114659.46656338077,1.5707876053170284,5.9958037004333367,1.4032299463072602,1.0003057333806262,2.4724704522375317E-2,1,0,1,0,0.74267601164234476,0.4307768464366577,-3.0584651186405969,-92.876964633081556,87.123035366918444,null,28512,812934144,null,12.073319017639543,-11.016967917780759,null,33.309689631494997,-81.859996715300781,null,0,0]
[28676,28.675999999999998,12.632334508049983,1.4915514816784208,1.1367376720001752,0.4955434118147452,1,0,115318.98369704267,1.5707876551957551,6.0293346837167476,1.4041705808476208,1.0003092600854417,2.486686168253224E-2,1,0,1,0,0.74001896059229821,0.43508405958585666,-3.0670322523716842,-92.96676059718807,87.03323940281193,null,28676,822312976,null,12.07191032850238,-10.971221391646681,null,33.302531186901078,-81.995539205541419,null,0,0]
[28840,28.84,12.704128237492155,1.4920002429427899,1.1382108770175721,0.49793266624167209,1,0,115978.50083070487,1.5707877045072067,6.0628709427048166,1.4051008101223077,1.0003128070050225,2.5009017837437249E-2,1,0,1,0,0.73735626463322324,0.43943464736705445,-3.0750841030044018,-93.059698408796422,86.940301591203578,null,28840,831745600,null,12.070524480031057,-10.926070953221929,null,33.295865184739682,-82.133627455574484,null,0,0]
[29008,29.007999999999999,12.777675656136321,1.4924547206177112,1.1397267333776127,0.50037377634920222,1,0,116654.1037481152,1.5707877544432358,6.0972305385189465,1.4060431166808234,1.0003164613949544,2.5154640167309578E-2,1,0,1,0,0.73462305416567097,0.44393700334666897,-3.0828039266376699,-93.158194967791857,86.841805032208143,null,29008,841464064,null,12.069127983137143,-10.880427170387588,null,33.28954185800032,-82.277767797404294,null,0,0]
[29176,29.175999999999998,12.851225683799981,1.4929039962588693,1.1412493633249059,0.50280838718098309,1,0,117329.70666552582,1.5707878038041858,6.1315954876385863,1.4069748616149789,1.0003201369973052,2.5300261430112953E-2,1,0,1,0,0.73188450015753326,0.44848627086064269,-3.0899949932196602,-93.260058728623761,86.739941271376239,null,29176,851238976,null,12.067754391838555,-10.835388429966432,null,33.283724382716919,-82.424670298657318,null,0,0]
[29344,29.344000000000001,12.924778275942302,1.493348158494846,1.1427787397842195,0.5052364959120339,1,0,118005.30958293672,1.5707878525999341,6.1659657005565558,1.4078962199105507,1.0003238338118403,2.5445881619683215E-2,1,0,1,0,0.72914090563796752,0.45308317035277856,-3.0966634095262369,-93.365326183850826,86.634673816149174,null,29344,861070336,null,12.066403190464133,-10.790944706224721,null,33.278407167784763,-82.574381477626105,null,0,0]
[29512,29.512,12.998333389029078,1.4937872939562702,1.1443148357054196,0.50765810003911649,1,0,118680.9125003479,1.5707879008401331,6.2003410897367663,1.4088073627441848,1.0003275518383252,2.559150072985647E-2,1,0,1,0,0.72639258021060671,0.45772843198854313,-3.1028153238140832,-93.474034468367591,86.525965531632409,null,29512,870958144,null,12.065073877597019,-10.747086191662955,null,33.273584566364036,-82.726948276704618,null,0,0]
[29684,29.684000000000001,13.073642381593249,1.4942317657185504,1.1458944384678826,0.51013062037302204,1,0,119372.60120150726,1.5707879496632102,6.235540213767087,1.4097297911119908,1.0003313803645348,2.5740585837011502E-2,1,0,1,0,0.72357424760774702,0.462535170837934,-3.1085850871051623,-93.588935186394949,86.411064813605051,null,29684,881139856,null,12.063735081757169,-10.702779684018406,null,33.269153598912808,-82.886155502376539,null,0,0]
[29856,29.856000000000002,13.148953927337541,1.494671146081104,1.147481027180316,0.51259631838176134,1,0,120064.28990266689,1.5707879979237491,6.2707445838906555,1.4106418631022657,1.0003352311243086,2.5889669799683018E-2,1,0,1,0,0.72075163464933356,0.46739418237636826,-3.1138266608171494,-93.707523362533308,86.292476637466692,null,29856,891380736,null,12.062418209249817,-10.659066455292978,null,33.26522889770817,-83.048456907240336,null,0,0]
[30028,30.027999999999999,13.224267982641253,1.4951055218615159,1.1490745729050966,0.51505519240608821,1,0,120755.97860382681,1.5707880456314165,6.3059541122450806,1.4115437506603523,1.0003391041173895,2.6038752611257186E-2,1,0,1,0,0.71792509597159415,0.4723062818606682,-3.1185468162079841,-93.829840925339283,86.170159074660717,null,30028,901680784,null,12.06112276541803,-10.615936653919096,null,33.261804186149121,-83.213904271420176,null,0,0]
[30200,30.2,13.299584504870328,1.4955349779184062,1.1506750467383631,0.51750724112599145,1,0,121447.66730498699,1.570788092795659,6.3411687129066694,1.4124356219792316,1.0003429993435196,2.6187834265120478E-2,1,0,1,0,0.71509499409899124,0.47727229519750508,-3.1227523961951236,-93.955930496865719,86.044069503134281,null,30200,912040000,null,12.059848269300934,-10.573380643311165,null,33.258873102279082,-83.382549853554551,null,0,0]
[30375.75,30.37575,13.376545607271957,1.4959688016304373,1.152317540915577,0.52000569905023908,1,0,122154.43642841111,1.5707881404364699,6.3771562257254164,1.4133367631578708,1.0003470024597991,2.634016504301159E-2,1,0,1,0,0.71219989447765053,0.48240313942187629,-3.1265253433317812,-94.088710443813667,85.911289556186333,null,30375.75,922686188.0625,null,12.058567137400676,-10.530479697261162,null,33.256381287042686,-83.55823074655251,null,0,0]
[30551.5,30.551500000000001,13.453509198376599,1.496397661865279,1.1539672076926657,0.52249702909198614,1,0,122861.2055518355,1.5707881875291656,6.4131488590263448,1.4142277900708971,1.0003510287886108,2.6492494598200279E-2,1,0,1,0,0.70930186580203702,0.48759205126044231,-3.1297757356727125,-94.225520834547652,85.774479165452348,null,30551.5,933394152.25,null,12.057306903139972,-10.488158154483969,null,33.254391128962453,-83.737362680063669,null,0,0]
[30727.25,30.727250000000002,13.530475235715784,1.4968216431657571,1.1556240163527187,0.52498123091690663,1,0,123567.97467526018,1.5707882340831512,6.4491465270773496,1.4151088706580948,1.0003550783296737,2.6644822923631951E-2,1,0,1,0,0.70640132150989943,0.49283994594436292,-3.1325111504291177,-94.366409348946704,85.633590651053296,null,30727.25,944163892.5625,null,12.056067094853734,-10.446406392873344,null,33.252895522492281,-83.920002956073361,null,0,0]
[30903,30.902999999999999,13.607443677780548,1.4972408281689911,1.1572879362221256,0.5274583045445036,1,0,124274.7437986851,1.5707882801076178,6.4851491460379878,1.415980169192502,1.0003591510827066,2.6797150012252358E-2,1,0,1,0,0.70349868443113062,0.49814775002429545,-3.1347392737236874,-94.511424396064598,85.488575603935402,null,30903,954995409,null,12.054847253932115,-10.405215000399961,null,33.251887240119338,-84.106209395664621,null,0,0]
[31083,31.082999999999998,13.686275826885774,1.4976652626621112,1.1589994323596009,0.52998789050147144,1,0,124998.60406734249,1.5707883267055558,6.522027429365437,1.4168625656984755,1.0003633463837969,2.6953159396823925E-2,1,0,1,0,0.70052413816636971,0.50364698778500694,-3.136503591262203,-94.664274969868913,85.335725030131087,null,31083,966152889,null,12.053618146264411,-10.363598753868605,null,33.251352030248526,-84.300676216000312,null,0,0]
[31263,31.263000000000002,13.765110413260246,1.498084835646468,1.1607183228103113,0.53251000050497466,1,0,125722.46433600014,1.570788372766909,6.5589107337893706,1.4177350387603653,1.000367566032454,2.7109167469066716E-2,1,0,1,0,0.69754832555207436,0.50921107058748372,-3.1377524908346883,-94.821559153070268,85.178440846929732,null,31263,977375169,null,12.05240904972614,-10.32255097286717,null,33.251312227214306,-84.499008180203091,null,0,0]
[31443,31.443000000000001,13.843947395266756,1.4984996300274092,1.1624445747726559,0.53502463570350733,1,0,126446.32460465806,1.5707884183008922,6.5957989750767956,1.4185977535347956,1.0003718100283701,2.7265174221403371E-2,1,0,1,0,0.69457173286294138,0.51484102984753632,-3.1384946388769213,-94.983331263080501,85.016668736919499,null,31443,988662249,null,12.051219511453056,-10.282062194711974,null,33.25175961744516,-84.701269068368489,null,0,0]
[31623,31.623000000000001,13.922786732209914,1.4989097268391025,1.1641781554995243,0.53753179761689285,1,0,127170.18487331622,1.5707884633165112,6.6326920708574431,1.4194508715626233,1.0003760783712352,2.742117964625693E-2,1,0,1,0,0.69159485765554007,0.52053790872597727,-3.1387388585622187,-95.149646368920443,84.850353631079557,null,31623,1000014129,null,12.050049091139964,-10.242123163875517,null,33.252685818072955,-84.907523205044924,null,0,0]
[31807,31.806999999999999,14.003380447019261,1.4993241640701602,1.1659578010701042,0.54008695196606449,1,0,127910.13092572262,1.5707885088058697,6.6704099468491558,1.4203131932802044,1.0003804667303651,2.7580650478380136E-2,1,0,1,0,0.68855206780725731,0.52643164991587366,-3.1384832177725048,-95.324411025828766,84.675588974171234,null,31807,1011685249,null,12.048871975684792,-10.20185538081399,null,33.254118574317843,-85.122555645014785,null,0,0]
[31991,31.991,14.083976539497209,1.4997338581052195,1.1677450357306818,0.54263430157276193,1,0,128650.07697812928,1.5707885537719533,6.7081327271687021,1.4211658171973953,1.0003848805298932,2.7740119907355802E-2,1,0,1,0,0.68551007126508701,0.53239755869928895,-3.1377264597879062,-95.504041527617787,84.495958472382213,null,31991,1023424081,null,12.047713945301536,-10.162143130410128,null,33.256033362685699,-85.341898397207643,null,0,0]
[32175,32.174999999999997,14.16457496905713,1.5001388897739218,1.1695398246894078,0.54517384923384693,1,0,129390.02303053619,1.5707885982237395,6.7458603295412356,1.4220089047748119,1.0003893197694829,2.7899587925091791E-2,1,0,1,0,0.68246943768467172,0.53843678558074559,-3.1364785812393681,-95.68859901332884,84.31140098667116,null,32175,1035230625,null,12.046574567727824,-10.122977161702838,null,33.258420618807946,-85.56562185162602,null,0,0]
[32359,32.359000000000002,14.245175696029772,1.500539338082737,1.1713421332210627,0.54770559813160979,1,0,130129.96908294337,1.5707886421700015,6.7835926735118237,1.4228426139356225,1.0003937844487956,2.8059054523496382E-2,1,0,1,0,0.6794307501518243,0.54455049253132992,-3.1347497938528681,-95.878145355114654,84.121854644885346,null,32359,1047104881,null,12.045453422688947,-10.084348426400084,null,33.261270551233324,-85.793796928714571,null,0,0]
[32547.5,32.547499999999999,14.327749978279691,1.5009449078267627,1.1731962813949957,0.55029118133672916,1,0,130888.01164206726,1.570788686675779,6.8222526540846138,1.423687148935203,1.0003983846988604,2.822241963994886E-2,1,0,1,0,0.676320388921129,0.5508921804690412,-3.1324909458141859,-96.077566129118566,83.922433870881434,null,32547.5,1059339756.25,null,12.044323338006397,-10.045322816914043,null,33.26465948395456,-86.032243312204528,null,0,0]
[32736,32.735999999999997,14.410326590246283,1.5013458295005948,1.1750582478861356,0.55286858763232638,1,0,131646.05420119144,1.5707887306690114,6.8609174457176936,1.4245221657482956,1.0004030116474729,2.8385783249606195E-2,1,0,1,0,0.67321335342043009,0.55731453978508816,-3.1297498174729883,-96.282356456449577,83.717643543550423,null,32736,1071645696,null,12.04321153249569,-10.006842443643336,null,33.268512417806463,-86.275514012806255,null,0,0]
[32924.5,32.924500000000002,14.49290549210728,1.5017421824267339,1.1769279955874261,0.55543782166514655,1,0,132404.09676031585,1.5707887741585018,6.8995869675285482,1.4253478232378494,1.0004076652942624,2.8549145343769764E-2,1,0,1,0,0.67011031632572893,0.56381885404360377,-3.1265381674656427,-96.492585056350421,83.507414943649579,null,32924.5,1084022700.25,null,12.042117590885317,-9.9688982044174352,null,33.272818009424178,-86.523686851933007,null,0,0]
[33113,33.113,14.57548664494179,1.5021340441358095,1.1788054874726579,0.55799888848407098,1,0,133162.13931944052,1.5707888171528532,6.9382611404280361,1.4261642767764733,1.0004123456388563,2.8712505913741432E-2,1,0,1,0,0.66701196640029203,0.57040641707920359,-3.1228680439846097,-96.708321310782097,83.291678689217903,null,33113,1096470769,null,12.041041109444517,-9.9314811970361099,null,33.277564614346012,-86.776840113745976,null,0,0]
[33305.75,33.305750000000003,14.65993199509864,1.502530175623727,1.1807332796455061,0.56060925836248321,1,0,133937.27302379766,1.570788860613322,6.9778120064354301,1.4269897791711659,1.0004171591155706,2.8879548094399288E-2,1,0,1,0,0.66384934144573116,0.57722994939291028,-3.1186539471773402,-96.934689898236073,83.065310101763927,null,33305.75,1109272983.0625,null,12.039958003370932,-9.8937566958529697,null,33.282861817226873,-87.040933202383087,null,0,0]
[33498.5,33.4985,14.744379619343528,1.5029217695298396,1.1826690911104212,0.56321110053231715,1,0,134712.4067281551,1.5707889035736484,7.0173675738999082,1.4278059757165977,1.0004220005067459,2.9046588662967249E-2,1,0,1,0,0.66069312688228121,0.58414329244239094,-3.1139869351494447,-97.166965944100852,82.833034055899148,null,33498.5,1122149502.25,null,12.038892335177863,-9.8565652595358628,null,33.288594497447832,-87.310400684564996,null,0,0]
[33691.25,33.691249999999997,14.828829478824836,1.5033089032572979,1.1846128825537057,0.56580442165931644,1,0,135487.54043251273,1.5707889460424169,7.0569277637635013,1.4286130218180855,1.0004268698119771,2.9213627610147064E-2,1,0,1,0,0.65754411346734964,0.59114785761781252,-3.1088809196753457,-97.405225463921639,82.594774536078361,null,33691.25,1135100326.5625,null,12.037843708207213,-9.8198979839751459,null,33.294749139892581,-87.5853274799465,null,0,0]
[33884,33.884,14.91328153556996,1.503691652461373,1.1865646147577396,0.56838922882408771,1,0,136262.67413687066,1.5707889880280161,7.0964924987219673,1.4294110694635398,1.0004317670308565,2.9380664926641032E-2,1,0,1,0,0.65440311100748561,0.59824506370525843,-3.1033501910533841,-97.649544968873954,82.350455031126046,null,33884,1148125456,null,12.036811736826721,-9.7837461608528802,null,33.301311839895035,-87.865798808021111,null,0,0]
[34081.5,34.081499999999998,14.999817011745067,1.5040793632802343,1.1885726399154199,0.57102891078877338,1,0,137056.90970942957,1.5707890305556764,7.1370368755539424,1.4302196052861424,1.0004368138869926,2.9551816896055839E-2,1,0,1,0,0.65119388064800365,0.6056147522996228,-3.0972579851868383,-97.906251611647122,82.093748388352878,null,34081.5,1161548642.25,null,12.035771218492332,-9.7472291927491472,null,33.308444564095971,-88.159022418897948,null,0,0]
[34279,34.279000000000003,15.086354716820921,1.5044626262156018,1.1905889189834815,0.57365967035575827,1,0,137851.14528198875,1.5707890725932869,7.1775858653698368,1.4310190061562436,1.0004418900486245,2.972296713366147E-2,1,0,1,0,0.64799484521457906,0.61308473842095401,-3.0907515398838474,-98.169484517119187,81.830515482880813,null,34279,1175049841,null,12.034747400969065,-9.7112354915672654,null,33.315974826922229,-88.458249025551908,null,0,0]
[34476.5,34.476500000000001,15.172894612660309,1.5048415172605514,1.1926134100987698,0.57628151645662984,1,0,138645.38085454816,1.5707891141492689,7.2181393904272451,1.4318094250115858,1.0004469955153066,2.9894115629457561E-2,1,0,1,0,0.64480694050376952,0.62065656418798509,-3.0838475711742612,-98.439327121747795,81.560672878252205,null,34476.5,1188629052.25,null,12.033739903084303,-9.6757562945295703,null,33.32388629351658,-88.763570827218203,null,0,0]
[34674,34.673999999999999,15.259436661990208,1.5052161106893043,1.1946460715119749,0.57889445845272869,1,0,139439.6164271078,1.5707891552318529,7.2586973747125159,1.4325910114172213,1.0004521302865899,3.0065262373444358E-2,1,0,1,0,0.64163112491461305,0.62833177384500494,-3.0765632845216864,-98.71586305389981,81.28413694610019,null,34674,1202286276,null,12.032748354284074,-9.6407830320884074,null,33.332162128969379,-89.07508002181136,null,0,0]
[34875.75,34.875749999999996,15.347843194201854,1.5055944031500936,1.196730866360052,0.58155444491430475,1,0,140250.94314490003,1.5707891967180674,7.3001326526553294,1.4333804492834135,1.0004574058097766,3.0240090202889685E-2,1,0,1,0,0.63840047182428239,0.63628049731703751,-3.0687479885766904,-99.005347741142245,80.994652258857755,null,34875.75,1216317938.0625,null,12.031751561334637,-9.6055708478811983,null,33.340974217863817,-89.399776893261048,null,0,0]
[35077.5,35.077500000000001,15.436251897611323,1.5059683624428208,1.1988240992254389,0.58420516102234377,1,0,141062.26986269242,1.5707892377270616,7.3415724287734081,1.4341609756092188,1.0004627119113907,3.0414916183228103E-2,1,0,1,0,0.63518452922281943,0.64434035824715497,-3.0605737650288773,-99.301993475941742,80.698006524058258,null,35077.5,1230431006.25,null,12.030770661991852,-9.5708691240389641,null,33.350129340754407,-89.731124351902778,null,0,0]
[35279.25,35.279249999999998,15.524662735125483,1.5063380624923925,1.2009257259853368,0.58684661809991534,1,0,141873.59658048511,1.5707892782670232,7.3830166273239799,1.4349327395089866,1.0004680485909456,3.058974030380231E-2,1,0,1,0,0.63198439427680664,0.6525129969714607,-3.0520606558999539,-99.605889285690736,80.394110714309264,null,35279.25,1244625480.5625,null,12.029805293347689,-9.5366693167973224,null,33.359607818527493,-90.069219968893421,null,0,0]
[35481,35.481000000000002,{"$f":"SQRT(1+(A397/pole1)^2)","v":15.613075670490499},{"$f":"ATAN(A397/pole1)","v":1.5067035755539611},{"$f":"SQRT(1+(A397/Zero1)^2)","v":1.2030357026489487},{"$f":"ATAN(A397/Zero1)","v":0.5894788279079467},{"$f":"IF(VIN_nom>Vout, 1, SQRT(1+(A397/z_RHP)^2))","v":1},{"$f":"IF(VIN_nom>Vout, 0, -ATAN(A397/z_RHP))","v":0},{"$f":"SQRT(1+(A397/Pole2)^2)","v":142684.92329827798},{"$f":"ATAN(A397/Pole2)","v":1.5707893183459527},7.4244651742475023,1.4356958868095113,{"$f":"SQRT(1+(A397/pole4)^2)","v":1.0004734158479522},{"$f":"ATAN(A397/pole4)","v":3.0764562553955689E-2},{"$f":"IF(VOUT_setting=1,1,SQRT(1+(A397*zterm1)^2))","v":1},{"$f":"IF(VOUT_setting=1,0,ATAN(((A397*zterm1))))","v":0},1,{"$f":"IF(VOUT_setting=1,0,ATAN(A397*$Q$4/(1+Afbr-$Q$5*(A397)^2)))","v":0},{"$f":"SQRT((1-(Z397/pterm2))^2+(A397/pterm1)^2)","v":0.62880119040770965},{"$f":"IF((ATAN((A397/pterm1)/(1-A397^2/pterm2))>0),ATAN((A397/pterm1)/(1-A397^2/pterm2)),PI()+ATAN((A397/pterm1)/(1-A397^2/pterm2)))","v":0.66080004707331541},{"$f":"20*LOG10(((E397*K397*G397*O397)/(C397*I397*S397*M397*Q397))*Adc)","v":-3.0432293166480182},{"$f":"((F397+L397+H397+P397)-(D397+J397+T397+N397+R397))*radconv","v":-99.917123878473177},{"$f":"IF(V397>0,V397,V397+180)","v":80.082876121526823},null,{"$f":"IF(U397<0,A397,1000000000)","v":35481},{"$f":"A397^2","v":1258901361},null,{"$f":"20*LOG10((K397/(I397*M397))*AEA)","v":12.02885510259531},{"$f":"(L397-(J397+N397))*radconv","v":-9.502963070744217},null,{"$f":"20*LOG10((E397*G397/(C397*S397))*Acs*Am)","v":33.369389348531811},{"$f":"(F397+H397-(D397+T397))*radconv","v":-90.414160807728933},null,{"$f":"SUM((U398<0)*(U397>0))*A397","v":0},0]
[35687.75,{"$f":"A398/1000","v":35.687750000000001},15.703681896087158,1.5070738771304064,1.2052065881729503,0.59216669104120601,1,0,143516.3572457562,1.5707893589480308,7.4669453822318461,1.4364691569139367,1.0004789478455161,3.0943715498039589E-2,1,0,1,0,0.6255578656032762,0.66941287491427215,-3.0338712244541437,-100.24377798834266,79.756222011657343,null,35687.75,1273615500.0625,null,12.027896751135845,-9.46892499120918,null,33.379705792185149,-90.774852997133493,null,0,0]
[35894.5,35.894500000000001,15.794290250317774,1.5074399300798773,1.2073861494947902,0.59484486925824942,1,0,144347.79119323462,1.5707893990823785,7.5094300045352673,1.4372336779154313,1.0004845119538739,3.1122866455186117E-2,1,0,{"$f":"IF(VOUT_setting=1,1,SQRT((1+Afbr-$Q$5*(A399)^2)^2+(A399*$Q$4)^2))","v":1},0,0.62233479647494649,0.67814929526341716,-3.0242249159418559,-100.5783260497799,79.421673950220097,null,35894.5,1288415130.25,null,12.02695362009398,-9.4353880577050582,null,33.390295231739302,-91.142937992074835,null,0,0]
[36101.25,36.10125,15.884900696756803,1.5078018070083163,1.209574339715078,0.59751337659813375,1,0,145179.22514071333,1.5707894387570314,7.5519189666572286,1.4379895965864991,1.0004901081724897,3.1302015413928796E-2,1,0,1,0,0.61913328027320969,0.68701102531836333,-3.01431475563871,-100.92086139695462,79.079138603045379,null,36101.25,1303300251.5625,null,12.026025360641174,-9.4023438605902605,null,33.401133651495257,-91.518517536364314,null,0,0]
[36308,36.308,15.975513199804277,1.5081595788788262,1.2117711120881764,0.60017222754963495,1,0,146010.65908819222,1.5707894779798426,7.5944121957569148,1.4387370564545112,1.0004957365008247,3.1481162362801927E-2,1,0,1,0,0.61595464474027484,0.69599976138410968,-3.0041658708344121,-101.27147623300495,78.728523766995053,null,36308,1318270864,null,12.02511163368014,-9.3697841761451777,null,33.41219626326059,-91.901692056859801,null,0,0]
[36519.5,36.519500000000001,16.068209581248574,1.5085213951235357,1.2140271860423337,0.60288218841201036,1,0,146861.19490387215,1.5707895176442517,7.6378860309927319,1.4394930827164825,1.0005015273619824,3.1664423050805204E-2,1,0,1,0,0.61272807320072864,0.70532816908402962,-2.9935638251969916,-101.63860107049308,78.361398929506919,null,36519.5,1333673880.25,null,12.024191607650355,-9.3369693986721636,null,33.423718334927798,-92.301631671820928,null,0,0]
[36731,36.731000000000002,16.16090804206727,1.5088790606813951,1.2162921425629087,0.60558207616362514,1,0,147711.73071955238,1.570789556851879,7.681364182441345,1.4402405508634866,1.0005073518240737,3.1847681611255743E-2,1,0,1,0,0.6095283555864085,0.71479299242063543,-2.9827676844151227,-102.0143714739241,77.985628526075899,null,36731,1349166361,null,12.023286101473191,-9.3046448169964666,null,33.435419981886824,-92.709726656927629,null,0,0]
[36942.5,36.942500000000003,16.25360854668277,1.5092326464789365,1.2185659321196487,0.60827190772194928,1,0,148562.2665352328,1.5707895956105702,7.724846577223266,1.4409796045714975,1.0005132098865119,3.2030938031881805E-2,1,0,1,0,0.60635701421675769,0.72439595228698128,-2.9718069546282244,-102.39888090541785,77.601119094582145,null,36942.5,1364748306.25,null,12.022394781685882,-9.2728021988375176,null,33.447272031461033,-93.12607870658033,null,0,0]
[37154,37.154000000000003,16.346311060323739,1.5095822218378827,1.2208485053588503,0.61095170046073244,1,0,149412.80235091341,1.5707896339279919,7.768333144083714,1.4417103843365793,1.0005191015487065,3.2214192300412524E-2,1,0,1,0,0.60321560592871859,0.73413872740817732,-2.9607120606333637,-102.7922204751426,77.207779524857401,null,37154,1380419716,null,12.021517324132599,-9.2414334941000398,null,33.459244383009178,-93.550786981042535,null,0,0]
[37370.25,37.370249999999999,16.441097587123437,1.5099355722040568,1.2231913726412607,0.61368131669795012,1,0,150282.44003479515,1.5707896726575286,7.812800600718373,1.4424491647639408,1.0005251602690746,3.2401559970624633E-2,1,0,1,0,0.60003625298022989,0.74424657113174009,-2.9492619466004437,-103.20361585082351,76.79638414917649,null,37370.25,1396535585.0625,null,12.020634164563244,-9.2098420893486086,null,33.471577656611451,-93.993773761474884,null,0,0]
[37586.5,37.586500000000001,16.535886143166838,1.5102848715972683,1.2255433187988078,0.61640047629080075,1,0,151152.07771867714,1.5707897109414124,{"$f":"SQRT(1+(A407/Zero2)^2)","v":7.8572722732854299},{"$f":"ATAN(A407/Zero2)","v":1.4431795826836347},1.0005312541140969,3.2588925365047872E-2,1,0,1,0,0.59689159540328895,0.75450397081536824,-2.93773891513362,-103.62442615023272,76.375573849767278,null,37586.5,1412744982.25,null,12.01976483996331,-9.1787296650660881,null,33.483970012678206,-94.445696485166678,null,0,0]
[37802.75,37.802750000000003,16.630676693756172,1.5106301892000344,1.2279042916620555,0.61910919923117302,1,0,152021.71540255932,1.5707897487872919,7.9017480906020676,1.443901778517388,1.0005373830831319,3.2776288470568717E-2,1,0,1,0,0.59378340996249113,0.76491254610269055,-2.9261785737510602,-104.05473894464465,75.945261055355346,null,37802.75,1429047907.5625,null,12.018909032050988,-9.1480881753670609,null,33.496386161973092,-94.90665076927759,null,0,0]
[38019,38.018999999999998,16.725469204979557,1.510971592630338,1.2302742392625738,0.62180750597039181,1,0,152891.3530864417,1.5707897862026405,7.9462279830725784,1.4446158895775711,1.000543547175534,3.2963649274074629E-2,1,0,1,0,0.59071351138441908,0.77547384375573547,-2.9146175990248251,-104.49463769170347,75.505362308296526,null,38019,1445444361,null,12.018066431427247,-9.1179097525091013,null,33.508789737323063,-95.376727939194367,null,0,0]
[38240.5,38.240499999999997,16.822565035256925,1.5113172956713994,1.2327109732721091,0.62456054399190619,1,0,153782.1033614937,1.5707898240876366,7.9917918878485539,1.445339096191143,1.0005498973285203,3.3155556321138223E-2,1,0,1,0,0.587610712210487,0.78645140362372024,-2.9028147619574227,-104.95523635559567,75.044763644404327,null,38240.5,1462335840.25,null,12.0172167524182,-9.087470700306655,null,33.521442253399513,-95.867765655289006,null,0,{"$f":"IF(AH410>0,W410,0)","v":0}]
[38462,38.462000000000003,16.919662852934099,1.5116590309420708,1.2351570133621275,0.62730269878451828,1,0,154672.85363654591,1.5707898615362783,8.0373599251604837,1.4460541026948359,1.000556284329605,3.3347460925211153E-2,1,0,1,0,0.58455205683452183,0.79759220854052715,-2.8910926300852751,-105.42605416512288,74.573945834877122,null,38462,1479325444,null,12.016380299974077,-9.0575013148180208,null,33.534000837715787,-96.368552850304866,null,0,0]
[38683.5,38.683500000000002,17.016762623990704,1.5119968662836218,1.2376123043544958,0.63003399376104907,1,0,155563.60391159836,1.5707898985560613,8.0829320251160759,1.4467610470495946,1.0005627081780817,3.3539363072205654E-2,1,0,1,0,0.5815396178073261,0.80889763107664558,-2.8794941561397063,-105.9071644033864,74.092835596613597,null,38683.5,1496413172.25,null,12.015556768699824,-9.0279936910856389,null,33.546422842935606,-96.879170712300748,null,0,0]
[38905,38.905000000000001,17.113864315177782,1.5123308680012424,1.2400767913002217,0.63275445279735576,1,0,156454.35418665103,1.5707899351543111,8.1285081193842643,1.4474600641548556,1.000569168873241,3.3731262748035055E-2,1,0,1,0,0.57857550808030012,0.82036892732882583,-2.8680634908714064,-106.39863374089461,73.60136625910539,null,38905,1513599025,null,12.014745861737756,-8.9989400995537387,null,33.558664415165971,-97.39969364134086,null,0,0]
[39131.5,39.131500000000003,17.213159869908662,1.512668512372773,1.2426063626679926,0.63552514148800276,1,0,157365.21169138903,1.5707899721502503,8.1751170803665225,1.4481668001728782,1.0005758135109772,3.3927491674845087E-2,1,0,1,0,0.57559670956416475,0.83227187786457213,-2.8565955801894178,-106.91197161805198,73.088028381948021,null,39131.5,1531274292.25,null,12.013929404217967,-8.9696923174935126,null,33.570948783367754,-97.94227930055844,null,0,0]
[39358,39.357999999999997,17.312457364493422,1.5130022835894752,1.2451454343706652,0.63828455144175533,1,0,158276.0691961273,1.5707900087203761,8.2217300783246099,1.4488655228742133,1.0005824966761649,3.4123717987877146E-2,1,0,1,0,0.57267304180675438,0.8443505154171157,-2.8454003183299426,-107.43625888346713,72.563741116532867,null,39358,1549052164,null,12.013125545673006,-8.9409034905041445,null,33.582947903772187,-98.495355392962963,null,0,0]
[39584.5,39.584499999999998,17.4117567657437,1.5133322478422468,1.2476939484083642,0.6410327096216536,1,0,159186.92670086573,1.570790044871998,8.2683470449828924,1.449556367108088,1.0005892183680318,3.4319941672072439E-2,1,0,1,0,0.56980689003359308,0.85660573781337113,-2.8345287386830149,-107.97154149968817,72.028458500311828,null,39584.5,1566932640.25,null,12.012333994567605,-8.9125658918500648,null,33.594611034524519,-99.058975607838121,null,0,0]
[39811,39.811,17.511058041223283,1.5136584698239302,1.2502518470393091,0.64376964345112164,1,0,160097.78420560437,1.5707900806122592,8.3149679135911114,1.4502394647298751,1.0005959785858016,3.4516162712373434E-2,1,0,1,0,0.56700067958194689,0.86903826887685021,-2.8240331214462389,-108.51785551891804,71.48214448108196,null,39811,1584915721,null,12.011554467516357,-8.8846719663213953,null,33.605886178812547,-99.633183552596648,null,0,0]
[40042.75,40.042749999999998,17.612662908727202,1.5139884458034376,1.2528786881570473,0.64655842760261018,1,0,161029.7543015127,1.5707901167624443,8.3626733689540309,1.4509305121868077,1.000602935372275,3.4716929170250453E-2,1,0,1,0,0.56419403619376762,0.88194305140784834,-2.8137391659487951,-109.08827680247509,70.911723197524907,null,40042.75,1603421827.5625,null,12.010769029979777,-8.8565830055209975,null,33.616965571846563,-100.2316937969541,null,0,0]
[40274.5,40.274500000000003,17.714269671971376,1.5143146364189117,1.2555152324917118,0.64933552055086419,1,0,161961.7243974212,1.5707901524965941,8.4103827725772859,1.4516137197858223,1.00060993248966,3.4917692828359256E-2,1,0,1,0,0.56145540392961824,0.89503437855348278,-2.8039533797099625,-109.67028828289337,70.329711717106633,null,40274.5,1622035350.25,null,12.009995605107754,-8.8289430512398184,null,33.627524782957423,-100.84134523165358,null,0,0]
[40506.25,40.506250000000001,17.815878298520687,1.5146371063671098,1.2581614190424795,0.65210095309374827,1,0,162893.69449332991,1.5707901878218498,8.4580960576482731,1.4522892195608108,1.0006169699371104,3.5118453670574763E-2,1,0,1,0,0.55878750025268042,0.90831237686440625,-2.7947355598538079,-110.26389158775524,69.736108412244761,null,40506.25,1640756289.0625,null,12.009233914107785,-8.801744537978367,null,33.637504293813542,-101.46214704977686,null,0,0]
[40738,40.738,17.917488756675169,1.5149559188803379,1.2608171870984819,0.65485475648444269,1,0,163825.66458923882,1.5707902227451891,8.5058131588481469,1.4529571406113566,1.0006240477137749,3.5319211680773267E-2,1,0,1,0,0.55619307841854282,0.92177692548830148,-2.7861466647418305,-110.86907422761649,69.130925772383506,null,40738,1659584644,null,12.008483685985325,-8.7749800683513257,null,33.646843417047982,-102.09409415926515,null,0,0]
[40975.25,40.975250000000003,18.02151254699038,1.5152785734617988,1.263545845303305,0.65766190111861866,1,0,164779.75263780163,1.570790258088129,8.5546665911169502,1.4536331942198677,1.0006313352389105,3.552473122402959E-2,1,0,1,0,0.55361611226121343,0.93575386355842138,-2.7780702076095523,-111.50058540495391,68.49941459504609,null,40975.25,1678971112.5625,null,12.00772725224283,-8.7480224772655895,null,33.655676307922761,-102.75256292768836,null,0,0]
[41212.5,41.212499999999999,18.125538191917993,1.5155975245336024,1.2662844173698251,0.660456925769352,1,0,165733.84068636468,1.570790293024148,8.603523888878911,1.4543015698463828,1.0006386650283785,3.5730247765059467E-2,1,0,1,0,0.55112209945872648,0.9499251983813688,-2.770785551376874,-112.1441566448533,67.855843355146703,null,41212.5,1698470156.25,null,12.006982281087264,-8.7215046068141309,null,33.663705935311,-103.42265203803919,null,0,0]
[41449.75,41.449750000000002,18.229565659708385,1.5159128354328015,1.2690328391157215,0.6632398653721896,1,0,166687.92873492793,1.5707903275602335,8.6523849866523612,1.4549623969641918,1.0006460370812502,3.5935761286568238E-2,1,0,1,0,0.54871409135669758,0.96428989954484423,-2.7643613197372967,-112.79972311746141,67.200276882538589,null,41449.75,1718081775.0625,null,12.006248505501825,-8.6954190381333465,null,33.670863942536016,-104.10430407932806,null,0,0]
[41687,41.686999999999998,18.333594919331997,1.5162245680618234,1.271791046683636,0.66601075530999698,1,0,167642.01678349139,1.5707903617032137,8.7012498204214133,1.4556158021648911,1.0006534513965919,3.6141271771262778E-2,1,0,1,0,0.54639516455517589,0.97884660154326997,-2.7588669892528603,-113.46720085076683,66.532799149233171,null,41687,1737805969,null,12.005525665946211,-8.6697585174594121,null,33.677081112576069,-104.79744233330737,null,0,0]
[41929.75,41.929749999999999,18.440037639156873,1.5165398868130151,1.2746232583139172,0.66883344629187036,1,0,168618.22278470875,1.5707903962377867,8.7512512549240196,1.4562768019026737,1.0006610813352523,3.6351543299815381E-2,1,0,1,0,0.54411791348711769,0.9939376986248315,-2.7542809875078418,-114.16237233065937,65.837627669340634,null,41929.75,1758103935.0625,null,12.004797125430953,-8.6439356720188094,null,33.682395654836348,-105.51843665864054,null,0,0]
[42172.5,42.172499999999999,18.546482171354405,1.5168515861530421,1.2774655805341268,0.67164359877718671,1,0,169594.42878592634,1.5707904303747893,8.8012564695830005,1.4569302908516768,1.0006687555165821,3.6561811612497865E-2,1,0,1,0,0.54194049994769,1.0092257713259145,-2.7508177693198914,-114.86977083764457,65.130229162355434,null,42172.5,1778519756.25,null,12.004079507047148,-8.6185429560416971,null,33.686576491408104,-106.25122788160283,null,0,0]
[42415.25,42.41525,18.652928484897217,1.517159727985288,1.2803179460073495,0.67444125203708094,1,0,170570.63478714411,1.5707904641210475,8.8512654003303908,1.4575763957550145,1.0006764739395628,3.6772076690791342E-2,1,0,1,0,0.53986627124872555,1.0247081722721061,-2.7485535403626753,-115.58923872255838,64.410761277441622,null,42415.25,1799053432.5625,null,12.003372555493311,-8.593573107012574,null,33.689547671919151,-106.99566561554576,null,0,0]
[42658,42.658000000000001,18.759376549461649,1.5174643728108175,1.2831802877585214,0.67722644577676472,1,0,171546.84078836208,1.5707904974832321,8.9012779845332926,1.4582152405323117,1.0006842366031712,3.6982338516178652E-2,1,0,1,0,0.53789858060972273,1.0403818256918953,-2.7475647206220266,-116.32059384743863,63.67940615256137,null,42658,1819704964,null,12.002676022620001,-8.5690190241812036,null,33.691233024533112,-107.75157482325743,null,0,0]
[42906.5,42.906500000000001,18.868347823677968,1.5177726732278483,1.2861206935693936,0.68006474836584563,1,0,172546.17010371824,1.5707905312446424,8.9524789332183055,1.4588618239451296,1.0006922289642266,3.7197577408024568E-2,1,0,1,0,0.53599813485098358,1.0566211670147667,-2.7479533343297788,-117.08136883538199,62.918631164618006,null,42906.5,1840967742.25,null,12.001973531004611,-8.5443067379714979,null,33.691546902440749,-108.5370620974105,null,0,0]
[43155,43.155000000000001,18.977320870718255,1.5180774329803308,1.2890714130034597,0.68289007972582305,1,0,173545.49941907459,1.5707905646172351,9.0036835820985601,1.4595010532823371,1.0007002676843901,3.7412812851772871E-2,1,0,1,0,0.5342164359634729,1.0730529785985605,-2.7498402723931448,-117.85413302617485,62.14586697382515,null,43155,1862354025,null,12.001281453181555,-8.5200155894179108,null,33.690352042200438,-109.3341174367569,null,0,0]
[43403.5,43.403500000000001,19.086295660216742,1.5183787126583181,1.2920323753985417,0.68570248377490794,1,0,174544.82873443118,1.5707905976076886,9.0548918684011799,1.4601330527859482,1.0007083527625447,3.7628044827564759E-2,1,0,1,0,0.53255705641872064,1.0896724916721472,-2.7533066884795572,-118.63860702528544,61.361392974714562,null,43403.5,1883863812.25,null,12.000599544708258,-8.4961384592222444,null,33.687567534587323,-110.14246856606322,null,0,0]
[43652,43.652000000000001,19.195272162496746,1.5186765714784816,1.2950035104945479,0.68850200484834578,1,0,175544.15804978789,1.5707906302225292,9.1061037307608981,1.4607579439264762,1.0007164841975666,3.7843273315543387E-2,1,0,1,0,0.53102354422436204,1.1064744239053173,-2.7584328885842515,-119.43448206961803,60.565517930381972,null,43652,1905497104,null,11.999927567996556,-8.4726683868729271,null,33.683113311194333,-110.96181368274513,null,0,0]
[43906,43.905999999999999,19.306662359425044,1.5189775477335157,1.2980508453141923,0.69135021989459799,1,0,176565.60531779862,1.570790663177692,9.1584526880651413,1.4613894431978547,1.0007248435100435,3.8063261786777415E-2,1,0,1,0,0.52958982695520618,1.1238307078288019,-2.7654702298109388,-120.25940191137771,59.740598088622292,null,43906,1927736836,null,11.999250742070746,-8.4490924429653962,null,33.676752795893449,-111.8103094684123,null,0,0]
[44160,44.16,19.418054285215025,1.5192750709066918,1.3011086609738227,0.69418507031676668,1,0,177587.05258580949,1.5707906957537512,9.2108052561647593,1.4620137640582467,1.000733251251716,3.8283246572155427E-2,1,0,1,0,0.52829499011428993,1.1413647560267397,-2.7744072411151377,-121.09548584511053,58.904514154889469,null,44160,1950105600,null,11.998583811405858,-8.4259275588064497,null,33.668482715254143,-112.66955828630414,null,0,0]
[44414,44.414000000000001,19.529447910283483,1.5195692000327727,1.3041768837522834,0.69700660471634479,1,0,178608.49985382057,1.5707907279572106,9.2631613738384058,1.4626310277356205,1.0007417074213634,3.8503227650479026E-2,1,0,1,0,0.52714268528714558,1.1590692448655786,-2.7853248539225515,-121.94230790861241,58.057692091387594,null,44414,1972603396,null,11.997926543031054,-8.4031667877031921,null,33.658222370821534,-113.53914112090921,null,0,0]
[44668,44.667999999999999,19.640843205717893,1.5198599928096113,1.3072554403708012,0.69981487208739934,1,0,179629.94712183185,1.5707907597944268,9.3155209812369577,1.463241352754197,1.0007502120177585,3.872320500055193E-2,1,0,1,0,0.52613649735433565,1.1769362886941008,-2.7983016359517792,-122.79940999425148,57.200590005748523,null,44668,1995230224,null,11.997278710504597,-8.3808033378677269,null,33.64589342131876,-114.41860665638373,null,0,0]
[44928.25,44.928249999999998,19.754981230097858,1.5201545393873288,1.3104203910964982,0.70267853143306125,1,0,180676.52842694987,1.5707907920416626,9.3691725232050995,1.4638596199286211,1.0007589761083187,3.8948591289970629E-2,1,0,1,0,0.52526077249312753,1.1954027503083069,-2.8138127928700234,-123.68775242067282,56.312247579327178,null,44928.25,2018547648.0625,null,11.996624494038731,-8.3582947689103353,null,33.631036480866385,-115.32945765176252,null,0,0]
[45188.5,45.188499999999998,19.869120948683271,1.520445701898381,1.3135960361489687,0.705528368145941,1,0,181723.10973206811,1.5707908239174613,9.4228276057954172,1.4644708463107643,1.0007677910355215,3.9173973620359376E-2,1,0,1,0,0.52454580282360153,1.2140213385892236,-2.8316434347261725,-124.58581230840653,55.414187691593469,null,45188.5,2042000532.25,null,11.995979722284375,-8.3361893595180572,null,33.613850610764587,-116.2496229488885,null,0,0]
[45448.75,45.448749999999997,19.983262332443413,1.52073353828081,1.3167822981546371,0.70836443610976407,1,0,182769.69103718651,1.5707908554282037,9.4764861688677762,1.4650751510409095,1.0007766567980239,3.9399351968925515E-2,1,0,1,0,0.52399515658164841,1.2327818128743058,-2.8518678308529011,-125.49299631582815,54.507003684171849,null,45448.75,2065588876.5625,null,11.9953441715969,-8.3144802825151629,null,33.594261765325342,-117.17851603331302,null,0,0]
[45709,45.709000000000003,20.097405353006668,1.5210181051586571,1.3199791002295731,0.71118678957482662,1,0,183816.27234230508,1.5707908865801252,9.5301481536326431,1.4656726505964222,1.0007855733944744,3.9624726312878812E-2,1,0,1,0,0.5236122813422659,1.251673381266631,-2.8745559530512592,-126.40867957418597,53.591320425814033,null,45709,2089312681,null,11.994717624610718,-8.2931608632916625,null,33.572200190113158,-118.11551871089431,null,0,0]
[45975.25,45.975250000000003,20.214181577876886,1.5213059069246744,1.3232604315009475,0.71406007622736223,1,0,184886.98232304616,1.5707909180852762,9.5850507833138234,1.466277001784613,1.0007947481648596,3.9855292439196693E-2,1,0,1,0,0.52339765287219742,1.2711243515976915,-2.9003847561069254,-127.35358620929911,52.64641379070089,null,45975.25,2113723612.5625,null,11.994085729893927,-8.2717463618890132,null,33.547003281774288,-119.08183984741007,null,0,0]
[46241.5,46.241500000000002,20.330959457850778,1.5215904025365576,1.3265526332164104,0.71691912469913521,1,0,185957.69230378745,1.5707909492276251,9.6399568739647616,1.4668744688093771,1.0008039761372558,4.0085854325873957E-2,1,0,1,0,0.52336548428900209,1.290688044656626,-2.9289248493341855,-128.30597190977977,51.694028090220229,null,46241.5,2138276322.25,null,11.993462817794905,-8.2507260302961125,null,33.519086100646049,-120.05524587948368,null,0,0]
[46507.75,46.507750000000001,20.447738964571254,1.5218716485933916,1.329855624643077,0.71976399416717229,1,0,187028.40228452889,1.5707909800134037,9.6948663667826942,1.467465168211451,1.0008132573101911,4.0316411948515429E-2,1,0,1,0,0.52351900090342407,1.3103513274564338,-2.9602346053584911,-129.26507738486137,50.734922615138629,null,46507.75,2162970810.0625,null,11.992848674625973,-8.2300931901799022,null,33.488390487790674,-121.03498419468151,null,0,0]
[46774,46.774000000000001,20.564520070324953,1.5221497004106925,1.3331693255848573,0.72259474414105263,1,0,188099.11226527049,1.5707910104487004,9.7497792042859306,1.4680492139251782,1.0008225916821856,4.0546965282728671E-2,1,0,1,0,0.52386124747909202,1.3301006248945337,-2.9943660283265032,-130.23011806915082,49.769881930849181,null,46774,2187807076,null,11.992243092700601,-8.2098413125346301,null,33.454864646748035,-122.02027675661616,null,0,0]
[47046.25,47.046250000000001,20.683934488242826,1.5224307714818421,1.3365686927356357,0.72547474763503694,1,0,189193.95092163468,1.5707910412136445,9.8059329142375127,1.4686396569860471,1.0008321914155198,4.0782709725148976E-2,1,0,1,0,0.52440933593943184,1.3503693709276221,-3.0322315229555401,-131.22220284380003,48.777797156199966,null,47046.25,2213349639.0625,null,11.991632506373431,-8.1895203413766406,null,33.417609738446167,-123.0326825024234,null,0,0]
[47318.5,47.3185,20.803350521451641,1.5227086157490985,1.3399790896471604,0.72834011493189288,1,0,190288.78957799898,1.5707910716245725,9.8620900038322308,1.4692233760016273,1.0008418467694764,4.1018449632107545E-2,1,0,1,0,0.52516057287457563,1.3706981632371362,-3.0731354725084579,-132.21876670601804,47.781233293981956,null,47318.5,2239040442.25,null,11.991030450646761,-8.1695843494889431,null,33.377307844619921,-124.04918235652909,null,0,0]
[47590.75,47.59075,20.922768142293727,1.5229832884205681,1.3434004323179829,0.73119091062680897,1,0,191383.62823436348,1.57079110168756,9.9182504156635076,1.469800484792023,1.0008515577424464,4.1254184977534331E-2,1,0,1,0,0.52611756264779952,1.3910714208371027,-3.1171107881676607,-133.21890987066953,46.781090129330465,null,47590.75,2264879485.5625,null,11.990436721659435,-8.1500268143143355,null,33.333926257948043,-125.0688830563552,null,0,0]
[47863,47.863,21.042187323738904,1.5232548434530233,1.3468326373319655,0.73402719960706808,1,0,192478.46689072816,1.5707911314085443,9.9744140936143157,1.4703710946315975,1.0008613243328102,4.1489915735362322E-2,1,0,1,0,0.52728267187690947,1.4114733405298714,-3.1641822225642664,-134.22171987824848,45.778280121751521,null,47863,2290866769,null,11.989851121274189,-8.1308413591480839,null,33.287440423936687,-126.0908785191004,null,0,0]
[48141.75,48.141750000000002,21.16445924119753,1.5235297067864422,1.350357954582307,0.73691624299219394,1,0,193599.44494568388,1.5707911614908314,10.031922012553185,1.4709487079072938,1.0008713817249928,4.173126981167144E-2,1,0,1,0,0.52869344460449774,1.4323753962244568,-3.2156024864199928,-135.25027346066153,44.749726539338468,null,48141.75,2317628093.0625,null,11.989259760526281,-8.111576849766827,null,33.236611520828866,-127.13869661089475,null,0,0]
[48420.5,48.420499999999997,21.286732739258724,1.5238014124455217,1.353894483942494,0.73979021722843274,1,0,194720.4230006398,1.5707911912267596,10.089433240357922,1.4715197364133803,1.0008814974185511,4.1972619023412087E-2,1,0,1,0,0.53032662162836652,1.4532735789500875,-3.2702941740096931,-136.27966459646328,43.720335403536723,null,48420.5,2344544820.25,null,11.988676518342308,-8.0926893213295568,null,33.182503075423135,-128.18697527513368,null,0,0]
[48699.25,48.699249999999999,21.409007790840551,1.5240700144938633,1.3574421377801626,0.74264919280281605,1,0,195841.40105559587,1.5707912206222763,10.146947720766207,1.4720842917447596,1.000891671411718,4.2213963342615284E-2,1,0,1,0,0.53218392817464344,1.4741506986037201,-3.3282565186011013,-137.3089010291267,42.691098970873298,null,48699.25,2371616950.5625,null,11.988101199475887,-8.0741723786576038,null,33.12511604969815,-129.23472865046909,null,0,0]
[48978,48.978000000000002,21.531284369475912,1.5243355657687707,1.3610008291024327,0.74549324044936605,1,0,196962.37911055214,1.5707912496831937,10.204465398780998,1.4726424829970262,1.0009019037027151,4.2455302741315447E-2,1,0,1,0,0.53426680654574299,1.4949896594202365,-3.3894795285457406,-138.33699596606903,41.663004033930974,null,48978,2398844484,null,11.987533614168344,-8.0560197697645322,null,33.064460625061052,-130.28097619630458,null,0,0]
[49263.25,49.263249999999999,21.656413794423141,1.5246042048337189,1.3646538398216508,0.74838822660366677,1,0,198109.49656409945,1.570791279081297,10.263327550426181,1.4732072132281746,1.0009124349451517,4.2702264662066239E-2,1,0,1,0,0.53663298404236359,1.516257400251348,-3.4554857880835437,-139.38686405425156,40.613135945748439,null,49263.25,2426867800.5625,null,11.986960607440801,-8.0378146710821845,null,32.999027372250794,-131.34904938316939,null,0,0]
[49548.5,49.548499999999997,21.78154476429091,1.5248697573535772,1.3683182265062916,0.75126773110869505,1,0,199256.61401764696,1.5707913081409115,10.322192937923033,1.4737655025501344,1.0009230272321414,4.2949221370920256E-2,1,0,1,0,0.53923752159306038,1.5374496273774814,-3.5248564127838495,-140.43348443189501,39.56651556810499,null,49548.5,2455053852.25,null,11.986395313904117,-8.0199782912993207,null,32.93022204108717,-132.4135061405957,null,0,0]
[49833.75,49.833750000000002,21.906677252605459,1.525132276182259,1.3719938980059465,0.754131830451508,1,0,200403.73147119459,1.5707913368678494,10.381061506225253,1.4743174601865505,1.0009336805617461,4.3196172837920828E-2,1,0,1,0,0.54208104500863064,1.5585488770589702,-3.5975518317995023,-141.47584888690434,38.524151113095655,null,49833.75,2483402639.0625,null,11.98583754688544,-8.0025043709787003,null,32.858084389090195,-133.47334451592562,null,0,0]
[50119,50.119,22.031811233494146,1.5253918129745963,1.3756807638651709,0.7569806013139333,1,0,201550.84892474243,1.5707913652677914,10.439933201525184,1.4748631929130134,1.0009443949320169,4.3443119033115124E-2,1,0,1,0,0.54516387661262988,1.5795381479301935,-3.6735233905952325,-142.51297575965964,37.487024240340361,null,50119,2511914161,null,11.985287124961189,-7.9853867909389038,null,32.782663252218718,-134.52758896872072,null,0,0]
[50410.75,50.41075,22.159798163648396,1.525654231719505,1.3794631287835706,0.75987851091489178,1,0,202724.10577688136,1.5707913939824116,10.50014958771904,1.4754150307673761,1.0009554165918266,4.3695686913817616E-2,1,0,1,0,0.54856453143507944,1.600874782701506,-3.7545553225445198,-143.56732711807655,36.432672881923452,null,50410.75,2541243715.5625,null,11.984731574837348,-7.968241529720145,null,32.70218687039327,-135.59908558835639,null,0,0]
[50702.5,50.702500000000001,22.287786602279958,1.5259136365834158,1.3832570148578407,0.76276054830178552,1,0,203897.36262902041,1.5707914223665749,10.560369135004914,1.4759605751756575,1.0009665021017087,4.3948249216350294E-2,1,0,1,0,0.55221526487971284,1.6220622067200514,-3.8388843507004129,-144.61422630766941,35.385773692330588,null,50702.5,2570743506.25,null,11.984183340531365,-7.9514565178614687,null,32.618406076543366,-136.66276978980795,null,0,0]
[50994.25,50.994250000000001,22.415776523549752,1.5261700791572181,1.3870623275501575,0.76562679603405337,1,0,205070.61948115969,1.5707914504259535,10.620591789611916,1.4764999328687844,1.0009776514595419,4.4200805908678302E-2,1,0,1,0,0.55611548644945397,1.6430842175878018,-3.9264321225210108,-145.65273710830283,34.34726289169717,null,50994.25,2600413533.0625,null,11.9836422438512,-7.9350256386207505,null,32.531399401402929,-137.71771146968209,null,0,0]
[51286,51.286000000000001,{"$f":"SQRT(1+(A461/pole1)^2)","v":22.543767902205193},{"$f":"ATAN(A461/pole1)","v":1.5264236098617578},{"$f":"SQRT(1+(A461/Zero1)^2)","v":1.3908789730741005},{"$f":"ATAN(A461/Zero1)","v":0.76847733680675789},{"$f":"IF(VIN_nom>Vout, 1, SQRT(1+(A461/z_RHP)^2))","v":1},{"$f":"IF(VIN_nom>Vout, 0, -ATAN(A461/z_RHP))","v":0},{"$f":"SQRT(1+(A461/Pole2)^2)","v":206243.87633329909},{"$f":"ATAN(A461/Pole2)","v":1.5707914781660899},10.680817498979156,1.4770332081849835,{"$f":"SQRT(1+(A461/pole4)^2)","v":1.0009888646631926},{"$f":"ATAN(A461/pole4)","v":4.4453356958771027E-2},{"$f":"IF(VOUT_setting=1,1,SQRT(1+(A461*zterm1)^2))","v":1},{"$f":"IF(VOUT_setting=1,0,ATAN(((A461*zterm1))))","v":0},1,{"$f":"IF(VOUT_setting=1,0,ATAN(A461*$Q$4/(1+Afbr-$Q$5*(A461)^2)))","v":0},{"$f":"SQRT((1-(Z461/pterm2))^2+(A461/pterm1)^2)","v":0.56026431309765767},{"$f":"IF((ATAN((A461/pterm1)/(1-A461^2/pterm2))>0),ATAN((A461/pterm1)/(1-A461^2/pterm2)),PI()+ATAN((A461/pterm1)/(1-A461^2/pterm2)))","v":1.6639254204107774},{"$f":"20*LOG10(((E461*K461*G461*O461)/(C461*I461*S461*M461*Q461))*Adc)","v":-4.0171126988896866},{"$f":"((F461+L461+H461+P461)-(D461+J461+T461+N461+R461))*radconv","v":-146.68196962869061},{"$f":"IF(V461>0,V461,V461+180)","v":33.318030371309391},null,{"$f":"IF(U461<0,A461,1000000000)","v":51286},{"$f":"A461^2","v":2630253796},null,{"$f":"20*LOG10((K461/(I461*M461))*AEA)","v":11.983108111615442},{"$f":"(L461-(J461+N461))*radconv","v":-7.9189429123403174},null,{"$f":"20*LOG10((E461*G461/(C461*S461))*Acs*Am)","v":32.441252957270017},{"$f":"(F461+H461-(D461+T461))*radconv","v":-138.76302671635034},null,{"$f":"SUM((U462<0)*(U461>0))*A461","v":0},0]
[51584.75,{"$f":"A462/1000","v":51.58475},22.674831681020816,1.5266802575336071,1.3947988387066379,0.77138008075088094,1,0,207445.28330699814,1.5707915062466342,10.74249132442487,1.4775730819663528,1.0010004130666084,4.4711961622406725E-2,1,0,1,0,0.56476909196978586,1.6850641265519566,-4.113118459695146,-147.72540420309642,32.274595796903583,null,51584.75,2660986432.5625,null,11.982568205153763,-7.9028289878650755,null,32.345787102926231,-139.82257521523132,null,0,0]
[51883.5,51.883499999999998,22.805896936216211,1.5269339553189449,1.3987303908770887,0.77426653083372654,1,0,208646.69028069731,1.5707915340037977,10.804168245170196,1.4781067920302911,1.0010120284117534,4.4970560301845063E-2,1,0,{"$f":"IF(VOUT_setting=1,1,SQRT((1+Afbr-$Q$5*(A463)^2)^2+(A463*$Q$4)^2))","v":1},0,0.56953179636635998,1.7059833892114964,-4.2122055280107498,-148.75738293918278,31.242617060817224,null,51883.5,2691897572.25,null,11.98203524918606,-7.8870678569875396,null,32.247232990578325,-140.87031508219519,null,0,0]
[52182.25,52.182250000000003,22.936963642482624,1.5271847537536742,1.4026735313169021,0.77713677616954813,1,0,209848.09725439668,1.5707915614431347,10.865848208506341,1.4786344430351139,1.0010237106962965,4.5229152962708269E-2,1,0,1,0,0.57455062182558791,1.7266696234177175,-4.3142617402233956,-149.77711926689892,30.222880733101078,null,52182.25,2722987215.0625,null,11.981509073021179,-7.8716535215764587,null,32.14570295453057,-141.90546574532243,null,0,0]
[52481,52.481000000000002,23.068031775086197,1.5274327022266352,1.406628162571385,0.77999090594285003,1,0,211049.50422809619,1.5707915885700727,10.927531162912008,1.4791561372897364,1.001035459917895,4.5487739570623409E-2,1,0,1,0,0.57982351173651814,1.7471103067888516,-4.4191699272686291,-150.78388756296815,29.216112437031853,null,52481,2754255361,null,11.980989510772943,-7.8565801181043513,null,32.041314329733567,-142.92730744486383,null,0,0]
[52786.5,52.786499999999997,23.202062729579282,1.5276833558968723,1.4106839278200782,0.78289294945674937,1,0,212278.05596187108,1.5707916159923812,10.990610831495941,1.4796835628327136,1.0010475438233402,4.5752162425700037E-2,1,0,1,0,0.58547589167234493,1.7677469780703634,-4.5292713641623807,-151.79930091103748,28.200699088962523,null,52786.5,2786414582.25,null,11.980464881242449,-7.8415127452523654,null,31.931737522370305,-143.95778816578513,null,0,0]
[53092,53.091999999999999,23.336095125049532,1.5279311302908831,1.41475150547055,0.78577832971912254,1,0,213506.60769564612,1.5707916430991047,11.053693522527832,1.4802049685546284,1.0010596977197828,4.6016578878532187E-2,1,0,1,0,0.59138887512026217,1.7881038543687575,-4.6420949596567791,-152.79981747647483,27.200182523525172,null,53092,2818760464,null,11.979946831715614,-7.8267898978378199,null,31.819431976402747,-144.97302757863699,null,0,0]
[53397.5,53.397500000000001,23.470128936809697,1.528176074707114,1.4188307939295874,0.78864714220509335,1,0,214735.15942942133,1.5707916698956601,11.116779184554604,1.4807204566536436,1.0010719216046735,4.6280988892379804E-2,1,0,1,0,0.59755957578507224,1.8081710587616366,-4.7575047478466379,-153.78486285026472,26.215137149735284,null,53397.5,2851293006.25,null,11.979435199366815,-7.812405718542581,null,31.704533820561686,-145.97245713172211,null,0,0]
[53703,53.703000000000003,23.604164140733019,1.5284182373256308,1.42292169247816,0.79149948238737211,1,0,215963.71116319668,1.5707916963873405,11.179867767282147,1.4812301270338279,1.0010842154754485,4.6545392430508231E-2,1,0,1,0,0.60398492063774656,1.8279398853615005,-4.8753629550161834,-154.75392978624402,25.246070213755985,null,53703,2884012209,null,11.978929825952857,-7.7983544814836909,null,31.587180986806096,-146.95557530476034,null,0,0]
[54015.75,54.015749999999997,23.741381630328945,1.5286633144039441,1.4271215969470668,0.79440254947566113,1,0,217221.41838001597,1.5707917231972981,11.244456516399637,1.4817459682137604,1.001096873593508,4.6816063937943943E-2,1,0,1,0,0.61082314864974097,1.8478608908409542,-4.9984095248617173,-155.72898206402701,24.271017935972992,null,54015.75,2917701248.0625,null,11.97841878215765,-7.7843088300664034,null,31.464645460755772,-147.94467323396069,null,0,0]
[54328.5,54.328499999999998,23.878600529509459,1.528905574815109,1.4313334582667416,0.79728855555816369,1,0,218479.12559683539,1.5707917496985846,{"$f":"SQRT(1+(A471/Zero2)^2)","v":11.309048223401183},{"$f":"ATAN(A471/Zero2)","v":1.482255917067177},1.001109605053135,4.7086728580761239E-2,1,0,1,0,0.61792122898259916,1.8674543778405071,-5.1237276255962891,-156.68642225010674,23.313577749893255,null,54328.5,2951585912.25,null,11.977913976326297,-7.7706003730911428,null,31.339832165852552,-148.91582187701556,null,0,0]
[54641.25,54.641249999999999,24.015820814112793,1.5291450668115985,1.4355571711945725,0.80015760293914451,1,0,219736.832813655,1.5707917758965007,11.373642837892691,1.4827600737198821,1.0011224098515314,4.7357386319565334E-2,1,0,1,0,0.62527540076731958,1.8867146369185541,-5.2511687903700146,-157.62591438189625,22.374085618103749,null,54641.25,2985666201.5625,null,11.977415252620256,-7.7572233718184638,null,31.212889724784869,-149.86869101007778,null,0,0]
[54954,54.954000000000001,24.153042460525999,1.5293818375506179,1.4397926314284792,0.80300979384087856,1,0,220994.54003047472,1.5707918017962252,11.438240310616187,1.4832585360477695,1.001135287985883,4.7628037114967527E-2,1,0,1,0,0.63288179302370917,1.9056370952925255,-5.3805858899653094,-158.54718769342159,21.452812306578409,null,54954,3019942116,null,11.976922459590437,-7.7441722164126512,null,31.083965418219393,-150.80301547700896,null,0,0]
[55274,55.274000000000001,24.293446489797194,1.529621328437438,1.4441383269245018,0.80591076204839329,1,0,222281.40273033839,1.5707918279929829,11.50433815490349,1.4837627593927356,1.0011485405568836,4.7904954761777349E-2,1,0,1,0,0.64092144075195079,1.9246449317511127,-5.5148968840720567,-159.47074292728328,20.529257072716717,null,55274,3055215076,null,11.976424227875944,-7.7311500601977894,null,30.950152655827139,-151.73959286708552,null,0,{"$f":"IF(AH474>0,W474,0)","v":0}]
[55594,55.594000000000001,24.433851896427022,1.529858066941933,1.4484961027520979,0.80879429937449432,1,0,223568.26543020221,1.5707918538881624,11.570438890649307,1.4842612217102757,1.0011618698973055,4.8181865056129231E-2,1,0,1,0,0.64921667813132866,1.9432928439842958,-5.6509719332503048,-160.37484668212318,19.625153317876823,null,55594,3090692836,null,11.975931897652025,-7.7184575479965103,null,30.814569936872807,-152.65638913412667,null,0,0]
[55914,55.914000000000001,24.574258656806798,1.5300921002151284,1.4528658502087848,0.81166051493047164,1,0,224855.12813006618,1.5707918794869418,11.636542468579329,1.4847540209303689,1.0011752760040822,4.8458767955851093E-2,1,0,1,0,0.65776313745702231,1.9615792541046801,-5.7886618339494502,-161.25939938849706,18.740600611502941,null,55914,3126375396,null,11.975445320018592,-7.7060890667147115,null,30.677366613807099,-153.55331032178236,null,0,0]
[56234,56.234000000000002,24.714666747864115,1.5303234743377596,1.4572474615990711,0.81450951765911861,1,0,226141.99082993032,1.5707919047943812,11.702648840530475,1.4852412527813761,1.0011887588741302,4.8735663418777671E-2,1,0,1,0,0.66655641786168263,1.9795035653371909,-5.9278213094830337,-162.1243577650242,17.8756422349758,null,56234,3162262756,null,11.974964350270785,-7.6940391293953736,null,30.538688108021319,-154.43031863562885,null,0,0]
[56561.5,56.561500000000002,24.858367007850642,1.5305575649192948,1.4617439399577961,0.81740758468361463,1,0,227459.01437432264,1.5707919303984612,11.770307424464503,1.4857342371511615,1.0012026372287721,4.9019040874835738E-2,1,0,1,0,0.67580674905796734,1.9974733796229669,-6.0716169432410876,-162.98930955180987,17.010690448190132,null,56561.5,3199203282.25,null,11.974477767625187,-7.6820310048740303,null,30.395379056908865,-155.30727854693586,null,0,0]
[56889,56.889000000000003,25.002068614377304,1.5307889646006365,1.4662526198428694,0.82028785284849071,1,0,228776.0379187151,1.5707919557077448,11.837968836279538,1.4862215862089219,1.001216595980539,4.9302410452070546E-2,1,0,1,0,0.68530625024728664,2.0150654918880564,-6.2166582686248635,-163.83380864046686,16.166191359533144,null,56889,3236358321,null,11.973996764986152,-7.6703452916344235,null,30.25081873416412,-156.16346334883244,null,0,0]
[57216.5,57.216500000000003,25.145771544358713,1.5310177194906178,1.47077338904236,0.82315043827162282,1,0,230093.0614631077,1.5707919807272941,11.905633027761818,1.4867033958039557,1.0012306351260682,4.958577210530437E-2,1,0,1,0,0.69505020917278493,2.0322819770300873,-6.3628047551498792,-164.65796440859083,15.342035591409172,null,57216.5,3273727872.25,null,11.973521199982603,-7.6589764956178152,null,30.105147812642659,-156.99898791297298,null,0,0]
[57544,57.543999999999997,25.289475775233978,1.5312438746511634,1.4753061364206932,0.82599545680874831,1,0,231410.08500750049,1.5707920054620559,11.97329995178551,1.4871797596292204,1.0012447546619785,4.9869125789367121E-2,1,0,1,0,0.70503394782672202,2.0491256661637021,-6.5099215557646275,-165.46192964039994,14.538070359600056,null,57544,3311311936,null,11.973050934256868,-7.6479192463085406,null,29.958501277753641,-157.81401039409135,null,0,0]
[57879,57.878999999999998,25.436472265630712,1.5314725651336936,1.4799549652187145,0.82888757399426793,1,0,232757.26939642144,1.5707920304736578,12.042519279126717,1.4876614937619499,1.0012592807154559,5.0158960197002202E-2,1,0,1,0,0.7154895742799765,2.0659730521437232,-6.6612768940513458,-166.26361703339694,13.73638296660306,null,57879,3349978641,null,11.972575241617358,-7.6369256350175849,null,29.807621632106436,-158.62669139837934,null,0,0]
[58214,58.213999999999999,25.583470071050751,1.531698627602966,1.4846160952811331,0.8317615547966043,1,0,234104.4537853426,1.5707920551973946,12.111741369204664,1.4881377215055327,1.0012738908762573,5.0448786170703551E-2,1,0,1,0,0.72618635294408196,2.0824384586201066,-6.8133809153773708,-167.04462217023138,12.955377829768622,null,58214,3388869796,null,11.972104813181909,-7.6262470168631724,null,29.655988039215863,-159.41837515336823,null,0,0]
[58549,58.548999999999999,25.730469168955949,1.5319221070774784,1.48928941110765,0.83461752224891372,1,0,235451.63817426385,1.5707920796382076,12.180966174919046,1.4886085365210326,1.001288585140701,5.0738603662151195E-2,1,0,1,0,0.73711946958395902,2.0985268803264794,-6.9661085520688113,-167.80522138928055,12.194778610719453,null,58549,3427985401,null,11.971639513041524,-7.6158780229762373,null,29.503725702664806,-160.18934336630434,null,0,0]
[58884,58.884,25.877469537320117,1.53214304755384,1.4939747983430787,0.83745559902237143,1,0,236798.82256318527,1.5707921038009256,12.250193650232365,1.4890740303620733,1.0013033635050839,5.1028412623033668E-2,1,0,1,0,0.74828419663488421,2.1142438206886434,-7.1193412928871025,-168.54572025776787,11.454279742232131,null,58884,3467325456,null,11.971179209118482,-7.6058134052291777,null,29.350953265769554,-160.93990685253866,null,0,0]
[59227,59.226999999999997,26.02798165609186,1.5323666784542205,1.4987844644492943,0.84034304183680397,1,0,238178.17851960345,1.5707921282574562,12.321077037979327,1.4895452206353423,1.0013185819181973,5.1325133505906999E-2,1,0,1,0,0.75995067956727669,2.1299574047466621,-7.2766397286718156,-169.28342216759955,10.716577832400446,null,59227,3507837529,null,11.970712955427397,-7.5958184467498544,null,29.194121083675931,-161.68760372084969,null,0,0]
[59570,59.57,26.178495061575315,1.5325877378312964,1.5036065464073471,0.84321198832428557,1,0,239557.53447602177,1.5707921524323487,12.391963129959782,1.490011020285346,1.001333888488001,5.162184534344564E-2,1,0,1,0,0.77185024925880585,2.1452945659947984,-7.4342370206854902,-170.00077738869373,9.9992226113062657,null,59570,3548584900,null,11.970251670956134,-7.5861318138367446,null,29.036985076133519,-162.41464557485693,null,0,0]
[59913,59.912999999999997,26.329009731703497,1.5328062697650457,1.5084409251467759,0.84606256886596298,1,0,240936.89043244024,1.5707921763304402,12.462851880030387,1.4904715210938695,1.0013492832104525,5.1918548083821833E-2,1,0,1,0,0.78397816226969275,2.1602624281983704,-7.5920268003189069,-170.69818387664361,9.3018161233563887,null,59913,3589567569,null,11.969795225596783,-7.5767482450885701,null,28.879651741859448,-163.12143563155507,null,0,0]
[60256,60.256,26.47952564491095,1.5330223173341806,1.5132874828169462,0.84889491337298084,1,0,242316.24638885885,1.5707921999564576,12.533743243090008,1.490926812775319,1.0013647660814859,5.2215241675217364E-2,1,0,1,0,0.79632979832093831,2.1748683939538385,-7.7499094176132708,-171.37605565089763,8.6239443491023735,null,60256,3630785536,null,11.969343492912701,-7.5676625975503384,null,28.72222085724917,-163.80839305334726,null,0,0]
[60607,60.606999999999999,26.633553398272639,1.5332408758801261,1.5182595663767999,0.85177457442965276,1,0,243727.77391277422,1.5707922238566718,12.60629070814468,1.4913874222082713,1.0013807013212523,5.2518845708156937E-2,1,0,1,0,0.80919644287026726,2.1894483229073378,-7.9114734078103011,-172.04995972618738,7.9500402738126184,null,60607,3673208449,null,11.968885974831734,-7.55866822013998,null,28.561114385133102,-164.49129150604739,null,0,0]
[60958,60.957999999999998,26.787582409231025,1.5334569210062903,1.5232441577725411,0.85463541255012276,1,0,245139.30143668974,1.5707922474816485,12.678840817155548,1.4918427603930926,1.0013967288607517,5.282244005060252E-2,1,0,1,0,0.8222879883642521,2.2036656143926039,-8.0729441176459531,-172.70432212076483,7.2956778792351713,null,60958,3715877764,null,11.968433135175715,-7.5499752920062733,null,28.400096514953471,-165.15434682875858,null,0,0]
[61309,61.308999999999997,26.941612656216527,1.5336704958014047,1.5282411346155353,0.85747756531563479,1,0,246550.8289606054,1.5707922708361144,12.75139352499359,1.4922929171161705,1.0014128486955525,5.3126024647056444E-2,1,0,1,0,0.83559990360754721,2.2175287539460253,-8.2342351773764193,-173.33961845874043,6.6603815412595679,null,61309,3758793481,null,11.967984849604132,-7.541578665859193,null,28.239253740794585,-165.79803979288118,null,0,0]
[61660,61.66,27.095644118149877,1.5338816423753239,1.53325037581051,0.86030116972365378,1,0,247962.35648452118,1.5707922939246892,12.823948787549469,1.4927379801404304,1.0014290608211971,5.3429599442031822E-2,1,0,1,0,0.8491278019203562,2.2310463123954385,-8.3952665570030298,-173.95632934435719,6.0436706556428135,null,61660,3801955600,null,11.967540997286402,-7.5334733103390432,null,28.078666213485704,-166.42285603401811,null,0,0]
[62019,62.018999999999998,27.253187504002671,1.5340951324331347,1.5383863497019856,0.8631700846458259,1,0,249406.05557593374,1.5707923172691547,12.898160329088698,1.4931880073002561,1.0014457379193653,5.3740083123712645E-2,1,0,1,0,0.86318303076852876,2.244523456108853,-8.5596224645511132,-174.56837424736753,5.4316257526324705,null,62019,3846356361,null,11.9670914922586,-7.5254793955129804,null,27.914759810965425,-167.04289485185453,null,0,0]
[62378,62.378,27.410732117722858,1.5343061684099684,1.5435349012245976,0.86601988402448338,1,0,250849.75466734648,1.5707923403449144,12.972374452933041,1.493632885396176,1.0014625115537987,5.4050556434653847E-2,1,0,1,0,0.87745537955674091,2.2576573192760576,-8.72355641438185,-175.16199966538886,4.838000334611138,null,62378,3891014884,null,11.96664637992685,-7.5177798907221813,null,27.75127097346644,-167.64421977466668,null,0,0]
[62737,62.737000000000002,27.568277938259737,1.534514792360244,1.5486959049374909,0.86885071244650947,1,0,252293.45375875931,1.5707923631565814,13.04659111501501,1.4940727021232587,1.0014793817196466,5.4361019315522716E-2,1,0,1,0,0.89194062040724287,2.2704570933264594,-8.8870014339317862,-175.7377213261646,4.2622786738353966,null,62737,3935931169,null,11.966205541650424,-7.5103697682741135,null,27.588266792192925,-168.2273515578905,null,0,0]
[63096,63.095999999999997,27.725824945040902,1.5347210453833637,1.5538692367649785,0.87166271379644622,1,0,253737.15285017228,1.5707923857086632,13.120810272262677,1.4945075432002843,1.0014963484120307,5.4671471706998535E-2,1,0,1,0,0.90663467883592352,2.2829319070106235,-9.0498961846696186,-176.29605146495533,3.7039485350446739,null,63096,3981105216,null,11.965768862137285,-7.5032441137038948,null,27.425808720968234,-168.79280735125141,null,0,0]
[63463.25,63.463250000000002,27.886993667516386,1.5349296268031729,1.5591740827302523,0.8745200045919902,1,0,255214.02887056631,1.5707924085149947,13.196737560896807,1.4949473160263953,1.0015138048817644,5.4989047534510317E-2,1,0,1,0,0.9218783945839345,2.2953665736493227,-9.2159065678566741,-176.84974544966889,3.1502545503311126,null,63463.25,4027584100.5625,null,11.965326333909633,-7.4962440481135379,null,27.260240866008829,-169.35350140155532,null,0,0]
[63830.5,63.830500000000001,28.048163589306103,1.5351358111372397,1.5644915715806449,0.87735789535892117,1,0,256690.90489096049,1.570792431058893,13.272667372580841,1.4953820572617542,1.0015313623550512,5.5306612259441862E-2,1,0,1,0,0.93733248910969946,2.3074801829216334,-9.3812279110345163,-177.38630603690007,2.6136939630999336,null,63830.5,4074332730.25,null,11.96488792395553,-7.4895316202705393,null,27.095357932785092,-169.89677441662948,null,0,0]
[64197.75,64.197749999999999,28.209334689853737,1.5353396394543819,1.5698215748396478,0.8801765377600973,1,0,258167.78091135478,1.5707924533448616,13.348599664259764,1.4958118526058461,1.0015490208265792,5.5624165818327652E-2,1,0,1,0,0.95299307914280051,2.3192821393476288,-9.5458107622432067,-177.90626081578912,2.0937391842108752,null,64197.75,4121351105.0625,null,11.964453519009782,-7.4831019165778079,null,26.93120948652215,-170.4231588992113,null,0,0]
[64565,64.564999999999998,28.370506949069938,1.5355411518909663,1.5751639654693705,0.8829760826314591,1,0,259644.65693174922,1.5707924753773022,13.424534393851292,1.4962367858265526,1.0015667802910062,5.5941708147715603E-2,1,0,1,0,0.96885643483408912,2.3307816810950195,-9.7096104624441786,-178.41012794880916,1.589872051190838,null,64565,4168639225,null,11.964023009004469,-7.4769501341059357,null,26.767840296326494,-170.93317781470321,null,0,0]
[64941,64.941000000000003,28.535520435211197,1.5357451071652781,1.5806463448960892,0.88582269986730666,1,0,261156.72060409328,1.5707924976765124,13.502280806724372,1.4966668916258767,1.0015850675129683,5.6266804455218374E-2,1,0,1,0,0.98530407792888552,2.3422513553083593,-9.8764595115338008,-178.90986317407933,1.0901368259206663,null,64941,4217333481,null,11.963586165335645,-7.4709348110595188,null,26.601428090905692,-171.43892836301981,null,0,0]
[65317,65.316999999999993,28.700535094716532,1.5359467171529368,1.58614144406075,0.88864961598292147,1,0,262668.78427643748,1.57079251971899,13.580029688797506,1.4970920725882373,1.0016034605861897,5.6591888857182263E-2,1,0,1,0,1.0019568246794135,2.3534230327774028,-10.042406939489013,-179.39380033511458,0.60619966488542332,null,65317,4266310489,null,11.963153180727703,-7.4652009635394059,null,26.435913647558422,-171.92859937157516,null,0,0]
[65693,65.692999999999998,28.865550907462765,1.5361460220593401,1.5916491312203378,0.89145699008053425,1,0,264180.84794878174,1.5707925415091435,13.657780997901865,1.4975124126672319,1.0016219595048388,5.6916961285555304E-2,1,0,1,0,1.018811142139501,2.3643059967448874,-10.207418398830747,-179.86245969642462,0.13754030357537772,null,65693,4315570249,null,11.962723946784264,-7.4597437777122524,null,26.271331422160124,-172.40271591871235,null,0,0]
[66069,66.069000000000003,29.03056785378411,1.5363430611764781,1.5971692761493292,0.89424498030249044,1,0,265692.91162112623,1.5707925630512805,13.735534692822119,1.4979279939224222,1.0016405642630515,5.7242021672300636E-2,1,0,1,0,1.0358636452858787,2.3749092973261359,-10.371463487302599,-180.31634827648034,-0.31634827648034047,null,66069,4365112761,null,11.962298358171555,-7.4545585482601018,null,26.107711922300982,-172.86178972822023,null,0,0]
[66453.75,66.453749999999999,29.199426108508764,1.5365423802093736,1.6028306436260236,0.89707794881694281,1,0,267240.16294542025,1.5707925848423809,13.815100243202732,1.4983484037293906,1.0016597115343409,5.7574634093031291E-2,1,0,1,0,1.0535147575777297,2.3854790390655221,-10.538297864267053,-180.7660236980486,-0.76602369804859904,null,66453.75,4416100889.0625,null,11.961866532353554,-7.4495293771087336,null,25.941309371154535,-173.31649432093988,null,0,0]
[66838.5,66.838499999999996,29.36828550993075,1.5367394071929947,1.6085047843452001,0.89989095268899466,1,0,268787.41426971444,1.5707926063826045,13.894668207360304,1.4987639986467192,1.0016789696160244,5.7907233761075434E-2,1,0,1,0,1.0713666667003656,2.3957743511768563,-10.704067370562422,-181.20126315294476,-1.2012631529447617,null,66838.5,4467385082.25,null,11.96143830973134,-7.4447753337635802,null,25.775968087481381,-173.75648781918116,null,0,0]
[67223.25,67.223249999999993,29.53714603838359,1.5369341814220725,1.6141915636069124,0.90268415817030756,1,0,270334.66559400875,1.5707926276762585,13.974238544063402,1.4991748607786064,1.0016983385017113,5.823982060358468E-2,1,0,1,0,1.0894161913590885,2.4058041411268287,-10.868750414171053,-181.62256501916931,-1.6225650191693148,null,67223.25,4518965340.5625,null,11.961013586745056,-7.4402917100734225,null,25.611709766859029,-174.1822733090959,null,0,0]
[67608,67.608000000000004,29.706007674647825,1.5371267412985583,1.6198908483047878,0.9054577304163709,1,0,271881.91691830324,1.5707926487275528,14.053811213013152,1.4995810703762309,1.0017178181849742,5.8572394547727613E-2,1,0,1,0,1.107660288690143,2.4155770463464687,-11.032328542680398,-182.03041232063836,-2.0304123206383622,null,67608,4570841664,null,11.960592262761924,-7.4360739040527459,null,25.448552962332819,-174.5943384165856,null,0,0]
[68001.75,68.001750000000001,29.878820418094417,1.5373215520041246,1.6257362600147438,0.90827602522213002,1,0,273465.36125603155,1.5707926700246373,14.135247604564059,1.4999920467455206,1.001737868242121,5.8912734568889576E-2,1,0,1,0,1.1265295656997949,2.4253213189566796,-11.19857284679307,-182.43435750513439,-2.4343575051343862,null,68001.75,4624238003.0625,null,11.960164500407958,-7.4320279596532455,null,25.282736420574111,-175.0023295454811,null,0,0]
[68395.5,68.395499999999998,30.051634282436918,1.5375141221738342,1.6315944920153953,0.91107410397247124,1,0,275048.80559375999,1.5707926910765089,14.216686356228445,1.5003983147153259,1.0017580343272445,5.9253060926908581E-2,1,0,1,0,1.145596595571716,2.4348139906526924,-11.363629828847115,-182.82518591504422,-2.8251859150442158,null,68395.5,4677944420.25,null,11.959740093646696,-7.4282509897826765,null,25.118103845281329,-175.39693492526155,null,0,0]
[68789.25,68.789249999999996,30.224449248448554,1.5377044902255572,1.6374654067082917,0.91385214006376136,1,0,276632.24993148859,1.5707927118873786,14.298127427678368,1.5007999546064565,1.001778316433338,5.9593373543777556E-2,1,0,1,0,1.1648585297657736,2.4440634509172341,-11.527488327952584,-183.20336589235123,-3.2033658923512291,null,68789.25,4731960915.5625,null,11.959318943508986,-7.4247383881694233,null,24.954666496313571,-175.77862750418177,null,0,0]
[69183,69.183000000000007,30.397265297339644,1.5378926937041495,1.6433488681655071,0.91661030565468982,1,0,278215.69426921732,1.5707927324613611,14.379570779498364,1.5011970449260812,1.0017987145533551,5.9933672341508475E-2,1,0,1,0,1.1843126468562819,2.4530778038457353,-11.690139609351125,-183.56934955235425,-3.5693495523542538,null,69183,4786287489,null,11.958900953824445,-7.4214856524514419,null,24.792433204599572,-176.1478638999028,null,0,0]
[69586,69.585999999999999,30.57414225399711,1.538083115317171,1.6493833964991167,0.91941286842699421,1,0,279836.33698186418,1.5707927532775658,14.462929724861503,1.501598832653156,1.001819711993952,6.0281951068920585E-2,1,0,1,0,1.2044200765756607,2.4620686291752132,-11.855355020125751,-183.93175658740148,-3.9317565874014804,null,69586,4842211396,null,11.958476319866374,-7.418421005281977,null,24.627642427783016,-176.51333558211951,null,0,0]
[69989,69.989000000000004,30.751020306531419,1.5382713463492104,1.6554307851730476,0.92219497705599707,1,0,281456.97969451122,1.570792773854049,14.546290978264425,1.5019960153483805,1.0018408309482463,6.0630215155039829E-2,1,0,1,0,1.2247234393638569,2.4708294569819325,-12.019294194164571,-184.28229515639268,-4.2822951563926779,null,69989,4898460121,null,11.958054801324353,-7.4156193543830371,null,24.464124772286215,-176.86667580200958,null,0,0]
[70392,70.391999999999996,30.927899436140468,1.5384574243711366,1.6614908937625641,0.92495681205082081,1,0,283077.62240715837,1.570792794194928,14.629654500252792,1.5023886716073125,1.0018620714085533,6.0978464516314369E-2,1,0,1,0,1.2452201939754666,2.4793680848016257,-12.181954328941327,-184.6213993277126,-4.6213993277125951,null,70392,4955033664,null,11.957636303594725,-7.413076192009604,null,24.301883135239088,-177.20832313570301,null,0,0]
[70795,70.795000000000002,31.104779624449712,1.5386413860998227,1.6675635835909757,0.9276985525365915,1,0,284698.26511980558,1.5707928143042267,14.713020252265403,1.502776878249839,1.0018834333671449,6.132669906921373E-2,1,0,1,0,1.2659079143407701,2.4876920243361322,-12.343334439493594,-184.94948692477158,-4.9494869247715769,null,70795,5011932025,null,11.957220734750818,-7.4107871121509907,null,24.140918593530728,-177.53869981262062,null,0,0]
[71207.25,71.207250000000002,31.28572079453312,1.5388274179732289,1.6737885339210841,0.93048261744998817,1,0,286356.10620737105,1.5707928346395756,14.798301754274668,1.5031694696405933,1.0019054113489299,6.1682911189638784E-2,1,0,1,0,1.2872656532796523,2.4959924262045972,-12.507094948154604,-185.27412537871913,-5.274125378719134,null,71207.25,5070472452.5625,null,11.95679856478125,-7.4087038986266469,null,23.977580254839282,-177.86542148009252,null,0,0]
[71619.5,71.619500000000002,31.466663034896328,1.5390113103808301,1.6800263616158047,0.93324602954955627,1,0,288013.94729493663,1.5707928547408194,14.883585510978483,1.5035575619504329,1.0019275164539747,6.2039107637342758E-2,1,0,1,0,1.308818434666944,2.5040831920274007,-12.669519002636068,-185.58807017566474,-5.5880701756647397,null,71619.5,5129352780.25,null,11.956379273287101,-7.4068775520566845,null,23.815575491851973,-178.18119262360807,null,0,0]
[72031.75,72.031750000000002,31.647606327181663,1.5391931000068835,1.6862769237683992,0.93598897605774078,1,0,289671.78838250227,1.5707928746119775,14.968871483839111,1.5039412319627283,1.001949748673866,6.239528832298049E-2,1,0,1,0,1.3305640003080383,2.5119714883011888,-12.830610372672888,-185.89171889616588,-5.8917188961658837,null,72031.75,5188573008.0625,null,11.955962769985046,-7.4053036681892372,null,23.654900625117207,-178.48641522797669,null,0,0]
[72444,72.444000000000003,31.828550653448794,1.5393728227020145,1.6925400792935521,0.93871164266605234,1,0,291329.62947006809,1.570792894256978,15.054159635191127,1.5043205547260854,1.001972108000142,6.2751453157230713E-2,1,0,1,0,1.3525001951544817,2.5196642056042635,-12.990374137369242,-186.18545345116678,-6.1854534511667794,null,72444,5248133136,null,11.955548967146814,-7.4039779421632455,null,23.495550663259081,-178.78147550900354,null,0,0]
[72865.75,72.865750000000006,32.013665761205246,1.5395545845840626,1.6989604514499403,0.94147625687683634,1,0,293025.67429403641,1.5707929141246506,15.141415405651784,1.5047041965244554,1.0019951141056243,6.3115809053181107E-2,1,0,1,0,1.3751370182761804,2.5273387106904761,-13.15245221712374,-186.4760798027695,-6.4760798027695046,null,72865.75,5309417523.0625,null,11.955128334158447,-7.402874079683035,null,23.333893216492953,-179.07320572308643,null,0,0]
[73287.5,73.287499999999994,32.198781914448261,1.5397342565134009,1.7053937110865083,0.94422003400912269,1,0,294721.71911800478,1.5707929337636568,15.228673379103741,1.5050834419602459,1.0020182532250688,6.348014816971112E-2,1,0,1,0,1.397969103281911,2.534822265892207,-13.313155168130745,-186.75709058159697,-6.7570905815969695,null,73287.5,5371057656.25,null,11.954710349597368,-7.4020211357325296,null,23.173608250047025,-179.35506944586444,null,0,0]
[73709.25,73.709249999999997,32.383899095248879,1.5399118743189308,1.7118397129060612,0.94694316790566802,1,0,296417.76394197327,1.5707929531779221,15.315933517894335,1.5054583660661889,1.0020415253492607,6.3844470411259568E-2,1,0,1,0,1.4209944451312513,2.5421214153781051,-13.472491828896992,-187.02884738305744,-7.0288473830574389,null,73709.25,5433053535.5625,null,11.954294927281907,-7.4014148060025198,null,23.014687011596241,-179.62743257705489,null,0,0]
[74131,74.131,{"$f":"SQRT(1+(A525/pole1)^2)","v":32.569017286085682},{"$f":"ATAN(A525/pole1)","v":1.5400874730154916},{"$f":"SQRT(1+(A525/Zero1)^2)","v":1.7182983135060299},{"$f":"ATAN(A525/Zero1)","v":0.94964585072810126},{"$f":"IF(VIN_nom>Vout, 1, SQRT(1+(A525/z_RHP)^2))","v":1},{"$f":"IF(VIN_nom>Vout, 0, -ATAN(A525/z_RHP))","v":0},{"$f":"SQRT(1+(A525/Pole2)^2)","v":298113.80876594188},{"$f":"ATAN(A525/Pole2)","v":1.5707929723712819},15.403195785223197,1.505829042179637,{"$f":"SQRT(1+(A525/pole4)^2)","v":1.0020649304689335},{"$f":"ATAN(A525/pole4)","v":6.4208775682292094E-2},{"$f":"IF(VOUT_setting=1,1,SQRT(1+(A525*zterm1)^2))","v":1},{"$f":"IF(VOUT_setting=1,0,ATAN(((A525*zterm1))))","v":0},1,{"$f":"IF(VOUT_setting=1,0,ATAN(A525*$Q$4/(1+Afbr-$Q$5*(A525)^2)))","v":0},{"$f":"SQRT((1-(Z525/pterm2))^2+(A525/pterm1)^2)","v":1.444211130591615},{"$f":"IF((ATAN((A525/pterm1)/(1-A525^2/pterm2))>0),ATAN((A525/pterm1)/(1-A525^2/pterm2)),PI()+ATAN((A525/pterm1)/(1-A525^2/pterm2)))","v":2.5492424430392377},{"$f":"20*LOG10(((E525*K525*G525*O525)/(C525*I525*S525*M525*Q525))*Adc)","v":-13.630471935688874},{"$f":"((F525+L525+H525+P525)-(D525+J525+T525+N525+R525))*radconv","v":-187.29169703656575},{"$f":"IF(V525>0,V525,V525+180)","v":-7.2916970365657505},null,{"$f":"IF(U525<0,A525,1000000000)","v":74131},{"$f":"A525^2","v":5495405161},null,{"$f":"20*LOG10((K525/(I525*M525))*AEA)","v":11.95388198346998},{"$f":"(L525-(J525+N525))*radconv","v":-7.4010508833182564},null,{"$f":"20*LOG10((E525*G525/(C525*S525))*Acs*Am)","v":22.857119848616286},{"$f":"(F525+H525-(D525+T525))*radconv","v":-179.89064615324745},null,{"$f":"SUM((U526<0)*(U525>0))*A525","v":0},0]
[74562.75,{"$f":"A526/1000","v":74.562749999999994},32.75852579256383,1.5402651795228064,1.7249229548929155,0.95239163080166633,1,0,299850.06804928149,1.5707929917948198,15.492529271823157,1.50620418185923,1.0020890282943244,6.4581701218343404E-2,1,0,1,0,1.4681745973201967,2.556354106483071,-13.790803678029203,-187.55189981249347,-7.551899812493474,null,74562.75,5559603687.5625,null,11.953461730855963,-7.4009251351246865,null,22.69720835888997,-180.15097467736877,null,0,0]
[74994.5,74.994500000000002,32.94803532164282,1.5404408417816142,1.7315605014411413,0.95511638063008542,1,0,301586.32733262132,1.5707930109947115,15.581864913683559,1.5065750200073269,1.0021132654769853,6.4954608767047117E-2,1,0,{"$f":"IF(VOUT_setting=1,1,SQRT((1+Afbr-$Q$5*(A527)^2)^2+(A527*$Q$4)^2))","v":1},0,1.4923348061921033,2.5632916362666611,-13.949736853036999,-187.80345869827258,-7.8034586982725784,null,74994.5,5624175030.25,null,11.95304390555329,-7.401044803118479,null,22.538693009184847,-180.40241389515415,null,0,0]
[75426.25,75.426249999999996,33.137545855778285,1.54061449485358,1.7382108053114371,0.9578203009039914,1,0,303322.58661596116,1.5707930299747976,15.671202673945404,1.5069416300870411,1.0021376420068049,6.5327498225999037E-2,1,0,1,0,1.5166899738249962,2.5700609923647675,-14.107284166262994,-188.04670147068882,-8.0467014706888165,null,75426.25,5689119189.0625,null,11.952628425139549,-7.4014056725260051,null,22.381561176372596,-180.64529579816281,null,0,0]
[75858,75.858000000000004,33.327057377824794,1.5407861730033587,1.7448737206364024,0.96050359047574685,1,0,305058.84589930112,1.5707930487388315,15.760542516584577,1.5073040839003669,1.0021621578736146,6.5700369492825067E-2,1,0,1,0,1.5412383984132048,2.5766678925537168,-14.263458894054473,-188.28194218441121,-8.2819421844112071,null,75858,5754436164,null,11.952215209527621,-7.4020036237454763,null,22.225799664193048,-180.87993856066578,null,0,0]
[76299.75,76.299750000000003,33.520959285832738,1.5409598183458972,1.7517038623090355,0.96322788168234241,1,0,306835.31964201212,1.5707930677176785,15.851953727179355,1.5076707041230129,1.0021873857705343,6.6081858101034299E-2,1,0,1,0,1.5665537317291249,2.5832653955967704,-14.42184459021936,-188.51466300447461,-8.5146630044746132,null,76299.75,5821651850.0625,null,11.951794686130633,-7.4028566068952246,null,22.067834491425149,-181.11180639757939,null,0,0]
[76741.5,76.741500000000002,33.714862192962173,1.5411314663348579,1.7585469036669441,0.96593099072808697,1,0,308611.79338472325,1.570793086478028,15.943367044008873,1.5080331202668269,1.002212759511995,6.646332744791468E-2,1,0,1,0,1.5920680170972239,2.5897042075399339,-14.578822986687021,-188.73963046260874,-8.7396304626087442,null,76741.5,5889257822.25,null,11.951376371191953,-7.403949349907232,null,21.911274409896162,-181.33568111270148,null,0,0]
[77183.25,77.183250000000001,33.908766082073072,1.5413011512250385,1.7654026947051304,0.96861312465749172,1,0,310388.26712743449,1.5707931050236317,16.034782431050584,1.5083914041390014,1.0022382790869195,6.68447774239114E-2,1,0,1,0,1.6177796701027036,2.5959897311775801,-14.734409655465075,-188.95714009569645,-8.9571400956964453,null,77183.25,5957254080.5625,null,11.950960186017941,-7.4052777324703412,null,21.75610392629212,-181.55186236322609,null,0,0]
[77625,77.625,34.102670936415116,1.5414689064926161,1.7722710874623582,0.97127448852157305,1,0,312164.74087014585,1.570793123358156,16.126199853097944,1.5087456259227636,1.0022639444841686,6.7226207919503331E-2,1,0,1,0,1.6436871784716074,2.6021271469555654,-14.888620480337824,-189.16747486363982,-9.1674748636398249,null,77625,6025640625,null,11.950546054145567,-7.4068377273168249,null,21.602307233291747,-181.76063713632303,null,0,0]
[78077,78.076999999999998,34.301075979914749,1.5416385910365877,1.7793117401884615,0.97397631770869819,1,0,313982.43443371251,1.5707931419033538,16.219740519548129,1.5091039337636165,1.0022903563251766,6.7616468533564386E-2,1,0,1,0,1.670397042212151,2.6082588484086919,-15.045002215819759,-189.37554609881673,-9.3755460988167272,null,78077,6096017929,null,11.950124360924303,-7.4086695489290406,null,21.446347191031077,-181.9668765498877,null,0,0]
[78529,78.528999999999996,34.499481999680327,1.5418063238786481,1.7863652792374198,0.97665682976056767,1,0,315800.12799727928,1.5707931602350653,{"$f":"SQRT(1+(A535/Zero2)^2)","v":16.31328324448096},{"$f":"ATAN(A535/Zero2)","v":1.5094581324715721},1.002316920810302,6.8006708520841438E-2,1,0,1,0,1.6973089676886488,2.6142457915426709,-15.199977907388067,-189.57666709276117,-9.5766670927611699,null,78529,6166803841,null,11.949704662264631,-7.410735612454471,null,21.291791198122443,-182.16593148030674,null,0,0]
[78981,78.980999999999995,34.697888978964691,1.5419721384895231,1.7934315525641038,0.97931623790313549,1,0,317617.82156084618,1.570793178356956,16.406827992687422,1.5098082922425671,1.0023436379274082,6.8396927764122081E-2,1,0,1,0,1.7244215455943184,2.6200928661107947,-15.353565210517715,-189.77110368004739,-9.7711036800473892,null,78981,6237998361,null,11.949286883027867,-7.4130318894564438,null,21.138621674229555,-182.35807179059091,null,0,0]
[79433,79.433000000000007,34.89629690140147,1.5421360675791549,1.800510410237889,0.9819547532122116,1,0,319435.51512441313,1.5707931962726076,16.500374729756182,1.510154481684685,1.0023705076642908,6.8787126146231614E-2,1,0,1,0,1.7517334303472911,2.6258047593138283,-15.505781891022783,-189.95911026042367,-9.959110260423671,null,79433,6309601489,null,11.94887095020627,-7.4155544424729136,null,20.986820926546081,-182.54355581795073,null,0,0]
[79895.5,79.895499999999998,35.099314817021778,1.5423018863699876,1.8077665824365743,0.98463315291565778,1,0,321295.43387031968,1.5707932143946115,16.596096589424388,1.5105046733396004,1.0023981595537481,6.9186367155389616E-2,1,0,1,0,1.7798847378173148,2.6315140987041157,-15.660134427855041,-190.14508238882982,-10.14508238882982,null,79895.5,6383290920.25,null,11.948447192483885,-7.418365801776412,null,20.832892147436212,-182.72671658705343,null,0,{"$f":"IF(AH538>0,W538,0)","v":0}]
[80358,80.358000000000004,35.302333686628195,1.5424657979631273,1.8150356194902202,0.98729011810418132,1,0,323155.35261622636,1.5707932323080132,16.691820460998493,1.5108508484943202,1.0024259712100101,6.9585586074813507E-2,1,0,1,0,1.8082420592764388,2.6370912224262044,-15.813089725807359,-190.32482680122715,-10.324826801227147,null,80358,6457408164,null,11.9480252198301,-7.4214060119892311,null,20.680358822137684,-182.90342078923791,null,0,0]
[80820.5,80.820499999999996,35.505353493856134,1.5426278350657907,1.8223173674490722,0.98992586798749882,1,0,325015.27136213315,1.5707932500163939,16.787546310062368,1.5111930757737495,1.0024539426197789,6.9984782779095589E-2,1,0,1,0,1.83680413926258,2.6425405526667909,-15.964666907606215,-190.49858224554609,-10.498582245546089,null,80820.5,6531953220.25,null,11.947604960499509,-7.4246711342137868,null,20.529201899669417,-183.07391111133225,null,0,0]
[81283,81.283000000000001,35.708374222713054,1.5427880296417631,1.8296116745471491,0.99254061946779049,1,0,326875.19010804006,1.5707932675232532,16.883274102979726,1.5115314222501341,1.0024820737696827,7.0383957142870324E-2,1,0,1,0,1.8655697785923664,2.6478663280717925,-16.114885051400393,-190.66657713218029,-10.666577132180294,null,81283,6606926089,null,11.947186344782621,-7.4281573185110732,null,20.379402371592125,-183.23841981366922,null,0,0]
[81756.25,81.756249999999994,35.916114749461244,1.5429500729806762,1.8370883693450355,0.99519463392718444,1,0,328778.33939777082,1.5707932852319948,16.98122889813099,1.5118736842245886,1.0025110241173203,7.0792386357306933E-2,1,0,1,0,1.8952135410788575,2.6531922339092704,-16.267207786542183,-190.83274174929886,-10.832741749298862,null,81756.25,6684084414.0625,null,11.946759629786905,-7.4319494367445698,null,20.227506351446053,-183.4007923125543,null,0,0]
[82229.5,82.229500000000002,36.123856208449354,1.5431102525626188,1.8445778992588289,0.99782711464222817,1,0,330681.48868750175,1.5707933027369005,17.079185659700752,1.5122120201875733,1.002540141688582,7.120079191519868E-2,1,0,1,0,1.9250680632356634,2.6583972017981328,-16.418147716134339,-190.99332771642074,-10.993327716420737,null,82229.5,6761690670.25,null,11.946334494262182,-7.4359651317667383,null,20.076991557378619,-183.55736258465402,null,0,0]
[82702.75,82.702749999999995,36.331598583685938,1.5432686003499247,1.852080108578773,1.0004382865843438,1,0,332584.63797723269,1.5707933200414697,17.177144354047101,1.5125464972293332,1.0025694264688969,7.1609173682372643E-2,1,0,1,0,1.9551322246764393,2.6634852308321149,-16.567724948719945,-191.14854925465812,-11.148549254658121,null,82702.75,6839744857.5625,null,11.945910869705454,-7.4402005521026577,null,19.927837949349737,-183.70834870255544,null,0,0]
[83176,83.176000000000002,36.539341859543164,1.5434251475784166,1.8595948438463517,1.0030283722599882,1,0,334487.78726696374,1.5707933371491216,17.275104948290544,1.5128771809218389,1.0025988784436135,7.2017531524703193E-2,1,0,1,0,1.9854049547403685,2.6684601543795106,-16.71595943052009,-191.29861127634939,-11.298611276349391,null,83176,6918246976,null,11.945488689558957,-7.4446519332662229,null,19.780025647696093,-183.8539593430832,null,0,0]
[83660.5,83.660499999999999,36.752024482138317,1.5435835828169651,1.8673010360560836,1.0056584145579732,1,0,336436.17782348726,1.570793354462948,17.375396175914691,1.5132118627919802,1.0026292037325351,7.2435571839531601E-2,1,0,1,0,2.0166123179988098,2.6734400071030562,-16.866347336797478,-191.44710024613107,-11.447100246131072,null,83660.5,6999079260.25,null,11.94505790223479,-7.4494290123482054,null,19.630068528742875,-183.99767123378285,null,0,0]
[84145,84.144999999999996,36.964708016656687,1.5437401948843661,1.8750200383934705,1.0082668202837233,1,0,338384.5683800109,1.5707933715773914,17.475689327452102,1.5135427032137903,1.0026597042280181,7.2853586794179026E-2,1,0,1,0,2.0480361614670128,2.6783089454835922,-17.015369597271047,-191.59058815074658,-11.590588150746584,null,84145,7080381025,null,11.944628493598115,-7.4544247257519016,null,19.481475676905976,-184.13616342499472,null,0,0]
[84629.5,84.629499999999993,37.177392447447573,1.5438950150628636,1.8827516932996569,1.010853820280166,1,0,340332.95893653459,1.5707933884958758,17.575984369967724,1.5138697678763762,1.0026903799140743,7.3271576244881523E-2,1,0,1,0,2.0796754818560159,2.6830705931169128,-17.163046964553203,-191.72926740120761,-11.729267401207608,null,84629.5,7162152270.25,null,11.944200398147245,-7.4596353017278005,null,19.334226405074691,-184.26963209947982,null,0,0]
[85114,85.114000000000004,37.390077759216254,1.5440480739232807,1.8904958455371283,1.0134196427631319,1,0,342281.3494930584,1.5707934052217478,17.676281271273382,1.5141931209812132,1.0027212307746249,7.3689540047928298E-2,1,0,1,0,2.1115293199430076,2.6877284239908819,-17.30939994011657,-191.86332203161629,-11.863322031616292,null,85114,7244392996,null,11.943773552242835,-7.4650570537600798,null,19.188300275415727,-184.39826497785617,null,0,0]
[85609.5,85.609499999999997,37.607592735303726,1.5442028171839335,1.8984285863729433,1.0160220501288051,1,0,344273.97595489037,1.5707934221315476,17.778857184996863,1.514520041913985,1.0027529632359975,7.4116966547818061E-2,1,0,1,0,2.1443272844545875,2.6923880974829268,-17.457726940334513,-191.99582034756108,-11.995820347561079,null,85609.5,7328986490.25,null,11.943338243293844,-7.4708165674402478,null,19.040408584146778,-184.52500378012084,null,0,0]
[86105,86.105000000000004,37.825108601565816,1.5443557807248696,1.9063740773100333,1.0186027819377588,1,0,346266.60241672245,1.5707934388467288,17.881434977076122,1.5148432120827213,1.0027848788821172,7.4544365918370284E-2,1,0,1,0,2.1773477200345583,2.6969460876620097,-17.604711247528535,-192.12384592371316,-12.123845923713162,null,86105,7414071025,null,11.94290411233435,-7.4767894185224772,null,18.893858407912251,-184.64705650519062,null,0,0]
[86600.5,86.600499999999997,38.042625342733324,1.5445069950666386,1.9143321595894132,1.0211620739213114,1,0,348259.2288785546,1.5707934553706324,17.984014615369684,1.5151626956016704,1.002816977695494,7.4971738006036417E-2,1,0,1,0,2.2105897292313839,2.701405670389577,-17.750373905758487,-192.24757101331465,-12.247571013314655,null,86600.5,7499646600.25,null,11.942471096934863,-7.4829719249246764,null,18.74862876508179,-184.76459908838999,null,0,0]
[87096,87.096000000000004,38.260142943884176,1.5446564900360491,1.9223026768315474,1.0237001590338242,1,0,350251.85534038686,1.5707934717065231,18.086596068464669,1.5154785551335865,1.0028492596585399,7.5399082657327421E-2,1,0,1,0,2.2440524535352315,2.7057699871915815,-17.894735643370293,-192.36716037527415,-12.367160375274153,null,87096,7585713216,null,11.94203913644145,-7.4893604877282565,null,18.604698987963395,-184.87779988754593,null,0,0]
[87603.25,87.603250000000003,38.482819507029646,1.5448077794609356,1.930474922266747,1.0262767039855194,1,0,352291.73379198014,1.5707934882383707,18.191611926533536,1.5157982148048537,1.0028824968347152,7.5836532531965067E-2,1,0,1,0,2.2785364639918728,2.710142261153595,-18.04119443484328,-192.48546614310695,-12.485466143106947,null,87603.25,7674329410.5625,null,11.941597963889457,-7.4961103164621825,null,18.458681369042402,-184.98935582664478,null,0,0]
[88110.5,88.110500000000002,38.705496940853934,1.5449573281162698,1.9386598752261035,1.0288315096163725,1,0,354331.61224357353,1.5707935045798713,18.296629622124797,1.5161142049883325,1.002915925912143,7.6273953328246935E-2,1,0,1,0,2.3132500772322335,2.7144209562984676,-18.186332799942559,-192.59976464143656,-12.599764641436565,null,88110.5,7763460210.25,null,11.941157773676075,-7.5030687143864609,null,18.313983194156506,-185.09669592705009,null,0,0]
[88617.75,88.617750000000001,38.928175230415611,1.5451051658681345,1.9468573754351897,1.031364816973112,1,0,356371.49069516698,1.5707935207342938,18.401649123778387,1.5164265884464454,1.0029495468716347,7.6711344881699478E-2,1,0,1,0,2.3481924863435282,2.7186090464908124,-18.33017191697412,-192.71021055513637,-12.710210555136371,null,88617.75,7853105615.0625,null,11.940718506128574,-7.5102320762427928,null,18.170583344672444,-185.19997847889354,null,0,0]
[89125,89.125,39.150854361113161,1.5452513219034356,1.9550672650640226,1.0338768641666212,1,0,358411.36914676055,1.5707935367048322,18.506670400747804,1.5167354265198163,1.0029833596938944,7.7148707027915944E-2,1,0,1,0,2.3833629190204628,2.7227093845440868,-18.472732600898759,-192.81695184411953,-12.816951844119529,null,89125,7943265625,null,11.940280103273739,-7.5175968782355485,null,18.028461063602641,-185.29935496588399,null,0,0]
[89644,89.644000000000005,39.378692513677485,1.5453991526636002,1.9634799906956697,1.0364253414491291,1,0,360498.49958811508,1.5707935528582473,18.614126209342579,1.5170478115602168,1.0030181543209367,7.7596169675161239E-2,1,0,1,0,2.4195832804392494,2.726816733240804,-18.617293708857463,-192.92247897801894,-12.922478978018944,null,89644,8036046736,null,11.939832381427964,-7.5253371805458302,null,17.884347677489711,-185.39714179747315,null,0,0]
[90163,90.162999999999997,39.606531516920093,1.5455452826158869,1.9719053597543617,1.0389520572443018,1,0,362585.63002946973,1.5707935688256967,18.721583813534192,1.517356610593261,1.0030531497611468,7.8043601189011103E-2,1,0,1,0,2.456040819409135,2.730837896210248,-18.760559388130165,-193.02442109437396,-13.024421094373963,null,90163,8129366569,null,11.939385447216228,-7.5332811514759603,null,17.741528932428746,-185.49113994289806,null,0,0]
[90682,90.682000000000002,39.834371356244219,1.5456897409382291,1.9803432108657453,1.0414572572466323,1,0,364672.76047082443,1.5707935846103729,18.829043182580151,1.517661884956732,1.0030883459935067,7.8491001393586446E-2,1,0,1,0,2.4927348100307691,2.7347755725236667,-18.902550750984876,-193.12291690880045,-13.122916908800448,null,90682,8223225124,null,11.938939243700837,-7.5414252667356187,null,17.599983773089427,-185.58149164206486,null,0,0]
[91201,91.200999999999993,40.0622120173851,1.5458325561450825,1.9887933851570609,1.0439411840644386,1,0,366759.89091217931,1.5707936002153966,18.936504286435294,1.5179636945987545,1.0031237429968816,7.8938370113082856E-2,1,0,1,0,2.5296645571515235,2.7386323523882625,-19.043288513553939,-193.21809911789603,-13.218099117896031,null,91201,8317622401,null,11.938493715567295,-7.5497660816562213,null,17.459691538653903,-185.6683330362398,null,0,0]
[91732,91.731999999999999,40.29532150669111,1.5459770019585484,1.99745152995447,1.046460775867577,1,0,368895.27870477946,1.570793615998479,19.046451804906127,1.5182689577920354,1.0031601661937513,7.9396049849266126E-2,1,0,1,0,2.5676914729179163,2.7424971753315255,-19.186004108336064,-193.31218504922245,-13.31218504922245,null,91732,8414759824,null,11.938038529147391,-7.558499810606488,null,17.317431130291684,-185.75368523861596,null,0,0]
[92263,92.263000000000005,40.528431827071074,1.5461197861360445,2.0061222457576897,1.048958603420596,1,0,371030.66649737966,1.5707936315998889,19.156401077858785,1.5185707168616285,1.0031967995080397,7.9853696255511461E-2,1,0,1,0,2.6059637930299431,2.746282476389859,-19.327450077233699,-193.40306535853219,-13.403065358532189,null,92263,8512461169,null,11.937583937528819,-7.5674323909813497,null,17.176439753012616,-185.83563296755079,null,0,0]
[92794,92.793999999999997,40.76154296426656,1.5462609371798819,2.0148053702687401,1.0514349167419601,1,0,373166.05428997992,1.5707936470227455,19.266352075255821,1.5188690317450724,1.0032336429167299,8.0311309143781387E-2,1,0,1,0,2.6444808630942793,2.7499907088623168,-19.467647340095329,-193.49086447280322,-13.490864472803224,null,92794,8610726436,null,11.937129886396827,-7.5765603780177626,null,17.036696541282982,-185.91430409478548,null,0,0]
[93325,93.325000000000003,40.994654904343406,1.5464004829443334,2.0235007437451271,1.0538899626172706,1,0,375301.4420825803,1.5707936622700964,19.376304767741111,1.5191639610219048,1.0032706963966753,8.0768888326122168E-2,1,0,1,0,2.683242056086256,2.7536242280941594,-19.606616398871367,-193.57570143258272,-13.575701432582719,null,93325,8709555625,null,11.936676322986772,-7.585880404761097,null,16.898181045916999,-185.98982102782162,null,0,0]
[93868.5,93.868499999999997,41.233255230872714,1.5465416796874962,2.0324133313600572,1.0563810313858879,1,0,377487.09794939449,1.5707936776977343,19.488847525913389,1.5194623867402508,1.0033088396566205,8.1237204044934327E-2,1,0,1,0,2.7231678901195644,2.7572682704326779,-19.747605909375505,-193.659586793535,-13.659586793534999,null,93868.5,8811295292.25,null,11.936212534051974,-7.5956152687189382,null,16.75765532434766,-186.06397152481605,null,0,0]
[94412,94.412000000000006,41.471856369990661,1.5466812517314266,2.0413384207860918,1.0588503325874814,1,0,379672.75381620892,1.5707936929477482,19.601391999791041,1.5197573855682578,1.0033472029451131,8.1705484054052244E-2,1,0,1,0,2.7633482286542863,2.7608387392913958,-19.887350855901957,-193.74060509608046,-13.740605096080458,null,94412,8913625744,null,11.935749148965746,-7.605544422838423,null,16.618373762907439,-186.13506067324204,null,0,0]
[94955.5,94.955500000000001,41.710458307752219,1.5468192269525947,2.0502758487577206,1.0612981205745575,1,0,381858.40968302329,1.570793708023188,19.713938159989809,1.5200490161461158,1.0033857862369153,8.2173728152209025E-2,1,0,1,0,2.8037824797352959,2.764337871136862,-20.025871900201828,-193.81886813300014,-13.818868133000137,null,94955.5,9016546980.25,null,11.935286115859626,-7.6156644959271276,null,16.48031575171369,-186.20320363707299,null,0,0]
[95499,95.498999999999995,41.949061030529563,1.5469556325934823,2.0592254546200852,1.0637246463182231,1,0,384044.06554983777,1.5707937229270343,19.826485977792203,1.5203373357848202,1.0034245895066487,8.2641936138231689E-2,1,0,1,0,2.8444700758612251,2.7677678140667474,-20.163189272099178,-193.89448286748487,-13.894482867484868,null,95499,9120059001,null,11.934823384347848,-7.6259721929513233,null,16.343461111328114,-186.26851067453353,null,0,0]
[96611.5,96.611500000000007,42.437463660334707,1.5472300605475433,2.0775818782819102,1.0686262798100241,1,0,388517.92415486311,1.5707937529110734,20.056867197466609,1.5209174119293951,1.0035047024934964,8.360020609259107E-2,1,0,1,0,2.9285420187339817,2.7745814619043077,-20.440596017575132,-194.04142741067886,-14.041427410678864,null,96611.5,9333781932.25,null,11.933876946917616,-7.6476428200735969,null,16.067000803282394,-186.39378459060526,null,0,0]
[97724,97.724000000000004,42.925869413407987,1.5474982437001317,2.0959873429385634,1.0734419420248573,1,0,392991.7827598888,1.5707937822124298,20.28725501276103,1.5214843132430658,1.0035857368323382,8.4558322176003467E-2,1,0,1,0,3.0136688031934598,2.7811304537279629,-20.713206513481794,-194.17852227873934,-14.178522278739337,null,97724,9549980176,null,11.93293116750686,-7.670059454132657,null,15.795336086786484,-186.50846282460668,null,0,0]
[98862,98.861999999999995,43.425473206473157,1.5477663324529063,2.1148640907693981,1.0782811463622259,1,0,397568.1882363109,1.5707938115031062,20.522930219964465,1.5220510396328741,1.0036695816267833,8.5538238575293676E-2,1,0,1,0,3.1018339891798954,2.7875717806221059,-20.987267291905795,-194.30935321563604,-14.309353215636037,null,98862,9773695044,null,11.931963995001968,-7.6937351760721153,null,15.522242480867375,-186.61561803956394,null,0,0]
[100000,100,43.925080049597724,1.5480283227047991,2.1337894873375509,1.0830346188631241,1,0,402144.59371273336,1.5707938401271269,20.758611869027806,1.5226048976093813,1.0037543900194952,8.6517990326659633E-2,1,0,1,0,3.1910947297785413,2.7937675173100454,-21.256635359522562,-194.43140335819876,-14.431403358198764,null,100000,10000000000,null,11.930996731052439,-7.7181387319558903,null,15.253841677200136,-186.7132646262429,null,0,0]
[101165,101.16500000000001,44.436543534201988,1.5482904263645858,2.1532129591975542,1.0878142033775984,1,0,406829.5782294579,1.5707938687631962,20.999891708444853,1.5231590183312562,1.0038422084698573,8.752081503234023E-2,1,0,1,0,3.2836042863082331,2.7998705412509892,-21.52769428501372,-194.54795877065922,-14.547958770659221,null,101165,10234357225,null,11.930006045982127,-7.7438492172339544,null,14.983773436779291,-186.80410955342532,null,0,0]
[102330,102.33,44.948010002048662,1.5485465650508361,2.17268473984472,1.0925082234652586,1,0,411514.56274618272,1.5707938967472372,21.241177849386041,1.5237005503051002,1.0039310362643477,8.8523463286380763E-2,1,0,1,0,3.3772545418959314,2.8057448916628132,-21.794154810106342,-194.65668400256905,-14.656684002569051,null,102330,10471428900,null,11.929014520504788,-7.7702708373516192,null,14.71830443716401,-186.88641316521742,null,0,0]
[103520,103.52,45.470455120450943,1.5488022511884822,2.1926229064983151,1.0972167934278043,1,0,416300.08341133554,1.5707939246815177,21.487648089594064,1.5242411469079722,1.0040228120222567,8.9547443378149197E-2,1,0,1,0,3.4740886692834496,2.811522639853183,-22.06174291535493,-194.76029057357255,-14.760290573572547,null,103520,10716390400,null,11.928000491262198,-7.7979682716997152,null,14.451730361158006,-186.96232230187289,null,0,0]
[104710,104.71,45.992903143968185,1.5490521285017431,2.2126088082656801,1.1018404018641488,1,0,421085.60407648864,1.5707939519808676,21.73412446702649,1.5247694823639837,1.0041156403403679,9.0571235213747575E-2,1,0,1,0,3.5721062135651542,2.8170880111195276,-22.324844480627654,-194.85695564821094,-14.856955648210942,null,104710,10964184100,null,11.926984878176539,-7.8263573953528489,null,14.189644408970945,-187.03059825285811,null,0,0]
[105930,105.93,46.528525039510761,1.5493024797219881,2.233146769976063,1.1064945544434608,1,0,425991.76811975514,1.5707939793316947,21.986820689831379,1.5252988398684297,1.0042119012599631,9.1620639300876605E-2,1,0,1,0,3.673820162476241,2.8225855583708022,-22.590074902693516,-194.94942071322475,-14.949420713224754,null,105930,11221164900,null,11.925941674655103,-7.8561554368118047,null,13.925457190426517,-187.09326527641301,null,0,0]
[107150,107.15,47.064149784885792,1.5495471325941192,2.2537322219539475,1.1110637830090049,1,0,430897.93216302193,1.5707940060596939,22.239522933756714,1.5258161675961559,1.0043092678541439,9.266984106628523E-2,1,0,1,0,3.7767717508993477,2.8278840664582106,-22.8508950703641,-195.03569859802371,-15.035698598023714,null,107150,11481122500,null,11.92489612986806,-7.8866311058399514,null,13.66568256754298,-187.14906749218375,null,0,0]
[108400,108.4,47.612948485795393,1.5497920923327653,2.2748717817371955,1.1156595015904482,1,0,435924.73958440212,1.5707940328209391,22.498445200160916,1.5263341629531098,1.0044101751645254,9.3744630675913529E-2,1,0,1,0,3.8835356896663273,2.8331178379274253,-23.113705298788368,-195.11819498891026,-15.118194988910261,null,108400,11750560000,null,11.923822118723042,-7.9185345999182033,null,13.403946350263727,-187.19966038899204,null,0,0]
[109650,109.65,48.161749978621735,1.5500314694698258,2.2960585029365941,1.1201705006372709,1,0,440951.54700578266,1.5707940589720331,22.757373365962064,1.5268403711789944,1.0045122425082369,9.4819203110355729E-2,1,0,1,0,3.9915931935663123,2.8381650112733081,-23.37218499710438,-195.19519718180717,-15.195197181807174,null,109650,12023122500,null,11.922745002365494,-7.9511009686793637,null,13.146543768305269,-187.24409621312785,null,0,0]
[110925,110.925,48.721530279695266,1.5502700785663381,2.3177162029582981,1.124686663313184,1,0,446078.89057559118,1.5707940850389626,23.021485966203553,1.5273449726632096,1.0046175458984605,9.5915040755049766E-2,1,0,1,0,4.1031418254409191,2.8431313677473291,-23.631519357211793,-195.26853951088515,-15.268539510885148,null,110925,12304355625,null,11.921642833703558,-7.9849777989340822,null,12.88831157685979,-187.28356171195111,null,0,0]
[112200,112.2,49.281313291677591,1.5505032669875951,2.3394202986739927,1.1291191171240582,1,0,451206.23414539994,1.5707941105134617,23.285604295263575,1.5278381273269166,1.0047240554401271,9.7010647378424061E-2,1,0,1,0,4.2160311084673729,2.8479240464291382,-23.886638036375516,-195.33705900234261,-15.337059002342613,null,112200,12588840000,null,11.920536822247264,-8.0194972132031328,null,12.634298909152356,-187.31756178913949,null,0,0]
[113510,113.51,49.856465623723579,1.5507374026270886,2.361767172223737,1.1335883041397732,1,0,456474.32832300768,1.5707941360911966,23.556978695729182,1.5283333015387415,1.0048347446409176,9.813608616981781E-2,1,0,1,0,4.3334132297223382,2.85267710296691,-24.14451241232657,-195.40285147782274,-15.402851477822736,null,113510,12884520100,null,11.919396149935826,-8.0556101791265338,null,12.377565205512743,-187.34724129869619,null,0,0]
[114820,114.82,50.431620626535924,1.5509661978086537,2.3841603339878019,1.1379736239440084,1,0,461742.42250061565,1.5707941610852905,23.828358740741255,1.5288171968358539,1.0049467062966193,9.9261275614639197E-2,1,0,1,0,4.4522058277243737,2.8572658804111604,-24.398221514679783,-195.46436262039845,-15.464362620398447,null,114820,13183632400,null,11.918250833071053,-8.0923550593147784,null,12.125001420024306,-187.37200756108373,null,0,0]
[116155,116.155,51.017754524044925,1.5511940519842848,2.4070271302785597,1.1423586011129485,1,0,467111.05282665166,1.5707941859763612,24.104923404017317,1.5292991171181469,1.0050621132966966,0.10040767874768111,1,0,1,0,4.5747143316239542,2.8617821747966019,-24.652626431263695,-195.52301511441652,-15.523015114416523,null,116155,13491984025,null,11.917078598507967,-8.1304285484183207,null,11.871768738003482,-187.39258656599824,null,0,0]
[117490,117.49,51.603891010099446,1.5514167300636739,2.4299393373582445,1.1466609666989576,1,0,472479.68315268785,1.570794210301774,24.38149353858709,1.5297701042351914,1.0051788408854274,0.10155381713187873,1,0,1,0,4.6986832946294435,2.8661453612996621,-24.902981178074338,-195.5779431223558,-15.577943122355805,null,117490,13803900100,null,11.915900985514373,-8.1691132603468031,null,11.622591604186425,-187.40882986200901,null,0,0]
[118860,118.86,52.20539697011241,1.5516400475370855,2.4534981169562453,1.150992502288513,1,0,477989.06408652308,1.5707942346968233,24.665320070877829,1.5302424579441991,1.0053000012413114,0.10272972577592314,1,0,1,0,4.8274187137335502,2.8704720627508618,-25.155824571197442,-195.63077342157541,-15.630773421575412,null,118860,14127699600,null,11.914686638407899,-8.2094253865594364,null,11.370962558169799,-187.42134803501594,null,0,0]
[120230,120.23,{"$f":"SQRT(1+(A589/pole1)^2)","v":52.806905474333021},{"$f":"ATAN(A589/pole1)","v":1.551858277528992},{"$f":"SQRT(1+(A589/Zero1)^2)","v":2.477102053474511},{"$f":"ATAN(A589/Zero1)","v":1.1552415672247305},{"$f":"IF(VIN_nom>Vout, 1, SQRT(1+(A589/z_RHP)^2))","v":1},{"$f":"IF(VIN_nom>Vout, 0, -ATAN(A589/z_RHP))","v":0},{"$f":"SQRT(1+(A589/Pole2)^2)","v":483498.44502035854},{"$f":"ATAN(A589/Pole2)","v":1.570794258535918},24.949151981232635,1.5307040643704815,{"$f":"SQRT(1+(A589/pole4)^2)","v":1.0054225513508181},{"$f":"ATAN(A589/pole4)","v":0.1039053493842136},{"$f":"IF(VOUT_setting=1,1,SQRT(1+(A589*zterm1)^2))","v":1},{"$f":"IF(VOUT_setting=1,0,ATAN(((A589*zterm1))))","v":0},1,{"$f":"IF(VOUT_setting=1,0,ATAN(A589*$Q$4/(1+Afbr-$Q$5*(A589)^2)))","v":0},{"$f":"SQRT((1-(Z589/pterm2))^2+(A589/pterm1)^2)","v":4.9576881328429865},{"$f":"IF((ATAN((A589/pterm1)/(1-A589^2/pterm2))>0),ATAN((A589/pterm1)/(1-A589^2/pterm2)),PI()+ATAN((A589/pterm1)/(1-A589^2/pterm2)))","v":2.8746538346239068},{"$f":"20*LOG10(((E589*K589*G589*O589)/(C589*I589*S589*M589*Q589))*Adc)","v":-25.404672701254039},{"$f":"((F589+L589+H589+P589)-(D589+J589+T589+N589+R589))*radconv","v":-195.68033300752953},{"$f":"IF(V589>0,V589,V589+180)","v":-15.680333007529526},null,{"$f":"IF(U589<0,A589,1000000000)","v":120230},{"$f":"A589^2","v":14455252900},null,{"$f":"20*LOG10((K589/(I589*M589))*AEA)","v":11.913466096591559},{"$f":"(L589-(J589+N589))*radconv","v":-8.25033692351459},null,{"$f":"20*LOG10((E589*G589/(C589*S589))*Acs*Am)","v":11.123334969929539},{"$f":"(F589+H589-(D589+T589))*radconv","v":-187.42999608401499},null,{"$f":"SUM((U590<0)*(U589>0))*A589","v":0},0]
[126030,{"$f":"A590/1000","v":126.03},55.353464104394654,1.5527296272813091,2.577502791345271,1.1723656491817456,1,0,506822.8314555774,1.5707943537188276,26.150831676382925,1.5325472995612908,1.0059567610431297,0.10887921199653812,1,0,1,0,5.5261481662513505,2.8909138829171641,-26.416757245257763,-195.86012938079179,-15.86012938079179,null,126030,15883560900,null,11.908224812665825,-8.4297141157792925,null,10.116491709851552,-187.43041526501244,null,0,0]
[131830,131.83000000000001,57.90006106470539,1.5535243290861134,2.6786025585799123,1.1882014432034427,1,0,530147.21789080033,1.5707944405263918,27.352592412539856,1.5342285716631758,1.0065158306346862,0.11384767194597407,1,0,{"$f":"IF(VOUT_setting=1,1,SQRT((1+Afbr-$Q$5*(A591)^2)^2+(A591*$Q$4)^2))","v":1},0,6.1219566769186455,2.9051719855841021,-27.367985884314535,-196.00361434817884,-16.003614348178843,null,131830,17379148900,null,11.902852348944698,-8.6180610798329305,null,9.1706355345159061,-187.38555326834589,null,0,0]
[144540,144.54,63.480732450638136,1.5550428639011373,2.9022372316444507,1.2190243969103138,1,0,581259.79575144791,1.5707946063937828,29.986341804193664,1.537441626402497,1.0078276885107711,0.12471540946366387,1,0,1,0,7.5228370659964421,2.9310560431972541,-29.272869130704326,-196.24623260299032,-16.246232602990318,null,144540,20891811600,null,11.890562727562372,-9.0566516005475464,null,7.2780419095084401,-187.18958100244279,null,0,0]
[158490,158.49,69.605999745833202,1.5564292548958372,3.1503894657374421,1.2477876537843069,1,0,637358.96657412499,1.5707947578203432,32.877338823045932,1.5403755479315318,1.0094041664194811,0.13660932925092836,1,0,1,0,9.2103988872435139,2.9533142922160631,-31.132662021515266,-196.46633622093557,-16.466336220935574,null,158490,25119080100,null,11.87617368841369,-9.5700303618781195,null,5.4326380578461873,-186.89630585905741,null,0,0]
[173780,173.78,76.319771800277451,1.5576931873021893,3.4249163648060938,1.27450209216983,1,0,698846.87495254283,1.5707948958662685,36.046307783404217,1.5430506747001298,1.0112955547660563,0.1496011029818809,1,0,1,0,11.23987202451919,2.9726205118033544,-32.953349906705434,-196.70540278195267,-16.705402781952671,null,173780,30199488400,null,11.859237618599074,-10.161138601671839,null,3.6288862424706307,-186.54426418028078,null,0,0]
[190550,190.55,83.683521986734434,1.5588462585216745,3.7283916416705192,1.2992596074308802,1,0,766286.52331789676,1.5707950218000031,39.522264766522547,1.54549143253271,1.0135655065952536,0.16379199369114272,1,0,1,0,13.681620184990614,2.9895187320195058,-34.743536764600492,-196.99440469863981,-16.994404698639812,null,190550,36309302500,null,11.839200665348621,-10.834378840464383,null,1.8587363378260244,-186.16002585817546,null,0,0]
[208930,208.93,91.754333620361265,1.559897443238917,4.06321501934673,1.3221310292039619,1,0,840200.6996420112,1.5707951366030766,43.332155168036898,1.5477167273698484,1.0162867037168317,0.17926899132808577,1,0,1,0,16.616827383688349,3.0044021795262026,-36.508271576936146,-197.35622915403908,-17.356229154039085,null,208930,43651744900,null,11.815444543530212,-11.593652060854073,null,0.11775764730878104,-185.762577093185,null,0,0]
[229090,229.09,100.60685511170793,1.5608564825782181,4.4325204812877432,1.3432320430824884,1,0,921273.04973419523,1.5707952413403723,47.511217368756981,1.5497471113861052,1.0195497666660596,0.19614533678720658,1,0,1,0,20.147575457913632,3.0175974581808438,-38.254398975928481,-197.80882973330372,-17.808829733303725,null,229090,52482228100,null,11.787211640525957,-12.444268996321103,null,-1.6001368486792977,-185.36456073698258,null,0,0]
[251190,251.19,110.3113445850056,1.5617309518714879,4.8392685321206477,1.3626538765933389,1,0,1010147.0049443868,1.5707953368399741,52.092618585004423,1.5515985698870838,1.0234581809614725,0.21451622301635317,1,0,1,0,24.392067338273069,3.0293458015141597,-39.985745145562809,-198.36577349296999,-18.365773492969993,null,251190,63096416100,null,11.753654534106289,-13.390767957922172,null,-3.2979259118939637,-184.97500553504779,null,0,0]
[275420,275.42,120.95123426776743,1.5625284376812114,5.2869779861946098,1.3805060205882302,1,0,1107586.6400006372,1.5707954239309907,{"$f":"SQRT(1+(A599/Zero2)^2)","v":57.115746370044718},{"$f":"ATAN(A599/Zero2)","v":1.5532871255546106},1.0281369835632168,0.23448967564860024,1,0,1,0,29.494999802804195,3.0398496178631298,-41.706874622341175,-199.03809031912408,-19.03809031912408,null,275420,75856176400,null,11.713767725209552,-14.438420373977015,null,-4.9791685797755907,-184.59966994514707,null,0,0]
[302000,302,132.62313071338156,1.5632560925194781,5.7797323743088151,1.3969028669934846,1,0,1214476.6730091115,1.5707955033949728,62.626209086568885,1.5548278925828911,1.0337367331960701,0.25618269709415042,1,0,1,0,35.633329233078172,3.0492769351151101,-43.422612942169692,-199.83510094426799,-19.835100944267992,null,302000,91204000000,null,11.666364343629333,-15.593064054030604,null,-6.6475035180238917,-184.24203689023733,null,0,0]
[331130,331.13,145.41485857259448,1.563919396253626,6.3212528607519793,1.4119324546352521,1,0,1331621.3931572323,1.5707955758306922,68.665469963274674,1.5562324513493828,1.04042593713529,0.27967638821258001,1,0,1,0,43.009900739365776,3.057753465428461,-45.134945936631524,-200.7632611291379,-20.763261129137902,null,331130,109647076900,null,11.610153656422025,-16.858682262609719,null,-8.3036258252784094,-183.90457886652814,null,0,0]
[363080,363.08,159.44498173260916,1.5645245298084394,6.9165687164331437,1.4257074626613762,1,0,1460106.5908480205,1.5707956419133913,75.289505642593625,1.5575138726732862,1.048413981036489,0.30508409990509455,1,0,1,0,51.881360012029958,3.0653989032236435,-46.84868256175956,-201.82907262431462,-21.82907262431462,null,363080,131827086400,null,11.543566008090941,-18.241020663877578,null,-9.9507748020753581,-183.58805196043707,null,0,{"$f":"IF(AH602>0,W602,0)","v":0}]
[398110,398.11,174.82767335953727,1.5650763773511118,7.5705328810144161,1.438318059010415,1,0,1600977.8420251252,1.5707957021766328,82.552220687301755,1.5586824860088346,1.0579372553265165,0.33248051186822608,1,0,1,0,62.546704148648722,3.0723052509462985,-48.566486536872453,-203.03660740934808,-23.036607409348079,null,398110,158491572100,null,11.464894963338281,-19.743766285703643,null,-11.589907732435599,-183.29284112364442,null,0,0]
[436520,436.52,191.69467217226523,1.565579674061359,8.2887519699482066,1.4498562964523489,1,0,1755441.580469681,1.5707957571376598,90.515813621365382,1.5597483087370794,1.0692746019960837,0.36193489145745222,1,0,1,0,75.369586932676256,3.0785544594688652,-50.291758075173206,-204.38895279706725,-24.388952797067248,null,436520,190549710400,null,11.372200942017791,-21.370313931198524,null,-13.222485249415858,-183.01863886586872,null,0,0]
[478630,478.63,210.18649989171954,1.5660386293541033,9.0772140714129765,1.4604063022561269,1,0,1924784.6688815644,1.5707958072562613,99.246630426877417,1.5607202474647643,1.0827460711185535,0.39348736226915659,1,0,1,0,90.784065000675255,3.0842158055159179,-52.027491189110926,-205.88728772376601,-25.887287723766008,null,478630,229086676900,null,11.263364468875229,-23.122452228463686,null,-14.849381890211021,-182.76483549530235,null,0,0]
[524810,524.80999999999995,230.46563517721822,1.5664572714856828,9.9428506362056481,1.4700512147428304,1,0,2110495.0422575078,1.5707958529724142,108.82138453282656,1.5616068271490713,1.0987261721207633,0.42716269270656559,1,0,1,0,109.31935290118706,3.0893517492238423,-53.777431396119546,-207.53158892493224,-27.531588924932237,null,524810,275425536100,null,11.136033222941835,-25.001111883612136,null,-16.471990851286243,-182.53047704132013,null,0,0]
[575440,575.44000000000005,252.69894835280701,1.5668390384225268,10.892787504401952,1.4788630166078123,1,0,2314100.850053614,1.5707958946616125,119.31886344389426,1.5624153241763656,1.1176340518311607,0.46293141107969615,1,0,1,0,131.60140378792539,3.0940140741794155,-55.544348429556166,-209.31879056969174,-29.318790569691743,null,575440,331131193600,null,10.987768415169237,-27.004187408475669,null,-18.090643076950265,-182.3146031612161,null,0,0]
[630960,630.96,277.07965801968436,1.5671872485317788,11.935282170793352,1.4869127880180231,1,0,2537371.5284822145,1.5707959326862733,130.83029549791354,1.5631527627900486,1.1399533272301892,0.50073718717023952,1,0,1,0,158.39295896476222,3.0982505468914106,-57.331806638156024,-211.24411708974856,-31.244117089748556,null,630960,398110521600,null,10.815968188642175,-29.128048880545844,null,-19.706301059023065,-182.11606820920269,null,0,0]
[691830,691.83,303.80976573455456,1.5675047874222576,13.078973593141217,1.4942630358223425,1,0,2782156.9426743812,1.570795967361543,143.45105639297438,1.5638252516107491,1.1662188679983918,0.5404602131298879,1,0,1,0,190.6001037814128,3.1021017359157192,-59.142576694977969,-213.29926238251699,-33.299262382516986,null,691830,478628748900,null,10.618065644912003,-31.365481835629666,null,-21.31916857211484,-181.93378054688733,null,0,0]
[758580,758.58,333.12201270177655,1.5677944191941371,14.333821196622768,1.5009745422034362,1,0,3050588.4589767847,1.5707959989892901,157.29103611365466,1.564438642584586,1.1970376215432721,0.58194414521157478,1,0,1,0,229.32592944520505,3.1056052883781464,-60.980033168995178,-215.47376616676337,-35.473766166763369,null,758580,575443616400,null,10.391475407388981,-33.707193162337653,null,-22.930034808609019,-181.76657300442577,null,0,0]
[831760,831.76,365.25792305281527,1.5680585319761107,15.710165445532192,1.5071002108707567,1,0,3344877.872654839,1.570796027830319,172.46427194478639,1.5649979919154844,1.23306573451669,0.62495957355765985,1,0,1,0,275.87826115406205,3.1087932080278966,-62.846468388554598,-217.75313389182841,-37.753133891828412,null,831760,691824697600,null,10.133877289978644,-36.139748959830598,null,-24.538871910758104,-181.61338493199781,null,0,0]
[912010,912.01,400.49854328398192,1.5682994362172729,17.220043928063838,1.5126917763250975,1,0,3667598.9091082965,1.5707960541369466,189.10346231367163,1.5655081916729425,1.2750389705445708,0.66924585959515481,1,0,1,0,331.85319442137092,3.1116957386076582,-64.744763977156751,-220.12105283624811,-40.121052836248111,null,912010,831762240100,null,9.8431081354525389,-38.647935457402014,null,-26.146398344834161,-181.47311737884604,null,0,0]
[1000000,1000,439.13809415303155,1.5685191368230385,18.876063086015179,1.517794366044795,1,0,4021445.9371150243,1.5707960781281196,207.34752632451205,1.5659734871190769,1.3237399851711416,0.71447800725413402,1,0,1,0,399.1482288040898,3.1143388176066562,-66.676593196059954,-222.55767424101074,-42.557674241010744,null,1000000,1000000000000,null,9.5175031312395575,-41.21288852880776,null,-27.752622559524376,-181.34478571220299,null,0,0]
[]
[]
["Pole/Zero Locations for Chart"]
[{"$f":"U4*1000","v":15136},null,{"$f":"SQRT(1+(A617/pole1)^2)","v":6.7215804649602822},{"$f":"ATAN(A617/pole1)","v":1.4214674276163879},{"$f":"SQRT(1+(A617/Zero1)^2)","v":1.0399038487728265},{"$f":"ATAN(A617/Zero1)","v":0.27792295861592997},{"$f":"IF(VIN_nom>Vout, 1, SQRT(1+(A617/z_RHP)^2))","v":1},{"$f":"IF(VIN_nom>Vout, 0, -ATAN(A617/z_RHP))","v":0},{"$f":"SQRT(1+(A617/Pole2)^2)","v":60868.605712385543},{"$f":"ATAN(A617/Pole2)","v":1.5707798979644947},{"$f":"SQRT(1+(A617/Zero2)^2)","v":3.2938430104965639},{"$f":"ATAN(A617/Zero2)","v":1.2623310178238567},{"$f":"SQRT(1+(A617/pole4)^2)","v":1.0000861702602852},{"$f":"ATAN(A617/pole4)","v":1.3127381534703225E-2},{"$f":"IF(VOUT_setting=1,1,SQRT(1+(A617*zterm1)^2))","v":1},{"$f":"IF(VOUT_setting=1,0,ATAN(((A617*zterm1))))","v":0},{"$f":"IF(VOUT_setting=1,1,SQRT((1+Afbr-$Q$5*(A617)^2)^2+(A617*$Q$4)^2))","v":1},{"$f":"IF(VOUT_setting=1,0,ATAN(A617*$Q$4/(1+Afbr-$Q$5*(A617)^2)))","v":0},{"$f":"SQRT((1-(A617^2/(pole3^2)))^2+(A617/(Q*pole3))^2)","v":0.92315940937251695},{"$f":"ATAN((A617/(Q*pole3))/(1-A617^2/pole3^2))","v":0.17929653297320047},{"$f":"20*LOG10(((E617*K617*G617*O617)/(C617*I617*S617*M617*Q617))*Adc)","v":1.9950129979983043E-2},{"$f":"((F617+L617+H617+P617)-(D617+J617+T617+N617+R617))*radconv","v":-94.218169073199206},{"$f":"IF(V617>0,V617,V617+180)","v":85.781830926800794},"crossover",null,null,null,{"$f":"20*LOG10((K617/(I617*M617))*AEA)","v":12.372666817623671},{"$f":"(L617-(J617+N617))*radconv","v":-18.424962606645206},null,{"$f":"20*LOG10((E617*G617/(C617*S617))*Acs*Am)","v":36.088757080131451},{"$f":"(F617+H617-(D617+T617))*radconv","v":-75.793206466553997}]
[{"$f":"A617","v":15136},null,null,null,null,null,null,null,null,null,null,null,null,null,null,null,null,null,null,null,null,-135]
[{"$f":"A618","v":15136}]
[1000000,null,null,null,null,null,null,null,null,null,null,null,null,null,null,null,null,null,null,null,null,{"$f":"V617","v":-94.218169073199206}]
[]
[{"$f":"pole1","v":2277.1939080607376},null,1.4142135623730951,0.78539816339744828,1.0009208149669695,4.2897760739427443E-2,{"$f":"IF(VIN_nom>Vout, 1, SQRT(1+(A622/z_RHP)^2))","v":1},{"$f":"IF(VIN_nom>Vout, 0, -ATAN(A622/z_RHP))","v":0},9157.6122441930402,1.5706871280239374,1.1058660940327472,0.44113271732642501,1.0000019505338025,{"$f":"ATAN(A622/pole4)","v":1.9751104434902315E-3},{"$f":"IF(VOUT_setting=1,1,SQRT(1+(A622*zterm1)^2))","v":1},{"$f":"IF(VOUT_setting=1,0,ATAN(((A622*zterm1))))","v":0},{"$f":"IF(VOUT_setting=1,1,SQRT((1+Afbr-$Q$5*(A622)^2)^2+(A622*$Q$4)^2))","v":1},{"$f":"IF(VOUT_setting=1,0,ATAN(A622*$Q$4/(1+Afbr-$Q$5*(A622)^2)))","v":0},{"$f":"SQRT((1-(A622^2/(pole3^2)))^2+(A622/(Q*pole3))^2)","v":0.99823309657720893},{"$f":"ATAN((A622/(Q*pole3))/(1-A622^2/pole3^2))","v":2.4815366979981601E-2},{"$f":"20*LOG10(((E622*K622*G622*O622)/(C622*I622*S622*M622*Q622))*Adc)","v":19.521050120344267},{"$f":"((F622+L622+H622+P622)-(D622+J622+T622+N622+R622))*radconv","v":-108.79582123424593},71.204178765754065,"p1",null,null,null,{"$f":"20*LOG10((K622/(I622*M622))*AEA)","v":19.345613303862486},{"$f":"(L622-(J622+N622))*radconv","v":-64.831866029919709},null,{"$f":"20*LOG10((E622*G622/(C622*S622))*Acs*Am)","v":48.616910584256921},{"$f":"(F622+H622-(D622+T622))*radconv","v":-43.96395520432619}]
[{"$f":"Zero1","v":53051.647757918792},null,23.318391253917046,1.5278985660554691,1.4142135623730951,0.78539816339744828,1,0,213344.33333567693,1.5707916395365835,11.045361017187261,1.4801364395941514,1.0010580883496816,4.598165356198966E-2,{"$f":"IF(VOUT_setting=1,1,SQRT(1+(A623*zterm1)^2))","v":1},{"$f":"IF(VOUT_setting=1,0,ATAN(((A623*zterm1))))","v":0},{"$f":"IF(VOUT_setting=1,1,SQRT((1+Afbr-$Q$5*(A623)^2)^2+(A623*$Q$4)^2))","v":1},{"$f":"IF(VOUT_setting=1,0,ATAN(A623*$Q$4/(1+Afbr-$Q$5*(A623)^2)))","v":0},0.59059301672292996,-1.3561612533779992,-4.6270413511557376,27.331461798142456,27.331461798142456,"z1",null,null,null,{"$f":"20*LOG10((K623/(I623*M623))*AEA)","v":11.980014887447869},{"$f":"(L623-(J623+N623))*radconv","v":-7.8287150406962907},null,31.834417529171532,35.160176838838758]
[{"$f":"Pole2","v":0.24866677698455608},null,1.0000000059621859,1.0919877095926486E-4,1.0000000000109852,4.6872583132088968E-6,1,0,1.4142135623730951,0.78539816339744828,1.0000000013292085,5.155984139998627E-5,1.0000000000000231,2.156799142554791E-7,1,0,1,0,0.99999999997892375,2.7047419999183642E-6,97.859306057523156,-45.003201286554294,134.99679871344571,"p2",null,null,{"$f":"Pole2","v":0.24866677698455608},{"$f":"20*LOG10((K624/(I624*M624))*AEA)","v":94.696924455535594},{"$f":"(L624-(J624+N624))*radconv","v":-44.99705824766086},null,51.603855369762712,-6.1430388934336786E-3]
[{"$f":"Zero2","v":4822.8770689017083},null,2.3421177297669913,1.1296636094684716,1.0041237288352056,9.065988720074511E-2,1,0,19394.939419719314,1.5707447669534966,1.4142135623730951,0.78539816339744828,1.0000087491197855,4.1830744666691887E-3,1,0,1,0,0.99208382957041485,5.290156101353604E-2,10.838664220086534,-107.79828283425489,72.201717165745109,"z2",null,null,{"$f":"Zero2","v":4822.8770689017083},{"$f":"20*LOG10((K625/(I625*M625))*AEA)","v":14.96367981540994},{"$f":"(L625-(J625+N625))*radconv","v":-45.236718402714978},null,44.316458172451732,-62.561564431539907]
[{"$f":"pole3","v":50000},null,21.97960792054517,1.5252838992192808,1.374141329728519,0.75579401558897541,1,0,201072.29685823168,1.5707913534593569,10.415372853730947,1.4746362752870159,1.0009399177127727,4.334009917732233E-2,1,0,1,0,0.54384868631366123,{"$error":"#DIV/0!"},-3.6414349372009451,{"$error":"#DIV/0!"},{"$error":"#DIV/0!"},"p3",null,null,null,{"$f":"20*LOG10((K626/(I626*M626))*AEA)","v":11.985515867311072},{"$f":"(L626-(J626+N626))*radconv","v":-7.9924849336973702},null,32.814522963263123,{"$error":"#DIV/0!"}]
[{"$f":"Fp2_u","v":1152943.6009048077},null,{"$f":"SQRT(1+(A627/pole1)^2)","v":506.30113038644316},{"$f":"ATAN(A627/pole1)","v":1.5688212163514064},{"$f":"SQRT(1+(A627/Zero1)^2)","v":21.755469733256081},{"$f":"ATAN(A627/Zero1)","v":1.5248146732329069},1,0,{"$f":"SQRT(1+(A627/Pole2)^2)","v":4636500.3595813699},{"$f":"ATAN(A627/Pole2)","v":1.5707961111149824},{"$f":"SQRT(1+(A627/Zero2)^2)","v":239.05931494311028},{"$f":"ATAN(A627/Zero2)","v":1.5666132523282275},{"$f":"SQRT(1+(A627/pole4)^2)","v":1.4142135623730951},0.78539816339744828,1,0,1,0,530.85972242270282,-2.3625269335055526E-2,-69.730790602832059,-46.407421176700431,{"$f":"IF(V627>0,V627,V627+180)","v":133.59257882329956},"p4",null,null,null,null,null,null,-30.232548735845302,-1.1677609702263281]
[{"$f":"z_RHP","v":0},null,{"$f":"SQRT(1+(A628/pole1)^2)","v":1},{"$f":"ATAN(A628/pole1)","v":0},{"$f":"SQRT(1+(A628/Zero1)^2)","v":1},{"$f":"ATAN(A628/Zero1)","v":0},1,0,{"$f":"SQRT(1+(A628/Pole2)^2)","v":1},{"$f":"ATAN(A628/Pole2)","v":0},{"$f":"SQRT(1+(A628/Zero2)^2)","v":1},{"$f":"ATAN(A628/Zero2)","v":0},{"$f":"SQRT(1+(A628/pole4)^2)","v":1},0,1,0,1,0,1,0,100.86960605412621,0,{"$f":"IF(V628>0,V628,V628+180)","v":180},"z_RHP",null,null,null,null,null,null,51.60385542127112,0]
[{"$f":"Fp2_u","v":1152943.6009048077},null,null,null,null,null,null,null,null,null,null,null,null,null,null,null,null,null,null,null,-25]
[]
[null,null,null,"System","Plant"]
["p1","p-dom",{"$f":"pole1","v":2277.1939080607376},{"$f":"U622","v":19.521050120344267},{"$f":"AE622","v":48.616910584256921}]
["z1","ESR zero",{"$f":"Zero1","v":53051.647757918792},{"$f":"U623","v":-4.6270413511557376},{"$f":"AE623","v":31.834417529171532}]
["p2","EA pole",{"$f":"Pole2","v":0.24866677698455608},{"$f":"U624","v":97.859306057523156},{"$f":"AE624","v":51.603855369762712}]
["z2","EA zero",{"$f":"Zero2","v":4822.8770689017083},{"$f":"U625","v":10.838664220086534},{"$f":"AE625","v":44.316458172451732}]
["p3","p_sampling",{"$f":"pole3","v":50000},{"$f":"U626","v":-3.6414349372009451},{"$f":"AE626","v":32.814522963263123}]
[]
[]
[{"$f":"U4*1000","v":15136}]
[{"$f":"U4*1000","v":15136}]
[]
[]
[]
[]
[]
[]
[]
[]
[]
[]
[]
[]
[]
[]
[]
[]
[]
[]
[]
[]
[]
[]
[]
[]
[]
[]
[]
[]
[]
[]
[]
[]
[]
[]
[]
[]
[]
[]
[]
[]
[]
[]
[]
[]
[]
[]
[null,null,null,null,null,null,null,null,null,null,null,null,null,null,null,null,null,null,null,null,null,null,null,null,null,null,null,null,null,null,null,null,null,"phase margin",{"$f":"SUM(AI689:AI1306)","v":0}]

{"sheet":"Bode Plot Management","index":8,"n_rows":6,"n_cols":14,"rows_kept":6,"cut":false,"hidden":true,"merged":[]}
[null,null,null,null,null,null,null,null,null,"Single or dual output (MODE)",null,null,null,"3.3V or 5V fixed (FB1/2)"]
[{"$f":"CHOOSE(BODE_PLOT_TYPE, \"BODE_PLOT_Ch1\", \"BODE_PLOT_Ch2\")","v":"BODE_PLOT_Ch1"},null,null,null,null,null,null,null,null,"With/without dither (DITH)",null,null,null,"With/without VOUT connected to VCCX"]
[null,null,null,null,null,null,null,null,null,"FPWM or DEM (DEMB)"]
[null,null,null,null,null,null,null,null,null,"Shunt or inductor DCR current sensing"]
[]
[null,null,null,null,null,{"$f":"INDIRECT(A2)","v":0}]

{"sheet":"Efficiency Calculations","index":9,"n_rows":109,"n_cols":57,"rows_kept":109,"cut":false,"hidden":true,"merged":[[6,24,6,26],[0,0,3,3],[5,0,6,3],[6,6,6,13],[6,17,6,20],[6,21,6,23],[6,51,6,56],[6,27,6,32],[6,33,6,36],[6,40,6,44],[6,45,6,49]]}
["BUCK CONTROLLER POWER DESIGN TOOL"]
[null,null,null,null,null,null,null,{"$f":"AV19","v":0.89465030697335113},"10% load"]
[null,null,null,null,null,null,null,{"$f":"AV59","v":0.94808719774529249},"50% load",null,null,null,null,null,null,null,null,null,null,null,null,null,null,null,null,null,null,null,null,null,null,null,null,null,null,null,null,null,null,null,null,{"$f":"IF(MODE=1, (Qg_Q1+Qg_Q2)*Fsw*Vin, (Qg_Q1+Qg_Q2+Qg_Q3+Qg_Q4)*Fsw*Vin)","v":3.4439999999999998E-2}]
[null,null,null,null,null,null,null,{"$f":"AV109","v":0.91995199785635695},"100% load",null,null,null,null,null,null,null,null,null,null,null,null,null,null,null,null,null,null,null,null,null,null,null,null,null,null,null,null,null,null,null,"I_VCC",{"$f":"(Qg_Q1+Qg_Q2)*Fsw*1000","v":2.0499999999999998},"mA",{"$f":"AP4*5/1000","v":1.025E-2}]
[]
["Enter the values of your design and MOSFET datasheet specifications below. Note that thermal resistance (θJA) will change when components are placed on the PCB"]
[null,null,null,null,null,null,"Operating Point Condtions",null,null,null,null,null,null,null,null,null,null,"Filter Inductor",null,null,null,"Cout",null,null,"Cin",null,null,"High-side BUCK \"Control\" MOSFET Losses ",null,null,null,null,null,"Low-side BUCK \"Sync\" MOSFET Losses ",null,null,null,"External Diode","Diode/FET","Sense Rs","Controller IC Losses",null,null,null,null,"RESULTS",null,null,null,null,null,"Consolidated Buck/Boost Efficiency & Losses"]
["Input Parameters",null,null,null,null,null,"Step","Vin","Mode","Iout","Iout/ phase","Iin","Duty Cycle BUCK Leg","Ripple Current pk-pk","Peak Inductor Current","Valley Inductor Current","SW node voltage at Q1 turn-on","Irms Lf","DCR    Loss","Core Loss","Total Inductor Loss","Irms Cout","Cout ESR Loss","Total Cout Loss","Irms Cin","Cin ESR Loss","Total Cin Loss","Irms","RDS(on) Loss","Transition Loss (not including capacitive loss)","MOSFET Output Capacitance Loss","Dead Time Loss ","Total Control MOSFET Loss","Irms","RDS(on) Loss","Deadtime Loss","Total Sync MOSFET Loss","Deadtime Loss","Reverse Recovery Loss","Isense Shunt Loss","IQ Loss","Switching Current Loss","Switching Current Diss","LDO Loss Saved from Gate Drive Current (ext VCC)","Total IC Loss","Total Loss","Pout","EFF, h",{"$f":"IF(Vin>Vout, \"Buck ''CONTROL'' MOSFET Temp Rise\", \"Boost ''CONTROL'' MOSFET Temp Rise\")","v":"Buck ''CONTROL'' MOSFET Temp Rise"},{"$f":"IF(Vin>Vout, \"Buck ''SYNC'' MOSFET Temp Rise\", \"Boost ''SYNC'' MOSFET Temp Rise\")","v":"Buck ''SYNC'' MOSFET Temp Rise"},null,"h","Inductor Cu & Core Loss","Total MOSFET Loss","Control MOSFET Loss","SYNC MOSFET Loss","Shunt Loss"]
["Design","Input Value","Units","Description",null,null,0,{"$f":"Vin","v":16.8},{"$f":"MODE","v":1},0,{"$f":"Iout*G9/100/Number_of_Phases","v":0},{"$f":"Vout*K9/(Vin*Efficiency)","v":0},{"$f":"(Vout+(Rdson2+Rs+Rdcr)*K9)/(Vin+(Rs+Rdson2-Rdson1)*K9)","v":0.44047619047619047},{"$f":"(Vin-(Rdson1+Rdcr)*K9-Vout)*M9/(Fsw*Lf)","v":12.546897546897549},{"$f":"K9+N9/2","v":6.2734487734487745},{"$f":"K9-N9/2","v":-6.2734487734487745},{"$f":"IF(MIN(Vin, -P9/(Coss_Q1+Coss_Q2)*0.00000002)<0, 0, MIN(Vin, -P9/(Coss_Q1+Coss_Q2)*0.00000002))","v":16.8},{"$f":"SQRT(K9^2+(N9^2)/12)","v":3.6219773380979774},{"$f":"R9^2*Rdcr","v":0.18366207772773435},{"$f":"Core_Loss_Ch1","v":0.2},{"$f":"(T9+S9*(1+Ltc*(Ta-25)))/(1-S9*Ltc*ThetaCa)","v":0.38938327300392039},{"$f":"N9/SQRT(12)","v":3.6219773380979778},{"$f":"RCoutEsr*V9^2","v":0.26237439675390628},{"$f":"W9","v":0.26237439675390628},{"$f":"SQRT(M9*(1-M9))*SQRT(K9^2+(N9^2)/12)","v":1.7981099060889754},{"$f":"RCinEsr*Y9^2","v":1.616599617187652E-4},{"$f":"Z9","v":1.616599617187652E-4},{"$f":"SQRT(M9)*SQRT(K9^2+(N9^2)/12)","v":2.4038476944333347},{"$f":"Rdson1*AB9^2","v":0.14446209345081149},{"$f":"(Vin*K9/2)*Fsw*(Tr_buck+Tf_buck)","v":0},{"$f":"(0.5*Coss_Q1*(Vin-Q9)^2-0.5*Coss_Q2*(Vin-Q9)^2+(Qoss_Q2*(Vin-Q9)/Vin)*Vin)*Fsw","v":0},{"$f":"IF(K9>N9/2,0,ABS(K9-N9/2)*Vsd_Q1*Deadtime*Fsw)","v":7.0262626262626278E-3},{"$f":"(AF9+AE9+AD9+AC9*(1+RdsonTopTc*Ta-RdsonTopTc*25))/(1-AC9*RdsonTopTc*ThetaJA_Q1)","v":0.15534837164600504},{"$f":"SQRT((1-M9))*SQRT(K9^2+(N9^2)/12)","v":2.7092870094663009},{"$f":"Rdson2*AH9^2","v":8.0742597096291363E-2},{"$f":"IF(K9<N9/2,Deadtime*Fsw*IF(VfdSky_Q2>0,0,Vsd_Q2)*(K9+N9/2),2*Deadtime*Fsw*IF(VfdSky_Q2>0,0,Vsd_Q2)*K9)","v":7.0262626262626278E-3},{"$f":"(AJ9+AI9*(1+RdsonBotTc*Ta-RdsonBotTc*25))/(1-AI9*RdsonBotTc*ThetaJA_Q2)","v":8.8859420258511734E-2},{"$f":"2*Deadtime*Fsw*IF(VfdSky_Q2>0,VfdSky_Q2,Vsd_Q2)*K9","v":0},{"$f":"IF(QrrSky_Q2>0,QrrSky_Q2,Qrr_Q2*K9/(Iout/Number_of_Phases))*Fsw*Vin","v":0},{"$f":"Rs*R9^2","v":4.5915519431933588E-2},{"$f":"Iq*Vin","v":3.6960000000000005E-5},{"$f":"IF(Ext_VCC=1,  (Qg_Q1+Qg_Q2)*Fsw*VCC, (Qg_Q1+Qg_Q2)*Fsw*Vin)","v":3.4439999999999998E-2},{"$f":"(Vin-VCC)*Fsw*(Qg_Q1+Qg_Q2)+(RdsonDRT+RdsonDRT2)*Fsw*Qg_Q1*VCC/(RdsonDRT+2*Rgate1+RdsonDRT2)+(RdsonDRB+RdsonDRB2)*Fsw*Qg_Q2*VCC/(RdsonDRB+2*Rgate2+RdsonDRB2)","v":3.0339999999999999E-2},{"$f":"(Qg_Q1+Qg_Q2)*Fsw*(Vin-VCC)","v":2.419E-2},{"$f":"SUM(AO9:AP9)","v":3.4476960000000001E-2},{"$f":" SUM(U9,X9,AA9,AG9,AK9,AL9,AM9,AS9,AN9)","v":0.97651960105599589},{"$f":"Vout*K9","v":0},{"$f":"AU9/(AU9+AT9)","v":0},{"$f":"ThetaJA_Q1*BC9","v":6.6799799807782163},{"$f":"ThetaJA_Q2*BD9","v":3.3766579698234458},null,{"$f":"AV9*100","v":0},{"$f":"U9","v":0.38938327300392039},{"$f":"AG9+AK9+AM9","v":0.24420779190451677},{"$f":"AG9+AM9*0.66","v":0.15534837164600504},{"$f":"AK9+AM9*0.33","v":8.8859420258511734E-2},{"$f":"AN9","v":4.5915519431933588E-2}]
[null,null,null,null,null,null,1,16.8,1,{"$f":"Iout*G10/100","v":0.12},0.12,5.873015873015873E-2,0.44071281536591433,12.547387662011159,{"$f":"K10+N10/2","v":6.3936938310055798},{"$f":"K10-N10/2","v":-6.1536938310055795},16.8,{"$f":"SQRT(K10^2+(N10^2)/12)","v":3.6241060638083553},0.18387802666425487,0.2,0.38960927341348411,{"$f":"N10/SQRT(12)","v":3.6221188221443663},0.26239489523464982,{"$f":"W10","v":0.26239489523464982},{"$f":"SQRT(M10*(1-M10))*SQRT(K10^2+(N10^2)/12)","v":1.7992693134105806},1.6186850310904912E-4,{"$f":"Z10","v":1.6186850310904912E-4},{"$f":"SQRT(M10)*SQRT(K10^2+(N10^2)/12)","v":2.4059064643843913},0.14470964788416504,3.1932051649928269E-4,0,6.8921370907262499E-3,0.15579895063271723,2.7103060429342456,8.0803347310024767E-2,7.1609370907262503E-3,8.905810574423309E-2,2.6880000000000003E-4,1.0079999999999998E-3,4.5969506666063718E-2,3.6960000000000005E-5,3.4439999999999998E-2,3.0339999999999999E-2,2.419E-2,3.4476960000000001E-2,0.97874636019425698,0.88800000000000001,{"$f":"AU10/(AU10+AT10)","v":0.47569397692978121},6.7279619172068408,3.3968483382808574,null,{"$f":"AV10*100","v":47.569397692978121},0.38960927341348411,0.24586505637695033,0.15646423063271722,8.9390745744233086E-2,4.5969506666063718E-2]
["Vin",{"$f":"Vin","v":16.8},"V","Vin",null,null,2,16.8,1,0.24,0.24,0.11746031746031746,0.44094947575469656,12.547872075760861,6.5139360378804305,-6.0339360378804301,16.8,3.630200793685054,0.18449700923460235,0.2,0.39025711081686221,3.6222586603487605,0.26241515604943194,0.26241515604943194,1.8023975660021285,1.6243184929651987E-4,1.6243184929651987E-4,2.4105995030920555,0.14527474910769164,6.3864103299856537E-4,0,6.7580083624260816E-3,0.15658400320936547,2.7142895641703246,8.1041046219803237E-2,7.2956083624260834E-3,8.9438377899237073E-2,5.3760000000000006E-4,2.0159999999999996E-3,4.6124252308650589E-2,3.6960000000000005E-5,3.4439999999999998E-2,3.0339999999999999E-2,2.419E-2,3.4476960000000001E-2,0.98201189213284379,1.776,0.64394211100611753,6.7903262180027157,3.4239390001710088,null,64.394211100611756,0.39025711081686221,0.24803838110860252,0.15791456320936548,9.0103657899237077E-2,4.6124252308650589E-2]
["Vout",{"$f":"Vout","v":7.4},"V","Vout",null,null,3,16.8,1,0.36,0.36,0.17619047619047618,0.44118617165052609,12.548350786863553,6.6341753934317769,-5.9141753934317762,16.8,3.6402416067959367,0.18551902538187567,0.2,0.39132691237300676,3.6223968523407626,0.26243517911696529,0.26243517911696529,1.8074851059900012,1.6335012041878431E-4,1.6335012041878431E-4,2.4179156988814987,0.14615790817244018,9.5796154949784795E-4,0,6.6238764406435892E-3,0.15770429982090065,2.7212207975375051,8.1455468918457202E-2,7.4302764406435906E-3,9.0000056878126525E-2,8.0640000000000009E-4,3.0239999999999998E-3,4.6379756345468919E-2,3.6960000000000005E-5,3.4439999999999998E-2,3.0339999999999999E-2,2.419E-2,3.4476960000000001E-2,0.9863169146548868,2.6640000000000001,0.72979964816338783,6.867106012298728,3.457923121368808,null,72.979964816338779,0.39132691237300676,0.25072835669902721,0.15970013982090064,9.0997976878126524E-2,4.6379756345468919E-2]
["Fsw",{"$f":"Fsw/1000","v":100},"kHz","Switching Frequency",null,null,4,16.8,1,0.48,0.48,0.23492063492063492,0.44142290306139464,12.548823794035762,6.7544118970178815,-5.7944118970178806,16.8,3.6541959741936632,0.18694407504938446,0.2,0.39281888814589339,3.6225333977498644,0.26245496435626353,0.26245496435626353,1.8145161100506502,1.6462343568166715E-4,1.6462343568166715E-4,2.4278355486556702,0.14735963628290447,1.2772820659971307E-3,0,6.4897413246600257E-3,0.15916072471227091,2.7310735556731158,8.2046390431466942E-2,7.5649413246600284E-3,9.0742992272002956E-2,1.0752000000000001E-3,4.0319999999999991E-3,4.6736018762346114E-2,3.6960000000000005E-5,3.4439999999999998E-2,3.0339999999999999E-2,2.419E-2,3.4476960000000001E-2,0.9916623716844587,3.552,0.78174822630651963,6.9583393226276486,3.4987949863361121,null,78.17482263065196,0.39281888814589339,0.25393571698427386,0.1618218447122709,9.2073552272002951E-2,4.6736018762346114E-2]
["Iout",{"$f":"Iout","v":12},"A","Max Output Current",null,null,5,16.8,1,0.6,0.6,0.29365079365079366,0.44165966999529588,12.549291095993613,6.8746455479968063,-5.674645547996807,16.8,3.6720192788617068,0.18877215818064869,0.2,0.39473333120768156,3.6226682962054433,0.26247451168664099,0.26247451168664099,1.82346874587144,1.6625191335849812E-4,1.6625191335849812E-4,2.4403314922123225,0.14888044479708051,1.5966025824964134E-3,0,6.3556030137564244E-3,0.16095427681715255,2.743812638000056,8.2813585716937088E-2,7.6996030137564241E-3,9.166706301410496E-2,1.3440000000000001E-3,5.0399999999999993E-3,4.7193039545162171E-2,3.6960000000000005E-5,3.4439999999999998E-2,3.0339999999999999E-2,2.419E-2,3.4476960000000001E-2,0.99804943418410086,4.4400000000000004,0.81646922370542163,7.0640691031375598,3.5465499945359884,null,81.646922370542157,0.39473333120768156,0.2576613398312575,0.16428067681715255,9.3330263014104964E-2,4.7193039545162171E-2]
["Ta",{"$f":"Ta","v":25},"°C","Ambient Temperature",null,null,6,16.8,1,0.72,0.72,0.35238095238095235,0.44189647246022623,12.549752691452863,6.9948763457264311,-5.5548763457264316,16.8,3.6936555133614855,0.19100327471939979,0.2,0.39707061778270797,3.6228015473367705,0.26249382102771396,0.26249382102771396,1.8343155169675707,1.6823567078940029E-4,1.6823567078940029E-4,2.455368365248078,0.15072084522652548,1.9159230989956959E-3,0,6.2214615072136038E-3,0.1630860707462736,2.7593943615084595,8.3756829665571464E-2,7.8342615072136031E-3,9.2772177297429023E-2,1.6128000000000002E-3,6.0479999999999996E-3,4.7750818679849948E-2,3.6960000000000005E-5,3.4439999999999998E-2,3.0339999999999999E-2,2.419E-2,3.4476960000000001E-2,1.0054795012047639,5.3280000000000003,0.84124374271464841,7.184343282089765,3.6011846573023027,null,84.124374271464845,0.39707061778270797,0.26190624804370261,0.1670777507462736,9.4768017297429022E-2,4.7750818679849948E-2]
["Vcc",{"$f":"VCC","v":5},"V","Subregulated VCC Voltage",null,null,7,16.8,1,0.84,0.84,0.41111111111111109,0.44213331046418414,12.550208579128865,7.1151042895644325,-5.4351042895644328,16.8,3.7190381303463376,0.19363742460957975,0.2,0.39983120743244027,3.6229331507730009,0.26251289229939967,0.26251289229939967,1.8470236835545748,1.7057482438057549E-4,1.7057482438057549E-4,2.4729039547577658,0.15288134923641497,2.2352436154949788E-3,0,6.0873168043121643E-3,0.16555733787700982,2.7777672050611768,8.4875897100647191E-2,7.968916804312165E-3,9.4058272504256815E-2,1.8816000000000002E-3,7.0559999999999998E-3,4.8409356152394938E-2,3.6960000000000005E-5,3.4439999999999998E-2,3.0339999999999999E-2,2.419E-2,3.4476960000000001E-2,1.0139542010898821,6.2160000000000002,0.859756483528342,7.3192148087114219,3.6626965951617589,null,85.975648352834199,0.39983120743244027,0.26667161038126663,0.17021429787700981,9.6386752504256809E-2,4.8409356152394938E-2]
["Components","Input Value","Units","Description",null,null,8,16.8,1,0.96,0.96,0.46984126984126984,0.44237018401517098,12.550658757736606,7.2353293788683031,-5.3153293788683031,16.8,3.7480910169172628,0.19667460779534235,0.2,0.40301564328156553,3.6230631061431819,0.26253172542191761,0.26253172542191761,1.8615557450884552,1.7326948960359168E-4,1.7326948960359168E-4,2.4928896377144505,0.1553624686456021,2.5545641319942615E-3,0,5.9531689043324995E-3,0.16836942754610659,2.7988725453781913,8.6170562777989748E-2,8.1035689043324997E-3,9.5525315147524922E-2,2.1504000000000002E-3,8.0639999999999983E-3,4.9168651948835587E-2,3.6960000000000005E-5,3.4439999999999998E-2,3.0339999999999999E-2,2.419E-2,3.4476960000000001E-2,1.023475392835554,7.1040000000000001,0.87407216344970329,7.4687417044825839,3.7310845356059472,null,87.407216344970323,0.40301564328156553,0.27195874269363152,0.1736916675461066,9.8186435147524925E-2,4.9168651948835587E-2]
["L",{"$f":"Lf*1000000","v":3.3},"uH","Filter Inductance",null,null,9,16.8,1,1.08,1.08,0.52857142857142858,0.44260709312119018,12.551103225990678,7.3555516129953391,-5.195551612995339,16.8,3.7807295613134597,0.20011482422105251,0.2,0.40662455228541733,3.6231914130762495,0.2625503203157894,0.2625503203157894,1.8778699688459168,1.7631978099466825E-4,1.7631978099466825E-4,2.5152710822229478,0.15816471542667498,2.8738846484935442E-3,0,5.8190178065547797E-3,0.17152380834754791,2.8226454610387162,8.7640601385947134E-2,8.2382178065547804E-3,9.7173300823978292E-2,2.4192000000000003E-3,9.0720000000000002E-3,5.0028706055263127E-2,3.6960000000000005E-5,3.4439999999999998E-2,3.0339999999999999E-2,2.419E-2,3.4476960000000001E-2,1.0340451676089906,7.9920000000000009,0.88543762540433746,7.6329871189445599,3.8063483113111749,null,88.543762540433747,0.40662455228541733,0.27776910917152625,0.1775113283475479,0.10016706082397829,5.0028706055263127E-2]
["Rdcr",{"$f":"Rdcr*1000","v":14},"mW","Inductor DCR at 25°C",null,null,10,16.8,1,1.2,1.2,0.58730158730158732,0.44284403779024745,12.551541982605279,7.4757709913026398,-5.0757709913026394,16.8,3.8168617796682009,0.2039580738312867,0.2,0.41065864553899051,3.6233180712010236,0.26256867690183811,0.26256867690183811,1.8959209485311388,1.7972581215396066E-4,1.7972581215396066E-4,2.5399889897872785,0.161288601706015,3.1932051649928269E-3,0,5.6848635102589558E-3,0.17502206953777869,2.8490155803103825,8.9285787545364356E-2,8.3728635102589578E-3,9.9002254179061167E-2,2.6880000000000003E-3,1.0079999999999999E-2,5.0989518457821674E-2,3.6960000000000005E-5,3.4439999999999998E-2,3.0339999999999999E-2,2.419E-2,3.4476960000000001E-2,1.0456658504276442,8.8800000000000008,0.89465030697335113,7.8120193901244832,3.8884888588043243,null,89.465030697335109,0.41065864553899051,0.2841043237168398,0.18167486953777867,0.10232865417906116,5.0989518457821674E-2]
["LTc",{"$f":"Ltc*1000000","v":4000},"ppm","Inductor Series Resistance Temp Co",null,null,11,16.8,1,1.32,1.32,0.64603174603174607,0.44308101803035127,12.55197502629424,7.5959875131471204,-4.9559875131471198,16.8,3.8563894713915405,0.20820435657083336,0.2,0.41511871862782662,3.6234430801462199,0.26258679510119054,0.26258679510119054,1.915660177301008,1.8348769574484647E-4,1.8348769574484647E-4,2.5669798578396019,0.16473463976385558,3.5125256814921091E-3,0,5.5507060147247742E-3,0.17886592255066766,2.8779079492758806,9.1105895809558357E-2,8.507506014724775E-3,0.10101222888350622,2.9568000000000003E-3,1.1088000000000001E-2,5.205108914270834E-2,3.6960000000000005E-5,3.4439999999999998E-2,3.0339999999999999E-2,2.419E-2,3.4476960000000001E-2,1.0583400020016442,9.7680000000000007,0.90224397148011504,8.0059121096787091,3.9775082175732366,null,90.224397148011505,0.41511871862782662,0.29096615143417387,0.18618400255066767,0.10467126888350622,5.205108914270834E-2]
["ThetaCa",{"$f":"ThetaCa","v":20},"°C/W","Core to Ambient Thermal Resistance",null,null,12,16.8,1,1.44,1.44,0.7047619047619047,0.44331803384951218,12.55240235577099,7.7162011778854946,-4.8362011778854956,16.8,3.8992093739325875,0.21285367238469266,0.2,0.42000565202109402,3.6235664395404372,0.26260467483527522,0.26260467483527522,1.9370366206822656,1.8760554349320856E-4,1.8760554349320856E-4,2.5961767430923461,0.16850334203433956,3.8318461979913918E-3,0,5.4165453192317548E-3,0.183057202624789,2.9092438984021567,9.3100700664291949E-2,8.6421453192317543E-3,0.10320330762159098,3.2256000000000003E-3,1.2095999999999999E-2,5.3213418096173165E-2,3.6960000000000005E-5,3.4439999999999998E-2,3.0339999999999999E-2,2.419E-2,3.4476960000000001E-2,1.0720704207424157,10.656000000000001,0.90858936020316372,8.2147441928659273,4.0734095296204575,null,90.858936020316378,0.42000565202109402,0.29835651024637999,0.191040562624789,0.10719498762159098,5.3213418096173165E-2]
["Cin",{"$f":"Cin*1000000","v":160},"μF","Input Capacitance",null,null,13,16.8,1,1.56,1.56,0.76349206349206344,0.44355508525574344,12.552823969748577,7.8364119848742888,-4.7164119848742878,16.8,3.9452142909214958,0.21790602121807681,0.2,0.42532041150722683,3.623688149012164,0.26262231602582409,0.26262231602582409,1.9599972764609614,1.9207946618671933E-4,1.9207946618671933E-4,2.6275100083963783,0.1725952211055784,4.1511667144906745E-3,0,5.2823814230592023E-3,0.18759787054580393,2.9429418881568261,9.5269976527748698E-2,8.7767814230592048E-3,0.10557560209104161,3.4944000000000004E-3,1.3103999999999999E-2,5.4476505304519203E-2,3.6960000000000005E-5,3.4439999999999998E-2,3.0339999999999999E-2,2.419E-2,3.4476960000000001E-2,1.0868601449406026,11.544,0.91395200861471382,8.4385999534695699,4.1761970394595807,null,91.39520086147138,0.42532041150722683,0.30627747263684557,0.19624651054580394,0.1098999220910416,5.4476505304519203E-2]
["RCinEsr",{"$f":"RCinEsr*1000","v":0.05},"mW","Input Capacitor ESR",null,null,14,16.8,1,1.68,1.68,0.82222222222222219,0.44379217225706041,12.553239866939656,7.9566199334698275,-4.5966199334698281,16.8,3.994294171658316,0.2233614030164103,0.2,0.43106404867252468,3.6238082081897764,0.26263971859487195,0.26263971859487195,1.9844877105899348,1.9690957367412404E-4,1.9690957367412404E-4,2.660908038393734,0.17701078971970974,4.4704872309899576E-3,0,5.1482143254862073E-3,0.19249001450692282,2.9789183172680658,9.7613497750507247E-2,8.9114143254862086E-3,0.10812925301457053,3.7632000000000004E-3,1.4112E-2,5.5840350754102576E-2,3.6960000000000005E-5,3.4439999999999998E-2,3.0339999999999999E-2,2.419E-2,3.4476960000000001E-2,1.1027124551166665,12.432,0.9185270866467653,8.6775691837976812,4.2858760945536805,null,91.852708664676527,0.43106404867252468,0.31473126752149339,0.20180393450692283,0.11278621301457054,5.5840350754102576E-2]
["Cout",{"$f":"Cout*1000000","v":150},"μF","Output Capcitance",null,null,15,16.8,1,1.8,1.8,0.88095238095238093,0.44402929486148107,12.553650046056505,8.0768250230282526,-4.4768250230282529,16.8,4.0463371242690442,0.22921981772533032,0.2,0.4372377014231591,3.6239266167015409,0.26265688246475755,0.26265688246475755,2.0104525603183165,2.0209597486452375E-4,2.0209597486452375E-4,2.6962979121228905,0.18175056077295648,4.7898077474892399E-3,0,5.0140440257916427E-3,0.19773585209064912,3.0170882804982058,0.10013103861551582,9.0460440257916445E-3,0.11086443016304441,4.0320000000000009E-3,1.512E-2,5.7304954431332579E-2,3.6960000000000005E-5,3.4439999999999998E-2,3.0339999999999999E-2,2.419E-2,3.4476960000000001E-2,1.1196308765478074,13.32,0.92246125360681752,8.931747239897911,4.4024531461956879,null,92.246125360681759,0.4372377014231591,0.32372028225369354,0.20771505209064911,0.11585403016304441,5.7304954431332579E-2]
["RCoutEsr",{"$f":"Cout_ESR*1000","v":20},"mW","Output Capacitor ESR",null,null,16,16.8,1,1.92,1.92,0.93968253968253967,0.44426645307702578,12.554054505811017,8.1970272529055084,-4.3570272529055085,16.8,4.1012303492861939,0.23548126529068616,0.2,0.44384259455106917,3.6240433741756126,0.2626738075581232,0.2626738075581232,2.0378359979481036,2.0763877772665717E-4,2.0763877772665717E-4,2.7336060236667938,0.18681504731568452,5.109128263988523E-3,0,4.8798705232541697E-3,0.20333773237522271,3.0573662661314853,0.10282237333806658,9.180670523254171E-3,0.11378133239028715,4.3008000000000005E-3,1.6127999999999997E-2,5.8870316322671541E-2,3.6960000000000005E-5,3.4439999999999998E-2,3.0339999999999999E-2,2.419E-2,3.4476960000000001E-2,1.1376191819751005,14.208,0.92586684391912033,9.2012351321345758,4.5259357508309117,null,92.58668439191203,0.44384259455106917,0.33324706476550986,0.21398221237522269,0.11910357239028715,5.8870316322671541E-2]
["Top Driver","Input Value","Units","Description",null,null,17,16.8,1,2.04,2.04,0.99841269841269842,0.44450364691171718,12.554453244914683,8.3172266224573406,-4.2372266224573414,16.8,4.1588609846802687,0.24214574565854027,0.2,0.45088004034427764,3.6241584802400317,0.2626904937979147,0.2626904937979147,2.066582150741572,2.1353808928818309E-4,2.1353808928818309E-4,2.7727586447612866,0.19220476255246119,5.4284487804878061E-3,0,4.7456938171522222E-3,0.20929813816941958,3.0996667865751775,0.10568727606577015,9.3152938171522232E-3,0.11688018767953204,4.5696000000000009E-3,1.7135999999999998E-2,6.0536436414635068E-2,3.6960000000000005E-5,3.4439999999999998E-2,3.0339999999999999E-2,2.419E-2,3.4476960000000001E-2,1.1566813944950671,15.096000000000002,0.92883134995270089,9.4861396212850426,4.656332571822217,null,92.883134995270083,0.45088004034427764,0.34331432584895161,0.22060789816941959,0.12253506767953204,6.0536436414635068E-2]
["RdsonDRT",0.7,"W","Drain to Source Resistance of pullup Top FET Driver",null,null,18,16.8,1,2.16,2.16,1.0571428571428572,0.44474087637358056,12.554846262078627,8.4374231310393135,-4.1174231310393132,16.8,4.2191168572782072,0.2492132587751679,0.2,0.45835143924219479,3.624271934522731,0.26270694110738274,0.26270694110738274,2.0966354744445277,2.1979401563496152E-4,2.1979401563496152E-4,2.8136824258762001,0.19792021984211447,5.7477692969870884E-3,0,4.6115139067640304E-3,0.21561968837960283,3.1439049383981947,0.10872552087853012,9.4499139067640327E-3,0.12016125320154489,4.8384000000000005E-3,1.8144E-2,6.2303314693791974E-2,3.6960000000000005E-5,3.4439999999999998E-2,3.0339999999999999E-2,2.419E-2,3.4476960000000001E-2,1.1768217906401519,15.984000000000002,0.93142392567225352,9.7865733203229208,4.7936533816587055,null,93.142392567225357,0.45835143924219479,0.35392494158114768,0.22759472837960282,0.12614877320154488,6.2303314693791974E-2]
["RdsonDRT2",{"$f":"RdsonDRT2","v":0.5},"W","Drain to Source Resistance of pulldown Top FET Driver",null,null,19,16.8,1,2.2799999999999998,2.2799999999999998,1.1158730158730157,0.4449781414706433,12.555233556013567,8.5576167780067838,-3.9976167780067837,16.8,4.281887138926491,0.25668380458705731,0.2,0.46625828053652407,3.6243837366515277,0.26272314941008179,0.26272314941008179,2.1279410795900069,2.2640666191033423E-4,2.2640666191033423E-4,2.8563048345566355,0.20396193269779023,6.0670898134863697E-3,0,4.477330791367598E-3,0.2223051405131721,3.1899968906869614,0.11193688178851728,9.584530791367599E-3,0.12362481538444897,5.1072000000000001E-3,1.9151999999999995E-2,6.4170951146764327E-2,3.6960000000000005E-5,3.4439999999999998E-2,3.0339999999999999E-2,2.419E-2,3.4476960000000001E-2,1.1980449036529017,16.872,0.93369994872504636,10.1026548020664,4.9379090646090606,null,93.369994872504634,0.46625828053652407,0.3650819558976211,0.23494546051317211,0.12994497538444896,6.4170951146764327E-2]
["Bottom Driver","Input Value","Units","Description",null,null,20,16.8,1,2.4,2.4,1.1746031746031746,0.44521544221093545,12.555615125429851,8.6778075627149249,-3.8778075627149255,16.8,4.3470629086192867,0.26455738304091003,0.2,0.47460214311843163,3.6244938862541307,0.26273911862987143,0.26273911862987143,2.160445011169716,2.3337613231440573E-4,2.3337613231440573E-4,2.9005545317198349,0.21033041478701175,6.3864103299856537E-3,0,4.3431444702407163E-3,0.22935739332283228,3.2378603027328254,0.11532113274014413,9.7191444702407169E-3,0.12727118999529222,5.3760000000000006E-3,2.0159999999999997E-2,6.6139345760227508E-2,3.6960000000000005E-5,3.4439999999999998E-2,3.0339999999999999E-2,2.419E-2,3.4476960000000001E-2,1.2203555269589696,17.760000000000002,0.93570428513703963,10.434508712881788,5.0891116198211037,null,93.570428513703959,0.47460214311843163,0.37678858331812454,0.24266299332283228,0.1339239899952922,6.6139345760227508E-2]
["RdsonDRB",0.7,"W","Drain to Source Resistance of pullup Bottom FET Driver",null,null,21,16.8,1,2.52,2.52,1.2333333333333332,0.44545277860248939,12.555990969037421,8.7979954845187098,-3.7579954845187102,16.8,4.4145376240944838,0.27283399408364079,0.2,0.48338469627267938,3.6246023829581326,0.26275484869091548,0.26275484869091548,2.1940944833954727,2.4070253010332232E-4,2.4070253010332232E-4,2.9463616881281727,0.21702617993173742,6.7057308464849377E-3,0,4.2089549426609554E-3,0.23677948959636858,3.2874146737636059,0.11887804761003902,9.8537549426609555E-3,0.13110072223340472,5.644800000000001E-3,2.1167999999999999E-2,6.8208498520910196E-2,3.6960000000000005E-5,3.4439999999999998E-2,3.0339999999999999E-2,2.419E-2,3.4476960000000001E-2,1.2437587178443814,18.648,0.93747366758834461,10.782265892643849,5.2472741648693795,null,93.74736675883446,0.48338469627267938,0.38904821182977328,0.25075036959636859,0.13808616223340472,6.8208498520910196E-2]
["RdsonDRB2",0.5,"W","Drain to Source Resistance of pulldown Bottom FET Driver",null,null,22,16.8,1,2.64,2.64,1.2920634920634921,0.44569015065333989,12.556361085545843,8.9181805427729213,-3.6381805427729215,16.8,4.4842075081204893,0.28151363766237836,0.2,0.49260770051947739,3.6247092263910172,0.26277033951768336,0.26277033951768336,2.2288380721288505,2.4838595758855256E-4,2.4838595758855256E-4,2.9936582444121433,0.22404974210841991,7.0250513629842182E-3,0,4.0747622079056718E-3,0.24457461909691766,3.3385816287081211,0.12260740020702107,9.9883622079056725E-3,0.13511378683560468,5.9136000000000006E-3,2.2176000000000001E-2,7.0378409415594589E-2,3.6960000000000005E-5,3.4439999999999998E-2,3.0339999999999999E-2,2.419E-2,3.4476960000000001E-2,1.2682598013428663,19.536000000000001,0.93903845590021895,11.146063501167459,5.412410939752978,null,93.903845590021888,0.49260770051947739,0.40186440593252237,0.25921077909691764,0.14243186683560469,7.0378409415594589E-2]
["Deadtime","Input Value","Units","Description",null,null,23,16.8,1,2.76,2.76,1.3507936507936507,0.44592755837152426,12.556725473664297,9.0383627368321484,-3.5183627368321488,16.8,4.5559718558994069,0.29059631372446482,0.2,0.50227300850484924,3.6248144161801568,0.26278559103494981,0.26278559103494981,2.2646258681564388,2.5642651613616525E-4,2.5642651613616525E-4,3.0423781188278647,0.23140161544806445,7.3443718794834996E-3,0,3.9405662652520074E-3,0.25274612165902244,3.3912851448713228,0.126508964272074,1.0122966265252007E-2,0.13931078819331796,6.1824000000000002E-3,2.3183999999999996E-2,7.2649078431116204E-2,3.6960000000000005E-5,3.4439999999999998E-2,3.0339999999999999E-2,2.419E-2,3.4476960000000001E-2,1.2938643743393918,20.423999999999999,0.9404239591868826,11.526045151337964,5.5845373113460823,null,94.042395918688257,0.50227300850484924,0.41524090985234041,0.26804756165902244,0.14696150819331796,7.2649078431116204E-2]
["Deadtime",{"$f":"Deadtime*1000000000","v":14},"ns","Total Deadtime",null,null,24,16.8,1,2.88,2.88,1.4095238095238094,0.44616500176508189,12.557084132101565,9.1585420660507815,-3.3985420660507826,16.8,4.629733270760827,0.30008202221745645,0.2,0.5123825659403648,3.6249179519528085,0.26280060316779486,0.26280060316779486,2.3014095948618465,2.648243061661084E-4,2.648243061661084E-4,3.0924573674428375,0.23908231423628715,7.6636923959827836E-3,0,3.8063671139768763E-3,0.26129749044608402,3.44545172494671,0.13058251347832084,1.0257567113976877E-2,0.14369216048168773,6.4512000000000007E-3,2.4191999999999998E-2,7.5020505554364111E-2,3.6960000000000005E-5,3.4439999999999998E-2,3.0339999999999999E-2,2.419E-2,3.4476960000000001E-2,1.3205783098964616,21.312000000000001,0.94165144192524375,11.922361049181612,5.7636697783041333,null,94.16514419252438,0.5123825659403648,0.42918165092777172,0.27726421044608401,0.15167552048168773,7.5020505554364111E-2]
["IQ","Input Value","Units","Description",null,null,25,16.8,1,3,3,1.4682539682539684,0.44640248084205508,12.557437059566055,9.2787185297830277,-3.2787185297830277,16.8,4.7053978356861865,0.30997076308912347,0.2,0.52293841259313212,3.6250198333361228,0.26281537584160503,0.26281537584160503,2.3391426940291051,2.7357942715148701E-4,2.7357942715148701E-4,3.1438343016983219,0.24709235291337439,7.9830129124820685E-3,0,3.6721647533569908E-3,0.27023237537516237,3.5010105220557786,0.13482782143099803,1.0392164753356992E-2,0.1482583678007578,6.7200000000000003E-3,2.5199999999999997E-2,7.7492690772280867E-2,3.6960000000000005E-5,3.4439999999999998E-2,3.0339999999999999E-2,2.419E-2,3.4476960000000001E-2,1.3484077618100898,22.200000000000003,0.94273889872091965,12.33516814113198,5.9498259764287962,null,94.273889872091971,0.52293841259313212,0.44369074317592017,0.28686437537516235,0.15657436780075779,7.7492690772280867E-2]
["IQ ",{"$f":"Iq*1000","v":2.2000000000000001E-3},"mA","Quiescent Current Of Controller (Not Switching!)",null,null,26,16.8,1,3.12,3.12,1.5269841269841269,0.44663999561048806,12.557784254765769,9.3988921273828847,-3.1588921273828845,16.8,4.7828752282600462,0.32026253628745022,0.2,0.5339426833270049,3.6251200599571307,0.26282990898207181,0.26282990898207181,2.3777803835419271,2.8269197761783972E-4,2.8269197761783972E-4,3.1964495683451055,0.25543224607434029,8.302333428981349E-3,0,3.5379591826688308E-3,0.27955458671542871,3.5578934225367091,0.13924466166742974,1.0526759182668832E-2,0.15300990432882355,6.9888000000000007E-3,2.6207999999999999E-2,8.0065634071862554E-2,3.6960000000000005E-5,3.4439999999999998E-2,3.0339999999999999E-2,2.419E-2,3.4476960000000001E-2,1.3773591694028096,23.088000000000001,0.9437016575205085,12.764630268763435,6.1430246844952947,null,94.370165752050852,0.5339426833270049,0.45877249104425227,0.29685186671542874,0.16165854432882354,8.0065634071862554E-2]
["High-side FET","Input Value","Units","Description",null,null,27,16.8,1,3.24,3.24,1.5857142857142859,0.44687754607842789,12.558125716408343,9.5190628582041725,-3.0390628582041712,16.8,4.8620787864615806,0.33095734176063601,0.2,0.54539760919600533,3.6252186314427597,0.2628442025151943,0.2628442025151943,2.417279690654011,2.9216205514241754E-4,2.9216205514241754E-4,3.2502461966379523,0.26410250846898692,8.621653945480633E-3,0,3.4037504011886714E-3,0.28926809886695698,3.6160350920587376,0.14383280765700265,1.0661350401188674E-2,0.15794729448805406,7.2576000000000012E-3,2.7216000000000001E-2,8.2739335440159004E-2,3.6960000000000005E-5,3.4439999999999998E-2,3.0339999999999999E-2,2.419E-2,3.4476960000000001E-2,1.407439262561512,23.976000000000003,0.94455285400834677,13.210918331279151,6.3432858305460549,null,94.455285400834683,0.54539760919600533,0.47443139335501106,0.307230658866957,0.16692857448805407,8.2739335440159004E-2]
["RdsonTop",{"$f":"Rdson1*1000","v":25},"mW","Drain-Source Resistance of Top FET ",null,null,28,16.8,1,3.36,3.36,1.6444444444444444,0.44711513225392374,12.558461443201001,9.6392307216004998,-2.9192307216005005,16.8,4.9429255323506389,0.34205517945709385,0.2,0.55730551859102029,3.6253155474198171,0.262858256367277,0.262858256367277,2.4575994643287924,3.0198975635345839E-4,3.0198975635345839E-4,3.3051696174445326,0.27310365500196093,8.9409744619799152E-3,0,3.2695384081925603E-3,0.2993770543269228,3.6753729903623946,0.1485920328011395,1.0795938408192561E-2,0.16307109312249474,7.5264000000000008E-3,2.8223999999999999E-2,8.5513794864273462E-2,3.6960000000000005E-5,3.4439999999999998E-2,3.0339999999999999E-2,2.419E-2,3.4476960000000001E-2,1.4386550670283416,24.864000000000001,0.94530380817593707,13.674210456057681,6.5506304986548001,null,94.530380817593709,0.55730551859102029,0.49067214744941756,0.3180048943269228,0.17238501312249474,8.5513794864273462E-2]
["RdsonTopTc",{"$f":"RdsonTopTc*1000000","v":4000},"ppm","Drain to Source Resistance Temp Co",null,null,29,16.8,1,3.48,3.48,1.7031746031746031,0.44735275414502729,12.558791433850589,9.7593957169252938,-2.7993957169252943,16.8,5.0253361602231728,0.35355604932545215,0.2,0.56966883844089056,3.625410807515002,0.26287207046493161,0.26287207046493161,2.4987003699101833,3.1217517692946434E-4,3.1217517692946434E-4,3.3611676586139798,0.28243620073281461,9.2602949784791975E-3,0,3.1353232029563294E-3,0.30988576785071348,3.7358473595603447,0.15352211043327399,1.093052320295633E-2,0.16838188568857626,7.7952000000000004E-3,2.9232000000000001E-2,8.8389012331363037E-2,3.6960000000000005E-5,3.4439999999999998E-2,3.0339999999999999E-2,2.419E-2,3.4476960000000001E-2,1.4710139099534045,25.752000000000002,0.94596432581568179,14.15469217758068,6.7650809361658979,null,94.59643258156818,0.56966883844089056,0.50749965353928972,0.32917888785071348,0.17802844568857626,8.8389012331363037E-2]
["QgTop",{"$f":"Qg_Q1*1000000000","v":6.5},"nC","Gate Charge Of Top FET",null,null,30,16.8,1,3.6,3.6,1.7619047619047619,0.44759041175979286,12.559115687063573,9.8795578435317868,-2.6795578435317862,16.8,5.109234995256517,0.36545995131455405,0.2,0.58249009546906072,3.6255044113549029,0.26288564473507725,0.26288564473507725,2.540544869111649,3.2271841159847633E-4,3.2271841159847633E-4,3.4181905205887086,0.29210066087606268,9.5796154949784797E-3,0,3.0011047847556004E-3,0.32079873081587396,3.7974011905132379,0.1586228138188249,1.1065104784755602E-2,0.17388028845825795,8.0640000000000017E-3,3.024E-2,9.1364987828638514E-2,3.6960000000000005E-5,3.4439999999999998E-2,3.0339999999999999E-2,2.419E-2,3.4476960000000001E-2,1.5045234257185069,26.64,0.94654294183771215,14.65255662508258,6.9866605614138022,null,94.654294183771214,0.58249009546906072,0.52491901927413198,0.34075713081587394,0.18385948845825795,9.1364987828638514E-2]
["QgdTop",{"$f":"Qgd_Q1*1000000000","v":2.1},"nC","Gate to Drain Charge",null,null,31,16.8,1,3.72,3.72,1.8206349206349206,0.44782810510627685,12.559434201546013,9.9997171007730064,-2.5597171007730064,16.8,5.1945499280733634,0.37776688537345782,0.2,0.59577191750702607,3.6255963585659918,0.26289897910493959,0.26289897910493959,2.5830971880180953,3.3361955413734956E-4,3.3361955413734956E-4,3.4761907358558006,0.30209755080124234,9.8989360114777637E-3,0,2.8668831528657671E-3,0.33212061579729557,3.8599801713476833,0.16389391615517018,1.1199683152865769E-2,0.17956694873494713,8.3328000000000013E-3,3.1247999999999995E-2,9.4441721343364454E-2,3.6960000000000005E-5,3.4439999999999998E-2,3.0339999999999999E-2,2.419E-2,3.4476960000000001E-2,1.5391915620417098,27.528000000000002,0.94704711809682662,15.168004719283708,7.2153939719279911,null,94.704711809682664,0.59577191750702607,0.54293556453224268,0.35274429579729555,0.18987878873494712,9.4441721343364454E-2]
["QgsTop",{"$f":"Qgs_Q1*1000000000","v":2.2000000000000002},"nC",null,null,null,32,{"$f":"Vin","v":16.8},{"$f":"MODE","v":1},3.84,{"$f":"Iout*G41/100/Number_of_Phases","v":3.84},{"$f":"Vout*K41/(Vin*Efficiency)","v":1.8793650793650793},{"$f":"(Vout+(Rdson2+Rs+Rdcr)*K41)/(Vin+(Rs+Rdson2-Rdson1)*K41)","v":0.44806583419253831},{"$f":"(Vin-(Rdson1+Rdcr)*K41-Vout)*M41/(Fsw*Lf)","v":12.559746976003593},10.119873488001797,-2.4398734880017967,{"$f":"IF(MIN(Vin, -P41/(Coss_Q1+Coss_Q2)*0.00000002)<0, 0, MIN(Vin, -P41/(Coss_Q1+Coss_Q2)*0.00000002))","v":16.8},5.2812123300528846,{"$f":"R41^2*Rdcr","v":0.39047685145143668},{"$f":"Core_Loss_Ch1","v":0.2},{"$f":"(T41+S41*(1+Ltc*(Ta-25)))/(1-S41*Ltc*ThetaCa)","v":0.60951703486587194},3.6256866487746318,0.26291207350205242,0.26291207350205242,2.6263232754976205,3.4487869737102753E-4,3.4487869737102753E-4,3.5351231154400895,{"$f":"Rdson1*AB41^2","v":0.31242738603297115},{"$f":"(Vin*K41/2)*Fsw*(Tr_buck+Tf_buck)","v":1.0218256527977046E-2},{"$f":"(0.5*Coss_Q1*(Vin-Q41)^2-0.5*Coss_Q2*(Vin-Q41)^2+(Qoss_Q2*(Vin-Q41)/Vin)*Vin)*Fsw","v":0},{"$f":"IF(K41>N41/2,0,ABS(K41-N41/2)*Vsd_Q1*Deadtime*Fsw)","v":2.7326583065620125E-3},{"$f":"(AF41+AE41+AD41+AC41*(1+RdsonTopTc*Ta-RdsonTopTc*25))/(1-AC41*RdsonTopTc*ThetaJA_Q1)","v":0.34385628136253393},{"$f":"SQRT((1-M41))*SQRT(K41^2+(N41^2)/12)","v":3.9235326217305464},{"$f":"Rdson2*AH41^2","v":0.16933519057162152},{"$f":"IF(K41<N41/2,Deadtime*Fsw*IF(VfdSky_Q2>0,0,Vsd_Q2)*(K41+N41/2),2*Deadtime*Fsw*IF(VfdSky_Q2>0,0,Vsd_Q2)*K41)","v":1.1334258306562013E-2},{"$f":"(AJ41+AI41*(1+RdsonBotTc*Ta-RdsonBotTc*25))/(1-AI41*RdsonBotTc*ThetaJA_Q2)","v":0.18544254508234762},{"$f":"2*Deadtime*Fsw*IF(VfdSky_Q2>0,VfdSky_Q2,Vsd_Q2)*K41","v":8.6016000000000009E-3},{"$f":"IF(QrrSky_Q2>0,QrrSky_Q2,Qrr_Q2*K41/(Iout/Number_of_Phases))*Fsw*Vin","v":3.2255999999999993E-2},{"$f":"Rs*R41^2","v":9.761921286285917E-2},{"$f":"Iq*Vin","v":3.6960000000000005E-5},{"$f":"IF(Ext_VCC=1,  (Qg_Q1+Qg_Q2)*Fsw*VCC, (Qg_Q1+Qg_Q2)*Fsw*Vin)","v":3.4439999999999998E-2},3.0339999999999999E-2,{"$f":"(Qg_Q1+Qg_Q2)*Fsw*(Vin-VCC)","v":2.419E-2},{"$f":"SUM(AO41:AP41)","v":3.4476960000000001E-2},{"$f":" SUM(U41,X41,AA41,AG41,AK41,AL41,AM41,AS41,AN41)","v":1.5750265863730362},{"$f":"Vout*K41","v":28.416},0.94748340535002973,{"$f":"ThetaJA_Q1*BC41","v":15.701245378588958},{"$f":"ThetaJA_Q2*BD41","v":7.4513069531292091},null,94.748340535002967,{"$f":"U41","v":0.60951703486587194},{"$f":"AG41+AK41+AM41","v":0.56155482644488153},{"$f":"AG41+AM41*0.66","v":0.3651452413625339},{"$f":"AK41+AM41*0.33","v":0.1960870250823476},{"$f":"AN41","v":9.761921286285917E-2}]
["RGateTop",{"$f":"Rgate1","v":0.5},"W","Gate Resistance",null,null,33,16.8,1,{"$f":"Iout*G42/100","v":3.96},3.96,1.9380952380952381,0.44830359902663858,12.560054009141602,10.240027004570802,-2.3200270045708011,16.8,5.3691569536299495,0.40358984949797977,0.2,0.62372828176726658,3.6257752816070714,0.26292492785425675,0.26292492785425675,2.6701907541290621,3.5649593317181653E-4,3.5649593317181653E-4,3.5949446852545957,0.32309068225100662,1.053757704447633E-2,0,2.5984302451192974E-3,0.35601077709667273,3.9880094160712019,0.17494641012939824,1.1468830245119299E-2,0.1915077875663953,8.8704000000000005E-3,{"$f":"IF(QrrSky_Q2>0,QrrSky_Q2,Qrr_Q2*K42/(Iout/Number_of_Phases))*Fsw*Vin","v":3.3264000000000002E-2},0.10089746237449494,3.6960000000000005E-5,3.4439999999999998E-2,3.0339999999999999E-2,2.419E-2,3.4476960000000001E-2,1.6120370925922578,29.304000000000002,0.94785757670802784,16.252495735156927,7.6944264875230219,null,94.785757670802781,0.62372828176726658,0.58078256466306799,0.37796501709667274,0.20248490756639531,0.10089746237449494]
["GfsTop",{"$f":"Gfs_Q1","v":45},"S","Transconductance of Top FET",null,null,34,16.8,1,4.08,4.08,1.9968253968253968,0.44854139961664152,12.560355299664939,10.360177649832469,-2.2001776498324697,16.8,5.4583218212638478,0.41710587946279126,0.2,0.63840859783532822,3.6258622566894481,0.26293754208970194,0.26293754208970194,2.7146688654738678,3.6847135245865887E-4,3.6847135245865887E-4,3.6556146147552511,0.33408795529030461,1.0856897560975612E-2,0,2.4641989678123662E-3,0.36858934886669387,4.053363898402524,0.18072734782160196,1.1603398967812366E-2,0.19776341801045533,9.1392000000000018E-3,3.4271999999999997E-2,0.10427646986569782,3.6960000000000005E-5,3.4439999999999998E-2,3.0339999999999999E-2,2.419E-2,3.4476960000000001E-2,1.6502320080203357,30.192000000000004,0.94817473826568821,16.821981361267838,7.9447807643973025,null,94.817473826568815,0.63840859783532822,0.60062476687714916,0.39120886886669387,0.20907317801045533,0.10427646986569782]
["VthTop",{"$f":"Vth_Q1","v":2},"V","Threshold Voltage of Top FET",null,null,35,16.8,1,4.2,4.2,2.0555555555555554,0.44877923597061337,12.560650846278124,10.480325423139062,-2.0803254231390618,16.8,5.5486481062365343,0.43102494129579189,0.2,0.6535610296508706,3.625947573647788,0.26294991613684565,0.26294991613684565,2.7597284112622602,3.8080504519640593E-4,3.8080504519640593E-4,3.7170941400027981,0.34541972114107855,1.1176218077474893E-2,0,2.3299644739157494E-3,0.38159744433590193,4.1195517912995268,0.18667777657319051,1.173796447391575E-2,0.2042102102639605,9.4080000000000014E-3,3.5279999999999999E-2,0.10775623532394797,3.6960000000000005E-5,3.4439999999999998E-2,3.0339999999999999E-2,2.419E-2,3.4476960000000001E-2,1.6896206007567232,31.080000000000002,0.94843942133655024,17.409936506443781,8.2023991900304996,null,94.84394213365502,0.6535610296508706,0.62108765459986237,0.40488224433590192,0.21585261026396049,0.10775623532394797]
["VspTop",{"$f":"Vsp_Q1","v":2.2666666666666666},"V",null,null,null,36,16.8,1,4.32,4.32,2.1142857142857143,0.44901710809662276,12.560940647685262,10.600470323842632,-1.9604703238426309,16.8,5.6400800079628883,0.44534703494711714,0.2,0.66918873236958221,3.6260312321079993,0.2629620499244531,0.2629620499244531,2.8053416918268268,3.9349710039509017E-4,3.9349710039509017E-4,3.7793464829192751,0.35708649594885739,1.1495538593974177E-2,0,2.1957267627037464E-3,0.39504071873957031,4.1865311008361514,0.19279746924095192,1.1872526762703749E-2,0.21084897048468482,9.676800000000001E-3,3.6288000000000001E-2,0.11133675873677928,3.6960000000000005E-5,3.4439999999999998E-2,3.0339999999999999E-2,2.419E-2,3.4476960000000001E-2,1.7302124873554647,31.968000000000004,0.94865565976222954,18.016604345801522,8.4673123984180236,null,94.865565976222953,0.66918873236958221,0.64217768922425511,0.41899079873957029,0.22282401048468481,0.11133675873677928]
["VsdTop",{"$f":"Vsd_Q1","v":0.8},"V",null,null,null,37,16.8,1,4.4400000000000004,4.4400000000000004,2.1730158730158728,0.44925501600274098,12.561224702590096,10.720612351295049,-1.8406123512950474,16.8,5.7325646240648673,0.46007216036711962,0.2,0.68529497140579043,3.6261132316958844,0.26297394338159941,0.26297394338159941,2.8514824429029817,4.0654760610919782E-4,4.0654760610919782E-4,3.8423367682416716,0.36908879601454636,1.1814859110473461E-2,0,2.0614858334504532E-3,0.40892504093363408,4.2542620192576432,0.19908619861347929,1.2007085833450457E-2,0.21768053743485652,9.9456000000000024E-3,3.7296000000000003E-2,0.11501804009177991,3.6960000000000005E-5,3.4439999999999998E-2,3.0339999999999999E-2,2.419E-2,3.4476960000000001E-2,1.7720176408537698,32.856000000000002,0.94882705503871634,18.642237240146265,8.7395522625245476,null,94.882705503871634,0.68529497140579043,0.66390157836849062,0.43354040093363411,0.22998821743485653,0.11501804009177991]
["θJATop",{"$f":"ThetaJA_Q1","v":43},"°C/W","Junction to Ambient Resistance",null,null,38,16.8,1,4.5599999999999996,4.5599999999999996,2.2317460317460314,0.44949295969704128,12.56150300969596,10.840751504847979,-1.7207515048479802,16.8,5.8260518210777521,0.47520031750636754,0.2,0.70188312418351706,3.6261935720371286,0.26298559643766778,0.26298559643766778,2.898125771725375,4.1995664943694007E-4,4.1995664943694007E-4,3.906031939421303,0.38142713779448367,1.2134179626972739E-2,0,1.9272416854297383E-3,0.42325649972894408,4.3227068267584423,0.20554373741114446,1.2141641685429739E-2,0.22470578279132367,1.02144E-2,3.8303999999999991E-2,0.11880007937659189,3.6960000000000005E-5,3.4439999999999998E-2,3.0339999999999999E-2,2.419E-2,3.4476960000000001E-2,1.8150463991674812,33.744,0.94895683144050869,19.287097008344595,9.0191519060703005,null,94.895683144050864,0.70188312418351706,0.68626628252026778,0.4485371397289441,0.23734610279132368,0.11880007937659189]
["Low-side FET","Input Value","Units","Description",null,null,39,16.8,1,4.68,4.68,2.2904761904761903,0.44973093918759993,12.561775567705816,10.960887783852908,-1.6008877838529081,16.8,5.9204941053190447,0.49073150631564583,0.2,0.71895668195662787,3.6262722527573086,0.26299700902235129,0.26299700902235129,2.9452480931817071,4.337243165195241E-4,4.337243165195241E-4,3.9704006744937055,0.3941020379005018,1.2453500143472022E-2,0,1.7929943179152571E-3,0.43804141052435175,4.3918297935026454,0.21216985828607235,1.2276194317915257E-2,0.23192561146999971,1.04832E-2,3.9311999999999993E-2,0.12268287657891146,3.6960000000000005E-5,3.4439999999999998E-2,3.0339999999999999E-2,2.419E-2,3.4476960000000001E-2,1.8593094738687617,34.631999999999998,0.9490478828883846,19.951455212547124,9.306145715859989,null,94.904788288838461,0.71895668195662787,0.70927902199435144,0.46398733052435176,0.24489857146999972,0.12268287657891146]
["RdsonBot",{"$f":"Rdson2*1000","v":11},"mW","Drain-Source Resistance of Low-side FET",null,null,40,16.8,1,4.8,4.8,2.3492063492063493,0.44996895448249508,12.562042375322216,11.081021187661108,-1.4810211876611081,16.8,6.0158464951561541,0.50666572674595622,0.2,0.73651925169995169,3.6263492734818836,0.26300818106565171,0.26300818106565171,2.9928270666392454,4.4785069254042357E-4,4.4785069254042357E-4,4.0354133027484789,0.40711401309998463,1.2772820659971307E-2,0,1.6587437301804411E-3,0.45328632225266202,4.4615970828037792,0.21896433382211511,1.2410743730180442E-2,0.2393409619648274,1.0752000000000001E-2,4.0319999999999995E-2,0.12666643168648906,3.6960000000000005E-5,3.4439999999999998E-2,3.0339999999999999E-2,2.419E-2,3.4476960000000001E-2,1.9048179593621222,35.520000000000003,0.94910281296677323,20.635593456864466,9.6005693546634401,null,94.910281296677326,0.73651925169995169,0.73294728421748945,0.47989752225266202,0.25264656196482738,0.12666643168648906]
["RdsonBotTc",{"$f":"RdsonBotTc*1000000","v":4000},"ppm","Drain To Source Resitance Temp Co",null,null,41,16.8,1,4.92,4.92,2.4079365079365078,0.4502070055898077,12.562303431247335,11.201151715623666,-1.3611517156236674,16.8,6.1120663956549128,0.52300297874851653,0.2,0.75457455807333251,3.6264246338362041,0.26301911249788096,0.26301911249788096,3.0408415339331589,4.6233586172464842E-4,4.6233586172464842E-4,4.1010417228598275,0.42046358031592757,1.3092141176470591E-2,0,1.5244899214985075E-3,0.46899802465434609,4.5319766561906443,0.22592693653482626,1.2545289921498507E-2,0.24695280670151068,1.1020800000000001E-2,4.1327999999999997E-2,0.13075074468712913,3.6960000000000005E-5,3.4439999999999998E-2,3.0339999999999999E-2,2.419E-2,3.4476960000000001E-2,1.9515833424759244,36.408000000000001,0.94912396922948528,21.33980370013688,9.9024597746574052,null,94.912396922948531,0.75457455807333251,0.75727883135585683,0.49627450465434608,0.26059104670151068,0.13075074468712913]
["QgBot",{"$f":"Qg_Q2*1000000000","v":14},"nC","Gate Charge Of Top FET",null,null,42,16.8,1,5.04,5.04,2.4666666666666663,0.45044509251762099,12.562558734182952,11.321279367091476,-1.2412793670914759,16.8,6.2091134763735019,0.53974326227476244,0.2,0.773126445460669,3.6264983334455061,0.26302980324966063,0.26302980324966063,3.0892714588977612,4.7717990733801515E-4,4.7717990733801515E-4,4.1672593229939334,0.43415125662699644,1.3411461692969875E-2,0,1.3902328911424532E-3,0.48518355589478235,4.6029381809234824,0.23305743887143496,1.2679832891142455E-2,0.25476215240627692,1.1289600000000002E-2,4.2335999999999999E-2,0.13493581556869061,3.6960000000000005E-5,3.4439999999999998E-2,3.0339999999999999E-2,2.419E-2,3.4476960000000001E-2,1.9996175124874174,37.295999999999999,0.94911347272117619,22.064388583475644,10.211855231438523,null,94.911347272117624,0.773126445460669,0.78228170830105925,0.51312531589478239,0.26873303240627694,0.13493581556869061]
["RGateBot",{"$f":"Rgate2","v":0.5},"W","Gate Resistance",null,null,43,16.8,1,5.16,5.16,2.5253968253968258,0.45068321527402055,12.562808282830456,11.441404141415228,-1.121404141415228,16.8,6.3069495528818154,0.55688657727634594,0.2,0.79217888008608595,3.6265703719349123,0.2630402532519226,0.2630402532519226,3.1380978687300822,4.9238291168641416E-4,4.9238291168641416E-4,4.2340409032865303,0.4481775592675854,1.3730782209469154E-2,0,1.2559726383850555E-3,0.50185021054174572,4.6744529403870043,0.2403556132108198,1.2814372638385058E-2,0.26277004048994451,1.1558400000000002E-2,4.3343999999999994E-2,0.13922164431908648,3.6960000000000005E-5,3.4439999999999998E-2,3.0339999999999999E-2,2.419E-2,3.4476960000000001E-2,2.0489327716004717,38.184000000000005,0.94907324347364597,22.809661773295069,10.528795298617892,null,94.907324347364593,0.79217888008608595,0.80796425103169023,0.53045725054174575,0.27707356048994453,0.13922164431908648]
["VsdBot",{"$f":"Vsd_Q2","v":0.8},"V","Diode Forward Voltage of Bottom FET Body Diode",null,null,44,16.8,1,5.28,5.28,2.5841269841269843,0.45092137386709474,12.563052075890846,11.561526037945423,-1.0015260379454229,16.8,6.4055384724311386,0.57443292370513621,0.2,0.81173595220947714,3.6266407489294337,0.26305046243590885,0.26305046243590885,3.1873027973980776,5.0794495611508053E-4,5.0794495611508053E-4,4.3013626009806645,0.4625430056278787,1.4050102725968436E-2,0,1.1217091624988738E-3,0.51900554792087927,4.7464937476710425,0.24782123186348329,1.2948909162498875E-2,0.27097754744758468,1.1827200000000001E-2,4.4352000000000003E-2,0.14360823092628405,3.6960000000000005E-5,3.4439999999999998E-2,3.0339999999999999E-2,2.419E-2,3.4476960000000001E-2,2.0995418458962494,39.072000000000003,0.94900502260141817,23.57594832059781,10.853320883008218,null,94.90050226014182,0.81173595220947714,0.83433509536846384,0.54827786792087929,0.28561370744758469,0.14360823092628405]
["QrrBot",{"$f":"Qrr_Q2*1000000000","v":59.999999999999993},"nC","Reverse Recovery Charge of Body Diode",null,null,45,16.8,1,5.4,5.4,2.6428571428571432,0.45115956830493392,12.563290112064729,11.681645056032366,-0.88164505603236432,16.8,6.5048460040694751,0.59238230151322069,0.2,0.83180187840376829,3.6267094640539677,0.26306043073317237,0.26306043073317237,3.236869231241386,5.2386612100786009E-4,5.2386612100786009E-4,4.3692018184281975,0.4772481132539067,1.4369423242467722E-2,0,9.8744246275624808E-4,0.53665740086794167,4.8190348625531172,0.25545406707152574,1.3083442462756251E-2,0.27938578527407776,1.2096000000000003E-2,4.5360000000000004E-2,0.14809557537830517,3.6960000000000005E-5,3.4439999999999998E-2,3.0339999999999999E-2,2.419E-2,3.4476960000000001E-2,2.1514578967782731,39.960000000000008,0.94891039151264167,24.363585037321492,11.185474240414955,null,94.891039151264167,0.83180187840376829,0.86140318614201938,0.56659500086794168,0.29435458527407776,0.14809557537830517]
["TrrBot",{"$f":"Trr_Q2*1000000000","v":40},"ns","Reverse Recovery Time of Body Diode",null,null,46,16.8,1,5.52,5.52,2.7015873015873013,0.45139779859563117,12.56352239005232,11.80176119502616,-0.76176119502616046,16.8,6.6048397333908735,0.61073471065290352,0.2,0.85238100391633331,3.6267765169332988,0.2630701580755766,0.2630701580755766,3.2867810568593634,5.401464857864778E-4,5.401464857864778E-4,4.4375371540871988,0.49229339984760795,1.4688743758966999E-2,0,8.5317253842929965E-4,0.55481388489779104,4.8920519120175436,0.26325389100861951,1.3217972538429301E-2,0.28799590189588015,1.23648E-2,4.6367999999999993E-2,0.15268367766322588,3.6960000000000005E-5,3.4439999999999998E-2,3.0339999999999999E-2,2.419E-2,3.4476960000000001E-2,2.2046945329345933,40.847999999999999,0.94879078866369115,25.172920890605013,11.525298992043446,null,94.879078866369113,0.85238100391633331,0.88917778679367121,0.58541676489779104,0.30329734189588015,0.15268367766322588]
["θJABot",{"$f":"ThetaJA_Q2","v":38},"°C/W","Junction to Ambient Resistance",null,null,47,16.8,1,5.64,5.64,2.7603174603174598,0.45163606474728174,12.563748908553444,11.921874454276722,-0.64187445427672252,16.8,6.7054889620194604,0.62949015107670758,0.2,0.87347780511713446,3.6268419071920994,0.26307964439529652,0.26307964439529652,3.3370230113375157,5.5678612890980512E-4,5.5678612890980512E-4,4.5063483365886654,0.50767938326688578,1.5008064275466285E-2,0,7.1889938878992924E-4,0.57348340781126539,4.9655218143805779,0.27122047577998321,1.3352499388789929E-2,0.29680908161933056,1.26336E-2,4.7375999999999995E-2,0.1573725377691769,3.6960000000000005E-5,3.4439999999999998E-2,3.0339999999999999E-2,2.419E-2,3.4476960000000001E-2,2.2592658228411135,41.735999999999997,0.94864752421456744,26.004317415884412,11.872840141534562,null,94.864752421456743,0.87347780511713446,0.91766848943059587,0.60475156781126538,0.31244316161933056,0.1573725377691769]
["Bottom Schottky","Input Value","Units","Std Units",null,null,48,16.8,1,5.76,5.76,2.8190476190476188,0.45187436676798376,12.563969666267537,12.041984833133768,-0.52198483313376887,16.8,6.8067646118578908,0.64864862273737267,0.2,0.89509689203623732,3.626905634454928,0.26308888962481808,0.26308888962481808,3.3875806348281228,5.7378512787312533E-4,5.7378512787312533E-4,4.5756161618985036,0.52340658152566977,1.5327384791965567E-2,0,5.8462301310982111E-4,0.59267467976244581,5.0394227070383879,0.27935359342235527,1.3487023013109821E-2,0.30582654559583894,1.2902400000000001E-2,4.8383999999999996E-2,0.16216215568434317,3.6960000000000005E-5,3.4439999999999998E-2,3.0339999999999999E-2,2.419E-2,3.4476960000000001E-2,2.3151863078315569,42.624000000000002,0.94848179288399592,26.85814914978517,12.228144092641879,null,94.848179288399592,0.89509689203623732,0.94688522535828468,0.62460811976244579,0.32179326559583893,0.16216215568434317]
["VfdSky",{"$f":"VfdSky_Q2","v":0},"V","Diode Forward Voltage",null,null,49,16.8,1,5.88,5.88,2.8777777777777778,0.45211270466583742,12.564184661893643,12.162092330946821,-0.40209233094682162,16.8,6.9086391340731463,0.66821012558785742,0.2,0.91724301099350158,3.6269676983462311,0.26309789369693914,0.26309789369693914,3.4384402254725934,5.9114355920740101E-4,5.9114355920740101E-4,4.6453224335624901,0.53947551279397332,1.5646705308464851E-2,0,4.5034341066044019E-4,0.61239672381016252,5.1137338778125736,0.28765301590396825,1.3621543410660441E-2,0.31504955230431758,1.3171200000000001E-2,4.9391999999999998E-2,0.16705253139696435,3.6960000000000005E-5,3.4439999999999998E-2,3.0339999999999999E-2,2.419E-2,3.4476960000000001E-2,2.3724710157610924,43.512,0.9482946852553632,27.734804083836988,12.591258667564068,null,94.829468525536313,0.91724301099350158,0.97683827611448015,0.64499544381016249,0.33134891230431757,0.16705253139696435]
["QrrSky",{"$f":"QrrSky_Q2*1000000000","v":0},"nC","Diode Reverse Recovery Charge",null,null,50,16.8,1,6,6,2.9365079365079367,0.45235107844894545,12.56439389413041,12.282196947065206,-0.28219694706520482,16.8,7.0110864227477938,0.68817465958133839,0.2,0.93992104732334458,3.6270280984903414,0.26310665654476922,0.26310665654476922,3.4895887966307386,6.0886149847853843E-4,6.0886149847853843E-4,4.7154499059918091,0.5558866953979541,1.5966025824964137E-2,0,3.1606058071302943E-4,0.63265888697910921,5.1884356998348053,0.29611851512452314,1.3756060580713032E-2,0.32447939805122938,1.3440000000000001E-2,5.0399999999999993E-2,0.1720436648953346,3.6960000000000005E-5,3.4439999999999998E-2,3.0339999999999999E-2,2.419E-2,3.4476960000000001E-2,2.4311354752922658,44.400000000000006,0.94808719774529249,28.634684140101694,12.962233125946716,null,94.808719774529251,0.93992104732334458,1.0075382850303385,0.66592288697910917,0.34111139805122936,0.1720436648953346]
["Ireverse",{"$f":"Ireverse","v":0},"mA","Reverse Leakage Current",null,null,51,16.8,1,6.12,6.12,2.9952380952380953,0.45258948812541305,12.564597361676093,12.402298680838047,-0.16229868083804622,11.846619039273449,7.1140817330901172,0.70854222467121086,0.2,0.9631360281976219,3.6270868345114771,0.26311517810172974,0.26311517810172974,3.541014036364873,6.2693902028665253E-4,6.2693902028665253E-4,4.7859822307232722,0.5726406478199727,1.6285346341463416E-2,4.8184330545450668E-3,1.8177452253861174E-4,0.65881572374708885,5.263509569886577,0.30474986291516337,1.3890574522538614E-2,0.33411741748864121,1.3708800000000002E-2,5.1407999999999995E-2,0.17713555616780272,3.6960000000000005E-5,3.4439999999999998E-2,3.0339999999999999E-2,2.419E-2,3.4476960000000001E-2,2.4965406027231709,45.288000000000004,0.9477542198536717,29.788035161124817,13.341118184568366,null,94.775421985367174,0.9631360281976219,1.04434114123573,0.69274500374708881,0.35108205748864119,0.17713555616780272]
["Controller","Input Value","Units","Std Units",null,null,52,16.8,1,6.24,6.24,3.0539682539682538,0.45282793370334778,12.564795063228555,12.522397531614278,-4.2397531614277284E-2,3.0947103368085611,7.2176016040702695,0.72931282081108817,0.2,0.98689312554979136,3.6271439060337438,0.26312345830155448,0.26312345830155448,3.5927042691135398,6.4537619826533267E-4,6.4537619826533267E-4,4.8569039055705101,0.58973788869865185,1.6604666857962698E-2,1.2672197357055538E-2,4.7485235407990563E-5,0.68894535272075075,5.3389378500907512,0.31354683103844816,1.4025085235407993E-2,0.34396498415068927,1.3977600000000001E-2,5.2415999999999997E-2,0.18232820520277204,3.6960000000000005E-5,3.4439999999999998E-2,3.0339999999999999E-2,2.419E-2,3.4476960000000001E-2,2.5667710621238236,46.176000000000002,0.94734047724015502,31.112216246992279,13.727966037726194,null,94.734047724015497,0.98689312554979136,1.0853263368714401,0.72353991272075069,0.36126226415068929,0.18232820520277204]
["θJA",30,"°C/W","Junction to Ambient Resistance",null,null,53,16.8,1,6.36,6.36,3.1126984126984132,0.45306641519085988,12.564986997485281,12.642493498742642,7.7506501257359695E-2,0,7.321623785330309,0.75048644795480335,0.2,1.011197659103678,3.6271993126811375,0.26313149707829037,0.26313149707829037,3.6446484194800068,6.6417310508090556E-4,6.6417310508090556E-4,4.9282002265692766,0.60717893682893675,1.6923987374461984E-2,1.5247680000000001E-2,0,0.71390736026768908,5.4147038128375087,0.32250919118832755,1.4246400000000003E-2,0.35411479306416743,1.4246400000000003E-2,5.3424000000000006E-2,0.18762161198870084,3.6960000000000005E-5,3.4439999999999998E-2,3.0339999999999999E-2,2.419E-2,3.4476960000000001E-2,2.6327844546076067,47.064000000000007,0.94702304216458189,32.214189611510633,14.126299096438363,null,94.702304216458188,1.011197659103678,1.1214461533318565,0.74916720026768913,0.37174471306416745,0.18762161198870084]
["Theta Ja",2,"°C/W","Junction to Ambient Resistance",null,null,54,16.8,1,6.48,6.48,3.1714285714285717,0.45330493259606169,12.565173163143346,12.762586581571673,0.1974134184283276,0,7.426127168202469,0.77206310605640749,0.2,1.0360550995102868,3.6272530540775363,0.26313929436629629,0.26313929436629629,3.6968359780539322,6.8332981243169873E-4,6.8332981243169873E-4,4.9998572426106458,0.62496431116215323,1.7243307890961266E-2,1.5247680000000001E-2,0,0.73663952628127116,5.490791588817471,0.33163671499011554,1.4515200000000002E-2,0.3645272912669163,1.4515200000000002E-2,5.4432000000000001E-2,0.19301577651410187,3.6960000000000005E-5,3.4439999999999998E-2,3.0339999999999999E-2,2.419E-2,3.4476960000000001E-2,2.6974844777513041,47.952000000000005,0.94674211385238838,33.220279790094665,14.534614348142821,null,94.674211385238834,1.0360550995102868,1.1555988175481875,0.77256464628127119,0.38248985126691631,0.19301577651410187]
[null,null,null,null,null,null,55,16.8,1,6.6,6.6,3.2301587301587298,0.45354348592706817,12.565353558899435,12.882676779449717,0.31732322055028206,0,7.5310917206612364,0.79404279507017117,0.2,1.0614710715962867,3.6273051298467056,0.26314685010024452,0.26314685010024452,3.7492569691801685,7.0284639104730318E-4,7.0284639104730318E-4,5.0718617126497758,0.64309453080606804,1.7562628407460548E-2,1.5247680000000001E-2,0,0.75996644464710228,5.5671861180285243,0.34092917400046457,1.4784E-2,0.37515412380428709,1.4784E-2,5.5440000000000003E-2,0.19851069876754279,3.6960000000000005E-5,3.4439999999999998E-2,3.0339999999999999E-2,2.419E-2,3.4476960000000001E-2,2.7636529953065105,48.839999999999996,0.9464446248493712,34.251944319825398,14.95107430456291,null,94.644462484937122,1.0614710715962867,1.1905605684513894,0.7965568446471023,0.3934493238042871,0.19851069876754279]
[null,null,null,null,null,null,56,16.8,1,6.72,6.72,3.2888888888888888,0.45378207519199687,12.565528183449857,13.002764091724927,0.43723590827507142,0,7.6364984260298288,0.81642551495058469,0.2,1.0874513577279235,3.6273555396123021,0.26315416421512111,0.26315416421512111,3.8019019205861642,7.2272291068783826E-4,7.2272291068783826E-4,5.1442010653742845,0.66157011502494811,1.788194892395983E-2,1.5247680000000001E-2,0,0.78389974251452632,5.6438731036193683,0.35038633970733934,1.5052800000000002E-2,0.38599683866181139,1.5052800000000002E-2,5.6447999999999998E-2,0.20410637873764617,3.6960000000000005E-5,3.4439999999999998E-2,3.0339999999999999E-2,2.419E-2,3.4476960000000001E-2,2.8313089647677163,49.728000000000002,0.94613116076800707,35.309683168124636,15.375737789148832,null,94.613116076800708,1.0874513577279235,1.2263445811763378,0.82115542251452633,0.4046246786618114,0.20410637873764617]
["Outputs",null,null,null,null,null,57,16.8,1,6.84,6.84,3.3476190476190473,0.45402070039896747,12.565697035490501,13.122848517745251,0.5571514822547492,0,7.7423292252597493,0.83921126565235726,0.2,1.1140019012943034,3.6274042829978619,0.26316123664622465,0.26316123664622465,3.8547618347784098,7.4295944014321068E-4,7.4295944014321068E-4,5.2168633612147444,0.68039158323962001,1.8201269440459113E-2,1.5247680000000001E-2,0,0.80845146738512752,5.7208389684316785,0.36000798352999069,1.5321600000000001E-2,0.39705702580962787,1.5321600000000001E-2,5.7455999999999993E-2,0.20980281641308932,3.6960000000000005E-5,3.4439999999999998E-2,3.0339999999999999E-2,2.419E-2,3.4476960000000001E-2,2.9004719669885164,50.616,0.94580225750349034,36.394014377560481,15.808665220765858,null,94.58022575034903,1.1140019012943034,1.2629644931947552,0.84637242738512752,0.41601750580962787,0.20980281641308932]
["Design","Value","Units",null,null,null,58,16.8,1,6.96,6.96,3.4063492063492062,0.45425936155610241,12.565860113716896,13.242930056858448,0.67706994314155189,0,7.8485669626026917,0.86240004713041829,0.2,1.1411288103141632,3.6274513596268161,0.26316806732916875,0.26316806732916875,3.907828162118641,7.6355604723237782E-4,7.6355604723237782E-4,5.2898372565799381,0.69955945502752925,1.8520589956958395E-2,1.5247680000000001E-2,0,0.83363410347274125,5.7980708141033661,0.36979387681892995,1.5590400000000001E-2,0.40833631786328167,1.5590400000000001E-2,5.8464000000000002E-2,0.21560001178260457,3.6960000000000005E-5,3.4439999999999998E-2,3.0339999999999999E-2,2.419E-2,3.4476960000000001E-2,2.9711622268091915,51.504000000000005,0.94545840516383128,37.505474769327876,16.249918638804704,null,94.545840516383123,1.1411288103141632,1.300434421336023,0.87222034347274124,0.42762943786328167,0.21560001178260457]
["Dmax",{"$f":"D1_Vinmin","v":0.8222222222222223},"index",null,null,null,59,16.8,1,7.08,7.08,3.4650793650793652,0.45449805867152626,12.56601741682414,13.363008708412071,0.79699129158793003,0,7.9551953344964428,0.88599185933991553,0.2,1.168838361170411,3.6274967691224718,0.26317465619987945,0.26317465619987945,3.9610927754916494,7.8451279880260697E-4,7.8451279880260697E-4,5.3631119702008805,0.71907425012279935,1.8839910473457677E-2,1.5247680000000001E-2,0,0.85946058889278365,5.8755563825974813,0.37974379085590193,1.58592E-2,0.41983639076637197,1.58592E-2,5.9471999999999997E-2,0.22149796483497888,3.6960000000000005E-5,3.4439999999999998E-2,3.0339999999999999E-2,2.419E-2,3.4476960000000001E-2,3.0434006346632274,52.392000000000003,0.9451000515948248,38.644620682389693,16.699561729122134,null,94.510005159482475,1.168838361170411,1.3387689796591555,0.89871210889278363,0.43946215076637196,0.22149796483497888]
["Dprime",{"$f":"1-B68","v":0.1777777777777777},"index",null,null,null,60,16.8,1,7.2,7.2,3.5238095238095237,0.45473679175336634,12.566168943506966,13.483084471753482,0.91691552824651712,0,8.0621988414904475,0.90998670223621891,0.2,1.1971370024769339,3.6275405111080312,0.26318100319459836,0.26318100319459836,4.0145479464785039,8.0582976072873867E-4,8.0582976072873867E-4,5.4366772514700292,0.73893648841629289,1.9159230989956959E-2,1.5247680000000001E-2,0,0.88594433372866699,5.9532840200244266,0.38985749685386017,1.6128000000000003E-2,0.43155896449561187,1.6128000000000003E-2,6.0479999999999999E-2,0.22749667555905473,3.6960000000000005E-5,3.4439999999999998E-2,3.0339999999999999E-2,2.419E-2,3.4476960000000001E-2,3.117208769215595,53.28,0.94472760554566448,39.812028750332679,17.157659850833252,null,94.472760554566449,1.1971370024769339,1.377983298224279,0.92586113372866696,0.45151736449561186,0.22749667555905473]
["Ipp",{"$f":"Iripple_Vinnom","v":12.870781199958257},"A",null,null,null,61,16.8,1,7.32,7.32,3.5825396825396827,0.45497556080975221,12.566314692459709,13.603157346229855,1.0368426537701456,0,8.1695627430416415,0.93438457577491707,0.2,1.2260313590823497,3.6275825852065813,0.26318710824988129,0.26318710824988129,4.0681863229514059,8.2750699791244407E-4,8.2750699791244407E-4,5.5105233506652347,0.75914668995567025,1.9478551506456245E-2,1.5247680000000001E-2,0,0.91309923902627455,6.031242642629068,0.40013476595693992,1.6396800000000003E-2,0.44350580378888033,1.6396800000000003E-2,6.1487999999999994E-2,0.23359614394372927,3.6960000000000005E-5,3.4439999999999998E-2,3.0339999999999999E-2,2.419E-2,3.4476960000000001E-2,3.1926089210890281,54.168000000000006,0.94434143951503202,41.008296718129806,17.624280063977452,null,94.434143951503202,1.2260313590823497,1.4180930428151548,0.95368131902627451,0.46379684378888031,0.23359614394372927]
["Top FET","Value","Units",null,null,null,62,16.8,1,7.44,7.44,3.6412698412698412,0.45521436584881603,12.566454662376298,13.723227331188149,1.1567726688118514,0,8.2772730150170784,0.95918547991181879,0.2,1.2555282362156031,3.627622991041092,0.26319297130259839,0.26319297130259839,4.1220009080093254,8.4954457428148514E-4,8.4954457428148514E-4,5.5846409909516943,0.77970537494544812,1.9797872022955527E-2,1.5247680000000001E-2,0,0.94093971677094812,6.1094217048188773,0.41057536924043198,1.6665600000000003E-2,0.45567871889687805,1.6665600000000003E-2,6.2495999999999989E-2,0.2397963699779547,3.6960000000000005E-5,3.4439999999999998E-2,3.0339999999999999E-2,2.419E-2,3.4476960000000001E-2,3.2696241177382634,55.056000000000004,0.94394189231240666,42.234044301150767,18.099491158081364,null,94.394189231240659,1.2555282362156031,1.4591144356678261,0.98218707677094808,0.47630239889687803,0.2397963699779547]
["Tr",{"$f":"(Qgd_Q1+Qgs_Q1/2)*(RdsonDRT+Rgate1)/(VCC-Vsp_Q1)*1000000000","v":1.75609756097561},"ns","Turn on of MOSFET -> Rise time of current",null,null,63,16.8,1,7.56,7.56,3.6999999999999997,0.45545320687869234,12.566588851950288,13.843294425975143,1.2767055740248558,0,8.3853163097462673,0.98438941460295459,0.2,1.285634623778525,3.6276617282344246,0.26319859228993542,0.26319859228993542,4.1759850401766876,8.7194255278897454E-4,8.7194255278897454E-4,5.6590213420592832,0.8006130637470612,2.011719253945481E-2,1.5247680000000001E-2,0,0.96948071090516807,6.1878111691141893,0.42117907771075741,1.6934400000000002E-2,0.46807956635901743,1.6934400000000002E-2,6.3503999999999991E-2,0.24609735365073865,3.6960000000000005E-5,3.4439999999999998E-2,3.0339999999999999E-2,2.419E-2,3.4476960000000001E-2,3.3482781495361733,55.944000000000003,0.94352927136495324,43.489914088922227,18.583363681642663,null,94.352927136495325,1.285634623778525,1.5010642772641856,1.011393350905168,0.4890358863590174,0.24609735365073865]
["Tf",{"$f":"(Qgd_Q1+Qgs_Q1/2)*(RdsonDRT2+Rgate1)/(Vsp_Q1)*1000000000","v":1.4117647058823533},"ns","Turn off of MOSFET -> Fall time of current",null,null,64,{"$f":"Vin","v":16.8},{"$f":"MODE","v":1},7.68,{"$f":"Iout*G73/100/Number_of_Phases","v":7.68},{"$f":"Vout*K73/(Vin*Efficiency)","v":3.7587301587301587},{"$f":"(Vout+(Rdson2+Rs+Rdcr)*K73)/(Vin+(Rs+Rdson2-Rdson1)*K73)","v":0.45569208390751798},{"$f":"(Vin-(Rdson1+Rdcr)*K73-Vout)*M73/(Fsw*Lf)","v":12.566717259874816},13.963358629937407,1.3966413700625919,{"$f":"IF(MIN(Vin, -P73/(Coss_Q1+Coss_Q2)*0.00000002)<0, 0, MIN(Vin, -P73/(Coss_Q1+Coss_Q2)*0.00000002))","v":0},8.4936799184728891,{"$f":"R73^2*Rdcr","v":1.0099963798045748},{"$f":"Core_Loss_Ch1","v":0.2},{"$f":"(T73+S73*(1+Ltc*(Ta-25)))/(1-S73*Ltc*ThetaCa)","v":1.3163577007906926},3.6276987964093208,0.2632039711493927,0.2632039711493927,4.2301323747907302,8.9470099541263319E-4,8.9470099541263319E-4,5.7336559955369522,{"$f":"Rdson1*AB73^2","v":0.82187027687892089},{"$f":"(Vin*K73/2)*Fsw*(Tr_buck+Tf_buck)","v":2.0436513055954092E-2},{"$f":"(0.5*Coss_Q1*(Vin-Q73)^2-0.5*Coss_Q2*(Vin-Q73)^2+(Qoss_Q2*(Vin-Q73)/Vin)*Vin)*Fsw","v":1.5247680000000001E-2},{"$f":"IF(K73>N73/2,0,ABS(K73-N73/2)*Vsd_Q1*Deadtime*Fsw)","v":0},{"$f":"(AF73+AE73+AD73+AC73*(1+RdsonTopTc*Ta-RdsonTopTc*25))/(1-AC73*RdsonTopTc*ThetaJA_Q1)","v":0.99873771944912348},{"$f":"SQRT((1-M73))*SQRT(K73^2+(N73^2)/12)","v":6.26640147790682},{"$f":"Rdson2*AH73^2","v":0.43194566230544051},{"$f":"IF(K73<N73/2,Deadtime*Fsw*IF(VfdSky_Q2>0,0,Vsd_Q2)*(K73+N73/2),2*Deadtime*Fsw*IF(VfdSky_Q2>0,0,Vsd_Q2)*K73)","v":1.7203200000000002E-2},{"$f":"(AJ73+AI73*(1+RdsonBotTc*Ta-RdsonBotTc*25))/(1-AI73*RdsonBotTc*ThetaJA_Q2)","v":0.4807102498042013},{"$f":"2*Deadtime*Fsw*IF(VfdSky_Q2>0,VfdSky_Q2,Vsd_Q2)*K73","v":1.7203200000000002E-2},{"$f":"IF(QrrSky_Q2>0,QrrSky_Q2,Qrr_Q2*K73/(Iout/Number_of_Phases))*Fsw*Vin","v":6.4511999999999986E-2},{"$f":"Rs*R73^2","v":0.2524990949511437},{"$f":"Iq*Vin","v":3.6960000000000005E-5},{"$f":"IF(Ext_VCC=1,  (Qg_Q1+Qg_Q2)*Fsw*VCC, (Qg_Q1+Qg_Q2)*Fsw*Vin)","v":3.4439999999999998E-2},{"$f":"(Vin-VCC)*Fsw*(Qg_Q1+Qg_Q2)+(RdsonDRT+RdsonDRT2)*Fsw*Qg_Q1*VCC/(RdsonDRT+2*Rgate1+RdsonDRT2)+(RdsonDRB+RdsonDRB2)*Fsw*Qg_Q2*VCC/(RdsonDRB+2*Rgate2+RdsonDRB2)","v":3.0339999999999999E-2},{"$f":"(Qg_Q1+Qg_Q2)*Fsw*(Vin-VCC)","v":2.419E-2},3.4476960000000001E-2,{"$f":" SUM(U73,X73,AA73,AG73,AK73,AL73,AM73,AS73,AN73)","v":3.4285955971399664},{"$f":"Vout*K73","v":56.832000000000001},0.94310385479657133,{"$f":"ThetaJA_Q1*BC73","v":44.776572496312305},{"$f":"ThetaJA_Q2*BD73","v":19.075969972559651},null,94.310385479657128,{"$f":"U73","v":1.3163577007906926},1.5439599692533246,1.0413156394491234,0.50199920980420132,0.2524990949511437]
["Part Power","Value","Units",null,null,null,65,16.8,1,{"$f":"Iout*G74/100","v":7.8},7.8,3.8174603174603172,0.45593099694343259,12.566839884842649,{"$f":"K74+N74/2","v":14.083419942421324},{"$f":"K74-N74/2","v":1.5165800575786754},0,{"$f":"SQRT(K74^2+(N74^2)/12)","v":8.6023517360626052},1.0360063754731506,0.2,1.3477048399921845,{"$f":"N74/SQRT(12)","v":3.6277341951884146},{"$f":"RCoutEsr*V74^2","v":0.26320910781878665},{"$f":"W74","v":0.26320910781878665},{"$f":"SQRT(M74*(1-M74))*SQRT(K74^2+(N74^2)/12)","v":4.2844368665066082},{"$f":"RCinEsr*Y74^2","v":9.1781996315404822E-4},{"$f":"Z74","v":9.1781996315404822E-4},{"$f":"SQRT(M74)*SQRT(K74^2+(N74^2)/12)","v":5.808536941490428},0.84347753501647438,2.0755833572453374E-2,1.5247680000000001E-2,0,1.0287268177907043,6.3451835269186923,0.44287489389308365,1.7472000000000001E-2,0.4935727207771759,1.7472000000000001E-2,6.5519999999999995E-2,0.25900159386828764,3.6960000000000005E-5,3.4439999999999998E-2,3.0339999999999999E-2,2.419E-2,3.4476960000000001E-2,3.5106018602102931,57.72,{"$f":"AU74/(AU74+AT74)","v":0.94266589330242068},46.094710765000286,19.577384189532683,null,{"$f":"AV74*100","v":94.26658933024207},1.3477048399921845,{"$f":"AG74+AK74+AM74","v":1.5878195385678802},{"$f":"AG74+AM74*0.66","v":1.0719700177907043},{"$f":"AK74+AM74*0.33","v":0.51519432077717586},{"$f":"AN74","v":0.25900159386828764}]
["Power Dis",{"$f":"AS9","v":3.4476960000000001E-2},"W",null,null,null,66,16.8,1,7.92,7.92,3.8761904761904762,0.45616994599457789,12.566956725546145,14.203478362773073,1.6365216372269273,0,8.7113202278307078,1.0624194015653745,0.2,1.3796836126100744,3.6277679241942224,0.26321400223624919,0.26321400223624919,4.338892752852809,9.412995160379314E-4,9.412995160379314E-4,5.8836565467140094,0.86543535899226554,2.107515408895266E-2,1.5247680000000001E-2,0,1.0594646832161279,6.4241486402574663,0.45396654327334035,1.7740800000000001E-2,0.50666897959116264,1.7740800000000001E-2,6.6528000000000004E-2,0.26560485039134363,3.6960000000000005E-5,3.4439999999999998E-2,3.0339999999999999E-2,2.419E-2,{"$f":"SUM(AO75:AP75)","v":3.4476960000000001E-2},3.5943231875609958,58.608000000000004,0.94221561183940195,47.445046018293496,20.087682344464181,null,94.221561183940196,1.3796836126100744,1.6326616628072905,1.1033731632161279,0.52862321959116265,0.26560485039134363]
["Temp rise",{"$f":"B75*B62","v":1.0343088},"°C",null,null,null,67,16.8,1,8.0399999999999991,8.0399999999999991,3.9349206349206343,0.45640893106909847,12.567067780677274,14.323533890338636,1.7564661096613623,0,8.8205743983604261,1.0892354580381594,0.2,1.4123017932947621,3.6277999830491487,0.26321865434022806,0.26321865434022806,4.3934945387729192,9.6513971311137329E-4,9.6513971311137329E-4,5.9590075341318149,0.88774426979599341,2.1394474605451939E-2,1.5247680000000001E-2,0,1.0909686207574472,6.503288546971576,0.46522038117688841,1.8009600000000001E-2,0.52000107620750702,1.8009600000000001E-2,6.7535999999999985E-2,0.27230886450953984,3.6960000000000005E-5,3.4439999999999998E-2,3.0339999999999999E-2,2.419E-2,3.4476960000000001E-2,3.6797867088225957,59.495999999999995,0.94175321115061461,48.828322372570227,20.606942335885268,null,94.175321115061465,1.4123017932947621,1.6785056969649541,1.1355423807574472,0.54228795620750703,0.27230886450953984]
["Current (switching)",{"$f":"(Qg_Q1+Qg_Q2)*Fsw+Iq","v":2.0521999999999997E-3},"A",null,null,null,68,16.8,1,8.16,8.16,3.9936507936507937,0.45664795217514087,12.5671730489276,14.4435865244638,1.8764134755362001,0,8.9301037621896846,1.1164545448486409,0.2,1.4455673652325405,3.62783037137548,0.26322306406948703,0.26322306406948703,4.4482369820932526,9.8934061244310449E-4,9.8934061244310449E-4,6.034582963468389,0.91040478857457308,2.1713795121951224E-2,1.5247680000000001E-2,0,1.1232565904386511,6.5825953590123891,0.47663617826540583,1.8278400000000004E-2,0.53357111114311395,1.8278400000000004E-2,6.8543999999999994E-2,0.27911363621216023,3.6960000000000005E-5,3.4439999999999998E-2,3.0339999999999999E-2,2.419E-2,3.4476960000000001E-2,3.767020467708396,60.384000000000007,0.94127886913966397,50.245312108861995,21.135243983438329,null,94.127886913966393,1.4455673652325405,1.7253717015817649,1.1684956304386511,0.55619063114311396,0.27911363621216023]
["Qrr Current",{"$f":"Qrr_Q2*Fsw","v":5.9999999999999993E-3},"A",null,null,null,69,16.8,1,8.2799999999999994,8.2799999999999994,4.0523809523809522,0.45688700932085441,12.567272528988308,14.563636264494153,1.9963637355058452,0,9.0398983162508717,1.1440766619541749,0.2,1.4794885254410641,3.6278590887953945,0.26322723136310699,0.26322723136310699,4.5031150798591559,1.0139022711227468E-3,1.0139022711227468E-3,6.1103762130729553,0.93341743663219479,2.20331156384505E-2,1.5247680000000001E-2,0,1.1563472360079414,6.6620615505162935,0.48821370513154311,1.85472E-2,0.54738123640645631,1.85472E-2,6.9552000000000003E-2,0.28601916548854373,3.6960000000000005E-5,3.4439999999999998E-2,3.0339999999999999E-2,2.419E-2,3.4476960000000001E-2,3.8560534569782354,61.271999999999998,0.94079274210881436,51.696816908341482,21.67266906344534,null,94.079274210881437,1.4794885254410641,1.7732804724143978,1.2022515560079414,0.57033339640645631,0.28601916548854373]
["Diode Current",{"$f":"Deadtime*Fsw*(Iripple_Vinnom/2)*(Vsd_Q2)/Vin","v":4.2902603999860859E-4},null,null,null,null,70,16.8,1,8.4,8.4,4.1111111111111107,0.45712610251439101,12.567366219550188,14.683683109775094,2.1163168902249065,0,9.1499485139548344,1.1721018093123401,0.2,1.5140736902547216,3.6278861349309555,0.26323115616048531,0.26323115616048531,4.5581240554861413,1.0388247452600714E-3,1.0388247452600714E-3,6.1863809628259574,0.9567827354303855,2.2352436154949785E-2,1.5247680000000001E-2,0,1.1902599152501592,6.7416799383246353,0.49995273229889742,1.8816000000000003E-2,0.56143365646298871,1.8816000000000003E-2,7.0559999999999998E-2,0.29302545232808502,3.6960000000000005E-5,3.4439999999999998E-2,3.0339999999999999E-2,2.419E-2,3.4476960000000001E-2,3.9469156552016997,62.160000000000004,0.94029496587334538,53.183669155756846,22.219301345593571,null,94.029496587334535,1.5140736902547216,1.8222535717131478,1.2368295152501592,0.5847184564629887,0.29302545232808502]
["Total",{"$f":"SUM(B77:B79)","v":8.4812260399986083E-3},"A",null,null,null,71,16.8,1,8.52,8.52,4.1698412698412701,0.4573652317639047,12.567454119303619,14.803727059651809,2.23627294034819,0,9.2602452408166158,1.2005299868809349,0.2,1.5493315010072071,3.6279115094041079,0.26323483840133582,0.26323483840133582,4.6132593466750871,1.0641080899842527E-3,1.0641080899842527E-3,6.2625911780606112,0.98050120658806483,2.2671756671449068E-2,1.5247680000000001E-2,0,1.2250147319802114,6.82144366366418,0.51185303022198603,1.9084800000000002E-2,0.57573062923082408,1.9084800000000002E-2,7.1568000000000007E-2,0.30013249672023373,3.6960000000000005E-5,3.4439999999999998E-2,3.0339999999999999E-2,2.419E-2,3.4476960000000001E-2,4.0396380654297959,63.048000000000002,0.93978565676302417,54.706733315149087,22.775226630771314,null,93.978565676302424,1.5493315010072071,1.8723133612110354,1.2722496119802114,0.59934806923082407,0.30013249672023373]
[null,null,null,null,null,null,72,16.8,1,8.64,8.64,4.2285714285714286,0.45760439707755218,12.567536226938602,14.923768113469301,2.3562318865306997,0,9.3707797915266635,1.229361194617983,0.2,1.58527082991896,3.6279352118366881,0.26323827802569033,0.26323827802569033,4.6685165940438171,1.0897523594431242E-3,1.0897523594431242E-3,6.3390010944362825,1.0045733718816097,2.2991077187948353E-2,1.5247680000000001E-2,0,1.260632569825838,6.9013461749154503,0.52391436928622126,1.9353600000000002E-2,0.59027446710756515,1.9353600000000002E-2,7.2576000000000002E-2,0.30734029865449575,3.6960000000000005E-5,3.4439999999999998E-2,3.0339999999999999E-2,2.419E-2,3.4476960000000001E-2,4.1342527558919926,63.936000000000007,0.93926491252033528,56.266907382511036,23.340532790087476,null,93.926491252033529,1.58527082991896,1.9234830369334033,1.308532729825838,0.61422454710756513,0.30734029865449575]
[null,null,null,null,null,null,73,16.8,1,8.76,8.76,4.2873015873015872,0.45784359846349232,12.567612541144728,15.043806270572365,2.4761937294276359,0,9.481543848376953,1.2585954324817277,0.2,1.6219007861974593,3.6279572418504129,0.2632414749738971,0.2632414749738971,4.7238916304302103,1.1157576068024297E-3,1.1157576068024297E-3,6.4156052037041995,1.0289997532449102,2.3310397704447636E-2,1.5247680000000001E-2,0,1.2971351279161305,6.9813812114006808,0.53613651980788279,1.9622400000000002E-2,0.60506753802921431,1.9622400000000002E-2,7.3583999999999983E-2,0.31464885812043192,3.6960000000000005E-5,3.4439999999999998E-2,3.0339999999999999E-2,2.419E-2,3.4476960000000001E-2,4.2307929028439348,64.823999999999998,0.93873281310398815,57.865124420393613,23.915309805110144,null,93.873281310398809,1.6219007861974593,1.9757866659453449,1.3457005679161305,0.62935025802921429,0.31464885812043192]
[null,null,null,null,null,null,74,16.8,1,8.8800000000000008,8.8800000000000008,4.3460317460317457,0.45808283592988708,12.567683060611216,15.163841530305609,2.5961584696943927,0,9.5925294609571665,1.2882327004306366,0.2,1.6592307223587741,3.627977599066893,0.26324442918662355,0.26324442918662355,4.7793804708248109,1.1421238842450796E-3,1.1421238842450796E-3,6.4923982403097646,1.0537808727694331,2.3629718220946921E-2,1.5247680000000001E-2,0,1.3345449586010156,7.0615427881273831,0.54851925203409235,1.9891200000000005E-2,0.62011226656212981,1.9891200000000005E-2,7.4592000000000006E-2,0.32205817510765916,3.6960000000000005E-5,3.4439999999999998E-2,3.0339999999999999E-2,2.419E-2,3.4476960000000001E-2,4.3292928357004472,65.712000000000003,0.93818942140522887,59.502354179843671,24.499649809360932,null,93.818942140522893,1.6592307223587741,2.0292492251631455,1.3837756786010156,0.64472762656212979,0.32205817510765916]
[null,null,null,null,null,null,75,16.8,1,9,9,4.4047619047619051,0.45832210948490021,12.567747784026857,15.283873892013428,2.7161261079865717,0,9.703729027041236,1.318272998423397,0.2,1.6972702407791338,3.6279962831076142,0.26324714060485327,0.26324714060485327,4.8349793028934487,1.168851242970401E-3,1.168851242970401E-3,6.5693751687790778,1.0789172527042783,2.3949038737446204E-2,1.5247680000000001E-2,0,1.3728855073364303,7.1418251814274711,0.56106233614278689,2.0160000000000001E-2,0.6354111350290268,2.0160000000000001E-2,7.5600000000000001E-2,0.32956824960584924,3.6960000000000005E-5,3.4439999999999998E-2,3.0339999999999999E-2,2.419E-2,3.4476960000000001E-2,4.4297880845982638,66.600000000000009,0.93763478388359733,61.179604815466504,25.093647131103019,null,93.763478388359729,1.6972702407791338,2.0838966423654575,1.4227815073364303,0.66035913502902677,0.32956824960584924]
[null,null,null,null,null,null,76,16.8,1,9.1199999999999992,9.1199999999999992,4.4634920634920627,0.45856141913669818,12.56780671008007,15.403903355040034,2.8360966449599641,0,9.8151352745896716,1.3487163264189226,0.2,1.7360292004857298,3.6280132935939569,0.26324960916988943,0.26324960916988943,4.8906844780529291,1.1959397331933925E-3,1.1959397331933925E-3,6.6465311718406674,1.104409415456242,2.4268359253945479E-2,1.5247680000000001E-2,0,1.4121811548802892,7.2222229154357169,0.57376554224269261,2.04288E-2,0.65096668467006291,2.04288E-2,7.6607999999999982E-2,0.33717908160473065,3.6960000000000005E-5,3.4439999999999998E-2,3.0339999999999999E-2,2.419E-2,3.4476960000000001E-2,4.5323154305438971,67.488,0.93706893112798362,62.897924699852432,25.697398337462388,null,93.706893112798355,1.7360292004857298,2.139755839550352,1.4627424348802891,0.67624732467006288,0.33717908160473065]
[null,null,null,null,null,null,77,16.8,1,9.24,9.24,4.5222222222222221,0.45880076489345017,12.567859837458874,15.523929918729436,2.9560700812705631,0,9.926741244797693,1.3795626843763471,0.2,1.7755177241963556,3.6280286301471838,0.26325183482335301,0.26325183482335301,4.9464925030651266,1.2233894041439751E-3,1.2233894041439751E-3,6.7238616392364117,1.1302578835898742,2.4587679770444765E-2,1.5247680000000001E-2,0,1.4524572619555753,7.302730749354839,0.58662864037329954,2.0697600000000003E-2,0.66678151684009179,2.0697600000000003E-2,7.7616000000000004E-2,0.34489067109408678,3.6960000000000005E-5,3.4439999999999998E-2,3.0339999999999999E-2,2.419E-2,3.4476960000000001E-2,4.6369129583136059,68.376000000000005,0.93649187834813508,64.658404344089732,26.311002279923486,null,93.649187834813503,1.7755177241963556,2.1968547787956672,1.5036838219555753,0.69239479684009175,0.34489067109408678]
[null,null,null,null,null,null,78,16.8,1,9.36,9.36,4.5809523809523807,0.45904014676332733,12.567907164850887,15.643953582425443,3.0760464175745561,0,10.038540276123774,1.4108120722550286,0.2,1.8157462056179994,3.628042292388443,0.2632538175071838,0.2632538175071838,5.0024000321170696,1.2512003040662429E-3,1.2512003040662429E-3,6.801362157178632,1.1564631798275395,2.4907000286944043E-2,1.5247680000000001E-2,0,1.4937402165491591,7.383343665457919,0.59965140050483334,2.09664E-2,0.68285829424320377,2.09664E-2,7.8623999999999986E-2,0.35270301806375715,3.6960000000000005E-5,3.4439999999999998E-2,3.0339999999999999E-2,2.419E-2,3.4476960000000001E-2,4.7436201122853685,69.263999999999996,0.93590362580112307,66.462178431613836,26.934560141241743,null,93.590362580112313,1.8157462056179994,2.2552225107923629,1.545632056549159,0.70880421424320372,0.35270301806375715]
[null,null,null,null,null,null,79,16.8,1,9.48,9.48,4.6396825396825392,0.45927956475450377,12.567948690943334,15.763974345471667,3.1960256545283334,0,10.150525989237307,1.4424644900145482,0.2,1.8567253170149545,3.6280542799387696,0.26325555716364046,0.26325555716364046,5.0584038593566572,1.2793724802177163E-3,1.2793724802177163E-3,6.8790284984130725,1.1830258270494802,2.5226320803443333E-2,1.5247680000000001E-2,0,1.5360574840282759,7.4640568577820199,0.61283359253823078,2.1235200000000003E-2,0.69919974220572745,2.1235200000000003E-2,7.9631999999999994E-2,0.36061612250363706,3.6960000000000005E-5,3.4439999999999998E-2,3.0339999999999999E-2,2.419E-2,3.4476960000000001E-2,4.8524777553964524,70.152000000000001,0.93530415915672016,68.310427973215866,27.56817548381764,null,93.530415915672023,1.8567253170149545,2.3148892262340035,1.5886146040282758,0.7254783022057274,0.36061612250363706]
[null,null,null,null,null,null,80,16.8,1,9.6,9.6,4.6984126984126986,0.45951901887515567,12.567984414423044,15.883992207211522,3.3160077927884775,0,10.262692272828073,1.4745199376147105,0.2,1.8984660170575365,3.6280645924190833,0.26325705373530101,0.26325705373530101,5.1145009118555986,1.3079059788685876E-3,1.3079059788685876E-3,6.9568566128500029,1.2099463482938706,2.5545641319942615E-2,1.5247680000000001E-2,0,1.5794376602711004,7.5448657214698134,0.62617498630511226,2.1504000000000002E-2,0.71580864998890226,2.1504000000000002E-2,8.0639999999999989E-2,0.36862998440367761,3.6960000000000005E-5,3.4439999999999998E-2,3.0339999999999999E-2,2.419E-2,3.4476960000000001E-2,4.9635282314353875,71.040000000000006,0.93469344980510449,70.204382591657321,28.211954299578284,null,93.469344980510442,1.8984660170575365,2.3758863102600025,1.6326600602711003,0.7424198499889022,0.36862998440367761]
[null,null,null,null,null,null,81,16.8,1,9.7200000000000006,9.7200000000000006,4.757142857142858,0.45975850913346206,12.568014333976461,16.004007166988231,3.4359928330117704,0,10.375033270223915,1.5069784150155439,0.2,1.940979558963039,3.6280732294501927,0.26325830716506304,0.26325830716506304,5.1706882429730312,1.3368008453009768E-3,1.3368008453009768E-3,7.0348426187282467,1.2372252667568826,2.5864961836441901E-2,1.5247680000000001E-2,0,1.6239105280237696,7.625765842718871,0.63967535156775635,2.1772800000000005E-2,0.73268787214248721,2.1772800000000005E-2,8.1647999999999998E-2,0.37674460375388596,3.6960000000000005E-5,3.4439999999999998E-2,3.0339999999999999E-2,2.419E-2,3.4476960000000001E-2,5.0768154308935465,71.928000000000011,0.9340714551098479,72.145322945022102,28.866005061414516,null,93.40714551098479,1.940979558963039,2.4382464001662565,1.6777982080237697,0.75963171214248726,0.37674460375388596]
[null,null,null,null,null,null,82,16.8,1,9.84,9.84,4.8158730158730156,0.45999803553760388,12.568038448289597,16.124019224144799,3.5559807758552013,0,10.487543366766458,1.5398399221772998,0.2,1.9842774989411116,3.6280801906527831,0.26325931739614272,0.26325931739614272,5.2269630260949329,1.366057123808175E-3,1.366057123808175E-3,7.1129827942790378,1.2648631057927409,2.6184282352941183E-2,1.5247680000000001E-2,0,1.6695071167134299,7.7067529893008455,0.65333445801907264,2.2041600000000001E-2,0.74984032990061467,2.2041600000000001E-2,8.2655999999999993E-2,0.38495998054432495,3.6960000000000005E-5,3.4439999999999998E-2,3.0339999999999999E-2,2.419E-2,3.4476960000000001E-2,5.1923848606194323,72.816000000000003,0.93343811860870007,74.134583298677484,29.53043877622336,null,93.343811860870005,1.9842774989411116,2.5020034466140446,1.72406007671343,0.77711680990061471,0.38495998054432495]
[null,null,null,null,null,null,83,16.8,1,9.9600000000000009,9.9600000000000009,4.874603174603175,0.46023759809576514,12.568056756048104,16.244028378024055,3.6759716219759486,0,10.600217177898003,1.5731044590604546,0.2,2.0283717049563683,3.6280854756474343,0.26326008437207743,0.26326008437207743,5.2833225487261313,1.3956748576938992E-3,1.3956748576938992E-3,7.1912735698589252,1.2928603889137884,2.6503602869440469E-2,1.5247680000000001E-2,0,1.7162597659658687,7.7878231016152624,0.66715207528257603,2.2310400000000005E-2,0.76726901262125946,2.2310400000000005E-2,8.3664000000000002E-2,0.39327611476511365,3.6960000000000005E-5,3.4439999999999998E-2,3.0339999999999999E-2,2.419E-2,3.4476960000000001E-2,5.3102837175383817,73.704000000000008,0.93279337016428987,76.173554256532356,30.205369039607859,null,93.279337016428983,2.0283717049563683,2.5671927785871285,1.7714780059658688,0.7948781326212595,0.39327611476511365]
[null,null,null,null,null,null,84,16.8,1,10.08,10.08,4.9333333333333327,0.46047719681613214,12.568069255937228,16.364034627968614,3.795965372031386,0,10.713049537915721,1.6067720256257072,0.2,2.0732743658216335,3.6280890840546092,0.26326060803672424,0.26326060803672424,5.3397642069131388,1.4256540892715352E-3,1.4256540892715352E-3,7.2697115205227867,1.3212176397905433,2.6822923385939751E-2,1.5247680000000001E-2,0,1.7642021930968874,7.868972284244907,0.6811279729123596,2.2579200000000004E-2,0.78497697927073851,2.2579200000000004E-2,8.4671999999999997E-2,0.4016930064064268,3.6960000000000005E-5,3.4439999999999998E-2,3.0339999999999999E-2,2.419E-2,3.4476960000000001E-2,5.4305609667216821,74.591999999999999,0.93213712606648458,78.263685663166157,30.890912092288065,null,93.213712606648457,2.0732743658216335,2.6338511723676259,1.8200857130968875,0.81291873927073854,0.4016930064064268]
[null,null,null,null,null,null,85,16.8,1,10.199999999999999,10.199999999999999,4.9920634920634921,0.46071683170689331,12.568075946641805,16.484037973320902,3.9159620266790967,0,10.826035489352185,1.640842621833982,0.2,2.118998000635937,3.6280910154946535,0.26326088833426053,0.26326088833426053,5.396285499977532,1.4559948598633883E-3,1.4559948598633883E-3,7.3482933590099888,1.3499353822517577,2.7142243902439026E-2,1.5247680000000001E-2,0,1.8133695648692609,7.9501967979819659,0.69526192039306967,2.2848E-2,0.80296735995472068,2.2848E-2,8.5679999999999992E-2,0.4102106554584955,3.6960000000000005E-5,3.4439999999999998E-2,3.0339999999999999E-2,2.419E-2,3.4476960000000001E-2,5.5532674241125379,75.48,0.93146928908780391,80.406489689378219,31.587186878279386,null,93.146928908780396,2.118998000635937,2.7020169248239814,1.869918364869261,0.83124175995472072,0.4102106554584955]
[null,null,null,null,null,null,86,16.8,1,10.32,10.32,5.0507936507936515,0.46095650277624012,12.568076826846291,16.604038413423147,4.035961586576855,0,10.939170272943887,1.6753162476464294,0.2,2.165555468582034,3.6280912695878018,0.26326092520918454,0.26326092520918454,5.4528840255408522,1.4866972097999306E-3,1.4866972097999306E-3,7.427015929118463,1.3790141402844847,2.7461564418938308E-2,1.5247680000000001E-2,0,1.8637985738318963,8.0314930522960566,0.70955368713987799,2.3116800000000003E-2,0.82124335749727984,2.3116800000000003E-2,8.6687999999999987E-2,0.41882906191160735,3.6960000000000005E-5,3.4439999999999998E-2,3.0339999999999999E-2,2.419E-2,3.4476960000000001E-2,5.6784558442418023,76.368000000000009,0.93078974849295304,82.603544114771537,32.294315104896633,null,93.078974849295307,2.165555468582034,2.7717299313291761,1.9210126538318963,0.84985039749727986,0.41882906191160735]
[null,null,null,null,null,null,87,16.8,1,10.44,10.44,5.1095238095238091,0.46119621003236594,12.568071895234732,16.724035947617367,4.1559640523826333,0,11.05244931815187,1.7101929030244205,0.2,2.212959979098994,3.6280898459541717,0.26326071860631528,0.26326071860631528,5.5095574748232661,1.5177611784190463E-3,1.5177611784190463E-3,7.5058761994430174,1.4084544380341288,2.7780884935437591E-2,1.5247680000000001E-2,0,1.9155275195849453,8.112857598217202,0.72400304249845648,2.3385600000000003E-2,0.83980824906959295,2.3385600000000003E-2,8.7695999999999996E-2,0.42754822575610513,3.6960000000000005E-5,3.4439999999999998E-2,3.0339999999999999E-2,2.419E-2,3.4476960000000001E-2,5.8061810132943723,77.256,0.9300983800032282,84.856495822152652,33.012421304644533,null,93.009838000322816,2.212959979098994,2.8430317686545381,1.9734068795849453,0.86874792906959297,0.42754822575610513]
[null,null,null,null,null,null,88,16.8,1,10.56,10.56,5.1682539682539685,0.46143595348346711,12.568061150490786,16.844030575245394,4.2759694247546074,0,11.165868234201032,1.7454725879295554,0.2,2.2612251024461987,3.6280867442137668,0.26326026847079304,0.26326026847079304,5.5663036281993792,1.5491868040652787E-3,1.5491868040652787E-3,7.5848712574559007,1.4382567998045166,2.8100205451936873E-2,1.5247680000000001E-2,0,1.9685963953445453,8.1942871216085056,0.73860975574494903,2.3654400000000003E-2,0.85866538786994029,2.3654400000000003E-2,8.8704000000000005E-2,0.43636814698238885,3.6960000000000005E-5,3.4439999999999998E-2,3.0339999999999999E-2,2.419E-2,3.4476960000000001E-2,5.9364998479179309,78.144000000000005,0.9293950457162401,87.167064519815455,33.741632899057734,null,92.939504571624013,2.2612251024461987,2.9159657832144856,2.0271410353445454,0.88793770786994031,0.43636814698238885]
[null,null,null,null,null,null,89,16.8,1,10.68,10.68,5.2269841269841262,0.46167573313774207,12.568044591297712,16.964022295648856,4.3959777043511439,0,11.279422801606648,1.7811553023236555,0.2,2.3103647806758678,3.6280819639864772,0.26325957474807948,0.26325957474807948,5.6231203509956567,1.580974124089076E-3,1.580974124089076E-3,7.6639983039088602,1.4684217500579473,2.8419525968436159E-2,1.5247680000000001E-2,0,2.0230469802135356,8.2757784368049681,0.75337359608594689,2.3923200000000002E-2,0.877818204856748,2.3923200000000002E-2,8.9711999999999986E-2,0.44528882558091387,3.6960000000000005E-5,3.4439999999999998E-2,3.0339999999999999E-2,2.419E-2,3.4476960000000001E-2,6.0694715001992323,79.031999999999996,0.92867959398110977,89.537046709182022,34.482080264556423,null,92.867959398110983,2.3103647806758678,2.9905771850702836,2.0822569002135354,0.90742316485674801,0.44528882558091387]
[null,null,null,null,null,null,90,16.8,1,10.8,10.8,5.2857142857142865,0.46191554900339193,12.568022216338353,17.084011108169179,4.5159888918308244,0,11.3931089641589,1.8172410461687705,0.2,2.3603933390321816,3.6280755048920725,0.26325863738395738,0.26325863738395738,5.6800055895149208,1.6131231748460373E-3,1.6131231748460373E-3,7.743254647537456,1.4989498134152603,2.8738846484935444E-2,1.5247680000000001E-2,0,2.0789229376006393,8.357328480596383,0.76829433265846181,2.4192000000000005E-2,0.89727021053646305,2.4192000000000005E-2,9.0720000000000009E-2,0.45431026154219262,3.6960000000000005E-5,3.4439999999999998E-2,3.0339999999999999E-2,2.419E-2,3.4476960000000001E-2,6.2051574692702802,79.920000000000016,0.92795185922900292,91.968319916827497,35.233896800385594,null,92.795185922900288,2.3603933390321816,3.0669131481371026,2.1387981376006393,0.92720781053646306,0.45431026154219262]
[null,null,null,null,null,null,91,16.8,1,10.92,10.92,5.3444444444444441,0.4621554010886203,12.567994024295183,17.203997012147592,4.6360029878524083,0,11.506922821337884,1.8537298194271725,0.2,2.411325497795922,3.6280673665502161,0.2632574563245324,0.2632574563245324,5.7369573672743188,1.6456339916961543E-3,1.6456339916961543E-3,7.8226377000495022,1.5298415146558941,2.9058167001434723E-2,1.5247680000000001E-2,0,2.1362699202702098,8.4389343065336657,0.78337173452989917,2.4460800000000001E-2,0.91702499680814353,2.4460800000000001E-2,9.172799999999999E-2,0.46343245485679313,3.6960000000000005E-5,3.4439999999999998E-2,3.0339999999999999E-2,2.419E-2,3.4476960000000001E-2,6.3436217200472962,80.808000000000007,0.92721166175857761,94.462847211619007,35.997218998709457,null,92.721166175857761,2.411325497795922,3.1450229170783532,2.1968104002702096,0.94729523680814354,0.46343245485679313]
[null,null,null,null,null,null,92,16.8,1,11.04,11.04,5.4031746031746026,0.46239528940163316,12.567960013850257,17.323980006925126,4.7560199930748706,0,11.620860621133511,1.8906216220613616,0.2,2.4631763845946004,3.6280575485804496,0.26325603151623161,0.26325603151623161,5.7939737814440582,1.678506609003058E-3,1.678506609003058E-3,7.9021449713807286,1.5610973787179434,2.9377487517933999E-2,1.5247680000000001E-2,0,2.1951356825484014,8.5205930795393456,0.79860557069803162,2.4729600000000001E-2,0.93708623886671183,2.4729600000000001E-2,9.2735999999999985E-2,0.47265540551534041,3.6960000000000005E-5,3.4439999999999998E-2,3.0339999999999999E-2,2.419E-2,3.4476960000000001E-2,6.4849308096502885,81.695999999999998,0.92645880747563392,97.022682029581262,36.772186516935051,null,92.645880747563396,2.4631763845946004,3.2249579214151134,2.2563414425484014,0.96768911886671183,0.47265540551534041]
[null,null,null,null,null,null,93,16.8,1,11.16,11.16,5.461904761904762,0.46263521395063906,12.567920183685247,17.443960091842623,4.8760399081573764,0,11.734918753246239,1.9279164540340636,0.2,2.5159615471990233,3.6280460506022045,0.26325436290580512,0.26325436290580512,5.8510529994749927,1.7117410601332655E-3,1.7117410601332655E-3,7.9817740652018605,1.592717930698226,2.9696808034433288E-2,1.5247680000000001E-2,0,2.2555702002598923,8.6023020708041411,0.81399561009097343,2.4998400000000004E-2,0.95745769716690809,2.4998400000000004E-2,9.3743999999999994E-2,0.48197911350851591,3.6960000000000005E-5,3.4439999999999998E-2,3.0339999999999999E-2,2.419E-2,3.4476960000000001E-2,6.6291540221002787,82.584000000000003,0.92569308758596203,99.649973331175374,37.558942252342504,null,92.569308758596208,2.5159615471990233,3.3067718974268003,2.3174412402598925,0.98839321716690809,0.48197911350851591]
[null,null,null,null,null,null,94,16.8,1,11.28,11.28,5.5206349206349197,0.46287517474384893,12.567874532481413,17.563937266240707,4.9960627337592927,0,11.849093742646154,1.9656143153082273,0.2,2.5696969668283884,3.6280328722347934,0.26325245044032491,0.26325245044032491,5.9081932559038979,1.7453373774554152E-3,1.7453373774554152E-3,8.0615226746622337,1.6247036958523335,3.001612855093257E-2,1.5247680000000001E-2,0,2.31762579902249,8.6840586529527144,0.82954162156715194,2.52672E-2,0.97814321945005378,2.52672E-2,9.4751999999999989E-2,0.49140357882705682,3.6960000000000005E-5,3.4439999999999998E-2,3.0339999999999999E-2,2.419E-2,3.4476960000000001E-2,6.7763635119457692,83.471999999999994,0.92491427824008332,102.34697111796707,38.357632419102046,null,92.491427824008326,2.5696969668283884,3.3905210184725441,2.38016211902249,1.0094113794500539,0.49140357882705682]
[null,null,null,null,null,null,95,16.8,1,11.4,11.4,5.57936507936508,0.46311517178947625,12.567823058919624,17.683911529459813,5.1160884705401886,0,11.963382243469416,2.0037152058470307,0.2,2.6243990719871499,3.6280180130974156,0.26325029406718636,0.26325029406718636,5.965392849326042,1.7792955923395138E-3,1.7792955923395138E-3,8.1413885783561586,1.6570551995947029,3.0335449067431852E-2,1.5247680000000001E-2,0,2.3813572915859624,8.7658602954628044,0.8452433739152837,2.5536000000000003E-2,0.9991467428358406,2.5536000000000003E-2,9.5759999999999998E-2,0.50092880146175767,3.6960000000000005E-5,3.4439999999999998E-2,3.0339999999999999E-2,2.419E-2,3.4476960000000001E-2,6.9266344575302359,84.360000000000014,0.92412214012827087,105.11603233819639,39.168406627761939,null,92.412214012827093,2.6243990719871499,3.4762640344218028,2.4445588915859626,1.0307475428358406,0.50092880146175767]
[null,null,null,null,null,null,96,16.8,1,11.52,11.52,{"$f":"Vout*K105/(Vin*Efficiency)","v":5.6380952380952376},0.46335520509573691,{"$f":"(Vin-(Rdson1+Rdcr)*K105-Vout)*M105/(Fsw*Lf)","v":12.567765761680345},17.80388288084017,5.236117119159827,{"$f":"IF(MIN(Vin, -P105/(Coss_Q1+Coss_Q2)*0.00000002)<0, 0, MIN(Vin, -P105/(Coss_Q1+Coss_Q2)*0.00000002))","v":0},12.077781033232279,{"$f":"R105^2*Rdcr","v":2.0422191256138755},0.2,{"$f":"(T105+S105*(1+Ltc*(Ta-25)))/(1-S105*Ltc*ThetaCa)","v":2.680084752858114},3.6280014728091547,0.2632478937341079,0.2632478937341079,6.0226501395252585,1.8136157351561807E-3,1.8136157351561807E-3,8.2213696364989381,{"$f":"Rdson1*AB105^2","v":1.6897729674986672},3.0654769583931134E-2,1.5247680000000001E-2,0,{"$f":"(AF105+AE105+AD105+AC105*(1+RdsonTopTc*Ta-RdsonTopTc*25))/(1-AC105*RdsonTopTc*ThetaJA_Q1)","v":2.4468221249665238},8.847704560322903,{"$f":"Rdson2*AH105^2","v":0.8611006358543456},2.5804800000000003E-2,{"$f":"(AJ105+AI105*(1+RdsonBotTc*Ta-RdsonBotTc*25))/(1-AI105*RdsonBotTc*ThetaJA_Q2)","v":1.0204722959814314},2.5804800000000003E-2,9.6767999999999993E-2,0.51055478140346888,3.6960000000000005E-5,3.4439999999999998E-2,3.0339999999999999E-2,2.419E-2,3.4476960000000001E-2,{"$f":" SUM(U105,X105,AA105,AG105,AK105,AL105,AM105,AS105,AN105)","v":7.0800452246788028},85.248000000000005,0.92331641802391007,107.95962721356052,39.991417967294396,null,92.331641802391005,2.680084752858114,3.5640624209479554,2.5106890049665238,1.0524057359814314,0.51055478140346888]
[null,null,null,null,null,null,97,16.8,1,11.64,11.64,{"$f":"Vout*K106/(Vin*Efficiency)","v":5.696825396825397},0.46359527467084943,{"$f":"(Vin-(Rdson1+Rdcr)*K106-Vout)*M106/(Fsw*Lf)","v":12.567702639443658},17.92385131972183,5.3561486802781717,{"$f":"IF(MIN(Vin, -P106/(Coss_Q1+Coss_Q2)*0.00000002)<0, 0, MIN(Vin, -P106/(Coss_Q1+Coss_Q2)*0.00000002))","v":0},12.1922870073443,{"$f":"R106^2*Rdcr","v":2.081126074572393},0.2,{"$f":"(T106+S106*(1+Ltc*(Ta-25)))/(1-S106*Ltc*ThetaCa)","v":2.7367713762775616},3.6279832509889833,0.26324524938913185,0.26324524938913185,6.0799635447523661,1.8482978352758878E-3,1.8482978352758878E-3,8.3014637873004702,{"$f":"Rdson1*AB106^2","v":1.7228575252965268},3.0974090100430424E-2,1.5247680000000001E-2,0,{"$f":"(AF106+AE106+AD106+AC106*(1+RdsonTopTc*Ta-RdsonTopTc*25))/(1-AC106*RdsonTopTc*ThetaJA_Q1)","v":2.514080538200762},8.9295890979146151,{"$f":"Rdson2*AH106^2","v":0.87711317603355099},2.6073600000000002E-2,{"$f":"(AJ106+AI106*(1+RdsonBotTc*Ta-RdsonBotTc*25))/(1-AI106*RdsonBotTc*ThetaJA_Q2)","v":1.0421240013102788},2.6073600000000002E-2,9.7776000000000002E-2,0.52028151864309824,3.6960000000000005E-5,3.4439999999999998E-2,3.0339999999999999E-2,2.419E-2,3.4476960000000001E-2,{"$f":" SUM(U106,X106,AA106,AG106,AK106,AL106,AM106,AS106,AN106)","v":7.2366775416561087},86.13600000000001,0.92249684027292,110.88034602263278,40.826823089790601,null,92.249684027292005,2.7367713762775616,3.653980539511041,2.5786126982007622,1.0743900813102789,0.52028151864309824]
[null,null,null,null,null,null,98,16.8,1,11.76,11.76,{"$f":"Vout*K107/(Vin*Efficiency)","v":5.7555555555555555},0.4638353805230348,{"$f":"(Vin-(Rdson1+Rdcr)*K107-Vout)*M107/(Fsw*Lf)","v":12.567633690889222},18.04381684544461,5.4761831545553887,{"$f":"IF(MIN(Vin, -P107/(Coss_Q1+Coss_Q2)*0.00000002)<0, 0, MIN(Vin, -P107/(Coss_Q1+Coss_Q2)*0.00000002))","v":0},12.306897173903387,{"$f":"R107^2*Rdcr","v":2.1204360526864368},0.2,{"$f":"(T107+S107*(1+Ltc*(Ta-25)))/(1-S107*Ltc*ThetaCa)","v":2.7944768013195436},3.6279633472557515,0.26324236098062315,0.26324236098062315,6.1373315391433669,1.8833419210681948E-3,1.8833419210681948E-3,8.3816690435249193,{"$f":"Rdson1*AB107^2","v":1.7563093988795986},3.1293410616929702E-2,1.5247680000000001E-2,0,{"$f":"(AF107+AE107+AD107+AC107*(1+RdsonTopTc*Ta-RdsonTopTc*25))/(1-AC107*RdsonTopTc*ThetaJA_Q1)","v":2.5831957316228449},9.0115116431066777,{"$f":"Rdson2*AH107^2","v":0.89328076303231929},2.6342400000000002E-2,{"$f":"(AJ107+AI107*(1+RdsonBotTc*Ta-RdsonBotTc*25))/(1-AI107*RdsonBotTc*ThetaJA_Q2)","v":1.0641060773131399},2.6342400000000002E-2,9.8783999999999997E-2,0.53010901317160919,3.6960000000000005E-5,3.4439999999999998E-2,3.0339999999999999E-2,2.419E-2,3.4476960000000001E-2,{"$f":" SUM(U107,X107,AA107,AG107,AK107,AL107,AM107,AS107,AN107)","v":7.3966166863288283},87.024000000000001,0.92166311822659608,113.88090637978233,41.674782297899313,null,92.166311822659608,2.7944768013195436,3.7460858089359848,2.6483931716228448,1.0967047973131399,0.53010901317160919]
[null,null,null,null,null,null,99,16.8,1,11.88,11.88,{"$f":"Vout*K108/(Vin*Efficiency)","v":5.8142857142857141},0.46407552266051622,{"$f":"(Vin-(Rdson1+Rdcr)*K108-Vout)*M108/(Fsw*Lf)","v":12.567558914696312},18.163779457348156,5.596220542651845,{"$f":"IF(MIN(Vin, -P108/(Coss_Q1+Coss_Q2)*0.00000002)<0, 0, MIN(Vin, -P108/(Coss_Q1+Coss_Q2)*0.00000002))","v":0},12.421608648756552,{"$f":"R108^2*Rdcr","v":2.1601490599200899},0.2,{"$f":"(T108+S108*(1+Ltc*(Ta-25)))/(1-S108*Ltc*ThetaCa)","v":2.8532193955180096},3.6279417612281986,0.26323922845727127,0.26323922845727127,6.1947526502694208,1.9187480199010008E-3,1.9187480199010008E-3,8.4619834892258741,{"$f":"Rdson1*AB108^2","v":1.7901291142982825},3.1612731133428988E-2,1.5247680000000001E-2,0,{"$f":"(AF108+AE108+AD108+AC108*(1+RdsonTopTc*Ta-RdsonTopTc*25))/(1-AC108*RdsonTopTc*ThetaJA_Q1)","v":2.6542340486580054},9.0934700115485203,{"$f":"Rdson2*AH108^2","v":0.90960316536025465},2.6611200000000005E-2,{"$f":"(AJ108+AI108*(1+RdsonBotTc*Ta-RdsonBotTc*25))/(1-AI108*RdsonBotTc*ThetaJA_Q2)","v":1.0864228409239136},2.6611200000000005E-2,9.9792000000000006E-2,0.54003726498002247,3.6960000000000005E-5,3.4439999999999998E-2,3.0339999999999999E-2,2.419E-2,3.4476960000000001E-2,{"$f":" SUM(U108,X108,AA108,AG108,AK108,AL108,AM108,AS108,AN108)","v":7.559951686557123},87.912000000000006,0.92081494561484278,116.96416105229424,42.535459635108722,null,92.081494561484277,2.8532193955180096,3.8404488895819187,2.7200967686580055,1.1193542009239137,0.54003726498002247]
[null,null,null,null,null,null,100,16.8,1,12,12,{"$f":"Vout*K109/(Vin*Efficiency)","v":5.8730158730158735},0.46431570109151976,{"$f":"(Vin-(Rdson1+Rdcr)*K109-Vout)*M109/(Fsw*Lf)","v":12.567478309543803},18.283739154771901,5.7162608452280983,{"$f":"IF(MIN(Vin, -P109/(Coss_Q1+Coss_Q2)*0.00000002)<0, 0, MIN(Vin, -P109/(Coss_Q1+Coss_Q2)*0.00000002))","v":0},12.536418650811104,{"$f":"R109^2*Rdcr","v":2.2002650962376631},0.2,{"$f":"(T109+S109*(1+Ltc*(Ta-25)))/(1-S109*Ltc*ThetaCa)","v":2.9130180517569473},3.627918492524949,0.26323585176809,0.26323585176809,6.2522254568109998,1.9545161581397759E-3,1.9545161581397759E-3,8.5424052766469156,{"$f":"Rdson1*AB109^2","v":1.8243171977621266},3.1932051649928274E-2,1.5247680000000001E-2,0,{"$f":"(AF109+AE109+AD109+AC109*(1+RdsonTopTc*Ta-RdsonTopTc*25))/(1-AC109*RdsonTopTc*ThetaJA_Q1)","v":2.7272651712242517},9.1754620961518576,{"$f":"Rdson2*AH109^2","v":0.92608015145711386},2.6880000000000001E-2,{"$f":"(AJ109+AI109*(1+RdsonBotTc*Ta-RdsonBotTc*25))/(1-AI109*RdsonBotTc*ThetaJA_Q2)","v":1.1090787099729786},2.6880000000000001E-2,0.10079999999999999,0.55006627405941577,3.6960000000000005E-5,3.4439999999999998E-2,3.0339999999999999E-2,2.419E-2,3.4476960000000001E-2,{"$f":" SUM(U109,X109,AA109,AG109,AK109,AL109,AM109,AS109,AN109)","v":7.7267755349398222},88.800000000000011,0.91995199785635695,120.13310636264282,43.409022978973184,null,91.995199785635691,2.9130180517569473,3.9371438811972301,2.7937931712242516,1.1423427099729786,0.55006627405941577]

{"sheet":"Efficiency Plot Management","index":10,"n_rows":2,"n_cols":1,"rows_kept":2,"cut":false,"hidden":true,"merged":[]}
[]
[{"$f":"IF(PLOT_TYPE=1, \"EFF_Ch1\", \"EFF_Ch2\")","v":"EFF_Ch1"}]

{"sheet":"Input Filter Calculations","index":11,"n_rows":97,"n_cols":40,"rows_kept":97,"cut":false,"hidden":true,"merged":[[10,29,10,30],[10,31,10,34],[9,0,11,0],[9,1,10,1],[10,8,10,9],[10,11,10,14],[10,16,10,19],[11,17,11,19]]}
[]
[null,null,null,null,null,null,null,null,null,null,null,null,null,null,null,null,null,null,null,null,null,null,null,null,null,null,null,null,null,"AEF comparison Values"]
[null,null,null,{"$f":"L_infilter*0.000001","v":6.8000000000000005E-7},null,null,null,null,null,null,null,"Lfilter Passive",{"$f":"'Input Filters'!O9*0.000001","v":6.8000000000000005E-7},null,null,null,null,null,null,null,null,null,null,null,null,null,null,null,null,"Lfilter",{"$f":"'Input Filters'!G9*0.000001","v":9.9999999999999995E-7}]
[null,null,null,null,null,null,null,null,null,null,null,"Cfilter Passive",{"$f":"'Input Filters'!O10*0.000001","v":4.6999999999999995E-7},null,null,null,null,null,null,null,null,null,null,null,null,null,null,null,null,"Cinj",{"$f":"'Input Filters'!G10*0.000001","v":9.9999999999999995E-7}]
[null,null,null,null,null,null,null,null,null,null,null,"Cdamp passive",{"$f":"'Input Filters'!O11*0.000001","v":9.9999999999999995E-7},null,null,null,null,null,null,null,null,null,null,null,null,null,null,null,null,"Cdamp",{"$f":"'Input Filters'!G11*0.000001","v":9.9999999999999995E-7}]
[null,null,null,null,null,null,null,null,null,null,null,"Rdamp passive",{"$f":"'Input Filters'!O12","v":0.35},null,null,null,null,null,null,null,null,null,null,null,null,null,null,null,null,"Rdamp",{"$f":"'Input Filters'!G12","v":10}]
[]
[]
[]
["Freq (Hz)","(kHz)",null,null,null,null,null,null,null,null,null,null,null,null,null,null,null,null,null,null,null,null,"AEF",null,null,null,"Passive",null,null,"AEFCompare"]
[null,null,null,null,null,null,null,null,"AEF Numerator",null,null,"AEF Denominator",null,null,null,null,"Passive",null,null,null,null,null,"Magnitude","Phase",null,null,"Magnitude","Phase",null,"AEF Numerator",null,"AEF Denominator"]
[null,null,"jω","-ω^2","-jω^3",null,"Gop",null,null,null,null,null,null,null,null,null,"Numerator","Denominator",null,null,null,null,null,null,null,null,null,null,null,null,null,null,null,null,null,null,null,null,"Magnitude","Phase"]
[1,{"$f":"A13/1000","v":1E-3},{"$f":"COMPLEX(0,2*Pi*A13)","v":"6.2831853i"},{"$f":"COMPLEX(-POWER(2*Pi*A13,2),0)","v":"-39.4784175141361"},{"$f":"COMPLEX(0,-POWER(2*Pi*A13,3))","v":"-248.050212592082i"},null,{"$f":"IMSUM(IMPRODUCT(C13,Rcomp_AEF*Csen_AEF),Csen_AEF/Ccomp_AEF)","v":"100+0.00062831853i"},null,{"$f":"IMPRODUCT((RdampSel*CdampSel+RdampSel*CinjSel),C13)","v":{"$error":"#REF!"}},{"$f":"IMSUM(1,I13)","v":{"$error":"#REF!"}},null,{"$f":"IMPRODUCT(G13,L_infilterStd*RdampSel*CinjSel*CdampSel,E13)","v":{"$error":"#REF!"}},{"$f":"IMPRODUCT(G13,L_infilterStd*CinjSel,D13)","v":{"$error":"#REF!"}},{"$f":"J13","v":{"$error":"#REF!"}},{"$f":"IMSUM(L13:N13)","v":{"$error":"#REF!"}},0,{"$f":"IMSUM(IMPRODUCT(C13,RdampPssv*CdampPssv),1)","v":"1+0.000002199114855i"},{"$f":"IMPRODUCT(RdampPssv*CdampPssv*CfilterPssv*LinfilterPssv,E13)","v":"-2.77468967805503E-17i"},{"$f":"IMPRODUCT(D13,LinfilterPssv*(CfilterPssv+CdampPssv))","v":"-3.94626261471304E-11"},{"$f":"IMSUM(S13,R13,Q13)","v":"0.999999999960537+2.19911485497225E-06i"},1,{"$f":"CHOOSE(INFILTER_TYPE,U13,IMDIV(J13,O13))","v":1},{"$f":"20*LOG10(IMABS(V13))","v":0},{"$f":"IMARGUMENT(V13)*180/Pi","v":0},null,{"$f":"IMDIV(Q13,T13)","v":"1.00000000003946-5.9033537744459E-17i"},{"$f":"20*LOG10(IMABS(Z13))","v":3.4274512546547312E-10},{"$f":"IMARGUMENT(Z13)*180/Pi","v":-3.3823725662152017E-15},null,{"$f":"IMPRODUCT((RdampCom*CdampCom+RdampCom*CinjCom),C13)","v":"0.000125663706i"},{"$f":"IMSUM(1,AD13)","v":"1+0.000125663706i"},{"$f":"IMPRODUCT(G13,L_infilterStd*RdampSel*CinjSel*CdampSel,E13)","v":{"$error":"#REF!"}},{"$f":"IMPRODUCT(G13,LAEFCom*CinjCom,D13)","v":"-3.94784175141361E-09-2.48050212592082E-14i"},{"$f":"AE13","v":"1+0.000125663706i"},{"$f":"IMSUM(AF13:AH13)","v":{"$error":"#REF!"}},null,{"$f":"IMDIV(AE13,AI13)","v":{"$error":"#REF!"}},null,{"$f":"20*LOG10(IMABS(AK13))","v":{"$error":"#REF!"}},{"$f":"IMARGUMENT(AK13)*180/Pi","v":{"$error":"#REF!"}}]
[2,{"$f":"A14/1000","v":2E-3},"12.5663706i","-157.913670056544","-1984.40170073666i",null,"100+0.00125663706i",null,{"$error":"#REF!"},{"$f":"IMSUM(1,I14)","v":{"$error":"#REF!"}},null,{"$error":"#REF!"},{"$error":"#REF!"},{"$f":"J14","v":{"$error":"#REF!"}},{"$f":"IMSUM(L14:N14)","v":{"$error":"#REF!"}},0,"1+0.00000439822971i","-2.21975174244403E-16i","-1.57850504588521E-10",{"$f":"IMSUM(S14,R14,Q14)","v":"0.999999999842149+4.39822970977802E-06i"},1,{"$f":"CHOOSE(INFILTER_TYPE,U14,IMDIV(J14,O14),IMDIV(Q14,T14))","v":1},{"$f":"20*LOG10(IMABS(V14))","v":0},0,null,"1.00000000015785-4.72284395630731E-16i",{"$f":"20*LOG10(IMABS(Z14))","v":1.3710672912527204E-9},-2.7059902626176745E-14,null,"0.000251327412i",{"$f":"IMSUM(1,AD14)","v":"1+0.000251327412i"},{"$error":"#REF!"},"-1.57913670056544E-08-1.98440170073665E-13i",{"$f":"AE14","v":"1+0.000251327412i"},{"$f":"IMSUM(AF14:AH14)","v":{"$error":"#REF!"}},null,{"$f":"IMDIV(AE14,AI14)","v":{"$error":"#REF!"}},null,{"$f":"20*LOG10(IMABS(AK14))","v":{"$error":"#REF!"}},{"$error":"#REF!"}]
[3,3.0000000000000001E-3,"18.8495559i","-355.305757627225","-6697.35573998623i",null,"100+0.00188495559i",null,{"$error":"#REF!"},{"$error":"#REF!"},null,{"$error":"#REF!"},{"$error":"#REF!"},{"$error":"#REF!"},{"$error":"#REF!"},0,"1+0.000006597344565i","-7.4916621307486E-16i","-3.55163635324174E-10","0.999999999644836+6.59734456425083E-06i",1,1,0,0,null,"1.00000000035516-1.59396947052946E-15i",3.0848797076462865E-9,-9.1327723405961694E-14,null,"0.000376991118i","1+0.000376991118i",{"$error":"#REF!"},"-3.55305757627225E-08-6.69735573998623E-13i","1+0.000376991118i",{"$error":"#REF!"},null,{"$error":"#REF!"},null,{"$error":"#REF!"},{"$error":"#REF!"}]
[4,4.0000000000000001E-3,"25.1327412i","-631.654680226178","-15875.2136058933i",null,"100+0.00251327412i",null,{"$error":"#REF!"},{"$error":"#REF!"},null,{"$error":"#REF!"},{"$error":"#REF!"},{"$error":"#REF!"},{"$error":"#REF!"},0,"1+0.00000879645942i","-1.77580139395522E-15i","-6.31402018354088E-10","0.999999999368598+0.0000087964594182242i",1,1,0,0,null,"1.0000000006314-3.77830227167012E-15i",5.484271092367277E-9,-2.1648077400206861E-13,null,"0.000502654824i","1+0.000502654824i",{"$error":"#REF!"},"-6.31654680226178E-08-1.58752136058933E-12i","1+0.000502654824i",{"$error":"#REF!"},null,{"$error":"#REF!"},null,{"$error":"#REF!"},{"$error":"#REF!"}]
[5,5.0000000000000001E-3,"31.4159265i","-986.960437853402","-31006.2765740103i",null,"100+0.00314159265i",null,{"$error":"#REF!"},{"$error":"#REF!"},null,{"$error":"#REF!"},{"$error":"#REF!"},{"$error":"#REF!"},{"$error":"#REF!"},0,"1+0.000010995574275i","-3.46836209756879E-15i","-9.86565653678261E-10","0.999999999013434+0.0000109955742715316i",1,1,0,0,null,"1.00000000098657-7.37945946308484E-15i",8.5692375875376739E-9,-4.2281188238863731E-13,null,"0.00062831853i","1+0.00062831853i",{"$error":"#REF!"},"-9.86960437853402E-08-3.10062765740103E-12i","1+0.00062831853i",{"$error":"#REF!"},null,{"$error":"#REF!"},null,{"$error":"#REF!"},{"$error":"#REF!"}]
[6,6.0000000000000001E-3,"37.6991118i","-1421.2230305089","-53578.8459198898i",null,"100+0.00376991118i",null,{"$error":"#REF!"},{"$error":"#REF!"},null,{"$error":"#REF!"},{"$error":"#REF!"},{"$error":"#REF!"},{"$error":"#REF!"},0,"1+0.00001319468913i","-5.99332970459887E-15i","-1.4206545412967E-09","0.999999998579345+0.0000131946891240067i",1,1,0,0,null,"1.00000000142066-1.27518015159367E-14i",1.2339696260264985E-8,-7.3062440784858933E-13,null,"0.000753982236i","1+0.000753982236i",{"$error":"#REF!"},"-1.4212230305089E-07-5.35788459198898E-12i","1+0.000753982236i",{"$error":"#REF!"},null,{"$error":"#REF!"},null,{"$error":"#REF!"},{"$error":"#REF!"}]
[7,7.0000000000000001E-3,"43.9822971i","-1934.44245819267","-85081.2229190843i",null,"100+0.00439822971i",null,{"$error":"#REF!"},{"$error":"#REF!"},null,{"$error":"#REF!"},{"$error":"#REF!"},{"$error":"#REF!"},{"$error":"#REF!"},0,"1+0.000015393803985i","-9.51718559572877E-15i","-1.93366868120939E-09","0.999999998066331+0.0000153938039754828i",1,1,0,0,null,"1.00000000193367-2.02493221373488E-14i",1.6795643252346658E-8,-1.1602006955531912E-12,null,"0.000879645942i","1+0.000879645942i",{"$error":"#REF!"},"-1.93444245819267E-07-8.50812229190843E-12i","1+0.000879645942i",{"$error":"#REF!"},null,{"$error":"#REF!"},null,{"$error":"#REF!"},{"$error":"#REF!"}]
[8,8.0000000000000002E-3,"50.2654824i","-2526.61872090471","-127001.708847146i",null,"100+0.00502654824i",null,{"$error":"#REF!"},{"$error":"#REF!"},null,{"$error":"#REF!"},{"$error":"#REF!"},{"$error":"#REF!"},{"$error":"#REF!"},0,"1+0.00001759291884i","-1.42064111516417E-14i","-2.52560807341635E-09","0.999999997474392+0.0000175929188257936i",1,1,0,0,null,"1.00000000252561-3.02264148354676E-14i",2.1937169209509332E-8,-1.7318459974888673E-12,null,"0.001005309648i","1+0.001005309648i",{"$error":"#REF!"},"-2.52661872090471E-07-1.27001708847146E-11i","1+0.001005309648i",{"$error":"#REF!"},null,{"$error":"#REF!"},null,{"$error":"#REF!"},{"$error":"#REF!"}]
[9,8.9999999999999993E-3,"56.5486677i","-3197.75181864502","-180828.604979628i",null,"100+0.00565486677i",null,{"$error":"#REF!"},{"$error":"#REF!"},null,{"$error":"#REF!"},{"$error":"#REF!"},{"$error":"#REF!"},{"$error":"#REF!"},0,"1+0.000019792033695i","-2.02274877530212E-14i","-3.19647271791756E-09","0.999999996803527+0.0000197920336747725i",1,1,0,0,null,"1.00000000319647-4.30372020696133E-14i",2.7764185412408903E-8,-2.4658500355761629E-12,null,"0.001130973354i","1+0.001130973354i",{"$error":"#REF!"},"-3.19775181864502E-07-1.80828604979628E-11i","1+0.001130973354i",{"$error":"#REF!"},null,{"$error":"#REF!"},null,{"$error":"#REF!"},{"$error":"#REF!"}]
[10,0.01,"62.831853i","-3947.84175141361","-248050.212592082i",null,"100+0.0062831853i",null,{"$error":"#REF!"},{"$error":"#REF!"},null,{"$error":"#REF!"},{"$error":"#REF!"},{"$error":"#REF!"},{"$error":"#REF!"},0,"1+0.00002199114855i","-2.77468967805503E-14i","-3.94626261471304E-09","0.999999996053737+0.0000219911485222531i",1,1,0,0,null,"1.00000000394626-5.90359570729332E-14i",3.4276778649137416E-8,-3.3825111703113878E-12,null,"0.00125663706i","1+0.00125663706i",{"$error":"#REF!"},"-3.94784175141361E-07-2.48050212592082E-11i","1+0.00125663706i",{"$error":"#REF!"},null,{"$error":"#REF!"},null,{"$error":"#REF!"},{"$error":"#REF!"}]
[20,0.02,"125.663706i","-15791.3670056544","-1984401.70073666i",null,"100+0.0125663706i",null,{"$error":"#REF!"},{"$error":"#REF!"},null,{"$error":"#REF!"},{"$error":"#REF!"},{"$error":"#REF!"},{"$error":"#REF!"},0,"1+0.0000439822971i","-2.21975174244403E-13i","-1.57850504588521E-08","0.99999998421495+0.0000439822968780248i",1,1,0,0,null,"1.00000001578505-4.72287580174405E-13i",1.3710720057442979E-7,-2.7060084664215768E-11,null,"0.00251327412i","1+0.00251327412i",{"$error":"#REF!"},"-1.57913670056544E-06-1.98440170073665E-10i","1+0.00251327412i",{"$error":"#REF!"},null,{"$error":"#REF!"},null,{"$error":"#REF!"},{"$error":"#REF!"}]
[30,0.03,"188.495559i","-35530.5757627225","-6697355.73998623i",null,"100+0.0188495559i",null,{"$error":"#REF!"},{"$error":"#REF!"},null,{"$error":"#REF!"},{"$error":"#REF!"},{"$error":"#REF!"},{"$error":"#REF!"},0,"1+0.00006597344565i","-7.4916621307486E-13i","-3.55163635324174E-08","0.999999964483636+0.0000659734449008338i",1,1,0,0,null,"1.00000003551637-1.59397081397336E-12i",3.0849126526975555E-7,-9.1327797168431367E-11,null,"0.00376991118i","1+0.00376991118i",{"$error":"#REF!"},"-3.55305757627225E-06-6.69735573998623E-10i","1+0.00376991118i",{"$error":"#REF!"},null,{"$error":"#REF!"},null,{"$error":"#REF!"},{"$error":"#REF!"}]
[40,0.04,"251.327412i","-63165.4680226178","-15875213.6058933i",null,"100+0.0251327412i",null,{"$error":"#REF!"},{"$error":"#REF!"},null,{"$error":"#REF!"},{"$error":"#REF!"},{"$error":"#REF!"},{"$error":"#REF!"},0,"1+0.0000879645942i","-1.77580139395522E-12i","-6.31402018354088E-08","0.999999936859798+0.0000879645924241986i",1,1,0,0,null,"1.00000006314021-3.77830129983406E-12i",5.4842887803037698E-7,-2.1648070478801279E-10,null,"0.00502654824i","1+0.00502654824i",{"$error":"#REF!"},"-6.31654680226178E-06-1.58752136058933E-09i","1+0.00502654824i",{"$error":"#REF!"},null,{"$error":"#REF!"},null,{"$error":"#REF!"},{"$error":"#REF!"}]
[50,0.05,"314.159265i","-98696.0437853402","-31006276.5740103i",null,"100+0.0314159265i",null,{"$error":"#REF!"},{"$error":"#REF!"},null,{"$error":"#REF!"},{"$error":"#REF!"},{"$error":"#REF!"},{"$error":"#REF!"},0,"1+0.00010995574275i","-3.46836209756879E-12i","-9.86565653678261E-08","0.999999901343435+0.000109955739281638i",1,1,0,0,null,"1.00000009865657-7.37949525076775E-12i",8.5692003703246746E-7,-4.2281389157559421E-10,null,"0.0062831853i","1+0.0062831853i",{"$error":"#REF!"},"-9.86960437853402E-06-3.10062765740103E-09i","1+0.0062831853i",{"$error":"#REF!"},null,{"$error":"#REF!"},null,{"$error":"#REF!"},{"$error":"#REF!"}]
[60,0.06,"376.991118i","-142122.30305089","-53578845.9198898i",null,"100+0.0376991118i",null,{"$error":"#REF!"},{"$error":"#REF!"},null,{"$error":"#REF!"},{"$error":"#REF!"},{"$error":"#REF!"},{"$error":"#REF!"},0,"1+0.0001319468913i","-5.99332970459887E-12i","-1.4206545412967E-07","0.999999857934546+0.00013194688530667i",1,1,0,0,null,"1.00000014206547-1.27517683815965E-11i",1.2339649066219747E-6,-7.3062240663248992E-10,null,"0.00753982236i","1+0.00753982236i",{"$error":"#REF!"},"-0.000014212230305089-5.35788459198898E-09i","1+0.00753982236i",{"$error":"#REF!"},null,{"$error":"#REF!"},null,{"$error":"#REF!"},{"$error":"#REF!"}]
[70,7.0000000000000007E-2,"439.822971i","-193444.245819267","-85081222.9190843i",null,"100+0.0439822971i",null,{"$error":"#REF!"},{"$error":"#REF!"},null,{"$error":"#REF!"},{"$error":"#REF!"},{"$error":"#REF!"},{"$error":"#REF!"},0,"1+0.00015393803985i","-9.51718559572877E-12i","-1.93366868120939E-07","0.999999806633132+0.000153938030332814i",1,1,0,0,null,"1.0000001933669-2.02493379799158E-11i",1.6795633910819215E-6,-1.1602013811643187E-9,null,"0.00879645942i","1+0.00879645942i",{"$error":"#REF!"},"-0.0000193444245819267-8.50812229190843E-09i","1+0.00879645942i",{"$error":"#REF!"},null,{"$error":"#REF!"},null,{"$error":"#REF!"},{"$error":"#REF!"}]
[80,0.08,"502.654824i","-252661.872090471","-127001708.847146i",null,"100+0.0502654824i",null,{"$error":"#REF!"},{"$error":"#REF!"},null,{"$error":"#REF!"},{"$error":"#REF!"},{"$error":"#REF!"},{"$error":"#REF!"},0,"1+0.0001759291884i","-1.42064111516417E-11i","-2.52560807341635E-07","0.999999747439193+0.000175929174193589i",1,1,0,0,null,"1.00000025256087-3.02264211687963E-11i",2.1937155666510632E-6,-1.731845927339326E-9,null,"0.01005309648i","1+0.01005309648i",{"$error":"#REF!"},"-0.0000252661872090471-1.27001708847146E-08i","1+0.01005309648i",{"$error":"#REF!"},null,{"$error":"#REF!"},null,{"$error":"#REF!"},{"$error":"#REF!"}]
[90,0.09,"565.486677i","-319775.181864502","-180828604.979628i",null,"100+0.0565486677i",null,{"$error":"#REF!"},{"$error":"#REF!"},null,{"$error":"#REF!"},{"$error":"#REF!"},{"$error":"#REF!"},{"$error":"#REF!"},0,"1+0.00019792033695i","-2.02274877530212E-11i","-3.19647271791756E-07","0.999999680352728+0.000197920316722512i",1,1,0,0,null,"1.00000031964737-4.30372335896138E-11i",2.7764213343660625E-6,-2.4658510612183728E-9,null,"0.01130973354i","1+0.01130973354i",{"$error":"#REF!"},"-0.0000319775181864502-1.80828604979628E-08i","1+0.01130973354i",{"$error":"#REF!"},null,{"$error":"#REF!"},null,{"$error":"#REF!"},{"$error":"#REF!"}]
[100,0.1,"628.31853i","-394784.175141361","-248050212.592082i",null,"100+0.062831853i",null,{"$error":"#REF!"},{"$error":"#REF!"},null,{"$error":"#REF!"},{"$error":"#REF!"},{"$error":"#REF!"},{"$error":"#REF!"},0,"1+0.0002199114855i","-2.77468967805503E-11i","-3.94626261471305E-07","0.999999605373739+0.000219911457753103i",1,1,0,0,null,"1.0000003946264-5.90359940073355E-11i",3.4276806823585146E-6,-3.382511965016509E-9,null,"0.0125663706i","1+0.0125663706i",{"$error":"#REF!"},"-0.0000394784175141361-2.48050212592082E-08i","1+0.0125663706i",{"$error":"#REF!"},null,{"$error":"#REF!"},null,{"$error":"#REF!"},{"$error":"#REF!"}]
[200,0.2,"1256.63706i","-1579136.70056544","-1984401700.73666i",null,"100+0.125663706i",null,{"$error":"#REF!"},{"$error":"#REF!"},null,{"$error":"#REF!"},{"$error":"#REF!"},{"$error":"#REF!"},{"$error":"#REF!"},0,"1+0.000439822971i","-2.21975174244403E-10i","-1.57850504588521E-06","0.999998421494954+0.000439822749024826i",1,1,0,0,null,"1.00000157850733-4.72289004721146E-10i",1.3710729639650269E-5,-2.7060123997272546E-8,null,"0.0251327412i","1+0.0251327412i",{"$error":"#REF!"},"-0.000157913670056544-1.98440170073665E-07i","1+0.0251327412i",{"$error":"#REF!"},null,{"$error":"#REF!"},null,{"$error":"#REF!"},{"$error":"#REF!"}]
[300,0.3,"1884.95559i","-3553057.57627225","-6697355739.98623i",null,"100+0.188495559i",null,{"$error":"#REF!"},{"$error":"#REF!"},null,{"$error":"#REF!"},{"$error":"#REF!"},{"$error":"#REF!"},{"$error":"#REF!"},0,"1+0.0006597344565i","-7.4916621307486E-10i","-3.55163635324174E-06","0.999996448363647+0.000659733707333787i",1,1,0,0,null,"1.00000355164792-1.59398129480179E-09i",3.084916708360373E-5,-9.1328076554125626E-8,null,"0.0376991118i","1+0.0376991118i",{"$error":"#REF!"},"-0.000355305757627225-6.69735573998623E-07i","1+0.0376991118i",{"$error":"#REF!"},null,{"$error":"#REF!"},null,{"$error":"#REF!"},{"$error":"#REF!"}]
[400,0.4,"2513.27412i","-6316546.80226177","-15875213605.8933i",null,"100+0.251327412i",null,{"$error":"#REF!"},{"$error":"#REF!"},null,{"$error":"#REF!"},{"$error":"#REF!"},{"$error":"#REF!"},{"$error":"#REF!"},0,"1+0.000879645942i","-1.77580139395522E-09i","-6.31402018354087E-06","0.999993685979816+0.000879644166198606i",1,1,0,0,null,"1.00000631405673-3.77834562794476E-09i",5.4843026783634755E-5,-2.1648189139136651E-7,null,"0.0502654824i","1+0.0502654824i",{"$error":"#REF!"},"-0.000631654680226177-1.58752136058933E-06i","1+0.0502654824i",{"$error":"#REF!"},null,{"$error":"#REF!"},null,{"$error":"#REF!"},{"$error":"#REF!"}]
[500,0.5,"3141.59265i","-9869604.37853402","-31006276574.0103i",null,"100+0.314159265i",null,{"$error":"#REF!"},{"$error":"#REF!"},null,{"$error":"#REF!"},{"$error":"#REF!"},{"$error":"#REF!"},{"$error":"#REF!"},0,"1+0.0010995574275i","-3.46836209756879E-09i","-9.86565653678261E-06","0.999990134343463+0.0010995539591379i",1,1,0,0,null,"1.00000986574575-7.37963050952798E-09i",8.5692356072072088E-5,-4.228175116350063E-7,null,"0.062831853i","1+0.062831853i",{"$error":"#REF!"},"-0.000986960437853402-3.10062765740103E-06i","1+0.062831853i",{"$error":"#REF!"},null,{"$error":"#REF!"},null,{"$error":"#REF!"},{"$error":"#REF!"}]
[600,0.6,"3769.91118i","-14212230.305089","-53578845919.8898i",null,"100+0.376991118i",null,{"$error":"#REF!"},{"$error":"#REF!"},null,{"$error":"#REF!"},{"$error":"#REF!"},{"$error":"#REF!"},{"$error":"#REF!"},0,"1+0.001319468913i","-5.99332970459887E-09i","-0.000014206545412967","0.999985793454587+0.0013194629196703i",1,1,0,0,null,"1.00001420673042-1.27521054564846E-08i",1.2339721601309145E-4,-7.3063144351324126E-7,null,"0.0753982236i","1+0.0753982236i",{"$error":"#REF!"},"-0.0014212230305089-5.35788459198898E-06i","1+0.0753982236i",{"$error":"#REF!"},null,{"$error":"#REF!"},null,{"$error":"#REF!"},{"$error":"#REF!"}]
[700,0.7,"4398.22971i","-19344424.5819267","-85081222919.0843i",null,"100+0.439822971i",null,{"$error":"#REF!"},{"$error":"#REF!"},null,{"$error":"#REF!"},{"$error":"#REF!"},{"$error":"#REF!"},{"$error":"#REF!"},0,"1+0.0015393803985i","-9.51718559572877E-09i","-0.0000193366868120939","0.999980663313188+0.0015393708813144i",1,1,0,0,null,"1.00001933702955-2.02500661951286E-08i",1.6795768070547058E-4,-1.1602208939414706E-6,null,"0.0879645942i","1+0.0879645942i",{"$error":"#REF!"},"-0.00193444245819267-8.50812229190843E-06i","1+0.0879645942i",{"$error":"#REF!"},null,{"$error":"#REF!"},null,{"$error":"#REF!"},{"$error":"#REF!"}]
[800,0.8,"5026.54824i","-25266187.2090471","-127001708847.146i",null,"100+0.502654824i",null,{"$error":"#REF!"},{"$error":"#REF!"},null,{"$error":"#REF!"},{"$error":"#REF!"},{"$error":"#REF!"},{"$error":"#REF!"},0,"1+0.001759291884i","-1.42064111516417E-08i","-0.0000252560807341635","0.999974743919266+0.00175927767758885i",1,1,0,0,null,"1.00002525666544-3.02278400042037E-08i",2.1937383832667357E-4,-1.7318839164039424E-6,null,"0.1005309648i","1+0.1005309648i",{"$error":"#REF!"},"-0.00252661872090471-0.0000127001708847146i","1+0.1005309648i",{"$error":"#REF!"},null,{"$error":"#REF!"},null,{"$error":"#REF!"},{"$error":"#REF!"}]
[900,0.9,"5654.86677i","-31977518.1864502","-180828604979.628i",null,"100+0.565486677i",null,{"$error":"#REF!"},{"$error":"#REF!"},null,{"$error":"#REF!"},{"$error":"#REF!"},{"$error":"#REF!"},{"$error":"#REF!"},0,"1+0.0019792033695i","-2.02274877530212E-08i","-0.0000319647271791756","0.999968035272821+0.00197918314201225i",1,1,0,0,null,"1.00003196566377-4.30397908600739E-08i",2.7764579017865241E-4,-2.4659195454707077E-6,null,"0.1130973354i","1+0.1130973354i",{"$error":"#REF!"},"-0.00319775181864502-0.0000180828604979628i","1+0.1130973354i",{"$error":"#REF!"},null,{"$error":"#REF!"},null,{"$error":"#REF!"},{"$error":"#REF!"}]
[1000,1,"6283.1853i","-39478417.5141361","-248050212592.082i",null,"100+0.62831853i",null,{"$error":"#REF!"},{"$error":"#REF!"},null,{"$error":"#REF!"},{"$error":"#REF!"},{"$error":"#REF!"},{"$error":"#REF!"},0,"1+0.002199114855i","-2.77468967805503E-08i","-0.0000394626261471304","0.999960537373853+0.00219908710810322i",1,1,0,0,null,"1.00003946405367-5.90403247598128E-08i",3.4277365128982361E-4,-3.3826279414737456E-6,null,"0.125663706i","1+0.125663706i",{"$error":"#REF!"},"-0.00394784175141361-0.0000248050212592082i","1+0.125663706i",{"$error":"#REF!"},null,{"$error":"#REF!"},null,{"$error":"#REF!"},{"$error":"#REF!"}]
[2000,2,"12566.3706i","-157913670.056544","-1984401700736.66i",null,"100+1.25663706i",null,{"$error":"#REF!"},{"$error":"#REF!"},null,{"$error":"#REF!"},{"$error":"#REF!"},{"$error":"#REF!"},{"$error":"#REF!"},0,"1+0.00439822971i","-2.21975174244403E-07i","-0.000157850504588521","0.999842149495412+0.00439800773482576i",1,1,0,0,null,"1.00015787334724-4.72427600959129E-07i",1.3711622397485389E-3,-2.7063835033150666E-5,null,"0.251327412i","1+0.251327412i",{"$error":"#REF!"},"-0.0157913670056544-0.000198440170073665i","1+0.251327412i",{"$error":"#REF!"},null,{"$error":"#REF!"},null,{"$error":"#REF!"},{"$error":"#REF!"}]
[3000,3,"18849.5559i","-355305757.627225","-6697355739986.23i",null,"100+1.88495559i",null,{"$error":"#REF!"},{"$error":"#REF!"},null,{"$error":"#REF!"},{"$error":"#REF!"},{"$error":"#REF!"},{"$error":"#REF!"},0,"1+0.006597344565i","-7.4916621307486E-07i","-0.000355163635324174","0.999644836364676+0.00659659539878692i",1,1,0,0,null,"1.00035527929582-1.59503405307709E-06i",3.0853687138606856E-3,-9.135626253668961E-5,null,"0.376991118i","1+0.376991118i",{"$error":"#REF!"},"-0.0355305757627225-0.000669735573998623i","1+0.376991118i",{"$error":"#REF!"},null,{"$error":"#REF!"},null,{"$error":"#REF!"},{"$error":"#REF!"}]
[4000,4,"25132.7412i","-631654680.226177","-15875213605893.3i",null,"100+2.51327412i",null,{"$error":"#REF!"},{"$error":"#REF!"},null,{"$error":"#REF!"},{"$error":"#REF!"},{"$error":"#REF!"},{"$error":"#REF!"},0,"1+0.00879645942i","-1.77580139395522E-06i","-0.000631402018354087","0.999368597981646+0.00879468361860604i",1,1,0,0,null,"1.00063176764934-3.78278365967147E-06i",5.4857314697180446E-3,-2.1660069744338419E-4,null,"0.502654824i","1+0.502654824i",{"$error":"#REF!"},"-0.0631654680226177-0.00158752136058933i","1+0.502654824i",{"$error":"#REF!"},null,{"$error":"#REF!"},null,{"$error":"#REF!"},{"$error":"#REF!"}]
[5000,5,"31415.9265i","-986960437.853402","-31006276574010.3i",null,"100+3.14159265i",null,{"$error":"#REF!"},{"$error":"#REF!"},null,{"$error":"#REF!"},{"$error":"#REF!"},{"$error":"#REF!"},{"$error":"#REF!"},0,"1+0.010995574275i","-3.46836209756879E-06i","-0.000986565653678261","0.999013434346322+0.0109921059129024i",1,1,0,0,null,"1.00098745857977-7.39318105431537E-06i",8.5727245740982051E-3,-4.2318019914624398E-4,null,"0.62831853i","1+0.62831853i",{"$error":"#REF!"},"-0.0986960437853402-0.00310062765740103i","1+0.62831853i",{"$error":"#REF!"},null,{"$error":"#REF!"},null,{"$error":"#REF!"},{"$error":"#REF!"}]
[6000,6,{"$f":"COMPLEX(0,2*Pi*A45)","v":"37699.1118i"},{"$f":"COMPLEX(-POWER(2*Pi*A45,2),0)","v":"-1421223030.5089"},{"$f":"COMPLEX(0,-POWER(2*Pi*A45,3))","v":"-53578845919889.8i"},null,{"$f":"IMSUM(IMPRODUCT(C45,Rcomp_AEF*Csen_AEF),Csen_AEF/Ccomp_AEF)","v":"100+3.76991118i"},null,{"$f":"IMPRODUCT((RdampSel*CdampSel+RdampSel*CinjSel),C45)","v":{"$error":"#REF!"}},{"$error":"#REF!"},null,{"$f":"IMPRODUCT(G45,L_infilterStd*RdampSel*CinjSel*CdampSel,E45)","v":{"$error":"#REF!"}},{"$f":"IMPRODUCT(G45,L_infilterStd*CinjSel,D45)","v":{"$error":"#REF!"}},{"$error":"#REF!"},{"$error":"#REF!"},0,{"$f":"IMSUM(IMPRODUCT(C45,RdampPssv*CdampPssv),1)","v":"1+0.01319468913i"},{"$f":"IMPRODUCT(RdampPssv*CdampPssv*CfilterPssv*LinfilterPssv,E45)","v":"-5.99332970459887E-06i"},{"$f":"IMPRODUCT(D45,LinfilterPssv*(CfilterPssv+CdampPssv))","v":"-0.0014206545412967"},"0.998579345458703+0.0131886958002954i",1,{"$f":"CHOOSE(INFILTER_TYPE,U45,IMDIV(J45,O45),IMDIV(Q45,T45))","v":1},0,{"$f":"IMARGUMENT(V45)*180/Pi","v":0},null,{"$f":"IMDIV(Q45,T45)","v":"1.00142250680344-0.000012785844067251i"},1.2346958077157324E-2,{"$f":"IMARGUMENT(Z45)*180/Pi","v":-7.3153429085745297E-4},null,{"$f":"IMPRODUCT((RdampCom*CdampCom+RdampCom*CinjCom),C45)","v":"0.753982236i"},"1+0.753982236i",{"$f":"IMPRODUCT(G45,L_infilterStd*RdampSel*CinjSel*CdampSel,E45)","v":{"$error":"#REF!"}},{"$f":"IMPRODUCT(G45,LAEFCom*CinjCom,D45)","v":"-0.14212230305089-0.00535788459198898i"},"1+0.753982236i",{"$error":"#REF!"},null,{"$error":"#REF!"},null,{"$error":"#REF!"},{"$f":"IMARGUMENT(AK45)*180/Pi","v":{"$error":"#REF!"}}]
[7000,7,"43982.2971i","-1934442458.19267","-85081222919084.3i",null,"100+4.39822971i",null,{"$error":"#REF!"},{"$error":"#REF!"},null,{"$error":"#REF!"},{"$error":"#REF!"},{"$error":"#REF!"},{"$error":"#REF!"},0,"1+0.015393803985i","-9.51718559572877E-06i","-0.00193366868120939","0.998066331318791+0.0153842867994043i",1,1,0,0,null,"1.00193710173868-0.0000203230411399365i",1.680917841515581E-2,-1.1621732375608322E-3,null,"0.879645942i","1+0.879645942i",{"$error":"#REF!"},"-0.193444245819267-0.00850812229190843i","1+0.879645942i",{"$error":"#REF!"},null,{"$error":"#REF!"},null,{"$error":"#REF!"},{"$error":"#REF!"}]
[8000,8,"50265.4824i","-2526618720.90471","-127001708847146i",null,"100+5.02654824i",null,{"$error":"#REF!"},{"$error":"#REF!"},null,{"$error":"#REF!"},{"$error":"#REF!"},{"$error":"#REF!"},{"$error":"#REF!"},0,"1+0.01759291884i","-0.0000142064111516418i","-0.00252560807341635","0.997474391926584+0.0175787124288484i",1,1,0,0,null,"1.00253146769905-0.0000303702348632679i",2.1960268903701091E-2,-1.7356924326137229E-3,null,"1.005309648i","1+1.005309648i",{"$error":"#REF!"},"-0.252661872090471-0.0127001708847146i","1+1.005309648i",{"$error":"#REF!"},null,{"$error":"#REF!"},null,{"$error":"#REF!"},{"$error":"#REF!"}]
[9000,9,"56548.6677i","-3197751818.64502","-180828604979628i",null,"100+5.65486677i",null,{"$error":"#REF!"},{"$error":"#REF!"},null,{"$error":"#REF!"},{"$error":"#REF!"},{"$error":"#REF!"},{"$error":"#REF!"},0,"1+0.019792033695i","-0.0000202274877530212i","-0.00319647271791756","0.996803527282082+0.019771806207247i",1,1,0,0,null,"1.00320586412249-0.0000432966329094656i",2.7801250322054171E-2,-2.4727869152797537E-3,null,"1.130973354i","1+1.130973354i",{"$error":"#REF!"},"-0.319775181864502-0.0180828604979628i","1+1.130973354i",{"$error":"#REF!"},null,{"$error":"#REF!"},null,{"$error":"#REF!"},{"$error":"#REF!"}]
[10000,10,"62831.853i","-3947841751.41361","-248050212592082i",null,"100+6.2831853i",null,{"$error":"#REF!"},{"$error":"#REF!"},null,{"$error":"#REF!"},{"$error":"#REF!"},{"$error":"#REF!"},{"$error":"#REF!"},0,"1+0.02199114855i","-0.0000277468967805503i","-0.00394626261471305","0.996053737385287+0.0219634016532194i",1,1,0,0,null,"1.0039605858368-0.0000594757476545141i",3.4333281589256678E-2,-3.394266041884357E-3,null,"1.25663706i","1+1.25663706i",{"$error":"#REF!"},"-0.394784175141361-0.0248050212592082i","1+1.25663706i",{"$error":"#REF!"},null,{"$error":"#REF!"},null,{"$error":"#REF!"},{"$error":"#REF!"}]
[11000,11,"69115.0383i","-4776888519.21047","-330154832960062i",null,"100+6.91150383i",null,{"$error":"#REF!"},{"$error":"#REF!"},null,{"$error":"#REF!"},{"$error":"#REF!"},{"$f":"J50","v":{"$error":"#REF!"}},{"$f":"IMSUM(L50:N50)","v":{"$error":"#REF!"}},0,"1+0.024190263405i","-0.0000369311196149125i","-0.00477497776380279",{"$f":"IMSUM(S50,R50,Q50)","v":"0.995225022236197+0.0241533322853851i"},1,1,0,0,null,"1.00479596336193-0.0000792859658181959i",4.1557660533084087E-2,-4.5210683336785549E-3,null,"1.382300766i","1+1.382300766i",{"$error":"#REF!"},"-0.477688851921047-0.0330154832960062i","1+1.382300766i",{"$error":"#REF!"},null,{"$error":"#REF!"},null,{"$error":"#REF!"},{"$error":"#REF!"}]
[12000,12,"75398.2236i","-5684892122.0356","-428630767359119i",null,"100+7.53982236i",null,{"$error":"#REF!"},{"$error":"#REF!"},null,{"$error":"#REF!"},{"$error":"#REF!"},{"$f":"J51","v":{"$error":"#REF!"}},{"$f":"IMSUM(L51:N51)","v":{"$error":"#REF!"}},0,"1+0.02638937826i","-0.000047946637636791i","-0.00568261816518679",{"$f":"IMSUM(S51,R51,Q51)","v":"0.994317381834813+0.0263414316223632i"},1,1,0,0,null,"1.00571236324959-0.000103111129481765i",4.9475824752593413E-2,-5.8742765248443194E-3,null,"1.507964472i","1+1.507964472i",{"$error":"#REF!"},"-0.56848921220356-0.0428630767359119i","1+1.507964472i",{"$error":"#REF!"},null,{"$error":"#REF!"},null,{"$error":"#REF!"},{"$error":"#REF!"}]
[13000,13,"81681.4089i","-6671852559.889","-544966317064805i",null,"100+8.16814089i",null,{"$error":"#REF!"},{"$error":"#REF!"},null,{"$error":"#REF!"},{"$error":"#REF!"},{"$f":"J52","v":{"$error":"#REF!"}},{"$f":"IMSUM(L52:N52)","v":{"$error":"#REF!"}},0,"1+0.028588493115i","-0.0000609599322268691i","-0.00666918381886504",{"$f":"IMSUM(S52,R52,Q52)","v":"0.993330816181135+0.0285275331827731i"},1,1,0,0,null,"1.00671018846073-0.00013134112988737i",5.808935257490936E-2,-7.4751328348372729E-3,null,"1.633628178i","1+1.633628178i",{"$error":"#REF!"},"-0.6671852559889-0.0544966317064805i","1+1.633628178i",{"$error":"#REF!"},null,{"$error":"#REF!"},null,{"$error":"#REF!"},{"$error":"#REF!"}]
[15000,15,"94247.7795i","-8882643940.68062","-837169467498278i",null,"100+9.42477795i",null,{"$error":"#REF!"},{"$error":"#REF!"},null,{"$error":"#REF!"},{"$error":"#REF!"},{"$f":"J53","v":{"$error":"#REF!"}},{"$f":"IMSUM(L53:N53)","v":{"$error":"#REF!"}},0,"1+0.032986722825i","-0.0000936457766343574i","-0.00887909088310435",{"$f":"IMSUM(S53,R53,Q53)","v":"0.991120909116896+0.0328930770483656i"},1,1,0,0,null,"1.00895191127968-0.00020260911556929i",7.7409522394356958E-2,-1.1505649516535831E-2,null,"1.88495559i","1+1.88495559i",{"$error":"#REF!"},"-0.888264394068062-0.0837169467498278i","1+1.88495559i",{"$error":"#REF!"},null,{"$error":"#REF!"},null,{"$error":"#REF!"},{"$error":"#REF!"}]
[16000,16,"100530.9648i","-10106474883.6188","-1016013670777170i",null,"100+10.05309648i",null,{"$error":"#REF!"},{"$error":"#REF!"},null,{"$error":"#REF!"},{"$error":"#REF!"},{"$f":"J54","v":{"$error":"#REF!"}},{"$f":"IMSUM(L54:N54)","v":{"$error":"#REF!"}},0,"1+0.03518583768i","-0.000113651289213134i","-0.0101024322936654",{"$f":"IMSUM(S54,R54,Q54)","v":"0.989897567706335+0.0350721863907869i"},1,1,0,0,null,"1.01019680079824-0.000246462681525396i",8.8120034652894183E-2,-1.3978732840646416E-2,null,"2.010619296i","1+2.010619296i",{"$error":"#REF!"},"-1.01064748836188-0.101601367077717i","1+2.010619296i",{"$error":"#REF!"},null,{"$error":"#REF!"},null,{"$error":"#REF!"},{"$error":"#REF!"}]
[17500,17.5,"109955.74275i","-12090265363.7042","-1329394108110690i",null,"100+10.995574275i",null,{"$error":"#REF!"},{"$error":"#REF!"},null,{"$error":"#REF!"},{"$error":"#REF!"},{"$error":"#REF!"},{"$error":"#REF!"},0,"1+0.0384845099625i","-0.000148706024933262i","-0.0120854292575587","0.987914570742441+0.0383358039375667i",1,1,0,0,null,"1.01222071263725-0.000323696833892721i",0.10550484102978921,-1.8322547228315767E-2,null,"2.199114855i","1+2.199114855i",{"$error":"#REF!"},"-1.20902653637042-0.132939410811069i","1+2.199114855i",{"$error":"#REF!"},null,{"$error":"#REF!"},null,{"$error":"#REF!"},{"$error":"#REF!"}]
[19000,19,"119380.5207i","-14251708722.6031","-1701376408169090i",null,"100+11.93805207i",null,{"$error":"#REF!"},{"$error":"#REF!"},null,{"$error":"#REF!"},{"$error":"#REF!"},{"$error":"#REF!"},{"$error":"#REF!"},0,"1+0.041783182245i","-0.000190315965017794i","-0.0142460080391141","0.985753991960886+0.0415928662799822i",1,1,0,0,null,"1.01443433812182-0.000415975520938413i",0.12447955922984369,-2.3494512681856306E-2,null,"2.387610414i","1+2.387610414i",{"$error":"#REF!"},"-1.42517087226031-0.170137640816909i","1+2.387610414i",{"$error":"#REF!"},null,{"$error":"#REF!"},null,{"$error":"#REF!"},{"$error":"#REF!"}]
[20000,20,"125663.706i","-15791367005.6544","-1984401700736660i",null,"100+12.5663706i",null,{"$error":"#REF!"},{"$error":"#REF!"},null,{"$error":"#REF!"},{"$error":"#REF!"},{"$error":"#REF!"},{"$error":"#REF!"},0,"1+0.0439822971i","-0.000221975174244403i","-0.0157850504588521","0.984214949541148+0.0437603219257556i",1,1,0,0,null,"1.01601657935512-0.000486596443905099i",0.13801689257265934,-2.744041881657654E-2,null,"2.51327412i","1+2.51327412i",{"$error":"#REF!"},"-1.57913670056544-0.198440170073665i","1+2.51327412i",{"$error":"#REF!"},null,{"$error":"#REF!"},null,{"$error":"#REF!"},{"$error":"#REF!"}]
[25000,25,"157079.6325i","-24674010946.3351","-3875784571751290i",null,"100+15.70796325i",null,{"$error":"#REF!"},{"$error":"#REF!"},null,{"$error":"#REF!"},{"$error":"#REF!"},{"$error":"#REF!"},{"$error":"#REF!"},0,"1+0.054977871375i","-0.000433545262196099i","-0.0246641413419566","0.975335858658043+0.0545443261128039i",1,1,0,0,null,"1.02523378537434-0.000966656304033977i",0.21646204909008521,-5.4022127344881758E-2,null,"3.14159265i","1+3.14159265i",{"$error":"#REF!"},"-2.46740109463351-0.387578457175129i","1+3.14159265i",{"$error":"#REF!"},null,{"$error":"#REF!"},null,{"$error":"#REF!"},{"$error":"#REF!"}]
[30000,30,"188495.559i","-35530575762.7225","-6697355739986230i",null,"100+18.8495559i",null,{"$error":"#REF!"},{"$error":"#REF!"},null,{"$error":"#REF!"},{"$error":"#REF!"},{"$error":"#REF!"},{"$error":"#REF!"},0,"1+0.06597344565i","-0.00074916621307486i","-0.0355163635324174","0.964483636467583+0.0652242794369251i",1,1,0,0,null,"1.03670887459481-0.00170572482425677i",0.31314808208663503,-9.4270192682177109E-2,null,"3.76991118i","1+3.76991118i",{"$error":"#REF!"},"-3.55305757627225-0.669735573998623i","1+3.76991118i",{"$error":"#REF!"},null,{"$error":"#REF!"},null,{"$error":"#REF!"},{"$error":"#REF!"}]
[35000,35,"219911.4855i","-48361061454.8167","-10635152864885500i",null,"100+21.99114855i",null,{"$error":"#REF!"},{"$error":"#REF!"},null,{"$error":"#REF!"},{"$error":"#REF!"},{"$error":"#REF!"},{"$error":"#REF!"},0,"1+0.076969019925i","-0.00118964819946609i","-0.0483417170302348","0.951658282969765+0.0757793717255339i",1,1,0,0,null,"1.05057619978726-0.00277724104542023i",0.42858150735745315,-0.15146337803870516,null,"4.39822971i","1+4.39822971i",{"$error":"#REF!"},"-4.83610614548167-1.06351528648855i","1+4.39822971i",{"$error":"#REF!"},null,{"$error":"#REF!"},null,{"$error":"#REF!"},{"$error":"#REF!"}]
[40000,40,"251327.412i","-63165468022.6178","-15875213605893300i",null,"100+25.1327412i",null,{"$error":"#REF!"},{"$error":"#REF!"},null,{"$error":"#REF!"},{"$error":"#REF!"},{"$error":"#REF!"},{"$error":"#REF!"},0,"1+0.0879645942i","-0.00177580139395522i","-0.0631402018354088","0.936859798164591+0.0861887928060448i",1,1,0,0,null,"1.06700286965865-0.00426861635465528i",0.56338125510820847,-0.22921437604912545,null,"5.02654824i","1+5.02654824i",{"$error":"#REF!"},"-6.31654680226178-1.58752136058933i","1+5.02654824i",{"$error":"#REF!"},null,{"$error":"#REF!"},null,{"$error":"#REF!"},{"$error":"#REF!"}]
[45000,45,"282743.3385i","-79943795466.1256","-22603575622453500i",null,"100+28.27433385i",null,{"$error":"#REF!"},{"$error":"#REF!"},null,{"$error":"#REF!"},{"$error":"#REF!"},{"$error":"#REF!"},{"$error":"#REF!"},0,"1+0.098960168475i","-0.00252843596912765i","-0.0799118179479392","0.920088182052061+0.0964317325058724i",1,1,0,0,null,"1.08619356566251-0.00628565719175738i",0.71828994959670589,-0.33155932819996564,null,"5.65486677i","1+5.65486677i",{"$error":"#REF!"},"-7.99437954661256-2.26035756224535i","1+5.65486677i",{"$error":"#REF!"},null,{"$error":"#REF!"},null,{"$error":"#REF!"},{"$error":"#REF!"}]
[50000,50,"314159.265i","-98696043785.3402","-31006276574010300i",null,"100+31.4159265i",null,{"$error":"#REF!"},{"$error":"#REF!"},null,{"$error":"#REF!"},{"$error":"#REF!"},{"$error":"#REF!"},{"$error":"#REF!"},0,"1+0.10995574275i","-0.00346836209756879i","-0.0986565653678261","0.901343434632174+0.106487380652431i",1,1,0,0,null,"1.10839666057698-0.00895831050462997i",0.89418785513768861,-0.46306726345210286,null,"6.2831853i","1+6.2831853i",{"$error":"#REF!"},"-9.86960437853402-3.10062765740103i","1+6.2831853i",{"$error":"#REF!"},null,{"$error":"#REF!"},null,{"$error":"#REF!"},{"$error":"#REF!"}]
[55000,55,"345575.1915i","-119422212980.262","-41269354120007700i",null,"100+34.55751915i",null,{"$error":"#REF!"},{"$error":"#REF!"},null,{"$error":"#REF!"},{"$error":"#REF!"},{"$error":"#REF!"},{"$error":"#REF!"},0,"1+0.120951317025i","-0.00461638995186406i","-0.11937444409507","0.88062555590493+0.116334927073136i",1,1,0,0,null,"1.1339119415625-0.0124482487823856i",1.0921099587044569,-0.628976061964027,null,"6.91150383i","1+6.91150383i",{"$error":"#REF!"},"-11.9422212980262-4.12693541200078i","1+6.91150383i",{"$error":"#REF!"},null,{"$error":"#REF!"},null,{"$error":"#REF!"},{"$error":"#REF!"}]
[60000,60,"376991.118i","-142122303050.89","-53578845919889800i",null,"100+37.6991118i",null,{"$error":"#REF!"},{"$error":"#REF!"},null,{"$error":"#REF!"},{"$error":"#REF!"},{"$error":"#REF!"},{"$error":"#REF!"},0,"1+0.1319468913i","-0.00599332970459887i","-0.14206545412967","0.85793454587033+0.125953561595401i",1,1,0,0,null,"1.1631003258263-0.0169590294511739i",1.3132667689997053,-0.83536384612322845,null,"7.53982236i","1+7.53982236i",{"$error":"#REF!"},"-14.212230305089-5.35788459198898i","1+7.53982236i",{"$error":"#REF!"},null,{"$error":"#REF!"},null,{"$error":"#REF!"},{"$error":"#REF!"}]
[65000,65,"408407.0445i","-166796313997.225","-68120789633100600i",null,"100+40.84070445i",null,{"$error":"#REF!"},{"$error":"#REF!"},null,{"$error":"#REF!"},{"$error":"#REF!"},{"$error":"#REF!"},{"$error":"#REF!"},0,"1+0.142942465575i","-0.00761999152835863i","-0.166729595471626","0.833270404528374+0.135322474046641i",1,1,0,0,null,"1.19639605981863-0.0227498889631618i",1.5590695347266561,-1.0893679748558442,null,"8.16814089i","1+8.16814089i",{"$error":"#REF!"},"-16.6796313997225-6.81207896331006i","1+8.16814089i",{"$error":"#REF!"},null,{"$error":"#REF!"},null,{"$error":"#REF!"},{"$error":"#REF!"}]
[70000,70,"439822.971i","-193444245819.267","-85081222919084300i",null,"100+43.9822971i",null,{"$error":"#REF!"},{"$error":"#REF!"},null,{"$error":"#REF!"},{"$error":"#REF!"},{"$error":"#REF!"},{"$error":"#REF!"},0,"1+0.15393803985i","-0.00951718559572877i","-0.193366868120939","0.806633131879061+0.144420854254271i",1,1,0,0,null,"1.23432201043572-0.0301547238275632i",1.8311607132208529,-1.3994685289579945,null,"8.79645942i","1+8.79645942i",{"$error":"#REF!"},"-19.3444245819267-8.50812229190843i","1+8.79645942i",{"$error":"#REF!"},null,{"$error":"#REF!"},null,{"$error":"#REF!"},{"$error":"#REF!"}]
[75000,75,"471238.8975i","-222066098517.016","-104646183437285000i",null,"100+47.12388975i",null,{"$error":"#REF!"},{"$error":"#REF!"},null,{"$error":"#REF!"},{"$error":"#REF!"},{"$error":"#REF!"},{"$error":"#REF!"},0,"1+0.164933614125i","-0.0117057220792947i","-0.221977272077609","0.778022727922391+0.153227892045705i",1,1,0,0,null,"1.27750877655212-0.0396085636961541i",2.1314506343374608,-1.775860031243816,null,"9.42477795i","1+9.42477795i",{"$error":"#REF!"},"-22.2066098517016-10.4646183437285i","1+9.42477795i",{"$error":"#REF!"},null,{"$error":"#REF!"},null,{"$error":"#REF!"},{"$error":"#REF!"}]
[80000,80,"502654.824i","-252661872090.471","-127001708847146000i",null,"100+50.2654824i",null,{"$error":"#REF!"},{"$error":"#REF!"},null,{"$error":"#REF!"},{"$error":"#REF!"},{"$error":"#REF!"},{"$error":"#REF!"},0,"1+0.1759291884i","-0.0142064111516417i","-0.252560807341635","0.747439192658365+0.161722777248358i",1,1,0,0,null,"1.32671843606306-0.0516850094110243i",2.4621613570964245,-2.2309452403961947,null,"10.05309648i","1+10.05309648i",{"$error":"#REF!"},"-25.2661872090471-12.7001708847146i","1+10.05309648i",{"$error":"#REF!"},null,{"$error":"#REF!"},null,{"$error":"#REF!"},{"$error":"#REF!"}]
[90000,90,"565486.677i","-319775181864.502","-180828604979628000i",null,"100+56.5486677i",null,{"$error":"#REF!"},{"$error":"#REF!"},null,{"$error":"#REF!"},{"$error":"#REF!"},{"$error":"#REF!"},{"$error":"#REF!"},0,"1+0.19792033695i","-0.0202274877530212i","-0.319647271791756","0.680352728208244+0.177692849196979i",1,1,0,0,null,"1.44709298035524-0.0870397594174791i",3.2256122149724868,-3.4420800766964819,null,"11.30973354i","1+11.30973354i",{"$error":"#REF!"},"-31.9775181864502-18.0828604979628i","1+11.30973354i",{"$error":"#REF!"},null,{"$error":"#REF!"},null,{"$error":"#REF!"},{"$error":"#REF!"}]
[100000,100,"628318.53i","-394784175141.361","-248050212592082000i",null,"100+62.831853i",null,{"$error":"#REF!"},{"$error":"#REF!"},null,{"$error":"#REF!"},{"$error":"#REF!"},{"$error":"#REF!"},{"$error":"#REF!"},0,"1+0.2199114855i","-0.0277468967805503i","-0.394626261471305","0.605373738528695+0.19216458871945i",1,1,0,0,null,"1.60541786286688-0.146344269997555i",4.1477004385549856,-5.208487782900634,null,"12.5663706i","1+12.5663706i",{"$error":"#REF!"},"-39.4784175141361-24.8050212592082i","1+12.5663706i",{"$error":"#REF!"},null,{"$error":"#REF!"},null,{"$error":"#REF!"},{"$error":"#REF!"}]
[110000,110,"691150.383i","-477688851921.047","-330154832960062000i",null,"100+69.1150383i",null,{"$error":"#REF!"},{"$error":"#REF!"},null,{"$error":"#REF!"},{"$error":"#REF!"},{"$f":"J72","v":{"$error":"#REF!"}},{"$f":"IMSUM(L72:N72)","v":{"$error":"#REF!"}},1,"1+0.24190263405i","-0.0369311196149125i","-0.477497776380279",{"$f":"IMSUM(S72,R72,Q72)","v":"0.522502223619721+0.204971514435088i"},1,1,0,0,null,"1.81601781079008-0.249432980334241i",5.2635704959533189,-7.8207323086855629,null,"13.82300766i","1+13.82300766i",{"$error":"#REF!"},"-47.7688851921047-33.0154832960062i","1+13.82300766i",{"$error":"#REF!"},null,{"$error":"#REF!"},null,{"$error":"#REF!"},{"$error":"#REF!"}]
[120000,120,"753982.236i","-568489212203.56","-428630767359118000i",null,"100+75.3982236i",null,{"$error":"#REF!"},{"$error":"#REF!"},null,{"$error":"#REF!"},{"$error":"#REF!"},{"$error":"#REF!"},{"$error":"#REF!"},2,"1+0.2638937826i","-0.0479466376367909i","-0.568261816518679","0.431738183481321+0.215947144963209i",1,1,0,0,null,"2.09725415352119-0.43777055480966i",6.6182385434260986,-11.79034914070173,null,"15.07964472i","1+15.07964472i",{"$error":"#REF!"},"-56.848921220356-42.8630767359119i","1+15.07964472i",{"$error":"#REF!"},null,{"$error":"#REF!"},null,{"$error":"#REF!"},{"$error":"#REF!"}]
[130000,130,"816814.089i","-667185255988.9","-544966317064805000i",null,"100+81.6814089i",null,{"$error":"#REF!"},{"$error":"#REF!"},null,{"$error":"#REF!"},{"$error":"#REF!"},{"$error":"#REF!"},{"$error":"#REF!"},3,"1+0.28588493115i","-0.0609599322268691i","-0.666918381886505","0.333081618113495+0.224924998923131i",1,1,0,0,null,"2.4600564712321-0.802936137717432i",8.2585333921617039,-18.076129196132914,null,"16.33628178i","1+16.33628178i",{"$error":"#REF!"},"-66.71852559889-54.4966317064805i","1+16.33628178i",{"$error":"#REF!"},null,{"$error":"#REF!"},null,{"$error":"#REF!"},{"$error":"#REF!"}]
[150000,150,"942477.795i","-888264394068.062","-837169467498278000i",null,"100+94.2477795i",null,{"$error":"#REF!"},{"$error":"#REF!"},null,{"$error":"#REF!"},{"$error":"#REF!"},{"$error":"#REF!"},{"$error":"#REF!"},4,"1+0.32986722825i","-0.0936457766343574i","-0.887909088310435","0.112090911689565+0.236221451615643i",1,1,0,0,null,"2.77938675294686-2.91445167327342i",12.100245900170394,-46.358872275853109,null,"18.8495559i","1+18.8495559i",{"$error":"#REF!"},"-88.8264394068062-83.7169467498278i","1+18.8495559i",{"$error":"#REF!"},null,{"$error":"#REF!"},null,{"$error":"#REF!"},{"$error":"#REF!"}]
[160000,160,"1005309.648i","-1010647488361.88","-1016013670777170000i",null,"100+100.5309648i",null,{"$error":"#REF!"},{"$error":"#REF!"},null,{"$error":"#REF!"},{"$error":"#REF!"},{"$error":"#REF!"},{"$error":"#REF!"},5,"1+0.3518583768i","-0.113651289213134i","-1.01024322936654","-0.01024322936654+0.238207087586866i",1,1,0,0,null,"1.29419724044521-4.25368014631354i",12.959790177872241,-73.077431398381563,null,"20.10619296i","1+20.10619296i",{"$error":"#REF!"},"-101.064748836188-101.601367077717i","1+20.10619296i",{"$error":"#REF!"},null,{"$error":"#REF!"},null,{"$error":"#REF!"},{"$error":"#REF!"}]
[175000,175,{"$f":"COMPLEX(0,2*Pi*A77)","v":"1099557.4275i"},{"$f":"COMPLEX(-POWER(2*Pi*A77,2),0)","v":"-1209026536370.42"},{"$f":"COMPLEX(0,-POWER(2*Pi*A77,3))","v":"-1329394108110690000i"},null,"100+109.95574275i",null,{"$f":"IMPRODUCT((RdampSel*CdampSel+RdampSel*CinjSel),C77)","v":{"$error":"#REF!"}},{"$error":"#REF!"},null,{"$f":"IMPRODUCT(G77,L_infilterStd*RdampSel*CinjSel*CdampSel,E77)","v":{"$error":"#REF!"}},{"$f":"IMPRODUCT(G77,L_infilterStd*CinjSel,D77)","v":{"$error":"#REF!"}},{"$error":"#REF!"},{"$error":"#REF!"},6,{"$f":"IMSUM(IMPRODUCT(C77,RdampPssv*CdampPssv),1)","v":"1+0.384845099625i"},{"$f":"IMPRODUCT(RdampPssv*CdampPssv*CfilterPssv*LinfilterPssv,E77)","v":"-0.148706024933262i"},{"$f":"IMPRODUCT(D77,LinfilterPssv*(CfilterPssv+CdampPssv))","v":"-1.20854292575587"},"-0.20854292575587+0.236139074691738i",1,1,0,0,null,{"$f":"IMDIV(Q77,T77)","v":"-1.18552956082797-3.18780870043445i"},10.632434371784214,{"$f":"IMARGUMENT(Z77)*180/Pi","v":-110.39990747553254},null,{"$f":"IMPRODUCT((RdampCom*CdampCom+RdampCom*CinjCom),C77)","v":"21.99114855i"},"1+21.99114855i",{"$f":"IMPRODUCT(G77,L_infilterStd*RdampSel*CinjSel*CdampSel,E77)","v":{"$error":"#REF!"}},{"$f":"IMPRODUCT(G77,LAEFCom*CinjCom,D77)","v":"-120.902653637042-132.939410811069i"},"1+21.99114855i",{"$error":"#REF!"},null,{"$error":"#REF!"},null,{"$error":"#REF!"},{"$f":"IMARGUMENT(AK77)*180/Pi","v":{"$error":"#REF!"}}]
[190000,190,"1193805.207i","-1425170872260.31","-1701376408169090000i",null,"100+119.3805207i",null,{"$error":"#REF!"},{"$error":"#REF!"},null,{"$error":"#REF!"},{"$error":"#REF!"},{"$error":"#REF!"},{"$error":"#REF!"},7,"1+0.41783182245i","-0.190315965017794i","-1.42460080391141","-0.42460080391141+0.227515857432206i",1,1,0,0,null,"-1.42011816933091-1.74500664759685i",{"$f":"20*LOG10(IMABS(Z78))","v":7.0430359282769261},-129.13932379003126,null,"23.87610414i",{"$f":"IMSUM(1,AD78)","v":"1+23.87610414i"},{"$error":"#REF!"},"-142.517087226031-170.137640816909i",{"$f":"AE78","v":"1+23.87610414i"},{"$f":"IMSUM(AF78:AH78)","v":{"$error":"#REF!"}},null,{"$f":"IMDIV(AE78,AI78)","v":{"$error":"#REF!"}},null,{"$f":"20*LOG10(IMABS(AK78))","v":{"$error":"#REF!"}},{"$error":"#REF!"}]
[200000,200,"1256637.06i","-1579136700565.44","-1984401700736660000i",null,"100+125.663706i",null,{"$error":"#REF!"},{"$error":"#REF!"},null,{"$error":"#REF!"},{"$error":"#REF!"},{"$error":"#REF!"},{"$error":"#REF!"},0,"1+0.439822971i","-0.221975174244403i","-1.57850504588521","-0.57850504588521+0.217847796755597i",1,1,0,0,null,"-1.26317208366406-1.23594812428182i",4.9459582998103908,-135.6241223057485,null,"25.1327412i","1+25.1327412i",{"$error":"#REF!"},"-157.913670056544-198.440170073665i","1+25.1327412i",{"$error":"#REF!"},null,{"$error":"#REF!"},null,{"$error":"#REF!"},{"$error":"#REF!"}]
[300000,300,"1884955.59i","-3553057576272.25","-6697355739986230000i",null,"100+188.495559i",null,{"$error":"#REF!"},{"$error":"#REF!"},null,{"$error":"#REF!"},{"$error":"#REF!"},{"$error":"#REF!"},{"$error":"#REF!"},0,"1+0.6597344565i","-0.74916621307486i","-3.55163635324174","-2.55163635324174-0.08943175657486i",1,1,0,0,null,"-0.400475408867723-0.244517302172491i",-6.5724330903943216,-148.59311414511541,null,"37.6991118i","1+37.6991118i",{"$error":"#REF!"},"-355.305757627225-669.735573998623i","1+37.6991118i",{"$error":"#REF!"},null,{"$error":"#REF!"},null,{"$error":"#REF!"},{"$error":"#REF!"}]
[400000,400,"2513274.12i","-6316546802261.78","-15875213605893300000i",null,"100+251.327412i",null,{"$error":"#REF!"},{"$error":"#REF!"},null,{"$error":"#REF!"},{"$error":"#REF!"},{"$error":"#REF!"},{"$error":"#REF!"},0,"1+0.879645942i","-1.77580139395522i","-6.31402018354088","-5.31402018354088-0.89615545195522i",1,1,0,0,null,"-0.210121191022436-0.130098243366712i",-12.141260868793136,-148.23594278994108,null,"50.2654824i","1+50.2654824i",{"$error":"#REF!"},"-631.654680226178-1587.52136058933i","1+50.2654824i",{"$error":"#REF!"},null,{"$error":"#REF!"},null,{"$error":"#REF!"},{"$error":"#REF!"}]
[500000,500,"3141592.65i","-9869604378534.03","-31006276574010300000i",null,"100+314.159265i",null,{"$error":"#REF!"},{"$error":"#REF!"},null,{"$error":"#REF!"},{"$error":"#REF!"},{"$error":"#REF!"},{"$error":"#REF!"},0,"1+1.0995574275i","-3.46836209756879i","-9.86565653678262","-8.86565653678262-2.36880467006879i",1,1,0,0,null,"-0.136208802833546-0.0876308907321328i",-15.811684145573038,-147.2445124058745,null,"62.831853i","1+62.831853i",{"$error":"#REF!"},"-986.960437853403-3100.62765740103i","1+62.831853i",{"$error":"#REF!"},null,{"$error":"#REF!"},null,{"$error":"#REF!"},{"$error":"#REF!"}]
[600000,600,"3769911.18i","-14212230305089","-53578845919889800000i",null,{"$f":"IMSUM(IMPRODUCT(C83,Rcomp_AEF*Csen_AEF),Csen_AEF/Ccomp_AEF)","v":"100+376.991118i"},null,{"$error":"#REF!"},{"$error":"#REF!"},null,{"$error":"#REF!"},{"$error":"#REF!"},{"$error":"#REF!"},{"$error":"#REF!"},0,"1+1.319468913i","-5.99332970459887i","-14.206545412967","-13.206545412967-4.67386079159887i",1,{"$f":"CHOOSE(INFILTER_TYPE,U83,IMDIV(J83,O83),IMDIV(Q83,T83))","v":1},0,{"$f":"IMARGUMENT(V83)*180/Pi","v":0},null,"-0.0987148424567274-0.0649745603002369i",-18.549182102928064,-146.64690503853296,null,"75.3982236i","1+75.3982236i",{"$error":"#REF!"},"-1421.2230305089-5357.88459198898i","1+75.3982236i",{"$error":"#REF!"},null,{"$error":"#REF!"},null,{"$error":"#REF!"},{"$error":"#REF!"}]
[700000,700,"4398229.71i","-19344424581926.7","-85081222919084300000i",null,"100+439.822971i",null,{"$error":"#REF!"},{"$error":"#REF!"},null,{"$error":"#REF!"},{"$error":"#REF!"},{"$error":"#REF!"},{"$error":"#REF!"},0,"1+1.5393803985i","-9.51718559572877i","-19.3366868120939","-18.3366868120939-7.97780519722877i",1,1,0,0,null,"-0.0765669830392885-0.050638587700621i",-20.743388875708668,-146.52081538204177,null,"87.9645942i","1+87.9645942i",{"$error":"#REF!"},"-1934.44245819267-8508.12229190843i","1+87.9645942i",{"$error":"#REF!"},null,{"$error":"#REF!"},null,{"$error":"#REF!"},{"$error":"#REF!"}]
[800000,800,"5026548.24i","-25266187209047.1","-127001708847146000000i",null,"100+502.654824i",null,{"$error":"#REF!"},{"$error":"#REF!"},null,{"$error":"#REF!"},{"$error":"#REF!"},{"$error":"#REF!"},{"$error":"#REF!"},0,"1+1.759291884i","-14.2064111516417i","-25.2560807341635","-24.2560807341635-12.4471192676417i",1,1,0,0,null,"-0.0620946151681225-0.040665794855093i",-22.588919033913939,-146.77919071706401,null,"100.5309648i","1+100.5309648i",{"$error":"#REF!"},"-2526.61872090471-12700.1708847146i","1+100.5309648i",{"$error":"#REF!"},null,{"$error":"#REF!"},null,{"$error":"#REF!"},{"$error":"#REF!"}]
[900000,900,"5654866.77i","-31977518186450.2","-180828604979628000000i",null,"100+565.486677i",null,{"$error":"#REF!"},{"$error":"#REF!"},null,{"$error":"#REF!"},{"$error":"#REF!"},{"$error":"#REF!"},{"$error":"#REF!"},0,"1+1.9792033695i","-20.2274877530212i","-31.9647271791756","-30.9647271791756-18.2482843835212i",1,1,0,0,null,"-0.0519283597315569-0.033315323192724i",-24.194781244722876,-147.31726418522518,null,"113.0973354i","1+113.0973354i",{"$error":"#REF!"},"-3197.75181864502-18082.8604979628i","1+113.0973354i",{"$error":"#REF!"},null,{"$error":"#REF!"},null,{"$error":"#REF!"},{"$error":"#REF!"}]
[1000000,1000,"6283185.3i","-39478417514136.1","-248050212592083000000i",null,"100+628.31853i",null,{"$error":"#REF!"},{"$error":"#REF!"},null,{"$error":"#REF!"},{"$error":"#REF!"},{"$error":"#REF!"},{"$error":"#REF!"},0,"1+2.199114855i","-27.7468967805504i","-39.4626261471305","-38.4626261471305-25.5477819255504i",1,1,0,0,null,"-0.044391344457259-0.0276895930961649i",-25.626768047686518,-148.04569057314714,null,"125.663706i","1+125.663706i",{"$error":"#REF!"},"-3947.84175141361-24805.0212592082i","1+125.663706i",{"$error":"#REF!"},null,{"$error":"#REF!"},null,{"$error":"#REF!"},{"$error":"#REF!"}]
[2000000,2000,"12566370.6i","-157913670056544","-1.98440170073666E+21i",null,"100+1256.63706i",null,{"$error":"#REF!"},{"$error":"#REF!"},null,{"$error":"#REF!"},{"$error":"#REF!"},{"$error":"#REF!"},{"$error":"#REF!"},0,"1+4.39822971i","-221.975174244403i","-157.850504588521","-156.850504588521-217.576944534403i",1,1,0,0,null,"-0.0154820114155727-0.00656485596685991i",-35.485359346827785,-157.02154019060663,null,"251.327412i","1+251.327412i",{"$error":"#REF!"},"-15791.3670056544-198440.170073666i","1+251.327412i",{"$error":"#REF!"},null,{"$error":"#REF!"},null,{"$error":"#REF!"},{"$error":"#REF!"}]
[3000000,3000,"18849555.9i","-355305757627225","-6.69735573998623E+21i",null,"100+1884.95559i",null,{"$error":"#REF!"},{"$error":"#REF!"},null,{"$error":"#REF!"},{"$error":"#REF!"},{"$error":"#REF!"},{"$error":"#REF!"},0,"1+6.597344565i","-749.16621307486i","-355.163635324174","-354.163635324174-742.56886850986i",1,1,0,0,null,"-0.00776127767315144-0.00235501700871593i",-41.818827844809874,-163.12054420169724,null,"376.991118i","1+376.991118i",{"$error":"#REF!"},"-35530.5757627225-669735.573998623i","1+376.991118i",{"$error":"#REF!"},null,{"$error":"#REF!"},null,{"$error":"#REF!"},{"$error":"#REF!"}]
[4000000,4000,"25132741.2i","-631654680226178","-1.58752136058933E+22i",null,"100+2513.27412i",null,{"$error":"#REF!"},{"$error":"#REF!"},null,{"$error":"#REF!"},{"$error":"#REF!"},{"$error":"#REF!"},{"$error":"#REF!"},0,"1+8.79645942i","-1775.80139395522i","-631.402018354088","-630.402018354088-1767.00493453522i",1,1,0,0,null,"-0.00459520096124435-0.00107346840047734i",-46.523147642689807,-166.85114049434898,null,"502.654824i","1+502.654824i",{"$error":"#REF!"},"-63165.4680226178-1587521.36058933i","1+502.654824i",{"$error":"#REF!"},null,{"$error":"#REF!"},null,{"$error":"#REF!"},{"$error":"#REF!"}]
[5000000,5000,"31415926.5i","-986960437853403","-3.10062765740103E+22i",null,"100+3141.59265i",null,{"$error":"#REF!"},{"$error":"#REF!"},null,{"$error":"#REF!"},{"$error":"#REF!"},{"$error":"#REF!"},{"$error":"#REF!"},0,"1+10.995574275i","-3468.36209756879i","-986.565653678262","-985.565653678262-3457.36652329379i",1,1,0,0,null,"-0.00301757308495533-0.000570959537178404i",-50.254080822840123,-169.28564289756036,null,"628.31853i","1+628.31853i",{"$error":"#REF!"},"-98696.0437853403-3100627.65740103i","1+628.31853i",{"$error":"#REF!"},null,{"$error":"#REF!"},null,{"$error":"#REF!"},{"$error":"#REF!"}]
[6000000,6000,"37699111.8i","-1421223030508900","-5.35788459198898E+22i",null,"100+3769.91118i",null,{"$error":"#REF!"},{"$error":"#REF!"},null,{"$error":"#REF!"},{"$error":"#REF!"},{"$error":"#REF!"},{"$error":"#REF!"},0,"1+13.19468913i","-5993.32970459887i","-1420.6545412967","-1419.6545412967-5980.13501546887i",1,1,0,0,null,"-0.00212628728062533-0.000337549802608077i",-53.339467507298949,-170.979524286046,null,"753.982236i","1+753.982236i",{"$error":"#REF!"},"-142122.30305089-5357884.59198898i","1+753.982236i",{"$error":"#REF!"},null,{"$error":"#REF!"},null,{"$error":"#REF!"},{"$error":"#REF!"}]
[7000000,7000,"43982297.1i","-1934442458192670","-8.50812229190843E+22i",null,"100+4398.22971i",null,{"$error":"#REF!"},{"$error":"#REF!"},null,{"$error":"#REF!"},{"$error":"#REF!"},{"$error":"#REF!"},{"$error":"#REF!"},0,"1+15.393803985i","-9517.18559572877i","-1933.66868120939","-1932.66868120939-9501.79179174377i",1,1,0,0,null,"-0.00157628762603077-0.000215374297002146i",-55.966960551322785,-172.21963347996476,null,"879.645942i","1+879.645942i",{"$error":"#REF!"},"-193444.245819267-8508122.29190843i","1+879.645942i",{"$error":"#REF!"},null,{"$error":"#REF!"},null,{"$error":"#REF!"},{"$error":"#REF!"}]
[8000000,8000,"50265482.4i","-2526618720904710","-1.27001708847146E+23i",null,"100+5026.54824i",null,{"$error":"#REF!"},{"$error":"#REF!"},null,{"$error":"#REF!"},{"$error":"#REF!"},{"$error":"#REF!"},{"$error":"#REF!"},0,"1+17.59291884i","-14206.4111516417i","-2525.60807341635","-2524.60807341635-14188.8182328017i",1,1,0,0,null,"-0.00121401992445827-0.000145531817287078i",-58.253518683206799,-173.1642323462458,null,"1005.309648i","1+1005.309648i",{"$error":"#REF!"},"-252661.872090471-12700170.8847146i","1+1005.309648i",{"$error":"#REF!"},null,{"$error":"#REF!"},null,{"$error":"#REF!"},{"$error":"#REF!"}]
[9000000,9000,"56548667.7i","-3197751818645020","-1.80828604979628E+23i",null,"100+5654.86677i",null,{"$error":"#REF!"},{"$error":"#REF!"},null,{"$error":"#REF!"},{"$error":"#REF!"},{"$error":"#REF!"},{"$error":"#REF!"},0,"1+19.792033695i","-20227.4877530212i","-3196.47271791756","-3195.47271791756-20207.6957193262i",1,1,0,0,null,"-0.000963171180292813-0.000102821581350465i",-60.27671706539698,-173.90657129969617,null,"1130.973354i","1+1130.973354i",{"$error":"#REF!"},"-319775.181864502-18082860.4979628i","1+1130.973354i",{"$error":"#REF!"},null,{"$error":"#REF!"},null,{"$error":"#REF!"},{"$error":"#REF!"}]
[10000000,10000,"62831853i","-3947841751413610","-2.48050212592082E+23i",null,"100+6283.1853i",null,{"$error":"#REF!"},{"$error":"#REF!"},null,{"$error":"#REF!"},{"$error":"#REF!"},{"$error":"#REF!"},{"$error":"#REF!"},0,"1+21.99114855i","-27746.8967805503i","-3946.26261471304","-3945.26261471304-27724.9056320003i",1,1,0,0,null,"-0.000782478973720499-0.0000752783461022707i",-62.09053569388221,-174.50477476720093,null,"1256.63706i","1+1256.63706i",{"$error":"#REF!"},"-394784.175141361-24805021.2592083i","1+1256.63706i",{"$error":"#REF!"},null,{"$error":"#REF!"},null,{"$error":"#REF!"},{"$error":"#REF!"}]
[{"$f":"Fsw","v":100000},{"$f":"A97/1000","v":100},"628318.53i","-394784175141.361","-248050212592082000i",null,"100+62.831853i",null,{"$error":"#REF!"},{"$f":"IMSUM(1,I97)","v":{"$error":"#REF!"}},null,{"$error":"#REF!"},{"$error":"#REF!"},{"$f":"J97","v":{"$error":"#REF!"}},{"$f":"IMSUM(L97:N97)","v":{"$error":"#REF!"}},2,"1+0.2199114855i","-0.0277468967805503i","-0.394626261471305",{"$f":"IMSUM(S97,R97,Q97)","v":"0.605373738528695+0.19216458871945i"},1,1,{"$f":"20*LOG10(IMABS(V97))","v":0},0,null,"1.60541786286688-0.146344269997555i",4.1477004385549856,-5.208487782900634,null,"12.5663706i","1+12.5663706i",{"$error":"#REF!"},"-39.4784175141361-24.8050212592082i","1+12.5663706i",{"$error":"#REF!"},null,{"$error":"#REF!"},null,{"$error":"#REF!"},{"$error":"#REF!"}]

{"sheet":"Standard Value Calculator","index":12,"n_rows":159,"n_cols":20,"rows_kept":159,"cut":false,"hidden":true,"merged":[]}
[]
["Capacitors","Css","Cc1ea","Cc2ea","Cout","Cin","Cres","Cdither","Cc3ea","Cc4ea","Cin_Passive","Cdamp_Pssv","Cinj_AEF","Cdamp_AEF"]
["Inputs",{"$f":"Css","v":0},{"$f":"Cc1ea","v":5.4145533860010111E-9},{"$f":"Cc2ea","v":3.3635864159331752E-10},{"$f":"Cout","v":1.4999999999999999E-4},{"$f":"Cin","v":1.6000000000000001E-4},{"$f":"Cres","v":7.4999999999999997E-8},{"$f":"Cdither_init","v":2.0226537216828479E-9},{"$f":"Cc3ea","v":0},{"$f":"Cc4ea","v":0},{"$f":"'Variable Management'!B291*0.000001","v":3.1374376701032284E-3},{"$f":"K3*4","v":1.2549750680412914E-2},{"$f":"Cinj_AEF*0.000001","v":3.1374376701032287E-5},{"$f":"'Variable Management'!B294*0.000001","v":1.0458125567010762E-5},null,null,"Resistors","inputs","Standard Result"]
["Standard Result",{"$f":"SUM(B6:B158)/1000000000000","v":0},{"$f":"IF(C3=\"OPEN\",\"OPEN\",SUM(C6:C158)/1000000000000)","v":5.5999999999999997E-9},{"$f":"SUM(D6:D158)/1000000000000","v":3.3E-10},{"$f":"SUM(E6:E158)/1000000000000","v":1.4999999999999999E-4},{"$f":"SUM(F6:F158)/1000000000000","v":1.4999999999999999E-4},{"$f":"SUM(G6:G158)/1000000000000","v":8.2000000000000006E-8},{"$f":"IF(H3=\"OPEN\",\"OPEN\",SUM(H6:H158)/1000000000000)","v":2.1999999999999998E-9},0,0,3.3E-3,1.2E-2,3.3000000000000003E-5,1.0000000000000001E-5,null,null,"Rt",{"$f":"Rfadj","v":221},{"$f":"IF(R4>(INT(0.5+100*POWER(10,IF(96*(LOG(R4)-INT(LOG(R4)))-ROUND(96*(LOG(R4)-INT(LOG(R4))),0)<0,ROUND(96*(LOG(R4)-INT(LOG(R4))),0)-1,ROUND(96*(LOG(R4)-INT(LOG(R4))),0))/96))*POWER(10,INT(LOG(R4))-2)+INT(0.5+100*POWER(10,(IF(96*(LOG(R4)-INT(LOG(R4)))-ROUND(96*(LOG(R4)-INT(LOG(R4))),0)<0,ROUND(96*(LOG(R4)-INT(LOG(R4))),0)-1,ROUND(96*(LOG(R4)-INT(LOG(R4))),0))+1)/96))*POWER(10,INT(LOG(R4))-2))/2,INT(0.5+100*POWER(10,(IF(96*(LOG(R4)-INT(LOG(R4)))-ROUND(96*(LOG(R4)-INT(LOG(R4))),0)<0,ROUND(96*(LOG(R4)-INT(LOG(R4))),0)-1,ROUND(96*(LOG(R4)-INT(LOG(R4))),0))+1)/96))*POWER(10,INT(LOG(R4))-2),INT(0.5+100*POWER(10,IF(96*(LOG(R4)-INT(LOG(R4)))-ROUND(96*(LOG(R4)-INT(LOG(R4))),0)<0,ROUND(96*(LOG(R4)-INT(LOG(R4))),0)-1,ROUND(96*(LOG(R4)-INT(LOG(R4))),0))/96))*POWER(10,INT(LOG(R4))-2))","v":221},"Ω"]
["(pF)"]
[0.47,{"$f":"IF(IF((B$3*10^12-$A7)*(B$3*10^12-$A6)*-1<0,0,1)*IF(ABS(B$3*10^12-$A7)>(B$3*10^12-$A6),$A6,$A7)=B7,0,IF((B$3*10^12-$A7)*(B$3*10^12-$A6)*-1<0,0,1)*IF(ABS(B$3*10^12-$A7)>(B$3*10^12-$A6),$A6,$A7))","v":0},0,0,0,0,0,0,0,0,0,0,0,0]
[0.56000000000000005,{"$f":"IF(IF((B$3*10^12-$A8)*(B$3*10^12-$A7)*-1<0,0,1)*IF(ABS(B$3*10^12-$A8)>(B$3*10^12-$A7),$A7,$A8)=B8,0,IF((B$3*10^12-$A8)*(B$3*10^12-$A7)*-1<0,0,1)*IF(ABS(B$3*10^12-$A8)>(B$3*10^12-$A7),$A7,$A8))","v":0},{"$f":"IF(IF((C$3*10^12-$A8)*(C$3*10^12-$A7)*-1<0,0,1)*IF(ABS(C$3*10^12-$A8)>(C$3*10^12-$A7),$A7,$A8)=C8,0,IF((C$3*10^12-$A8)*(C$3*10^12-$A7)*-1<0,0,1)*IF(ABS(C$3*10^12-$A8)>(C$3*10^12-$A7),$A7,$A8))","v":0},{"$f":"IF(IF((D$3*10^12-$A8)*(D$3*10^12-$A7)*-1<0,0,1)*IF(ABS(D$3*10^12-$A8)>(D$3*10^12-$A7),$A7,$A8)=D8,0,IF((D$3*10^12-$A8)*(D$3*10^12-$A7)*-1<0,0,1)*IF(ABS(D$3*10^12-$A8)>(D$3*10^12-$A7),$A7,$A8))","v":0},{"$f":"IF(IF((E$3*10^12-$A8)*(E$3*10^12-$A7)*-1<0,0,1)*IF(ABS(E$3*10^12-$A8)>(E$3*10^12-$A7),$A7,$A8)=E8,0,IF((E$3*10^12-$A8)*(E$3*10^12-$A7)*-1<0,0,1)*IF(ABS(E$3*10^12-$A8)>(E$3*10^12-$A7),$A7,$A8))","v":0},{"$f":"IF(IF((F$3*10^12-$A8)*(F$3*10^12-$A7)*-1<0,0,1)*IF(ABS(F$3*10^12-$A8)>(F$3*10^12-$A7),$A7,$A8)=F8,0,IF((F$3*10^12-$A8)*(F$3*10^12-$A7)*-1<0,0,1)*IF(ABS(F$3*10^12-$A8)>(F$3*10^12-$A7),$A7,$A8))","v":0},{"$f":"IF(IF((G$3*10^12-$A8)*(G$3*10^12-$A7)*-1<0,0,1)*IF(ABS(G$3*10^12-$A8)>(G$3*10^12-$A7),$A7,$A8)=G8,0,IF((G$3*10^12-$A8)*(G$3*10^12-$A7)*-1<0,0,1)*IF(ABS(G$3*10^12-$A8)>(G$3*10^12-$A7),$A7,$A8))","v":0},0,0,0,{"$f":"IF(IF((K$3*10^12-$A8)*(K$3*10^12-$A7)*-1<0,0,1)*IF(ABS(K$3*10^12-$A8)>(K$3*10^12-$A7),$A7,$A8)=K8,0,IF((K$3*10^12-$A8)*(K$3*10^12-$A7)*-1<0,0,1)*IF(ABS(K$3*10^12-$A8)>(K$3*10^12-$A7),$A7,$A8))","v":0},0,0,0,null,null,"Rc1ea",{"$f":"Rcea1","v":8645.2702737187519},{"$f":"IF(R7>(INT(0.5+100*POWER(10,IF(96*(LOG(R7)-INT(LOG(R7)))-ROUND(96*(LOG(R7)-INT(LOG(R7))),0)<0,ROUND(96*(LOG(R7)-INT(LOG(R7))),0)-1,ROUND(96*(LOG(R7)-INT(LOG(R7))),0))/96))*POWER(10,INT(LOG(R7))-2)+INT(0.5+100*POWER(10,(IF(96*(LOG(R7)-INT(LOG(R7)))-ROUND(96*(LOG(R7)-INT(LOG(R7))),0)<0,ROUND(96*(LOG(R7)-INT(LOG(R7))),0)-1,ROUND(96*(LOG(R7)-INT(LOG(R7))),0))+1)/96))*POWER(10,INT(LOG(R7))-2))/2,INT(0.5+100*POWER(10,(IF(96*(LOG(R7)-INT(LOG(R7)))-ROUND(96*(LOG(R7)-INT(LOG(R7))),0)<0,ROUND(96*(LOG(R7)-INT(LOG(R7))),0)-1,ROUND(96*(LOG(R7)-INT(LOG(R7))),0))+1)/96))*POWER(10,INT(LOG(R7))-2),INT(0.5+100*POWER(10,IF(96*(LOG(R7)-INT(LOG(R7)))-ROUND(96*(LOG(R7)-INT(LOG(R7))),0)<0,ROUND(96*(LOG(R7)-INT(LOG(R7))),0)-1,ROUND(96*(LOG(R7)-INT(LOG(R7))),0))/96))*POWER(10,INT(LOG(R7))-2))","v":8660},"Ω"]
[0.68,0,0,0,0,0,0,0,0,0,0,0,0,0,null,null,"Rc1ea",{"$f":"Rcea2","v":0},{"$f":"IF(R8>(INT(0.5+100*POWER(10,IF(96*(LOG(R8)-INT(LOG(R8)))-ROUND(96*(LOG(R8)-INT(LOG(R8))),0)<0,ROUND(96*(LOG(R8)-INT(LOG(R8))),0)-1,ROUND(96*(LOG(R8)-INT(LOG(R8))),0))/96))*POWER(10,INT(LOG(R8))-2)+INT(0.5+100*POWER(10,(IF(96*(LOG(R8)-INT(LOG(R8)))-ROUND(96*(LOG(R8)-INT(LOG(R8))),0)<0,ROUND(96*(LOG(R8)-INT(LOG(R8))),0)-1,ROUND(96*(LOG(R8)-INT(LOG(R8))),0))+1)/96))*POWER(10,INT(LOG(R8))-2))/2,INT(0.5+100*POWER(10,(IF(96*(LOG(R8)-INT(LOG(R8)))-ROUND(96*(LOG(R8)-INT(LOG(R8))),0)<0,ROUND(96*(LOG(R8)-INT(LOG(R8))),0)-1,ROUND(96*(LOG(R8)-INT(LOG(R8))),0))+1)/96))*POWER(10,INT(LOG(R8))-2),INT(0.5+100*POWER(10,IF(96*(LOG(R8)-INT(LOG(R8)))-ROUND(96*(LOG(R8)-INT(LOG(R8))),0)<0,ROUND(96*(LOG(R8)-INT(LOG(R8))),0)-1,ROUND(96*(LOG(R8)-INT(LOG(R8))),0))/96))*POWER(10,INT(LOG(R8))-2))","v":{"$error":"#NUM!"}},"Ω"]
[0.82,0,0,0,0,0,0,0,0,0,0,0,0,0]
[1,0,0,0,0,0,0,0,0,0,0,0,0,0,null,null,"Rfb1",{"$f":"Rfb1_","v":100000},{"$f":"IF(R10>(INT(0.5+100*POWER(10,IF(96*(LOG(R10)-INT(LOG(R10)))-ROUND(96*(LOG(R10)-INT(LOG(R10))),0)<0,ROUND(96*(LOG(R10)-INT(LOG(R10))),0)-1,ROUND(96*(LOG(R10)-INT(LOG(R10))),0))/96))*POWER(10,INT(LOG(R10))-2)+INT(0.5+100*POWER(10,(IF(96*(LOG(R10)-INT(LOG(R10)))-ROUND(96*(LOG(R10)-INT(LOG(R10))),0)<0,ROUND(96*(LOG(R10)-INT(LOG(R10))),0)-1,ROUND(96*(LOG(R10)-INT(LOG(R10))),0))+1)/96))*POWER(10,INT(LOG(R10))-2))/2,INT(0.5+100*POWER(10,(IF(96*(LOG(R10)-INT(LOG(R10)))-ROUND(96*(LOG(R10)-INT(LOG(R10))),0)<0,ROUND(96*(LOG(R10)-INT(LOG(R10))),0)-1,ROUND(96*(LOG(R10)-INT(LOG(R10))),0))+1)/96))*POWER(10,INT(LOG(R10))-2),INT(0.5+100*POWER(10,IF(96*(LOG(R10)-INT(LOG(R10)))-ROUND(96*(LOG(R10)-INT(LOG(R10))),0)<0,ROUND(96*(LOG(R10)-INT(LOG(R10))),0)-1,ROUND(96*(LOG(R10)-INT(LOG(R10))),0))/96))*POWER(10,INT(LOG(R10))-2))","v":100000},"Ω"]
[1.2,0,0,0,0,0,0,0,0,0,0,0,{"$f":"IF(IF((M$3*10^12-$A12)*(M$3*10^12-$A11)*-1<0,0,1)*IF(ABS(M$3*10^12-$A12)>(M$3*10^12-$A11),$A11,$A12)=M12,0,IF((M$3*10^12-$A12)*(M$3*10^12-$A11)*-1<0,0,1)*IF(ABS(M$3*10^12-$A12)>(M$3*10^12-$A11),$A11,$A12))","v":0},0,null,null,"Rfb2",{"$f":"Rfb2_","v":12121.21212121212},{"$f":"IF(R11=\"OPEN\",\"OPEN\",IF(R11>(INT(0.5+100*POWER(10,IF(96*(LOG(R11)-INT(LOG(R11)))-ROUND(96*(LOG(R11)-INT(LOG(R11))),0)<0,ROUND(96*(LOG(R11)-INT(LOG(R11))),0)-1,ROUND(96*(LOG(R11)-INT(LOG(R11))),0))/96))*POWER(10,INT(LOG(R11))-2)+INT(0.5+100*POWER(10,(IF(96*(LOG(R11)-INT(LOG(R11)))-ROUND(96*(LOG(R11)-INT(LOG(R11))),0)<0,ROUND(96*(LOG(R11)-INT(LOG(R11))),0)-1,ROUND(96*(LOG(R11)-INT(LOG(R11))),0))+1)/96))*POWER(10,INT(LOG(R11))-2))/2,INT(0.5+100*POWER(10,(IF(96*(LOG(R11)-INT(LOG(R11)))-ROUND(96*(LOG(R11)-INT(LOG(R11))),0)<0,ROUND(96*(LOG(R11)-INT(LOG(R11))),0)-1,ROUND(96*(LOG(R11)-INT(LOG(R11))),0))+1)/96))*POWER(10,INT(LOG(R11))-2),INT(0.5+100*POWER(10,IF(96*(LOG(R11)-INT(LOG(R11)))-ROUND(96*(LOG(R11)-INT(LOG(R11))),0)<0,ROUND(96*(LOG(R11)-INT(LOG(R11))),0)-1,ROUND(96*(LOG(R11)-INT(LOG(R11))),0))/96))*POWER(10,INT(LOG(R11))-2)))","v":12100},"Ω"]
[1.5,0,0,0,0,0,0,0,0,0,0,0,0,0,null,null,"Rt1",{"$f":"'Variable Management'!B27*1000","v":221144.44444444444},{"$f":"IF(R12>(INT(0.5+100*POWER(10,IF(96*(LOG(R12)-INT(LOG(R12)))-ROUND(96*(LOG(R12)-INT(LOG(R12))),0)<0,ROUND(96*(LOG(R12)-INT(LOG(R12))),0)-1,ROUND(96*(LOG(R12)-INT(LOG(R12))),0))/96))*POWER(10,INT(LOG(R12))-2)+INT(0.5+100*POWER(10,(IF(96*(LOG(R12)-INT(LOG(R12)))-ROUND(96*(LOG(R12)-INT(LOG(R12))),0)<0,ROUND(96*(LOG(R12)-INT(LOG(R12))),0)-1,ROUND(96*(LOG(R12)-INT(LOG(R12))),0))+1)/96))*POWER(10,INT(LOG(R12))-2))/2,INT(0.5+100*POWER(10,(IF(96*(LOG(R12)-INT(LOG(R12)))-ROUND(96*(LOG(R12)-INT(LOG(R12))),0)<0,ROUND(96*(LOG(R12)-INT(LOG(R12))),0)-1,ROUND(96*(LOG(R12)-INT(LOG(R12))),0))+1)/96))*POWER(10,INT(LOG(R12))-2),INT(0.5+100*POWER(10,IF(96*(LOG(R12)-INT(LOG(R12)))-ROUND(96*(LOG(R12)-INT(LOG(R12))),0)<0,ROUND(96*(LOG(R12)-INT(LOG(R12))),0)-1,ROUND(96*(LOG(R12)-INT(LOG(R12))),0))/96))*POWER(10,INT(LOG(R12))-2))","v":221000},"Ω"]
[1.8,0,0,0,0,0,0,0,0,0,0,0,0,0,null,null,"Rd",{"$f":"'Variable Management'!B28*1000","v":0},{"$f":"IF(R13=\"OPEN\",\"OPEN\",IF(R13>(INT(0.5+100*POWER(10,IF(96*(LOG(R13)-INT(LOG(R13)))-ROUND(96*(LOG(R13)-INT(LOG(R13))),0)<0,ROUND(96*(LOG(R13)-INT(LOG(R13))),0)-1,ROUND(96*(LOG(R13)-INT(LOG(R13))),0))/96))*POWER(10,INT(LOG(R13))-2)+INT(0.5+100*POWER(10,(IF(96*(LOG(R13)-INT(LOG(R13)))-ROUND(96*(LOG(R13)-INT(LOG(R13))),0)<0,ROUND(96*(LOG(R13)-INT(LOG(R13))),0)-1,ROUND(96*(LOG(R13)-INT(LOG(R13))),0))+1)/96))*POWER(10,INT(LOG(R13))-2))/2,INT(0.5+100*POWER(10,(IF(96*(LOG(R13)-INT(LOG(R13)))-ROUND(96*(LOG(R13)-INT(LOG(R13))),0)<0,ROUND(96*(LOG(R13)-INT(LOG(R13))),0)-1,ROUND(96*(LOG(R13)-INT(LOG(R13))),0))+1)/96))*POWER(10,INT(LOG(R13))-2),INT(0.5+100*POWER(10,IF(96*(LOG(R13)-INT(LOG(R13)))-ROUND(96*(LOG(R13)-INT(LOG(R13))),0)<0,ROUND(96*(LOG(R13)-INT(LOG(R13))),0)-1,ROUND(96*(LOG(R13)-INT(LOG(R13))),0))/96))*POWER(10,INT(LOG(R13))-2)))","v":{"$error":"#NUM!"}},"Ω"]
[2.2000000000000002,{"$f":"IF(IF((B$3*10^12-$A15)*(B$3*10^12-$A14)*-1<0,0,1)*IF(ABS(B$3*10^12-$A15)>(B$3*10^12-$A14),$A14,$A15)=B15,0,IF((B$3*10^12-$A15)*(B$3*10^12-$A14)*-1<0,0,1)*IF(ABS(B$3*10^12-$A15)>(B$3*10^12-$A14),$A14,$A15))","v":0},0,0,0,0,0,0,0,0,0,0,0,0,null,null,"Rd_AEF",{"$f":"'Variable Management'!B300","v":6.5192024052026495E-2},{"$f":"IF(R14=\"OPEN\",\"OPEN\",IF(R14>(INT(0.5+100*POWER(10,IF(96*(LOG(R14)-INT(LOG(R14)))-ROUND(96*(LOG(R14)-INT(LOG(R14))),0)<0,ROUND(96*(LOG(R14)-INT(LOG(R14))),0)-1,ROUND(96*(LOG(R14)-INT(LOG(R14))),0))/96))*POWER(10,INT(LOG(R14))-2)+INT(0.5+100*POWER(10,(IF(96*(LOG(R14)-INT(LOG(R14)))-ROUND(96*(LOG(R14)-INT(LOG(R14))),0)<0,ROUND(96*(LOG(R14)-INT(LOG(R14))),0)-1,ROUND(96*(LOG(R14)-INT(LOG(R14))),0))+1)/96))*POWER(10,INT(LOG(R14))-2))/2,INT(0.5+100*POWER(10,(IF(96*(LOG(R14)-INT(LOG(R14)))-ROUND(96*(LOG(R14)-INT(LOG(R14))),0)<0,ROUND(96*(LOG(R14)-INT(LOG(R14))),0)-1,ROUND(96*(LOG(R14)-INT(LOG(R14))),0))+1)/96))*POWER(10,INT(LOG(R14))-2),INT(0.5+100*POWER(10,IF(96*(LOG(R14)-INT(LOG(R14)))-ROUND(96*(LOG(R14)-INT(LOG(R14))),0)<0,ROUND(96*(LOG(R14)-INT(LOG(R14))),0)-1,ROUND(96*(LOG(R14)-INT(LOG(R14))),0))/96))*POWER(10,INT(LOG(R14))-2)))","v":6.4899999999999999E-2},"Ω"]
[2.7,0,0,0,0,0,0,0,0,0,{"$f":"IF(IF((K$3*10^12-$A16)*(K$3*10^12-$A15)*-1<0,0,1)*IF(ABS(K$3*10^12-$A16)>(K$3*10^12-$A15),$A15,$A16)=K16,0,IF((K$3*10^12-$A16)*(K$3*10^12-$A15)*-1<0,0,1)*IF(ABS(K$3*10^12-$A16)>(K$3*10^12-$A15),$A15,$A16))","v":0},0,0,0]
[3.3,0,0,0,0,0,0,0,0,0,0,0,0,0,null,null,"Rs",{"$f":"Rs_ideal*1000","v":2.7991092450658877},{"$f":"IF(R16=0,0,IF(R16>(INT(0.5+100*POWER(10,IF(96*(LOG(R16)-INT(LOG(R16)))-ROUND(96*(LOG(R16)-INT(LOG(R16))),0)<0,ROUND(96*(LOG(R16)-INT(LOG(R16))),0)-1,ROUND(96*(LOG(R16)-INT(LOG(R16))),0))/96))*POWER(10,INT(LOG(R16))-2)+INT(0.5+100*POWER(10,(IF(96*(LOG(R16)-INT(LOG(R16)))-ROUND(96*(LOG(R16)-INT(LOG(R16))),0)<0,ROUND(96*(LOG(R16)-INT(LOG(R16))),0)-1,ROUND(96*(LOG(R16)-INT(LOG(R16))),0))+1)/96))*POWER(10,INT(LOG(R16))-2))/2,INT(0.5+100*POWER(10,(IF(96*(LOG(R16)-INT(LOG(R16)))-ROUND(96*(LOG(R16)-INT(LOG(R16))),0)<0,ROUND(96*(LOG(R16)-INT(LOG(R16))),0)-1,ROUND(96*(LOG(R16)-INT(LOG(R16))),0))+1)/96))*POWER(10,INT(LOG(R16))-2),INT(0.5+100*POWER(10,IF(96*(LOG(R16)-INT(LOG(R16)))-ROUND(96*(LOG(R16)-INT(LOG(R16))),0)<0,ROUND(96*(LOG(R16)-INT(LOG(R16))),0)-1,ROUND(96*(LOG(R16)-INT(LOG(R16))),0))/96))*POWER(10,INT(LOG(R16))-2)))","v":2.8000000000000003},"mΩ"]
[3.9,0,0,0,0,0,0,0,0,0,0,0,0,0,null,null,"Cres",{"$f":"Cres","v":7.4999999999999997E-8},{"$f":"G4*1000000000000","v":82000},"pF"]
[4.7,0,0,0,0,0,0,0,0,0,0,0,0,0]
[5.6,0,0,0,0,0,0,0,0,0,0,0,0,0]
[6.8,0,0,0,0,0,0,0,0,0,0,0,0,0]
[8.1999999999999993,0,0,0,0,0,0,0,0,0,0,0,0,0,null,null,"Cdither",{"$f":"Cdither_init","v":2.0226537216828479E-9},{"$f":"H4","v":2.1999999999999998E-9}]
[10,0,0,0,0,0,0,0,0,0,{"$f":"IF(IF((K$3*10^12-$A23)*(K$3*10^12-$A22)*-1<0,0,1)*IF(ABS(K$3*10^12-$A23)>(K$3*10^12-$A22),$A22,$A23)=K23,0,IF((K$3*10^12-$A23)*(K$3*10^12-$A22)*-1<0,0,1)*IF(ABS(K$3*10^12-$A23)>(K$3*10^12-$A22),$A22,$A23))","v":0},0,0,0]
[12,0,0,0,0,0,0,0,0,0,0,0,0,0,null,null,"Cin_Passive",{"$f":"K4","v":3.3E-3},{"$f":"R23*1000000","v":3300},"uF"]
[15,0,0,0,0,0,0,0,0,0,0,0,0,0,null,null,"Cinj_AEF",{"$f":"Cinj_AEF","v":31.374376701032286},{"$f":"M4*1000000","v":33},"uF"]
[18,0,0,0,0,0,0,0,0,0,0,0,0,0,null,null,"Cdamp_AEF",{"$f":"'Variable Management'!B294","v":10.458125567010763},{"$f":"N4*1000000","v":10},"uF"]
[22,0,0,0,0,0,0,0,0,0,0,0,0,0,null,null,"Rdamp_AEF",{"$f":"'Variable Management'!B295","v":1.604698331160848},{"$f":"IF(R26=\"OPEN\",\"OPEN\",IF(R26>(INT(0.5+100*POWER(10,IF(96*(LOG(R26)-INT(LOG(R26)))-ROUND(96*(LOG(R26)-INT(LOG(R26))),0)<0,ROUND(96*(LOG(R26)-INT(LOG(R26))),0)-1,ROUND(96*(LOG(R26)-INT(LOG(R26))),0))/96))*POWER(10,INT(LOG(R26))-2)+INT(0.5+100*POWER(10,(IF(96*(LOG(R26)-INT(LOG(R26)))-ROUND(96*(LOG(R26)-INT(LOG(R26))),0)<0,ROUND(96*(LOG(R26)-INT(LOG(R26))),0)-1,ROUND(96*(LOG(R26)-INT(LOG(R26))),0))+1)/96))*POWER(10,INT(LOG(R26))-2))/2,INT(0.5+100*POWER(10,(IF(96*(LOG(R26)-INT(LOG(R26)))-ROUND(96*(LOG(R26)-INT(LOG(R26))),0)<0,ROUND(96*(LOG(R26)-INT(LOG(R26))),0)-1,ROUND(96*(LOG(R26)-INT(LOG(R26))),0))+1)/96))*POWER(10,INT(LOG(R26))-2),INT(0.5+100*POWER(10,IF(96*(LOG(R26)-INT(LOG(R26)))-ROUND(96*(LOG(R26)-INT(LOG(R26))),0)<0,ROUND(96*(LOG(R26)-INT(LOG(R26))),0)-1,ROUND(96*(LOG(R26)-INT(LOG(R26))),0))/96))*POWER(10,INT(LOG(R26))-2)))","v":1.62},"Ω"]
[27,0,0,0,0,0,0,0,0,0,0,0,{"$f":"IF(IF((M$3*10^12-$A28)*(M$3*10^12-$A27)*-1<0,0,1)*IF(ABS(M$3*10^12-$A28)>(M$3*10^12-$A27),$A27,$A28)=M28,0,IF((M$3*10^12-$A28)*(M$3*10^12-$A27)*-1<0,0,1)*IF(ABS(M$3*10^12-$A28)>(M$3*10^12-$A27),$A27,$A28))","v":0},0,null,null,"Rdamp_Passive",{"$f":"SQRT(L_infilterStd/K4)","v":1.4354811251305468E-2},{"$f":"IF(R27=\"OPEN\",\"OPEN\",IF(R27>(INT(0.5+100*POWER(10,IF(96*(LOG(R27)-INT(LOG(R27)))-ROUND(96*(LOG(R27)-INT(LOG(R27))),0)<0,ROUND(96*(LOG(R27)-INT(LOG(R27))),0)-1,ROUND(96*(LOG(R27)-INT(LOG(R27))),0))/96))*POWER(10,INT(LOG(R27))-2)+INT(0.5+100*POWER(10,(IF(96*(LOG(R27)-INT(LOG(R27)))-ROUND(96*(LOG(R27)-INT(LOG(R27))),0)<0,ROUND(96*(LOG(R27)-INT(LOG(R27))),0)-1,ROUND(96*(LOG(R27)-INT(LOG(R27))),0))+1)/96))*POWER(10,INT(LOG(R27))-2))/2,INT(0.5+100*POWER(10,(IF(96*(LOG(R27)-INT(LOG(R27)))-ROUND(96*(LOG(R27)-INT(LOG(R27))),0)<0,ROUND(96*(LOG(R27)-INT(LOG(R27))),0)-1,ROUND(96*(LOG(R27)-INT(LOG(R27))),0))+1)/96))*POWER(10,INT(LOG(R27))-2),INT(0.5+100*POWER(10,IF(96*(LOG(R27)-INT(LOG(R27)))-ROUND(96*(LOG(R27)-INT(LOG(R27))),0)<0,ROUND(96*(LOG(R27)-INT(LOG(R27))),0)-1,ROUND(96*(LOG(R27)-INT(LOG(R27))),0))/96))*POWER(10,INT(LOG(R27))-2)))","v":1.43E-2},"Ω"]
[33,0,0,0,0,0,0,0,0,0,0,0,0,0,null,null,"Cdamp_Passive",{"$f":"L4","v":1.2E-2},{"$f":"R28*1000000","v":12000},"uF"]
[39,0,0,0,0,0,0,0,0,0,0,0,0,0]
[47,0,0,0,0,0,0,0,0,0,0,0,0,0]
[56,0,0,0,0,0,0,0,0,0,0,0,0,0]
[68,0,0,0,0,0,0,0,0,0,0,0,0,0,null,null,"Rc1",{"$f":"S7/1000&\" kΩ\"","v":"8.66 kΩ"},{"$f":"S7/1000","v":8.66},"kΩ"]
[82,0,0,0,0,0,0,0,0,0,0,0,0,0,null,null,"Cc1",{"$f":"C4*1000000000&\" nF\"","v":"5.6 nF"},{"$f":"C4*1000000000","v":5.6},"nF"]
[{"$f":"A22*10","v":100},0,0,0,0,0,0,0,0,0,0,0,0,0,null,null,"Cc2",{"$f":"D4*1000000000000&\" pF\"","v":"330 pF"},{"$f":"D4*1000000000000","v":330},"pF"]
[{"$f":"A23*10","v":120},0,0,0,0,0,0,0,0,0,0,0,0,0]
[150,0,0,0,0,0,0,0,0,0,0,0,0,0,null,null,"Rc2",{"$f":"S8/1000&\" kΩ\"","v":{"$error":"#NUM!"}},{"$f":"S8/1000","v":{"$error":"#NUM!"}},"kΩ"]
[180,0,0,0,0,0,0,0,0,0,0,0,0,0,null,null,"Cc3",{"$f":"I4*1000000000&\" nF\"","v":"0 nF"},{"$f":"I4*1000000000","v":0},"nF"]
[220,0,0,0,0,0,0,0,0,0,0,0,0,0,null,null,"Cc4",{"$f":"J4*1000000000000&\" pF\"","v":"0 pF"},{"$f":"J4*1000000000000","v":0},"pF"]
[270,0,{"$f":"IF(IF((C$3*10^12-$A40)*(C$3*10^12-$A39)*-1<0,0,1)*IF(ABS(C$3*10^12-$A40)>(C$3*10^12-$A39),$A39,$A40)=C40,0,IF((C$3*10^12-$A40)*(C$3*10^12-$A39)*-1<0,0,1)*IF(ABS(C$3*10^12-$A40)>(C$3*10^12-$A39),$A39,$A40))","v":0},0,0,0,0,0,0,0,0,0,0,0]
[330,0,0,330,0,0,0,0,0,0,0,0,0,0,null,null,"Rent",{"$f":"'Variable Management'!B185/1000","v":99.999999999999986},{"$f":"IF(R40>(INT(0.5+100*POWER(10,IF(96*(LOG(R40)-INT(LOG(R40)))-ROUND(96*(LOG(R40)-INT(LOG(R40))),0)<0,ROUND(96*(LOG(R40)-INT(LOG(R40))),0)-1,ROUND(96*(LOG(R40)-INT(LOG(R40))),0))/96))*POWER(10,INT(LOG(R40))-2)+INT(0.5+100*POWER(10,(IF(96*(LOG(R40)-INT(LOG(R40)))-ROUND(96*(LOG(R40)-INT(LOG(R40))),0)<0,ROUND(96*(LOG(R40)-INT(LOG(R40))),0)-1,ROUND(96*(LOG(R40)-INT(LOG(R40))),0))+1)/96))*POWER(10,INT(LOG(R40))-2))/2,INT(0.5+100*POWER(10,(IF(96*(LOG(R40)-INT(LOG(R40)))-ROUND(96*(LOG(R40)-INT(LOG(R40))),0)<0,ROUND(96*(LOG(R40)-INT(LOG(R40))),0)-1,ROUND(96*(LOG(R40)-INT(LOG(R40))),0))+1)/96))*POWER(10,INT(LOG(R40))-2),INT(0.5+100*POWER(10,IF(96*(LOG(R40)-INT(LOG(R40)))-ROUND(96*(LOG(R40)-INT(LOG(R40))),0)<0,ROUND(96*(LOG(R40)-INT(LOG(R40))),0)-1,ROUND(96*(LOG(R40)-INT(LOG(R40))),0))/96))*POWER(10,INT(LOG(R40))-2))","v":100},"kΩ"]
[390,0,0,0,0,0,0,0,0,0,0,0,0,0,null,null,"Renb",{"$f":"'Variable Management'!B186/1000","v":22.222222222222218},{"$f":"IF(R41>(INT(0.5+100*POWER(10,IF(96*(LOG(R41)-INT(LOG(R41)))-ROUND(96*(LOG(R41)-INT(LOG(R41))),0)<0,ROUND(96*(LOG(R41)-INT(LOG(R41))),0)-1,ROUND(96*(LOG(R41)-INT(LOG(R41))),0))/96))*POWER(10,INT(LOG(R41))-2)+INT(0.5+100*POWER(10,(IF(96*(LOG(R41)-INT(LOG(R41)))-ROUND(96*(LOG(R41)-INT(LOG(R41))),0)<0,ROUND(96*(LOG(R41)-INT(LOG(R41))),0)-1,ROUND(96*(LOG(R41)-INT(LOG(R41))),0))+1)/96))*POWER(10,INT(LOG(R41))-2))/2,INT(0.5+100*POWER(10,(IF(96*(LOG(R41)-INT(LOG(R41)))-ROUND(96*(LOG(R41)-INT(LOG(R41))),0)<0,ROUND(96*(LOG(R41)-INT(LOG(R41))),0)-1,ROUND(96*(LOG(R41)-INT(LOG(R41))),0))+1)/96))*POWER(10,INT(LOG(R41))-2),INT(0.5+100*POWER(10,IF(96*(LOG(R41)-INT(LOG(R41)))-ROUND(96*(LOG(R41)-INT(LOG(R41))),0)<0,ROUND(96*(LOG(R41)-INT(LOG(R41))),0)-1,ROUND(96*(LOG(R41)-INT(LOG(R41))),0))/96))*POWER(10,INT(LOG(R41))-2))","v":22.1},"kΩ"]
[470,0,0,0,0,0,0,0,0,0,0,0,0,0]
[560,0,0,0,0,0,0,0,0,0,0,0,{"$f":"IF(IF((M$3*10^12-$A44)*(M$3*10^12-$A43)*-1<0,0,1)*IF(ABS(M$3*10^12-$A44)>(M$3*10^12-$A43),$A43,$A44)=M44,0,IF((M$3*10^12-$A44)*(M$3*10^12-$A43)*-1<0,0,1)*IF(ABS(M$3*10^12-$A44)>(M$3*10^12-$A43),$A43,$A44))","v":0},0]
[680,0,0,0,0,0,0,0,0,0,0,0,0,0]
[{"$f":"A33*10","v":820},0,0,0,0,0,0,0,0,0,0,0,0,0]
[1000,0,0,0,0,0,0,0,0,0,0,0,0,0]
[1200,0,0,0,0,0,0,0,0,0,0,0,0,0]
[1500,0,0,0,0,0,0,0,0,0,0,0,0,0]
[1800,0,0,0,0,0,0,2200,0,0,0,0,0,0]
[2200,0,0,0,0,0,0,0,0,0,0,0,0,0]
[2700,0,0,0,0,0,0,0,0,0,0,0,0,0]
[3300,0,0,0,0,0,0,0,0,0,0,0,0,0]
[3900,0,0,0,0,0,0,0,0,0,0,0,0,0]
[4700,0,5600,0,0,0,0,0,0,0,0,0,0,0]
[5600,0,0,0,0,0,0,0,0,0,0,0,0,0]
[6800,0,0,0,0,0,0,0,0,0,0,0,0,0]
[8200,0,0,0,0,0,0,0,0,0,0,0,0,0]
[10000,0,0,0,0,0,0,0,0,0,0,0,0,0]
[12000,0,0,0,0,0,0,0,0,0,0,0,{"$f":"IF(IF((M$3*10^12-$A60)*(M$3*10^12-$A59)*-1<0,0,1)*IF(ABS(M$3*10^12-$A60)>(M$3*10^12-$A59),$A59,$A60)=M60,0,IF((M$3*10^12-$A60)*(M$3*10^12-$A59)*-1<0,0,1)*IF(ABS(M$3*10^12-$A60)>(M$3*10^12-$A59),$A59,$A60))","v":0},0]
[15000,0,0,0,0,0,0,0,0,0,0,0,0,0]
[18000,0,0,0,0,0,0,0,0,0,0,0,0,0]
[22000,0,0,0,0,0,0,0,0,0,0,0,0,0]
[27000,0,0,0,0,0,0,0,0,0,0,0,0,0]
[33000,0,0,0,0,0,0,0,0,0,0,0,0,0]
[39000,0,0,0,0,0,0,0,0,0,0,0,0,0]
[47000,0,0,0,0,0,0,0,0,0,0,0,0,0]
[56000,0,0,0,0,0,0,0,0,0,0,0,0,0]
[68000,0,0,0,0,0,82000,0,0,0,0,0,0,0]
[82000,0,0,0,0,0,0,0,0,{"$f":"IF(IF((J$3*10^12-$A70)*(J$3*10^12-$A69)*-1<0,0,1)*IF(ABS(J$3*10^12-$A70)>(J$3*10^12-$A69),$A69,$A70)=J70,0,IF((J$3*10^12-$A70)*(J$3*10^12-$A69)*-1<0,0,1)*IF(ABS(J$3*10^12-$A70)>(J$3*10^12-$A69),$A69,$A70))","v":0},0,0,0,0]
[100000,0,0,{"$f":"IF(IF((D$3*10^12-$A71)*(D$3*10^12-$A70)*-1<0,0,1)*IF(ABS(D$3*10^12-$A71)>(D$3*10^12-$A70),$A70,$A71)=D71,0,IF((D$3*10^12-$A71)*(D$3*10^12-$A70)*-1<0,0,1)*IF(ABS(D$3*10^12-$A71)>(D$3*10^12-$A70),$A70,$A71))","v":0},0,0,0,0,0,0,0,0,0,0]
[120000,{"$f":"IF(IF((B$3*10^12-$A72)*(B$3*10^12-$A71)*-1<0,0,1)*IF(ABS(B$3*10^12-$A72)>(B$3*10^12-$A71),$A71,$A72)=B72,0,IF((B$3*10^12-$A72)*(B$3*10^12-$A71)*-1<0,0,1)*IF(ABS(B$3*10^12-$A72)>(B$3*10^12-$A71),$A71,$A72))","v":0},{"$f":"IF(IF((C$3*10^12-$A72)*(C$3*10^12-$A71)*-1<0,0,1)*IF(ABS(C$3*10^12-$A72)>(C$3*10^12-$A71),$A71,$A72)=C72,0,IF((C$3*10^12-$A72)*(C$3*10^12-$A71)*-1<0,0,1)*IF(ABS(C$3*10^12-$A72)>(C$3*10^12-$A71),$A71,$A72))","v":0},0,0,{"$f":"IF(IF((F$3*10^12-$A72)*(F$3*10^12-$A71)*-1<0,0,1)*IF(ABS(F$3*10^12-$A72)>(F$3*10^12-$A71),$A71,$A72)=F72,0,IF((F$3*10^12-$A72)*(F$3*10^12-$A71)*-1<0,0,1)*IF(ABS(F$3*10^12-$A72)>(F$3*10^12-$A71),$A71,$A72))","v":0},{"$f":"IF(IF((G$3*10^12-$A72)*(G$3*10^12-$A71)*-1<0,0,1)*IF(ABS(G$3*10^12-$A72)>(G$3*10^12-$A71),$A71,$A72)=G72,0,IF((G$3*10^12-$A72)*(G$3*10^12-$A71)*-1<0,0,1)*IF(ABS(G$3*10^12-$A72)>(G$3*10^12-$A71),$A71,$A72))","v":0},{"$f":"IF(IF((H$3*10^12-$A72)*(H$3*10^12-$A71)*-1<0,0,1)*IF(ABS(H$3*10^12-$A72)>(H$3*10^12-$A71),$A71,$A72)=H72,0,IF((H$3*10^12-$A72)*(H$3*10^12-$A71)*-1<0,0,1)*IF(ABS(H$3*10^12-$A72)>(H$3*10^12-$A71),$A71,$A72))","v":0},{"$f":"IF(IF((I$3*10^12-$A72)*(I$3*10^12-$A71)*-1<0,0,1)*IF(ABS(I$3*10^12-$A72)>(I$3*10^12-$A71),$A71,$A72)=I72,0,IF((I$3*10^12-$A72)*(I$3*10^12-$A71)*-1<0,0,1)*IF(ABS(I$3*10^12-$A72)>(I$3*10^12-$A71),$A71,$A72))","v":0},0,0,0,0,0]
[150000,0,0,0,0,0,0,0,0,0,0,0,0,0]
[180000,0,0,0,0,0,0,0,0,0,0,0,0,0]
[220000,0,0,0,0,0,0,0,0,0,0,0,0,0]
[270000,0,0,0,0,0,0,0,0,0,0,0,0,0]
[330000,0,0,0,0,0,0,0,0,0,0,0,0,0]
[390000,0,0,0,0,0,0,0,0,0,0,0,0,0]
[470000,0,0,0,0,0,0,0,0,0,0,0,0,0]
[560000,0,0,0,0,0,0,0,0,0,0,0,0,0]
[680000,0,0,0,0,0,0,0,0,0,0,0,0,0]
[820000,0,0,0,0,0,0,0,0,0,0,0,0,0]
[1000000,0,0,0,0,0,0,0,0,0,0,0,0,0]
[1200000,0,0,0,0,0,0,0,0,0,0,0,0,0]
[1500000,0,0,0,0,0,0,0,0,0,0,0,0,0]
[1800000,0,0,0,0,0,0,0,0,0,0,{"$f":"IF(IF((L$3*10^12-$A86)*(L$3*10^12-$A85)*-1<0,0,1)*IF(ABS(L$3*10^12-$A86)>(L$3*10^12-$A85),$A85,$A86)=L86,0,IF((L$3*10^12-$A86)*(L$3*10^12-$A85)*-1<0,0,1)*IF(ABS(L$3*10^12-$A86)>(L$3*10^12-$A85),$A85,$A86))","v":0},0,0]
[2200000,0,0,0,0,0,0,0,0,0,0,0,0,0]
[2700000,0,0,0,0,0,0,0,0,0,0,0,0,0]
[3300000,0,0,0,0,0,0,0,0,0,0,0,0,0]
[3900000,0,0,0,0,0,0,0,0,0,0,0,0,0]
[4700000,0,0,0,0,0,0,0,0,0,0,0,0,0]
[5600000,0,0,0,0,0,0,0,0,0,0,0,0,0]
[6800000,0,0,0,0,0,0,0,0,0,0,0,0,0]
[8200000,0,0,0,0,0,0,0,0,0,0,0,0,0]
[10000000,0,0,0,0,0,0,0,0,0,0,0,0,10000000]
[12000000,0,0,0,0,0,0,0,0,0,0,0,0,0]
[15000000,0,0,0,0,0,0,0,0,0,0,0,0,0]
[18000000,0,0,0,0,0,0,0,0,0,0,0,0,0]
[22000000,0,0,0,0,0,0,0,0,0,0,0,0,0]
[{"$f":"A87*10","v":27000000},0,0,0,0,0,0,0,0,0,0,0,33000000,0]
[33000000,0,0,0,0,0,0,0,0,0,0,0,0,0]
[39000000,0,0,0,0,0,0,0,0,0,0,0,0,0]
[47000000,0,0,0,0,0,0,0,0,0,0,0,0,0]
[56000000,0,0,0,0,{"$f":"IF(IF((F$3*10^12-$A104)*(F$3*10^12-$A103)*-1<0,0,1)*IF(ABS(F$3*10^12-$A104)>(F$3*10^12-$A103),$A103,$A104)=F104,0,IF((F$3*10^12-$A104)*(F$3*10^12-$A103)*-1<0,0,1)*IF(ABS(F$3*10^12-$A104)>(F$3*10^12-$A103),$A103,$A104))","v":0},{"$f":"IF(IF((G$3*10^12-$A104)*(G$3*10^12-$A103)*-1<0,0,1)*IF(ABS(G$3*10^12-$A104)>(G$3*10^12-$A103),$A103,$A104)=G104,0,IF((G$3*10^12-$A104)*(G$3*10^12-$A103)*-1<0,0,1)*IF(ABS(G$3*10^12-$A104)>(G$3*10^12-$A103),$A103,$A104))","v":0},{"$f":"IF(IF((H$3*10^12-$A104)*(H$3*10^12-$A103)*-1<0,0,1)*IF(ABS(H$3*10^12-$A104)>(H$3*10^12-$A103),$A103,$A104)=H104,0,IF((H$3*10^12-$A104)*(H$3*10^12-$A103)*-1<0,0,1)*IF(ABS(H$3*10^12-$A104)>(H$3*10^12-$A103),$A103,$A104))","v":0},{"$f":"IF(IF((I$3*10^12-$A104)*(I$3*10^12-$A103)*-1<0,0,1)*IF(ABS(I$3*10^12-$A104)>(I$3*10^12-$A103),$A103,$A104)=I104,0,IF((I$3*10^12-$A104)*(I$3*10^12-$A103)*-1<0,0,1)*IF(ABS(I$3*10^12-$A104)>(I$3*10^12-$A103),$A103,$A104))","v":0},0,0,0,0,0]
[68000000,0,0,0,0,0,0,0,0,0,0,0,0,0]
[82000000,0,0,0,0,0,0,0,0,0,0,0,0,0]
[100000000,0,0,0,0,0,0,0,0,0,0,0,0,0]
[120000000,0,0,0,0,0,0,0,0,0,0,0,0,0]
[150000000,0,0,0,150000000,150000000,0,0,0,0,0,0,0,0]
[180000000,0,0,0,0,0,0,0,0,0,0,0,0,0]
[220000000,0,0,0,0,0,0,0,0,0,0,0,0,0]
[270000000,0,0,0,0,0,0,0,0,0,0,0,0,0]
[330000000,0,0,0,0,0,0,0,0,0,0,0,0,0]
[390000000,0,0,0,0,0,0,0,0,0,0,0,0,0]
[470000000,0,0,0,0,0,0,0,0,0,0,0,0,0]
[560000000,0,0,0,0,0,0,0,0,0,0,0,0,0]
[680000000,0,0,0,0,0,0,0,0,0,0,0,0,0]
[820000000,0,0,0,0,0,0,0,0,0,0,0,0,0]
[1000000000,0,0,0,0,0,0,0,0,0,0,0,0,0]
[1200000000,0,0,0,0,0,0,0,0,0,0,0,0,0]
[1500000000,0,0,0,0,0,0,0,0,0,0,0,0,0]
[1800000000,0,0,0,0,0,0,0,0,0,0,0,0,0]
[2200000000,0,0,0,0,0,0,0,0,0,0,0,0,0]
[2700000000,0,0,0,0,0,0,0,0,0,3300000000,0,0,0]
[3300000000,0,0,0,0,0,0,0,0,0,0,0,0,0]
[3900000000,0,0,0,0,0,0,0,0,0,0,0,0,0]
[4700000000,0,0,0,0,0,0,0,0,0,0,0,0,0]
[5600000000,0,0,0,0,0,0,0,0,0,0,0,0,0]
[6800000000,0,0,0,0,0,0,0,0,0,0,0,0,0]
[8200000000,0,0,0,0,0,0,0,0,0,0,0,0,0]
[10000000000,0,0,0,0,0,0,0,0,0,0,0,0,0]
[12000000000,0,0,0,0,0,0,0,0,0,0,12000000000,0,0]
[15000000000,0,0,0,0,0,0,0,0,0,{"$f":"IF(IF((K$3*10^12-$A133)*(K$3*10^12-$A132)*-1<0,0,1)*IF(ABS(K$3*10^12-$A133)>(K$3*10^12-$A132),$A132,$A133)=K133,0,IF((K$3*10^12-$A133)*(K$3*10^12-$A132)*-1<0,0,1)*IF(ABS(K$3*10^12-$A133)>(K$3*10^12-$A132),$A132,$A133))","v":0},{"$f":"IF(IF((L$3*10^12-$A133)*(L$3*10^12-$A132)*-1<0,0,1)*IF(ABS(L$3*10^12-$A133)>(L$3*10^12-$A132),$A132,$A133)=L133,0,IF((L$3*10^12-$A133)*(L$3*10^12-$A132)*-1<0,0,1)*IF(ABS(L$3*10^12-$A133)>(L$3*10^12-$A132),$A132,$A133))","v":0},0,0]
[18000000000,0,0,0,0,0,0,0,0,{"$f":"IF(IF((J$3*10^12-$A134)*(J$3*10^12-$A133)*-1<0,0,1)*IF(ABS(J$3*10^12-$A134)>(J$3*10^12-$A133),$A133,$A134)=J134,0,IF((J$3*10^12-$A134)*(J$3*10^12-$A133)*-1<0,0,1)*IF(ABS(J$3*10^12-$A134)>(J$3*10^12-$A133),$A133,$A134))","v":0},0,0,{"$f":"IF(IF((M$3*10^12-$A134)*(M$3*10^12-$A133)*-1<0,0,1)*IF(ABS(M$3*10^12-$A134)>(M$3*10^12-$A133),$A133,$A134)=M134,0,IF((M$3*10^12-$A134)*(M$3*10^12-$A133)*-1<0,0,1)*IF(ABS(M$3*10^12-$A134)>(M$3*10^12-$A133),$A133,$A134))","v":0},{"$f":"IF(IF((N$3*10^12-$A134)*(N$3*10^12-$A133)*-1<0,0,1)*IF(ABS(N$3*10^12-$A134)>(N$3*10^12-$A133),$A133,$A134)=N134,0,IF((N$3*10^12-$A134)*(N$3*10^12-$A133)*-1<0,0,1)*IF(ABS(N$3*10^12-$A134)>(N$3*10^12-$A133),$A133,$A134))","v":0}]
[22000000000,0,0,0,{"$f":"IF(IF((E$3*10^12-$A135)*(E$3*10^12-$A134)*-1<0,0,1)*IF(ABS(E$3*10^12-$A135)>(E$3*10^12-$A134),$A134,$A135)=E135,0,IF((E$3*10^12-$A135)*(E$3*10^12-$A134)*-1<0,0,1)*IF(ABS(E$3*10^12-$A135)>(E$3*10^12-$A134),$A134,$A135))","v":0},0,0,0,0,0,0,0,{"$f":"IF(IF((M$3*10^12-$A135)*(M$3*10^12-$A134)*-1<0,0,1)*IF(ABS(M$3*10^12-$A135)>(M$3*10^12-$A134),$A134,$A135)=M135,0,IF((M$3*10^12-$A135)*(M$3*10^12-$A134)*-1<0,0,1)*IF(ABS(M$3*10^12-$A135)>(M$3*10^12-$A134),$A134,$A135))","v":0},{"$f":"IF(IF((N$3*10^12-$A135)*(N$3*10^12-$A134)*-1<0,0,1)*IF(ABS(N$3*10^12-$A135)>(N$3*10^12-$A134),$A134,$A135)=N135,0,IF((N$3*10^12-$A135)*(N$3*10^12-$A134)*-1<0,0,1)*IF(ABS(N$3*10^12-$A135)>(N$3*10^12-$A134),$A134,$A135))","v":0}]
[27000000000,{"$f":"IF(IF((B$3*10^12-$A136)*(B$3*10^12-$A135)*-1<0,0,1)*IF(ABS(B$3*10^12-$A136)>(B$3*10^12-$A135),$A135,$A136)=B136,0,IF((B$3*10^12-$A136)*(B$3*10^12-$A135)*-1<0,0,1)*IF(ABS(B$3*10^12-$A136)>(B$3*10^12-$A135),$A135,$A136))","v":0},{"$f":"IF(IF((C$3*10^12-$A136)*(C$3*10^12-$A135)*-1<0,0,1)*IF(ABS(C$3*10^12-$A136)>(C$3*10^12-$A135),$A135,$A136)=C136,0,IF((C$3*10^12-$A136)*(C$3*10^12-$A135)*-1<0,0,1)*IF(ABS(C$3*10^12-$A136)>(C$3*10^12-$A135),$A135,$A136))","v":0},0,0,0,0,0,0,0,0,0,0,0]
[33000000000,0,0,0,0,0,0,0,0,0,0,0,0,0]
[39000000000,0,0,0,0,0,0,0,0,0,0,0,0,0]
[47000000000,0,0,0,0,0,0,0,0,0,0,0,0,0]
[56000000000,0,0,0,0,0,0,0,0,0,0,0,0,0]
[68000000000,0,0,0,0,0,0,0,0,0,0,0,0,0]
[82000000000,0,0,0,0,0,0,0,0,0,0,0,0,0]
[100000000000,0,0,0,0,0,0,0,0,0,0,0,0,0]
[120000000000,0,0,0,0,0,0,0,0,0,0,0,0,0]
[150000000000,0,0,0,0,0,0,0,0,0,0,0,0,0]
[180000000000,0,0,0,0,0,0,0,0,0,0,0,0,0]
[220000000000,0,0,0,0,0,0,0,0,0,0,0,0,0]
[270000000000,0,0,0,0,0,0,0,0,0,0,0,0,0]
[330000000000,0,0,0,0,0,0,0,0,0,0,0,0,0]
[390000000000,0,0,0,0,0,0,0,0,0,0,0,0,0]
[470000000000,0,0,0,0,0,0,0,0,0,0,0,0,0]
[560000000000,0,0,0,0,0,0,0,0,0,0,0,0,0]
[680000000000,0,0,0,0,0,0,0,0,0,0,0,0,0]
[820000000000,0,0,0,0,0,0,0,0,0,0,0,0,0]
[1000000000000,0,0,0,0,0,0,0,0,0,0,0,0,0]
[1200000000000,0,0,0,0,0,0,0,0,0,0,0,0,0]
[1500000000000,0,0,0,0,0,0,0,0,0,0,0,0,0]
[1800000000000,0,0,0,0,0,0,0,0,0,0,0,0,0]
[2200000000000,0,0,0,0,0,0,0,0,0,0,0,0,0]
[2700000000000,2700000000000,2700000000000,2700000000000,2700000000000,2700000000000,2700000000000,2700000000000,2700000000000,2700000000000,2700000000000,2700000000000,2700000000000,2700000000000]

{"sheet":"Snubber","index":13,"n_rows":6,"n_cols":5,"rows_kept":6,"cut":false,"hidden":true,"merged":[]}
[null,null,"UNITS","STD UNITS"]
["Frequency of Ringing",85,"MHz",{"$f":"B2*1000000","v":85000000},"Hz"]
["SW capacitance",3000,"pF",{"$f":"B3*0.000000000001","v":3E-9},"F"]
["Lpar",{"$f":"1000000000*1/((D2*2*3.14159)^2*D3)","v":1.1686430773614742},"nH",{"$f":"B4/1000000000","v":1.1686430773614743E-9},"H"]
["Csnub",{"$f":"4*B3","v":12000},"pF",{"$f":"B5*0.000000000001","v":1.2E-8},"F"]
["Rsnub",{"$f":"SQRT(D4/D3)","v":0.62413755891936573},"Ω",{"$f":"B6","v":0.62413755891936573},"Ω"]

{"sheet":"Parallel Output Caps","index":14,"n_rows":17,"n_cols":5,"rows_kept":17,"cut":false,"hidden":true,"merged":[]}
[]
[]
[]
["Fsw",{"$f":"Fsw","v":100000}]
[]
["C1",20,"uF",{"$f":"B6/1000000","v":2.0000000000000002E-5},"F"]
["R1",0.5,"mOhms",{"$f":"B7/1000","v":5.0000000000000001E-4},"Ohms"]
[]
["C2",68,"uF",{"$f":"B9/1000000","v":6.7999999999999999E-5},"F"]
["R2",20,"mOhms",{"$f":"B10/1000","v":0.02},"Ohms"]
[]
[]
["I1 ",{"$f":"(D6/(D6+D9))*SQRT((D10*D9*B4)^2+1)/SQRT((((D7+D10)*D6*D9/(D9+D6))*B4)^2+1)","v":0.2292498909893611},"%"]
["I2 ",{"$f":"1-B13","v":0.7707501090106389},"%"]
[]
["I1 ",{"$f":"B13*(Iripple1/(2*SQRT(3)))","v":{"$error":"#NAME?"}},"A"]
["I2 ",{"$f":"B14*(Iripple1/(2*SQRT(3)))","v":{"$error":"#NAME?"}},"A"]