{"text_format":"1","workbook":"xlsx","n_sheets":9,"sheets":["Instructions","Design Calculator","Device Parameters","Equations","MOSFET Database 24V","MOSFET Database 48V","Start_up","SOA","dv_dt_recommendations"],"not_rendered":{"charts":5,"images":14,"macros":1,"external_links":2,"defined_names":102,"comments":2,"pivot_tables":0},"unopened":[],"bounds":{"document_bytes":16777216,"sheet_cells":100000,"rows_first":2000,"rows_last":500,"rows_between":2000,"halvings":0,"cell_chars":16384,"cell_head_chars":4096},"cells_cut":0,"cells_raw":0,"read":"whole","date_system":"1900"}

{"sheet":"Instructions","index":0,"n_rows":57,"n_cols":13,"rows_kept":57,"cut":false,"hidden":false,"merged":[[56,1,118,12],[12,5,12,10]]}
[]
[]
[]
[]
[]
[]
[null,null,null,null,null,null,null,null,null,null,null,null,"© 2014"]
[null,"LM5069 Design Tool with FET Recommendation - Rev. A"]
[]
[null,"Typical design procedure"]
[]
[null,"Before proceeding, please go through the application note ",null,null,null,null,null,null,"Robust Hot Swap Design"]
[null,"and the design example in the ",null,null,null,"LM5069 Datasheet (See \"Design-In Procedure\")"]
[]
[]
{"$rows_left_out":43}
{"sheet":"Design Calculator","index":1,"n_rows":146,"n_cols":60,"rows_kept":146,"cut":false,"hidden":false,"merged":[[119,2,121,6],[9,3,9,5],[10,3,10,5],[68,10,69,39],[143,2,144,5],[127,9,127,10],[11,3,12,5],[23,7,25,8],[29,7,30,8],[27,7,28,8],[88,1,94,1],[43,10,44,39],[62,1,67,1],[1,11,1,12],[0,0,0,12],[15,3,16,5],[53,1,56,1]]}
["                         LM5069 Hot Swap Design Tool with FET Recommendation"]
[null,"www.ti.com/hotswap"]
[]
[]
[]
[]
[]
[]
[]
[null,null,null,"Enter Values in Green Shaded Cells"]
[null,null,null,"Calculated Values are shown in White Cells"]
[null,null,null,"Yellow and Red cells highlight potential issues with the design. Red highlights items that are higher risk. "]
[null,null,null,null,null,null,null,null,null,null,null,null,null,null,null,null,null,null,null,null,null,null,null,null,null,null,null,null,null,null,null,null,null,null,null,null,null,null,null,null,null,null,null,null,null,"Yes"]
[]
[null,null,null,"LM5069 Datasheet"]
{"$rows_left_out":132}
{"sheet":"Device Parameters","index":2,"n_rows":52,"n_cols":17,"rows_kept":52,"cut":false,"hidden":true,"merged":[[31,2,31,4],[31,5,31,7]]}
[]
[null,null,"Min","Typ","Max","Units"]
["Operating Conditions"]
[null,"Junction Temperature",-40,null,125]
[null,"Input Voltage",9,null,80,"V"]
["Current Limit"]
[]
[null,null,48.5,55,61.5]
[null,"Sense input Current",null,23,null,"uA"]
[]
["Power Limit"]
[null,"Systematic Offset",null,null,1E-3,"V"]
[null,"Minimum Recommended Vsns",null,null,5.0000000000000001E-3,"V","<= I am assuming this would have +/- 50% error at best"]
[null,"A_coeff",null,null,125000]
[]
{"$rows_left_out":38}
{"sheet":"Equations","index":3,"n_rows":286,"n_cols":25,"rows_kept":286,"cut":false,"hidden":true,"merged":[[53,3,53,6],[62,3,62,6],[77,3,77,7]]}
[]
[]
[]
[]
[]
[]
[]
[]
[]
[]
[]
[]
["Current Limit"]
[]
[null,null,null,"CLMIN =",{"$f":"IF('Design Calculator'!$F$32=\"26 mV\",'Device Parameters'!C7,'Device Parameters'!C8)","v":48.5},"mV"]
{"$rows_left_out":272}
{"sheet":"MOSFET Database 24V","index":4,"n_rows":84,"n_cols":76,"rows_kept":84,"cut":false,"hidden":true,"merged":[]}
[]
[]
[]
[null,{"$f":"'Design Calculator'!H54","v":"NON-TI MOSFET"},1,null,null,"CSD18536KTT",2,null,null,"CSD18535KTT",3,null,null,"CSD18540Q5B",4,null,null,"CSD19506KTT",5,null,null,"CSD19505KTT",6,null,null,"CSD18532Q5B",7,null,null,"CSD18532NQ5B",8,null,null,"CSD18542KTT",9,null,null,"CSD19502Q5B",10,null,null,"CSD18532KCS",11,null,null,"CSD18531Q5A",12,null,null,"CSD18533Q5A",13,null,null,"CSD19501KCS",14,null,null,"CSD18563Q5A",15,null,null,"CSD19503KCS",16,null,null,"CSD18534Q5A",17,null,null,"CSD18543Q3A",18,null,null,"CSD18537NQ5A",19]
[null,"Webpage","Enter webpage link",null,null,"Webpage","https://www.ti.com/product/CSD18536KTT",null,null,"Webpage","https://www.ti.com/product/CSD18535KTT",null,null,"Webpage","https://www.ti.com/product/CSD18540Q5B",null,null,"Webpage","https://www.ti.com/product/CSD19506KTT",null,null,"Webpage","https://www.ti.com/product/CSD19505KTT",null,null,"Webpage","https://www.ti.com/product/CSD18532Q5B",null,null,"Webpage","https://www.ti.com/product/CSD18532NQ5B",null,null,"Webpage","https://www.ti.com/product/CSD18542KTT",null,null,"Webpage","https://www.ti.com/product/CSD19502Q5B",null,null,"Webpage","https://www.ti.com/product/CSD18532KCS",null,null,"Webpage","https://www.ti.com/product/CSD18531Q5A",null,null,"Webpage","https://www.ti.com/product/CSD18533Q5A",null,null,"Webpage","https://www.ti.com/product/CSD19501KCS",null,null,"Webpage","https://www.ti.com/product/CSD18563Q5A",null,null,"Webpage","https://www.ti.com/product/CSD19503KCS",null,null,"Webpage","https://www.ti.com/product/CSD18534Q5A",null,null,"Webpage","https://www.ti.com/product/CSD18543Q3A",null,null,"Webpage","https://www.ti.com/product/CSD18537NQ5A"]
[null,"Maximum Junction Temperature",{"$f":"'Design Calculator'!H56","v":175},"°C",null,"Maximum Junction Temperature",175,"°C",null,"Maximum Junction Temperature",175,"°C",null,"Maximum Junction Temperature",175,"°C",null,"Maximum Junction Temperature",175,"°C",null,"Maximum Junction Temperature",175,"°C",null,"Maximum Junction Temperature",150,"°C",null,"Maximum Junction Temperature",150,"°C",null,"Maximum Junction Temperature",175,"°C",null,"Maximum Junction Temperature",150,"°C",null,"Maximum Junction Temperature",175,"°C",null,"Maximum Junction Temperature",150,"°C",null,"Maximum Junction Temperature",150,"°C",null,"Maximum Junction Temperature",175,"°C",null,"Maximum Junction Temperature",150,"°C",null,"Maximum Junction Temperature",175,"°C",null,"Maximum Junction Temperature",150,"°C",null,"Maximum Junction Temperature",150,"°C",null,"Maximum Junction Temperature",150,"°C"]
[null,"Maximum Rds(on)",{"$f":"'Design Calculator'!H55","v":2},"mΩ",null,"Maximum Rds(on)",1.6,"mΩ",null,"Maximum Rds(on)",2,"mΩ",null,"Maximum Rds(on)",2.2000000000000002,"mΩ",null,"Maximum Rds(on)",2.2999999999999998,"mΩ",null,"Maximum Rds(on)",3.1,"mΩ",null,"Maximum Rds(on)",3.2,"mΩ",null,"Maximum Rds(on)",3.4,"mΩ",null,"Maximum Rds(on)",4,"mΩ",null,"Maximum Rds(on)",4.0999999999999996,"mΩ",null,"Maximum Rds(on)",4.2,"mΩ",null,"Maximum Rds(on)",4.5999999999999996,"mΩ",null,"Maximum Rds(on)",5.9,"mΩ",null,"Maximum Rds(on)",6.6,"mΩ",null,"Maximum Rds(on)",6.8,"mΩ",null,"Maximum Rds(on)",9.1999999999999993,"mΩ",null,"Maximum Rds(on)",9.8000000000000007,"mΩ",null,"Maximum Rds(on)",9.9,"mΩ",null,"Maximum Rds(on)",13,"mΩ"]
[]
[null,"Rds(on) vs Temperature",null,null,null,"Rds(on) vs Temperature",null,null,null,"Rds(on) vs Temperature",null,null,null,"Rds(on) vs Temperature",null,null,null,"Rds(on) vs Temperature",null,null,null,"Rds(on) vs Temperature",null,null,null,"Rds(on) vs Temperature",null,null,null,"Rds(on) vs Temperature",null,null,null,"Rds(on) vs Temperature",null,null,null,"Rds(on) vs Temperature",null,null,null,"Rds(on) vs Temperature",null,null,null,"Rds(on) vs Temperature",null,null,null,"Rds(on) vs Temperature",null,null,null,"Rds(on) vs Temperature",null,null,null,"Rds(on) vs Temperature",null,null,null,"Rds(on) vs Temperature",null,null,null,"Rds(on) vs Temperature",null,null,null,"Rds(on) vs Temperature",null,null,null,"Rds(on) vs Temperature"]
[]
[null,70,null,null,null,70,1.23,null,null,70,1.23,null,null,70,1.24,null,null,70,1.26,null,null,70,1.26,null,null,70,1.33,null,null,70,1.31,null,null,70,1.26,null,null,70,1.28,null,null,70,1.27,null,null,70,1.3,null,null,70,1.29,null,null,70,1.27,null,null,70,1.31,null,null,70,1.32,null,null,70,1.29,null,null,70,1.27,null,null,70,1.33]
[null,75,null,null,null,75,1.26,null,null,75,1.26,null,null,75,1.26,null,null,75,1.29,null,null,75,1.29,null,null,75,1.37,null,null,75,1.35,null,null,75,1.3,null,null,75,1.31,null,null,75,1.3,null,null,75,1.33,null,null,75,1.33,null,null,75,1.3,null,null,75,1.35,null,null,75,1.36,null,null,75,1.32,null,null,75,1.3,null,null,75,1.37]
[null,80,null,null,null,80,1.28,null,null,80,1.29,null,null,80,1.29,null,null,80,1.32,null,null,80,1.32,null,null,80,1.41,null,null,80,1.39,null,null,80,1.33,null,null,80,1.35,null,null,80,1.34,null,null,80,1.36,null,null,80,1.36,null,null,80,1.33,null,null,80,1.39,null,null,80,1.41,null,null,80,1.36,null,null,80,1.33,null,null,80,1.41]
[null,85,null,null,null,85,1.31,null,null,85,1.31,null,null,85,1.32,null,null,85,1.35,null,null,85,1.36,null,null,85,1.46,null,null,85,1.43,null,null,85,1.36,null,null,85,1.38,null,null,85,1.37,null,null,85,1.4,null,null,85,1.4,null,null,85,1.37,null,null,85,1.43,null,null,85,1.45,null,null,85,1.39,null,null,85,1.36,null,null,85,1.45]
[null,90,null,null,null,90,1.34,null,null,90,1.34,null,null,90,1.35,null,null,90,1.38,null,null,90,1.39,null,null,90,1.5,null,null,90,1.47,null,null,90,1.4,null,null,90,1.41,null,null,90,1.4,null,null,90,1.43,null,null,90,1.43,null,null,90,1.4,null,null,90,1.47,null,null,90,1.49,null,null,90,1.43,null,null,90,1.4,null,null,90,1.49]
{"$rows_left_out":70}
{"sheet":"MOSFET Database 48V","index":5,"n_rows":84,"n_cols":40,"rows_kept":84,"cut":false,"hidden":true,"merged":[]}
[]
[]
[]
[null,"CSD19536KTT",1,null,null,"CSD19535KTT",2,null,null,"CSD19532Q5B",3,null,null,"CSD19532KTT",4,null,null,"CSD19531Q5A",5,null,null,"CSD19533Q5A",6,null,null,"CSD19537Q3",7,null,null,"CSD19534Q5A",8,null,null,"CSD19538Q2",9,null,null,"CSD19538Q3A",10]
[null,"Webpage","https://www.ti.com/product/CSD19536KTT",null,null,"Webpage","https://www.ti.com/product/CSD19535KTT",null,null,"Webpage","https://www.ti.com/product/CSD19532Q5B",null,null,"Webpage","https://www.ti.com/product/CSD19532KTT",null,null,"Webpage","https://www.ti.com/product/CSD19531Q5A",null,null,"Webpage","https://www.ti.com/product/CSD19533Q5A",null,null,"Webpage","https://www.ti.com/product/CSD19537Q3",null,null,"Webpage","https://www.ti.com/product/CSD19534Q5A",null,null,"Webpage","https://www.ti.com/product/CSD19538Q2",null,null,"Webpage","https://www.ti.com/product/CSD19538Q3A"]
[null,"Maximum Junction Temperature",175,"°C",null,"Maximum Junction Temperature",175,"°C",null,"Maximum Junction Temperature",150,"°C",null,"Maximum Junction Temperature",175,"°C",null,"Maximum Junction Temperature",150,"°C",null,"Maximum Junction Temperature",150,"°C",null,"Maximum Junction Temperature",150,"°C",null,"Maximum Junction Temperature",150,"°C",null,"Maximum Junction Temperature",150,"°C",null,"Maximum Junction Temperature",150,"°C"]
[null,"Maximum Rds(on)",2.4,"mΩ",null,"Maximum Rds(on)",3.4,"mΩ",null,"Maximum Rds(on)",4.9000000000000004,"mΩ",null,"Maximum Rds(on)",5.6,"mΩ",null,"Maximum Rds(on)",6.4,"mΩ",null,"Maximum Rds(on)",9.4,"mΩ",null,"Maximum Rds(on)",14.5,"mΩ",null,"Maximum Rds(on)",15.1,"mΩ",null,"Maximum Rds(on)",59,"mΩ",null,"Maximum Rds(on)",59,"mΩ"]
[]
[null,"Rds(on) vs Temperature",null,null,null,"Rds(on) vs Temperature",null,null,null,"Rds(on) vs Temperature",null,null,null,"Rds(on) vs Temperature",null,null,null,"Rds(on) vs Temperature",null,null,null,"Rds(on) vs Temperature",null,null,null,"Rds(on) vs Temperature",null,null,null,"Rds(on) vs Temperature",null,null,null,"Rds(on) vs Temperature",null,null,null,"Rds(on) vs Temperature"]
[]
[null,70,1.25,null,null,70,1.33,null,null,70,1.33,null,null,70,1.33,null,null,70,1.31,null,null,70,1.34,null,null,70,1.34,null,null,70,1.3,null,null,70,1.32,null,null,70,1.28]
[null,75,1.28,null,null,75,1.37,null,null,75,1.37,null,null,75,1.37,null,null,75,1.35,null,null,75,1.38,null,null,75,1.38,null,null,75,1.34,null,null,75,1.36,null,null,75,1.32]
[null,80,1.31,null,null,80,1.41,null,null,80,1.41,null,null,80,1.42,null,null,80,1.39,null,null,80,1.42,null,null,80,1.43,null,null,80,1.38,null,null,80,1.4,null,null,80,1.35]
[null,85,1.35,null,null,85,1.45,null,null,85,1.46,null,null,85,1.46,null,null,85,1.43,null,null,85,1.46,null,null,85,1.47,null,null,85,1.41,null,null,85,1.45,null,null,85,1.39]
[null,90,1.38,null,null,90,1.49,null,null,90,1.5,null,null,90,1.51,null,null,90,1.47,null,null,90,1.51,null,null,90,1.52,null,null,90,1.45,null,null,90,1.49,null,null,90,1.42]
{"$rows_left_out":70}
{"sheet":"Start_up","index":6,"n_rows":353,"n_cols":25,"rows_kept":353,"cut":false,"hidden":true,"merged":[[11,23,11,24],[130,23,130,24]]}
[null,"PLIM","ILIM","Load type",null,"SS","Load Value","Load start","Rs","Vos,syst",null,null,"Start-time",null,"I_fet-I_L margin",null,"I_g(hi/nom)","I_g(low/nom)"]
[null,{"$f":"'Design Calculator'!F52","v":176},{"$f":"'Design Calculator'!F42","v":40},{"$f":"IF( 'Design Calculator'!F28 = \"Constant Current\", \"CC\", \"R\")","v":"CC"},null,{"$f":"'Design Calculator'!F30","v":"Soft Start"},{"$f":"'Design Calculator'!F29","v":15},{"$f":"'Design Calculator'!F27","v":0},{"$f":"RsEFF","v":1.5},{"$f":"'Device Parameters'!E12","v":1E-3},null,null,{"$f":"J114*1000","v":2362.4999999845259},"ms",{"$f":"MIN(L10:L111)","v":7.1110605436160539E-6},null,{"$f":"'Device Parameters'!E30/'Device Parameters'!D30","v":1.375},{"$f":"'Device Parameters'!C30/'Device Parameters'!D30","v":0.625}]
[]
[null,null,null,"To avoid timer running: Iload + Icap,ss < IFET_PLIM / 2 => SS_RATE < 1/Cout * (IFET_PLIM/2 - ILOAD)",null,null,null,null,null,null,null,null,"Max_SS_Rate",{"$f":"MIN(M10:M114)","v":-1150.7936507936508},"V/ms","max_power_typ",{"$f":"MAX(O10:O114)","v":378.00268800000003},"W"]
[null,null,null,null,null,null,null,null,null,null,null,null,"FET_ENERGY",{"$f":"SUM(N10:N114)","v":442.22225524325688},"J","max_power_high",{"$f":"MAX(P10:P114)","v":378.00369599999999},"W"]
[null,null,null,null,null,null,null,null,null,null,null,null,null,null,null,"max_power_low",{"$f":"MAX(Q10:Q114)","v":378.00168000000002},"W"]
["VIN","Vout","ILOAD","PLIM","IFET_PLIM","I_FET_SS","IFET","ICAP","Dt","Time","Tiime (ms)","I_Fet-IL margin","Max _allowed SS_rate","FET_Energy","Power (W)","P_ fast_SS","P_slow_SS"]
[null,null,null,null,null,null,null,null,null,null,-1,null,null,null,0]
[null,null,null,null,null,null,null,null,null,null,-0.01,null,null,null,0]
[{"$f":"VINMAX","v":25.2},{"$f":"VINMAX*((ROW()-10)/104)","v":0},{"$f":"IF(B10>=$H$2,IF($D$2=\"CC\", $G$2, B10/$G$2), 0)","v":15},{"$f":"B2","v":176},{"$f":"MIN(D10/(A10-B10),$C$2)","v":6.9841269841269842},{"$f":"I_Cout_ss+C10","v":15.000106666666667},{"$f":"IF($F$2=\"Soft Start\", F10, E10)","v":15.000106666666667},{"$f":"G10-C10","v":1.0666666666736546E-4},{"$f":"(COUTMAX/1000000)*(B10)/H10","v":0},{"$f":"I10","v":0},{"$f":"J10*1000","v":0},{"$f":"H10/G10","v":7.1110605436160539E-6},{"$f":"1/COUTMAX*(E10/2-C10)*1000","v":-1150.7936507936508},{"$f":"I10*G10*(A10-B10)","v":0},{"$f":"G10*(A10-B10)","v":378.00268800000003},{"$f":"(A10-B10)*(I_Cout_ss*$Q$2+C10)","v":378.00369599999999},{"$f":"(A10-B10)*(I_Cout_ss*$R$2+C10)","v":378.00168000000002}]
[25.2,0.24230769230769231,15,{"$f":"B2","v":176},{"$f":"MIN(D11/(A11-B11),$C$2)","v":7.0519340422253043},{"$f":"I_Cout_ss+C11","v":15.000106666666667},{"$f":"IF($F$2=\"Soft Start\", F11, E11)","v":15.000106666666667},1.0666666666736546E-4,{"$f":"(COUTMAX/1000000)*(B11-B10)/H11","v":2.2716346153697338E-2},{"$f":"J10+I11","v":2.2716346153697338E-2},{"$f":"J11*1000","v":22.716346153697337},{"$f":"H11/G11","v":7.1110605436160539E-6},-1147.4032978887346,{"$f":"I11*G11*(A11-B11)","v":8.5042741392934005},{"$f":"G11*(A11-B11)","v":374.36804676923083},374.36904507692304,374.3670484615385]
[25.2,0.48461538461538461,15,{"$f":"B2","v":176},7.1210706504824151,15.000106666666667,15.000106666666667,1.0666666666736546E-4,2.2716346153697338E-2,{"$f":"J11+I12","v":4.5432692307394676E-2},45.432692307394674,7.1110605436160539E-6,-1143.9464674758792,{"$f":"I12*G12*(A12-B12)","v":8.4217083709507463},370.73340553846157,370.7343941538461,370.73241692307693,null,null,null,null,null,null,"Start-up slop "]
[25.2,0.72692307692307689,15,{"$f":"B2","v":176},7.1915763004871911,15.000106666666667,15.000106666666667,1.0666666666736546E-4,2.2716346153697331E-2,6.8149038461092007E-2,68.149038461092005,7.1110605436160539E-6,-1140.4211849756405,8.3391426026080886,367.09876430769236,367.09974323076921,367.09778538461541,null,null,null,null,null,null,"QG",0.3]
[25.2,0.96923076923076923,15,{"$f":"B2","v":176},7.2634920634920634,15.000106666666667,15.000106666666667,1.0666666666736546E-4,2.2716346153697341E-2,9.0865384614789352E-2,90.865384614789349,7.1110605436160539E-6,-1136.8253968253969,{"$f":"I14*G14*(A14-B14)","v":8.256576834265438},363.4641230769231,363.46509230769226,363.46315384615383,null,null,null,null,null,null,"I_Src",0.3]
[25.2,1.2115384615384617,15,{"$f":"B2","v":176},7.336860670194004,15.000106666666667,15.000106666666667,1.0666666666736546E-4,2.2716346153697348E-2,0.1135817307684867,113.58173076848669,7.1110605436160539E-6,-1133.1569664902997,8.1740110659227856,359.82948184615384,359.83044138461531,359.82852230769225,null,null,null,null,null,null,"RMS",{"$f":"SQRT(Y14^2+Y13^2)","v":0.42426406871192851}]
{"$rows_left_out":339}
{"sheet":"SOA","index":7,"n_rows":143,"n_cols":9,"rows_kept":143,"cut":false,"hidden":true,"merged":[[100,1,100,5],[7,13,7,15],[7,17,7,19],[4,1,4,5],[52,1,52,5]]}
[]
[]
["FET 1"]
[]
[null,"Look Up",null,null,null,null,null,"I = a * t^m"]
[null,"10us","100us","1ms","10ms","100ms",null,"a = iSOA1/tSOA1^m"]
["Final SOA",{"$f":"'Design Calculator'!F57","v":400},{"$f":"'Design Calculator'!F58","v":380.95238095238091},{"$f":"'Design Calculator'!F59","v":38.091745273975661},{"$f":"'Design Calculator'!F60","v":12.905576310935604},{"$f":"'Design Calculator'!F61","v":6.6567167007349317},null,"m = log(iSOA1/iSOA2)/log(tSOA1/tSOA2)"]
[null,"Maximum Junction Temperature",{"$f":"'Design Calculator'!F56","v":175},"oC"]
[]
[null,"SOA Check - Based on Timer",null,null,null,null,"SOA Predictor - dv/dt start-up"]
[null,"time",{"$f":"IF('Design Calculator'!F30=\"Power Limit\", 'Design Calculator'!$F$84,'Design Calculator'!F97)","v":0.70588235294117641},"ms",null,null,"time",{"$f":"Equations!F73","v":1169.891826915413},"ms"]
[null,"Voltage",{"$f":"VINMAX","v":25.2},"V",null,null,"Voltage",{"$f":"VINMAX","v":25.2},"V"]
[null,"Lower time",{"$f":"IF(C11<10, IF(C11<1, 0.1, 1), IF(C11<100, 10, 100))","v":0.1},"ms",null,null,"Lower time",{"$f":"IF(H11<10, IF(H11<1, 0.1, 1), IF(H11<100, 10, 100))","v":100},"ms"]
[null,"Lower time (adjusted)",{"$f":"SOA!C13","v":0.1},null,null,null,"Lower time (adjusted)",{"$f":"SOA!H13","v":100}]
[null,"Higher timer",{"$f":"C13*10","v":1},"ms",null,null,"Higher time",{"$f":"H13*10","v":1000},"ms"]
{"$rows_left_out":129}
{"sheet":"dv_dt_recommendations","index":8,"n_rows":149,"n_cols":25,"rows_kept":149,"cut":false,"hidden":true,"merged":[]}
[]
[]
[]
[]
[null,null,"Key Equations for SOA margin estimate: "]
[]
[null,null,"1) Get total Energy = 1/2 CV^2 + E_load (t_worksheet) * t_start / t_ worksheet"]
[null,null,"     note:  t_worksheet is the start time from the start-up worksheet.  E_load = Total Energy @ Start-up - 1/2CV^2"]
[]
[null,null,"2) Get peak power:  4 Possible points with peak power"]
[null,null,"      a) At Vin = 0 [mainly if there is no load or constant current load that starts at Vout = 0="]
[null,null,"      b) At Vin = Load start [ constant current="]
[null,null,"      c) When derivative of power = 0  [Peak, applies to resistive loads only="]
[null,null,"                "," P = (I_cap + Vout/R ) * (Vin - Vout) = Icap * Vin - Icap * Vout +Vin * Vout / R - Vout^2 / R "]
[null,null,null," =>  dP/dVout =  -Icap + Vin/R -2Vout /R ;  Zero when Vout = -R*I_cap / 2 + Vin / 2"]
{"$rows_left_out":134}