{"text_format":"1","workbook":"xlsx","n_sheets":13,"sheets":["Design the Power Module","Schematic & BOM","EVMs","Variable Management","MOSFET Parameters","Schematic Management","Stability Calculations","Bode Plot Management","Efficiency Calculations","Efficiency Plot Management","Standard Value Calculator","Snubber","Parallel Output Caps"],"not_rendered":{"charts":9,"images":23,"macros":1,"external_links":1,"defined_names":237,"comments":1,"pivot_tables":0},"unopened":[],"bounds":{"document_bytes":16777216,"sheet_cells":100000,"rows_first":2000,"rows_last":500,"rows_between":2000,"halvings":0,"cell_chars":16384,"cell_head_chars":4096},"cells_cut":0,"cells_raw":0,"read":"whole","date_system":"1900"}

{"sheet":"Design the Power Module","index":0,"n_rows":56,"n_cols":17,"rows_kept":56,"cut":false,"hidden":false,"merged":[[2,14,2,15],[0,0,0,16],[81,5,81,6],[39,11,40,16],[41,11,42,16]]}
["                      TPSM6360x 3V‒36VIN, 1V‒16VOUT Power Module Design Tool"]
[null,null,null,null,null,null,null,null,null,null,null,null,null,null,"http://www.ti.com/product/lm5175"]
["About",null,"xx",null,null,"= Input Box",null,null,null,null,null,null,null,null,"TERMS OF USE",null,"                "]
[]
["Step 1: Operating Specifications"]
[null,null,null,"Input Voltage – Min, VIN(min) ",12,"V"]
[null,null,null,"Input Voltage – Nom, VIN(nom)",24,"V"]
[null,null,null,"Input Voltage – Max, VIN(max)",36,"V"]
[null,null,null,"Output Voltage, VOUT ",5,"V"]
[null,null,null,"Full Load Output Current, IOUT ",4,"A"]
[null,null,null,"Switching Frequency, FSW",832,"kHz"]
[null,null,null,"Frequency Set Resistor, RT ",{"$f":"'Variable Management'!C340","v":15.8},{"$f":"'Variable Management'!E340","v":"kΩ"}]
[null,null,null,"Ambient Temperature, TA",25,"°C"]
[]
["Step 2: Buck Inductor"]
[null,null,null,"Inductor Pk-Pk Ripple Current at VIN(nom)",{"$f":"'Variable Management'!B60","v":2.707692261915116},"Apk-pk"]
[null,null,null,"DIL as a % of Full Load at VIN(nom)",{"$f":"'Variable Management'!D60*100","v":67.692306547877905},"%"]
[null,null,null,"Peak Inductor Current at VIN(max) and Full Load",{"$f":"'Variable Management'!B99","v":5.4784952280122443},"Apk"]
[null,null,null,"Peak Inductor Current Limit",{"$f":"Ipk_OCP","v":9.3000000000000007},"Apk"]
[]
["Step 3: Output Capacitors"]
[null,null,null,"Desired Output Voltage Ripple",50,"mVpk-pk"]
[null,null,null,"Effective COUT Value to Meet Ripple Spec",{"$f":"'Variable Management'!B113","v":8.1360945370045545},"µF"]
[null,null,null,"Desired Crossover Frequency",80,{"$f":"\"     kHz \"","v":"     kHz "}]
[null,null,null,"Effective COUT Value to Meet Crossover Spec",{"$f":"'Variable Management'!B206","v":37.999673956099208},"µF"]
[null,null,null,"Output Capacitance (derated), COUT ",60,"µF"]
[null,null,null,"Output Cap ESR (Max) to Meet Ripple Spec",{"$f":"'Variable Management'!B117","v":18.295348096740312},"mΩ"]
[null,null,null,"Output Capacitor ESR",2,"mΩ"]
[null,null,null,"Resulting Output Voltage Ripple (max) ",{"$f":"'Variable Management'!B119*1000","v":8.6773185844071605},"mVpk-pk"]
[null,null,null,"Output Capacitor RMS Current (max) ",{"$f":"'Variable Management'!B106","v":0.85360961788844669},"A (rms)"]
[]
["Step 4: Input Capacitors"]
[null,null,null,"Input Voltage Ripple Spec",120,"mVpk-pk"]
[null,null,null,"Minimum Input Capacitance",{"$f":"'Variable Management'!B136","v":10.016025641025641},"µF"]
[null,null,null,"Input Capacitance (derated), CIN ",20,"µF"]
[null,null,null,"Maximum Permitted ESR",{"$f":"'Variable Management'!B141","v":10.934361290952697},"mΩ"]
[null,null,null,"Input Capacitor ESR",1,"mΩ"]
[null,null,null,"Resulting Input Voltage Ripple (max)",{"$f":"'Variable Management'!B146*1000","v":65.574649074166089},"mVpk-pk"]
[null,null,null,"Input Capacitor RMS Current (max)",{"$f":"'Variable Management'!B129","v":2.016843890201129},"A (rms)"]
[null,null,null,null,null,null,null,null,null,null,null,{"$f":"CHOOSE(SCH_MODE, \"\", \"** For Single-Output Operation in 2-Phase Mode, tie MODE to VDDA and use FB1 to set VOUT **\", \"** For Single-Output Operation in 3-Phase Mode, tie both MODE pins to VDDA. Use FB1 of master IC to set VOUT. Connect FB2 of master IC to AGND. Connect FB2 of slave IC to VDDA to configure it as a slave **\", \"** For Single-Output Operation in 4-Phase Mode, tie both MODE pins to VDDA. Use FB1 of master IC to set VOUT. Connect FB2 of master IC to AGND. Connect FB2 of slave IC to VDDA to configure it as a slave **\")","v":""}]
["Step 5: Feedback Network"]
[null,null,null,{"$f":"CHOOSE(TPSM63603_Fixed_Vout, \"Lower Feedback Resistance\", \"* Tie FB to VOUT for a Fixed 5V Output\", \"* Tie FB to VOUT for a Fixed 3.3V Output\")","v":"Lower Feedback Resistance"},10,"kΩ",null,null,null,null,null,{"$f":"CHOOSE(SCH_MODE, \"\", \"** For Single-Output Operation in 2-Phase Mode, tie MODE to VDDA and use FB1 to set VOUT **\", \"** For Single-Output Operation in 3-Phase Mode, tie both MODE pins to VDDA. Use FB1 of master IC to set VOUT. Connect FB2 of master IC to AGND. Connect FB2 of slave IC to VDDA to configure it as a slave **\", \"** For Single-Output Operation in 4-Phase Mode, tie both MODE pins to VDDA. Use FB1 of master IC to set VOUT. Connect FB2 of master IC to AGND. Connect FB2 of slave IC to VDDA to configure it as a slave **\")","v":""}]
[null,null,null,"Upper Feedback Resistance (E96), RFBT",{"$f":"IF(Vout=Vref,\"SHORT\",Rfb2_u/1000)","v":40.200000000000003},{"$f":"IF(Vout=Vref,\"\",\"kΩ\")","v":"kΩ"}]
[null,null,null,"Feedforward Capacitance, CFF",22,"pF"]
[]
["Step 6: VIN UVLO"]
[null,null,null,"Desired VIN UVLO Turn-On Threshold",8.9,"V"]
[null,null,null,"UVLO Divider Upper Resistance, RENT",604,"kΩ"]
[null,null,null,"UVLO Divider Lower Resistance (E96), RENB",{"$f":"Renb_u/1000","v":100},{"$f":"IF(Vout=Vref,\"\",\"kΩ\")","v":"kΩ"}]
[null,null,null,"Actual VIN UVLO Turn-On Threshold",{"$f":"1.263/E49*(E48+E49)","v":8.8915199999999999},"V",null,null,null,null,null,null,null,null,null,null," "]
[null,null,null,"Actual VIN UVLO Turn-Off Threshold",{"$f":"E50*0.72","v":6.4018943999999998},"V"]
[]
["Step 7: Power Loss & Thermals"]
[null,null,null,"Total Power Dissipation",{"$f":"'Efficiency Calculations'!AT109","v":1.3769485915828896},"W"]
[null,null,null,"Junction Temperature (estimate)",{"$f":"'Variable Management'!B285","v":55.292869014823573},"°C"]
[null,null,null,null,{"$f":"CHOOSE(Ext_VCC, \"\", \"* Tie VLDOIN to GND\")","v":""}]

{"sheet":"Schematic & BOM","index":1,"n_rows":52,"n_cols":10,"rows_kept":52,"cut":false,"hidden":false,"merged":[[47,0,48,0],[47,9,48,9],[47,3,48,6],[47,2,48,2],[47,1,48,1],[47,7,48,7],[47,8,48,8],[46,3,46,6],[42,3,42,6],[43,3,43,6],[41,3,41,6],[38,3,38,5],[36,3,36,5],[44,3,44,6],[45,3,45,6],[35,3,35,6],[37,3,37,5],[40,3,40,5],[39,3,39,5]]}
[]
[]
[]
[]
[]
[]
[]
[]
[]
[]
[]
[]
[]
[]
[]
[]
[]
[]
[]
[]
[]
[]
[]
[]
[]
[]
[]
[]
[]
[]
[]
[]
[]
[{"$f":"\"VIN = \"&VIN_min&\" V to \"&VIN_max&\" V, VOUT = \"&Vout&\" V, IOUT = \"&Iout&\" A,  Fsw = \"&Fsw/1000&\" kHz\"","v":"VIN = 12 V to 36 V, VOUT = 5 V, IOUT = 4 A,  Fsw = 832 kHz"}]
["High-Efficiency Synchronous Buck Power Module BOM"]
["Count","Ref Des","Value","Description",null,null,null,"Size","Part Number","MFR"]
[{"$f":"ROUNDUP('Design the Power Module'!E35/10,0)","v":2},"CIN1, CIN2",10,{"$f":"C37","v":10},null,null,null,1210,"Std","Std"]
[2,"COUT",22,{"$f":"C38","v":22},null,null,null,1210,"Std","Std"]
[1,"CVCC",1,{"$f":"C39","v":1},null,null,null,"0402","Std","Std"]
[1,"CSYNC",1,{"$f":"C40","v":1},null,null,null,"0402","Std","Std"]
[1,"CFF",{"$f":"'Variable Management'!D299","v":22},{"$f":"C41","v":22},null,null,null,"0402","Std","Std"]
[1,"RRT",{"$f":"'Design the Power Module'!E12","v":15.8},{"$f":"C42","v":15.8},null,null,null,"0402","Std","Std"]
[1,"RFBT",{"$f":"'Design the Power Module'!E42","v":10},10,null,null,null,"0402","Std","Std"]
[1,"RFBB",{"$f":"'Design the Power Module'!E43","v":40.200000000000003},40.200000000000003,null,null,null,"0402","Std","Std"]
[1,"RENT",{"$f":"'Variable Management'!D302","v":604},604,null,null,null,"0402","Std","Std"]
[1,"RENB",{"$f":"'Variable Management'!D303","v":100},100,null,null,null,"0402","Std","Std"]
[1,"RPGOOD",100,100,null,null,null,"0402","Std","Std"]
[1,"U1",{"$f":"'Variable Management'!N19","v":"TPSM63606"},{"$f":"CHOOSE(GPN, \"IC, TPSM63606 Synchronous Buck Power Module, 3V–36V Input, 6A Output\", \"IC, TPSM63604 Synchronous Buck Power Module, 3V–36V Input, 4A Output\", \"IC, TPSM63603 Synchronous Buck Power Module, 3V–36V Input, 3A Output\", \"IC, TPSM63602 Synchronous Buck Power Module, 3V–36V Input, 2A Output\")","v":"IC, TPSM63606 Synchronous Buck Power Module, 3V–36V Input, 6A Output"},null,null,null,{"$f":"CHOOSE(GPN, \"B3QFN\", \"B3QFN\", \"B0QFN\", \"B0QFN\")","v":"B3QFN"},{"$f":"CHOOSE(VARIANT, \"TPSM63606RDLR\", \"TPSM63604RDLR\", \"TPSM63603RDHR\", \"TPSM63602RDHR\", \"TPSM63603V5RDHR\", \"TPSM63603V3RDHR\")","v":"TPSM63606RDLR"},"TI"]
[]
[]
["NOTES:"]
["** Effective input and output capacitances should be appropriately derated for applied voltage and temperature, particularly with ceramics **"]

{"sheet":"EVMs","index":2,"n_rows":4,"n_cols":2,"rows_kept":4,"cut":false,"hidden":false,"merged":[[0,0,0,16]]}
["TPSM6360x Quickstart Design Tool"]
[]
[]
[null,"TPSM63606EVM PCB Layout"]

{"sheet":"Variable Management","index":3,"n_rows":345,"n_cols":27,"rows_kept":345,"cut":false,"hidden":true,"merged":[[4,4,4,7],[0,0,0,8]]}
["EXCEL Variables Names/Calculations"]
[null,"Input from user ="]
[null,"Output ="]
[null,"Constant"]
["Variable Name","Value","STD Units",null,"Notes",null,null,null,"Iteration"]
["Step 1: Operational Specs"]
["VIN_min",{"$f":"'Design the Power Module'!E6","v":12},"V","Minimum input voltage",null,null,null,null,1]
["VIN_nom",{"$f":"'Design the Power Module'!E7","v":24},"V","Nominal input voltage",null,null,null,null,null,null,"Use CFF",1,null,"TPSM63606 3.3Vout",{"$f":"IF(Vout = 3.3, 1, 0)","v":0},null,null,null,null,"Dual  Outputs",1,null,"FPWM",1,null,{"$f":"CHOOSE(SCH_MODE, \"Bode Plot (Ch1)\", \"Bode Plot - 2 Ph\", \"Bode Plot - 3 Ph\", \"Bode Plot - 4 Ph\")","v":"Bode Plot (Ch1)"},1]
["VIN_max",{"$f":"'Design the Power Module'!E8","v":36},"V","Maximum input voltage",null,null,null,null,null,null,"No CFF",2,null,"TPSM63603 5Vout",{"$f":"IF(Vout = 5, 1, 0)","v":1},null,null,null,null,"Single Output – 2  Phases",2,null,"DEM",2,null,{"$f":"IF(MODE=1, \"Bode Plot (Ch2)\", \"N/A - Do Not Use\")","v":"Bode Plot (Ch2)"},2]
[null,null,null,null,null,null,null,null,null,null,null,1,null,"TPSM63603 Fixed Vout",{"$f":"IF(AND(GPN=3,Vout=3.3),3,IF(AND(GPN=3,Vout=5),2,1))","v":1},"1 = No, 2 = 5V, 3 = 3.3V",null,null,null,"Single Output – 3  Phases",3,null,"FPWM/DEM",2,null,"BODE_PLOT_TYPE",1]
["Vout",{"$f":"'Design the Power Module'!E9","v":5},"V","Output voltage",null,null,null,null,null,null,"NO_FF_CAP",{"$f":"IF(L10=2, TRUE, FALSE)","v":false},null,null,{"$f":"AND(GPN=3, OR(O8,O9))","v":false},null,null,null,null,"Single Output – 4  Phases",4]
["Iout",{"$f":"'Design the Power Module'!E10","v":4},"A","Output current",null,"Iout-max",{"$f":"CHOOSE(GPN, 6, 4, 3, 2)","v":6},"A",1,null,null,null,null,null,null,null,null,null,null,"Single/Dual Yes/No",1]
[null,null,null,null,null,null,null,null,1,null,null,null,null,null,null,null,null,null,null,"MODE (Single/Dual), DUAL = 1, SINGLE = 2",{"$f":"IF(U12=1, 1, 2)","v":1},null,"External BIAS",1]
["Rout",{"$f":"Vout/Iout","v":1.25},"W","Load resistance",null,null,null,null,null,null,null,null,null,null,null,null,null,null,null,"SINGLE OUTPUT (1 = YES)",{"$f":"IF(U12=1, 2, 1)","v":2},null,"No External BIAS",2]
["Pout",{"$f":"Vout*Iout","v":20},"W","Output power",null,null,null,null,null,null,null,null,null,"TPSM63606 6A module",1,null,null,null,null,"Number of Phases",{"$f":"SCH_MODE","v":1},null,"Ext_VCC",1]
[null,null,null,null,null,null,null,null,null,null,null,null,null,"TPSM63604 4A module",2]
["Efficiency",0.9,null,"Estimate of efficiency",null,null,null,null,null,null,null,{"$f":"Vout","v":5},null,"TPSM63603 3A module",3]
["Pin",{"$f":"Pout/Efficiency","v":22.222222222222221},"W","Calculate input power assuming finite efficiency",null,null,null,null,null,null,null,null,null,"TPSM63602 2A module",4]
[null,null,null,null,null,null,null,null,null,null,null,"GPN",null,{"$f":"CHOOSE(GPN, \"TPSM63606\", \"TPSM63604\", \"TPSM63603\", \"TPSM63602\")","v":"TPSM63606"},1,null,null,null,null,null,null,null,"2.2 MHz Fsw Setting",1]
["Iin_Vinmin",{"$f":"Pin/VIN_min","v":1.8518518518518519},"A",null,null,null,null,null,null,null,null,null,null,null,null,null,null,null,null,null,null,null,"440 kHz Fsw Setting",2]
["Iin_Vinnom",{"$f":"Pin/VIN_nom","v":0.92592592592592593},"A","Input currents at min, nom, max Vin",null,null,null,{"$f":"AND(OSC=1, OR(Fsw/1000>2530, Fsw/1000<1800))","v":false},null,null,"Variant","VARIANT",null,{"$f":"CHOOSE(VARIANT, \"TPSM63606\", \"TPSM63604\", \"TPSM63603\", \"TPSM63602\", \"TPSM63603V5\", \"TPSM63603V3\")","v":"TPSM63606"},{"$f":"IF(AND(GPN=3,Vout=5),5,IF(AND(GPN=3,Vout=3.3),6,GPN))","v":1},null,null,null,null,null,null,null,"OSC",2]
["Iin_Vinmax",{"$f":"Pin/VIN_max","v":0.61728395061728392},"A",null,null,null,null,{"$f":"AND(OSC=2, OR(Fsw/1000>500, Fsw/1000<300))","v":true}]
[null,null,null,null,null,null,null,{"$f":"OR(H21,H22)","v":true}]
["Fsw",{"$f":"'Design the Power Module'!E11*1000","v":832000},"Hz","Nominal switching frequency - determines RT resistor"]
["RT resistor to AGND",{"$f":"13.46/(Fsw/1000000)-0.44","v":15.737884615384617},"kΩ",null,null,null,null,null,1]
["Tsw",{"$f":"1/Fsw","v":1.201923076923077E-6},"sec","Switching period"]
["Max crossover frequency = 20% Fsw",{"$f":"Fsw*0.2/1000","v":166.4},"kHz",null,null,"Min Crossover",10,null,null,null,"Adjustable",1]
["Vref",1,"V","Reference voltage",null,null,null,null,null,null,"5V",2]
["Rt",{"$f":"'Standard Value Calculator'!O12/1000","v":15.8},"kΩ","Frequency set resistor",null,{"$f":"IF(OR((Fsw=440000),(Fsw=2200000)),\"N/A\",Rfadj/1000)","v":1.5800000000000002E-2},null,null,null,null,"3.3V",3]
[null,null,null,null,null,null,null,null,null,null,"Adjustable_NoRT",4,null,null,"TPSM63603V5"]
[null,null,null,null,null,null,null,null,null,null,"5V_NoRT",5,null,null,"TPSM63603V3"]
[null,null,null,null,null,null,null,null,null,null,"3.3V_NoRT",6]
["Step 2: Buck Inductor","Channel 1",null,null,null,null,null,null,null,null,"Schematic setting",{"$f":"IF(No_RT, IF(Vout=3.3, 6, IF(Vout=5, 5, 4)),IF(Vout=3.3, 3, IF(Vout=5, 2, 1)))","v":5}]
["Don1",{"$f":"Vout/VIN_nom","v":0.20833333333333334},null,null,null,"Ideal Duty Cycle at VIN(nom)"]
["Doff1",{"$f":"1-34:34","v":0.79166666666666663},null,null,null,"Ideal 1- Duty Cycle at VIN(nom)"]
[]
["D_Vinmin",{"$f":"Vout/VIN_min","v":0.41666666666666669}]
["D_Vinnom",{"$f":"Vout/VIN_nom","v":0.20833333333333334}]
["D_Vinmax",{"$f":"Vout/VIN_max","v":0.1388888888888889},null,null,null,null,null,null,null,null,"Toko chip inductor for the TPSM63602/03"]
[]
["L_Vinnom",{"$f":"(VIN_nom-Vout)*D1_Vinnom/(Fsw*Iout*0.35)","v":3.3982944139194141E-6},"H",null,null,"Calculated inductance for 35% ripple at VIN(nom)",null,null,null,null,"Current (A)","L (uH)"]
["L_slopecomp",null,"H",null,null,"Calculated inductance based on one times inductor downslope",null,null,null,null,0,2]
[null,null,null,null,null,null,null,null,null,null,0.5,1.96]
["Lopt",{"$f":"B41","v":3.3982944139194141E-6},"H",null,null,"min of calculated inductances at VIN(min) and VIN(nom)",null,null,null,null,1,1.91]
["L_actual_TPSM63602-03",{"$f":"-0.0238*Iout^2-0.0868*Iout+2.0073","v":1.2792999999999999},"uH",null,null,"Calculate TOKO chip inductance based on entered load current value",null,null,null,null,1.5,1.82]
["L_actual_TPSM63604-06",{"$f":"-0.1304*Iout+2.32","v":1.7984},"uH",null,null,"Calculate MagLayers inductance based on entered load current value",null,null,null,null,2,1.74]
[null,null,null,null,null,null,null,null,null,null,2.5,1.64]
["Lo",{"$f":"CHOOSE(GPN, B46, B46, B45, B45)*0.000001","v":1.7984E-6},"H",null,null,"Chosen inductance",null,null,null,null,3,1.53]
["Rdcr",{"$f":"CHOOSE(GPN, 0.021, 0.021, 0.068, 0.068)","v":2.1000000000000001E-2},"W",null,null,"Chosen inductor DCR",null,null,null,null,3.5,1.4]
[null,null,null,null,null,null,null,null,null,null,4,1.29]
["Don2",{"$f":"(Vout+Iout*(Rdcr+Rdson2))/(Vin+Iout*(Rdson2-Rdson1))","v":0.2160535117056856}]
["Doff2",{"$f":"1-_Don2","v":0.78394648829431435}]
[]
["D_Vinmin_2",{"$f":"(Vout+Iout*(Rdcr+Rdson2))/(VIN_min+Iout*(Rdson2-Rdson1))","v":0.4335570469798658},null,{"$f":"Vout/VIN_min","v":0.41666666666666669},null,"Duty cycles adjusted for DCR/Rdson voltage drops"]
["D_Vinnom_2",{"$f":"(Vout+Iout*(Rdcr+Rdson2))/(VIN_nom+Iout*(Rdson2-Rdson1))","v":0.2160535117056856},null,{"$f":"Vout/VIN_nom","v":0.20833333333333334}]
["D_Vinmax_2",{"$f":"(Vout+Iout*(Rdcr+Rdson2))/(VIN_max+Iout*(Rdson2-Rdson1))","v":0.14387527839643652},null,{"$f":"Vout/VIN_max","v":0.1388888888888889},null,{"$f":"(Ts-0.000000085)/Ts","v":0.92927999999999999},"Dmax = [Ts-toff(min)]/Ts"]
[]
[]
["Iripple_Vinmin",{"$f":"(VIN_min-Vout-Iout*(Rdcr+Rdson1))*D1_Vinmin_2/(Fsw*Lf)","v":1.9564513951023064},"A",{"$f":"B59/Iout","v":0.48911284877557659},null,"Ripple calculations include DCR and Rdson",null,null,null,null,"MagLayers inductor for the TPSM63604/06"]
["Iripple_Vinnom",{"$f":"(VIN_nom-Vout-Iout*(Rdcr+Rdson1))*D1_Vinnom_2/(Fsw*Lf)","v":2.707692261915116},"A",{"$f":"B60/Iout","v":0.67692306547877901},null,"% ripple current at Vin-nom"]
["Iripple_Vinmax",{"$f":"(VIN_max-Vout-Iout*(Rdcr+Rdson1))*D1_Vinmax_2/(Fsw*Lf)","v":2.9569904560244895},"A",{"$f":"B61/Iout","v":0.73924761400612238},null,"Max inductor ripple current - it's at Vin-max",null,null,null,null,"Current (A)","L (uH)"]
[null,null,null,null,null,null,null,null,null,null,0,2.2000000000000002]
["Iinductor_rms_Vinmin",{"$f":"SQRT(Iout^2+(Iripple_Vinmin^2)/12)","v":4.0396751319608795},"A",null,null,null,null,null,null,null,1,2.1800000000000002]
["Iinductor_rms_Vinnom",{"$f":"SQRT(Iout^2+(Iripple_Vinnom^2)/12)","v":4.0756553397913304},"A",null,null,null,null,null,null,null,1.5,2.14]
["Iinudctor_rms_Vinmax",{"$f":"SQRT(Iout^2+(Iripple_Vinmax^2)/12)","v":4.0900671607874193},"A",null,null,null,null,null,null,null,2,2.0699999999999998]
[null,null,null,null,"TPSM63604/06","TPSM63602/03","=> Result based on GPN",null,null,null,2.5,2]
["Core loss estimate - Vin(min)",{"$f":"kcore*Iripple_Vinmin^kcore1*(Fsw/1000)^kcore2","v":0.11121476134019231},"W","kcore",4.1999999999999999E-8,{"$f":"0.000000042*0.5","v":2.0999999999999999E-8},{"$f":"CHOOSE(GPN, E67, E67, F67, F67)","v":4.1999999999999999E-8},"Core loss constant",null,null,3,1.93]
["Core loss estimate - Vin(nom)",{"$f":"CHOOSE(GPN, kcore*Iripple_Vinnom^kcore1*(Fsw/1000)^kcore2, kcore*Iripple_Vinnom^kcore1*(Fsw/1000)^kcore2, 0.5*kcore*Iripple_Vinnom^kcore1*(Fsw/1000)^kcore2, 0.5*kcore*Iripple_Vinnom^kcore1*(Fsw/1000)^kcore2)","v":0.25060402167332357},"W","kcore1",2.5,2.5,{"$f":"CHOOSE(GPN, E68, E68, F68, F68)","v":2.5},"Ripple current exponent",null,null,4,1.8]
["Core loss estimate - Vin(max)",{"$f":"kcore*Iripple_Vinmax^kcore1*(Fsw/1000)^kcore2","v":0.31233063464282829},"W","kcore2",1.95,1.95,{"$f":"CHOOSE(GPN, E69, E69, F69, F69)","v":1.95},"Fsw exponent",null,null,6,1.55]
[null,null,null,"Pcore = kcore*(deltaI)^kcore1*(Fsw)^kcore2",null,null,null,null,null,null,8,1.28]
[null,null,null,"Note: ** core loss for 2A/3A versions scaled by 50% for smaller 2520 core size**",null,null,null,null,null,null,10,1]
[]
[]
[]
["Inductor copper temperature",125,"°C"]
["Inductor DCR at hot",{"$f":"Rdcr*(1+Ltc*(B75-25))*1000","v":29.253},"mW"]
[]
[]
["Step 2b: Sense Resistors, Slope Comp, Current Limit"]
[]
["Ilimit_inductor_Vinmin",{"$f":"Ipk_OCP","v":9.3000000000000007},"A",null,null,"Peak inductor current at current limit inception"]
["Ilimit_inductor_Vinnom",{"$f":"Ipk_OCP","v":9.3000000000000007},"A"]
["Ilimit_inductor_Vinmax",{"$f":"Ipk_OCP","v":9.3000000000000007},"A"]
[]
["CS threshold_min",6.8000000000000005E-2,"V","not applicable here"]
["CS threshold",7.4999999999999997E-2,"V"]
["CS threshold_max",8.2000000000000003E-2,"V"]
[]
["Rs",4.1000000000000002E-2,"W",null,null,"Current sense resistance Rs = high-side MOSFET Rdson"]
[]
["Current limit setpoint - peak",{"$f":"CHOOSE(GPN, 9.3, 7, 6.2, 4.87)","v":9.3000000000000007},"A","9.3, 7, 6.2, 4.87A",null,"Peak current limit (trimmed at ATE) = min inductor sat current at hot"]
[]
["Iout_OCP_Vinmin",{"$f":"Ipk_OCP-Iripple_Vinmin/2","v":8.3217743024488477},"A",null,null,"Current limit setpoints (i.e. IOUT) assuming no CS delay"]
["Iout_OCP_Vinnom",{"$f":"Ipk_OCP-Iripple_Vinnom/2","v":7.9461538690424423},"A"]
["Iout_OCP_Vinmax",{"$f":"Ipk_OCP-Iripple_Vinmax/2","v":7.8215047719877564},"A"]
[]
["Ipk_full-load_Vinmin",{"$f":"Iout+Iripple_Vinmin/2","v":4.978225697551153},"A"]
["Ipk_full-load_Vinnom",{"$f":"Iout+Iripple_Vinnom/2","v":5.3538461309575585},"A"]
["Ipk_full-load_Vinmax",{"$f":"Iout+Iripple_Vinmax/2","v":5.4784952280122443},"A"]
[]
[]
["Step 3: Output Capacitor"]
["Icoutrms_VINmin",{"$f":"Iripple_Vinmin/SQRT(12)","v":0.56477886980936776},"A",null,null,"Output cap RMS current"]
["Icoutrms_VINnom",{"$f":"Iripple_Vinnom/SQRT(12)","v":0.78164342814967946},"A"]
["Icoutrms_VINmax",{"$f":"Iripple_Vinmax/SQRT(12)","v":0.85360961788844669},"A"]
["Max Cout rms current",{"$f":"MAX(B103:B105)","v":0.85360961788844669},"A"]
[]
["Vripple1",{"$f":"'Design the Power Module'!E22/1000","v":0.05},"V",null,null,"Output voltage ripple spec(pk-pk)"]
[]
["Output Ripple Spec (pk-pk)",{"$f":"Vo1_ripple*1000","v":50},"mV",null,null,"Vout ripple spec at Vin(nom)"]
[]
["Coutmin",{"$f":"Iripple_Vinnom/(Fsw*8*Vo1_ripple)","v":8.1360945370045552E-6},"F",null,null,"Minimum output capacitnace",null,{"$f":"Vo2_ripple","v":0},1]
["Reported Coutmin",{"$f":"IF(Cout_min*1000000<2, 2.2,Cout_min*1000000)","v":8.1360945370045545},"uF"]
["Cout",{"$f":"'Design the Power Module'!E26/1000000","v":6.0000000000000002E-5},"F",null,null,"Chosen output capacitance",null,null,1]
["Resrmax",{"$f":"SQRT((Vo1_ripple/Iripple_Vinnom)^2-(1/(Fsw*Cout*8))^2)","v":1.8295348096740313E-2},"W",null,null,"Max ESR before ripple exceeds Vripple1",null,null,1]
[]
["Reported Cout ESR max",{"$f":"IF(OR(CoutEsrMax>0.3, CoutEsrMax<0, (ISERROR(CoutEsrMax))), \"N/A\", CoutEsrMax*1000)","v":18.295348096740312},"mΩ"]
["CoutEsr",{"$f":"'Design the Power Module'!E28/1000","v":2E-3},"W",null,null,"Chosen ESR",null,null,1,null,{"$f":"ISERROR(CoutEsrMax)","v":false},{"$f":"ISERROR(B117)","v":false}]
["Vripple",{"$f":"Iripple_Vinnom*SQRT(Cout_ESR^2+(1/(8*Fsw*Cout))^2)","v":8.6773185844071597E-3},"Vp-p",null,null,null,null,null,null,null,null,{"$f":"OR(CoutEsrMax>0.3,CoutEsrMax<0)","v":false}]
[null,null,null,null,null,null,null,null,null,null,{"$f":"OR(TRUE, FALSE, TRUE)","v":true}]
["Step 4: Input Capacitor"]
[]
["Icinrms_VINmin",{"$f":"SQRT(D1_Vinmin_2*(Iout^2*(1-D1_Vinmin_2)+Iripple_Vinmin^2/12))","v":2.016843890201129},"A",null,null,"Calculate input cap rms current",null,null,null,null,null,null,null,"A"]
["Icinrms_VINnom",{"$f":"SQRT(D1_Vinnom_2*(Iout^2*(1-D1_Vinnom_2)+Iripple_Vinnom^2/12))","v":1.6858207838783601},"A"]
["Icinrms_VINmax",{"$f":"SQRT(D1_Vinmax_2*(Iout^2*(1-D1_Vinmax_2)+Iripple_Vinmax^2/12))","v":1.4407073106532469},"A"]
["Max Cin rms current",{"$f":"MAX(B123:B125)","v":2.016843890201129},"A"]
[]
["Icinrms - max at D = 0.5",{"$f":"Iout/2","v":2},"A"]
["Final result",{"$f":"IF(VIN_min<2*Vout, Iout/2, B123)","v":2.016843890201129},"A","…report this"]
[]
["Vinripple1",{"$f":"'Design the Power Module'!E33/1000","v":0.12},"Vp-p",null,null,"Input voltage ripple spec (pk-pk)"]
[null,null,null,null,null,{"$f":"Number_of_Phases","v":1}]
["Cinmin_Vinmax",{"$f":"Iout*D1_Vinmax*(1-D1_Vinmax)/(Vinripple1*Fsw)","v":4.79161720481165E-6},"F",null,null,"Calculate cap at Vinmax and 50% duty cycle (Vin = 2*Vout)"]
["Cinmin_50%D",{"$f":"Iout*0.5*(1-0.5)/(Vinripple1*Fsw)","v":1.0016025641025641E-5},"F",null,null,"Buck 50% typically worst case"]
["Cinmin",{"$f":"IF(VIN_max<2*Vout, B133,B134)","v":1.0016025641025641E-5},"F"]
["Reported Cinmin",{"$f":"IF(Cinmin*1000000<4.7, 4.7,Cinmin*1000000)","v":10.016025641025641},"uF",null,null,"…report this"]
["Cin",{"$f":"'Design the Power Module'!E35/1000000","v":2.0000000000000002E-5},"F",null,null,"Input capacitance"]
["CinEsrMax_Vinmax",{"$f":"-(Iout*D1_Vinmax*(1-D1_Vinmax)/(Cin*Fsw)-Vinripple1)/(Iout+Iripple_Vinmax/2)","v":1.6656087661545402E-2},"W"]
["CinEsrMax_50%D",{"$f":"-(Iout*0.5*(1-0.5)/(Cin*Fsw)-Vinripple1)/(Iout+Iripple_Vinmax/2)","v":1.0934361290952698E-2},"W",null,null,"Calculate ESR at Vinmax and 50% duty cycle (Vin = 2*Vout)"]
["CinEsrMax",{"$f":"IF(VIN_max<2*Vout, B138,B139)","v":1.0934361290952698E-2},"W"]
["Reported Cin ESR max",{"$f":"IF(OR(CinEsrMax>0.3, CinEsrMax<0), \"N/A\",CinEsrMax*1000)","v":10.934361290952697},"mΩ",null,null,"…report this"]
["RCinEsr",{"$f":"'Design the Power Module'!E37/1000","v":1E-3},"W",null,null,"Input capacitance series resistance (ESR)"]
[]
["Vinripple2_Vinmax",{"$f":"Iout*D1_Vinmax_2*(1-D1_Vinmax_2)/(Cin*Fsw)+(Iout +Iripple_Vinmax/2)*RCinEsr","v":3.5087914137335419E-2},"Vp-p"]
["Vinripple2_50%D",{"$f":"Iout*0.5*(1-0.5)/(Cin*Fsw)+(Iout +Iripple_Vinmax/2)*RCinEsr","v":6.5574649074166089E-2},"Vp-p",null,null,"Calculate ripple at Vinmax and 50% duty cycle (Vin = 2*Vout)"]
["Vinripple2",{"$f":"IF(VIN_max<2*Vout, B144,B145)","v":6.5574649074166089E-2},"Vp-p",null,null,"…report highest of these"]
[]
[null,{"$f":"Iout*D1_Vinmax_2*(1-D1_Vinmax_2)/(Cin*Fsw)","v":2.9609418909323174E-2},"Vp-p"]
[]
["Step ?: Other Components - MODE"]
[]
["RPG1/2",100,"kΩ"]
["RFB1/2",null,"W",null,"Tie to VDDA or AGND for 3.3V/5V output, respectively. "]
["R_MODE",null,"W",null,"Tie to VDDA or AGND for Single/Dual operation, respectively. "]
["R_DEMB",null,"W",null,"Tie to VDDA or AGND for FPWM/DEM, respectively. "]
[]
[]
["Step 5: Feedback Network and Internal Compensation"]
["Pi",3.1415926500000002,null,"p"]
["CS Amp Gain (effective value)",3.4140000000000001,null,null,null,"Effective CS gain - depending on control architecture"]
["Ri",{"$f":"CHOOSE(GPN, 0.139, 0.139*9.3/Ipk_OCP, 0.139*9.3/Ipk_OCP, 0.139*9.3/Ipk_OCP)","v":0.13900000000000001},"W",null,null,"Current Sense effective resistance = shunt resistor Rs * CS amp gain"]
[]
["Se_ext",{"$f":"B167/Ri*1000","v":2995199.9999999995},"A/s",null,null,"Slope comp slope - referred to inductor current"]
["Sn",{"$f":"(Vin-Vout)/Lf","v":10564946.619217081},"A/s",null,null,"On-time Slope"]
["Sf",{"$f":"Vout/Lf","v":2780249.1103202845},"A/s",null,null,"Off-time Slope"]
[]
["Se_int",{"$f":"6*0.6*Ri*Fsw/1000","v":416.33279999999996},"mV/μs",null,null,"Slope comp slope - referred to IC"]
["Sn_int",{"$f":"Sn*Ri/1000","v":1468.5275800711743},"mV/μs",null,null,"Upslope"]
["Sf_int",{"$f":"Sf*Ri/1000","v":386.45462633451962},"mV/μs",null,null,"Downslope"]
[]
["mc_buck",{"$f":"1+Se_ext/Sn","v":1.2835035621052631},null,null,null,"mc = 1 + Se/Sn for peak current-mode buck"]
["k_buck",{"$f":"mc_buck*(1-D1_Vinnom_2)","v":1.0061981102256643},null,null,null,"mc*(1-d)"]
[]
["mc",{"$f":"1+Se_ext/Sn","v":1.2835035621052631}]
["k",{"$f":"mc_buck*(1-D1_Vinnom_2)","v":1.0061981102256643}]
["Q",{"$f":"1/Pi/(k-0.5)","v":0.62882472320098048},null,null,null,"1/(Pi*(k-0.5))",null,"Q = 2/Pi = 0.636 gives ideal one-cycle damping"]
[]
["Error Amp (EA)"]
["gm",{"$f":"14.75/1000000*1","v":1.4749999999999999E-5},"S",null,null,"Error Amp Transconductance"]
["GBW",6,"MHz",null,null,"EA gain-bandwidth product"]
["Cbw",{"$f":"gm/(2*Pi*GBW*1000000)","v":3.9125590221465103E-13},"F",null,null,"EA effective bandwidth limiting capacitance = gm/(2*Pi*GBW)"]
[]
["RoEA",{"$f":"118300000","v":118300000},"W",null,null,"EA output resistance"]
["AEA",{"$f":"gm*RoEA","v":1744.925},"V/V",null,null,"EA DC gain = gm*RoEA"]
["Afb",{"$f":"Vref/Vout","v":0.2},"V/V",null,null,"Feedback gain from Vout to FB"]
["Acs",{"$f":"1/Ri","v":7.1942446043165464},null,null,null,"Acs = 1/Ri"]
["Am_buck",{"$f":"(Ro/Number_of_Phases)/Ri/((1+Ro/Number_of_Phases*(k-0.5)/(Fsw*Lf)))","v":6.320127189941533}]
["Am",{"$f":"Ro/Ri/((1+Ro*(k-0.5)/(Fsw*Lf)))","v":6.320127189941533},null,null,null,"Buck modulator gain"]
[]
["Scaling factor to calculate Rcomp - buck",{"$f":"2*Pi*Ri/gm","v":59211.034352542389},null,null,null,"2*Pi*Ri/gm -- scaling factor to calculate Rcomp given desired buck crossover frequency"]
["DC Gain is Adc = AEA*Afb*Am"]
[]
["Rout",{"$f":"Rout","v":1.25},"W",null,null,"Output Resistance (Load)"]
[]
["Fp_load_buck",{"$f":"1/(2*Pi*Ro*Cout)+(k-0.5)/(2*Pi*Fsw*Lf*Cout)","v":3019.4529252507027},"Hz",null,null,"Buck dominant pole frequency -- note slope comp influence"]
["Fp_dominant",{"$f":"Fload_u","v":3019.4529252507027},"Hz"]
["Cbw",{"$f":"Cbw","v":3.9125590221465103E-13},"F",null,null,"Cbw"]
["Fp_EA",{"$f":"1/(2*Pi*(RoEA+Rcea1_u)*Cc1ea_u)","v":74.177359840490496},"Hz",null,null,"Error Amp LF pole -- related to amplifier ouptut resistance and comp cap"]
["Fp_HF",{"$f":"1/(2*Pi*Rcea1_u*(Cc2ea_u+Cbw))","v":451977.40112994361},"Hz",null,null,"Error Amp HF pole cancels zero related to Output Cap ESR"]
["Fesr",{"$f":"1/(2*Pi*Cout*Cout_ESR)","v":1326291.1939479697},"Hz",null,null,"Cout ESR zero frequency"]
["F_mod",{"$f":"Fsw/2","v":416000},"Hz",null,null,"Zero-order sample-and-hold effects of current-mode control modeled as double pole at Fsw/2"]
["Fz_ff",{"$f":"IF(NO_FF_CAP=TRUE, 1000000000, 1/(2*Pi*Rfb2_u*Cff_u*0.000000000001))","v":179958.09958588463},"Hz"]
["Fp_ff",{"$f":"IF(NO_FF_CAP=TRUE, 1000000000, 1/(2*Pi*Rfb4_u*Cff_u*0.000000000001))","v":903389.65992114111},"Hz"]
[]
["Desired Crossover Frequency",{"$f":"'Design the Power Module'!E24*1000","v":80000},"Hz"]
["Cout - for the Fc spec",{"$f":"Rcea1_u/Fcross/(2*Pi*Ri/(gm*Afb))*1000000","v":37.999673956099208},"uF",null,null,"Output cap to meet the crossover frequeny spec"]
["Rcea1",{"$f":"Fcross*Cout*2*Pi*Ri/(gm*Afb)","v":1421064.8244610173},"W",null,null,"This component will largely determine the crossover frequency",null,null,null,null,{"$f":"Fcross/Fp_dominant/(gm*Afb*Am)","v":1421064.824461017}]
["Cc1ea, Cc3ea",{"$f":"10/(Rcea1*Fcross*2*Pi)","v":1.3999620261352328E-11},"F",null,null,"This along with Rcea1 will set a zero at Fcrossover/5 to optimize phase margin"]
["Cc2ea, Cc4ea",{"$f":"MAX(1/(Rcea1*2*Pi*Fesr)-Cbw, 1/(Rcea1*2*Pi*(Fsw/2))-Cbw)","v":-1.2203243565018321E-13},"F",null,null,"This along with Rcea1 places a pole at the output cap ESR zero"]
[]
[]
["Rcea1_u",{"$f":"900000","v":900000},"W",null,null,{"$f":"1/(Rcea1*2*Pi*(Fsw/2))-Cbw","v":-1.2203243565018321E-13}]
["Cc1ea_u",{"$f":"0.000000000018","v":1.7999999999999999E-11},"F"]
["Cc2ea_u",{"$f":"0","v":0},"F"]
[]
["Resulting Pole/Zero Locations",null,null,null,null,{"$f":"Cout","v":6.0000000000000002E-5},{"$f":"Cout_ESR","v":2E-3}]
["Fz1",{"$f":"1/(2*Pi*Rcea1_u*Cc1ea_u)","v":9824.3792144294057},"Hz",null,null,"This zero is set at or close to the dominant load pole"]
["Fp2",{"$f":"1/(2*Pi*Rcea1_u*(Cc1ea_u*(Cc2ea_u+Cbw)/(Cc1ea_u+Cc2ea_u+Cbw)))","v":461801.78034437296},"Hz",null,null,"This pole cancels the zero from the Output Cap ESR"]
[]
["Rfb1",{"$f":"'Design the Power Module'!E42*1000","v":10000},"W",null,null,"Lower Feedback Resistance - chosen by user"]
["Rfb2",{"$f":"IF(Vout=Vref,0,(Vout-Vref)*B220/Vref)","v":40000},"W",{"$f":"Rfb2_u","v":40200},null,"Upper Feedback Resistance"]
["Rfb2_u",{"$f":"IF(Vout=Vref,\"N/A\",'Standard Value Calculator'!O11)","v":40200},"W",null,null,"Std Value Upper Feedback Resistance"]
["Cff",{"$f":"1/(2*Pi*200000)/Rfb2_u","v":1.979539095444731E-11},"F",{"$f":"1/(1/Rfb1_+1/Rfb2_u)","v":8007.9681274900395},"W","Based on a 200kHz zero frequency"]
["Cff_u",{"$f":"IF('Design the Power Module'!E44<0.1, 0.1, 'Design the Power Module'!E44)","v":22},"pF"]
[]
[]
["Step 6: UVLO Divider"]
["VIN UVLO turn-on voltage",{"$f":"'Design the Power Module'!E47","v":8.9},"V"]
["VIN UVLO turn-off voltage",{"$f":"'Design the Power Module'!E51","v":6.4018943999999998},"V"]
["Rent",{"$f":"'Design the Power Module'!E48*1000","v":604000},"W"]
["Renb",{"$f":"B230*(1.263/(B228-1.263))","v":99888.961634149513},"W"]
["Renb_u",{"$f":"'Standard Value Calculator'!O7","v":100000},"W"]
[]
["Step 7: Efficiency"]
["VAR",0]
["Design"]
["Ta",{"$f":"'Design the Power Module'!E13","v":25},"°C","Ambient Temperature"]
["Components"]
["LTc",{"$f":"3930/1000000","v":3.9300000000000003E-3},"%/°C","Inductor DCR Temp Co"]
["θCA",22,"°C/W","Inductor Core-to-Ambient Thermal Resistance"]
["RCinEsr",{"$f":"RCinEsr","v":1E-3},"W","Input Capacitor ESR"]
[]
["Controller Characteristics"]
["VCC",3.3,"V"]
["Top Driver"]
["RdsonDRT",0.5,"W","Drain-Source Resistance of Pullup High-side FET Driver"]
["RdsonDRT2",0.5,"W","Drain-Source Resistance of Pulldown High-side FET Driver"]
["Bottom Driver"]
["RdsonDRB",0.5,"W","Drain-Source Resistance of Pullup Low-side FET Driver"]
["RdsonDRB2",0.5,"W","Drain-Source Resistance of Pulldown Low-side FET Driver"]
["Deadtime"]
["Deadtime",8.0000000000000005E-9,"s","Total Deadtime",null,null,"8ns"]
["IQ"]
["IQ ",3.4999999999999997E-5,"A","Quiescent Current of LM5143-Q1 Controller (One channel disabled)"]
[]
["High- & low-side MOSFETs - Ch1","Q1: high-side",null,"Q2: low-side"]
["Rdson",{"$f":"'MOSFET Parameters'!E6/1000","v":4.1000000000000002E-2},"W",{"$f":"'MOSFET Parameters'!F6/1000","v":2.1000000000000001E-2},"W","Drain-Source Resistances of Channel 1 FETs"]
["RdsonTopTc",{"$f":"4000/1000000","v":4.0000000000000001E-3},"%/°C",4.0000000000000001E-3,"%/°C","Drain-Source Resistance Temp Co"]
["Qg",{"$f":"'MOSFET Parameters'!E7/1000000000","v":3E-9},"C",{"$f":"'MOSFET Parameters'!F7/1000000000","v":6E-9},"C","Gate Charge at VCC = 5V"]
["Qgd",{"$f":"'MOSFET Parameters'!E8/1000000000","v":1.0000000000000001E-9},"C",{"$f":"'MOSFET Parameters'!F8/1000000000","v":2.0000000000000001E-9},"C","Gate to Drain Charge"]
["Qgs",{"$f":"'MOSFET Parameters'!E9/1000000000","v":1.0000000000000001E-9},"C",{"$f":"'MOSFET Parameters'!F9/1000000000","v":2.0000000000000001E-9},"C","Gate to Source Charge"]
["Qoss",{"$f":"'MOSFET Parameters'!E10/1000000000","v":0},"C",{"$f":"'MOSFET Parameters'!F10/1000000000","v":2.0000000000000001E-9},"C","Output Charge"]
["Coss",{"$f":"'MOSFET Parameters'!E11/1000000000000","v":1E-10},"F",{"$f":"'MOSFET Parameters'!F11/1000000000000","v":2.0000000000000001E-10},"F","Output Capacitance"]
["Rgate",{"$f":"'MOSFET Parameters'!E12","v":1},"W",{"$f":"'MOSFET Parameters'!F12","v":1},"W","Gate Resistance"]
["Gfs",{"$f":"'MOSFET Parameters'!E13","v":100},"S",{"$f":"'MOSFET Parameters'!F13","v":100},"S","Transconductance"]
["Vth",{"$f":"'MOSFET Parameters'!E14","v":1.5},"V",{"$f":"'MOSFET Parameters'!F14","v":1.5},"V","Threshold Voltage"]
["Vsp",{"$f":"Vth_Q1+(Iout/Number_of_Phases)/Gfs_Q1","v":1.54},"V",{"$f":"Vth_Q2+Iout/Gfs_Q2","v":1.54},"V","Switch Point Voltage of FETs"]
[]
["Vsd - Buck",{"$f":"'MOSFET Parameters'!E15","v":0.7},"V",{"$f":"'MOSFET Parameters'!F15","v":0.7},"V","Diode Forward Voltage of MOSFET Body diode"]
["QrrTop",null,"C",{"$f":"'MOSFET Parameters'!F16/1000000000","v":3E-9},"C","Reverse Recovery Charge of Body Diode"]
["TrrTop",4.0000000000000001E-8,"s",4.0000000000000001E-8,"s","Reverse Recovery Time of Body Diode"]
["θJA-MOSFET",{"$f":"'MOSFET Parameters'!E17","v":22},"°C/W",{"$f":"'MOSFET Parameters'!F17","v":22},"°C/W","Junction-to-Ambient Thermal Resistance"]
[]
[]
["Controller"]
["θJACtrl",22,"°C/W",null,null,"Junction-to-ambient thermal resistance of controller"]
["Outputs"]
["Top FET"]
["Tr",{"$f":"(Qgd_Q1+Qgs_Q1/2)*(RdsonDRT+Rgate1)/(VCC-Vsp_Q1)","v":1.2784090909090912E-9},"s"]
["Tf",{"$f":"(Qgd_Q1+Qgs_Q1/2)*(RdsonDRT2+Rgate1)/(Vsp_Q1)","v":1.4610389610389613E-9},"s"]
[]
["IC Power Disipation","Value","Units"]
["Power Dis",{"$f":"'Efficiency Calculations'!AT109","v":1.3769485915828896},"W"]
["Temp rise",{"$f":"B283*ThetaJaCtrl","v":30.292869014823573},"°C"]
["Junction temperature",{"$f":"B284 + Ta","v":55.292869014823573},"°C"]
[]
["Current (switching)",{"$f":"(Qg_Q1+Qg_Q2)*Fsw+Iq","v":7.5230000000000002E-3},"A"]
["Qrr Current",{"$f":"Qrr_Q2*Fsw","v":2.496E-3},"A"]
[]
[]
[]
["Low-side MOSFET/Diode"]
["Part Power"]
["Power Dis"]
[]
["SCHEMATIC LABELS"]
[{"$f":"\"RFBT = \"&'Design the Power Module'!E43&\"kΩ\"","v":"RFBT = 40.2kΩ"},{"$f":"IF(VARIANT<5, 'Design the Power Module'!E43&\" kΩ\", \"\")","v":"40.2 kΩ"},null,{"$f":"'Design the Power Module'!E43&\"kΩ\"","v":"40.2kΩ"}]
[{"$f":"\"RFBB = \"&'Design the Power Module'!E42&\"kΩ\"","v":"RFBB = 10kΩ"},{"$f":"IF(VARIANT<5, 'Design the Power Module'!E42&\" kΩ\", \"\")","v":"10 kΩ"},null,{"$f":"'Design the Power Module'!E42&\"kΩ\"","v":"10kΩ"}]
[{"$f":"\"CFF = \"&'Design the Power Module'!E44&\"pF\"","v":"CFF = 22pF"},{"$f":"IF(VARIANT< 5, IF(NO_FF_CAP=TRUE,\"N/A\",IF(Cff_u>0.1,ROUND(Cff_u,1)&\" pF\",\"N/A\")), \"\")","v":"22 pF"},null,{"$f":"IF(Cff_u>0, ROUND(Cff_u,1), \"N/A\")","v":22}]
[]
[{"$f":"\"RRT = \"&'Design the Power Module'!E12&\"kΩ\"","v":"RRT = 15.8kΩ"},{"$f":"'Design the Power Module'!E12&\" kΩ\"","v":"15.8 kΩ"},null,{"$f":"'Design the Power Module'!E12&\"kΩ\"","v":"15.8kΩ"}]
[{"$f":"\"RENT = \"&'Design the Power Module'!E48&\"kΩ\"","v":"RENT = 604kΩ"},{"$f":"'Design the Power Module'!E48&\" kΩ\"","v":"604 kΩ"},null,{"$f":"'Design the Power Module'!E48","v":604}]
[{"$f":"\"RENB = \"&Renb_u/1000&\"kΩ\"","v":"RENB = 100kΩ"},{"$f":"Renb_u/1000&\" kΩ\"","v":"100 kΩ"},null,{"$f":"Renb_u/1000","v":100}]
["RPG",{"$f":"CHOOSE(GPN, Renb_u/1000&\" kΩ\", Renb_u/1000&\" kΩ\", \"\", \"\")","v":"100 kΩ"}]
[{"$f":"\"Rdcr = \"&Rdcr*1000&\"mΩ\"","v":"Rdcr = 21mΩ"},{"$f":"Rdcr*1000&\"mΩ\"","v":"21mΩ"},null,{"$f":"IF(MODE=1, Rdcr2*1000&\"mΩ\", Rdcr*1000&\"mΩ\")","v":"0mΩ"}]
[]
[{"$f":"\"VOUT = \"&'Design the Power Module'!E9&\" V\"","v":"VOUT = 5 V"},{"$f":"'Design the Power Module'!E9&\" V\"","v":"5 V"},null,{"$f":"IF(MODE=1, 'Design the Power Module'!J10&\"V\", \"\")","v":"V"}]
[]
[{"$f":"\"COUT = \"&'Design the Power Module'!$E$26&\" µF\"","v":"COUT = 60 µF"},{"$f":"ROUND('Design the Power Module'!$E$26, 0)&\" µF\"","v":"60 µF"},null,{"$f":"IF(MODE=1, 'Design the Power Module'!$J$40&\"µF\", ROUND('Design the Power Module'!$E$26/Number_of_Phases, 0)&\"µF\")","v":"µF"},{"$f":"ROUND('Design the Power Module'!$E$26, 0)","v":60}]
["Capacitance per component (Cout)",{"$f":"\"22µF\"","v":"22µF"}]
["# of output caps",{"$f":"ROUNDUP(Cout*1000000/22,0)&\" x\"","v":"3 x"}]
[]
["CIN",{"$f":"Cin/2*1000000&\" µF\"","v":"10 µF"},{"$f":"Cin*1000000&\" µF\"","v":"20 µF"}]
["Capacitance per component (Cin)",{"$f":"\"10 µF\"","v":"10 µF"}]
["# of input caps",{"$f":"ROUNDUP(Cin*1000000/10,0)&\" x\"","v":"2 x"}]
[]
[{"$f":"\"CVCC = 1µF\"","v":"CVCC = 1µF"},{"$f":"CHOOSE(GPN, \"\", \"\", \"1 µF\", \"1 µF\")","v":""},null,{"$f":"IF(MODE=1, 'Design the Power Module'!$J$40&\"µF\", ROUND('Design the Power Module'!$E$26/Number_of_Phases, 0)&\"µF\")","v":"µF"}]
[]
[{"$f":"\"RC1 = \"&Rcea1_u/1000&\"kΩ\"","v":"RC1 = 900kΩ"},{"$f":"ROUND(Rcea1_u/1000,2)&\" kΩ\"","v":"900 kΩ"}]
[{"$f":"\"CC1 = \"&Cc1ea_u*10^9&\"nF\"","v":"CC1 = 0.018nF"},{"$f":"Cc1ea_u*10^9&\" nF\"","v":"0.018 nF"}]
[{"$f":"\"CC2 = \"&IF(Cc2ea_u>0, Cc2ea_u*10^12&\"pF\", \"OPEN\")","v":"CC2 = OPEN"},{"$f":"IF(Cc2ea_u>0, ROUND(Cc2ea_u*10^12,1)&\" pF\", \"N/A\")","v":"N/A"}]
[]
[{"$f":"\"gm = \"&$B$179*1000&\"mS\"","v":"gm = 0.01475mS"},{"$f":"$B$179*1000&\"mS\"","v":"0.01475mS"}]
[{"$f":"\"RoEA = \"&RoEA/1000000&\"MΩ\"","v":"RoEA = 118.3MΩ"},{"$f":"RoEA/1000000&\"MΩ\"","v":"118.3MΩ"}]
[{"$f":"\"GBW = \"&GBW&\"MHz\"","v":"GBW = 6MHz"},{"$f":"GBW&\"MHz\"","v":"6MHz"}]
[]
[{"$f":"\"RPGOOD = 100 kΩ\"","v":"RPGOOD = 100 kΩ"},{"$f":"CHOOSE(GPN, \"100 kΩ\", \"100 kΩ\", \"\", \"\")","v":"100 kΩ"}]
[{"$f":"\"RFB2 = \"&'Design the Power Module'!E42&\"kΩ\"","v":"RFB2 = 10kΩ"},{"$f":"IF(VOUT_setting=1, 'Design the Power Module'!E42&\"kΩ\", \"\")","v":{"$error":"#NAME?"}},null,{"$f":"'Design the Power Module'!#REF!&\"kΩ\"","v":{"$error":"#REF!"}}]
[{"$f":"\"RFB1 = \"&IF(Vout=Vref,\"OPEN\",'Design the Power Module'!E43&\"kΩ\")","v":"RFB1 = 40.2kΩ"},{"$f":"IF(VOUT_setting=1, IF(Vout=Vref,\"OPEN\",Rfb2_u/1000&\"kΩ\"), \"\")","v":{"$error":"#NAME?"}},null,{"$f":"IF(Vout2=Vref,\"OPEN\",Rfb4_u/1000&\"kΩ\")","v":"8.00796812749004kΩ"}]
[{"$f":"CHOOSE(BODE_PLOT_TYPE, \"Crossover Frequency = \"&ROUND('Stability Calculations'!Q4,1)&\" kHz\",  \"Crossover Frequency = \"&ROUND(#REF!,1)&\" kHz\")","v":"Crossover Frequency = 52.5 kHz"},{"$f":"CHOOSE(BODE_PLOT_TYPE, ROUND('Stability Calculations'!Q4,1)&\" kHz\", ROUND(#REF!,1)&\" kHz\")","v":"52.5 kHz"},null,{"$f":"'Stability Calculations'!Q4","v":52.481000000000002}]
[{"$f":"CHOOSE(BODE_PLOT_TYPE, \"Phase Margin = \"&ROUND('Stability Calculations'!Q5,0)&\"°\", \"Phase Margin = \"&ROUND(#REF!,0)&\"°\")","v":"Phase Margin = 59°"},{"$f":"CHOOSE(BODE_PLOT_TYPE, ROUND('Stability Calculations'!Q5,0)&\"°\", ROUND(#REF!,0)&\"°\")","v":"59°"}]
[]
["Full-load/high line efficiency",{"$f":"ROUND('Efficiency Calculations'!AZ109,1)&\"%\"","v":"93.6%"}]
["Half-load/mid-line efficiency",{"$f":"ROUND('Efficiency Calculations'!AZ59,1)&\"%\"","v":"94%"}]
[]
[]
["Rpgood","100 kΩ"]
[]
[]
["Rt",{"$f":"IF(No_RT,\"\", Rfadj&\"kΩ\")","v":""},{"$f":"Rfadj","v":15.8},{"$f":"Fsw","v":832000},{"$f":"'Design the Power Module'!K85&\"kΩ\"","v":"kΩ"},{"$f":"OR((Fsw=440000),(Fsw=2200000))","v":false},null,{"$f":"OR(OR(AND(OSC=1, OR(Fsw/1000>2530, Fsw/1000<1800)), AND(OSC=2, OR(Fsw/1000>500, Fsw/1000<300))), OR((Fsw=440000),(Fsw=2200000)))","v":true}]
[]
["Blank out",{"$f":"IF(B80=\"y\",\"\",\"|\")","v":"|"}]
["OUTPUT CURRENT",{"$f":"'Design the Power Module'!$E$10&\" A\"","v":"4 A"},null,{"$f":"IF(MODE=1,'Design the Power Module'!$J$11&\"A\",\"\")","v":"A"}]
["VIN",{"$f":"VIN_nom&\" V\"","v":"24 V"}]
["VIN range",{"$f":"VIN_min&\" V\"&\"...\"&VIN_max&\" V\"","v":"12 V...36 V"}]

{"sheet":"MOSFET Parameters","index":4,"n_rows":17,"n_cols":7,"rows_kept":17,"cut":false,"hidden":true,"merged":[]}
[]
[]
["MOSFET Parameters"]
[null,null,null,null,"Internal Power MOSFETs"]
[null,null,null,null,"High-side","  Low-side"]
[null,null,null,"On-State Resistance, RDS(on) ",41,21,"mΩ"]
[null,null,null,"Total Gate Charge, QG ",3,6,"nC"]
[null,null,null,"Gate-Drain Charge, QGD ",1,2,"nC"]
[null,null,null,"Gate-Source Charge, QGS ",1,2,"nC"]
[null,null,null,"Output Charge, QOSS ",null,2,"nC"]
[null,null,null,"Output Capacitance, COSS ",100,200,"pF"]
[null,null,null,"Gate Resistance, RGATE ",1,1,"Ω"]
[null,null,null,"Transconductance, gFS ",100,100,"S"]
[null,null,null,"Gate-Source Miller Plateau Voltage, VTH ",1.5,1.5,"V"]
[null,null,null,"Body Diode Forward Voltage, VBD ",0.7,0.7,"V"]
[null,null,null,"Body Diode Rev Recovery Charge, QRR ",null,3,"nC"]
[null,null,null,"Thermal Resistance, θJA ",22,22,"°C/W"]

{"sheet":"Schematic Management","index":5,"n_rows":15,"n_cols":14,"rows_kept":15,"cut":false,"hidden":true,"merged":[]}
[{"$f":"VARIANT","v":1},null,null,null,null,null,null,null,null,null,null,null,null,"3.3V or 5V fixed (FB1/2)"]
[{"$f":"CHOOSE(VARIANT, \"TPSM63606\", \"TPSM63604\", \"TPSM63603\", \"TPSM63602\", \"TPSM63603V5\", \"TPSM63603V3\")","v":"TPSM63606"},null,null,null,null,null,null,null,null,"With/without dither (DITH)",null,null,null,"With/without VOUT connected to VCCX"]
[null,null,null,null,null,null,null,null,null,"FPWM or DEM (DEMB)"]
[null,null,null,null,null,null,null,null,null,"Shunt or inductor DCR current sensing"]
[]
[]
[]
[]
[]
[]
[]
[]
[]
[]
[null," "]

{"sheet":"Stability Calculations","index":6,"n_rows":687,"n_cols":35,"rows_kept":687,"cut":false,"hidden":true,"merged":[[9,20,9,22],[10,14,10,15],[10,16,10,17],[9,27,9,28],[9,30,9,31],[10,18,10,19],[9,18,9,19],[9,1,10,1],[1,0,1,3],[1,9,1,11],[1,12,1,14],[9,0,11,0],[10,6,10,7],[1,4,1,6],[9,2,9,7],[9,8,9,13],[10,2,10,3],[10,4,10,5],[10,8,10,9],[10,10,10,11],[10,12,10,13]]}
[]
["Divider Network & EA Poles/Zeros",null,null,null,"Modulator",null,null,null,null,"Power Stage Poles/Zeros",null,null,"Complex Pole Pair",null,null,"Total System"]
[null,"Afb1",{"$f":"Afb","v":0.2},"V/V","Acs",{"$f":"Acs","v":7.1942446043165464},"A/V","gm",{"$f":"gm","v":1.4749999999999999E-5},"z_ESR",{"$f":"Fesr","v":1326291.1939479697},"Hz","p3",{"$f":"Fsw/2","v":416000},"Hz","Adc",{"$f":"Am*Afb*AEA","v":2205.6295873817462},"V/V"]
[null,"EA zero, z1",{"$f":"Fz1_u","v":9824.3792144294057},"Hz","Am",{"$f":"Am","v":6.320127189941533},"V/V",null,null,"p_dom",{"$f":"Fp_dominant","v":3019.4529252507027},"Hz","pterm1",{"$f":"Q*pole3","v":261591.08485160788},null,"Crossover",{"$f":"AI7","v":52.481000000000002},"kHz"]
[null,"EA pole, p1",{"$f":"Fp1_u","v":74.177359840490496},"Hz","Q",{"$f":"Q","v":0.62882472320098048},null,null,null,null,null,null,"pterm2",{"$f":"pole3^2","v":173056000000},null,"Phase Margin",{"$f":"AI9","v":58.692793315009226},"°"]
[null,"Aea",{"$f":"AEA","v":1744.925},"V/V","mc",{"$f":"mc","v":1.2835035621052631},null,"FF zero, z5",{"$f":"Fz_ff","v":179958.09958588463},null,null,null,null,null,null,"radconv",{"$f":"180/Pi","v":57.295779578552292},null,null,null,null,null,null,null,null,null,null,null,null,null,null,null,null,"XOVER SEARCH"]
[null,"EA pole, p2",{"$f":"Fp2_u","v":451977.40112994361},"Hz","k",{"$f":"k","v":1.0061981102256643},null,"FF pole, p5",{"$f":"Fp_ff","v":903389.65992114111},null,null,null,null,null,null,null,null,null,null,null,null,null,null,null,null,null,null,null,null,null,null,null,null,"xover",{"$f":"SUM(AH12:AH613)/1000","v":52.481000000000002}]
[]
[null,null,null,null,null,null,null,null,null,null,null,null,null,null,null,null,null,null,null,null,null,null,null,null,null,null,null,null,null,null,null,null,null,"phase margin",{"$f":"SUM(AI13:AI613)","v":58.692793315009226}]
["Freq (Hz)",null,"Power Stage",null,null,null,null,null,"Error Amplifier",null,null,null,null,null,null,"FF Network",null,null,"Sampling Double Pole",null,"System Response",null,null,null,null,null,null,"ERROR AMP Response",null,null,"PLANT Response"]
[null,null,"p_dom",null,"z_ESR",null,"z_RHP",null,"p1",null,"z1",null,"p2",null,"z3",null,"p3",null,"p3"]
[null,null,"Gain(V/V)","Phase(rad)","Gain(V/V)","Phase(rad)","Gain(V/V)","Phase(rad)","Gain(V/V)","Phase(rad)","Gain(V/V)","Phase(rad)","Gain(V/V)","Phase(rad)","Gain(V/V)","Phase(rad)","Gain(V/V)","Phase(rad)","Gain(V/V)","Phase(rad)","Gain (dB)","Phase (°)","Phase Margin (°)",null,null,"Fsquare",null,"Gain(dB)","Phase(Deg)",null,"Gain(dB)","Phase(Deg)"]
[1,{"$f":"A13/1000","v":1E-3},{"$f":"SQRT(1+(A13/pole1)^2)","v":1.0000000548420229},{"$f":"ATAN(A13/pole1)","v":3.3118581020951792E-4},{"$f":"SQRT(1+(A13/Zero1)^2)","v":1.0000000000002842},{"$f":"ATAN(A13/Zero1)","v":7.5398223599985732E-7},{"$f":"IF(VIN_nom>Vout, 1, SQRT(1+(A13/z_RHP)^2))","v":1},{"$f":"IF(VIN_nom>Vout, 0, -ATAN(A13/z_RHP))","v":0},{"$f":"SQRT(1+(A13/Pole2)^2)","v":1.0000908672803697},{"$f":"ATAN(A13/Pole2)","v":1.3480385764824765E-2},{"$f":"SQRT(1+(A13/Zero2)^2)","v":1.0000000051803579},{"$f":"ATAN(A13/Zero2)","v":1.0178760150846921E-4},{"$f":"SQRT(1+(A13/pole4)^2)","v":1.0000000000024476},{"$f":"ATAN(A13/pole4)","v":2.2124999999963895E-6},{"$f":"SQRT(1+(A13/Zero3)^2)","v":1.0000000000154392},{"$f":"ATAN(A13/Zero3)","v":5.5568490792628044E-6},{"$f":"SQRT(1+(A13/pole5)^2)","v":1.0000000000006126},{"$f":"ATAN(A13/pole5)","v":1.1069420476728545E-6},{"$f":"SQRT((1-(Z13/pterm2))^2+(A13/pterm1)^2)","v":1.0000000000015281},{"$f":"IF((ATAN((A13/pterm1)/(1-A13^2/pterm2))>0),ATAN((A13/pterm1)/(1-A13^2/pterm2)),PI()+ATAN((A13/pterm1)/(1-A13^2/pterm2)))","v":3.8227602464670185E-6},{"$f":"20*LOG10(((E13*K13*G13*O13)/(C13*I13*S13*M13*Q13))*Adc)","v":66.869861920888155},{"$f":"((F13+L13+H13+R13)-(D13+J13+T13+N13+T13))*radconv","v":-0.785970960478378},{"$f":"IF(V13>0,V13,V13+180)","v":179.21402903952162},null,{"$f":"IF(U13<0,A13,1000000000)","v":1000000000},{"$f":"A13^2","v":1},null,{"$f":"20*LOG10((K13/(I13*M13))*AEA)","v":64.834746116504917},{"$f":"(L13-(J13+N13))*radconv","v":-0.76666397834771238},null,{"$f":"20*LOG10((E13*G13/(C13*S13))*Acs*Am)","v":33.154219885892921},{"$f":"(F13+H13-(D13+T13))*radconv","v":-1.9151377209772027E-2},null,{"$f":"SUM((U14<0)*(U13>0))*A13","v":0},{"$f":"IF(AH13>0,W11,0)","v":0}]
[1.0965,{"$f":"A14/1000","v":1.0965E-3},1.0000000659372357,3.6314523820862068E-4,1.0000000000003417,8.2674152177381173E-7,1,0,1.0001092498402124,1.4781061860808258E-2,1.0000000062284078,1.1161010497605451E-4,1.0000000000029428,2.4260062499952398E-6,1.0000000000185629,6.0930850153989776E-6,1.0000000000007367,1.2137619552731845E-6,1.0000000000018374,4.1916566102518559E-6,66.869702180727757,-0.86180678001209632,179.1381932199879,null,1000000000,1.2023122500000001,null,64.83458647269245,-0.84063667425972477,null,33.154219789518947,-2.0999484956611979E-2,null,0,0]
[1.2022999999999999,1.2022999999999999E-3,1.0000000792755301,3.9818469312887119E-4,1.0000000000004108,9.0651284234255179E-7,1,0,1.0001313482933727,1.620703045010868E-2,1.0000000074883384,1.2237923310533326E-4,1.0000000000035381,2.660088749993725E-6,1.0000000000223179,6.6809996479670331E-6,1.0000000000008855,1.3308764239168305E-6,1.0000000000022091,4.5961046443291547E-6,66.869510154202615,-0.94494782683007295,179.05505217316994,null,1000000000,1.4455252899999997,null,64.834394561993562,-0.92173504258599581,null,33.154219673661373,-2.3025700447686748E-2,null,0,0]
[1.3183,1.3183000000000001E-3,1.0000000953107664,4.3660224182004518E-4,1.0000000000004938,9.9397478171847286E-7,1,0,1.0001579143059665,1.7770398306901573E-2,1.0000000090030212,1.341865947266482E-4,1.0000000000042537,2.916738749991728E-6,1.0000000000268323,7.3255941411365159E-6,1.0000000000010647,1.4592817014466843E-6,1.0000000000026561,5.039544832920844E-6,66.869279312022229,-1.0361000095499251,178.96389999045007,null,1000000000,1.7379148900000001,null,64.834163859058947,-1.0106476156819646,null,33.15421953437793,-2.5247259900746378E-2,null,0,0]
[1.4454,1.4454000000000001E-3,1.0000001145749176,4.7869595101424133E-4,1.0000000000005937,1.0898059239139688E-6,1,0,1.0001898288177595,1.9483264278506246E-2,1.0000000108227061,1.4712379866692557E-4,1.0000000000051135,3.1979474999890977E-6,1.0000000000322555,8.0318696590764145E-6,1.0000000000012799,1.5999740357056321E-6,1.000000000003193,5.5254176602488877E-6,66.869002002798055,-1.1359687826073177,178.86403121739269,null,1000000000,2.0891811599999999,null,64.833886717119611,-1.1080624717278591,null,33.154219367047865,-2.768139952679852E-2,null,0,0]
[1.5849,1.5849E-3,1.0000001377581109,5.2489636158616418E-4,1.0000000000007141,1.1949864458358314E-6,1,0,1.0002282345741367,2.1363107143172626E-2,1.0000000130125826,1.6132316878842662E-4,1.000000000006148,3.5065912499856265E-6,1.0000000000387821,8.8070501055865641E-6,1.000000000001539,1.7543924513556235E-6,1.0000000000038387,6.0586927146338887E-6,66.868668302047851,-1.2455732884641924,178.75442671153581,null,1000000000,2.51190801,null,64.833553217686159,-1.2149736541477307,null,33.154219165676665,-3.0353016077336821E-2,null,0,0]
[1.7378,1.7378000000000001E-3,1.0000001656200943,5.7553465847768898E-4,1.0000000000008584,1.3102703297200504E-6,1,0,1.0002743893608368,2.3423348789453995E-2,1.0000000156444158,1.7688649266745079E-4,1.0000000000073914,3.8448824999810526E-6,1.0000000000466258,9.6566923297421286E-6,1.0000000000018501,1.9236438904442991E-6,1.0000000000046154,6.6431927563225601E-6,66.868267288291605,-1.3656961463893813,178.63430385361062,null,1000000000,3.0199488400000001,null,64.833152445876053,-1.3321444752780327,null,33.154218923665098,-3.3281260879819183E-2,null,0,0]
[1.9055,1.9055000000000001E-3,1.0000001991275458,6.3107450065096288E-4,1.0000000000010321,1.4367131506970118E-6,1,0,1.0003298933322702,2.568278281070786E-2,1.0000000188095182,1.9395627291208064E-4,1.0000000000088871,4.2159187499750212E-6,1.0000000000560589,1.0588575920248538E-5,1.0000000000022244,2.1092780718383577E-6,1.0000000000055491,7.2842696496602912E-6,66.867785069048736,-1.4974331923488648,178.50256680765114,null,1000000000,3.63093025,null,64.832670517603091,-1.4606437413769207,null,33.154218632616526,-3.6492945795180261E-2,null,0,0]
[2.0893000000000002,2.0893000000000001E-3,1.0000002393949774,6.9194642813691126E-4,1.0000000000012408,1.5752950856734971E-6,1,0,1.0003965909133921,2.8158831205864671E-2,1.000000022613166,2.1266483336008124E-4,1.0000000000106841,4.6225762499670746E-6,1.0000000000673952,1.1609924780901644E-5,1.0000000000026743,2.3127340201997165E-6,1.0000000000066711,7.9868929829679298E-6,66.867205634930329,-1.6418003155422694,178.35819968445773,null,1000000000,4.3651744900000002,null,64.832091433156435,-1.6014622426544765,null,33.154218282850202,-4.001296752656873E-2,null,0,0]
[2.2909000000000002,2.2909000000000002E-3,1.0000002878231222,7.587134547650603E-4,1.0000000000014917,1.7272979044506825E-6,1,0,1.0004767997314541,3.0874272790877361E-2,1.0000000271876723,2.3318521287456526E-4,1.0000000000128453,5.0686162499565941E-6,1.000000000081029,1.2730185555126516E-5,1.0000000000032154,2.5358935370093422E-6,1.0000000000080207,8.7575614486650502E-6,66.866508873272167,-1.8001257688469772,178.19987423115302,null,1000000000,5.2482228100000006,null,64.831395092035521,-1.7558954102357907,null,33.154217862199246,-4.3873883297909241E-2,null,0,0]
[2.5118999999999998,2.5118999999999996E-3,1.0000003460334597,8.3190547516946234E-4,1.0000000000017935,1.8939279786061355E-6,1,0,1.0005732017420113,3.3850497061974988E-2,1.0000000326862015,2.5568027154065611E-4,1.0000000000154432,5.5575787499427797E-6,1.0000000000974163,1.39582492014374E-5,1.0000000000038658,2.7805277295434127E-6,1.000000000009643,9.6023914631467635E-6,66.865671517672794,-1.9736568427746148,178.0263431572254,null,1000000000,6.309641609999999,null,64.83055824191932,-1.9251596436136198,null,33.154217356579373,-4.8106335160199881E-2,null,0,0]
[2.7542,2.7542000000000001E-3,1.0000004160105416,9.1215173885207071E-4,1.0000000000021561,2.0766178743882155E-6,1,0,1.0006890783470879,3.7112878864699328E-2,1.0000000392962138,2.8034340569852242E-4,1.0000000000185665,6.0936674999245735E-6,1.0000000001171165,1.5304673733068193E-5,1.0000000000046474,3.0487397876923755E-6,1.0000000000115929,1.0528646270882372E-5,66.864665110828966,-2.1638732520086097,177.83612674799139,null,1000000000,7.5856176399999997,null,64.829552442737935,-2.1106979744080219,null,33.15421674875261,-5.2746710527458635E-2,null,0,0]
[3.02,3.0200000000000001E-3,1.0000005001810748,1.0001808498863662E-3,1.0000000000025924,2.277026352716065E-6,1,0,1.0008284404400467,4.0690758560215368E-2,1.0000000472469355,3.0739854793477379E-4,1.000000000022323,6.6817499999005609E-6,1.0000000001408125,1.6781684217971022E-5,1.0000000000055878,3.3429649839609328E-6,1.0000000000139384,1.1544735944415457E-5,66.863454882949299,-2.3724859990009919,177.62751400099901,null,1000000000,9.1204000000000001,null,64.828342945772832,-2.314178929980145,null,33.154216017640394,-5.7837142159742387E-2,null,0,0]
[3.3113000000000001,3.3113000000000001E-3,1.0000006013265865,1.0966551738100505E-3,1.0000000000031166,2.4966613780616128E-6,1,0,1.0009958825438603,4.4610688418380409E-2,1.0000000568011089,3.3704927327583644E-4,1.000000000026837,7.3262512498689221E-6,1.0000000001692873,1.8400394354275685E-5,1.0000000000067177,3.6654172024442049E-6,1.000000000016757,1.2658306004240684E-5,66.862001029361764,-2.6010436199125446,177.39895638008747,null,1000000000,10.964707690000001,null,64.826889970505974,-2.5371124328750256,null,33.154215139082197,-6.3415932462956751E-2,null,0,0]
[3.6307999999999998,3.6308E-3,1.0000007229661683,1.2024689041097451E-3,1.0000000000037472,2.7375587024619618E-6,1,0,1.0011972146444768,4.8908515162809578E-2,1.000000068291147,3.6957040800769664E-4,1.0000000000322657,8.033144999827201E-6,1.0000000002035316,2.0175807634457446E-5,1.0000000000080767,4.0190851866706015E-6,1.0000000000201468,1.3879677903025868E-5,66.860253239904935,-2.8516367049843674,177.14836329501563,null,1000000000,13.182708639999998,null,64.825143237334757,-2.7815369449518883,null,33.154214082510947,-6.9534789685688755E-2,null,0,0]
[3.9811000000000001,3.9811000000000004E-3,1.0000008691994895,1.3184831132141146E-3,1.0000000000045051,3.0016786797305857E-6,1,0,1.0014391995962415,5.3618572040883904E-2,1.000000082104304,4.0522659958428078E-4,1.0000000000387921,8.8081837497722078E-6,1.0000000002446998,2.2122371866071962E-5,1.00000000000971,4.406846985963674E-6,1.000000000024222,1.5218790817414887E-5,66.858153002413744,-3.1262677683441473,176.87373223165585,null,1000000000,15.849157210000001,null,64.823044269694464,-3.0494047827966781,null,33.154212812316658,-7.6243506796886532E-2,null,0,0]
[4.3651999999999997,4.3651999999999996E-3,1.0000010450126418,1.4456913444059285E-3,1.0000000000054161,3.2912832565753158E-6,1,0,1.0017300555170199,5.8780353016280706E-2,1.0000000987115658,4.443232103993789E-4,1.0000000000466387,9.6580049996997065E-6,1.0000000002941951,2.4256757596290185E-5,1.0000000000116742,4.832023426465911E-6,1.0000000000291211,1.6687113028151188E-5,66.855629274412379,-3.4272404518895332,176.57275954811047,null,1000000000,19.054971039999998,null,64.820522068407058,-3.3429616681712644,null,33.154211285189838,-8.3599537117567013E-2,null,0,0]
[4.7862999999999998,4.7862999999999994E-3,1.0000012563569245,1.5851533736823175E-3,1.0000000000065117,3.6087851761511341E-6,1,0,1.0020795805790506,6.4435752239928507E-2,1.0000001186750918,4.8718596023795919E-4,1.0000000000560707,1.058968874960415E-5,1.0000000003536935,2.659674674207792E-5,1.0000000000140352,5.2981567227291724E-6,1.0000000000350107,1.8296877368028797E-5,66.852597448241255,-3.7569986382202458,176.24300136177976,null,1000000000,22.908667689999998,null,64.81749207749229,-3.6645897023979943,null,33.154209449437197,-9.1664163989355882E-2,null,0,0]
[5.2481,5.2481000000000003E-3,1.0000015104882578,1.738094563860182E-3,1.0000000000078288,3.9569741727309482E-6,1,0,1.0024997063825167,7.0633000157117709E-2,1.0000001426802763,5.341914625090759E-4,1.0000000000674125,1.161142124947816E-5,1.0000000004252374,2.9162899644911861E-5,1.0000000000168743,5.8093425603289281E-6,1.0000000000420926,2.0062228049966706E-5,66.848954619628842,-4.1183560533970969,175.88164394660291,null,1000000000,27.542553609999999,null,64.813851455686859,-4.0170311771179046,null,33.154207242033465,-0.10050824609381968,null,0,0]
[5.7544000000000004,5.7544000000000007E-3,1.0000018159888526,1.9057733887053632E-3,1.0000000000094122,4.3387153788111765E-6,1,0,1.0030045222291244,7.7421170716830356E-2,1.0000001715377962,5.857265091603614E-4,1.0000000000810469,1.2731609999312092E-5,1.0000000005112428,3.1976332331140566E-5,1.0000000000202871,6.3697873190451255E-6,1.0000000000506057,2.1997691562910751E-5,66.844579476738787,-4.5141761124328053,175.48582388756719,null,1000000000,33.113119360000006,null,64.809478965679631,-4.4030761426630134,null,33.154204588433238,-0.11020455681296024,null,0,0]
[6.3095999999999997,6.3095999999999994E-3,1.0000021833163126,2.0896470229249953E-3,1.0000000000113161,4.7573263162297106E-6,1,0,1.0036111661351992,8.4856731221851264E-2,1.0000002062354791,6.4223896439421623E-4,1.0000000000974407,1.3959989999093149E-5,1.0000000006146541,3.5061494936510343E-5,1.0000000000243907,6.9843615438859265E-6,1.000000000060842,2.4120088051957658E-5,66.839324718396085,-4.9477539987727202,175.05224600122727,null,1000000000,39.811052159999996,null,64.804227397106132,-4.8259348342128643,null,33.154201397801458,-0.12083735975093081,null,0,0]
[6.9183000000000003,6.9183000000000005E-3,1.0000026248935101,2.2912388650384334E-3,1.0000000000136047,5.2162753032714895E-6,1,0,1.0043399492905951,9.2997970236908339E-2,1.0000002479467935,7.0419704954577216E-4,1.0000000001171481,1.530673874880456E-5,1.0000000007389684,3.8443948966520312E-5,1.0000000000293237,7.6581571682685275E-6,1.0000000000731473,2.6447002214257284E-5,66.833016181803799,-5.4224919660921715,174.57750803390783,null,1000000000,47.862874890000008,null,64.7979226950455,-5.2889206965454427,null,33.154197562232881,-0.13249474802243866,null,0,0]
[7.5857999999999999,7.5858000000000002E-3,1.0000031558443085,2.5123041253142168E-3,1.0000000000163567,5.7195584457864322E-6,1,0,1.0052155363013227,0.10191141790548057,1.0000002981003466,7.7214023673940807E-4,1.0000000001408442,1.678358249842408E-5,1.0000000008884438,4.2153145720938525E-5,1.0000000000352551,8.3970409850428109E-6,1.0000000000879434,2.8998694679137235E-5,66.825442917139242,-5.9422739959512638,174.05772600404873,null,1000000000,57.544361639999998,null,64.790354041005457,-5.7958153884855577,null,33.154192950361555,-0.14527821965669613,null,0,0]
[8.3176000000000005,8.3176000000000014E-3,1.0000037940995006,2.7546642280672756E-3,1.0000000000196647,6.271322646071386E-6,1,0,1.0062670704056851,0.11166480511460355,1.0000003583898927,8.4662835494870832E-4,1.0000000001693294,1.8402689997922586E-5,1.0000000010681278,4.6219647869239707E-5,1.0000000000423852,9.2071011754673301E-6,1.0000000001057296,3.1796190627981071E-5,66.816356527031346,-6.5110555865120849,173.48894441348793,null,1000000000,69.182469760000004,null,64.781273193319436,-6.3504682253880036,null,33.154187406440904,-0.15929310163392868,null,0,0]
[9.1201000000000008,9.1201000000000008E-3,1.0000045615421072,3.0204386328861917E-3,1.0000000000236424,6.876393390435219E-6,1,0,1.0075299902777402,0.12233594145589938,1.0000004308825201,9.2831284106087235E-4,1.0000000002035803,2.0178221247261403E-5,1.0000000012841814,5.0679019244918973E-5,1.0000000000509588,1.0095422168642357E-5,1.0000000001271159,3.4863955726403299E-5,66.8054560636308,-7.1333819429695398,172.86661805703045,null,1000000000,83.176224010000013,null,64.770379394161878,-6.9573008551873956,null,33.154180740395759,-0.17466195534293369,null,0,0]
[10,0.01,1.0000054841874071,3.3118461146602199E-3,1.0000000000284244,7.5398223598571242E-6,1,0,1.0090462237975963,0.13400411169763218,1.0000005180356604,1.0178756670694105E-3,1.0000000002447578,2.2124999996389819E-5,1.0000000015439285,5.5568490736004154E-5,1.0000000000612661,1.1069420476280947E-5,1.0000000001528271,3.8227602468103941E-5,66.792387224608149,-7.8138868701890756,172.18611312981093,null,1000000000,100,null,64.757318567109394,-7.6208177357114231,null,33.154172726258977,-0.19151308526849398,null,0,0]
[10.965,1.0964999999999999E-2,1.000006593702043,3.6314365786478107E-3,1.0000000000341751,8.2674152175516415E-6,1,0,1.0108665399523455,0.14675859394881641,1.0000006228405878,1.1161005909597441E-3,1.0000000002942753,2.4260062495240568E-5,1.0000000018562842,6.0930850079340485E-5,1.0000000000736609,1.2137619552141761E-5,1.0000000001837459,4.1916566107045379E-5,66.776723299471158,-8.5577903479497692,171.44220965205022,null,1000000000,120.23122499999999,null,64.74166427664909,-8.34609019589581,null,33.154163088976887,-0.20999394409606692,null,0,0]
[12.023,1.2022999999999999E-2,1.0000079275219071,3.9818260977272091E-3,1.0000000000410882,9.0651284231796871E-6,1,0,1.0130505337405133,0.16068706376327707,1.0000007488335618,1.2237917262185839E-3,1.0000000003538037,2.6600887493725668E-5,1.0000000022317879,6.6809996381260542E-5,1.0000000000885616,1.3308764238390401E-5,1.0000000002209155,4.5961046449259243E-5,66.757967046393418,-9.3702232528628269,170.62977674713719,null,1000000000,144.55252899999999,null,64.722919606030004,-9.1380966040964591,null,33.154151503386061,-0.23025581080207574,null,0,0]
[13.183,1.3183E-2,1.000009531031669,4.3659949540044438E-3,1.0000000000493992,9.9397478168606572E-6,1,0,1.015669904489686,0.17588622581540495,1.0000009003017158,1.3418651499314065E-3,1.0000000004253682,2.9167387491728741E-5,1.0000000026832163,7.3255941281634535E-5,1.0000000001064753,1.4592817013441353E-5,1.0000000002656004,5.0395448337075487E-5,66.735524951504829,-10.256848748670976,169.74315125132904,null,1000000000,173.79148899999998,null,64.700491435479137,-10.002326383572914,null,33.154137575282874,-0.25247102542541233,null,0,0]
[14.454000000000001,1.4454E-2,1.0000114574267898,4.7869233119177739E-3,1.0000000000593838,1.0898059238712556E-5,1,0,1.0188078165433943,0.1924458003965209,1.0000010822700367,1.4712369357673769E-3,1.0000000005113434,3.1979474989098333E-5,1.0000000032255465,8.0318696419776826E-5,1.0000000001279958,1.5999740355704705E-5,1.0000000003192837,5.5254176612857792E-5,66.708716116401391,-11.222929816897969,168.77707018310204,null,1000000000,208.91811600000003,null,64.67369932851139,-10.943868782107593,null,33.154120842623492,-0.27681192126310367,null,0,0]
[15.849,1.5848999999999999E-2,1.0000137757171654,5.2489158928881391E-3,1.0000000000713998,1.1949864457795191E-5,1,0,1.0225713295068544,0.21049843306088473,1.0000013012574154,1.6132303023939385E-3,1.0000000006148091,3.5065912485627426E-5,1.0000000038782064,8.8070500830438958E-5,1.0000000001538947,1.754392451177429E-5,1.0000000003838876,6.0586927160009072E-5,66.676671013466148,-12.276243272105534,167.72375672789445,null,1000000000,251.19080099999999,null,64.641674356749249,-11.970249663264187,null,33.15410070600641,-0.3035274264492131,null,0,0]
[17.378,1.7378000000000001E-2,1.0000165618736649,5.7552836747585788E-3,1.0000000000858404,1.3102703296458175E-5,1,0,1.0270761418315177,0.23012605779619555,1.0000015644403732,1.7688631002692771E-3,1.0000000007391561,3.8448824981053539E-5,1.0000000046625852,9.6566923000255297E-5,1.0000000001850204,1.923643890209397E-5,1.0000000004615301,6.6431927581246135E-5,66.638468523429481,-13.421619554512699,166.57838044548731,null,1000000000,301.99488400000001,null,64.603496060599653,-13.086106447875512,null,33.154076505576661,-0.3328090043207243,null,0,0]
[19.055,1.9054999999999999E-2,1.0000199125583005,6.3106620700430806E-3,1.0000000001032072,1.4367131505991474E-5,1,0,1.032467698969364,0.25144744622361237,1.0000018809500684,1.9395603212983734E-3,1.0000000008886984,4.215918747502212E-5,1.0000000056058969,1.0588575881071951E-4,1.0000000002224527,2.1092780715286762E-5,1.0000000005549048,7.2842696520360124E-5,66.592965525306568,-14.666054135095228,165.33394586490476,null,1000000000,363.09302500000001,null,64.558022158414758,-14.298164377282337,null,33.154047401770271,-0.36492470604371346,null,0,{"$f":"IF(AH45>0,W43,0)","v":0}]
[20.893000000000001,2.0893000000000002E-2,1.0000239392140688,6.9193549565008698E-3,1.0000000001240776,1.575295085544494E-5,1,0,1.0389099629484977,0.27454991456242056,1.0000022613140789,2.1266451596527952E-3,1.0000000010684105,4.6225762467074591E-5,1.0000000067395176,1.1609924729259749E-4,1.000000000267437,2.3127340197914992E-5,1.0000000006671173,7.9868929860995604E-5,66.538905110490177,-16.014726601894992,163.98527339810499,null,1000000000,436.51744900000006,null,64.503996709256754,-15.611352136866717,null,33.154012426656109,-0.40012341141400226,null,0,0]
[22.909000000000002,2.2909000000000002E-2,1.0000287819021687,7.5869904249479805E-3,1.000000000149178,1.7272979042806173E-5,1,0,1.0466053124694097,0.29954781549239018,1.0000027187635778,2.3318479445156165E-3,1.0000000012845436,5.0686162456594274E-5,1.0000000081028813,1.2730185487046738E-4,1.0000000003215379,2.5358935364711877E-5,1.0000000008020709,8.7575614527934969E-5,66.474766555301144,-17.474419995535364,162.52558000446464,null,1000000000,524.82228100000009,null,64.439900205595407,-17.032124667040964,null,33.153970363756329,-0.43873057535895349,null,0,0]
[25.119,2.5118999999999999E-2,1.0000346027532707,8.3188647672801166E-3,1.0000000001793481,1.8939279783819518E-5,1,0,1.0557808505679351,0.32651383360472869,1.0000032686148632,2.5567971996650614E-3,1.000000001544334,5.5575787442781596E-5,1.0000000097416359,1.3958249111693121E-4,1.0000000003865666,2.7805277288340058E-5,1.0000000009642847,9.6023914685889773E-5,66.398903868067819,-19.049516315164379,160.95048368483563,null,1000000000,630.96416099999999,null,64.364088063507779,-18.564555208852795,null,33.153919804941424,-0.48105246630010845,null,0,0]
[27.542000000000002,2.7542000000000001E-2,1.0000416001975216,9.1212669542984019E-3,1.0000000002156171,2.0766178740926974E-5,1,0,1.0667066852300213,0.35552225900956402,1.0000039296137408,2.8034267861728021E-3,1.0000000018566391,6.0936674924575044E-5,1.0000000117116519,1.5304673614767808E-4,1.0000000004647407,3.0487397867572389E-5,1.0000000011592882,1.0528646278056266E-4,66.30942411982538,-20.74453030576132,159.25546969423868,null,1000000000,758.56176400000004,null,64.274669076924582,-20.212791878570521,null,33.153859026849844,-0.52745275645486589,null,0,0]
[30.2,3.0199999999999998E-2,1.0000500168691377,1.0001478339474285E-2,1.0000000002592424,2.2770263523264656E-5,1,0,1.0797021438182048,0.38663976017308893,1.0000047246824999,3.0739758938001182E-3,1.000000002232289,6.6817499900562671E-5,1.0000000140812462,1.6781684062008387E-4,1.0000000005587706,3.3429649827280854E-5,1.0000000013938448,1.1544735953873237E-4,66.204179001639943,-22.563580764167593,157.4364192358324,null,1000000000,912.04,null,64.169497043564277,-21.980528990686963,null,33.153785922259395,-0.57835250486346634,null,0,0]
[33.113,3.3112999999999997E-2,1.0000601308688639,1.0966116533890747E-2,1.0000000003116658,2.4966613775480508E-5,1,0,1.0951144629563481,0.41985868037309443,1.0000056800949293,3.3704800972946571E-3,1.0000000026836977,7.3262512368923674E-5,1.0000000169287255,1.8400394148688836E-4,1.0000000006717642,3.6654172008190892E-5,1.0000000016757051,1.2658306016707742E-4,66.080988454867381,-24.506500687856452,155.49349931214354,null,1000000000,1096.470769,null,64.046394319280651,-23.867213752830224,null,33.153698076019033,-0.63413438927253074,null,0,0]
[36.308,3.6308E-2,1.0000722940297448,1.2024115323622082E-2,1.0000000003747114,2.7375587017849373E-5,1,0,1.1133670828553526,0.45519261257605237,1.0000068290916273,3.6956874228780195E-3,1.0000000032265708,8.0331449827203237E-5,1.0000000203531605,2.0175807363434094E-4,1.0000000008076522,4.019085184528226E-5,1.000000002014676,1.3879677919461086E-4,65.937315566824623,-26.574435685768151,153.42556431423185,null,1000000000,1318.2708640000001,null,63.902827045948897,-25.873470957012927,null,33.153592432744063,-0.6953150252766831,null,0,0]
[39.811,3.9810999999999999E-2,1.0000869162095121,1.3184074834646028E-2,1.0000000004505036,3.0016786788380888E-5,1,0,1.1349216046917383,0.49257488340341776,1.000008210397044,4.0522440372995541E-3,1.000000003879205,8.8081837272208297E-5,1.0000000244699665,2.2122371508791729E-4,1.000000000971015,4.4068469831394573E-5,1.0000000024221818,1.5218790839080835E-4,65.770650866363937,-28.763918704633991,151.23608129536601,null,1000000000,1584.9157210000001,null,63.736289310560437,-27.995332181786925,null,33.153465433332677,-0.76239173532721427,null,0,0]
[43.652000000000001,4.3652000000000003E-2,1.000104495859079,1.4455916463731533E-2,1.0000000005416272,3.2912832553987678E-5,1,0,1.1603061719275654,0.5319069215564719,1.0000098711083447,4.4432031568425023E-3,1.0000000046638531,9.658004969970987E-5,1.0000000294195142,2.4256757125299666E-4,1.0000000011674224,4.8320234227428426E-5,1.0000000029121172,1.6687113056712677E-4,65.578377863418666,-31.069709288801146,148.93029071119886,null,1000000000,1905.497104,null,63.544168950077555,-30.226978574348021,null,33.153312749585048,-0.835938248427606,null,0,0]
[47.863,4.7863000000000003E-2,1.0001256278801802,1.5850219532850308E-2,1.0000000006511665,3.6087851746001876E-5,1,0,1.1901044413615962,0.57302933554229529,1.0000118674394525,4.8718214438097556E-3,1.0000000056070752,1.0589688710415208E-4,1.0000000353693463,2.6596746121209638E-4,1.0000000014035231,5.2981567178213568E-5,1.0000000035010668,1.8296877405679071E-4,65.357962239430151,-33.483109198314828,146.51689080168518,null,1000000000,2290.8667689999997,null,63.323936809910194,-32.559095138386624,null,33.153129216135042,-0.91656634157486871,null,0,0]
[52.481000000000002,5.2481E-2,1.0001510375336875,1.7379213207552823E-2,1.0000000007828822,3.9569741706863713E-5,1,0,1.2249759710717798,0.61574645894084201,1.0000142679268584,5.3418643216858732E-3,1.0000000067412551,1.1611421197816295E-4,1.0000000425237348,2.9162898826435712E-4,1.0000000016874231,5.809342553859068E-5,1.0000000042092503,2.0062228099600188E-4,65.106912583619845,-35.993409463196343,144.00659053680366,null,1000000000,2754.255361,null,63.073107774350284,-34.980259961330184,null,33.152908536208351,-1.0049831999802881,null,0,0]
[57.544000000000004,5.7544000000000005E-2,1.0001815825640494,1.9055450215094624E-2,1.0000000009412224,4.3387153761159366E-5,1,0,1.2656252056621693,0.6597861501223653,1.0000171536339764,5.8571987799741401E-3,1.0000000081046947,1.2731609931209458E-4,1.0000000511242901,3.1976331252194195E-4,1.0000000020287094,6.3697873105163103E-5,1.0000000050605842,2.1997691628339493E-4,64.823121520743442,-38.585532584324604,141.4144674156754,null,1000000000,3311.3119360000005,null,62.78958191240028,-37.474663731310471,null,33.152643263542856,-1.1019147234034414,null,0,0]
[63.095999999999997,6.3095999999999999E-2,1.0002183080404028,2.0893459860255145E-2,1.0000000011316077,4.757326312676649E-5,1,0,1.3128355872406186,0.70484806237935638,1.0000206233373794,6.4223022274822001E-3,1.000000009744066,1.3959989909315289E-4,1.0000000614654194,3.506149351416454E-4,1.0000000024390652,6.9843615326426194E-5,1.0000000060842105,2.4120088138210598E-4,64.504728288221273,-41.242866054959741,138.75713394504027,null,1000000000,3981.1052159999995,null,62.471507530524015,-40.024846890692245,null,33.152324326639359,-1.2082011161223869,null,0,0]
[69.183000000000007,6.9183000000000008E-2,1.000262455254127,2.2908420490279607E-2,1.0000000013604764,5.2162752985877216E-5,1,0,1.3674331333207974,0.75057444496888592,1.000024794375046,7.0418552606430129E-3,1.0000000117148125,1.5306738630456283E-4,1.000000073896858,3.8443947091534972E-4,1.0000000029323686,7.6581571534472111E-5,1.0000000073147477,2.6447002327958886E-4,64.150466067063718,-43.945534821402084,136.05446517859792,null,1000000000,4786.2874890000012,null,62.117628580045732,-42.610049484620014,null,33.151940952266749,-1.324720121465524,null,0,0]
[75.858000000000004,7.5858000000000009E-2,1.0003155351476005,2.5117810463612847E-2,1.0000000016356674,5.7195584396119377E-5,1,0,1.4303242437138406,0.79659932206431505,1.0000298095948021,7.721250457150019E-3,1.0000000140844321,1.6783582342408515E-4,1.000000088844381,4.2153143249192395E-4,1.0000000035255148,8.3970409655042402E-5,1.0000000087943419,2.8998694829027215E-4,63.759480785679884,-46.673286762181476,133.32671323781852,null,1000000000,5754.4361640000006,null,61.727104097337914,-45.20900038950181,null,33.151480028910228,-1.4524824944924861,null,0,0]
[83.176000000000002,8.3176E-2,1.0003793387208921,2.753974745012339E-2,1.0000000019664743,6.2713226379320042E-5,1,0,1.5024452396956078,0.84252341090371252,1.0000358383535022,8.4660832988916312E-3,1.0000000169329497,1.8402689792258779E-4,1.0000001068127868,4.6219644610919348E-4,1.0000000042385355,9.2071011497110779E-5,1.0000000105729612,3.1796190825569956E-4,63.331696220799941,-49.403987329697358,130.59601267030263,null,1000000000,6918.2469760000004,null,61.299873393471991,-47.798508762902095,null,33.150926018017856,-1.5925359717657723,null,0,0]
[91.201000000000008,9.1201000000000004E-2,1.0004560512597245,3.019529791830838E-2,1.0000000023642392,6.8763933797053075E-5,1,0,1.5848243217802831,0.88797440926763382,1.0000430873330395,9.2828644283693661E-3,1.0000000203580304,2.0178220976140775E-4,1.0000001284181415,5.0679014949569742E-4,1.0000000050958773,1.0095422134688635E-4,1.0000000127115873,3.4863955986878993E-4,62.86744376860932,-52.117168490239166,127.88283150976083,null,1000000000,8317.6224010000005,null,60.836286814632921,-50.356878339661456,null,33.150259964451372,-1.7460988260169314,null,0,0]
[100,0.1,1.0005482699445565,3.3106481593652134E-2,1.0000000028424461,7.5398223457123084E-5,1,0,1.6785196382583363,0.93258093756758875,1.0000518022377261,1.0178408677042968E-2,1.000000024475781,2.2124999638982232E-4,1.0000001543928465,5.5568485073615641E-4,1.0000000061266034,1.10694204315211E-4,1.0000000152827178,3.8227602811478722E-4,62.367813041279305,-54.792453636415303,125.2075463635847,null,1000000000,10000,null,60.337456488111357,-52.86244866903683,null,33.149459346982304,-1.9144444750645069,null,0,0]
[109.65,0.10965000000000001,1.0006591551353912,3.6298574839468342E-2,1.0000000034175076,8.2674151989040306E-5,1,0,1.7846893733988209,0.97602230451034921,1.0000622821386487,1.1160547143081304E-2,1.0000000294275313,2.4260062024057509E-4,1.0000001856284078,6.0930842614413661E-4,1.0000000073660904,1.2137619493133272E-4,1.0000000183745992,4.1916566559728512E-4,61.834217484069207,-57.412503332036096,122.5874966679639,null,1000000000,12023.122500000001,null,59.804823247643817,-55.296406565552509,null,33.148496769697196,-2.0990346866115139,null,0,0]
[120.23,0.12023,1.0007924413513578,3.9797447210436529E-2,1.0000000041088275,9.0651283985966345E-5,1,0,1.9045047627123137,1.0179979262085976,1.0000748805806743,1.2237312481776159E-2,1.0000000353803602,2.6600886872567357E-4,1.0000002231787566,6.680998654028463E-4,1.0000000088561602,1.3308764160599801E-4,1.0000000220915559,4.5961047046029176E-4,61.268781763987263,-59.96115356579925,120.03884643420075,null,1000000000,14455.252900000001,null,59.240544110336558,-57.641079618389888,null,33.147339873706976,-2.3013655673799573,null,0,0]
[131.83000000000001,0.13183,1.0009526539341742,4.3632516709728703E-2,1.0000000049399294,9.9397477844535679E-5,1,0,2.0392487559414572,1.058274430821168,1.0000900261597476,1.3417854250360111E-2,1.0000000425368238,2.9167386672874671E-4,1.0000002683216116,7.3255928308576536E-4,1.0000000106475153,1.4592816910892375E-4,1.0000000265600648,5.0395449123779071E-4,60.673760353724461,-62.426235650539134,117.57376434946087,null,1000000000,17379.148900000004,null,58.64691273076857,-59.882583783978667,null,33.145949466465908,-2.5231384693244525,null,0,0]
[144.54,0.14454,1.0011450936229167,4.7833084577028423E-2,1.0000000059383847,1.0898059195999422E-4,1,0,2.1901910202061923,1.0966476794587658,1.0001082212063179,1.4711318592243174E-2,1.0000000511343399,3.1979473909833801E-4,1.000000322554599,8.0318679321051865E-4,1.0000000127995845,1.5999740220543288E-4,1.0000000319283695,5.5254177649747367E-4,60.052013199722964,-64.797249329401836,115.20275067059816,null,1000000000,20891.811599999997,null,58.02683492089173,-62.008710139111045,null,33.144279669972278,-2.7660480543465304,null,0,0]
[158.49,0.15849000000000002,1.0013766336449663,5.2441514683057938E-2,1.0000000071399631,1.1949864401482942E-4,1,0,2.3590702390860594,1.1330539264488133,1.0001301173609336,1.6130917749895099E-2,1.000000061480909,3.5065911062743936E-4,1.0000003878205825,8.8070478287780192E-4,1.0000000153894641,1.754392433357984E-4,1.000000038388787,6.058692852702615E-4,59.405017619659411,-67.072272075643795,112.9277279243562,null,1000000000,25119.080100000003,null,57.381847440626814,-64.015065799736377,null,33.142271025776132,-3.0325444511007515,null,0,0]
[173.78,0.17377999999999999,1.0016548318470575,5.7490051451232198E-2,1.0000000085840417,1.3102703222225235E-4,1,0,2.5472612963635242,1.1673628387581936,1.0001564319242309,1.7686804940227521E-2,1.0000000739156045,3.8448823105354663E-4,1.000000466258425,9.656689328367172E-4,1.000000018502029,1.9236438667191293E-4,1.0000000461530352,6.6431929383299734E-4,58.736181399827252,-69.245147909428738,110.75485209057126,null,1000000000,30199.488400000002,null,56.715423363248803,-65.893614173315413,null,33.139858229055221,-3.3244927117816272,null,0,0]
[190.55,0.19055000000000002,1.0019892970042641,6.3023881830438999E-2,1.0000000103207234,1.4367131408127211E-4,1,0,2.756620202623012,1.1995650964859121,1.0001880774971545,1.9393195933829852E-2,1.0000000888698506,4.2159185002213018E-4,1.000000560589543,1.0588571963415856E-3,1.0000000222452696,2.1092780405605134E-4,1.0000000554904971,7.2842698896079608E-4,58.047488213925973,-71.317181505571355,108.68281849442864,null,1000000000,36309.302500000005,null,56.029629300299263,-67.64302451254423,null,33.136958319267599,-3.6445064737967643,null,0,0]
[208.93,0.20893,1.002391091402143,6.9084537655586073E-2,1.000000012407773,1.5752950726441976E-4,1,0,2.9888779017157785,1.2296434814663801,1.0002261061015738,2.1263278509422306E-2,1.0000001068410502,4.6225759207460895E-4,1.0000006739515401,1.1609919565074614E-3,1.0000000267436928,2.3127339789698082E-4,1.0000000667117523,7.9868932992627336E-4,57.34171206462711,-73.28906989665758,106.71093010334242,null,1000000000,43651.744900000005,null,55.327334599660716,-69.261571164812153,null,33.133475925030893,-3.9949881936745126,null,0,0]
[229.09,0.22909000000000002,1.0028741014073197,7.5726277238582343E-2,1.0000000149177901,1.7272978872740887E-4,1,0,3.2462698607662102,1.2576580004903095,1.0002718397789396,2.3314296579566223E-2,1.0000001284543452,5.0686158159428505E-4,1.0000008102877931,1.2730178679075449E-3,1.0000000321537796,2.535893482655738E-4,1.0000000802071425,8.7575618656381181E-4,56.620396789931704,-75.166449881422324,104.83355011857768,null,1000000000,52482.2281,null,54.610202639133419,-70.751725812899622,null,33.129291473653439,-4.3790765344944935,null,0,0]
[251.19,0.25119000000000002,1.0034543688624873,8.2999448186363026E-2,1.0000000179348159,1.8939279559635679E-4,1,0,3.5309092940197759,1.283653528083879,1.0003268086185841,2.5562458417386733E-2,1.0000001544333958,5.5575781778162219E-4,1.0000009741631295,1.3958240137275609E-3,1.0000000386566716,2.7805276578932826E-4,1.0000000964285238,9.6023920128098926E-4,55.885812057793146,-76.95392193259886,103.04607806740114,null,1000000000,63096.416100000002,null,53.880640896103735,-72.115151194783095,null,33.124267117626154,-4.7996843341763533,null,0,0]
[275.42,0.27542,1.0041514888511436,9.0963478001887949E-2,1.0000000215617086,2.0766178445409141E-4,1,0,3.8452978079001849,1.3077141808259583,1.0003928849668839,2.8027000475621257E-2,1.0000001856639007,6.0936667457507112E-4,1.0000011711645047,1.5304661784745852E-3,1.0000000464740704,3.0487396932435927E-4,1.0000001159289309,1.0528646995445017E-3,55.139486463445557,-78.658695410743292,101.34130458925671,null,1000000000,75856.176400000011,null,53.140345964027404,-73.355588753520962,null,33.118234812125586,-5.2602499452168319,null,0,0]
[302,0.30199999999999999,1.0049893651160138,9.9686591409545444E-2,1.0000000259242448,2.2770263133665422E-4,1,0,4.1923349027198133,1.3299438717721002,1.0004723578051775,3.073017882081986E-2,1.0000002232288905,6.6817490056270612E-4,1.0000014081236348,1.6781668465771142E-3,1.0000000558770727,3.3429648594433256E-4,1.0000001393846141,1.1544736899650582E-3,54.382413583274371,-80.289458709526457,99.710541290473543,null,1000000000,91204,null,52.390515863490236,-74.477744978596036,null,33.110990055966795,-5.7647210386334748,null,0,0]
[331.13,0.33112999999999998,1.005995295886088,0.10922907444671207,1.0000000311665898,2.4966613261918544E-4,1,0,4.5746659656872293,1.3504217100800262,1.0005678498793542,3.3692174113885982E-2,1.0000002683697509,7.3262499392374287E-4,1.0000016928711295,1.8400373590046009E-3,1.000000067176414,3.665417038307572E-4,1.0000001675707024,1.2658307263412427E-3,53.616486304818764,-81.853133958707701,98.146866041292299,null,1000000000,109647.0769,null,51.6332760869835,-75.485021577450993,null,33.102300178881279,-6.3165869156455212,null,0,0]
[363.08,0.36307999999999996,{"$f":"SQRT(1+(A77/pole1)^2)","v":1.0072037175227457},{"$f":"ATAN(A77/pole1)","v":0.11967236169308111},{"$f":"SQRT(1+(A77/Zero1)^2)","v":1.0000000374711375},{"$f":"ATAN(A77/Zero1)","v":2.7375586340825097E-4},{"$f":"IF(VIN_nom>Vout, 1, SQRT(1+(A77/z_RHP)^2))","v":1},{"$f":"IF(VIN_nom>Vout, 0, -ATAN(A77/z_RHP))","v":0},{"$f":"SQRT(1+(A77/Pole2)^2)","v":4.9958608986423698},{"$f":"ATAN(A77/Pole2)","v":1.369269284979862},{"$f":"SQRT(1+(A77/Zero2)^2)","v":1.0006826784696108},{"$f":"ATAN(A77/Zero2)","v":3.6940230665615567E-2},{"$f":"SQRT(1+(A77/pole4)^2)","v":1.0000003226570409},{"$f":"ATAN(A77/pole4)","v":8.0331432720331919E-4},{"$f":"SQRT(1+(A77/Zero3)^2)","v":1.0000020353139978},{"$f":"ATAN(A77/Zero3)","v":2.0175780261164926E-3},{"$f":"SQRT(1+(A77/pole5)^2)","v":1.0000000807652254},{"$f":"ATAN(A77/pole5)","v":4.019084970290706E-4},{"$f":"SQRT((1-(Z77/pterm2))^2+(A77/pterm1)^2)","v":1.0000002014678648},{"$f":"IF((ATAN((A77/pterm1)/(1-A77^2/pterm2))>0),ATAN((A77/pterm1)/(1-A77^2/pterm2)),PI()+ATAN((A77/pterm1)/(1-A77^2/pterm2)))","v":1.3879679562980713E-3},{"$f":"20*LOG10(((E77*K77*G77*O77)/(C77*I77*S77*M77*Q77))*Adc)","v":52.842038821652501},{"$f":"((F77+L77+H77+R77)-(D77+J77+T77+N77+T77))*radconv","v":-83.359916295832974},{"$f":"IF(V77>0,V77,V77+180)","v":96.640083704167026},null,{"$f":"IF(U77<0,A77,1000000000)","v":1000000000},{"$f":"A77^2","v":131827.0864},null,{"$f":"20*LOG10((K77/(I77*M77))*AEA)","v":50.869253389619089},{"$f":"(L77-(J77+N77))*radconv","v":-76.382858342713831},null,{"$f":"20*LOG10((E77*G77/(C77*S77))*Acs*Am)","v":33.091872536694915},{"$f":"(F77+H77-(D77+T77))*radconv","v":-6.9205609076895334},null,{"$f":"SUM((U78<0)*(U77>0))*A77","v":0},{"$f":"IF(AH77>0,W75,0)","v":0}]
[398.11,{"$f":"A78/1000","v":0.39811000000000002},1.0086545480714257,0.13109224175451201,1.0000000450503734,3.0016785895884399E-4,1,0,5.4593685422040377,1.3865848918740724,1.000820706295523,4.0500503436887929E-2,1.0000003879204296,8.8081814720843339E-4,1.0000024469936919,2.2122335780873064E-3,1.0000000971014971,4.406846700717927E-4,1.0000002422185617,1.5218793005672498E-3,52.060095267765377,-84.818400563160722,95.181599436839278,null,1000000000,158491.57210000002,null,50.099809311215111,-77.175421576438524,null,33.079369627310442,-7.5810310974917998,null,0,0]
[436.52,0.43651999999999996,1.0103960925074171,0.14357450141344738,1.0000000541627259,3.2912831377439561E-4,1,0,5.9691742528862477,1.4024752813722843,1.0009866289880378,4.4403118654381658E-2,1.0000004663851942,9.6580019971006191E-4,1.000002941947119,2.4256710026413545E-3,1.0000001167422452,4.8320230504360394E-4,1.0000002912122783,1.6687115912856795E-3,51.271117233291655,-86.238029695245928,93.761970304754072,null,1000000000,190549.71039999998,null,49.325811632454879,-77.867139562212273,null,33.064385143095038,-8.3029654542808267,null,0,0]
[478.63,0.47863,1.0124856316375435,0.15720745337489586,1.0000000651166501,3.6087850195054734E-4,1,0,6.5295373599405746,1.4170410215383613,1.0011860476325551,4.8680110112393683E-2,1.0000005607073819,1.0589684791523781E-3,1.000003536928433,2.6596684034644719E-3,1.0000001403523135,5.2981562270397605E-4,1.0000003501074817,1.8296881170698932E-3,50.475543912537255,-87.627936986073024,92.372063013926976,null,1000000000,229086.67689999999,null,48.548177980702071,-78.46197958953131,null,33.046440511242572,-9.0914801886243062,null,0,0]
[524.80999999999995,0.52481,1.0149925063620657,0.17209043665412385,1.0000000782882199,3.9569739662286354E-4,1,0,7.145391029910467,1.4303850522891117,1.0014257864310498,5.3368425755580401E-2,1.00000067412529,1.1611416031633982E-3,1.0000042523645396,2.9162816979238478E-3,1.0000001687422906,5.8093419068731768E-4,1.0000004209262081,2.0062233062935779E-3,49.673276894487195,-88.997764737862241,91.002235262137759,null,1000000000,275425.53609999997,null,47.76738483791236,-78.963769623221211,null,33.02496066839953,-9.9523320636375363,null,0,0]
[575.44000000000005,0.57544000000000006,1.0179979420571719,0.18831933322172748,1.0000000941222513,4.3387151065919799E-4,1,0,7.8218102841184294,1.4425978193379914,1.0017139093673424,5.8505812321926608E-2,1.0000008104691376,1.2731603120952585E-3,1.0000051124160818,3.1976223358218567E-3,1.0000002028709318,6.3697864576349385E-4,1.000000506060108,2.1997698171193846E-3,48.864474128279994,-90.356200128296905,89.643799871703095,null,1000000000,331131.19360000006,null,46.984256783049474,-79.375577263038466,null,32.999278783214983,-10.891081526777118,null,0,0]
[630.96,0.63096000000000008,1.0215999089274537,0.20600070996661454,1.0000001131607621,4.7573259573705157E-4,1,0,8.5646790898749945,1.4537707923223937,1.0020602327245987,6.4135821497443402E-2,1.0000009744061291,1.3959980931539636E-3,1.000006146523251,3.5061351280633005E-3,1.0000002439065012,6.9843604083122315E-4,1.0000006084234725,2.4120096763473168E-3,48.04872781771806,-91.712296095469952,88.287703904530048,null,1000000000,398110.52160000004,null,46.19918148036929,-79.700203782071725,null,32.968599149673395,-11.913911776086074,null,0,0]
[691.83,0.69183000000000006,1.0259132220131781,0.22523651422184143,1.0000001360476309,5.2162748302109142E-4,1,0,9.3801565770702009,1.4639853202322628,1.0024764019593142,7.0303659411083921E-2,1.0000011714805697,1.5306726795645113E-3,1.0000073896587645,3.8443759594662865E-3,1.0000002932368131,7.6581556713161433E-4,1.0000007314782904,2.6447013698069448E-3,47.225766737325998,-93.074175397681898,86.925824602318102,null,1000000000,478628.74890000006,null,45.412806531206172,-79.939778325536182,null,32.932002649257178,-13.026744845342348,null,0,0]
[758.58,0.75858000000000003,1.0310756450246588,0.24613685995101311,1.0000001635667306,5.7195578221625549E-4,1,0,10.275346428007037,1.4733217244735604,1.0029765739146759,7.7061135380159212E-2,1.0000014084422157,1.6783566740878116E-3,1.0000088843990151,4.2152896077214006E-3,1.0000003525514245,8.3970390116481499E-4,1.0000008794392894,2.8998709817945455E-3,46.394782997625008,-94.450023569977404,85.549976430022596,null,1000000000,575443.61640000006,null,44.625409399338444,-80.096001700967818,null,32.888403573580703,-14.235982990062842,null,0,0]
[831.76,0.83175999999999994,1.0372473832046618,0.26880043636763901,1.0000001966474192,6.2713218239941043E-4,1,0,11.257627184642386,1.4818504269351056,1.00357750031534,8.4461439129487892E-2,1.0000016932935627,1.8402669225920279E-3,1.0000106812222167,4.6219318783059472E-3,1.0000004238534703,9.2070985740870753E-4,1.000001057303483,3.1796210584332835E-3,45.555152611564424,-95.846734429787801,84.153265570212199,null,1000000000,691824.69759999996,null,43.837601669682122,-80.169930958769498,null,32.836565929642553,-15.547377392756859,null,0,0]
[912.01,0.91200999999999999,1.0446200506500285,0.29333168373893309,1.0000002364239025,6.8763923067146075E-4,1,0,12.335591314997162,1.4896410326999947,1.0042995829231987,9.2566018493566854E-2,1.0000020358009918,2.0178193864143798E-3,1.0000128417325249,5.0678585421266237E-3,1.0000005095876141,1.0095418739318482E-3,1.0000012711693682,3.4863982034249816E-3,44.705631069765417,-97.271052589877911,82.728947410122089,null,1000000000,831762.24009999994,null,43.049583812246382,-80.162114603467629,null,32.775044224222874,-16.967024572107906,null,0,0]
[1000,1,1.053415420859467,0.31981655090455335,1.0000002842445657,7.5398209312312634E-4,1,0,13.518240181395269,1.4967545677856173,1.0051670089554323,0.10143824027555305,1.0000024475751297,2.2124963898328687E-3,1.0000154391666611,5.5567918845254305E-3,1.0000006126601608,1.1069415955539718E-3,1.0000015282871473,3.8227637148641998E-3,43.845116213522424,-98.728075435938621,81.271924564061379,null,1000000000,1000000,null,42.261875391512092,-80.072503448841928,null,32.7022161232832,-18.499966841574125,null,0,0]
[1096.5,1.0965,1.0638958951079345,0.34833718157031135,1.0000003417507135,8.2674133341437519E-4,1,0,14.81592440424382,1.5032500303451559,1.0062091311632062,0.11115010317167374,1.0000029427488326,2.4260014905917635E-3,1.0000185626702165,6.0930096138356437E-3,1.0000007366087706,1.2137613592289535E-3,1.0000018374821356,4.1916611827540733E-3,42.971975210902244,-100.2221173974624,79.777882602537602,null,1000000000,1202312.25,null,41.474699752912052,-79.90045022531271,null,32.616224705920345,-20.15104608025397,null,0,0]
[1202.3,1.2022999999999999,1.076360100803208,0.37894049663693574,1.0000004108826823,9.065125940292527E-4,1,0,16.239268429316287,1.5091782136751082,1.0074605088265165,0.12177372087055433,1.00000353802982,2.6600824756999905E-3,1.0000223176291105,6.6809002469044925E-3,1.0000008856156357,1.3308756381547901E-3,1.0000022091877216,4.5961106722228794E-3,42.08487098393482,-101.75500725891411,78.244992741085895,null,1000000000,1445525.2899999998,null,40.688735982984994,-79.644833505211338,null,32.515052928644209,-21.923089566918637,null,0,{"$f":"IF(AH90>0,W90,0)","v":0}]
[1318.3,1.3183,1.0911560574852099,0.411656688366766,1.0000004939928113,9.939744543746487E-4,1,0,17.80038058191111,1.5145881603903686,1.0089628548269152,0.13338979645373433,1.0000042536734211,2.9167304787885624E-3,1.0000268318047885,7.3254631044540842E-3,1.0000010647509752,1.4592806656007489E-3,1.0000026560529023,5.0395527792881254E-3,41.182000101153882,-103.32707328550126,76.672926714498743,null,1000000000,1737914.89,null,39.904416152557289,-79.303953360973154,null,32.396464223571051,-23.817985442671027,null,0,0]
[1445.4,1.4454,1.1086703065040835,0.44645960808634955,1.0000005938382996,1.0898054924689149E-3,1,0,19.511372850191353,1.5195217023332459,1.0107647661283683,0.14607585786661464,1.0000051134210328,3.197936598404348E-3,1.0000322549449208,8.0316969514729539E-3,1.0000012799576383,1.5999726704422285E-3,1.0000031929040478,5.5254281336714652E-3,40.262050641056177,-104.93518442183999,75.064815578160008,null,1000000000,2089181.1600000001,null,39.122736214454321,-78.875878638087073,null,32.258149467430364,-25.834393752786305,null,0,0]
[1584.9,1.5849000000000002,1.1293875512916349,0.48336579069062513,1.0000007139960481,1.1949858770262847E-3,1,0,21.389746125051499,1.5240279063225353,1.0129290030596807,0.15994513775008151,1.000006148072198,3.5065768775444043E-3,1.0000387813137879,8.8068224126796272E-3,1.0000015389452526,1.75439065141674E-3,1.0000038389756964,6.0587065225577502E-3,39.321502112434771,-106.57720728952977,73.422792710470233,null,1000000000,2511908.0100000002,null,38.342949426466873,-78.357097690879698,null,32.097333291024711,-27.973490465260728,null,0,0]
[1737.8,1.7378,1.1537938361144646,0.52223604474963448,1.0000008584038,1.3102695798938974E-3,1,0,23.448966100772079,1.5281375863287026,1.0155239199254997,0.1750755156280456,1.000007391533402,3.844863553713078E-3,1.0000466247664441,9.6563921791553986E-3,1.0000018502011971,1.9236415176975927E-3,1.0000046154437172,6.643210958365617E-3,38.35970852301412,-108.24292836570197,71.757071634298029,null,1000000000,3019948.84,null,37.566800268178923,-77.745040613647532,null,31.911623438967169,-30.227476341676287,null,0,0]
[1905.5,1.9055,1.1824783850497773,0.56295563479082966,1.000001032071806,1.43671216217129E-3,1,0,25.707887780814151,1.5318879433648314,1.0186358705373608,0.19157758974738764,1.0000088869459645,4.2158937723939666E-3,1.0000560573987975,1.0588180224156044E-2,1.0000022245245179,2.1092749437524993E-3,1.0000055492523632,7.2842936460097707E-3,37.374189908926311,-109.92220994215062,70.077790057849384,null,1000000000,3630930.25,null,36.794509508261349,-77.035679508026206,null,31.698316909523957,-32.590023703244995,null,0,0]
[2089.3000000000002,2.0893000000000002,1.2160551024677941,0.60530048241113776,1.0000012407765337,1.5752937826164816E-3,1,0,28.184022266817983,1.5353077819905776,1.022363111967409,0.20954310242566315,1.0000106840485192,4.6225433250269479E-3,1.0000673929058133,1.1609403188317866E-2,1.000002674365748,2.3127298968137937E-3,1.0000066714681599,7.9869246143231837E-3,36.364052600198285,-111.59920289253705,68.400797107462949,null,1000000000,4365174.4900000012,null,36.027486458197544,-76.225573076824404,null,31.455108105235521,-35.048522405892435,null,0,0]
[2290.9,2.2909000000000002,1.2552475163703367,0.64905452835313027,1.0000014917779125,1.7272961866242858E-3,1,0,30.900271857896438,1.5384285004326597,1.0268278071198087,0.22909146017110549,1.0000128453528434,5.0685728449475134E-3,1.0000810255295745,1.2729497948129562E-2,1.0000032153728462,2.5358881011315333E-3,1.0000080211376599,8.7576031481083946E-3,35.327278116534458,-113.2572644083111,66.742735591688898,null,1000000000,5248222.8100000005,null,35.266130142042115,-75.309894285362006,null,31.17957623416234,-37.590892109016927,null,0,0]
[2511.9,2.5119000000000002,1.300794772022583,0.693895127262809,1.0000017934799859,1.8939257141299605E-3,1,0,33.878194229615062,1.5412745268989589,1.032168786635276,0.25031761978815931,1.0000154432215347,5.5575215326719779E-3,1.0000974116158858,1.3957342800409729E-2,1.0000038656597559,2.7805205638538732E-3,1.0000096434643744,9.6024464317447534E-3,34.263695452379118,-114.87460045099144,65.125399549008563,null,1000000000,6309641.6100000003,null,34.51201052268577,-74.284804923969006,null,30.869976522623514,-40.19892796619456,null,0,0]
[2754.2,2.7542,1.3535217974590616,0.73948848632384279,1.0000021561685737,2.076614889370239E-3,1,0,37.143391379143026,1.5438703836462198,1.0385530459425232,0.27332712149683297,1.0000185662194481,6.0935920767348599E-3,1.0001171096617196,1.5303478948764895E-2,1.0000046473963473,3.048730341931114E-3,1.0000115937776282,1.0528718729317248E-2,33.17302262183339,-116.42831475936688,63.571685240633116,null,1000000000,7585617.6399999987,null,33.76631662235301,-73.145903801596262,null,30.524833305757006,-42.853839191876816,null,0,0]
[3020,3.02,1.4143416841869774,0.78548874689144554,1.0000025924211451,2.2770224173862988E-3,1,0,40.725510354767493,1.5462392247008125,1.0461806121435893,0.29823056477101412,1.000022322642381,6.6816505653432617E-3,1.0001408025499432,1.6780109105504728E-2,1.000005587691831,3.3429525310500058E-3,1.0000139397400725,1.1544831469455201E-2,32.055249318038449,-117.8945889652088,62.105411034791203,null,1000000000,9120400,null,33.030144048935341,-71.888459469474967,null,30.143034975363356,-45.536196447948967,null,0,0]
[3311.3,3.3113000000000001,1.4841339341494124,0.83146544747514117,1.0000031166541616,2.4966561905914015E-3,1,0,44.651504675225752,1.5483987923685496,1.0552735291001154,0.32509117531421916,1.0000268366185872,7.326120177921956E-3,1.0001692729295724,1.8398318143258222E-2,1.0000067176190708,3.6654007872868083E-3,1.00001675891835,1.2658431921313915E-2,30.912828815426895,-119.24706994809962,60.752930051900378,null,1000000000,10964707.690000001,null,32.30588111903667,-70.510119350389175,null,29.724639964771388,-48.221687868112198,null,0,0]
[3630.8,3.6308000000000002,1.5639478441316073,0.87706890604174925,1.0000037471068044,2.7375518638701767E-3,1,0,48.957763550415322,1.5503691365828167,1.0661061386707504,0.35400201850698132,1.0000322651887743,8.0329722099426494E-3,1.0002035108985636,2.0173070695929479E-2,1.0000080764902541,4.0190635467463572E-3,1.0000201494578731,1.3879843895025265E-2,29.747058362945275,-120.46277621869692,59.537223781303084,null,1000000000,13182708.640000001,null,31.59483252233851,-69.007042097402419,null,29.269632580105878,-50.890753023986981,null,0,0]
[3981.1,3.9811000000000001,1.6548110872595669,0.92191108879362693,1.0000045050273005,3.0016696646717632E-3,1,0,53.679330174292453,1.552166104572946,1.0789849929387108,0.38500394925011505,1.0000387912981044,8.8079559689307335E-3,1.00024466973693,2.2118764037647645E-2,1.0000097101030359,4.4068184588939036E-3,1.0000242257175287,1.5219009633269989E-2,28.56138182132382,-121.51923376224643,58.480766237753571,null,1000000000,15849157.209999999,null,30.899364696324465,-67.378124287538384,null,28.77908063271947,-53.521616552419836,null,0,0]
[4365.2,4.3651999999999997,1.7578470853364125,0.96565574908636354,1.0000054162580696,3.2912713723392594E-3,1,0,58.85664045910206,1.5538050729459187,1.094268313204553,0.41812311276652653,1.0000466374427643,9.6577047266991622E-3,1.0002941518819932,2.425200179968762E-2,1.0000116741570542,4.831985820277252E-3,1.0000291268092303,1.6687401477235207E-2,27.359438980430021,-122.39793493143532,57.602065068564684,null,1000000000,19054971.039999999,null,30.221697312574506,-65.623128983032359,null,28.254392554259134,-56.095540666109812,null,0,0]
[4786.3,4.7862999999999998,1.8742239533330953,1.0079989989146483,1.0000065116440231,3.60876951015526E-3,1,0,64.532827409667803,1.555299717310799,1.1123624397693945,0.45334395840653813,1.0000560691820344,1.0589292928744522E-2,1.0003536309413765,2.6590478011710307E-2,1.0000140351338371,5.2981071497066531E-3,1.0000350188153757,1.8297257593391406E-2,26.145748895932361,-123.08460935233707,56.915390647662932,null,1000000000,22908667.690000001,null,29.564360751456174,-63.744136061032911,null,27.697543076531609,-58.595676832774359,null,0,0]
[5248.1,5.2481,2.0052378405353366,1.0487049805663728,1.0000078287916569,3.9569535206471834E-3,1,0,70.757764923946667,1.5566631317589734,1.1337374356105026,0.49062522136691833,1.0000674102796496,1.1610899455186247E-2,1.000425146983112,2.9154636433096966E-2,1.0000168740881246,5.8092772095939887E-3,1.0000421042816254,2.0062729270820777E-2,24.924763595372148,-123.5705537064147,56.429446293585301,null,1000000000,27542553.610000003,null,28.929717421122014,-61.744728672096741,null,27.110604826108631,-61.009162386784411,null,0,0]
[5370.3,5.3703000000000003,2.0404169578133078,1.0585965501197925,1.000008197615543,4.0490886734153514E-3,1,0,72.405007068704151,1.5569846881423508,1.1396509602842899,0.50025216543694673,1.0000705859607608,1.1881229652642041E-2,1.0004451717997915,2.983309284092233E-2,1.0000176690431515,5.9445408557619343E-3,1.0000440884546387,2.0529906400346572E-2,24.619125870846847,-123.66013379706746,56.339866202932541,null,1000000000,28840122.090000004,null,28.774987428768046,-61.227058009716274,null,26.959530141017769,-61.597395898036069,null,0,0]
[5432.85,5.4328500000000002,2.0584991949115365,1.0635286423110408,1.0000083896885565,4.0962494800207494E-3,1,0,73.248176775013235,1.5571436857262286,1.1427184389378762,0.50514108430840354,1.0000722397618371,1.2019601764281263E-2,1.000455600000278,3.0180360878131907E-2,1.0000180830330367,6.0137776055195448E-3,1.0000451217766309,2.0769039035382686E-2,24.465338710255054,-123.70037896737084,56.299621032629162,null,1000000000,29515859.122500002,null,28.697756177229511,-60.963981620207541,null,26.882887290348918,-61.890983140653987,null,0,0]
[5495.4,5.4954000000000001,2.0766306333582465,1.0683747246967381,1.0000085839857298,4.1434102684047734E-3,1,0,74.091348290907263,1.5572990644775668,1.1458130836894782,0.51000371061964922,1.0000739127110745,1.2157973415625035E-2,1.0004661488482736,3.0527621634076886E-2,1.0000185018167325,6.0830142976196853E-3,1.0000461670788716,2.100817211236947E-2,24.313310898707261,-123.73699527633509,56.263004723664906,null,1000000000,30199421.159999996,null,28.621818905116427,-60.702204313228712,null,26.806708804435821,-62.179642410777369,null,0,0]
[5559.4,5.5593999999999992,2.0952319780222375,1.0732462174247819,1.0000087850890886,4.1916642933960907E-3,1,0,74.954067558513117,1.5574544268699719,1.149007355870721,0.514951828558745,1.0000756442607377,1.2299552241206083E-2,1.0004770671050349,3.0882924776030433E-2,1.0000189352702265,6.1538559366006154E-3,1.0000472490133061,2.1252849104714776E-2,24.159548566485309,-123.77083269283702,56.229167307162982,null,1000000000,30906928.359999996,null,28.545430349760945,-60.435711517035145,null,26.729244002358577,-62.470012591383572,null,0,0]
[5623.4,5.6233999999999993,2.1138821697958261,1.0780318624223959,1.000008988520918,4.2399182988671321E-3,1,0,75.816788594146928,1.5576062535212762,1.1522296038206319,0.51987239126473206,1.0000773958564115,1.2441130573685665E-2,1.0004881116595781,3.1238220118334884E-2,1.0000193737423491,6.2246975138141028E-3,1.0000483434909277,2.149752657049556E-2,24.007565278673766,-123.80112764287516,56.198872357124841,null,1000000000,31622627.559999995,null,28.470335959641147,-60.170594908108576,null,26.652263027605812,-62.755464087594028,null,0,0]
[5688.9,5.6888999999999994,2.1330187161699721,1.0828429057761089,1.0000091991316495,4.2893032371450245E-3,1,0,76.699731422467238,1.5577581020897242,1.1555560959551796,0.52487974111100788,1.0000792092612578,1.258602663184024E-2,1.0004995458391304,3.1601834525892956E-2,1.000019827687598,6.2971993757957104E-3,1.0000494766085426,2.1747939160266721E-2,23.853829937227996,-123.82859389391761,56.171406106082387,null,1000000000,32363583.209999997,null,28.394791118492147,-59.9006971097606,null,26.573977203149294,-63.042634603140378,null,0,0]
[5754.4,5.7543999999999995,2.1522037550528776,1.0875682842886896,1.0000094121812746,4.3386881545006721E-3,1,0,77.582675979074594,1.5579064943778873,1.1589113952327923,0.52985822046333164,1.0000810436625585,1.2730922161484909E-2,1.0005111122971342,3.1965440574359905E-2,1.0000202868894665,6.3697011715737944E-3,1.0000506228653614,2.1998352257454182E-2,23.70189371766358,-123.85260807114553,56.147391928854475,null,1000000000,33113119.359999996,null,28.320540950684968,-59.632255408315665,null,26.496194725653321,-63.324896915103153,null,0,0]
[5821.4,5.8213999999999997,2.1718769772607778,1.092315397228645,1.0000096326332091,4.3892040022646284E-3,1,0,78.485842367332779,1.558054830647696,1.1623730775991201,0.5349208455243748,1.0000829417961408,1.2879135356222636E-2,1.0005230804881264,3.2337364730543793E-2,1.0000207620459696,6.4438632445305098E-3,1.0000518089669563,2.2254500536780228E-2,23.548306695082108,-123.87373050299556,56.126269497004444,null,1000000000,33888697.959999993,null,28.245899278618158,-59.359179391484076,null,26.417149601551429,-63.608668322218314,null,0,0]
[5888.4,5.8883999999999999,2.1915982635597659,1.0969771790423024,1.0000098556370178,4.4397198276272627E-3,1,0,79.389010443272113,1.5581997918292292,1.1658643744284174,0.53995327785842051,1.0000848618986127,1.3027347985095415E-2,1.0005351870757311,3.2709279937525051E-2,1.0000212427025945,6.5180252466036474E-3,1.0000530088177166,2.2510649359369424E-2,23.396536427477649,-123.89150039413562,56.108499605864381,null,1000000000,34673254.559999995,null,28.17255108954437,-59.087639879747847,null,26.338626596992064,-63.887550648340095,null,0,0]
[5957,5.9569999999999999,2.2118389627490269,1.1016640499397172,1.0000100866103014,4.4914419775788752E-3,1,0,80.313748401224544,1.5583448367286417,1.1694694522260756,0.54507462226546255,1.0000868506162446,1.3179099426937783E-2,1.0005477261641942,3.3090067322255681E-2,1.0000217405362881,6.5939582072673539E-3,1.0000542515679081,2.2772915738160999E-2,23.242990634019026,-123.90635148762387,56.093648512376134,null,1000000000,35485849,null,28.098760682799021,-58.811213637204375,null,26.258766680115659,-64.168151865918674,null,0,0]
[6025.6,6.0256000000000007,2.2321273670928288,1.1062658199455329,1.0000103202587913,4.5431641034995003E-3,1,0,81.238488010353024,1.5584865795320149,1.1731050140749,0.55016435643291306,1.000088862364285,1.3330850261757654E-2,1.0005604103274606,3.3470845107669338E-2,1.0000222441359157,6.6698910918909539E-3,1.0000555087331826,2.3035182699709909E-2,23.091282107404218,-123.91794863407127,56.082051365928734,null,1000000000,36307855.360000007,null,28.026264668837783,-58.536409297034325,null,26.179448429344077,-64.443877196336643,null,0,0]
[6095.8,6.0958000000000006,2.2529370128563815,1.1108890166717988,1.0000105621263342,4.5960925512134147E-3,1,0,82.184797541489971,1.5586283260569449,1.1768566344450258,0.55534010871763162,1.0000909448758182,1.3486139838936623E-2,1.0005735405152798,3.3860493955029602E-2,1.000022765450524,6.7475949262590191E-3,1.0000568101441694,2.3303567285229181E-2,22.937902939820528,-123.92657837729099,56.073421622709006,null,1000000000,37158777.640000001,null,27.953386804810883,-58.256879450009208,null,26.098837671029628,-64.721111584293581,null,0,0]
[6166,6.1660000000000004,2.2737939307757058,1.1154274941747602,1.0000108067953259,4.6490209731759836E-3,1,0,83.131108686296415,1.5587668454818182,1.1806395800885074,0.56048283026814694,1.0000930515042965,1.3641428765646333E-2,1.0005868226124013,3.425013251690872E-2,1.0000232928031496,6.8252986791435171E-3,1.0000581266520405,2.3571952495193969E-2,22.786378907369766,-123.93206172944994,56.067938270550059,null,1000000000,38019556,null,27.881802421061728,-57.979057188167637,null,26.018787302814378,-64.993491955559563,null,0,0]
[6237.8,6.2378,2.295173777353039,1.1199839903238129,1.0000110599387693,4.7031557139907724E-3,1,0,84.098989788763205,1.5589052973188282,1.184540838241815,0.56570864401222587,1.0000952310946605,1.380025636043446E-2,1.0006005645713167,3.4648640967093566E-2,1.0000238384212115,6.9047733724663975E-3,1.000059488783551,2.3846455400415651E-2,22.633285348671958,-123.93454597206937,56.065454027930627,null,1000000000,38910148.840000004,null,27.809893352388542,-57.696672972565878,null,25.937488261539695,-65.267186120340199,null,0,0]
[6309.6,6.3096000000000005,2.3166003954195791,1.1244562903359951,1.0000113160128137,4.7572904272395163E-3,1,0,85.066872466631779,1.5590405985750624,1.1884742322859467,0.57090000787001483,1.0000974359135215,1.3959083258925255E-2,1.0006144654302127,3.5047138408146078E-2,1.0000243903556441,6.9842479785637551E-3,1.0000608667096471,2.4120958974052992E-2,22.482062175921659,-123.93399949277597,56.066000507224032,null,1000000000,39811052.160000004,null,27.739275103926168,-57.41608203517891,null,25.85676746315912,-65.536056241698148,null,0,0]
[6383.05,6.3830499999999999,2.3385664635371373,1.1289464744896545,1.0000115810039605,4.8126691544871187E-3,1,0,86.056999148426897,1.5591758599400769,1.1925309382538758,0.5761750905581301,1.0000997175048549,1.4121559350344795E-2,1.0006288501502509,3.5454781997184354E-2,1.0000249615095638,7.0655488596553058E-3,1.0000622926452851,2.4401771477082095E-2,22.329263416649148,-123.93043479687098,56.069565203129017,null,1000000000,40743327.302500002,null,27.668338346271575,-57.130901159898137,null,25.774785555932187,-65.80624124716006,null,0,0]
[6456.5,6.4565000000000001,2.3605788032180435,1.1333530043972426,1.0000118490619447,4.8680478522154886E-3,1,0,87.047127368871728,1.5593080442135108,1.1966206026480604,0.58141426113533057,1.0001020254971802,1.4284034696142783E-2,1.0006434011432861,3.5862413798348376E-2,1.0000255392734743,7.1468496473412095E-3,1.0000637351116273,2.4682584695848584E-2,22.178350255112207,-123.92395842009211,56.076041579907894,null,1000000000,41686392.25,null,27.598689809473935,-56.847601549926637,null,25.693399641487844,-66.071633260078329,null,0,0]
[6531.7,6.5316999999999998,2.383162202447362,1.1377800998996426,1.0000121266839164,4.924745957005568E-3,1,0,88.060847658613625,1.5594402983197833,1.2008415003044208,0.58674113744408196,1.0001044158309405,1.4450380354519362E-2,1.000658471079358,3.6279745372052585E-2,1.0000261376511197,7.2300873878963596E-3,1.0000652290729557,2.4970089245147157E-2,22.025758449922698,-123.91444114485878,56.085558855141215,null,1000000000,42663104.890000001,null,27.528684938659488,-56.559502525395736,null,25.61068709376848,-66.338511383326903,null,0,0]
[6606.9,6.6068999999999996,2.4057914322553033,1.1421239953810358,1.0000124075206001,4.9814440301324935E-3,1,0,89.074569453582185,1.559569542166853,1.2050962333152231,0.59203054864630933,1.0001068338383354,1.4616725213134698E-2,1.0006737152904885,3.6697064303222768E-2,1.000026742957459,7.3133250282622544E-3,1.0000667403641064,2.5257594562122121E-2,21.875069800073575,-123.90213102659931,56.097868973400693,null,1000000000,43651127.609999992,null,27.45996734479295,-56.273377572379431,null,25.528588973873823,-66.600622542309722,null,0,0]
[6683.85,6.6838500000000005,2.4289933796469416,1.1464851093143484,1.0000126982205075,5.039461506644357E-3,1,0,90.11188335401522,1.5596987835077656,1.209484632474437,0.59740437356902065,1.0001093367627689,1.4786940291472761E-2,1.0006894946512159,3.7124081540369142E-2,1.0000273695224664,7.3984996098635271E-3,1.0000683047654628,2.5551791298728272E-2,21.722807195431709,-123.88677271211233,56.113227287887668,null,1000000000,44673850.822500005,null,27.390951424490204,-55.982637673104811,null,25.445210767231767,-66.864028039777153,null,0,0]
[6760.8,6.7608000000000006,2.4522406501178251,1.150763616518504,1.0000129922864835,5.09747894923002E-3,1,0,91.149198725357408,1.5598250832115144,1.2139077060052548,0.60273919077955473,1.0001118686633974,1.4957154512903534E-2,1.0007054564756157,3.7551085233036546E-2,1.0000280033423723,7.4836740841150483E-3,1.0000698873148186,2.584598885782971E-2,21.572462434260178,-123.8687478678124,56.131252132187598,null,1000000000,45708416.640000001,null,27.323219937577047,-55.693964158617234,null,25.36246445209802,-67.122700569368419,null,0,0]
[6839.55,6.83955,2.4760773101083986,1.1550589446563373,1.0000132967162896,5.156853489442198E-3,1,0,92.210780254874393,1.5599513952197053,1.2184697497217332,0.60815854016219795,1.0001144897903735,1.5131349456055647E-2,1.0007219805827396,3.7988063130950336E-2,1.0000286594999022,7.5708408312941062E-3,1.0000715256738002,2.6147069092611903E-2,21.420548379606409,-123.84766903060769,56.15233096939231,null,1000000000,46779444.202500001,null,27.255202005696283,-55.40067609097612,null,25.278430604269108,-67.382653459770239,null,0,0]
[6918.3,6.9183000000000003,2.4999587816894215,1.1592722849392514,1.0000136046714765,5.2162279932947923E-3,1,0,93.272363222099898,1.5600748319799298,1.2230673115283757,0.61353730340327306,1.0001171412645424,1.5305543480854871E-2,1.0007386957710773,3.842502651474726E-2,1.0000293232556814,7.6580074634239889E-3,1.0000731830421727,2.6448150208828639E-2,21.270566466894852,-123.82405336744921,56.17594663255079,null,1000000000,47862874.890000001,null,27.188465453696544,-55.109548645764775,null,25.195045928376114,-67.637908844694209,null,0,0]
[6998.9,6.9988999999999999,2.5244463540916118,1.1635019802057411,1.000013923511744,5.276997288673986E-3,1,0,94.35888640191942,1.5601982924379862,1.2278092426105152,0.61900055029350287,1.0001198864520029,1.5483828720752497E-2,1.0007560014909656,3.8872239867147877E-2,1.0000300104725319,7.7472216990930876E-3,1.0000748990313457,2.6756305265042177E-2,21.11902302636522,-123.79738336553372,56.202616634466281,null,1000000000,48984601.209999993,null,27.12145587053417,-54.813816411157717,null,25.110367836602677,-67.894426692391093,null,0,0]
[7079.5,7.0795000000000003,2.5489782214375025,1.1676503336657225,1.0000142460449677,5.3377665450779219E-3,1,0,95.445410987257233,1.560318942017332,1.2325875375935598,0.62442159989116985,1.0001226634287255,1.5662112976250499E-2,1.0007735073548913,3.9319437663375166E-2,1.0000307056487903,7.8364358114368302E-3,1.0000766349362089,2.7064461266038328E-2,20.969425528906903,-123.76830955784973,56.231690442150267,null,1000000000,50119320.25,null,27.055724323203826,-54.52034079543516,null,25.02635598670869,-68.146284054236901,null,0,0]
[7161.95,7.16195,2.5741176764039304,1.1718120179333498,1.0000145798023203,5.399930588532025E-3,1,0,96.556875817143194,1.5604395513825444,1.2375126943515082,0.62992359624917338,1.0001255370368296,1.5844488333804727E-2,1.0007916221049713,3.9776883643658147E-2,1.0000314250168509,7.9276975131558469E-3,1.000078431293093,2.737969131547946E-2,20.818368145370645,-123.73620713282587,56.263792867174132,null,1000000000,51293527.802499995,null,26.989774111765698,-54.222459370756297,null,24.941097843082606,-68.399230612808282,null,0,0]
[7244.4,7.2443999999999997,2.5993008512800069,1.1758931312770666,1.0000149174240953,5.4620945902511091E-3,1,0,97.668342019637109,1.5605574156791251,1.2424750153932194,0.6353818078963529,1.0001284439096887,1.602686263727705E-2,1.000809946269922,4.0234312968594692E-2,1.0000321527138598,8.0189590828174898E-3,1.0000802484933264,2.7694922376532299E-2,20.669267555814859,-123.70183979768358,56.298160202316424,null,1000000000,52481331.359999992,null,26.92509670113834,-53.926929283976023,null,24.856521950326858,-68.647560857835145,null,0,0]
[7328.75,7.3287500000000003,2.625108284694488,1.1799871918641889,1.0000152668251405,5.5256910722740324E-3,1,0,98.805422520683365,1.560675251985594,1.2475896858268711,0.64092069801880203,1.000131452192436,1.6213438519864974E-2,1.0008289093990614,4.0702265983919489E-2,1.0000329057991566,8.1123235704208714E-3,1.0000821291405437,2.8017418765986606E-2,20.518715634735585,-123.66446085975603,56.335539140243966,null,1000000000,53710576.5625,null,26.860213514552239,-53.627015790095577,null,24.770695180048598,-68.896967122845226,null,0,0]
[7413.1,7.4131,2.6509588612977733,1.1840014729521919,1.0000156202707571,5.58928750959908E-3,1,0,99.942504362463623,1.5607904069614951,1.2527423182235202,0.64641419170508685,1.0001344952901092,1.6400013273563076E-2,1.0008480916814069,4.1170201164108494E-2,1.0000336676016546,8.2056879165922931E-3,1.000084031606022,2.8339916238791698E-2,20.370130790020454,-123.62495835863379,56.375041641366209,null,1000000000,54954051.610000007,null,26.796597576841449,-53.329549626809452,null,24.685566414158835,-69.14180242389132,null,0,0]
[7499.45,7.4994499999999995,2.6774657590071347,1.1880305756759029,1.0000159862863804,5.6543918179843729E-3,1,0,101.10654858533289,1.5609056093432567,1.2580559590797462,0.6519911547670324,1.0001376466044583,1.659101066779603E-2,1.0008679557857298,4.1649212741250573E-2,1.000034456496713,8.3012658512829109E-3,1.0000860017824487,2.867006149697153E-2,20.220019346823417,-123.58244189424997,56.417558105750032,null,1000000000,56241750.302499995,null,26.732753274496233,-53.027557135366877,null,24.599133735825408,-69.38783873328714,null,0,0]
[7585.8,7.5857999999999999,2.7040152692434258,1.1919806215824669,1.0000163565406395,5.7194960784361084E-3,1,0,102.27059411950091,1.5610181892557893,1.2634083988014839,0.65752103491708713,1.0001408344036025,1.6782006851445305E-2,1.0008880495321519,4.2128205195100514E-2,1.0000352545272131,8.3968436343038067E-3,1.0000879948275716,2.9000207916839021E-2,20.071886870628852,-123.53794327881414,56.46205672118586,null,1000000000,57544361.640000001,null,26.670171727753033,-52.728111970285681,null,24.513415358778641,-69.629345490019702,null,0,0]
[7674.15,7.67415,2.7312225156274654,1.195942610014874,1.0000167397575894,5.7861082044029458E-3,1,0,103.46160206567862,1.561130754729986,1.2689244544632463,0.66313053536618016,1.0001441337989063,1.697742553561148E-2,1.0009088463484936,4.2618271836647362E-2,1.000036080496594,8.4946349882986643E-3,1.0000900577059413,2.9338002256380804E-2,19.922329791499457,-123.49048274039708,56.509517259602916,null,1000000000,58892578.222499996,null,26.607414820437867,-52.424357461459898,null,24.42644188428477,-69.871888302270293,null,0,0]
[7762.5,7.7625000000000002,2.7584717888599291,1.199826382241703,1.0000171274117855,5.852720279021297E-3,1,0,104.65261129297784,1.5612407580808829,1.2744800923725255,0.66869130432593815,1.0001474713879235,1.7172842922978139E-2,1.0009298835383988,4.3108317995787876E-2,1.0000369160294531,8.5924261798189655E-3,1.0000921445284783,2.9675797840274808E-2,19.774760469429509,-123.44118613386757,56.558813866132425,null,1000000000,60256406.25,null,26.545914208357249,-52.123248188152623,null,24.340197872505179,-70.109949730284782,null,0,0]
[7852.9,7.8529,2.7863955463660828,1.2037215839457269,1.0000175286536601,5.9208779111126486E-3,1,0,105.87125698986931,1.5613507520619534,1.2802050717007138,0.67433096553710392,1.0001509259525025,1.7372793255213174E-2,1.0009516576463848,4.3609713333927456E-2,1.0000377808482044,8.6924862667799811E-3,1.0000943045579633,3.0021432655145983E-2,19.625781964432754,-123.38896313450248,56.611036865497525,null,1000000000,61668038.409999996,null,26.484253950981781,-51.817877903556742,null,24.252698186582997,-70.349026620035175,null,0,0]
[7943.3,7.9432999999999998,{"$f":"SQRT(1+(A141/pole1)^2)","v":2.8143607414252312},{"$f":"ATAN(A141/pole1)","v":1.2075394324488946},{"$f":"SQRT(1+(A141/Zero1)^2)","v":1.0000179345410751},{"$f":"ATAN(A141/Zero1)","v":5.9890354881929663E-3},{"$f":"IF(VIN_nom>Vout, 1, SQRT(1+(A141/z_RHP)^2))","v":1},{"$f":"IF(VIN_nom>Vout, 0, -ATAN(A141/z_RHP))","v":0},{"$f":"SQRT(1+(A141/Pole2)^2)","v":107.0899039385104},{"$f":"ATAN(A141/Pole2)","v":1.5614582426555681},{"$f":"SQRT(1+(A141/Zero2)^2)","v":1.2859704056542487},{"$f":"ATAN(A141/Zero2)","v":0.67992023511275279},{"$f":"SQRT(1+(A141/pole4)^2)","v":1.0001544205029735},{"$f":"ATAN(A141/pole4)","v":1.757274219818486E-2},{"$f":"SQRT(1+(A141/Zero3)^2)","v":1.0009736833799157},{"$f":"ATAN(A141/Zero3)","v":4.4111086732391142E-2},{"$f":"SQRT(1+(A141/pole5)^2)","v":1.0000386556793377},{"$f":"ATAN(A141/pole5)","v":8.7925461796782081E-3},{"$f":"SQRT((1-(Z141/pterm2))^2+(A141/pterm1)^2)","v":1.0000964896598925},{"$f":"IF((ATAN((A141/pterm1)/(1-A141^2/pterm2))>0),ATAN((A141/pterm1)/(1-A141^2/pterm2)),PI()+ATAN((A141/pterm1)/(1-A141^2/pterm2)))","v":3.0367068803016272E-2},{"$f":"20*LOG10(((E141*K141*G141*O141)/(C141*I141*S141*M141*Q141))*Adc)","v":19.478799183986652},{"$f":"((F141+L141+H141+R141)-(D141+J141+T141+N141+T141))*radconv","v":-123.33505200397323},{"$f":"IF(V141>0,V141,V141+180)","v":56.664947996026768},null,{"$f":"IF(U141<0,A141,1000000000)","v":1000000000},{"$f":"A141^2","v":63096014.890000001},null,{"$f":"20*LOG10((K141/(I141*M141))*AEA)","v":26.423843026597975},{"$f":"(L141-(J141+N141))*radconv","v":-51.515251333867234},null,{"$f":"20*LOG10((E141*G141/(C141*S141))*Acs*Am)","v":24.16594279982067},{"$f":"(F141+H141-(D141+T141))*radconv","v":-70.583671577366715},null,{"$f":"SUM((U142<0)*(U141>0))*A141","v":0},0]
[8035.8,{"$f":"A142/1000","v":8.0358000000000001},2.8430171875257337,1.2113681672113634,1.0000183546659533,6.0587763142172712E-3,1,0,108.33686141525448,1.5615657270919023,1.2919108769126919,0.68558752478197371,1.0001580376217192,1.7777334518087082E-2,1.0009964812172212,4.4624084107766408E-2,1.0000395611968145,8.8949303109433896E-3,1.0000987514770616,3.0720735504941359E-2,19.330424508283805,-123.27825643351255,56.721743566487447,null,1000000000,64574081.640000001,null,26.36328881040793,-51.208420235208671,null,24.077932380599858,-70.819309674784122,null,0,0]
[8128.3,8.1282999999999994,2.871714477893784,1.2151204343140576,1.0000187796546995,6.1285170813037597E-3,1,0,109.58382011511979,1.5616707653899726,1.2978924613783676,0.6912027558572148,1.0001616966047933,1.7981925349595407E-2,1.0010195424710346,4.5137057981507155E-2,1.0000404771971971,8.9973142557215943E-3,1.0001010395497059,3.1074403634894575E-2,19.184052630147686,-123.21992226562263,56.780077734377372,null,1000000000,66069260.890000001,null,26.303976412374443,-50.904431635598449,null,23.990680750660541,-71.050566583219094,null,0,0]
[8222.9500000000007,8.2229500000000009,2.9011198013060246,1.2188830205191219,1.0000192195563158,6.1998787882874117E-3,1,0,110.85976340240154,1.5617757991382384,1.3040550447999455,0.69689499598480364,1.0001654839692533,1.8191269977027941E-2,1.0010434123958321,4.5661930424492396E-2,1.0000414253395924,9.1020777401547223E-3,1.0001034079850257,3.1436293654499771E-2,19.036307805501384,-123.15875210537736,56.84124789462264,null,1000000000,67616906.702500015,null,26.244537565895179,-50.596302854058202,null,23.902175889721423,-71.282792939231058,null,0,0]
[8270.2750000000015,8.2702750000000016,2.9158376317130186,1.2207358421319294,1.0000194414168444,6.2355596181447462E-3,1,0,111.49773549680032,1.5618274145334241,1.3071520693698058,0.69972094319464606,1.0001673940885492,1.8295941693901804E-2,1.0010554507714737,4.5924357223244783E-2,1.000041903526725,9.1544594075889281E-3,1.0001046025132461,3.1617239236904925E-2,18.963191435398791,-123.12763993456733,56.872360065432673,null,1000000000,68397448.575625017,null,26.215282809204339,-50.443342597545971,null,23.858213975232768,-71.397274855199356,null,0,0]
[8317.6,8.3176000000000005,2.9305653714755895,1.2225700470468004,1.0000196645505188,6.2712404321246286E-3,1,0,112.13570788486568,1.5618784426190007,1.3102594834301327,0.7025335087326896,1.0001693151658053,1.840061300982563E-2,1.001067558085966,4.6186777692278198E-2,1.000042384457809,9.2068410247850511E-3,1.0001058039156068,3.1798185203967773E-2,18.89057189188415,-123.09619419338574,56.903805806614258,null,1000000000,69182469.760000005,null,26.186332425343508,-50.291115381016873,null,23.814443941432156,-71.510690135895189,null,0,0]
[8366.0499999999993,8.3660499999999995,2.9456533262893099,1.2244288472932046,1.0000198943073824,6.3077694264073673E-3,1,0,112.78884631809939,1.5619300857216885,1.3134514521820306,0.70539912425798379,1.0001712932622344,1.850777213262253E-2,1.0010800246269227,4.6455429771096651E-2,1.0000428796640517,9.2604677944836365E-3,1.0001070409989934,3.198343298147819E-2,18.816735189880134,-123.06366891127254,56.936331088727457,null,1000000000,69990792.602499992,null,26.157005003902725,-50.136026402830701,null,23.769830795142038,-71.625712503716713,null,0,0]
[8414.5,8.4145000000000003,2.9607513549921598,1.2262686963442841,1.0000201253986392,6.3442984038561282E-3,1,0,113.44198504867832,1.5619811341573691,{"$f":"SQRT(1+(A148/Zero2)^2)","v":1.3166541543246459},{"$f":"ATAN(A148/Zero2)","v":0.70825082214368473},1.0001732828436627,1.8614930830320217E-2,1.0010925634179657,4.6724075139512065E-2,1.0000433777462452,9.3140945109176851E-3,1.0001082852879231,3.216868116680062E-2,18.743408029300774,-123.03082118214178,56.969178817858221,null,1000000000,70803810.25,null,26.127988241991421,-49.981700750388761,null,23.725415930199674,-71.739649072358617,null,0,0]
[8462.9500000000007,8.4629500000000011,2.9758593042544472,1.2280898702847589,1.0000203578242886,6.3808273643734337E-3,1,0,114.09512407149596,1.5620315981383108,1.3198675117231982,0.71108865749204631,1.0001752839100213,1.8722089100460224E-2,1.0011051744563808,4.6992713759000874E-2,1.0000438787043853,9.3677211737788323E-3,1.0001095367827508,3.235392976228655E-2,18.670584865895652,-122.99766425262763,57.002335747372371,null,1000000000,71621522.702500015,null,26.099278014777909,-49.828135851543465,null,23.681197927233338,-71.852515660450422,null,0,0]
[8511.4,8.5114000000000001,2.9909770237447209,1.2298926401185599,1.0000205915843292,6.4173563078618106E-3,1,0,114.74826338156211,1.5620814876442843,1.3230914467432702,0.71391268576403333,1.0001772964612414,1.882924694058415E-2,1.0011178577394371,4.7261345591045292E-2,1.0000443825384677,9.4213477827587155E-3,1.0001107954838342,3.2539178770287315E-2,18.598260231039088,-122.96421104438313,57.035788955616866,null,1000000000,72443929.959999993,null,26.070870264448111,-49.675329100273494,null,23.637175375478687,-71.964327795513967,null,0,0]
[8560.9500000000007,8.5609500000000001,3.0064479250723855,1.2317175813107519,1.0000208320317936,6.4547145801335474E-3,1,0,115.41623173991687,1.5621319258089319,1.326399437593331,0.71678660757314838,1.0001793665839338,1.8938837225513764E-2,1.0011309037021918,4.7536069330932879E-2,1.000044900786129,9.4761918644771827E-3,1.0001120902161402,3.2728634067238742E-2,18.52480356449362,-122.92970500906438,57.070294990935622,null,1000000000,73289864.902500018,null,26.042126245618611,-49.51983446454571,null,23.592354040478053,-72.077603741406222,null,0,0]
[8610.5,8.6105,3.0219287365650152,1.2335238307592382,1.0000210738749271,6.4920728343881183E-3,1,0,116.08420038851239,1.5621817835137879,1.3297183291816845,0.71964620665421541,1.000181448718761,1.9048427055478837E-2,1.0011440252214601,4.7810785890206549E-2,1.0000454220417954,9.5310358891876282E-3,1.0001133924863983,3.291808980062285E-2,18.4518569879823,-122.89491541793386,57.105084582066141,null,1000000000,74140710.25,null,26.013690218411419,-49.36512717672332,null,23.54773417596229,-72.18980875530923,null,0,0]
[8660.0499999999993,8.66005,3.0374193066952362,1.2353116625658922,1.0000213171137282,6.5294310705212612E-3,1,0,116.75216932236708,1.5622310707214775,1.333048040089583,0.72249154339180111,1.0001835428656483,1.9158016427849894E-2,1.0011572222942711,4.8085495227684204E-2,1.0000459463054623,9.5858798565602223E-3,1.0001147022949977,3.3107545972954198E-2,18.379414889439168,-122.85985508706995,57.140144912930054,null,1000000000,74996466.002499983,null,25.985558051055353,-49.211204347691201,null,23.503314301688057,-72.300958542253554,null,0,0]
[8709.6,8.7096,3.0529194869165273,1.237081345742173,1.0000215617481965,6.5667892884287132E-3,1,0,117.42013853661271,1.5622797971679399,1.3363884894456208,0.72532267849338883,1.00018564902452,1.9267605339997523E-2,1.001170494917637,4.8360197302190246E-2,1.0000464735771251,9.6407237662651298E-3,1.0001160196423293,3.329700258674715E-2,18.307471734292339,-122.82453650940194,57.175463490598062,null,1000000000,75857132.160000011,null,25.957725679309917,-49.058063056844347,null,23.45909294737567,-72.411068515610523,null,0,{"$f":"IF(AH154>0,W154,0)","v":0}]
[8760.3250000000007,8.7603249999999999,3.0687970320267088,1.2388744705077566,1.0000218136294867,6.6050333784892987E-3,1,0,118.1039478713848,1.5623291081532793,1.3398191918598696,0.72820630241237161,1.0001878175701735,1.9379792500664322E-2,1.0011841605363088,4.8641405936239557E-2,1.0000470164680342,9.6968681525989673E-3,1.0001173760378892,3.3490952324857347E-2,18.234333693744368,-122.78812561400404,57.211874385995955,null,1000000000,76743294.105625018,null,25.929539676745804,-48.902096738570776,null,23.414027066188471,-72.52272827342604,null,0,0]
[8811.0499999999993,8.8110499999999998,3.0846843426344566,1.2406491303663212,1.0000220669734188,6.64327744922843E-3,1,0,118.78775749002898,1.562377851414809,1.3432609782928591,0.73107517288578228,1.0001899987040954,1.9491979173445612E-2,1.0011979053247531,4.8922606871467968E-2,1.0000475625112799,9.7530124777981692E-3,1.0001187403347958,3.3684902530946401E-2,18.161707045977757,-122.75146956963333,57.248530430366671,null,1000000000,77634602.102499992,null,25.901659448122313,-48.746943174330703,null,23.369166146000083,-72.633330097919298,null,0,0]
[8861.7749999999996,8.8617749999999997,3.1005812686251866,1.2424055980659814,1.0000223217799915,6.6815215005342514E-3,1,0,119.47156738767092,1.5624260367006024,1.3467137637625572,0.73392935598601883,1.0001921924262032,1.9604165355520668E-2,1.0012117292797089,4.9203800063722145E-2,1.0000481117068576,9.8091567415088884E-3,1.0001201125334762,3.3878853207711203E-2,18.089586097469859,-122.71458077663368,57.285419223366318,null,1000000000,78531056.15062499,null,25.874080844239952,-48.592599136816396,null,23.32450864254379,-72.742889616567084,null,0,0]
[8912.5,8.9124999999999996,3.1164876628572666,1.2441441412405583,1.0000225780492031,6.7197655322949077E-3,1,0,120.15537755954723,1.5624736735368356,{"$f":"SQRT(1+(A158/Zero2)^2)","v":1.3501774638860278},{"$f":"ATAN(A158/Zero2)","v":0.73676891806789613},1.0001943987364137,1.9716351044068839E-2,1.0012256323978974,4.9484985468856053E-2,1.0000486640547617,9.8653009433772691E-3,1.0001214926343605,3.4072804357848374E-2,18.017965234367331,-122.67747131342647,57.322528686573534,null,1000000000,79432656.25,null,25.846799784219087,-48.439061369825104,null,23.280053022902631,-72.851422163818754,null,0,0]
[8964.4,8.9643999999999995,3.1327721640593258,1.2459046779933964,1.0000228417685177,6.7588954330601528E-3,1,0,120.85502787145882,1.5625218558949392,1.3537326070159637,0.73965919262822966,1.0001966691826414,1.9831134901648222E-2,1.001239939501239,4.9772676180709803E-2,1.0000492324600172,9.9227456119126388E-3,1.0001229128834128,3.4271248708510803E-2,17.945197159521303,-122.63928611371189,57.36071388628811,null,1000000000,80360467.359999999,null,25.81919055847349,-48.282798112067262,null,23.234774993754787,-72.961421535154301,null,0,0]
[9016.2999999999993,9.0162999999999993,3.1490662748139004,1.2476470011244678,1.0000231070190155,6.798025313127341E-3,1,0,121.55467846071028,1.5625694835922264,1.3572989995084497,0.74253430232797424,1.0001989528067343,1.9945918236597821E-2,1.001254329470779,5.0060358647024628E-2,1.0000498041653212,9.9801902149579975E-3,1.0001243414059218,3.4469693560440787E-2,17.872940966239707,-122.60089448555985,57.399105514440151,null,1000000000,81293665.689999983,null,25.791884390791481,-48.127371927150698,null,23.189705099675962,-73.070377372738193,null,0,0]
[9068.2000000000007,9.0682000000000009,3.1653698467221143,1.2493713814065643,1.0000233738006952,6.8371551723766608E-3,1,0,122.2543293225401,1.5626165661513061,1.3608765529212818,0.74539431904645392,1.0002012496086021,2.0060701045896637E-2,1.0012688023029441,5.0348032820539165E-2,1.0000503791706685,1.0037634752134338E-2,1.0001257782023552,3.4668138916526044E-2,17.801190891924655,-122.56230837051832,57.437691629481677,null,1000000000,82232251.24000001,null,25.764877123229478,-47.972779242125732,null,23.144841736073694,-73.178305190880948,null,0,0]
[9120.1,9.1201000000000008,3.1816827343415,1.251078084491005,1.000023642113556,6.8762850106883003E-3,1,0,122.95398045229501,1.5626631128780482,1.3644651794644858,0.74823931489797901,1.000203559588154,2.0175483326523757E-2,1.0012833579941416,5.0635698654000277E-2,1.0000509574760528,1.009507922306265E-2,1.0001272232731839,3.4866584779653945E-2,17.729941255648185,-122.52353939081434,57.476460609185665,null,1000000000,83176224.010000005,null,25.738164666812033,-47.819016458160704,null,23.100183311057656,-73.285220210454298,null,0,0]
[9173.2000000000007,9.1732000000000014,3.1983822911832669,1.2528062257169894,1.0000239182148756,6.9163195633514833E-3,1,0,123.66980875933065,1.5627101907547856,1.3681481492854821,0.75113462060104041,1.0002059366157787,2.0292918982415555E-2,1.0012983359842478,5.0930007039799025E-2,1.0000515525680256,1.0153851820891954E-2,1.0001287103201291,3.5069619514212592E-2,17.657556316425666,-122.48369655738773,57.516303442612269,null,1000000000,84147598.24000001,null,25.711135502328162,-47.662553591888781,null,23.054702775507259,-73.393574631712056,null,0,0]
[9226.2999999999993,9.2262999999999984,3.2150913006608226,1.2545164095128603,1.0000241959189982,6.9563540938438482E-3,1,0,124.38563733730415,1.5627567267734124,1.3718425263753133,0.75401435619792845,1.000208327437311,2.041035407850848E-2,1.0013134007016393,5.1224306595374379E-2,1.0000521511143905,1.0212624348571687E-2,1.0001302060295294,3.5272654785646063E-2,17.585683449540678,-122.44368592892882,57.556314071071185,null,1000000000,85124611.689999983,null,25.684406495095352,-47.506951748731211,null,23.009433434671141,-73.500900200043205,null,0,0]
[9279.4,9.279399999999999,3.231809616158932,1.2562089044807454,1.0000244752259222,6.9963886020370852E-3,1,0,125.10146618156467,1.5628027302352392,1.3755482188228048,0.75687859957011094,1.0002107320526521,2.0527788611567458E-2,1.001328552142402,5.1518597270146183E-2,1.0000527531151415,1.0271396805695955E-2,1.0001317104018987,3.5475690597045931E-2,17.514316827469791,-122.40351896605181,57.596481033948194,null,1000000000,86107264.359999999,null,25.657973481032819,-47.352206999149054,null,22.964373625174392,-73.607212305400495,null,0,0]
[9332.5,9.3324999999999996,3.2485370939997065,1.257883974100388,1.0000247561356463,7.0364230878028787E-3,1,0,125.81729528756715,1.5628482102299086,1.3792651354245322,0.75972742878014443,1.0002131504617024,2.0645222578357519E-2,1.0013437903025992,5.1812879013543443E-2,1.0000533585702724,1.0330169191858861E-2,1.000133223437752,3.5678726951503453E-2,17.443450706333252,-122.36320681337656,57.636793186623436,null,1000000000,87095556.25,null,25.631832365666362,-47.198315391100081,null,22.919521697679592,-73.71252604424572,null,0,0]
[9386.85,9.3868500000000008,3.2656676863198819,1.2595806999428618,1.000025045317962,7.0773999816066647E-3,1,0,126.54997562764605,1.5628942280207936,1.3830810792109438,0.76262743975212266,1.0002156400857789,2.0765420408428964E-2,1.0013594769780056,5.2114078991278526E-2,1.0000539818554204,1.0390325034859123E-2,1.0001347810635506,3.5886543446770058E-2,17.371428766036523,-122.32180664462224,57.678193355377758,null,1000000000,88112952.922499999,null,25.605373960503076,-47.041680455255062,null,22.873827507225432,-73.819300479151721,null,0,0]
[9441.2000000000007,9.4412000000000003,3.2828075819663183,1.2612597129964973,1.0000253361794245,7.1183768516426601E-3,1,0,127.28265623262661,1.5629397160248593,1.386908590732838,0.76551146829668437,1.0002181441604172,2.0885617638399561E-2,1.0013752544953214,5.2415269505014565E-2,1.0000546087594846,1.0450480802657305E-2,1.000136347766623,3.6094360517515307E-2,17.299919253847623,-122.28027701614475,57.719722983855249,null,1000000000,89136257.440000013,null,25.579212895977808,-46.885930856116367,null,22.828347649841859,-73.925060080346995,null,0,0]
[9495.5499999999993,9.4955499999999997,3.2999566359752572,1.2629212798671439,1.0000256287200322,7.159353697773276E-3,1,0,128.01533709796044,1.5629846833384351,1.3907475744826465,0.76837959859169858,1.0002206626855086,2.1005814264800766E-2,1.0013911228502526,5.2716450500554776E-2,1.0000552392824584,1.0510636494818175E-2,1.0001379235475318,3.6302178167053029E-2,17.228916273736466,-122.23862890169265,57.76137109830735,null,1000000000,90165469.80249998,null,25.553344999020151,-46.731062291629918,null,22.78308040264351,-74.029820123419313,null,0,0]
[9549.9,9.5498999999999992,3.3171147063040545,1.2645656620342389,1.0000259229397843,7.2003305198609273E-3,1,0,128.74801821920269,1.5630291388507973,1.3945979357197416,0.77123191493581322,1.000223195660944,2.1126010284164134E-2,1.0014070820384811,5.3017621923712697E-2,1.000055873424335,1.0570792110906507E-2,1.0001395084068436,3.6509996398696752E-2,17.158414015409903,-122.19687296250906,57.803127037490938,null,1000000000,91200590.00999999,null,25.527766166916276,-46.577070440958238,null,22.738024058125777,-74.133595590234606,null,0,0]
[9605.5249999999996,9.6055250000000001,3.3346844796956763,1.2662310933386143,1.0000262258003465,7.2422685947044442E-3,1,0,129.49788761247981,1.5630741163614932,1.3985503057286459,0.77413485724986963,1.0002258030202993,2.1249025357169233E-2,1.0014235096643449,5.3325848577459048E-2,1.00005652618982,1.0632358842075957E-2,1.0001411398464191,3.6722690457253189E-2,17.086770344583051,-122.15403662576178,57.845963374238224,null,1000000000,92266110.52562499,null,25.501882386503762,-46.420369364049378,null,22.692127350357598,-74.238801372357855,null,0,0]
[9661.15,9.6611499999999992,3.3522634054040372,1.2678790624719181,1.0000265304197562,7.2842066440720948E-3,1,0,130.24775726471165,1.5631185759782118,1.4025143949412811,0.77702141392928059,1.0002284255157008,2.137203978697029E-2,1.0014400324259909,5.3634065089621603E-2,1.0000571827459768,1.0693925492639365E-2,1.0001427807965451,3.6935385132569318E-2,17.015639117865678,-122.11110897478203,57.888891025217973,null,1000000000,93337819.32249999,null,25.476292916257318,-46.264577404859367,null,22.646447986639281,-74.343006682573801,null,0,0]
[9716.7749999999996,9.7167750000000002,3.3698513401991761,1.2695098338281035,1.0000268367980112,7.3261446678163844E-3,1,0,130.9976271714512,1.5631625265945199,1.4064901042685012,0.77989167561908901,1.0002310631470295,2.1495053569849334E-2,1.0014566503187101,5.3942271402144241E-2,1.0000578430927978,1.0755492062130155E-2,1.0001444312578391,3.7148080428196305E-2,16.945014375896793,-122.06810047444226,57.931899525557739,null,1000000000,94415716.40062499,null,25.4509935775808,-46.109689879160626,null,22.600984186287441,-74.446226669752036,null,0,0]
[9772.4,9.7723999999999993,3.3874481437531339,1.2711236666774501,1.0000271449351104,7.3680826657898119E-3,1,0,131.74749732835269,1.5632059769015132,1.4104773354495366,0.78274573301781147,1.0002337159141654,2.1618066702088511E-2,1.001473363337767,5.4250467456982449E-2,1.0000585072302757,1.0817058550081762E-2,1.0001460912309226,3.7360776347684997E-2,16.874890247096072,-122.02502128138507,57.974978718614935,null,1000000000,95499801.75999999,null,25.425980262955168,-45.955702088061038,null,22.555734185322748,-74.548476189197274,null,0,0]
[9829.2999999999993,9.8292999999999999,3.4054573224539002,1.2727572304697876,1.0000274619549041,7.4109819124049507E-3,1,0,132.51455577471245,1.5632499143603769,1.4145677787934814,0.78564853817023672,1.0002364451463583,2.1743898784121987E-2,1.0014905578587525,5.456571710738168E-2,1.0000591905126548,1.0880036140097712E-2,1.0001477990948007,3.7578348193606149E-2,16.803670704514971,-121.98089178753862,58.019108212461376,null,1000000000,96615138.48999998,null,25.400685333410319,-45.799110682082599,null,22.509666378143798,-74.652080502918778,null,0,0]
[9886.2000000000007,9.8862000000000005,3.4234754930976763,1.2743736032452566,1.0000277808150926,7.4538811317420746E-3,1,0,133.28161447394703,1.5632933460840024,1.4186700728849482,0.78853457974449481,1.0002391902159213,2.1869730177477405E-2,1.0015078519067919,5.4880955901640681E-2,1.0000598777614402,1.0943013643806083E-2,1.0001495169128374,3.7795920699831259E-2,16.732962833802482,-121.93670886947866,58.063291130521336,null,1000000000,97736950.440000013,null,25.375681217321016,-45.643450742430687,null,22.463818603204423,-74.754699883322616,null,0,0]
[9943.1,9.9431000000000012,3.4415025144510651,1.2759730466369081,1.000028101515674,7.4967803236433116E-3,1,0,134.04867342171539,1.5633362807540427,1.4227841152166429,0.79140395487335247,1.0002419511227243,2.1995560878175724E-2,1.0015252454767294,5.5196183777669432E-2,1.0000605689766238,1.1005991060707487E-2,1.0001512446857088,3.8013493870159815E-2,16.662760625611575,-121.89248245004447,58.107517549955531,null,1000000000,98865237.610000014,null,25.350963739691842,-45.488717201001805,null,22.418189026242203,-74.856349321105142,null,0,0]
[10000,10,3.4595382481557828,1.2775558171723733,1.0000284240566466,7.5396794879507897E-3,1,0,134.81573261377534,1.5633787268545751,1.4269098041715838,0.7942567606687605,1.0002447278666355,2.2121390882238055E-2,1.0015427385633795,5.5511400673390901E-2,1.0000612641581967,1.1068968390302556E-2,1.0001529824140951,3.8231067708390888E-2,16.593058160203483,-121.84822214942851,58.151777850571492,null,1000000000,100000000,null,25.32652879716403,-45.33490497956489,null,22.372775830966845,-74.957043514443669,null,0,0]
[10058.25,10.058249999999999,3.4780107780539935,1.2791591319397129,1.0000287561565777,7.5835964419952145E-3,1,0,135.60099117423226,1.5634216825859752,1.4311453377669974,0.79716018933365174,1.0002475868961656,2.2250205582410844E-2,1.0015607497690675,5.5834084914133976E-2,1.0000619799421895,1.1133439818656199E-2,1.0001547716848735,3.8453804363390576E-2,16.522213526162659,-121.80288637462397,58.197113625376033,null,1000000000,101168393.0625,null,25.301802574447443,-45.178392491544741,null,22.326507435519353,-75.05915229811842,null,0,0]
[10116.5,10.1165,3.4964921541071816,1.28074550149726,1.0000290901852618,7.6275133667861516E-3,1,0,136.3862499820182,1.5634641436727739,1.4353928645136054,0.80004645891285364,1.0002504625229358,2.2379019544060571E-2,1.001578865258631,5.6156757515738044E-2,1.0000626998829989,1.1197911154452416E-2,1.0001565713906317,3.8676541726418032E-2,16.451880355705889,-121.75753455875665,58.242465441243354,null,1000000000,102343572.25,null,25.277363973566096,-45.022834763353714,null,22.280462016358165,-75.160290235031113,null,0,0]
[10174.75,10.17475,3.5149822367791255,1.2823151852108696,1.000029426142697,7.6714302621542236E-3,1,0,137.17150903288558,1.5635061186098203,1.4396522782582151,0.80291567340764314,1.0002533547468031,2.2507832762918796E-2,1.0015970850264115,5.647941841164468E-2,1.0000634239806163,1.126238239715545E-2,1.0001583815321122,3.8899279801547913E-2,16.382052579363076,-121.71217609054288,58.287823909457117,null,1000000000,103525537.5625,null,25.253208815933341,-44.868226322632012,null,22.234637682697731,-75.260472185993734,null,0,0]
[10233,10.233000000000001,3.533480889389224,1.283868437347766,1.0000297640288813,7.7153471279300572E-3,1,0,137.95676832268347,1.563547615698557,1.4439234738048623,0.80576793671710767,1.0002562635676233,2.2636645234717222E-2,1.0016154090667184,5.6802067535310037E-2,1.0000641522350322,1.1326853546229554E-2,1.0001602021100617,3.9122018592854427E-2,16.312724219345,-121.66682006134265,58.333179938657352,null,1000000000,104714289,null,25.229332995367528,-44.714561691793484,null,22.189032563028896,-75.359712719688289,null,0,0]
[10292.5,10.2925,3.5523852173509227,1.2854383159863396,1.0000301111571175,7.760206384990539E-3,1,0,138.75887891266083,1.5635895183784794,1.4482983812773718,0.80866401457476755,1.0002592519443518,2.2768221146931826E-2,1.0016342339737703,5.7131628236848545E-2,1.0000649004087743,1.1392708099135375E-2,1.0001620725317983,3.9349537930179826E-2,16.242417611638661,-121.62050239593573,58.379497604064269,null,1000000000,105935556.25,null,25.205229015560985,-44.558568244395346,null,22.142673187444576,-75.460125791825732,null,0,0]
[10352,10.352,3.5712982075340793,1.2869915707966935,1.0000304602977659,7.8050656108178667E-3,1,0,139.56098974347529,1.5636309393967507,1.4526853627904035,0.81154262465610461,1.0002622576376856,2.2899796270677973E-2,1.0016531676644769,5.7461176515174281E-2,1.0000656529196135,1.1458562553220773E-2,1.0001639538443154,3.9577058023340529E-2,16.172619761944727,-121.57420553690142,58.425794463098583,null,1000000000,107163904,null,25.181408054270172,-44.40354798450344,null,22.09653864876578,-75.559586433861455,null,0,0]
[10411.5,10.4115,3.5902197230430284,1.2885284570616622,1.0000308114508243,7.8499248052315285E-3,1,0,140.36310081099796,1.5636718870106567,1.4570843092865948,0.81440387724480556,1.0002652806474688,2.3031370601407128E-2,1.0016722101326694,5.7790712299414522E-2,1.0000664097675398,1.1524416907914775E-2,1.0001658460484226,3.9804578876677259E-2,16.103324585178875,-121.52793826546645,58.472061734533554,null,1000000000,108399332.25,null,25.157865959690881,-44.249495066174944,null,22.050627013819103,-75.658109272683518,null,0,0]
[10471,10.471,3.6091496297918249,1.2900492250212048,1.0000311646162907,7.8947839680510151E-3,1,0,141.16521211119397,1.5637123692898167,1.4614951127259292,0.81724788243544366,1.0002683209735439,2.3162944134570925E-2,1.0016913613721441,5.812023551871276E-2,1.0000671709525437,1.1590271162646413E-2,1.0001677491449343,4.0032100494530216E-2,16.034526089150731,-121.48170907400487,58.518290925995132,null,1000000000,109641841,null,25.134598652531484,-44.096403643549998,null,22.004936369813088,-75.755708646244486,null,0,0]
[10532,10.532,3.6285653348195503,1.2915918555052979,1.0000315287742327,7.9407740011469344E-3,1,0,141.98754494209001,1.5637533973069735,1.4660293099358424,0.82014579517941777,1.0002714559229422,2.3297833814822227E-2,1.0017111083284906,5.8458052927821427E-2,1.000067955829538,1.1657785504301868E-2,1.0001697115272901,4.0265358749701219E-2,15.964502621009425,-121.43436256750007,58.565637432499926,null,1000000000,110923024,null,25.111025844835567,-43.940444815348037,null,21.958321297678598,-75.854824541206312,null,0,0]
[10593,10.593,3.6479895828488482,1.2931180616710103,1.000031895047323,7.9867640006513769E-3,1,0,142.80987800924086,1.5637939528261373,1.4705757427306554,0.82302581360783089,1.0002746090723913,2.3432722647106739E-2,1.0017309695961973,5.8795856979702903E-2,1.0000687452650212,1.1725299739675961E-2,1.0001716853599179,4.0498617817658372E-2,15.894988729326482,-121.3870732660564,58.612926733943596,null,1000000000,112211649,null,25.087733398167138,-43.785484135180397,null,21.911934492756657,-75.952999440536331,null,0,0]
[10654,10.654,3.6674222381374708,1.2946280974350375,1.0000322634355594,8.0327539663698367E-3,1,0,143.63221130858875,1.5638340439627105,1.4751342979784405,0.82588805561736456,1.0002777804217189,2.3567610626523905E-2,1.0017509451684647,5.913364759805928E-2,1.0000695392589825,1.179281386815346E-2,1.0001736706437108,4.0731877703076867E-2,15.825978250454337,-121.33984942832636,58.66015057167364,null,1000000000,113507716,null,25.064717144505568,-43.631515312762325,null,21.865773959537936,-76.050247892868612,null,0,0]
[10715,10.715,3.6868631677469055,1.2961222116568987,1.0000326339389392,8.0787438981078045E-3,1,0,144.45454483616814,1.5638736786473078,1.4797048636415799,0.82873263881890202,1.0002809699707522,2.3702497748173342E-2,1.0017710350384554,5.9471424706610966E-2,1.0000703378114111,1.1860327889119138E-2,1.0001756673795665,4.0965138410631291E-2,15.757465116169961,-121.29269902899486,58.707300971005139,null,1000000000,114811225,null,25.041972989490713,-43.478532063596532,null,21.819837724277775,-76.146584157082231,null,0,0]
[10777.5,10.7775,3.7067905988882464,1.2976368078036913,1.0000330157468562,8.1258646943590061E-3,1,0,145.29709991266617,1.5639138226330427,1.484400161304019,0.83162897795621737,1.0002842568276455,2.3840700871466676E-2,1.0017917374626308,5.98174937176882E-2,1.000071160728349,1.1929501978774983E-2,1.000177725094366,4.120413589482072E-2,15.687776825407918,-121.24447341202186,58.755526587978139,null,1000000000,116154506.25,null,25.018947563766467,-43.322802591447541,null,21.773002507285817,-76.244357848477748,null,0,0]
[10840,10.84,3.7267264424633968,1.2991352029202643,1.0000333997752142,8.1729854545245974E-3,1,0,146.13965522061631,1.5639535037256145,1.4891078326861216,0.83450702811399258,1.0002875627899459,2.3978903083873737E-2,1.0018125598601848,6.0163548384311052E-2,1.0000719884306741,1.1998675954258962E-2,1.0001797948332942,4.1443134252009642E-2,15.618598041919192,-121.19634096036584,58.803659039634155,null,1000000000,117505600,null,24.996199311533328,-43.168094426624407,null,21.726398629151742,-76.341203341303611,null,0,0]
[10902.5,10.9025,3.7466705641859619,1.3006176489459746,1.0000337860240107,8.2201061783953675E-3,1,0,146.98221075603817,1.5639927298853136,1.4938277608037107,0.83736691474639491,1.0002908878574637,2.41171043801243E-2,1.0018335022236367,6.0509588624493786E-2,1.0000728209183747,1.2067849814909357E-2,1.0001818765973336,4.1682133487224209E-2,15.549922539173565,-121.14830937750919,58.851690622490807,null,1000000000,118864506.25,null,24.973724059574778,-43.014400836921908,null,21.680024036691215,-76.437135070921627,null,0,0]
[10965,10.965,3.7666228325585362,1.3020843927657022,1.0000341744932433,8.2672268657621138E-3,1,0,147.82476651504223,1.5640315088909507,1.4985598298437763,0.84020876291761359,1.0002942320300081,2.4255304754948349E-2,1.0018545645454633,6.0855614356271341E-2,1.0000736581914389,1.2137023560064464E-2,1.0001839703874724,4.1921133605489928E-2,15.481744188324573,-121.10038608928038,58.899613910719623,null,1000000000,120231225,null,24.951517709273435,-42.8617151020809,null,21.633876699805231,-76.532167183093378,null,0,0]
[11028.75,11.02875,3.786982405438617,1.3035645459455354,1.0000345730193507,8.3152899290527826E-3,1,0,148.68417361561893,1.5640706107019753,1.5033989289482594,0.84308899410514893,1.0002976627678037,2.4396268182550137E-2,1.0018761716869977,6.1208545571143705E-2,1.0000745171398333,1.220758066045319E-2,1.000186118443732,4.2164914641051411E-2,15.412708180244643,-121.05162332078653,58.948376679213467,null,1000000000,121633326.5625,null,24.929140080025061,-42.707006989046697,null,21.587038453340483,-76.628187527226387,null,0,0]
[11092.5,11.092499999999999,3.8073501862991304,1.3050288658653544,1.0000349738555943,8.3633529539249938E-3,1,0,149.54358094091367,1.5641092630871103,1.5082504197572775,0.84595071960200596,1.0003011133820652,2.4537230640424949E-2,1.0018979036172797,6.1561461519278972E-2,1.0000753810668945,1.2278137639289982E-2,1.0001882790140404,4.2408696605898973E-2,15.344176831287172,-121.002987981177,58.997012018823,null,1000000000,123043556.25,null,24.907033832753221,-42.553333368218588,null,21.540432449448033,-76.723300747828986,null,0,0]
[11156.25,11.15625,3.8277260441131875,1.3064775990469915,1.0000353770019712,8.4114159401567339E-3,1,0,150.40298848707428,1.5641474737503416,1.5131141830764443,0.84879407076470847,1.0003045838725872,2.4678192122980874E-2,1.0019197603281891,6.1914362113762285E-2,1.0000762499726097,1.2348694495872652E-2,1.0001904520994644,4.2652479505363654E-2,15.27614394009108,-120.95448711068718,59.045512889312818,null,1000000000,124461914.0625,null,24.885194847882836,-42.400687154507601,null,21.49405660648226,-76.817520969879936,null,0,0]
[11220,11.22,3.8481098505776523,1.307910987053708,1.0000357824584787,8.4594788875259966E-3,1,0,151.2623962503362,1.5641852502205769,1.5179901009394137,0.85161917845684421,1.0003080742391628,2.4819152624626251E-2,1.0019417418115597,6.2267247267701699E-2,1.0000771238569657,1.2419251229499014E-2,1.000192637701077,4.289626334477583E-2,15.208603403425014,-120.90612748365923,59.093872516340767,null,1000000000,125888400,null,24.863619080009371,-42.249061281036731,null,21.44790886675753,-76.910862034252716,null,0,0]
[11285.5,11.285500000000001,3.869061359408045,1.3093679889334742,1.0000362014512856,8.5088611692103917E-3,1,0,152.14539582151195,1.5642236191903214,1.5230124044289302,0.85450297358863248,1.0003116811214723,2.4963981602690727E-2,1.0019644566567301,6.262980329162747E-2,1.0000780269158098,1.2491744685833103E-2,1.0001948963370078,4.3146740274190909E-2,15.139715313176811,-120.85659429767719,59.143405702322809,null,1000000000,127362510.25,null,24.841721015450112,-42.094328460052999,null,21.400729770283967,-77.005863967412139,null,0,0]
[11351,11.351000000000001,3.8900209932078411,1.3108092930429154,1.0000366228827886,8.5582434093942356E-3,1,0,153.02839561408794,1.5642615453691973,1.5280472903877829,0.85736778831728788,1.0003153089856007,2.5108809533284544E-2,1.0019873032010109,6.2992342829758602E-2,1.0000789352303558,1.2564238010864839E-2,1.0001971681880386,4.3397218207272985E-2,15.071334227519097,-120.80722388754991,59.19277611245009,null,1000000000,128845201,null,24.820092392930299,-41.940657705999818,null,21.353787144810056,-77.099966544466838,null,0,0]
[11416.5,11.416499999999999,3.9109886213478853,1.3122351458222823,1.0000370467529844,8.6076256078367365E-3,1,0,153.91139562425357,1.5642990363780576,1.5330946348484866,0.86021376285187623,1.0003189578313196,2.5253636410343557E-2,1.0020102814353939,6.3354865787925305E-2,1.0000798488005895,1.2636731203832633E-2,1.0001994532553538,4.3647697149801178E-2,15.003453838387601,-120.75802277689093,59.241977223109075,null,1000000000,130336472.25,null,24.798729059095464,-41.788041421784726,null,21.307078835781738,-77.193183885748013,null,0,0]
[11482,11.481999999999999,3.9319641159361023,1.3136457887075004,1.0000374730618702,8.6570077642970956E-3,1,0,154.79439584828523,1.5643360996638722,1.5381543151659713,0.86304103678422206,1.0003226276583999,2.5398462227803894E-2,1.0020333913508197,6.3717372071983844E-2,1.000080767626496,1.2709224263974911E-2,1.0002017515401438,4.3898177107553879E-2,14.936067939105984,-120.70899722798953,59.291002772010472,null,1000000000,131836324,null,24.777626936465381,-41.636472035717837,null,21.260602714159486,-77.285529824860092,null,0,0]
[11548.75,11.54875,3.9533478696486455,1.3150679490906108,1.000037910015362,8.7073322848826261E-3,1,0,155.6942474378902,1.5643734377538872,1.5433231198794481,0.865903170864459,1.000326389105902,2.5546050800340853E-2,1.0020570777602495,6.4086779162997029E-2,1.0000817093943117,1.2783100642022956E-2,1.0002041072848156,4.4153438267625009E-2,14.867898461896322,-120.65922291674902,59.340777083250984,null,1000000000,133373626.5625,null,24.756386693379877,-41.483079349628099,null,21.213476341846601,-77.378755617219682,null,0,0]
[11615.5,11.615500000000001,3.9747395331231563,1.3164748044346006,1.0000383495015051,8.7576567613634419E-3,1,0,156.59409924205906,1.5644103467250039,1.5485044827444243,0.86874617445603808,1.0003301723427365,2.5693638259736147E-2,1.0020809009055152,6.4456168740087749E-2,1.0000826566202823,1.2856976880530516E-2,1.0002064767587793,4.4408700494153387E-2,14.800229826785735,-120.60964326987103,59.390356730128971,null,1000000000,134919840.25,null,24.735409410132526,-41.330758109319596,null,21.166586718838978,-77.471104559061871,null,0,0]
[11682.25,11.68225,{"$f":"SQRT(1+(A205/pole1)^2)","v":3.9961389793348001},{"$f":"ATAN(A205/pole1)","v":1.3178665950021324},{"$f":"SQRT(1+(A205/Zero1)^2)","v":1.000038791520296},{"$f":"ATAN(A205/Zero1)","v":8.8079811934847069E-3},{"$f":"IF(VIN_nom>Vout, 1, SQRT(1+(A205/z_RHP)^2))","v":1},{"$f":"IF(VIN_nom>Vout, 0, -ATAN(A205/z_RHP))","v":0},{"$f":"SQRT(1+(A205/Pole2)^2)","v":157.49395125711399},{"$f":"ATAN(A205/Pole2)","v":1.5644468339325179},1.5536982781219546,0.87157019322203133,{"$f":"SQRT(1+(A205/pole4)^2)","v":1.0003339773686557},{"$f":"ATAN(A205/pole4)","v":2.5841224599572915E-2},{"$f":"SQRT(1+(A205/Zero3)^2)","v":1.0021048607768646},{"$f":"ATAN(A205/Zero3)","v":6.4825540703703291E-2},{"$f":"SQRT(1+(A205/pole5)^2)","v":1.0000836093043926},{"$f":"ATAN(A205/pole5)","v":1.2930852978691598E-2},{"$f":"SQRT((1-(Z205/pterm2))^2+(A205/pterm1)^2)","v":1.0002088599633168},{"$f":"IF((ATAN((A205/pterm1)/(1-A205^2/pterm2))>0),ATAN((A205/pterm1)/(1-A205^2/pterm2)),PI()+ATAN((A205/pterm1)/(1-A205^2/pterm2)))","v":4.4663963793251958E-2},{"$f":"20*LOG10(((E205*K205*G205*O205)/(C205*I205*S205*M205*Q205))*Adc)","v":14.733055777727646},{"$f":"((F205+L205+H205+R205)-(D205+J205+T205+N205+T205))*radconv","v":-120.5602641293337},{"$f":"IF(V205>0,V205,V205+180)","v":59.439735870666297},null,{"$f":"IF(U205<0,A205,1000000000)","v":1000000000},{"$f":"A205^2","v":136474965.0625},null,{"$f":"20*LOG10((K205/(I205*M205))*AEA)","v":24.714691004273391},{"$f":"(L205-(J205+N205))*radconv","v":-41.179500389972809},null,{"$f":"20*LOG10((E205*G205/(C205*S205))*Acs*Am)","v":21.119931671708535},{"$f":"(F205+H205-(D205+T205))*radconv","v":-77.562590416788098},null,{"$f":"SUM((U206<0)*(U205>0))*A205","v":0},0]
[11749,{"$f":"A206/1000","v":11.749000000000001},4.0175460839194077,1.3192435561712608,1.0000392360717312,8.8583055809915764E-3,1,0,158.39380347946084,1.564482906564584,1.5589043817479902,0.87437537209791361,1.0003378041834114,2.5988809813434606E-2,1.0021289573644907,6.5194894954319613E-2,1.0000845674466263,1.3004728935700224E-2,1.0002112568997181,4.4919228171032763E-2,14.666370159960005,-120.51109108935974,59.488908910640262,null,1000000000,138039001,null,24.694227468423367,-41.029298298879993,null,21.073509053241835,-77.653226676932249,null,0,0]
[11817.5,11.817500000000001,4.0395222579414023,1.3206414415978118,1.0000396949111829,8.9099492878115614E-3,1,0,159.31724754493652,1.5645195012668178,1.5642596426079522,0.8772346589491069,1.0003417539795703,2.6140263125195025E-2,1.0021538278272621,6.5573914129697528E-2,1.0000855563833224,1.3080541567954598E-2,1.0002137309551093,4.5181186001206838E-2,14.598437687272634,-120.46084875890125,59.53915124109875,null,1000000000,139653306.25,null,24.673488290744807,-40.876247587262164,null,21.026108786802187,-77.745369723861955,null,0,0]
[11886,11.885999999999999,4.0615062400972359,1.322024196849148,1.0000401564178103,8.9615929471033688E-3,1,0,160.2406918213064,1.5645556741889897,1.56962760478055,0.88007441196104585,1.0003457267214924,2.6291715237475494E-2,1.0021788422478204,6.5952914438853719E-2,1.0000865510680541,1.3156354049838422E-2,1.0002162194746014,4.5443144980404061E-2,14.531006778024214,-120.4108346478714,59.589165352128603,null,1000000000,141276996,null,24.653009206885482,-40.72429184724998,null,20.978948797562694,-77.836645944164886,null,0,0]
[11954.5,11.954499999999999,4.0834979042789419,1.3233920610449574,1.0000406205916099,9.0132365585915957E-3,1,0,161.16413630494529,1.5645914325811987,1.5750081383994774,0.88289478529248411,1.0003497224089046,2.6443166143342408E-2,1.0022040006153867,6.6331895774324787E-2,1.0000875515008043,1.3232166380480682E-2,1.0002187224596126,4.5705105115226997E-2,14.464071100639542,-120.36105403999824,59.638945960001763,null,1000000000,142910070.25,null,24.632786122070158,-40.573422661200283,null,20.932026848909693,-77.927069038784097,null,0,0]
[12023,12.023,4.1054971270370144,1.3247452684052479,1.000041087432578,9.0648801220008322E-3,1,0,162.08758099231065,1.5646267835283278,1.5804011150648876,0.88569593223857801,1.0003537410415315,2.6594615835862499E-2,1.0022293029191207,6.6710858028679945E-2,1.0000885576815555,1.3307978559010366E-2,1.0002212399115691,4.5967066412277213E-2,14.397624427489454,-120.31151197829308,59.688488021706917,null,1000000000,144552529,null,24.612815017851354,-40.423631651484229,null,20.885340731848817,-78.016652427931518,null,0,0]
[12093,12.093,4.1279857675076697,1.326113205002057,1.0000415672517529,9.1176545164042885E-3,1,0,163.0312473030522,1.5646624948625574,1.5859249087553404,0.88853871425680597,1.0003578713775167,2.6749380684300317E-2,1.0022553079750629,6.7098098902357212E-2,1.0000895918336261,1.3385450700185949E-2,1.0002238274373092,4.6234765295644929E-2,14.330221527369675,-120.2611364971284,59.738863502871595,null,1000000000,146240649,null,24.5926628043552,-40.271665720955028,null,20.837873655262115,-78.107343687805468,null,0,0]
[12163,12.163,4.1504820487579348,1.3274663152346593,1.0000420498561775,9.1704288600185594E-3,1,0,163.97491381931434,1.5646977951633438,1.5914614299249212,0.89136173949838404,1.0003620256740338,2.6904144251032238E-2,1.0022814633168833,6.7485319623373022E-2,1.0000906319881546,1.3462922680675123E-2,1.0002264300735584,4.6502465406633137E-2,14.263316456530919,-120.21102003666202,59.788979963337979,null,1000000000,147938569,null,24.572765480090858,-40.120808146428075,null,20.790648274299564,-78.197185532831341,null,0,0]
[12233,12.233000000000001,4.1729858472150498,1.328804833971601,1.000042535245848,9.2232031525497464E-3,1,0,164.91858053756908,1.5647326914864177,1.597010546202642,0.89416516867863438,1.0003662039307843,2.7058906528660557E-2,1.0023077689328164,6.7872520077189941E-2,1.0000916781451223,1.3540394499548429E-2,1.0002290478218647,4.6770166752283342E-2,14.196902892691954,-120.16116725027746,59.838832749722542,null,1000000000,149646289,null,24.553118993260075,-39.971050123433379,null,20.743662318681459,-78.286191420405885,null,0,0]
[12303,12.303000000000001,4.1954970419166795,1.3301289912522976,1.0000430234207598,9.2759773937039647E-3,1,0,165.8622474543688,1.5647671907269409,1.6025721267518642,0.89694916152155491,1.0003704061474681,2.7213667509787948E-2,1.0023342248110305,6.8259700149306823E-2,1.0000927303045104,1.3617866155876424E-2,1.0002316806837861,4.7037869339635982E-2,14.130974618353942,-120.11158256226798,59.888417437732016,null,1000000000,151363809,null,24.53371936831001,-39.822382895099821,null,20.696913546666234,-78.374374531236995,null,0,0]
[12374.5,12.374499999999999,4.2184981319286816,1.3314669312214396,1.0000435249319655,9.3298824581086025E-3,1,0,166.82613600656902,1.5648020263059605,{"$f":"SQRT(1+(A215/Zero2)^2)","v":1.6082656173474865},{"$f":"ATAN(A215/Zero2)","v":0.89977291083996846},1.0003747231469129,2.7371743451490967E-2,1.0023614027151888,6.8655155776735199E-2,1.0000938112068849,1.3696997750352055E-2,1.000234385568685,4.7311309700221772E-2,14.064128237548225,-120.06121649143877,59.938783508561229,null,1000000000,153128250.25,null,24.514154834909036,-39.671646992536395,null,20.649405575645257,-78.463611290737987,null,0,0]
[12446,12.446,4.2415066914951307,1.3327903579079794,1.0000440293490507,9.3837874682909991E-3,1,0,167.79002475888973,1.5648364616511834,1.6139718410126715,0.90257671556008845,1.0003790651435087,2.7529818024933685E-2,1.0023887373652742,6.9050589898238118E-2,1.0000948983716424,1.3776129173281358E-2,1.000237106225178,4.7584751371140543E-2,13.997775380079933,-120.011138765062,59.988861234938,null,1000000000,154902916,null,24.49483970829986,-39.522030821177644,null,20.602140423701051,-78.552016578581302,null,0,0]
[12517.5,12.5175,4.264522599713616,1.3340995016255672,1.0000445366720108,9.4376924239379673E-3,1,0,168.75391370790183,1.5648705036206958,1.619690663170352,0.90536074262686372,1.0003834321369298,2.7687891222234168E-2,1.0024162287484639,6.9446002391913383E-2,1.0000959917987629,1.3855260423673884E-2,1.0002398426549539,4.7858194359891415E-2,13.931909745550488,-119.96135340731867,60.038646592681332,null,1000000000,156687806.25,null,24.475769987589512,-39.373525208270372,null,20.555115791549508,-78.639603591214708,null,0,0]
[12589,12.589,4.2875457382395838,1.3353945879391369,1.0000450469008417,9.4915973247363204E-3,1,0,169.717802850254,1.5649041589167896,1.6254219508423771,0.9081251578647489,1.0003878241268489,2.7845963035510894E-2,1.0024438768518629,6.9841393135899196E-2,1.0000970914882252,1.3934391500539199E-2,1.0002425948597105,4.8131638673972299E-2,13.866525138900975,-119.91186422558135,60.088135774418646,null,1000000000,158482921,null,24.456941747858853,-39.226121036334625,null,20.508329409273621,-78.726385253004423,null,0,{"$f":"IF(AH218>0,W218,0)","v":0}]
[12662.25,12.66225,4.3111397569719463,1.3367070254143367,1.0000455726312116,9.546821519047375E-3,1,0,170.70528388197366,1.5649382438064579,1.6313063043221048,0.91093706807506747,1.0003923495343692,2.8007902295832512E-2,1.0024723641644013,7.024643859364961E-2,1.0000982245872714,1.4015459171027709E-2,1.0002454307867645,4.841177706327688E-2,13.800032673620867,-119.86147466892209,60.138525331077915,null,1000000000,160332575.0625,null,24.437899070714053,-39.076241805219439,null,20.460642631237846,-78.81446901543454,null,0,0]
[12735.5,12.7355,4.3347411207627085,1.33800517344942,1.0000461014114286,9.6020456551266196E-3,1,0,171.69276510973398,1.5649719366215344,1.6372034635008499,0.91372874338920496,1.000396901176265,2.816984008680664E-2,1.0025010159350203,7.0651460965211604E-2,1.0000993642589155,1.4096526657286298E-2,1.0002482832740911,4.8691916859509091E-2,13.734032237995653,-119.81140338851027,60.188596611489729,null,1000000000,162192960.25,null,24.419101737634389,-38.927499399848827,null,20.413201177976809,-78.90173413720089,null,0,0]
[12808.75,12.80875,4.3583497102868476,1.3392892598451045,1.0000466332414883,9.6572697326373063E-3,1,0,172.68024653017176,1.5650052440882423,1.6431132904990589,0.91650035839664179,1.000401479052178,2.8331776399960124E-2,1.0025298321496197,7.1056460119687997E-2,1.0001005105031349,1.4177593958250058E-2,1.0002511523235473,4.8972058070726826E-2,13.668517501290632,-119.76165381902763,60.238346180972371,null,1000000000,164064076.5625,null,24.400545765677695,-38.779884201881138,null,20.366002701941532,-78.988193670804165,null,0,0]
[12882,12.882,4.3819654087547351,1.3405595076791179,1.0000471681213856,9.7124937512426991E-3,1,0,173.66772814000026,1.5650381727798253,1.6490356491196427,0.91925208641963307,1.0004060831617483,2.8493711226820272E-2,1.0025588127940195,7.1461435926227071E-2,1.0001016633199069,1.4258661072854093E-2,1.000254037937002,4.9252200704986593E-2,13.603482239835969,-119.71222918838987,60.28777081161013,null,1000000000,165945924,null,24.382227248450906,-38.63338665681632,null,20.319044886100155,-79.073860398137583,null,0,0]
[12957.25,12.95725,4.4062331870842302,1.3418502571022171,1.0000477207813898,9.7692255311880843E-3,1,0,174.68217189888881,1.5650716128689788,1.6551326185410924,0.92205841884766515,1.0004108402982657,2.8660065925778078E-2,1.0025887559292459,7.1877444642350616E-2,1.0001028544570667,1.4341941428853698E-2,1.000257019589073,4.9539993775210067E-2,13.537164133892789,-119.66179662889891,60.338203371101088,null,1000000000,167890327.5625,null,24.363651809605376,-38.484043050736219,null,20.271053148941039,-79.161053729331528,null,0,0]
[13032.5,13.032500000000001,4.4305082259224156,1.3431268644349994,1.0000482766600389,9.8259572482471344E-3,1,0,175.69661585085819,1.565104666802795,1.6612425272224756,0.92484413017658362,1.0004156251197749,2.8826419038045781E-2,1.0026188725653618,7.2293428438346977E-2,1.0001040525305411,1.4425221585899692E-2,1.0002600187260418,4.982778836447771E-2,13.471339065874126,-119.61171326235809,60.388286737641906,null,1000000000,169846056.25,null,24.345318852447107,-38.335858730623876,null,20.223310532922824,-79.247436869073837,null,0,0]
[13107.75,13.107749999999999,4.4547904065774269,1.3443895567392545,1.0000488357573272,9.8826889020547735E-3,1,0,176.71105999258316,1.5651373412315999,1.6673652329195636,0.9276094040998496,1.0004204376258785,2.8992770554439117E-2,1.0026491626867322,7.2709387172502513E-2,1.0001052575403049,1.45085015428376E-2,1.0002630353499684,5.0115584481519447E-2,13.406000627179784,-119.56198195518643,60.438018044813575,null,1000000000,171813110.0625,null,24.327224383061726,-38.188823552128589,null,20.175814623629684,-79.333022827567873,null,0,0]
[13183,13.183,4.4790796128966841,1.3456385563311875,1.0000493980732499,9.9394204922459324E-3,1,0,177.72550432081437,1.565169642653885,1.6735005951740431,0.93035442287578718,1.0004252778161771,2.9159120465774346E-2,1.0026796262776347,7.3125320703155292E-2,1.0001064694863333,1.4591781298512961E-2,1.000266069462926,5.0403382135063603E-2,13.3411425191021,-119.51260537542861,60.487394624571394,null,1000000000,173791489,null,24.309364485433495,-38.04292744442759,null,20.128563038641193,-79.417824343114916,null,0,0]
[13259.75,13.25975,4.5038601087041741,1.3468985737860055,1.0000499749136338,9.9972828787902E-3,1,0,178.76017031949883,1.5652022103095431,1.6797711507063886,0.93313348231865245,1.0004302430057193,2.9328784659294813E-2,1.002710875790594,7.3549519158697424E-2,1.0001077127357672,1.4676720907245804E-2,1.0002691820741356,5.06969182107097E-2,13.275479927239136,-119.46261251689754,60.537387483102464,null,1000000000,175820970.0625,null,24.291386227354458,-37.895286098607784,null,20.080618802212527,-79.503521133214548,null,0,0]
[13336.5,13.336499999999999,4.5286476767769743,1.3481447997819462,1.0000505551022372,1.0055145198389395E-2,1,0,179.79483650560348,1.5652344031307546,1.6860545828448354,0.93589184944992077,1.0004352369932985,2.9498447163834617E-2,1.0027423057244247,7.3973691098427899E-2,1.0001089632006974,1.4761660304186604E-2,1.0002723128829558,5.0990455903060082E-2,13.210304110570814,-119.41299367613068,60.587006323869318,null,1000000000,177862232.25,null,24.273643997383004,-37.748808761708908,null,20.03292382112976,-79.588427827392266,null,0,0]
[13413.25,13.41325,4.5534422016172389,1.3493774557089473,1.0000511386390538,1.0113007450656183E-2,1,0,180.82950287591115,1.5652662275516109,1.6923507481629498,0.93862971300933107,1.0004402597784838,2.9668107969651528E-2,1.002773916062162,7.4397836372211604E-2,1.000110220881097,1.484659948811053E-2,1.0002754618916239,5.1283995221370317E-2,13.145608725167827,-119.3637510930876,60.6362489069124,null,1000000000,179915275.5625,null,24.256133879913897,-37.603484987828587,null,19.98547566736173,-79.672557110909665,null,0,0]
[13490,13.49,4.5782435701970758,1.3505967583266487,1.000051725524078,1.0170869635203226E-2,1,0,181.86416942727789,1.5652976898597875,1.698659505072261,0.94134726017077885,1.0004453113608414,2.9837767067003904E-2,1.002805706786746,7.4821954829970658E-2,1.0001114857769384,1.4931538457792772E-2,1.00027862910239,5.1577536174894204E-2,13.081387536582,-119.31488682375851,60.685113176241487,null,1000000000,181980100,null,24.238852036292155,-37.459304412391667,null,19.93827194540976,-79.755921403731676,null,0,0]
[13568.5,13.5685,4.6036174065920807,1.3518302703474034,1.0000523292544323,1.0230051082491197E-2,1,0,182.92242790821189,1.5653295013624833,1.7051249897013001,0.94410594786163993,1.0004505079149812,3.0011292835335313E-2,1.0028384089667108,7.5255715844638582E-2,1.0001127869781243,1.5018413923751946E-2,1.0002818873614245,5.1877771945832027E-2,13.016186173845885,-119.26530169416472,60.734698305835281,null,1000000000,184104192.25,null,24.221408362429038,-37.313008209550063,null,19.890242309176067,-79.840407831974645,null,0,0]
[13647,13.647,4.6289981708318972,1.3530502575321322,1.0000529364874096,1.0289232458116398E-2,1,0,183.98068657212866,1.5653609469050769,1.7116033528473804,0.94684377317043744,1.0004557345935652,3.0184816795791141E-2,1.00287129981701,7.5689448489064823E-2,1.0001140957274888,1.510528916299632E-2,1.0002851646668867,5.2178009446979888E-2,12.951468027354064,-119.21611611880162,60.783883881198378,null,1000000000,186240609,null,24.204195606998336,-37.167886261599669,null,19.842463411453263,-79.924119447433526,null,0,0]
[13725.5,13.7255,4.6543857495821319,1.3542569375349045,1.000053547223003,1.0348413761664406E-2,1,0,185.03894541588872,1.5653920327664081,1.7180944488286858,0.94956093127948815,1.0004609913961213,3.0358338937950011E-2,1.0029043793190811,7.612315260285768E-2,1.0001154120250013,1.5192164174215435E-2,1.0002884610212264,5.2478248688233316E-2,12.887226767336271,-119.16733174559246,60.832668254407537,null,1000000000,188389350.25,null,24.187209901361481,-37.023927744571402,null,19.794932791430039,-80.007068721358635,null,0,0]
[13804,13.804,4.6797800319376259,1.3554505234424117,1.0000541614612066,1.040759499272079E-2,1,0,186.09720443642402,1.565422765082499,1.7245981338725012,0.95225761565621858,1.0004662783221743,3.0531859251391173E-2,1.0029376474542573,7.655682802568943E-2,1.0001167358706329,1.5279038956098853E-2,1.000291776426907,5.277848967948584E-2,12.823456174233508,-119.118950050842,60.881049949157998,null,1000000000,190550416,null,24.170447453693825,-36.881121924569335,null,19.747648021694271,-80.089267863308692,null,0,0]
[13884.25,13.88425,4.7057472452874425,1.3566573999862941,1.0000547930132173,1.0468095475218885E-2,1,0,187.17905539817161,1.5654538233030082,1.7312596709402397,0.95499345342643083,1.000471714247436,3.0709245950900008E-2,1.0029718522039845,7.7000141547565612E-2,1.0001180970311148,1.5367850198515281E-2,1.0002951854386279,5.3085425760497788E-2,12.758744102584034,-119.0699073920312,60.930092607968803,null,1000000000,192772398.0625,null,24.153538229871675,-36.736312980916196,null,19.699560771953461,-80.172536515478257,null,0,0]
[13964.5,13.964499999999999,4.7317212375623932,1.3578510283590526,1.0000554282257326,1.0528595881081361E-2,1,0,188.26090653839944,1.5654845245681714,1.7379340667607284,0.95770829785772582,1.000477181653239,3.0886630717225392E-2,1.0030062540511731,7.7443424746366563E-2,1.0001194660799437,1.5456661198487393E-2,1.0002986143658326,5.3392363691307253E-2,12.694511114754459,-119.02128816610214,60.978711833897862,null,1000000000,195007260.25,null,24.13685455342091,-36.592686304184198,null,19.65172543042047,-80.255046213731774,null,0,0]
[14044.75,14.044750000000001,4.7577018977367649,1.359031622166476,1.0000560670987453,1.0589096209865468E-2,1,0,189.34275785404816,1.5655148749965579,1.7446211737528137,0.96040235010207042,1.0004826805390674,3.1064013539236157E-2,1.0030408529755428,7.7886677451011008E-2,1.0001208430170869,1.554547195461521E-2,1.000302063211199,5.3699303482477818E-2,12.630750908341044,-118.97309343785273,61.026906562147275,null,1000000000,197255002.5625,null,24.120392610913967,-36.450230719145033,null,19.604139508469117,-80.336809197410076,null,0,0]
[14125,14.125,4.7836891171686142,1.3601993905198644,1.0000567096322481,1.0649596461128454E-2,1,0,190.42460934212787,1.565544880567695,1.751320846310461,0.96307580944944782,1.000488210904402,3.1241394405801877E-2,1.0030756489567003,7.8329899490489158E-2,1.0001222278425117,1.5634282465498781E-2,1.0003055319774203,5.4006245144570843E-2,12.567457291564271,-118.92532411328276,61.074675886717245,null,1000000000,199515625,null,24.104148665380968,-36.308935149287677,null,19.556800551641665,-80.417837448338574,null,0,0]
[14207.25,14.20725,4.8103306884294614,1.3613831674275998,1.0000573719775074,1.0711604425909011E-2,1,0,191.53342303693657,1.5655752821992523,1.7582003778104769,0.9657947345113882,1.0004939117636966,3.1423193938524281E-2,1.0031115165905564,7.8784135562198626E-2,1.0001236553663062,1.5725306066494801E-2,1.0003091078672244,5.4320838395595004E-2,12.503064076386954,-118.87680650242777,61.123193497572231,null,1000000000,201845952.5625,null,24.087722268999052,-36.165310449383028,null,19.508535549136493,-80.500134939999754,null,0,0]
[14289.5,14.2895,4.836978926279011,1.3625539024603579,1.00005803816797,1.0773612308314551E-2,1,0,192.64223690673393,1.5656053338582532,1.7650928055276109,0.96849244538212875,1.0004996456900082,3.1604991393446157E-2,1.0031475911819963,7.923833905768865E-2,1.0001250911763973,1.5816329406892458E-2,1.0003127046889748,5.4635433634416378E-2,12.439148173258888,-118.82873720723779,61.171262792762207,null,1000000000,204189810.25,null,24.071517160684522,-36.022881062101639,null,19.460524861694878,-80.581685305879077,null,0,0]
[14371.75,14.37175,4.8636337211369494,1.363711806807385,1.0000587082036281,1.0835620107868402E-2,1,0,193.75105094851565,1.5656350415531952,1.7719979789770852,0.97116915056982489,1.0005054126827679,3.1786786758586379E-2,1.0031838727086932,7.9692509793078611E-2,1.0001265352727495,1.5907352485184576E-2,1.0003163224456213,5.4950030872398491E-2,12.375703262508271,-118.78111672631888,61.218883273681115,null,1000000000,206547198.0625,null,24.05552955565414,-35.881635384381291,null,19.412765954813494,-80.662500646907446,null,0,0]
[14454,14.454000000000001,4.8902949657853787,1.3648570871917507,1.0000593820844741,1.0897627824093897E-2,1,0,194.85986515934576,1.5656644111558189,1.7789157497345203,0.97382505655226825,1.0005112127414044,3.1968580021964704E-2,1.003220361148196,8.0146647584568506E-2,1.0001279876553268,1.5998375299864E-2,1.0003199611401306,5.5264630120902353E-2,12.312723136536894,-118.7339454108795,61.2660545891205,null,1000000000,208918116,null,24.039755745936581,-35.741561921655482,null,19.365256329252784,-80.742592808122524,null,0,0]
[14622.5,14.6225,4.9449337520505967,1.3671647720199123,1.0000607746260641,1.1024658567146918E-2,1,0,197.13141819224214,1.5657235469304158,1.7931264414646901,0.97920193953919688,1.0005231981828702,3.2341000944701888E-2,1.0032957585853686,8.1076905245856257E-2,1.0001309889288348,1.6184846741114801E-2,1.0003274808835165,5.5909134603660322E-2,12.185125854239464,-118.6387121086117,61.361287891388301,null,1000000000,213817506.25,null,24.008093413833397,-35.458215596622857,null,19.268694677349437,-80.904462470701475,null,0,0]
[14706.75,14.70675,4.9722628575693779,1.368299592545982,1.0000614769485179,1.108817380549742E-2,1,0,198.26719496276371,1.5657526066774434,1.8002509973111573,0.98185850993022206,1.0005292429413823,3.2527208047206234E-2,1.0033337828539526,8.1541981445774236E-2,1.0001325026065875,1.6278082040435987E-2,1.0003312737207344,5.6231390057654491E-2,12.122033134811145,-118.59180275640169,61.408197243598309,null,1000000000,216288495.5625,null,23.992583526026365,-35.318339207025126,null,19.220795808201217,-80.984307619788012,null,0,0]
[14791,14.791,4.9995982964461829,1.3694220051805481,1.0000621833053995,1.1151688954380885E-2,1,0,199.40297189880846,1.5657813353823835,1.8073881579720801,0.98449411783916618,1.0005353223909101,3.2713412893304802E-2,1.003372024123016,8.2007022295604567E-2,1.0001340249782866,1.6371317056728132E-2,1.0003350885393127,5.6553647669658418E-2,12.059402714711403,-118.54536471816292,61.454635281837085,null,1000000000,218773681,null,23.977282905936935,-35.179644782583118,null,19.17314818011571,-81.063441977828859,null,0,0]
[14877.25,14.87725,5.0275891006216851,1.3705584177970462,1.0000629106096119,1.1216711788066512E-2,1,0,200.56571106714466,1.5658104090230069,1.8147076487006597,0.9871707975227727,1.0005415820951331,3.2904035681659019E-2,1.0034113979594239,8.2483065866249025E-2,1.0001355924953046,1.6466765072297548E-2,1.0003390166910822,5.6883557562189574E-2,11.995758044851746,-118.49831218052152,61.501687819478477,null,1000000000,221332567.5625,null,23.961832092716921,-35.038870011597709,null,19.124627096156345,-81.143730535150837,null,0,0]
[14963.5,14.9635,5.0555863256938318,1.3716822452205228,1.000063642142053,1.128173452690048E-2,1,0,201.72845040306004,1.5658391475094855,1.8220400365946356,0.98982595271867146,1.0005478781556274,3.3094656077908902E-2,1.0034509991685208,8.2959071970624049E-2,1.000137169123853,1.6562212787805664E-2,1.0003429678872051,5.7213469742268597E-2,11.932585069567708,-118.45175277152302,61.548247228476981,null,1000000000,223906332.25,null,23.946593057812091,-34.89930916294005,null,19.076364052799054,-81.223298150528947,null,0,0]
[15049.75,15.04975,5.0835898655758083,1.3727936925694628,1.0000643779027134,1.1346757170333174E-2,1,0,202.89118990367348,1.565867556603928,1.8293851665740111,0.99245980503148279,1.0005542105717065,3.3285274068246933E-2,1.0034908277233874,8.3435040397469462E-2,1.0001387548638887,1.6657660201514803E-2,1.000346942131243,5.7543384222974801E-2,11.86987748088767,-118.40568587756474,61.594314122435264,null,1000000000,226494975.0625,null,23.931562103315478,-34.760949868954071,null,19.028356440443389,-81.302156577167565,null,0,0]
[15136,15.135999999999999,5.1115996164818869,1.3738929605903178,1.0000651178915843,1.141177971781498E-2,1,0,204.05392956616944,1.5658956419371111,1.8367428857720944,0.99507257370646618,1.0005605793426804,3.3475889638866628E-2,1.0035308835969547,8.3910970935626827E-2,1.0001403497153682,1.6753107311687308E-2,1.0003509394267776,5.7873301017384339E-2,11.80762908471001,-118.36011076220119,61.639889237798812,null,1000000000,229098496,null,23.916735608051614,-34.623779889640396,null,18.980601686629957,-81.380317317771826,null,0,0]
[15224,15.224,5.1401839771544191,1.3750021839465589,1.0000658772524771,1.1478121463900473E-2,1,0,205.24026121189249,1.5659239691456175,1.8442627106434251,0.99771685047197245,1.0005671148032049,3.3670370263604081E-2,1.0035719864540353,8.4396518766813242E-2,1.0001419863167322,1.6850490715252138E-2,1.0003550415884066,5.8209914173899688E-2,11.744584629134136,-118.31411689527664,61.685883104723359,null,1000000000,231770176,null,23.901815330074342,-34.485039939441172,null,18.932135970911421,-81.459356545852771,null,0,0]
[15312,15.311999999999999,5.1687745922338015,1.3760991375001717,1.0000666410148806,1.1544463108946041E-2,1,0,206.42659302041369,1.5659519707617116,1.8517953261829476,1.0003396330099461,1.0005736881073977,3.3864848340402473E-2,1.0036133258905198,8.4882026712439218E-2,1.0001436324029389,1.694787379918359E-2,1.000359167754044,5.8546529766450625E-2,11.682005513721492,-118.26863305116274,61.731366948837262,null,1000000000,234457344,null,23.887100512915591,-34.347512716707627,null,18.883928183952332,-81.537692911390565,null,0,0]
[15400,15.4,5.19737135850401,1.3771840211204252,1.0000674091787844,1.1610804652367947E-2,1,0,207.61292498894221,1.5659796523668033,1.8593405769368685,1.0029411466881459,1.0005802992545125,3.4059323854601177E-2,1.0036549018771745,8.5367494548561573E-2,1.0001452879739416,1.7045256561636187E-2,1.0003633179275602,5.8883147808915189E-2,11.619885510351136,-118.2236580895845,61.776341910415496,null,1000000000,237160000,null,23.87258754580192,-34.211185627769574,null,18.835975708909167,-81.615337866879401,null,0,0]
[15488,15.488,5.2259741749862645,1.3782570304159529,1.0000681817441786,1.1677146093582461E-2,1,0,208.79925711475082,1.5660070194154574,1.8668983097058567,1.0055216143856522,1.0005869482437995,3.4253796791540718E-2,1.0036967143846041,8.5852922051349784E-2,1.0001469530296929,1.714263900076449E-2,1.000367492112848,5.9219768315167905E-2,11.558218503865326,-118.17919076147311,61.820809238526891,null,1000000000,239878144,null,23.858272893429199,-34.076046214279955,null,18.78827596643508,-81.692302620696822,null,0,0]
[15578.25,15.578250000000001,5.2553144942267416,1.3793453415273891,1.0000689786343906,1.1745183658055875E-2,1,0,210.01592175662034,1.5660347650504785,1.8746620866274648,1.0081464307979842,1.0005938065407378,3.445323935559029E-2,1.0037398416000565,8.6350718925045894E-2,1.0001486705094538,1.7242510994039006E-2,1.0003717979690914,5.9564998169343845E-2,11.49543901320799,-118.13411233565623,61.865887664343774,null,1000000000,242681873.0625,null,23.843794601106879,-33.938672236661624,null,18.739616473201657,-81.770540202582225,null,0,0]
[15668.5,15.6685,5.2846609688515613,1.3804215668087156,1.0000697801540248,1.1813221113784963E-2,1,0,211.2325865583019,1.5660621910649726,1.8824386727464117,1.0107495781418494,1.000600704638086,3.46526791776764E-2,1.0037832175225663,8.6848472900041912E-2,1.0001503979650779,1.7342382643312698E-2,1.0003761290890438,5.991023064445563E-2,11.433123305940038,-118.08956484521919,61.910435154780814,null,1000000000,245501892.25,null,23.829517598170558,-33.802521335203636,null,18.691217424516978,-81.848085473808808,null,0,0]
[15758.75,15.758749999999999,5.3140134968819703,1.3814859040181224,1.0000705863030701,1.1881258460140084E-2,1,0,212.44925151704993,1.5660893029501541,1.8902279099677586,1.013331288799763,1.000607642535021,3.4852116241989972E-2,1.0038268421198935,8.7346183735268867E-2,1.0001521353965142,1.744225394659504E-2,1.0003804854769764,6.0255465755457829E-2,11.371265139871873,-118.04554662191585,61.954453378084153,null,1000000000,248338201.5625,null,23.815438306716132,-33.667580509086235,null,18.643076156651237,-81.924949765979122,null,0,0]
[15849,15.849,5.3433719785591869,1.3825385466766551,1.0000713970815152,1.1949295696491604E-2,1,0,213.66591663018124,1.5661161060721667,1.8980296425366669,1.0158917924858244,1.0006146202307147,3.5051550532723255E-2,1.0038707153596185,8.7843851189785049E-2,1.0001538828037104,1.7542124901895551E-2,1.0003848671371864,6.0600703517301034E-2,11.30985838711403,-118.00205590045172,61.997944099548278,null,1000000000,251190801,null,23.801553224540001,-33.533836903212709,null,18.595190044477278,-82.00114416792502,null,0,0]
[15941.25,15.94125,5.3733871151228865,1.3836026275954321,1.00007223061176,1.2018840568890422E-2,1,0,214.90954400790596,1.5661431895261919,1.9060170207103728,1.0184873579059255,1.0006217936873989,3.5255401537012801E-2,1.0039158177941361,8.8352502201856226E-2,1.0001556792443709,1.7644208702254898E-2,1.0003893720209565,6.0953594732637333E-2,11.24755108659661,-117.95814462783115,62.041855372168854,null,1000000000,254123451.5625,null,23.787557583486659,-33.398353528841575,null,18.546503750805783,-82.078346063310349,null,0,0]
[16033.5,16.0335,5.4034082682052311,1.384654885699647,1.0000730689788355,1.2088385325025848E-2,1,0,216.15317154145581,1.5661699613333717,1.9140171324225399,1.0210612429203385,1.0006290087245568,3.5459249610037179E-2,1.0039611799442525,8.8861107380575038E-2,1.0001574861077187,1.77462921348332E-2,1.0003939033186717,6.1306488749179759E-2,11.185702835999919,-117.91478047830904,62.085219521690959,null,1000000000,257073122.25,null,23.773757689454669,-33.264094326217837,null,18.498078621092525,-82.154870728477206,null,0,0]
[16125.75,16.12575,5.4334353380776994,1.3856955146506187,1.0000739121827293,1.2157929964225475E-2,1,0,217.39679922815657,1.5661964268420345,1.922029818669819,1.0236136843597419,1.0006362653412886,3.5663094734918556E-2,1.0040068017747654,8.9369666469040654E-2,1.0001593033936971,1.7848375197504828E-2,1.0003984610350001,6.165938558288199E-2,11.124307444933059,-117.8719612859215,62.1280387140785,null,1000000000,260039813.0625,null,23.760150035626811,-33.131046031412765,null,18.449911972370369,-82.230729260354465,null,0,0]
[16218,16.218,5.4634682271847472,1.3867247039534223,1.0000747602234294,1.2227474485816901E-2,1,0,218.64042706539485,1.5662225912788257,1.9300549228414332,1.0261449162427898,1.0006435635366899,3.5866936894780571E-2,1.0040526832502763,8.9878179210494111E-2,1.0001611311022494,1.7950457888144193E-2,1.0004030451746366,6.2012285249693315E-2,11.063358837021447,-117.82968480071391,62.170315199286094,null,1000000000,263023524,null,23.746731190032641,-32.999195534642901,null,18.402001160845039,-82.305932517735471,null,0,0]
[16312.5,16.3125,5.4942395598940923,1.3877673276965616,1.0000756339632373,1.2298715092603231E-2,1,0,219.91438744232738,1.5662490870355055,1.9382884759607883,1.0287161353575325,1.0006510828481137,3.6075747722622106E-2,1.0040999529703938,9.0399046377075673E-2,1.0001630141959867,1.8055030012530764E-2,1.0004077685253667,6.2373795179720651E-2,11.001380704975244,-117.78693747047805,62.213062529521949,null,1000000000,266097656.25,null,23.733177316826261,-32.865357605196557,null,18.353184342985177,-82.382301665068582,null,0,0]
[16407,16.407,5.5250167986630307,1.3887983366288899,1.000076512778644,1.2369955574546017E-2,1,0,221.18834797186693,1.5662752775812963,1.9465347349756019,1.0312655858907021,1.000658645789231,3.628455540319888E-2,1.0041474950797535,9.0919864363259245E-2,1.0001649082267947,1.8159601742000521E-2,1.0004125196141254,6.2735308116610253E-2,10.939858863672452,-117.74475461517403,62.255245384825969,null,1000000000,269189649,null,23.719814516525069,-32.732749255980963,null,18.304630500994065,-82.458005512195129,null,0,0]
[16501.5,16.5015,5.5557998453388864,1.3898179216028228,1.0000773966696366,1.2441195930922468E-2,1,0,222.46230865139177,1.5663011681596564,1.9547935390871523,1.0337935104001961,1.0006662523590526,3.6493359918374178E-2,1.0041953095396683,9.1440632893504917E-2,1.0001668131946113,1.826417307426868E-2,1.0004172984460473,6.3096824077492453E-2,10.878787136858188,-117.70313357382001,62.296866426179989,null,1000000000,272299502.25,null,23.706639332301506,-32.601356888841138,null,18.25633691611079,-82.533054995175988,null,0,0]
[16596,16.596,5.5865886039140165,1.3908262693596811,1.0000782856362012,1.2512436161009799E-2,1,0,223.73626947833972,1.5663267638946208,1.9630647299601223,1.0363001484657357,1.0006739025565834,3.6702161250012903E-2,1.0042433963112363,9.1961351692432386E-2,1.0001687290993737,1.8368744007050505E-2,1.0004221050262965,6.3458343079492566E-2,10.818159462906891,-117.66207161367997,62.33792838632003,null,1000000000,275427216,null,23.693648381901188,-32.471167069416722,null,18.208300909634175,-82.607460814523321,null,0,0]
[16692.5,16.692499999999999,5.6180347733403124,1.3918445512290452,1.0000791986546973,1.2585183989756707E-2,1,0,225.0371925887257,1.5663526022726584,1.9715235932378317,1.0388381160047688,1.0006817596845035,3.6915378353294177E-2,1.0042927817690566,9.2493039387791604E-2,1.0001706968389197,1.8475527666634604E-2,1.00042704197395,6.3827516433436898E-2,10.756700730307493,-117.62071466233154,62.379285337668463,null,1000000000,278639556.25,null,23.680569175489573,-32.339449110887458,null,18.159511338522513,-82.682787999612415,null,0,0]
[16789,16.789000000000001,5.6494867032420508,1.3928514961364344,1.0000801169658491,1.2657931685289029E-2,1,0,226.33811584762432,1.5663781436282971,1.9799950470964698,1.0413543821327509,1.0006896623042352,3.7128592098643484E-2,1.0043424511042496,9.3024674644642896E-2,1.0001726759831171,1.8582310904828776E-2,1.0004320078678703,6.4196692994663518E-2,10.695692624122383,-117.57993473895155,62.42006526104845,null,1000000000,281870521,null,23.667675185009202,-32.208957341097083,null,18.110984842839358,-82.757465816023469,null,0,0]
[16885.5,16.8855,5.6809442979424967,1.3938472903542274,1.0000810405696428,1.2730679246837144E-2,1,0,227.6390392524894,1.5664033930538206,1.9884789306182833,1.043849192549346,1.0006976104147001,3.7341802466755197E-2,1.0043924042746999,9.3556257170269663E-2,1.0001746665318982,1.8689093719200304E-2,1.0004370027136509,6.4565872781391948E-2,10.63512904315707,-117.53972873153896,62.460271268461042,null,1000000000,285120110.25,null,23.654963037807946,-32.07967797315203,null,18.06271869476754,-82.831504937465638,null,0,0]
[16982,16.981999999999999,{"$f":"SQRT(1+(A269/pole1)^2)","v":5.7124074638553939},{"$f":"ATAN(A269/pole1)","v":1.3948321161405204},{"$f":"SQRT(1+(A269/Zero1)^2)","v":1.000081969466063},{"$f":"ATAN(A269/Zero1)","v":1.2803426673631432E-2},{"$f":"IF(VIN_nom>Vout, 1, SQRT(1+(A269/z_RHP)^2))","v":1},{"$f":"IF(VIN_nom>Vout, 0, -ATAN(A269/z_RHP))","v":0},{"$f":"SQRT(1+(A269/Pole2)^2)","v":228.93996280083269},{"$f":"ATAN(A269/Pole2)","v":1.5664283555257688},1.9969750853859567,1.046322789850425,{"$f":"SQRT(1+(A269/pole4)^2)","v":1.000705604014815},{"$f":"ATAN(A269/pole4)","v":3.7555009438325487E-2},{"$f":"SQRT(1+(A269/Zero3)^2)","v":1.0044426412380603},{"$f":"ATAN(A269/Zero3)","v":9.408778667213262E-2},{"$f":"SQRT(1+(A269/pole5)^2)","v":1.0001766684851949},{"$f":"ATAN(A269/pole5)","v":1.8795876107316527E-2},{"$f":"SQRT((1-(Z269/pterm2))^2+(A269/pterm1)^2)","v":1.0004420265169183},{"$f":"IF((ATAN((A269/pterm1)/(1-A269^2/pterm2))>0),ATAN((A269/pterm1)/(1-A269^2/pterm2)),PI()+ATAN((A269/pterm1)/(1-A269^2/pterm2)))","v":6.4935055811836062E-2},{"$f":"20*LOG10(((E269*K269*G269*O269)/(C269*I269*S269*M269*Q269))*Adc)","v":10.575003999926743},{"$f":"((F269+L269+H269+R269)-(D269+J269+T269+N269+T269))*radconv","v":-117.50009346929319},{"$f":"IF(V269>0,V269,V269+180)","v":62.499906530706809},null,{"$f":"IF(U269<0,A269,1000000000)","v":1000000000},{"$f":"A269^2","v":288388324},null,{"$f":"20*LOG10((K269/(I269*M269))*AEA)","v":23.642429434530342},{"$f":"(L269-(J269+N269))*radconv","v":-31.951597391361492},null,{"$f":"20*LOG10((E269*G269/(C269*S269))*Acs*Am)","v":18.014710206906827},{"$f":"(F269+H269-(D269+T269))*radconv","v":-82.904915807646304},null,{"$f":"SUM((U270<0)*(U269>0))*A269","v":0},0]
[17081,{"$f":"A270/1000","v":17.081},5.7446914313247905,1.3958312441168297,1.000082927927217,1.2878058607945986E-2,1,0,230.27458917832857,1.5664536715905852,2.0057039365597111,1.0488386764486539,1.0007138519745207,3.7773736356665671E-2,1.0044944745488908,9.463303095983501E-2,1.0001787341540183,1.8905424433032118E-2,1.0004472105689561,6.5313806559434515E-2,10.513770880928163,-117.46002112170625,62.539978878293752,null,1000000000,291760561,null,23.629753285676493,-31.821430340355377,null,17.965722960205291,-82.979586348439298,null,0,0]
[17180,17.18,5.7769810693725452,1.3968192040944667,1.0000838919587476,1.2952690398793229E-2,1,0,231.60921570170729,1.5664786958924886,2.0144453731394445,1.051332743962113,1.0007221478090522,3.7992459659043937E-2,1.0045466064563533,9.5178218817654855E-2,1.0001808118257727,1.9014972304933739E-2,1.0004524251104043,6.5692560759812169E-2,10.452986905623295,-117.42054254231876,62.579457457681244,null,1000000000,295152400,null,23.617258245443207,-31.692496506857918,null,17.917001294065916,-83.053617216091766,null,0,0]
[17279,17.279,5.8092762834425153,1.3977961803856072,1.000084861560639,1.3027322045342191E-2,1,0,232.94384236846139,1.5665034334463199,2.0231992319956125,1.0538052443769894,1.0007304915172193,3.8211179324623069E-2,1.0045990369139628,9.5723349930310342E-2,1.0001829015003834,1.912451972039492E-2,1.0004576701474428,6.6071318432617071E-2,10.392645965280607,-117.38165414228048,62.618345857719518,null,1000000000,298563841,null,23.604940979923633,-31.564781739259431,null,17.868542434464189,-83.127018972086887,null,0,0]
[17378,17.378,5.8415769810534224,1.3987623533107783,1.0000858367328749,1.3101953546761917E-2,1,0,234.2784691761405,1.5665278891526482,2.0319653525799297,1.0562564263951155,1.0007388830978241,3.842989533256793E-2,1.0046517658749772,9.6268423982720175E-2,1.0001850031777748,1.9234066676789247E-2,1.0004629456862879,6.6450079597490941E-2,10.332742065979119,-117.34335228566813,62.656647714331868,null,1000000000,301994884,null,23.592798228522835,-31.438272067582691,null,17.820343648878598,-83.199801949202822,null,0,0]
[17479.25,17.47925,5.874617363057193,1.3997394941144932,1.0000868398297806,1.3178281067688143E-2,1,0,235.64342855453711,1.5665526141326906,2.0409432214222418,1.0587415222213665,1.0007475149117318,3.8653578353892354E-2,1.0047060019292366,9.6825826733395987E-2,1.0001871650355492,1.9346102859165437E-2,1.0004683726797767,6.6837452603139724E-2,10.271922638240325,-117.30478278864207,62.695217211357928,null,1000000000,305524180.5625,null,23.580556690774777,-31.310119294982105,null,17.771315638573334,-83.273609586841246,null,0,0]
[17580.5,17.580500000000001,5.9076632914256439,1.400705704090323,1.0000878487530707,1.3254608435055347E-2,1,0,237.00838807532909,1.5665770543245412,2.0499335840720674,1.0612048354551722,1.0007561967962693,3.8877257505362708E-2,1.0047605501097105,9.7383169134729913E-2,1.0001893394477246,1.945813855581446E-2,1.0004738315905377,6.7224829302927586E-2,10.211548017674104,-117.26681897298404,62.733181027015959,null,1000000000,309073980.25,null,23.568491018054118,-31.183198034109129,null,17.722554006460246,-83.346791154631433,null,0,0]
[17681.75,17.681750000000001,5.9407146736018461,1.40166116386119,1.0000888635027281,1.3330935647974645E-2,1,0,238.37334773607031,1.5666012146203834,2.0589362768664636,1.0636466217381113,1.0007649287501337,3.9100932764697602E-2,1.0048154103655658,9.7940450850323643E-2,1.0001915264142194,1.9570173763926953E-2,1.0004793224253359,6.7612209717845415E-2,10.151612147979442,-117.22945682208375,62.770543177916252,null,1000000000,312644283.0625,null,23.556597948380041,-31.057493916805072,null,17.67405595909381,-83.419357002758105,null,0,0]
[17783,17.783000000000001,5.9737714190621416,1.4026060501315067,1.0000898840787344,1.3407262705557171E-2,1,0,239.73830753437036,1.5666250998009867,2.0679511387699545,1.0660671332900442,1.0007737107720145,3.9324604109617987E-2,1.0048705826456894,9.8497671544002879E-2,1.0001937259349511,1.968220848069362E-2,1.0004848451909745,6.7999593868877051E-2,10.092109087245406,-117.19269228448275,62.807307715517254,null,1000000000,316235089,null,23.544874292112155,-30.932992764577829,null,17.625818745082917,-83.491317256891577,null,0,0]
[17886.5,17.886500000000002,6.0075682100648775,1.4035611853114931,1.0000909333561889,1.3485285758496331E-2,1,0,241.1335999123784,1.566649236274279,2.0771787437138669,1.068519703928988,1.0007827396978772,3.9553241859813126E-2,1.0049273034250903,9.9067211498917312E-2,1.0001959873096462,1.979673234706248E-2,1.0004905236949497,6.8395590440013421E-2,10.031725009113586,-117.15572418734548,62.844275812654516,null,1000000000,319926882.25,null,23.533061965127914,-30.806953714040141,null,17.576776363527639,-83.564261012242255,null,0,0]
[17990,17.989999999999998,6.0413704203488692,1.4045056331475367,1.0000919887217807,1.3563308647239919E-2,1,0,242.52889242924712,1.5666730950285863,{"$f":"SQRT(1+(A279/Zero2)^2)","v":2.0864187325393537},{"$f":"ATAN(A279/Zero2)","v":1.0709505659975682},1.0007918209389333,3.978187547261644E-2,1.004984350141692,9.9636686980050099E-2,1.0001982618025684,1.9911255694069211E-2,1.0004962355791835,6.8791590959476262E-2,9.9717809882044008,-117.11937190239685,62.88062809760315,null,1000000000,323640100,null,23.521420148072167,-30.682142323784152,null,17.528000853800254,-83.636592663520247,null,0,0]
[18093.5,18.093499999999999,6.0751779594556901,1.4054395703614053,1.000093050175491,1.3641331370838519E-2,1,0,243.9241850825936,1.5666966808296976,2.0956709414417052,1.0733599781006478,1.0008009544937582,4.0010504924238022E-2,1.005041722739993,0.1002060976290471,1.0002005494136281,2.0025778518713282E-2,1.0005019808510693,6.9187595449656469E-2,9.912271031226819,-117.08363101256994,62.916368987430062,null,1000000000,327374742.25,null,23.509945656433821,-30.558544048539144,null,17.479489408075484,-83.708322337474314,null,0,0]
[18197,18.196999999999999,6.1089907389152156,1.4063631698365739,1.0000941177172999,1.3719353928342721E-2,1,0,245.31947787008914,1.5667199983349775,2.1049352092814733,1.0757481952956047,1.0008101403609198,4.0239130190890524E-2,1.0050994211641884,0.1007754430878039,1.0002028501427356,2.0140300817994242E-2,1.0005077595180429,6.9583603932937124E-2,9.8531892585570073,-117.04849707792236,62.951502922077637,null,1000000000,331130809,null,23.498635376875583,-30.436144540078221,null,17.431239261026587,-83.779459940934828,null,0,0]
[18303,18.303000000000001,6.1436255935207749,1.4072985398818953,1.0000952173555808,1.379926091553243E-2,1,0,246.74847351859111,1.5667436057256634,2.1144355854602366,1.0781723926958866,1.0008196023303975,4.0473273444307983E-2,1.0051588509377294,0.10135847290719656,1.000205220042081,2.0257588808702015E-2,1.0005137123889554,6.998918200084113E-2,9.7931181863183507,-117.01313896122625,62.986861038773753,null,1000000000,334999809,null,23.487218931704955,-30.312016284267557,null,17.38209164814069,-83.85171227533165,null,0,{"$f":"IF(AH282>0,W282,0)","v":0}]
[18409,18.408999999999999,6.1782657630213746,1.4082234219029872,1.0000963233795825,1.387916772649129E-2,1,0,248.17746930302462,1.5667669412555694,2.1239482764078419,1.0805748892301485,1.0008291191668324,4.0707412257647353E-2,1.0052186223481883,0.10194143358953676,1.0002076037006571,2.0374876241990254E-2,1.0005197003036528,7.0394764304575072E-2,9.7334841043123248,-116.97840798959416,63.02159201040584,null,1000000000,338891281,null,23.475968338312878,-30.189115565619964,null,17.333212371494419,-83.923363942996474,null,0,0]
[18515,18.515000000000001,6.212911158517211,1.4091379897589931,1.0000974357892833,1.3959074360199455E-2,1,0,249.606465221055,1.5667900095938752,2.133473117397696,1.0829559476263095,1.0008386908686591,4.0941546605364212E-2,1.0052787353346262,0.10252432475096172,1.0002100011183654,2.0492163114636058E-2,1.0005257232702611,7.0800350868157461E-2,9.6742810500686929,-116.94429934027649,63.055700659723513,null,1000000000,342805225,null,23.464880472554164,-30.067427596995223,null,17.284598593810536,-83.99442490675905,null,0,0]
[18621,18.620999999999999,6.2475616930671629,1.410042413521885,1.0000985545846621,1.4038980815637103E-2,1,0,251.03546127040079,1.5668128153034462,2.1430099464232502,1.0853158269168193,1.0008483174343035,4.1175676461917089E-2,1.0053391898357711,0.10310714600788926,1.0002124122951068,2.060944942341663E-2,1.0005317812969534,7.1205941715597867E-2,9.6155031748392066,-116.91080817917712,63.089191820822876,null,1000000000,346741641,null,23.453952280769677,-29.946937796896716,null,17.23624752105334,-84.064904912459667,null,0,0]
[18729.5,18.729500000000002,6.2830346907465238,1.4109578358997712,1.0000997063800643,1.4120771671596588E-2,1,0,252.49816019042984,1.5668358915448926,2.1527839498365622,1.0877096960325505,1.0008582278599516,4.1415323571093413E-2,1.0054014237778945,0.10370364025211616,1.0002148945887388,2.0729501331391065E-2,1.000538018520382,7.1621102846564685E-2,9.5557733796173636,-116.87716158274137,63.122838417258635,null,1000000000,350794170.25,null,23.442928600508882,-29.824832138889292,null,17.187025292713308,-84.136455461039191,null,0,0]
[18838,18.838000000000001,6.3185128944758615,1.4118629789071107,1.0001008648658625,1.4202562338615251E-2,1,0,253.96085924336859,1.5668587019690388,2.1625701784576079,1.0900819127995789,1.0008681957644852,4.1654965920617598E-2,1.0054640154028995,0.10430006044322929,1.0002173912978567,2.0849552641756631E-2,1.0005442924946517,7.2036268516716712E-2,9.496477008760527,-116.84415167225606,63.155848327743939,null,1000000000,354870244,null,23.432065958942012,-29.703951566163081,null,17.138072518544206,-84.207417315971284,null,0,0]
[18946.5,18.9465,6.3539962170496,1.4127580132608759,1.0001020300420329,1.4284352815599441E-2,1,0,255.42355842693368,1.5668812511425196,2.1723684670676291,1.092432743320753,1.0008782211461866,4.1894603483107674E-2,1.0055269646439911,0.10489640617078363,1.0002199024223528,2.0969603351057384E-2,1.0005506032286795,7.245143875177347E-2,9.4376081427890028,-116.81177324580109,63.188226754198908,null,1000000000,358969862.25,null,23.421361298832963,-29.584281092227965,null,17.089386337450467,-84.277800260154336,null,0,0]
[19055,19.055,6.3894845731868664,1.4136431059508738,1.0001032019085525,1.4366143101455519E-2,1,0,256.88625773889379,1.5669035435279621,2.1821786532134984,1.0947624498681241,1.000888304003329,4.2134236231184972E-2,1.0055902714340095,0.10549267702464857,1.0002224279621184,2.1089653455837479E-2,1.0005569507314334,7.2866613577444506E-2,9.3791609756598753,-116.78002110143362,63.219978898566382,null,1000000000,363093025,null,23.410811632521185,-29.465805944123318,null,17.040963932203866,-84.347613862935191,null,0,0]
[19165.75,19.165749999999999,6.425713967590724,1.4145364696759761,1.0001044049763246,1.4449629300980161E-2,1,0,258.37928965521706,1.5669260378957304,2.192204380709875,1.0971189511206272,1.0008986552258046,4.2378833328331381E-2,1.0056552597152437,0.10610123529792408,1.0002250207414853,2.1212192451876E-2,1.0005634677941546,7.3290402780400651E-2,9.319930763685333,-116.74825100119968,63.251748998800323,null,1000000000,367325973.0625,null,23.400200010858939,-29.346091581484387,null,16.991806532608951,-84.418297759886656,null,0,0]
[19276.5,19.276499999999999,6.4619484328414671,1.415419815277102,1.0001056150147531,1.4533115299065012E-2,1,0,259.87232170077715,1.566948273791875,2.2022421708529474,1.0994539834396055,1.0009090663285443,4.2623425351685632E-2,1.0057206203858233,0.10670971469746346,1.0002276285399589,2.1334730810785959E-2,1.0005700231854286,7.3714196820436645E-2,9.2611280473110433,-116.71712248632053,63.282877513679466,null,1000000000,371583452.25,null,23.389743801436925,-29.227592198088416,null,16.942918166878471,-84.488407949300878,null,0,0]
[19387.25,19.387250000000002,6.4981878841126335,1.4162933089729166,1.0001068320238127,1.4616601094547026E-2,1,0,261.36535387335925,1.5669702556458793,2.2122918594478631,1.1017678137657501,1.0009195373096791,4.2868012272140932E-2,1.0057863533731499,0.10731811478811201,1.0002302513574215,2.1457268528892362E-2,1.0005766169149581,7.4137995724862363E-2,9.2027470002669993,-116.68663004137885,63.313369958621152,null,1000000000,375865462.5625,null,23.379440039470992,-29.110292751483435,null,16.89429597477378,-84.557953956437274,null,0,0]
[19498,19.498000000000001,6.5344322384479856,1.4171571133551424,1.0001080560034779,1.4700086686263171E-2,1,0,262.85838617079895,1.5669919877865905,2.2223532850769048,1.1040607051222822,1.0009300681673299,4.3112594060594173E-2,1.0058524586042299,0.10792643513506334,1.0002328891937546,2.157980560252035E-2,1.0005832489925015,7.4561799520976565E-2,9.1447819081170039,-116.6567681618362,63.343231838163803,null,1000000000,380172004,null,23.369285828033423,-28.994178417906102,null,16.84593714004027,-84.62694509874602,null,0,0]
[19611.75,19.611750000000001,6.5716634000337262,1.4180343969908271,1.0001093203947147,1.4785833525361327E-2,1,0,264.39186190879087,1.5670140531006531,2.2326993065333633,1.1063941811570683,1.0009409466146373,4.3363795716392019E-2,1.0059207419244591,0.1085511502160901,1.0002356141183975,2.1705661290063176E-2,1.0005901006505511,7.4997088450531907E-2,9.0856737770600002,-116.62674803258145,63.373251967418554,null,1000000000,384620738.0625,null,23.359009267811686,-28.87613713343638,null,16.79653960159165,-84.697237035132346,null,0,0]
[19725.5,19.7255,6.6088995623587277,1.4189017956251555,1.0001105921392572,1.4871580147017902E-2,1,0,265.92533777402468,1.5670358639325705,2.2430573730954726,1.1087061184740883,1.0009518882222173,4.3614991896168388E-2,1.0059894177709188,0.10917578024605518,1.0002383548863398,2.1831516289881427E-2,1.0005969927833447,7.5432382598716957E-2,9.0269925721656978,-116.59738136746064,63.402618632539358,null,1000000000,389095350.25,null,23.348884487316948,-28.759315032086384,null,16.747413997977024,-84.766962914123766,null,0,0]
[19839.25,19.83925,6.6461406413704482,1.4197594741110791,1.0001118712370771,1.4957326549972829E-2,1,0,267.45881376431191,1.567057424659545,2.2534273186642424,1.1109967895409996,1.0009628929879986,4.3866182568402669E-2,1.0060584860632251,0.10980032475501138,1.0002411114974519,2.1957370597993811E-2,1.0006039254016386,7.5867681995072614E-2,8.9687324529585339,-116.56866225328004,63.431337746719962,null,1000000000,393595840.5625,null,23.338908559596554,-28.643696751598473,null,16.698557417053834,-84.836132182863423,null,0,0]
[19953,19.952999999999999,6.6833865548787958,1.420607593684639,1.0001131576881463,1.5043072732966057E-2,1,0,268.99228987751377,1.5670787395589643,2.2638089799953587,1.1132664627286994,1.000973960909898,4.4117367701578411E-2,1.0061279467205564,0.11042478327340707,1.0002438839516021,2.2083224210419174E-2,1.0006108985162501,7.630298666912716E-2,8.9108876919053017,-116.54058479861901,63.459415201380992,null,1000000000,398122209,null,23.329078625468981,-28.529267158723389,null,16.649966991858108,-84.904754081260023,null,0,0]
[20069,20.068999999999999,6.7213740963098063,1.4214628083319909,1.0001144771583321,1.5130514766466919E-2,1,0,270.5560986096815,1.5671002272355037,2.2744078922206032,1.1155596795578491,1.0009853127978896,4.4373515594738677E-2,1.0061991853240992,0.1110615046734398,1.0002467275615743,2.2211566514367113E-2,1.0006180512776595,7.6746907231225764E-2,8.852320689326886,-116.51260670649974,63.487393293500261,null,1000000000,402764761,null,23.319201711630143,-28.41378285915928,null,16.600686616165859,-84.974178986386065,null,0,0]
[20185,20.184999999999999,6.7593664984433559,1.422308409774284,1.0001158042754823,1.5217956568571602E-2,1,0,272.11990746533456,1.5671214679428462,2.2850186542059565,1.1178316105800628,1.0009967303607803,4.4629657661359436E-2,1.006270831797166,0.11169813566242667,1.0002495876472637,2.2339908086472269E-2,1.0006252461762024,7.7190833343859358E-2,8.7941739557334895,-116.48528361230994,63.514716387690058,null,1000000000,407434225,null,23.309470825932131,-28.299503662368739,null,16.551677147223934,-85.04305342671428,null,0,0]
[20301,20.300999999999998,6.7973636797758923,1.4231445580050872,1.0001171390395664,1.5305398137943852E-2,1,0,273.68371644235646,1.5671424659144644,2.2956411016378699,1.1200825276602477,1.0010082135963227,4.4885793868030308E-2,1.0063428860526422,0.11233467574368164,1.0002524642085286,2.2468248922512962E-2,1.00063248322355,7.7634765038302314E-2,8.7364417625759927,-116.45860935084207,63.541390649157933,null,1000000000,412130601,null,23.29988314237163,-28.186414232285792,null,16.502935683981768,-85.111386571069346,null,0,0]
[20417,20.417000000000002,6.8353655606060029,1.4239714095135179,1.0001184814505537,1.5392839473247447E-2,1,0,275.24752553867825,1.5671632252876233,2.3062750730507329,1.1223126985092078,1.001019762502257,4.5141924181345522E-2,1.0064153480029423,0.11297112442095518,1.0002553572452275,2.2596589018267655E-2,1.0006397624314405,7.8078702345815099E-2,8.6791184920851272,-116.43257778859737,63.567422211402629,null,1000000000,416853889,null,23.290435900661059,-28.074499465345063,null,16.454459370460807,-85.17918738748493,null,0,0]
[20536,20.536000000000001,6.8743550503911486,1.4248101450502217,1.0001198665251421,1.5482541977767456E-2,1,0,276.85177809554722,1.5671842778444971,2.3171958695652477,1.124579264483897,1.0010316783243227,4.5404672395532544E-2,1.0064901075238191,0.11362393747777103,1.0002583422217679,2.2728247480753881E-2,1.0006472737172609,7.8534126656035305E-2,8.6207318721421515,-116.40653444958328,63.593465550416724,null,1000000000,421727296,null,23.280887445152565,-27.960895387281948,null,16.405001936830999,-85.24819770988708,null,0,0]
[20655,20.655000000000001,6.9133493215800277,1.4256394195046558,1.0001212596472118,1.5572244233106481E-2,1,0,278.45603077370589,1.5672050878236155,2.3281284585436497,1.1268245549042075,1.0010436632525876,4.5667414336387213E-2,1.0065652959116176,0.11427665328509205,1.0002613445366335,2.2859905155168479E-2,1.0006548293977824,7.8989556940012751E-2,8.5627639687687935,-116.38115451581419,63.618845484185812,null,1000000000,426629025,null,23.271481109365311,-27.848496050575854,null,16.355817597658188,-85.316666308753028,null,0,0]
[20774,20.774000000000001,6.9523482937189538,1.4264593909414391,1.0001226608167293,1.5661946237821991E-2,1,0,280.06028357106976,1.5672256593935916,2.3390726746355961,1.1290488456083601,1.0010557172845702,4.5930149967859581E-2,1.0066409130702381,0.11492927130860887,1.000264364189668,2.2991562036954325E-2,1.0006624294858966,7.9444993231450184E-2,8.5052090630276194,-116.35643148034411,63.643568519655886,null,1000000000,431559076,null,23.262214117358646,-27.73728588763931,null,16.306903411594227,-85.384602242532011,null,0,0]
[20893,20.893000000000001,6.9913518881397847,1.4272702139486066,1.0001240700336609,1.5751647990471473E-2,1,0,281.66453648560224,1.5672459966280685,2.3500283553966996,1.1312524081301933,1.0010678404177744,4.6192879253904945E-2,1.0067169589030627,0.11558179101450536,1.0002674011807147,2.3123218121554458E-2,1.0006700739945691,7.9900435564034575E-2,8.4480615471942304,-116.33235887821336,63.667641121786644,null,1000000000,436517449,null,23.253083758389579,-27.627249572066713,null,16.258256483315037,-85.452014370478778,null,0,0]
[21014.75,21.014749999999999,7.0312615296494991,1.4280904641429666,1.0001255201450119,1.5843422420407743E-2,1,0,283.30586259087454,1.5672665654712385,2.361248912366368,1.133485719823998,1.0010803152197876,4.6461673410383979E-2,1.0067952056444356,0.11624928764916255,1.0002705262978069,2.3257915848913471E-2,1.0006779411478632,8.0366409111757853E-2,8.3900092813816194,-116.30839643321082,63.691603566789183,null,1000000000,441619717.5625,null,23.243881048955078,-27.515869516174352,null,16.208758982406945,-85.520451274985291,null,0,0]
[21136.5,21.136500000000002,7.0711758484630147,1.4289014548259229,1.0001269786799416,1.5935196583438546E-2,1,0,284.9471888146262,1.5672868973569525,2.3724811350593766,1.1356978957806934,1.0010928623483468,4.6730460848456425E-2,1.0068739008953445,0.11691668024073437,1.0002736695631715,2.3392612732166616E-2,1.0006858548261834,8.0832389054354511E-2,8.3323719214310934,-116.28510128067482,63.714898719325177,null,1000000000,446751632.25,null,23.234815821352008,-27.40568648721813,null,16.15953524639054,-85.588358030259258,null,0,0]
[21258.25,21.25825,7.1110947658197174,1.4297033408594808,1.0001284456384132,1.6026970478019119E-2,1,0,286.58851515482172,1.5673069963564439,2.3837248585674349,1.1378892132781693,1.0011054818007328,4.6999241529537619E-2,1.0069530445506338,0.1175839682191538,1.0002768309766377,2.3527308766434187E-2,1.0006938150436562,8.1298375427849304E-2,8.2751438058319913,-116.26246664224175,63.737533357758252,null,1000000000,451913193.0625,null,23.225885373008815,-27.296684829398938,null,16.110582318129786,-85.655743511392529,null,0,0]
[21380,21.38,7.1510182047086728,1.4304962736947642,1.0001299210203896,1.6118744102604728E-2,1,0,288.2298416094718,1.5673268664482116,2.3949799209117564,1.1400599451914049,1.0011181735742101,4.7268015415048749E-2,1.0070326365045821,0.1182511510149052,1.0002800105380329,2.3662003946836679E-2,1.0007018218144883,8.1764368268249274E-2,8.2183193834534993,-116.24048579107217,63.759514208927826,null,1000000000,457104400,null,23.21708706527831,-27.1888491338729,null,16.061897286953606,-85.722616398046867,null,0,0]
[21504.5,21.5045,7.1918480024735647,1.431298012216617,1.0001314384382263,1.6212590361914414E-2,1,0,289.90824126259588,1.567346952680253,2.4065007645118555,1.1422586994978579,1.0011312268071673,4.7542853100876865E-2,1.007114489714438,0.11893329428193877,1.0002832806842834,2.3799740635414603E-2,1.0007100575937995,8.224089333944179E-2,8.1606232552244258,-116.21867760374973,63.781322396250275,null,1000000000,462443520.25,null,23.208223995036938,-27.079767687573671,null,16.012386650902993,-85.790478512529617,null,0,0]
[21629,21.629000000000001,7.2326823708531007,1.432090698312511,1.0001329646643142,1.6306436335627474E-2,1,0,291.58664103133884,1.5673668076758704,2.4180331314923764,1.1444364911359743,1.0011443556593507,4.7817683599106278E-2,1.0071968114779442,0.11961532635832046,1.0002865698071792,2.3937476420799339E-2,1.0007183420835541,8.2717425249075494E-2,8.103337863998739,-116.19753901409935,63.802460985900652,null,1000000000,467813641,null,23.199493718604248,-26.971873653008579,null,15.963150139385881,-85.85782236938725,null,0,0]
[21753.5,21.753499999999999,7.2735212328674415,1.4328744834585903,1.0001344996986128,1.6400282022092212E-2,1,0,293.26504091371567,1.5673864354052507,2.4295768577607371,1.1465935981017461,1.0011575601277856,4.8092506868503686E-2,1.0072796016802206,0.1202972466368715,1.0002898779065332,2.4075211297773805E-2,1.0007266752992072,8.3193964035594606E-2,8.0464576146966991,-116.17706300297903,63.822936997020975,null,1000000000,473214762.25,null,23.190893610589999,-26.865151327293013,null,15.914184784681531,-85.924656649860893,null,0,0]
[21878,21.878,7.3143645132476038,1.4336495157919427,1.0001360435410818,1.6494127419656942E-2,1,0,294.94344090778628,1.5674058397482102,2.4411317821681129,1.1487302939054393,1.0011708402094797,4.8367322867842337E-2,1.0073628602057709,0.12097905451102811,1.0002932049821569,2.4212945261121135E-2,1.0007350572563016,8.3670509737423557E-2,7.9899770215149655,-116.15724261176652,63.84275738823348,null,1000000000,478646884,null,23.182421108097849,-26.759585259378031,null,15.865487665861993,-85.99098984387669,null,0,0]
[22005.25,22.00525,7.3561144436621575,1.4344327731715369,1.0001376305866025,1.6590045407267526E-2,1,0,296.65891410754375,1.5674254458058074,2.4529533429857078,1.1508933734948825,1.0011844917601433,4.8648201544480831E-2,1.0074484416084406,0.12167580561163513,1.0002966251568366,2.4353720591376693E-2,1.0007436747415583,8.4157588735229105E-2,7.932656261189063,-116.13765474329595,63.862345256704046,null,1000000000,484231027.5625,null,23.173890722182296,-26.652866435109924,null,15.815989103860616,-86.058279061071033,null,0,0]
[22132.5,22.1325,7.3978688360559932,1.4352071894386884,1.0001392268336207,1.6685963089585601E-2,1,0,298.37438742002496,1.5674448264173284,2.4647862708351647,1.1530356940347901,1.0011982222949281,4.8929072539279757E-2,1.007534512005918,0.12237243800802051,1.0003000651549527,2.4494494956178853E-2,1.0007523431783898,8.4644675038318018E-2,7.8757417570374741,-116.11873727500858,63.881262724991416,null,1000000000,489847556.25,null,23.165488419728796,-26.547323659522576,null,15.766764733688746,-86.125062155889538,null,0,0]
[22259.75,22.25975,7.4396276153014655,1.4359729125326468,1.0001408322820919,1.6781880464847711E-2,1,0,300.08986084329661,1.5674639854490675,2.4766304027871291,1.1551575335501689,1.0012120318105846,4.9209935808241068E-2,1.0076210712728944,0.12306895105454342,1.0003035249763004,2.463526834995803E-2,1.0007610625836785,8.5131768687652529E-2,7.8192279883644309,-116.10048297765515,63.899517022344853,null,1000000000,495496470.0625,null,23.157211655564556,-26.442941221957959,null,15.717811581969672,-86.191347607074789,null,0,0]
[22387,22.387,7.4813907079404798,1.4367300871306183,1.0001424469319722,1.6877797531290425E-2,1,0,301.80533437546956,1.5674829266794159,2.4884855788613338,1.1572591655131814,1.0012259203038449,4.9490791307374035E-2,1.0077081192833919,0.12376534410624743,1.0003070046206741,2.4776040767144882E-2,1.0007698329744037,8.561886972417275E-2,7.763109542403499,-116.08288469090496,63.917115309095038,null,1000000000,501177769,null,23.149057945444852,-26.339703667580689,null,15.669126722339088,-86.257143706466877,null,0,0]
[22517.5,22.517499999999998,7.5242248462661925,1.4374978695972891,1.0001441123773276,1.6976164023393761E-2,1,0,303.56462168466868,1.5675021293252591,2.5006548456888278,1.159393767176403,1.0012402455386276,4.977881181710446E-2,1.00779789801825,0.12447939792217443,1.0003105937248253,2.4920407530427981E-2,1.0007788803365465,8.6118419170603963E-2,7.7059628537220011,-116.06551086854444,63.934489131455564,null,1000000000,507037806.25,null,23.140821255993714,-26.235002591399912,null,15.61947407921085,-86.324120491563349,null,0,0]
[22648,22.648,7.5670633698303709,1.4382569593945365,1.0001457875000119,1.707453018694504E-2,1,0,305.32390910451477,1.5675211106784279,2.5128353964191246,1.1615076841425953,1.0012546538297289,5.0066824061360191E-2,1.0078881905102006,0.12519332416386283,1.0003142036770623,2.5064773254733049E-2,1.0007879813582312,8.6617976473524816E-2,7.6492207448295275,-116.04881196468233,63.951188035317671,null,1000000000,512931904,null,23.132708883600962,-26.131473508347653,null,15.570097521146211,-86.390599692356957,null,0,0]
[22778.5,22.778500000000001,7.6099062045754131,1.4390075024560631,1.0001474722999766,1.7172896020042346E-2,1,0,307.08319663310601,1.5675398745422828,2.5250270677539981,1.1636011969990572,1.0012691451735636,5.035482799271726E-2,1.0079789966211801,0.12590712213793126,1.0003178344771593,2.5209137934053792E-2,1.0007971360580883,8.71175416770196E-2,7.5928777139802053,-116.03278048493995,63.967219515060052,null,1000000000,518860062.25,null,23.124718337445934,-26.029100557155211,null,15.520994039583302,-86.45658967286775,null,0,0]
[22909,22.908999999999999,7.6527532780947443,1.4397496414863051,1.0001491667771727,1.7271261520783818E-2,1,0,308.8424842685842,1.5675584246335232,2.5372296993862227,1.1656745816580463,1.0012837195665254,5.0642823563759924E-2,1.0080703162123892,0.12662079115177013,1.0003214861248895,2.5353501562384157E-2,1.0008063444548547,8.7617114825147543E-2,7.5369283674183905,-116.01740901280766,63.982590987192339,null,1000000000,524822281,null,23.116847186859609,-25.927868139449153,null,15.472160673811073,-86.522098612091028,null,0,0]
[23042.25,23.042249999999999,7.6965075594339369,1.4404988929203835,1.000150906946961,1.7371699512836524E-2,1,0,310.63884512355696,1.5675771488238068,2.549700620258609,1.1677711713310688,1.0012986867716254,5.0936879331295835E-2,1.0081640898427449,0.12734936538375885,1.0003252362340522,2.5500906245453946E-2,1.0008158023240252,8.8127223620055359E-2,7.480200732834124,-116.00238701243548,63.997612987564523,null,1000000000,530945285.0625,null,23.108930900592419,-25.825663371196804,null,15.422573938881074,-86.588499965127042,null,0,0]
[23175.5,23.1755,7.7402661125718897,1.4412396731820445,1.0001526572060264,1.7472137154371077E-2,1,0,312.43520608618599,1.5675956577028654,2.5621826396890435,1.1698473424157836,1.001313740555223,5.1230926282568902E-2,1.0082583985274676,0.12807780370619032,1.0003290080782592,2.5648309820117249E-2,1.0008253162168599,8.8637340790714378E-2,7.4238725167253499,-115.9880377503921,64.011962249607905,null,1000000000,537103800.25,null,23.101134157634963,-25.724615660320293,null,15.373262733509652,-86.654416455713871,null,0,0]
[23308.75,23.30875,7.7840288654658094,1.4419721243292118,1.0001544175543167,1.7572574443362941E-2,1,0,314.23156715462483,1.5676139549632817,2.5746755962602044,1.1719033741103113,1.0013288809134133,5.1524964367129174E-2,1.0083532421164301,0.12880610538425599,1.0003328016572643,2.5795712279981124E-2,1.0008348861536505,8.9147466383946425E-2,7.3679383085478536,-115.97435358364957,64.025646416350426,null,1000000000,543297826.5625,null,23.09345455375043,-25.624709218624481,null,15.324224053957664,-86.719856225969693,null,0,0]
[23442,23.442,7.8277957476771372,1.4426963852789105,1.000156187991778,1.7673011377787633E-2,1,0,316.02792832706928,1.5676320442136822,2.5871793315324911,1.1739395409035409,1.0013441078422696,5.1818993534535888E-2,1.0084486204587111,0.12953426968400272,1.0003366169708205,2.5943113618652924E-2,1.0008445121548037,8.9657600446545416E-2,7.3123928038919708,-115.96132695422583,64.038673045774175,null,1000000000,549527364,null,23.08588974300903,-25.525928522923518,null,15.275454944326651,-86.784827238050823,null,0,0]
[23578.5,23.578499999999998,7.8726343244487813,1.4434299608540724,1.0001580120718729,1.7775897623778979E-2,1,0,317.86810329264478,1.5676503626696561,2.599999049651732,1.1760050547956726,1.0013597959191409,5.2120184846290198E-2,1.0085468794199504,0.13028005087709771,1.0003405478767271,2.6094108942699673E-2,1.0008544310901015,9.0180185633979892E-2,7.2558901348963278,-115.94865658017402,64.051343419825983,null,1000000000,555945662.25,null,23.078257059074943,-25.425889855468451,null,15.22577281606342,-86.850905000547783,null,0,0]
[23715,23.715,7.9174770897594877,1.4441552272099016,1.0001598467391812,1.7878783493395702E-2,1,0,319.70827836365811,1.5676684702511086,2.612829751393742,1.1780502912959177,1.0013755748327231,5.2421366693479299E-2,1.0086456992149906,0.13102568635236797,1.0003445015898065,2.624510307661582E-2,1.0008644089016867,9.0702779808275499E-2,7.1997844235048261,-115.93666042697166,64.063339573028344,null,1000000000,562401225,null,23.070740033170615,-25.327000372489618,null,15.176367438131518,-86.916507216319289,null,0,0]
[23851.5,23.851500000000001,7.9623239728413475,1.4448723239790773,1.0001616919936451,1.7981668984461678E-2,1,0,321.54845353829899,1.5676863705784412,2.6256712757396024,1.1800755306828672,1.001391444578722,5.2722539021911187E-2,1.0087450796790085,0.13177117532365548,1.0003484781097882,2.639609601353041E-2,1.0008744456118748,9.1225383019642226E-2,7.144070297044939,-115.92533064680231,64.074669353197692,null,1000000000,568894052.25,null,23.063336323191251,-25.229244219535381,null,15.12723578278105,-86.981641888730024,null,0,0]
[23988,23.988,8.0071749045054634,1.4455813876997976,1.0001635478352056,1.808455409480084E-2,1,0,323.38862881479849,1.5677040671896503,2.6385234646705626,1.1820810484372712,1.001407405152819,5.3023701777404168E-2,1.0088450206463113,0.13251651700576256,1.0003524774364001,2.6547087746572828E-2,1.0008845412431098,9.1747995318258585E-2,7.0887424884802677,-115.91465948472039,64.085340515279611,null,1000000000,575424144,null,23.056043644244806,-25.132605812329292,null,15.078374870699893,-87.04631684384222,null,0,0]
[24127.75,24.127749999999999,8.0530978391811416,1.4462991510849073,1.0001654588316164,1.8189888453919899E-2,1,0,325.27261789207745,1.5677219777096505,2.651692544661099,1.1841141677689568,1.0014238398337545,5.3332025100584921E-2,1.0089479216666541,0.13327945150823337,1.0003565956124059,2.6701673266495231E-2,1.0008949383121579,9.2283060233576297E-2,7.0324921838408976,-115.90440857350688,64.095591426493115,null,1000000000,582148320.0625,null,23.048690030432503,-25.034808477614092,null,15.028628031743221,-87.112063403771145,null,0,0]
[24267.5,24.267499999999998,8.0990248756357452,1.447008774408918,1.0001673809251481,1.8295222409350456E-2,1,0,327.15660707249782,1.5677396819478624,2.6648724772610053,1.1861271845403707,1.0014403697101861,5.3640338274641965E-2,1.0090514098443819,0.13404222996169701,1.0003607376934187,2.685625750996196E-2,1.0009053971894393,9.2818134780364797E-2,6.9766359670301412,-115.89483186238178,64.105168137618222,null,1000000000,588911556.25,null,23.041448127545038,-24.938150534183372,null,14.979158813214262,-87.177344147525858,null,0,0]
[24407.25,24.407250000000001,8.1449559444830602,1.4477103946614296,1.0001693141157362,1.8400555958757434E-2,1,0,329.04059635428791,1.5677571834476007,2.678063102238819,1.1881203793571493,1.0014569947774008,5.3948641241464666E-2,1.0091554849988575,0.13480485152668253,1.000364903679142,2.7010840469600943E-2,1.0009159178994549,9.3353219012369315E-2,6.9211685129007918,-115.88592132915464,64.114078670845359,null,1000000000,595713852.5625,null,23.034315659463154,-24.842616104205902,null,14.929964169171161,-87.242166927245464,null,0,0]
[24547,24.547000000000001,{"$f":"SQRT(1+(A333/pole1)^2)","v":8.1908909778872037},{"$f":"ATAN(A333/pole1)","v":1.4484041457909811},{"$f":"SQRT(1+(A333/Zero1)^2)","v":1.0001712584033164},{"$f":"ATAN(A333/Zero1)","v":1.8505889099805804E-2},{"$f":"IF(VIN_nom>Vout, 1, SQRT(1+(A333/z_RHP)^2))","v":1},{"$f":"IF(VIN_nom>Vout, 0, -ATAN(A333/z_RHP))","v":0},{"$f":"SQRT(1+(A333/Pole2)^2)","v":330.92458573571633},{"$f":"ATAN(A333/Pole2)","v":1.5677744856714908},2.6912642623757064,1.1900940279559393,{"$f":"SQRT(1+(A333/pole4)^2)","v":1.0014737150306574},{"$f":"ATAN(A333/pole4)","v":5.4256933942953986E-2},{"$f":"SQRT(1+(A333/Zero3)^2)","v":1.0092601469484932},{"$f":"ATAN(A333/Zero3)","v":0.13556731536479424},{"$f":"SQRT(1+(A333/pole5)^2)","v":1.0003690935692771},{"$f":"ATAN(A333/pole5)","v":2.7165422138040463E-2},{"$f":"SQRT((1-(Z333/pterm2))^2+(A333/pterm1)^2)","v":1.0009265004668457},{"$f":"IF((ATAN((A333/pterm1)/(1-A333^2/pterm2))>0),ATAN((A333/pterm1)/(1-A333^2/pterm2)),PI()+ATAN((A333/pterm1)/(1-A333^2/pterm2)))","v":9.3888312983299707E-2},{"$f":"20*LOG10(((E333*K333*G333*O333)/(C333*I333*S333*M333*Q333))*Adc)","v":6.8660846011600949},{"$f":"((F333+L333+H333+R333)-(D333+J333+T333+N333+T333))*radconv","v":-115.87766905174139},{"$f":"IF(V333>0,V333,V333+180)","v":64.122330948258607},null,{"$f":"IF(U333<0,A333,1000000000)","v":1000000000},{"$f":"A333^2","v":602555209},null,{"$f":"20*LOG10((K333/(I333*M333))*AEA)","v":23.027290406028573},{"$f":"(L333-(J333+N333))*radconv","v":-24.748189584200539},null,{"$f":"20*LOG10((E333*G333/(C333*S333))*Acs*Am)","v":14.881041102581259},{"$f":"(F333+H333-(D333+T333))*radconv","v":-87.306539420827036},null,{"$f":"SUM((U334<0)*(U333>0))*A333","v":0},0]
[24690,{"$f":"A334/1000","v":24.69},8.2378983026260659,1.4491060215419687,1.000173259393917,1.8613671423635646E-2,1,0,332.85238892506584,1.5677919875213422,2.704783170832938,1.1920936246465574,1.0014909226542648,5.4572385555354617E-2,1.0093678501299719,0.13634734677498239,1.0003734056431548,2.7323597384721759E-2,1.0009373931982253,9.4435861137346797E-2,6.8101113552577308,-115.8698980973615,64.130101902638501,null,1000000000,609596100,null,23.020210499295708,-24.65269796115199,null,14.831258338581449,-87.371950665221462,null,0,0]
[24833,24.832999999999998,8.2849096395444768,1.4497999322779733,1.0001752720035129,1.8721453314946134E-2,1,0,334.78019221519861,1.5678092878053684,2.7183127864651766,1.1940733243589694,1.0015082299325229,5.4887826296369992E-2,1.0094761673290429,0.13712721126422514,1.0003777427455673,2.7481771263834033E-2,1.0009483507501731,9.4983419602227961E-2,6.7545289643809605,-115.86279990703291,64.137200092967092,null,1000000000,616677889,null,23.013238321195036,-24.558334179225433,null,14.781753733795293,-87.436906163421881,null,0,0]
[24976,24.975999999999999,8.3319249207285004,1.4504860121596812,1.0001772962320341,1.8829234771235701E-2,1,0,336.70799560438377,1.5678263899857217,2.7318529501892366,1.1960334073114911,1.0015256368602652,5.5203256103790836E-2,1.0095850983480743,0.13790690793779264,1.0003821048761894,2.7639943767480434E-2,1.000959373149545,9.5530988435371916E-2,6.6993321595333644,-115.85636631424875,64.143633685751254,null,1000000000,623800576,null,23.006371664693983,-24.46508237789639,null,14.732524229633011,-87.501413605703178,null,0,0]
[25119,25.119,8.3789440797828689,1.4511643923662301,1.0001793320794103,1.8937015790002839E-2,1,0,338.63579909092948,1.5678432974457166,2.7454035059374724,1.1979741487995275,1.0015431434322963,5.5518674915420889E-2,1.0096946429884004,0.13868643590215626,1.0003864920346934,2.7798114887764517E-2,1.0009704604233514,9.6078567694167713E-2,6.6445157755343267,-115.85058925921327,64.149410740786735,null,1000000000,630964161,null,22.999608377333274,-24.372926974186097,null,14.683566816764341,-87.565480511507772,null,0,0]
[25265.25,25.265250000000002,8.427035799511728,1.4518503598263637,1.0001814262139241,1.9047245922220381E-2,1,0,340.60741639206043,1.5678603912030831,2.7592726182809852,1.1999392740745933,1.0015611509425062,5.5841250898112753E-2,1.0098073117701925,0.13948350497698156,1.0003910047885713,2.7959879367128085E-2,1.0009818668117816,9.6638602779650598E-2,6.5888417756051831,-115.84535170787508,64.154648292124918,null,1000000000,638332857.5625,null,22.992796110959532,-24.279795232137573,null,14.633775087088237,-87.630555477357277,null,0,0]
[25411.5,25.4115,8.4751314395902249,1.4525285419902396,1.0001835325012733,1.915747559150982E-2,1,0,342.57903379157017,1.5678772882038168,2.7731522795505081,1.2018847358476137,1.0015792626666726,5.616381524797797E-2,1.0099206219584844,0.14028039570027817,1.000395543720191,2.8121642382829385E-2,1.0009933411146308,9.719864889135478E-2,6.5335550780798446,-115.84078416165838,64.159215838341623,null,1000000000,645744332.25,null,22.986087579731624,-24.187778185931453,null,14.584261743448883,-87.695185036868224,null,0,0]
[25557.75,25.557749999999999,8.5232309336520764,1.4531990700339157,1.0001856509413813,1.9267704795195389E-2,1,0,344.55065128776977,1.567893991825601,2.7870423321429274,1.2038108132778538,1.0015974785991426,5.648636789852525E-2,1.0100345733374085,0.1410771071201353,1.0004001088291961,2.8283403926422607E-2,1.0010048833612915,9.7758706090541728E-2,6.478650477743555,-115.83687833912447,64.163121660875532,null,1000000000,653198585.0625,null,22.979480648100235,-24.096860030637334,null,14.535023719863492,-87.759376709538429,null,0,0]
[25704,25.704000000000001,8.5713342168154387,1.4538620722166367,1.0001877815341709,1.9377933530601379E-2,1,0,346.52226887900889,1.5679105053692475,2.800942621464555,1.2057177805645523,1.0016157987342302,5.6808908783277844E-2,1.0101491656899733,0.14187363828598093,1.0004047001152288,2.8445163989462403E-2,1.0010164935813233,9.8318774438428583E-2,6.4241228719281631,-115.83362607149353,64.166373928506474,null,1000000000,660695616,null,22.972973233587027,-24.007025241109844,null,14.486057999843371,-87.823137847742117,null,0,0]
[25853.75,25.853750000000002,8.6205925496174078,1.4545332739234176,1.0001899757078363,1.9490799730631281E-2,1,0,348.54107057777225,1.5679272205219819,2.8151860160399824,1.2076508643374408,1.0016346652669932,5.7139156334244871E-2,1.0102671643623107,0.14268904396843993,1.0004094284020268,2.8610793690552298E-2,1.0010284521167316,9.8892257747386553E-2,6.3686757431094589,-115.830964760133,64.169035239867,null,1000000000,668416389.0625,null,22.966411083192853,-23.916147197944795,null,14.436199507501664,-87.887986289129842,null,0,0]
[26003.5,26.003499999999999,8.6698547219657058,1.4551968483811737,1.0001921826226448,1.9603665434022494E-2,1,0,350.55987237279521,1.5679437431565062,{"$f":"SQRT(1+(A343/Zero2)^2)","v":2.8294398245024164},{"$f":"ATAN(A343/Zero2)","v":1.2095644786917286},1.0016536410373613,5.7469391408515494E-2,1.01038583459042,0.14350425865335872,1.0004141841329952,2.8776421821457492E-2,1.0010404819811323,9.9465752874799349E-2,6.3136133596103319,-115.82897168248257,64.171028317517425,null,1000000000,676182012.25,null,22.95994901508061,-23.826372924953453,null,14.386620261673071,-87.952398426941514,null,0,0]
[26153.25,26.15325,8.7191206687811587,1.4558529242900318,1.0001944022785123,1.9716530637902796E-2,1,0,352.5786742624241,1.5679600765797852,2.8437038902558629,1.2114589024828726,1.0016727260391263,5.7799613934773141E-2,1.0105051761377055,0.14431928132467678,1.0004189673077419,2.8942048373113202E-2,1.0010525832068065,0.10003925988623898,6.2589305611305379,-115.82763842886257,64.172361571137429,null,1000000000,683992485.5625,null,22.953584956695931,-23.737686630283985,null,14.337317178644842,-88.016381639072847,null,0,0]
[26303,26.303000000000001,8.7683903264422742,1.4565016274836053,1.0001966346753537,1.9829395339400042E-2,1,0,354.59747624504325,1.5679762240234747,2.8579780597190125,1.2133344095523582,1.0016919202660441,5.8129823841717589E-2,1.0106251887663453,0.14513411096783246,1.0004237779258736,2.9107673336455159E-2,1.0010647558262189,0.10061277884722751,6.2046222891117271,-115.82695670831386,64.173043291686142,null,1000000000,691847809,null,22.947316887298644,-23.650072805050055,null,14.288287224652036,-88.079943139177473,null,0,0]
[26456,26.456,8.8187330433275939,1.4571569228973782,1.0001989286802013,1.9944709003393193E-2,1,0,356.66009205456993,1.5679925331199429,2.872572297493956,1.2152313631840874,1.0017116438622493,5.8467187133548294E-2,1.010748498846906,0.14596642431543844,1.0004287212909067,2.9276891181732937E-2,1.001077266394707,0.10119875720683212,6.149517022044785,-115.82692458717,64.173075412830002,null,1000000000,699919936,null,22.941009869953405,-23.561649303098754,null,14.238472161603113,-88.144455901418993,null,0,{"$f":"IF(AH346>0,W346,0)","v":0}]
[26609,26.609000000000002,8.8690795040923582,1.4578047788507671,1.0002012359848738,2.0060022136899232E-2,1,0,358.72270795787244,1.5680086546654126,2.8871767675050322,1.2171091324482943,1.0017314814627571,5.8804537101952201E-2,1.0108725089478425,0.14679853402912038,1.0004336933026119,2.9446107349879378E-2,1.0010898515585578,0.10178474817841024,6.0947923526561354,-115.82755546209283,64.172444537907168,null,1000000000,708038881,null,22.93479894765661,-23.474313475183571,null,14.18893596405939,-88.208543166985706,null,0,0]
[26762,26.762,8.9194296453386492,1.4584453207824453,1.0002035565892795,2.0175334736855177E-2,1,0,360.78532395334253,1.5680245918765729,2.9017913152583108,1.2189679938617828,1.0017514330607946,5.9141873670938906E-2,1.0109972188115595,0.14763043903170869,1.0004386939605616,2.9615321831228846E-2,1.0011025113529934,0.10237075183168003,6.0404431984584157,-115.82884086561033,64.171159134389669,null,1000000000,716204644,null,22.928682123139144,-23.388049658007446,null,14.13967555119017,-88.272212127154233,null,0,0]
[26915,26.914999999999999,8.9697834050874583,1.4590786713386987,1.0002058904933258,2.0290646800198136E-2,1,0,362.84794003940829,1.5680403478969709,2.9164157892510736,1.2208082189233647,1.0017714986495505,5.9479196764536245E-2,1.0111226281791339,0.14846213824769708,1.0004437232643266,2.9784534616116284E-2,1.0011152458134358,0.10295676823630412,5.9864645770115104,-115.83077245357201,64.16922754642799,null,1000000000,724417225,null,22.92265744924617,-23.302842471593394,null,14.090687892119387,-88.335469813205989,null,0,0]
[27071.75,27.071750000000002,9.0213750148866101,1.4597202126438507,1.000208295393398,2.0408784579898545E-2,1,0,364.96111053365672,1.5680563053996717,2.9314088450615179,1.2226744991266632,1.0017921742505833,5.982477352674774E-2,1.011251836464631,0.14931400771157136,1.0004489055424635,2.9957893003736261E-2,1.0011283698637614,0.10355716108486052,5.9315421099510708,-115.83341292364707,64.166587076352926,null,1000000000,732879648.0625,null,22.916578693308889,-23.216626879985888,null,14.040779301103267,-88.399858602542324,null,0,0]
[27228.5,27.2285,9.0729702954333646,1.4603544576988137,1.0002107142528451,2.0526921789850768E-2,1,0,367.07428111976952,1.5680720791743024,2.9464120070437536,1.2245217794713836,1.0018129694839955,6.0170335983537278E-2,1.0113817784091472,0.15016565889761468,1.00045411788691,3.0131249590179158E-2,1.0011415723609642,0.10415756746534804,5.8769982851640101,-115.83671430109453,64.163285698905469,null,1000000000,741391212.25,null,22.910592677851326,-23.131488553604196,null,13.991150713712294,-88.463830155502805,null,0,0]
[27385.25,27.385249999999999,9.1245691844585011,1.4609815297685038,1.0002131470715658,2.0645058426761408E-2,1,0,369.18745179616928,1.5680876723757464,2.9614251215982241,1.2263503362159769,1.0018338843423371,6.0515884053268652E-2,1.0115124537299387,0.15101709065476618,1.0004593602971958,3.0304604365053604E-2,1.0011548533437911,0.10475798745249444,5.8228280551624545,-115.84066800546177,64.159331994538235,null,1000000000,749951917.5625,null,22.904697463166368,-23.047411840089094,null,13.941799026977492,-88.527391539117133,null,0,0]
[27542,27.542000000000002,9.1761716210890967,1.4616015493679606,1.0002155938494581,2.0763194487337162E-2,1,0,371.30062256131441,1.5681030880870668,2.9764480381235061,1.2281604405478963,1.0018549188181169,6.0861417654326233E-2,1.0116438621428119,0.15186830183383077,1.000464632772849,3.0477957317968887E-2,1.0011682128512105,0.10535842112096468,5.7690264719045459,-115.84526558516566,64.154734414834337,null,1000000000,758561764,null,22.898891158518097,-22.964381373514293,null,13.892721188428334,-88.590549662855182,null,0,0]
[27702.5,27.702500000000001,9.2290121795484552,1.4622292174656653,1.0002181136266932,2.0884156168836585E-2,1,0,373.46434774136662,1.568118691831871,2.9918403568694552,1.2299950069747063,1.0018765804473113,6.121520253223061E-2,1.0117791736082784,0.1527396471617205,1.0004700625366583,3.0655455572001104E-2,1.0011819733699339,0.10597323348537641,5.7143146845365553,-115.85063162638086,64.14936837361914,null,1000000000,767428506.25,null,22.89303614826612,-22.880432869007105,null,13.842749856367663,-88.654807955702623,null,0,0]
[27863,27.863,9.2818563325375916,1.4628497388323738,1.0002206480387743,2.1005117239107623E-2,1,0,375.62807301130113,1.5681341158126019,3.0072426419561422,1.2318107871526318,1.0018983674696937,6.1568972067783882E-2,1.0119152530538957,0.15361075879883271,1.0004755238205645,3.0832951893810162E-2,1.0011958162987469,0.10658806035178132,5.6599792028176088,-115.85665519160766,64.143344808392342,null,1000000000,776346769,null,22.887270492137191,-22.797549558500432,null,13.793059312529941,-88.718657636949999,null,0,0]
[28023.5,28.023499999999999,9.3347040190101485,1.4634632343680742,1.0002231970855902,2.1126077694615247E-2,1,0,377.79179836957366,1.5681493631179382,3.0226547410296645,1.2336080563813083,1.0019202798770843,6.192272617343926E-2,1.0120521001698786,0.15448163551763988,1.0004810166240516,3.1010446272243773E-2,1.0012097416802017,0.10720290180012575,5.6060150228512846,-115.86332761635293,64.136672383647067,null,1000000000,785316552.25,null,22.881592310704292,-22.715715840439216,null,13.743646437713053,-88.782105638439546,null,0,0]
[28184,28.184000000000001,9.3875551792903877,1.464069822271556,1.0002257607670284,2.1247037531824515E-2,1,0,379.95552381467502,1.5681644367662024,3.0380765047315688,1.2353870848542154,1.0019423176612563,6.2276464761673034E-2,1.0121897146448617,0.15535227609270175,1.0004865409466004,3.1187938696150386E-2,1.0012237495570944,0.1078177579102855,5.552417239335198,-115.87064036987927,64.129359630120732,null,1000000000,794337856,null,22.875999772247027,-22.634916401799838,null,13.694508163627956,-88.845158737242087,null,0,0]
[28348,28.347999999999999,9.4415623846511636,1.4646826229568086,1.0002283954709807,2.1370634480145263E-2,1,0,382.1664333919058,1.5681796628134985,3.053844399293792,1.2371863424872782,1.0019649655192553,6.2637901155776235E-2,1.0123311223749241,0.15624165740226179,1.0004922182942526,3.136929964083035E-2,1.0012381481599897,0.10844603732554053,5.4980241220551438,-115.87876527989839,64.121234720101612,null,1000000000,803609104,null,22.870371885457523,-22.553407701268775,null,13.644578846383189,-88.909185805612537,null,0,0]
[28512,28.512,9.4955730952195019,1.4652884526609125,1.0002310454545469,2.1494230775445641E-2,1,0,384.37734305671592,1.5681947137026326,3.0696220785665815,1.2389671096764467,1.0019877442642899,6.2999321163622807E-2,1.0124733306339624,0.15713078957654228,1.0004979285495126,3.1550658521271716E-2,1.0012526329865983,0.10907433221742606,5.4440035047110147,-115.88754116100763,64.112458838992367,null,1000000000,812934144,null,22.864829697220213,-22.472947450448601,null,13.594929917764222,-88.972814390344567,null,0,0]
[28676,28.675999999999998,9.5495872515209683,1.4658874292226467,1.0002337107176056,2.1617826413954717E-2,1,0,386.58825280760283,1.5682095924388022,3.0854093924434181,1.2407296588739372,1.0020106538874338,6.3360724691912951E-2,1.0126163390847061,0.15801967131498607,1.0005036717118174,3.173201532557976E-2,1.0012672040833628,0.10970264267092746,5.3903504570102125,-115.89695933198536,64.103040668014643,null,1000000000,822312976,null,22.859371398645095,-22.393520205816639,null,13.545558262097758,-89.03605124818823,null,0,0]
[28840,28.84,9.6036047954154107,1.4664796678494778,1.0002363912600349,2.1741421391901699E-2,1,0,388.7991626430981,1.5682243019588484,3.1012061937836362,1.2424742574386032,1.0020336943797099,6.3722111647372626E-2,1.0127601473881782,0.15890830131935157,1.0005094477806002,3.1913370041860581E-2,1.0012818614969889,0.11033096877095154,5.3370601455918854,-115.90701124875073,64.092988751249266,null,1000000000,831745600,null,22.853995226905322,-22.315110811763322,null,13.496460814606682,-89.098902985126017,null,0,0]
[29008,29.007999999999999,9.6589432935067343,1.46707948260941,1.000239153024336,2.1868030192638908E-2,1,0,391.0639971949563,1.568239197790458,3.1173979695856291,1.244243068720887,1.0020574325217293,6.4092295637262722E-2,1.0129082922086621,0.15981834285290192,1.0005153988486748,3.2099145866432845E-2,1.0012969659580802,0.1109746362100868,5.282841232459341,-115.91795666504449,64.082043334955515,null,1000000000,841464064,null,22.848571289213702,-22.235828838990329,null,13.446447038865163,-89.162895117173889,null,0,0]
[29176,29.175999999999998,9.7142852270779141,1.4676724633344316,1.0002419308221702,2.1994638292188434E-2,1,0,393.32883183258673,1.5682539220780971,3.1335993979578673,1.2459935951120382,1.0020813079753608,6.4462462037969723E-2,1.0130572756493224,0.16072811747248844,1.0005213844467826,3.2284919474616675E-2,1.0013121610980318,0.11161832024841405,5.2289929993566888,-115.92954939983289,64.070450600167106,null,1000000000,851238976,null,22.843229930825061,-22.157583676777808,null,13.396714658831744,-89.226496679102638,null,0,0]
[29344,29.344000000000001,9.7696305377461563,1.4682587257491089,1.0002447246534043,2.212124568649718E-2,1,0,395.59366655451629,1.5682684777681064,3.1498103299528863,1.2477261081171938,1.0021053207307902,6.4832610749311723E-2,1.0132070973402232,0.16163762379016453,1.0005274045743044,3.2470690853629185E-2,1.0013274469679152,0.1122620209769459,5.1755105510573234,-115.94178070201355,64.058219297986454,null,1000000000,861070336,null,22.837969398247971,-22.080359932100169,null,13.347260539049284,-89.289714306888357,null,0,0]
[29512,29.512,9.8249791684406542,1.4688383829890015,1.0002475345179036,2.2247852371512177E-2,1,0,397.85850135930531,1.5682828677397376,3.166030619587342,1.2494408741150225,1.0021294707781474,6.520274167113578E-2,1.0133577569095671,0.16254686042057767,1.0005334592306161,3.2656459990688412E-2,1.0013428236190924,0.11290573848660644,5.1223890885877648,-115.95464196201746,64.045358037982538,null,1000000000,870958144,null,22.832787982890743,-22.004142501814535,null,13.29808159544408,-89.352554488162937,null,0,0]
[29684,29.684000000000001,9.8816490049602859,1.4694251141401837,1.0002504278942241,2.2377472762349734E-2,1,0,400.17726088667672,1.5682974315839813,3.1826466516870755,1.251178354909124,1.0021543380503937,6.5581666699504285E-2,1.0135128712614909,0.16347746470292202,1.0005396938165054,3.2846649866434811E-2,1.0013586604841658,0.11356480008370219,5.0683718972292988,-115.96845323328907,64.031546766710932,null,1000000000,881139856,null,22.827563427355972,-21.927137436925531,null,13.248013638865309,-89.416506453526509,null,0,0]
[29856,29.856000000000002,9.938322204475865,1.4700051538301573,1.0002533380761005,2.2507092401118332E-2,1,0,402.49602049794993,1.5683118276250589,3.1992721918685212,1.252897782643918,1.0021793492089925,6.5960572868786607E-2,1.013668863071153,0.16440778337245893,1.0005459645936539,3.3036837365085552E-2,1.0013745926148045,0.11422387946313421,5.0147232045563808,-115.98290699821534,64.017093001784659,null,1000000000,891380736,null,22.822418315315907,-21.851156041184062,null,13.198227736040982,-89.48007608834682,null,0,0]
[30028,30.027999999999999,9.9949987097812567,1.4705786154967813,1.0002562650633862,2.2636711283469012E-2,1,0,404.81478019168327,1.5683260587464707,3.2159070926675413,1.2545994272218819,1.0022045042431722,6.6339460071599743E-2,1.013825731933524,0.16533781495103048,1.0005522715613806,3.3227022472926797E-2,1.0013906200670761,0.11488297672218506,4.9614381583492992,-115.99799446327641,64.002005536723587,null,1000000000,901680784,null,22.817350950804261,-21.776183009377078,null,13.148720737584261,-89.543269897957472,null,0,0]
[30200,30.2,10.051678464957261,1.4711456100368163,1.0002592088559337,2.2766329405052969E-2,1,0,407.13353996646782,1.568340127766026,3.2325512095732538,1.2562835534033276,1.0022298031420989,6.6718328200593258E-2,1.0139834774415495,0.16626755796337744,1.0005586147190015,3.3417205176245766E-2,1.0014067428973656,0.11554209195803776,4.9085120017323849,-116.01370698020928,63.986293019790722,null,1000000000,912040000,null,22.812359681489689,-21.702203327153978,null,13.099489545849959,-89.606094242092183,null,0,0]
[30375.75,30.37575,10.109597270662151,1.4717183990132854,1.0002622341886964,2.289877271277313E-2,1,0,409.50285417909578,1.5683543389462662,3.2495675792890095,1.2579865721914643,1.0022558022083399,6.7105436722095776E-2,1.0141455672662449,0.16721727193177083,1.0005651335535251,3.3611531806786055E-2,1.0014233158217314,0.11621559610884581,4.8547977915496965,-116.03039885960285,63.969601140397145,null,1000000000,922686188.0625,null,22.807336517854523,-21.627621463222351,null,13.049466721778618,-89.669913135837135,null,0,0]
[30551.5,30.551500000000001,10.167519355407656,1.4722846620722825,1.0002652770671827,2.3031215217012464E-2,1,0,411.87216847347446,1.5683683866255251,3.2665932754322227,1.2596718433360987,1.0022819514578221,6.7492525102500908E-2,1.0143085715134204,0.16816668150909181,1.0005716901717356,3.380585589786942E-2,1.0014399884484231,0.11688911923369852,4.8014485435146037,-116.04772554042306,63.952274459576941,null,1000000000,933394152.25,null,22.80238944947989,-21.554045942444802,null,12.999725483574112,-89.733359255221799,null,0,0]
[30727.25,30.727250000000002,10.225444663471345,1.47284450975199,1.0002683374912325,2.3163656913131964E-2,1,0,414.2414828482012,1.5683822736092996,3.2836281529296012,1.2613396334040847,1.0023082508787911,6.7879593227388915E-2,1.0144724897422903,0.16911578513092734,1.000578284572891,3.4000177434869862E-2,1.0014567608386284,0.11756266143594903,4.7484594757063512,-116.06567825002016,63.934321749979844,null,1000000000,944163892.5625,null,22.797516846353115,-21.481461645853003,null,12.950262686793149,-89.796438939805014,null,0,0]
[30903,30.902999999999999,10.283373140383246,1.4733980501161426,1.000271415460684,2.3296097796492814E-2,1,0,416.61079730190505,1.5683960026392667,3.3006720696253318,1.2629902038497729,1.0023347004594263,6.8266640982376406E-2,1.0146373215098841,0.17006458123607754,1.0005849167562437,3.4194496403162515E-2,1.0014736330538829,0.11823622281883948,4.6958258999055449,-116.08424836322637,63.915751636773635,null,1000000000,954995409,null,22.792717120512705,-21.409853743748936,null,12.901075238677588,-89.859158387363806,null,0,0]
[31083,31.082999999999998,10.342705677255196,1.4739585486795019,1.0002745860486189,2.343174052814375E-2,1,0,419.03740678018914,1.5684099027358742,3.3181373677953747,1.2646631071982521,1.0023619452837602,6.8663027121686038E-2,1.0148070857295071,0.1710360008123967,1.0005917484825009,3.4393511729758311E-2,1.0014910168142104,0.11892609230458186,4.6422832228429467,-116.10389865923987,63.896101340760126,null,1000000000,966152889,null,22.787875252979038,-21.337511111975459,null,12.850980574309538,-89.923027443443118,null,0,0]
[31263,31.263000000000002,10.402041426309893,1.4745126529777455,1.0002777750404395,2.3567382397403459E-2,1,0,421.46401633850434,1.5684236427708611,3.3356118548633757,1.2663184872436803,1.0023893475926036,6.9059391651261556E-2,1.0149778072570474,0.17200709451496585,1.0005986198387538,3.4592524330862157E-2,1.0015085054176893,0.11961598212868649,4.5891037754106669,-116.12417872933115,63.875821270668851,null,1000000000,977375169,null,22.783106588065042,-21.266162082509208,null,12.801168331266624,-89.986531349831452,null,0,0]
[31443,31.443000000000001,10.461380332889943,1.4750604714760944,1.00028098243597,2.3703023399288942E-2,1,0,423.8906259754761,1.5684372254930945,3.3530953871669071,1.2679566089492618,1.0024169073730407,6.9455734448338705E-2,1.0151494856095229,0.17297786067713189,1.0006055308241857,3.4791534190766187E-2,1.0015260989315629,0.12030589240170149,4.5362828112138374,-116.14507977114422,63.854920228855775,null,1000000000,988662249,null,22.778409548761299,-21.195791624541407,null,12.751635348333664,-90.049676327747719,null,0,0]
[31623,31.623000000000001,10.520722343568185,1.4756021102078696,1.0002842082350334,2.3838663528817392E-2,1,0,426.31723568976139,1.5684506535888554,3.370587823950701,1.2695777321526287,1.0024446246120844,6.9852055390193998E-2,1.0153221203015717,0.17394829763583525,1.0006124814379758,3.4990541293763812E-2,1.0015437974234553,0.12099582323405006,4.483815676802088,-116.16659313306121,63.833406866938788,null,1000000000,1000014129,null,22.773782598939576,-21.126384997353401,null,12.702378516396708,-90.112468459065923,null,0,0]
[31807,31.806999999999999,10.581386219551076,1.4761495060018002,1.0002875247398628,2.3977316976607398E-2,1,0,428.79777014290698,1.5684642230012629,3.3884780414562146,1.2712175763101659,1.0024731205222788,7.0257160747223699E-2,1.0154995792659423,0.17493995787423078,1.0006196274680781,3.5193967910991157E-2,1.0015619977891881,0.12170110722723906,4.4305435670239621,-116.18920859814847,63.810791401851532,null,1000000000,1011685249,null,22.769123713135045,-21.056417145264753,null,12.652309328452322,-90.176297466648876,null,0,0]
[31991,31.991,10.642053230015129,1.4766906608925889,1.000290860474871,2.4115969502309605E-2,1,0,431.27830467409854,1.5684776363223711,3.4063772751548931,1.2728401912621574,1.0025017809393197,7.0662243007700298E-2,1.0156780365129385,0.17593127061267264,1.0006268149056183,3.5397391614236155E-2,1.0015803079945897,0.12240641293659474,4.3776316413755909,-116.21244608816055,63.787553911839453,null,1000000000,1023424081,null,22.764534945920119,-20.987426187231669,null,12.602522293155848,-90.239770193897442,null,0,0]
[32175,32.174999999999997,10.702723321658134,1.4772256806932174,1.0002942154398651,2.4254621100602211E-2,1,0,433.75883928199687,1.5684908962300905,3.4242853836599121,1.2744458387092434,1.0025306058490984,7.1067302040669161E-2,1.0158574915164515,0.17692223408648602,1.0006340437497041,3.5600812386725952E-2,1.0015987281131327,0.12311174047965691,4.3250752151807523,-116.23629683205725,63.763703167942751,null,1000000000,1035230625,null,22.760014780963434,-20.919397274841764,null,12.553014251051851,-90.302892710488393,null,0,0]
[32359,32.359000000000002,10.763396442376997,1.4777546688450329,1.0002975896346518,2.4393271766163623E-2,1,0,436.23937396529368,1.5685040053414239,3.4422022284573361,1.276034775257417,1.0025595952374267,7.1472337715221143E-2,1.0160379437478027,0.17791284653498329,1.0006413139994379,3.5804230211689131E-2,1.001617258218706,0.12381708997382576,4.2728696952501712,-116.26075221131248,63.739247788687521,null,1000000000,1047104881,null,22.755561741352128,-20.852315848097309,null,12.503782094794069,-90.365670950205811,null,0,0]
[32547.5,32.547499999999999,10.825556504449811,1.478290445201252,1.0003010662912875,2.4535312371951137E-2,1,0,438.78057397584729,1.5685172813562756,3.4605661744924028,1.2776455057668268,1.002589464152043,7.1887254794442856E-2,1.0162238427668346,0.17892732007430232,1.0006488049902371,3.6012619855041249E-2,1.0016363556386667,0.12453971274876231,4.2197465858822811,-116.28642382837936,63.713576171620645,null,1000000000,1059339756.25,null,22.751067899946456,-20.784561445004812,null,12.453628785482367,-90.429633582205938,null,0,0]
[32736,32.735999999999997,10.887719638583221,1.4788201037074959,1.0003045631293903,2.4677351987520815E-2,1,0,441.32177406284643,1.5685304044803723,3.4789390040039283,1.2792392273273909,1.0026195056583329,7.2302147080751444E-2,1.0164107872561072,0.17994142148061384,1.0006563394348034,3.6221006369301943E-2,1.0016555686495756,0.12526235881061673,4.1669822817880933,-116.31271218342548,63.687287816574525,null,1000000000,1071645696,null,22.746641491015403,-20.717771402371945,null,12.403758582106931,-90.493247078199815,null,0,0]
[32924.5,32.924500000000002,10.949885792456438,1.4793437482632503,1.0003080801487489,2.4819390607151697E-2,1,0,443.86297422497819,1.5685433773396957,3.4973205769865081,1.2808161999708267,1.0026497197407831,7.2717014433546459E-2,1.0165987766388591,0.18095514887398539,1.0006639173321548,3.6429389736443767E-2,1.0016748973322369,0.12598502828515412,4.1145721280948475,-116.33960848890709,63.660391511092911,null,1000000000,1084022700.25,null,22.742281047547745,-20.651930963880623,null,12.354168306539563,-90.556517398723045,null,0,0]
[33113,33.113,11.012054914927607,1.4798614804350854,1.0003116173491504,2.4961428225123067E-2,1,0,446.40417446095944,1.5685562025004329,3.5157107562968233,1.2823766786252075,1.002680106383792,7.3131856712278634E-2,1.0167878103355332,0.18196850037894594,1.0006715386813045,3.6637769938440902E-2,1.0016943417679141,0.12670772129798211,4.0625115607694404,-116.36710411259018,63.632895887409816,null,1000000000,1096470769,null,22.737985140852555,-20.587025662206948,null,12.304854833215551,-90.619450370636031,null,0,0]
[33305.75,33.305750000000003,11.075628746156974,1.4803848752128947,1.0003152551692192,2.510666724100722E-2,1,0,449.00266973753281,1.5685691667040846,3.5345243279169201,1.2839555448581852,1.0027113565607975,7.3556026124078688E-2,1.0169821853560919,0.18300430868601519,1.0006793767959179,3.685084507603243E-2,1.0017143443882917,0.12744673292138428,4.0096340498936982,-116.39583056942419,63.604169430575809,null,1000000000,1109272983.0625,null,22.733657663063727,-20.521609201815533,null,12.254712549116704,-90.683459346898104,null,0,0]
[33498.5,33.4985,11.139205576834488,1.4809022955971129,1.0003189140901558,2.5251905197457753E-2,1,0,451.60116508870192,1.5685819817167019,3.5533466171514156,1.2855176882535542,1.0027427871340553,7.3980169021343925E-2,1.0171776510779744,0.18403972001186553,1.000687260341677,3.7063916866029632E-2,1.0017344682134799,0.12818576942157583,3.9571126958164888,-116.42516590272403,63.574834097275968,null,1000000000,1122149502.25,null,22.72939476124305,-20.457140822254122,null,12.204853243224694,-90.747127501657971,null,0,0]
[33691.25,33.691249999999997,11.202785355893718,1.4814138430287083,1.0003225941117293,2.5397142088359009E-2,1,0,454.19966051318642,1.5685946500988655,3.5721774861974223,1.2870633655914994,1.0027743980866033,7.440428525397047E-2,1.0173742068725196,0.18507473236587219,1.000695189317508,3.7276985289165107E-2,1.0017547133318501,0.12892483093233725,3.9049428985610479,-116.45510136710278,63.544898632897215,null,1000000000,1135100326.5625,null,22.725195024633194,-20.393605949211967,null,12.15527373691571,-90.810460655070457,null,0,0]
[33884,33.884,11.266368033418638,1.4819196166711421,1.0003262952337064,2.5542377907595594E-2,1,0,456.79815600973518,1.5686071743528922,3.5910168000803808,1.2885928285821016,1.0028061894013831,7.4828374671911738E-2,1.0175718521080463,0.18610934376236329,1.0007031637223311,3.7490050326173294E-2,1.0017750798322753,0.12966391758727305,3.8531201476748036,-116.48562837382239,63.514371626177606,null,1000000000,1148125456,null,22.721057079431979,-20.330990295538932,null,12.105970904182374,-90.873464496788756,null,0,0]
[34081.5,34.081499999999998,11.33152055469772,1.4824319666597536,1.0003301094501598,2.569119170165457E-2,1,0,459.46068713673895,1.5686198603038606,3.6103289985216986,1.2901434220132311,1.0028389512258631,7.5262887090353586E-2,1.0177754973576114,0.18716903344693517,1.0007113817638997,3.7708362460677276E-2,1.001796074230161,0.13042124401222174,3.8003756672488791,-116.51751243513783,63.482487564862168,null,1000000000,1161548642.25,null,22.716879856783336,-20.267770415294596,null,12.055736855776498,-90.937685194373515,null,0,0]
[34279,34.279000000000003,11.3966760165191,1.4829384585104919,1.0003339458192999,2.5840004357580944E-2,1,0,462.12321833683319,1.5686324000741636,3.629649785037449,1.2916775113452068,1.0028719023749906,7.5697371037457481E-2,1.0179802850522404,0.18822829796380378,1.0007196474987761,3.792667099916066E-2,1.0018171962568545,0.13117859711931357,3.7479862393855523,-116.54999978707693,63.450000212923072,null,1000000000,1175049841,null,22.712764702394693,-20.205486143454841,null,12.005786804904233,-91.001571839366363,null,0,0]
[34476.5,34.476500000000001,11.461834368735728,1.4834391918684555,1.0003378043408715,2.598881586879687E-2,1,0,464.78574960876188,1.5686447961759906,3.6489790232100083,1.2931953515740897,1.0029050428301043,7.6131826351997306E-2,1.0181862145025937,0.18928713519315413,1.0007279609257789,3.8144975920904219E-2,1.0018384460095975,0.13193597705169435,3.6959472896025085,-116.58308168135271,63.416918318647291,null,1000000000,1188629052.25,null,22.708710251761708,-20.144123004521816,null,11.956117553190369,-91.065130149589422,null,0,0]
[34674,34.673999999999999,11.526995562332218,1.4839342641373008,1.0003416850146185,2.6137626228724817E-2,1,0,467.44828095129748,1.568657051064295,3.66831657943797,1.2946971926221078,1.0029383725724381,7.6566252872811463E-2,1.018393285016048,0.19034554302071327,1.0007363220437191,3.8363277205190838E-2,1.0018598235861826,0.13269338395231139,3.6442543323701013,-116.61674952866382,63.383250471336183,null,1000000000,1202286276,null,22.704715176292169,-20.083666810431247,null,11.90672595535146,-91.128365714428227,null,0,0]
[34875.75,34.875749999999996,11.593561842760048,1.4844342437426452,1.0003456720686095,2.628963764134824E-2,1,0,470.16810734374513,1.5686694263558156,3.6880787127049439,1.2962150871751339,1.0029726149584013,7.7009997915091083E-2,1.0186059889126455,0.19142628115841581,1.0007449123245782,3.8586272334798076E-2,1.0018817932682385,0.13346711747585394,3.5918016618585114,-116.65173810694911,63.348261893050889,null,1000000000,1216317938.0625,null,22.700694091047495,-20.022831628804298,null,11.85655496421008,-91.192634488716138,null,0,0]
[35077.5,35.077500000000001,11.66013098825105,1.4849285145782316,1.0003496822378732,2.6441647838727402E-2,1,0,472.88793380736973,1.5686816592937571,3.7078492527297078,1.297716798094275,1.0030070548258565,7.745371257133174E-2,1.0188198820382861,0.19250656677270486,1.0007535523684512,3.8809263625019928E-2,1.0019038965426559,0.13424087944168236,3.5397008470616331,-116.68732050234433,63.312679497655665,null,1000000000,1230431006.25,null,22.696732271095058,-19.962913803846114,null,11.806667234802914,-91.256577873841636,null,0,0]
[35279.25,35.279249999999998,11.726702950012792,1.4854171736257578,1.0003537155221314,2.6593656813851924E-2,1,0,475.60776034095016,1.5686937523203197,3.7276280657493412,1.299202576163303,1.0030416921544612,7.7897396669952962E-2,1.0190349636441198,0.19358639762790517,1.0007622421740496,3.9032251053779596E-2,1.0019261335154592,0.13501467000152342,3.4879473796071938,-116.72348805178983,63.276511948210171,null,1000000000,1244625480.5625,null,22.692828409199784,-19.903899096801915,null,11.757059578579497,-91.320201435541691,null,0,0]
[35481,35.481000000000002,{"$f":"SQRT(1+(A397/pole1)^2)","v":11.79327768035251},{"$f":"ATAN(A397/pole1)","v":1.4859003156878792},{"$f":"SQRT(1+(A397/Zero1)^2)","v":1.0003577719211048},{"$f":"ATAN(A397/Zero1)","v":2.6745664559711772E-2},{"$f":"IF(VIN_nom>Vout, 1, SQRT(1+(A397/z_RHP)^2))","v":1},{"$f":"IF(VIN_nom>Vout, 0, -ATAN(A397/z_RHP))","v":0},{"$f":"SQRT(1+(A397/Pole2)^2)","v":478.32758694329311},{"$f":"ATAN(A397/Pole2)","v":1.5687057078221571},3.7474150207695334,1.3006726671539885,{"$f":"SQRT(1+(A397/pole4)^2)","v":1.00307652692376},{"$f":"ATAN(A397/pole4)","v":7.8341050039446011E-2},{"$f":"SQRT(1+(A397/Zero3)^2)","v":1.0192512329777701},{"$f":"ATAN(A397/Zero3)","v":0.19466577149446546},{"$f":"SQRT(1+(A397/pole5)^2)","v":1.0007709817400772},{"$f":"ATAN(A397/pole5)","v":3.925523459900257E-2},{"$f":"SQRT((1-(Z397/pterm2))^2+(A397/pterm1)^2)","v":1.0019485042932728},{"$f":"IF((ATAN((A397/pterm1)/(1-A397^2/pterm2))>0),ATAN((A397/pterm1)/(1-A397^2/pterm2)),PI()+ATAN((A397/pterm1)/(1-A397^2/pterm2)))","v":0.13578848930688289},{"$f":"20*LOG10(((E397*K397*G397*O397)/(C397*I397*S397*M397*Q397))*Adc)","v":3.4365368384399102},{"$f":"((F397+L397+H397+R397)-(D397+J397+T397+N397+T397))*radconv","v":-116.76023225133854},{"$f":"IF(V397>0,V397,V397+180)","v":63.239767748661464},null,{"$f":"IF(U397<0,A397,1000000000)","v":1000000000},{"$f":"A397^2","v":1258901361},null,{"$f":"20*LOG10((K397/(I397*M397))*AEA)","v":22.68898123258548},{"$f":"(L397-(J397+N397))*radconv","v":-19.845773552904959},null,{"$f":"20*LOG10((E397*G397/(C397*S397))*Acs*Am)","v":11.707728859902176},{"$f":"(F397+H397-(D397+T397))*radconv","v":-91.383510614690607},null,{"$f":"SUM((U398<0)*(U397>0))*A397","v":0},0]
[35687.75,{"$f":"A398/1000","v":35.687750000000001},11.861505165636439,1.4863898046981414,1.0003619528312144,2.6901438253280036E-2,1,0,481.11481947950682,1.5687178193793188,3.7677006718046346,1.302163168510416,1.0031124298278971,7.8795666475573067E-2,1.0194740936015037,0.19577141919955862,1.0007799895242351,3.9483740326120509E-2,1.0019715684218027,0.13658151627139609,3.384203426933178,-116.79847662015682,63.201523379843181,null,1000000000,1273615500.0625,null,22.685096224520155,-19.787115659952175,null,11.657459662848739,-91.448068192076505,null,0,0]
[35894.5,35.894500000000001,11.929735460423027,1.4868736947083945,1.0003661580153473,2.7057210640993559E-2,1,0,483.90205208548213,1.5687297914135068,3.7879946034811764,1.303637702587721,1.0031485400365381,7.9250250276107673E-2,1.0196981999426804,0.19687658226301932,1.0007890495630454,3.971224192789246E-2,1.0019947732983991,0.1373745737453349,3.332221020679766,-116.83730899095814,63.162691009041865,null,1000000000,1288415130.25,null,22.681268146191911,-19.72936276074519,null,11.607474798054842,-91.512306793273282,null,0,0]
[36101.25,36.10125,11.997968516780858,1.4873520810154699,1.0003703874731975,2.7212981715309219E-2,1,0,486.68928476002048,1.5687416263218303,3.8082966834196865,1.3050965182874423,1.0031848575272968,7.9704801256707952E-2,1.0199235511801412,0.19798125830554986,1.0007981618550885,3.9940739380569273E-2,1.0020181190397701,0.13816766189102,3.280585132719894,-116.87672071001658,63.123279289983415,null,1000000000,1303300251.5625,null,22.677495733559056,-19.672500721058555,null,11.55777105638424,-91.576231888119693,null,0,0]
[36308,36.308,12.066204287860792,1.4878250567707489,1.0003746412044572,2.7368751468684265E-2,1,0,489.47651750195075,1.568753326446799,3.8286067819959912,1.3065398595003979,1.0032213822776619,8.0159319233112966E-2,1.0201501464888931,0.19908544495470357,1.0008073263989372,4.0169232660404425E-2,1.0020416057632839,0.13896078087052288,3.2292913629119155,-116.91670328462207,63.083296715377926,null,1000000000,1318270864,null,22.673777756053664,-19.616515690636252,null,11.508345282104212,-91.639848823514953,null,0,0]
[36519.5,36.519500000000001,12.136010510214318,1.4883033954580274,1.0003790177795213,2.752809859625225E-2,1,0,492.32778588932007,1.5687651583005133,3.8493916618601078,1.3080005982260112,1.0032589606030775,8.0624245239078671E-2,1.0203832341443253,0.20021449100380259,1.0008167555593754,4.0402971141045324E-2,1.0020657780859716,0.13977215352016298,3.177168638287859,-116.9581864324245,63.041813567575502,null,1000000000,1333673880.25,null,22.670029435857302,-19.560137739832225,null,11.458068354565834,-91.704613922097394,null,0,0]
[36731,36.731000000000002,12.205819477620823,1.4887762627100021,1.0003834197554937,2.7687444325519471E-2,1,0,495.17905434481798,1.5687768538972895,3.8701846671596307,1.3094456440390856,1.0032967557728565,8.1089136317092705E-2,1.0206176219330789,0.20134301991355769,1.0008262393970815,4.0636705204640224E-2,1.0020900981938194,0.14058355877898504,3.125394886070211,-117.00024948949368,62.999750510506317,null,1000000000,1349166361,null,22.666335578451637,-19.504649118514262,null,11.40807579894469,-91.769067479013913,null,0,0]
[36942.5,36.942500000000003,12.275631143248665,1.4892437516617387,1.0003878471320391,2.7846788648412515E-2,1,0,498.03032286727438,1.5687884155773741,3.8909856676302264,1.3108752425361867,1.0033347677624935,8.1553992270165659E-2,1.0208533089596223,0.20247102916663023,1.0008357779105006,4.0870434825776528E-2,1.0021145662146165,0.14139499681967035,3.0739656636213954,-117.04288386493513,62.957116135064865,null,1000000000,1364748306.25,null,22.662694968534431,-19.450035877835255,null,11.358364402912436,-91.8332148408672,null,0,0]
[37154,37.154000000000003,12.34544546132372,1.489705953351089,1.0003922999088204,2.8006131556858424E-2,1,0,500.88159145554584,1.5687998456277266,3.9117945357287276,1.3122896343436452,1.0033729965473461,8.2018812901398605E-2,1.0210902943242894,0.20359851625328923,1.00084537109807,4.1104159979044534E-2,1.0021391822768735,0.14220646781462062,3.0228766140194634,-117.08608112938619,62.913918870613813,null,1000000000,1380419716,null,22.659106423074221,-19.396284350673657,null,11.30893100764893,-91.897061234082386,null,0,0]
[37370.25,37.370249999999999,12.416830409122475,1.4901731614409059,1.0003968789508324,2.8169051617680976E-2,1,0,503.79689569365371,1.5688113986121215,3.9330787470470217,1.3137203142222107,1.0034123080257518,8.2494036040987762E-2,1.0213339435177227,0.20475078265879584,1.0008552362636389,4.1343129632806647E-2,1.0021645043827678,0.14303619758749284,2.9709874417456801,-117.13082192350257,62.869178076497434,null,1000000000,1396535585.0625,null,22.655489915735231,-19.342202649207795,null,11.258671606597311,-91.962035668096291,null,0,0]
[37586.5,37.586500000000001,12.488218036322689,1.4906350281356076,1.0004014845460816,2.8331970182742378E-2,1,0,506.71219999823029,1.5688228186592603,{"$f":"SQRT(1+(A407/Zero2)^2)","v":3.9543709220961913},{"$f":"ATAN(A407/Zero2)","v":1.3151355900778936},1.00345184609403,8.2969221838344612E-2,1.0215789481065936,0.20590249789829876,1.0008651585834141,4.1582094562047603E-2,1.0021899815284321,0.14386596217507941,2.9194449465032015,-117.17613385329373,62.823866146706266,null,1000000000,1412744982.25,null,22.651925435332988,-19.288993776945603,null,11.208696320978934,-92.026706143150022,null,0,0]
[37802.75,37.802750000000003,12.559608297235963,1.4910916443197593,1.0004061166942011,2.849488724341483E-2,1,0,509.62750436813502,1.5688341080505273,3.9756709329241366,1.3165357037803374,1.0034916107253982,8.3444370083300412E-2,1.0218253071159464,0.20705365931398234,1.0008751380556959,4.1821054739616503E-2,1.0022156138535718,0.14469576176074439,2.8682447351263303,-117.22200840968586,62.777991590314144,null,1000000000,1429047907.5625,null,22.648411815509917,-19.236643994449196,null,11.159001940297411,-92.091077877545942,null,0,0]
[38019,38.018999999999998,12.631001147205158,1.4915430988320098,1.0004107753948219,2.865780279107101E-2,1,0,512.54280880225303,1.5688452690154013,3.9969786542596069,1.317920892282235,1.0035316018929232,8.3919480565787519E-2,1.022073019566379,0.2082042642564578,1.0008851746787746,4.206001013836571E-2,1.00224140149868,0.14552559652753952,2.817382498918283,-117.26843724509888,62.73156275490112,null,1000000000,1445444361,null,22.644947920945349,-19.185139841033077,null,11.109585307555978,-92.15515597234608,null,0,0]
[38240.5,38.240499999999997,12.704129872479454,1.4920002531046734,1.0004155747237249,2.8824671936296255E-2,1,0,515.5288894788165,1.5688565700760819,4.0188115382683378,1.3193244791174752,1.0035727987684793,8.4406086154218643E-2,1.0223281479439528,0.20938222329872394,1.0008955142125913,4.2304761783825737E-2,1.0022679763717837,0.1463756142355476,2.7656314230340291,-117.31655932360452,62.683440676395477,null,1000000000,1462335840.25,null,22.641450327626671,-19.133248188719996,null,11.05925366459978,-92.220490512258621,null,0,{"$f":"IF(AH410>0,W410,0)","v":0}]
[38462,38.462000000000003,12.777261222398499,1.4924521743761714,1.0004204019092435,2.8991539475828287E-2,1,0,518.51497022046181,1.5688677409731946,4.0406522539928007,1.320712895201712,1.0036142332554778,8.4892651678564746E-2,1.0225846941822947,0.21055959292084472,1.0009059137021794,4.254950835796973E-2,1.0022947144988548,0.14722566924138383,2.7142260436561405,-117.36524569648898,62.634754303511016,null,1000000000,1479325444,null,22.638002587764305,-19.082216003086362,null,11.009206881612938,-92.28552745229743,null,0,0]
[38683.5,38.683500000000002,12.850395152151883,1.4928989518061915,1.0004252569509746,2.9158405400397644E-2,1,0,521.50105102607108,1.5688787839426603,4.0625006751189661,1.3220863799066058,1.0036559053244902,8.5379176913417218E-2,1.0228426572145346,0.21173637030342513,1.0009163731456703,4.2794249831635156E-2,1.0023216160334385,0.14807576174072756,2.6631619923453753,-117.41448789705923,62.585512102940768,null,1000000000,1496413172.25,null,22.634603576327379,-19.032029684340166,null,10.959441733006621,-92.350271912679005,null,0,0]
[38905,38.905000000000001,12.923531617941963,1.493340672544464,1.0004301398485125,2.9325269700735391E-2,1,0,524.48713189455179,1.5688897011694818,4.0843566779914795,1.3234451677082237,1.0036978149459241,8.5865661633481097E-2,1.0231020359689891,0.21291255263646691,1.0009268925411841,4.3038986175663124E-2,1.002348681129946,0.14892589192890637,2.6124349845045671,-117.46427762100575,62.535722378994251,null,1000000000,1513599025,null,22.631252198335154,-18.982675910275336,null,10.909955047056583,-92.414728898437644,null,0,0]
[39131.5,39.131500000000003,12.998321597706191,1.4937872239597216,1.000435161775149,2.9495899000269672E-2,1,0,527.54061871561544,1.5689007370272088,4.1067137586339353,1.3248196689331579,1.0037409162339512,8.6363085818377011E-2,1.0233687326720586,0.2141146670933764,1.0009377113901423,4.3289241707118849E-2,1.0023765264803104,0.14979525159251025,2.5609070606268372,-117.51574898259344,62.484251017406564,null,1000000000,1531274292.25,null,22.627873316552986,-18.933055405587677,null,10.859635993103877,-92.480348710821303,null,0,0]
[39358,39.357999999999997,13.073114139784776,1.494228665935065,1.0004402128285201,2.9666526581814696E-2,1,0,530.59410560018898,1.5689116458656338,4.1290785138728845,1.3261792829971726,1.0037842658570519,8.6860467162615806E-2,1.0236369074521245,0.21531615342028468,1.0009485929243009,4.3539491813080138E-2,1.0024045431895638,0.15066465107764912,2.5097227660257264,-117.56777580657318,62.432224193426819,null,1000000000,1549052164,null,22.624542019319907,-18.884278140131844,null,10.809601574764551,-92.545678153901278,null,0,0]
[39584.5,39.584499999999998,13.147909200450158,1.4946650854958137,1.0004452930081842,2.9837152435461332E-2,1,0,533.64759254718194,1.5689224298651356,4.1514508196742437,1.3275242455148026,1.0038278637830536,8.7357805425671078E-2,1.0239065591478027,0.21651700864324913,1.0009595371416158,4.3789736462380567E-2,1.0024327314256192,0.15153409059202516,2.4588777776586781,-117.62034971670971,62.379650283290289,null,1000000000,1566932640.25,null,22.621257227242147,-18.836330725334726,null,10.759848567753881,-92.610722226329344,null,0,0]
[39811,39.811,13.222706736962708,1.495096567705918,1.000450402313698,3.0007776551301057E-2,1,0,536.70107955552919,1.5689330911564734,4.1738305546218522,1.3288547872617955,1.0038717099796051,8.7855100367143349E-2,1.0241776865925387,0.21771722979873134,1.0009705440400305,4.4039975623857794E-2,1.0024610913573329,0.15240357034294733,2.4083678551591903,-117.67346249875057,62.326537501249433,null,1000000000,1584915721,null,22.618017889815285,-18.789200047029585,null,10.710373801651258,-92.675485814356463,null,0,0]
[40042.75,40.042749999999998,13.299240510230375,1.4955330275442313,1.0004556601926848,3.0182353721724498E-2,1,0,539.82534281522953,1.5689438747282431,4.196736590621776,1.330201479109351,1.0039168294139604,8.8363876922511686E-2,1.0244566246807347,0.21894461128654422,1.0009818709403209,4.429600931820149E-2,1.0024902865269041,0.1532932454601528,2.3570296400591757,-117.72835572233802,62.271644277661977,null,1000000000,1603421827.5625,null,22.61474944927954,-18.741808890294124,null,10.660037007438669,-92.741465215383258,null,0,0]
[40274.5,40.274500000000003,13.375776787973622,1.4959644926121516,1.0004609485624263,3.0356929051861933E-2,1,0,542.94960613698106,1.5689545341974551,4.2196501550941159,1.3315335477258703,1.0039622086923876,8.8872607615967172E-2,1.0247371052357575,0.22017132272891071,1.0009932634567409,4.4552037201380887E-2,1.0025196618044574,0.15418296313861357,2.3060334784354848,-117.78379619339377,62.216203806606231,null,1000000000,1622035350.25,null,22.611526458672881,-18.695245844733993,null,10.609984954679508,-92.807160981167485,null,0,0]
[40506.25,40.506250000000001,13.452315527445185,1.4963910480028797,1.0004662674224389,3.0531502531101727E-2,1,0,546.0738695197191,1.5689650716941983,4.2425711260580297,1.332851225356376,1.004007847779653,8.9381292190420306E-2,1.0250191269913902,0.22139736098543264,1.0010047215870506,4.480805924002957E-2,1.0025492173739354,0.15507272359909771,2.2553750834400321,-117.83977561587224,62.160224384127758,null,1000000000,1640756289.0625,null,22.608347880798235,-18.649497711004528,null,10.560214414795926,-92.872578000447504,null,0,0]
[40738,40.738,13.528856686863802,1.4968127768911552,1.0004716167722363,3.0706074148832918E-2,1,0,549.19813296240272,1.5689754893000911,4.2654993841155564,1.3341547394546851,1.0040537466403283,8.9889930388923664E-2,1.0253026886758565,0.22262272292725294,1.001016245328997,4.5064075400785712E-2,1.0025789534203147,0.15596252706193242,2.2050502499581959,-117.89628585550439,62.103714144495612,null,1000000000,1659584644,null,22.605212706288302,-18.604551561507925,null,10.510722213196267,-92.937721052016656,null,0,0]
[40975.25,40.975250000000003,13.607216821216408,1.4972395996512393,1.0004771246585766,3.0884786842925092E-2,1,0,552.39654295559114,1.5689860320728402,4.2889792129157476,1.3354747500119832,1.0041010038513207,9.0410591520327932E-2,1.0255945738279189,0.22387646189931196,1.001028110521244,4.5326161333861539E-2,1.0026095823232182,0.15687349253391331,2.1538723068666963,-117.95467875894842,62.045321241051582,null,1000000000,1678971112.5625,null,22.602047061476288,-18.559356269379247,null,10.460340505473072,-93.004131188555235,null,0,0]
[41212.5,41.212499999999999,13.685579406112334,1.4976615345782545,1.00048266449803,3.1063497563600898E-2,1,0,555.5949530094714,1.5689964534618011,4.3124664335671374,1.3367803843329675,1.0041485332363962,9.0931203503922697E-2,1.0258880701536928,0.22512948547562961,1.0010400444715148,4.55882410359972E-2,1.0026404007666385,0.15778450353944073,2.1030352804482231,-118.01361122494757,61.986388775052433,null,1000000000,1698470156.25,null,22.598924849401357,-18.514974904176743,null,10.410243939266495,-93.070263994836168,null,0,0]
[41449.75,41.449750000000002,13.763944399696376,1.4980786650072764,1.0004882362900658,3.1242206299478065E-2,1,0,558.79336312300165,1.5690067555512937,4.3359609259482284,1.3380718716234936,1.0041963347569081,9.1451766064496648E-2,1.0261831762707538,0.22638179033706218,1.0010520471773499,4.5850314471413897E-2,1.002671408952402,0.15869556031345139,2.0525349118835035,-118.07307502900001,61.926924970999991,null,1000000000,1718081775.0625,null,22.595845072089379,-18.471394437026518,null,10.360429276694312,-93.136124259720589,null,0,0]
[41687,41.686999999999998,13.84231176105987,1.4984910723929716,1.0004938400341501,3.1420913039175068E-2,1,0,561.99177329516317,1.5690169403781891,4.3594625724902194,1.3393494363379419,1.0042444083739963,9.19722789269979E-2,1.0264798907906898,0.22763337317728952,1.0010641186362763,4.611238160433799E-2,1.0027026070834677,0.15960666309038674,2.0023670233399291,-118.13306210833726,61.866937891662744,null,1000000000,1737805969,null,22.592806758422679,-18.42860210858467,null,10.31089333409251,-93.20171666430177,null,0,0]
[41929.75,41.929749999999999,13.922498266928894,1.4989082348235638,1.000499606757052,3.160376053361412E-2,1,0,565.2643300220069,1.5690272420172113,4.3835163260230239,1.3406424367407208,1.0042938780386301,9.250480674702817E-2,1.0267851471451539,0.2289132198253141,1.001076541099104,4.6380517494758605E-2,1.0027347252731569,0.16053893518161114,1.9513759838859399,-118.1949731938505,61.805026806149499,null,1000000000,1758103935.0625,null,22.589739940646044,-18.385620479546692,null,10.260494256395297,-93.268557177481597,null,0,0]
[42172.5,42.172499999999999,14.002687167904377,1.499320619414193,1.0005054069294774,3.1786605914143701E-2,1,0,568.5368868081481,1.5690374250616479,4.4075773281411994,1.3419213222618065,1.0043436324787227,9.3037281955980433E-2,1.0270920843799989,0.23019230362611931,1.0010890355343982,4.6648646711332453E-2,1.0027670427504793,0.16147125592835415,1.9007244203384137,-118.25741552209973,61.742584477900266,null,1000000000,1778519756.25,null,22.586714556795751,-18.343437764297008,null,10.210380396649612,-93.335126849470001,null,0,0]
[42415.25,42.41525,14.082878423072605,1.4997283076418533,1.0005112405508443,3.1969449168574748E-2,1,0,571.80944365256858,1.5690474915477033,4.4316454607791949,1.3431863186558988,1.0043936716519535,9.3569704259750558E-2,1.0274007009887294,0.23147062107998889,1.0011016019394638,4.6916769215756771E-2,1.0027995597365207,0.16240362558011409,1.8504081076057379,-118.32038095787975,61.679619042120251,null,1000000000,1799053432.5625,null,22.583729648472371,-18.302041127859113,null,10.160548513136668,-93.401430363548442,null,0,0]
[42658,42.658000000000001,14.163071992445285,1.5001313791445221,1.0005171076205679,3.2152290284719068E-2,1,0,575.08200055427324,1.5690574434652342,4.4557206083878222,1.3444376469784882,1.0044439955157682,9.4102073364412842E-2,1.027710995458422,0.23274816870141726,1.0011142403115909,4.7184884969734553E-2,1.002832276453606,0.16333604438583416,1.8004229006814008,-118.38386152715287,61.616138472847126,null,1000000000,1819704964,null,22.580784283128146,-18.261418001856033,null,10.110995418464734,-93.46747229759869,null,0,0]
[42906.5,42.906500000000001,14.245167456811702,1.5005392973800238,1.0005231483086656,3.2339460116298041E-2,1,0,578.4320743101166,1.5690675144718165,4.4803731702329781,1.3457046838485125,1.0044958062378975,9.4646997242956984E-2,1.0280303762091221,0.23405517646733204,1.0011272525892587,4.7459344528153563E-2,1.0028659752459763,0.16429060049538072,1.7495924157588698,-118.44937117696244,61.550628823037556,null,1000000000,1840967742.25,null,22.577809162906995,-18.220621001238637,null,10.060554064275598,-93.534812285940106,null,0,0]
[43155,43.155000000000001,14.327265264370736,1.5009425407922301,1.0005292240472121,3.2526627681247006E-2,1,0,581.78214812395208,1.5690774694947258,4.505032846063501,1.3469578516839924,1.0045479152062342,9.5191864749549562E-2,1.0283515120199682,0.23536137015305478,1.0011403402779258,4.7733796931346557E-2,1.0028998838189407,0.16524520864121367,1.6991003663246271,-118.51540424377501,61.484595756224991,null,1000000000,1862354025,null,22.574873582977936,-18.180608762517611,null,10.010398272431068,-93.601887537964345,null,0,0]
[43403.5,43.403500000000001,14.409365375071147,1.5013411891559634,1.0005353348355692,3.2713792966493786E-2,1,0,585.13222199478321,1.5690873105260943,4.5296995196938212,1.3481973730896928,1.0046003223743682,9.5736675569466828E-2,1.0286744012472546,0.23666674606600585,1.0011535033746346,4.8008242138249183E-2,1.0029340024150331,0.1661998690885598,1.6489425535392668,-118.58195267364071,61.418047326359286,null,1000000000,1883863812.25,null,22.571976621838044,-18.141368627487811,null,9.9605247927852645,-93.668702640377404,null,0,0]
[43652,43.652000000000001,14.491467749768212,1.501735320444086,1.0005414806730948,3.2900955958967158E-2,1,0,588.48229592163682,1.5690970395126906,4.5543730774228184,1.3494234660162794,1.0046530276956331,9.6281429388185055E-2,1.0289990422403699,0.23797130052937576,1.0011667418764107,4.828268010780358E-2,1.0029683312781459,0.16715458210202216,1.5991148579250321,-118.64900857336548,61.350991426634522,null,1000000000,1905497104,null,22.569117382908836,-18.102888202016686,null,9.9109304297289729,-93.735262076604783,null,0,0]
[43906,43.905999999999999,14.575389579523554,1.5021335861565088,1.0005477987558782,3.3092259008857552E-2,1,0,591.90651641081968,1.5691068700175417,4.579599728483827,1.3506630403799029,1.0047072076088142,9.683818089768402E-2,1.029332677073129,0.23930387569806869,1.0011803513070665,4.8563184635034819E-2,1.0030036374895568,0.16813048018355273,1.548521286013016,-118.71806499633487,61.281935003665126,null,1000000000,1927736836,null,22.566232936676371,-18.064328580714651,null,9.8605235850856925,-93.80303500506875,null,0,0]
[44160,44.16,14.659313694692313,1.5025272918131405,1.000554153455103,3.3283559635748784E-2,1,0,595.33073695654548,1.56911658743629,4.6048333391988789,1.351889031346738,1.004761698919699,9.739487219103983E-2,1.0296681385637474,0.24063558493565251,1.0011940395112402,4.8843681514287689E-2,1.0030391638981788,0.16910643374082096,1.4982641479893668,-118.78763542324965,61.212364576750346,null,1000000000,1950105600,null,22.563386083061854,-18.026537301233667,null,9.8104017670305357,-93.870549978934491,null,0,0]
[44414,44.414000000000001,14.743240056246176,1.5029165151656614,1.0005605447700714,3.347485782568551E-2,1,0,598.75495755784436,1.5691261937091188,4.6300737957789506,1.3531016573470971,1.0048165015776267,9.7951502933034243E-2,1.0300054249274579,0.24196642436707844,1.0012078064857006,4.9124170701738648E-2,1.0030749107688555,0.17008244305434775,1.4483392889789486,-118.85771192123137,61.14228807876863,null,1000000000,1972603396,null,22.560575940277413,-17.989501940396398,null,9.7605617319353186,-93.937811469917392,null,0,0]
[44668,44.667999999999999,14.827168626039432,1.5033013322108146,1.0005669727000819,3.3666153564713426E-2,1,0,602.17917821376841,1.5691356907320804,4.6553209868722609,1.3543011322319991,1.004871615531657,9.8508072788671977E-2,1.0303445343721274,0.24329639013468229,1.0012216522271988,4.9404652153571371E-2,1.0031108783679095,0.17105850840395787,1.398742632291234,-118.92828671662946,61.071713283370542,null,1000000000,1995230224,null,22.557801650413253,-17.953210334883991,null,9.7110002905832378,-94.00482384914244,null,0,0]
[44928.25,44.928249999999998,14.913164618759055,1.5036911255804224,1.0005735967744913,3.386215382723038E-2,1,0,605.68765632341092,1.5691453100639636,4.681196289076941,1.3555167001916302,1.0049284084626804,9.9078274266564084E-2,1.0306938770852694,0.24465817124744579,1.0012359203558692,4.9692027146642087E-2,1.003147960218685,0.1720586495228012,1.3482618179822412,-119.00110697113736,60.998893028862639,null,1000000000,2018547648.0625,null,22.554995409810168,-17.916784706318165,null,9.6605050073488368,-94.073231241382857,null,0,0]
[45188.5,45.188499999999998,14.999162851385435,1.5040764492197758,1.0005802592865292,3.4058151487083091E-2,1,0,609.19613448845303,1.5691548185966686,4.7070784321903973,1.3567189021698811,1.0049855280888114,9.9648411113559848E-2,1.0310451298691019,0.2460190270289343,1.0012502711686331,4.9979393925614339E-2,1.003185274364919,0.17305885006183777,1.2981171347289475,-119.07443432069344,60.925565679306558,null,1000000000,2042000532.25,null,22.552225058370674,-17.881114840672456,null,9.6102955882373742,-94.141386090591809,null,0,0]
[45448.75,45.448749999999997,15.085163285610466,1.5044573794591876,1.0005869602354278,3.4254146529265159E-2,1,0,612.70461270794306,1.5691642182335728,4.7329673039844842,1.3579079539947432,1.0050429743543483,0.10021848297005771,1.0313982907721455,0.24737895338670926,1.0012647046619356,5.0266752443381024E-2,1.0032228210979099,0.1740591103197609,1.2483044401142795,-119.14826089890776,60.851739101092235,null,1000000000,2065588876.5625,null,22.549489746362937,-17.846188460365699,null,9.5603687727002455,-94.209292788147735,null,0,0]
[45709,45.709000000000003,15.171165883993694,1.5048339909033264,1.0005936996204148,3.4450138938771406E-2,1,0,616.21309098095116,1.5691735108347062,4.7588627946443456,1.359084066947047,1.0051007472032849,0.10078848947670703,1.0317533578349982,0.24873794624767132,1.0012792208322012,5.0554102652843221E-2,1.0032606007105824,0.17505943059447904,1.1988196695077291,-119.22257899849185,60.777421001508145,null,1000000000,2089312681,null,22.546788647145377,-17.8119935458806,null,9.5107213549965177,-94.276955626511949,null,0,0]
[45975.25,45.975250000000003,15.259153452631653,1.5052148917747976,1.0006006341549667,3.4650647165203982E-2,1,0,619.80245641555314,1.5691829088042093,4.7853620369663057,1.360274120808378,1.0051601898965199,0.10137156934212056,1.0321185814159508,0.25012730010183581,1.0012941572235474,5.0848069004058624E-2,1.0032994926251864,0.17608287542618101,1.148529232026483,-119.29911125914198,60.700888740858019,null,1000000000,2113723612.5625,null,22.544059841193857,-17.777754961589739,null,9.4602151757502391,-94.345930433227679,null,0,0]
[46241.5,46.241500000000002,15.34714320976588,1.5055914250633895,1.0006076089166569,3.4851152604401747E-2,1,0,623.39182190426686,1.5691921985504538,4.8118679818028385,1.3614510656116101,1.0052199742857726,0.10195458004961758,1.0324857958879397,0.25151566835766087,1.0013091801403597,5.1142026559760183E-2,1.0033386289066732,0.17710638370218451,1.0985736476820565,-119.37614214006084,60.623857859939164,null,1000000000,2138276322.25,null,22.541365164242034,-17.744257307809466,null,9.4099948082999134,-94.414658790664973,null,0,0]
[46507.75,46.507750000000001,15.43513511796905,1.5059636653569572,1.0006146239046438,3.5051655240301544E-2,1,0,626.98118744616283,1.5692013819321198,4.8383805189994309,1.3626151135674367,1.0052801003100802,0.10253752121523969,1.03285499912748,0.25290304671690716,1.0013242895787438,5.1435975269542564E-2,1.0033780098739784,0.1781299557389025,1.0489488043609276,-119.45366388060251,60.546336119397495,null,1000000000,2162970810.0625,null,22.538703801425651,-17.711488510258036,null,9.360056990281187,-94.483144991442614,null,0,0]
[46774,46.774000000000001,15.523129140661558,1.5063316855569497,1.0006216791180813,3.525215505684156E-2,1,0,630.57055304033304,1.5692104607655675,4.8648995407757374,1.3637664724009646,1.0053405679081471,0.10312039245530923,1.0332261890026297,0.25428943090270545,1.0013394855347824,5.172991508300958E-2,1.0034176358478148,0.17915359185186877,0.99965066688267556,-119.53166887799239,60.468331122007612,null,1000000000,2187807076,null,22.536074960065591,-17.679436749250154,null,9.3103985141949046,-94.551393231504974,null,0,0]
[47046.25,47.046250000000001,15.613108276501201,1.5067037095871822,1.0006289349167561,3.5457170246996315E-2,1,0,634.24080579961446,1.5692196379329051,4.8920227698667258,1.3649308679122631,1.005402751298748,0.10371632611549772,1.0336077957840577,0.25570602508396822,1.001355113394961,5.2030469640483898E-2,1.0034584084879861,0.18020036240718235,0.94957529245775341,-119.61192369005479,60.388076309945205,null,1000000000,2213349639.0625,null,22.533419702899977,-17.64739209728706,null,9.2599065438134005,-94.620937668200312,null,0,0]
[47318.5,47.3185,15.703089548460348,1.5070714701507244,1.0006362327724829,3.5662182455327929E-2,1,0,637.91105861169717,1.5692287094976716,4.9191525584970446,1.3660824213745222,1.0054652917007543,0.10431218585258252,1.033991475213208,0.25712157080328213,1.001370831707765,5.2331014789620024E-2,1.003499437985562,0.18124720062365868,0.89983321922394222,-119.69266819591918,60.307331804080818,null,1000000000,2239040442.25,null,22.530796841116999,-17.616072954471598,null,9.209700034682669,-94.690241873792871,null,0,0]
[47590.75,47.59075,15.793072920027283,1.5074350400224368,1.0006435726843417,3.5867191664668514E-2,1,0,641.58131147567497,1.569237677272207,4.9462887987318842,1.3672213410697016,1.0055281890475514,0.10490797125727794,1.0343772249836716,0.25853606355767167,1.0013866404689351,5.2631550476567382E-2,1.0035407246891894,0.18229410683576375,0.85042037015172089,-119.77389475438586,60.226105245614136,null,1000000000,2264879485.5625,null,22.528205594627977,-17.58546746751556,null,9.159775727656438,-94.759310038122138,null,0,0]
[47863,47.863,15.883058355516852,1.5077944903324461,1.0006509546514071,3.6072197857851679E-2,1,0,645.25156439066245,1.5692465430276159,4.9734313849667178,1.3683478308656816,1.0055914432721609,0.10550368192061155,1.0347650427800426,0.25994949886771196,1.0014025396741875,5.2932076647485581E-2,1.0035822689494533,0.18334108137698066,0.80133274416468825,-119.8555958804687,60.144404119531302,null,1000000000,2290866769,null,22.525645204611592,-17.555564033694271,null,9.1101304183970271,-94.828146256734925,null,0,0]
[48141.75,48.141750000000002,15.975194305609396,1.5081583268965872,1.0006585564361132,3.6282095454468852E-2,1,0,649.00944506722954,1.5692555165597248,5.0012284707347892,1.3694885455366892,1.0056565773885888,0.10611353737828168,1.0351642600202033,0.26139557983911116,1.0014189121791954,5.3239767999477342E-2,1.0036250723057003,0.18441312369841201,0.75140600764594401,-119.93973167187691,60.060268328123087,null,1000000000,2317628093.0625,null,22.523054884458489,-17.525662186737396,null,9.0595856004859314,-94.898389810434338,null,0,0]
[48420.5,48.420499999999997,16.067332346197311,1.5085179906698072,1.0006662023061637,3.6491989852770614E-2,1,0,652.76732579545592,1.569264386773356,5.0290319923054216,1.3706166485449236,1.005722085483983,0.10672331361637721,1.0355656402726501,0.26284054284216446,1.0014353794894002,5.3547449261424677E-2,1.0036681464138317,0.18548523835499481,0.70181195593038703,-120.02434956673137,59.975650433268626,null,1000000000,2344544820.25,null,22.520495367182718,-17.496472476170876,null,9.0093266338654772,-94.968398608573779,null,0,0]
[48699.25,48.699249999999999,16.15947244152186,1.5088735529370696,1.0006738922605476,3.6701881034336407E-2,1,0,656.5252065744545,1.5692731554426602,5.0568418435226485,1.3717323450668057,1.0057879674852708,0.10733301019695905,1.035969181023243,0.26428438314591401,1.0014519416001249,5.3855120375571795E-2,1.0037114916564553,0.18655742570143385,0.65254652969404092,-120.10944201518664,59.890557984813356,null,1000000000,2371616950.5625,null,22.517965903201752,-17.467983222811018,null,8.9593502498842881,-95.038176756859315,null,0,0]
[48978,48.978000000000002,16.251614556634454,1.5092250833708765,1.0006816262982487,3.6911768980747411E-2,1,0,660.28308740335842,1.5692818243013995,5.0846579205290272,1.3728358359140986,1.0058542233189811,0.10794262668243935,1.0363748797482355,0.26572709604547412,1.0014685985066665,5.4162781284174386E-2,1.0037551084183041,0.18762968609132918,0.60360574500795339,-120.19500162266539,59.804998377334613,null,1000000000,2398844484,null,22.515465763422124,-17.440182995256631,null,8.9096532349259761,-95.107728268546353,null,0,0]
[49263.25,49.263249999999999,16.345907332470755,1.5095807080182391,1.0006895863173875,3.7126547806829391E-2,1,0,664.12859599743899,1.5692905937427455,5.1131289627844998,1.3739526275144878,1.0059224110645151,0.10856637506565367,1.0367922701113497,0.26720227865505719,1.0014857419577607,5.4477605722976601E-2,1.0038000237463733,0.18872702584845566,0.55385574592861131,-120.2830324123231,59.716967587676905,null,1000000000,2426867800.5625,null,22.512936942424201,-17.412436151741069,null,8.8590832861417823,-95.178671076524111,null,0,0]
[49548.5,49.548499999999997,16.44020215184225,1.5099322532510542,1.0006975924975452,3.7341323206100299E-2,1,0,667.97410464200505,1.5692992622132242,5.1416063116236996,1.3750570495348315,1.0059909901231363,0.10919003864882018,1.0372119148854519,0.2686762707841272,1.0015029846671368,5.479241935242108E-2,1.003845224226056,0.18982444284089817,0.50443749781765113,-120.3715372157741,59.628462784225903,null,1000000000,2455053852.25,null,22.510437347251692,-17.385387389067876,null,8.8087992494657339,-95.249384772864587,null,0,0]
[49833.75,49.833750000000002,16.534498979786619,1.510279788776812,1.0007056448376141,3.7556095158828094E-2,1,0,671.8196133361896,1.5693078314467124,5.1700898628348302,1.3761493037013972,1.0060599604148219,0.10981361696417447,1.0376338113353236,0.2701490674760168,1.0015203266296682,5.510722211066689E-2,1.0038907102765309,0.19092193744394123,0.45534696457434642,-120.46050858912082,59.53949141087918,null,1000000000,2483402639.0625,null,22.507966259002444,-17.359025221716173,null,8.7587978522793684,-95.319873374145601,null,0,0]
[50119,50.119,16.628797782133862,1.5106233827257356,1.0007137433364797,3.7770863645282649E-2,1,0,675.66512207914559,1.5693163031376132,5.1985795144675944,1.3772295874359712,1.006129321859115,0.11043710954434523,1.0380579567155284,0.27162066380283978,1.0015377678401987,5.5422013935885979E-2,1.0039364823192998,0.19201951003163076,0.40658018478942948,-120.54993924234155,59.450060757658449,null,1000000000,2511914161,null,22.505522978464608,-17.333338408554557,null,8.7090758771001724,-95.390140806503027,null,0,0]
[50410.75,50.41075,16.725247381610867,1.5109707982397675,1.0007220741234188,3.7990522461234653E-2,1,0,679.59825859063517,1.5693248686970804,5.2277245671817028,1.3783223063102512,1.0062006683842986,0.11107472049332967,1.0384940906204625,0.27312454662577534,1.0015557091448104,5.5743967557539111E-2,1.0039835936546113,0.19314217409663206,0.35703300592852427,-120.64187541086683,59.358124589133169,null,1000000000,2541243715.5625,null,22.503052079417749,-17.307753415589577,null,8.6585066341102177,-95.461784638924996,null,0,0]
[50702.5,50.702500000000001,16.82169897663498,1.511314229800075,1.0007304531943881,3.8210177609398148E-2,1,0,683.5313951514122,1.5693333356816612,5.2568757927607406,1.3794029074417813,1.0062724239199674,0.1117122407676111,1.0389325712745825,0.2746271634196743,1.0015737542610867,5.6065909611438106E-2,1.0040310050638863,0.19426492052834404,0.30781635217297354,-120.73427707943458,59.265722920565423,null,1000000000,2570743506.25,null,22.500608850616757,-17.282851874939421,null,8.6082230556483257,-95.533205137026187,null,0,0]
[50994.25,50.994250000000001,16.918152533075922,1.5116537454647434,1.0007388805481749,3.8429829068669499E-2,1,0,687.46453176063073,1.5693417057832602,5.2860330890790266,1.3804715888070518,1.0063445883786306,0.11234966986842397,1.0393733957078177,0.27612850900575725,1.0015919031834168,5.6387840031473555E-2,1.0040787170056327,0.19538774972290354,0.25892621559467693,-120.82713692302123,59.172863076978771,null,1000000000,2600413533.0625,null,22.498192603798664,-17.258622511748555,null,8.5582218703177304,-95.60440622415382,null,0,0]
[51286,51.286000000000001,{"$f":"SQRT(1+(A461/pole1)^2)","v":17.014608017576663},{"$f":"ATAN(A461/pole1)","v":1.5119894117522379},{"$f":"SQRT(1+(A461/Zero1)^2)","v":1.0007473561835591},{"$f":"ATAN(A461/Zero1)","v":3.8649476817947254E-2},{"$f":"IF(VIN_nom>Vout, 1, SQRT(1+(A461/z_RHP)^2))","v":1},{"$f":"IF(VIN_nom>Vout, 0, -ATAN(A461/z_RHP))","v":0},{"$f":"SQRT(1+(A461/Pole2)^2)","v":691.39766841746427},{"$f":"ATAN(A461/Pole2)","v":1.5693499806552837},5.3151963562307465,1.381528544147816,{"$f":"SQRT(1+(A461/pole4)^2)","v":1.0064171616723234},{"$f":"ATAN(A461/pole4)","v":0.11298700729744175},{"$f":"SQRT(1+(A461/Zero3)^2)","v":1.0398165609392716},{"$f":"ATAN(A461/Zero3)","v":0.27762857823692622},{"$f":"SQRT(1+(A461/pole5)^2)","v":1.0016101559061577},{"$f":"ATAN(A461/pole5)","v":5.6709758751550467E-2},{"$f":"SQRT((1-(Z461/pterm2))^2+(A461/pterm1)^2)","v":1.0041267299408927},{"$f":"IF((ATAN((A461/pterm1)/(1-A461^2/pterm2))>0),ATAN((A461/pterm1)/(1-A461^2/pterm2)),PI()+ATAN((A461/pterm1)/(1-A461^2/pterm2)))","v":0.19651066207506138},{"$f":"20*LOG10(((E461*K461*G461*O461)/(C461*I461*S461*M461*Q461))*Adc)","v":0.21035866212372484},{"$f":"((F461+L461+H461+R461)-(D461+J461+T461+N461+T461))*radconv","v":-120.92044776868157},{"$f":"IF(V461>0,V461,V461+180)","v":59.079552231318431},null,{"$f":"IF(U461<0,A461,1000000000)","v":1000000000},{"$f":"A461^2","v":2630253796},null,{"$f":"20*LOG10((K461/(I461*M461))*AEA)","v":22.495802669579632},{"$f":"(L461-(J461+N461))*radconv","v":-17.235054291613427},null,{"$f":"20*LOG10((E461*G461/(C461*S461))*Acs*Am)","v":8.5084998618407681},{"$f":"(F461+H461-(D461+T461))*radconv","v":-95.675391735361785},null,{"$f":"SUM((U462<0)*(U461>0))*A461","v":0},0]
[51584.75,{"$f":"A462/1000","v":51.58475},17.11337973643635,1.5123292106170776,1.0007560852079451,3.8874390740859154E-2,1,0,695.42517344018358,1.5693583570710234,5.3450654272270004,1.3825989057984185,1.0064918998017438,0.11363954093819596,1.0402727816899286,0.27916331084530227,1.0016289541292265,5.7039389120667396E-2,1.0041762072545324,0.19766060321113099,0.1609560722189638,-121.01645746145687,58.983542538543134,null,1000000000,2660986432.5625,null,22.493381980455407,-17.211594443329304,null,8.4578708677315149,-95.747860931531932,null,0,0]
[51883.5,51.883499999999998,17.212153408584552,1.5126651095804602,1.0007648648559666,3.9099300728836495E-2,1,0,699.4526785111351,1.5693666370226056,5.3749405538619808,1.3836573700296233,1.0065670664318196,0.11429197739922353,1.0407314505518572,0.28069669429485183,1.0016478611813795,5.7369007081427337E-2,1.004226001165117,0.19881063237638108,0.11188361092021358,-121.11292530708253,58.887074692917466,null,1000000000,2691897572.25,null,22.490987519142283,-17.188805171987219,null,8.4075279538391694,-95.820111948963486,null,0,0]
[52182.25,52.182250000000003,17.310929000585709,1.5129971753240601,1.0007736951262916,3.9324206759229201E-2,1,0,703.48018362949028,1.5693748221668344,5.404821635718144,1.3847041317779762,1.006642661466562,0.11494431614690678,1.0411925642897117,0.28222872316258052,1.0016668770564541,5.7698612562910305E-2,1.0042761121759252,0.19996074999009494,6.3137283038606037E-2,-121.20984407485723,58.79015592514277,null,1000000000,2722987215.0625,null,22.488618624519539,-17.166675372899697,null,8.3574678385167189,-95.892148633555848,null,0,0]
[52481,52.481000000000002,17.409706479762431,1.5133254730196506,1.0007825760175795,3.9549108809389624E-2,1,0,707.50768879443967,1.5693829141227886,5.4347085745666073,1.3857393817958537,1.0067186848094631,0.11559655664812045,1.0416561196566458,0.28375939206050566,1.001686001748253,5.8028205494212538E-2,1.0043265407930131,0.20111095646999777,1.4713166779673496E-2,-121.30720668499077,58.692793315009226,null,1000000000,2754255361,null,22.486274653648614,-17.145194178981157,null,8.307687295474885,-95.963974744608137,null,52481,58.692793315009226]
[52786.5,52.786499999999997,17.51071766969585,1.5136573579738846,1.0007917099130745,3.9779088188727815E-2,1,0,711.62619203139741,1.5693910941877907,5.4652767400343238,1.3867863120679345,1.0067968686668587,0.11626343180780388,1.0421326702666096,0.28532323312410357,1.0017056710719945,5.8365232242507288E-2,1.0043784377830451,0.20228724321299077,-3.4475848113550589E-2,-121.40722089521448,58.592779104785521,null,52786.5,2786414582.25,null,22.483902846105195,-17.123887308234828,null,8.2570678175666341,-96.037209769912877,null,0,0]
[53092,53.091999999999999,17.611730766268419,1.5139854358733553,1.0008008967399908,4.0009063358049352E-2,1,0,715.74469531542445,1.5693991801141296,5.4958508291493349,1.3878215950624209,1.0068755001998024,0.1169302031052879,1.0426117671815904,0.28688564078544615,1.0017254541720315,5.8702245717182459E-2,1.0044306679727777,0.20346362376172425,-8.3335994287758758E-2,-121.5076847235883,58.492315276411702,null,53092,2818760464,null,22.481555797141194,-17.103236432724461,null,8.2067340362633576,-96.110232282936295,null,0,0]
[53397.5,53.397500000000001,17.712745736860313,1.5143097717811989,1.0008101364968705,4.0239034293144377E-2,1,0,719.86319864571306,1.5694071735175714,5.5264307435967659,1.3888454218883393,1.0069545793034191,0.11759686997210196,1.0430934068930042,0.28844660939686723,1.001745351041623,5.9039245842472041E-2,1.0044832319123449,0.20464009855777102,-0.13187123901764503,-121.60859106454893,58.391408935451068,null,53397.5,2851293006.25,null,22.47923287445737,-17.083230662715017,null,8.1566826732587909,-96.183046038208843,null,0,0]
[53703,53.703000000000003,17.813762549591015,1.514630429287922,1.0008194291822474,4.0469000969805748E-2,1,0,723.98170202147367,1.5694150759771155,5.5570163872072946,1.3898579795445596,1.0070341058722703,0.11826343184032484,1.0435775858801402,0.29000613334915043,1.0017653616739903,5.937623254262818E-2,1.0045361301549089,0.2058166680409618,-0.18008547702625705,-121.70993296137632,58.290067038623675,null,53703,2884012209,null,22.47693346316586,-17.063859341890975,null,8.1069105055367157,-96.255654705785631,null,0,0]
[54015.75,54.015749999999997,17.917178527359969,1.5149549510181253,1.0008289972237796,4.0704420684297388E-2,1,0,728.1979440670159,1.5694230733787731,5.5883337132015729,1.390883084343836,1.0071159831420045,0.11894570292168394,1.0440758818971403,0.29160116497262134,1.0017859650277812,5.9721202486285416E-2,1.0045906306349126,0.20702125792766268,-0.22911538340871965,-121.8141239344662,58.185876065533805,null,54015.75,2917701248.0625,null,22.474603213851381,-17.044674634119659,null,8.0562430694825764,-96.329777791868793,null,0,0]
[54328.5,54.328499999999998,18.020596370407514,1.5152757480063537,1.0008386207326365,4.0939835884505393E-2,1,0,732.41418615859618,1.5694309787041656,{"$f":"SQRT(1+(A471/Zero2)^2)","v":5.6196568461839096},{"$f":"ATAN(A471/Zero2)","v":1.3918967626345196},1.0071983291416653,0.11962786275900923,1.0445768316364326,0.29319467078211442,1.0018066875934597,6.0066158199452033E-2,1.0046454826561921,0.20822594797620006,-0.27781690145127208,-121.9187570885809,58.081242911419096,null,54328.5,2951585912.25,null,22.472296354447323,-17.026132967671014,null,8.0058615739062766,-96.403693463456719,null,0,0]
[54641.25,54.641249999999999,18.124016046803124,1.5155928839486332,1.0008482997072179,4.1175246544466804E-2,1,0,736.63042829542428,1.5694387935343395,5.6509856895907662,1.3928992023602489,1.0072811437562963,0.12030991074478647,1.0450804312819044,0.29478664488496986,1.0018275293636278,6.0411099600918013E-2,1.0047006868220754,0.20943073865273065,-0.32619398509177244,-122.02382542019433,57.976174579805672,null,54641.25,2985666201.5625,null,22.470012278313895,-17.008223629947015,null,7.9557627329430165,-96.477405398259208,null,0,0]
[54954,54.954000000000001,18.227437525340399,1.5159064210983428,1.0008580341459148,4.1410652638221655E-2,1,0,740.84667047672735,1.5694465194143492,5.6823201489707627,1.3938905874105805,1.0073644268703237,0.1209918462721169,1.0455866770046287,0.29637708143090569,1.0018484903308467,6.0756026609493724E-2,1.0047562437392024,0.21063563042145531,-0.37425051621289007,-122.12932207315173,57.870677926848273,null,54954,3019942116,null,22.467750395555409,-16.990936138604543,null,7.9059433161931549,-96.550917191216286,null,0,0]
[55274,55.274000000000001,18.333258297690421,1.5162235650599152,1.0008680516490012,4.1651511034422557E-2,1,0,745.16065133098073,1.569454333899309,5.7143867031067694,1.3948936998319528,1.007450125402928,0.12168947302561628,1.0461073930307883,0.29800278911796541,1.0018700605697954,6.1108934546048328E-2,1.0048134542946718,0.21186855845096769,-0.4230932579227582,-122.23770062149315,57.762299378506853,null,55274,3055215076,null,22.465458451820247,-16.97388083612147,null,7.8552549158138705,-96.625929604769979,null,0,{"$f":"IF(AH474>0,W474,0)","v":0}]
[55594,55.594000000000001,18.439080892840018,1.5165370688499082,1.0008781272140483,4.1892364595285253E-2,1,0,749.4746322302143,1.5694620584238159,5.7464589430798654,1.395885616063999,1.0075363141609217,0.12238698076286755,1.046630871085525,0.29962687488092155,1.0018917555802789,6.1461827242782409E-2,1.0048710354410344,0.21310159329081949,-0.47160841183358604,-122.3465135140641,57.6534864859359,null,55594,3090692836,null,22.463188544243589,-16.957455054551133,null,7.8048523750190153,-96.700739848681408,null,0,0]
[55914,55.914000000000001,18.544905279584917,1.5168469947228342,1.000888260839303,4.2133213293012131E-2,1,0,753.7886131736559,1.5694696945324176,5.7785367742168452,1.3968665205953619,1.0076229930185077,0.12308436883580016,1.0471571070265913,0.30124933259108505,1.0019135753541919,6.181470461279507E-2,1.0049289878388539,0.21433473543181866,-0.51979991333112574,-122.4557538615433,57.5442461384567,null,55914,3126375396,null,22.460940091883245,-16.941648274837299,null,7.7547324058189204,-96.775351519585229,null,0,0]
[56234,56.234000000000002,18.650731427428546,1.5171534035230383,1.0008984525230016,4.2374057099808994E-2,1,0,758.10259416055089,1.5694772437345041,5.8106201039187777,1.397836593925901,1.0077101618492172,0.12378163659703148,1.0476860966982604,0.30287015616633284,1.0019355198833833,6.216756656920825E-2,1.0049873121523114,0.21556798536258157,-0.56767162637766866,-122.5654149201257,57.434585079874296,null,56234,3162262756,null,22.458712529861053,-16.926450204489186,null,7.7048917757405064,-96.84976813319382,null,0,0]
[56561.5,56.561500000000002,18.759039668006327,1.5174634141476597,1.0009089431879432,4.2620540590107295E-2,1,0,762.51768412104934,1.5694848814245497,5.8434609855339517,1.3988183726703325,1.0077998809000359,0.12449512132213132,1.0482303315125576,0.30452726946240893,1.0019581079043944,6.2528682677372591E-2,1.0050473892316925,0.21683025170501752,-0.61633817286682924,-122.67807488853828,57.321925111461724,null,56561.5,3199203282.25,null,22.456453816701909,-16.911515696900651,null,7.6541689260664239,-96.925730504004889,null,0,0]
[56889,56.889000000000003,18.86734969075253,1.517769865503686,1.000919494660941,4.2867018898630496E-2,1,0,766.93277412551663,1.5694924311770602,5.8763074366406025,1.3997891767596569,1.0078901128904294,0.12520847865998991,1.0487774418009883,0.3061826583848849,1.0019808265796952,6.2889782456902563E-2,1.0051078572838106,0.2180926319775624,-0.66467773283933096,-122.79116167798543,57.208838322014572,null,56889,3236358321,null,22.454215836684167,-16.897197653531169,null,7.6037319848714606,-97.001495768355326,null,0,0]
[57216.5,57.216500000000003,18.975661465150164,1.5180728184812424,1.0009301069400722,4.3113491995595075E-2,1,0,771.34786417319788,1.5694998945020624,5.9091593643635765,1.4007491873890998,1.0079808576826466,0.12592170791889068,1.0493274230658105,0.30783631656553456,1.0020036759003981,6.3250865814742249E-2,1.0051687170323964,0.21935512669679,-0.71269422732715015,-122.90466850861169,57.095331491388308,null,57216.5,3273727872.25,null,22.451998033178381,-16.883485739544749,null,7.5535776596503545,-97.077067446296283,null,0,0]
[57544,57.543999999999997,19.083974961374551,1.5183723325906984,1.0009407800234023,4.3359959851221298E-2,1,0,775.76295426335491,1.5695072728752066,5.9420166778663379,1.4016985818266825,1.0080721151382028,0.12663480840788666,1.0498802707951287,0.30948823768730382,1.0020266558575657,6.3611932657861359E-2,1.0052299692051341,0.22061773637681611,-0.76039150647789167,-123.01858874431048,56.981411255689522,null,57544,3311311936,null,22.449799864978971,-16.870369843192087,null,7.5037027135177947,-97.152448978683694,null,0,0]
[57879,57.878999999999998,19.194770670382276,1.5186752085374602,1.0009517604352973,4.3612066555084303E-2,1,0,780.27915333006888,1.5695147338297648,5.9756319285111887,1.4026589152642008,1.0081659927223581,0.12736410549585819,1.0504487401235838,0.31117618534749947,1.0020502972221574,6.3981251024002539E-2,1.005293030869417,0.2219093802556982,-0.80885476661743005,-123.13553878336661,56.864461216633387,null,57879,3349978641,null,22.447571123427398,-16.857559916641645,null,7.4529713249014327,-97.229363585012621,null,0,0]
[58214,58.213999999999999,19.305568119989147,1.5189746080136355,1.0009628044640762,4.3864167711778881E-2,1,0,784.79535243971782,1.5695221089144051,6.0092526284659575,1.4036085037796673,1.0082604064240177,0.12809326638854732,1.0510201991137051,0.31286230227107925,1.0020740752559973,6.4350551913535975E-2,1.0053565046901518,0.22320114550130304,-0.8569919531340211,-123.25290777738421,56.747092222615791,null,58214,3388869796,null,22.445361828538978,-16.845352905377887,null,7.4025255794871718,-97.306086275879437,null,0,0]
[58549,58.548999999999999,19.416367280397523,1.5192705904803385,1.0009739121076331,4.4116263289444617E-2,1,0,789.31155159156481,1.5695293996030912,6.0428786867758442,1.4045475250189177,1.00835535609259,0.12882229034896575,1.0515946428915544,0.31454658186323958,1.0020979899493567,6.471983522697651E-2,1.0054203914589814,0.22449303265581169,-0.90480696780558656,-123.37068906675803,56.629310933241968,null,58549,3427985401,null,22.443171447933452,-16.833738673269774,null,7.3523621854950028,-97.382620491045202,null,0,0]
[58884,58.884,19.527168122485612,1.5195632140515363,1.0009850833638505,4.4368353256225304E-2,1,0,793.82775078488964,1.569536607336244,6.0765100144850024,1.4054761527704465,1.0084508415766842,0.12955117664098431,1.0521720665684084,0.3162290175852383,1.0021220412924514,6.5089100864867605E-2,1.0054846919718567,0.22578504225865478,-0.95230364219081143,-123.48887613351661,56.511123866483388,null,58884,3467325456,null,22.440999464006083,-16.822707303322954,null,7.3024779067487007,-97.458969592927261,null,0,0]
[59227,59.226999999999997,19.640616667507516,1.5198594047926435,1.0009965873035729,4.4626457435177701E-2,1,0,798.45179955342974,1.5695439027137097,6.1109498471761405,1.4064163655047095,1.0085491623138998,0.13029732576587941,1.0527663618378438,0.31794971366185115,1.002146808569319,6.5467166369067645E-2,1.0055509575378496,0.22710803325207207,-1.0006086607766269,-123.61029934423098,56.389700655769019,null,59227,3507837529,null,22.438794147164884,-16.812006271875617,null,7.2516882320250486,-97.536953592540641,null,0,0]
[59570,59.57,19.754066915788986,1.5201521934331117,1.0010081579259174,4.4884555664487243E-2,1,0,803.07584836397609,1.5695511140787342,6.1453950213957533,1.4073460391964476,1.0086480444396304,0.13104332900959056,1.05336377061009,0.31966846305817509,1.002171719079471,6.5845213132508851E-2,1.0056176585473411,0.22843115374754147,-1.0485878644674831,-123.73213455415792,56.267865445842077,null,59570,3548584900,null,22.436607063331856,-16.801895911151259,null,7.2011844696797302,-97.614750426956149,null,0,0]
[59913,59.912999999999997,19.867518838151462,1.5204416382046013,1.001019795228572,4.5142647909974576E-2,1,0,807.69989721580714,1.5695582428742196,6.1798454478261338,1.4082653484792234,1.0087474877887863,0.13178918558480759,1.0539642875907533,0.32138525893841413,1.002196772812227,6.6223241048532333E-2,1.0056847958686916,0.2297544043150079,-1.0962451482419668,-123.85437520490268,56.145624795097319,null,59913,3589567569,null,22.434437701969799,-16.792366252946479,null,7.1509633192531226,-97.692363467215969,null,0,0]
[60256,60.256,19.980972406078649,1.5207277960184666,1.0010314992092111,4.5400734137465114E-2,1,0,812.32394610821814,1.5695652905102149,6.2143010391167177,1.4091744641844943,1.008847492195406,0.13253489470518254,1.0545679074699854,0.32310009452836447,1.0022219697568457,6.6601250010511384E-2,1.0057523703749762,0.23107778552132671,-1.1435843372355892,-123.97701487808368,56.022985121916321,null,60256,3630785536,null,22.432285566747506,-16.783407545075121,null,7.1010215360825404,-97.769796008536957,null,0,0]
[60607,60.606999999999999,20.097073795869907,1.5210172832494311,1.0010435451954283,4.5664833602978495E-2,1,0,817.05584457876978,1.5695724199392109,6.2495655171930586,1.4100944051249591,1.0089504097311597,0.13329784298499661,1.0551888126899409,0.32485288987566502,1.0022479026351783,6.6988055774521341E-2,1.0058219744778141,0.23243216859459695,-1.191702256574634,-124.10292148947676,55.897078510523244,null,60607,3673208449,null,22.430100566031292,-16.774821014387314,null,7.0502008190622956,-97.848851054381242,null,0,0]
[60958,60.957999999999998,20.2131768505058,1.52130344491589,1.0010556610012757,4.5928926694104553E-2,1,0,821.7877430903734,1.5695794672649277,6.2848352248668604,1.4110040216414974,1.0090539144469342,0.1340606351883811,1.0558129559387934,0.32660361826841455,1.0022739854607654,6.7374841464204929E-2,1.0058920382618546,0.2337866896628025,-1.2394949579089707,-124.22923278773889,55.770767212261106,null,60958,3715877764,null,22.427932596317881,-16.766812382924961,null,6.9996659517573594,-97.92772383116754,null,0,0]
[61309,61.308999999999997,20.329281541461924,1.5215863379495105,1.0010678466242182,4.6193013374236973E-2,1,0,826.51964164232345,1.5695864338975101,6.3201100745859904,1.4119034850893069,1.0091580061620562,0.13482327047583303,1.056440331477476,0.3283522726474743,1.0023002182219003,6.7761606965405133E-2,1.0059625626779995,0.23514134932323549,-1.2869663241824463,-124.35594232666273,55.644057673337272,null,61309,3758793481,null,22.425781168949868,-16.759371865453819,null,6.9494136305421765,-98.006417637159799,null,0,0]
[61660,61.66,20.445387840861407,1.5218660179908545,1.0010801020617066,4.6457093606774788E-2,1,0,831.25154023393122,1.5695933212149944,6.3553899807294849,1.4127929630852418,1.0092626846949027,0.13558574800892492,1.0570709335508606,0.33009884602115536,1.0023266009068112,6.8148352164001016E-2,1.0060335486822978,0.23649614816972528,-1.3341201690063347,-124.4830437980803,55.516956201919697,null,61660,3801955600,null,22.423645808895685,-16.752489889152859,null,6.8994406076554196,-98.084935696448383,null,0,0]
[62019,62.018999999999998,20.564142073137059,1.5221488055128012,1.0010927090422341,4.6727186054147878E-2,1,0,836.09128840641017,1.5696002848646842,6.3914791306304464,1.413692555550776,1.0093703559052427,0.13636543988591715,1.0577192399874986,0.3318830674267827,1.0023537399824545,6.85438909470832E-2,1.0061066310919458,0.23788197021841212,-1.3820241900422641,-124.61344116866312,55.386558831336885,null,62019,3846356361,null,22.421477919146628,-16.746019079198106,null,6.8486141901012587,-98.165064825279543,null,0,0]
[62378,62.378,20.682897931017834,1.5224283456710652,1.0011053890505621,4.6997271679237375E-2,1,0,840.93103661896669,1.569607168359618,6.4275733948561156,1.4145820453432298,1.0094786406003129,0.13714496496482909,1.0583709094848424,0.33366509730642968,1.0023810358687653,6.8939408250170281E-2,1.0061801984100882,0.23926793911552674,-1.4296039057866516,-124.74423561937827,55.255764380621727,null,62378,3891014884,null,22.41932587400666,-16.740112960418053,null,6.7980732486227442,-98.24501669856015,null,0,0]
[62737,62.737000000000002,20.801655386662173,1.522704694039555,1.0011181420839161,4.7267350442899786E-2,1,0,845.77078487091251,1.5696139730758023,6.4636726877286792,1.415461600311958,1.0095875385827127,0.13792432235211291,1.0590259358345331,0.33544492839809176,1.0024084885529341,6.9334903951277407E-2,1.006254251676314,0.2406540554850703,-1.4768631824103573,-124.87542082569668,55.124579174303321,null,62737,3935931169,null,22.417189206592987,-16.734761943395906,null,6.747814481584621,-98.324794538435953,null,0,0]
[63096,63.095999999999997,20.920414412860346,1.5229779049322474,1.0011309681395053,4.753742230599764E-2,1,0,850.6105331615754,1.569620700357927,6.4997769254619078,1.4163313846391801,1.0096970496540087,0.13870351115542001,1.0596843128116227,0.33722255351339619,1.0024360980220783,6.9730377928460083E-2,1.006328791935817,0.24204031994717151,-1.5238058173829012,-125.00699059883971,54.993009401160293,null,63096,3981105216,null,22.415067463063309,-16.72995664710065,null,6.6978346431651348,-98.404401494641832,null,0,0]
[63463.25,63.463250000000002,21.041904178405431,1.5232542032400453,1.0011441645000048,4.781369337486642E-2,1,0,855.5615013339492,1.5696275034828002,6.5367158878687111,1.4172112144684079,1.0098097115210711,0.13950043073924506,1.0603612801248878,0.33903873932674139,1.0024645041880305,7.0134917490321275E-2,1.0064055501724036,0.24345859534069972,-1.5715034667028434,-125.14197552180454,54.85802447819546,null,63463.25,4027584100.5625,null,22.412911943085277,-16.72559603029843,null,6.6469915330661289,-98.485664249646788,null,0,0]
[63830.5,63.830500000000001,21.163395531862541,1.5235273293123868,1.0011574372715186,4.8089957139533769E-2,1,0,860.51246954546502,1.5696342283239622,6.5736598534809287,1.4180811556782242,1.0099230145555962,0.14029717201651518,1.0610417406027539,0.34085260162753467,1.0024930744002483,7.0539434060302608E-2,1.0064828202727796,0.2448770270118088,-1.6188775803745021,-125.27735020761386,54.722649792386136,null,63830.5,4074332730.25,null,22.41077111994651,-16.72178728811501,null,6.5964336207051986,-98.566754621494013,null,0,0]
[64197.75,64.197749999999999,21.284888446040895,1.5237973374289799,1.0011707864510087,4.8366213558121214E-2,1,0,865.46343779545077,1.569640876224901,6.6106087384160057,1.4189413727530491,1.0100369585418105,0.14109373403586972,1.0617256875289081,0.34266413295914161,1.002521808644707,7.0943927507990404E-2,1.0065606033740249,0.24629561561165353,-1.665932011326906,-125.41310844895865,54.586891551041347,null,64197.75,4121351105.0625,null,22.408644547413395,-16.718521018754579,null,6.5461576045551118,-98.647675759889552,null,0,0]
[64565,64.564999999999998,21.406382894366651,1.5240642806390918,1.0011842120354182,4.8642462588756992E-2,1,0,870.41440608325047,1.5696474484985381,6.6475624606453074,1.4197920265781334,1.0101515432628185,0.14189011584728595,1.0624131141699655,0.34447332594527502,1.0025507069073023,7.1348397703016195E-2,1.0066389006193255,0.24771436178705528,-1.7126705443433576,-125.54924417207353,54.450755827926471,null,64565,4168639225,null,22.406531791740576,-16.71578802496381,null,6.4961602388915383,-98.728430743791748,null,0,0]
[64941,64.941000000000003,21.530773599123339,1.5243344627954079,1.0011980366482014,4.892528575690288E-2,1,0,875.48333485208343,1.5696541003496429,6.6854015601300247,1.4206532044380233,1.0102695216366033,0.14270528434802782,1.0631205172675051,0.34632319408151191,1.0025804636038091,7.1762480470056775E-2,1.0067195972187446,0.24916707455098919,-1.7601992621910791,-125.68900830201946,54.31099169798054,null,64941,4217333481,null,22.404382572441129,-16.713533005858203,null,6.4452570055057965,-98.810940777477597,null,0,0]
[65317,65.316999999999993,21.655165857535611,1.5246015409940128,1.0012119413435436,4.9208101092050906E-2,1,0,880.55226365920817,1.5696606756175377,6.7232455618798612,1.4215046880771098,1.0103881711771319,0.1435202619402948,1.0638315535308369,0.34817059572880593,1.0026103921970906,7.217653858679296E-2,1.0068008351985418,0.25061995384679386,-1.8074046671097519,-125.82915564438511,54.170844355614889,null,65317,4266310489,null,22.402246954437768,-16.71181809854632,null,6.3946391472189159,-98.893282957857707,null,0,0]
[65693,65.692999999999998,21.779559642982715,1.5248655683811652,1.001225926118108,4.9490908549286693E-2,1,0,885.62119250396688,1.5696671756172134,6.7610943835761939,1.4223466390558872,1.010507491647987,0.14433504760892787,1.0645462156799219,0.35001552323214347,1.0026404926717536,7.2590571913462895E-2,1.0068826158054165,0.2520730003543632,-1.8542906095797826,-125.96968009316269,54.030319906837306,null,65693,4315570249,null,22.400124510288862,-16.710634063472774,null,6.3443033544525118,-98.975460371516803,null,0,0]
[66069,66.069000000000003,21.903954929448304,1.5251265968975511,1.0012399909685392,4.9773708083703364E-2,1,0,890.69012138571725,1.5696736016337265,6.7989479447230554,1.4231792153916081,1.0106274828115271,0.14514964034026556,1.0652644964171829,0.35185796902437161,1.0026707650123179,7.3004580310355449E-2,1.0069649402927403,0.253526214748726,-1.9008608722469176,-126.11057567409291,53.889424325907086,null,66069,4365112761,null,22.3980148245499,-16.709971862465711,null,6.294246373601629,-99.057476035686321,null,0,0]
[66453.75,66.453749999999999,22.031246580329043,1.5253906484723696,1.0012544660152256,5.0063080475941782E-2,1,0,895.87701075115694,1.5696801019161923,6.8376872306208361,1.4240216236481786,1.0107509603595364,0.14598298890410202,1.0660032307149394,0.3537407140682175,1.0027019197244007,7.3428197258721462E-2,1.0070497449034048,0.25501342178893965,-1.9481919763324138,-126.25512816494087,53.744871835059129,null,66453.75,4416100889.0625,null,22.395868829728592,-16.709825219059134,null,6.243309785998731,-99.141235946476414,null,0,0]
[66838.5,66.838499999999996,22.158539749651084,1.5256516662947388,1.0012690249009095,5.0352444477209851E-2,1,0,901.06390015401485,1.5696865273621317,6.8764313142197802,1.4248545396779806,1.0108751396718256,0.14681613330371632,1.0667457384637682,0.35562084480172707,1.0027332543614653,7.385178780769476E-2,1.007135121679309,0.25650080603510761,-1.9952003403062664,-126.400057013192,53.599942986808003,null,66838.5,4467385082.25,null,22.393735350685027,-16.710206454619801,null,6.192658419146877,-99.22483266997537,null,0,0]
[67223.25,67.223249999999993,22.285834411395136,1.5259097023143393,1.0012836676219339,5.0641800039416866E-2,1,0,906.25078959364862,1.5696928792565159,6.9151801148788099,1.425678121882908,1.0110000204898058,0.14764907245793349,1.067492011789652,0.35749835340194258,1.002764768906645,7.4275351807748496E-2,1.0072210719850136,0.25798836819450049,-2.0418898071030509,-126.54535622363031,53.454643776369693,null,67223.25,4518965340.5625,null,22.391613978772792,-16.711106505064386,null,6.1422889608735272,-99.308269225959677,null,0,0]
[67608,67.608000000000004,22.413130540132705,1.5261648073022611,1.001298394174621,5.0931147114480602E-2,1,0,911.43767906943026,1.5696991588550648,6.9539335537445295,1.4264925251851304,1.0111256025535551,0.14848180528725041,1.0682420428007011,0.35937323214165584,1.0027964633429782,7.4698889109412636E-2,1.0073075971923526,0.25947610896894002,-2.0882641522627097,-126.69101993067682,53.308980069323184,null,67608,4570841664,null,22.389504316843912,-16.712516504102865,null,6.0921981550249651,-99.391548566364776,null,0,0]
[68001.75,68.001750000000001,22.543405849030073,1.5264228967558688,1.0013135520002727,5.1227253704755907E-2,1,0,916.74589932996935,1.5697055117729328,6.9935982275660757,1.4273166334747531,1.011254847979568,0.14933380250163106,1.0690135007055608,0.36128923687567199,1.0028290854041766,7.5132305917997161E-2,1.0073967430510982,0.26099883635483123,-2.1354008831916804,-126.84046237365176,53.159537626348239,null,68001.75,4624238003.0625,null,22.387357027431968,-16.714478417170326,null,6.0412208002418151,-99.476616197542313,null,0,0]
[68395.5,68.395499999999998,22.673682642291794,1.5266780204031625,1.0013287976175458,5.1523351304317969E-2,1,0,922.05411962708195,1.5697117915439283,7.0332675975462697,1.4281314459631298,1.0113848272867947,0.15018558134334278,1.069788877369789,0.36320247120700527,1.0028618958346727,7.5565694447968637E-2,1.0074864939524519,0.26252175227943209,-2.1822153692988628,-126.99027453610147,53.009725463898533,null,68395.5,4677944420.25,null,22.38522119589075,-16.716956237577595,null,5.9905285607141456,-99.561525218137277,null,0,0]
[68789.25,68.789249999999996,22.803960894477775,1.5269302290412941,1.0013441310224305,5.1819439861658635E-2,1,0,927.36233996014005,1.5697179994241288,7.0729415846683468,1.4289371179868879,1.0115155401923253,0.15103714066082982,1.0705681642787075,0.36511292716378718,1.0028948946159786,7.5999054539307609E-2,1.0075768513903742,0.26404485747705958,-2.2287114485839727,-127.14045053061002,52.859549469389975,null,68789.25,4731960915.5625,null,22.383096431523015,-16.719941071180155,null,5.9401181205140219,-99.646278583636558,null,0,0]
[69183,69.183000000000007,22.934240580725703,1.527179572314691,1.0013595522108936,5.2115519325279247E-2,1,0,932.67056032852963,1.569724136641016,7.1126201116694592,1.4297338014644783,1.0116469864117992,0.15188847930440344,1.071351352899534,0.36702059687840971,1.0029280817295025,7.6432386032058361E-2,1.0076678168667541,0.26556815267592493,-2.274892892040294,-127.29098459732705,52.709015402672946,null,69183,4786287489,null,22.380982354655721,-16.723424218149166,null,5.8899862198012967,-99.730879183130426,null,0,0]
[69586,69.585999999999999,23.06758226526842,1.5274318566849501,1.0013754265717905,5.2418544836048034E-2,1,0,938.1034817828039,1.5697303461128023,7.1532353914117364,1.4305400479704504,1.0117822796328027,0.1527595879406381,1.0721569715909911,0.36897018839664186,1.0029622434779479,7.6875867594644307E-2,1.007761550517952,0.26712743072480227,-2.3218372899438258,-127.44541992789337,52.554580072106631,null,69586,4842211396,null,22.378829295770561,-16.72749632099444,null,5.8389617043460253,-99.817311981318369,null,0,0]
[69989,69.989000000000004,23.200925401126639,1.5276812411530625,1.0013913928805249,5.2721560711687591E-2,1,0,943.53640327283244,1.5697364840758001,7.1938552684899566,1.4313371900987479,1.0119183404191709,0.15363046298205624,1.072966659322911,0.37091684488268456,1.0029966024714321,7.7319318860330319E-2,1.0078559243202365,0.26868690933066364,-2.3684598807185835,-127.60021853764731,52.399781462352692,null,69989,4898460121,null,22.376686661459896,-16.732072585107272,null,5.7882222337728955,-99.903590670473108,null,0,0]
[70392,70.391999999999996,23.334269963419846,1.5279277754025387,1.0014074511326994,5.3024566897015131E-2,1,0,948.96932479800148,1.5697425517581887,7.2344796654652885,1.4321253802014662,1.0120551684613295,0.15450110320215507,1.073780406890473,0.37286055823918418,1.0030311586896845,7.7762739657830357E-2,1.007950939909569,0.27024658925417622,-2.4147644997835278,-127.75537464434994,52.244625355650058,null,70392,4955033664,null,22.374554078203843,-16.737144281451624,null,5.7377644874448963,-99.989718143994878,null,0,0]
[70795,70.795000000000002,23.46761592783275,1.5281715079890614,1.0014236013238904,5.3327563336858501E-2,1,0,954.40224635771074,1.5697485503601818,7.2751085066200574,1.4329047672724371,1.012192763448126,0.155371507376517,1.0745982050706537,0.37480132048220599,1.003065912112322,7.8206129815929865E-2,1.0080465989305545,0.27180647124916418,-2.460754915893907,-127.91088259128544,52.089117408714557,null,70795,5011932025,null,22.372431183054864,-16.742702871922969,null,5.6875852009005143,-100.07569723027142,null,0,0]
[71207.25,71.207250000000002,23.604023988632246,1.528417985549223,1.0014402173320467,5.3637504268533247E-2,1,0,959.95986900571654,1.56975461639309,7.3166744167887359,1.4336930869852391,1.0123343098584647,0.15626164430127157,1.0754389555573773,0.37678356705581922,1.0031016672497473,7.8659665162616507E-2,1.0081451210768053,0.27340236684782343,-2.5074797009170524,-128.07031816620517,51.929681833794831,null,71207.25,5070472452.5625,null,22.370269217923621,-16.748884126540737,null,5.6365389308586655,-100.16349912937704,null,0,0]
[71619.5,71.619500000000002,23.740433466925509,1.5286616306673049,1.0014569295387388,5.3947434885457571E-2,1,0,965.5174916886391,1.569760612592521,7.3582448225180004,1.4344724999530767,1.0124766581609157,0.15715153163485654,1.076283925156365,0.37876270894938269,1.0031376287047449,7.911316808502665E-2,1.0082443200399431,0.27499847547433026,-2.5538834650503315,-128.23011033131894,51.76988966868106,null,71619.5,5129352780.25,null,22.368116654806784,-16.755557398370588,null,5.5857773142746048,-100.25115153809388,null,0,0]
[72031.75,72.031750000000002,23.876844338417932,1.5289024918602294,1.0014737379391503,5.4257355128607333E-2,1,0,971.07511440587894,1.5697665401574796,7.3998196480429215,1.4352431553447249,1.0126198080173023,0.15804116807342605,1.0771331039384215,0.38073873798308683,1.0031737964551271,7.9566638400118114E-2,1.0083441976084189,0.27659479791315295,-2.5999700363450411,-128.39025341745636,51.609746582543636,null,72031.75,5188573008.0625,null,22.365973137295299,-16.762714134664325,null,5.5352970310319645,-100.33865728456534,null,0,0]
[72444,72.444000000000003,24.013256579366679,1.5291406165437866,1.0014906425284382,5.4567264938970371E-2,1,0,976.63273715685011,1.5697724002596785,7.4413988192837834,1.4360051990371516,1.0127637590877363,0.15893055231545805,1.0779864819562546,0.38271164610007002,1.0032101704785819,8.0020075924928685E-2,1.0084447555800833,0.2781913349411072,-2.6457431766505604,-128.55074187865051,51.449258121349487,null,72444,5248133136,null,22.363838319096786,-16.770345969849807,null,5.4850948171571172,-100.42601913340553,null,0,0]
[72865.75,72.865750000000006,24.152813733686273,1.5293814451315475,1.0015080362058737,5.4884305536742894E-2,1,0,982.31843129721665,1.5697783267850627,7.4839405736973301,1.4367760405681826,1.0129118561710484,0.15984016943165102,1.0788638605587966,0.38472678054571186,1.0032475961493903,8.0483928463016247E-2,1.0085483368242685,0.27982488586387233,-2.6922506321607487,-128.71528042677699,51.284719573223015,null,72865.75,5309417523.0625,null,22.361662957050456,-16.778636790080217,null,5.4340201389476963,-100.51524808047975,null,0,0]
[73287.5,73.287499999999994,24.292372272735403,1.5296195066351068,1.0015255305461273,5.5201335090445142E-2,1,0,988.00412547168889,1.5697841850993737,7.5264867247713338,1.4375381676343499,1.0130607910955307,0.16074951984571198,1.079745613045713,0.38673863191208341,1.0032852376619945,8.0947746295015527E-2,1.0086526340284958,0.28145866299992611,-2.7384378044896138,-128.88016908902628,51.119830910973718,null,73287.5,5371057656.25,null,22.359495997643965,-16.787407723255413,null,5.3832297570892287,-100.60433207915283,null,0,0]
[73709.25,73.709249999999997,24.431932172784762,1.5298548484456003,1.0015431255439238,5.551835353692966E-2,1,0,993.68981967968102,1.5697899763734819,7.5690371983638753,1.4382917263117587,1.0132105634917123,0.1616586021716673,1.0806317287102574,0.3887471919696322,1.0033230949921015,8.141152922528451E-2,1.0087576491482255,0.28309266715590814,-2.7843085167083013,-129.04540230610311,50.954597693896886,null,73709.25,5433053535.5625,null,22.357337100822299,-16.796650387506567,null,5.3327203510022851,-100.69327389457196,null,0,0]
[74131,74.131,{"$f":"SQRT(1+(A525/pole1)^2)","v":24.571493410643942},{"$f":"ATAN(A525/pole1)","v":1.5300875168786949},{"$f":"SQRT(1+(A525/Zero1)^2)","v":1.0015608211939584},{"$f":"ATAN(A525/Zero1)","v":5.5835360813062382E-2},{"$f":"IF(VIN_nom>Vout, 1, SQRT(1+(A525/z_RHP)^2))","v":1},{"$f":"IF(VIN_nom>Vout, 0, -ATAN(A525/z_RHP))","v":0},{"$f":"SQRT(1+(A525/Pole2)^2)","v":999.37551392062142},{"$f":"ATAN(A525/Pole2)","v":1.5697957017516113},7.6115919219834662,1.439036859449222,{"$f":"SQRT(1+(A525/pole4)^2)","v":1.0133611729882646},{"$f":"ATAN(A525/pole4)","v":0.16256741502613292},{"$f":"SQRT(1+(A525/Zero3)^2)","v":1.0815221968278785},{"$f":"ATAN(A525/Zero3)","v":0.39075245262193425},{"$f":"SQRT(1+(A525/pole5)^2)","v":1.0033611681152823},{"$f":"ATAN(A525/pole5)","v":8.1875277058270704E-2},{"$f":"SQRT((1-(Z525/pterm2))^2+(A525/pterm1)^2)","v":1.0088633841491401},{"$f":"IF((ATAN((A525/pterm1)/(1-A525^2/pterm2))>0),ATAN((A525/pterm1)/(1-A525^2/pterm2)),PI()+ATAN((A525/pterm1)/(1-A525^2/pterm2)))","v":0.28472689912989857},{"$f":"20*LOG10(((E525*K525*G525*O525)/(C525*I525*S525*M525*Q525))*Adc)","v":-2.8298665261005862},{"$f":"((F525+L525+H525+R525)-(D525+J525+T525+N525+T525))*radconv","v":-129.21097463963778},{"$f":"IF(V525>0,V525,V525+180)","v":50.789025360362217},null,{"$f":"IF(U525<0,A525,1000000000)","v":74131},{"$f":"A525^2","v":5495405161},null,{"$f":"20*LOG10((K525/(I525*M525))*AEA)","v":22.355185936214017},{"$f":"(L525-(J525+N525))*radconv","v":-16.806356584496719},null,{"$f":"20*LOG10((E525*G525/(C525*S525))*Acs*Am)","v":5.282488656236513},{"$f":"(F525+H525-(D525+T525))*radconv","v":-100.78207622977331},null,{"$f":"SUM((U526<0)*(U525>0))*A525","v":0},0]
[74562.75,{"$f":"A526/1000","v":74.562749999999994},24.714365109312407,1.5303229800971465,1.0015790406755256,5.6159872926166185E-2,1,0,1005.1960201510274,1.5698014957918869,7.6551599775072861,1.4397910785073595,1.0135162202642316,0.16349749592314267,1.0824382758551523,0.39280183347311898,1.0034003674829763,8.2349984131007026E-2,1.008972373953877,0.28640011674435006,-2.8761846920700496,-129.38081853245416,50.619181467545843,null,74562.75,5559603687.5625,null,22.352991440228923,-16.816764699707523,null,5.2313502472728306,-100.87284241155818,null,0,0]
[74994.5,74.994500000000002,24.857238162466185,1.5305557365635565,1.0015973656276467,5.6484373199071299E-2,1,0,1011.0165264147901,1.5698072231186189,7.698732338353242,1.4405367607087625,1.013672144014238,0.16442729149289367,1.0833588933823326,0.39484773985612198,1.003439792946041,8.2824654007923215E-2,1.0090821223839146,0.28807357477326001,-2.922182914621767,-129.55100665423623,50.448993345763768,null,74994.5,5624175030.25,null,22.350804376542005,-16.827641770327865,null,5.1804961267291727,-100.9634679610019,null,0,0]
[75426.25,75.426249999999996,25.000112546883045,1.5307858326593418,1.0016157960445324,5.680886156408943E-2,1,0,1016.8370327113369,1.5698128848774375,7.7423089318325342,1.441274049362901,1.0138289438338868,0.16535680025975233,1.0842840378491021,0.39689016351562406,1.0034794444778279,8.3299286479518897E-2,1.0091926315812625,0.28974727404466727,-2.9678650205941706,-129.72153354327591,50.27846645672409,null,75426.25,5689119189.0625,null,22.348624420203858,-16.83897956642214,null,5.1299229670320656,-101.05395558688537,null,0,0]
[75858,75.858000000000004,25.142988239868377,1.5310133137128061,1.0016343319203611,5.7133337953547303E-2,1,0,1022.6575390401077,1.5698184821878916,7.7858896868766987,1.4420030846075742,1.0139866193167593,0.16628602075097779,1.0852136976778151,0.39892909634061213,1.003519322051539,8.3773881336394157E-2,1.0093039036990683,0.29142121537701376,-3.0132347712610286,-129.89239385681452,50.107606143185478,null,75858,5754436164,null,22.346451255557405,-16.850770038449483,null,5.0796274968670927,-101.14430793709968,null,0,0]
[76299.75,76.299750000000003,25.289174486870667,1.5312434031880982,1.0016534062608511,5.7465317254316452E-2,1,0,1028.6128573606361,1.5698241435771121,7.8304840746290969,1.4427406060020491,1.0141488527031708,0.16723646352941932,1.086169551225016,0.40101163265436979,1.0035603571794123,8.4259429396711119E-2,1.009418544939924,0.29313417916742252,-3.0593359206042665,-130.06755120710878,49.932448792891222,null,76299.75,5821651850.0625,null,22.344234466711033,-16.86329390884168,null,5.0284511628566575,-101.23661567587915,null,0,0]
[76741.5,76.741500000000002,25.435362057321733,1.5314708478361116,1.001672590989608,5.7797283875074552E-2,1,0,1034.5681757137534,1.5698297397886558,7.8750826734380865,1.4434697742464329,1.0143120019187628,0.1681866014138669,1.0871301071478241,0.40309049783617978,1.0036016288842029,8.4744937636520676E-2,1.0095339894472632,0.29484739806409355,-3.1051178405770345,-130.24304665774631,49.756953342253695,null,76741.5,5889257822.25,null,22.342024147736691,-16.876275175935415,null,4.9775587771757008,-101.32878722024113,null,0,0]
[77183.25,77.183250000000001,25.581550928532756,1.531695692975668,1.0016918861002895,5.812923774338561E-2,1,0,1040.5234940988998,1.5698352719416337,7.9196854121617415,1.4441907296906062,1.0144760665216817,0.16913643283633964,1.088095352992658,0.4051656836639857,1.0036431371367254,8.5230405831863185E-2,1.0096502395633991,0.29656087291214417,-3.1505843568524492,-130.41887485195559,49.581125148044407,null,77183.25,5957254080.5625,null,22.339819988769879,-16.8897057725565,null,4.926947010602329,-101.42082521933477,null,0,0]
[77625,77.625,25.727741078330403,1.5319179828966114,1.0017112915865169,5.8461178786830423E-2,1,0,1046.4788125155287,1.569840741129682,7.9642922212452802,1.4449036095747259,1.0146410460678803,0.17008595623207981,1.0890652762893898,0.40723718207156656,1.0036848819076321,8.5715833758891469E-2,1.0097672976427523,0.29827460454595534,-3.1957392298822085,-130.59503054967055,49.404969450329446,null,77625,6025640625,null,22.337621688843061,-16.90357780842989,null,4.8766125901800876,-101.51273226273703,null,0,0]
[78077,78.076999999999998,25.877324603739751,1.5321428309568792,1.0017312615816858,5.8800808564268982E-2,1,0,1052.5723132251276,1.5698462731616507,8.0099381918592769,1.4456248117092765,1.0148108002308884,0.17105719112062603,1.0900625333650458,0.4093529208037523,1.0037278400727565,8.6212483238196663E-2,1.0098879106107301,0.30002836683610684,-3.2416231209280562,-130.77560726147388,49.22439273852612,null,78077,6096017929,null,22.335378141021124,-16.918220592074544,null,4.8253939691974237,-101.60663893238005,null,0,0]
[78529,78.528999999999996,26.026909422381948,1.5323650944835066,1.0017513471203241,5.9140424761438749E-2,1,0,1058.6658139665678,1.5698517415107454,{"$f":"SQRT(1+(A535/Zero2)^2)","v":8.0555882814865214},{"$f":"ATAN(A535/Zero2)","v":1.4463378402725815},1.0149815113413618,0.17202810021815815,1.0910646610098687,0.41146478242201484,1.0037710457968709,8.6709090085016677E-2,1.0100093744973355,0.30178239969947007,-3.2871885015795765,-130.95651611249357,49.043483887506426,null,78529,6166803841,null,22.333140117052984,-16.933309371645603,null,4.7744589565471394,-101.70041379994849,null,0,0]
[78981,78.980999999999995,26.176495512086575,1.5325848177624448,1.0017715481954816,5.9480027300816855E-2,1,0,1064.7593147393027,1.569857147270316,8.1012424204957263,1.4470428327186546,1.0151531789165313,0.17299868185901479,1.0920716458155844,0.41357275878808014,1.0038144990480096,8.720565405992757E-2,1.0101316918639045,0.30353670399460136,-3.3324391981227204,-131.13775184834492,48.862248151655081,null,78981,6237998361,null,22.330907321570596,-16.948836238817183,null,4.7238042208630731,-101.79405945647385,null,0,0]
[79433,79.433000000000007,26.326082851186914,1.5328020440740917,1.0017918648001689,5.9819616104899255E-2,1,0,1070.8528155427982,1.5698624915088264,8.1469005408103108,1.4477399234525097,1.0153258024712499,0.17396893438112565,1.093083474358459,0.41567684193170451,1.0038581997940286,8.7702174923631276E-2,1.010254865284929,0.30529128056804666,-3.3773789719318916,-131.31930932911922,48.680690670880779,null,79433,6309601489,null,22.328679467725276,-16.964793458738079,null,4.6734264870584603,-101.8875784346844,null,0,0]
[79895.5,79.895499999999998,26.479146388592845,1.5330217760459759,1.0018127729403927,6.016707928851573E-2,1,0,1077.0878689405029,1.5698678973022804,8.1936233549822042,1.4484451655764456,1.0155034251265871,0.17496138354948107,1.0941238075744595,0.41782576504172303,1.0039031718641802,8.8210185136397432E-2,1.0103817888494924,0.30708689882031137,-3.4230447170148652,-131.50541220443085,48.494587795569146,null,79895.5,6383290920.25,null,22.32640468522083,-16.981558939398724,null,4.6221618441940278,-101.98314132292066,null,0,{"$f":"IF(AH538>0,W538,0)","v":0}]
[80358,80.358000000000004,26.632211189773056,1.5332389822724735,1.001833802025081,6.0514527927162533E-2,1,0,1083.3229223693206,1.5698732408697622,8.2403501981731395,1.4491424099036865,1.0156820476570441,0.17595348462134783,1.0951691836998783,0.41997059560060807,1.0039484029927668,8.8718149705234062E-2,1.0105096141985648,0.30888280390240724,-3.4683926923154349,-131.69184141229024,48.308158587709755,null,80358,6457408164,null,22.324134495082998,-16.998759150310661,null,4.5711804595735259,-102.07857676411014,null,0,0]
[80820.5,80.820499999999996,26.78527723306199,1.5334537060334734,1.0018549520466176,6.086196193786983E-2,1,0,1089.5579758287172,1.569878523279546,8.2870810022300407,1.4498317910490972,1.0158616695351854,0.17694523582788446,1.0962195883076684,0.42211132561113374,1.0039938931447749,8.9226068374189796E-2,1.0106383441328328,0.31067899668180959,-3.5134267263345489,-131.87859179827336,48.121408201726638,null,80820.5,6531953220.25,null,22.321868615898467,-17.016386338470706,null,4.5204789993287182,-102.17388729246433,null,0,0]
[81283,81.283000000000001,26.938344497286334,1.5336659896261047,1.0018762229973435,6.1209381237688917E-2,1,0,1095.7930293181705,1.5698837455755918,8.3338157005227647,1.4505134406382296,1.0160422902310005,0.17793663540424998,1.0972750069567616,0.42424794725695514,1.0040396422849984,8.9733940887454136E-2,1.0107679814672708,0.31247547801255932,-3.5581505829418485,-132.06565832021047,47.934341679789526,null,81283,6606926089,null,22.319606774412271,-17.034432920986809,null,4.47005418588898,-102.26907538511573,null,0,0]
[81756.25,81.756249999999994,27.094970783413359,1.5338807245948092,1.0018981135239513,6.1564860374539884E-2,1,0,1102.173005703095,1.5698890280931284,8.381640627883451,1.4512030650260928,1.0162281424931243,0.17895071250063788,1.0983601320896119,0.42642997024256629,1.0040867228344499,9.025356996100857E-2,1.0109015742268816,0.3143140149621878,-3.6035967516326806,-132.25739497297201,47.742605027027992,null,81756.25,6684084414.0625,null,22.317296263184751,-17.053325357818494,null,4.4187403417479647,-102.36635174609357,null,0,0]
[82229.5,82.229500000000002,27.251598304558041,1.5340929912111343,1.0019201306502901,6.1920323933048083E-2,1,0,1108.5529821184211,1.5698942498064672,8.4294694961675241,1.4518848638680448,1.0164150394130544,0.17996441770510851,1.0994504764241155,0.42860767567864211,1.004134074476283,9.0773150166869182E-2,1.0110361230676068,0.31615285579861863,-3.6487259289255269,-132.44945229400037,47.550547705999634,null,82229.5,6761690670.25,null,22.314989425680221,-17.072641373742567,null,4.3677093861117608,-102.4635049849021,null,0,0]
[82702.75,82.702749999999995,27.408227039547416,1.5343028317731795,1.0019422743680142,6.2275771824414725E-2,1,0,1114.9329585636278,1.5698994117594272,8.4773022386710117,1.4525589689905147,1.016602980414627,0.18097774913998646,1.1005460244478078,0.43078105577341641,1.004181697172148,9.1292681231433429E-2,1.0111716310515368,0.31799200139271722,-3.6935419469755915,-132.64182522648176,47.358174773518243,null,82702.75,6839744857.5625,null,22.312685993940736,-17.09237336788453,null,4.3169579823775255,-102.56053758002864,null,0,0]
[83176,83.176000000000002,27.564856967689597,1.5345102876185195,1.0019645446687302,6.2631203959864712E-2,1,0,1121.3129350382046,1.5699045149720707,8.5251387901816464,1.453225509289426,1.0167919649188863,0.18199070493205105,1.1016467606360447,0.4329501029294916,1.0042295908834833,9.1812162881256654E-2,1.0113081012562715,0.31983145260032481,-3.7380485735604707,-132.83450882363564,47.165491176364355,null,83176,6918246976,null,22.31038570782113,-17.11251390616961,null,4.2664828502594556,-102.65745195406421,null,0,0]
[83660.5,83.660499999999999,27.725211484638447,1.5347202468191221,1.0019874754979774,6.299506893882767E-2,1,0,1127.8445750088015,1.5699096796866139,8.5741163815234351,1.4539001893333106,1.0169865223222274,0.18302734940257401,1.1027790217010833,0.43516621582553938,1.0042789038294482,9.234394206411943E-2,1.0114488156351329,0.3217149483323376,-3.7832965593968817,-133.03208963218415,46.967910367815847,null,83660.5,6999079260.25,null,22.308033734757949,-17.133548856519614,null,4.2150906674471864,-102.75655015880997,null,0,0]
[84145,84.144999999999996,27.885567209737566,1.5349277912914707,1.0020105389820027,6.3358917215650359E-2,1,0,1134.3762150091368,1.5699147849251993,8.6230978314080868,1.4545672049599079,1.0171821721928231,0.18406359619963322,1.1039166875608786,0.43737777183554899,1.0043285007466041,9.287566887546124E-2,1.0115905451036018,0.32359876614730709,-3.8282280610776609,-133.22998589864332,46.770014101356679,null,84145,7080381025,null,22.305684530825577,-17.154996752900619,null,4.1639812647882124,-102.85552942077418,null,0,0]
[84629.5,84.629499999999993,28.045924122263759,1.535132962437278,1.002033735111646,6.3722748695152903E-2,1,0,1140.9078550386992,1.569919831709317,8.6720830744544095,1.455226685450594,1.0173789139004041,0.18509944332784145,1.1050597415226213,0.43958476343366593,1.0043783815928826,9.3407343022389011E-2,1.0117332930142748,0.32548290691414195,-3.8728469215953942,-133.42819265388377,46.571807346116231,null,84629.5,7162152270.25,null,22.303337840671347,-17.176850132235192,null,4.113151297695036,-102.95439216733844,null,0,0]
[85114,85.114000000000004,28.206282201964918,1.5353358007175604,1.002057063877696,6.4086563282181944E-2,1,0,1147.4394950969897,1.5699248210371988,8.721072046745169,1.4558787572084468,1.0175767468116721,0.18613488879678106,1.1062081668836021,0.44178718330292621,1.0044285463259834,9.3938964212186796E-2,1.0118770627366096,0.32736737148491662,-3.9171569196640785,-133.62670503680368,46.373294963196315,null,85114,7244392996,null,22.300993416439496,-17.199101695312386,null,4.0625974780301766,-103.05314077102041,null,0,0]
[85609.5,85.609499999999997,28.370282208980662,1.5355408724952435,1.0020810594737797,6.4458620278267195E-2,1,0,1154.119428354024,1.5699298652307307,8.7711770478534099,1.4565380993296646,1.017780199268935,0.18719342532092356,1.1073882041798688,0.44403487050453677,1.0044801435737076,9.4482600153782098E-2,1.0120251569832321,0.32929495638205442,-3.9621573354669954,-133.83003556774699,46.169964432253011,null,85609.5,7328986490.25,null,22.298597857794515,-17.22226286083211,null,4.0111781477448591,-103.15401570213933,null,0,0]
[86105,86.105000000000004,28.534283395377969,1.5357435869756431,1.002105193777691,6.4830659404904262E-2,1,0,1160.7993616400854,1.5699348513696543,8.8212858187552836,1.4571899510269484,1.017984791691886,0.18825153754543611,1.1085738241825538,0.44627776121317225,1.0045320376549831,9.5026180087595169E-2,1.0121743271484513,0.3312228817016068,-4.0068424997762042,-134.03367581071015,45.96632418928985,null,86105,7414071025,null,22.296204167710563,-17.245825559168392,null,3.960040865350793,-103.25477609868427,null,0,0]
[86600.5,86.600499999999997,28.698285740937504,1.5359439845557563,1.0021294667794083,6.5202680560397741E-2,1,0,1167.4792949546761,1.5699397804504773,8.8713982955714421,1.4578344386766098,1.0181905233933406,0.18930922335748065,1.1097650089987658,0.4485158482721055,1.0045842285238087,9.5569703701097533E-2,1.0123245768908875,0.333151148299838,-4.0512162556444613,-134.23762089733415,45.762379102665847,null,86600.5,7499646600.25,null,22.293812103807802,-17.269782485530921,null,3.9091822886349274,-103.35542433011973,null,0,0]
[87096,87.096000000000004,28.862289225899374,1.5361421047151476,1.0021538784688537,6.5574683643081957E-2,1,0,1174.1592282973088,1.5699446534470309,8.9215144158531086,1.4584716858400988,1.0183973936828443,0.19036648064973796,1.110961740728551,0.45074912474772333,1.0046367161339302,9.6113170681958654E-2,1.0124759098874008,0.33507975701423309,-4.0952823821885982,-134.4418660648266,45.558133935173402,null,87096,7585713216,null,22.291421430870141,-17.294126495426017,null,3.8585991317303221,-103.45596271226752,null,0,0]
[87603.25,87.603250000000003,29.030182954600775,1.5363426041940509,1.0021790126922443,6.5955489364545525E-2,1,0,1180.9975657386758,1.5699495848976177,8.972822671133283,1.4591166703753644,1.0186103482581912,0.19144836305196414,1.1121925781443316,0.4530303697930691,1.0046907557361346,9.6669466135149623E-2,1.0126319574549609,0.3370544548746271,-4.1400786890757466,-134.65126055830592,45.348739441694079,null,87603.25,7674329410.5625,null,22.288975269430416,-17.319441450615543,null,3.8070983963692262,-103.55877377888052,null,0,0]
[88110.5,88.110500000000002,29.198077836895649,1.5365407978553318,1.0022042922373156,6.6336275930381286E-2,1,0,1187.8359032084329,1.5699544595677632,9.0241346167058545,1.4597543203068826,1.0188244945866936,0.19252979191863587,1.1134291906840341,0.45530655940447745,1.0047451062210926,9.7225701576185763E-2,1.0127891481173819,0.33902951298453671,-4.1845604197518274,-134.86095975858737,45.13904024141263,null,88110.5,7763460210.25,null,22.286530088839637,-17.34514740869189,null,3.755879504677448,-103.66147447018875,null,0,0]
[88617.75,88.617750000000001,29.365973852997577,1.5367367252328938,1.0022297170930716,6.6717043231616091E-2,1,0,1194.6742407060926,1.5699592784325045,9.0754501899768751,1.46038475952844,1.0190398319170273,0.19361076500704183,1.1146715591269545,0.45757768686064754,1.004799767538356,9.7781876670637341E-2,1.0129474858783958,0.34100493218069833,-4.2287314300203187,-135.07095888086116,44.929041119138844,null,88617.75,7853105615.0625,null,22.284085658557196,-17.371237198431537,null,3.7049391067330233,-103.76406710550322,null,0,0]
[89125,89.125,29.533870983569948,1.5369304249623601,1.0022552872484534,6.7097791159310055E-2,1,0,1201.5125782311788,1.5699640424446806,9.1267693297557688,1.4610081091704661,1.0192563594943271,0.19469128008062123,1.1159196642487184,0.45984374567902475,1.0048547396371994,9.8337991084296514E-2,1.0131069747615293,0.34298071327882318,-4.2725955118134546,-135.28125324383552,44.718746756164478,null,89125,7943265625,null,22.281641754915029,-17.39770380602031,null,3.6542739090775793,-103.86655395146062,null,0,0]
[89644,89.644000000000005,29.705658437248875,1.5371263453092232,1.0022816000896053,6.7487338612303729E-2,1,0,1208.5093198569502,1.5699688610090019,9.1792808612561636,1.4616386838624715,1.0194791338742655,0.19579634795706036,1.1172025981192915,0.46215704313032574,1.0049113067265858,9.890692424526501E-2,1.0132713537096447,0.34500263701030331,-4.3171618806318355,-135.49671969204957,44.503280307950433,null,89644,8036046736,null,22.279141559157626,-17.425166346326385,null,3.6027165557624108,-103.97130763191085,null,0,0]
[90163,90.162999999999997,29.877447018060792,1.5373200126678488,1.0023080650162028,6.7876865553194624E-2,1,0,1215.5060615104585,1.5699736240997213,9.2317960011399656,1.4622620847424059,1.0197031526717868,0.19690093163671399,1.1184914967928528,0.46446502143144763,1.0049681990539507,9.9475793174517879E-2,1.0134369463119415,0.34702494126404709,-4.3614147696730878,-135.7124856219684,44.287514378031602,null,90163,8129366569,null,22.276641462056222,-17.453008994952064,null,3.5514405000149338,-104.0759552032203,null,0,0]
[90682,90.682000000000002,30.049236706674563,1.53751146566418,1.0023346820161994,6.8266371865405392E-2,1,0,1222.502803191227,1.5699783326693137,9.2843146881765595,1.4628784330621178,1.0199284150669132,0.19800502874410694,1.1197863396725445,0.46676767440417349,1.0050254165640611,0.10004459751480911,1.0136037569420162,0.34904762684477586,-4.4053580424815886,-135.92854633730681,44.071453662693187,null,90682,8223225124,null,22.274141244919395,-17.481224723146234,null,3.5004423894848942,-104.18049893127902,null,0,0]
[91201,91.200999999999993,30.221027484198483,1.5377007420465443,1.0023614510774799,6.8655857432396092E-2,1,0,1229.4995448987911,1.5699829876485729,9.3368368625089033,1.4634878473668718,1.0201549202358409,0.19910863691060143,1.1210871061618952,0.46906499612464997,1.0050829592013806,0.10061333690914102,1.0137717899948839,0.35107069453372841,-4.4489954989076432,-136.14489724301396,43.855102756986042,null,91201,8317622401,null,22.271640695634723,-17.509806656383176,null,3.4497189282797875,-104.28494103034578,null,0,0]
[91732,91.731999999999999,30.396791410533318,1.5378921805504069,1.0023889964396198,6.9054326854266629E-2,1,0,1236.6580610083538,1.5699876957427807,9.3905769705236395,1.4641042966949591,1.0203879478633127,0.20023725353672653,1.1224240573341133,0.47140991162083051,1.0051421687362689,0.10119515875943183,1.0139449779568237,0.35314093460691226,-4.4933293070946139,-136.36654612504094,43.633453874959059,null,91732,8414759824,null,22.269081771879144,-17.539421434926854,null,3.3981035389378302,-104.39169505140949,null,0,0]
[92263,92.263000000000005,30.572556438062062,1.5380814178586339,1.0024167009501976,6.9452774313827501E-2,1,0,1243.8165771450128,1.5699923496441617,9.4443206064375147,1.4647137303474107,1.0206222746414624,0.20136535335639991,1.1237671655944563,0.47374923474470831,1.005201718488381,0.10177691187052867,1.0141194548992079,0.3552115762410723,-4.537350842932101,-136.58848935291564,43.411510647084356,null,92263,8512461169,null,22.266522071393386,-17.569405466226552,null,3.3467688418972181,-104.49834721935008,null,0,0]
[92794,92.793999999999997,30.748322547900639,1.5382684917055252,1.0024445645960189,6.9851199686389545E-2,1,0,1250.975093308303,1.5699969502830462,9.4980677103639906,1.4653162669673123,1.0208578996756725,0.2024929338552357,1.1251164088928434,0.47608295996630945,1.0052616083972552,0.10235859586090945,1.0142952255981594,0.35728262019585855,-4.5810639784728107,-136.81072231619979,43.189277683800213,null,92794,8610726436,null,22.263961386997345,-17.599751861774479,null,3.2957114825979317,-104.60489974685258,null,0,0]
[93325,93.325000000000003,30.924089721594157,1.5384534389680931,1.0024725873638138,7.0249602847305484E-2,1,0,1258.1336094977698,1.5700014985685915,9.5518182237606126,1.4659120225475022,1.0210948220671974,0.20361999252644472,1.1264717651843577,0.47841108202599419,1.0053218384020994,0.10294021034932983,1.0144722948529545,0.35935406720470547,-4.6244725222357612,-137.03324050338372,42.966759496616277,null,93325,8709555625,null,22.261399517808094,-17.630453884132983,null,3.2449281629218412,-104.71135479597864,null,0,0]
[93868.5,93.868499999999997,31.103995623510894,1.5386405753295187,1.0025014345721326,7.0657361481542488E-2,1,0,1265.460640690093,1.5700061006338277,9.6068375216369155,1.4665148985019585,1.0213386643128972,0.20477303970393132,1.1278653347658545,0.48078820144470696,1.0053838383861931,0.10353544395459059,1.0146548822066055,0.36147469522612735,-4.6685914026906268,-137.26128764423333,42.738712355766665,null,93868.5,8811295292.25,null,22.25877591073306,-17.662240052173569,null,3.1932297867471386,-104.82021710654901,null,0,0]
[94412,94.412000000000006,31.283902602161934,1.5388255593356293,1.0025304484538533,7.106509658197023E-2,1,0,1272.7876719089088,1.5700106497138313,9.66186027144124,1.467110908106606,1.0215838637972423,0.20592553490672824,1.1292652618215793,0.48315944050227844,1.0054461945368374,0.10413060393984108,1.0148388402210691,0.36359574697133068,-4.712399058292875,-137.48962433709471,42.51037566290529,null,94412,8913625744,null,22.256150655885936,-17.694384971428939,null,3.141811687985419,-104.92898172221599,null,0,0]
[94955.5,94.955500000000001,31.463810639077298,1.5390084278947411,1.0025596289945047,7.1472808015067585E-2,1,0,1280.1147031537621,1.5700151467184211,9.7168864145330236,1.4677001675855463,1.0218304195431791,0.20707747547170682,1.1306715227372466,0.48552479442450158,1.0055089067877698,0.10472568989718758,1.0150241741174157,0.36571722314065991,-4.7558993755665382,-137.71824604832511,42.281753951674887,null,94955.5,9016546980.25,null,22.253523557020287,-17.726881882291355,null,3.0906705055510524,-105.03765080544736,null,0,0]
[95499,95.498999999999995,31.643719716206931,1.539189217076381,1.0025889761795352,7.1880495647360418E-2,1,0,1287.4417344242088,1.5700195925367051,9.7719158935889556,1.4682827905638611,1.0220783305691956,0.20822885874418895,1.1320840939093282,0.48788425872424956,1.0055719750723664,0.10532070141904754,1.0152108891417624,0.3678391244051557,-4.7990961775311884,-137.94714834105466,42.052851658945343,null,95499,9120059001,null,22.250894423927157,-17.759724173363441,null,3.0398029348755182,-105.14622646897003,null,0,0]
[96611.5,96.611500000000007,32.011982036748478,1.5395529408368069,1.0026495670659539,7.2714924068977491E-2,1,0,1302.4395675994815,1.5700285367775115,9.8845669000594434,1.4694551415040353,1.0225900062888307,0.21058389705057581,1.1349950900937755,0.49269550541789259,1.0057021806588688,0.10653840745449178,1.0155974086137767,0.37218381084074043,-4.886585767720014,-138.41654938853918,41.583450611460819,null,96611.5,9333781932.25,null,22.245505690854067,-17.827999635258042,null,2.936520803084159,-105.36818927480701,null,0,0]
[97724,97.724000000000004,32.380248495983707,1.5399083912503224,1.0027108559833258,7.3549251065547369E-2,1,0,1317.4374008765767,1.5700372773741342,9.9972311857675109,1.4706010702572392,1.02310734781152,0.21293656671060096,1.1379322244782144,0.49748202567028194,1.0058338771212203,0.10775579641982096,1.0159897824811688,0.37653028614212747,-4.9728508300961813,-138.88707187349925,41.112928126500748,null,97724,9549980176,null,22.240106159689475,-17.897641595561176,null,2.8343443458608384,-105.5897863584709,null,0,0]
[98862,98.861999999999995,32.75696025555542,1.5402637199093765,1.0027742718059141,7.4402595831453713E-2,1,0,1332.7790048159466,1.5700460147850175,10.112491165382467,1.471746845275673,1.0236424006361942,0.21534068863723474,1.1409635152342383,0.50235264768807419,1.0059701341603895,0.10900075789537875,1.0163972552276799,0.3809782441422645,-5.0598579993315376,-139.36950364028175,40.630496359718251,null,98862,9773695044,null,22.234570215994218,-17.970240179414805,null,2.7309424699049965,-105.81610135853661,null,0,0]
[100000,100,33.133676056925502,1.5406109687400606,1.0028384177533465,7.5255832051264057E-2,1,0,1348.1206088547481,1.5700545533325398,10.227764121453857,1.4728667946114642,1.0241833637098388,0.21774228476772473,1.1440217292094568,0.50719734370486891,1.00610794995819,0.11024538023207998,1.0168109515851074,0.3854280830995282,-5.1456472757825811,-139.85303725039691,40.146962749603091,null,100000,10000000000,null,22.22902007014693,-18.044162354398189,null,2.6286428813131044,-106.04206740867517,null,0,0]
[101165,101.16500000000001,33.519333799664153,1.5409583710250834,1.0029048417852264,7.6129198297806275E-2,1,0,1363.8262053560038,1.5700630954743093,10.345785013697963,1.4739874620297466,1.0247432740616995,0.2201982196509496,1.1471801660056309,0.51213010824305538,1.0062506495537451,0.11151917708928979,1.0172409624269529,0.38998545054925254,-5.2322422702079123,-140.34914901197033,39.650850988029674,null,101165,10234357225,null,22.223322139278036,-18.1211569734199,null,2.5250305521533889,-106.27304981432755,null,0,0]
[102330,102.33,33.904995495765611,1.5412978701046334,1.0029720306997632,7.7002448197069029E-2,1,0,1379.5318019545095,1.5700714431161302,10.463818606057259,1.4750828481729212,1.0253093584993094,0.22265145742094755,1.1503663625075897,0.51703566681025304,1.0063949813852224,0.11279261064984761,1.0176776025240546,0.39454479660047409,-5.3176246022007634,-140.84634499896347,39.153655001036526,null,102330,10471428900,null,22.217606586672325,-18.199434425576516,null,2.4225186575691344,-106.50369943138455,null,0,0]
[103520,103.52,34.298937136792041,1.5416367722774997,1.0030414509561216,7.7894315885029389E-2,1,0,1395.574428619929,1.5700797759144371,10.58439777817088,1.4761765163489307,1.0258939542876739,0.22515452919191062,1.1536493528052909,0.52201839686405349,1.0065440948876792,0.11409299190544527,1.0181305137197738,0.39920402828904988,-5.4036191074765387,-141.35529498646409,38.644705013535912,null,103520,10716390400,null,22.211748884582597,-18.280664737465269,null,2.3189156601714793,-106.73897115295122,null,0,0]
[104710,104.71,34.692882627747245,1.541967977866783,1.0031116689489081,7.8786059420435983E-2,1,0,1411.6170553800482,1.5700879193129744,10.704989325178129,1.4772455454679443,1.0264849703348149,0.22765473424098381,1.1569608224818726,0.52697272605684142,1.0066949099416518,0.11539298573314528,1.0185904578319438,0.40386532948106035,-5.4884120359358288,-141.86530706234001,38.134692937659992,null,104710,10964184100,null,22.205870234013318,-18.363131660459704,null,2.2164062077824704,-106.97392757999141,null,0,0]
[105930,105.93,35.096763378656036,1.5422998143415045,1.0031844851242504,7.9700153541218205E-2,1,0,1428.0641182038803,1.5700960780672817,10.828633409197204,1.4783168055102589,1.0270975394248181,0.23021496611932762,1.1603850847084221,0.53202247151684179,1.006851292691914,0.11672534589636482,1.0190693605291983,0.40864629244472578,-5.5741272938965363,-142.38924480694536,37.610755193054644,null,105930,11221164900,null,22.199820408805326,-18.448910924763926,null,2.112420261622689,-107.21449567438418,null,0,0]
[107150,107.15,35.500647906325248,1.5426241003627059,1.0032581394064231,8.0614114208987606E-2,1,0,1444.511181120607,1.5701040510320337,10.952289639543624,1.4793638767252244,1.0277168328692932,0.23277212919456516,1.1638387621151911,0.53704237423729873,1.0070094622311037,0.11805728987959468,1.0195557823710435,0.41342943295081364,-5.6586438326576358,-142.91423040535904,37.085769594640965,null,107150,11481122500,null,22.193746154398212,-18.535889632364466,null,2.0095287728588329,-107.45476356994142,null,0,0]
[108400,108.4,35.914467804710526,1.5429487956932024,1.0033344739404457,8.155040933784842E-2,1,0,1461.3626801037656,1.5701120339142465,11.078998769596277,1.4804124518249688,1.0283583165536223,0.23538896126451717,1.1674076020660633,0.54215477830931891,1.0071733735401516,0.11942155019141043,1.020062032390612,0.41833245018457182,-5.7440277263684507,-143.45317824054587,36.546821759454133,null,108400,11750560000,null,22.187496043623835,-18.626201523511671,null,1.9052146878941836,-107.70064367739928,null,0,0]
[109650,109.65,36.328291403190555,1.543266093703938,1.0034116879119217,8.2486561188769111E-2,1,0,1478.2141791779279,1.5701198347882852,11.20571980562341,1.4814373121914877,1.0290068334323104,0.23800251277070142,1.171006767725099,0.54723588789319266,1.0073391587944451,0.12078536398805671,1.0205763151782949,0.4232377524845618,-5.8282179777928897,-143.9931582458573,36.006841754142698,null,109650,12023122500,null,22.181218025222506,-18.717673778027784,null,1.8019943142101293,-107.9462390835271,null,0,0]
[110925,110.925,36.750395155851074,1.5435823760438789,1.0034913519487494,8.3441286804607009E-2,1,0,1495.4027083241356,1.5701276105561446,11.334987113790664,1.4824590615014701,1.029675552462979,0.24066492510718468,1.1747088691543939,0.55238640760855318,1.007510189332802,0.12217598902924903,1.0211092330524834,0.42824351304219577,-5.9128947223425179,-144.54496768768837,35.45503231231163,null,110925,12304355625,null,22.174784627653828,-18.812122363838174,null,1.6978087175255088,-108.1964679318511,null,0,0]
[112200,112.2,37.172502501328538,1.5438914754111339,1.0035719305232469,8.4395859977189375E-2,1,0,1512.5912375587041,1.5701352096020851,11.464265988496829,1.4834577679517476,1.0303515607821683,0.24332386268100961,1.1784419368124226,0.5575044307543261,1.0076831675690792,0.12356613933042383,1.0216506589866918,0.43325164623298051,-5.9963941738577251,-145.0977844381413,34.902215561858696,null,112200,12588840000,null,22.16832010481129,-18.907681993603624,null,1.5947061015282837,-108.44642990237656,null,0,0]
[113510,113.51,37.606200722218297,1.5442018325792064,1.0036556733667528,8.5376476551773675E-2,1,0,1530.2516088611642,1.5701428394432848,11.597105335649259,1.4844606974273966,1.0310537033034533,0.24605213925510036,1.1823094254904132,0.5627291448750239,1.0078629218044717,0.12499395076426895,1.0222158902563419,0.43839972472984801,-6.0809922093945374,-145.66679244009967,34.33320755990033,null,113510,12884520100,null,22.161644710865559,-19.006974258352024,null,1.4898734899668082,-108.70299003797022,null,0,0]
[114820,114.82,38.039902482799789,1.5445051128676703,1.0037403811728693,8.6356928556360554E-2,1,0,1547.9119802506739,1.5701502951843669,11.72995608373577,1.4854409099796122,1.0317635099869362,0.24877668222411572,1.186208977458223,0.56791964838583275,1.0080447299798436,0.12642125007471378,1.0227902688901478,0.44355029850043598,-6.164412869491203,-146.23679736452812,33.763202635471885,null,114820,13183632400,null,22.154934505768743,-19.107344211922786,null,1.3861286455136961,-108.9592970960491,null,0,0]
[116155,116.155,38.481884512289788,1.5448071478747327,1.0038276980485423,8.7355920257890921E-2,1,0,1565.9093817150417,1.5701577201937442,11.865353484323915,1.4864172456353399,1.0324947311850452,0.25154934526329265,1.1902156090225327,0.5731740712129586,1.0082321197364095,0.12787525531255467,1.0233851079290581,0.44880172615098962,-6.2482469543160288,-146.81867300556402,33.181326994435977,null,116155,13491984025,null,22.148059513596337,-19.210691611436459,null,1.2814953607638611,-109.2202490600459,null,0,0]
[117490,117.49,38.923869972571026,1.5451023236169006,1.0039160165537682,8.8354737185492513E-2,1,0,1583.9067832637772,1.5701649764673393,12.000761940114815,1.4873715495654263,1.0332338785816551,0.25431806258682288,1.1942548801843496,0.57839309375761339,1.008421640233176,0.12932871709729354,1.0239896259789028,0.45405573050956588,-6.3309235178063794,-147.40151864423188,32.598481355768115,null,117490,13803900100,null,22.141146583097637,-19.315065595144063,null,1.1779366246856386,-109.48096566541663,null,0,0]
[118860,118.86,39.377446512374036,1.5453983488603884,1.0040076916118983,8.9379556576142757E-2,1,0,1602.3760268854153,1.5701722535136362,12.139731536113667,1.4883287383746941,1.0340006271734377,0.25715523017111092,1.1984336380952352,0.58371221882275393,1.0086183434379761,0.13081971349286198,1.0246201518249045,0.4594501495088491,-6.4145970946739084,-148.00062069200607,31.999379307993934,null,118860,14127699600,null,22.13401213093567,-19.423197388690578,null,1.072752292173117,-109.74828627853995,null,0,0]
[120230,120.23,{"$f":"SQRT(1+(A589/pole1)^2)","v":39.831026424270291},{"$f":"ATAN(A589/pole1)","v":1.5456876320929067},{"$f":"SQRT(1+(A589/Zero1)^2)","v":1.0041004209407165},{"$f":"ATAN(A589/Zero1)","v":9.0404187757273657E-2},{"$f":"IF(VIN_nom>Vout, 1, SQRT(1+(A589/z_RHP)^2))","v":1},{"$f":"IF(VIN_nom>Vout, 0, -ATAN(A589/z_RHP))","v":0},{"$f":"SQRT(1+(A589/Pole2)^2)","v":1620.845270589974},{"$f":"ATAN(A589/Pole2)","v":1.570179364718636},12.278712002886701,1.4892642595393368,{"$f":"SQRT(1+(A589/pole4)^2)","v":1.0347756866001276},{"$f":"ATAN(A589/pole4)","v":0.25998817038564248},{"$f":"SQRT(1+(A589/Zero3)^2)","v":1.2026460672095671},{"$f":"ATAN(A589/Zero3)","v":0.58899423056669298},{"$f":"SQRT(1+(A589/pole5)^2)","v":1.0088172879949062},{"$f":"ATAN(A589/pole5)","v":0.13231012513455023},{"$f":"SQRT((1-(Z589/pterm2))^2+(A589/pterm1)^2)","v":1.0252610670556161},{"$f":"IF((ATAN((A589/pterm1)/(1-A589^2/pterm2))>0),ATAN((A589/pterm1)/(1-A589^2/pterm2)),PI()+ATAN((A589/pterm1)/(1-A589^2/pterm2)))","v":0.46484726097927809},{"$f":"20*LOG10(((E589*K589*G589*O589)/(C589*I589*S589*M589*Q589))*Adc)","v":-6.4971175486808042},{"$f":"((F589+L589+H589+R589)-(D589+J589+T589+N589+T589))*radconv","v":-148.60067902515132},{"$f":"IF(V589>0,V589,V589+180)","v":31.399320974848678},null,{"$f":"IF(U589<0,A589,1000000000)","v":120230},{"$f":"A589^2","v":14455252900},null,{"$f":"20*LOG10((K589/(I589*M589))*AEA)","v":22.126836081368641},{"$f":"(L589-(J589+N589))*radconv","v":-19.532318934375372},null,{"$f":"20*LOG10((E589*G589/(C589*S589))*Acs*Am)","v":0.96864406483934551},{"$f":"(F589+H589-(D589+T589))*radconv","v":-110.0153856537333},null,{"$f":"SUM((U590<0)*(U589>0))*A589","v":0},0]
[126030,{"$f":"A590/1000","v":126.03},41.751326572141949,1.5468427014164245,1.0045046704834319,9.4739909063829134E-2,1,0,1699.0362301955795,1.5702077577932689,12.867208782198654,1.4930009465786442,1.0381485984250476,0.27193398757506659,1.2208446559446144,0.61094719821766286,1.0096843347855584,0.13861327480304633,1.0280918585029428,0.48772585486213688,-6.8344137066621009,-151.15096627547572,28.849033724524276,null,126030,15883560900,null,22.095979019283064,-20.004294249333828,null,0.5392155909754498,-111.14399459097658,null,0,0]
[131830,131.83000000000001,43.671677525218456,1.547896189572451,1.0049277877872267,9.9072060706415763E-2,1,0,1777.2271910503678,1.5702336525021541,13.45586950757132,1.4964107363443833,1.0416686850229853,0.28380075239545582,1.2396141719203342,0.63224537807576653,1.0105914262657296,0.1449053588653339,1.0311184707950665,0.51065119661784819,-7.1538174880271868,-153.71568612567654,26.284313874323459,null,131830,17379148900,null,22.064319481144597,-20.490326885498913,null,0.12674864723109308,-112.2696663385366,null,0,0]
[144540,144.54,47.880042661202609,1.5499092795080989,1.0059208564882176,0.10855219526449747,1,0,1948.5732485569647,1.5702831307707616,14.746325795443182,1.5029307411903299,1.0498898428537931,0.30951674876327717,1.2826181435765156,0.67668119533895632,1.0127187018858521,0.15865273056554338,1.0384751943696147,0.56104378358266416,-7.800447213422057,-159.3774389094261,20.622561090573896,null,144540,20891811600,null,21.992002390405673,-21.593011080500069,null,-0.72551649950150721,-114.72911875087554,null,0,0]
[158490,158.49,52.499165804088278,1.5517472530598835,1.0071146538787563,0.1189346583606246,1,0,2136.6359991682152,1.5703283013395091,16.163280991023658,1.5088881624546486,1.0596989298596868,0.33726189242921689,1.3325319191911431,0.72205203533692586,1.0152728346281108,0.17367182761771424,1.0477815038484029,0.61656993302994501,-8.4420059113249266,-165.64110550805881,14.358894491941186,null,158490,25119080100,null,21.907865016809186,-22.843943703692421,null,-1.5926639420782107,-117.4209695809088,null,0,0]
[173780,173.78,57.562159120009746,1.5534229286651695,1.0085475117065466,0.13028483568942539,1,0,2342.7635629639585,1.5703694804642745,17.716893616221999,1.5143230104926213,1.0713688507643213,0.36706307781217745,1.3901500162108322,0.76793475887779805,1.0183339620048661,0.19004296208587229,1.0596031074161252,0.67763337929796674,-9.0831963092938199,-172.54460367690706,7.4553963230929412,null,173780,30199488400,null,21.809937321542485,-24.242391387403302,null,-2.4774583717761884,-120.36533922030533,null,0,0]
[190550,190.55,63.115380939191795,1.5549516653421653,1.0102680073989703,0.14269485226703119,1,0,2568.8433080881628,1.5704070465215114,19.421389431605242,1.5192839262510445,1.0852371671971135,0.39898039702032323,1.4564269292595748,0.81397787986465275,1.0220031995270433,0.20788064727438549,1.074710293613071,0.74475152607795114,-9.7320593790607752,-180.13694179751127,-0.13694179751126967,null,190550,36309302500,null,21.69589576354976,-25.789031914224211,null,-3.385579960915952,-123.58747434921432,null,0,0]
[208930,208.93,69.201879471439014,1.5563453492548134,1.0123317371640148,0.15624551260267436,1,0,2816.6277907037907,1.5704412923014117,21.289981848673609,1.5238085897226537,1.101672415861739,0.43300048465785279,1.5322870273884928,0.85976011680870257,1.0263953363505127,0.22727747459241762,1.09409723210188,0.81831970239141139,-10.397991345814878,-188.45125950184783,-8.4512595018478294,null,208930,43651744900,null,21.563402411722791,-27.480957374467355,null,-4.3227987703781894,-127.10607692179286,null,0,0]
[229090,229.09,75.877949850658098,1.5576168859670276,1.0148081496062478,0.17104207024659332,1,0,3088.4088150565603,1.5704725354585301,23.339954043329868,1.527938221763768,1.1211193990372481,0.46912182934903818,1.6188193978497423,0.90493825736053057,1.0316528293523617,0.24835401487977912,1.1191002021926222,0.89875729308015528,-11.093797301757423,-197.52098522641305,-17.520985226413046,null,229090,52482228100,null,21.409802216106755,-29.3157375918498,null,-5.2977919600339813,-130.93988476962664,null,0,0]
[251190,251.19,83.196576787827254,1.558776312040179,1.0177768084808954,0.18717583543519253,1,0,3386.3433734037121,1.5705010230101748,25.587575911785322,1.5317049045067768,1.1440571732324025,0.50725309370771754,1.7170693660849419,0.94913355100714558,1.0379370619396906,0.27120212861199317,1.1514299459642712,0.98623383531825892,-11.833812099600273,-207.34856937971028,-27.348569379710284,null,251190,63096416100,null,21.232543746891054,-31.286315301890202,null,-6.3195881729929484,-135.09395501870179,null,0,0]
[275420,275.42,91.220680560759305,1.559833680780111,1.0213341362954684,0.20475169159519244,1,0,3712.9928940737236,1.5705270022794402,{"$f":"SQRT(1+(A599/Zero2)^2)","v":28.052170902889621},{"$f":"ATAN(A599/Zero2)","v":1.5351409074794204},1.1710370771267502,0.54727836494259408,1.8282041409871168,0.99203804030701892,1.0454416018750934,0.29592231458607993,1.1933120325978777,1.0807361634460204,-12.635005577917957,-217.91283571472218,-37.912835714722178,null,275420,75856176400,null,21.028969542711828,-33.38421445366906,null,-7.3993692403293938,-139.5620999665787,null,0,0]
[302000,302,100.02311730939282,1.5607984714329242,1.0255966507890972,0.22388535581666449,1,0,4071.3232414735562,1.5705507064030131,30.756116989167378,1.5382767380560949,1.2026877527542217,0.58904610749848818,1.9535222682236635,1.0334060284033735,1.0543975288479777,0.32261715233419075,1.2476053918243104,1.1819618740408513,-13.516228753734881,-229.15675006358703,-49.156750063587026,null,302000,91204000000,null,20.796395924679452,-35.599018113367805,null,-8.5498003308878374,-144.320906193322,null,0,0]
[331130,331.13,109.67012056589581,1.5616779465792949,1.0306954838201747,0.24466441521043611,1,0,4464.0306559898381,1.5705723139944867,33.719759966436861,1.5411357764008742,1.2396530053935519,0.63228813934313677,2.0942170672336768,1.0729829861020934,1.0650600136522554,0.35133465069350911,1.3177940545659934,1.2890373512859463,-14.495362590857713,-240.95615541789559,-60.956155417895587,null,331130,109647076900,null,20.532678667322216,-37.914031231456725,null,-9.7818894703556634,-149.31571694308136,null,0,0]
[363080,363.08,120.25110640505149,1.5624802991420845,1.0367942305465567,0.26720918586697989,1,0,4894.7550621643722,1.5705920264786895,36.970569228976856,1.5437444853357949,1.2826980104101862,0.6767587136741624,2.2518064166644045,1.1106403023600127,1.077743224232419,0.38215056828615473,1.4082659649672224,1.4008060119404722,-15.590642204187656,-253.1521673453276,-73.152167345327598,null,363080,131827086400,null,20.235550340117506,-40.313668886088792,null,-11.107403487091998,-154.47384069312861,null,0,{"$f":"IF(AH602>0,W602,0)","v":0}]
[398110,398.11,131.85217990299554,1.5632120032911525,1.0440788997791464,0.29161079467706214,1,0,5367.0015725362928,1.5706100030175936,40.534999073263783,1.5461237848979854,1.3326068474001025,0.72211587595807625,2.4277548005110541,1.1462546240732037,1.0927959569743499,0.41508037135781067,1.5242043429145409,1.51555240527164,-16.816049294553764,-265.52169121541067,-85.521691215410669,null,398110,158491572100,null,19.90346338671527,-42.777149015160575,null,-12.533723438985904,-159.69213911276225,null,0,0]
[436520,436.52,144.57269366743228,1.5638793361184169,1.0527703713302881,0.31796128543133906,1,0,5884.8145477423586,1.5706263979047506,44.44357560812788,1.5482939879564113,1.3902412041801413,0.76800267982301396,2.6237192862727974,1.1797690684641207,1.1106234753249131,0.45011940606476081,1.6717703167289373,1.6313002681225113,-18.181201528447037,-277.81201000548702,-97.812010005487025,null,436520,190549710400,null,19.535256391667332,-45.28286509673481,null,-14.064364213383646,-164.85246659388702,null,0,0]
[478630,478.63,158.51862437100371,1.5644878779501425,1.0631243128050512,0.34633308725705009,1,0,6452.5079724754878,1.5706413482953321,48.728861818199661,1.5502731672925556,1.4565078366485933,0.81403033971503935,2.8414555030755451,1.2111616442115094,1.1316822197910756,0.48721466367997279,1.8581134204862788,1.7459380285527084,-19.689492538357346,-289.75705900971701,-109.75705900971701,null,478630,229086676900,null,19.130433139068387,-47.807513723718067,null,-15.697148932127922,-169.83000882187704,null,0,0]
[524810,524.80999999999995,173.8125080975135,1.5650429691808736,1.0754424419922399,0.37679175994484304,1,0,7075.06989155054,1.5706549854345062,53.428510451319717,1.5520786349495286,1.5324004158344238,0.85982384846659088,3.0829769966404306,1.2404593435770541,1.1564966968565382,0.52628259423200296,2.0916140765845062,1.8575240398810682,-21.338937462554011,-301.11320793585116,-121.11320793585116,null,524810,275425536100,null,18.688936717753254,-50.328624180885541,null,-17.425287850596483,-174.51006731922348,null,0,0]
[575440,575.44000000000005,190.5801931802911,1.5655491677270683,1.0900662876108447,0.40936085885872969,1,0,7757.6231618157899,1.5706674213322427,58.581193398599957,1.5537251728229522,1.6189314166823126,0.90499260974309259,3.3503519666574291,1.2677007500932076,1.1856398715080629,0.56716689885948346,2.3818785828296356,1.9643718380329571,-23.121463445339717,-311.67184898363172,-131.67184898363172,null,575440,331131193600,null,18.211556988805935,-52.822976424212385,null,-19.236669112818788,-178.79492633847138,null,0,0]
[630960,630.96,208.96739918126343,1.5660108730796787,1.107394029600274,0.44404592832374834,1,0,8506.0995122642398,1.5706787640975801,64.231690060878094,1.5552270587194943,1.7172108804689654,0.94919258971201692,3.6459682228324573,1.2929600279135458,1.2197594278270572,0.60967563229858679,2.7402581059784978,2.065283361083095,-25.026025955520375,-321.2861028779318,-141.2861028779318,null,630960,398110521600,null,17.699440469799093,-55.270046903190476,null,-21.117136255407548,-182.61587639346703,null,0,0]
[691830,691.83,229.1264696656861,1.5664319110372864,1.1278720141931604,0.48079955485155057,1,0,9326.7002959435413,1.5706891077388334,70.426816521070194,1.5565967128547908,1.8283770157184527,0.99209981817615744,3.9723257842183806,1.3163168446609415,1.2595529810857329,0.65354656655785737,3.1799833807711395,2.1594822137084972,-27.03870024214369,-329.86569325558901,-149.86569325558901,null,691830,478628748900,null,17.15442095894204,-57.650567253152936,null,-23.050585502618905,-185.93136910380852,null,0,0]
[758580,758.58,251.2329312869154,1.5668159463748066,1.1520127986072044,0.51954350680552419,1,0,10226.570550069899,1.5706985423033413,77.220514253799763,1.5578460381070618,1.9536853419481504,1.0334557662973036,4.3323061944829853,1.3378719177484903,1.3057959155542003,0.69848631123585903,3.7169529175197549,2.2466489748021177,-29.145637040182582,-337.3800300677504,-157.3800300677504,null,758580,575443616400,null,16.578496351484091,-59.94904803741661,null,-25.021906067061245,-188.72779530689695,null,0,0]
[831760,831.76,275.46893466399905,1.5671661454185735,1.1803791244009656,0.56013116002574259,1,0,11213.124935913238,1.5707071455892077,84.668761294741856,1.5589853207631152,2.0944187719653864,1.0730353243593245,4.72890669415131,1.3577223350040581,1.3593039103161684,0.74414004398641864,4.3699128767451283,2.3267522569967216,-31.332282133938666,-343.84094603269114,-163.84094603269114,null,831760,691824697600,null,15.97419576447394,-62.152006515986407,null,-27.016257393115502,-191.01193900174147,null,0,0]
[912010,912.01,302.0464371914822,1.5674855715476217,1.2136094349563691,0.60238195748136203,1,0,12294.991422958921,1.5707149928625088,92.83669672985198,1.5600245159255015,2.2520226748724164,1.1106878976294907,5.1656199976619712,1.3759787108523687,1.4209769483353356,0.79014658077359234,5.1616871257661527,2.4000352132295686,-33.585995169749147,-349.29832490450161,-169.29832490450161,null,912010,831762240100,null,15.343909101360076,-64.250248173317317,null,-29.021508629505469,-192.80825249996971,null,0,0]
[1000000,1000,331.18733204113926,1.5677768830458096,1.2523933935483531,0.64604487200071159,1,0,13481.20241676868,1.5707221494351922,101.79251393108373,1.5609722636400398,2.4279942854133734,1.1462992096526083,5.6461112006707364,1.3927439743058465,1.4917508829919199,0.83611163802820521,6.1194225177968251,2.4668543679265666,-35.894362715769709,-353.82310840878796,-173.82310840878796,null,1000000,1000000000000,null,14.690326304856281,-66.236734154759645,null,-31.026647414626755,-194.15169825244516,null,0,0]
[]
[]
["Pole/Zero Locations for Chart"]
[{"$f":"Q4*1000","v":52481},null,{"$f":"SQRT(1+(A617/pole1)^2)","v":17.409706479762431},{"$f":"ATAN(A617/pole1)","v":1.5133254730196506},{"$f":"SQRT(1+(A617/Zero1)^2)","v":1.0007825760175795},{"$f":"ATAN(A617/Zero1)","v":3.9549108809389624E-2},{"$f":"IF(VIN_nom>Vout, 1, SQRT(1+(A617/z_RHP)^2))","v":1},{"$f":"IF(VIN_nom>Vout, 0, -ATAN(A617/z_RHP))","v":0},{"$f":"SQRT(1+(A617/Pole2)^2)","v":707.50768879443967},{"$f":"ATAN(A617/Pole2)","v":1.5693829141227886},{"$f":"SQRT(1+(A617/Zero2)^2)","v":5.4347085745666073},{"$f":"ATAN(A617/Zero2)","v":1.3857393817958537},{"$f":"SQRT(1+(A617/pole4)^2)","v":1.0067186848094631},{"$f":"ATAN(A617/pole4)","v":0.11559655664812045},{"$f":"SQRT(1+(A617/Zero3)^2)","v":1.0416561196566458},{"$f":"ATAN(A617/Zero3)","v":0.28375939206050566},{"$f":"SQRT(1+(A617/pole5)^2)","v":1.001686001748253},{"$f":"ATAN(A617/pole5)","v":5.8028205494212538E-2},{"$f":"SQRT((1-(A617^2/(pole3^2)))^2+(A617/(Q*pole3))^2)","v":1.0043265407930131},{"$f":"ATAN((A617/(Q*pole3))/(1-A617^2/pole3^2))","v":0.20111095646999777},{"$f":"20*LOG10(((E617*K617*G617*O617)/(C617*I617*S617*M617*Q617))*Adc)","v":1.4713166779673496E-2},{"$f":"((F617+L617+H617+R617)-(D617+J617+T617+N617+T617))*radconv","v":-121.30720668499077},{"$f":"IF(V617>0,V617,V617+180)","v":58.692793315009226},"crossover",null,null,null,{"$f":"20*LOG10((K617/(I617*M617))*AEA)","v":22.486274653648614},{"$f":"(L617-(J617+N617))*radconv","v":-17.145194178981157},null,{"$f":"20*LOG10((E617*G617/(C617*S617))*Acs*Am)","v":8.307687295474885},{"$f":"(F617+H617-(D617+T617))*radconv","v":-95.963974744608137}]
[{"$f":"A617","v":52481},null,null,null,null,null,null,null,null,null,null,null,null,null,null,null,null,null,null,null,null,-180]
[{"$f":"A618","v":52481}]
[1000000]
[]
[{"$f":"pole1","v":3019.4529252507027},null,1.4142135623730951,0.78539816339744828,1.0000025914819943,2.2766099348818362E-3,{"$f":"IF(VIN_nom>Vout, 1, SQRT(1+(A622/z_RHP)^2))","v":1},{"$f":"IF(VIN_nom>Vout, 0, -ATAN(A622/z_RHP))","v":0},40.718137353465863,1.5462347771506,1.0461642514855225,0.29817968618776791,1.0000223145556846,6.6804402164876257E-3,{"$f":"SQRT(1+(A622/Zero3)^2)","v":1.0001407515452261},{"$f":"ATAN(A622/Zero3)","v":1.6777069949434838E-2},{"$f":"SQRT(1+(A622/pole5)^2)","v":1.0000055856675927},{"$f":"ATAN(A622/pole5)","v":3.3423469577730956E-3},{"$f":"SQRT((1-(A622^2/(pole3^2)))^2+(A622/(Q*pole3))^2)","v":1.0000139346896784},{"$f":"ATAN((A622/(Q*pole3))/(1-A622^2/pole3^2))","v":1.1542740081950744E-2},{"$f":"20*LOG10(((E622*K622*G622*O622)/(C622*I622*S622*M622*Q622))*Adc)","v":32.057472680612172},{"$f":"((F622+L622+H622+R622)-(D622+J622+T622+N622+T622))*radconv","v":-117.89180854260103},62.108191457398974,"p1",null,null,null,{"$f":"20*LOG10((K622/(I622*M622))*AEA)","v":33.031580931669488},{"$f":"(L622-(J622+N622))*radconv","v":-71.891050423828034},null,{"$f":"20*LOG10((E622*G622/(C622*S622))*Acs*Am)","v":30.143821880579694},{"$f":"(F622+H622-(D622+T622))*radconv","v":-45.530910201872629}]
[{"$f":"Zero1","v":1326291.1939479697},null,439.24997800639562,1.5685197168600147,1.4142135623730951,0.78539816339744828,1,0,17880.000027964201,1.5707403983833219,135.00370365289984,1.5633890548637315,3.1001316798244685,1.2423561844605004,7.4375331932032411,1.4359347142005265,1.7763440902625485,0.97284070821583057,10.473590105229414,-0.50531558095087636,-43.205197934970315,-2.827959900693489,177.17204009930651,"z1",null,null,null,{"$f":"20*LOG10((K623/(I623*M623))*AEA)","v":12.56749583289997},{"$f":"(L623-(J623+N623))*radconv","v":-71.602967060804758},null,-37.091626116237087,-15.917109766635155]
[{"$f":"Pole2","v":74.177359840490496},null,1.0003017106987275,2.4561549644296601E-2,1.0000000015639936,5.5928411574795184E-5,1,0,1.4142135623730951,0.78539816339744828,1.0000285033773921,7.5501920999562393E-3,1.0000000134672618,1.6411740717361048E-4,1.0000000849512811,4.121923703918381E-4,1.0000000033710292,8.2110038408302023E-5,1.00000000840898,2.8356226380147107E-4,63.857979498072687,-46.008667099722409,133.9913329002776,"p2",null,null,{"$f":"Pole2","v":74.177359840490496},{"$f":"20*LOG10((K624/(I624*M624))*AEA)","v":61.825482798889297},{"$f":"(L624-(J624+N624))*radconv","v":-44.5768091438716},null,33.151600072224831,-1.4203155935490839]
[{"$f":"Zero2","v":9824.3792144294057},null,3.4038995081601073,1.2726166406071286,1.0000274344659248,7.4072719311650357E-3,1,0,132.44821955842792,1.5632461346949404,1.4142135623730951,0.78539816339744828,1.0002362084932335,2.1733016690115941E-2,1.00148906692284,5.4538454337945054E-2,1.0000591312648335,1.0874589760086437E-2,1.0001476510033334,3.755953227302631E-2,16.809809564376838,-121.98471041779295,58.015289582207046,"z2",null,null,{"$f":"Zero2","v":9824.3792144294057},{"$f":"20*LOG10((K625/(I625*M625))*AEA)","v":25.402861323892466},{"$f":"(L625-(J625+N625))*radconv","v":-45.812616042939062},null,22.513641663774202,-74.643159790566145]
[{"$f":"pole3","v":416000},null,137.77693118669021,1.5635381539526103,1.0480364827176101,0.30393823004485804,1,0,5608.1802791023592,1.5706180158356313,42.355448875875275,1.547184419638983,1.3590938746091086,0.74397217890833145,2.5186746718151989,1.1625131504398614,1.1009310144255033,0.43154135003541094,1.5902682625288369,{"$error":"#DIV/0!"},-17.449761656979096,{"$error":"#DIV/0!"},{"$error":"#DIV/0!"},"p3",null,null,null,{"$f":"20*LOG10((K626/(I626*M626))*AEA)","v":19.732292651937115},{"$f":"(L626-(J626+N626))*radconv","v":-43.969112137722988},null,-13.251189595560543,{"$error":"#DIV/0!"}]
[{"$f":"Fp2_u","v":451977.40112994361},null,{"$f":"SQRT(1+(A627/pole1)^2)","v":149.69184749495679},{"$f":"ATAN(A627/pole1)","v":1.5641158865784091},{"$f":"SQRT(1+(A627/Zero1)^2)","v":1.056471961965419},{"$f":"ATAN(A627/Zero1)","v":0.32844014233439611},1,0,{"$f":"SQRT(1+(A627/Pole2)^2)","v":6093.1988977332803},{"$f":"ATAN(A627/Pole2)","v":1.570632209387723},{"$f":"SQRT(1+(A627/Zero2)^2)","v":46.016562692006879},{"$f":"ATAN(A627/Zero2)","v":1.5490633101047806},{"$f":"SQRT(1+(A627/pole4)^2)","v":1.4142135623730951},{"$f":"ATAN(A627/pole4)","v":0.78539816339744828},2.7033284847320225,1.1918794968727706,1.1181739076487012,0.46389780961856458,1.7371984720014144,-1.466735759350368,-18.734274871245034,77.620112159060938,{"$f":"IF(V627>0,V627,V627+180)","v":77.620112159060938},"p4",null,null,null,null,null,null,-14.669571867859911,13.238763694950684]
[{"$f":"z_RHP","v":0},null,{"$f":"SQRT(1+(A628/pole1)^2)","v":1},{"$f":"ATAN(A628/pole1)","v":0},{"$f":"SQRT(1+(A628/Zero1)^2)","v":1},{"$f":"ATAN(A628/Zero1)","v":0},1,0,{"$f":"SQRT(1+(A628/Pole2)^2)","v":1},{"$f":"ATAN(A628/Pole2)","v":0},{"$f":"SQRT(1+(A628/Zero2)^2)","v":1},{"$f":"ATAN(A628/Zero2)","v":0},{"$f":"SQRT(1+(A628/pole4)^2)","v":1},{"$f":"ATAN(A628/pole4)","v":0},1,0,1,0,1,0,66.870651579459249,0,{"$f":"IF(V628>0,V628,V628+180)","v":180},"z_RHP",null,null,null,null,null,null,33.154220362255472,0]
[{"$f":"Fp2_u","v":451977.40112994361},null,null,null,null,null,null,null,null,null,null,null,null,null,null,null,null,null,null,null,-25]
[]
[null,null,null,"System","Plant"]
["p1","p-dom",{"$f":"pole1","v":3019.4529252507027},{"$f":"U622","v":32.057472680612172},{"$f":"AE622","v":30.143821880579694}]
["z1","ESR zero",{"$f":"Zero1","v":1326291.1939479697},{"$f":"U623","v":-43.205197934970315},{"$f":"AE623","v":-37.091626116237087}]
["p2","EA pole",{"$f":"Pole2","v":74.177359840490496},{"$f":"U624","v":63.857979498072687},{"$f":"AE624","v":33.151600072224831}]
["z2","EA zero",{"$f":"Zero2","v":9824.3792144294057},{"$f":"U625","v":16.809809564376838},{"$f":"AE625","v":22.513641663774202}]
["p3","p_sampling",{"$f":"pole3","v":416000},{"$f":"U626","v":-17.449761656979096},{"$f":"AE626","v":-13.251189595560543}]
[]
[]
[{"$f":"Q4*1000","v":52481}]
[{"$f":"Q4*1000","v":52481}]
[]
[]
[]
[]
[]
[]
[]
[]
[]
[]
[]
[]
[]
[]
[]
[]
[]
[]
[]
[]
[]
[]
[]
[]
[]
[]
[]
[]
[]
[]
[]
[]
[]
[]
[]
[]
[]
[]
[]
[]
[]
[]
[]
[]
[]
[]
[null,null,null,null,null,null,null,null,null,null,null,null,null,null,null,null,null,null,null,null,null,null,null,null,null,null,null,null,null,null,null,null,null,"phase margin",{"$f":"SUM(AI689:AI1306)","v":0}]

{"sheet":"Bode Plot Management","index":7,"n_rows":6,"n_cols":14,"rows_kept":6,"cut":false,"hidden":true,"merged":[]}
[null,null,null,null,null,null,null,null,null,"Single or dual output (MODE)",null,null,null,"3.3V or 5V fixed (FB1/2)"]
[{"$f":"CHOOSE(BODE_PLOT_TYPE, \"BODE_PLOT_Ch1\", \"BODE_PLOT_Ch2\")","v":"BODE_PLOT_Ch1"},null,null,null,null,null,null,null,null,"With/without dither (DITH)",null,null,null,"With/without VOUT connected to VCCX"]
[null,null,null,null,null,null,null,null,null,"FPWM or DEM (DEMB)"]
[null,null,null,null,null,null,null,null,null,"Shunt or inductor DCR current sensing"]
[]
[null,null,null,null,null,{"$f":"INDIRECT(A2)","v":0}]

{"sheet":"Efficiency Calculations","index":8,"n_rows":109,"n_cols":57,"rows_kept":109,"cut":false,"hidden":true,"merged":[[6,51,6,56],[6,27,6,32],[6,33,6,36],[6,38,6,42],[6,45,6,49],[6,24,6,26],[0,0,3,3],[5,0,6,3],[6,6,6,13],[6,17,6,20],[6,21,6,23]]}
["BUCK CONTROLLER POWER DESIGN TOOL",null,null,null,null,null,null,null,null,null,null,null,null,null,null,null,null,null,null,null,null,null,null,null,null,null,null,null,null,null,null,null,null,null,null,null,null,null,null,null,{"$f":"Ext_VCC","v":1}]
[null,null,null,null,null,null,null,{"$f":"AV19","v":0.84966449187026127},"10% load"]
[null,null,null,null,null,null,null,{"$f":"AV59","v":0.94042433218056687},"50% load",null,null,null,null,null,null,null,null,null,null,null,null,null,null,null,null,null,null,null,null,null,null,null,null,null,null,null,null,null,null,{"$f":"IF(MODE=1, (Qg_Q1+Qg_Q2)*Fsw*Vin, (Qg_Q1+Qg_Q2+Qg_Q3+Qg_Q4)*Fsw*Vin)","v":0.17971199999999998}]
[null,null,null,null,null,null,null,{"$f":"AV109","v":0.93558722444956166},"100% load",null,null,null,null,null,null,null,null,null,null,null,3,null,null,null,null,null,null,null,null,null,null,null,1,null,null,null,2,null,"I_VCC",{"$f":"(Qg_Q1+Qg_Q2)*Fsw*1000","v":7.4879999999999995},"mA",{"$f":"AN4*5/1000","v":3.7440000000000001E-2}]
[null,null,null,null,null,null,null,null,null,null,null,null,null,null,null,null,null,null,null,null,null,null,null,null,null,null,null,null,null,null,null,null,null,null,null,null,null,null,null,null,null,{"$f":"VCC","v":3.3}]
["Enter the values of your design and MOSFET datasheet specifications below. Note that thermal resistance (θJA) will change when components are placed on the PCB"]
[null,null,null,null,null,null,"Operating Point Condtions",null,null,null,null,null,null,null,null,null,null,"Filter Inductor",null,null,null,"Cout",null,null,"Cin",null,null,"High-side BUCK \"Control\" MOSFET Losses ",null,null,null,null,null,"Low-side BUCK \"Sync\" MOSFET Losses ",null,null,null,"Diode/FET","\"Controller\" Losses",null,null,null,null,null,null,"RESULTS",null,null,null,null,null,"Consolidated Buck/Boost Efficiency & Losses"]
["Input Parameters",null,null,null,null,null,"Step","Vin","Mode","Iout","Iout/ phase","Iin","Duty Cycle BUCK Leg","Ripple Current pk-pk","Peak Inductor Current","Valley Inductor Current","SW node voltage at Q1 turn-on","Irms Lf","DCR    Loss","Core Loss","Total Inductor Loss","Irms Cout","Cout ESR Loss","Total Cout Loss","Irms Cin","Cin ESR Loss","Total Cin Loss","Irms","RDS(on) Loss","Transition Loss (not including capacitive loss)","MOSFET Output Capacitance Loss","Dead Time Loss ","Total Control MOSFET Loss","Irms","RDS(on) Loss","Deadtime Loss","Total Sync MOSFET Loss","Reverse Recovery Loss","IQ Loss","Switching Current Loss","Switching Current Diss from VCC","LDO Loss Saved from Gate Drive Current (ext VCC = Vout)","Total \"Control\" Loss","Total Loss (not considering total loss)","Total Loss (considering total loss)","Total Loss","Pout","EFF, h",{"$f":"IF(Vin>Vout, \"Buck ''CONTROL'' MOSFET Temp Rise\", \"Boost ''CONTROL'' MOSFET Temp Rise\")","v":"Buck ''CONTROL'' MOSFET Temp Rise"},{"$f":"IF(Vin>Vout, \"Buck ''SYNC'' MOSFET Temp Rise\", \"Boost ''SYNC'' MOSFET Temp Rise\")","v":"Buck ''SYNC'' MOSFET Temp Rise"},null,"h","Inductor Cu & Core Loss","Total MOSFET Loss","Control MOSFET Loss","SYNC MOSFET Loss","Power Loss"]
["Design","Input Value","Units","Description",null,null,0,{"$f":"Vin","v":24},{"$f":"MODE","v":1},0,{"$f":"Iout*G9/100/Number_of_Phases","v":0},{"$f":"Vout*K9/(Vin*Efficiency)","v":0},{"$f":"(Vout+(Rdson2+Rs+Rdcr)*K9)/(Vin+(Rs+Rdson2-Rdson1)*K9)","v":0.20833333333333334},{"$f":"(Vin-(Rdson1+Rdcr)*K9-Vout)*M9/(Fsw*Lf)","v":2.6454694058536363},{"$f":"K9+N9/2","v":1.3227347029268182},{"$f":"K9-N9/2","v":-1.3227347029268182},{"$f":"IF(MIN(Vin, -P9/(Coss_Q1+Coss_Q2)*0.00000002)<0, 0, MIN(Vin, -P9/(Coss_Q1+Coss_Q2)*0.00000002))","v":24},{"$f":"SQRT(K9^2+(N9^2)/12)","v":0.7636812368012581},{"$f":"R9^2*Rdcr","v":1.2247389660288287E-2},{"$f":"Core_Loss","v":0.25060402167332357},{"$f":"(T9+S9*(1+Ltc*(Ta-25)))/(1-S9*Ltc*ThetaCa)","v":0.26313004218502978},{"$f":"N9/SQRT(12)","v":0.76368123680125821},{"$f":"RCoutEsr*V9^2","v":1.1664180628845988E-3},{"$f":"W9","v":1.1664180628845988E-3},{"$f":"SQRT(M9*(1-M9))*SQRT(K9^2+(N9^2)/12)","v":0.31014349833713406},{"$f":"RCinEsr*Y9^2","v":9.6188989560795889E-5},{"$f":"Z9","v":9.6188989560795889E-5},{"$f":"SQRT(M9)*SQRT(K9^2+(N9^2)/12)","v":0.34857120011624459},{"$f":"Rdson1*AB9^2","v":4.9815771435696406E-3},{"$f":"(Vin*K9/2)*Fsw*(Tr_buck+Tf_buck)","v":0},{"$f":"(0.5*Coss_Q1*(Vin-Q9)^2-0.5*Coss_Q2*(Vin-Q9)^2+(Qoss_Q2*(Vin-Q9)/Vin)*Vin)*Fsw","v":0},{"$f":"IF(K9>N9/2,0,ABS(K9-N9/2)*Vsd_Q1*Deadtime*Fsw)","v":6.1628855278766312E-3},{"$f":"(AF9+AE9+AD9+AC9*(1+RdsonTC*(Ta-25))/(1-AC9*RdsonTC*ThetaJA_Q1))","v":1.1146647446959201E-2},{"$f":"SQRT((1-M9))*SQRT(K9^2+(N9^2)/12)","v":0.67949036041125721},{"$f":"Rdson2*AH9^2","v":9.6958501477282244E-3},{"$f":"IF(K9<N9/2,Deadtime*Fsw*Vsd_Q2*(K9+N9/2),2*Deadtime*Fsw*Vsd_Q2*K9)","v":6.1628855278766303E-3},{"$f":"(AJ9+AI9*(1+RdsonTC*(Ta-25)))/(1-AI9*RdsonTC*ThetaJA_Q2)","v":1.5872278456145267E-2},{"$f":"Qrr_Q2*K9/Iout*Fsw*Vin","v":0},{"$f":"Iq*Vin","v":8.3999999999999993E-4},{"$f":"IF(Ext_VCC=1,  (Qg_Q1+Qg_Q2)*Fsw*Vout, (Qg_Q1+Qg_Q2)*Fsw*Vin)","v":3.7440000000000001E-2},{"$f":"(Vin-VCC)*Fsw*(Qg_Q1+Qg_Q2)","v":0.15500159999999999},{"$f":"(Qg_Q1+Qg_Q2)*Fsw*(Vin-Vout)","v":0.14227200000000001},{"$f":"SUM(AM9:AN9)","v":3.8280000000000002E-2},{"$f":"SUM(S9,T9,AC9,AD9,AE9,AF9,AI9,AJ9,AQ9, AL9)","v":0.32813460968066294},{"$f":"((T9+S9*(1+Ltc*(Ta-25))) + (AF9+AE9+AD9+AC9*(1+RdsonTC*(Ta-25))) + (AJ9+AI9*(1+RdsonTC*(Ta-25))) + AQ9 + AL9) / (1-S9*Ltc*ThetaCa-AC9*RdsonTC*ThetaJA_Q1 -AI9*RdsonTC*ThetaJA_Q2)","v":0.32890771480012326},{"$f":"AS9","v":0.32890771480012326},{"$f":"Vout*K9","v":0},{"$f":"AU9/(AU9+AT9)","v":0},{"$f":"ThetaJA_Q1*BC9","v":0.24522624383310243},{"$f":"ThetaJA_Q2*BD9","v":0.34919012603519589},null,{"$f":"AV9*100","v":0},{"$f":"U9","v":0.26313004218502978},{"$f":"AG9+AK9+AL9","v":2.7018925903104469E-2},{"$f":"AG9+AL9*0.66","v":1.1146647446959201E-2},{"$f":"AK9+AL9*0.33","v":1.5872278456145267E-2},{"$f":"BA9+BB9","v":0.29014896808813423}]
[null,null,null,null,null,null,1,24,1,{"$f":"Iout*G10/100","v":0.04},0.04,9.2592592592592587E-3,0.20846437041370219,2.6467878273086467,{"$f":"K10+N10/2","v":1.3633939136543234},{"$f":"K10-N10/2","v":-1.2833939136543233},24,{"$f":"SQRT(K10^2+(N10^2)/12)","v":0.76510815154837353},1.2293200154881148E-2,0.25060402167332357,0.26317694472992281,{"$f":"N10/SQRT(12)","v":0.76406183229223601},1.1675809671315381E-3,{"$f":"W10","v":1.1675809671315381E-3},{"$f":"SQRT(M10*(1-M10))*SQRT(K10^2+(N10^2)/12)","v":0.31079497079495705},9.6593513871438201E-5,{"$f":"Z10","v":9.6593513871438201E-5},{"$f":"SQRT(M10)*SQRT(K10^2+(N10^2)/12)","v":0.34933230397819021},5.003355402711138E-3,1.0940259740259742E-3,0,5.9795889224982229E-3,{"$f":"(AF10+AE10+AD10+AC10*(1+RdsonTopTc*Ta-RdsonTopTc*25))/(1-AC10*RdsonTopTc*ThetaJA_Q1)","v":1.2082290074471603E-2},0.68070362490812275,9.7305059242242236E-3,6.3523249224982231E-3,{"$f":"(AJ10+AI10*(1+RdsonBotTc*Ta-RdsonBotTc*25))/(1-AI10*RdsonBotTc*ThetaJA_Q2)","v":1.6096614128246315E-2},5.990399999999999E-4,8.3999999999999993E-4,3.7440000000000001E-2,0.15500159999999999,0.14227200000000001,3.8280000000000002E-2,{"$f":"SUM(S10,T10,AC10,AD10,AE10,AF10,AI10,AJ10,AQ10, AL10)","v":0.32993606297416245},0.33071637167834778,{"$f":"AS10","v":0.33071637167834778},0.2,{"$f":"AU10/(AU10+AT10)","v":0.37684912445326701},0.27450844243837524,0.35847454122141892,null,{"$f":"AV10*100","v":37.684912445326702},0.26317694472992281,2.8777944202717915E-2,1.2477656474471603E-2,1.6294297328246315E-2,{"$f":"BA10+BB10","v":0.29195488893264071}]
["Vin",{"$f":"Vin","v":24},"V","Vin",null,null,2,24,1,0.08,0.08,1.8518518518518517E-2,0.20859539832211746,2.6481056979498296,1.4040528489749149,-1.2440528489749147,24,0.76861692818520644,1.2406211628150119E-2,0.25060402167332357,0.2632926518099088,0.76444226877695798,1.1687439645857258E-3,1.1687439645857258E-3,0.31229252748133268,9.7526622720678924E-5,9.7526622720678924E-5,0.35104460822511807,5.0525249955209921E-3,2.1880519480519485E-3,0,5.7962910339439235E-3,1.3042667036823502E-2,0.68376872210487671,9.8183329719076593E-3,6.5417630339439231E-3,1.6374243570098604E-2,1.1980799999999998E-3,8.3999999999999993E-4,3.7440000000000001E-2,0.15500159999999999,0.14227200000000001,3.8280000000000002E-2,0.33188527728484213,0.33267747435606837,0.33267747435606837,0.4,0.54594281112784293,0.30433479641011701,0.36893141934216928,null,54.594281112784294,0.2632926518099088,3.0614990606922108E-2,1.3833399836823501E-2,1.6769609970098603E-2,0.29390764241683093]
["Vout",{"$f":"Vout","v":5},"V","Vout",null,null,3,24,1,0.12,0.12,2.7777777777777776E-2,0.20872641705954209,2.6494230178350153,1.4447115089175075,-1.2047115089175078,24,0.7741792604340203,1.25864240730095E-2,0.25060402167332357,0.26347716745583144,0.76482254627211843,1.1699070545723336E-3,1.1699070545723336E-3,0.31462525119452656,9.8989048689218927E-5,9.8989048689218927E-5,0.35369607617619969,5.1291374864000424E-3,3.2820779220779227E-3,0,5.6129918623484525E-3,1.4030540152938271E-2,0.6886600126214143,9.9593048726582568E-3,6.7311998623484507E-3,1.6705145439007193E-2,1.7971200000000001E-3,8.3999999999999993E-4,3.7440000000000001E-2,0.15500159999999999,0.14227200000000001,3.8280000000000002E-2,0.33398227775216616,0.33479113485914774,0.33479113485914774,0.6,0.64185461075260053,0.33476606576464196,0.38056029085815823,null,64.185461075260051,0.26347716745583144,3.2532805591945463E-2,1.5216639352938271E-2,1.7298195039007192E-2,0.29600997304777688]
["Fsw",{"$f":"Fsw/1000","v":832},"kHz","Switching Frequency",null,null,4,24,1,0.16,0.16,3.7037037037037035E-2,0.20885742662693887,2.6507397870220237,1.4853698935110118,-1.1653698935110119,24,0.78175131481083138,1.2833837482377736E-2,0.25060402167332357,0.26373049810015481,0.76520266479440835,1.1710702364169275E-3,1.1710702364169275E-3,0.31777590153448337,1.0098152359605367E-4,1.0098152359605367E-4,0.35726755815546668,5.2332444325251613E-3,4.3761038961038969E-3,0,5.4296914078465069E-3,1.5045968788926466E-2,0.6953380545447615,1.0153395212059968E-2,6.9206354078465053E-3,1.7089299888485013E-2,2.3961599999999996E-3,8.3999999999999993E-4,3.7440000000000001E-2,0.15500159999999999,0.14227200000000001,3.8280000000000002E-2,0.33622708951208324,0.33705747707949407,0.33705747707949407,0.8,0.70357041409619991,0.36580355655638219,0.39336071914667026,null,70.357041409619995,0.26373049810015481,3.4531428677411484E-2,1.6627434388926464E-2,1.7880032688485013E-2,0.2982619267775663]
["Iout",{"$f":"Iout","v":4},"A","Max Output Current",null,null,5,24,1,0.2,0.2,4.6296296296296294E-2,0.2089884270252706,2.6520560055686708,1.5260280027843354,-1.1260280027843355,24,0.79127539752145581,1.3148451849177496E-2,0.25060402167332357,0.26405265257752503,0.76558262436051794,1.172233509445476E-3,1.172233509445476E-3,0.32172158537891571,1.0350477849872294E-4,1.0350477849872294E-4,0.36173354240887334,5.3648973838505594E-3,5.4701298701298716E-3,0,5.2463896705727759E-3,1.6089012723953095E-2,0.70375109166456407,1.0400577579400379E-2,7.1100696705727745E-3,1.7526688566177694E-2,2.9951999999999999E-3,8.3999999999999993E-4,3.7440000000000001E-2,0.15500159999999999,0.14227200000000001,3.8280000000000002E-2,0.33861973769702736,0.33947663679653567,0.33947663679653567,1,0.74656024041716706,0.39744858392696814,0.40733230045590924,null,74.656024041716705,0.26405265257752503,3.6610901290130796E-2,1.8065844723953096E-2,1.8515104566177693E-2,0.30066355386765581]
["Ta",{"$f":"Ta","v":25},"°C","Ambient Temperature",null,null,6,24,1,0.24,0.24,5.5555555555555552E-2,0.20911941825549968,2.6533716735327584,1.5666858367663792,-1.0866858367663792,24,0.80268202701453906,1.3530267166335555E-2,0.25060402167332357,0.26444364212554039,0.76596242498713296,1.1733968729843384E-3,1.1733968729843384E-3,0.3264345932856354,1.065595436935582E-4,1.065595436935582E-4,0.36706309297199902,5.5241478831089862E-3,6.5641558441558454E-3,0,5.0630866506619137E-3,1.715973215295492E-2,0.71383690172895853,1.0700825567669976E-2,7.2995026506619135E-3,1.8017294611894091E-2,3.5942400000000003E-3,8.3999999999999993E-4,3.7440000000000001E-2,0.15500159999999999,0.14227200000000001,3.8280000000000002E-2,0.34116024743591783,0.34204876170101151,0.34204876170101151,1.2,0.77818550865816816,0.42970247216500823,0.42247466386166999,null,77.818550865816817,0.26444364212554039,3.8771266764849009E-2,1.9531930552954921E-2,1.9203393811894089E-2,0.30321490889038938]
["Vcc",{"$f":"VCC","v":3.3},"V","Subregulated VCC Voltage",null,null,7,24,1,0.28000000000000003,0.28000000000000003,6.4814814814814811E-2,0.20925040031858863,2.6546867909720859,1.607343395486043,-1.0473433954860429,24,0.81589224973653185,1.3979283426782925E-2,0.25060402167332357,0.2649034803857323,0.76634206669093885,1.1745603263602787E-3,1.1745603263602787E-3,0.33188333600217512,1.1014654871593268E-4,1.1014654871593268E-4,0.37322090057978741,5.7110474658130898E-3,7.6581818181818209E-3,0,4.8797823482485715E-3,1.8258187689378452E-2,0.72552486004998595,1.1054112773561588E-2,7.4889343482485706E-3,1.8561102655742484E-2,4.1932800000000006E-3,8.3999999999999993E-4,3.7440000000000001E-2,0.15500159999999999,0.14227200000000001,3.8280000000000002E-2,0.3438486438541602,0.34477401142108821,0.34477401142108821,1.4000000000000001,0.80239617900986748,0.46256655476632597,0.4387874712263346,null,80.239617900986744,0.2649034803857323,4.1012570345120937E-2,2.1025752489378453E-2,1.9944885055742483E-2,0.30591605073085326]
["Components","Input Value","Units","Description",null,null,8,24,1,0.32,0.32,7.407407407407407E-2,0.20938137321549966,2.6560013579444406,1.6480006789722204,-1.0080006789722202,24,0.83082003734276055,1.4495500623454746E-2,0.25060402167332357,0.26543218340475555,0.76672154948861726,1.1757238689004523E-3,1.1757238689004523E-3,0.33803331542986814,1.1426652234050873E-4,1.1426652234050873E-4,0.3801683728475786,5.9256476602565968E-3,8.7522077922077939E-3,0,4.696476763467369E-3,1.9384440367938384E-2,0.73873807451399887,1.1460412797469663E-2,7.6783647634673683E-3,1.9158098816371864E-2,4.7923199999999992E-3,8.3999999999999993E-4,3.7440000000000001E-2,0.15500159999999999,0.14227200000000001,3.8280000000000002E-2,0.34668495207364713,0.34765255755081087,0.34765255755081087,1.6,0.8215017579993904,0.49604217449464444,0.45627041716018096,null,82.150175799939035,0.26543218340475555,4.3334859184310251E-2,2.2547371567938384E-2,2.0739564416371863E-2,0.30876704258906579]
["L",{"$f":"Lf*1000000","v":1.7984},"uH","Filter Inductance",null,null,9,24,1,0.36,0.36,8.3333333333333315E-2,0.20951233694719495,2.6573153745076037,1.6886576872538019,-0.96865768725380186,24,0.84737462197437041,1.507891874929035E-2,0.25060402167332357,0.26602976963578912,0.76710087339684818,1.1768874999324146E-3,1.1768874999324146E-3,0.34484807173810195,1.189201925814871E-4,1.189201925814871E-4,0.38786469816902314,6.1679999875156443E-3,9.8462337662337685E-3,0,4.5131698964529137E-3,2.0538551647397145E-2,0.75339546446767236,1.1919699243489654E-2,7.8677938964529133E-3,1.9808270699318283E-2,5.3913599999999996E-3,8.3999999999999993E-4,3.7440000000000001E-2,0.15500159999999999,0.14227200000000001,3.8280000000000002E-2,0.34966919721275885,0.35068458368089916,0.35068458368089916,1.7999999999999998,0.8369428105163137,0.53013068344273717,0.47492322898500228,null,83.694281051631364,0.26602976963578912,4.5738182346715422E-2,2.4096849247397144E-2,2.1587419499318285E-2,0.31176795198250451]
["Rdcr",{"$f":"Rdcr*1000","v":21},"mW","Inductor DCR at 25°C",null,null,10,24,1,0.4,0.4,9.2592592592592587E-2,0.20964329151463654,2.658628840719349,1.7293144203596746,-0.92931442035967449,24,0.86546265626661167,1.5729537797233243E-2,0.25060402167332357,0.26669625994014673,0.7674800384323095,1.1780512187841185E-3,1.1780512187841185E-3,0.35229006045140565,1.2410828669285506E-4,1.2410828669285506E-4,0.39626783137381683,6.4381559614500169E-3,1.0940259740259743E-2,0,4.3298617473397959E-3,2.1720583413365382E-2,0.7694136827548308,1.2431945719417381E-2,8.0572217473397958E-3,2.0511607395455909E-2,5.9903999999999999E-3,8.3999999999999993E-4,3.7440000000000001E-2,0.15500159999999999,0.14227200000000001,3.8280000000000002E-2,0.35280140438636354,0.35387028543189747,0.35387028543189747,2,0.84966449187026127,0.56483344309403838,0.49474566670003001,null,84.966449187026129,0.26669625994014673,4.822259080882129E-2,2.5674247413365381E-2,2.248843939545591E-2,0.31491885074896803]
["LTc",3930,"ppm","Inductor Series Resistance Temp Co",null,null,11,24,1,0.44,0.44,0.10185185185185186,0.2097742369187863,2.6599417566374401,1.76997087831872,-0.88997087831872013,24,0.88499011994030519,1.6447357760231072E-2,0.25060402167332357,0.26743167758909892,0.76785904461167609,1.1792150247839119E-3,1.1792150247839119E-3,0.36032142757354069,1.2983153116863434E-4,1.2983153116863434E-4,0.4053353651744237,6.7361670887044209E-3,1.2034285714285716E-2,0,4.1465523162625808E-3,2.2930597981123856E-2,0.78670881152486938,1.2997125836748323E-2,8.2466483162625791E-3,2.1268099479552393E-2,6.5894399999999994E-3,8.3999999999999993E-4,3.7440000000000001E-2,0.15500159999999999,0.14227200000000001,3.8280000000000002E-2,0.35608159870581835,0.35720987048969233,0.35720987048969233,2.2000000000000002,0.86031264988771194,0.60015182438472481,0.51573752295015263,null,86.031264988771198,0.26743167758909892,5.0788137460676251E-2,2.7279628381123855E-2,2.3442614679552394E-2,0.31821981504977515]
["ThetaCa",{"$f":"ThetaCa","v":22},"°C/W","Core to Ambient Thermal Resistance",null,null,12,24,1,0.48,0.48,0.1111111111111111,0.20990517316060589,2.6612541223196344,1.8106270611598172,-0.85062706115981723,24,0.90586392942332716,1.7232378631235685E-2,0.25060402167332357,0.26823604826590525,0.76823789195162118,1.1803789172605415E-3,1.1803789172605415E-3,0.36890466484327639,1.3609065174313009E-4,1.3609065174313009E-4,0.41502526719171545,7.0620848687097471E-3,1.3128311688311691E-2,0,3.9632416033558203E-3,2.4168658098466828E-2,0.80519779323015772,1.3615213210677034E-2,8.436073603355819E-3,2.2077739008928683E-2,7.1884800000000006E-3,8.3999999999999993E-4,3.7440000000000001E-2,0.15500159999999999,0.14227200000000001,3.8280000000000002E-2,0.35950980527896931,0.36070355864340897,0.36070355864340897,2.4,0.8693436107929472,0.63608720776627026,0.5378986229964311,null,86.934361079294717,0.26823604826590525,5.3434877107395515E-2,2.8913054898466829E-2,2.4449937408928684E-2,0.32167092537330078]
["Cin",{"$f":"Cin*1000000","v":20},"μF","Input Capacitance",null,null,13,24,1,0.52,0.52,0.12037037037037036,0.21003610024105701,2.6625659378236795,1.8512829689118397,-0.81128296891183971,24,0.92799323692124724,1.8084600403203057E-2,0.25060402167332357,0.2691094000680585,0.76861658046881487,1.1815428955431484E-3,1.1815428955431484E-3,0.37800313939328384,1.4288637339117838E-4,1.4288637339117838E-4,0.42529647603628995,7.4159607936843492E-3,1.4222337662337665E-2,0,3.7799296087540437E-3,2.5434826948567194E-2,0.82479958489483229,1.4286181460096442E-2,8.625497608754043E-3,2.2940519522222622E-2,7.7875199999999992E-3,8.3999999999999993E-4,3.7440000000000001E-2,0.15500159999999999,0.14227200000000001,3.8280000000000002E-2,0.36308604921015308,0.36435158182570043,0.36435158182570043,2.6,0.87708894448974173,0.67264098326847821,0.56122882468889768,null,87.708894448974178,0.2691094000680585,5.6162866470789816E-2,3.0574590148567192E-2,2.5510401122222623E-2,0.32527226653884833]
["RCinEsr",{"$f":"RCinEsr*1000","v":1},"mW","Input Capacitor ESR",null,null,14,24,1,0.56000000000000005,0.56000000000000005,0.12962962962962962,0.21016701816110106,2.6638772032073161,1.8919386016036581,-0.77193860160365801,24,0.95129042856565937,1.9004023069093354E-2,0.25060402167332357,0.27005176350973958,0.76899511017992572,1.1827069589612723E-3,1.1827069589612723E-3,0.3875815015301875,1.5021942032839475E-4,1.5021942032839475E-4,0.43610936054728106,7.797846348635294E-3,1.5316363636363642E-2,0,3.5966163325917631E-3,2.6729168152863591E-2,0.84543604437217923,1.5010004207597226E-2,8.8149203325917636E-3,2.385643603825649E-2,8.3865600000000012E-3,8.3999999999999993E-4,3.7440000000000001E-2,0.15500159999999999,0.14227200000000001,3.8280000000000002E-2,0.36681035560019665,0.36815418415544293,0.36815418415544293,2.8000000000000003,0.88379537018853005,0.70981455056299891,0.58572801844164279,null,88.379537018853,0.27005176350973958,5.8972164191120086E-2,3.2264297752863588E-2,2.662400083825649E-2,0.32902392770085964]
["Cout",{"$f":"Cout*1000000","v":60},"μF","Output Capcitance",null,null,15,24,1,0.6,0.6,0.13888888888888887,0.21029792692169946,2.6651879185282774,1.9325939592641386,-0.73259395926413873,24,0.97567184720192901,1.9990646621870913E-2,0.25060402167332357,0.27106317152448545,0.76937348110161974,1.1838711068448489E-3,1.1838711068448489E-3,0.39760598085469256,1.5809051601142215E-4,1.5809051601142215E-4,0.4474260536086343,8.207793011359656E-3,1.6410389610389611E-2,0,3.4133017750034751E-3,2.8051745773969707E-2,0.86703257146120405,1.5786655079467186E-2,9.0043417750034736E-3,2.4825485055008121E-2,8.9855999999999998E-3,8.3999999999999993E-4,3.7440000000000001E-2,0.15500159999999999,0.14227200000000001,3.8280000000000002E-2,0.37068274954641783,0.37211162198285364,0.37211162198285364,3,0.88965026556148041,0.74760931902733352,0.61139612721017866,null,88.965026556148047,0.27106317152448545,6.1862830828977824E-2,3.3982241773969704E-2,2.7790733055008121E-2,0.33292600235346326]
["RCoutEsr",{"$f":"Cout_ESR*1000","v":2},"mW","Output Capacitor ESR",null,null,16,24,1,0.64,0.64,0.14814814814814814,0.21042882652381334,2.6664980838442855,1.9732490419221427,-0.69324904192214276,24,1.0010582746584256,2.1044471054504185E-2,0.25060402167332357,0.27214365946806884,0.76975169325055981,1.1850353385242079E-3,1.1850353385242079E-3,0.40804458474311156,1.6650038313817836E-4,1.6650038313817836E-4,0.45921067624958739,8.6458522524457387E-3,1.7504415584415588E-2,0,3.2299859361236477E-3,2.9402624318605946E-2,0.88951853498423539,1.6616107705690511E-2,9.1937619361236456E-3,2.5847664548685329E-2,9.5846399999999984E-3,8.3999999999999993E-4,3.7440000000000001E-2,0.15500159999999999,0.14227200000000001,3.8280000000000002E-2,0.37470325614262684,0.376224163937046,0.376224163937046,3.2,0.89479849509129694,0.7860267078093307,0.63823310647107723,null,89.479849509129693,0.27214365946806884,6.483492886729128E-2,3.5728486718605942E-2,2.9010595748685329E-2,0.3369785883353601]
["Top Driver","Input Value","Units","Description",null,null,17,24,1,0.68,0.68,0.15740740740740741,0.21055971696840381,2.6678076992130588,2.0139038496065296,-0.65390384960652936,24,1.0273752122107287,2.2165496359965835E-2,0.25060402167332357,0.27329326512159113,0.77012974664340783,1.1861996533300793E-3,1.1861996533300793E-3,0.41886721481646771,1.7544974364810492E-4,1.7544974364810492E-4,0.471429469552753,9.1120755352743932E-3,1.8598441558441561E-2,0,3.0466688160867418E-3,3.078186874055381E-2,0.9128275203466697,1.7498335719947244E-2,9.3831808160867412E-3,2.6922973972903826E-2,1.0183680000000001E-2,8.3999999999999993E-4,3.7440000000000001E-2,0.15500159999999999,0.14227200000000001,3.8280000000000002E-2,0.378871900479126,0.38049209097604014,0.38049209097604014,3.4000000000000004,0.89935381907443546,0.8250681458921838,0.66623894420388419,null,89.935381907443542,0.27329326512159113,6.7888522713457633E-2,3.7503097540553809E-2,3.0283588372903826E-2,0.34118178783504877]
["RdsonDRT",1,"W","Drain to Source Resistance of pullup Top FET Driver",null,null,18,24,1,0.72,0.72,0.16666666666666663,0.21069059825643177,2.6691167646923044,2.0545583823461522,-0.61455838234615223,24,1.0545529978606067,2.3353722531232652E-2,0.25060402167332357,0.27451202869478869,0.77050764129682248,1.1873640505935857E-3,1.1873640505935857E-3,0.43004571701438138,1.8493931872241341E-4,1.8493931872241341E-4,0.48405085189472147,9.6065143160202291E-3,1.9692467532467537E-2,0,2.8633504150271921E-3,3.2189544443633061E-2,0.93689743199391218,1.8433312759612536E-2,9.5725984150271913E-3,2.8051414257967984E-2,1.0782719999999999E-2,8.3999999999999993E-4,3.7440000000000001E-2,0.15500159999999999,0.14227200000000001,3.8280000000000002E-2,0.38318870764271085,0.38491569643924534,0.38491569643924534,3.5999999999999996,0.90340681566157344,0.86473507215992729,0.69541366087529566,null,90.340681566157343,0.27451202869478869,7.1023678701601048E-2,3.930613964363306E-2,3.1609711857967987E-2,0.34553570739638972]
["RdsonDRT2",1,"W","Drain to Source Resistance of pulldown Top FET Driver",null,null,19,24,1,0.76,0.76,0.1759259259259259,0.2108214703888581,2.6704252803397233,2.0952126401698616,-0.57521264016986162,24,1.0825267963533856,2.4609149561285612E-2,0.25060402167332357,0.27579999282955336,0.77088537722746053,1.1885285296462482E-3,1.1885285296462482E-3,0.44155387982027172,1.9496982878433497E-4,1.9496982878433497E-4,0.49704541785049106,1.012922004365294E-2,2.0786493506493513E-2,0,2.6800307330794191E-3,3.3625717284702081E-2,0.96167048276265343,1.9421012465756057E-2,9.7620147330794178E-3,2.923298781025481E-2,1.1381760000000001E-2,8.3999999999999993E-4,3.7440000000000001E-2,0.15500159999999999,0.14227200000000001,3.8280000000000002E-2,0.3876537027166706,0.3894952861024355,0.3894952861024355,3.8,0.9070304990210909,0.90502893546344576,0.7257573094256059,null,90.703049902109086,0.27579999282955336,7.4240465094956895E-2,4.1137678884702079E-2,3.2988968610254812E-2,0.35004045792451027]
["Bottom Driver","Input Value","Units","Description",null,null,20,24,1,0.8,0.8,0.18518518518518517,0.21095233336664335,2.6717332462130052,2.1358666231065024,-0.53586662310650257,24,1.1112364936906951,2.5931777443109798E-2,0.25060402167332357,0.27715720260366683,0.77126295445197568,1.1896930898199808E-3,1.1896930898199808E-3,0.45336739351145011,2.0554199349936606E-4,2.0554199349936606E-4,0.51038589322051209,1.0680244159938498E-2,2.1880519480519486E-2,0,2.4967097703778164E-3,3.5090453576681412E-2,0.98709309840130599,2.0461408483141298E-2,9.9514297703778148E-3,3.0467698511700555E-2,1.19808E-2,8.3999999999999993E-4,3.7440000000000001E-2,0.15500159999999999,0.14227200000000001,3.8280000000000002E-2,0.39226691078078835,0.39423117823523346,0.39423117823523346,4,0.91028437916787974,0.94595119468699096,0.75726997525741213,null,91.028437916787979,0.27715720260366683,7.7538952088381963E-2,4.299778157668141E-2,3.4421362511700554E-2,0.35469615469204879]
["RdsonDRB",1,"W","Drain to Source Resistance of pullup Bottom FET Driver",null,null,21,24,1,0.84,0.84,0.19444444444444445,0.21108318719074814,2.6730406623698366,2.1765203311849182,-0.49652033118491834,24,1.1406265231106751,2.73216061696945E-2,0.25060402167332357,0.27858370553475115,0.77164037298702037,1.1908577304470958E-3,1.1908577304470958E-3,0.46546378137887112,2.1665653177551752E-4,2.1665653177551752E-4,0.5240470584771455,1.1259638099440498E-2,2.2974545454545459E-2,0,2.3133875270567711E-3,3.6583820091601056E-2,1.0131157612657098,2.1554474460224973E-2,1.014084352705677E-2,3.1755551719390269E-2,1.2579839999999998E-2,8.3999999999999993E-4,3.7440000000000001E-2,0.15500159999999999,0.14227200000000001,3.8280000000000002E-2,0.39702835691134253,0.3991237036611297,0.3991237036611297,4.2,0.91321744545740147,0.98750331881522313,0.78995177622658597,null,91.321744545740145,0.27858370553475115,8.0919211810991321E-2,4.4886514491601054E-2,3.5906898919390272E-2,0.35950291734574247]
["RdsonDRB2",1,"W","Drain to Source Resistance of pulldown Bottom FET Driver",null,null,22,24,1,0.88,0.88,0.20370370370370372,0.21121403186213281,2.6743475288678917,2.2171737644339458,-0.45717376443394586,24,1.1706456446893525,2.8778635734033147E-2,0.25060402167332357,0.28007955158443448,0.77201763284924396,1.1920224508603001E-3,1.1920224508603001E-3,0.47782231191475494,2.2831416176356136E-4,2.2831416176356136E-4,0.53800565074377071,1.1867453289521357E-2,2.4068571428571432E-2,0,2.1300640032506403E-3,3.8105884063671401E-2,1.0396928129009653,2.2700184049156354E-2,1.0330256003250639E-2,3.3096554265249829E-2,1.3178879999999999E-2,8.3999999999999993E-4,3.7440000000000001E-2,0.15500159999999999,0.14227200000000001,3.8280000000000002E-2,0.40193806618110722,0.40417320582005339,0.40417320582005339,4.4000000000000004,0.9158703925723547,1.0296867870007707,0.82380286263549629,null,91.587039257235475,0.28007955158443448,8.4381318328921234E-2,4.6803944863671398E-2,3.7445584665249831E-2,0.36446086991335569]
["Deadtime","Input Value","Units","Description",null,null,23,24,1,0.92,0.92,0.21296296296296297,0.2113448673817577,2.6756538457648391,2.2578269228824195,-0.41782692288241952,24,1.2012466962270274,3.0302866129123314E-2,0.25060402167332357,0.281644793162733,0.77239473405529369,1.1931872503926958E-3,1.1931872503926958E-3,0.49042389914978474,2.4051560085727822E-4,2.4051560085727822E-4,0.55224025238101215,1.2503741150343604E-2,2.5162597402597405E-2,0,1.9467391990937691E-3,3.9656713192378297E-2,1.066782231219898,2.3898510905776583E-2,1.0519667199093767E-2,3.4490714455840593E-2,1.3777920000000001E-2,8.3999999999999993E-4,3.7440000000000001E-2,0.15500159999999999,0.14227200000000001,3.8280000000000002E-2,0.40699606365935198,0.40938004083351931,0.40938004083351931,4.6000000000000005,0.91827730427787591,1.0725030886323226,0.85882341722849309,null,91.827730427787586,0.281644793162733,8.7925347648218882E-2,4.8750140392378294E-2,3.9037428055840595E-2,0.36957014081095185]
["Deadtime",15,"ns","Total Deadtime",null,null,24,24,1,0.96,0.96,0.22222222222222221,0.21147569375058284,2.676959613118338,2.2984798065591692,-0.37847980655916902,24,1.2323863291147343,3.1894297347966699E-2,0.25060402167332357,0.28327948513265111,0.77277167662181445,1.1943521283777803E-3,1.1943521283777803E-3,0.50325099671406948,2.532615656937044E-4,2.532615656937044E-4,0.5667311724496239,1.3168553094871138E-2,2.6256623376623382E-2,0,1.76341311472048E-3,4.1236375645602369E-2,1.0943453944540384,2.5149428689618065E-2,1.0709077114720481E-2,3.5938042072256524E-2,1.4376960000000001E-2,8.3999999999999993E-4,3.7440000000000001E-2,0.15500159999999999,0.14227200000000001,3.8280000000000002E-2,0.41220237441184382,0.41474457757237593,0.41474457757237593,4.8,0.92046694302993992,1.1159537234032522,0.8950136551896436,null,92.046694302993998,0.28327948513265111,9.1551377717858901E-2,5.0725169245602372E-2,4.0682438872256525E-2,0.37483086285051004]
["IQ","Input Value","Units","Description",null,null,25,24,1,1,1,0.23148148148148145,0.21160651096956828,2.6782648309860395,2.3391324154930198,-0.33913241549301976,22.60882769953465,1.2640247395026425,3.3552929383569186E-2,0.25060402167332357,0.28498368481499847,0.77314846056544873,1.1955170841494464E-3,1.1955170841494464E-3,0.51628748982846728,2.6655277215337968E-4,2.6655277215337968E-4,0.58146032578350204,1.3861940528870511E-2,2.7350649350649354E-2,2.2343997165997281E-3,1.5800857502650777E-3,4.5082068742497441E-2,1.1223468410498008,2.6452911063903801E-2,1.0898485750265077E-2,3.7438548370123774E-2,1.4976E-2,8.3999999999999993E-4,3.7440000000000001E-2,0.15500159999999999,0.14227200000000001,3.8280000000000002E-2,0.41979142321744628,0.42251609992411471,0.42251609992411471,5,0.92208117188807837,1.2092570323349439,0.93237382414272307,null,92.208117188807833,0.28498368481499847,9.7496617112621212E-2,5.4966228742497444E-2,4.2380628370123775E-2,0.38248030192761967]
["IQ ",{"$f":"Iq*1000","v":3.4999999999999996E-2},"mA","Quiescent Current Of Controller (Not Switching!)",null,null,26,24,1,1.04,1.04,0.24074074074074073,0.21173731903967388,2.6795694994255888,2.3797847497127944,-0.29978474971279434,19.985649980852958,1.2961254023129829,3.527876222894083E-2,0.25060402167332357,0.28675745199342662,0.77352508590283731,1.1966821170419837E-3,1.1966821170419837E-3,0.52951858830507048,2.8038993536059473E-4,2.8038993536059473E-4,0.59641111313917239,1.4583954850912174E-2,2.8444675324675331E-2,6.0094941790896821E-3,1.3967571058618514E-3,5.0499692160819371E-2,1.1507540322089187,2.7808931695546789E-2,1.108789310586185E-2,3.8992246079702642E-2,1.5575039999999998E-2,8.3999999999999993E-4,3.7440000000000001E-2,0.15500159999999999,0.14227200000000001,3.8280000000000002E-2,0.42906953016421201,0.43199881728942674,0.43199881728942674,5.2,0.92329564843599532,1.3371428083380261,0.97090420415345813,null,92.329564843599528,0.28675745199342662,0.10506697824052201,6.0779218560819373E-2,4.4132009279702643E-2,0.39182443023394864]
["High-side FET","Input Value","Units","Description",null,null,27,24,1,1.08,1.08,0.25,0.21186811796185936,2.6808736184946191,2.4204368092473096,-0.2604368092473095,17.362453949820633,1.3286548134090495,3.7071795877095762E-2,0.25060402167332357,0.28860084891968463,0.77390155265061722,1.1978472263900722E-3,1.1978472263900722E-3,0.54293072272955489,2.9477376968363683E-4,2.9477376968363683E-4,0.61156830486975178,1.5334647452371727E-2,2.9538701298701304E-2,9.2121046966591961E-3,1.2134271816450644E-3,5.5373604483234029E-2,1.1795371217870907,2.9217464255149254E-2,1.1277299181645065E-2,4.0599149406091772E-2,1.617408E-2,8.3999999999999993E-4,3.7440000000000001E-2,0.15500159999999999,0.14227200000000001,3.8280000000000002E-2,0.43792354161659086,0.44106649914316165,0.44106649914316165,5.4,0.92448870438166342,1.4530669402311487,1.010605107734019,null,92.448870438166338,0.28860084891968463,0.11214683388932581,6.6048497283234031E-2,4.5936595806091773E-2,0.40074768280901041]
["RdsonTop",{"$f":"Rdson1*1000","v":41},"mW","Drain-Source Resistance of Top FET ",null,null,28,24,1,1.1200000000000001,1.1200000000000001,0.25925925925925924,0.2119989077370843,2.6821771882507597,2.4610885941253802,-0.22108859412537973,14.73923960835865,1.3615822434816034,3.8932030321052323E-2,0.25060402167332357,0.29051394031909561,0.77427786082542482,1.1990124115287919E-3,1.1990124115287919E-3,0.5565114452866522,3.0970498873503851E-4,3.0970498873503851E-4,0.62691792977155647,1.6114069717431224E-2,3.0632727272727284E-2,1.1842219277585248E-2,1.0300959777489694E-3,5.9703774474509017E-2,1.2086687367080122,3.0678482417002186E-2,1.146670397774897E-2,4.225927402953495E-2,1.6773120000000002E-2,8.3999999999999993E-4,3.7440000000000001E-2,0.15500159999999999,0.14227200000000001,3.8280000000000002E-2,0.44635347063461972,0.44971908186548187,0.44971908186548187,5.6000000000000005,0.92566281578039711,1.5570287408391983,1.0514768798497689,null,92.566281578039707,0.29051394031909561,0.11873616850404398,7.0774033674509018E-2,4.7794403629534951E-2,0.40925010882313961]
["RdsonTopTc",{"$f":"RdsonTopTc*1000000","v":4000},"ppm","Drain to Source Resistance Temp Co",null,null,29,24,1,1.1599999999999999,1.1599999999999999,0.26851851851851849,0.21212968836630819,2.6834802087516305,2.5017401043758154,-0.18174010437581534,12.11600695838769,1.394879505870241,4.0859465553832963E-2,0.25060402167332357,0.29249679339625428,0.77465401044389359,1.2001776717936159E-3,1.2001776717936159E-3,0.57024933614325535,3.2518430537182343E-4,3.2518430537182343E-4,0.64244717013665398,1.692227302308039E-2,3.1726753246753246E-2,1.3899825931738349E-2,8.4676349430779885E-4,6.3490162708231088E-2,1.2381237698551035,3.2191959859084483E-2,1.1656107494307798E-2,4.3972637105829868E-2,1.7372159999999998E-2,8.3999999999999993E-4,3.7440000000000001E-2,0.15500159999999999,0.14227200000000001,3.8280000000000002E-2,0.4543593302764285,0.45795646929663902,0.45795646929663902,5.8,0.92682012546052261,1.649027342781084,1.0935198979282572,null,92.682012546052263,0.29249679339625428,0.12483495981406095,7.4955788308231089E-2,4.9705449905829868E-2,0.41733175321031524]
["QgTop",{"$f":"Qg_Q1*1000000000","v":3},"nC","Gate Charge Of Top FET",null,null,30,24,1,1.2,1.2,0.27777777777777773,0.2122604598504903,2.6847826800548402,2.5423913400274198,-0.14239134002742015,9.4927560018280097,1.428520739527503,4.2854101568464295E-2,0.25060402167332357,0.29454947784094715,0.77503000152265344,1.2013430065204085E-3,1.2013430065204085E-3,0.5841339158923694,3.4121243169575371E-4,3.4121243169575371E-4,0.65814426358193101,1.7759308739117893E-2,3.2820779220779223E-2,1.5384912670582307E-2,6.6342973145575609E-4,6.6732721538357687E-2,1.2678791865057182,3.3757870263062442E-2,1.1845509731455754E-2,4.5739257266839563E-2,1.79712E-2,8.3999999999999993E-4,3.7440000000000001E-2,0.15500159999999999,0.14227200000000001,3.8280000000000002E-2,0.46194113359824124,0.4657785326564402,0.4657785326564402,6,0.92796249820436139,1.7290616978438691,1.1367345718704704,null,92.796249820436145,0.29454947784094715,0.13044317880519724,7.8593713538357687E-2,5.1669753266839563E-2,0.42499265664614438]
["QgdTop",{"$f":"Qgd_Q1*1000000000","v":1},"nC","Gate to Drain Charge",null,null,31,24,1,1.24,1.24,0.28703703703703703,0.2123912221905899,2.6860846022179943,2.5830423011089971,-0.10304230110899715,6.8694867405998101,1.4624822075918451,4.4915938357977053E-2,0.25060402167332357,0.29667206583429562,0.77540583407833397,1.2025084150454335E-3,1.2025084150454335E-3,0.59815556425864369,3.5779007905357643E-4,3.5779007905357643E-4,0.67399841188480214,1.862522822815265E-2,3.3914805194805199E-2,1.6297467507173712E-2,4.8009468932703949E-4,6.9431395070444574E-2,1.2979138447136933,3.5376187314289105E-2,1.2034910689327039E-2,4.7559154621106069E-2,1.8570239999999998E-2,8.3999999999999993E-4,3.7440000000000001E-2,0.15500159999999999,0.14227200000000001,3.8280000000000002E-2,0.4690988936543754,0.47318511045713724,0.47318511045713724,6.2,0.92909156532828108,1.7971305763497807,1.1811213440643336,null,92.909156532828106,0.29667206583429562,0.13556078969155064,8.1687753470444574E-2,5.3687333821106069E-2,0.43223285552584623]
["QgsTop",{"$f":"Qgs_Q1*1000000000","v":1},"nC",null,null,null,32,{"$f":"Vin","v":24},{"$f":"MODE","v":1},1.28,{"$f":"Iout*G41/100/Number_of_Phases","v":1.28},{"$f":"Vout*K41/(Vin*Efficiency)","v":0.29629629629629628},{"$f":"(Vout+(Rdson2+Rs+Rdcr)*K41)/(Vin+(Rs+Rdson2-Rdson1)*K41)","v":0.21252197538756593},{"$f":"(Vin-(Rdson1+Rdcr)*K41-Vout)*M41/(Fsw*Lf)","v":2.6873859752986862},2.6236929876493429,-6.3692987649343058E-2,{"$f":"IF(MIN(Vin, -P41/(Coss_Q1+Coss_Q2)*0.00000002)<0, 0, MIN(Vin, -P41/(Coss_Q1+Coss_Q2)*0.00000002))","v":4.2461991766228708},1.4967421115050759,{"$f":"R41^2*Rdcr","v":4.7044975915406129E-2},{"$f":"Core_Loss","v":0.25060402167332357},{"$f":"(T41+S41*(1+Ltc*(Ta-25)))/(1-S41*Ltc*ThetaCa)","v":0.29886463205512354},0.77578150812756075,1.2036738967053453E-3,1.2036738967053453E-3,0.61230544504950379,3.7491795803727094E-4,3.7491795803727094E-4,0.68999969681161633,{"$f":"Rdson1*AB41^2","v":1.9520082845605021E-2},{"$f":"(Vin*K41/2)*Fsw*(Tr_buck+Tf_buck)","v":3.5008831168831175E-2},{"$f":"(0.5*Coss_Q1*(Vin-Q41)^2-0.5*Coss_Q2*(Vin-Q41)^2+(Qoss_Q2*(Vin-Q41)/Vin)*Vin)*Fsw","v":1.6637478456161897E-2},{"$f":"IF(K41>N41/2,0,ABS(K41-N41/2)*Vsd_Q1*Deadtime*Fsw)","v":2.9675836805581921E-4},{"$f":"(AF41+AE41+AD41+AC41*(1+RdsonTopTc*Ta-RdsonTopTc*25))/(1-AC41*RdsonTopTc*ThetaJA_Q1)","v":7.1586119132547435E-2},{"$f":"SQRT((1-M41))*SQRT(K41^2+(N41^2)/12)","v":1.3282083295750522},{"$f":"Rdson2*AH41^2","v":3.7046884701803562E-2},{"$f":"IF(K41<N41/2,Deadtime*Fsw*Vsd_Q2*(K41+N41/2),2*Deadtime*Fsw*Vsd_Q2*K41)","v":1.2224310368055817E-2},{"$f":"(AJ41+AI41*(1+RdsonBotTc*Ta-RdsonBotTc*25))/(1-AI41*RdsonBotTc*ThetaJA_Q2)","v":4.9432350754566409E-2},{"$f":"Qrr_Q2*K41/Iout*Fsw*Vin","v":1.9169279999999997E-2},{"$f":"Iq*Vin","v":8.3999999999999993E-4},{"$f":"IF(Ext_VCC=1,  (Qg_Q1+Qg_Q2)*Fsw*Vout, (Qg_Q1+Qg_Q2)*Fsw*Vin)","v":3.7440000000000001E-2},{"$f":"(Vin-VCC)*Fsw*(Qg_Q1+Qg_Q2)","v":0.15500159999999999},{"$f":"(Qg_Q1+Qg_Q2)*Fsw*(Vin-Vout)","v":0.14227200000000001},{"$f":"SUM(AM41:AN41)","v":3.8280000000000002E-2},0.47583262349724303,{"$f":"((T41+S41*(1+Ltc*(Ta-25))) + (AF41+AE41+AD41+AC41*(1+RdsonTC*(Ta-25))) + (AJ41+AI41*(1+RdsonTC*(Ta-25))) + AQ41 + AL41) / (1-S41*Ltc*ThetaCa-AC41*RdsonTC*ThetaJA_Q1 -AI41*RdsonTC*ThetaJA_Q2)","v":0.48017600840969477},0.48017600840969477,{"$f":"Vout*K41","v":6.4},0.93020876096443295,{"$f":"ThetaJA_Q1*BC41","v":1.8532325665160436},{"$f":"ThetaJA_Q2*BD41","v":1.2266806894004609},null,93.020876096443288,{"$f":"U41","v":0.29886463205512354},{"$f":"AG41+AK41+AL41","v":0.14018774988711385},{"$f":"AG41+AL41*0.66","v":8.4237843932547435E-2},{"$f":"AK41+AL41*0.33","v":5.5758213154566409E-2},0.43905238194223739]
["RGateTop",{"$f":"Rgate1","v":1},"W","Gate Resistance",null,null,33,24,1,{"$f":"Iout*G42/100","v":1.32},1.32,0.30555555555555558,0.2126527194423774,2.6886867993545058,2.6643433996772528,-2.4343399677252853E-2,1.6228933118168569,1.53128042024268,4.9241214233790576E-2,0.25060402167332357,0.30112725368655041,0.77615702368695871,1.2048394508371964E-3,1.2048394508371964E-3,0.62657543718557518,3.9259677848429465E-4,3.9259677848429465E-4,0.70613900275540198,2.044392393970814E-2,3.6102857142857152E-2,1.640493353378859E-2,1.1342076777625648E-4,7.3196821245793756E-2,1.3587448009858971,3.8769936118330316E-2,1.2413708767776255E-2,5.1358868731371174E-2,1.9768319999999999E-2,8.3999999999999993E-4,3.7440000000000001E-2,0.15500159999999999,0.14227200000000001,3.8280000000000002E-2,0.48214233617735081,0.48675099932339227,0.48675099932339227,6.6000000000000005,0.93131535179239899,1.8973660738074627,1.2734131152901658,null,93.131535179239904,0.30112725368655041,0.14432400997716494,8.6243912445793755E-2,5.7882414331371174E-2,0.44545126366371535]
["GfsTop",{"$f":"Gfs_Q1","v":100},"S","Transconductance of Top FET",null,null,34,24,1,1.36,1.36,0.31481481481481483,0.21278345435598303,2.6899870744430285,2.7049935372215144,1.500646277848583E-2,0,1.5660787139825425,5.1504653306173501E-2,0.25060402167332357,0.30346001042281034,0.77653238077314823,1.2060050767784274E-3,1.2060050767784274E-3,0.64095807154433282,4.1082724947783005E-4,4.1082724947783005E-4,0.72240794588702406,2.1396802851509088E-2,3.7196883116883121E-2,1.5974400000000007E-2,0,7.4708756479355196E-2,1.3895068542862625,4.0545315260278603E-2,1.2673024E-2,5.340890156642962E-2,2.0367360000000001E-2,8.3999999999999993E-4,3.7440000000000001E-2,0.15500159999999999,0.14227200000000001,3.8280000000000002E-2,0.48854246020816783,0.49342938419701871,0.49342938419701871,6.8000000000000007,0.93234603940004501,1.9393267097458142,1.3228628680614516,null,93.234603940004504,0.30346001042281034,0.14848501804578482,8.8151214079355195E-2,6.013013036642962E-2,0.45194502846859519]
["VthTop",{"$f":"Vth_Q1","v":1.5},"V","Threshold Voltage of Top FET",null,null,35,24,1,1.4,1.4,0.32407407407407407,0.21291418012934157,2.6912868006218287,2.7456434003109145,5.4356599689085572E-2,0,1.601120041387728,5.3835293125602236E-2,0.25060402167332357,0.30586298447629917,0.77690757940274979,1.2071707738668801E-3,1.2071707738668801E-3,0.6554464732890336,4.2961007934703185E-4,4.2961007934703185E-4,0.73879880945389609,2.2378770914870266E-2,3.8290909090909091E-2,1.5974400000000007E-2,0,7.6795315465727931E-2,1.4204793930511437,4.2372995827741858E-2,1.3045759999999998E-2,5.5626176027517855E-2,2.0966399999999996E-2,8.3999999999999993E-4,3.7440000000000001E-2,0.15500159999999999,0.14227200000000001,3.8280000000000002E-2,0.49574855063244705,0.50093460381518484,0.50093460381518484,7,0.9332170415723402,1.9939290682460145,1.3759919366053928,null,93.321704157234024,0.30586298447629917,0.15338789149324578,9.063313946572793E-2,6.2545088027517848E-2,0.45925087596954495]
["VspTop",{"$f":"Vsp_Q1","v":1.54},"V",null,null,null,36,24,1,1.44,1.44,0.33333333333333326,0.21304489676341143,2.6925859779484673,2.7862929889742336,9.3707011025766285E-2,0,1.6363887895975062,5.6233133685128223E-2,0.25060402167332357,0.30833626058484992,0.77728261959237976,1.2083365414407843E-3,1.2083365414407843E-3,0.67003430932100172,4.4894597566727182E-4,4.4894597566727182E-4,0.75530448482182644,2.3389879456470555E-2,3.9384935064935074E-2,1.5974400000000007E-2,0,7.8911639089294619E-2,1.4516485132181367,4.4252951524496965E-2,1.3418495999999999E-2,5.7896913142078066E-2,2.1565439999999998E-2,8.3999999999999993E-4,3.7440000000000001E-2,0.15500159999999999,0.14227200000000001,3.8280000000000002E-2,0.50310325740435435,0.50860354323340951,0.50860354323340951,7.1999999999999993,0.93402131263063071,2.0491862487644816,1.4302971835257177,null,93.402131263063069,0.30833626058484992,0.15837399223137266,9.3144829489294617E-2,6.5013508342078072E-2,0.46671025281622258]
["VsdTop",{"$f":"Vsd_Q1","v":0.7},"V",null,null,null,37,24,1,1.48,1.48,0.34259259259259256,0.21317560425915108,2.6938846064805007,2.8269423032402505,0.13305769675974966,0,1.6718705659887021,5.8698174977807049E-2,0.25060402167332357,0.31087992601923869,0.77765750135865308,1.2095023788387671E-3,1.2095023788387671E-3,0.68471574047949757,4.688356452603867E-4,4.688356452603867E-4,0.77191841783971049,2.4430179795806636E-2,4.0478961038961044E-2,1.5974400000000007E-2,0,8.1057803425382796E-2,1.483001397713172,4.6185156058003655E-2,1.3791231999999999E-2,6.0221144478106399E-2,2.216448E-2,8.3999999999999993E-4,3.7440000000000001E-2,0.15500159999999999,0.14227200000000001,3.8280000000000002E-2,0.51060660554390191,0.51643676019646578,0.51643676019646578,7.4,0.93476398841545871,2.1050999249584215,1.4857793033183408,null,93.476398841545873,0.31087992601923869,0.1634434279034892,9.5686360225382794E-2,6.7535422878106405E-2,0.4743233539227279]
["θJATop",{"$f":"ThetaJA_Q1","v":22},"°C/W","Junction to Ambient Resistance",null,null,38,24,1,1.52,1.52,0.3518518518518518,0.21330630261751868,2.6951826862754742,2.8675913431377369,0.17240865686226292,0,1.7075520907720279,6.12304169966984E-2,0.25060402167332357,0.31349407059092099,0.7780322247181819,1.210668285399847E-3,1.210668285399847E-3,0.69948537811374112,4.8927979419492338E-4,4.8927979419492338E-4,0.78863456010688582,2.5499723245194231E-2,4.1572987012987027E-2,1.5974400000000007E-2,0,8.3233885069163224E-2,1.5145262207386645,4.8169583139403782E-2,1.4163967999999999E-2,6.2598903089281704E-2,2.2763520000000002E-2,8.3999999999999993E-4,3.7440000000000001E-2,0.15500159999999999,0.14227200000000001,3.8280000000000002E-2,0.51825862006760703,0.52443482651490714,0.52443482651490714,7.6,0.93544968509029558,2.1616717819215907,1.5424390231641976,null,93.544968509029559,0.31349407059092099,0.16859630815844492,9.8257808269163222E-2,7.011086468928171E-2,0.48209037874936589]
["Low-side FET","Input Value","Units","Description",null,null,39,24,1,1.56,1.56,0.3611111111111111,0.21343699183947246,2.6964802173909281,2.9082401086954643,0.21175989130453599,0,1.7434210995143196,6.3829859734866101E-2,0.25060402167332357,0.3161787866600011,0.77840678968757648,1.2118342604634379E-3,1.2118342604634379E-3,0.71433824466171891,5.1027912778638584E-4,5.1027912778638584E-4,0.80544732473402891,2.6598561109769374E-2,4.2667012987012989E-2,1.5974400000000007E-2,0,8.5439961139209195E-2,1.5462120609122523,5.0206206483520803E-2,1.4536703999999999E-2,6.5030223516520325E-2,2.3362560000000004E-2,8.3999999999999993E-4,3.7440000000000001E-2,0.15500159999999999,0.14227200000000001,3.8280000000000002E-2,0.52605932598849292,0.53259832817765573,0.53259832817765573,7.8000000000000007,0.93608256306119875,2.2189035162626025,1.6002771029634471,null,93.60825630611987,0.3161787866600011,0.17383274465572954,0.10085925073920921,7.2739868316520323E-2,0.49001153131573061]
["RdsonBot",{"$f":"Rdson2*1000","v":21},"mW","Drain-Source Resistance of Low-side FET",null,null,40,24,1,1.6,1.6,0.37037037037037035,0.21356767192597029,2.697777199884392,2.9488885999421961,0.25111140005780408,0,1.7794662547192832,6.6496503185378142E-2,0.25060402167332357,0.31893416914343514,0.77878119628344433,1.2130003033693454E-3,1.2130003033693454E-3,0.72926973788679905,5.3183435059748064E-4,5.3183435059748064E-4,0.82235154620668616,2.7726744687489629E-2,4.3761038961038973E-2,1.5974400000000007E-2,0,8.7676109281084755E-2,1.5780488224817844,5.2294999808859065E-2,1.4909439999999999E-2,6.7515141789633651E-2,2.39616E-2,8.3999999999999993E-4,3.7440000000000001E-2,0.15500159999999999,0.14227200000000001,3.8280000000000002E-2,0.53400874831608947,0.54092786546774296,0.54092786546774296,8,0.93666638168731098,2.2767968361838644,1.6592943353719405,null,93.666638168731097,0.31893416914343514,0.17915285107071841,0.10349076528108475,7.5422469789633656E-2,0.49808702021415352]
["RdsonBotTc",{"$f":"RdsonBotTc*1000000","v":4000},"ppm","Drain To Source Resitance Temp Co",null,null,41,24,1,1.64,1.64,0.37962962962962959,0.21369834287797013,2.69907363381339,2.9895368169066949,0.29046318309330488,0,1.8156770656504104,6.9230347341306592E-2,0.25060402167332357,0.32176031552346923,0.77915544452239116,1.21416641345777E-3,1.21416641345777E-3,0.74427559844345503,5.5394616643836313E-4,5.5394616643836313E-4,0.83934244398314284,2.8884325269135407E-2,4.4855064935064942E-2,1.5974400000000007E-2,0,8.9942407670962191E-2,1.6100271638880164,5.4435936837603081E-2,1.5282175999999998E-2,7.0053695429089513E-2,2.4560639999999995E-2,8.3999999999999993E-4,3.7440000000000001E-2,0.15500159999999999,0.14227200000000001,3.8280000000000002E-2,0.54210691205643358,0.54942405308124398,0.54942405308124398,8.1999999999999993,0.93720454629379213,2.335353461561168,1.7194915458399693,null,93.720454629379219,0.32176031552346923,0.18455674310005168,0.10615243007096219,7.8158706629089511E-2,0.50631705862352094]
["QgBot",{"$f":"Qg_Q2*1000000000","v":6},"nC","Gate Charge Of Top FET",null,null,42,24,1,1.68,1.68,0.3888888888888889,0.2138290046964296,2.7003695192354358,3.0301847596177178,0.32981524038228205,0,1.8520438156357562,7.203139219572767E-2,0.25060402167332357,0.32465732585631418,0.77952953442101958,1.2153325900693031E-3,1.2153325900693031E-3,0.75935188046575897,5.7661527836688428E-4,5.7661527836688428E-4,0.85641558948330054,3.0071354138311197E-2,4.5949090909090919E-2,1.5974400000000007E-2,0,9.2238935019268983E-2,1.6421384329966282,5.6628991295617055E-2,1.5654911999999997E-2,7.2645923447877139E-2,2.5159679999999997E-2,8.3999999999999993E-4,3.7440000000000001E-2,0.15500159999999999,0.14227200000000001,3.8280000000000002E-2,0.55035384221207051,0.55808752024945119,0.55808752024945119,8.4,0.93770014872170948,2.3945751240239175,1.7808695926532971,null,93.770014872170947,0.32465732585631418,0.19004453846714611,0.10884432381926898,8.0948617847877144E-2,0.51470186432346032]
["RGateBot",{"$f":"Rgate2","v":1},"W","Gate Resistance",null,null,43,24,1,1.72,1.72,0.39814814814814808,0.2139596573823063,2.7016648562080365,3.0708324281040182,0.36916757189598171,0,1.8885574961521467,7.4899637741721786E-2,0.25060402167332357,0.32762530278105806,0.77990346599593074,1.2164988325449318E-3,1.2164988325449318E-3,0.77449492489546701,5.9984238868883509E-4,5.9984238868883509E-4,0.87356687615113904,3.1287882571446837E-2,4.7043116883116888E-2,1.5974400000000007E-2,0,9.4565770574364522E-2,1.674374608372931,5.8874136912444121E-2,1.6027647999999999E-2,7.5291866353475859E-2,2.5758719999999995E-2,8.3999999999999993E-4,3.7440000000000001E-2,0.15500159999999999,0.14227200000000001,3.8280000000000002E-2,0.5587495637820532,0.56691891086433499,0.56691891086433499,8.6,0.93815600242820507,2.4544635670360195,1.8434293669764688,null,93.815600242820508,0.32762530278105806,0.19561635692784038,0.11156652577436452,8.3792243953475856E-2,0.52324165970889847]
["VsdBot",{"$f":"Vsd_Q2","v":0.7},"V","Diode Forward Voltage of Bottom FET Body Diode",null,null,44,24,1,1.76,1.76,0.40740740740740744,0.2140903009365577,2.7029596447886894,3.1114798223943447,0.40852017760565529,0,1.9252097470439464,7.7835083972373348E-2,0.25060402167332357,0.3306643515288189,0.78027723926372261,1.2176651402260332E-3,1.2176651402260332E-3,0.78970133528961017,6.2362819895819333E-4,6.2362819895819333E-4,0.89079249229916313,3.253396183779874E-2,4.8137142857142864E-2,1.5974400000000007E-2,0,9.6922994126247178E-2,1.7067282460240885,6.1171347421305693E-2,1.6400384E-2,7.7991566149927916E-2,2.6357759999999997E-2,8.3999999999999993E-4,3.7440000000000001E-2,0.15500159999999999,0.14227200000000001,3.8280000000000002E-2,0.56729410176194417,0.57591888360733956,0.57591888360733956,8.8000000000000007,0.93857467297266572,2.5150205459774377,1.9071717928984142,null,93.857467297266567,0.3306643515288189,0.20127232027617509,0.11431911572624717,8.668962694992792E-2,0.53193667180499404]
["QrrBot",{"$f":"Qrr_Q2*1000000000","v":3},"nC","Reverse Recovery Charge of Body Diode",null,null,45,24,1,1.8,1.8,0.41666666666666663,0.21422093536014111,2.7042538850348881,3.1521269425174441,0.44787305748255601,0,1.9619928022873048,8.0837730880771022E-2,0.25060402167332357,0.33377457993213766,0.78065085424099201,1.2188315124543811E-3,1.2188315124543811E-3,0.80496795586990244,6.4797340997736915E-4,6.4797340997736915E-4,0.90808889646832147,3.3809643199451213E-2,4.9231168831168841E-2,1.5974400000000007E-2,0,9.9310686010291319E-2,1.7391924310835007,6.3520596559100889E-2,1.6773119999999999E-2,8.0745066340015631E-2,2.69568E-2,8.3999999999999993E-4,3.7440000000000001E-2,0.15500159999999999,0.14227200000000001,3.8280000000000002E-2,0.57598748114381548,0.58508811208156197,0.58508811208156197,9,0.9389585045812896,2.5762478282264092,1.9720978274803438,null,93.895850458128962,0.33377457993213766,0.20701255235030697,0.11710217401029133,8.9640810340015628E-2,0.54078713228244468]
["TrrBot",{"$f":"Trr_Q2*1000000000","v":40},"ns","Reverse Recovery Time of Body Diode",null,null,46,24,1,1.84,1.84,0.42592592592592593,0.2143515606540137,2.7055475770041117,3.192773788502056,0.48722621149794421,0,1.9988994407638589,8.3907578460007431E-2,0.25060402167332357,0.33695609843461416,0.78102431094433189,1.2199979485721369E-3,1.2199979485721369E-3,0.82029185159761886,6.7287872179745006E-4,6.7287872179745006E-4,0.92545279506077183,3.5114977911317596E-2,5.032519480519481E-2,1.5974400000000007E-2,0,0.10172892711101561,1.7717607339593777,6.5921858066405742E-2,1.7145856000000001E-2,8.3552411927542758E-2,2.7555840000000002E-2,8.3999999999999993E-4,3.7440000000000001E-2,0.15500159999999999,0.14227200000000001,3.8280000000000002E-2,0.58482972691624913,0.59442728494736685,0.59442728494736685,9.2000000000000011,0.93930964336619083,2.6381471932423435,2.038208460805941,null,93.930964336619084,0.33695609843461416,0.21283717903855837,0.11991578151101562,9.2645839127542762E-2,0.54979327747317253]
["θJABot",{"$f":"ThetaJA_Q2","v":22},"°C/W","Junction to Ambient Resistance",null,null,47,24,1,1.88,1.88,0.43518518518518506,0.21448217681913251,2.7068407207538376,3.2334203603769187,0.52657963962308107,0,2.0359229415576929,8.7044626703179528E-2,0.25060402167332357,0.3402090201007873,0.78139760939033442,1.2211644479218594E-3,1.2211644479218594E-3,0.8356702900776406,6.9834483371844806E-4,6.9834483371844806E-4,0.94288112202533203,3.645001722114171E-2,5.1419220779220787E-2,1.5974400000000007E-2,0,0.10417779886588205,1.8044271705140056,6.8375105687472792E-2,1.7518591999999996E-2,8.6413649419721197E-2,2.815488E-2,8.3999999999999993E-4,3.7440000000000001E-2,0.15500159999999999,0.14227200000000001,3.8280000000000002E-2,0.59382086406433832,0.60393710606148998,0.60393710606148998,9.3999999999999986,0.93963005768043473,2.7007204326494048,2.1055047160338662,null,93.963005768043473,0.3402090201007873,0.21874632828560325,0.12276001966588204,9.5704759819721194E-2,0.55895534838639049]
[null,null,null,null,null,null,48,24,1,1.92,1.92,0.44444444444444442,0.21461278385645449,2.7081333163415313,3.2740666581707654,0.56593334182923427,0,2.0730570433355782,9.0248875603388248E-2,0.25060402167332357,0.34353346062626133,0.78177074959558857,1.2223310098464968E-3,1.2223310098464968E-3,0.85110072511398094,7.2437244428954421E-4,7.2437244428954421E-4,0.96037102039630917,3.7814812369498969E-2,5.2513246753246763E-2,1.5974400000000007E-2,0,0.1066573832691264,1.8371861658814552,7.0880313170230247E-2,1.7891327999999998E-2,8.932882682966202E-2,2.8753920000000002E-2,8.3999999999999993E-4,3.7440000000000001E-2,0.15500159999999999,0.14227200000000001,3.8280000000000002E-2,0.60296091756968773,0.61361829461968409,0.61361829461968409,9.6,0.93992155601282601,2.7639693503207807,2.1739876494525645,null,93.992155601282604,0.34353346062626133,0.2247401300987884,0.12563497046912639,9.8817620429662023E-2,0.56827359072504979]
[null,null,null,null,null,null,49,24,1,1.96,1.96,0.45370370370370372,0.21474338176693636,2.7094253638246499,3.3147126819123249,0.605287318087675,0,2.1102959074131511,9.3520325153738607E-2,0.25060402167332357,0.34692953834807916,0.78214373157668071,1.2234976336893894E-3,1.2234976336893894E-3,0.86658078175628372,7.5096225130933184E-4,7.5096225130933184E-4,0.97791982550565704,3.9209414589797605E-2,5.360727272727274E-2,1.5974400000000007E-2,0,0.10916776287562027,1.8700325215695259,7.3437454266281274E-2,1.8264063999999997E-2,9.2297993678972151E-2,2.9352959999999997E-2,8.3999999999999993E-4,3.7440000000000001E-2,0.15500159999999999,0.14227200000000001,3.8280000000000002E-2,0.61224991241041371,0.62347158530296121,0.62347158530296121,9.8000000000000007,0.94018580276248331,2.8278957624636458,2.243658350537387,null,94.018580276248329,0.34692953834807916,0.23081871655459241,0.12854071647562026,0.10198447047897215,0.57774825490267157]
[null,null,null,null,null,null,50,24,1,2,2,0.46296296296296291,0.21487397055153482,2.7107168632606462,3.3553584316303233,0.6446415683696769,0,2.1476340841486792,9.6858975347339851E-2,0.25060402167332357,0.35039737425534573,0.78251655535019604,1.224664318794273E-3,1.224664318794273E-3,0.88210824269250965,7.7811495182606751E-4,7.7811495182606751E-4,0.99552504970603184,4.0633875108280086E-2,5.4701298701298709E-2,1.5974400000000007E-2,0,0.11170902080476554,1.9029613855265006,7.6046502730903728E-2,1.8636799999999999E-2,9.5321201000456823E-2,2.9951999999999999E-2,8.3999999999999993E-4,3.7440000000000001E-2,0.15500159999999999,0.14227200000000001,3.8280000000000002E-2,0.62168787356114585,0.63349772842749241,0.63349772842749241,10,0.94042433218056687,2.8925014977048416,2.3145179420100503,null,94.042433218056686,0.35039737425534573,0.23698222180522235,0.13147734080476553,0.10520536100045683,0.58737959606056811]
[null,null,null,null,null,null,51,24,1,2.04,2.04,0.47222222222222215,0.21500455021120632,2.7120078147069608,3.3960039073534807,0.68399609264651962,0,2.1850664823415866,0.10026482617730534,0.25060402167332357,0.35393709200010198,0.78288922093271629,1.2258310645052711E-3,1.2258310645052711E-3,0.89768103585734182,8.0583124213791022E-4,8.0583124213791022E-4,1.013184368458375,4.2088245144024247E-2,5.5795324675324685E-2,1.5974400000000007E-2,0,0.11428124074442061,1.9359682248849641,7.8707432323049026E-2,1.9009536E-2,9.83985013409273E-2,3.0551040000000002E-2,8.3999999999999993E-4,3.7440000000000001E-2,0.15500159999999999,0.14227200000000001,3.8280000000000002E-2,0.63127482599302676,0.64369749009821997,0.64369749009821997,10.199999999999999,0.94063856072285279,2.9577883971772532,2.3865675799004005,null,94.063856072285276,0.35393709200010198,0.2432307820853479,0.13444492714442061,0.1084803445409273,0.59716787408544991]
["Controller","Input Value","Units","Std Units",null,null,52,24,1,2.08,2.08,0.48148148148148145,0.21513512074690733,2.7132982182210297,3.4366491091105149,0.72335089088948523,0,2.222588341345165,0.10373787763675249,0.25060402167332357,0.35754881790845222,0.78326172834082175,1.2269978701669024E-3,1.2269978701669024E-3,0.91329722313887007,8.3411181779317097E-4,8.3411181779317097E-4,1.0308956076522477,4.3572575908944582E-2,5.6889350649350662E-2,1.5974400000000007E-2,0,0.11688450695485983,1.9690488011237188,8.1420216805341852E-2,1.9382271999999999E-2,0.10152994876411547,3.1150079999999997E-2,8.3999999999999993E-4,3.7440000000000001E-2,0.15500159999999999,0.14227200000000001,3.8280000000000002E-2,0.64101079467371314,0.65407165236624754,0.65407165236624754,10.4,0.94082979802051159,3.0237583146069165,2.4598084536105405,null,94.082979802051156,0.35754881790845222,0.2495645357189753,0.13744355975485983,0.11180947516411548,0.60711335362742758]
["θJA",20,"°C/W","Junction to Ambient Resistance",null,null,53,24,1,2.12,2.12,0.49074074074074076,0.21526568215959396,2.714588073860277,3.4772940369301386,0.7627059630698616,0,2.2601952056320354,0.10727812971880282,0.25060402167332357,0.36123268099194583,0.78363407759108938,1.228164735124075E-3,1.228164735124075E-3,0.92895499007785876,8.6295737359055468E-4,8.6295737359055468E-4,1.0486567320403277,4.5086918607793486E-2,5.7983376623376631E-2,1.5974400000000007E-2,0,0.11951890427276553,2.0021991474147969,8.4184829944079331E-2,1.9755008000000001E-2,0.10471559885369451,3.1749119999999999E-2,8.3999999999999993E-4,3.7440000000000001E-2,0.15500159999999999,0.14227200000000001,3.8280000000000002E-2,0.65089580456737572,0.66462101339006441,0.66462101339006441,10.600000000000001,0.94099925664609219,3.0904131164008417,2.5342417859812789,null,94.099925664609216,0.36123268099194583,0.25598362312646006,0.14047332347276553,0.11519280845369451,0.61721630411840589]
["Theta Ja",2,"°C/W","Junction to Ambient Resistance",null,null,54,24,1,2.16,2.16,0.5,0.21539623445022243,2.7158773816821231,3.5179386908410617,0.80206130915893858,0,2.2978829015772422,0.11088558241658196,0.25060402167332357,0.36498881295921648,0.78400626870009493,1.2293316587220909E-3,1.2293316587220909E-3,0.94465263646454045,8.923686035794072E-4,8.923686035794072E-4,1.0664658346803944,4.6631324438162564E-2,5.9077402597402608E-2,1.5974400000000007E-2,0,0.12218451811525384,2.0354155479460445,8.7001245509230427E-2,2.0127743999999999E-2,0.1079555087164065,3.2348160000000001E-2,8.3999999999999993E-4,3.7440000000000001E-2,0.15500159999999999,0.14227200000000001,3.8280000000000002E-2,0.66092988063470104,0.67534638760067567,0.67534638760067567,10.8,0.94114806082625968,3.1577546817355842,2.609868833360943,null,94.114806082625961,0.36498881295921648,0.26248818683166036,0.14353430371525383,0.1186304015164065,0.6274769997908769]
[null,null,null,null,null,null,55,24,1,2.2000000000000002,2.2000000000000002,0.50925925925925919,0.21552677761974864,2.7171661417439776,3.5585830708719888,0.84141692912801136,0,2.3356475162475441,0.11456023572321977,0.25060402167332357,0.36881734822787987,0.78437830168441125,1.2304986403066426E-3,1.2304986403066426E-3,0.96038856774743075,9.2234620105996132E-4,9.2234620105996132E-4,1.0843211272888533,4.8205844590483757E-2,6.0171428571428584E-2,1.5974400000000007E-2,0,0.12488143448393364,2.0686945190308674,8.9869437274435388E-2,2.0500480000000001E-2,0.11124973698529758,3.2947199999999996E-2,8.3999999999999993E-4,3.7440000000000001E-2,0.15500159999999999,0.14227200000000001,3.8280000000000002E-2,0.67111304783289105,0.6862486058706978,0.6862486058706978,11,0.94127725423144304,3.2257849026465402,2.6866908856765468,null,94.127725423144298,0.36881734822787987,0.26907837146923125,0.14662658648393365,0.12212231298529758,0.63789571969711112]
[null,null,null,null,null,null,56,24,1,2.2400000000000002,2.2400000000000002,0.51851851851851849,0.21565731166912852,2.7184543541032422,3.5992271770516213,0.88077282294837911,0,2.3734853780067633,0.11830208963185007,0.25060402167332357,0.3727184239366918,0.78475017656060864,1.2316656792238129E-3,1.2316656792238129E-3,0.9761612871772668,9.5289085858357833E-4,9.5289085858357833E-4,1.1022209314195086,4.9810530248030851E-2,6.1265454545454567E-2,1.5974400000000007E-2,0,0.1276097399690003,2.1020327918357076,9.2789379017005014E-2,2.0873216E-2,0.11459834382306029,3.3546240000000005E-2,8.3999999999999993E-4,3.7440000000000001E-2,0.15500159999999999,0.14227200000000001,3.8280000000000002E-2,0.68144533111566408,0.69732851568749143,0.69732851568749143,11.200000000000001,0.9413878069544761,3.2945056841180067,2.7647092665073263,null,94.138780695447608,0.3727184239366918,0.27575432379206061,0.1497502583690003,0.12566860302306029,0.64847274772875241]
["Outputs",null,null,null,null,null,57,24,1,2.2799999999999998,2.2799999999999998,0.52777777777777768,0.21578783659931769,2.7197420188173118,3.6398710094086555,0.9201289905913439,0,2.4113930387661897,0.12211114413561082,0.25060402167332357,0.37669217995796994,0.78512189334525562,1.2328327748200778E-3,1.2328327748200778E-3,0.99196938861690409,9.8400326795299465E-4,9.8400326795299465E-4,1.1201636703899445,5.1445432586920359E-2,6.235948051948053E-2,1.5974400000000007E-2,0,0.13036952175336305,2.1354272965728818,9.5761044517919905E-2,2.1245951999999995E-2,0.11800139092548396,3.414528E-2,8.3999999999999993E-4,3.7440000000000001E-2,0.15500159999999999,0.14227200000000001,3.8280000000000002E-2,0.6919267554332551,0.7085869813303991,0.7085869813303991,11.399999999999999,0.94148062177503189,3.363918944173987,2.8439253331606471,null,94.148062177503192,0.37669217995796994,0.28251619267884703,0.15290540655336304,0.12926933332548396,0.65920837263681697]
["Design","Value","Units",null,null,null,58,24,1,2.3199999999999998,2.3199999999999998,0.53703703703703698,0.2159183524112718,2.721029135943573,3.6805145679717866,0.95948543202821335,0,2.4493672577261973,0.12598739922764421,0.25060402167332357,0.38073875891028003,0.78549345205491838,1.2339999264423048E-3,1.2339999264423048E-3,1.0078115499549352,1.0156841202225689E-3,1.0156841202225689E-3,1.1381478618856848,5.3110602776113201E-2,6.3453506493506492E-2,1.5974400000000007E-2,0,0.13316086761680779,2.1688751480217103,9.8784407561830115E-2,2.1618687999999997E-2,0.12145894152501403,3.4744319999999995E-2,8.3999999999999993E-4,3.7440000000000001E-2,0.15500159999999999,0.14227200000000001,3.8280000000000002E-2,0.70255734573241768,0.72002488405216403,0.72002488405216403,11.6,0.94155653979366472,3.4340266139697713,2.9243404767503085,null,94.155653979366477,0.38073875891028003,0.2893641291418218,0.15609211881680779,0.13292456712501402,0.67010288805210183]
["Dmax",{"$f":"D1_Vinmin","v":0.41666666666666669},"index",null,null,null,59,24,1,2.36,2.36,0.54629629629629617,0.21604885910594621,2.7223157055394029,3.7211578527697013,0.9988421472302984,0,2.4874049864706138,0.12993085490109638,0.25060402167332357,0.38485830617138955,0.78586485270616013,1.2351671334377495E-3,1.2351671334377495E-3,1.0236865270670124,1.047934105698521E-3,1.047934105698521E-3,1.1561721111792447,5.4806091977415546E-2,6.4547532467532476E-2,1.5974400000000007E-2,0,0.13598386594019435,2.2023736322545733,0.10185944193705425,2.1991423999999996E-2,0.12497106039441931,3.5343359999999997E-2,8.3999999999999993E-4,3.7440000000000001E-2,0.15500159999999999,0.14227200000000001,3.8280000000000002E-2,0.71333712695642226,0.73164312226459505,0.73164312226459505,11.799999999999999,0.94161634550821938,3.5048306378842753,3.0059561222772251,null,94.161634550821944,0.38485830617138955,0.29629828633461364,0.15931048354019434,0.13663436919441932,0.68115659250600324]
["Dprime",{"$f":"1-B68","v":0.58333333333333326},"index",null,null,null,60,24,1,2.4,2.4,0.55555555555555547,0.21617935668429633,2.7236017276621731,3.7618008638310867,1.0381991361689134,0,2.5255033552892048,0.13394151114911768,0.25060402167332357,0.38905096989149052,0.78623609531554273,1.2363343951540624E-3,1.2363343951540624E-3,1.0395931482744505,1.0807539139391835E-3,1.0807539139391835E-3,1.1742351049074815,5.6531951345480454E-2,6.5641558441558445E-2,1.5974400000000007E-2,0,0.13883860570969009,2.2359201944568476,0.10498612143557891,2.2364159999999998E-2,0.12853781385056912,3.5942399999999999E-2,8.3999999999999993E-4,3.7440000000000001E-2,0.15500159999999999,0.14227200000000001,3.8280000000000002E-2,0.72426612404505908,0.74344261172856418,0.74344261172856418,12,0.9416607713959233,3.5763329736131819,3.0887737287125208,null,94.166077139592332,0.38905096989149052,0.30331881956025919,0.16256058970969009,0.14039880585056913,0.69236978945174976]
["Ipp",{"$f":"Iripple_Vinnom","v":2.707692261915116},"A",null,null,null,61,24,1,2.44,2.44,0.56481481481481477,0.21630984514727722,2.7248872023692448,3.8024436011846223,1.0775563988153776,0,2.5636596606159796,0.13801936796486244,0.25060402167332357,0.39331690100669436,0.78660717989962492,1.2375017109392818E-3,1.2375017109392818E-3,1.0555303092546608,1.1141442337552401E-3,1.1141442337552401E-3,1.1923356053562322,5.8288232027808723E-2,6.6735584415584429E-2,1.5974400000000007E-2,0,0.14172517652103833,2.2695124277406871,0.10816441985305797,2.2736895999999996E-2,0.13215926975831987,3.6541439999999994E-2,8.3999999999999993E-4,3.7440000000000001E-2,0.15500159999999999,0.14227200000000001,3.8280000000000002E-2,0.73534436193463726,0.75542428574840759,0.75542428574840759,12.2,0.9416905020563926,3.6485355922628431,3.1727947890830372,null,94.169050205639266,0.39331690100669436,0.31042588627935819,0.16584252692103832,0.14421794495831988,0.70374278728605255]
["Top FET","Value","Units",null,null,null,62,24,1,2.48,2.48,0.57407407407407407,0.21644032449584402,2.7261721297179733,3.8430860648589866,1.1169139351410133,0,2.6018713534821276,0.14216442534148929,0.25060402167332357,0.39765625325280085,0.78697810647496369,1.2386690801418384E-3,1.2386690801418384E-3,1.0714969683624749,1.1481057532099746E-3,1.1481057532099746E-3,1.2104724452062812,6.0074985164750613E-2,6.7829610389610398E-2,1.5974400000000007E-2,0,0.14464366858386388,2.303148062862491,0.11139431098881214,2.3109631999999998E-2,0.13583549753451193,3.7140479999999997E-2,8.3999999999999993E-4,3.7440000000000001E-2,0.15500159999999999,0.14227200000000001,3.8280000000000002E-2,0.74657186555798616,0.76758909537081266,0.76758909537081266,12.4,0.94170617796384115,3.7214404784450053,3.2580208305592624,null,94.170617796384121,0.39765625325280085,0.31761964611837579,0.16915638538386388,0.14809185593451193,0.71527589937117664]
["Tr",{"$f":"(Qgd_Q1+Qgs_Q1/2)*(RdsonDRT+Rgate1)/(VCC-Vsp_Q1)*1000000000","v":1.2784090909090911},"ns","Turn on of MOSFET -> Rise time of current",null,null,63,24,1,2.52,2.52,0.58333333333333326,0.21657079473095156,2.7274565097657022,3.8837282548828513,1.1562717451171489,0,2.6401360288923139,0.14637668327216083,0.25060402167332357,0.40206918317934265,0.78734887505811268,1.2398365021105511E-3,1.2398365021105511E-3,1.0874921423254107,1.1826391596195115E-3,1.1826391596195115E-3,1.2286445226991807,6.1892261889506597E-2,6.8923636363636381E-2,1.5974400000000007E-2,0,0.14759417272601466,2.3368249587627608,0.11467576864582815,2.3482368E-2,0.13956656815207694,3.7739519999999999E-2,8.3999999999999993E-4,3.7440000000000001E-2,0.15500159999999999,0.14227200000000001,3.8280000000000002E-2,0.7579486598444557,0.77993800958827175,0.77993800958827175,12.6,0.94170839887080526,3.795049630372322,3.3444534145456926,null,94.170839887080533,0.40206918317934265,0.32490026087809165,0.17250225592601465,0.15202060975207693,0.72696944405743436]
["Tf",{"$f":"(Qgd_Q1+Qgs_Q1/2)*(RdsonDRT2+Rgate1)/(Vsp_Q1)*1000000000","v":1.4610389610389614},"ns","Turn off of MOSFET -> Fall time of current",null,null,64,{"$f":"Vin","v":24},{"$f":"MODE","v":1},2.56,{"$f":"Iout*G73/100/Number_of_Phases","v":2.56},{"$f":"Vout*K73/(Vin*Efficiency)","v":0.59259259259259256},{"$f":"(Vout+(Rdson2+Rs+Rdcr)*K73)/(Vin+(Rs+Rdson2-Rdson1)*K73)","v":0.21670125585355471},{"$f":"(Vin-(Rdson1+Rdcr)*K73-Vout)*M73/(Fsw*Lf)","v":2.7287403425697732},3.9243701712848864,1.1956298287151135,{"$f":"IF(MIN(Vin, -P73/(Coss_Q1+Coss_Q2)*0.00000002)<0, 0, MIN(Vin, -P73/(Coss_Q1+Coss_Q2)*0.00000002))","v":0},2.6784514160419857,{"$f":"R73^2*Rdcr","v":0.15065614175004369},{"$f":"Core_Loss","v":0.25060402167332357},{"$f":"(T73+S73*(1+Ltc*(Ta-25)))/(1-S73*Ltc*ThetaCa)","v":0.40655585016390927},0.78771948566562511,1.2410039761946339E-3,1.2410039761946339E-3,1.1035149022795585,1.2177451395530637E-3,1.2177451395530637E-3,1.2468507971855223,{"$f":"Rdson1*AB73^2","v":6.3740113328129067E-2},{"$f":"(Vin*K73/2)*Fsw*(Tr_buck+Tf_buck)","v":7.0017662337662351E-2},{"$f":"(0.5*Coss_Q1*(Vin-Q73)^2-0.5*Coss_Q2*(Vin-Q73)^2+(Qoss_Q2*(Vin-Q73)/Vin)*Vin)*Fsw","v":1.5974400000000007E-2},{"$f":"IF(K73>N73/2,0,ABS(K73-N73/2)*Vsd_Q1*Deadtime*Fsw)","v":0},{"$f":"(AF73+AE73+AD73+AC73*(1+RdsonTopTc*Ta-RdsonTopTc*25))/(1-AC73*RdsonTopTc*ThetaJA_Q1)","v":0.15057678039794056},{"$f":"SQRT((1-M73))*SQRT(K73^2+(N73^2)/12)","v":2.370541093854976},{"$f":"Rdson2*AH73^2","v":0.11800876663075807},{"$f":"IF(K73<N73/2,Deadtime*Fsw*Vsd_Q2*(K73+N73/2),2*Deadtime*Fsw*Vsd_Q2*K73)","v":2.3855103999999999E-2},{"$f":"(AJ73+AI73*(1+RdsonBotTc*Ta-RdsonBotTc*25))/(1-AI73*RdsonBotTc*ThetaJA_Q2)","v":0.14335255414425613},{"$f":"Qrr_Q2*K73/Iout*Fsw*Vin","v":3.8338559999999994E-2},{"$f":"Iq*Vin","v":8.3999999999999993E-4},{"$f":"IF(Ext_VCC=1,  (Qg_Q1+Qg_Q2)*Fsw*Vout, (Qg_Q1+Qg_Q2)*Fsw*Vin)","v":3.7440000000000001E-2},{"$f":"(Vin-VCC)*Fsw*(Qg_Q1+Qg_Q2)","v":0.15500159999999999},{"$f":"(Qg_Q1+Qg_Q2)*Fsw*(Vin-Vout)","v":0.14227200000000001},3.8280000000000002E-2,0.7694747697199168,{"$f":"((T73+S73*(1+Ltc*(Ta-25))) + (AF73+AE73+AD73+AC73*(1+RdsonTC*(Ta-25))) + (AJ73+AI73*(1+RdsonTC*(Ta-25))) + AQ73 + AL73) / (1-S73*Ltc*ThetaCa-AC73*RdsonTC*ThetaJA_Q1 -AI73*RdsonTC*ThetaJA_Q2)","v":0.79247201554719171},0.79247201554719171,{"$f":"Vout*K73","v":12.8},0.94169772690054054,{"$f":"ThetaJA_Q1*BC73","v":3.8693650599546925},{"$f":"ThetaJA_Q2*BD73","v":3.4320941367736344},null,94.16977269005406,{"$f":"U73","v":0.40655585016390927},{"$f":"AG73+AK73+AL73","v":0.33226789454219674},{"$f":"AG73+AL73*0.66","v":0.17588022999794056},{"$f":"AK73+AL73*0.33","v":0.15600427894425611},0.73882374470610601]
["Part Power","Value","Units",null,null,null,65,24,1,{"$f":"Iout*G74/100","v":2.6},2.6,0.60185185185185186,0.21683170786460801,2.7300236281875137,{"$f":"K74+N74/2","v":3.9650118140937569},{"$f":"K74-N74/2","v":1.2349881859062433},0,{"$f":"SQRT(K74^2+(N74^2)/12)","v":2.7168153693013157},0.15500280076830875,0.25060402167332357,0.41111641642675284,{"$f":"N74/SQRT(12)","v":0.78808993831404994},{"$f":"RCoutEsr*V74^2","v":1.2421715017436861E-3},{"$f":"W74","v":1.2421715017436861E-3},{"$f":"SQRT(M74*(1-M74))*SQRT(K74^2+(N74^2)/12)","v":1.1195643701159721},{"$f":"RCinEsr*Y74^2","v":1.2534243788331733E-3},{"$f":"Z74","v":1.2534243788331733E-3},{"$f":"SQRT(M74)*SQRT(K74^2+(N74^2)/12)","v":1.2650902850218495},6.5618590599523241E-2,7.1111688311688334E-2,1.5974400000000007E-2,0,0.15359158367710957,2.4042945579972477,0.1213932787539188,2.422784E-2,0.14719352960893073,3.8937600000000003E-2,8.3999999999999993E-4,3.7440000000000001E-2,0.15500159999999999,0.14227200000000001,3.8280000000000002E-2,{"$f":"SUM(S74,T74,AC74,AD74,AE74,AF74,AI74,AJ74,AQ74, AL74)","v":0.78115022010676272},0.80519211876074126,{"$f":"AS74","v":0.80519211876074126},13,{"$f":"AU74/(AU74+AT74)","v":0.94167468936078658},3.9443887928964108,3.5209446273964762,null,{"$f":"AV74*100","v":94.167468936078663},0.41111641642675284,0.33972271328604031,0.17929039967710958,0.16004293760893074,{"$f":"BA74+BB74","v":0.75083912971279321}]
["Power Dis",{"$f":"AQ9","v":3.8280000000000002E-2},"W",null,null,null,66,24,1,2.64,2.64,0.61111111111111116,0.21696215076506603,2.7313063666762476,4.0056531833381239,1.2743468166618763,0,2.7552258598985766,0.15941666032013088,0.25060402167332357,0.41575104704567617,0.78846023301993517,1.2433390781077011E-3,1.2433390781077011E-3,1.135639715110369,1.28967756253596E-3,1.28967756253596E-3,1.2833620557856833,6.7527744815448668E-2,7.2205714285714304E-2,1.5974400000000007E-2,0,0.1566386752724615,2.4380835450868772,0.1248292788292913,2.4600575999999999E-2,0.15108957021306385,3.9536639999999998E-2,8.3999999999999993E-4,3.7440000000000001E-2,0.15500159999999999,0.14227200000000001,{"$f":"SUM(AM75:AN75)","v":3.8280000000000002E-2},0.79297503592390872,0.81809934332652556,0.81809934332652556,13.200000000000001,0.94163978130772841,4.0201228687941528,3.6110065510874048,null,94.163978130772847,0.41575104704567617,0.34726488548552537,0.1827328576724615,0.16413666141306385,0.76301593253120159]
["Temp rise",{"$f":"B75*B62","v":0.76560000000000006},"°C",null,null,null,67,24,1,2.68,2.68,0.62037037037037035,0.21709258455588309,2.7325885580932874,4.0462942790466441,1.3137057209533565,0,2.7936809682421742,0.16389772039868919,0.25060402167332357,0.42045990997120936,0.78883036979982546,1.2445067046370588E-3,1.2445067046370588E-3,1.1517401508115286,1.3265053749913628E-3,1.3265053749913628E-3,1.3016652287810284,6.9467627080520247E-2,7.3299740259740287E-2,1.5974400000000007E-2,0,0.15971814852890023,2.4719063462236925,0.12831674067452029,2.4973312000000001E-2,0.1550407531972558,4.0135680000000007E-2,8.3999999999999993E-4,3.7440000000000001E-2,0.15500159999999999,0.14227200000000001,3.8280000000000002E-2,0.80494924208679353,0.83119473214918782,0.83119473214918782,13.4,0.94159346788562559,4.0965693412358055,3.7022816071396276,null,94.159346788562559,0.42045990997120936,0.35489458172615607,0.18620769732890025,0.16828552759725579,0.77535449169736537]
["Current (switching)",{"$f":"(Qg_Q1+Qg_Q2)*Fsw+Iq","v":7.5230000000000002E-3},"A",null,null,null,68,24,1,2.72,2.72,0.62962962962962965,0.21722300923801352,2.7338702024959409,4.0869351012479704,1.3530648987520297,0,2.8321788768263327,0.16844598099716662,0.25060402167332357,0.42524317604207268,0.78920034867026412,1.245674380682533E-3,1.245674380682533E-3,1.1678649321661219,1.3639084997833803E-3,1.3639084997833803E-3,1.3199989698093704,7.1438288492209776E-2,7.4393766233766243E-2,1.5974400000000007E-2,0,0.16283009743182439,2.5057613433931549,0.13185563811091286,2.5346047999999999E-2,0.1590471573804115,4.0734720000000002E-2,8.3999999999999993E-4,3.7440000000000001E-2,0.15500159999999999,0.14227200000000001,3.8280000000000002E-2,0.81707286350737907,0.8444793471680182,0.8444793471680182,13.600000000000001,0.94153618646465187,4.1737302779001366,3.7947715295690534,null,94.153618646465191,0.42524317604207268,0.36261197481223589,0.18971501263182439,0.17248961498041152,0.78785515085430857]
["Qrr Current",{"$f":"Qrr_Q2*Fsw","v":2.496E-3},"A",null,null,null,69,24,1,2.76,2.76,0.63888888888888884,0.21735342481241135,2.7351512999415051,4.1275756499707521,1.3924243500292472,0,2.8707178636706256,0.17306144210875046,0.25060402167332357,0.43010101900093445,0.78957016964779148,1.2468421055952846E-3,1.2468421055952846E-3,1.1840133528598074,1.4018876197503228E-3,1.4018876197503228E-3,1.3383624881835081,7.3439780140846789E-2,7.5487792207792212E-2,1.5974400000000007E-2,0,0.16597461661169635,2.5396470036248915,0.1354459449634387,2.5718783999999995E-2,0.16310886316452303,4.133375999999999E-2,8.3999999999999993E-4,3.7440000000000001E-2,0.15500159999999999,0.14227200000000001,3.8280000000000002E-2,0.82934592509415173,0.85795426958968113,0.85795426958968113,13.799999999999999,0.94146834859693562,4.2516077606573193,3.8884780872195068,null,94.146834859693556,0.43010101900093445,0.37041723977621938,0.19325489821169634,0.17674900396452303,0.80051825877715377]
["Diode Current",{"$f":"Deadtime*Fsw*(Iripple_Vinnom/2)*(Vsd_Q2)/Vin","v":2.6282666222322728E-4},null,null,null,null,70,24,1,2.8,2.8,0.64814814814814814,0.2174838312800306,2.7364318504872709,4.1682159252436355,1.4317840747563644,0,2.909296296248189,0.17774410372663205,0.25060402167332357,0.4350336155104606,0.78993983274894586,1.2480098787268652E-3,1.2480098787268652E-3,1.2001847428563026,1.4404434169850494E-3,1.4404434169850494E-3,1.3567550339637078,7.5472153109620341E-2,7.6581818181818181E-2,1.5974400000000007E-2,0,0.16915180134865207,2.5735618735864052,0.13908763506072894,2.6091519999999997E-2,0.16722595253956546,4.1932799999999992E-2,8.3999999999999993E-4,3.7440000000000001E-2,0.15500159999999999,0.14227200000000001,3.8280000000000002E-2,0.84176845175212311,0.8716206001261525,0.8716206001261525,14,0.94139034180856118,4.3302038856703451,3.98340308387044,null,94.139034180856115,0.4350336155104606,0.37831055388821755,0.19682744934865207,0.18106377653956546,0.81334416939867815]
["Total",{"$f":"SUM(B77:B79)","v":1.0281826662223227E-2},"A",null,null,null,71,24,1,2.84,2.84,0.65740740740740733,0.21761422864182503,2.7377118541905192,4.208855927095259,1.4711440729047403,0,2.9479126258616635,0.18249396584400676,0.25060402167332357,0.44004114516966325,0.79030933799026293,1.2491776994292153E-3,1.2491776994292153E-3,1.2163784661178507,1.4795765728352153E-3,1.4795765728352153E-3,1.3751758953975426,7.7535458474579752E-2,7.7675844155844165E-2,1.5974400000000007E-2,0,0.17236174757714884,2.6075045745755032,0.1427806822350757,2.6464255999999995E-2,0.17139850908850809,4.2531839999999994E-2,8.3999999999999993E-4,3.7440000000000001E-2,0.15500159999999999,0.14227200000000001,3.8280000000000002E-2,0.85434046838282995,0.88547945923796945,0.88547945923796945,14.2,0.94130253124333263,4.409520763497274,4.0795483583471777,null,94.130253124333265,0.44004114516966325,0.38629209666565689,0.20043276197714882,0.18543401628850809,0.8263332418353202]
[null,null,null,null,null,null,72,24,1,2.88,2.88,0.66666666666666652,0.21774461689874852,2.7389913111085264,4.2494956555542629,1.5105043444457367,0,2.9865653824296787,0.18731102845407399,0.25060402167332357,0.44512379053054879,0.7906786853882769,1.2503455670546675E-3,1.2503455670546675E-3,1.2325939184920203,1.5192877679035132E-3,1.5192877679035132E-3,1.3936243965465238,7.9629747304636164E-2,7.8769870129870148E-2,1.5974400000000007E-2,0,0.17560455189065483,2.6414737978783114,0.14652506032243107,2.6836991999999997E-2,0.17562661799244098,4.3130879999999996E-2,8.3999999999999993E-4,3.7440000000000001E-2,0.15500159999999999,0.14227200000000001,3.8280000000000002E-2,0.86706199988433497,0.89953198738290174,0.89953198738290174,14.399999999999999,0.94120526117238612,4.4895605191944057,4.1769157846337013,null,94.120526117238612,0.44512379053054879,0.39436204988309576,0.20407093269065482,0.18985980839244099,0.83948584041364449]
[null,null,null,null,null,null,73,24,1,2.92,2.92,0.67592592592592582,0.21787499605175442,2.7402702212985561,4.2901351106492776,1.5498648893507219,0,3.0252531696500986,0.19219529155003734,0.25060402167332357,0.45028173711506936,0.79104787495951845,1.2515134809559399E-3,1.2515134809559399E-3,1.2488305257511592,1.5595776820479166E-3,1.5595776820479166E-3,1.4120998950841528,8.1755070661563692E-2,7.9863896103896118E-2,1.5974400000000007E-2,0,0.17888031154637826,2.6754683004627982,0.15032074316240718,2.7209727999999996E-2,0.17991036603581814,4.3729919999999999E-2,8.3999999999999993E-4,3.7440000000000001E-2,0.15500159999999999,0.14227200000000001,3.8280000000000002E-2,0.87993307115122787,0.91377934527014781,0.91377934527014781,14.6,0.94109885638223012,4.5703252924203221,4.2755072719879994,null,94.109885638223005,0.45028173711506936,0.40252059758219638,0.20774205874637827,0.19434123963581815,0.85280233469726574]
[null,null,null,null,null,null,74,24,1,2.96,2.96,0.68518518518518512,0.21800536610179636,2.7415485848178673,4.3307742924089334,1.5892257075910663,0,3.0639746605092983,0.19714675512510449,0.25060402167332357,0.45551517343238029,0.79141690672051668,1.252681440486142E-3,1.252681440486142E-3,1.2650877417720596,1.6004469943819296E-3,1.6004469943819296E-3,1.430601780251427,8.3911479600000657E-2,8.0957922077922087E-2,1.5974400000000007E-2,0,0.18218912447003799,2.7094869009804272,0.15416770459827492,2.7582463999999998E-2,0.18424984161181721,4.4328960000000001E-2,8.3999999999999993E-4,3.7440000000000001E-2,0.15500159999999999,0.14227200000000001,3.8280000000000002E-2,0.89295370707462562,0.92822271412017143,0.92822271412017143,14.8,0.94098362345245468,4.6518172375408353,4.3753247650599789,null,94.098362345245462,0.45551517343238029,0.41076792608185519,0.21144623807003798,0.1988783984118172,0.86628309951423543]
[null,null,null,null,null,null,75,24,1,3,3,0.69444444444444442,0.21813572704982753,2.7428264017237112,4.3714132008618556,1.6285867991381444,0,3.102728593109521,0.20216541917248715,0.25060402167332357,0.46082429099640676,0.7917857806877987,1.2538494449987737E-3,1.2538494449987737E-3,1.2813650468445046,1.6418963832748195E-3,1.6418963832748195E-3,1.4491294709570857,8.6099025167450882E-2,8.205194805194807E-2,1.5974400000000007E-2,0,0.18553108926067571,2.743528476051055,0.15806591847696352,2.7955199999999999E-2,0.18864513472781624,4.4927999999999996E-2,8.3999999999999993E-4,3.7440000000000001E-2,0.15500159999999999,0.14227200000000001,3.8280000000000002E-2,0.90612393254217316,0.94286329593028806,0.94286329593028806,15,0.94085985193318622,4.7340385237348661,4.4763702440119575,null,94.085985193318621,0.46082429099640676,0.4191042239884919,0.21518356926067572,0.20347137472781623,0.87992851498489866]
[null,null,null,null,null,null,76,24,1,3.04,3.04,0.70370370370370361,0.21826607889680119,2.7441036720733289,4.4120518360366647,1.6679481639633356,0,3.1415137667888486,0.20725128368540108,0.25060402167332357,0.46620928434372277,0.79215449687788853,1.2550174938477214E-3,1.2550174938477214E-3,1.2976619460983936,1.6839265263518702E-3,1.6839265263518702E-3,1.467682414011013,8.8317758404284963E-2,8.3145974025974054E-2,1.5974400000000007E-2,0,0.18890630519550969,2.7775919568083909,0.16201535864906,2.8327935999999998E-2,0.19309633701098966,4.5527040000000005E-2,8.3999999999999993E-4,3.7440000000000001E-2,0.15500159999999999,0.14227200000000001,3.8280000000000002E-2,0.91944377243804354,0.95770231374612191,0.95770231374612191,15.2,0.94072781543132167,4.8169913351012132,4.5786457246417731,null,94.072781543132166,0.46620928434372277,0.4275296822064994,0.21895415159550968,0.20812026021098967,0.89373896655022222]
[null,null,null,null,null,null,77,24,1,3.08,3.08,0.71296296296296291,0.21839642164367029,2.7453803959239544,4.4526901979619771,1.7073098020380229,0,3.18032903851058,0.21240434865706626,0.25060402167332357,0.47167035105174565,0.79252305530730827,1.2561855863872616E-3,1.2561855863872616E-3,1.3139779680400352,1.7265381004946197E-3,1.7265381004946197E-3,1.4862600824802434,9.0567730343741382E-2,8.4240000000000009E-2,1.5974400000000007E-2,0,0.19231487223483104,2.8116763256853465,0.16601599896880848,2.8700672E-2,0.19760354171402214,4.612608E-2,8.3999999999999993E-4,3.7440000000000001E-2,0.15500159999999999,0.14227200000000001,3.8280000000000002E-2,0.9329132516429397,0.97274101193905149,0.97274101193905149,15.4,0.94058777261365545,4.900677870766283,4.6821532585084871,null,94.058777261365549,0.47167035105174565,0.4360444939488532,0.22275808503483105,0.21282514811402214,0.90771484500059885]
[null,null,null,null,null,null,78,24,1,3.12,3.12,0.72222222222222221,0.21852675529138785,2.7466565733328157,4.4933282866664079,1.7466717133335923,0,3.2191733195008356,0.2176246140807066,0.25060402167332357,0.47720769175724886,0.79289145599257815,1.257353721972061E-3,1.257353721972061E-3,1.3303126631890367,1.7697317818411076E-3,1.7697317818411076E-3,1.5048619741579417,9.2848992011928033E-2,8.5334025974025979E-2,1.5974400000000007E-2,0,0.19575689102694319,2.8457806134204184,0.17006781329410936,2.9073407999999999E-2,0.20216684372094232,4.6725120000000009E-2,8.3999999999999993E-4,3.7440000000000001E-2,0.15500159999999999,0.14227200000000001,3.8280000000000002E-2,0.94653239503409359,0.98798065648976763,0.98798065648976763,15.600000000000001,0.94043996813420228,4.9851003449927509,4.7868949330607311,null,94.043996813420222,0.47720769175724886,0.44464885474788551,0.22659547022694321,0.21758613332094232,0.92185654650513438]
[null,null,null,null,null,null,79,24,1,3.16,3.16,0.73148148148148151,0.21865707984090654,2.7479322043571273,4.5339661021785638,1.7860338978214365,0,3.2580455721150656,0.22291207994955028,0.25060402167332357,0.48282151017519764,0.79325969895021464,1.2585218999571703E-3,1.2585218999571703E-3,1.3466656028079551,1.8135082457861132E-3,1.8135082457861132E-3,1.523487610136554,9.516159442782314E-2,8.6428051948051962E-2,1.5974400000000007E-2,0,0.19923246291314362,2.8799038962678942,0.17417077548651899,2.9446144E-2,0.20678633955307707,4.7324160000000004E-2,8.3999999999999993E-4,3.7440000000000001E-2,0.15500159999999999,0.14227200000000001,3.8280000000000002E-2,0.96030122748526781,1.0034225352780717,1.0034225352780717,15.8,0.9402846334922883,5.07026098728916,4.892872871767695,null,94.028463349228829,0.48282151017519764,0.45334296246622069,0.23046640851314362,0.22240331235307706,0.93616447264141833]
[null,null,null,null,null,null,80,24,1,3.2,3.2,0.7407407407407407,0.21878739529317912,2.7492072890541035,4.5746036445270519,1.8253963554729484,0,3.2969448069157936,0.22826674625682944,0.25060402167332357,0.48851201311790898,0.79362778419673397,1.2596901196980355E-3,1.2596901196980355E-3,1.3630363777175585,1.8578681669814028E-3,1.8578681669814028E-3,1.54213653347711,9.7505588603276697E-2,8.7522077922077945E-2,1.5974400000000007E-2,0,0.20274168993275041,2.9140452933961445,0.17832485941124865,2.9818879999999999E-2,0.21146212737512626,4.7923199999999999E-2,8.3999999999999993E-4,3.7440000000000001E-2,0.15500159999999999,0.14227200000000001,3.8280000000000002E-2,0.9742197738667564,1.0190679583790454,1.0190679583790454,16,0.94012198782734591,5.156162042520509,5.0000892342527781,null,94.012198782734586,0.48851201311790898,0.4621270173078767,0.2343710019327504,0.22727678337512627,0.95063903042578568]
[null,null,null,null,null,null,81,24,1,3.24,3.24,0.75000000000000011,0.21891770164915794,2.7504818274809431,4.6152409137404717,1.8647590862595287,0,3.335870079945447,0.23368861299578012,0.25060402167332357,0.49427941051454066,0.79399571174864814,1.2608583805504847E-3,1.2608583805504847E-3,1.3794245971911507,1.9028122193359685E-3,1.9028122193359685E-3,1.5608083079673161,9.9881025543011648E-2,8.8616103896103915E-2,1.5974400000000007E-2,0,0.20628467482817228,2.9482039644596245,0.18253003893716438,3.0191616000000001E-2,0.21619430700136011,4.8522240000000001E-2,8.3999999999999993E-4,3.7440000000000001E-2,0.15500159999999999,0.14227200000000001,3.8280000000000002E-2,0.98828805904538364,1.0349182583657213,1.0349182583657213,16.200000000000003,0.93995223865576627,5.24280577101979,5.1085462164299225,null,93.995223865576634,0.49427941051454066,0.47100122182953236,0.23830935322817229,0.23220664620136011,0.96528063234407302]
[null,null,null,null,null,null,82,24,1,3.28,3.28,0.75925925925925919,0.21904799890979557,2.7517558196948433,4.6558779098474217,1.9041220901525782,0,3.3748204901794954,0.23917768015964277,0.25060402167332357,0.50012391543091406,0.79436348162246861,1.2620266818707401E-3,1.2620266818707401E-3,1.3958298879219768,1.9483410760162783E-3,1.9483410760162783E-3,1.5795025169617241,0.10228795624462529,8.9710129870129884E-2,1.5974400000000007E-2,0,0.20986152105002354,2.9823791073314183,0.18678628793678592,3.0564351999999996E-2,0.22098297990193805,4.9121279999999989E-2,8.3999999999999993E-4,3.7440000000000001E-2,0.15500159999999999,0.14227200000000001,3.8280000000000002E-2,1.0025061078845074,1.0509747906183982,1.0509747906183982,16.399999999999999,0.93977558255465476,5.3301944487005173,5.2182460506426374,null,93.977558255465482,0.50012391543091406,0.47996578095196157,0.24228156585002353,0.23719300230193804,0.98008969638287557]
[null,null,null,null,null,null,83,24,1,3.32,3.32,0.76851851851851838,0.21917828707604411,2.7530292657529887,4.696514632876494,1.9434853671235055,0,3.4137951771463535,0.24473394774166177,0.25060402167332357,0.50604574408967029,0.79473109383470297,1.263195023015407E-3,1.263195023015407E-3,1.4122518930582146,1.994455409446511E-3,1.994455409446511E-3,1.5982187622978086,0.10472643169859031,9.0804155844155854E-2,1.5974400000000007E-2,0,0.21347233276228417,3.0165699559842736,0.19109358028628623,3.0937087999999995E-2,0.22582824920935171,4.9720319999999998E-2,8.3999999999999993E-4,3.7440000000000001E-2,0.15500159999999999,0.14227200000000001,3.8280000000000002E-2,1.0168739452440176,1.0672389336407377,1.0672389336407377,16.599999999999998,0.93959220579687897,5.4183303671702516,5.329191005805737,null,93.959220579687894,0.50604574408967029,0.48902090197163589,0.24628774396228417,0.2422359548093517,0.99506664606130624]
[null,null,null,null,null,null,84,24,1,3.36,3.36,0.77777777777777779,0.21930856614885569,2.754302165712557,4.7371510828562782,1.9828489171437214,0,3.452793318701648,0.25035741573508558,0.25060402167332357,0.51204511589076795,0.79509854840185712,1.2643634033414806E-3,1.2643634033414806E-3,1.4286902713005376,2.0411558913088039E-3,2.0411558913088039E-3,1.6169566632823142,0.10719650288825609,9.1898181818181837E-2,1.5974400000000007E-2,0,0.21711721484750512,3.050775778509077,0.19545188986549097,3.1309823999999993E-2,0.23073021972499197,5.0319359999999994E-2,8.3999999999999993E-4,3.7440000000000001E-2,0.15500159999999999,0.14227200000000001,3.8280000000000002E-2,1.0313915959803381,1.0837120893827921,1.0837120893827921,16.8,0.93940228494138134,5.5072158338451134,5.4413833875498234,null,93.94022849413814,0.51204511589076795,0.49816679457249707,0.25032799244750514,0.24733560852499198,1.010211910463265]
[null,null,null,null,null,null,85,24,1,3.4,3.4,0.78703703703703698,0.21943883612918233,2.7555745196307195,4.7777872598153595,2.0222127401846404,0,3.4918141289454643,0.2560480841331666,0.25060402167332357,0.51812225343232265,0.79546584534043485,1.2655318222063452E-3,1.2655318222063452E-3,1.445144696057628,2.0884431925434939E-3,2.0884431925434939E-3,1.6357158557426927,0.10969822078985003,9.2992207792207807E-2,1.5974400000000007E-2,0,0.22079627291206036,3.0849958752606335,0.19986119055787757,3.1682559999999999E-2,0.2356889979258405,5.0918400000000003E-2,8.3999999999999993E-4,3.7440000000000001E-2,0.15500159999999999,0.14227200000000001,3.8280000000000002E-2,1.0460590849464255,1.1003956835711048,1.1003956835711048,17,0.93920598738237071,5.5968531720653276,5.5548255383684912,null,93.920598738237075,0.51812225343232265,0.50740367083790083,0.25440241691206034,0.2524920699258405,1.0255259242702235]
[null,null,null,null,null,null,86,24,1,3.44,3.44,0.79629629629629617,0.21956909701797589,2.756846327564638,4.8184231637823185,2.061576836217681,0,3.5308568562721265,0.26180595292916159,0.25060402167332357,0.52427738253179546,0.79583298466693753,1.266700278967772E-3,1.266700278967772E-3,1.4616148546554122,2.1363179833493616E-3,2.1363179833493616E-3,1.6544959911388739,0.11223163637247879,9.4086233766233776E-2,1.5974400000000007E-2,0,0.22450961329144511,3.1192295771214531,0.20432145625057488,3.2055295999999997E-2,0.2407046919712878,5.1517439999999991E-2,8.3999999999999993E-4,3.7440000000000001E-2,0.15500159999999999,0.14227200000000001,3.8280000000000002E-2,1.0608764369917727,1.1172911660460483,1.1172911660460483,17.2,0.9390034718606689,5.6872447212117931,5.6695198377683313,null,93.900347186066895,0.52427738253179546,0.51673174526273291,0.25851112369144513,0.25770544717128779,1.0410091277945284]
[null,null,null,null,null,null,87,24,1,3.48,3.48,0.80555555555555547,0.21969934881618805,2.7581175895714676,4.8590587947857333,2.1009412052142662,0,3.5699207815429128,0.26763102211633122,0.25060402167332357,0.53051073224752943,0.79619996639786428,1.2678687729839205E-3,1.2678687729839205E-3,1.478100447596127,2.1847809331838712E-3,2.1847809331838712E-3,1.6732967357310053,0.11479680059812956,9.5180259740259759E-2,1.5974400000000007E-2,0,0.22825734305562104,3.1534762438749917,0.20883266083436247,3.2428031999999996E-2,0.2457774117100775,5.2116479999999993E-2,8.3999999999999993E-4,3.7440000000000001E-2,0.15500159999999999,0.14227200000000001,3.8280000000000002E-2,1.0758436769624067,1.1344000111065453,1.1344000111065453,17.399999999999999,0.93879488894019936,5.778392836823663,5.7854687024217055,null,93.879488894019943,0.53051073224752943,0.52615123476569858,0.26265421985562104,0.26297585011007751,1.056661967013228]
[null,null,null,null,null,null,88,24,1,3.52,3.52,0.81481481481481488,0.21982959152477036,2.7593883057083533,4.8996941528541766,2.1403058471458234,0,3.6090052163728812,0.27352329168794004,0.25060402167332357,0.53682253490064358,0.79656679054971158,1.2690373036133363E-3,1.2690373036133363E-3,1.4946011878636427,2.2338327107634119E-3,2.2338327107634119E-3,1.6921177697991421,0.11739376442167092,9.6274285714285729E-2,1.5974400000000007E-2,0,0.23203957001440903,3.1877352626804885,0.21339477820366953,3.2800768000000001E-2,0.25090726868737795,5.2715519999999995E-2,8.3999999999999993E-4,3.7440000000000001E-2,0.15500159999999999,0.14227200000000001,3.8280000000000002E-2,1.0909608297008899,1.1517237178623443,1.1517237178623443,17.600000000000001,0.93858038145233291,5.8702998907169981,5.9026745863223145,null,93.858038145233294,0.53682253490064358,0.53566235870178702,0.26683181321440902,0.26830339028737793,1.0724848936024305]
[null,null,null,null,null,null,89,24,1,3.56,3.56,0.82407407407407407,0.21995982514467435,2.7606584760324346,4.9403292380162176,2.1796707619837825,0,3.6481095015236971,0.27948276163725705,0.25060402167332357,0.54321302609728461,0.79693345713897412,1.2702058702149541E-3,1.2702058702149541E-3,1.5111168002717557,2.2834739840635492E-3,2.2834739840635492E-3,1.7109587869112028,0.12002257879085486,9.7368311688311698E-2,1.5974400000000007E-2,0,0.2358564027229309,3.2220060466421883,0.2180077822565753,3.3173503999999999E-2,0.25609437615198355,5.3314559999999997E-2,8.3999999999999993E-4,3.7440000000000001E-2,0.15500159999999999,0.14227200000000001,3.8280000000000002E-2,1.1062279200463228,1.1692638105940121,1.1692638105940121,17.8,0.9383600849105701,5.9629682711044802,6.0211399809436381,null,93.836008491057015,0.54321302609728461,0.54526533887491446,0.27104401232293091,0.27368818095198355,1.088478364972199]
[null,null,null,null,null,null,90,24,1,3.6,3.6,0.83333333333333326,0.22009004967685122,2.7619281006008412,4.9809640503004209,2.2190359496995793,0,3.6872330053949733,0.28550943195755502,0.25060402167332357,0.5496824447512404,0.79729996618214372,1.2713744721480952E-3,1.2713744721480952E-3,1.527647020852414,2.3337054203192561E-3,2.3337054203192561E-3,1.7298194932357738,0.12268329464631723,9.8462337662337682E-2,1.5974400000000007E-2,0,0.23970795048709817,3.2562880334662623,0.22267164689480712,3.3546239999999998E-2,0.26133884906364346,5.3913599999999999E-2,8.3999999999999993E-4,3.7440000000000001E-2,0.15500159999999999,0.14227200000000001,3.8280000000000002E-2,1.1216449728343407,1.1870218391208132,1.1870218391208132,18,0.93813412789781836,6.0564003827161601,6.140867415400157,null,93.813412789781836,0.5496824447512404,0.55496039955074161,0.27529092648709819,0.27913033706364349,1.104642844301982]
[null,null,null,null,null,null,91,24,1,3.64,3.64,0.84259259259259256,0.22022026512225229,2.7631971794706964,5.0215985897353486,2.2584014102646517,0,3.726375122607255,0.29160330264211093,0.25060402167332357,0.55623103310692312,0.79766631769571061,1.2725431087724686E-3,1.2725431087724686E-3,1.544191596281097,2.3845276860251629E-3,2.3845276860251629E-3,1.7486996068966443,0.1253759629215796,9.9556363636363651E-2,1.5974400000000007E-2,0,0.24359432336915141,3.2905806841993344,0.22738634602374094,3.3918975999999997E-2,0.26664080410052299,5.4512640000000001E-2,8.3999999999999993E-4,3.7440000000000001E-2,0.15500159999999999,0.14227200000000001,3.8280000000000002E-2,1.1372120128971188,1.2049993791766547,1.2049993791766547,18.2,0.93790263242833549,6.1505986469213312,6.2618594566115053,null,93.790263242833547,0.55623103310692312,0.56474776746967437,0.27957266576915141,0.28462997530052297,1.1209788005765975]
[null,null,null,null,null,null,92,24,1,3.68,3.68,0.85185185185185186,0.22035047148182851,2.7644657126991139,5.0622328563495573,2.297767143650443,0,3.7655352726702862,0.29776437368420583,0.25060402167332357,0.56285903676272098,0.79803251169616207,1.2737117794481701E-3,1.2737117794481701E-3,1.5607502833367657,2.4359414469357944E-3,2.4359414469357944E-3,1.7675988573661718,0.12810063454305007,0.10065038961038962,1.5974400000000007E-2,0,0.24751563219324829,3.3248834820429258,0.23215185355239973,3.4291712000000002E-2,0.27200035966679348,5.5111680000000003E-2,8.3999999999999993E-4,3.7440000000000001E-2,0.15500159999999999,0.14227200000000001,3.8280000000000002E-2,1.1529290650633688,1.2231980327942755,1.2231980327942755,18.400000000000002,0.93766571428622048,6.2455655018514626,6.3841187094694565,null,93.766571428622044,0.56285903676272098,0.57462767186004182,0.28388934099324831,0.29018721406679349,1.1374867086227627]
[null,null,null,null,null,null,93,24,1,3.72,3.72,0.86111111111111116,0.22048066875653086,2.7657337003432003,5.1028668501716004,2.3371331498284,0,3.8047128987307102,0.3039926450771247,0.25060402167332357,0.56956670469472692,0.79839854819998324,1.2748804835356819E-3,1.2748804835356819E-3,1.5773228483940172,2.4879473680658156E-3,2.4879473680658156E-3,1.7865169848948192,0.13085736043002472,0.1017444155844156,1.5974400000000007E-2,0,0.25147198855110237,3.3591959312386299,0.23696814339345348,3.4664448E-2,0.27741763590035745,5.5710720000000005E-2,8.3999999999999993E-4,3.7440000000000001E-2,0.15500159999999999,0.14227200000000001,3.8280000000000002E-2,1.1687961541583423,1.2416194286978668,1.2416194286978668,18.600000000000001,0.93742348334218861,6.3413034025242521,6.5076478170078644,null,93.74234833421886,0.56956670469472692,0.58460034445145981,0.28824106375110237,0.29580217350035748,1.1541670491461868]
[null,null,null,null,null,null,94,24,1,3.76,3.76,0.87037037037037013,0.22061085694731003,2.767001142460054,5.1435005712300264,2.3764994287699728,0,3.8439074663937913,0.31028811681415669,0.25060402167332357,0.57635428928084764,0.79876442722365715,1.2760492203958743E-3,1.2760492203958743E-3,1.5939090669452485,2.5405461136902728E-3,2.5405461136902728E-3,1.8054537399743951,0.13364619149468876,0.10283844155844157,1.5974400000000007E-2,0,0.25546350480767221,3.3935175560191828,0.24183518946321858,3.5037183999999992E-2,0.28289275468070485,5.630976E-2,8.3999999999999993E-4,3.7440000000000001E-2,0.15500159999999999,0.14227200000000001,3.8280000000000002E-2,1.1848133050038292,1.2602652227043158,1.2602652227043158,18.799999999999997,0.9371760438502108,6.4378148209687884,6.6324494605755069,null,93.717604385021076,0.57635428928084764,0.59466601948837705,0.2926279464076722,0.30147497548070484,1.1710203087692248]
[null,null,null,null,null,null,95,24,1,3.8,3.8,0.87962962962962954,0.22074103605511677,2.7682680391067653,5.1841340195533823,2.4158659804466174,0,3.8831184626141657,0.31665078888859505,0.25060402167332357,0.58322204632529584,0.79913014878366428,1.2772179893900028E-3,1.2772179893900028E-3,1.6105087231508046,2.5937383473448351E-3,2.5937383473448351E-3,1.8244088828327321,0.13646717864211808,0.10393246753246753,1.5974400000000007E-2,0,0.25949029410690244,3.4278478996209887,0.24675296568165653,3.5409919999999998E-2,0.28842583963690377,5.6908799999999996E-2,8.3999999999999993E-4,3.7440000000000001E-2,0.15500159999999999,0.14227200000000001,3.8280000000000002E-2,1.200980542418161,1.279137098133265,1.279137098133265,19,0.93692349472547265,6.5351022463518529,6.7585263600118832,null,93.692349472547264,0.58322204632529584,0.60482493374380619,0.29705010210690241,0.30720574363690378,1.188046980069102]
[null,null,null,null,null,null,96,24,1,3.84,3.84,{"$f":"Vout*K105/(Vin*Efficiency)","v":0.88888888888888884},0.22087120608090152,{"$f":"(Vin-(Rdson1+Rdcr)*K105-Vout)*M105/(Fsw*Lf)","v":2.7695343903404175},5.2247671951702088,2.4552328048297909,{"$f":"IF(MIN(Vin, -P105/(Coss_Q1+Coss_Q2)*0.00000002)<0, 0, MIN(Vin, -P105/(Coss_Q1+Coss_Q2)*0.00000002))","v":0},3.9223453946509932,{"$f":"R105^2*Rdcr","v":0.32308066129373697},0.25060402167332357,{"$f":"(T105+S105*(1+Ltc*(Ta-25)))/(1-S105*Ltc*ThetaCa)","v":0.59017023508347255},0.79949571289648313,1.2783867898797116E-3,1.2783867898797116E-3,1.6271216094152385,2.647524731826036E-3,2.647524731826036E-3,1.8433821829576886,{"$f":"Rdson1*AB105^2","v":0.13932037277028},0.10502649350649353,1.5974400000000007E-2,0,{"$f":"(AF105+AE105+AD105+AC105*(1+RdsonTopTc*Ta-RdsonTopTc*25))/(1-AC105*RdsonTopTc*ThetaJA_Q1)","v":0.26355247037751561},3.4621865233539917,{"$f":"Rdson2*AH105^2","v":0.251721445972374},3.5782655999999996E-2,{"$f":"(AJ105+AI105*(1+RdsonBotTc*Ta-RdsonBotTc*25))/(1-AI105*RdsonBotTc*ThetaJA_Q2)","v":0.29401701615572778},5.7507840000000005E-2,8.3999999999999993E-4,3.7440000000000001E-2,0.15500159999999999,0.14227200000000001,3.8280000000000002E-2,1.2172978912162082,1.2982367662261927,1.2982367662261927,19.2,0.93666592980498564,6.6331681851053439,6.8858812738260111,null,93.666592980498564,0.59017023508347255,0.61507732653324343,0.30150764477751563,0.31299460335572776,1.205247561616716]
[null,null,null,null,null,null,97,24,1,3.88,3.88,{"$f":"Vout*K106/(Vin*Efficiency)","v":0.89814814814814803},0.22100136702561474,{"$f":"(Vin-(Rdson1+Rdcr)*K106-Vout)*M106/(Fsw*Lf)","v":2.7708001962180848},5.2654000981090423,2.4945999018909575,{"$f":"IF(MIN(Vin, -P106/(Coss_Q1+Coss_Q2)*0.00000002)<0, 0, MIN(Vin, -P106/(Coss_Q1+Coss_Q2)*0.00000002))","v":0},3.96158778908325,{"$f":"R106^2*Rdcr","v":0.32957773402288382},0.25060402167332357,{"$f":"(T106+S106*(1+Ltc*(Ta-25)))/(1-S106*Ltc*ThetaCa)","v":0.59719911828724292},0.79986111957858963,1.2795556212270298E-3,1.2795556212270298E-3,1.643747525987953,2.7019059291915164E-3,2.7019059291915164E-3,1.8623734186485414,{"$f":"Rdson1*AB106^2","v":0.14220582477003488},0.1061205194805195,1.5974400000000007E-2,0,{"$f":"(AF106+AE106+AD106+AC106*(1+RdsonTopTc*Ta-RdsonTopTc*25))/(1-AC106*RdsonTopTc*ThetaJA_Q1)","v":0.26765014833885714},3.4965330057250794,{"$f":"Rdson2*AH106^2","v":0.25674060426262202},3.6155391999999995E-2,{"$f":"(AJ106+AI106*(1+RdsonBotTc*Ta-RdsonBotTc*25))/(1-AI106*RdsonBotTc*ThetaJA_Q2)","v":0.29966641138991845},5.810688E-2,8.3999999999999993E-4,3.7440000000000001E-2,0.15500159999999999,0.14227200000000001,3.8280000000000002E-2,1.2337653762093839,1.3175659665747219,1.3175659665747219,19.399999999999999,0.93640343809207827,6.7320151610548571,7.0145169993782055,null,93.64034380920782,0.59719911828724292,0.62542343972877557,0.30600068913885714,0.31884168178991845,1.2226225580160186]
[null,null,null,null,null,null,98,24,1,3.92,3.92,{"$f":"Vout*K107/(Vin*Efficiency)","v":0.90740740740740744},0.2211315188902066,{"$f":"(Vin-(Rdson1+Rdcr)*K107-Vout)*M107/(Fsw*Lf)","v":2.7720654567968332},5.3060327283984163,2.5339672716015835,{"$f":"IF(MIN(Vin, -P107/(Coss_Q1+Coss_Q2)*0.00000002)<0, 0, MIN(Vin, -P107/(Coss_Q1+Coss_Q2)*0.00000002))","v":0},4.0008451908811944,{"$f":"R107^2*Rdcr","v":0.33614200706934078},0.25060402167332357,{"$f":"(T107+S107*(1+Ltc*(Ta-25)))/(1-S107*Ltc*ThetaCa)","v":0.6043089621706097},0.80022636884645737,1.2807244827943729E-3,1.2807244827943729E-3,1.6603862805866183,2.7568826007602644E-3,2.7568826007602644E-3,1.881382376592958,{"$f":"Rdson1*AB107^2","v":0.14512358552513727},0.10721454545454548,1.5974400000000007E-2,0,{"$f":"(AF107+AE107+AD107+AC107*(1+RdsonTopTc*Ta-RdsonTopTc*25))/(1-AC107*RdsonTopTc*ThetaJA_Q1)","v":0.27178344350679329},3.5308869416115005,{"$f":"Rdson2*AH107^2","v":0.26181041448329495},3.6528127999999993E-2,{"$f":"(AJ107+AI107*(1+RdsonBotTc*Ta-RdsonBotTc*25))/(1-AI107*RdsonBotTc*ThetaJA_Q2)","v":0.30537415426658471},5.8705919999999995E-2,8.3999999999999993E-4,3.7440000000000001E-2,0.15500159999999999,0.14227200000000001,3.8280000000000002E-2,1.2503830222056422,1.3371264675583685,1.3371264675583685,19.600000000000001,0.93613610398589231,6.8316457155494517,7.1444363730648641,null,93.61361039858923,0.6043089621706097,0.63586351777337802,0.31052935070679327,0.32474710786658473,1.2401724799439877]
[null,null,null,null,null,null,99,24,1,3.96,3.96,{"$f":"Vout*K108/(Vin*Efficiency)","v":0.91666666666666663},0.2212616616756273,{"$f":"(Vin-(Rdson1+Rdcr)*K108-Vout)*M108/(Fsw*Lf)","v":2.7733301721337229},5.3466650860668619,2.5733349139331385,{"$f":"IF(MIN(Vin, -P108/(Coss_Q1+Coss_Q2)*0.00000002)<0, 0, MIN(Vin, -P108/(Coss_Q1+Coss_Q2)*0.00000002))","v":0},4.0401171625303478,{"$f":"R108^2*Rdcr","v":0.3427734804264177},0.25060402167332357,{"$f":"(T108+S108*(1+Ltc*(Ta-25)))/(1-S108*Ltc*ThetaCa)","v":0.61150003649579177},0.80059146071655807,1.2818933739445445E-3,1.2818933739445445E-3,1.6770376880418825,2.8124554071128627E-3,2.8124554071128627E-3,1.9004088514678861,{"$f":"Rdson1*AB108^2","v":0.14807370591223709},0.10830857142857145,1.5974400000000007E-2,0,{"$f":"(AF108+AE108+AD108+AC108*(1+RdsonTopTc*Ta-RdsonTopTc*25))/(1-AC108*RdsonTopTc*ThetaJA_Q1)","v":0.27595247219966235},3.5652479414810383,{"$f":"Rdson2*AH108^2","v":0.2669308505689304},3.6900863999999998E-2,{"$f":"(AJ108+AI108*(1+RdsonBotTc*Ta-RdsonBotTc*25))/(1-AI108*RdsonBotTc*ThetaJA_Q2)","v":0.31114037549574292},5.9304959999999997E-2,8.3999999999999993E-4,3.7440000000000001E-2,0.15500159999999999,0.14227200000000001,3.8280000000000002E-2,1.2671508540094802,1.3569200667919523,1.3569200667919523,19.8,0.93586400749692367,6.9320624075925714,7.2756422705063439,null,93.586400749692373,0.61150003649579177,0.64639780769540522,0.31509374579966232,0.3307110122957429,1.257897844191197]
[null,null,null,null,null,null,100,24,1,4,4,{"$f":"Vout*K109/(Vin*Efficiency)","v":0.92592592592592582},0.22139179538282677,{"$f":"(Vin-(Rdson1+Rdcr)*K109-Vout)*M109/(Fsw*Lf)","v":2.7745943422858033},5.3872971711429019,2.6127028288570981,{"$f":"IF(MIN(Vin, -P109/(Coss_Q1+Coss_Q2)*0.00000002)<0, 0, MIN(Vin, -P109/(Coss_Q1+Coss_Q2)*0.00000002))","v":0},4.079403283204587,{"$f":"R109^2*Rdcr","v":0.34947215408742766},0.25060402167332357,{"$f":"(T109+S109*(1+Ltc*(Ta-25)))/(1-S109*Ltc*ThetaCa)","v":0.618772614579708},0.80095639520536066,1.2830622940407316E-3,1.2830622940407316E-3,1.6937015699619924,2.8686250080917179E-3,2.8686250080917179E-3,1.9194526455628103,{"$f":"Rdson1*AB109^2","v":0.15105623680088093},0.10940259740259742,1.5974400000000007E-2,0,{"$f":"(AF109+AE109+AD109+AC109*(1+RdsonTopTc*Ta-RdsonTopTc*25))/(1-AC109*RdsonTopTc*ThetaJA_Q1)","v":0.28015735154427979},3.5996156306559026,{"$f":"Rdson2*AH109^2","v":0.27210188645770811},3.7273599999999997E-2,{"$f":"(AJ109+AI109*(1+RdsonBotTc*Ta-RdsonBotTc*25))/(1-AI109*RdsonBotTc*ThetaJA_Q2)","v":0.31696520757899405},5.9903999999999999E-2,8.3999999999999993E-4,3.7440000000000001E-2,0.15500159999999999,0.14227200000000001,3.8280000000000002E-2,1.2840688964219378,1.3769485915828896,1.3769485915828896,20,0.93558722444956166,7.033267813974156,7.4081376067378688,null,93.55872244495616,0.618772614579708,0.65702655912327379,0.3196939915442798,0.33673352757899405,1.2757991737029819]

{"sheet":"Efficiency Plot Management","index":9,"n_rows":3,"n_cols":1,"rows_kept":3,"cut":false,"hidden":true,"merged":[]}
[]
[{"$f":"\"EFF_Ch1\"","v":"EFF_Ch1"}]
[{"$f":"\"EFF_Ch2\"","v":"EFF_Ch2"}]

{"sheet":"Standard Value Calculator","index":10,"n_rows":159,"n_cols":16,"rows_kept":159,"cut":false,"hidden":true,"merged":[]}
[]
["Capacitors","Css","Cc1ea","Cc2ea","Cout","Cin","Cres","Cdither","Cc3ea","Cc4ea"]
["Inputs",{"$f":"Css","v":{"$error":"#NAME?"}},{"$f":"Cc1ea","v":1.3999620261352328E-11},{"$f":"Cc2ea","v":-1.2203243565018321E-13},{"$f":"Cout","v":6.0000000000000002E-5},{"$f":"Cin","v":2.0000000000000002E-5},{"$f":"Cres","v":{"$error":"#NAME?"}},{"$f":"Cdither_init","v":{"$error":"#NAME?"}},{"$f":"Cc3ea","v":{"$error":"#NAME?"}},{"$f":"Cc4ea","v":{"$error":"#NAME?"}},null,null,"Resistors","inputs","Standard Result"]
["Standard Result",{"$f":"SUM(B6:B158)/1000000000000","v":{"$error":"#NAME?"}},{"$f":"IF(C3=\"OPEN\",\"OPEN\",SUM(C6:C158)/1000000000000)","v":1.5E-11},{"$f":"SUM(D6:D158)/1000000000000","v":0},{"$f":"SUM(E6:E158)/1000000000000","v":5.5999999999999999E-5},{"$f":"SUM(F6:F158)/1000000000000","v":2.1999999999999999E-5},{"$f":"SUM(G6:G158)/1000000000000","v":{"$error":"#NAME?"}},{"$f":"IF(H3=\"OPEN\",\"OPEN\",SUM(H6:H158)/1000000000000)","v":{"$error":"#NAME?"}},{"$f":"IF(I3=\"OPEN\",\"OPEN\",SUM(I6:I158)/1000000000000)","v":{"$error":"#NAME?"}},{"$f":"IF(J3=\"OPEN\",\"OPEN\",SUM(J6:J158)/1000000000000)","v":{"$error":"#NAME?"}},null,null,"Rt",{"$f":"Rfadj","v":15.8},{"$f":"IF(N4>(INT(0.5+100*POWER(10,IF(96*(LOG(N4)-INT(LOG(N4)))-ROUND(96*(LOG(N4)-INT(LOG(N4))),0)<0,ROUND(96*(LOG(N4)-INT(LOG(N4))),0)-1,ROUND(96*(LOG(N4)-INT(LOG(N4))),0))/96))*POWER(10,INT(LOG(N4))-2)+INT(0.5+100*POWER(10,(IF(96*(LOG(N4)-INT(LOG(N4)))-ROUND(96*(LOG(N4)-INT(LOG(N4))),0)<0,ROUND(96*(LOG(N4)-INT(LOG(N4))),0)-1,ROUND(96*(LOG(N4)-INT(LOG(N4))),0))+1)/96))*POWER(10,INT(LOG(N4))-2))/2,INT(0.5+100*POWER(10,(IF(96*(LOG(N4)-INT(LOG(N4)))-ROUND(96*(LOG(N4)-INT(LOG(N4))),0)<0,ROUND(96*(LOG(N4)-INT(LOG(N4))),0)-1,ROUND(96*(LOG(N4)-INT(LOG(N4))),0))+1)/96))*POWER(10,INT(LOG(N4))-2),INT(0.5+100*POWER(10,IF(96*(LOG(N4)-INT(LOG(N4)))-ROUND(96*(LOG(N4)-INT(LOG(N4))),0)<0,ROUND(96*(LOG(N4)-INT(LOG(N4))),0)-1,ROUND(96*(LOG(N4)-INT(LOG(N4))),0))/96))*POWER(10,INT(LOG(N4))-2))","v":15.8},"Ω"]
["(pF)"]
[0.47,{"$f":"IF(IF((B$3*10^12-$A7)*(B$3*10^12-$A6)*-1<0,0,1)*IF(ABS(B$3*10^12-$A7)>(B$3*10^12-$A6),$A6,$A7)=B7,0,IF((B$3*10^12-$A7)*(B$3*10^12-$A6)*-1<0,0,1)*IF(ABS(B$3*10^12-$A7)>(B$3*10^12-$A6),$A6,$A7))","v":{"$error":"#NAME?"}},0,0,0,0,{"$error":"#NAME?"},{"$error":"#NAME?"},{"$error":"#NAME?"},{"$error":"#NAME?"}]
[0.56000000000000005,{"$f":"IF(IF((B$3*10^12-$A8)*(B$3*10^12-$A7)*-1<0,0,1)*IF(ABS(B$3*10^12-$A8)>(B$3*10^12-$A7),$A7,$A8)=B8,0,IF((B$3*10^12-$A8)*(B$3*10^12-$A7)*-1<0,0,1)*IF(ABS(B$3*10^12-$A8)>(B$3*10^12-$A7),$A7,$A8))","v":{"$error":"#NAME?"}},{"$f":"IF(IF((C$3*10^12-$A8)*(C$3*10^12-$A7)*-1<0,0,1)*IF(ABS(C$3*10^12-$A8)>(C$3*10^12-$A7),$A7,$A8)=C8,0,IF((C$3*10^12-$A8)*(C$3*10^12-$A7)*-1<0,0,1)*IF(ABS(C$3*10^12-$A8)>(C$3*10^12-$A7),$A7,$A8))","v":0},{"$f":"IF(IF((D$3*10^12-$A8)*(D$3*10^12-$A7)*-1<0,0,1)*IF(ABS(D$3*10^12-$A8)>(D$3*10^12-$A7),$A7,$A8)=D8,0,IF((D$3*10^12-$A8)*(D$3*10^12-$A7)*-1<0,0,1)*IF(ABS(D$3*10^12-$A8)>(D$3*10^12-$A7),$A7,$A8))","v":0},{"$f":"IF(IF((E$3*10^12-$A8)*(E$3*10^12-$A7)*-1<0,0,1)*IF(ABS(E$3*10^12-$A8)>(E$3*10^12-$A7),$A7,$A8)=E8,0,IF((E$3*10^12-$A8)*(E$3*10^12-$A7)*-1<0,0,1)*IF(ABS(E$3*10^12-$A8)>(E$3*10^12-$A7),$A7,$A8))","v":0},{"$f":"IF(IF((F$3*10^12-$A8)*(F$3*10^12-$A7)*-1<0,0,1)*IF(ABS(F$3*10^12-$A8)>(F$3*10^12-$A7),$A7,$A8)=F8,0,IF((F$3*10^12-$A8)*(F$3*10^12-$A7)*-1<0,0,1)*IF(ABS(F$3*10^12-$A8)>(F$3*10^12-$A7),$A7,$A8))","v":0},{"$f":"IF(IF((G$3*10^12-$A8)*(G$3*10^12-$A7)*-1<0,0,1)*IF(ABS(G$3*10^12-$A8)>(G$3*10^12-$A7),$A7,$A8)=G8,0,IF((G$3*10^12-$A8)*(G$3*10^12-$A7)*-1<0,0,1)*IF(ABS(G$3*10^12-$A8)>(G$3*10^12-$A7),$A7,$A8))","v":{"$error":"#NAME?"}},{"$error":"#NAME?"},{"$error":"#NAME?"},{"$error":"#NAME?"},null,null,"Renb",{"$f":"Renb","v":99888.961634149513},{"$f":"IF(N7>(INT(0.5+100*POWER(10,IF(96*(LOG(N7)-INT(LOG(N7)))-ROUND(96*(LOG(N7)-INT(LOG(N7))),0)<0,ROUND(96*(LOG(N7)-INT(LOG(N7))),0)-1,ROUND(96*(LOG(N7)-INT(LOG(N7))),0))/96))*POWER(10,INT(LOG(N7))-2)+INT(0.5+100*POWER(10,(IF(96*(LOG(N7)-INT(LOG(N7)))-ROUND(96*(LOG(N7)-INT(LOG(N7))),0)<0,ROUND(96*(LOG(N7)-INT(LOG(N7))),0)-1,ROUND(96*(LOG(N7)-INT(LOG(N7))),0))+1)/96))*POWER(10,INT(LOG(N7))-2))/2,INT(0.5+100*POWER(10,(IF(96*(LOG(N7)-INT(LOG(N7)))-ROUND(96*(LOG(N7)-INT(LOG(N7))),0)<0,ROUND(96*(LOG(N7)-INT(LOG(N7))),0)-1,ROUND(96*(LOG(N7)-INT(LOG(N7))),0))+1)/96))*POWER(10,INT(LOG(N7))-2),INT(0.5+100*POWER(10,IF(96*(LOG(N7)-INT(LOG(N7)))-ROUND(96*(LOG(N7)-INT(LOG(N7))),0)<0,ROUND(96*(LOG(N7)-INT(LOG(N7))),0)-1,ROUND(96*(LOG(N7)-INT(LOG(N7))),0))/96))*POWER(10,INT(LOG(N7))-2))","v":100000},"Ω"]
[0.68,{"$error":"#NAME?"},0,0,0,0,{"$error":"#NAME?"},{"$error":"#NAME?"},{"$error":"#NAME?"},{"$error":"#NAME?"},null,null,"Rc1ea",{"$f":"Rcea2","v":0},{"$f":"IF(N8>(INT(0.5+100*POWER(10,IF(96*(LOG(N8)-INT(LOG(N8)))-ROUND(96*(LOG(N8)-INT(LOG(N8))),0)<0,ROUND(96*(LOG(N8)-INT(LOG(N8))),0)-1,ROUND(96*(LOG(N8)-INT(LOG(N8))),0))/96))*POWER(10,INT(LOG(N8))-2)+INT(0.5+100*POWER(10,(IF(96*(LOG(N8)-INT(LOG(N8)))-ROUND(96*(LOG(N8)-INT(LOG(N8))),0)<0,ROUND(96*(LOG(N8)-INT(LOG(N8))),0)-1,ROUND(96*(LOG(N8)-INT(LOG(N8))),0))+1)/96))*POWER(10,INT(LOG(N8))-2))/2,INT(0.5+100*POWER(10,(IF(96*(LOG(N8)-INT(LOG(N8)))-ROUND(96*(LOG(N8)-INT(LOG(N8))),0)<0,ROUND(96*(LOG(N8)-INT(LOG(N8))),0)-1,ROUND(96*(LOG(N8)-INT(LOG(N8))),0))+1)/96))*POWER(10,INT(LOG(N8))-2),INT(0.5+100*POWER(10,IF(96*(LOG(N8)-INT(LOG(N8)))-ROUND(96*(LOG(N8)-INT(LOG(N8))),0)<0,ROUND(96*(LOG(N8)-INT(LOG(N8))),0)-1,ROUND(96*(LOG(N8)-INT(LOG(N8))),0))/96))*POWER(10,INT(LOG(N8))-2))","v":{"$error":"#NUM!"}},"Ω"]
[0.82,{"$error":"#NAME?"},0,0,0,0,{"$error":"#NAME?"},{"$error":"#NAME?"},{"$error":"#NAME?"},{"$error":"#NAME?"}]
[1,{"$error":"#NAME?"},0,0,0,0,{"$error":"#NAME?"},{"$error":"#NAME?"},{"$error":"#NAME?"},{"$error":"#NAME?"},null,null,"Rfb1",{"$f":"Rfb1_","v":10000},{"$f":"IF(N10>(INT(0.5+100*POWER(10,IF(96*(LOG(N10)-INT(LOG(N10)))-ROUND(96*(LOG(N10)-INT(LOG(N10))),0)<0,ROUND(96*(LOG(N10)-INT(LOG(N10))),0)-1,ROUND(96*(LOG(N10)-INT(LOG(N10))),0))/96))*POWER(10,INT(LOG(N10))-2)+INT(0.5+100*POWER(10,(IF(96*(LOG(N10)-INT(LOG(N10)))-ROUND(96*(LOG(N10)-INT(LOG(N10))),0)<0,ROUND(96*(LOG(N10)-INT(LOG(N10))),0)-1,ROUND(96*(LOG(N10)-INT(LOG(N10))),0))+1)/96))*POWER(10,INT(LOG(N10))-2))/2,INT(0.5+100*POWER(10,(IF(96*(LOG(N10)-INT(LOG(N10)))-ROUND(96*(LOG(N10)-INT(LOG(N10))),0)<0,ROUND(96*(LOG(N10)-INT(LOG(N10))),0)-1,ROUND(96*(LOG(N10)-INT(LOG(N10))),0))+1)/96))*POWER(10,INT(LOG(N10))-2),INT(0.5+100*POWER(10,IF(96*(LOG(N10)-INT(LOG(N10)))-ROUND(96*(LOG(N10)-INT(LOG(N10))),0)<0,ROUND(96*(LOG(N10)-INT(LOG(N10))),0)-1,ROUND(96*(LOG(N10)-INT(LOG(N10))),0))/96))*POWER(10,INT(LOG(N10))-2))","v":10000},"Ω"]
[1.2,{"$error":"#NAME?"},0,0,0,0,{"$error":"#NAME?"},{"$error":"#NAME?"},{"$error":"#NAME?"},{"$error":"#NAME?"},null,null,"Rfb2",{"$f":"Rfb2_","v":40000},{"$f":"IF(N11=\"OPEN\",\"OPEN\",IF(N11>(INT(0.5+100*POWER(10,IF(96*(LOG(N11)-INT(LOG(N11)))-ROUND(96*(LOG(N11)-INT(LOG(N11))),0)<0,ROUND(96*(LOG(N11)-INT(LOG(N11))),0)-1,ROUND(96*(LOG(N11)-INT(LOG(N11))),0))/96))*POWER(10,INT(LOG(N11))-2)+INT(0.5+100*POWER(10,(IF(96*(LOG(N11)-INT(LOG(N11)))-ROUND(96*(LOG(N11)-INT(LOG(N11))),0)<0,ROUND(96*(LOG(N11)-INT(LOG(N11))),0)-1,ROUND(96*(LOG(N11)-INT(LOG(N11))),0))+1)/96))*POWER(10,INT(LOG(N11))-2))/2,INT(0.5+100*POWER(10,(IF(96*(LOG(N11)-INT(LOG(N11)))-ROUND(96*(LOG(N11)-INT(LOG(N11))),0)<0,ROUND(96*(LOG(N11)-INT(LOG(N11))),0)-1,ROUND(96*(LOG(N11)-INT(LOG(N11))),0))+1)/96))*POWER(10,INT(LOG(N11))-2),INT(0.5+100*POWER(10,IF(96*(LOG(N11)-INT(LOG(N11)))-ROUND(96*(LOG(N11)-INT(LOG(N11))),0)<0,ROUND(96*(LOG(N11)-INT(LOG(N11))),0)-1,ROUND(96*(LOG(N11)-INT(LOG(N11))),0))/96))*POWER(10,INT(LOG(N11))-2)))","v":40200},"Ω"]
[1.5,{"$error":"#NAME?"},0,0,0,0,{"$error":"#NAME?"},{"$error":"#NAME?"},{"$error":"#NAME?"},{"$error":"#NAME?"},null,null,"Rt1",{"$f":"'Variable Management'!B25*1000","v":15737.884615384617},{"$f":"IF(N12>(INT(0.5+100*POWER(10,IF(96*(LOG(N12)-INT(LOG(N12)))-ROUND(96*(LOG(N12)-INT(LOG(N12))),0)<0,ROUND(96*(LOG(N12)-INT(LOG(N12))),0)-1,ROUND(96*(LOG(N12)-INT(LOG(N12))),0))/96))*POWER(10,INT(LOG(N12))-2)+INT(0.5+100*POWER(10,(IF(96*(LOG(N12)-INT(LOG(N12)))-ROUND(96*(LOG(N12)-INT(LOG(N12))),0)<0,ROUND(96*(LOG(N12)-INT(LOG(N12))),0)-1,ROUND(96*(LOG(N12)-INT(LOG(N12))),0))+1)/96))*POWER(10,INT(LOG(N12))-2))/2,INT(0.5+100*POWER(10,(IF(96*(LOG(N12)-INT(LOG(N12)))-ROUND(96*(LOG(N12)-INT(LOG(N12))),0)<0,ROUND(96*(LOG(N12)-INT(LOG(N12))),0)-1,ROUND(96*(LOG(N12)-INT(LOG(N12))),0))+1)/96))*POWER(10,INT(LOG(N12))-2),INT(0.5+100*POWER(10,IF(96*(LOG(N12)-INT(LOG(N12)))-ROUND(96*(LOG(N12)-INT(LOG(N12))),0)<0,ROUND(96*(LOG(N12)-INT(LOG(N12))),0)-1,ROUND(96*(LOG(N12)-INT(LOG(N12))),0))/96))*POWER(10,INT(LOG(N12))-2))","v":15800},"Ω"]
[1.8,{"$error":"#NAME?"},0,0,0,0,{"$error":"#NAME?"},{"$error":"#NAME?"},{"$error":"#NAME?"},{"$error":"#NAME?"},null,null,"Rt2",{"$f":"'Variable Management'!#REF!*1000","v":{"$error":"#REF!"}},{"$f":"IF(N13=\"OPEN\",\"OPEN\",IF(N13>(INT(0.5+100*POWER(10,IF(96*(LOG(N13)-INT(LOG(N13)))-ROUND(96*(LOG(N13)-INT(LOG(N13))),0)<0,ROUND(96*(LOG(N13)-INT(LOG(N13))),0)-1,ROUND(96*(LOG(N13)-INT(LOG(N13))),0))/96))*POWER(10,INT(LOG(N13))-2)+INT(0.5+100*POWER(10,(IF(96*(LOG(N13)-INT(LOG(N13)))-ROUND(96*(LOG(N13)-INT(LOG(N13))),0)<0,ROUND(96*(LOG(N13)-INT(LOG(N13))),0)-1,ROUND(96*(LOG(N13)-INT(LOG(N13))),0))+1)/96))*POWER(10,INT(LOG(N13))-2))/2,INT(0.5+100*POWER(10,(IF(96*(LOG(N13)-INT(LOG(N13)))-ROUND(96*(LOG(N13)-INT(LOG(N13))),0)<0,ROUND(96*(LOG(N13)-INT(LOG(N13))),0)-1,ROUND(96*(LOG(N13)-INT(LOG(N13))),0))+1)/96))*POWER(10,INT(LOG(N13))-2),INT(0.5+100*POWER(10,IF(96*(LOG(N13)-INT(LOG(N13)))-ROUND(96*(LOG(N13)-INT(LOG(N13))),0)<0,ROUND(96*(LOG(N13)-INT(LOG(N13))),0)-1,ROUND(96*(LOG(N13)-INT(LOG(N13))),0))/96))*POWER(10,INT(LOG(N13))-2)))","v":{"$error":"#REF!"}},"Ω"]
[2.2000000000000002,{"$f":"IF(IF((B$3*10^12-$A15)*(B$3*10^12-$A14)*-1<0,0,1)*IF(ABS(B$3*10^12-$A15)>(B$3*10^12-$A14),$A14,$A15)=B15,0,IF((B$3*10^12-$A15)*(B$3*10^12-$A14)*-1<0,0,1)*IF(ABS(B$3*10^12-$A15)>(B$3*10^12-$A14),$A14,$A15))","v":{"$error":"#NAME?"}},0,0,0,0,{"$error":"#NAME?"},{"$error":"#NAME?"},{"$error":"#NAME?"},{"$error":"#NAME?"}]
[2.7,{"$error":"#NAME?"},0,0,0,0,{"$error":"#NAME?"},{"$error":"#NAME?"},{"$error":"#NAME?"},{"$error":"#NAME?"}]
[3.3,{"$error":"#NAME?"},0,0,0,0,{"$error":"#NAME?"},{"$error":"#NAME?"},{"$error":"#NAME?"},{"$error":"#NAME?"},null,null,"Rs",{"$f":"Rs_ideal*1000","v":{"$error":"#NAME?"}},{"$f":"IF(N16=0,0,IF(N16>(INT(0.5+100*POWER(10,IF(96*(LOG(N16)-INT(LOG(N16)))-ROUND(96*(LOG(N16)-INT(LOG(N16))),0)<0,ROUND(96*(LOG(N16)-INT(LOG(N16))),0)-1,ROUND(96*(LOG(N16)-INT(LOG(N16))),0))/96))*POWER(10,INT(LOG(N16))-2)+INT(0.5+100*POWER(10,(IF(96*(LOG(N16)-INT(LOG(N16)))-ROUND(96*(LOG(N16)-INT(LOG(N16))),0)<0,ROUND(96*(LOG(N16)-INT(LOG(N16))),0)-1,ROUND(96*(LOG(N16)-INT(LOG(N16))),0))+1)/96))*POWER(10,INT(LOG(N16))-2))/2,INT(0.5+100*POWER(10,(IF(96*(LOG(N16)-INT(LOG(N16)))-ROUND(96*(LOG(N16)-INT(LOG(N16))),0)<0,ROUND(96*(LOG(N16)-INT(LOG(N16))),0)-1,ROUND(96*(LOG(N16)-INT(LOG(N16))),0))+1)/96))*POWER(10,INT(LOG(N16))-2),INT(0.5+100*POWER(10,IF(96*(LOG(N16)-INT(LOG(N16)))-ROUND(96*(LOG(N16)-INT(LOG(N16))),0)<0,ROUND(96*(LOG(N16)-INT(LOG(N16))),0)-1,ROUND(96*(LOG(N16)-INT(LOG(N16))),0))/96))*POWER(10,INT(LOG(N16))-2)))","v":{"$error":"#NAME?"}},"mΩ"]
[3.9,{"$error":"#NAME?"},0,0,0,0,{"$error":"#NAME?"},{"$error":"#NAME?"},{"$error":"#NAME?"},{"$error":"#NAME?"},null,null,"Cres",{"$f":"Cres","v":{"$error":"#NAME?"}},{"$f":"G4*1000000000000","v":{"$error":"#NAME?"}},"pF"]
[4.7,{"$error":"#NAME?"},0,0,0,0,{"$error":"#NAME?"},{"$error":"#NAME?"},{"$error":"#NAME?"},{"$error":"#NAME?"}]
[5.6,{"$error":"#NAME?"},0,0,0,0,{"$error":"#NAME?"},{"$error":"#NAME?"},{"$error":"#NAME?"},{"$error":"#NAME?"}]
[6.8,{"$error":"#NAME?"},0,0,0,0,{"$error":"#NAME?"},{"$error":"#NAME?"},{"$error":"#NAME?"},{"$error":"#NAME?"}]
[8.1999999999999993,{"$error":"#NAME?"},0,0,0,0,{"$error":"#NAME?"},{"$error":"#NAME?"},{"$error":"#NAME?"},{"$error":"#NAME?"}]
[10,{"$error":"#NAME?"},0,0,0,0,{"$error":"#NAME?"},{"$error":"#NAME?"},{"$error":"#NAME?"},{"$error":"#NAME?"},null,null,"Cdither",{"$f":"Cdither_init","v":{"$error":"#NAME?"}},{"$f":"H4","v":{"$error":"#NAME?"}}]
[12,{"$error":"#NAME?"},15,0,0,0,{"$error":"#NAME?"},{"$error":"#NAME?"},{"$error":"#NAME?"},{"$error":"#NAME?"}]
[15,{"$error":"#NAME?"},0,0,0,0,{"$error":"#NAME?"},{"$error":"#NAME?"},{"$error":"#NAME?"},{"$error":"#NAME?"}]
[18,{"$error":"#NAME?"},0,0,0,0,{"$error":"#NAME?"},{"$error":"#NAME?"},{"$error":"#NAME?"},{"$error":"#NAME?"}]
[22,{"$error":"#NAME?"},0,0,0,0,{"$error":"#NAME?"},{"$error":"#NAME?"},{"$error":"#NAME?"},{"$error":"#NAME?"}]
[27,{"$error":"#NAME?"},0,0,0,0,{"$error":"#NAME?"},{"$error":"#NAME?"},{"$error":"#NAME?"},{"$error":"#NAME?"}]
[33,{"$error":"#NAME?"},0,0,0,0,{"$error":"#NAME?"},{"$error":"#NAME?"},{"$error":"#NAME?"},{"$error":"#NAME?"}]
[39,{"$error":"#NAME?"},0,0,0,0,{"$error":"#NAME?"},{"$error":"#NAME?"},{"$error":"#NAME?"},{"$error":"#NAME?"}]
[47,{"$error":"#NAME?"},0,0,0,0,{"$error":"#NAME?"},{"$error":"#NAME?"},{"$error":"#NAME?"},{"$error":"#NAME?"},null,null,"Rc1",{"$f":"O7/1000&\" kΩ\"","v":"100 kΩ"},{"$f":"O7/1000","v":100},"kΩ"]
[56,{"$error":"#NAME?"},0,0,0,0,{"$error":"#NAME?"},{"$error":"#NAME?"},{"$error":"#NAME?"},{"$error":"#NAME?"},null,null,"Cc1",{"$f":"C4*1000000000&\" nF\"","v":"0.015 nF"},{"$f":"C4*1000000000","v":1.4999999999999999E-2},"nF"]
[68,{"$error":"#NAME?"},0,0,0,0,{"$error":"#NAME?"},{"$error":"#NAME?"},{"$error":"#NAME?"},{"$error":"#NAME?"},null,null,"Cc2",{"$f":"D4*1000000000000&\" pF\"","v":"0 pF"},{"$f":"D4*1000000000000","v":0},"pF"]
[82,{"$error":"#NAME?"},0,0,0,0,{"$error":"#NAME?"},{"$error":"#NAME?"},{"$error":"#NAME?"},{"$error":"#NAME?"}]
[{"$f":"A22*10","v":100},{"$error":"#NAME?"},0,0,0,0,{"$error":"#NAME?"},{"$error":"#NAME?"},{"$error":"#NAME?"},{"$error":"#NAME?"},null,null,"Rc2",{"$f":"O8/1000&\" kΩ\"","v":{"$error":"#NUM!"}},{"$f":"O8/1000","v":{"$error":"#NUM!"}},"kΩ"]
[{"$f":"A23*10","v":120},{"$error":"#NAME?"},0,0,0,0,{"$error":"#NAME?"},{"$error":"#NAME?"},{"$error":"#NAME?"},{"$error":"#NAME?"},null,null,"Cc3",{"$f":"I4*1000000000&\" nF\"","v":{"$error":"#NAME?"}},{"$f":"I4*1000000000","v":{"$error":"#NAME?"}},"nF"]
[150,{"$error":"#NAME?"},0,0,0,0,{"$error":"#NAME?"},{"$error":"#NAME?"},{"$error":"#NAME?"},{"$error":"#NAME?"},null,null,"Cc4",{"$f":"J4*1000000000000&\" pF\"","v":{"$error":"#NAME?"}},{"$f":"J4*1000000000000","v":{"$error":"#NAME?"}},"pF"]
[180,{"$error":"#NAME?"},0,0,0,0,{"$error":"#NAME?"},{"$error":"#NAME?"},{"$error":"#NAME?"},{"$error":"#NAME?"}]
[220,{"$error":"#NAME?"},0,0,0,0,{"$error":"#NAME?"},{"$error":"#NAME?"},{"$error":"#NAME?"},{"$error":"#NAME?"}]
[270,{"$error":"#NAME?"},{"$f":"IF(IF((C$3*10^12-$A40)*(C$3*10^12-$A39)*-1<0,0,1)*IF(ABS(C$3*10^12-$A40)>(C$3*10^12-$A39),$A39,$A40)=C40,0,IF((C$3*10^12-$A40)*(C$3*10^12-$A39)*-1<0,0,1)*IF(ABS(C$3*10^12-$A40)>(C$3*10^12-$A39),$A39,$A40))","v":0},0,0,0,{"$error":"#NAME?"},{"$error":"#NAME?"},{"$error":"#NAME?"},{"$error":"#NAME?"}]
[330,{"$error":"#NAME?"},0,0,0,0,{"$error":"#NAME?"},{"$error":"#NAME?"},{"$error":"#NAME?"},{"$error":"#NAME?"}]
[390,{"$error":"#NAME?"},0,0,0,0,{"$error":"#NAME?"},{"$error":"#NAME?"},{"$error":"#NAME?"},{"$error":"#NAME?"}]
[470,{"$error":"#NAME?"},0,0,0,0,{"$error":"#NAME?"},{"$error":"#NAME?"},{"$error":"#NAME?"},{"$error":"#NAME?"}]
[560,{"$error":"#NAME?"},0,0,0,0,{"$error":"#NAME?"},{"$error":"#NAME?"},{"$error":"#NAME?"},{"$error":"#NAME?"}]
[680,{"$error":"#NAME?"},0,0,0,0,{"$error":"#NAME?"},{"$error":"#NAME?"},{"$error":"#NAME?"},{"$error":"#NAME?"}]
[{"$f":"A33*10","v":820},{"$error":"#NAME?"},0,0,0,0,{"$error":"#NAME?"},{"$error":"#NAME?"},{"$error":"#NAME?"},{"$error":"#NAME?"}]
[1000,{"$error":"#NAME?"},0,0,0,0,{"$error":"#NAME?"},{"$error":"#NAME?"},{"$error":"#NAME?"},{"$error":"#NAME?"}]
[1200,{"$error":"#NAME?"},0,0,0,0,{"$error":"#NAME?"},{"$error":"#NAME?"},{"$error":"#NAME?"},{"$error":"#NAME?"}]
[1500,{"$error":"#NAME?"},0,0,0,0,{"$error":"#NAME?"},{"$error":"#NAME?"},{"$error":"#NAME?"},{"$error":"#NAME?"}]
[1800,{"$error":"#NAME?"},0,0,0,0,{"$error":"#NAME?"},{"$error":"#NAME?"},{"$error":"#NAME?"},{"$error":"#NAME?"}]
[2200,{"$error":"#NAME?"},0,0,0,0,{"$error":"#NAME?"},{"$error":"#NAME?"},{"$error":"#NAME?"},{"$error":"#NAME?"}]
[2700,{"$error":"#NAME?"},0,0,0,0,{"$error":"#NAME?"},{"$error":"#NAME?"},{"$error":"#NAME?"},{"$error":"#NAME?"}]
[3300,{"$error":"#NAME?"},0,0,0,0,{"$error":"#NAME?"},{"$error":"#NAME?"},{"$error":"#NAME?"},{"$error":"#NAME?"}]
[3900,{"$error":"#NAME?"},0,0,0,0,{"$error":"#NAME?"},{"$error":"#NAME?"},{"$error":"#NAME?"},{"$error":"#NAME?"}]
[4700,{"$error":"#NAME?"},0,0,0,0,{"$error":"#NAME?"},{"$error":"#NAME?"},{"$error":"#NAME?"},{"$error":"#NAME?"}]
[5600,{"$error":"#NAME?"},0,0,0,0,{"$error":"#NAME?"},{"$error":"#NAME?"},{"$error":"#NAME?"},{"$error":"#NAME?"}]
[6800,{"$error":"#NAME?"},0,0,0,0,{"$error":"#NAME?"},{"$error":"#NAME?"},{"$error":"#NAME?"},{"$error":"#NAME?"}]
[8200,{"$error":"#NAME?"},0,0,0,0,{"$error":"#NAME?"},{"$error":"#NAME?"},{"$error":"#NAME?"},{"$error":"#NAME?"}]
[10000,{"$error":"#NAME?"},0,0,0,0,{"$error":"#NAME?"},{"$error":"#NAME?"},{"$error":"#NAME?"},{"$error":"#NAME?"}]
[12000,{"$error":"#NAME?"},0,0,0,0,{"$error":"#NAME?"},{"$error":"#NAME?"},{"$error":"#NAME?"},{"$error":"#NAME?"}]
[15000,{"$error":"#NAME?"},0,0,0,0,{"$error":"#NAME?"},{"$error":"#NAME?"},{"$error":"#NAME?"},{"$error":"#NAME?"}]
[18000,{"$error":"#NAME?"},0,0,0,0,{"$error":"#NAME?"},{"$error":"#NAME?"},{"$error":"#NAME?"},{"$error":"#NAME?"}]
[22000,{"$error":"#NAME?"},0,0,0,0,{"$error":"#NAME?"},{"$error":"#NAME?"},{"$error":"#NAME?"},{"$error":"#NAME?"}]
[27000,{"$error":"#NAME?"},0,0,0,0,{"$error":"#NAME?"},{"$error":"#NAME?"},{"$error":"#NAME?"},{"$error":"#NAME?"}]
[33000,{"$error":"#NAME?"},0,0,0,0,{"$error":"#NAME?"},{"$error":"#NAME?"},{"$error":"#NAME?"},{"$error":"#NAME?"}]
[39000,{"$error":"#NAME?"},0,0,0,0,{"$error":"#NAME?"},{"$error":"#NAME?"},{"$error":"#NAME?"},{"$error":"#NAME?"}]
[47000,{"$error":"#NAME?"},0,0,0,0,{"$error":"#NAME?"},{"$error":"#NAME?"},{"$error":"#NAME?"},{"$error":"#NAME?"}]
[56000,{"$error":"#NAME?"},0,0,0,0,{"$error":"#NAME?"},{"$error":"#NAME?"},{"$error":"#NAME?"},{"$error":"#NAME?"}]
[68000,{"$error":"#NAME?"},0,0,0,0,{"$error":"#NAME?"},{"$error":"#NAME?"},{"$error":"#NAME?"},{"$error":"#NAME?"}]
[82000,{"$error":"#NAME?"},0,0,0,0,{"$error":"#NAME?"},{"$error":"#NAME?"},{"$error":"#NAME?"},{"$f":"IF(IF((J$3*10^12-$A70)*(J$3*10^12-$A69)*-1<0,0,1)*IF(ABS(J$3*10^12-$A70)>(J$3*10^12-$A69),$A69,$A70)=J70,0,IF((J$3*10^12-$A70)*(J$3*10^12-$A69)*-1<0,0,1)*IF(ABS(J$3*10^12-$A70)>(J$3*10^12-$A69),$A69,$A70))","v":{"$error":"#NAME?"}}]
[100000,{"$error":"#NAME?"},0,{"$f":"IF(IF((D$3*10^12-$A71)*(D$3*10^12-$A70)*-1<0,0,1)*IF(ABS(D$3*10^12-$A71)>(D$3*10^12-$A70),$A70,$A71)=D71,0,IF((D$3*10^12-$A71)*(D$3*10^12-$A70)*-1<0,0,1)*IF(ABS(D$3*10^12-$A71)>(D$3*10^12-$A70),$A70,$A71))","v":0},0,0,{"$error":"#NAME?"},{"$error":"#NAME?"},{"$error":"#NAME?"},{"$error":"#NAME?"}]
[120000,{"$f":"IF(IF((B$3*10^12-$A72)*(B$3*10^12-$A71)*-1<0,0,1)*IF(ABS(B$3*10^12-$A72)>(B$3*10^12-$A71),$A71,$A72)=B72,0,IF((B$3*10^12-$A72)*(B$3*10^12-$A71)*-1<0,0,1)*IF(ABS(B$3*10^12-$A72)>(B$3*10^12-$A71),$A71,$A72))","v":{"$error":"#NAME?"}},{"$f":"IF(IF((C$3*10^12-$A72)*(C$3*10^12-$A71)*-1<0,0,1)*IF(ABS(C$3*10^12-$A72)>(C$3*10^12-$A71),$A71,$A72)=C72,0,IF((C$3*10^12-$A72)*(C$3*10^12-$A71)*-1<0,0,1)*IF(ABS(C$3*10^12-$A72)>(C$3*10^12-$A71),$A71,$A72))","v":0},0,0,{"$f":"IF(IF((F$3*10^12-$A72)*(F$3*10^12-$A71)*-1<0,0,1)*IF(ABS(F$3*10^12-$A72)>(F$3*10^12-$A71),$A71,$A72)=F72,0,IF((F$3*10^12-$A72)*(F$3*10^12-$A71)*-1<0,0,1)*IF(ABS(F$3*10^12-$A72)>(F$3*10^12-$A71),$A71,$A72))","v":0},{"$f":"IF(IF((G$3*10^12-$A72)*(G$3*10^12-$A71)*-1<0,0,1)*IF(ABS(G$3*10^12-$A72)>(G$3*10^12-$A71),$A71,$A72)=G72,0,IF((G$3*10^12-$A72)*(G$3*10^12-$A71)*-1<0,0,1)*IF(ABS(G$3*10^12-$A72)>(G$3*10^12-$A71),$A71,$A72))","v":{"$error":"#NAME?"}},{"$f":"IF(IF((H$3*10^12-$A72)*(H$3*10^12-$A71)*-1<0,0,1)*IF(ABS(H$3*10^12-$A72)>(H$3*10^12-$A71),$A71,$A72)=H72,0,IF((H$3*10^12-$A72)*(H$3*10^12-$A71)*-1<0,0,1)*IF(ABS(H$3*10^12-$A72)>(H$3*10^12-$A71),$A71,$A72))","v":{"$error":"#NAME?"}},{"$f":"IF(IF((I$3*10^12-$A72)*(I$3*10^12-$A71)*-1<0,0,1)*IF(ABS(I$3*10^12-$A72)>(I$3*10^12-$A71),$A71,$A72)=I72,0,IF((I$3*10^12-$A72)*(I$3*10^12-$A71)*-1<0,0,1)*IF(ABS(I$3*10^12-$A72)>(I$3*10^12-$A71),$A71,$A72))","v":{"$error":"#NAME?"}},{"$error":"#NAME?"}]
[150000,{"$error":"#NAME?"},0,0,0,0,{"$error":"#NAME?"},{"$error":"#NAME?"},{"$error":"#NAME?"},{"$error":"#NAME?"}]
[180000,{"$error":"#NAME?"},0,0,0,0,{"$error":"#NAME?"},{"$error":"#NAME?"},{"$error":"#NAME?"},{"$error":"#NAME?"}]
[220000,{"$error":"#NAME?"},0,0,0,0,{"$error":"#NAME?"},{"$error":"#NAME?"},{"$error":"#NAME?"},{"$error":"#NAME?"}]
[270000,{"$error":"#NAME?"},0,0,0,0,{"$error":"#NAME?"},{"$error":"#NAME?"},{"$error":"#NAME?"},{"$error":"#NAME?"}]
[330000,{"$error":"#NAME?"},0,0,0,0,{"$error":"#NAME?"},{"$error":"#NAME?"},{"$error":"#NAME?"},{"$error":"#NAME?"}]
[390000,{"$error":"#NAME?"},0,0,0,0,{"$error":"#NAME?"},{"$error":"#NAME?"},{"$error":"#NAME?"},{"$error":"#NAME?"}]
[470000,{"$error":"#NAME?"},0,0,0,0,{"$error":"#NAME?"},{"$error":"#NAME?"},{"$error":"#NAME?"},{"$error":"#NAME?"}]
[560000,{"$error":"#NAME?"},0,0,0,0,{"$error":"#NAME?"},{"$error":"#NAME?"},{"$error":"#NAME?"},{"$error":"#NAME?"}]
[680000,{"$error":"#NAME?"},0,0,0,0,{"$error":"#NAME?"},{"$error":"#NAME?"},{"$error":"#NAME?"},{"$error":"#NAME?"}]
[820000,{"$error":"#NAME?"},0,0,0,0,{"$error":"#NAME?"},{"$error":"#NAME?"},{"$error":"#NAME?"},{"$error":"#NAME?"}]
[1000000,{"$error":"#NAME?"},0,0,0,0,{"$error":"#NAME?"},{"$error":"#NAME?"},{"$error":"#NAME?"},{"$error":"#NAME?"}]
[1200000,{"$error":"#NAME?"},0,0,0,0,{"$error":"#NAME?"},{"$error":"#NAME?"},{"$error":"#NAME?"},{"$error":"#NAME?"}]
[1500000,{"$error":"#NAME?"},0,0,0,0,{"$error":"#NAME?"},{"$error":"#NAME?"},{"$error":"#NAME?"},{"$error":"#NAME?"}]
[1800000,{"$error":"#NAME?"},0,0,0,0,{"$error":"#NAME?"},{"$error":"#NAME?"},{"$error":"#NAME?"},{"$error":"#NAME?"}]
[2200000,{"$error":"#NAME?"},0,0,0,0,{"$error":"#NAME?"},{"$error":"#NAME?"},{"$error":"#NAME?"},{"$error":"#NAME?"}]
[2700000,{"$error":"#NAME?"},0,0,0,0,{"$error":"#NAME?"},{"$error":"#NAME?"},{"$error":"#NAME?"},{"$error":"#NAME?"}]
[3300000,{"$error":"#NAME?"},0,0,0,0,{"$error":"#NAME?"},{"$error":"#NAME?"},{"$error":"#NAME?"},{"$error":"#NAME?"}]
[3900000,{"$error":"#NAME?"},0,0,0,0,{"$error":"#NAME?"},{"$error":"#NAME?"},{"$error":"#NAME?"},{"$error":"#NAME?"}]
[4700000,{"$error":"#NAME?"},0,0,0,0,{"$error":"#NAME?"},{"$error":"#NAME?"},{"$error":"#NAME?"},{"$error":"#NAME?"}]
[5600000,{"$error":"#NAME?"},0,0,0,0,{"$error":"#NAME?"},{"$error":"#NAME?"},{"$error":"#NAME?"},{"$error":"#NAME?"}]
[6800000,{"$error":"#NAME?"},0,0,0,0,{"$error":"#NAME?"},{"$error":"#NAME?"},{"$error":"#NAME?"},{"$error":"#NAME?"}]
[8200000,{"$error":"#NAME?"},0,0,0,0,{"$error":"#NAME?"},{"$error":"#NAME?"},{"$error":"#NAME?"},{"$error":"#NAME?"}]
[10000000,{"$error":"#NAME?"},0,0,0,0,{"$error":"#NAME?"},{"$error":"#NAME?"},{"$error":"#NAME?"},{"$error":"#NAME?"}]
[12000000,{"$error":"#NAME?"},0,0,0,0,{"$error":"#NAME?"},{"$error":"#NAME?"},{"$error":"#NAME?"},{"$error":"#NAME?"}]
[15000000,{"$error":"#NAME?"},0,0,0,0,{"$error":"#NAME?"},{"$error":"#NAME?"},{"$error":"#NAME?"},{"$error":"#NAME?"}]
[18000000,{"$error":"#NAME?"},0,0,0,22000000,{"$error":"#NAME?"},{"$error":"#NAME?"},{"$error":"#NAME?"},{"$error":"#NAME?"}]
[22000000,{"$error":"#NAME?"},0,0,0,0,{"$error":"#NAME?"},{"$error":"#NAME?"},{"$error":"#NAME?"},{"$error":"#NAME?"}]
[{"$f":"A87*10","v":27000000},{"$error":"#NAME?"},0,0,0,0,{"$error":"#NAME?"},{"$error":"#NAME?"},{"$error":"#NAME?"},{"$error":"#NAME?"}]
[33000000,{"$error":"#NAME?"},0,0,0,0,{"$error":"#NAME?"},{"$error":"#NAME?"},{"$error":"#NAME?"},{"$error":"#NAME?"}]
[39000000,{"$error":"#NAME?"},0,0,0,0,{"$error":"#NAME?"},{"$error":"#NAME?"},{"$error":"#NAME?"},{"$error":"#NAME?"}]
[47000000,{"$error":"#NAME?"},0,0,0,0,{"$error":"#NAME?"},{"$error":"#NAME?"},{"$error":"#NAME?"},{"$error":"#NAME?"}]
[56000000,{"$error":"#NAME?"},0,0,56000000,{"$f":"IF(IF((F$3*10^12-$A104)*(F$3*10^12-$A103)*-1<0,0,1)*IF(ABS(F$3*10^12-$A104)>(F$3*10^12-$A103),$A103,$A104)=F104,0,IF((F$3*10^12-$A104)*(F$3*10^12-$A103)*-1<0,0,1)*IF(ABS(F$3*10^12-$A104)>(F$3*10^12-$A103),$A103,$A104))","v":0},{"$f":"IF(IF((G$3*10^12-$A104)*(G$3*10^12-$A103)*-1<0,0,1)*IF(ABS(G$3*10^12-$A104)>(G$3*10^12-$A103),$A103,$A104)=G104,0,IF((G$3*10^12-$A104)*(G$3*10^12-$A103)*-1<0,0,1)*IF(ABS(G$3*10^12-$A104)>(G$3*10^12-$A103),$A103,$A104))","v":{"$error":"#NAME?"}},{"$f":"IF(IF((H$3*10^12-$A104)*(H$3*10^12-$A103)*-1<0,0,1)*IF(ABS(H$3*10^12-$A104)>(H$3*10^12-$A103),$A103,$A104)=H104,0,IF((H$3*10^12-$A104)*(H$3*10^12-$A103)*-1<0,0,1)*IF(ABS(H$3*10^12-$A104)>(H$3*10^12-$A103),$A103,$A104))","v":{"$error":"#NAME?"}},{"$f":"IF(IF((I$3*10^12-$A104)*(I$3*10^12-$A103)*-1<0,0,1)*IF(ABS(I$3*10^12-$A104)>(I$3*10^12-$A103),$A103,$A104)=I104,0,IF((I$3*10^12-$A104)*(I$3*10^12-$A103)*-1<0,0,1)*IF(ABS(I$3*10^12-$A104)>(I$3*10^12-$A103),$A103,$A104))","v":{"$error":"#NAME?"}},{"$error":"#NAME?"}]
[68000000,{"$error":"#NAME?"},0,0,0,0,{"$error":"#NAME?"},{"$error":"#NAME?"},{"$error":"#NAME?"},{"$error":"#NAME?"}]
[82000000,{"$error":"#NAME?"},0,0,0,0,{"$error":"#NAME?"},{"$error":"#NAME?"},{"$error":"#NAME?"},{"$error":"#NAME?"}]
[100000000,{"$error":"#NAME?"},0,0,0,0,{"$error":"#NAME?"},{"$error":"#NAME?"},{"$error":"#NAME?"},{"$error":"#NAME?"}]
[120000000,{"$error":"#NAME?"},0,0,0,0,{"$error":"#NAME?"},{"$error":"#NAME?"},{"$error":"#NAME?"},{"$error":"#NAME?"}]
[150000000,{"$error":"#NAME?"},0,0,0,0,{"$error":"#NAME?"},{"$error":"#NAME?"},{"$error":"#NAME?"},{"$error":"#NAME?"}]
[180000000,{"$error":"#NAME?"},0,0,0,0,{"$error":"#NAME?"},{"$error":"#NAME?"},{"$error":"#NAME?"},{"$error":"#NAME?"}]
[220000000,{"$error":"#NAME?"},0,0,0,0,{"$error":"#NAME?"},{"$error":"#NAME?"},{"$error":"#NAME?"},{"$error":"#NAME?"}]
[270000000,{"$error":"#NAME?"},0,0,0,0,{"$error":"#NAME?"},{"$error":"#NAME?"},{"$error":"#NAME?"},{"$error":"#NAME?"}]
[330000000,{"$error":"#NAME?"},0,0,0,0,{"$error":"#NAME?"},{"$error":"#NAME?"},{"$error":"#NAME?"},{"$error":"#NAME?"}]
[390000000,{"$error":"#NAME?"},0,0,0,0,{"$error":"#NAME?"},{"$error":"#NAME?"},{"$error":"#NAME?"},{"$error":"#NAME?"}]
[470000000,{"$error":"#NAME?"},0,0,0,0,{"$error":"#NAME?"},{"$error":"#NAME?"},{"$error":"#NAME?"},{"$error":"#NAME?"}]
[560000000,{"$error":"#NAME?"},0,0,0,0,{"$error":"#NAME?"},{"$error":"#NAME?"},{"$error":"#NAME?"},{"$error":"#NAME?"}]
[680000000,{"$error":"#NAME?"},0,0,0,0,{"$error":"#NAME?"},{"$error":"#NAME?"},{"$error":"#NAME?"},{"$error":"#NAME?"}]
[820000000,{"$error":"#NAME?"},0,0,0,0,{"$error":"#NAME?"},{"$error":"#NAME?"},{"$error":"#NAME?"},{"$error":"#NAME?"}]
[1000000000,{"$error":"#NAME?"},0,0,0,0,{"$error":"#NAME?"},{"$error":"#NAME?"},{"$error":"#NAME?"},{"$error":"#NAME?"}]
[1200000000,{"$error":"#NAME?"},0,0,0,0,{"$error":"#NAME?"},{"$error":"#NAME?"},{"$error":"#NAME?"},{"$error":"#NAME?"}]
[1500000000,{"$error":"#NAME?"},0,0,0,0,{"$error":"#NAME?"},{"$error":"#NAME?"},{"$error":"#NAME?"},{"$error":"#NAME?"}]
[1800000000,{"$error":"#NAME?"},0,0,0,0,{"$error":"#NAME?"},{"$error":"#NAME?"},{"$error":"#NAME?"},{"$error":"#NAME?"}]
[2200000000,{"$error":"#NAME?"},0,0,0,0,{"$error":"#NAME?"},{"$error":"#NAME?"},{"$error":"#NAME?"},{"$error":"#NAME?"}]
[2700000000,{"$error":"#NAME?"},0,0,0,0,{"$error":"#NAME?"},{"$error":"#NAME?"},{"$error":"#NAME?"},{"$error":"#NAME?"}]
[3300000000,{"$error":"#NAME?"},0,0,0,0,{"$error":"#NAME?"},{"$error":"#NAME?"},{"$error":"#NAME?"},{"$error":"#NAME?"}]
[3900000000,{"$error":"#NAME?"},0,0,0,0,{"$error":"#NAME?"},{"$error":"#NAME?"},{"$error":"#NAME?"},{"$error":"#NAME?"}]
[4700000000,{"$error":"#NAME?"},0,0,0,0,{"$error":"#NAME?"},{"$error":"#NAME?"},{"$error":"#NAME?"},{"$error":"#NAME?"}]
[5600000000,{"$error":"#NAME?"},0,0,0,0,{"$error":"#NAME?"},{"$error":"#NAME?"},{"$error":"#NAME?"},{"$error":"#NAME?"}]
[6800000000,{"$error":"#NAME?"},0,0,0,0,{"$error":"#NAME?"},{"$error":"#NAME?"},{"$error":"#NAME?"},{"$error":"#NAME?"}]
[8200000000,{"$error":"#NAME?"},0,0,0,0,{"$error":"#NAME?"},{"$error":"#NAME?"},{"$error":"#NAME?"},{"$error":"#NAME?"}]
[10000000000,{"$error":"#NAME?"},0,0,0,0,{"$error":"#NAME?"},{"$error":"#NAME?"},{"$error":"#NAME?"},{"$error":"#NAME?"}]
[12000000000,{"$error":"#NAME?"},0,0,0,0,{"$error":"#NAME?"},{"$error":"#NAME?"},{"$error":"#NAME?"},{"$error":"#NAME?"}]
[15000000000,{"$error":"#NAME?"},0,0,0,0,{"$error":"#NAME?"},{"$error":"#NAME?"},{"$error":"#NAME?"},{"$error":"#NAME?"}]
[18000000000,{"$error":"#NAME?"},0,0,0,0,{"$error":"#NAME?"},{"$error":"#NAME?"},{"$error":"#NAME?"},{"$f":"IF(IF((J$3*10^12-$A134)*(J$3*10^12-$A133)*-1<0,0,1)*IF(ABS(J$3*10^12-$A134)>(J$3*10^12-$A133),$A133,$A134)=J134,0,IF((J$3*10^12-$A134)*(J$3*10^12-$A133)*-1<0,0,1)*IF(ABS(J$3*10^12-$A134)>(J$3*10^12-$A133),$A133,$A134))","v":{"$error":"#NAME?"}}]
[22000000000,{"$error":"#NAME?"},0,0,{"$f":"IF(IF((E$3*10^12-$A135)*(E$3*10^12-$A134)*-1<0,0,1)*IF(ABS(E$3*10^12-$A135)>(E$3*10^12-$A134),$A134,$A135)=E135,0,IF((E$3*10^12-$A135)*(E$3*10^12-$A134)*-1<0,0,1)*IF(ABS(E$3*10^12-$A135)>(E$3*10^12-$A134),$A134,$A135))","v":0},0,{"$error":"#NAME?"},{"$error":"#NAME?"},{"$error":"#NAME?"},{"$f":"IF(IF((J$3*10^12-$A135)*(J$3*10^12-$A134)*-1<0,0,1)*IF(ABS(J$3*10^12-$A135)>(J$3*10^12-$A134),$A134,$A135)=J135,0,IF((J$3*10^12-$A135)*(J$3*10^12-$A134)*-1<0,0,1)*IF(ABS(J$3*10^12-$A135)>(J$3*10^12-$A134),$A134,$A135))","v":{"$error":"#NAME?"}}]
[27000000000,{"$f":"IF(IF((B$3*10^12-$A136)*(B$3*10^12-$A135)*-1<0,0,1)*IF(ABS(B$3*10^12-$A136)>(B$3*10^12-$A135),$A135,$A136)=B136,0,IF((B$3*10^12-$A136)*(B$3*10^12-$A135)*-1<0,0,1)*IF(ABS(B$3*10^12-$A136)>(B$3*10^12-$A135),$A135,$A136))","v":{"$error":"#NAME?"}},{"$f":"IF(IF((C$3*10^12-$A136)*(C$3*10^12-$A135)*-1<0,0,1)*IF(ABS(C$3*10^12-$A136)>(C$3*10^12-$A135),$A135,$A136)=C136,0,IF((C$3*10^12-$A136)*(C$3*10^12-$A135)*-1<0,0,1)*IF(ABS(C$3*10^12-$A136)>(C$3*10^12-$A135),$A135,$A136))","v":0},0,0,0,{"$error":"#NAME?"},{"$error":"#NAME?"},{"$error":"#NAME?"},{"$error":"#NAME?"}]
[33000000000,{"$error":"#NAME?"},0,0,0,0,{"$error":"#NAME?"},{"$error":"#NAME?"},{"$error":"#NAME?"},{"$error":"#NAME?"}]
[39000000000,{"$error":"#NAME?"},0,0,0,0,{"$error":"#NAME?"},{"$error":"#NAME?"},{"$error":"#NAME?"},{"$error":"#NAME?"}]
[47000000000,{"$error":"#NAME?"},0,0,0,0,{"$error":"#NAME?"},{"$error":"#NAME?"},{"$error":"#NAME?"},{"$error":"#NAME?"}]
[56000000000,{"$error":"#NAME?"},0,0,0,0,{"$error":"#NAME?"},{"$error":"#NAME?"},{"$error":"#NAME?"},{"$error":"#NAME?"}]
[68000000000,{"$error":"#NAME?"},0,0,0,0,{"$error":"#NAME?"},{"$error":"#NAME?"},{"$error":"#NAME?"},{"$error":"#NAME?"}]
[82000000000,{"$error":"#NAME?"},0,0,0,0,{"$error":"#NAME?"},{"$error":"#NAME?"},{"$error":"#NAME?"},{"$error":"#NAME?"}]
[100000000000,{"$error":"#NAME?"},0,0,0,0,{"$error":"#NAME?"},{"$error":"#NAME?"},{"$error":"#NAME?"},{"$error":"#NAME?"}]
[120000000000,{"$error":"#NAME?"},0,0,0,0,{"$error":"#NAME?"},{"$error":"#NAME?"},{"$error":"#NAME?"},{"$error":"#NAME?"}]
[150000000000,{"$error":"#NAME?"},0,0,0,0,{"$error":"#NAME?"},{"$error":"#NAME?"},{"$error":"#NAME?"},{"$error":"#NAME?"}]
[180000000000,{"$error":"#NAME?"},0,0,0,0,{"$error":"#NAME?"},{"$error":"#NAME?"},{"$error":"#NAME?"},{"$error":"#NAME?"}]
[220000000000,{"$error":"#NAME?"},0,0,0,0,{"$error":"#NAME?"},{"$error":"#NAME?"},{"$error":"#NAME?"},{"$error":"#NAME?"}]
[270000000000,{"$error":"#NAME?"},0,0,0,0,{"$error":"#NAME?"},{"$error":"#NAME?"},{"$error":"#NAME?"},{"$error":"#NAME?"}]
[330000000000,{"$error":"#NAME?"},0,0,0,0,{"$error":"#NAME?"},{"$error":"#NAME?"},{"$error":"#NAME?"},{"$error":"#NAME?"}]
[390000000000,{"$error":"#NAME?"},0,0,0,0,{"$error":"#NAME?"},{"$error":"#NAME?"},{"$error":"#NAME?"},{"$error":"#NAME?"}]
[470000000000,{"$error":"#NAME?"},0,0,0,0,{"$error":"#NAME?"},{"$error":"#NAME?"},{"$error":"#NAME?"},{"$error":"#NAME?"}]
[560000000000,{"$error":"#NAME?"},0,0,0,0,{"$error":"#NAME?"},{"$error":"#NAME?"},{"$error":"#NAME?"},{"$error":"#NAME?"}]
[680000000000,{"$error":"#NAME?"},0,0,0,0,{"$error":"#NAME?"},{"$error":"#NAME?"},{"$error":"#NAME?"},{"$error":"#NAME?"}]
[820000000000,{"$error":"#NAME?"},0,0,0,0,{"$error":"#NAME?"},{"$error":"#NAME?"},{"$error":"#NAME?"},{"$error":"#NAME?"}]
[1000000000000,{"$error":"#NAME?"},0,0,0,0,{"$error":"#NAME?"},{"$error":"#NAME?"},{"$error":"#NAME?"},{"$error":"#NAME?"}]
[1200000000000,{"$error":"#NAME?"},0,0,0,0,{"$error":"#NAME?"},{"$error":"#NAME?"},{"$error":"#NAME?"},{"$error":"#NAME?"}]
[1500000000000,{"$error":"#NAME?"},0,0,0,0,{"$error":"#NAME?"},{"$error":"#NAME?"},{"$error":"#NAME?"},{"$error":"#NAME?"}]
[1800000000000,{"$error":"#NAME?"},0,0,0,0,{"$error":"#NAME?"},{"$error":"#NAME?"},{"$error":"#NAME?"},{"$error":"#NAME?"}]
[2200000000000,{"$error":"#NAME?"},0,0,0,0,{"$error":"#NAME?"},{"$error":"#NAME?"},{"$error":"#NAME?"},{"$error":"#NAME?"}]
[2700000000000,{"$error":"#NAME?"},2700000000000,0,2700000000000,2700000000000,{"$error":"#NAME?"},{"$error":"#NAME?"},{"$error":"#NAME?"},{"$error":"#NAME?"}]

{"sheet":"Snubber","index":11,"n_rows":6,"n_cols":5,"rows_kept":6,"cut":false,"hidden":true,"merged":[]}
[null,null,"UNITS","STD UNITS"]
["Frequency of Ringing",85,"MHz",{"$f":"B2*1000000","v":85000000},"Hz"]
["SW capacitance",3000,"pF",{"$f":"B3*0.000000000001","v":3E-9},"F"]
["Lpar",{"$f":"1000000000*1/((D2*2*3.14159)^2*D3)","v":1.1686430773614742},"nH",{"$f":"B4/1000000000","v":1.1686430773614743E-9},"H"]
["Csnub",{"$f":"4*B3","v":12000},"pF",{"$f":"B5*0.000000000001","v":1.2E-8},"F"]
["Rsnub",{"$f":"SQRT(D4/D3)","v":0.62413755891936573},"Ω",{"$f":"B6","v":0.62413755891936573},"Ω"]

{"sheet":"Parallel Output Caps","index":12,"n_rows":17,"n_cols":5,"rows_kept":17,"cut":false,"hidden":true,"merged":[]}
[]
[]
[]
["Fsw",{"$f":"Fsw","v":832000}]
[]
["C1",20,"uF",{"$f":"B6/1000000","v":2.0000000000000002E-5},"F"]
["R1",0.5,"mOhms",{"$f":"B7/1000","v":5.0000000000000001E-4},"Ohms"]
[]
["C2",68,"uF",{"$f":"B9/1000000","v":6.7999999999999999E-5},"F"]
["R2",20,"mOhms",{"$f":"B10/1000","v":0.02},"Ohms"]
[]
[]
["I1 ",{"$f":"(D6/(D6+D9))*SQRT((D10*D9*B4)^2+1)/SQRT((((D7+D10)*D6*D9/(D9+D6))*B4)^2+1)","v":0.33186414010698956},"%"]
["I2 ",{"$f":"1-B13","v":0.6681358598930105},"%"]
[]
["I1 ",{"$f":"B13*(Iripple1/(2*SQRT(3)))","v":{"$error":"#NAME?"}},"A"]
["I2 ",{"$f":"B14*(Iripple1/(2*SQRT(3)))","v":{"$error":"#NAME?"}},"A"]