{"text_format":"1","workbook":"xlsx","n_sheets":6,"sheets":["Home","Register Setup","Schematic Checklist","Passive Component Calculator","TS Calculator","Sheet2"],"not_rendered":{"charts":0,"images":7,"macros":1,"external_links":0,"defined_names":80,"comments":0,"pivot_tables":0},"unopened":[],"bounds":{"document_bytes":16777216,"sheet_cells":100000,"rows_first":2000,"rows_last":500,"rows_between":2000,"halvings":0,"cell_chars":16384,"cell_head_chars":4096},"cells_cut":0,"cells_raw":0,"read":"row_number_cap","date_system":"1900"}

{"sheet":"Home","index":0,"n_rows":23,"n_cols":2,"rows_kept":23,"cut":false,"hidden":false,"merged":[[0,0,0,1],[0,2,0,11],[0,12,0,13],[2,1,2,5],[27,1,27,5]]}
[]
[]
[]
[]
[]
[]
[]
[]
[]
[]
[]
[]
[]
[]
[]
[]
[]
[]
[]
[]
[]
[]
[null,"Updated April 9, 2020"]

{"sheet":"Register Setup","index":1,"n_rows":44,"n_cols":15,"rows_kept":44,"cut":false,"hidden":false,"merged":[[35,7,37,7],[23,1,23,5],[41,10,43,10],[16,7,18,7],[16,10,18,10],[31,7,33,7],[25,7,27,7],[31,10,33,10],[25,10,27,10],[41,7,43,7],[3,1,3,5],[0,0,0,1],[0,12,0,13],[14,1,14,5],[5,7,7,7],[5,10,7,10],[9,7,11,7],[0,2,0,3],[0,4,0,5],[0,6,0,7],[0,8,0,9],[0,10,0,11]],"read":"row_number_cap"}
[]
[]
[]
[null,"Battery Charge Parameters",null,null,null,null,null,"Input:",null,null,"Output:"]
[]
[null,"Battery Voltage (V)",4.2,null,null,null,null,"Fast Charge Control (0x03)",{"$f":"BIN2DEC(I8)","v":20},"(Decimal)","Termination/Pre-charge (0x04)",{"$f":"BIN2DEC(L8)","v":14},"(Decimal)"]
[null,null,null,null,null,null,null,null,{"$f":"BIN2HEX(I8,2)","v":"14"},"(Hex)",null,{"$f":"BIN2HEX(L8,2)","v":"0E"},"(Hex)"]
[null,"Fast Charge Current (mA)",10,null,null,null,null,null,{"$f":"CONCATENATE(INDEX(Sheet2!G1:G59,(MATCH(C8,Sheet2!E1:E59,0))),Sheet2!BL2*1,Sheet2!BL3*1)","v":"00010100"},"(Binary)",null,{"$f":"CONCATENATE(INDEX(Sheet2!K1:K42,(MATCH(C10,Sheet2!I1:I42,0))),1*NOT(Sheet2!BL4),0)","v":"00001110"},"(Binary)"]
[]
[null,"Pre-Chrg / Term Current (mA)",2,null,null,null,null,"Battery Voltage Control (0x05)",{"$f":"BIN2DEC(I12)","v":120},"(Decimal)"]
[null,null,null,null,null,null,null,null,{"$f":"BIN2HEX(I12,2)","v":"78"},"(Hex)"]
[null,null,null,null,null,null,null,null,{"$f":"DEC2BIN(2*ROUNDUP((C6-3.6)/0.01,0), 8)","v":"01111000"},"(Binary)"]
[]
[]
[null,"System Power"]
[]
[null,"Buck Converter Voltage (V)",1.8,null,null,null,null,"SYS VOUT Control (0x06)",{"$f":"BIN2DEC(I19)","v":170},"(Decimal)","Load Switch and LDO Control (0x07)",{"$f":"BIN2DEC(L19)","v":124},"(Decimal)"]
[null,null,null,null,null,null,null,null,{"$f":"BIN2HEX(I19,2)","v":"AA"},"(Hex)",null,{"$f":"BIN2HEX(L19,2)","v":"7C"},"(Hex)"]
[null,"LS/LDO Voltage (V)","Load Switch",null,null,null,null,null,{"$f":"CONCATENATE(1*NOT(Sheet2!BL5),INDEX(Sheet2!N1:N39,(MATCH(C17,Sheet2!M1:M39))),0)","v":"10101010"},"(Binary)",null,{"$f":"CONCATENATE(1*Sheet2!BL6,INDEX(Sheet2!R1:R27,(MATCH(C19,Sheet2!P1:P27))),0,1*Sheet2!BL8)","v":"01111100"},"(Binary)"]
[]
[]
[]
[]
[null,"Advanced Features"]
[]
[null,"Wake Timer 1 [MRWAKE1] (ms)","0 - 80 ms",null,"Wake Timer 2 [MRWAKE2] (ms)","1 - 1500 ms",null,"Push Button Control (0x08)",{"$f":"BIN2DEC(I28)","v":104},"(Decimal)","Status and Ship Mode Control (0x00)",{"$f":"BIN2DEC(L28)","v":0},"(Decimal)"]
[null,null,null,null,null,null,null,null,{"$f":"BIN2HEX(I28,2)","v":"68"},"(Hex)",null,{"$f":"BIN2HEX(L28,2)","v":"00"},"(Hex)"]
[null,"After Reset, Device Enters [MRREC]:","Hi-Z",null,"MRRESET (s)","1 - 9 s",null,null,{"$f":"CONCATENATE(IF(C26=\"0 - 80 ms\",0,1),IF(F26=\"1 - 1500 ms\",1,0),IF(C28=\"Hi-Z\",1,0),IF(F28=\"0 - 5 s\",DEC2BIN(0,2),IF(F28=\"1 - 9 s\",DEC2BIN(1,2),IF(F28=\"10 - 11 s\",DEC2BIN(2,2),DEC2BIN(3,2)))),1*VINDPM_ACTIVE,0,0)","v":"01101000"},"(Binary)",null,{"$f":"CONCATENATE(0,0,1*Sheet2!BL7,0,0,0,0,0)","v":"00000000"},"(Binary)"]
[]
[]
[]
[null,"Input Current Limit (mA)",100,null,"Battery UVLO (V)",3,null,"ILIM and Battery UVLO Control (0x09)",{"$f":"BIN2DEC(I34)","v":10},"(Decimal)","Voltage Based Battery Monitor (0x0A)",{"$f":"BIN2DEC(L34)","v":0},"(Decimal)"]
[null,null,null,null,null,null,null,null,{"$f":"BIN2HEX(I34,2)","v":"0A"},"(Hex)",null,{"$f":"BIN2HEX(L34,2)","v":"00"},"(Hex)"]
[null,null,null,null,null,null,null,null,{"$f":"CONCATENATE(1*VIN_PGOOD,0,INDEX(Sheet2!V1:V8,(MATCH('Register Setup'!C32,Sheet2!T1:T8))),INDEX(Sheet2!Z1:Z5,(MATCH(F32,Sheet2!X1:X5))))","v":"00001010"},"(Binary)",null,{"$f":"CONCATENATE(1*THERMREG_ACTIVE,0,0,0,0,0,0,0)","v":"00000000"},"(Binary)",null,"(Decimal)"]
[null,null,null,null,null,null,null,null,null,null,null,null,null,null,"(Hex)"]
[null,"VINDPM Threshold (V)",4.5999999999999996,null,"Safety Timer Limit","3 hour",null,"IVIN_DPM and Timers (0x0B)",{"$f":"BIN2DEC(I38)","v":66},"(Decimal)",null,null,null,null,"(Binary)"]
[null,null,null,null,null,null,null,null,{"$f":"BIN2HEX(I38,2)","v":"42"},"(Hex)"]
[null,null,null,null,null,null,null,null,{"$f":"CONCATENATE(1*VIN_OVP_FAULT,INDEX(Sheet2!AD1:AD8,(MATCH('Register Setup'!C36,Sheet2!AB1:AB8))),1*BAT_OCP_FAULT,INDEX(Sheet2!AH1:AH4,(MATCH('Register Setup'!F36,Sheet2!AF1:AF4))),0)","v":"01000010"},"(Binary)"]
[]
[]
{"$rows_left_out":5}
{"sheet":"Schematic Checklist","index":2,"n_rows":22,"n_cols":9,"rows_kept":22,"cut":false,"hidden":false,"merged":[[7,2,8,8]]}
[]
[null,"BQ25120A Schematic Checklist"]
[false,"Minimum of 1uF capacitance on IN pin to GND. Account for capacitor derating. Ensure capacitor is rated to twice input voltage."]
[false,"Connect minimum 3uF capacitance on PMID pin to GND. Account for capacitor derating. Ensure capacitor is rated to twice input voltage."]
[false,"Ensure USBGND and PGND are tied together.",null,null,"define absent / present",null,null,null," "]
[false,"/CD pin is typically connected to MCU GPIO. Pin is internally pulled low with 900kΩ resistor. /CD is governed by table to the right."]
[false,"SDA pulled up to VSYS with 10kΩ resistor."]
[false,"SCL pulled up to VSYS with 10KΩ  resistor.","VIN present: Vin > Vuvlo & Vin > Vbat + Vslp & Vbat < Vovp                                                   Else, absent"]
[false,"Connect appropriate resistor value to ILIM pin. The resistor value should be between 500Ω and 4kΩ."]
[false,"LSCTRL should be pulled either high or low depending on desired startup state. LDO can be disabled or enabled through I2C regardless of LSCTRL state. If LDO voltage is updated through I2C, LDO will need to be disabled and then enabled for voltage change to occur."]
[false,"Connect appropriate resistor value to ISET pin. The resistor value should be between 665Ω and 39.2kΩ. Use passive component calculator for exact values."]
[false,"Connect appropriate resistor value to IPRETERM pin. The resistor value should be between 549Ω and 15kΩ. Use passive component calculator for exact values."]
[false,"/INT is an open-drain status output that signals charging status and fault interrupts. Connect to an LED or pull up to VSYS (or external pull-up voltage) with 100KΩ resistor."]
[false,"/PG is an open-drain status output that signals Power Good status. /MR can be level shifted to /PG when PGB_MR but in register 0x08h is enabled. Connect to an LED or pull up to VSYS(or external pull-up voltage) with 100KΩ resistor. Can be left floating if unused."]
[false,"/RESET is open drain active low in output. Pull up to VSYS (or external pull-up voltage) with 100kΩ resistor."]
[false,"/MR is pushbutton input that can be used to reset the device or count for wake timers. This pin is pulled up to VBAT internally and can be left floating if functionality is not needed. Note that if /MR is not used, the only way to exit shipmode if through VIN insertion."]
[false,"Connect 2.2µH inductor between SW and SYS."]
[false,"Connect minimum of 10µF capacitance on SYS. Account for capacitor derating. Ensure capacitor is rated for twice SYS voltage."]
[false,"Connect minimum of 1µF to LS/LDO. Account for capacitor derating. Ensure capacitor is rated for twice LS/LDO voltage."]
[false,"Connect minimum of 1µF from VINLS to GND. Account for capacitor derating. Ensure capacitor is rated for twice SYS voltage. VINLS is typically connected to PMID."]
[false,"Connect minimum of 1µF from BAT to GND.  Account for capacitor derating. Ensure capacitor is rated for twice BAT voltage."]
[false,"Follow datasheet procedure on TS pin. If TS will NOT be used, set the TS in off mode with RHI = 37kΩ and RLO = 50kΩ with NTC thermistor absent. RHI should be pulled up to VIN."]

{"sheet":"Passive Component Calculator","index":3,"n_rows":24,"n_cols":6,"rows_kept":24,"cut":false,"hidden":false,"merged":[[18,1,18,2],[5,1,5,2]]}
[]
[]
[]
[null,"Input:",null,null,"Output:"]
[]
[null,"External Resistors"]
[]
[null,"Fast Charge Current [ISET] (mA)",300,null,"RISET, Calc (Ω)",{"$f":"1000*(200/C8)","v":666.66666666666663}]
[null,null,"Max 300 mA",null,"RISET, 1% (Ω)",{"$f":"INDEX(Sheet2!AU1:AU288,MATCH(MIN(ABS(Sheet2!AU1:AU288-F8)),ABS(Sheet2!AU1:AU288-F8),0))","v":665}]
[]
[]
[null,"Termination & Precharge Current [IPRETERM] (%)",10,null,"RTERM (kΩ)",{"$f":"VLOOKUP(C12,Sheet2!AX1:AY4,2)","v":4.99}]
[null,"Note: finer adjustments made through I2C","% of ISET",null,"ITERM (mA)",{"$f":"C12/100*C8","v":30}]
[]
[]
[null,"Input Current Limit [ILIM] (mA)",400,null,"RILIM, Calc (Ω)",{"$f":"1000*(200/C16)","v":500}]
[null,null,"Max 400 mA",null,"RILIM, 1% (Ω)",{"$f":"INDEX(Sheet2!AU1:AU288,MATCH(MIN(ABS(Sheet2!AU1:AU288-F16)),ABS(Sheet2!AU1:AU288-F16),0))","v":499}]
[]
[null,"Inductor"]
[]
[null,"ISYS (Max) (A)",0.2,null,"Pk-Pk Inductor Ripple Current (A)",{"$f":" 1000000*(C24*(1-(C24/C23)))/(C22*2000000)","v":0.26181818181818189}]
[null,"Inductor (µH)",2.2000000000000002,null,"Maximum Inductor Current (A)",{"$f":"C21 + (F21 / 2)","v":0.33090909090909093}]
[null,"VPMID / VIN (V)",5]
[null,"VSYS (V)",1.8]

{"sheet":"TS Calculator","index":4,"n_rows":50,"n_cols":6,"rows_kept":50,"cut":false,"hidden":false,"merged":[[31,4,32,6],[9,1,9,5],[24,1,24,5],[14,1,14,5],[20,1,20,5],[28,4,29,6]]}
[]
[]
[null,"INPUT:"]
[null,"OUTPUT:",null,null,"VHOT (V)",{"$f":"$C$6*0.15","v":0.75}]
[null,null,null,null,"VWARM (V)",{"$f":"$C$6*0.205","v":1.0249999999999999}]
[null,"VIN (V)",5,null,"VCOOL (V)",{"$f":"$C$6*0.36","v":1.7999999999999998}]
[null,"VIN is the same as VDRV in the diagram",null,null,"VCOLD (V)",{"$f":"$C$6*0.398","v":1.9900000000000002}]
[]
[]
[null,"Thermistor Resistances at Desired Temp Thresholds. USE OWN THERMISTOR DATA"]
[]
[null,"RHOT (Ω)",2872]
[null,"RCOLD (Ω)",28829]
[]
[null,"External Resistor Values (Calculated and 1%)"]
[null,"RLO, Calc (Ω)",{"$f":"($C$6*$C$13*$C$12*((1/$F$7) - (1/$F$4)))/($C$12*(($C$6/$F$4)-1) - ($C$13*(($C$6/$F$7)-1)))","v":12584.493326463446}]
[null,"RLO, 1% (Ω)",{"$f":"INDEX(Sheet2!AU1:AU384,MATCH(MIN(ABS(Sheet2!AU1:AU384-C16)),ABS(Sheet2!AU1:AU384-C16),0))","v":12700}]
[null,"RHI, Calc (Ω)",{"$f":"(($C$6/$F$7)-1)/((1/$C$16) + (1/$C$13))","v":13250.640344561605}]
[null,"RHI, 1% (Ω)",{"$f":"INDEX(Sheet2!AU1:AU384,MATCH(MIN(ABS(Sheet2!AU1:AU384-C18)),ABS(Sheet2!AU1:AU384-C18),0))","v":13300}]
[]
[null,"Thermistor Resistances at Cool and Warm Temps"]
[null,"RCOOL (Ω)",{"$f":"($C$16*$C$18*0.36)/($C$16- ($C$16*0.36) - ($C$18*0.36))","v":18280.683299574386}]
[null,"RWARM (Ω)",{"$f":"(($C$16*$C$18*0.205)/($C$16-$C$16*0.205 - $C$18*0.205))","v":4690.3015164123517}]
[]
[null,"Reference Thermistor Data"]
[]
[null,"T (°C)","R_THERM (Ω)"]
[null,-30,130769]
[null,-25,99489,null,"JEITA recommends 0°, 10°, 45°, and 60° C for TCOLD, TCOOL, TWARM, THOT respectively"]
[null,-20,76385]
[null,-15,59157]
[null,-10,46194,null,"To learn more about JEITA Compliance click here"]
[null,-5,36356]
[null,0,28829]
[null,5,23025]
[null,10,18515]
[null,15,14986]
[null,20,12205]
[null,25,10000]
[null,30,8240]
{"$rows_left_out":11}
{"sheet":"Sheet2","index":5,"n_rows":384,"n_cols":64,"rows_kept":384,"cut":false,"hidden":true,"merged":[]}
["Batt Reg Voltage",null,null,"Charge Current Options","Ext. Iset Resistor",31,{"$f":"DEC2BIN(F1,6)","v":"011111"},"Pre-term Current ",0.5,0,{"$f":"DEC2BIN(J1,6)","v":"000000"},"SYS VOUT",1.1000000000000001,"000000","LDO","Load Switch",31,{"$f":"DEC2BIN(Q1,5)","v":"11111"},"inlim",50,0,{"$f":"DEC2BIN(U1,3)","v":"000"},"BUVLO",2.2000000000000002,6,{"$f":"DEC2BIN(Y1,3)","v":"110"},"VINDPM ",4.2,0,{"$f":"DEC2BIN(AC1,3)","v":"000"},"saftey timer"," ½ hour",0,{"$f":"DEC2BIN(AG1,2)","v":"00"},null,{"$f":"CONCATENATE('Passive Component Calculator'!F12,\" kΩ\")","v":"4.99 kΩ"},null,{"$f":"CONCATENATE('TS Calculator'!C17/1000,\" kΩ\")","v":"12.7 kΩ"},null,null,null,null,null,null,null,"resistor 1%",10,null,"preterm lookup",5,15,null,null,null,null,null,null,null,null,null,null,null,null,"Charge Parameters 1"]
[3.6,null,null,null,5,0,{"$f":"DEC2BIN(F2,6)","v":"000000"},null,1,1,{"$f":"DEC2BIN(J2,6)","v":"000001"},null,1.2,"000001",null,0.8,0,"00000",null,100,1,{"$f":"DEC2BIN(U2,3)","v":"001"},null,2.4,5,{"$f":"DEC2BIN(Y2,3)","v":"101"},null,4.3,1,{"$f":"DEC2BIN(AC2,3)","v":"001"},null,"3 hour",1,{"$f":"DEC2BIN(AG2,2)","v":"01"},null,{"$f":"CONCATENATE('Passive Component Calculator'!F9,\" Ω\")","v":"665 Ω"},null,null,null,null,null,null,null,null,null,null,10.199999999999999,null,null,10,4.99,null,null,null,null,null,null,null,null,null,null,null,"Disable Charger",false]
[3.61,null,null,null,6,1,{"$f":"DEC2BIN(F3,6)","v":"000001"},null,1.5,2,"000010",null,1.25,"000010",null,0.9,1,"00001",null,150,2,"010",null,2.6,4,"100",null,4.4000000000000004,2,"010",null,"9 hour",2,"10",null,{"$f":"CONCATENATE('Passive Component Calculator'!F17,\" Ω\")","v":"499 Ω"},null,{"$f":"CONCATENATE('TS Calculator'!C19/1000,\" kΩ\")","v":"13.3 kΩ"},null,null,true,null,null,null,null,null,10.5,null,null,15,1.65,null,null,null,null,null,null,null,null,null,null,null,"High impedance",false]
[3.62,null,null,null,7,2,"000010",null,2,3,"000011",null,1.3,"010000",null,1,2,"00010",null,200,3,"011",null,2.8,3,"011",null,4.5,3,"011",null,"Disabled",3,"11",null,null,null,null,null,null,true,null,null,null,null,null,10.7,null,null,20,0.54900000000000004,null,null,null,null,null,null,null,null,null,null,null,"Disable termination",false]
[3.63,null,null,null,8,3,"000011",null,2.5,4,"000100",null,1.333,"000011",null,1.1000000000000001,3,"00011",null,250,4,"100",null,3,2,"010",null,4.5999999999999996,4,"100",null,null,null,null,null,null,null,null,null,null,true,null,null,null,null,null,11,null,null,null,null,null,null,null,null,null,null,null,null,null,null,null,"disable buck converter",false]
[3.64,null,null,null,9,4,"000100",null,3,5,"000101",null,1.4,"010001",null,1.2,4,"00100",null,300,5,"101",null,null,null,null,null,4.7,5,"101",null,null,null,null,null,null,null,null,null,null,true,null,null,null,null,null,11.3,null,null,null,null,null,null,null,null,null,null,null,null,null,null,null,"enable ls/ldo",false]
[3.65,null,null,null,10,5,"000101",null,3.5,6,"000110",null,1.41,"000100",null,1.3,5,"00101",null,350,6,"110",null,null,null,null,null,4.8,6,"110",null,null,null,null,null,null,null,null,null,null,true,null,null,null,null,null,11.5,null,null,null,null,null,null,null,null,null,null,null,null,null,null,null,"Shipmode",false]
[3.66,null,null,null,11,6,"000110",null,4,7,"000111",null,1.5,"000101",null,1.4,6,"00110",null,400,7,{"$f":"DEC2BIN(U8,3)","v":"111"},null,null,null,null,null,4.9000000000000004,7,"111",null,null,null,null,null,null,null,null,null,null,true,null,null,null,null,null,11.8,null,null,null,null,null,null,null,null,null,null,null,null,null,null,null,"MRRESSET_VIN",false]
[3.67,null,null,null,12,7,"000111",null,4.5,8,"001000",null,1.583,"000110",null,1.5,7,"00111",null,null,null,null,null,null,null,null,null,null,null,null,null,null,null,null,null,null,null,null,null,null,true,null,null,null,null,null,12.1,null,null,null,null,null,null,null,null,null,null,null,null,null,null,null,"Mask Vin Overvoltage Fault",false]
[3.68,null,null,null,13,8,"001000",null,5,9,"001001",null,1.6,"010011",null,1.6,8,"01000",null,null,null,null,null,null,null,null,null,null,null,null,null,null,null,null,null,null,null,null,null,null,true,null,null,null,null,null,12.4,null,null,null,null,null,null,null,null,null,null,null,null,null,null,null,"Mask Vin Undervoltage Fault",false]
[3.69,null,null,null,14,9,"001001",null,6,32,"100000",null,1.667,"000111",null,1.7,9,"01001",null,null,null,null,null,null,null,null,null,null,null,null,null,null,null,null,null,null,null,null,null,null,true,null,null,null,null,null,12.7,null,null,null,null,null,null,null,null,null,null,null,null,null,null,null,"Mask Bat UVLO Fault",false]
[3.7,null,null,null,15,10,"001010",null,7,33,"100001",null,1.7,"010100",null,1.8,10,"01010",null,null,null,null,null,null,null,null,null,null,null,null,null,null,null,null,null,null,null,null,null,null,true,null,null,null,null,null,13,null,null,null,null,null,null,null,null,null,null,null,null,null,null,null,"Mask Bat OCP Fault",false]
[3.71,null,null,null,16,11,"001011",null,8,34,"100010",null,1.75,"001000",null,1.9,11,"01011",null,null,null,null,null,null,null,null,null,null,null,null,null,null,null,null,null,null,null,null,null,null,true,null,null,null,null,null,13.3,null,null,null,null,null,null,null,null,null,null,null,null,null,null,null,"disable TS",false]
[3.72,null,null,null,17,12,"001100",null,9,35,"100011",null,1.8,"010101",null,2,12,"01100",null,null,null,null,null,null,null,null,null,null,null,null,null,null,null,null,null,null,null,null,null,null,true,null,null,null,null,null,13.7,null,null,null,null,null,null,null,null,null,null,null,null,null,null,null,"Disable INT",false]
[3.73,null,null,null,18,13,"001101",null,10,36,"100100",null,1.833,"001001",null,2.1,13,"01101",null,null,null,null,null,null,null,null,null,null,null,null,null,null,null,null,null,null,null,null,null,null,true,null,null,null,null,null,14,null,null,null,null,null,null,null,null,null,null,null,null,null,null,null,"mask /mr wake int",false]
[3.74,null,null,null,19,14,"001110",null,11,37,"100101",null,1.9,"010110",null,2.2000000000000002,14,"01110",null,null,null,null,null,null,null,null,null,null,null,null,null,null,null,null,null,null,null,null,null,null,true,null,null,null,null,null,14.3,null,null,null,null,null,null,null,null,null,null,null,null,null,null,null,"mask /mr RST int",false]
[3.75,null,null,null,20,15,"001111",null,12,38,"100110",null,1.917,"001010",null,2.2999999999999998,15,"01111",null,null,null,null,null,null,null,null,null,null,null,null,null,null,null,null,null,null,null,null,null,null,true,null,null,null,null,null,14.7,null,null,null,null,null,null,null,null,null,null,null,null,null,null,null,"mask timer fault int",false]
[3.76,null,null,null,21,16,"010000",null,13,39,"100111",null,2,"100110",null,2.4,16,"10000",null,null,null,null,null,null,null,null,null,null,null,null,null,null,null,null,null,null,null,null,null,null,true,null,null,null,null,null,15,null,null,null,null,null,null,null,null,null,null,null,null,null,null,null,"PGBMR",false]
[3.77,null,null,null,22,17,"010001",null,14,40,"101000",null,2.0830000000000002,"001100",null,2.5,17,"10001",null,null,null,null,null,null,null,null,null,null,null,null,null,null,null,null,null,null,null,null,null,null,true,null,null,null,null,null,15.4,null,null,null,null,null,null,null,null,null,null,null,null,null,null,null,"vbreg read",false]
[3.78,null,null,null,23,18,"010010",null,15,41,"101001",null,2.1,"011000",null,2.6,18,"10010",null,null,null,null,null,null,null,null,null,null,null,null,null,null,null,null,null,null,null,null,null,null,true,null,null,null,null,null,15.8,null,null,null,null,null,null,null,null,null,null,null,null,null,null,null,"reset reg",false]
[3.79,null,null,null,24,19,"010011",null,16,42,"101010",null,2.1669999999999998,"001101",null,2.7,19,"10011",null,null,null,null,null,null,null,null,null,null,null,null,null,null,null,null,null,null,null,null,null,null,null,null,null,null,null,null,16.2,null,null,null,null,null,null,null,null,null,null,null,null,null,null,null,"vindpm disable",false]
[3.8,null,null,null,25,20,"010100",null,17,43,"101011",null,2.2000000000000002,"011001",null,2.8,20,"10100",null,null,null,null,null,null,null,null,null,null,null,null,null,null,null,null,null,null,null,null,null,null,null,null,null,null,null,null,16.5,null,null,null,null,null,null,null,null,null,null,null,null,null,null,null,"2xtmr",false]
[3.81,null,null,null,26,21,"010101",null,18,44,"101100",null,2.25,"001110",null,2.9,21,"10101",null,null,null,null,null,null,null,null,null,null,null,null,null,null,null,null,null,null,null,null,null,null,null,null,null,null,null,null,16.899999999999999]
[3.8199999999999901,null,null,null,27,22,"010110",null,19,45,"101101",null,2.2999999999999998,"011010",null,3,22,"10110",null,null,null,null,null,null,null,null,null,null,null,null,null,null,null,null,null,null,null,null,null,null,null,null,null,null,null,null,17.399999999999999]
[3.83,null,null,null,28,23,"010111",null,20,46,"101110",null,2.3330000000000002,"001111",null,3.1,23,"10111",null,null,null,null,null,null,null,null,null,null,null,null,null,null,null,null,null,null,null,null,null,null,null,null,null,null,null,null,17.8]
[3.8399999999999901,null,null,null,29,24,"011000",null,21,47,"101111",null,2.4,"011011",null,3.2,24,"11000",null,null,null,null,null,null,null,null,null,null,null,null,null,null,null,null,null,null,null,null,null,null,null,null,null,null,null,null,18.2]
[3.85,null,null,null,30,25,"011001",null,22,48,"110000",null,2.4169999999999998,"101011",null,3.3,25,"11001",null,null,null,null,null,null,null,null,null,null,null,null,null,null,null,null,null,null,null,null,null,null,null,null,null,null,null,null,18.7]
[3.8599999999999901,null,null,null,31,26,"011010",null,23,49,"110001",null,2.5,"011100",null,null,null,null,null,null,null,null,null,null,null,null,null,null,null,null,null,null,null,null,null,null,null,null,null,null,null,null,null,null,null,null,19.100000000000001]
[3.8699999999999899,null,null,null,32,27,"011011",null,24,50,"110010",null,2.5830000000000002,"101101",null,null,null,null,null,null,null,null,null,null,null,null,null,null,null,null,null,null,null,null,null,null,null,null,null,null,null,null,null,null,null,null,19.600000000000001]
[3.8799999999999901,null,null,null,33,28,"011100",null,25,51,"110011",null,2.6,"011101",null,null,null,null,null,null,null,null,null,null,null,null,null,null,null,null,null,null,null,null,null,null,null,null,null,null,null,null,null,null,null,null,20]
[3.8899999999999899,null,null,null,34,29,"011101",null,26,52,"110100",null,2.6669999999999998,"101110",null,null,null,null,null,null,null,null,null,null,null,null,null,null,null,null,null,null,null,null,null,null,null,null,null,null,null,null,null,null,null,null,20.5]
[3.8999999999999901,null,null,null,35,30,"011110",null,27,53,"110101",null,2.7,"011110",null,null,null,null,null,null,null,null,null,null,null,null,null,null,null,null,null,null,null,null,null,null,null,null,null,null,null,null,null,null,null,null,21]
[3.9099999999999899,null,null,null,40,32,"100000",null,28,54,"110110",null,2.75,"101111",null,null,null,null,null,null,null,null,null,null,null,null,null,null,null,null,null,null,null,null,null,null,null,null,null,null,null,null,null,null,null,null,21.5]
[3.9199999999999902,null,null,null,50,33,"100001",null,29,55,"110111",null,2.8,"011111",null,null,null,null,null,null,null,null,null,null,null,null,null,null,null,null,null,null,null,null,null,null,null,null,null,null,null,null,null,null,null,null,22.1]
[3.9299999999999899,null,null,null,60,34,"100010",null,30,56,"111000",null,2.9,"111011",null,null,null,null,null,null,null,null,null,null,null,null,null,null,null,null,null,null,null,null,null,null,null,null,null,null,null,null,null,null,null,null,22.6]
[3.9399999999999902,null,null,null,70,35,"100011",null,31,57,"111001",null,3,"111100",null,null,null,null,null,null,null,null,null,null,null,null,null,null,null,null,null,null,null,null,null,null,null,null,null,null,null,null,null,null,null,null,23.2]
[3.94999999999999,null,null,null,80,36,"100100",null,32,58,"111010",null,3.1,"111101",null,null,null,null,null,null,null,null,null,null,null,null,null,null,null,null,null,null,null,null,null,null,null,null,null,null,null,null,null,null,null,null,23.7]
[3.9599999999999902,null,null,null,90,37,"100101",null,33,59,"111011",null,3.2,"111110",null,null,null,null,null,null,null,null,null,null,null,null,null,null,null,null,null,null,null,null,null,null,null,null,null,null,null,null,null,null,null,null,24.3]
[3.96999999999999,null,null,null,100,38,"100110",null,34,60,"111100",null,3.3,"111111",null,null,null,null,null,null,null,null,null,null,null,null,null,null,null,null,null,null,null,null,null,null,null,null,null,null,null,null,null,null,null,null,24.9]
[3.9799999999999902,null,null,null,110,39,"100111",null,35,61,"111101",null,null,null,null,null,null,null,null,null,null,null,null,null,null,null,null,null,null,null,null,null,null,null,null,null,null,null,null,null,null,null,null,null,null,null,25.5]
{"$rows_left_out":344}