{"text_format":"1","workbook":"xlsx","n_sheets":9,"sheets":["Instructions","Design Calculator","Device Parameters","Equations","MOSFET Database 24V","MOSFET Database 48V","Start_up","SOA","dv_dt_recommendations"],"not_rendered":{"charts":5,"images":14,"macros":1,"external_links":2,"defined_names":102,"comments":2,"pivot_tables":0},"unopened":[],"bounds":{"document_bytes":16777216,"sheet_cells":100000,"rows_first":2000,"rows_last":500,"rows_between":2000,"halvings":0,"cell_chars":16384,"cell_head_chars":4096},"cells_cut":0,"cells_raw":0,"read":"whole","date_system":"1900"}

{"sheet":"Instructions","index":0,"n_rows":57,"n_cols":13,"rows_kept":57,"cut":false,"hidden":false,"merged":[[56,1,118,12],[12,5,12,10]]}
[]
[]
[]
[]
[]
[]
[null,null,null,null,null,null,null,null,null,null,null,null,"© 2014"]
[null,"LM5069 Design Tool with FET Recommendation - Rev. A"]
[]
[null,"Typical design procedure"]
[]
[null,"Before proceeding, please go through the application note ",null,null,null,null,null,null,"Robust Hot Swap Design"]
[null,"and the design example in the ",null,null,null,"LM5069 Datasheet (See \"Design-In Procedure\")"]
[]
[]
["Step 1: ","1. Enter your system parameters (operating voltage limits, load current, load capacitance, system max ambient temperature )"]
[null,"2. Enter FET operating parameters (preferred FET operating junction temperature, thermal impedance)"]
[null,null,"Note: The tool adjusts the number of FETs required in parallel to maintain the preferred FET operating junction temperature."]
[null,null,"Note: Thermal impedance is heavily dependent on the board layout and the amount of copper connected to the drain of the FET. "]
[null,null,"Thermal impedance is required to determine MOSFET SOA margin."]
[null,"3. Enter the load startup conditions (startup mode, startup load type, load turn on threshold, startup load value)"]
[]
["Step 2:","1. Set the current limit settings. Use a resistive divider to reduce effective sense resistance if needed."]
[null,"2. Select Target power limit greater than the Minimum Recommended Power Limit threshold"]
[]
["Step 3:","1. Select MOSFETs from the dropdown menu."]
[null,"2.  Compare their SOA margin, cost, power dissipation at full load and number of FETs required in parallel to know which FET fits your design perfectly."]
[null,null,"Note: You can also enter the SOA data of a non-TI FET to compare it with TI FETs."]
[null,null,"An SOA margin greater than 1.1 is required and greater than 1.3 is recommended for safe operation"]
[null,"3. If none of the FETs satisfy the SOA margin, try to change the following parameters:"]
[null,null,"a. In case of power limit startup mode, reduce the load startup conditions or use a different FET in the non-TI FET column."]
[null,null,"b. In case of soft start startup mode, reduce the fault timer or use a different FET in the non-TI FET column. "]
[null,"Note: The FETs selected in this section will be available as the final choices in the next section."]
[null,"(Links to the TI FET product pages have been provided)"]
[]
["Step 4:","1. Select an FET from the dropdown menu."]
[null,"2. Review start up conditions to check whether selected FET is operating with reasonable margin, within the SOA curve."]
[null,"3. Adjust Soft-start and Timer capacitances to get accurate SOA measurements."]
[]
["Step 5:","1. Enter desired UVLO and OVLO threshold values to get recommended resistor values."]
[null,"2. In case any of the cells in the threshold table is highlighted in red, adjust the resistor values."]
[null,"3. If nearest resistor values still give red highlighted cells, change the configuration "]
[]
["Step 6:","Done. View the design summary with all the results"]
[]
[null,"* Comments on the data to be filled/expected are provided to guide you"]
[]
[null,"Notes"]
[null,"1. This worksheet is designed for use with Microsoft Excel 5.0 or later.  Its use is intended to assist power supply designers in their"]
[null,"routine, day-to-day calculations.  "]
[]
[null,"2. All worksheets have light green inputs cells, white calculated cells, yellow warning cells and red high-risk cells."]
[]
[null,"3. Formulas and device constants used in the spreadsheet are locked to prohibit them from accidentally being overwritten or deleted."]
[]
[]
[null,"TEXAS INSTRUMENTS TEXT FILE LICENSE\n\n\nCopyright (c) 2014 Texas Instruments Incorporated\n\nAll rights reserved not granted herein.\n\nLimited License.  \n\nTexas Instruments Incorporated grants a world-wide, royalty-free, non-exclusive license under copyrights and patents it now or hereafter owns or controls to make, have made, use, import, offer to sell and sell (\"Utilize\") this software subject to the terms herein.  With respect to the foregoing patent license, such license is granted  solely to the extent that any such patent is necessary to Utilize the software alone.  The patent license shall not apply to any combinations which include this software, other than combinations with devices manufactured by or for TI (“TI Devices”).  No hardware patent is licensed hereunder.\n\nRedistributions must preserve existing copyright notices and reproduce this license (including the above copyright notice and the disclaimer and (if applicable) source code license limitations below) in the documentation and/or other materials provided with the distribution\n\nRedistribution and use in binary form, without modification, are permitted provided that the following conditions are met:\n\n* No reverse engineering, decompilation, or disassembly of this software is permitted with respect to any software provided in binary form.\n\n* any redistribution and use are licensed by TI for use only with TI Devices.\n\n* Nothing shall obligate TI to provide you with source code for the software licensed and provided to you in object code.\n\nIf software source code is provided to you, modification and redistribution of the source code are permitted provided that the following conditions are met:\n\n* any redistribution and use of the source code, including any resulting derivative works, are licensed by TI for use only with TI Devices.\n\n* any redistribution and use of any object code compiled from the source code and any resulting derivative works, are licensed by TI for use only with TI Devices.\n\nNeither the name of Texas Instruments Incorporated nor the names of its suppliers may be used to endorse or promote products derived from this software without specific prior written permission.\n\nDISCLAIMER.\n\nTHIS SOFTWARE IS PROVIDED BY TI AND TI’S LICENSORS \"AS IS\" AND ANY EXPRESS OR IMPLIED WARRANTIES, INCLUDING, BUT NOT LIMITED TO, THE IMPLIED WARRANTIES OF MERCHANTABILITY AND FITNESS FOR A PARTICULAR PURPOSE ARE DISCLAIMED. IN NO EVENT SHALL TI AND TI’S LICENSORS BE LIABLE FOR ANY DIRECT, INDIRECT, INCIDENTAL, SPECIAL, EXEMPLARY, OR CONSEQUENTIAL DAMAGES (INCLUDING, BUT NOT LIMITED TO, PROCUREMENT OF SUBSTITUTE GOODS OR SERVICES; LOSS OF USE, DATA, OR PROFITS; OR BUSINESS INTERRUPTION) HOWEVER CAUSED AND ON ANY THEORY OF LIABILITY, WHETHER IN CONTRACT, STRICT LIABILITY, OR TORT (INCLUDING NEGLIGENCE OR OTHERWISE) ARISING IN ANY WAY OUT OF THE USE OF THIS SOFTWARE, EVEN IF ADVISED OF THE POSSIBILITY OF SUCH DAMAGE.\n"]

{"sheet":"Design Calculator","index":1,"n_rows":146,"n_cols":63,"rows_kept":146,"cut":false,"hidden":false,"merged":[[119,2,121,6],[9,3,9,5],[10,3,10,5],[68,10,69,39],[143,2,144,5],[127,9,127,10],[11,3,12,5],[23,7,25,8],[29,7,30,8],[27,7,28,8],[88,1,94,1],[43,10,44,39],[62,1,67,1],[1,11,1,12],[0,0,0,12],[15,3,16,5],[53,1,56,1]]}
["                         LM5069 Hot Swap Design Tool with FET Recommendation"]
[null,"www.ti.com/hotswap"]
[]
[]
[]
[]
[]
[]
[]
[null,null,null,"Enter Values in Green Shaded Cells"]
[null,null,null,"Calculated Values are shown in White Cells"]
[null,null,null,"Yellow and Red cells highlight potential issues with the design. Red highlights items that are higher risk. "]
[null,null,null,null,null,null,null,null,null,null,null,null,null,null,null,null,null,null,null,null,null,null,null,null,null,null,null,null,null,null,null,null,null,null,null,null,null,null,null,null,null,null,null,null,null,"Yes"]
[]
[null,null,null,"LM5069 Datasheet"]
[null,null,null,"*For additional questions not addressed in the instructions, please post on E2E.ti.com"]
[]
[]
[null,"Step 1: System Parameters",null,null,"Minimum Input Operating Voltage: VIN(MIN)",10,"V"]
[null,null,null,null,"Nominal Input Operating Voltage: VIN(NOM)",12,"V"]
[null,null,null,null,"Maximum Input Operating Voltage: VIN(MAX)",14,"V"]
[null,null,null,null,"Maximum Load Current: IOUT(MAX)",1.8,"A"]
[null,null,null,null,"Maximum Output Load Capacitance: CLOAD",3000,"µF"]
[null,null,null,null,"Maximum Ambient Operating Temperature: TMAX",85,"oC","Note: The tool adjusts the number of FETs required in parallel to maintain the preferred FET operating junction temperature  (TJ,DC)"]
[null,null,null,null,"Preferred FET operating junction temperature (Tj,DC)",100,"oC"]
[null,null,null,null,"Estimated MOSFET RQJA",30,"oC/W"]
[null,null,null,null,"Load Turn-On Threshold",0,"V"]
[null,null,null,null,"Startup Load Type","Constant Current",null,"Note: In case none of the FETs satisfy the SOA margin, reduce the load startup conditions"]
[null,null,null,null,"Startup Load Value",0.2,{"$f":"IF(F28=\"Constant Current\",\"A\",\"Ohms\")","v":"A"}]
[null,null,null,null,"System startup mode","Soft Start",null,"Note: In case none of the FETs satisfy the SOA margin, reduce the fault timer"]
[null,null,null,null,"Fault timer required",1,"ms"]
[null,"Step 2:  Current Limit and Power Limit Selection",null,null,"Current Limit Threshold Voltage","48.5 mV"]
[null,null,null,null,"Maximum Recommended Value for Effective Sense Resistance",{"$f":"Equations!F20","v":26.677667766776676},"mW"]
[null,null,null,null,"Use External Resistor Divider to Reduce Effecitve RS","No",null,null,null,null,null,null,null,null,null,null,null,null,null,null,null,null,null,null,null,null,null,null,null,null,null,null,null,null,null,null,null,null,null,null,null,"Yes",null,null,null,null,null,null,null,null,null,null,null,null,null,null,null,null,null,null,null,"Rs","WSL2010R0270FEA"]
[null,null,null,null,"Enter the Resistance for RS",27,"mW",null,null,null,null,null,null,null,null,null,null,null,null,null,null,null,null,null,null,null,null,null,null,null,null,null,null,null,null,null,null,null,null,null,null,"No"]
[null,null,null,null,"Recommended Value for RCL1",{"$f":"Equations!F21","v":10},"W"]
[null,null,null,null,"Recommended Value for RCL2",{"$f":"Equations!F22","v":2.0618556701030855E-2},"W"]
[null,null,null,null,"Enter value for RCL1",10,"W",null,null,null,null,null,null,null,null,null,null,null,null,null,null,null,null,null,null,null,null,null,null,null,null,null,null,null,null,null,null,null,null,null,null,{"$f":"AND(F34=\"No\")","v":true}]
[null,null,null,null,"Enter value for RCL2",0.31,"W"]
[null,null,null,null,"Effective Sense Resistance (RS,EFF)",{"$f":"RsEFF","v":27},"mW"]
[null,null,null,null,"Resulting Minimum Current Limit",{"$f":"CLMIN","v":1.7962962962962963},"A"]
[null,null,null,null,"Resulting Typical Current Limit",{"$f":"CLNOM","v":2.0370370370370372},"A"]
[null,null,null,null,"Resulting Maximum Current Limit",{"$f":"CLMAX","v":2.2777777777777777},"A",null,null,null,null,null,null,null,null,null,null,null,null,null,null,null,null,null,null,null,null,null,null,null,null,null,null,null,null,null,null,null,null,null,null,"Retry"]
[null,null,null,null,"Maximum Power Dissipation in RS",{"$f":"Equations!F27/1000","v":0.14008333333333331},"W",null,null,null,"Note: Use a resistive divider to fine tune the current limit setting if needed",null,null,null,null,null,null,null,null,null,null,null,null,null,null,null,null,null,null,null,null,null,null,null,null,null,null,null,null,null,null,"Latch Off"]
[null,null,null,null,"Fault Response","Retry",null,null,null,null,null,null,null,null,null,null,null,null,null,null,null,null,null,null,null,null,null,null,null,null,null,null,null,null,null,null,null,null,null,null,null,"1.9 x Current Limit"]
[null,null,null,null,"Circuit Breaker to Current Limit Raitio","1.9 x Current Limit",null,null,null,null,null,null,null,null,null,null,null,null,null,null,null,null,null,null,null,null,null,null,null,null,null,null,null,null,null,null,null,null,null,null,null,"3.9 x Current Limit"]
[]
[null,null,null,null,"Minimum Power Limit to Ensure Vsns > 5mV (PLIM,MIN)",{"$f":"Equations!F40","v":2.592592592592593},"W"]
[null,null,null,null,"Target Power Limit",75,"W"]
[null,null,null,null,"Calculated RPWR",{"$f":"Equations!F42","v":253.125},"kW"]
[null,null,null,null,"Actual RPWR",22,"kW"]
[null,null,null,null,"Actual PLIM",{"$f":"Equations!F44","v":6.5185185185185182},"W"]
[null,"Step 3: MOSFET Suggestions",null,null,"Q1 FET Name","Part Number , SOA margin, $1ku","Part Number , SOA margin, $1ku","MOSFET from non-TI suppliers",null,null,null,null,null,null,null,null,null,null,null,null,null,null,null,null,null,null,null,null,null,null,null,null,null,null,null,null,null,null,null,null,null,null,null,null,null,null,null,"FET part number (48V FETs)","FET display name (48V FETs)","cost","power dissipation","SOA margin",null,null,null,"FET part number (24V FETs)","FET display name (24V FETs)","cost","power dissipation","SOA margin"]
[null,"Scroll down the dropdown menu to select MOSFET",null,null,"Choose FETs for comparison","CSD18532NQ5B , 32.74 , $0.845","CSD18540Q5B , 2.99 , $0.867","NON-TI MOSFET",null,null,null,null,null,null,null,null,null,null,null,null,null,null,null,null,null,null,null,null,null,null,null,null,null,null,null,null,null,null,null,null,null,{"$f":"((((TJMAX-TAMB)/ThetaJA)/(CLMAX^2))*1000)*NUMFETS1^2","v":2023.7953599048187},{"$f":"((TJMAX-TAMB)/ThetaJA)","v":10.5},null,null,null,null,{"$f":"'MOSFET Database 48V'!B4","v":"CSD19536KTT"},{"$f":"AV54&\" , \"&ROUND(AZ54,2)&\" , $\"&AX54","v":"CSD19536KTT , 150.9 , $1.972"},{"$f":"'MOSFET Database 48V'!C35","v":1.972},{"$f":"'MOSFET Database 48V'!C33","v":1.1197439999999999E-2},{"$f":"'MOSFET Database 48V'!C61","v":150.89659021607383},null,null,null,{"$f":"'MOSFET Database 24V'!F4","v":"CSD18536KTT"},{"$f":"BD54&\" , \"&ROUND(BH54,2)&\" , $\"&BF54","v":"CSD18536KTT , 181.62 , $1.894"},{"$f":"'MOSFET Database 24V'!G35","v":1.8939999999999999},{"$f":"'MOSFET Database 24V'!G33","v":7.2576000000000003E-3},{"$f":"'MOSFET Database 24V'!G61","v":181.61849633229872}]
[null,null,null,null,"MOSFET On resistance @ TJ,DC",{"$f":"IF(VINMAX<=40,'MOSFET Database 24V'!C80,'MOSFET Database 48V'!C80)","v":5.3040000000000003},{"$f":"IF(VINMAX<=40,'MOSFET Database 24V'!G80,'MOSFET Database 48V'!G80)","v":3.1240000000000001},1,"mW",null,null,null,null,null,null,null,null,null,null,null,null,null,null,null,null,null,null,null,null,null,null,null,null,null,null,null,null,null,null,null,null,"Values Used",null,null,null,null,null,{"$f":"'MOSFET Database 48V'!F4","v":"CSD19535KTT"},"CSD19535KTT , 71.38 , $1.313",{"$f":"'MOSFET Database 48V'!G35","v":1.3129999999999999},{"$f":"'MOSFET Database 48V'!G33","v":1.7405280000000002E-2},{"$f":"'MOSFET Database 48V'!G61","v":71.3795179317802},null,null,null,{"$f":"'MOSFET Database 24V'!R4","v":"CSD19506KTT"},"CSD19506KTT , 131.07 , $1.972",{"$f":"'MOSFET Database 24V'!S35","v":1.972},{"$f":"'MOSFET Database 24V'!S33","v":1.08054E-2},{"$f":"'MOSFET Database 24V'!S61","v":131.06591743667349}]
[null,null,null,null,"Maximum FET Junction Temperature",{"$f":"IF(VINMAX<=40,'MOSFET Database 24V'!C79,'MOSFET Database 48V'!C79)","v":150},{"$f":"IF(VINMAX<=40,'MOSFET Database 24V'!G79,'MOSFET Database 48V'!G79)","v":175},175,"oC",null,null,null,null,null,null,null,null,null,null,null,null,null,null,null,null,null,null,null,null,null,null,null,null,null,null,null,null,null,null,null,null,{"$f":"H56","v":175},null,null,null,null,null,{"$f":"'MOSFET Database 48V'!N4","v":"CSD19532KTT"},"CSD19532KTT , 59.12 , $0.914",{"$f":"'MOSFET Database 48V'!O35","v":0.91400000000000003},{"$f":"'MOSFET Database 48V'!O33","v":2.9030400000000005E-2},{"$f":"'MOSFET Database 48V'!O61","v":59.119149955522325},null,null,null,{"$f":"'MOSFET Database 24V'!J4","v":"CSD18535KTT"},"CSD18535KTT , 117.57 , $1.266",{"$f":"'MOSFET Database 24V'!K35","v":1.266},{"$f":"'MOSFET Database 24V'!K33","v":9.0719999999999985E-3},{"$f":"'MOSFET Database 24V'!K61","v":117.56826140517784}]
[null,null,null,null,"10ms SOA Current@ VIN(MAX)",{"$f":"IF(VINMAX<=40,'MOSFET Database 24V'!C70,'MOSFET Database 48V'!C70)","v":400},{"$f":"IF(VINMAX<=40,'MOSFET Database 24V'!G70,'MOSFET Database 48V'!G70)","v":400},400,"A",null,null,null,null,null,null,null,null,null,null,null,null,null,null,null,null,null,null,null,null,null,null,null,null,null,null,null,null,null,null,null,null,{"$f":"H57","v":400},null,null,null,null,null,{"$f":"'MOSFET Database 48V'!R4","v":"CSD19531Q5A"},"CSD19531Q5A , 37.21 , $0.611",{"$f":"'MOSFET Database 48V'!S35","v":0.61099999999999999},{"$f":"'MOSFET Database 48V'!S33","v":3.2348160000000001E-2},{"$f":"'MOSFET Database 48V'!S61","v":37.206520687950544},null,null,null,{"$f":"'MOSFET Database 24V'!V4","v":"CSD19505KTT"},"CSD19505KTT , 82.25 , $1.313",{"$f":"'MOSFET Database 24V'!W35","v":1.3129999999999999},{"$f":"'MOSFET Database 24V'!W33","v":1.4664240000000002E-2},{"$f":"'MOSFET Database 24V'!W61","v":82.248431468355577}]
[null,null,null,null,"100µs SOA Current @ VIN(MAX)",{"$f":"IF(VINMAX<=40,'MOSFET Database 24V'!C71,'MOSFET Database 48V'!C71)","v":601.73570974983545},{"$f":"IF(VINMAX<=40,'MOSFET Database 24V'!G71,'MOSFET Database 48V'!G71)","v":626.08493738234574},100,"A",null,null,null,null,null,null,null,null,null,null,null,null,null,null,null,null,null,null,null,null,null,null,null,null,null,null,null,null,null,null,null,null,100,null,null,null,null,null,{"$f":"'MOSFET Database 48V'!J4","v":"CSD19532Q5B"},"CSD19532Q5B , 34.43 , $0.896",{"$f":"'MOSFET Database 48V'!K35","v":0.89600000000000002},{"$f":"'MOSFET Database 48V'!K33","v":2.5242840000000002E-2},{"$f":"'MOSFET Database 48V'!K61","v":34.43480387468945},null,null,null,{"$f":"'MOSFET Database 24V'!AP4","v":"CSD18532KCS"},"CSD18532KCS , 67.73 , $0.818",{"$f":"'MOSFET Database 24V'!AQ35","v":0.81799999999999995},{"$f":"'MOSFET Database 24V'!AQ33","v":2.0139840000000003E-2},{"$f":"'MOSFET Database 24V'!AQ61","v":67.733895572241039}]
[null,null,null,null,"1ms SOA Current @ VIN(MAX)",{"$f":"IF(VINMAX<=40,'MOSFET Database 24V'!C72,'MOSFET Database 48V'!C72)","v":33.624407288629875},{"$f":"IF(VINMAX<=40,'MOSFET Database 24V'!G72,'MOSFET Database 48V'!G72)","v":50.754558722510708},10,"A",null,null,null,null,null,null,null,null,null,null,null,null,null,null,null,null,null,null,null,null,null,null,null,null,null,null,null,null,null,null,null,null,10,null,null,null,null,null,{"$f":"'MOSFET Database 48V'!V4","v":"CSD19533Q5A"},"CSD19533Q5A , 15.34 , $0.48",{"$f":"'MOSFET Database 48V'!W35","v":0.48},{"$f":"'MOSFET Database 48V'!W33","v":4.8729600000000012E-2},{"$f":"'MOSFET Database 48V'!W61","v":15.336816557808566},null,null,null,{"$f":"'MOSFET Database 24V'!AH4","v":"CSD18542KTT"},"CSD18542KTT , 64.64 , $0.861",{"$f":"'MOSFET Database 24V'!AI35","v":0.86099999999999999},{"$f":"'MOSFET Database 24V'!AI33","v":1.9051200000000001E-2},{"$f":"'MOSFET Database 24V'!AI61","v":64.636433318146601}]
[null,null,null,null,"10ms  Current at @ VIN(MAX)",{"$f":"IF(VINMAX<=40,'MOSFET Database 24V'!C73,'MOSFET Database 48V'!C73)","v":11.98008745545671},{"$f":"IF(VINMAX<=40,'MOSFET Database 24V'!G73,'MOSFET Database 48V'!G73)","v":17.15082098001713},2,"A",null,null,null,null,null,null,null,null,null,null,null,null,null,null,null,null,null,null,null,null,null,null,null,null,null,null,null,null,null,null,null,null,2,null,null,null,null,null,{"$f":"'MOSFET Database 48V'!AD4","v":"CSD19534Q5A"},"CSD19534Q5A , 14.91 , $0.335",{"$f":"'MOSFET Database 48V'!AE35","v":0.33500000000000002},{"$f":"'MOSFET Database 48V'!AE33","v":7.4853719999999999E-2},{"$f":"'MOSFET Database 48V'!AE61","v":14.913717562672614},null,null,null,{"$f":"'MOSFET Database 24V'!N4","v":"CSD18540Q5B"},"CSD18540Q5B , 65.18 , $0.867",{"$f":"'MOSFET Database 24V'!O35","v":0.86699999999999999},{"$f":"'MOSFET Database 24V'!O33","v":1.0121760000000002E-2},{"$f":"'MOSFET Database 24V'!O61","v":65.184212815489929}]
[null,null,null,null,"100ms SOA Current at @ VIN(MAX)",{"$f":"IF(VINMAX<=40,'MOSFET Database 24V'!C74,'MOSFET Database 48V'!C74)","v":4.9306775809066696},{"$f":"IF(VINMAX<=40,'MOSFET Database 24V'!G74,'MOSFET Database 48V'!G74)","v":5.5916046225844749},0.1,"A",null,null,null,null,null,null,null,null,null,null,null,null,null,null,null,null,null,null,null,null,null,null,null,null,null,null,null,null,null,null,null,null,0.1,null,null,null,null,null,{"$f":"'MOSFET Database 48V'!Z4","v":"CSD19537Q3"},"CSD19537Q3 , 14.3 , $0.401",{"$f":"'MOSFET Database 48V'!AA35","v":0.40100000000000002},{"$f":"'MOSFET Database 48V'!AA33","v":7.5637800000000019E-2},{"$f":"'MOSFET Database 48V'!AA61","v":14.29808683173929},null,null,null,{"$f":"'MOSFET Database 24V'!Z4","v":"CSD18532Q5B"},"CSD18532Q5B , 37.76 , $0.845",{"$f":"'MOSFET Database 24V'!AA35","v":0.84499999999999997},{"$f":"'MOSFET Database 24V'!AA33","v":1.6485120000000002E-2},{"$f":"'MOSFET Database 24V'!AA61","v":37.762388139150254}]
[null,null,null,null,null,null,null,null,null,null,null,null,null,null,null,null,null,null,null,null,null,null,null,null,null,null,null,null,null,null,null,null,null,null,null,null,null,null,null,null,null,0,null,null,null,null,null,{"$f":"'MOSFET Database 48V'!AL4","v":"CSD19538Q3A"},"CSD19538Q3A , 5.71 , $0.162",{"$f":"'MOSFET Database 48V'!AM35","v":0.16200000000000001},{"$f":"'MOSFET Database 48V'!AM33","v":0.28673999999999999},{"$f":"'MOSFET Database 48V'!AM61","v":5.7066617894938059},null,null,null,{"$f":"'MOSFET Database 24V'!AL4","v":"CSD19502Q5B"},"CSD19502Q5B , 34.52 , $0.896",{"$f":"'MOSFET Database 24V'!AM35","v":0.89600000000000002},{"$f":"'MOSFET Database 24V'!AM33","v":1.9660319999999998E-2},{"$f":"'MOSFET Database 24V'!AM61","v":34.524572643922667}]
[null,"Note: TI recommends choosing a FET with SOA current specified for 100ms and/or 1s or DC. If choosing a FET without these parameters, this calculator will estimate the values via extrapolation, which leaves an inherent associated risk.",null,null,null,null,null,null,null,null,null,null,null,null,null,null,null,null,null,null,null,null,null,null,null,null,null,null,null,null,null,null,null,null,null,null,null,null,null,null,null,null,null,null,null,null,null,{"$f":"'MOSFET Database 48V'!AH4","v":"CSD19538Q2"},"CSD19538Q2 , 4.34 , $0.162",{"$f":"'MOSFET Database 48V'!AI35","v":0.16200000000000001},{"$f":"'MOSFET Database 48V'!AI33","v":0.30203279999999999},{"$f":"'MOSFET Database 48V'!AI61","v":4.3383116843321741},null,null,null,{"$f":"'MOSFET Database 24V'!AT4","v":"CSD18531Q5A"},"CSD18531Q5A , 32.57 , $0.589",{"$f":"'MOSFET Database 24V'!AU35","v":0.58899999999999997},{"$f":"'MOSFET Database 24V'!AU33","v":2.250504E-2},{"$f":"'MOSFET Database 24V'!AU61","v":32.569438691047736}]
[null,null,null,null,"Number of FETs suggested",{"$f":"IF(VINMAX<=40,'MOSFET Database 24V'!C77,'MOSFET Database 48V'!C77)","v":1},{"$f":"IF(VINMAX<=40,'MOSFET Database 24V'!G77,'MOSFET Database 48V'!G77)","v":1},{"$f":"'MOSFET Database 24V'!K77","v":1},"#",null,null,null,null,null,null,null,null,null,null,null,null,null,null,null,null,null,null,null,null,null,null,null,null,null,null,null,null,null,null,null,null,null,null,null,null,null,null,null,null,null,null,null,null,null,null,{"$f":"'MOSFET Database 24V'!AD4","v":"CSD18532NQ5B"},"CSD18532NQ5B , 37.25 , $0.845",{"$f":"'MOSFET Database 24V'!AE35","v":0.84499999999999997},{"$f":"'MOSFET Database 24V'!AE33","v":1.7184959999999999E-2},{"$f":"'MOSFET Database 24V'!AE61","v":37.25496891384784}]
[null,null,null,null,"FET Power dissapation at full load (per FET)",{"$f":"IF(VINMAX<=40,'MOSFET Database 24V'!C76,'MOSFET Database 48V'!C76)","v":1.7184959999999999E-2},{"$f":"IF(VINMAX<=40,'MOSFET Database 24V'!G76,'MOSFET Database 48V'!G76)","v":1.0121760000000002E-2},{"$f":"'MOSFET Database 24V'!K76","v":3.2400000000000003E-3},"W",null,null,null,null,null,null,null,null,null,null,null,null,null,null,null,null,null,null,null,null,null,null,null,null,null,null,null,null,null,null,null,null,null,null,null,null,null,null,null,null,null,null,null,null,null,null,{"$f":"'MOSFET Database 24V'!BB4","v":"CSD19501KCS"},"CSD19501KCS , 17.97 , $0.719",{"$f":"'MOSFET Database 24V'!BC35","v":0.71899999999999997},{"$f":"'MOSFET Database 24V'!BC33","v":3.1434480000000001E-2},{"$f":"'MOSFET Database 24V'!BC61","v":17.96997169091976}]
[null,null,null,null,"Maximum steady state FET Junction Temperature (TJ,DC)",{"$f":"IF(VINMAX<=40,'MOSFET Database 24V'!C78,'MOSFET Database 48V'!C78)","v":85.515548800000005},{"$f":"IF(VINMAX<=40,'MOSFET Database 24V'!G78,'MOSFET Database 48V'!G78)","v":85.303652799999995},{"$f":"'MOSFET Database 24V'!K78","v":85.097200000000001},"oC",null,null,null,null,null,null,null,null,null,null,null,null,null,null,null,null,null,null,null,null,null,null,null,null,null,null,null,null,null,null,null,null,null,null,null,null,null,null,null,null,null,null,null,null,null,null,{"$f":"'MOSFET Database 24V'!BF4","v":"CSD18563Q5A"},"CSD18563Q5A , 22.76 , $0.477",{"$f":"'MOSFET Database 24V'!BG35","v":0.47699999999999998},{"$f":"'MOSFET Database 24V'!BG33","v":3.4369919999999998E-2},{"$f":"'MOSFET Database 24V'!BG61","v":22.761633695541885}]
[null,null,null,null,"SOA Margin",{"$f":"IF(VINMAX<=40,'MOSFET Database 24V'!C81,'MOSFET Database 48V'!C81)","v":37.25496891384784},{"$f":"IF(VINMAX<=40,'MOSFET Database 24V'!G81,'MOSFET Database 48V'!G81)","v":65.184212815489929},{"$f":"'MOSFET Database 24V'!K81","v":12.872575089387258},null,null,null,null,null,null,null,null,null,null,null,null,null,null,null,null,null,null,null,null,null,null,null,null,null,null,null,null,null,null,null,null,null,null,null,null,null,null,null,null,null,null,null,null,null,null,null,{"$f":"'MOSFET Database 24V'!BJ4","v":"CSD19503KCS"},"CSD19503KCS , 20.07 , $0.587",{"$f":"'MOSFET Database 24V'!BK35","v":0.58699999999999997},{"$f":"'MOSFET Database 24V'!BK33","v":4.7096640000000002E-2},{"$f":"'MOSFET Database 24V'!BK61","v":20.068695720127778}]
[null,null,null,null,"Webpage Link",{"$f":"IF(VINMAX<=40,HYPERLINK('MOSFET Database 24V'!C82,SFET24_1),HYPERLINK('MOSFET Database 48V'!C82,SFET48_1))","v":"CSD18532NQ5B"},{"$f":"IF(VINMAX<=40,HYPERLINK('MOSFET Database 24V'!G82,SFET24_2),HYPERLINK('MOSFET Database 48V'!G82,SFET48_2))","v":"CSD18540Q5B"},"Enter Webpage Link",null,null,null,null,null,null,null,null,null,null,null,null,null,null,null,null,null,null,null,null,null,null,null,null,null,null,null,null,null,null,null,null,null,null,null,null,null,null,null,null,null,null,null,null,null,null,null,{"$f":"'MOSFET Database 24V'!AX4","v":"CSD18533Q5A"},"CSD18533Q5A , 20.24 , $0.464",{"$f":"'MOSFET Database 24V'!AY35","v":0.46400000000000002},{"$f":"'MOSFET Database 24V'!AY33","v":2.8674000000000002E-2},{"$f":"'MOSFET Database 24V'!AY61","v":20.243835406101987},null,"Mosfet ","CSD18540Q5B"]
[null,null,null,null,"Cost per FET (1k USD)",{"$f":"IF(VINMAX<=40,'MOSFET Database 24V'!C84,'MOSFET Database 48V'!C84)","v":0.84499999999999997},{"$f":"IF(VINMAX<=40,'MOSFET Database 24V'!G84,'MOSFET Database 48V'!G84)","v":0.86699999999999999},"Enter Cost Details",null,null,"Note: Hover here to see the 3 values affecting this curve, consult a thermal expert if you are unsure! ",null,null,null,null,null,null,null,null,null,null,null,null,null,null,null,null,null,null,null,null,null,null,null,null,null,null,null,null,null,null,null,null,null,null,null,null,null,null,null,null,null,null,null,null,{"$f":"'MOSFET Database 24V'!BN4","v":"CSD18534Q5A"},"CSD18534Q5A , 15.14 , $0.326",{"$f":"'MOSFET Database 24V'!BO35","v":0.32600000000000001},{"$f":"'MOSFET Database 24V'!BO33","v":4.7628000000000011E-2},{"$f":"'MOSFET Database 24V'!BO61","v":15.135527827120454}]
[null,null,null,null,"Total Cost of the FETs",{"$f":"NUMFETS1*F69","v":0.84499999999999997},{"$f":"G64*G69","v":0.86699999999999999},null,null,null,null,null,null,null,null,null,null,null,null,null,null,null,null,null,null,null,null,null,null,null,null,null,null,null,null,null,null,null,null,null,null,null,null,null,null,null,null,null,null,null,null,null,null,null,null,{"$f":"'MOSFET Database 24V'!BR4","v":"CSD18543Q3A"},"CSD18543Q3A , 14.93 , $0.258",{"$f":"'MOSFET Database 24V'!BS35","v":0.25800000000000001},{"$f":"'MOSFET Database 24V'!BS33","v":4.6830960000000005E-2},{"$f":"'MOSFET Database 24V'!BS61","v":14.934502570454036}]
[null,null,null,null,null,null,null,null,null,null,null,null,null,null,null,null,null,null,null,null,null,null,null,null,null,null,null,null,null,null,null,null,null,null,null,null,null,null,null,null,null,null,null,null,null,null,null,null,null,null,null,null,null,null,null,{"$f":"'MOSFET Database 24V'!BV4","v":"CSD18537NQ5A"},"CSD18537NQ5A , 10.06 , $0.273",{"$f":"'MOSFET Database 24V'!BW35","v":0.27300000000000002},{"$f":"'MOSFET Database 24V'!BW33","v":6.65496E-2},{"$f":"'MOSFET Database 24V'!BW61","v":10.058831879572809}]
[null,null,null,null,null,"Note: If none of the FETs are meeting the requirement, reduce the startup load or select a stronger FET in cell H62"]
[null,null,null,null,null,"Note: If none of the FETs are meeting the requirement, reduce the fault timer or select a stronger FET in cell H62"]
[]
[null,"Step 4: Startup",null,null,"Select preferred FET from the dropdown menu","CSD18540Q5B , 2.99 , $0.867"]
[]
[]
[null,null,null,null,"Timer Overview"]
[null,null,null,null,"Typical Start Time with Vinmax (Tstart)",{"$f":"IF(F75=F54,Start_up!M2,IF(F75=G54,Start_up!M121,IF(F75=H54,Start_up!M240)))","v":131.25},"ms"]
[null,null,null,null,"IFET - ILOAD margin (lowest for Vout range)",{"$f":"IF(F75=F54,Start_up!O2,IF(F75=G54,Start_up!O121,IF(F75=H54,Start_up!O240)))","v":0.61538461538461542}]
[null,null,null,null,"Target Fault Timer: Tstart + Margin",{"$f":"IF(F75=F54,Equations!F58,IF(F75=G54,Equations!G58,IF(F75=H54,Equations!H58)))","v":196.875},"ms"]
[null,null,null,null,"Target Timer capacitance",{"$f":"IF(F75=F54,Equations!F59,IF(F75=G54,Equations!G59,IF(F75=H54,Equations!H59)))","v":4183.59375},"nF"]
[null,null,null,null,"Selected Timer capacitance ",600,"nF"]
[null,null,null,null,"Final Fault Timer(Tfault)",{"$f":"IF(F75=F54,Equations!F61,IF(F75=G54,Equations!G61,IF(F75=H54,Equations!H61)))","v":28.235294117647058},"ms"]
[null,null,null,null,"Derated SOA / PLIM",{"$f":"_xlfn.SWITCH(F75,F54,Equations!F62,G54,Equations!G62,H54,Equations!H62)","v":64.12683379253545}]
[null,null,null,null,"Can a \"hot\" board be hotplugged","No"]
[null,null,null,null,"Recommended slew Rate (max)",{"$f":"_xlfn.SWITCH(F75,F54,dv_dt_recommendations!J28,G54,dv_dt_recommendations!J73,H54,dv_dt_recommendations!J118)","v":19.946117777149563},"V/ms"]
[null,null,null,null,"Recommended slew Rate (min)",{"$f":"_xlfn.SWITCH(F75,F54,dv_dt_recommendations!J29,G54,dv_dt_recommendations!J74,H54,dv_dt_recommendations!J119)","v":0.10708559822108767},"V/ms"]
[null,"Note: This is the typical dv/dt rate, but max value can be 1.4x. This is because the gate source current can vary from 16uA to 22uA. Thus TI recommends keeping the overall SOA margin during start-up >1.5 in order to compensate for this.",null,null,"dv/dt rate on Vout",0.12,"V/ms"]
[null,null,null,null,"calculated SS capacitance",{"$f":"_xlfn.SWITCH(F75,F54,Equations!F66,G54,Equations!G66,H54,Equations!H66)","v":133.33333333333334},"nF"]
[null,null,null,null,"actual SS capacitance",150,"nF"]
[null,null,null,null,"actual typical dv/dt rate on Vout",{"$f":"_xlfn.SWITCH(F75,F54,Equations!F68,G54,Equations!G68,H54,Equations!H68)","v":0.10666666666666667},"V/ms"]
[null,null,null,null,"SOA margin during start-up",{"$f":"_xlfn.SWITCH(F75,F54,Equations!F75,G54,Equations!G75,H54,Equations!H75)","v":7.9573423386103501}]
[null,null,null,null,"Target Fault Time",{"$f":"F31","v":1},"ms"]
[null,null,null,null,"Calculated Timer Capacitance ",{"$f":"_xlfn.SWITCH(F75,F54,Equations!F80,G54,Equations!G80,H54,Equations!H80)","v":21.25},"nF"]
[null,null,null,null,"Actual Timer Capacitance ( pick one smaller than CT,CALC) ",22,"nF"]
[null,null,null,null,"Actual Fault Time (Tfault)",{"$f":"_xlfn.SWITCH(F75,F54,Equations!F82,G54,Equations!G82,H54,Equations!H82)","v":1.0352941176470587},"ms",null,null,null,null,null,null,null,null,null,null,null,null,null,null,null,null,null,null,null,null,null,null,null,null,null,null,null,null,null,null,null,null,null," ","Option A"]
[null,null,null,null,"SOA margin during \"hot-short\" or \"start-into short\"",{"$f":"_xlfn.SWITCH(F75,F54,Equations!F84,G54,Equations!G84,H54,Equations!H84)","v":107.23987508022309},null,null,null,null,null,null,null,null,null,null,null,null,null,null,null,null,null,null,null,null,null,null,null,null,null,null,null,null,null,null,null,null,null,null,null,"Option B"]
[null,null,null,null,"Resulting Typical Insertion Delay Time",{"$f":"_xlfn.SWITCH(F75,F54,Equations!F111,G54,Equations!G111,H54,Equations!H111)","v":16},"ms",null,null,null,null,null,null,null,null,null,null,null,null,null,null,null,null,null,null,null,null,null,null,null,null,null,null,null,null,null,null,null,null,null,null,"Option C"]
[null,null,null,null,"Resulting Typical Restart Time",{"$f":"_xlfn.SWITCH(F75,F54,Equations!F114,G54,Equations!G114,H54,Equations!H114)","v":206.94235294117649},"ms",null,null,null,null,null,null,null,null,null,null,null,null,null,null,null,null,null,null,null,null,null,null,null,null,null,null,null,null,null,null,null,null,null,null,"Option D"]
[null,"Step 5: UVLO, OVLO & PGD Thresholds",null,null,"Select Option A or Option B","Option B"]
[null,null,null,null,"Desired Upper UVLO Threshold",11,"V"]
[null,null,null,null,"Desired Lower UVLO Threshold",10,"V"]
[null,null,null,null,"Desired Upper OVLO Threshold",14,"V"]
[null,null,null,null,"Desired Lower OVLO Threshold",13,"V"]
[null,null,null,null,"Recommended Resistance for:  R1",{"$f":"IF(F101=\"Option A\",Equations!F132,Equations!G132)","v":47.61904761904762},"kW"]
[null,null,null,null,"R2",{"$f":"IF(F101=\"Option A\",Equations!F133,Equations!G133)","v":15.873015873015873},"kW"]
[null,null,null,null,"R3",{"$f":"IF(F101=\"Option A\",Equations!F134,Equations!G134)","v":47.61904761904762},"kW"]
[null,null,null,null,"R4",{"$f":"IF(F101=\"Option A\",Equations!F135,Equations!G135)","v":10.351966873706004},"kW"]
[null,null,null,null,"Enter the Resistance for R1 ",47,"kW"]
[null,null,null,null,"Enter the Resistance for R2 ",15,"kW"]
[null,null,null,null,"Enter the Resistance for R3 ",47,"kW",null,null,null,null,null,null,null,null,null,null,null,null,null,null,null,null,null,null,null,null,null,null,null,null,null,null,null,null,null,null,null,null,null,null,null,null,null,null,null,null,null,null,null,null,null,null,null,null,null,null,null,null,null,null,"R1 &R3","RMCF0603FT47K0"]
[null,null,null,null,"Enter the Resistance for R4 ",10,"kW",null,null,null,null,null,null,null,null,null,null,null,null,null,null,null,null,null,null,null,null,null,null,null,null,null,null,null,null,null,null,null,null,null,null,null,null,null,null,null,null,null,null,null,null,null,null,null,null,null,null,null,null,null,null,"R2","ERJ-S03F1502V"]
[null,null,null,null,null,null,null,null,null,null,null,null,null,null,null,null,null,null,null,null,null,null,null,null,null,null,null,null,null,null,null,null,null,null,null,null,null,null,null,null,null,null,null,null,null,null,null,null,null,null,null,null,null,null,null,null,null,null,null,null,null,"R4","SFR03EZPF1002"]
[null,null,"Resulting Thresholds:","Minimum","Typical","Maximum"]
[null,null,"Resulting Upper UVLO Threshold = ",{"$f":"IF($F$101=\"Option A\",Equations!F136,Equations!G136)","v":10.690666666666669},{"$f":"IF($F$101=\"Option A\",Equations!F137,Equations!G137)","v":11.320333333333332},{"$f":"IF($F$101=\"Option A\",Equations!F138,Equations!G138)","v":11.95},"V"]
[null,null,"Resulting Lower UVLO Threshold = ",{"$f":"IF($F$101=\"Option A\",Equations!F139,Equations!G139)","v":10.126666666666667},{"$f":"IF($F$101=\"Option A\",Equations!F140,Equations!G140)","v":10.333333333333334},{"$f":"IF($F$101=\"Option A\",Equations!F141,Equations!G141)","v":10.54},"V"]
[null,null,"Resulting Upper OVLO Threshold = ",{"$f":"IF($F$101=\"Option A\",Equations!F142,Equations!G142)","v":13.965},{"$f":"IF($F$101=\"Option A\",Equations!F143,Equations!G143)","v":14.25},{"$f":"IF($F$101=\"Option A\",Equations!F144,Equations!G144)","v":14.535},"V"]
[null,null,"Resulting Lower OVLO Threshold = ",{"$f":"IF($F$101=\"Option A\",Equations!F145,Equations!G145)","v":12.555},{"$f":"IF($F$101=\"Option A\",Equations!F146,Equations!G146)","v":13.263},{"$f":"IF($F$101=\"Option A\",Equations!F147,Equations!G147)","v":13.971},"V"]
[null,null,"Note: If any of the cells above are yellow, then these values are outside of the device's operating range. This will result in the device turning either on or off at its operating limits rather than at the user selected values in yellow."]
[]
[null,null,null,null,null,null,null,null,null," "]
[null,null,null,null,"Enter the Resistance for RPG",10,"kW"]
[null,"Design Summary",null,null,"RSNS =",{"$f":"Rs","v":27},"mW"]
[null,null,null,null,"RCL1 =",{"$f":"IF(RsMAX>Rs,\"DNP\",RDIV1)","v":10},"W"]
[null,null,null,null,"RCL2 =",{"$f":"IF(RsMAX>Rs,\"0\",RDIV2)","v":0.31},"W"]
[null,null,null,null,"RPWR =",{"$f":"F51","v":22},"kW"]
[null,null,null,null,"CTIMER =",{"$f":"IF(F30=\"Soft Start\", F96, F83)","v":22},"nF",null,null,"Design Results"]
[null,null,null,null,"R1 =",{"$f":"F110","v":47},"kW",null,null,"Settings","Units",null,null,null,null,null,null,null,null,null,null,null,null,null,null,null,null,null,null,null,null,null,null,null,null,"Units"]
[null,null,null,null,"R2 =",{"$f":"F111","v":15},"kW",null,"Current limit",{"$f":"F42","v":2.0370370370370372},"A",null,null,null,null,null,null,null,null,null,null,null,null,null,null,null,null,null,null,null,null,null,null,null,null,"A"]
[null,null,null,null,"R3 =",{"$f":"F112","v":47},"kW",null,"Power Limit",{"$f":"F52","v":6.5185185185185182},"W",null,null,null,null,null,null,null,null,null,null,null,null,null,null,null,null,null,null,null,null,null,null,null,null,"W"]
[null,null,null,null,"R4 =",{"$f":"IF(F101=\"Option A\",\"N/A\",F113)","v":10},"kW",null,"Circuit Breaker Current",{"$f":"F42","v":2.0370370370370372},"A",null,null,null,null,null,null,null,null,null,null,null,null,null,null,null,null,null,null,null,null,null,null,null,null,"A"]
[null,null,null,null,"Cdv/dt =",{"$f":"IF(F30=\"Soft Start\", F91, \"DNP\")","v":150},"nF",null,"Startup Time",{"$f":"IF(F30=\"Soft Start\",Equations!F70,Start_up!M2)","v":131.25},"ms",null,null,null,null,null,null,null,null,null,null,null,null,null,null,null,null,null,null,null,null,null,null,null,null,"ms"]
[null,null,null,null,"CIN = ",0.01,"µF",null,"Insertion Delay",{"$f":"TINSERT","v":16},"ms",null,null,null,null,null,null,null,null,null,null,null,null,null,null,null,null,null,null,null,null,null,null,null,null,"ms"]
[null,null,null,null,"D1","B380-13-F",null,null,"Fault Timeout",{"$f":"IF(F30=\"Soft Start\", F97,F84)","v":1.0352941176470587},"ms",null,null,null,null,null,null,null,null,null,null,null,null,null,null,null,null,null,null,null,null,null,null,null,null,"ms"]
[null,null,null,null,"D2",{"$f":"IF(F30=\"Soft Start\",\"1N4148W-7-F\",\"DNP\")","v":"1N4148W-7-F"},null,null,"Restart Time During Fault",{"$f":"F100","v":206.94235294117649},"ms",null,null,null,null,null,null,null,null,null,null,null,null,null,null,null,null,null,null,null,null,null,null,null,null,"ms"]
[null,null,null,null,"Q1",{"$f":"F75","v":"CSD18540Q5B , 2.99 , $0.867"},null,null,"Upper UVLO Threshold",{"$f":"E116","v":11.320333333333332},"V",null,null,null,null,null,null,null,null,null,null,null,null,null,null,null,null,null,null,null,null,null,null,null,null,"V"]
[null,null,null,null,"#FETs in parallel",{"$f":"MATCH(F137,F54:H54,F64:H64)","v":2},null,null,"Lower UVLO Threshold",{"$f":"E117","v":10.333333333333334},"V",null,null,null,null,null,null,null,null,null,null,null,null,null,null,null,null,null,null,null,null,null,null,null,null,"V"]
[null,null,null,null,"Q2",{"$f":"IF(F30=\"Soft Start\",\"MMBT5401LT1G\",\"DNP\")","v":"MMBT5401LT1G"},null,null,"Upper OVLO Threshold",{"$f":"E118","v":14.25},"V",null,null,null,null,null,null,null,null,null,null,null,null,null,null,null,null,null,null,null,null,null,null,null,null,"V"]
[null,null,null,null,"Z1","5.0SMDxx",null,null,"Lower OVLO Threshold",{"$f":"E119","v":13.263},"V",null,null,null,null,null,null,null,null,null,null,null,null,null,null,null,null,null,null,null,null,null,null,null,null,"V"]
[]
[]
[null,"Notes:","1. Although not mandatory, CIN provides transient suppression at the VIN pin"]
[null,null,"2. A TVS clamp from VIN to GND is absolutely mandatory to clamp the voltage overshoot upon MOSFET turn-off, e.g. during circuit breaker"]
[]
[null,null,"3. Componet tolerances not accounted for in Min/Max Calculations."]

{"sheet":"Device Parameters","index":2,"n_rows":52,"n_cols":17,"rows_kept":52,"cut":false,"hidden":true,"merged":[[31,2,31,4],[31,5,31,7]]}
[]
[null,null,"Min","Typ","Max","Units"]
["Operating Conditions"]
[null,"Junction Temperature",-40,null,125]
[null,"Input Voltage",9,null,80,"V"]
["Current Limit"]
[]
[null,null,48.5,55,61.5]
[null,"Sense input Current",null,23,null,"uA"]
[]
["Power Limit"]
[null,"Systematic Offset",null,null,1E-3,"V"]
[null,"Minimum Recommended Vsns",null,null,5.0000000000000001E-3,"V","<= I am assuming this would have +/- 50% error at best"]
[null,"A_coeff",null,null,125000]
[]
[null,"Key Equations: ","Vsns = Rpwr / (A*Vds) + Vos,syst",null,null,null,null,null,"Example: ","Vds","Rpwr","Rsns (m-ohm)","Plim","Vsns (mV)",null,"Plim","Rpwr"]
[null,null,"Plim (Vds) = 1/Rs * [ Rpwr/A]",null,null,null,null,null,null,12,25,{"$f":"0.5","v":0.5},{"$f":"1/(0.001*L17)*(K17*1000/$E$14+J17*$E$12)","v":424.00000000000006},{"$f":"K17*1000/$E$14/J17+$E$12","v":1.7666666666666667E-2},null,82,{"$f":"E14*(P17*L17*0.001-J17*E12)","v":3625}]
[null,null,"Rpwr =  A * [PLIM(Vds) * Rs]",null,null,null,null,null,null,12,5,{"$f":"0.5","v":0.5},{"$f":"1/(0.001*L18)*(K18*1000/$E$14+J18*$E$12)","v":104.00000000000001},{"$f":"K18*1000/$E$14/J18+$E$12*0.001","v":3.3343333333333337E-3}]
[null,"How Plim varries vs Vds:",null,null,null,null,null,null,"Ex: Plim @ 13V = 100W, Rs = 0.5; Plim @ (Vds = 5V) = 100W - 7V * 1mV/0.5mili-ohm = 100W - 14W = 86W"]
[]
["Timer"]
[null,"Upper Threshold",3.76,4,4.16,"V"]
[null,"Insertion Time Current",-8,-5.5,-3,"uA"]
[null,"timer_constant"]
[null,"Fault detection current",120,85,51,"uA"]
[null,"Computed Start - Up Slop",null,{"$f":"SQRT(0.66^2+ ((120-90)/90)^2+ 0.1^2)","v":0.74613076006227697},null,null,"<= mean root square(T_start_error_Plim, timer_error, cap_error); T_start proportional to 1/Plim => T_start_error_plim = 1/(1-Plim_err) - 1 = 1/(1-0.4) - 1 = 0.66"]
[null,"Slop for calculations",null,0.5,null,null,"Note: We get additional buffer, b/c this is designed for a Vinmax, while typically Vin = Vinnom"]
[]
["Gate"]
[null,"Gate Sourcing Current",10,16,22]
[]
["Circuit Breaker"]
[]
[]
[]
[]
[]
["Timer Pin"]
[null,"Upper Threshold",3.76,4,4.16]
[null,"Lower Threshold (Restart)",1.1870000000000001,1.25,1.3129999999999999]
[null,"End of Cycle",null,0.3]
[null,"Re-enable threshold",null,0.3]
[null,"Insertion time current",3,5.5,8]
[null,"Sink current, end of insertion",1,1.5,2]
[null,"Fault detection current",51,85,120]
[null,"Fault sink current",1.25,2.5,3.75]
[]
["Power Good"]
[null,"PGVOL",null,60,150,"mV",2,"mA sinking"]
["FB Pin"]
[null,"FB Threshold",2.41,2.46,2.52,"V"]
[null,"FB Hysteresis Current",15,20,25,"uA"]

{"sheet":"Equations","index":3,"n_rows":286,"n_cols":25,"rows_kept":286,"cut":false,"hidden":true,"merged":[[53,3,53,6],[62,3,62,6],[77,3,77,7]]}
[]
[]
[]
[]
[]
[]
[]
[]
[]
[]
[]
[]
["Current Limit"]
[]
[null,null,null,"CLMIN =",{"$f":"IF('Design Calculator'!$F$32=\"26 mV\",'Device Parameters'!C7,'Device Parameters'!C8)","v":48.5},"mV"]
[null,null,null,"CLNOM = ",{"$f":"IF('Design Calculator'!$F$32=\"26 mV\",'Device Parameters'!D7,'Device Parameters'!D8)","v":55},"mV"]
[null,null,null,"CLMAX =",{"$f":"IF('Design Calculator'!$F$32=\"26 mV\",'Device Parameters'!E7,'Device Parameters'!E8)","v":61.5},"mV"]
[]
[]
[null,null,null,null,"Max Rs =",{"$f":"CLMIN_Threshold/('Design Calculator'!F22*1.01)","v":26.677667766776676}]
[null,null,null,null,"RCL1 Recommended  =",{"$f":"IF(Rs>RsMAX,10,\"NA\")","v":10}]
[null,null,null,null,"RCL2 Recommmended =",{"$f":"IF(Rs>RsMAX,(((IOUTMAX*Rs)/CLMIN_Threshold)-1)*F21,\"NA\")","v":2.0618556701030855E-2}]
[null,null,null,null,"Effective Rs =",{"$f":"IF(RsMAX>Rs,Rs,IF('Design Calculator'!F34=\"Yes\",IF(Rs>RsMAX,Rs/(1+RDIV2/RDIV1),Rs),Rs))","v":27}]
[null,null,null,null,"Min. Current limit =",{"$f":"CLMIN_Threshold/RsEFF","v":1.7962962962962963}]
[null,null,null,null,"Typ. Current limit =",{"$f":"CLNOM_Threshold/RsEFF","v":2.0370370370370372}]
[null,null,null,null,"Max. Current limit =",{"$f":"CLMAX_Threshold/RsEFF","v":2.2777777777777777}]
[null,null,null,null,"Rs Power Diss. =",{"$f":"F26^2*'Design Calculator'!F35","v":140.08333333333331}]
[]
[]
[]
["FET Selection"]
[null,null,null,null,null,"Nominal",null,null,null,"Derated at TJDC"]
[null,null,null,null,"10us SOA Current Maximum Input Voltage",{"$f":"VINMAX*'Design Calculator'!F57","v":5600},{"$f":"VINMAX*'Design Calculator'!G57","v":5600},{"$f":"VINMAX*'Design Calculator'!H57","v":5600},"W",{"$f":"F33*($F$38-TJDC1)/($F$38-25)","v":2888.9034137599997},{"$f":"G33*($G$38-TJDC2)/($G$38-25)","v":3348.6636288000004},{"$f":"H33*($H$38-TJDC3)/($H$38-25)","v":3356.3712}]
[null,null,null,null,"100us SOA Current Maximum Input Voltage",{"$f":"VINMAX*'Design Calculator'!F58","v":8424.2999364976968},{"$f":"VINMAX*'Design Calculator'!G58","v":8765.1891233528404},{"$f":"VINMAX*'Design Calculator'!H58","v":1400},"W",{"$f":"F34*($F$38-TJDC1)/($F$38-25)","v":4345.8908651939901},{"$f":"G34*($G$38-TJDC2)/($G$38-25)","v":5241.3696458794675},{"$f":"H34*($H$38-TJDC3)/($H$38-25)","v":839.09280000000001}]
[null,null,null,null,"1ms SOA Current Maximum Input Voltage",{"$f":"VINMAX*'Design Calculator'!F59","v":470.74170204081827},{"$f":"VINMAX*'Design Calculator'!G59","v":710.56382211514995},{"$f":"VINMAX*'Design Calculator'!H59","v":140},"W",{"$f":"F35*($F$38-TJDC1)/($F$38-25)","v":242.84416250444866},{"$f":"G35*($G$38-TJDC2)/($G$38-25)","v":424.89986197466357},{"$f":"H35*($H$38-TJDC3)/($H$38-25)","v":83.909279999999995}]
[null,null,null,null,"10ms SOA Current at Maximum Input Voltage",{"$f":"VINMAX*'Design Calculator'!F60","v":167.72122437639393},{"$f":"VINMAX*'Design Calculator'!G60","v":240.11149372023982},{"$f":"VINMAX*'Design Calculator'!H60","v":28},"W",{"$f":"F36*($F$38-TJDC1)/($F$38-25)","v":86.52328886803059},{"$f":"G36*($G$38-TJDC2)/($G$38-25)","v":143.58082604960833},{"$f":"H36*($H$38-TJDC3)/($H$38-25)","v":16.781856000000001}]
[null,null,null,null,"100ms SOA Current at Maximum Input Voltage",{"$f":"VINMAX*'Design Calculator'!F61","v":69.029486132693378},{"$f":"VINMAX*'Design Calculator'!G61","v":78.282464716182645},{"$f":"VINMAX*'Design Calculator'!H61","v":1.4000000000000001},"W",{"$f":"F37*($F$38-TJDC1)/($F$38-25)","v":35.61062823907794},{"$f":"G37*($G$38-TJDC2)/($G$38-25)","v":46.811007565696457},{"$f":"H37*($H$38-TJDC3)/($H$38-25)","v":0.83909280000000008}]
[null,null,null,null,"Maximum Junction Temperature",{"$f":"'Design Calculator'!F56","v":150},{"$f":"'Design Calculator'!G56","v":175},{"$f":"'Design Calculator'!H56","v":175}]
[]
[null,null,null,null,"Minimum Power Limit=",{"$f":"VINMAX*'Device Parameters'!E13/RsEFF/0.001","v":2.592592592592593},"W"]
[null,null,null,null,"Target PLIM",{"$f":"'Design Calculator'!F49","v":75},"W"]
[null,null,null,null,"Rpwr",{"$f":"'Device Parameters'!E14*RsEFF*0.001*F41/1000","v":253.125},"k-ohm"]
[null,null,null,null,"Rpwr actual",{"$f":"RPWR","v":22},"k-ohm"]
[null,null,null,null,"Final Plim",{"$f":"(1/RsEFF)*1000*(Equations!F43*1000/'Device Parameters'!E14)","v":6.5185185185185182},"W"]
[]
[]
[]
[null,null,null,null,"Resulting Typical Power Limit =",{"$f":"F49*(1-0.24)","v":4.9540740740740743},"   24% tolerance used in this calculation."]
[null,null,null,null,"Resulting Minimum Power Limit =",{"$f":"F44","v":6.5185185185185182}]
[null,null,null,null,"Resulting Maximum Power Limit =",{"$f":"F49*(1+0.24)","v":8.0829629629629629}]
[]
[]
["Startup"]
[null,null,null,"With PLIM"]
[null,null,null,null,null,"FET1","FET2","FET3"]
[null,null,null,null,"Typical Start time",{"$f":"Start_up!M2","v":131.25},{"$f":"Start_up!M121","v":131.25},{"$f":"Start_up!M240","v":131.25},"ms"]
[null,null,null,null,"Start-slop",{"$f":"'Device Parameters'!D27","v":0.5},{"$f":"'Device Parameters'!D27","v":0.5},{"$f":"'Device Parameters'!D27","v":0.5}]
[null,null,null,null,"Target Fault Timer",{"$f":"F56*(1+F57)","v":196.875},{"$f":"G56*(1+G57)","v":196.875},196.875,"ms"]
[null,null,null,null,"Target Timer capacitance",{"$f":"'Device Parameters'!D25/'Device Parameters'!D22*F58","v":4183.59375},{"$f":"'Device Parameters'!D25/'Device Parameters'!D22*G58","v":4183.59375},{"$f":"'Device Parameters'!D25/'Device Parameters'!D22*H58","v":4183.59375},"nF"]
[null,null,null,null,"Selected Timer capacitance",{"$f":"'Design Calculator'!F83","v":600},{"$f":"'Design Calculator'!F83","v":600},{"$f":"'Design Calculator'!F83","v":600},"nF"]
[null,null,null,null,"Final Fault Timer",{"$f":"'Device Parameters'!D22/'Device Parameters'!D25*F60","v":28.235294117647058},{"$f":"'Device Parameters'!D22/'Device Parameters'!D25*G60","v":28.235294117647058},{"$f":"'Device Parameters'!D22/'Device Parameters'!D25*H60","v":28.235294117647058},"ms"]
[null,null,null,null,"SOA / PLIM",{"$f":"SOA!C29/F49","v":36.679826618987569},{"$f":"SOA!C77/F49","v":64.12683379253545},{"$f":"SOA!C125/F49","v":12.564117346996996}]
[null,null,null,"With SS"]
[null,null,null,null,null,"FET1","FET2","FET3"]
[null,null,null,null,"dv/dt rate",{"$f":"'Design Calculator'!F89","v":0.12},{"$f":"'Design Calculator'!F89","v":0.12},{"$f":"'Design Calculator'!F89","v":0.12},"V/ms"]
[null,null,null,null,"calculated SS capacitance",{"$f":"'Device Parameters'!D30/ss_rate","v":133.33333333333334},{"$f":"'Device Parameters'!D30/G65","v":133.33333333333334},{"$f":"'Device Parameters'!D30/H65","v":133.33333333333334},"nF"]
[null,null,null,null,"actual SS capacitance",{"$f":"'Design Calculator'!F91","v":150},{"$f":"'Design Calculator'!F91","v":150},{"$f":"'Design Calculator'!F91","v":150},"nF"]
[null,null,null,null,"actual dv/dt rate",{"$f":"ss_rate*F66/F67","v":0.10666666666666667},{"$f":"G65*G66/G67","v":0.10666666666666667},{"$f":"H65*H66/H67","v":0.10666666666666667},"V/ms"]
[null,null,null,null,"I_Cout",{"$f":"COUTMAX*F68/1000","v":0.32},{"$f":"COUTMAX*G68/1000","v":0.32},{"$f":"COUTMAX*H68/1000","v":0.32},"A"]
[null,null,null,null,"typical start time",{"$f":"VINMAX/F68","v":131.25},{"$f":"VINMAX/G68","v":131.25},{"$f":"VINMAX/H68","v":131.25},"ms"]
[null,null,null,null,"FET Energy dissipated at start-up (EFET)",{"$f":"Start_up!N5","v":0.47315625000000017},{"$f":"Start_up!N124","v":0.47315625000000017},{"$f":"Start_up!N243","v":0.47315625000000017},"J"]
[null,null,null,null,"Peak Power dissipated  during start-up (PFET)",{"$f":"Start_up!Q4","v":7.28},{"$f":"Start_up!Q123","v":7.28},{"$f":"Start_up!Q242","v":7.28},"W"]
[null,null,null,null,"Equivalent time at peak power - EFET/PFET (t_power)",{"$f":"F71/F72*1000","v":64.993990384615415},{"$f":"G71/G72*1000","v":64.993990384615415},64.993990384615415,"ms"]
[null,null,null,null,"Available SOA for t_power at Vinmax",{"$f":"SOA!H31","v":42.382381292458717},{"$f":"SOA!H79","v":57.929452225083352},{"$f":"SOA!H127","v":1.4714207069999203},"W"]
[null,null,null,null,"SOA margin",{"$f":"F74/F72","v":5.8217556720410322},{"$f":"G74/G72","v":7.9573423386103501},0.20211822898350554]
[]
[null,null,null,null,null,1,"ms"]
[null,null,null,"Covering hot-short, start-into short for SS"]
[null,null,null,null,"Target Fault Time",{"$f":"'Design Calculator'!F94","v":1},{"$f":"'Design Calculator'!F94","v":1},{"$f":"'Design Calculator'!F94","v":1}]
[null,null,null,null,"Calculated Timer Capacitance ",{"$f":"'Device Parameters'!D25/'Device Parameters'!D22*F79","v":21.25},{"$f":"'Device Parameters'!D25/'Device Parameters'!D22*G79","v":21.25},{"$f":"'Device Parameters'!D25/'Device Parameters'!D22*H79","v":21.25},"nF"]
[null,null,null,null,"Actual Timer Capacitance",{"$f":"'Design Calculator'!F96","v":22},{"$f":"'Design Calculator'!F96","v":22},{"$f":"'Design Calculator'!F96","v":22},"nF"]
[null,null,null,null,"Actual Fault Time (Tfault)",{"$f":"'Device Parameters'!D22/'Device Parameters'!D25*F81","v":1.0352941176470587},{"$f":"'Device Parameters'!D22/'Device Parameters'!D25*G81","v":1.0352941176470587},{"$f":"'Device Parameters'!D22/'Device Parameters'!D25*H81","v":1.0352941176470587},"ms"]
[null,null,null,null,"Available derated SOA for Tfault",{"$f":"SOA!C29","v":239.09812907191895},{"$f":"SOA!C73","v":699.04511163404675},{"$f":"SOA!C121","v":136.64663102023465},"W"]
[null,null,null,null,"SOA margin",{"$f":"F83/F44","v":36.679826618987569},{"$f":"G83/F44","v":107.23987508022309},{"$f":"H83/F44","v":20.962835440604181}]
[]
[]
[]
[]
[]
[]
[]
[]
[]
[]
[]
[]
[]
[]
[]
[]
[null,null,null,null,null,null,"  10% margin added in this calculation"]
[]
[]
[null,null,null,null,null,null,null,null,"UVLO upper is F40",null,null,"R1 is F48"]
[null,null,null,null,null,null,"A"]
[null,null,null,null,null,null,"V/S"]
[null,null,null,null,null,null,"nF"]
[]
[]
[null,null,null,null,"Min Insertion time =",{"$f":"IF('Design Calculator'!F30=\"Soft Start\", Equations!F81, Equations!F60)*'Device Parameters'!C39*1000/'Device Parameters'!E43*0.001","v":10.34},{"$f":"IF('Design Calculator'!F30=\"Soft Start\", Equations!G81, Equations!G60)*'Device Parameters'!C39*1000/'Device Parameters'!E43*0.001","v":10.34},{"$f":"IF('Design Calculator'!F30=\"Soft Start\", Equations!H81, Equations!H60)*'Device Parameters'!C39*1000/'Device Parameters'!E43*0.001","v":10.34},"ms"]
[null,null,null,null,"Typ. Insertion time =",{"$f":"IF('Design Calculator'!F30=\"Soft Start\", Equations!F81, Equations!F60)*0.001*'Device Parameters'!D39*1000/'Device Parameters'!D43","v":16},{"$f":"IF('Design Calculator'!F30=\"Soft Start\", Equations!G81, Equations!G60)*0.001*'Device Parameters'!D39*1000/'Device Parameters'!D43","v":16},{"$f":"IF('Design Calculator'!F30=\"Soft Start\", Equations!H81, Equations!H60)*0.001*'Device Parameters'!D39*1000/'Device Parameters'!D43","v":16},"ms"]
[null,null,null,null,"Max Insertion time =",{"$f":"IF('Design Calculator'!F30=\"Soft Start\", Equations!F81, Equations!F60)*0.001*'Device Parameters'!E39*1000/'Device Parameters'!C43","v":30.506666666666671},{"$f":"IF('Design Calculator'!F30=\"Soft Start\", Equations!G81, Equations!G60)*0.001*'Device Parameters'!E39*1000/'Device Parameters'!C43","v":30.506666666666671},{"$f":"IF('Design Calculator'!F30=\"Soft Start\", Equations!H81, Equations!H60)*0.001*'Device Parameters'!E39*1000/'Device Parameters'!C43","v":30.506666666666671},"ms"]
[null,null,null,null,"Min Restart time = ",{"$f":"IF('Design Calculator'!F30=\"Soft Start\", Equations!F81, Equations!F60)*(J113+K113+L113)","v":192.08511666666664},{"$f":"IF('Design Calculator'!F30=\"Soft Start\", Equations!G81, Equations!G60)*(J113+K113+L113)","v":192.08511666666664},{"$f":"IF('Design Calculator'!F30=\"Soft Start\", Equations!H81, Equations!H60)*(J113+K113+L113)","v":192.08511666666664},"ms",{"$f":"(('Device Parameters'!C39-'Device Parameters'!E40)/'Device Parameters'!E45)*7","v":0.14274166666666666},{"$f":"(('Device Parameters'!C39-'Device Parameters'!C40)/'Device Parameters'!D46)*8","v":8.2335999999999991},{"$f":"(('Device Parameters'!C40-'Device Parameters'!D41)/'Device Parameters'!D46)","v":0.3548}]
[null,null,null,null,"Typ. Restart time =",{"$f":"IF('Design Calculator'!F30=\"Soft Start\", Equations!F81, Equations!F60)*(J114+K114+L114)","v":206.94235294117649},{"$f":"IF('Design Calculator'!F30=\"Soft Start\", Equations!G81, Equations!G60)*(J114+K114+L114)","v":206.94235294117649},{"$f":"IF('Design Calculator'!F30=\"Soft Start\", Equations!H81, Equations!H60)*(J114+K114+L114)","v":206.94235294117649},"ms",{"$f":"(('Device Parameters'!D39-'Device Parameters'!D40)/'Device Parameters'!D45)*7","v":0.22647058823529415},{"$f":"(('Device Parameters'!D39-'Device Parameters'!D40)/'Device Parameters'!D46)*8","v":8.8000000000000007},{"$f":"(('Device Parameters'!D40-'Device Parameters'!D41)/'Device Parameters'!D46)","v":0.38}]
[null,null,null,null,"Max Restart time =",{"$f":"IF('Design Calculator'!F30=\"Soft Start\", Equations!F81, Equations!F60)*(J115+K115+L115)","v":218.32049411764712},{"$f":"IF('Design Calculator'!F30=\"Soft Start\", Equations!G81, Equations!G60)*(J115+K115+L115)","v":218.32049411764712},{"$f":"IF('Design Calculator'!F30=\"Soft Start\", Equations!H81, Equations!H60)*(J115+K115+L115)","v":218.32049411764712},"ms",{"$f":"(('Device Parameters'!E39-'Device Parameters'!C40)/'Device Parameters'!C45)*7","v":0.40805882352941175},{"$f":"(('Device Parameters'!E39-'Device Parameters'!E40)/'Device Parameters'!D46)*8","v":9.1104000000000021},{"$f":"(('Device Parameters'!E40-'Device Parameters'!D41)/'Device Parameters'!D46)","v":0.40519999999999995}]
[null,null,null,null,"Min PG Threshold =",{"$f":"(1+'Design Calculator'!#REF!/'Design Calculator'!#REF!)*'Device Parameters'!C51","v":{"$error":"#REF!"}}]
[null,null,null,null,"Nom PG Threshold =",{"$f":"(1+'Design Calculator'!#REF!/'Design Calculator'!#REF!)*'Device Parameters'!D51","v":{"$error":"#REF!"}}]
[null,null,null,null,"Max PG Threshold =",{"$f":"(1+'Design Calculator'!#REF!/'Design Calculator'!#REF!)*'Device Parameters'!E51","v":{"$error":"#REF!"}}]
[null,null,null,null,"Min PG Hysteresis =",{"$f":"('Design Calculator'!#REF!*'Device Parameters'!C52)","v":{"$error":"#REF!"}}]
[null,null,null,null,"Nom PG Hysteresis =",{"$f":"('Design Calculator'!#REF!*'Device Parameters'!$D$52)","v":{"$error":"#REF!"}}]
[null,null,null,null,"Max PG Hysteresis =",{"$f":"('Design Calculator'!#REF!*'Device Parameters'!$E$52)","v":{"$error":"#REF!"}}]
[]
[]
[null,null,null,null,null,null,null,null,"UVLO lower is F41",null,null,"R2 is F49"]
[null,null,null,null,null,null,null,null,"OVLO upper is F42",null,null,"R3 is F50"]
[null,null,null,null,null,null,null,null,"OVLO lower is F43",null,null,"R4 is F51"]
[]
[]
[null,null,null,null,"Option A"]
[null,null,null,null,"Option B"]
[null,null,null,null,null,"A","B","C","D"]
[null,null,null,null,"R1 = ",{"$f":"('Design Calculator'!F102-'Design Calculator'!F103)*1000/21","v":47.61904761904762},{"$f":"('Design Calculator'!F102-'Design Calculator'!F103)*1000/21","v":47.61904761904762}]
[null,null,null,null,"R2 = ",{"$f":"2.5*F132/('Design Calculator'!F103-2.5)-F134","v":4.5351473922902485},{"$f":"2.5*G132/('Design Calculator'!F103-2.5)","v":15.873015873015873}]
[null,null,null,null,"R3 = ",{"$f":"(F132*'Design Calculator'!F103*2.5)/('Design Calculator'!F104*('Design Calculator'!F103-2.5))","v":11.337868480725625},{"$f":"('Design Calculator'!F104-'Design Calculator'!F105)*1000/21","v":47.61904761904762}]
[null,null,null,null,"R4 = ",null,{"$f":"2.5*G134/('Design Calculator'!F104-2.5)","v":10.351966873706004}]
[null,null,null,null,"Resulting upper UVLO Threshold (min) = ",{"$f":"2.45+('Design Calculator'!F$110*((2.45/('Design Calculator'!F$111+'Design Calculator'!F$112))+(12/1000)))","v":4.8712580645161294},{"$f":"2.45+('Design Calculator'!F$110*((2.45/'Design Calculator'!F$111)+(12/1000)))","v":10.690666666666669}]
[null,null,null,null,"Resulting upper UVLO Threshold (typ) = ",{"$f":"2.5+('Design Calculator'!F$110*((2.5/('Design Calculator'!F$111+'Design Calculator'!F$112))+(21/1000)))","v":5.3821612903225802},{"$f":"2.5+('Design Calculator'!F$110*((2.5/'Design Calculator'!F$111)+(21/1000)))","v":11.320333333333332}]
[null,null,null,null,"Resulting upper UVLO Threshold (max) = ",{"$f":"2.55+('Design Calculator'!F$110*((2.55/('Design Calculator'!F$111+'Design Calculator'!F$112))+(30/1000)))","v":5.8930645161290318},{"$f":"2.55+('Design Calculator'!F$110*((2.55/'Design Calculator'!F$111)+(30/1000)))","v":11.95}]
[null,null,null,null,"Resulting lower UVLO Threshold (min) = ",{"$f":"2.45*('Design Calculator'!F$110+'Design Calculator'!F$111+'Design Calculator'!F$112)/('Design Calculator'!F$111+'Design Calculator'!F$112)","v":4.3072580645161294},{"$f":"2.45*('Design Calculator'!F$110+'Design Calculator'!F$111)/'Design Calculator'!F$111","v":10.126666666666667}]
[null,null,null,null,"Resulting lower UVLO Threshold (typ) = ",{"$f":"2.5*('Design Calculator'!F$110+'Design Calculator'!F$111+'Design Calculator'!F$112)/('Design Calculator'!F$111+'Design Calculator'!F$112)","v":4.395161290322581},{"$f":"2.5*('Design Calculator'!F$110+'Design Calculator'!F$111)/'Design Calculator'!F$111","v":10.333333333333334}]
[null,null,null,null,"Resulting lower UVLO Threshold (max) = ",{"$f":"2.55*('Design Calculator'!F$110+'Design Calculator'!F$111+'Design Calculator'!F$112)/('Design Calculator'!F$111+'Design Calculator'!F$112)","v":4.4830645161290317},{"$f":"2.55*('Design Calculator'!F$110+'Design Calculator'!F$111)/'Design Calculator'!F$111","v":10.54}]
[null,null,null,null,"Resulting upper OVLO Threshold (min) = ",{"$f":"2.45*('Design Calculator'!F$110+'Design Calculator'!F$111+'Design Calculator'!F$112)/'Design Calculator'!F$112","v":5.6819148936170212},{"$f":"2.45*('Design Calculator'!F$112+'Design Calculator'!F$113)/'Design Calculator'!F$113","v":13.965}]
[null,null,null,null,"Resulting upper OVLO Threshold (typ) = ",{"$f":"2.5*('Design Calculator'!F$110+'Design Calculator'!F$111+'Design Calculator'!F$112)/'Design Calculator'!F$112","v":5.7978723404255321},{"$f":"2.5*('Design Calculator'!F$112+'Design Calculator'!F$113)/'Design Calculator'!F$113","v":14.25}]
[null,null,null,null,"Resulting upper OVLO Threshold (max) = ",{"$f":"2.55*('Design Calculator'!F$110+'Design Calculator'!F$111+'Design Calculator'!F$112)/'Design Calculator'!F$112","v":5.9138297872340422},{"$f":"2.55*('Design Calculator'!F$112+'Design Calculator'!F$113)/'Design Calculator'!F$113","v":14.535}]
[null,null,null,null,"Resulting lower OVLO Threshold (min) = ",{"$f":"2.45+(('Design Calculator'!F$110+'Design Calculator'!F$111)*((2.45/'Design Calculator'!F$112)-(30/1000)))","v":3.8219148936170217},{"$f":"2.45+('Design Calculator'!F$112*((2.45/'Design Calculator'!F$113)-(30/1000)))","v":12.555}]
[null,null,null,null,"Resulting lower OVLO Threshold (typ) = ",{"$f":"2.5+(('Design Calculator'!F$110+'Design Calculator'!F$111)*((2.5/'Design Calculator'!F$112)-(21/1000)))","v":4.4958723404255316},{"$f":"2.5+('Design Calculator'!F$112*((2.5/'Design Calculator'!F$113)-(21/1000)))","v":13.263}]
[null,null,null,null,"Resulting lower OVLO Threshold (max) = ",{"$f":"2.55+(('Design Calculator'!F$110+'Design Calculator'!F$111)*((2.55/'Design Calculator'!F$112)-(12/1000)))","v":5.1698297872340424},{"$f":"2.55+('Design Calculator'!F$112*((2.55/'Design Calculator'!F$113)-(12/1000)))","v":13.971}]
[]
[]
[]
[]
[]
[]
[]
[null,null,null,null,"Ramp time for output voltage",{"$f":"'Design Calculator'!#REF!","v":{"$error":"#REF!"}},"ms"]
[null,null,null,null,"Nominal output voltage",{"$f":"'Design Calculator'!F20","v":12},"V"]
[null,null,null,null,"Required soft-start capacitance",{"$f":"22/F156*F155","v":{"$error":"#REF!"}},"nF"]
[]
[]
[]
[]
[]
[]
[]
[]
[]
[]
[]
[]
[]
[]
[]
[]
[]
[]
[]
[]
[null,null,"GRAPH:"]
[null,null,null,null,"Selected Rs =",{"$f":"'Design Calculator'!F35","v":27}]
[null,null,null,null,"Selected RPWR =",{"$f":"'Design Calculator'!F51","v":22}]
[null,null,null,null,"Max System voltage =",{"$f":"'Design Calculator'!F21","v":14}]
[]
[null,null,null,null,"Current Lim (min) =",{"$f":"F24","v":1.7962962962962963}]
[null,null,null,null,"Current Lim (typ) =",{"$f":"F25","v":2.0370370370370372}]
[null,null,null,null,"Current Lim (max) =",{"$f":"F26","v":2.2777777777777777}]
[]
[null,null,null,null,"Power Limit (min) =",{"$f":"F48","v":4.9540740740740743}]
[null,null,null,null,"Power Limit (typ) =",{"$f":"F49","v":6.5185185185185182},null,null,null,null,null,null,null,null,null,null,null,null,null,null,null,null,null,null,"W"]
[null,null,null,null,"Power Limit (max) =",{"$f":"F50","v":8.0829629629629629}]
[]
[]
[]
[]
[null,null,null,"A) This table calculates the Ids current based",null,null,null,null,"B) This table corrrects the table at left so no",null,null,null,null,"C) This table creates the",null,null,null,"D) This table changes ID values to zero for Vds>Vin(max)"]
[null,null,null,"on power limit only - no current limit info.",null,null,null,null,"current is greater than the current limit.",null,null,null,null,"SOA data points from",null,null,null,"and adds the SOA curve. This data is plotted."]
[null,"PLIM",null,"Vds","Min","Typ","Max",null,"Vds","Min","Typ","Max",null,"the customer's SOA",null,null,null,"Vds","Min","Typ","Max","SOA",null,"Temp Derated SOA"]
[null,{"$f":"D197*F197","v":6.0370370370370363},null,1,{"$f":"(1-$F$284)*F197","v":4.5277777777777768},{"$f":"($F$188+(D197-VINMAX)*$E$281/$E$282)/D197","v":6.0370370370370363},{"$f":"F197*(1+$F$284)","v":7.5462962962962958},null,1,{"$f":"IF(E197>$F$183,$F$183,E197)","v":1.7962962962962963},{"$f":"IF(F197>$F$184,$F$184,F197)","v":2.0370370370370372},{"$f":"IF(G197>$F$185,$F$185,G197)","v":2.2777777777777777},null,"data he entered.",null,null,null,1,{"$f":"IF($R197>$F$181,0.0000000005,J197)","v":1.7962962962962963},{"$f":"IF($R197>$F$181,0.0000000005,K197)","v":2.0370370370370372},{"$f":"IF($R197>$F$181,0.0000000005,L197)","v":2.2777777777777777},{"$f":"$X$197/R197","v":239.09812907191895},null,{"$f":"SOA!C29","v":239.09812907191895}]
[null,{"$f":"D198*F198","v":6.0740740740740735},null,2,2.2777777777777777,3.0370370370370368,3.7962962962962958,null,2,1.7962962962962963,2.0370370370370372,2.2777777777777777,null,null,null,null,null,2,{"$f":"IF($R198>$F$181,0.0000000005,J198)","v":1.7962962962962963},{"$f":"IF($R198>$F$181,0.0000000005,K198)","v":2.0370370370370372},2.2777777777777777,119.54906453595947]
[null,6.1111111111111107,null,3,1.5277777777777777,2.0370370370370368,2.5462962962962958,null,3,1.5277777777777777,2.0370370370370368,2.2777777777777777,null,null,"User's",null,null,3,1.5277777777777777,2.0370370370370368,2.2777777777777777,79.699376357306321]
[null,6.1481481481481479,null,4,1.1527777777777777,1.537037037037037,1.9212962962962963,null,4,1.1527777777777777,1.537037037037037,1.9212962962962963,null,"Vds","Ids",null,null,4,1.1527777777777777,1.537037037037037,1.9212962962962963,59.774532267979737]
[null,6.1851851851851851,null,5,0.9277777777777777,1.2370370370370369,1.5462962962962963,null,5,0.9277777777777777,1.2370370370370369,1.5462962962962963,null,1,{"$f":"#REF!","v":{"$error":"#REF!"}},"x = customer's entry",null,5,0.9277777777777777,1.2370370370370369,1.5462962962962963,47.819625814383791]
[null,6.2222222222222214,null,6,0.77777777777777768,1.037037037037037,1.2962962962962963,null,6,0.77777777777777768,1.037037037037037,1.2962962962962963,null,2,{"$f":"O205+((O201-O205)*3/7)","v":{"$error":"#REF!"}},null,null,6,0.77777777777777768,1.037037037037037,1.2962962962962963,39.84968817865316]
[null,6.2592592592592586,null,7,0.67063492063492058,0.89417989417989407,1.1177248677248677,null,7,0.67063492063492058,0.89417989417989407,1.1177248677248677,null,3,{"$f":"O205+((O201-O205)*2/8)","v":{"$error":"#REF!"}},null,null,7,0.67063492063492058,0.89417989417989407,1.1177248677248677,34.156875581702707]
[null,6.2962962962962958,null,8,0.59027777777777768,0.78703703703703698,0.98379629629629628,null,8,0.59027777777777768,0.78703703703703698,0.98379629629629628,null,4,{"$f":"O205+((O201-O205)*1/9)","v":{"$error":"#REF!"}},null,null,8,0.59027777777777768,0.78703703703703698,0.98379629629629628,29.887266133989868]
[null,6.3333333333333339,null,9,0.52777777777777779,0.70370370370370372,0.87962962962962965,null,9,0.52777777777777779,0.70370370370370372,0.87962962962962965,null,5,{"$f":"#REF!","v":{"$error":"#REF!"}},"x",null,9,0.52777777777777779,0.70370370370370372,0.87962962962962965,26.566458785768774]
[null,6.3703703703703702,null,10,0.4777777777777778,0.63703703703703707,0.79629629629629628,null,10,0.4777777777777778,0.63703703703703707,0.79629629629629628,null,6,{"$f":"O$210+((O$205-O$210)*4/6)","v":{"$error":"#REF!"}},null,null,10,0.4777777777777778,0.63703703703703707,0.79629629629629628,23.909812907191895]
[null,6.4074074074074074,null,11,0.43686868686868685,0.5824915824915825,0.72811447811447816,null,11,0.43686868686868685,0.5824915824915825,0.72811447811447816,null,7,{"$f":"O$210+((O$205-O$210)*3/7)","v":{"$error":"#REF!"}},null,null,11,0.43686868686868685,0.5824915824915825,0.72811447811447816,21.736193551992631]
[null,6.4444444444444438,null,12,0.40277777777777773,0.53703703703703698,0.67129629629629628,null,12,0.40277777777777773,0.53703703703703698,0.67129629629629628,null,8,{"$f":"O$210+((O$205-O$210)*2/8)","v":{"$error":"#REF!"}},null,null,12,0.40277777777777773,0.53703703703703698,0.67129629629629628,19.92484408932658]
[null,6.481481481481481,null,13,0.37393162393162394,0.49857549857549854,0.62321937321937315,null,13,0.37393162393162394,0.49857549857549854,0.62321937321937315,null,9,{"$f":"O$210+((O$205-O$210)*1/9)","v":{"$error":"#REF!"}},null,null,13,0.37393162393162394,0.49857549857549854,0.62321937321937315,18.392163774762995]
[null,6.5185185185185182,null,14,0.34920634920634919,0.46560846560846558,0.58201058201058198,null,14,0.34920634920634919,0.46560846560846558,0.58201058201058198,null,10,{"$f":"#REF!","v":{"$error":"#REF!"}},"x",null,14,0.34920634920634919,0.46560846560846558,0.58201058201058198,17.078437790851353]
[null,6.5555555555555554,null,15,0.32777777777777772,0.437037037037037,0.54629629629629628,null,15,0.32777777777777772,0.437037037037037,0.54629629629629628,null,11,{"$f":"O$215+((O$210-O$215)*4/6)","v":{"$error":"#REF!"}},null,null,15,5.0000000000000003E-10,5.0000000000000003E-10,5.0000000000000003E-10,15.939875271461263]
[null,6.5925925925925926,null,16,0.30902777777777779,0.41203703703703703,0.51504629629629628,null,16,0.30902777777777779,0.41203703703703703,0.51504629629629628,null,12,{"$f":"O$215+((O$210-O$215)*3/7)","v":{"$error":"#REF!"}},null,null,16,5.0000000000000003E-10,5.0000000000000003E-10,5.0000000000000003E-10,14.943633066994934]
[null,6.6296296296296289,null,17,0.29248366013071891,0.38997821350762524,0.48747276688453156,null,17,0.29248366013071891,0.38997821350762524,0.48747276688453156,null,13,{"$f":"O$215+((O$210-O$215)*2/8)","v":{"$error":"#REF!"}},null,null,17,5.0000000000000003E-10,5.0000000000000003E-10,5.0000000000000003E-10,14.064595827759938]
[null,6.6666666666666661,null,18,{"$f":"(1-$F$284)*F214","v":0.27777777777777779},0.37037037037037035,{"$f":"F214*(1+$F$284)","v":0.46296296296296291},null,18,{"$f":"IF(E214>$F$183,$F$183,E214)","v":0.27777777777777779},{"$f":"IF(F214>$F$184,$F$184,F214)","v":0.37037037037037035},{"$f":"IF(G214>$F$185,$F$185,G214)","v":0.46296296296296291},null,14,{"$f":"O$215+((O$210-O$215)*1/9)","v":{"$error":"#REF!"}},null,null,18,{"$f":"IF($R214>$F$181,0.0000000005,J214)","v":5.0000000000000003E-10},{"$f":"IF($R214>$F$181,0.0000000005,K214)","v":5.0000000000000003E-10},{"$f":"IF($R214>$F$181,0.0000000005,L214)","v":5.0000000000000003E-10},{"$f":"$X$197/R214","v":13.283229392884387}]
[null,6.7037037037037033,null,19,0.26461988304093564,0.35282651072124754,0.44103313840155944,null,19,0.26461988304093564,0.35282651072124754,0.44103313840155944,null,15,{"$f":"#REF!","v":{"$error":"#REF!"}},"x",null,19,5.0000000000000003E-10,5.0000000000000003E-10,5.0000000000000003E-10,12.584112056416787]
[null,6.7407407407407405,null,20,0.25277777777777777,0.33703703703703702,0.42129629629629628,null,20,0.25277777777777777,0.33703703703703702,0.42129629629629628,null,16,{"$f":"O$220+((O$215-O$220)*4/6)","v":{"$error":"#REF!"}},null,null,20,5.0000000000000003E-10,5.0000000000000003E-10,5.0000000000000003E-10,11.954906453595948]
[null,6.7777777777777777,null,21,0.24206349206349204,0.32275132275132273,0.40343915343915343,null,21,0.24206349206349204,0.32275132275132273,0.40343915343915343,null,17,{"$f":"O$220+((O$215-O$220)*3/7)","v":{"$error":"#REF!"}},null,null,21,{"$f":"IF($R217>$F$181,0.0000000005,J217)","v":5.0000000000000003E-10},{"$f":"IF($R217>$F$181,0.0000000005,K217)","v":5.0000000000000003E-10},{"$f":"IF($R217>$F$181,0.0000000005,L217)","v":5.0000000000000003E-10},{"$f":"$X$197/R217","v":11.385625193900902}]
[null,6.814814814814814,null,22,0.23232323232323232,0.30976430976430974,0.38720538720538716,null,22,0.23232323232323232,0.30976430976430974,0.38720538720538716,null,18,{"$f":"O$220+((O$215-O$220)*2/8)","v":{"$error":"#REF!"}},null,null,22,5.0000000000000003E-10,5.0000000000000003E-10,5.0000000000000003E-10,10.868096775996316]
[null,6.8518518518518512,null,23,0.22342995169082125,0.29790660225442833,0.37238325281803542,null,23,0.22342995169082125,0.29790660225442833,0.37238325281803542,null,19,{"$f":"O$220+((O$215-O$220)*1/9)","v":{"$error":"#REF!"}},null,null,23,5.0000000000000003E-10,5.0000000000000003E-10,5.0000000000000003E-10,10.395570829213867]
[null,6.8888888888888893,null,24,0.21527777777777779,0.28703703703703703,0.35879629629629628,null,24,0.21527777777777779,0.28703703703703703,0.35879629629629628,null,20,{"$f":"#REF!","v":{"$error":"#REF!"}},"x",null,24,5.0000000000000003E-10,5.0000000000000003E-10,5.0000000000000003E-10,9.9624220446632901]
[null,6.9259259259259256,null,25,0.20777777777777778,0.27703703703703703,0.34629629629629627,null,25,0.20777777777777778,0.27703703703703703,0.34629629629629627,null,null,null,null,null,25,5.0000000000000003E-10,5.0000000000000003E-10,5.0000000000000003E-10,9.5639251628767585]
[null,6.9629629629629637,null,26,0.20085470085470086,0.26780626780626782,0.33475783475783477,null,26,0.20085470085470086,0.26780626780626782,0.33475783475783477,null,null,null,null,null,26,5.0000000000000003E-10,5.0000000000000003E-10,5.0000000000000003E-10,9.1960818873814976]
[null,7,null,27,0.19444444444444442,0.25925925925925924,0.32407407407407407,null,27,0.19444444444444442,0.25925925925925924,0.32407407407407407,null,null,null,null,null,27,5.0000000000000003E-10,5.0000000000000003E-10,5.0000000000000003E-10,8.8554862619229233]
[null,7.0370370370370363,null,28,0.18849206349206346,0.25132275132275128,0.31415343915343907,null,28,0.18849206349206346,0.25132275132275128,0.31415343915343907,null,null,null,null,null,28,5.0000000000000003E-10,5.0000000000000003E-10,5.0000000000000003E-10,8.5392188954256767]
[null,7.0740740740740735,null,29,0.18295019157088122,0.24393358876117494,0.30491698595146866,null,29,0.18295019157088122,0.24393358876117494,0.30491698595146866,null,null,null,null,null,29,5.0000000000000003E-10,5.0000000000000003E-10,5.0000000000000003E-10,8.2447630714454814]
[null,7.1111111111111107,null,30,0.17777777777777776,0.23703703703703702,0.29629629629629628,null,30,0.17777777777777776,0.23703703703703702,0.29629629629629628,null,null,null,null,null,30,5.0000000000000003E-10,5.0000000000000003E-10,5.0000000000000003E-10,7.9699376357306315]
[null,7.1481481481481479,null,31,0.17293906810035842,0.23058542413381122,0.28823178016726403,null,31,0.17293906810035842,0.23058542413381122,0.28823178016726403,null,null,null,null,null,31,5.0000000000000003E-10,5.0000000000000003E-10,5.0000000000000003E-10,7.7128428732877081]
[null,7.1851851851851851,null,32,0.16840277777777779,0.22453703703703703,0.28067129629629628,null,32,0.16840277777777779,0.22453703703703703,0.28067129629629628,null,null,null,null,null,32,5.0000000000000003E-10,5.0000000000000003E-10,5.0000000000000003E-10,7.4718165334974671]
[null,7.2222222222222214,null,33,0.16414141414141412,{"$f":"($F$188+(D229-VINMAX)*$E$281/$E$282)/D229","v":0.21885521885521883},0.27356902356902352,null,33,0.16414141414141412,0.21885521885521883,0.27356902356902352,null,null,null,null,null,33,5.0000000000000003E-10,5.0000000000000003E-10,5.0000000000000003E-10,7.2453978506642107]
[null,7.2592592592592586,null,34,0.16013071895424835,0.21350762527233114,0.26688453159041392,null,34,0.16013071895424835,0.21350762527233114,0.26688453159041392,null,null,null,null,null,34,5.0000000000000003E-10,5.0000000000000003E-10,5.0000000000000003E-10,7.0322979138799688]
[null,7.2962962962962958,null,35,0.15634920634920635,0.20846560846560847,0.26058201058201058,null,35,0.15634920634920635,0.20846560846560847,0.26058201058201058,null,null,null,null,null,35,5.0000000000000003E-10,5.0000000000000003E-10,5.0000000000000003E-10,6.8313751163405412]
[null,7.333333333333333,null,36,0.15277777777777776,0.20370370370370369,0.25462962962962959,null,36,0.15277777777777776,0.20370370370370369,0.25462962962962959,null,null,null,null,null,36,5.0000000000000003E-10,5.0000000000000003E-10,5.0000000000000003E-10,6.6416146964421934]
[null,7.3703703703703702,null,37,0.14939939939939939,0.19919919919919921,0.24899899899899902,null,37,0.14939939939939939,0.19919919919919921,0.24899899899899902,null,null,null,null,null,37,{"$f":"IF($R233>$F$181,0.0000000005,J233)","v":5.0000000000000003E-10},{"$f":"IF($R233>$F$181,0.0000000005,K233)","v":5.0000000000000003E-10},{"$f":"IF($R233>$F$181,0.0000000005,L233)","v":5.0000000000000003E-10},{"$f":"$X$197/R233","v":6.4621115965383495}]
[null,7.4074074074074066,null,38,0.14619883040935672,0.19493177387914229,0.24366471734892786,null,38,0.14619883040935672,0.19493177387914229,0.24366471734892786,null,null,null,null,null,38,5.0000000000000003E-10,5.0000000000000003E-10,5.0000000000000003E-10,6.2920560282083935]
[null,7.4444444444444446,null,39,0.14316239316239315,0.19088319088319089,0.23860398860398863,null,39,0.14316239316239315,0.19088319088319089,0.23860398860398863,null,null,null,null,null,39,5.0000000000000003E-10,5.0000000000000003E-10,5.0000000000000003E-10,6.130721258254332]
[null,7.481481481481481,null,40,0.14027777777777778,0.18703703703703703,0.23379629629629628,null,40,0.14027777777777778,0.18703703703703703,0.23379629629629628,null,null,null,null,null,40,5.0000000000000003E-10,5.0000000000000003E-10,5.0000000000000003E-10,5.9774532267979739]
[null,7.5185185185185182,null,41,0.13753387533875339,0.18337850045167117,0.22922312556458896,null,41,0.13753387533875339,0.18337850045167117,0.22922312556458896,null,null,null,null,null,41,5.0000000000000003E-10,5.0000000000000003E-10,5.0000000000000003E-10,5.8316616846809497]
[null,7.5555555555555554,null,42,0.13492063492063491,0.17989417989417988,0.22486772486772486,null,42,0.13492063492063491,0.17989417989417988,0.22486772486772486,null,null,null,null,null,42,{"$f":"IF($R238>$F$181,0.0000000005,J238)","v":5.0000000000000003E-10},{"$f":"IF($R238>$F$181,0.0000000005,K238)","v":5.0000000000000003E-10},{"$f":"IF($R238>$F$181,0.0000000005,L238)","v":5.0000000000000003E-10},5.6928125969504508]
[null,7.5925925925925926,null,43,0.13242894056847546,0.17657192075796727,0.22071490094745908,null,43,0.13242894056847546,0.17657192075796727,0.22071490094745908,null,null,null,null,null,43,5.0000000000000003E-10,5.0000000000000003E-10,5.0000000000000003E-10,5.5604216063236969]
[null,7.6296296296296306,null,44,0.13005050505050506,0.17340067340067342,0.21675084175084178,null,44,0.13005050505050506,0.17340067340067342,0.21675084175084178,null,null,null,null,null,44,5.0000000000000003E-10,5.0000000000000003E-10,5.0000000000000003E-10,5.4340483879981578]
[null,7.6666666666666661,null,45,0.12777777777777777,0.17037037037037037,0.21296296296296297,null,45,0.12777777777777777,0.17037037037037037,0.21296296296296297,null,null,null,null,null,45,5.0000000000000003E-10,5.0000000000000003E-10,5.0000000000000003E-10,5.3132917571537543]
[null,7.7037037037037033,null,46,0.12560386473429952,0.16747181964573268,0.20933977455716585,null,46,0.12560386473429952,0.16747181964573268,0.20933977455716585,null,null,null,null,null,46,5.0000000000000003E-10,5.0000000000000003E-10,5.0000000000000003E-10,5.1977854146069333]
[null,7.7407407407407405,null,47,0.12352245862884159,0.16469661150512213,0.20587076438140267,null,47,0.12352245862884159,0.16469661150512213,0.20587076438140267,null,null,null,null,null,47,5.0000000000000003E-10,5.0000000000000003E-10,5.0000000000000003E-10,5.0871942355727438]
[null,7.7777777777777777,null,48,0.12152777777777778,0.16203703703703703,0.20254629629629628,null,48,0.12152777777777778,0.16203703703703703,0.20254629629629628,null,null,null,null,null,48,5.0000000000000003E-10,5.0000000000000003E-10,5.0000000000000003E-10,4.981211022331645]
[null,7.8148148148148149,null,49,0.11961451247165533,0.15948601662887377,0.1993575207860922,null,49,0.11961451247165533,0.15948601662887377,0.1993575207860922,null,null,null,null,null,49,5.0000000000000003E-10,5.0000000000000003E-10,5.0000000000000003E-10,4.8795536545289577]
[null,7.8518518518518512,null,50,0.11777777777777777,0.15703703703703703,0.1962962962962963,null,50,0.11777777777777777,0.15703703703703703,0.1962962962962963,null,null,null,null,null,50,5.0000000000000003E-10,5.0000000000000003E-10,5.0000000000000003E-10,4.7819625814383793]
[null,7.8888888888888884,null,51,0.11601307189542484,0.15468409586056645,0.19335511982570805,null,51,0.11601307189542484,0.15468409586056645,0.19335511982570805,null,null,null,null,null,51,5.0000000000000003E-10,5.0000000000000003E-10,5.0000000000000003E-10,4.6881986092533126]
[null,7.9259259259259265,null,52,0.11431623931623933,0.15242165242165243,0.19052706552706553,null,52,0.11431623931623933,0.15242165242165243,0.19052706552706553,null,null,null,null,null,52,5.0000000000000003E-10,5.0000000000000003E-10,5.0000000000000003E-10,4.5980409436907488]
[null,7.9629629629629628,null,53,0.11268343815513626,0.15024458420684836,0.18780573025856045,null,53,0.11268343815513626,0.15024458420684836,0.18780573025856045,null,null,null,null,null,53,5.0000000000000003E-10,5.0000000000000003E-10,5.0000000000000003E-10,4.5112854541871501]
[null,8,null,54,0.1111111111111111,0.14814814814814814,0.18518518518518517,null,54,0.1111111111111111,0.14814814814814814,0.18518518518518517,null,null,null,null,null,54,5.0000000000000003E-10,5.0000000000000003E-10,5.0000000000000003E-10,4.4277431309614617]
[null,8.0370370370370363,null,55,0.10959595959595958,0.14612794612794611,0.18265993265993263,null,55,0.10959595959595958,0.14612794612794611,0.18265993265993263,null,null,null,null,null,55,5.0000000000000003E-10,5.0000000000000003E-10,5.0000000000000003E-10,4.3472387103985266]
[null,8.0740740740740744,null,56,0.10813492063492064,0.14417989417989419,0.18022486772486773,null,56,0.10813492063492064,0.14417989417989419,0.18022486772486773,null,null,null,null,null,56,5.0000000000000003E-10,5.0000000000000003E-10,5.0000000000000003E-10,4.2696094477128383]
[null,8.1111111111111107,null,57,0.1067251461988304,0.14230019493177387,0.17787524366471735,null,57,0.1067251461988304,0.14230019493177387,0.17787524366471735,null,null,null,null,null,57,5.0000000000000003E-10,5.0000000000000003E-10,5.0000000000000003E-10,4.194704018805596]
[null,8.148148148148147,null,58,0.10536398467432949,0.14048531289910599,0.17560664112388247,null,58,0.10536398467432949,0.14048531289910599,0.17560664112388247,null,null,null,null,null,58,{"$f":"IF($R254>$F$181,0.0000000005,J254)","v":5.0000000000000003E-10},{"$f":"IF($R254>$F$181,0.0000000005,K254)","v":5.0000000000000003E-10},{"$f":"IF($R254>$F$181,0.0000000005,L254)","v":5.0000000000000003E-10},{"$f":"$X$197/R254","v":4.1223815357227407}]
[null,8.1851851851851851,null,59,0.10404896421845575,0.13873195229127433,0.17341494036409291,null,59,0.10404896421845575,0.13873195229127433,0.17341494036409291,null,null,null,null,null,59,5.0000000000000003E-10,5.0000000000000003E-10,5.0000000000000003E-10,4.0525106622359139]
[null,8.2222222222222214,null,60,0.10277777777777776,0.13703703703703701,0.17129629629629628,null,60,0.10277777777777776,0.13703703703703701,0.17129629629629628,null,null,null,null,null,60,5.0000000000000003E-10,5.0000000000000003E-10,5.0000000000000003E-10,3.9849688178653158]
[null,8.2592592592592595,null,61,0.10154826958105646,0.13539769277474195,0.16924711596842745,null,61,0.10154826958105646,0.13539769277474195,0.16924711596842745,null,null,null,null,null,61,5.0000000000000003E-10,5.0000000000000003E-10,5.0000000000000003E-10,3.9196414601953924]
[null,8.2962962962962958,null,62,0.1003584229390681,0.13381123058542413,0.16726403823178015,null,62,0.1003584229390681,0.13381123058542413,0.16726403823178015,null,null,null,null,null,62,5.0000000000000003E-10,5.0000000000000003E-10,5.0000000000000003E-10,3.8564214366438541]
[null,8.3333333333333321,null,63,9.9206349206349201E-2,0.13227513227513227,0.16534391534391535,null,63,9.9206349206349201E-2,0.13227513227513227,0.16534391534391535,null,null,null,null,null,63,5.0000000000000003E-10,5.0000000000000003E-10,5.0000000000000003E-10,3.7952083979669675]
[null,8.3703703703703702,null,64,9.8090277777777776E-2,0.13078703703703703,0.16348379629629628,null,64,9.8090277777777776E-2,0.13078703703703703,0.16348379629629628,null,null,null,null,null,64,5.0000000000000003E-10,5.0000000000000003E-10,5.0000000000000003E-10,3.7359082667487336]
[null,8.4074074074074066,null,65,9.7008547008546997E-2,{"$f":"($F$188+(D261-VINMAX)*$E$281/$E$282)/D261","v":0.12934472934472932},0.16168091168091164,null,65,9.7008547008546997E-2,0.12934472934472932,0.16168091168091164,null,null,null,null,null,65,5.0000000000000003E-10,5.0000000000000003E-10,5.0000000000000003E-10,3.678432754952599]
[null,{"$f":"D262*F262","v":8.4444444444444446},null,66,9.5959595959595967E-2,0.12794612794612795,0.15993265993265993,null,66,9.5959595959595967E-2,0.12794612794612795,0.15993265993265993,null,null,null,null,null,66,5.0000000000000003E-10,5.0000000000000003E-10,5.0000000000000003E-10,3.6226989253321054]
[null,8.481481481481481,null,67,9.4941956882255374E-2,0.12658927584300717,0.15823659480375896,null,67,9.4941956882255374E-2,0.12658927584300717,0.15823659480375896,null,null,null,null,null,67,5.0000000000000003E-10,5.0000000000000003E-10,5.0000000000000003E-10,3.5686287921181932]
[null,8.518518518518519,null,68,9.3954248366013085E-2,0.12527233115468411,0.15659041394335516,null,68,9.3954248366013085E-2,0.12527233115468411,0.15659041394335516,null,null,null,null,null,68,5.0000000000000003E-10,5.0000000000000003E-10,5.0000000000000003E-10,3.5161489569399844]
[null,8.5555555555555554,null,69,9.2995169082125601E-2,0.12399355877616747,0.15499194847020933,null,69,9.2995169082125601E-2,0.12399355877616747,0.15499194847020933,null,null,null,null,null,69,5.0000000000000003E-10,5.0000000000000003E-10,5.0000000000000003E-10,3.4651902764046225]
[null,8.5925925925925917,null,70,9.2063492063492056E-2,0.12275132275132274,0.15343915343915343,null,70,9.2063492063492056E-2,0.12275132275132274,0.15343915343915343,null,null,null,null,null,70,5.0000000000000003E-10,5.0000000000000003E-10,5.0000000000000003E-10,3.4156875581702706]
[null,8.6296296296296298,null,71,9.115805946791862E-2,0.12154407929055816,0.15193009911319771,null,71,9.115805946791862E-2,0.12154407929055816,0.15193009911319771,null,null,null,null,null,71,5.0000000000000003E-10,5.0000000000000003E-10,5.0000000000000003E-10,3.3675792827030837]
[null,8.6666666666666661,null,72,9.0277777777777776E-2,0.12037037037037036,0.15046296296296297,null,72,9.0277777777777776E-2,0.12037037037037036,0.15046296296296297,null,null,null,null,null,72,5.0000000000000003E-10,5.0000000000000003E-10,5.0000000000000003E-10,3.3208073482210967]
[null,8.7037037037037042,null,73,8.9421613394216143E-2,0.11922881785895485,0.14903602232369356,null,73,8.9421613394216143E-2,0.11922881785895485,0.14903602232369356,null,null,null,null,null,73,5.0000000000000003E-10,5.0000000000000003E-10,5.0000000000000003E-10,3.2753168366016294]
[null,8.7407407407407405,null,74,8.858858858858859E-2,0.11811811811811812,0.14764764764764765,null,74,8.858858858858859E-2,0.11811811811811812,0.14764764764764765,null,null,null,null,null,74,5.0000000000000003E-10,5.0000000000000003E-10,5.0000000000000003E-10,3.2310557982691748]
[null,8.7777777777777768,null,75,8.777777777777776E-2,0.11703703703703702,0.14629629629629629,null,75,8.777777777777776E-2,0.11703703703703702,0.14629629629629629,null,null,null,null,null,75,5.0000000000000003E-10,5.0000000000000003E-10,5.0000000000000003E-10,3.1879750542922527]
[null,8.8148148148148149,null,76,8.6988304093567254E-2,0.11598440545808968,0.1449805068226121,null,76,8.6988304093567254E-2,0.11598440545808968,0.1449805068226121,null,null,null,null,null,76,5.0000000000000003E-10,5.0000000000000003E-10,5.0000000000000003E-10,3.1460280141041967]
[null,8.8518518518518512,null,77,8.6219336219336223E-2,0.11495911495911496,0.14369889369889369,null,77,8.6219336219336223E-2,0.11495911495911496,0.14369889369889369,null,null,null,null,null,77,5.0000000000000003E-10,5.0000000000000003E-10,5.0000000000000003E-10,3.1051705074275189]
[null,8.8888888888888893,null,78,8.5470085470085472E-2,0.11396011396011396,0.14245014245014245,null,78,8.5470085470085472E-2,0.11396011396011396,0.14245014245014245,null,null,null,null,null,78,5.0000000000000003E-10,5.0000000000000003E-10,5.0000000000000003E-10,3.065360629127166]
[null,8.9259259259259256,null,79,8.4739803094233471E-2,0.11298640412564463,0.14123300515705578,null,79,8.4739803094233471E-2,0.11298640412564463,0.14123300515705578,null,null,null,null,null,79,5.0000000000000003E-10,5.0000000000000003E-10,5.0000000000000003E-10,3.0265585958470753]
[null,8.9629629629629619,null,80,8.4027777777777757E-2,0.11203703703703702,0.14004629629629628,null,80,8.4027777777777757E-2,0.11203703703703702,0.14004629629629628,null,null,null,null,null,80,5.0000000000000003E-10,5.0000000000000003E-10,5.0000000000000003E-10,2.9887266133989869]
[]
[]
[null,null,null,"Note: I added an adjustment for the systematic offset"]
[]
[null,null,null,"Vos syst",{"$f":"'Device Parameters'!E12","v":1E-3}]
[null,null,null,"Rs (ohm)",{"$f":"RsEFF*0.001","v":2.7E-2}]
[null,null,null,"Vin, max",{"$f":"VINMAX","v":14}]
[null,null,null,"Plim tolerance",null,0.25]
[]
[null,null,null,"Plim (Vds) = Plim (Vin,max) + (Vds - Vin,max)*Vos,syst/Rs"]

{"sheet":"MOSFET Database 24V","index":4,"n_rows":84,"n_cols":76,"rows_kept":84,"cut":false,"hidden":true,"merged":[]}
[]
[]
[]
[null,{"$f":"'Design Calculator'!H54","v":"NON-TI MOSFET"},1,null,null,"CSD18536KTT",2,null,null,"CSD18535KTT",3,null,null,"CSD18540Q5B",4,null,null,"CSD19506KTT",5,null,null,"CSD19505KTT",6,null,null,"CSD18532Q5B",7,null,null,"CSD18532NQ5B",8,null,null,"CSD18542KTT",9,null,null,"CSD19502Q5B",10,null,null,"CSD18532KCS",11,null,null,"CSD18531Q5A",12,null,null,"CSD18533Q5A",13,null,null,"CSD19501KCS",14,null,null,"CSD18563Q5A",15,null,null,"CSD19503KCS",16,null,null,"CSD18534Q5A",17,null,null,"CSD18543Q3A",18,null,null,"CSD18537NQ5A",19]
[null,"Webpage","Enter webpage link",null,null,"Webpage","https://www.ti.com/product/CSD18536KTT",null,null,"Webpage","https://www.ti.com/product/CSD18535KTT",null,null,"Webpage","https://www.ti.com/product/CSD18540Q5B",null,null,"Webpage","https://www.ti.com/product/CSD19506KTT",null,null,"Webpage","https://www.ti.com/product/CSD19505KTT",null,null,"Webpage","https://www.ti.com/product/CSD18532Q5B",null,null,"Webpage","https://www.ti.com/product/CSD18532NQ5B",null,null,"Webpage","https://www.ti.com/product/CSD18542KTT",null,null,"Webpage","https://www.ti.com/product/CSD19502Q5B",null,null,"Webpage","https://www.ti.com/product/CSD18532KCS",null,null,"Webpage","https://www.ti.com/product/CSD18531Q5A",null,null,"Webpage","https://www.ti.com/product/CSD18533Q5A",null,null,"Webpage","https://www.ti.com/product/CSD19501KCS",null,null,"Webpage","https://www.ti.com/product/CSD18563Q5A",null,null,"Webpage","https://www.ti.com/product/CSD19503KCS",null,null,"Webpage","https://www.ti.com/product/CSD18534Q5A",null,null,"Webpage","https://www.ti.com/product/CSD18543Q3A",null,null,"Webpage","https://www.ti.com/product/CSD18537NQ5A"]
[null,"Maximum Junction Temperature",{"$f":"'Design Calculator'!H56","v":175},"°C",null,"Maximum Junction Temperature",175,"°C",null,"Maximum Junction Temperature",175,"°C",null,"Maximum Junction Temperature",175,"°C",null,"Maximum Junction Temperature",175,"°C",null,"Maximum Junction Temperature",175,"°C",null,"Maximum Junction Temperature",150,"°C",null,"Maximum Junction Temperature",150,"°C",null,"Maximum Junction Temperature",175,"°C",null,"Maximum Junction Temperature",150,"°C",null,"Maximum Junction Temperature",175,"°C",null,"Maximum Junction Temperature",150,"°C",null,"Maximum Junction Temperature",150,"°C",null,"Maximum Junction Temperature",175,"°C",null,"Maximum Junction Temperature",150,"°C",null,"Maximum Junction Temperature",175,"°C",null,"Maximum Junction Temperature",150,"°C",null,"Maximum Junction Temperature",150,"°C",null,"Maximum Junction Temperature",150,"°C"]
[null,"Maximum Rds(on)",{"$f":"'Design Calculator'!H55","v":1},"mΩ",null,"Maximum Rds(on)",1.6,"mΩ",null,"Maximum Rds(on)",2,"mΩ",null,"Maximum Rds(on)",2.2000000000000002,"mΩ",null,"Maximum Rds(on)",2.2999999999999998,"mΩ",null,"Maximum Rds(on)",3.1,"mΩ",null,"Maximum Rds(on)",3.2,"mΩ",null,"Maximum Rds(on)",3.4,"mΩ",null,"Maximum Rds(on)",4,"mΩ",null,"Maximum Rds(on)",4.0999999999999996,"mΩ",null,"Maximum Rds(on)",4.2,"mΩ",null,"Maximum Rds(on)",4.5999999999999996,"mΩ",null,"Maximum Rds(on)",5.9,"mΩ",null,"Maximum Rds(on)",6.6,"mΩ",null,"Maximum Rds(on)",6.8,"mΩ",null,"Maximum Rds(on)",9.1999999999999993,"mΩ",null,"Maximum Rds(on)",9.8000000000000007,"mΩ",null,"Maximum Rds(on)",9.9,"mΩ",null,"Maximum Rds(on)",13,"mΩ"]
[]
[null,"Rds(on) vs Temperature",null,null,null,"Rds(on) vs Temperature",null,null,null,"Rds(on) vs Temperature",null,null,null,"Rds(on) vs Temperature",null,null,null,"Rds(on) vs Temperature",null,null,null,"Rds(on) vs Temperature",null,null,null,"Rds(on) vs Temperature",null,null,null,"Rds(on) vs Temperature",null,null,null,"Rds(on) vs Temperature",null,null,null,"Rds(on) vs Temperature",null,null,null,"Rds(on) vs Temperature",null,null,null,"Rds(on) vs Temperature",null,null,null,"Rds(on) vs Temperature",null,null,null,"Rds(on) vs Temperature",null,null,null,"Rds(on) vs Temperature",null,null,null,"Rds(on) vs Temperature",null,null,null,"Rds(on) vs Temperature",null,null,null,"Rds(on) vs Temperature",null,null,null,"Rds(on) vs Temperature"]
[]
[null,70,null,null,null,70,1.23,null,null,70,1.23,null,null,70,1.24,null,null,70,1.26,null,null,70,1.26,null,null,70,1.33,null,null,70,1.31,null,null,70,1.26,null,null,70,1.28,null,null,70,1.27,null,null,70,1.3,null,null,70,1.29,null,null,70,1.27,null,null,70,1.31,null,null,70,1.32,null,null,70,1.29,null,null,70,1.27,null,null,70,1.33]
[null,75,null,null,null,75,1.26,null,null,75,1.26,null,null,75,1.26,null,null,75,1.29,null,null,75,1.29,null,null,75,1.37,null,null,75,1.35,null,null,75,1.3,null,null,75,1.31,null,null,75,1.3,null,null,75,1.33,null,null,75,1.33,null,null,75,1.3,null,null,75,1.35,null,null,75,1.36,null,null,75,1.32,null,null,75,1.3,null,null,75,1.37]
[null,80,null,null,null,80,1.28,null,null,80,1.29,null,null,80,1.29,null,null,80,1.32,null,null,80,1.32,null,null,80,1.41,null,null,80,1.39,null,null,80,1.33,null,null,80,1.35,null,null,80,1.34,null,null,80,1.36,null,null,80,1.36,null,null,80,1.33,null,null,80,1.39,null,null,80,1.41,null,null,80,1.36,null,null,80,1.33,null,null,80,1.41]
[null,85,null,null,null,85,1.31,null,null,85,1.31,null,null,85,1.32,null,null,85,1.35,null,null,85,1.36,null,null,85,1.46,null,null,85,1.43,null,null,85,1.36,null,null,85,1.38,null,null,85,1.37,null,null,85,1.4,null,null,85,1.4,null,null,85,1.37,null,null,85,1.43,null,null,85,1.45,null,null,85,1.39,null,null,85,1.36,null,null,85,1.45]
[null,90,null,null,null,90,1.34,null,null,90,1.34,null,null,90,1.35,null,null,90,1.38,null,null,90,1.39,null,null,90,1.5,null,null,90,1.47,null,null,90,1.4,null,null,90,1.41,null,null,90,1.4,null,null,90,1.43,null,null,90,1.43,null,null,90,1.4,null,null,90,1.47,null,null,90,1.49,null,null,90,1.43,null,null,90,1.4,null,null,90,1.49]
[null,95,null,null,null,95,1.37,null,null,95,1.37,null,null,95,1.38,null,null,95,1.42,null,null,95,1.42,null,null,95,1.55,null,null,95,1.52,null,null,95,1.43,null,null,95,1.45,null,null,95,1.44,null,null,95,1.47,null,null,95,1.47,null,null,95,1.43,null,null,95,1.51,null,null,95,1.54,null,null,95,1.46,null,null,95,1.43,null,null,95,1.54]
[null,100,null,null,null,100,1.4,null,null,100,1.4,null,null,100,1.42,null,null,100,1.45,null,null,100,1.46,null,null,100,1.59,null,null,100,1.56,null,null,100,1.47,null,null,100,1.48,null,null,100,1.48,null,null,100,1.51,null,null,100,1.5,null,null,100,1.47,null,null,100,1.56,null,null,100,1.58,null,null,100,1.5,null,null,100,1.46,null,null,100,1.58]
[null,105,null,null,null,105,1.43,null,null,105,1.44,null,null,105,1.45,null,null,105,1.48,null,null,105,1.49,null,null,105,1.64,null,null,105,1.61,null,null,105,1.5,null,null,105,1.52,null,null,105,1.51,null,null,105,1.54,null,null,105,1.54,null,null,105,1.5,null,null,105,1.6,null,null,105,1.63,null,null,105,1.54,null,null,105,1.5,null,null,105,1.63]
[null,110,null,null,null,110,1.46,null,null,110,1.47,null,null,110,1.48,null,null,110,1.52,null,null,110,1.53,null,null,110,1.69,null,null,110,1.65,null,null,110,1.54,null,null,110,1.56,null,null,110,1.55,null,null,110,1.58,null,null,110,1.58,null,null,110,1.54,null,null,110,1.65,null,null,110,1.68,null,null,110,1.58,null,null,110,1.53,null,null,110,1.67]
[null,115,null,null,null,115,1.49,null,null,115,1.5,null,null,115,1.51,null,null,115,1.55,null,null,115,1.56,null,null,115,1.74,null,null,115,1.7,null,null,115,1.57,null,null,115,1.59,null,null,115,1.59,null,null,115,1.62,null,null,115,1.62,null,null,115,1.58,null,null,115,1.69,null,null,115,1.72,null,null,115,1.61,null,null,115,1.57,null,null,115,1.72]
[null,120,null,null,null,120,1.52,null,null,120,1.53,null,null,120,1.55,null,null,120,1.59,null,null,120,1.6,null,null,120,1.79,null,null,120,1.75,null,null,120,1.61,null,null,120,1.63,null,null,120,1.62,null,null,120,1.66,null,null,120,1.65,null,null,120,1.61,null,null,120,1.74,null,null,120,1.77,null,null,120,1.65,null,null,120,1.6,null,null,120,1.77]
[null,125,null,null,null,125,1.56,null,null,125,1.56,null,null,125,1.58,null,null,125,1.62,null,null,125,1.64,null,null,125,1.84,null,null,125,1.8,null,null,125,1.65,null,null,125,1.67,null,null,125,1.66,null,null,125,1.7,null,null,125,1.69,null,null,125,1.65,null,null,125,1.79,null,null,125,1.82,null,null,125,1.69,null,null,125,1.64,null,null,125,1.82]
[null,130,null,null,null,130,1.59,null,null,130,1.6,null,null,130,1.61,null,null,130,1.66,null,null,130,1.67,null,null,130,1.89,null,null,130,1.85,null,null,130,1.68,null,null,130,1.71,null,null,130,1.7,null,null,130,1.73,null,null,130,1.73,null,null,130,1.69,null,null,130,1.84,null,null,130,1.88,null,null,130,1.73,null,null,130,1.68,null,null,130,1.87]
[]
[null,"Maximum Load Current",{"$f":"IOUTMAX","v":1.8},"A",null,"Maximum Load Current",{"$f":"IOUTMAX","v":1.8},"A",null,"Maximum Load Current",{"$f":"IOUTMAX","v":1.8},"A",null,"Maximum Load Current",{"$f":"IOUTMAX","v":1.8},"A",null,"Maximum Load Current",{"$f":"IOUTMAX","v":1.8},"A",null,"Maximum Load Current",{"$f":"IOUTMAX","v":1.8},"A",null,"Maximum Load Current",{"$f":"IOUTMAX","v":1.8},"A",null,"Maximum Load Current",{"$f":"IOUTMAX","v":1.8},"A",null,"Maximum Load Current",{"$f":"IOUTMAX","v":1.8},"A",null,"Maximum Load Current",{"$f":"IOUTMAX","v":1.8},"A",null,"Maximum Load Current",{"$f":"IOUTMAX","v":1.8},"A",null,"Maximum Load Current",{"$f":"IOUTMAX","v":1.8},"A",null,"Maximum Load Current",{"$f":"IOUTMAX","v":1.8},"A",null,"Maximum Load Current",{"$f":"IOUTMAX","v":1.8},"A",null,"Maximum Load Current",{"$f":"IOUTMAX","v":1.8},"A",null,"Maximum Load Current",{"$f":"IOUTMAX","v":1.8},"A",null,"Maximum Load Current",{"$f":"IOUTMAX","v":1.8},"A",null,"Maximum Load Current",{"$f":"IOUTMAX","v":1.8},"A",null,"Maximum Load Current",{"$f":"IOUTMAX","v":1.8},"A"]
[null,"Maximum Ambient Temperature",{"$f":"TAMB","v":85},"°C",null,"Maximum Ambient Temperature",{"$f":"TAMB","v":85},"°C",null,"Maximum Ambient Temperature",{"$f":"TAMB","v":85},"°C",null,"Maximum Ambient Temperature",{"$f":"TAMB","v":85},"°C",null,"Maximum Ambient Temperature",{"$f":"TAMB","v":85},"°C",null,"Maximum Ambient Temperature",{"$f":"TAMB","v":85},"°C",null,"Maximum Ambient Temperature",{"$f":"TAMB","v":85},"°C",null,"Maximum Ambient Temperature",{"$f":"TAMB","v":85},"°C",null,"Maximum Ambient Temperature",{"$f":"TAMB","v":85},"°C",null,"Maximum Ambient Temperature",{"$f":"TAMB","v":85},"°C",null,"Maximum Ambient Temperature",{"$f":"TAMB","v":85},"°C",null,"Maximum Ambient Temperature",{"$f":"TAMB","v":85},"°C",null,"Maximum Ambient Temperature",{"$f":"TAMB","v":85},"°C",null,"Maximum Ambient Temperature",{"$f":"TAMB","v":85},"°C",null,"Maximum Ambient Temperature",{"$f":"TAMB","v":85},"°C",null,"Maximum Ambient Temperature",{"$f":"TAMB","v":85},"°C",null,"Maximum Ambient Temperature",{"$f":"TAMB","v":85},"°C",null,"Maximum Ambient Temperature",{"$f":"TAMB","v":85},"°C",null,"Maximum Ambient Temperature",{"$f":"TAMB","v":85},"°C"]
[null,"RQJA",{"$f":"ThetaJA","v":30},"°C/W",null,"RQJA",{"$f":"ThetaJA","v":30},"°C/W",null,"RQJA",{"$f":"ThetaJA","v":30},"°C/W",null,"RQJA",{"$f":"ThetaJA","v":30},"°C/W",null,"RQJA",{"$f":"ThetaJA","v":30},"°C/W",null,"RQJA",{"$f":"ThetaJA","v":30},"°C/W",null,"RQJA",{"$f":"ThetaJA","v":30},"°C/W",null,"RQJA",{"$f":"ThetaJA","v":30},"°C/W",null,"RQJA",{"$f":"ThetaJA","v":30},"°C/W",null,"RQJA",{"$f":"ThetaJA","v":30},"°C/W",null,"RQJA",{"$f":"ThetaJA","v":30},"°C/W",null,"RQJA",{"$f":"ThetaJA","v":30},"°C/W",null,"RQJA",{"$f":"ThetaJA","v":30},"°C/W",null,"RQJA",{"$f":"ThetaJA","v":30},"°C/W",null,"RQJA",{"$f":"ThetaJA","v":30},"°C/W",null,"RQJA",{"$f":"ThetaJA","v":30},"°C/W",null,"RQJA",{"$f":"ThetaJA","v":30},"°C/W",null,"RQJA",{"$f":"ThetaJA","v":30},"°C/W",null,"RQJA",{"$f":"ThetaJA","v":30},"°C/W"]
[null,"Operation Temp required ",{"$f":"'Design Calculator'!F25","v":100},"°C",null,"Operation Temp required ",{"$f":"'Design Calculator'!F25","v":100},"°C",null,"Operation Temp required ",{"$f":"'Design Calculator'!F25","v":100},"°C",null,"Operation Temp required ",{"$f":"'Design Calculator'!F25","v":100},"°C",null,"Operation Temp required ",{"$f":"'Design Calculator'!F25","v":100},"°C",null,"Operation Temp required ",{"$f":"'Design Calculator'!F25","v":100},"°C",null,"Operation Temp required ",{"$f":"'Design Calculator'!F25","v":100},"°C",null,"Operation Temp required ",{"$f":"'Design Calculator'!F25","v":100},"°C",null,"Operation Temp required ",{"$f":"'Design Calculator'!F25","v":100},"°C",null,"Operation Temp required ",{"$f":"'Design Calculator'!F25","v":100},"°C",null,"Operation Temp required ",{"$f":"'Design Calculator'!F25","v":100},"°C",null,"Operation Temp required ",{"$f":"'Design Calculator'!F25","v":100},"°C",null,"Operation Temp required ",{"$f":"'Design Calculator'!F25","v":100},"°C",null,"Operation Temp required ",{"$f":"'Design Calculator'!F25","v":100},"°C",null,"Operation Temp required ",{"$f":"'Design Calculator'!F25","v":100},"°C",null,"Operation Temp required ",{"$f":"'Design Calculator'!F25","v":100},"°C",null,"Operation Temp required ",{"$f":"'Design Calculator'!F25","v":100},"°C",null,"Operation Temp required ",{"$f":"'Design Calculator'!F25","v":100},"°C",null,"Operation Temp required ",{"$f":"'Design Calculator'!F25","v":100},"°C"]
[null,null,null,null,null,null,{"$f":"LOOKUP(G28,F11:F23,G11:G23)","v":1.4},null,null,null,{"$f":"LOOKUP(K28,J11:J23,K11:K23)","v":1.4},null,null,null,{"$f":"LOOKUP(O28,N11:N23,O11:O23)","v":1.42},null,null,null,{"$f":"LOOKUP(S28,R11:R23,S11:S23)","v":1.45},null,null,null,{"$f":"LOOKUP(W28,V11:V23,W11:W23)","v":1.46},null,null,null,{"$f":"LOOKUP(AA28,Z11:Z23,AA11:AA23)","v":1.59},null,null,null,{"$f":"LOOKUP(AE28,AD11:AD23,AE11:AE23)","v":1.56},null,null,null,{"$f":"LOOKUP(AI28,AH11:AH23,AI11:AI23)","v":1.47},null,null,null,{"$f":"LOOKUP(AM28,AL11:AL23,AM11:AM23)","v":1.48},null,null,null,{"$f":"LOOKUP(AQ28,AP11:AP23,AQ11:AQ23)","v":1.48},null,null,null,{"$f":"LOOKUP(AU28,AT11:AT23,AU11:AU23)","v":1.51},null,null,null,{"$f":"LOOKUP(AY28,AX11:AX23,AY11:AY23)","v":1.5},null,null,null,{"$f":"LOOKUP(BC28,BB11:BB23,BC11:BC23)","v":1.47},null,null,null,{"$f":"LOOKUP(BG28,BF11:BF23,BG11:BG23)","v":1.56},null,null,null,{"$f":"LOOKUP(BK28,BJ11:BJ23,BK11:BK23)","v":1.58},null,null,null,{"$f":"LOOKUP(BO28,BN11:BN23,BO11:BO23)","v":1.5},null,null,null,{"$f":"LOOKUP(BS28,BR11:BR23,BS11:BS23)","v":1.46},null,null,null,{"$f":"LOOKUP(BW28,BV11:BV23,BW11:BW23)","v":1.58}]
[null,"datasheet","Not Applicable",null,null,"datasheet","https://www.ti.com/lit/gpn/csd18536ktt",null,null,"datasheet","https://www.ti.com/lit/gpn/csd18535ktt",null,null,"datasheet","https://www.ti.com/lit/gpn/csd18540q5b",null,null,"datasheet","https://www.ti.com/lit/gpn/csd19506ktt",null,null,"datasheet","https://www.ti.com/lit/gpn/csd19505ktt",null,null,"datasheet","https://www.ti.com/lit/gpn/csd18532q5b",null,null,"datasheet","https://www.ti.com/lit/gpn/csd18532nq5b",null,null,"datasheet","https://www.ti.com/lit/gpn/csd18542ktt",null,null,"datasheet","https://www.ti.com/lit/gpn/csd19502q5b",null,null,"datasheet","https://www.ti.com/lit/gpn/csd18532kcs",null,null,"datasheet","https://www.ti.com/lit/gpn/csd18531q5a",null,null,"datasheet","https://www.ti.com/lit/gpn/csd18533q5a",null,null,"datasheet","https://www.ti.com/lit/gpn/csd19501kcs",null,null,"datasheet","https://www.ti.com/lit/gpn/csd18563q5a",null,null,"datasheet","https://www.ti.com/lit/gpn/csd19503kcs",null,null,"datasheet","https://www.ti.com/lit/gpn/csd18534q5a",null,null,"datasheet","https://www.ti.com/lit/gpn/csd18543q3a",null,null,"datasheet","https://www.ti.com/lit/gpn/csd18537nq5a"]
[null,"Number of FETs",{"$f":"SQRT((C25*C25*C7*C27)/(1000*(C28-C26)))","v":8.0498447189992439E-2},null,null,"Number of FETs",{"$f":"SQRT((G25*G25*G29*G7*G27)/(1000*(G28-G26)))","v":0.12047904382090688},null,null,"Number of FETs",{"$f":"SQRT((K25*K25*K29*K7*K27)/(1000*(K28-K26)))","v":0.13469966592386187},null,null,"Number of FETs",{"$f":"SQRT((O25*O25*O29*O7*O27)/(1000*(O28-O26)))","v":0.14227972448666046},null,null,"Number of FETs",{"$f":"SQRT((S25*S25*S29*S7*S27)/(1000*(S28-S26)))","v":0.14700612232148702},null,null,"Number of FETs",{"$f":"SQRT((W25*W25*W29*W7*W27)/(1000*(W28-W26)))","v":0.17125559844863467},null,null,"Number of FETs",{"$f":"SQRT((AA25*AA25*AA29*AA7*AA27)/(1000*(AA28-AA26)))","v":0.18157709106602629},null,null,"Number of FETs",{"$f":"SQRT((AE25*AE25*AE29*AE7*AE27)/(1000*(AE28-AE26)))","v":0.18539126193000577},null,null,"Number of FETs",{"$f":"SQRT((AI25*AI25*AI29*AI7*AI27)/(1000*(AI28-AI26)))","v":0.19519836064885382},null,null,"Number of FETs",{"$f":"SQRT((AM25*AM25*AM29*AM7*AM27)/(1000*(AM28-AM26)))","v":0.19829432669645392},null,null,"Number of FETs",{"$f":"SQRT((AQ25*AQ25*AQ29*AQ7*AQ27)/(1000*(AQ28-AQ26)))","v":0.2006979820526355},null,null,"Number of FETs",{"$f":"SQRT((AU25*AU25*AU29*AU7*AU27)/(1000*(AU28-AU26)))","v":0.212155791813469},null,null,"Number of FETs",{"$f":"SQRT((AY25*AY25*AY29*AY7*AY27)/(1000*(AY28-AY26)))","v":0.23947442452170128},null,null,"Number of FETs",{"$f":"SQRT((BC25*BC25*BC29*BC7*BC27)/(1000*(BC28-BC26)))","v":0.25073683415086823},null,null,"Number of FETs",{"$f":"SQRT((BG25*BG25*BG29*BG7*BG27)/(1000*(BG28-BG26)))","v":0.262182836966877},null,null,"Number of FETs",{"$f":"SQRT((BK25*BK25*BK29*BK7*BK27)/(1000*(BK28-BK26)))","v":0.30690923739763848},null,null,"Number of FETs",{"$f":"SQRT((BO25*BO25*BO29*BO7*BO27)/(1000*(BO28-BO26)))","v":0.30863570759068043},null,null,"Number of FETs",{"$f":"SQRT((BS25*BS25*BS29*BS7*BS27)/(1000*(BS28-BS26)))","v":0.30604235001058272},null,null,"Number of FETs",{"$f":"SQRT((BW25*BW25*BW29*BW7*BW27)/(1000*(BW28-BW26)))","v":0.36482763053255712}]
[null,"FET round-up",{"$f":"CEILING(C31,1)","v":1},null,null,"FET round-up",{"$f":"CEILING(G31,1)","v":1},null,null,"FET round-up",{"$f":"CEILING(K31,1)","v":1},null,null,"FET round-up",{"$f":"CEILING(O31,1)","v":1},null,null,"FET round-up",{"$f":"CEILING(S31,1)","v":1},null,null,"FET round-up",{"$f":"CEILING(W31,1)","v":1},null,null,"FET round-up",{"$f":"CEILING(AA31,1)","v":1},null,null,"FET round-up",{"$f":"CEILING(AE31,1)","v":1},null,null,"FET round-up",{"$f":"CEILING(AI31,1)","v":1},null,null,"FET round-up",{"$f":"CEILING(AM31,1)","v":1},null,null,"FET round-up",{"$f":"CEILING(AQ31,1)","v":1},null,null,"FET round-up",{"$f":"CEILING(AU31,1)","v":1},null,null,"FET round-up",{"$f":"CEILING(AY31,1)","v":1},null,null,"FET round-up",{"$f":"CEILING(BC31,1)","v":1},null,null,"FET round-up",{"$f":"CEILING(BG31,1)","v":1},null,null,"FET round-up",{"$f":"CEILING(BK31,1)","v":1},null,null,"FET round-up",{"$f":"CEILING(BO31,1)","v":1},null,null,"FET round-up",{"$f":"CEILING(BS31,1)","v":1},null,null,"FET round-up",{"$f":"CEILING(BW31,1)","v":1}]
[null,"FET power dissipation",{"$f":"C25*C25*C7/(1000*C32*C32)","v":3.2400000000000003E-3},"W",null,"FET power dissipation",{"$f":"G25*G25*G29*G7/(1000*G32*G32)","v":7.2576000000000003E-3},"W",null,"FET power dissipation",{"$f":"K25*K25*K29*K7/(1000*K32*K32)","v":9.0719999999999985E-3},"W",null,"FET power dissipation",{"$f":"O25*O25*O29*O7/(1000*O32*O32)","v":1.0121760000000002E-2},"W",null,"FET power dissipation",{"$f":"S25*S25*S29*S7/(1000*S32*S32)","v":1.08054E-2},"W",null,"FET power dissipation",{"$f":"W25*W25*W29*W7/(1000*W32*W32)","v":1.4664240000000002E-2},"W",null,"FET power dissipation",{"$f":"AA25*AA25*AA29*AA7/(1000*AA32*AA32)","v":1.6485120000000002E-2},"W",null,"FET power dissipation",{"$f":"AE25*AE25*AE29*AE7/(1000*AE32*AE32)","v":1.7184959999999999E-2},"W",null,"FET power dissipation",{"$f":"AI25*AI25*AI29*AI7/(1000*AI32*AI32)","v":1.9051200000000001E-2},"W",null,"FET power dissipation",{"$f":"AM25*AM25*AM29*AM7/(1000*AM32*AM32)","v":1.9660319999999998E-2},"W",null,"FET power dissipation",{"$f":"AQ25*AQ25*AQ29*AQ7/(1000*AQ32*AQ32)","v":2.0139840000000003E-2},"W",null,"FET power dissipation",{"$f":"AU25*AU25*AU29*AU7/(1000*AU32*AU32)","v":2.250504E-2},"W",null,"FET power dissipation",{"$f":"AY25*AY25*AY29*AY7/(1000*AY32*AY32)","v":2.8674000000000002E-2},"W",null,"FET power dissipation",{"$f":"BC25*BC25*BC29*BC7/(1000*BC32*BC32)","v":3.1434480000000001E-2},"W",null,"FET power dissipation",{"$f":"BG25*BG25*BG29*BG7/(1000*BG32*BG32)","v":3.4369919999999998E-2},"W",null,"FET power dissipation",{"$f":"BK25*BK25*BK29*BK7/(1000*BK32*BK32)","v":4.7096640000000002E-2},"W",null,"FET power dissipation",{"$f":"BO25*BO25*BO29*BO7/(1000*BO32*BO32)","v":4.7628000000000011E-2},"W",null,"FET power dissipation",{"$f":"BS25*BS25*BS29*BS7/(1000*BS32*BS32)","v":4.6830960000000005E-2},"W",null,"FET power dissipation",{"$f":"BW25*BW25*BW29*BW7/(1000*BW32*BW32)","v":6.65496E-2},"W"]
[null,"Operating Temperature",{"$f":"C26+C33*C27","v":85.097200000000001},"°C",null,"Operating Temperature",{"$f":"G26+G33*G27","v":85.217727999999994},"°C",null,"Operating Temperature",{"$f":"K26+K33*K27","v":85.27216},"°C",null,"Operating Temperature",{"$f":"O26+O33*O27","v":85.303652799999995},"°C",null,"Operating Temperature",{"$f":"S26+S33*S27","v":85.324162000000001},"°C",null,"Operating Temperature",{"$f":"W26+W33*W27","v":85.4399272},"°C",null,"Operating Temperature",{"$f":"AA26+AA33*AA27","v":85.494553600000003},"°C",null,"Operating Temperature",{"$f":"AE26+AE33*AE27","v":85.515548800000005},"°C",null,"Operating Temperature",{"$f":"AI26+AI33*AI27","v":85.571535999999995},"°C",null,"Operating Temperature",{"$f":"AM26+AM33*AM27","v":85.589809599999995},"°C",null,"Operating Temperature",{"$f":"AQ26+AQ33*AQ27","v":85.604195200000007},"°C",null,"Operating Temperature",{"$f":"AU26+AU33*AU27","v":85.675151200000002},"°C",null,"Operating Temperature",{"$f":"AY26+AY33*AY27","v":85.860219999999998},"°C",null,"Operating Temperature",{"$f":"BC26+BC33*BC27","v":85.943034400000002},"°C",null,"Operating Temperature",{"$f":"BG26+BG33*BG27","v":86.031097599999995},"°C",null,"Operating Temperature",{"$f":"BK26+BK33*BK27","v":86.412899199999998},"°C",null,"Operating Temperature",{"$f":"BO26+BO33*BO27","v":86.428839999999994},"°C",null,"Operating Temperature",{"$f":"BS26+BS33*BS27","v":86.404928799999993},"°C",null,"Operating Temperature",{"$f":"BW26+BW33*BW27","v":86.996487999999999},"°C"]
[null,"cost 1k USD","Enter cost details",null,null,"cost 1k USD",1.8939999999999999,null,null,"cost 1k USD",1.266,null,null,"cost 1k USD",0.86699999999999999,null,null,"cost 1k USD",1.972,null,null,"cost 1k USD",1.3129999999999999,null,null,"cost 1k USD",0.84499999999999997,null,null,"cost 1k USD",0.84499999999999997,null,null,"cost 1k USD",0.86099999999999999,null,null,"cost 1k USD",0.89600000000000002,null,null,"cost 1k USD",0.81799999999999995,null,null,"cost 1k USD",0.58899999999999997,null,null,"cost 1k USD",0.46400000000000002,null,null,"cost 1k USD",0.71899999999999997,null,null,"cost 1k USD",0.47699999999999998,null,null,"cost 1k USD",0.58699999999999997,null,null,"cost 1k USD",0.32600000000000001,null,null,"cost 1k USD",0.25800000000000001,null,null,"cost 1k USD",0.27300000000000002]
[]
[null,"SOA"]
[null,"Time(ms)",null,null,null,"Time(ms)",null,null,null,"Time(ms)",null,null,null,"Time(ms)",null,null,null,"Time(ms)",null,null,null,"Time(ms)",null,null,null,"Time(ms)",null,null,null,"Time(ms)",null,null,null,"Time(ms)",null,null,null,"Time(ms)",null,null,null,"Time(ms)",null,null,null,"Time(ms)",null,null,null,"Time(ms)",null,null,null,"Time(ms)",null,null,null,"Time(ms)",null,null,null,"Time(ms)",null,null,null,"Time(ms)",null,null,null,"Time(ms)",null,null,null,"Time(ms)"]
[null,0.01,{"$f":"'Design Calculator'!H57","v":400},"A",null,0.01,400,"A",null,0.01,400,"A",null,0.01,400,"A",null,0.01,400,"A",null,0.01,400,"A",null,0.01,{"$f":"36326*VINMAX^-1.677","v":434.67119666722186},"A",null,0.01,400,"A",null,0.01,400,"A",null,0.01,{"$f":"30220*VINMAX^-1.615","v":425.89023489315292},"A",null,0.01,400,"A",null,0.01,{"$f":"20185*VINMAX^-1.526","v":359.78029313433416},"A",null,0.01,{"$f":"19093*VINMAX^-1.564","v":307.84345512869521},"A",null,0.01,{"$f":"26533.896*VINMAX^-1.640895","v":349.24102926349616},"A",null,0.01,{"$f":"2759.3*VINMAX^-1","v":197.09285714285716},"A",null,0.01,{"$f":"3718*VINMAX^-1","v":265.57142857142856},"A",null,0.01,{"$f":"5949.5*VINMAX^-1","v":424.96428571428567},"A",null,0.01,156,"A",null,0.01,{"$f":"6156.5*VINMAX^-1.437","v":138.78671504724102},"A"]
[null,0.1,{"$f":"'Design Calculator'!H58","v":100},"A",null,0.1,{"$f":"7200*VINMAX^-1","v":514.28571428571422},"A",null,0.1,{"$f":"7200*VINMAX^-1","v":514.28571428571422},"A",null,0.1,{"$f":"210787.85*VINMAX^-2.205","v":626.08493738234574},"A",null,0.1,{"$f":"9600*VINMAX^-1","v":685.71428571428567},"A",null,0.1,{"$f":"6024*VINMAX^-1","v":430.28571428571428},"A",null,0.1,{"$f":"9058.8*VINMAX^-1.677","v":108.39617454079803},"A",null,0.1,{"$f":"254877.35*VINMAX^-2.292","v":601.73570974983545},"A",null,0.1,{"$f":"23236.2*VINMAX^-1.559","v":379.62210961182518},"A",null,0.1,{"$f":"7262.7*VINMAX^-1.615","v":102.35317700061223},"A",null,0.1,{"$f":"25472*VINMAX^-1.733","v":262.91971947121169},"A",null,0.1,{"$f":"5027.2*VINMAX^-1.526","v":89.605523390880592},"A",null,0.1,{"$f":"3987.9*VINMAX^-1.564","v":64.298377138622726},"A",null,0.1,{"$f":"450*VINMAX^-1","v":32.142857142857139},"A",null,0.1,{"$f":"2213.6*VINMAX^-1.334","v":65.488394960361177},"A",null,0.1,{"$f":"2786.8*VINMAX^-1.436","v":62.989178250079028},"A",null,0.1,{"$f":"3055.1*VINMAX^-1.399","v":76.136394796060031},"A",null,0.1,{"$f":"8287.2884*VINMAX^-1.6338","v":111.1395075133687},"A",null,0.1,{"$f":"1328.6*VINMAX^-1.437","v":29.950788534356274},"A"]
[null,1,{"$f":"'Design Calculator'!H59","v":10},"A",null,1,{"$f":"18540.6*VINMAX^-1.848","v":141.27950821521989},"A",null,1,{"$f":"10892.05*VINMAX^-1.811","v":91.51067392309514},"A",null,1,{"$f":"5035.355*VINMAX^-1.742","v":50.754558722510708},"A",null,1,{"$f":"8530.6*VINMAX^-1.677","v":102.07581650303923},"A",null,1,{"$f":"4926.09*VINMAX^-1.645","v":64.13893191327287},"A",null,1,{"$f":"2847.4*VINMAX^-1.677","v":34.071540092227266},"A",null,1,{"$f":"3649.035*VINMAX^-1.776","v":33.624407288629875},"A",null,1,{"$f":"4614.61*VINMAX^-1.711","v":50.478905964828293},"A",null,1,{"$f":"2213.6*VINMAX^-1.615","v":31.196248311035184},"A",null,1,{"$f":"5126.7*VINMAX^-1.733","v":52.917341622686116},"A",null,1,{"$f":"1653.3*VINMAX^-1.526","v":29.468652892692329},"A",null,1,{"$f":"1139.3*VINMAX^-1.564","v":18.369352560002223},"A",null,1,{"$f":"270.803*VINMAX^-1.12","v":14.092565799736114},"A",null,1,{"$f":"700*VINMAX^-1.334","v":20.709196093355992},"A",null,1,{"$f":"700*VINMAX^-1.436","v":15.821883441601592},"A",null,1,{"$f":"556.03*VINMAX^-1.399","v":13.856868710828863},"A",null,1,{"$f":"1050.9707*VINMAX^-1.64545","v":13.667662062995944},"A",null,1,{"$f":"412.19*VINMAX^-1.437","v":9.2920484163603145},"A"]
[null,10,{"$f":"'Design Calculator'!H60","v":2},"A",null,10,{"$f":"4210.83*VINMAX^-1.786","v":37.790534688236328},"A",null,10,{"$f":"2539.81*VINMAX^-1.762","v":24.284190436234297},"A",null,10,{"$f":"1366.82*VINMAX^-1.659","v":17.15082098001713},"A",null,10,{"$f":"1565.525*VINMAX^-1.487","v":30.929123893649844},"A",null,10,{"$f":"1494.22*VINMAX^-1.647","v":19.352704722821418},"A",null,10,{"$f":"1085.4*VINMAX^-1.677","v":12.987725509624033},"A",null,10,{"$f":"1388.79*VINMAX^-1.801","v":11.98008745545671},"A",null,10,{"$f":"1390.155*VINMAX^-1.765","v":13.187037557984389},"A",null,10,{"$f":"822.43*VINMAX^-1.615","v":11.590499863771534},"A",null,10,{"$f":"1760.7*VINMAX^-1.733","v":18.173788869070446},"A",null,10,{"$f":"679.18*VINMAX^-1.526","v":12.105800321574291},"A",null,10,{"$f":"418.17*VINMAX^-1.564","v":6.742308575455219},"A",null,10,{"$f":"407.4016*VINMAX^-1.56317","v":6.583089639403692},"A",null,10,{"$f":"278.68*VINMAX^-1.334","v":8.2446268104234974},"A",null,10,{"$f":"226.52*VINMAX^-1.436","v":5.1199614817022754},"A",null,10,{"$f":"197.29*VINMAX^-1.399","v":4.9166800855339217},"A",null,10,{"$f":"13.3098*VINMAX^-0.761056","v":1.786092353761803},"A",null,10,{"$f":"167.92*VINMAX^-1.437","v":3.7854406222257304},"A"]
[null,100,{"$f":"'Design Calculator'!H61","v":0.1},"A",null,100,{"$f":"795.6*VINMAX^-1.492","v":15.512141055189629},"A",null,100,{"$f":"1006.005*VINMAX^-1.605","v":14.55675732535091},"A",null,100,{"$f":"108.017*VINMAX^-1.122","v":5.5916046225844749},"A",null,100,{"$f":"334.6265*VINMAX^-1.214","v":13.588167622724431},"A",null,100,{"$f":"351.234*VINMAX^-1.35","v":9.9614761956463784},"A",null,100,{"$f":"314.18*VINMAX^-1.677","v":3.759428414053509},"A",null,100,{"$f":"144.5275*VINMAX^-1.28","v":4.9306775809066696},"A",null,100,{"$f":"695.825*VINMAX^-1.644","v":9.0837576221877221},"A",null,100,{"$f":"266.13*VINMAX^-1.615","v":3.7505681076146522},"A",null,100,{"$f":"1037.9*VINMAX^-1.733","v":10.7131115279197},"A",null,100,{"$f":"180.1*VINMAX^-1.526","v":3.210127856997453},"A",null,100,{"$f":"157.27*VINMAX^-1.564","v":2.5357220022044675},"A",null,100,{"$f":"111.1856*VINMAX^-1.2291","v":4.3385297055799512},"A",null,100,{"$f":"124.48*VINMAX^-1.334","v":3.6826867567156487},"A",null,100,{"$f":"175.83*VINMAX^-1.436","v":3.9742310936240117},"A",null,100,{"$f":"116.17*VINMAX^-1.399","v":2.8950819886282919},"A",null,100,{"$f":"87.16708*VINMAX^-1.583","v":1.3366934420632093},"A",null,100,{"$f":"84.159*VINMAX^-1.437","v":1.8972063918883713},"A"]
[]
[null,"Timer Duration",{"$f":"IF('Design Calculator'!F30=\"Soft Start\",'Design Calculator'!F31-0.00001,'Design Calculator'!F79)","v":0.99999000000000005},"ms",null,"Timer Duration",{"$f":"IF('Design Calculator'!F30=\"Soft Start\",'Design Calculator'!F31-0.00001,'Design Calculator'!F79)","v":0.99999000000000005},"ms",null,"Timer Duration",{"$f":"IF('Design Calculator'!F30=\"Soft Start\",'Design Calculator'!F31-0.00001,'Design Calculator'!F79)","v":0.99999000000000005},"ms",null,"Timer Duration",{"$f":"IF('Design Calculator'!F30=\"Soft Start\",'Design Calculator'!F31-0.00001,'Design Calculator'!F79)","v":0.99999000000000005},"ms",null,"Timer Duration",{"$f":"IF('Design Calculator'!F30=\"Soft Start\",'Design Calculator'!F31-0.00001,'Design Calculator'!F79)","v":0.99999000000000005},"ms",null,"Timer Duration",{"$f":"IF('Design Calculator'!F30=\"Soft Start\",'Design Calculator'!F31-0.00001,'Design Calculator'!F79)","v":0.99999000000000005},"ms",null,"Timer Duration",{"$f":"IF('Design Calculator'!F30=\"Soft Start\",'Design Calculator'!F31-0.00001,'Design Calculator'!F79)","v":0.99999000000000005},"ms",null,"Timer Duration",{"$f":"IF('Design Calculator'!F30=\"Soft Start\",'Design Calculator'!F31-0.00001,'Design Calculator'!F79)","v":0.99999000000000005},"ms",null,"Timer Duration",{"$f":"IF('Design Calculator'!F30=\"Soft Start\",'Design Calculator'!F31-0.00001,'Design Calculator'!F79)","v":0.99999000000000005},"ms",null,"Timer Duration",{"$f":"IF('Design Calculator'!F30=\"Soft Start\",'Design Calculator'!F31-0.00001,'Design Calculator'!F79)","v":0.99999000000000005},"ms",null,"Timer Duration",{"$f":"IF('Design Calculator'!F30=\"Soft Start\",'Design Calculator'!F31-0.00001,'Design Calculator'!F79)","v":0.99999000000000005},"ms",null,"Timer Duration",{"$f":"IF('Design Calculator'!F30=\"Soft Start\",'Design Calculator'!F31-0.00001,'Design Calculator'!F79)","v":0.99999000000000005},"ms",null,"Timer Duration",{"$f":"IF('Design Calculator'!F30=\"Soft Start\",'Design Calculator'!F31-0.00001,'Design Calculator'!F79)","v":0.99999000000000005},"ms",null,"Timer Duration",{"$f":"IF('Design Calculator'!F30=\"Soft Start\",'Design Calculator'!F31-0.00001,'Design Calculator'!F79)","v":0.99999000000000005},"ms",null,"Timer Duration",{"$f":"IF('Design Calculator'!F30=\"Soft Start\",'Design Calculator'!F31-0.00001,'Design Calculator'!F79)","v":0.99999000000000005},"ms",null,"Timer Duration",{"$f":"IF('Design Calculator'!F30=\"Soft Start\",'Design Calculator'!F31-0.00001,'Design Calculator'!F79)","v":0.99999000000000005},"ms",null,"Timer Duration",{"$f":"IF('Design Calculator'!F30=\"Soft Start\",'Design Calculator'!F31-0.00001,'Design Calculator'!F79)","v":0.99999000000000005},"ms",null,"Timer Duration",{"$f":"IF('Design Calculator'!F30=\"Soft Start\",'Design Calculator'!F31-0.00001,'Design Calculator'!F79)","v":0.99999000000000005},"ms",null,"Timer Duration",{"$f":"IF('Design Calculator'!F30=\"Soft Start\",'Design Calculator'!F31-0.00001,'Design Calculator'!F79)","v":0.99999000000000005},"ms"]
[]
[null,"Lower time",{"$f":"IF(C45>B42,10,IF(C45>B41,1,IF(C45>B40,0.1,0.01)))","v":0.1},"ms",null,"Lower time",{"$f":"IF(G45>F42,10,IF(G45>F41,1,IF(G45>F40,0.1,0.01)))","v":0.1},"ms",null,"Lower time",{"$f":"IF(K45>J42,10,IF(K45>J41,1,IF(K45>J40,0.1,0.01)))","v":0.1},"ms",null,"Lower time",{"$f":"IF(O45>N42,10,IF(O45>N41,1,IF(O45>N40,0.1,0.01)))","v":0.1},"ms",null,"Lower time",{"$f":"IF(S45>R42,10,IF(S45>R41,1,IF(S45>R40,0.1,0.01)))","v":0.1},"ms",null,"Lower time",{"$f":"IF(W45>V42,10,IF(W45>V41,1,IF(W45>V40,0.1,0.01)))","v":0.1},"ms",null,"Lower time",{"$f":"IF(AA45>Z42,10,IF(AA45>Z41,1,IF(AA45>Z40,0.1,0.01)))","v":0.1},"ms",null,"Lower time",{"$f":"IF(AE45>AD42,10,IF(AE45>AD41,1,IF(AE45>AD40,0.1,0.01)))","v":0.1},"ms",null,"Lower time",{"$f":"IF(AI45>AH42,10,IF(AI45>AH41,1,IF(AI45>AH40,0.1,0.01)))","v":0.1},"ms",null,"Lower time",{"$f":"IF(AM45>AL42,10,IF(AM45>AL41,1,IF(AM45>AL40,0.1,0.01)))","v":0.1},"ms",null,"Lower time",{"$f":"IF(AQ45>AP42,10,IF(AQ45>AP41,1,IF(AQ45>AP40,0.1,0.01)))","v":0.1},"ms",null,"Lower time",{"$f":"IF(AU45>AT42,10,IF(AU45>AT41,1,IF(AU45>AT40,0.1,0.01)))","v":0.1},"ms",null,"Lower time",{"$f":"IF(AY45>AX42,10,IF(AY45>AX41,1,IF(AY45>AX40,0.1,0.01)))","v":0.1},"ms",null,"Lower time",{"$f":"IF(BC45>BB42,10,IF(BC45>BB41,1,IF(BC45>BB40,0.1,0.01)))","v":0.1},"ms",null,"Lower time",{"$f":"IF(BG45>BF42,10,IF(BG45>BF41,1,IF(BG45>BF40,0.1,0.01)))","v":0.1},"ms",null,"Lower time",{"$f":"IF(BK45>BJ42,10,IF(BK45>BJ41,1,IF(BK45>BJ40,0.1,0.01)))","v":0.1},"ms",null,"Lower time",{"$f":"IF(BO45>BN42,10,IF(BO45>BN41,1,IF(BO45>BN40,0.1,0.01)))","v":0.1},"ms",null,"Lower time",{"$f":"IF(BS45>BR42,10,IF(BS45>BR41,1,IF(BS45>BR40,0.1,0.01)))","v":0.1},"ms",null,"Lower time",{"$f":"IF(BW45>BV42,10,IF(BW45>BV41,1,IF(BW45>BV40,0.1,0.01)))","v":0.1},"ms"]
[null,"Lower Current",{"$f":"LOOKUP(C47,B39:B43,C39:C43)","v":100},"A",null,"Lower Current",{"$f":"LOOKUP(G47,F39:F43,G39:G43)","v":514.28571428571422},"A",null,"Lower Current",{"$f":"LOOKUP(K47,J39:J43,K39:K43)","v":514.28571428571422},"A",null,"Lower Current",{"$f":"LOOKUP(O47,N39:N43,O39:O43)","v":626.08493738234574},"A",null,"Lower Current",{"$f":"LOOKUP(S47,R39:R43,S39:S43)","v":685.71428571428567},"A",null,"Lower Current",{"$f":"LOOKUP(W47,V39:V43,W39:W43)","v":430.28571428571428},"A",null,"Lower Current",{"$f":"LOOKUP(AA47,Z39:Z43,AA39:AA43)","v":108.39617454079803},"A",null,"Lower Current",{"$f":"LOOKUP(AE47,AD39:AD43,AE39:AE43)","v":601.73570974983545},"A",null,"Lower Current",{"$f":"LOOKUP(AI47,AH39:AH43,AI39:AI43)","v":379.62210961182518},"A",null,"Lower Current",{"$f":"LOOKUP(AM47,AL39:AL43,AM39:AM43)","v":102.35317700061223},"A",null,"Lower Current",{"$f":"LOOKUP(AQ47,AP39:AP43,AQ39:AQ43)","v":262.91971947121169},"A",null,"Lower Current",{"$f":"LOOKUP(AU47,AT39:AT43,AU39:AU43)","v":89.605523390880592},"A",null,"Lower Current",{"$f":"LOOKUP(AY47,AX39:AX43,AY39:AY43)","v":64.298377138622726},"A",null,"Lower Current",{"$f":"LOOKUP(BC47,BB39:BB43,BC39:BC43)","v":32.142857142857139},"A",null,"Lower Current",{"$f":"LOOKUP(BG47,BF39:BF43,BG39:BG43)","v":65.488394960361177},"A",null,"Lower Current",{"$f":"LOOKUP(BK47,BJ39:BJ43,BK39:BK43)","v":62.989178250079028},"A",null,"Lower Current",{"$f":"LOOKUP(BO47,BN39:BN43,BO39:BO43)","v":76.136394796060031},"A",null,"Lower Current",{"$f":"LOOKUP(BS47,BR39:BR43,BS39:BS43)","v":111.1395075133687},"A",null,"Lower Current",{"$f":"LOOKUP(BW47,BV39:BV43,BW39:BW43)","v":29.950788534356274},"A"]
[null,"Higher Timer",{"$f":"IF(C45<B39,0.01,IF(C45<B40,0.1,IF(C45<B41,1,IF(C45<B42,10,100))))","v":1},"ms",null,"Higher Timer",{"$f":"IF(G45<F39,0.01,IF(G45<F40,0.1,IF(G45<F41,1,IF(G45<F42,10,100))))","v":1},"ms",null,"Higher Timer",{"$f":"IF(K45<J39,0.01,IF(K45<J40,0.1,IF(K45<J41,1,IF(K45<J42,10,100))))","v":1},"ms",null,"Higher Timer",{"$f":"IF(O45<N39,0.01,IF(O45<N40,0.1,IF(O45<N41,1,IF(O45<N42,10,100))))","v":1},"ms",null,"Higher Timer",{"$f":"IF(S45<R39,0.01,IF(S45<R40,0.1,IF(S45<R41,1,IF(S45<R42,10,100))))","v":1},"ms",null,"Higher Timer",{"$f":"IF(W45<V39,0.01,IF(W45<V40,0.1,IF(W45<V41,1,IF(W45<V42,10,100))))","v":1},"ms",null,"Higher Timer",{"$f":"IF(AA45<Z39,0.01,IF(AA45<Z40,0.1,IF(AA45<Z41,1,IF(AA45<Z42,10,100))))","v":1},"ms",null,"Higher Timer",{"$f":"IF(AE45<AD39,0.01,IF(AE45<AD40,0.1,IF(AE45<AD41,1,IF(AE45<AD42,10,100))))","v":1},"ms",null,"Higher Timer",{"$f":"IF(AI45<AH39,0.01,IF(AI45<AH40,0.1,IF(AI45<AH41,1,IF(AI45<AH42,10,100))))","v":1},"ms",null,"Higher Timer",{"$f":"IF(AM45<AL39,0.01,IF(AM45<AL40,0.1,IF(AM45<AL41,1,IF(AM45<AL42,10,100))))","v":1},"ms",null,"Higher Timer",{"$f":"IF(AQ45<AP39,0.01,IF(AQ45<AP40,0.1,IF(AQ45<AP41,1,IF(AQ45<AP42,10,100))))","v":1},"ms",null,"Higher Timer",{"$f":"IF(AU45<AT39,0.01,IF(AU45<AT40,0.1,IF(AU45<AT41,1,IF(AU45<AT42,10,100))))","v":1},"ms",null,"Higher Timer",{"$f":"IF(AY45<AX39,0.01,IF(AY45<AX40,0.1,IF(AY45<AX41,1,IF(AY45<AX42,10,100))))","v":1},"ms",null,"Higher Timer",{"$f":"IF(BC45<BB39,0.01,IF(BC45<BB40,0.1,IF(BC45<BB41,1,IF(BC45<BB42,10,100))))","v":1},"ms",null,"Higher Timer",{"$f":"IF(BG45<BF39,0.01,IF(BG45<BF40,0.1,IF(BG45<BF41,1,IF(BG45<BF42,10,100))))","v":1},"ms",null,"Higher Timer",{"$f":"IF(BK45<BJ39,0.01,IF(BK45<BJ40,0.1,IF(BK45<BJ41,1,IF(BK45<BJ42,10,100))))","v":1},"ms",null,"Higher Timer",{"$f":"IF(BO45<BN39,0.01,IF(BO45<BN40,0.1,IF(BO45<BN41,1,IF(BO45<BN42,10,100))))","v":1},"ms",null,"Higher Timer",{"$f":"IF(BS45<BR39,0.01,IF(BS45<BR40,0.1,IF(BS45<BR41,1,IF(BS45<BR42,10,100))))","v":1},"ms",null,"Higher Timer",{"$f":"IF(BW45<BV39,0.01,IF(BW45<BV40,0.1,IF(BW45<BV41,1,IF(BW45<BV42,10,100))))","v":1},"ms"]
[null,"Higher Current",{"$f":"LOOKUP(C49,B39:B43,C39:C43)","v":10},"A",null,"Higher Current",{"$f":"LOOKUP(G49,F39:F43,G39:G43)","v":141.27950821521989},"A",null,"Higher Current",{"$f":"LOOKUP(K49,J39:J43,K39:K43)","v":91.51067392309514},"A",null,"Higher Current",{"$f":"LOOKUP(O49,N39:N43,O39:O43)","v":50.754558722510708},"A",null,"Higher Current",{"$f":"LOOKUP(S49,R39:R43,S39:S43)","v":102.07581650303923},"A",null,"Higher Current",{"$f":"LOOKUP(W49,V39:V43,W39:W43)","v":64.13893191327287},"A",null,"Higher Current",{"$f":"LOOKUP(AA49,Z39:Z43,AA39:AA43)","v":34.071540092227266},"A",null,"Higher Current",{"$f":"LOOKUP(AE49,AD39:AD43,AE39:AE43)","v":33.624407288629875},"A",null,"Higher Current",{"$f":"LOOKUP(AI49,AH39:AH43,AI39:AI43)","v":50.478905964828293},"A",null,"Higher Current",{"$f":"LOOKUP(AM49,AL39:AL43,AM39:AM43)","v":31.196248311035184},"A",null,"Higher Current",{"$f":"LOOKUP(AQ49,AP39:AP43,AQ39:AQ43)","v":52.917341622686116},"A",null,"Higher Current",{"$f":"LOOKUP(AU49,AT39:AT43,AU39:AU43)","v":29.468652892692329},"A",null,"Higher Current",{"$f":"LOOKUP(AY49,AX39:AX43,AY39:AY43)","v":18.369352560002223},"A",null,"Higher Current",{"$f":"LOOKUP(BC49,BB39:BB43,BC39:BC43)","v":14.092565799736114},"A",null,"Higher Current",{"$f":"LOOKUP(BG49,BF39:BF43,BG39:BG43)","v":20.709196093355992},"A",null,"Higher Current",{"$f":"LOOKUP(BK49,BJ39:BJ43,BK39:BK43)","v":15.821883441601592},"A",null,"Higher Current",{"$f":"LOOKUP(BO49,BN39:BN43,BO39:BO43)","v":13.856868710828863},"A",null,"Higher Current",{"$f":"LOOKUP(BS49,BR39:BR43,BS39:BS43)","v":13.667662062995944},"A",null,"Higher Current",{"$f":"LOOKUP(BW49,BV39:BV43,BW39:BW43)","v":9.2920484163603145},"A"]
[]
[null,"a",{"$f":"C48/C47^C53","v":10},null,null,"a",{"$f":"G48/G47^G53","v":141.27950821521992},null,null,"a",{"$f":"K48/K47^K53","v":91.510673923095169},null,null,"a",{"$f":"O48/O47^O53","v":50.75455872251073},null,null,"a",{"$f":"S48/S47^S53","v":102.07581650303926},null,null,"a",{"$f":"W48/W47^W53","v":64.13893191327287},null,null,"a",{"$f":"AA48/AA47^AA53","v":34.071540092227274},null,null,"a",{"$f":"AE48/AE47^AE53","v":33.624407288629882},null,null,"a",{"$f":"AI48/AI47^AI53","v":50.4789059648283},null,null,"a",{"$f":"AM48/AM47^AM53","v":31.196248311035188},null,null,"a",{"$f":"AQ48/AQ47^AQ53","v":52.917341622686131},null,null,"a",{"$f":"AU48/AU47^AU53","v":29.468652892692333},null,null,"a",{"$f":"AY48/AY47^AY53","v":18.369352560002227},null,null,"a",{"$f":"BC48/BC47^BC53","v":14.092565799736116},null,null,"a",{"$f":"BG48/BG47^BG53","v":20.709196093355988},null,null,"a",{"$f":"BK48/BK47^BK53","v":15.821883441601592},null,null,"a",{"$f":"BO48/BO47^BO53","v":13.856868710828868},null,null,"a",{"$f":"BS48/BS47^BS53","v":13.667662062995948},null,null,"a",{"$f":"BW48/BW47^BW53","v":9.2920484163603181}]
[null,"m",{"$f":"IF(C49=C47,0.00000000000001,LOG(C48/C50)/LOG(C47/C49))","v":-1},null,null,"m",{"$f":"IF(G49=G47,0.00000000000001,LOG(G48/G50)/LOG(G47/G49))","v":-0.56112528626775338},null,null,"m",{"$f":"IF(K49=K47,0.00000000000001,LOG(K48/K50)/LOG(K47/K49))","v":-0.74973270706322392},null,null,"m",{"$f":"IF(O49=O47,0.00000000000001,LOG(O48/O50)/LOG(O47/O49))","v":-1.0911581992464914},null,null,"m",{"$f":"IF(S49=S47,0.00000000000001,LOG(S48/S50)/LOG(S47/S49))","v":-0.82722033483686963},null,null,"m",{"$f":"IF(W49=W47,0.00000000000001,LOG(W48/W50)/LOG(W47/W49))","v":-0.8266352040397591},null,null,"m",{"$f":"IF(AA49=AA47,0.00000000000001,LOG(AA48/AA50)/LOG(AA47/AA49))","v":-0.50262219071741665},null,null,"m",{"$f":"IF(AE49=AE47,0.00000000000001,LOG(AE48/AE50)/LOG(AE47/AE49))","v":-1.252751147688778},null,null,"m",{"$f":"IF(AI49=AI47,0.00000000000001,LOG(AI48/AI50)/LOG(AI47/AI49))","v":-0.87624156445964951},null,null,"m",{"$f":"IF(AM49=AM47,0.00000000000001,LOG(AM48/AM50)/LOG(AM47/AM49))","v":-0.51599895901769965},null,null,"m",{"$f":"IF(AQ49=AQ47,0.00000000000001,LOG(AQ48/AQ50)/LOG(AQ47/AQ49))","v":-0.69622514155974446},null,null,"m",{"$f":"IF(AU49=AU47,0.00000000000001,LOG(AU48/AU50)/LOG(AU47/AU49))","v":-0.48297449761474615},null,null,"m",{"$f":"IF(AY49=AY47,0.00000000000001,LOG(AY48/AY50)/LOG(AY47/AY49))","v":-0.54410616209128426},null,null,"m",{"$f":"IF(BC49=BC47,0.00000000000001,LOG(BC48/BC50)/LOG(BC47/BC49))","v":-0.3580944068315543},null,null,"m",{"$f":"IF(BG49=BG47,0.00000000000001,LOG(BG48/BG50)/LOG(BG47/BG49))","v":-0.50000110611863879},null,null,"m",{"$f":"IF(BK49=BK47,0.00000000000001,LOG(BK48/BK50)/LOG(BK47/BK49))","v":-0.60000776184827487},null,null,"m",{"$f":"IF(BO49=BO47,0.00000000000001,LOG(BO48/BO50)/LOG(BO47/BO49))","v":-0.73992720609917828},null,null,"m",{"$f":"IF(BS49=BS47,0.00000000000001,LOG(BS48/BS50)/LOG(BS47/BS49))","v":-0.91017423578800272},null,null,"m",{"$f":"IF(BW49=BW47,0.00000000000001,LOG(BW48/BW50)/LOG(BW47/BW49))","v":-0.5082967968037726}]
[]
[null,"Current",{"$f":"C52*C45^C53","v":10.000100001000011},"A",null,"Current",{"$f":"G52*G45^G53","v":141.28030097645279},"A",null,"Current",{"$f":"K52*K45^K53","v":91.511360014550405},"A",null,"Current",{"$f":"O52*O45^O53","v":50.755112540830332},"A",null,"Current",{"$f":"S52*S45^S53","v":102.07666090266484},"A",null,"Current",{"$f":"W52*W45^W53","v":64.139462113105964},"A",null,"Current",{"$f":"AA52*AA45^AA53","v":34.071711344635133},"A",null,"Current",{"$f":"AE52*AE45^AE53","v":33.624828523522773},"A",null,"Current",{"$f":"AI52*AI45^AI53","v":50.47934828613316},"A",null,"Current",{"$f":"AM52*AM45^AM53","v":31.196409284571907},"A",null,"Current",{"$f":"AQ52*AQ45^AQ53","v":52.917710049647425},"A",null,"Current",{"$f":"AU52*AU45^AU53","v":29.468795219825935},"A",null,"Current",{"$f":"AY52*AY45^AY53","v":18.369452509553106},"A",null,"Current",{"$f":"BC52*BC45^BC53","v":14.092616264768704},"A",null,"Current",{"$f":"BG52*BG45^BG53","v":20.709299640342127},"A",null,"Current",{"$f":"BK52*BK45^BK53","v":15.821978374889783},"A",null,"Current",{"$f":"BO52*BO45^BO53","v":13.856971242462359},"A",null,"Current",{"$f":"BS52*BS45^BS53","v":13.667786463722814},"A",null,"Current",{"$f":"BW52*BW45^BW53","v":9.2920956479009718},"A"]
[null,"Power",{"$f":"C55*VINMAX","v":140.00140001400015},"W",null,"Power",{"$f":"G55*VINMAX","v":1977.9242136703392},"W",null,"Power",{"$f":"K55*VINMAX","v":1281.1590402037057},"W",null,"Power",{"$f":"O55*VINMAX","v":710.57157557162463},"W",null,"Power",{"$f":"S55*VINMAX","v":1429.0732526373079},"W",null,"Power",{"$f":"W55*VINMAX","v":897.95246958348343},"W",null,"Power",{"$f":"AA55*VINMAX","v":477.00395882489187},"W",null,"Power",{"$f":"AE55*VINMAX","v":470.7475993293188},"W",null,"Power",{"$f":"AI55*VINMAX","v":706.71087600586429},"W",null,"Power",{"$f":"AM55*VINMAX","v":436.74972998400671},"W",null,"Power",{"$f":"AQ55*VINMAX","v":740.84794069506393},"W",null,"Power",{"$f":"AU55*VINMAX","v":412.56313307756307},"W",null,"Power",{"$f":"AY55*VINMAX","v":257.1723351337435},"W",null,"Power",{"$f":"BC55*VINMAX","v":197.29662770676185},"W",null,"Power",{"$f":"BG55*VINMAX","v":289.93019496478979},"W",null,"Power",{"$f":"BK55*VINMAX","v":221.50769724845696},"W",null,"Power",{"$f":"BO55*VINMAX","v":193.99759739447302},"W",null,"Power",{"$f":"BS55*VINMAX","v":191.34901049211939},"W",null,"Power",{"$f":"BW55*VINMAX","v":130.08933907061362},"W"]
[]
[null,"Derating Factor",{"$f":"(C6-C34)/(C6-25)","v":0.599352},null,null,"Derating Factor",{"$f":"(G6-G34)/(G6-25)","v":0.59854848000000005},null,null,"Derating Factor",{"$f":"(K6-K34)/(K6-25)","v":0.59818559999999998},null,null,"Derating Factor",{"$f":"(O6-O34)/(O6-25)","v":0.59797564800000003},null,null,"Derating Factor",{"$f":"(S6-S34)/(S6-25)","v":0.59783891999999994},null,null,"Derating Factor",{"$f":"(W6-W34)/(W6-25)","v":0.59706715200000005},null,null,"Derating Factor",{"$f":"(AA6-AA34)/(AA6-25)","v":0.5160435712},null,null,"Derating Factor",{"$f":"(AE6-AE34)/(AE6-25)","v":0.51587560960000001},null,null,"Derating Factor",{"$f":"(AI6-AI34)/(AI6-25)","v":0.59618976000000001},null,null,"Derating Factor",{"$f":"(AM6-AM34)/(AM6-25)","v":0.51528152320000009},null,null,"Derating Factor",{"$f":"(AQ6-AQ34)/(AQ6-25)","v":0.59597203199999993},null,null,"Derating Factor",{"$f":"(AU6-AU34)/(AU6-25)","v":0.51459879040000001},null,null,"Derating Factor",{"$f":"(AY6-AY34)/(AY6-25)","v":0.51311824000000006},null,null,"Derating Factor",{"$f":"(BC6-BC34)/(BC6-25)","v":0.59371310399999999},null,null,"Derating Factor",{"$f":"(BG6-BG34)/(BG6-25)","v":0.5117512192},null,null,"Derating Factor",{"$f":"(BK6-BK34)/(BK6-25)","v":0.59058067199999997},null,null,"Derating Factor",{"$f":"(BO6-BO34)/(BO6-25)","v":0.50856928000000001},null,null,"Derating Factor",{"$f":"(BS6-BS34)/(BS6-25)","v":0.50876056960000005},null,null,"Derating Factor",{"$f":"(BW6-BW34)/(BW6-25)","v":0.50402809599999998}]
[null,"Power at Hot-Short",{"$f":"C58*C56","v":83.910119101191015},"W",null,"Power at Hot-Short",{"$f":"G58*G56","v":1183.8835316475768},"W",null,"Power at Hot-Short",{"$f":"K58*K56","v":766.37088915967774},"W",null,"Power at Hot-Short",{"$f":"O58*O56","v":424.90449835282323},"W",null,"Power at Hot-Short",{"$f":"S58*S56","v":854.35560995757521},"W",null,"Power at Hot-Short",{"$f":"W58*W56","v":536.13792364557708},"W",null,"Power at Hot-Short",{"$f":"AA58*AA56","v":246.15482638853496},"W",null,"Power at Hot-Short",{"$f":"AE58*AE56","v":242.84720477174889},"W",null,"Power at Hot-Short",{"$f":"AI58*AI56","v":421.33378755532601},"W",null,"Power at Hot-Short",{"$f":"AM58*AM56","v":225.04906612334773},"W",null,"Power at Hot-Short",{"$f":"AQ58*AQ56","v":441.52465261905269},"W",null,"Power at Hot-Short",{"$f":"AU58*AU56","v":212.30448924534818},"W",null,"Power at Hot-Short",{"$f":"AY58*AY56","v":131.95981598051665},"W",null,"Power at Hot-Short",{"$f":"BC58*BC56","v":117.13759324451398},"W",null,"Power at Hot-Short",{"$f":"BG58*BG56","v":148.37213075612488},"W",null,"Power at Hot-Short",{"$f":"BK58*BK56","v":130.81816469416626},"W",null,"Power at Hot-Short",{"$f":"BO58*BO56","v":98.661218428637028},"W",null,"Power at Hot-Short",{"$f":"BS58*BS56","v":97.350831570367049},"W",null,"Power at Hot-Short",{"$f":"BW58*BW56","v":65.568681881659785},"W"]
[]
[null,"Margin",{"$f":"C59/'Design Calculator'!F52","v":12.872575089387258},null,null,"Margin",{"$f":"G59/'Design Calculator'!F52","v":181.61849633229872},null,null,"Margin",{"$f":"K59/'Design Calculator'!F52","v":117.56826140517784},null,null,"Margin",{"$f":"O59/'Design Calculator'!F52","v":65.184212815489929},null,null,"Margin",{"$f":"S59/'Design Calculator'!F52","v":131.06591743667349},null,null,"Margin",{"$f":"W59/'Design Calculator'!F52","v":82.248431468355577},null,null,"Margin",{"$f":"AA59/'Design Calculator'!F52","v":37.762388139150254},null,null,"Margin",{"$f":"AE59/'Design Calculator'!F52","v":37.25496891384784},null,null,"Margin",{"$f":"AI59/'Design Calculator'!F52","v":64.636433318146601},null,null,"Margin",{"$f":"AM59/'Design Calculator'!F52","v":34.524572643922667},null,null,"Margin",{"$f":"AQ59/'Design Calculator'!F52","v":67.733895572241039},null,null,"Margin",{"$f":"AU59/'Design Calculator'!F52","v":32.569438691047736},null,null,"Margin",{"$f":"AY59/'Design Calculator'!F52","v":20.243835406101987},null,null,"Margin",{"$f":"BC59/'Design Calculator'!F52","v":17.96997169091976},null,null,"Margin",{"$f":"BG59/'Design Calculator'!F52","v":22.761633695541885},null,null,"Margin",{"$f":"BK59/'Design Calculator'!F52","v":20.068695720127778},null,null,"Margin",{"$f":"BO59/'Design Calculator'!F52","v":15.135527827120454},null,null,"Margin",{"$f":"BS59/'Design Calculator'!F52","v":14.934502570454036},null,null,"Margin",{"$f":"BW59/'Design Calculator'!F52","v":10.058831879572809}]
[]
[null,"Selected FET",{"$f":"IF(C61>1.3,1,0)","v":1},null,null,"Selected FET",{"$f":"IF(G61>1.3,1,0)","v":1},null,null,"Selected FET",{"$f":"IF(K61>1.3,1,0)","v":1},null,null,"Selected FET",{"$f":"IF(O61>1.3,1,0)","v":1},null,null,"Selected FET",{"$f":"IF(S61>1.3,1,0)","v":1},null,null,"Selected FET",{"$f":"IF(W61>1.3,1,0)","v":1},null,null,"Selected FET",{"$f":"IF(AA61>1.3,1,0)","v":1},null,null,"Selected FET",{"$f":"IF(AE61>1.3,1,0)","v":1},null,null,"Selected FET",{"$f":"IF(AI61>1.3,1,0)","v":1},null,null,"Selected FET",{"$f":"IF(AM61>1.3,1,0)","v":1},null,null,"Selected FET",{"$f":"IF(AQ61>1.3,1,0)","v":1},null,null,"Selected FET",{"$f":"IF(AU61>1.3,1,0)","v":1},null,null,"Selected FET",{"$f":"IF(AY61>1.3,1,0)","v":1},null,null,"Selected FET",{"$f":"IF(BC61>1.3,1,0)","v":1},null,null,"Selected FET",{"$f":"IF(BG61>1.3,1,0)","v":1},null,null,"Selected FET",{"$f":"IF(BK61>1.3,1,0)","v":1},null,null,"Selected FET",{"$f":"IF(BO61>1.3,1,0)","v":1},null,null,"Selected FET",{"$f":"IF(BS61>1.3,1,0)","v":1},null,null,"Selected FET",{"$f":"IF(BW61>1.3,1,0)","v":1}]
[null,null,{"$f":"COLUMN()","v":3},null,null,null,{"$f":"COLUMN()","v":7},null,null,null,{"$f":"COLUMN()","v":11},null,null,null,{"$f":"COLUMN()","v":15},null,null,null,{"$f":"COLUMN()","v":19},null,null,null,{"$f":"COLUMN()","v":23},null,null,null,{"$f":"COLUMN()","v":27},null,null,null,{"$f":"COLUMN()","v":31},null,null,null,{"$f":"COLUMN()","v":35},null,null,null,{"$f":"COLUMN()","v":39},null,null,null,{"$f":"COLUMN()","v":43},null,null,null,{"$f":"COLUMN()","v":47},null,null,null,{"$f":"COLUMN()","v":51},null,null,null,{"$f":"COLUMN()","v":55},null,null,null,{"$f":"COLUMN()","v":59},null,null,null,{"$f":"COLUMN()","v":63},null,null,null,{"$f":"COLUMN()","v":67},null,null,null,{"$f":"COLUMN()","v":71},null,null,null,{"$f":"COLUMN()","v":75}]
[]
[]
[null,"FET1",{"$f":"LEFT('Design Calculator'!F54,FIND(\" \",'Design Calculator'!F54)-1)","v":"CSD18532NQ5B"},null,null,"FET2",{"$f":"LEFT('Design Calculator'!G54,FIND(\" \",'Design Calculator'!G54)-1)","v":"CSD18540Q5B"},null,null,"FET3",{"$f":"B4","v":"NON-TI MOSFET"}]
[null,"Column Number",{"$f":"MATCH(SFET24_1,B4:BV4,0)+2","v":31},null,null,"Column Number",{"$f":"MATCH(SFET24_2,B4:BV4,0)+2","v":15},null,null,"Column Number",{"$f":"COLUMN(C:C)","v":3}]
[]
[null,0.01,{"$f":"INDIRECT(ADDRESS(39,C68))","v":400},"A",null,0.01,{"$f":"INDIRECT(ADDRESS(39,G68))","v":400},"A",null,0.01,{"$f":"INDIRECT(ADDRESS(39,K68))","v":400},"A"]
[null,0.1,{"$f":"INDIRECT(ADDRESS(40,C68))","v":601.73570974983545},"A",null,0.1,{"$f":"INDIRECT(ADDRESS(40,G68))","v":626.08493738234574},"A",null,0.1,{"$f":"INDIRECT(ADDRESS(40,K68))","v":100},"A"]
[null,1,{"$f":"INDIRECT(ADDRESS(41,C68))","v":33.624407288629875},"A",null,1,{"$f":"INDIRECT(ADDRESS(41,G68))","v":50.754558722510708},"A",null,1,{"$f":"INDIRECT(ADDRESS(41,K68))","v":10},"A"]
[null,10,{"$f":"INDIRECT(ADDRESS(42,C68))","v":11.98008745545671},"A",null,10,{"$f":"INDIRECT(ADDRESS(42,G68))","v":17.15082098001713},"A",null,10,{"$f":"INDIRECT(ADDRESS(42,K68))","v":2},"A"]
[null,100,{"$f":"INDIRECT(ADDRESS(43,C68))","v":4.9306775809066696},"A",null,100,{"$f":"INDIRECT(ADDRESS(43,G68))","v":5.5916046225844749},"A",null,100,{"$f":"INDIRECT(ADDRESS(43,K68))","v":0.1},"A"]
[]
[null,"MOSFET Power Dissipation",{"$f":"INDIRECT(ADDRESS(33,C68))","v":1.7184959999999999E-2},"W",null,"MOSFET Power Dissipation",{"$f":"INDIRECT(ADDRESS(33,G68))","v":1.0121760000000002E-2},"W",null,"MOSFET Power Dissipation",{"$f":"INDIRECT(ADDRESS(33,K68))","v":3.2400000000000003E-3},"W"]
[null,"Number of FETs",{"$f":"INDIRECT(ADDRESS(32,C68))","v":1},null,null,"Number of FETs",{"$f":"INDIRECT(ADDRESS(32,G68))","v":1},null,null,"Number of FETs",{"$f":"INDIRECT(ADDRESS(32,K68))","v":1}]
[null,"Junction Temperature",{"$f":"INDIRECT(ADDRESS(34,C68))","v":85.515548800000005},"°C",null,"Junction Temperature",{"$f":"INDIRECT(ADDRESS(34,G68))","v":85.303652799999995},"°C",null,"Junction Temperature",{"$f":"INDIRECT(ADDRESS(34,K68))","v":85.097200000000001},"°C"]
[null,"Maximum Junction Temperature",{"$f":"INDIRECT(ADDRESS(6,C68))","v":150},"°C",null,"Maximum Junction Temperature",{"$f":"INDIRECT(ADDRESS(6,G68))","v":175},"°C",null,"Maximum Junction Temperature",{"$f":"INDIRECT(ADDRESS(6,K68))","v":175},"°C"]
[null,"On resistance at Junction temp",{"$f":"INDIRECT(ADDRESS(7,C68))*INDIRECT(ADDRESS(29,C68))","v":5.3040000000000003},"mΩ",null,"On resistance at Junction temp",{"$f":"INDIRECT(ADDRESS(7,G68))*INDIRECT(ADDRESS(29,G68))","v":3.1240000000000001},"mΩ",null,"On resistance at Junction temp",{"$f":"INDIRECT(ADDRESS(7,K68))","v":1},"mΩ"]
[null,"Margin",{"$f":"INDIRECT(ADDRESS(61,C68))","v":37.25496891384784},null,null,"Margin",{"$f":"INDIRECT(ADDRESS(61,G68))","v":65.184212815489929},null,null,"Margin",{"$f":"INDIRECT(ADDRESS(61,K68))","v":12.872575089387258}]
[null,"webpage link",{"$f":"HYPERLINK(INDIRECT(ADDRESS(5,C68)))","v":"https://www.ti.com/product/CSD18532NQ5B"},null,null,"webpage link",{"$f":"HYPERLINK(INDIRECT(ADDRESS(5,G68)))","v":"https://www.ti.com/product/CSD18540Q5B"},null,null,"webpage link",{"$f":"INDIRECT(ADDRESS(5,K68))","v":"Enter webpage link"}]
[null,"datasheet link",{"$f":"HYPERLINK(INDIRECT(ADDRESS(30,C68)))","v":"https://www.ti.com/lit/gpn/csd18532nq5b"},null,null,"datasheet link",{"$f":"HYPERLINK(INDIRECT(ADDRESS(30,G68)))","v":"https://www.ti.com/lit/gpn/csd18540q5b"},null,null,"datasheet link",{"$f":"INDIRECT(ADDRESS(30,K68))","v":"Not Applicable"}]
[null,"cost 1k USD",{"$f":"INDIRECT(ADDRESS(35,C68))","v":0.84499999999999997},"$",null,"cost 1k USD",{"$f":"INDIRECT(ADDRESS(35,G68))","v":0.86699999999999999},"$",null,"cost 1k USD",{"$f":"INDIRECT(ADDRESS(35,K68))","v":"Enter cost details"},"$"]

{"sheet":"MOSFET Database 48V","index":5,"n_rows":84,"n_cols":40,"rows_kept":84,"cut":false,"hidden":true,"merged":[]}
[]
[]
[]
[null,"CSD19536KTT",1,null,null,"CSD19535KTT",2,null,null,"CSD19532Q5B",3,null,null,"CSD19532KTT",4,null,null,"CSD19531Q5A",5,null,null,"CSD19533Q5A",6,null,null,"CSD19537Q3",7,null,null,"CSD19534Q5A",8,null,null,"CSD19538Q2",9,null,null,"CSD19538Q3A",10]
[null,"Webpage","https://www.ti.com/product/CSD19536KTT",null,null,"Webpage","https://www.ti.com/product/CSD19535KTT",null,null,"Webpage","https://www.ti.com/product/CSD19532Q5B",null,null,"Webpage","https://www.ti.com/product/CSD19532KTT",null,null,"Webpage","https://www.ti.com/product/CSD19531Q5A",null,null,"Webpage","https://www.ti.com/product/CSD19533Q5A",null,null,"Webpage","https://www.ti.com/product/CSD19537Q3",null,null,"Webpage","https://www.ti.com/product/CSD19534Q5A",null,null,"Webpage","https://www.ti.com/product/CSD19538Q2",null,null,"Webpage","https://www.ti.com/product/CSD19538Q3A"]
[null,"Maximum Junction Temperature",175,"°C",null,"Maximum Junction Temperature",175,"°C",null,"Maximum Junction Temperature",150,"°C",null,"Maximum Junction Temperature",175,"°C",null,"Maximum Junction Temperature",150,"°C",null,"Maximum Junction Temperature",150,"°C",null,"Maximum Junction Temperature",150,"°C",null,"Maximum Junction Temperature",150,"°C",null,"Maximum Junction Temperature",150,"°C",null,"Maximum Junction Temperature",150,"°C"]
[null,"Maximum Rds(on)",2.4,"mΩ",null,"Maximum Rds(on)",3.4,"mΩ",null,"Maximum Rds(on)",4.9000000000000004,"mΩ",null,"Maximum Rds(on)",5.6,"mΩ",null,"Maximum Rds(on)",6.4,"mΩ",null,"Maximum Rds(on)",9.4,"mΩ",null,"Maximum Rds(on)",14.5,"mΩ",null,"Maximum Rds(on)",15.1,"mΩ",null,"Maximum Rds(on)",59,"mΩ",null,"Maximum Rds(on)",59,"mΩ"]
[]
[null,"Rds(on) vs Temperature",null,null,null,"Rds(on) vs Temperature",null,null,null,"Rds(on) vs Temperature",null,null,null,"Rds(on) vs Temperature",null,null,null,"Rds(on) vs Temperature",null,null,null,"Rds(on) vs Temperature",null,null,null,"Rds(on) vs Temperature",null,null,null,"Rds(on) vs Temperature",null,null,null,"Rds(on) vs Temperature",null,null,null,"Rds(on) vs Temperature"]
[]
[null,70,1.25,null,null,70,1.33,null,null,70,1.33,null,null,70,1.33,null,null,70,1.31,null,null,70,1.34,null,null,70,1.34,null,null,70,1.3,null,null,70,1.32,null,null,70,1.28]
[null,75,1.28,null,null,75,1.37,null,null,75,1.37,null,null,75,1.37,null,null,75,1.35,null,null,75,1.38,null,null,75,1.38,null,null,75,1.34,null,null,75,1.36,null,null,75,1.32]
[null,80,1.31,null,null,80,1.41,null,null,80,1.41,null,null,80,1.42,null,null,80,1.39,null,null,80,1.42,null,null,80,1.43,null,null,80,1.38,null,null,80,1.4,null,null,80,1.35]
[null,85,1.35,null,null,85,1.45,null,null,85,1.46,null,null,85,1.46,null,null,85,1.43,null,null,85,1.46,null,null,85,1.47,null,null,85,1.41,null,null,85,1.45,null,null,85,1.39]
[null,90,1.38,null,null,90,1.49,null,null,90,1.5,null,null,90,1.51,null,null,90,1.47,null,null,90,1.51,null,null,90,1.52,null,null,90,1.45,null,null,90,1.49,null,null,90,1.42]
[null,95,1.41,null,null,95,1.54,null,null,95,1.55,null,null,95,1.55,null,null,95,1.52,null,null,95,1.56,null,null,95,1.56,null,null,95,1.49,null,null,95,1.53,null,null,95,1.46]
[null,100,1.44,null,null,100,1.58,null,null,100,1.59,null,null,100,1.6,null,null,100,1.56,null,null,100,1.6,null,null,100,1.61,null,null,100,1.53,null,null,100,1.58,null,null,100,1.5]
[null,105,1.48,null,null,105,1.63,null,null,105,1.64,null,null,105,1.64,null,null,105,1.61,null,null,105,1.65,null,null,105,1.66,null,null,105,1.57,null,null,105,1.63,null,null,105,1.53]
[null,110,1.51,null,null,110,1.68,null,null,110,1.69,null,null,110,1.69,null,null,110,1.65,null,null,110,1.7,null,null,110,1.71,null,null,110,1.6,null,null,110,1.67,null,null,110,1.57]
[null,115,1.55,null,null,115,1.73,null,null,115,1.74,null,null,115,1.74,null,null,115,1.7,null,null,115,1.75,null,null,115,1.76,null,null,115,1.64,null,null,115,1.72,null,null,115,1.61]
[null,120,1.58,null,null,120,1.78,null,null,120,1.79,null,null,120,1.79,null,null,120,1.75,null,null,120,1.8,null,null,120,1.81,null,null,120,1.68,null,null,120,1.77,null,null,120,1.65]
[null,125,1.62,null,null,125,1.83,null,null,125,1.84,null,null,125,1.84,null,null,125,1.8,null,null,125,1.85,null,null,125,1.86,null,null,125,1.73,null,null,125,1.82,null,null,125,1.69]
[null,130,1.65,null,null,130,1.88,null,null,130,1.89,null,null,130,1.9,null,null,130,1.85,null,null,130,1.91,null,null,130,1.91,null,null,130,1.77,null,null,130,1.87,null,null,130,1.73]
[]
[null,"Maximum Load Current",{"$f":"IOUTMAX","v":1.8},"A",null,"Maximum Load Current",{"$f":"IOUTMAX","v":1.8},"A",null,"Maximum Load Current",{"$f":"IOUTMAX","v":1.8},"A",null,"Maximum Load Current",{"$f":"IOUTMAX","v":1.8},"A",null,"Maximum Load Current",{"$f":"IOUTMAX","v":1.8},"A",null,"Maximum Load Current",{"$f":"IOUTMAX","v":1.8},"A",null,"Maximum Load Current",{"$f":"IOUTMAX","v":1.8},"A",null,"Maximum Load Current",{"$f":"IOUTMAX","v":1.8},"A",null,"Maximum Load Current",{"$f":"IOUTMAX","v":1.8},"A",null,"Maximum Load Current",{"$f":"IOUTMAX","v":1.8},"A"]
[null,"Maximum Ambient Temperature",{"$f":"TAMB","v":85},"°C",null,"Maximum Ambient Temperature",{"$f":"TAMB","v":85},"°C",null,"Maximum Ambient Temperature",{"$f":"TAMB","v":85},"°C",null,"Maximum Ambient Temperature",{"$f":"TAMB","v":85},"°C",null,"Maximum Ambient Temperature",{"$f":"TAMB","v":85},"°C",null,"Maximum Ambient Temperature",{"$f":"TAMB","v":85},"°C",null,"Maximum Ambient Temperature",{"$f":"TAMB","v":85},"°C",null,"Maximum Ambient Temperature",{"$f":"TAMB","v":85},"°C",null,"Maximum Ambient Temperature",{"$f":"TAMB","v":85},"°C",null,"Maximum Ambient Temperature",{"$f":"TAMB","v":85},"°C"]
[null,"RQJA",{"$f":"ThetaJA","v":30},"°C/W",null,"RQJA",{"$f":"ThetaJA","v":30},"°C/W",null,"RQJA",{"$f":"ThetaJA","v":30},"°C/W",null,"RQJA",{"$f":"ThetaJA","v":30},"°C/W",null,"RQJA",{"$f":"ThetaJA","v":30},"°C/W",null,"RQJA",{"$f":"ThetaJA","v":30},"°C/W",null,"RQJA",{"$f":"ThetaJA","v":30},"°C/W",null,"RQJA",{"$f":"ThetaJA","v":30},"°C/W",null,"RQJA",{"$f":"ThetaJA","v":30},"°C/W",null,"RQJA",{"$f":"ThetaJA","v":30},"°C/W"]
[null,"Operation Temp required ",{"$f":"'Design Calculator'!F25","v":100},"°C",null,"Operation Temp required ",{"$f":"'Design Calculator'!F25","v":100},"°C",null,"Operation Temp required ",{"$f":"'Design Calculator'!F25","v":100},"°C",null,"Operation Temp required ",{"$f":"'Design Calculator'!F25","v":100},"°C",null,"Operation Temp required ",{"$f":"'Design Calculator'!F25","v":100},"°C",null,"Operation Temp required ",{"$f":"'Design Calculator'!F25","v":100},"°C",null,"Operation Temp required ",{"$f":"'Design Calculator'!F25","v":100},"°C",null,"Operation Temp required ",{"$f":"'Design Calculator'!F25","v":100},"°C",null,"Operation Temp required ",{"$f":"'Design Calculator'!F25","v":100},"°C",null,"Operation Temp required ",{"$f":"'Design Calculator'!F25","v":100},"°C"]
[null,null,{"$f":"LOOKUP(C28,B11:B23,C11:C23)","v":1.44},null,null,null,{"$f":"LOOKUP(G28,F11:F23,G11:G23)","v":1.58},null,null,null,{"$f":"LOOKUP(K28,J11:J23,K11:K23)","v":1.59},null,null,null,{"$f":"LOOKUP(O28,N11:N23,O11:O23)","v":1.6},null,null,null,{"$f":"LOOKUP(S28,R11:R23,S11:S23)","v":1.56},null,null,null,{"$f":"LOOKUP(W28,V11:V23,W11:W23)","v":1.6},null,null,null,{"$f":"LOOKUP(AA28,Z11:Z23,AA11:AA23)","v":1.61},null,null,null,{"$f":"LOOKUP(AE28,AD11:AD23,AE11:AE23)","v":1.53},null,null,null,{"$f":"LOOKUP(AI28,AH11:AH23,AI11:AI23)","v":1.58},null,null,null,{"$f":"LOOKUP(AM28,AL11:AL23,AM11:AM23)","v":1.5}]
[null,"datasheet","https://www.ti.com/lit/gpn/csd19536ktt",null,null,"datasheet","https://www.ti.com/lit/gpn/csd19535ktt",null,null,"datasheet","https://www.ti.com/lit/gpn/csd19532q5b",null,null,"datasheet","https://www.ti.com/lit/gpn/csd19532ktt",null,null,"datasheet","https://www.ti.com/lit/gpn/csd19531q5a",null,null,"datasheet","https://www.ti.com/lit/gpn/csd19533q5a",null,null,"datasheet","https://www.ti.com/lit/gpn/csd19537q3",null,null,"datasheet","https://www.ti.com/lit/gpn/csd19534q5a",null,null,"datasheet","https://www.ti.com/lit/gpn/csd19538q2",null,null,"datasheet","https://www.ti.com/lit/gpn/csd19538q3a"]
[null,"Number of FETs",{"$f":"SQRT((C25*C25*C29*C7*C27)/(1000*(C28-C26)))","v":0.149649189773951},null,null,"Number of FETs",{"$f":"SQRT((G25*G25*G29*G7*G27)/(1000*(G28-G26)))","v":0.18657588268583913},null,null,"Number of FETs",{"$f":"SQRT((K25*K25*K29*K7*K27)/(1000*(K28-K26)))","v":0.22469018670160032},null,null,"Number of FETs",{"$f":"SQRT((O25*O25*O29*O7*O27)/(1000*(O28-O26)))","v":0.24095808764181378},null,null,"Number of FETs",{"$f":"SQRT((S25*S25*S29*S7*S27)/(1000*(S28-S26)))","v":0.25435471295024198},null,null,"Number of FETs",{"$f":"SQRT((W25*W25*W29*W7*W27)/(1000*(W28-W26)))","v":0.31218456079697476},null,null,"Number of FETs",{"$f":"SQRT((AA25*AA25*AA29*AA7*AA27)/(1000*(AA28-AA26)))","v":0.38894164086659588},null,null,"Number of FETs",{"$f":"SQRT((AE25*AE25*AE29*AE7*AE27)/(1000*(AE28-AE26)))","v":0.38692045694173366},null,null,"Number of FETs",{"$f":"SQRT((AI25*AI25*AI29*AI7*AI27)/(1000*(AI28-AI26)))","v":0.77721657213417672},null,null,"Number of FETs",{"$f":"SQRT((AM25*AM25*AM29*AM7*AM27)/(1000*(AM28-AM26)))","v":0.75728462284665476}]
[null,"FET round-up",{"$f":"CEILING(C31,1)","v":1},null,null,"FET round-up",{"$f":"CEILING(G31,1)","v":1},null,null,"FET round-up",{"$f":"CEILING(K31,1)","v":1},null,null,"FET round-up",{"$f":"CEILING(O31,1)","v":1},null,null,"FET round-up",{"$f":"CEILING(S31,1)","v":1},null,null,"FET round-up",{"$f":"CEILING(W31,1)","v":1},null,null,"FET round-up",{"$f":"CEILING(AA31,1)","v":1},null,null,"FET round-up",{"$f":"CEILING(AE31,1)","v":1},null,null,"FET round-up",{"$f":"CEILING(AI31,1)","v":1},null,null,"FET round-up",{"$f":"CEILING(AM31,1)","v":1}]
[null,"FET power dissipation",{"$f":"C25*C25*C29*C7/(1000*C32*C32)","v":1.1197439999999999E-2},"W",null,"FET power dissipation",{"$f":"G25*G25*G29*G7/(1000*G32*G32)","v":1.7405280000000002E-2},"W",null,"FET power dissipation",{"$f":"K25*K25*K29*K7/(1000*K32*K32)","v":2.5242840000000002E-2},"W",null,"FET power dissipation",{"$f":"O25*O25*O29*O7/(1000*O32*O32)","v":2.9030400000000005E-2},"W",null,"FET power dissipation",{"$f":"S25*S25*S29*S7/(1000*S32*S32)","v":3.2348160000000001E-2},"W",null,"FET power dissipation",{"$f":"W25*W25*W29*W7/(1000*W32*W32)","v":4.8729600000000012E-2},"W",null,"FET power dissipation",{"$f":"AA25*AA25*AA29*AA7/(1000*AA32*AA32)","v":7.5637800000000019E-2},"W",null,"FET power dissipation",{"$f":"AE25*AE25*AE29*AE7/(1000*AE32*AE32)","v":7.4853719999999999E-2},"W",null,"FET power dissipation",{"$f":"AI25*AI25*AI29*AI7/(1000*AI32*AI32)","v":0.30203279999999999},"W",null,"FET power dissipation",{"$f":"AM25*AM25*AM29*AM7/(1000*AM32*AM32)","v":0.28673999999999999},"W"]
[null,"Operating Temperature",{"$f":"C26+C33*C27","v":85.335923199999996},"°C",null,"Operating Temperature",{"$f":"G26+G33*G27","v":85.522158399999995},"°C",null,"Operating Temperature",{"$f":"K26+K33*K27","v":85.757285199999998},"°C",null,"Operating Temperature",{"$f":"O26+O33*O27","v":85.870912000000004},"°C",null,"Operating Temperature",{"$f":"S26+S33*S27","v":85.970444799999996},"°C",null,"Operating Temperature",{"$f":"W26+W33*W27","v":86.461888000000002},"°C",null,"Operating Temperature",{"$f":"AA26+AA33*AA27","v":87.269133999999994},"°C",null,"Operating Temperature",{"$f":"AE26+AE33*AE27","v":87.245611600000004},"°C",null,"Operating Temperature",{"$f":"AI26+AI33*AI27","v":94.060984000000005},"°C",null,"Operating Temperature",{"$f":"AM26+AM33*AM27","v":93.602199999999996},"°C"]
[null,"cost 1k USD",1.972,null,null,"cost 1k USD",1.3129999999999999,null,null,"cost 1k USD",0.89600000000000002,null,null,"cost 1k USD",0.91400000000000003,null,null,"cost 1k USD",0.61099999999999999,null,null,"cost 1k USD",0.48,null,null,"cost 1k USD",0.40100000000000002,null,null,"cost 1k USD",0.33500000000000002,null,null,"cost 1k USD",0.16200000000000001,null,null,"cost 1k USD",0.16200000000000001]
[]
[]
[null,"Time(ms)",null,null,null,"Time(ms)",null,null,null,"Time(ms)",null,null,null,"Time(ms)",null,null,null,"Time(ms)",null,null,null,"Time(ms)",null,null,null,"Time(ms)",null,null,null,"Time(ms)",null,null,null,"Time(ms)",null,null,null,"Time(ms)"]
[null,0.01,400,"A",null,0.01,400,"A",null,0.01,{"$f":"30220*VINMAX^-1.615","v":425.89023489315292},"A",null,0.01,{"$f":"17178*VINMAX^-1","v":1227},"A",null,0.01,{"$f":"52855*VINMAX^-1.635","v":706.58878306612723},"A",null,0.01,{"$f":"14788*VINMAX^-1.324","v":449.19604381493076},"A",null,0.01,{"$f":"8327.2*VINMAX^-1","v":594.80000000000007},"A",null,0.01,{"$f":"11099*VINMAX^-1.441","v":247.57874206722164},"A",null,0.01,34.4,"A",null,0.01,37,"A"]
[null,0.1,{"$f":"81187*VINMAX^-1.57","v":1288.4437932766182},"A",null,0.1,{"$f":"21797*VINMAX^-1.499","v":417.20624319799009},"A",null,0.1,{"$f":"7262.7*VINMAX^-1.615","v":102.35317700061223},"A",null,0.1,{"$f":"89244.4*VINMAX^-1.866","v":648.49414521066194},"A",null,0.1,{"$f":"10071*VINMAX^-1.635","v":134.63353768345414},"A",null,0.1,{"$f":"2234.1*VINMAX^-1.324","v":67.862380408908351},"A",null,0.1,{"$f":"6972.3*VINMAX^-1.544","v":118.50983086830868},"A",null,0.1,{"$f":"2301*VINMAX^-1.441","v":51.327028155390302},"A",null,0.1,{"$f":"6382.61*VINMAX^-1.811","v":53.624151788532579},"A",null,0.1,{"$f":"7915.7*VINMAX^-1.854","v":59.370122936802133},"A"]
[null,1,{"$f":"7406.1*VINMAX^-1.57","v":117.53536375757156},"A",null,1,{"$f":"2910.8*VINMAX^-1.499","v":55.714269518773669},"A",null,1,{"$f":"2213.6*VINMAX^-1.615","v":31.196248311035184},"A",null,1,{"$f":"4961.45*VINMAX^-1.771","v":46.32504691733385},"A",null,1,{"$f":"2529.8*VINMAX^-1.635","v":33.819474097071023},"A",null,1,{"$f":"462.49*VINMAX^-1.324","v":14.048463504460869},"A",null,1,{"$f":"780.45*VINMAX^-1.544","v":13.265493094268965},"A",null,1,{"$f":"620.07*VINMAX^-1.441","v":13.831529921039925},"A",null,1,{"$f":"297.466*VINMAX^-1.587","v":4.5136942872690584},"A",null,1,{"$f":"417.872*VINMAX^-1.615","v":5.8890669832981999},"A"]
[null,10,{"$f":"2304.5*VINMAX^-1.57","v":36.572588242033412},"A",null,10,{"$f":"868.34*VINMAX^-1.499","v":16.620492233726786},"A",null,10,{"$f":"822.43*VINMAX^-1.615","v":11.590499863771534},"A",null,10,{"$f":"700.975*VINMAX^-1.653","v":8.9362001278894869},"A",null,10,{"$f":"800*VINMAX^-1.635","v":10.694750287634127},"A",null,10,{"$f":"124.48*VINMAX^-1.324","v":3.7811687539953058},"A",null,10,{"$f":"294.05*VINMAX^-1.544","v":4.9980373430325962},"A",null,10,{"$f":"207.91*VINMAX^-1.441","v":4.6377237826106903},"A",null,10,{"$f":"58.33815*VINMAX^-1.39","v":1.4887942514029864},"A",null,10,{"$f":"100.1*VINMAX^-1.471","v":2.0629074153968112},"A"]
[null,100,{"$f":"1175.8*VINMAX^-1.57","v":18.660034391400686},"A",null,100,{"$f":"509.52*VINMAX^-1.499","v":9.7524854353461432},"A",null,100,{"$f":"266.13*VINMAX^-1.615","v":3.7505681076146522},"A",null,100,{"$f":"284.092*VINMAX^-1.545","v":4.8160522399297596},"A",null,100,{"$f":"241.6*VINMAX^-1.635","v":3.2298145868655066},"A",null,100,{"$f":"75.006*VINMAX^-1.324","v":2.2783607291305583},"A",null,100,{"$f":"75.64*VINMAX^-1.312","v":2.3715459150548845},"A",null,100,{"$f":"103.96*VINMAX^-1.441","v":2.3189734233091595},"A",null,100,{"$f":"15.90615*VINMAX^-1.222","v":0.63240692086604899},"A",null,100,{"$f":"20.2878*VINMAX^-1.191","v":0.87537968641729347},"A"]
[]
[null,"Timer Duration",{"$f":"IF('Design Calculator'!F30=\"Soft Start\",'Design Calculator'!F31-0.00001,'Design Calculator'!F79)","v":0.99999000000000005},"ms",null,"Timer Duration",{"$f":"IF('Design Calculator'!F30=\"Soft Start\",'Design Calculator'!F31-0.00001,'Design Calculator'!F79)","v":0.99999000000000005},"ms",null,"Timer Duration",{"$f":"IF('Design Calculator'!F30=\"Soft Start\",'Design Calculator'!F31-0.00001,'Design Calculator'!F79)","v":0.99999000000000005},"ms",null,"Timer Duration",{"$f":"IF('Design Calculator'!F30=\"Soft Start\",'Design Calculator'!F31-0.00001,'Design Calculator'!F79)","v":0.99999000000000005},"ms",null,"Timer Duration",{"$f":"IF('Design Calculator'!F30=\"Soft Start\",'Design Calculator'!F31-0.00001,'Design Calculator'!F79)","v":0.99999000000000005},"ms",null,"Timer Duration",{"$f":"IF('Design Calculator'!F30=\"Soft Start\",'Design Calculator'!F31-0.00001,'Design Calculator'!F79)","v":0.99999000000000005},"ms",null,"Timer Duration",{"$f":"IF('Design Calculator'!F30=\"Soft Start\",'Design Calculator'!F31-0.00001,'Design Calculator'!F79)","v":0.99999000000000005},"ms",null,"Timer Duration",{"$f":"IF('Design Calculator'!F30=\"Soft Start\",'Design Calculator'!F31-0.00001,'Design Calculator'!F79)","v":0.99999000000000005},"ms",null,"Timer Duration",{"$f":"IF('Design Calculator'!F30=\"Soft Start\",'Design Calculator'!F31-0.00001,'Design Calculator'!F79)","v":0.99999000000000005},"ms",null,"Timer Duration",{"$f":"IF('Design Calculator'!F30=\"Soft Start\",'Design Calculator'!F31-0.00001,'Design Calculator'!F79)","v":0.99999000000000005},"ms"]
[]
[null,"Lower time",{"$f":"IF(C45>B42,10,IF(C45>B41,1,IF(C45>B40,0.1,0.01)))","v":0.1},"ms",null,"Lower time",{"$f":"IF(G45>F42,10,IF(G45>F41,1,IF(G45>F40,0.1,0.01)))","v":0.1},"ms",null,"Lower time",{"$f":"IF(K45>J42,10,IF(K45>J41,1,IF(K45>J40,0.1,0.01)))","v":0.1},"ms",null,"Lower time",{"$f":"IF(O45>N42,10,IF(O45>N41,1,IF(O45>N40,0.1,0.01)))","v":0.1},"ms",null,"Lower time",{"$f":"IF(S45>R42,10,IF(S45>R41,1,IF(S45>R40,0.1,0.01)))","v":0.1},"ms",null,"Lower time",{"$f":"IF(W45>V42,10,IF(W45>V41,1,IF(W45>V40,0.1,0.01)))","v":0.1},"ms",null,"Lower time",{"$f":"IF(AA45>Z42,10,IF(AA45>Z41,1,IF(AA45>Z40,0.1,0.01)))","v":0.1},"ms",null,"Lower time",{"$f":"IF(AE45>AD42,10,IF(AE45>AD41,1,IF(AE45>AD40,0.1,0.01)))","v":0.1},"ms",null,"Lower time",{"$f":"IF(AI45>AH42,10,IF(AI45>AH41,1,IF(AI45>AH40,0.1,0.01)))","v":0.1},"ms",null,"Lower time",{"$f":"IF(AM45>AL42,10,IF(AM45>AL41,1,IF(AM45>AL40,0.1,0.01)))","v":0.1},"ms"]
[null,"Lower Current",{"$f":"LOOKUP(C47,B39:B43,C39:C43)","v":1288.4437932766182},"A",null,"Lower Current",{"$f":"LOOKUP(G47,F39:F43,G39:G43)","v":417.20624319799009},"A",null,"Lower Current",{"$f":"LOOKUP(K47,J39:J43,K39:K43)","v":102.35317700061223},"A",null,"Lower Current",{"$f":"LOOKUP(O47,N39:N43,O39:O43)","v":648.49414521066194},"A",null,"Lower Current",{"$f":"LOOKUP(S47,R39:R43,S39:S43)","v":134.63353768345414},"A",null,"Lower Current",{"$f":"LOOKUP(W47,V39:V43,W39:W43)","v":67.862380408908351},"A",null,"Lower Current",{"$f":"LOOKUP(AA47,Z39:Z43,AA39:AA43)","v":118.50983086830868},"A",null,"Lower Current",{"$f":"LOOKUP(AE47,AD39:AD43,AE39:AE43)","v":51.327028155390302},"A",null,"Lower Current",{"$f":"LOOKUP(AI47,AH39:AH43,AI39:AI43)","v":53.624151788532579},"A",null,"Lower Current",{"$f":"LOOKUP(AM47,AL39:AL43,AM39:AM43)","v":59.370122936802133},"A"]
[null,"Higher Timer",{"$f":"IF(C45<B39,0.01,IF(C45<B40,0.1,IF(C45<B41,1,IF(C45<B42,10,100))))","v":1},"ms",null,"Higher Timer",{"$f":"IF(G45<F39,0.01,IF(G45<F40,0.1,IF(G45<F41,1,IF(G45<F42,10,100))))","v":1},"ms",null,"Higher Timer",{"$f":"IF(K45<J39,0.01,IF(K45<J40,0.1,IF(K45<J41,1,IF(K45<J42,10,100))))","v":1},"ms",null,"Higher Timer",{"$f":"IF(O45<N39,0.01,IF(O45<N40,0.1,IF(O45<N41,1,IF(O45<N42,10,100))))","v":1},"ms",null,"Higher Timer",{"$f":"IF(S45<R39,0.01,IF(S45<R40,0.1,IF(S45<R41,1,IF(S45<R42,10,100))))","v":1},"ms",null,"Higher Timer",{"$f":"IF(W45<V39,0.01,IF(W45<V40,0.1,IF(W45<V41,1,IF(W45<V42,10,100))))","v":1},"ms",null,"Higher Timer",{"$f":"IF(AA45<Z39,0.01,IF(AA45<Z40,0.1,IF(AA45<Z41,1,IF(AA45<Z42,10,100))))","v":1},"ms",null,"Higher Timer",{"$f":"IF(AE45<AD39,0.01,IF(AE45<AD40,0.1,IF(AE45<AD41,1,IF(AE45<AD42,10,100))))","v":1},"ms",null,"Higher Timer",{"$f":"IF(AI45<AH39,0.01,IF(AI45<AH40,0.1,IF(AI45<AH41,1,IF(AI45<AH42,10,100))))","v":1},"ms",null,"Higher Timer",{"$f":"IF(AM45<AL39,0.01,IF(AM45<AL40,0.1,IF(AM45<AL41,1,IF(AM45<AL42,10,100))))","v":1},"ms"]
[null,"Higher Current",{"$f":"LOOKUP(C49,B39:B43,C39:C43)","v":117.53536375757156},"A",null,"Higher Current",{"$f":"LOOKUP(G49,F39:F43,G39:G43)","v":55.714269518773669},"A",null,"Higher Current",{"$f":"LOOKUP(K49,J39:J43,K39:K43)","v":31.196248311035184},"A",null,"Higher Current",{"$f":"LOOKUP(O49,N39:N43,O39:O43)","v":46.32504691733385},"A",null,"Higher Current",{"$f":"LOOKUP(S49,R39:R43,S39:S43)","v":33.819474097071023},"A",null,"Higher Current",{"$f":"LOOKUP(W49,V39:V43,W39:W43)","v":14.048463504460869},"A",null,"Higher Current",{"$f":"LOOKUP(AA49,Z39:Z43,AA39:AA43)","v":13.265493094268965},"A",null,"Higher Current",{"$f":"LOOKUP(AE49,AD39:AD43,AE39:AE43)","v":13.831529921039925},"A",null,"Higher Current",{"$f":"LOOKUP(AI49,AH39:AH43,AI39:AI43)","v":4.5136942872690584},"A",null,"Higher Current",{"$f":"LOOKUP(AM49,AL39:AL43,AM39:AM43)","v":5.8890669832981999},"A"]
[]
[null,"a",{"$f":"C48/C47^C53","v":117.53536375757164},null,null,"a",{"$f":"G48/G47^G53","v":55.714269518773669},null,null,"a",{"$f":"K48/K47^K53","v":31.196248311035188},null,null,"a",{"$f":"O48/O47^O53","v":46.32504691733385},null,null,"a",{"$f":"S48/S47^S53","v":33.819474097071016},null,null,"a",{"$f":"W48/W47^W53","v":14.048463504460871},null,null,"a",{"$f":"AA48/AA47^AA53","v":13.265493094268967},null,null,"a",{"$f":"AE48/AE47^AE53","v":13.831529921039927},null,null,"a",{"$f":"AI48/AI47^AI53","v":4.5136942872690611},null,null,"a",{"$f":"AM48/AM47^AM53","v":5.8890669832982034}]
[null,"m",{"$f":"IF(C49=C47,0.00000000000001,LOG(C48/C50)/LOG(C47/C49))","v":-1.0398969220065086},null,null,"m",{"$f":"IF(G49=G47,0.00000000000001,LOG(G48/G50)/LOG(G47/G49))","v":-0.87438435794684766},null,null,"m",{"$f":"IF(K49=K47,0.00000000000001,LOG(K48/K50)/LOG(K47/K49))","v":-0.51599895901769965},null,null,"m",{"$f":"IF(O49=O47,0.00000000000001,LOG(O48/O50)/LOG(O47/O49))","v":-1.1460901916655675},null,null,"m",{"$f":"IF(S49=S47,0.00000000000001,LOG(S48/S50)/LOG(S47/S49))","v":-0.59998640772850509},null,null,"m",{"$f":"IF(W49=W47,0.00000000000001,LOG(W48/W50)/LOG(W47/W49))","v":-0.68400026174045703},null,null,"m",{"$f":"IF(AA49=AA47,0.00000000000001,LOG(AA48/AA50)/LOG(AA47/AA49))","v":-0.95103098045433099},null,null,"m",{"$f":"IF(AE49=AE47,0.00000000000001,LOG(AE48/AE50)/LOG(AE47/AE49))","v":-0.5694758986902303},null,null,"m",{"$f":"IF(AI49=AI47,0.00000000000001,LOG(AI48/AI50)/LOG(AI47/AI49))","v":-1.0748282947497338},null,null,"m",{"$f":"IF(AM49=AM47,0.00000000000001,LOG(AM48/AM50)/LOG(AM47/AM49))","v":-1.0035214541232498}]
[]
[null,"Current",{"$f":"C52*C45^C53","v":117.53658601666805},"A",null,"Current",{"$f":"G52*G45^G53","v":55.714756680197119},"A",null,"Current",{"$f":"K52*K45^K53","v":31.196409284571907},"A",null,"Current",{"$f":"O52*O45^O53","v":46.325577849849992},"A",null,"Current",{"$f":"S52*S45^S53","v":33.819677010942058},"A",null,"Current",{"$f":"W52*W45^W53","v":14.048559596797109},"A",null,"Current",{"$f":"AA52*AA45^AA53","v":13.265619254448714},"A",null,"Current",{"$f":"AE52*AE45^AE53","v":13.831608688887368},"A",null,"Current",{"$f":"AI52*AI45^AI53","v":4.5137428022357007},"A",null,"Current",{"$f":"AM52*AM45^AM53","v":5.8891260819408551},"A"]
[null,"Power",{"$f":"C55*VINMAX","v":1645.5122042333528},"W",null,"Power",{"$f":"G55*VINMAX","v":780.00659352275966},"W",null,"Power",{"$f":"K55*VINMAX","v":436.74972998400671},"W",null,"Power",{"$f":"O55*VINMAX","v":648.55808989789989},"W",null,"Power",{"$f":"S55*VINMAX","v":473.47547815318882},"W",null,"Power",{"$f":"W55*VINMAX","v":196.67983435515953},"W",null,"Power",{"$f":"AA55*VINMAX","v":185.718669562282},"W",null,"Power",{"$f":"AE55*VINMAX","v":193.64252164442314},"W",null,"Power",{"$f":"AI55*VINMAX","v":63.19239923129981},"W",null,"Power",{"$f":"AM55*VINMAX","v":82.447765147171964},"W"]
[]
[null,"Derating Factor",{"$f":"(C6-C34)/(C6-25)","v":0.59776051200000002},null,null,"Derating Factor",{"$f":"(G6-G34)/(G6-25)","v":0.59651894400000005},null,null,"Derating Factor",{"$f":"(K6-K34)/(K6-25)","v":0.51394171840000002},null,null,"Derating Factor",{"$f":"(O6-O34)/(O6-25)","v":0.59419391999999993},null,null,"Derating Factor",{"$f":"(S6-S34)/(S6-25)","v":0.51223644160000004},null,null,"Derating Factor",{"$f":"(W6-W34)/(W6-25)","v":0.50830489599999995},null,null,"Derating Factor",{"$f":"(AA6-AA34)/(AA6-25)","v":0.50184692800000008},null,null,"Derating Factor",{"$f":"(AE6-AE34)/(AE6-25)","v":0.5020351072},null,null,"Derating Factor",{"$f":"(AI6-AI34)/(AI6-25)","v":0.44751212799999995},null,null,"Derating Factor",{"$f":"(AM6-AM34)/(AM6-25)","v":0.45118240000000004}]
[null,"Power at Hot-Short",{"$f":"C58*C56","v":983.62221770477754},"W",null,"Power at Hot-Short",{"$f":"G58*G56","v":465.28870948123387},"W",null,"Power at Hot-Short",{"$f":"K58*K56","v":224.46390673871642},"W",null,"Power at Hot-Short",{"$f":"O58*O56","v":385.36927378414549},"W",null,"Power at Hot-Short",{"$f":"S58*S56","v":242.531394114048},"W",null,"Power at Hot-Short",{"$f":"W58*W56","v":99.973322747196576},"W",null,"Power at Hot-Short",{"$f":"AA58*AA56","v":93.202343792078338},"W",null,"Power at Hot-Short",{"$f":"AE58*AE56","v":97.215344112236295},"W",null,"Power at Hot-Short",{"$f":"AI58*AI56","v":28.279365053424538},"W",null,"Power at Hot-Short",{"$f":"AM58*AM56","v":37.1989805537374},"W"]
[]
[null,"Margin",{"$f":"C59/'Design Calculator'!F52","v":150.89659021607383},null,null,"Margin",{"$f":"G59/'Design Calculator'!F52","v":71.3795179317802},null,null,"Margin",{"$f":"K59/'Design Calculator'!F52","v":34.43480387468945},null,null,"Margin",{"$f":"O59/'Design Calculator'!F52","v":59.119149955522325},null,null,"Margin",{"$f":"S59/'Design Calculator'!F52","v":37.206520687950544},null,null,"Margin",{"$f":"W59/'Design Calculator'!F52","v":15.336816557808566},null,null,"Margin",{"$f":"AA59/'Design Calculator'!F52","v":14.29808683173929},null,null,"Margin",{"$f":"AE59/'Design Calculator'!F52","v":14.913717562672614},null,null,"Margin",{"$f":"AI59/'Design Calculator'!F52","v":4.3383116843321741},null,null,"Margin",{"$f":"AM59/'Design Calculator'!F52","v":5.7066617894938059}]
[]
[null,"Selected FET",{"$f":"IF(C61>1.3,1,0)","v":1},null,null,"Selected FET",{"$f":"IF(G61>1.3,1,0)","v":1},null,null,"Selected FET",{"$f":"IF(K61>1.3,1,0)","v":1},null,null,"Selected FET",{"$f":"IF(O61>1.3,1,0)","v":1},null,null,"Selected FET",{"$f":"IF(S61>1.3,1,0)","v":1},null,null,"Selected FET",{"$f":"IF(W61>1.3,1,0)","v":1},null,null,"Selected FET",{"$f":"IF(AA61>1.3,1,0)","v":1},null,null,"Selected FET",{"$f":"IF(AE61>1.3,1,0)","v":1},null,null,"Selected FET",{"$f":"IF(AI61>1.3,1,0)","v":1},null,null,"Selected FET",{"$f":"IF(AM61>1.3,1,0)","v":1}]
[null,null,{"$f":"COLUMN()","v":3},null,null,null,{"$f":"COLUMN()","v":7},null,null,null,{"$f":"COLUMN()","v":11},null,null,null,{"$f":"COLUMN()","v":15},null,null,null,{"$f":"COLUMN()","v":19},null,null,null,{"$f":"COLUMN()","v":23},null,null,null,{"$f":"COLUMN()","v":27},null,null,null,{"$f":"COLUMN()","v":31},null,null,null,{"$f":"COLUMN()","v":35},null,null,null,{"$f":"COLUMN()","v":39}]
[]
[]
[null,"FET1",{"$f":"LEFT('Design Calculator'!F54,FIND(\" \",'Design Calculator'!F54)-1)","v":"CSD18532NQ5B"},null,null,"FET2",{"$f":"LEFT('Design Calculator'!G54,FIND(\" \",'Design Calculator'!G54)-1)","v":"CSD18540Q5B"}]
[null,"Column Number",{"$f":"MATCH(SFET48_1,B4:AM4,0)+2","v":{"$error":"#N/A"}},null,null,"Column Number",{"$f":"MATCH(SFET48_2,B4:AM4,0)+2","v":{"$error":"#N/A"}}]
[]
[null,0.01,{"$f":"INDIRECT(ADDRESS(39,C68))","v":{"$error":"#N/A"}},"A",null,0.01,{"$f":"INDIRECT(ADDRESS(39,G68))","v":{"$error":"#N/A"}},"A"]
[null,0.1,{"$f":"INDIRECT(ADDRESS(40,C68))","v":{"$error":"#N/A"}},"A",null,0.1,{"$f":"INDIRECT(ADDRESS(40,G68))","v":{"$error":"#N/A"}},"A"]
[null,1,{"$f":"INDIRECT(ADDRESS(41,C68))","v":{"$error":"#N/A"}},"A",null,1,{"$f":"INDIRECT(ADDRESS(41,G68))","v":{"$error":"#N/A"}},"A"]
[null,10,{"$f":"INDIRECT(ADDRESS(42,C68))","v":{"$error":"#N/A"}},"A",null,10,{"$f":"INDIRECT(ADDRESS(42,G68))","v":{"$error":"#N/A"}},"A"]
[null,100,{"$f":"INDIRECT(ADDRESS(43,C68))","v":{"$error":"#N/A"}},"A",null,100,{"$f":"INDIRECT(ADDRESS(43,G68))","v":{"$error":"#N/A"}},"A"]
[]
[null,"MOSFET Power Dissipation",{"$f":"INDIRECT(ADDRESS(33,C68))","v":{"$error":"#N/A"}},"W",null,"MOSFET Power Dissipation",{"$f":"INDIRECT(ADDRESS(33,G68))","v":{"$error":"#N/A"}},"W"]
[null,"Number of FETs",{"$f":"INDIRECT(ADDRESS(32,C68))","v":{"$error":"#N/A"}},null,null,"Number of FETs",{"$f":"INDIRECT(ADDRESS(32,G68))","v":{"$error":"#N/A"}}]
[null,"Junction Temperature",{"$f":"INDIRECT(ADDRESS(34,C68))","v":{"$error":"#N/A"}},"°C",null,"Junction Temperature",{"$f":"INDIRECT(ADDRESS(34,G68))","v":{"$error":"#N/A"}},"°C"]
[null,"Maximum Junction Temperature",{"$f":"INDIRECT(ADDRESS(6,C68))","v":{"$error":"#N/A"}},"°C",null,"Maximum Junction Temperature",{"$f":"INDIRECT(ADDRESS(6,G68))","v":{"$error":"#N/A"}},"°C"]
[null,"On resistance at Junction temp",{"$f":"INDIRECT(ADDRESS(7,C68))*INDIRECT(ADDRESS(29,C68))","v":{"$error":"#N/A"}},"mΩ",null,"On resistance at Junction temp",{"$f":"INDIRECT(ADDRESS(7,G68))*INDIRECT(ADDRESS(29,G68))","v":{"$error":"#N/A"}},"mΩ"]
[null,"Margin",{"$f":"INDIRECT(ADDRESS(61,C68))","v":{"$error":"#N/A"}},null,null,"Margin",{"$f":"INDIRECT(ADDRESS(61,G68))","v":{"$error":"#N/A"}}]
[null,"webpage link",{"$f":"HYPERLINK(INDIRECT(ADDRESS(5,C68)))","v":{"$error":"#N/A"}},null,null,"webpage link",{"$f":"HYPERLINK(INDIRECT(ADDRESS(5,G68)))","v":{"$error":"#N/A"}}]
[null,"datasheet link",{"$f":"HYPERLINK(INDIRECT(ADDRESS(30,C68)))","v":{"$error":"#N/A"}},null,null,"datasheet link",{"$f":"HYPERLINK(INDIRECT(ADDRESS(30,G68)))","v":{"$error":"#N/A"}}]
[null,"cost 1k USD",{"$f":"INDIRECT(ADDRESS(35,C68))","v":{"$error":"#N/A"}},"$",null,"cost 1k USD",{"$f":"INDIRECT(ADDRESS(35,G68))","v":{"$error":"#N/A"}},"$"]

{"sheet":"Start_up","index":6,"n_rows":353,"n_cols":25,"rows_kept":353,"cut":false,"hidden":true,"merged":[[11,23,11,24],[130,23,130,24]]}
[null,"PLIM","ILIM","Load type",null,"SS","Load Value","Load start","Rs","Vos,syst",null,null,"Start-time",null,"I_fet-I_L margin",null,"I_g(hi/nom)","I_g(low/nom)"]
[null,{"$f":"'Design Calculator'!F52","v":6.5185185185185182},{"$f":"'Design Calculator'!F42","v":2.0370370370370372},{"$f":"IF( 'Design Calculator'!F28 = \"Constant Current\", \"CC\", \"R\")","v":"CC"},null,{"$f":"'Design Calculator'!F30","v":"Soft Start"},{"$f":"'Design Calculator'!F29","v":0.2},{"$f":"'Design Calculator'!F27","v":0},{"$f":"RsEFF","v":27},{"$f":"'Device Parameters'!E12","v":1E-3},null,null,{"$f":"J114*1000","v":131.25},"ms",{"$f":"MIN(L10:L111)","v":0.61538461538461542},null,{"$f":"'Device Parameters'!E30/'Device Parameters'!D30","v":1.375},{"$f":"'Device Parameters'!C30/'Device Parameters'!D30","v":0.625}]
[]
[null,null,null,"To avoid timer running: Iload + Icap,ss < IFET_PLIM / 2 => SS_RATE < 1/Cout * (IFET_PLIM/2 - ILOAD)",null,null,null,null,null,null,null,null,"Max_SS_Rate",{"$f":"MIN(M10:M114)","v":1.0934744268077593E-2},"V/ms","max_power_typ",{"$f":"MAX(O10:O114)","v":7.28},"W"]
[null,null,null,null,null,null,null,null,null,null,null,null,"FET_ENERGY",{"$f":"SUM(N10:N114)","v":0.47315625000000017},"J","max_power_high",{"$f":"MAX(P10:P114)","v":8.9600000000000009},"W"]
[null,null,null,null,null,null,null,null,null,null,null,null,null,null,null,"max_power_low",{"$f":"MAX(Q10:Q114)","v":5.6000000000000005},"W"]
["VIN","Vout","ILOAD","PLIM","IFET_PLIM","I_FET_SS","IFET","ICAP","Dt","Time","Tiime (ms)","I_Fet-IL margin","Max _allowed SS_rate","FET_Energy","Power (W)","P_ fast_SS","P_slow_SS"]
[null,null,null,null,null,null,null,null,null,null,-1,null,null,null,0]
[null,null,null,null,null,null,null,null,null,null,-0.01,null,null,null,0]
[{"$f":"VINMAX","v":14},{"$f":"VINMAX*((ROW()-10)/104)","v":0},{"$f":"IF(B10>=$H$2,IF($D$2=\"CC\", $G$2, B10/$G$2), 0)","v":0.2},{"$f":"B2","v":6.5185185185185182},{"$f":"MIN(D10/(A10-B10),$C$2)","v":0.46560846560846558},{"$f":"I_Cout_ss+C10","v":0.52},{"$f":"IF($F$2=\"Soft Start\", F10, E10)","v":0.52},{"$f":"G10-C10","v":0.32},{"$f":"(COUTMAX/1000000)*(B10)/H10","v":0},{"$f":"I10","v":0},{"$f":"J10*1000","v":0},{"$f":"H10/G10","v":0.61538461538461542},{"$f":"1/COUTMAX*(E10/2-C10)*1000","v":1.0934744268077593E-2},{"$f":"I10*G10*(A10-B10)","v":0},{"$f":"G10*(A10-B10)","v":7.28},{"$f":"(A10-B10)*(I_Cout_ss*$Q$2+C10)","v":8.9600000000000009},{"$f":"(A10-B10)*(I_Cout_ss*$R$2+C10)","v":5.6000000000000005}]
[14,0.13461538461538464,0.2,{"$f":"B2","v":6.5185185185185182},{"$f":"MIN(D11/(A11-B11),$C$2)","v":0.4701289361483536},{"$f":"I_Cout_ss+C11","v":0.52},{"$f":"IF($F$2=\"Soft Start\", F11, E11)","v":0.52},0.32,{"$f":"(COUTMAX/1000000)*(B11-B10)/H11","v":1.2620192307692311E-3},{"$f":"J10+I11","v":1.2620192307692311E-3},{"$f":"J11*1000","v":1.2620192307692311},{"$f":"H11/G11","v":0.61538461538461542},1.1688156024725596E-2,{"$f":"I11*G11*(A11-B11)","v":9.0991586538461556E-3},{"$f":"G11*(A11-B11)","v":7.21},8.8738461538461539,5.546153846153846]
[14,0.26923076923076927,0.2,{"$f":"B2","v":6.5185185185185182},0.47473804336549436,0.52,0.52,0.32,1.2620192307692311E-3,{"$f":"J11+I12","v":2.5240384615384621E-3},2.5240384615384621,0.61538461538461542,1.2456340560915722E-2,{"$f":"I12*G12*(A12-B12)","v":9.01081730769231E-3},7.14,8.787692307692307,5.4923076923076923,null,null,null,null,null,null,"Start-up slop "]
[14,0.40384615384615385,0.2,{"$f":"B2","v":6.5185185185185182},0.47943842003247938,0.52,0.52,0.32,1.2620192307692306E-3,3.7860576923076927E-3,3.7860576923076925,0.61538461538461542,1.3239736672079892E-2,8.9224759615384609E-3,7.07,8.7015384615384619,5.4384615384615387,null,null,null,null,null,null,"QG",0.3]
[14,0.53846153846153855,0.2,{"$f":"B2","v":6.5185185185185182},0.48423280423280418,0.52,0.52,0.32,1.2620192307692315E-3,5.0480769230769242E-3,5.0480769230769242,0.61538461538461542,1.403880070546736E-2,{"$f":"I14*G14*(A14-B14)","v":8.8341346153846204E-3},7,8.615384615384615,5.384615384615385,null,null,null,null,null,null,"I_Src",0.3]
[14,0.67307692307692313,0.2,{"$f":"B2","v":6.5185185185185182},0.48912404467960025,0.52,0.52,0.32,1.2620192307692306E-3,6.3100961538461548E-3,6.3100961538461551,0.61538461538461542,1.4854007446600037E-2,8.7457932692307679E-3,6.93,8.5292307692307698,5.3307692307692314,null,null,null,null,null,null,"RMS",{"$f":"SQRT(Y14^2+Y13^2)","v":0.42426406871192851}]
[14,0.80769230769230771,0.2,{"$f":"B2","v":6.5185185185185182},0.49411510636000433,0.52,0.52,0.32,1.2620192307692306E-3,7.5721153846153855E-3,7.572115384615385,0.61538461538461542,1.5685851060000717E-2,8.6574519230769222E-3,6.86,8.4430769230769229,5.2769230769230768]
[14,0.94230769230769229,0.2,{"$f":"B2","v":6.5185185185185182},0.49920907652866409,0.52,0.52,0.32,1.2620192307692306E-3,8.8341346153846152E-3,8.834134615384615,0.61538461538461542,1.6534846088110677E-2,8.5691105769230766E-3,6.7900000000000009,8.3569230769230778,5.2230769230769241,null,null,null,null,null,null,"PLIM",0.3]
[14,1.0769230769230771,0.2,{"$f":"B2","v":6.5185185185185182},0.50440917107583771,0.52,0.52,0.32,1.2620192307692326E-3,1.0096153846153848E-2,10.096153846153848,0.61538461538461542,1.7401528512639618E-2,8.4807692307692431E-3,6.7200000000000006,8.2707692307692309,5.1692307692307695,null,null,null,null,null,null,"combined",{"$f":"MAX(Y15:Y17)","v":0.42426406871192851}]
[14,1.2115384615384615,0.2,{"$f":"B2","v":6.5185185185185182},0.50971874129768868,0.52,0.52,0.32,1.2620192307692282E-3,1.1358173076923076E-2,11.358173076923077,0.61538461538461542,1.8286456882948107E-2,8.392427884615368E-3,6.65,8.184615384615384,5.1153846153846159]
[14,1.3461538461538463,0.2,{"$f":"B2","v":6.5185185185185182},0.51514128109872792,0.52,0.52,0.32,1.2620192307692326E-3,1.262019230769231E-2,12.62019230769231,0.61538461538461542,1.9190213516454651E-2,8.3040865384615501E-3,6.58,8.0984615384615388,5.0615384615384613,null,null,null,null,null,null,"I_timer",0.2]
[14,1.4807692307692308,0.2,{"$f":"B2","v":6.5185185185185182},0.52068043465892921,0.52,0.52,0.32,1.2620192307692306E-3,1.3882211538461541E-2,13.882211538461542,0.61538461538461542,2.0113405776488198E-2,8.2157451923076923E-3,6.5100000000000007,8.0123076923076937,5.0076923076923086,null,null,null,null,null,null,"C_timer",0.2]
[14,1.6153846153846154,0.2,{"$f":"B2","v":6.5185185185185182},0.52634000460087416,0.52,0.52,0.32,1.2620192307692306E-3,1.5144230769230771E-2,15.14423076923077,0.61538461538461542,2.1056667433479021E-2,8.127403846153845E-3,6.44,7.9261538461538468,4.953846153846154,null,null,null,null,null,null,"RMS",{"$f":"SQRT(Y21^2+Y20^2)","v":0.28284271247461906}]
[14,1.75,0.2,{"$f":"B2","v":6.5185185185185182},0.53212396069538925,0.52,0.52,0.32,1.2620192307692306E-3,1.6406250000000001E-2,16.40625,0.61538461538461542,2.2020660115898205E-2,8.0390624999999993E-3,6.37,7.84,4.9000000000000004]
[14,1.8846153846153846,0.2,{"$f":"B2","v":6.5185185185185182},0.53803644914756021,0.52,0.52,0.32,1.2620192307692306E-3,1.766826923076923E-2,17.66826923076923,0.61538461538461542,2.3006074857926696E-2,7.950721153846152E-3,6.3,7.7538461538461538,4.8461538461538467,null,null,null,null,null,null,"Final",{"$f":"SQRT(Y18^2+Y22^2)","v":0.50990195135927852}]
[14,2.0192307692307692,0.2,{"$f":"B2","v":6.5185185185185182},0.54408180250876881,0.52,0.52,0.32,1.2620192307692306E-3,1.893028846153846E-2,18.93028846153846,0.61538461538461542,2.4013633751461465E-2,7.8623798076923063E-3,6.2299999999999995,7.6676923076923069,4.7923076923076922]
[14,2.1538461538461542,0.2,{"$f":"B2","v":6.5185185185185182},0.55026455026455023,0.52,0.52,0.32,1.2620192307692345E-3,2.0192307692307693E-2,20.192307692307693,0.61538461538461542,2.504409171075837E-2,7.7740384615384859E-3,6.16,7.5815384615384618,4.7384615384615385]
[14,2.2884615384615383,0.2,{"$f":"B2","v":6.5185185185185182},0.5565894301526485,0.52,0.52,0.32,1.2620192307692263E-3,2.145432692307692E-2,21.45432692307692,0.61538461538461542,2.6098238358774745E-2,7.6856971153845882E-3,6.09,7.4953846153846158,4.6846153846153848]
[14,2.4230769230769229,0.2,{"$f":"B2","v":6.5185185185185182},0.56306140027070262,0.52,0.52,0.32,1.2620192307692306E-3,2.2716346153846149E-2,22.71634615384615,0.61538461538461542,2.7176900045117098E-2,7.5973557692307686E-3,6.0200000000000005,7.4092307692307688,4.6307692307692312]
[14,2.5576923076923075,0.2,{"$f":"B2","v":6.5185185185185182},0.56968565203859312,0.52,0.52,0.32,1.2620192307692306E-3,2.3978365384615379E-2,23.97836538461538,0.61538461538461542,2.8280942006432181E-2,7.5090144230769229E-3,5.9500000000000011,7.3230769230769237,4.5769230769230775]
[14,2.6923076923076925,0.2,{"$f":"B2","v":6.5185185185185182},0.57646762408667174,0.52,0.52,0.32,1.2620192307692345E-3,2.5240384615384612E-2,25.240384615384613,0.61538461538461542,2.9411270681111951E-2,7.420673076923099E-3,5.88,7.2369230769230768,4.523076923076923]
[14,2.8269230769230771,0.2,{"$f":"B2","v":6.5185185185185182},0.5834130171479569,0.52,0.52,0.32,1.2620192307692306E-3,2.6502403846153842E-2,26.502403846153843,0.61538461538461542,3.0568836191326144E-2,7.3323317307692299E-3,5.8100000000000005,7.1507692307692308,4.4692307692307693]
[14,2.9615384615384617,0.2,{"$f":"B2","v":6.5185185185185182},0.5905278100400051,0.52,0.52,0.32,1.2620192307692306E-3,2.7764423076923072E-2,27.764423076923073,0.61538461538461542,3.175463500666751E-2,7.2439903846153834E-3,5.74,7.0646153846153847,4.4153846153846157]
[14,3.0961538461538458,0.2,{"$f":"B2","v":6.5185185185185182},0.5978182768306225,0.52,0.52,0.32,1.2620192307692263E-3,2.9026442307692298E-2,29.026442307692299,0.61538461538461542,3.2969712805103739E-2,7.1556490384615127E-3,5.67,6.9784615384615378,4.3615384615384611]
[14,3.2307692307692308,0.2,{"$f":"B2","v":6.5185185185185182},0.60529100529100521,0.52,0.52,0.32,1.2620192307692345E-3,3.0288461538461531E-2,30.288461538461533,0.61538461538461542,3.4215167548500861E-2,7.0673076923077147E-3,5.6000000000000005,6.8923076923076927,4.3076923076923084]
[14,3.3653846153846154,0.2,{"$f":"B2","v":6.5185185185185182},0.6129529167503851,0.52,0.52,0.32,1.2620192307692306E-3,3.1550480769230761E-2,31.550480769230763,0.61538461538461542,3.5492152791730847E-2,6.9789663461538457E-3,5.53,6.8061538461538467,4.2538461538461538]
[14,3.5,0.2,{"$f":"B2","v":6.5185185185185182},0.62081128747795411,0.52,0.52,0.32,1.2620192307692306E-3,3.2812499999999994E-2,32.812499999999993,0.61538461538461542,3.6801881246325677E-2,6.8906249999999992E-3,5.46,6.72,4.2]
[14,3.634615384615385,0.2,{"$f":"B2","v":6.5185185185185182},0.62887377173091463,0.52,0.52,0.32,1.2620192307692345E-3,3.4074519230769228E-2,34.074519230769226,0.61538461538461542,3.8145628621819104E-2,6.8022836538461744E-3,5.39,6.6338461538461537,4.1461538461538465]
[14,3.7692307692307692,0.2,{"$f":"B2","v":6.5185185185185182},0.6371484266221108,0.52,0.52,0.32,1.2620192307692263E-3,3.5336538461538454E-2,35.336538461538453,0.61538461538461542,3.9524737770351794E-2,6.7139423076922828E-3,5.3199999999999994,6.5476923076923077,4.092307692307692]
[14,3.9038461538461542,0.2,{"$f":"B2","v":6.5185185185185182},0.64564373897707228,0.52,0.52,0.32,1.2620192307692345E-3,3.6598557692307687E-2,36.598557692307686,0.61538461538461542,4.0940623162845372E-2,6.6256009615384822E-3,5.2500000000000009,6.4615384615384617,4.0384615384615392]
[14,4.0384615384615383,0.2,{"$f":"B2","v":6.5185185185185182},0.65436865436865432,0.52,0.52,0.32,1.2620192307692263E-3,3.7860576923076913E-2,37.860576923076913,0.61538461538461542,4.2394775728109048E-2,6.5372596153845924E-3,5.1800000000000006,6.3753846153846156,3.9846153846153847]
[14,4.1730769230769234,0.2,{"$f":"B2","v":6.5185185185185182},0.66333260853808795,0.52,0.52,0.32,1.2620192307692345E-3,3.9122596153846147E-2,39.122596153846146,0.61538461538461542,4.388876808968132E-2,6.4489182692307884E-3,5.1100000000000003,6.2892307692307696,3.930769230769231]
[{"$f":"VINMAX","v":14},{"$f":"VINMAX*((ROW()-10)/104)","v":4.3076923076923084},{"$f":"IF(B42>=$H$2,IF($D$2=\"CC\", $G$2, B42/$G$2), 0)","v":0.2},{"$f":"B2","v":6.5185185185185182},0.67254556143445032,{"$f":"I_Cout_ss+C42","v":0.52},0.52,{"$f":"G42-C42","v":0.32},1.2620192307692345E-3,4.038461538461538E-2,40.38461538461538,0.61538461538461542,{"$f":"1/COUTMAX*(E42/2-C42)*1000","v":4.5424260239075052E-2},6.3605769230769419E-3,5.04,{"$f":"(A42-B42)*(I_Cout_ss*$Q$2+C42)","v":6.2030769230769227},{"$f":"(A42-B42)*(I_Cout_ss*$R$2+C42)","v":3.8769230769230769}]
[14,4.4423076923076916,0.2,{"$f":"B2","v":6.5185185185185182},0.68201803413071005,0.52,0.52,0.32,{"$f":"(COUTMAX/1000000)*(B43-B42)/H43","v":1.262019230769218E-3},4.1646634615384599E-2,41.646634615384599,0.61538461538461542,4.7003005688451664E-2,6.2722355769230147E-3,4.9700000000000006,6.1169230769230776,3.8230769230769237]
[14,4.5769230769230766,0.2,{"$f":"B2","v":6.5185185185185182},0.69176114890400597,0.52,0.52,0.32,1.2620192307692345E-3,4.2908653846153832E-2,42.908653846153832,0.61538461538461542,4.8626858150667661E-2,6.1838942307692497E-3,4.9000000000000004,6.0307692307692307,3.7692307692307696]
[14,4.7115384615384617,0.2,{"$f":"B2","v":6.5185185185185182},0.70178667280116558,0.52,0.52,0.32,1.2620192307692345E-3,4.4170673076923066E-2,44.170673076923066,0.61538461538461542,5.0297778800194259E-2,6.0955528846154032E-3,4.83,5.9446153846153846,3.7153846153846155]
[14,4.8461538461538458,0.2,{"$f":"B2","v":6.5185185185185182},0.71210706504824151,0.52,0.52,0.32,1.2620192307692263E-3,4.5432692307692292E-2,45.432692307692292,0.61538461538461542,5.2017844174706909E-2,6.0072115384615168E-3,4.76,5.8584615384615386,3.6615384615384614]
[14,4.9807692307692308,0.2,{"$f":"B2","v":6.5185185185185182},0.72273552870567781,0.52,0.52,0.32,1.2620192307692345E-3,4.6694711538461525E-2,46.694711538461526,0.61538461538461542,5.3789254784279629E-2,5.9188701923077111E-3,4.6900000000000004,5.7723076923076926,3.6076923076923082]
[14,5.115384615384615,0.2,{"$f":"B2","v":6.5185185185185182},0.73368606701940031,0.52,0.52,0.32,1.2620192307692263E-3,4.7956730769230752E-2,47.956730769230752,0.61538461538461542,5.5614344503233382E-2,5.8305288461538256E-3,4.62,5.6861538461538466,3.5538461538461541]
[14,5.25,0.2,{"$f":"B2","v":6.5185185185185182},0.74497354497354495,0.52,0.52,0.32,1.2620192307692345E-3,4.9218749999999985E-2,49.218749999999986,0.61538461538461542,5.7495590828924151E-2,5.7421875000000172E-3,4.55,5.6000000000000005,3.5]
[14,5.384615384615385,0.2,{"$f":"B2","v":6.5185185185185182},0.75661375661375663,0.52,0.52,0.32,1.2620192307692345E-3,5.0480769230769218E-2,50.480769230769219,0.61538461538461542,5.9435626102292763E-2,5.6538461538461707E-3,4.4799999999999995,5.5138461538461536,3.4461538461538463]
[14,5.5192307692307692,0.2,{"$f":"B2","v":6.5185185185185182},0.76862349878222902,0.52,0.52,0.32,1.2620192307692263E-3,5.1742788461538444E-2,51.742788461538446,0.61538461538461542,6.1437249797038157E-2,5.5655048076922869E-3,4.41,5.4276923076923076,3.3923076923076922]
[14,5.6538461538461542,0.2,{"$f":"B2","v":6.5185185185185182},0.78102065198839388,0.52,0.52,0.32,1.2620192307692345E-3,5.3004807692307677E-2,53.004807692307679,0.61538461538461542,6.3503441998065638E-2,5.4771634615384786E-3,4.3400000000000007,5.3415384615384616,3.338461538461539]
[14,5.7884615384615383,0.2,{"$f":"B2","v":6.5185185185185182},0.79382426923410521,0.52,0.52,0.32,1.2620192307692263E-3,5.4266826923076904E-2,54.266826923076906,0.61538461538461542,6.5637378205684202E-2,5.3888221153845966E-3,4.2700000000000005,5.2553846153846155,3.2846153846153849]
[14,5.9230769230769234,0.2,{"$f":"B2","v":6.5185185185185182},0.80705467372134032,0.52,0.52,0.32,1.2620192307692345E-3,5.5528846153846137E-2,55.528846153846139,0.61538461538461542,6.7842445620223388E-2,5.3004807692307847E-3,4.2,5.1692307692307695,3.2307692307692308]
[14,6.0576923076923084,0.2,{"$f":"B2","v":6.5185185185185182},0.82073356649627838,0.52,0.52,0.32,1.2620192307692345E-3,5.679086538461537E-2,56.790865384615373,0.61538461538461542,7.012226108271305E-2,5.2121394230769382E-3,4.13,5.0830769230769226,3.1769230769230767]
[14,6.1923076923076916,0.2,{"$f":"B2","v":6.5185185185185182},0.8348841452289727,0.52,0.52,0.32,1.262019230769218E-3,5.805288461538459E-2,58.052884615384592,0.61538461538461542,7.2480690871495446E-2,5.1237980769230258E-3,4.0600000000000005,4.9969230769230775,3.1230769230769235]
[14,6.3269230769230766,0.2,{"$f":"B2","v":6.5185185185185182},0.84953123549614773,0.52,0.52,0.32,1.2620192307692345E-3,5.9314903846153823E-2,59.314903846153825,0.61538461538461542,7.4921872582691285E-2,5.0354567307692461E-3,3.99,4.9107692307692314,3.0692307692307694]
[14,6.4615384615384617,0.2,{"$f":"B2","v":6.5185185185185182},0.86470143613000749,0.52,0.52,0.32,1.2620192307692345E-3,6.0576923076923056E-2,60.576923076923059,0.61538461538461542,7.7450239355001241E-2,4.9471153846153996E-3,3.92,4.8246153846153845,3.0153846153846153]
[14,6.5961538461538458,0.2,{"$f":"B2","v":6.5185185185185182},0.88042328042328033,0.52,0.52,0.32,1.2620192307692263E-3,6.1838942307692282E-2,61.838942307692285,0.61538461538461542,8.0070546737213394E-2,4.858774038461521E-3,3.85,4.7384615384615385,2.9615384615384617]
[14,6.7307692307692308,0.2,{"$f":"B2","v":6.5185185185185182},0.89672741524593369,0.52,0.52,0.32,1.2620192307692345E-3,6.3100961538461522E-2,63.100961538461526,0.61538461538461542,8.2787902540988945E-2,4.7704326923077066E-3,3.7800000000000002,4.6523076923076925,2.907692307692308]
[14,6.865384615384615,0.2,{"$f":"B2","v":6.5185185185185182},0.91364680043925317,0.52,0.52,0.32,1.2620192307692263E-3,6.4362980769230749E-2,64.362980769230745,0.61538461538461542,8.5607800073208853E-2,{"$f":"I61*G61*(A61-B61)","v":4.6820913461538298E-3},3.7100000000000004,4.5661538461538465,2.8538461538461544]
[14,7,0.2,{"$f":"B2","v":6.5185185185185182},0.93121693121693117,0.52,0.52,0.32,1.2620192307692345E-3,6.5624999999999989E-2,65.624999999999986,0.61538461538461542,8.8536155202821848E-2,4.5937500000000136E-3,3.64,4.4800000000000004,2.8000000000000003]
[14,7.1346153846153841,0.2,{"$f":"B2","v":6.5185185185185182},0.9494760867309886,0.52,0.52,0.32,1.2620192307692263E-3,6.6887019230769215E-2,66.887019230769212,0.61538461538461542,9.1579347788498106E-2,4.5054086538461376E-3,3.5700000000000003,4.3938461538461544,2.7461538461538466]
[14,7.2692307692307701,0.2,{"$f":"B2","v":6.5185185185185182},0.96846560846560859,0.52,0.52,0.32,1.262019230769243E-3,6.8149038461538455E-2,68.149038461538453,0.61538461538461542,9.4744268077601418E-2,4.4170673076923501E-3,3.4999999999999996,4.3076923076923075,2.6923076923076921]
[14,7.4038461538461542,0.2,{"$f":"B2","v":6.5185185185185182},0.98823021272000866,0.52,0.52,0.32,1.2620192307692263E-3,6.9411057692307682E-2,69.411057692307679,0.61538461538461542,9.8038368786668106E-2,4.3287259615384455E-3,3.43,4.2215384615384615,2.6384615384615384]
[14,7.5384615384615383,0.2,{"$f":"B2","v":6.5185185185185182},1.0088183421516754,0.52,0.52,0.32,1.2620192307692263E-3,7.0673076923076908E-2,70.673076923076906,0.61538461538461542,0.1014697236919459,4.2403846153846007E-3,3.3600000000000003,4.1353846153846154,2.5846153846153848]
[14,7.6730769230769234,0.2,{"$f":"B2","v":6.5185185185185182},1.0302825621974558,0.52,0.52,0.32,1.2620192307692345E-3,7.1935096153846148E-2,71.935096153846146,0.61538461538461542,0.10504709369957597,4.152043269230782E-3,3.29,4.0492307692307694,2.5307692307692307]
[14,7.8076923076923084,0.2,{"$f":"B2","v":6.5185185185185182},1.0526800092017483,0.52,0.52,0.32,1.2620192307692345E-3,7.3197115384615388E-2,73.197115384615387,0.61538461538461542,0.1087800015336247,4.0637019230769346E-3,3.2199999999999998,3.9630769230769229,2.476923076923077]
[14,7.9423076923076916,0.2,{"$f":"B2","v":6.5185185185185182},1.0760728982951204,0.52,0.52,0.32,1.262019230769218E-3,7.4459134615384601E-2,74.459134615384599,0.61538461538461542,0.11267881638252006,3.9753605769230378E-3,3.1500000000000004,3.8769230769230774,2.4230769230769234]
[14,8.0769230769230766,0.2,{"$f":"B2","v":6.5185185185185182},1.1005291005291005,0.52,0.52,0.32,1.2620192307692345E-3,7.5721153846153841E-2,75.72115384615384,0.61538461538461542,0.1167548500881834,3.8870192307692429E-3,3.08,3.7907692307692309,2.3692307692307693]
[14,8.2115384615384617,0.2,{"$f":"B2","v":6.5185185185185182},1.1261228005414052,0.52,0.52,0.32,1.2620192307692345E-3,7.6983173076923081E-2,76.98317307692308,0.61538461538461542,0.12102046675690085,3.798677884615396E-3,3.0100000000000002,3.7046153846153844,2.3153846153846156]
[14,8.3461538461538467,0.2,{"$f":"B2","v":6.5185185185185182},1.1529352481733435,0.52,0.52,0.32,1.2620192307692345E-3,7.8245192307692321E-2,78.245192307692321,0.61538461538461542,0.12548920802889055,3.7103365384615495E-3,2.94,3.6184615384615384,2.2615384615384615]
[14,8.4807692307692299,0.2,{"$f":"B2","v":6.5185185185185182},1.1810556200800102,0.52,0.52,0.32,1.262019230769218E-3,7.9507211538461534E-2,79.507211538461533,0.61538461538461542,0.13017593668000169,3.6219951923076566E-3,2.8700000000000006,3.5323076923076928,2.2076923076923083]
[{"$f":"VINMAX","v":14},{"$f":"VINMAX*((ROW()-10)/104)","v":8.6153846153846168},{"$f":"IF(B74>=$H$2,IF($D$2=\"CC\", $G$2, B74/$G$2), 0)","v":0.2},{"$f":"B2","v":6.5185185185185182},1.2105820105820109,{"$f":"I_Cout_ss+C74","v":0.52},0.52,{"$f":"G74-C74","v":0.32},1.2620192307692512E-3,8.0769230769230788E-2,80.769230769230788,0.61538461538461542,{"$f":"1/COUTMAX*(E74/2-C74)*1000","v":0.13509700176366846},3.5336538461539029E-3,2.7999999999999994,{"$f":"(A74-B74)*(I_Cout_ss*$Q$2+C74)","v":3.4461538461538455},{"$f":"(A74-B74)*(I_Cout_ss*$R$2+C74)","v":2.1538461538461533}]
[14,8.75,0.2,{"$f":"B2","v":6.5185185185185182},{"$f":"MIN(D75/(A75-B75),$C$2)","v":1.2416225749559082},0.52,{"$f":"IF($F$2=\"Soft Start\", F75, E75)","v":0.52},0.32,{"$f":"(COUTMAX/1000000)*(B75-B74)/H75","v":1.262019230769218E-3},8.203125E-2,{"$f":"J75*1000","v":82.03125},{"$f":"H75/G75","v":0.61538461538461542},0.14027042915931803,{"$f":"I75*G75*(A75-B75)","v":3.4453124999999653E-3},{"$f":"G75*(A75-B75)","v":2.73},3.36,2.1]
[14,8.8846153846153832,0.2,{"$f":"B2","v":6.5185185185185182},1.2742968532442212,0.52,0.52,0.32,1.262019230769218E-3,{"$f":"J75+I76","v":8.3293269230769212E-2},83.293269230769212,0.61538461538461542,0.14571614220737017,3.356971153846121E-3,2.6600000000000006,3.2738461538461547,2.0461538461538469]
[14,9.0192307692307701,0.2,{"$f":"B2","v":6.5185185185185182},1.3087373087373089,0.52,0.52,0.32,1.2620192307692512E-3,8.4555288461538466E-2,84.555288461538467,0.61538461538461542,0.15145621812288482,3.2686298076923604E-3,2.59,3.1876923076923074,1.9923076923076921]
[14,9.1538461538461533,0.2,{"$f":"B2","v":6.5185185185185182},1.3450911228689004,0.52,0.52,0.32,1.262019230769218E-3,8.5817307692307679E-2,85.817307692307679,0.61538461538461542,0.15751518714481674,3.1802884615384302E-3,2.5200000000000005,3.1015384615384618,1.9384615384615387]
[14,9.2884615384615383,0.2,{"$f":"B2","v":6.5185185185185182},1.3835222978080119,0.52,0.52,0.32,1.2620192307692345E-3,8.7079326923076919E-2,87.07932692307692,0.61538461538461542,0.16392038296800196,3.0919471153846249E-3,2.4500000000000002,3.0153846153846153,1.8846153846153848]
[14,9.4230769230769234,0.2,{"$f":"B2","v":6.5185185185185182},1.424214130096483,0.52,0.52,0.32,1.2620192307692345E-3,8.8341346153846159E-2,88.34134615384616,0.61538461538461542,0.1707023550160805,3.0036057692307784E-3,2.38,2.9292307692307693,1.8307692307692307]
[14,9.5576923076923084,0.2,{"$f":"B2","v":6.5185185185185182},1.4673721340388008,0.52,0.52,0.32,1.2620192307692345E-3,8.9603365384615399E-2,89.603365384615401,0.61538461538461542,0.17789535567313347,2.9152644230769314E-3,2.3099999999999996,2.8430769230769228,1.7769230769230768]
[14,9.6923076923076916,0.2,{"$f":"B2","v":6.5185185185185182},1.5132275132275128,0.52,0.52,0.32,1.262019230769218E-3,9.0865384615384612E-2,90.865384615384613,0.61538461538461542,0.18553791887125212,2.8269230769230489E-3,2.2400000000000002,2.7569230769230773,1.7230769230769234]
[14,9.8269230769230766,0.2,{"$f":"B2","v":6.5185185185185182},1.5620413039767878,0.52,0.52,0.32,1.2620192307692345E-3,9.2127403846153852E-2,92.127403846153854,0.61538461538461542,0.19367355066279793,2.7385817307692393E-3,2.1700000000000004,2.6707692307692308,1.6692307692307695]
[14,9.9615384615384617,0.2,{"$f":"B2","v":6.5185185185185182},1.6141093474426806,0.52,0.52,0.32,1.2620192307692345E-3,9.3389423076923092E-2,93.389423076923094,0.61538461538461542,0.2023515579071134,2.6502403846153924E-3,2.1,2.5846153846153848,1.6153846153846154]
[14,10.096153846153847,0.2,{"$f":"B2","v":6.5185185185185182},1.6697682904579458,0.52,0.52,0.32,1.2620192307692345E-3,9.4651442307692332E-2,94.651442307692335,0.61538461538461542,0.2116280484096576,2.5618990384615459E-3,2.0299999999999998,2.4984615384615383,1.5615384615384613]
[14,10.23076923076923,0.2,{"$f":"B2","v":6.5185185185185182},1.7294028722600145,0.52,0.52,0.32,1.262019230769218E-3,9.5913461538461545E-2,95.913461538461547,0.61538461538461542,0.22156714537666905,2.4735576923076682E-3,1.9600000000000004,2.4123076923076927,1.5076923076923081]
[14,10.365384615384617,0.2,{"$f":"B2","v":6.5185185185185182},1.793454830491868,0.52,0.52,0.32,1.2620192307692512E-3,9.7175480769230799E-2,97.175480769230802,0.61538461538461542,0.23224247174864465,2.3852163461538841E-3,1.8899999999999995,2.3261538461538454,1.4538461538461533]
[14,10.5,0.2,{"$f":"B2","v":6.5185185185185182},1.8624338624338623,0.52,0.52,0.32,1.262019230769218E-3,9.8437500000000011E-2,98.437500000000014,0.61538461538461542,0.2437389770723104,2.2968749999999769E-3,1.82,2.2400000000000002,1.4000000000000001]
[14,10.634615384615383,0.2,{"$f":"B2","v":6.5185185185185182},1.9369312169312161,0.52,0.52,0.32,1.262019230769218E-3,9.9699519230769224E-2,99.699519230769226,0.61538461538461542,0.25615520282186938,2.2085336538461326E-3,1.7500000000000007,2.1538461538461546,1.3461538461538467]
[14,10.76923076923077,0.2,{"$f":"B2","v":6.5185185185185182},2.0176366843033513,0.52,0.52,0.32,1.2620192307692512E-3,0.10096153846153848,100.96153846153848,0.61538461538461542,0.26960611405055857,2.1201923076923416E-3,1.6799999999999997,2.0676923076923073,1.2923076923076922]
[14,10.903846153846153,0.2,{"$f":"B2","v":6.5185185185185182},2.0370370370370372,0.52,0.52,0.32,1.262019230769218E-3,0.10222355769230769,102.22355769230769,0.61538461538461542,0.27283950617283953,2.0318509615384417E-3,1.6100000000000003,1.9815384615384619,1.2384615384615387]
[14,11.038461538461538,0.2,{"$f":"B2","v":6.5185185185185182},2.0370370370370372,0.52,0.52,0.32,1.2620192307692345E-3,0.10348557692307693,103.48557692307693,0.61538461538461542,0.27283950617283953,1.9435096153846215E-3,1.54,1.8953846153846154,1.1846153846153846]
[14,11.173076923076923,0.2,{"$f":"B2","v":6.5185185185185182},2.0370370370370372,0.52,0.52,0.32,1.2620192307692345E-3,0.10474759615384617,104.74759615384617,0.61538461538461542,0.27283950617283953,1.8551682692307747E-3,1.47,1.8092307692307692,1.1307692307692307]
[14,11.307692307692308,0.2,{"$f":"B2","v":6.5185185185185182},2.0370370370370372,0.52,0.52,0.32,1.2620192307692345E-3,0.10600961538461541,106.00961538461542,0.61538461538461542,0.27283950617283953,1.766826923076928E-3,1.3999999999999997,1.7230769230769227,1.0769230769230766]
[14,11.442307692307692,0.2,{"$f":"B2","v":6.5185185185185182},2.0370370370370372,0.52,0.52,0.32,1.262019230769218E-3,0.10727163461538462,107.27163461538463,0.61538461538461542,0.27283950617283953,1.6784855769230605E-3,1.3300000000000003,1.6369230769230774,1.0230769230769234]
[14,11.576923076923077,0.2,{"$f":"B2","v":6.5185185185185182},2.0370370370370372,0.52,0.52,0.32,1.2620192307692345E-3,0.10853365384615386,108.53365384615387,0.61538461538461542,0.27283950617283953,1.5901442307692357E-3,1.2600000000000002,1.5507692307692309,0.96923076923076934]
[14,11.711538461538462,0.2,{"$f":"B2","v":6.5185185185185182},2.0370370370370372,0.52,0.52,0.32,1.2620192307692345E-3,0.1097956730769231,109.79567307692311,0.61538461538461542,0.27283950617283953,1.5018028846153892E-3,1.19,1.4646153846153847,0.91538461538461535]
[14,11.846153846153847,0.2,{"$f":"B2","v":6.5185185185185182},2.0370370370370372,0.52,0.52,0.32,1.2620192307692345E-3,0.11105769230769234,111.05769230769235,0.61538461538461542,0.27283950617283953,1.4134615384615425E-3,1.1199999999999997,1.3784615384615382,0.86153846153846136]
[14,11.98076923076923,0.2,{"$f":"B2","v":6.5185185185185182},2.0370370370370372,0.52,0.52,0.32,1.262019230769218E-3,0.11231971153846156,112.31971153846156,0.61538461538461542,0.27283950617283953,1.3251201923076795E-3,1.0500000000000005,1.2923076923076928,0.80769230769230804]
[14,12.115384615384617,0.2,{"$f":"B2","v":6.5185185185185182},2.0370370370370372,0.52,0.52,0.32,1.2620192307692512E-3,0.11358173076923081,113.58173076923082,0.61538461538461542,0.27283950617283953,1.2367788461538653E-3,0.97999999999999932,1.2061538461538452,0.75384615384615339]
[14,12.25,0.2,{"$f":"B2","v":6.5185185185185182},2.0370370370370372,0.52,0.52,0.32,1.262019230769218E-3,0.11484375000000002,114.84375000000003,0.61538461538461542,0.27283950617283953,1.1484374999999884E-3,0.91,1.1200000000000001,0.70000000000000007]
[14,12.384615384615383,0.2,{"$f":"B2","v":6.5185185185185182},2.0370370370370372,0.52,0.52,0.32,1.262019230769218E-3,0.11610576923076923,116.10576923076924,0.61538461538461542,0.27283950617283953,1.0600961538461441E-3,0.84000000000000075,1.0338461538461547,0.64615384615384674]
[14,12.51923076923077,0.2,{"$f":"B2","v":6.5185185185185182},2.0370370370370372,0.52,0.52,0.32,1.2620192307692512E-3,0.11736778846153849,117.3677884615385,0.61538461538461542,0.27283950617283953,9.7175480769232298E-4,0.76999999999999957,0.94769230769230717,0.59230769230769198]
[14,12.653846153846153,0.2,{"$f":"B2","v":6.5185185185185182},2.0370370370370372,0.52,0.52,0.32,1.262019230769218E-3,0.1186298076923077,118.62980769230771,0.61538461538461542,0.27283950617283953,8.8341346153845307E-4,0.70000000000000029,0.86153846153846192,0.53846153846153866]
[14,12.788461538461538,0.2,{"$f":"B2","v":6.5185185185185182},2.0370370370370372,0.52,0.52,0.32,1.2620192307692345E-3,0.11989182692307694,119.89182692307695,0.61538461538461542,0.27283950617283953,7.9507211538461784E-4,0.63000000000000012,0.77538461538461545,0.48461538461538467]
[{"$f":"VINMAX","v":14},{"$f":"VINMAX*((ROW()-10)/104)","v":12.923076923076923},{"$f":"IF(B106>=$H$2,IF($D$2=\"CC\", $G$2, B106/$G$2), 0)","v":0.2},{"$f":"B2","v":6.5185185185185182},2.0370370370370372,{"$f":"I_Cout_ss+C106","v":0.52},0.52,{"$f":"G106-C106","v":0.32},1.2620192307692345E-3,0.12115384615384618,121.15384615384617,0.61538461538461542,{"$f":"1/COUTMAX*(E106/2-C106)*1000","v":0.27283950617283953},7.0673076923077123E-4,0.55999999999999983,{"$f":"(A106-B106)*(I_Cout_ss*$Q$2+C106)","v":0.68923076923076909},{"$f":"(A106-B106)*(I_Cout_ss*$R$2+C106)","v":0.43076923076923068}]
[14,13.057692307692308,0.2,{"$f":"B2","v":6.5185185185185182},2.0370370370370372,0.52,0.52,0.32,{"$f":"(COUTMAX/1000000)*(B107-B106)/H107","v":1.2620192307692345E-3},0.12241586538461542,122.41586538461542,0.61538461538461542,0.27283950617283953,6.1838942307692452E-4,0.48999999999999966,0.60307692307692262,0.37692307692307669]
[14,13.192307692307692,0.2,{"$f":"B2","v":6.5185185185185182},2.0370370370370372,0.52,0.52,0.32,1.262019230769218E-3,0.12367788461538463,123.67788461538463,0.61538461538461542,0.27283950617283953,5.3004807692307206E-4,0.42000000000000037,0.51692307692307737,0.32307692307692337]
[14,13.326923076923077,0.2,{"$f":"B2","v":6.5185185185185182},2.0370370370370372,0.52,0.52,0.32,1.2620192307692345E-3,0.12493990384615387,124.93990384615387,0.61538461538461542,0.27283950617283953,4.4170673076923228E-4,0.35000000000000014,0.43076923076923096,0.26923076923076933]
[14,13.461538461538462,0.2,{"$f":"B2","v":6.5185185185185182},2.0370370370370372,0.52,0.52,0.32,1.2620192307692345E-3,0.1262019230769231,126.20192307692309,0.61538461538461542,0.27283950617283953,3.5336538461538562E-4,0.27999999999999992,0.34461538461538455,0.21538461538461534]
[14,13.596153846153847,{"$f":"IF(B111>=$H$2,IF($D$2=\"CC\", $G$2, B111/$G$2), 0)","v":0.2},{"$f":"B2","v":6.5185185185185182},{"$f":"$C$2","v":2.0370370370370372},{"$f":"I_Cout_ss+C111","v":0.52},0.52,{"$f":"G111-C111","v":0.32},{"$f":"(COUTMAX/1000000)*(B111-B110)/H111","v":1.2620192307692345E-3},{"$f":"J110+I111","v":0.12746394230769234},127.46394230769234,{"$f":"H111/G111","v":0.61538461538461542},0.27283950617283953,{"$f":"I111*G111*(A111-B111)","v":2.650240384615389E-4},0.20999999999999971,0.25846153846153813,0.16153846153846133]
[14,13.73076923076923,{"$f":"IF(B112>=$H$2,IF($D$2=\"CC\", $G$2, B112/$G$2), 0)","v":0.2},{"$f":"B2","v":6.5185185185185182},{"$f":"$C$2","v":2.0370370370370372},{"$f":"I_Cout_ss+C112","v":0.52},0.52,{"$f":"G112-C112","v":0.32},{"$f":"(COUTMAX/1000000)*(B112-B111)/H112","v":1.262019230769218E-3},{"$f":"J111+I112","v":0.12872596153846155},128.72596153846155,{"$f":"H112/G112","v":0.61538461538461542},0.27283950617283953,{"$f":"I112*G112*(A112-B112)","v":1.7668269230769107E-4},0.14000000000000043,0.17230769230769283,0.10769230769230803]
[14,13.865384615384617,{"$f":"IF(B113>=$H$2,IF($D$2=\"CC\", $G$2, B113/$G$2), 0)","v":0.2},{"$f":"B2","v":6.5185185185185182},{"$f":"$C$2","v":2.0370370370370372},0.52,0.52,0.32,1.2620192307692512E-3,0.12998798076923079,129.9879807692308,0.61538461538461542,0.27283950617283953,8.8341346153846689E-5,6.9999999999999285E-2,8.6153846153845276E-2,5.3846153846153301E-2]
[14,14,{"$f":"IF(B114>=$H$2,IF($D$2=\"CC\", $G$2, B114/$G$2), 0)","v":0.2},{"$f":"B2","v":6.5185185185185182},{"$f":"$C$2","v":2.0370370370370372},{"$f":"I_Cout_ss+C114","v":0.52},0.52,{"$f":"G114-C114","v":0.32},{"$f":"(COUTMAX/1000000)*(B114-B113)/H114","v":1.262019230769218E-3},{"$f":"J113+I114","v":0.13125000000000001},131.25,{"$f":"H114/G114","v":0.61538461538461542},0.27283950617283953,{"$f":"I114*G114*(A114-B114)","v":0},0,0,0]
[null,null,null,null,null,null,null,null,null,null,{"$f":"K114+0.5","v":131.75},null,null,0,0]
[]
[]
[]
[]
[null,"PLIM","ILIM","Load type",null,"SS","Load Value","Load start","Rs","Vos,syst",null,null,"Start-time",null,"I_fet-I_L margin",null,"I_g(hi/nom)","I_g(low/nom)"]
[null,{"$f":"'Design Calculator'!F52","v":6.5185185185185182},{"$f":"'Design Calculator'!F42","v":2.0370370370370372},{"$f":"IF( 'Design Calculator'!F28 = \"Constant Current\", \"CC\", \"R\")","v":"CC"},null,{"$f":"'Design Calculator'!F30","v":"Soft Start"},{"$f":"'Design Calculator'!F29","v":0.2},{"$f":"'Design Calculator'!F27","v":0},{"$f":"RsEFF","v":27},{"$f":"'Device Parameters'!E12","v":1E-3},null,null,{"$f":"J233*1000","v":131.25},"ms",{"$f":"MIN(L129:L230)","v":0.61538461538461542},null,{"$f":"'Device Parameters'!E30/'Device Parameters'!D30","v":1.375},{"$f":"'Device Parameters'!C30/'Device Parameters'!D30","v":0.625}]
[]
[null,null,null,"To avoid timer running: Iload + Icap,ss < IFET_PLIM / 2 => SS_RATE < 1/Cout * (IFET_PLIM/2 - ILOAD)",null,null,null,null,null,null,null,null,"Max_SS_Rate",{"$f":"MIN(M129:M233)","v":1.0934744268077593E-2},"V/ms","max_power_typ",{"$f":"MAX(O129:O233)","v":7.28},"W"]
[null,null,null,null,null,null,null,null,null,null,null,null,"FET_ENERGY",{"$f":"SUM(N129:N233)","v":0.47315625000000017},"J","max_power_high",{"$f":"MAX(P129:P233)","v":8.9600000000000009},"W"]
[null,null,null,null,null,null,null,null,null,null,null,null,null,null,null,"max_power_low",{"$f":"MAX(Q129:Q233)","v":5.6000000000000005},"W"]
["VIN","Vout","ILOAD","PLIM","IFET_PLIM","I_FET_SS","IFET","ICAP","Dt","Time","Tiime (ms)","I_Fet-IL margin","Max _allowed SS_rate","FET_Energy","Power (W)","P_ fast_SS","P_slow_SS"]
[null,null,null,null,null,null,null,null,null,null,-1,null,null,null,0]
[null,null,null,null,null,null,null,null,null,null,-0.01,null,null,null,0]
[{"$f":"VINMAX","v":14},{"$f":"VINMAX*((ROW()-129)/104)","v":0},{"$f":"IF(B129>=$H$121,IF($D$121=\"CC\", $G$121, B129/$G$121), 0)","v":0.2},{"$f":"B121","v":6.5185185185185182},{"$f":"MIN(D129/(A129-B129),$C$121)","v":0.46560846560846558},{"$f":"Equations!$G$69+C129","v":0.52},{"$f":"IF($F$121=\"Soft Start\", F129, E129)","v":0.52},{"$f":"G129-C129","v":0.32},{"$f":"(COUTMAX/1000000)*(B129)/H129","v":0},{"$f":"I129","v":0},{"$f":"J129*1000","v":0},{"$f":"H129/G129","v":0.61538461538461542},{"$f":"1/COUTMAX*(E129/2-C129)*1000","v":1.0934744268077593E-2},{"$f":"I129*G129*(A129-B129)","v":0},{"$f":"G129*(A129-B129)","v":7.28},{"$f":"(A129-B129)*(Equations!$G$69*$Q$121+C129)","v":8.9600000000000009},{"$f":"(A129-B129)*(Equations!$G$69*$R$121+C129)","v":5.6000000000000005}]
[14,0.13461538461538464,{"$f":"IF(B130>=$H$121,IF($D$121=\"CC\", $G$121, B130/$G$121), 0)","v":0.2},{"$f":"B121","v":6.5185185185185182},{"$f":"MIN(D130/(A130-B130),$C$121)","v":0.4701289361483536},{"$f":"Equations!$G$69+C130","v":0.52},{"$f":"IF($F$121=\"Soft Start\", F130, E130)","v":0.52},0.32,{"$f":"(COUTMAX/1000000)*(B130-B129)/H130","v":1.2620192307692311E-3},{"$f":"J129+I130","v":1.2620192307692311E-3},{"$f":"J130*1000","v":1.2620192307692311},{"$f":"H130/G130","v":0.61538461538461542},1.1688156024725596E-2,{"$f":"I130*G130*(A130-B130)","v":9.0991586538461556E-3},{"$f":"G130*(A130-B130)","v":7.21},{"$f":"(A130-B130)*(Equations!$G$69*$Q$121+C130)","v":8.8738461538461539},{"$f":"(A130-B130)*(Equations!$G$69*$R$121+C130)","v":5.546153846153846}]
[14,0.26923076923076927,0.2,{"$f":"B121","v":6.5185185185185182},0.47473804336549436,{"$f":"Equations!$G$69+C131","v":0.52},0.52,0.32,1.2620192307692311E-3,{"$f":"J130+I131","v":2.5240384615384621E-3},2.5240384615384621,0.61538461538461542,1.2456340560915722E-2,{"$f":"I131*G131*(A131-B131)","v":9.01081730769231E-3},7.14,{"$f":"(A131-B131)*(Equations!$G$69*$Q$121+C131)","v":8.787692307692307},{"$f":"(A131-B131)*(Equations!$G$69*$R$121+C131)","v":5.4923076923076923},null,null,null,null,null,null,"Start-up slop "]
[14,0.40384615384615385,0.2,{"$f":"B121","v":6.5185185185185182},0.47943842003247938,{"$f":"Equations!$G$69+C132","v":0.52},0.52,0.32,1.2620192307692306E-3,3.7860576923076927E-3,3.7860576923076925,0.61538461538461542,1.3239736672079892E-2,{"$f":"I132*G132*(A132-B132)","v":8.9224759615384609E-3},7.07,{"$f":"(A132-B132)*(Equations!$G$69*$Q$121+C132)","v":8.7015384615384619},{"$f":"(A132-B132)*(Equations!$G$69*$R$121+C132)","v":5.4384615384615387},null,null,null,null,null,null,"QG",0.3]
[14,0.53846153846153855,0.2,{"$f":"B121","v":6.5185185185185182},0.48423280423280418,{"$f":"Equations!$G$69+C133","v":0.52},0.52,0.32,1.2620192307692315E-3,5.0480769230769242E-3,5.0480769230769242,0.61538461538461542,1.403880070546736E-2,8.8341346153846204E-3,7,{"$f":"(A133-B133)*(Equations!$G$69*$Q$121+C133)","v":8.615384615384615},{"$f":"(A133-B133)*(Equations!$G$69*$R$121+C133)","v":5.384615384615385},null,null,null,null,null,null,"I_Src",0.3]
[14,0.67307692307692313,0.2,{"$f":"B121","v":6.5185185185185182},0.48912404467960025,{"$f":"Equations!$G$69+C134","v":0.52},0.52,0.32,1.2620192307692306E-3,6.3100961538461548E-3,6.3100961538461551,0.61538461538461542,1.4854007446600037E-2,8.7457932692307679E-3,6.93,{"$f":"(A134-B134)*(Equations!$G$69*$Q$121+C134)","v":8.5292307692307698},{"$f":"(A134-B134)*(Equations!$G$69*$R$121+C134)","v":5.3307692307692314},null,null,null,null,null,null,"RMS",{"$f":"SQRT(Y133^2+Y132^2)","v":0.42426406871192851}]
[14,0.80769230769230771,0.2,{"$f":"B121","v":6.5185185185185182},0.49411510636000433,{"$f":"Equations!$G$69+C135","v":0.52},0.52,0.32,1.2620192307692306E-3,7.5721153846153855E-3,7.572115384615385,0.61538461538461542,1.5685851060000717E-2,8.6574519230769222E-3,6.86,{"$f":"(A135-B135)*(Equations!$G$69*$Q$121+C135)","v":8.4430769230769229},{"$f":"(A135-B135)*(Equations!$G$69*$R$121+C135)","v":5.2769230769230768}]
[14,0.94230769230769229,0.2,{"$f":"B121","v":6.5185185185185182},0.49920907652866409,{"$f":"Equations!$G$69+C136","v":0.52},0.52,0.32,1.2620192307692306E-3,8.8341346153846152E-3,8.834134615384615,0.61538461538461542,1.6534846088110677E-2,8.5691105769230766E-3,6.7900000000000009,{"$f":"(A136-B136)*(Equations!$G$69*$Q$121+C136)","v":8.3569230769230778},{"$f":"(A136-B136)*(Equations!$G$69*$R$121+C136)","v":5.2230769230769241},null,null,null,null,null,null,"PLIM",0.3]
[14,1.0769230769230771,0.2,{"$f":"B121","v":6.5185185185185182},0.50440917107583771,{"$f":"Equations!$G$69+C137","v":0.52},0.52,0.32,1.2620192307692326E-3,1.0096153846153848E-2,10.096153846153848,0.61538461538461542,1.7401528512639618E-2,8.4807692307692431E-3,6.7200000000000006,{"$f":"(A137-B137)*(Equations!$G$69*$Q$121+C137)","v":8.2707692307692309},{"$f":"(A137-B137)*(Equations!$G$69*$R$121+C137)","v":5.1692307692307695},null,null,null,null,null,null,"combined",{"$f":"MAX(Y134:Y136)","v":0.42426406871192851}]
[14,1.2115384615384615,0.2,{"$f":"B121","v":6.5185185185185182},0.50971874129768868,{"$f":"Equations!$G$69+C138","v":0.52},0.52,0.32,1.2620192307692282E-3,1.1358173076923076E-2,11.358173076923077,0.61538461538461542,1.8286456882948107E-2,8.392427884615368E-3,6.65,{"$f":"(A138-B138)*(Equations!$G$69*$Q$121+C138)","v":8.184615384615384},{"$f":"(A138-B138)*(Equations!$G$69*$R$121+C138)","v":5.1153846153846159}]
[14,1.3461538461538463,0.2,{"$f":"B121","v":6.5185185185185182},0.51514128109872792,{"$f":"Equations!$G$69+C139","v":0.52},0.52,0.32,1.2620192307692326E-3,1.262019230769231E-2,12.62019230769231,0.61538461538461542,1.9190213516454651E-2,8.3040865384615501E-3,6.58,{"$f":"(A139-B139)*(Equations!$G$69*$Q$121+C139)","v":8.0984615384615388},{"$f":"(A139-B139)*(Equations!$G$69*$R$121+C139)","v":5.0615384615384613},null,null,null,null,null,null,"I_timer",0.2]
[14,1.4807692307692308,0.2,{"$f":"B121","v":6.5185185185185182},0.52068043465892921,{"$f":"Equations!$G$69+C140","v":0.52},0.52,0.32,1.2620192307692306E-3,1.3882211538461541E-2,13.882211538461542,0.61538461538461542,2.0113405776488198E-2,8.2157451923076923E-3,6.5100000000000007,{"$f":"(A140-B140)*(Equations!$G$69*$Q$121+C140)","v":8.0123076923076937},{"$f":"(A140-B140)*(Equations!$G$69*$R$121+C140)","v":5.0076923076923086},null,null,null,null,null,null,"C_timer",0.2]
[14,1.6153846153846154,0.2,{"$f":"B121","v":6.5185185185185182},0.52634000460087416,{"$f":"Equations!$G$69+C141","v":0.52},0.52,0.32,1.2620192307692306E-3,1.5144230769230771E-2,15.14423076923077,0.61538461538461542,2.1056667433479021E-2,8.127403846153845E-3,6.44,{"$f":"(A141-B141)*(Equations!$G$69*$Q$121+C141)","v":7.9261538461538468},{"$f":"(A141-B141)*(Equations!$G$69*$R$121+C141)","v":4.953846153846154},null,null,null,null,null,null,"RMS",{"$f":"SQRT(Y140^2+Y139^2)","v":0.28284271247461906}]
[14,1.75,0.2,{"$f":"B121","v":6.5185185185185182},0.53212396069538925,{"$f":"Equations!$G$69+C142","v":0.52},0.52,0.32,1.2620192307692306E-3,1.6406250000000001E-2,16.40625,0.61538461538461542,2.2020660115898205E-2,8.0390624999999993E-3,6.37,{"$f":"(A142-B142)*(Equations!$G$69*$Q$121+C142)","v":7.84},{"$f":"(A142-B142)*(Equations!$G$69*$R$121+C142)","v":4.9000000000000004}]
[14,1.8846153846153846,0.2,{"$f":"B121","v":6.5185185185185182},0.53803644914756021,{"$f":"Equations!$G$69+C143","v":0.52},0.52,0.32,1.2620192307692306E-3,1.766826923076923E-2,17.66826923076923,0.61538461538461542,2.3006074857926696E-2,7.950721153846152E-3,6.3,{"$f":"(A143-B143)*(Equations!$G$69*$Q$121+C143)","v":7.7538461538461538},{"$f":"(A143-B143)*(Equations!$G$69*$R$121+C143)","v":4.8461538461538467},null,null,null,null,null,null,"Final",{"$f":"SQRT(Y137^2+Y141^2)","v":0.50990195135927852}]
[14,2.0192307692307692,0.2,{"$f":"B121","v":6.5185185185185182},0.54408180250876881,{"$f":"Equations!$G$69+C144","v":0.52},0.52,0.32,1.2620192307692306E-3,1.893028846153846E-2,18.93028846153846,0.61538461538461542,2.4013633751461465E-2,7.8623798076923063E-3,6.2299999999999995,{"$f":"(A144-B144)*(Equations!$G$69*$Q$121+C144)","v":7.6676923076923069},{"$f":"(A144-B144)*(Equations!$G$69*$R$121+C144)","v":4.7923076923076922}]
[14,2.1538461538461542,0.2,{"$f":"B121","v":6.5185185185185182},0.55026455026455023,{"$f":"Equations!$G$69+C145","v":0.52},0.52,0.32,1.2620192307692345E-3,2.0192307692307693E-2,20.192307692307693,0.61538461538461542,2.504409171075837E-2,7.7740384615384859E-3,6.16,{"$f":"(A145-B145)*(Equations!$G$69*$Q$121+C145)","v":7.5815384615384618},{"$f":"(A145-B145)*(Equations!$G$69*$R$121+C145)","v":4.7384615384615385}]
[14,2.2884615384615383,0.2,{"$f":"B121","v":6.5185185185185182},0.5565894301526485,{"$f":"Equations!$G$69+C146","v":0.52},0.52,0.32,1.2620192307692263E-3,2.145432692307692E-2,21.45432692307692,0.61538461538461542,2.6098238358774745E-2,7.6856971153845882E-3,6.09,{"$f":"(A146-B146)*(Equations!$G$69*$Q$121+C146)","v":7.4953846153846158},{"$f":"(A146-B146)*(Equations!$G$69*$R$121+C146)","v":4.6846153846153848}]
[14,2.4230769230769229,0.2,{"$f":"B121","v":6.5185185185185182},0.56306140027070262,{"$f":"Equations!$G$69+C147","v":0.52},0.52,0.32,1.2620192307692306E-3,2.2716346153846149E-2,22.71634615384615,0.61538461538461542,2.7176900045117098E-2,7.5973557692307686E-3,6.0200000000000005,{"$f":"(A147-B147)*(Equations!$G$69*$Q$121+C147)","v":7.4092307692307688},{"$f":"(A147-B147)*(Equations!$G$69*$R$121+C147)","v":4.6307692307692312}]
[14,2.5576923076923075,0.2,{"$f":"B121","v":6.5185185185185182},0.56968565203859312,{"$f":"Equations!$G$69+C148","v":0.52},0.52,0.32,1.2620192307692306E-3,2.3978365384615379E-2,23.97836538461538,0.61538461538461542,2.8280942006432181E-2,7.5090144230769229E-3,5.9500000000000011,{"$f":"(A148-B148)*(Equations!$G$69*$Q$121+C148)","v":7.3230769230769237},{"$f":"(A148-B148)*(Equations!$G$69*$R$121+C148)","v":4.5769230769230775}]
[14,2.6923076923076925,0.2,{"$f":"B121","v":6.5185185185185182},0.57646762408667174,{"$f":"Equations!$G$69+C149","v":0.52},0.52,0.32,1.2620192307692345E-3,2.5240384615384612E-2,25.240384615384613,0.61538461538461542,2.9411270681111951E-2,7.420673076923099E-3,5.88,{"$f":"(A149-B149)*(Equations!$G$69*$Q$121+C149)","v":7.2369230769230768},{"$f":"(A149-B149)*(Equations!$G$69*$R$121+C149)","v":4.523076923076923}]
[14,2.8269230769230771,0.2,{"$f":"B121","v":6.5185185185185182},0.5834130171479569,{"$f":"Equations!$G$69+C150","v":0.52},0.52,0.32,1.2620192307692306E-3,2.6502403846153842E-2,26.502403846153843,0.61538461538461542,3.0568836191326144E-2,7.3323317307692299E-3,5.8100000000000005,{"$f":"(A150-B150)*(Equations!$G$69*$Q$121+C150)","v":7.1507692307692308},{"$f":"(A150-B150)*(Equations!$G$69*$R$121+C150)","v":4.4692307692307693}]
[14,2.9615384615384617,0.2,{"$f":"B121","v":6.5185185185185182},0.5905278100400051,{"$f":"Equations!$G$69+C151","v":0.52},0.52,0.32,1.2620192307692306E-3,2.7764423076923072E-2,27.764423076923073,0.61538461538461542,3.175463500666751E-2,7.2439903846153834E-3,5.74,{"$f":"(A151-B151)*(Equations!$G$69*$Q$121+C151)","v":7.0646153846153847},{"$f":"(A151-B151)*(Equations!$G$69*$R$121+C151)","v":4.4153846153846157}]
[14,3.0961538461538458,0.2,{"$f":"B121","v":6.5185185185185182},0.5978182768306225,{"$f":"Equations!$G$69+C152","v":0.52},0.52,0.32,1.2620192307692263E-3,2.9026442307692298E-2,29.026442307692299,0.61538461538461542,3.2969712805103739E-2,7.1556490384615127E-3,5.67,{"$f":"(A152-B152)*(Equations!$G$69*$Q$121+C152)","v":6.9784615384615378},{"$f":"(A152-B152)*(Equations!$G$69*$R$121+C152)","v":4.3615384615384611}]
[14,3.2307692307692308,0.2,{"$f":"B121","v":6.5185185185185182},0.60529100529100521,{"$f":"Equations!$G$69+C153","v":0.52},0.52,0.32,1.2620192307692345E-3,3.0288461538461531E-2,30.288461538461533,0.61538461538461542,3.4215167548500861E-2,7.0673076923077147E-3,5.6000000000000005,{"$f":"(A153-B153)*(Equations!$G$69*$Q$121+C153)","v":6.8923076923076927},{"$f":"(A153-B153)*(Equations!$G$69*$R$121+C153)","v":4.3076923076923084}]
[14,3.3653846153846154,0.2,{"$f":"B121","v":6.5185185185185182},0.6129529167503851,{"$f":"Equations!$G$69+C154","v":0.52},0.52,0.32,1.2620192307692306E-3,3.1550480769230761E-2,31.550480769230763,0.61538461538461542,3.5492152791730847E-2,6.9789663461538457E-3,5.53,{"$f":"(A154-B154)*(Equations!$G$69*$Q$121+C154)","v":6.8061538461538467},{"$f":"(A154-B154)*(Equations!$G$69*$R$121+C154)","v":4.2538461538461538}]
[14,3.5,0.2,{"$f":"B121","v":6.5185185185185182},0.62081128747795411,{"$f":"Equations!$G$69+C155","v":0.52},0.52,0.32,1.2620192307692306E-3,3.2812499999999994E-2,32.812499999999993,0.61538461538461542,3.6801881246325677E-2,6.8906249999999992E-3,5.46,{"$f":"(A155-B155)*(Equations!$G$69*$Q$121+C155)","v":6.72},{"$f":"(A155-B155)*(Equations!$G$69*$R$121+C155)","v":4.2}]
[14,3.634615384615385,0.2,{"$f":"B121","v":6.5185185185185182},0.62887377173091463,{"$f":"Equations!$G$69+C156","v":0.52},0.52,0.32,1.2620192307692345E-3,3.4074519230769228E-2,34.074519230769226,0.61538461538461542,3.8145628621819104E-2,6.8022836538461744E-3,5.39,{"$f":"(A156-B156)*(Equations!$G$69*$Q$121+C156)","v":6.6338461538461537},{"$f":"(A156-B156)*(Equations!$G$69*$R$121+C156)","v":4.1461538461538465}]
[14,3.7692307692307692,0.2,{"$f":"B121","v":6.5185185185185182},0.6371484266221108,{"$f":"Equations!$G$69+C157","v":0.52},0.52,0.32,1.2620192307692263E-3,3.5336538461538454E-2,35.336538461538453,0.61538461538461542,3.9524737770351794E-2,6.7139423076922828E-3,5.3199999999999994,{"$f":"(A157-B157)*(Equations!$G$69*$Q$121+C157)","v":6.5476923076923077},{"$f":"(A157-B157)*(Equations!$G$69*$R$121+C157)","v":4.092307692307692}]
[14,3.9038461538461542,0.2,{"$f":"B121","v":6.5185185185185182},0.64564373897707228,{"$f":"Equations!$G$69+C158","v":0.52},0.52,0.32,1.2620192307692345E-3,3.6598557692307687E-2,36.598557692307686,0.61538461538461542,4.0940623162845372E-2,6.6256009615384822E-3,5.2500000000000009,{"$f":"(A158-B158)*(Equations!$G$69*$Q$121+C158)","v":6.4615384615384617},{"$f":"(A158-B158)*(Equations!$G$69*$R$121+C158)","v":4.0384615384615392}]
[14,4.0384615384615383,0.2,{"$f":"B121","v":6.5185185185185182},0.65436865436865432,{"$f":"Equations!$G$69+C159","v":0.52},0.52,0.32,1.2620192307692263E-3,3.7860576923076913E-2,37.860576923076913,0.61538461538461542,4.2394775728109048E-2,6.5372596153845924E-3,5.1800000000000006,{"$f":"(A159-B159)*(Equations!$G$69*$Q$121+C159)","v":6.3753846153846156},{"$f":"(A159-B159)*(Equations!$G$69*$R$121+C159)","v":3.9846153846153847}]
[14,4.1730769230769234,0.2,{"$f":"B121","v":6.5185185185185182},0.66333260853808795,{"$f":"Equations!$G$69+C160","v":0.52},0.52,0.32,1.2620192307692345E-3,3.9122596153846147E-2,39.122596153846146,0.61538461538461542,4.388876808968132E-2,6.4489182692307884E-3,5.1100000000000003,{"$f":"(A160-B160)*(Equations!$G$69*$Q$121+C160)","v":6.2892307692307696},{"$f":"(A160-B160)*(Equations!$G$69*$R$121+C160)","v":3.930769230769231}]
[14,{"$f":"VINMAX*((ROW()-129)/104)","v":4.3076923076923084},0.2,{"$f":"B121","v":6.5185185185185182},0.67254556143445032,{"$f":"Equations!$G$69+C161","v":0.52},0.52,0.32,1.2620192307692345E-3,4.038461538461538E-2,40.38461538461538,0.61538461538461542,4.5424260239075052E-2,6.3605769230769419E-3,5.04,{"$f":"(A161-B161)*(Equations!$G$69*$Q$121+C161)","v":6.2030769230769227},{"$f":"(A161-B161)*(Equations!$G$69*$R$121+C161)","v":3.8769230769230769}]
[14,4.4423076923076916,0.2,{"$f":"B121","v":6.5185185185185182},0.68201803413071005,{"$f":"Equations!$G$69+C162","v":0.52},0.52,0.32,1.262019230769218E-3,4.1646634615384599E-2,41.646634615384599,0.61538461538461542,4.7003005688451664E-2,6.2722355769230147E-3,4.9700000000000006,{"$f":"(A162-B162)*(Equations!$G$69*$Q$121+C162)","v":6.1169230769230776},{"$f":"(A162-B162)*(Equations!$G$69*$R$121+C162)","v":3.8230769230769237}]
[14,4.5769230769230766,0.2,{"$f":"B121","v":6.5185185185185182},0.69176114890400597,{"$f":"Equations!$G$69+C163","v":0.52},0.52,0.32,1.2620192307692345E-3,4.2908653846153832E-2,42.908653846153832,0.61538461538461542,4.8626858150667661E-2,6.1838942307692497E-3,4.9000000000000004,{"$f":"(A163-B163)*(Equations!$G$69*$Q$121+C163)","v":6.0307692307692307},{"$f":"(A163-B163)*(Equations!$G$69*$R$121+C163)","v":3.7692307692307696}]
[14,4.7115384615384617,0.2,{"$f":"B121","v":6.5185185185185182},0.70178667280116558,{"$f":"Equations!$G$69+C164","v":0.52},0.52,0.32,1.2620192307692345E-3,4.4170673076923066E-2,44.170673076923066,0.61538461538461542,5.0297778800194259E-2,6.0955528846154032E-3,4.83,{"$f":"(A164-B164)*(Equations!$G$69*$Q$121+C164)","v":5.9446153846153846},{"$f":"(A164-B164)*(Equations!$G$69*$R$121+C164)","v":3.7153846153846155}]
[14,4.8461538461538458,0.2,{"$f":"B121","v":6.5185185185185182},0.71210706504824151,{"$f":"Equations!$G$69+C165","v":0.52},0.52,0.32,1.2620192307692263E-3,4.5432692307692292E-2,45.432692307692292,0.61538461538461542,5.2017844174706909E-2,6.0072115384615168E-3,4.76,{"$f":"(A165-B165)*(Equations!$G$69*$Q$121+C165)","v":5.8584615384615386},{"$f":"(A165-B165)*(Equations!$G$69*$R$121+C165)","v":3.6615384615384614}]
[14,4.9807692307692308,0.2,{"$f":"B121","v":6.5185185185185182},0.72273552870567781,{"$f":"Equations!$G$69+C166","v":0.52},0.52,0.32,1.2620192307692345E-3,4.6694711538461525E-2,46.694711538461526,0.61538461538461542,5.3789254784279629E-2,5.9188701923077111E-3,4.6900000000000004,{"$f":"(A166-B166)*(Equations!$G$69*$Q$121+C166)","v":5.7723076923076926},{"$f":"(A166-B166)*(Equations!$G$69*$R$121+C166)","v":3.6076923076923082}]
[14,5.115384615384615,0.2,{"$f":"B121","v":6.5185185185185182},0.73368606701940031,{"$f":"Equations!$G$69+C167","v":0.52},0.52,0.32,1.2620192307692263E-3,4.7956730769230752E-2,47.956730769230752,0.61538461538461542,5.5614344503233382E-2,5.8305288461538256E-3,4.62,{"$f":"(A167-B167)*(Equations!$G$69*$Q$121+C167)","v":5.6861538461538466},{"$f":"(A167-B167)*(Equations!$G$69*$R$121+C167)","v":3.5538461538461541}]
[14,5.25,0.2,{"$f":"B121","v":6.5185185185185182},0.74497354497354495,{"$f":"Equations!$G$69+C168","v":0.52},0.52,0.32,1.2620192307692345E-3,4.9218749999999985E-2,49.218749999999986,0.61538461538461542,5.7495590828924151E-2,5.7421875000000172E-3,4.55,{"$f":"(A168-B168)*(Equations!$G$69*$Q$121+C168)","v":5.6000000000000005},{"$f":"(A168-B168)*(Equations!$G$69*$R$121+C168)","v":3.5}]
[14,5.384615384615385,0.2,{"$f":"B121","v":6.5185185185185182},0.75661375661375663,{"$f":"Equations!$G$69+C169","v":0.52},0.52,0.32,1.2620192307692345E-3,5.0480769230769218E-2,50.480769230769219,0.61538461538461542,5.9435626102292763E-2,5.6538461538461707E-3,4.4799999999999995,{"$f":"(A169-B169)*(Equations!$G$69*$Q$121+C169)","v":5.5138461538461536},{"$f":"(A169-B169)*(Equations!$G$69*$R$121+C169)","v":3.4461538461538463}]
[14,5.5192307692307692,0.2,{"$f":"B121","v":6.5185185185185182},0.76862349878222902,{"$f":"Equations!$G$69+C170","v":0.52},0.52,0.32,1.2620192307692263E-3,5.1742788461538444E-2,51.742788461538446,0.61538461538461542,6.1437249797038157E-2,5.5655048076922869E-3,4.41,{"$f":"(A170-B170)*(Equations!$G$69*$Q$121+C170)","v":5.4276923076923076},{"$f":"(A170-B170)*(Equations!$G$69*$R$121+C170)","v":3.3923076923076922}]
[14,5.6538461538461542,0.2,{"$f":"B121","v":6.5185185185185182},0.78102065198839388,{"$f":"Equations!$G$69+C171","v":0.52},0.52,0.32,1.2620192307692345E-3,5.3004807692307677E-2,53.004807692307679,0.61538461538461542,6.3503441998065638E-2,5.4771634615384786E-3,4.3400000000000007,{"$f":"(A171-B171)*(Equations!$G$69*$Q$121+C171)","v":5.3415384615384616},{"$f":"(A171-B171)*(Equations!$G$69*$R$121+C171)","v":3.338461538461539}]
[14,5.7884615384615383,0.2,{"$f":"B121","v":6.5185185185185182},0.79382426923410521,{"$f":"Equations!$G$69+C172","v":0.52},0.52,0.32,1.2620192307692263E-3,5.4266826923076904E-2,54.266826923076906,0.61538461538461542,6.5637378205684202E-2,5.3888221153845966E-3,4.2700000000000005,{"$f":"(A172-B172)*(Equations!$G$69*$Q$121+C172)","v":5.2553846153846155},{"$f":"(A172-B172)*(Equations!$G$69*$R$121+C172)","v":3.2846153846153849}]
[14,5.9230769230769234,0.2,{"$f":"B121","v":6.5185185185185182},0.80705467372134032,{"$f":"Equations!$G$69+C173","v":0.52},0.52,0.32,1.2620192307692345E-3,5.5528846153846137E-2,55.528846153846139,0.61538461538461542,6.7842445620223388E-2,5.3004807692307847E-3,4.2,{"$f":"(A173-B173)*(Equations!$G$69*$Q$121+C173)","v":5.1692307692307695},{"$f":"(A173-B173)*(Equations!$G$69*$R$121+C173)","v":3.2307692307692308}]
[14,6.0576923076923084,0.2,{"$f":"B121","v":6.5185185185185182},0.82073356649627838,{"$f":"Equations!$G$69+C174","v":0.52},0.52,0.32,1.2620192307692345E-3,5.679086538461537E-2,56.790865384615373,0.61538461538461542,7.012226108271305E-2,5.2121394230769382E-3,4.13,{"$f":"(A174-B174)*(Equations!$G$69*$Q$121+C174)","v":5.0830769230769226},{"$f":"(A174-B174)*(Equations!$G$69*$R$121+C174)","v":3.1769230769230767}]
[14,6.1923076923076916,0.2,{"$f":"B121","v":6.5185185185185182},0.8348841452289727,{"$f":"Equations!$G$69+C175","v":0.52},0.52,0.32,1.262019230769218E-3,5.805288461538459E-2,58.052884615384592,0.61538461538461542,7.2480690871495446E-2,5.1237980769230258E-3,4.0600000000000005,{"$f":"(A175-B175)*(Equations!$G$69*$Q$121+C175)","v":4.9969230769230775},{"$f":"(A175-B175)*(Equations!$G$69*$R$121+C175)","v":3.1230769230769235}]
[14,6.3269230769230766,0.2,{"$f":"B121","v":6.5185185185185182},0.84953123549614773,{"$f":"Equations!$G$69+C176","v":0.52},0.52,0.32,1.2620192307692345E-3,5.9314903846153823E-2,59.314903846153825,0.61538461538461542,7.4921872582691285E-2,5.0354567307692461E-3,3.99,{"$f":"(A176-B176)*(Equations!$G$69*$Q$121+C176)","v":4.9107692307692314},{"$f":"(A176-B176)*(Equations!$G$69*$R$121+C176)","v":3.0692307692307694}]
[14,6.4615384615384617,0.2,{"$f":"B121","v":6.5185185185185182},0.86470143613000749,{"$f":"Equations!$G$69+C177","v":0.52},0.52,0.32,1.2620192307692345E-3,6.0576923076923056E-2,60.576923076923059,0.61538461538461542,7.7450239355001241E-2,4.9471153846153996E-3,3.92,{"$f":"(A177-B177)*(Equations!$G$69*$Q$121+C177)","v":4.8246153846153845},{"$f":"(A177-B177)*(Equations!$G$69*$R$121+C177)","v":3.0153846153846153}]
[14,6.5961538461538458,0.2,{"$f":"B121","v":6.5185185185185182},0.88042328042328033,{"$f":"Equations!$G$69+C178","v":0.52},0.52,0.32,1.2620192307692263E-3,6.1838942307692282E-2,61.838942307692285,0.61538461538461542,8.0070546737213394E-2,4.858774038461521E-3,3.85,{"$f":"(A178-B178)*(Equations!$G$69*$Q$121+C178)","v":4.7384615384615385},{"$f":"(A178-B178)*(Equations!$G$69*$R$121+C178)","v":2.9615384615384617}]
[14,6.7307692307692308,0.2,{"$f":"B121","v":6.5185185185185182},0.89672741524593369,{"$f":"Equations!$G$69+C179","v":0.52},0.52,0.32,1.2620192307692345E-3,6.3100961538461522E-2,63.100961538461526,0.61538461538461542,8.2787902540988945E-2,4.7704326923077066E-3,3.7800000000000002,{"$f":"(A179-B179)*(Equations!$G$69*$Q$121+C179)","v":4.6523076923076925},{"$f":"(A179-B179)*(Equations!$G$69*$R$121+C179)","v":2.907692307692308}]
[14,6.865384615384615,0.2,{"$f":"B121","v":6.5185185185185182},0.91364680043925317,{"$f":"Equations!$G$69+C180","v":0.52},0.52,0.32,1.2620192307692263E-3,6.4362980769230749E-2,64.362980769230745,0.61538461538461542,8.5607800073208853E-2,{"$f":"I180*G180*(A180-B180)","v":4.6820913461538298E-3},3.7100000000000004,{"$f":"(A180-B180)*(Equations!$G$69*$Q$121+C180)","v":4.5661538461538465},{"$f":"(A180-B180)*(Equations!$G$69*$R$121+C180)","v":2.8538461538461544}]
[14,7,0.2,{"$f":"B121","v":6.5185185185185182},0.93121693121693117,{"$f":"Equations!$G$69+C181","v":0.52},0.52,0.32,1.2620192307692345E-3,6.5624999999999989E-2,65.624999999999986,0.61538461538461542,8.8536155202821848E-2,{"$f":"I181*G181*(A181-B181)","v":4.5937500000000136E-3},3.64,{"$f":"(A181-B181)*(Equations!$G$69*$Q$121+C181)","v":4.4800000000000004},{"$f":"(A181-B181)*(Equations!$G$69*$R$121+C181)","v":2.8000000000000003}]
[14,7.1346153846153841,0.2,{"$f":"B121","v":6.5185185185185182},0.9494760867309886,{"$f":"Equations!$G$69+C182","v":0.52},0.52,0.32,1.2620192307692263E-3,6.6887019230769215E-2,66.887019230769212,0.61538461538461542,9.1579347788498106E-2,4.5054086538461376E-3,3.5700000000000003,{"$f":"(A182-B182)*(Equations!$G$69*$Q$121+C182)","v":4.3938461538461544},{"$f":"(A182-B182)*(Equations!$G$69*$R$121+C182)","v":2.7461538461538466}]
[14,7.2692307692307701,0.2,{"$f":"B121","v":6.5185185185185182},0.96846560846560859,{"$f":"Equations!$G$69+C183","v":0.52},0.52,0.32,1.262019230769243E-3,6.8149038461538455E-2,68.149038461538453,0.61538461538461542,9.4744268077601418E-2,4.4170673076923501E-3,3.4999999999999996,{"$f":"(A183-B183)*(Equations!$G$69*$Q$121+C183)","v":4.3076923076923075},{"$f":"(A183-B183)*(Equations!$G$69*$R$121+C183)","v":2.6923076923076921}]
[14,7.4038461538461542,0.2,{"$f":"B121","v":6.5185185185185182},0.98823021272000866,{"$f":"Equations!$G$69+C184","v":0.52},0.52,0.32,1.2620192307692263E-3,6.9411057692307682E-2,69.411057692307679,0.61538461538461542,9.8038368786668106E-2,4.3287259615384455E-3,3.43,{"$f":"(A184-B184)*(Equations!$G$69*$Q$121+C184)","v":4.2215384615384615},{"$f":"(A184-B184)*(Equations!$G$69*$R$121+C184)","v":2.6384615384615384}]
[14,7.5384615384615383,0.2,{"$f":"B121","v":6.5185185185185182},1.0088183421516754,{"$f":"Equations!$G$69+C185","v":0.52},0.52,0.32,1.2620192307692263E-3,7.0673076923076908E-2,70.673076923076906,0.61538461538461542,0.1014697236919459,4.2403846153846007E-3,3.3600000000000003,{"$f":"(A185-B185)*(Equations!$G$69*$Q$121+C185)","v":4.1353846153846154},{"$f":"(A185-B185)*(Equations!$G$69*$R$121+C185)","v":2.5846153846153848}]
[14,7.6730769230769234,0.2,{"$f":"B121","v":6.5185185185185182},1.0302825621974558,{"$f":"Equations!$G$69+C186","v":0.52},0.52,0.32,1.2620192307692345E-3,7.1935096153846148E-2,71.935096153846146,0.61538461538461542,0.10504709369957597,4.152043269230782E-3,3.29,{"$f":"(A186-B186)*(Equations!$G$69*$Q$121+C186)","v":4.0492307692307694},{"$f":"(A186-B186)*(Equations!$G$69*$R$121+C186)","v":2.5307692307692307}]
[14,7.8076923076923084,0.2,{"$f":"B121","v":6.5185185185185182},1.0526800092017483,{"$f":"Equations!$G$69+C187","v":0.52},0.52,0.32,1.2620192307692345E-3,7.3197115384615388E-2,73.197115384615387,0.61538461538461542,0.1087800015336247,4.0637019230769346E-3,3.2199999999999998,{"$f":"(A187-B187)*(Equations!$G$69*$Q$121+C187)","v":3.9630769230769229},{"$f":"(A187-B187)*(Equations!$G$69*$R$121+C187)","v":2.476923076923077}]
[14,7.9423076923076916,0.2,{"$f":"B121","v":6.5185185185185182},1.0760728982951204,{"$f":"Equations!$G$69+C188","v":0.52},0.52,0.32,1.262019230769218E-3,7.4459134615384601E-2,74.459134615384599,0.61538461538461542,0.11267881638252006,3.9753605769230378E-3,3.1500000000000004,{"$f":"(A188-B188)*(Equations!$G$69*$Q$121+C188)","v":3.8769230769230774},{"$f":"(A188-B188)*(Equations!$G$69*$R$121+C188)","v":2.4230769230769234}]
[14,8.0769230769230766,0.2,{"$f":"B121","v":6.5185185185185182},1.1005291005291005,{"$f":"Equations!$G$69+C189","v":0.52},0.52,0.32,1.2620192307692345E-3,7.5721153846153841E-2,75.72115384615384,0.61538461538461542,0.1167548500881834,3.8870192307692429E-3,3.08,{"$f":"(A189-B189)*(Equations!$G$69*$Q$121+C189)","v":3.7907692307692309},{"$f":"(A189-B189)*(Equations!$G$69*$R$121+C189)","v":2.3692307692307693}]
[14,8.2115384615384617,0.2,{"$f":"B121","v":6.5185185185185182},1.1261228005414052,{"$f":"Equations!$G$69+C190","v":0.52},0.52,0.32,1.2620192307692345E-3,7.6983173076923081E-2,76.98317307692308,0.61538461538461542,0.12102046675690085,3.798677884615396E-3,3.0100000000000002,{"$f":"(A190-B190)*(Equations!$G$69*$Q$121+C190)","v":3.7046153846153844},{"$f":"(A190-B190)*(Equations!$G$69*$R$121+C190)","v":2.3153846153846156}]
[14,8.3461538461538467,0.2,{"$f":"B121","v":6.5185185185185182},1.1529352481733435,{"$f":"Equations!$G$69+C191","v":0.52},0.52,0.32,1.2620192307692345E-3,7.8245192307692321E-2,78.245192307692321,0.61538461538461542,0.12548920802889055,3.7103365384615495E-3,2.94,{"$f":"(A191-B191)*(Equations!$G$69*$Q$121+C191)","v":3.6184615384615384},{"$f":"(A191-B191)*(Equations!$G$69*$R$121+C191)","v":2.2615384615384615}]
[14,8.4807692307692299,0.2,{"$f":"B121","v":6.5185185185185182},1.1810556200800102,{"$f":"Equations!$G$69+C192","v":0.52},0.52,0.32,1.262019230769218E-3,7.9507211538461534E-2,79.507211538461533,0.61538461538461542,0.13017593668000169,3.6219951923076566E-3,2.8700000000000006,{"$f":"(A192-B192)*(Equations!$G$69*$Q$121+C192)","v":3.5323076923076928},{"$f":"(A192-B192)*(Equations!$G$69*$R$121+C192)","v":2.2076923076923083}]
[{"$f":"VINMAX","v":14},{"$f":"VINMAX*((ROW()-129)/104)","v":8.6153846153846168},0.2,{"$f":"B121","v":6.5185185185185182},1.2105820105820109,{"$f":"Equations!$G$69+C193","v":0.52},0.52,{"$f":"G193-C193","v":0.32},1.2620192307692512E-3,8.0769230769230788E-2,80.769230769230788,0.61538461538461542,{"$f":"1/COUTMAX*(E193/2-C193)*1000","v":0.13509700176366846},3.5336538461539029E-3,2.7999999999999994,{"$f":"(A193-B193)*(Equations!$G$69*$Q$121+C193)","v":3.4461538461538455},{"$f":"(A193-B193)*(Equations!$G$69*$R$121+C193)","v":2.1538461538461533}]
[14,8.75,{"$f":"IF(B194>=$H$121,IF($D$121=\"CC\", $G$121, B194/$G$121), 0)","v":0.2},{"$f":"B121","v":6.5185185185185182},{"$f":"MIN(D194/(A194-B194),$C$121)","v":1.2416225749559082},{"$f":"Equations!$G$69+C194","v":0.52},{"$f":"IF($F$121=\"Soft Start\", F194, E194)","v":0.52},0.32,{"$f":"(COUTMAX/1000000)*(B194-B193)/H194","v":1.262019230769218E-3},8.203125E-2,{"$f":"J194*1000","v":82.03125},{"$f":"H194/G194","v":0.61538461538461542},0.14027042915931803,3.4453124999999653E-3,{"$f":"G194*(A194-B194)","v":2.73},{"$f":"(A194-B194)*(Equations!$G$69*$Q$121+C194)","v":3.36},{"$f":"(A194-B194)*(Equations!$G$69*$R$121+C194)","v":2.1}]
[14,8.8846153846153832,0.2,{"$f":"B121","v":6.5185185185185182},1.2742968532442212,{"$f":"Equations!$G$69+C195","v":0.52},0.52,0.32,1.262019230769218E-3,{"$f":"J194+I195","v":8.3293269230769212E-2},83.293269230769212,0.61538461538461542,0.14571614220737017,3.356971153846121E-3,2.6600000000000006,{"$f":"(A195-B195)*(Equations!$G$69*$Q$121+C195)","v":3.2738461538461547},{"$f":"(A195-B195)*(Equations!$G$69*$R$121+C195)","v":2.0461538461538469}]
[14,9.0192307692307701,0.2,{"$f":"B121","v":6.5185185185185182},1.3087373087373089,{"$f":"Equations!$G$69+C196","v":0.52},0.52,0.32,1.2620192307692512E-3,8.4555288461538466E-2,84.555288461538467,0.61538461538461542,0.15145621812288482,3.2686298076923604E-3,2.59,{"$f":"(A196-B196)*(Equations!$G$69*$Q$121+C196)","v":3.1876923076923074},{"$f":"(A196-B196)*(Equations!$G$69*$R$121+C196)","v":1.9923076923076921}]
[14,9.1538461538461533,0.2,{"$f":"B121","v":6.5185185185185182},1.3450911228689004,{"$f":"Equations!$G$69+C197","v":0.52},0.52,0.32,1.262019230769218E-3,8.5817307692307679E-2,85.817307692307679,0.61538461538461542,0.15751518714481674,3.1802884615384302E-3,2.5200000000000005,{"$f":"(A197-B197)*(Equations!$G$69*$Q$121+C197)","v":3.1015384615384618},{"$f":"(A197-B197)*(Equations!$G$69*$R$121+C197)","v":1.9384615384615387}]
[14,9.2884615384615383,0.2,{"$f":"B121","v":6.5185185185185182},1.3835222978080119,{"$f":"Equations!$G$69+C198","v":0.52},0.52,0.32,1.2620192307692345E-3,8.7079326923076919E-2,87.07932692307692,0.61538461538461542,0.16392038296800196,3.0919471153846249E-3,2.4500000000000002,{"$f":"(A198-B198)*(Equations!$G$69*$Q$121+C198)","v":3.0153846153846153},{"$f":"(A198-B198)*(Equations!$G$69*$R$121+C198)","v":1.8846153846153848}]
[14,9.4230769230769234,0.2,{"$f":"B121","v":6.5185185185185182},1.424214130096483,{"$f":"Equations!$G$69+C199","v":0.52},0.52,0.32,1.2620192307692345E-3,8.8341346153846159E-2,88.34134615384616,0.61538461538461542,0.1707023550160805,3.0036057692307784E-3,2.38,{"$f":"(A199-B199)*(Equations!$G$69*$Q$121+C199)","v":2.9292307692307693},{"$f":"(A199-B199)*(Equations!$G$69*$R$121+C199)","v":1.8307692307692307}]
[14,9.5576923076923084,0.2,{"$f":"B121","v":6.5185185185185182},1.4673721340388008,{"$f":"Equations!$G$69+C200","v":0.52},0.52,0.32,1.2620192307692345E-3,8.9603365384615399E-2,89.603365384615401,0.61538461538461542,0.17789535567313347,2.9152644230769314E-3,2.3099999999999996,{"$f":"(A200-B200)*(Equations!$G$69*$Q$121+C200)","v":2.8430769230769228},{"$f":"(A200-B200)*(Equations!$G$69*$R$121+C200)","v":1.7769230769230768}]
[14,9.6923076923076916,0.2,{"$f":"B121","v":6.5185185185185182},1.5132275132275128,{"$f":"Equations!$G$69+C201","v":0.52},0.52,0.32,1.262019230769218E-3,9.0865384615384612E-2,90.865384615384613,0.61538461538461542,0.18553791887125212,2.8269230769230489E-3,2.2400000000000002,{"$f":"(A201-B201)*(Equations!$G$69*$Q$121+C201)","v":2.7569230769230773},{"$f":"(A201-B201)*(Equations!$G$69*$R$121+C201)","v":1.7230769230769234}]
[14,9.8269230769230766,0.2,{"$f":"B121","v":6.5185185185185182},1.5620413039767878,{"$f":"Equations!$G$69+C202","v":0.52},0.52,0.32,1.2620192307692345E-3,9.2127403846153852E-2,92.127403846153854,0.61538461538461542,0.19367355066279793,2.7385817307692393E-3,2.1700000000000004,{"$f":"(A202-B202)*(Equations!$G$69*$Q$121+C202)","v":2.6707692307692308},{"$f":"(A202-B202)*(Equations!$G$69*$R$121+C202)","v":1.6692307692307695}]
[14,9.9615384615384617,0.2,{"$f":"B121","v":6.5185185185185182},1.6141093474426806,{"$f":"Equations!$G$69+C203","v":0.52},0.52,0.32,1.2620192307692345E-3,9.3389423076923092E-2,93.389423076923094,0.61538461538461542,0.2023515579071134,2.6502403846153924E-3,2.1,{"$f":"(A203-B203)*(Equations!$G$69*$Q$121+C203)","v":2.5846153846153848},{"$f":"(A203-B203)*(Equations!$G$69*$R$121+C203)","v":1.6153846153846154}]
[14,10.096153846153847,0.2,{"$f":"B121","v":6.5185185185185182},1.6697682904579458,{"$f":"Equations!$G$69+C204","v":0.52},0.52,0.32,1.2620192307692345E-3,9.4651442307692332E-2,94.651442307692335,0.61538461538461542,0.2116280484096576,2.5618990384615459E-3,2.0299999999999998,{"$f":"(A204-B204)*(Equations!$G$69*$Q$121+C204)","v":2.4984615384615383},{"$f":"(A204-B204)*(Equations!$G$69*$R$121+C204)","v":1.5615384615384613}]
[14,10.23076923076923,0.2,{"$f":"B121","v":6.5185185185185182},1.7294028722600145,{"$f":"Equations!$G$69+C205","v":0.52},0.52,0.32,1.262019230769218E-3,9.5913461538461545E-2,95.913461538461547,0.61538461538461542,0.22156714537666905,2.4735576923076682E-3,1.9600000000000004,{"$f":"(A205-B205)*(Equations!$G$69*$Q$121+C205)","v":2.4123076923076927},{"$f":"(A205-B205)*(Equations!$G$69*$R$121+C205)","v":1.5076923076923081}]
[14,10.365384615384617,0.2,{"$f":"B121","v":6.5185185185185182},1.793454830491868,{"$f":"Equations!$G$69+C206","v":0.52},0.52,0.32,1.2620192307692512E-3,9.7175480769230799E-2,97.175480769230802,0.61538461538461542,0.23224247174864465,2.3852163461538841E-3,1.8899999999999995,{"$f":"(A206-B206)*(Equations!$G$69*$Q$121+C206)","v":2.3261538461538454},{"$f":"(A206-B206)*(Equations!$G$69*$R$121+C206)","v":1.4538461538461533}]
[14,10.5,0.2,{"$f":"B121","v":6.5185185185185182},1.8624338624338623,{"$f":"Equations!$G$69+C207","v":0.52},0.52,0.32,1.262019230769218E-3,9.8437500000000011E-2,98.437500000000014,0.61538461538461542,0.2437389770723104,2.2968749999999769E-3,1.82,{"$f":"(A207-B207)*(Equations!$G$69*$Q$121+C207)","v":2.2400000000000002},{"$f":"(A207-B207)*(Equations!$G$69*$R$121+C207)","v":1.4000000000000001}]
[14,10.634615384615383,0.2,{"$f":"B121","v":6.5185185185185182},1.9369312169312161,{"$f":"Equations!$G$69+C208","v":0.52},0.52,0.32,1.262019230769218E-3,9.9699519230769224E-2,99.699519230769226,0.61538461538461542,0.25615520282186938,2.2085336538461326E-3,1.7500000000000007,{"$f":"(A208-B208)*(Equations!$G$69*$Q$121+C208)","v":2.1538461538461546},{"$f":"(A208-B208)*(Equations!$G$69*$R$121+C208)","v":1.3461538461538467}]
[14,10.76923076923077,0.2,{"$f":"B121","v":6.5185185185185182},2.0176366843033513,{"$f":"Equations!$G$69+C209","v":0.52},0.52,0.32,1.2620192307692512E-3,0.10096153846153848,100.96153846153848,0.61538461538461542,0.26960611405055857,2.1201923076923416E-3,1.6799999999999997,{"$f":"(A209-B209)*(Equations!$G$69*$Q$121+C209)","v":2.0676923076923073},{"$f":"(A209-B209)*(Equations!$G$69*$R$121+C209)","v":1.2923076923076922}]
[14,10.903846153846153,0.2,{"$f":"B121","v":6.5185185185185182},2.0370370370370372,{"$f":"Equations!$G$69+C210","v":0.52},0.52,0.32,1.262019230769218E-3,0.10222355769230769,102.22355769230769,0.61538461538461542,0.27283950617283953,2.0318509615384417E-3,1.6100000000000003,{"$f":"(A210-B210)*(Equations!$G$69*$Q$121+C210)","v":1.9815384615384619},{"$f":"(A210-B210)*(Equations!$G$69*$R$121+C210)","v":1.2384615384615387}]
[14,11.038461538461538,0.2,{"$f":"B121","v":6.5185185185185182},2.0370370370370372,{"$f":"Equations!$G$69+C211","v":0.52},0.52,0.32,1.2620192307692345E-3,0.10348557692307693,103.48557692307693,0.61538461538461542,0.27283950617283953,1.9435096153846215E-3,1.54,{"$f":"(A211-B211)*(Equations!$G$69*$Q$121+C211)","v":1.8953846153846154},{"$f":"(A211-B211)*(Equations!$G$69*$R$121+C211)","v":1.1846153846153846}]
[14,11.173076923076923,0.2,{"$f":"B121","v":6.5185185185185182},2.0370370370370372,{"$f":"Equations!$G$69+C212","v":0.52},0.52,0.32,1.2620192307692345E-3,0.10474759615384617,104.74759615384617,0.61538461538461542,0.27283950617283953,1.8551682692307747E-3,1.47,{"$f":"(A212-B212)*(Equations!$G$69*$Q$121+C212)","v":1.8092307692307692},{"$f":"(A212-B212)*(Equations!$G$69*$R$121+C212)","v":1.1307692307692307}]
[14,11.307692307692308,0.2,{"$f":"B121","v":6.5185185185185182},2.0370370370370372,{"$f":"Equations!$G$69+C213","v":0.52},0.52,0.32,1.2620192307692345E-3,0.10600961538461541,106.00961538461542,0.61538461538461542,0.27283950617283953,1.766826923076928E-3,1.3999999999999997,{"$f":"(A213-B213)*(Equations!$G$69*$Q$121+C213)","v":1.7230769230769227},{"$f":"(A213-B213)*(Equations!$G$69*$R$121+C213)","v":1.0769230769230766}]
[14,11.442307692307692,0.2,{"$f":"B121","v":6.5185185185185182},2.0370370370370372,{"$f":"Equations!$G$69+C214","v":0.52},0.52,0.32,1.262019230769218E-3,0.10727163461538462,107.27163461538463,0.61538461538461542,0.27283950617283953,1.6784855769230605E-3,1.3300000000000003,{"$f":"(A214-B214)*(Equations!$G$69*$Q$121+C214)","v":1.6369230769230774},{"$f":"(A214-B214)*(Equations!$G$69*$R$121+C214)","v":1.0230769230769234}]
[14,11.576923076923077,0.2,{"$f":"B121","v":6.5185185185185182},2.0370370370370372,{"$f":"Equations!$G$69+C215","v":0.52},0.52,0.32,1.2620192307692345E-3,0.10853365384615386,108.53365384615387,0.61538461538461542,0.27283950617283953,1.5901442307692357E-3,1.2600000000000002,{"$f":"(A215-B215)*(Equations!$G$69*$Q$121+C215)","v":1.5507692307692309},{"$f":"(A215-B215)*(Equations!$G$69*$R$121+C215)","v":0.96923076923076934}]
[14,11.711538461538462,0.2,{"$f":"B121","v":6.5185185185185182},2.0370370370370372,{"$f":"Equations!$G$69+C216","v":0.52},0.52,0.32,1.2620192307692345E-3,0.1097956730769231,109.79567307692311,0.61538461538461542,0.27283950617283953,1.5018028846153892E-3,1.19,{"$f":"(A216-B216)*(Equations!$G$69*$Q$121+C216)","v":1.4646153846153847},{"$f":"(A216-B216)*(Equations!$G$69*$R$121+C216)","v":0.91538461538461535}]
[14,11.846153846153847,0.2,{"$f":"B121","v":6.5185185185185182},2.0370370370370372,{"$f":"Equations!$G$69+C217","v":0.52},0.52,0.32,1.2620192307692345E-3,0.11105769230769234,111.05769230769235,0.61538461538461542,0.27283950617283953,1.4134615384615425E-3,1.1199999999999997,{"$f":"(A217-B217)*(Equations!$G$69*$Q$121+C217)","v":1.3784615384615382},{"$f":"(A217-B217)*(Equations!$G$69*$R$121+C217)","v":0.86153846153846136}]
[14,11.98076923076923,0.2,{"$f":"B121","v":6.5185185185185182},2.0370370370370372,{"$f":"Equations!$G$69+C218","v":0.52},0.52,0.32,1.262019230769218E-3,0.11231971153846156,112.31971153846156,0.61538461538461542,0.27283950617283953,1.3251201923076795E-3,1.0500000000000005,{"$f":"(A218-B218)*(Equations!$G$69*$Q$121+C218)","v":1.2923076923076928},{"$f":"(A218-B218)*(Equations!$G$69*$R$121+C218)","v":0.80769230769230804}]
[14,12.115384615384617,0.2,{"$f":"B121","v":6.5185185185185182},2.0370370370370372,{"$f":"Equations!$G$69+C219","v":0.52},0.52,0.32,1.2620192307692512E-3,0.11358173076923081,113.58173076923082,0.61538461538461542,0.27283950617283953,1.2367788461538653E-3,0.97999999999999932,{"$f":"(A219-B219)*(Equations!$G$69*$Q$121+C219)","v":1.2061538461538452},{"$f":"(A219-B219)*(Equations!$G$69*$R$121+C219)","v":0.75384615384615339}]
[14,12.25,0.2,{"$f":"B121","v":6.5185185185185182},2.0370370370370372,{"$f":"Equations!$G$69+C220","v":0.52},0.52,0.32,1.262019230769218E-3,0.11484375000000002,114.84375000000003,0.61538461538461542,0.27283950617283953,1.1484374999999884E-3,0.91,{"$f":"(A220-B220)*(Equations!$G$69*$Q$121+C220)","v":1.1200000000000001},{"$f":"(A220-B220)*(Equations!$G$69*$R$121+C220)","v":0.70000000000000007}]
[14,12.384615384615383,0.2,{"$f":"B121","v":6.5185185185185182},2.0370370370370372,{"$f":"Equations!$G$69+C221","v":0.52},0.52,0.32,1.262019230769218E-3,0.11610576923076923,116.10576923076924,0.61538461538461542,0.27283950617283953,1.0600961538461441E-3,0.84000000000000075,{"$f":"(A221-B221)*(Equations!$G$69*$Q$121+C221)","v":1.0338461538461547},{"$f":"(A221-B221)*(Equations!$G$69*$R$121+C221)","v":0.64615384615384674}]
[14,12.51923076923077,0.2,{"$f":"B121","v":6.5185185185185182},2.0370370370370372,{"$f":"Equations!$G$69+C222","v":0.52},0.52,0.32,1.2620192307692512E-3,0.11736778846153849,117.3677884615385,0.61538461538461542,0.27283950617283953,9.7175480769232298E-4,0.76999999999999957,{"$f":"(A222-B222)*(Equations!$G$69*$Q$121+C222)","v":0.94769230769230717},{"$f":"(A222-B222)*(Equations!$G$69*$R$121+C222)","v":0.59230769230769198}]
[14,12.653846153846153,0.2,{"$f":"B121","v":6.5185185185185182},2.0370370370370372,{"$f":"Equations!$G$69+C223","v":0.52},0.52,0.32,1.262019230769218E-3,0.1186298076923077,118.62980769230771,0.61538461538461542,0.27283950617283953,8.8341346153845307E-4,0.70000000000000029,{"$f":"(A223-B223)*(Equations!$G$69*$Q$121+C223)","v":0.86153846153846192},{"$f":"(A223-B223)*(Equations!$G$69*$R$121+C223)","v":0.53846153846153866}]
[14,12.788461538461538,0.2,{"$f":"B121","v":6.5185185185185182},2.0370370370370372,{"$f":"Equations!$G$69+C224","v":0.52},0.52,0.32,1.2620192307692345E-3,0.11989182692307694,119.89182692307695,0.61538461538461542,0.27283950617283953,7.9507211538461784E-4,0.63000000000000012,{"$f":"(A224-B224)*(Equations!$G$69*$Q$121+C224)","v":0.77538461538461545},{"$f":"(A224-B224)*(Equations!$G$69*$R$121+C224)","v":0.48461538461538467}]
[14,{"$f":"VINMAX*((ROW()-129)/104)","v":12.923076923076923},0.2,{"$f":"B121","v":6.5185185185185182},2.0370370370370372,{"$f":"Equations!$G$69+C225","v":0.52},0.52,0.32,1.2620192307692345E-3,0.12115384615384618,121.15384615384617,0.61538461538461542,0.27283950617283953,7.0673076923077123E-4,0.55999999999999983,{"$f":"(A225-B225)*(Equations!$G$69*$Q$121+C225)","v":0.68923076923076909},{"$f":"(A225-B225)*(Equations!$G$69*$R$121+C225)","v":0.43076923076923068}]
[14,13.057692307692308,0.2,{"$f":"B121","v":6.5185185185185182},2.0370370370370372,{"$f":"Equations!$G$69+C226","v":0.52},0.52,0.32,1.2620192307692345E-3,0.12241586538461542,122.41586538461542,0.61538461538461542,0.27283950617283953,6.1838942307692452E-4,0.48999999999999966,{"$f":"(A226-B226)*(Equations!$G$69*$Q$121+C226)","v":0.60307692307692262},{"$f":"(A226-B226)*(Equations!$G$69*$R$121+C226)","v":0.37692307692307669}]
[14,13.192307692307692,0.2,{"$f":"B121","v":6.5185185185185182},2.0370370370370372,{"$f":"Equations!$G$69+C227","v":0.52},0.52,0.32,1.262019230769218E-3,0.12367788461538463,123.67788461538463,0.61538461538461542,0.27283950617283953,5.3004807692307206E-4,0.42000000000000037,{"$f":"(A227-B227)*(Equations!$G$69*$Q$121+C227)","v":0.51692307692307737},{"$f":"(A227-B227)*(Equations!$G$69*$R$121+C227)","v":0.32307692307692337}]
[14,13.326923076923077,0.2,{"$f":"B121","v":6.5185185185185182},2.0370370370370372,{"$f":"Equations!$G$69+C228","v":0.52},0.52,0.32,1.2620192307692345E-3,0.12493990384615387,124.93990384615387,0.61538461538461542,0.27283950617283953,4.4170673076923228E-4,0.35000000000000014,{"$f":"(A228-B228)*(Equations!$G$69*$Q$121+C228)","v":0.43076923076923096},{"$f":"(A228-B228)*(Equations!$G$69*$R$121+C228)","v":0.26923076923076933}]
[14,13.461538461538462,0.2,{"$f":"B121","v":6.5185185185185182},2.0370370370370372,{"$f":"Equations!$G$69+C229","v":0.52},0.52,0.32,1.2620192307692345E-3,0.1262019230769231,126.20192307692309,0.61538461538461542,0.27283950617283953,3.5336538461538562E-4,0.27999999999999992,{"$f":"(A229-B229)*(Equations!$G$69*$Q$121+C229)","v":0.34461538461538455},{"$f":"(A229-B229)*(Equations!$G$69*$R$121+C229)","v":0.21538461538461534}]
[14,13.596153846153847,0.2,{"$f":"B121","v":6.5185185185185182},{"$f":"$C$121","v":2.0370370370370372},{"$f":"Equations!$G$69+C230","v":0.52},0.52,{"$f":"G230-C230","v":0.32},{"$f":"(COUTMAX/1000000)*(B230-B229)/H230","v":1.2620192307692345E-3},{"$f":"J229+I230","v":0.12746394230769234},127.46394230769234,{"$f":"H230/G230","v":0.61538461538461542},0.27283950617283953,{"$f":"I230*G230*(A230-B230)","v":2.650240384615389E-4},0.20999999999999971,{"$f":"(A230-B230)*(Equations!$G$69*$Q$121+C230)","v":0.25846153846153813},{"$f":"(A230-B230)*(Equations!$G$69*$R$121+C230)","v":0.16153846153846133}]
[14,13.73076923076923,0.2,{"$f":"B121","v":6.5185185185185182},{"$f":"$C$121","v":2.0370370370370372},{"$f":"Equations!$G$69+C231","v":0.52},0.52,{"$f":"G231-C231","v":0.32},{"$f":"(COUTMAX/1000000)*(B231-B230)/H231","v":1.262019230769218E-3},{"$f":"J230+I231","v":0.12872596153846155},128.72596153846155,{"$f":"H231/G231","v":0.61538461538461542},0.27283950617283953,{"$f":"I231*G231*(A231-B231)","v":1.7668269230769107E-4},0.14000000000000043,{"$f":"(A231-B231)*(Equations!$G$69*$Q$121+C231)","v":0.17230769230769283},{"$f":"(A231-B231)*(Equations!$G$69*$R$121+C231)","v":0.10769230769230803}]
[14,13.865384615384617,0.2,{"$f":"B121","v":6.5185185185185182},{"$f":"$C$121","v":2.0370370370370372},{"$f":"Equations!$G$69+C232","v":0.52},0.52,0.32,1.2620192307692512E-3,0.12998798076923079,129.9879807692308,0.61538461538461542,0.27283950617283953,8.8341346153846689E-5,6.9999999999999285E-2,{"$f":"(A232-B232)*(Equations!$G$69*$Q$121+C232)","v":8.6153846153845276E-2},{"$f":"(A232-B232)*(Equations!$G$69*$R$121+C232)","v":5.3846153846153301E-2}]
[14,14,0.2,{"$f":"B121","v":6.5185185185185182},{"$f":"$C$121","v":2.0370370370370372},{"$f":"Equations!$G$69+C233","v":0.52},0.52,0.32,1.262019230769218E-3,0.13125000000000001,131.25,0.61538461538461542,0.27283950617283953,0,0,{"$f":"(A233-B233)*(Equations!$G$69*$Q$121+C233)","v":0},{"$f":"(A233-B233)*(Equations!$G$69*$R$121+C233)","v":0}]
[null,null,null,null,null,null,null,null,null,null,{"$f":"K233+0.5","v":131.75},null,null,0,0]
[]
[]
[]
[]
[null,"PLIM","ILIM","Load type",null,"SS","Load Value","Load start","Rs","Vos,syst",null,null,"Start-time",null,"I_fet-I_L margin",null,"I_g(hi/nom)","I_g(low/nom)"]
[null,{"$f":"'Design Calculator'!F52","v":6.5185185185185182},{"$f":"'Design Calculator'!F42","v":2.0370370370370372},{"$f":"IF( 'Design Calculator'!F28 = \"Constant Current\", \"CC\", \"R\")","v":"CC"},null,{"$f":"'Design Calculator'!F30","v":"Soft Start"},{"$f":"'Design Calculator'!F29","v":0.2},{"$f":"'Design Calculator'!F27","v":0},{"$f":"RsEFF","v":27},{"$f":"'Device Parameters'!E12","v":1E-3},null,null,{"$f":"J352*1000","v":131.25},"ms",{"$f":"MIN(L248:L349)","v":0.61538461538461542},null,{"$f":"'Device Parameters'!E30/'Device Parameters'!D30","v":1.375},{"$f":"'Device Parameters'!C30/'Device Parameters'!D30","v":0.625}]
[]
[null,null,null,"To avoid timer running: Iload + Icap,ss < IFET_PLIM / 2 => SS_RATE < 1/Cout * (IFET_PLIM/2 - ILOAD)",null,null,null,null,null,null,null,null,"Max_SS_Rate",{"$f":"MIN(M248:M352)","v":1.0934744268077593E-2},"V/ms","max_power_typ",{"$f":"MAX(O248:O352)","v":7.28},"W"]
[null,null,null,null,null,null,null,null,null,null,null,null,"FET_ENERGY",{"$f":"SUM(N248:N352)","v":0.47315625000000017},"J","max_power_high",{"$f":"MAX(P248:P352)","v":8.9600000000000009},"W"]
[null,null,null,null,null,null,null,null,null,null,null,null,null,null,null,"max_power_low",{"$f":"MAX(Q248:Q352)","v":5.6000000000000005},"W"]
["VIN","Vout","ILOAD","PLIM","IFET_PLIM","I_FET_SS","IFET","ICAP","Dt","Time","Tiime (ms)","I_Fet-IL margin","Max _allowed SS_rate","FET_Energy","Power (W)","P_ fast_SS","P_slow_SS"]
[null,null,null,null,null,null,null,null,null,null,-1,null,null,null,0]
[null,null,null,null,null,null,null,null,null,null,-0.01,null,null,null,0]
[{"$f":"VINMAX","v":14},{"$f":"VINMAX*((ROW()-248)/104)","v":0},{"$f":"IF(B248>=$H$240,IF($D$240=\"CC\", $G$240, B248/$G$240), 0)","v":0.2},{"$f":"B240","v":6.5185185185185182},{"$f":"MIN(D248/(A248-B248),$C$240)","v":0.46560846560846558},{"$f":"Equations!$H$69+C248","v":0.52},{"$f":"IF($F$240=\"Soft Start\", F248, E248)","v":0.52},{"$f":"G248-C248","v":0.32},{"$f":"(COUTMAX/1000000)*(B248)/H248","v":0},{"$f":"I248","v":0},{"$f":"J248*1000","v":0},{"$f":"H248/G248","v":0.61538461538461542},{"$f":"1/COUTMAX*(E248/2-C248)*1000","v":1.0934744268077593E-2},{"$f":"I248*G248*(A248-B248)","v":0},{"$f":"G248*(A248-B248)","v":7.28},{"$f":"(A248-B248)*(Equations!$H$69*$Q$240+C248)","v":8.9600000000000009},{"$f":"(A248-B248)*(Equations!$H$69*$R$240+C248)","v":5.6000000000000005}]
[14,0.13461538461538464,{"$f":"IF(B249>=$H$240,IF($D$240=\"CC\", $G$240, B249/$G$240), 0)","v":0.2},{"$f":"B240","v":6.5185185185185182},{"$f":"MIN(D249/(A249-B249),$C$240)","v":0.4701289361483536},{"$f":"Equations!$H$69+C249","v":0.52},{"$f":"IF($F$240=\"Soft Start\", F249, E249)","v":0.52},0.32,{"$f":"(COUTMAX/1000000)*(B249-B248)/H249","v":1.2620192307692311E-3},{"$f":"J248+I249","v":1.2620192307692311E-3},{"$f":"J249*1000","v":1.2620192307692311},{"$f":"H249/G249","v":0.61538461538461542},1.1688156024725596E-2,{"$f":"I249*G249*(A249-B249)","v":9.0991586538461556E-3},{"$f":"G249*(A249-B249)","v":7.21},{"$f":"(A249-B249)*(Equations!$H$69*$Q$240+C249)","v":8.8738461538461539},{"$f":"(A249-B249)*(Equations!$H$69*$R$240+C249)","v":5.546153846153846}]
[14,0.26923076923076927,0.2,{"$f":"B240","v":6.5185185185185182},0.47473804336549436,{"$f":"Equations!$H$69+C250","v":0.52},0.52,0.32,1.2620192307692311E-3,{"$f":"J249+I250","v":2.5240384615384621E-3},2.5240384615384621,0.61538461538461542,1.2456340560915722E-2,{"$f":"I250*G250*(A250-B250)","v":9.01081730769231E-3},7.14,{"$f":"(A250-B250)*(Equations!$H$69*$Q$240+C250)","v":8.787692307692307},{"$f":"(A250-B250)*(Equations!$H$69*$R$240+C250)","v":5.4923076923076923}]
[14,0.40384615384615385,0.2,{"$f":"B240","v":6.5185185185185182},0.47943842003247938,{"$f":"Equations!$H$69+C251","v":0.52},0.52,0.32,1.2620192307692306E-3,3.7860576923076927E-3,3.7860576923076925,0.61538461538461542,1.3239736672079892E-2,{"$f":"I251*G251*(A251-B251)","v":8.9224759615384609E-3},7.07,{"$f":"(A251-B251)*(Equations!$H$69*$Q$240+C251)","v":8.7015384615384619},{"$f":"(A251-B251)*(Equations!$H$69*$R$240+C251)","v":5.4384615384615387}]
[14,0.53846153846153855,0.2,{"$f":"B240","v":6.5185185185185182},0.48423280423280418,{"$f":"Equations!$H$69+C252","v":0.52},0.52,0.32,1.2620192307692315E-3,5.0480769230769242E-3,5.0480769230769242,0.61538461538461542,1.403880070546736E-2,8.8341346153846204E-3,7,{"$f":"(A252-B252)*(Equations!$H$69*$Q$240+C252)","v":8.615384615384615},{"$f":"(A252-B252)*(Equations!$H$69*$R$240+C252)","v":5.384615384615385}]
[14,0.67307692307692313,0.2,{"$f":"B240","v":6.5185185185185182},0.48912404467960025,{"$f":"Equations!$H$69+C253","v":0.52},0.52,0.32,1.2620192307692306E-3,6.3100961538461548E-3,6.3100961538461551,0.61538461538461542,1.4854007446600037E-2,8.7457932692307679E-3,6.93,{"$f":"(A253-B253)*(Equations!$H$69*$Q$240+C253)","v":8.5292307692307698},{"$f":"(A253-B253)*(Equations!$H$69*$R$240+C253)","v":5.3307692307692314}]
[14,0.80769230769230771,0.2,{"$f":"B240","v":6.5185185185185182},0.49411510636000433,{"$f":"Equations!$H$69+C254","v":0.52},0.52,0.32,1.2620192307692306E-3,7.5721153846153855E-3,7.572115384615385,0.61538461538461542,1.5685851060000717E-2,8.6574519230769222E-3,6.86,{"$f":"(A254-B254)*(Equations!$H$69*$Q$240+C254)","v":8.4430769230769229},{"$f":"(A254-B254)*(Equations!$H$69*$R$240+C254)","v":5.2769230769230768}]
[14,0.94230769230769229,0.2,{"$f":"B240","v":6.5185185185185182},0.49920907652866409,{"$f":"Equations!$H$69+C255","v":0.52},0.52,0.32,1.2620192307692306E-3,8.8341346153846152E-3,8.834134615384615,0.61538461538461542,1.6534846088110677E-2,8.5691105769230766E-3,6.7900000000000009,{"$f":"(A255-B255)*(Equations!$H$69*$Q$240+C255)","v":8.3569230769230778},{"$f":"(A255-B255)*(Equations!$H$69*$R$240+C255)","v":5.2230769230769241}]
[14,1.0769230769230771,0.2,{"$f":"B240","v":6.5185185185185182},0.50440917107583771,{"$f":"Equations!$H$69+C256","v":0.52},0.52,0.32,1.2620192307692326E-3,1.0096153846153848E-2,10.096153846153848,0.61538461538461542,1.7401528512639618E-2,8.4807692307692431E-3,6.7200000000000006,{"$f":"(A256-B256)*(Equations!$H$69*$Q$240+C256)","v":8.2707692307692309},{"$f":"(A256-B256)*(Equations!$H$69*$R$240+C256)","v":5.1692307692307695}]
[14,1.2115384615384615,0.2,{"$f":"B240","v":6.5185185185185182},0.50971874129768868,{"$f":"Equations!$H$69+C257","v":0.52},0.52,0.32,1.2620192307692282E-3,1.1358173076923076E-2,11.358173076923077,0.61538461538461542,1.8286456882948107E-2,8.392427884615368E-3,6.65,{"$f":"(A257-B257)*(Equations!$H$69*$Q$240+C257)","v":8.184615384615384},{"$f":"(A257-B257)*(Equations!$H$69*$R$240+C257)","v":5.1153846153846159}]
[14,1.3461538461538463,0.2,{"$f":"B240","v":6.5185185185185182},0.51514128109872792,{"$f":"Equations!$H$69+C258","v":0.52},0.52,0.32,1.2620192307692326E-3,1.262019230769231E-2,12.62019230769231,0.61538461538461542,1.9190213516454651E-2,8.3040865384615501E-3,6.58,{"$f":"(A258-B258)*(Equations!$H$69*$Q$240+C258)","v":8.0984615384615388},{"$f":"(A258-B258)*(Equations!$H$69*$R$240+C258)","v":5.0615384615384613}]
[14,1.4807692307692308,0.2,{"$f":"B240","v":6.5185185185185182},0.52068043465892921,{"$f":"Equations!$H$69+C259","v":0.52},0.52,0.32,1.2620192307692306E-3,1.3882211538461541E-2,13.882211538461542,0.61538461538461542,2.0113405776488198E-2,8.2157451923076923E-3,6.5100000000000007,{"$f":"(A259-B259)*(Equations!$H$69*$Q$240+C259)","v":8.0123076923076937},{"$f":"(A259-B259)*(Equations!$H$69*$R$240+C259)","v":5.0076923076923086}]
[14,1.6153846153846154,0.2,{"$f":"B240","v":6.5185185185185182},0.52634000460087416,{"$f":"Equations!$H$69+C260","v":0.52},0.52,0.32,1.2620192307692306E-3,1.5144230769230771E-2,15.14423076923077,0.61538461538461542,2.1056667433479021E-2,8.127403846153845E-3,6.44,{"$f":"(A260-B260)*(Equations!$H$69*$Q$240+C260)","v":7.9261538461538468},{"$f":"(A260-B260)*(Equations!$H$69*$R$240+C260)","v":4.953846153846154}]
[14,1.75,0.2,{"$f":"B240","v":6.5185185185185182},0.53212396069538925,{"$f":"Equations!$H$69+C261","v":0.52},0.52,0.32,1.2620192307692306E-3,1.6406250000000001E-2,16.40625,0.61538461538461542,2.2020660115898205E-2,8.0390624999999993E-3,6.37,{"$f":"(A261-B261)*(Equations!$H$69*$Q$240+C261)","v":7.84},{"$f":"(A261-B261)*(Equations!$H$69*$R$240+C261)","v":4.9000000000000004}]
[14,1.8846153846153846,0.2,{"$f":"B240","v":6.5185185185185182},0.53803644914756021,{"$f":"Equations!$H$69+C262","v":0.52},0.52,0.32,1.2620192307692306E-3,1.766826923076923E-2,17.66826923076923,0.61538461538461542,2.3006074857926696E-2,7.950721153846152E-3,6.3,{"$f":"(A262-B262)*(Equations!$H$69*$Q$240+C262)","v":7.7538461538461538},{"$f":"(A262-B262)*(Equations!$H$69*$R$240+C262)","v":4.8461538461538467}]
[14,2.0192307692307692,0.2,{"$f":"B240","v":6.5185185185185182},0.54408180250876881,{"$f":"Equations!$H$69+C263","v":0.52},0.52,0.32,1.2620192307692306E-3,1.893028846153846E-2,18.93028846153846,0.61538461538461542,2.4013633751461465E-2,7.8623798076923063E-3,6.2299999999999995,{"$f":"(A263-B263)*(Equations!$H$69*$Q$240+C263)","v":7.6676923076923069},{"$f":"(A263-B263)*(Equations!$H$69*$R$240+C263)","v":4.7923076923076922}]
[14,2.1538461538461542,0.2,{"$f":"B240","v":6.5185185185185182},0.55026455026455023,{"$f":"Equations!$H$69+C264","v":0.52},0.52,0.32,1.2620192307692345E-3,2.0192307692307693E-2,20.192307692307693,0.61538461538461542,2.504409171075837E-2,7.7740384615384859E-3,6.16,{"$f":"(A264-B264)*(Equations!$H$69*$Q$240+C264)","v":7.5815384615384618},{"$f":"(A264-B264)*(Equations!$H$69*$R$240+C264)","v":4.7384615384615385}]
[14,2.2884615384615383,0.2,{"$f":"B240","v":6.5185185185185182},0.5565894301526485,{"$f":"Equations!$H$69+C265","v":0.52},0.52,0.32,1.2620192307692263E-3,2.145432692307692E-2,21.45432692307692,0.61538461538461542,2.6098238358774745E-2,7.6856971153845882E-3,6.09,{"$f":"(A265-B265)*(Equations!$H$69*$Q$240+C265)","v":7.4953846153846158},{"$f":"(A265-B265)*(Equations!$H$69*$R$240+C265)","v":4.6846153846153848}]
[14,2.4230769230769229,0.2,{"$f":"B240","v":6.5185185185185182},0.56306140027070262,{"$f":"Equations!$H$69+C266","v":0.52},0.52,0.32,1.2620192307692306E-3,2.2716346153846149E-2,22.71634615384615,0.61538461538461542,2.7176900045117098E-2,7.5973557692307686E-3,6.0200000000000005,{"$f":"(A266-B266)*(Equations!$H$69*$Q$240+C266)","v":7.4092307692307688},{"$f":"(A266-B266)*(Equations!$H$69*$R$240+C266)","v":4.6307692307692312}]
[14,2.5576923076923075,0.2,{"$f":"B240","v":6.5185185185185182},0.56968565203859312,{"$f":"Equations!$H$69+C267","v":0.52},0.52,0.32,1.2620192307692306E-3,2.3978365384615379E-2,23.97836538461538,0.61538461538461542,2.8280942006432181E-2,7.5090144230769229E-3,5.9500000000000011,{"$f":"(A267-B267)*(Equations!$H$69*$Q$240+C267)","v":7.3230769230769237},{"$f":"(A267-B267)*(Equations!$H$69*$R$240+C267)","v":4.5769230769230775}]
[14,2.6923076923076925,0.2,{"$f":"B240","v":6.5185185185185182},0.57646762408667174,{"$f":"Equations!$H$69+C268","v":0.52},0.52,0.32,1.2620192307692345E-3,2.5240384615384612E-2,25.240384615384613,0.61538461538461542,2.9411270681111951E-2,7.420673076923099E-3,5.88,{"$f":"(A268-B268)*(Equations!$H$69*$Q$240+C268)","v":7.2369230769230768},{"$f":"(A268-B268)*(Equations!$H$69*$R$240+C268)","v":4.523076923076923}]
[14,2.8269230769230771,0.2,{"$f":"B240","v":6.5185185185185182},0.5834130171479569,{"$f":"Equations!$H$69+C269","v":0.52},0.52,0.32,1.2620192307692306E-3,2.6502403846153842E-2,26.502403846153843,0.61538461538461542,3.0568836191326144E-2,7.3323317307692299E-3,5.8100000000000005,{"$f":"(A269-B269)*(Equations!$H$69*$Q$240+C269)","v":7.1507692307692308},{"$f":"(A269-B269)*(Equations!$H$69*$R$240+C269)","v":4.4692307692307693}]
[14,2.9615384615384617,0.2,{"$f":"B240","v":6.5185185185185182},0.5905278100400051,{"$f":"Equations!$H$69+C270","v":0.52},0.52,0.32,1.2620192307692306E-3,2.7764423076923072E-2,27.764423076923073,0.61538461538461542,3.175463500666751E-2,7.2439903846153834E-3,5.74,{"$f":"(A270-B270)*(Equations!$H$69*$Q$240+C270)","v":7.0646153846153847},{"$f":"(A270-B270)*(Equations!$H$69*$R$240+C270)","v":4.4153846153846157}]
[14,3.0961538461538458,0.2,{"$f":"B240","v":6.5185185185185182},0.5978182768306225,{"$f":"Equations!$H$69+C271","v":0.52},0.52,0.32,1.2620192307692263E-3,2.9026442307692298E-2,29.026442307692299,0.61538461538461542,3.2969712805103739E-2,7.1556490384615127E-3,5.67,{"$f":"(A271-B271)*(Equations!$H$69*$Q$240+C271)","v":6.9784615384615378},{"$f":"(A271-B271)*(Equations!$H$69*$R$240+C271)","v":4.3615384615384611}]
[14,3.2307692307692308,0.2,{"$f":"B240","v":6.5185185185185182},0.60529100529100521,{"$f":"Equations!$H$69+C272","v":0.52},0.52,0.32,1.2620192307692345E-3,3.0288461538461531E-2,30.288461538461533,0.61538461538461542,3.4215167548500861E-2,7.0673076923077147E-3,5.6000000000000005,{"$f":"(A272-B272)*(Equations!$H$69*$Q$240+C272)","v":6.8923076923076927},{"$f":"(A272-B272)*(Equations!$H$69*$R$240+C272)","v":4.3076923076923084}]
[14,3.3653846153846154,0.2,{"$f":"B240","v":6.5185185185185182},0.6129529167503851,{"$f":"Equations!$H$69+C273","v":0.52},0.52,0.32,1.2620192307692306E-3,3.1550480769230761E-2,31.550480769230763,0.61538461538461542,3.5492152791730847E-2,6.9789663461538457E-3,5.53,{"$f":"(A273-B273)*(Equations!$H$69*$Q$240+C273)","v":6.8061538461538467},{"$f":"(A273-B273)*(Equations!$H$69*$R$240+C273)","v":4.2538461538461538}]
[14,3.5,0.2,{"$f":"B240","v":6.5185185185185182},0.62081128747795411,{"$f":"Equations!$H$69+C274","v":0.52},0.52,0.32,1.2620192307692306E-3,3.2812499999999994E-2,32.812499999999993,0.61538461538461542,3.6801881246325677E-2,6.8906249999999992E-3,5.46,{"$f":"(A274-B274)*(Equations!$H$69*$Q$240+C274)","v":6.72},{"$f":"(A274-B274)*(Equations!$H$69*$R$240+C274)","v":4.2}]
[14,3.634615384615385,0.2,{"$f":"B240","v":6.5185185185185182},0.62887377173091463,{"$f":"Equations!$H$69+C275","v":0.52},0.52,0.32,1.2620192307692345E-3,3.4074519230769228E-2,34.074519230769226,0.61538461538461542,3.8145628621819104E-2,6.8022836538461744E-3,5.39,{"$f":"(A275-B275)*(Equations!$H$69*$Q$240+C275)","v":6.6338461538461537},{"$f":"(A275-B275)*(Equations!$H$69*$R$240+C275)","v":4.1461538461538465}]
[14,3.7692307692307692,0.2,{"$f":"B240","v":6.5185185185185182},0.6371484266221108,{"$f":"Equations!$H$69+C276","v":0.52},0.52,0.32,1.2620192307692263E-3,3.5336538461538454E-2,35.336538461538453,0.61538461538461542,3.9524737770351794E-2,6.7139423076922828E-3,5.3199999999999994,{"$f":"(A276-B276)*(Equations!$H$69*$Q$240+C276)","v":6.5476923076923077},{"$f":"(A276-B276)*(Equations!$H$69*$R$240+C276)","v":4.092307692307692}]
[14,3.9038461538461542,0.2,{"$f":"B240","v":6.5185185185185182},0.64564373897707228,{"$f":"Equations!$H$69+C277","v":0.52},0.52,0.32,1.2620192307692345E-3,3.6598557692307687E-2,36.598557692307686,0.61538461538461542,4.0940623162845372E-2,6.6256009615384822E-3,5.2500000000000009,{"$f":"(A277-B277)*(Equations!$H$69*$Q$240+C277)","v":6.4615384615384617},{"$f":"(A277-B277)*(Equations!$H$69*$R$240+C277)","v":4.0384615384615392}]
[14,4.0384615384615383,0.2,{"$f":"B240","v":6.5185185185185182},0.65436865436865432,{"$f":"Equations!$H$69+C278","v":0.52},0.52,0.32,1.2620192307692263E-3,3.7860576923076913E-2,37.860576923076913,0.61538461538461542,4.2394775728109048E-2,6.5372596153845924E-3,5.1800000000000006,{"$f":"(A278-B278)*(Equations!$H$69*$Q$240+C278)","v":6.3753846153846156},{"$f":"(A278-B278)*(Equations!$H$69*$R$240+C278)","v":3.9846153846153847}]
[14,4.1730769230769234,0.2,{"$f":"B240","v":6.5185185185185182},0.66333260853808795,{"$f":"Equations!$H$69+C279","v":0.52},0.52,0.32,1.2620192307692345E-3,3.9122596153846147E-2,39.122596153846146,0.61538461538461542,4.388876808968132E-2,6.4489182692307884E-3,5.1100000000000003,{"$f":"(A279-B279)*(Equations!$H$69*$Q$240+C279)","v":6.2892307692307696},{"$f":"(A279-B279)*(Equations!$H$69*$R$240+C279)","v":3.930769230769231}]
[14,{"$f":"VINMAX*((ROW()-248)/104)","v":4.3076923076923084},0.2,{"$f":"B240","v":6.5185185185185182},0.67254556143445032,{"$f":"Equations!$H$69+C280","v":0.52},0.52,0.32,1.2620192307692345E-3,4.038461538461538E-2,40.38461538461538,0.61538461538461542,4.5424260239075052E-2,6.3605769230769419E-3,5.04,{"$f":"(A280-B280)*(Equations!$H$69*$Q$240+C280)","v":6.2030769230769227},{"$f":"(A280-B280)*(Equations!$H$69*$R$240+C280)","v":3.8769230769230769}]
[14,4.4423076923076916,0.2,{"$f":"B240","v":6.5185185185185182},0.68201803413071005,{"$f":"Equations!$H$69+C281","v":0.52},0.52,0.32,1.262019230769218E-3,4.1646634615384599E-2,41.646634615384599,0.61538461538461542,4.7003005688451664E-2,6.2722355769230147E-3,4.9700000000000006,{"$f":"(A281-B281)*(Equations!$H$69*$Q$240+C281)","v":6.1169230769230776},{"$f":"(A281-B281)*(Equations!$H$69*$R$240+C281)","v":3.8230769230769237}]
[14,4.5769230769230766,0.2,{"$f":"B240","v":6.5185185185185182},0.69176114890400597,{"$f":"Equations!$H$69+C282","v":0.52},0.52,0.32,1.2620192307692345E-3,4.2908653846153832E-2,42.908653846153832,0.61538461538461542,4.8626858150667661E-2,6.1838942307692497E-3,4.9000000000000004,{"$f":"(A282-B282)*(Equations!$H$69*$Q$240+C282)","v":6.0307692307692307},{"$f":"(A282-B282)*(Equations!$H$69*$R$240+C282)","v":3.7692307692307696}]
[14,4.7115384615384617,0.2,{"$f":"B240","v":6.5185185185185182},0.70178667280116558,{"$f":"Equations!$H$69+C283","v":0.52},0.52,0.32,1.2620192307692345E-3,4.4170673076923066E-2,44.170673076923066,0.61538461538461542,5.0297778800194259E-2,6.0955528846154032E-3,4.83,{"$f":"(A283-B283)*(Equations!$H$69*$Q$240+C283)","v":5.9446153846153846},{"$f":"(A283-B283)*(Equations!$H$69*$R$240+C283)","v":3.7153846153846155}]
[14,4.8461538461538458,0.2,{"$f":"B240","v":6.5185185185185182},0.71210706504824151,{"$f":"Equations!$H$69+C284","v":0.52},0.52,0.32,1.2620192307692263E-3,4.5432692307692292E-2,45.432692307692292,0.61538461538461542,5.2017844174706909E-2,6.0072115384615168E-3,4.76,{"$f":"(A284-B284)*(Equations!$H$69*$Q$240+C284)","v":5.8584615384615386},{"$f":"(A284-B284)*(Equations!$H$69*$R$240+C284)","v":3.6615384615384614}]
[14,4.9807692307692308,0.2,{"$f":"B240","v":6.5185185185185182},0.72273552870567781,{"$f":"Equations!$H$69+C285","v":0.52},0.52,0.32,1.2620192307692345E-3,4.6694711538461525E-2,46.694711538461526,0.61538461538461542,5.3789254784279629E-2,5.9188701923077111E-3,4.6900000000000004,{"$f":"(A285-B285)*(Equations!$H$69*$Q$240+C285)","v":5.7723076923076926},{"$f":"(A285-B285)*(Equations!$H$69*$R$240+C285)","v":3.6076923076923082}]
[14,5.115384615384615,0.2,{"$f":"B240","v":6.5185185185185182},0.73368606701940031,{"$f":"Equations!$H$69+C286","v":0.52},0.52,0.32,1.2620192307692263E-3,4.7956730769230752E-2,47.956730769230752,0.61538461538461542,5.5614344503233382E-2,5.8305288461538256E-3,4.62,{"$f":"(A286-B286)*(Equations!$H$69*$Q$240+C286)","v":5.6861538461538466},{"$f":"(A286-B286)*(Equations!$H$69*$R$240+C286)","v":3.5538461538461541}]
[14,5.25,0.2,{"$f":"B240","v":6.5185185185185182},0.74497354497354495,{"$f":"Equations!$H$69+C287","v":0.52},0.52,0.32,1.2620192307692345E-3,4.9218749999999985E-2,49.218749999999986,0.61538461538461542,5.7495590828924151E-2,5.7421875000000172E-3,4.55,{"$f":"(A287-B287)*(Equations!$H$69*$Q$240+C287)","v":5.6000000000000005},{"$f":"(A287-B287)*(Equations!$H$69*$R$240+C287)","v":3.5}]
[14,5.384615384615385,0.2,{"$f":"B240","v":6.5185185185185182},0.75661375661375663,{"$f":"Equations!$H$69+C288","v":0.52},0.52,0.32,1.2620192307692345E-3,5.0480769230769218E-2,50.480769230769219,0.61538461538461542,5.9435626102292763E-2,5.6538461538461707E-3,4.4799999999999995,{"$f":"(A288-B288)*(Equations!$H$69*$Q$240+C288)","v":5.5138461538461536},{"$f":"(A288-B288)*(Equations!$H$69*$R$240+C288)","v":3.4461538461538463}]
[14,5.5192307692307692,0.2,{"$f":"B240","v":6.5185185185185182},0.76862349878222902,{"$f":"Equations!$H$69+C289","v":0.52},0.52,0.32,1.2620192307692263E-3,5.1742788461538444E-2,51.742788461538446,0.61538461538461542,6.1437249797038157E-2,5.5655048076922869E-3,4.41,{"$f":"(A289-B289)*(Equations!$H$69*$Q$240+C289)","v":5.4276923076923076},{"$f":"(A289-B289)*(Equations!$H$69*$R$240+C289)","v":3.3923076923076922}]
[14,5.6538461538461542,0.2,{"$f":"B240","v":6.5185185185185182},0.78102065198839388,{"$f":"Equations!$H$69+C290","v":0.52},0.52,0.32,1.2620192307692345E-3,5.3004807692307677E-2,53.004807692307679,0.61538461538461542,6.3503441998065638E-2,5.4771634615384786E-3,4.3400000000000007,{"$f":"(A290-B290)*(Equations!$H$69*$Q$240+C290)","v":5.3415384615384616},{"$f":"(A290-B290)*(Equations!$H$69*$R$240+C290)","v":3.338461538461539}]
[14,5.7884615384615383,0.2,{"$f":"B240","v":6.5185185185185182},0.79382426923410521,{"$f":"Equations!$H$69+C291","v":0.52},0.52,0.32,1.2620192307692263E-3,5.4266826923076904E-2,54.266826923076906,0.61538461538461542,6.5637378205684202E-2,5.3888221153845966E-3,4.2700000000000005,{"$f":"(A291-B291)*(Equations!$H$69*$Q$240+C291)","v":5.2553846153846155},{"$f":"(A291-B291)*(Equations!$H$69*$R$240+C291)","v":3.2846153846153849}]
[14,5.9230769230769234,0.2,{"$f":"B240","v":6.5185185185185182},0.80705467372134032,{"$f":"Equations!$H$69+C292","v":0.52},0.52,0.32,1.2620192307692345E-3,5.5528846153846137E-2,55.528846153846139,0.61538461538461542,6.7842445620223388E-2,5.3004807692307847E-3,4.2,{"$f":"(A292-B292)*(Equations!$H$69*$Q$240+C292)","v":5.1692307692307695},{"$f":"(A292-B292)*(Equations!$H$69*$R$240+C292)","v":3.2307692307692308}]
[14,6.0576923076923084,0.2,{"$f":"B240","v":6.5185185185185182},0.82073356649627838,{"$f":"Equations!$H$69+C293","v":0.52},0.52,0.32,1.2620192307692345E-3,5.679086538461537E-2,56.790865384615373,0.61538461538461542,7.012226108271305E-2,5.2121394230769382E-3,4.13,{"$f":"(A293-B293)*(Equations!$H$69*$Q$240+C293)","v":5.0830769230769226},{"$f":"(A293-B293)*(Equations!$H$69*$R$240+C293)","v":3.1769230769230767}]
[14,6.1923076923076916,0.2,{"$f":"B240","v":6.5185185185185182},0.8348841452289727,{"$f":"Equations!$H$69+C294","v":0.52},0.52,0.32,1.262019230769218E-3,5.805288461538459E-2,58.052884615384592,0.61538461538461542,7.2480690871495446E-2,5.1237980769230258E-3,4.0600000000000005,{"$f":"(A294-B294)*(Equations!$H$69*$Q$240+C294)","v":4.9969230769230775},{"$f":"(A294-B294)*(Equations!$H$69*$R$240+C294)","v":3.1230769230769235}]
[14,6.3269230769230766,0.2,{"$f":"B240","v":6.5185185185185182},0.84953123549614773,{"$f":"Equations!$H$69+C295","v":0.52},0.52,0.32,1.2620192307692345E-3,5.9314903846153823E-2,59.314903846153825,0.61538461538461542,7.4921872582691285E-2,5.0354567307692461E-3,3.99,{"$f":"(A295-B295)*(Equations!$H$69*$Q$240+C295)","v":4.9107692307692314},{"$f":"(A295-B295)*(Equations!$H$69*$R$240+C295)","v":3.0692307692307694}]
[14,6.4615384615384617,0.2,{"$f":"B240","v":6.5185185185185182},0.86470143613000749,{"$f":"Equations!$H$69+C296","v":0.52},0.52,0.32,1.2620192307692345E-3,6.0576923076923056E-2,60.576923076923059,0.61538461538461542,7.7450239355001241E-2,4.9471153846153996E-3,3.92,{"$f":"(A296-B296)*(Equations!$H$69*$Q$240+C296)","v":4.8246153846153845},{"$f":"(A296-B296)*(Equations!$H$69*$R$240+C296)","v":3.0153846153846153}]
[14,6.5961538461538458,0.2,{"$f":"B240","v":6.5185185185185182},0.88042328042328033,{"$f":"Equations!$H$69+C297","v":0.52},0.52,0.32,1.2620192307692263E-3,6.1838942307692282E-2,61.838942307692285,0.61538461538461542,8.0070546737213394E-2,4.858774038461521E-3,3.85,{"$f":"(A297-B297)*(Equations!$H$69*$Q$240+C297)","v":4.7384615384615385},{"$f":"(A297-B297)*(Equations!$H$69*$R$240+C297)","v":2.9615384615384617}]
[14,6.7307692307692308,0.2,{"$f":"B240","v":6.5185185185185182},0.89672741524593369,{"$f":"Equations!$H$69+C298","v":0.52},0.52,0.32,1.2620192307692345E-3,6.3100961538461522E-2,63.100961538461526,0.61538461538461542,8.2787902540988945E-2,4.7704326923077066E-3,3.7800000000000002,{"$f":"(A298-B298)*(Equations!$H$69*$Q$240+C298)","v":4.6523076923076925},{"$f":"(A298-B298)*(Equations!$H$69*$R$240+C298)","v":2.907692307692308}]
[14,6.865384615384615,0.2,{"$f":"B240","v":6.5185185185185182},0.91364680043925317,{"$f":"Equations!$H$69+C299","v":0.52},0.52,0.32,1.2620192307692263E-3,6.4362980769230749E-2,64.362980769230745,0.61538461538461542,8.5607800073208853E-2,{"$f":"I299*G299*(A299-B299)","v":4.6820913461538298E-3},3.7100000000000004,{"$f":"(A299-B299)*(Equations!$H$69*$Q$240+C299)","v":4.5661538461538465},{"$f":"(A299-B299)*(Equations!$H$69*$R$240+C299)","v":2.8538461538461544}]
[14,7,0.2,{"$f":"B240","v":6.5185185185185182},0.93121693121693117,{"$f":"Equations!$H$69+C300","v":0.52},0.52,0.32,1.2620192307692345E-3,6.5624999999999989E-2,65.624999999999986,0.61538461538461542,8.8536155202821848E-2,{"$f":"I300*G300*(A300-B300)","v":4.5937500000000136E-3},3.64,{"$f":"(A300-B300)*(Equations!$H$69*$Q$240+C300)","v":4.4800000000000004},{"$f":"(A300-B300)*(Equations!$H$69*$R$240+C300)","v":2.8000000000000003}]
[14,7.1346153846153841,0.2,{"$f":"B240","v":6.5185185185185182},0.9494760867309886,{"$f":"Equations!$H$69+C301","v":0.52},0.52,0.32,1.2620192307692263E-3,6.6887019230769215E-2,66.887019230769212,0.61538461538461542,9.1579347788498106E-2,4.5054086538461376E-3,3.5700000000000003,{"$f":"(A301-B301)*(Equations!$H$69*$Q$240+C301)","v":4.3938461538461544},{"$f":"(A301-B301)*(Equations!$H$69*$R$240+C301)","v":2.7461538461538466}]
[14,7.2692307692307701,0.2,{"$f":"B240","v":6.5185185185185182},0.96846560846560859,{"$f":"Equations!$H$69+C302","v":0.52},0.52,0.32,1.262019230769243E-3,6.8149038461538455E-2,68.149038461538453,0.61538461538461542,9.4744268077601418E-2,4.4170673076923501E-3,3.4999999999999996,{"$f":"(A302-B302)*(Equations!$H$69*$Q$240+C302)","v":4.3076923076923075},{"$f":"(A302-B302)*(Equations!$H$69*$R$240+C302)","v":2.6923076923076921}]
[14,7.4038461538461542,0.2,{"$f":"B240","v":6.5185185185185182},0.98823021272000866,{"$f":"Equations!$H$69+C303","v":0.52},0.52,0.32,1.2620192307692263E-3,6.9411057692307682E-2,69.411057692307679,0.61538461538461542,9.8038368786668106E-2,4.3287259615384455E-3,3.43,{"$f":"(A303-B303)*(Equations!$H$69*$Q$240+C303)","v":4.2215384615384615},{"$f":"(A303-B303)*(Equations!$H$69*$R$240+C303)","v":2.6384615384615384}]
[14,7.5384615384615383,0.2,{"$f":"B240","v":6.5185185185185182},1.0088183421516754,{"$f":"Equations!$H$69+C304","v":0.52},0.52,0.32,1.2620192307692263E-3,7.0673076923076908E-2,70.673076923076906,0.61538461538461542,0.1014697236919459,4.2403846153846007E-3,3.3600000000000003,{"$f":"(A304-B304)*(Equations!$H$69*$Q$240+C304)","v":4.1353846153846154},{"$f":"(A304-B304)*(Equations!$H$69*$R$240+C304)","v":2.5846153846153848}]
[14,7.6730769230769234,0.2,{"$f":"B240","v":6.5185185185185182},1.0302825621974558,{"$f":"Equations!$H$69+C305","v":0.52},0.52,0.32,1.2620192307692345E-3,7.1935096153846148E-2,71.935096153846146,0.61538461538461542,0.10504709369957597,4.152043269230782E-3,3.29,{"$f":"(A305-B305)*(Equations!$H$69*$Q$240+C305)","v":4.0492307692307694},{"$f":"(A305-B305)*(Equations!$H$69*$R$240+C305)","v":2.5307692307692307}]
[14,7.8076923076923084,0.2,{"$f":"B240","v":6.5185185185185182},1.0526800092017483,{"$f":"Equations!$H$69+C306","v":0.52},0.52,0.32,1.2620192307692345E-3,7.3197115384615388E-2,73.197115384615387,0.61538461538461542,0.1087800015336247,4.0637019230769346E-3,3.2199999999999998,{"$f":"(A306-B306)*(Equations!$H$69*$Q$240+C306)","v":3.9630769230769229},{"$f":"(A306-B306)*(Equations!$H$69*$R$240+C306)","v":2.476923076923077}]
[14,7.9423076923076916,0.2,{"$f":"B240","v":6.5185185185185182},1.0760728982951204,{"$f":"Equations!$H$69+C307","v":0.52},0.52,0.32,1.262019230769218E-3,7.4459134615384601E-2,74.459134615384599,0.61538461538461542,0.11267881638252006,3.9753605769230378E-3,3.1500000000000004,{"$f":"(A307-B307)*(Equations!$H$69*$Q$240+C307)","v":3.8769230769230774},{"$f":"(A307-B307)*(Equations!$H$69*$R$240+C307)","v":2.4230769230769234}]
[14,8.0769230769230766,0.2,{"$f":"B240","v":6.5185185185185182},1.1005291005291005,{"$f":"Equations!$H$69+C308","v":0.52},0.52,0.32,1.2620192307692345E-3,7.5721153846153841E-2,75.72115384615384,0.61538461538461542,0.1167548500881834,3.8870192307692429E-3,3.08,{"$f":"(A308-B308)*(Equations!$H$69*$Q$240+C308)","v":3.7907692307692309},{"$f":"(A308-B308)*(Equations!$H$69*$R$240+C308)","v":2.3692307692307693}]
[14,8.2115384615384617,0.2,{"$f":"B240","v":6.5185185185185182},1.1261228005414052,{"$f":"Equations!$H$69+C309","v":0.52},0.52,0.32,1.2620192307692345E-3,7.6983173076923081E-2,76.98317307692308,0.61538461538461542,0.12102046675690085,3.798677884615396E-3,3.0100000000000002,{"$f":"(A309-B309)*(Equations!$H$69*$Q$240+C309)","v":3.7046153846153844},{"$f":"(A309-B309)*(Equations!$H$69*$R$240+C309)","v":2.3153846153846156}]
[14,8.3461538461538467,0.2,{"$f":"B240","v":6.5185185185185182},1.1529352481733435,{"$f":"Equations!$H$69+C310","v":0.52},0.52,0.32,1.2620192307692345E-3,7.8245192307692321E-2,78.245192307692321,0.61538461538461542,0.12548920802889055,3.7103365384615495E-3,2.94,{"$f":"(A310-B310)*(Equations!$H$69*$Q$240+C310)","v":3.6184615384615384},{"$f":"(A310-B310)*(Equations!$H$69*$R$240+C310)","v":2.2615384615384615}]
[14,8.4807692307692299,0.2,{"$f":"B240","v":6.5185185185185182},1.1810556200800102,{"$f":"Equations!$H$69+C311","v":0.52},0.52,0.32,1.262019230769218E-3,7.9507211538461534E-2,79.507211538461533,0.61538461538461542,0.13017593668000169,3.6219951923076566E-3,2.8700000000000006,{"$f":"(A311-B311)*(Equations!$H$69*$Q$240+C311)","v":3.5323076923076928},{"$f":"(A311-B311)*(Equations!$H$69*$R$240+C311)","v":2.2076923076923083}]
[{"$f":"VINMAX","v":14},{"$f":"VINMAX*((ROW()-248)/104)","v":8.6153846153846168},0.2,{"$f":"B240","v":6.5185185185185182},1.2105820105820109,{"$f":"Equations!$H$69+C312","v":0.52},0.52,{"$f":"G312-C312","v":0.32},1.2620192307692512E-3,8.0769230769230788E-2,80.769230769230788,0.61538461538461542,{"$f":"1/COUTMAX*(E312/2-C312)*1000","v":0.13509700176366846},3.5336538461539029E-3,2.7999999999999994,{"$f":"(A312-B312)*(Equations!$H$69*$Q$240+C312)","v":3.4461538461538455},{"$f":"(A312-B312)*(Equations!$H$69*$R$240+C312)","v":2.1538461538461533}]
[14,8.75,{"$f":"IF(B313>=$H$240,IF($D$240=\"CC\", $G$240, B313/$G$240), 0)","v":0.2},{"$f":"B240","v":6.5185185185185182},{"$f":"MIN(D313/(A313-B313),$C$240)","v":1.2416225749559082},{"$f":"Equations!$H$69+C313","v":0.52},{"$f":"IF($F$240=\"Soft Start\", F313, E313)","v":0.52},0.32,{"$f":"(COUTMAX/1000000)*(B313-B312)/H313","v":1.262019230769218E-3},8.203125E-2,{"$f":"J313*1000","v":82.03125},{"$f":"H313/G313","v":0.61538461538461542},0.14027042915931803,3.4453124999999653E-3,{"$f":"G313*(A313-B313)","v":2.73},{"$f":"(A313-B313)*(Equations!$H$69*$Q$240+C313)","v":3.36},{"$f":"(A313-B313)*(Equations!$H$69*$R$240+C313)","v":2.1}]
[14,8.8846153846153832,0.2,{"$f":"B240","v":6.5185185185185182},1.2742968532442212,{"$f":"Equations!$H$69+C314","v":0.52},0.52,0.32,1.262019230769218E-3,{"$f":"J313+I314","v":8.3293269230769212E-2},83.293269230769212,0.61538461538461542,0.14571614220737017,3.356971153846121E-3,2.6600000000000006,{"$f":"(A314-B314)*(Equations!$H$69*$Q$240+C314)","v":3.2738461538461547},{"$f":"(A314-B314)*(Equations!$H$69*$R$240+C314)","v":2.0461538461538469}]
[14,9.0192307692307701,0.2,{"$f":"B240","v":6.5185185185185182},1.3087373087373089,{"$f":"Equations!$H$69+C315","v":0.52},0.52,0.32,1.2620192307692512E-3,8.4555288461538466E-2,84.555288461538467,0.61538461538461542,0.15145621812288482,3.2686298076923604E-3,2.59,{"$f":"(A315-B315)*(Equations!$H$69*$Q$240+C315)","v":3.1876923076923074},{"$f":"(A315-B315)*(Equations!$H$69*$R$240+C315)","v":1.9923076923076921}]
[14,9.1538461538461533,0.2,{"$f":"B240","v":6.5185185185185182},1.3450911228689004,{"$f":"Equations!$H$69+C316","v":0.52},0.52,0.32,1.262019230769218E-3,8.5817307692307679E-2,85.817307692307679,0.61538461538461542,0.15751518714481674,3.1802884615384302E-3,2.5200000000000005,{"$f":"(A316-B316)*(Equations!$H$69*$Q$240+C316)","v":3.1015384615384618},{"$f":"(A316-B316)*(Equations!$H$69*$R$240+C316)","v":1.9384615384615387}]
[14,9.2884615384615383,0.2,{"$f":"B240","v":6.5185185185185182},1.3835222978080119,{"$f":"Equations!$H$69+C317","v":0.52},0.52,0.32,1.2620192307692345E-3,8.7079326923076919E-2,87.07932692307692,0.61538461538461542,0.16392038296800196,3.0919471153846249E-3,2.4500000000000002,{"$f":"(A317-B317)*(Equations!$H$69*$Q$240+C317)","v":3.0153846153846153},{"$f":"(A317-B317)*(Equations!$H$69*$R$240+C317)","v":1.8846153846153848}]
[14,9.4230769230769234,0.2,{"$f":"B240","v":6.5185185185185182},1.424214130096483,{"$f":"Equations!$H$69+C318","v":0.52},0.52,0.32,1.2620192307692345E-3,8.8341346153846159E-2,88.34134615384616,0.61538461538461542,0.1707023550160805,3.0036057692307784E-3,2.38,{"$f":"(A318-B318)*(Equations!$H$69*$Q$240+C318)","v":2.9292307692307693},{"$f":"(A318-B318)*(Equations!$H$69*$R$240+C318)","v":1.8307692307692307}]
[14,9.5576923076923084,0.2,{"$f":"B240","v":6.5185185185185182},1.4673721340388008,{"$f":"Equations!$H$69+C319","v":0.52},0.52,0.32,1.2620192307692345E-3,8.9603365384615399E-2,89.603365384615401,0.61538461538461542,0.17789535567313347,2.9152644230769314E-3,2.3099999999999996,{"$f":"(A319-B319)*(Equations!$H$69*$Q$240+C319)","v":2.8430769230769228},{"$f":"(A319-B319)*(Equations!$H$69*$R$240+C319)","v":1.7769230769230768}]
[14,9.6923076923076916,0.2,{"$f":"B240","v":6.5185185185185182},1.5132275132275128,{"$f":"Equations!$H$69+C320","v":0.52},0.52,0.32,1.262019230769218E-3,9.0865384615384612E-2,90.865384615384613,0.61538461538461542,0.18553791887125212,2.8269230769230489E-3,2.2400000000000002,{"$f":"(A320-B320)*(Equations!$H$69*$Q$240+C320)","v":2.7569230769230773},{"$f":"(A320-B320)*(Equations!$H$69*$R$240+C320)","v":1.7230769230769234}]
[14,9.8269230769230766,0.2,{"$f":"B240","v":6.5185185185185182},1.5620413039767878,{"$f":"Equations!$H$69+C321","v":0.52},0.52,0.32,1.2620192307692345E-3,9.2127403846153852E-2,92.127403846153854,0.61538461538461542,0.19367355066279793,2.7385817307692393E-3,2.1700000000000004,{"$f":"(A321-B321)*(Equations!$H$69*$Q$240+C321)","v":2.6707692307692308},{"$f":"(A321-B321)*(Equations!$H$69*$R$240+C321)","v":1.6692307692307695}]
[14,9.9615384615384617,0.2,{"$f":"B240","v":6.5185185185185182},1.6141093474426806,{"$f":"Equations!$H$69+C322","v":0.52},0.52,0.32,1.2620192307692345E-3,9.3389423076923092E-2,93.389423076923094,0.61538461538461542,0.2023515579071134,2.6502403846153924E-3,2.1,{"$f":"(A322-B322)*(Equations!$H$69*$Q$240+C322)","v":2.5846153846153848},{"$f":"(A322-B322)*(Equations!$H$69*$R$240+C322)","v":1.6153846153846154}]
[14,10.096153846153847,0.2,{"$f":"B240","v":6.5185185185185182},1.6697682904579458,{"$f":"Equations!$H$69+C323","v":0.52},0.52,0.32,1.2620192307692345E-3,9.4651442307692332E-2,94.651442307692335,0.61538461538461542,0.2116280484096576,2.5618990384615459E-3,2.0299999999999998,{"$f":"(A323-B323)*(Equations!$H$69*$Q$240+C323)","v":2.4984615384615383},{"$f":"(A323-B323)*(Equations!$H$69*$R$240+C323)","v":1.5615384615384613}]
[14,10.23076923076923,0.2,{"$f":"B240","v":6.5185185185185182},1.7294028722600145,{"$f":"Equations!$H$69+C324","v":0.52},0.52,0.32,1.262019230769218E-3,9.5913461538461545E-2,95.913461538461547,0.61538461538461542,0.22156714537666905,2.4735576923076682E-3,1.9600000000000004,{"$f":"(A324-B324)*(Equations!$H$69*$Q$240+C324)","v":2.4123076923076927},{"$f":"(A324-B324)*(Equations!$H$69*$R$240+C324)","v":1.5076923076923081}]
[14,10.365384615384617,0.2,{"$f":"B240","v":6.5185185185185182},1.793454830491868,{"$f":"Equations!$H$69+C325","v":0.52},0.52,0.32,1.2620192307692512E-3,9.7175480769230799E-2,97.175480769230802,0.61538461538461542,0.23224247174864465,2.3852163461538841E-3,1.8899999999999995,{"$f":"(A325-B325)*(Equations!$H$69*$Q$240+C325)","v":2.3261538461538454},{"$f":"(A325-B325)*(Equations!$H$69*$R$240+C325)","v":1.4538461538461533}]
[14,10.5,0.2,{"$f":"B240","v":6.5185185185185182},1.8624338624338623,{"$f":"Equations!$H$69+C326","v":0.52},0.52,0.32,1.262019230769218E-3,9.8437500000000011E-2,98.437500000000014,0.61538461538461542,0.2437389770723104,2.2968749999999769E-3,1.82,{"$f":"(A326-B326)*(Equations!$H$69*$Q$240+C326)","v":2.2400000000000002},{"$f":"(A326-B326)*(Equations!$H$69*$R$240+C326)","v":1.4000000000000001}]
[14,10.634615384615383,0.2,{"$f":"B240","v":6.5185185185185182},1.9369312169312161,{"$f":"Equations!$H$69+C327","v":0.52},0.52,0.32,1.262019230769218E-3,9.9699519230769224E-2,99.699519230769226,0.61538461538461542,0.25615520282186938,2.2085336538461326E-3,1.7500000000000007,{"$f":"(A327-B327)*(Equations!$H$69*$Q$240+C327)","v":2.1538461538461546},{"$f":"(A327-B327)*(Equations!$H$69*$R$240+C327)","v":1.3461538461538467}]
[14,10.76923076923077,0.2,{"$f":"B240","v":6.5185185185185182},2.0176366843033513,{"$f":"Equations!$H$69+C328","v":0.52},0.52,0.32,1.2620192307692512E-3,0.10096153846153848,100.96153846153848,0.61538461538461542,0.26960611405055857,2.1201923076923416E-3,1.6799999999999997,{"$f":"(A328-B328)*(Equations!$H$69*$Q$240+C328)","v":2.0676923076923073},{"$f":"(A328-B328)*(Equations!$H$69*$R$240+C328)","v":1.2923076923076922}]
[14,10.903846153846153,0.2,{"$f":"B240","v":6.5185185185185182},2.0370370370370372,{"$f":"Equations!$H$69+C329","v":0.52},0.52,0.32,1.262019230769218E-3,0.10222355769230769,102.22355769230769,0.61538461538461542,0.27283950617283953,2.0318509615384417E-3,1.6100000000000003,{"$f":"(A329-B329)*(Equations!$H$69*$Q$240+C329)","v":1.9815384615384619},{"$f":"(A329-B329)*(Equations!$H$69*$R$240+C329)","v":1.2384615384615387}]
[14,11.038461538461538,0.2,{"$f":"B240","v":6.5185185185185182},2.0370370370370372,{"$f":"Equations!$H$69+C330","v":0.52},0.52,0.32,1.2620192307692345E-3,0.10348557692307693,103.48557692307693,0.61538461538461542,0.27283950617283953,1.9435096153846215E-3,1.54,{"$f":"(A330-B330)*(Equations!$H$69*$Q$240+C330)","v":1.8953846153846154},{"$f":"(A330-B330)*(Equations!$H$69*$R$240+C330)","v":1.1846153846153846}]
[14,11.173076923076923,0.2,{"$f":"B240","v":6.5185185185185182},2.0370370370370372,{"$f":"Equations!$H$69+C331","v":0.52},0.52,0.32,1.2620192307692345E-3,0.10474759615384617,104.74759615384617,0.61538461538461542,0.27283950617283953,1.8551682692307747E-3,1.47,{"$f":"(A331-B331)*(Equations!$H$69*$Q$240+C331)","v":1.8092307692307692},{"$f":"(A331-B331)*(Equations!$H$69*$R$240+C331)","v":1.1307692307692307}]
[14,11.307692307692308,0.2,{"$f":"B240","v":6.5185185185185182},2.0370370370370372,{"$f":"Equations!$H$69+C332","v":0.52},0.52,0.32,1.2620192307692345E-3,0.10600961538461541,106.00961538461542,0.61538461538461542,0.27283950617283953,1.766826923076928E-3,1.3999999999999997,{"$f":"(A332-B332)*(Equations!$H$69*$Q$240+C332)","v":1.7230769230769227},{"$f":"(A332-B332)*(Equations!$H$69*$R$240+C332)","v":1.0769230769230766}]
[14,11.442307692307692,0.2,{"$f":"B240","v":6.5185185185185182},2.0370370370370372,{"$f":"Equations!$H$69+C333","v":0.52},0.52,0.32,1.262019230769218E-3,0.10727163461538462,107.27163461538463,0.61538461538461542,0.27283950617283953,1.6784855769230605E-3,1.3300000000000003,{"$f":"(A333-B333)*(Equations!$H$69*$Q$240+C333)","v":1.6369230769230774},{"$f":"(A333-B333)*(Equations!$H$69*$R$240+C333)","v":1.0230769230769234}]
[14,11.576923076923077,0.2,{"$f":"B240","v":6.5185185185185182},2.0370370370370372,{"$f":"Equations!$H$69+C334","v":0.52},0.52,0.32,1.2620192307692345E-3,0.10853365384615386,108.53365384615387,0.61538461538461542,0.27283950617283953,1.5901442307692357E-3,1.2600000000000002,{"$f":"(A334-B334)*(Equations!$H$69*$Q$240+C334)","v":1.5507692307692309},{"$f":"(A334-B334)*(Equations!$H$69*$R$240+C334)","v":0.96923076923076934}]
[14,11.711538461538462,0.2,{"$f":"B240","v":6.5185185185185182},2.0370370370370372,{"$f":"Equations!$H$69+C335","v":0.52},0.52,0.32,1.2620192307692345E-3,0.1097956730769231,109.79567307692311,0.61538461538461542,0.27283950617283953,1.5018028846153892E-3,1.19,{"$f":"(A335-B335)*(Equations!$H$69*$Q$240+C335)","v":1.4646153846153847},{"$f":"(A335-B335)*(Equations!$H$69*$R$240+C335)","v":0.91538461538461535}]
[14,11.846153846153847,0.2,{"$f":"B240","v":6.5185185185185182},2.0370370370370372,{"$f":"Equations!$H$69+C336","v":0.52},0.52,0.32,1.2620192307692345E-3,0.11105769230769234,111.05769230769235,0.61538461538461542,0.27283950617283953,1.4134615384615425E-3,1.1199999999999997,{"$f":"(A336-B336)*(Equations!$H$69*$Q$240+C336)","v":1.3784615384615382},{"$f":"(A336-B336)*(Equations!$H$69*$R$240+C336)","v":0.86153846153846136}]
[14,11.98076923076923,0.2,{"$f":"B240","v":6.5185185185185182},2.0370370370370372,{"$f":"Equations!$H$69+C337","v":0.52},0.52,0.32,1.262019230769218E-3,0.11231971153846156,112.31971153846156,0.61538461538461542,0.27283950617283953,1.3251201923076795E-3,1.0500000000000005,{"$f":"(A337-B337)*(Equations!$H$69*$Q$240+C337)","v":1.2923076923076928},{"$f":"(A337-B337)*(Equations!$H$69*$R$240+C337)","v":0.80769230769230804}]
[14,12.115384615384617,0.2,{"$f":"B240","v":6.5185185185185182},2.0370370370370372,{"$f":"Equations!$H$69+C338","v":0.52},0.52,0.32,1.2620192307692512E-3,0.11358173076923081,113.58173076923082,0.61538461538461542,0.27283950617283953,1.2367788461538653E-3,0.97999999999999932,{"$f":"(A338-B338)*(Equations!$H$69*$Q$240+C338)","v":1.2061538461538452},{"$f":"(A338-B338)*(Equations!$H$69*$R$240+C338)","v":0.75384615384615339}]
[14,12.25,0.2,{"$f":"B240","v":6.5185185185185182},2.0370370370370372,{"$f":"Equations!$H$69+C339","v":0.52},0.52,0.32,1.262019230769218E-3,0.11484375000000002,114.84375000000003,0.61538461538461542,0.27283950617283953,1.1484374999999884E-3,0.91,{"$f":"(A339-B339)*(Equations!$H$69*$Q$240+C339)","v":1.1200000000000001},{"$f":"(A339-B339)*(Equations!$H$69*$R$240+C339)","v":0.70000000000000007}]
[14,12.384615384615383,0.2,{"$f":"B240","v":6.5185185185185182},2.0370370370370372,{"$f":"Equations!$H$69+C340","v":0.52},0.52,0.32,1.262019230769218E-3,0.11610576923076923,116.10576923076924,0.61538461538461542,0.27283950617283953,1.0600961538461441E-3,0.84000000000000075,{"$f":"(A340-B340)*(Equations!$H$69*$Q$240+C340)","v":1.0338461538461547},{"$f":"(A340-B340)*(Equations!$H$69*$R$240+C340)","v":0.64615384615384674}]
[14,12.51923076923077,0.2,{"$f":"B240","v":6.5185185185185182},2.0370370370370372,{"$f":"Equations!$H$69+C341","v":0.52},0.52,0.32,1.2620192307692512E-3,0.11736778846153849,117.3677884615385,0.61538461538461542,0.27283950617283953,9.7175480769232298E-4,0.76999999999999957,{"$f":"(A341-B341)*(Equations!$H$69*$Q$240+C341)","v":0.94769230769230717},{"$f":"(A341-B341)*(Equations!$H$69*$R$240+C341)","v":0.59230769230769198}]
[14,12.653846153846153,0.2,{"$f":"B240","v":6.5185185185185182},2.0370370370370372,{"$f":"Equations!$H$69+C342","v":0.52},0.52,0.32,1.262019230769218E-3,0.1186298076923077,118.62980769230771,0.61538461538461542,0.27283950617283953,8.8341346153845307E-4,0.70000000000000029,{"$f":"(A342-B342)*(Equations!$H$69*$Q$240+C342)","v":0.86153846153846192},{"$f":"(A342-B342)*(Equations!$H$69*$R$240+C342)","v":0.53846153846153866}]
[14,12.788461538461538,0.2,{"$f":"B240","v":6.5185185185185182},2.0370370370370372,{"$f":"Equations!$H$69+C343","v":0.52},0.52,0.32,1.2620192307692345E-3,0.11989182692307694,119.89182692307695,0.61538461538461542,0.27283950617283953,7.9507211538461784E-4,0.63000000000000012,{"$f":"(A343-B343)*(Equations!$H$69*$Q$240+C343)","v":0.77538461538461545},{"$f":"(A343-B343)*(Equations!$H$69*$R$240+C343)","v":0.48461538461538467}]
[14,{"$f":"VINMAX*((ROW()-248)/104)","v":12.923076923076923},0.2,{"$f":"B240","v":6.5185185185185182},2.0370370370370372,{"$f":"Equations!$H$69+C344","v":0.52},0.52,0.32,1.2620192307692345E-3,0.12115384615384618,121.15384615384617,0.61538461538461542,0.27283950617283953,7.0673076923077123E-4,0.55999999999999983,{"$f":"(A344-B344)*(Equations!$H$69*$Q$240+C344)","v":0.68923076923076909},{"$f":"(A344-B344)*(Equations!$H$69*$R$240+C344)","v":0.43076923076923068}]
[14,13.057692307692308,0.2,{"$f":"B240","v":6.5185185185185182},2.0370370370370372,{"$f":"Equations!$H$69+C345","v":0.52},0.52,0.32,1.2620192307692345E-3,0.12241586538461542,122.41586538461542,0.61538461538461542,0.27283950617283953,6.1838942307692452E-4,0.48999999999999966,{"$f":"(A345-B345)*(Equations!$H$69*$Q$240+C345)","v":0.60307692307692262},{"$f":"(A345-B345)*(Equations!$H$69*$R$240+C345)","v":0.37692307692307669}]
[14,13.192307692307692,0.2,{"$f":"B240","v":6.5185185185185182},2.0370370370370372,{"$f":"Equations!$H$69+C346","v":0.52},0.52,0.32,1.262019230769218E-3,0.12367788461538463,123.67788461538463,0.61538461538461542,0.27283950617283953,5.3004807692307206E-4,0.42000000000000037,{"$f":"(A346-B346)*(Equations!$H$69*$Q$240+C346)","v":0.51692307692307737},{"$f":"(A346-B346)*(Equations!$H$69*$R$240+C346)","v":0.32307692307692337}]
[14,13.326923076923077,0.2,{"$f":"B240","v":6.5185185185185182},2.0370370370370372,{"$f":"Equations!$H$69+C347","v":0.52},0.52,0.32,1.2620192307692345E-3,0.12493990384615387,124.93990384615387,0.61538461538461542,0.27283950617283953,4.4170673076923228E-4,0.35000000000000014,{"$f":"(A347-B347)*(Equations!$H$69*$Q$240+C347)","v":0.43076923076923096},{"$f":"(A347-B347)*(Equations!$H$69*$R$240+C347)","v":0.26923076923076933}]
[14,13.461538461538462,0.2,{"$f":"B240","v":6.5185185185185182},2.0370370370370372,{"$f":"Equations!$H$69+C348","v":0.52},0.52,0.32,1.2620192307692345E-3,0.1262019230769231,126.20192307692309,0.61538461538461542,0.27283950617283953,3.5336538461538562E-4,0.27999999999999992,{"$f":"(A348-B348)*(Equations!$H$69*$Q$240+C348)","v":0.34461538461538455},{"$f":"(A348-B348)*(Equations!$H$69*$R$240+C348)","v":0.21538461538461534}]
[14,13.596153846153847,0.2,{"$f":"B240","v":6.5185185185185182},{"$f":"$C$240","v":2.0370370370370372},{"$f":"Equations!$H$69+C349","v":0.52},0.52,{"$f":"G349-C349","v":0.32},{"$f":"(COUTMAX/1000000)*(B349-B348)/H349","v":1.2620192307692345E-3},{"$f":"J348+I349","v":0.12746394230769234},127.46394230769234,{"$f":"H349/G349","v":0.61538461538461542},0.27283950617283953,{"$f":"I349*G349*(A349-B349)","v":2.650240384615389E-4},0.20999999999999971,{"$f":"(A349-B349)*(Equations!$H$69*$Q$240+C349)","v":0.25846153846153813},{"$f":"(A349-B349)*(Equations!$H$69*$R$240+C349)","v":0.16153846153846133}]
[14,13.73076923076923,0.2,{"$f":"B240","v":6.5185185185185182},{"$f":"$C$240","v":2.0370370370370372},{"$f":"Equations!$H$69+C350","v":0.52},0.52,{"$f":"G350-C350","v":0.32},{"$f":"(COUTMAX/1000000)*(B350-B349)/H350","v":1.262019230769218E-3},{"$f":"J349+I350","v":0.12872596153846155},128.72596153846155,{"$f":"H350/G350","v":0.61538461538461542},0.27283950617283953,{"$f":"I350*G350*(A350-B350)","v":1.7668269230769107E-4},0.14000000000000043,{"$f":"(A350-B350)*(Equations!$H$69*$Q$240+C350)","v":0.17230769230769283},{"$f":"(A350-B350)*(Equations!$H$69*$R$240+C350)","v":0.10769230769230803}]
[14,13.865384615384617,0.2,{"$f":"B240","v":6.5185185185185182},{"$f":"$C$240","v":2.0370370370370372},{"$f":"Equations!$H$69+C351","v":0.52},0.52,0.32,1.2620192307692512E-3,0.12998798076923079,129.9879807692308,0.61538461538461542,0.27283950617283953,8.8341346153846689E-5,6.9999999999999285E-2,{"$f":"(A351-B351)*(Equations!$H$69*$Q$240+C351)","v":8.6153846153845276E-2},{"$f":"(A351-B351)*(Equations!$H$69*$R$240+C351)","v":5.3846153846153301E-2}]
[14,14,0.2,{"$f":"B240","v":6.5185185185185182},{"$f":"$C$240","v":2.0370370370370372},{"$f":"Equations!$H$69+C352","v":0.52},0.52,0.32,1.262019230769218E-3,0.13125000000000001,131.25,0.61538461538461542,0.27283950617283953,0,0,{"$f":"(A352-B352)*(Equations!$H$69*$Q$240+C352)","v":0},{"$f":"(A352-B352)*(Equations!$H$69*$R$240+C352)","v":0}]
[null,null,null,null,null,null,null,null,null,null,{"$f":"K352+0.5","v":131.75},null,null,0,0]

{"sheet":"SOA","index":7,"n_rows":143,"n_cols":9,"rows_kept":143,"cut":false,"hidden":true,"merged":[[100,1,100,5],[7,13,7,15],[7,17,7,19],[4,1,4,5],[52,1,52,5]]}
[]
[]
["FET 1"]
[]
[null,"Look Up",null,null,null,null,null,"I = a * t^m"]
[null,"10us","100us","1ms","10ms","100ms",null,"a = iSOA1/tSOA1^m"]
["Final SOA",{"$f":"'Design Calculator'!F57","v":400},{"$f":"'Design Calculator'!F58","v":601.73570974983545},{"$f":"'Design Calculator'!F59","v":33.624407288629875},{"$f":"'Design Calculator'!F60","v":11.98008745545671},{"$f":"'Design Calculator'!F61","v":4.9306775809066696},null,"m = log(iSOA1/iSOA2)/log(tSOA1/tSOA2)"]
[null,"Maximum Junction Temperature",{"$f":"'Design Calculator'!F56","v":150},"oC"]
[]
[null,"SOA Check - Based on Timer",null,null,null,null,"SOA Predictor - dv/dt start-up"]
[null,"time",{"$f":"IF('Design Calculator'!F30=\"Power Limit\", 'Design Calculator'!$F$84,'Design Calculator'!F97)","v":1.0352941176470587},"ms",null,null,"time",{"$f":"Equations!F73","v":64.993990384615415},"ms"]
[null,"Voltage",{"$f":"VINMAX","v":14},"V",null,null,"Voltage",{"$f":"VINMAX","v":14},"V"]
[null,"Lower time",{"$f":"IF(C11<10, IF(C11<1, 0.1, 1), IF(C11<100, 10, 100))","v":1},"ms",null,null,"Lower time",{"$f":"IF(H11<10, IF(H11<1, 0.1, 1), IF(H11<100, 10, 100))","v":10},"ms"]
[null,"Lower time (adjusted)",{"$f":"SOA!C13","v":1},null,null,null,"Lower time (adjusted)",{"$f":"SOA!H13","v":10}]
[null,"Higher timer",{"$f":"C13*10","v":10},"ms",null,null,"Higher time",{"$f":"H13*10","v":100},"ms"]
[null,"Higher time (adjusted)",{"$f":"SOA!C15","v":10},null,null,null,"Higher time (adjusted)",{"$f":"SOA!H15","v":100}]
[null,"I (lower time)",{"$f":"IF(C14=0.01, B7, IF(C14=0.1, C7, IF(C14=1, D7, E7)))","v":33.624407288629875},"A",null,null,"I (lower time)",{"$f":"IF(H14=0.01, B7, IF(H14=0.1, C7, IF(H14=1, D7, IF(H14=10,E7,F7))))","v":11.98008745545671}]
[null,"I (higher time)",{"$f":"IF(C16=100, F7, IF(C16=10, E7, IF(C16=1, D7,IF(C16=0.1, C7,B7))))","v":11.98008745545671},"A",null,null,"I (higher time)",{"$f":"IF(H16=100, F7, IF(H16=10, E7, IF(H16=1, D7, IF(H16=0.1,B7,C7))))","v":4.9306775809066696}]
[]
[null,"Assuming Power vs time is linear on a log-log plot",null,null,null,null,"Assuming Power vs time is linear on a log-log plot"]
[null,"a",{"$f":"C17/C14^C22","v":33.624407288629875},null,null,null,"a",{"$f":"H17/H14^H22","v":29.108067417784767}]
[null,"m",{"$f":"LOG(C17/C18)/LOG(C14/C16)","v":-0.44819464914477142},null,null,null,"m",{"$f":"IF(H17=H18,0.000000000001,LOG(H17/H18)/LOG(H14/H16))","v":-0.38555338368458214},"<-- Cannot plot zero on a log graph. If slope ~=0, then use 1e-12 as value"]
[null,"Extr. I",{"$f":"C21*C11^C22","v":33.105728344268194},"A",null,null,"Extr. I",{"$f":"H21*H11^H22","v":5.8217556720410331}]
[]
[null,"Interpolated Power=",{"$f":" C23*C12","v":463.48019681975472},null,null,null,"Interpolated Power=",{"$f":"IF(H11<1, H17, H23)*H12","v":81.504579408574457}]
[]
[null,null,null,null,null,null,"board hot?",{"$f":"'Design Calculator'!F86","v":"No"}]
[null,"Derating factor =",{"$f":"(C8-TJDC1)/(C8-25)","v":0.51587560960000001},null,null,null,"Temp for derating",{"$f":"IF(H27=\"Yes\", TJDC1,TAMB)","v":85}]
[null,"Max Power with Temp Derating = ",{"$f":"IF((C25*C28)<0,0.000000001,C25*C28)","v":239.09812907191895},"W"]
[null,null,null,null,null,null,"Derating factor =",{"$f":"(C8-H28)/(C8-25)","v":0.52}]
[null,null,null,null,null,null,"Max Power with Temp Derating = ",{"$f":"IF((H25*H30)<0,0.000000001,H25*H30)","v":42.382381292458717}]
[null,"SOA Coefficients"]
[null,null,"0.01ms to 0.1 ms","0.1ms to 1ms","1ms to 10ms","10ms to 100ms"]
[null,"t1",0.01,0.1,1,10]
[null,"t2",0.1,1,10,100]
[null,"a",{"$f":"B7/(C34^C37)","v":905.21466097034545},{"$f":"C7/(D34^D37)","v":33.624407288629882},{"$f":"D7/(E34^E37)","v":33.624407288629875},{"$f":"E7/(F34^F37)","v":29.108067417784767}]
[null,"m",{"$f":"LOG(B7/C7)/LOG(C34/C35)","v":0.17734579394983352},{"$f":"LOG(C7/D7)/LOG(D34/D35)","v":-1.252751147688778},{"$f":"LOG(D7/E7)/LOG(E34/E35)","v":-0.44819464914477142},{"$f":"LOG(E7/F7)/LOG(F34/F35)","v":-0.38555338368458214}]
[]
[null,"MOSFET's SOA"]
[null,"VDS","ID"]
[null,"(V)","(A)"]
[null,1,{"$f":"$C$29/B42","v":239.09812907191895}]
[null,1.2,{"$f":"$C$29/B43","v":199.24844089326581}]
[null,30,7.9699376357306315]
[null,60,3.9849688178653158]
[null,80,2.9887266133989869]
[null,100,2.3909812907191896]
[]
[]
[]
["FET 2"]
[]
[null,"Look Up",null,null,null,null,null,"I = a * t^m"]
[null,"10us","100us","1ms","10ms","100ms",null,"a = iSOA1/tSOA1^m"]
["Final SOA",{"$f":"'Design Calculator'!$G$57","v":400},{"$f":"'Design Calculator'!$G$58","v":626.08493738234574},{"$f":"'Design Calculator'!$G$59","v":50.754558722510708},{"$f":"'Design Calculator'!$G$60","v":17.15082098001713},{"$f":"'Design Calculator'!$G$61","v":5.5916046225844749},null,"m = log(iSOA1/iSOA2)/log(tSOA1/tSOA2)"]
[null,"Maximum Junction Temperature",{"$f":"'Design Calculator'!$G$56","v":175},"oC"]
[]
[null,"SOA Check - Based on Timer",null,null,null,null,"SOA Predictor - dv/dt start-up"]
[null,"time",{"$f":"IF('Design Calculator'!F30=\"Power Limit\", 'Design Calculator'!$F$84,'Design Calculator'!F97)","v":1.0352941176470587},"ms",null,null,"time",{"$f":"Equations!G73","v":64.993990384615415},"ms"]
[null,"Voltage",{"$f":"VINMAX","v":14},"V",null,null,"Voltage",{"$f":"VINMAX","v":14},"V"]
[null,"Lower time",{"$f":"IF(C59<10, IF(C59<1, 0.1, 1), IF(C59<100, 10, 100))","v":1},"ms",null,null,"Lower time",{"$f":"IF(H59<10, IF(H59<1, 0.1, 1), IF(H59<100, 10, 100))","v":10},"ms"]
[null,"Lower time (adjusted)",{"$f":"SOA!C61","v":1},null,null,null,"Lower time (adjusted)",{"$f":"SOA!H61","v":10}]
[null,"Higher timer",{"$f":"C61*10","v":10},"ms",null,null,"Higher time",{"$f":"H61*10","v":100},"ms"]
[null,"Higher time (adjusted)",{"$f":"SOA!C63","v":10},null,null,null,"Higher time (adjusted)",{"$f":"SOA!H63","v":100}]
[null,"I (lower time)",{"$f":"IF(C62=0.01, B55, IF(C62=0.1, C55, IF(C62=1, D55, E55)))","v":50.754558722510708},"A",null,null,"I (lower time)",{"$f":"IF(H62=0.01, B55, IF(H62=0.1, C55, IF(H62=1, D55, IF(H62=10,E55,F55))))","v":17.15082098001713}]
[null,"I (higher time)",{"$f":"IF(C64=100, F55, IF(C64=10, E55, IF(C64=1, D55,IF(C64=0.1, C55,B55))))","v":17.15082098001713},"A",null,null,"I (higher time)",{"$f":"IF(H64=100, F55, IF(H64=10, E55, IF(H64=1, D55, IF(H64=0.1,B55,C55))))","v":5.5916046225844749}]
[]
[null,"Assuming Power vs time is linear on a log-log plot",null,null,null,null,"Assuming Power vs time is linear on a log-log plot"]
[null,"a",{"$f":"C65/C62^C70","v":50.754558722510708},null,null,null,"a",{"$f":"H65/H62^H70","v":52.605768852204278}]
[null,"m",{"$f":"LOG(C65/C66)/LOG(C62/C64)","v":-0.47119014242394203},null,null,null,"m",{"$f":"IF(H65=H66,0.000000000001,LOG(H65/H66)/LOG(H62/H64))","v":-0.48674845855434495},"<-- Cannot plot zero on a log graph. If slope ~=0, then use 1e-12 as value"]
[null,"Extr. I",{"$f":"C69*C59^C70","v":49.931793688146193},"A",null,null,"Extr. I",{"$f":"H69*H59^H70","v":6.8963633601289711}]
[]
[null,"Interpolated Power=",{"$f":" C71*C60","v":699.04511163404675},null,null,null,"Interpolated Power=",{"$f":"IF(H59<1, H65, H71)*H60","v":96.549087041805592}]
[]
[null,null,null,null,null,null,"board hot?",{"$f":"'Design Calculator'!F86","v":"No"}]
[null,"Derating factor =",{"$f":"(C56-TJDC2)/(C56-25)","v":0.59797564800000003},null,null,null,"Temp for derating",{"$f":"IF(H75=\"Yes\", TJDC2,TAMB)","v":85}]
[null,"Max Power with Temp Derating = ",{"$f":"IF((C73*C76)<0,0.000000001,C73*C76)","v":418.01195361060144},"W"]
[null,null,null,null,null,null,"Derating factor =",{"$f":"(C56-H76)/(C56-25)","v":0.6}]
[null,null,null,null,null,null,"Max Power with Temp Derating = ",{"$f":"IF((H73*H78)<0,0.000000001,H73*H78)","v":57.929452225083352}]
[null,"SOA Coefficients"]
[null,null,"0.01ms to 0.1 ms","0.1ms to 1ms","1ms to 10ms","10ms to 100ms"]
[null,"t1",0.01,0.1,1,10]
[null,"t2",0.1,1,10,100]
[null,"a",{"$f":"B55/(C82^C85)","v":979.95587204263938},{"$f":"C55/(D82^D85)","v":50.75455872251073},{"$f":"D55/(E82^E85)","v":50.754558722510708},{"$f":"E55/(F82^F85)","v":52.605768852204278}]
[null,"m",{"$f":"LOG(B55/C55)/LOG(C82/C83)","v":0.19457326414151749},{"$f":"LOG(C55/D55)/LOG(D82/D83)","v":-1.0911581992464914},{"$f":"LOG(D55/E55)/LOG(E82/E83)","v":-0.47119014242394203},{"$f":"LOG(E55/F55)/LOG(F82/F83)","v":-0.48674845855434495}]
[]
[null,"MOSFET's SOA"]
[null,"VDS","ID"]
[null,"(V)","(A)"]
[null,1,{"$f":"$C$77/B90","v":418.01195361060144}]
[null,1.2,{"$f":"$C$77/B91","v":348.34329467550123}]
[null,30,13.933731787020047]
[null,60,6.9668658935100236]
[null,80,5.2251494201325182]
[null,100,4.1801195361060142]
[]
[]
[]
["FET 3"]
[]
[null,"Look Up",null,null,null,null,null,"I = a * t^m"]
[null,"10us","100us","1ms","10ms","100ms",null,"a = iSOA1/tSOA1^m"]
["Final SOA",{"$f":"'Design Calculator'!H57","v":400},{"$f":"'Design Calculator'!H58","v":100},{"$f":"'Design Calculator'!H59","v":10},{"$f":"'Design Calculator'!H60","v":2},{"$f":"'Design Calculator'!H61","v":0.1},null,"m = log(iSOA1/iSOA2)/log(tSOA1/tSOA2)"]
[null,"Maximum Junction Temperature",{"$f":"'Design Calculator'!H56","v":175},"oC"]
[]
[null,"SOA Check - Based on Timer",null,null,null,null,"SOA Predictor - dv/dt start-up"]
[null,"time",{"$f":"IF('Design Calculator'!F30=\"Power Limit\", 'Design Calculator'!$F$84,'Design Calculator'!F97)","v":1.0352941176470587},"ms",null,null,"time",{"$f":"Equations!H73","v":64.993990384615415},"ms"]
[null,"Voltage",{"$f":"VINMAX","v":14},"V",null,null,"Voltage",{"$f":"VINMAX","v":14},"V"]
[null,"Lower time",{"$f":"IF(C107<10, IF(C107<1, 0.1, 1), IF(C107<100, 10, 100))","v":1},"ms",null,null,"Lower time",{"$f":"IF(H107<10, IF(H107<1, 0.1, 1), IF(H107<100, 10, 100))","v":10},"ms"]
[null,"Lower time (adjusted)",{"$f":"SOA!C109","v":1},null,null,null,"Lower time (adjusted)",{"$f":"SOA!H109","v":10}]
[null,"Higher timer",{"$f":"C109*10","v":10},"ms",null,null,"Higher time",{"$f":"H109*10","v":100},"ms"]
[null,"Higher time (adjusted)",{"$f":"SOA!C111","v":10},null,null,null,"Higher time (adjusted)",{"$f":"SOA!H111","v":100}]
[null,"I (lower time)",{"$f":"IF(C110=0.01, B103, IF(C110=0.1, C103, IF(C110=1, D103, E103)))","v":10},"A",null,null,"I (lower time)",{"$f":"IF(H110=0.01, B103, IF(H110=0.1, C103, IF(H110=1, D103, IF(H110=10,E103,F103))))","v":2}]
[null,"I (higher time)",{"$f":"IF(C112=100, F103, IF(C112=10, E103, IF(C112=1, D103,IF(C112=0.1, C103,B103))))","v":2},"A",null,null,"I (higher time)",{"$f":"IF(H112=100, F103, IF(H112=10, E103, IF(H112=1, D103, IF(H112=0.1,B103,C103))))","v":0.1}]
[]
[null,"Assuming Power vs time is linear on a log-log plot",null,null,null,null,"Assuming Power vs time is linear on a log-log plot"]
[null,"a",{"$f":"C113/C110^C118","v":10},null,null,null,"a",{"$f":"H113/H110^H118","v":40.000000000000014}]
[null,"m",{"$f":"LOG(C113/C114)/LOG(C110/C112)","v":-0.69897000433601886},null,null,null,"m",{"$f":"IF(H113=H114,0.000000000001,LOG(H113/H114)/LOG(H110/H112))","v":-1.3010299956639813},"<-- Cannot plot zero on a log graph. If slope ~=0, then use 1e-12 as value"]
[null,"Extr. I",{"$f":"C117*C107^C118","v":9.7604736443024755},"A",null,null,"Extr. I",{"$f":"H117*H107^H118","v":0.17516913178570481}]
[]
[null,"Interpolated Power=",{"$f":" C119*C108","v":136.64663102023465},null,null,null,"Interpolated Power=",{"$f":"IF(H107<1, H113, H119)*H108","v":2.4523678449998672}]
[]
[null,null,null,null,null,null,"board hot?",{"$f":"'Design Calculator'!F86","v":"No"}]
[null,"Derating factor =",{"$f":"(C104-TJDC3)/(C104-25)","v":0.599352},null,null,null,"Temp for derating",{"$f":"IF(H123=\"Yes\", TJDC3,TAMB)","v":85}]
[null,"Max Power with Temp Derating = ",{"$f":"IF((C121*C124)<0,0.000000001,C121*C124)","v":81.899431595239676},"W"]
[null,null,null,null,null,null,"Derating factor =",{"$f":"(C104-H124)/(C104-25)","v":0.6}]
[null,null,null,null,null,null,"Max Power with Temp Derating = ",{"$f":"IF((H121*H126)<0,0.000000001,H121*H126)","v":1.4714207069999203}]
[null,"SOA Coefficients"]
[null,null,"0.01ms to 0.1 ms","0.1ms to 1ms","1ms to 10ms","10ms to 100ms"]
[null,"t1",0.01,0.1,1,10]
[null,"t2",0.1,1,10,100]
[null,"a",{"$f":"B103/(C130^C133)","v":25},{"$f":"C103/(D130^D133)","v":10},{"$f":"D103/(E130^E133)","v":10},{"$f":"E103/(F130^F133)","v":40.000000000000014}]
[null,"m",{"$f":"LOG(B103/C103)/LOG(C130/C131)","v":-0.6020599913279624},{"$f":"LOG(C103/D103)/LOG(D130/D131)","v":-1},{"$f":"LOG(D103/E103)/LOG(E130/E131)","v":-0.69897000433601886},{"$f":"LOG(E103/F103)/LOG(F130/F131)","v":-1.3010299956639813}]
[]
[null,"MOSFET's SOA"]
[null,"VDS","ID"]
[null,"(V)","(A)"]
[null,1,{"$f":"$C$125/B138","v":81.899431595239676}]
[null,1.2,{"$f":"$C$125/B139","v":68.249526329366404}]
[null,30,2.7299810531746558]
[null,60,1.3649905265873279]
[null,80,1.0237428949404959]
[null,100,0.8189943159523968]

{"sheet":"dv_dt_recommendations","index":8,"n_rows":149,"n_cols":25,"rows_kept":149,"cut":false,"hidden":true,"merged":[]}
[]
[]
[]
[]
[null,null,"Key Equations for SOA margin estimate: "]
[]
[null,null,"1) Get total Energy = 1/2 CV^2 + E_load (t_worksheet) * t_start / t_ worksheet"]
[null,null,"     note:  t_worksheet is the start time from the start-up worksheet.  E_load = Total Energy @ Start-up - 1/2CV^2"]
[]
[null,null,"2) Get peak power:  4 Possible points with peak power"]
[null,null,"      a) At Vin = 0 [mainly if there is no load or constant current load that starts at Vout = 0="]
[null,null,"      b) At Vin = Load start [ constant current="]
[null,null,"      c) When derivative of power = 0  [Peak, applies to resistive loads only="]
[null,null,"                "," P = (I_cap + Vout/R ) * (Vin - Vout) = Icap * Vin - Icap * Vout +Vin * Vout / R - Vout^2 / R "]
[null,null,null," =>  dP/dVout =  -Icap + Vin/R -2Vout /R ;  Zero when Vout = -R*I_cap / 2 + Vin / 2"]
[]
[null,null,null,"FET 1"]
[null,null,null,"Copied Inputs",null,null,null,null,"Maximum Junction Temperature",{"$f":"'Design Calculator'!F56","v":150},"°C"]
[null,null,null,"Temp_start_up",{"$f":"SOA!H28","v":85}]
[null,null,null,"SOA margin target",1.5,null,null,null,"SOA Coefficients"]
[null,null,null,"Cap Energy (J)",{"$f":"1/2*COUTMAX*VINMAX^2*0.000001","v":0.29399999999999998},null,null,null,null,"0.01 to 0.1 ms","0.1 to 1 ms","1 to 10 ms","10 to 100 ms"]
[null,null,null,"E_load (t_worksheet)  (J)",{"$f":"MAX(Equations!F71-E21,0)","v":0.17915625000000018},null,null,null,"t1",0.01,0.1,1,10]
[null,null,null,"t_worksheet (ms)",{"$f":"Equations!F70","v":131.25},null,null,null,"t2",0.1,1,10,100]
[null,null,null,null,null,null,null,null,"a",{"$f":"SOA!C36","v":905.21466097034545},{"$f":"SOA!D36","v":33.624407288629882},{"$f":"SOA!E36","v":33.624407288629875},{"$f":"SOA!F36","v":29.108067417784767}]
[null,null,null,"Load Turn-On Threshold",{"$f":"'Design Calculator'!F27","v":0},null,null,null,"m",{"$f":"SOA!C37","v":0.17734579394983352},{"$f":"SOA!D37","v":-1.252751147688778},{"$f":"SOA!E37","v":-0.44819464914477142},{"$f":"SOA!F37","v":-0.38555338368458214}]
[null,null,null,"Startup Load Type",{"$f":"'Design Calculator'!F28","v":"Constant Current"}]
[null,null,null,"Startup Load Value",{"$f":"'Design Calculator'!F29","v":0.2},null,null,null,"Initial","Final"]
[null,null,null,null,null,null,"max slew rate ",null,{"$f":"SUM(E58:X58)","v":2.1995768529989235},{"$f":"IF(I28=0, \"NA\", I28/AVERAGE(1, E32))","v":2.4648433285578175}]
[null,null,null,"Upper bound Slew Rate (4ms start-up) (V/ms)",{"$f":"12/1","v":12},null,"min slew rate",null,{"$f":"SUM(E59:X59)","v":0.12},{"$f":"IF(I29=0, \"NA\", I29*AVERAGE(1,E32))","v":0.10708559822108767}]
[null,null,null,"Min Slew Rate (400 ms start - up) (V/ms)",0.12]
[null,null,null,"# of points",20]
[null,null,null,"mult per point",{"$f":"(E30/E29)^(1/(E31-1))","v":0.78475997035146128}]
[]
[null,null,null,null,1,2,3,4,5,6,7,8,9,10,11,12,13,14,15,16,17,18,19,20]
[null,null,null,"slew rate (V/ms)",{"$f":"E29","v":12},{"$f":"E35*$E$32","v":9.4171196442175358},{"$f":"F35*$E$32","v":7.3901785327923166},5.7995162862861038,4.5512282288787,3.5716217299575823,2.802865762908147,2.1995768529989235,1.7261398659451956,1.354605470021627,1.0630401484920993,0.83423135541307281,0.65467137374022233,0.51375988784632731,0.40317819435405389,0.316398107847643,0.24829656973377476,0.19485320870264661,0.15291299828437604,0.12]
[null,null,null,"t_start (ms)",{"$f":"VINMAX/E35","v":1.1666666666666667},1.4866541499869894,1.8944061957201754,2.4139944279672547,3.0760927151854176,3.9197880006644121,4.9948877985059594,6.3648605780299379,8.11058262207154,10.335112554784295,13.169775402988037,16.781915363356063,21.384774959711752,27.250083806051425,34.724100152365374,44.248052225209577,56.384186116670456,71.848957957703078,91.555329874337147,116.66666666666667]
[null,null,null,"I_cap (A)",{"$f":"E35*COUTMAX/1000","v":36},28.251358932652607,22.170535598376951,17.398548858858309,13.653684686636099,10.714865189872748,8.4085972887244402,6.5987305589967704,5.1784195978355863,4.0638164100648808,3.189120445476298,2.5026940662392185,1.964014121220667,1.541279663538982,1.2095345830621616,0.94919432354292899,0.74488970920132436,0.58455962610793988,0.45873899485312813,0.36]
[null,null,null,"Total FET Energy (J)",{"$f":"$E$21+$E$22*E36/$E$23","v":0.29559249999999998},{"$f":"$E$21+$E$22*F36/$E$23","v":0.29602928291473224},{"$f":"$E$21+$E$22*G36/$E$23","v":0.29658586445715801},{"$f":"$E$21+$E$22*H36/$E$23","v":0.29729510239417528},0.29819886655622807,0.2993505106209069,{"$f":"$E$21+$E$22*K36/$E$23","v":0.30081802184496065},{"$f":"$E$21+$E$22*L36/$E$23","v":0.30268803468901084},0.30507094527912765,0.30810742863728058,0.3119767434250787,0.31690731447098103,0.32319021782000656,0.33119636439526023,{"$f":"$E$21+$E$22*S36/$E$23","v":0.34139839670797878},0.35439859128741114,0.37096441404925523,0.39207382761226478,{"$f":"$E$21+$E$22*W36/$E$23","v":0.4189730252784703},0.45325000000000015]
[null,null,null,"Power (Vout= 0) , (W)",{"$f":"(E37+IF($E$26=\"Resistive\",0,IF($E$25=0,$E$27,0)))*VINMAX","v":506.80000000000007},398.31902505713651,313.18749837727728,246.37968402401631,193.95158561290538,152.80811265821848,120.52036204214215,95.182227825954783,75.297874369698206,59.693429740908336,47.447686236668176,37.837716927349064,30.29619769708934,24.377915289545747,19.733484162870262,16.088720529601005,13.228455928818542,10.983834765511158,9.2223459279437936,7.8400000000000007]
[null,null,null,"Power (load on), (W)",{"$f":"(E37+IF($E$26=\"Resistive\", $E$25/$E$27,$E$27)) *(VINMAX-$E$25)","v":506.80000000000007},398.31902505713651,313.18749837727728,246.37968402401631,193.95158561290538,152.80811265821848,120.52036204214215,95.182227825954783,75.297874369698206,59.693429740908336,47.447686236668176,37.837716927349064,30.29619769708934,24.377915289545747,19.733484162870262,16.088720529601005,13.228455928818542,10.983834765511158,9.2223459279437936,7.8400000000000007]
[null,null,null,"Vout (dP/dVout = 0) (V)",{"$f":"IF($E$26=\"Resistive\", -$E$27*E37/2 + VINMAX/2, -1)","v":-1},-1,-1,-1,-1,-1,-1,-1,-1,-1,-1,-1,-1,-1,-1,-1,-1,-1,-1,-1]
[null,null,null,"Power (@ Vout above, if applicable) ",{"$f":"IF(AND(E41<VINMAX, E41>$E$25), (VINMAX-E41)*(E37+E41/$E$27), 0)","v":0},0,0,0,0,0,0,0,0,0,0,0,0,0,0,0,0,0,0,0]
[]
[null,null,null,"max power (W)",{"$f":"MAX(E39,E40,E42)","v":506.80000000000007},{"$f":"MAX(F39,F40,F42)","v":398.31902505713651},{"$f":"MAX(G39,G40,G42)","v":313.18749837727728},{"$f":"MAX(H39,H40,H42)","v":246.37968402401631},193.95158561290538,152.80811265821848,{"$f":"MAX(K39,K40,K42)","v":120.52036204214215},{"$f":"MAX(L39,L40,L42)","v":95.182227825954783},75.297874369698206,59.693429740908336,47.447686236668176,37.837716927349064,30.29619769708934,24.377915289545747,{"$f":"MAX(S39,S40,S42)","v":19.733484162870262},16.088720529601005,13.228455928818542,10.983834765511158,9.2223459279437936,7.8400000000000007]
[null,null,null,"Equivalent time for SOA (ms)",{"$f":"E38/E44*1000","v":0.58325276243093915},{"$f":"F38/F44*1000","v":0.74319644378590399},{"$f":"G38/G44*1000","v":0.94699139012209121},{"$f":"H38/H44*1000","v":1.2066542887732412},1.5374912538811756,1.9589961908007829,{"$f":"K38/K44*1000","v":2.4959933470808369},{"$f":"L38/L44*1000","v":3.1800898298208597},{"$f":"M38/M44*1000","v":4.0515213454935992},5.1614964992727224,{"$f":"O38/O44*1000","v":6.5751729572005786},{"$f":"P38/P44*1000","v":8.3754343603622861},{"$f":"Q38/Q44*1000","v":10.667682494396203},13.585918256812175,{"$f":"S38/S44*1000","v":17.300462193612034},{"$f":"T38/T44*1000","v":22.027767256903186},28.042911133800537,{"$f":"V38/V44*1000","v":35.695532205506431},{"$f":"W38/W44*1000","v":45.430200574994501},{"$f":"X38/X44*1000","v":57.812500000000014}]
[]
[null,null,null,"a",{"$f":"IF(E45<$J$23,$J$24,IF(E45<$K$23,$K$24,IF(E45<$L$23,$L$24,$M$24)))","v":33.624407288629882},{"$f":"IF(F45<$J$23,$J$24,IF(F45<$K$23,$K$24,IF(F45<$L$23,$L$24,$M$24)))","v":33.624407288629882},{"$f":"IF(G45<$J$23,$J$24,IF(G45<$K$23,$K$24,IF(G45<$L$23,$L$24,$M$24)))","v":33.624407288629882},{"$f":"IF(H45<$J$23,$J$24,IF(H45<$K$23,$K$24,IF(H45<$L$23,$L$24,$M$24)))","v":33.624407288629875},33.624407288629875,{"$f":"IF(J45<$J$23,$J$24,IF(J45<$K$23,$K$24,IF(J45<$L$23,$L$24,$M$24)))","v":33.624407288629875},{"$f":"IF(K45<$J$23,$J$24,IF(K45<$K$23,$K$24,IF(K45<$L$23,$L$24,$M$24)))","v":33.624407288629875},{"$f":"IF(L45<$J$23,$J$24,IF(L45<$K$23,$K$24,IF(L45<$L$23,$L$24,$M$24)))","v":33.624407288629875},33.624407288629875,33.624407288629875,33.624407288629875,33.624407288629875,29.108067417784767,29.108067417784767,{"$f":"IF(S45<$J$23,$J$24,IF(S45<$K$23,$K$24,IF(S45<$L$23,$L$24,$M$24)))","v":29.108067417784767},29.108067417784767,29.108067417784767,29.108067417784767,29.108067417784767,29.108067417784767]
[null,null,null,"m",{"$f":"IF(E45<$J$23,$J$25,IF(E45<$K$23,$K$25,IF(E45<$L$23,$L$25,$M$25)))","v":-1.252751147688778},{"$f":"IF(F45<$J$23,$J$25,IF(F45<$K$23,$K$25,IF(F45<$L$23,$L$25,$M$25)))","v":-1.252751147688778},{"$f":"IF(G45<$J$23,$J$25,IF(G45<$K$23,$K$25,IF(G45<$L$23,$L$25,$M$25)))","v":-1.252751147688778},{"$f":"IF(H45<$J$23,$J$25,IF(H45<$K$23,$K$25,IF(H45<$L$23,$L$25,$M$25)))","v":-0.44819464914477142},-0.44819464914477142,-0.44819464914477142,{"$f":"IF(K45<$J$23,$J$25,IF(K45<$K$23,$K$25,IF(K45<$L$23,$L$25,$M$25)))","v":-0.44819464914477142},{"$f":"IF(L45<$J$23,$J$25,IF(L45<$K$23,$K$25,IF(L45<$L$23,$L$25,$M$25)))","v":-0.44819464914477142},-0.44819464914477142,-0.44819464914477142,-0.44819464914477142,-0.44819464914477142,-0.38555338368458214,-0.38555338368458214,{"$f":"IF(S45<$J$23,$J$25,IF(S45<$K$23,$K$25,IF(S45<$L$23,$L$25,$M$25)))","v":-0.38555338368458214},-0.38555338368458214,-0.38555338368458214,-0.38555338368458214,-0.38555338368458214,-0.38555338368458214]
[]
[null,null,null,"Available SOA (W)",{"$f":"E47*E45^E48*VINMAX","v":924.92353483141517},682.74378842585486,503.98221475912686,432.73066447513759,388.19884720872307,{"$f":"J47*J45^J48*VINMAX","v":348.25293092985407},312.42105634464212,280.27994789235163,251.44990627534435,225.59031292448594,202.39559266177775,181.59158638744395,163.59329859725779,149.03048366348852,135.77007882890405,123.69569793851159,112.70114135095037,102.68946233108176,{"$f":"W47*W45^W48*VINMAX","v":93.572141401761741},85.268369783532592]
[null,null,null,"Derated for Temp",{"$f":"E50*($J$18-$E$19)/($J$18 - 25)","v":480.9602381123359},{"$f":"F50*($J$18-$E$19)/($J$18 - 25)","v":355.02676998144455},262.07075167474596,225.01994552707154,201.86340054853599,181.09152408352412,162.45894929921391,145.74557290402285,130.75395126317906,117.30696272073268,105.24570818412444,94.427624921470851,85.068515270574053,77.495851505014031,70.600440991030098,64.321762928026018,58.60459350249419,53.398520412162512,48.657513528916105,44.339552287436952]
[null,null,null,"SOA Margin",{"$f":"E51/E44","v":0.94901388735662162},{"$f":"F51/F44","v":0.89131261036431297},{"$f":"G51/G44","v":0.83678548164475519},{"$f":"H51/H44","v":0.91330560154926288},1.040792731395459,1.1850910330171169,{"$f":"K51/K44","v":1.3479792671250619},{"$f":"L51/L44","v":1.5312267450865464},{"$f":"M51/M44","v":1.736489274865876},1.9651570236437828,{"$f":"O51/O44","v":2.2181420535273482},{"$f":"P51/P44","v":2.4955952047206806},{"$f":"Q51/Q44","v":2.8078941166517035},3.178936778824867,{"$f":"S51/S44","v":3.5776977044869285},{"$f":"T51/T44","v":3.9979414652447303},4.4301915369293043,{"$f":"V51/V44","v":4.8615553267272302},{"$f":"W51/W44","v":5.2760451526203749},{"$f":"X51/X44","v":5.6555551387036926}]
[]
[null,null,null,"Pass? ",{"$f":"IF(E52>$E$20, \"Y\", \"N\")","v":"N"},{"$f":"IF(F52>$E$20, \"Y\", \"N\")","v":"N"},"N","N","N","N","N","Y","Y","Y","Y","Y","Y","Y","Y","Y","Y","Y","Y","Y","N"]
[null,null,null,"first yes",{"$f":"IF(E54=\"Y\", 1, 0)","v":0},{"$f":"IF(AND(F54=\"Y\", E54=\"N\"),  1, 0)","v":0},{"$f":"IF(AND(G54=\"Y\", F54=\"N\"),  1, 0)","v":0},0,0,0,0,1,0,0,0,0,0,0,0,0,0,0,0,0]
[null,null,null,"2nd yes",0,{"$f":"IF(AND(F54=\"Y\", G54=\"N\"),  1, 0)","v":0},{"$f":"IF(AND(G54=\"Y\", H54=\"N\"),  1, 0)","v":0},0,0,0,0,0,0,0,0,0,0,0,0,0,0,0,0,1]
[]
[null,null,null,"Mult 1",{"$f":"E55*E35","v":0},{"$f":"F55*F35","v":0},0,0,0,0,0,2.1995768529989235,0,0,0,0,0,0,0,0,0,0,0,0]
[null,null,null,"mult2",{"$f":"E35*E56","v":0},{"$f":"F35*F56","v":0},0,0,0,0,0,0,0,0,0,0,0,0,0,0,0,0,0,0.12]
[]
[]
[null,null,null,"FET 2"]
[null,null,null,"Copied Inputs",null,null,null,null,"Maximum Junction Temperature",{"$f":"'Design Calculator'!G56","v":175},"°C"]
[null,null,null,"Temp_start_up",{"$f":"SOA!H76","v":85}]
[null,null,null,"SOA margin target",1.5,null,null,null,"SOA Coefficients"]
[null,null,null,"Cap Energy (J)",{"$f":"1/2*COUTMAX*VINMAX^2*0.000001","v":0.29399999999999998},null,null,null,null,"0.01 to 0.1 ms","0.1 to 1ms","1 to 10 ms","10 to 100 ms"]
[null,null,null,"E_load (t_worksheet)  (J)",{"$f":"MAX(Equations!G71-E66,0)","v":0.17915625000000018},null,null,null,"t1",0.01,0.1,1,10]
[null,null,null,"t_worksheet (ms)",{"$f":"Equations!G70","v":131.25},null,null,null,"t2",0.1,1,10,100]
[null,null,null,null,null,null,null,null,"a",{"$f":"SOA!C84","v":979.95587204263938},{"$f":"SOA!D84","v":50.75455872251073},{"$f":"SOA!E84","v":50.754558722510708},{"$f":"SOA!F84","v":52.605768852204278}]
[null,null,null,"Load Turn-On Threshold",{"$f":"'Design Calculator'!F27","v":0},null,null,null,"m",{"$f":"SOA!C85","v":0.19457326414151749},{"$f":"SOA!D85","v":-1.0911581992464914},{"$f":"SOA!E85","v":-0.47119014242394203},{"$f":"SOA!F85","v":-0.48674845855434495}]
[null,null,null,"Startup Load Type",{"$f":"'Design Calculator'!F28","v":"Constant Current"}]
[null,null,null,"Startup Load Value",{"$f":"'Design Calculator'!F29","v":0.2},null,null,null,"Initial","Final"]
[null,null,null,null,null,null,"max slew rate ",null,{"$f":"SUM(E103:X103)","v":17.799516286286103},{"$f":"IF(I73=0, \"NA\", I73/AVERAGE(1, E77))","v":19.946117777149563}]
[null,null,null,"Upper bound Slew Rate (4ms start-up) (V/ms)",{"$f":"12/1","v":12},null,"min slew rate",null,{"$f":"SUM(E104:X104)","v":0.12},{"$f":"IF(I74=0, \"NA\", I74*AVERAGE(1,E77))","v":0.10708559822108767}]
[null,null,null,"Min Slew Rate (400 ms start - up) (V/ms)",0.12]
[null,null,null,"# of points",20]
[null,null,null,"mult per point",{"$f":"(E75/E74)^(1/(E76-1))","v":0.78475997035146128}]
[]
[null,null,null,null,1,2,3,4,5,6,7,8,9,10,11,12,13,14,15,16,17,18,19,20]
[null,null,null,"slew rate (V/ms)",{"$f":"E74","v":12},{"$f":"E80*$E$32","v":9.4171196442175358},{"$f":"F80*$E$32","v":7.3901785327923166},{"$f":"G80*$E$32","v":5.7995162862861038},{"$f":"H80*$E$32","v":4.5512282288787},{"$f":"I80*$E$32","v":3.5716217299575823},{"$f":"J80*$E$32","v":2.802865762908147},{"$f":"K80*$E$32","v":2.1995768529989235},{"$f":"L80*$E$32","v":1.7261398659451956},{"$f":"M80*$E$32","v":1.354605470021627},{"$f":"N80*$E$32","v":1.0630401484920993},{"$f":"O80*$E$32","v":0.83423135541307281},{"$f":"P80*$E$32","v":0.65467137374022233},{"$f":"Q80*$E$32","v":0.51375988784632731},{"$f":"R80*$E$32","v":0.40317819435405389},{"$f":"S80*$E$32","v":0.316398107847643},{"$f":"T80*$E$32","v":0.24829656973377476},{"$f":"U80*$E$32","v":0.19485320870264661},{"$f":"V80*$E$32","v":0.15291299828437604},{"$f":"W80*$E$32","v":0.12}]
[null,null,null,"t_start (ms)",{"$f":"VINMAX/E80","v":1.1666666666666667},1.4866541499869894,1.8944061957201754,2.4139944279672547,3.0760927151854176,3.9197880006644121,4.9948877985059594,6.3648605780299379,8.11058262207154,10.335112554784295,13.169775402988037,16.781915363356063,21.384774959711752,27.250083806051425,34.724100152365374,44.248052225209577,56.384186116670456,71.848957957703078,91.555329874337147,116.66666666666667]
[null,null,null,"I_cap (A)",{"$f":"E80*COUTMAX/1000","v":36},28.251358932652607,22.170535598376951,17.398548858858309,13.653684686636099,10.714865189872748,8.4085972887244402,6.5987305589967704,5.1784195978355863,4.0638164100648808,3.189120445476298,2.5026940662392185,1.964014121220667,1.541279663538982,1.2095345830621616,0.94919432354292899,0.74488970920132436,0.58455962610793988,0.45873899485312813,0.36]
[null,null,null,"Total FET Energy (J)",{"$f":"$E$66+$E$67*E81/$E$68","v":0.29559249999999998},{"$f":"$E$66+$E$67*F81/$E$68","v":0.29602928291473224},0.29658586445715801,0.29729510239417528,0.29819886655622807,0.2993505106209069,0.30081802184496065,0.30268803468901084,0.30507094527912765,0.30810742863728058,0.3119767434250787,0.31690731447098103,0.32319021782000656,0.33119636439526023,0.34139839670797878,0.35439859128741114,0.37096441404925523,0.39207382761226478,0.4189730252784703,0.45325000000000015]
[null,null,null,"Power (Vout= 0) , (W)",{"$f":"(E82+IF($E$71=\"Resistive\",0,IF($E$70=0,$E$72,0)))*VINMAX","v":506.80000000000007},398.31902505713651,313.18749837727728,246.37968402401631,193.95158561290538,152.80811265821848,120.52036204214215,95.182227825954783,75.297874369698206,59.693429740908336,47.447686236668176,37.837716927349064,30.29619769708934,24.377915289545747,19.733484162870262,16.088720529601005,13.228455928818542,10.983834765511158,9.2223459279437936,7.8400000000000007]
[null,null,null,"Power (load on), (W)",{"$f":"(E82+IF($E$71=\"Resistive\", $E$70/$E$72,$E$72)) *(VINMAX-$E$70)","v":506.80000000000007},398.31902505713651,313.18749837727728,246.37968402401631,193.95158561290538,152.80811265821848,120.52036204214215,95.182227825954783,75.297874369698206,59.693429740908336,47.447686236668176,37.837716927349064,30.29619769708934,24.377915289545747,19.733484162870262,16.088720529601005,13.228455928818542,10.983834765511158,9.2223459279437936,7.8400000000000007]
[null,null,null,"Vout (dP/dVout = 0) (V)",{"$f":"IF($E$71=\"Resistive\", -$E$72*E82/2 + VINMAX/2, -1)","v":-1},-1,-1,-1,-1,-1,-1,-1,-1,-1,-1,-1,-1,-1,-1,-1,-1,-1,-1,-1]
[null,null,null,"Power (@ Vout above, if applicable) ",{"$f":"IF(AND(E86<VINMAX, E86>$E$70), (VINMAX-E86)*(E82+E86/$E$72), 0)","v":0},0,0,0,0,0,0,0,0,0,0,0,0,0,0,0,0,0,0,0]
[]
[null,null,null,"max power (W)",{"$f":"MAX(E84,E85,E87)","v":506.80000000000007},{"$f":"MAX(F84,F85,F87)","v":398.31902505713651},{"$f":"MAX(G84,G85,G87)","v":313.18749837727728},{"$f":"MAX(H84,H85,H87)","v":246.37968402401631},193.95158561290538,152.80811265821848,{"$f":"MAX(K84,K85,K87)","v":120.52036204214215},{"$f":"MAX(L84,L85,L87)","v":95.182227825954783},75.297874369698206,59.693429740908336,47.447686236668176,37.837716927349064,30.29619769708934,24.377915289545747,19.733484162870262,16.088720529601005,13.228455928818542,10.983834765511158,9.2223459279437936,7.8400000000000007]
[null,null,null,"Equivalent time for SOA (ms)",{"$f":"E83/E89*1000","v":0.58325276243093915},{"$f":"F83/F89*1000","v":0.74319644378590399},{"$f":"G83/G89*1000","v":0.94699139012209121},{"$f":"H83/H89*1000","v":1.2066542887732412},1.5374912538811756,1.9589961908007829,{"$f":"K83/K89*1000","v":2.4959933470808369},{"$f":"L83/L89*1000","v":3.1800898298208597},4.0515213454935992,5.1614964992727224,6.5751729572005786,8.3754343603622861,10.667682494396203,13.585918256812175,17.300462193612034,22.027767256903186,28.042911133800537,35.695532205506431,45.430200574994501,57.812500000000014]
[]
[null,null,null,"a",{"$f":"IF(E90<$J$68,$J$69,IF(E90<$K$68,$K$69,IF(E90<$L$68,$L$69,$M$69)))","v":50.75455872251073},{"$f":"IF(F90<$J$68,$J$69,IF(F90<$K$68,$K$69,IF(F90<$L$68,$L$69,$M$69)))","v":50.75455872251073},50.75455872251073,50.754558722510708,50.754558722510708,50.754558722510708,50.754558722510708,50.754558722510708,50.754558722510708,50.754558722510708,50.754558722510708,50.754558722510708,52.605768852204278,52.605768852204278,52.605768852204278,52.605768852204278,52.605768852204278,52.605768852204278,52.605768852204278,52.605768852204278]
[null,null,null,"m",{"$f":"IF(E90<$J$68,$J$70,IF(E90<$K$68,$K$70,IF(E90<$L$68,$L$70,$M$70)))","v":-1.0911581992464914},{"$f":"IF(F90<$J$68,$J$70,IF(F90<$K$68,$K$70,IF(F90<$L$68,$L$70,$M$70)))","v":-1.0911581992464914},-1.0911581992464914,-0.47119014242394203,-0.47119014242394203,-0.47119014242394203,-0.47119014242394203,-0.47119014242394203,-0.47119014242394203,-0.47119014242394203,-0.47119014242394203,-0.47119014242394203,-0.48674845855434495,-0.48674845855434495,-0.48674845855434495,-0.48674845855434495,-0.48674845855434495,-0.48674845855434495,-0.48674845855434495,-0.48674845855434495]
[]
[null,null,null,"Available SOA (W)",{"$f":"E92*E90^E93*VINMAX","v":1279.6475207215485},982.31195746380286,754.07286762462616,650.37232416825964,580.20145141132753,{"$f":"J92*J90^J93*VINMAX","v":517.6065248364157},{"$f":"K92*K90^K93*VINMAX","v":461.77020428422787},411.96337282908593,367.53560528406302,327.90666027491233,292.55888400877348,261.03042604624068,232.67508473120938,206.83883606987047,183.88179229001076,163.48299954339586,145.35693201192706,129.24953943701954,{"$f":"W92*W90^W93*VINMAX","v":114.93477561295525},{"$f":"X92*X90^X93*VINMAX","v":102.21156482434158}]
[null,null,null,"Derated for Temp",{"$f":"E95*($J$63-$E$64)/($J$63 - 25)","v":767.78851243292911},{"$f":"F95*($J$63-$E$64)/($J$63 - 25)","v":589.38717447828174},452.44372057477563,390.22339450095575,348.12087084679649,310.56391490184944,277.06212257053676,247.17802369745158,220.52136317043784,196.74399616494739,175.53533040526409,156.61825562774442,139.60505083872565,124.10330164192227,110.32907537400645,98.089799726037512,87.214159207156243,77.549723662211733,68.960865367773152,61.32693889460495]
[null,null,null,"SOA Margin",{"$f":"E96/E89","v":1.5149733868053059},{"$f":"F96/F89","v":1.4796862248639457},{"$f":"G96/G89","v":1.4446417015973771},{"$f":"H96/H89","v":1.5838294299578612},1.7948854078542413,2.0323784483647072,{"$f":"K96/K89","v":2.2988822625147516},{"$f":"L96/L89","v":2.5968926063532396},2.9286532324633758,3.295907054074283,3.6995551169702381,4.1392099826863733,4.6080056723467306,5.0908086342864136,5.5909577073873882,6.096805494605114,6.5929205703560525,7.0603505349256572,7.4775838931416674,7.822313634515937]
[]
[null,null,null,"Pass? ",{"$f":"IF(E97>$E$20, \"Y\", \"N\")","v":"Y"},{"$f":"IF(F97>$E$20, \"Y\", \"N\")","v":"N"},"N","Y","Y","Y","Y","Y","Y","Y","Y","Y","Y","Y","Y","Y","Y","Y","Y","Y","N"]
[null,null,null,"first yes",{"$f":"IF(E99=\"Y\", 1, 0)","v":1},{"$f":"IF(AND(F99=\"Y\", E99=\"N\"),  1, 0)","v":0},{"$f":"IF(AND(G99=\"Y\", F99=\"N\"),  1, 0)","v":0},{"$f":"IF(AND(H99=\"Y\", G99=\"N\"),  1, 0)","v":1},{"$f":"IF(AND(I99=\"Y\", H99=\"N\"),  1, 0)","v":0},{"$f":"IF(AND(J99=\"Y\", I99=\"N\"),  1, 0)","v":0},{"$f":"IF(AND(K99=\"Y\", J99=\"N\"),  1, 0)","v":0},{"$f":"IF(AND(L99=\"Y\", K99=\"N\"),  1, 0)","v":0},{"$f":"IF(AND(M99=\"Y\", L99=\"N\"),  1, 0)","v":0},{"$f":"IF(AND(N99=\"Y\", M99=\"N\"),  1, 0)","v":0},{"$f":"IF(AND(O99=\"Y\", N99=\"N\"),  1, 0)","v":0},{"$f":"IF(AND(P99=\"Y\", O99=\"N\"),  1, 0)","v":0},{"$f":"IF(AND(Q99=\"Y\", P99=\"N\"),  1, 0)","v":0},{"$f":"IF(AND(R99=\"Y\", Q99=\"N\"),  1, 0)","v":0},{"$f":"IF(AND(S99=\"Y\", R99=\"N\"),  1, 0)","v":0},{"$f":"IF(AND(T99=\"Y\", S99=\"N\"),  1, 0)","v":0},{"$f":"IF(AND(U99=\"Y\", T99=\"N\"),  1, 0)","v":0},{"$f":"IF(AND(V99=\"Y\", U99=\"N\"),  1, 0)","v":0},{"$f":"IF(AND(W99=\"Y\", V99=\"N\"),  1, 0)","v":0},{"$f":"IF(AND(X99=\"Y\", W99=\"N\"),  1, 0)","v":0}]
[null,null,null,"2nd yes",0,{"$f":"IF(AND(F99=\"Y\", G99=\"N\"),  1, 0)","v":0},{"$f":"IF(AND(G99=\"Y\", H99=\"N\"),  1, 0)","v":0},{"$f":"IF(AND(H99=\"Y\", I99=\"N\"),  1, 0)","v":0},{"$f":"IF(AND(I99=\"Y\", J99=\"N\"),  1, 0)","v":0},{"$f":"IF(AND(J99=\"Y\", K99=\"N\"),  1, 0)","v":0},{"$f":"IF(AND(K99=\"Y\", L99=\"N\"),  1, 0)","v":0},{"$f":"IF(AND(L99=\"Y\", M99=\"N\"),  1, 0)","v":0},{"$f":"IF(AND(M99=\"Y\", N99=\"N\"),  1, 0)","v":0},{"$f":"IF(AND(N99=\"Y\", O99=\"N\"),  1, 0)","v":0},{"$f":"IF(AND(O99=\"Y\", P99=\"N\"),  1, 0)","v":0},{"$f":"IF(AND(P99=\"Y\", Q99=\"N\"),  1, 0)","v":0},{"$f":"IF(AND(Q99=\"Y\", R99=\"N\"),  1, 0)","v":0},{"$f":"IF(AND(R99=\"Y\", S99=\"N\"),  1, 0)","v":0},{"$f":"IF(AND(S99=\"Y\", T99=\"N\"),  1, 0)","v":0},{"$f":"IF(AND(T99=\"Y\", U99=\"N\"),  1, 0)","v":0},{"$f":"IF(AND(U99=\"Y\", V99=\"N\"),  1, 0)","v":0},{"$f":"IF(AND(V99=\"Y\", W99=\"N\"),  1, 0)","v":0},{"$f":"IF(AND(W99=\"Y\", X99=\"N\"),  1, 0)","v":0},{"$f":"IF(AND(X99=\"Y\", Y99=\"N\"),  1, 0)","v":1}]
[]
[null,null,null,"Mult 1",{"$f":"E100*E80","v":12},{"$f":"F100*F80","v":0},0,5.7995162862861038,0,0,0,0,0,0,0,0,0,0,0,0,0,0,0,0]
[null,null,null,"mult2",{"$f":"E80*E101","v":0},{"$f":"F80*F101","v":0},0,0,0,0,0,0,0,0,0,0,0,0,0,0,0,0,0,0.12]
[]
[]
[null,null,null,"FET 3"]
[null,null,null,"Copied Inputs",null,null,null,null,"Maximum Junction Temperature",{"$f":"'Design Calculator'!H56","v":175},"°C"]
[null,null,null,"Temp_start_up",{"$f":"SOA!H124","v":85}]
[null,null,null,"SOA margin target",1.5,null,null,null,"SOA Coefficients"]
[null,null,null,"Cap Energy (J)",{"$f":"1/2*COUTMAX*VINMAX^2*0.000001","v":0.29399999999999998},null,null,null,null,"0.01 to 0.1 ms","0.1 to 1ms","1 to 10 ms","10 to 100 ms"]
[null,null,null,"E_load (t_worksheet)  (J)",{"$f":"MAX(Equations!H71-E111,0)","v":0.17915625000000018},null,null,null,"t1",0.01,0.1,1,10]
[null,null,null,"t_worksheet (ms)",{"$f":"Equations!H70","v":131.25},null,null,null,"t2",0.1,1,10,100]
[null,null,null,null,null,null,null,null,"a",{"$f":"SOA!C132","v":25},{"$f":"SOA!D132","v":10},{"$f":"SOA!E132","v":10},{"$f":"SOA!F132","v":40.000000000000014}]
[null,null,null,"Load Turn-On Threshold",{"$f":"'Design Calculator'!F27","v":0},null,null,null,"m",{"$f":"SOA!C133","v":-0.6020599913279624},{"$f":"SOA!D133","v":-1},{"$f":"SOA!E133","v":-0.69897000433601886},{"$f":"SOA!F133","v":-1.3010299956639813}]
[null,null,null,"Startup Load Type",{"$f":"'Design Calculator'!F28","v":"Constant Current"}]
[null,null,null,"Startup Load Value",{"$f":"'Design Calculator'!F29","v":0.2},null,null,null,"Initial","Final"]
[null,null,null,null,null,null,"max slew rate ",null,{"$f":"SUM(E148:X148)","v":0},{"$f":"IF(I118=0, \"NA\", I118/AVERAGE(1, E122))","v":"NA"}]
[null,null,null,"Upper bound Slew Rate (4ms start-up) (V/ms)",{"$f":"12/1","v":12},null,"min slew rate",null,{"$f":"SUM(E149:X149)","v":0},{"$f":"IF(I119=0, \"NA\", I119*AVERAGE(1,E122))","v":"NA"}]
[null,null,null,"Min Slew Rate (400 ms start - up) (V/ms)",0.12]
[null,null,null,"# of points",20]
[null,null,null,"mult per point",{"$f":"(E120/E119)^(1/(E121-1))","v":0.78475997035146128}]
[]
[null,null,null,null,1,2,3,4,5,6,7,8,9,10,11,12,13,14,15,16,17,18,19,20]
[null,null,null,"slew rate (V/ms)",{"$f":"E119","v":12},{"$f":"E125*$E$32","v":9.4171196442175358},{"$f":"F125*$E$32","v":7.3901785327923166},{"$f":"G125*$E$32","v":5.7995162862861038},{"$f":"H125*$E$32","v":4.5512282288787},{"$f":"I125*$E$32","v":3.5716217299575823},{"$f":"J125*$E$32","v":2.802865762908147},{"$f":"K125*$E$32","v":2.1995768529989235},{"$f":"L125*$E$32","v":1.7261398659451956},{"$f":"M125*$E$32","v":1.354605470021627},{"$f":"N125*$E$32","v":1.0630401484920993},{"$f":"O125*$E$32","v":0.83423135541307281},{"$f":"P125*$E$32","v":0.65467137374022233},{"$f":"Q125*$E$32","v":0.51375988784632731},{"$f":"R125*$E$32","v":0.40317819435405389},{"$f":"S125*$E$32","v":0.316398107847643},{"$f":"T125*$E$32","v":0.24829656973377476},{"$f":"U125*$E$32","v":0.19485320870264661},{"$f":"V125*$E$32","v":0.15291299828437604},{"$f":"W125*$E$32","v":0.12}]
[null,null,null,"t_start (ms)",{"$f":"VINMAX/E125","v":1.1666666666666667},1.4866541499869894,1.8944061957201754,2.4139944279672547,3.0760927151854176,3.9197880006644121,4.9948877985059594,6.3648605780299379,8.11058262207154,10.335112554784295,13.169775402988037,16.781915363356063,21.384774959711752,27.250083806051425,34.724100152365374,44.248052225209577,56.384186116670456,71.848957957703078,91.555329874337147,116.66666666666667]
[null,null,null,"I_cap (A)",{"$f":"E125*COUTMAX/1000","v":36},28.251358932652607,22.170535598376951,17.398548858858309,13.653684686636099,10.714865189872748,8.4085972887244402,6.5987305589967704,5.1784195978355863,4.0638164100648808,3.189120445476298,2.5026940662392185,1.964014121220667,1.541279663538982,1.2095345830621616,0.94919432354292899,0.74488970920132436,0.58455962610793988,0.45873899485312813,0.36]
[null,null,null,"Total FET Energy (J)",{"$f":"$E$111+$E$112*E126/$E$113","v":0.29559249999999998},{"$f":"$E$111+$E$112*F126/$E$113","v":0.29602928291473224},0.29658586445715801,0.29729510239417528,0.29819886655622807,0.2993505106209069,0.30081802184496065,0.30268803468901084,0.30507094527912765,0.30810742863728058,0.3119767434250787,0.31690731447098103,0.32319021782000656,0.33119636439526023,0.34139839670797878,0.35439859128741114,0.37096441404925523,0.39207382761226478,0.4189730252784703,0.45325000000000015]
[null,null,null,"Power (Vout= 0) , (W)",{"$f":"(E127+IF($E$116=\"Resistive\",0,IF($E$115=0,$E$117,0)))*VINMAX","v":506.80000000000007},398.31902505713651,313.18749837727728,246.37968402401631,193.95158561290538,152.80811265821848,120.52036204214215,95.182227825954783,75.297874369698206,59.693429740908336,47.447686236668176,37.837716927349064,30.29619769708934,24.377915289545747,19.733484162870262,16.088720529601005,13.228455928818542,10.983834765511158,9.2223459279437936,7.8400000000000007]
[null,null,null,"Power (load on), (W)",{"$f":"(E127+IF($E$116=\"Resistive\", $E$115/$E$117,$E$117)) *(VINMAX-$E$115)","v":506.80000000000007},398.31902505713651,313.18749837727728,246.37968402401631,193.95158561290538,152.80811265821848,120.52036204214215,95.182227825954783,75.297874369698206,59.693429740908336,47.447686236668176,37.837716927349064,30.29619769708934,24.377915289545747,19.733484162870262,16.088720529601005,13.228455928818542,10.983834765511158,9.2223459279437936,7.8400000000000007]
[null,null,null,"Vout (dP/dVout = 0) (V)",{"$f":"IF($E$116=\"Resistive\", -$E$117*E127/2 + VINMAX/2, -1)","v":-1},-1,-1,-1,-1,-1,-1,-1,-1,-1,-1,-1,-1,-1,-1,-1,-1,-1,-1,-1]
[null,null,null,"Power (@ Vout above, if applicable) ",{"$f":"IF(AND(E131<VINMAX, E131>$E$115), (VINMAX-E131)*(E127+E131/$E$117), 0)","v":0},0,0,0,0,0,0,0,0,0,0,0,0,0,0,0,0,0,0,0]
[]
[null,null,null,"max power (W)",{"$f":"MAX(E129,E130,E132)","v":506.80000000000007},{"$f":"MAX(F129,F130,F132)","v":398.31902505713651},{"$f":"MAX(G129,G130,G132)","v":313.18749837727728},{"$f":"MAX(H129,H130,H132)","v":246.37968402401631},193.95158561290538,152.80811265821848,{"$f":"MAX(K129,K130,K132)","v":120.52036204214215},{"$f":"MAX(L129,L130,L132)","v":95.182227825954783},75.297874369698206,59.693429740908336,47.447686236668176,37.837716927349064,30.29619769708934,24.377915289545747,19.733484162870262,16.088720529601005,13.228455928818542,10.983834765511158,9.2223459279437936,7.8400000000000007]
[null,null,null,"Equivalent time for SOA (ms)",{"$f":"E128/E134*1000","v":0.58325276243093915},{"$f":"F128/F134*1000","v":0.74319644378590399},{"$f":"G128/G134*1000","v":0.94699139012209121},{"$f":"H128/H134*1000","v":1.2066542887732412},1.5374912538811756,1.9589961908007829,{"$f":"K128/K134*1000","v":2.4959933470808369},{"$f":"L128/L134*1000","v":3.1800898298208597},4.0515213454935992,5.1614964992727224,6.5751729572005786,8.3754343603622861,10.667682494396203,13.585918256812175,17.300462193612034,22.027767256903186,28.042911133800537,35.695532205506431,45.430200574994501,57.812500000000014]
[]
[null,null,null,"a",{"$f":"IF(E135<$J$113,$J$114,IF(E135<$K$113,$K$114,IF(E135<$L$113,$L$114,$M$114)))","v":10},{"$f":"IF(F135<$J$113,$J$114,IF(F135<$K$113,$K$114,IF(F135<$L$113,$L$114,$M$114)))","v":10},10,10,10,10,10,10,10,10,10,10,40.000000000000014,40.000000000000014,40.000000000000014,40.000000000000014,40.000000000000014,40.000000000000014,40.000000000000014,40.000000000000014]
[null,null,null,"m",{"$f":"IF(E135<$J$113,$J$115,IF(E135<$K$113,$K$115,IF(E135<$L$113,$L$115,$M$115)))","v":-1},{"$f":"IF(F135<$J$113,$J$115,IF(F135<$K$113,$K$115,IF(F135<$L$113,$L$115,$M$115)))","v":-1},-1,-0.69897000433601886,-0.69897000433601886,-0.69897000433601886,-0.69897000433601886,-0.69897000433601886,-0.69897000433601886,-0.69897000433601886,-0.69897000433601886,-0.69897000433601886,-1.3010299956639813,-1.3010299956639813,-1.3010299956639813,-1.3010299956639813,-1.3010299956639813,-1.3010299956639813,-1.3010299956639813,-1.3010299956639813]
[]
[null,null,null,"Available SOA (W)",{"$f":"E137*E135^E138*VINMAX","v":240.03315375051807},188.37549771743852,147.8366133634546,122.77333781664458,103.64577281948431,{"$f":"J137*J135^J138*VINMAX","v":87.499448344056759},{"$f":"K137*K135^K138*VINMAX","v":73.869778755344541},62.364576069631056,52.652765628442033,44.454859860001193,37.534916118037145,31.693747358585576,25.741746774017965,18.793395519404594,13.722644589684114,10.021740438092092,7.3202641211474573,5.3479928938437009,{"$f":"W137*W135^W138*VINMAX","v":3.9078053100631838},{"$f":"X137*X135^X138*VINMAX","v":2.8559123673372651}]
[null,null,null,"Derated for Temp",{"$f":"E140*($J$108-$E$109)/($J$108 - 25)","v":144.01989225031085},{"$f":"F140*($J$108-$E$109)/($J$108 - 25)","v":113.02529863046313},88.701968018072762,73.664002689986745,62.187463691690589,52.499669006434054,44.321867253206726,37.418745641778635,31.59165937706522,26.672915916000719,22.520949670822286,19.016248415151345,15.445048064410779,11.276037311642757,8.233586753810469,6.0130442628552547,4.3921584726884744,3.2087957363062203,2.3446831860379103,1.7135474204023593]
[null,null,null,"SOA Margin",{"$f":"E141/E134","v":0.28417500444023447},{"$f":"F141/F134","v":0.28375571218133583},{"$f":"G141/G134","v":0.28322320807077389},{"$f":"H141/H134","v":0.2989857016084419},0.32063395354656327,0.34356598019019158,{"$f":"K141/K134","v":0.36775418279700134},{"$f":"L141/L134","v":0.3931274408726867},0.41955579279643668,0.44683168703442044,0.47464800619545933,0.50257388551385929,0.50980153413425333,0.46255133704884049,0.41723938286085627,0.37374284995454365,0.33202351781057382,0.29213801962696329,0.25423934477815441,0.21856472199009683]
[]
[null,null,null,"Pass? ",{"$f":"IF(E142>$E$20, \"Y\", \"N\")","v":"N"},{"$f":"IF(F142>$E$20, \"Y\", \"N\")","v":"N"},"N","N","N","N","N","N","N","N","N","N","N","N","N","N","N","N","N","N","N"]
[null,null,null,"first yes",{"$f":"IF(E144=\"Y\", 1, 0)","v":0},{"$f":"IF(AND(F144=\"Y\", E144=\"N\"),  1, 0)","v":0},{"$f":"IF(AND(G144=\"Y\", F144=\"N\"),  1, 0)","v":0},{"$f":"IF(AND(H144=\"Y\", G144=\"N\"),  1, 0)","v":0},{"$f":"IF(AND(I144=\"Y\", H144=\"N\"),  1, 0)","v":0},{"$f":"IF(AND(J144=\"Y\", I144=\"N\"),  1, 0)","v":0},{"$f":"IF(AND(K144=\"Y\", J144=\"N\"),  1, 0)","v":0},{"$f":"IF(AND(L144=\"Y\", K144=\"N\"),  1, 0)","v":0},{"$f":"IF(AND(M144=\"Y\", L144=\"N\"),  1, 0)","v":0},{"$f":"IF(AND(N144=\"Y\", M144=\"N\"),  1, 0)","v":0},{"$f":"IF(AND(O144=\"Y\", N144=\"N\"),  1, 0)","v":0},{"$f":"IF(AND(P144=\"Y\", O144=\"N\"),  1, 0)","v":0},{"$f":"IF(AND(Q144=\"Y\", P144=\"N\"),  1, 0)","v":0},{"$f":"IF(AND(R144=\"Y\", Q144=\"N\"),  1, 0)","v":0},{"$f":"IF(AND(S144=\"Y\", R144=\"N\"),  1, 0)","v":0},{"$f":"IF(AND(T144=\"Y\", S144=\"N\"),  1, 0)","v":0},{"$f":"IF(AND(U144=\"Y\", T144=\"N\"),  1, 0)","v":0},{"$f":"IF(AND(V144=\"Y\", U144=\"N\"),  1, 0)","v":0},{"$f":"IF(AND(W144=\"Y\", V144=\"N\"),  1, 0)","v":0},{"$f":"IF(AND(X144=\"Y\", W144=\"N\"),  1, 0)","v":0}]
[null,null,null,"2nd yes",0,{"$f":"IF(AND(F144=\"Y\", G144=\"N\"),  1, 0)","v":0},{"$f":"IF(AND(G144=\"Y\", H144=\"N\"),  1, 0)","v":0},{"$f":"IF(AND(H144=\"Y\", I144=\"N\"),  1, 0)","v":0},{"$f":"IF(AND(I144=\"Y\", J144=\"N\"),  1, 0)","v":0},{"$f":"IF(AND(J144=\"Y\", K144=\"N\"),  1, 0)","v":0},{"$f":"IF(AND(K144=\"Y\", L144=\"N\"),  1, 0)","v":0},{"$f":"IF(AND(L144=\"Y\", M144=\"N\"),  1, 0)","v":0},{"$f":"IF(AND(M144=\"Y\", N144=\"N\"),  1, 0)","v":0},{"$f":"IF(AND(N144=\"Y\", O144=\"N\"),  1, 0)","v":0},{"$f":"IF(AND(O144=\"Y\", P144=\"N\"),  1, 0)","v":0},{"$f":"IF(AND(P144=\"Y\", Q144=\"N\"),  1, 0)","v":0},{"$f":"IF(AND(Q144=\"Y\", R144=\"N\"),  1, 0)","v":0},{"$f":"IF(AND(R144=\"Y\", S144=\"N\"),  1, 0)","v":0},{"$f":"IF(AND(S144=\"Y\", T144=\"N\"),  1, 0)","v":0},{"$f":"IF(AND(T144=\"Y\", U144=\"N\"),  1, 0)","v":0},{"$f":"IF(AND(U144=\"Y\", V144=\"N\"),  1, 0)","v":0},{"$f":"IF(AND(V144=\"Y\", W144=\"N\"),  1, 0)","v":0},{"$f":"IF(AND(W144=\"Y\", X144=\"N\"),  1, 0)","v":0},{"$f":"IF(AND(X144=\"Y\", Y144=\"N\"),  1, 0)","v":0}]
[]
[null,null,null,"Mult 1",{"$f":"E145*E125","v":0},{"$f":"F145*F125","v":0},0,0,0,0,0,0,0,0,0,0,0,0,0,0,0,0,0,0]
[null,null,null,"mult2",{"$f":"E125*E146","v":0},{"$f":"F125*F146","v":0},0,0,0,0,0,0,0,0,0,0,0,0,0,0,0,0,0,0]