{"text_format":"1","workbook":"xlsx","n_sheets":12,"sheets":["Design Regulator","BOM & Schematic","EVM","Variable Management","Stability Calculations","Bode Plot Management","Efficiency Calculations","Efficiency Plot Management","Schematic Management","Standard Value Calculator","Snubber","Parallel Output Caps"],"not_rendered":{"charts":7,"images":27,"macros":1,"external_links":0,"defined_names":260,"comments":1,"pivot_tables":0},"unopened":[],"bounds":{"document_bytes":16777216,"sheet_cells":100000,"rows_first":2000,"rows_last":500,"rows_between":2000,"halvings":0,"cell_chars":16384,"cell_head_chars":4096},"cells_cut":0,"cells_raw":0,"read":"whole","date_system":"1900"}

{"sheet":"Design Regulator","index":0,"n_rows":103,"n_cols":17,"rows_kept":103,"cut":false,"hidden":false,"merged":[[70,5,70,7],[2,14,2,15],[0,0,0,16],[81,5,81,6],[80,7,80,8],[36,11,37,16]]}
["                        LM25141-Q1 Synchronous Buck Controller Design Tool"]
[null,null,null,null,null,null,null,null,null,null,null,null,null,null,"http://www.ti.com/product/lm5175"]
["About",null,"xx",null,null,"= Input Box",null,null,null,null,null,null,null,null,"TERMS OF USE",null,"                "]
[]
["Step 1: Operating Specifications"]
[null,null,null,"Input Voltage – Min, VIN(min) ",16,"V"]
[null,null,null,"Input Voltage – Nom, VIN(nom)",24,"V"]
[null,null,null,"Input Voltage – Max, VIN(max)",36,"V"]
[null,null,null,"Output Voltage, VOUT ",12,"V"]
[null,null,null,"Full Load Output Current, IOUT ",9,"A"]
[null,null,null,{"$f":"IF(OSC=1, \"* Tie OSC to VDDA\", \"* Tie OSC to AGND\")","v":"* Tie OSC to AGND"}]
[null,null,null,"Switching Frequency, FSW",440,"kHz"]
[null,null,null,"Frequency Set Resistor, RT ",{"$f":"'Variable Management'!C364","v":"N/A"},"kΩ"]
[null,null,null,"Ambient Temperature, TA",25,"°C"]
[]
["Step 2: Current Sense Resistor"]
[null,null,null,"Required IOCP Setpoint at VIN(nom)",12,"A"]
[null,null,null,"Recommended Sense Resistance",{"$f":"Rs_ideal*1000","v":5.7670445615615931},"mΩ"]
[null,null,null,"Sense Resistance, RS",2,"mΩ"]
[null,null,null,"Min Inductor Sat Current, ILO(SAT)",{"$f":"'Variable Management'!B95","v":37.5},"A"]
[null,null,null,"Max power loss in shunt",{"$f":"'Variable Management'!B105","v":2.7378313720945049},"W"]
[null,null,null,"VIN(min)",{"$f":"'Variable Management'!B97","v":36.997724151238948},"A"]
[null,null,"IOUT(typ) at OCP Inception:","VIN(nom)",{"$f":"'Variable Management'!B98","v":36.495071877909751},"A"]
[null,null,null,"VIN(max)",{"$f":"'Variable Management'!B99","v":36.159761028576618},"A"]
[]
["Step 3: Buck Inductance"]
[null,null,null,"Recommended Inductance",{"$f":"Lopt*1000000","v":2.2727272727272729},"µH"]
[null,null,null,"Inductance, LO ",6.8,"µH"]
[null,null,null,"Inductor DCR ",2,"mΩ"]
[null,null,null,"DIL as a % at VIN(nom)",{"$f":"'Variable Management'!B68*100","v":22.331736046450011},"%"]
[]
[]
[]
["Step 4: Output Capacitors"]
[null,null,null,"Output Voltage Ripple Spec",100,"mVpk-pk"]
[null,null,null,"Minimum Output Capacitance",{"$f":"'Variable Management'!B121","v":5.7098188755127879},"µF"]
[null,null,null,"Output Capacitance (derated), COUT ",240,"µF",null,null,null,null,null,{"$f":"CHOOSE(SCH_MODE, \"\", \"** For Single-Output Operation in 2-Phase Mode, tie MODE to VDDA and use FB1 to set VOUT **\", \"** For Single-Output Operation in 3-Phase Mode, tie both MODE pins to VDDA. Use FB1 of master IC to set VOUT. Connect FB2 of master IC to AGND. Connect FB2 of slave IC to VDDA to configure it as a slave **\", \"** For Single-Output Operation in 4-Phase Mode, tie both MODE pins to VDDA. Use FB1 of master IC to set VOUT. Connect FB2 of master IC to AGND. Connect FB2 of slave IC to VDDA to configure it as a slave **\")","v":""}]
[null,null,null,"Maximum Permitted ESR",{"$f":"'Variable Management'!B125","v":49.740719471420519},"mΩ"]
[null,null,null,"Output Capacitor ESR",1,"mΩ",null,null,null,null,null,{"$f":"CHOOSE(SCH_MODE,  \"\", \"** Tie VCCX to GND if not used **\", \"** Slave controller (CNTRL2) not shown **\",\"** Slave controller (CNTRL2) not shown **\")","v":""}]
[null,null,null,"Resulting Output Voltage Ripple (max) ",{"$f":"'Variable Management'!B127*1000","v":3.1144176102912962},"mVpk-pk",null,null,null,null,null,{"$f":"IF(OR(SCH_MODE=3, SCH_MODE=4),\"** Tie VCCX to GND if not used **\", \"\")","v":""}]
[null,null,null,"Output Capacitor RMS Current (max) ",{"$f":"'Variable Management'!B114","v":0.77378733092971508},"A (rms)"]
[]
["Step 5: Input Capacitors"]
[null,null,null,"Input Voltage Ripple Spec",500,"mVpk-pk"]
[null,null,null,"Minimum Input Capacitance",{"$f":"'Variable Management'!B145","v":10.227272727272727},"µF"]
[null,null,null,"Input Capacitance (derated), CIN ",20,"µF"]
[null,null,null,"Maximum Permitted ESR",{"$f":"'Variable Management'!B150","v":23.627904779897982},"mΩ",null,null,null,null,null,null,null,null,null,null," "]
[null,null,null,"Input Capacitor ESR",2,"mΩ"]
[null,null,null,"Resulting Input Voltage Ripple (max)",{"$f":"'Variable Management'!B155*1000","v":276.36229612466497},"mVpk-pk"]
[null,null,null,"Input Capacitor RMS Current (max)",{"$f":"'Variable Management'!B138","v":4.5186933378046188},"A (rms)"]
[]
["Step 6: Soft-start, Hiccup, Dither, Diode Emulation Mode"]
[null,null,null,"Soft-Start Time, tSS ",3,"ms"]
[null,null,null,"Soft-Start Capacitance, CSS ",{"$f":"IF(Tss>0.5/1000,Css_u*1000000000,\"N/A\")","v":56},"nF"]
[null,null,null,"Hiccup Fault Time, tRES ",20,"ms"]
[null,null,null,"RES Capacitance, CRES ",{"$f":"IF(Tres>1/1000,Cres_u*1000000000,\"N/A\")","v":330},"nF"]
[null,null,null,"Modulating Frequency",8,{"$f":"IF(DITHER=1, \"kHz\", \"\")","v":"kHz"}]
[null,null,null,{"$f":"IF(DITHER=1, \"DITH Capacitance, Cd\", \"* Tie DITH to VDDA\")","v":"DITH Capacitance, Cd"},{"$f":"IF(DITHER=1,IF(E57>0,'Standard Value Calculator'!O22*1000000000,\"N/A\"),\"\")","v":10},{"$f":"IF(DITHER=1, \"nF\", \"\")","v":"nF"}]
[null,null,null,{"$f":"IF(DEMB=1, \"* Tie DEMB to VDDA\", \"* Tie DEMB to AGND\")","v":"* Tie DEMB to VDDA"}]
[]
[]
["Step 7: Compensation Design"]
[null,null,null,"Load Pole Frequency",{"$f":"Fp_dominant","v":831.27904897019926},"Hz"]
[null,null,null,"ESR Zero Frequency",{"$f":"Fesr/1000","v":663.14559697398488},"kHz"]
[null,null,null,"Desired Crossover Frequency",54,{"$f":"\"     kHz \"","v":"     kHz "}]
[null,null,null,"Error Amp Pole Frequency",{"$f":"Fp1_u","v":1.3812037098400818},"Hz"]
[null,null,null,{"$f":"CHOOSE(VOUT_setting, \"Upper Feedback Resistor\", \"* Tie FB to AGND for Fixed 5V Output\", \"* Tie FB to VDDA for Fixed 3.3V Output\")","v":"Upper Feedback Resistor"},49.9,"kΩ"]
[null,null,null,{"$f":"CHOOSE(VOUT_setting, \"Lower Feedback Resistor\", \"\", \"\")","v":"Lower Feedback Resistor"},{"$f":"IF(Vout=Vref,\"OPEN\",Rfb2_u/1000)","v":5.49},{"$f":"IF(Vout=Vref,\"\",\"kΩ\")","v":"kΩ"}]
[]
["Compensation Components"]
[null,"Calculated /","Std Values",{"$f":"C71","v":"Std Values"},null,"Actual P/Z Frequencies"]
["RC1",{"$f":"Rcea1/1000","v":16.286016297600007},{"$f":"'Standard Value Calculator'!O30","v":16.2},{"$f":"C72","v":16.2},"kΩ",{"$f":"Fp1_u","v":1.3812037098400818},"Hz   (FPEA)"]
["CC1",{"$f":"Cc1ea*1000000000","v":1.8097205052921097},{"$f":"'Standard Value Calculator'!O31","v":1.8},{"$f":"C73","v":1.8},"nF",{"$f":"Fz1_u/1000","v":5.4579884524607802},"kHz (FZCOMP)"]
["CC2",{"$f":"IF(Cc2ea<0, \"N/A\", Cc2ea*1000000000000)","v":12.589423747873239},{"$f":"'Standard Value Calculator'!O32","v":12},{"$f":"C74","v":12},"pF",{"$f":"Fp2_u/1000","v":224.14231382764953},"kHz (FPCOMP)"]
[null,null,null,null,null,null,null,null,null,null,null,null,null,"** Specify Inductor Core Loss **",0.25,"W"]
[]
["Efficiency / Power Loss Analyzer"]
[]
["Step 8: Efficiency"]
[null,null,null,null,null,"Power MOSFETs","(Q1, Q2) "]
[null,null,null,null,"IAUC60N04S6L039, L032"]
[null,null,null,null,"High-side","  Low-side"]
[null,null,null,"On-State Resistance, RDS(on) ",4.5,3.65,"mΩ"]
[null,null,null,"Total Gate Charge, QG ",8,9,"nC"]
[null,null,null,"Gate-Drain Charge, QGD ",3.1,3.9,"nC"]
[null,null,null,"Gate-Source Charge, QGS ",2.9,3.8,"nC"]
[null,null,null,"Output Charge, QOSS ",null,12,"nC"]
[null,null,null,"Output Capacitance, COSS ",259,330,"pF"]
[null,null,null,"Gate Resistance, RG ",0,0,"Ω"]
[null,null,null,"Transconductance, gFS ",71,71,"S"]
[null,null,null,"Gate-Source Threshold Voltage, VTH ",3.2,3.2,"V"]
[null,null,null,"Body Diode Forward Voltage, VBD ",0.8,0.8,"V"]
[null,null,null,"Body Diode Rev Recovery Charge, QRR ",null,13,"nC"]
[null,null,null,"Thermal Resistance, θJA ",50,50,"°C/W"]
[]
["External Schottky Diode (if applicable)"]
[null,null,null,"Schottky Fwd Voltage, VFWDsch ",null,0,"V"]
[null,null,null,"Schottky Rev Recovery Charge, QRRsch ",null,0,"nC"]
[]
["Step 9: IC Power Loss"]
[null,null,null,"IC Power Dissipation",{"$f":"'Variable Management'!B305","v":3.7399999999999996E-2},"W"]
[null,null,null,"IC Junction Temperature (estimate)",{"$f":"'Variable Management'!B307","v":26.27534},"°C"]
[null,null,null,null,{"$f":"CHOOSE(Ext_VCC, \"* Tie VCCX to VOUT\", \"* Tie VCCX to PGND\")","v":"* Tie VCCX to VOUT"}]

{"sheet":"BOM & Schematic","index":1,"n_rows":71,"n_cols":10,"rows_kept":71,"cut":false,"hidden":false,"merged":[[50,3,50,5],[47,3,47,5],[62,3,62,6],[63,3,63,6],[61,3,61,6],[52,3,52,5],[55,3,55,6],[41,3,41,6],[46,3,46,5],[60,3,60,6],[58,3,58,6],[59,3,59,6],[54,3,54,6],[57,3,57,6],[56,3,56,6],[53,3,53,6],[42,3,42,5],[43,3,43,5],[48,3,48,5],[49,3,49,5],[51,3,51,5],[44,3,44,5],[45,3,45,5],[64,0,65,0],[64,9,65,9],[64,3,65,6],[64,2,65,2],[64,1,65,1],[64,7,65,7],[64,8,65,8]]}
[]
[]
[]
[]
[]
[]
[]
[]
[]
[]
[]
[]
[]
[]
[]
[]
[]
[]
[]
[]
[]
[]
[]
[]
[]
[]
[]
[]
[]
[]
[]
[]
[]
[]
[]
["   ** Tie DEMB to VDDA for FPWM, AGND for DEM **"]
["   ** Tie VCCX to GND if not used **",null,null,null,null,null,null,null,{"$f":"IF(OR(SCH_MODE=3, SCH_MODE=4),\"** Tie VCCX to GND if not used **\", \"\")","v":""}]
["   ** Tie DITH to VDDA to disable spread spectrum **"]
["   ** Tie OSC to VDDA for 2.2MHz, AGND for 440kHz **"]
[{"$f":"\"VIN = \"&VIN_min&\" V to \"&VIN_max&\" V, VOUT = \"& Vout &\" V, IOUT = \" &Iout & \" A,  Fsw = \" & Fsw/1000 &\" kHz, Current Limit = \"&ROUNDUP(Ilimit_DC,0)&\" A\"","v":"VIN = 16 V to 36 V, VOUT = 12 V, IOUT = 9 A,  Fsw = 440 kHz, Current Limit = 12 A"}]
["High Efficiency Synchronous Buck Regulator BOM"]
["Count","Ref Des","Value","Description",null,null,null,"Size","Part Number","MFR"]
[1,"CBOOT",0.1,{"$f":"C43","v":0.1},null,null,null,"0603","Std","Std"]
[1,"CC1",{"$f":"'Design Regulator'!D73","v":1.8},1.8,null,null,null,"0603","Std","Std"]
[1,"CC2",{"$f":"'Design Regulator'!D74","v":12},12,null,null,null,"0603","Std","Std"]
[1,"CRES",{"$f":"Cres_u*1000000000","v":330},{"$f":"C46","v":330},null,null,null,"0603","Std","Std"]
[1,"CDITH",{"$f":"Cdither*1000000000","v":10},{"$f":"C47","v":10},null,null,null,"0603","Std","Std"]
[{"$f":"ROUNDUP('Design Regulator'!E46/10,0)","v":2},"CIN",10,{"$f":"C48","v":10},null,null,null,1210,"Std","Std"]
[{"$f":"ROUNDUP('Design Regulator'!E37/47,0)","v":6},"COUT",47,{"$f":"C49","v":47},null,null,null,1210,"Std","Std"]
[1,"CSS",{"$f":"'Design Regulator'!E54","v":56},{"$f":"C50","v":56},null,null,null,"0603","Std","Std"]
[2,"CVCC, CVCCX",2.2000000000000002,2.2000000000000002,null,null,null,"0603","Std","Std"]
[1,"CVDDA",0.47,0.47,null,null,null,"0603","Std","Std"]
[1,"DBOOT","See description","Schottky Diode, 60V, 200mA",null,null,null,"-","-","Various"]
[1,"LO",{"$f":"'Design Regulator'!E28","v":6.8},{"$f":"\"Inductor, \"&Lf*1000000&\"µH, \"&Rdcr*1000&\"mΩ, >\"&ROUNDUP(Ilimit_DC*1.1,0)&\"A\"","v":"Inductor, 6.8µH, 2mΩ, >14A"},null,null,null,"-","-","Various"]
[2,"Q1, Q2","See description",{"$f":"'Design Regulator'!E83","v":4.5},null,null,null,"Std",{"$f":"'Design Regulator'!E81","v":"IAUC60N04S6L039, L032"},"-"]
[1,"RC1",{"$f":"'Design Regulator'!D72","v":16.2},{"$f":"C56","v":16.2},null,null,null,"0603","Std","Std"]
[1,"RS",{"$f":"Rs*1000","v":2},2,null,null,null,"0508","Std","Std"]
[1,"RT",{"$f":"'Design Regulator'!E13","v":"N/A"},"N/A",null,null,null,"0603","Std","Std"]
[1,"RFB1",{"$f":"'Design Regulator'!E67","v":49.9},49.9,null,null,null,"0603","Std","Std"]
[1,"RFB2",{"$f":"'Design Regulator'!E68","v":5.49},5.49,null,null,null,"0603","Std","Std"]
[1,"RPGOOD",100,100,null,null,null,"0603","Std","Std"]
[1,"RCS",100,100,null,null,null,"0603","Std","Std"]
[1,"RDEMB",100,100,null,null,null,"0603","Std","Std"]
[1,"RVIN",2.2000000000000002,2.2000000000000002,null,null,null,"0603","Std","Std"]
[1,"U1","LM25141-Q1","IC, LM25141-Q1, Synchronous Buck PWM Controller, 3.8V–42V Input",null,null,null,"VQFN-24","LM25141QRGEQ1","TI"]
[]
[]
["NOTES:"]
["** For information on TI NexFETTM MOSFETs, see **",null,null,"http://www.ti.com/nexfet","   **"]
["** Inductor saturation current should be higher than the peak inductor current at the OCP setpoint for all input voltages and operating temperatures **"]
["** Effective input and output capacitances should be appropriately derated for applied voltage and temperature, particularly with ceramics **"]

{"sheet":"EVM","index":2,"n_rows":6,"n_cols":2,"rows_kept":6,"cut":false,"hidden":true,"merged":[[0,0,0,16]]}
[" LM5143-Q1 Quickstart Design Tool"]
[]
[]
[]
[]
[null,"LM5143-Q1EVM-2100 PCB Layout"]

{"sheet":"Variable Management","index":3,"n_rows":371,"n_cols":27,"rows_kept":371,"cut":false,"hidden":true,"merged":[[4,4,4,7],[0,0,0,8]]}
["EXCEL Variables Names/Calculations"]
[null,"Input from user ="]
[null,"Output ="]
[null,"Constant"]
["Variable Name","Value","STD Units",null,"Notes",null,null,null,"Iteration"]
["Step 1: Operational Specs"]
["VIN_min",{"$f":"'Design Regulator'!E6","v":16},"V","Minimum input voltage",null,null,null,null,1]
["VIN_nom",{"$f":"'Design Regulator'!E7","v":24},"V","Nominal input voltage",null,null,null,null,null,null,{"$f":"CHOOSE(SCH_MODE, \"Efficiency vs. IOUT (Ch1)\", \"Efficiency vs. IOUT - 2 Ph\", \"Efficiency vs. IOUT - 3 Ph\", \"Efficiency vs. IOUT - 4 Ph\")","v":"Efficiency vs. IOUT (Ch1)"},1,null,"DITHER Enabled",1,null,null,null,null,"Dual  Outputs",1,null,"FPWM",1,null,{"$f":"CHOOSE(SCH_MODE, \"Bode Plot (Ch1)\", \"Bode Plot - 2 Ph\", \"Bode Plot - 3 Ph\", \"Bode Plot - 4 Ph\")","v":"Bode Plot (Ch1)"},1]
["VIN_max",{"$f":"'Design Regulator'!E8","v":36},"V","Maximum input voltage",null,null,null,null,null,null,{"$f":"IF(MODE=1, \"Efficiency vs. IOUT (Ch2)\", \"N/A - Do Not Use\")","v":"Efficiency vs. IOUT (Ch2)"},2,null,"DITHER Disabled",2,null,null,null,null,"Single Output – 2  Phases",2,null,"DEM",2,null,{"$f":"IF(MODE=1, \"Bode Plot (Ch2)\", \"N/A - Do Not Use\")","v":"Bode Plot (Ch2)"},2]
[null,null,null,null,null,null,null,null,null,null,"PLOT_TYPE",1,null,"DITHER Yes/No",1,"1 = Yes, 2 = No",null,null,null,"Single Output – 3  Phases",3,null,"FPWM/DEM",1,null,"BODE_PLOT_TYPE",1]
["Vout",{"$f":"'Design Regulator'!E9","v":12},"V","Output voltage - channel 1",null,null,null,null,null,null,null,null,null,null,null,null,null,null,null,"Single Output – 4  Phases",4]
["Iout",{"$f":"'Design Regulator'!E10","v":9},"A","Output current - channel 1",null,null,null,null,1,null,null,null,null,null,null,null,null,null,null,"Single/Dual Yes/No",1]
[null,null,null,null,null,null,null,null,1,null,"Adjustable",1,null,"3.3V",1,null,null,null,null,"MODE (Single/Dual), DUAL = 1, SINGLE = 2",{"$f":"IF(U12=1, 1, 2)","v":1},null,"VCCX Connected",1]
["Rout",{"$f":"Vout/Iout","v":1.3333333333333333},"W","Load resistance - Channel 1",null,null,null,null,null,null,"5V",2,null,"5V",2,null,null,null,null,"SINGLE OUTPUT (1 = YES)",{"$f":"IF(U12=1, 2, 1)","v":2},null,"No External VCC",2]
[null,null,null,null,null,null,null,null,null,null,"3.3V",3,null,"Adjustable",3,null,null,null,null,"Number of Phases",{"$f":"SCH_MODE","v":1},null,"Ext_VCC",1]
["Pout",{"$f":"Vout*Iout","v":108},"W","Output power",null,null,null,null,null,null,"Output Voltage Setting",{"$f":"IF(Vout=3.3, 3, IF(Vout=5, 2, 1))","v":1},null,"Ch2 Output Setting",{"$f":"IF(Vout2=3.3, 1, IF(Vout2=5, 2, 3))","v":3}]
[]
["Efficiency",0.9,null,"Estimate of efficiency"]
["Pin",{"$f":"Pout/Efficiency","v":120},"W","Calculate input power assuming finite efficiency",null,null,null,null,null,null,null,null,null,null,null,null,null,null,null,null,null,null,"2.2 MHz Fsw Setting",1]
[null,null,null,null,null,null,null,null,null,null,null,null,null,null,null,null,null,null,null,null,null,null,"440 kHz Fsw Setting",2]
["Iin_Vinmin",{"$f":"Pin/VIN_min","v":7.5},"A",null,null,null,null,null,null,null,null,{"$f":"Vout","v":12},null,null,null,null,null,null,null,null,null,null,"OSC",2]
["Iin_Vinnom",{"$f":"Pin/VIN_nom","v":5},"A","Input currents at min, nom, max Vin",null,null,null,{"$f":"AND(OSC=1, OR(Fsw/1000>2530, Fsw/1000<1800))","v":false}]
["Iin_Vinmax",{"$f":"Pin/VIN_max","v":3.3333333333333335},"A",null,null,null,null,{"$f":"AND(OSC=2, OR(Fsw/1000>500, Fsw/1000<300))","v":false}]
[null,null,null,null,null,null,null,{"$f":"OR(H22,H23)","v":false}]
["OSC setting",{"$f":"CHOOSE(OSC, 2200, 440)","v":440},"kHz"]
["Fsw",{"$f":"'Design Regulator'!E12*1000","v":440000},"Hz","Nominal switching frequency - determines RT resistor (SYNCIN must be 80-120% of this)",null,null,null,null,null,null,null,null,null,"Min CS Gain - 11.4",1]
["RT resistor to AGND - 2.2MHz setting",{"$f":"(1/(Fsw/1000000)-0.0216)/0.0086","v":261.7589852008457},"kΩ",null,null,null,null,null,null,null,"Adjustable",1,null,"Nom CS Gain - 12",2]
["RT resistor to AGND - 440kHz setting",{"$f":"(1/(Fsw/1000)-0.0000138)/0.000045","v":50.198383838383833},"kΩ",null,null,null,null,null,1,null,"5V",2,null,"Max CS Gain - 12.6",3]
["Tsw",{"$f":"1/Fsw","v":2.2727272727272728E-6},"sec","Switching period",null,null,null,null,null,null,"3.3V",3,null,"CS Gain",2]
["Vref",1.2,"V","Reference voltage",null,null,null,null,null,null,"Adjustable_NoRT",4,null,null,{"$f":"CHOOSE(O29, 11.4, 12, 12.6)","v":12}]
["Rt",{"$f":"CHOOSE(OSC, 'Standard Value Calculator'!O12/1000, 'Standard Value Calculator'!O13/1000)","v":49.9},"kΩ","Frequency set resistor",null,{"$f":"IF(OR((Fsw=440000),(Fsw=2200000)),\"N/A\",Rfadj/1000)","v":"N/A"},null,null,null,null,"5V_NoRT",5]
[null,null,null,null,null,null,null,null,null,null,"3.3V_NoRT",6,null,"Min EA gm - 1.01mS",1010]
["Step 2: Buck Inductor","Channel 1",null,null,null,null,null,null,null,null,"Schematic setting",{"$f":"IF(No_RT, IF(Vout=3.3, 6, IF(Vout=5, 5, 4)),IF(Vout=3.3, 3, IF(Vout=5, 2, 1)))","v":4},null,"Nom EA gm - 1.2mS",1200]
["Don1",{"$f":"Vout/VIN_nom","v":0.5},null,null,null,"Ideal Duty Cycle at VIN(nom)",null,null,null,null,null,null,null,"Max EA gm - 1.4mS",1400]
["Doff1",{"$f":"1-34:34","v":0.5},null,null,null,"Ideal 1- Duty Cycle at VIN(nom)",null,null,null,null,null,null,null,"EA Transconductance",2]
[null,null,null,null,null,null,null,null,null,null,null,null,null,null,{"$f":"CHOOSE(O35, 0.000101, 0.0012, 0.0014)","v":1.1999999999999999E-3}]
["D_Vinmin",{"$f":"Vout/VIN_min","v":0.75}]
["D_Vinnom",{"$f":"Vout/VIN_nom","v":0.5}]
["D_Vinmax",{"$f":"Vout/VIN_max","v":0.33333333333333331}]
[]
["L_Vinnom",{"$f":"(VIN_nom-Vout)*D1_Vinnom/(Fsw*(Iout/Number_of_Phases)*0.35)","v":4.3290043290043287E-6},"H",null,null,"Calculated inductance for 35% ripple at VIN(nom)"]
["L_slopecomp",{"$f":"1000*Vout*Rs/24/Fsw","v":2.2727272727272728E-6},"H",null,null,"Calculated inductance based on one times inductor downslope"]
[]
["Lopt",{"$f":"B42","v":2.2727272727272728E-6},"H",null,null,"min of calculated inductances at VIN(min) and VIN(nom)"]
[]
["Lo",{"$f":"'Design Regulator'!E28/1000000","v":6.8000000000000001E-6},"H",null,null,"Chosen inductance"]
["Rdcr",{"$f":"'Design Regulator'!E29/1000","v":2E-3},"W",null,null,"Chosen inductor DCR"]
[]
["Don2",{"$f":"(Vout+Iout*(Rdcr+Rs))/(Vin+Iout*Rs)","v":0.50112415688233825}]
["Doff2",{"$f":"1-_Don2","v":0.49887584311766175}]
[]
["D_Vinmin_2",{"$f":"CHOOSE(MODE, (Vout+Iout*(Rdcr+Rs))/(VIN_min+Iout*Rs), (Vout+Iout/Number_of_Phases*(Rdcr+Rs))/(VIN_min+Iout/Number_of_Phases*Rs))","v":0.75140466974653508},null,null,null,"Duty cycles adjusted for DCR/shunt voltage drops"]
["D_Vinnom_2",{"$f":"CHOOSE(MODE, (Vout+Iout*(Rdcr+Rs))/(VIN_nom+Iout*Rs), (Vout+Iout/Number_of_Phases*(Rdcr+Rs))/(VIN_nom+Iout/Number_of_Phases*Rs))","v":0.50112415688233825},null,null,null,"need to include RDS(on) later"]
["D_Vinmax_2",{"$f":"CHOOSE(MODE, (Vout+Iout*(Rdcr+Rs))/(VIN_max+Iout*Rs), (Vout+Iout/Number_of_Phases*(Rdcr+Rs))/(VIN_max+Iout/Number_of_Phases*Rs))","v":0.33416625020822921}]
[]
["Iripple_Vinmin",{"$f":"(VIN_min-Vout)*D1_Vinmin_2/(Fsw*Lf)","v":1.0045516975221058},"A"]
["Iripple_Vinnom",{"$f":"(VIN_nom-Vout)*D1_Vinnom_2/(Fsw*Lf)","v":2.0098562441805012},"A"]
["Iripple_Vinmax",{"$f":"(VIN_max-Vout)*D1_Vinmax_2/(Fsw*Lf)","v":2.6804779428467582},"A"]
[]
["Ishunt_rms_Vinmin",{"$f":"SQRT((Iout/Number_of_Phases)^2+(Iripple_Vinmin^2)/12)","v":9.0046706589459937},"A"]
["Ishunt_rms_Vinnom",{"$f":"SQRT((Iout/Number_of_Phases)^2+(Iripple_Vinnom^2)/12)","v":9.0186821012564025},"A"]
["Ishunt_rms_Vinmax",{"$f":"SQRT((Iout/Number_of_Phases)^2+(Iripple_Vinmax^2)/12)","v":9.0332024683114085},"A"]
["Max shunt power loss at full load",{"$f":"B61^2*Rs","v":0.16267325368704519},"W",null,null,"Note this is power loss at full load - not loss near OCP!"]
[]
["Max inductor ripple current",{"$f":"MAX(B56:B58)","v":2.6804779428467582},"A",null,null,"Ripple current at Vin(max)"]
[]
[null,{"$f":"B56/(Iout/Number_of_Phases)","v":0.11161685528023398}]
["% ripple current",{"$f":"B57/(Iout/Number_of_Phases)","v":0.22331736046450013}]
[null,{"$f":"B58/(Iout/Number_of_Phases)","v":0.29783088253852869}]
[]
["Inductor copper temerature",100,"°C"]
["DCR at hot",{"$f":"Rdcr*(1+0.0039*(B71-25))","v":2.5850000000000001E-3},"W"]
[]
[]
["Step 3: Sense Resistors, Slope Comp, Current Limit"]
[]
["Ilimit_DC",{"$f":"'Design Regulator'!E17","v":12},"A",null,null,"Chosen OCP level - based on output current"]
[]
["Ilimit_inductor_Vinmin",{"$f":"CHOOSE(MODE, Ilimit_DC+Iripple_Vinmin/2, Ilimit_DC/Number_of_Phases+Iripple_Vinmin/2)","v":12.502275848761053},"A",null,null,"Peak inductor current at current limit inception"]
["Ilimit_inductor_Vinnom",{"$f":"CHOOSE(MODE, Ilimit_DC+Iripple_Vinnom/2, Ilimit_DC/Number_of_Phases+Iripple_Vinnom/2)","v":13.00492812209025},"A"]
["Ilimit_inductor_Vinmax",{"$f":"CHOOSE(MODE, Ilimit_DC+Iripple_Vinmax/2, Ilimit_DC/Number_of_Phases+Iripple_Vinmax/2)","v":13.340238971423378},"A"]
[]
[]
["CS threshold_min",6.8000000000000005E-2,"V"]
["CS threshold",7.4999999999999997E-2,"V"]
["CS threshold_max",8.2000000000000003E-2,"V"]
[]
["Shunt required to get OCP at VIN(min)",{"$f":"Buck_CS_threshold/B79","v":5.9989077914508124E-3},"W"]
["Shunt required to get OCP at VIN(nom)",{"$f":"Buck_CS_threshold/B80","v":5.767044561561593E-3},"W"]
["Shunt required to get OCP at VIN(max)",{"$f":"Buck_CS_threshold/B81","v":5.6220881920226676E-3},"W"]
[]
["Rs_ideal",{"$f":"B89","v":5.767044561561593E-3},"W",null,null,"Ideal Rs for the required OCP -- based on 73mV CL threshold"]
["Rs",{"$f":"'Design Regulator'!E19/1000","v":2E-3},"W",null,null,"Selected (starndard value) current limit sense resistor"]
[]
["Current limit - peak",{"$f":"Buck_CS_threshold/Rs","v":37.5},"A",null,null,"Peak inductor current limit = min sat current"]
[]
["Iout_OCP_Vinmin",{"$f":"Number_of_Phases*(Buck_CS_threshold/Rs-Iripple_Vinmin/2)","v":36.997724151238948},"A",null,null,"Current limit setpoints (i.e. IOUT) after standard components are selected"]
["Iout_OCP_Vinnom",{"$f":"Number_of_Phases*(Buck_CS_threshold/Rs-Iripple_Vinnom/2)","v":36.495071877909751},"A"]
["Iout_OCP_Vinmax",{"$f":"Number_of_Phases*(Buck_CS_threshold/Rs-Iripple_Vinmax/2)","v":36.159761028576618},"A"]
[]
["Irms_OCP_Vinmin",{"$f":"SQRT((Iout_OCP_Vinmin/Number_of_Phases)^2+(Iripple_Vinmin^2)/12)","v":36.998860604716633},"A"]
["Irms_OCP_Vinnom",{"$f":"SQRT((Iout_OCP_Vinnom/Number_of_Phases)^2+(Iripple_Vinnom^2)/12)","v":36.499683535851673},"A"]
["Irms_OCP_Vinmax",{"$f":"SQRT((Iout_OCP_Vinmax/Number_of_Phases)^2+(Iripple_Vinmax^2)/12)","v":36.168039267802115},"A"]
[]
["Pshunt_Vinmin",{"$f":"B101^2*Rs","v":2.7378313720945049},"W",null,null,"Max power dissipations in shunt"]
["Pshunt_Vinnom",{"$f":"B102^2*Rs","v":2.6644537964346431},"W"]
["Pshunt_Vinmax",{"$f":"B103^2*Rs","v":2.6162541289545516},"W"]
[]
[]
["Step 4: Output Capacitor"]
["Icoutrms_VINmin",{"$f":"Iripple_Vinmin/SQRT(12)","v":0.28998909648964166},"A",null,null,"Output Cap RMS current"]
["Icoutrms_VINnom",{"$f":"Iripple_Vinnom/SQRT(12)","v":0.58019552180503131},"A"]
["Icoutrms_VINmax",{"$f":"Iripple_Vinmax/SQRT(12)","v":0.77378733092971508},"A"]
["Max Cout rms current",{"$f":"MAX(B111:B113)","v":0.77378733092971508},"A"]
[]
["Vripple1",{"$f":"'Design Regulator'!E35/1000","v":0.1},"V",null,null,"Output voltage ripple spec(pk-pk)"]
[]
["Output Ripple Spec (pk-pk)",{"$f":"Vo1_ripple*1000","v":100},"mV",null,null,"Vout ripple spec at Vin(nom)"]
[]
["Coutmin",{"$f":"Iripple_Vinnom/(Fsw*8*Vo1_ripple)","v":5.7098188755127877E-6},"F",null,null,"Minimum output capacitnace",null,{"$f":"Vo2_ripple","v":0},1]
["Reported Coutmin",{"$f":"IF(Cout_min*1000000<2, 2.2,Cout_min*1000000)","v":5.7098188755127879},"uF"]
["Cout",{"$f":"'Design Regulator'!E37/1000000","v":2.4000000000000001E-4},"F",null,null,"Chosen output capacitance",null,null,1]
["Resrmax",{"$f":"SQRT((Vo1_ripple/Iripple_Vinnom)^2-(1/(Fsw*Cout*8))^2)","v":4.9740719471420516E-2},"W",null,null,"Max ESR before ripple exceeds Vripple1",null,null,1]
[]
["Reported Cout ESR max",{"$f":"IF(OR(CoutEsrMax>0.3, CoutEsrMax<0, (ISERROR(CoutEsrMax))), \"N/A\", CoutEsrMax*1000)","v":49.740719471420519},"mΩ"]
["CoutEsr",{"$f":"'Design Regulator'!E39/1000","v":1E-3},"W",null,null,"Chosen ESR",null,null,1,null,{"$f":"ISERROR(CoutEsrMax)","v":false},{"$f":"ISERROR(B125)","v":false}]
["Vripple",{"$f":"Iripple_Vinnom*SQRT(Cout_ESR^2+(1/(8*Fsw*Cout))^2)","v":3.1144176102912962E-3},"Vp-p",null,null,null,null,null,null,null,null,{"$f":"OR(CoutEsrMax>0.3,CoutEsrMax<0)","v":false}]
[null,null,null,null,null,null,null,null,null,null,{"$f":"OR(TRUE, FALSE, TRUE)","v":true}]
["Step 5: Input Capacitor"]
[null,null,null,null,null,null,null,null,null,null,"Two channels operating at full load"]
["Icinrms_VINmin",{"$f":"SQRT(D1_Vinmin_2*(Iout^2*(1-D1_Vinmin_2)+Iripple_Vinmin^2/12))","v":3.8979019273585265},"A",null,null,"Calculate input cap rms current with one output unloaded",null,null,null,null,{"$f":"SQRT(Iout^2*D1_Vinmin*(1-D1_Vinmin)+Iout2^2*D2_Vinmin*(1-D2_Vinmin)-2*Iout*Iout2*D1_Vinmin*D2_Vinmin)","v":{"$error":"#NAME?"}},"A",{"$f":"SQRT(Iout^2*D1_Vinmin*(1-D1_Vinmin)+Iout2^2*D2_Vinmin*(1-D2_Vinmin)-2*Iout*Iout2*(0.5-D2_Vinmin*(1-D1_Vinmin)))","v":{"$error":"#NAME?"}},"A"]
["Icinrms_VINnom",{"$f":"SQRT(D1_Vinnom_2*(Iout^2*(1-D1_Vinnom_2)+Iripple_Vinnom^2/12))","v":4.5186933378046188},"A",null,null,null,null,null,null,null,{"$f":"SQRT(Iout^2*D1_Vinnom*(1-D1_Vinnom)+Iout2^2*D2_Vinnom*(1-D2_Vinnom)-2*Iout*Iout2*D1_Vinnom*D2_Vinnom)","v":{"$error":"#NAME?"}},"A"]
["Icinrms_VINmax",{"$f":"SQRT(D1_Vinmax_2*(Iout^2*(1-D1_Vinmax_2)+Iripple_Vinmax^2/12))","v":4.2687836143340911},"A",null,null,null,null,null,null,null,{"$f":"SQRT(Iout^2*D1_Vinmax*(1-D1_Vinmax)+Iout2^2*D2_Vinmax*(1-D2_Vinmax)-2*Iout*Iout2*D1_Vinmax*D2_Vinmax)","v":{"$error":"#NAME?"}},"A"]
["Max Cin rms current",{"$f":"MAX(B131:B133)","v":4.5186933378046188},"A",null,null,null,null,null,null,null,{"$f":"MAX(K131:K133)","v":{"$error":"#NAME?"}},"A"]
[null,null,null,null,null,{"$f":"Number_of_Phases*D1_Vinnom","v":0.5},"N*D"]
["Icinrms - multiphase",{"$f":"Iout*SQRT((D1_Vinnom-F136/Number_of_Phases)*((F136+1)/Number_of_Phases-D1_Vinnom))","v":4.5},"A",null,null,{"$f":"FLOOR(Number_of_Phases*D1_Vinnom,1)","v":0},"floor(N*D)"]
["Icinrms - multiphase - max",{"$f":"Iout/2/Number_of_Phases","v":4.5},"A"]
["Final result",{"$f":"CHOOSE(MODE, B134, B137)","v":4.5186933378046188},"A","…report this"]
[]
["Vinripple1",{"$f":"'Design Regulator'!E44/1000","v":0.5},"Vp-p",null,null,"Input voltage ripple spec (pk-pk)"]
[]
["Cinmin_Vinmax",{"$f":"Iout/Number_of_Phases*D1_Vinmax*(1-D1_Vinmax)/(Vinripple1*Fsw)","v":9.090909090909091E-6},"F",null,null,"Calculate cap at Vinmax and 50% duty cycle (Vin = 2*Vout)"]
["Cinmin_50%D",{"$f":"Iout*0.5*(1-0.5)/(Vinripple1*Fsw)","v":1.0227272727272727E-5},"F",null,null,"Buck 50% typically worst case"]
["Cinmin",{"$f":"IF(VIN_max<2*Vout, B142,B143)","v":1.0227272727272727E-5},"F"]
["Reported Cinmin",{"$f":"IF(Cinmin*1000000<10, 10,Cinmin*1000000)","v":10.227272727272727},"uF",null,null,"…report this"]
["Cin",{"$f":"'Design Regulator'!E46/1000000","v":2.0000000000000002E-5},"F",null,null,"Input capacitance"]
["CinEsrMax_Vinmax",{"$f":"-(Iout/Number_of_Phases*D1_Vinmax*(1-D1_Vinmax)/(Cin*Fsw)-Vinripple1)/(Iout/Number_of_Phases+Iripple_Vinmax/2)","v":2.6375335568258208E-2},"W"]
["CinEsrMax_50%D",{"$f":"-(Iout/Number_of_Phases*0.5*(1-0.5)/(Cin*Fsw)-Vinripple1)/(Iout/Number_of_Phases+Iripple_Vinmax/2)","v":2.3627904779897981E-2},"W",null,null,"Calculate ESR at Vinmax and 50% duty cycle (Vin = 2*Vout)"]
["CinEsrMax",{"$f":"IF(VIN_max<2*Vout, B147,B148)","v":2.3627904779897981E-2},"W"]
["Reported Cin ESR max",{"$f":"IF(OR(CinEsrMax>0.3, CinEsrMax<0), \"N/A\",CinEsrMax*1000)","v":23.627904779897982},"mΩ",null,null,"…report this"]
["RCinEsr",{"$f":"'Design Regulator'!E48/1000","v":2E-3},"W",null,null,"Input capacitance series resistance (ESR)"]
[]
["Vinripple2_Vinmax",{"$f":"Iout/Number_of_Phases*D1_Vinmax_2*(1-D1_Vinmax_2)/(Cin*Fsw)+(Iout/Number_of_Phases +Iripple_Vinmax/2)*RCinEsr","v":0.24823644463261979},"Vp-p"]
["Vinripple2_50%D",{"$f":"Iout/Number_of_Phases*0.5*(1-0.5)/(Cin*Fsw)+(Iout/Number_of_Phases +Iripple_Vinmax/2)*RCinEsr","v":0.27636229612466495},"Vp-p",null,null,"Calculate ripple at Vinmax and 50% duty cycle (Vin = 2*Vout)"]
["Vinripple2",{"$f":"IF(VIN_max<2*Vout, B153,B154)","v":0.27636229612466495},"Vp-p",null,null,"…report highest of these"]
[]
[null,{"$f":"Iout*D1_Vinmax_2*(1-D1_Vinmax_2)/(Cin*Fsw)","v":0.22755596668977304},"Vp-p"]
[]
["Step 6a: Soft Start"]
["Tss",{"$f":"'Design Regulator'!E53/1000","v":3.0000000000000001E-3},"s","Soft-start time"]
["Iss",{"$f":"Cout*Vout/Tss","v":0.96000000000000008},"A","Load cap current during soft start"]
["Css",{"$f":"0.000022*Tss/1.2","v":5.4999999999999996E-8},"F"]
["Css_u",{"$f":"'Standard Value Calculator'!B4","v":5.5999999999999999E-8},"F"]
[]
["Step 6b: Other Components - Dither, Hiccup, DEMB, MODE"]
["Tres",{"$f":"'Design Regulator'!E55/1000","v":0.02},"s","Hiccup time"]
["Cres",{"$f":"0.00002*Tres/1.2","v":3.3333333333333335E-7},"F"]
["Cres_u",{"$f":"'Standard Value Calculator'!G4","v":3.3000000000000002E-7},"F"]
[]
["RPG1/2",100,"kΩ"]
["RFB1/2",null,"W",null,"Tie to VDDA or AGND for 3.3V/5V output, respectively. "]
["R_MODE",null,"W",null,"Tie to VDDA or AGND for Single/Dual operation, respectively. "]
["R_DEMB",null,"W",null,"Tie to VDDA or AGND for FPWM/DEM, respectively. "]
[]
["Dither Modulation Frequency",{"$f":"'Design Regulator'!E57*1000","v":8000},"Hz"]
["Cdither_calculated",{"$f":"10*10^-6/Fdither/0.12","v":1.0416666666666666E-8},"F"]
["Cdither_stdvalue",{"$f":"'Standard Value Calculator'!O22","v":1E-8},"F"]
[]
[]
["Step 7: Compensation"]
["Pi",3.1415926500000002,null,"p"]
["CS Amp Gain",{"$f":"O30","v":12}]
["Ri",{"$f":"Rs*CSAmp_gain","v":2.4E-2},"W",null,null,"Current Sense effective resistance = shunt resistor Rs * CS amp gain"]
["gm",{"$f":"O36","v":1.1999999999999999E-3},"S",null,null,"Error Amp Transconductance"]
[]
["Se_ext",{"$f":"B190/Ri*1000","v":5333333.333333333},"A/s",null,null,"Slope Comp Slope - referred to inductor current"]
["Sn",{"$f":"(Vin-Vout)/Lf","v":1764705.8823529412},"A/s",null,null,"On-time Slope"]
["Sf",{"$f":"Vout/Lf","v":1764705.8823529412},"A/s",null,null,"Off-time Slope"]
[]
["Se_int",{"$f":"Fsw/220*64/1000","v":128},"mV/μs",null,null,"Slope Comp Slope - referred to IC"]
["Sn_int",{"$f":"Sn*Ri/1000","v":42.352941176470587},"mV/μs",null,null,"etc"]
["Sf_int",{"$f":"Sf*Ri/1000","v":42.352941176470587},"mV/μs",null,null,"etc"]
[]
["mc_buck",{"$f":"1+Se_ext/Sn","v":4.0222222222222221},null,null,null,"mc = 1 + Se/Sn for peak current-mode buck"]
["k_buck",{"$f":"mc_buck*(1-D1_Vinnom_2)","v":2.0065895023177061},null,null,null,"mc*(1-d)"]
[]
["mc",{"$f":"1+Se_ext/Sn","v":4.0222222222222221}]
["k",{"$f":"mc_buck*(1-D1_Vinnom_2)","v":2.0065895023177061}]
["Q",{"$f":"1/Pi/(k-0.5)","v":0.21127844449853886},null,null,null,"1/(Pi*(k-0.5))",null,"Q = 2/Pi = 0.636 gives ideal one-cycle damping"]
[]
["Error Amp (EA)"]
["GBW",6,"MHz",null,null,"EA gain-bandwidth product"]
["Cbw",{"$f":"gm/(2*Pi*GBW*1000000)","v":3.1830988654751269E-11},"F",null,null,"EA effective bandwidth limiting capacitance = gm/(2*Pi*GBW)"]
["RoEA",64000000,"W",null,null,"EA output resistance"]
["AEA",{"$f":"gm*RoEA","v":76800},"V/V",null,null,"EA DC gain = gm*RoEA"]
["Afb",{"$f":"Vref/Vout","v":9.9999999999999992E-2},"V/V",null,null,"Feedback gain from Vout to FB"]
["Acs",{"$f":"1/Ri","v":41.666666666666664},null,null,null,"Acs = 1/Ri"]
["Am_buck",{"$f":"(Ro/Number_of_Phases)/Ri/((1+Ro/Number_of_Phases*(k-0.5)/(Fsw*Lf)))","v":33.239219218639612}]
["Am",{"$f":"(Ro*Number_of_Phases)/Ri/((1+Ro*Number_of_Phases*(k-0.5)/(Fsw*Lf)))","v":33.239219218639612},null,null,null,"Buck modulator gain"]
[]
["Scaling factor to calculate Rcomp - buck",{"$f":"2*Pi*Ri/gm","v":125.66370600000002},null,null,null,"2*Pi*Ri/gm -- scaling factor to calculate Rcomp given desired buck crossover frequency"]
["DC Gain is Adc = AEA*Afb*Am"]
[]
["Ro",{"$f":"Rout","v":1.3333333333333333},"W",null,null,"Output Resistance"]
[]
["Fp_load_buck",{"$f":"1/(2*Pi*Ro*Cout)+(k-0.5)/(2*Pi*Fsw*Lf*Cout/Number_of_Phases)","v":831.27904897019926},"Hz",null,null,"Buck dominant pole frequency -- note slope comp influence"]
["Fp_dominant",{"$f":"Fload_u","v":831.27904897019926},"Hz"]
[null,{"$f":"Cbw","v":3.1830988654751269E-11}]
["Fp_EA",{"$f":"1/(2*Pi*(RoEA+Rcea1_u)*Cc1ea_u)","v":1.3812037098400818},"Hz",null,null,"Error Amp LF pole -- related to amplifier ouptut resistance and comp cap"]
["Fp_HF",{"$f":"1/(2*Pi*Rcea1_u*(Cc2ea_u+Cbw))","v":224142.31382764954},"Hz",null,null,"Error Amp HF pole cancels zero related to Output Cap ESR"]
["Fesr",{"$f":"1/(2*Pi*Cout*Cout_ESR)","v":663145.59697398485},"Hz",null,null,"Cout ESR zero frequency"]
["F_mod",{"$f":"Fsw/2","v":220000},"Hz",null,null,"Zero-order sample-and-hold effects of current-mode control modeled as pole at Fsw/2"]
[]
["Desired Crossover Frequency",{"$f":"'Design Regulator'!E65*1000","v":54000},"Hz"]
["Rcea1",{"$f":"Fcross*Cout/Number_of_Phases*2*Pi*Ri/(gm*Afb)","v":16286.016297600007},"W",null,null,"This component will largely determine the crossover frequency",null,null,null,null,{"$f":"Fcross/Fp_dominant/(gm*Afb*Am)","v":16286.016297600003}]
["Cc1ea, Cc3ea",{"$f":"10/(Rcea1*Fcross*2*Pi)","v":1.8097205052921096E-9},"F",null,null,"This along with Rcea1 will set a zero at Fcrossover/5 to optimize phase margin"]
["Cc2ea, Cc4ea",{"$f":"MAX(1/(Rcea1*2*Pi*Fesr)-Cbw, 1/(Rcea1*2*Pi*(Fsw/2))-Cbw)","v":1.2589423747873238E-11},"F",null,null,"This along with Rcea1 places a pole at the output cap ESR zero"]
[]
["Chosen Compensation Components from the standard value sheet"]
["Rcea1_u",{"$f":"'Design Regulator'!D72*1000","v":16200},"W",null,null,{"$f":"1/(Rcea1*2*Pi*(Fsw/2))-Cbw","v":1.2589423747873238E-11}]
["Cc1ea_u",{"$f":"'Design Regulator'!D73*0.000000001","v":1.8000000000000002E-9},"F"]
["Cc2ea_u",{"$f":"'Design Regulator'!D74*0.000000000001","v":1.2000000000000001E-11},"F"]
[]
["Resulting Pole/Zero Locations",null,null,null,null,{"$f":"Cout","v":2.4000000000000001E-4},{"$f":"Cout_ESR","v":1E-3}]
["Fz1",{"$f":"1/(2*Pi*Rcea1_u*Cc1ea_u)","v":5457.9884524607805},"Hz",null,null,"This zero is set at or close to the dominant load pole"]
["Fp2",{"$f":"1/(2*Pi*Rcea1_u*(Cc1ea_u*(Cc2ea_u+Cbw)/(Cc1ea_u+Cc2ea_u+Cbw)))","v":229600.30228011034},"Hz",null,null,"This pole cancels the zero from the Output Cap ESR"]
[]
["Rfb1",{"$f":"'Design Regulator'!E67*1000","v":49900},"W",null,null,"Upper Feedback Resistance - chosen by user"]
["Rfb2",{"$f":"IF(Vout=Vref,100000000,Vref*B238/((Vout-Vref)))","v":5544.4444444444443},"W",null,null,"Lower Feedback Resistance"]
["Rfb2_u",{"$f":"IF(Vout=Vref,\"N/A\",'Standard Value Calculator'!O11)","v":5490},"W",null,null,"Std Value Lower Feedback Resistance"]
[]
[]
["Other Input Variables"]
["Rfets",0,"W","Series resistance due to FETs"]
["Diode loss eq res",{"$f":"0.00000002*Fsw*0.6*4/Iripple1","v":{"$error":"#NAME?"}}]
["Fet loss eq res",{"$f":"_Don2*RdsonTop+Doff2*RdsonBot","v":{"$error":"#NAME?"}}]
["cap loss eq res",{"$f":"B248*Vin^2*Fsw/2/(((Iripple1/SQRT(3))^2))","v":{"$error":"#NAME?"}}]
["Sw cap",5.0000000000000001E-9]
[]
["Step 8: Efficiency"]
["VAR",0]
["Design"]
["Ta",{"$f":"'Design Regulator'!E14","v":25},"°C","Ambient Temperature"]
["Components"]
["LTc",{"$f":"4000/1000000","v":4.0000000000000001E-3},"%/°C","Inductor DCR Temp Co"]
["θCA",20,"°C/W","Inductor Core to Ambient Thermal Resistance"]
["RCinEsr",{"$f":"RCinEsr","v":2E-3},"W","Input Capacitor ESR"]
[]
["Controller Characteristics"]
["VCC",5,"V","with 170mA current limit"]
["Top Driver"]
["RdsonDRT",1,"W","Drain-Source Resistance of Pullup High-side FET Driver"]
["RdsonDRT2",0.5,"W","Drain-Source Resistance of Pulldown High-side FET Driver"]
["Bottom Driver"]
["RdsonDRB",1,"W","Drain-Source Resistance of Pullup Low-side FET Driver"]
["RdsonDRB2",0.5,"W","Drain-Source Resistance of Pulldown Low-side FET Driver"]
["Deadtime"]
["Deadtime",1.4E-8,"s","Total Deadtime",null,null,"14ns for LM513-Q1"]
["IQ"]
["IQ ",3.4999999999999997E-5,"A","Quiescent Current of LM5143-Q1 Controller (One channel disabled)"]
[]
["High- & low-side MOSFETs - Ch1","Q1: high-side",null,"Q2: low-side"]
["Rdson",{"$f":"'Design Regulator'!E83/1000","v":4.4999999999999997E-3},"W",{"$f":"'Design Regulator'!F83/1000","v":3.65E-3},"W","Drain-Source Resistances of Channel 1 FETs"]
["RdsonTopTc",{"$f":"4000/1000000","v":4.0000000000000001E-3},"%/°C",4.0000000000000001E-3,"%/°C","Drain-Source Resistance Temp Co"]
["Qg",{"$f":"'Design Regulator'!E84/1000000000","v":8.0000000000000005E-9},"C",{"$f":"'Design Regulator'!F84/1000000000","v":8.9999999999999995E-9},"C","Gate Charge at VCC = 5V"]
["Qgd",{"$f":"'Design Regulator'!E85/1000000000","v":3.1E-9},"C",{"$f":"'Design Regulator'!F85/1000000000","v":3.9000000000000002E-9},"C","Gate to Drain Charge"]
["Qgs",{"$f":"'Design Regulator'!E86/1000000000","v":2.8999999999999999E-9},"C",{"$f":"'Design Regulator'!F86/1000000000","v":3.8000000000000001E-9},"C","Gate to Source Charge"]
["Qoss",{"$f":"'Design Regulator'!E87/1000000000","v":0},"C",{"$f":"'Design Regulator'!F87/1000000000","v":1.2E-8},"C","Output Charge"]
["Coss",{"$f":"'Design Regulator'!E88/1000000000000","v":2.5899999999999998E-10},"F",{"$f":"'Design Regulator'!F88/1000000000000","v":3.3E-10},"F","Output Capacitance"]
["Rgate",{"$f":"'Design Regulator'!E89","v":0},"W",{"$f":"'Design Regulator'!F89","v":0},"W","Gate Resistance"]
["Gfs",{"$f":"'Design Regulator'!E90","v":71},"S",{"$f":"'Design Regulator'!F90","v":71},"S","Transconductance"]
["Vth",{"$f":"'Design Regulator'!E91","v":3.2},"V",{"$f":"'Design Regulator'!F91","v":3.2},"V","Threshold Voltage"]
["Vsp",{"$f":"Vth_Q1+(Iout/Number_of_Phases)/Gfs_Q1","v":3.3267605633802817},"V",{"$f":"Vth_Q2+(Iout/Number_of_Phases)/Gfs_Q2","v":3.3267605633802817},"V","Switch Point Voltage of FETs"]
[]
["Vsd - Buck",{"$f":"'Design Regulator'!E92","v":0.8},"V",{"$f":"'Design Regulator'!F92","v":0.8},"V","Diode Forward Voltage of MOSFET Body diode"]
["QrrTop",null,"C",{"$f":"'Design Regulator'!F93/1000000000","v":1.3000000000000001E-8},"C","Reverse Recovery Charge of Body Diode"]
["TrrTop",4.0000000000000001E-8,"s",4.0000000000000001E-8,"s","Reverse Recovery Time of Body Diode"]
["θJA-MOSFET",{"$f":"'Design Regulator'!E94","v":50},"°C/W",{"$f":"'Design Regulator'!F94","v":50},"°C/W","Junction-to-Ambient Resistance"]
[]
[]
[]
["Anti-parallel Schottky Diode (optional)"]
["VfdSky",{"$f":"'Design Regulator'!F97","v":0},"V",{"$f":"'Design Regulator'!#REF!","v":{"$error":"#REF!"}},"V","Diode Forward Voltage"]
["QrrSky",{"$f":"'Design Regulator'!F98/1000000000","v":0},"C",{"$f":"'Design Regulator'!#REF!/1000000000","v":{"$error":"#REF!"}},"C","Diode Reverse Recovery Charge"]
["Ireverse",0,"A",0,"A","Reverse Leakage Current"]
[]
["Controller"]
["θJACtrl",34.1,"°C/W",null,null,"Junction-to-ambient thermal resistance of controller"]
["Outputs"]
["Top FET"]
["Tr",{"$f":"(Qgd_Q1+Qgs_Q1/2)*(RdsonDRT+Rgate1)/(VCC-Vsp_Q1)","v":2.7192760942760944E-9},"s"]
["Tf",{"$f":"(Qgd_Q1+Qgs_Q1/2)*(RdsonDRT2+Rgate1)/(Vsp_Q1)","v":6.8384843353090607E-10},"s"]
[]
["IC Power Disipation","Value","Units"]
["Power Dis",{"$f":"CHOOSE(Ext_VCC, (Qg_Q1+Qg_Q2)*Fsw*VCC, (Qg_Q1+Qg_Q2)*Fsw*Vin)","v":3.7399999999999996E-2},"W"]
["Temp rise",{"$f":"B305*ThetaJaCtrl","v":1.2753399999999999},"°C"]
["Junction temperature",{"$f":"B306 + Ta","v":26.27534},"°C"]
[]
["Current (switching)",{"$f":"(Qg_Q1+Qg_Q2)*Fsw+Iq","v":7.515E-3},"A"]
["Qrr Current",{"$f":"Qrr_Q2*Fsw","v":5.7200000000000003E-3},"A"]
["Diode Current",{"$f":"C311/Vin","v":{"$error":"#NAME?"}},{"$f":"Deadtime*Fsw*(Ipp/2)*(Vsd_Q1+Vsd_Q2)","v":{"$error":"#NAME?"}}]
["Total Application Switching IQ",{"$f":"SUM(B309:B311)","v":{"$error":"#NAME?"}},"A"]
[]
["Low-side MOSFET/Diode"]
["Part Power"]
["Power Dis"]
[]
["SCHEMATIC LABELS"]
[{"$f":"\"RC1 = \"&'Design Regulator'!D72&\"kΩ\"","v":"RC1 = 16.2kΩ"},{"$f":"'Design Regulator'!D72&\"kΩ\"","v":"16.2kΩ"},null,{"$f":"'Design Regulator'!D75&\"kΩ\"","v":"kΩ"}]
[{"$f":"\"RC2 = \"&'Design Regulator'!D75&\"kΩ\"","v":"RC2 = kΩ"},{"$f":"'Design Regulator'!D75&\"kΩ\"","v":"kΩ"}]
[]
[{"$f":"\"Lo = \"&'Design Regulator'!E28&\"µH\"","v":"Lo = 6.8µH"},{"$f":"'Design Regulator'!E28&\"µH\"","v":"6.8µH"},null,{"$f":"IF(MODE = 1, 'Design Regulator'!J28&\"µH\", 'Design Regulator'!E28&\"µH\")","v":"µH"}]
[{"$f":"\"Rdcr = \"&Rdcr*1000&\"mΩ\"","v":"Rdcr = 2mΩ"},{"$f":"Rdcr*1000&\"mΩ\"","v":"2mΩ"},null,{"$f":"IF(MODE=1, Rdcr2*1000&\"mΩ\", Rdcr*1000&\"mΩ\")","v":"0mΩ"}]
[{"$f":"\"Rs = \"&'Design Regulator'!E19&\"mΩ\"","v":"Rs = 2mΩ"},{"$f":"'Design Regulator'!E19&\"mΩ\"","v":"2mΩ"},null,{"$f":"IF(MODE = 1, 'Design Regulator'!J19&\"mΩ\", 'Design Regulator'!E19&\"mΩ\")","v":"mΩ"}]
[]
[{"$f":"\"VOUT = \"&'Design Regulator'!E9&\"V\"","v":"VOUT = 12V"},{"$f":"'Design Regulator'!E9&\"V\"","v":"12V"},null,{"$f":"IF(MODE=1, 'Design Regulator'!J10&\"V\", \"\")","v":"V"}]
[]
[{"$f":"\"COUT = \"&'Design Regulator'!$E$37&\"µF\"","v":"COUT = 240µF"},{"$f":"ROUND('Design Regulator'!$E$37/Number_of_Phases, 0)&\"µF\"","v":"240µF"},null,{"$f":"IF(MODE=1, 'Design Regulator'!$J$37&\"µF\", ROUND('Design Regulator'!$E$37/Number_of_Phases, 0)&\"µF\")","v":"µF"}]
["Capacitance per component (Cout)",{"$f":"\"22µF\"","v":"22µF"}]
["# of output caps",{"$f":"ROUNDUP(Cout*1000000/22,0)&\" x\"","v":"11 x"}]
[]
["CIN",{"$f":"Cin*1000000&\"µF\"","v":"20µF"}]
["Capacitance per component (Cin)",{"$f":"\"10µF\"","v":"10µF"}]
["# of input caps",{"$f":"ROUNDUP(Cin*1000000/10,0)&\" x\"","v":"2 x"}]
[]
[{"$f":"\"RC1 = \"&Rcea1_u/1000&\"kΩ\"","v":"RC1 = 16.2kΩ"},{"$f":"ROUND(Rcea1_u/1000,2)&\"kΩ\"","v":"16.2kΩ"}]
[{"$f":"\"CC1 = \"&Cc1ea_u*10^9&\"nF\"","v":"CC1 = 1.8nF"},{"$f":"Cc1ea_u*10^9&\"nF\"","v":"1.8nF"}]
[{"$f":"\"CC2 = \"&IF(Cc2ea_u>0, Cc2ea_u*10^12&\"pF\", \"OPEN\")","v":"CC2 = 12pF"},{"$f":"IF(Cc2ea_u>0, ROUND(Cc2ea_u*10^12,1)&\"pF\", \"N/A\")","v":"12pF"}]
[]
[{"$f":"\"gm = \"&$B$184*1000&\"mS\"","v":"gm = 1.2mS"},{"$f":"$B$184*1000&\"mS\"","v":"1.2mS"}]
[{"$f":"\"RoEA = \"&RoEA/1000000&\"MΩ\"","v":"RoEA = 64MΩ"},{"$f":"RoEA/1000000&\"MΩ\"","v":"64MΩ"}]
[{"$f":"\"GBW = \"&GBW&\"MHz\"","v":"GBW = 6MHz"},{"$f":"GBW&\"MHz\"","v":"6MHz"}]
[]
[{"$f":"\"Cslope = \"&Cslope&\"pF\"","v":{"$error":"#NAME?"}},{"$f":"ROUND(Cslope*1,0)&\"pF\"","v":{"$error":"#NAME?"}}]
["Cd",{"$f":"IF(DITHER=1, ROUND(Cdither*1000000000,1)&\"nF\", \"\")","v":"10nF"},{"$f":"IF(DITHER=1, \"Cd\", \"\")","v":"Cd"}]
[{"$f":"\"RFB1 = \"&'Design Regulator'!E67&\"kΩ\"","v":"RFB1 = 49.9kΩ"},{"$f":"IF(VOUT_setting=1, 'Design Regulator'!E67&\"kΩ\", \"\")","v":"49.9kΩ"},null,{"$f":"'Design Regulator'!J67&\"kΩ\"","v":"kΩ"}]
[{"$f":"\"RFB2 = \"&IF(Vout=Vref,\"OPEN\",'Design Regulator'!E68&\"kΩ\")","v":"RFB2 = 5.49kΩ"},{"$f":"IF(VOUT_setting=1, IF(Vout=Vref,\"OPEN\",Rfb2_u/1000&\"kΩ\"), \"\")","v":"5.49kΩ"},null,{"$f":"IF(Vout2=Vref,\"OPEN\",Rfb4_u/1000&\"kΩ\")","v":"0kΩ"}]
[{"$f":"CHOOSE(BODE_PLOT_TYPE, \"Crossover Frequency = \"&ROUND('Stability Calculations'!Q4,1)&\" kHz\",  \"Crossover Frequency = \"&ROUND(#REF!,1)&\" kHz\")","v":"Crossover Frequency = 40.7 kHz"},{"$f":"CHOOSE(BODE_PLOT_TYPE, ROUND('Stability Calculations'!Q4,1)&\" kHz\", ROUND(#REF!,1)&\" kHz\")","v":"40.7 kHz"},null,{"$f":"'Stability Calculations'!Q4","v":40.738}]
[{"$f":"CHOOSE(BODE_PLOT_TYPE, \"Phase Margin = \"&ROUND('Stability Calculations'!Q5,0)&\"°\", \"Phase Margin = \"&ROUND(#REF!,0)&\"°\")","v":"Phase Margin = 35°"},{"$f":"CHOOSE(BODE_PLOT_TYPE, ROUND('Stability Calculations'!Q5,0)&\"°\", ROUND(#REF!,0)&\"°\")","v":"35°"}]
[]
["Full-load/high line efficiency",{"$f":"IF(PLOT_TYPE=1, ROUND('Efficiency Calculations'!AZ109,1)&\"%\", ROUND(#REF!,1)&\"%\")","v":"98.5%"}]
["Half-load/mid-line efficiency",{"$f":"IF(PLOT_TYPE=1, ROUND('Efficiency Calculations'!AZ59,1)&\"%\", ROUND(#REF!,1)&\"%\")","v":"98.5%"}]
["OSC pin setting",{"$f":"IF(VOUT_setting=1, \"\", IF(OSC=1, \"Tie OSC to VDDA\", \"Tie OSC to AGND\"))","v":""}]
[]
[{"$f":"\"CDITH = \"&Cdither*1000000000&\"nF\"","v":"CDITH = 10nF"},{"$f":"Cdither*1000000000&\"nF\"","v":"10nF"}]
[{"$f":"\"Rs = \"&Rs&\"Ω\"","v":"Rs = 0.002Ω"},{"$f":"'Standard Value Calculator'!O6&\"Ω\"","v":"Ω"}]
["Rset",{"$f":"'Standard Value Calculator'!O16&\"mΩ\"","v":"5.76mΩ"}]
["Rs",{"$f":"'Standard Value Calculator'!O6&\"mΩ\"","v":"mΩ"}]
[{"$f":"\"Rshunt = \"&ROUND(Rshunt,1)&\"mΩ\"","v":{"$error":"#NAME?"}},{"$f":"IF(Rshunt=\"0\", \"N/A\",ROUND(Rshunt,1)&\"mΩ\")","v":{"$error":"#NAME?"}}]
[]
["Rpgood","20kΩ"]
[]
[]
["Rt",{"$f":"IF(No_RT,\"\", Rfadj&\"kΩ\")","v":""},{"$f":"IF(OR((Fsw=440000),(Fsw=2200000)),\"N/A\",Rfadj)","v":"N/A"},{"$f":"Fsw","v":440000},null,{"$f":"OR((Fsw=440000),(Fsw=2200000))","v":true},null,{"$f":"OR(OR(AND(OSC=1, OR(Fsw/1000>2530, Fsw/1000<1800)), AND(OSC=2, OR(Fsw/1000>500, Fsw/1000<300))), OR((Fsw=440000),(Fsw=2200000)))","v":true}]
["Css",{"$f":"'Standard Value Calculator'!B4*1000000000&\"nF\"","v":"56nF"},{"$f":"IF(MODE=1,\"Css\",\"\")","v":"Css"}]
["Cres",{"$f":"IF(Cres_u = 0, \"N/A\", Cres_u*1000000000 &\"nF\")","v":"330nF"},{"$f":"IF(Cres_u = 0, \"N/A\", Cres_u*1000000 &\"µF\")","v":"0.33µF"},{"$f":"Cres_u","v":3.3000000000000002E-7}]
[]
["Blank out",{"$f":"IF(B76=\"y\",\"\",\"|\")","v":"|"}]
["OUTPUT CURRENT",{"$f":"'Design Regulator'!$E$10&\"A\"","v":"9A"},null,{"$f":"IF(MODE=1,'Design Regulator'!$J$11&\"A\",\"\")","v":"A"}]
["VIN",{"$f":"VIN_nom&\"V\"","v":"24V"}]
["VIN range",{"$f":"VIN_min&\"V\"&\"...\"&VIN_max&\"V\"","v":"16V...36V"}]

{"sheet":"Stability Calculations","index":4,"n_rows":687,"n_cols":31,"rows_kept":687,"cut":false,"hidden":true,"merged":[[9,1,10,1],[1,0,1,3],[1,9,1,11],[1,12,1,14],[9,0,11,0],[9,14,9,15],[1,15,1,17],[10,6,10,7],[1,4,1,6],[9,2,9,7],[9,8,9,13],[9,16,9,18],[9,23,9,24],[9,26,9,27],[10,2,10,3],[10,4,10,5],[10,8,10,9],[10,10,10,11],[10,12,10,13],[10,14,10,15]]}
[]
["Divider Network & EA Poles/Zeros",null,null,null,"Modulator",null,null,null,null,"Power Stage Poles/Zeros",null,null,"Complex Pole Pair",null,null,"Total System"]
[null,"Afb1",{"$f":"Afb","v":9.9999999999999992E-2},"V/V","Acs",{"$f":"Acs","v":41.666666666666664},"A/V","gm",{"$f":"gm","v":1.1999999999999999E-3},"z_ESR",{"$f":"Fesr","v":663145.59697398485},"Hz","p3",{"$f":"Fsw/2","v":220000},"Hz","Adc",{"$f":"Am*Afb*AEA","v":255277.20359915221},"V/V"]
[null,"EA zero, z1",{"$f":"Fz1_u","v":5457.9884524607805},"Hz","Am",{"$f":"Am","v":33.239219218639612},"V/V",null,null,"p_dom",{"$f":"Fp_dominant","v":831.27904897019926},"Hz","pterm1",{"$f":"Q*pole3","v":46481.257789678551},null,"Crossover",{"$f":"AE7","v":40.738},"kHz"]
[null,"EA pole, p1",{"$f":"Fp1_u","v":1.3812037098400818},"Hz","Q",{"$f":"Q","v":0.21127844449853886},null,null,null,null,null,null,"pterm2",{"$f":"pole3^2","v":48400000000},null,"Phase Margin",{"$f":"AE9","v":34.528674221764646},"°"]
[null,"Aea",{"$f":"AEA","v":76800},"V/V","mc",{"$f":"mc","v":4.0222222222222221},null,null,null,null,null,null,null,null,null,"radconv",{"$f":"180/Pi","v":57.295779578552292},null,null,null,null,null,null,null,null,null,null,null,null,"XOVER SEARCH"]
[null,"EA pole, p2",{"$f":"Fp2_u","v":224142.31382764954},"Hz","k",{"$f":"k","v":2.0065895023177061},null,null,null,null,null,null,null,null,null,null,null,null,null,null,null,null,null,null,null,null,null,null,null,"xover",{"$f":"SUM(AD12:AD613)/1000","v":40.738}]
[]
[null,null,null,null,null,null,null,null,null,null,null,null,null,null,null,null,null,null,null,null,null,null,null,null,null,null,null,null,null,"phase margin",{"$f":"SUM(AE13:AE613)","v":34.528674221764646}]
["Freq (Hz)",null,"Power Stage",null,null,null,null,null,"Error Amplifier",null,null,null,null,null,"Sampling Double Pole",null,"System Response",null,null,null,null,null,null,"ERROR AMP Response",null,null,"PLANT Response"]
[null,null,"p_dom",null,"z_ESR",null,"z_RHP",null,"p1",null,"z1",null,"p2",null,"p3"]
[null,null,"Gain(V/V)","Phase(rad)","Gain(V/V)","Phase(rad)","Gain(V/V)","Phase(rad)","Gain(V/V)","Phase(rad)","Gain(V/V)","Phase(rad)","Gain(V/V)","Phase(rad)","Gain(V/V)","Phase(rad)","Gain (dB)","Phase (°)","Phase Margin (°)",null,null,"Fsquare",null,"Gain(dB)","Phase(Deg)",null,"Gain(dB)","Phase(Deg)"]
[1,{"$f":"A13/1000","v":1E-3},{"$f":"SQRT(1+(A13/pole1)^2)","v":1.0000007235627111},{"$f":"ATAN(A13/pole1)","v":1.2029648995291265E-3},{"$f":"SQRT(1+(A13/Zero1)^2)","v":1.0000000000011369},{"$f":"ATAN(A13/Zero1)","v":1.5079644719988572E-6},{"$f":"IF(VIN_nom>Vout, 1, SQRT(1+(A13/z_RHP)^2))","v":1},{"$f":"IF(VIN_nom>Vout, 0, -ATAN(A13/z_RHP))","v":0},{"$f":"SQRT(1+(A13/Pole2)^2)","v":1.234578845543032},{"$f":"ATAN(A13/Pole2)","v":0.62665645596303476},{"$f":"SQRT(1+(A13/Zero2)^2)","v":1.0000000167843597},{"$f":"ATAN(A13/Zero2)","v":1.832176812978724E-4},{"$f":"SQRT(1+(A13/pole4)^2)","v":1.0000000000099523},{"$f":"ATAN(A13/pole4)","v":4.4614512222903983E-6},{"$f":"SQRT((1-(V13/pterm2))^2+(A13/pterm1)^2)","v":1.0000000002107661},{"$f":"IF((ATAN((A13/pterm1)/(1-A13^2/pterm2))>0),ATAN((A13/pterm1)/(1-A13^2/pterm2)),PI()+ATAN((A13/pterm1)/(1-A13^2/pterm2)))","v":2.1514047756436417E-5},{"$f":"20*LOG10(((E13*K13*G13)/(C13*I13*O13*M13))*Adc)","v":106.30985791334011},{"$f":"((F13+L13+H13)-(D13+J13+P13+N13))*radconv","v":-35.964599270640342},{"$f":"IF(R13>0,R13,R13+180)","v":144.03540072935965},null,{"$f":"IF(Q13<0,A13,1000000000)","v":1000000000},{"$f":"A13^2","v":1},null,{"$f":"20*LOG10((K13/(I13*M13))*AEA)","v":95.876847924790241},{"$f":"(L13-(J13+N13))*radconv","v":-35.89452819477809},null,{"$f":"20*LOG10((E13*G13/(C13*O13))*Acs*Am)","v":62.828785154317757},{"$f":"(F13+H13-(D13+P13))*radconv","v":-7.0071075862251433E-2},null,{"$f":"SUM((Q14<0)*(Q13>0))*A13","v":0},{"$f":"IF(AD13>0,S11,0)","v":0}]
[1.0965,{"$f":"A14/1000","v":1.0965E-3},1.0000008699482474,1.3190508836071089E-3,1.0000000000013669,1.6534830435464933E-6,1,0,1.2768061550719689,0.67099363689369318,1.0000000201800412,2.0089818708832628E-4,1.0000000000119658,4.8919812652348552E-6,1.0000000002534066,2.3590153364294794E-5,106.01773394038645,-38.510706117014756,141.48929388298524,null,{"$f":"IF(Q14<0,A14,1000000000)","v":1000000000},{"$f":"A14^2","v":1.2023122500000001},null,95.584725223692558,-38.433873189707327,null,62.828783882461785,-7.6832927307432505E-2,null,{"$f":"SUM((Q15<0)*(Q14>0))*A14","v":0},0]
[1.2022999999999999,1.2022999999999999E-3,1.0000010459280291,1.4463243878741563E-3,1.0000000000016436,1.8130256846836137E-6,1,0,1.3257912984217481,0.71626005441165541,1.0000000242622162,2.2028261712627077E-4,1.0000000000143863,5.3640028045438894E-6,1.0000000003046674,2.5866339616023607E-5,105.69072851331799,-41.110610705638443,138.88938929436156,null,1000000000,1.4455252899999997,null,95.257721325606454,-41.026364268938579,null,62.82878235347944,-8.424643669986602E-2,null,0,0]
[1.3183,1.3183000000000001E-3,1.0000012574900736,1.5858680625573224E-3,1.000000000001976,1.9879495634349819E-6,1,0,1.3823851806821976,0.76210042605976058,1.0000000291697884,2.4153586726063505E-4,1.0000000000172962,5.8815311463166366E-6,1.0000000003662932,2.8361969154513554E-5,105.32764861389786,-43.744010696308145,136.25598930369185,null,1000000000,1.7379148900000001,null,94.894643264321132,-43.6516360293421,null,62.828780515344597,-9.2374666966040977E-2,null,0,0]
[1.4454,1.4454000000000001E-3,1.0000015116529883,1.7387645522442829E-3,1.0000000000023754,2.1796118478253486E-6,1,0,1.4474519928024046,0.80810571721851854,1.0000000350655676,2.6482283332042396E-4,1.0000000000207923,6.4485815966519411E-6,1.0000000004403282,3.1096404622627418E-5,104.92814447581308,-46.387523976453949,133.61247602354604,null,1000000000,2.0891811599999999,null,94.495141334503913,-46.286243295744605,null,62.828778307077037,-0.10128068070933234,null,0,0]
[1.5849,1.5849E-3,1.0000018175219754,1.9065776787856245E-3,1.0000000000028559,2.3899728916682497E-6,1,0,1.5220723747558567,0.85396520892687267,1.0000000421607667,2.9038169817643521E-4,1.0000000000249991,7.0709540421371224E-6,1.0000000005294247,3.4097614282287447E-5,104.49151917662961,-49.023425436943462,130.97657456305654,null,1000000000,2.51190801,null,94.058518692829992,-48.912369868478301,null,62.82877564956749,-0.11105556846516171,null,0,0]
[1.7378,1.7378000000000001E-3,1.000002185120773,2.0905103654680441E-3,1.0000000000034337,2.6205406594356019E-6,1,0,1.6071750554322135,0.89923407369442698,1.0000000506879065,3.1839567936294748E-4,1.0000000000300555,7.7531099339923481E-6,1.0000000006365024,3.7387112181043934E-5,104.01895846629863,-51.626288166658959,128.37371183334105,null,1000000000,3.0199488400000001,null,93.585961176340277,-51.504518767733813,null,62.828772455726245,-0.12176939892513988,null,0,0]
[1.9055,1.9055000000000001E-3,1.0000026272032347,2.2922467069786644E-3,1.0000000000041283,2.8734263013880922E-6,1,0,1.7039010839563637,0.94358576182838239,1.0000000609428377,3.4912128143531969E-4,1.000000000036136,8.5012953039259559E-6,1.0000000007652765,4.0995017985477605E-5,103.51133079465532,-54.177486003910936,125.82251399608907,null,1000000000,3.63093025,null,93.078337345679671,-54.043965735533909,null,62.828768614743524,-0.13352026837702707,null,0,0]
[2.0893000000000002,2.0893000000000001E-3,1.0000031584736429,2.5133504847323195E-3,1.0000000000049631,3.1505901713391761E-6,1,0,1.813328063648975,0.9866683084374448,1.0000000732666563,3.8279668712148766E-4,1.0000000000434435,9.3213100385232099E-6,1.0000000009200303,4.4949299957310393E-5,102.97068621205605,-56.656930619530961,123.34306938046905,null,1000000000,4.3651744900000002,null,92.537697378960132,-56.510531354491519,null,62.82876399886382,-0.14639926503943543,null,0,0]
[2.2909000000000002,2.2909000000000002E-3,1.0000037974124882,2.7558666409214783E-3,1.0000000000059672,3.4545958088910579E-6,1,0,1.9367599966358837,1.0282407666995699,1.0000000880880557,4.1973336613293591E-4,1.0000000000522318,1.0220738604856989E-5,1.0000000011061467,4.9286531977242045E-5,102.39869232172396,-59.050918481377167,120.94908151862283,null,1000000000,5.2482228100000006,null,91.965709039968871,-58.890392977258685,null,62.828758447522958,-0.16052550411848246,null,0,0]
[2.5118999999999998,2.5118999999999996E-3,1.0000045654126193,3.0217197918030406E-3,1.0000000000071738,3.7878559571986843E-6,1,0,2.0754322488474415,1.0680574361135922,1.000000105903289,4.6022446630898488E-4,1.0000000000627953,1.1206719324876454E-5,1.0000000013298576,5.4041136521050791E-5,101.79803071540388,-61.3454677069656,118.65453229303441,null,1000000000,6.309641609999999,null,91.365054106317928,-61.169456614940017,null,62.828751774853828,-0.17601109202558157,null,0,0]
[2.7542,2.7542000000000001E-3,1.0000054886569876,3.3131954011647482E-3,1.0000000000086247,4.1532357487585205E-6,1,0,2.2307546750469123,1.1059574423385869,1.0000001273197272,5.0461810064516925E-4,1.0000000000754943,1.2287728955895308E-5,1.00000000159879,5.925399027863402E-5,101.17115785705353,-63.531474541126968,116.46852545887303,null,1000000000,7.5856176399999997,null,90.738189269449265,-63.338485387035,null,62.828743753372123,-0.19298915409196421,null,0,0]
[3.02,3.0200000000000001E-3,1.0000065991619627,3.6329397661228526E-3,1.0000000000103697,4.5540527054085181E-6,1,0,2.4043244784835349,1.1418451383752335,1.0000001530800628,5.5331734724305744E-4,1.0000000000907687,1.3473582690591078E-5,1.0000000019222699,6.4972424153937871E-5,100.52032310828554,-65.603590425603201,114.3964095743968,null,1000000000,9.1204000000000001,null,90.087364169141196,-65.391976591848277,null,62.828734104912215,-0.21161383375494233,null,0,0]
[3.3113000000000001,3.3113000000000001E-3,1.0000079336250209,3.9833585249834467E-3,1.0000000000124665,4.9933227560921005E-6,1,0,2.5976016799319264,1.1756204752236055,1.0000001840355814,6.0668864043536856E-4,1.0000000001091238,1.4773203431393476E-5,1.0000000023109872,7.1239466241031121E-5,99.848722213330632,-67.556202616501722,112.44379738349828,null,1000000000,10.964707690000001,null,89.415774868459067,-67.32417736003687,null,62.828722510639437,-0.23202525646484096,null,0,0]
[3.6307999999999998,3.6308E-3,1.0000095384743619,4.3676992899759409E-3,1.0000000000149885,5.4751174048828916E-6,1,0,2.8125037157528472,1.2072884329675175,1.0000002212632997,6.6522666657308762E-4,1.0000000001311979,1.6198637096582636E-5,1.0000000027784663,7.8113204466909037E-5,99.158297624968625,-69.389757967734667,110.61024203226533,null,1000000000,13.182708639999998,null,88.725364223558131,-69.1353453761255,null,62.828708567178396,-0.2544125916091744,null,0,0]
[3.9811000000000001,3.9811000000000004E-3,1.000011467797552,4.7890892581461172E-3,1.0000000000180203,6.0033573594070806E-6,1,0,3.0508833634055619,1.2368499656498941,1.000000266017921,7.2940778981969495E-4,1.0000000001577352,1.7761483459310408E-5,1.0000000033404628,8.5649575353203319E-5,98.45163125483856,-71.104466668376389,108.89553333162361,null,1000000000,15.849157210000001,null,88.018714615995449,-70.825508673709194,null,62.82869180461099,-0.27895799466719035,null,0,0]
[4.3651999999999997,4.3651999999999996E-3,1.0000137873764465,5.2511366462213603E-3,1.0000000000216651,6.5825665130793258E-6,1,0,3.3148647908944837,1.264351054705716,1.0000003198254377,7.9978166082367828E-4,1.0000000001896403,1.9475126873209081E-5,1.0000000040161394,9.3913121039824234E-5,97.730807286920367,-72.703142709177271,107.29685729082273,null,1000000000,19.054971039999998,null,87.297910801266326,-72.397271069155877,null,62.828671651421928,-0.3058716400213945,null,0,0]
[4.7862999999999998,4.7862999999999994E-3,1.0000165757263195,5.7576900507842355E-3,1.0000000000260467,7.217570352208272E-6,1,0,3.6067129459784053,1.289854402165296,1.0000003845072458,8.7693457301673704E-4,1.0000000002279932,2.1353843982144524E-5,1.0000000048283675,1.0297268647517753E-4,96.997868423959545,-74.189570054083987,105.81042994591601,null,1000000000,22.908667689999998,null,86.564996164253955,-73.854192350025727,null,62.82864742547347,-0.33537770405825745,null,0,0]
[5.2481,5.2481000000000003E-3,1.0000199285733948,6.3131992592739602E-3,1.0000000000313154,7.9139483453379823E-6,1,0,3.9290445940607608,1.3134503787646066,1.0000004622840213,9.6154442764089377E-4,1.000000000274111,2.3414142155578873E-5,1.0000000058050329,1.1290787363010231E-4,96.254332382609661,-75.569147865004837,104.43085213499516,null,1000000000,27.542553609999999,null,85.821489253269633,-75.201412483009776,null,62.828618295107894,-0.36773538199504324,null,0,0]
[5.7544000000000004,5.7544000000000007E-3,1.0000239591400628,6.9222339899214719E-3,1.000000000037649,8.6774307574590044E-6,1,0,4.2845534209288694,1.3352270752004249,1.0000005557823533,1.0543074464140897E-3,1.0000000003295508,2.5672974908077841E-5,1.0000000069791186,1.2380043587840135E-4,95.501926094191262,-76.84715062925585,103.15284937074415,null,1000000000,33.113119360000006,null,85.069117983283249,-76.443939774052311,null,62.828583276675893,-0.40321085520353328,null,0,0]
[6.3095999999999997,6.3095999999999994E-3,1.0000288053883764,7.590085234643819E-3,1.0000000000452642,9.5146526322440851E-6,1,0,4.6763611307289334,1.3552906009976944,1.0000006682027982,1.1560297798776634E-3,1.0000000003962104,2.8149972624914725E-5,1.0000000083908149,1.3574503502002764E-4,94.741835365782094,-78.0299211055721,101.9700788944279,null,1000000000,39.811052159999996,null,84.309069359937297,-77.587808786820105,null,62.828541171612699,-0.44211231875198342,null,0,0]
[6.9183000000000003,6.9183000000000005E-3,1.0000346312043824,8.3222839387103505E-3,1.0000000000544191,1.0432550606259115E-5,1,0,5.1077389837162146,1.3737421772104625,1.0000008033473879,1.2675542198489057E-3,1.0000000004763443,3.0865657981574665E-5,1.000000010087865,1.4884063566131614E-4,93.975372848865518,-79.123533893238786,100.87646610676121,null,1000000000,47.862874890000008,null,83.542657458471496,-78.638771947963122,null,62.82849055616191,-0.48476194527567829,null,0,0]
[7.5857999999999999,7.5858000000000002E-3,1.0000416361025941,9.1252022451856606E-3,1.0000000000654268,1.1439116891198652E-5,1,0,5.5824624441245083,1.3906917916253376,1.0000009658448006,1.3898518074205262E-3,1.0000000005726972,3.3843676669353601E-5,1.0000000121283932,1.6320126223768198E-4,93.203371115224002,-80.13460771857909,99.86539228142091,null,1000000000,57.544361639999998,null,82.770716583910854,-79.603076811701072,null,62.828429697081035,-0.53153090687800841,null,0,0]
[8.3176000000000005,8.3176000000000014E-3,1.0000500566206529,1.0005451782684157E-2,1.0000000000786589,1.2542645291649475E-5,1,0,6.1044580252567044,1.40623996036886,1.0000011611827864,1.5239302233076755E-3,1.0000000006885228,3.7108566669735432E-5,1.0000000145813102,1.7894524198860362E-4,92.426873617590317,-81.069230524361117,98.930769475638883,null,1000000000,69.182469760000004,null,81.994292243805518,-80.486426197934975,null,62.828356539552679,-0.5828043264261521,null,0,0]
[9.1201000000000008,9.1201000000000008E-3,1.0000601814250096,1.0970725317371336E-2,1.0000000000945697,1.375278678022014E-5,1,0,6.6783023902930152,1.4204923870822881,1.0000013960586915,1.670962038728116E-3,1.0000000008277925,4.0688881270225998E-5,1.0000000175307173,1.9621026478895315E-4,91.646408333520782,-81.933841234839235,98.066158765160765,null,1000000000,83.176224010000013,null,81.213914923302184,-81.294810931795823,null,62.828268575986463,-0.63903030304339814,null,0,0]
[10,0.01,1.0000723536797531,1.2029074567621411E-2,1.0000000001136979,1.5079644718856987E-5,1,0,7.3087955633084034,1.4335443556176661,1.000001678434566,1.8321747833564567E-3,1.0000000009952272,4.4614512193598939E-5,1.0000000210765965,2.1514047471832769E-4,90.862710345160437,-82.734299602446015,97.265700397553985,null,1000000000,100,null,80.430322685430355,-82.03362175626765,null,62.828162825497948,-0.70067784617835749,null,0,0]
[10.965,1.0964999999999999E-2,1.0000869910788612,1.318975156118333E-2,1.0000000001367004,1.6534830433973124E-5,1,0,8.001462101576589,1.4454915173214284,1.0000020180020968,2.0089791951615164E-3,1.000000001196574,4.8919812613714678E-5,1.0000000253406502,2.3590152989091747E-4,90.076115361141561,-83.47654611297672,96.52345388702328,null,1000000000,120.23122499999999,null,79.64385486695339,-82.708260228772332,null,62.828035659956043,-0.76828588420438571,null,0,0]
[12.023,1.2022999999999999E-2,1.0001045873883492,1.4462245588267338E-2,1.000000000164353,1.8130256844869494E-5,1,0,8.7619778986871744,1.4564176146941425,1.0000024262187057,2.2028226438736234E-3,1.0000000014386263,5.3640027994508046E-5,1.0000000304667533,2.5866339121395269E-4,89.287310019433335,-84.16585070128744,95.83414929871256,null,1000000000,144.55252899999999,null,78.855202394493006,-83.323443532403019,null,62.827882790708202,-0.84240716888440503,null,0,0]
[13.183,1.3183E-2,1.0001257411810072,1.5857364643394014E-2,1.000000000197597,1.9879495631757248E-5,1,0,9.5968160749789924,1.4664056058480248,1.0000029169746179,2.4153540225595569E-3,1.0000000017296204,5.8815311396025778E-5,1.0000000366293307,2.8361968502460088E-4,88.496630144692119,-84.80750391192079,95.19249608807921,null,1000000000,173.79148899999998,null,78.064706291341167,-83.883832642858707,null,62.827699019118825,-0.92367126906208985,null,0,0]
[14.454000000000001,1.4454E-2,1.000151153989322,1.7385911087446457E-2,1.0000000002375353,2.1796118474836437E-5,1,0,10.512455809503562,1.4755270264451112,1.0000035065506685,2.6482222043624887E-3,1.0000000020792101,6.4485815878026899E-5,1.0000000440328281,3.1096403763209118E-4,87.704874263216496,-85.406141509587954,94.593858490412046,null,1000000000,208.91811600000003,null,77.273171176117344,-84.393434078792112,null,62.827478252867039,-1.0127074307958635,null,0,0]
[15.849,1.5848999999999999E-2,1.0001817358487539,1.9063490223772805E-2,1.0000000002855987,2.389972891217752E-5,1,0,11.518265121080228,1.4838682594633119,1.0000042160678813,2.9038089016133039E-3,1.0000000024999196,7.0709540304704233E-5,1.0000000529424711,3.4097613149245369E-4,86.910957009616695,-85.967488754821261,94.032511245178739,null,1000000000,251.19080099999999,null,76.479519585938704,-84.857064081290289,null,62.827212589445878,-1.1104246735309728,null,0,0]
[17.378,1.7378000000000001E-2,1.0002184884474385,2.0902089553569009E-2,1.0000000003433616,2.6205406588417381E-5,1,0,12.621456567304497,1.4914830401288439,1.0000050687779283,3.1839461420794094E-3,1.0000000030055356,7.753109918612863E-5,1.0000000636502422,3.7387110687424991E-4,86.116197024367267,-86.495220333917231,93.504779666082769,null,1000000000,301.99488400000001,null,75.685078858341356,-85.277699040794175,null,62.826893331793784,-1.2175212931230506,null,0,0]
[19.055,1.9054999999999999E-2,1.0002626861665633,2.2918493672075508E-2,1.0000000004128289,2.8734263006051778E-5,1,0,13.832132532287536,1.4984377690811934,1.0000060942653826,3.4911987720044751E-3,1.000000003613601,8.5012952836505665E-5,1.0000000765276502,4.0995016016379804E-4,85.320228724418172,-86.993975081278123,93.006024918721877,null,1000000000,363.09302500000001,null,74.88949447381286,-85.659000057555048,null,62.826509416373213,-1.334975023723074,null,0,{"$f":"IF(AD45>0,S43,0)","v":0}]
[20.893000000000001,2.0893000000000002E-2,1.0003157979988924,2.5128267520935728E-2,1.0000000004963108,3.1505901703071521E-5,1,0,15.159678975548728,1.5047839367158276,1.0000073266390594,3.8279483608636791E-3,1.0000000043443409,9.3213100117965422E-5,1.0000000920030188,4.4949297361680102E-4,84.523760834136269,-87.467476755341778,92.532523244658222,null,1000000000,436.51744900000006,null,74.093487907341768,-86.003784183132296,null,62.826048092562388,-1.4636925722094816,null,0,0]
[22.909000000000002,2.2909000000000002E-2,1.0003796698952208,2.7551762548653425E-2,1.0000000005967116,3.4545958075305359E-5,1,0,16.616375310425042,1.5105783427467974,1.0000088087671697,4.1973092590799023E-3,1.0000000052231748,1.0220738569623085E-4,1.0000001106146701,4.9286528555409078E-4,83.726293182479381,-87.919991185018276,92.080008814981724,null,1000000000,524.82228100000009,null,73.29657500786395,-86.315131707866215,null,62.825493340383318,-1.6048594771520734,null,0,0]
[25.119,2.5118999999999999E-2,1.0004564381361816,3.0208097941858084E-2,1.0000000007173926,3.787855955405214E-5,1,0,18.213783296053428,1.5158652306545071,1.0000105902733878,4.6022124955708713E-3,1.0000000062795278,1.1206719278430336E-4,1.0000001329857637,5.4041132010314514E-4,82.928364488634116,-88.355003278271283,91.644996721728717,null,1000000000,630.96416099999999,null,72.499313029110183,-86.595413750827831,null,62.82482662529182,-1.7595895274434423,null,0,0]
[27.542000000000002,2.7542000000000001E-2,1.0005487166600306,3.3119959817267723E-2,1.0000000008624683,4.1532357463943775E-5,1,0,19.96563652940636,1.5206893054938455,1.0000127318924859,5.046138603526016E-3,1.000000007549414,1.2287728894670307E-4,1.000000159878992,5.9253984332607976E-4,82.129921818886032,-88.776201480746181,91.223798519253819,null,1000000000,758.56176400000004,null,71.701671710144225,-86.846997159949396,null,62.824025274509687,-1.9292043207967697,null,0,0]
[30.2,3.0199999999999998E-2,1.0006597007711648,3.6313587106987746E-2,1.0000000010369698,4.5540527022917238E-5,1,0,21.887841825623472,1.5250929529360391,1.0000153078902967,5.5331175702339041E-3,1.0000000090768715,1.3473582609874413E-4,1.0000001922269757,6.4972416314928267E-4,81.33058486736843,-89.18731763276287,90.81268236723713,null,1000000000,912.04,null,70.903298451720843,-87.072085177733868,null,62.823061581415459,-2.1152324550289929,null,0,0]
[33.113,3.3112999999999997E-2,1.0007930511841228,3.9812747458017272E-2,1.0000000012466637,4.9933227519836045E-5,1,0,23.994862966029132,1.5291086662460831,1.0000184033904951,6.0668127154656758E-3,1.000000010912377,1.4773203324994373E-4,1.0000002310986971,7.1239455907804946E-4,80.531147327137731,-89.591393392017153,90.408606607982847,null,1000000000,1096.470769,null,70.105018673549424,-87.272334750813755,null,62.821903819356194,-2.3190586412033993,null,0,0]
[36.308,3.6308E-2,1.0009533975019218,4.3649527954695982E-2,1.0000000014988455,5.4751173994666966E-5,1,0,26.306229587539853,1.5327733560366716,1.0000221260876418,6.6521695227476415E-3,1.0000000131197921,1.6198636956317621E-4,1.0000002778465971,7.8113190844707452E-4,79.730981061751578,-89.992136530837115,90.007863469162885,null,1000000000,1318.2708640000001,null,69.306244347320586,-87.449584247985698,null,62.820511880198858,-2.5425522828514096,null,0,0]
[39.811,3.9810999999999999E-2,1.0011461295242916,4.7854694993216533E-2,1.000000001802015,6.0033573522671079E-5,1,0,28.840751198789594,1.5361162148612617,1.0000266014418095,7.2939498388271268E-3,1.0000000157735145,1.776148327440414E-4,1.0000003340462418,8.5649557395551211E-4,78.930387892724355,-90.392746059164949,89.607253940835051,null,1000000000,1584.9157210000001,null,68.507323957372265,-87.605240091815261,null,62.818839101119977,-2.7875059673496776,null,0,0]
[43.652000000000001,4.3652000000000003E-2,1.0013777979856002,5.2463661783822696E-2,1.000000002166509,6.5825665036669411E-5,1,0,31.620133747205958,1.5391656329593133,1.0000319820374626,7.9976477929744622E-3,1.0000000189640281,1.9475126629453363E-4,1.0000004016138626,9.3913097366856964E-4,78.12928161335762,-90.796604911370608,89.203395088629392,null,1000000000,1905.497104,null,67.708227972238944,-87.740621801452832,null,62.816828806886555,-3.0559831099177757,null,0,0]
[47.863,4.7863000000000003E-2,1.0016562148458736,5.7514036527468303E-2,1.000000002604666,7.2175703398006947E-5,1,0,34.667532757160885,1.5419468919228416,1.0000384499927795,8.7691231965576853E-3,1.0000000227993324,2.1353843660821295E-4,1.0000004828366378,1.0297265526904385E-3,77.327737781133536,-91.207025524820168,88.792974475179832,null,1000000000,2290.8667689999997,null,66.909099476821154,-87.856850342873244,null,62.814413470080268,-3.3501751819469434,null,0,0]
[52.481000000000002,5.2481E-2,1.0019908953646972,6.3049154045238795E-2,1.0000000031315288,7.9139483289813634E-5,1,0,38.009724311178701,1.5444842338989215,1.0000462273443269,9.615150918314809E-3,1.0000000274111023,2.3414141731985968E-4,1.0000005805031318,1.1290783249179011E-3,76.525467040231774,-91.627543472659568,88.372456527340432,null,1000000000,2754.255361,null,66.109731286318606,-87.954935975428498,null,62.811510919681041,-3.6726074972310738,null,0,0]
[57.544000000000004,5.7544000000000005E-2,1.0023930792940485,6.9113192117024519E-2,1.0000000037648902,8.6774307358970855E-5,1,0,41.674210270613735,1.5467983677783239,1.000055576706379,1.0542687752726475E-2,1.0000000329550816,2.5672974349681563E-4,1.0000006979116258,1.2380038164832138E-3,75.722608315728067,-92.061531163546519,87.938468836453481,null,1000000000,3311.3119360000005,null,65.310359260804915,-88.035676349840244,null,62.808024220691038,-4.0258548137062826,null,0,0]
[63.095999999999997,6.3095999999999999E-2,1.0028764433619377,7.5757049903795851E-2,1.0000000045264308,9.5146526038195899E-5,1,0,45.692836883905976,1.5489093109537257,1.0000668180698036,1.1559788014523937E-2,1.0000000396210471,2.8149971888796028E-4,1.0000008390811479,1.3574496352999222E-3,74.918902382938285,-92.512652020880722,87.487347979119278,null,1000000000,3981.1052159999995,null,64.510841961775455,-88.099768147361857,null,62.803835586930717,-4.4128838735188545,null,0,0]
[69.183000000000007,6.9183000000000008E-2,1.0034572042735534,8.3033407152508856E-2,1.0000000054419056,1.0432550568788965E-4,1,0,50.098899714239586,1.5508344828955858,1.0000803315444833,1.2674870194282976E-2,1.0000000476344411,3.0865657011197578E-4,1.0000010087860141,1.4884054142070119E-3,74.114388406365961,-92.984504575995786,87.015495424004214,null,1000000000,4786.2874890000012,null,63.711357952236504,-88.147738844771823,null,62.798805619897344,-4.8367657312239496,null,0,0]
[75.858000000000004,7.5858000000000009E-2,1.0041550646564998,9.1002509297604464E-2,1.0000000065426697,1.1439116841802693E-4,1,0,54.930762729148938,1.5525905857137352,1.0000965798628754,1.3897632205351309E-2,1.000000057269721,3.3843675390129828E-4,1.0000012128385827,1.632011380026725E-3,73.308740293774051,-93.481016247879779,86.518983752120221,null,1000000000,5754.4361640000006,null,62.911750157420627,-88.180003300940783,null,62.792765302121296,-5.3010129469389886,null,0,0]
[83.176000000000002,8.3176E-2,1.0049933207226454,9.9725936072494165E-2,1.0000000078658975,1.2542645226534428E-4,1,0,60.228239042928173,1.5541920566440937,1.0001161116051025,1.5238134485215596E-2,1.0000000688522837,3.7108564983429206E-4,1.0000014581299712,1.7894507821881193E-3,72.501969138318984,-94.006043169856298,85.993956830143702,null,1000000000,6918.2469760000004,null,62.1122289680957,-88.196826347161277,null,62.785515335991171,-5.809216822695026,null,0,0]
[91.201000000000008,9.1201000000000004E-2,1.006000321661132,0.10927461984304164,1.0000000094569572,1.375278669438086E-4,1,0,66.037658056743211,1.555652873027018,1.0001395962230546,1.6708081022918705E-2,1.0000000827792497,4.0688879047217388E-4,1.0000017530702188,1.962100488960583E-3,71.693641590046525,-94.563869439512899,85.436130560487101,null,1000000000,8317.6224010000005,null,61.312602851358584,-88.198354596679764,null,62.776813904455807,-6.3655148428331447,null,0,0]
[100,0.1,1.0072096402716431,0.11972125406426241,1.0000000113697842,1.5079644605698464E-4,1,0,72.407522113546051,1.5569851679143192,1.0001678295140841,1.8319718619949261E-2,1.0000000995227301,4.4614509263094833E-4,1.000002107657485,2.1514019011540041E-3,70.883608040772444,-95.158747491704503,84.841252508295497,null,1000000000,10000,null,60.513007451078877,-88.184598658791785,null,62.766375755461453,-6.9741488329127259,null,0,0]
[109.65,0.10965000000000001,1.0086619713843861,0.13114804833331187,1.0000000136700309,1.6534830284792242E-4,1,0,79.393573897996589,1.5582005159024064,1.0002017800557113,2.0087116877571448E-2,1.0000001196573964,4.8919808750327518E-4,1.0000025340618779,2.3590115468900201E-3,70.071350217563634,-95.795352578299585,84.204647421700415,null,1000000000,12023.122500000001,null,59.713268781192369,-88.155435263136624,null,62.75385660213913,-7.6399173151629673,null,0,0]
[120.23,0.12023,1.0104051521652051,0.14363650934298339,1.0000000164353104,1.8130256648205071E-4,1,0,87.053004943587396,1.5593088199042491,1.0002425927392702,2.2024700076180018E-2,1.00000014386262,5.3640022901423892E-4,1.0000030466707803,2.5866289658741776E-3,69.256733604257619,-96.478206378507593,83.521793621492407,null,1000000000,14455.252900000001,null,58.913654690703467,-88.110625548565295,null,62.738854079322039,-8.3675808299422858,null,0,0]
[131.83000000000001,0.13183,1.0124968233460616,0.15727716987487719,1.0000000197597172,1.9879495372500532E-4,1,0,95.450971067336553,1.5603195523540243,1.0002916553557883,2.4148891805650691E-2,1.0000001729620283,5.8815304681968333E-4,1.000003662926505,2.8361903297399573E-3,68.439260039324083,-97.212223931162868,82.787776068837132,null,1000000000,17379.148900000004,null,58.114148794524837,-88.049794249147723,null,62.720886410567132,-9.1624296820151336,null,0,0]
[144.54,0.14454,1.01500398157703,0.17215547028538644,1.0000000237535387,2.1796118133131378E-4,1,0,104.65262879964611,1.5612407596794213,1.0003505942234792,2.6476095779259037E-2,1.0000002079210015,6.4485807028777625E-4,1.0000044032733038,3.1096317821831983E-3,67.618887761925805,-98.001947933702951,81.998052066297049,null,1000000000,20891.811599999997,null,57.315264444082381,-87.972485533629239,null,62.699398483611319,-10.029462400073699,null,0,0]
[158.49,0.15849000000000002,1.0180130021481295,0.18839694257525733,1.0000000285598518,2.3899728461679537E-4,1,0,114.75209427260721,1.5620817785883814,1.0004215188378143,2.9030012950196249E-2,1.0000002499919241,7.0709528638009025E-4,1.0000052942333646,3.4097499845755757E-3,66.793574357813867,-98.85393006504539,81.14606993495461,null,1000000000,25119.080100000003,null,56.515670317236925,-87.877909622185328,null,62.673679206344836,-10.976020442860056,null,0,0]
[173.78,0.17377999999999999,1.021617571896591,0.20608343097885423,1.0000000343361661,2.6205405994553888E-4,1,0,125.82176516022727,1.562848492596135,1.0005067506793164,3.1828816344242949E-2,1.0000003005535232,7.753108380665018E-4,1.000006365004358,3.7386961326667978E-3,65.963700986532487,-99.772295693866013,80.227704306133987,null,1000000000,30199.488400000002,null,55.716506783013486,-87.765387939837638,null,62.642969369286881,-12.006907754028386,null,0,0]
[190.55,0.19055000000000002,1.0259357356651877,0.2253322697650032,1.0000000412828927,2.8734262223137699E-4,1,0,137.96299880430522,1.5635479430598977,1.0006092428068767,3.489795563071741E-2,1.0000003613600439,8.5012932561123148E-4,1.0000076527363051,4.0994819108402655E-3,65.127805963692424,-100.76290910774591,79.237090892254088,null,1000000000,36309.302500000005,null,54.917258951324797,-87.63390155495253,null,62.606322178135514,-13.12900755279338,null,0,0]
[208.93,0.20893,1.0311011456768344,0.24623528187096036,1.0000000496310908,3.150590067104786E-4,1,0,151.26991328142361,1.5641855787485111,1.0007323983862313,3.8260989513070588E-2,1.0000004344340099,9.3213073391312654E-4,1.0000092002603735,4.4949037801509098E-3,64.28544007766024,-101.83017597474827,78.169824025251728,null,1000000000,43651.744900000005,null,54.118528671700972,-87.48244607539543,null,62.562686571727149,-14.347729899352846,null,0,0]
[229.09,0.22909000000000002,1.0372793230210957,0.26891219442384429,1.0000000596711591,3.4545956714783152E-4,1,0,165.86558668298341,1.5647673121078014,1.0008804929627577,4.1948716100859623E-2,1.0000005223173518,1.0220735046234774E-3,1.0000110614070434,4.9286186376641039E-3,63.43474487915045,-102.97976860273931,77.020231397260687,null,1000000000,52482.2281,null,53.319738579673199,-87.309639113168203,null,62.510781465245138,-15.670129489571123,null,0,0]
[251.19,0.25119000000000002,1.0446571020260758,0.29344908556439631,1.0000000717392612,3.7878557760581515E-4,1,0,181.86585769615883,1.565297740904394,1.0010584727641907,4.598999825055846E-2,1.000000627952593,1.1206714633822028E-3,1.0000132984896712,5.4040680943865417E-3,62.574810526550735,-104.21545288365473,75.784547116345266,null,1000000000,63096.416100000002,null,52.521384359333609,-87.114131280227937,null,62.449201332984998,-17.101321603426804,null,0,0]
[275.42,0.27542,1.0534578496567648,0.3199381392945661,1.0000000862468321,4.1532355099801305E-4,1,0,199.40828519005063,1.5657814690093956,1.0012723878681877,5.0419047770076622E-2,1.0000007549411296,1.2287722772175694E-3,1.000015987773907,5.9253389741380979E-3,61.703933549083978,-105.54108047144931,74.458919528550695,null,1000000000,75856.176400000011,null,51.72339866279561,-86.894274734497031,null,62.37631005205624,-18.646805736952277,null,0,0]
[302,0.30199999999999999,1.0639472142656843,0.348469982056276,1.0000001036969748,4.5540523906123639E-4,1,0,218.65214835064214,1.566222836464765,1.0015296308609618,5.5275375961173927E-2,1.0000009076867407,1.3473574538216673E-3,1.0000192225164113,6.4971632432001061E-3,60.819866170624898,-106.96013706398533,73.039862936014671,null,1000000000,91204,null,50.925417593659944,-86.648110547474786,null,62.290223742732834,-20.312026516510556,null,0,0]
[331.13,0.33112999999999998,1.0764168011707362,0.37907276278289886,1.000000124666353,4.9933223411340781E-4,1,0,239.74224674815164,1.5666251683389703,1.00183866563809,6.0594600559645349E-2,1.0000010912371029,1.4773192685097949E-3,1.000023109607892,7.1238422613767406E-3,59.92148656158566,-108.47266553620165,71.527334463798354,null,1000000000,109647.0769,null,50.128279284725636,-86.373839609221847,null,62.188982442627903,-22.098825926979803,null,0,0]
[363.08,0.36307999999999996,{"$f":"SQRT(1+(A77/pole1)^2)","v":1.091224265247084},{"$f":"ATAN(A77/pole1)","v":0.41179982889343369},{"$f":"SQRT(1+(A77/Zero1)^2)","v":1.0000001498845417},{"$f":"ATAN(A77/Zero1)","v":5.4751168578473486E-4},{"$f":"IF(VIN_nom>Vout, 1, SQRT(1+(A77/z_RHP)^2))","v":1},{"$f":"IF(VIN_nom>Vout, 0, -ATAN(A77/z_RHP))","v":0},{"$f":"SQRT(1+(A77/Pole2)^2)","v":262.87406017185435},{"$f":"ATAN(A77/Pole2)","v":1.566992214623355},{"$f":"SQRT(1+(A77/Zero2)^2)","v":1.0022101907707441},{"$f":"ATAN(A77/Zero2)","v":6.642480933487506E-2},{"$f":"SQRT(1+(A77/pole4)^2)","v":1.0000013119783586},{"$f":"ATAN(A77/pole4)","v":1.6198622929838259E-3},{"$f":"SQRT((1-(V77/pterm2))^2+(A77/pterm1)^2)","v":1.0000277842812617},{"$f":"IF((ATAN((A77/pterm1)/(1-A77^2/pterm2))>0),ATAN((A77/pterm1)/(1-A77^2/pterm2)),PI()+ATAN((A77/pterm1)/(1-A77^2/pterm2)))","v":7.8111828669843592E-3},{"$f":"20*LOG10(((E77*K77*G77)/(C77*I77*O77*M77))*Adc)","v":59.005930589203295},{"$f":"((F77+L77+H77)-(D77+J77+P77+N77))*radconv","v":-110.07956049874812},{"$f":"IF(R77>0,R77,R77+180)","v":69.920439501251877},null,1000000000,131827.0864,null,{"$f":"20*LOG10((K77/(I77*M77))*AEA)","v":49.331434634097278},{"$f":"(L77-(J77+N77))*radconv","v":-86.068990569055288},null,{"$f":"20*LOG10((E77*G77/(C77*O77))*Acs*Am)","v":62.07027112087389},{"$f":"(F77+H77-(D77+P77))*radconv","v":-24.010569929692824},null,0,{"$f":"IF(AD77>0,S75,0)","v":0}]
[398.11,{"$f":"A78/1000","v":0.39811000000000002},1.108763845977556,0.44663581224613574,1.0000001802014817,6.0033566382700315E-4,1,0,288.2358287427993,1.5673269385149118,1.002656650666407,7.2811846221212964E-2,1.0000015773502295,1.7761464783812096E-3,1.0000334040771333,8.5647761702132112E-3,58.071242769551063,-111.77784888006671,68.222151119933287,null,{"$f":"IF(Q78<0,A78,1000000000)","v":1000000000},{"$f":"A78^2","v":158491.57210000002},null,48.535296193252286,-85.731173002004041,null,61.931721742066657,-26.046675878062658,null,{"$f":"SUM((Q79<0)*(Q78>0))*A78","v":0},0]
[436.52,0.43651999999999996,1.1294907834280583,0.48353988581449497,1.0000002166508861,6.5825655624286326E-4,1,0,316.04475287389175,1.5676322126638704,1.0031931567637344,7.9808307549713881E-2,1.000001896401036,1.9475102253936757E-3,1.0000401605955673,9.3910730183910593E-3,57.114942965417526,-113.56276287790361,66.437237122096391,null,1000000000,190549.71039999998,null,47.739927461071836,-85.357614635722754,null,61.77079067011357,-28.205148242180844,null,0,0]
[478.63,0.47863,1.1539138936403823,0.5224167939018074,1.000000260466575,7.2175690990432771E-4,1,0,346.5325132608516,1.5679105906817004,1.0038377091921158,8.7469719427767531E-2,1.0000022799306656,2.135381152858619E-3,1.0000482825209212,1.0296953483599913E-2,56.134726070541987,-115.42625799013534,64.57374200986466,null,1000000000,229086.67689999999,null,46.945594949197215,-84.945362166295624,null,61.584906287112645,-30.480895823839713,null,0,0]
[524.80999999999995,0.52481,1.1826138166682927,0.56313707519510081,1.000000313152843,7.9139466933199473E-4,1,0,379.96699096261096,1.5681645161950546,1.0046122050632829,9.5859767617057126E-2,1.0000027411065087,2.3414099372834709E-3,1.0000580486612256,1.1290371894636579E-2,55.127908034933455,-117.35792607244083,62.642073927559167,null,1000000000,275425.53609999997,null,46.152252201906535,-84.491001254650413,null,61.3714309987948,-32.866924817790412,null,0,0]
[575.44000000000005,0.57544000000000006,1.216218953009877,0.60549515396233833,1.0000003764889518,8.6774285797061688E-4,1,0,416.62330727880885,1.5683960747141048,1.0055424656138663,0.10504272465135643,1.0000032955027744,2.5672918510274952E-3,1.0000697887748766,1.2379495909326209E-2,54.092510907444364,-119.3429577214425,60.657042278557498,null,1000000000,331131.19360000006,null,45.360332858184989,-83.991065978741588,null,61.127953215027247,-35.351891742700914,null,0,0]
[630.96,0.63096000000000008,1.2554346120085191,0.649250925643856,1.0000004526429711,9.5146497613716877E-4,1,0,456.82002391524378,1.5686072791474561,1.0066598533894995,0.11509214447931848,1.000003962096947,2.8149898277276078E-3,1.0000839046634757,1.3573781524430647E-2,53.026351812766393,-121.36411320030385,58.635886799696152,null,1000000000,398110.52160000004,null,44.569942319413052,-83.441569806720722,null,60.852184659121214,-37.922543393583155,null,0,0]
[691.83,0.69183000000000006,1.3010134821936301,0.69409717796608694,1.0000005441904127,1.0432546821776362E-3,1,0,500.89018283226864,1.5687998798718488,1.0080014653820439,0.12608310178496196,1.000004763432871,3.0865559974043374E-3,1.0001008736129531,1.48831118496875E-2,51.92806482538608,-123.40023346413795,56.599766535862045,null,1000000000,478628.74890000006,null,43.78155589851265,-82.83842914362954,null,60.54228409264131,-40.561804320508394,null,0,0]
[758.58,0.75858000000000003,1.353787053982255,0.73970326807586129,1.0000006542667623,1.1439111902210573E-3,1,0,549.21750645860322,1.568975553529703,1.0096122549484297,0.13810057973824258,1.0000057269558578,3.3843547468631438E-3,1.0001212766477758,1.6318871630478949E-2,50.796340978864208,-125.42834293612179,54.571657063878206,null,1000000000,575443.61640000006,null,42.995379486579736,-82.177006346414188,null,60.196736658052359,-43.251336589707591,null,0,0]
[831.76,0.83175999999999994,1.4146227305232284,0.7856873634716679,1.0000007865894454,1.2542638715035887E-3,1,0,602.200197460288,1.569135748695115,1.0115451889119746,0.1512296014646303,1.0000068852049047,3.7108396354199533E-3,1.0001458025753636,1.7892870409709757E-2,49.630996633406582,-127.42254545242844,52.577454547571563,null,1000000000,691824.69759999996,null,42.2120525019563,-81.452653524594538,null,59.814719297218168,-45.969891927833899,null,0,0]
[912.01,0.91200999999999999,1.4844745596439504,0.83167466241973642,1.0000009456952741,1.3752778110462632E-3,1,0,660.30161908171476,1.5692818668066633,1.0138644846928322,0.16556672766726155,1.0000082778910424,4.0688656748564429E-3,1.0001752919581013,1.9618846413521948E-2,48.431950331057571,-129.35680965849107,50.643190341508927,null,1000000000,831762.24009999994,null,41.431903459342848,-80.660082034049339,null,59.395822037482596,-48.696727624441749,null,0,0]
[1000,1,1.5643292318477084,0.87727164063979302,1.0000011369777781,1.5079633289861801E-3,1,0,724.00685484487371,1.5694151239633738,1.0166458181153395,0.18120788284383582,1.0000099522239811,4.4614216216183169E-3,1.0002107439754002,2.1511173699976547E-2,47.200310594831159,-131.20409881126665,48.795901188733353,null,1000000000,1000000,null,40.655677966589529,-79.794036726374472,null,58.940407794009516,-51.410062084892196,null,0,0]
[1096.5,1.0965,1.6552634991757758,0.92211836905139233,1.0000013670021533,1.6534815366728546E-3,1,0,793.87338891643446,1.5695366797549364,1.0199804324894344,0.19825905451471393,1.0000119656687614,4.8919422417158017E-3,1.0002533747149434,2.3586364587281312E-2,45.937417261209525,-132.93886065244931,47.061139347550693,null,1000000000,1202312.25,null,39.883932385899918,-78.848708201156782,null,58.44926004107748,-54.090152451292539,null,0,0]
[1202.3,1.2022999999999999,1.7583677522631904,0.9658605555409796,1.0000016435297161,1.8130236981801597E-3,1,0,870.4731856701992,1.5696475260777472,1.0239748204803407,0.21681986232281664,1.000014386159563,5.3639513601799003E-3,1.0003046215865352,2.5861345196219385E-2,44.645967880867836,-134.53624822675317,45.463751773246827,null,1000000000,1445525.2899999998,null,39.117777044198853,-77.818647405073307,null,57.92396600243687,-56.717600821679852,null,0,{"$f":"IF(AD90>0,S90,0)","v":0}]
[1318.3,1.3183,1.8748284531088655,1.0082023914905849,1.0000019759697811,1.9879469446890466E-3,1,0,954.45785017975095,1.5697486114004839,1.0287563255904437,0.23699669759154393,1.0000172960547362,5.8814633290157755E-3,1.0003662268985072,2.8355385648428568E-2,43.328811752814538,-135.97452786242366,44.025472137576344,null,1000000000,1737914.89,null,38.35818945702654,-76.698042912989379,null,57.366397461555884,-59.276484949434291,null,0,0]
[1445.4,1.4454,2.005818601400029,1.0488715560342028,1.0000023753510825,2.1796083962722979E-3,1,0,1046.4789875901245,1.5698407412895503,1.034471428472906,0.25888018748741831,1.0000207918861537,6.4484922125926441E-3,1.0004402323198536,3.10877282104399E-2,41.990184409270732,-137.23420505690228,42.765794943097717,null,1000000000,2089181.1600000001,null,37.606803560419657,-75.481978315250529,null,56.779156014618948,-61.752226741651761,null,0,0]
[1584.9,1.5849000000000002,2.1529159886685605,1.0877418659436444,1.0000028559811331,2.3899683412035729E-3,1,0,1147.4778054476408,1.5699248501337959,1.0413076084308186,0.28260948115623669,1.0000249988830618,7.0708362003482818E-3,1.0005292859993504,3.4086176670750444E-2,40.631605532212973,-138.30194385678797,41.698056143212028,null,1000000000,2511908.0100000002,null,36.863702215229068,-74.162866701392147,null,56.163678482751784,-64.139077155395825,null,0,0]
[1737.8,1.7378,2.3173791922748874,1.1246171091340917,1.000003433610779,2.6205346608449147E-3,1,0,1258.1783096221052,1.57000152680698,1.0494645375087064,0.30824697918823529,1.0000300549051768,7.7529545914265955E-3,1.0006363019485158,3.7372036618899866E-2,39.259053777102643,-139.16435041138041,40.835649588619589,null,1000000000,3019948.84,null,36.131474831316751,-72.737422019952447,null,55.523354111553772,-66.42692839142795,null,0,0]
[1905.5,1.9055,2.5008825185296035,1.159433486250772,1.0000041282808334,2.8734183932117023E-3,1,0,1379.5941083911862,1.5700714758539671,1.0591910493650887,0.33589179487245124,1.000036135358042,8.5010905110778513E-3,1.0007649867421728,4.0975146326211506E-2,37.875914227474624,-139.81407723937278,40.185922760627221,null,1000000000,3630930.25,null,35.411369960599387,-71.200363569944969,null,54.860319432643116,-68.613713669427796,null,0,0]
[2089.3000000000002,2.0893000000000002,2.7049874790113257,1.1921236786217371,1.0000049630968977,3.1505797469296134E-3,1,0,1512.6664094958087,1.5701352424563,1.0707629606901148,0.36558855618253294,1.0000434424667957,9.3210400865344368E-3,1.0009196114533914,4.4923110328059214E-2,36.487620837547482,-140.24654291235697,39.753457087643028,null,1000000000,4365174.4900000012,null,34.705850609909049,-69.549497687058263,null,54.177545393406312,-70.697045225298695,null,0,0]
[2290.9,2.2909000000000002,2.9316956521286843,1.2227100014646963,1.0000059670982984,3.4545820663536876E-3,1,0,1658.6260231194458,1.5701934180941743,1.0845165371433019,0.39740133851875553,1.0000522303848116,1.0220382729483859E-2,1.0011055415312629,4.9252013729152458E-2,35.097617957544621,-140.46174356113022,39.53825643886978,null,1000000000,5248222.8100000005,null,34.016524819245426,-67.781621278902094,null,53.476868304067075,-72.680122282228126,null,0,0]
[2511.9,2.5119000000000002,3.1828990058360165,1.2512045951851811,1.0000071739006438,3.7878378415062458E-3,1,0,1818.6313588949108,1.5702464627196397,1.100820870667615,0.43132401611163856,1.0000627933075188,1.1206250207983848E-2,1.0013289831240102,5.3995645956431006E-2,33.711204268777884,-140.46295850001314,39.537041499986856,null,1000000000,6309641.6100000003,null,33.346118590570399,-65.897520299736286,null,52.760860843975372,-74.565438200276873,null,0,0]
[2754.2,2.7542,3.4608299727587717,1.2776685137021393,1.0000086246464002,4.1532118688000696E-3,1,0,1994.0580283040049,1.5702948368544229,1.1201069014724605,0.46733529493008302,1.0000754912919867,1.2287110578168177E-2,1.0015975262849994,5.919404413529359E-2,32.332623386252109,-140.25754730639738,39.742452693602615,null,1000000000,7585617.6399999987,null,32.697002330880153,-63.898926377502001,null,52.031396221139836,-76.358620928895377,null,0,0]
[3020,3.02,3.768072116397323,1.3021903053434125,1.0000103696442573,4.5540212230642009E-3,1,0,2186.4988446910102,1.5703389746049836,1.1428736366061811,0.50538659363249216,1.000090764596165,1.3472767460340863E-2,1.0019204436413884,6.4893423991219432E-2,30.965472772618018,-139.85641142176468,40.143588578235324,null,1000000000,9120400,null,32.071415314671782,-61.789209596575091,null,51.289832623714119,-78.067201825189571,null,0,0]
[3311.3,3.3113000000000001,4.1069834409532291,1.3248361546275917,1.0000124665583658,4.9932812567960285E-3,1,0,2397.4018202181219,1.5703792085544062,1.1696457569498957,0.54532316331155828,1.0001091178164796,1.4772128834747695E-2,1.0023083486594977,7.1135378069633923E-2,29.615185611752722,-139.27494915460935,40.725050845390655,null,1000000000,10964707.690000001,null,31.472547046403079,-59.577765861518422,null,50.538413731117522,-79.697183293090944,null,0,0]
[3630.8,3.6308000000000002,4.4807409773835225,1.3457234792420276,1.0000149883429736,5.4750626968865972E-3,1,0,2628.7217713412679,1.5704159137610711,1.2010523087997129,0.5870050857499155,1.0001311893165978,1.6197220502667913E-2,1.0027746540936122,7.7976062372823618E-2,28.284513703577442,-138.53159954958574,41.468400450414265,null,1000000000,13182708.640000001,null,30.902430987190577,-57.273322412594844,null,49.777857882154741,-81.258277136990884,null,0,0]
[3981.1,3.9811000000000001,4.892415212826295,1.3649476185975948,1.0000180199874329,6.0032852401061317E-3,1,0,2882.3411139392979,1.5704493865888172,1.2377543829684936,0.63019139947145864,1.0001577227091443,1.7759616074487575E-2,1.0033349556199644,8.5468906878078316E-2,26.977424245289562,-137.64914805773256,42.35085194226744,null,1000000000,15849157.209999999,null,30.363636472149345,-54.890365424852988,null,49.00956293890809,-82.758782632879544,null,0,0]
[4365.2,4.3651999999999997,5.345553571417363,1.3826162973571181,1.0000216648562672,6.5824714410446213E-3,1,0,3160.4318663612935,1.570479914336419,1.2804885699445594,0.67460789840110391,1.0001896223051023,1.9472665256780052E-2,1.0040081841542681,9.367514324332725E-2,25.696768666773785,-136.65350823356084,43.346491766439158,null,1000000000,19054971.039999999,null,29.858162999722243,-52.445387091982504,null,48.234380832819426,-84.208121141578332,null,0,0]
[4786.3,4.7862999999999998,5.8439479287234208,1.3988328455720143,1.0000260463216901,7.2174450271791021E-3,1,0,3465.3108482051402,1.5705077523905551,1.3300430968985524,0.71992476417017326,1.0002279673419217,2.13505991838135E-2,1.0048168783890492,0.10265928243964899,24.445092159667887,-135.57374749713722,44.426252502862781,null,1000000000,22908667.690000001,null,29.387714833894798,-49.958114631047131,null,47.453152491540969,-85.61563286609011,null,0,0]
[5248.1,5.2481,6.3919906083687765,1.4137052312092755,1.0000313147988993,7.9137831333240816E-3,1,0,3799.6568821563474,1.5705331451333524,1.3872880941647114,0.76579608649590425,1.0002740734684079,2.3409864850356694E-2,1.0057884418713294,0.11249519892048404,23.223722618146013,-134.44074065018046,45.559259349819541,null,1000000000,27542553.610000003,null,28.953289725891544,-47.449323586813478,null,46.666208058022349,-86.99141706336701,null,0,0]
[5370.3,5.3703000000000003,6.53722333648565,1.4172232310559749,1.0000327900589796,8.0980445806021397E-3,1,0,3888.1304324325633,1.570539133774137,1.4028991298511699,0.77730025059441288,1.0002869836031507,2.3954748463040146E-2,1.0060603299939808,0.11509485549271994,22.923398598557124,-134.15312174541606,45.846878254583942,null,1000000000,28840122.090000004,null,28.850444457832296,-46.821746191600482,null,46.468729306492705,-87.331375553815576,null,0,0]
[5432.85,5.4328500000000002,6.6115932681340155,1.418964160807799,1.0000335583319193,8.1923615005859238E-3,1,0,3933.4170165254159,1.5705420949129041,1.4109605222794572,0.78308994737480075,1.0002937067708759,2.423365026151611E-2,1.0062018928431757,0.11642501013444122,22.773053657033845,-134.00810232460569,45.991897675394313,null,1000000000,29515859.122500002,null,28.799571078336243,-46.506170557768364,null,46.369257744465472,-87.501931766837359,null,0,0]
[5495.4,5.4954000000000001,6.6859827926145243,1.4206663557880796,1.0000343355008252,8.2866782748133964E-3,1,0,3978.7036006519716,1.5705449886428502,1.4190686726592661,0.78881367287418402,1.0003005077466112,2.451254828921719E-2,1.0063450749200653,0.11775480707119809,22.624922034138748,-133.86461887591395,46.135381124086052,null,1000000000,30199421.159999996,null,28.749851130202725,-46.194370721620764,null,46.270846069703907,-87.670248154293176,null,0,0]
[5559.4,5.5593999999999992,6.7621163794307533,1.4223692413114775,1.0000351398933038,8.3831812964692935E-3,1,0,4025.0399937168395,1.5705478820559999,1.4274123470314677,0.79460258457695243,1.0003075469116733,2.4797907630870874E-2,1.0064932514189133,0.11911505631494371,22.475589801656678,-133.71942981187476,46.280570188125239,null,1000000000,30906928.359999996,null,28.700138474469718,-45.879206179001372,null,46.171226492954844,-87.840223632873375,null,0,0]
[5623.4,5.6233999999999993,6.8382691384984495,1.4240342040139218,1.0000359535989283,8.4796841619794467E-3,1,0,4071.376386814637,1.5705507096091966,1.4358032992519929,0.80032402440590089,1.0003146675305827,2.5083262933168864E-2,1.0066431216304492,0.12047492279670015,22.328459691011247,-133.57590785721987,46.424092142780125,null,1000000000,31622627.559999995,null,28.65156553215251,-45.567903485056725,null,46.072669324626609,-88.008004372163143,null,0,0]
[5688.9,5.6888999999999994,6.9162259185341872,1.4257002205406406,1.0000367960188727,8.5784486498466216E-3,1,0,4118.7987891586017,1.5705535375592445,1.4444390075435278,0.80611053771065555,1.0003220393770136,2.5375302019487223E-2,1.0067982573659793,0.1218662604673731,22.180103638793277,-133.43077440696325,46.569225593036748,null,1000000000,32363583.209999997,null,28.603000288053529,-45.253255330939766,null,45.972878516507627,-88.177519076023444,null,0,0]
[5754.4,5.7543999999999995,6.9942014673616679,1.4273290940038481,1.0000376481935838,8.6772129703543196E-3,1,0,4166.2211915347552,1.5705563011304806,1.453122505255958,0.81182808304178167,1.0003294965364764,2.5667336776582592E-2,1.006955165541402,0.12325718838065526,22.033938843525522,-133.28743698528118,46.712563014718825,null,1000000000,33113119.359999996,null,28.555561008176351,-44.942554813957386,null,45.874153001117051,-88.344882171323775,null,0,0]
[5821.4,5.8213999999999997,7.073981487180081,1.4289581128283915,1.0000385299761323,8.7782388940336759E-3,1,0,4214.7296031578007,1.5705590636479005,1.4620534175427007,0.81760610432847614,1.0003372127345975,2.5966054821642784E-2,1.0071174999686436,0.1246795410147139,21.886636063592853,-133.1426966625431,46.857303337456898,null,1000000000,33888697.959999993,null,28.508166355365319,-44.628772143769837,null,45.774244873995407,-88.513924518773266,null,0,0]
[5888.4,5.8883999999999999,7.153779860509311,1.4305507933207791,1.0000394219652931,8.8792646385231697E-3,1,0,4263.2380148122793,1.570561763299803,1.4710325476272859,0.82331377656889559,1.0003450181938975,2.6264768231702835E-2,1.0072816872001096,0.12610145547783186,21.741510651310868,-132.99987604761094,47.00012395238906,null,1000000000,34673254.559999995,null,28.461882169508957,-44.319016309536444,null,45.675403647569794,-88.680859738074503,null,0,0]
[5957,5.9569999999999999,7.2355022486357976,1.432145104936285,1.0000403458307918,8.9827027502921118E-3,1,0,4312.9048363287729,1.5705644645009418,1.4802751470572832,0.82908581461661446,1.0003531025340902,2.6570610238421229E-2,1.0074517140855666,0.12755686714998207,21.595117622050882,-132.85565055755086,47.14434944244914,null,1000000000,35485849,null,28.415609373377592,-44.005981113463179,null,45.575283414441159,-88.849669444087695,null,0,0]
[6025.6,6.0256000000000007,7.3172426173408232,1.4337038005692393,1.0000412803961454,9.0861406698364115E-3,1,0,4362.5716578760175,1.5705671041970393,1.4895664509898359,0.8347860334035746,1.000361280445127,2.6876447273256162E-2,1.0076236814106385,0.12901180939584292,21.450891504351887,-132.71346866856021,47.286531331439789,null,1000000000,36307855.360000007,null,28.370433099315015,-43.697057049076598,null,45.476233570804759,-89.016411619483591,null,0,0]
[6095.8,6.0958000000000006,7.4009074599076801,1.4352632023440317,1.0000422478360143,9.1919909342984239E-3,1,0,4413.396889286023,1.5705697439532347,1.4991239385857209,0.84054586093649475,1.0003697459621306,2.7189412326650692E-2,1.0078016674637724,0.1305001948750226,21.30548681243857,-132.57009825671264,47.42990174328736,null,1000000000,37158777.640000001,null,28.325304514193704,-43.385126063944128,null,45.375957464012735,-89.184972192768541,null,0,0]
[6166,6.1660000000000004,7.4845898971350175,1.436787737565921,1.0000432264806132,9.2978409927757816E-3,1,0,4464.2221207260809,1.5705723236021074,1.5087305294690228,0.84623252564661189,1.0003783094608103,2.7502372052573679E-2,1.0079816834330653,0.13198807801775278,21.162235473583863,-132.42888954041004,47.57111045958996,null,1000000000,38019556,null,28.28125673482667,-43.077383250642775,null,45.276753904525073,-89.351506289767258,null,0,0]
[6237.8,6.2378,7.5701972189657614,1.4383121503230887,1.0000442390211761,9.4061033726464769E-3,1,0,4516.2057620295636,1.5705749019837025,1.518605897452955,0.85197418545862236,1.0003871694932509,2.7822459188956743E-2,1.0081679010504692,0.1335093477337865,21.017888698532573,-132.28670581199881,47.713294188001186,null,1000000000,38910148.840000004,null,28.237289371921072,-42.766897748034459,null,45.176374492379381,-89.519808063964348,null,0,0]
[6309.6,6.3096000000000005,7.6558217392320511,1.439802467693911,1.0000452632829764,9.5143655320180792E-3,1,0,4568.1894033623857,1.5705774216839898,1.5285306809537234,0.8576414686417605,1.0003961320193127,2.814254062282685E-2,1.0083562398798538,0.13503008049159088,20.875678852773877,-132.14679558705265,47.853204412947349,null,1000000000,39811052.160000004,null,28.194385489687953,-42.460670023438617,null,45.077068528853808,-89.68612556361407,null,0,0]
[6383.05,6.3830499999999999,7.7434311548602333,1.4412929261380196,1.0000463232111616,9.6251153792904498E-3,1,0,4621.3676548665844,1.5705799406333778,1.5387336759050436,0.8633631535580788,1.0004054065595613,2.8469971719721928E-2,1.0085511004949961,0.13658519881894332,20.732354204867821,-132.00602513094265,47.993974869057354,null,1000000000,40743327.302500002,null,28.15156256262263,-42.15174637077908,null,44.976566808013068,-89.854278760163567,null,0,0]
[6456.5,6.4565000000000001,7.831057387351068,1.4427500325550024,1.0000473954054174,9.7358649904417741E-3,1,0,4674.5459063994394,1.570582402270964,1.5489863808468602,0.86900927788650351,1.0004147883524022,2.8797396710485933E-2,1.0087481784311207,0.13813974301198012,20.591150281253814,-131.86763653170237,48.132363468297626,null,1000000000,41686392.25,null,28.109785745770402,-41.847148387328431,null,44.877139701251288,-90.020488144373942,null,0,0]
[6531.7,6.5316999999999998,7.9207882187783643,1.4442084516822586,1.0000485058533692,9.8492530446613602E-3,1,0,4728.9911687190743,1.5705848652015515,1.5595338408271002,0.87471282693025332,1.0004245047862628,2.9132616442041893E-2,1.0089522477441444,0.13973072411570914,20.448721290235774,-131.72841614077382,48.271583859226183,null,1000000000,42663104.890000001,null,28.068063983499918,-41.539706889879938,null,44.776432472503735,-90.188709250893837,null,0,0]
[6606.9,6.6068999999999996,8.0105355201575321,1.445634194527069,1.0000496291587668,9.9626408456125713E-3,1,0,4783.4364310667415,1.5705872720657923,1.5701313506276298,0.88033956542335545,1.0004343336379031,2.9467829624476746E-2,1.0091586385517697,0.14132109036192364,20.308399696967253,-131.59168565531652,48.408314344683475,null,1000000000,43651127.609999992,null,28.02737221283731,-41.236662725208639,null,44.676802649897823,-90.355022930107864,null,0,0]
[6683.85,6.6838500000000005,8.1023878341940136,1.4470604172727299,1.0000507919146111,1.0078667060223838E-2,1,0,4839.1487042018625,1.5705896788763798,1.5810262385114011,0.88601897623351833,1.0004445075883899,2.9810836787707708E-2,1.0093722340254931,0.14294782311873541,20.166936312982891,-131.45434380142376,48.545656198576239,null,1000000000,44673850.822500005,null,27.986766505826623,-40.931047218200753,null,44.575944972924148,-90.523296583222987,null,0,0]
[6760.8,6.7608000000000006,8.1942562598837494,1.4484546631236892,1.0000519681331901,1.0194693003466856E-2,1,0,4894.8609773643766,1.5705920308993482,1.5919714245502543,0.89162047103566222,1.0004547992426867,3.0153836934280517E-2,1.0095882572964539,0.14457389816414848,20.027564101024634,-131.31959285517831,48.680407144821686,null,1000000000,45708416.640000001,null,27.947173090944126,-40.629892428489711,null,44.476166175848384,-90.689700426688574,null,0,0]
[6839.55,6.83955,8.2882897769566828,1.4498495192049596,1.0000531858043991,1.0313432719639012E-2,1,0,4951.8764616224171,1.5705943831449394,1.6032236401692981,0.89727362595559923,1.0004654534996149,3.0504853127332979E-2,1.0098118457810039,0.14623732177531984,19.887039074333607,-131.18436069167541,48.815639308324592,null,1000000000,46779444.202500001,null,27.907668595887131,-40.326237030444148,null,44.375145644214349,-90.858123661231275,null,0,0]
[6918.3,6.9183000000000003,8.382339058100639,1.451213077506754,1.0000544175754438,1.0432172144980913E-2,1,0,5008.8919459072331,1.5705966818399959,1.6145263767541136,0.90284780541199805,1.0004762310236264,3.0855861801063911E-2,1.0100379736860488,0.14790004172213167,19.748588940960484,-131.05181645886964,48.948183541130362,null,1000000000,47862874.890000001,null,27.869158526188059,-40.027103094104547,null,44.275205580540309,-91.024713364765105,null,0,0]
[6998.9,6.9988999999999999,8.478613527370424,1.4525773410639109,1.0000556928838553,1.0553700699789989E-2,1,0,5067.2468415956819,1.5705989809702801,1.6261458536727189,0.90847251467023893,1.0004873893745529,3.1215108516469962E-2,1.0102720416458466,0.14960108594521937,19.608977252032986,-130.91892553372671,49.081074466273293,null,1000000000,48984601.209999993,null,27.83074073078971,-39.725546043333146,null,44.174011687011152,-91.193379490393568,null,0,0]
[7079.5,7.0795000000000003,8.5749034227957406,1.4539109676926103,1.0000569829622412,1.0675228942849082E-2,1,0,5125.6017373103059,1.5706012277494392,1.637816046621932,0.91401723999245765,1.0004986768436939,3.157434717230765E-2,1.0105087661427292,0.15130137725101289,19.471424054982446,-130.78881540145295,49.21118459854705,null,1000000000,50119320.25,null,27.793299301105193,-39.428568273252111,null,44.073899919645136,-91.360247128200825,null,0,0]
[7161.95,7.16195,8.6734188717616938,1.4552445640352396,1.0000583179339324,1.0799546279572277E-2,1,0,5185.2960444291575,1.5706034737740411,1.6498054571757423,0.91960789189605563,1.0005103569855784,3.1941822944857139E-2,1.0107536709151435,0.15303990775809098,19.332786056067732,-130.65857518497444,49.341424815025562,null,1000000000,51293527.802499995,null,27.755976210603141,-39.129431012678126,null,43.972585011232468,-91.529144172296327,null,0,0]
[7244.4,7.2443999999999997,8.7719493997276246,1.4565482035310193,1.0000596683612839,1.0923863282473734E-2,1,0,5244.9903515735723,1.5706056686737129,1.661845688070789,0.92511770432634421,1.0005221722316588,3.2309290087926462E-2,1.0110013516421008,0.15477763356494303,19.196187524930121,-130.53120081777024,49.468799182229759,null,1000000000,52481331.359999992,null,27.719610073136145,-38.834922089072599,null,43.872352617561852,-91.696278728697663,null,0,0]
[7328.75,7.3287500000000003,8.8727655720998388,1.457851920295125,1.0000610659021918,1.1051044730407982E-2,1,0,5306.0602704303119,1.5706078630468512,1.6742148244321444,0.93067230484044672,1.0005343995565952,3.2685216209556611E-2,1.0112576105310391,0.15655456243294746,19.058494458786292,-130.40383139247942,49.596168607520582,null,1000000000,53710576.5625,null,27.68336399210439,-38.538331630892046,null,43.770905632449782,-91.865499761587344,null,0,0]
[7413.1,7.4131,8.9735964864373141,1.4591263410203756,1.0000624796191628,1.1178225820824721E-2,1,0,5367.1301893120208,1.5706100074826175,1.6866348577604011,0.93614526627354988,1.0005467682740343,3.3061133089944329E-2,1.0115167704904804,0.15833063118325391,18.92282182436379,-130.2794083512791,49.720591648720898,null,1000000000,54954051.610000007,null,27.64805536294153,-38.246415356816598,null,43.670541627190147,-92.032992994462489,null,0,0]
[7499.45,7.4994499999999995,9.0768329327717101,1.4604016480275042,1.000063943612252,1.1308422092996191E-2,1,0,5429.6481205217769,1.5706121527962402,1.6994009355094617,0.94166496037506231,1.0005595767183344,3.3445953550571193E-2,1.0117850780830673,0.16014791146095708,18.785968118930882,-130.15505718289052,49.844942817109484,null,1000000000,56241750.302499995,null,27.61284869513193,-37.952331685941147,null,43.568894589566838,-92.202725496949355,null,0,0]
[7585.8,7.5857999999999999,9.1800838096934232,1.4616482695810276,1.0000654245574447,1.1438617981772758E-2,1,0,5492.166051755953,1.5706142492691806,1.7122180159679723,0.94710218097829957,1.0005725333284812,3.3830764101950822E-2,1.0120564212453775,0.16196427127145091,18.651118033660655,-130.03373175941084,49.966268240589159,null,1000000000,57544361.640000001,null,27.578560923133651,-37.662970032320935,null,43.468332276294881,-92.370761727089914,null,0,0]
[7674.15,7.67415,9.2857405708880894,1.4628950691380376,1.0000669573491534,1.1571829007954807E-2,1,0,5556.1319953187531,1.5706163454686355,1.7253835627120442,0.95258156067094646,1.0005859433810367,3.4224477088221593E-2,1.0123371884626879,0.16382173808490921,18.515161584843813,-129.91269355629618,50.087306443703824,null,1000000000,58892578.222499996,null,27.544398485979002,-37.371702897084354,null,43.366538264632695,-92.540990659211829,null,0,0]
[7762.5,7.7625000000000002,9.3914114420456976,1.4641138129196209,1.0000685078871734,1.1705039623431475E-2,1,0,5620.097938905411,1.5706183939517064,1.7386001262413893,0.95797779357724122,1.0005995085301636,3.4618179460367861E-2,1.0126211283508926,0.16567822099526255,18.381189415220657,-129.79475214354454,50.205247856455458,null,1000000000,60256406.25,null,27.511135154679124,-37.085196379699305,null,43.265829426309409,-92.709555763845231,null,0,0]
[7852.9,7.8529,9.4995483260092382,1.4653327684975683,1.0000701127712472,1.1841340717320297E-2,1,0,5685.5480951288582,1.5706204422559877,1.7521749578654138,0.96341481171471088,1.0006135489635812,3.5021005862017229E-2,1.0129149377382307,0.16757675112597131,18.246106045059769,-129.67724085925408,50.322759140745916,null,1000000000,61668038.409999996,null,27.477999444845441,-36.796875798838187,null,43.163881765982211,-92.880365060415912,null,0,0]
[7943.3,7.9432999999999998,{"$f":"SQRT(1+(A141/pole1)^2)","v":9.6076990071566239},{"$f":"ATAN(A141/pole1)","v":1.4665242830555651},{"$f":"SQRT(1+(A141/Zero1)^2)","v":1.0000717362345524},{"$f":"ATAN(A141/Zero1)","v":1.1977641371213401E-2},{"$f":"IF(VIN_nom>Vout, 1, SQRT(1+(A141/z_RHP)^2))","v":1},{"$f":"IF(VIN_nom>Vout, 0, -ATAN(A141/z_RHP))","v":0},{"$f":"SQRT(1+(A141/Pole2)^2)","v":5750.9982513756158},{"$f":"ATAN(A141/Pole2)","v":1.5706224439381595},{"$f":"SQRT(1+(A141/Zero2)^2)","v":1.765800788556884},{"$f":"ATAN(A141/Zero2)","v":0.96876807639646367},{"$f":"SQRT(1+(A141/pole4)^2)","v":1.0006277517610969},{"$f":"ATAN(A141/pole4)","v":3.542382089368442E-2},{"$f":"SQRT((1-(V141/pterm2))^2+(A141/pterm1)^2)","v":1.013212063113329},{"$f":"IF((ATAN((A141/pterm1)/(1-A141^2/pterm2))>0),ATAN((A141/pterm1)/(1-A141^2/pterm2)),PI()+ATAN((A141/pterm1)/(1-A141^2/pterm2)))","v":0.16947422956789848},{"$f":"20*LOG10(((E141*K141*G141)/(C141*I141*O141*M141))*Adc)","v":18.11298747863723},{"$f":"((F141+L141+H141)-(D141+J141+P141+N141))*radconv","v":-129.56289248505004},{"$f":"IF(R141>0,R141,R141+180)","v":50.437107514949957},null,1000000000,63096014.890000001,null,{"$f":"20*LOG10((K141/(I141*M141))*AEA)","v":27.445742946411286},{"$f":"(L141-(J141+N141))*radconv","v":-36.513350614812659},null,{"$f":"20*LOG10((E141*G141/(C141*O141))*Acs*Am)","v":43.063019697993823},{"$f":"(F141+H141-(D141+P141))*radconv","v":-93.049541870237377},null,0,0]
[8035.8,{"$f":"A142/1000","v":8.0358000000000001},9.7183758393772575,1.4677160241661544,1.0000734166425989,1.2117107840631771E-2,1,0,5817.9688205673447,1.570624445501654,1.7797947165300947,0.97416069375724634,1.0006424525491489,3.5835981449094591E-2,1.0135195201541136,0.1714146866522554,17.978754174282351,-129.44911890815328,50.550881091846719,null,{"$f":"IF(Q142<0,A142,1000000000)","v":1000000000},{"$f":"A142^2","v":64574081.640000001},null,27.413616395126144,-36.228106140632327,null,42.96091294492409,-93.221012767520975,null,{"$f":"SUM((Q143<0)*(Q142>0))*A142","v":0},0]
[8128.3,8.1282999999999994,9.8290661632430361,1.4688809252436452,1.000075116502904,1.2256573838651454E-2,1,0,5884.9393897818491,1.5706264015095914,1.7938395931133484,0.97946902042876594,1.0006573233176501,3.6248129824281237E-2,1.0138304428868337,0.17335401965210384,17.846466037046188,-129.33856932508314,50.661430674916858,null,1000000000,66069260.890000001,null,27.382349060387071,-35.94768785918798,null,42.859892142426986,-93.390881465895177,null,0,0]
[8222.9500000000007,8.2229500000000009,9.942342784841891,1.4700460512357163,1.0000768760090855,1.2399280985168945E-2,1,0,5953.4665722495238,1.5706283574290547,1.80826241844842,0.98481521810591766,1.0006727156758461,3.6669845110736232E-2,1.0141521766395982,0.17533725341450057,17.713060765361995,-129.2287405427326,50.771259457267405,null,1000000000,67616906.702500015,null,27.35121396841037,-35.665647867522594,null,42.757621962719512,-93.563092675210001,null,0,0]
[8270.2750000000015,8.2702750000000016,9.9989860709741158,1.4706187142246512,1.0000777633997417,1.2470634369395188E-2,1,0,5987.7301634917549,1.5706293186002478,1.815492981303745,0.98745642537868483,1.0006804785896839,3.6880697870130361E-2,1.0143144019634693,0.17632842055316258,17.647083507099353,-129.17505917580371,50.82494082419629,null,1000000000,68397448.575625017,null,27.33596292076124,-35.526453882079458,null,42.706895752105993,-93.648605293724287,null,0,0]
[8317.6,8.3176000000000005,10.055632599259951,1.4711849254175333,1.0000786558820904,1.2541987626631453E-2,1,0,6021.9937547394538,1.5706302688338087,1.8227361084633884,0.99007665972893688,1.0006882859919697,3.7091547348738443E-2,1.0144775323464057,0.1773192858146459,17.581580843332237,-129.12219170446824,50.877808295531764,null,1000000000,69182469.760000005,null,27.320918006339156,-35.388460741926508,null,42.656438002760957,-93.733730962541742,null,0,0]
[8366.0499999999993,8.3660499999999995,10.113629018760427,1.4717580256094285,1.0000795748550173,1.2615036946259921E-2,1,0,6057.0718529162004,1.5706312305192001,1.8301642778326312,0.99273767771556332,1.0006963250764758,3.7307405678850797E-2,1.0146454777665923,0.17833339139077506,17.515005839650343,-129.06890425038318,50.931095749616816,null,1000000000,69990792.602499992,null,27.305725277019132,-35.248418513726705,null,42.605055728399094,-93.820485736656465,null,0,0]
[8414.5,8.4145000000000003,10.171628722139426,1.4723245902297597,1.0000804991645624,1.2688086131248701E-2,1,0,6092.1499510984859,1.5706321811299806,{"$f":"SQRT(1+(A148/Zero2)^2)","v":1.8376053018004517},{"$f":"ATAN(A148/Zero2)","v":0.99537716372079021},1.0007044107874949,3.7523260530741759E-2,1.0148143708681978,0.17934717731916675,17.44891442636316,-129.01645688672264,50.983543113277364,null,1000000000,70803810.25,null,27.290741135374361,-35.109609143371209,null,42.553948456756679,-93.906847743351449,null,0,0]
[8462.9500000000007,8.4629500000000011,10.229631653540393,1.472884730083504,1.0000814288107103,1.2761135180818553E-2,1,0,6127.2280492862128,1.5706331208563555,1.8450590248411387,0.99799534169958082,1.0007125431238975,3.7739111884381102E-2,1.0149842111829561,0.18036064196207094,17.383299800591352,-128.96484304642874,51.03515695357126,null,1000000000,71621522.702500015,null,27.275961923436011,-34.972019808936089,null,42.503113042923218,-93.992823237492644,null,0,0]
[8511.4,8.5114000000000001,10.287637758363402,1.4734385534929106,1.0000823637934466,1.2834184094190253E-2,1,0,6162.3061474792885,1.5706340498841984,1.8525252936687391,1.0005924331741982,1.0007207220845462,3.7954959719740528E-2,1.0151549982402903,0.18137378368521934,17.318155287612594,-128.91405615952866,51.085943840471344,null,1000000000,72443929.959999993,null,27.261384059470895,-34.835637827632851,null,42.452546393909579,-94.078418331895804,null,0,0]
[8560.9500000000007,8.5609500000000001,10.346964049947069,1.4739985279826056,1.0000833255235504,1.2908891355139602E-2,1,0,6198.1806524479252,1.5706349891281826,1.8601738941494723,1.0032269068123258,1.0007291349617264,3.8175704465274928E-2,1.01533064155172,0.18240959189430861,17.252011164647104,-128.86296469866107,51.137035301338926,null,1000000000,73289864.902500018,null,27.246679824556765,-34.697395163756724,null,42.401106505858223,-94.165569534904336,null,0,0]
[8610.5,8.6105,10.406293549048508,1.4745521174686149,1.0000842928352836,1.2983598471987661E-2,1,0,6234.0551574219662,1.5706359175622164,1.8678352992906009,1.0058397865238402,1.0007375966018577,3.8396445488593722E-2,1.0155072740801587,0.18344505890792637,17.186345020231542,-128.81272427145325,51.187275728546751,null,1000000000,74140710.25,null,27.232178842924696,-34.560388908108301,null,42.349941343074732,-94.252335363344969,null,0,0]
[8660.0499999999993,8.66005,10.465626201117594,1.4750994302039924,1.0000852657286294,1.3058305443900952E-2,1,0,6269.9296624013177,1.5706368353718529,1.8755093521720543,1.0084313014806765,1.0007461070037025,3.861718276827969E-2,1.0156848953147859,0.18448018298933702,17.121150111604383,-128.76332785970811,51.236672140291887,null,1000000000,74996466.002499983,null,27.217877518988445,-34.424605939507181,null,42.299047758383814,-94.338721920200925,null,0,0]
[8709.6,8.7096,10.524961952831401,1.4756405720158696,1.0000862442035721,1.3133012270045997E-2,1,0,6305.8041673858934,1.570637742738423,1.8831958981746177,1.0110016782703046,1.0007546661660176,3.88379162829178E-2,1.0158635047422802,0.18551496240567561,17.056419823695109,-128.71476845429225,51.285231545707745,null,1000000000,75857132.160000011,null,27.203772332813102,-34.290033284610118,null,42.248422656649886,-94.424735169682108,null,0,{"$f":"IF(AD154>0,S154,0)","v":0}]
[8760.3250000000007,8.7603249999999999,10.585707914545802,1.4761882620031181,1.0000872516631898,1.3209490498730696E-2,1,0,6342.5293796080114,1.5706386609893022,1.8910775004421028,1.0136113453619715,1.0007634788026398,3.9063880221884797E-2,1.0160473726926,0.18657392115487706,16.990629061800281,-128.66591724790493,51.334082752095071,null,1000000000,76743294.105625018,null,27.189532236549102,-34.153509766092291,null,42.196871991019059,-94.51240748181263,null,0,0]
[8811.0499999999993,8.8110499999999998,10.646457015359054,1.4767297018701915,1.0000882649722254,1.3285968572884221E-2,1,0,6379.2545918354153,1.5706395686674854,1.8989718746747928,1.0161993322278484,1.0007723425370454,3.928984016971182E-2,1.0162322751616779,0.18763251503619804,16.925311585264144,-128.61792839046581,51.382071609534194,null,1000000000,77634602.102499992,null,27.175490460407822,-34.018227598566213,null,42.145596290624198,-94.599700791899579,null,0,0]
[8861.7749999999996,8.8617749999999997,10.707209201840586,1.4772649976855403,1.0000892841306612,1.336244649161243E-2,1,0,6415.9798040680162,1.5706404659545281,1.9068788622469812,1.0187658736795517,1.0007812573678763,3.9515796103431158E-2,1.0164182115907068,0.18869074220325702,16.86046069395416,-128.57079440888256,51.429205591117437,null,1000000000,78531056.15062499,null,27.161643462630671,-33.884173337403674,null,42.094592397091368,-94.68662107147891,null,0,0]
[8912.5,8.9124999999999996,10.767964421762953,1.4777942531380368,1.0000903091384794,1.3438924254021174E-2,1,0,6452.7050163057229,1.5706413530278522,{"$f":"SQRT(1+(A158/Zero2)^2)","v":1.9147983069017183},{"$f":"ATAN(A158/Zero2)","v":1.0213112017834669},1.0007902232937675,3.9741748000077542E-2,1.0166051814181665,0.18974860081399111,16.796069815383198,-128.52450785102408,51.475492148975917,null,1000000000,79432656.25,null,27.147987776750337,-33.751333695029906,null,42.043857204400737,-94.773174155994141,null,0,0]
[8964.4,8.9643999999999995,10.830130069314125,1.4783296221861033,1.0000913639438784,1.3517173393789793E-2,1,0,6490.2809357813376,1.5706422502589421,1.9229139312528496,1.0238937732443296,1.0007994497901382,3.9972929671250719E-2,1.0167975512310139,0.19083058041093506,16.730656774226393,-128.47801845348729,51.521981546512706,null,1000000000,80360467.359999999,null,27.134210241000819,-33.616660391491358,null,41.992221698993447,-94.861358061995958,null,0,0]
[9016.2999999999993,9.0162999999999993,10.89229878556441,1.4788588800562126,1.0000924248727519,1.3595422368019326E-2,1,0,6527.8568552621164,1.5706431371606746,1.9310422729645016,1.0264546200149323,1.0008087297732129,4.0204107067522213E-2,1.016991001674368,0.19191217029169499,16.665711780296579,-128.43240048793959,51.567599512060411,null,1000000000,81293665.689999983,null,27.120625874530706,-33.483230984254952,null,41.940861071533746,-94.949169503684658,null,0,0]
[9068.2000000000007,9.0682000000000009,10.954470518267446,1.4793821305006674,1.0000934919250803,1.367367117575208E-2,1,0,6565.4327747479729,1.5706440139104036,1.9391831721172059,1.028993981902901,1.0008180632415036,4.0435280164301673E-2,1.0171855321380083,0.19299336849735921,16.601228189469452,-128.38764605555534,51.612353944444664,null,1000000000,82232251.24000001,null,27.107231197249643,-33.351031742108503,null,41.889772157987686,-95.036614313446833,null,0,0]
[9120.1,9.1201000000000008,11.016645216353753,1.4798994749429104,1.0000945651008439,1.375191981603037E-2,1,0,6603.008694238817,1.5706448806814461,1.9473364712206789,1.0315120958173001,1.0008274501935137,4.0666448937001477E-2,1.0173811420087773,0.19407417307382263,16.537199484861063,-128.34374729019467,51.656252709805329,null,1000000000,83176224.010000005,null,27.094022803761106,-33.220049099684054,null,41.838951846867829,-95.123698190510623,null,0,0]
[9173.2000000000007,9.1732000000000014,11.080260496673493,1.4804227720955712,1.0000956694273448,1.3831977499119252E-2,1,0,6641.4534211218079,1.5706457573426442,1.9556909574864476,1.0340666855097498,1.0008371095362494,4.0902958151578961E-2,1.0175823911403139,0.19517955793225369,16.472154465685044,-128.29971092922315,51.700289070776847,null,1000000000,84147598.24000001,null,27.080698333019527,-33.087283100565315,null,41.787231298433397,-95.212427828657852,null,0,0]
[9226.2999999999993,9.2262999999999984,11.14387877656838,1.4809400945811437,1.0000967801636775,1.3912035004892496E-2,1,0,6679.8981480098437,1.5706466239129697,1.9640580978261923,1.0365995258523437,1.0008468248613362,4.1139462787745995E-2,1.017784768862914,0.19628452662570917,16.407572205005707,-128.25655371617319,51.743446283826813,null,1000000000,85124611.689999983,null,27.067561879664108,-32.955762406913877,null,41.735785491109482,-95.300791309259282,null,0,0]
[9279.4,9.279399999999999,11.207500004958034,1.4814515438689086,1.0000978973098205,1.3992092332324487E-2,1,0,6718.342874902839,1.5706474805656534,1.9724377312030292,1.0391108613367812,1.0008565961671443,4.1375962819178803E-2,1.0179882745104121,0.19738907707712372,16.343446117691517,-128.21426734593248,51.785732654067516,null,1000000000,86107264.359999999,null,27.054610027475867,-32.825473018804381,null,41.684611255983526,-95.388794327128124,null,0,0]
[9332.5,9.3324999999999996,11.271124131913039,1.481957219149469,1.0000990208657521,1.4072149480389616E-2,1,0,6756.7876018007091,1.5706483274699832,1.9808296990666303,1.0416009334058076,1.0008664234520337,4.1612458219556649E-2,1.0181929074134644,0.19849320721477934,16.279769745345597,-128.17284355760324,51.827156442396756,null,1000000000,87095556.25,null,27.041839434248814,-32.696401110777934,null,41.633705476864655,-95.476442446825345,null,0,0]
[9386.85,9.3868500000000008,11.336248952750985,1.4824689199834811,1.0001001775086171,1.4154091026099004E-2,1,0,6796.137336398876,1.5706491843882455,1.9894318284915022,1.0441278516872101,1.0008765400455544,4.1854516014125438E-2,1.0184035241454366,0.19962289168805236,16.215053508535938,-128.13132933861019,51.868670661389814,null,1000000000,88112952.922499999,null,27.028952512026141,-32.565537345756439,null,41.581876162277673,-95.565791992853732,null,0,0]
[9441.2000000000007,9.4412000000000003,11.401376707936867,1.4829747750008684,1.000101340866556,1.4236032381723199E-2,1,0,6835.4870710019768,1.5706500314404939,1.9980465516391979,1.04663299586586,1.0008867152812218,4.2096568901250207E-2,1.0186153204008195,0.20075213145120838,16.150795111454595,-128.09070142760953,51.909298572390469,null,1000000000,89136257.440000013,null,27.01624862742479,-32.435920298469988,null,41.530321649797685,-95.654781129139579,null,0,0]
[9495.5499999999993,9.4955499999999997,11.466507347470934,1.4834748835545721,1.0001025109395456,1.4317973546162498E-2,1,0,6874.8368056099225,1.5706508687961394,2.0066737063137947,1.0491166151304616,1.0008969491572473,4.2338616852717496E-2,1.0188282954516064,0.20188092430028495,16.086988021976605,-128.05095112151986,51.949048878480141,null,1000000000,90165469.80249998,null,27.003724425606997,-32.307535699547536,null,41.479038762137478,-95.743415421972358,null,0,0]
[9549.9,9.5498999999999992,11.531640822480847,1.4839693427645035,1.0001036877275622,1.4399914518317212E-2,1,0,6914.1865402226367,1.5706516966207367,2.015313132864617,1.0515789554681758,1.0009072416718321,4.2580659840317336E-2,1.0190424485663507,0.2030092680372762,16.023625834333657,-128.0120697728718,51.987930227128203,null,1000000000,91200590.00999999,null,26.991376625117219,-32.180369462832189,null,41.428024374984318,-95.831700310039636,null,0,0]
[9605.5249999999996,9.6055250000000001,11.598305153877048,1.484469650904972,1.0001048990750636,1.4483777548537047E-2,1,0,6954.4593826899008,1.5706525341651008,2.0241677753580491,1.0540772798227456,1.0009178363553664,4.282837575994216E-2,1.0192628445878371,0.20416361433277719,15.959231353610601,-127.97316711397058,52.026832886029425,null,1000000000,92266110.52562499,null,26.978918464677847,-32.05146708578323,null,41.376088054700631,-95.921700028187331,null,0,0]
[9661.15,9.6611499999999992,11.664972355241595,1.4849642404843788,1.0001061174562935,1.4567640375014086E-2,1,0,6994.732225161988,1.5706533620649805,2.0330349418484484,1.056553826431643,1.0009284924570963,4.3076086420292259E-2,1.0194844730328596,0.2053174855580456,15.895289708976614,-127.93515651680279,52.064843483197208,null,1000000000,93337819.32249999,null,26.966638351513485,-31.923811627727527,null,41.324426523231004,-96.011344889075232,null,0,0]
[9716.7749999999996,9.7167750000000002,11.73164237764713,1.4854532087530956,1.0001073428712264,1.4651502996569468E-2,1,0,7035.0050676388137,1.5706541804860095,2.0419144691766382,1.0590088488269924,1.0009392099750603,4.3323791791136754E-2,1.0197073331061632,0.20647087937625078,15.831794424971321,-127.89802890101853,52.101971098981466,null,1000000000,94415716.40062499,null,26.954532994634562,-31.797388570102381,null,41.273036596104632,-96.100640330916178,null,0,0]
[9772.4,9.7723999999999993,11.798315173270167,1.4859366507741214,1.0001085753198362,1.4735365412024345E-2,1,0,7075.2779101202977,1.5706549895900499,2.0508061967837214,1.061442597190966,1.0009499889072857,4.3571491842248671E-2,1.0199314240087733,0.20762379345719198,15.768739151993037,-127.86177525304304,52.138224746956965,null,1000000000,95499801.75999999,null,26.942599175708516,-31.672183586067359,null,41.221915142052403,-96.189591666975673,null,0,0]
[9829.2999999999993,9.8292999999999999,11.866519019826136,1.4864255531137807,1.0001098432951594,1.4821149852644586E-2,1,0,7116.4738604566564,1.570655807764981,2.0599141930173563,1.0639103766427682,1.0009610784470437,4.3824863976967401E-2,1.0201619240111963,0.20880263510335959,15.704687331243774,-127.82558554288116,52.174414457118843,null,1000000000,96615138.48999998,null,26.930566017363191,-31.545354270501118,null,41.169896479648465,-96.280231272380021,null,0,0]
[9886.2000000000007,9.8862000000000005,11.934725670363751,1.4869088674392494,1.0001111186302427,1.4906934075112609E-2,1,0,7157.6698107977254,1.5706566165219047,2.069034623505853,1.0663564146377067,1.0009722322445129,4.4078230481318217E-2,1.020393710211057,0.20998096985672032,15.641082873977092,-127.79029146428233,52.209708535717667,null,1000000000,97736950.440000013,null,26.918705763404134,-31.419769786446668,null,41.118152276340837,-96.370521677835683,null,0,0]
[9943.1,9.9431000000000012,12.002935077082148,1.4873866887882654,1.0001124013250575,1.4992718078166685E-2,1,0,7198.8657611434219,1.5706574160225062,2.0781673245389776,1.0687809683466707,1.0009834502975452,4.4331591322960329E-2,1.020626781741176,0.21115879524482409,15.577919373289081,-127.75588359352359,52.244116406476408,null,1000000000,98865237.610000014,null,26.90701519317804,-31.295415406508297,null,41.06667934587891,-96.460468187015309,null,0,0]
[10000,10,12.071147193258978,1.487859110060558,1.0001136913795758,1.507850186054511E-2,1,0,7240.0617114936658,1.5706582064247909,2.0873121350533084,1.0711842914531933,1.0009947326039803,4.4584946469557359E-2,1.0208611377303622,0.21233610880258194,15.51519054730039,-127.72235258440493,52.277647415595069,null,1000000000,100000000,null,26.895491157746601,-31.172276602890541,null,41.015474555321667,-96.550075981514354,null,0,0]
[10058.25,10.058249999999999,12.140980457802506,1.4883372409539071,1.0001150196653823,1.5166320704863978E-2,1,0,7282.2350701608948,1.5706590063165671,2.0966862922506002,1.0736229045045729,1.0010063491484715,4.4844306745423571E-2,1.0211023836301394,0.21354082235155961,15.451417263581659,-127.68892466324162,52.311075336758378,null,1000000000,101168393.0625,null,26.883862999075177,-31.047460446641672,null,40.963329430274356,-96.641464216599957,null,0,0]
[10116.5,10.1165,12.210816466138466,1.4888099029091715,1.0001163556642048,1.5254139315235673E-2,1,0,7324.4084288327304,1.5706597969969174,2.1060728070531889,1.0760397946084268,1.0010180330268448,4.5103660984231471E-2,1.0213449738012319,0.21474499429042021,15.388086590626219,-127.65639613597706,52.343603864022938,null,1000000000,102343572.25,null,26.87240291510571,-30.923888049932238,null,40.911458841288386,-96.732508086044845,null,0,0]
[10174.75,10.17475,12.280655171457747,1.4892771890170426,1.0001176993760121,1.5341957690306595E-2,1,0,7366.5817875090916,1.5706605786240466,2.1154715149660572,1.0784352228746774,1.0010297842367424,4.5363009151302335E-2,1.0215889072959907,0.21594862199855919,15.325192176512877,-127.62475723282392,52.375242767176076,null,1000000000,103525537.5625,null,26.861107749095293,-30.801544459343219,null,40.859859593185462,-96.823212773480705,null,0,0]
[10233,10.233000000000001,12.350496528008225,1.4897391902720352,1.0001190508007736,1.5429775828723177E-2,1,0,7408.755146189902,1.5706613513525578,2.1248822541927423,1.0808094467818157,1.0010416027757933,4.5622351211962328E-2,1.0218341831624287,0.21715170286356741,15.262727793833498,-127.59399827222188,52.406001727778118,null,1000000000,104714289,null,26.849974415236456,-30.680414929315159,null,40.808528544364918,-96.913583342906747,null,0,0]
[10292.5,10.2925,12.421839316797891,1.4902057420206594,1.0001204391890348,1.5519478230813955E-2,1,0,7451.8335125722415,1.5706621316332208,2.1345071965028661,1.0832129918975839,1.0010537444409853,4.5887252212469982E-2,1.0220861073552288,0.21838003363543482,15.199360598135643,-127.56347774343361,52.436522256566391,null,1000000000,105935556.25,null,26.838766110825443,-30.557924354279105,null,40.756369653078075,-97.005553389154514,null,0,0]
[10352,10.352,12.493184778574539,1.4906669651474198,1.0001218356247634,1.5609180383129761E-2,1,0,7494.9118789590657,1.570662902944274,2.1441443591745815,1.0855949445183755,1.0010659563509545,4.6152146768560533E-2,1.022339430128743,0.21960778835899239,15.136429338060676,-127.53385519194967,52.466144808050331,null,1000000000,107163904,null,26.827720368725984,-30.436670054917094,null,40.704484135102568,-97.097185137032582,null,0,0]
[10411.5,10.4115,12.564532867803926,1.4911229502306302,1.0001232401079263,1.5698882284228072E-2,1,0,7537.9902453502964,1.5706636654394976,2.1537935781676452,1.0879555676424428,1.00107823850313,4.6417034843295658E-2,1.0225941504544704,0.22083496427667632,15.073927759732539,-127.50512058761569,52.494879412384307,null,1000000000,108399332.25,null,26.816834117657958,-30.31663696923377,null,40.652868807842466,-97.188483618381923,null,0,0]
[10471,10.471,12.635883539978581,1.4915737858115661,1.000124652638489,1.5788583932666397E-2,1,0,7581.0686117458608,1.5706644192691752,2.1634546921649545,1.0902951205299576,1.0010905908949266,4.6681916399742493E-2,1.0228502672992663,0.2220615586399628,15.011849732122158,-127.47726399805779,52.522736001942206,null,1000000000,109641841,null,26.806104355821056,-30.197810249210004,null,40.601520542068982,-97.2794537488478,null,0,0]
[10532,10.532,12.709035604493371,1.4920307317319095,1.0001261091333011,1.5880546703395088E-2,1,0,7625.2329873827102,1.5706651832607226,2.1733715461914738,1.0926720475633194,1.0011033276068979,4.6953468836979123E-2,1.0231142895572067,0.22331846895171259,14.948640122099334,-127.44960634302147,52.550393656978528,null,1000000000,110923024,null,26.79526348122338,-30.077224943911425,null,40.549151806643835,-97.372381399110026,null,0,0]
[10593,10.593,12.782190292275658,1.4924824473844642,1.0001275740863063,1.5972509205493608E-2,1,0,7669.397363023958,1.570665938453349,2.1833005677069144,1.0950273686453962,1.0011161381390741,4.7225014344533654E-2,1.0233797774204489,0.22457476219612837,14.885863020164791,-127.42285070439203,52.577149295607967,null,1000000000,112211649,null,26.784580912079981,-29.957876667252691,null,40.49705727385269,-97.464974037139328,null,0,0]
[10654,10.654,12.855347558541512,1.492929021876586,1.0001290474974673,1.606447143740768E-2,1,0,7713.5617386695294,1.570666684998191,2.1932415914610055,1.0973613512565641,1.0011290224886211,4.7496552882626997E-2,1.0236467297606544,0.22583043544131148,14.823512202573825,-127.3969867006322,52.603013299367802,null,1000000000,113507716,null,26.774053629457729,-29.839750100117431,null,40.445233738883971,-97.557236600514756,null,0,0]
[10715,10.715,12.9285073595191,1.4933705423069785,1.0001305293667468,1.615643339758303E-2,1,0,7757.7261143193509,1.5706674230429423,2.2031944549880138,1.0996742589825574,1.0011419806526891,4.7768084411486202E-2,1.0239151454444437,0.22708548576547705,14.761581568506401,-127.37200405864644,52.627995941353561,null,1000000000,114811225,null,26.7636786834133,-29.722830146338925,null,40.393678050860977,-97.649173912307504,null,0,0]
[10777.5,10.7775,13.003468756230792,1.4938177668112669,1.0001320564480511,1.625065643396556E-2,1,0,7802.9764992107966,1.5706681705710712,2.2134041741103787,1.1020224544718671,1.0011553340166433,4.8046285633679194E-2,1.0241916780852542,0.22837074885230996,14.698557605718248,-127.34731059841542,52.652689401584581,null,1000000000,116154506.25,null,26.753203603287087,-29.604271041288243,null,40.341129168199039,-97.743039557127176,null,0,0]
[10840,10.84,13.078432723948662,1.4942598645314369,1.0001335924084813,1.6344879181777548E-2,1,0,7848.2268841065516,1.5706689094791804,2.2236259858774794,1.104349073798661,1.0011687648638652,4.8324479413170474E-2,1.0244697444972215,0.22965535182877098,14.635962161431177,-127.32352089281267,52.676479107187333,null,1000000000,117505600,null,26.742882388278879,-29.486947238963069,null,40.288854938920181,-97.836573653849555,null,0,0]
[10902.5,10.9025,13.153399218714615,1.4946969229519709,1.0001351372479961,1.6439101639347316E-2,1,0,7893.4772690065429,1.5706696399155156,2.2338597242868596,1.1066543881336677,1.0011822731912363,4.8602665707200628E-2,1.0247493434449673,0.23093929158543139,14.573789055668701,-127.30062424537397,52.699375754626033,null,1000000000,118864506.25,null,26.732712078998727,-29.370843208469037,null,40.236852142437854,-97.929781036904913,null,0,0]
[10965,10.965,13.228368197565539,1.495129027581954,1.0001366909665548,1.6533323805003233E-2,1,0,7938.7276539106979,1.5706703620249436,2.2441052261721954,1.1089386646099486,1.0011958589956209,4.8880844473017167E-2,1.0250304736876601,0.23222256502414554,14.512032231075253,-127.27861007824788,52.72138992175212,null,1000000000,120231225,null,26.722689784315456,-29.255943650059841,null,40.185117612527677,-98.022666428188046,null,0,0]
[11028.75,11.02875,13.304839071549942,1.4955647575872804,1.0001382849066327,1.6629430111509035E-2,1,0,7984.8830465171504,1.5706710901449934,2.2545675905111802,1.1112472263060142,1.0012097963296411,4.9164579014254403E-2,1.025318802782778,0.23353081428969272,14.449462965603004,-127.25705391224589,52.742946087754106,null,1000000000,121633326.5625,null,26.712616599313659,-29.139971317918004,null,40.132621532057222,-98.117082594327911,null,0,0]
[11092.5,11.092499999999999,13.381312442727628,1.4959955073336677,1.0001398880843806,1.6725536110794633E-2,1,0,8031.0384391277885,1.5706718098958476,2.2650418594325212,1.1135344490612278,1.0012238142640986,4.9448305633311429E-2,1.0256087224122024,0.23483836384294846,14.387314445652455,-127.23639402329118,52.763605976708817,null,1000000000,123043556.25,null,26.702691541822311,-29.025220683600605,null,40.080398069598019,-98.211173339690575,null,0,0]
[11156.25,11.15625,13.457788268527977,1.4964213615630135,1.0001415004997538,1.6821641801086161E-2,1,0,8077.1938317425393,1.5706725214209776,2.2755278685456246,1.1158006037785646,1.0012379127956077,4.9732024284841511E-2,1.0259002312417864,0.2361452104326312,14.325580618191209,-127.21661956457858,52.783380435421421,null,1000000000,124461914.0625,null,26.692911751660404,-28.911676231132578,null,40.028444032298687,-98.304943333446005,null,0,0]
[11220,11.22,13.534266507341204,1.4968424031090011,1.0001431221527077,1.6917747180609798E-2,1,0,8123.3492243613327,1.570673224860595,2.2860254562935576,1.1180459572589048,1.0012520919207637,5.0015734923505605E-2,1.026193327931594,0.23745135081981639,14.264255550278405,-127.19771981552496,52.802280184475038,null,1000000000,125888400,null,26.683274434922932,-28.79932267938532,null,39.976756281123357,-98.398397136139636,null,0,0]
[11285.5,11.285500000000001,13.612846619322768,1.4972700750946339,1.0001447979430105,1.7016490421476613E-2,1,0,8170.7716277620366,1.5706739393328486,2.2968231060105233,1.1203315584562961,1.0012667442157825,5.0307225303875144E-2,1.0264961228393799,0.23879260710238714,14.201666681886842,-127.17920117112412,52.82079882887588,null,1000000000,127362510.25,null,26.67351808966994,-28.685109481802801,null,39.923923757984781,-98.494091689321323,null,0,0]
[11351,11.351000000000001,13.691429192558864,1.4976928378716856,1.0001464834849199,1.7115233330483197E-2,1,0,8218.1940311668623,1.5706746455594969,2.3076326419478215,1.1225957587195445,1.0012814815825801,5.0598707128404891E-2,1.0268005910940621,0.24013311098640436,14.139497001384758,-127.16158338009657,52.838416619903427,null,1000000000,128845201,null,26.663906374852534,-28.572121504773794,null,39.871365792300104,-98.589461875322755,null,0,0]
[11416.5,11.416499999999999,13.77001418491191,1.498110775337776,1.0001481787783864,1.7213975905705722E-2,1,0,8265.6164345757406,1.5706753436824628,2.3184538978508793,1.1248388343328048,1.0012963040174001,5.0890180347944167E-2,1.0271067312233981,0.24147285899981066,14.077740450451163,-127.1448552259972,52.855144774002795,null,1000000000,130336472.25,null,26.654436467097149,-28.460342923697755,null,39.819079149121897,-98.684512302299453,null,0,0]
[11482,11.481999999999999,13.848601555199485,1.498523969492964,1.0001498838233609,1.7312718145220386E-2,1,0,8313.0388379886008,1.5706760338404306,2.3292867103760289,1.1270610572992306,1.0013112115164646,5.1181644913351053E-2,1.0274145417488252,0.24281184768447439,14.016391091789801,-127.12900562955491,52.870994370445089,null,1000000000,131836324,null,26.645105609215442,-28.349758159072341,null,39.767060648342238,-98.779247470482602,null,0,0]
[11548.75,11.54875,13.928691089227481,1.4989402520568997,1.0001516314397398,1.7413344431248208E-2,1,0,8361.3662491042069,1.5706767291152122,2.3403379793586154,1.1293045129697548,1.0013264910206325,5.1478662825313312E-2,1.0277299435004981,0.24417560481892597,13.954283842091213,-127.11374609778343,52.886253902216566,null,1000000000,133373626.5625,null,26.635736949468676,-28.238275326605027,null,39.714322058390415,-98.875470771178399,null,0,0]
[11615.5,11.615500000000001,14.008783009375534,1.4993517746962812,1.0001533891832679,1.7513970364598772E-2,1,0,8409.6936602238093,1.5706774163990178,2.3514009167255656,1.1315268695910505,1.0013418588587626,5.1775671646664009E-2,1.028047076891935,0.24553856615906167,13.89258739561717,-127.09937617474613,52.900623825253874,null,1000000000,134919840.25,null,26.62650711811628,-28.128000401908761,null,39.66185544326877,-98.971375772837348,null,0,0]
[11682.25,11.68225,{"$f":"SQRT(1+(A205/pole1)^2)","v":14.088877274950065},{"$f":"ATAN(A205/pole1)","v":1.4997586184500202},{"$f":"SQRT(1+(A205/Zero1)^2)","v":1.000155157053892},{"$f":"ATAN(A205/Zero1)","v":1.761459594323616E-2},{"$f":"IF(VIN_nom>Vout, 1, SQRT(1+(A205/z_RHP)^2))","v":1},{"$f":"IF(VIN_nom>Vout, 0, -ATAN(A205/z_RHP))","v":0},{"$f":"SQRT(1+(A205/Pole2)^2)","v":8458.0210713473371},{"$f":"ATAN(A205/Pole2)","v":1.5706780958288238},2.3624753585556761,1.1337284017703402,{"$f":"SQRT(1+(A205/pole4)^2)","v":1.0013573150267878},{"$f":"ATAN(A205/pole4)","v":5.2072671325422072E-2},{"$f":"SQRT((1-(V205/pterm2))^2+(A205/pterm1)^2)","v":1.0283659403382561},{"$f":"IF((ATAN((A205/pterm1)/(1-A205^2/pterm2))>0),ATAN((A205/pterm1)/(1-A205^2/pterm2)),PI()+ATAN((A205/pterm1)/(1-A205^2/pterm2)))","v":0.24690072808984079},{"$f":"20*LOG10(((E205*K205*G205)/(C205*I205*O205*M205))*Adc)","v":13.831295837473011},{"$f":"((F205+L205+H205)-(D205+J205+P205+N205))*radconv","v":-127.08588456765568},{"$f":"IF(R205>0,R205,R205+180)","v":52.914115432344317},null,1000000000,136474965.0625,null,{"$f":"20*LOG10((K205/(I205*M205))*AEA)","v":26.617413397849681},{"$f":"(L205-(J205+N205))*radconv","v":-28.01891765601852},null,{"$f":"20*LOG10((E205*G205/(C205*O205))*Acs*Am)","v":39.609657605391206},{"$f":"(F205+H205-(D205+P205))*radconv","v":-99.066966911637138},null,0,0]
[11749,{"$f":"A206/1000","v":11.749000000000001},14.168973846176444,1.5001608625308682,1.0001569350515584,1.771522116512448E-2,1,0,8506.3484824747247,1.5706787675384937,2.3735611438181214,1.1359093798000603,1.0013728595206179,5.2369661809616108E-2,1.0286865322479106,0.24826208701140265,13.770403370750959,-127.07326012700442,52.926739872995583,null,{"$f":"IF(Q206<0,A206,1000000000)","v":1000000000},{"$f":"A206^2","v":138039001},null,26.608453135268356,-27.911011607010504,null,39.55772540125048,-99.162248519993923,null,{"$f":"SUM((Q207<0)*(Q206>0))*A206","v":0},0]
[11817.5,11.817500000000001,14.251172683854714,1.5005689513982248,1.0001587701921164,1.7818484128408113E-2,1,0,8555.9429043846794,1.570679448969337,2.3849491951724984,1.1381264465001246,1.0013889033733272,5.2674428947383035E-2,1.0290173245433896,0.24965829836732362,13.708323437399025,-127.06119473180979,52.938805268190208,null,1000000000,139653306.25,null,26.599393994167823,-27.801483955912349,null,39.504704608999084,-99.259710775897446,null,0,0]
[11886,11.885999999999999,14.333373867652307,1.5009723595935471,1.0001606159975678,1.7921746711647386E-2,1,0,8605.5373262985613,1.570680122545896,2.3963488580156214,1.1403224303082928,1.0014050402350649,5.2979186291286208E-2,1.0293499337037435,0.25105365642440947,13.646651795002672,-127.05001923477754,52.949980765222463,null,1000000000,141276996,null,26.590469937417463,-27.693163254376753,null,39.451957023353089,-99.356855980400766,null,0,0]
[11954.5,11.954499999999999,14.415577357434767,1.5013711670576906,1.0001624724678533,1.8025008912642207E-2,1,0,8655.1317482163013,1.5706807884031868,2.4077599674219319,1.1424976096481714,1.001421270101335,5.3283933785190515E-2,1.0296843579872694,0.25244815734229437,13.58538254709533,-127.03972204829255,52.960277951707454,null,1000000000,142910070.25,null,26.581678295981611,-27.586033554425669,null,39.399479416881597,-99.453688493866849,null,0,0]
[12023,12.023,14.497783113976785,1.5017654519243095,1.0001643396029141,1.8128270729192524E-2,1,0,8704.7261701378338,1.5706814466731496,2.4191823614135877,1.14465225848036,1.0014375929676149,5.3588671372971824E-2,1.0300205956450343,0.25384179729761919,13.524509915446002,-127.03029173770489,52.969708262295114,null,1000000000,144552529,null,26.573016464225553,-27.480079163616914,null,39.347268616988323,-99.550212574088007,null,0,0]
[12093,12.093,14.58179129843858,1.5021637780021531,1.0001662586417164,1.8233793353950725E-2,1,0,8755.4066013023803,1.570682111653589,2.4308663732345424,1.1468331601174664,1.0014543693412434,5.3900071754342506E-2,1.0303660677161053,0.25526506150657052,13.462708152966453,-127.02153874091307,52.978461259086927,null,1000000000,146240649,null,26.564296414951436,-27.373002732319133,null,39.294186903782901,-99.64853600859395,null,0,0]
[12163,12.163,14.665801769995213,1.5025575406598177,1.0001681888173515,1.8339315572598019E-2,1,0,8806.0870324707521,1.5706827689798919,2.4425618364171067,1.1489931867805057,1.0014712428228409,5.4211461672528979E-2,1.0307134297331628,0.25668741861551619,13.401308731768967,-127.01366733953786,52.986332660462139,null,1000000000,147938569,null,26.555706616183606,-27.267121310888193,null,39.241377281353238,-99.746546028649647,null,0,0]
[12233,12.233000000000001,14.749814489566889,1.5029468177518033,1.000170130129755,1.8444837382786794E-2,1,0,8856.7674636428837,1.5706834187834546,2.4542685872518466,1.1511326168861797,1.0014882134074989,5.4522841067674618E-2,1.0310626798067226,0.25810886459969357,13.340305849355001,-127.00666581584302,52.993334184156978,null,1000000000,149646289,null,26.547244481350184,-27.162418951321044,null,39.188836533772701,-99.844246864521978,null,0,0]
[12303,12.303000000000001,14.833829418958107,1.5033316853743282,1.000172082578862,1.8550358782169499E-2,1,0,8907.4478948187134,1.5706840611926827,2.4659864649815209,1.1532517243211284,1.0015052810902811,5.4834209879935016E-2,1.0314138160396031,0.25952939545306275,13.279693819671971,-127.00052261180579,52.999477388194208,null,1000000000,151363809,null,26.53890748566382,-27.058879964997391,null,39.136561499776029,-99.941642646808404,null,0,0]
[12374.5,12.374499999999999,14.919646910806309,1.5037203252799567,1.0001740883633223,1.8658140927850442E-2,1,0,8959.214335237777,1.570684709864588,{"$f":"SQRT(1+(A215/Zero2)^2)","v":2.4779667630645044},{"$f":"ATAN(A215/Zero2)","v":1.1553955407586862},1.0015228147453898,5.5152239893340192E-2,1.0317744218586651,0.26097941735180558,13.21818067297089,-126.99512202085388,53.004877979146116,null,1000000000,153128250.25,null,26.530518467922477,-26.95430727464413,null,39.083437370816291,-100.04081474620973,null,0,0]
[12446,12.446,15.0054666303567,1.5041045198008076,1.0001761057667493,1.876592263997991E-2,1,0,9010.980775660566,1.5706853510834897,2.4899583401344563,1.1575187177434623,1.0015404496940574,5.5470258739276385E-2,1.0321369915130576,0.26242847609084197,13.157063676492731,-126.99059305463271,53.009406945367289,null,1000000000,154902916,null,26.522254874943162,-26.850916070953591,null,39.030583967317448,-100.13967698367912,null,0,0]
[12517.5,12.5175,15.091288539604415,1.5044843446632061,1.0001781347890724,1.8873703916056361E-2,1,0,9062.7472160870184,1.5706859849771027,2.5019610340151854,1.1596215330365058,1.0015581859309335,5.5788266354008902E-2,1.0325015229564456,0.26387656746181376,13.096337128338993,-126.98692390009327,53.013076099906726,null,1000000000,156687806.25,null,26.514114204821997,-26.74869044305569,null,38.977998089284874,-100.23823345703759,null,0,0]
[12589,12.589,15.177112601403257,1.5048598738857073,1.0001801754302213,1.8981484753578304E-2,1,0,9114.5136565170724,1.5706866116702403,2.513974685478749,1.1617042598171476,1.0015760234506368,5.6106262673816618E-2,1.0328680141343272,0.26532368727692329,13.035995441058573,-126.98410290986422,53.01589709013578,null,1000000000,158482921,null,26.506094015711486,-26.647614742428068,null,38.925676591114964,-100.33648816743616,null,0,{"$f":"IF(AD218>0,S218,0)","v":0}]
[12662.25,12.66225,15.265039446392736,1.5052402153878646,1.0001822780659291,1.9091903126225187E-2,1,0,9167.5471077305519,1.5706872463625594,2.5262935770824777,1.1638174112547923,1.0015944025789223,5.6432030340746848E-2,1.0332455054893186,0.26680521423605247,12.974570240799292,-126.9820804267278,53.017919573272195,null,1000000000,160332575.0625,null,26.497999977130384,-26.545241561070146,null,38.872345429436798,-100.43683886565768,null,0,0]
[12735.5,12.7355,15.352968474324177,1.5056162003846234,1.000184392896025,1.9202321033272216E-2,1,0,9220.5805589476804,1.5706878737538361,2.5386236401076352,1.165910044861636,1.0016128879970783,5.6757786017737802E-2,1.0336250492924119,0.26828571266678658,12.913537455034616,-126.98092391037825,53.019076089621748,null,1000000000,162192960.25,null,26.490027387036889,-26.444042859531393,null,38.819285233765612,-100.53688105084686,null,0,0]
[12808.75,12.80875,15.440899647904942,1.5059879031956376,1.0001865199204314,1.931273847202989E-2,1,0,9273.6140101683977,1.5706884939693293,2.5509647125633568,1.1679824399597916,1.0016314796992203,5.708352963631895E-2,1.0340066433082102,0.26976517813366208,12.852891430994822,-126.98062136431426,53.01937863568574,null,1000000000,164064076.5625,null,26.482173805129953,-26.344002637087339,null,38.76649279163275,-100.63661872722693,null,0,0]
[12882,12.882,15.528832930686164,1.5063553964619913,1.000188659139071,1.9423155439808791E-2,1,0,9326.6474613926421,1.5706891071314479,2.5633166354351369,1.1700348711900532,1.0016501776794298,5.7409261128035093E-2,1.0343902852925584,0.27124360622405103,12.79262662970412,-126.98116096522551,53.018839034774487,null,1000000000,165945924,null,26.474436850135682,-26.245105161070878,null,38.713964945336322,-100.73605580415463,null,0,0]
[12957.25,12.95725,15.619169281149354,1.5067286147616978,1.000190869464529,1.9536586712073183E-2,1,0,9381.1289249406109,1.5706897298160154,2.5760169470067869,1.1721228362913296,1.0016694968488098,5.7743873612392277E-2,1.0347865323837704,0.27276131608953708,12.731107648099229,-126.98258000753951,53.017419992460489,null,1000000000,167890327.5625,null,26.466607652562175,-26.144681133206127,null,38.660275161304938,-100.83789887433339,null,0,0]
[13032.5,13.032500000000001,15.709507782214596,1.5070975406822351,1.0001930926590394,1.9650017481534852E-2,1,0,9435.6103884921777,1.5706903453097887,2.5887283787562874,1.1741903052642266,1.0016889281662971,5.8078473152214684E-2,1.0351849359751826,0.27427792178997867,12.669979496934211,-126.98486306743872,53.015136932561276,null,1000000000,169846056.25,null,26.458896627019154,-26.045430293325836,null,38.606858035682933,-100.93943277411289,null,0,0]
[13107.75,13.107749999999999,15.799848396992521,1.5074622477513993,1.0001953287225165,1.9763447745278235E-2,1,0,9490.0918520472769,1.5706909537366123,2.6014507676745438,1.1762375610124209,1.0017084716253655,5.8413059673336397E-2,1.0355854936052817,0.27579341861692391,12.609236527399961,-126.98799788180784,53.012002118192157,null,1000000000,171813110.0625,null,26.451301375564327,-25.947336435089689,null,38.55371031760351,-101.04066144671813,null,0,0]
[13183,13.183,15.890191089431813,1.5078228078293834,1.0001975776548737,1.9876877500387854E-2,1,0,9544.5733156058468,1.5706915552175025,2.6141839537865579,1.1782648816126025,1.0017281272194511,5.8747633101608895E-2,1.035988202803074,0.27730780188754783,12.548873205018081,-126.99197236985813,53.008027630141868,null,1000000000,173791489,null,26.443819558847519,-25.850383628562277,null,38.50082881193844,-101.14158874129583,null,0,0]
[13259.75,13.25975,15.982336736545525,1.5081863561662054,1.0001998846725781,1.9992567786772612E-2,1,0,9600.1407884083037,1.5706921616556713,2.6271819169473796,1.1803123621601161,1.0017482901227244,5.9088862203853773E-2,1.0364011531823882,0.27885122029778037,12.487692078353643,-126.99687869074683,53.003121309253174,null,1000000000,175820970.0625,null,26.436303085477817,-25.752657368196214,null,38.447164158643702,-101.24422132255063,null,0,0]
[13336.5,13.336499999999999,16.07448447178519,1.5085457364343309,1.0002022050771384,2.0108257537917784E-2,1,0,9655.7082612142531,1.5706927611138781,2.6401907852494135,1.1823396742580112,1.0017685696621603,5.943007753032313E-2,1.0368163365390679,0.28039347055668701,12.426894606565455,-127.00263367724396,52.997366322756037,null,1000000000,177862232.25,null,26.428899877694828,-25.65608548565779,null,38.393769894638503,-101.34654819158619,null,0,0]
[13413.25,13.41325,16.166634259444656,1.5089010198140789,1.0002045388684615,2.0223946750730307E-2,1,0,9711.2757340236294,1.5706933537119407,2.6532103982867503,1.1843470980250093,1.0017889658306764,5.9771279002402006E-2,1.0372337502213598,0.28193454777846072,12.366475266626342,-127.00922508066273,52.990774919337269,null,1000000000,179915275.5625,null,26.421607631222042,-25.560651933687211,null,38.34064280117218,-101.44857314697551,null,0,0]
[13490,13.49,16.258786064626477,1.5092522758762124,1.0002068860464532,2.0339635422117183E-2,1,0,9766.84320683638,1.570693939566949,2.6662405986554134,1.1863349087519086,1.0018094786211489,6.0112466541494748E-2,1.0376533915675563,0.2834744471052168,12.306428647080601,-127.01664083815974,52.983359161840255,null,1000000000,181980100,null,26.4144240982436,-25.466340941489126,null,38.287779714604881,-101.55029989667059,null,0,0]
[13568.5,13.5685,16.35304110253329,1.5096074458032014,1.0002093005910624,2.0457961382638095E-2,1,0,9823.6776904333037,1.5706945319240511,2.6795786957715015,1.1883480371917805,1.0018305797634748,6.0461419105977653E-2,1.0380849029319381,0.2850482346213104,12.245392924896315,-127.02506606590829,52.974933934091709,null,1000000000,184104192.25,null,26.407186945855603,-25.371024626914842,null,38.233981144808588,-101.65404143899345,null,0,0]
[13647,13.647,16.447298179661939,1.5099585449195216,1.0002117291395671,2.0576286770216667E-2,1,0,9880.5121740336363,1.5706951174664636,2.692927544779101,1.1903412154767292,1.0018518028914514,6.0810356928596314E-2,1.0385187390416846,0.28662077972476463,12.184736007903771,-127.03432872579199,52.965671274208006,null,1000000000,186240609,null,26.40005893842325,-25.276850136920046,null,38.180452235248403,-101.75747858887195,null,0,0]
[13725.5,13.7255,16.541557261152754,1.510305642728206,1.0002141716918656,2.0694611581543766E-2,1,0,9937.3466576373175,1.5706956963111125,2.7062869865760479,1.1923147231003699,1.0018731479973264,6.1159279925318645E-2,1.038954897017021,0.28819207730869967,12.124452449969576,-127.04441649570835,52.955583504291653,null,1000000000,188389350.25,null,26.393037843793024,-25.183801459584846,null,38.127189771944437,-101.86061503612351,null,0,0]
[13804,13.804,16.635818312935388,1.5106488071609359,1.0002166282478548,2.0812935813310347E-2,1,0,9994.1811412442894,1.5706962685722632,2.7196568650613084,1.1942688346797865,1.0018946150733037,6.1508188012134105E-2,1.0393933739676213,0.28976212229698067,12.064536915059351,-127.05531724453805,52.944682755461955,null,1000000000,190550416,null,26.386121484800316,-25.091862862242802,null,38.074190596026909,-101.96345438229525,null,0,0]
[13884.25,13.88425,16.732182727735413,1.5109956250156131,1.0002191540431711,2.0933897243891469E-2,1,0,10052.282635635653,1.5706968469018319,2.7333354269547869,1.1962467407722992,1.0019166867855331,6.1864858805051853E-2,1.0398440199580867,0.29136586824122485,12.00366066004486,-127.06728893402384,52.932711065976164,null,1000000000,192772398.0625,null,26.379156992117416,-24.999006057715729,null,38.020278833695329,-102.06828287630807,null,0,0]
[13964.5,13.964499999999999,16.828549132076972,1.5113384709003161,1.0002216944732873,2.1054858061790541E-2,1,0,10110.384130030341,1.5706974185844103,2.7470245754489073,1.1982049416058438,1.0019388859500213,6.2221513838396254E-2,1.0402970833281244,0.29296829448935818,11.94315808220898,-127.08008521285289,52.919914787147107,null,1000000000,195007260.25,null,26.372297524609522,-24.907276997561507,null,37.966635723367339,-102.17280821529138,null,0,0]
[14044.75,14.044750000000001,16.924917491976146,1.5116774125814487,1.0002242495380922,2.1175818263472562E-2,1,0,10168.485624428295,1.5706979837339388,2.7607241530615716,1.200143715401099,1.0019612125582973,6.2578153022482763E-2,1.0407525609561337,0.2945693957180513,11.883023819462341,-127.09369371947156,52.90630628052844,null,1000000000,197255002.5625,null,26.36554092432889,-24.816659742299194,null,37.913258060901327,-102.27703397717235,null,0,0]
[14125,14.125,17.02128777421796,1.5120125162943432,1.0002268192374739,2.1296777845402647E-2,1,0,10226.587118829459,1.5706985424617683,2.774434005302334,1.2020633354699222,1.0019836666018418,6.2934776267650983E-2,1.041210449709371,0.29616916663773418,11.823252618126027,-127.10810228764412,52.891897712355885,null,1000000000,199515625,null,26.358885086739544,-24.727138633555658,null,37.860142697154366,-102.38096365408845,null,0,0]
[14207.25,14.20725,17.12006176887844,1.5123520566024955,1.0002294681652981,2.1420751349541595E-2,1,0,10286.136625555424,1.5706991085643813,2.7884960394532765,1.2040112017430264,1.0020068124775325,6.3300270686049237E-2,1.0416822487403987,0.29780742128536875,11.762363152595491,-127.12368763920769,52.876312360792312,null,1000000000,201845952.5625,null,26.35216578498483,-24.636507839847646,null,37.805972533378537,-102.48717979936005,null,0,0]
[14289.5,14.2895,17.218837714625788,1.5126877013997377,1.0002321324659971,2.1544724195133851E-2,1,0,10345.686132284645,1.5706996681500498,2.8025685474732063,1.2059395136704849,1.0020300922012815,6.3665748170526698E-2,1.0421565738757632,0.29944426734691915,11.701844232704786,-127.1400881639733,52.859911836026697,null,1000000000,204189810.25,null,26.345548019805097,-24.546996083981952,null,37.752071378667573,-102.59309207999137,null,0,0]
[14371.75,14.37175,17.317615578074271,1.5130195172685468,1.0002348121394484,2.1668696378373951E-2,1,0,10405.235639017072,1.5707002213306638,2.816651372374003,1.207848550109641,1.0020535057637596,6.4031208624630576E-2,1.0426334217068154,0.3010796992380565,11.641690538713883,-127.15729138063104,52.842708619368963,null,1000000000,206547198.0625,null,26.339029690047276,-24.458587389494181,null,37.698436014434485,-102.69870399113687,null,0,0]
[14454,14.454000000000001,17.416395326594902,1.5133475692842859,1.0002375071855281,2.1792667895456551E-2,1,0,10464.785145752643,1.5707007682155667,2.8307443601776261,1.2097385849327262,1.002077053155586,6.439665195193528E-2,1.043112788813044,0.30271371141187464,11.581896858704251,-127.17528500914538,52.824714990854616,null,1000000000,208918116,null,26.332608746931946,-24.37126606540145,null,37.645063277540189,-102.80401894374393,null,0,0]
[14622.5,14.6225,17.618764454997869,1.5140081400936793,1.0002430763483112,2.2046637843282764E-2,1,0,10586.78018387707,1.5707018693693038,2.8596468120484086,1.2135523619476569,1.0021257109786827,6.514525703725578E-2,1.0441026883335933,0.30605674477922729,11.460504428938345,-127.21456490163824,52.785435098361759,null,1000000000,213817506.25,null,26.319750346035281,-24.195707741613941,null,37.536529248670945,-103.01885716002431,null,0,0]
[14706.75,14.70675,17.719951852816873,1.5143327674351794,1.0002458851231553,2.2173621752561382E-2,1,0,10647.777702944015,1.570702410483966,2.8741134001211934,1.2154304729420828,1.0021502504751771,6.551953221453953E-2,1.0446015883497279,0.30772600373131848,11.400353446848383,-127.23539808722963,52.764601912770374,null,1000000000,216288495.5625,null,26.313466090853147,-24.109575299699042,null,37.482662521763118,-103.12582278753057,null,0,0]
[14791,14.791,17.82114109681012,1.51465370831277,1.0002487100267865,2.2300604946631358E-2,1,0,10708.775222014043,1.5707029454342161,2.8885900244914953,1.2172897655413752,1.0021749303479046,6.5893789010213005E-2,1.0451031169050211,0.30939374978490419,11.340559037017311,-127.25701022051265,52.742989779487345,null,1000000000,218773681,null,26.30727579594285,-24.024519666020247,null,37.429058406842344,-103.23249055449237,null,0,0]
[14877.25,14.87725,17.924734339144035,1.514978514310384,1.0002516186979526,2.2430601833395892E-2,1,0,10771.220753409345,1.5707034868072731,2.9034205473576633,1.2191739824429599,1.0022003414965002,6.6276911090834431E-2,1.0456192701562501,0.31109951304282002,11.279709266433516,-127.27992961642944,52.720070383570558,null,1000000000,221332567.5625,null,26.301033857752675,-23.938544286423177,null,37.374450574448723,-103.34138533000623,null,0,0]
[14963.5,14.9635,18.028329450785886,1.5152995875149782,1.0002545442724631,2.2560597961919653E-2,1,0,10833.666284807767,1.5707040219393535,2.9182612733698563,1.2210390416583243,1.0022258997431239,6.6660013687323896E-2,1.0461381702810013,0.31280367855675406,11.219222584768254,-127.30363981914388,52.696360180856118,null,1000000000,223906332.25,null,26.294886331803653,-23.853665087452871,null,37.320111418732481,-103.44997473169101,null,0,0]
[15049.75,15.04975,18.13192639969531,1.5156169918418356,1.0002574867501695,2.26905933278157E-2,1,0,10896.111816209255,1.5707045509377586,2.9331120476528874,1.2228852211075629,1.0022516050765224,6.7043096688722201E-2,1.046659813240695,0.31450624024106372,11.159093785868485,-127.32812821844371,52.671871781556291,null,1000000000,226494975.0625,null,26.288831240436529,-23.76986614525126,null,37.266037711199836,-103.55826207319241,null,0,0]
[15136,15.135999999999999,18.235525154559472,1.5159307897567855,1.0002604461309226,2.2820587926697264E-2,1,0,10958.557347613762,1.5707050739073434,2.9479727183485704,1.2247127936273121,1.0022774574853788,6.7426159984104492E-2,1.0471841949834955,0.31620719205565456,11.099317769392631,-127.35338241480099,52.64661758519901,null,1000000000,229098496,null,26.282866655869299,-23.687131827082805,null,37.212226279291215,-103.66625058771821,null,0,0]
[15224,15.224,18.341227742682531,1.5162473010177169,1.0002634829778931,2.2953219302082436E-2,1,0,11022.26988980344,1.5707056013806788,2.9631449550466247,1.2265585481819707,1.0023039860059966,6.7816975153352277E-2,1.0477220348390752,0.31794099051917957,11.0386873134269,-127.37992562646127,52.620074373538728,null,1000000000,231770176,null,26.276872380915425,-23.603800162752123,null,37.15759009827935,-103.77612546370915,null,0,0]
[15312,15.311999999999999,18.446932147161188,1.5165601849711126,1.0002665374204736,2.3085849869786772E-2,1,0,11085.982431996148,1.5707061227911026,2.9783271837453578,1.2283854911850574,1.0023306676068962,6.8207769575630656E-2,1.0482627171812953,0.31967310056417181,10.978413699276604,-127.40724060214848,52.592759397851523,null,1000000000,234457344,null,26.270968420789945,-23.521544784840788,null,37.103220444254539,-103.88569581730766,null,0,0]
[15400,15.4,18.552638336949173,1.5168695035564215,1.0002696094585024,2.3218479625151514E-2,1,0,11149.694974191838,1.5707066382425501,2.9935192524155112,1.2301938967523784,1.0023575022758535,6.8598543133236697E-2,1.0488062376648846,0.32140351592212879,10.918491833056439,-127.43531482537216,52.56468517462784,null,1000000000,237160000,null,26.265152879161814,-23.440349986881177,null,37.049114119662505,-103.994964838491,null,0,0]
[15488,15.488,18.658346281703242,1.5171753173121989,1.0002726990918176,2.3351108563518085E-2,1,0,11213.407516390456,1.5707071478365948,3.0087210120008763,1.2319840339501755,1.0023844900005752,6.8989295708505607E-2,1.0493525919308144,0.32313223037400202,10.858916724163823,-127.46413599139574,52.535864008604264,null,1000000000,239878144,null,26.259423907621748,-23.360200351591249,null,36.995267982309954,-104.1039356398045,null,0,0]
[15578.25,15.578250000000001,18.766758778189772,1.5174853717572343,1.000275885997125,2.3487127729216375E-2,1,0,11278.749072455097,1.5707076644800524,3.0243213656099028,1.2338012433746346,1.002412326715229,6.9390017199531723E-2,1.0499158542919944,0.32490337175313017,10.7981734359144,-127.4944572255405,52.505542774459499,null,1000000000,242681873.0625,null,26.253636487990018,-23.279071172671252,null,36.940312113692258,-104.21538605286928,null,0,0]
[15668.5,15.6685,18.875173058070786,1.517791864480863,1.0002790914086321,2.3623146025679657E-2,1,0,11344.090628522712,1.5707081751718144,3.0399316037618549,1.2355997957204627,1.0024403243860072,6.9790716370985467E-2,1.050482087866849,0.32667271104625362,10.737784553161944,-127.52553853800214,52.474461461997862,null,1000000000,245501892.25,null,26.247936332497375,-23.199009345791747,null,36.885623386432449,-104.32652919221039,null,0,0]
[15758.75,15.758749999999999,18.983589090791668,1.5180948564484018,1.0002823153261609,2.3759163447883366E-2,1,0,11409.432184593254,1.5707086800141365,3.0555515749619255,1.237379965386584,1.0024684829994239,7.0191393096069962E-2,1.0510512879093004,0.32844024170717073,10.677745013909195,-127.55736732374771,52.442632676252288,null,1000000000,248338201.5625,null,26.242321595169052,-23.119999147646354,null,36.831198584508023,-104.43736817610139,null,0,0]
[15849,15.849,19.092006846491344,1.5183944072429572,1.0002855577495324,2.3895179990803136E-2,1,0,11474.773740666667,1.5707091791069452,3.0711811307038031,1.2391420216574203,1.0024968025419174,7.0592047248031309E-2,1.051623449658738,0.33020595724444229,10.618049859065303,-127.58993119459564,52.410068805404364,null,1000000000,251190801,null,26.236790477003428,-23.042025147837069,null,36.77703454782975,-104.54790604675857,null,0,0]
[15941.25,15.94125,19.202828962027535,1.5186971005033978,1.0002888911525134,2.4034209836781631E-2,1,0,11541.563309065961,1.5707096834196039,3.0871668017277543,1.2409246814376977,1.0025259159681363,7.1001556701423177E-2,1.0522113468058456,0.33200891960500067,10.557382678484474,-127.6239637280442,52.376036271955797,null,1000000000,254123451.5625,null,26.231221379585492,-22.963378324366559,null,36.721936464666868,-104.66058540367766,null,0,0]
[16033.5,16.0335,19.313652816797227,1.5189963200168437,1.0002922438902475,2.4173238753458583E-2,1,0,11608.352877468156,1.5707101819290581,3.1031621822893318,1.242688969186317,1.002555197506158,7.1411042302471278E-2,1.0528023282773877,0.33380997196191237,10.497065155188402,-127.65873878928628,52.341261210713725,null,1000000000,257073122.25,null,26.225735991800573,-22.885782441634564,null,36.667104329155713,-104.77295634765173,null,0,0]
[16125.75,16.12575,19.424478381031513,1.5192921251872142,1.0002956159625402,2.4312266735468782E-2,1,0,11675.142445873202,1.5707106747349018,3.1191671230142894,1.2444351566439764,1.0025846471412529,7.1820503915947728E-2,1.053396388943252,0.33560910755995432,10.437092309397777,-127.69424382354065,52.305756176459354,null,1000000000,260039813.0625,null,26.220332535585094,-22.809221928004298,null,36.612534939580563,-104.88502189553631,null,0,0]
[16218,16.218,19.535305625636546,1.519584574072814,1.0002990073691962,2.4451293777447224E-2,1,0,11741.932014281048,1.5707111619344638,3.1351814774901978,1.2461635104457394,1.0026142648586085,7.2229941406672646E-2,1.0539935236582259,0.33740631970368307,10.377459262491467,-127.73046649475718,52.269533505242819,null,1000000000,263023524,null,26.215009278277066,-22.733681504243233,null,36.558225149982285,-104.99678499051393,null,0,0]
[16312.5,16.3125,19.648837686393779,1.5198807350980059,1.0003025015403506,2.4593710742577903E-2,1,0,11810.350596555363,1.570711655303308,3.1515960369275375,1.2479158012743496,1.0026447792253497,7.264934002393833E-2,1.0546084046691806,0.33924536495725932,10.316719086592718,-127.76830408162722,52.231695918372779,null,1000000000,266097656.25,null,26.209637577430271,-22.657340673852605,null,36.502856674930328,-105.11096340777461,null,0,0]
[16407,16.407,19.762371450775369,1.5201734932902098,1.0003060160000905,2.4736126709865996E-2,1,0,11878.769178832517,1.5707121429888031,3.1680201731162598,1.2496499283918701,1.0026754699417428,7.3068713040369562E-2,1.0552265005336179,0.34108237775406552,10.256325437612183,-127.80686921804076,52.19313078195924,null,1000000000,269189649,null,26.204346494786172,-22.582038754997235,null,36.447754108593891,-105.22483046304352,null,0,0]
[16501.5,16.5015,19.875906889587355,1.5204629069119411,1.0003095507482023,2.4878541673544991E-2,1,0,11947.187761112462,1.5707126250885903,3.1844537378772322,1.2513661624918868,1.0027063369915943,7.3488060310810469E-2,1.0558478056725709,0.34291735109175447,10.196273384538721,-127.84614932899706,52.153850671002942,null,1000000000,272299502.25,null,26.199134307221836,-22.507760235354677,null,36.392914243084768,-105.33838909364238,null,0,0]
[16596,16.596,19.989443974298592,1.5207490329042959,1.0003131057844703,2.5020955627848639E-2,1,0,12015.606343395153,1.5707131016980871,3.2008965859901575,1.2530647691322552,1.0027373803586204,7.3907381690159313E-2,1.0564723144913029,0.34475027803373842,10.136558096661851,-127.88613206168273,52.11386793831727,null,1000000000,275427216,null,26.193999335852919,-22.434489896733886,null,36.338333926576809,-105.45164216494884,null,0,0]
[16692.5,16.692499999999999,20.105385629814094,1.5210378795728949,1.0003167569961453,2.5166382586457821E-2,1,0,12085.472938004074,1.5707135828256478,3.2176968631253402,1.2547814048468109,1.0027692626651379,7.4335550726484886E-2,1.0571133406986997,0.346619878121182,10.075921606498522,-127.92767346407223,52.072326535927772,null,1000000000,278639556.25,null,26.188833672675912,-22.360693760522363,null,36.282863099590486,-105.56697970354985,null,0,0]
[16789,16.789000000000001,20.221328943534399,1.5213234139368044,1.000320429363365,2.5311808480362352E-2,1,0,12155.339532615757,1.5707140584223478,3.2345065237754631,1.2564802028866129,1.0028013287963551,7.4763692458556019E-2,1.0577576957854191,0.34848732986616271,10.015626414381858,-127.96992219759657,52.030077802403426,null,1000000000,281870521,null,26.183745125591322,-22.287917766478206,null,36.227656454558421,-105.68200443111834,null,0,0]
[16885.5,16.8855,20.337273887099094,1.5216056926004573,1.0003241228858963,2.5457233303422859E-2,1,0,12225.20612723016,1.5707145285830131,3.2513254223995438,1.2581614301891737,1.0028335787346385,7.5191806732038166E-2,1.058405373744427,0.35035262609437845,9.9556676836311038,-128.01286579694295,51.987134203057053,null,1000000000,285120110.25,null,26.178732041178389,-22.216146616798945,null,36.172710808220593,-105.79671918014395,null,0,0]
[16982,16.981999999999999,{"$f":"SQRT(1+(A269/pole1)^2)","v":20.453220432790474},{"$f":"ATAN(A269/pole1)","v":1.5218847708868579},{"$f":"SQRT(1+(A269/Zero1)^2)","v":1.000327837563505},{"$f":"ATAN(A269/Zero1)","v":2.5602657049500245E-2},{"$f":"IF(VIN_nom>Vout, 1, SQRT(1+(A269/z_RHP)^2))","v":1},{"$f":"IF(VIN_nom>Vout, 0, -ATAN(A269/z_RHP))","v":0},{"$f":"SQRT(1+(A269/Pole2)^2)","v":12295.072721847235},{"$f":"ATAN(A269/Pole2)","v":1.5707149934003144},3.2681534163734245,1.2598253485959297,{"$f":"SQRT(1+(A269/pole4)^2)","v":1.0028660124622557},{"$f":"ATAN(A269/pole4)","v":7.561989339265679E-2},{"$f":"SQRT((1-(V269/pterm2))^2+(A269/pterm1)^2)","v":1.0590563685524872},{"$f":"IF((ATAN((A269/pterm1)/(1-A269^2/pterm2))>0),ATAN((A269/pterm1)/(1-A269^2/pterm2)),PI()+ATAN((A269/pterm1)/(1-A269^2/pterm2)))","v":0.35221575970288049},{"$f":"20*LOG10(((E269*K269*G269)/(C269*I269*O269*M269))*Adc)","v":9.8960406757669119},{"$f":"((F269+L269+H269)-(D269+J269+P269+N269))*radconv","v":-128.05649201932982},{"$f":"IF(R269>0,R269,R269+180)","v":51.943507980670176},null,1000000000,288388324,null,{"$f":"20*LOG10((K269/(I269*M269))*AEA)","v":26.173792808557749},{"$f":"(L269-(J269+N269))*radconv","v":-22.145365305545731},null,{"$f":"20*LOG10((E269*G269/(C269*O269))*Acs*Am)","v":36.118023032977035},{"$f":"(F269+H269-(D269+P269))*radconv","v":-105.91112671378411},null,0,0]
[17081,{"$f":"A270/1000","v":17.081},20.572172411531422,1.5221678100366984,1.0003316704603027,2.5751847124508467E-2,1,0,12366.749331871626,1.5707154648016393,3.2854266740965068,1.2615146555680854,1.0028994774162752,7.6059041524459983E-2,1.0597276690360207,0.354124906266502,9.8352087859394004,-128.10194523106205,51.898054768937953,null,{"$f":"IF(Q270<0,A270,1000000000)","v":1000000000},{"$f":"A270^2","v":291760561},null,26.168800718047287,-22.073763489497114,null,36.062183233659994,-106.02818174156491,null,{"$f":"SUM((Q271<0)*(Q270>0))*A270","v":0},0]
[17180,17.18,20.691126019383709,1.5224475948157195,1.0003355256219906,2.5901036052919373E-2,1,0,12438.425941898733,1.57071593077005,3.3027092095453772,1.2631862875366937,1.0029331357676148,7.6498160265394549E-2,1.0604024475579414,0.35603176179124074,9.774716232128748,-128.14809148776891,51.851908512231091,null,1000000000,295152400,null,26.163883052536075,-22.003172381300015,null,36.006608345360554,-106.14491910646892,null,0,0]
[17279,17.279,20.810081228410578,1.5227241809879337,1.0003394030483106,2.6050223828105158E-2,1,0,12510.10255192851,1.5707163913989306,3.3200008778321641,1.2648405112577215,1.0029669874968039,7.6937249449081618E-2,1.0610806975630742,0.35793631884145122,9.7145582037239802,-128.19491827066841,51.80508172933159,null,1000000000,298563841,null,26.15903820393067,-21.933576692781074,null,35.951295165561191,-106.26134157788736,null,0,0]
[17378,17.378,20.929038011310052,1.5229976230515281,1.0003433027390041,2.6199410443438331E-2,1,0,12581.779161960911,1.5707168467795363,3.337301536996065,1.2664775883411474,1.0030010325842631,7.7376308909210351E-2,1.0617624124793623,0.3598385700602702,9.6547299880505673,-128.24241328769102,51.757586712308978,null,1000000000,301994884,null,26.154264605786068,-21.864961430492219,null,35.896240548032381,-106.37745185719884,null,0,0]
[17479.25,17.47925,21.050699957583795,1.5232740831093741,1.0003473140878965,2.6351986457066101E-2,1,0,12655.084785860354,1.570717307174091,3.3550045477085204,1.2681344034885209,1.0030360514031564,7.7825316075639847E-2,1.0624631979777568,0.36178166164181746,9.5938783702293424,-128.2916663463547,51.708333653645298,null,1000000000,305524180.5625,null,26.149454624421047,-21.795785509307766,null,35.840198911576174,-106.49588083704695,null,0,0]
[17580.5,17.580500000000001,21.172363494275487,1.5235473659225633,1.0003513487241269,2.6504561243500695E-2,1,0,12728.390409762445,1.5707177622656172,3.3727166713356209,1.2697738212706293,1.0030712724274324,7.8274291800440057E-2,1.0631675937155121,0.3637223260772961,9.533362059058792,-128.34159305768733,51.658406942312666,null,1000000000,309073980.25,null,26.144715982765732,-21.727604278414965,null,35.784421242060937,-106.61398877927238,null,0,0]
[17681.75,17.681750000000001,21.294028594124551,1.5238175259102309,1.0003554066474138,2.665713479565341E-2,1,0,12801.696033667147,1.5707182121452137,3.3904377650559265,1.2713961056021772,1.0031066956357915,7.8723235905924199E-2,1.0638755926091841,0.36566055575191997,9.4731763148029913,-128.39218097762688,51.607819022373121,null,1000000000,312644283.0625,null,26.140047132189398,-21.660402611653971,null,35.728904348381469,-106.7317783659729,null,0,0]
[17783,17.783000000000001,21.41569523048954,1.5240846162566977,1.0003594878574738,2.680970710643589E-2,1,0,12875.001657574405,1.5707186569019054,3.4081676889468699,1.2730015152710541,1.0031423210068153,7.917214821448143E-2,1.0645871875580444,0.36759634313671347,9.4133164941791385,-128.4434178899086,51.556582110091398,null,1000000000,316235089,null,26.135446564304385,-21.594165676495287,null,35.673645095642627,-106.84925221341332,null,0,0]
[17886.5,17.886500000000002,21.540067130887202,1.5243545233448548,1.0003636838295422,2.6965668622577481E-2,1,0,12949.936295348876,1.5707191063377308,3.4263005951041379,1.2746254236089336,1.0031789469816603,7.9631003302587308E-2,1.0653183051282786,0.36957261596670649,9.3524585871566632,-128.49645169932077,51.503548300679228,null,1000000000,319926882.25,null,26.130812807472026,-21.527438793074975,null,35.617420945452515,-106.96901290624584,null,0,0]
[17990,17.989999999999998,21.664440582458248,1.5246213314314478,1.000367904134247,2.7121628826586513E-2,1,0,13024.870933125929,1.5707195506021714,{"$f":"SQRT(1+(A279/Zero2)^2)","v":3.444442441538432},{"$f":"ATAN(A279/Zero2)","v":1.2762322299266302},1.00321578415837,8.0089824789803157E-2,1.0660531652956922,0.3715463211189835,9.2919317362405973,-128.55013855919671,51.449861440803289,null,1000000000,323640100,null,26.126247337892067,-21.46168956174569,null,35.561459564116412,-107.08844899745104,null,0,0]
[18093.5,18.093499999999999,21.788815558639765,1.5248850935473495,1.00037214877128,2.7277587710892622E-2,1,0,13099.805570905524,1.5707199897839723,3.4625930877251871,1.2778221948037212,1.0032528325136791,8.0548612486661314E-2,1.0667917604215156,0.37351745082868221,9.231731278206869,-128.60446612764045,51.39553387235955,null,1000000000,327374742.25,null,26.12174866690113,-21.396903046626438,null,35.505757777073619,-107.20756308101402,null,0,0]
[18197,18.196999999999999,21.913192033471585,1.525145861521163,1.0003764177403318,2.7433545267925824E-2,1,0,13174.740208687619,1.5707204239698602,3.480752396003485,1.2793955737265099,1.0032900920241938,8.1007366203778935E-2,1.0675340828494151,0.37548599742410721,9.1718526446417208,-128.65942229092153,51.340577709078474,null,1000000000,331130809,null,26.117315344626434,-21.333064603548539,null,35.450312465783171,-107.32635768737298,null,0,0]
[18303,18.303000000000001,22.040574297857582,1.5254098776654195,1.0003808150449642,2.7593268532049679E-2,1,0,13251.484861877621,1.5707208635535035,3.4993591724766206,1.2809900269596555,1.0033284703656593,8.1477165509962521E-2,1.0682981911893452,0.37749940807714111,9.1108565696089556,-128.71634502855673,51.283654971443269,null,1000000000,334999809,null,26.112841197351667,-21.2686518663347,null,35.393790538025172,-107.447693162222,null,0,{"$f":"IF(AD282>0,S282,0)","v":0}]
[18409,18.408999999999999,22.167958080915067,1.5256708595946697,1.0003852378706082,2.7752990387936039E-2,1,0,13328.229515070154,1.5707212980748548,3.5179747511846826,1.2825676098744332,1.0033670701361752,8.1946928773238836E-2,1.0690661927585559,0.37951009333157398,9.0501886488704955,-128.77390208821441,51.226097911785587,null,1000000000,338891281,null,26.108432635212502,-21.205203372009059,null,35.337531179425874,-107.5686987162054,null,0,0]
[18515,18.515000000000001,22.29534335661339,1.5259288592813551,1.0003896862169253,2.7912710827454272E-2,1,0,13404.974168265178,1.5707217276208605,3.536598993130831,1.2841285810803635,1.0034058913101873,8.2416655790447088E-2,1.0698380792772637,0.38151804524911415,8.9898442683355508,-128.83208116943888,51.167918830561121,null,1000000000,342805225,null,26.104088219581417,-21.142704296678922,null,35.281531214522012,-107.68937687275996,null,0,0]
[18621,18.620999999999999,22.422730099513128,1.5261839275184752,1.0003941600835748,2.8072429842474194E-2,1,0,13481.718821462646,1.5707221522764869,3.5552317621667786,1.2856731940931441,1.0034449338619986,8.2886346358521851E-2,1.0706138424478162,0.38352325599326065,8.9298189078152461,-128.89087020177575,51.109129798224245,null,1000000000,346741641,null,26.09980654948518,-21.081140108198191,null,35.225787524097953,-107.80973009357756,null,0,0]
[18729.5,18.729500000000002,22.553122740291279,1.5264420273584018,1.0003987658958622,2.8235914331620243E-2,1,0,13560.273490068201,1.5707225819694963,3.574312675234705,1.2872375546034378,1.0034851264728708,8.3367076573730686E-2,1.0714119081158506,0.38557291245933173,8.8687036275256155,-128.95166510421475,51.048334895785246,null,1000000000,350794170.25,null,26.095487455339665,-21.019077285262316,null,35.168991337953827,-107.93258781895238,null,0,0]
[18838,18.838000000000001,22.683516866185048,1.5266971598884269,1.000403398445739,2.8399397311046373E-2,1,0,13638.828158676233,1.570723006712756,3.5934022425388892,1.2887852978702228,1.0035255509720933,8.3847768170008857E-2,1.0722140178048909,0.38761968063778074,8.8079133002640901,-129.01307419374902,50.98692580625098,null,1000000000,354870244,null,26.091231246925126,-20.957964063946221,null,35.112457219106837,-108.05511012980278,null,0,0]
[18946.5,18.9465,22.813912451729667,1.5269493759550683,1.000408057732834,2.8562878772034908E-2,1,0,13717.382827286696,1.5707234265913026,3.6125003268843621,1.2903166799683388,1.0035662073316438,8.4328420929895231E-2,1.0730201625604523,0.38966355245448553,8.7474433684553716,-129.07508524196095,50.924914758039051,null,1000000000,358969862.25,null,26.087036536912301,-20.897785764654959,null,35.056181997310944,-108.17729947730601,null,0,0]
[19055,19.055,22.94430947203897,1.5271987252504649,1.0004127437567734,2.8726358705868652E-2,1,0,13795.937495899552,1.5707238416882359,3.6316067939015362,1.2918319518941925,1.0036070955233445,8.4809034636035563E-2,1.0738303334100467,0.39170451994614036,8.6872893673140563,-129.13768625150902,50.862313748490976,null,1000000000,363093025,null,26.08290197442048,-20.838527998661501,null,35.000162558661458,-108.2991582528475,null,0,0]
[19165.75,19.165749999999999,23.077412032469635,1.5274503392543088,1.0004175545302034,2.8893227192540456E-2,1,0,13876.121178380074,1.5707242605461222,3.6511179865410481,1.2933622872237058,1.0036490706907972,8.5299574483303539E-2,1.0746614478971388,0.39378480820292544,8.6262092167886841,-129.20218165543341,50.797818344566593,null,1000000000,367325973.0625,null,26.078742337597415,-20.77897610469314,null,34.943242044959149,-108.42320555074028,null,0,0]
[19276.5,19.276499999999999,23.210516037165437,1.5276990674411817,1.0004223931600842,2.9060094069710753E-2,1,0,13956.304860863002,1.5707246745910486,3.6706376389163302,1.2948763500870075,1.0036912873454311,8.5790073183012128E-2,1.0754967382440797,0.39586205401545599,8.5654491209069477,-129.26726719752043,50.732732802479575,null,1000000000,371583452.25,null,26.074642635854005,-20.720353921018233,null,34.886581650820823,-108.54691327650222,null,0,0]
[19387.25,19.387250000000002,23.343621461421019,1.5279449591448619,1.0004272596460109,2.922695932811031E-2,1,0,14036.488543348296,1.5707250839054976,3.690165616780483,1.2963743918234962,1.0037337454567758,8.6280530504351083E-2,1.0763361948531114,0.39793624927022386,8.5050046151550216,-129.33293083086346,50.667069169136539,null,1000000000,375865462.5625,null,26.070601542848447,-20.662647038451475,null,34.830178238074453,-108.67028379241196,null,0,0]
[19498,19.498000000000001,23.476728281091059,1.5281880625816799,1.0004321539875771,2.9393822958470407E-2,1,0,14116.672225835915,1.5707254885700772,3.7097017886566626,1.2978566587691445,1.0037764449941915,8.6770946216628703E-2,1.0771798081086938,0.40000738597286156,8.4448713257054173,-129.39916073793137,50.600839262068632,null,1000000000,380172004,null,26.066617767116846,-20.605841334382113,null,34.774028724356448,-108.79331940354926,null,0,0]
[19611.75,19.611750000000001,23.613442130938004,1.5284348981284119,1.0004372099045062,2.9565204892353782E-2,1,0,14199.027926813162,1.5707258994384621,3.7297755517723017,1.2993629094621715,1.0038205524701391,8.7274602770252396E-2,1.078050590136759,0.40213143348018271,8.3834286185305356,-129.46776199750181,50.53223800249819,null,1000000000,384620738.0625,null,26.062584425128392,-20.548420462588535,null,34.716619359170025,-108.91934153491329,null,0,0]
[19725.5,19.7255,23.750157402936228,1.5286788919243719,1.000442295205747,2.9736585088983938E-2,1,0,14281.383627792777,1.5707263055681808,3.7498576863600306,1.3008530302380619,1.0038649145627558,8.777821493714523E-2,1.0789257364345994,0.40425223778047487,8.3223051473509067,-129.53693607570762,50.463063924292385,null,1000000000,389095350.25,null,26.058608894419425,-20.491920952293913,null,34.659471418699361,-109.04501512341369,null,0,0]
[19839.25,19.83925,23.886874072666899,1.5289200927345903,1.0004474098908507,2.9907963538320169E-2,1,0,14363.73932877472,1.5707267070407422,3.7699480586378789,1.3023272722989752,1.0039095312382877,8.8281782467751008E-2,1.0798052365282609,0.40636979060234241,8.2614964566874942,-129.60667089078638,50.393329109213624,null,1000000000,393595840.5625,null,26.054689883582213,-20.436328401046286,null,34.602581738873162,-109.17034248974011,null,0,0]
[19953,19.952999999999999,24.023592116266823,1.5291585482153285,1.0004525539593672,3.0079340230322379E-2,1,0,14446.095029758955,1.570727103935796,3.7900465376061958,1.3037858817979815,1.0039544024627929,8.8785305112648288E-2,1.0806890799259727,0.40848408380550555,8.2009981819136346,-129.67695459415322,50.323045405846784,null,1000000000,398122209,null,26.050826135403131,-20.381628695586393,null,34.545947212278378,-109.29532589856679,null,0,0]
[20069,20.068999999999999,24.163015863542697,1.5293989413573257,1.0004578300391962,3.0254104970731641E-2,1,0,14530.079744611126,1.5707275040479904,3.8105507847334863,1.30525749351423,1.0040004233659217,8.9298741061439646E-2,1.0815948680669281,0.41063683292007574,8.1396184922959556,-129.74918176051133,50.250818239488666,null,1000000000,402764761,null,26.046941605774251,-20.326752192756754,null,34.488452052289588,-109.42242956775461,null,0,0]
[20185,20.184999999999999,24.302440991149901,1.5296365762019788,1.0004631366754,3.0428867862511439E-2,1,0,14614.064459465599,1.570727899561422,3.8310631958014234,1.3067133496465708,1.0040467089157981,8.9812129807790089E-2,1.0825051509421508,0.41278617550479318,8.0785527309335521,-129.82195557468035,50.178044425319655,null,1000000000,407434225,null,26.043112009954491,-20.272775450399472,null,34.431215886746941,-109.54918012428087,null,0,0]
[20301,20.300999999999998,24.441867475466729,1.5298714999256107,1.0004684738674927,3.060362889501602E-2,1,0,14698.04917432233,1.5707282905549227,3.8515836403737094,1.3081536958012967,1.004093259075824,9.0325471087620401E-2,1.0834199173708361,0.41493210334539321,8.017796546031736,-129.89526418681368,50.104735813186323,null,1000000000,412130601,null,26.039336117757195,-20.219684385696649,null,34.374235594042418,-109.67557980111705,null,0,0]
[20417,20.417000000000002,24.58129529340718,1.5301037586354003,1.0004738416149852,3.0778388057600338E-2,1,0,14782.033889181283,1.5707286771055331,3.8721119907285133,1.30957877263677,1.004140073809199,9.0838764637000219E-2,1.0843391561550555,0.41707460836762927,7.9573456742525126,-129.96909597723135,50.030904022768652,null,1000000000,416853889,null,26.035612731559855,-20.167465199231788,null,34.317508108460537,-109.80163077799958,null,0,0]
[20536,20.536000000000001,24.72433036534893,1.5303393019750948,1.0004793799339751,3.0957664899457935E-2,1,0,14868.190622530237,1.5707290691153213,3.8931793307390805,1.3110250852765697,1.0041883741551032,9.1365283145064993E-2,1.0852868039499688,0.41926895794242403,7.8956442996750411,-130.04536891832169,49.954631081678315,null,1000000000,421727296,null,26.031846389383656,-20.114787337908687,null,34.259573076059262,-109.93058158041302,null,0,0]
[20655,20.655000000000001,24.867366793232854,1.5305721356496187,1.0004849504082016,3.1136939750731476E-2,1,0,14954.347355881449,1.5707294566081242,3.9142547269075241,1.3124558262129213,1.0042369528570319,9.1891750859722621E-2,1.0862391344934554,0.42145968860307848,7.8342554209343778,-130.12216839641525,49.877831603584752,null,1000000000,426629025,null,26.028132851631788,-20.062998500421937,null,34.201897735070467,-110.05916989599328,null,0,0]
[20774,20.774000000000001,25.010404553794736,1.5308023061242921,1.000490553037128,3.1316212599930719E-2,1,0,15040.504089234881,1.5707298396615663,3.935338049801469,1.313871239814004,1.004285809874591,9.2418167496524914E-2,1.0871961356434698,0.42364679208872535,7.7731747106705837,-130.19948258800878,49.800517411991223,null,1000000000,431559076,null,26.024470925591988,-20.012084673656116,null,34.144478950846477,-110.18739791435264,null,0,0]
[20893,20.893000000000001,25.153443624299332,1.5310298588086493,1.0004961878202139,3.1495483435566171E-2,1,0,15126.660822590495,1.5707302183515028,3.9564291726992917,1.3152715654858418,1.0043349451671642,9.2944532771192134E-2,1.088157795241379,0.4258302602913791,7.7123979297273433,-130.27729990208525,49.722700097914753,null,1000000000,436517449,null,26.020859450297976,-19.962032128714579,null,34.087313645197248,-110.31526777337066,null,0,0]
[21014.75,21.014749999999999,25.299789552071086,1.5312600071130944,1.0005019860956412,3.1678894988749234E-2,1,0,15214.808572895621,1.5707306013540585,3.9780156385728791,1.3166888812617574,1.0043855038919998,9.3483008496707112E-2,1.0891464865398388,0.42806041623009816,7.6505268582692878,-130.3574243623919,49.642575637608104,null,1000000000,441619717.5625,null,26.017215551049638,-19.911700247332021,null,34.02908647298753,-110.44572411505983,null,0,0]
[21136.5,21.136500000000002,25.446136804513962,1.5314875081457422,1.0005078180273625,3.1862304409900594E-2,1,0,15302.956323202952,1.5707309799442888,3.9996100091545075,1.3180908953155293,1.0044363538151784,9.4021429857303496E-2,1.0901400282815055,0.43028675024441448,7.5889652213155268,-130.43805164362649,49.561948356373506,null,1000000000,446751632.25,null,26.013622100170796,-19.862241722360576,null,33.971118286912613,-110.5758099212659,null,0,0]
[21258.25,21.25825,25.592485358903097,1.5317124072974664,1.000513683614789,3.2045711686718222E-2,1,0,15391.104073512453,1.5707313541980039,4.0212121570966097,1.3194778486953742,1.0044874948924767,9.455979654908736E-2,1.091138407395156,0.43250925414414204,7.5277087509788405,-130.51917005382262,49.48082994617738,null,1000000000,451913193.0625,null,26.010077951122014,-19.81364272968651,null,33.913405965624712,-110.70552732413611,null,0,0]
[21380,21.38,25.738835193030265,1.5319347489278468,1.0005195828573288,3.2229116806900951E-2,1,0,15479.251823824086,1.5707317241892877,4.0428219577280871,1.3208499775302438,1.0045389270794263,9.5098108268353215E-2,1.0921416107940001,0.43472791990396087,7.4667532663750178,-130.60076813313611,49.399231866863886,null,1000000000,457104400,null,26.006581987963656,-19.765889726961099,null,33.855946444179239,-110.83487840617502,null,0,0]
[21504.5,21.5045,25.888491971037965,1.5321595129928223,1.0005256501509905,3.2416662304798366E-2,1,0,15569.390591085374,1.5707320982051622,4.064927651495351,1.3222380094142174,1.004591821979399,9.5648521813926038E-2,1.0931724491337995,0.43699272191572308,7.404727956663935,-130.68469363064978,49.315306369350225,null,1000000000,462443520.25,null,26.003055759634755,-19.717919160804232,null,33.797447362797058,-110.96677446984555,null,0,0]
[21629,21.629000000000001,26.038150041869297,1.5323816933403243,1.0005317526360273,3.2604205521521566E-2,1,0,15659.529358348816,1.5707324679152461,4.0870410921574116,1.323611023683769,1.004645021193457,9.6198877233850358E-2,1.0942083044294786,0.43925349399438085,7.3430088094646306,-130.76909719346713,49.230902806532868,null,1000000000,467813641,null,25.999577652181078,-19.670805463515123,null,33.739206323051434,-111.098291729952,null,0,0]
[21753.5,21.753499999999999,26.187809383359586,1.5326013342448823,1.0005378903117954,3.279174644391971E-2,1,0,15749.668125614375,1.5707328333934678,4.1091621546446158,1.3249692576552219,1.0046985246732596,9.6749174203990623E-2,1.0952491626410152,0.4415102280886658,7.2815916219726944,-130.85396728622206,49.146032713777942,null,1000000000,473214762.25,null,25.996146565434167,-19.624535023534179,null,33.681220222306408,-111.22943226268787,null,0,0]
[21878,21.878,26.337469973847739,1.5328184789756727,1.000544063177647,3.2979285058842907E-2,1,0,15839.806892882012,1.5707331947120735,4.1312907165234103,1.3263129437810912,1.0047523323701999,9.7299412400421711E-2,1.0962950097142095,0.44376291632443021,7.2204722770337852,-130.93929260468553,49.060707395314466,null,1000000000,478646884,null,25.992761428649885,-19.579094507893217,null,33.62348601415178,-111.36019809679232,null,0,0]
[22005.25,22.00525,26.490437588999054,1.5330378846088044,1.0005504087558679,3.3170963694793089E-2,1,0,15931.93667709944,1.5707335597866587,4.1539156868287321,1.3276715133352146,1.0048076429105235,9.7861743380248903E-2,1.0973690985551532,0.44606117382670857,7.1583064913232732,-131.02696150725788,48.97303849274212,null,1000000000,484231027.5625,null,25.989347918572491,-19.53349431528137,null,33.564733738518655,-111.49346719197652,null,0,0]
[22132.5,22.1325,26.643406464726251,1.5332547708872648,1.0005567910945434,3.3362639892431122E-2,1,0,16024.066461318969,1.570733920663278,4.176548240988958,1.3290153612751001,1.0048632711521954,9.8424012277679079E-2,1.0984483693528455,0.44835518869291058,7.096443418397973,-131.11508280478316,48.884917195216843,null,1000000000,489847556.25,null,25.985980239034951,-19.488733811448871,null,33.506238345130896,-111.6263489933343,null,0,0]
[22259.75,22.25975,26.796376579441077,1.5334691809365268,1.0005632101929702,3.3554313637719532E-2,1,0,16116.196245540559,1.5707342774139257,4.1991882563789522,1.3303447208230292,1.0049192170424557,9.8986218747533314E-2,1.099532807059747,0.45064495308366798,7.0348789254409745,-131.20364514150583,48.796354858494169,null,1000000000,495496470.0625,null,25.982657336129069,-19.444799618090951,null,33.447996755079785,-111.75884552341486,null,0,0]
[22387,22.387,26.94934791204528,1.5336811569038218,1.0005696660504411,3.3745984916621903E-2,1,0,16208.326029764177,1.5707346301089589,4.2218356129639494,1.331659820404264,1.0049754805282549,9.9548362444867144E-2,1.1006223966159332,0.45293045934918696,6.9736089637994594,-131.29263739125145,48.707362608748554,null,1000000000,501177769,null,25.979378184177612,-19.401678631671476,null,33.390005945389724,-111.89095875957997,null,0,0]
[22517.5,22.517499999999998,27.106227417905181,1.5338960618154029,1.000576324970829,3.3942548956326049E-2,1,0,16302.808834019153,1.5707349876716321,4.2450688910246361,1.3329939314085035,1.005033510809423,0.10012479788793949,1.1017451497009241,0.45526990761459812,6.9110759070241254,-131.38433763284164,48.615662367158365,null,1000000000,507037806.25,null,25.976059677563089,-19.358287506558899,null,33.330791395228914,-112.02605012628274,null,0,0]
[22648,22.648,27.263108161235031,1.5341084934719453,1.0005830225503909,3.4139110372152358E-2,1,0,16397.291638276187,1.5707353411136828,4.2683096424193288,1.3343135163929631,1.0050918750023083,0.10070116657700724,1.1028732890358566,0.45760486178080417,6.8488442558311586,-131.47646704358635,48.523532956413646,null,1000000000,512931904,null,25.972785087506288,-19.315724600256765,null,33.271834334092745,-112.16074244332964,null,0,0]
[22778.5,22.778500000000001,27.419990120794651,1.5343184943058863,1.0005897587883505,3.4335669148964819E-2,1,0,16491.77444253525,1.5707356905059335,4.2915577457334466,1.3356188067941304,1.0051505730487451,0.10127746814079176,1.1040067983416433,0.45993531421155315,6.7869099051060839,-131.5690143404787,48.430985659521298,null,1000000000,518860062.25,null,25.969553394462281,-19.273976635216243,null,33.213131676411685,-112.29503770526244,null,0,0]
[22909,22.908999999999999,27.576873275827033,1.5345261057849491,1.0005965336839271,3.4532225271628664E-2,1,0,16586.2572467963,1.5707360359175921,4.3148130821311268,1.3369100292562608,1.0052096048902481,0.1018537022082793,1.1051456613288915,0.46226125747586089,6.7252688335583457,-131.66196847149564,48.338031528504359,null,1000000000,524822281,null,25.966363606327526,-19.233030608385814,null,33.154680392998699,-112.42893786310984,null,0,0]
[23042.25,23.042249999999999,27.737063610176225,1.5347356689167069,1.0006034912328228,3.4732920627193312E-2,1,0,16682.731068007397,1.5707363845710172,4.3385658159752198,1.3382141762705275,1.0052702250568293,0.10244200910923643,1.1063140305044681,0.46463155466334244,6.6626273336879285,-131.75728994185951,48.242710058140489,null,1000000000,530945285.0625,null,25.96314883610394,-19.192035967409932,null,33.095253663351862,-112.56525397444956,null,0,0]
[23175.5,23.1755,27.897255148656591,1.5349428253518476,1.0006104890840903,3.4933613183682738E-2,1,0,16779.204889220506,1.5707367292152024,4.3623258484851277,1.3395041190118695,1.0053311931104418,0.10303024485832066,1.1074879470195289,0.46699713563150508,6.6002833881176244,-131.85301299805315,48.146987001946854,null,1000000000,537103800.25,null,25.95997574874324,-19.151850864910074,null,33.036082805142264,-112.70116213314304,null,0,0]
[23308.75,23.30875,28.057447870643482,1.5351476162952118,1.0006175272368847,3.5134302924989036E-2,1,0,16875.678710435579,1.5707370699189069,4.386093061047406,1.3407800840611295,1.0053925089877969,0.10361840906142918,1.1086673935052334,0.46935799312452908,6.5382329726621862,-131.94912658536825,48.050873414631752,null,1000000000,543297826.5625,null,25.956843371112587,-19.112462300119393,null,32.977164767317483,-112.83666428524884,null,0,0]
[23442,23.442,28.217641755980456,1.5353500820167512,1.0006246056903552,3.5334989835005673E-2,1,0,16972.152531652588,1.5707374067493272,4.4098673375702431,1.3420422932972982,1.0054541726252604,0.10420650132475304,1.1098523525851931,0.47171412010457464,6.4764721451773921,-132.04561987734417,47.954380122655834,null,1000000000,549527364,null,25.9537507562817,-19.073857541594631,null,32.918496554663569,-112.97176233574953,null,0,0]
[23578.5,23.578499999999998,28.381743994918825,1.5355551160834169,1.0006318985752163,3.5540568595155149E-2,1,0,17070.979372901256,1.5707377478476243,4.4342286802256048,1.3433212520721332,1.0055177007734786,0.1048088622973477,1.1110719108495943,0.47412280147984565,6.41350118810713,-132.14484929081121,47.855150709188791,null,1000000000,555945662.25,null,25.950622978021972,-19.035110886546988,null,32.858653375853038,-113.10973840426426,null,0,0]
[23715,23.715,28.545847413278349,1.535757792772473,1.0006392337487924,3.5746144350007558E-2,1,0,17169.806214151889,1.5707380850192998,4.4585971968377276,1.3445862325681999,1.0055815937162984,0.1054111469424697,1.1122972169608121,0.47652650451591816,6.3508259978802828,-132.24445486901416,47.755545130985837,null,1000000000,562401225,null,25.947534994975801,-18.997160529657631,null,32.799066168672361,-113.24729433935651,null,0,0]
[23851.5,23.851500000000001,28.709951990834636,1.5359581524910635,1.0006466112101533,3.595171708225333E-2,1,0,17268.633055404447,1.5707384183317687,4.4829727704181588,1.3458374587189013,1.005645851384189,0.10601335483775544,1.1135282522210375,0.47892522235003188,6.288442590954693,-132.34442568412032,47.655574315879676,null,1000000000,568894052.25,null,25.944485869391023,-18.959993620150637,null,32.739731887331544,-113.38443206396968,null,0,0]
[23988,23.988,28.874057707822949,1.5361562347284707,1.0006540309583636,3.615728677458447E-2,1,0,17367.459896658907,1.5707387478509116,4.5073552864756037,1.3470751497865534,1.0057104737072406,0.10661548556117163,1.1147649979281253,0.48131894835344663,6.2263470651377535,-132.44475103668049,47.555248963319514,null,1000000000,575424144,null,25.941474688854633,-18.923597574814597,null,32.680647542050998,-113.52115346186586,null,0,0]
[24127.75,24.127749999999999,29.042071864066536,1.5363567140429613,1.0006616711753438,3.6367747815983224E-2,1,0,17468.639757945166,1.570739081353099,4.5323254140201001,1.348328511550581,1.0057770123655523,0.1072318723401548,1.1160370864389002,0.48376448963016871,6.1630673270852308,-132.54782144972472,47.452178550275278,null,1000000000,582148320.0625,null,25.938430197531112,-18.887120704742262,null,32.620412295321998,-113.66070074498245,null,0,0]
[24267.5,24.267499999999998,29.210087174139804,1.5365548870665622,1.0006693557148039,3.6578205634275149E-2,1,0,17569.819619233338,1.5707394110141879,4.5573025834373562,1.3495681366659382,1.0058439331007591,0.107848177334466,1.1173151208766947,0.48620478522322125,6.1000813163936263,-132.65124149716874,47.348758502831259,null,1000000000,588911556.25,null,25.935423622063727,-18.85142598066901,null,32.560432860097784,-113.79981551649972,null,0,0]
[24407.25,24.407250000000001,29.378103618246271,1.5367507933533282,1.0006770845757227,3.6788660210891298E-2,1,0,17670.999480523406,1.5707397369001577,4.5822866795756623,1.3507942459811908,1.0059112358366054,0.10846440009229044,1.1185990811637294,0.48863982877111772,6.0373850969433942,-132.75500040607304,47.244999593926963,null,1000000000,595713852.5625,null,25.932454060659545,-18.816500726797386,null,32.500706202051724,-113.93849967927567,null,0,0]
[24547,24.547000000000001,{"$f":"SQRT(1+(A333/pole1)^2)","v":29.54612117703962},{"$f":"ATAN(A333/pole1)","v":1.536944471558304},{"$f":"SQRT(1+(A333/Zero1)^2)","v":1.0006848577570733},{"$f":"ATAN(A333/Zero1)","v":3.6999111527264456E-2},{"$f":"IF(VIN_nom>Vout, 1, SQRT(1+(A333/z_RHP)^2))","v":1},{"$f":"IF(VIN_nom>Vout, 0, -ATAN(A333/z_RHP))","v":0},{"$f":"SQRT(1+(A333/Pole2)^2)","v":17772.179341815328},{"$f":"ATAN(A333/Pole2)","v":1.5707400590754856},4.6072775897494749,1.3520070557177262,{"$f":"SQRT(1+(A333/pole4)^2)","v":1.0059789204964202},{"$f":"ATAN(A333/pole4)","v":0.10908054016218367},{"$f":"SQRT((1-(V333/pterm2))^2+(A333/pterm1)^2)","v":1.1198889472217652},{"$f":"IF((ATAN((A333/pterm1)/(1-A333^2/pterm2))>0),ATAN((A333/pterm1)/(1-A333^2/pterm2)),PI()+ATAN((A333/pterm1)/(1-A333^2/pterm2)))","v":0.49106961416249395},{"$f":"20*LOG10(((E333*K333*G333)/(C333*I333*O333*M333))*Adc)","v":5.9749748130889468},{"$f":"((F333+L333+H333)-(D333+J333+P333+N333))*radconv","v":-132.85908763137249},{"$f":"IF(R333>0,R333,R333+180)","v":47.140912368627511},null,1000000000,602555209,null,{"$f":"20*LOG10((K333/(I333*M333))*AEA)","v":25.929520635963573},{"$f":"(L333-(J333+N333))*radconv","v":-18.782332532382824},null,{"$f":"20*LOG10((E333*G333/(C333*O333))*Acs*Am)","v":32.441229342893251},{"$f":"(F333+H333-(D333+P333))*radconv","v":-114.07675509898968},null,0,0]
[24690,{"$f":"A334/1000","v":24.69},29.718047255071181,1.5371403869070905,1.0006928575874845,3.7214453666076341E-2,1,0,17875.712223139177,1.570740384967906,4.6328566224259848,1.35323452404512,1.0060485744878518,0.10971092300561103,1.1212149026036058,0.49355045707369916,5.9114051748183289,-132.96592458088409,47.034075419115908,null,{"$f":"IF(Q334<0,A334,1000000000)","v":1000000000},{"$f":"A334^2","v":609596100},null,25.926555508730086,-18.748140726364209,null,32.380624831856125,-114.21778385451988,null,{"$f":"SUM((Q335<0)*(Q334>0))*A334","v":0},0]
[24833,24.832999999999998,29.889974460643192,1.5373340484521167,1.0007009038215184,3.7429792351914529E-2,1,0,17979.24510446491,1.5707407071070452,4.6584425586664313,1.3544485107401767,1.0061186282099632,0.11034121831526761,1.1225469991057466,0.4960257822667592,5.8481270072579683,-133.07308366310241,46.926916336897591,null,1000000000,616677889,null,25.923626434908115,-18.714716130617539,null,32.320275738117736,-114.35836753248483,null,0,0]
[24976,24.975999999999999,30.061902774410079,1.5375254948482067,1.000708996458056,3.7645127564891731E-2,1,0,18082.77798579248,1.5707410255573713,4.6840352853413414,1.3556492331786492,1.0061890815792631,0.11097142560869142,1.1238852152217402,0.49849558399535848,5.785136427765698,-133.18055428602293,46.819445713977075,null,1000000000,623800576,null,25.920732548947619,-18.682046266480288,null,32.260179044585961,-114.49850801954264,null,0,0]
[25119,25.119,30.233832177466194,1.5377147638715749,1.0007171354959714,3.7860459285122577E-2,1,0,18186.310867121869,1.5707413403818846,4.7096346917505816,1.3568369041649495,1.0062599345118077,0.11160154440383485,1.1252295294492727,0.50095985677932753,5.7224296331315463,-133.28832608440783,46.711673915592172,null,1000000000,630964161,null,25.917873008807994,-18.650118917148156,null,32.200331790091433,-114.63820716725968,null,0,0]
[25265.25,25.265250000000002,30.409670174405623,1.537906120775038,1.0007255075060679,3.8080681274644437E-2,1,0,18292.196768483311,1.5707416586753069,4.7358226991373389,1.3580382850288781,1.0063328109382264,0.11224589204061658,1.1266106814456558,0.50347441146904059,5.6585873341513606,-133.39884819190874,46.601151808091259,null,1000000000,638332857.5625,null,25.914983150974891,-18.618221501017381,null,32.139379348944345,-114.78062669089134,null,0,0]
[25411.5,25.4115,30.585509272066602,1.5380952774260856,1.0007339280482614,3.8300899568789092E-2,1,0,18398.082669846586,1.5707419733050012,4.7620174666276505,1.3592264505500331,1.0064061051171918,0.11289014609221766,1.1279981664156895,0.50598317229130563,5.5950340649772423,-133.5096640932241,46.490335906775897,null,1000000000,645744332.25,null,25.912127508413842,-18.587075696301181,null,32.078681722331275,-114.92258839692292,null,0,0]
[25557.75,25.557749999999999,30.761349451573174,1.5382822715427753,1.0007423971213263,3.8521114146290655E-2,1,0,18503.968571211659,1.5707422843338625,4.7882188832746229,1.360401614291243,1.0064798169574394,0.11353430604432958,1.1293919613782577,0.50848613423395672,5.5317660017992143,-133.62076340136912,46.379236598630882,null,1000000000,653198585.0625,null,25.909305251839861,-18.556669240886741,null,32.018235915727224,-115.0640941604824,null,0,0]
[25704,25.704000000000001,30.937190694478431,1.5384671399862468,1.000750914724031,3.8741324985885388E-2,1,0,18609.854472578507,1.5707425918233549,4.8144268405187152,1.3615639853105304,1.0065539463672104,0.11417837138310656,1.1307920433617318,0.51098329256676622,5.468779399049116,-133.7321359544658,46.267864045534196,null,1000000000,660695616,null,25.906515574531372,-18.526990130712075,null,31.958038990285623,-115.20514582375375,null,0,0]
[25853.75,25.853750000000002,31.117241186928162,1.5386542676684163,1.0007596864511321,3.8966801933113832E-2,1,0,18718.274395518325,1.5707429030668678,4.8412686630571224,1.3627411318847726,1.0066302823965583,0.11483775167835619,1.1322321221084497,0.51353419370046227,5.4045732373618227,-133.84644658285626,46.15355341714374,null,1000000000,668416389.0625,null,25.903692074183024,-18.497342141057423,null,31.896656328946676,-115.34910444179883,null,0,0]
[26003.5,26.003499999999999,31.297292756466099,1.5388392422868846,1.000768509055816,3.9192274916272418E-2,1,0,18826.694318459937,1.5707432107255774,{"$f":"SQRT(1+(A343/Zero2)^2)","v":4.8681171200327613},{"$f":"ATAN(A343/Zero2)","v":1.3639052957480915},1.0067070560245246,0.11549703168871651,1.1336787436848215,0.51607900097900372,5.3406544636586002,-133.9610228279746,46.038977172025398,null,1000000000,676182012.25,null,25.900901088660071,-18.468432054651142,null,31.835528540766411,-115.49259077332346,null,0,0]
[26153.25,26.15325,31.47734538460929,1.5390221007759108,1.000777382536737,3.9417743912541062E-2,1,0,18935.114241403313,1.5707435148610622,4.8949721022778574,1.3650566873974426,1.0067842671510008,0.11615621086408319,1.1351318834690742,0.51861771022762349,5.2770192989444862,-134.07585447953133,45.92414552046867,null,1000000000,683992485.5625,null,25.898141820804639,-18.440247782915623,null,31.774652643907725,-115.63560669661574,null,0,0]
[26303,26.303000000000001,31.657399053295169,1.5392028792300632,1.0007863068925418,3.9643208899102111E-2,1,0,19043.534164348417,1.5707438155334978,4.9218335029810003,1.3661955128716867,1.006861915675338,0.11681528865487058,1.136591516855193,0.52115031757087915,5.2136640416530735,-134.19093155165547,45.809068448344533,null,1000000000,691847809,null,25.895413495209937,-18.412777492652555,null,31.714025712211015,-115.77815405900292,null,0,0]
[26456,26.456,31.84136145389451,1.5393854695454621,1.0007954774738388,3.9873562950836765E-2,1,0,19154.307107325807,1.570744119215951,4.9492843925186039,1.3673462856666168,1.0069417010277937,0.11748856502409968,1.1380895093750261,0.52373158397453645,5.1492191092764914,-134.30874943181038,45.691250568189616,null,1000000000,699919936,null,25.892657129444,-18.385436362418954,null,31.65233714560037,-115.92331306939143,null,0,{"$f":"IF(AD346>0,S346,0)","v":0}]
[26609,26.609000000000002,32.025324903864224,1.5395659621554345,1.0008047011593604,4.0103912768784375E-2,1,0,19265.080050304943,1.5707444194060958,4.976741763975645,1.3684843620100533,1.0070219427555509,0.1181617344021469,1.1395942285416125,0.52630647350660187,5.0850587925794741,-134.42680311989503,45.573196880104973,null,1000000000,708038881,null,25.889931493616729,-18.358816355033827,null,31.590902464730625,-116.06798676486123,null,0,0]
[26762,26.762,32.209289385223862,1.539744392991472,1.0008139779476386,4.0334258328617152E-2,1,0,19375.852993285796,1.5707447161638297,5.0042055106559857,1.3696099479688089,1.0071026407495229,0.11883479620455652,1.1411056481712669,0.52887498298421698,5.0211793813546945,-134.54508265684822,45.454917343151777,null,1000000000,716204644,null,25.887235826618088,-18.332905633683584,null,31.529718720504484,-116.21217702316461,null,0,0]
[26915,26.914999999999999,32.393254880401336,1.5399207971693598,1.0008233078371964,4.0564599606010006E-2,1,0,19486.625936268338,1.5707450095476878,5.0316755281684458,1.3707232452378473,1.0071837949000391,0.11950774984744936,1.1426237421031158,0.53143710953872303,4.9575772413518928,-134.66357830531763,45.336421694682372,null,1000000000,724417225,null,25.88456938811936,-18.307692611997982,null,31.468783019000412,-116.35588569331961,null,0,0]
[27071.75,27.071750000000002,32.581730367234094,1.5400994590838042,1.0008329214684479,4.0800582036347975E-2,1,0,19600.113902364916,1.5707453066832067,5.0598252268998269,1.3718512914346159,1.0072674110716093,0.12019708467386278,1.1441859385785194,0.53405541113410437,4.8927000517496415,-134.78519242738949,45.214807572610511,null,1000000000,732879648.0625,null,25.881867154702611,-18.282573326634697,null,31.406608062814911,-116.50261910075479,null,0,0]
[27228.5,27.2285,32.770206882115168,1.5402760658703323,1.0008425908327176,4.1036559920068653E-2,1,0,19713.601868463204,1.570745600397605,5.0879812929505919,1.3729668541872331,1.0073515057994373,0.12088630473499183,1.1457550850256091,0.53666700798563582,4.8281064049968707,-134.90701338336382,45.092986616636182,null,1000000000,741391212.25,null,25.879194090939279,-18.258162518353693,null,31.34468747982547,-116.64885086501009,null,0,0]
[27385.25,27.385249999999999,32.958684407407652,1.540450652775194,1.0008523159283904,4.1272533231023076E-2,1,0,19827.089834563172,1.5707458907496288,5.1161436211954703,1.3740701368450663,1.0074360789636818,0.12157540940486607,1.147331153395887,0.53927189801443842,4.7637926283783436,-135.029031391529,44.970968608470997,null,1000000000,749951917.5625,null,25.876549464269502,-18.234448503594862,null,31.283018329876722,-116.79458288793413,null,0,0]
[27542,27.542000000000002,33.147162925875691,1.5406232542434817,1.0008620967538417,4.1508501943065323E-2,1,0,19940.577800664792,1.5707461777966873,5.1443121087880774,1.3751613384246708,1.0075211304438605,0.12226439805816303,1.1489141156720071,0.54187007947416377,4.6997551245089708,-135.15123689153543,44.848763108464567,null,1000000000,758561764,null,25.873932562202285,-18.2114198470105,null,31.221597728074567,-116.93981704452497,null,0,0]
[27702.5,27.702500000000001,33.340151511317224,1.5407979628387949,1.0008721693142248,4.1750111047040787E-2,1,0,20056.780789880577,1.5707464683449843,5.1731607606971295,1.3762663306650316,1.0076087121391952,0.12296974882812067,1.1505420618986495,0.54452346567989585,4.6344682086982107,-135.27655048351039,44.723449516489609,null,1000000000,767428506.25,null,25.87128105851118,-18.188538724603021,null,31.158962315954909,-117.08801175890736,null,0,0]
[27863,27.863,33.533141102689875,1.5409706604770805,1.0008823002993021,4.199171527395866E-2,1,0,20172.983779098031,1.5707467555459749,5.2020156590135267,1.3773590657333765,1.0076967950524378,0.12367497663927951,1.1521771764844986,0.54716981584055102,4.5694635428273154,-135.40204104730097,44.597958952699031,null,1000000000,776346769,null,25.868657171671803,-18.16635264961484,null,31.096581536923395,-117.23568839768616,null,0,0]
[28023.5,28.023499999999999,33.726131682725061,1.5411413816697628,1.0008924897072993,4.2233314595761344E-2,1,0,20289.186768317133,1.5707470394571721,5.2308767003667667,1.3784397438828566,1.0077853790521654,0.12438008082248783,1.1538194294639985,0.54980912914233682,4.5047374980272403,-135.52769900654221,44.472300993457793,null,1000000000,785316552.25,null,25.86606019806073,-18.14485011334126,null,31.03445246573439,-117.38284889320097,null,0,0]
[28184,28.184000000000001,33.919123234547122,1.541310160143287,1.0009027375364319,4.2474908984394655E-2,1,0,20405.389757537854,1.5707473201347797,5.2597437836334242,1.3795085610844766,1.0078744640062531,0.12508506070932016,1.1554687909122212,0.55244140512154438,4.4402865199509165,-135.65351500526674,44.34648499473326,null,1000000000,794337856,null,25.863489453383757,-18.124019852393076,null,30.972572232335036,-117.52949515287368,null,0,0]
[28348,28.347999999999999,34.116324311528778,1.5414806467093225,1.0009132691826053,4.2721766661594038E-2,1,0,20524.126768332004,1.5707476036500982,5.2892465052139253,1.3805886336209701,1.0079660089445186,0.12580528490292003,1.1571614313315037,0.55512381344864203,4.374710576252772,-135.78222839205949,44.217771607940506,null,1000000000,803609104,null,25.860889049563927,-18.103418305288141,null,30.909596692456724,-117.67881008677131,null,0,0]
[28512,28.512,34.313526368726528,1.541649173685548,1.000923861821859,4.2968619128914497E-2,1,0,20642.863779127787,1.5707478839038767,5.3187553285448175,1.38165672275732,1.0080580766427019,0.12652537791133434,1.1588614305929765,0.55779887430519925,4.3094145534698054,-135.91108771710114,44.08891228289886,null,1000000000,812934144,null,25.858314645643823,-18.083495653206455,null,30.846875073593864,-117.82759206389467,null,0,0]
[28676,28.675999999999998,34.510729389336845,1.5418157746550802,1.0009345154522569,4.3215466356437429E-2,1,0,20761.600789925171,1.5707481609520744,5.3482701526277561,1.382713024429991,1.0081506669575824,0.12724533902382126,1.1605687569124925,0.56046658830365814,4.2443948883709854,-136.04008367751848,43.959916322481519,null,1000000000,822312976,null,25.855765570125794,-18.064240632299299,null,30.784404484013073,-117.97584304521915,null,0,0]
[28840,28.84,34.707933356938042,1.5419804824382177,1.0009452300718513,4.3462308314248077E-2,1,0,20880.337800724134,1.570748434849377,5.3777908786613153,1.3837577303797053,1.0082437797451795,0.12796516753044637,1.162283378556878,0.56312695642086064,4.1796480908332621,-136.16920718798181,43.830792812018188,null,1000000000,831745600,null,25.853241169971977,-18.045642219089491,null,30.722182086629168,-118.12356496889224,null,0,0]
[29008,29.007999999999999,34.909948142550434,1.5421472779999146,1.000956269260233,4.3715165312274776E-2,1,0,21001.970836178331,1.5707487122158565,5.4080376410040074,1.3848160896894928,1.0083397051680503,0.12870241459192722,1.1640473515225327,0.56584459614706928,4.1136014614065939,-136.3016030329521,43.698396967047898,null,1000000000,841464064,null,25.85068012069561,-18.027259734419214,null,30.658696506478865,-118.27434329853287,null,0,0]
[29176,29.175999999999998,35.111963888208344,1.542312154258543,1.0009673724450028,4.3968016716858294E-2,1,0,21123.603871634128,1.5707489863880961,5.4382903936345093,1.3858626750328706,1.0084361785526166,0.12943952099455019,1.1658189127811522,0.56855453051492644,4.0478339852872907,-136.43411410233264,43.565885897667357,null,1000000000,851238976,null,25.84814363467633,-18.009543606157731,null,30.595465516378837,-118.42457049617494,null,0,0]
[29344,29.344000000000001,35.313980577435771,1.5424751441436806,1.0009785396240312,4.4220862495853781E-2,1,0,21245.236907091494,1.5707492574209592,5.4685490371355767,1.3868976795414405,1.0085331997416289,0.13017648597781786,1.167598028397473,0.57125676173531248,3.9823421370912393,-136.56673130530964,43.433268694690355,null,1000000000,861070336,null,25.845631066323431,-17.992482728249495,null,30.532486236535689,-118.57424857706012,null,0,0]
[29512,29.512,35.515998194131519,1.5426362798360873,1.0009897707951763,4.4473702617120706E-2,1,0,21366.869942550402,1.570749525368059,5.4988134742590917,1.3879212921954562,1.008630768577006,0.13091330878213914,1.169384664499393,0.5739512924010064,3.9171224638728956,-136.69944576788103,43.300554232118969,null,1000000000,870958144,null,25.843141787850836,-17.976066232474004,null,30.46975584178994,-118.72337953540701,null,0,0]
[29684,29.684000000000001,35.722826698506303,1.5427993639926698,1.0010013356685965,4.473255684632374E-2,1,0,21491.399002664668,1.5707497965527175,5.5298043960671555,1.3889576677357107,1.008731227674339,0.13166752689727346,1.1712215954603669,0.57670200390497595,3.8506283824203749,-136.83541181502588,43.164588184974122,null,1000000000,881139856,null,25.840616731650719,-17.959915340574284,null,30.405786816537535,-118.87549647445154,null,0,0]
[29856,29.856000000000002,35.929656142042703,1.5429605705621734,1.0010129676130717,4.4991405077008523E-2,1,0,21615.928062780495,1.5707500646127941,5.5608011910900768,1.3899824905205385,1.008832260468882,0.13242159437402154,1.1730663376448973,0.57944465050129434,3.7844124906870231,-136.97146165703325,43.028538342966755,null,1000000000,891380736,null,25.838114810537856,-17.944417562833891,null,30.342072845917048,-119.02704409419935,null,0,0]
[30028,30.027999999999999,36.136486508614652,1.5431199317757514,1.001024666626263,4.5250247274697869E-2,1,0,21740.457122897853,1.5707503296019811,5.591803761657669,1.3909959505345886,1.0089338667882879,0.13317551040021439,1.1749188549201977,0.58217923618440393,3.7184713070140507,-137.10758644267631,42.892413557323692,null,1000000000,901680784,null,25.835635405094525,-17.929561970476737,null,30.2786110676874,-119.17802447219957,null,0,0]
[30200,30.2,36.343317782463124,1.5432774791312229,1.0010364327058194,4.5509083404919437E-2,1,0,21864.986183016725,1.5707505915727484,5.6228120122358485,1.3919982336662007,1.0090360464593011,0.13392927416469794,1.1767791112302248,0.58490576534666994,3.6528014213360871,-137.24377753619947,42.756222463800526,null,1000000000,912040000,null,25.833177913031239,-17.915337869416085,null,30.215398674072723,-119.32843966678341,null,0,0]
[30375.75,30.37575,36.554659380224322,1.5434366198032061,1.0010485245864214,4.5773556461525498E-2,1,0,21992.230266250182,1.5707508561905861,5.6545020846814271,1.39301101307501,1.0091410459420302,0.13469931361190279,1.1786878819891933,0.58768342225403858,3.5859765392330329,-137.38299763916737,42.617002360832629,null,1000000000,922686188.0625,null,25.830688867838415,-17.901445055566384,null,30.151062837162499,-119.48155258360102,null,0,0]
[30551.5,30.551500000000001,36.76600189311656,1.5435939308981206,1.0010606864846665,4.6038023110456933E-2,1,0,22119.474349485165,1.5707511177639522,5.6861978924234453,1.3940125027016024,1.0092466436810761,0.13546919237668051,1.180604657060548,0.59045267802844692,3.5194279362249996,-137.52226940877432,42.477730591225679,null,1000000000,933394152.25,null,25.828221482902684,-17.888189717729773,null,30.086981619090199,-119.63407969104456,null,0,0]
[30727.25,30.727250000000002,36.977345305448658,1.5437494437788666,1.0010729183980034,4.6302483314952958E-2,1,0,22246.718432721646,1.5707513763450871,5.7178993400851725,1.3950028883001697,1.0093528394886713,0.1362389095969716,1.182529398237836,0.59321353860779547,3.4531521940039323,-137.6615842949746,42.338415705025398,null,1000000000,944163892.5625,null,25.825775167536914,-17.875561166575817,null,30.0231521922349,-119.7860231283988,null,0,0]
[30903,30.902999999999999,37.188689601886068,1.543903189095752,1.0010852203238652,4.6566937038258226E-2,1,0,22373.962515959593,1.5707516319850425,5.7496063343765949,1.3959823516156658,1.0094596331760641,0.13700846441184397,1.1844620674058295,0.59596601033984675,3.3871459644554216,-137.80093396008581,42.199066039914186,null,1000000000,954995409,null,25.823349347400182,-17.86354894248295,null,29.959571782823119,-119.93738501760284,null,0,0]
[31083,31.082999999999998,37.405145543107963,1.5440588513972737,1.0010978923057141,4.6837779045234618E-2,1,0,22504.283625393982,1.5707518908103091,5.7820857237379704,1.3969743645332742,1.0095696288999176,0.13779645941809238,1.1864496506801727,0.59877635402248353,3.319819508072948,-137.94368094556651,42.056319054433487,null,1000000000,966152889,null,25.820885527021666,-17.851874406799013,null,29.894709146819164,-120.09180653876756,null,0,0]
[31263,31.263000000000002,37.621602380255233,1.5442127224885409,1.0011106377216299,4.7108614175749082E-2,1,0,22634.604734829863,1.5707521466551486,5.8145707396185742,1.3979552939929873,1.0096802513652168,0.13858428224501265,1.188445469384235,0.60157791300250085,3.2527688656015128,-138.08644736931248,41.913552630687519,null,1000000000,977375169,null,25.818442035884125,-17.840824870560898,null,29.830101995485265,-120.2456224987516,null,0,0]
[31443,31.443000000000001,37.838060097952152,1.5443648331027826,1.0011234565688079,4.737944239033258E-2,1,0,22764.925844267207,1.5707523995707464,5.8470612882392112,1.3989253228545466,1.009791500365983,0.13937193197140507,1.1904494828796013,0.60437069539692634,3.1859906572591861,-138.22922493260117,41.77077506739883,null,1000000000,988662249,null,25.816018306860094,-17.830389806828986,null,29.765747516166972,-120.39883512577218,null,0,0]
[31623,31.623000000000001,38.054518681172759,1.544515213274301,1.0011363488444271,4.7650263649522191E-2,1,0,22895.246953705991,1.5707526496071231,5.8795572778777911,1.3998846300181631,1.0099033756951628,0.14015940767733376,1.1924616506360417,0.60715470974720975,3.1194815727143972,-138.37200554785193,41.627994452148073,null,1000000000,1000014129,null,25.813613788565227,-17.820558915533777,null,29.701642949917048,-120.55144663231813,null,0,0]
[31807,31.806999999999999,38.275788334430061,1.5446671772377782,1.0011496035062932,4.7927095928874411E-2,1,0,23028.464087800436,1.5707529022748548,5.912780930939034,1.4008543556261446,1.010018384286729,0.14096420202273907,1.1945269192283714,0.6099915379368841,3.0517692935203415,-138.51795401453552,41.482045985464481,null,1000000000,1011685249,null,25.81117513418139,-17.811123527062257,null,29.636369325106834,-120.70683048747321,null,0,0]
[31991,31.991,38.497058861431057,1.5448173943103947,1.0011629348903361,4.8203920856899868E-2,1,0,23161.681221896331,1.57075315203609,5.9460100820500656,1.401813243545508,1.0101340469118696,0.14176881258765361,1.1966006232296831,0.61281922343898132,2.9843314513208439,-138.66388923297487,41.336110767025133,null,1000000000,1023424081,null,25.808755436838084,-17.80229839603248,null,29.571351180250637,-120.86159083694243,null,0,0]
[32175,32.174999999999997,38.718330247195723,1.5449658944352318,1.0011763429934912,4.8480738391465765E-2,1,0,23294.898355993653,1.5707533989406932,5.9792446395460352,1.402761472716098,1.0102503633459454,0.1425732383935728,1.1986827197097796,0.61563777670896758,2.91716472353641,-138.80980321454541,41.190196785454589,null,1000000000,1035230625,null,25.806354155297306,-17.79407321673936,null,29.506585734006986,-121.01572999780605,null,0,0]
[32359,32.359000000000002,38.939602477084499,1.5451127068750781,1.0011898278126765,4.8757548490446077E-2,1,0,23428.115490092379,1.5707536430373947,6.0124845137740826,1.4036992181983401,1.0103673333631511,0.14337747846339799,1.2007731658645382,0.61844720863660096,2.8502658557609313,-138.95568817881701,41.044311821182987,null,1000000000,1047104881,null,25.803970763364926,-17.78643790576778,null,29.442070258163881,-121.16925027304922,null,0,0]
[32547.5,32.547499999999999,39.166287116460005,1.5452613896316461,1.001203721973678,4.9041120647014651E-2,1,0,23564.590651928651,1.5707538902418892,6.046542741406264,1.4046492053015633,1.0104878415779823,0.14420119382263547,1.2029233509244159,0.62131590264627745,2.7820053084121832,-139.10510297090761,40.894897029092391,null,1000000000,1059339756.25,null,25.80154709839136,-17.779217231531604,null,29.376233375788701,-121.32588573937603,null,0,0]
[32736,32.735999999999997,39.39297261170271,1.5454083612118954,1.0012176966424042,4.9324684910370405E-2,1,0,23701.065813766341,1.5707541345994842,6.0806063647631978,1.4055885495683413,1.0106090352520976,0.14502471217828763,1.2050822085293305,0.62417504820855996,2.714019180200959,-139.25447142534941,40.745528574650592,null,1000000000,1071645696,null,25.799141137057266,-17.772594896317159,null,29.310653208911571,-121.48187652903223,null,0,0]
[32924.5,32.924500000000002,39.619658948121959,1.5455536509812262,1.0012317518154843,4.9608241235242739E-2,1,0,23837.540975605432,1.5707543761590774,6.1146752936693964,1.4065174272219654,1.0107309141389225,0.14584803248443115,1.2072496930810759,0.62702465840207433,2.6463041830990219,-139.40378582262343,40.596214177376567,null,1000000000,1084022700.25,null,25.796752359564927,-17.766560746148219,null,29.245326989301979,-121.63722507647526,null,0,0]
[33113,33.113,39.846346111361356,1.5456972876370831,1.0012458874895278,4.9891789576368709E-2,1,0,23974.016137445902,1.5707546149684526,6.1487494399340603,1.4074360106526265,1.0108534779906082,0.14667115369671968,1.2094257591284081,0.62986474675167592,2.5788570965654389,-139.55303865015361,40.44696134984639,null,1000000000,1096470769,null,25.7943802606157,-17.761104846695595,null,29.180252001717619,-121.79193380345801,null,0,0]
[33305.75,33.305750000000003,40.0781450987635,1.5458424825621895,1.0012604251127872,5.0181722614296397E-2,1,0,24113.568325483106,1.5707548563668459,6.1835971414559703,1.4083648355599863,1.0109795132629231,0.14751262638070239,1.2116597143753942,0.63275903718407944,2.5101630725837119,-139.70558531116887,40.294414688831125,null,1000000000,1109272983.0625,null,25.791971414421553,-17.756113764068406,null,29.113966823930038,-121.94947154710049,null,0,0]
[33498.5,33.4985,40.309944921358536,1.5459860076215819,1.0012750469007179,5.0471647208713048E-2,1,0,24253.120513521699,1.570755094987232,6.2184501178712823,1.4092832495542076,1.0111062642070907,0.14835388868843313,1.2139025468034823,0.63564340156089449,2.4417425738672032,-139.85805234715576,40.141947652844237,null,1000000000,1122149502.25,null,25.78957898311171,-17.751706969986184,null,29.047938756523372,-122.10634537716955,null,0,0]
[33691.25,33.691249999999997,40.541745564820665,1.5461278914520646,1.0012897528496325,5.0761563311249681E-2,1,0,24392.67270156166,1.5707553308772899,6.2533082809807308,1.4101914251752483,1.0112337305539971,0.14919493950848411,1.2161542083062957,0.6385178557378145,2.3735923646098374,-140.01043236335806,39.989567636641937,null,1000000000,1135100326.5625,null,25.787202470430103,-17.747874517689183,null,28.982165059947619,-122.26255784566889,null,0,0]
[33884,33.884,40.773547015149823,1.5462681620394978,1.0013045429558227,5.1051470873545848E-2,1,0,24532.224889602967,1.5707555640836148,6.2881715445277822,1.4110895312050533,1.011361912033147,0.15003577773118304,1.218414650946233,0.64138241602334878,2.3057092752951061,-140.16271816902423,39.837281830975769,null,1000000000,1148125456,null,25.784841393987957,-17.744606675774477,null,28.916643047075027,-122.41811149324981,null,0,0]
[34081.5,34.081499999999998,41.011061645509827,1.5464102445953589,1.00131978482914,5.1348513811686092E-2,1,0,24675.216106922915,1.5707558003007844,6.3238991569534129,1.4119994973410348,1.0114939938294585,0.15089711532038635,1.2207398568433327,0.6443073234850949,2.2364271496561501,-140.31865177008311,39.681348229916892,null,1000000000,1161548642.25,null,25.782437653943305,-17.74183399952393,null,28.849764661480727,-122.5768177705592,null,0,0]
[34279,34.279000000000003,41.248577094244268,1.5465506908890032,1.0013351150507208,5.1645547680709489E-2,1,0,24818.207324244227,1.5707560337960025,6.3596319469724483,1.4128992385827963,1.0116268258593522,0.15175822735181779,1.2230741806554106,0.64722187949672438,2.1674189401925843,-140.4744718092613,39.525528190738697,null,1000000000,1175049841,null,25.780049137609041,-17.73963408709411,null,28.783144968351419,-122.7348377221672,null,0,0]
[34476.5,34.476500000000001,41.486093347297135,1.5466895290186358,1.0013505336165069,5.1942572428619702E-2,1,0,24961.198541566882,1.5707562646160471,6.3953698277987341,1.4137889248740343,1.0117604078273374,0.15261911263751593,1.2254175713764763,0.65012610302463802,2.0986814425140334,-140.6301711836997,39.369828816300299,null,1000000000,1188629052.25,null,25.777675368426792,-17.73799713604345,null,28.716781239855116,-122.89217404765627,null,0,0]
[34674,34.673999999999999,41.7236103909324,1.5468267864429022,1.0013660405224183,5.2239588003430044E-2,1,0,25104.189758890847,1.5707564928066313,6.4311127145629747,1.4146687224448693,1.0118947394364133,0.15347976999148927,1.2277699781946709,0.65302001349599081,2.0302115178555207,-140.78574299311799,39.214257006882008,null,1000000000,1202286276,null,25.775315883207696,-17.736913556754473,null,28.650670800415703,-123.04882943636352,null,0,0]
[34875.75,34.875749999999996,41.966239363148119,1.5469653933188405,1.0013819723290374,5.2542985527265856E-2,1,0,25250.258002411727,1.5707567232391562,6.4676298344283616,1.4155574112534588,1.0120327354271828,0.15435871124711681,1.230182263000855,0.65596557033031355,1.9605412643115354,-140.94452386876014,39.055476131239857,null,1000000000,1216317938.0625,null,25.772919904429884,-17.736368265919687,null,28.583396525649533,-123.20815560284043,null,0,0]
[35077.5,35.077500000000001,42.208869132344482,1.5471024066861165,1.0013979963099864,5.2846373369329645E-2,1,0,25396.326245933931,1.5707569510209924,6.5041520048609831,1.4164361204034199,1.0121715130378879,0.15523741216027639,1.232603849555755,0.65890040788957593,1.8911438044020632,-141.10315769842344,38.896842301576555,null,1000000000,1230431006.25,null,25.77053789469851,-17.736380844923609,null,28.516381075471429,-123.36677685349984,null,0,0]
[35279.25,35.279249999999998,42.451499684856159,1.5472378538625255,1.0014141124608409,5.3149751474237325E-2,1,0,25542.394489457438,1.5707571761976153,6.5406791412560095,1.4173050157237821,1.0123110719470723,0.15611587147317701,1.2350346843356586,0.66182454830986903,1.8220159933566824,-141.26163774801611,38.738362251983887,null,1000000000,1244625480.5625,null,25.768169400694543,-17.736941723002133,null,28.44962175843002,-123.52469602501401,null,0,0]
[35481,35.481000000000002,{"$f":"SQRT(1+(A397/pole1)^2)","v":42.694131007328409},{"$f":"ATAN(A397/pole1)","v":1.5473717615451066},{"$f":"SQRT(1+(A397/Zero1)^2)","v":1.0014303207771511},{"$f":"ATAN(A397/Zero1)","v":5.3453119786615579E-2},{"$f":"IF(VIN_nom>Vout, 1, SQRT(1+(A397/z_RHP)^2))","v":1},{"$f":"IF(VIN_nom>Vout, 0, -ATAN(A397/z_RHP))","v":0},{"$f":"SQRT(1+(A397/Pole2)^2)","v":25688.462732982225},{"$f":"ATAN(A397/Pole2)","v":1.570757398813466},6.5772111608766801,1.4181642594193251,{"$f":"SQRT(1+(A397/pole4)^2)","v":1.0124514118316472},{"$f":"ATAN(A397/pole4)","v":0.15699408793021083},{"$f":"SQRT((1-(V397/pterm2))^2+(A397/pterm1)^2)","v":1.2374747140361182},{"$f":"IF((ATAN((A397/pterm1)/(1-A397^2/pterm2))>0),ATAN((A397/pterm1)/(1-A397^2/pterm2)),PI()+ATAN((A397/pterm1)/(1-A397^2/pterm2)))","v":0.66473801418766953},{"$f":"20*LOG10(((E397*K397*G397)/(C397*I397*O397*M397))*Adc)","v":1.7531547505636134},{"$f":"((F397+L397+H397)-(D397+J397+P397+N397))*radconv","v":-141.41995748197721},{"$f":"IF(R397>0,R397,R397+180)","v":38.580042518022793},null,1000000000,1258901361,null,{"$f":"20*LOG10((K397/(I397*M397))*AEA)","v":25.765813981830526},{"$f":"(L397-(J397+N397))*radconv","v":-17.738041537111211},null,{"$f":"20*LOG10((E397*G397/(C397*O397))*Acs*Am)","v":28.383115934500964},{"$f":"(F397+H397-(D397+P397))*radconv","v":-123.68191594486601},null,0,0]
[35687.75,{"$f":"A398/1000","v":35.687750000000001},42.942776282811828,1.5475074179763433,1.0014470264018578,5.3763996303130744E-2,1,0,25838.151007326778,1.5707576243351127,6.614653540549754,1.4190349504561184,1.0125960396883666,0.15789381608552927,1.2399846993888459,0.66771263438700845,1.682860312399258,-141.58202791964581,38.41797208035419,null,{"$f":"IF(Q398<0,A398,1000000000)","v":1000000000},{"$f":"A398^2","v":1273615500.0625},null,25.763413305573909,-17.739718162892387,null,28.315222172593231,-123.84230975675339,null,{"$f":"SUM((Q399<0)*(Q398>0))*A398","v":0},0]
[35894.5,35.894500000000001,43.191422339458079,1.5476415125056064,1.0014638288073854,5.4074862418012078E-2,1,0,25987.839281672626,1.5707578472587795,6.652100878357766,1.419895839202906,1.0127414870179601,0.15879328653551422,1.2425042284357888,0.67067609387739258,1.6128394677421709,-141.74391671693894,38.256083283061059,null,1000000000,1288415130.25,null,25.761025462921626,-17.741941504239829,null,28.247589170588423,-124.00197521269907,null,0,0]
[36101.25,36.10125,43.440069163853295,1.5477740719485662,1.0014807279888625,5.4385718071701832E-2,1,0,26137.527556019755,1.5707580676291013,6.689553091035533,1.420747089010449,1.012887753467407,0.15969249793606954,1.2450332445386869,0.67362841841519239,1.5430890999176428,-141.9056174556622,38.094382544337805,null,1000000000,1303300251.5625,null,25.758650018632807,-17.744702127390688,null,28.180214247052717,-124.16091532827153,null,0,0]
[36308,36.308,43.688716742888943,1.5479051225106433,1.0014977239413902,5.469656320465438E-2,1,0,26287.215830368135,1.5707582854896973,6.7270100971614477,1.4215888596478536,1.0130348386819026,0.16059144894554886,1.2475716913087449,0.67656963421962979,1.473606155759462,-142.06712391447124,37.932876085528761,null,1000000000,1318270864,null,25.7562865497449,-17.747990803877979,null,28.113094771782446,-124.31913311059323,null,0,0]
[36519.5,36.519500000000001,43.943077669827147,1.5480376493311911,1.0015152104956166,5.5014538934227475E-2,1,0,26440.343133995444,1.5707585058031202,6.7653325401734632,1.4224403242221033,1.0131861499469381,0.16151078217153628,1.2501781575203039,0.6795669566191721,1.4028004598694026,-142.23213360852623,37.767866391473774,null,1000000000,1333673880.25,null,25.753880743792354,-17.75189201421755,null,28.044694881844929,-124.48024159430867,null,0,0]
[36731,36.731000000000002,44.197439359669922,1.5481686507377714,1.0015327983080662,5.5332503528071696E-2,1,0,26593.470437624026,1.5707587235793787,6.8036598327409576,1.4232821962312365,1.0133383172739872,0.16242984007187297,1.2527943741403704,0.6825527109256283,1.3322683494100649,-142.39692743104735,37.603072568952655,null,1000000000,1349166361,null,25.751486612026632,-17.756326917687023,null,27.976556903151316,-124.64060051336031,null,0,0]
[36942.5,36.942500000000003,44.451801799320805,1.5482981529120552,1.0015504873734049,5.5650456922481994E-2,1,0,26746.597741253852,1.5707589388620498,6.8419918933655888,1.4241146356979626,1.0134913402774579,0.16334862121832713,1.2554202816251208,0.68552692663863024,1.2620067513389874,-142.56149932802748,37.43850067197252,null,1000000000,1364748306.25,null,25.749103738958986,-17.761286266325634,null,27.908678178147873,-124.80021306170187,null,0,0]
[37154,37.154000000000003,44.706164975981352,1.5484261814400571,1.0015682776862675,5.5968399053766896E-2,1,0,26899.725044884908,1.5707591516937176,6.8803286423551828,1.4249377991314054,1.0136452185698241,0.16426712418539605,1.2580558207111472,0.68848963371642258,1.1920126550092995,-142.72584343901991,37.274156560980089,null,1000000000,1380419716,null,25.746731720856111,-17.766761013585736,null,27.841056099921065,-124.9590824254342,null,0,0]
[37370.25,37.370249999999999,44.9662415498128,1.5485555876974126,1.0015865722234227,5.6293470017642087E-2,1,0,27056.291377794969,1.5707593668144519,6.9195311484762057,1.4257700182757951,1.0138034366694633,0.16520596636681284,1.2607604474523784,0.69150701156780869,1.1207200955100263,-142.89363706893977,37.106362931060232,null,1000000000,1396535585.0625,null,25.744317245208286,-17.772882389123406,null,27.772178016069617,-125.12075467981637,null,0,0]
[37586.5,37.586500000000001,45.226318867987622,1.54868350563623,1.0016049725954916,5.6618529072181505E-2,1,0,27212.85771070627,1.570759579459837,{"$f":"SQRT(1+(A407/Zero2)^2)","v":6.9587383929879438},{"$f":"ATAN(A407/Zero2)","v":1.4265928601298328},1.0139625480811028,0.16614451472828662,1.2634750188801396,0.69451242280056824,1.0497010151483146,-143.0611807727916,36.938819227208398,null,1000000000,1412744982.25,null,25.74191329991303,-17.779524067352376,null,27.703562881003162,-125.28165670543919,null,0,0]
[37802.75,37.802750000000003,45.486396917738013,1.5488099607816104,1.0016234787966412,5.6943576149349716E-2,1,0,27369.42404361879,1.5707597896723533,6.9979502962474029,1.42740648120228,1.0141225523842727,0.16708276775502157,1.2661994725673209,0.69750590084720188,0.97895238748019242,-143.22846888084624,36.771531119153764,null,1000000000,1429047907.5625,null,25.739519489068062,-17.78667699662369,null,27.635208064180009,-125.44179188422257,null,0,0]
[38019,38.018999999999998,45.746475686586521,1.548934978078381,1.0016420908210057,5.726861118112641E-2,1,0,27525.990376532503,1.5707599974935149,7.0371667803773486,1.4282110345626073,1.014283449156409,0.16802072393525491,1.2689337463999151,0.70048747958993562,0.90847124722138894,-143.39549591306928,36.604504086930717,null,1000000000,1445444361,null,25.737135428002723,-17.794332322463653,null,27.567110984986542,-125.60116359060562,null,0,0]
[38240.5,38.240499999999997,46.012869239223875,1.5490615653208972,1.0016612643998983,5.7601524678135452E-2,1,0,27686.357741807191,1.5707602079233014,7.0773400104548232,1.4290258762917269,1.0144491768814283,0.16898114198525094,1.271744517513931,0.70352914321334925,0.83655327479714292,-143.56630174352122,36.433698256478777,null,1000000000,1462335840.25,null,25.734703205099819,-17.802685287995107,null,27.497625235465204,-125.76361645552612,null,0,{"$f":"IF(AD410>0,S410,0)","v":0}]
[38462,38.462000000000003,46.279263520698201,1.5491866952337587,1.0016805489900504,5.7934425393380846E-2,1,0,27846.72510708309,1.5707604159293866,7.1175178866047544,1.4298315191049289,1.0146158400310512,0.16994124539961719,1.2745654604754735,0.70655839609933702,0.76490982735968427,-143.73682261749693,36.263177382503073,null,1000000000,1479325444,null,25.732280428709014,-17.811547146423798,null,27.428404564418546,-125.92527547107314,null,0,0]
[38683.5,38.683500000000002,46.545658518495479,1.5493103928352394,1.0016999445850507,5.8267313253816934E-2,1,0,28007.092472360178,1.5707606215534047,7.1577003305886073,1.4306281168722135,1.0147834381443892,0.17090103256377051,1.2773965095667834,0.70957527604323034,0.69353790735190701,-143.90705323191105,36.09294676808895,null,1000000000,1496413172.25,null,25.729866719728754,-17.820908991524764,null,27.359446353391036,-126.0861442403863,null,0,0]
[38905,38.905000000000001,46.812054220386493,1.5494326825742992,1.0017194511784511,5.8600188186415061E-2,1,0,28167.459837638438,1.5707608248360414,7.1978872659061324,1.4314158200737648,1.0149519707582728,0.17186050186652174,1.2802375994206601,0.71257982128024344,0.6224345775696869,-144.07698847062386,35.92301152937614,null,1000000000,1513599025,null,25.727461709863992,-17.83076211143533,null,27.290748033473573,-126.24622635918851,null,0,0]
[39131.5,39.131500000000003,47.084464084934936,1.5495563018063878,1.0017395128796083,5.8940563780904696E-2,1,0,28331.447233736813,1.5707610303276192,7.2389859221402402,1.4322122597136533,1.0151252736160097,0.17284129923823663,1.2831531377925716,0.71563947398943306,0.55000096088157957,-144.25044912684058,35.749550873159421,null,1000000000,1531274292.25,null,25.725011033944021,-17.841336805201799,null,27.220765092705438,-126.40911232163877,null,0,0]
[39358,39.357999999999997,47.356874660736821,1.5496784988524628,1.0017596906331869,5.9280925702924779E-2,1,0,28495.434629836367,1.5707612334540442,7.280089118333275,1.4329997064928375,1.0152995526532793,0.17382176083956979,1.2860790382319758,0.71868631104914005,0.47784217152358366,-144.42359067777355,35.576409322226453,null,1000000000,1549052164,null,25.722568708460653,-17.852407378193909,null,27.151048628830811,-126.57118329957959,null,0,0]
[39584.5,39.584499999999998,47.629285935588342,1.5497992981110251,1.0017799844321742,5.9621273874444596E-2,1,0,28659.422025937085,1.570761434255916,7.3211967780195328,1.4337783109080213,1.0154748073674762,0.17480188495884147,1.2890152319894055,0.72172037468226902,0.40595525422671008,-144.59640822644698,35.403591773553018,null,1000000000,1566932640.25,null,25.720134372390532,-17.86396511183985,null,27.081596047604059,-126.73244311460714,null,0,0]
[39811,39.811,47.90169789756326,1.5499187234257343,1.0018003942695177,5.9961608217452445E-2,1,0,28823.409422038942,1.5707616327729106,7.3623088264328924,1.4345482201377717,1.0156510372535295,0.17578166988814345,1.2919616507036806,0.7247417075343231,0.3343373128610283,-144.76889705858574,35.231102941414264,null,1000000000,1584915721,null,25.71770767503757,-17.876001477846209,null,27.012404803591338,-126.89289558073955,null,0,0]
[40042.75,40.042749999999998,48.180424743128761,1.5500395190985683,1.0018213972791379,6.0309816710466591E-2,1,0,28991.197850501943,1.5707618335668019,7.4043782693651155,1.4353271252348943,1.0158323607476778,0.17678381221260339,1.2949868762038825,0.72781993936192935,0.26133479258226155,-144.94503901166738,35.054960988332624,null,1000000000,1603421827.5625,null,25.715232280773375,-17.888803533459999,null,26.941877677576763,-127.05623547820737,null,0,0]
[40274.5,40.274500000000003,48.459152283636122,1.5501589251870864,1.0018425217536535,6.0658010561310892E-2,1,0,29158.986278966098,1.5707620320498521,7.446452153723274,1.4360972288681528,1.0160147040665992,0.17778559583553485,1.2980226626152085,0.7308849350193688,0.18860791042712027,-145.12082741192691,34.879172588073089,null,1000000000,1622035350.25,null,25.712764172302116,-17.902089191322155,null,26.871618903892887,-127.21873822060473,null,0,0]
[40506.25,40.506250000000001,48.737880507162416,1.550276965528635,1.0018637676853819,6.100618968648492E-2,1,0,29326.774707431388,1.5707622282617244,7.488530404645668,1.4368586784833037,1.0161980666613117,0.17878701893985327,1.301068937980298,0.73393674146817223,0.11615374616297941,-145.29625777076708,34.703742229232915,null,1000000000,1640756289.0625,null,25.710303005362839,-17.915849901574383,null,26.80162590656802,-127.38040786919269,null,0,0]
[40738,40.738,49.016609402055892,1.5503936634185174,1.0018851350665958,6.1354354002509569E-2,1,0,29494.563135897792,1.57076242224118,7.5306129489361098,1.4376116182709362,1.0163824479801615,0.17978807971267402,1.304125630771209,0.73697540607140699,4.3969437626133076E-2,-145.47132577823535,34.528674221764646,null,1000000000,1659584644,null,25.707848445587,-17.930077301054677,null,26.731896157807014,-127.54124847718072,null,40738,34.528674221764646]
[40975.25,40.975250000000003,49.301953905746203,1.5505117639872628,1.0019071353475695,6.171076569019348E-2,1,0,29666.333598266374,1.5707626185512784,7.5736985886545405,1.438373759237547,1.0165722598207121,0.18081252091016176,1.3072655834107256,0.74007262216950753,-2.9651373618990312E-2,-145.6501689117093,34.349831088290699,null,40975.25,1678971112.5625,null,25.705342138213794,-17.945117245006525,null,26.660781653935093,-127.7050516667028,null,0,0]
[41212.5,41.212499999999999,49.587299089173534,1.5506285053616544,1.0019292628944976,6.2067161680487502E-2,1,0,29838.104060636084,1.5707628126011612,7.6167885778511781,1.4391272774113693,1.0167631381342954,0.18183657854258986,1.3104163034820437,0.74315616692183117,-0.10299525918671262,-145.82862370153822,34.17137629846178,null,41212.5,1698470156.25,null,25.702842076528867,-17.960629132433429,null,26.589937830052293,-127.86799456910479,null,0,0]
[41449.75,41.449750000000002,49.872644940670597,1.5507439108683347,1.0019515176989484,6.242354188389717E-2,1,0,30009.8745230069,1.5707630044296392,7.6598828431232162,1.4398723174641217,1.0169550823203941,0.18286025067870015,1.313577715645637,0.74622609235457338,-0.17606511089119342,-146.00668607274119,33.993313927258811,null,41449.75,1718081775.0625,null,25.700347931912795,-17.976604565827209,null,26.519362122963894,-128.030081506914,null,0,0]
[41687,41.686999999999998,50.157991448835546,1.5508580033032728,1.0019738997524426,6.2779906210951975E-2,1,0,30181.644985378814,1.57076319407464,7.7029813127032503,1.4406090208678812,1.0171480917755908,0.18388353539191984,1.3167497450361521,0.74928245087003309,-0.24886376342500693,-146.18435212502354,33.815647874976463,null,41687,1737805969,null,25.697859385241571,-17.993035331223535,null,26.449052017101305,-128.19131679380001,null,0,0]
[41929.75,41.929749999999999,50.449953612601867,1.5509734048145414,1.001996932372581,6.3144515355739381E-2,1,0,30357.397481652977,1.5707633858947161,7.7470831822598667,1.4413543182622679,1.0173466775993356,0.18493013919185305,1.3200062210422647,0.75239567550120279,-0.32307225178906301,-146.36572278750873,33.63427721249127,null,41929.75,1758103935.0625,null,25.695318619222384,-18.010309907102119,null,26.377384294756432,-128.35541288040665,null,0,0]
[42172.5,42.172499999999999,50.74191644050422,1.5510874783147388,1.0020200981918856,6.3509107690111227E-2,1,0,30533.149977928242,1.5707635755065132,7.7911893063564808,1.4420911777664667,1.0175463773681097,0.18597633333245672,1.3232736551958257,0.75549480902953126,-0.39700264879255542,-146.54667082022843,33.453329179771572,null,42172.5,1778519756.25,null,25.692783066876647,-18.028044340201323,null,26.305989450098679,-128.51862648002708,null,0,0]
[42415.25,42.41525,51.033879921144099,1.5512002465934196,1.0020433972011185,6.3873683118308058E-2,1,0,30708.902474204595,1.5707637629479465,7.835299613144687,1.4428197410815853,1.0177471904261863,0.18702211576538938,1.3265519688465517,0.7585799087074383,-0.47065781515626848,-146.7271925806721,33.272807419327904,null,42415.25,1799053432.5625,null,25.690252415227977,-18.046230396456743,null,26.234864935383634,-128.68096218421536,null,0,0]
[42658,42.658000000000001,51.325844043382361,1.551311731921724,1.0020668293909887,6.4238241544597244E-2,1,0,30884.654970482014,1.5707639482560678,7.8794140323782136,1.44354014677105,1.0179491161147027,0.18806748444752344,1.3298410838647787,0.76165103213162921,-0.5440405555502108,-146.90728459637614,33.092715403623856,null,42658,1819704964,null,25.68772636039407,-18.064860021829183,null,26.164008249823599,-128.84242457454692,null,0,0]
[42906.5,42.906500000000001,51.624724549841474,1.551424551822026,1.002090954557487,6.4611417526743584E-2,1,0,31064.570502202721,1.5707641357816617,7.9245775743771327,1.4442693083494902,1.0181569765846161,0.18913718399963295,1.3332192150441389,0.76478048473126103,-0.61888219609627881,-147.09119385115144,32.908806148848555,null,42906.5,1840967742.25,null,25.685144924513796,-18.08438215493177,null,26.091748045157811,-129.00681169621967,null,0,0]
[43155,43.155000000000001,51.923605705832394,1.5515360729024457,1.0021152192687552,6.4984575489064819E-2,1,0,31244.486033924513,1.5707643211475935,7.969745281934653,1.4449902054118569,1.0183660016115399,0.19020644565181399,1.336608501335669,0.76789541430644648,-0.69344412638625286,-147.27464592181548,32.725354078184523,null,43155,1862354025,null,25.682567689266453,-18.104352596368312,null,26.019763350115177,-129.17029332544718,null,0,0]
[43403.5,43.403500000000001,52.222487500202881,1.5516463174605564,1.0021396235146574,6.5357715328951502E-2,1,0,31424.401565647364,1.5707645043909575,8.0149170846263136,1.4457029769380565,1.0185761904785273,0.19127526722939314,1.3400088606197489,0.77099588365908955,-0.76772918244927157,-147.45763760465189,32.542362395348107,null,43403.5,1883863812.25,null,25.679994356347343,-18.124763260702476,null,25.948051626971264,-129.33287434394938,null,0,0]
[43652,43.652000000000001,52.521369922054511,1.5517553072865031,1.0021641672849995,6.5730836943824367E-2,1,0,31604.317097371255,1.5707646855480035,8.0600929136000854,1.4464077588255853,1.0187875424652331,0.19234364656350841,1.3434202113475557,0.77408195589834927,-0.84174014522149987,-147.64016586136708,32.35983413863292,null,43652,1905497104,null,25.677424636178049,-18.145606239391604,null,25.876610384368327,-129.4945596219755,null,0,0]
[43906,43.905999999999999,52.826868085189162,1.5518654348354655,1.0021893984576637,6.6112197842279924E-2,1,0,31788.214662997543,1.5707648685953479,8.1062727008742055,1.4471200210029647,1.0190047735282766,0.1934352128345728,1.3469183395497848,0.77722151893975044,-0.91710875654452662,-147.82625205873859,32.173747941261411,null,43906,1927736836,null,25.674801481849954,-18.167349250976919,null,25.803864927373397,-129.65890280776168,null,0,0]
[44160,44.16,53.132366881644529,1.5519742959699649,1.002214775377529,6.6493539483437517E-2,1,0,31972.112228624883,1.5707650495369847,8.1524565540102021,1.447824213571125,1.0192232182343515,0.19452631250602001,1.3504277806619784,0.78034617475424473,-0.99219671282034505,-148.01184817779514,31.988151822204856,null,44160,1950105600,null,25.672181516852909,-18.189527762276349,null,25.731396936094622,-129.82232041551885,null,0,0]
[44414,44.414000000000001,53.437866300558724,1.5520819124073282,1.0022402980335248,6.6874861757853635E-2,1,0,32156.009794253259,1.570765228409041,8.1986444042977524,1.4485204722084521,1.0194428758032852,0.19561694328073034,1.3539484494448155,0.78345599162003254,-1.0670068149209921,-148.19695147782721,31.803048522172787,null,44414,1972603396,null,25.669564458378513,-18.212133869945699,null,25.659203892468373,-129.98481760788155,null,0,0]
[44668,44.667999999999999,53.743366331316821,1.5521883053711962,1.002265966414517,6.725616455611845E-2,1,0,32339.907359882647,1.5707654052468218,8.2448361845603202,1.4492089295839392,1.0196637454512474,0.19670710286801996,1.3574802612789585,0.78655103807771065,-1.1415418099048398,-148.38155937761832,31.618440622381684,null,44668,1995230224,null,25.666950031941099,-18.235159843387869,null,25.587283323921937,-130.14639953423048,null,0,0]
[44928.25,44.928249999999998,54.056384211005351,1.5522960689598397,1.0022924175354064,6.7646829489850166E-2,1,0,32528.329964037424,1.5707655843620307,8.2921685811283066,1.4499063714392613,1.0198913062434891,0.19782359613835315,1.3611104478035356,0.78970699405917633,-1.2176283084101986,-148.57019342283343,31.429806577166573,null,44928.25,2018547648.0625,null,25.664273725556246,-18.259179983439953,null,25.513873131801436,-130.31101343939349,null,0,0]
[45188.5,45.188499999999998,54.369402711221888,1.5524025917048505,1.0023190216171656,6.8037473744728308E-2,1,0,32716.752568193227,1.5707657614141159,8.3395049654284694,1.4505958960403857,1.0201201378204727,0.19893958989965646,1.3647521546398163,0.79284759024952611,-1.2934316663738634,-148.75830239383401,31.241697606165985,null,45188.5,2042000532.25,null,25.661599624531043,-18.28362501077585,null,25.440743874862971,-130.47467738305812,null,0,0]
[45448.75,45.448749999999997,54.682421821310179,1.5525078949127091,1.0023457786476151,6.8428097203177288E-2,1,0,32905.175172350049,1.5707659364385191,8.3868452699390588,1.4512776367950033,1.0203502393272108,0.20005508170912883,1.368405292784745,0.79597290111784857,-1.3689546723699111,-148.94588400326327,31.054115996736726,null,45448.75,2065588876.5625,null,25.658927459033414,-18.308487143766406,null,25.367893034364553,-130.63739685949685,null,0,0]
[45709,45.709000000000003,54.995441530856539,1.5526119994049223,1.0023726886145063,6.8818699747659418E-2,1,0,33093.597776507864,1.5707661094698748,8.4341894286487662,1.4519517241446569,1.0205816099047436,0.20117006913116306,1.3720697739130692,0.79908300134689814,-1.4442000619070636,-149.13293611853129,30.867063881468709,null,45709,2089312681,null,25.65625696724598,-18.333758771096111,null,25.295318136614839,-130.7991773474352,null,0,0]
[45975.25,45.975250000000003,55.315678442865938,1.5527172847308288,1.002400377237203,6.9218285772820951E-2,1,0,33286.364417650162,1.5707662844632198,8.4826290165535436,1.4526335653025699,1.020819627069631,0.20231023781852886,1.3758303856221208,0.80224914156117177,-1.520895723126082,-149.32375066185122,30.676249338148779,null,45975.25,2113723612.5625,null,25.653526375063024,-18.360029030578538,null,25.221353067578768,-130.9637216312727,null,0,0]
[46241.5,46.241500000000002,55.635915960990829,1.552821358023857,1.0024282259033002,6.9617849659813269E-2,1,0,33479.131058793457,1.5707664574414062,8.5310725033098738,1.4533076631342077,1.0210589706646513,0.20344987345928095,1.3796026845067519,0.80539952043787943,-1.5973064479167234,-149.51400697423725,30.485993025762752,null,46241.5,2138276322.25,null,25.650797004831585,-18.386712293195075,null,25.147671713019577,-131.12729468104214,null,0,0]
[46507.75,46.507750000000001,55.956154074824809,1.5529242400911933,1.0024562345994597,7.0017391282904989E-2,1,0,33671.897699937756,1.5707666284390434,8.5795198228742162,1.4539741481980539,1.0212996397572498,0.20458897346897809,1.3833865781816785,0.80853421852279739,-1.6734350022796161,-149.70370324344552,30.296296756554483,null,46507.75,2162970810.0625,null,25.648068600551813,-18.413800932401006,null,25.074271562936449,-131.28990231104447,null,0,0]
[46774,46.774000000000001,56.276392774198314,1.5530259512665159,1.0024844033122682,7.0416910516407138E-2,1,0,33864.664341083015,1.5707667974899528,8.627970910681233,1.4546331481473476,1.021541633410588,0.20572753527116783,1.387181974995894,0.81165331651850803,-1.7492841002124742,-149.89283780595491,30.107162194045088,null,46774,2187807076,null,25.645340913894611,-18.44128748852247,null,25.001150151660791,-131.45155031743246,null,0,0]
[47046.25,47.046250000000001,56.603848715445537,1.5531287644580114,1.0025133722652115,7.0825409717234708E-2,1,0,34061.77501921283,1.5707669683718672,8.6775176848046947,1.4552993887992205,1.0217904491324941,0.20689119559120073,1.3910747020603673,0.81482665689205758,-1.8265562743127388,-150.08565213679208,29.914347863207922,null,47046.25,2213349639.0625,null,25.642552249358861,-18.469797326999903,null,24.926666642096279,-131.61585480979215,null,0,0]
[47318.5,47.3185,56.931305248143758,1.5532303949321684,1.0025425084994783,7.1233885242334163E-2,1,0,34258.88569734362,1.5707671372874217,8.7270682669386961,1.4559580641731771,1.0220406477915309,0.20805428775037094,1.3949792650803365,0.81798385723803402,-1.903541833854163,-150.27787609658657,29.722123903413433,null,47318.5,2239040442.25,null,25.639763833472557,-18.498707958089604,null,24.852469498441163,-131.77916813849697,null,0,0]
[47590.75,47.59075,57.258762362145617,1.5533308629783942,1.0025718120004841,7.1642336957465483E-2,1,0,34455.996375475384,1.5707673042703629,8.7766225925860599,1.4566093018373785,1.022292228372307,0.20921680902017484,1.3988955684336102,0.82112500422907475,-1.9802435209280409,-150.46950835798816,29.530491642011839,null,47590.75,2264879485.5625,null,25.636975423997971,-18.528011918276128,null,24.778556220841871,-131.94149643971204,null,0,0]
[47863,47.863,57.586220047534596,1.5534301884246975,1.0026012827535622,7.205076472843612E-2,1,0,34653.107053608088,1.5707674693536695,8.826180598693254,1.4572532265204239,1.0225451898548241,0.21037875668095887,1.4028235172894894,0.82425018463095834,-2.0566640267658416,-150.66054773570227,29.339452264297734,null,47863,2290866769,null,25.634186786024479,-18.557701907202009,null,24.704924352977564,-132.10284582850025,null,0,0]
[48141.75,48.141750000000002,57.921496404641367,1.5535307216685779,1.0026316303983351,7.2468918810737332E-2,1,0,34854.923771807378,1.5707676364438092,8.8769255568255119,1.4579050753752238,1.02280562050082,0.21156784882961693,1.4068572140458389,0.82743352681917071,-2.1346205083316678,-150.85553282139821,29.144467178601786,null,48141.75,2317628093.0625,null,25.631331094366647,-18.588493254106766,null,24.629823563069561,-132.26703956729145,null,0,0]
[48420.5,48.420499999999997,58.256773340418597,1.5536300977440451,1.0026621533454623,7.2887047507331201E-2,1,0,35056.740490007629,1.5707678016101203,8.9276742439453862,1.4585495137305104,1.0230674965952653,0.2127563339106682,1.4109029203476855,0.83060031521660216,-2.2122877744070188,-151.04989429608162,28.950105703918382,null,48420.5,2344544820.25,null,25.628474687265779,-18.619674298719165,null,24.555012704095081,-132.43021999736246,null,0,0]
[48699.25,48.699249999999999,58.592050844932444,1.5537283365138896,1.0026928515789346,7.3305150674338501E-2,1,0,35258.557208208826,1.5707679648856379,8.9784265968209045,1.4591866667144162,1.0233308170284652,0.21394420903400002,1.4149605369665452,0.83375064313681735,-2.2896685568527184,-151.24363131951117,28.756368680488833,null,48699.25,2371616950.5625,null,25.625617334902383,-18.651237708026816,null,24.480489274012776,-132.5923936114844,null,0,0]
[48978,48.978000000000002,58.927328908475111,1.5538254573889381,1.0027237250826531,7.3723228167933322E-2,1,0,35460.373926410954,1.5707681263026456,9.0291825536372539,1.4598166566654966,1.0235955806857489,0.21513147131935093,1.4190299655291041,0.83688460391650799,-2.3667655375228507,-151.43674318722455,28.56325681277545,null,48978,2398844484,null,25.622758814492748,-18.683176309369696,null,24.406250813752276,-132.75356687785484,null,0,0]
[49263.25,49.263249999999999,59.270425684040212,1.5539237054564659,1.0027554999381731,7.4151027825372376E-2,1,0,35666.896684679719,1.5707682895925301,9.0811257253609732,1.4604540462285871,1.0238680111329126,0.21634578120975978,1.4232064131651823,0.84007479691138909,-2.4453692366220583,-151.63371032234664,28.366289677653356,null,49263.25,2426867800.5625,null,25.619832203490983,-18.71624076509935,null,24.33057372565484,-132.91746955724727,null,0,0]
[49548.5,49.548499999999997,59.613523025138441,1.5540208226187444,1.0027874582988818,7.4578800293550629E-2,1,0,35873.419442949431,1.5707684510022999,9.1330725444661223,1.4610841853943601,1.0241419505186193,0.21755944327725954,1.4273950243324243,0.84324804830965072,-2.5236812717586194,-151.83002172914044,28.169978270859559,null,49548.5,2455053852.25,null,25.616903918875146,-18.749683412754319,null,24.255189975134112,-133.0803383163861,null,0,0]
[49833.75,49.833750000000002,59.956620922061127,1.5541168282885227,1.0028196001472347,7.5006545418519491E-2,1,0,36079.942201220067,1.57076861056424,9.1850229490683049,1.4617071966826356,1.0244173976323534,0.21877245446760374,1.431595696368648,0.84640445808555387,-2.6017043629504477,-152.02567706378409,27.974322936215913,null,49833.75,2483402639.0625,null,25.613973743303411,-18.783497059320361,null,24.180097059514019,-133.24218000446376,null,0,0]
[50119,50.119,60.299719365320563,1.5542117414368077,1.0028519254655892,7.543426304639006E-2,1,0,36286.464959491612,1.5707687683099012,9.2369768786711006,1.4623231998791733,1.0246943512582425,0.21998481173748252,1.4358083275310392,0.84954412615926267,-2.6794411811479875,-152.22067611127758,27.779323888722416,null,50119,2511914161,null,25.611041466175216,-18.817674669017919,null,24.105292518444674,-133.40300144225969,null,0,0]
[50410.75,50.41075,60.650636558218316,1.5543077065491671,1.0028851771521552,7.5871698483779323E-2,1,0,36497.693757829853,1.5707689278034216,9.2901182687316215,1.4629461125727563,1.0249791729582103,0.22122411542540246,1.4401292179542957,0.85273812372113267,-2.7586559920865632,-152.41943962393276,27.58056037606724,null,50410.75,2541243715.5625,null,25.608039984552022,-18.853000409869235,null,24.029079189129298,-133.56643921406348,null,0,0]
[50702.5,50.702500000000001,61.001554303239928,1.5544025675639397,1.0029186207278145,7.6309104831198127E-2,1,0,36708.922556169025,1.5707690854614418,9.3432632225398056,1.4635619391852142,1.0252655680205964,0.2224627286469453,1.4444624063718332,0.85591481908103961,-2.8375768351454216,-152.617516536605,27.382483463395005,null,50702.5,2570743506.25,null,25.605035879505763,-18.888692487287024,null,23.953162451116693,-133.72882404931795,null,0,0]
[50994.25,50.994250000000001,61.352472590911439,1.5544963434247545,1.0029522561733717,7.674648192419195E-2,1,0,36920.151354509093,1.570769241315465,9.396411679627299,1.4641707994873903,1.0255535351272735,0.22370064818169785,1.4488077868777891,0.85907431885125218,-2.9162064173463036,-152.81490700746505,27.185092992534948,null,50994.25,2600413533.0625,null,25.602028946169163,-18.924743856196336,null,23.877539802252411,-133.89016315126869,null,0,0]
[51286,51.286000000000001,{"$f":"SQRT(1+(A461/pole1)^2)","v":61.703391411974401},{"$f":"ATAN(A461/pole1)","v":1.5545890526443735},{"$f":"SQRT(1+(A461/Zero1)^2)","v":1.0029860834695234},{"$f":"ATAN(A461/Zero1)","v":7.7183829598373069E-2},{"$f":"IF(VIN_nom>Vout, 1, SQRT(1+(A461/z_RHP)^2))","v":1},{"$f":"IF(VIN_nom>Vout, 0, -ATAN(A461/z_RHP))","v":0},{"$f":"SQRT(1+(A461/Pole2)^2)","v":37131.380152850055},{"$f":"ATAN(A461/Pole2)","v":1.5707693953962789},9.4495635808821934,1.464772810576308,{"$f":"SQRT(1+(A461/pole4)^2)","v":1.0258430729543639},{"$f":"ATAN(A461/pole4)","v":0.22493787082135738},{"$f":"SQRT((1-(V461/pterm2))^2+(A461/pterm1)^2)","v":1.4531652545499363},{"$f":"IF((ATAN((A461/pterm1)/(1-A461^2/pterm2))>0),ATAN((A461/pterm1)/(1-A461^2/pterm2)),PI()+ATAN((A461/pterm1)/(1-A461^2/pterm2)))","v":0.86221672950600825},{"$f":"20*LOG10(((E461*K461*G461)/(C461*I461*O461*M461))*Adc)","v":-2.9945473976508308},{"$f":"((F461+L461+H461)-(D461+J461+P461+N461))*radconv","v":-153.01161131593571},{"$f":"IF(R461>0,R461,R461+180)","v":26.98838868406429},null,51286,2630253796,null,{"$f":"20*LOG10((K461/(I461*M461))*AEA)","v":25.599018986120964},{"$f":"(L461-(J461+N461))*radconv","v":-18.961147625373737},null,{"$f":"20*LOG10((E461*G461/(C461*O461))*Acs*Am)","v":23.802208781996089},{"$f":"(F461+H461-(D461+P461))*radconv","v":-134.05046369056203},null,0,0]
[51584.75,{"$f":"A462/1000","v":51.58475},62.06273042242028,1.5546828998112772,1.0030209211790786,7.7631639960937221E-2,1,0,37347.676994339767,1.5707695513678661,9.5039942721538431,1.4653822877023104,1.0261411840178842,0.22620405280771866,1.4576396886632217,0.86541693846276413,-3.0744716811101607,-153.2123245391308,26.787675460869195,null,{"$f":"IF(Q462<0,A462,1000000000)","v":51584.75},{"$f":"A462^2","v":2660986432.5625},null,25.595933470436933,-18.99878297881471,null,23.725370014220783,-134.21354156031612,null,{"$f":"SUM((Q463<0)*(Q462>0))*A462","v":0},0]
[51883.5,51.883499999999998,62.422069973177507,1.5547756664957952,1.0030559600145568,7.8079419127392385E-2,1,0,37563.97383583038,1.5707697055432557,9.5584284535933239,1.4659848232418227,1.0264409392510812,0.22746949728653287,1.4621265773794816,0.86859945386921467,-3.1540988418369746,-153.41231924151751,26.587680758482492,null,51883.5,2691897572.25,null,25.592844379753636,-19.036773696880744,null,23.648831944177275,-134.37554554463676,null,0,0]
[52182.25,52.182250000000003,62.781410054968383,1.5548673712492915,1.0030911999548819,7.8527166921452146E-2,1,0,37780.270677321874,1.5707698579532978,9.6128660659099658,1.4665805346840946,1.0267423372139186,0.22873420085268475,1.4666258112086492,0.87176438948044876,-3.2334315865581558,-153.61159608882826,26.388403911171736,null,52182.25,2722987215.0625,null,25.589751520668354,-19.07511285460253,null,23.572592058541375,-134.53648323422573,null,0,0]
[52481,52.481000000000002,63.140750658726446,1.5549580322008913,1.0031266409788593,7.8974883166905097E-2,1,0,37996.567518814241,1.5707700086281406,9.6673070511448902,1.4671695368914597,1.027045376460165,0.2299981601145259,1.471137281715196,0.87491185882188527,-3.3124725746867592,-153.81015586068239,26.189844139317614,null,52481,2754255361,null,25.586654705971483,-19.113793678253369,null,23.496647885109635,-134.69636218242897,null,0,0]
[52786.5,52.786499999999997,63.508210785764192,1.5550496805744016,1.0031630906901146,7.9432682367497814E-2,1,0,38217.751401914422,1.5707701609435989,9.7229815128035231,1.4677650257700607,1.0273569584323405,0.23128990421234255,1.4757632276595518,0.87811249787870771,-3.3930004298064786,-154.01246128611501,25.987538713884987,null,52786.5,2786414582.25,null,25.583483641934627,-19.153694890856883,null,23.419291094026775,-134.85876639525816,null,0,0]
[53092,53.091999999999999,63.875671440096951,1.5551402744886327,1.0031997506290955,7.9890448205301376E-2,1,0,38438.935285015483,1.5707703115061615,9.7786593830385087,1.4683537336493084,1.0276702536140643,0.23258086286188812,1.480401743483335,0.88129511177547082,-3.4732286741762159,-154.21401886077044,25.785981139229563,null,53092,2818760464,null,25.580308064515854,-19.193939522800139,null,23.342238427075806,-135.02007933797029,null,0,0]
[53397.5,53.397500000000001,64.24313261267659,1.555229832036136,1.0032366207727559,8.0348180492134449E-2,1,0,38660.11916811741,1.5707704603459143,9.8343406039561039,1.4689357752979999,1.0279852604389506,0.23387103248031491,1.4850527166083416,0.88445982104705889,-3.5531600062855362,-154.4148297588716,25.585170241128395,null,53397.5,2851293006.25,null,25.577127792312613,-19.234520794757159,null,23.265487367169726,-135.18030896411437,null,0,0]
[53703,53.703000000000003,64.610594294660814,1.555318370897937,1.0032737010979205,8.0805879039899595E-2,1,0,38881.303051220173,1.5707706074922592,9.8900251189628925,1.4695112629184699,1.0283019773339814,0.23516040949966047,1.4897160355778183,0.88760674590141686,-3.6327970782749333,-154.61489526018678,25.385104739813215,null,53703,2884012209,null,25.573942649840312,-19.275432075263144,null,23.189035437652635,-135.33946318492363,null,0,0]
[54015.75,54.015749999999997,64.986776944385994,1.5554079737327369,1.0033118790963385,8.1274404354937546E-2,1,0,39107.735979012825,1.5707707564064537,9.9470344704309284,1.4700937331207571,1.0286279802001734,0.23647956073637588,1.4945026961106116,0.89081005491872223,-3.7140219682074678,-154.81893793498236,25.181062065017642,null,54015.75,2917701248.0625,null,25.570676696661671,-19.317649321586313,null,23.11107650089874,-135.50128861339607,null,0,0]
[54328.5,54.328499999999998,65.362960109862698,1.5554965451866154,1.0033502773209486,8.1742893911873407E-2,1,0,39334.168906806328,1.570770903606155,{"$f":"SQRT(1+(A471/Zero2)^2)","v":10.004047158181125},{"$f":"ATAN(A471/Zero2)","v":1.4706695645650913},1.0289557719075673,0.23779787378894035,1.4993020625878211,0.8939949792255486,-3.7949439472888402,-155.02220244863796,24.977797551362045,null,54328.5,2951585912.25,null,25.56740528528962,-19.360198818074238,null,23.03342593318942,-135.6620036305637,null,0,0]
[54641.25,54.641249999999999,65.73914378223698,1.555584102963999,1.0033888957464678,8.2211347509173804E-2,1,0,39560.601834600689,1.5707710491208033,10.061063125496689,1.4712388697316898,1.0292853507471109,0.23911534487802663,1.5041140190259465,0.89716164661600939,-3.8755657180669205,-155.22469048965829,24.775309510341714,null,54641.25,2985666201.5625,null,25.564128245468943,-19.403073905232496,null,22.956081202232014,-135.82161658442578,null,0,0]
[54954,54.954000000000001,66.115327952856376,1.5556706643664373,1.003427734347472,8.2679764945399373E-2,1,0,39787.034762395866,1.5707711929791681,10.118082316936007,1.4718017585824374,1.0296167150026294,0.24043197024082472,1.5089384506363568,0.90031018445190147,-3.9558899374529015,-155.42640384388758,24.573596156112416,null,54954,3019942116,null,25.560845412625195,-19.446268068764404,null,22.879039815689779,-135.98013577512319,null,0,0]
[55274,55.274000000000001,66.500233126721653,1.5557582187348673,1.0034677011477104,8.3159003341067045E-2,1,0,40018.716734880974,1.5707713384873823,10.176426576758896,1.4723711669926858,1.0299576069447116,0.24177823762634576,1.5138875134179797,0.90351307751758492,-4.0377709359227225,-155.63199333492099,24.368006665079008,null,55274,3055215076,null,25.557480317028837,-19.49078714638182,null,22.80052391281632,-136.1412061885392,null,0,{"$f":"IF(AD474>0,S474,0)","v":0}]
[55594,55.594000000000001,66.885138804495043,1.5558447654010739,1.0035078983954253,8.3638203453336335E-2,1,0,40250.398707366934,1.5707714823205008,10.234774098424854,1.4729340832919988,1.0303003643816575,0.24312361170400296,1.5188493971203483,0.90669725905124643,-4.1193459141912223,-155.83677588234357,24.163224117656426,null,55594,3090692836,null,25.554108825546077,-19.535626915810006,null,22.722320426030578,-136.30114896653359,null,0,0]
[55914,55.914000000000001,67.270044977526751,1.5559303216613802,1.0035483260629248,8.4117365066740751E-2,1,0,40482.080679853709,1.5707716245072842,10.293124826463714,1.4734906175300051,1.0306449854522666,0.24446808849714796,1.5238239826071698,0.90986286396671878,-4.2006175777418795,-156.0407536879236,23.959246312076402,null,55914,3126375396,null,25.550730779157043,-19.580780845472397,null,22.644426808868957,-136.45997284245126,null,0,0]
[56234,56.234000000000002,67.654951637363794,1.5560149044185549,1.0035889841223629,8.459648796591919E-2,1,0,40713.762652341291,1.5707717650758377,10.351478706653017,1.4740408772908429,1.0309914682877142,0.24581166404741056,1.5288111520093342,0.91301002663435593,-4.2815885871847428,-156.24392904200724,23.756070957992762,null,56234,3162262756,null,25.547346024283428,-19.626242546064326,null,22.566840554299709,-136.61768649594291,null,0,0]
[56561.5,56.561500000000002,68.048880042473982,1.5561004788258972,1.0036308336307835,8.5086799997518447E-2,1,0,40950.874671059886,1.5707719072920623,10.411203464433978,1.4745976467277573,1.031347997585365,0.24718579236348662,1.5339281162891094,0.91621199488469429,-4.3641487786616686,-156.45103791395604,23.548962086043957,null,56561.5,3199203282.25,null,25.543874838305438,-19.673081908630795,null,22.487751548800773,-136.77795600532522,null,0,0]
[56889,56.889000000000003,68.442808940168476,1.5561850681710692,1.0036729243978113,8.5577071022800516E-2,1,0,41187.986689779296,1.5707720478708591,10.470931412789083,1.4751480645212443,1.0317064729557375,0.24855896836531055,1.5390580154747879,0.9193949292497432,-4.4463995577387276,-156.65731139914928,23.342688600850721,null,56889,3236358321,null,25.540396316894874,-19.720230536153878,null,22.40897929113428,-136.93708086299543,null,0,0]
[57216.5,57.216500000000003,68.836738321990566,1.5562686893643831,1.0037152563930953,8.6067300811250441E-2,1,0,41425.098708499507,1.5707721868403455,10.530662497429317,1.4756922384166005,1.0320668923710004,0.24993118786935847,1.5442007272654186,0.92255897190223513,-4.5283436381680389,-156.86275221414354,23.137247785856459,null,57216.5,3273727872.25,null,25.536910311975269,-19.767682017195519,null,22.330521215624568,-137.09507019694809,null,0,0]
[57544,57.543999999999997,69.230668179676059,1.55635135893132,1.0037578295861147,8.6557489132471313E-2,1,0,41662.21072722051,1.5707723242279987,10.590396665287622,1.4762302737431974,1.0324292537951647,0.25130244671234098,1.5493561307019794,0.92570426435337605,-4.6099836894932942,-157.06736315508186,22.932636844918136,null,57544,3311311936,null,25.53341668068828,-19.815430079862715,null,22.252374795586306,-137.25193307521917,null,0,0]
[57879,57.878999999999998,69.633619815727556,1.5564349539650506,1.0038016272521595,8.70588599978213E-2,1,0,41904.75279217257,1.5707724631533413,10.651501927049406,1.4767743867888887,1.032801920669884,0.25270411019779615,1.5546426030521208,0.92890233401171551,-4.6931815456417407,-157.27580423815121,22.72419576184879,null,57879,3349978641,null,25.52983500859467,-19.864572060672725,null,22.172758611531471,-137.41123217747852,null,0,0]
[58214,58.213999999999999,70.036571932788448,1.5565175870791765,1.0038456772245195,8.7560186987652194E-2,1,0,42147.294857125424,1.5707726004797562,10.712610306308592,1.4773122923799085,1.0331766151836475,0.25410475977155544,1.5599421032231555,0.93208108219094821,-4.7760668019862464,-157.48338315844276,22.516616841557237,null,58214,3388869796,null,25.526245070440339,-19.914011517964489,null,22.093463293341294,-137.56937164047827,null,0,0]
[58549,58.548999999999999,70.439524522603861,1.5565992747806776,1.0038899794699812,8.8061469855760563E-2,1,0,42389.83692207907,1.5707727362346893,10.773721750017994,1.4778440958333507,1.0335533351312125,0.25550439104369776,1.5652545060316974,0.93524065810786561,-4.8586421795844679,-157.69010314115908,22.309896858840915,null,58549,3427985401,null,25.522646729172816,-19.96374216756158,null,22.014486257010596,-137.72636097359751,null,0,0]
[58884,58.884,70.842477577106678,1.5566800332010171,1.0039345339551475,8.8562708356075007E-2,1,0,42632.378987033488,1.5707728704449613,10.834836206324596,1.4783699001041088,1.0339320782986385,0.25690299964664104,1.5705796877090819,0.9383812101951774,-4.9409103559843528,-157.89596748164351,22.10403251835649,null,58884,3467325456,null,25.519039852733449,-20.013757861875824,null,21.93582495705008,-137.88220961976768,null,0,0]
[59227,59.226999999999997,71.255053864352249,1.5567617738104715,1.0039804137400277,8.9075870504438603E-2,1,0,42880.713101301029,1.5707730062871958,10.897413180770691,1.4789021502142987,1.0343219600281182,0.25833394372649787,1.5760451503807995,0.94157720401517275,-5.0248276043267062,-158.10586496047094,21.894135039529061,null,59227,3507837529,null,25.515337865745103,-20.065257016657178,null,21.855609695696067,-138.0406079438138,null,0,0]
[59570,59.57,71.667630622208861,1.5568425732905438,1.0040265578842791,8.9588985618985262E-2,1,0,43129.047215569364,1.5707731405650898,10.959993207093978,1.4794283223249518,1.0347139580376679,0.25976380651530051,1.5815237514281375,0.94475356691051282,-5.1084283500143837,-158.31487264294168,21.68512735705832,null,59570,3548584900,null,25.511626666216443,-20.117042372116231,null,21.775720149537051,-138.19783027082548,null,0,0]
[59913,59.912999999999997,72.080207842595371,1.5569224478008556,1.0040729663514545,9.0102053436025092E-2,1,0,43377.381329838463,1.5707732733055104,11.022576233313895,1.4799485196696236,1.0351080699229656,0.2611925833981148,1.5870153625214241,0.94791045556542342,-5.1917153325363703,-158.52299426966317,21.477005730336828,null,59913,3589567569,null,25.507906127617645,-20.169107750529111,null,21.696153705613863,-138.35388651913405,null,0,0]
[60256,60.256,72.492785517614621,1.5570014131332008,1.0041196391049041,9.0615073692016421E-2,1,0,43625.715444108318,1.5707734045347135,11.085162208621282,1.4804628431635769,1.0355042932703948,0.26262026978474762,1.5925198568246646,0.9510480257487115,-5.2746912483430721,-158.73023364192059,21.269766358079409,null,60256,3630785536,null,25.50417612821672,-20.221447108382804,null,21.616907789208092,-138.50878653353774,null,0,0]
[60607,60.606999999999999,72.914986458160101,1.5570812950899815,1.0041676740015713,9.1140009922301382E-2,1,0,43879.841607691356,1.5707735372869256,11.149210916381072,1.4809831845139849,1.0359119413577069,0.26408012127200453,1.5981659424958237,0.95423893736211629,-5.3592831975783035,-158.94139725067586,21.058602749324137,null,60607,3673208449,null,25.500349215244043,-20.275284680236989,null,21.53614275294553,-138.66611257043886,null,0,0]
[60958,60.957999999999998,73.337187858628141,1.5571602572881322,1.0042159855782045,9.1664895789158693E-2,1,0,44133.967771275158,1.5707736685103466,11.213262608361424,1.4814975814802087,1.0363217954061172,0.26553882115503891,1.6038252553344188,0.95740994590069139,-5.4435549804354615,-159.1516452030379,20.848354796962099,null,60958,3715877764,null,25.496512151788359,-20.329396770562159,null,21.45570803354406,-138.82224843247567,null,0,0]
[61309,61.308999999999997,73.759389711120917,1.5572383155208707,1.0042645737948732,9.2189731010660192E-2,1,0,44388.093934859709,1.5707737982312338,11.277317233713967,1.4820061350791371,1.0367338527993653,0.26699636459568465,1.6094976641780852,0.96056121523858062,-5.5275093535958222,-159.360981745798,20.639018254202,null,61309,3758793481,null,25.492664821992378,-20.383777315814843,null,21.375600990179681,-138.97720442998309,null,0,0]
[61660,61.66,74.181592007920386,1.5573154852219133,1.0043134386114265,9.271451530504371E-2,1,0,44642.220098445003,1.5707739264752467,11.341374742736782,1.4825089440576822,1.0371481109112939,0.26845274678309794,1.6151830394344406,0.96369290819956099,-5.6111490312037802,-159.56941117654978,20.430588823450222,null,61660,3801955600,null,25.488807114598512,-20.438420384042864,null,21.295819019965588,-139.13099079250691,null,0,0]
[62019,62.018999999999998,74.613417600841942,1.5573935103574379,1.0043637032420458,9.3251207520074292E-2,1,0,44902.138311343537,1.5707740561405872,11.406895184334862,1.4830173711718366,1.0375740845845329,0.26994111662501358,1.6210112755226904,0.96687589663941687,-5.6963722756548085,-159.78165730451971,20.218342695480288,null,62019,3846356361,null,25.484850635864326,-20.494574395849043,null,21.214552254248748,-139.28708290867067,null,0,0]
[62378,62.378,75.045243642776555,1.5574706375475,1.0044142571391099,9.3787845864379965E-2,1,0,45162.056524242813,1.5707741843134189,11.472418540913223,1.4835199907724717,1.0380023548488915,0.27142826158353078,1.6268528065511356,0.97003874730103501,-5.7812719276310354,-159.99296374071727,20.007036259282728,null,62378,3891014884,null,25.480883079745837,-20.550990887506067,null,21.133620158391007,-139.44197285321118,null,0,0]
[62737,62.737000000000002,75.477070126017438,1.5575468822034038,1.0044651002589433,9.4324430037035015E-2,1,0,45421.974737142817,1.5707743110193635,11.537944762809822,1.4840169015494293,1.0384329188628902,0.27291417660029199,1.6327074988482533,0.97318163092654253,-5.865850759935233,-160.20333522532422,19.796664774675776,null,62737,3935931169,null,25.476904341168513,-20.607663916147981,null,21.053020064664135,-139.59567130917625,null,0,0]
[63096,63.095999999999997,75.908897043033136,1.5576222593858091,1.0045162325576293,9.4860959737299216E-2,1,0,45681.892950043548,1.5707744362834597,11.603473801482265,1.4845081999746261,1.0388657737745559,0.2743988566470284,1.638575220385605,0.97630471707037603,-5.9501115033525123,-160.41277653913997,19.587223460860031,null,63096,3981105216,null,25.472914319458788,-20.664587667677136,null,20.972749342956583,-139.74818887146284,null,0,0]
[63463.25,63.463250000000002,76.350648000284593,1.5576984865145467,1.0045688390795573,9.5409762481234422E-2,1,0,45947.784213798579,1.5707745629597696,11.670511595463044,1.485005079715046,1.0393109433961107,0.27591637230799854,1.6445911309566326,0.97947926369062166,-6.0359822675853989,-160.62607346302454,19.373926536975461,null,63463.25,4027584100.5625,null,25.468820829493964,-20.723073056428866,null,20.890972068688516,-139.90300040659571,null,0,0]
[63830.5,63.830500000000001,76.792399396073108,1.5577738366444112,1.0046217481302602,9.5958507584329472E-2,1,0,46213.675477554338,1.5707746881784104,11.737552237857123,1.485496283581766,1.0397585043461492,0.27743258503789731,1.650620402161656,0.98263344757582993,-6.121525806261559,-160.83840721001229,19.161592789987708,null,63830.5,4074332730.25,null,25.464715332208662,-20.781808912819269,null,20.809534027297659,-140.05659829719301,null,0,0]
[64197.75,64.197749999999999,77.234151222873848,1.5578483248229027,1.0046749596619422,9.6507194725239637E-2,1,0,46479.566741310817,1.5707748119643983,11.804595680134389,1.4859819080429857,1.040208453537987,0.27894748955179466,1.6566628978743854,0.98576744633519187,-6.2067449130156893,-161.04978300833847,18.950216991661534,null,64197.75,4121351105.0625,null,25.460597733199194,-20.840789408256768,null,20.728432519552999,-140.20899360008173,null,0,0]
[64565,64.564999999999998,77.675903473333165,1.5579219657552525,1.0047284736265438,9.7055823582827661E-2,1,0,46745.458005067994,1.5707749343421804,11.871641874858991,1.4864620473983168,1.0406607878738201,0.28046108059789432,1.6627184836856415,0.98888143624813563,-6.2916423398779751,-161.2602061165432,18.739793883456798,null,64565,4168639225,null,25.456467942276273,-20.900008840266544,null,20.647664883613629,-140.36019727627666,null,0,0]
[64941,64.941000000000003,78.128181225845168,1.5579964984773103,1.0047835758773396,9.7617463206471328E-2,1,0,47017.684322761568,1.5707750582017177,11.940288297416117,1.4869480399905832,1.0411263672224362,0.28200936782685837,1.6689317713212664,0.99204907231315953,-6.3782320736610689,-161.4746612206259,18.525338779374096,null,64941,4217333481,null,25.45222703506726,-20.960880936247008,null,20.565316057039546,-140.5137802843789,null,0,0]
[65317,65.316999999999993,78.580459407373112,1.5580701732377746,1.0048389950413099,9.8179041055828156E-2,1,0,47289.910640455848,1.5707751806352501,12.008937507893558,1.4874284763322883,1.0415944401175969,0.28355626721911437,1.6751585005376359,0.99519610439098238,-6.4644903253701926,-161.68812893584433,18.311871064155667,null,65317,4266310489,null,25.447973169675386,-21.021991783044726,null,20.483311670722301,-140.66613715279962,null,0,0]
[65693,65.692999999999998,79.03273801055164,1.5581430047653431,1.0048947310660219,9.8740556786938716E-2,1,0,47562.136958150826,1.570775301667263,12.077589458751561,1.4879034509489628,1.0420650031991618,0.2851017732466819,1.6813985325476948,0.99832271729913957,-6.5504199194868153,-161.90061498382184,18.099385016178161,null,65693,4315570249,null,25.443706262151604,-21.083335649418697,null,20.401648984129462,-140.81727933440317,null,0,0]
[66069,66.069000000000003,79.485017028183051,1.5582150074535166,1.0049507838987553,9.9302010056076404E-2,1,0,47834.363275846503,1.5707754213216847,12.1462441035233,1.4883730562389641,1.0425380530951971,0.28664588041815992,1.6876517303609206,1.0014290943749944,-6.636023639089669,-162.11212510609755,17.887874893902449,null,66069,4365112761,null,25.439426232595959,-21.144906928069904,null,20.320325294082249,-140.96721817802771,null,0,0]
[66453.75,66.453749999999999,79.947821577626769,1.5582878424138022,1.005008469049758,9.9876464041962168E-2,1,0,48112.92464747862,1.5707755423589598,12.216499170822079,1.4888481258576234,1.0430246822311791,0.28822446717985289,1.6940639359676912,1.0045870028316226,-6.7232849894410629,-162.32755308974802,17.672446910251978,null,66453.75,4416100889.0625,null,25.435032938409961,-21.208140737983346,null,20.237457237916857,-141.11941235176468,null,0,0]
[66838.5,66.838499999999996,80.410626546306162,1.558359838968326,1.0050664858127909,0.10045085189746358,1,0,48391.48601911142,1.5707756620027538,12.286756963745599,1.4893177625214309,1.0435139080901503,0.28980157770529996,1.7004896427229255,1.0077241063186357,-6.8102108893222857,-162.54197141176198,17.458028588238022,null,66838.5,4467385082.25,null,25.43062574749748,-21.271601171333309,null,20.154938528948115,-141.27037024042872,null,0,0]
[67223.25,67.223249999999993,80.873431927023901,1.5584310115098887,1.0051248341304309,0.10102517325505925,1,0,48670.047390744912,1.5707757802769933,12.357017435802929,1.4897820586947614,1.0440057270216019,0.29137720622992486,1.7069287095436667,1.0108405964441052,-6.8968041924420111,-162.75538626944405,17.244613730555955,null,67223.25,4518965340.5625,null,25.42620458656376,-21.335282601386339,null,20.072766386762112,-141.42010366805772,null,0,0]
[67608,67.608000000000004,81.336237712746453,1.5585013741037435,1.0051835139449405,0.10159942774748831,1,0,48948.608762379074,1.5707758972050603,12.42728054155279,1.4902411047601678,1.0445001353625698,0.29295134702941333,1.7133809972185559,1.0139366631851772,-6.983067711322219,-162.96780386942683,17.032196130573169,null,67608,4570841664,null,25.42176938619572,-21.399179522964268,null,19.990938068249939,-141.56862434646251,null,0,0]
[68001.75,68.001750000000001,81.809869776956035,1.5585725583598693,1.0052439095451466,0.10218704548099744,1,0,49233.686189490749,1.5707760154983543,12.499189909202668,1.4907055451712263,1.0450087859503441,0.29456076357221161,1.7199977606409369,1.017084203474879,-7.0710105369344047,-163.18416426316637,16.815835736833634,null,68001.75,4624238003.0625,null,25.417215834074792,-21.464788600737631,null,19.907548794758682,-141.71937566242877,null,0,0]
[68395.5,68.395499999999998,82.283502250940103,1.5586429231282513,1.0053046522088713,0.10277459240711488,1,0,49518.763616603108,1.5707761324296292,12.571101942143716,1.4911646720882541,1.0455201407046224,0.29616860997319944,1.7266280815589665,1.020210751085683,-7.158613801590624,-163.39949336902444,16.600506630975559,null,68395.5,4677944420.25,null,25.41264744283021,-21.530612078756747,null,19.824513921347041,-141.86888129026764,null,0,0]
[68789.25,68.789249999999996,82.757135127663048,1.5587124824783813,1.0053657418732074,0.103362068133056,1,0,49803.841043716122,1.5707762480222736,12.643016594896322,1.4916185759869576,1.0460341956596018,0.29777488022807652,1.7332718166917578,1.0233165043371513,-7.2458803921089192,-163.61379785194504,16.386202148054963,null,68789.25,4731960915.5625,null,25.408064149872452,-21.596644430464472,null,19.741830623786505,-142.0171534214806,null,0,0]
[69183,69.183000000000007,83.230768400249374,1.5587812501595275,1.0054271784749036,0.10394947226632795,1,0,50088.918470829805,1.570776362299144,12.714933823008149,1.4920673453047972,1.0465509468363507,0.29937956837684127,1.7399288247051248,1.0264016597636867,-7.3328131542388011,-163.82708437551676,16.172915624483238,null,69183,4786287489,null,25.403465896334623,-21.662880248594234,null,19.659496115194454,-142.16420412692253,null,0,0]
[69586,69.585999999999999,83.71552869865728,1.5588508275735089,1.0054904175412815,0.10455060119027397,1,0,50380.692954962055,1.5707764779214213,12.788543156686112,1.4925214304251666,1.0470826253738901,0.30102030949493769,1.746755818343831,1.0295381657573297,-7.421445390137233,-164.0443342785756,15.955665721424396,null,69586,4842211396,null,25.398744070785785,-21.730877253744094,null,19.575585704844862,-142.31345702483151,null,0,0]
[69989,69.989000000000004,84.200289397667007,1.5589196038410289,1.0055540199018604,0.10515165428730448,1,0,50672.46743909498,1.5707765922121812,12.86215509709386,1.4929703180499392,1.0476171198251989,0.30265938080886995,1.75359642235285,1.032653505662773,-7.5097338331600536,-164.26053194190203,15.73946805809797,null,69989,4898460121,null,25.39400646013252,-21.799076304434365,null,19.492034872475305,-142.46145563746765,null,0,0]
[70392,70.391999999999996,84.685050490399092,1.5589875927193955,1.0056179854877088,0.10575263113756973,1,0,50964.241923228561,1.5707767051942934,12.935769599730031,1.493414096729923,1.0481544258824471,0.30429677607298045,1.7604504913652967,1.0357478844051136,-7.5976814068368022,-164.47568448900338,15.524315510996615,null,70392,4955033664,null,25.389253012589819,-21.867471970537981,null,19.408840746341259,-142.60821251846542,null,0,0]
[70795,70.795000000000002,85.169811970130652,1.5590548076527357,1.0056823142295186,0.10635353132154668,1,0,51256.016407362789,1.5707768168901057,13.009386621098994,1.4938528530197284,1.0486945392239961,0.30593248909032678,1.7673178820358131,1.038821504967115,-7.6852909936511526,-164.68979903127203,15.310200968727969,null,70795,5011932025,null,25.384483679943671,-21.936058939062878,null,19.326000492173055,-142.75374009220917,null,0,0]
[71207.25,71.207250000000002,85.665700502712269,1.5591227782632375,1.0057484951816873,0.10696814411637086,1,0,51554.487948515634,1.5707769298415011,13.084695924972126,1.4942965715962035,1.0492499498644652,0.30760399937076077,1.7743565353781614,1.0419444051554552,-7.7745647211929771,-164.90776149648437,15.092238503515631,null,71207.25,5070472452.5625,null,25.379588394655038,-22.006412693539524,null,19.241622049919862,-142.90134880294485,null,0,0]
[71619.5,71.619500000000002,86.161589426514112,1.5591899664866022,1.0058150560041512,0.10758267579806904,1,0,51852.95948966912,1.5707770414925744,13.160007775555682,1.4947352116491934,1.049808288946583,0.30927373633137833,1.7814088318467587,1.0450460068027461,-7.8634907426482146,-165.12465276486017,14.875347235139827,null,71619.5,5129352780.25,null,25.374676395551997,-22.076955747734079,null,19.157608027567669,-143.0476970171261,null,0,0]
[72031.75,72.031750000000002,86.657478734820018,1.5592563857536292,1.0058819966215005,0.10819712591863488,1,0,52151.431030823253,1.5707771518656513,13.235322129375662,1.4951688597050259,1.0503695518003833,0.31094169349700379,1.7884746243800285,1.0481265209243722,-7.9520720162297565,-165.34048039457281,14.659519605427192,null,72031.75,5188573008.0625,null,25.369747641870056,-22.147682774332068,null,19.073955507668067,-143.19279762024078,null,0,0]
[72444,72.444000000000003,87.153368421066673,1.5593220491894684,1.0059493169579152,0.10881149403042731,1,0,52449.902571978018,1.5707772609825494,13.310638943940575,1.4955976003392373,1.0509337337414479,0.31260786444586997,1.7955537680070914,1.0511861564389466,-8.0403114591326741,-165.55525192092949,14.444748079070507,null,72444,5248133136,null,25.364802096262334,-22.218588560822088,null,18.990661610372868,-143.33666336010739,null,0,0]
[72865.75,72.865750000000006,87.660685907180365,1.5593884570081633,1.0060185815082057,0.10943993447470575,1,0,52755.252171692475,1.5707773713362665,13.387693882609184,1.4960312288367812,1.0515139327079563,0.31431057601210755,1.8028097124520917,1.0542949088360056,-8.1302335781553694,-165.7738876421773,14.2261123578227,null,72865.75,5309417523.0625,null,25.359725171869915,-22.291307987395083,null,18.905816415742592,-143.48257965478223,null,0,0]
[73287.5,73.287499999999994,88.168003775428758,1.5594541006072111,1.0060882433180529,0.11006828814035861,1,0,53060.601771407564,1.5707774804198711,13.464751309802777,1.4964598941889804,1.0520971768841663,0.31601140466291622,1.8100793300281708,1.0573822449506982,-8.2198039796943121,-165.99143389772198,14.008566102278024,null,73287.5,5371057656.25,null,25.35463060411282,-22.3642038253703,null,18.821340581960747,-143.62723007235169,null,0,0]
[73709.25,73.709249999999997,88.675322019253173,1.5595189931025166,1.0061583023049439,0.11069655454927846,1,0,53365.951371123279,1.5707775882551656,13.541811183039737,1.4968836809654888,1.0526834612084401,0.31771034369583906,1.8173624721062631,1.0604483817300401,-8.3090256598768235,-166.20789866833397,13.792101331666032,null,73709.25,5433053535.5625,null,25.349518363384654,-22.437270846490179,null,18.737231142506403,-143.77062782184382,null,0,0]
[74131,74.131,{"$f":"SQRT(1+(A525/pole1)^2)","v":89.182640632244173},{"$f":"ATAN(A525/pole1)","v":1.5595831473115693},{"$f":"SQRT(1+(A525/Zero1)^2)","v":1.0062287583859175},{"$f":"ATAN(A525/Zero1)","v":0.1113247332237662},{"$f":"IF(VIN_nom>Vout, 1, SQRT(1+(A525/z_RHP)^2))","v":1},{"$f":"IF(VIN_nom>Vout, 0, -ATAN(A525/z_RHP))","v":0},{"$f":"SQRT(1+(A525/Pole2)^2)","v":53671.300970839606},{"$f":"ATAN(A525/Pole2)","v":1.5707776948634553},13.618873460798616,1.4973026718289144,{"$f":"SQRT(1+(A525/pole4)^2)","v":1.0532727806040554},{"$f":"ATAN(A525/pole4)","v":0.31940738646693662},{"$f":"SQRT((1-(V525/pterm2))^2+(A525/pterm1)^2)","v":1.8246589922161933},{"$f":"IF((ATAN((A525/pterm1)/(1-A525^2/pterm2))>0),ATAN((A525/pterm1)/(1-A525^2/pterm2)),PI()+ATAN((A525/pterm1)/(1-A525^2/pterm2)))","v":1.0634935338686156},{"$f":"20*LOG10(((E525*K525*G525)/(C525*I525*O525*M525))*Adc)","v":-8.3979015737437823},{"$f":"((F525+L525+H525)-(D525+J525+P525+N525))*radconv","v":-166.42328990119748},{"$f":"IF(R525>0,R525,R525+180)","v":13.576710098802522},null,74131,5495405161,null,{"$f":"20*LOG10((K525/(I525*M525))*AEA)","v":25.344388423350104},{"$f":"(L525-(J525+N525))*radconv","v":-22.510503935087179},null,{"$f":"20*LOG10((E525*G525/(C525*O525))*Acs*Am)","v":18.653485168673999},{"$f":"(F525+H525-(D525+P525))*radconv","v":-143.91278596611031},null,0,0]
[74562.75,{"$f":"A526/1000","v":74.562749999999994},89.701988515298495,1.5596480709893479,1.0063012962736486,0.11196771509486579,1,0,53983.890632197734,1.5707778027502539,13.697765389697077,1.4977267137941481,1.0538792117464313,0.32114269624692149,1.8321422250481154,1.0665893736996606,-8.4885296822175054,-166.6426844560801,13.357315543919896,null,{"$f":"IF(Q526<0,A526,1000000000)","v":74562.75},{"$f":"A526^2","v":5559603687.5625},null,25.339118490746223,-22.585640228227838,null,18.568126992804149,-144.05704422785226,null,{"$f":"SUM((Q527<0)*(Q526>0))*A526","v":0},0]
[74994.5,74.994500000000002,90.221336772101253,1.559712247216734,1.0063742501321102,0.11261060400992237,1,0,54296.480293556473,1.5707779093948249,13.77665975340334,1.4981458991384926,1.05448881277956,0.32287600487277757,1.8396391739955114,1.0696636701213673,-8.5788015722530133,-166.86097069978564,13.139029300214361,null,74994.5,5624175030.25,null,25.333829963745078,-22.660940056388206,null,18.483143629769785,-144.20003064339744,null,0,0]
[75426.25,75.426249999999996,90.740685396235051,1.5597756888271508,1.0064476198708452,0.11325339945778826,1,0,54609.069954915823,1.5707780148185,13.855556510325583,1.4985603106775411,1.0551015782090833,0.32460730540718957,1.8471496887415744,1.0727166462150377,-8.6687202860589156,-167.07815703727812,12.921842962721882,null,75426.25,5689119189.0625,null,25.328522824051049,-22.736398278327624,null,18.398532055657917,-144.3417587589505,null,0,0]
[75858,75.858000000000004,91.260034381428611,1.5598384083619117,1.0065214053989076,0.11389610092777334,1,0,54921.659616275778,1.5707781190421257,13.934455619812708,1.498970029357872,1.0557175025249117,0.32633659097705919,1.8546736212004198,1.0757485226477175,-8.7582888245010757,-167.29425182917021,12.705748170829793,null,75858,5754436164,null,25.323197056506032,-22.812009863543675,null,18.314289284760772,-144.4822419656266,null,0,0]
[76299.75,76.299750000000003,91.791412662366014,1.5599018460053822,1.006597330165276,0.11455359056089609,1,0,55241.48933927757,1.5707782244589166,14.015184548602438,1.4993844631222089,1.0563509563210607,0.32810383687339184,1.8623855549356481,1.0788290113122285,-8.849572561554675,-167.51423062249219,12.485769377507808,null,76299.75,5821651850.0625,null,25.317728643269035,-22.889526329206916,null,18.228473960944171,-144.6247042932853,null,0,0]
[76741.5,76.741500000000002,92.322791308450533,1.5599645533980211,1.0066736900104911,0.11521098073222819,1,0,55561.319062279967,1.5707783286620782,14.095915857002362,1.4997941497967975,1.0569877053078358,0.32986895903358537,1.8701112284953061,1.0818878712918811,-8.9404959411446754,-167.73308427945844,12.266915720541562,null,76741.5,5889257822.25,null,25.312240706795993,-22.967193032424454,null,18.143038517827211,-144.76589124703398,null,0,0]
[77183.25,77.183250000000001,92.854170313413206,1.5600265430764082,1.0067504848355533,0.11586827089626855,1,0,55881.14878528296,1.5707784316724485,14.176649504359213,1.5001991703445694,1.057627743533589,0.3316319503043873,1.8778504902925839,1.0849253312059752,-9.0310620487852624,-167.95082160104639,12.049178398953615,null,77183.25,5957254080.5625,null,25.306733240381387,-23.045004925704774,null,18.05797987660123,-144.90581667534161,null,0,0]
[77625,77.625,93.385549671127848,1.5600878272918042,1.0068277145409299,0.11652546050802771,1,0,56200.978508286542,1.5707785335103917,14.257385450939363,1.5005996039007696,1.0582710650303635,0.33339280360278994,1.8856031910368547,1.0879416171031722,-9.1212739284004982,-168.16745133328627,11.832548666713734,null,77625,6025640625,null,25.301206240320738,-23.122957070272669,null,17.973294997046644,-145.04449426301358,null,0,0]
[78077,78.076999999999998,93.929259072875666,1.5601498157770668,1.0069071862491319,0.11719779435457926,1,0,56528.229294473029,1.5707786365185068,14.339997066708031,1.5010046615898966,1.0589327058110654,0.33519229400421285,1.8935495359610233,1.0910062068301702,-9.2132154896578538,-168.38797018874692,11.61202981125308,null,78077,6096017929,null,25.295530776752948,-23.202858081523758,null,17.88702889935708,-145.18511210722318,null,0,0]
[78529,78.528999999999996,94.472968831399015,1.5602110907517082,1.006987113040448,0.11787002177571473,1,0,56855.480080660112,1.5707787383408263,{"$f":"SQRT(1+(A535/Zero2)^2)","v":14.422611008311444},{"$f":"ATAN(A535/Zero2)","v":1.5014050789343587},1.0595977713025511,0.33698953128861431,1.9015096417009809,1.0940490991896055,-9.3047925117026509,-168.60734780332598,11.392652196674021,null,78529,6166803841,null,25.289834863883677,-23.282895802902615,null,17.801147790181552,-145.32445200042332,null,0,0]
[78981,78.980999999999995,95.016678940573229,1.5602716644639436,1.0070674948065239,0.11854214218930118,1,0,57182.730866847778,1.5707788389977086,14.505227236009503,1.5018009350935311,1.0602662550602404,0.33878450809646526,1.909483355560186,1.0970705281095021,-9.3960081256577297,-168.82559335923503,11.174406640764971,null,78981,6237998361,null,25.284118506858331,-23.36306527840766,null,17.715648533251819,-145.46252808082741,null,0,0]
[79433,79.433000000000007,95.560389394412979,1.5603315488832536,1.0071483314384233,0.11921415501377758,1,0,57509.981653036019,1.5707789385090494,14.587845710961275,1.5021923074393009,1.0609381506227138,0.34057721714500239,1.9174705272016273,1.1000707247916202,-9.4868654207226815,-169.04271597326672,10.957284026733277,null,79433,6309601489,null,25.278381713690997,-23.443361658824589,null,17.630528031354196,-145.59935431444214,null,0,0]
[79895.5,79.895499999999998,96.116730640878529,1.560392123127103,1.0072315166366053,0.11990166678249971,1,0,57844.834503948237,1.5707790391665608,14.672385706964084,1.5025882090233411,1.0616291792312118,0.34240921607540886,1.9256570175128875,1.1031188768398457,-9.5794656169052601,-169.26372943117047,10.736270568829525,null,79895.5,6383290920.25,null,25.272490511822255,-23.525649743085925,null,17.543819037040365,-145.73807968808455,null,0,{"$f":"IF(AD538>0,S538,0)","v":0}]
[80358,80.358000000000004,96.673072235960106,1.5604520001765805,1.0073151778465947,0.12058906467535678,1,0,58179.687354861031,1.5707791386654049,14.75692797633857,1.5029795744369645,1.0623237662584539,0.3442388254808158,1.9338572870583763,1.1061452798613773,-9.671697066433806,-169.48358626728211,10.516413732717893,null,80358,6457408164,null,25.266577939078346,-23.608060754683166,null,17.457500160255726,-145.87552551259887,null,0,0]
[80820.5,80.820499999999996,97.229414173673462,1.5605111919991894,1.0073993149497977,0.12127634807118834,1,0,58514.5402057744,1.570779237025473,14.841472480234954,1.5033664810801814,1.0630219047291423,0.34606603780814144,1.9420711822015657,1.1091501728424149,-9.7635629480270243,-169.70229602946543,10.29770397053457,null,80820.5,6531953220.25,null,25.260644012753186,-23.690589827302382,null,17.371568204987671,-146.01170620216305,null,0,0]
[81283,81.283000000000001,97.785756448170474,1.5605697102901002,1.0074839278269858,0.12196351634947347,1,0,58849.393056688335,1.5707793342662042,14.926019180682651,1.5037490046047191,1.0637235876506725,0.34789084558810662,1.9502985517265969,1.1121337918887144,-9.8550663980657784,-169.91986818985202,10.080131810147975,null,81283,6606926089,null,25.254688752880206,-23.77323219957448,null,17.286020014821894,-146.1466359902775,null,0,0]
[81756.25,81.756249999999994,98.355030264135053,1.5606289034619116,1.0075709997471196,0.1226665368383746,1,0,59192.028973867309,1.5707794326282769,15.012533255668622,1.5041359592308783,1.0644452416318892,0.34975557108427258,1.9587309445626073,1.1151649818262135,-9.9483247476695418,-170.1413296620922,9.858670337907796,null,81756.25,6684084414.0625,null,25.248573014025851,-23.857907869341624,null,17.198877404072487,-146.28342179275057,null,0,0]
[82229.5,82.229500000000002,98.924304420752733,1.5606874153626622,1.0076585695607307,0.12336943548368608,1,0,59534.664891046865,1.5707795298581559,15.099049552779567,1.5045184794781716,1.0651705918805958,0.35161776340047435,1.9671771326910872,1.118174388434392,-10.041210133690308,-170.36161985446739,9.6383801455326079,null,82229.5,6761690670.25,null,25.242434989201765,-23.942692404912066,null,17.112130042875805,-146.4189274495553,null,0,0]
[82702.75,82.702749999999995,99.493578912176204,1.5607452576860763,1.0077466371380239,0.12407221162270488,1,0,59877.300808226973,1.570779625975278,15.185568034035342,1.5048966410271776,1.0658996308508042,0.353477414806187,1.9756369617139324,1.1211622554871057,-10.133725784112823,-170.58074866417118,9.4192513358288181,null,82702.75,6839744857.5625,null,25.236274708182247,-24.027581028295227,null,17.02577467347281,-146.55316763587595,null,0,0]
[83176,83.176000000000002,100.06285373269115,1.5608024418597859,1.0078352023485109,0.12477486459344306,1,0,60219.936725407628,1.5707797209986367,15.272088662315502,1.5052705178485202,1.0666323509788351,0.35533451766226432,1.9841102797123464,1.1241288237257236,-10.225874884092418,-170.79872590254516,9.2012740974548421,null,83176,6918246976,null,25.230092203354339,-24.112569064683967,null,16.939808078321118,-146.6861568378612,null,0,0]
[83660.5,83.660499999999999,100.64566157024009,1.5608603152605514,1.0079263882939267,0.1254940925981754,1,0,60570.717711935438,1.5707798171671785,15.360668227178911,1.505648919160558,1.0673862947201203,0.35723311915326345,1.992798841359869,1.1271440965239363,-10.319838090524019,-171.02070204496925,8.979297955030745,null,83660.5,6999079260.25,null,25.223739743244145,-24.199675629104586,null,16.852197331999715,-146.82102641586462,null,0,0]
[84145,84.144999999999996,101.22846974100307,1.5609175222661549,1.0080180955340103,0.12621319010731033,1,0,60921.498698463809,1.5707799122282591,15.449249966277097,1.5060229812280919,1.0681440806158782,0.35912903357644432,2.0015012264595287,1.130137546895372,-10.41342373445514,-171.24149174895382,8.7585082510461802,null,84145,7080381025,null,25.217364066870736,-24.286876792823559,null,16.764987364442003,-146.95461495613026,null,0,0]
[84629.5,84.629499999999993,101.8112782392577,1.5609740743203568,1.0081103239264964,0.12693215641287078,1,0,61272.279684992733,1.570780006200899,15.537833842423893,1.5063927781618853,1.0689057004945826,0.36102225303152341,2.0102172797996953,1.133109423494788,-10.506635099535993,-171.46110525981334,8.5388947401866631,null,84629.5,7162152270.25,null,25.210965216920471,-24.374167858043808,null,16.678174849311418,-147.08693740176952,null,0,0]
[85114,85.114000000000004,102.39408705941197,1.5610299826063909,1.0082030733283627,0.12765099080768044,1,0,61623.060671522173,1.5707800991036858,15.626419819275458,1.5067583823968973,1.069671146166695,0.36291276971793657,2.0189468487091085,1.1360599717887028,-10.59947542593479,-171.67955272692171,8.3204472730782868,null,85114,7244392996,null,25.204543238572246,-24.461544228673475,null,16.591756501260846,-147.21800849824828,null,0,0]
[85609.5,85.609499999999997,102.99012819241318,1.5610865057551366,1.0082984672329771,0.12838600831482869,1,0,61981.805725857797,1.5707801930280867,15.717019171825207,1.5071280244598988,1.0704579188947774,0.3648434048168423,2.0278884350114201,1.1390557011492368,-10.694043143960787,-171.90176420721619,8.0982357927838109,null,85609.5,7328986490.25,null,25.197951584384299,-24.550987923054066,null,16.503780437422794,-147.35077628416209,null,0,0]
[86105,86.105000000000004,103.58616965066744,1.5611423784284189,1.0083944057683452,0.12912088635995933,1,0,62340.550780193953,1.5707802858714923,15.807620647257476,1.5074934293608144,1.0712486757267055,0.36677119684318904,2.0368438425125017,1.1420296319987315,-10.788229503302757,-172.12277725942297,7.8772227405770252,null,86105,7414071025,null,25.19133584286012,-24.640511430944439,null,16.416209819605001,-147.48226582847855,null,0,0]
[86600.5,86.600499999999997,104.1822114285923,1.5611976117902839,1.0084908887790336,0.12985562418925198,1,0,62699.29583453064,1.5707803776524585,15.898224209278343,1.5078546694436485,1.0720434078462577,0.3686961377753411,2.0458129158619394,1.1449820167957936,-10.882037834129525,-172.34260242764947,7.6573975723505328,null,86600.5,7499646600.25,null,25.184696069859875,-24.73011014879576,null,16.329041261778482,-147.61249227885369,null,0,0]
[87096,87.096000000000004,104.77825352073233,1.5612522167507621,1.0085879161087863,0.13059022104977952,1,0,63058.04088886785,1.5707804683891176,15.988829822415727,1.5082118154169717,1.0728421064190814,0.37061821969988723,2.0547955022972411,1.1479131046717053,-10.975471422587642,-172.56125015063603,7.4387498493639725,null,87096,7585713216,null,25.178032323606438,-24.819779572939208,null,16.242271419573797,-147.74147057769687,null,0,0]
[87603.25,87.603250000000003,105.38843012972423,1.5613074767825585,1.0086878079580446,0.13134209090694887,1,0,63425.293015634379,1.5707805602142078,16.081586093039302,1.5085732618077659,1.073663844280961,0.37258291110666641,2.0640049373110911,1.1508918948754381,-11.070735849187855,-172.78387388878949,7.2161261112105137,null,87603.25,7674329410.5625,null,25.17118578758868,-24.911644007175617,null,16.153853528991341,-147.87222988161389,null,0,0]
[88110.5,88.110500000000002,105.9986070568326,1.5613621006100014,1.0087882699137589,0.13209381143643514,1,0,63792.545142401432,1.5707806509820283,16.174344440520294,1.5089305625225315,1.0744897201502273,0.37454458986787625,2.0732282180198291,1.1538488839930121,-11.16561438143129,-173.00528547802375,6.994714521976249,null,88110.5,7763460210.25,null,25.164314258569654,-25.003573298698402,null,16.065846525766933,-148.00171217932535,null,0,0]
[88617.75,88.617750000000001,106.60878429659525,1.5614160991567423,1.0088893018056206,0.13284538183340436,1,0,64159.797269169001,1.5707807407107348,16.267104829330702,1.5092837883892805,1.0753197244925612,0.37650324784454614,2.0824651886617236,1.1567843287317274,-11.260110406836619,-173.22549577514189,6.7745042248581058,null,88617.75,7853105615.0625,null,25.157417806169974,-25.09556292407294,null,15.978246952761285,-148.12993285106893,null,0,0]
[89125,89.125,107.21896184367426,1.5614694830977833,1.0089909034624245,0.13359680129402246,1,0,64527.049395937094,1.5707808294180694,16.359867224747539,1.509633008633732,1.07615384775547,0.37845887701546166,2.0917156961176944,1.1596984823232299,-11.354227268120384,-173.44451552203057,6.5554844779694292,null,89125,7943265625,null,25.150496502252537,-25.187608458392546,null,15.89105139539496,-148.25690706363801,null,0,0]
[89644,89.644000000000005,107.84327392946767,1.5615234783857252,1.0090954481676739,0.13436546966673196,1,0,64902.808595134527,1.5707809191411806,16.454780420918077,1.5099862429502815,1.0770115459104248,0.38045666351492985,2.1011943372565853,1.1626583635967456,-11.450135263699979,-173.66738751565453,6.332612484345475,null,89644,8036046736,null,25.143389227958416,-25.281839498526068,null,15.802250674109485,-148.38554801712849,null,0,0]
[90163,90.162999999999997,108.46758632605777,1.5615768521069777,1.0092005889743125,0.13513397833020757,1,0,65278.567794332477,1.5707810078313558,16.549695646675527,1.5103354255962109,1.0778735357300486,0.38245126265162799,2.1106868335716689,1.1655964813075363,-11.545653265458714,-173.88903554851206,6.1109644514879449,null,90163,8129366569,null,25.136256096529873,-25.376120000668806,null,15.71386580377929,-148.51291554784328,null,0,0]
[90682,90.682000000000002,109.09189902810868,1.561629614932567,1.0093063256960502,0.13590232642673214,1,0,65654.326993530936,1.5707810955063306,16.644612867298978,1.510680625800549,1.0787398069263061,0.38444266621468681,2.1201930293328259,1.1685130956903922,-11.640784713576791,-174.10947075554341,5.8905292444565873,null,90682,8223225124,null,25.129097191708219,-25.470445528857578,null,15.625893260482869,-148.63902522668585,null,0,0]
[91201,91.200999999999993,109.71621203040598,1.5616817772906493,1.0094126581456191,0.13667051309970524,1,0,66030.086192729897,1.570781182183437,16.739532048854311,1.5110219112259557,1.0796103491931641,0.38643086612090549,2.1297127714985442,1.1714084633677138,-11.735533002686244,-174.32870414777292,5.6712958522270753,null,91201,8317622401,null,25.121912599350754,-25.56481174416728,null,15.538329563730882,-148.76389240360564,null,0,0]
[91732,91.731999999999999,110.35496032084062,1.5617345348896137,1.0095220655007555,0.13745629335685164,1,0,66414.53346589928,1.5707812698495587,16.836647888443405,1.5113671050162798,1.0805054291799907,0.38846171204783864,2.1394664863093147,1.1743490505982019,-11.832078946958378,-174.55177405707727,5.4482259429227327,null,91732,8414759824,null,25.114535395631027,-25.661397520331334,null,15.449160823178476,-148.89037653674592,null,0,0]
[92263,92.263000000000005,110.99370891489806,1.5617866852679616,1.0096320960505925,0.13824190282900659,1,0,66798.980739069171,1.5707813565065931,16.933765711254662,1.5117083393649833,1.0814049581455805,0.39048918774861174,2.149234065488411,1.1772679293540786,-11.928230855648248,-174.77360885822861,5.2263911417713871,null,92263,8512461169,null,25.107131491051177,-25.758016998238094,null,15.360412819068458,-149.01559185999051,null,0,0]
[92794,92.793999999999997,111.63245780736636,1.5618382388487595,1.0097427495914035,0.13902734060243166,1,0,67183.428012239558,1.5707814421718636,17.030885483360382,1.5120456819288592,1.0823089249970232,0.39251328497872945,2.1590153535458283,1.1801653630519819,-12.02399222170197,-174.99421994560873,5.0057800543912663,null,92794,8610726436,null,25.099700983935286,-25.854665830056629,null,15.27208196013062,-149.13955411555207,null,0,0]
[93325,93.325000000000003,112.27120699315228,1.5618892058178855,1.0098540259183983,0.13981260576463511,1,0,67567.875285410439,1.5707815268622982,17.128007171601713,1.5123791988337409,1.0832173186238012,0.39453399563188041,2.1688101977224319,1.1830416113648667,-12.119366491721713,-175.21361858105308,4.7863814189469167,null,93325,8709555625,null,25.092243974595196,-25.951339763568249,null,15.184164699450971,-149.26227881748483,null,0,0]
[93868.5,93.868499999999997,112.92499294609135,1.561940775475726,1.0099685664795397,0.14061617674811325,1,0,67961.37263563383,1.5707816125541263,17.227417102441802,1.512716672538567,1.084151668981794,0.39659875938932471,2.178849499254341,1.1859638957948597,-12.21658859632255,-175.4369379833264,4.563062016673598,null,93868.5,8811295292.25,null,25.084584084926789,-26.050311103471394,null,15.094602484518539,-149.38662687985504,null,0,0]
[94412,94.412000000000006,113.57877919588908,1.5619917514394657,1.01008375905582,0.14141956496761637,1,0,68354.869985857746,1.5707816972593531,17.32682897277309,1.5130502738018488,1.0850906333773849,0.39865995850638503,2.1889026873554722,1.1888645243753031,-12.313412326968558,-175.65901063143477,4.3409893685652321,null,94412,8913625744,null,25.076896649303926,-26.149300022553874,null,15.005466189495394,-149.50971060888097,null,0,0]
[94955.5,94.955500000000001,114.2325657374485,1.5620421439024952,1.010199603424192,0.14222276944877821,1,0,68748.367336082141,1.5707817809949194,17.426242749402817,1.5133800688235686,1.0860341998429475,0.40071758473740698,2.1989696067754569,1.1917437637151838,-12.409841234040913,-175.87984817636317,4.1201518236368315,null,94955.5,9016546980.25,null,25.069181781270188,-26.248302256365537,null,14.916752150456778,-149.63154591999762,null,0,0]
[95499,95.498999999999995,114.88635256578857,1.5620919628261853,1.0103160993604496,0.1430257892186263,1,0,69141.864686307003,1.5707818637773807,17.525658399890709,1.5137061223049666,1.0869823563938563,0.40277162998631222,2.2090501050382492,1.1946018765474367,-12.505878820651482,-176.09946212806108,3.9005378719389228,null,95499,9120059001,null,25.061439596229182,-26.347313634875842,null,14.828456748887218,-149.75214849318519,null,0,0]
[96611.5,96.611500000000007,116.22460154741364,1.5621921902754339,1.0105565879010332,0.14466892485036534,1,0,69947.321543944461,1.5707820303218085,17.729159807437931,1.5143621239692768,1.0889374184238216,0.40696489224526039,2.2297257768047434,1.2003874037019002,-12.701254095900385,-176.54522593515009,3.4547740648499143,null,96611.5,9333781932.25,null,25.045507286968522,-26.549993280510947,null,14.649013782898969,-149.99523265463912,null,0,0]
[97724,97.724000000000004,117.56285166999695,1.5622901358926649,1.0107998035354258,0.14631127418171419,1,0,70752.778401583812,1.5707821930743189,17.93266867135651,1.5150032366364514,1.0909115589036322,0.41114305128845607,2.2504564678884913,1.2060876658516662,-12.89503327571609,-176.98600623859025,3.0139937614097505,null,97724,9549980176,null,25.029462042790279,-26.752660435062516,null,14.471279847261512,-150.2333458035277,null,0,0]
[98862,98.861999999999995,118.93177743010463,1.5623880459728714,1.0110514135213529,0.14799044619086754,1,0,71576.697416411393,1.5707823557675074,18.140849685905028,1.515644161515469,1.092950580976241,0.41540128658023734,2.2717180039951352,1.2118325637509499,-13.091632226629137,-177.43183094910194,2.5681690508980637,null,98862,9773695044,null,25.012933272139012,-26.959926376772508,null,14.291209666999729,-150.47190457232946,null,0,0]
[100000,100,120.30070430439055,1.562483727775418,1.0113058728634687,0.14966877792185065,1,0,72400.616431240836,1.5707825147577992,18.349037983340708,1.5162705427717384,1.0950093470338078,0.41964358643643718,2.2930346073192354,1.2174926371174644,-13.286620134166839,-177.87263608820683,2.127363911793168,null,100000,10000000000,null,24.996288589942036,-27.167112361320815,null,14.112866441659001,-150.70552372688601,null,0,0]
[101165,101.16500000000001,121.70211122643613,1.5625794500057004,1.0115693187839379,0.15138604984943016,1,0,73244.083612504808,1.5707826738150148,18.562173010207879,1.5168972305503843,1.0971372951884146,0.4239699660614113,2.3149127576279693,1.2232013494029108,-13.484595401270225,-178.31879909680208,1.6812009031979187,null,101165,10234357225,null,24.979130163381736,-27.379098203163775,null,13.932049601115917,-150.93970089363833,null,0,0]
[102330,102.33,123.10351923821804,1.5626729928368968,1.011835746286929,0.15310242248317435,1,0,74087.550793770584,1.5707828292505817,18.775315161624402,1.5175096899270333,1.0992856993488651,0.42827951544989989,2.3368461275887928,1.2288255975907336,-13.680942275302506,-178.75990004280877,1.2400999571912337,null,102330,10471428900,null,24.961852791388441,-27.590934763366182,null,13.752980099076931,-151.16896527944257,null,0,0]
[103520,103.52,124.53500147011144,1.5627663694738356,1.0121109669125452,0.15485468892721763,1,0,74949.118129142589,1.5707829844097561,18.993038285066916,1.5181211001507282,1.1015012013089696,0.43266410504258784,2.3593059424053053,1.2344855611480576,-13.879851717837536,-179.20534082588091,0.79465917411909004,null,103520,10716390400,null,24.944083227473143,-27.80713090676819,null,13.571840220457203,-151.3982099191127,null,0,0]
[104710,104.71,125.96648476317088,1.562857623847113,1.0123892934666265,0.15660599727821675,1,0,75810.685464516355,1.5707831360422488,19.210768347597547,1.5187186514512876,1.1037377939688946,0.43703100861221805,2.3818209080670076,1.2400618412278863,-14.077122761462322,-179.64570071807145,0.35429928192854732,null,104710,10964184100,null,24.926192357041714,-28.023107571432678,null,13.392460047263848,-151.62259314663879,null,0,0]
[105930,105.93,127.43405693453619,1.5629490504276495,1.0126778583419453,0.15840045121772112,1,0,76693.972984817286,1.5707832879606687,19.433994362840938,1.5193173668616309,1.1060525323190435,0.44148958026464574,2.4049595015111955,1.2456940673602255,-14.277696933194271,-180.09198940164654,-9.1989401646543456E-2,null,105930,11221164900,null,24.90772603776454,-28.244269748168357,null,13.210352194809067,-151.84771965347818,null,0,0]
[107150,107.15,128.90163014684475,1.5630383951857434,1.0129696822417491,0.1601938770099284,1,0,77577.260505119935,1.5707834364196305,19.65722718617743,1.5199024841273798,1.1083891656448794,0.44592944133138884,2.4281536078700787,1.2512428244721217,-14.476610800641499,-180.53314217197564,-0.53314217197564062,null,107150,11481122500,null,24.889135316599727,-28.46513880539386,null,13.030029048526654,-152.06800336658176,null,0,0]
[108400,108.4,130.40529226793336,1.5631278512016495,1.0132720594141549,0.16203032592542044,1,0,78482.268210349808,1.5707835850632568,19.885956162753633,1.5204883641513456,1.1108058218715491,0.45045901396337457,2.4519744137310076,1.2568437165408233,-14.678725307610014,-180.97991978833437,-0.97991978833437088,null,108400,11750560000,null,24.869960087923761,-28.691104264440977,null,12.847089770234103,-152.28881552389339,null,0,0]
[109650,109.65,131.90895540878313,1.5632152677552893,1.013577851846126,0.16386567292884646,1,0,79387.275915581369,1.5707837303178354,20.114691810051081,1.5210609196154841,1.11324516931263,0.4549688283503957,2.4758510555748985,1.2623615099547094,-14.879159722501454,-181.42151366763028,-1.4215136676302791,null,109650,12023122500,null,24.850657674629982,-28.916700906304463,null,12.665957768636444,-152.50481276132581,null,0,0]
[110925,110.925,133.44269282725722,1.5633024030836051,1.0138932753222671,0.16573657989952631,1,0,80310.383774919232,1.5707838751049279,20.348008809172295,1.5216316648526582,1.1157565258402016,0.45954842888156422,2.5002615460007571,1.2679063123311594,-15.081903645980404,-181.86670364053498,-1.8667036405349791,null,110925,12304355625,null,24.830840002677171,-29.146399691280813,null,12.483031517110298,-152.72030394925414,null,0,0]
[112200,112.2,134.97643123587835,1.5633875581735084,1.0142122455071358,0.16760631660933492,1,0,81233.491634258753,1.5707840166014049,20.581332286375844,1.5221894695836702,1.1182911774535957,0.4641073649717633,2.52472773166375,1.2733691666396434,-15.282962859047194,-182.30670918930136,-2.3067091893013583,null,112200,12588840000,null,24.810893700738134,-29.375655738852593,null,12.301918605982555,-152.93105345044879,null,0,0]
[113510,113.51,136.55227326370408,1.5634730584630596,1.0145436623059059,0.16952614796225582,1,0,82181.939709346494,1.5707841586712972,20.821067240137051,1.5227495652788741,1.1209195047016833,0.46876987408272308,2.5499223508731359,1.2788989042663932,-15.487818824397833,-182.75349950402438,-2.7534995040243757,null,113510,12884520100,null,24.790267859060833,-29.610714853667073,null,12.117688482309212,-153.14278465035733,null,0,0]
[114820,114.82,138.1281162669909,1.5635566078827181,1.0148788160111675,0.17144471837199504,1,0,83130.387784435879,1.5707842974993926,21.060808576914567,1.5232969096766891,1.1235720852962792,0.47341046874918952,2.5751733772369496,1.2843466903710685,-15.690960963394105,-183.19502961711569,-3.1950296171156936,null,114820,13183632400,null,24.769510273343091,-29.845248773083522,null,11.935303929030681,-153.34978084403224,null,0,0]
[116155,116.155,139.73403357942857,1.5636398130209577,1.0152242065069867,0.17339859212939268,1,0,84096.936013631625,1.5707844357552532,21.30513147384411,1.5238420262865735,1.1263000622712345,0.47811703275694606,2.6009631479731312,1.2898164024235075,-15.89624917958108,-183.63968091067616,-3.6396809106761623,null,116155,13491984025,null,24.748223149441806,-30.083690067397058,null,11.751302836744998,-153.55599084327912,null,0,0]
[117490,117.49,141.33995183727498,1.5637211273900287,1.0155734701008798,0.1753511294319087,1,0,85063.484242828941,1.5707845708692028,21.549460558081702,1.5243747819217524,1.1290528678719747,0.4828007494350256,2.6268091633025739,1.2952055311542909,-16.099822467878475,-184.07908235623086,-4.079082356230856,null,117490,13803900100,null,24.726803543908133,-30.32153035780934,null,11.569149153981273,-153.75755199842155,null,0,0]
[118860,118.86,142.98797377048814,1.5638026746328386,1.0159359129706018,0.17735345322011012,1,0,86055.372687774579,1.5707847063699447,21.80020148831834,1.5249090891687163,1.1319034679773787,0.4875834666488591,2.6533901043735852,1.3006544434384317,-16.306982865984811,-184.5246533684832,-4.5246533684832002,null,118860,14127699600,null,24.704686946122138,-30.564954082451067,null,11.38410535366093,-153.95969928603213,null,0,0]
[120230,120.23,{"$f":"SQRT(1+(A589/pole1)^2)","v":144.6359966328958},{"$f":"ATAN(A589/pole1)","v":1.5638823635321373},{"$f":"SQRT(1+(A589/Zero1)^2)","v":1.0163024261179823},{"$f":"ATAN(A589/Zero1)","v":0.17935434081384358},{"$f":"IF(VIN_nom>Vout, 1, SQRT(1+(A589/z_RHP)^2))","v":1},{"$f":"IF(VIN_nom>Vout, 0, -ATAN(A589/z_RHP))","v":0},{"$f":"SQRT(1+(A589/Pole2)^2)","v":87047.261132721746},{"$f":"ATAN(A589/Pole2)","v":1.5707848387826719},22.050948500630582,1.5254312450714151,{"$f":"SQRT(1+(A589/pole4)^2)","v":1.1347798292519418},{"$f":"ATAN(A589/pole4)","v":0.4923420464544141},{"$f":"SQRT((1-(V589/pterm2))^2+(A589/pterm1)^2)","v":2.6800279650545584},{"$f":"IF((ATAN((A589/pterm1)/(1-A589^2/pterm2))>0),ATAN((A589/pterm1)/(1-A589^2/pterm2)),PI()+ATAN((A589/pterm1)/(1-A589^2/pterm2)))","v":1.3060230426680062},{"$f":"20*LOG10(((E589*K589*G589)/(C589*I589*O589*M589))*Adc)","v":-16.512403314349356},{"$f":"((F589+L589+H589)-(D589+J589+P589+N589))*radconv","v":-184.96491166649332},{"$f":"IF(R589>0,R589,R589+180)","v":-4.9649116664933217},null,120230,14455252900,null,{"$f":"20*LOG10((K589/(I589*M589))*AEA)","v":24.682435528853574},{"$f":"(L589-(J589+N589))*radconv","v":-30.807690879280837},null,{"$f":"20*LOG10((E589*G589/(C589*O589))*Acs*Am)","v":11.200936322564949},{"$f":"(F589+H589-(D589+P589))*radconv","v":-154.15722078721248},null,0,0]
[126030,{"$f":"A590/1000","v":126.03},151.61303732567987,1.5642005401237127,1.0178990775573544,0.18780900950953211,1,0,91246.496885068831,1.5707853674700549,23.112568017786256,1.5275163130493923,1.1472380243901428,0.5122198137766476,2.7934075146346236,1.3279106882286413,-17.363512431417153,-186.7722715951808,-6.772271595180797,null,{"$f":"IF(Q590<0,A590,1000000000)","v":126030},{"$f":"A590^2","v":15883560900},null,24.586793784497189,-31.827167750572574,null,10.44546894985354,-154.94510384460821,null,{"$f":"SUM((Q591<0)*(Q590>0))*A590","v":0},0]
[131830,131.83000000000001,158.59009201670139,1.5644907208513479,1.0195682589546016,0.19623659596803697,1,0,95445.732637439156,1.5707858496371192,24.174279191394973,1.5294182403268648,1.160139683942802,0.53166301141705474,2.9077138701173708,1.3485483306863095,-18.18625287600598,-188.49355078973949,-8.4935507897394871,null,131830,17379148900,null,24.488959100310876,-32.832236136952908,null,9.7205631894510205,-155.66131465278656,null,0,0]
[144540,144.54,173.87950602996224,1.5650451860454384,1.0234779323815228,0.21460478295400329,1,0,104647.85098451147,1.5707867709369348,26.501157772213347,1.5330531658194675,1.1898916110714914,0.5727520732478748,3.1611527437220728,1.3900209953060112,-19.899524623062042,-191.99512508959484,-11.995125089594836,null,144540,20891811600,null,24.267767015011582,-34.978252863483611,null,8.2284835276942516,-157.01687222611127,null,0,0]
[158490,158.49,190.66062137380973,1.5655513812066666,1.0281632673020897,0.23459666496358689,1,0,114747.73697528563,1.5707876120260795,29.055384247314798,1.5363724995698151,1.2247383029352918,0.61547212398900919,3.4435220834062261,1.4306523460804379,-21.655011303598229,-195.46422537574443,-15.464225375744434,null,158490,25119080100,null,24.016008272756881,-37.235795850282884,null,6.7247555894127684,-158.22842952546159,null,0,0]
[173780,173.78,209.05373282456858,1.5660128493601322,1.0337660922461456,0.25629109751863338,1,0,125817.79122618304,1.5707883787933441,31.855268871626716,1.5393991874502433,1.2653486225186308,0.65950433406589992,3.7575750682980193,1.470552376543055,-23.450045073331047,-198.88325677195601,-18.883256771956013,null,173780,30199488400,null,23.731804834406198,-39.585283144083022,null,5.2139252580306312,-159.29797362787301,null,0,0]
[190550,190.55,229.22725342958176,1.5664338299410454,1.0404642171144296,0.27980446111660484,1,0,137959.37460019422,1.570789078284218,34.926448295685312,1.5421608162494518,1.3125243687186752,0.70456925851442576,4.1071059091942628,1.5099354460646284,-25.285342769533891,-202.24048473594655,-22.240484735946552,null,190550,36309302500,null,23.413141034925435,-42.009123524927574,null,3.6972913613085541,-160.23136121101899,null,0,0]
[208930,208.93,251.33756706087624,1.5668176034783943,1.0484570493244094,0.30521451347556222,1,0,151266.60789866815,1.5707897159505477,38.29273011759021,1.5446787401398734,1.3670655464874624,0.75028610175545973,4.4960004639754443,1.5489742136229938,-27.158743033821043,-205.51849349868854,-25.518493498688542,null,208930,43651744900,null,23.058902894187135,-44.484275821661377,null,2.1781292377596979,-161.03421767702716,null,0,0]
[229090,229.09,275.58917607029178,1.5671677292980137,1.0579897551626036,0.33262419014745948,1,0,165862.57216952316,1.5707902977071591,41.985249711928489,1.546976185682418,1.4299073313893074,0.79631417600037802,4.9293748298248001,1.5879075578783568,-29.070401037231527,-208.70442554343421,-28.704425543434212,null,229090,52482228100,null,22.668033432784046,-46.989889616822666,null,0.6573406957523058,-161.7145359266116,null,0,0]
[251190,251.19,302.17455355062413,1.567486975251051,1.0693355542233822,0.36208541109788761,1,0,181863.10839903593,1.5707908281535898,46.033312861166749,1.5490712193552008,1.5019672367833949,0.84223955469146239,5.4126374972188129,1.6269250542573255,-31.017472573378559,-211.78157541909874,-31.781575419098743,null,251190,63096416100,null,22.240567634245217,-49.501213796184949,null,-0.86226504185589592,-162.28036162291374,null,0,0]
[275420,275.42,331.32226155731644,1.5677781127045705,1.0828174693131067,0.39364616467134628,1,0,199405.77775841038,1.5707913118950716,{"$f":"SQRT(1+(A599/Zero2)^2)","v":50.471721857515064},{"$f":"ATAN(A599/Zero2)","v":1.5509819554781088},1.5842609725318184,0.88768515893854927,5.9524915953488291,1.6662418354638218,-32.997969218592495,-214.73703594049994,-34.737035940499936,null,275420,75856176400,null,21.77689759195346,-51.995605720554572,null,-2.3790916447780797,-162.74143021994536,null,0,0]
[302000,302,363.29695118967078,1.5680437541143317,1.0988147980616452,0.42733984950344089,1,0,218649.86160377788,1.5707917532726787,55.34077603805693,1.5527254846499441,1.6779077165987588,0.93231039057439347,6.5571554338784743,1.7060811461310261,-35.010254632693226,-217.56134035678625,-37.561340356786246,null,302000,91204000000,null,21.277783736168118,-54.45257158195956,null,-3.8922632030934601,-163.10876877482667,null,0,0]
[331130,331.13,398.33921454288213,1.5682859009722185,1.1177355328829879,0.46311328683035285,1,0,239740.16116798544,1.5707921556122497,60.677112386046709,1.5543149018390261,1.7839493817288947,0.97574166535006857,7.2354642275714642,1.7465939001429827,-37.049335759097104,-220.24414209571864,-40.244142095718644,null,331130,109647076900,null,20.745256085171775,-56.849956483757552,null,-5.3988166785010048,-163.39418561196106,null,0,0]
[363080,363.08,436.77385116789947,1.5685068104445608,1.1400741668762198,0.50093083192957866,1,0,262872.15811537689,1.5707925226643749,66.530192279379492,1.5557649910423166,1.9036697293193592,1.0177272768328163,7.9992418066783335,1.7879826867483934,-39.113554650852564,-222.78395172247582,-42.78395172247582,null,363080,131827086400,null,20.180876077723834,-59.17249186392047,null,-6.8986555628085133,-163.61145985855535,null,0,{"$f":"IF(AD602>0,S602,0)","v":0}]
[398110,398.11,478.91363119767396,1.5687082661060292,1.1663631492190289,0.54066632837327666,1,0,288234.09404865402,1.5707928573926966,72.94764647044596,1.5570874359484552,2.0383088449538378,1.0580149498185674,8.8618502956565717,1.8303771412408034,-41.198796775715884,-225.18040365371542,-45.180403653715416,null,398110,158491572100,null,19.58714330453968,-61.405054161718127,null,-8.3901649144876789,-163.77534949199733,null,0,0]
[436520,436.52,525.11944341161961,1.5688919969953459,1.1972058381931028,0.58215766413371084,1,0,316043.17081708834,1.5707931626702063,79.984434595655117,1.5582935684933417,2.1892477402603232,1.0964265464068912,9.8398465560306079,1.873893865903661,-43.302028131779203,-227.43871045242904,-47.438710452429035,null,436520,190549710400,null,18.966507574459065,-63.536787719781579,null,-9.872760540470388,-163.90192273264751,null,0,0]
[478630,478.63,575.77623599477215,1.5690595401055147,1.233261212358862,0.62517925146448261,1,0,346531.07039323659,1.5707934410507731,87.699181273686463,1.5593934646850975,2.3579369222953908,1.1328289632318853,10.953104270353005,1.9186007298371508,-45.420053520552166,-229.56757059309831,-49.56757059309831,null,478630,229086676900,null,18.321647918866915,-65.559489110582462,null,-11.345926273651203,-164.00808148251582,null,0,0]
[524810,524.80999999999995,631.32910543926801,1.5692123662115183,1.2752669462324069,0.66947182079553103,1,0,379965.67505786743,1.5707936949782204,96.159672223399184,1.5603967694520187,2.546020528357972,1.1671548118333204,12.226352879435005,1.9645391808534218,-47.551057861226568,-231.57988463374062,-51.579884633740619,null,524810,275425536100,null,17.654958555306123,-67.468744786092472,null,-12.810241250764815,-164.11113984764813,null,0,0]
[575440,575.44000000000005,692.23517799981903,1.5693517305368745,1.324000772485709,0.71470507186202892,1,0,416622.1071533924,1.5707939265382063,105.43552604702799,1.5613117153870975,2.7551799231999428,1.1993615908620685,13.689018551390484,2.0116733917421499,-49.692620246031439,-233.48968983532316,-53.489689835323162,null,575440,331131193600,null,16.96911825979042,-69.2616480250461,null,-14.265963340053979,-164.22804181027709,null,0,0]
[630960,630.96,759.02375788178108,1.5694788445963368,1.3803210304770877,0.76053236941470237,1,0,456818.92939207749,1.5707941377437526,115.6073545505152,1.5621462502090735,2.9873415593166932,1.229460886928273,15.377707867759474,2.059932492582826,-51.843966928824088,-235.31306441047795,-55.313064410477949,null,630960,398110521600,null,16.266354219219249,-70.938407435900828,null,-15.714545982275453,-164.37465697457716,null,0,0]
[691830,691.83,832.24820867911444,1.5695947618889012,1.4451232202136071,0.80656468419534355,1,0,500889.1846094738,1.5707943303453211,126.75943441159579,1.5629072858130937,3.244516671617856,1.2574830334249876,17.336380651163282,2.1091673815837386,-54.004115234907303,-237.06515760476205,-57.065157604762049,null,691830,478628748900,null,15.548996967140571,-72.500365071932137,null,-17.157337036279991,-164.56479253282987,null,0,0]
[758580,758.58,912.5461015915597,1.5697004915287129,1.5193860446309271,0.8524233694323472,1,0,549216.59607262944,1.5707945060196193,138.988867691096,1.5636014438924906,3.5290146661275981,1.2834949841399335,19.619481437678882,2.1591910766280447,-56.173585401918771,-238.76046568241904,-58.760465682419039,null,758580,575443616400,null,14.818882429783107,-73.950977803589893,null,-18.596692665934,-164.80948787882917,null,0,0]
[831760,831.76,1000.5790671970879,1.5697969053605914,1.6041133093663802,0.89771613478121604,1,0,602199.36717187753,1.5707946662152705,152.39642125378984,1.5642344458255855,3.8432352537235728,1.3075696392625447,22.292190227868904,2.2097399649835654,-58.352391461812864,-240.41026042594365,-60.410260425943648,null,831760,691824697600,null,14.077974485408564,-75.294094776228008,null,-20.034590781453552,-165.1161656497157,null,0,0]
[912010,912.01,1097.1170029810405,1.5698848468563407,1.7004091985344201,0.94209643516296993,1,0,660300.86185233307,1.5707948123337505,167.09935164883811,1.5648118273986016,4.1899702395719425,1.329805250407909,25.435102214551275,2.2605303562219698,-60.541979822774323,-242.02350377491229,-62.023503774912285,null,912010,831762240100,null,13.327663648762114,-76.535028295839197,null,-21.473868305768555,-165.48847547907309,null,0,0]
[1000000,1000,1202.965895448928,1.5699650479374045,1.809407872430713,0.98523534994638551,1,0,724006.16424403875,1.5707949455911867,183.22041232190264,1.5653383925386337,4.5721490580623696,1.3502983922885639,29.144731025410159,2.311224670330887,-62.743072911738196,-243.6049996677144,-63.604999667714395,null,1000000,1000000000000,null,12.569448636537029,-77.679036510796848,null,-22.916746382507341,-165.92596315691756,null,0,0]
[]
[]
["Pole/Zero Locations for Chart"]
[{"$f":"Q4*1000","v":40738},null,{"$f":"SQRT(1+(A617/pole1)^2)","v":49.016609402055892},{"$f":"ATAN(A617/pole1)","v":1.5503936634185174},{"$f":"SQRT(1+(A617/Zero1)^2)","v":1.0018851350665958},{"$f":"ATAN(A617/Zero1)","v":6.1354354002509569E-2},{"$f":"IF(VIN_nom>Vout, 1, SQRT(1+(A617/z_RHP)^2))","v":1},{"$f":"IF(VIN_nom>Vout, 0, -ATAN(A617/z_RHP))","v":0},{"$f":"SQRT(1+(A617/Pole2)^2)","v":29494.563135897792},{"$f":"ATAN(A617/Pole2)","v":1.57076242224118},{"$f":"SQRT(1+(A617/Zero2)^2)","v":7.5306129489361098},{"$f":"ATAN(A617/Zero2)","v":1.4376116182709362},{"$f":"SQRT(1+(A617/pole4)^2)","v":1.0163824479801615},{"$f":"ATAN(A617/pole4)","v":0.17978807971267402},{"$f":"SQRT((1-(A617^2/(pole3^2)))^2+(A617/(Q*pole3))^2)","v":1.304125630771209},{"$f":"ATAN((A617/(Q*pole3))/(1-A617^2/pole3^2))","v":0.73697540607140699},{"$f":"20*LOG10(((E617*K617*G617)/(C617*I617*O617*M617))*Adc)","v":4.3969437626133076E-2},{"$f":"((F617+L617+H617)-(D617+J617+P617+N617))*radconv","v":-145.47132577823535},{"$f":"IF(R617>0,R617,R617+180)","v":34.528674221764646},"crossover",null,null,null,{"$f":"20*LOG10((K617/(I617*M617))*AEA)","v":25.707848445587},{"$f":"(L617-(J617+N617))*radconv","v":-17.930077301054677},null,{"$f":"20*LOG10((E617*G617/(C617*O617))*Acs*Am)","v":26.731896157807014},{"$f":"(F617+H617-(D617+P617))*radconv","v":-127.54124847718072}]
[{"$f":"A617","v":40738},null,null,null,null,null,null,null,null,null,null,null,null,null,null,null,null,-180]
[{"$f":"A618","v":40738}]
[1000000,null,null,null,null,null,null,null,null,null,null,null,null,null,null,null,null,{"$f":"R617","v":-145.47132577823535}]
[]
[{"$f":"pole1","v":831.27904897019926},null,1.4142135623730951,0.78539816339744828,1.0000007856800448,1.2535386155781755E-3,{"$f":"IF(VIN_nom>Vout, 1, SQRT(1+(A622/z_RHP)^2))","v":1},{"$f":"IF(VIN_nom>Vout, 0, -ATAN(A622/z_RHP))","v":0},601.85198643039064,1.5691347879403856,1.011531917239809,0.15114348159426888,1.0000068772447297,3.7086939253904989E-3,1.0001456340205643,1.7882526073406006E-2,{"$f":"20*LOG10(((E622*K622*G622)/(C622*I622*O622*M622))*Adc)","v":49.638420789954196},{"$f":"((F622+L622+H622)-(D622+J622+P622+N622))*radconv","v":-127.41018069380222},52.589819306197782,"p1",null,null,null,42.216962516040688,-81.45740984238401,null,{"$f":"20*LOG10((E622*G622/(C622*O622))*Acs*Am)","v":59.817233439681388},{"$f":"(F622+H622-(D622+P622))*radconv","v":-45.952770851418208}]
[{"$f":"Zero1","v":663145.59697398485},null,797.74188801674052,1.5695427881793185,1.4142135623730951,0.78539816339744828,1,0,480121.50000104139,1.5707942439887737,121.50411515664808,1.5625660599570315,3.1230217818086352,1.2448528840125002,16.399056053635835,-1.0551735389403678,-53.009787917148401,-56.267443743680133,123.73255625631987,"z1",null,null,null,15.880520791462502,-71.796256668719792,null,-16.494533542843019,15.52881292503965]
[{"$f":"Pole2","v":1.3812037098400818},null,1.0000013803572703,1.6615388545109795E-3,1.0000000000021689,2.0828061230304289E-6,1,0,1.4142135623730951,0.78539816339744828,1.0000000320199203,2.5306093854656901E-4,1.0000000000189861,6.1621729794609532E-6,1.0000000004020833,2.9715282571262402E-5,105.12992900400504,-45.082636182418888,134.9173638175811,"p2",null,null,{"$f":"Pole2","v":1.3812037098400818},94.696924721947013,-44.985853794169842,null,62.828779447825902,-9.6782388249048792E-2]
[{"$f":"Zero2","v":5457.9884524607805},null,6.6414876333402129,1.4196528452006276,1.0000338696020419,8.2302668378652563E-3,1,0,3951.6174104810875,1.5705432658563501,1.4142135623730951,0.78539816339744828,1.000296430688876,2.4345738084227592E-2,1.0062592422485308,0.11695949038965617,22.713257615889386,-133.95025089366649,46.049749106333508,"z2",null,null,{"$f":"Zero2","v":5457.9884524607805},28.779452170019432,-46.380408770616164,null,46.329580611637837,-87.569842123050321]
[{"$f":"pole3","v":220000},null,264.65429482190694,1.5670178036456071,1.0535936178065095,0.32032684548512702,1,0,159281.35613667566,1.5707900485962156,40.320292947647928,1.5459923763874677,1.401206649728157,0.77607188756353951,4.7330905070484635,{"$error":"#DIV/0!"},-28.225640917575923,{"$error":"#DIV/0!"},{"$error":"#DIV/0!"},"p3",null,null,null,22.844355290092658,-45.886445767885192,null,1.3257789580992931,{"$error":"#DIV/0!"}]
[{"$f":"Fp2_u","v":224142.31382764954},null,{"$f":"SQRT(1+(A627/pole1)^2)","v":269.63732044837258},{"$f":"ATAN(A627/pole1)","v":1.567087632869506},{"$f":"SQRT(1+(A627/Zero1)^2)","v":1.0555771334423822},{"$f":"ATAN(A627/Zero1)","v":0.3259434427823964},1,0,{"$f":"SQRT(1+(A627/Pole2)^2)","v":162280.41688206641},{"$f":"ATAN(A627/Pole2)","v":1.5707901646219171},{"$f":"SQRT(1+(A627/Zero2)^2)","v":41.079008950093559},{"$f":"ATAN(A627/Zero2)","v":1.546450588710669},{"$f":"SQRT(1+(A627/pole4)^2)","v":1.4142135623730951},{"$f":"ATAN(A627/pole4)","v":0.78539816339744828},{"$f":"SQRT((1-(A627^2/(pole3^2)))^2+(A627/(Q*pole3))^2)","v":4.8223582601072037},{"$f":"ATAN((A627/(Q*pole3))/(1-A627^2/pole3^2))","v":-1.5629138116562526},-28.613972435892375,-27.95851371536649,{"$f":"IF(R627>0,R627,R627+180)","v":152.04148628463352},"p4",null,null,null,null,null,null,1.0178014297696438,18.436041312499803]
[{"$f":"z_RHP","v":0},null,{"$f":"SQRT(1+(A628/pole1)^2)","v":1},{"$f":"ATAN(A628/pole1)","v":0},{"$f":"SQRT(1+(A628/Zero1)^2)","v":1},{"$f":"ATAN(A628/Zero1)","v":0},1,0,{"$f":"SQRT(1+(A628/Pole2)^2)","v":1},{"$f":"ATAN(A628/Pole2)","v":0},{"$f":"SQRT(1+(A628/Zero2)^2)","v":1},{"$f":"ATAN(A628/Zero2)","v":0},{"$f":"SQRT(1+(A628/pole4)^2)","v":1},{"$f":"ATAN(A628/pole4)","v":0},{"$f":"SQRT((1-(A628^2/(pole3^2)))^2+(A628/(Q*pole3))^2)","v":1},{"$f":"ATAN((A628/(Q*pole3))/(1-A628^2/pole3^2))","v":0},108.14024067578451,0,{"$f":"IF(R628>0,R628,R628+180)","v":180},"z_RHP",null,null,null,null,null,null,62.828791440922146,0]
[{"$f":"Fp2_u","v":224142.31382764954},null,null,null,null,null,null,null,null,null,null,null,null,null,null,null,-25]
[]
[null,null,null,"System","Plant"]
["p1","p-dom",{"$f":"pole1","v":831.27904897019926},{"$f":"Q622","v":49.638420789954196},{"$f":"AA622","v":59.817233439681388}]
["z1","ESR zero",{"$f":"Zero1","v":663145.59697398485},{"$f":"Q623","v":-53.009787917148401},{"$f":"AA623","v":-16.494533542843019}]
["p2","EA pole",{"$f":"Pole2","v":1.3812037098400818},{"$f":"Q624","v":105.12992900400504},{"$f":"AA624","v":62.828779447825902}]
["z2","EA zero",{"$f":"Zero2","v":5457.9884524607805},{"$f":"Q625","v":22.713257615889386},{"$f":"AA625","v":46.329580611637837}]
["p3","p_sampling",{"$f":"pole3","v":220000},{"$f":"Q626","v":-28.225640917575923},{"$f":"AA626","v":1.3257789580992931}]
[]
[]
[{"$f":"Q4*1000","v":40738}]
[{"$f":"Q4*1000","v":40738}]
[]
[]
[]
[]
[]
[]
[]
[]
[]
[]
[]
[]
[]
[]
[]
[]
[]
[]
[]
[]
[]
[]
[]
[]
[]
[]
[]
[]
[]
[]
[]
[]
[]
[]
[]
[]
[]
[]
[]
[]
[]
[]
[]
[]
[]
[]
[null,null,null,null,null,null,null,null,null,null,null,null,null,null,null,null,null,null,null,null,null,null,null,null,null,null,null,null,null,"phase margin",{"$f":"SUM(AE689:AE1306)","v":0}]

{"sheet":"Bode Plot Management","index":5,"n_rows":6,"n_cols":14,"rows_kept":6,"cut":false,"hidden":true,"merged":[]}
[null,null,null,null,null,null,null,null,null,"Single or dual output (MODE)",null,null,null,"3.3V or 5V fixed (FB1/2)"]
[{"$f":"CHOOSE(BODE_PLOT_TYPE, \"BODE_PLOT_Ch1\", \"BODE_PLOT_Ch2\")","v":"BODE_PLOT_Ch1"},null,null,null,null,null,null,null,null,"With/without dither (DITH)",null,null,null,"With/without VOUT connected to VCCX"]
[null,null,null,null,null,null,null,null,null,"FPWM or DEM (DEMB)"]
[null,null,null,null,null,null,null,null,null,"Shunt or inductor DCR current sensing"]
[]
[null,null,null,null,null,{"$f":"INDIRECT(A2)","v":0}]

{"sheet":"Efficiency Calculations","index":6,"n_rows":109,"n_cols":57,"rows_kept":109,"cut":false,"hidden":true,"merged":[[6,24,6,26],[0,0,3,3],[5,0,6,3],[6,6,6,13],[6,17,6,20],[6,21,6,23],[6,51,6,56],[6,27,6,32],[6,33,6,36],[6,40,6,44],[6,45,6,49]]}
["BUCK CONTROLLER POWER DESIGN TOOL"]
[null,null,null,null,null,null,null,{"$f":"AV19","v":0.96009443631230595},"10% load"]
[null,null,null,null,null,null,null,{"$f":"AV59","v":0.9849535734522854},"50% load",null,null,null,null,null,null,null,null,null,null,null,null,null,null,null,null,null,null,null,null,null,null,null,null,null,null,null,null,null,null,null,null,{"$f":"IF(MODE=1, (Qg_Q1+Qg_Q2)*Fsw*Vin, (Qg_Q1+Qg_Q2+Qg_Q3+Qg_Q4)*Fsw*Vin)","v":0.17951999999999999}]
[null,null,null,null,null,null,null,{"$f":"AV109","v":0.98530552108985969},"100% load",null,null,null,null,null,null,null,null,null,null,null,null,null,null,null,null,null,null,null,null,null,null,null,null,null,null,null,null,null,null,null,"I_VCC",{"$f":"(Qg_Q1+Qg_Q2)*Fsw*1000","v":7.4799999999999995},"mA",{"$f":"AP4*5/1000","v":3.7399999999999996E-2}]
[]
["Enter the values of your design and MOSFET datasheet specifications below. Note that thermal resistance (θJA) will change when components are placed on the PCB"]
[null,null,null,null,null,null,"Operating Point Condtions",null,null,null,null,null,null,null,null,null,null,"Filter Inductor",null,null,null,"Cout",null,null,"Cin",null,null,"High-side BUCK \"Control\" MOSFET Losses ",null,null,null,null,null,"Low-side BUCK \"Sync\" MOSFET Losses ",null,null,null,"External Diode","Diode/FET","Sense Rs","Controller IC Losses",null,null,null,null,"RESULTS",null,null,null,null,null,"Consolidated Buck/Boost Efficiency & Losses"]
["Input Parameters",null,null,null,null,null,"Step","Vin","Mode","Iout","Iout/ phase","Iin","Duty Cycle BUCK Leg","Ripple Current pk-pk","Peak Inductor Current","Valley Inductor Current","SW node voltage at Q1 turn-on","Irms Lf","DCR    Loss","Core Loss","Total Inductor Loss","Irms Cout","Cout ESR Loss","Total Cout Loss","Irms Cin","Cin ESR Loss","Total Cin Loss","Irms","RDS(on) Loss","Transition Loss (not including capacitive loss)","MOSFET Output Capacitance Loss","Dead Time Loss ","Total Control MOSFET Loss","Irms","RDS(on) Loss","Deadtime Loss","Total Sync MOSFET Loss","Deadtime Loss","Reverse Recovery Loss","Isense Shunt Loss","IQ Loss","Switching Current Loss","Switching Current Diss","LDO Loss Saved from Gate Drive Current (ext VCC)","Total IC Loss","Total Loss","Pout","EFF, h",{"$f":"IF(Vin>Vout, \"Buck ''CONTROL'' MOSFET Temp Rise\", \"Boost ''CONTROL'' MOSFET Temp Rise\")","v":"Buck ''CONTROL'' MOSFET Temp Rise"},{"$f":"IF(Vin>Vout, \"Buck ''SYNC'' MOSFET Temp Rise\", \"Boost ''SYNC'' MOSFET Temp Rise\")","v":"Buck ''SYNC'' MOSFET Temp Rise"},null,"h","Inductor Cu & Core Loss","Total MOSFET Loss","Control MOSFET Loss","SYNC MOSFET Loss","Shunt Loss"]
["Design","Input Value","Units","Description",null,null,0,{"$f":"Vin","v":24},{"$f":"MODE","v":1},0,{"$f":"Iout*G9/100/Number_of_Phases","v":0},{"$f":"Vout*K9/(Vin*Efficiency)","v":0},{"$f":"(Vout+(Rdson2+Rs+Rdcr)*K9)/(Vin+(Rs+Rdson2-Rdson1)*K9)","v":0.5},{"$f":"(Vin-(Rdson1+Rdcr)*K9-Vout)*M9/(Fsw*Lf)","v":2.0053475935828877},{"$f":"K9+N9/2","v":1.0026737967914439},{"$f":"K9-N9/2","v":-1.0026737967914439},{"$f":"IF(MIN(Vin, -P9/(Coss_Q1+Coss_Q2)*0.00000002)<0, 0, MIN(Vin, -P9/(Coss_Q1+Coss_Q2)*0.00000002))","v":24},{"$f":"SQRT(K9^2+(N9^2)/12)","v":0.57889398648692425},{"$f":"R9^2*Rdcr","v":6.7023649518144646E-4},{"$f":"Core_Loss_Ch1","v":0.25},{"$f":"(T9+S9*(1+Ltc*(Ta-25)))/(1-S9*Ltc*ThetaCa)","v":0.25068367788315454},{"$f":"N9/SQRT(12)","v":0.57889398648692425},{"$f":"RCoutEsr*V9^2","v":3.3511824759072323E-4},{"$f":"W9","v":3.3511824759072323E-4},{"$f":"SQRT(M9*(1-M9))*SQRT(K9^2+(N9^2)/12)","v":0.28944699324346213},{"$f":"RCinEsr*Y9^2","v":1.6755912379536162E-4},{"$f":"Z9","v":1.6755912379536162E-4},{"$f":"SQRT(M9)*SQRT(K9^2+(N9^2)/12)","v":0.40933986343301776},{"$f":"Rdson1*AB9^2","v":7.5401605707912738E-4},{"$f":"(Vin*K9/2)*Fsw*(Tr_buck+Tf_buck)","v":0},{"$f":"(0.5*Coss_Q1*(Vin-Q9)^2-0.5*Coss_Q2*(Vin-Q9)^2+(Qoss_Q2*(Vin-Q9)/Vin)*Vin)*Fsw","v":0},{"$f":"IF(K9>N9/2,0,ABS(K9-N9/2)*Vsd_Q1*Deadtime*Fsw)","v":4.9411764705882362E-3},{"$f":"(AF9+AE9+AD9+AC9*(1+RdsonTopTc*Ta-RdsonTopTc*25))/(1-AC9*RdsonTopTc*ThetaJA_Q1)","v":5.696051510527541E-3},{"$f":"SQRT((1-M9))*SQRT(K9^2+(N9^2)/12)","v":0.40933986343301776},{"$f":"Rdson2*AH9^2","v":6.1159080185307002E-4},{"$f":"IF(K9<N9/2,Deadtime*Fsw*IF(VfdSky_Q2>0,0,Vsd_Q2)*(K9+N9/2),2*Deadtime*Fsw*IF(VfdSky_Q2>0,0,Vsd_Q2)*K9)","v":4.9411764705882353E-3},{"$f":"(AJ9+AI9*(1+RdsonBotTc*Ta-RdsonBotTc*25))/(1-AI9*RdsonBotTc*ThetaJA_Q2)","v":5.5534465598082181E-3},{"$f":"2*Deadtime*Fsw*IF(VfdSky_Q2>0,VfdSky_Q2,Vsd_Q2)*K9","v":0},{"$f":"IF(QrrSky_Q2>0,QrrSky_Q2,Qrr_Q2*K9/(Iout/Number_of_Phases))*Fsw*Vin","v":0},{"$f":"Rs*R9^2","v":6.7023649518144646E-4},{"$f":"Iq*Vin","v":8.3999999999999993E-4},{"$f":"IF(Ext_VCC=1,  (Qg_Q1+Qg_Q2)*Fsw*VCC, (Qg_Q1+Qg_Q2)*Fsw*Vin)","v":3.7399999999999996E-2},{"$f":"(Vin-VCC)*Fsw*(Qg_Q1+Qg_Q2)+(RdsonDRT+RdsonDRT2)*Fsw*Qg_Q1*VCC/(RdsonDRT+2*Rgate1+RdsonDRT2)+(RdsonDRB+RdsonDRB2)*Fsw*Qg_Q2*VCC/(RdsonDRB+2*Rgate2+RdsonDRB2)","v":0.17952000000000001},{"$f":"(Qg_Q1+Qg_Q2)*Fsw*(Vin-VCC)","v":0.14212},{"$f":"SUM(AO9:AP9)","v":3.8239999999999996E-2},{"$f":" SUM(U9,X9,AA9,AG9,AK9,AL9,AM9,AS9,AN9)","v":0.30134608982005784},{"$f":"Vout*K9","v":0},{"$f":"AU9/(AU9+AT9)","v":0},{"$f":"ThetaJA_Q1*BC9","v":0.28480257552637706},{"$f":"ThetaJA_Q2*BD9","v":0.27767232799041092},null,{"$f":"AV9*100","v":0},{"$f":"U9","v":0.25068367788315454},{"$f":"AG9+AK9+AM9","v":1.1249498070335758E-2},{"$f":"AG9+AM9*0.66","v":5.696051510527541E-3},{"$f":"AK9+AM9*0.33","v":5.5534465598082181E-3},{"$f":"AN9","v":6.7023649518144646E-4}]
[null,null,null,null,null,null,1,24,1,{"$f":"Iout*G10/100","v":0.09},0.09,0.05,0.50002653113558448,2.0053562359980948,{"$f":"K10+N10/2","v":1.0926781179990475},{"$f":"K10-N10/2","v":-0.91267811799904741},24,{"$f":"SQRT(K10^2+(N10^2)/12)","v":0.58585077972526745},6.8644227220940768E-4,0.25,0.25070020956992944,{"$f":"N10/SQRT(12)","v":0.57889648133729743},3.3512113610470397E-4,{"$f":"W10","v":3.3512113610470397E-4},{"$f":"SQRT(M10*(1-M10))*SQRT(K10^2+(N10^2)/12)","v":0.2929253894502527},1.7161056756916443E-4,{"$f":"Z10","v":1.7161056756916443E-4},{"$f":"SQRT(M10)*SQRT(K10^2+(N10^2)/12)","v":0.41427004972463238},7.7228853344482227E-4,1.6171647756138868E-3,0,4.4976777654993057E-3,6.8881950093623882E-3,0.41424806819809606,6.263453363213687E-4,5.3847177654993061E-3,6.011816196428166E-3,8.8703999999999996E-4,1.3728000000000002E-3,6.8644227220940768E-4,8.3999999999999993E-4,3.7399999999999996E-2,0.17952000000000001,0.14212,3.8239999999999996E-2,0.30529323475160325,1.08,{"$f":"AU10/(AU10+AT10)","v":0.77961833127240721},0.38971215046811941,0.32324200982140827,null,{"$f":"AV10*100","v":77.961833127240723},0.25070020956992944,1.4272811205790555E-2,7.7942430093623886E-3,6.4648401964281657E-3,6.8644227220940768E-4]
["Vin",{"$f":"Vin","v":24},"V","Vin",null,null,2,24,1,0.18,0.18,0.1,0.5000530620423399,2.0053648671208189,1.1826824335604094,-0.82268243356040949,24,0.60623759439420688,7.3504804171374983E-4,0.25,0.25074979309326362,0.57889897292781145,3.35124020856875E-4,3.35124020856875E-4,0.30311879549019277,1.8376200835885063E-4,1.8376200835885063E-4,0.42869745975873602,8.2701680401616883E-4,3.2343295512277737E-3,0,4.0541790325856978E-3,8.1168679450669499E-3,0.42865196704702269,6.7066015731447872E-4,5.8282590325856977E-3,6.4997910200737825E-3,1.7740799999999999E-3,2.7456000000000004E-3,7.3504804171374983E-4,8.3999999999999993E-4,3.7399999999999996E-2,0.17952000000000001,0.14212,3.8239999999999996E-2,0.30938006612933389,2.16,0.87471346741116429,0.49644819725334755,0.37029195100368917,null,87.471346741116434,0.25074979309326362,1.7362258965140733E-2,9.9289639450669508E-3,7.4058390200737829E-3,7.3504804171374983E-4]
["Vout",{"$f":"Vout","v":12},"V","Vout",null,null,3,24,1,0.27,0.27,0.15,0.50007959272026914,2.0053734869512052,1.2726867434756026,-0.73268674347560259,24,0.63876983479750848,8.1605380369447259E-4,0.25,0.25083242922433113,0.57890146125850839,3.3512690184723631E-4,3.3512690184723631E-4,0.31938491335214664,2.0401344575391646E-4,2.0401344575391646E-4,0.45171443069120465,9.1820667102605598E-4,4.8514943268416601E-3,0,3.6106802718477698E-3,9.3821042118506035E-3,0.45164253005286953,7.4453055857683363E-4,6.2718002718477701E-3,7.017375760563555E-3,2.6611200000000003E-3,4.1184000000000004E-3,8.1605380369447259E-4,8.3999999999999993E-4,3.7399999999999996E-2,0.17952000000000001,0.14212,3.8239999999999996E-2,0.31360662334804096,3.24,0.91174976394754259,0.60501241059253019,0.41882238802817778,null,91.174976394754253,0.25083242922433113,2.0517879972414159E-2,1.2100248211850604E-2,8.3764477605635553E-3,8.1605380369447259E-4]
["Fsw",{"$f":"Fsw/1000","v":440},"kHz","Switching Frequency",null,null,4,24,1,0.36,0.36,0.2,0.50010612316937531,2.0053820954894008,1.3626910477447005,-0.64269104774470043,21.823125560091697,0.68171092046100323,9.294595581515766E-4,0.25,0.25094811924839444,0.57890394632943076,3.3512977907578846E-4,3.3512977907578846E-4,0.34085545255298649,2.3236487907020247E-4,2.3236487907020247E-4,0.48209356782159285,1.0458639366072873E-3,6.4686591024555474E-3,1.1419877262766132E-2,3.1671814832858838E-3,2.2106205801799516E-2,0.48199125608338117,8.4795183393404964E-4,6.7153414832858841E-3,7.56457619647168E-3,3.5481599999999999E-3,5.4912000000000008E-3,9.294595581515766E-4,8.3999999999999993E-4,3.7399999999999996E-2,0.17952000000000001,0.14212,3.8239999999999996E-2,0.32939521546296319,4.32,0.92915310482372848,1.2865198900899759,0.46883360982358402,null,92.915310482372846,0.25094811924839444,3.5161981998271197E-2,2.5730397801799518E-2,9.37667219647168E-3,9.294595581515766E-4]
["Iout",{"$f":"Iout","v":9},"A","Max Output Current",null,null,5,24,1,0.45,0.45,0.25,0.50013265338966129,2.0053906927355514,1.4526953463677756,-0.55269534636777573,18.767244358837889,0.73323437763278065,1.0752653050850624E-3,0.25,0.25109686496485406,0.57890642814062032,3.3513265254253122E-4,3.3513265254253122E-4,0.36661717591372212,2.6881630734990617E-4,2.6881630734990617E-4,0.51854377352834724,1.2099944027925804E-3,8.0858238780694338E-3,2.7201247137742173E-2,2.7236826669003989E-3,3.923024176009457E-2,0.51840621859456237,9.8091927729292302E-4,7.1588826669003987E-3,8.1413991552684289E-3,4.4352000000000003E-3,6.8640000000000003E-3,1.0752653050850624E-3,8.3999999999999993E-4,3.7399999999999996E-2,0.17952000000000001,0.14212,3.8239999999999996E-2,0.34968692014519459,5.4,0.93918157197046748,2.1880240880047284,0.5203259577634215,null,93.918157197046753,0.25109686496485406,5.4235640915363002E-2,4.3760481760094568E-2,1.040651915526843E-2,1.0752653050850624E-3]
["Ta",{"$f":"Ta","v":25},"°C","Ambient Temperature",null,null,6,24,1,0.54,0.54,0.3,0.50015918338112997,2.0053992786898038,1.542699639344902,-0.46269963934490188,15.711362965871034,0.7916662947526979,1.2534710444949311E-3,0.25,0.2512786686873188,0.57890890669211981,3.3513552224746546E-4,3.3513552224746546E-4,0.39583312731604003,3.1336772936159277E-4,3.1336772936159277E-4,0.55988170804486759,1.4106038715145724E-3,9.7029886536833202E-3,4.269088604954014E-2,2.2801838226916764E-3,5.6100489510969312E-2,0.55970348868327346,1.1434281826414293E-3,7.6024238226916766E-3,8.7478525135534242E-3,5.3222400000000007E-3,8.2368000000000007E-3,1.2534710444949311E-3,8.3999999999999993E-4,3.7399999999999996E-2,0.17952000000000001,0.14212,3.8239999999999996E-2,0.36982802500794543,6.48,0.94600915181260825,3.0768388755484652,0.57329982567767124,null,94.600915181260831,0.2512786686873188,7.3085142024522737E-2,6.1536777510969309E-2,1.1465996513553425E-2,1.2534710444949311E-3]
["Vcc",{"$f":"VCC","v":5},"V","Subregulated VCC Voltage",null,null,7,24,1,0.63,0.63,0.35,0.50018571314378446,2.0054078533523025,1.6327039266761512,-0.37270392667615126,12.655481381193592,0.85559241943263553,1.4640767763811819E-3,0.25,0.25149353324369572,0.57891138198397074,3.3513838819059091E-4,3.3513838819059091E-4,0.42779618020747168,3.6601914360020717E-4,3.6601914360020717E-4,0.6051075468424908,1.6476981446058171E-3,1.1320153429297207E-2,5.788879394324184E-2,1.8366849506600736E-3,7.2717293697786248E-2,0.60488283571684665,1.3354738440487159E-3,8.0459649506600724E-3,9.3839451973818065E-3,6.2092800000000002E-3,9.6096000000000011E-3,1.4640767763811819E-3,8.3999999999999993E-4,3.7399999999999996E-2,0.17952000000000001,0.14212,3.8239999999999996E-2,0.38981888644703566,7.5600000000000005,0.95096506071206166,3.9529814848893126,0.62775565986909032,null,95.096506071206164,0.25149353324369572,9.1710838895168054E-2,7.9059629697786252E-2,1.2555113197381807E-2,1.4640767763811819E-3]
["Components","Input Value","Units","Description",null,null,8,24,1,0.72,0.72,0.4,0.50021224267762765,2.0054164167231954,1.7227082083615977,-0.28270820836159771,9.5995996048080734,0.9238729622474664,1.7070825007438168E-3,0.25,0.25174146197629993,0.57891385401621587,3.3514125037190849E-4,3.3514125037190849E-4,0.46193643950606833,4.2677054828708705E-4,4.2677054828708705E-4,0.65341547507416664,1.9212830237987947E-3,1.2937318204911095E-2,7.2794970763929767E-2,1.3931860508059534E-3,8.9080988001443678E-2,0.65313816861787344,1.5570515556651103E-3,8.489506050805954E-3,1.0049687182683413E-2,7.0963199999999997E-3,1.0982400000000002E-2,1.7070825007438168E-3,8.3999999999999993E-4,3.7399999999999996E-2,0.17952000000000001,0.14212,3.8239999999999996E-2,0.4096598514598298,8.64,0.95473201665212348,4.8164686000721835,0.68369395913417064,null,95.473201665212343,0.25174146197629993,0.11011307518412709,9.6329372001443675E-2,1.3673879182683413E-2,1.7070825007438168E-3]
["L",{"$f":"Lf*1000000","v":6.8},"uH","Filter Inductance",null,null,9,24,1,0.81,0.81,0.45,0.50023877198266242,2.0054249688026267,1.8127124844013134,-0.19271248440131328,6.5437176367169201,0.99561242900609581,1.9824882175828364E-3,0.25,0.25202245874198465,0.57891632278889671,3.3514410879141804E-4,3.3514410879141804E-4,0.49780615774112941,4.9562194136997244E-4,4.9562194136997244E-4,0.70417237642275321,2.2313643107259042E-3,1.4554482980524979E-2,8.7409416456687705E-2,9.4968712312967188E-4,0.10519189515919543,0.70383618340814968,1.8081566117221094E-3,8.9330471231296726E-3,1.0745089495774848E-2,7.9833600000000001E-3,1.23552E-2,1.9824882175828364E-3,8.3999999999999993E-4,3.7399999999999996E-2,0.17952000000000001,0.14212,3.8239999999999996E-2,0.42935125766469917,9.7200000000000006,0.95769667964339522,5.6673163579597716,0.74111527478874251,null,95.769667964339519,0.25202245874198465,0.12829218465497028,0.11334632715919543,1.4822305495774849E-2,1.9824882175828364E-3]
["Rdcr",{"$f":"Rdcr*1000","v":2},"mW","Inductor DCR at 25°C",null,null,10,24,1,0.9,0.9,0.5,0.50026530105889178,2.0054335095907447,1.9027167547953723,-0.10271675479537234,3.4878354769226605,1.0701153972582214,2.2902939268982419E-3,0.25,0.25233652791229122,0.57891878830205623,3.3514696344912097E-4,3.3514696344912097E-4,0.53505762330940565,5.7257332052301974E-4,5.7257332052301974E-4,0.75688657698928063,2.5779478069194758E-3,1.6171647756138868E-2,0.10173213096659996,5.0618816763159488E-4,0.12105032698228406,0.75648507785849328,2.0887843065323826E-3,9.3765881676315943E-3,1.1470164213964674E-2,8.8704000000000005E-3,1.3728000000000001E-2,2.2902939268982419E-3,8.3999999999999993E-4,3.7399999999999996E-2,0.17952000000000001,0.14212,3.8239999999999996E-2,0.44889343331941034,10.8,0.96009443631230595,6.5055403491142023,0.8000202106982337,null,96.009443631230596,0.25233652791229122,0.14624849119624872,0.13011080698228406,1.6000404213964675E-2,2.2902939268982419E-3]
["LTc",{"$f":"Ltc*1000000","v":4000},"ppm","Inductor Series Resistance Temp Co",null,null,11,24,1,0.99,0.99,0.54999999999999993,0.50029182990631882,2.0054420390876935,1.9927210195438467,-1.2721019543846745E-2,0.4319531254277334,1.1468434131759302,2.6304996286900346E-3,0.25,0.25268367437361933,0.57892125055573596,3.3514981434501723E-4,3.3514981434501723E-4,0.57342160891738825,6.5762468314681233E-4,6.5762468314681233E-4,0.81117737665853007,2.9610393138117664E-3,1.7788812531752754E-2,0.11576311423875216,6.2689184312076773E-5,0.13665658437239234,0.81070406310959275,2.3989299344897692E-3,9.8201291843120764E-3,1.222492446625164E-2,9.7574400000000009E-3,1.5100800000000001E-2,2.6304996286900346E-3,8.3999999999999993E-4,3.7399999999999996E-2,0.17952000000000001,0.14212,3.8239999999999996E-2,0.46828669733844513,11.879999999999999,0.96207678775069416,7.3311556186196167,0.86040942331258208,null,96.207678775069411,0.25268367437361933,0.16398230883864398,0.14662311237239234,1.7208188466251641E-2,2.6304996286900346E-3]
["ThetaCa",{"$f":"ThetaCa","v":20},"°C/W","Core to Ambient Thermal Resistance",null,null,12,24,1,1.08,1.08,0.6,0.50031835852494633,2.0054505572936199,2.08272527864681,7.7274721353190134E-2,0,1.2253785788396612,3.0031053229582156E-3,0.25,0.25306390352741676,0.57892370954997829,3.3515266147910762E-4,3.3515266147910762E-4,0.612689165225064,7.5077602636837166E-4,7.5077602636837166E-4,0.86674930794895444,3.3806446327349616E-3,1.940597730736664E-2,0.11772287999999999,0,0.14060456875624236,0.86619760946859936,2.738588790069274E-3,1.0644480000000001E-2,1.3390402951552803E-2,1.0644480000000001E-2,1.6473600000000001E-2,3.0031053229582156E-3,8.3999999999999993E-4,3.7399999999999996E-2,0.17952000000000001,0.14212,3.8239999999999996E-2,0.47650598924601761,12.96,0.96453646583215968,7.5738572378121178,0.94133454757764012,null,96.453646583215971,0.25306390352741676,0.17046857170779517,0.15147714475624235,1.8826690951552802E-2,3.0031053229582156E-3]
["Cin",{"$f":"Cin*1000000","v":20},"μF","Input Capacitance",null,null,13,24,1,1.17,1.17,0.64999999999999991,0.5003448869147773,2.00545906420867,2.1727295321043352,0.16727046789566491,0,1.3053947697349613,3.4081110097027851E-3,0.25,0.25347722129038991,0.57892616528482532,3.3515550485139291E-4,3.3515550485139291E-4,0.65269722959469134,8.5202734704117042E-4,8.5202734704117042E-4,0.92337178799840625,3.8367695649211813E-3,2.1023142082980527E-2,0.11772287999999999,0,0.1426922871327857,0.92273508981723396,3.1077561678270684E-3,1.153152E-2,1.4648380887037142E-2,1.153152E-2,1.7846399999999998E-2,3.4081110097027851E-3,8.3999999999999993E-4,3.7399999999999996E-2,0.17952000000000001,0.14212,3.8239999999999996E-2,0.48303110317180808,14.04,0.96674033817456229,7.7235455566392845,1.0268846443518571,null,96.674033817456234,0.25347722129038991,0.17518706801982287,0.15447091113278569,2.0537692887037141E-2,3.4081110097027851E-3]
["RCinEsr",{"$f":"RCinEsr*1000","v":2},"mW","Input Capacitor ESR",null,null,14,24,1,1.26,1.26,0.7,0.50037141507581473,2.0054675598329901,2.2627337799164948,0.25726622008350497,0,1.3866356206523307,3.8455166889237486E-3,0.25,0.25392363409473362,0.57892861776031945,3.3515834446187412E-4,3.3515834446187412E-4,0.69331761904092193,9.6137864174514589E-4,9.6137864174514589E-4,0.98086355507135592,4.3294199115024848E-3,2.2640306858594413E-2,0.11772287999999999,0,0.14481800235868802,0.98013521046570695,3.5064273624004932E-3,1.241856E-2,1.5936163162113156E-2,1.241856E-2,1.9219200000000002E-2,3.8455166889237486E-3,8.3999999999999993E-4,3.7399999999999996E-2,0.17952000000000001,0.14212,3.8239999999999996E-2,0.48969761329066558,15.120000000000001,0.96862862911106495,7.8751337179344016,1.1139249581056578,null,96.86286291110649,0.25392363409473362,0.17997336552080118,0.15750267435868803,2.2278499162113156E-2,3.8455166889237486E-3]
["Cout",{"$f":"Cout*1000000","v":240},"μF","Output Capcitance",null,null,15,24,1,1.35,1.35,0.75000000000000011,0.50039794300806173,2.0054760441667261,2.3527380220833631,0.34726197791663704,0,1.4688979475479405,4.3153223606211041E-3,0.25,0.25440314888838195,0.57893106697650254,3.3516118031055164E-4,3.3516118031055164E-4,0.73444874116125558,1.078829906786706E-3,1.078829906786706E-3,1.0390809479226086,4.8586014735108613E-3,2.4257471634208303E-2,0.11772287999999999,0,0.14698177828462974,1.0382542867596576,3.9345976685080395E-3,1.3305600000000001E-2,1.7253775001086488E-2,1.3305600000000001E-2,2.0591999999999999E-2,4.3153223606211041E-3,8.3999999999999993E-4,3.7399999999999996E-2,0.17952000000000001,0.14212,3.8239999999999996E-2,0.49650561562181655,16.200000000000003,0.97026290248677727,8.0286249142314876,1.2024567500543244,null,97.026290248677725,0.25440314888838195,0.18482755328571623,0.16057249828462974,2.4049135001086488E-2,4.3153223606211041E-3]
["RCoutEsr",{"$f":"Cout_ESR*1000","v":1},"mW","Output Capacitor ESR",null,null,16,24,1,1.44,1.44,0.8,0.50042447071152085,2.0054845172100233,2.4427422586050116,0.4372577413949883,0,1.5520193337704999,4.8175280247948525E-3,0.25,0.25491577313527813,0.57893351293341688,3.3516401239742677E-4,3.3516401239742677E-4,0.77600938724951862,1.2043811381987467E-3,1.2043811381987467E-3,1.0979091291964655,5.4243200518782359E-3,2.587463640982219E-2,0.11772287999999999,0,0.14918368046757507,1.0969774639547001,4.3922623809493711E-3,1.4192639999999999E-2,1.8601242688649423E-2,1.4192639999999999E-2,2.1964800000000003E-2,4.8175280247948525E-3,8.3999999999999993E-4,3.7399999999999996E-2,0.17952000000000001,0.14212,3.8239999999999996E-2,0.50345520946689371,17.28,0.97168968552304269,8.1840224233787531,1.292481334432471,null,97.168968552304264,0.25491577313527813,0.18974972315622451,0.16368044846757507,2.5849626688649423E-2,4.8175280247948525E-3]
["Top Driver","Input Value","Units","Description",null,null,17,24,1,1.53,1.53,0.84999999999999987,0.50045099818619554,2.00549297896303,2.5327464894815153,0.52725351051848501,0,1.6358688335934823,5.3521336814450014E-3,0.25,0.25546151481566565,0.578935955631105,3.3516684072250081E-4,3.3516684072250081E-4,0.81793408406199319,1.3380323317406634E-3,1.3380323317406634E-3,1.1572555126905009,6.026581447436492E-3,2.7491801185436072E-2,0.11772287999999999,0,0.15142377617691427,1.156212142761849,4.8794167946053044E-3,1.507968E-2,1.9978593571606484E-2,1.507968E-2,2.33376E-2,5.3521336814450014E-3,8.3999999999999993E-4,3.7399999999999996E-2,0.17952000000000001,0.14212,3.8239999999999996E-2,0.51054649741809466,18.36,0.97294479534612588,8.3413296088457134,1.3840000785803241,null,97.294479534612591,0.25546151481566565,0.19473996974852076,0.16682659217691428,2.7680001571606484E-2,5.3521336814450014E-3]
["RdsonDRT",0.7,"W","Drain to Source Resistance of pullup Top FET Driver",null,null,18,24,1,1.62,1.62,0.9,0.50047752543208834,2.0055014294258893,2.6227507147129447,0.61724928528705547,0,1.7203399853766621,5.9191393305715488E-3,0.25,0.25604038242639832,0.5789383950696082,3.3516966528577375E-4,3.3516966528577375E-4,0.86016960039818868,1.4797834828983592E-3,1.4797834828983592E-3,1.2170448235073752,6.665391460917441E-3,2.9108965961049959E-2,0.11772287999999999,0,0.15370213440079936,1.2158830383139967,5.3960562044378171E-3,1.596672E-2,2.1385856060694524E-2,1.596672E-2,2.47104E-2,5.9191393305715488E-3,8.3999999999999993E-4,3.7399999999999996E-2,0.17952000000000001,0.14212,3.8239999999999996E-2,0.51777958536664781,19.440000000000001,0.97405625294377485,8.500549920039969,1.4770144030347261,null,97.405625294377487,0.25604038242639832,0.19979839046149386,0.17001099840079936,2.9540288060694524E-2,5.9191393305715488E-3]
["RdsonDRT2",{"$f":"RdsonDRT2","v":0.5},"W","Drain to Source Resistance of pulldown Top FET Driver",null,null,19,24,1,1.71,1.71,0.95,0.50050405244920237,2.0055098685987485,2.7127549342993742,0.70724506570062573,0,1.8053455309406139,6.5185449721744939E-3,0.25,0.25665238498127174,0.57894083124896922,3.351724860872475E-4,3.351724860872475E-4,0.90267230678808863,1.6296345868842585E-3,1.6296345868842585E-3,1.2772153645031261,7.3407558929528393E-3,3.0726130736663845E-2,0.11772287999999999,0,0.15601882585267457,1.2759284457854183,5.9421759054900346E-3,1.6853759999999999E-2,2.2823059632497592E-2,1.6853759999999999E-2,2.6083200000000001E-2,6.5185449721744939E-3,8.3999999999999993E-4,3.7399999999999996E-2,0.17952000000000001,0.14212,3.8239999999999996E-2,0.52515458251158997,20.52,0.97504629483938354,8.6616868926337283,1.5715257816248798,null,97.504629483938359,0.25665238498127174,0.20492508548517216,0.17323373785267457,3.1430515632497595E-2,6.5185449721744939E-3]
["Bottom Driver","Input Value","Units","Description",null,null,20,24,1,1.8,1.8,1,0.50053057923754074,2.0055182964817546,2.8027591482408774,0.79724085175912274,0,1.8908133972253642,7.1503506062538455E-3,0.25,0.25729753201137429,0.57894326416923036,3.3517530312692325E-4,3.3517530312692325E-4,0.94540616632147068,1.7875856386373205E-3,1.7875856386373205E-3,1.3377161751843585,8.0526805440744101E-3,3.2343295512277735E-2,0.11772287999999999,0,0.15837392297800287,1.3362973987017464,6.5177711928862472E-3,1.7740800000000001E-2,2.4290234831456828E-2,1.7740800000000001E-2,2.7456000000000001E-2,7.1503506062538455E-3,8.3999999999999993E-4,3.7399999999999996E-2,0.17952000000000001,0.14212,3.8239999999999996E-2,0.53267160136885194,21.6,0.97593279243632269,8.8247441489001428,1.6675357415728416,null,97.593279243632267,0.25729753201137429,0.21012015780945972,0.17649488297800286,3.3350714831456831E-2,7.1503506062538455E-3]
["RdsonDRB",0.7,"W","Drain to Source Resistance of pullup Bottom FET Driver",null,null,21,24,1,1.89,1.89,1.0499999999999998,0.50055710579710622,2.0055267130750529,2.8927633565375261,0.88723664346247344,0,1.9766836156564869,7.8145562328096035E-3,0.25,0.25797583356545783,0.57894569383043359,3.3517811640480219E-4,3.3517811640480219E-4,0.9883411943309478,1.9536366328230487E-3,1.9536366328230487E-3,1.3985048535818372,8.8011712147138006E-3,3.3960460287891618E-2,0.11772287999999999,0,0.16076749996118939,1.3969474903921213,7.1228373618318873E-3,1.862784E-2,2.5787413271975614E-2,1.862784E-2,2.8828800000000002E-2,7.8145562328096035E-3,8.3999999999999993E-4,3.7399999999999996E-2,0.17952000000000001,0.14212,3.8239999999999996E-2,0.5403307577806602,22.68,0.97673027299149884,8.9897253980594698,1.7650458635987809,null,97.673027299149879,0.25797583356545783,0.21538371323316502,0.1797945079611894,3.5300917271975617E-2,7.8145562328096035E-3]
["RdsonDRB2",0.5,"W","Drain to Source Resistance of pulldown Bottom FET Driver",null,null,22,24,1,1.98,1.98,1.0999999999999999,0.50058363212790191,2.0055351183787891,2.9827675591893943,0.97723244081060545,0,2.0629059420925824,8.5111618518417705E-3,0.25,0.25868730021033026,0.57894812023262099,3.351809259208854E-4,3.351809259208854E-4,1.0314522683657019,2.1277875638335041E-3,2.1277875638335041E-3,1.4595458734523201,9.586233705202632E-3,3.5577625063505508E-2,0.11772287999999999,0,0.16319963273270391,1.4578431908848046,7.7573697076135399E-3,1.9514880000000002E-2,2.731462764062036E-2,1.9514880000000002E-2,3.0201600000000002E-2,8.5111618518417705E-3,8.3999999999999993E-4,3.7399999999999996E-2,0.17952000000000001,0.14212,3.8239999999999996E-2,0.54813217092525079,23.759999999999998,0.97745066683564996,9.1566344366351959,1.864057782031018,null,97.745066683565,0.25868730021033026,0.22071586037332427,0.18313268873270391,3.7281155640620359E-2,8.5111618518417705E-3]
["Deadtime",0.5,"Units","Description",null,null,23,24,1,2.0699999999999998,2.0699999999999998,1.1499999999999997,0.50061015822993049,2.0055435123931091,3.0727717561965546,1.0672282438034453,0,2.149438003682631,9.2401674633503482E-3,0.25,0.25943194303126643,0.57895054337583463,3.3518373167517419E-4,3.3518373167517419E-4,1.074718201620154,2.3100384257873155E-3,2.3100384257873155E-3,1.5208092740213799,1.0407873815772463E-2,3.7194789839119384E-2,0.11772287999999999,0,0.16567039897640284,1.5189545364248851,8.4213635255989423E-3,2.040192E-2,2.887191169841722E-2,2.040192E-2,3.1574400000000002E-2,9.2401674633503482E-3,8.3999999999999993E-4,3.7399999999999996E-2,0.17952000000000001,0.14212,3.8239999999999996E-2,0.55607596332689935,24.839999999999996,0.97810386281211714,9.3254751488201428,1.9645731849208612,null,97.81038628121172,0.25943194303126643,0.22611671067482006,0.18650950297640284,3.9291463698417226E-2,9.2401674633503482E-3]
["Deadtime",{"$f":"Deadtime*1000000000","v":14},"ns","Total Deadtime",null,null,24,24,1,2.16,2.16,1.2,0.5006366841031954,2.0055518951181601,3.16277594755908,1.1572240524409201,0,2.236243844858532,1.000157306733534E-2,0.25,0.26020977363244091,0.57895296326011692,3.3518653366767029E-4,3.3518653366767029E-4,1.1181210159302288,2.5003892125296939E-3,2.5003892125296939E-3,1.5822696319285456,1.1266097346554827E-2,3.8811954614733281E-2,0.11772287999999999,0,0.16817987813705285,1.5802561012520644,9.1148141112369681E-3,2.1288960000000003E-2,3.0459300283244995E-2,2.1288960000000003E-2,3.2947200000000003E-2,1.000157306733534E-2,8.3999999999999993E-4,3.7399999999999996E-2,0.17952000000000001,0.14212,3.8239999999999996E-2,0.56416226086627153,25.92,0.97869812700476111,9.4962515068526425,2.0665938141622502,null,97.869812700476118,0.26020977363244091,0.23158637842029786,0.18992503013705286,4.1331876283245E-2,1.000157306733534E-2]
["IQ","Input Value","Units","Description",null,null,25,24,1,2.25,2.25,1.25,0.50066320974769907,2.0055602665540873,3.2527801332770436,1.2472198667229564,0,2.3232927779120685,1.0795378663796752E-2,0.25,0.2610208041373801,0.57895537988550994,3.3518933189837516E-4,3.3518933189837516E-4,1.1616453670618325,2.6988399176324394E-3,2.6988399176324394E-3,1.6439052485253383,1.2160910097581192E-2,4.0429119390347164E-2,0.11772287999999999,0,0.17072815142805692,1.6417261847729727,9.8377167600576573E-3,2.2176000000000001E-2,3.2076829312324737E-2,2.2176000000000001E-2,3.4320000000000003E-2,1.0795378663796752E-2,8.3999999999999993E-4,3.7399999999999996E-2,0.17952000000000001,0.14212,3.8239999999999996E-2,0.5723911927910893,27,0.97924042246503662,9.6689675714028471,2.1701214656162371,null,97.92404224650366,0.2610208041373801,0.23712498074038169,0.19337935142805693,4.3402429312324742E-2,1.0795378663796752E-2]
["IQ ",{"$f":"Iq*1000","v":3.4999999999999996E-2},"mA","Quiescent Current Of Controller (Not Switching!)",null,null,26,24,1,2.34,2.34,1.2999999999999998,0.50068973516344484,2.0055686267010371,3.3427843133505184,1.3372156866494813,0,2.4105584677346634,1.1621584252734577E-2,0.25,0.26186504718943521,0.57895779325205599,3.3519212636729038E-4,3.3519212636729038E-4,1.205278087080728,2.9053905343939582E-3,2.9053905343939582E-3,1.7056975027362467,1.3092317868783005E-2,4.2046284165961054E-2,0.11772287999999999,0,0.17331530183938512,1.7033461643267407,1.0590066767672162E-2,2.306304E-2,3.3724535784806137E-2,2.306304E-2,3.5692799999999997E-2,1.1621584252734577E-2,8.3999999999999993E-4,3.7399999999999996E-2,0.17952000000000001,0.14212,3.8239999999999996E-2,0.58076289172712248,28.08,0.97973665621110317,9.8436274919692561,2.2751579892403071,null,97.973665621110314,0.26186504718943521,0.24273263762419126,0.19687254983938512,4.5503159784806138E-2,1.1621584252734577E-2]
["High-side FET","Input Value","Units","Description",null,null,27,24,1,2.4300000000000002,2.4300000000000002,1.35,0.50071626035043537,2.0055769755591539,3.4327884877795771,1.4272115122204232,0,2.4980181979069762,1.2480189834148834E-2,0.25,0.26274251595227577,0.57896020335979659,3.3519491707441703E-4,3.3519491707441703E-4,1.2490078173973285,3.1200410558392764E-3,3.1200410558392764E-3,1.7676303321422335,1.4060326459991682E-2,4.3663448941574944E-2,0.11772287999999999,0,0.17594141414571088,1.7650999761954433,1.1371859429772814E-2,2.3950080000000002E-2,3.5402457784451467E-2,2.3950080000000002E-2,3.7065600000000004E-2,1.2480189834148834E-2,8.3999999999999993E-4,3.7399999999999996E-2,0.17952000000000001,0.14212,3.8239999999999996E-2,0.58927749368950055,29.160000000000004,0.9801918720945576,10.020235507285543,2.3817052892225736,null,98.019187209455765,0.26274251595227577,0.24840947193016236,0.20040471014571087,4.7634105784451472E-2,1.2480189834148834E-2]
["RdsonTop",{"$f":"Rdson1*1000","v":4.5},"mW","Drain-Source Resistance of Top FET ",null,null,28,24,1,2.52,2.52,1.4,0.500742785308674,2.0055853131285866,3.5227926565642935,1.5172073434357067,0,2.5856522782500662,1.3371195408039516E-2,0.25,0.26365322411040265,0.57896261020877471,3.3519770401975761E-4,3.3519770401975761E-4,1.2928247125422763,3.3427914747200384E-3,3.3427914747200384E-3,1.8296898140843791,1.5064941670938583E-2,4.5280613717188826E-2,0.11772287999999999,0,0.17860657491475476,1.8269736966512757,1.2183090042133042E-2,2.4837120000000001E-2,3.711063448241704E-2,2.4837120000000001E-2,3.8438400000000005E-2,1.3371195408039516E-2,8.3999999999999993E-4,3.7399999999999996E-2,0.17952000000000001,0.14212,3.8239999999999996E-2,0.59793513809435384,30.240000000000002,0.98061040288797674,10.198795945737739,2.4897653241208522,null,98.06104028879767,0.26365322411040265,0.2541556093971718,0.20397591891475478,4.9795306482417041E-2,1.3371195408039516E-2]
["RdsonTopTc",{"$f":"RdsonTopTc*1000000","v":4000},"ppm","Drain to Source Resistance Temp Co",null,null,29,24,1,2.61,2.61,1.45,0.50076931003816338,2.0055936394094798,3.61279681970474,1.60720318029526,0,2.6734435634969578,1.4294600974406624E-2,0.25,0.26459718586968328,0.5789650137990322,3.3520048720331352E-4,3.3520048720331352E-4,1.3367201995022249,3.573641783514536E-3,3.573641783514536E-3,1.891863825335278,1.6106169301255038E-2,4.6897778492802709E-2,0.11772287999999999,0,0.18131087251583741,1.8889552015839552,1.3023753900607445E-2,2.5724159999999999E-2,3.8849106140132976E-2,2.5724159999999999E-2,3.9811199999999998E-2,1.4294600974406624E-2,8.3999999999999993E-4,3.7399999999999996E-2,0.17952000000000001,0.14212,3.8239999999999996E-2,0.60673596777077832,31.32,0.9809959913101276,10.37931322579187,2.5993401070066486,null,98.099599131012766,0.26459718586968328,0.25997117865597041,0.20758626451583742,5.1986802140132973E-2,1.4294600974406624E-2]
["QgTop",{"$f":"Qg_Q1*1000000000","v":8},"nC","Gate Charge Of Top FET",null,null,30,24,1,2.7,2.7,1.5000000000000002,0.50079583453890653,2.0056019544019787,3.7028009772009893,1.6971990227990108,0,2.7613770598426228,1.5250406533250176E-2,0.25,0.26557441595790526,0.57896741413061104,3.3520326662508649E-4,3.3520326662508649E-4,1.3806867809948264,3.8125919744277119E-3,3.8125919744277119E-3,1.9541417639051439,1.7184015150472381E-2,4.8514943268416606E-2,0.11772287999999999,0,0.18405439712864291,1.9510338882722618,1.3893846301131749E-2,2.6611200000000002E-2,4.0617914112281467E-2,2.6611200000000002E-2,4.1183999999999998E-2,1.5250406533250176E-2,8.3999999999999993E-4,3.7399999999999996E-2,0.17952000000000001,0.14212,3.8239999999999996E-2,0.61568012897313262,32.400000000000006,0.98135188714671251,10.561791856432146,2.7104317056140732,null,98.135188714671244,0.26557441595790526,0.26585631124092435,0.21123583712864291,5.4208634112281467E-2,1.5250406533250176E-2]
["QgdTop",{"$f":"Qgd_Q1*1000000000","v":3.1},"nC","Gate to Drain Charge",null,null,31,24,1,2.79,2.79,1.55,0.50082235881090653,2.0056102581062305,3.7928051290531153,1.7871948709468848,0,2.8494396014453578,1.6238612084570159E-2,0.25,0.26658492962535246,0.57896981120355351,3.3520604228507838E-4,3.3520604228507838E-4,1.4247178737194193,4.0596420393911661E-3,4.0596420393911661E-3,2.0165143203074107,1.8298485018021862E-2,5.0132108044030489E-2,0.11772287999999999,0,0.18683724075219485,2.0132004466222981,1.4793362539722807E-2,2.749824E-2,4.2417100849874038E-2,2.749824E-2,4.2556800000000006E-2,1.6238612084570159E-2,8.3999999999999993E-4,3.7399999999999996E-2,0.17952000000000001,0.14212,3.8239999999999996E-2,0.6247677713936679,33.480000000000004,0.98168092579953847,10.746236437609742,2.8230422424937021,null,98.16809257995385,0.26658492962535246,0.27181114160206887,0.21492472875219484,5.6460844849874042E-2,1.6238612084570159E-2]
["QgsTop",{"$f":"Qgs_Q1*1000000000","v":2.9},"nC",null,null,null,32,{"$f":"Vin","v":24},{"$f":"MODE","v":1},2.88,{"$f":"Iout*G41/100/Number_of_Phases","v":2.88},{"$f":"Vout*K41/(Vin*Efficiency)","v":1.6},{"$f":"(Vout+(Rdson2+Rs+Rdcr)*K41)/(Vin+(Rs+Rdson2-Rdson1)*K41)","v":0.50084888285416607},{"$f":"(Vin-(Rdson1+Rdcr)*K41-Vout)*M41/(Fsw*Lf)","v":2.0056185505223811},3.8828092752611907,1.8771907247388093,{"$f":"IF(MIN(Vin, -P41/(Coss_Q1+Coss_Q2)*0.00000002)<0, 0, MIN(Vin, -P41/(Coss_Q1+Coss_Q2)*0.00000002))","v":0},2.9376195829588436,{"$f":"R41^2*Rdcr","v":1.7259217628366581E-2},{"$f":"Core_Loss_Ch1","v":0.25},{"$f":"(T41+S41*(1+Ltc*(Ta-25)))/(1-S41*Ltc*ThetaCa)","v":0.26762874264540043},0.57897220501790192,3.3520881418329146E-4,3.3520881418329146E-4,1.4688076746230556,4.3147919700631757E-3,4.3147919700631757E-3,2.0789732884412357,{"$f":"Rdson1*AB41^2","v":1.9449584703234744E-2},{"$f":"(Vin*K41/2)*Fsw*(Tr_buck+Tf_buck)","v":5.1749272819644379E-2},{"$f":"(0.5*Coss_Q1*(Vin-Q41)^2-0.5*Coss_Q2*(Vin-Q41)^2+(Qoss_Q2*(Vin-Q41)/Vin)*Vin)*Fsw","v":0.11772287999999999},{"$f":"IF(K41>N41/2,0,ABS(K41-N41/2)*Vsd_Q1*Deadtime*Fsw)","v":0},{"$f":"(AF41+AE41+AD41+AC41*(1+RdsonTopTc*Ta-RdsonTopTc*25))/(1-AC41*RdsonTopTc*ThetaJA_Q1)","v":0.18965949721404662},{"$f":"SQRT((1-M41))*SQRT(K41^2+(N41^2)/12)","v":2.0754466700281955},{"$f":"Rdson2*AH41^2","v":1.5722297912478606E-2},{"$f":"IF(K41<N41/2,Deadtime*Fsw*IF(VfdSky_Q2>0,0,Vsd_Q2)*(K41+N41/2),2*Deadtime*Fsw*IF(VfdSky_Q2>0,0,Vsd_Q2)*K41)","v":2.8385279999999999E-2},{"$f":"(AJ41+AI41*(1+RdsonBotTc*Ta-RdsonBotTc*25))/(1-AI41*RdsonBotTc*ThetaJA_Q2)","v":4.4246709903428348E-2},{"$f":"2*Deadtime*Fsw*IF(VfdSky_Q2>0,VfdSky_Q2,Vsd_Q2)*K41","v":2.8385279999999999E-2},{"$f":"IF(QrrSky_Q2>0,QrrSky_Q2,Qrr_Q2*K41/(Iout/Number_of_Phases))*Fsw*Vin","v":4.3929600000000006E-2},{"$f":"Rs*R41^2","v":1.7259217628366581E-2},{"$f":"Iq*Vin","v":8.3999999999999993E-4},{"$f":"IF(Ext_VCC=1,  (Qg_Q1+Qg_Q2)*Fsw*VCC, (Qg_Q1+Qg_Q2)*Fsw*Vin)","v":3.7399999999999996E-2},0.17952000000000001,{"$f":"(Qg_Q1+Qg_Q2)*Fsw*(Vin-VCC)","v":0.14212},{"$f":"SUM(AO41:AP41)","v":3.8239999999999996E-2},{"$f":" SUM(U41,X41,AA41,AG41,AK41,AL41,AM41,AS41,AN41)","v":0.63399904817548847},{"$f":"Vout*K41","v":34.56},0.98198559227930771,{"$f":"ThetaJA_Q1*BC41","v":10.932651660702332},{"$f":"ThetaJA_Q2*BD41","v":2.9371738951714175},null,98.198559227930772,{"$f":"U41","v":0.26762874264540043},{"$f":"AG41+AK41+AM41","v":0.27783580711747496},{"$f":"AG41+AM41*0.66","v":0.21865303321404664},{"$f":"AK41+AM41*0.33","v":5.8743477903428348E-2},{"$f":"AN41","v":1.7259217628366581E-2}]
["RGateTop",{"$f":"Rgate1","v":0},"W","Gate Resistance",null,null,33,24,1,{"$f":"Iout*G42/100","v":2.97},2.97,1.65,0.50087540666868846,2.0056268316505759,3.9728134158252884,1.9671865841747123,0,3.0259067372144384,1.8312223164639457E-2,0.25,0.26870587131513313,0.57897459557369813,3.352115823197273E-4,3.352115823197273E-4,1.5129510497416483,4.578041757828711E-3,4.578041757828711E-3,2.1415114083978826,2.0637320005342269E-2,5.3366437595258262E-2,0.11772287999999999,0,0.19252126217968743,2.1377652981610131,1.6680647715578277E-2,2.9272320000000001E-2,4.6106785926244932E-2,2.9272320000000001E-2,4.5302400000000007E-2,1.8312223164639457E-2,8.3999999999999993E-4,3.7399999999999996E-2,0.17952000000000001,0.14212,3.8239999999999996E-2,0.64337411592585336,35.64,0.98226807369484814,11.121042308984372,3.052828896312247,null,98.226807369484817,0.26870587131513313,0.28393044810593238,0.22242084617968744,6.1056577926244936E-2,1.8312223164639457E-2]
["GfsTop",{"$f":"Gfs_Q1","v":71},"S","Transconductance of Top FET",null,null,34,24,1,3.06,3.06,1.6999999999999997,0.50090193025447638,2.0056351014909608,4.0628175507454802,2.0571824492545199,0,3.1142919494958061,1.9397628693388781E-2,0.25,0.26981633245598025,0.57897698287098431,3.3521434669438806E-4,3.3521434669438806E-4,1.5571434413372829,4.8493913937994321E-3,4.8493913937994321E-3,2.2041222351401086,2.1861696723475627E-2,5.4983602370872145E-2,0.11772287999999999,0,0.19542263316216663,2.2001498856340129,1.7668407245282066E-2,3.015936E-2,4.7997374677784366E-2,3.015936E-2,4.66752E-2,1.9397628693388781E-2,8.3999999999999993E-4,3.7399999999999996E-2,0.17952000000000001,0.14212,3.8239999999999996E-2,0.65289313472981392,36.72,0.98253030258117491,11.311413258108331,3.1700095338892185,null,98.253030258117491,0.26981633245598025,0.29009520783995102,0.22622826516216663,6.3400190677784365E-2,1.9397628693388781E-2]
["VthTop",{"$f":"Vth_Q1","v":3.2},"V","Threshold Voltage of Top FET",null,null,35,24,1,3.15,3.15,1.7499999999999998,0.50092845361153304,2.0056433600436829,4.1528216800218409,2.1471783199781584,0,3.2027671016337225,2.0515434214614551E-2,0.25,0.27096014341437458,0.57897936690980301,3.352171073072763E-4,3.352171073072763E-4,1.6013807899456194,5.1288408688137119E-3,5.1288408688137119E-3,2.2668000282662786,2.3122720656666002E-2,5.6600767146486028E-2,0.11772287999999999,0,0.19836370953193744,2.2625946917553028,1.8685571797931348E-2,3.1046399999999998E-2,4.9918523027145424E-2,3.1046399999999998E-2,4.8048000000000007E-2,2.0515434214614551E-2,8.3999999999999993E-4,3.7399999999999996E-2,0.17952000000000001,0.14212,3.8239999999999996E-2,0.662556268164193,37.799999999999997,0.98277399287907963,11.503769476596872,3.2887181513572714,null,98.277399287907969,0.27096014341437458,0.29633023255908286,0.23007538953193746,6.5774363027145427E-2,2.0515434214614551E-2]
["VspTop",{"$f":"Vsp_Q1","v":3.3267605633802817},"V",null,null,null,36,24,1,3.24,3.24,1.8,0.50095497673986111,2.0056516073088879,4.2428258036544442,2.2371741963455563,0,3.2913249405305449,2.1665639728316789E-2,0.25,0.27213732206243152,0.57898174769019606,3.3521986415839381E-4,3.3521986415839381E-4,1.6456594686381276,5.4163901734366488E-3,5.4163901734366488E-3,2.3295396590478075,2.4420397603844585E-2,5.8217931922099918E-2,0.11772287999999999,0,0.2013445925269228,2.3250945875559172,1.9732136669948646E-2,3.193344E-2,5.1870278956644818E-2,3.193344E-2,4.9420800000000001E-2,2.1665639728316789E-2,8.3999999999999993E-4,3.7399999999999996E-2,0.17952000000000001,0.14212,3.8239999999999996E-2,0.6723636833119111,38.880000000000003,0.98300066998029756,11.69811602634614,3.4089571478322407,null,98.300066998029763,0.27213732206243152,0.30263567148356763,0.23396232052692281,6.8179142956644817E-2,2.1665639728316789E-2]
["VsdTop",{"$f":"Vsd_Q1","v":0.8},"V",null,null,null,37,24,1,3.33,3.33,1.8499999999999999,0.50098149963946381,2.0056598432867214,4.332829921643361,2.3271700783566391,0,3.379958966799411,2.2848245234495482E-2,0.25,0.27334788679864802,0.57898412521220566,3.3522261724774308E-4,3.3522261724774308E-4,1.689976227341685,5.7120392979600693E-3,5.7120392979600693E-3,2.3923365316890282,2.5754733363842493E-2,5.9835096697713808E-2,0.11772287999999999,0,0.20436538526280476,2.3876449770419916,2.0808097157837564E-2,3.2820479999999999E-2,5.3852691565498753E-2,3.2820479999999999E-2,5.0793600000000001E-2,2.2848245234495482E-2,8.3999999999999993E-4,3.7399999999999996E-2,0.17952000000000001,0.14212,3.8239999999999996E-2,0.68231555077665484,39.96,0.98321169594965119,11.894458063140238,3.5307289782749378,null,98.321169594965113,0.27334788679864802,0.30901167682830349,0.23788916126280477,7.0614579565498756E-2,2.2848245234495482E-2]
["θJATop",{"$f":"ThetaJA_Q1","v":50},"°C/W","Junction to Ambient Resistance",null,null,38,24,1,3.42,3.42,1.9,0.50100802231034391,2.0056680679773287,4.4228340339886643,2.4171659660113356,0,3.4686633400454596,2.4063250733150646E-2,0.25,0.2745918565486235,0.57898649947587366,3.352253665753259E-4,3.352253665753259E-4,1.7343281454791866,6.0157882324025497E-3,6.0157882324025497E-3,2.4551865163540771,2.712573373539091E-2,6.1452261473327691E-2,0.11772287999999999,0,0.20742619274354002,2.4502417302152972,2.1913448558182856E-2,3.3707519999999998E-2,5.5865811073607385E-2,3.3707519999999998E-2,5.2166400000000002E-2,2.4063250733150646E-2,8.3999999999999993E-4,3.7399999999999996E-2,0.17952000000000001,0.14212,3.8239999999999996E-2,0.69241204469789941,41.04,0.98340829080388925,12.092800837177,3.6540361536803694,null,98.340829080388929,0.2745918565486235,0.3154584038171474,0.24185601674354001,7.3080723073607384E-2,2.4063250733150646E-2]
["Low-side FET","Input Value","Units","Description",null,null,39,24,1,3.51,3.51,1.9499999999999997,0.50103454475250442,2.0056762813808571,4.5128381406904285,2.507161859309571,0,3.557432797979625,2.5310656224282288E-2,0.25,0.27586925076580099,0.5789888704812427,3.3522811214114524E-4,3.3522811214114524E-4,1.7787125915264417,6.3276369665094204E-3,6.3276369665094204E-3,2.5180858919743403,2.8533404517120938E-2,6.3069426248941574E-2,0.11772287999999999,0,0.21052712187210287,2.5128811258754236,2.304818616765042E-2,3.4594559999999996E-2,5.7909688825442313E-2,3.4594559999999996E-2,5.3539200000000009E-2,2.5310656224282288E-2,8.3999999999999993E-4,3.7399999999999996E-2,0.17952000000000001,0.14212,3.8239999999999996E-2,0.702653342766279,42.12,0.98359155054821068,12.293149693605143,3.7788812412721153,null,98.359155054821073,0.27586925076580099,0.32197601069754522,0.24586299387210286,7.5577624825442308E-2,2.5310656224282288E-2]
["RdsonBot",{"$f":"Rdson2*1000","v":3.65},"mW","Drain-Source Resistance of Low-side FET",null,null,40,24,1,3.6,3.6,2,0.50106106696594843,2.0056844834974528,4.6028422417487267,2.5971577582512735,0,3.646262587080805,2.6590461707890409E-2,0.25,0.27718008943222938,0.57899123822835497,3.3523085394520372E-4,3.3523085394520372E-4,1.8231271883432583,6.6475854897527888E-3,6.6475854897527888E-3,2.5810312972213998,2.9977751507563714E-2,6.468659102455547E-2,0.11772287999999999,0,0.21366828146145914,2.5755598025883271,2.42123052829872E-2,3.5481600000000002E-2,5.9984377294037827E-2,3.5481600000000002E-2,5.4912000000000002E-2,2.6590461707890409E-2,8.3999999999999993E-4,3.7399999999999996E-2,0.17952000000000001,0.14212,3.8239999999999996E-2,0.71303962623931472,43.2,0.98376246253258104,12.495510073072957,3.9052668647018915,null,98.376246253258103,0.27718008943222938,0.32856465875549695,0.24991020146145915,7.8105337294037833E-2,2.6590461707890409E-2]
["RdsonBotTc",{"$f":"RdsonBotTc*1000000","v":4000},"ppm","Drain To Source Resitance Temp Co",null,null,41,24,1,3.69,3.69,2.0499999999999998,0.50108758895067862,2.0056926743272601,4.6928463371636298,2.6871536628363701,0,3.7351484029403039,2.7902667183975004E-2,0.25,0.27852439305934729,0.57899360271725209,3.3523359198750312E-4,3.3523359198750312E-4,1.8675697833456624,6.9756337913315283E-3,6.9756337913315283E-3,2.6440196883260207,3.1458780505150323E-2,6.6303755800169353E-2,0.11772287999999999,0,0.21684978224577153,2.6382747165016527,2.5405801201021348E-2,3.6368640000000001E-2,6.2089930085086752E-2,3.6368640000000001E-2,5.6284799999999996E-2,2.7902667183975004E-2,8.3999999999999993E-4,3.7399999999999996E-2,0.17952000000000001,0.14212,3.8239999999999996E-2,0.7235710799574997,44.28,0.98392191858126243,12.699887512288576,4.0331957042543376,null,98.392191858126239,0.27852439305934729,0.33522451233085826,0.25399775024577154,8.0663914085086746E-2,2.7902667183975004E-2]
["QgBot",{"$f":"Qg_Q2*1000000000","v":9},"nC","Gate Charge Of Top FET",null,null,42,24,1,3.78,3.78,2.0999999999999996,0.50111411070669831,2.0057008538704264,4.7828504269352132,2.7771495730647864,0,3.8240863387570165,2.9247272652536085E-2,0.25,0.27990218268878719,0.57899596394797648,3.3523632626804653E-4,3.3523632626804653E-4,1.9120384227534915,7.3117818601713194E-3,7.3117818601713194E-3,2.7070483026602941,3.2976497308211901E-2,6.7920920575783236E-2,0.11772287999999999,0,0.22007173689184059,2.7010231049237738,2.6628669218662034E-2,3.7255679999999999E-2,6.422640194114114E-2,3.7255679999999999E-2,5.7657600000000003E-2,2.9247272652536085E-2,8.3999999999999993E-4,3.7399999999999996E-2,0.17952000000000001,0.14212,3.8239999999999996E-2,0.7342478923607445,45.36,0.98407072626338632,12.90628764459203,4.1626704970570572,null,98.407072626338632,0.27990218268878719,0.34195573883298169,0.25812575289184059,8.3253409941141138E-2,2.9247272652536085E-2]
["RGateBot",{"$f":"Rgate2","v":0},"W","Gate Resistance",null,null,43,24,1,3.87,3.87,2.15,0.50114063223401006,2.005709022127097,4.8728545110635491,2.8671454889364516,0,3.9130728407208109,3.0624278113573673E-2,0.25,0.28131347989320138,0.57899832192057032,3.3523905678683639E-4,3.3523905678683639E-4,1.9565313292820845,7.6560296849246413E-3,7.6560296849246413E-3,2.7701146271902242,3.4530907714979554E-2,6.9538085351397119E-2,0.11772287999999999,0,0.22333426001078177,2.7638024547737858,2.7880904632899658E-2,3.8142720000000005E-2,6.6393848745918888E-2,3.8142720000000005E-2,5.9030400000000004E-2,3.0624278113573673E-2,8.3999999999999993E-4,3.7399999999999996E-2,0.17952000000000001,0.14212,3.8239999999999996E-2,0.74507025550518735,46.44,0.98420961860455725,13.114716200539089,4.2936940372959445,null,98.420961860455719,0.28131347989320138,0.34875850875670061,0.26229432401078179,8.5873880745918896E-2,3.0624278113573673E-2]
["VsdBot",{"$f":"Vsd_Q2","v":0.8},"V","Diode Forward Voltage of Bottom FET Body Diode",null,null,44,24,1,3.96,3.96,2.1999999999999997,0.5011671535326172,2.0057171790974189,4.9628585895487092,2.9571414104512908,0,4.0021046692389088,3.2033683567087752E-2,0.25,0.28275830677710884,0.57900067663507582,3.3524178354387563E-4,3.3524178354387563E-4,2.0010468827554728,8.0083772539707911E-3,8.0083772539707911E-3,2.8332163710597484,3.6122017523584363E-2,7.1155250127011016E-2,0.11772287999999999,0,0.22663746816994243,2.8266104751633012,2.9162502740805597E-2,3.9029760000000004E-2,6.8592327528716482E-2,3.9029760000000004E-2,6.0403200000000004E-2,3.2033683567087752E-2,8.3999999999999993E-4,3.7399999999999996E-2,0.17952000000000001,0.14212,3.8239999999999996E-2,0.75603836508037014,47.519999999999996,0.98433926248539816,13.32517900849712,4.4262691764358246,null,98.433926248539819,0.28275830677710884,0.35563299569865892,0.26650358016994241,8.8525383528716486E-2,3.2033683567087752E-2]
["QrrBot",{"$f":"Qrr_Q2*1000000000","v":13},"nC","Reverse Recovery Charge of Body Diode",null,null,45,24,1,4.05,4.05,2.2499999999999996,0.5011936746025224,2.0057253247815368,5.0528626623907682,3.0471373376092314,0,4.0911788651364489,3.3475489013078327E-2,0.25,0.2842366859777633,0.57900302809153492,3.3524450653916679E-4,3.3524450653916679E-4,2.0455836032066599,8.3688245554158838E-3,8.3688245554158838E-3,2.896351441691865,3.7749832532057444E-2,7.2772414902624885E-2,0.11772287999999999,0,0.22998147990506046,2.8894450734957076,3.0473458839532442E-2,3.9916800000000002E-2,7.0821896468929141E-2,3.9916800000000002E-2,6.1775999999999998E-2,3.3475489013078327E-2,8.3999999999999993E-4,3.7399999999999996E-2,0.17952000000000001,0.14212,3.8239999999999996E-2,0.76715242042678622,48.599999999999994,0.98446026592959079,13.537681995253022,4.560398823446457,null,98.446026592959086,0.2842366859777633,0.36257937637398957,0.27075363990506046,9.1207976468929142E-2,3.3475489013078327E-2]
["TrrBot",{"$f":"Trr_Q2*1000000000","v":40},"ns","Reverse Recovery Time of Body Diode",null,null,46,24,1,4.1399999999999997,4.1399999999999997,2.2999999999999994,0.50122019544372887,2.0057334591795972,5.1428667295897981,3.1371332704102013,0,4.1802927201061779,3.4949694451545422E-2,0.25,0.28574864066604327,0.57900537628998994,3.3524722577271281E-4,3.3524722577271281E-4,2.0901401361024687,8.7373715770928933E-3,8.7373715770928933E-3,2.9595179238942109,3.9414358538329947E-2,7.4389579678238768E-2,0.11772287999999999,0,0.23336641573266717,2.9523043345701354,3.1813768226313877E-2,4.0803840000000001E-2,7.3082614900678508E-2,4.0803840000000001E-2,6.3148800000000005E-2,3.4949694451545422E-2,8.3999999999999993E-4,3.7399999999999996E-2,0.17952000000000001,0.14212,3.8239999999999996E-2,0.7784126245538,49.679999999999993,0.98457318444902853,13.75223118663336,4.6960859450339258,null,98.457318444902853,0.28574864066604327,0.36959783063334567,0.27504462373266719,9.3921718900678519E-2,3.4949694451545422E-2]
["θJABot",{"$f":"ThetaJA_Q2","v":50},"°C/W","Junction to Ambient Resistance",null,null,47,24,1,4.2300000000000004,4.2300000000000004,2.35,0.50124671605623938,2.0057415822917473,5.2328707911458743,3.2271292088541266,0,4.2694437507999234,3.6456299882489038E-2,0.25,0.28729419454736244,0.57900772123048316,3.3524994124451693E-4,3.3524994124451693E-4,2.1347152393892768,9.1140183065616352E-3,9.1140183065616352E-3,3.0227140615396535,4.1115601340232968E-2,7.6006744453852679E-2,0.11772287999999999,0,0.23679239816273698,3.0151865022606765,3.3183426198464649E-2,4.1690880000000007E-2,7.5374543317548837E-2,4.1690880000000007E-2,6.4521600000000012E-2,3.6456299882489038E-2,8.3999999999999993E-4,3.7399999999999996E-2,0.17952000000000001,0.14212,3.8239999999999996E-2,0.78981918415794328,50.760000000000005,0.98467852658539168,13.96883270813685,4.8333335658774423,null,98.467852658539172,0.28729419454736244,0.3766885414802858,0.27937665416273699,9.6666671317548844E-2,3.6456299882489038E-2]
["Bottom Schottky","Input Value","Units","Std Units",null,null,48,24,1,4.32,4.32,2.4,0.50127323644005695,2.0057496941181308,5.3228748470590652,3.3171251529409349,0,4.3586296760512449,3.7995305305909159E-2,0.25,0.28887337186260253,0.57901006291305623,3.3525265295458138E-4,3.3525265295458138E-4,2.1793077721043415,9.4987647311087775E-3,9.4987647311087775E-3,3.0859382414608652,4.2853566735497596E-2,7.7623909229466562E-2,0.11772287999999999,0,0.24025955171158678,3.0780899634097771,3.4582428053380618E-2,4.2577920000000005E-2,7.769774337743264E-2,4.2577920000000005E-2,6.5894400000000006E-2,3.7995305305909159E-2,8.3999999999999993E-4,3.7399999999999996E-2,0.17952000000000001,0.14212,3.8239999999999996E-2,0.80137230964159445,51.84,0.98477675876442117,14.187492785579339,4.9721447688716323,null,98.47767587644212,0.28887337186260253,0.38385169508901945,0.28374985571158678,9.9442895377432644E-2,3.7995305305909159E-2]
["VfdSky",{"$f":"VfdSky_Q2","v":0},"V","Diode Forward Voltage",null,null,49,24,1,4.41,4.41,2.4499999999999997,0.50129975659518444,2.0057577946588943,5.4128788973294473,3.407121102670553,0,4.4478483967984914,3.9566710721805821E-2,0.25,0.2904861973890675,0.57901240133775134,3.3525536090290924E-4,3.3525536090290924E-4,2.2239166843373295,9.8916108377478818E-3,9.8916108377478818E-3,3.1491889792542884,4.4628260521754996E-2,7.9241074005080445E-2,0.11772287999999999,0,0.2437680029150274,3.1410132336311865,3.6010769088538785E-2,4.3464960000000004E-2,8.0052277907486383E-2,4.3464960000000004E-2,6.7267199999999999E-2,3.9566710721805821E-2,8.3999999999999993E-4,3.7399999999999996E-2,0.17952000000000001,0.14212,3.8239999999999996E-2,0.81307221513203776,52.92,0.98486830956032578,14.40821774575137,5.1125226953743192,null,98.486830956032577,0.2904861973890675,0.39108748082251377,0.2881643549150274,0.10225045390748638,3.9566710721805821E-2]
["QrrSky",{"$f":"QrrSky_Q2*1000000000","v":0},"nC","Diode Reverse Recovery Charge",null,null,50,24,1,4.5,4.5,2.5,0.50132627652162498,2.0057658839141852,5.5028829419570924,3.4971170580429076,0,4.5370979783435912,4.1170516130179004E-2,0.25,0.29213269644145867,0.57901473650461133,3.3525806508950454E-4,3.3525806508950454E-4,2.2685410083597111,1.029255661321939E-2,1.029255661321939E-2,3.2124649067356472,4.6439688496536312E-2,8.0858238780694328E-2,0.11772287999999999,0,0.24731788034176971,3.2039549447645848,3.7468444601497231E-2,4.4352000000000003E-2,8.2438210909196785E-2,4.4352000000000003E-2,6.8640000000000007E-2,4.1170516130179004E-2,8.3999999999999993E-4,3.7399999999999996E-2,0.17952000000000001,0.14212,3.8239999999999996E-2,0.82491911850091304,54,0.9849535734522854,14.631014017088487,5.2544705454598395,null,98.495357345228541,0.29213269644145867,0.39839609125096653,0.29262028034176973,0.1050894109091968,4.1170516130179004E-2]
["Ireverse",{"$f":"Ireverse","v":0},"mA","Reverse Leakage Current",null,null,51,24,1,4.59,4.59,2.5499999999999998,0.50135279621938145,2.0057739618841488,5.5928869809420743,3.5871130190579255,0,4.6263766346369133,4.2806721531028741E-2,0.25,0.2938128948728726,0.57901706841367773,3.3526076551436954E-4,3.3526076551436954E-4,2.3131798507671899,1.0701602043990639E-2,1.0701602043990639E-2,3.2757647608280469,4.8287856457272738E-2,8.2475403556308224E-2,0.11772287999999999,0,0.25090931460708887,3.2669138337629202,3.8955449889895126E-2,4.5239040000000001E-2,8.4855607563558894E-2,4.5239040000000001E-2,7.00128E-2,4.2806721531028741E-2,8.3999999999999993E-4,3.7399999999999996E-2,0.17952000000000001,0.14212,3.8239999999999996E-2,0.83691324138405421,55.08,0.9850329141422518,14.855888130354444,5.3979915781779448,null,98.503291414225174,0.2938128948728726,0.40577772217064778,0.29711776260708889,0.1079598315635589,4.2806721531028741E-2]
["Controller","Input Value","Units","Std Units",null,null,52,24,1,4.68,4.68,2.5999999999999996,0.50137931568845684,2.0057820285689303,5.6828910142844649,3.6771089857155346,0,4.7156827143243536,4.4475326924355012E-2,0.25,0.29552681907581996,0.57901939706499284,3.3526346217750789E-4,3.3526346217750789E-4,2.3578323855032477,1.1118747116255871E-2,1.1118747116255871E-2,3.3390873736961058,5.0172770201295402E-2,8.4092568331922107E-2,0.11772287999999999,0,0.25454243838674867,3.3298887328258804,4.0471780251452726E-2,4.612608E-2,8.7304534236366652E-2,4.612608E-2,7.1385599999999994E-2,4.4475326924355012E-2,8.3999999999999993E-4,3.7399999999999996E-2,0.17952000000000001,0.14212,3.8239999999999996E-2,0.8490548092017236,56.16,0.9851066674926755,15.082846719337434,5.5430891118183325,null,98.510666749267557,0.29552681907581996,0.4132325726231153,0.30165693438674868,0.11086178223636665,4.4475326924355012E-2]
["θJA",30,"°C/W","Junction to Ambient Resistance",null,null,53,24,1,4.7699999999999996,4.7699999999999996,2.6499999999999995,0.50140583492885404,2.0057900839686762,5.7728950419843379,3.7671049580156613,0,4.8050146883312355,4.6176332310157837E-2,0.25,0.29727449598326644,0.57902172245859862,3.3526615507892244E-4,3.3526615507892244E-4,2.4024978476510936,1.1543991815936275E-2,1.1543991815936275E-2,3.4024316639667367,5.209443552583555E-2,8.5709733107535976E-2,0.11772287999999999,0,0.25821738643118936,3.3928785606200917,4.2017430983971447E-2,4.7013119999999999E-2,8.9785058483616897E-2,4.7013119999999999E-2,7.2758400000000001E-2,4.6176332310157837E-2,8.3999999999999993E-4,3.7399999999999996E-2,0.17952000000000001,0.14212,3.8239999999999996E-2,0.86134405117924584,57.239999999999995,0.98517514413400631,15.311896521559468,5.6897665241808451,null,98.517514413400633,0.29727449598326644,0.42076084491480625,0.30623793043118935,0.1137953304836169,4.6176332310157837E-2]
["Theta Ja",2,"°C/W","Junction to Ambient Resistance",null,null,54,24,1,4.8600000000000003,4.8600000000000003,2.7,0.50143235394057606,2.0057981280835326,5.8628990640417662,3.857100935958234,0,4.8943711387898059,4.7909737688437239E-2,0.25,0.29905595306969601,0.5790240445945376,3.3526884421861711E-4,3.3526884421861711E-4,2.4471755278974117,1.1977336128679952E-2,1.1977336128679952E-2,3.4657966288999575,5.4052858228024393E-2,8.7326897883149887E-2,0.11772287999999999,0,0.26193429557998271,3.4558823144494246,4.3592397385333735E-2,4.7900160000000004E-2,9.2297249057027145E-2,4.7900160000000004E-2,7.4131200000000008E-2,4.7909737688437239E-2,8.3999999999999993E-4,3.7399999999999996E-2,0.17952000000000001,0.14212,3.8239999999999996E-2,0.87378120036804163,58.320000000000007,0.9852386317844718,15.543044378999134,5.8380272528513579,null,98.523863178447186,0.29905595306969601,0.42836274463700985,0.3108608875799827,0.11676054505702715,4.7909737688437239E-2]
[null,null,null,null,null,null,55,24,1,4.95,4.95,2.75,0.50145887272362588,2.0058061609136457,5.9529030804568226,3.9470969195431773,0,4.9837507491443223,4.9675543059193188E-2,0.25,0.30087121835219532,0.57902636347285164,3.3527152959659493E-4,3.3527152959659493E-4,2.4918647675849042,1.2418780039861937E-2,1.2418780039861937E-2,3.5291813373923526,5.6048044104893127E-2,8.8944062658763784E-2,0.11772287999999999,0,0.26569330477655512,3.5188990632580124,4.5196674753503127E-2,4.8787200000000003E-2,9.4841175909668951E-2,4.8787200000000003E-2,7.5504000000000016E-2,4.9675543059193188E-2,8.3999999999999993E-4,3.7399999999999996E-2,0.17952000000000001,0.14212,3.8239999999999996E-2,0.88636649366707132,59.400000000000006,0.98529739731851018,15.776297238827757,5.9878747954834477,null,98.529739731851024,0.30087121835219532,0.43603848068622408,0.31552594477655516,0.11975749590966896,4.9675543059193188E-2]
[null,null,null,null,null,null,56,24,1,5.04,5.04,2.8,0.5014853912780064,2.0058141824591611,6.0429070912295808,4.0370929087704193,0,5.0731522952906571,5.1473748422425733E-2,0.25,0.30272032039156105,0.57902867909358291,3.3527421121285947E-4,3.3527421121285947E-4,2.5365649542820963,1.2868323534584267E-2,1.2868323534584267E-2,3.592584923712022,5.807999895337311E-2,9.0561227434377653E-2,0.11772287999999999,0,0.26949455508318498,3.5819279413648104,4.6830258386524319E-2,4.9674240000000001E-2,9.7416910201716972E-2,4.9674240000000001E-2,7.6876800000000009E-2,5.1473748422425733E-2,8.3999999999999993E-4,3.7399999999999996E-2,0.17952000000000001,0.14212,3.8239999999999996E-2,0.89910017184468582,60.480000000000004,0.98535168861505862,16.01166215415925,6.1393127100858491,null,98.535168861505866,0.30272032039156105,0.44378826528490195,0.32023324308318502,0.12278625420171697,5.1473748422425733E-2]
["Outputs",null,null,null,null,null,57,24,1,5.13,5.13,2.85,0.5015119096037205,2.005822192720224,6.1329110963601119,4.1270889036398879,0,5.1625746376267934,5.3304353778134833E-2,0.25,0.30460328829342886,0.57903099145677339,3.35276889067414E-4,3.35276889067414E-4,2.5812755178085793,1.33259665976759E-2,1.33259665976759E-2,3.6560065818776022,6.0148728570295566E-2,9.2178392209991536E-2,0.11772287999999999,0,0.27333818969627449,3.6449681428422758,4.8493143582523004E-2,5.056128E-2,0.10002452430631495,5.056128E-2,7.8249600000000002E-2,5.3304353778134833E-2,8.3999999999999993E-4,3.7399999999999996E-2,0.17952000000000001,0.14212,3.8239999999999996E-2,0.9119824795608964,61.56,0.985401736212561,16.249146284813726,6.2923446153157485,null,98.540173621256102,0.30460328829342886,0.4516123140025895,0.32498292569627452,0.12584689230631496,5.3304353778134833E-2]
["Design","Value","Units",null,null,null,58,24,1,5.22,5.22,2.9,0.50153842770077128,2.005830191696981,6.2229150958484905,4.2170849041515091,0,5.2520167139071692,5.5167359126320523E-2,0.25,0.3065201517094252,0.57903330056246538,3.3527956316026236E-4,3.3527956316026236E-4,2.6259959266621875,1.3791709213692802E-2,1.3791709213692802E-2,3.7194455606056791,6.2254238752391819E-2,9.3795556985605419E-2,0.11772287999999999,0,0.27722435396190159,3.7080189164634754,5.0185325639706027E-2,5.1448319999999999E-2,0.10266409181555974,5.1448319999999999E-2,7.9622399999999996E-2,5.5167359126320523E-2,8.3999999999999993E-4,3.7399999999999996E-2,0.17952000000000001,0.14212,3.8239999999999996E-2,0.92501366539006014,62.64,0.98544775479386526,16.48875689809508,6.4469741907779881,null,98.54477547938653,0.3065201517094252,0.45951084577746132,0.32977513796190161,0.12893948381555975,5.5167359126320523E-2]
["Dmax",{"$f":"D1_Vinmin","v":0.75},"index",null,null,null,59,24,1,5.31,5.31,2.9499999999999997,0.50156494556916176,2.0058381793895799,6.3129190896947893,4.3070809103052099,0,5.3414775328078843,5.7062764466982809E-2,0.25,0.30847094083834015,0.5790356064107014,3.3528223349140867E-4,3.3528223349140867E-4,2.6707256848015981,1.4265551366917931E-2,1.4265551366917931E-2,3.7829011587608345,6.4396535296293286E-2,9.5412721761219316E-2,0.11772287999999999,0,0.28115319539165345,3.7710795611518644,5.1906799856361284E-2,5.2335359999999997E-2,0.10533568754660404,5.2335359999999997E-2,8.0995200000000003E-2,5.7062764466982809E-2,8.3999999999999993E-4,3.7399999999999996E-2,0.17952000000000001,0.14212,3.8239999999999996E-2,0.93819398184398994,63.72,0.98548994452106964,16.730501369582672,6.6032051773302012,null,98.548994452106967,0.30847094083834015,0.46748408293825749,0.33461002739165346,0.13206410354660403,5.7062764466982809E-2]
["Dprime",{"$f":"1-B68","v":0.25},"index",null,null,null,60,24,1,5.4,5.4,3.0000000000000004,0.50159146320889469,2.0058461557981633,6.4029230778990822,4.3970769221009185,0,5.4309561681218588,5.8990569800121725E-2,0.25,0.31045568642732457,0.57903790900152285,3.3528490006085585E-4,3.3528490006085585E-4,2.715464328743912,1.474749304136125E-2,1.474749304136125E-2,3.8463727212511198,6.6575623998531341E-2,9.7029886536833213E-2,0.11772287999999999,0,0.28512486367874629,3.8341494218765284,5.3657561530857829E-2,5.3222400000000003E-2,0.10803938754787913,5.3222400000000003E-2,8.2367999999999997E-2,5.8990569800121725E-2,8.3999999999999993E-4,3.7399999999999996E-2,0.17952000000000001,0.14212,3.8239999999999996E-2,0.9515236853954937,64.800000000000011,0.98552849223771144,16.974387183937313,6.7610413773939557,null,98.552849223771148,0.31045568642732457,0.4755322512266254,0.33948774367874629,0.13522082754787912,5.8990569800121725E-2]
["Ipp",{"$f":"Iripple_Vinnom","v":2.0098562441805012},"A",null,null,null,61,24,1,5.49,5.49,3.0499999999999994,0.50161798061997309,2.0058541209228786,6.4929270604614393,4.4870729395385611,0,5.520451753513349,6.0950775125737225E-2,0.25,0.31247441977310808,0.57904020833497205,3.3528756286860782E-4,3.3528756286860782E-4,2.7602114249419114,1.5237534220759715E-2,1.5237534220759715E-2,3.9098596353190476,6.8791510655537375E-2,9.8647051312447068E-2,0.11772287999999999,0,0.28913951071443422,3.8972278859429572,5.5437605961645653E-2,5.4109440000000002E-2,0.11077526910543817,5.4109440000000002E-2,8.3740800000000004E-2,6.0950775125737225E-2,8.3999999999999993E-4,3.7399999999999996E-2,0.17952000000000001,0.14212,3.8239999999999996E-2,0.96500303650234609,65.88,0.98556357255342797,17.22042193572171,6.9204866552719082,null,98.556357255342803,0.31247441977310808,0.48365557981987239,0.34440843871443422,0.13840973310543817,6.0950775125737225E-2]
["Top FET","Value","Units",null,null,null,62,24,1,5.58,5.58,3.1,0.50164449780240017,2.0058620747638738,6.582931037381937,4.5770689626180632,0,5.6099634777701244,6.2943380443829341E-2,0.25,0.31452717272324066,0.57904250441109195,3.3529022191466944E-4,3.3529022191466944E-4,2.8049665674101485,1.5735674888577342E-2,1.5735674888577342E-2,3.973361327184465,7.1044201063642912E-2,0.10026421608806098,0.11772287999999999,0,0.29319729060471117,3.9603143796357352,5.7246928447255964E-2,5.499648E-2,0.11354341074942188,5.499648E-2,8.5113600000000011E-2,6.2943380443829341E-2,8.3999999999999993E-4,3.7399999999999996E-2,0.17952000000000001,0.14212,3.8239999999999996E-2,0.97863229963169518,66.960000000000008,0.98559534882428002,17.468613330235559,7.0815449374710946,null,98.559534882427997,0.31452717272324066,0.49185430135413305,0.34937226660471116,0.14163089874942189,6.2943380443829341E-2]
["Tr",{"$f":"(Qgd_Q1+Qgs_Q1/2)*(RdsonDRT+Rgate1)/(VCC-Vsp_Q1)*1000000000","v":2.7192760942760943},"ns","Turn on of MOSFET -> Rise time of current",null,null,63,24,1,5.67,5.67,3.1499999999999995,0.50167101475617837,2.0058700173212909,6.6729350086606454,4.6670649913393545,0,5.6994905804991944,6.4968385754398089E-2,0.25,0.31661397767735627,0.5790447972299233,3.3529287719904301E-4,3.3529287719904301E-4,2.8497293755728084,1.6241915028005177E-2,1.6241915028005177E-2,4.0368772590010549,7.3333701019079406E-2,0.10188138086367485,0.11772287999999999,0,0.29729835968730861,4.0234083651748778,5.9085524286301018E-2,5.5883519999999999E-2,0.11634389226064686,5.5883519999999999E-2,8.6486400000000005E-2,6.4968385754398089E-2,8.3999999999999993E-4,3.7399999999999996E-2,0.17952000000000001,0.14212,3.8239999999999996E-2,0.99241174328491399,68.039999999999992,0.98562397404026003,17.718969184365431,7.2442202130323432,null,98.562397404026001,0.31661397767735627,0.50012865194795542,0.35437938368730859,0.14488440426064686,6.4968385754398089E-2]
["Tf",{"$f":"(Qgd_Q1+Qgs_Q1/2)*(RdsonDRT2+Rgate1)/(Vsp_Q1)*1000000000","v":0.68384843353090607},"ns","Turn off of MOSFET -> Fall time of current",null,null,64,{"$f":"Vin","v":24},{"$f":"MODE","v":1},5.76,{"$f":"Iout*G73/100/Number_of_Phases","v":5.76},{"$f":"Vout*K73/(Vin*Efficiency)","v":3.2},{"$f":"(Vout+(Rdson2+Rs+Rdcr)*K73)/(Vin+(Rs+Rdson2-Rdson1)*K73)","v":0.50169753148131124},{"$f":"(Vin-(Rdson1+Rdcr)*K73-Vout)*M73/(Fsw*Lf)","v":2.0058779485952791},6.7629389742976391,4.7570610257023604,{"$f":"IF(MIN(Vin, -P73/(Coss_Q1+Coss_Q2)*0.00000002)<0, 0, MIN(Vin, -P73/(Coss_Q1+Coss_Q2)*0.00000002))","v":0},5.7890323482186323,{"$f":"R73^2*Rdcr","v":6.7025791057443468E-2},{"$f":"Core_Loss_Ch1","v":0.25},{"$f":"(T73+S73*(1+Ltc*(Ta-25)))/(1-S73*Ltc*ThetaCa)","v":0.31873486758845992},0.5790470867915094,3.3529552872173387E-4,3.3529552872173387E-4,2.8944994923096208,1.6756254621961304E-2,1.6756254621961304E-2,4.1004069260929166,{"$f":"Rdson1*AB73^2","v":7.5660016317978418E-2},{"$f":"(Vin*K73/2)*Fsw*(Tr_buck+Tf_buck)","v":0.10349854563928876},{"$f":"(0.5*Coss_Q1*(Vin-Q73)^2-0.5*Coss_Q2*(Vin-Q73)^2+(Qoss_Q2*(Vin-Q73)/Vin)*Vin)*Fsw","v":0.11772287999999999},{"$f":"IF(K73>N73/2,0,ABS(K73-N73/2)*Vsd_Q1*Deadtime*Fsw)","v":0},{"$f":"(AF73+AE73+AD73+AC73*(1+RdsonTopTc*Ta-RdsonTopTc*25))/(1-AC73*RdsonTopTc*ThetaJA_Q1)","v":0.30144287654899421},{"$f":"SQRT((1-M73))*SQRT(K73^2+(N73^2)/12)","v":4.0865093379522532},{"$f":"Rdson2*AH73^2","v":6.095338877747402E-2},{"$f":"IF(K73<N73/2,Deadtime*Fsw*IF(VfdSky_Q2>0,0,Vsd_Q2)*(K73+N73/2),2*Deadtime*Fsw*IF(VfdSky_Q2>0,0,Vsd_Q2)*K73)","v":5.6770559999999998E-2},{"$f":"(AJ73+AI73*(1+RdsonBotTc*Ta-RdsonBotTc*25))/(1-AI73*RdsonBotTc*ThetaJA_Q2)","v":0.11917679467731797},{"$f":"2*Deadtime*Fsw*IF(VfdSky_Q2>0,VfdSky_Q2,Vsd_Q2)*K73","v":5.6770559999999998E-2},{"$f":"IF(QrrSky_Q2>0,QrrSky_Q2,Qrr_Q2*K73/(Iout/Number_of_Phases))*Fsw*Vin","v":8.7859200000000012E-2},{"$f":"Rs*R73^2","v":6.7025791057443468E-2},{"$f":"Iq*Vin","v":8.3999999999999993E-4},{"$f":"IF(Ext_VCC=1,  (Qg_Q1+Qg_Q2)*Fsw*VCC, (Qg_Q1+Qg_Q2)*Fsw*Vin)","v":3.7399999999999996E-2},{"$f":"(Vin-VCC)*Fsw*(Qg_Q1+Qg_Q2)+(RdsonDRT+RdsonDRT2)*Fsw*Qg_Q1*VCC/(RdsonDRT+2*Rgate1+RdsonDRT2)+(RdsonDRB+RdsonDRB2)*Fsw*Qg_Q2*VCC/(RdsonDRB+2*Rgate2+RdsonDRB2)","v":0.17952000000000001},{"$f":"(Qg_Q1+Qg_Q2)*Fsw*(Vin-VCC)","v":0.14212},3.8239999999999996E-2,{"$f":" SUM(U73,X73,AA73,AG73,AK73,AL73,AM73,AS73,AN73)","v":1.0063416400228986},{"$f":"Vout*K73","v":69.12},0.98564959163007937,{"$f":"ThetaJA_Q1*BC73","v":17.971497427449712},{"$f":"ThetaJA_Q2*BD73","v":7.4085165338658987},null,98.564959163007941,{"$f":"U73","v":0.31873486758845992},0.50847887122631219,0.35942994854899424,0.14817033067731797,6.7025791057443468E-2]
["Part Power","Value","Units",null,null,null,65,24,1,{"$f":"Iout*G74/100","v":5.85},5.85,3.2499999999999991,0.50172404797780124,2.0058858685859819,{"$f":"K74+N74/2","v":6.8529429342929902},{"$f":"K74-N74/2","v":4.8470570657070091},0,{"$f":"SQRT(K74^2+(N74^2)/12)","v":5.8785881108037108},6.9115596352965478E-2,0.25,0.32088987596423729,{"$f":"N74/SQRT(12)","v":0.57904937309589155},{"$f":"RCoutEsr*V74^2","v":3.3529817648274502E-4},{"$f":"W74","v":3.3529817648274502E-4},{"$f":"SQRT(M74*(1-M74))*SQRT(K74^2+(N74^2)/12)","v":2.9392765821789286},{"$f":"RCinEsr*Y74^2","v":1.7278693653090888E-2},{"$f":"Z74","v":1.7278693653090888E-2},{"$f":"SQRT(M74)*SQRT(K74^2+(N74^2)/12)","v":4.1639498544416691},7.8023152756371575E-2,0.10511571041490261,0.11772287999999999,0,0.30563100204317367,4.1496168240185671,6.2850517219549484E-2,5.7657599999999996E-2,0.12204220030186631,5.7657599999999996E-2,8.9232000000000006E-2,6.9115596352965478E-2,8.3999999999999993E-4,3.7399999999999996E-2,0.17952000000000001,0.14212,3.8239999999999996E-2,1.0204222664918163,70.199999999999989,{"$f":"AU74/(AU74+AT74)","v":0.98567233619208805},18.226206102158685,7.5744380150933157,null,{"$f":"AV74*100","v":98.567233619208807},0.32088987596423729,{"$f":"AG74+AK74+AM74","v":0.51690520234504},{"$f":"AG74+AM74*0.66","v":0.36452412204317369},{"$f":"AK74+AM74*0.33","v":0.15148876030186631},{"$f":"AN74","v":6.9115596352965478E-2}]
["Power Dis",{"$f":"AS9","v":3.8239999999999996E-2},"W",null,null,null,66,24,1,5.94,5.94,3.3,0.50175056424565168,2.0058937772935481,6.9429468886467749,4.9370531113532259,0,5.9681572382505212,7.1237801640964174E-2,0.25,0.32307903686838685,0.5790516561431126,3.3530082048208155E-4,3.3530082048208155E-4,2.9840603297994974,1.780923210376617E-2,1.780923210376617E-2,4.227505598398043,8.0423116130190569E-2,0.10673287519051652,0.11772287999999999,0,0.30986289930780087,4.2127303777948208,6.4776904911382827E-2,5.8544640000000002E-2,0.1249401927079129,5.8544640000000002E-2,9.0604800000000013E-2,7.1237801640964174E-2,8.3999999999999993E-4,3.7399999999999996E-2,0.17952000000000001,0.14212,{"$f":"SUM(AO75:AP75)","v":3.8239999999999996E-2},1.0346539034493132,71.28,0.98569233415912183,18.483103365390043,7.7419888353956452,null,98.56923341591218,0.32307903686838685,0.52540789201571381,0.36966206730780088,0.15483977670791291,7.1237801640964174E-2]
["Temp rise",{"$f":"B75*B62","v":1.1471999999999998},"°C",null,null,null,67,24,1,6.03,6.03,3.3499999999999996,0.50177708028486512,2.0059016747181206,7.0329508373590608,5.0270491626409397,0,6.057739137724548,7.3392406921439501E-2,0.25,0.32530238492197616,0.57905393593321408,3.3530346071974682E-4,3.3530346071974682E-4,3.0288504383748012,1.8347869956086452E-2,1.8347869956086452E-2,4.2910737385949593,8.2859912235266953E-2,0.10835003996613041,0.11772287999999999,0,0.31413873378359869,4.2758495799852962,6.6732547151910585E-2,5.9431680000000001E-2,0.12787085674736026,5.9431680000000001E-2,9.1977600000000007E-2,7.3392406921439501E-2,8.3999999999999993E-4,3.7399999999999996E-2,0.17952000000000001,0.14212,3.8239999999999996E-2,1.049036835791181,72.36,0.98570970440413519,18.742197489179937,7.911173237368013,null,98.570970440413518,0.32530238492197616,0.533987190530959,0.3748439497835987,0.15822346474736027,7.3392406921439501E-2]
["Current (switching)",{"$f":"(Qg_Q1+Qg_Q2)*Fsw+Iq","v":7.515E-3},"A",null,null,null,68,24,1,6.12,6.12,3.3999999999999995,0.501803596095445,2.0059095608598474,7.1229547804299234,5.1170452195700769,0,6.1473332508654313,7.5579412194391515E-2,0.25,0.32755995530482029,0.57905621246623851,3.3530609719574554E-4,3.3530609719574554E-4,3.0736466283454069,1.8894607191878177E-2,1.8894607191878177E-2,4.3546538800417638,8.5333546867332535E-2,0.10996720474174429,0.11772287999999999,0,0.3184586732325973,4.3389740356716766,6.8717439240150294E-2,6.0318719999999999E-2,0.13083427855761262,6.0318719999999999E-2,9.33504E-2,7.5579412194391515E-2,8.3999999999999993E-4,3.7399999999999996E-2,0.17952000000000001,0.14212,3.8239999999999996E-2,1.0635713525784958,73.44,0.98572455879268828,19.003496861629866,8.0819955278806308,null,98.57245587926883,0.32755995530482029,0.54264335179020984,0.3800699372325973,0.16163991055761262,7.5579412194391515E-2]
["Qrr Current",{"$f":"Qrr_Q2*Fsw","v":5.7200000000000003E-3},"A",null,null,null,69,24,1,6.21,6.21,3.4499999999999997,0.501830111677394,2.0059174357188732,7.2129587178594363,5.2070412821405636,0,6.2369390513223779,7.7798817459820174E-2,0.25,0.32985178375688406,0.57905848574222762,3.3530872991008163E-4,3.3530872991008163E-4,3.1184486361566743,1.9449443792694844E-2,1.9449443792694844E-2,4.4182456503815368,8.7844025822019153E-2,0.11158436951735817,0.11772287999999999,0,0.32282288775699008,4.4021033725702887,7.0731576475200689E-2,6.1205759999999998E-2,0.13383054556892593,6.1205759999999998E-2,9.4723200000000007E-2,7.7798817459820174E-2,8.3999999999999993E-4,3.7399999999999996E-2,0.17952000000000001,0.14212,3.8239999999999996E-2,1.078257747065225,74.52,0.98573700268764353,19.267009987849505,8.2544600784462965,null,98.573700268764355,0.32985178375688406,0.55137663332591602,0.38534019975699008,0.16508920156892593,7.7798817459820174E-2]
["Diode Current",{"$f":"Deadtime*Fsw*(Iripple_Vinnom/2)*(Vsd_Q2)/Vin","v":2.0634524106919814E-4},null,null,null,null,70,24,1,6.3,6.3,3.4999999999999996,0.5018566270307151,2.0059252992953458,7.3029626496476725,5.2970373503523271,0,6.3265560424975895,8.005062271772552E-2,0.25,0.33217790657970758,0.57906075576122429,3.3531135886276028E-4,3.3531135886276028E-4,3.1632562131304778,2.0012379739817142E-2,2.0012379739817142E-2,4.4818486982954964,9.0391354894858653E-2,0.11320153429297206,0.11772287999999999,0,0.32723154981831509,4.4652372394364139,7.2774954156241509E-2,6.2092799999999997E-2,0.13685974651188901,6.2092799999999997E-2,9.6096000000000015E-2,8.005062271772552E-2,8.3999999999999993E-4,3.7399999999999996E-2,0.17952000000000001,0.14212,3.8239999999999996E-2,1.0930963167263172,75.599999999999994,0.98574713541083203,19.532745490915755,8.4285713255944508,null,98.574713541083199,0.33217790657970758,0.56018729633020414,0.39065490981831508,0.168571426511889,8.005062271772552E-2]
["Total",{"$f":"SUM(B77:B79)","v":1.3441345241069198E-2},"A",null,null,null,71,24,1,6.39,6.39,3.5499999999999994,0.5018831421554113,2.0059331515894088,7.3929665757947038,5.3870334242052955,0,6.4161837554775332,8.2334827968107566E-2,0.25,0.33453836063785558,0.5790630225232698,3.3531398405378486E-4,3.3531398405378486E-4,3.2080691244308341,2.0583415014252836E-2,2.0583415014252836E-2,4.5454626920402204,9.2975539881282862E-2,0.11481869906858595,0.11772287999999999,0,0.33168483425696377,4.5283753046014477,7.4847567582533525E-2,6.2979839999999995E-2,0.13992197142503687,6.2979839999999995E-2,9.7468799999999994E-2,8.2334827968107566E-2,8.3999999999999993E-4,3.7399999999999996E-2,0.17952000000000001,0.14212,3.8239999999999996E-2,1.1080873632862704,76.679999999999993,0.98575505066590363,19.800712112848188,8.6043337712518433,null,98.575505066590367,0.33453836063785558,0.56907560568200066,0.3960142422569638,0.17208667542503686,8.2334827968107566E-2]
[null,null,null,null,null,null,72,24,1,6.48,6.48,3.6,0.50190965705148549,2.0059409926012086,7.482970496300605,5.4770295036993959,0,6.5058217471341129,8.4651433210966326E-2,0.25,0.33693318336038958,0.57906528602840646,3.3531660548316019E-4,3.3531660548316019E-4,3.2528871481144921,2.1162549596736868E-2,2.1162549596736868E-2,4.6090873181050078,9.5596586576623857E-2,0.11643586384419984,0.11772287999999999,0,0.33618291831202313,4.5915172546301886,7.6949412053418612E-2,6.3866880000000001E-2,0.1430173116625981,6.3866880000000001E-2,9.8841600000000002E-2,8.4651433210966326E-2,8.3999999999999993E-4,3.7399999999999996E-2,0.17952000000000001,0.14212,3.8239999999999996E-2,1.123231192748197,77.760000000000005,0.98576083692611904,20.070918715601156,8.7817519831299062,null,98.576083692611903,0.33693318336038958,0.57804182997462117,0.40141837431202315,0.17563503966259811,8.4651433210966326E-2]
[null,null,null,null,null,null,73,24,1,6.57,6.57,3.65,0.50193617171894078,2.0059488223308928,7.5729744111654469,5.5670255888345537,0,6.5954695983797009,8.7000438446301787E-2,0.25,0.33936241274236423,0.57906754627667689,3.3531922315089137E-4,3.3531922315089137E-4,3.2977100742584482,2.1749783467731321E-2,2.1749783467731321E-2,4.6727222799780259,9.8254500776113682E-2,0.11805302861981372,0.11772287999999999,0,0.34072598164145385,4.654662793086934,7.9080482868319688E-2,6.4753920000000006E-2,0.14614585990237683,6.4753920000000006E-2,0.10021440000000001,8.7000438446301787E-2,8.3999999999999993E-4,3.7399999999999996E-2,0.17952000000000001,0.14212,3.8239999999999996E-2,1.1385281154233788,78.84,0.98576457779042537,20.343374282072695,8.9608305951188427,null,98.576457779042542,0.33936241274236423,0.58708624154383071,0.40686748564145386,0.17921661190237684,8.7000438446301787E-2]
[null,null,null,null,null,null,74,24,1,6.66,6.66,3.6999999999999997,0.50196268615777984,2.005956640778606,7.6629783203893034,5.6570216796106969,0,6.685126912561719,8.9381843674113962E-2,0.25,0.34182608734634795,0.57906980326812285,3.3532183705698251E-4,3.3532183705698251E-4,3.3425377041572371,2.2345116607425469E-2,2.2345116607425469E-2,4.736367297011129,0.10094928827488428,0.11967019339542762,0.11772287999999999,0,0.34531420634261045,4.7178116394002503,8.1240775326740747E-2,6.5640959999999998E-2,0.14930771015377128,6.5640959999999998E-2,0.1015872,8.9381843674113962E-2,8.3999999999999993E-4,3.7399999999999996E-2,0.17952000000000001,0.14212,3.8239999999999996E-2,1.1539784459613263,79.92,0.98576635231080345,20.618087917130524,9.1415743076885647,null,98.576635231080346,0.34182608734634795,0.59620911649638175,0.41236175834261046,0.18283148615377129,8.9381843674113962E-2]
[null,null,null,null,null,null,75,24,1,6.75,6.75,3.7499999999999996,0.50198920036800598,2.0059644479444936,7.7529822239722463,5.7470177760277537,0,6.7747933139839356,9.1795648894402879E-2,0.25,0.3443242463039668,0.57907205700278619,3.3532444720143806E-4,3.3532444720143806E-4,3.3873698495835773,2.2948548995735736E-2,2.2948548995735736E-2,4.8000221033742925,0.10368095486796795,0.1212873581710415,0.11772287999999999,0,0.34994777697310836,4.7809635278173443,8.3430284728266774E-2,6.6528000000000004E-2,0.15250295776592965,6.6528000000000004E-2,0.10296,9.1795648894402879E-2,8.3999999999999993E-4,3.7399999999999996E-2,0.17952000000000001,0.14212,3.8239999999999996E-2,1.1695825033803451,81,0.98576623529355012,20.89506884865542,9.3239878882964824,null,98.576623529355018,0.3443242463039668,0.60541073473903806,0.41790137697310836,0.18647975776592965,9.1795648894402879E-2]
[null,null,null,null,null,null,76,24,1,6.84,6.84,3.8,0.502015714349622,2.0059722438287029,7.8429861219143513,5.8370138780856484,0,6.8644684465429853,9.4241854107168538E-2,0.25,0.34685692931747236,0.57907430748070965,3.3532705358426345E-4,3.3532705358426345E-4,3.4322063321066354,2.3560080612305769E-2,2.3560080612305769E-2,4.8636864470914993,0.10644950635029689,0.12290452294665538,0.11772287999999999,0,0.35462688057204012,4.844118206439922,8.5649006372563952E-2,6.7415039999999996E-2,0.15573169943604556,6.7415039999999996E-2,0.1043328,9.4241854107168538E-2,8.3999999999999993E-4,3.7399999999999996E-2,0.17952000000000001,0.14212,3.8239999999999996E-2,1.1853406110986167,82.08,0.98576429757688866,21.174326428602004,9.5080761718022782,null,98.576429757688871,0.34685692931747236,0.61469138000808565,0.42348652857204011,0.19016152343604556,9.4241854107168538E-2]
[null,null,null,null,null,null,77,24,1,6.93,6.93,3.8499999999999996,0.50204222810263066,2.0059800284313791,7.9329900142156893,5.9270099857843102,0,6.9541519724697896,9.6720459312410925E-2,0.25,0.34942417666133452,0.57907655470193498,3.3532965620546306E-4,3.3532965620546306E-4,3.4770469824627339,2.4179711436506407E-2,2.4179711436506407E-2,4.9273600891508131,0.10925494851670338,0.12452168772226928,0.11772287999999999,0,0.35935170668154903,4.9072754363342144,8.7896935559379413E-2,6.8302080000000001E-2,0.15899403321779348,6.8302080000000001E-2,0.10570560000000001,9.6720459312410925E-2,8.3999999999999993E-4,3.7399999999999996E-2,0.17952000000000001,0.14212,3.8239999999999996E-2,1.2012530969658,83.16,0.98576060628704665,21.455870134077454,9.6938440608896759,null,98.576060628704667,0.34942417666133452,0.62405133989934258,0.42911740268154908,0.19387688121779351,9.6720459312410925E-2]
[null,null,null,null,null,null,78,24,1,7.02,7.02,3.8999999999999995,0.50206874162703519,2.0059878017526676,8.0229939008763331,6.017006099123666,0,7.0438435711665992,9.9231464510130055E-2,0.25,0.35202602918385806,0.57907879866650414,3.353322550650416E-4,3.353322550650416E-4,3.5218916399738718,2.4807441447435696E-2,2.4807441447435696E-2,4.9910428026820606,0.11209728716191979,0.12613885249788315,0.11772287999999999,0,0.36412244736876237,4.9704349907086227,9.0174067588541296E-2,6.9189119999999993E-2,0.16229005852990611,6.9189119999999993E-2,0.10707840000000002,9.9231464510130055E-2,8.3999999999999993E-4,3.7399999999999996E-2,0.17952000000000001,0.14212,3.8239999999999996E-2,1.2173202932951575,84.24,0.98575522507472457,21.739709568438119,9.8812965264953068,null,98.575522507472456,0.35202602918385806,0.63349090589866852,0.43479419136876241,0.19762593052990612,9.9231464510130055E-2]
[null,null,null,null,null,null,79,24,1,7.11,7.11,3.95,0.50209525492283846,2.0059955637927147,8.1129977818963575,6.1070022181036432,0,7.1335429381313045,0.10177486970032601,0.25,0.3546625283088235,0.57908103937445954,3.3533485016300435E-4,3.3533485016300435E-4,3.5667401520098814,2.5443270623918945E-2,2.5443270623918945E-2,5.0547343721962212,0.11497652808057866,0.12775601727349706,0.11772287999999999,0,0.36893929724809049,5.0335966541530794,9.2480397759958935E-2,7.0076159999999998E-2,0.16561987616489587,7.0076159999999998E-2,0.10845120000000003,0.10177486970032601,8.3999999999999993E-4,3.7399999999999996E-2,0.17952000000000001,0.14212,3.8239999999999996E-2,1.2335425368962178,85.320000000000007,0.98574821433368387,22.025854462404524,10.070438608244794,null,98.574821433368385,0.3546625283088235,0.64301037341298639,0.44051708924809052,0.20140877216489589,0.10177486970032601]
[null,null,null,null,null,null,80,24,1,7.2,7.2,4,0.50212176799004349,2.0060033145516667,8.2030016572758342,6.1969983427241671,0,7.2232497839614656,0.10435067488299872,0.25,0.35733371603715286,0.57908327682584315,3.3533744149935607E-4,3.3533744149935607E-4,3.6115923734904429,2.6087198944508661E-2,2.6087198944508661E-2,5.1184345928811839,0.11789267706721246,0.12937318204911094,0.11772287999999999,0,0.37380245350389668,5.0967602219347716,9.4815921373622519E-2,7.0963200000000004E-2,0.16898358829792018,7.0963200000000004E-2,0.109824,0.10435067488299872,8.3999999999999993E-4,3.7399999999999996E-2,0.17952000000000001,0.14212,3.8239999999999996E-2,1.2499201691079767,86.4,0.98573963140301279,22.314314675194836,10.261275414896009,null,98.573963140301274,0.35733371603715286,0.65261004180181692,0.4462862935038967,0.20522550829792019,0.10435067488299872]
[null,null,null,null,null,null,81,24,1,7.29,7.29,4.05,0.50214828082865304,2.0060110540296696,8.2930055270148344,6.2869944729851657,0,7.3129638334312927,0.10695888005814821,0.25,0.36003963494859997,0.57908551102069739,3.3534002907410223E-4,3.3534002907410223E-4,3.6564481664235733,2.6739226387484622E-2,2.6739226387484622E-2,5.182143269949087,0.12084573991625377,0.13099034682472482,0.11772287999999999,0,0.37871211591354298,5.1599254993454595,9.7180633729603547E-2,7.1850239999999996E-2,0.17238129849579417,7.1850239999999996E-2,0.11119680000000001,0.10695888005814821,8.3999999999999993E-4,3.7399999999999996E-2,0.17952000000000001,0.14212,3.8239999999999996E-2,1.2664535358326443,87.48,0.98572953075447356,22.605100195677149,10.453812124789708,null,98.572953075447359,0.36003963494859997,0.66229021440933711,0.45210200391354299,0.20907624249579418,0.10695888005814821]
[null,null,null,null,null,null,82,24,1,7.38,7.38,4.0999999999999996,0.50217479343867022,2.0060187822268682,8.3830093911134345,6.3769906088865653,0,7.4026848246353998,0.10959948522577448,0.25,0.3627803282034654,0.57908774195906387,3.3534261288724738E-4,3.3534261288724738E-4,3.7013073994775048,2.7399352930853858E-2,2.7399352930853858E-2,5.2458602180308747,0.12383572242203521,0.13260751160033871,0.11772287999999999,0,0.38366848687081728,5.2230923010959991,9.9574530128054298E-2,7.2737280000000001E-2,0.17581311172615083,7.2737280000000001E-2,0.11256959999999999,0.10959948522577448,8.3999999999999993E-4,3.7399999999999996E-2,0.17952000000000001,0.14212,3.8239999999999996E-2,1.2831429875699492,88.56,0.98571796416619717,22.898221143540866,10.648053986307541,null,98.571796416619719,0.3627803282034654,0.67205119859696816,0.45796442287081729,0.21296107972615083,0.10959948522577448]
[null,null,null,null,null,null,83,24,1,7.47,7.47,4.1499999999999995,0.50220130582009803,2.0060264991434096,8.4730132495717037,6.466986750428295,0,7.4924125081937927,0.11227249038587761,0.25,0.36555583954433701,0.57908996964098514,3.3534519293879712E-4,3.3534519293879712E-4,3.7461699475831791,2.8067578552350717E-2,2.8067578552350717E-2,5.3095852606141536,0.12686263037878981,0.13422467637595259,0.11772287999999999,0,0.38867177140974724,5.2862604507541748,0.10199760586920822,7.3624319999999993E-2,0.17927913436675075,7.3624319999999993E-2,0.11394239999999999,0.11227249038587761,8.3999999999999993E-4,3.7399999999999996E-2,0.17952000000000001,0.14212,3.8239999999999996E-2,1.2999888794520023,89.64,0.98570498088387459,23.193687770487362,10.844006318337538,null,98.570498088387453,0.36555583954433701,0.68189330577649798,0.46387375540974723,0.21688012636675075,0.11227249038587761]
[null,null,null,null,null,null,84,24,1,7.56,7.56,4.1999999999999993,0.50222781797293936,2.0060342047794393,8.5630171023897184,6.55698289761028,0,7.5821466465130278,0.11497789553845751,0.25,0.36836621329785413,0.57909219406650314,3.3534776922875654E-4,3.3534776922875654E-4,3.7910356915648249,2.8743903229436783E-2,2.8743903229436783E-2,5.3733182295207529,0.12992646958065016,0.13584184115156647,0.11772287999999999,0,0.39372217722880576,5.3494297802222546,0.10444985625337982,7.4511359999999999E-2,0.18277947421494367,7.4511359999999999E-2,0.11531520000000001,0.11497789553845751,8.3999999999999993E-4,3.7399999999999996E-2,0.17952000000000001,0.14212,3.8239999999999996E-2,1.3169915712787266,90.72,0.98569062777047889,23.491510461440289,11.041674510747184,null,98.56906277704789,0.36836621329785413,0.69181685144374949,0.46983020922880575,0.22083349021494367,0.11497789553845751]
[null,null,null,null,null,null,85,24,1,7.65,7.65,4.25,0.50225432989719709,2.006041899135103,8.6530209495675514,6.6469790504324493,0,7.6718870130990027,0.11771570068351428,0.25,0.37121149437649859,0.57909441523565997,3.35350341757131E-4,3.35350341757131E-4,3.8359045177963536,2.9428326939300954E-2,2.9428326939300954E-2,5.4370589644208147,0.13302724582164932,0.13745900592718038,0.11772287999999999,0,0.3988199147155157,5.4126001292510422,0.10693127658096466,7.5398400000000004E-2,0.18631424049728212,7.5398400000000004E-2,0.11668800000000001,0.11771570068351428,8.3999999999999993E-4,3.7399999999999996E-2,0.17952000000000001,0.14212,3.8239999999999996E-2,1.3341514275538691,91.800000000000011,0.9856749494454603,23.791699735775783,11.241064024864105,null,98.567494944546027,0.37121149437649859,0.70182215521279778,0.47583399471551568,0.22482128049728212,0.11771570068351428]
[null,null,null,null,null,null,86,24,1,7.74,7.74,4.3,0.50228084159287423,2.006049582210546,8.7430247911052739,6.7369752088947275,0,7.7616333919171892,0.12048590582104787,0.25,0.37409172828041004,0.57909663314849757,3.353529105239256E-4,3.353529105239256E-4,3.880776317881478,3.0120849658859444E-2,3.0120849658859444E-2,5.5008073123804158,0.13616496489572033,0.13907617070279424,0.11772287999999999,0,0.40396519697145677,5.4757713449874883,0.10944186215243923,7.628544000000001E-2,0.18988354387929002,7.628544000000001E-2,0.11806080000000001,0.12048590582104787,8.3999999999999993E-4,3.7399999999999996E-2,0.17952000000000001,0.14212,3.8239999999999996E-2,1.3514688175215883,92.88,0.98565798841426633,24.094266248572836,11.442180393964502,null,98.565798841426627,0.37409172828041004,0.71190954085074676,0.48188532497145675,0.22884360787929003,0.12048590582104787]
[null,null,null,null,null,null,87,24,1,7.83,7.83,4.3499999999999996,0.50230735305997387,2.0060572540059156,8.8330286270029585,6.8269713729970425,0,7.8513855767965666,0.12328851095105832,0.25,0.37700696109922688,0.57909884780505849,3.353554755291463E-4,3.353554755291463E-4,3.9256509883556765,3.0821471364755798E-2,3.0821471364755798E-2,5.5645631274400911,0.13933963259669629,0.14069333547840815,0.11772287999999999,0,0.40915823983768318,5.5389432815531974,0.11198160826836107,7.7172480000000002E-2,0.1934874964753876,7.7172480000000002E-2,0.1194336,0.12328851095105832,8.3999999999999993E-4,3.7399999999999996E-2,0.17952000000000001,0.14212,3.8239999999999996E-2,1.368944115203641,93.960000000000008,0.98563978518896322,24.399220791884158,11.645029223769379,null,98.56397851889632,0.37700696109922688,0.72207933631307086,0.48798441583768315,0.23290058447538758,0.12328851095105832]
[null,null,null,null,null,null,88,24,1,7.92,7.92,4.3999999999999995,0.50233386429849869,2.0060649145213558,8.9230324572606783,6.9169675427393216,0,7.9411433708737933,0.12612351607354558,0.25,0.37995723951395338,0.57910105920538424,3.3535803677279798E-4,3.3535803677279798E-4,3.9705284304082795,3.1530192033360875E-2,3.1530192033360875E-2,5.6283262702218124,0.1425512547183104,0.14231050025402203,0.11772287999999999,0,0.41439926192055582,5.6021157996513971,0.11455051022936892,7.8059520000000007E-2,0.19712621185897455,7.8059520000000007E-2,0.12080640000000001,0.12612351607354558,8.3999999999999993E-4,3.7399999999999996E-2,0.17952000000000001,0.14212,3.8239999999999996E-2,1.3865776994371632,95.039999999999992,0.98562037840066097,24.706574296027792,11.849616192948728,null,98.562037840066097,0.37995723951395338,0.73233187377953035,0.49413148592055584,0.23699232385897456,0.12612351607354558]
[null,null,null,null,null,null,89,24,1,8.01,8.01,4.45,0.5023603753084519,2.0060725637570149,9.0130362818785077,7.0069637181214919,0,8.0309065860745079,0.12899092118850983,0.25,0.382942610798852,0.57910326734951767,3.3536059425488699E-4,3.3536059425488699E-4,4.0154085496231202,3.2247011640772899E-2,3.2247011640772899E-2,5.692096607562223,0.14579983705419616,0.14392766502963592,0.11772287999999999,0,0.4196884846179974,5.6652887662001437,0.11714856333618244,7.8946559999999999E-2,0.20079980507267225,7.8946559999999999E-2,0.12217920000000002,0.12899092118850983,8.3999999999999993E-4,3.7399999999999996E-2,0.17952000000000001,0.14212,3.8239999999999996E-2,1.4043699539130594,96.12,0.98559980490438726,25.016337830899872,12.055947053633613,null,98.559980490438733,0.382942610798852,0.74266748969066965,0.50032675661799741,0.24111894107267226,0.12899092118850983]
[null,null,null,null,null,null,90,24,1,8.1,8.1,4.4999999999999991,0.50238688608983639,2.0060802017130372,9.1030401008565178,7.0969598991434815,0,8.1206750426288714,0.13189072629595086,0.25,0.38596312282336098,0.57910547223750042,3.3536314797541841E-4,3.3536314797541841E-4,4.0602912557363071,3.2971930162817437E-2,3.2971930162817437E-2,5.7558740121700742,0.14908538539788671,0.14554482980524977,0.11772287999999999,0,0.42502613214617357,5.7284620539897624,0.11977576288960221,7.9833600000000005E-2,0.20450839263872822,7.9833600000000005E-2,0.123552,0.13189072629595086,8.3999999999999993E-4,3.7399999999999996E-2,0.17952000000000001,0.14212,3.8239999999999996E-2,1.4223212672150063,97.199999999999989,0.98557809987699174,25.328522607308678,12.264027631936411,null,98.557809987699173,0.38596312282336098,0.75308652478490179,0.50657045214617358,0.24528055263872822,0.13189072629595086]
[null,null,null,null,null,null,91,24,1,8.19,8.19,4.55,0.50241339664265505,2.0060878283895685,9.1930439141947833,7.1869560858052157,0,8.2104485686187925,0.13482293139586876,0.25,0.38901882405403992,0.57910767386937456,3.353656979343979E-4,3.353656979343979E-4,4.1051764624098341,3.3704947575047439E-2,3.3704947575047439E-2,5.8196583623060754,0.15240790554281564,0.14716199458086368,0.11772287999999999,0,0.43041243156661085,5.7916355413626768,0.12243210419051,8.0720639999999996E-2,0.20825209256958421,8.0720639999999996E-2,0.1249248,0.13482293139586876,8.3999999999999993E-4,3.7399999999999996E-2,0.17952000000000001,0.14212,3.8239999999999996E-2,1.4404320328590856,98.28,0.98555529690861698,25.643139978330542,12.47386382847921,null,98.555529690861704,0.38901882405403992,0.76358932413619507,0.51286279956661085,0.24947727656958421,0.13482293139586876]
[null,null,null,null,null,null,92,24,1,8.2799999999999994,8.2799999999999994,4.5999999999999988,0.50243990696691088,2.0060954437867551,9.2830477218933769,7.2769522781066218,0,8.3002269995543987,0.13778753648826364,0.25,0.39210976355653976,0.5791098722451824,3.3536824413183145E-4,3.3536824413183145E-4,4.1500640870198158,3.4446063852743236E-2,3.4446063852743236E-2,5.8834495414834231,0.15576740328231675,0.14877915935647754,0.11772287999999999,0,0.43584761281375328,5.8548091119139238,0.12511758253986863,8.1607680000000002E-2,0.21203102437860932,8.1607680000000002E-2,0.12629760000000001,0.13778753648826364,8.3999999999999993E-4,3.7399999999999996E-2,0.17952000000000001,0.14212,3.8239999999999996E-2,1.4587026493340414,99.359999999999985,0.98553142808822214,25.960201440687662,12.685461618930466,null,98.553142808822216,0.39210976355653976,0.77417623719236262,0.51920402881375327,0.25370923237860932,0.13778753648826364]
[null,null,null,null,null,null,93,24,1,8.3699999999999992,8.3699999999999992,4.6499999999999995,0.50246641706260686,2.0061030479047433,9.3730515239523715,7.3669484760476278,0,8.3900101779775991,0.14078454157313541,0.25,0.39523599099759948,0.57911206736496612,3.3537078656772505E-4,3.3537078656772505E-4,4.1949540504582714,3.519527897091252E-2,3.519527897091252E-2,5.9472474381874756,0.1591638844096237,0.15039632413209145,0.11772287999999999,0,0.44133190872296735,5.9179826542108263,0.12783219323872178,8.2494719999999994E-2,0.21584530909100025,8.2494719999999994E-2,0.12767039999999999,0.14078454157313541,8.3999999999999993E-4,3.7399999999999996E-2,0.17952000000000001,0.14212,3.8239999999999996E-2,1.4771335201421827,100.44,0.98550652408360506,26.27971863614837,12.898827054550013,null,98.550652408360506,0.39523599099759948,0.78484761781396761,0.52559437272296738,0.25797654109100027,0.14078454157313541]
[null,null,null,null,null,null,94,24,1,8.4600000000000009,8.4600000000000009,4.7,0.5024929269297459,2.0061106407436777,9.4630553203718399,7.4569446796281618,0,8.4797979530907526,0.14381394665048425,0.25,0.39839755664707022,0.57911425922876747,3.3537332524208411E-4,3.3537332524208411E-4,4.2398462769474596,3.5952592904290467E-2,3.5952592904290467E-2,6.0110519456131861,0.16259735471787029,0.15201348890770536,0.11772287999999999,0,0.44686555505900094,5.9811560615304167,0.13057593158819447,8.3381760000000013E-2,0.21969506925485152,8.3381760000000013E-2,0.12904320000000002,0.14381394665048425,8.3999999999999993E-4,3.7399999999999996E-2,0.17952000000000001,0.14212,3.8239999999999996E-2,1.4957250538409397,101.52000000000001,0.98548061421633248,26.601703352950047,13.113966262742577,null,98.54806142163325,0.39839755664707022,0.79560382431385246,0.53203406705900091,0.26227932525485154,0.14381394665048425]
[null,null,null,null,null,null,95,24,1,8.5500000000000007,8.5500000000000007,4.75,0.50251943656833087,2.0061182223037051,9.5530591111518532,7.5469408888481482,0,8.5695901804085661,0.14687575172030984,0.25,0.40159451137996449,0.57911644783662886,3.3537586015491491E-4,3.3537586015491491E-4,4.2847406938658219,3.6718005627339532E-2,3.6718005627339532E-2,6.0748629614189715,0.16606782000009035,0.15363065368331927,0.11772287999999999,0,0.45244879054490356,6.0443292316132853,0.1333487928894922,8.4268800000000005E-2,0.22358042895239558,8.4268800000000005E-2,0.130416,0.14687575172030984,8.3999999999999993E-4,3.7399999999999996E-2,0.17952000000000001,0.14212,3.8239999999999996E-2,1.5144776640850681,102.60000000000001,0.98545372653194907,26.926167527245177,13.330885447619778,null,98.545372653194903,0.40159451137996449,0.80644521949729908,0.53852335054490352,0.26661770895239556,0.14687575172030984]
[null,null,null,null,null,null,96,24,1,8.64,8.64,{"$f":"Vout*K105/(Vin*Efficiency)","v":4.8},0.50254594597836499,{"$f":"(Vin-(Rdson1+Rdcr)*K105-Vout)*M105/(Fsw*Lf)","v":2.0061257925849718},9.643062896292486,7.6369371037075151,{"$f":"IF(MIN(Vin, -P105/(Coss_Q1+Coss_Q2)*0.00000002)<0, 0, MIN(Vin, -P105/(Coss_Q1+Coss_Q2)*0.00000002))","v":0},8.659386721431618,{"$f":"R105^2*Rdcr","v":0.14996995678261246},0.25,{"$f":"(T105+S105*(1+Ltc*(Ta-25)))/(1-S105*Ltc*ThetaCa)","v":0.40482690667853399},0.57911863318859247,3.3537839130622348E-4,3.3537839130622348E-4,4.3296372315847522,3.7491517114249751E-2,3.7491517114249751E-2,6.138680387495854,{"$f":"Rdson1*AB105^2","v":0.16957528604921812},0.15524781845893312,0.11772287999999999,0,{"$f":"(AF105+AE105+AD105+AC105*(1+RdsonTopTc*Ta-RdsonTopTc*25))/(1-AC105*RdsonTopTc*ThetaJA_Q1)","v":0.45808185689141501},6.1075020664327235,{"$f":"Rdson2*AH105^2","v":0.13615077244390195},8.515584000000001E-2,{"$f":"(AJ105+AI105*(1+RdsonBotTc*Ta-RdsonBotTc*25))/(1-AI105*RdsonBotTc*ThetaJA_Q2)","v":0.22750151381141828},8.515584000000001E-2,0.13178880000000001,0.14996995678261246,8.3999999999999993E-4,3.7399999999999996E-2,0.17952000000000001,0.14212,3.8239999999999996E-2,{"$f":" SUM(U105,X105,AA105,AG105,AK105,AL105,AM105,AS105,AN105)","v":1.5333917696695358},103.68,0.98542588786581087,27.253123244570755,13.549590890570915,null,98.542588786581092,0.40482690667853399,0.8173721707028333,0.54506246489141508,0.27099181781141829,0.14996995678261246]
[null,null,null,null,null,null,97,24,1,8.73,8.73,4.8499999999999996,0.50257245515985094,2.0061333515876223,9.7330666757938111,7.7269333242061897,0,8.7491874433398689,0.15309656183739206,0.25,0.40809479463437276,0.57912081528469994,3.3538091869601556E-4,3.3538091869601556E-4,4.3745358233153446,3.827312733893852E-2,3.827312733893852E-2,6.2025041297507437,0.17311975865808762,0.15686498323454701,0.11772287999999999,0,0.46376499882682837,6.1706744719780025,0.13898186555279166,8.6042880000000002E-2,0.23145845101684787,8.6042880000000002E-2,0.13316159999999999,0.15309656183739206,8.3999999999999993E-4,3.7399999999999996E-2,0.17952000000000001,0.14212,3.8239999999999996E-2,1.5524677945730756,104.76,0.98539712390485656,27.582582741341415,13.770088950842393,null,98.539712390485661,0.40809479463437276,0.82838504984367622,0.55165165482682832,0.27540177901684787,0.15309656183739206]
[null,null,null,null,null,null,98,24,1,8.82,8.82,4.8999999999999995,0.50259896411279181,2.0061408993118031,9.8230704496559014,7.8169295503440992,0,8.8389922187048171,0.15625556688464862,0.25,0.41139822795054881,0.5791229941249938,3.353834423242976E-4,3.353834423242976E-4,4.4194364049644772,3.9062836275050687E-2,3.9062836275050687E-2,6.2663340979029138,0.17670124361943323,0.15848214801016089,0.11772287999999999,0,0.46949846412733698,6.2338463580508288,0.14184206751761008,8.6929920000000008E-2,0.23545136932252186,8.6929920000000008E-2,0.1345344,0.15625556688464862,8.3999999999999993E-4,3.7399999999999996E-2,0.17952000000000001,0.14212,3.8239999999999996E-2,1.5717061680024311,105.84,0.98536745924560465,27.914558406366851,13.992386066126095,null,98.536745924560464,0.41139822795054881,0.8394842334498589,0.55829116812733703,0.27984772132252189,0.15625556688464862]
[null,null,null,null,null,null,99,24,1,8.91,8.91,4.95,0.50262547283719061,2.0061484357576607,9.9130742178788296,7.9069257821211698,0,8.9288009252189671,0.15944697192438215,0.25,0.41473725994376204,0.579125169709516,3.3538596219107568E-4,3.3538596219107568E-4,4.4643389149995416,3.9860643895958565E-2,3.9860643895958565E-2,6.3301702052927,0.18031974672588938,0.16009931278577477,0.11772287999999999,0,0.47528250364787028,6.2970176380740481,0.14473137363988717,8.7816959999999999E-2,0.23948039906313431,8.7816959999999999E-2,0.13590720000000001,0.15944697192438215,8.3999999999999993E-4,3.7399999999999996E-2,0.17952000000000001,0.14212,3.8239999999999996E-2,1.5911073244372982,106.92,0.98533691744864371,28.249062782393512,14.216488753156717,null,98.53369174486437,0.41473725994376204,0.85067010271100463,0.56498125564787027,0.28432977506313434,0.15944697192438215]
[null,null,null,null,null,null,100,24,1,9,9,5,0.50265198133305011,2.0061559609253403,10.00307798046267,7.9969220195373296,0,9.0186134454413978,0.16267077695659274,0.25,0.41811194454653,0.57912734203830885,3.353884782963564E-4,3.353884782963564E-4,4.5092432943212311,4.0666550174761978E-2,4.0666550174761978E-2,6.3940123687015973,0.18397527376999054,0.16171647756138866,0.11772287999999999,0,0.48111737135342819,6.3601882289117322,0.14764977922123385,8.8704000000000005E-2,0.24354567216636397,8.8704000000000005E-2,0.13728000000000001,0.16267077695659274,8.3999999999999993E-4,3.7399999999999996E-2,0.17952000000000001,0.14212,3.8239999999999996E-2,1.6106717036759735,108,0.98530552108985969,28.58610856767141,14.4424036083182,null,98.530552108985972,0.41811194454653,0.86194304351979212,0.57172217135342818,0.28884807216636399,0.16267077695659274]

{"sheet":"Efficiency Plot Management","index":7,"n_rows":2,"n_cols":1,"rows_kept":2,"cut":false,"hidden":true,"merged":[]}
[]
[{"$f":"IF(PLOT_TYPE=1, \"EFF_Ch1\", \"EFF_Ch2\")","v":"EFF_Ch1"}]

{"sheet":"Schematic Management","index":8,"n_rows":17,"n_cols":14,"rows_kept":17,"cut":false,"hidden":true,"merged":[]}
[null,null,null,null,null,null,null,null,null,null,null,null,null,"3.3V or 5V fixed (FB1/2)"]
[{"$f":"IF(DITHER=1, CHOOSE(SCH_SETTING, \"SCH_ADJ_VOUT\", \"SCH_5V_FIXED\", \"SCH_3V3_FIXED\", \"SCH_ADJ_VOUT_NO_RT\", \"SCH_5V_FIXED_NO_RT\", \"SCH_3V3_FIXED_NO_RT\"), CHOOSE(SCH_SETTING, \"SCH_ADJ_VOUT_NO_DITH\", \"SCH_5V_FIXED_NO_DITH\", \"SCH_3V3_FIXED_NO_DITH\", \"SCH_ADJ_VOUT_NO_RT_NO_DITH\", \"SCH_5V_FIXED_NO_RT_NO_DITH\", \"SCH_3V3_FIXED_NO_RT_NO_DITH\"))","v":"SCH_ADJ_VOUT_NO_RT"},null,null,null,null,null,null,null,null,"With/without dither (DITH)",null,null,null,"With/without VOUT connected to VCCX"]
[null,null,null,null,null,null,null,null,null,"FPWM or DEM (DEMB)"]
[null,null,null,null,null,null,null,null,null,"Shunt or inductor DCR current sensing"]
[]
[]
[]
[]
[]
[]
[]
[]
[]
[]
[]
[]
[null," "]

{"sheet":"Standard Value Calculator","index":9,"n_rows":159,"n_cols":16,"rows_kept":159,"cut":false,"hidden":true,"merged":[]}
[]
["Capacitors","Css","Cc1ea","Cc2ea","Cout","Cin","Cres","Cdither","Cc3ea","Cc4ea"]
["Inputs",{"$f":"Css","v":5.4999999999999996E-8},{"$f":"Cc1ea","v":1.8097205052921096E-9},{"$f":"Cc2ea","v":1.2589423747873238E-11},{"$f":"Cout","v":2.4000000000000001E-4},{"$f":"Cin","v":2.0000000000000002E-5},{"$f":"Cres","v":3.3333333333333335E-7},{"$f":"Cdither_init","v":1.0416666666666666E-8},{"$f":"Cc3ea","v":0},{"$f":"Cc4ea","v":0},null,null,"Resistors","inputs","Standard Result"]
["Standard Result",{"$f":"SUM(B6:B158)/1000000000000","v":5.5999999999999999E-8},{"$f":"IF(C3=\"OPEN\",\"OPEN\",SUM(C6:C158)/1000000000000)","v":1.8E-9},{"$f":"SUM(D6:D158)/1000000000000","v":1.2000000000000001E-11},{"$f":"SUM(E6:E158)/1000000000000","v":2.2000000000000001E-4},{"$f":"SUM(F6:F158)/1000000000000","v":2.1999999999999999E-5},{"$f":"SUM(G6:G158)/1000000000000","v":3.3000000000000002E-7},{"$f":"IF(H3=\"OPEN\",\"OPEN\",SUM(H6:H158)/1000000000000)","v":1E-8},0,0,null,null,"Rt",{"$f":"Rfadj","v":49.9},{"$f":"IF(N4>(INT(0.5+100*POWER(10,IF(96*(LOG(N4)-INT(LOG(N4)))-ROUND(96*(LOG(N4)-INT(LOG(N4))),0)<0,ROUND(96*(LOG(N4)-INT(LOG(N4))),0)-1,ROUND(96*(LOG(N4)-INT(LOG(N4))),0))/96))*POWER(10,INT(LOG(N4))-2)+INT(0.5+100*POWER(10,(IF(96*(LOG(N4)-INT(LOG(N4)))-ROUND(96*(LOG(N4)-INT(LOG(N4))),0)<0,ROUND(96*(LOG(N4)-INT(LOG(N4))),0)-1,ROUND(96*(LOG(N4)-INT(LOG(N4))),0))+1)/96))*POWER(10,INT(LOG(N4))-2))/2,INT(0.5+100*POWER(10,(IF(96*(LOG(N4)-INT(LOG(N4)))-ROUND(96*(LOG(N4)-INT(LOG(N4))),0)<0,ROUND(96*(LOG(N4)-INT(LOG(N4))),0)-1,ROUND(96*(LOG(N4)-INT(LOG(N4))),0))+1)/96))*POWER(10,INT(LOG(N4))-2),INT(0.5+100*POWER(10,IF(96*(LOG(N4)-INT(LOG(N4)))-ROUND(96*(LOG(N4)-INT(LOG(N4))),0)<0,ROUND(96*(LOG(N4)-INT(LOG(N4))),0)-1,ROUND(96*(LOG(N4)-INT(LOG(N4))),0))/96))*POWER(10,INT(LOG(N4))-2))","v":49.900000000000006},"Ω"]
["(pF)"]
[0.47,{"$f":"IF(IF((B$3*10^12-$A7)*(B$3*10^12-$A6)*-1<0,0,1)*IF(ABS(B$3*10^12-$A7)>(B$3*10^12-$A6),$A6,$A7)=B7,0,IF((B$3*10^12-$A7)*(B$3*10^12-$A6)*-1<0,0,1)*IF(ABS(B$3*10^12-$A7)>(B$3*10^12-$A6),$A6,$A7))","v":0},0,0,0,0,0,0,0,0]
[0.56000000000000005,{"$f":"IF(IF((B$3*10^12-$A8)*(B$3*10^12-$A7)*-1<0,0,1)*IF(ABS(B$3*10^12-$A8)>(B$3*10^12-$A7),$A7,$A8)=B8,0,IF((B$3*10^12-$A8)*(B$3*10^12-$A7)*-1<0,0,1)*IF(ABS(B$3*10^12-$A8)>(B$3*10^12-$A7),$A7,$A8))","v":0},{"$f":"IF(IF((C$3*10^12-$A8)*(C$3*10^12-$A7)*-1<0,0,1)*IF(ABS(C$3*10^12-$A8)>(C$3*10^12-$A7),$A7,$A8)=C8,0,IF((C$3*10^12-$A8)*(C$3*10^12-$A7)*-1<0,0,1)*IF(ABS(C$3*10^12-$A8)>(C$3*10^12-$A7),$A7,$A8))","v":0},{"$f":"IF(IF((D$3*10^12-$A8)*(D$3*10^12-$A7)*-1<0,0,1)*IF(ABS(D$3*10^12-$A8)>(D$3*10^12-$A7),$A7,$A8)=D8,0,IF((D$3*10^12-$A8)*(D$3*10^12-$A7)*-1<0,0,1)*IF(ABS(D$3*10^12-$A8)>(D$3*10^12-$A7),$A7,$A8))","v":0},{"$f":"IF(IF((E$3*10^12-$A8)*(E$3*10^12-$A7)*-1<0,0,1)*IF(ABS(E$3*10^12-$A8)>(E$3*10^12-$A7),$A7,$A8)=E8,0,IF((E$3*10^12-$A8)*(E$3*10^12-$A7)*-1<0,0,1)*IF(ABS(E$3*10^12-$A8)>(E$3*10^12-$A7),$A7,$A8))","v":0},{"$f":"IF(IF((F$3*10^12-$A8)*(F$3*10^12-$A7)*-1<0,0,1)*IF(ABS(F$3*10^12-$A8)>(F$3*10^12-$A7),$A7,$A8)=F8,0,IF((F$3*10^12-$A8)*(F$3*10^12-$A7)*-1<0,0,1)*IF(ABS(F$3*10^12-$A8)>(F$3*10^12-$A7),$A7,$A8))","v":0},{"$f":"IF(IF((G$3*10^12-$A8)*(G$3*10^12-$A7)*-1<0,0,1)*IF(ABS(G$3*10^12-$A8)>(G$3*10^12-$A7),$A7,$A8)=G8,0,IF((G$3*10^12-$A8)*(G$3*10^12-$A7)*-1<0,0,1)*IF(ABS(G$3*10^12-$A8)>(G$3*10^12-$A7),$A7,$A8))","v":0},0,0,0,null,null,"Rc1ea",{"$f":"Rcea1","v":16286.016297600007},16200,"Ω"]
[0.68,0,0,0,0,0,0,0,0,0,null,null,"Rc1ea",{"$f":"Rcea2","v":0},{"$f":"IF(N8>(INT(0.5+100*POWER(10,IF(96*(LOG(N8)-INT(LOG(N8)))-ROUND(96*(LOG(N8)-INT(LOG(N8))),0)<0,ROUND(96*(LOG(N8)-INT(LOG(N8))),0)-1,ROUND(96*(LOG(N8)-INT(LOG(N8))),0))/96))*POWER(10,INT(LOG(N8))-2)+INT(0.5+100*POWER(10,(IF(96*(LOG(N8)-INT(LOG(N8)))-ROUND(96*(LOG(N8)-INT(LOG(N8))),0)<0,ROUND(96*(LOG(N8)-INT(LOG(N8))),0)-1,ROUND(96*(LOG(N8)-INT(LOG(N8))),0))+1)/96))*POWER(10,INT(LOG(N8))-2))/2,INT(0.5+100*POWER(10,(IF(96*(LOG(N8)-INT(LOG(N8)))-ROUND(96*(LOG(N8)-INT(LOG(N8))),0)<0,ROUND(96*(LOG(N8)-INT(LOG(N8))),0)-1,ROUND(96*(LOG(N8)-INT(LOG(N8))),0))+1)/96))*POWER(10,INT(LOG(N8))-2),INT(0.5+100*POWER(10,IF(96*(LOG(N8)-INT(LOG(N8)))-ROUND(96*(LOG(N8)-INT(LOG(N8))),0)<0,ROUND(96*(LOG(N8)-INT(LOG(N8))),0)-1,ROUND(96*(LOG(N8)-INT(LOG(N8))),0))/96))*POWER(10,INT(LOG(N8))-2))","v":{"$error":"#NUM!"}},"Ω"]
[0.82,0,0,0,0,0,0,0,0,0]
[1,0,0,0,0,0,0,0,0,0,null,null,"Rfb1",{"$f":"Rfb1_","v":49900},{"$f":"IF(N10>(INT(0.5+100*POWER(10,IF(96*(LOG(N10)-INT(LOG(N10)))-ROUND(96*(LOG(N10)-INT(LOG(N10))),0)<0,ROUND(96*(LOG(N10)-INT(LOG(N10))),0)-1,ROUND(96*(LOG(N10)-INT(LOG(N10))),0))/96))*POWER(10,INT(LOG(N10))-2)+INT(0.5+100*POWER(10,(IF(96*(LOG(N10)-INT(LOG(N10)))-ROUND(96*(LOG(N10)-INT(LOG(N10))),0)<0,ROUND(96*(LOG(N10)-INT(LOG(N10))),0)-1,ROUND(96*(LOG(N10)-INT(LOG(N10))),0))+1)/96))*POWER(10,INT(LOG(N10))-2))/2,INT(0.5+100*POWER(10,(IF(96*(LOG(N10)-INT(LOG(N10)))-ROUND(96*(LOG(N10)-INT(LOG(N10))),0)<0,ROUND(96*(LOG(N10)-INT(LOG(N10))),0)-1,ROUND(96*(LOG(N10)-INT(LOG(N10))),0))+1)/96))*POWER(10,INT(LOG(N10))-2),INT(0.5+100*POWER(10,IF(96*(LOG(N10)-INT(LOG(N10)))-ROUND(96*(LOG(N10)-INT(LOG(N10))),0)<0,ROUND(96*(LOG(N10)-INT(LOG(N10))),0)-1,ROUND(96*(LOG(N10)-INT(LOG(N10))),0))/96))*POWER(10,INT(LOG(N10))-2))","v":49900},"Ω"]
[1.2,0,0,0,0,0,0,0,0,0,null,null,"Rfb2",{"$f":"Rfb2_","v":5544.4444444444443},{"$f":"IF(N11=\"OPEN\",\"OPEN\",IF(N11>(INT(0.5+100*POWER(10,IF(96*(LOG(N11)-INT(LOG(N11)))-ROUND(96*(LOG(N11)-INT(LOG(N11))),0)<0,ROUND(96*(LOG(N11)-INT(LOG(N11))),0)-1,ROUND(96*(LOG(N11)-INT(LOG(N11))),0))/96))*POWER(10,INT(LOG(N11))-2)+INT(0.5+100*POWER(10,(IF(96*(LOG(N11)-INT(LOG(N11)))-ROUND(96*(LOG(N11)-INT(LOG(N11))),0)<0,ROUND(96*(LOG(N11)-INT(LOG(N11))),0)-1,ROUND(96*(LOG(N11)-INT(LOG(N11))),0))+1)/96))*POWER(10,INT(LOG(N11))-2))/2,INT(0.5+100*POWER(10,(IF(96*(LOG(N11)-INT(LOG(N11)))-ROUND(96*(LOG(N11)-INT(LOG(N11))),0)<0,ROUND(96*(LOG(N11)-INT(LOG(N11))),0)-1,ROUND(96*(LOG(N11)-INT(LOG(N11))),0))+1)/96))*POWER(10,INT(LOG(N11))-2),INT(0.5+100*POWER(10,IF(96*(LOG(N11)-INT(LOG(N11)))-ROUND(96*(LOG(N11)-INT(LOG(N11))),0)<0,ROUND(96*(LOG(N11)-INT(LOG(N11))),0)-1,ROUND(96*(LOG(N11)-INT(LOG(N11))),0))/96))*POWER(10,INT(LOG(N11))-2)))","v":5490},"Ω"]
[1.5,0,0,0,0,0,0,0,0,0,null,null,"Rt1",{"$f":"'Variable Management'!B27*1000","v":261758.98520084569},{"$f":"IF(N12>(INT(0.5+100*POWER(10,IF(96*(LOG(N12)-INT(LOG(N12)))-ROUND(96*(LOG(N12)-INT(LOG(N12))),0)<0,ROUND(96*(LOG(N12)-INT(LOG(N12))),0)-1,ROUND(96*(LOG(N12)-INT(LOG(N12))),0))/96))*POWER(10,INT(LOG(N12))-2)+INT(0.5+100*POWER(10,(IF(96*(LOG(N12)-INT(LOG(N12)))-ROUND(96*(LOG(N12)-INT(LOG(N12))),0)<0,ROUND(96*(LOG(N12)-INT(LOG(N12))),0)-1,ROUND(96*(LOG(N12)-INT(LOG(N12))),0))+1)/96))*POWER(10,INT(LOG(N12))-2))/2,INT(0.5+100*POWER(10,(IF(96*(LOG(N12)-INT(LOG(N12)))-ROUND(96*(LOG(N12)-INT(LOG(N12))),0)<0,ROUND(96*(LOG(N12)-INT(LOG(N12))),0)-1,ROUND(96*(LOG(N12)-INT(LOG(N12))),0))+1)/96))*POWER(10,INT(LOG(N12))-2),INT(0.5+100*POWER(10,IF(96*(LOG(N12)-INT(LOG(N12)))-ROUND(96*(LOG(N12)-INT(LOG(N12))),0)<0,ROUND(96*(LOG(N12)-INT(LOG(N12))),0)-1,ROUND(96*(LOG(N12)-INT(LOG(N12))),0))/96))*POWER(10,INT(LOG(N12))-2))","v":261000},"Ω"]
[1.8,0,0,0,0,0,0,0,0,0,null,null,"Rt2",{"$f":"'Variable Management'!B28*1000","v":50198.38383838383},{"$f":"IF(N13=\"OPEN\",\"OPEN\",IF(N13>(INT(0.5+100*POWER(10,IF(96*(LOG(N13)-INT(LOG(N13)))-ROUND(96*(LOG(N13)-INT(LOG(N13))),0)<0,ROUND(96*(LOG(N13)-INT(LOG(N13))),0)-1,ROUND(96*(LOG(N13)-INT(LOG(N13))),0))/96))*POWER(10,INT(LOG(N13))-2)+INT(0.5+100*POWER(10,(IF(96*(LOG(N13)-INT(LOG(N13)))-ROUND(96*(LOG(N13)-INT(LOG(N13))),0)<0,ROUND(96*(LOG(N13)-INT(LOG(N13))),0)-1,ROUND(96*(LOG(N13)-INT(LOG(N13))),0))+1)/96))*POWER(10,INT(LOG(N13))-2))/2,INT(0.5+100*POWER(10,(IF(96*(LOG(N13)-INT(LOG(N13)))-ROUND(96*(LOG(N13)-INT(LOG(N13))),0)<0,ROUND(96*(LOG(N13)-INT(LOG(N13))),0)-1,ROUND(96*(LOG(N13)-INT(LOG(N13))),0))+1)/96))*POWER(10,INT(LOG(N13))-2),INT(0.5+100*POWER(10,IF(96*(LOG(N13)-INT(LOG(N13)))-ROUND(96*(LOG(N13)-INT(LOG(N13))),0)<0,ROUND(96*(LOG(N13)-INT(LOG(N13))),0)-1,ROUND(96*(LOG(N13)-INT(LOG(N13))),0))/96))*POWER(10,INT(LOG(N13))-2)))","v":49900},"Ω"]
[2.2000000000000002,{"$f":"IF(IF((B$3*10^12-$A15)*(B$3*10^12-$A14)*-1<0,0,1)*IF(ABS(B$3*10^12-$A15)>(B$3*10^12-$A14),$A14,$A15)=B15,0,IF((B$3*10^12-$A15)*(B$3*10^12-$A14)*-1<0,0,1)*IF(ABS(B$3*10^12-$A15)>(B$3*10^12-$A14),$A14,$A15))","v":0},0,0,0,0,0,0,0,0]
[2.7,0,0,0,0,0,0,0,0,0]
[3.3,0,0,0,0,0,0,0,0,0,null,null,"Rs",{"$f":"Rs_ideal*1000","v":5.7670445615615931},{"$f":"IF(N16=0,0,IF(N16>(INT(0.5+100*POWER(10,IF(96*(LOG(N16)-INT(LOG(N16)))-ROUND(96*(LOG(N16)-INT(LOG(N16))),0)<0,ROUND(96*(LOG(N16)-INT(LOG(N16))),0)-1,ROUND(96*(LOG(N16)-INT(LOG(N16))),0))/96))*POWER(10,INT(LOG(N16))-2)+INT(0.5+100*POWER(10,(IF(96*(LOG(N16)-INT(LOG(N16)))-ROUND(96*(LOG(N16)-INT(LOG(N16))),0)<0,ROUND(96*(LOG(N16)-INT(LOG(N16))),0)-1,ROUND(96*(LOG(N16)-INT(LOG(N16))),0))+1)/96))*POWER(10,INT(LOG(N16))-2))/2,INT(0.5+100*POWER(10,(IF(96*(LOG(N16)-INT(LOG(N16)))-ROUND(96*(LOG(N16)-INT(LOG(N16))),0)<0,ROUND(96*(LOG(N16)-INT(LOG(N16))),0)-1,ROUND(96*(LOG(N16)-INT(LOG(N16))),0))+1)/96))*POWER(10,INT(LOG(N16))-2),INT(0.5+100*POWER(10,IF(96*(LOG(N16)-INT(LOG(N16)))-ROUND(96*(LOG(N16)-INT(LOG(N16))),0)<0,ROUND(96*(LOG(N16)-INT(LOG(N16))),0)-1,ROUND(96*(LOG(N16)-INT(LOG(N16))),0))/96))*POWER(10,INT(LOG(N16))-2)))","v":5.76},"mΩ"]
[3.9,0,0,0,0,0,0,0,0,0,null,null,"Cres",{"$f":"Cres","v":3.3333333333333335E-7},{"$f":"G4*1000000000000","v":330000},"pF"]
[4.7,0,0,0,0,0,0,0,0,0]
[5.6,0,0,0,0,0,0,0,0,0]
[6.8,0,0,0,0,0,0,0,0,0]
[8.1999999999999993,0,0,0,0,0,0,0,0,0]
[10,0,0,0,0,0,0,0,0,0,null,null,"Cdither",{"$f":"Cdither_init","v":1.0416666666666666E-8},{"$f":"H4","v":1E-8}]
[12,0,0,12,0,0,0,0,0,0]
[15,0,0,0,0,0,0,0,0,0]
[18,0,0,0,0,0,0,0,0,0]
[22,0,0,0,0,0,0,0,0,0]
[27,0,0,0,0,0,0,0,0,0]
[33,0,0,0,0,0,0,0,0,0]
[39,0,0,0,0,0,0,0,0,0]
[47,0,0,0,0,0,0,0,0,0,null,null,"Rc1",{"$f":"O7/1000&\" kΩ\"","v":"16.2 kΩ"},{"$f":"O7/1000","v":16.2},"kΩ"]
[56,0,0,0,0,0,0,0,0,0,null,null,"Cc1",{"$f":"C4*1000000000&\" nF\"","v":"1.8 nF"},{"$f":"C4*1000000000","v":1.8},"nF"]
[68,0,0,0,0,0,0,0,0,0,null,null,"Cc2",{"$f":"D4*1000000000000&\" pF\"","v":"12 pF"},{"$f":"D4*1000000000000","v":12},"pF"]
[82,0,0,0,0,0,0,0,0,0]
[{"$f":"A22*10","v":100},0,0,0,0,0,0,0,0,0,null,null,"Rc2",{"$f":"O8/1000&\" kΩ\"","v":{"$error":"#NUM!"}},{"$f":"O8/1000","v":{"$error":"#NUM!"}},"kΩ"]
[{"$f":"A23*10","v":120},0,0,0,0,0,0,0,0,0,null,null,"Cc3",{"$f":"I4*1000000000&\" nF\"","v":"0 nF"},{"$f":"I4*1000000000","v":0},"nF"]
[150,0,0,0,0,0,0,0,0,0,null,null,"Cc4",{"$f":"J4*1000000000000&\" pF\"","v":"0 pF"},{"$f":"J4*1000000000000","v":0},"pF"]
[180,0,0,0,0,0,0,0,0,0]
[220,0,0,0,0,0,0,0,0,0]
[270,0,{"$f":"IF(IF((C$3*10^12-$A40)*(C$3*10^12-$A39)*-1<0,0,1)*IF(ABS(C$3*10^12-$A40)>(C$3*10^12-$A39),$A39,$A40)=C40,0,IF((C$3*10^12-$A40)*(C$3*10^12-$A39)*-1<0,0,1)*IF(ABS(C$3*10^12-$A40)>(C$3*10^12-$A39),$A39,$A40))","v":0},0,0,0,0,0,0,0]
[330,0,0,0,0,0,0,0,0,0]
[390,0,0,0,0,0,0,0,0,0]
[470,0,0,0,0,0,0,0,0,0]
[560,0,0,0,0,0,0,0,0,0]
[680,0,0,0,0,0,0,0,0,0]
[{"$f":"A33*10","v":820},0,0,0,0,0,0,0,0,0]
[1000,0,0,0,0,0,0,0,0,0]
[1200,0,0,0,0,0,0,0,0,0]
[1500,0,0,0,0,0,0,0,0,0]
[1800,0,1800,0,0,0,0,0,0,0]
[2200,0,0,0,0,0,0,0,0,0]
[2700,0,0,0,0,0,0,0,0,0]
[3300,0,0,0,0,0,0,0,0,0]
[3900,0,0,0,0,0,0,0,0,0]
[4700,0,0,0,0,0,0,0,0,0]
[5600,0,0,0,0,0,0,0,0,0]
[6800,0,0,0,0,0,0,0,0,0]
[8200,0,0,0,0,0,0,0,0,0]
[10000,0,0,0,0,0,0,10000,0,0]
[12000,0,0,0,0,0,0,0,0,0]
[15000,0,0,0,0,0,0,0,0,0]
[18000,0,0,0,0,0,0,0,0,0]
[22000,0,0,0,0,0,0,0,0,0]
[27000,0,0,0,0,0,0,0,0,0]
[33000,0,0,0,0,0,0,0,0,0]
[39000,0,0,0,0,0,0,0,0,0]
[47000,56000,0,0,0,0,0,0,0,0]
[56000,0,0,0,0,0,0,0,0,0]
[68000,0,0,0,0,0,0,0,0,0]
[82000,0,0,0,0,0,0,0,0,{"$f":"IF(IF((J$3*10^12-$A70)*(J$3*10^12-$A69)*-1<0,0,1)*IF(ABS(J$3*10^12-$A70)>(J$3*10^12-$A69),$A69,$A70)=J70,0,IF((J$3*10^12-$A70)*(J$3*10^12-$A69)*-1<0,0,1)*IF(ABS(J$3*10^12-$A70)>(J$3*10^12-$A69),$A69,$A70))","v":0}]
[100000,0,0,{"$f":"IF(IF((D$3*10^12-$A71)*(D$3*10^12-$A70)*-1<0,0,1)*IF(ABS(D$3*10^12-$A71)>(D$3*10^12-$A70),$A70,$A71)=D71,0,IF((D$3*10^12-$A71)*(D$3*10^12-$A70)*-1<0,0,1)*IF(ABS(D$3*10^12-$A71)>(D$3*10^12-$A70),$A70,$A71))","v":0},0,0,0,0,0,0]
[120000,{"$f":"IF(IF((B$3*10^12-$A72)*(B$3*10^12-$A71)*-1<0,0,1)*IF(ABS(B$3*10^12-$A72)>(B$3*10^12-$A71),$A71,$A72)=B72,0,IF((B$3*10^12-$A72)*(B$3*10^12-$A71)*-1<0,0,1)*IF(ABS(B$3*10^12-$A72)>(B$3*10^12-$A71),$A71,$A72))","v":0},{"$f":"IF(IF((C$3*10^12-$A72)*(C$3*10^12-$A71)*-1<0,0,1)*IF(ABS(C$3*10^12-$A72)>(C$3*10^12-$A71),$A71,$A72)=C72,0,IF((C$3*10^12-$A72)*(C$3*10^12-$A71)*-1<0,0,1)*IF(ABS(C$3*10^12-$A72)>(C$3*10^12-$A71),$A71,$A72))","v":0},0,0,{"$f":"IF(IF((F$3*10^12-$A72)*(F$3*10^12-$A71)*-1<0,0,1)*IF(ABS(F$3*10^12-$A72)>(F$3*10^12-$A71),$A71,$A72)=F72,0,IF((F$3*10^12-$A72)*(F$3*10^12-$A71)*-1<0,0,1)*IF(ABS(F$3*10^12-$A72)>(F$3*10^12-$A71),$A71,$A72))","v":0},{"$f":"IF(IF((G$3*10^12-$A72)*(G$3*10^12-$A71)*-1<0,0,1)*IF(ABS(G$3*10^12-$A72)>(G$3*10^12-$A71),$A71,$A72)=G72,0,IF((G$3*10^12-$A72)*(G$3*10^12-$A71)*-1<0,0,1)*IF(ABS(G$3*10^12-$A72)>(G$3*10^12-$A71),$A71,$A72))","v":0},{"$f":"IF(IF((H$3*10^12-$A72)*(H$3*10^12-$A71)*-1<0,0,1)*IF(ABS(H$3*10^12-$A72)>(H$3*10^12-$A71),$A71,$A72)=H72,0,IF((H$3*10^12-$A72)*(H$3*10^12-$A71)*-1<0,0,1)*IF(ABS(H$3*10^12-$A72)>(H$3*10^12-$A71),$A71,$A72))","v":0},{"$f":"IF(IF((I$3*10^12-$A72)*(I$3*10^12-$A71)*-1<0,0,1)*IF(ABS(I$3*10^12-$A72)>(I$3*10^12-$A71),$A71,$A72)=I72,0,IF((I$3*10^12-$A72)*(I$3*10^12-$A71)*-1<0,0,1)*IF(ABS(I$3*10^12-$A72)>(I$3*10^12-$A71),$A71,$A72))","v":0},0]
[150000,0,0,0,0,0,0,0,0,0]
[180000,0,0,0,0,0,0,0,0,0]
[220000,0,0,0,0,0,0,0,0,0]
[270000,0,0,0,0,0,0,0,0,0]
[330000,0,0,0,0,0,330000,0,0,0]
[390000,0,0,0,0,0,0,0,0,0]
[470000,0,0,0,0,0,0,0,0,0]
[560000,0,0,0,0,0,0,0,0,0]
[680000,0,0,0,0,0,0,0,0,0]
[820000,0,0,0,0,0,0,0,0,0]
[1000000,0,0,0,0,0,0,0,0,0]
[1200000,0,0,0,0,0,0,0,0,0]
[1500000,0,0,0,0,0,0,0,0,0]
[1800000,0,0,0,0,0,0,0,0,0]
[2200000,0,0,0,0,0,0,0,0,0]
[2700000,0,0,0,0,0,0,0,0,0]
[3300000,0,0,0,0,0,0,0,0,0]
[3900000,0,0,0,0,0,0,0,0,0]
[4700000,0,0,0,0,0,0,0,0,0]
[5600000,0,0,0,0,0,0,0,0,0]
[6800000,0,0,0,0,0,0,0,0,0]
[8200000,0,0,0,0,0,0,0,0,0]
[10000000,0,0,0,0,0,0,0,0,0]
[12000000,0,0,0,0,0,0,0,0,0]
[15000000,0,0,0,0,0,0,0,0,0]
[18000000,0,0,0,0,22000000,0,0,0,0]
[22000000,0,0,0,0,0,0,0,0,0]
[{"$f":"A87*10","v":27000000},0,0,0,0,0,0,0,0,0]
[33000000,0,0,0,0,0,0,0,0,0]
[39000000,0,0,0,0,0,0,0,0,0]
[47000000,0,0,0,0,0,0,0,0,0]
[56000000,0,0,0,0,{"$f":"IF(IF((F$3*10^12-$A104)*(F$3*10^12-$A103)*-1<0,0,1)*IF(ABS(F$3*10^12-$A104)>(F$3*10^12-$A103),$A103,$A104)=F104,0,IF((F$3*10^12-$A104)*(F$3*10^12-$A103)*-1<0,0,1)*IF(ABS(F$3*10^12-$A104)>(F$3*10^12-$A103),$A103,$A104))","v":0},{"$f":"IF(IF((G$3*10^12-$A104)*(G$3*10^12-$A103)*-1<0,0,1)*IF(ABS(G$3*10^12-$A104)>(G$3*10^12-$A103),$A103,$A104)=G104,0,IF((G$3*10^12-$A104)*(G$3*10^12-$A103)*-1<0,0,1)*IF(ABS(G$3*10^12-$A104)>(G$3*10^12-$A103),$A103,$A104))","v":0},{"$f":"IF(IF((H$3*10^12-$A104)*(H$3*10^12-$A103)*-1<0,0,1)*IF(ABS(H$3*10^12-$A104)>(H$3*10^12-$A103),$A103,$A104)=H104,0,IF((H$3*10^12-$A104)*(H$3*10^12-$A103)*-1<0,0,1)*IF(ABS(H$3*10^12-$A104)>(H$3*10^12-$A103),$A103,$A104))","v":0},{"$f":"IF(IF((I$3*10^12-$A104)*(I$3*10^12-$A103)*-1<0,0,1)*IF(ABS(I$3*10^12-$A104)>(I$3*10^12-$A103),$A103,$A104)=I104,0,IF((I$3*10^12-$A104)*(I$3*10^12-$A103)*-1<0,0,1)*IF(ABS(I$3*10^12-$A104)>(I$3*10^12-$A103),$A103,$A104))","v":0},0]
[68000000,0,0,0,0,0,0,0,0,0]
[82000000,0,0,0,0,0,0,0,0,0]
[100000000,0,0,0,0,0,0,0,0,0]
[120000000,0,0,0,0,0,0,0,0,0]
[150000000,0,0,0,0,0,0,0,0,0]
[180000000,0,0,0,0,0,0,0,0,0]
[220000000,0,0,0,220000000,0,0,0,0,0]
[270000000,0,0,0,0,0,0,0,0,0]
[330000000,0,0,0,0,0,0,0,0,0]
[390000000,0,0,0,0,0,0,0,0,0]
[470000000,0,0,0,0,0,0,0,0,0]
[560000000,0,0,0,0,0,0,0,0,0]
[680000000,0,0,0,0,0,0,0,0,0]
[820000000,0,0,0,0,0,0,0,0,0]
[1000000000,0,0,0,0,0,0,0,0,0]
[1200000000,0,0,0,0,0,0,0,0,0]
[1500000000,0,0,0,0,0,0,0,0,0]
[1800000000,0,0,0,0,0,0,0,0,0]
[2200000000,0,0,0,0,0,0,0,0,0]
[2700000000,0,0,0,0,0,0,0,0,0]
[3300000000,0,0,0,0,0,0,0,0,0]
[3900000000,0,0,0,0,0,0,0,0,0]
[4700000000,0,0,0,0,0,0,0,0,0]
[5600000000,0,0,0,0,0,0,0,0,0]
[6800000000,0,0,0,0,0,0,0,0,0]
[8200000000,0,0,0,0,0,0,0,0,0]
[10000000000,0,0,0,0,0,0,0,0,0]
[12000000000,0,0,0,0,0,0,0,0,0]
[15000000000,0,0,0,0,0,0,0,0,0]
[18000000000,0,0,0,0,0,0,0,0,{"$f":"IF(IF((J$3*10^12-$A134)*(J$3*10^12-$A133)*-1<0,0,1)*IF(ABS(J$3*10^12-$A134)>(J$3*10^12-$A133),$A133,$A134)=J134,0,IF((J$3*10^12-$A134)*(J$3*10^12-$A133)*-1<0,0,1)*IF(ABS(J$3*10^12-$A134)>(J$3*10^12-$A133),$A133,$A134))","v":0}]
[22000000000,0,0,0,{"$f":"IF(IF((E$3*10^12-$A135)*(E$3*10^12-$A134)*-1<0,0,1)*IF(ABS(E$3*10^12-$A135)>(E$3*10^12-$A134),$A134,$A135)=E135,0,IF((E$3*10^12-$A135)*(E$3*10^12-$A134)*-1<0,0,1)*IF(ABS(E$3*10^12-$A135)>(E$3*10^12-$A134),$A134,$A135))","v":0},0,0,0,0,{"$f":"IF(IF((J$3*10^12-$A135)*(J$3*10^12-$A134)*-1<0,0,1)*IF(ABS(J$3*10^12-$A135)>(J$3*10^12-$A134),$A134,$A135)=J135,0,IF((J$3*10^12-$A135)*(J$3*10^12-$A134)*-1<0,0,1)*IF(ABS(J$3*10^12-$A135)>(J$3*10^12-$A134),$A134,$A135))","v":0}]
[27000000000,{"$f":"IF(IF((B$3*10^12-$A136)*(B$3*10^12-$A135)*-1<0,0,1)*IF(ABS(B$3*10^12-$A136)>(B$3*10^12-$A135),$A135,$A136)=B136,0,IF((B$3*10^12-$A136)*(B$3*10^12-$A135)*-1<0,0,1)*IF(ABS(B$3*10^12-$A136)>(B$3*10^12-$A135),$A135,$A136))","v":0},{"$f":"IF(IF((C$3*10^12-$A136)*(C$3*10^12-$A135)*-1<0,0,1)*IF(ABS(C$3*10^12-$A136)>(C$3*10^12-$A135),$A135,$A136)=C136,0,IF((C$3*10^12-$A136)*(C$3*10^12-$A135)*-1<0,0,1)*IF(ABS(C$3*10^12-$A136)>(C$3*10^12-$A135),$A135,$A136))","v":0},0,0,0,0,0,0,0]
[33000000000,0,0,0,0,0,0,0,0,0]
[39000000000,0,0,0,0,0,0,0,0,0]
[47000000000,0,0,0,0,0,0,0,0,0]
[56000000000,0,0,0,0,0,0,0,0,0]
[68000000000,0,0,0,0,0,0,0,0,0]
[82000000000,0,0,0,0,0,0,0,0,0]
[100000000000,0,0,0,0,0,0,0,0,0]
[120000000000,0,0,0,0,0,0,0,0,0]
[150000000000,0,0,0,0,0,0,0,0,0]
[180000000000,0,0,0,0,0,0,0,0,0]
[220000000000,0,0,0,0,0,0,0,0,0]
[270000000000,0,0,0,0,0,0,0,0,0]
[330000000000,0,0,0,0,0,0,0,0,0]
[390000000000,0,0,0,0,0,0,0,0,0]
[470000000000,0,0,0,0,0,0,0,0,0]
[560000000000,0,0,0,0,0,0,0,0,0]
[680000000000,0,0,0,0,0,0,0,0,0]
[820000000000,0,0,0,0,0,0,0,0,0]
[1000000000000,0,0,0,0,0,0,0,0,0]
[1200000000000,0,0,0,0,0,0,0,0,0]
[1500000000000,0,0,0,0,0,0,0,0,0]
[1800000000000,0,0,0,0,0,0,0,0,0]
[2200000000000,0,0,0,0,0,0,0,0,0]
[2700000000000,2700000000000,2700000000000,2700000000000,2700000000000,2700000000000,2700000000000,2700000000000,2700000000000,2700000000000]

{"sheet":"Snubber","index":10,"n_rows":6,"n_cols":5,"rows_kept":6,"cut":false,"hidden":true,"merged":[]}
[null,null,"UNITS","STD UNITS"]
["Frequency of Ringing",85,"MHz",{"$f":"B2*1000000","v":85000000},"Hz"]
["SW capacitance",3000,"pF",{"$f":"B3*0.000000000001","v":3E-9},"F"]
["Lpar",{"$f":"1000000000*1/((D2*2*3.14159)^2*D3)","v":1.1686430773614742},"nH",{"$f":"B4/1000000000","v":1.1686430773614743E-9},"H"]
["Csnub",{"$f":"4*B3","v":12000},"pF",{"$f":"B5*0.000000000001","v":1.2E-8},"F"]
["Rsnub",{"$f":"SQRT(D4/D3)","v":0.62413755891936573},"Ω",{"$f":"B6","v":0.62413755891936573},"Ω"]

{"sheet":"Parallel Output Caps","index":11,"n_rows":17,"n_cols":5,"rows_kept":17,"cut":false,"hidden":true,"merged":[]}
[]
[]
[]
["Fsw",{"$f":"Fsw","v":440000}]
[]
["C1",20,"uF",{"$f":"B6/1000000","v":2.0000000000000002E-5},"F"]
["R1",0.5,"mOhms",{"$f":"B7/1000","v":5.0000000000000001E-4},"Ohms"]
[]
["C2",68,"uF",{"$f":"B9/1000000","v":6.7999999999999999E-5},"F"]
["R2",20,"mOhms",{"$f":"B10/1000","v":0.02},"Ohms"]
[]
[]
["I1 ",{"$f":"(D6/(D6+D9))*SQRT((D10*D9*B4)^2+1)/SQRT((((D7+D10)*D6*D9/(D9+D6))*B4)^2+1)","v":0.2623198781570561},"%"]
["I2 ",{"$f":"1-B13","v":0.73768012184294385},"%"]
[]
["I1 ",{"$f":"B13*(Iripple1/(2*SQRT(3)))","v":{"$error":"#NAME?"}},"A"]
["I2 ",{"$f":"B14*(Iripple1/(2*SQRT(3)))","v":{"$error":"#NAME?"}},"A"]