{"text_format":"1","workbook":"xlsx","n_sheets":15,"sheets":["Design Regulator","Input Filters","Design Input Filter","BOM & Schematic","EVM","Variable Management","Schematic Management","Stability Calculations","Bode Plot Management","Efficiency Calculations","Efficiency Plot Management","Input Filter Calculations","Standard Value Calculator","Snubber","Parallel Output Caps"],"not_rendered":{"charts":9,"images":35,"macros":1,"external_links":0,"defined_names":301,"comments":3,"pivot_tables":0},"unopened":[],"bounds":{"document_bytes":16777216,"sheet_cells":100000,"rows_first":2000,"rows_last":500,"rows_between":2000,"halvings":0,"cell_chars":16384,"cell_head_chars":4096},"cells_cut":0,"cells_raw":0,"read":"whole","date_system":"1900"}

{"sheet":"Design Regulator","index":0,"n_rows":102,"n_cols":16,"rows_kept":102,"cut":false,"hidden":false,"merged":[[67,5,67,7],[2,13,2,14],[0,0,0,15],[78,5,78,6],[33,10,34,15]]}
["                      LM(2)5148/-Q1 Synchronous Buck Controller Design Tool"]
[null,null,null,null,null,null,null,null,null,null,null,null,null,"http://www.ti.com/product/lm5175"]
["About",null,"xx",null,null,"= Input Box",null,null,null,null,null,null,null,"TERMS OF USE",null,"                "]
[]
["Step 1: Operating Specifications"]
[null,null,null,"Input Voltage – Min, VIN(min) ",50,"V"]
[null,null,null,"Input Voltage – Nom, VIN(nom)",60,"V"]
[null,null,null,"Input Voltage – Max, VIN(max)",65,"V"]
[null,null,null,"Output Voltage, VOUT ",3.3010000000000002,"V"]
[null,null,null,"Full Load Output Current, IOUT ",25,"A"]
[null,null,null,"Switching Frequency, FSW",300,"kHz"]
[null,null,null,"Frequency Set Resistor, RT ",{"$f":"'Variable Management'!C442","v":73.2},"kΩ"]
[null,null,null,"Ambient Temperature, TA",25,"°C"]
[]
["Step 2: Current Sense Resistor"]
[null,null,null,"Required IOCP Setpoint at VIN(nom)",30,"A"]
[null,null,null,"Recommended Sense Resistance",{"$f":"Rs_ideal*1000","v":1.8963308599631434},"mΩ"]
[null,null,null,"Sense Resistance, RS",1.5,"mΩ"]
[null,null,null,"Min Inductor Sat Current, ILO(SAT)",{"$f":"'Variable Management'!B95","v":40},"A"]
[null,null,null,"Max power loss in shunt",{"$f":"'Variable Management'!B105","v":2.2107637518562204},"W"]
[null,null,null,"VIN(min)",{"$f":"'Variable Management'!B97","v":38.379250799274281},"A"]
[null,null,"IOUT(typ) at OCP Inception:","VIN(nom)",{"$f":"'Variable Management'!B98","v":38.359951701062258},"A"]
[null,null,null,"VIN(max)",{"$f":"'Variable Management'!B99","v":38.352527687018174},"A"]
[]
["Step 3: Buck Inductance"]
[null,null,null,"Recommended Inductance",{"$f":"Lopt*1000000","v":0.68770833333333337},"µH"]
[null,null,null,"Inductance, LO ",3.3,"µH"]
[null,null,null,"Inductor DCR ",4,"mΩ"]
[null,null,null,"DIL as a % at VIN(nom)",{"$f":"'Variable Management'!B68*100","v":13.120386391501945},"%"]
[]
["Step 4: Output Capacitors"]
[null,null,null,"Output Voltage Ripple Spec",200,"mVPK=PK"]
[null,null,null,"Minimum Output Capacitance",{"$f":"'Variable Management'!B121","v":6.8335345789072637},"µF"]
[null,null,null,"Output Capacitance (derated), COUT ",100,"µF",null,null,null,null,{"$f":"CHOOSE(SCH_MODE, \"\", \"** For Single-Output Operation in 2-Phase Mode, tie MODE to VDDA and use FB1 to set VOUT **\", \"** For Single-Output Operation in 3-Phase Mode, tie both MODE pins to VDDA. Use FB1 of master IC to set VOUT. Connect FB2 of master IC to AGND. Connect FB2 of slave IC to VDDA to configure it as a slave **\", \"** For Single-Output Operation in 4-Phase Mode, tie both MODE pins to VDDA. Use FB1 of master IC to set VOUT. Connect FB2 of master IC to AGND. Connect FB2 of slave IC to VDDA to configure it as a slave **\")","v":""}]
[null,null,null,"Maximum Permitted ESR",{"$f":"'Variable Management'!B125","v":60.831282147980609},"mΩ"]
[null,null,null,"Output Capacitor ESR",1,"mΩ",null,null,null,null,{"$f":"CHOOSE(SCH_MODE,  \"\", \"** Tie VCCX to GND if not used **\", \"** Slave controller (CNTRL2) not shown **\",\"** Slave controller (CNTRL2) not shown **\")","v":""},null,null,null,null,{"$f":"IF(SCH_MODE=1,  \"** Tie VCCX to GND if not used **\", \"\")","v":"** Tie VCCX to GND if not used **"}]
[null,null,null,"Resulting Output Voltage Ripple (max) ",{"$f":"'Variable Management'!B127*1000","v":14.055170331798879},"mVPK-PK",null,null,null,null,{"$f":"IF(OR(SCH_MODE=3, SCH_MODE=4),\"** Tie VCCX to GND if not used **\", \"\")","v":""}]
[null,null,null,"Output Capacitor RMS Current (max) ",{"$f":"'Variable Management'!B114","v":0.95116858338251353},"ARMS"]
[]
["Step 5: Input Capacitors"]
[null,null,null,"Input Voltage Ripple Spec",500,"mVPK-PK"]
[null,null,null,"Minimum Input Capacitance",{"$f":"'Variable Management'!B148","v":10.276893266666669},"µF"]
[null,null,null,"Input Capacitance (derated), CIN ",200,"µF"]
[null,null,null,"Maximum Permitted ESR",{"$f":"'Variable Management'!B154","v":14.854442053045892},"mΩ",null,null,null,null,null,null,null,null,null," "]
[null,null,null,"Input Capacitor ESR",1,"mΩ"]
[null,null,null,"Resulting Input Voltage Ripple (max)",{"$f":"'Variable Management'!B161*1000","v":53.285846805201615},"mVPK-PK"]
[null,null,null,"Input Capacitor RMS Current (max)",{"$f":"'Variable Management'!B138","v":6.3291244996463272},"ARMS"]
[null,null,null,"AEF Filter Inductor",0.68,"µH"]
["Step 6: Enable, CNFG, FPWM/PFM"]
[]
[]
[null,null,null,"Input Voltage UVLO Turn On",35,"V"]
[null,null,null,"Input Voltage UVLO Turn Off",30,"V"]
[null,null,null,"Upper Enable Resistor, RUV1",{"$f":"IF(UVLO_TYPE=1,'Variable Management'!B187,0)","v":499},"kΩ"]
[null,null,null,"Lower Enable Resistor, RUV2",{"$f":"IF(UVLO_TYPE=1,'Variable Management'!B188,\"DNP\")","v":14.700000000000001},"kΩ"]
[null,null,null,"Configuration Resistor, RCNFG",{"$f":"IF(DITHER=1,\"41.2\",\"29.4\")","v":"41.2"},"kΩ"]
[null,null,null,{"$f":"IF(DEMB=1, \"* Tie PFM to GND\", \"* Tie PFM to VDDA\")","v":"* Tie PFM to GND"}]
[]
["Step 7: Compensation Design"]
[null,null,null,"Load Pole Frequency",{"$f":"Fp_dominant","v":13166.227114142192},"Hz"]
[null,null,null,"ESR Zero Frequency",{"$f":"Fesr/1000","v":1591.5494327375638},"kHz"]
[null,null,null,"Desired Crossover Frequency",60,{"$f":"\"     kHz \"","v":"     kHz "}]
[null,null,null,"Error Amp Pole Frequency",{"$f":"Fp1_u","v":0.16578132219050415},"Hz"]
[null,null,null,{"$f":"CHOOSE(VOUT_setting, \"Upper Feedback Resistor\",\"\",\"\",\"\")","v":"Upper Feedback Resistor"},100,"kΩ"]
[null,null,null,{"$f":"CHOOSE(VOUT_setting, \"Lower Feedback Resistor\", \"* Pullup FB to VDDA with \"&'Variable Management'!D418,\"* Tie FB TO VDDA\",\"* Pullup FB to VDDA with\"&'Variable Management'!D418)","v":"Lower Feedback Resistor"},{"$f":"IF(Vout=Vref,\"OPEN\",Rfb2_u/1000)","v":31.6},{"$f":"IF(Vout=Vref,\"\",\"kΩ\")","v":"kΩ"}]
[]
["Compensation Components"]
[null,"Calculated /","Std Values",{"$f":"C68","v":"Std Values"},null,"Actual P/Z Frequencies"]
["RC1",{"$f":"Rcea1/1000","v":1.944449500809375},{"$f":"'Standard Value Calculator'!S32","v":1.96},{"$f":"C69","v":1.96},"kΩ",{"$f":"Fp1_u","v":0.16578132219050415},"Hz   (FPEA)"]
["CC1",{"$f":"Cc1ea*1000000000","v":13.641816806205588},{"$f":"'Standard Value Calculator'!S33","v":14.999999999999998},{"$f":"C70","v":14.999999999999998},"nF",{"$f":"Fz1_u/1000","v":5.413433444685591},"kHz (FZCOMP)"]
["CC2",{"$f":"IF(Cc2ea<0, \"N/A\", Cc2ea*1000000000000)","v":513.84168359347223},{"$f":"'Standard Value Calculator'!S34","v":470.00000000000006},{"$f":"C71","v":470.00000000000006},"pF",{"$f":"Fp2_u/1000","v":161.8104571181608},"kHz (FPCOMP)"]
[null,null,null,null,null,null,null,null,null,null,null,null,"** Specify Inductor Core Loss **",0.2,"W"]
[]
["Efficiency / Power Loss Analyzer"]
[]
["Step 8: Efficiency"]
[null,null,null,null,null,"Power MOSFETs","(Q1, Q2) "]
[null,null,null,null,"'836, '818"]
[null,null,null,null,"High-side","  Low-side"]
[null,null,null,"On-State Resistance, RDS(on) ",6.2,3.3,"mΩ"]
[null,null,null,"Total Gate Charge, QG ",16,31,"nC"]
[null,null,null,"Gate-Drain Charge, QGD ",5.5,11.2,"nC"]
[null,null,null,"Gate-Source Charge, QGS ",6.3,11,"nC"]
[null,null,null,"Output Charge, QOSS ",null,30,"nC"]
[null,null,null,"Output Capacitance, COSS ",250,484,"pF"]
[null,null,null,"Gate Resistance, RG ",1.2,1,"Ω"]
[null,null,null,"Transconductance, gFS ",99,200,"S"]
[null,null,null,"Gate-Source Threshold Voltage, VTH ",3,3,"V"]
[null,null,null,"Body Diode Forward Voltage, VBD ",0.7,0.7,"V"]
[null,null,null,"Body Diode Rev Recovery Charge, QRR ",null,73,"nC"]
[null,null,null,"Thermal Resistance, θJA ",42,40.700000000000003,"°C/W"]
[]
["External Schottky Diode (if applicable)"]
[null,null,null,"Schottky Fwd Voltage, VFWDsch ",null,0,"V"]
[null,null,null,"Schottky Rev Recovery Charge, QRRsch ",null,0,"nC"]
[]
[]
[]
["Step 9: IC Power Loss"]
[null,null,null,"IC Power Dissipation",{"$f":"'Variable Management'!B361","v":0.84599999999999997},"W"]
[null,null,null,"IC Junction Temperature (estimate)",{"$f":"'Variable Management'!B363","v":53.848600000000005},"°C"]
[null,null,null,null,{"$f":"CHOOSE(Ext_VCC, \"\", \"* Tie VCCX to PGND\")","v":"* Tie VCCX to PGND"}]

{"sheet":"Input Filters","index":1,"n_rows":17,"n_cols":17,"rows_kept":17,"cut":false,"hidden":true,"merged":[[0,0,0,16],[2,14,2,15]]}
["                           LM(2)5149-Q1 Synchronous Buck Controller Design Tool"]
[null,null,null,null,null,null,null,null,null,null,null,null,null,null,"http://www.ti.com/product/lm5175"]
["About",null,"xx",null,null,"= Input Box",null,null,null,null,null,null,null,null,"TERMS OF USE",null,"                "]
[]
[]
[]
[null,null,null,null,"AEF",null,null,null,null,null,null,null,"Passive"]
[]
[null,"Design tab - LAEF",{"$f":"'Design Regulator'!E48 & \" µH\"","v":"0.68 µH"},null,null,"LAEF",1,"µH",null,"Suggested LIN Inductor","0.1-10","µH",null,"Chosen LIN",0.68,"µH"]
[null,"Design tab - CINJ",{"$f":"'Design Regulator'!#REF! & \" µF\"","v":{"$error":"#REF!"}},null,null,"CINJ",1,"µF",null,"Suggested CF","0.1-10","µF",null,"Chosen CF",0.47,"µF"]
[null,"Design tab - CDAMP",{"$f":"'Design Regulator'!#REF! & \" µF\"","v":{"$error":"#REF!"}},null,null,"CDAMP",1,"µF",null,"Suggested CDAMP","1-10","µF",null,"Chosen CDAMP",1,"µF"]
[null,"Design tab - RDAMP",{"$f":"'Design Regulator'!#REF! & \" Ω\"","v":{"$error":"#REF!"}},null,null,"RDAMP",10,"Ω",null,"Suggested RDAMP",{"$f":"Rdamp_PassiveStd","v":8.2500000000000004E-2},"Ω",null,"Chosen RDAMP",0.35,"Ω"]
[]
[null,null,"VIN Ripple at Fsw",null,null,{"$f":"VinRipple_dBuV","v":94.532237437329556},"dBµV","VIN Ripple",{"$f":"VinRipple_dBuV","v":94.532237437329556},"dBµV"]
[]
[null,null,null,"AEF Attenuation at Fsw",{"$f":"-'Input Filter Calculations'!AM97","v":{"$error":"#REF!"}},"dB",null,null,null,null,null,"Passive Attenuation at Fsw",{"$f":"-'Input Filter Calculations'!AA97","v":6.5724330903943216},"dB"]
[null,null,null,"AEF EMI at Fsw",{"$f":"VinRipple_dBuV-E16","v":{"$error":"#REF!"}},"dB-µV",null,null,null,null,null,"Passive EMI at Fsw",{"$f":"VinRipple_dBuV-M16","v":87.959804346935229},"dB-µV"]

{"sheet":"Design Input Filter","index":2,"n_rows":14,"n_cols":17,"rows_kept":14,"cut":false,"hidden":true,"merged":[[0,0,0,16],[2,14,2,15]]}
["                           LM5149-Q1 Synchronous Buck Controller Design Tool"]
[null,null,null,null,null,null,null,null,null,null,null,null,null,null,"http://www.ti.com/product/lm5175"]
["About",null,"xx",null,null,"= Input Box",null,null,null,null,null,null,null,null,"TERMS OF USE",null,"                "]
[]
[]
[]
[null,"Choose Filter"]
[null,"Suggested Inductor",{"$f":"CHOOSE(INFILTER_TYPE,\"\",\"0.01-1\",\"0.1-10\")","v":""},"µH",null,"Chosen Inductor",1,"µH"]
[null,{"$f":"CHOOSE(INFILTER_TYPE,\"\",\"Suggested Cinj\",\"Suggested Cf\")","v":""},{"$f":"CHOOSE(INFILTER_TYPE,\"\",'Standard Value Calculator'!S24,'Standard Value Calculator'!S23)","v":""},"µF",null,{"$f":"CHOOSE(INFILTER_TYPE,\"\",\"Chosen Cinj\",\"Chosen Cf\")","v":""},6.8000000000000005E-2,"µF"]
[null,"Suggested Cdamp",{"$f":"CHOOSE(INFILTER_TYPE,\"\",CHOOSE(OSC,\"DNP\",'Standard Value Calculator'!S25),'Standard Value Calculator'!S28)","v":""},"µF",null,"Chosen Cdamp",3.3000000000000002E-2,"µF"]
[null,"Suggested Rdamp",{"$f":"CHOOSE(INFILTER_TYPE,\"\",'Standard Value Calculator'!S26,Rdamp_PassiveStd)","v":""},"Ω",null,"Chosen Rdamp",43.2,"Ω"]
[null,null,null,null,null,"Filter Attenuation",{"$f":"-'Variable Management'!B302","v":0},"dB"]
[null,null,null,null,null,"VIN Ripple",{"$f":"VinRipple_dBuV","v":94.532237437329556},"dB-µV"]
[null,null,null,null,null,"Fsw Conducted EMC",{"$f":"'Variable Management'!B303","v":94.532237437329556},"dB-µV"]

{"sheet":"BOM & Schematic","index":3,"n_rows":71,"n_cols":10,"rows_kept":71,"cut":false,"hidden":true,"merged":[[50,3,50,5],[47,3,47,5],[62,3,62,6],[63,3,63,6],[61,3,61,6],[52,3,52,5],[55,3,55,6],[41,3,41,6],[46,3,46,5],[60,3,60,6],[58,3,58,6],[59,3,59,6],[54,3,54,6],[57,3,57,6],[56,3,56,6],[53,3,53,6],[42,3,42,5],[43,3,43,5],[48,3,48,5],[49,3,49,5],[51,3,51,5],[44,3,44,5],[45,3,45,5],[64,0,65,0],[64,9,65,9],[64,3,65,6],[64,2,65,2],[64,1,65,1],[64,7,65,7],[64,8,65,8]]}
[]
[]
[]
[]
[]
[]
[]
[]
[]
[]
[]
[]
[]
[]
[]
[]
[]
[]
[]
[]
[]
[]
[]
[]
[]
[]
[]
[]
[]
[]
[]
[]
[]
[]
[]
["   ** Tie DEMB to VDDA for FPWM, AGND for DEM **"]
["   ** Tie VCCX to GND if not used **",null,null,null,null,null,null,null,{"$f":"IF(OR(SCH_MODE=3, SCH_MODE=4),\"** Tie VCCX to GND if not used **\", \"\")","v":""}]
["   ** Tie DITH to VDDA to disable spread spectrum **"]
["   ** Tie OSC to VDDA for 2.2MHz, AGND for 440kHz **"]
[{"$f":"\"VIN = \"&VIN_min&\" V to \"&VIN_max&\" V, VOUT = \"& Vout &\" V, IOUT = \" &Iout & \" A,  Fsw = \" & Fsw/1000 &\" kHz, Current Limit = \"&ROUNDUP(Ilimit_DC,0)&\" A\"","v":"VIN = 50 V to 65 V, VOUT = 3.301 V, IOUT = 25 A,  Fsw = 300 kHz, Current Limit = 30 A"}]
["High Efficiency Synchronous Buck Regulator BOM"]
["Count","Ref Des","Value","Description",null,null,null,"Size","Part Number","MFR"]
[1,"CBOOT",0.1,{"$f":"C43","v":0.1},null,null,null,"0603","Std","Std"]
[1,"CC1",{"$f":"'Design Regulator'!D70","v":14.999999999999998},14.999999999999998,null,null,null,"0603","Std","Std"]
[1,"CC2",{"$f":"'Design Regulator'!D71","v":470.00000000000006},470.00000000000006,null,null,null,"0603","Std","Std"]
[1,"CRES",{"$f":"Cres_u*1000000000","v":470},{"$f":"C46","v":470},null,null,null,"0603","Std","Std"]
[1,"CDITH",{"$f":"Cdither*1000000000","v":2.1999999999999997},{"$f":"C47","v":2.1999999999999997},null,null,null,"0603","Std","Std"]
[{"$f":"ROUNDUP('Design Regulator'!E43/10,0)","v":20},"CIN",10,{"$f":"C48","v":10},null,null,null,1210,"Std","Std"]
[{"$f":"ROUNDUP('Design Regulator'!E34/47,0)","v":3},"COUT",47,{"$f":"C49","v":47},null,null,null,1210,"Std","Std"]
[1,"CSS",{"$f":"'Design Regulator'!#REF!","v":{"$error":"#REF!"}},{"$f":"C50","v":{"$error":"#REF!"}},null,null,null,"0603","Std","Std"]
[2,"CVCC, CVCCX",2.2000000000000002,2.2000000000000002,null,null,null,"0603","Std","Std"]
[1,"CVDDA",0.47,0.47,null,null,null,"0603","Std","Std"]
[1,"DBOOT","See description","Schottky Diode, 60V, 200mA",null,null,null,"-","-","Various"]
[1,"LO",{"$f":"'Design Regulator'!E27","v":3.3},{"$f":"\"Inductor, \"&Lf*1000000&\"µH, \"&Rdcr*1000&\"mΩ, >\"&ROUNDUP(Ilimit_DC*1.1,0)&\"A\"","v":"Inductor, 3.3µH, 4mΩ, >33A"},null,null,null,"-","-","Various"]
[2,"Q1, Q2","See description",{"$f":"'Design Regulator'!E80","v":6.2},null,null,null,"Std",{"$f":"'Design Regulator'!E78","v":"'836, '818"},"-"]
[1,"RC1",{"$f":"'Design Regulator'!D69","v":1.96},{"$f":"C56","v":1.96},null,null,null,"0603","Std","Std"]
[1,"RS",{"$f":"Rs*1000","v":1.5},1.5,null,null,null,"0508","Std","Std"]
[1,"RT",{"$f":"'Design Regulator'!E12","v":73.2},73.2,null,null,null,"0603","Std","Std"]
[1,"RFB1",{"$f":"'Design Regulator'!E64","v":100},100,null,null,null,"0603","Std","Std"]
[1,"RFB2",{"$f":"'Design Regulator'!E65","v":31.6},31.6,null,null,null,"0603","Std","Std"]
[1,"RPGOOD",100,100,null,null,null,"0603","Std","Std"]
[1,"RCS",100,100,null,null,null,"0603","Std","Std"]
[1,"RDEMB",100,100,null,null,null,"0603","Std","Std"]
[1,"RVIN",2.2000000000000002,2.2000000000000002,null,null,null,"0603","Std","Std"]
[1,"U1","LM5141-Q1","IC, LM5141-Q1, Synchronous Buck PWM Controller, 3.8V–65V Input",null,null,null,"VQFN-24","LM5141QRGEQ1","TI"]
[]
[]
["NOTES:"]
["** For information on TI NexFETTM MOSFETs, see **",null,null,"http://www.ti.com/nexfet","   **"]
["** Inductor saturation current should be higher than the peak inductor current at the OCP setpoint for all input voltages and operating temperatures **"]
["** Effective input and output capacitances should be appropriately derated for applied voltage and temperature, particularly with ceramics **"]

{"sheet":"EVM","index":4,"n_rows":6,"n_cols":2,"rows_kept":6,"cut":false,"hidden":false,"merged":[[0,0,0,16]]}
[" LM25149-Q1 Quickstart Design Tool"]
[]
[]
[]
[]
[null,"LM25149-Q1EVM-2100 PCB Layout"]

{"sheet":"Variable Management","index":5,"n_rows":450,"n_cols":27,"rows_kept":450,"cut":false,"hidden":true,"merged":[[4,4,4,7],[0,0,0,8]]}
["EXCEL Variables Names/Calculations"]
[null,"Input from user ="]
[null,"Output ="]
[null,"Constant"]
["Variable Name","Value","STD Units",null,"Notes",null,null,null,"Iteration"]
["Step 1: Operational Specs"]
["VIN_min",{"$f":"'Design Regulator'!E6","v":50},"V","Minimum input voltage",null,null,null,null,1]
["VIN_nom",{"$f":"'Design Regulator'!E7","v":60},"V","Nominal input voltage",null,null,null,null,null,null,{"$f":"CHOOSE(SCH_MODE, \"Efficiency vs. IOUT (Ch1)\", \"Efficiency vs. IOUT - 2 Ph\", \"Efficiency vs. IOUT - 3 Ph\", \"Efficiency vs. IOUT - 4 Ph\")","v":"Efficiency vs. IOUT (Ch1)"},1,null,"DITHER Enabled",1,null,null,null,null,"Dual  Outputs",1,null,"FPWM",1,null,{"$f":"CHOOSE(SCH_MODE, \"Bode Plot (Ch1)\", \"Bode Plot - 2 Ph\", \"Bode Plot - 3 Ph\", \"Bode Plot - 4 Ph\")","v":"Bode Plot (Ch1)"},1]
["VIN_max",{"$f":"'Design Regulator'!E8","v":65},"V","Maximum input voltage",null,null,null,null,null,null,{"$f":"IF(MODE=1, \"Efficiency vs. IOUT (Ch2)\", \"N/A - Do Not Use\")","v":"Efficiency vs. IOUT (Ch2)"},2,null,"DITHER Disabled",2,null,null,null,null,"Single Output – 2  Phases",2,null,"PFM",2,null,{"$f":"IF(MODE=1, \"AEF Gain\", \"N/A - Do Not Use\")","v":"AEF Gain"},2]
[null,null,null,null,null,null,null,null,null,null,"PLOT_TYPE",1,null,"DITHER Yes/No",1,"1 = Yes, 2 = No",null,null,null,"Single Output – 3  Phases",3,null,"FPWM/PFM",1,null,"BODE_PLOT_TYPE",1]
["Vout",{"$f":"'Design Regulator'!E9","v":3.3010000000000002},"V","Output voltage - channel 1",null,null,null,null,null,null,null,null,null,null,null,null,null,null,null,"Single Output – 4  Phases",4]
["Iout",{"$f":"'Design Regulator'!E10","v":25},"A","Output current - channel 1",null,null,null,null,1,null,null,null,null,null,null,null,null,null,null,"Single/Dual Yes/No",1]
[null,null,null,null,null,null,null,null,1,null,"Adjustable",1,null,"3.3V",1,null,null,null,null,"MODE (Single/Dual), DUAL = 1, SINGLE = 2",{"$f":"IF(U12=1, 1, 2)","v":1},null,"VCCX Connected",1]
["Rout",{"$f":"Vout/Iout","v":0.13204000000000002},"W","Load resistance - Channel 1",null,null,null,null,null,null,"5V",2,null,"5V",2,null,null,null,null,"SINGLE OUTPUT (1 = YES)",{"$f":"IF(U12=1, 2, 1)","v":2},null,"No External VCC",2]
[null,null,null,null,null,null,null,null,null,null,"3.3V",3,null,"Adjustable",3,null,null,null,null,"Number of Phases",{"$f":"SCH_MODE","v":1},null,"Ext_VCC",2]
["Pout",{"$f":"Vout*Iout","v":82.525000000000006},"W","Output power",null,null,null,null,null,null,"12V",4,null,"Ch2 Output Setting",{"$f":"IF(Vout2=3.3, 1, IF(Vout2=5, 2, 3))","v":3}]
[null,null,null,null,null,null,null,null,null,null,"Output Voltage Setting",{"$f":"IF(Vout=3.3, 3, IF(Vout=5, 2,  IF(Vout=12,4,1)))","v":1}]
["Efficiency",0.9,null,"Estimate of efficiency"]
["Pin",{"$f":"Pout/Efficiency","v":91.694444444444443},"W","Calculate input power assuming finite efficiency",null,null,null,null,null,null,null,null,null,null,null,null,null,null,null,null,null,null,"2.2 MHz Fsw Setting",1,null,"Internal Compensation",1]
[null,null,null,null,null,null,null,null,null,null,null,null,null,null,null,null,null,null,null,null,null,null,"440 kHz Fsw Setting",2,null,"External Compensation",2]
["Iin_Vinmin",{"$f":"Pin/VIN_min","v":1.8338888888888889},"A",null,null,null,null,null,null,null,null,{"$f":"Vout","v":3.3010000000000002},null,null,null,null,null,null,null,null,null,null,"OSC",{"$f":"IF(Fsw>1000000,1,2)","v":2},null,"COMP_TYPE",2]
["Iin_Vinnom",{"$f":"Pin/VIN_nom","v":1.5282407407407408},"A","Input currents at min, nom, max Vin",null,null,null,{"$f":"AND(OSC=1, OR(Fsw/1000>2530, Fsw/1000<1800))","v":false}]
["Iin_Vinmax",{"$f":"Pin/VIN_max","v":1.4106837606837606},"A",null,null,null,null,{"$f":"AND(OSC=2, OR(Fsw/1000>500, Fsw/1000<300))","v":false}]
[null,null,null,null,null,null,null,{"$f":"OR(H22,H23)","v":false}]
["OSC setting",{"$f":"CHOOSE(OSC, 2200, 440)","v":440},"kHz",null,null,null,null,null,null,null,"SetVout_IntComp_nAEF",1,null,null,null,null,null,null,null,null,null,null,"No Input Filter",1,null,"UVLO Divider",1]
["Fsw",{"$f":"'Design Regulator'!E11*1000","v":300000},"Hz","Nominal switching frequency - determines RT resistor (SYNCIN must be 80-120% of this)",null,null,null,null,null,null,"SetVout_IntComp_AEF",2,null,null,null,null,null,null,null,null,null,null,"AEF Input Filter",2,null,"No UVLO Divider",2]
["RT resistor to AGND",{"$f":"((1000000000/Fsw)-53)/45+0.1","v":72.996296296296293},"kΩ",null,null,null,null,null,null,null,"SetVout_ExtComp_nAEF",3,null,null,null,null,null,null,null,null,null,null,"Passive LC Filter",3,null,"UVLO_TYPE",1]
[null,null,"kΩ",null,null,null,null,null,1,null,"SetVout_ExtComp_AEF",4,null,null,null,null,null,null,null,null,null,null,"INFILTER_TYPE",1]
["Tsw",{"$f":"1/Fsw","v":3.3333333333333333E-6},"sec","Switching period",null,null,null,null,null,null,"AdjVout_IntComp_nAEF",5]
["Vref",0.8,"V","Reference voltage",null,null,null,null,null,null,"AdjVout_IntComp_AEF",6]
["Rt",{"$f":"'Standard Value Calculator'!S12/1000","v":73.2},"kΩ","Frequency set resistor",null,{"$f":"IF(OR((Fsw=440000),(Fsw=2200000)),\"N/A\",Rfadj/1000)","v":7.3200000000000001E-2},null,null,null,null,"AdjVout_ExtComp_nAEF",7]
[null,null,null,null,null,null,null,null,null,null,"AdjVout_ExtComp_AEF",8]
["Step 2: Buck Inductor","Channel 1",null,null,null,null,null,null,null,null,"Schematic setting",{"$f":"(IF(OR(Vout=3.3,Vout=5,Vout=12),CHOOSE(COMP_TYPE,IF(INFILTER_TYPE=1,1,2),IF(INFILTER_TYPE=1,3,4)),CHOOSE(COMP_TYPE,IF(INFILTER_TYPE=1,5,6),IF(INFILTER_TYPE=1,7,8))))","v":7}]
["Don1",{"$f":"Vout/VIN_nom","v":5.5016666666666672E-2},null,null,null,"Ideal Duty Cycle at VIN(nom)"]
["Doff1",{"$f":"1-34:34","v":0.94498333333333329},null,null,null,"Ideal 1- Duty Cycle at VIN(nom)"]
[]
["D_Vinmin",{"$f":"Vout/VIN_min","v":6.6020000000000009E-2}]
["D_Vinnom",{"$f":"Vout/VIN_nom","v":5.5016666666666672E-2}]
["D_Vinmax",{"$f":"Vout/VIN_max","v":5.0784615384615386E-2}]
[]
["L_Vinnom",{"$f":"(VIN_nom-Vout)*D1_Vinnom/(Fsw*(Iout/Number_of_Phases)*0.3)","v":1.3863955481481481E-6},"H",null,null,"Calculated inductance for 35% ripple at VIN(nom)"]
["L_slopecomp",{"$f":"1000*Vout*Rs/24/Fsw","v":6.8770833333333335E-7},"H",null,null,"Calculated inductance based on one times inductor downslope"]
[]
["Lopt",{"$f":"B42","v":6.8770833333333335E-7},"H",null,null,"Slope comp"]
[]
["Lo",{"$f":"'Design Regulator'!E27/1000000","v":3.2999999999999997E-6},"H",null,null,"Chosen inductance"]
["Rdcr",{"$f":"'Design Regulator'!E28/1000","v":4.0000000000000001E-3},"W",null,null,"Chosen inductor DCR"]
[]
["Don2",{"$f":"(Vout+Iout*(Rdcr+Rs))/(Vin+Iout*Rs)","v":5.7272537997085156E-2}]
["Doff2",{"$f":"1-_Don2","v":0.9427274620029148}]
[]
["D_Vinmin_2",{"$f":"CHOOSE(MODE, (Vout+Iout*(Rdcr+Rs))/(VIN_min+Iout*Rs), (Vout+Iout/Number_of_Phases*(Rdcr+Rs))/(VIN_min+Iout/Number_of_Phases*Rs))","v":6.8718461154134408E-2},null,null,null,"Duty cycles adjusted for DCR/shunt voltage drops"]
["D_Vinnom_2",{"$f":"CHOOSE(MODE, (Vout+Iout*(Rdcr+Rs))/(VIN_nom+Iout*Rs), (Vout+Iout/Number_of_Phases*(Rdcr+Rs))/(VIN_nom+Iout/Number_of_Phases*Rs))","v":5.7272537997085156E-2},null,null,null,"need to include RDS(on) later"]
["D_Vinmax_2",{"$f":"CHOOSE(MODE, (Vout+Iout*(Rdcr+Rs))/(VIN_max+Iout*Rs), (Vout+Iout/Number_of_Phases*(Rdcr+Rs))/(VIN_max+Iout/Number_of_Phases*Rs))","v":5.2869498366327129E-2}]
[]
["Iripple_Vinmin",{"$f":"(VIN_min-Vout)*D1_Vinmin_2/(Fsw*Lf)","v":3.2414984014514374},"A"]
["Iripple_Vinnom",{"$f":"(VIN_nom-Vout)*D1_Vinnom_2/(Fsw*Lf)","v":3.2800965978754864},"A"]
["Iripple_Vinmax",{"$f":"(VIN_max-Vout)*D1_Vinmax_2/(Fsw*Lf)","v":3.2949446259636548},"A"]
[]
["Ishunt_rms_Vinmin",{"$f":"SQRT((Iout/Number_of_Phases)^2+(Iripple_Vinmin^2)/12)","v":25.017506057236886},"A"]
["Ishunt_rms_Vinnom",{"$f":"SQRT((Iout/Number_of_Phases)^2+(Iripple_Vinnom^2)/12)","v":25.017925296493903},"A"]
["Ishunt_rms_Vinmax",{"$f":"SQRT((Iout/Number_of_Phases)^2+(Iripple_Vinmax^2)/12)","v":25.018087890044953},"A"]
["Max shunt power loss at full load",{"$f":"B61^2*Rs","v":0.93884487921142434},"W",null,null,"Note this is power loss at full load - not loss near OCP!"]
[]
["Max inductor ripple current",{"$f":"MAX(B56:B58)","v":3.2949446259636548},"A",null,null,"Ripple current at Vin(max)"]
[]
[null,{"$f":"B56/(Iout/Number_of_Phases)","v":0.12965993605805751}]
["% ripple current",{"$f":"B57/(Iout/Number_of_Phases)","v":0.13120386391501945}]
[null,{"$f":"B58/(Iout/Number_of_Phases)","v":0.13179778503854619}]
[]
["Inductor copper temerature",100,"°C"]
["DCR at hot",{"$f":"Rdcr*(1+0.0039*(B71-25))","v":5.1700000000000001E-3},"W"]
[]
[]
["Step 3: Sense Resistors, Slope Comp, Current Limit"]
[]
["Ilimit_DC",{"$f":"'Design Regulator'!E16","v":30},"A",null,null,"Chosen OCP level - based on output current"]
[]
["Ilimit_inductor_Vinmin",{"$f":"CHOOSE(MODE, Ilimit_DC+Iripple_Vinmin/2, Ilimit_DC/Number_of_Phases+Iripple_Vinmin/2)","v":31.620749200725719},"A",null,null,"Peak inductor current at current limit inception"]
["Ilimit_inductor_Vinnom",{"$f":"CHOOSE(MODE, Ilimit_DC+Iripple_Vinnom/2, Ilimit_DC/Number_of_Phases+Iripple_Vinnom/2)","v":31.640048298937742},"A"]
["Ilimit_inductor_Vinmax",{"$f":"CHOOSE(MODE, Ilimit_DC+Iripple_Vinmax/2, Ilimit_DC/Number_of_Phases+Iripple_Vinmax/2)","v":31.647472312981826},"A"]
[]
[]
["CS threshold_min",5.1999999999999998E-2,"V"]
["CS threshold",0.06,"V"]
["CS threshold_max",6.8000000000000005E-2,"V"]
[]
["Shunt required to get OCP at VIN(min)",{"$f":"Buck_CS_threshold/B79","v":1.8974882479578616E-3},"W"]
["Shunt required to get OCP at VIN(nom)",{"$f":"Buck_CS_threshold/B80","v":1.8963308599631433E-3},"W"]
["Shunt required to get OCP at VIN(max)",{"$f":"Buck_CS_threshold/B81","v":1.89588600968261E-3},"W"]
[]
["Rs_ideal",{"$f":"B89","v":1.8963308599631433E-3},"W",null,null,"Ideal Rs for the required OCP -- based on 73mV CL threshold"]
["Rs",{"$f":"'Design Regulator'!E18/1000","v":1.5E-3},"W",null,null,"Selected (starndard value) current limit sense resistor"]
[]
["Current limit - peak",{"$f":"Buck_CS_threshold/Rs","v":40},"A",null,null,"Peak inductor current limit = min sat current"]
[]
["Iout_OCP_Vinmin",{"$f":"Number_of_Phases*(Buck_CS_threshold/Rs-Iripple_Vinmin/2)","v":38.379250799274281},"A",null,null,"Current limit setpoints (i.e. IOUT) after standard components are selected"]
["Iout_OCP_Vinnom",{"$f":"Number_of_Phases*(Buck_CS_threshold/Rs-Iripple_Vinnom/2)","v":38.359951701062258},"A"]
["Iout_OCP_Vinmax",{"$f":"Number_of_Phases*(Buck_CS_threshold/Rs-Iripple_Vinmax/2)","v":38.352527687018174},"A"]
[]
["Irms_OCP_Vinmin",{"$f":"SQRT((Iout_OCP_Vinmin/Number_of_Phases)^2+(Iripple_Vinmin^2)/12)","v":38.390656431448008},"A"]
["Irms_OCP_Vinnom",{"$f":"SQRT((Iout_OCP_Vinnom/Number_of_Phases)^2+(Iripple_Vinnom^2)/12)","v":38.371636408274},"A"]
["Irms_OCP_Vinmax",{"$f":"SQRT((Iout_OCP_Vinmax/Number_of_Phases)^2+(Iripple_Vinmax^2)/12)","v":38.36432068546906},"A"]
[]
["Pshunt_Vinmin",{"$f":"B101^2*Rs","v":2.2107637518562204},"W",null,null,"Max power dissipations in shunt"]
["Pshunt_Vinnom",{"$f":"B102^2*Rs","v":2.2085737209731682},"W"]
["Pshunt_Vinmax",{"$f":"B103^2*Rs","v":2.207731652486264},"W"]
[]
[]
["Step 4: Output Capacitor"]
["Icoutrms_VINmin",{"$f":"Iripple_Vinmin/SQRT(12)","v":0.93573998732786456},"A",null,null,"Output Cap RMS current"]
["Icoutrms_VINnom",{"$f":"Iripple_Vinnom/SQRT(12)","v":0.94688232687569396},"A"]
["Icoutrms_VINmax",{"$f":"Iripple_Vinmax/SQRT(12)","v":0.95116858338251353},"A"]
["Max Cout rms current",{"$f":"MAX(B111:B113)","v":0.95116858338251353},"A"]
[]
["Vripple1",{"$f":"'Design Regulator'!E32/1000","v":0.2},"V",null,null,"Output voltage ripple spec(pk-pk)"]
[]
["Output Ripple Spec (pk-pk)",{"$f":"Vo1_ripple*1000","v":200},"mV",null,null,"Vout ripple spec at Vin(nom)"]
[]
["Coutmin",{"$f":"Iripple_Vinnom/(Fsw*8*Vo1_ripple)","v":6.8335345789072635E-6},"F",null,null,"Minimum output capacitnace",null,{"$f":"Vo2_ripple","v":0},1]
["Reported Coutmin",{"$f":"IF(Cout_min*1000000<2, 2.2,Cout_min*1000000)","v":6.8335345789072637},"uF"]
["Cout",{"$f":"'Design Regulator'!E34/1000000","v":1E-4},"F",null,null,"Chosen output capacitance",null,null,1]
["Resrmax",{"$f":"SQRT((Vo1_ripple/Iripple_Vinnom)^2-(1/(Fsw*Cout*8))^2)","v":6.0831282147980607E-2},"W",null,null,"Max ESR before ripple exceeds Vripple1",null,null,1]
[]
["Reported Cout ESR max",{"$f":"IF(OR(CoutEsrMax>0.3, CoutEsrMax<0, (ISERROR(CoutEsrMax))), \"N/A\", CoutEsrMax*1000)","v":60.831282147980609},"mΩ"]
["CoutEsr",{"$f":"'Design Regulator'!E36/1000","v":1E-3},"W",null,null,"Chosen ESR",null,null,1,null,{"$f":"ISERROR(CoutEsrMax)","v":false},{"$f":"ISERROR(B125)","v":false}]
["Vripple",{"$f":"Iripple_Vinnom*SQRT(Cout_ESR^2+(1/(8*Fsw*Cout))^2)","v":1.4055170331798879E-2},"Vp-p",null,null,null,null,null,null,null,null,{"$f":"OR(CoutEsrMax>0.3,CoutEsrMax<0)","v":false}]
[null,null,null,null,null,null,null,null,null,null,{"$f":"OR(TRUE, FALSE, TRUE)","v":true}]
["Step 5: Input Capacitor"]
[null,null,null,null,null,null,null,null,null,null,"Two channels operating at full load"]
["Icinrms_VINmin",{"$f":"SQRT(D1_Vinmin_2*(Iout^2*(1-D1_Vinmin_2)+Iripple_Vinmin^2/12))","v":6.3291244996463272},"A",{"$f":"D1_Vinmax","v":5.0784615384615386E-2},null,"Calculate input cap rms current with one output unloaded",null,null,null,null,{"$f":"SQRT(Iout^2*D1_Vinmin*(1-D1_Vinmin)+Iout2^2*D2_Vinmin*(1-D2_Vinmin)-2*Iout*Iout2*D1_Vinmin*D2_Vinmin)","v":{"$error":"#NAME?"}},"A",{"$f":"SQRT(Iout^2*D1_Vinmin*(1-D1_Vinmin)+Iout2^2*D2_Vinmin*(1-D2_Vinmin)-2*Iout*Iout2*(0.5-D2_Vinmin*(1-D1_Vinmin)))","v":{"$error":"#NAME?"}},"A"]
["Icinrms_VINnom",{"$f":"SQRT(D1_Vinnom_2*(Iout^2*(1-D1_Vinnom_2)+Iripple_Vinnom^2/12))","v":5.8134840032988127},"A",{"$f":"D1_Vinmin","v":6.6020000000000009E-2},null,null,null,null,null,null,{"$f":"SQRT(Iout^2*D1_Vinnom*(1-D1_Vinnom)+Iout2^2*D2_Vinnom*(1-D2_Vinnom)-2*Iout*Iout2*D1_Vinnom*D2_Vinnom)","v":{"$error":"#NAME?"}},"A"]
["Icinrms_VINmax",{"$f":"SQRT(D1_Vinmax_2*(Iout^2*(1-D1_Vinmax_2)+Iripple_Vinmax^2/12))","v":5.5985961409159346},"A",null,null,null,null,null,null,null,{"$f":"SQRT(Iout^2*D1_Vinmax*(1-D1_Vinmax)+Iout2^2*D2_Vinmax*(1-D2_Vinmax)-2*Iout*Iout2*D1_Vinmax*D2_Vinmax)","v":{"$error":"#NAME?"}},"A"]
["Icinrms - multiphase",{"$f":"Iout*SQRT((D1_Vinmin-F136/Number_of_Phases)*((F136+1)/Number_of_Phases-D1_Vinmin))","v":6.2079263647372631},"A",null,null,null,null,null,null,null,{"$f":"MAX(K131:K133)","v":{"$error":"#NAME?"}},"A"]
["Max Cin rms current",{"$f":"MAX(B131:B133)","v":6.3291244996463272},"A",null,null,{"$f":"Number_of_Phases*D1_Vinnom","v":5.5016666666666672E-2},"N*D"]
[null,null,null,null,null,{"$f":"FLOOR(Number_of_Phases*D1_Vinnom,1)","v":0},"floor(N*D)"]
["Icinrms - multiphase - max",{"$f":"Iout/2/Number_of_Phases","v":12.5},"A"]
["Final result",{"$f":"IF(D1_Vinmin<0.5, B135, B137)","v":6.3291244996463272},"A","…report this"]
[]
["Vinripple1",{"$f":"'Design Regulator'!E41/1000","v":0.5},"Vp-p",null,null,"Input voltage ripple spec (pk-pk)"]
[]
["Cinmin_Vinmin",{"$f":"Iout/Number_of_Phases*D1_Vinmin*(1-D1_Vinmin)/(Vinripple1*Fsw)","v":1.0276893266666669E-5},"F"]
["Cinmin_Vinnom",{"$f":"Iout/Number_of_Phases*D1_Vinnom*(1-D1_Vinnom)/(Vinripple1*Fsw)","v":8.6649721759259252E-6},"F"]
["Cinmin_Vinmax",{"$f":"Iout/Number_of_Phases*D1_Vinmax*(1-D1_Vinmax)/(Vinripple1*Fsw)","v":8.0342563708086778E-6},"F",null,null,"Calculate cap at Vinmax and 50% duty cycle (Vin = 2*Vout)"]
[]
["Cinmin_50%D",{"$f":"Iout*0.5*(1-0.5)/(Vinripple1*Fsw)","v":4.1666666666666665E-5},"F",null,null,"Buck 50% typically worst case"]
["Cinmin",{"$f":"IF(D1_Vinmin<0.5, B142,B146)","v":1.0276893266666669E-5},"F",{"$f":"(VIN_min+VIN_max)/2","v":57.5}]
["Reported Cinmin",{"$f":"IF(Cinmin*1000000<2.2, 2.2,Cinmin*1000000)","v":10.276893266666669},"uF",{"$f":"2*Vout","v":6.6020000000000003},null,"…report this"]
[]
["Cin",{"$f":"'Design Regulator'!E43/1000000","v":2.0000000000000001E-4},"F",null,null,"Input capacitance"]
["CinEsrMax_Vinmax",{"$f":"-(Iout/Number_of_Phases*D1_Vinmax*(1-D1_Vinmax)/(Cin*Fsw)-Vinripple1)/(Iout/Number_of_Phases+Iripple_Vinmax/2)","v":1.8009751673113809E-2},"W"]
["CinEsrMax_50%D",{"$f":"-(Iout/Number_of_Phases*0.5*(1-0.5)/(Cin*Fsw)-Vinripple1)/(Iout/Number_of_Phases+Iripple_Vinmax/2)","v":1.4854442053045891E-2},"W",null,null,"Calculate ESR at Vinmax and 50% duty cycle (Vin = 2*Vout)"]
["CinEsrMax",{"$f":"IF(VIN_max<2*Vout, B151,B152)","v":1.4854442053045891E-2},"W"]
["Reported Cin ESR max",{"$f":"IF(OR(CinEsrMax>0.3, CinEsrMax<0), \"N/A\",CinEsrMax*1000)","v":14.854442053045892},"mΩ",null,null,"…report this"]
["RCinEsr",{"$f":"'Design Regulator'!E45/1000","v":1E-3},"W",null,null,"Input capacitance series resistance (ESR)"]
[]
["Vinripple2_Vinmin",{"$f":"Iout/Number_of_Phases*D1_Vinmin_2*(1-D1_Vinmin_2)/(Cin*Fsw)+(Iout/Number_of_Phases +Iripple_Vinmin/2)*RCinEsr","v":5.3285846805201612E-2},"Vp-p"]
["Vinripple2_Vinnom",{"$f":"Iout/Number_of_Phases*D1_Vinnom_2*(1-D1_Vinnom_2)/(Cin*Fsw)+(Iout/Number_of_Phases +Iripple_Vinnom/2)*RCinEsr","v":4.913687929412841E-2},"Vp-p"]
["Vinripple2_Vinmax",{"$f":"Iout/Number_of_Phases*D1_Vinmax_2*(1-D1_Vinmax_2)/(Cin*Fsw)+(Iout/Number_of_Phases +Iripple_Vinmax/2)*RCinEsr","v":4.7511770024990185E-2},"Vp-p"]
["Vinripple2_50%D",{"$f":"Iout/Number_of_Phases*0.5*(1-0.5)/(Cin*Fsw)+(Iout/Number_of_Phases +Iripple_Vinmax/2)*RCinEsr","v":0.1308141389796485},"Vp-p",null,null,"Calculate ripple at Vinmax and 50% duty cycle (Vin = 2*Vout)"]
["Vinripple2",{"$f":"IF(D1_Vinmin<0.5, B157,B160)","v":5.3285846805201612E-2},"Vp-p",null,null,"…report highest of these"]
[]
[null,{"$f":"Iout*D1_Vinmax_2*(1-D1_Vinmax_2)/(Cin*Fsw)","v":2.0864297712008362E-2},"Vp-p"]
[]
["Step 6a: Soft Start"]
["Tss",{"$f":"'Design Regulator'!E50/1000","v":0},"s","Soft-start time"]
["Iss",{"$f":"Cout*Vout/Tss","v":{"$error":"#DIV/0!"}},"A","Load cap current during soft start"]
["Css",{"$f":"0.000022*Tss/1.2","v":0},"F"]
["Css_u",{"$f":"'Standard Value Calculator'!B4","v":0},"F"]
[]
["Step 6b: Other Components - Dither, Hiccup, DEMB, MODE"]
["Tres",{"$f":"'Design Regulator'!E53/1000","v":0.03},"s","Hiccup time"]
["Cres",{"$f":"0.00002*Tres/1.2","v":5.0000000000000008E-7},"F"]
["Cres_u",{"$f":"'Standard Value Calculator'!G4","v":4.7E-7},"F"]
[]
["RPG1/2",100,"kΩ"]
["RFB1/2",null,"W",null,"Tie to VDDA or AGND for 3.3V/5V output, respectively. "]
["R_MODE",null,"W",null,"Tie to VDDA or AGND for Single/Dual operation, respectively. "]
["R_DEMB",null,"W",null,"Tie to VDDA or AGND for FPWM/DEM, respectively. "]
[]
["Enable Hysteresis Current",1.0000000000000001E-5,"A",null,"10 µA Hysteresis Current"]
["Turn ON Voltage",{"$f":"'Design Regulator'!E52","v":35}]
["Hysteresis Voltage",{"$f":"'Design Regulator'!E52-'Design Regulator'!E53","v":5}]
[]
["Upper FB resistor",{"$f":"B183/B181","v":499999.99999999994},"W"]
["Lower FB resister",{"$f":"B185/(B182-1)","v":14705.882352941175},"W"]
["Standard upper FB resistor",{"$f":"'Standard Value Calculator'!S40","v":499},"kΩ"]
["Standard lower FB resistor",{"$f":"'Standard Value Calculator'!S41","v":14.700000000000001},"kΩ"]
[]
["Dither Modulation Frequency",{"$f":"'Design Regulator'!E56*1000","v":41200},"Hz"]
["Cdither_calculated",{"$f":"10*10^-6/Fdither/0.12","v":2.0226537216828479E-9},"F"]
["Cdither_stdvalue",{"$f":"'Standard Value Calculator'!S21","v":2.1999999999999998E-9},"F"]
[]
[]
["Step 7: Compensation"]
["Pi",3.1415926500000002,null,"p"]
["CS Amp Gain",10]
["Ri",{"$f":"Rs*CSAmp_gain","v":1.4999999999999999E-2},"W",null,null,"Current Sense effective resistance = shunt resistor Rs * CS amp gain"]
["gm",{"$f":"IF(COMP_TYPE=1,0.00003,0.0012)","v":1.1999999999999999E-3},"S",null,null,"Error Amp Transconductance"]
[]
["Se_ext",{"$f":"B205/Ri*1000","v":4545454.5454545449},"A/s",null,null,"Slope Comp Slope - referred to inductor current"]
["Sn",{"$f":"(Vin-Vout)/Lf","v":17181515.151515152},"A/s",null,null,"On-time Slope"]
["Sf",{"$f":"Vout/Lf","v":1000303.0303030304},"A/s",null,null,"Off-time Slope"]
[]
["Se_int",{"$f":"Fsw*0.001*(5/22)","v":68.181818181818173},"mV/μs",null,null,"Slope Comp Slope - referred to IC"]
["Sn_int",{"$f":"Sn*Ri/1000","v":257.72272727272724},"mV/μs",null,null,"etc"]
["Sf_int",{"$f":"Sf*Ri/1000","v":15.004545454545456},"mV/μs",null,null,"etc"]
[]
["mc_buck",{"$f":"1+Se_ext/Sn","v":1.2645549304220531},null,null,null,"mc = 1 + Se/Sn for peak current-mode buck"]
["k_buck",{"$f":"mc_buck*(1-D1_Vinnom_2)","v":1.1921306601200548},null,null,null,"mc*(1-d)"]
[]
["mc",{"$f":"1+Se_ext/Sn","v":1.2645549304220531}]
["k",{"$f":"mc_buck*(1-D1_Vinnom_2)","v":1.1921306601200548}]
["Q",{"$f":"1/Pi/(k-0.5)","v":0.45989854934659263},null,null,null,"1/(Pi*(k-0.5))",null,"Q = 2/Pi = 0.636 gives ideal one-cycle damping"]
[]
["Error Amp (EA)"]
["GBW",6,"MHz",null,null,"EA gain-bandwidth product"]
["Cbw",{"$f":"gm/(2*Pi*GBW*1000000)","v":3.1830988654751269E-11},"F",null,null,"EA effective bandwidth limiting capacitance = gm/(2*Pi*GBW)"]
["RoEA",64000000,"W",null,null,"EA output resistance"]
["AEA",{"$f":"gm*RoEA","v":76800},"V/V",null,null,"EA DC gain = gm*RoEA"]
["Afb",{"$f":"IF(VOUT_setting=1,Vref/Vout,SQRT((1+(Fcross*zterm1)^2)/((1+Afbr-pterm4*(Fcross)^2)^2+(Fcross*pterm3)^2)))","v":0.24235080278703425},"V/V",null,null,"Feedback gain from Vout to FB"]
["Acs",{"$f":"1/Ri","v":66.666666666666671},null,null,null,"Acs = 1/Ri"]
["Am_buck",{"$f":"(Ro/Number_of_Phases)/Ri/((1+Ro/Number_of_Phases*(k-0.5)/(Fsw*Lf)))","v":8.0587471715317172}]
["Am",{"$f":"(Ro*Number_of_Phases)/Ri/((1+Ro*Number_of_Phases*(k-0.5)/(Fsw*Lf)))","v":8.0587471715317172},null,null,null,"Buck modulator gain"]
[]
["Scaling factor to calculate Rcomp - buck",{"$f":"2*Pi*Ri/gm","v":78.539816250000015},null,null,null,"2*Pi*Ri/gm -- scaling factor to calculate Rcomp given desired buck crossover frequency"]
["DC Gain is Adc = AEA*Afb*Am"]
[]
["Ro",{"$f":"Rout","v":0.13204000000000002},"W",null,null,"Output Resistance"]
[]
["Fp_load_buck",{"$f":"1/(2*Pi*Ro*Cout)+(k-0.5)/(2*Pi*Fsw*Lf*Cout/Number_of_Phases)","v":13166.227114142192},"Hz",null,null,"Buck dominant pole frequency -- note slope comp influence"]
["Fp_dominant",{"$f":"Fload_u","v":13166.227114142192},"Hz"]
[null,{"$f":"Cbw","v":3.1830988654751269E-11}]
["Fp_EA",{"$f":"1/(2*Pi*(RoEA+Rcea1_u)*Cc1ea_u)","v":0.16578132219050415},"Hz",null,null,"Error Amp LF pole -- related to amplifier ouptut resistance and comp cap"]
["Fp_HF",{"$f":"1/(2*Pi*Rcea1_u*(Cc2ea_u+Cbw))","v":161810.45711816079},"Hz",null,null,"Error Amp HF pole cancels zero related to Output Cap ESR"]
["Fesr",{"$f":"1/(2*Pi*Cout*Cout_ESR)","v":1591549.4327375637},"Hz",null,null,"Cout ESR zero frequency"]
["F_mod",{"$f":"Fsw/2","v":150000},"Hz",null,null,"Zero-order sample-and-hold effects of current-mode control modeled as pole at Fsw/2"]
[null,null,null,"Internal Comp Crossover"]
["Desired Crossover Frequency",{"$f":"CHOOSE(COMP_TYPE,Fcross_Ch2,'Design Regulator'!E62*1000)","v":60000},"Hz",{"$f":"Fsw/50","v":6000}]
["Rcea1",{"$f":"Fcross*Cout/Number_of_Phases*2*Pi*Ri/(gm*Afb)","v":1944.449500809375},"W",null,null,"This component will largely determine the crossover frequency",null,null,null,null,{"$f":"Fcross/Fp_dominant/(gm*Afb*Am)","v":1944.4495008093747}]
["Cc1ea, Cc3ea",{"$f":"10/(Rcea1*Fcross*2*Pi)","v":1.3641816806205589E-8},"F",null,null,"This along with Rcea1 will set a zero at Fcrossover/5 to optimize phase margin"]
["Cc2ea, Cc4ea",{"$f":"MAX(1/(Rcea1*2*Pi*Fesr)-Cbw, 1/(Rcea1*2*Pi*(Fsw/2))-Cbw)","v":5.1384168359347224E-10},"F",null,null,"This along with Rcea1 places a pole at the output cap ESR zero"]
[]
[{"$f":"CHOOSE(COMP_TYPE,\"Internal Compensation\",\"External Compensation\")","v":"External Compensation"}]
["Chosen Compensation Components from the standard value sheet",null,null,"Internal Values"]
["Rcea1_u",{"$f":"CHOOSE(COMP_TYPE,D246,'Design Regulator'!D69*1000)","v":1960},"W",400000,null,null,{"$f":"1/(Rcea1*2*Pi*(Fsw/2))-Cbw","v":5.1384168359347224E-10}]
["Cc1ea_u",{"$f":"CHOOSE(COMP_TYPE,Cc3ea_u,'Design Regulator'!D70*0.000000001)","v":1.4999999999999999E-8},"F",{"$f":"50*0.000000000001","v":5.0000000000000002E-11}]
["Cc2ea_u",{"$f":"CHOOSE(COMP_TYPE,Cc4ea_u,'Design Regulator'!D71*0.000000000001)","v":4.7000000000000003E-10},"F",{"$f":"0.000000000001","v":9.9999999999999998E-13}]
[]
["Resulting Pole/Zero Locations",null,null,null,null,{"$f":"Cout","v":1E-4},{"$f":"Cout_ESR","v":1E-3}]
["Fz1",{"$f":"1/(2*Pi*Rcea1_u*Cc1ea_u)","v":5413.433444685591},"Hz",null,null,"This zero is set at or close to the dominant load pole"]
["Fp2",{"$f":"1/(2*Pi*Rcea1_u*(Cc1ea_u*(Cc2ea_u+Cbw)/(Cc1ea_u+Cc2ea_u+Cbw)))","v":167223.89056284635},"Hz",null,null,"This pole cancels the zero from the Output Cap ESR"]
[null,null,null,"Internal Values"]
["Rfb1",{"$f":"IF(VOUT_setting=1,'Design Regulator'!E64*1000,2500000)","v":100000},"W",null,null,"Upper Feedback Resistance - chosen by user"]
["Rfb2",{"$f":"IF(Vout=Vref,100000000,Vref*B254/((Vout-Vref)))","v":31987.205117952813},"W",null,null,"Lower Feedback Resistance"]
["Rfb2_u",{"$f":"IF(Vout=Vref,\"N/A\",CHOOSE(VOUT_setting,'Standard Value Calculator'!S11,471000,792000,177000))","v":31600},"W",null,null,"Std Value Lower Feedback Resistance"]
[]
["Rff",20000,"W"]
["Cff",3.67E-13,"F"]
["Cfb",2.1999999999999999E-12,"F"]
[]
["wff",{"$f":"1/(2*Pi*Rff*Cff)","v":21683234.778440922},"Hz"]
["wfbt",{"$f":"1/(2*Pi*Rfb1_*Cfb)","v":723431.56033525639},"Hz"]
["wfbb",{"$f":"1/(2*Pi*Rfb2_u*Cfb)","v":2289340.3808077732},"Hz"]
["w1",{"$f":"1/(2*Pi*Rff*Cfb)","v":3617157.8016762817},"Hz"]
["wfft",{"$f":"1/(2*Pi*Cff*Rfb1_)","v":4336646.9556881851},"Hz"]
["Cfb*(Rff+RFBT)/(Rff*RFBT))",{"$f":"2*Pi*Cfb*(Rff+Rfb1_)/(Rff*Rfb1_)","v":8.2938045959999999E-16},"Hz"]
[]
[]
[]
[]
["Other Input Variables"]
["Rfets",0,"W","Series resistance due to FETs"]
["Diode loss eq res",{"$f":"0.00000002*Fsw*0.6*4/Iripple1","v":{"$error":"#NAME?"}}]
["Fet loss eq res",{"$f":"_Don2*RdsonTop+Doff2*RdsonBot","v":{"$error":"#NAME?"}}]
["cap loss eq res",{"$f":"B277*Vin^2*Fsw/2/(((Iripple1/SQRT(3))^2))","v":{"$error":"#NAME?"}}]
["Sw cap",5.0000000000000001E-9]
[]
["Step 8: AEF"]
[]
["VinRipple_dBuV",{"$f":"20*LOG10(Vinripple2*1000000)","v":94.532237437329556},"dBuV"]
["CISPR 25 limit",{"$f":"CHOOSE(OSC,35,50)","v":50},"dBuV","Chooses CISPR conducted limit 35 at 2.1MHz and 50 at 440kHz"]
["Attenuation required",{"$f":"VinRipple_dBuV-B282+3","v":47.532237437329556},"dBuV","Margin of attenuation req"]
["Filter Frequency Required",{"$f":"Fsw/(POWER(10,Attn_req/40))","v":19445.330043802438},"Hz","assume 40db/decade drop and set frequency based on attenuation"]
[]
["Lfilter",{"$f":"'Design Regulator'!E48","v":0.68},"uH","user input"]
[]
["Gop_AEF",{"$f":"CHOOSE(OSC,20,100)","v":100}]
["n",3,null,null,null,"n should be 2 or 3"]
[]
["Passive Cf",{"$f":"1000000/(LinfilterPssv*POWER(2*Pi*Fx_infilter,2))","v":98.514626242187148},"uF",{"$f":"'Design Input Filter'!G9*0.000001","v":6.8E-8}]
["Cinj_AEF",{"$f":"1000000/(L_infilter*Gop_AEF*0.000001*POWER(2*Pi*Fx_infilter,2))","v":0.98514626242187164},"uF",{"$f":"'Design Regulator'!#REF!*0.000001","v":{"$error":"#REF!"}}]
[]
["Cdamp_AEF",{"$f":"CHOOSE(OSC,0,Cinj_AEF/nAEF)","v":0.3283820874739572},"uF",{"$f":"'Design Regulator'!#REF!*0.000001","v":{"$error":"#REF!"}}]
["Rdamp_AEF",{"$f":"CHOOSE(OSC,SQRT(L_infilter*Gop_AEF/(Cinj_AEF)),1.09*SQRT(L_infilter*Gop_AEF/Cinj_AEF))","v":9.0558787129064058},"Ω",{"$f":"'Design Regulator'!#REF!","v":{"$error":"#REF!"}}]
["Ccomp_AEF",{"$f":"CHOOSE(OSC,5,1)","v":1},"nF",{"$f":"B296*0.000000001","v":1.0000000000000001E-9},null,"AEF Comp network & sense is specifically defined at 2.2MHz at 440kHz"]
["Rcomp_AEF",{"$f":"CHOOSE(OSC,200,1000)","v":1000},"Ω"]
["Csen_AEF",{"$f":"Gop_AEF*B296","v":100},"nF",{"$f":"B298*0.000000001","v":1.0000000000000001E-7}]
[]
["Rd_AEF",{"$f":"SQRT(L_infilter*0.000001/Cin)","v":5.8309518948453008E-2},null,{"$f":"'Standard Value Calculator'!S14","v":5.9000000000000004E-2}]
[]
["Attenuation at Fsw",{"$f":"'Input Filter Calculations'!W97","v":0},"dBuV"]
["Conducted EMC at Fsw",{"$f":"VinRipple_dBuV+B302","v":94.532237437329556},"dBuV"]
[]
[]
["Step 8: Efficiency"]
["VAR",0]
["Design"]
["Ta",{"$f":"'Design Regulator'!E13","v":25},"°C","Ambient Temperature"]
["Components"]
["LTc",{"$f":"4000/1000000","v":4.0000000000000001E-3},"%/°C","Inductor DCR Temp Co"]
["θCA",20,"°C/W","Inductor Core to Ambient Thermal Resistance"]
["RCinEsr",{"$f":"RCinEsr","v":1E-3},"W","Input Capacitor ESR"]
[]
["Controller Characteristics"]
["VCC",5,"V","with 170mA current limit"]
["Top Driver"]
["RdsonDRT",1,"W","Drain-Source Resistance of Pullup High-side FET Driver"]
["RdsonDRT2",0.5,"W","Drain-Source Resistance of Pulldown High-side FET Driver"]
["Bottom Driver"]
["RdsonDRB",1,"W","Drain-Source Resistance of Pullup Low-side FET Driver"]
["RdsonDRB2",0.5,"W","Drain-Source Resistance of Pulldown Low-side FET Driver"]
["Deadtime"]
["Deadtime",1.4E-8,"s","Total Deadtime",null,null,"14ns for LM513-Q1"]
["IQ"]
["IQ ",2.2000000000000001E-6,"A","Quiescent Current of LM5143-Q1 Controller (One channel disabled)"]
[]
["High- & low-side MOSFETs - Ch1","Q1: high-side",null,"Q2: low-side"]
["Rdson",{"$f":"'Design Regulator'!E80/1000","v":6.1999999999999998E-3},"W",{"$f":"'Design Regulator'!F80/1000","v":3.3E-3},"W","Drain-Source Resistances of Channel 1 FETs"]
["RdsonTopTc",{"$f":"4000/1000000","v":4.0000000000000001E-3},"%/°C",4.0000000000000001E-3,"%/°C","Drain-Source Resistance Temp Co"]
["Qg",{"$f":"'Design Regulator'!E81/1000000000","v":1.6000000000000001E-8},"C",{"$f":"'Design Regulator'!F81/1000000000","v":3.1E-8},"C","Gate Charge at VCC = 5V"]
["Qgd",{"$f":"'Design Regulator'!E82/1000000000","v":5.4999999999999996E-9},"C",{"$f":"'Design Regulator'!F82/1000000000","v":1.1199999999999999E-8},"C","Gate to Drain Charge"]
["Qgs",{"$f":"'Design Regulator'!E83/1000000000","v":6.3000000000000002E-9},"C",{"$f":"'Design Regulator'!F83/1000000000","v":1.0999999999999999E-8},"C","Gate to Source Charge"]
["Qoss",{"$f":"'Design Regulator'!E84/1000000000","v":0},"C",{"$f":"'Design Regulator'!F84/1000000000","v":2.9999999999999997E-8},"C","Output Charge"]
["Coss",{"$f":"'Design Regulator'!E85/1000000000000","v":2.5000000000000002E-10},"F",{"$f":"'Design Regulator'!F85/1000000000000","v":4.8399999999999998E-10},"F","Output Capacitance"]
["Rgate",{"$f":"'Design Regulator'!E86","v":1.2},"W",{"$f":"'Design Regulator'!F86","v":1},"W","Gate Resistance"]
["Gfs",{"$f":"'Design Regulator'!E87","v":99},"S",{"$f":"'Design Regulator'!F87","v":200},"S","Transconductance"]
["Vth",{"$f":"'Design Regulator'!E88","v":3},"V",{"$f":"'Design Regulator'!F88","v":3},"V","Threshold Voltage"]
["Vsp",{"$f":"Vth_Q1+(Iout/Number_of_Phases)/Gfs_Q1","v":3.2525252525252526},"V",{"$f":"Vth_Q2+(Iout/Number_of_Phases)/Gfs_Q2","v":3.125},"V","Switch Point Voltage of FETs"]
[]
["Vsd - Buck",{"$f":"'Design Regulator'!E89","v":0.7},"V",{"$f":"'Design Regulator'!F89","v":0.7},"V","Diode Forward Voltage of MOSFET Body diode"]
["QrrTop",null,"C",{"$f":"'Design Regulator'!F90/1000000000","v":7.3000000000000005E-8},"C","Reverse Recovery Charge of Body Diode"]
["TrrTop",4.0000000000000001E-8,"s",4.0000000000000001E-8,"s","Reverse Recovery Time of Body Diode"]
["θJA-MOSFET",{"$f":"'Design Regulator'!E91","v":42},"°C/W",{"$f":"'Design Regulator'!F91","v":40.700000000000003},"°C/W","Junction-to-Ambient Resistance"]
[]
[]
[]
["Anti-parallel Schottky Diode (optional)"]
["VfdSky",{"$f":"'Design Regulator'!F94","v":0},"V",{"$f":"'Design Regulator'!#REF!","v":{"$error":"#REF!"}},"V","Diode Forward Voltage"]
["QrrSky",{"$f":"'Design Regulator'!F95/1000000000","v":0},"C",{"$f":"'Design Regulator'!#REF!/1000000000","v":{"$error":"#REF!"}},"C","Diode Reverse Recovery Charge"]
["Ireverse",0,"A",0,"A","Reverse Leakage Current"]
[]
["Controller"]
["θJACtrl",34.1,"°C/W",null,null,"Junction-to-ambient thermal resistance of controller"]
["Outputs"]
["Top FET"]
["Tr",{"$f":"(Qgd_Q1+Qgs_Q1/2)*(RdsonDRT+Rgate1)/(VCC-Vsp_Q1)","v":1.0890000000000002E-8},"s"]
["Tf",{"$f":"(Qgd_Q1+Qgs_Q1/2)*(RdsonDRT2+Rgate1)/(Vsp_Q1)","v":4.5211024844720489E-9},"s"]
[]
["IC Power Disipation","Value","Units"]
["Power Dis",{"$f":"CHOOSE(Ext_VCC, (Qg_Q1+Qg_Q2)*Fsw*VCC, (Qg_Q1+Qg_Q2)*Fsw*Vin)","v":0.84599999999999997},"W"]
["Temp rise",{"$f":"B361*ThetaJaCtrl","v":28.848600000000001},"°C"]
["Junction temperature",{"$f":"B362 + Ta","v":53.848600000000005},"°C"]
[]
["Current (switching)",{"$f":"(Qg_Q1+Qg_Q2)*Fsw+Iq","v":1.41022E-2},"A"]
["Qrr Current",{"$f":"Qrr_Q2*Fsw","v":2.1900000000000003E-2},"A"]
["Diode Current",{"$f":"C367/Vin","v":{"$error":"#NAME?"}},{"$f":"Deadtime*Fsw*(Ipp/2)*(Vsd_Q1+Vsd_Q2)","v":{"$error":"#NAME?"}}]
["Total Application Switching IQ",{"$f":"SUM(B365:B367)","v":{"$error":"#NAME?"}},"A"]
[]
["Low-side MOSFET/Diode"]
["Part Power"]
["Power Dis"]
[]
["SCHEMATIC LABELS"]
[{"$f":"\"RC1 = \"&'Design Regulator'!D69&\"kΩ\"","v":"RC1 = 1.96kΩ"},{"$f":"'Design Regulator'!D69&\" kΩ\"","v":"1.96 kΩ"},null,{"$f":"'Design Regulator'!D72&\"kΩ\"","v":"kΩ"}]
[{"$f":"\"RC2 = \"&'Design Regulator'!D72&\"kΩ\"","v":"RC2 = kΩ"},{"$f":"'Design Regulator'!D72&\"kΩ\"","v":"kΩ"}]
[]
[{"$f":"\"Lo = \"&'Design Regulator'!E27&\"µH\"","v":"Lo = 3.3µH"},{"$f":"'Design Regulator'!E27&\" µH\"","v":"3.3 µH"},null,{"$f":"IF(MODE = 1, 'Design Regulator'!I27&\"µH\", 'Design Regulator'!E27&\"µH\")","v":"µH"}]
[{"$f":"\"Rdcr = \"&Rdcr*1000&\"mΩ\"","v":"Rdcr = 4mΩ"},{"$f":"Rdcr*1000&\" mΩ\"","v":"4 mΩ"},null,{"$f":"IF(MODE=1, Rdcr2*1000&\"mΩ\", Rdcr*1000&\"mΩ\")","v":"0mΩ"}]
[{"$f":"\"Rs = \"&'Design Regulator'!E18&\"mΩ\"","v":"Rs = 1.5mΩ"},{"$f":"'Design Regulator'!E18&\" mΩ\"","v":"1.5 mΩ"},null,{"$f":"IF(MODE = 1, 'Design Regulator'!I18&\"mΩ\", 'Design Regulator'!E18&\"mΩ\")","v":"mΩ"}]
[]
["IC",{"$f":"IF(VIN_max>42,\"LM5148(-Q1)\",\"LM25148(-Q1)\")","v":"LM5148(-Q1)"}]
[]
[{"$f":"IF((INFILTER_TYPE=1),\"AEF IS DISABLED!\",\"AEF\")","v":"AEF IS DISABLED!"},{"$f":"IF((INFILTER_TYPE=1),\"\",\"0.1µF\")","v":""},{"$f":"IF((INFILTER_TYPE=1),\"\",\"0.47Ω\")","v":""},{"$f":"IF((INFILTER_TYPE=1),\"\",\"3Ω\")","v":""},{"$f":"IF((INFILTER_TYPE=1),\"\",\"50kΩ\")","v":""}]
[{"$f":"\"LAEF =\"&L_infilter&\" uF\"","v":"LAEF =0.68 uF"},{"$f":"IF((INFILTER_TYPE=1),\"\",L_infilter&\"µH\")","v":""}]
[{"$f":"\"Cinj =\"&CinjSel*1000000&\" uF\"","v":{"$error":"#REF!"}},{"$f":"IF((INFILTER_TYPE=1),\"\",CinjSel*1000000&\"µF\")","v":""}]
[{"$f":"\"Cdamp =\"&CdampSel*1000000&\" uF\"","v":{"$error":"#REF!"}},{"$f":"IF((INFILTER_TYPE=1),\"\",IF(OSC=1,\"DNP\",CdampSel*1000000&\"µF\"))","v":""}]
[{"$f":"\"Rdamp =\"&RdampSel&\"Ω\"","v":{"$error":"#REF!"}},{"$f":"IF((INFILTER_TYPE=1),\"\",RdampSel&\"Ω\")","v":""}]
[{"$f":"\"Rcomp =\"&Rcomp_AEF&\"Ω\"","v":"Rcomp =1000Ω"},{"$f":"IF((INFILTER_TYPE=1),\"\",Rcomp_AEF&\"Ω\")","v":""}]
[{"$f":"\"Ccomp =\"&Ccomp_AEF*1000000000000&\"pF\"","v":"Ccomp =1000pF"},{"$f":"IF((INFILTER_TYPE=1),\"\",Ccomp_AEF*1000000000000&\"pF\")","v":""}]
[{"$f":"\"Csen =\"&Csen_AEF*1000000&\"µF\"","v":"Csen =0.1µF"},{"$f":"IF((INFILTER_TYPE=1),\"\",Csen_AEF*1000000&\"µF\")","v":""}]
[null,"CDAMP"]
[]
[{"$f":"\"VOUT = \"&'Design Regulator'!E9&\"V\"","v":"VOUT = 3.301V"},{"$f":"'Design Regulator'!E9&\" V\"","v":"3.301 V"},null,{"$f":"IF(MODE=1, 'Design Regulator'!I10&\"V\", \"\")","v":"V"}]
[]
[{"$f":"\"COUT = \"&'Design Regulator'!$E$34&\"µF\"","v":"COUT = 100µF"},{"$f":"ROUND('Design Regulator'!$E$34/Number_of_Phases, 0)&\" µF\"","v":"100 µF"},null,{"$f":"IF(MODE=1, 'Design Regulator'!$I$34&\"µF\", ROUND('Design Regulator'!$E$34/Number_of_Phases, 0)&\"µF\")","v":"µF"}]
["Capacitance per component (Cout)",{"$f":"\"22µF\"","v":"22µF"}]
["# of output caps",{"$f":"ROUNDUP(Cout*1000000/22,0)&\" x\"","v":"5 x"}]
[]
["CIN",{"$f":"Cin*1000000&\"µF\"","v":"200µF"}]
["Capacitance per component (Cin)",{"$f":"\"10µF\"","v":"10µF"}]
["# of input caps",{"$f":"ROUNDUP(Cin*1000000/10,0)&\" x\"","v":"20 x"}]
["Cd",{"$f":"CHOOSE(INFILTER_TYPE,\"\",4*Cin*1000000&\"µF\")","v":""}]
["Rd",{"$f":"CHOOSE(INFILTER_TYPE,\"\",D300&\"Ω\")","v":""}]
[]
[{"$f":"\"RC1 = \"&Rcea1_u/1000&\"kΩ\"","v":"RC1 = 1.96kΩ"},{"$f":"IF(COMP_TYPE=1,\"100 kΩ\",ROUND(Rcea1_u/1000,2)&\" kΩ\")","v":"1.96 kΩ"}]
[{"$f":"\"CC1 = \"&Cc1ea_u*10^9&\"nF\"","v":"CC1 = 15nF"},{"$f":"IF(COMP_TYPE=1,\"\",Cc1ea_u*10^9&\" nF\")","v":"15 nF"}]
[{"$f":"\"CC2 = \"&IF(Cc2ea_u>0, Cc2ea_u*10^12&\"pF\", \"OPEN\")","v":"CC2 = 470pF"},{"$f":"IF(COMP_TYPE=1,\"\",IF(Cc2ea_u>0, ROUND(Cc2ea_u*10^12,1)&\" pF\", \"N/A\"))","v":"470 pF"}]
[]
[{"$f":"\"gm = \"&$B$199*1000&\"mS\"","v":"gm = 1.2mS"},{"$f":"$B$199*1000&\"mS\"","v":"1.2mS"}]
[{"$f":"\"RoEA = \"&RoEA/1000000&\"MΩ\"","v":"RoEA = 64MΩ"},{"$f":"RoEA/1000000&\"MΩ\"","v":"64MΩ"}]
[{"$f":"\"GBW = \"&GBW&\"MHz\"","v":"GBW = 6MHz"},{"$f":"GBW&\"MHz\"","v":"6MHz"}]
[]
[{"$f":"\"Cslope = \"&Cslope&\"pF\"","v":{"$error":"#NAME?"}},{"$f":"ROUND(Cslope*1,0)&\"pF\"","v":{"$error":"#NAME?"}}]
["Cd",{"$f":"IF(DITHER=1, ROUND(Cdither*1000000000,1)&\"nF\", \"\")","v":"2.2nF"},{"$f":"IF(DITHER=1, \"Cd\", \"\")","v":"Cd"}]
[{"$f":"\"RFB1 = \"&'Design Regulator'!E64&\"kΩ\"","v":"RFB1 = 100kΩ"},{"$f":"IF(VOUT_setting=1, 'Design Regulator'!E64&\" kΩ\", \"\")","v":"100 kΩ"},null,{"$f":"'Design Regulator'!I64&\"kΩ\"","v":"kΩ"}]
[{"$f":"\"RFB2 = \"&IF(Vout=Vref,\"OPEN\",'Design Regulator'!E65&\"kΩ\")","v":"RFB2 = 31.6kΩ"},{"$f":"IF(VOUT_setting=1, IF(Vout=Vref,\"OPEN\",Rfb2_u/1000&\" kΩ\"), \"\")","v":"31.6 kΩ"},null,{"$f":"IF(Vout2=Vref,\"OPEN\",Rfb4_u/1000&\"kΩ\")","v":"0kΩ"}]
[{"$f":"\"RFBSET = \"&CHOOSE(VOUT_setting,\"\",\"24.9kΩ\",\"0Ω\",\"48.7kΩ\")","v":"RFBSET = "},null,null,{"$f":"CHOOSE(VOUT_setting,\"\",\"24.9kΩ\",\"0Ω\",\"48.7kΩ\")","v":""}]
[]
["RENT",{"$f":"IF((UVLO_TYPE=1),B187&\" kΩ\",\"0Ω\")","v":"499 kΩ"}]
["RENB",{"$f":"IF((UVLO_TYPE=1),B188&\" kΩ\",\"\")","v":"14.7 kΩ"}]
[]
[{"$f":"CHOOSE(BODE_PLOT_TYPE, \"Crossover Frequency = \"&ROUND('Stability Calculations'!U4,1)&\" kHz\",  \"Fsw Attenuation = \"&ROUND('Input Filter Calculations'!W97,1)&\" dB\")","v":"Crossover Frequency = 49 kHz"},{"$f":"CHOOSE(BODE_PLOT_TYPE, ROUND('Stability Calculations'!U4,1)&\" kHz\", ROUND(#REF!,1)&\" kHz\")","v":"49 kHz"},null,{"$f":"'Stability Calculations'!U4","v":48.978000000000002}]
[{"$f":"CHOOSE(BODE_PLOT_TYPE, \"Phase Margin = \"&ROUND('Stability Calculations'!U5,0)&\"°\", \"°\")","v":"Phase Margin = 45°"},{"$f":"CHOOSE(BODE_PLOT_TYPE, ROUND('Stability Calculations'!U5,0)&\"°\", ROUND(#REF!,0)&\"°\")","v":"45°"}]
[{"$f":"IF(loopPM<45,CHOOSE(COMP_TYPE,\"Phase Margin too low, Increase COUT\",\"Phase Margin too low, Re-compensate\"),\"\")","v":""}]
[]
["Full-load/high line efficiency",{"$f":"IF(PLOT_TYPE=1, ROUND('Efficiency Calculations'!AZ109,1)&\"%\", ROUND(#REF!,1)&\"%\")","v":"85.5%"}]
["Half-load/mid-line efficiency",{"$f":"IF(PLOT_TYPE=1, ROUND('Efficiency Calculations'!AZ59,1)&\"%\", ROUND(#REF!,1)&\"%\")","v":"88.2%"}]
["OSC pin setting",{"$f":"IF(VOUT_setting=1, \"\", IF(OSC=1, \"Tie OSC to VDDA\", \"Tie OSC to AGND\"))","v":""}]
[]
[{"$f":"\"CDITH = \"&Cdither*1000000000&\"nF\"","v":"CDITH = 2.2nF"},{"$f":"Cdither*1000000000&\"nF\"","v":"2.2nF"}]
[{"$f":"\"Rs = \"&Rs&\"Ω\"","v":"Rs = 0.0015Ω"},{"$f":"'Standard Value Calculator'!S6&\"Ω\"","v":"Ω"}]
["Rset",{"$f":"'Standard Value Calculator'!S16&\"mΩ\"","v":"1.91mΩ"}]
["Rs",{"$f":"'Standard Value Calculator'!S6&\"mΩ\"","v":"mΩ"}]
[{"$f":"\"Rshunt = \"&ROUND(Rshunt,1)&\"mΩ\"","v":{"$error":"#NAME?"}},{"$f":"IF(Rshunt=\"0\", \"N/A\",ROUND(Rshunt,1)&\"mΩ\")","v":{"$error":"#NAME?"}}]
[]
["Rpgood","20kΩ"]
["RDAMP"]
[]
["VCCX",{"$f":"IF((Ext_VCC=1),\"5V\",\"GND\")","v":"GND"}]
["RCNFG",{"$f":" 'Design Regulator'!E56&\" kΩ\"","v":"41.2 kΩ"}]
["Rt",{"$f":" Rfadj&\" kΩ\"","v":"73.2 kΩ"},{"$f":"Rfadj","v":73.2},{"$f":"Fsw","v":300000},null,{"$f":"OR((Fsw=440000),(Fsw=2200000))","v":false},null,{"$f":"OR(OR(AND(OSC=1, OR(Fsw/1000>2530, Fsw/1000<1800)), AND(OSC=2, OR(Fsw/1000>500, Fsw/1000<300))), OR((Fsw=440000),(Fsw=2200000)))","v":false}]
["Css",{"$f":"'Standard Value Calculator'!B4*1000000000&\"nF\"","v":"0nF"},{"$f":"IF(MODE=1,\"Css\",\"\")","v":"Css"}]
["Cres",{"$f":"IF(Cres_u = 0, \"N/A\", Cres_u*1000000000 &\"nF\")","v":"470nF"},{"$f":"IF(Cres_u = 0, \"N/A\", Cres_u*1000000 &\"µF\")","v":"0.47µF"},{"$f":"Cres_u","v":4.7E-7}]
[]
["Blank out",{"$f":"IF(B76=\"y\",\"\",\"|\")","v":"|"}]
["OUTPUT CURRENT",{"$f":"'Design Regulator'!$E$10&\" A\"","v":"25 A"},null,{"$f":"IF(MODE=1,'Design Regulator'!#REF!&\"A\",\"\")","v":{"$error":"#REF!"}}]
["VIN",{"$f":"VIN_nom&\" V\"","v":"60 V"}]
["VIN range",{"$f":"VIN_min&\"V\"&\"...\"&VIN_max&\"V\"","v":"50V...65V"}]
[null,{"$f":"IF(INFILTER_TYPE=1,B449,\"\")","v":"50V...65V"},{"$f":"IF(INFILTER_TYPE=1,\"\",B449)","v":""}]

{"sheet":"Schematic Management","index":6,"n_rows":17,"n_cols":14,"rows_kept":17,"cut":false,"hidden":true,"merged":[]}
[null,null,null,null,null,null,null,null,null,null,null,null,null,"3.3V or 5V fixed (FB1/2)"]
[{"$f":"IF(MODE=1, CHOOSE(SCH_SETTING, \"SCH_SetVout_IntComp_nAEF\",\"SCH_SetVout_IntComp_AEF\",\"SCH_SetVout_ExtComp_nAEF\",\"SCH_SetVout_ExtComp_AEF\",\"SCH_AdjVout_IntComp_nAEF\",\"SCH_AdjVout_IntComp_AEF\",\"SCH_AdjVout_ExtComp_nAEF\",\"SCH_AdjVout_ExtComp_AEF\"))","v":"SCH_AdjVout_ExtComp_nAEF"},null,null,null,null,null,null,null,null,null,null,null,null,"With/without VOUT connected to VCCX"]
[]
[]
[]
[]
[]
[]
[]
[]
[]
[]
[]
[]
[]
[]
[null," "]

{"sheet":"Stability Calculations","index":7,"n_rows":687,"n_cols":35,"rows_kept":687,"cut":false,"hidden":true,"merged":[[9,1,10,1],[1,0,1,3],[1,9,1,11],[9,0,11,0],[9,18,9,19],[1,19,1,21],[10,6,10,7],[1,4,1,6],[9,2,9,7],[9,8,9,13],[9,20,9,22],[9,14,9,17],[1,12,1,14],[1,15,1,18],[9,27,9,28],[9,30,9,31],[10,2,10,3],[10,4,10,5],[10,8,10,9],[10,10,10,11],[10,12,10,13],[10,18,10,19],[10,14,10,15],[10,16,10,17]]}
[]
["Divider Network & EA Poles/Zeros",null,null,null,"Modulator",null,null,null,null,"Power Stage Poles/Zeros",null,null,"Complex Pole Pair",null,null,"Feedback natural frequencies",null,null,null,"Total System"]
[null,"Afb1",{"$f":"Afb","v":0.24235080278703425},"V/V","Acs",{"$f":"Acs","v":66.666666666666671},"A/V","gm",{"$f":"gm","v":1.1999999999999999E-3},"z_ESR",{"$f":"Fesr","v":1591549.4327375637},"Hz","p3",{"$f":"Fsw/2","v":150000},"Hz","zterm1",{"$f":"((1/wffHz)+(1/wfftHz))","v":2.7671148061200001E-7},null,null,"Adc",{"$f":"IF(VOUT_setting=1,Am*Afb*AEA,Am*AEA)","v":149993.76740954519},"V/V"]
[null,"EA zero, z1",{"$f":"Fz1_u","v":5413.433444685591},"Hz","Am",{"$f":"Am","v":8.0587471715317172},"V/V",null,null,"p_dom",{"$f":"Fp_dominant","v":13166.227114142192},"Hz","pterm1",{"$f":"Q*pole3","v":68984.782401988894},null,"pterm3",{"$f":"((1/wfbtHz)+(1/wffHz)+(1/wfftHz)+(Afbr/wffHz))","v":1.8049571203525063E-6},null,null,"Crossover",{"$f":"AI7","v":48.978000000000002},"kHz"]
[null,"EA pole, p1",{"$f":"Fp1_u","v":0.16578132219050415},"Hz","Q",{"$f":"Q","v":0.45989854934659263},null,null,null,null,null,null,"pterm2",{"$f":"pole3^2","v":22500000000},null,"pterm4",{"$f":"1/(wffHz*wfbtHz)","v":6.3749748601826958E-14},null,null,"Phase Margin",{"$f":"AI9","v":45.187204950932738},"°"]
[null,"Aea",{"$f":"AEA","v":76800},"V/V","mc",{"$f":"mc","v":1.2645549304220531},null,null,null,null,null,null,null,null,null,"Afbr",{"$f":"Rfb1_/Rfb2_u","v":3.1645569620253164},null,null,"radconv",{"$f":"180/Pi","v":57.295779578552292},null,null,null,null,null,null,null,null,null,null,null,null,"XOVER SEARCH"]
[null,"EA pole, p2",{"$f":"Fp2_u","v":161810.45711816079},"Hz","k",{"$f":"k","v":1.1921306601200548},null,null,null,null,null,null,null,null,null,null,null,null,null,null,null,null,null,null,null,null,null,null,null,null,null,null,null,"xover",{"$f":"SUM(AH12:AH613)/1000","v":48.978000000000002}]
[]
[null,null,null,null,null,null,null,null,null,null,null,null,null,null,null,null,null,null,null,null,null,null,null,null,null,null,null,null,null,null,null,null,null,"phase margin",{"$f":"SUM(AI13:AI613)","v":45.187204950932738}]
["Freq (Hz)",null,"Power Stage",null,null,null,null,null,"Error Amplifier",null,null,null,null,null,"Feedback Gain",null,null,null,"Sampling Double Pole",null,"System Response",null,null,null,null,null,null,"ERROR AMP Response",null,null,"PLANT Response"]
[null,null,"p_dom",null,"z_ESR",null,"z_RHP",null,"p1",null,"z1",null,"p2",null,"z1",null,"p1p2",null,"p3"]
[null,null,"Gain(V/V)","Phase(rad)","Gain(V/V)","Phase(rad)","Gain(V/V)","Phase(rad)","Gain(V/V)","Phase(rad)","Gain(V/V)","Phase(rad)","Gain(V/V)","Phase(rad)","Gain(V/V)","Phase(rad)","Gain(V/V)","Phase(rad)","Gain(V/V)","Phase(rad)","Gain (dB)","Phase (°)","Phase Margin (°)",null,null,"Fsquare",null,"Gain(dB)","Phase(Deg)",null,"Gain(dB)","Phase(Deg)"]
[1,{"$f":"A13/1000","v":1E-3},{"$f":"SQRT(1+(A13/pole1)^2)","v":1.0000000028843457},{"$f":"ATAN(A13/pole1)","v":7.5951902500829297E-5},{"$f":"SQRT(1+(A13/Zero1)^2)","v":1.0000000000001974},{"$f":"ATAN(A13/Zero1)","v":6.2831852999991738E-7},{"$f":"IF(VIN_nom>Vout, 1, SQRT(1+(A13/z_RHP)^2))","v":1},{"$f":"IF(VIN_nom>Vout, 0, -ATAN(A13/z_RHP))","v":0},{"$f":"SQRT(1+(A13/Pole2)^2)","v":6.1143714389022223},{"$f":"ATAN(A13/Pole2)","v":1.4065091891049373},{"$f":"SQRT(1+(A13/Zero2)^2)","v":1.0000000170617822},{"$f":"ATAN(A13/Zero2)","v":1.8472564571883417E-4},{"$f":"SQRT(1+(A13/pole4)^2)","v":1.0000000000190967},{"$f":"ATAN(A13/pole4)","v":6.1800702982813208E-6},{"$f":"IF(VOUT_setting=1,1,SQRT(1+(A13*zterm1)^2))","v":1},{"$f":"IF(VOUT_setting=1,0,ATAN(((A13*zterm1))))","v":0},{"$f":"IF(VOUT_setting=1,1,SQRT((1+Afbr-pterm4*(A13)^2)^2+(A13*$Q$4)^2))","v":1},{"$f":"IF(VOUT_setting=1,0,ATAN(A13*$Q$4/(1+Afbr-$Q$5*(A13)^2)))","v":0},{"$f":"SQRT((1-(Z13/pterm2))^2+(A13/pterm1)^2)","v":1.0000000000606217},{"$f":"IF((ATAN((A13/pterm1)/(1-A13^2/pterm2))>0),ATAN((A13/pterm1)/(1-A13^2/pterm2)),PI()+ATAN((A13/pterm1)/(1-A13^2/pterm2)))","v":1.449595063078099E-5},{"$f":"20*LOG10(((E13*K13*G13*O13)/(C13*I13*S13*M13*Q13))*Adc)","v":87.7944280335077},{"$f":"((F13+L13+H13+P13)-(D13+J13+T13+N13+R13))*radconv","v":-80.581956846487159},{"$f":"IF(V13>0,V13,V13+180)","v":99.418043153512841},null,{"$f":"IF(U13<0,A13,1000000000)","v":1000000000},{"$f":"A13^2","v":1},null,{"$f":"20*LOG10((K13/(I13*M13))*AEA)","v":81.980188190052687},{"$f":"(L13-(J13+N13))*radconv","v":-80.576810566230776},null,{"$f":"20*LOG10((E13*G13/(C13*S13))*Acs*Am)","v":54.603525409108748},{"$f":"(F13+H13-(D13+T13))*radconv","v":-5.1462802563820185E-3},null,{"$f":"SUM((U14<0)*(U13>0))*A13","v":0},{"$f":"IF(AH13>0,W11,0)","v":0}]
[1.0965,{"$f":"A14/1000","v":1.0965E-3},1.0000000034678842,8.3281261059760782E-5,1.0000000000002374,6.8895126814489105E-7,1,0,6.689303265056167,1.4207414426672593,1.0000000205135899,2.0255167006458878E-4,1.0000000000229601,6.7764470820480153E-6,1,0,{"$f":"IF(VOUT_setting=1,1,SQRT((1+Afbr-pterm4*(A14)^2)^2+(A14*$Q$4)^2))","v":1},0,1.0000000000728864,1.5894809866569037E-5,87.013846706971918,-81.396914339454,98.603085660546,null,1000000000,1.2023122500000001,null,81.199606868691632,-81.391271443154736,null,54.603525403934015,-5.6428962992618676E-3,null,0,0]
[1.2022999999999999,1.2022999999999999E-3,1.0000000041693946,9.1316972298515875E-5,1.0000000000002853,7.5542736861885632E-7,1,0,7.3209436211114314,1.4337735429731755,1.0000000246632379,2.2209564272225425E-4,1.0000000000276046,7.4302985195814873E-6,1,0,{"$f":"IF(VOUT_setting=1,1,SQRT((1+Afbr-$Q$5*(A15)^2)^2+(A15*$Q$4)^2))","v":1},0,1.0000000000876303,1.7428481443189206E-5,86.23012319973995,-82.1430608382542,97.8569391617458,null,1000000000,1.4455252899999997,null,80.415883367680564,-82.13687346550644,null,54.603525397713128,-6.1873727477543975E-3,null,0,0]
[1.3183,1.3183000000000001E-3,1.0000000050127473,1.0012739292476905E-4,1.0000000000003431,8.2831231809881071E-7,1,0,8.0146720726583194,1.445699132706789,1.0000000296519254,2.4352381670713933E-4,1.0000000000331883,8.1471866741477279E-6,1,0,1,0,1.0000000001053557,1.9110011716197584E-5,85.443749332199772,-82.825757098213927,97.174242901786073,null,1000000000,1.7379148900000001,null,79.629509507619119,-82.818972756960093,null,54.603525390234395,-6.7843412538274835E-3,null,0,0]
[1.4454,1.4454000000000001E-3,1.0000000060259207,1.0978087964477542E-4,1.0000000000004123,9.0817160326175039E-7,1,0,8.7758749239077112,1.4565995310611031,1.0000000356451539,2.6700244501413255E-4,1.0000000000398963,8.9326736090119571E-6,1,0,1,0,1.00000000012665,2.0952447041146629E-5,84.655656026872478,-83.449657790630653,96.550342209369347,null,1000000000,2.0891811599999999,null,78.841416211276496,-83.442219357161278,null,54.603525381249725,-7.4384334693674723E-3,null,0,0]
[1.5849,1.5849E-3,1.0000000072452111,1.2037616992360149E-4,1.0000000000004958,9.9582203819667106E-7,1,0,9.6123423047467078,1.4665748354826846,1.0000000428576272,2.9277167086491862E-4,1.000000000047969,9.7947934155575342E-6,1,0,1,0,1.0000000001522764,2.2974632153835572E-5,83.864880016231908,-84.020491468029547,95.979508531970453,null,1000000000,2.51190801,null,78.05064021144841,-84.012335128471321,null,54.603525370437239,-8.1563395582375277E-3,null,0,0]
[1.7378,1.7378000000000001E-3,1.0000000087105765,1.3198921565327475E-4,1.000000000000596,1.0918919414335663E-6,1,0,10.530074242678355,1.4756869094199769,1.000000051525709,3.2101621975453719E-4,1.0000000000576708,1.0739726164077095E-5,1,0,1,0,1.0000000001830749,2.5191063004868568E-5,83.07283597535266,-84.541797561296988,95.458202438703012,null,1000000000,3.0199488400000001,null,77.258596183563796,-84.532854355496909,null,54.603525357442592,-8.9432058000924308E-3,null,0,0]
[1.9055,1.9055000000000001E-3,1.0000000104728581,1.4472634948315842E-4,1.0000000000007168,1.1972609589144282E-6,1,0,11.537475933838579,1.4840133663610198,1.0000000619501401,3.5199470738359571E-4,1.0000000000693385,1.1776123952980621E-5,1,0,1,0,1.0000000002201137,2.7622033925092801E-5,82.279248551585852,-85.018015878668066,94.981984121331934,null,1000000000,3.63093025,null,76.465008775424636,-85.008209641681603,null,54.603525341814951,-9.8062369864790142E-3,null,0,0]
[2.0893000000000002,2.0893000000000001E-3,1.0000000125906725,1.586863088681419E-4,1.0000000000008615,1.3127459047282461E-6,1,0,12.642358272406687,1.4916144443447317,1.0000000744776549,3.8594727682736071E-4,1.00000000008336,1.2912020873645985E-5,1,0,1,0,1.0000000002646248,3.0286389650281626E-5,81.484902931019434,-85.452591196841013,94.547408803158987,null,1000000000,4.3651744900000002,null,75.670663173638687,-85.441839073560345,null,54.603525323034475,-1.0752123280675853E-2,null,0,0]
[2.2909000000000002,2.2909000000000002E-3,1.0000000151376891,1.7399821201777662E-4,1.0000000000010361,1.439414920376006E-6,1,0,13.854941752785853,1.4985570999067295,1.000000089544032,4.2318796132820058E-4,1.0000000001002234,1.4157923045566956E-5,1,0,1,0,1.0000000003181571,3.3208773296444597E-5,80.689370826013089,-85.849351200573778,94.150648799426222,null,1000000000,5.2482228100000006,null,74.875131091218904,-85.837561587216086,null,54.603525300447913,-1.1789613357699999E-2,null,0,0]
[2.5118999999999998,2.5118999999999996E-3,1.0000000181991879,1.9078358194395283E-4,1.0000000000012454,1.5782733155056895E-6,1,0,15.184851173224247,1.504893525460818,1.0000001076537268,4.6401232145728763E-4,1.0000000001204929,1.5523718581203486E-5,1,0,1,0,1.000000000382502,3.6412378384509397E-5,79.893254247227006,-86.21127816112373,93.78872183887627,null,1000000000,6.309641609999999,null,74.079014539581735,-86.198351219859632,null,54.603525273298999,-1.2926941264117158E-2,null,0,0]
[2.7542,2.7542000000000001E-3,1.0000000218795437,2.0918672721875517E-4,1.0000000000014975,1.7305148953242725E-6,1,0,16.643520649132959,1.5106766759945003,1.0000001294241498,5.0877133532764595E-4,1.0000000001448597,1.7021149614099327E-5,1,0,1,0,1.0000000004598542,3.9924747220566088E-5,79.096561215263648,-86.541396516922546,93.458603483077454,null,1000000000,7.5856176399999997,null,73.282321540255225,-86.527222631992586,null,54.603525240662158,-1.4173884929963614E-2,null,0,0]
[3.02,3.0200000000000001E-3,1.0000000263063866,2.2937474197088809E-4,1.0000000000018003,1.8975219605977226E-6,1,0,18.244195285683329,1.5159568895074245,1.0000001556102689,5.5787139854272143E-4,1.0000000001741689,1.8663812298880097E-5,1,0,1,0,1.0000000005528955,4.3777770895858058E-5,78.298971140931613,-86.842579238965186,93.157420761034814,null,1000000000,9.1204000000000001,null,72.484731505179781,-86.827037472796633,null,54.603525201405567,-1.5541766168540888E-2,null,0,0]
[3.3113000000000001,3.3113000000000001E-3,1.0000000316260076,2.5149952993198645E-4,1.0000000000021645,2.0805511483859983E-6,1,0,19.998919704114154,1.5207727657208907,1.00000018707744,6.1168196133843625E-4,1.000000000209389,2.0464066776102838E-5,1,0,1,0,1.0000000006647007,4.8000441311460467E-5,77.501334878257438,-87.117027761175905,92.882972238824095,null,1000000000,10.964707690000001,null,71.687095289679206,-87.099986883639758,null,54.603525154231967,-1.7040877536147459E-2,null,0,0]
[3.6307999999999998,3.6308E-3,1.000000038023489,2.7576616113988663E-4,1.0000000000026021,2.2812989187200426E-6,1,0,21.923958296526589,1.5251682948042584,1.000000224920482,6.7070178153514476E-4,1.0000000002517453,2.2438599235519615E-5,1,0,1,0,1.0000000007991601,5.2631897533825078E-5,76.703086538093544,-87.367248808883105,92.632751191116895,null,1000000000,13.182708639999998,null,70.888847006247218,-87.348563694899326,null,54.603525097500054,-1.8685113983793696E-2,null,0,0]
[3.9811000000000001,3.9811000000000004E-3,1.0000000457144482,3.0237211041229917E-4,1.0000000000031286,2.5013988997777836E-6,1,0,24.034976875466985,1.5291782823730338,1.0000002704148363,7.3541114395881389E-4,1.0000000003026654,2.4603477859836582E-5,1,0,1,0,1.0000000009608052,5.7709829034264685E-5,75.904592038009653,-87.59522337962774,92.40477662037226,null,1000000000,15.849157210000001,null,70.090352574365625,-87.574735523794999,null,54.603525029297785,-2.0487855832748238E-2,null,0,0]
[4.3651999999999997,4.3651999999999996E-3,1.0000000549611234,3.3154523328608179E-4,1.0000000000037614,2.7427360471491227E-6,1,0,26.350054547084444,1.5328366256080501,1.0000003251117182,8.0636422309156048E-4,1.0000000003638858,2.6977242859856648E-5,1,0,1,0,1.0000000011551475,6.3277723664238042E-5,75.105836231403345,-87.802878388058957,92.197121611941043,null,1000000000,19.054971039999998,null,69.29159684975744,-87.780413846144967,null,54.60352494729964,-2.2464541913978158E-2,null,0,0]
[4.7862999999999998,4.7862999999999994E-3,1.0000000660765163,3.6352857562494615E-4,1.0000000000045219,3.0073209801299339E-6,1,0,28.888478687726703,1.5361735337988061,1.0000003908626287,8.841521377728498E-4,1.0000000004374785,2.9579670460413488E-5,1,0,1,0,1.0000000013887658,6.938196846519372E-5,74.306973638442201,-87.991928431532529,92.008071568467471,null,1000000000,22.908667689999998,null,68.49273435536594,-87.967296791221102,null,54.603524848729997,-2.4631640311420316E-2,null,0,0]
[5.2481,5.2481000000000003E-3,1.0000000794422446,3.9860315917045544E-4,1.0000000000054365,3.2974784772810484E-6,1,0,31.672553315945063,1.5392180006711023,1.0000004699249483,9.6945836860903108E-4,1.0000000005259699,3.2433626921450374E-5,1,0,1,0,1.0000000016696804,7.6076198453709257E-5,73.507806124604244,-88.164015918976986,91.835984081023014,null,1000000000,27.542553609999999,null,67.693566960053261,-88.137007726732051,null,54.603524730204711,-2.700819224492362E-2,null,0,0]
[5.7544000000000004,5.7544000000000007E-3,1.0000000955096808,4.3705760076236778E-4,1.0000000000065361,3.6155961490162457E-6,1,0,34.725187772664484,1.5419948045528076,1.0000005649686803,1.0629848674466439E-3,1.0000000006323491,3.5562596509890808E-5,1,0,1,0,1.0000000020073785,8.3415498241191279E-5,72.708576268138629,-88.320541226517861,91.679458773482139,null,1000000000,33.113119360000006,null,66.894337246071274,-88.290927472960803,null,54.603524587721083,-2.9613753557074848E-2,null,0,0]
[6.3095999999999997,6.3095999999999994E-3,1.0000001148288329,4.7922608825475363E-4,1.0000000000078584,3.9644385968672308E-6,1,0,38.072911037700344,1.5445279121416706,1.0000006792472818,1.1655444196898316E-3,1.000000000760257,3.8993771534768729E-5,1,0,1,0,1.0000000024134195,9.1463650009101735E-5,71.909147463736218,-88.462855177221286,91.537144822778714,null,1000000000,39.811052159999996,null,66.09490861298822,-88.430384209369976,null,54.603524416401747,-3.2470967851308742E-2,null,0,0]
[6.9183000000000003,6.9183000000000005E-3,1.0000001380530708,5.2545799972116252E-4,1.0000000000094478,4.346896086071622E-6,1,0,41.743460057163944,1.5468381865149239,1.0000008166256269,1.2779867535553026E-3,1.0000000009140197,4.2755580319091026E-5,1,0,1,0,1.0000000029015359,1.0028733512861962E-4,71.10970124490504,-88.592129753194186,91.407870246805814,null,1000000000,47.862874890000008,null,65.295462600106092,-88.556526245216332,null,54.603524210452683,-3.5603507977862089E-2,null,0,0]
[7.5857999999999999,7.5858000000000002E-3,1.0000001659778215,5.7615587934594802E-4,1.0000000000113589,4.766298704837907E-6,1,0,45.768794636539397,1.5489456403656188,1.0000009818088993,1.4012909020330673E-3,1.0000000010989036,4.6880777234954319E-5,1,0,1,0,1.0000000034884455,1.0996338213580407E-4,70.310081815495622,-88.70948465474909,91.29051534525091,null,1000000000,57.544361639999998,null,64.495843418329173,-88.670446005578626,null,54.603523962820184,-3.903864917045962E-2,null,0,0]
[8.3176000000000005,8.3176000000000014E-3,1.0000001995461432,6.3173746141514876E-4,1.0000000000136562,5.2261022050804225E-6,1,0,50.182082348292788,1.5508675763568065,1.000001180375554,1.5364728392310272E-3,1.0000000013211523,5.1403352668364702E-5,1,0,1,0,1.0000000041939692,1.205715187561319E-4,69.510499165801832,-88.815883292405147,91.184116707594853,null,1000000000,69.182469760000004,null,63.696261066314214,-88.773078596502273,null,54.603523665141353,-4.2804695902861886E-2,null,0,0]
[9.1201000000000008,9.1201000000000008E-3,1.00000023990896,6.926888365416116E-4,1.0000000000164184,5.7303278253902794E-6,1,0,55.021919878684535,1.5526207512621262,1.0000014191336348,1.6847147867929783E-3,1.0000000015883859,5.6362859068389064E-5,1,0,1,0,1.0000000050422964,1.3220451906966829E-4,68.710759651895174,-88.912253224552757,91.087746775447243,null,1000000000,83.176224010000013,null,62.89652191033894,-88.865318640273827,null,54.603523307209976,-4.693458427891984E-2,null,0,0]
[10,0.01,1.0000002884345343,7.5951888042112168E-4,1.0000000000197393,6.2831852999173176E-6,1,0,60.328714633135711,1.554219713072835,1.0000017061767925,1.8472543770384207E-3,1.0000000019096633,6.1800702904920966E-5,1,0,1,0,1.0000000060621848,1.4495950594042809E-4,67.910995068668512,-88.999393930959613,91.000606069040387,null,1000000000,100,null,62.096757757429742,-88.947931136701072,null,54.603522876892505,-5.1462794258540751E-2,null,0,0]
[10.965,1.0964999999999999E-2,1.0000003467883636,8.3281241998323758E-4,1.0000000000237326,6.8895126813409956E-6,1,0,66.148906394505943,1.5556783430252108,1.0000020513569043,2.0255139583117941E-3,1.0000000022960116,6.7764470717792053E-5,1,0,1,0,1.000000007288639,1.5894809818135794E-4,67.111025619936811,-89.078061606032222,90.921938393967778,null,1000000000,120.23122499999999,null,61.296788826170953,-89.021632653988732,null,54.603522359419586,-5.6428952043475727E-2,null,0,0]
[12.023,1.2022999999999999E-2,1.000000416939387,9.1316947169919253E-4,1.0000000000285336,7.5542736860463008E-6,1,0,72.530142357155327,1.5570085186899518,1.0000024663207656,2.2209528120188003E-3,1.0000000027604667,7.4302985060441658E-5,1,0,1,0,1.0000000087630414,1.7428481379339902E-4,66.311111373177852,-89.148896626513306,90.851103373486694,null,1000000000,144.55252899999999,null,60.4968752015006,-89.087022913469966,null,54.603521737330979,-6.1873713043343839E-2,null,0,0]
[13.183,1.3183E-2,1.0000005012746185,1.0012735979850911E-3,1.000000000034305,8.2831231808005649E-6,1,0,79.526705220478732,1.558221602975266,1.0000029651881861,2.4352334012613277E-3,1.0000000033188325,8.1471866563018899E-5,1,0,1,0,1.0000000105355613,1.9110011632026991E-4,65.511225749468991,-89.212504290046823,90.787495709953177,null,1000000000,173.79148899999998,null,59.696990325663712,-89.144660896536706,null,54.603520989459014,-6.7843393510110497E-2,null,0,0]
[14.454000000000001,1.4454E-2,1.0000006025918999,1.0978083598376853E-3,1.0000000000412388,9.0817160323703215E-6,1,0,87.19287853951846,1.5593272488107945,1.0000035645090988,2.6700181687216631E-3,1.0000000039896328,8.9326735854908194E-5,1,0,1,0,1.0000000126650024,2.0952446930208262E-4,64.711869542828538,-89.269391920810065,90.730608079189935,null,1000000000,208.91811600000003,null,58.89763501748935,-89.195007611195862,null,54.603520090992916,-7.4384309614211608E-2,null,0,0]
[15.849,1.5848999999999999E-2,1.0000007245208589,1.2037611236170055E-3,1.000000000049583,9.9582203816408286E-6,1,0,95.607073265330769,1.560336658904361,1.0000042857536242,2.9277084273423731E-3,1.0000000047968989,9.7947933845476766E-5,1,0,1,0,1.0000000152276505,2.297463200757636E-4,63.911694554070245,-89.320135305941562,90.679864694058438,null,1000000000,251.19080099999999,null,58.097461109978248,-89.238571943423494,null,54.603519009745732,-8.1563362518053725E-2,null,0,0]
[17.378,1.7378000000000001E-2,1.0000008710572832,1.3198913977301074E-3,1.0000000000596114,1.0918919413906073E-5,1,0,104.82960629341221,1.5612568922561088,1.0000051525577469,3.2101512808246201E-3,1.0000000057670859,1.0739726123198727E-4,1,0,1,0,1.000000018307488,2.5191062812064143E-4,63.11182215504104,-89.365088068222832,90.634911931777168,null,1000000000,301.99488400000001,null,57.297590010411255,-89.275656053808518,null,54.603517710283512,-8.9432014414291314E-2,null,0,0]
[19.055,1.9054999999999999E-2,1.0000010472852781,1.4472624944718072E-3,1.0000000000716716,1.1972609588577937E-5,1,0,114.94492199479906,1.5620963981895286,1.0000061949950241,3.5199326819028024E-3,1.0000000069338548,1.1776123899089026E-4,1,0,1,0,1.0000000220113698,2.762203367091099E-4,62.311712933413183,-89.404663158438964,90.595336841561036,null,1000000000,363.09302500000001,null,56.497482351545607,-89.306600846036147,null,54.603516147521312,-9.8062312402793853E-2,null,0,{"$f":"IF(AH45>0,W43,0)","v":0}]
[20.893000000000001,2.0893000000000002E-2,1.0000012590664595,1.58686177002497E-3,1.0000000000861651,1.3127459046535914E-5,1,0,126.03143365362858,1.562861715054813,1.0000074477380296,3.8594537971074717E-3,1.0000000083360141,1.2912020802607023E-4,1,0,1,0,1.0000000264624942,3.0286389315223593E-4,61.511940191155048,-89.439169123525659,90.560830876474341,null,1000000000,436.51744900000006,null,55.6977114873294,-89.331647966464288,null,54.603514269479383,-0.10752115706137795,null,0,0]
[22.909000000000002,2.2909000000000002E-2,1.000001513767774,1.7399803817865743E-3,1.0000000001035958,1.4394149202775887E-5,1,0,138.19168244619092,1.5635599381070591,1.0000089543635093,4.2318546035396282E-3,1.0000000100223392,1.4157922951915923E-4,1,0,1,0,1.0000000318156963,3.3208772854735852E-4,60.711890449424565,-89.468926089112955,90.531073910887045,null,1000000000,524.82228100000009,null,54.897664004249279,-89.351030055391462,null,54.603512010829014,-0.11789603372149733,null,0,0]
[25.119,2.5118999999999999E-2,1.000001819917145,1.9078335278544121E-3,1.0000000001245475,1.5782733153759537E-5,1,0,151.52217829511619,1.5641965849569641,1.0000107653153225,4.6400902462461133E-3,1.0000000120492918,1.5523718457750608E-4,1,0,1,0,1.000000038250213,3.6412377802239081E-4,59.9120174289665,-89.494168877764366,90.505831122235634,null,1000000000,630.96416099999999,null,54.097793698673946,-89.364899596754896,null,54.603509295946289,-0.12926928100947388,null,0,0]
[27.542000000000002,2.7542000000000001E-2,1.0000021879520125,2.0918642514347768E-3,1.000000000149734,1.7305148951532557E-5,1,0,166.1375272471922,1.5647771807599926,1.0000129423320641,5.0876698947352385E-3,1.0000000144859766,1.7021149451364466E-4,1,0,1,0,1.0000000459854155,3.9924746453020758E-4,59.112202311608058,-89.515117501570799,90.484882498429201,null,1000000000,758.56176400000004,null,53.297981844987689,-89.373378825787213,null,54.603506032274105,-0.14173867578357788,null,0,0]
[30.2,3.0199999999999998E-2,1.000002630635245,2.2937434372678187E-3,1.0000000001800293,1.8975219603722601E-5,1,0,182.17043163536442,1.5653069341789871,1.0000155609070234,5.57865669155529E-3,1.0000000174168944,1.8663812084336774E-4,1,0,1,0,1.0000000552895494,4.3777769883956107E-4,58.312018202643685,-89.531958598916432,90.468041401083568,null,1000000000,912.04,null,52.497801661663281,-89.376541165987732,null,54.603502106634132,-0.15541743292869567,null,0,0]
[33.113,3.3112999999999997E-2,1.0000031625958101,2.514990049748601E-3,1.0000000002164346,2.0805511480887976E-5,1,0,199.74153031645804,1.5657898357766296,1.0000187075707712,6.1167440900292622E-3,1.0000000209389013,2.0464066493296092E-4,1,0,1,0,1.0000000664700832,4.8000439977591438E-4,57.512231074916699,-89.54481919612455,90.45518080387545,null,1000000000,1096.470769,null,51.698019251270352,-89.374410722305441,null,54.603497389300095,-0.17040847381911617,null,0,0]
[36.308,3.6308E-2,1.0000038023417452,2.7576546909399953E-3,1.0000000002602163,2.2812989183282459E-5,1,0,219.01368619057513,1.5662303862272655,1.0000224917977925,6.7069182540245038E-3,1.0000000251745365,2.2438598862697939E-4,1,0,1,0,1.0000000799160143,5.2631895775397141E-4,56.712200595526753,-89.553819981036739,90.446180018963261,null,1000000000,1318.2708640000001,null,50.897994445033213,-89.366969238719165,null,54.603491716147268,-0.1868507423175704,null,0,0]
[39.811,3.9810999999999999E-2,1.0000045714344874,3.0237119811420709E-3,1.0000000003128497,2.5013988992612919E-5,1,0,240.14373058737817,1.5666321419226432,1.0000270411216716,7.3539801922327492E-3,1.0000000302665557,2.4603477368359317E-4,1,0,1,0,1.0000000960805178,5.7709826716193088E-4,55.912233280428865,-89.559032644608763,90.440967355391237,null,1000000000,1584.9157210000001,null,50.098033950107954,-89.354154610317451,null,54.603484895974645,-0.20487803429131715,null,0,0]
[43.652000000000001,4.3652000000000003E-2,1.000005496097385,3.3154403063551685E-3,1.00000000037613,2.74273604646825E-5,1,0,263.31262306131958,1.5669985506297115,1.0000325106486361,8.0634692130851122E-3,1.000000036388581,2.69772422119587E-4,1,0,1,0,1.0000001155147524,6.3277720608402208E-4,55.112264005625171,-89.560502351674927,90.439497648325073,null,1000000000,1905.497104,null,49.298072875037668,-89.335857623353633,null,54.603476696241245,-0.22464472832128995,null,0,0]
[47.863,4.7863000000000003E-2,1.0000066076300165,3.6352699027119824E-3,1.0000000004521989,3.007320979232395E-5,1,0,288.71338744354063,1.567332677227637,1.0000390855066679,8.8412933042898677E-3,1.0000000437478442,2.9579669606342616E-4,1,0,1,0,1.0000001388765725,6.9381964436935359E-4,54.312406334391611,-89.558242203108634,90.441757796891366,null,1000000000,2290.8667689999997,null,48.498225060652878,-89.311926710642737,null,54.603466839392468,-0.2463154924659065,null,0,0]
[52.481000000000002,5.2481E-2,1.0000079441932113,3.9860106923902865E-3,1.0000000005436682,3.2974784760978443E-5,1,0,316.56920784425364,1.5676374546168645,1.0000469914017713,9.6942830250847673E-3,1.0000000525970063,3.2433625795548704E-4,1,0,1,0,1.0000001669680432,7.6076193143350486E-4,53.512428127996088,-89.552232376143238,90.447767623856762,null,1000000000,2754.255361,null,47.698258706618184,-89.282151654178435,null,54.60345498703164,-0.27008072196479904,null,0,0]
[57.544000000000004,5.7544000000000005E-2,1.0000095509229254,4.3705484574064436E-3,1.0000000006536267,3.6155961474565005E-5,1,0,347.10930063119986,1.5679153858881381,1.0000564952881208,1.0629452336259762E-2,1.0000000632349115,3.5562595025684422E-4,1,0,1,0,1.0000002007378392,8.3415491240874603E-4,52.712544711720419,-89.542423408676356,90.457576591323644,null,1000000000,3311.3119360000005,null,46.898389538462979,-89.246287455626785,null,54.603440738911175,-0.29613595304958212,null,0,0]
[63.095999999999997,6.3095999999999999E-2,1.0000114828180138,4.7922245639263599E-3,1.0000000007858385,3.9644385948110604E-5,1,0,380.59907447137135,1.5681688870094395,1.0000679224445013,1.1654921722196308E-2,1.000000076025708,3.899376957817963E-4,1,0,1,0,1.0000002413419415,9.1463640780773965E-4,51.912597171795497,-89.528730442626255,90.471269557373745,null,1000000000,3981.1052159999995,null,46.098459130123423,-89.204022850303161,null,54.603423607325816,-0.32470759232310975,null,0,0]
[69.183000000000007,6.9183000000000008E-2,1.0000138052127228,5.2545321208853539E-3,1.0000000009447751,4.3468960833611077E-5,1,0,417.31600227454044,1.5684000588550935,1.0000816592619126,1.2779178802818677E-2,1.0000000914019784,4.2755577739847744E-4,1,0,1,0,1.0000002901535727,1.0028732296351974E-3,51.112749541227686,-89.511040522546679,90.488959477453321,null,1000000000,4786.2874890000012,null,45.298632093956513,-89.15500819284803,null,54.603403012924908,-0.35603232969864795,null,0,0]
[75.858000000000004,7.5858000000000009E-2,1.0000165976457975,5.7614956795123641E-3,1.0000000011358801,4.7662987012647048E-5,1,0,457.57978129302404,1.5686109138092537,1.0000981761188572,1.4012001099406991E-2,1.0000001098903579,4.6880773834802634E-4,1,0,1,0,1.0000003488445257,1.0996336609885877E-3,50.312832308150696,-89.489200206876887,90.510799793123113,null,1000000000,5754.4361640000006,null,44.498739623399395,-89.098817340521549,null,54.603378250405036,-0.39038286635534836,null,0,0]
[83.176000000000002,8.3176E-2,1.0000199544172275,6.31729141603343E-3,1.0000000013656072,5.2261022003701317E-5,1,0,501.72217300123759,1.5688031905216537,1.0001180306594379,1.5363531575990044E-2,1.0000001321152248,5.1403348186195897E-4,1,0,1,0,1.0000004193968752,1.2057149761581238E-3,49.513045420433528,-89.463030416622729,90.536969583377271,null,1000000000,6918.2469760000004,null,43.69898250250985,-89.034988236604946,null,54.603348483577406,-0.42804218001777322,null,0,0]
[91.201000000000008,9.1201000000000004E-2,1.0000239906111128,6.9267786882839036E-3,1.0000000016418329,5.7303278191808406E-5,1,0,550.12922728540605,1.5689785710729536,1.0001419033958803,1.6845570185292497E-2,1.0000001588385818,5.6362853159675971E-4,1,0,1,0,1.0000005042295812,1.3220449120099978E-3,48.713188241567792,-89.432303374355271,90.567696625644729,null,1000000000,8317.6224010000005,null,42.899161115256376,-88.962963831566896,null,54.603312691965151,-0.46933954278839324,null,0,0]
[100,0.1,1.0000288430416178,7.5950442220437163E-3,1.0000000019739208,6.2831852917316603E-5,1,0,603.20509027082346,1.5691385150917365,1.0001706032720745,1.8470464046209584E-2,1.0000001909663263,6.1800695115698915E-4,1,0,1,0,1.0000006062183939,1.4495946920227024E-3,47.913388598273826,-89.396763679851986,90.603236320148014,null,1000000000,10000,null,42.099404501503479,-88.882144042259284,null,54.603269662424083,-0.51461963759268359,null,0,0]
[109.65,0.10965000000000001,1.0000346782410887,8.3279335933933302E-3,1.0000000023732691,6.8895126705495553E-5,1,0,661.41422854283303,1.5692844143838451,1.0002051148647866,2.0252397923820237E-2,1.000000229601149,6.7764460448985501E-4,1,0,1,0,1.0000007288637807,1.5894804974815016E-3,47.113465514346359,-89.356101722851648,90.643898277148352,null,1000000000,12023.122500000001,null,41.299533161679818,-88.791823151105419,null,54.603217918320283,-0.56427857174623841,null,0,0]
[120.23,0.12023,1.0000416930782243,9.13144344359622E-3,1.0000000028533524,7.5542736718199971E-5,1,0,725.23317287264354,1.5694174594812047,1.0002466019744245,2.2205913985913258E-2,1.0000002760466424,7.4302971523125202E-4,1,0,1,0,1.0000008763039652,1.7428474994414824E-3,46.313680626186418,-89.309986835827232,90.690013164172768,null,1000000000,14455.252900000001,null,40.499810477772698,-88.691264138873663,null,54.603155714067455,-0.61872269695356907,null,0,0]
[131.83000000000001,0.13183,1.0000501262180856,1.0012404737174551E-2,1.0000000034305063,8.2831231620464636E-5,1,0,795.204806526276,1.5695387887929129,1.0002964753094368,2.4347569897444573E-2,1.0000003318831985,8.1471848717188267E-4,1,0,1,0,1.0000010535558648,1.9110003214976216E-3,45.514011727137799,-89.258030323487205,90.741969676512795,null,1000000000,17379.148900000004,null,39.700216359259372,-88.579615415408867,null,54.603080933532162,-0.67841490807833005,null,0,0]
[144.54,0.14454,1.0000602573926853,1.0977647019873832E-2,1.0000000041238783,9.0817160076520718E-5,1,0,871.8720128555118,1.5696493692087976,1.0003563880389414,2.6693902952742501E-2,1.0000003989632096,8.9326712333781197E-4,1,0,1,0,1.0000012664998543,2.0952435836384723E-3,44.714966721703924,-89.199834748820521,90.800165251179479,null,1000000000,20891.811599999997,null,38.901261190816754,-88.456016730332834,null,54.602991096540904,-0.74381801848767393,null,0,0]
[158.49,0.15849000000000002,1.0000724494876632,1.2037035667196112E-2,1.0000000049583075,9.9582203490527213E-5,1,0,956.01895683936766,1.5697503222411162,1.00042848448132,2.9268807222581131E-2,1.0000004796897752,9.794790283563649E-4,1,0,1,0,1.0000015227645171,2.2974617381676609E-3,43.915208546783752,-89.134809907572716,90.865190092427284,null,1000000000,25119.080100000003,null,38.101611126697421,-88.319209343846808,null,54.602882985740059,-0.81560056372591272,null,0,0]
[173.78,0.17377999999999999,1.0000871019728785,1.3198155253958621E-2,1.00000000596114,1.0918919370947195E-4,1,0,1048.2488423858053,1.5698423546928133,1.0005151244255392,3.2090602831749269E-2,1.0000005767084241,1.073972203536464E-3,1,0,1,0,1.0000018307480176,2.5191043531654937E-3,43.115872217854758,-89.062496057865019,90.937503942134981,null,1000000000,30199.488400000002,null,37.302404723881416,-88.168219495811471,null,54.602753059627076,-0.89427656205352901,null,0,0]
[190.55,0.19055000000000002,1.0001047230991722,1.4471624710629167E-2,1.0000000071671689,1.1972609531943525E-4,1,0,1149.4061550379151,1.5699263122036478,1.0006193096490805,3.5184945574317207E-2,1.0000006933852363,1.1776118509933963E-3,1,0,1,0,1.0000022011358933,2.7622008252782292E-3,42.316436846255748,-88.982240910757199,91.017759089242801,null,1000000000,36309.302500000005,null,36.503125599428486,-88.001675241523841,null,54.602596812480996,-0.98056566923335275,null,0,0]
[208.93,0.20893,1.0001258987999706,1.5867299242978156E-2,1.0000000086165091,1.3127458971881422E-4,1,0,1260.2750600082895,1.5700028491354023,1.0007444994367056,3.8575583740334214E-2,1.000000833601068,1.2912013698718145E-3,1,0,1,0,1.0000026462478206,3.0286355809504501E-3,41.517498039669249,-88.893435264386341,91.106564735613659,null,1000000000,43651.744900000005,null,35.704374555030363,-87.818299427740627,null,54.602409050292621,-1.0751358366457098,null,0,0]
[229.09,0.22909000000000002,1.0001513654362346,1.7398065742356337E-2,1.0000000103595765,1.4394149104358475E-4,1,0,1381.8810041862819,1.5700726754209728,1.0008950398118417,4.2293563129629522E-2,1.0000010022334227,1.4157913586823781E-3,1,0,1,0,1.0000031815673087,3.3208728683992808E-3,40.718471177483025,-88.795274631977748,91.204725368022252,null,1000000000,52482.2281,null,34.90557349714733,-87.616414132177383,null,54.602183245989444,-1.1788604998003689,null,0,0]
[251.19,0.25119000000000002,1.000181975322604,1.9076044193707505E-2,1.0000000124547332,1.5782733024023515E-4,1,0,1515.1891141140432,1.5701363431246858,1.001075958483516,4.6367976655910859E-2,1.0000012049284672,1.5523706112480712E-3,1,0,1,0,1.0000038250179568,3.6412319575418136E-3,39.919844017483406,-88.687001945394073,91.312998054605927,null,1000000000,63096.416100000002,null,34.107217737660044,-87.394440738331909,null,54.601911845477098,-1.2925612070621679,null,0,0]
[275.42,0.27542,1.0002187715101185,2.0915622554357013E-2,1.000000014973409,1.730514878051529E-4,1,0,1661.3454776117917,1.5701944049948491,1.0012934051331777,5.0833307769673125E-2,1.000001448596622,1.7021133177906559E-3,1,0,1,0,1.0000045985366983,3.9924669698821972E-3,39.121539901033707,-88.567715723517509,91.432284276482491,null,1000000000,75856.176400000011,null,33.30923986159938,-87.150502436314881,null,54.601585605088061,-1.4172132872026324,null,0,0]
[302,0.30199999999999999,1.0002630292782975,2.2933453188181088E-2,1.0000000180029478,1.8975219378260079E-4,1,0,1821.6771437940088,1.570247382074571,1.0015548939618046,5.57293797815002E-2,1.0000017416879312,1.8663790630049197E-3,1,0,1,0,1.0000055289479473,4.3777668694289801E-3,38.323183892501007,-88.436370915109748,91.563629084890252,null,1000000000,91204,null,32.511276233666862,-86.882425270537098,null,54.601193224487872,-1.5539456445726478,null,0,0]
[331.13,0.33112999999999998,1.0003162100867067,2.5144652917398203E-2,1.000000021643465,2.0805511183687764E-4,1,0,1997.3905209838292,1.5702956735519429,1.0018690279430478,6.1092086620361974E-2,1.0000020938879535,2.0464038212692735E-3,1,0,1,0,1.0000066469982019,4.8000306591527101E-3,37.525601731717167,-88.292029668188064,91.707970331811936,null,1000000000,109647.0769,null,31.714165541353559,-86.588246358264499,null,54.600721756017343,-1.7037833099235591,null,0,0]
[363.08,0.36307999999999996,{"$f":"SQRT(1+(A77/pole1)^2)","v":1.0003801626356115},{"$f":"ATAN(A77/pole1)","v":2.7569629606176801E-2},{"$f":"SQRT(1+(A77/Zero1)^2)","v":1.0000000260216233},{"$f":"ATAN(A77/Zero1)","v":2.2812988791485997E-4},{"$f":"IF(VIN_nom>Vout, 1, SQRT(1+(A77/z_RHP)^2))","v":1},{"$f":"IF(VIN_nom>Vout, 0, -ATAN(A77/z_RHP))","v":0},{"$f":"SQRT(1+(A77/Pole2)^2)","v":2190.1142604618535},{"$f":"ATAN(A77/Pole2)","v":1.5703397295968418},{"$f":"SQRT(1+(A77/Zero2)^2)","v":1.0022466812848969},{"$f":"ATAN(A77/Zero2)","v":6.6969889045306666E-2},{"$f":"SQRT(1+(A77/pole4)^2)","v":1.0000025174505103},{"$f":"ATAN(A77/pole4)","v":2.243856158064311E-3},{"$f":"IF(VOUT_setting=1,1,SQRT(1+(A77*zterm1)^2))","v":1},{"$f":"IF(VOUT_setting=1,0,ATAN(((A77*zterm1))))","v":0},1,{"$f":"IF(VOUT_setting=1,0,ATAN(A77*$Q$4/(1+Afbr-$Q$5*(A77)^2)))","v":0},{"$f":"SQRT((1-(Z77/pterm2))^2+(A77/pterm1)^2)","v":1.0000079915868128},{"$f":"IF((ATAN((A77/pterm1)/(1-A77^2/pterm2))>0),ATAN((A77/pterm1)/(1-A77^2/pterm2)),PI()+ATAN((A77/pterm1)/(1-A77^2/pterm2)))","v":5.263171993393192E-3},{"$f":"20*LOG10(((E77*K77*G77*O77)/(C77*I77*S77*M77*Q77))*Adc)","v":36.72822886936116},{"$f":"((F77+L77+H77+P77)-(D77+J77+T77+N77+R77))*radconv","v":-88.133420580744527},{"$f":"IF(V77>0,V77,V77+180)","v":91.866579419255473},null,{"$f":"IF(U77<0,A77,1000000000)","v":1000000000},{"$f":"A77^2","v":131827.0864},null,{"$f":"20*LOG10((K77/(I77*M77))*AEA)","v":30.917359611269294},{"$f":"(L77-(J77+N77))*radconv","v":-86.265310497122485},null,{"$f":"20*LOG10((E77*G77/(C77*S77))*Acs*Am)","v":54.600154823745591},{"$f":"(F77+H77-(D77+T77))*radconv","v":-1.8681100836220517},null,{"$f":"SUM((U78<0)*(U77>0))*A77","v":0},{"$f":"IF(AH77>0,W75,0)","v":0}]
[398.11,{"$f":"A78/1000","v":0.39811000000000002},1.0004570400508361,3.0228001831352342E-2,1.0000000312849817,2.5013988476121885E-4,1,0,2401.4166931297718,1.5703799059247652,1.0027005023717532,7.3408978778341974E-2,1.0000030266510349,2.4603428220811682E-3,1,0,1,0,1.0000096080306307,5.7709594911137694E-3,35.93146005149989,-87.959340130591912,92.040659869408088,null,1000000000,158491.57210000002,null,30.121272257161209,-85.911083537304151,null,54.599473359992416,-2.0482565932877645,null,0,0]
[436.52,0.43651999999999996,1.0005494602955416,3.3142384482759912E-2,1.0000000376130045,2.7427359783809734E-4,1,0,2633.1074315992605,1.570416547370769,1.0032458499397958,8.0462346110496408E-2,1.0000036388515428,2.6977177422446556E-3,1,0,{"$f":"IF(VOUT_setting=1,1,SQRT((1+Afbr-$Q$5*(A79)^2)^2+(A79*$Q$4)^2))","v":1},0,1.0000115514447054,6.3277415028155674E-3,35.135337276473074,-87.76841225747259,92.23158774252741,null,1000000000,190549.71039999998,null,29.325968655535981,-85.522655338671314,null,54.598654186590835,-2.2457569188012734,null,0,0]
[478.63,0.47863,1.000660547023509,3.6336858047070493E-2,1.0000000452198963,3.0073208894785077E-4,1,0,2887.1167293534218,1.5704499604669169,1.0039010180795938,8.8185923296028715E-2,1.0000043747749561,2.9579584199703607E-3,1,0,1,0,1.0000138876130842,6.9381561616386166E-3,34.34010152209548,-87.559197080471748,92.440802919528252,null,1000000000,229086.67689999999,null,28.531717430181509,-85.096952084591393,null,54.597669657567707,-2.4622449958803618,null,0,0]
[524.80999999999995,0.52481,1.0007941071735493,3.9839227508487042E-2,1.0000000543668199,3.2974783577773914E-4,1,0,3165.6764420126419,1.5704804385369056,1.0046882606925618,9.6643853216970901E-2,1.000005259686948,3.243351320609233E-3,1,0,1,0,1.0000166967404909,7.6075662115854701E-3,33.545675310318913,-87.330054345037681,92.669945654962319,null,1000000000,275425.53609999997,null,27.738474783927582,-84.63044646965858,null,54.596486092045062,-2.6996078753790878,null,0,0]
[575.44000000000005,0.57544000000000006,1.0009546411836541,4.3677965886339737E-2,1.0000000653626755,3.6155959914819824E-4,1,0,3471.078745644943,1.5705082319151455,1.0056338184428395,0.10590085038151936,1.0000063234713648,3.5562446606172541E-3,1,0,1,0,1.0000200736916729,8.3414791222491593E-3,32.752455674358984,-87.079358327586846,92.920641672413154,null,1000000000,331131.19360000006,null,26.946677546297447,-84.119579511673422,null,54.595063693715275,-2.9597788159134266,null,0,0]
[630.96,0.63096000000000008,1.0011476298669728,4.7885976976111896E-2,1.0000000785838639,3.9644383891940764E-4,1,0,3805.9777388795178,1.5705335822177831,1.0067695616406367,0.11603095981572742,1.0000076025422009,3.8993573921054813E-3,1,0,1,0,1.0000241340607992,9.1462717969051262E-3,31.960503483033133,-86.805270966968479,93.194729033031521,null,1000000000,398110.52160000004,null,26.156435025536663,-83.560278371210529,null,54.593354023150205,-3.2449925957579411,null,0,0]
[691.83,0.69183000000000006,1.0013795791821103,5.2497524032020126E-2,1.0000000944775234,4.3468958123097008E-4,1,0,4173.1481612135958,1.5705566995468481,1.0081331852518387,0.12710972599587342,1.0000091401564821,4.2755319818347653E-3,1,0,1,0,1.0000290151645366,1.0028610648689892E-2,31.170241205632692,-86.505967320050829,93.494032679949171,null,1000000000,478628.74890000006,null,25.368227149295535,-82.948389567917303,null,54.591299621990892,-3.5575777521335321,null,0,0]
[758.58,0.75858000000000003,1.0016584032032474,5.7551968243886621E-2,1.0000001135880103,4.7662983439444384E-4,1,0,4575.7869951317853,1.5705777851518909,1.0097703638087683,0.13922263786422207,1.000010988976008,4.6880433824116738E-3,1,0,1,0,1.0000348841739863,1.0996176245721216E-2,30.381810448766572,-86.179424617177162,93.820575382822838,null,1000000000,575443.61640000006,null,24.582265363903176,-82.279214117913881,null,54.588830650517139,-3.9002104992632982,null,0,0]
[831.76,0.83175999999999994,1.0019934746610795,6.3089914677722389E-2,1.0000001365607121,5.2261017293412206E-4,1,0,5017.2118639846558,1.5705970129062807,1.0117349084672469,0.15245516893576816,1.00001321143608,5.1402899976420273E-3,1,0,1,0,1.0000419392848563,1.2056938366767356E-2,29.595774454064554,-85.823713596715933,94.176286403284067,null,1000000000,691824.69759999996,null,23.799195536438681,-81.54805942593093,null,54.585864483279607,-4.2756541707850033,null,0,0]
[912.01,0.91200999999999999,1.0023962189561215,6.9158424389640455E-2,1.0000001641832714,5.7303271982370933E-4,1,0,5501.2832749608342,1.5706145510244944,1.0140920534317495,0.16690435011900179,1.0000158837332991,5.6362262299627375E-3,1,0,1,0,1.0000504223760927,1.322017044669836E-2,28.812368805609552,-85.436715694300673,94.563284305699327,null,1000000000,831762.24009999994,null,23.019353859213432,-80.749602238973267,null,54.582300512049855,-4.6871134553274167,null,0,0]
[1000,1,1.0028801979876165,7.580635837693174E-2,1.000000197392068,6.2831844731661539E-4,1,0,6032.0426965384804,1.5706305454742249,1.0169186619206665,0.18266648001743854,1.0000190964521092,6.1799916211340627E-3,1,0,1,0,1.0000606209981076,1.4495579559700572E-2,28.032228668983045,-85.016490531355956,94.983509468644044,null,1000000000,1000000,null,22.243494740574036,-79.878570595085151,null,54.578019494062744,-5.1379199362708032,null,0,0]
[1096.5,1.0965,1.0034618918901574,8.3089518702401333E-2,1.0000002373268968,6.889511591405738E-4,1,0,6614.1348014605128,1.5706451354397417,1.0203073949394403,0.19984788313269614,1.0000229598539512,6.7763433596618808E-3,1,0,1,0,1.00007288516194,1.5894320676106254E-2,27.255776022963918,-84.561035339668678,95.438964660331322,null,1000000000,1202312.25,null,21.472184823778942,-78.929153090553385,null,54.572876764838718,-5.6318822491152893,null,0,0]
[1202.3,1.2022999999999999,1.0041607388641147,9.1064410652929584E-2,1.0000002853352139,7.554272249190089E-4,1,0,7252.3249033321827,1.5706584399770143,1.0243663778835572,0.21854832330359275,1.0000276042870477,7.4301617836315843E-3,1,0,1,0,1.000087628638632,1.74278365547944E-2,26.48396240691595,-84.068785212867894,95.931214787132106,null,1000000000,1445525.2899999998,null,20.706545901350182,-77.895920122638927,null,54.56670207121951,-6.1728650902289628,null,0,{"$f":"IF(AH90>0,W90,0)","v":0}]
[1318.3,1.3183,1.0050002462093819,9.9794782839564763E-2,1.0000003430505893,8.2831212866369297E-4,1,0,7952.0418404488537,1.570670572929072,1.0292248790464811,0.23887421002840062,1.0000331877746389,8.1470064205186807E-3,1,0,1,0,1.0001053530455628,1.9109161593719347E-2,25.71757297335008,-83.538335338493297,96.461664661506703,null,1000000000,1737914.89,null,19.947568524382636,-76.77309993636959,null,54.559290014621183,-6.7652354021237207,null,0,0]
[1445.4,1.4454,1.0060078735439459,0.10934302136019916,1.0000004123877455,9.0817135358284555E-4,1,0,8718.7144511144652,1.570681630986495,1.0350315497760105,0.26091585746471591,1.0000398955330778,8.9324360333673195E-3,1,0,1,0,1.0001266463136782,2.0951326586834084E-2,24.958016447716467,-82.96912379991322,97.03087620008678,null,1000000000,2089181.1600000001,null,19.196900557962444,-75.555841945303229,null,54.550401455407766,-7.4132818546099752,null,0,0]
[1584.9,1.5849000000000002,1.0072191531267947,0.11979974004542625,1.000000495830643,9.9582170902439348E-4,1,0,9560.1843906706781,1.5706917263017515,1.0419766101785135,0.28481218603808645,1.000047967838573,9.7944802030080283E-3,1,0,1,0,1.00015227114387,2.2973155002207368E-2,24.205083949788047,-82.35988102561636,97.64011897438364,null,1000000000,2511908.0100000002,null,18.454641796816922,-74.236653082315158,null,54.539727718624853,-8.1232279433011971,null,0,0]
[1737.8,1.7378,1.00867296645201,0.13123066159005148,1.0000005961138283,1.0918915075062575E-3,1,0,10482.483701695803,1.5707009295560386,1.0502625483302843,0.3106245073212664,1.000057669196176,1.0739313280240761E-2,1,0,1,0,1.0001830671299725,2.5189115824343588E-2,23.461044635524679,-81.712010580347609,98.287989419652391,null,1000000000,3019948.84,null,17.723397172334028,-72.812378267023988,null,54.526933028844383,-8.8996323133236181,null,0,0]
[1905.5,1.9055,1.0104185848088916,0.14372839679781602,1.0000007167166449,1.1972603868507152E-3,1,0,11494.057243806661,1.5707093253140401,1.0601416340566241,0.33845074807677833,1.0000693361439339,1.1775579639259756E-2,1,0,1,0,1.0002201024997106,2.7619466968680766E-2,22.726740876798406,-81.026818306985191,98.973181693014809,null,1000000000,3630930.25,null,17.004432871632993,-71.27790684058732,null,54.511593570819144,-9.7489114663978746,null,0,0]
[2089.3000000000002,2.0893000000000002,1.0125123925389401,0.15737410153043607,1.000000861650534,1.3127451506439818E-3,1,0,12602.746672368283,1.5707169790124611,1.0718933320448656,0.3683335890580039,1.000083356667363,1.2911303380876264E-2,1,0,1,0,1.0002646087546236,3.0283006075512528E-2,22.004170004498654,-80.30800238927057,99.69199761072943,null,1000000000,4365174.4900000012,null,16.300227658095043,-69.631256872325565,null,54.493227912057343,-10.67674551694499,null,0,0]
[2290.9,2.2909000000000002,1.0150248166406814,0.17227348321731778,1.0000010359571199,1.4394139262629642E-3,1,0,13818.806459788366,1.5707239616449986,1.0858582191035842,0.40033485520594175,1.0001002183706347,1.4156977190214358E-2,1,0,1,0,1.0003181335642772,3.3204312937694797E-2,21.294358553466054,-79.560029482002932,100.43997051799707,null,1000000000,5248222.8100000005,null,15.612405731260903,-67.869491308260095,null,54.471238387858882,-11.690538173742839,null,0,0]
[2511.9,2.5119000000000002,1.0180365298075471,0.1885181201738983,1.0000012454725538,1.5782720050440781E-3,1,0,15151.887874221149,1.5707303284183889,1.1024098445537602,0.43444530828233696,1.0001204856609163,1.5522471763944482E-2,1,0,1,0,1.0003824683130935,3.6406498997817047E-2,20.599366645237211,-78.790511249763753,101.20948875023625,null,1000000000,6309641.6100000003,null,14.943704638593939,-65.99370817282734,null,54.444947572297011,-12.796803076936415,null,0,0]
[2754.2,2.7542,1.0216452848817272,0.20621314756125672,1.0000014973397804,1.7305131678819483E-3,1,0,16613.451796604917,1.5707361346076951,1.1219840980688485,0.47064006462334462,1.0001448492764644,1.7019506114913256E-2,1,0,1,0,1.0004598052796021,3.9916997613769017E-2,19.920760141729406,-78.00907525651148,101.99092474348852,null,1000000000,7585617.6399999987,null,14.296502866546101,-64.006007811950866,null,54.413542840837039,-14.003067444560605,null,0,0]
[3020,3.02,1.025969187695037,0.22547446706716281,1.000001800293175,1.8975196832056466E-3,1,0,18216.768720663658,1.5707414323174052,1.1450853950182733,0.50886646218109743,1.0001741537800348,1.8661645649535596E-2,1,0,1,0,1.0005528248487465,4.3767555013110956E-2,19.259811166142715,-77.227899445500697,102.7721005544993,null,1000000000,9120400,null,13.673042470243091,-61.910187764620531,null,54.376054261553357,-15.317711680880159,null,0,0]
[3311.3,3.3113000000000001,1.031141123330469,0.24638949168489735,1.0000021643441983,2.0805481463743434E-3,1,0,19973.902731604692,1.57074626146646,1.172243539182342,0.54896498267900151,1.0002093670972763,2.046121086267088E-2,1,0,1,0,1.0006645987367337,4.7986976360037716E-2,18.618630200046265,-76.463418552613504,103.5365814473865,null,1000000000,10964707.690000001,null,13.076504394973972,-59.716095954395385,null,54.33141137072603,-16.747322598218112,null,0,0]
[3630.8,3.6308000000000002,1.0373268431334737,0.26907837169722015,1.0000026021589927,2.2812949611962113E-3,1,0,21901.140344462368,1.5707506670719498,1.2040934409999069,0.59079101384002042,1.0002517136880202,2.2434834500912673E-2,1,0,1,0,1.0007990125859343,5.2614149059249229E-2,17.997920347971473,-75.733888807977934,104.26611119202207,null,1000000000,13182708.640000001,null,12.508907568375442,-57.43297361989675,null,54.278298345249766,-18.300915188081166,null,0,0]
[3981.1,3.9811000000000001,1.0447147451472178,0.2936316276871842,1.0000031284933342,2.5013936827212356E-3,1,0,24014.164870014381,1.5707546847055005,1.2413016336316514,0.63409876014803335,1.0003026197721587,2.4598515250129183E-2,1,0,1,0,1.0009605919240017,5.7686435436168783E-2,17.398766020052761,-75.061545507715977,104.93845449228402,null,1000000000,15849157.209999999,null,11.972793055906607,-55.075822502120801,null,54.21525852979989,-19.985723005595176,null,0,0]
[4365.2,4.3651999999999997,1.0535284760128645,0.32014041295576229,1.0000037612934385,2.7427291696840426E-3,1,0,26331.072436084436,1.5707583488506762,1.2846102685804561,0.67860964256114675,1.0003638196339735,2.6970701298595436E-2,1,0,1,0,1.0011548393385954,6.3246890327374336E-2,16.821443651858011,-74.470990599715066,105.52900940028493,null,1000000000,19054971.039999999,null,11.470121706768277,-52.661662983538761,null,54.140607510743465,-21.80932761617629,null,0,0]
[4786.3,4.7862999999999998,1.0640268027351807,0.34867581480248855,1.0000045219795146,3.0073119141384537E-3,1,0,28871.165579020879,1.5707616901607273,1.3348128745724877,0.72399019074532289,1.0004373828006714,2.9571048016177444E-2,1,0,1,0,1.0013883203796488,6.934133235893393E-2,16.26572491386181,-73.989041476206594,106.01095852379341,null,1000000000,22908667.690000001,null,11.002547560784969,-50.210729432946927,null,54.052462918730583,-23.778312043259685,null,0,0]
[5248.1,5.2481,1.0765149768257696,0.37930164248996773,1.0000054366673754,3.297466525809378E-3,1,0,31656.762856479538,1.5707647379680574,1.3927850219414655,0.76989193305720727,1.0005258318284529,3.2422261360643585E-2,1,0,1,0,1.0016690368807553,7.6022643018658298E-2,15.730410560856614,-73.643519425020258,106.35648057497974,null,1000000000,27542553.610000003,null,10.571009980126123,-47.744290440986624,null,53.948686146384226,-25.89922898403362,null,0,0]
[5370.3,5.3703000000000003,1.0799860034332751,0.38728482895520056,1.0000056927957011,3.3742461957319385E-3,1,0,32393.878463507906,1.5707654567648912,1.4085907069355119,0.78139832281534449,1.0005505976900322,3.3176653754081478E-2,1,0,1,0,1.0017476358634645,7.7790223600510147E-2,15.599640944511933,-73.581795186415818,106.41820481358418,null,1000000000,28840122.090000004,null,10.468880693694844,-47.128287553974587,null,53.920045816470825,-26.453507632441195,null,0,0]
[5432.85,5.4328500000000002,1.0817892059444816,0.39135119432140697,1.0000058261800764,3.4135470670864673E-3,1,0,32771.182728813867,1.5707658121806263,1.4167520376520299,0.78718831895370811,1.0005634948088322,3.3562786853059537E-2,1,0,1,0,1.0017885668673761,7.8694919179000483E-2,15.534282114071251,-73.554766042756597,106.4452339572434,null,1000000000,29515859.122500002,null,10.418365932680908,-46.818689372218884,null,53.905201747044075,-26.73607667053772,null,0,0]
[5495.4,5.4954000000000001,1.0836102364891906,0.39540395928397704,1.0000059611090188,3.4528479278961108E-3,1,0,33148.486994123872,1.5707661595055018,1.4249603186698643,0.79291180023656582,1.0005765411065597,3.3948909940197509E-2,1,0,1,0,1.0018299710650769,7.9599567695433152E-2,15.469948536833968,-73.530764940806861,106.46923505919314,null,1000000000,30199421.159999996,null,10.368999271413003,-46.512901173754656,null,53.890234831074707,-27.017863767052205,null,0,0]
[5559.4,5.5593999999999992,1.0854918403222029,0.399536529160187,1.0000061007644998,3.493059828794623E-3,1,0,33534.537721223693,1.5707665067923529,1.4334066337520455,0.79869991877375635,1.0005900442366493,3.4343973439898173E-2,1,0,1,0,1.0018728248190349,8.0525138010743222E-2,15.405152235205746,-73.509291659475139,106.49070834052486,null,1000000000,30906928.359999996,null,10.319642575624828,-46.203921779142512,null,53.874795225234649,-27.305369880332641,null,0,0]
[5623.4,5.6233999999999993,1.0873919179895084,0.40365472689393933,1.0000062420369871,3.5332717183965581E-3,1,0,33920.588448327464,1.5707668461742503,1.4419004077359827,0.80442003516683647,1.0006037035297699,3.473902621519067E-2,1,0,1,0,1.0019161739021285,8.1450657922471553E-2,15.341364340375785,-73.49088719624784,106.50911280375216,null,1000000000,31622627.559999995,null,10.27142001908026,-45.898837553006373,null,53.859229886949258,-27.592049643241481,null,0,0]
[5688.9,5.6888999999999994,1.0893555562260435,0.40785449664040391,1.000006388294846,3.5744260623285142E-3,1,0,34315.687239351682,1.5707671856037799,1.4506415250110254,0.81020466470083519,1.000617844651928,3.5143326807305877E-2,1,0,1,0,1.0019610518275486,8.2397816919454678E-2,15.277093111028604,-73.475175827585559,106.52482417241444,null,1000000000,32363583.209999997,null,10.223207611016656,-45.590586859771612,null,53.843171065665686,-27.884588967813954,null,0,0]
[5754.4,5.7543999999999995,1.0913383392467038,0.41203907938488737,1.0000065362463952,3.6155803941525541E-3,1,0,34710.786030379757,1.5707675173061324,1.4594306011566958,0.81591981043388351,1.0006321493294084,3.5547615906032365E-2,1,0,1,0,1.0020064485096227,8.3344921907705649E-2,15.213813415504189,-73.462571241312858,106.53742875868714,null,1000000000,33113119.359999996,null,10.176115352180924,-45.286316193823097,null,53.826983628976997,-28.176255047489775,null,0,0]
[5821.4,5.8213999999999997,1.0933862283746385,0.41630371338374439,1.0000066893384618,3.6576771789185477E-3,1,0,35114.932885328373,1.5707678488819985,1.4684696749791035,0.82169486356764831,1.0006469508041329,3.5961151505260483E-2,1,0,1,0,1.0020534214890862,8.4313659804866534E-2,15.150078145997917,-73.452836066851177,106.54716393314882,null,1000000000,33888697.959999993,null,10.129069669205528,-44.979142864855476,null,53.810294042446117,-28.473693201995683,null,0,0]
[5888.4,5.8883999999999999,1.0954539284704348,0.42055232517748797,1.0000068442026788,3.6997739507206614E-3,1,0,35519.079740280766,1.5707681729123231,1.4775571239177545,0.82739906815496966,1.0006619233961058,3.6374674799996023E-2,1,0,1,0,1.0021009371879863,8.5282339891884287E-2,15.087316016908922,-73.446237761499788,106.55376223850021,null,1000000000,34673254.559999995,null,10.083128408931177,-44.676027721265157,null,53.793473173631483,-28.770210040234616,null,0,0]
[5957,5.9569999999999999,1.0975914158069138,0.42488573051291151,1.0000070046012812,3.7428760049780414E-3,1,0,35932.877863414898,1.5707684971285969,1.4869107819911818,0.83316705858712814,1.0006774308301061,3.6798060382011701E-2,1,0,1,0,1.0021501498679031,8.6274092054515555E-2,15.024031250883121,-73.442672520725182,106.55732747927482,null,1000000000,35485849,null,10.03720049172577,-44.369822996061082,null,53.776116324811085,-29.072849524664129,null,0,0]
[6025.6,6.0256000000000007,1.0997494338110809,0.42920220991864316,1.0000071668576829,3.7859780453284278E-3,1,0,36346.67598655272,1.5707688139626228,1.4963132897313622,0.83886274693989182,1.0006931176353122,3.7221432765983269E-2,1,0,1,0,1.0021999314218366,8.7265782220127402E-2,14.961702621934755,-73.442275369083291,106.55772463091671,null,1000000000,36307855.360000007,null,9.9923628175480985,-44.067759695697191,null,53.758625370040392,-29.374515673386103,null,0,0]
[6095.8,6.0958000000000006,1.1019789132759905,0.43360177898261371,1.0000073348217902,3.8300853665161768E-3,1,0,36770.125377872377,1.5707691308038618,1.5059847153030228,0.84461745915636133,1.0007093560000964,3.7654665903439716E-2,1,0,1,0,1.0022514629519053,8.8280537268013728E-2,14.898878181327117,-73.445085987933311,106.55491401206669,null,1000000000,37158777.640000001,null,9.9475742646187175,-43.762879557019986,null,53.74058948236214,-29.682206430913318,null,0,0]
[6166,6.1660000000000004,1.1042296365010071,0.43798349751359011,1.0000075047313668,3.874192672801334E-3,1,0,37193.574769195642,1.5707694404306165,1.5157053767180866,0.85029854420889062,1.0007257821828555,3.8087884899794207E-2,1,0,1,0,1.0023035901186907,8.9295225901591405E-2,14.836991371755285,-73.451087344344941,106.54891265565506,null,1000000000,38019556,null,9.9038600170624296,-43.462216720513915,null,53.722416920346596,-29.988870623831016,null,0,0]
[6237.8,6.2378,1.10655349870089,0.44244655755097373,1.0000076805260121,3.9193052582218151E-3,1,0,37626.675428700815,1.5707697499052637,1.5256975426482835,0.85603403762627139,1.0007427770297919,3.8530963036394798E-2,1,0,1,0,1.0023575214795419,9.0332971853773938E-2,14.774632303842342,-73.460460223302434,106.53953977669757,null,1000000000,38910148.840000004,null,9.8602271078098198,-43.159001392739341,null,53.703690761686254,-30.301458830563107,null,0,0]
[6309.6,6.3096000000000005,1.1088993095974553,0.44689082312369388,1.0000078583558174,3.9644178276895085E-3,1,0,38059.776088209517,1.5707700523365866,1.5357392436894941,0.86169471017283217,1.0007599683340891,3.8974026037360818E-2,1,0,1,0,1.0024120758470358,9.1370646734969793E-2,14.713191038491404,-73.473037836963385,106.52696216303661,null,1000000000,39811052.160000004,null,9.8176509719890994,-42.860071714326402,null,53.684825632156041,-30.612966122636976,null,0,0]
[6383.05,6.3830499999999999,1.1113215945578188,0.45141771451088342,1.0000080423780908,4.0105670899243341E-3,1,0,38502.829618030773,1.5707703546777811,1.54606195736006,0.86740919370988301,1.0007777579738903,3.942725500631622E-2,1,0,1,0,1.0024685284991006,9.2432093525481526E-2,14.651256147131589,-73.489151512280856,106.51084848771914,null,1000000000,40743327.302500002,null,9.7751564362160437,-42.558641355160596,null,53.665385276569282,-30.930510157120246,null,0,0]
[6456.5,6.4565000000000001,1.1137665542167765,0.4559248229038827,1.0000082285301353,4.0567163350760287E-3,1,0,38945.883147855478,1.5707706501400287,1.5564344875374323,0.87304769339218935,1.000795753182621,3.9880467769436344E-2,1,0,1,0,1.0025256330211783,9.3493464235658463E-2,14.590219287385482,-73.508479578952816,106.49152042104718,null,1000000000,41686392.25,null,9.7337011025244884,-42.261563227527169,null,53.64580375051473,-31.246916351425678,null,0,0]
[6531.7,6.5316999999999998,1.1162931027340168,0.46051876601034714,1.0000084213238771,4.1039651018612653E-3,1,0,39399.49275225398,1.5707709457574708,1.5671047288604114,0.87874301850208147,1.0008143901028101,4.0344461675184032E-2,1,0,1,0,1.0025847733987243,9.4580043158988561E-2,14.528627485738042,-73.531526100192707,106.46847389980729,null,1000000000,42663104.890000001,null,9.6923013885421501,-41.961846965583902,null,53.625611662849629,-31.569679134608808,null,0,0]
[6606.9,6.6068999999999996,1.1188431031622359,0.4650918647822363,1.000008616350083,4.1512138503226464E-3,1,0,39853.102356655851,1.5707712346454534,1.5778251134669605,0.88436113108790992,1.0008332424806228,4.0808438200606693E-2,1,0,1,0,1.0026445969695574,9.5666540506035153E-2,14.467915124710007,-73.557796226476952,106.44220377352305,null,1000000000,43651127.609999992,null,9.6519245543527479,-41.6665532740112,null,53.605276136010993,-31.891242952465774,null,0,0]
[6683.85,6.6838500000000005,1.121476555355724,0.46974975731403779,1.0000088182257931,4.1995621182897638E-3,1,0,40317.26803563162,1.5707715235269961,1.588845823441484,0.89003132000376839,1.0008527566015566,4.1283193852996752E-2,1,0,1,0,1.0027065198790293,9.6778236623814656E-2,14.406669527948285,-73.587939306912276,106.41206069308772,null,1000000000,44673850.822500005,null,9.6116338226040625,-41.368893426625625,null,53.584321270997961,-32.219045880286636,null,0,0]
[6760.8,6.7608000000000006,1.1241342247553741,0.47438572572664439,1.0000090224390779,4.2479103666233572E-3,1,0,40781.43371461067,1.5707718058325613,1.5999169117641421,0.89562321361334118,1.0008724962987992,4.1757930885658996E-2,1,0,1,0,1.0027691580295024,9.78898453680591E-2,14.346283555151873,-73.621305769840205,106.37869423015979,null,1000000000,45708416.640000001,null,9.57234808420578,-41.075718126243459,null,53.563221036599828,-32.545587643596768,null,0,0]
[6839.55,6.83955,1.1268789566227686,0.47910739315982476,1.0000092338495146,4.2973895475707184E-3,1,0,41256.457070294266,1.5707720881648466,1.6112980491375659,0.90126617079953297,1.0008929312824004,4.2243753377877974E-2,1,0,1,0,1.0028340018684221,9.9027365161381484E-2,14.285344668508875,-73.65871164519973,106.34128835480027,null,1000000000,46779444.202500001,null,9.5331509869261168,-40.78025225000907,null,53.541479247236488,-32.878459395190646,null,0,0]
[6918.3,6.9183000000000003,1.1296486888825343,0.48380601125207418,1.000009447708162,4.3468687074763113E-3,1,0,41731.480425981077,1.5707723640696376,1.6227297743622684,0.90682979663511409,1.0009136024905696,4.2729555918011121E-2,1,0,1,0,1.0028995946699333,0.10016479135148489,14.22524559979758,-73.699335368877641,106.30066463112236,null,1000000000,47862874.890000001,null,9.4949408371138198,-40.489330213914343,null,53.5195903283375,-33.210005154963319,null,0,0]
[6998.9,6.9988999999999999,1.1325091846864328,0.48859110247329901,1.0000096691259457,4.3975102129060724E-3,1,0,42217.66306050311,1.5707726400266675,1.6344813310504669,0.91244335641293906,1.0009350039066542,4.322675006358908E-2,1,0,1,0,1.0029675038724779,0.10132883999801118,14.164574308603958,-73.744164084554356,106.25583591544564,null,1000000000,48984601.209999993,null,9.4568223541603285,-40.19619986757899,null,53.497037520097365,-33.547964216975345,null,0,0]
[7079.5,7.0795000000000003,1.1353954806576685,0.49335197382432455,1.000009893108315,4.4481516957803231E-3,1,0,42703.845695028285,1.5707729097001639,1.6462836573410284,0.91797660045130003,1.0009566527452756,4.3723922825287621E-2,1,0,1,0,1.0030361974963071,0.10249278834937357,14.10472304110943,-73.792199526368393,106.20780047363161,null,1000000000,50119320.25,null,9.4196725882968089,-39.907669688922681,null,53.474336018466353,-33.884529837445726,null,0,0]
[7161.95,7.16195,1.1383745159847936,0.49819702859285969,1.0000101248852753,4.4999555215881511E-3,1,0,43201.187608388762,1.5707731792830932,1.6584082814932413,0.92355518456926511,1.0009790544760737,4.4232484740054152E-2,1,0,1,0,1.0031072793925833,0.10368334768075102,14.04431691450705,-73.844571172224676,106.15542882777532,null,1000000000,51293527.802499995,null,9.3826400414896636,-39.617194260273941,null,53.45096243867112,-34.227376911950714,null,0,0]
[7244.4,7.2443999999999997,1.1413801342883354,0.50301667885429846,1.0000103593458975,4.5517593232433399E-3,1,0,43698.529521752302,1.5707734427296653,1.6705837662273713,0.92905262245561948,1.0010017150836845,4.4741023760762916E-2,1,0,1,0,1.0031791819751517,0.1048737996620917,13.984710085993724,-73.900128771001548,106.09987122899845,null,1000000000,52481331.359999992,null,9.3465566466141077,-39.331366504904942,null,53.427439005033357,-34.568762266096591,null,0,0]
[7328.75,7.3287500000000003,1.1444823053758462,0.50792108122574375,1.0000106019866313,4.6047568803684116E-3,1,0,44207.332316081796,1.5707737061130393,1.6830913072393909,0.93459426583452365,1.0010251657640941,4.5261257727439316E-2,1,0,1,0,1.0032535906880289,0.10609157238702155,13.92452770964713,-73.96017655341258,106.03982344658742,null,1000000000,53710576.5625,null,9.3105918591194534,-39.043676028804022,null,53.40322141618141,-34.916500524608566,null,0,0]
[7413.1,7.4131,1.1476118556702373,0.51279885167279149,1.0000108474361342,4.6577544116261733E-3,1,0,44716.135110414303,1.5707739635025948,1.695649772231117,0.94005398884339753,1.001048887352602,4.5781467179210299E-2,1,0,1,0,1.0033288581746265,0.10730923019336468,13.86512406776524,-74.023383799528787,105.97661620047121,null,1000000000,54954051.610000007,null,9.2755565789500132,-38.760677496146215,null,53.378853054468962,-35.262706303382579,null,0,0]
[7499.45,7.4994499999999995,1.1508437373497165,0.51776467654762948,1.0000111016148781,4.7120085258854352E-3,1,0,45237.001989974044,1.5707742209975164,1.7085575846465091,0.94555985890506544,1.0010734519965545,4.6313985490550574E-2,1,0,1,0,1.0034067997738871,0.10855563916376812,13.805089955033827,-74.091272736563226,105.90872726343677,null,1000000000,56241750.302499995,null,9.2406216290779088,-38.475740183865106,null,53.353753891609649,-35.615532552698127,null,0,0]
[7585.8,7.5857999999999999,1.1541038388151774,0.52270256778853852,1.0000113587371615,4.7662626124048276E-3,1,0,45757.868869536716,1.5707744726302517,1.7215164137031074,0.95098299970977995,1.0010983005066854,4.6846477517347322E-2,1,0,1,0,1.0034856411646693,0.10980192495549403,13.745815053099426,-74.162292333635421,105.83770766636458,null,1000000000,57544361.640000001,null,9.2065974870532461,-38.195541066983154,null,53.328503131699918,-35.966751266652274,null,0,0]
[7674.15,7.67415,1.1574684083501789,0.52772591278724701,1.0000116248613891,4.8217732787166371E-3,1,0,46290.799834326695,1.5707747242301611,1.7348269996704833,0.95644772799822197,1.0011240183293149,4.7391275368133159E-2,1,0,1,0,1.0035672398365778,0.11107694772179119,13.685924936711372,-74.238104863617778,105.76189513638222,null,1000000000,58892578.222499996,null,9.1726965403329643,-37.913664232698338,null,53.302513962032137,-36.324440630919433,null,0,0]
[7762.5,7.7625000000000002,1.1608620157020313,0.53272001319299522,1.0000118940670848,4.8772839153122796E-3,1,0,46823.730799119541,1.5707749701028302,1.748188603406335,0.96182907987796251,1.0011500332749395,4.7936045067390444E-2,1,0,1,0,1.0036497802564637,0.1123518385997888,13.626773769546077,-74.317009422132202,105.6829905778678,null,1000000000,60256406.25,null,9.1396864871167782,-37.636562573638074,null,53.276372848083035,-36.680446848494157,null,0,0]
[7852.9,7.8529,1.1643641569390726,0.53779973030247596,1.0000121727087508,4.9340825434867437E-3,1,0,47369.027451270384,1.5707752159540396,1.761911835136688,0.96725065274049804,1.0011769593698592,4.8493425676274377E-2,1,0,1,0,1.0037352105432473,0.11365617292463751,13.566987421163773,-74.400850703295248,105.59914929670475,null,1000000000,61668038.409999996,null,9.1068015655306329,-37.357878972681846,null,53.249471421286884,-37.042971730613388,null,0,0]
[7943.3,7.9432999999999998,{"$f":"SQRT(1+(A141/pole1)^2)","v":1.1678961622375532},{"$f":"ATAN(A141/pole1)","v":0.54284885241539171},{"$f":"SQRT(1+(A141/Zero1)^2)","v":1.0000124545765383},{"$f":"ATAN(A141/Zero1)","v":4.9908811398254376E-3},{"$f":"IF(VIN_nom>Vout, 1, SQRT(1+(A141/z_RHP)^2))","v":1},{"$f":"IF(VIN_nom>Vout, 0, -ATAN(A141/z_RHP))","v":0},{"$f":"SQRT(1+(A141/Pole2)^2)","v":47914.324103424027},{"$f":"ATAN(A141/Pole2)","v":1.5707754562093508},{"$f":"SQRT(1+(A141/Zero2)^2)","v":1.7756860541703201},{"$f":"ATAN(A141/Zero2)","v":0.97258826883634231},{"$f":"SQRT(1+(A141/pole4)^2)","v":1.0012041964867855},{"$f":"ATAN(A141/pole4)","v":4.9050776131941587E-2},{"$f":"IF(VOUT_setting=1,1,SQRT(1+(A141*zterm1)^2))","v":1},{"$f":"IF(VOUT_setting=1,0,ATAN(((A141*zterm1))))","v":0},1,{"$f":"IF(VOUT_setting=1,0,ATAN(A141*$Q$4/(1+Afbr-$Q$5*(A141)^2)))","v":0},{"$f":"SQRT((1-(Z141/pterm2))^2+(A141/pterm1)^2)","v":1.0038216265609723},{"$f":"IF((ATAN((A141/pterm1)/(1-A141^2/pterm2))>0),ATAN((A141/pterm1)/(1-A141^2/pterm2)),PI()+ATAN((A141/pterm1)/(1-A141^2/pterm2)))","v":0.11496036602791591},{"$f":"20*LOG10(((E141*K141*G141*O141)/(C141*I141*S141*M141*Q141))*Adc)","v":13.507919989448489},{"$f":"((F141+L141+H141+P141)-(D141+J141+T141+N141+R141))*radconv","v":-74.487739250828},{"$f":"IF(V141>0,V141,V141+180)","v":105.512260749172},null,{"$f":"IF(U141<0,A141,1000000000)","v":1000000000},{"$f":"A141^2","v":63096014.890000001},null,{"$f":"20*LOG10((K141/(I141*M141))*AEA)","v":9.0747875282824726},{"$f":"(L141-(J141+N141))*radconv","v":-37.084003691850697},null,{"$f":"20*LOG10((E141*G141/(C141*S141))*Acs*Am)","v":53.222418026819753},{"$f":"(F141+H141-(D141+T141))*radconv","v":-37.403735558977317},null,{"$f":"SUM((U142<0)*(U141>0))*A141","v":0},0]
[8035.8,{"$f":"A142/1000","v":8.0358000000000001},1.1715408472987785,0.5479836181228156,1.0000127463315434,5.0489991392475685E-3,1,0,48472.288045066322,1.5707756964504174,1.7898317992866046,0.97796468180085461,1.0012323882413983,4.9621042317349186E-2,1,0,1,0,1.003911070253442,0.11629470781640162,13.448197599882199,-74.579703730220629,105.42029626977937,null,1000000000,64574081.640000001,null,9.0429005926965438,-36.808645530172129,null,53.194582572839394,-37.771058200048472,null,0,0]
[8128.3,8.1282999999999994,1.1752162289312704,0.55308640064810755,1.0000130414642914,5.1071171045614016E-3,1,0,49030.251986711366,1.5707759312236003,1.8040284687347674,0.98325662716323325,1.0012609055819126,5.0191276204199359E-2,1,0,{"$f":"IF(VOUT_setting=1,1,SQRT((1+Afbr-$Q$5*(A143)^2)^2+(A143*$Q$4)^2))","v":1},0,1.0040015457572367,0.11762889838558328,13.389174355013999,-74.674664519241603,105.3253354807584,null,1000000000,66069260.890000001,null,9.0118644416150016,-36.538124841749273,null,53.166595479052731,-38.136539677492337,null,0,0]
[8222.9500000000007,8.2229500000000009,1.1790085139689552,0.55827471764735948,1.0000133469532986,5.1665858841636143E-3,1,0,49601.184819975751,1.5707761659861639,1.8186065842912049,0.98858589719717993,1.0012904227542474,5.0774730358670632E-2,1,0,1,0,1.0040951921357346,0.11899394156775546,13.329476549104982,-74.774835319960715,105.22516468003928,null,1000000000,67616906.702500015,null,8.9809573275769701,-36.266223072102548,null,53.13780478718175,-38.508612247858174,null,0,0]
[8270.2750000000015,8.2702750000000016,1.1809165005589572,0.56085634545630592,1.0000135010240201,5.1963202602870323E-3,1,0,49886.651236608959,1.5707762813523729,1.82591477888232,0.99121858317114864,1.0013053091565138,5.1066444486654317E-2,1,0,1,0,1.0041424203567815,0.11967640255059789,13.299884092567476,-74.826028980749356,105.17397101925064,null,1000000000,68397448.575625017,null,8.9658170617477762,-36.132101875212278,null,53.123352596473438,-38.693927105537057,null,0,0]
[8317.6,8.3176000000000005,1.1828323323017289,0.56342962745215652,1.0000136559788864,5.2260546272218924E-3,1,0,50172.117653242807,1.5707763954057736,1.8332355280003834,0.99383026065916635,1.001320280764453,5.1358149916118818E-2,1,0,1,0,1.0041899185757721,0.12035882282530638,13.270458412214463,-74.877945253766114,105.12205474623389,null,1000000000,69182469.760000005,null,8.9508808161312334,-35.999183802295533,null,53.10886316173697,-38.878761451470602,null,0,0]
[8366.0499999999993,8.3660499999999995,1.1848017941671964,0.56605544198525959,1.0000138155332281,5.2564958237336515E-3,1,0,50464.370117816317,1.5707765108337,1.84074315376958,0.99648248361486236,1.001335696538318,5.1656780643457467E-2,1,0,1,0,1.004238825595885,0.12105742304396924,13.240502815680671,-74.931831748524814,105.06816825147519,null,1000000000,69990792.602499992,null,8.9357971694088203,-35.864339514294798,null,53.093991211925584,-39.067492234230023,null,0,0]
[8414.5,8.4145000000000003,1.1867793979788492,0.56867252339901686,1.0000139760142488,5.2869370105032877E-3,1,0,50756.622582390512,1.5707766249323774,{"$f":"SQRT(1+(A148/Zero2)^2)","v":1.8482636226089937},{"$f":"ATAN(A148/Zero2)","v":0.99911314149221431},1.0013512016088582,5.1955402149341641E-2,1,0,1,0,1.0042880155658316,0.12175598011501491,13.210715623426363,-74.986450384248869,105.01354961575113,null,1000000000,70803810.25,null,8.9209199351726092,-35.730730209758676,null,53.079081253907489,-39.255720174490193,null,0,0]
[8462.9500000000007,8.4629500000000011,1.1887651031023929,0.57128087951819229,1.000014137421948,5.3173781874743887E-3,1,0,51048.875046965361,1.5707767377246351,1.8557967783820688,1.0017224602731343,1.001366795971925,5.2254014380941897E-2,1,0,1,0,1.0043374884665595,0.12245449379525215,13.181093712490801,-75.041788645804928,104.95821135419507,null,1000000000,71621522.702500015,null,8.9062454752296176,-35.598342939158471,null,53.064133802914917,-39.443445706646472,null,0,0]
[8511.4,8.5114000000000001,1.1907588690086743,0.5738805185903616,1.0000142997563251,5.3478193545905403E-3,1,0,51341.127511540835,1.5707768492327836,1.8633424672158934,1.0043106634505974,1.0013824796233477,5.2552617285438682E-2,1,0,1,0,1.0043872442789097,0.12315296384160397,13.151634032897269,-75.097834184867978,104.90216581513202,null,1000000000,72443929.959999993,null,8.8917702274856314,-35.467164895541906,null,53.049149371065376,-39.630669289326072,null,0,0]
[8560.9500000000007,8.5609500000000001,1.192806196265108,0.57653017226817083,1.0000144667347877,5.3789516421839543E-3,1,0,51640.015222990725,1.5707769619671414,1.8710722770899784,1.0069360188917336,1.0013986117013189,5.2857989913860148E-2,1,0,1,0,1.0044384223374088,0.12386724644070959,13.121670200193256,-75.155871022958237,104.84412897704176,null,1000000000,73289864.902500018,null,8.8771687498321636,-35.334246130881489,null,53.03378701601482,-39.821624892076748,null,0,0]
[8610.5,8.6105,1.194861869081826,0.57917072735908381,1.0000146346824832,5.4100839193505041E-3,1,0,51938.902934441248,1.570777073404017,1.8788148771454705,1.0095397539655484,1.0014148371591425,5.3163352675135951E-2,1,0,1,0,1.0044898962588409,0.12458148288824292,13.091869822266135,-75.2146220228407,104.7853779771593,null,1000000000,74140710.25,null,8.8627683327004654,-35.202565482335473,null,53.018387055219407,-40.012056540505242,null,0,0]
[8660.0499999999993,8.66005,1.19692584445932,0.58180219401463973,1.0000148035994114,5.4412161860298456E-3,1,0,52237.790645892419,1.5707771835656807,1.8865701099072973,1.0121220997781157,1.0014311559922797,5.3468705512799135E-2,1,0,1,0,1.0045416660223709,0.12529567292456656,13.062229861650485,-75.2740745079211,104.7259254920789,null,1000000000,74996466.002499983,null,8.8485654010456667,-35.072109706541852,null,53.002950026258553,-40.201964801379241,null,0,0]
[8709.6,8.7096,1.1989980795210893,0.58442458282008858,1.0000149734855717,5.4723484421616382E-3,1,0,52536.678357344223,1.5707772924738979,1.8943378202242929,1.0146832847952632,1.0014475681961656,5.3774048370393818E-2,1,0,1,0,1.0045937316070499,0.12600981629017083,13.032747352891494,-75.334215977708851,104.66578402229115,null,1000000000,75857132.160000011,null,8.8345564553108229,-34.942865711385316,null,52.987476463234408,-40.391350266323542,null,0,{"$f":"IF(AH154>0,W154,0)","v":0}]
[8760.3250000000007,8.7603249999999999,1.2011279655359401,0.58709976563128197,1.0000151484042934,5.5042189395944404E-3,1,0,52842.653718866401,1.5707774026885226,1.902302494833819,1.0172835206105675,1.0014644663029666,5.4086621554857606E-2,1,0,1,0,1.0046473382495742,0.12674084582317724,13.002725787335134,-75.396484425370005,104.60351557462999,null,1000000000,76743294.105625018,null,8.820412673790921,-34.811798612371433,null,52.971598679197946,-40.584685812998593,null,0,0]
[8811.0499999999993,8.8110499999999998,1.2032664170797494,0.58976545876487607,1.0000153243387591,5.536089425845549E-3,1,0,53148.629080389204,1.5707775116341416,1.9102799240383457,1.0198620562964584,1.0014814622515369,5.4399184160620159E-2,1,0,1,0,1.0047012548646592,0.12747182589581199,12.972863163685425,-75.459448968333376,104.54055103166662,null,1000000000,77634602.102499992,null,8.8064649999693927,-34.681974160365634,null,52.955683729369767,-40.777474807967742,null,0,0]
[8861.7749999999996,8.8617749999999997,1.2054133885657456,0.59242167494245845,1.0000155012889678,5.5679599008502259E-3,1,0,53454.604441912641,1.570777619332546,1.9182699487118735,1.022419128507003,1.0014985560368954,5.4711736127149802E-2,1,0,1,0,1.0047554814294566,0.12820275623008265,12.943156523082425,-75.523096758069187,104.47690324193081,null,1000000000,78531056.15062499,null,8.7927099134003637,-34.553378793868994,null,52.939732175335799,-40.969717964200214,null,0,0]
[8912.5,8.9124999999999996,1.2075688345503768,0.59506842733023868,1.0000156792549189,5.5998303645437338E-3,1,0,53760.579803436689,1.5707777258050317,{"$f":"SQRT(1+(A158/Zero2)^2)","v":1.9262724121193997},{"$f":"ATAN(A158/Zero2)","v":1.0249549710957064},1.0015157476540324,5.5024277393927241E-2,1,0,1,0,1.0048100179209918,0.12893363654813988,12.91360297788675,-75.587415131963638,104.41258486803636,null,1000000000,79432656.25,null,8.7791439687389836,-34.425999111815294,null,52.923744574801503,-41.161416020148337,null,0,0]
[8964.4,8.9643999999999995,1.2097829335280632,0.59776670843978552,1.0000158623946025,5.6324390677161152E-3,1,0,54073.642815031169,1.5707778334967204,1.9344729588126377,1.0275278222812887,1.0015334387519077,5.5344047266686167E-2,1,0,1,0,1.0048661384569384,0.12968139500862558,12.883520367712173,-75.653904434525046,104.34609556547495,null,1000000000,80360467.359999999,null,8.7654560288436247,-34.296913231822465,null,52.907349904522292,-41.356991202702574,null,0,0]
[9016.2999999999993,9.0162999999999993,1.2120058083790211,0.6004551115178256,1.0000160465976302,5.66504775891012E-3,1,0,54386.705826626254,1.5707779399486101,1.9426862027136522,1.0300789353536666,1.001551232255729,5.5663805810112571E-2,1,0,1,0,1.0049225833952207,0.13042910052088058,12.853592132151812,-75.721069516531131,104.27893048346887,null,1000000000,81293665.689999983,null,8.7519590306605295,-34.169072133814076,null,52.890918667145016,-41.551997382717104,null,0,0]
[9068.2000000000007,9.0682000000000009,1.2142374109059193,0.60313365206051772,1.0000162318640011,5.6976564380564077E-3,1,0,54699.768838221971,1.5707780451819886,1.9509119834585817,1.0326085518639958,1.0015691281600383,5.5983552959424254E-2,1,0,1,0,1.0049793527108215,0.13117675278776691,12.823815397781001,-75.788897406471875,104.21110259352812,null,1000000000,82232251.24000001,null,8.738649516092682,-34.042461975436275,null,52.874451447342054,-41.746435431035614,null,0,0]
[9120.1,9.1201000000000008,1.2164776930765491,0.60580234601660898,1.000016418193715,5.7302651050856364E-3,1,0,55012.831849818278,1.5707781492176582,1.9591501431340683,1.0351169104103166,1.0015871264593466,5.6303288649852956E-2,1,0,1,0,1.0050364463785877,0.13192435151230694,12.794187361349415,-75.857375327951729,104.14262467204827,null,1000000000,83176224.010000005,null,8.7255241015206444,-33.917069083509283,null,52.857948825482509,-41.940306244442425,null,0,0]
[9173.2000000000007,9.1732000000000014,1.218778706751966,0.60852257025952483,1.0000166099321357,5.7636277171211779E-3,1,0,55333.133312550366,1.5707782544404105,1.9675914298915216,1.0376615105432279,1.0016056468721874,5.6630405146110709E-2,1,0,1,0,1.0050951957928527,0.13268918003331481,12.764025326526811,-75.928096181222656,104.07190381877734,null,1000000000,84147598.24000001,null,8.7122822906477886,-33.790022658664157,null,52.841028601532756,-42.138073522558479,null,0,0]
[9226.2999999999993,9.2262999999999984,1.2210887048989174,0.61123252250757543,1.0000168027836382,5.7969903163260107E-3,1,0,55653.434775283051,1.5707783584519885,1.9760453478887805,1.0401843542767155,1.0016242744580726,5.6957509510350564E-2,1,0,1,0,1.0051542846779162,0.13345395187899683,12.734013225736039,-75.999471031375293,104.00052896862471,null,1000000000,85124611.689999983,null,8.6992262566320075,-33.664222019176236,null,52.824072534757761,-42.33524901219905,null,0,0]
[9279.4,9.279399999999999,1.2234076366248519,0.61393222125624225,1.0000169967482222,5.8303529026258738E-3,1,0,55973.736238016339,1.5707784612731848,1.9845117357005548,1.0426856877434101,1.0016430092110231,5.7284601673252798E-2,1,0,1,0,1.0052137130063936,0.13421866673182239,12.704148272887434,-76.071486814792465,103.92851318520754,null,1000000000,86107264.359999999,null,8.6863526058664391,-33.539653059904168,null,52.807081232674733,-42.531833754888289,null,0,0]
[9332.5,9.3324999999999996,1.2257354512262686,0.61662168545916185,1.0000171918258869,5.8637154759465047E-3,1,0,56294.037700750217,1.5707785629243183,1.9929904344084479,1.0451657539734192,1.0016618511250257,5.7611681565513315E-2,1,0,1,0,1.0052734807507502,0.13498332427444015,12.674427750910526,-76.144130671852793,103.85586932814721,null,1000000000,87095556.25,null,8.6736580185157326,-33.416301853441823,null,52.790055298048529,-42.727828818410934,null,0,0]
[9386.85,9.3868500000000008,1.2281272100013081,0.61936388244875928,1.0000173926484672,5.897863407060183E-3,1,0,56621.879216750553,1.570778665777391,2.0016813115704206,1.0476824285182602,1.001681247555277,5.7946448298945567E-2,1,0,1,0,1.0053350069231257,0.13576592254923248,12.644154398807657,-76.219121816070412,103.78087818392959,null,1000000000,88112952.922499999,null,8.6608466407983489,-33.291293637465614,null,52.772593323663045,-42.927828178604777,null,0,0]
[9441.2000000000007,9.4412000000000003,1.2305281679155731,0.62209539897904631,1.0000175946371488,5.9320113244189319E-3,1,0,56949.720732751477,1.5707787674462785,2.0103847570228015,1.0501773281565716,1.0017007562383551,5.8281202030352905E-2,1,0,1,0,1.0053968886206497,0.13654846011165411,12.614026811116581,-76.294744334705953,103.70525566529405,null,1000000000,89136257.440000013,null,8.6482160472178187,-33.167532218924293,null,52.755096329552501,-43.127212115781674,null,0,0]
[9495.5499999999993,9.4955499999999997,1.2329382712273329,0.62481625680397346,1.0000177977919305,5.9661592279431205E-3,1,0,57277.562248752976,1.5707788679513148,2.0191006082366538,1.0526507036143724,1.001720377167701,5.8615942685472121E-2,1,0,1,0,1.0054591258133094,0.1373309366220003,12.584042287036784,-76.370985086077297,103.6290149139227,null,1000000000,90165469.80249998,null,8.6357629061354366,-33.045003229185241,null,52.737564946555082,-43.325981856892085,null,0,0]
[9549.9,9.5498999999999992,1.2353574664103339,0.62752647813930873,1.0000180021128118,6.0003071175531216E-3,1,0,57605.403764755058,1.5707789673123707,2.0278287052476269,1.0551028023636599,1.0017401103367192,5.8950670190057564E-2,1,0,1,0,1.0055217184709286,0.13811335174076741,12.554198193646897,-76.447831141390139,103.55216885860986,null,1000000000,91200590.00999999,null,8.6234839590283734,-32.923692486031968,null,52.719999800272255,-43.524138655358172,null,0,0]
[9605.5249999999996,9.6055250000000001,1.2378427723156236,0.63028928868210299,1.0000182124343222,6.0352560701195388E-3,1,0,57940.936135088952,1.5707790678400582,2.0367740710152642,1.0575906486648039,1.0017604226405563,5.9293236393442382E-2,1,0,1,0,1.0055861475329804,0.13891405766119616,12.523796718408144,-76.527093431905541,103.47290656809446,null,1000000000,92266110.52562499,null,8.6110940052260947,-32.800782750228741,null,52.701988278835785,-43.726310681676793,null,0,0]
[9661.15,9.6611499999999992,1.2403374889189804,0.63304100636218008,1.0000184239772838,6.0702050079425047E-3,1,0,58276.468505423429,1.5707791672101501,2.0457319328570787,1.0600567225291189,1.0017808524978105,5.9635788664750181E-2,1,0,1,0,1.0056509488688787,0.13971469855695087,12.493536969248085,-76.606963027576015,103.39303697242399,null,1000000000,93337819.32249999,null,8.598879834319245,-32.679119618592388,null,52.683942700582577,-43.92784340898362,null,0,0]
[9716.7749999999996,9.7167750000000002,1.2428415595510149,0.6357816564322164,1.0000186367416957,6.1051539309366562E-3,1,0,58612.000875758473,1.5707792654425268,2.054702127336093,1.0625012789194419,1.0018013999012894,5.9978326924444207E-2,1,0,1,0,1.0057161224457405,0.14051527406473091,12.46341633251963,-76.687426742750091,103.31257325724991,null,1000000000,94415716.40062499,null,8.5868381790385389,-32.55868847941035,null,52.665863719134826,-44.128738263339741,null,0,0]
[9772.4,9.7723999999999993,1.2453549277864921,0.63851126460720908,1.0000188507275571,6.1401028390166259E-3,1,0,58947.53324609407,1.570779362556616,2.0636844936339021,1.0649245693974674,1.0018220648437608,6.0320851093007381E-2,1,0,1,0,1.0057816682305043,0.14131578382146071,12.43343226119535,-76.768471613124518,103.23152838687548,null,1000000000,95499801.75999999,null,8.5749658444815502,-32.439474915816362,null,52.647751982367538,-44.328996697308142,null,0,0]
[9829.2999999999993,9.8292999999999999,1.2479354669587595,0.64129204192596967,1.0000190708820282,6.1758528076720351E-3,1,0,59290.756470761531,1.5707794607594541,2.0728851764210803,1.0673816610409739,1.0018433250580907,6.0671211715150469E-2,1,0,1,0,1.0058491014813142,0.14213457393389023,12.402899623709438,-76.851962143292923,103.14803785670708,null,1000000000,96615138.48999998,null,8.5629933098893254,-32.318773746193195,null,52.629191879473851,-44.533188397099735,null,0,0]
[9886.2000000000007,9.8862000000000005,1.2505256161997367,0.64406132122365189,1.0000192923145834,6.211602760541027E-3,1,0,59633.97969542956,1.5707795578318799,2.0820982631897587,1.0698170224856958,1.001864708246031,6.1021557424531955E-2,1,0,1,0,1.0059169241280379,0.14295329447871674,12.372504698094303,-76.936034029828136,103.06396597017186,null,1000000000,97736950.440000013,null,8.5511914083153613,-32.199316706043632,null,52.610598855432677,-44.736717323784468,null,0,0]
[9943.1,9.9431000000000012,1.2531253159187876,0.64681913145466341,1.000019515025222,6.2473526975322293E-3,1,0,59977.202920098141,1.5707796537933001,2.0913235900069793,1.0722309122225631,1.0018862143997076,6.1371888136105078E-2,1,0,1,0,1.0059851361347067,0.14377194506806087,12.342244962652597,-77.020674095276505,102.9793259047235,null,1000000000,98865237.610000014,null,8.5395569432494547,-32.081088981167426,null,52.591973585056877,-44.9395851141091,null,0,0]
[10000,10,1.2557345067999319,0.64956550203190777,1.0000197390139427,6.2831026185542743E-3,1,0,60320.426144767262,1.5707797486626791,2.1005609956037619,1.0746235852055221,1.0019078435112021,6.1722203764845128E-2,1,0,1,0,1.0060537374651568,0.14459052531429525,12.312117960818183,-77.105869391099148,102.89413060890085,null,1000000000,100000000,null,8.528086789584016,-31.964075959994478,null,52.573316736887897,-45.141793431104688,null,0,0]
[10058.25,10.058249999999999,1.2584153728855556,0.65236521372528711,1.0000199696409096,6.3197007196591536E-3,1,0,60671.792626964248,1.5707798446710506,2.1100299127789262,1.0770513110714144,1.0019301131514491,6.2080815211714442E-2,1,0,1,0,1.0061243696703848,0.14542845378944727,12.281411167169381,-77.193647880846882,102.80635211915312,null,1000000000,101168393.0625,null,8.5165115124752138,-31.845529937193835,null,52.554185220347904,-45.348117943653044,null,0,0]
[10116.5,10.1165,1.2611060609334284,0.65515300029799051,1.0000202016073234,6.356298803834334E-3,1,0,61023.159109161781,1.5707799395738047,2.119511154999921,1.0794573310447964,1.0019525116363455,6.2439410671297442E-2,1,0,1,0,1.0061954098152881,0.14626630772269167,12.250838471441647,-77.281981518223759,102.71801848177624,null,1000000000,102343572.25,null,8.5051020294660571,-31.728226591074769,null,52.535022007629323,-45.553754927149001,null,0,0]
[10174.75,10.17475,1.263806508209653,0.65792889472323568,1.0000204349131836,6.3928968709817905E-3,1,0,61374.525591359859,1.5707800333899309,2.1290045576028334,1.0818419074467254,1.0019750389572502,6.279799005244531E-2,1,0,1,0,1.0062668578604315,0.1471040866989797,12.220397438357214,-77.370857134657186,102.62914286534281,null,1000000000,103525537.5625,null,8.4938552083759298,-31.612150887613371,null,52.515827795635019,-45.758706247043847,null,0,0]
[10233,10.233000000000001,1.2665166522888023,0.66069293042662025,1.000020669558489,6.4294949210034922E-3,1,0,61725.892073558476,1.570780126137985,2.1385099586383634,1.0842052989187609,1.0019976951054737,6.3156553264033924E-2,1,0,1,0,1.0063387137661675,0.14794179030354493,12.190085696398651,-77.460261798306519,102.53973820169348,null,1000000000,104714289,null,8.4827679876252322,-31.497288003582014,null,52.496603274427152,-45.962973794724491,null,0,0]
[10292.5,10.2925,1.2692949005445064,0.66350407224585328,1.0000209106219691,6.466878319122603E-3,1,0,62084.798609023688,1.5707802197924992,2.1482315600366331,1.086597800363541,1.0020209704318324,6.3522794176654726E-2,1,0,1,0,1.0064125326857423,0.14879739213412654,12.159254569329736,-77.552118012487881,102.44788198751212,null,1000000000,105935556.25,null,8.4716045065538665,-31.381197192771094,null,52.476935628429608,-46.170920819716805,null,0,0]
[10352,10.352,1.272083135566233,0.66630291281335219,1.0000211530829963,6.5042616991663063E-3,1,0,62443.705144489446,1.5707803123704205,2.1579653472150833,1.0889687318915684,1.0020443801554204,6.3889018026182909E-2,1,0,1,0,1.006486777074171,0.14965291444954226,12.128553535683757,-77.644499687881989,102.35550031211801,null,1000000000,107163904,null,8.4606013092125441,-31.266341207828543,null,52.457237792124957,-46.378158480053436,null,0,0]
[10411.5,10.4115,1.274881291829175,0.66908948913380906,1.0000213969415694,6.5416450610301276E-3,1,0,62802.611679955735,1.5707804038902069,2.1677111560183753,1.0913183575950101,1.0020679242668185,6.4255224715581982E-2,1,0,1,0,1.0065614468885087,0.15050835680866903,12.097980262385548,-77.737393783564158,102.26260621643584,null,1000000000,108399332.25,null,8.449755349078794,-31.152704912885572,null,52.437510478960483,-46.584688870678576,null,0,0]
[10471,10.471,1.2776893041503909,0.67186383865018784,1.0000216421976877,6.5790284046095939E-3,1,0,63161.51821542254,1.5707804943698964,2.1774688250291079,1.093646937782,1.0020916027565547,6.462141414784292E-2,1,0,1,0,1.0066365420855796,0.15136371877069754,12.067532478117402,-77.830787500525474,102.16921249947453,null,1000000000,109641841,null,8.4390636487577844,-31.040273388859973,null,52.417754395013354,-46.790514111665509,null,0,0]
[10532,10.532,1.2805782707208664,0.67469547634853033,1.0000218950875697,6.6173541663311951E-3,1,0,63529.472814809204,1.5707805860692816,2.1874846320152783,1.0960126422051233,1.0021160176756083,6.499681722973516E-2,1,0,1,0,1.0067139719972469,0.15224056055566335,12.03644506236061,-77.927041206222583,102.07295879377742,null,1000000000,110923024,null,8.4282595059589287,-30.926242775905667,null,52.397471122055414,-47.000798430316934,null,0,0]
[10593,10.593,1.2834774589165321,0.67751434405185962,1.0000221494463468,6.6556799086125353E-3,1,0,63897.427414196398,1.5707806767125614,2.1975125697485427,1.0983567687481273,1.0021405738134481,6.5372201967008853E-2,1,0,1,0,1.006791848917217,0.15311731690150787,12.005484899247811,-78.023793560796477,101.97620643920352,null,1000000000,112211649,null,8.4176113761999058,-30.813447372834837,null,52.377159088701639,-47.210346187961662,null,0,0]
[10654,10.654,1.2863867996265712,0.68032048345479312,1.0000224052740185,6.6940056313410396E-3,1,0,64265.382013584116,1.5707807663178761,2.2075524729149976,1.100679585879879,1.0021652711596929,6.574756825522271E-2,1,0,1,0,1.0068701727982092,0.15399398733427372,11.974649731880923,-78.121031538945772,101.87896846105423,null,1000000000,113507716,null,8.4071162657150396,-30.701871792569779,null,52.356819031819626,-47.419159746375975,null,0,0]
[10715,10.715,1.289306224123038,0.68311393667809606,1.0000226625705833,6.7323313344041322E-3,1,0,64633.336612972336,1.5707808549029529,2.2176041789990046,1.1029813581302177,1.0021901097039034,6.6122915989966502E-2,1,0,1,0,1.0069489435926882,0.15487057138035734,11.943937363947351,-78.218742365473517,101.78125763452648,null,1000000000,114811225,null,8.3967712493546003,-30.591500873700578,null,52.336451680246483,-47.627241491772921,null,0,0]
[10777.5,10.7775,1.2923078250604434,0.68596296790471434,1.0000229277176294,6.7715994522740105E-3,1,0,65010.339276280458,1.5707809446262881,2.2279151329687483,1.1053181763823487,1.0022157054697864,6.650747423446346E-2,1,0,1,0,1.0070301148570613,0.1557686206777745,11.912594905093281,-78.319333249506798,101.6806667504932,null,1000000000,116154506.25,null,8.3863245345808171,-30.479649755391591,null,52.315555936166199,-47.839683494115206,null,0,0]
[10840,10.84,1.2953198669691466,0.68879877220358665,1.0000231944066951,6.8108675492601686E-3,1,0,65387.341939589111,1.570781033314991,2.2382381408285701,1.1076334518395932,1.0022414494407996,6.6892012779994597E-2,1,0,1,0,1.007111755182662,0.1566665782823054,11.881376878567737,-78.420394157264269,101.57960584273573,null,1000000000,117505600,null,8.3760293823415193,-30.369031760362255,null,52.294633061879949,-48.051362396902,null,0,0]
[10902.5,10.9025,1.2983422771826958,0.69162139617927065,1.0000234626377791,6.8501356252415237E-3,1,0,65764.344602898273,1.5707811209868547,2.2485730365633181,1.1099274565528143,1.0022673416055223,6.7276531514358917E-2,1,0,1,0,1.007193864517532,0.15756444368571021,11.850281108376009,-78.521912137101836,101.47808786289816,null,1000000000,118864506.25,null,8.3658828587207807,-30.259631295837114,null,52.273683815308956,-48.262280841264719,null,0,0]
[10965,10.965,1.3013749834607222,0.69443088684420595,1.0000237324108803,6.8894036800969897E-3,1,0,66141.3472662079,1.5707812076592671,2.2589196570065746,1.1122004584926408,1.0022933819524702,6.7661030325390378E-2,1,0,1,0,1.0072764428094332,0.15846221638014715,11.81930547768949,-78.623874494527186,101.37612550547281,null,1000000000,120231225,null,8.3558820976679975,-30.151433002799706,null,52.252708945675231,-48.47244149172748,null,0,0]
[11028.75,11.02875,1.304478876396667,0.69728308655019933,1.0000240091680284,6.9294570741601051E-3,1,0,66525.889982784269,1.5707812950531146,2.2694851223488373,1.1144975571322289,1.0023200957517073,6.8053198471337895E-2,1,0,1,0,1.0073611557322415,0.15937784849344458,11.787831966621203,-78.728320995119262,101.27167900488074,null,1000000000,121633326.5625,null,8.3458285825343488,-30.042293532422242,null,52.231288949740595,-48.686027462697005,null,0,0]
[11092.5,11.092499999999999,1.3075933308940335,0.70012172239344284,1.0000242875294882,6.9695104459893756E-3,1,0,66910.432699361132,1.5707813814424352,2.2800624519771815,1.1167733549650072,1.0023469636953897,6.8445345653432965E-2,1,0,1,0,1.0074463564472769,0.16029338308632063,11.756479180411565,-78.833203945022703,101.1667960549773,null,1000000000,123043556.25,null,8.3359209033805097,-29.934373249681173,null,52.209843842684791,-48.898830695341523,null,0,0]
[11156.25,11.15625,1.3107182716654719,0.70294684547908926,1.000024567495259,7.0095637954563066E-3,1,0,67294.975415938461,1.5707814668444493,2.2906514815377603,1.119028123655303,1.002373985771122,6.8837471752757895E-2,1,0,1,0,1.0075320448982086,0.16120881962114234,11.725245051646274,-78.938510670504115,101.06148932949588,null,1000000000,124461914.0625,null,8.3261562254076118,-29.827656583530242,null,52.188374391892395,-49.110854086973859,null,0,0]
[11220,11.22,1.313853623887614,0.70575850728970879,1.0000248490653389,7.0496171224324047E-3,1,0,67679.518132516299,1.570781551275986,2.3012520495216373,1.121262130725434,1.0024011619664395,6.9229576650433708E-2,1,0,1,0,1.0076182210284059,0.1621241575607166,11.694127569557121,-79.044228756779177,100.95577124322082,null,1000000000,125888400,null,8.3165317796882778,-29.722128200222709,null,52.166881355522577,-49.322100556556478,null,0,0]
[11285.5,11.285500000000001,1.3170858105282923,0.70863338583423774,1.0000251400357658,7.0907699289415073E-3,1,0,68074.616923667345,1.5707816370317333,2.3121554645623044,1.1235361160231454,1.0024292446855407,6.9632423004410221E-2,1,0,1,0,1.0077072706619452,0.16306451916775461,11.662275320432895,-79.153264582373126,100.84673541762687,null,1000000000,127362510.25,null,8.3067863503080073,-29.614924749184041,null,52.144774535778623,-49.538339833189113,null,0,0]
[11351,11.351000000000001,1.3203288294379063,0.7114941652543656,1.0000254326997877,7.1319227114330251E-3,1,0,68469.7157148189,1.5707817217977882,2.323070723510646,1.1257887436292102,1.0024574900749275,7.0035246722439978E-2,1,0,1,0,1.0077968349946116,0.16400477554386278,11.630542082739128,-79.262708911674579,100.73729108832542,null,1000000000,128845201,null,8.2971832376296746,-29.508943650088817,null,52.122644410763186,-49.753765261585755,null,0,0]
[11416.5,11.416499999999999,1.3235826009933516,0.71434090253252547,1.0000257270574033,7.1730754697675904E-3,1,0,68864.81450597095,1.5707818055911846,2.3339976601977108,1.1280202904879533,1.0024858981208498,7.0438047675711934E-2,1,0,1,0,1.0078869139639917,0.16494492610784792,11.598925851141166,-79.372549102099171,100.62745089790083,null,1000000000,130336472.25,null,8.2877196440735403,-29.404169028791749,null,52.100491772721362,-49.968380073307408,null,0,0]
[11482,11.481999999999999,1.3268470460898383,0.7171736550035136,1.0000260231086109,7.2142282038058373E-3,1,0,69259.91329712345,1.5707818884285685,2.3449361113756724,1.1302310292243627,1.0025144688094798,7.0840825735459106E-2,1,0,1,0,1.0079775075073398,0.16588497027901683,11.567424676024414,-79.482772778740141,100.51722722125986,null,1000000000,131836324,null,8.2783928378191014,-29.300585258607502,null,52.078317403859053,-50.182187520132636,null,0,0]
[11548.75,11.54875,1.3301846894197276,0.720046139664966,1.0000263265520304,7.2561662702233546E-3,1,0,69662.552141542721,1.5707819718801068,2.3560949917802922,1.1324628279127675,1.0025437520539902,7.1251266713084183E-2,1,0,1,0,1.008070359267635,0.16684284416595893,11.535438742100757,-79.595481955116782,100.40451804488322,null,1000000000,133373626.5625,null,8.2690260050964213,-29.196233930097915,null,52.055698302658072,-50.399248025018856,null,0,0]
[11615.5,11.615500000000001,1.3335332533338522,0.72290422192577986,1.0000266317542965,7.2981043111161291E-3,1,0,70065.190985962472,1.5707820543725146,2.3672654970458038,1.1346735749805206,1.002573204178939,7.1661683645179497E-2,1,0,1,0,1.0081637452969077,0.16780060634449084,11.503568379192149,-79.708564272118153,100.29143572788185,null,1000000000,134919840.25,null,8.2597957028844444,-29.093087337943459,null,52.033058241961434,-50.615476934174715,null,0,0]
[11682.25,11.68225,{"$f":"SQRT(1+(A205/pole1)^2)","v":1.3368926557726544},{"$f":"ATAN(A205/pole1)","v":0.7257479634903774},{"$f":"SQRT(1+(A205/Zero1)^2)","v":1.0000269387154077},{"$f":"ATAN(A205/Zero1)","v":7.3400423263366614E-3},{"$f":"IF(VIN_nom>Vout, 1, SQRT(1+(A205/z_RHP)^2))","v":1},{"$f":"IF(VIN_nom>Vout, 0, -ATAN(A205/z_RHP))","v":0},{"$f":"SQRT(1+(A205/Pole2)^2)","v":70467.829830382689},{"$f":"ATAN(A205/Pole2)","v":1.5707821359222325},2.3784474633818773,1.1368635455790916,{"$f":"SQRT(1+(A205/pole4)^2)","v":1.0026028251694437},{"$f":"ATAN(A205/pole4)","v":7.2072076395607296E-2},{"$f":"IF(VOUT_setting=1,1,SQRT(1+(A205*zterm1)^2))","v":1},{"$f":"IF(VOUT_setting=1,0,ATAN(((A205*zterm1))))","v":0},1,{"$f":"IF(VOUT_setting=1,0,ATAN(A205*$Q$4/(1+Afbr-$Q$5*(A205)^2)))","v":0},{"$f":"SQRT((1-(Z205/pterm2))^2+(A205/pterm1)^2)","v":1.0082576655276863},{"$f":"IF((ATAN((A205/pterm1)/(1-A205^2/pterm2))>0),ATAN((A205/pterm1)/(1-A205^2/pterm2)),PI()+ATAN((A205/pterm1)/(1-A205^2/pterm2)))","v":0.16875825620165366},{"$f":"20*LOG10(((E205*K205*G205*O205)/(C205*I205*S205*M205*Q205))*Adc)","v":11.471811691605179},{"$f":"((F205+L205+H205+P205)-(D205+J205+T205+N205+R205))*radconv","v":-79.822007458159675},{"$f":"IF(V205>0,V205,V205+180)","v":100.17799254184033},null,{"$f":"IF(U205<0,A205,1000000000)","v":1000000000},{"$f":"A205^2","v":136474965.0625},null,{"$f":"20*LOG10((K205/(I205*M205))*AEA)","v":8.2506992393975622},{"$f":"(L205-(J205+N205))*radconv","v":-28.991129710268023},null,{"$f":"20*LOG10((E205*G205/(C205*S205))*Acs*Am)","v":52.010398017861348},{"$f":"(F205+H205-(D205+T205))*radconv","v":-50.830877747891648},null,{"$f":"SUM((U206<0)*(U205>0))*A205","v":0},0]
[11749,{"$f":"A206/1000","v":11.749000000000001},1.3402628152350333,0.72857742637330825,1.0000272474353622,7.3819803157374559E-3,1,0,70870.468674803371,1.5707822165453282,2.3896407298974216,1.1390330105097157,1.0026326150105376,7.2482444828278453E-2,1,0,1,0,1.0083521198921406,0.16971579312503854,11.440166836583462,-79.935799508688703,100.0642004913113,null,1000000000,138039001,null,8.2417339863259365,-28.89034552442703,null,51.98771841591126,-51.04545398426167,null,0,0]
[11817.5,11.817500000000001,1.3437324298018303,0.73146629016867715,1.0000275660777125,7.4250177759890264E-3,1,0,71283.663593797348,1.5707822983352242,2.4011390355521671,1.1412383131716282,1.0026633613917268,7.2903546558800658E-2,1,0,{"$f":"IF(VOUT_setting=1,1,SQRT((1+Afbr-$Q$5*(A207)^2)^2+(A207*$Q$4)^2))","v":1},0,1.0084496058392336,0.17069831595721754,11.407806731595656,-80.052925261654906,99.947074738345094,null,1000000000,139653306.25,null,8.2326674133450357,-28.7881230273541,null,51.964424883904357,-51.264802234300809,null,0,0]
[11886,11.885999999999999,1.3472132007169666,0.7343402500331786,1.0000278865723358,7.4680552087345326E-3,1,0,71696.85851279179,1.5707823791823963,2.4126489074698561,1.1434225849756434,1.0026942855609464,7.3324622389527278E-2,1,0,1,0,1.0085476541482539,0.17168071855137285,11.375560631755571,-80.170393636163311,99.829606363836689,null,1000000000,141276996,null,8.2237336102369003,-28.68710397171651,null,51.941112587172412,-51.483289664446801,null,0,0]
[11954.5,11.954499999999999,1.3507050417306161,0.73719937389651002,1.0000282089192301,7.5110926138145699E-3,1,0,72110.053431786713,1.5707824591030501,2.4241701809019065,1.1455861047876303,1.002725387501747,7.3745672173543941E-2,1,0,1,0,1.0086462647447254,0.17266300024747988,11.343426708634075,-80.288192501164986,99.711807498835014,null,1000000000,142910070.25,null,8.2149299337072286,-28.587272372187861,null,51.917782340580587,-51.700920128977117,null,0,0]
[12023,12.023,1.3542078672096414,0.74004372995909118,1.0000285331183936,7.5541299910697373E-3,1,0,72523.248350782073,1.5707825381130218,2.4357026940552218,1.1477291469769328,1.0027566671975874,7.4166695763991361E-2,1,0,1,0,1.0087454375537794,0.1736451603861362,11.311403185414157,-80.406309998771746,99.593690001228254,null,1000000000,144552529,null,8.2062538034135066,-28.488612501055613,null,51.894434947654389,-51.917697497716119,null,0,0]
[12093,12.093,1.3577986563308775,0.74293518601173125,1.0000288663303611,7.5981097637329844E-3,1,0,72945.491333697515,1.5707826179284301,2.4474991902577603,1.1498982428375615,1.002788815469287,7.4596911636130303E-2,1,0,1,0,1.0088473627660752,0.17464870141621794,11.278790673069732,-80.527331126274007,99.472668873725993,null,1000000000,146240649,null,8.1975168300195449,-28.388986589607594,null,51.870559408703926,-52.138344536666423,null,0,0]
[12163,12.163,1.3614007374143151,0.74581136520648561,1.0000292014766041,7.6420895070028472E-3,1,0,73367.734316613423,1.5707826968251375,2.4593070913843906,1.1520465197122791,1.0028211493309334,7.5027099845072304E-2,1,0,1,0,1.0089498749236547,0.17565211411660375,11.246289854832103,-80.648660805634066,99.351339194365934,null,1000000000,147938569,null,8.1889077954737015,-28.290551880565268,null,51.846667625012131,-52.358108925068805,null,0,0]
[12233,12.233000000000001,1.3650140210662303,0.74867234108582614,1.0000295385571196,7.6860692207092246E-3,1,0,73789.977299529768,1.5707827748189152,2.4711262339450295,1.1541742563540287,1.0028536687645748,7.545726023427797E-2,1,0,1,0,1.0090529739453509,0.17665539778565156,11.213898991089287,-80.770287230901147,99.229712769098853,null,1000000000,149646289,null,8.1804241387896486,-28.193292394496019,null,51.822760417953376,-52.576994836405127,null,0,0]
[12303,12.303000000000001,1.3686384185603628,0.75151818741235743,1.0000298775719065,7.7300489046820114E-3,1,0,74212.220282446564,1.5707828519251754,2.4829564574083389,1.1562817269547254,1.0028863737521594,7.5887392647269292E-2,1,0,1,0,1.0091566597495694,0.1776585517224116,11.181616391598313,-80.892198870087441,99.107801129912559,null,1000000000,151363809,null,8.1720633603085098,-28.09719241327786,null,51.79883859694354,-52.795006456809624,null,0,0]
[12374.5,12.374499999999999,1.3723518637828285,0.75440947373237444,1.0000302258481819,7.7749709795812139E-3,1,0,74643.511329283458,1.5707829297831239,{"$f":"SQRT(1+(A215/Zero2)^2)","v":2.4950514613936705},{"$f":"ATAN(A215/Zero2)","v":1.1584137159465977},1.0029199711028107,7.6326713138890348E-2,1,0,1,0,1.0092631730852772,0.17868306715483639,11.148752083649399,-81.017005638508948,98.982994361491052,null,1000000000,153128250.25,null,8.1636477416625244,-28.000214112919753,null,51.774389907640604,-53.016791525589198,null,0,0]
[12446,12.446,1.3760767192578316,0.75728513133330011,1.0000305761425097,7.819893023100136E-3,1,0,75074.802376120788,1.5707830067465132,2.5071576968769982,1.1605251251188407,1.0029537620065279,7.676600411265716E-2,1,0,1,0,1.0093702984473316,0.17970744575937364,11.115997315536791,-81.142086503730042,98.857913496269958,null,1000000000,154902916,null,8.1553552404707208,-27.904413206867968,null,51.749927640719804,-53.237673296862091,null,0,0]
[12517.5,12.5175,1.3798128925781907,0.76014523941809653,1.0000309284548878,7.8648150350575045E-3,1,0,75506.093422958569,1.5707830828306721,2.5192750019413155,1.1626162324659282,1.0029877464437484,7.7205265402016027E-2,1,0,1,0,1.0094780357474054,0.18073168679129847,11.083350435332555,-81.267430024512436,98.732569975487564,null,1000000000,156687806.25,null,8.1471833801831561,-27.809773758547852,null,51.725452620803132,-53.457656265964566,null,0,0]
[12589,12.589,1.3835602920556052,0.76298987735310986,1.0000312827853142,7.9097370152720493E-3,1,0,75937.384469796787,1.5707831580505818,2.5314032176232244,1.1646873113722465,1.0030219243948004,7.7644496840481581E-2,1,0,1,0,1.0095863848967102,0.18175578950665441,11.050809838154141,-81.393025033145392,98.606974966854608,null,1000000000,158482921,null,8.1391297438436077,-27.716280095507305,null,51.700965659964268,-53.676744937638098,null,0,{"$f":"IF(AH218>0,W218,0)","v":0}]
[12662.25,12.66225,1.3874109576654927,0.76588817967807354,1.000031647880903,7.9557584514055955E-3,1,0,76379.231591208387,1.5707832342306067,2.5438394290428636,1.1667885923286181,1.0030571395247714,7.8094447569027073E-2,1,0,1,0,1.0096980203504513,0.18280481346005678,11.017581379639898,-81.521943447503688,98.478056552496312,null,1000000000,160332575.0625,null,8.1309991243376558,-27.621670207556289,null,51.675867820955972,-53.900273239947396,null,0,0]
[12735.5,12.7355,1.3912732131746477,0.76877041439023919,1.0000320150945299,8.0017798538383009E-3,1,0,76821.078712620452,1.5707833095343116,2.5562867631692039,1.1688694188520317,1.0030925577150529,7.8544366614039657E-2,1,0,1,0,1.0098102977804753,0.18385369066502807,10.98446120518452,-81.65110293646589,98.34889706353411,null,1000000000,162192960.25,null,8.122987635855841,-27.528230406745294,null,51.650759134982415,-54.122872529720617,null,0,0]
[12808.75,12.80875,1.3951469623283703,0.77163666724314206,1.0000323844261925,8.0478012223752574E-3,1,0,77262.925834032925,1.5707833839767309,2.5687450583107903,1.1709300704003116,1.0031281789441364,7.8994253796733416E-2,1,0,1,0,1.0099232170898114,0.18490242032417084,10.951447732791944,-81.780492346535198,98.219507653464802,null,1000000000,164064076.5625,null,8.1150928634063018,-27.435944671938124,null,51.625640435039372,-54.344547674597074,null,0,0]
[12882,12.882,1.399032109653167,0.77448702409236592,1.0000327558758886,8.0938225568215564E-3,1,0,77704.772955445835,1.5707834575725568,2.58121415575678,1.1729708217238575,1.003164003190393,7.9444108938399316E-2,1,0,1,0,1.010036778180984,0.18595100164095044,10.918539425738063,-81.910100799811445,98.089899200188555,null,1000000000,165945924,null,8.1073124505519516,-27.344797251698985,null,51.600512540839844,-54.565303548112468,null,0,0]
[12957.25,12.95725,1.4030351058240289,0.77739874373066919,1.0000331396731215,8.1411004107702079E-3,1,0,78158.684162085454,1.5707835323113308,2.5940347914315858,1.1750468543753521,1.0032010169577548,7.9906213261370346E-2,1,0,1,0,1.0101541081189627,0.18702805785513305,10.884840541492959,-82.043465000794569,97.956534999205431,null,1000000000,167890327.5625,null,8.0994362731422083,-27.252330252148646,null,51.574689834004488,-54.791134748645959,null,0,0]
[13032.5,13.032500000000001,1.4070499293419543,0.78029387141443651,1.0000335257056223,8.1883782283241804E-3,1,0,78612.595368725524,1.5707836061870177,2.6068664971713602,1.1771024582193856,1.0032382449332342,8.0368283387645914E-2,1,0,1,0,1.0102721151531453,0.18810495581437103,10.851249496232247,-82.177037963224478,97.822962036775522,null,1000000000,169846056.25,null,8.0916759265890796,-27.161031728270071,null,51.548859135296901,-55.016006234954425,null,0,0]
[13107.75,13.107749999999999,1.4110764792527211,0.78317250044085884,1.0000339139733885,8.2356560092721673E-3,1,0,79066.506575366002,1.5707836792144818,2.6197091103078773,1.1791379162000433,1.003275687092986,8.0830319123731717E-2,1,0,1,0,1.0103907991761936,0.18918169465795942,10.817764763278861,-82.310808761597031,97.689191238402969,null,1000000000,171813110.0625,null,8.0840290383803044,-27.070885458326565,null,51.523021290552293,-55.239923303270487,null,0,0]
[13183,13.183,1.4151146554579288,0.78603472414056375,1.0000343044764173,8.2829337534028637E-3,1,0,79520.417782006902,1.5707837514082486,2.6325624712101989,1.1811535064103522,1.003313343413031,8.1292320276220978E-2,1,0,1,0,1.0105101600802109,0.19025827352617278,10.78438485989243,-82.444766750310919,97.555233249689081,null,1000000000,173791489,null,8.0764932941097882,-26.981875498512231,null,51.497177131436374,-55.462891251798681,null,0,0]
[13259.75,13.25975,1.4192452001956148,0.78893719981613497,1.0000347050660985,8.3311538728932568E-3,1,0,79983.377052567987,1.5707838241970209,2.6456829541161522,1.1831890921383448,1.0033519709386969,8.1763494929020478E-2,1,0,1,0,1.0106325974133012,0.19135614675733531,10.750446067904436,-82.581577068525817,97.418422931474183,null,1000000000,175820970.0625,null,8.0689194838373961,-26.892245516867177,null,51.470812149720771,-55.689331551658626,null,0,0]
[13336.5,13.336499999999999,1.4233876317225052,0.79182280575174246,1.0000351079810386,8.379373953639923E-3,1,0,80446.336323129479,1.5707838961480116,2.6588142914768338,1.1852045794700112,1.0033908211968929,8.2234633199614909E-2,1,0,1,0,1.0107557386531167,0.19245385176842231,10.716613343981651,-82.718560606495302,97.281439393504698,null,1000000000,177862232.25,null,8.061456607026166,-26.803764955959753,null,51.444442302609225,-55.914795650535545,null,0,0]
[13413.25,13.41325,1.4275418465595837,0.79469164095805533,1.0000355132212346,8.4275939954186647E-3,1,0,80909.295593691379,1.5707839672756017,2.6719563232594985,1.1872002484712447,1.0034298941617483,8.2705734883084053E-2,1,0,1,0,1.010879583683391,0.19355138765044438,10.68288524669015,-82.855706927533703,97.144293072466297,null,1000000000,179915275.5625,null,8.054102384365633,-26.716417758279182,null,51.418068427978255,-56.139289169254511,null,0,0]
[13490,13.49,1.4317077421361952,0.79754380440246764,1.0000359207866838,8.4758139980052952E-3,1,0,81372.2548642537,1.5707840375938453,2.6851088924353972,1.1891763743586679,1.0034691898072483,8.3176799774604446E-2,1,0,1,0,1.0110041323872589,0.1946487534954929,10.649260375933121,-82.99300587036727,97.00699412963273,null,1000000000,181980100,null,8.0468545925216652,-26.630188144144256,null,51.391691349065184,-56.362817726223007,null,0,0]
[13568.5,13.5685,1.4359806028751989,0.80044385767815796,1.000036340050539,8.5251334387018343E-3,1,0,81845.770209389506,1.5707841086925138,2.6985720972608647,1.1911776237670113,1.003509611772041,8.3658567286157018E-2,1,0,1,0,1.0111322487649401,0.19577096386963244,10.61497418070255,-83.133582979873168,96.866417020126832,null,1000000000,184104192.25,null,8.0395493797598832,-26.54313231796576,null,51.364710366596398,-56.590450661907397,null,0,0]
[13647,13.647,1.4402654689374119,0.80332667945511838,1.0000367617468879,8.5744528379242107E-3,1,0,82319.285554525719,1.5707841789732375,2.7120460025358235,1.1931589959511117,1.0035502666325549,8.4140295875709689E-2,1,0,1,0,1.0112611010221901,0.19689299444652567,10.580793136617533,-83.274299102106681,96.725700897893319,null,1000000000,186240609,null,8.0323509742909867,-26.457213095915016,null,51.33772772798028,-56.817086006191651,null,0,0]
[13725.5,13.7255,1.44456223349213,0.80619237536586486,1.0000371858757273,8.6237721954325504E-3,1,0,82792.800899662325,1.5707842484500507,2.7255304495643702,1.1951207702627111,1.0035911543604865,8.4621985324423971E-2,1,0,1,0,1.0113906890320277,0.19801484425827404,10.546715870675277,-83.415144216512147,96.584855783487853,null,1000000000,188389350.25,null,8.0252571686489684,-26.372414460581773,null,51.31074426768005,-57.042729755930367,null,0,0]
[13804,13.804,1.448870790681013,0.80904105091675926,1.000037612437054,8.673091510986974E-3,1,0,83266.316244799338,1.5707843171366684,2.7390252826527468,1.1970632211580894,1.0036322749273752,8.5103635413569675E-2,1,0,1,0,1.0115210126668206,0.19913651233818419,10.512741049127097,-83.556108575852065,96.443891424147935,null,1000000000,190550416,null,8.01826580986992,-26.288720675033016,null,51.283760804910912,-57.267387900819081,null,0,0]
[13884.25,13.88425,1.4532874791866071,0.81193574795180956,1.0000380510221394,8.723510258111862E-3,1,0,83750.387664509879,1.5707843865516582,2.7528315328523516,1.199029281503478,1.0036745528478273,8.5595982011906907E-2,1,0,1,0,1.0116550018786545,0.20028299689802179,10.478113373370059,-83.700328843500841,96.299671156499159,null,1000000000,192772398.0625,null,8.0112223042551793,-26.204287074206036,null,51.256176634768607,-57.496041769294791,null,0,0]
[13964.5,13.964499999999999,1.4577162713300245,0.81481287980083605,1.0000384921493695,8.7739289608844643E-3,1,0,84234.459084220798,1.5707844551688317,2.7666483176044729,1.2009757120960634,1.0037170740436527,8.6088287014299519E-2,1,0,1,0,1.0117897596077763,0.20142928949381703,10.443590061340306,-83.844653976940819,96.155346023059181,null,1000000000,195007260.25,null,8.0042814814911907,-26.120975746385266,null,51.228594145502846,-57.723678230555556,null,0,0]
[14044.75,14.044750000000001,1.4621570571275389,0.81767255865818012,1.0000389358187407,8.8243476190485066E-3,1,0,84718.53050393211,1.5707845230018649,2.7804754798636968,1.2029027909297521,1.0037598384839344,8.6580550187414784E-2,1,0,1,0,1.0119252857157253,0.20257538909671538,10.409169806519639,-83.989074405036988,96.010925594963012,null,1000000000,197255002.5625,null,7.9974412079751769,-26.038770751107712,null,51.201014164198199,-57.950303653929303,null,0,0]
[14125,14.125,1.4666097276314609,0.82051489650300224,1.0000393820302496,8.8747662323477167E-3,1,0,85202.60192364383,1.5707845900641226,2.794312865576261,1.2048107910731076,1.0038028461375841,8.7072771298040683E-2,1,0,1,0,1.0120615800633368,0.20372129467920319,10.374851339513809,-84.133580826592635,95.866419173407365,null,1000000000,199515625,null,7.9906994030289988,-25.957656430100826,null,51.173437502138547,-58.175924396491816,null,0,0]
[14207.25,14.20725,1.4711855878922206,0.82341019368787594,1.0000398420002514,8.9264413374720315E-3,1,0,85698.737428582375,1.5707846580115512,2.8085055589562096,1.2067468254211118,1.0038471779813485,8.7577215709587902E-2,1,0,1,0,1.0122020682059469,0.20489555624882219,10.339781917691294,-84.281768434193907,95.718231565806093,null,1000000000,201845952.5625,null,7.9838896352946236,-25.875636261755616,null,51.145177848050409,-58.406132172438284,null,0,0]
[14289.5,14.2895,1.4757737041896442,0.82628751216171459,1.0000403046406738,8.9781163949222767E-3,1,0,86194.872933521343,1.5707847251767726,2.8227086733756703,1.2086633836795673,1.0038917652456474,8.8081615440271613E-2,1,0,1,0,1.012343363059419,0.20606961182543473,10.304816834235416,-84.430027430623966,95.569972569376034,null,1000000000,204189810.25,null,7.9771790434651475,-25.794729386302151,null,51.116923356423996,-58.635298044321836,null,0,0]
[14371.75,14.37175,1.4803739625684995,0.82914697166670426,1.000040769951513,9.0297914044225411E-3,1,0,86691.00843846066,1.5707847915732163,2.8369220523151375,1.2105607443958613,1.0039366078964493,8.8585970239404288E-2,1,0,1,0,1.012485464471627,0.20724346030719934,10.269954835355325,-84.57834864030616,95.42165135969384,null,1000000000,206547198.0625,null,7.9705655505506465,-25.714919830556855,null,51.088674850458411,-58.863428809749273,null,0,0]
[14454,14.454000000000001,1.4849862501859039,0.83198869163145106,1.000041237932765,9.081466365696917E-3,1,0,87187.143943400384,1.5707848572140066,2.8511455422641991,1.2124391811179558,1.0039817058995339,8.9090279856434557E-2,1,0,1,0,1.0126283722896745,0.20841710059378171,10.235194702653036,-84.72672315621945,95.27327684378055,null,1000000000,208918116,null,7.9640471314435821,-25.636191907772435,null,51.060433136863196,-59.090531248447007,null,0,0]
[14622.5,14.6225,1.494472225974232,0.83775543585503498,1.0000422049932871,9.1873292045103888E-3,1,0,88203.543123733951,1.5707849893818562,2.8803151849486226,1.2162294388471584,1.0040748923811245,9.0123282637982305E-2,1,0,1,0,1.0129236554160022,0.21082080312489335,10.164297124187481,-85.030818279593817,94.969181720406183,null,1000000000,213817506.25,null,7.9509819128724661,-25.478220408709706,null,51.002600776968748,-59.552597870884121,null,0,0]
[14706.75,14.70675,1.4992336740117373,0.84061139493812009,1.0000426927263222,9.2402605468419729E-3,1,0,88711.742713901316,1.5707850543300637,2.8949152887385843,1.2180959108766785,1.004121887357013,9.0639711853162858E-2,1,0,1,0,1.0130725654714374,0.21202232204964663,10.129003734146414,-85.182913868398927,94.817086131601073,null,1000000000,216288495.5625,null,7.9445907058607146,-25.400872374455876,null,50.973698593939439,-59.782041493943019,null,0,0]
[14791,14.791,1.5040072730671656,0.84344924787359765,1.0000431832612011,9.2931918373947604E-3,1,0,89219.942304069045,1.5707851185383768,2.9095253763617248,1.2199436444315137,1.0041691501062322,9.1156092592997076E-2,1,0,1,0,1.0132223209651094,0.21322361784541441,10.093812374252982,-85.335030085668791,94.664969914331209,null,1000000000,218773681,null,7.9382911285128515,-25.32459515589165,null,50.944806811393867,-60.010434929777126,null,0,0]
[14877.25,14.87725,1.5089066586908597,0.8463358441901575,1.0000436883432229,9.3473796031533982E-3,1,0,89740.205979463673,1.5707851835175985,2.9244924769162974,1.2218161102475562,1.0042178121640843,9.1684681133837376E-2,1,0,1,0,1.0133765070904759,0.21445319868572016,10.057890117038458,-85.490770161366598,94.509229838633402,null,1000000000,221332567.5625,null,7.9319349233332677,-25.24760038278621,null,50.91524075935893,-60.243169778580416,null,0,0]
[14963.5,14.9635,1.5138185357425622,0.8492037320341167,1.000044196361684,9.4015673140168121E-3,1,0,90260.46965485868,1.5707852477477362,2.9394697266772734,1.2236695012500798,1.0042667547790258,9.22132183011595E-2,1,0,1,0,1.0135315789117045,0.21568254318902583,10.022072415667074,-85.646514702480431,94.353485297519569,null,1000000000,223906332.25,null,7.9256707359541121,-25.171695529586515,null,50.885687245366697,-60.474819172893909,null,0,0]
[15049.75,15.04975,1.5187427830239562,0.85205304597714304,1.0000447073165797,9.4557549696668575E-3,1,0,90780.73333025405,1.5707853112416692,2.9544569712942628,1.2255040948940903,1.0043159779100406,9.2741703807200454E-2,1,0,1,0,1.0136875362461764,0.2169116500992217,9.9863581178231779,-85.802255434696747,94.197744565303253,null,1000000000,226494975.0625,null,7.9194966123089925,-25.096864683542051,null,50.856147071167925,-60.70539075115471,null,0,0]
[15136,15.135999999999999,1.5236792806002202,0.85488392005984748,1.0000452212079058,9.5099425697854033E-3,1,0,91300.997005649799,1.5707853740119828,2.9694540594310133,1.2273201635412587,1.0043654815158845,9.3270137364368899E-2,1,0,1,0,1.0138443789103568,0.21814051816208796,9.9507461029168969,-85.957984345202632,94.042015654797368,null,1000000000,229098496,null,7.9134106477162476,-25.023092223721857,null,50.82662102085439,-60.9348921214808,null,0,0]
[15224,15.224,1.5287284415091578,0.85775336580974881,1.0000457485524124,9.5652295708939551E-3,1,0,91831.816755619147,1.5707854373228667,2.9847654274851125,1.2291542647522109,1.0044162785684378,9.3809238922981486E-2,1,0,1,0,1.0140053161548364,0.21939407231468019,9.9145158114535477,-86.116852739800962,93.883147260199038,null,1000000000,231770176,null,7.907290133737586,-24.948897836533547,null,50.796511243369693,-61.167954903267393,null,0,0]
[15312,15.311999999999999,1.5337901066057986,0.8606038959691622,1.0000462789537077,9.620516513525617E-3,1,0,92362.63650558886,1.5707854999060393,3.0000867335668127,1.2309696386756694,1.0044673675054125,9.4348285798980344E-2,1,0,1,0,1.0141671746310303,0.2206473751975494,9.8783897348188106,-86.275692777310397,93.724307222689603,null,1000000000,234457344,null,7.9012575376684024,-24.875773269103821,null,50.766417762804139,-61.399919508206594,null,0,0]
[15400,15.4,1.5388641525030176,0.86343565109420262,1.0000468124117874,9.6758033973425011E-3,1,0,92893.456255558951,1.5707855617739757,3.0154178261910785,1.2327665588959569,1.0045187482822737,9.4887277687469435E-2,1,0,1,0,1.0143299541410766,0.22190042548471034,9.8423667774757995,-86.434496743067726,93.565503256932274,null,1000000000,237160000,null,7.8953109862022135,-24.803702829451126,null,50.736341356927319,-61.630793913616593,null,0,0]
[15488,15.488,1.5439504571358593,0.86624877110002629,1.0000473489266464,9.7310902220067181E-3,1,0,93424.276005529377,1.5707856229388673,3.0307585568422319,1.2345452939402146,1.004570420854241,9.5426214283742747E-2,1,0,1,0,1.0144936544861332,0.22315322185226266,9.8064458734021223,-86.593257175554555,93.406742824445445,null,1000000000,239878144,null,7.8894486534698327,-24.732671115343731,null,50.706282785586019,-61.860586060210821,null,0,0]
[15578.25,15.578250000000001,1.5491794157376155,0.8691146074343592,1.0000479023342226,9.7877905684615064E-3,1,0,93968.667851380073,1.5707856849498765,3.0465013803827383,1.2363508955181191,1.0046237176342461,9.5978872759039158E-2,1,0,1,0,1.0146624965941655,0.22443778481950161,9.7697114509722685,-86.756024049685507,93.243975950314493,null,1000000000,242681873.0625,null,7.8835220436530999,-24.660886316481346,null,50.6754749729729,-62.095137733204155,null,0,0]
[15668.5,15.6685,1.5544210121154847,0.87196113948884235,1.0000484589568785,9.8444908519802459E-3,1,0,94513.059697231147,1.5707857462465236,3.0622540339779349,1.2381379263493013,1.0046773212252598,9.6531472429980378E-2,1,0,1,0,1.014832306800558,0.22572207790284635,9.7330821865263708,-86.918730025690607,93.081269974309393,null,1000000000,245501892.25,null,7.8776802713522738,-24.590162132858463,null,50.644687480827827,-62.328567892832162,null,0,0]
[15758.75,15.758749999999999,1.5596751188542415,0.87478851599299601,1.0000490187946089,9.9011910721984696E-3,1,0,95057.45154308257,1.5707858068410814,3.0780163667032419,1.2399066602305906,1.0047312315781762,9.7084012968514627E-2,1,0,1,0,1.0150030848876261,0.22700609968112229,9.6965570197501183,-87.08136783824169,92.91863216175831,null,1000000000,248338201.5625,null,7.871921513394625,-24.520482858979495,null,50.613921072009227,-62.560884979262205,null,0,0]
[15849,15.849,1.5649416099477111,0.87759688490645293,1.0000495818474082,9.9578912287517085E-3,1,0,95601.843388934329,1.5707858667455443,3.0937882306180238,1.2416573658387284,1.004785448643619,9.7636494046804759E-2,1,0,1,0,1.0151748306366111,0.22828984873550198,9.6601349183071079,-87.24393047138949,92.75606952861051,null,1000000000,251190801,null,7.8662439930950914,-24.451833082704635,null,50.583176490865753,-62.792097388684859,null,0,0]
[15941.25,15.94125,1.5703374793222267,0.88044799827658704,1.0000501607005567,1.0015847832293208E-2,1,0,96158.299320013073,1.5707859272765285,3.1099193089037591,1.2434285107528014,1.0048411841268552,9.8201156680635823E-2,1,0,1,0,1.0153513822222702,0.22960176319120892,9.6230111488997121,-87.410010852672414,92.589989147327586,null,1000000000,254123451.5625,null,7.8605228106602363,-24.38271020808039,null,50.551773903893213,-63.027300644591996,null,0,0]
[16033.5,16.0335,1.5757460262469702,0.88327956236792449,1.0000507429128376,1.0073804368546711E-2,1,0,96714.755251092167,1.5707859871109733,3.1260600421641587,1.2451813712727926,1.0048972399619638,9.8765756497708676E-2,1,0,1,0,1.0155289443675175,0.23091338971147901,9.5859929672403261,-87.575998628725571,92.424001371274429,null,1000000000,257073122.25,null,7.8548828952819649,-24.314631313025284,null,50.520395637612097,-63.261367315700269,null,0,0]
[16125.75,16.12575,1.5811671206273024,0.88609173261774077,1.0000513284842452,1.0131760837122991E-2,1,0,97271.21118217161,1.5707860462608325,3.1422102816137931,1.2469162184762896,1.0049536160953381,9.9330293148606905E-2,1,0,1,0,1.0157075168352694,0.23222472678872277,9.5490793546845865,-87.741887068155776,92.258112931844224,null,1000000000,260039813.0625,null,7.8493224912342621,-24.247580846602421,null,50.48904242910406,-63.494306221553359,null,0,0]
[16218,16.218,1.5866006338468523,0.88888466356841767,1.0000519174147735,1.0189717237632821E-2,1,0,97827.667113251373,1.5707861047377882,3.1583698814237366,1.248633318331704,1.005010312473076,9.9894766284153391E-2,1,0,1,0,1.0158870993872837,0.23353577291795763,9.5122693187102456,-87.907669681177893,92.092330318822107,null,1000000000,263023524,null,7.8438398877135498,-24.181543550607291,null,50.457714996650431,-63.72612613057062,null,0,0]
[16312.5,16.3125,1.5921794157543581,0.89172592647918958,1.0000525241924694,1.0249087137902999E-2,1,0,98397.695140211494,1.5707861639552225,3.1749331740086815,1.2503741695185711,1.0050687236885176,0.10047294083442955,1,0,1,0,1.0160721090902964,0.23487849253263954,9.4746678626720229,-88.07737950561517,91.92262049438483,null,1000000000,266097656.25,null,7.8383024896793092,-24.114930479225109,null,50.425650938646449,-63.962449026390061,null,0,0]
[16407,16.407,1.5977709611503648,0.89454732551588234,1.0000531344951311,1.0308456965919076E-2,1,0,98967.723167171949,1.5707862224905031,3.1915059885403787,1.2520969461384539,1.005127470845057,0.10105104799226192,1,0,1,0,1.0162581782410385,0.23622090364497816,9.4371730686216182,-88.246965238177964,91.753034761822036,null,1000000000,269189649,null,7.8328432379915256,-24.049349103861701,null,50.39361539628382,-64.197616134316277,null,0,0]
[16501.5,16.5015,1.6033751365022619,0.89734902381133619,1.0000537483227525,1.0367826721262657E-2,1,0,99537.751194132725,1.5707862803553496,3.2080881774492074,1.2538019181603222,1.0051865538837927,0.10162908738308465,1,0,1,0,1.0164453065796477,0.23756300464574578,9.3997839484592198,-88.416420644639473,91.583579355360527,null,1000000000,272299502.25,null,7.827460431538233,-23.984783935644931,null,50.361609082574716,-64.431636708994546,null,0,0]
[16596,16.596,1.6089918098383069,0.90013118346535748,1.0000543656753267,1.0427196403515342E-2,1,0,100107.77922109384,1.5707863375612148,3.224679596118297,1.255489350415816,1.0052459727455008,0.10220705863260084,1,0,1,0,1.0166334938450023,0.23890479392863478,9.3624995386489722,-88.585739726099021,91.414260273900979,null,1000000000,275427216,null,7.8221524129698867,-23.921219780050077,null,50.329632691332826,-64.664519946048955,null,0,0]
[16692.5,16.692499999999999,1.6147401165736872,0.90295222888604687,1.0000549997312027,1.0487822511117304E-2,1,0,100689.87133328198,1.5707863953093681,3.241631533475736,1.2571946649915442,1.005306995646599,0.10279719136938491,1,0,1,0,1.0168267564175624,0.2402746575185169,9.3245331220492744,-88.758495600795953,91.241504399204047,null,1000000000,278639556.25,null,7.8168075561706747,-23.857327875941387,null,50.297011131532336,-64.901167724854574,null,0,0]
[16789,16.789000000000001,1.620501182663312,0.90575323819132558,1.0000556374628011,1.0548448541620029E-2,1,0,101271.96344547045,1.5707864523936705,3.2585927997162343,1.2588822318033912,1.005368368609969,0.10338725226203989,1,0,1,0,1.0170211226591273,0.24164419268036191,9.2866739383786907,-88.931097395083839,91.068902604916161,null,1000000000,281870521,null,7.8115373272012629,-23.794448689398813,null,50.264422176831161,-65.136648705685033,null,0,0]
[16885.5,16.8855,1.6262748725074478,0.90853438059535097,1.0000562788701151,1.0609074494578005E-2,1,0,101854.05555765926,1.5707865088255037,3.2755632499215093,1.260552317013544,1.0054300915715058,0.10397724091287483,1,0,1,0,1.0172165922875986,0.24301339771320798,9.2489210348854538,-89.103539434683498,90.896460565316502,null,1000000000,285120110.25,null,7.8063400941127403,-23.73256694831846,null,50.231866506426442,-65.370972486365019,null,0,0]
[16982,16.981999999999999,{"$f":"SQRT(1+(A269/pole1)^2)","v":1.6320610521301497},{"$f":"ATAN(A269/pole1)","v":0.9112958241497966},{"$f":"SQRT(1+(A269/Zero1)^2)","v":1.0000569239531372},{"$f":"ATAN(A269/Zero1)","v":1.0669700369545718E-2},{"$f":"IF(VIN_nom>Vout, 1, SQRT(1+(A269/z_RHP)^2))","v":1},{"$f":"IF(VIN_nom>Vout, 0, -ATAN(A269/z_RHP))","v":0},{"$f":"SQRT(1+(A269/Pole2)^2)","v":102436.14766984837},{"$f":"ATAN(A269/Pole2)","v":1.5707865646159904},3.2925427420833708,1.262205181688391,{"$f":"SQRT(1+(A269/pole4)^2)","v":1.0054921644667545},{"$f":"ATAN(A269/pole4)","v":0.10456715692449725},{"$f":"IF(VOUT_setting=1,1,SQRT(1+(A269*zterm1)^2))","v":1},{"$f":"IF(VOUT_setting=1,0,ATAN(((A269*zterm1))))","v":0},1,{"$f":"IF(VOUT_setting=1,0,ATAN(A269*$Q$4/(1+Afbr-$Q$5*(A269)^2)))","v":0},{"$f":"SQRT((1-(Z269/pterm2))^2+(A269/pterm1)^2)","v":1.0174131650195253},{"$f":"IF((ATAN((A269/pterm1)/(1-A269^2/pterm2))>0),ATAN((A269/pterm1)/(1-A269^2/pterm2)),PI()+ATAN((A269/pterm1)/(1-A269^2/pterm2)))","v":0.24438227091932208},{"$f":"20*LOG10(((E269*K269*G269*O269)/(C269*I269*S269*M269*Q269))*Adc)","v":9.2112734815980364},{"$f":"((F269+L269+H269+P269)-(D269+J269+T269+N269+R269))*radconv","v":-89.275816270865178},{"$f":"IF(V269>0,V269,V269+180)","v":90.724183729134822},null,{"$f":"IF(U269<0,A269,1000000000)","v":1000000000},{"$f":"A269^2","v":288388324},null,{"$f":"20*LOG10((K269/(I269*M269))*AEA)","v":7.8012142670311144},{"$f":"(L269-(J269+N269))*radconv","v":-23.671667672566457},null,{"$f":"20*LOG10((E269*G269/(C269*S269))*Acs*Am)","v":50.199344780220656},{"$f":"(F269+H269-(D269+T269))*radconv","v":-65.604148598298735},null,{"$f":"SUM((U270<0)*(U269>0))*A269","v":0},0]
[17081,{"$f":"A270/1000","v":17.081},1.6380099733673588,0.91410851164516815,1.0000575895679276,1.0731896781521795E-2,1,0,103033.31988857122,1.5707866211967358,3.3099713679704834,1.2638832395747497,1.0055562090497725,0.10517227983177405,1,0,1,0,1.0176159763510944,0.24578626055286473,9.1727591308965177,-89.452379078060574,90.547620921939426,null,1000000000,291760561,null,7.79602822789459,-23.610196268340779,null,50.166016468655663,-65.842182809719773,null,0,0]
[17180,17.18,1.643971759402451,0.91690082094085268,1.0000582590513289,1.0794093110464392E-2,1,0,103630.49210729438,1.5707866771253864,3.3274092166794418,1.2655437138058041,1.0056206217940826,0.1057773254410329,1,0,{"$f":"IF(VOUT_setting=1,1,SQRT((1+Afbr-$Q$5*(A271)^2)^2+(A271*$Q$4)^2))","v":1},0,1.0178199480733578,0.24718989733439431,9.1343537465235372,-89.628757091270771,90.371242908729229,null,1000000000,295152400,null,7.7909140829394357,-23.549727867141119,null,50.132725229237842,-66.079029224129627,null,0,0]
[17279,17.279,1.6499462707814869,0.91967292962727942,1.000058932403334,1.085628935589248E-2,1,0,104227.66432601788,1.5707867324131508,3.3448561439653273,1.2671868703043434,1.0056854026289443,0.10638229332417865,1,0,1,0,1.018025079875847,0.24859317944146489,9.0960563933611027,-89.804945121147625,90.195054878852375,null,1000000000,298563841,null,7.7858702453009396,-23.490247208828137,null,50.099471713713896,-66.314697912319502,null,0,0]
[17378,17.378,1.6559333697675673,0.92242501397660326,1.0000596096239347,1.0918485517325027E-2,1,0,104824.83654474169,1.5707867870709822,3.3623120085028235,1.2688129698492536,1.005750551483231,0.10698718305345366,1,0,1,0,1.0182313714466145,0.24999610505526676,9.0578661577888724,-89.980938197748443,90.019061802251557,null,1000000000,301994884,null,7.7808951692981392,-23.431739327991103,null,50.066256554144466,-66.549198869757376,null,0,0]
[17479.25,17.47925,1.6620694173969348,0.925219115861448,1.0000603062373834,1.0982095140499012E-2,1,0,105435.58085934589,1.5707868423306213,3.3801736971707168,1.2704586498695742,1.0058175615793536,0.1076057389927372,1,0,1,0,1.0184435507408791,0.25143054471188164,9.0189178287883891,-90.16072451009542,89.83927548990458,null,1000000000,305524180.5625,null,7.7758765778843433,-23.372892619188278,null,50.032326816557777,-66.787831890907142,null,0,0]
[17580.5,17.580500000000001,1.6682183452971118,0.92799264156588956,1.0000610068972544,1.1045704674798389E-2,1,0,106046.32517395042,1.5707868969537553,3.3980444439831992,1.2720870245813951,1.0058849564614318,0.10822421228140786,1,0,1,0,1.0186569424545084,0.25286460765047269,8.9800796739620701,-90.340297064025691,89.659702935974309,null,1000000000,309073980.25,null,7.7709267654365206,-23.315032659526448,null,49.998438474179281,-67.025264404499239,null,0,0]
[17681.75,17.681750000000001,1.6743800115650904,0.93074577534274405,1.0000617116035397,1.1109314119708596E-2,1,0,106657.06948855527,1.5707869509513186,3.415924106774519,1.2736983570195102,1.0059527360521281,0.10884260246298175,1,0,1,0,1.0188715462490299,0.25429829193727893,8.941350780368376,-90.519651209369485,89.480348790630515,null,1000000000,312644283.0625,null,7.7660442041066897,-23.258144352693922,null,49.964592141915425,-67.261506856675567,null,0,0]
[17783,17.783000000000001,1.6805542760871559,0.93347869998200805,1.0000624203562303,1.1172923474715071E-2,1,0,107267.81380316042,1.5707870043339967,3.4338125462697255,1.2752929050956978,1.0060209002736846,0.10946090908135191,1,0,1,0,1.0190873617843748,0.25573159564258269,8.9027302550856042,-90.698782505909776,89.301217494090224,null,1000000000,316235089,null,7.7612274058334654,-23.202212895913515,null,49.930788414905869,-67.496569609996243,null,0,0]
[17886.5,17.886500000000002,1.6868786237526836,0.93625165730708348,1.0000631490412566,1.1237946277485426E-2,1,0,107892.130213646,1.5707870582782955,3.452107436003975,1.2769058028973013,1.0060909767211752,0.11009286900300168,1,0,1,0,1.0193092252961273,0.25719635517477202,8.8633625936421563,-90.881659754935399,89.118340245064601,null,1000000000,319926882.25,null,7.7563700299479033,-23.14601238614409,null,49.896278129347991,-67.735647368791305,null,0,0]
[17990,17.989999999999998,1.6932158453676385,0.93900387889408798,1.0000638819545085,1.1302968985224631E-2,1,0,108516.44662413189,1.5707871116018901,{"$f":"SQRT(1+(A279/Zero2)^2)","v":3.4704112114886385},{"$f":"ATAN(A279/Zero2)","v":1.2785016911996101},1.0061614549185189,0.11072474064367653,1,0,1,0,1.0195323542785653,0.25866071295809723,8.8241063442193948,-91.064295399444958,88.935704600555042,null,1000000000,323640100,null,7.751578349996203,-23.09078135520598,null,49.861813559876921,-67.973514044238954,null,0,0]
[18093.5,18.093499999999999,1.6995657969215916,0.94173555523411423,1.000064619095977,1.1367991597383074E-2,1,0,109140.76303461807,1.5707871643154323,3.4887237328650258,1.2800808296606763,1.0062323347812985,0.11135652351741539,1,0,1,0,1.019756748363307,0.26012466694451741,8.7849606128947819,-91.24668533191776,88.75331466808224,null,1000000000,327374742.25,null,7.7468508976260999,-23.036504898555467,null,49.827395280922417,-68.210180433362268,null,0,0]
[18197,18.196999999999999,1.7059283362611632,0.9444468752114068,1.0000653604656522,1.1433014113411145E-2,1,0,109765.07944510457,1.5707872164293317,3.5070448631294786,1.2816434728506898,1.0063036162246386,0.11198821713867714,1,0,1,0,1.0199824071802535,0.26158821509047708,8.7459245243502295,-91.428825644547672,88.571174355452328,null,1000000000,331130809,null,7.7421862428291179,-22.983168403172016,null,49.793023847174851,-68.44565724137567,null,0,0]
[18303,18.303000000000001,1.7124574610579231,0.9472027818285701,1.0000661241254343,1.1499607121398138E-2,1,0,110404.47596212485,1.5707872691911056,3.5258173158634936,1.2832270240779191,1.0063770356005401,0.11263507604078672,1,0,1,0,1.0202148272295444,0.26308669184719552,8.7060582866363116,-91.615102864307147,88.384897135692853,null,1000000000,334999809,null,7.7374725512686613,-22.929502909205997,null,49.757871301021382,-68.685599955101154,null,0,{"$f":"IF(AH282>0,W282,0)","v":0}]
[18409,18.408999999999999,1.7189994931479351,0.94993773266415071,1.0000668922201317,1.1566200027387815E-2,1,0,111043.87247914544,1.5707873213452694,3.5445985163957108,1.2847937981772557,1.0064508760096613,0.11328184029712826,1,0,1,0,1.0204485730558583,0.2645847385966264,8.6663052506993434,-91.801110575470545,88.198889424529455,null,1000000000,338891281,null,7.732821809758609,-22.87679321624513,null,49.722769006594461,-68.924317359225441,null,0,0]
[18515,18.515000000000001,1.7255542857263306,0.95265192538150734,1.0000676647497337,1.1632792830789784E-2,1,0,111683.26899616633,1.570787372902259,3.5633883264076527,1.2863440527933863,1.0065251373593398,0.11392850938750355,1,0,1,0,1.0206836442560656,0.26608235315826817,8.6266645322504463,-91.986845187254048,88.013154812745952,null,1000000000,342805225,null,7.728232599631168,-22.825024533128992,null,49.68771749827301,-69.161820654125037,null,0,0]
[18621,18.620999999999999,1.7321216939262372,0.95534555587833325,1.0000684417142305,1.169938553101366E-2,1,0,112322.66551318752,1.5707874238722723,3.5821866104202096,1.2878780404841557,1.006599819556411,0.11457508279218585,1,0,1,0,1.020920040425177,0.26757953335663059,8.587135264425811,-92.17230329946355,87.82769670053645,null,1000000000,346741641,null,7.7237035394328544,-22.774182360165138,null,49.652717290646692,-69.398120939298423,null,0,0]
[18729.5,18.729500000000002,1.7388569100623028,0.95808162264601937,1.0000692415963739,1.1767548706316787E-2,1,0,112977.14213674252,1.5707874754469062,3.6014368878266785,1.2894316186049506,1.0066766988811948,0.11523680593021556,1,0,1,0,1.0211633837622727,0.26911157229252752,8.546788239742817,-92.361845709306778,87.638154290693222,null,1000000000,350794170.25,null,7.7191285522851896,-22.723085788665443,null,49.616945253111368,-69.638759920641334,null,0,0]
[18838,18.838000000000001,1.7456050428806436,0.96079655551853538,1.00007004612505,1.1835711772265839E-2,1,0,113631.61876029783,1.570787526427438,3.6206957652361313,1.2909686730983492,1.0067540189396316,0.11589842771546918,1,0,1,0,1.021408114439234,0.27064315153847146,8.5065561999021178,-92.551091797109265,87.448908202890735,null,1000000000,354870244,null,7.7146137714093745,-22.672930110153022,null,49.581227994146474,-69.878161686956247,null,0,0]
[18946.5,18.9465,1.7523659431598861,0.96349055885447366,1.0000708553002478,1.190387472822768E-2,1,0,114286.09538385342,1.5707875768240742,3.6399631061419093,1.2924894590359561,1.006831779630182,0.11655994759212296,1,0,1,0,1.0216542320157282,0.27217426877782636,8.4664382676140963,-92.740038493270731,87.259961506729269,null,1000000000,358969862.25,null,7.7101578290554142,-22.623700678839874,null,49.545566004212418,-70.116337814430835,null,0,0]
[19055,19.055,1.7591394636924991,0.96616383508902881,1.0000716691219556,1.1972037573569181E-2,1,0,114940.57200740928,1.5707876266467893,3.6592387768530381,1.2939942264194015,1.0069099808507602,0.11722136500488102,1,0,1,0,1.0219017360494134,0.27370492169954169,8.4264335818861884,-92.928682908813329,87.071317091186671,null,1000000000,363093025,null,7.705759393490176,-22.575383139443101,null,49.509959754049746,-70.353299769370224,null,0,0]
[19165.75,19.165749999999999,1.7660663136742047,0.96887137984925376,1.0000725046121823,1.2041613819394113E-2,1,0,115608.62072684563,1.570787676920919,3.6789226281913843,1.2955139328340097,1.0069902579769272,0.11789639219767455,1,0,1,0,1.022155802076216,0.27526683501711263,8.3857152217066186,-93.120924738501671,86.879075261498329,null,1000000000,367325973.0625,null,7.701327707574559,-22.52698946543088,null,49.473673079785797,-70.593935273070798,null,0,0]
[19276.5,19.276499999999999,1.7730060091161317,0.97155774905627623,1.0000733449436059,1.2111189948630217E-2,1,0,116276.66944628229,1.5707877266173651,3.6986148855821459,1.2970174601728821,1.0070709938767235,0.11857131146541802,1,0,1,0,1.0224113117215956,0.27682825971210551,8.3451130901064197,-93.312846085038274,86.687153914961726,null,1000000000,371583452.25,null,7.6969532443375046,-22.479516567427094,null,49.437445411422651,-70.833329517611162,null,0,0]
[19387.25,19.387250000000002,1.7799583997727835,0.9742231518401252,1.0000741901162142,1.2180765960604176E-2,1,0,116944.71816571923,1.5707877757460276,3.7183154154695641,1.2985050587456513,1.0071521884398196,0.11924612221926727,1,0,1,0,1.022668264508694,0.27838919334483292,8.3046263199491559,-93.504444416089228,86.495555583910772,null,1000000000,375865462.5625,null,7.692634696485837,-22.432950070575142,null,49.401277189117053,-71.071494345514111,null,0,0]
[19498,19.498000000000001,1.7869233374641795,0.97686779527086265,1.0000750401299949,1.2250341854642676E-2,1,0,117612.76688515644,1.5707878243165816,3.7380240870578816,1.2999769738682694,1.0072338415552953,0.11992082387096281,1,0,1,0,1.0229266599585096,0.27994963348176133,8.2642540591981746,-93.695717367783558,86.304282632216442,null,1000000000,380172004,null,7.6883707911859833,-22.387275886155862,null,49.365168833665926,-71.308441481627668,null,0,0]
[19611.75,19.611750000000001,1.7940898495939341,0.97956268177072348,1.0000759182086219,1.2321802299533864E-2,1,0,118298.91173243422,1.5707878736317578,3.7582749688131654,1.301472686352257,1.0073181837287157,0.12061368767285655,1,0,1,0,1.0231935561385548,0.28155182659922817,8.2229065177345149,-93.891830496897626,86.108169503102374,null,1000000000,384620738.0625,null,7.6840469662259148,-22.341278870583142,null,49.328145117162336,-71.550551626314487,null,0,0]
[19725.5,19.7255,1.8012692874131779,0.98223610518364302,1.0000768013942229,1.2393262618573991E-2,1,0,118985.05657971228,1.5707879223781678,3.7785341682813764,1.3029523631261053,1.0074030093944462,0.12130643512579176,1,0,1,0,1.023461973166484,0.28315349393931127,8.1816779978297802,-94.087595843720251,85.912404156279749,null,1000000000,389095350.25,null,7.6797781694886158,-22.29619393463177,null,49.291185393994901,-71.791401909088492,null,0,0]
[19839.25,19.83925,1.8084614969802648,0.98488828314062316,1.000077689686784,1.2464722811033557E-2,1,0,119671.20142699064,1.5707879705655943,3.7988015523861747,1.3044162543195079,1.0074883184303631,0.12199906559434322,1,0,1,0,1.0237319105163063,0.28475463288573449,8.1405676223261239,-94.283011360507089,85.716988639492911,null,1000000000,393595840.5625,null,7.6755631284506762,-22.252006711079275,null,49.254290059529183,-72.031004649427828,null,0,0]
[19953,19.952999999999999,1.8156663265210244,0.98751943102303719,1.0000785830862919,1.253618287618307E-2,1,0,120357.34627426925,1.5707880182035978,3.8190769908229054,1.305864605024269,1.0075741107136891,0.12269157844374926,1,0,1,0,1.0240033676596867,0.28635524082916913,8.0995745284405736,-94.478075159692722,85.521924840307278,null,1000000000,398122209,null,7.6714006043679062,-22.208703121378271,null,49.217459489726409,-72.269372038314444,null,0,0]
[20069,20.068999999999999,1.8230265109415873,0.99018118637663832,1.0000794994168949,1.2609056305258232E-2,1,0,121057.06321742838,1.570788066227744,3.8397616445030556,1.3073258487597448,1.0076620975393316,0.12339766756022824,1,0,1,0,1.0242817589185418,0.28798695958989229,8.0578904864925942,-94.676633345226961,85.323366654773039,null,1000000000,402764761,null,7.6672085800028533,-22.165438700361403,null,49.179967472143474,-72.511194644865554,null,0,0]
[20185,20.184999999999999,1.8303995074724624,0.99282151678196295,1.0000804210584471,1.2681929600404832E-2,1,0,121756.7801605878,1.5707881136999158,3.8604544091001709,1.3087714304696698,1.007750586658972,0.12410363302729774,1,0,1,0,1.0245617295721408,0.2896181206744935,8.0163266428636604,-94.874822278581235,85.125177721418765,null,1000000000,407434225,null,7.6630686715757577,-22.123064531093128,null,49.142543536941631,-72.751757747488128,null,0,0]
[20301,20.300999999999998,1.8377851619112284,0.99544064350952965,1.0000813480109336,1.2754802760849251E-2,1,0,122456.49710374748,1.5707881606295753,3.8811551548817733,1.3102015946711105,1.0078395779403047,0.12480947417393198,1,0,1,0,1.0248432790527149,0.29124872133820379,7.9748821253354629,-95.072640432702343,84.927359567297657,null,1000000000,412130601,null,7.6589796672292101,-22.081566565872702,null,49.105188023759979,-72.991073866829652,null,0,0]
[20417,20.417000000000002,1.8451833222617193,0.99803878545392566,1.0000822802743399,1.2827675785817878E-2,1,0,123156.21404690742,1.5707882070259693,3.9018637548189772,1.3116165809454603,1.0079290712503202,0.12551519032983707,1,0,1,0,1.0251264067900105,0.29287875884387432,7.9335560750323895,-95.270086427665632,84.729913572334368,null,1000000000,416853889,null,7.6549403872705577,-22.040931039822201,null,49.06790125341557,-73.229155387843406,null,0,0]
[20536,20.536000000000001,1.8527856525691673,1.0006825417892227,1.0000832421667138,1.2902433316396546E-2,1,0,123874.027117908,1.5707882540776106,3.9231159531070885,1.3130526359136394,1.0080214005741679,0.12623902718257948,1,0,1,0,1.0254184962060926,0.29455036443821175,7.8912834635010212,-95.472250766300306,84.527749233699694,null,1000000000,421727296,null,7.6508471096000594,-22.000126643528759,null,49.029721919554696,-73.472124122771547,null,0,0]
[20655,20.655000000000001,1.8604008269350509,1.0033046729637534,1.0000842096482305,1.2977190702752129E-2,1,0,124591.84018890883,1.5707883005870928,3.9443761546641953,1.3144732131023411,1.0081142579436337,0.12696273106926606,1,0,1,0,1.0257122453447143,0.29622137155809691,7.8491337359187767,-95.67402095467753,84.32597904532247,null,1000000000,426629025,null,7.6468037459907539,-21.960201409219362,null,48.99161555558176,-73.713819545458151,null,0,0]
[20774,20.774000000000001,1.8680286882797583,1.00590540760949,1.0000851827188739,1.3051947944049463E-2,1,0,125309.65325990993,1.5707883465637333,3.9656442307714062,1.3158785557572323,1.008207643212816,0.1276863012686652,1,0,1,0,1.026007653582149,0.29789177727364824,7.8071060056652799,-95.875395946882492,84.124604053117508,null,1000000000,431559076,null,7.6428091218519132,-21.921141359154213,null,48.953582449467099,-73.954254587728286,null,0,0]
[20893,20.893000000000001,1.8756690818193049,1.0084849718002247,1.0000861613786276,1.3126705039453386E-2,1,0,126027.46633091129,1.5707883920166366,3.9869200554092421,1.3172689021753485,1.0083015562350381,0.1284097370603717,1,0,1,0,1.0263047202919704,0.29956157866353933,7.7651993988573773,-96.076374834488703,83.923625165511297,null,1000000000,436517449,null,7.6388620939455478,-21.882932799164376,null,48.915622870565571,-74.193442035324296,null,0,0]
[21014.75,21.014749999999999,1.8834988499757819,1.0111024709211665,1.0000871684387937,1.3203189562932538E-2,1,0,126761.86751909992,1.5707884379871693,4.0086954387896725,1.3186761018374784,1.0083981855503164,0.12914975105297416,1,0,1,0,1.0266103677369594,0.30126933942772971,7.7224488179613004,-96.281587441947039,83.718412558052961,null,1000000000,441619717.5625,null,7.634871951582312,-21.844708510022681,null,48.876862432032723,-74.436878931924355,null,0,0]
[21136.5,21.136500000000002,1.8913414156563777,1.0136982804559624,1.0000881813493403,1.3279673931928816E-2,1,0,127496.26870728884,1.5707884834281052,4.0304786744497392,1.320068093451445,1.0084953669793253,0.12988962283105232,1,0,1,0,1.0269177498569388,0.30297646145357487,7.6798232116134093,-96.486383917837912,83.513616082162088,null,1000000000,446751632.25,null,7.6309293059513159,-21.807347399220649,null,48.838179471315833,-74.679036518617238,null,0,0]
[21258.25,21.25825,1.8991966203223427,1.0162726343331938,1.0000892001102495,1.3356158145547845E-2,1,0,128230.669895478,1.5707885283485434,4.0522696357581465,1.3214451169214421,1.0085931003624711,0.13062935162580561,1,0,1,0,1.0272268659723649,0.3046829416404932,7.6373216824493309,-96.690763698657207,83.309236301342793,null,1000000000,451913193.0625,null,7.6270330282947825,-21.77083567773284,null,48.799574219808278,-74.91992802092436,null,0,0]
[21380,21.38,1.9070643077936067,1.0188257637679756,1.0000902247215036,1.3432642202895258E-2,1,0,128965.07108366741,1.5707885727573763,4.0740681987484102,1.3228074072469727,1.0086913855393151,0.13136893666935645,1,0,1,0,1.0275377154007994,0.30638877689740135,7.5949433451944346,-96.894726347034023,83.105273652965977,null,1000000000,457104400,null,7.6231820200722531,-21.735159837592821,null,48.761046890775916,-75.15956650944122,null,0,0]
[21504.5,21.5045,1.9151224534602695,1.0214148505538656,1.000091278525961,1.3510853663681769E-2,1,0,129716.06038904411,1.5707886176492671,4.0963668664740824,1.3241854717554937,1.0087924611715642,0.13212507746184007,1,0,1,0,1.0278573778362008,0.30813247215809497,7.5517342840687727,-97.102864253486374,82.897135746513626,null,1000000000,462443520.25,null,7.6192897289079671,-21.69952880555995,null,48.721730120814541,-75.403335447926423,null,0,0]
[21629,21.629000000000001,1.9231933292720178,1.0239822236992795,1.0000923384479965,1.358906495916591E-2,1,0,130467.04969442109,1.5707886620243483,4.1186732292105779,1.3255486118832152,1.0088941134640308,0.13288106631480814,1,0,1,0,1.028178851317991,0.3098754865182532,7.5086522074290691,-97.310565425652939,82.689434574347061,null,1000000000,467813641,null,7.6154425445481033,-21.664744142455714,null,48.682495228534705,-75.645821283197222,null,0,0]
[21753.5,21.753499999999999,1.9312767756296418,1.0265281217959443,1.0000934044875907,1.3667276088391366E-2,1,0,131218.0389997983,1.5707887058914931,4.1409871626051569,1.3268970637854371,1.0089963422424266,0.13363690241018952,1,0,1,0,1.0285021351071502,0.31161781670358218,7.4656962052474807,-97.517829769218622,82.482170230781378,null,1000000000,473214762.25,null,7.6116393842606769,-21.630792271214471,null,48.643342386640533,-75.887037498004176,null,0,0]
[21878,21.878,1.9393726353482961,1.0290527805744512,1.0000944766447237,1.3745487050401838E-2,1,0,131969.02830517577,1.5707887492593728,4.1633085449292784,1.328231058769169,1.0090991473315452,0.13439258493094169,1,0,1,0,1.0288272284615645,0.31335945945030697,7.4228653790193144,-97.72465730437402,82.27534269562598,null,1000000000,478646884,null,7.6078791943672561,-21.597659892604533,null,48.604271750305791,-76.126997411769509,null,0,0]
[22005.25,22.00525,1.9476599858109556,1.0316114991225329,1.0000955788057431,1.3825425389990511E-2,1,0,132736.60572774053,1.5707887930780706,4.1861305433414442,1.3295798159053585,1.0092048185784039,0.13516479968442438,1,0,1,0,1.0291613717793033,0.31513885844816286,7.3792169205869094,-97.935602066936184,82.064397933063816,null,1000000000,484231027.5625,null,7.6040792852476358,-21.564628957953715,null,48.564423200993012,-76.370973108982454,null,0,0]
[22132.5,22.1325,1.9559599795794109,1.0341485186393256,1.000096687357497,1.3905363552875558E-2,1,0,133504.18315030559,1.5707888363929001,4.2089600743447182,1.3309139440449023,1.0093110915036425,0.13593685228131286,1,0,1,0,1.0294974039083524,0.31691753244258897,7.3356973662711571,-98.146090897081393,81.853909102918607,null,1000000000,489847556.25,null,7.6003221289297285,-21.532426883312173,null,48.524660802995157,-76.613664013769252,null,0,0]
[22259.75,22.25975,1.9642724563815657,1.0366640817378892,1.0000978022999647,1.3985301538035944E-2,1,0,134271.76057287084,1.5707888792125029,4.2317970160295273,1.3322336752363932,1.0094179659172244,0.13670874185258189,1,0,1,0,1.0298353240464229,0.31869547798300346,7.2923057916485003,-98.356124153167542,81.643875846832458,null,1000000000,495496470.0625,null,7.5966066885968484,-21.501040323978497,null,48.484984668705387,-76.855083829189056,null,0,0]
[22387,22.387,1.9725972584078262,1.0391584280312127,1.0000989236331244,1.4065239344450645E-2,1,0,135039.33799543636,1.5707889215453237,4.254641249064564,1.333539236747751,1.0095254416281176,0.13748046753035034,1,0,1,0,1.0301751313879279,0.32047269163044623,7.2490412833357194,-98.565702296293466,81.434297703706534,null,1000000000,501177769,null,7.5929319553049712,-21.470456209217996,null,48.44539489368448,-77.095246087075438,null,0,0]
[22517.5,22.517499999999998,1.9811473168453981,1.041694691925398,1.0001000802430255,1.4147218597706707E-2,1,0,135826.51955649594,1.5707889644623914,4.2780763808077147,1.3348636586568792,1.0096362866264548,0.13827173216053346,1,0,1,0,1.0305255767736023,0.32229453204251257,7.2048028178252128,-98.780161011811927,81.219838988188073,null,1000000000,507037806.25,null,7.5892046197353764,-21.439911006249709,null,48.40488376374357,-77.340250005562197,null,0,0]
[22648,22.648,1.9897100097066249,1.0442091423166582,1.0001012435741814,1.4229197660794985E-2,1,0,136613.70111755579,1.5707890068848742,4.3015189349219876,1.3361736470901009,1.0097477636187673,0.13906282257338151,1,0,1,0,1.0308780052664166,0.32411559541023804,7.1606960804978108,-98.994142362207924,81.005857637792076,null,1000000000,512931904,null,7.5855180338769124,-21.41018277027986,null,48.364463612274626,-77.583959591928078,null,0,0]
[22778.5,22.778500000000001,1.9982851745752219,1.0467020280267239,1.0001024136265693,1.4311176532614257E-2,1,0,137400.88267861586,1.570789048821273,4.3249687907133341,1.3374694322880798,1.0098598723957608,0.13985373783658731,1,0,1,0,1.0312324159867958,0.32593587806269209,7.1167201201906982,-99.20764714890224,80.79235285109776,null,1000000000,518860062.25,null,7.5818711951284712,-21.381258256559935,null,48.324134490715963,-77.826388892342322,null,0,0]
[22909,22.908999999999999,2.0068726515762982,1.0491735946998666,1.0001035904001647,1.4393155212063309E-2,1,0,138188.0642396762,1.5707890902798942,4.3484258300539906,1.3387512397165762,1.0099726127470479,0.14064447701913274,1,0,1,0,1.0315888080516087,0.32775537634195123,7.072873996545308,-99.420676265650457,80.579323734349543,null,1000000000,524822281,null,7.5782631279798558,-21.353124493985913,null,48.283896434219187,-78.067551771664526,null,0,0]
[23042.25,23.042249999999999,2.0156536312647328,1.0516754985100198,1.0001047989067988,1.447686121193955E-2,1,0,138991.8339179238,1.5707891321276142,4.3723844668982634,1.3400458651292193,1.0100883803111924,0.14145169663632839,1,0,1,0,1.0319547537857554,0.32961240341097087,7.028236915813574,-99.637704710659847,80.362295289340153,null,1000000000,530945285.0625,null,7.5746180482740453,-21.325200596662391,null,48.242904433193267,-78.312504113997463,null,0,0]
[23175.5,23.1755,2.024447118484952,1.0541556829500442,1.0001060144208449,1.4560567008932226E-2,1,0,139795.60359617171,1.5707891734941184,4.396350352217909,1.341326377849877,1.0102048059013697,0.14225873071598868,1,0,1,0,1.0323227633769878,0.33146860503442699,6.9837332530791354,-99.854239384102982,80.145760615897018,null,1000000000,537103800.25,null,7.571011418568073,-21.298074638938754,null,48.202007400164803,-78.55616474516421,null,0,0]
[23308.75,23.30875,2.0332529509578605,1.0566143995017867,1.000107236942277,1.464427260186908E-2,1,0,140599.37327441984,1.5707892143876596,4.4203233681146763,1.3425930032594224,1.0103218892900943,0.14306557827118907,1,0,1,0,1.0326928358738303,0.3333239773604601,6.9393620401822069,-100.07028150475354,79.929718495246462,null,1000000000,543297826.5625,null,7.567442282330398,-21.271733651368432,null,48.161205323505541,-78.798547853385116,null,0,0]
[23442,23.442,2.0420709689776135,1.0590518963507072,1.0001084664710695,1.4727977989577878E-2,1,0,141403.14295266819,1.5707892548163032,4.444303399199435,1.343845962054816,1.0104396302487018,0.14387223831643239,1,0,1,0,1.0330649703210419,0.3351785165515096,6.8951223194401976,-100.28583237177502,79.714167628224985,null,1000000000,549527364,null,7.5639097088955385,-21.246164932944286,null,48.120498176198396,-79.039667438830733,null,0,0]
[23578.5,23.578499999999998,2.0511165313070467,1.0615270980038101,1.0001097332541538,1.4813724758086058E-2,1,0,142226.51676941063,1.570789295757206,4.4688754649708402,1.345115536040246,1.0105609245206488,0.14469837754243045,1,0,1,0,1.0334483182166159,0.33707742054604234,6.8499389327189961,-100.50613264237431,79.493867357625689,null,1000000000,555945662.25,null,7.5603279399712084,-21.220760338451349,null,48.078896558401524,-79.285372303922955,null,0,0]
[23715,23.715,2.060174549659791,1.0639805490226533,1.0001110073905346,1.4899471308742787E-2,1,0,143049.89058615334,1.5707893362268095,4.4934546549717833,1.3463712228957394,1.0106829083406885,0.14552431791118189,1,0,1,0,1.0338338278308645,0.33897544216310199,6.8048915286864755,-100.7259204026555,79.274079597344496,null,1000000000,562401225,null,7.5567826417763575,-21.196139997209801,null,48.037394452563859,-79.529780405445692,null,0,0]
[23851.5,23.851500000000001,2.0692448604589493,1.0664125056999856,1.0001122888801839,1.4985217640288004E-2,1,0,143873.26440289628,1.570789376233205,4.5180408529298814,1.3476132453410747,1.0108055814591774,0.14635005836800999,1,0,1,0,1.034221498124813,0.34087257732435605,6.7599791102797351,-100.94519728264414,79.054802717355855,null,1000000000,568894052.25,null,7.5532728930111315,-21.172291088351393,null,47.995991782922339,-79.772906194292759,null,0,0]
[23988,23.988,2.0783273027631184,1.0688232208746153,1.0001135777230732,1.5070963751461665E-2,1,0,144696.6382196394,1.5707894157843001,4.5426339450571733,1.3488418214436557,1.0109289436251825,0.14717559785983883,1,0,1,0,1.0346113280554572,0.34276882196738734,6.7152006908187198,-101.16396498202411,78.836035017975888,null,1000000000,575424144,null,7.549797797388015,-21.149201057650476,null,47.954688459084437,-80.014763924373625,null,0,0]
[24127.75,24.127749999999999,2.087638396564957,1.0712695883186945,1.0001149048706082,1.5158751207090711E-2,1,0,145539.61617487669,1.570789455813467,4.567819613061995,1.3500859419260047,1.0110559565739001,0.14802058375661714,1,0,1,0,1.0350126759365066,0.34470928849224103,6.6694939214430491,-101.3874157697136,78.612584230286402,null,1000000000,582148320.0625,null,7.5462749514789387,-21.12633462391576,null,47.912504535617842,-80.261081145797817,null,0,0]
[24267.5,24.267499999999998,2.0969618732885156,1.0736942161703749,1.0001162397256458,1.5246538429056484E-2,1,0,146382.59413011419,1.5707894953815995,4.5930122737561723,1.351316416300163,1.0111836912360967,0.14886535677596127,1,0,1,0,1.0354162852930044,0.34664881302198064,6.6239255470610949,-101.61033665256551,78.389663347434492,null,1000000000,588911556.25,null,7.5427866040972704,-21.104237831194187,null,47.870424508617553,-80.50609882137131,null,0,0]
[24407.25,24.407250000000001,2.106297568495664,1.0760973647989338,1.0001175822881547,1.5334325416006843E-2,1,0,147225.57208535192,1.570789534496617,4.6182118127029153,1.3525334641916016,1.0113121473383027,0.14970991579303361,1,0,1,0,1.0358221549927207,0.34858739124916999,6.5784945410240105,-101.83272965431284,78.167270345687157,null,1000000000,595713852.5625,null,7.5393318697554328,-21.082898031878457,null,47.828448236922306,-80.749831622434385,null,0,0]
[24547,24.547000000000001,{"$f":"SQRT(1+(A333/pole1)^2)","v":2.1156453204371237},{"$f":"ATAN(A333/pole1)","v":1.0784792909734031},{"$f":"SQRT(1+(A333/Zero1)^2)","v":1.0001189325581044},{"$f":"ATAN(A333/Zero1)","v":1.5422112166589666E-2},{"$f":"IF(VIN_nom>Vout, 1, SQRT(1+(A333/z_RHP)^2))","v":1},{"$f":"IF(VIN_nom>Vout, 0, -ATAN(A333/z_RHP))","v":0},{"$f":"SQRT(1+(A333/Pole2)^2)","v":148068.55004058988},{"$f":"ATAN(A333/Pole2)","v":1.5707895731662582},4.6434181179186869,1.3537373006179956,{"$f":"SQRT(1+(A333/pole4)^2)","v":1.0114413246056426},{"$f":"ATAN(A333/pole4)","v":0.15055425968478747},{"$f":"IF(VOUT_setting=1,1,SQRT(1+(A333*zterm1)^2))","v":1},{"$f":"IF(VOUT_setting=1,0,ATAN(((A333*zterm1))))","v":0},1,{"$f":"IF(VOUT_setting=1,0,ATAN(A333*$Q$4/(1+Afbr-$Q$5*(A333)^2)))","v":0},{"$f":"SQRT((1-(Z333/pterm2))^2+(A333/pterm1)^2)","v":1.0362302838991275},{"$f":"IF((ATAN((A333/pterm1)/(1-A333^2/pterm2))>0),ATAN((A333/pterm1)/(1-A333^2/pterm2)),PI()+ATAN((A333/pterm1)/(1-A333^2/pterm2)))","v":0.35052501888403759},{"$f":"20*LOG10(((E333*K333*G333*O333)/(C333*I333*S333*M333*Q333))*Adc)","v":6.5331998870382444},{"$f":"((F333+L333+H333+P333)-(D333+J333+T333+N333+R333))*radconv","v":-102.05459685752136},{"$f":"IF(V333>0,V333,V333+180)","v":77.945403142478639},null,{"$f":"IF(U333<0,A333,1000000000)","v":1000000000},{"$f":"A333^2","v":602555209},null,{"$f":"20*LOG10((K333/(I333*M333))*AEA)","v":7.5359098870874615},{"$f":"(L333-(J333+N333))*radconv","v":-21.06230284246082},null,{"$f":"20*LOG10((E333*G333/(C333*S333))*Acs*Am)","v":47.786575565604522},{"$f":"(F333+H333-(D333+T333))*radconv","v":-80.992294015060537},null,{"$f":"SUM((U334<0)*(U333>0))*A333","v":0},0]
[24690,{"$f":"A334/1000","v":24.69},2.1252227765723837,1.0808949063982047,1.000120322208037,1.551194022342431E-2,1,0,148931.13213432196,1.5707896122820497,4.6692175060975716,1.3549556769291877,1.0115742522243356,0.15141801562348667,1,0,1,0,1.0366502416125278,0.35250671916070075,6.486991964839989,-102.28108171061876,77.718918289381236,null,1000000000,609596100,null,7.5324413523943843,-21.041986832934171,null,47.743836178099343,-81.239094877684593,null,0,0]
[24833,24.832999999999998,2.1348125224904817,1.0832888334183846,1.0001217199279979,1.5601768029905403E-2,1,0,149793.71422805425,1.5707896509473476,4.6950237492733073,1.356160661378544,1.0117079343539528,0.15228154394134502,1,0,{"$f":"IF(VOUT_setting=1,1,SQRT((1+Afbr-$Q$5*(A335)^2)^2+(A335*$Q$4)^2))","v":1},0,1.0370725624125325,0.35448741508647347,6.4409246896319106,-102.50702060858151,77.492979391418487,null,1000000000,616677889,null,7.5290053597045024,-21.022425053046497,null,47.701204895581142,-81.484595555534995,null,0,0]
[24976,24.975999999999999,2.1444143933129904,1.0856613357472313,1.0001231257179533,1.5691595584584352E-2,1,0,150656.29632178679,1.5707896891698891,4.72083673502829,1.3573524701132433,1.0118423706954416,0.15314484344100351,1,0,1,0,1.0374972450677078,0.35646710212300331,6.3949970047450035,-102.73241594864116,77.267584051358838,null,1000000000,623800576,null,7.525601059633602,-21.003605050316391,null,47.658681510765142,-81.728810898324767,null,0,0]
[25119,25.119,2.1540282268947357,1.0880126733637143,1.0001245395778688,1.5781422886012593E-2,1,0,151518.87841551949,1.5707897269572364,4.746656353361236,1.358531314729071,1.0119775609482218,0.15400791292710167,1,0,1,0,1.0379242883420545,0.35844577575149067,6.3492078639038905,-102.95727017606902,77.042729823930983,null,1000000000,630964161,null,7.5222276260019152,-20.985514633142547,null,47.616265803555713,-81.971755542926488,null,0,0]
[25265.25,25.265250000000002,2.1638727641894748,1.090395825856507,1.0001259939180855,1.5873291453559424E-2,1,0,152401.06464774639,1.5707897651609453,4.7730695294269658,1.3597237577172776,1.01211660319941,0.15489035847077431,1,0,1,0,1.0383634775569694,0.36046836632851487,6.3025202839467633,-103.18667762234,76.81332237766,null,1000000000,638332857.5625,null,7.5188086126040385,-20.967755276801899,null,47.572997236996464,-82.218922345538076,null,0,0]
[25411.5,25.4115,2.1737294796615014,1.0927573789838949,1.0001274566991747,1.5965159753148647E-2,1,0,153283.25087997352,1.570789802924909,4.7994894177100882,1.3609030742161821,1.0122564333791821,0.15577256090431235,1,0,1,0,1.0388051332817851,0.36248988741234472,6.2559754358058104,-103.41552439209562,76.58447560790438,null,1000000000,645744332.25,null,7.5154202077672316,-20.950734058518716,null,47.529840793692316,-82.464790333576929,null,0,0]
[25557.75,25.557749999999999,2.183598208394729,1.0950975990795466,1.0001289279210992,1.6057027783230756E-2,1,0,154165.43711220086,1.5707898402566767,4.8259159079707867,1.362069476558327,1.0123970511610574,0.15665451895553206,1,0,1,0,1.0392492541797322,0.36451033423277879,6.2095722326187381,-103.64381323369078,76.356186766309222,null,1000000000,653198585.0625,null,7.5120615982453813,-20.93443874007621,null,47.486796200027086,-82.709374493614561,null,0,0]
[25704,25.704000000000001,2.1934787882417788,1.0974167486217474,1.000130407583822,1.614889554225625E-2,1,0,155047.6233444284,1.5707898771636257,4.8523488923435103,1.3632231725918593,1.0125384562168971,0.15753623135447528,1,0,1,0,1.0396958389092155,0.36652970204119983,6.1633095980186177,-103.8715469328743,76.128453067125704,null,1000000000,660695616,null,7.508731993062657,-20.918857340312243,null,47.443863170609688,-82.952689592562038,null,0,0]
[25853.75,25.853750000000002,2.203607939840198,1.0997698363670165,1.0001319314034558,1.624296156345938E-2,1,0,155950.92172580346,1.5707899145211572,4.8794210798194468,1.3643915248713445,1.0126840607414203,0.15843878869799832,1,0,1,0,1.0401556627125581,0.3685962736088631,6.1160843649475902,-104.10415838502857,75.895841614971431,null,1000000000,668416389.0625,null,7.5053519553560344,-20.903630552677154,null,47.400017975245291,-83.200527832351398,null,0,0]
[26003.5,26.003499999999999,2.2137491811681071,1.1021013778140769,1.0001334640726465,1.6337027297189128E-2,1,0,156854.22010717879,1.5707899514484167,{"$f":"SQRT(1+(A343/Zero2)^2)","v":4.9064998544277438},{"$f":"ATAN(A343/Zero2)","v":1.3655469825354873},1.0128304899706821,0.15934108580322559,1,0,1,0,1.0406180668233658,0.37066170389467124,6.0690042579132344,-104.33619382289696,75.663806177103041,null,1000000000,676182012.25,null,7.5020007169037495,-20.889127636871663,null,47.356289106663219,-83.447066186025296,null,0,0]
[26153.25,26.15325,2.2239023468339916,1.104411642546498,1.0001350055913529,1.6431092741782172E-2,1,0,157757.51848855425,1.5707899879527951,4.9335851077047996,1.3666897548466526,1.0129777435470413,0.16024312131413954,1,0,1,0,1.0410830497859445,0.37272598787150324,6.0220681543672789,-104.56765633742178,75.432343662578219,null,1000000000,683992485.5625,null,7.4986774965564527,-20.875336525774838,null,47.312676223464564,-83.692319811646939,null,0,0]
[26303,26.303000000000001,2.2340672742602377,1.1067008961586104,1.0001365559595348,1.6525157895575213E-2,1,0,158660.81686993001,1.5707900240415154,4.9606767335301853,1.3678200466300228,1.0131258211110516,0.16114489387721151,1,0,1,0,1.0415506101394814,0.37478912053616259,5.9752749424890812,-104.79854904671434,75.201450953285658,null,1000000000,691847809,null,7.4953815346332018,-20.862245406630532,null,47.269178973509611,-83.936303640083821,null,0,0]
[26456,26.456,2.2444647906480877,1.1090184051805461,1.0001381491147103,1.6621264228102933E-2,1,0,159583.71938979987,1.5707900604915179,4.9883627980187955,1.368962187743372,1.013277963008665,0.16206596448894134,1,0,1,0,1.0420309782577242,0.37689583479196098,5.9276126166082577,-105.03386756289629,74.96613243710371,null,1000000000,699919936,null,7.4920414246636478,-20.849581088329735,null,47.224856757598346,-84.184286474566548,null,0,{"$f":"IF(AH346>0,W346,0)","v":0}]
[26609,26.609000000000002,2.2548742505063877,1.1113145292226783,1.0001397515075598,1.6717370253561167E-2,1,0,160506.62190966998,1.5707900965223502,5.0160552979201229,1.3700917193142659,1.0134309642834578,0.16298675776704127,1,0,1,0,1.0425140337552599,0.37900133673760916,5.8800971390898829,-105.26859792682964,74.731402073170358,null,1000000000,708038881,null,7.4887282314862578,-20.837623329530832,null,47.180654473257356,-84.430974597298814,null,0,0]
[26762,26.762,2.2652954891876473,1.1135895390433501,1.0001413631380387,1.6813475970176048E-2,1,0,161429.5244295403,1.5707901321412014,5.0437541272341537,1.3712088461803118,1.0135848245462598,0.16390727227604951,1,0,1,0,1.0429997750578406,0.38110562111472263,5.8327273576892686,-105.50274353247876,74.49725646752124,null,1000000000,716204644,null,7.485441209907445,-20.826360312069433,null,47.136571713435558,-84.676383220409349,null,0,0]
[26915,26.914999999999999,2.2757283448756453,1.1158437013185201,1.0001429840061018,1.6909581376173755E-2,1,0,162352.42694941079,1.5707901673550977,5.0714591822526787,1.3723137688284446,1.013739543405952,0.16482750658326284,1,0,1,0,1.043488200585851,0.38320868269118769,5.7855021311041739,-105.73630779083373,74.263692209166265,null,1000000000,724417225,null,7.4821796352452274,-20.815780467205027,null,47.092608061512678,-84.920527323628704,null,0,0]
[27071.75,27.071750000000002,2.2864287891367154,1.1181317670016455,1.0001446541812531,1.7008041982843475E-2,1,0,163297.94962908226,1.5707902030192933,5.0998496331135632,1.373433321505571,1.01389894440443,0.16577000357038246,1,0,1,0,1.0439913793870814,0.38536201632799799,5.7372681542833925,-105.97499734969229,74.025002650307712,null,1000000000,732879648.0625,null,7.4788637733312004,-20.805637966825152,null,47.047689946605928,-85.169359382867142,null,0,0]
[27228.5,27.2285,2.2971410918589195,1.1203985044972973,1.0001463340522652,1.7106502259713878E-2,1,0,164243.47230875393,1.5707902382728631,5.128246405337145,1.3745404769013017,1.0140592457663054,0.16671220341648016,1,0,1,0,1.0444973722322426,0.38751405545504891,5.6891835143977376,-106.21308400582146,73.786915994178543,null,1000000000,741391212.25,null,7.4755731442625404,-20.796188729893888,null,47.002895935788935,-85.416895275927573,null,0,0]
[27385.25,27.385249999999999,2.3078650879137741,1.122644187666799,1.0001480236190894,1.7204962204877602E-2,1,0,165188.99498842578,1.5707902731228582,5.1566493944914864,1.3756354371325472,1.0142204470646601,0.16765410458998903,1,0,1,0,1.0450061774055226,0.38966479453210168,5.6412470188046218,-106.45057146520192,73.549428534798082,null,1000000000,749951917.5625,null,7.4723070314811268,-20.787421088616952,null,46.958225552977233,-85.66315037658498,null,0,0]
[27542,27.542000000000002,2.3186006150492093,1.1248690861571149,1.0001497228816767,1.7303421816427311E-2,1,0,166134.51766809786,1.5707903075761693,5.1850584984102888,1.3767184000050279,1.0143825478704527,0.16859570556243278,1,0,1,0,1.0455177931854329,0.39181422804806243,5.5934574862111761,-106.68746344120021,73.312536558799792,null,1000000000,758561764,null,7.4690647382378632,-20.779323622380943,null,46.913678313627045,-85.908139818819279,null,0,0]
[27702.5,27.702500000000001,2.3296047546517142,1.1271259526689552,1.0001514728428988,1.7404236573402988E-2,1,0,167102.66050757089,1.5707903424497225,5.2141534775177591,1.3778150419453583,1.014549458279441,0.16955952022106013,1,0,1,0,1.0460445590434391,0.39401372490819159,5.5446757201841255,-106.9294095500415,73.070590449958502,null,1000000000,767428506.25,null,7.4657688517210063,-20.771715177833876,null,46.86819243411685,-86.157694372207629,null,0,0]
[27863,27.863,2.3406206483658152,1.1293615870520415,1.0001532329692402,1.7505050976564254E-2,1,0,168070.80334704416,1.5707903769215095,5.2432546576923933,1.3788995119851499,1.0147173108321221,0.17052301690979974,1,0,1,0,1.0465742679246222,0.39621184139270638,5.496045562155695,-107.17073923526705,72.82926076473295,null,1000000000,776346769,null,7.4624965205164706,-20.764785890465038,null,46.822834607292954,-86.405953344802043,null,0,0]
[28023.5,28.023499999999999,2.3516481310111383,1.1315762654892059,1.000155003260647,1.7605865023863722E-2,1,0,169038.9461865176,1.5707904109984334,5.2723619362524863,1.3799720091454877,1.0148861050610309,0.17148619399798706,1,0,1,0,1.0471069179628576,0.39840857168073107,5.4475657799655064,-107.41145649149041,72.588543508509588,null,1000000000,785316552.25,null,7.4592470571083505,-20.758524264171516,null,46.777604288510886,-86.652932227318885,null,0,0]
[28184,28.184000000000001,2.362687040318963,1.1337702598322037,1.0001567837170653,1.7706678713254043E-2,1,0,170007.08902599121,1.5707904446872403,5.3014752127501081,1.3810327281872803,1.0150558404963916,0.17244904985841128,1,0,1,0,1.0476425072860491,0.40060390998362605,5.3992351532542866,-107.65156531129854,72.34843468870146,null,1000000000,794337856,null,7.45601979306063,-20.752919047129428,null,46.73250092584739,-86.898646264169102,null,0,0]
[28348,28.347999999999999,2.3739783108041559,1.1359910110900451,1.0001586134995082,1.7809690460176331E-2,1,0,170996.34401461243,1.570790478716648,5.3312294515257381,1.3821046102904131,1.0152302490537162,0.17343256907459897,1,0,1,0,1.0481928103018441,0.40284567787007575,5.3500033999559014,-107.89628581545736,72.103714184542639,null,1000000000,803609104,null,7.4527444071557483,-20.747858176377544,null,46.686544558453889,-87.148427639079813,null,0,0]
[28512,28.512,2.3852811782471131,1.1381907266553242,1.0001604538950155,1.7912701829087833E-2,1,0,171985.59900323386,1.5707905123545842,5.360989747521768,1.3831645929884493,1.0154056393155524,0.17441574947646657,1,0,1,0,1.0487461782227767,0.40508598028344733,5.3009248392015342,-108.14037947007907,71.859620529920932,null,1000000000,812934144,null,7.4494908466313703,-20.743459656256924,null,46.6407195582239,-87.396919813822151,null,0,0]
[28676,28.675999999999998,2.3965954785664878,1.1403696830163375,1.0001623049035282,1.8015712817804456E-2,1,0,172974.85399185549,1.5707905456077649,5.3907560004194268,1.3842128709951329,1.0155820107732811,0.17539858933927724,1,0,1,0,1.0493026090327062,0.40732481115268199,5.2519982062360659,-108.38385051434416,71.616149485655839,null,1000000000,822312976,null,7.4462584561550873,-20.739712232056458,null,46.595025315734716,-87.644138282287699,null,0,0]
[28840,28.84,2.407921050600442,1.1425281522559645,1.0001641665249879,1.8118723424142173E-2,1,0,173964.10898047729,1.5707905784827541,5.4205281120836437,1.385249634850553,1.0157593629157924,0.17638108694212032,1,0,1,0,1.0498621007092803,0.4095621644420559,5.2032222485213309,-108.62670317638916,71.373296823610843,null,1000000000,831745600,null,7.443046598617487,-20.73660488840838,null,46.549461215557585,-87.890098287980791,null,0,0]
[29008,29.007999999999999,2.4195343780874419,1.1447183042024924,1.0001660845561688,1.8224246085527928E-2,1,0,174977.49213955348,1.5707906117741373,5.4510323473199982,1.386299941704435,1.0159420570386246,0.17738719122280433,1,0,1,0,1.0504384101638633,0.4118525489746872,5.1534115692739935,-108.87484229031041,71.125157709689589,null,1000000000,841464064,null,7.4397770459039192,-20.734074174973369,null,46.502920089023817,-88.140768115337053,null,0,0]
[29176,29.175999999999998,2.4311592006012095,1.1468875216254155,1.0001680137241884,1.8329768341015185E-2,1,0,175990.87529862986,1.5707906446821263,5.4815425289022315,1.3873385577098003,1.0161257791741583,0.17839293270087284,1,0,1,0,1.0510179273006874,0.41414137026329234,5.1037563827553125,-109.12234142760691,70.877658572393088,null,1000000000,851238976,null,7.43652774259838,-20.732192488792517,null,46.45651420581067,-88.39014893881442,null,0,0]
[29344,29.344000000000001,2.4427953540334713,1.1490360831255122,1.0001699540289823,1.843529018825632E-2,1,0,177004.25845770643,1.5707906772133062,5.5120585580882375,1.3883656747767934,1.0163105287648804,0.1793983095389883,1,0,1,0,1.051600649926004,0.4164286219352723,5.0542553814340554,-109.36920508540318,70.630794914596819,null,1000000000,861070336,null,7.4332980595115945,-20.730948729330077,null,46.410242887576196,-88.6382563560731,null,0,0]
[29512,29.512,2.4544426772295567,1.1511642627858443,1.0001719054704854,1.8540811624903779E-2,1,0,178017.64161678316,1.5707907093741122,5.5425803382917866,1.3893814806865972,1.0164963052505671,0.18040331990409381,1,0,1,0,1.0521865758395605,0.41871429765712187,5.0049072705934226,-109.61543774102627,70.38456225897373,null,1000000000,870958144,null,7.4300873850321665,-20.73033203285906,null,46.364105451214989,-88.885105708167231,null,0,0]
[29684,29.684000000000001,2.466378724250454,1.1533222793934421,1.0001739149124191,1.8648845048884085E-2,1,0,179055.15294631431,1.5707907419235116,5.5738346869350499,1.390409945980996,1.0166875682589307,0.18143187751260839,1,0,1,0,1.0527897686651686,0.42105275497626565,4.9545412602576278,-109.86688401491851,70.133115985081488,null,1000000000,881139856,null,7.426819338000695,-20.730339187011509,null,46.317007487910672,-89.136544827907031,null,0,0]
[29856,29.856000000000002,2.4783261466167845,1.1554594993022231,1.0001759360275564,1.8756878037506104E-2,1,0,180092.66427584569,1.5707907740978779,5.6050948654981481,1.3914269406320852,1.0168799064470668,0.18246004711456898,1,0,1,0,1.0533963144444929,0.42338954709691262,4.904332801565717,-110.11767830866245,69.882321691337552,null,1000000000,891380736,null,7.423569972103305,-20.730981307988834,null,46.270048395116142,-89.386697000673635,null,0,0]
[30028,30.027999999999999,2.4902847806050423,1.15757620245057,1.0001779688158265,1.8864910588250749E-2,1,0,181130.17560537718,1.5707908059036555,5.6363607769800161,1.3924326534076512,1.0170733192049957,0.18348782675689845,1,0,1,0,1.0540062107957167,0.42572466734992298,4.8542805458808074,-110.36782535244537,69.632174647554635,null,1000000000,901680784,null,7.4203386845914796,-20.732247468659722,null,46.223227426943055,-89.635577883785643,null,0,0]
[30200,30.2,2.5022544654693712,1.159672664163399,1.0001800132771581,1.8972942698598991E-2,1,0,182167.68693490888,1.570790837347142,5.6676323265024466,1.3934272690017637,1.0172678059197942,0.1845152144912964,1,0,1,0,1.0546194553302553,0.42805810910927522,4.8043831580059901,-110.61732984826502,69.382670151734985,null,1000000000,912040000,null,7.4171248896286803,-20.734126975564909,null,46.176543834031051,-89.883202872700096,null,0,0]
[30375.75,30.37575,2.5144963680053096,1.1617942071291665,1.0001821143700125,1.9083329702665876E-2,1,0,183227.81842424162,1.5707908691083476,5.6995913957378956,1.3944322948099055,1.0174676415907413,0.18556459482765578,1,0,1,0,1.0552495260059709,0.43044068469151958,4.7535564850682333,-110.87161526938932,69.128384730610676,null,1000000000,922686188.0625,null,7.413858502816181,-20.736670122620012,null,46.12898354790579,-90.134945146769311,null,0,0]
[30551.5,30.551500000000001,2.526749478454589,1.1638951832362978,1.0001842276503254,1.9193716241606422E-2,1,0,184287.94991357453,1.5707909005041354,5.7315561577932668,1.3954261115991167,1.0176685972553794,0.186613561883403,1,0,1,0,1.0558830873895706,0.43282149394293307,4.7028887302863813,-111.12523964896856,68.874760351031441,null,1000000000,933394152.25,null,7.4106091946322463,-20.739831798981296,null,46.081565101307874,-90.385407849987288,null,0,0]
[30727.25,30.727250000000002,2.5390136345512877,1.1659758718328697,1.0001863531180195,1.9304102312733419E-2,1,0,185348.08140290761,1.5707909315407755,5.7635265179507043,1.3964089039194982,1.0178706722503557,0.18766211359557969,1,0,1,0,1.0565201369115307,0.43520052993431879,4.652378511726222,-111.3782079038274,68.621792096172598,null,1000000000,944163892.5625,null,7.4073763912911881,-20.743601312867291,null,46.03428768608876,-90.634606590960132,null,0,0]
[30903,30.902999999999999,2.5512886770046821,1.1680365476007584,1.0001884907730172,1.941448791335974E-2,1,0,186408.21289224087,1.5707909622243956,5.7955023835659496,1.3973808523344944,1.0180738659091508,0.188710247906514,1,0,1,0,1.0571606719953686,0.43757778578362516,4.6020244614607977,-111.63052491485138,68.369475085148622,null,1000000000,954995409,null,7.4041595351494118,-20.747968201209893,null,45.987150491965124,-90.882556713641492,null,0,0]
[31083,31.082999999999998,2.5638716765128238,1.1701265923885238,1.0001906927538089,1.952754237654698E-2,1,0,187493.98056268194,1.5707909932903381,5.8282571041021001,1.3983652486579468,1.0182831320811556,0.18978329347361211,1,0,1,0,1.0578203068615777,0.44001067624100931,4.5506132095379126,-111.8882734795735,68.111726520426501,null,1000000000,966152889,null,7.4008808527821568,-20.753049208681023,null,45.939017922409491,-91.135224270892493,null,0,0]
[31263,31.263000000000002,2.5764657663255051,1.1721962133381403,1.0001929075182934,1.9640596340497751E-2,1,0,188579.74823312319,1.5707910239985499,5.8610174093005529,1.3993386412995392,1.0184935702490405,0.19085589685622587,1,0,1,0,1.0584835924117104,0.44244168495954772,4.4993629100816186,-112.14534916620612,67.854650833793883,null,1000000000,977375169,null,7.3976177638326801,-20.758735324881339,null,45.891030711902673,-91.386613841324774,null,0,0]
[31443,31.443000000000001,2.5890707846020899,1.1742456908927972,1.0001951350663854,1.9753649802325461E-2,1,0,189665.51590356464,1.5707910543551742,5.8937832060350948,1.4003012119201932,1.0187051796864932,0.1919280558611417,1,0,1,0,1.0591505258558118,0.44487080469971313,4.4482721381998109,-112.40175709461739,67.598242905382605,null,1000000000,988662249,null,7.3943697184925679,-20.765016016096823,null,45.84318798536097,-91.636741078520558,null,0,0]
[31623,31.623000000000001,2.6016865724992906,1.1762753007400861,1.0001973753979996,1.9866702759143578E-2,1,0,190751.28357400623,1.5707910843662154,5.9265544032235145,1.4012531382440456,1.0189179596637639,0.19299976830104953,1,0,1,0,1.0598211043967416,0.44729802827396237,4.3973394837486834,-112.65750234106969,67.342497658930313,null,1000000000,1000014129,null,7.3911361825025415,-20.771880974504914,null,45.795488866899881,-91.885621366564777,null,0,0]
[31807,31.806999999999999,2.6145936801816063,1.1783297603311766,1.0001996787274674,1.998226747891757E-2,1,0,191861.17941490226,1.5707911146930893,5.9600593382845934,1.40221539779261,1.0191366771683799,0.1940948327408808,1,0,1,0,1.0605103492632215,0.44977722288074323,4.345436966565563,-112.91825111934395,67.08174888065605,null,1000000000,1011685249,null,7.3878452461910191,-20.779491871883771,null,45.74687728602828,-92.138759247460158,null,0,0]
[31991,31.991,2.6275117151038541,1.1803640271348628,1.000201995414745,2.0097831664888443E-2,1,0,192971.07525579847,1.5707911446711058,5.9935697303201092,1.4031668981173944,1.0193566162618792,0.19518942594481078,1,0,1,0,1.0612033970977863,0.45225442108948616,4.2936967390333924,-113.17831801982246,66.821681980177544,null,1000000000,1023424081,null,7.3845683898656223,-20.78769220756039,null,45.698413914821501,-92.390625812262073,null,0,0]
[32175,32.174999999999997,2.6404405168854508,1.1823783808092745,1.000204325459739,2.0213395313973179E-2,1,0,194080.97109669485,1.5707911743062506,6.0270854883082841,1.4041078169724839,1.0195777761537141,0.19628354559571171,1,0,1,0,1.0619002448901382,0.45472961539129952,4.2421173416463649,-113.43770831870712,66.562291681292876,null,1000000000,1035230625,null,7.381305089996804,-20.796471664557181,null,45.650097817303291,-92.641236654149964,null,0,0]
[32359,32.359000000000002,2.6533799281393025,1.1843730962106758,1.0002066688623568,2.0328958423088853E-2,1,0,195190.8669375914,1.5707912036043719,6.0606065232263582,1.4050383282552463,1.0198001560496359,0.19737718938299523,1,0,1,0,1.0626008896226566,0.45720279833411942,4.1906973303144106,-113.69642724166957,66.303572758330432,null,1000000000,1047104881,null,7.3780548379163822,-20.805820147237014,null,45.601928058051769,-92.890607094432539,null,0,0]
[32547.5,32.547499999999999,2.6666466327773191,1.1863965132343333,1.0002090834279929,2.044734724073273E-2,1,0,196327.9069702492,1.5707912332755114,6.0949527471323002,1.4059809819741544,1.0200292388746282,0.19849708402178176,1,0,1,0,1.063322603891617,0.45973437325168087,4.1381835514540652,-113.96078273302413,66.039217266975868,null,1000000000,1059339756.25,null,7.3747381096589946,-20.815977003945736,null,45.552731007448806,-93.144805729078413,null,0,0]
[32736,32.735999999999997,2.6799241471226227,1.1883998886098559,1.000211512012404,2.0565735485123048E-2,1,0,197464.94700290714,1.5707912626049469,6.1293043262885512,1.4069130703409525,1.0202596004081521,0.19961647434824559,1,0,1,0,1.0640482966571763,0.46226382157506557,4.0858340306746648,-114.2244445460384,65.775555453961601,null,1000000000,1071645696,null,7.3714340401756377,-20.826710296194257,null,45.50368555615276,-93.397734249844163,null,0,0]
[32924.5,32.924500000000002,2.6932123112999165,1.1903835027893841,1.0002139546154876,2.0684123152945391E-2,1,0,198601.98703556525,1.5707912915985478,6.1636611711567815,1.4078347683992645,1.020491239784256,0.20073535789959485,1,0,1,0,1.0647779646518136,0.46479113547755496,4.0336472645653547,-114.48741813115615,65.512581868843853,null,1000000000,1084022700.25,null,7.3681421279593904,-20.838009853950368,null,45.454790702259693,-93.649408277205779,null,0,0]
[33113,33.113,2.7065109684466773,1.192347631341647,1.0002164112371414,2.0802510240885429E-2,1,0,199739.02706822351,1.5707913202620489,6.1980231941704051,1.4087462473824375,1.0207241561329736,0.2018537322203427,1,0,1,0,1.0655116046005273,0.46731630719503797,3.9816217659688191,-114.74970888133305,65.250291118666951,null,1000000000,1096470769,null,7.3648618858296802,-20.849865725905531,null,45.406045445792877,-93.899843155427504,null,0,0]
[33305.75,33.305750000000003,2.7201201528547303,1.1943361764688407,1.0002189377429449,2.0923565930631969E-2,1,0,200901.70328198967,1.5707913492363013,6.2331652231189976,1.4096678841889694,1.020963643484665,0.20299679274465424,1,0,1,0,1.0662658893769086,0.4698961892915553,3.9285885086414023,-115.01721280507674,64.982787194923262,null,1000000000,1109272983.0625,null,7.3615192606666184,-20.862554030535279,null,45.356354813628521,-94.15465877454146,null,0,0]
[33498.5,33.4985,2.7337399863474352,1.196304914956982,1.0002214789063626,2.1044621007044156E-2,1,0,202064.37949575597,1.5707913778771185,6.2683124872397569,1.4105791862813712,1.0212044641878586,0.20413931564752436,1,0,1,0,1.0670243202839591,0.47247381529785132,3.8757207790616426,-115.28401397564731,64.715986024352688,null,1000000000,1122149502.25,null,7.3581878513302801,-20.875803648123796,null,45.306818493385094,-94.408210327523534,null,0,0]
[33691.25,33.691249999999997,2.7473703105492469,1.1982541262258255,1.0002240347272828,2.1165675466578715E-2,1,0,203227.05570952245,1.5707914061902237,6.3034648989608595,1.4114803250334271,1.0214466172994852,0.20528129832746408,1,0,1,0,1.0677868937968313,0.47504917711574574,3.8230170387686679,-115.55011797110791,64.449882028892091,null,1000000000,1135100326.5625,null,7.3548671804171128,-20.889604610950091,null,45.257435424005294,-94.660513360157822,null,0,0]
[33884,33.884,2.761010970091248,1.2001840847732095,1.0002266052055933,2.1286729305692476E-2,1,0,204389.73192328904,1.570791434181209,6.3386223726403967,1.4123714680836523,1.0216901018721523,0.20642273819108009,1,0,1,0,1.0685536063831513,0.47762226671545061,3.7704757663035089,-115.81553030590669,64.184469694093309,null,1000000000,1148125456,null,7.3515567842291318,-20.903947165764674,null,45.208204547728108,-94.911583140142042,null,0,0]
[34081.5,34.081499999999998,2.7749983419090523,1.2021419156568502,1.000229254232557,2.1410765666096395E-2,1,0,205581.06033947031,1.5707914625335764,6.3746514062294608,1.4132743751198735,1.021940966800613,0.20759174117299178,1,0,1,0,1.0693435029425296,0.48025640056031477,3.7168066517753844,-116.08677154398021,63.913228456019795,null,1000000000,1161548642.25,null,7.3481749955541655,-20.919194964886685,null,45.157917221874953,-95.167576579093506,null,0,0]
[34279,34.279000000000003,2.7889962438624103,1.2040801012998952,1.0002319186479849,2.1534801367593066E-2,1,0,206772.38875565174,1.5707914905592366,6.410685578279498,1.4141671324783394,1.0221932275942762,0.20876016876884018,1,0,1,0,1.0701377375578631,0.4828881319685257,3.6633049310485433,-116.35729812873788,63.642701871262119,null,1000000000,1175049841,null,7.3448030507832351,-20.934991311796171,null,45.107787445919037,-95.422306816941699,null,0,0]
[34476.5,34.476500000000001,2.8030045181922456,1.2059989215671827,1.000234598451754,2.1658836406371229E-2,1,0,207963.71717183333,1.5707915182638048,6.4467248026257398,1.4150499089435984,1.0224468832199674,0.20992801821536458,1,0,1,0,1.0709363064056301,0.48551745252516249,3.6099690217046962,-116.62711578468904,63.372884215310961,null,1000000000,1188629052.25,null,7.3414404929763535,-20.951326377849398,null,45.057814094382081,-95.675789406839641,null,0,0]
[34674,34.673999999999999,2.8170230101617064,1.2078986513293424,1.0002372936437405,2.1782870778619748E-2,1,0,209155.04558801511,1.5707915456527675,6.4827689950075076,1.415922869609447,1.0227019326398268,0.2110952867583463,1,0,1,0,1.0717392056547399,0.48814435389055072,3.556797359243411,-116.89623016648234,63.10376983351766,null,1000000000,1202286276,null,7.3380868784108877,-20.968190546377802,null,45.007996046486262,-95.928039620104528,null,0,0]
[34875.75,34.875749999999996,2.8313535578714579,1.2098198309437063,1.0002400627218886,2.1909573552792952E-2,1,0,210372.01018530471,1.5707915733108226,6.5195938657674439,1.4168046485230557,1.0229639084871962,0.21228707109493114,1,0,1,0,1.0725638496736465,0.49082527708003648,3.5026494745735666,-117.17041528718133,62.829584712818672,null,1000000000,1216317938.0625,null,7.3346698833716655,-20.985954133450644,null,44.957265156855641,-96.184461153730709,null,0,0]
[35077.5,35.077500000000001,2.8456944506367541,1.2117216539283762,1.0002428478573944,2.2036275623402733E-2,1,0,211588.97478259448,1.5707916006507248,6.5564237487878332,1.4176765215447014,1.0232273365560494,0.21347824347713248,1,0,1,0,1.073393004365977,0.49350365848862521,3.4486697377569344,-117.44387824685536,62.556121753144637,null,1000000000,1230431006.25,null,7.3312613249332141,-21.004250205693616,null,44.906693978477456,-96.439628041161768,null,0,0]
[35279.25,35.279249999999998,2.8600455328404975,1.2136043978034141,1.0002456490501239,2.216297698638698E-2,1,0,212805.9393798844,1.5707916276779317,6.5932585600733491,1.4185386533625051,1.0234922157250606,0.21466880099848895,1,0,1,0,1.0742266656246839,0.49617948946947427,3.394856537712311,-117.71662484888837,62.283375151111628,null,1000000000,1244625480.5625,null,7.3278607700727862,-21.023069160957196,null,44.856281333293268,-96.693555687931152,null,0,0]
[35481,35.481000000000002,{"$f":"SQRT(1+(A397/pole1)^2)","v":2.874406651863922},{"$f":"ATAN(A397/pole1)","v":1.2154683350896613},{"$f":"SQRT(1+(A397/Zero1)^2)","v":1.0002484662999422},{"$f":"ATAN(A397/Zero1)","v":2.228967763768373E-2},{"$f":"IF(VIN_nom>Vout, 1, SQRT(1+(A397/z_RHP)^2))","v":1},{"$f":"IF(VIN_nom>Vout, 0, -ATAN(A397/z_RHP))","v":0},{"$f":"SQRT(1+(A397/Pole2)^2)","v":214022.90397717449},{"$f":"ATAN(A397/Pole2)","v":1.5707916543977773},6.6300982174841625,1.4193912050629387,{"$f":"SQRT(1+(A397/pole4)^2)","v":1.0237585448678919},{"$f":"ATAN(A397/pole4)","v":0.21585874076251113},{"$f":"IF(VOUT_setting=1,1,SQRT(1+(A397*zterm1)^2))","v":1},{"$f":"IF(VOUT_setting=1,0,ATAN(((A397*zterm1))))","v":0},1,{"$f":"IF(VOUT_setting=1,0,ATAN(A397*$Q$4/(1+Afbr-$Q$5*(A397)^2)))","v":0},{"$f":"SQRT((1-(Z397/pterm2))^2+(A397/pterm1)^2)","v":1.0750648293352805},{"$f":"IF((ATAN((A397/pterm1)/(1-A397^2/pterm2))>0),ATAN((A397/pterm1)/(1-A397^2/pterm2)),PI()+ATAN((A397/pterm1)/(1-A397^2/pterm2)))","v":0.49885276145743296},{"$f":"20*LOG10(((E397*K397*G397*O397)/(C397*I397*S397*M397*Q397))*Adc)","v":3.3412082819947457},{"$f":"((F397+L397+H397+P397)-(D397+J397+T397+N397+R397))*radconv","v":-117.98866082183406},{"$f":"IF(V397>0,V397,V397+180)","v":62.01133917816594},null,{"$f":"IF(U397<0,A397,1000000000)","v":1000000000},{"$f":"A397^2","v":1258901361},null,{"$f":"20*LOG10((K397/(I397*M397))*AEA)","v":7.3244677983583237},{"$f":"(L397-(J397+N397))*radconv","v":-21.042401604015392},null,{"$f":"20*LOG10((E397*G397/(C397*S397))*Acs*Am)","v":44.806026049290153},{"$f":"(F397+H397-(D397+T397))*radconv","v":-96.946259217818664},null,{"$f":"SUM((U398<0)*(U397>0))*A397","v":0},0]
[35687.75,{"$f":"A398/1000","v":35.687750000000001},2.8891339410712602,1.2173592350345186,1.000251370028874,2.2419517587293072E-2,1,0,215270.02878753265,1.5707916814663963,6.6678558213006847,1.4202551112970163,1.0240329776231629,0.21707752704781599,1,0,1,0,1.0759284322811205,0.50158962175696664,3.2863999339930876,-118.26670735171534,61.73329264828466,null,1000000000,1273615500.0625,null,7.3209981785233191,-21.062736284124952,null,44.754687321123505,-97.203971067590373,null,0,0]
[35894.5,35.894500000000001,2.9038714555826663,1.2192309485029855,1.000254290620358,2.2549356780865192E-2,1,0,216517.15359789095,1.5707917082231881,6.705618345520258,1.421109288029353,1.0243089307015851,0.21829565844960136,1,0,{"$f":"IF(VOUT_setting=1,1,SQRT((1+Afbr-$Q$5*(A399)^2)^2+(A399*$Q$4)^2))","v":1},0,1.0767967548420505,0.50432377670198336,3.231761480239717,-118.5440195348551,61.455980465144904,null,1000000000,1288415130.25,null,7.3175356671363803,-21.083590883693521,null,44.703511378757071,-97.460428651161578,null,0,0]
[36101.25,36.10125,2.9186190405006767,1.2210837531243475,1.0002572280742463,2.2679195214029019E-2,1,0,217764.27840824943,1.5707917346735105,6.7433857074810648,1.4219538974775985,1.0245864028747469,0.2195131318834411,1,0,1,0,1.0776697925670375,0.5070552173411087,3.1772912664409372,-118.82060329480989,61.179396705190115,null,1000000000,1303300251.5625,null,7.3140798502238971,-21.104955931916749,null,44.652496981870769,-97.715647362893094,null,0,0]
[36308,36.308,2.9333765439380328,1.2229179214660317,1.0002601823903905,2.2809032882413632E-2,1,0,219011.40321860803,1.5707917608225987,6.7811578263523424,1.4227890983003884,1.0248653929088085,0.22072994427604223,1,0,1,0,1.078547540997737,0.50978393481269457,3.1229876579132769,-119.09646447480125,60.903535525198748,null,1000000000,1318270864,null,7.310630325959,-21.126822162537675,null,44.601642897608009,-97.969642312263574,null,0,0]
[36519.5,36.519500000000001,2.9484832028829855,1.2247752246625512,1.0002632220284429,2.2941852724310929E-2,1,0,220287.18023138132,1.5707917872660917,6.8198025844979728,1.4236339139808623,1.0251523619070098,0.22197402526607118,1,0,1,0,1.0794503249866281,0.51257251661843495,3.0676071520138559,-119.3779217937232,60.622078206276797,null,1000000000,1333673880.25,null,7.3071076547472158,-21.149699894807842,null,44.549785062920371,-98.228221898915336,null,0,0]
[36731,36.731000000000002,2.9635999291305297,1.2266135866879166,1.000266279312142,2.3074671756631613E-2,1,0,221562.95724415479,1.5707918134050574,6.8584521551752786,1.4244692086389836,1.0254409166824874,0.22321740802127887,1,0,1,0,1.0803580291601609,0.51535823021876837,3.0123975959190705,-119.65863506483983,60.341364935160172,null,1000000000,1349166361,null,7.3035907551970762,-21.173083118119557,null,44.498092406375733,-98.48555194672025,null,0,0]
[36942.5,36.942500000000003,2.9787265694091416,1.2284332835834262,1.0002693542413255,2.3207489974697033E-2,1,0,222838.73425692838,1.5707918392447258,6.897106457479774,1.4252951411787562,1.0257310558969268,0.22446008928802721,1,0,1,0,1.0812706487233072,0.51814106641785773,2.9573573018589117,-119.93861028688904,60.061389713110955,null,1000000000,1364748306.25,null,7.3000792340532499,-21.196962541823947,null,44.446563633459405,-98.741647745065094,null,0,0]
[37154,37.154000000000003,2.9938629734454336,1.230234586307879,1.0002724468158313,2.3340307373828716E-2,1,0,224114.51126970211,1.5707918647902084,6.9357654123007633,1.426111867013097,1.0260227782061826,0.22570206582501459,1,0,1,0,1.0821881788740206,0.52092101611760455,2.9024846025263953,-120.21785337372762,59.782146626272379,null,1000000000,1380419716,null,7.2965727096943924,-21.221329075996746,null,44.39519745848574,-98.9965242977309,null,0,0]
[37370.25,37.370249999999999,3.0093492620326079,1.2320576023937335,1.000275627089356,2.3476106818029443E-2,1,0,225418.94048489054,1.5707918906104401,6.975297324082268,1.4269375745406867,1.0263226876175331,0.22697120344024899,1,0,1,0,1.0831313877381383,0.52376040583324268,2.8465511048943357,-120.50261696576443,59.497383034235568,null,1000000000,1396535585.0625,null,7.2929922142402202,-21.246737227947236,null,44.342844456307844,-99.255879737817182,null,0,0]
[37586.5,37.586500000000001,3.0248454494281241,1.2338619459177487,1.0002788258093354,2.3611905396207861E-2,1,0,226723.36970007914,1.5707919161335637,{"$f":"SQRT(1+(A407/Zero2)^2)","v":7.0148339379688931},{"$f":"ATAN(A407/Zero2)","v":1.4277539750066972},1.0266242491699904,0.22823959750219722,1,0,1,0,1.0840797200623356,0.52659675901570735,2.7907893535924391,-120.78662740375844,59.213372596241555,null,1000000000,1412744982.25,null,7.2894161712558114,-21.272636015758266,null,44.290658747990364,-99.513991388000164,null,0,0]
[37802.75,37.802750000000003,3.040351384274032,1.2356478907334547,1.0002820429755923,2.3747703103363712E-2,1,0,228027.79891526783,1.5707919413646783,7.0543751749010593,1.4285612238176342,1.0269274614080801,0.22950724458646243,1,0,1,0,1.0850331706925582,0.52943006625597244,2.7351976311726114,-121.06989073950197,58.930109260498028,null,1000000000,1429047907.5625,null,7.2858442081133568,-21.299016339381602,null,44.238638988712992,-99.770874400120391,null,0,0]
[38019,38.018999999999998,3.0558669181901856,1.2374157056073782,1.0002852785879488,2.3883499934496927E-2,1,0,229332.22813045673,1.5707919663087664,7.0939209575727435,1.4293594729630046,1.0272323228700841,0.2307741412822826,1,0,1,0,1.0859917344681678,0.53226031825112918,2.6797742414677272,-121.35241293595776,58.647587064042241,null,1000000000,1445444361,null,7.2822759633053629,-21.32586929532318,null,44.186783843816102,-100.02654364063459,null,0,0]
[38240.5,38.240499999999997,3.0717689292532984,1.2392079186791085,1.000288611875829,2.4022592653903271E-2,1,0,230668.32556936709,1.5707919915659589,7.1344314448868458,1.4301679268656629,1.0275462938272217,0.23207101352163179,1,0,1,0,1.0869788651877275,0.53515610454944496,2.6231780746088234,-121.64103184522791,58.358968154772086,null,1000000000,1462335840.25,null,7.2786245789213924,-21.353855051814882,null,44.133839061341163,-100.28717679341305,null,0,{"$f":"IF(AH410>0,W410,0)","v":0}]
[38462,38.462000000000003,3.0876807052759445,1.2409816657400607,1.0002919645159483,2.4161684443617132E-2,1,0,232004.4230082776,1.5707920165322429,7.1749465425911563,1.4309672510188427,1.0278619919339671,0.23336709129558314,1,0,1,0,1.0879713493547136,0.53804866603800372,2.5667549780951591,-121.92888557522487,58.071114424775132,null,1000000000,1479325444,null,7.274976362048915,-21.38231836823816,null,44.081064181699986,-100.54656720698671,null,0,0]
[38683.5,38.683500000000002,3.1036020960669859,1.2427372197328825,1.0002953365081122,2.4300775298266009E-2,1,0,233340.52044718826,1.5707920412126151,7.2154661730231631,1.4317575982012414,1.0281794155993786,0.2346623709836132,1,0,1,0,1.0889691814037286,0.54093799306470536,2.5105031968970124,-122.21598025096459,57.784019749035409,null,1000000000,1496413172.25,null,7.2713309581457715,-21.411250283864032,null,44.028457804404972,-100.80472996710057,null,0,0]
[38905,38.905000000000001,3.1195329544116137,1.2444748484783876,1.0002987278521249,2.4439865212477603E-2,1,0,234676.61788609903,1.5707920656119589,7.2559902602465245,1.4325391178239661,1.0284985632257881,0.23595684898036781,1,0,1,0,1.089972355763331,0.54382407609333805,2.4544209982415612,-122.50232190445492,57.497678095545083,null,1000000000,1513599025,null,7.2676880233741095,-21.440642031774839,null,43.976018540521189,-101.06167987268006,null,0,0]
[39131.5,39.131500000000003,3.1358330660101337,1.2462334383794236,1.0003022157620072,2.458209387575503E-2,1,0,236042.87553807793,1.5707920902764347,7.2974336438934264,1.4333293025016631,1.0288266961895669,0.23727971491809619,1,0,1,0,1.0910036938940282,0.54677194324199596,2.3972464212041689,-122.79435472925994,57.205645270740064,null,1000000000,1531274292.25,null,7.2639650612792215,-21.471163833005598,null,43.922566925578685,-101.32319089625435,null,0,0]
[39358,39.357999999999997,3.1521427752901037,1.2479738351451974,1.0003057239068542,2.4724321544297056E-2,1,0,237409.13319005698,1.5707921146570292,7.3388815325350585,1.4341105621917596,1.0291566284236946,0.23860173498599449,1,0,1,0,1.0920406064441721,0.54971639848517162,2.3402455745452406,-123.0856126164926,56.914387383507403,null,1000000000,1549052164,null,7.2602439866164739,-21.502148517322112,null,43.869287153582505,-101.5834640991705,null,0,0]
[39584.5,39.584499999999998,3.1684619340388647,1.2496963092614264,1.0003092522864532,2.4866548212360003E-2,1,0,238775.39084203614,1.570792138758615,7.380333850271394,1.4348830463164395,1.0294883581982712,0.23992290537846339,1,0,1,0,1.0930830874387951,0.55265743200042616,2.28341667581534,-123.37610172236162,56.623898277638375,null,1000000000,1566932640.25,null,7.2565244642114388,-21.53358730569828,null,43.816177777257636,-101.84251441666335,null,0,0]
[39811,39.811,3.1847903969965792,1.2514011260969244,1.0003128009005902,2.5008773874200457E-2,1,0,240141.64849401548,1.5707921625859547,7.4217905228900545,1.4356469010017447,1.0298218837762068,0.24124322230665862,1,0,1,0,1.0941311308976391,0.55559503409086652,2.2267579656529577,-123.66582810690068,56.334171893099324,null,1000000000,1584915721,null,7.2528061691243204,-21.565471608916678,null,43.763237362182366,-102.100356497984,null,0,0]
[40042.75,40.042749999999998,3.2015068159722859,1.2531274541598079,1.0003164527106398,2.5154295109874159E-2,1,0,241539.57436971631,1.5707921866865826,7.4642125435406372,1.4364196781915728,1.030164996982752,0.24259325530612394,1,0,1,0,1.0952092178671149,0.55859716466207388,2.1689603143910308,-123.96148678039637,56.03851321960363,null,1000000000,1603421827.5625,null,7.2490026301677837,-21.598547311410361,null,43.709243249876977,-102.36293946898599,null,0,0]
[40274.5,40.274500000000003,3.2182326769705942,1.2548358430589761,1.0003201257036662,2.5299815279974578E-2,1,0,242937.50024541726,1.570792210509848,7.5066389713211601,1.4371837205856255,1.030509986504506,0.24394238684712094,1,0,1,0,1.0962931154698039,0.5615956827547699,2.1113371789409547,-124.25635949807834,55.743640501921661,null,1000000000,1622035350.25,null,7.2451997192178732,-21.632071815180048,null,43.65542302537682,-102.6242876828983,null,0,0]
[40506.25,40.506250000000001,3.2349678335363028,1.2565265611531604,1.0003238198794357,2.5445334378350375E-2,1,0,244335.42612111839,1.5707922340605114,7.5490697319262656,1.4379391745702357,1.0308568504576694,0.24529061292591908,1,0,1,0,1.0973828172848454,0.56459057838802473,2.0538867478017639,-124.55045244781346,55.449547552186544,null,1000000000,1640756289.0625,null,7.2413971193291715,-21.666036503782585,null,43.601775194126333,-102.88441594403088,null,0,0]
[40738,40.738,3.2517121421486164,1.2581998716822869,1.0003275352377134,2.5590852398850495E-2,1,0,245733.35199681963,1.5707922573432251,7.5915047527043304,1.4386861832983671,1.0312055869507497,0.24663792955732713,1,0,1,0,1.0984783168870276,0.56758184171704562,1.9966072334424958,-124.84377171829712,55.15622828170288,null,1000000000,1659584644,null,7.2375945233650363,-21.700432947089219,null,43.548298275731199,-103.14333877120789,null,0,0]
[40975.25,40.975250000000003,3.2688631681537617,1.2598951314382911,1.0003313607129185,2.5739822798483171E-2,1,0,247164.45410689578,1.5707922809056785,7.6349512002185529,1.4394423182736171,1.0315645375666649,0.24801627512074456,1,0,1,0,1.09960581450203,0.57064032234567685,1.9381435425500766,-125.14325699510799,54.85674300489201,null,1000000000,1678971112.5625,null,7.2337013757580984,-21.736084337829435,null,43.493727732445713,-103.40717265727855,null,0,0]
[41212.5,41.212499999999999,3.2860234904814991,1.2615726899505204,1.0003352083874872,2.5888792055426692E-2,1,0,248595.55621697209,1.5707923041968452,7.678401963540078,1.4401898959952895,1.0319254466209435,0.24939365916507777,1,0,1,0,1.1007393747214518,0.57369497577244732,1.8798552615872663,-125.44194403629996,54.558055963700042,null,1000000000,1698470156.25,null,7.2298076109647926,-21.772170916555346,null,43.439333216276204,-103.66977311974465,null,0,0]
[41449.75,41.449750000000002,3.3031929642466618,1.26323281372749,1.0003390782611632,2.6037760163082471E-2,1,0,250026.6583270485,1.5707923272213844,7.7218569698139712,1.4409290600893347,1.0322883120594557,0.25077007747526853,1,0,1,0,1.1018789906398723,0.57674579187564201,1.8217405486446916,-125.73983906173392,54.260160938266083,null,1000000000,1718081775.0625,null,7.2259129293362427,-21.808684212868041,null,43.385113184962179,-103.93115484886586,null,0,0]
[41687,41.686999999999998,3.3203714474843844,1.2648757641512409,1.0003429703336888,2.6186727114852239E-2,1,0,251457.76043712508,1.5707923499838479,7.7653161478090649,1.4416599510036978,1.0326531318198315,0.25214552585680383,1,0,1,0,1.1030246553486789,0.57979276068127006,1.7637975867133555,-126.03694818926647,53.963051810733532,null,1000000000,1737805969,null,7.2220170406439301,-21.845615939625933,null,43.33106611172316,-104.1913322496405,null,0,0]
[41929.75,41.929749999999999,3.3379573475225626,1.2665392941730709,1.0003469756098713,2.6339146259491502E-2,1,0,252922.03878157656,1.5707923730073785,7.8097870546491173,1.4423993658091609,1.0330284295860912,0.25355185202094888,1,0,1,0,1.10420313274135,0.58290637285920111,1.7046872738975867,-126.34013782740114,53.659862172598864,null,1000000000,1758103935.0625,null,7.218029293776258,-21.883828464982553,null,43.275943545775064,-104.45630936241859,null,0,0]
[42172.5,42.172499999999999,3.3555523879608624,1.2681853830713383,1.0003510041255239,2.6491564180056736E-2,1,0,254386.31712602821,1.5707923957658567,7.8542621830137396,1.4431304070684436,1.0334057689414089,0.25495715394659535,1,0,1,0,1.1053879279833734,0.5860159366394051,1.6457529973258731,-126.64251734592169,53.357482654078311,null,1000000000,1778519756.25,null,7.2140396973827894,-21.922462059465765,null,43.220998865596826,-104.72005528645592,null,0,0]
[42415.25,42.41525,3.3731564257649689,1.2698142949235023,1.0003550558803656,2.6643980869481051E-2,1,0,255850.59547047995,1.5707924182638331,7.8987414615930227,1.4438532154524797,1.0337851476501987,0.25636142720777083,1,0,1,0,1.1065790336666488,0.58912144181504278,1.5869928893392602,-126.94409297776839,53.055907022231608,null,1000000000,1799053432.5625,null,7.2100479692189232,-21.961508409895963,null,43.166230485774065,-104.98258456787245,null,0,0]
[42658,42.658000000000001,3.3907693207985736,1.2714262886889969,1.0003591308741142,2.6796396320697923E-2,1,0,257314.87381493187,1.5707924405057554,7.9432248206677185,1.4445679285159343,1.0341665634680812,0.25776466740120829,1,0,1,0,1.1077764423813119,0.59222287833898324,1.528405108048996,-127.24487085163511,52.755129148364887,null,1000000000,1819704964,null,7.2060538360673467,-22.000959382937602,null,43.11163683763538,-105.24391146869749,null,0,0]
[42906.5,42.906500000000001,3.4088084421626559,1.2730592067851472,1.0003633264627336,2.6952420734695455E-2,1,0,258813.83640441208,1.5707924630138335,7.9887660090009653,1.4452913261326406,1.0345591215597534,0.25920007139791834,1,0,1,0,1.109008735032746,0.59539355366808833,1.4686061642610493,-127.55195319150533,52.448046808494666,null,1000000000,1840967742.25,null,7.2019623270186841,-22.041755633162694,null,43.055929402896105,-105.51019755834264,null,0,0]
[43155,43.155000000000001,3.4268565571396867,1.2746749290775545,1.000367546403611,2.7108443836147338E-2,1,0,260312.79899389244,1.5707924852626944,8.0343113304934626,1.4460065224520968,1.0349538096215569,0.26063438354198748,1,0,1,0,1.1102476171329754,0.59855994451835415,1.4089839826878714,-127.858212203362,52.141787796637999,null,1000000000,1862354025,null,7.1978677460009921,-22.082959209706999,null,43.000401802340619,-105.77525299365499,null,0,0]
[43403.5,43.403500000000001,3.444913524375385,1.2762737174655967,1.0003717906964378,2.7264465617474028E-2,1,0,261811.76158337292,1.5707925072567905,8.0798607152506641,1.446713655438304,1.0353506252175817,0.26206759918400352,1,0,1,0,1.1114930807300922,0.60172204062783674,1.3495366689237249,-128.16365413451067,51.836345865489335,null,1000000000,1883863812.25,null,7.193769827410156,-22.124561941678916,null,42.945052407167303,-106.03909219283176,null,0,0]
[43652,43.652000000000001,3.4629792053951043,1.2778558287338553,1.0003760593409043,2.7420486071096362E-2,1,0,263310.72417285357,1.5707925290004727,8.1254140949391136,1.4474128599940732,1.0357495659025298,0.26349971369967923,1,0,1,0,1.1127451178721477,0.60487983190731776,1.2902623552434032,-128.46828512592424,51.53171487407576,null,1000000000,1905497104,null,7.1896683143092668,-22.166555835013867,null,42.889879606587876,-106.30172929091039,null,0,0]
[43906,43.905999999999999,3.481453594448491,1.2794559837795123,1.0003804476281462,2.7579958313714063E-2,1,0,264842.86299670907,1.5707925509710414,8.1719797573101101,1.448119483639144,1.0361595298657711,0.26496238217449769,1,0,1,0,1.1140316512111557,0.60810305481469584,1.2298530042286746,-128.77882667622106,51.221173323778942,null,1000000000,1927736836,null,7.1854720498110858,-22.209875271751454,null,42.833666520071326,-106.56895140446962,null,0,0]
[44160,44.16,3.4999368036296574,1.2810392419666585,1.0003848613562356,2.773942915319464E-2,1,0,266375.00182056479,1.5707925726888687,8.2185494538495938,1.4488180995867572,1.0365717088315234,0.2664238905526336,1,0,1,0,1.1153250354994058,0.61132175946166767,1.1696205337602656,-129.08853363512219,50.911466364877811,null,1000000000,1950105600,null,7.1812715136040683,-22.253587032632666,null,42.777634585809928,-106.83494660248954,null,0,0]
[44414,44.414000000000001,3.518428693935419,1.2826058617102771,1.0003893005248361,2.789889858144573E-2,1,0,267907.14064442058,1.5707925941582912,8.2651231163662029,1.44950884251838,1.0369861001585434,0.26788423397757788,1,0,1,0,1.1166252622480961,0.61453593562900799,1.1095630331929021,-129.39741222897214,50.602587771027856,null,1000000000,1972603396,null,7.1770664575656298,-22.29768312296887,null,42.721782141281004,-107.09972910600331,null,0,0]
[44668,44.667999999999999,3.536929129204947,1.2841560963491447,1.0003937651336092,2.8058366590375403E-2,1,0,269439.27946827654,1.5707926153835465,8.3117006781912384,1.4501918441269765,1.0374027011956433,0.26934340762043524,1,0,1,0,1.1179323229704257,0.61774557328285395,1.0496786192942917,-129.70546857669567,50.294531423304335,null,1000000000,1995230224,null,7.1728566418443549,-22.342155720876463,null,42.666107543103671,-107.36331285581923,null,0,0]
[44928.25,44.928249999999998,3.5558935151907094,1.2857277414018859,1.0003983659863824,2.8221757036248726E-2,1,0,271009.1185584676,1.5707926368821536,8.3594283176901527,1.4508837571392066,1.0378318423979487,0.27083726779375028,1,0,1,0,1.1192786250285292,0.62102947054122659,0.98849825826028237,-130.02025849527018,49.979741504729816,null,1000000000,2018547648.0625,null,7.1685380589341747,-22.388105140431083,null,42.609245764979839,-107.63215335483913,null,0,0]
[45188.5,45.188499999999998,3.5748665912738633,1.2872827077139342,1.0004029935459822,2.8385145974895026E-2,1,0,272578.95764865883,1.5707926581331311,8.4071599137717481,1.4515678138125212,1.038263297727124,0.27232988973410294,1,0,1,0,1.1206320834858428,0.62430858245249299,0.92749569042741653,-130.33419787391085,49.665802126089147,null,1000000000,2042000532.25,null,7.1642139948827754,-22.434433735337485,null,42.552567261198377,-107.89976413857339,null,0,0]
[45448.75,45.448749999999997,3.593848219820988,1.2888212519818973,1.0004076478120381,2.8548533397611639E-2,1,0,274148.79673885019,1.5707926791407325,8.4548953994260891,1.4522441465695399,1.038697064299434,0.27382126833778342,1,0,1,0,1.1219926892234018,0.62758289882370533,0.86666897692287581,-130.64729295730115,49.352707042698853,null,1000000000,2065588876.5625,null,7.1598842169620625,-22.481133626161135,null,42.496070325614539,-108.16615933113999,null,0,0]
[45709,45.709000000000003,3.6128382660297369,1.290343625819963,1.0004123287841773,2.8711919295696376E-2,1,0,275718.63582904165,1.5707926999091151,8.5026347091426651,1.4529128848874855,1.0391331392205241,0.27531139853170439,1,0,1,0,1.1233604331266795,0.63085240966242184,0.80601620726822654,-130.95954988091916,49.040450119080845,null,1000000000,2089312681,null,7.1555485004134454,-22.528197103975305,null,42.439753272508511,-108.43135277694384,null,0,0]
[45975.25,45.975250000000003,3.6322746964241586,1.2918846208589574,1.0004171453113258,2.8879070428802767E-2,1,0,277324.66717491485,1.5707927209129886,8.5514785274878715,1.4535893137294118,1.0395816535026907,0.27683458613996353,1,0,1,0,1.1247670874469688,0.63419231506658169,0.74414314535870651,-131.27814472944155,48.72185527055845,null,1000000000,2113723612.5625,null,7.1511064531085555,-22.576714011040625,null,42.382322257903894,-108.7014307184009,null,0,0]
[46241.5,46.241500000000002,3.6517196604263673,1.293409208263161,1.0004219897893607,2.9046219947742338E-2,1,0,278930.69852078822,1.5707927416749894,8.6003262141684722,1.4542580589835448,1.0400325776352042,0.27835645646784579,1,0,1,0,1.1261811935817745,0.63752717028340344,0.68244818404293484,-131.59587497649011,48.404125023509891,null,1000000000,2138276322.25,null,7.1466577387045573,-22.625595666794123,null,42.325076010992113,-108.97027930969597,null,0,0]
[46507.75,46.507750000000001,3.6711730224374488,1.2949176417180022,1.0004268622178762,2.921336784319864E-2,1,0,280536.72986666171,1.5707927621992714,8.6491777036432396,1.4549192502398065,1.0404859084849329,0.27987700418301792,1,0,1,0,1.127602741789544,0.64085696525823865,0.62092936702268775,-131.91274685137631,48.087253148623688,null,1000000000,2162970810.0625,null,7.1422021407523584,-22.674834340997997,null,42.268012791924065,-109.23791251037829,null,0,0]
[46774,46.774000000000001,3.6906346496595082,1.2964101698554531,1.0004317625964636,2.9380514105855772E-2,1,0,282142.76121253526,1.570792782489894,8.6980329318383269,1.4555730142033501,1.0409416429074962,0.28139622398687431,1,0,1,0,1.1290317223359969,0.64418169015162041,0.55958476718647443,-132.22876647341101,47.771233526588986,null,1000000000,2187807076,null,7.1377394504343883,-22.724422470626571,null,42.211130882405818,-109.50434400278442,null,0,0]
[47046.25,47.046250000000001,3.7105432599681065,1.2979201392931257,1.0004368023076504,2.9551425346742526E-2,1,0,283784.98481409065,1.5707928030002862,8.7479929237120722,1.4562339596996448,1.0414101295446532,0.28294830110949737,1,0,1,0,1.1305005805876684,0.64757608564423452,0.49703592666172913,-132.55103264904065,47.44896735095935,null,1000000000,2213349639.0625,null,7.1331686487181303,-22.775481727023067,null,42.153152843597333,-109.77555092201757,null,0,0]
[47318.5,47.3185,3.7304602400338616,1.2994139886101139,1.0004418712419536,2.9722334860711193E-2,1,0,285427.20841564611,1.5707928232746626,8.7979566937343137,1.4568873984336139,1.0418811226202442,0.28449897869995983,1,0,1,0,1.1319771893716311,0.65096515984575809,0.43466525993607674,-132.87242032620318,47.127579673796816,null,1000000000,2239040442.25,null,7.1285900131370328,-22.826890888410226,null,42.095360812452782,-110.04552943779292,null,0,0]
[47590.75,47.59075,3.7503854565102528,1.3008919680165685,1.0004469693989295,2.9893242637803547E-2,1,0,287069.43201720173,1.5707928433170739,8.8479241779000262,1.4575334570228118,1.0423546187366293,0.28604825120296895,1,0,1,0,1.1334615383080275,0.65434890292671399,0.37247079830459739,-133.19293570555297,46.807064294447031,null,1000000000,2264879485.5625,null,7.1240033435834649,-22.878642382073814,null,42.037753020374865,-110.31429332347915,null,0,0]
[47863,47.863,3.7703187788150108,1.3023543227119141,1.0004520967781307,3.0064148668061962E-2,1,0,288711.65561875748,1.5707928631314783,8.8978953136371945,1.4581722592653863,1.0428306144842998,0.287596113100275,1,0,1,0,1.1349536170275394,0.65772730528765233,0.31045060295737376,-133.51258487748782,46.487415122512175,null,1000000000,2290866769,null,7.119408447242872,-22.930728798956817,null,41.980327721368234,-110.58185607853098,null,0,0]
[48141.75,48.141750000000002,3.7907362763654291,1.3038356535024607,1.0004573768507103,3.0239133279120985E-2,1,0,290393.08749730175,1.5707928831867564,8.949063235477583,1.4588189211086824,1.0433205609742124,0.28917946312875842,1,0,1,0,1.1364893172907375,0.66118082410022394,0.24712823132873149,-133.8389744817716,46.161025518228399,null,1000000000,2317628093.0625,null,7.1146951295133167,-22.984398227831939,null,41.92171866746915,-110.85457625393967,null,0,0]
[48420.5,48.420499999999997,3.8111620029472983,1.3053011092478135,1.0004626875565847,3.0414116037813806E-2,1,0,292074.51937584614,1.5707929030111234,9.0002348570099837,1.459458229911988,1.0438131206067149,0.29076132280196232,1,0,1,0,1.1380330988784391,0.66462872449400301,0.18398452698649007,-134.16446860127397,45.835531398726033,null,1000000000,2344544820.25,null,7.1099728007858909,-23.038403550567757,null,41.863297291854323,-111.12606505070619,null,0,0]
[48699.25,48.699249999999999,3.8315958269570114,1.3067509375867141,1.0004680288952661,3.0589096933454425E-2,1,0,293755.9512543907,1.5707929226085449,9.051410115486421,1.460090309867047,1.0443082896842537,0.29234168631782342,1,0,1,0,1.1395849506992495,0.66807099690601823,0.12101750314365847,-134.48907342947464,45.510926570525356,null,1000000000,2371616950.5625,null,7.105241276325712,-23.092737319294983,null,41.805061792471683,-111.39633611017966,null,0,0]
[48978,48.978000000000002,3.852037619531798,1.308185381167206,1.0004734008662641,3.0764075955357535E-2,1,0,295437.38313293533,1.5707929419828954,9.1025889495655896,1.4607152823959602,1.044806064496715,0.29392054791514194,1,0,1,0,1.1411448616761422,0.67150763201999752,5.8225203747650091E-2,-134.81279504906726,45.187204950932738,null,1000000000,2398844484,null,7.1005003784036607,-23.147392247169243,null,41.747010390997723,-111.66540280189801,null,48978,45.187204950932738]
[49263.25,49.263249999999999,3.8729641995225732,1.3096375946383285,1.0004789298145276,3.0943133254641122E-2,1,0,297158.0232884686,1.5707929615820413,9.1549648305135101,1.4613475941697196,1.0453181403160714,0.29553466518800559,1,0,1,0,1.1427494789548693,0.67501855844478931,-5.8524363458371375E-3,-135.14315722542344,44.856842774576563,null,49263.25,2426867800.5625,null,7.09563904820806,-23.203646681583269,null,41.687794081099838,-111.93951054384017,null,0,0]
[49548.5,49.548499999999997,3.8938988594997879,1.3110741961223811,1.0004844908393073,3.1122188569145667E-2,1,0,298878.66344400198,1.5707929809555232,9.2073443301385556,1.4619727118963355,1.0458329369096067,0.29714719760550901,1,0,1,0,1.144362512204077,0.67852356264613634,-6.9751156486406118E-2,-135.47260706620642,44.527392933793578,null,49548.5,2455053852.25,null,7.0907675472179141,-23.260222486083734,null,41.628766861949416,-112.21238458012272,null,0,0]
[49833.75,49.833750000000002,3.9148414698399798,1.3124954301924845,1.0004900839400688,3.1301241887423059E-2,1,0,300599.30359953537,1.5707930001072163,9.2597273870314094,1.4625907571750472,1.0463504502615191,0.29875813912706334,1,0,1,0,1.1459839496048172,0.68202263543266473,-0.13347295615834945,-135.80115074545154,44.198849254548463,null,49833.75,2483402639.0625,null,7.0858857062836611,-23.317112347669209,null,41.569926903211723,-112.4840383977823,null,0,0]
[50119,50.119,3.9357919036299234,1.3139015364655582,1.0004957091162741,3.1480293198025935E-2,1,0,302319.94375506893,1.5707930190409074,9.3121139411604101,1.4632018488906948,1.0468706763427764,0.30036748375702138,1,0,1,0,1.1476137793568786,0.68551576787645618,-0.19701980336560662,-136.12879432641273,43.871205673587269,null,50119,2511914161,null,7.0809933629699318,-23.374309111431778,null,41.511272399318202,-112.75448521498097,null,0,0]
[50410.75,50.41075,3.9572276989380133,1.3153242796068294,1.0005014956530958,3.1663422467272134E-2,1,0,304079.79218759114,1.5707930381843882,9.365697785727944,1.4638197936730226,1.0474055587738162,0.30201184247868651,1,0,1,0,1.1492894171930235,0.68908234446983552,-0.26183573537433685,-136.46297903959641,43.537020960403595,null,50410.75,2541243715.5625,null,7.0759785111029325,-23.433119395097066,null,41.451471319176463,-113.02985964449933,null,0,0]
[50702.5,50.702500000000001,3.9786714181364085,1.3167316893442444,1.000507315742676,3.184654961208306E-2,1,0,305839.64062011341,1.5707930571075599,9.4192851659504875,1.4644307075707033,1.0479432704055573,0.30365451815982936,1,0,1,0,1.1509738093053044,0.69264268885453417,-0.32647271662266575,-136.79623465219419,43.203765347805813,null,50702.5,2570743506.25,null,7.0709523496051299,-23.492236075037759,null,41.391860499425938,-113.30399857715646,null,0,0]
[50994.25,50.994250000000001,4.0001229337907684,1.3181240067428885,1.0005131693844296,3.2029674620213347E-2,1,0,307599.48905263585,1.5707930758142039,9.4728760218252042,1.4650347094511869,1.0484838068851603,0.30529550453158105,1,0,1,0,1.1526669431338783,0.69619679232158393,-0.39093275402675209,-137.12856730836643,42.871432691633572,null,50994.25,2600413533.0625,null,7.0659147250618304,-23.551651981687584,null,41.332438086565155,-113.57691532667884,null,0,0]
[51286,51.286000000000001,{"$f":"SQRT(1+(A461/pole1)^2)","v":4.0215821211399012},{"$f":"ATAN(A461/pole1)","v":1.3195014679594204},{"$f":"SQRT(1+(A461/Zero1)^2)","v":1.0005190565777677},{"$f":"ATAN(A461/Zero1)","v":3.2212797479418506E-2},{"$f":"IF(VIN_nom>Vout, 1, SQRT(1+(A461/z_RHP)^2))","v":1},{"$f":"IF(VIN_nom>Vout, 0, -ATAN(A461/z_RHP))","v":0},{"$f":"SQRT(1+(A461/Pole2)^2)","v":309359.33748515835},{"$f":"ATAN(A461/Pole2)","v":1.5707930943080155},9.5264702946955833,1.4656319155274471,{"$f":"SQRT(1+(A461/pole4)^2)","v":1.0490271638459119},{"$f":"ATAN(A461/pole4)","v":0.30693479537435181},{"$f":"IF(VOUT_setting=1,1,SQRT(1+(A461*zterm1)^2))","v":1},{"$f":"IF(VOUT_setting=1,0,ATAN(((A461*zterm1))))","v":0},1,{"$f":"IF(VOUT_setting=1,0,ATAN(A461*$Q$4/(1+Afbr-$Q$5*(A461)^2)))","v":0},{"$f":"SQRT((1-(Z461/pterm2))^2+(A461/pterm1)^2)","v":1.1543688061425736},{"$f":"IF((ATAN((A461/pterm1)/(1-A461^2/pterm2))>0),ATAN((A461/pterm1)/(1-A461^2/pterm2)),PI()+ATAN((A461/pterm1)/(1-A461^2/pterm2)))","v":0.69974464644217749},{"$f":"20*LOG10(((E461*K461*G461*O461)/(C461*I461*S461*M461*Q461))*Adc)","v":-0.45521782237290648},{"$f":"((F461+L461+H461+P461)-(D461+J461+T461+N461+R461))*radconv","v":-137.45998304200191},{"$f":"IF(V461>0,V461,V461+180)","v":42.540016957998091},null,{"$f":"IF(U461<0,A461,1000000000)","v":51286},{"$f":"A461^2","v":2630253796},null,{"$f":"20*LOG10((K461/(I461*M461))*AEA)","v":7.0608654904790766},{"$f":"(L461-(J461+N461))*radconv","v":-23.611360100389089},null,{"$f":"20*LOG10((E461*G461/(C461*S461))*Acs*Am)","v":41.273202252801752},{"$f":"(F461+H461-(D461+T461))*radconv","v":-113.84862294161283},null,{"$f":"SUM((U462<0)*(U461>0))*A461","v":0},0]
[51584.75,{"$f":"A462/1000","v":51.58475},4.043564004299264,1.3208968253253537,1.000525119791523,3.2400311792231504E-2,1,0,311161.41021597624,1.5707931130287702,9.5813539437768025,1.4662365267963557,1.0495864758744797,0.30861165447611938,1,0,1,0,1.1561205349811459,0.70337114017077607,-0.52086600478861744,-137.79840648476107,42.201593515238926,null,51584.75,2660986432.5625,null,7.0556829306346049,-23.672796448494385,null,41.212736630230509,-114.12561003626668,null,0,0]
[51883.5,51.883499999999998,4.065553675223093,1.3222770910024395,1.0005312181849328,3.2587823825779856E-2,1,0,312963.48294679431,1.5707931315339334,9.636241055469668,1.466834250665237,1.0501487360409829,0.31028672266938129,1,0,{"$f":"IF(VOUT_setting=1,1,SQRT((1+Afbr-$Q$5*(A463)^2)^2+(A463*$Q$4)^2))","v":1},0,1.1578813903800322,0.70699106407525625,-0.58633481153169842,-138.13588093994261,41.864119060057391,null,51883.5,2691897572.25,null,7.0504879047046973,-23.734524791702061,null,41.15246284941734,-114.40135614824054,null,0,0]
[52182.25,52.182250000000003,4.087551008224608,1.3236425033383514,1.0005373517573539,3.2775333566919217E-2,1,0,314765.55567761243,1.5707931498272076,9.691131570941188,1.4674252037339048,1.0507139396125802,0.3119599934367796,1,0,1,0,1.1596513589610993,0.71060441000489893,-0.65162626188010164,-138.47241254373142,41.527587456268577,null,52182.25,2722987215.0625,null,7.0452802744270322,-23.796538076129895,null,41.092379029346596,-114.6758744676015,null,0,0]
[52481,52.481000000000002,4.109555880264768,1.3249932957999844,1.0005435205081392,3.2962841002506231E-2,1,0,316567.62840843073,1.5707931679122116,9.7460254326801756,1.4680094999943716,1.05128208184186,0.31363146031519545,1,0,1,0,1.1614304273756106,0.71421117010764279,-0.71674234221333355,-138.80800732229497,41.191992677705031,null,52481,2754255361,null,7.0400599077071302,-23.858829400414589,null,41.032483315733266,-114.94917792188038,null,0,0]
[52786.5,52.786499999999997,4.1320656044882087,1.3263597274381904,1.0005498650154601,3.3154582609795265E-2,1,0,318410.41742689098,1.5707931861941333,9.802162976094472,1.4686002299288123,1.0518660947983518,0.31533882039132594,1,0,1,0,1.16325908899867,0.71789260328073723,-0.78315034207220058,-139.15022192894432,40.849778071055681,null,52786.5,2786414582.25,null,7.0347082885460726,-23.922808642360565,null,40.97142693503546,-115.22741328658373,null,0,0]
[53092,53.091999999999999,4.154582960227529,1.3277113497766668,1.0005562463073734,3.3346321778375598E-2,1,0,320253.2064453513,1.5707932042656607,9.8583039011324498,1.4691842319047161,1.0524531706188087,0.31704428064690493,1,0,1,0,1.1650972381711515,0.72156713400087413,-0.84937905618048126,-139.49146930340018,40.50853069659982,null,53092,2818760464,null,7.0293430903896024,-23.987064504181628,null,40.910563419083644,-115.50440479921856,null,0,0]
[53397.5,53.397500000000001,4.1771078240660771,1.3290483974119764,1.0005626643831753,3.353805849419586E-2,1,0,322095.99546381179,1.5707932221304051,9.9144481503484112,1.4697616198190038,1.0530433041805545,0.31874783434674298,1,0,1,0,1.1669448607196,0.72523475482478217,-0.91543050568692763,-139.83175554988875,40.168244450111246,null,53397.5,2851293006.25,null,7.0239641906910517,-24.051590074373884,null,40.849890869275754,-115.78016547551486,null,0,0]
[53703,53.703000000000003,4.199640075194278,1.3303711001169432,1.000569119242158,3.3729792743205762E-2,1,0,323938.7844822724,1.5707932397918951,9.9705956675871921,1.4703325050209086,1.053636490345738,0.32044947481496444,1,0,1,0,1.1688019425062548,0.72889545862507876,-0.98130667828783946,-140.17108666372073,39.828913336279271,null,53703,2884012209,null,7.0185714727949815,-24.116378590798892,null,40.789407414570917,-116.05470807292183,null,0,0]
[54015.75,54.015749999999997,4.2227145812840678,1.3317105680058221,1.0005757653873719,3.3926074580349179E-2,1,0,325825.30580968183,1.5707932576655743,10.028078982511182,1.470910315867427,1.0542469105080339,0.32218950912873184,1,0,1,0,1.1707128796954553,0.73263586442619599,-1.0485666721937534,-140.5174873897603,39.482512610239695,null,54015.75,2917701248.0625,null,7.0130363473458912,-24.182970114485798,null,40.727682546114096,-116.33451727527449,null,0,0]
[54328.5,54.328499999999998,4.2457965813024057,1.3330354743882831,1.0005824500808149,3.4122353802414213E-2,1,0,327711.82713709131,1.5707932753334686,{"$f":"SQRT(1+(A471/Zero2)^2)","v":10.085565607298275},{"$f":"ATAN(A471/Zero2)","v":1.4714815399851446},1.054860518934321,0.32392752435670286,1,0,1,0,1.1726337005488543,0.73636900689003881,-1.115647082236412,-140.86289948907543,39.137100510924569,null,54328.5,2951585912.25,null,7.0074865107242683,-24.249823333048862,null,40.666151972693058,-116.61307615602657,null,0,0]
[54641.25,54.641249999999999,4.2688859536895754,1.3343460508537901,1.0005891733217143,3.4318630394329905E-2,1,0,329598.34846450097,1.5707932927991115,10.143055485671679,1.4720462889969448,1.0554773100640475,0.32566351352945327,1,0,1,0,1.1745643900199296,0.74009487938048557,-1.1825499360070286,-141.20732905677056,38.792670943229439,null,54641.25,2985666201.5625,null,7.0019218557044729,-24.316931451851843,null,40.60481377394224,-116.89039760491869,null,0,0]
[54954,54.954000000000001,4.2919825794632445,1.3356425242060612,1.0005959351092926,3.4514904341026519E-2,1,0,331484.86979191063,1.5707933100659561,10.200548562620154,1.4726046720258978,1.0560972783208427,0.32739746974264455,1,0,1,0,1.1765049331050956,0.74381347559618938,-1.2492772269790833,-141.55078207988132,38.449217920118684,null,54954,3019942116,null,6.9963422807112785,-24.384287823211736,null,40.543666057963378,-117.16649425666955,null,0,0]
[55274,55.274000000000001,4.3156220047057996,1.3369546860693629,1.0006028935415179,3.4715725449727057E-2,1,0,333415.12342826923,1.5707933275308268,10.259377667302847,1.4731695214035578,1.0567349009674147,0.32916951025400443,1,0,1,0,1.1785006440921453,0.74761073681575252,-1.3173716831052975,-141.90119221440091,38.098807785599092,null,55274,3055215076,null,6.9906178200526714,-24.453455780980772,null,40.481296062495758,-117.4477364334201,null,0,{"$f":"IF(AH474>0,W474,0)","v":0}]
[55594,55.594000000000001,4.339268779484426,1.3382525489374852,1.0006098923266127,3.4916543757232139E-2,1,0,335345.37706462789,1.5707933447946414,10.318210007963449,1.4737279296445214,1.057375837888308,0.33093940804407662,1,0,1,0,1.1805066391935228,0.75140036821432454,-1.3852864581384683,-142.25059235034158,37.749407649658423,null,55594,3090692836,null,6.9848775418378075,-24.522870008291935,null,40.419121565677465,-117.72772234204963,null,0,0]
[55914,55.914000000000001,4.362922784297016,1.3395363409722669,1.0006169314637305,3.5117359247403501E-2,1,0,337275.63070098666,1.5707933618608516,10.377045529563127,1.4742800059569499,1.05802008306027,0.33270715592853434,1,0,1,0,1.1825229024832891,0.75518236410996797,-1.4530235806137901,-142.59898856718681,37.401011432813192,null,55914,3126375396,null,6.9791213544271349,-24.592523836544657,null,40.357140630612811,-118.00646473064214,null,0,0]
[56234,56.234000000000002,4.3865839021829061,1.3408062856005403,1.0006240109520197,3.5318171904104266E-2,1,0,339205.88433734555,1.5707933787328312,10.435884178301299,1.4748258571017352,1.0586676304436573,0.33447274679423983,1,0,1,0,1.1845494180864615,0.75895671917385255,-1.5205850443959008,-142.94638683764816,37.053613162351837,null,56234,3162262756,null,6.9733491715865572,-24.662410741430929,null,40.295351349671272,-118.28397609621726,null,0,0]
[56561.5,56.561500000000002,4.4108068231621029,1.3420918848298991,1.0006312981457719,3.5523688156745677E-2,1,0,341181.37829330668,1.5707933958025753,10.496105040926412,1.475378164811803,1.0593337676111771,0.3362774779039433,1,0,1,0,1.1866340291998754,0.7628116189373737,-1.5895501424823186,-143.30090007402569,36.699099925974309,null,56561.5,3199203282.25,null,6.9674250565444584,-24.734170294499762,null,40.232310366626962,-118.56672977952593,null,0,0]
[56889,56.889000000000003,4.435036954530962,1.3433634388007505,1.0006386276025017,3.5729201407345E-2,1,0,343156.87224926788,1.5707934126757841,10.556329068792397,1.4759241708380306,1.0600033507432831,0.33807993485235366,1,0,1,0,1.1887293453577503,0.76665850533168178,-1.6583353687560067,-143.65438036491935,36.345619635080652,null,56889,3236358321,null,6.9614840213063012,-24.806160596352061,null,40.169466175591424,-118.84821976856729,null,0,0]
[57216.5,57.216500000000003,4.4592741787533026,1.3446211723854442,1.0006459993212802,3.5934711638608403E-2,1,0,345132.36620522925,1.570793429355833,10.616556208033323,1.4764639820993795,1.0606763733138762,0.33988011024565973,1,0,1,0,1.1908353497144135,0.77049737377022876,-1.726942752027274,-144.00683378332067,35.993166216679327,null,57216.5,3273727872.25,null,6.9555259898624193,-24.878375097541806,null,40.106816823764042,-119.12845868577887,null,0,0]
[57544,57.543999999999997,4.4835183808004366,1.3458653057694678,1.0006534133011737,3.6140218833243587E-2,1,0,347107.86016119062,1.5707934458460193,10.67678640599593,1.4769977031168224,1.0613528287799305,0.34167799676790545,1,0,1,0,1.1929520254841439,0.77432822003826729,-1.7953742858898187,-144.35826629683731,35.641733703162686,null,57544,3311311936,null,6.9495508913767541,-24.950807390473869,null,40.044360388387162,-119.40745890636344,null,0,0]
[57879,57.878999999999998,4.5083248955735424,1.3471240845654522,1.0006610407898013,3.6350429139749681E-2,1,0,349128.5944367543,1.5707934625207698,10.738399032407647,1.4775374522254654,1.0620483204734232,0.34351468062193213,1,0,1,0,1.1951281980959747,0.77823849175705373,-1.8651930601003324,-144.7166967550674,35.283303244932597,null,57879,3349978641,null,6.9434212321792437,-25.025117233165968,null,39.980671273374156,-119.69157952190146,null,0,0]
[58214,58.213999999999999,4.5331384757066173,1.3483690846612915,1.0006687124953371,3.65606362323566E-2,1,0,351149.32871231809,1.570793479003606,10.800014751532675,1.4780710427873338,1.062747390192458,0.34534895433472679,1,0,1,0,1.1973155011517642,0.78214036192345315,-1.9348319482696996,-145.07407131940215,34.925928680597849,null,58214,3388869796,null,6.9372735811925557,-25.099641832679932,null,39.917180036191482,-119.97442948672222,null,0,0]
[58549,58.548999999999999,4.5579590058079651,1.3496005272627944,1.0006764284167637,3.6770840092561638E-2,1,0,353170.06298788195,1.5707934952978226,10.861633510738113,1.4785985793094849,1.0634500308808803,0.34718081032844045,1,0,1,0,1.1995139168869455,0.78603382720804038,-2.0042929741289255,-145.43039605249564,34.569603947504362,null,58549,3427985401,null,6.9311078782942728,-25.174374767212438,null,39.853884713230535,-120.25602128528317,null,0,0]
[58884,58.884,4.5827863729537777,1.3508186289487114,1.0006841885530586,3.6981040701863782E-2,1,0,355190.79726344591,1.5707935114066385,10.923255258576113,1.4791201639543923,1.0641562354651748,0.34901024111009221,1,0,1,0,1.2017234276067523,0.7899188846709394,-2.0735781257639281,-145.78567691340334,34.214323086596664,null,58884,3467325456,null,6.9249240683001334,-25.249309754153167,null,39.790783371589676,-120.53636715925016,null,0,0]
[59227,59.226999999999997,4.6082136009443602,1.3520522184752615,1.0006921798162591,3.719625763960907E-2,1,0,357259.78787991899,1.5707935277113336,10.986351614562157,1.4796481418754421,1.0648829898054064,0.35088083927787422,1,0,1,0,1.2039971799369968,0.79388800556499883,-2.14433766339222,-146.14836664855164,33.851633351448356,null,59227,3507837529,null,6.918573771740455,-25.326237162057854,null,39.726374130521059,-120.82212948649381,null,0,0]
[59570,59.57,4.6336477644834613,1.3532722674578621,1.0007002174291089,3.741147113008253E-2,1,0,359328.77849639207,1.5707935438282659,11.049450998133928,1.4801700897620302,1.0656134652275062,0.35274887939380606,1,0,1,0,1.2062825261743866,0.79784830726959644,-2.214916933154,-146.50997438204951,33.490025617950494,null,59570,3548584900,null,6.9122043910080073,-25.403363489154934,null,39.662164241491723,-121.10661089289461,null,0,0]
[59913,59.912999999999997,4.6590887499867213,1.3544789940490136,1.0007083013904909,3.7626681153431436E-2,1,0,361397.76911286538,1.5707935597606604,11.112553357717646,1.4806861100515232,1.0663476540843657,0.35461435369098737,1,0,1,0,1.2085794475598473,0.80179978786944894,-2.2853179573734623,-146.87050619045976,33.129493809540236,null,59913,3589567569,null,6.9058158818926785,-25.480682421389805,null,39.598151726387592,-121.38982376907001,null,0,0]
[60256,60.256,4.6845364463070771,1.3556726118180709,1.0007164316992825,3.7841887689805009E-2,1,0,363466.75972933869,1.5707935755116686,11.175658642901956,1.4811963028803576,1.0670855487111004,0.35647725449527085,1,0,1,0,1.210887925415282,0.80574244585774746,-2.3555427222098837,-147.22996804829779,32.770031951702208,null,60256,3630785536,null,6.8994082049118752,-25.558187781851576,null,39.534334638531973,-121.67178026644616,null,0,0]
[60607,60.606999999999999,4.7105845088558693,1.3568807161959744,1.0007247996165882,3.8062109989987436E-2,1,0,365584.00668672111,1.5707935914454785,11.240238748813299,1.4817124644544322,1.0678444821187631,0.35838093274407762,1,0,1,0,1.2132621898401676,0.80976792606097936,-2.4272249435838744,-147.59671231099176,32.403287689008238,null,60607,3673208449,null,6.8928311976634191,-25.637687544348662,null,39.469229424406443,-121.9590247666431,null,0,0]
[60958,60.957999999999998,4.7366393709563006,1.3580755314470181,1.0007332160660936,3.8282328596586146E-2,1,0,367701.25364410359,1.5707936071957924,11.304821815165095,1.4822227286270953,1.0686072798801021,0.36028190009050381,1,0,1,0,1.2156485167877225,0.8137841653988751,-2.4987266830761059,-147.96234847427831,32.037651525721685,null,60958,3715877764,null,6.8862340488145932,-25.717369869278297,null,39.404324833763042,-122.244978605,null,0,0]
[61309,61.308999999999997,4.7627009210153597,1.3592572722862399,1.0007416810465743,3.8502543488335032E-2,1,0,369818.50060148619,1.5707936227657624,11.369407791507665,1.4827271956341068,1.0693739337256418,0.36218014861148873,1,0,1,0,1.2180468865121212,0.81779116355272685,-2.5700499561361703,-148.32688262651737,31.673117373482626,null,61309,3758793481,null,6.8796167304024731,-25.797228559777139,null,39.339618879115093,-122.52965406674022,null,0,0]
[61660,61.66,4.7887690498409565,1.360426148901265,1.0007501945567985,3.8722754643970181E-2,1,0,371935.7475588689,1.570793638158468,11.433996628528963,1.4832259634583189,1.0701444353678611,0.36407567048499323,1,0,1,0,1.2204572793606638,0.82178892062985209,-2.6411967416547038,-148.69032075594268,31.309679244057321,null,61660,3801955600,null,6.8729792189752725,-25.877257553847919,null,39.275109605023758,-122.81306320209477,null,0,0]
[62019,62.018999999999998,4.8154380180815446,1.3616085736677048,1.0007589523073361,3.8947980970307834E-2,1,0,374101.25085716072,1.5707936537217708,11.500060484779219,1.4837303035358915,1.0709364699890982,0.36601156651455735,1,0,1,0,1.2229350268464854,0.8258682358187972,-2.7137845642561458,-149.0609147366682,30.939085263331805,null,62019,3846356361,null,6.8661695167389816,-25.959280559839158,null,39.209331484658613,-123.10163417682904,null,0,0]
[62378,62.378,4.8421136447545354,1.3627779718916631,1.0007677608223811,3.9173203343295174E-2,1,0,376266.75415545254,1.5707936691059328,11.566127232756047,1.4842288820682725,1.0717325122109522,0.36794459395942136,1,0,1,0,1.2254253104812904,0.82993788545246294,-2.786191836155079,-149.43037452663515,30.569625473364852,null,62378,3891014884,null,6.8593386546807125,-26.041469309993037,null,39.143755074817946,-123.38890521664213,null,0,0]
[62737,62.737000000000002,4.8687958204173487,1.3639345545140713,1.0007766201005932,3.9398421740188039E-2,1,0,378432.25745374453,1.5707936843140291,11.632196823187508,1.4847217969802693,1.0725325531100041,0.36987474477708898,1,0,1,0,1.2279281095466306,0.83399787099268163,-2.8584205607665418,-149.79870622562552,30.201293774374477,null,62737,3935931169,null,6.8524866213658653,-26.123817733006462,null,39.078378383521326,-123.67488849261909,null,0,0]
[63096,63.095999999999997,4.8954844379868376,1.365078528014777,1.0007855301406239,3.9623636138244676E-2,1,0,380597.76075203653,1.570793699349065,11.698269207912681,1.4852091439955042,1.073336583744682,0.37180201103471688,1,0,1,0,1.230443403430292,0.83804819434321109,-2.930472704677296,-150.1659158355377,29.834084164462297,null,63096,3981105216,null,6.8456134096502028,-26.206319889973631,null,39.01319945132623,-123.95959594556405,null,0,0]
[63463.25,63.463250000000002,4.9227929297915116,1.3662359542349971,1.000794697461449,3.9854021914645113E-2,1,0,382813.02840189112,1.5707937145536044,11.765862811436813,1.4857020267565793,1.0741632103831484,0.37377057392605695,1,0,1,0,1.2330294074728505,0.84218160079316906,-3.003999941449111,-150.54040919996058,29.459590800039422,null,63463.25,4027584100.5625,null,6.8385603309484297,-26.290871004601676,null,38.946725293256193,-124.24953819535889,null,0,0]
[63830.5,63.830500000000001,4.9501079435759054,1.3673806084700211,1.0008039179010857,4.0084403458169882E-2,1,0,385028.29605174577,1.5707937295831844,11.833459240627906,1.4861892786331814,1.0749939932504975,0.37573610171294597,1,0,1,0,1.2356284439147385,0.8463049012868884,-3.0773464370169794,-150.91374071463528,29.086259285364719,null,63830.5,4074332730.25,null,6.8314850872696962,-26.375570836445267,null,38.880454041367059,-124.53816987819,null,0,0]
[64197.75,64.197749999999999,4.9774293719665419,1.3685126980140943,1.0008131914580662,4.031478074448102E-2,1,0,387243.56370160048,1.570793744440808,11.901058447337713,1.4866709953439226,1.0758289227180875,0.37769858625753461,1,0,1,0,1.2382404910414002,0.85041809925816314,-3.1505141819621132,-151.28591650441862,28.714083495581377,null,64197.75,4121351105.0625,null,6.82438768395388,-26.460413435139529,null,38.814383699737746,-124.82550306927911,null,0,0]
[64565,64.564999999999998,5.0047571099096499,1.3696324257642902,1.0008225181309138,4.0545153749243272E-2,1,0,389458.83135145536,1.5707937591294092,11.968660384503815,1.4871472704552553,1.0766679891391602,0.37965801954091732,1,0,1,0,1.2408655272588915,0.85452119859792586,-3.2235051297909845,-151.65694259854087,28.343057401459134,null,64565,4168639225,null,6.8172681304179541,-26.545392980440294,null,38.748512305444798,-125.11154961810055,null,0,0]
[64941,64.941000000000003,5.0327423807145912,1.3707662321285918,1.0008321220462464,4.0781011098238763E-2,1,0,391726.87937417947,1.5707937739958606,12.037875768070899,1.4876293510599601,1.0775313228161394,0.38166096833199598,1,0,1,0,1.2435665414529511,0.85871159940953457,-3.2980539764132506,-152.03562374880178,27.964376251198217,null,64941,4217333481,null,6.8099560141499991,-26.632533160599728,null,38.681275575090488,-125.40309058820205,null,0,0]
[65317,65.316999999999993,5.0607340496368503,1.3718874974194757,1.0008417816354873,4.101686390761642E-2,1,0,393994.92739690369,1.5707937886911534,12.107093917272895,1.4881059195139599,1.0783989724058538,0.38366070210195957,1,0,1,0,1.2462811256424109,0.8628914243358996,-3.3724215293790731,-152.41311226101956,27.586887738980437,null,65317,4266310489,null,6.8026207120586903,-26.719804946783135,null,38.614243324215977,-125.69330731423648,null,0,0]
[65693,65.692999999999998,5.088732011093752,1.3729964257952041,1.0008514968970252,4.1252712151268717E-2,1,0,396262.97541962803,1.5707938032182265,12.176314784944761,1.4885770696066312,1.0792709274993328,0.38565721263041031,1,0,1,0,1.249009257052095,0.86706067899803185,-3.4466097694355922,-152.78941431159612,27.210585688403881,null,65693,4315570249,null,6.7952622466169421,-26.807202494429379,null,38.547413549601202,-125.98221181716671,null,0,0]
[66069,66.069000000000003,5.1167361617900697,1.3740932170674462,1.0008612678292383,4.1488555803091139E-2,1,0,398531.02344235242,1.5707938175799518,12.245538324986073,1.4890428930163475,1.0801471776696472,0.38765049182621159,1,0,1,0,1.2517509130435196,0.87121936948958689,-3.5206206399380138,-153.16453598332569,26.835464016674308,null,66069,4365112761,null,6.7878806441772372,-26.894720087331137,null,38.480784281538483,-126.26981589599451,null,0,0]
[66453.75,66.453749999999999,5.1453983063631483,1.3752031720177988,1.000871323770858,4.1729883057179444E-2,1,0,400851.85183794616,1.5707938321076564,12.316375504545185,1.4895141361547806,1.0810482545719824,0.38968680386453075,1,0,1,0,1.2545703477429468,0.87546390906922344,-3.596172217803717,-153.54717156360323,26.452828436396771,null,66453.75,4416100889.0625,null,6.7803033429376347,-26.984392762420416,null,38.41281000491238,-126.56277880118279,null,0,0]
[66838.5,66.838499999999996,5.174066719830158,1.376300828255002,1.0008814380008928,4.1971205447942236E-2,1,0,403172.68023354001,1.5707938464681062,12.387215387920916,1.4899799895145951,1.0819538066357008,0.39171971569725705,1,0,1,0,1.2574038962989149,0.8796974014671195,-3.671542075414342,-153.92858378583568,26.071416214164316,null,66838.5,4467385082.25,null,6.7727018829949772,-27.07417942206423,null,38.345041607244418,-126.85440436377139,null,0,0]
[67223.25,67.223249999999993,5.2027412985615529,1.3773863864626672,1.0008916105175756,4.2212522947419839E-2,1,0,405493.50862913387,1.5707938606641727,12.458057928989366,1.4904405448385101,1.0828638226336524,0.39374921907289923,1,0,1,0,1.2602515349059955,0.88391985470084244,-3.7467321785528034,-154.30877888023997,25.69122111976003,null,67223.25,4518965340.5625,null,6.7650763043160591,-27.164074337180899,null,38.277477082784877,-127.14470454305913,null,0,0]
[67608,67.608000000000004,5.231421941177806,1.3784600430389895,1.0009018413191295,4.2453835527655984E-2,1,0,407814.33702472784,1.5707938746986625,12.52890308266813,1.4908958918033011,1.0837782913211438,0.39577530587992349,1,0,1,0,1.2631132399126113,0.88813127727361263,-3.8217444554270523,-154.68776298570774,25.312237014292265,null,67608,4570841664,null,6.7574266505422091,-27.254071905073783,null,38.210114459684476,-127.43369108063398,null,0,0]
[68001.75,68.001750000000001,5.2607796508459481,1.3795466924496598,1.0009123717817141,4.2700787724251912E-2,1,0,410189.45380384458,1.5707938888970161,12.601408091941584,1.4913565890899461,1.0847187494805628,0.39784524082997696,1,0,1,0,1.2660564246765902,0.89242980130926852,-3.898329264393174,-155.07436471781602,24.925635282183976,null,68001.75,4624238003.0625,null,6.7495731803300139,-27.346275245031677,null,38.141383120930541,-127.72808947278435,null,0,0]
[68395.5,68.395499999999998,5.290143503528232,1.3806212798480657,1.0009229632840408,4.2947734709541933E-2,1,0,412564.57058296143,1.5707939029318911,12.673915745161501,1.4918120151608021,1.0856638471956135,0.3999115807597351,1,0,1,0,1.2690142919899272,0.89671679213656696,-3.9747317995836129,-155.45971087151119,24.540289128488809,null,68395.5,4677944420.25,null,6.7416945992305042,-27.438574614550468,null,38.072859166839621,-128.02113625696072,null,0,0]
[68789.25,68.789249999999996,5.3195133974958626,1.3816840025206614,1.0009336158241722,4.3194676453572944E-2,1,0,414939.68736207834,1.5707939168060947,12.746425997207858,1.4922622597839879,1.0866135723603356,0.40197431742717998,1,0,1,0,1.271986817008373,0.90099226039638036,-4.0509540107485345,-155.84380774646132,24.156192253538677,null,68789.25,4731960915.5625,null,6.7337909651200389,-27.530964398223816,null,38.004540589785158,-128.31284334823752,null,0,0]
[69183,69.183000000000007,5.3488892332336526,1.3827350535284928,1.0009443294001592,4.3441612926395617E-2,1,0,417314.80414119526,1.5707939305223704,12.818938803979909,1.492707410704972,1.0875679128518856,0.40403344274166403,1,0,1,0,1.2749739750601501,0.90525621722668426,-4.126997809916551,-156.22666155327673,23.773338446723272,null,69183,4786287489,null,6.725862339346536,-27.623439105203925,null,37.936425416390648,-128.60322244807284,null,0,0]
[69586,69.585999999999999,5.3789612191609555,1.3837989068850596,1.0009553578615931,4.3694344956854425E-2,1,0,419745.71731448837,1.5707939444001306,12.893157686682276,1.4931578340490503,1.0885494393377757,0.40613719326681785,1,0,1,0,1.2780464347637979,0.90960843509111766,-4.2046452434323598,-156.61722856230253,23.382771437697471,null,69586,4842211396,null,6.7177216421078469,-27.718168570079147,null,37.866918680113528,-128.89905999222339,null,0,0]
[69989,69.989000000000004,5.4090392252148494,1.3848509298976517,1.0009664502561171,4.3947071402062124E-2,1,0,422176.63048778166,1.5707939581180732,12.967379155220634,1.4936031013008264,1.0895357747964869,0.40823714410334638,1,0,1,0,1.2811341713572875,0.91394861948456807,-4.2821097193815918,-157.00650630250712,22.99349369749288,null,69989,4898460121,null,6.7095549058297275,-27.812975742003584,null,37.797620940442414,-129.19353056050352,null,0,0]
[70392,70.391999999999996,5.4391231515225824,1.3858913165198685,1.0009776065816058,4.4199792229921354E-2,1,0,424607.54366107489,1.5707939716789432,13.041603165445993,1.4940433003172156,1.0905269061794813,0.41033328706570665,1,0,1,0,1.2842371589553505,0.91827678390839917,-4.3593931703644655,-157.39450115935321,22.605498840646788,null,70392,4955033664,null,6.7013622067584331,-27.907855118307001,null,37.728530188530833,-129.48664604104619,null,0,0]
[70795,70.795000000000002,5.4692129003893966,1.3869202565390701,1.0009888268359215,4.4452507408339011E-2,1,0,427038.45683436829,1.5707939850854229,13.115829674207243,1.4944785169742565,1.0915228204222833,0.41242561413186202,1,0,1,0,1.2873553718653181,0.92259294237063649,-4.436497491153375,-157.78121943148523,22.218780568514774,null,70795,5011932025,null,6.693143624409168,-28.002801319179657,null,37.659644450091186,-129.77841811230559,null,0,0]
[71207.25,71.207250000000002,5.4999992197808458,1.3879611635724254,1.0010003707715407,4.4711017242356918E-2,1,0,429525.16640183784,1.570793998642606,13.19176243440117,1.4949186554010401,1.0925465288918377,0.41456200960179213,1,0,1,0,1.2905608835940372,0.92699576163141972,-4.5151881681601704,-158.17549959727353,21.824500402726471,null,71207.25,5070472452.5625,null,6.6847097071037451,-28.099990465601721,null,37.589387690389813,-130.07550913167174,null,0,0]
[71619.5,71.619500000000002,5.5307914320069322,1.3889904813874532,1.0010119815998009,4.4969521096691861E-2,1,0,432011.87596930744,1.5707940120437158,13.26769772087594,1.4953537558047403,1.0935752145972677,0.41669439553290716,1,0,1,0,1.2937822738162374,0.93138604869853558,-4.5936952909558286,-158.5684569694331,21.4315430305669,null,71619.5,5129352780.25,null,6.676248882960552,-28.197238530889383,null,37.519341391737356,-130.37121843854371,null,0,0]
[72031.75,72.031750000000002,5.5615894391891185,1.3900084003150264,1.0010236593183743,4.5228018937003858E-2,1,0,434498.58553677716,1.5707940252914319,13.343635490502267,1.4957839040323888,1.0946088635061331,0.41882276386457634,1,0,1,0,1.2970195156592612,0.93576382014989989,-4.6720207704027139,-158.96009802457283,21.039901975427171,null,72031.75,5188573008.0625,null,6.6677612469186069,-28.29454013468343,null,37.449503548332416,-130.66555788988936,null,0,0]
[72444,72.444000000000003,5.5923931455867661,1.3910151065882146,1.0010354039249201,4.5486510728957756E-2,1,0,436985.29510424688,1.5707940383883732,13.419575701125682,1.4962091839952398,1.0956474615713703,0.42094710671210878,1,0,1,0,1.3002725824641992,0.9401290930761701,-4.7501664795640259,-159.35042915488117,20.649570845118831,null,72444,5248133136,null,6.6592468969747101,-28.391890017613704,null,37.379872189114998,-130.95853913726745,null,0,0]
[72865.75,72.865750000000006,5.6239125009638062,1.3920335984758752,1.0010474883926952,4.5750952980532403E-2,1,0,439529.30907654623,1.5707940516337655,13.497268381467348,1.4966393119161252,1.0967151002524711,0.42311622975037888,1,0,1,0,1.3036169624176566,0.94458204500297993,-4.8299288819163362,-159.74840620853294,20.251593791467059,null,72865.75,5309417523.0625,null,6.6505088009291944,-28.491527857452642,null,37.308847882808202,-131.25687835108033,null,0,0]
[73287.5,73.287499999999994,5.6554376251392906,1.3930407366333604,1.0010596428617324,4.6015388829092778E-2,1,0,442073.32304884563,1.5707940647267105,13.574963530355438,1.4970645163138043,1.0977878890310266,0.42528112350371949,1,0,1,0,1.3069778493270325,0.9490219535142328,-4.9095069816686268,-160.14502554375491,19.854974456245088,null,73287.5,5371057656.25,null,6.6417429623713407,-28.591205465480257,null,37.238035621613761,-131.55382007827464,null,0,0]
[73709.25,73.709249999999997,5.6869684221769967,1.3940367078490392,1.0010718673294818,4.6279818237890735E-2,1,0,444617.33702114515,1.570794077669825,13.652661105645622,1.4974848810928119,1.0988658128233937,0.42744178009597239,1,0,1,0,1.310355215345741,0.95344883850781059,-4.9889026671189738,-160.54029374640598,19.459706253594021,null,73709.25,5433053535.5625,null,6.6329494953960308,-28.690917583200164,null,37.16743340313873,-131.84937616320582,null,0,0]
[74131,74.131,{"$f":"SQRT(1+(A525/pole1)^2)","v":5.7185047982395298},{"$f":"ATAN(A525/pole1)","v":1.3950216948806167},{"$f":"SQRT(1+(A525/Zero1)^2)","v":1.0010841617933794},{"$f":"ATAN(A525/Zero1)","v":4.6544241170183527E-2},{"$f":"IF(VIN_nom>Vout, 1, SQRT(1+(A525/z_RHP)^2))","v":1},{"$f":"IF(VIN_nom>Vout, 0, -ATAN(A525/z_RHP))","v":0},{"$f":"SQRT(1+(A525/Pole2)^2)","v":447161.35099344474},{"$f":"ATAN(A525/Pole2)","v":1.5707940904656661},13.730361066146218,1.4979004882653544,{"$f":"SQRT(1+(A525/pole4)^2)","v":1.0999488565329969},{"$f":"ATAN(A525/pole4)","v":0.42959819184002579},{"$f":"IF(VOUT_setting=1,1,SQRT(1+(A525*zterm1)^2))","v":1},{"$f":"IF(VOUT_setting=1,0,ATAN(((A525*zterm1))))","v":0},1,{"$f":"IF(VOUT_setting=1,0,ATAN(A525*$Q$4/(1+Afbr-$Q$5*(A525)^2)))","v":0},{"$f":"SQRT((1-(Z525/pterm2))^2+(A525/pterm1)^2)","v":1.3137490328635799},{"$f":"IF((ATAN((A525/pterm1)/(1-A525^2/pterm2))>0),ATAN((A525/pterm1)/(1-A525^2/pterm2)),PI()+ATAN((A525/pterm1)/(1-A525^2/pterm2)))","v":0.95786272039786735},{"$f":"20*LOG10(((E525*K525*G525*O525)/(C525*I525*S525*M525*Q525))*Adc)","v":-5.0681177888361866},{"$f":"((F525+L525+H525+P525)-(D525+J525+T525+N525+R525))*radconv","v":-160.93421732023558},{"$f":"IF(V525>0,V525,V525+180)","v":19.065782679764425},null,{"$f":"IF(U525<0,A525,1000000000)","v":74131},{"$f":"A525^2","v":5495405161},null,{"$f":"20*LOG10((K525/(I525*M525))*AEA)","v":6.6241285169434159},{"$f":"(L525-(J525+N525))*radconv","v":-28.790659071366473},null,{"$f":"20*LOG10((E525*G525/(C525*S525))*Acs*Am)","v":37.09703925987413},{"$f":"(F525+H525-(D525+T525))*radconv","v":-132.14355824886908},null,{"$f":"SUM((U526<0)*(U525>0))*A525","v":0},0]
[74562.75,{"$f":"A526/1000","v":74.562749999999994},5.750794607964087,1.39601884542159,1.0010968202706005,4.6814927015968337E-2,1,0,449765.68539188063,1.5707941034149624,13.809905778041983,1.4983211053257204,1.1010628676763932,0.43180132883660877,1,0,1,0,1.3172403329311171,0.96236781126090465,-5.1490260157631038,-161.33609498565255,18.663905014347449,null,74562.75,5559603687.5625,null,6.6150700139287677,-28.892790682666373,null,37.025189535961864,-132.44330430298615,null,0,0]
[74994.5,74.994500000000002,5.7830900718998244,1.3970048598293272,1.0011095520971558,4.7085605996574416E-2,1,0,452370.01979031676,1.5707941162151582,13.889452905183534,1.4987369045760548,1.1021822123541039,0.43400000160149071,1,0,{"$f":"IF(VOUT_setting=1,1,SQRT((1+Afbr-$Q$5*(A527)^2)^2+(A527*$Q$4)^2))","v":1},0,1.3207488161053951,0.96685931998801422,-5.2297488221729616,-161.73657704191692,18.263422958083083,null,74994.5,5624175030.25,null,6.605982935982242,-28.994942543969511,null,36.95355380749853,-132.74163449794742,null,0,0]
[75426.25,75.426249999999996,5.8153910958456612,1.3979799217341304,1.0011223572702466,4.7356278072600684E-2,1,0,454974.35418875283,1.5707941288688141,13.969002406309686,1.4991479681795197,1.1033068743329397,0.43619420249697632,1,0,1,0,1.3242744535376381,0.97133727008840831,-5.310288076189261,-162.13567021444283,17.864329785557175,null,75426.25,5689119189.0625,null,6.5968674170809818,-29.097109510212519,null,36.88213007238349,-133.03856070423032,null,0,0]
[75858,75.858000000000004,5.8476975876658397,1.3989442107926846,1.0011352357870582,4.7626943204652168E-2,1,0,457578.68858718901,1.5707941413784319,14.048554241092596,1.4995543764447232,1.104436837368876,0.43838392408864485,1,0,1,0,1.3278172166401736,0.9758016855893753,-5.3906456082340926,-162.53338114855754,17.466618851442462,null,75858,5754436164,null,6.5877235938377865,-29.199286554233435,null,36.810916363581853,-133.33409459432411,null,0,0]
[76299.75,76.299750000000003,5.8807579132882424,1.3999198675977789,1.0011484884988775,4.7903870133016765E-2,1,0,460243.34341176163,1.5707941540312613,14.129950994068407,1.4999654613029993,1.1055984417992617,0.44061971936164179,1,0,1,0,1.3314597313406134,0.98035552101934442,-5.472678131779408,-162.9388799032624,17.061120096737596,null,76299.75,5821651850.0625,null,6.578338835299343,-29.303835484903701,null,36.738268598574983,-133.63504441835869,null,0,0]
[76741.5,76.741500000000002,5.9138237742487441,1.4008846149665208,1.0011618179852604,4.8180789708597259E-2,1,0,462907.9982363343,1.5707941665384226,14.211350107522126,1.5003718370436419,1.1067655612565215,0.44285081033348372,1,0,1,0,1.3351201145029088,0.98489524012255081,-5.5545241776500243,-163.34294547626118,16.657054523738822,null,76741.5,5889257822.25,null,6.5689247433986129,-29.408384683191684,null,36.665836644605101,-133.93456079306952,null,0,0]
[77183.25,77.183250000000001,5.9468950782147667,1.4018386330934542,1.0011752242431402,4.8457701889217351E-2,1,0,465572.65306090703,1.5707941789024176,14.292751541124051,1.5007735839907121,1.1079381783118081,0.4450771896943837,1,0,1,0,1.3387983363565517,0.98942087024044623,-5.6361855895910864,-163.74558474000094,16.254415259999064,null,77183.25,5957254080.5625,null,6.5594814723068895,-29.512929128191089,null,36.593618503755756,-134.2326556118098,null,0,0]
[77625,77.625,5.9799717348812216,1.4027820982654355,1.0011887072694332,4.8734606632707511E-2,1,0,468237.30788547988,1.5707941911256897,14.374155255456897,1.5011707806547605,1.1091162755280575,0.44729885035222916,1,0,1,0,1.3424943674177734,0.99393243922984087,-5.7176641738114817,-164.14680448893682,15.853195511063177,null,77625,6025640625,null,6.5500091786099857,-29.617463915370593,null,36.521612213232267,-134.5293405735662,null,0,0]
[78077,78.076999999999998,6.0138213231238931,1.4037367116221642,1.0012025826024158,4.90179287018584E-2,1,0,470963.79114684247,1.5707942034894138,14.457450114488033,1.5015725637045014,1.1103273625092931,0.44956716920099365,1,0,1,0,1.3462945615068094,0.99853416619413582,-5.8008459247817798,-164.55587151251535,15.444128487484647,null,78077,6096017929,null,6.5402872228864819,-29.724409247476132,null,36.448152417985476,-134.83146226503919,null,0,0]
[78529,78.528999999999996,6.0476763303308267,1.4046806379435914,1.0012165383010949,4.9301242895444533E-2,1,0,473690.27440820518,1.5707942157108106,{"$f":"SQRT(1+(A535/Zero2)^2)","v":14.540747280641156},{"$f":"ATAN(A535/Zero2)","v":1.5019697435619721},1.1115441499588183,0.4518305334982467,1,0,1,0,1.3501133393189446,1.0031212325369503,-5.8838399746067482,-164.96346653401827,15.036533465981734,null,78529,6166803841,null,6.5305352210510659,-29.831334440025302,null,36.374910369995924,-135.13213209399299,null,0,0]
[78981,78.980999999999995,6.0815366660023269,1.4056140540409281,1.0012305743621099,4.9584549168314652E-2,1,0,476416.75766956795,1.5707942277923239,14.624046714492829,1.5023623987609434,1.1127666191765984,0.45408893634558384,1,0,1,0,1.3539506702018924,1.0076936696913221,-5.9666481419139288,-165.36959659278617,14.630403407213834,null,78981,6237998361,null,6.5207533479931978,-29.938234598254986,null,36.301884075746607,-135.43136199453113,null,0,0]
[79433,79.433000000000007,6.1154022416289582,1.4065371328830247,1.0012446907820813,4.9867847475325133E-2,1,0,479143.24093093083,1.5707942397363417,14.707348377511702,1.5027506060615943,1.1139947514575539,0.45634237107725123,1,0,1,0,1.357806523817181,1.0122515095992755,-6.0492722080085484,-165.77426865211666,14.22573134788334,null,79433,6309601489,null,6.5109417807894223,-30.0451049423482,null,36.229071576855759,-135.7291637097685,null,0,0]
[79895.5,79.895499999999998,6.1500598512345963,1.4074711311868817,1.0012592183049493,5.0157718534415037E-2,1,0,481933.06063973688,1.5707942518179305,14.792587413694957,1.503143305628563,1.1152572557653486,0.45864300401557301,1,0,1,0,1.3617710910923297,1.0169001525429304,-6.1336268924811765,-166.1868392683121,13.813160731687901,null,79895.5,6383290920.25,null,6.5008717400536131,-30.154422164467842,null,36.154786933118942,-136.03241710384424,null,0,{"$f":"IF(AH538>0,W538,0)","v":0}]
[80358,80.358000000000004,6.1847227657312143,1.4083946609098668,1.001273829956409,5.0447581157647234E-2,1,0,484722.880348543,1.5707942637604484,14.877828704947254,1.5035315053753315,1.1165256496638956,0.46093842195680368,1,0,1,0,1.3657549884029774,1.0215335814090256,-6.2177924806021903,-166.59789787532438,13.402102124675622,null,80358,6457408164,null,6.4907709912172384,-30.263698402001832,null,36.080722093834304,-136.3341994733226,null,0,0]
[80820.5,80.820499999999996,6.2193908964205882,1.4093078955251921,1.001288525732777,5.0737435296683384E-2,1,0,487512.70005734928,1.5707942755662827,14.963072212728706,1.5039152820893071,1.1177999131040222,0.46322861850606528,1,0,1,0,1.3697581842649607,1.026151831983708,-6.3017707652099952,-167.00745169974417,12.992548300255834,null,80820.5,6531953220.25,null,6.4806397304173728,-30.372928889093032,null,36.006875070026368,-136.63452281065113,null,0,0]
[81283,81.283000000000001,6.2540641565580088,1.4102110047286083,1.0013033056303497,5.1027280903193688E-2,1,0,490302.51976615557,1.5707942872377667,15.048317899371709,1.5042947108232361,1.1190800260353069,0.46551358751662725,1,0,1,0,1.3737806475363945,1.0307549405517213,-6.3855635020850752,-167.41550789389981,12.584492106100186,null,81283,6606926089,null,6.470478155742823,-30.48210897348784,null,35.933243907825833,-136.93339892041206,null,0,0]
[81756.25,81.756249999999994,6.2895485568914893,1.4111247971131424,1.0013185161335931,5.132385457891659E-2,1,0,493157.18393305852,1.5707942990438417,15.13554718925683,1.5046785344881131,1.1203959270399029,0.46784624925598883,1,0,1,0,1.3779165181424167,1.0354494046294374,-6.4711135806051612,-167.83150577321618,12.168494226783821,null,81756.25,6684084414.0625,null,6.4600492227406807,-30.593769846676054,null,35.858122762307893,-137.23773592654013,null,0,0]
[82229.5,82.229500000000002,6.3250381501717756,1.4120283357235373,1.0013338147060729,5.1620419218503022E-2,1,0,496011.84809996147,1.570794310714023,15.222778683365673,1.5050579593384164,1.121717910144046,0.47017342538938917,1,0,1,0,1.3820724973653209,1.0401280930231329,-6.5564729901958856,-168.24595051582176,11.754049484178239,null,82229.5,6761690670.25,null,6.4495889757492177,-30.705368443518367,null,35.783223599708634,-137.54058207230338,null,0,0]
[82702.75,82.702749999999995,6.3605328494742768,1.4129217907343721,1.0013492013437522,5.1916974770202289E-2,1,0,498866.51226686453,1.570794322250644,15.310012344021379,1.5054330604548869,1.1230459538692759,0.47249511012658918,1,0,1,0,1.3862485529494066,1.0447910461340169,-6.6416434973218141,-168.65884955635349,11.341150443646512,null,82702.75,6839744857.5625,null,6.4390976326796556,-30.816900130582599,null,35.708544435652264,-137.84194942577088,null,0,0]
[83176,83.176000000000002,6.3960325697915836,1.4138053286073786,1.0013646760425716,5.2213521182273251E-2,1,0,501721.17643376766,1.570794333655984,15.397248134400003,1.5058039112216639,1.1243800367403716,0.47481129794144017,1,0,1,0,1.3904446530110284,1.0494383048471345,-6.7266268317055564,-169.07021025677534,10.92978974322466,null,83176,6918246976,null,6.4285754131501367,-30.928360386772884,null,35.634083320798041,-138.14184987000243,null,0,0]
[83660.5,83.660499999999999,6.4323812967034835,1.4146997662121512,1.0013806098245095,5.2517107511492842E-2,1,0,504643.70108007424,1.5707943451987767,15.486559844425036,1.506179249559181,1.1257520669258612,0.47717684571058061,1,0,1,0,1.3947612338647732,1.0541798219462681,-6.813438240825775,-169.48976372206576,10.51023627793424,null,83660.5,6999079260.25,null,6.4177713064533872,-31.042391649035626,null,35.558076018374571,-138.4473720730301,null,0,0]
[84145,84.144999999999996,6.4687351118053975,1.4155841511708551,1.0013966358954083,5.2820684151669794E-2,1,0,507566.22572638094,1.5707943566086444,15.575873711158938,1.5065502834813342,1.1271303812560434,0.47953662122521273,1,0,1,0,1.399098757070341,1.0589049778215733,-6.9000570274885673,-169.90772023062587,10.09227976937413,null,84145,7080381025,null,6.406935308764079,-31.156338802694272,null,35.482293229401087,-138.75138142793165,null,0,0]
[84629.5,84.629499999999993,6.5050939297910455,1.4164586506496275,1.0014127542508371,5.3124251047316134E-2,1,0,510488.75037268765,1.5707943678878702,15.665189697712774,1.5069170865107022,1.1285149567054553,0.48189061940240663,1,0,1,0,1.4034571896209336,1.0636138178203876,-6.9864849339721165,-170.32408745812705,9.6759125418729468,null,84629.5,7162152270.25,null,6.3960676606558682,-31.270197344115704,null,35.406732971025747,-139.05389011401135,null,0,0]
[85114,85.114000000000004,6.5414576672391416,1.4173234281587719,1.0014289648863397,5.3427808142954621E-2,1,0,513411.27501899441,1.5707943790386851,15.754507768033291,1.5072797305071721,1.1299057702571547,0.48423883544020019,1,0,1,0,1.4078364989136292,1.0683063877553531,-7.0727236661065831,-170.73887300879665,9.2611269912033549,null,85114,7244392996,null,6.3851686041564006,-31.383962881027347,null,35.331393295390754,-139.35491012776933,null,0,0]
[85609.5,85.609499999999997,6.5786520036283651,1.4181979505284186,1.0014456390070186,5.3738246949673441E-2,1,0,516400.15213405126,1.5707943903121209,15.84585581814588,1.5076463793580459,1.1313345887635871,0.48663437969148604,1,0,1,0,1.4123367947893906,1.0730887168137853,-7.1607264216649957,-171.16144767745632,8.8385523225436771,null,85609.5,7328986490.25,null,6.3739898649843578,-31.500210670597593,null,35.254569279004386,-139.66123700685873,null,0,0]
[86105,86.105000000000004,6.6158513147267355,1.4190626391031234,1.0014624096360503,5.4048675389005103E-2,1,0,519389.02924910816,1.5707944014558084,15.937205974019253,1.5080088250825787,1.1327698831833362,0.48902386700002304,1,0,1,0,1.4168588584443116,1.0778541269783903,-7.2485348115022221,-171.58238390067442,8.4176160993255849,null,86105,7414071025,null,6.3627787913225839,-31.616352236877511,null,35.177971962828927,-139.96603166379685,null,0,0]
[86600.5,86.600499999999997,6.6530555170887933,1.4199176575520327,1.0014792767685867,5.4359093401642571E-2,1,0,522377.90636416519,1.5707944124719748,16.028558199649876,1.5083671394498763,1.1342116289314608,0.49140729312577364,1,0,1,0,1.4214026563052566,1.082602668659701,-7.3361505479440403,-172.00168959283542,7.9983104071645812,null,86600.5,7499646600.25,null,6.3515356461571955,-31.732383224991629,null,35.101599371552503,-140.26930636784383,null,0,0]
[87096,87.096000000000004,6.6902645291143772,1.4207631659604776,1.0014962403997518,5.4669500928290829E-2,1,0,525366.78347922221,1.5707944233627966,16.119912459849541,1.5087213926064329,1.13565980143764,0.49378465412563616,1,0,1,0,1.4259681552342143,1.0873343927080736,-7.423575307364767,-172.41937259816504,7.5806274018349598,null,87096,7585713216,null,6.3402606936568882,-31.84829939004344,null,35.025449564632083,-140.57107320812162,null,0,0]
[87603.25,87.603250000000003,6.7283607928863782,1.4216190367515038,1.0015137062497508,5.4987258355414854E-2,1,0,528426.53709498968,1.570794434384259,16.21343511366722,1.5090799110863748,1.1371489465978282,0.49621210411103872,1,0,1,0,1.4306643626973832,1.0921609550870415,-7.5128770965162905,-172.84528755202223,7.1547124479777722,null,87603.25,7674329410.5625,null,6.3286857027396026,-31.966841065026721,null,34.947722766397845,-140.8784464869955,null,0,0]
[88110.5,88.110500000000002,6.7664619297823387,1.4224652695447231,1.0015312732188377,5.5305004667620027E-2,1,0,531486.29071075702,1.5707944452788209,16.306959827582663,1.5094343172154256,1.1386447748738999,0.49863319048940569,1,0,1,0,1.4353832437535012,1.0969700019541158,-7.6019821876541203,-173.26951836646407,6.7304816335359305,null,88110.5,7763460210.25,null,6.3170779417308873,-32.085253745263302,null,34.870225436268726,-141.18426462120075,null,0,0]
[88617.75,88.617750000000001,6.8045678579433213,1.4233020250376924,1.0015489413016923,5.5622739801331846E-2,1,0,534546.04432652448,1.5707944560486613,16.400486566352395,1.5097846812580578,1.1401472599619007,0.50104790997989201,1,0,1,0,1.4401247642551567,1.1017615891873711,-7.690892268141245,-173.69207324029128,6.307926759708721,null,88617.75,7853105615.0625,null,6.3054376972880979,-32.203533217041745,null,34.792955600224388,-141.48854002324956,null,0,0]
[89125,89.125,6.8426784973236545,1.4241294604016788,1.0015667104929629,5.594046369298928E-2,1,0,537605.79794229206,1.5707944666959099,16.494015295531558,1.5101310718890366,1.1416563755795957,0.50345625961587936,1,0,1,0,1.4448888905240078,1.1065357730756742,-7.7796089897923366,-174.11296030288361,5.8870396971163927,null,89125,7943265625,null,6.2937652569706461,-32.32167537573514,null,34.715911318890754,-141.79128492714847,null,0,0]
[89644,89.644000000000005,6.8816767306795681,1.4249665764415602,1.0015849959349776,5.626553567711217E-2,1,0,540736.4280587699,1.5707944774650788,16.589712560431305,1.5104814438232774,1.1432072838388159,0.50591380089312921,1,0,1,0,1.4497867362456029,1.1114025931420897,-7.8701823135975264,-174.54187904325036,5.4581209567496387,null,89644,8036046736,null,6.2817894124219187,-32.442407902974786,null,34.637313839634288,-142.09947114027554,null,0,0]
[90163,90.162999999999997,6.9206797321107461,1.4257942575556404,1.0016033872124057,5.6590595757746574E-2,1,0,543867.05817524774,1.5707944881102678,16.685411838531255,1.5108277966790367,1.1447650777766201,0.50836466850480899,1,0,1,0,1.45470817731268,1.1162513147198634,-7.9605566053586143,-174.96906881345149,5.0309311865485142,null,90163,8129366569,null,6.2697804746904762,-32.562988326474212,null,34.558948485604645,-142.40608048697729,null,0,0]
[90682,90.682000000000002,6.9596874214544302,1.4266126612430148,1.0016218843194171,5.691564386685577E-2,1,0,546997.6882917257,1.5707944986336055,16.781113095388807,1.5111701991338835,1.1463297293213255,0.51080886027482919,1,0,1,0,1.4596531791604646,1.121081999323343,-8.0507335247750493,-175.39453810643769,4.6054618935623068,null,90682,8223225124,null,6.2577387541307141,-32.683412586739792,null,34.480813286747974,-142.7111255196979,null,0,0]
[91201,91.200999999999993,6.9986997203255026,1.4274219415413862,1.001640487250149,5.7240679936418147E-2,1,0,550128.31840820366,1.5707945090371727,16.876816297341868,1.5115087183113438,1.1479012104310635,0.51324637435799292,1,0,1,0,1.464621707727084,1.12589470884215,-8.140714696525535,-175.81829534633303,4.1817046536669693,null,91201,8317622401,null,6.2456645617008295,-32.803676732273978,null,34.402906307427372,-143.01461861405909,null,0,0]
[91732,91.731999999999999,7.0386187283585313,1.4282406483951509,1.0016596298224913,5.7573218759578847E-2,1,0,553331.33303604543,1.5707945195594477,16.974734268855467,1.5118511139470268,1.1495160654054735,0.51573333449948766,1,0,1,0,1.4697294295303438,1.1308001564998562,-8.2325754275306053,-176.25008726848168,3.7499127315183216,null,91732,8414759824,null,6.2332779152960018,-32.926551830372894,null,34.32343222282713,-143.32353543810876,null,0,0]
[92263,92.263000000000005,7.0785424010294342,1.4290501206126627,1.0016788831561871,5.7905744836009937E-2,1,0,556534.34766388719,1.5707945299606056,17.072654207570924,1.512189582012484,1.1511380101299937,0.51821330172762858,1,0,1,0,1.4748617080346447,1.1356869204386559,-8.3242345866922403,-176.680104678877,3.3198953211229991,null,92263,8512461169,null,6.2208579381631877,-33.049251290308135,null,34.244193040798308,-143.63085338856885,null,0,0]
[92794,92.793999999999997,7.1184706598538812,1.4298505125182606,1.0016982472448497,5.8238258092911346E-2,1,0,559737.36229172908,1.5707945402427252,17.170576079832699,1.5125241896249735,1.152767014678761,0.52068627511918852,1,0,1,0,1.4800185083748558,1.1405550680443846,-8.4156938061482265,-177.10835638643388,2.8916436135661172,null,92794,8610726436,null,6.2084049647265509,-33.171771213766128,null,34.165186794778954,-143.93658517266778,null,0,0]
[93325,93.325000000000003,7.1584034280897058,1.430641975039856,1.0017177220820561,5.8570758457499955E-2,1,0,562940.37691957108,1.5707945504078387,17.268499852747993,1.51285500238286,1.1544030491649371,0.52315225409831012,1,0,1,0,1.4851997962231407,1.1454046670368392,-8.5069546835924541,-177.53485113152621,2.4651488684737899,null,93325,8709555625,null,6.1959193296993433,-33.294107809359673,null,34.086411552361938,-144.24074332216657,null,0,0]
[93868.5,93.868499999999997,7.1992808248157472,1.4314429758726306,1.0017377700495662,5.8911072616408322E-2,1,0,566218.79208008351,1.5707945606931459,17.368730733966366,1.5131897396461873,1.1560848456707815,0.52566903986137081,1,0,1,0,1.4905283778210436,1.1503492902575196,-8.6001601185546637,-177.96957533497311,2.0304246650268851,null,93868.5,8811295292.25,null,6.1831063023228197,-33.419130568534811,null,34.006019144776246,-144.55044476643829,null,0,0]
[94412,94.412000000000006,7.2401627884575701,1.4322349314212832,1.0017579340274094,5.925137311463638E-2,1,0,569497.20724059595,1.5707945708600346,17.468963539001475,1.5135206356588278,1.1577739437598475,0.52817849790954741,1,0,1,0,1.4958825423284372,1.1552746258530737,-8.6931610438780478,-178.40247719852707,1.5975228014729339,null,94412,8913625744,null,6.1702597676469324,-33.543953561240905,null,33.925864754128753,-144.85852363728623,null,0,0]
[94955.5,94.955500000000001,7.2810492420876018,1.4330179930642746,1.0017782140085805,5.9591659874194791E-2,1,0,572775.62240110862,1.5707945809105384,17.569198234927011,1.5138477560922854,1.1594703115216418,0.5306806287306296,1,0,1,0,1.5012622546601684,1.1601807474065242,-8.7859590666072513,-178.83356588136513,1.1664341186348679,null,94955.5,9016546980.25,null,6.1573800849740854,-33.668573052842767,null,33.845946414072394,-145.1649928285224,null,0,0]
[95499,95.498999999999995,7.3219401104881978,1.4337923088426381,1.0017986099860343,5.9931932817113266E-2,1,0,576054.03756162117,1.5707945908466439,17.669434789563212,1.5141711651311536,1.1611739170952049,0.53317543317654648,1,0,1,0,1.5066674803041569,1.1650677287880888,-8.8785557599057423,-179.26285047395211,0.73714952604788664,null,95499,9120059001,null,6.1444676135632728,-33.792985414759812,null,33.766262192184719,-145.46986505919233,null,0,0]
[96611.5,96.611500000000007,7.4056538294592329,1.4353506023937379,1.0018407205744198,6.0628400257188388E-2,1,0,582764.68496929435,1.5707946108364217,17.874616474518156,1.5148218457318141,1.1646834948276648,0.53825925256088636,1,0,1,0,1.5178109530791464,1.1750116050595081,-9.0674722284573033,-180.13597290376879,-0.13597290376878846,null,96611.5,9333781932.25,null,6.1179361040580211,-34.046986702680542,null,33.603877233138412,-146.08898620108829,null,0,0]
[97724,97.724000000000004,7.4893851293821108,1.436874056142535,1.0018833170815844,6.1324808812418807E-2,1,0,589475.33237696777,1.5707946303710685,18.079805555550134,1.5154577573499159,1.1682229927465262,0.54331239583834734,1,0,1,0,1.5290608980552529,1.1848762363124541,-9.2555643658415807,-181.00165069152823,-1.0016506915282264,null,97724,9549980176,null,6.0912717951871533,-34.300076553435389,null,33.442449404625002,-146.70157413809287,null,0,0]
[98862,98.861999999999995,7.5750532458308912,1.4383975799103468,1.0019273926468069,6.2037118369459382E-2,1,0,596339.79687128926,1.5707946498985947,18.289705239773024,1.5160934819654133,1.1718742948330518,0.54844964712732414,1,0,1,0,1.5406785822127613,1.1948856578688496,-9.4471277212175391,-181.87954705223908,-1.8795470522390758,null,98862,9773695044,null,6.0638621053503137,-34.557996152330873,null,33.278295739085884,-147.32155089990823,null,0,0]
[100000,100,7.6607385516545863,1.4398870258663359,1.0019719765299895,6.2749364897807955E-2,1,0,603204.26136561087,1.5707946689816747,18.49961214796642,1.5167147802557988,1.1755563316688464,0.55355485100849877,1,0,1,0,1.5524071058574251,1.2048135238463946,-9.6378539346827825,-182.74981207982947,-2.7498120798294678,null,100000,10000000000,null,6.0363199482824346,-34.814906112091734,null,33.115111682688514,-147.93490596773773,null,0,0]
[101165,101.16500000000001,7.7484740234644125,1.4413776835452985,1.0020181446836049,6.3478444034436601E-2,1,0,610231.59101050103,1.5707946880727872,18.714506502093766,1.5173363818919565,1.1793572645462782,0.55874802007049351,1,0,1,0,1.5645284292526045,1.2148931804680831,-9.8322507053610817,-183.63290171354592,-3.6329017135459196,null,101165,10234357225,null,6.0079905201266302,-35.076838725491143,null,32.949044340166019,-148.55606298805483,null,0,0]
[102330,102.33,7.8362263272881219,1.4428349587801246,1.0020648454171206,6.4207455601805283E-2,1,0,617258.92065539141,1.5707947067292054,18.92940792311121,1.5179438699440353,1.1831897986663809,0.56390768458603102,1,0,1,0,1.5767653468254637,1.2248888402018112,-10.025795182128176,-184.50815883314459,-4.5081588331445914,null,102330,10471428900,null,5.9795291723998512,-35.337660293678177,null,32.783961211125707,-149.17049853946642,null,0,0]
[103520,103.52,7.9258785241260101,1.4442901879438037,1.0021130980805295,6.4952040638591668E-2,1,0,624437.05136562302,1.5707947253524488,19.148928011199779,1.5185503167172247,1.1871368834747082,0.56914353398122675,1,0,1,0,1.5893839194637054,1.2350130577175411,-10.222625414873335,-185.39419697682854,-5.3941969768285389,null,103520,10716390400,null,5.950324475828519,-35.602906592922253,null,32.616335674951877,-149.79129038390624,null,0,0]
[104710,104.71,8.0155471300486418,1.4457128612462711,1.0021619062686511,6.5696553561211041E-2,1,0,631615.18207585486,1.5707947435523966,19.368454982196294,1.5191430164618542,1.191116296387575,0.57434454015926661,1,0,1,0,1.6021225413056401,1.2450512152419124,-10.418590949008665,-186.27223431778165,-6.2722343177816526,null,104710,10964184100,null,5.9209894291536314,-35.866944145341577,null,32.449705187491432,-150.40529017244009,null,0,0]
[105930,105.93,8.1074927539088097,1.447138727840511,1.002212521538806,6.6459760000140797E-2,1,0,638974.27406449616,1.5707947617866629,19.593523149762635,1.5197368702642962,1.1952292534550462,0.57964056356136906,1,0,1,0,1.6153066539164971,1.2552539312001469,-10.618611324632134,-187.16419003029094,-7.1641900302909391,null,105930,11221164900,null,5.8907833420221491,-36.136359663011191,null,32.279890898999447,-151.02783036727982,null,0,0]
[107150,107.15,8.1994544913817631,1.4485326133395438,1.0022637205226275,6.7222888909267073E-2,1,0,646333.36605313746,1.570794779605702,19.818598070281983,1.5203172357658039,1.1993755036818956,0.5849001168507203,1,0,1,0,1.6286163917101721,1.2653678958868502,-10.817747167146985,-188.04791594524329,-8.0479159452432896,null,107150,11481122500,null,5.8604479859733729,-36.40445839606587,null,32.111090412533379,-151.64345754917741,null,0,0]
[108400,108.4,8.2936937353929814,1.4499287111888139,1.002316783824879,6.8004701953470748E-2,1,0,653873.41932018835,1.5707947974469059,20.049214386253976,1.5208983572689585,1.2036578823401065,0.5902512685411091,1,0,1,0,1.6423834410159808,1.2756394134476792,-11.020874461946114,-188.94493009855174,-8.9449300985517368,null,108400,11750560000,null,5.8292366483047511,-36.677762016482347,null,31.939174455402867,-152.26716808206945,null,0,0]
[109650,109.65,8.3879487813016294,1.4512934358567653,1.0023704597097753,6.8786431744915888E-2,1,0,661413.47258723935,1.5707948148813335,20.279837318900512,1.5214662618971251,1.2079744825831498,0.59556432764288958,1,0,1,0,1.6562818254814988,1.2858195902408938,-11.223097276953187,-189.83349273381168,-9.8334927338116813,null,109650,12023122500,null,5.7978977922019883,-36.949640340187841,null,31.768290496498565,-152.88385239362387,null,0,0]
[110925,110.925,8.4841046610620836,1.452654213574418,1.0024258400929524,6.9583709388302495E-2,1,0,669104.32691963168,1.5707948322596503,20.51507929527984,1.5220323704801226,1.2124122908221773,0.60094451753896705,1,0,1,0,1.6705932130800487,1.2961102283853569,-11.428444644508321,-190.7312165821989,-10.731216582198897,null,110925,12304355625,null,5.7658050250035275,-37.225467877679499,null,31.595035896141891,-153.50574870451933,null,0,0]
[112200,112.2,8.5802758988427392,1.4539844894043361,1.0024818575991221,7.0380898436504219E-2,1,0,676795.18125202414,1.5707948492430055,20.750327697237786,1.5225856431854043,1.2168849375215465,0.6062853114365806,1,0,1,0,1.6850407157100982,1.3063077722872278,-11.632874610780865,-191.6203421646226,-11.620342164622599,null,112200,12588840000,null,5.7335881262007193,-37.499773609717579,null,31.422822828672153,-154.12056855490502,null,0,0]
[113510,113.51,8.6791025909645292,1.455320574156773,1.0025400763260144,7.1199877779734758E-2,1,0,684697.1570758943,1.5707948662951856,20.992040363986241,1.5231411877512842,1.2215162466100604,0.61173181879801641,1,0,1,0,1.7000263287859574,1.3166893089174265,-11.841972659452182,-192.52502085989693,-12.525020859896927,null,113510,12884520100,null,5.7003620107156152,-37.780006112996595,null,31.246950895485934,-154.7450147469003,null,0,0]
[114820,114.82,8.7779444274689347,1.4566265719040803,1.0025989674054132,7.2018761461053779E-2,1,0,692599.13289976458,1.5707948829582636,21.233759362001024,1.5236840841630406,1.2261835169481508,0.61713702298117223,1,0,1,0,1.7151551193206023,1.3269746483205049,-12.05012581004906,-193.42082764841794,-13.420827648417941,null,114820,13183632400,null,5.6670138802021039,-38.058596782033824,null,31.072145875402573,-155.36223086638415,null,0,0]
[116155,116.155,8.878687615561029,1.4579275753375021,1.0026596739593798,7.2853173156290973E-2,1,0,700651.90978897619,1.5707948995526584,21.480097610354374,1.5242247704354119,1.2309764310345073,0.62260304821103596,1,0,1,0,1.7307196813131591,1.3373583872161037,-12.26129088117008,-194.32470788681255,-14.324707886812547,null,116155,13491984025,null,5.6329084542841628,-38.340798868080746,null,30.895086230199492,-155.98390901873182,null,0,0]
[117490,117.49,8.9794454945822633,1.4591993839032364,1.0027210785231915,7.3687483237060647E-2,1,0,708704.68667818781,1.5707949157699397,21.726441995836961,1.5247531957604137,1.2358058376164414,0.628026513061546,1,0,1,0,1.7464324493779384,1.3476444093333646,-12.471497789798482,-195.21958639440737,-15.219586394407372,null,117490,13803900100,null,5.598685666551293,-38.621264902944347,null,30.719102109303957,-156.598321491463,null,0,0]
[118860,118.86,9.0828597269034894,1.4604751974726347,1.0027848185095498,7.4543559771949375E-2,1,0,716968.58505887724,1.5707949320336465,21.979251012524269,1.5252831596592438,1.240799351086906,0.63354810603294076,1,0,1,0,1.7627110114359228,1.3580996568845827,-12.686231128451265,-196.12867732507269,-16.128677325072687,null,118860,14127699600,null,5.5634484868040381,-38.907265113865684,null,30.539605950398432,-157.221412211207,null,0,0]
[120230,120.23,{"$f":"SQRT(1+(A589/pole1)^2)","v":9.1862884105196994},{"$f":"ATAN(A589/pole1)","v":1.4617222841911575},{"$f":"SQRT(1+(A589/Zero1)^2)","v":1.0028492933101096},{"$f":"ATAN(A589/Zero1)","v":7.5399526856995511E-2},{"$f":"IF(VIN_nom>Vout, 1, SQRT(1+(A589/z_RHP)^2))","v":1},{"$f":"IF(VIN_nom>Vout, 0, -ATAN(A589/z_RHP))","v":0},{"$f":"SQRT(1+(A589/Pole2)^2)","v":725232.4834395668},{"$f":"ATAN(A589/Pole2)","v":1.5707949479267092},22.232066061947243,1.5258010705835592,{"$f":"SQRT(1+(A589/pole4)^2)","v":1.2458303901098533},{"$f":"ATAN(A589/pole4)","v":0.6390252691567555},{"$f":"IF(VOUT_setting=1,1,SQRT(1+(A589*zterm1)^2))","v":1},{"$f":"IF(VOUT_setting=1,0,ATAN(((A589*zterm1))))","v":0},1,{"$f":"IF(VOUT_setting=1,0,ATAN(A589*$Q$4/(1+Afbr-$Q$5*(A589)^2)))","v":0},{"$f":"SQRT((1-(Z589/pterm2))^2+(A589/pterm1)^2)","v":1.7791451857470215},{"$f":"IF((ATAN((A589/pterm1)/(1-A589^2/pterm2))>0),ATAN((A589/pterm1)/(1-A589^2/pterm2)),PI()+ATAN((A589/pterm1)/(1-A589^2/pterm2)))","v":1.3684543239648101},{"$f":"20*LOG10(((E589*K589*G589*O589)/(C589*I589*S589*M589*Q589))*Adc)","v":-12.899978484609893},{"$f":"((F589+L589+H589+P589)-(D589+J589+T589+N589+R589))*radconv","v":-197.0285106835216},{"$f":"IF(V589>0,V589,V589+180)","v":-17.028510683521603},null,{"$f":"IF(U589<0,A589,1000000000)","v":120230},{"$f":"A589^2","v":14455252900},null,{"$f":"20*LOG10((K589/(I589*M589))*AEA)","v":5.5280975122138809},{"$f":"(L589-(J589+N589))*radconv","v":-39.191410245368054},null,{"$f":"20*LOG10((E589*G589/(C589*S589))*Acs*Am)","v":30.36120956882996},{"$f":"(F589+H589-(D589+T589))*radconv","v":-157.83710043815353},null,{"$f":"SUM((U590<0)*(U589>0))*A589","v":0},0]
[126030,{"$f":"A590/1000","v":126.03},9.6243110404136161,1.466704915146446,1.0031303895746624,7.9022088222292494E-2,1,0,760218.33059869253,1.5707950113833105,23.302440262926787,1.5278691836277642,1.2675350537270449,0.66172599849169489,1,0,1,0,1.8504397636076735,1.4112040113924638,-13.794218281161175,-200.73797906978629,-20.737979069786292,null,126030,15883560900,null,5.3772861503392058,-40.373575716286261,null,29.617781134153351,-160.36440335350005,null,0,0]
[131830,131.83000000000001,10.062551804049569,1.4712536473507973,1.00342464239381,8.2642572454555835E-2,1,0,795204.17775782093,1.5707950692562318,24.372905376307415,1.5297556399040064,1.2898707326951315,0.68365152536753315,1,0,{"$f":"IF(VOUT_setting=1,1,SQRT((1+Afbr-$Q$5*(A591)^2)^2+(A591*$Q$4)^2))","v":1},0,1.9245062291113502,1.4522582571449807,-14.671740276304412,-204.29155626429682,-24.291556264296815,null,131830,17379148900,null,5.2248736145130419,-41.521733204193907,null,28.892671674836279,-162.76982306010296,null,0,0]
[144540,144.54,11.023539192297509,1.4799564775632079,1.0041154100051024,9.0568709391718114E-2,1,0,871871.43937722943,1.5707951798368076,26.718964993376915,1.5333609842986888,1.3408678451263691,0.72908293470598584,1,0,1,0,2.096463463057042,1.5366965702653061,-16.539405988618149,-211.57047982097933,-31.57047982097933,null,144540,20891811600,null,4.8868484680570958,-43.91819653765068,null,27.36303110897849,-167.65228328332867,null,0,0]
[158490,158.49,12.079082094868527,1.4879137177074295,1.0049460758257571,9.9254975818170832E-2,1,0,956018.43383756594,1.5707952807899614,29.294241099421914,1.5366532911661528,1.3997784755438458,0.77503183982840473,1,0,1,0,2.3004101841845652,1.6214191648527316,-18.507331364458878,-218.82700563198622,-38.827005631986225,null,158490,25119080100,null,4.5123578838577991,-46.362245373027086,null,25.769596317337058,-172.46476025895916,null,0,0]
[173780,173.78,13.236749318128568,1.4951770294515543,1.0059434775958762,0.10875834394662852,1,0,1048248.3654001951,1.5707953728225053,32.117194837847052,1.5396553242775823,1.4674526162306956,0.82105016375111051,1,0,1,0,2.5422425221225109,1.7058115197608967,-20.5728440896122,-225.99864280976524,-45.998642809765244,null,173780,30199488400,null,4.101410913510473,-48.826902562713215,null,24.115030562531064,-177.1717402470521,null,0,0]
[190550,190.55,14.507141871231333,1.5018100554966252,1.0071416673127076,0.11915890139575827,1,0,1149405.720031027,1.5707954567800859,35.213674085538017,1.5423944493121577,1.5449177821773716,0.86678092207247992,1,0,1,0,2.8295675800801736,1.7894389845938514,-22.736110747819446,-233.03752390760232,-53.037523907602321,null,190550,36309302500,null,3.6538766869481103,-51.290146517650342,null,22.399298130886184,-181.74737738995194,null,0,0]
[208930,208.93,15.900108504324347,1.5078621384173299,1.0085797033967259,0.13052820707101837,1,0,1260274.6632698358,1.5707955333170707,38.607682562184998,1.5448918491699482,1.6331573196113105,0.91181614765467556,1,0,1,0,3.171182710699584,1.8717632766663292,-24.993148170910704,-239.88694624893492,-59.886946248934919,null,208930,43651744900,null,3.1708345371422082,-53.727388789352936,null,20.625302857600822,-186.15955745958192,null,0,0]
[229090,229.09,17.428533614865255,1.5133876241134083,1.0103064649550844,0.14295955510421102,1,0,1381880.6423609408,1.5707956031433963,42.330612090401829,1.5471705631661106,1.7333400848967344,0.95584247414621482,1,0,1,0,3.5782535326483957,1.9523905741598637,-27.342107540072046,-246.50283935209137,-66.502839352091371,null,229090,52482228100,null,2.6532290920399038,-56.119354793572654,null,18.793948933541781,-190.38348455851872,null,0,0]
[251190,251.19,19.104548155502865,1.518428838325355,1.0123781243114722,0.15653611059595224,1,0,1515188.7841225259,1.5707956668111305,46.412009800163354,1.5492485120543125,1.8465801867969842,0.99852652420008048,1,0,1,0,4.0637492465759131,2.0308488837320393,-29.777044997158804,-252.83569220067443,-72.83569220067443,null,251190,63096416100,null,2.1031335400294782,-58.445916663397369,null,16.909107028465449,-194.38977553727707,null,0,0]
[275420,275.42,20.942561476826498,1.5230285121277429,1.01486295529468,0.17135443245853282,1,0,1661345.1766511837,1.5707957248730238,{"$f":"SQRT(1+(A599/Zero2)^2)","v":50.886964570444519},{"$f":"ATAN(A599/Zero2)","v":1.5511436636317961},1.9741315413150968,1.0396154493465848,1,0,1,0,4.6436326470399232,2.1067656526122382,-32.292729155836717,-258.84555838786633,-78.845558387866333,null,275420,75856176400,null,1.5226360695772589,-60.691557801361107,null,14.973920340239754,-198.15400058650525,null,0,0]
[302000,302,22.959262640514851,1.5272271379764575,1.0178437482784835,0.18752276574285442,1,0,1821676.8693219163,1.5707957778501211,55.796107559950393,1.552872970007831,2.1173990875806119,1.0789234928697478,1,0,1,0,5.3374958885914507,2.1798442485235383,-34.884226507904977,-264.49994586804627,-84.499945868046268,null,302000,91204000000,null,0.91382114626868294,-62.844663877147411,null,12.991237911480077,-201.65528199089889,null,0,0]
[331130,331.13,25.169826424356149,1.5310557560627094,1.0214141818139337,0.20512872903707269,1,0,1997390.270657453,1.5707958261416117,61.176377398040088,1.5544494200178687,2.2776699258973254,1.1162606546166407,1,0,1,0,6.1678301200154397,2.2497364800169577,-37.542149764841781,-269.76403264787876,-89.764032647878764,null,331130,109647076900,null,0.27982517696103615,-64.893604501293012,null,10.967310623850921,-204.87042814658574,null,0,0]
[363080,363.08,27.594742159559747,1.5345496027407635,1.0256915947621452,0.22429151418149529,1,0,2190114.0321634789,1.5707958701976668,67.077642673173628,1.5558876775677593,2.4566048437248984,1.1515568882893155,1,0,1,0,7.1631605287547355,2.3162827486987845,-40.261305083493411,-274.61901060658181,-94.61901060658181,null,363080,131827086400,null,-0.37726039692350311,-66.833526162425969,null,8.9052408790838253,-207.78548444415588,null,0,{"$f":"IF(AH602>0,W602,0)","v":0}]
[398110,398.11,30.253743359792072,1.5377365440916273,1.0308103436415237,0.24511031994862817,1,0,2401416.484919542,1.5707959103740023,73.547926256054708,1.5571993314121813,2.6558070770365694,1.1847449166895809,1,0,1,0,8.3567352659719347,2.3793038537646538,-43.033147220056165,-279.04600656632863,-99.046006566328629,null,398110,158491572100,null,-1.054647189301448,-68.659910194675405,null,6.8107855348990167,-210.38609637165325,null,0,0]
[436520,436.52,33.16960201298609,1.5406436723822501,1.0369310537560774,0.26769076165472888,1,0,2633107.2417097366,1.5707959470154542,80.642640218581136,1.5583956213203243,2.8771020709609654,1.215815958103742,1,0,1,0,9.7890148702142987,2.4387154218630909,-45.85030467377927,-283.03454012413323,-103.03454012413323,null,436520,190549710400,null,-1.7499571815296411,-70.371609471328796,null,4.6889380734041071,-212.66293065280442,null,0,0]
[478630,478.63,36.366610639273375,1.5432951094318077,1.0442412531478737,0.29212830862429479,1,0,2887116.5561704296,1.5707959804285547,88.420891769110071,1.5594865413035812,3.122429991300085,1.2447888228304076,1,0,1,0,11.508297291306345,2.4944785411337427,-48.704839515639442,-286.57879903729543,-106.57879903729543,null,478630,229086676900,null,-2.4608183247172422,-71.969129145998153,null,2.5452643747315356,-214.6096698912973,null,0,0]
[524810,524.80999999999995,39.872859858578906,1.5457139809271532,1.0529642173797293,0.31852015381146959,1,0,3165676.2840686701,1.5707960109066281,96.951024612661428,1.5604816577516181,3.394024390038394,1.2717222849963699,1,0,1,0,13.573466561001441,2.5466306382855635,-51.590207912909619,-289.67950336892744,-109.67950336892744,null,524810,275425536100,null,-3.1853567668530633,-73.455288631149685,null,0.38443441959718133,-216.22421473777777,null,0,0]
[575440,575.44000000000005,43.717201501211591,1.5479200403051254,1.063355704893217,0.34693557270361991,1,0,3471078.6015976453,1.5707960387000088,106.30323041152582,1.5613891361997774,3.6941822797360788,1.2966804787407895,1,0,1,0,16.054156773577219,2.5952237826932745,-54.49848761682486,-292.34000584908551,-112.34000584908551,null,575440,331131193600,null,-3.9215017327274588,-74.833294705914142,null,-1.7877003184436699,-217.5067111431714,null,0,0]
[630960,630.96,47.933044846505744,1.5499323788106176,1.0757173113253096,0.3774369846816864,1,0,3805977.6075073597,1.5707960640503134,116.55878450841787,1.5622168595998749,4.0255611038053427,1.31975521091715,1,0,1,0,19.035203791724637,2.6403709211038091,-57.423376382567838,-294.56910382956841,-114.56910382956841,null,630960,398110521600,null,-4.6677284403200527,-76.107955869506469,null,-3.9663623765940481,-218.46114796006196,null,0,0]
[691830,691.83,52.555319454269224,1.5517676088341161,1.0903921569020147,0.41004912318325032,1,0,4173148.0414000913,1.5707960871676441,127.80265727291506,1.5629716835082459,4.3909448307284196,1.3410388116098226,1,0,1,0,22.617366013721028,2.6821947098934635,-60.357693244607688,-296.37825704310808,-116.37825704310808,null,691830,478628748900,null,-5.4224133639265446,-77.284169463682588,null,-6.1459943150274077,-219.09408757942541,null,0,0]
[758580,758.58,57.624271862465108,1.5534416571935707,1.1077797765985962,0.44477732419398341,1,0,4575786.8858610727,1.5707961082532502,140.13275001402093,1.5636601756282877,4.7935449068238105,1.3606388856286213,1,0,1,0,26.923288069505993,2.7208568280197127,-63.295796949638579,-297.78312483291523,-117.78312483291523,null,758580,575443616400,null,-6.1844344939414606,-78.367724499751745,null,-8.3220768900433839,-219.41540033316349,null,0,0]
[831760,831.76,63.181668729018803,1.554968290343915,1.1283268332289353,0.48157174085015059,1,0,5017211.7643278101,1.5707961274810054,153.6506590003064,1.5642880106819841,5.236701891651645,1.3786563912508434,1,0,1,0,32.09835501957226,2.7565146188821368,-66.231031894835112,-298.80182644196015,-118.80182644196015,null,831760,691824697600,null,-6.9524927254371445,-79.364080333258855,null,-10.489253603744228,-219.43774610870128,null,0,0]
[912010,912.01,69.276112604045764,1.5563608353416005,1.1525478601219166,0.52035460691554181,1,0,5501283.1840730393,1.5707961450191241,168.47460590077785,1.5648606793027264,5.7243094684782774,1.3952017929213756,1,0,1,0,38.319976419993111,2.789352198354849,-69.158584343382444,-299.45614476000333,-119.45614476000333,null,912010,831762240100,null,-7.7258287343893484,-80.279251530206878,null,-12.643470043339367,-219.17689322979646,null,0,0]
[1000000,1000,75.958485475163883,1.5576308603880906,1.1810098116194299,0.56098211559387845,1,0,6032042.6136479033,1.5707961610135743,184.72835451689238,1.5653829462299758,6.2604527705806916,1.4103762985853363,1,0,1,0,45.799042978944641,2.8195423846152434,-72.07285126948166,-299.77040966788297,-119.77040966788297,null,1000000,1000000000000,null,-8.5035072547165989,-81.118763887612317,null,-14.780058449111324,-218.65164578027068,null,0,0]
[]
[]
["Pole/Zero Locations for Chart"]
[{"$f":"U4*1000","v":48978},null,{"$f":"SQRT(1+(A617/pole1)^2)","v":3.852037619531798},{"$f":"ATAN(A617/pole1)","v":1.308185381167206},{"$f":"SQRT(1+(A617/Zero1)^2)","v":1.0004734008662641},{"$f":"ATAN(A617/Zero1)","v":3.0764075955357535E-2},{"$f":"IF(VIN_nom>Vout, 1, SQRT(1+(A617/z_RHP)^2))","v":1},{"$f":"IF(VIN_nom>Vout, 0, -ATAN(A617/z_RHP))","v":0},{"$f":"SQRT(1+(A617/Pole2)^2)","v":295437.38313293533},{"$f":"ATAN(A617/Pole2)","v":1.5707929419828954},{"$f":"SQRT(1+(A617/Zero2)^2)","v":9.1025889495655896},{"$f":"ATAN(A617/Zero2)","v":1.4607152823959602},{"$f":"SQRT(1+(A617/pole4)^2)","v":1.044806064496715},{"$f":"ATAN(A617/pole4)","v":0.29392054791514194},{"$f":"IF(VOUT_setting=1,1,SQRT(1+(A617*zterm1)^2))","v":1},{"$f":"IF(VOUT_setting=1,0,ATAN(((A617*zterm1))))","v":0},{"$f":"IF(VOUT_setting=1,1,SQRT((1+Afbr-$Q$5*(A617)^2)^2+(A617*$Q$4)^2))","v":1},{"$f":"IF(VOUT_setting=1,0,ATAN(A617*$Q$4/(1+Afbr-$Q$5*(A617)^2)))","v":0},{"$f":"SQRT((1-(A617^2/(pole3^2)))^2+(A617/(Q*pole3))^2)","v":1.1411448616761422},{"$f":"ATAN((A617/(Q*pole3))/(1-A617^2/pole3^2))","v":0.67150763201999752},{"$f":"20*LOG10(((E617*K617*G617*O617)/(C617*I617*S617*M617*Q617))*Adc)","v":5.8225203747650091E-2},{"$f":"((F617+L617+H617+P617)-(D617+J617+T617+N617+R617))*radconv","v":-134.81279504906726},{"$f":"IF(V617>0,V617,V617+180)","v":45.187204950932738},"crossover",null,null,null,{"$f":"20*LOG10((K617/(I617*M617))*AEA)","v":7.1005003784036607},{"$f":"(L617-(J617+N617))*radconv","v":-23.147392247169243},null,{"$f":"20*LOG10((E617*G617/(C617*S617))*Acs*Am)","v":41.747010390997723},{"$f":"(F617+H617-(D617+T617))*radconv","v":-111.66540280189801}]
[{"$f":"A617","v":48978},null,null,null,null,null,null,null,null,null,null,null,null,null,null,null,null,null,null,null,null,-135]
[{"$f":"A618","v":48978}]
[1000000,null,null,null,null,null,null,null,null,null,null,null,null,null,null,null,null,null,null,null,null,{"$f":"V617","v":-134.81279504906726}]
[]
[{"$f":"pole1","v":13166.227114142192},null,1.4142135623730951,0.78539816339744828,1.0000342172414638,8.272395760510377E-3,{"$f":"IF(VIN_nom>Vout, 1, SQRT(1+(A622/z_RHP)^2))","v":1},{"$f":"IF(VIN_nom>Vout, 0, -ATAN(A622/z_RHP))","v":0},79419.243019766756,1.5707837353880536,2.629696592249835,1.1807059470186925,1.0033049314425568,{"$f":"ATAN(A622/pole4)","v":8.1189345306596702E-2},{"$f":"IF(VOUT_setting=1,1,SQRT(1+(A622*zterm1)^2))","v":1},{"$f":"IF(VOUT_setting=1,0,ATAN(((A622*zterm1))))","v":0},{"$f":"IF(VOUT_setting=1,1,SQRT((1+Afbr-$Q$5*(A622)^2)^2+(A622*$Q$4)^2))","v":1},{"$f":"IF(VOUT_setting=1,0,ATAN(A622*$Q$4/(1+Afbr-$Q$5*(A622)^2)))","v":0},{"$f":"SQRT((1-(A622^2/(pole3^2)))^2+(A622/(Q*pole3))^2)","v":1.0104834964558822},{"$f":"ATAN((A622/(Q*pole3))/(1-A622^2/pole3^2))","v":0.19001832284743839},{"$f":"20*LOG10(((E622*K622*G622*O622)/(C622*I622*S622*M622*Q622))*Adc)","v":10.791816085536233},{"$f":"((F622+L622+H622+P622)-(D622+J622+T622+N622+R622))*radconv","v":-82.414892442806078},97.585107557193922,"p1",null,null,null,{"$f":"20*LOG10((K622/(I622*M622))*AEA)","v":8.0781634684635968},{"$f":"(L622-(J622+N622))*radconv","v":-27.001617813713814},null,{"$f":"20*LOG10((E622*G622/(C622*S622))*Acs*Am)","v":51.502938182726368},{"$f":"(F622+H622-(D622+T622))*radconv","v":-55.41327462909225}]
[{"$f":"Zero1","v":1591549.4327375637},null,120.88534379444371,1.5625239310343861,1.4142135623730951,0.78539816339744828,1,0,9600294.0000000522,1.57079622263142,294.00170067535322,1.5673949793676554,9.8865909445815863,1.4694759599989364,{"$f":"IF(VOUT_setting=1,1,SQRT(1+(A623*zterm1)^2))","v":1},{"$f":"IF(VOUT_setting=1,0,ATAN(((A623*zterm1))))","v":0},{"$f":"IF(VOUT_setting=1,1,SQRT((1+Afbr-$Q$5*(A623)^2)^2+(A623*$Q$4)^2))","v":1},{"$f":"IF(VOUT_setting=1,0,ATAN(A623*$Q$4/(1+Afbr-$Q$5*(A623)^2)))","v":0},113.93930881889943,-0.2038950115995129,-86.428805508135071,-117.23335062998144,62.766649370018555,"z1",null,null,null,{"$f":"20*LOG10((K623/(I623*M623))*AEA)","v":-12.472400722754141},{"$f":"(L623-(J623+N623))*radconv","v":-84.389647584414277},null,-25.167119219727194,-32.843703045567189]
[{"$f":"Pole2","v":0.16578132219050415},null,1.0000000000792717,1.2591406843018291E-5,1.0000000000000053,1.0416347666019358E-7,1,0,1.4142135623730951,0.78539816339744828,1.0000000004689165,3.0624062128523595E-5,1.0000000000005249,1.0245402252920258E-6,1,0,1,0,1.0000000000016662,2.4031578620389749E-6,100.51116431638881,-44.999157280884013,135.00084271911598,"p2",null,null,{"$f":"Pole2","v":0.16578132219050415},{"$f":"20*LOG10((K624/(I624*M624))*AEA)","v":94.696924448058837},{"$f":"(L624-(J624+N624))*radconv","v":-44.998304123737398},null,54.603525433983719,-8.5315714661844298E-4]
[{"$f":"Zero2","v":5413.433444685591},null,1.081227549733671,0.39009037977620409,1.000005784610045,3.4013474272412201E-3,1,0,32654.061239801824,1.5707657027327682,1.4142135623730951,0.78539816339744828,1.0005594753629352,3.3442925814136201E-2,1,0,1,0,1.0017758105595396,7.8414091709066866E-2,15.554459354847076,-73.562830005140043,106.43716999485996,"z2",null,null,{"$f":"Zero2","v":5413.433444685591},{"$f":"20*LOG10((K625/(I625*M625))*AEA)","v":10.433922116984144},{"$f":"(L625-(J625+N625))*radconv","v":-46.914383927815109},null,53.909822803516661,-26.648446077324934]
[{"$f":"pole3","v":150000},null,11.436588612991869,1.4832458612461923,1.0044315028615345,9.3970200894956807E-2,1,0,904806.39204772562,1.5707952215860821,27.726886079339494,1.5347224266179003,1.3635793156560816,0.7475392216308111,1,0,1,0,2.1743925946728124,{"$error":"#DIV/0!"},-17.319517748939724,{"$error":"#DIV/0!"},{"$error":"#DIV/0!"},"p3",null,null,null,{"$f":"20*LOG10((K626/(I626*M626))*AEA)","v":4.7405250666213155},{"$f":"(L626-(J626+N626))*radconv","v":-44.897661378160755},null,26.729242750092695,{"$error":"#DIV/0!"}]
[{"$f":"Fp2_u","v":161810.45711816079},null,{"$f":"SQRT(1+(A627/pole1)^2)","v":12.330429072672294},{"$f":"ATAN(A627/pole1)","v":1.4896069814883},{"$f":"SQRT(1+(A627/Zero1)^2)","v":1.0051549560300743},{"$f":"ATAN(A627/Zero1)","v":0.10132036679596028},1,0,{"$f":"SQRT(1+(A627/Pole2)^2)","v":976047.57267109142},{"$f":"ATAN(A627/Pole2)","v":1.5707953022546712},{"$f":"SQRT(1+(A627/Zero2)^2)","v":29.907264536765133},{"$f":"ATAN(A627/Zero2)","v":1.5373534009807603},{"$f":"SQRT(1+(A627/pole4)^2)","v":1.4142135623730951},0.78539816339744828,1,0,1,0,2.3512998627386001,-1.5011307565703558,-18.963785349460032,-40.450586775724013,{"$f":"IF(V627>0,V627,V627+180)","v":139.54941322427598},"p4",null,null,null,null,null,null,25.402461643685406,6.465493079773692]
[{"$f":"z_RHP","v":0},null,{"$f":"SQRT(1+(A628/pole1)^2)","v":1},{"$f":"ATAN(A628/pole1)","v":0},{"$f":"SQRT(1+(A628/Zero1)^2)","v":1},{"$f":"ATAN(A628/Zero1)","v":0},1,0,{"$f":"SQRT(1+(A628/Pole2)^2)","v":1},{"$f":"ATAN(A628/Pole2)","v":0},{"$f":"SQRT(1+(A628/Zero2)^2)","v":1},{"$f":"ATAN(A628/Zero2)","v":0},{"$f":"SQRT(1+(A628/pole4)^2)","v":1},0,1,0,1,0,1,0,103.5214642696632,0,{"$f":"IF(V628>0,V628,V628+180)","v":180},"z_RHP",null,null,null,null,null,null,54.603525434686695,0]
[{"$f":"Fp2_u","v":161810.45711816079},null,null,null,null,null,null,null,null,null,null,null,null,null,null,null,null,null,null,null,-25]
[]
[null,null,null,"System","Plant"]
["p1","p-dom",{"$f":"pole1","v":13166.227114142192},{"$f":"U622","v":10.791816085536233},{"$f":"AE622","v":51.502938182726368}]
["z1","ESR zero",{"$f":"Zero1","v":1591549.4327375637},{"$f":"U623","v":-86.428805508135071},{"$f":"AE623","v":-25.167119219727194}]
["p2","EA pole",{"$f":"Pole2","v":0.16578132219050415},{"$f":"U624","v":100.51116431638881},{"$f":"AE624","v":54.603525433983719}]
["z2","EA zero",{"$f":"Zero2","v":5413.433444685591},{"$f":"U625","v":15.554459354847076},{"$f":"AE625","v":53.909822803516661}]
["p3","p_sampling",{"$f":"pole3","v":150000},{"$f":"U626","v":-17.319517748939724},{"$f":"AE626","v":26.729242750092695}]
[]
[]
[{"$f":"U4*1000","v":48978}]
[{"$f":"U4*1000","v":48978}]
[]
[]
[]
[]
[]
[]
[]
[]
[]
[]
[]
[]
[]
[]
[]
[]
[]
[]
[]
[]
[]
[]
[]
[]
[]
[]
[]
[]
[]
[]
[]
[]
[]
[]
[]
[]
[]
[]
[]
[]
[]
[]
[]
[]
[]
[]
[null,null,null,null,null,null,null,null,null,null,null,null,null,null,null,null,null,null,null,null,null,null,null,null,null,null,null,null,null,null,null,null,null,"phase margin",{"$f":"SUM(AI689:AI1306)","v":0}]

{"sheet":"Bode Plot Management","index":8,"n_rows":6,"n_cols":14,"rows_kept":6,"cut":false,"hidden":true,"merged":[]}
[null,null,null,null,null,null,null,null,null,"Single or dual output (MODE)",null,null,null,"3.3V or 5V fixed (FB1/2)"]
[{"$f":"CHOOSE(BODE_PLOT_TYPE, \"BODE_PLOT_Ch1\", \"BODE_PLOT_Ch2\")","v":"BODE_PLOT_Ch1"},null,null,null,null,null,null,null,null,"With/without dither (DITH)",null,null,null,"With/without VOUT connected to VCCX"]
[null,null,null,null,null,null,null,null,null,"FPWM or DEM (DEMB)"]
[null,null,null,null,null,null,null,null,null,"Shunt or inductor DCR current sensing"]
[]
[null,null,null,null,null,{"$f":"INDIRECT(A2)","v":0}]

{"sheet":"Efficiency Calculations","index":9,"n_rows":109,"n_cols":57,"rows_kept":109,"cut":false,"hidden":true,"merged":[[6,24,6,26],[0,0,3,3],[5,0,6,3],[6,6,6,13],[6,17,6,20],[6,21,6,23],[6,51,6,56],[6,27,6,32],[6,33,6,36],[6,40,6,44],[6,45,6,49]]}
["BUCK CONTROLLER POWER DESIGN TOOL"]
[null,null,null,null,null,null,null,{"$f":"AV19","v":0.80234271125354983},"10% load"]
[null,null,null,null,null,null,null,{"$f":"AV59","v":0.88184306492444409},"50% load",null,null,null,null,null,null,null,null,null,null,null,null,null,null,null,null,null,null,null,null,null,null,null,null,null,null,null,null,null,null,null,null,{"$f":"IF(MODE=1, (Qg_Q1+Qg_Q2)*Fsw*Vin, (Qg_Q1+Qg_Q2+Qg_Q3+Qg_Q4)*Fsw*Vin)","v":0.84599999999999997}]
[null,null,null,null,null,null,null,{"$f":"AV109","v":0.85500507596309394},"100% load",null,null,null,null,null,null,null,null,null,null,null,null,null,null,null,null,null,null,null,null,null,null,null,null,null,null,null,null,null,null,null,"I_VCC",{"$f":"(Qg_Q1+Qg_Q2)*Fsw*1000","v":14.1},"mA",{"$f":"AP4*5/1000","v":7.0499999999999993E-2}]
[]
["Enter the values of your design and MOSFET datasheet specifications below. Note that thermal resistance (θJA) will change when components are placed on the PCB"]
[null,null,null,null,null,null,"Operating Point Condtions",null,null,null,null,null,null,null,null,null,null,"Filter Inductor",null,null,null,"Cout",null,null,"Cin",null,null,"High-side BUCK \"Control\" MOSFET Losses ",null,null,null,null,null,"Low-side BUCK \"Sync\" MOSFET Losses ",null,null,null,"External Diode","Diode/FET","Sense Rs","Controller IC Losses",null,null,null,null,"RESULTS",null,null,null,null,null,"Consolidated Buck/Boost Efficiency & Losses"]
["Input Parameters",null,null,null,null,null,"Step","Vin","Mode","Iout","Iout/ phase","Iin","Duty Cycle BUCK Leg","Ripple Current pk-pk","Peak Inductor Current","Valley Inductor Current","SW node voltage at Q1 turn-on","Irms Lf","DCR    Loss","Core Loss","Total Inductor Loss","Irms Cout","Cout ESR Loss","Total Cout Loss","Irms Cin","Cin ESR Loss","Total Cin Loss","Irms","RDS(on) Loss","Transition Loss (not including capacitive loss)","MOSFET Output Capacitance Loss","Dead Time Loss ","Total Control MOSFET Loss","Irms","RDS(on) Loss","Deadtime Loss","Total Sync MOSFET Loss","Deadtime Loss","Reverse Recovery Loss","Isense Shunt Loss","IQ Loss","Switching Current Loss","Switching Current Diss","LDO Loss Saved from Gate Drive Current (ext VCC)","Total IC Loss","Total Loss","Pout","EFF, h",{"$f":"IF(Vin>Vout, \"Buck ''CONTROL'' MOSFET Temp Rise\", \"Boost ''CONTROL'' MOSFET Temp Rise\")","v":"Buck ''CONTROL'' MOSFET Temp Rise"},{"$f":"IF(Vin>Vout, \"Buck ''SYNC'' MOSFET Temp Rise\", \"Boost ''SYNC'' MOSFET Temp Rise\")","v":"Buck ''SYNC'' MOSFET Temp Rise"},null,"h","Inductor Cu & Core Loss","Total MOSFET Loss","Control MOSFET Loss","SYNC MOSFET Loss","Shunt Loss"]
["Design","Input Value","Units","Description",null,null,0,{"$f":"Vin","v":60},{"$f":"MODE","v":1},0,{"$f":"Iout*G9/100/Number_of_Phases","v":0},{"$f":"Vout*K9/(Vin*Efficiency)","v":0},{"$f":"(Vout+(Rdson2+Rs+Rdcr)*K9)/(Vin+(Rs+Rdson2-Rdson1)*K9)","v":5.5016666666666672E-2},{"$f":"(Vin-(Rdson1+Rdcr)*K9-Vout)*M9/(Fsw*Lf)","v":3.1508989730639736},{"$f":"K9+N9/2","v":1.5754494865319868},{"$f":"K9-N9/2","v":-1.5754494865319868},{"$f":"IF(MIN(Vin, -P9/(Coss_Q1+Coss_Q2)*0.00000002)<0, 0, MIN(Vin, -P9/(Coss_Q1+Coss_Q2)*0.00000002))","v":42.927778924577296},{"$f":"SQRT(K9^2+(N9^2)/12)","v":0.90958618514390033},{"$f":"R9^2*Rdcr","v":3.3093881128185348E-3},{"$f":"Core_Loss_Ch1","v":0.2},{"$f":"(T9+S9*(1+Ltc*(Ta-25)))/(1-S9*Ltc*ThetaCa)","v":0.20336322874096091},{"$f":"N9/SQRT(12)","v":0.90958618514390033},{"$f":"RCoutEsr*V9^2","v":8.273470282046337E-4},{"$f":"W9","v":8.273470282046337E-4},{"$f":"SQRT(M9*(1-M9))*SQRT(K9^2+(N9^2)/12)","v":0.20739728512053604},{"$f":"RCinEsr*Y9^2","v":4.3013633875368918E-5},{"$f":"Z9","v":4.3013633875368918E-5},{"$f":"SQRT(M9)*SQRT(K9^2+(N9^2)/12)","v":0.21334918717537127},{"$f":"Rdson1*AB9^2","v":2.8221082914402793E-4},{"$f":"(Vin*K9/2)*Fsw*(Tr_buck+Tf_buck)","v":0},{"$f":"(0.5*Coss_Q1*(Vin-Q9)^2-0.5*Coss_Q2*(Vin-Q9)^2+(Qoss_Q2*(Vin-Q9)/Vin)*Vin)*Fsw","v":0.14341971796987577},{"$f":"IF(K9>N9/2,0,ABS(K9-N9/2)*Vsd_Q1*Deadtime*Fsw)","v":4.6318214904040407E-3},{"$f":"(AF9+AE9+AD9+AC9*(1+RdsonTopTc*Ta-RdsonTopTc*25))/(1-AC9*RdsonTopTc*ThetaJA_Q1)","v":0.14834078333650133},{"$f":"SQRT((1-M9))*SQRT(K9^2+(N9^2)/12)","v":0.88421103393717171},{"$f":"Rdson2*AH9^2","v":2.5800362033695993E-3},{"$f":"IF(K9<N9/2,Deadtime*Fsw*IF(VfdSky_Q2>0,0,Vsd_Q2)*(K9+N9/2),2*Deadtime*Fsw*IF(VfdSky_Q2>0,0,Vsd_Q2)*K9)","v":4.6318214904040407E-3},{"$f":"(AJ9+AI9*(1+RdsonBotTc*Ta-RdsonBotTc*25))/(1-AI9*RdsonBotTc*ThetaJA_Q2)","v":7.2148881624830895E-3},{"$f":"2*Deadtime*Fsw*IF(VfdSky_Q2>0,VfdSky_Q2,Vsd_Q2)*K9","v":0},{"$f":"IF(QrrSky_Q2>0,QrrSky_Q2,Qrr_Q2*K9/(Iout/Number_of_Phases))*Fsw*Vin","v":0},{"$f":"Rs*R9^2","v":1.2410205423069504E-3},{"$f":"Iq*Vin","v":1.3200000000000001E-4},{"$f":"IF(Ext_VCC=1,  (Qg_Q1+Qg_Q2)*Fsw*VCC, (Qg_Q1+Qg_Q2)*Fsw*Vin)","v":0.84599999999999997},{"$f":"(Vin-VCC)*Fsw*(Qg_Q1+Qg_Q2)+(RdsonDRT+RdsonDRT2)*Fsw*Qg_Q1*VCC/(RdsonDRT+2*Rgate1+RdsonDRT2)+(RdsonDRB+RdsonDRB2)*Fsw*Qg_Q2*VCC/(RdsonDRB+2*Rgate2+RdsonDRB2)","v":0.80465934065934064},{"$f":"(Qg_Q1+Qg_Q2)*Fsw*(Vin-VCC)","v":0.77549999999999997},{"$f":"SUM(AO9:AP9)","v":0.846132},{"$f":" SUM(U9,X9,AA9,AG9,AK9,AL9,AM9,AS9,AN9)","v":1.2071622814443324},{"$f":"Vout*K9","v":0},{"$f":"AU9/(AU9+AT9)","v":0},{"$f":"ThetaJA_Q1*BC9","v":6.2303129001330557},{"$f":"ThetaJA_Q2*BD9","v":0.29364594821306178},null,{"$f":"AV9*100","v":0},{"$f":"U9","v":0.20336322874096091},{"$f":"AG9+AK9+AM9","v":0.15555567149898442},{"$f":"AG9+AM9*0.66","v":0.14834078333650133},{"$f":"AK9+AM9*0.33","v":7.2148881624830895E-3},{"$f":"AN9","v":1.2410205423069504E-3}]
[null,null,null,null,null,null,1,60,1,{"$f":"Iout*G10/100","v":0.25},0.25,1.5282407407407408E-2,5.5053654479651132E-2,3.1528755237604211,{"$f":"K10+N10/2","v":1.8264377618802106},{"$f":"K10-N10/2","v":-1.3264377618802106},36.142718307362692,{"$f":"SQRT(K10^2+(N10^2)/12)","v":0.94386722531683231},3.5635413561091837E-3,0.2,0.2036215904728009,{"$f":"N10/SQRT(12)","v":0.91015676618223074},8.2838533902729588E-4,{"$f":"W10","v":8.2838533902729588E-4},{"$f":"SQRT(M10*(1-M10))*SQRT(K10^2+(N10^2)/12)","v":0.21528191963500351},4.634630492173211E-5,{"$f":"Z10","v":4.634630492173211E-5},{"$f":"SQRT(M10)*SQRT(K10^2+(N10^2)/12)","v":0.22146442973036462},3.0408826054193275E-4,3.4674980590062118E-2,0.19473767210309492,3.8997270199278189E-3,0.23362840330762899,0.91751776298418342,2.7780681897919507E-3,5.3697270199278184E-3,8.1514818763628316E-3,1.4699999999999997E-3,1.3140000000000001E-2,1.3363280085409439E-3,1.3200000000000001E-4,0.84599999999999997,0.80465934065934064,0.77549999999999997,0.846132,1.3083545353092827,0.82525000000000004,{"$f":"AU10/(AU10+AT10)","v":0.38678676687400909},10.176633738920417,0.50824865236796724,null,{"$f":"AV10*100","v":38.678676687400909},0.2036215904728009,0.25491988518399183,0.24230080330762899,1.2487681876362832E-2,1.3363280085409439E-3]
["Vin",{"$f":"Vin","v":60},"V","Vin",null,null,2,60,1,0.5,0.5,3.0564814814814815E-2,5.5090642724165119E-2,3.1548519086258033,2.0774259543129014,-1.0774259543129017,29.357655430869254,1.0389534223342207,4.3176968551199586E-3,0.2,0.20438829579127687,0.91072729934925611,8.2942421377998953E-4,8.2942421377998953E-4,0.23704460335384439,5.6190143979181417E-5,5.6190143979181417E-5,0.24385687135934112,3.6869027699683071E-4,6.9349961180124237E-2,0.24282384096984058,3.1676323056799307E-3,0.31572968101851812,1.0099297203621762,3.3658615322337175E-3,6.1076323056799293E-3,9.4786878010787688E-3,2.9399999999999995E-3,2.6280000000000001E-2,1.6191363206699845E-3,1.3200000000000001E-4,0.84599999999999997,0.80465934065934064,0.77549999999999997,0.846132,1.4074534152893028,1.6505000000000001,0.53974007313118333,13.98912820277776,0.73874927350390596,null,53.974007313118335,0.20438829579127687,0.35148836881959689,0.33307448101851811,1.8151087801078769E-2,1.6191363206699845E-3]
["Vout",{"$f":"Vout","v":3.3010000000000002},"V","Vout",null,null,3,60,1,0.75,0.75,4.5847222222222227E-2,5.5127631400216176E-2,3.1568281276572181,2.328414063828609,-0.82841406382860905,22.57259029505747,1.1802388115535409,5.5718546091892591E-3,0.2,0.20566352879165647,0.91129778464413858,8.3046365229731483E-4,8.3046365229731483E-4,0.26936498025788191,7.2557492589329112E-5,7.2557492589329112E-5,0.27711150603637025,4.7610287802202065E-4,0.10402494177018635,0.28767822134200366,2.4355373476561103E-3,0.39464636923959706,1.1472457738076745,4.34337045621458E-3,6.8455373476561093E-3,1.1196825086842385E-2,4.409999999999999E-3,3.9420000000000004E-2,2.0894454784459722E-3,1.3200000000000001E-4,0.84599999999999997,0.80465934065934064,0.77549999999999997,0.846132,1.5044611897414284,2.4757500000000001,0.62201473288175835,17.667869908063079,0.98516080103448522,null,62.201473288175833,0.20566352879165647,0.44526319432643946,0.42066356923959708,2.4205425086842387E-2,2.0894454784459722E-3]
["Fsw",{"$f":"Fsw/1000","v":300},"kHz","Switching Frequency",null,null,4,60,1,1,1,6.1129629629629631E-2,5.5164620507811846E-2,3.1588041808517624,2.579402090425881,-0.5794020904258812,15.787522899887772,1.3533305783931289,7.3260146176555227E-3,0.2,0.20744759574716282,0.91186822206604023,8.315036544138813E-4,8.315036544138813E-4,0.30896713503128748,9.5460690529441825E-5,9.5460690529441825E-5,0.31785878004927332,6.2641206513735636E-4,0.13869992236024847,0.32930080999139905,1.7034421458520905E-3,0.47038008805871356,1.3154730899412075,5.7105491861862449E-3,7.5834421458520884E-3,1.3306361956125107E-2,5.8799999999999989E-3,5.2560000000000003E-2,2.747255481620821E-3,1.3200000000000001E-4,0.84599999999999997,0.80465934065934064,0.77549999999999997,0.846132,1.5993802655885656,3.3010000000000002,0.67362119286543365,21.21292689846597,1.2475022916142919,null,67.362119286543361,0.20744759574716282,0.53624645001483873,0.50506968805871355,3.0651161956125106E-2,2.747255481620821E-3]
["Iout",{"$f":"Iout","v":25},"A","Max Output Current",null,null,5,60,1,1.25,1.25,7.6412037037037042E-2,5.5201610046959712E-2,3.1607800682065359,2.8303900341032682,-0.33039003410326795,9.0024532453206536,1.5475930408102478,9.5801768798572384E-3,0.2,0.20974092529291732,0.91243861161412365,8.3254421996430963E-4,8.3254421996430963E-4,0.35342902514129965,1.2491207581232942E-4,1.2491207581232942E-4,0.36360733913893239,8.1970384186930644E-4,0.17337490295031058,0.36769160368976478,9.7134670026360762E-4,0.54293232452587281,1.5042718912778419,7.4673519455324307E-3,8.3213467002636061E-3,1.5807916090636243E-2,7.3499999999999989E-3,6.5700000000000008E-2,3.592566329946464E-3,1.3200000000000001E-4,0.84599999999999997,0.80465934065934064,0.77549999999999997,0.846132,1.6922131885351497,4.1262500000000006,0.70916492315882818,24.624361630086657,1.5257988848888953,null,70.91649231588282,0.20974092529291732,0.62444024061650905,0.58629432452587282,3.7488916090636246E-2,3.592566329946464E-3]
["Ta",{"$f":"Ta","v":25},"°C","Ambient Temperature",null,null,6,60,1,1.5,1.5,9.1694444444444453E-2,5.5238600017667283E-2,3.1627557897186334,3.0813778948593167,-8.137789485931668E-2,2.2173813313165311,1.7560140514196427,1.2334341395132911E-2,0.2,0.21254406868350514,0.91300895328755027,8.3358534878322818E-4,8.3358534878322818E-4,0.40115331817926314,1.6092398468623312E-4,1.6092398468623312E-4,0.41271411134316183,1.0560642137510097E-3,0.20804988354037271,0.40285059920876315,2.3925101088639102E-4,0.61230443228398124,1.7068252432752018,9.613732956568791E-3,9.0592510108863898E-3,1.8702255161106952E-2,8.819999999999998E-3,7.8840000000000007E-2,4.6253780231748417E-3,1.3200000000000001E-4,0.84599999999999997,0.80465934065934064,0.77549999999999997,0.846132,1.7829626434852377,4.9515000000000002,0.73524797183186774,27.902230955927212,1.8200818250570532,null,73.524797183186777,0.21254406868350514,0.70984668744508816,0.66433883228398127,4.4719455161106952E-2,4.6253780231748417E-3]
["Vcc",{"$f":"VCC","v":5},"V","Subregulated VCC Voltage",null,null,7,60,1,1.75,1.75,0.10697685185185185,5.5275590419942157E-2,3.1647313453851558,3.3323656726925779,0.16763432730742212,0,1.9741142420602913,1.5588508162821113E-2,0.2,0.21585770012445296,0.9135792470854831,8.3462704070527813E-4,8.3462704070527813E-4,0.45111944275847299,2.0350875163471519E-4,2.0350875163471519E-4,0.46412929030228872,1.3355791883223383E-3,0.24272486413043481,0.41363999999999995,0,0.65784804949030529,1.9187785288012715,1.2149646440542948E-2,1.0289999999999999E-2,2.248411918379668E-2,1.0289999999999999E-2,9.198000000000002E-2,5.8456905610579177E-3,1.3200000000000001E-4,0.84599999999999997,0.80465934065934064,0.77549999999999997,0.846132,1.8514756951519531,5.7767499999999998,0.75728619352090742,30.179303678592824,2.1504870307805253,null,75.728619352090746,0.21585770012445296,0.77231216867410202,0.71855484949030535,5.2837519183796686E-2,5.8456905610579177E-3]
["Components","Input Value","Units","Description",null,null,8,60,1,2,2,0.12225925925925926,5.5312581253791841E-2,3.1667067352031983,3.5833533676015992,0.41664663239840083,0,2.1990155287230486,1.9342677182260438E-2,0.2,0.21968261717799067,0.91414949300708381,8.3566929556510845E-4,8.3566929556510845E-4,0.50267157207917212,2.5267870937654638E-4,2.5267870937654638E-4,0.51717825827021324,1.6583347751299507E-3,0.27739984472049695,0.41363999999999995,0,0.69289121915711738,2.1373338402640094,1.5075046617634404E-2,1.1759999999999998E-2,2.6901067691134303E-2,1.1759999999999998E-2,0.10512000000000001,7.2535039433476644E-3,1.3200000000000001E-4,0.84599999999999997,0.80465934065934064,0.77549999999999997,0.846132,1.9108287559745316,6.6020000000000003,0.77553539361008994,32.015357604598925,2.5067401750291665,null,77.553539361009001,0.21968261717799067,0.82491228684825169,0.76227041915711735,6.1590667691134304E-2,7.2535039433476644E-3]
["L",{"$f":"Lf*1000000","v":3.3},"uH","Filter Inductance",null,null,9,60,1,2.25,2.25,0.13754166666666667,5.5349572519223927E-2,3.1686819591698603,3.8343409795849301,0.66565902041506986,0,2.428829370951648,2.3596848452789514E-2,0.2,0.22401974124355409,0.91471969105151485,8.3671211319737886E-4,8.3671211319737886E-4,0.55537931980367727,3.0844618886559524E-4,3.0844618886559524E-4,0.57141829570438374,2.0244169857273554E-3,0.31207482531055908,0.41363999999999995,0,0.72798683211288329,2.3606552574511332,1.838988770695453E-2,1.3229999999999997E-2,3.1714837926715908E-2,1.3229999999999997E-2,0.11826,8.8488181697960674E-3,1.3200000000000001E-4,0.84599999999999997,0.80465934065934064,0.77549999999999997,0.846132,1.9713373877550124,7.4272500000000008,0.79025173609351373,33.853614148741102,2.8791439636173384,null,79.02517360935137,0.22401974124355409,0.87796167003959924,0.80603843211288329,7.0740637926715921E-2,8.8488181697960674E-3]
["Rdcr",{"$f":"Rdcr*1000","v":4},"mW","Inductor DCR at 25°C",null,null,10,60,1,2.5,2.5,0.15282407407407408,5.5386564216245951E-2,3.1706570172822377,4.0853285086411191,0.91467149135888115,0,2.6622838867101977,2.8351021973747028E-2,0.2,0.22887011811356878,0.91528984121793799,8.3775549343675817E-4,8.3775549343675817E-4,0.60895280547076658,3.708235192907173E-4,3.708235192907173E-4,0.62655121481510589,2.4339118336749667E-3,0.34674980590062116,0.41363999999999995,0,0.76313576180140263,2.5875063417604354,2.2094123926546555E-2,1.4699999999999998E-2,3.6926947326561786E-2,1.4699999999999998E-2,0.13140000000000002,1.0631633240155135E-2,1.3200000000000001E-4,0.84599999999999997,0.80465934065934064,0.77549999999999997,0.846132,2.0330050394944155,8.2525000000000013,0.80234271125354983,35.694109995658913,3.267760156191065,null,80.234271125354979,0.22887011811356878,0.93146270912796436,0.84985976180140266,8.0288947326561791E-2,1.0631633240155135E-2]
["LTc",{"$f":"Ltc*1000000","v":4000},"ppm","Inductor Series Resistance Temp Co",null,null,11,60,1,2.75,2.75,0.16810648148148147,5.5423556344865461E-2,3.1726319095374276,4.3363159547687138,1.1636840452312862,0,2.8984995145968071,3.3605197744471703E-2,0.2,0.23423491860514259,0.91585994350551514,8.387994361179254E-4,8.387994361179254E-4,0.66319154704779115,4.3982302807564261E-4,4.3982302807564261E-4,0.68237078825794439,2.8869053345401637E-3,0.38142478649068329,0.41363999999999995,0,0.79833888626186278,2.8170320451585491,2.618770949338552E-2,1.6169999999999997E-2,4.25390688197788E-2,1.6169999999999997E-2,0.14454000000000003,1.2601949154176889E-2,1.3200000000000001E-4,0.84599999999999997,0.80465934065934064,0.77549999999999997,0.846132,2.0958354453051546,9.07775,0.8124294609313818,37.536882022998242,3.672656840964998,null,81.242946093138187,0.23423491860514259,0.98541795508164154,0.89373528626186283,9.023726881977881E-2,1.2601949154176889E-2]
["ThetaCa",{"$f":"ThetaCa","v":20},"°C/W","Core to Ambient Thermal Resistance",null,null,12,60,1,3,3,0.18338888888888891,5.5460548905090029E-2,3.1746066359325296,4.5873033179662652,1.4126966820337352,0,3.1368525532889766,3.9359375764302283E-2,0.2,0.24011543926838028,0.91642999791340918,8.3984394107557115E-4,8.3984394107557115E-4,0.71795336957135669,5.1545704087886516E-4,5.1545704087886516E-4,0.73873076700004559,3.3834835058973488E-3,0.41609976708074542,0.41363999999999995,0,0.8335970882023902,3.0486260503648355,3.0670598623378217E-2,1.7639999999999996E-2,4.8553032335639304E-2,1.7639999999999996E-2,0.15768000000000001,1.4759765911613357E-2,1.3200000000000001E-4,0.84599999999999997,0.80465934065934064,0.77549999999999997,0.846132,2.1598326266999779,9.9030000000000005,0.82095145530583036,39.381967304500392,4.0939084960605205,null,82.095145530583039,0.24011543926838028,1.0398301205380296,0.93766588820239027,0.10058743233563931,1.4759765911613357E-2]
["Cin",{"$f":"Cin*1000000","v":200},"μF","Input Capacitance",null,null,13,60,1,3.25,3.25,0.19867129629629632,5.549754189692719E-2,3.176581196464638,4.8382905982323194,1.661709401767681,0,3.3768904347260649,4.5613556032577565E-2,0.2,0.24651310317212208,0.91700000444078111,8.4088900814439265E-4,8.4088900814439265E-4,0.77313509918611933,5.9773788159353059E-4,5.9773788159353059E-4,0.79552502113161239,3.9237323673280049E-3,0.45077474767080755,0.41363999999999995,0,0.86891125507440181,3.2818484043139375,3.5542745531363197E-2,1.9109999999999995E-2,5.4970826466312607E-2,1.9109999999999995E-2,0.17082,1.7105083512216585E-2,1.3200000000000001E-4,0.84599999999999997,0.80465934065934064,0.77549999999999997,0.846132,2.2250008951147908,10.728250000000001,0.82822837964530349,41.229403113124874,4.5315960571789233,null,82.822837964530351,0.24651310317212208,1.0947020815407145,0.9816524550744018,0.11134142646631261,1.7105083512216585E-2]
["RCinEsr",{"$f":"RCinEsr*1000","v":1},"mW","Input Capacitor ESR",null,null,14,60,1,3.5,3.5,0.2139537037037037,5.55345353203845E-2,3.1785555911308516,5.089277795565426,1.9107222044345742,0,3.6182778551624666,5.2367738548636397E-2,0.2,0.25342946076799805,0.91756996308679362,8.4193463715909981E-4,8.4193463715909981E-4,0.82866028766155231,6.8667787234732655E-4,6.8667787234732655E-4,0.85267491256602423,4.5077379404207581E-3,0.48544972826086963,0.41363999999999995,0,0.90428227914776926,3.5163731500851303,4.0804104431110759E-2,2.0579999999999998E-2,6.1794600288166308E-2,2.0579999999999998E-2,0.18396000000000004,1.9637901955738647E-2,1.3200000000000001E-4,0.84599999999999997,0.80465934065934064,0.77549999999999997,0.846132,2.2913448546691786,11.5535,0.83449833647674121,43.07922692420631,4.9858069917283698,null,83.449833647674126,0.25342946076799805,1.1500368794359357,1.0256958791477693,0.12250140028816633,1.9637901955738647E-2]
["Cout",{"$f":"Cout*1000000","v":100},"μF","Output Capcitance",null,null,15,60,1,3.75,3.75,0.22923611111111111,5.5571529175469515E-2,3.1805298199282674,5.3402649099641337,2.1597350900358663,0,3.860761690127275,5.9621923311817655E-2,0.2,0.26086619083378065,0.91813987385060869,8.4298082795441164E-4,8.4298082795441164E-4,0.88447121688745189,7.8228933350236996E-4,7.8228933350236996E-4,0.91012107035551604,5.135586248771435E-3,0.52012470885093176,0.41363999999999995,0,0.93971105758681028,3.7519542195033968,4.6454629535322832E-2,2.2049999999999997E-2,6.9026665344854077E-2,2.2049999999999997E-2,0.1971,2.2358221241931622E-2,1.3200000000000001E-4,0.84599999999999997,0.80465934065934064,0.77549999999999997,0.846132,2.3588694051688335,12.37875,0.83994230409142456,44.931476418646035,5.4566353795355624,null,83.99423040914246,0.26086619083378065,1.2058377229316644,1.0697970575868103,0.13406966534485409,2.2358221241931622E-2]
["RCoutEsr",{"$f":"Cout_ESR*1000","v":1},"mW","Output Capacitor ESR",null,null,16,60,1,4,4,0.24451851851851852,5.5608523462189807E-2,3.1825038828539829,5.5912519414269912,2.4087480585730088,0,4.1041476070391347,6.7376110321460222E-2,0.2,0.26882510149711203,0.91870973673138823,8.440275803650567E-4,8.440275803650567E-4,0.9405235688993101,8.8458458365509528E-4,8.8458458365509528E-4,0.96781790792509226,5.8073633179831149E-3,0.55479968944099389,0.41363999999999995,0,0.97519849252712387,3.9884026975049238,5.2494275055633019E-2,2.3519999999999996E-2,7.6669497795715372E-2,2.3519999999999996E-2,0.21024000000000001,2.5266041370547582E-2,1.3200000000000001E-4,0.84599999999999997,0.80465934065934064,0.77549999999999997,0.846132,2.4275797453545191,13.204000000000001,0.84470029357871135,46.786189486139207,5.9441820002856165,null,84.470029357871141,0.26882510149711203,1.2621079903228392,1.1139568925271239,0.14604869779571539,2.5266041370547582E-2]
["Top Driver","Input Value","Units","Description",null,null,17,60,1,4.25,4.25,0.25980092592592596,5.5645518180552904E-2,3.1844777799050936,5.8422388899525473,2.6577611100474532,0,4.3482841321865999,7.5630299576903093E-2,0.2,0.27730813134077625,0.9192795517282939,8.4507489422577299E-4,8.4507489422577299E-4,0.9967827946128206,9.9357593963614451E-4,9.9357593963614451E-4,1.0257298877028036,6.523155175666197E-3,0.58947467003105603,0.41363999999999995,0,1.0107454911532809,4.2255713331689204,5.8922995202606597E-2,2.4989999999999995E-2,8.4725740733330709E-2,2.4989999999999995E-2,0.22338000000000002,2.8361362341338656E-2,1.3200000000000001E-4,0.84599999999999997,0.80465934065934064,0.77549999999999997,0.846132,2.4974813764025883,14.029250000000001,0.84888231559396099,48.643404228437795,6.4485544278465605,null,84.888231559396104,0.27730813134077625,1.3188512318866117,1.1581762911532809,0.15844114073333071,2.8361362341338656E-2]
["RdsonDRT",0.7,"W","Drain to Source Resistance of pullup Top FET Driver",null,null,18,60,1,4.5,4.5,0.27508333333333335,5.5682513330566383E-2,3.1864515110786975,6.0932257555393488,2.9067742444606512,0,4.5930515748651581,8.4384491077485232E-2,0.2,0.28631735059078584,0.91984931884048793,8.4612276937130965E-4,8.4612276937130965E-4,1.0532215894626613,1.1092757165102546E-3,1.1092757165102546E-3,1.0838289243828025,7.2830478514384527E-3,0.62414965062111816,0.41363999999999995,0,1.0463529657773909,4.4633437725591483,6.5740744185740344E-2,2.6459999999999994E-2,9.3198206674406592E-2,2.6459999999999994E-2,0.23652000000000001,3.1644184154056967E-2,1.3200000000000001E-4,0.84599999999999997,0.80465934065934064,0.77549999999999997,0.846132,2.5685801056825217,14.854500000000002,0.85257600320365967,50.503158962650417,6.9698671316483489,null,85.257600320365967,0.28631735059078584,1.3760711724517976,1.2024561657773909,0.17124980667440659,3.1644184154056967E-2]
["RdsonDRT2",{"$f":"RdsonDRT2","v":0.5},"W","Drain to Source Resistance of pulldown Top FET Driver",null,null,19,60,1,4.75,4.75,0.29036574074074073,5.5719508912237772E-2,3.1884250763718907,6.3442125381859453,3.1557874618140547,0,4.8383541835666009,9.3638684822545712E-2,0.2,0.2958549623886495,0.9204190380671321,8.4717120563642485E-4,8.4717120563642485E-4,1.1098181056263892,1.2316962275761472E-3,1.2316962275761472E-3,1.1420925458889113,8.0871273769250913E-3,0.65882463121118029,0.41363999999999995,0,1.0820218339185517,4.7016269335477281,7.2947476213462661E-2,2.7929999999999996E-2,0.10208988022850622,2.7929999999999996E-2,0.24965999999999999,3.511450680845464E-2,1.3200000000000001E-4,0.84599999999999997,0.80465934065934064,0.77549999999999997,0.846132,2.6408820507773747,15.67975,0.85585202282006867,52.365492224579171,7.5082415853002038,null,85.585202282006861,0.2958549623886495,1.4337717141470578,1.2467974339185517,0.18447768022850622,3.511450680845464E-2]
["Bottom Driver","Input Value","Units","Description",null,null,20,60,1,5,5,0.30564814814814817,5.575650492557465E-2,3.1903984757817709,6.5951992378908857,3.4048007621091143,0,5.0841144954510895,0.10339288081142356,0.2,0.30592330414929114,0.92098870940738864,8.4822020285588737E-4,8.4822020285588737E-4,1.1665546641141236,1.3608497843664157E-3,1.3608497843664157E-3,1.2005025685344752,8.9354797857588084E-3,0.69349961180124231,0.41363999999999995,0,1.1177530183832083,4.9403455127954379,8.0543145493133461E-2,2.9399999999999996E-2,0.11140392094949791,2.9399999999999996E-2,0.26280000000000003,3.8772330304283835E-2,1.3200000000000001E-4,0.84599999999999997,0.80465934065934064,0.77549999999999997,0.846132,2.7143936437735032,16.505000000000003,0.8587679874774361,54.230442772094747,8.0638063826445663,null,85.876798747743607,0.30592330414929114,1.4919569393327063,1.2912010183832083,0.19812792094949794,3.8772330304283835E-2]
["RdsonDRB",0.7,"W","Drain to Source Resistance of pullup Bottom FET Driver",null,null,21,60,1,5.25,5.25,0.32093055555555555,5.5793501370584565E-2,3.192371709305434,6.8461858546527168,3.6538141453472832,0,5.3302692015379929,0.1136470790434579,0.2,0.31652484900619599,0.9215583328604191,8.4926976086447509E-4,8.4926976086447509E-4,1.2234168123119016,1.4967486966474147E-3,1.4967486966474147E-3,1.2590441275402244,9.8281911135798539E-3,0.72817459239130444,0.41363999999999995,0,1.1535474473464296,5.1794379662054979,8.8527706231044112E-2,3.0869999999999995E-2,0.12114366637496327,3.0869999999999995E-2,0.27594000000000002,4.2617654641296708E-2,1.3200000000000001E-4,0.84599999999999997,0.80465934065934064,0.77549999999999997,0.846132,2.789121635826397,17.330249999999999,0.86137133473593019,56.098049588550047,8.636697361461005,null,86.137133473593025,0.31652484900619599,1.5506311137213928,1.3356678473464296,0.21220386637496327,4.2617654641296708E-2]
["RdsonDRB2",0.5,"W","Drain to Source Resistance of pulldown Bottom FET Driver",null,null,22,60,1,5.5,5.5,0.33621296296296294,5.5830498247275068E-2,3.1943447769399769,7.0971723884699882,3.9028276115300118,0,5.5767660771720537,0.12440127951798791,0.2,0.32766220734546503,0.92212790842538539,8.5031987949697599E-4,8.5031987949697599E-4,1.2803926243223793,1.6394052724191498E-3,1.6394052724191498E-3,1.3177049573109869,1.0765347398036088E-2,0.76284957298136657,0.41363999999999995,0,1.1894060544341187,5.4188535249603333,9.6901112632417602E-2,3.2339999999999994E-2,0.13131263525919337,3.2339999999999994E-2,0.28908000000000006,4.6650479819245465E-2,1.3200000000000001E-4,0.84599999999999997,0.80465934065934064,0.77549999999999997,0.846132,2.8650731020099385,18.1555,0.86370147530677999,57.968351886232988,9.227057735049172,null,86.370147530677997,0.32766220734546503,1.6097986896933121,1.3801988544341188,0.22670903525919339,4.6650479819245465E-2]
["Deadtime","Input Value","Units","Description",null,null,23,60,1,5.75,5.75,0.35149537037037037,5.5867495555653721E-2,3.1963176786824965,7.3481588393412487,4.1518411606587513,0,5.8235616729445034,0.13565548223435275,0.2,0.33933812843057293,0.92269743610144961,8.5137055858818867E-4,8.5137055858818867E-4,1.3374721746321168,1.7888318179151634E-3,1.7888318179151634E-3,1.3764748500088699,1.1747034678783033E-2,0.79752455357142871,0.41363999999999995,0,1.2253297788061814,5.6585499508161314,0.10566331890140811,3.3809999999999993E-2,0.14191453100580365,3.3809999999999993E-2,0.30221999999999999,5.0870805837882282E-2,1.3200000000000001E-4,0.84599999999999997,0.80465934065934064,0.77549999999999997,0.846132,2.9422554464569437,18.98075,0.86579141926307135,59.84138910985962,9.8350382319362097,null,86.57914192630713,0.33933812843057293,1.669464309811985,1.4247949788061813,0.24164713100580365,5.0870805837882282E-2]
["Deadtime",{"$f":"Deadtime*1000000000","v":14},"ns","Total Deadtime",null,null,24,60,1,6,6,0.36677777777777781,5.5904493295728074E-2,3.198290414530089,7.5991452072650443,4.4008547927349557,0,6.0706195563527885,0.14740968719189174,0.2,0.35155550211973646,0.92326691588777343,8.5242179797292094E-4,8.5242179797292094E-4,1.3946471373083682,1.9450406376024265E-3,1.9450406376024265E-3,1.4353452432554756,1.2773338997483947E-2,0.83219953416149084,0.41363999999999995,0,1.261319565240659,5.8984918267839284,0.11481427924110145,3.5279999999999992E-2,0.15295324530642135,3.5279999999999992E-2,0.31536000000000003,5.5278632696959394E-2,1.3200000000000001E-4,0.84599999999999997,0.80465934065934064,0.77549999999999997,0.846132,3.0206764077993511,19.806000000000001,0.8676690222512089,61.717200940107688,10.460797243971351,null,86.766902225120887,0.35155550211973646,1.7296328105470804,1.4694571652406592,0.25702204530642137,5.5278632696959394E-2]
["IQ","Input Value","Units","Description",null,null,25,60,1,6.25,6.25,0.3820601851851852,5.5941491467505683E-2,3.20026298447985,7.8501314922399246,4.6498685077600754,0,6.3179089576762646,0.15966389438994394,0.2,0.36431736067792014,0.92383634778351831,8.5347359748598982E-4,8.5347359748598982E-4,1.4519104773302047,2.1080440341812228E-3,2.1080440341812228E-3,1.4943089026104823,1.3844346397809851E-2,0.86687451475155297,0.41363999999999995,0,1.2973763642188516,6.13864924075851,0.1243539478535146,3.6749999999999991E-2,0.16443286199233817,3.6749999999999991E-2,0.32850000000000001,5.9873960396228984E-2,1.3200000000000001E-4,0.84599999999999997,0.80465934065934064,0.77549999999999997,0.846132,3.1003440649170058,20.631250000000001,0.86935795141126571,63.595827297191768,11.104500983088164,null,86.935795141126576,0.36431736067792014,1.7903092262111897,1.5141863642188516,0.27283786199233817,5.9873960396228984E-2]
["IQ ",{"$f":"Iq*1000","v":2.2000000000000001E-3},"mA","Quiescent Current Of Controller (Not Switching!)",null,null,26,60,1,6.5,6.5,0.39734259259259264,5.5978490070994098E-2,3.2022353885288766,8.1011176942644383,4.8988823057355617,0,6.5654037162205201,0.17241810382784886,0.2,0.37762688068562816,0.92440573178784646,8.5452595696222395E-4,8.5452595696222395E-4,1.5092562103847853,2.2778543085850435E-3,2.2778543085850435E-3,1.5533596744787463,1.4960142925439644E-2,0.9015494953416151,0.41363999999999995,0,1.3335011320114438,6.378996761142421,0.13428227893959613,3.821999999999999E-2,0.17635766110648704,3.821999999999999E-2,0.34164,6.4656788935443327E-2,1.3200000000000001E-4,0.84599999999999997,0.80465934065934064,0.77549999999999997,0.846132,3.1812668430045496,21.456500000000002,0.87087844189467145,65.477308344480633,11.766323647034023,null,87.087844189467148,0.37762688068562816,1.8514987931179308,1.5589835320114438,0.28909886110648703,6.4656788935443327E-2]
["High-side FET","Input Value","Units","Description",null,null,27,60,1,6.75,6.75,0.41262500000000002,5.6015489106200897E-2,3.2042076266742656,8.3521038133371324,5.1478961866628676,0,6.8130814523412582,0.18567231550494587,0.2,0.39148738504675445,0.92497506789991968,8.5557887623646106E-4,8.5557887623646106E-4,1.5666792141279182,2.4544837599804717E-3,2.4544837599804717E-3,1.6124922919575764,1.6120814628060105E-2,0.93622447593167724,0.41363999999999995,0,1.3696948307656531,6.619512631955156,0.14459922669922579,3.9689999999999996E-2,0.18873212320358432,3.9689999999999996E-2,0.35478000000000004,6.9627118314354697E-2,1.3200000000000001E-4,0.84599999999999997,0.80465934065934064,0.77549999999999997,0.846132,3.2634535199665637,22.281750000000002,0.87224789509248601,67.361684492157437,12.446447594385884,null,87.224789509248595,0.39148738504675445,1.9132069539692376,1.6038496307656531,0.30580952320358434,6.9627118314354697E-2]
["RdsonTop",{"$f":"Rdson1*1000","v":6.2},"mW","Drain-Source Resistance of Top FET ",null,null,28,60,1,7,7,0.4279074074074074,5.6052488573133608E-2,3.2061796989131124,8.6030898494565555,5.3969101505434436,0,7.060922911004166,0.19942652942057418,0.2,0.40590234509789791,0.9255443561188994,8.5663235514354811E-4,8.5663235514354811E-4,1.6241750785451261,2.637944685767067E-3,2.637944685767067E-3,1.6717022209058665,1.732644755536596E-2,0.97089945652173926,0.41363999999999995,0,1.4059584285934175,6.8601781346960617,0.15530474533121438,4.1159999999999995E-2,0.20156093388679283,4.1159999999999995E-2,0.36792000000000008,7.478494853271532E-2,1.3200000000000001E-4,0.84599999999999997,0.80465934065934064,0.77549999999999997,0.846132,3.3469132331517342,23.106999999999999,0.87348135590928666,69.248996400923531,13.145063529192472,null,87.348135590928663,0.40590234509789791,1.9754393624802102,1.6487856285934175,0.32297453388679287,7.478494853271532E-2]
["RdsonTopTc",{"$f":"RdsonTopTc*1000000","v":4000},"ppm","Drain to Source Resistance Temp Co",null,null,29,60,1,7.25,7.25,0.44318981481481479,5.6089488471799821E-2,3.2081516052425139,8.8540758026212565,5.6459241973787435,0,7.308911436973248,0.21368074557407341,0.2,0.42087538282168224,0.92611359644394775,8.5768639351834332E-4,8.5768639351834332E-4,1.6817399863169296,2.8282493815772664E-3,2.8282493815772664E-3,1.7309855368779501,1.8577127759059998E-2,1.0055744371118014,0.41363999999999995,0,1.4422928996606421,7.1009770781659132,0.16639878903330443,4.2629999999999994E-2,0.2148489885897979,4.2629999999999994E-2,0.38106000000000007,8.013027959027752E-2,1.3200000000000001E-4,0.84599999999999997,0.80465934065934064,0.77549999999999997,0.846132,3.4316554864374953,23.93225,0.87459189668162163,71.139284985746968,13.862370695604776,null,87.459189668162168,0.42087538282168224,2.0382018882504402,1.6937924996606422,0.34059878858979792,8.013027959027752E-2]
["QgTop",{"$f":"Qg_Q1*1000000000","v":16},"nC","Gate Charge Of Top FET",null,null,30,60,1,7.5,7.5,0.45847222222222223,5.6126488802207053E-2,3.2101233456595648,9.1050616728297822,5.8949383271702178,0,7.5570325519476036,0.22843496396478286,0.2,0.43641027316675962,0.92668278887422595,8.5874099119571327E-4,8.5874099119571327E-4,1.7393706164231526,3.0254101412762577E-3,3.0254101412762577E-3,1.7903388259629764,1.9872941292853028E-2,1.0402494177018635,0.41363999999999995,0,1.4786992242775243,7.3418953873945396,0.17788131200216922,4.4099999999999993E-2,0.22860139761375201,4.4099999999999993E-2,0.39419999999999999,8.5663111486793564E-2,1.3200000000000001E-4,0.84599999999999997,0.80465934065934064,0.77549999999999997,0.846132,3.517690157677301,24.7575,0.87559092837003694,73.032591419656029,14.598577082879707,null,87.559092837003689,0.43641027316675962,2.1015006218912764,1.7388712242775244,0.35868739761375201,8.5663111486793564E-2]
["QgdTop",{"$f":"Qgd_Q1*1000000000","v":5.5},"nC","Gate to Drain Charge",null,null,31,60,1,7.75,7.75,0.47375462962962966,5.6163489564362887E-2,3.2120949201613622,9.3560474600806813,6.1439525399193187,0,7.8052736113483263,0.2436891845920422,0.2,0.45251094647732482,0.927251933408896,8.597961480105357E-4,8.597961480105357E-4,1.797064065903573,3.2294392569618812E-3,3.2294392569618812E-3,1.8497591043013724,2.1213974212464053E-2,1.0749243982919257,0.41363999999999995,0,1.5151783889899708,7.5829207699978465,0.18975226843341361,4.5569999999999992E-2,0.24282349142914728,4.5569999999999992E-2,0.40734000000000004,9.1383444222015817E-2,1.3200000000000001E-4,0.84599999999999997,0.80465934065934064,0.77549999999999997,0.846132,3.605027506523431,25.582750000000001,0.87648845460337943,74.928957137578777,15.353899641166297,null,87.648845460337938,0.45251094647732482,2.1653418804191182,1.7840227889899709,0.37724569142914732,9.1383444222015817E-2]
["QgsTop",{"$f":"Qgs_Q1*1000000000","v":6.3},"nC",null,null,null,32,{"$f":"Vin","v":60},{"$f":"MODE","v":1},8,{"$f":"Iout*G41/100/Number_of_Phases","v":8},{"$f":"Vout*K41/(Vin*Efficiency)","v":0.48903703703703705},{"$f":"(Vout+(Rdson2+Rs+Rdcr)*K41)/(Vin+(Rs+Rdson2-Rdson1)*K41)","v":5.6200490758274879E-2},{"$f":"(Vin-(Rdson1+Rdcr)*K41-Vout)*M41/(Fsw*Lf)","v":3.2140663287450022},9.6070331643725009,6.3929668356274991,{"$f":"IF(MIN(Vin, -P41/(Coss_Q1+Coss_Q2)*0.00000002)<0, 0, MIN(Vin, -P41/(Coss_Q1+Coss_Q2)*0.00000002))","v":0},8.0536235238430223,{"$f":"R41^2*Rdcr","v":0.25944340745519084},{"$f":"Core_Loss_Ch1","v":0.2},{"$f":"(T41+S41*(1+Ltc*(Ta-25)))/(1-S41*Ltc*ThetaCa)","v":0.46918149103511547},0.92782103004711969,8.6085186379769823E-4,8.6085186379769823E-4,1.8548177859198216,3.4403490189645089E-3,3.4403490189645089E-3,1.9092437523127315,{"$f":"Rdson1*AB41^2","v":2.2600312575620233E-2},{"$f":"(Vin*K41/2)*Fsw*(Tr_buck+Tf_buck)","v":1.1095993788819878},{"$f":"(0.5*Coss_Q1*(Vin-Q41)^2-0.5*Coss_Q2*(Vin-Q41)^2+(Qoss_Q2*(Vin-Q41)/Vin)*Vin)*Fsw","v":0.41363999999999995},{"$f":"IF(K41>N41/2,0,ABS(K41-N41/2)*Vsd_Q1*Deadtime*Fsw)","v":0},{"$f":"(AF41+AE41+AD41+AC41*(1+RdsonTopTc*Ta-RdsonTopTc*25))/(1-AC41*RdsonTopTc*ThetaJA_Q1)","v":1.5517313866721361},{"$f":"SQRT((1-M41))*SQRT(K41^2+(N41^2)/12)","v":7.8240424435232008},{"$f":"Rdson2*AH41^2","v":0.20201161252157326},{"$f":"IF(K41<N41/2,Deadtime*Fsw*IF(VfdSky_Q2>0,0,Vsd_Q2)*(K41+N41/2),2*Deadtime*Fsw*IF(VfdSky_Q2>0,0,Vsd_Q2)*K41)","v":4.7039999999999992E-2},{"$f":"(AJ41+AI41*(1+RdsonBotTc*Ta-RdsonBotTc*25))/(1-AI41*RdsonBotTc*ThetaJA_Q2)","v":0.25752082625329803},{"$f":"2*Deadtime*Fsw*IF(VfdSky_Q2>0,VfdSky_Q2,Vsd_Q2)*K41","v":4.7039999999999992E-2},{"$f":"IF(QrrSky_Q2>0,QrrSky_Q2,Qrr_Q2*K41/(Iout/Number_of_Phases))*Fsw*Vin","v":0.42048000000000002},{"$f":"Rs*R41^2","v":9.729127779569656E-2},{"$f":"Iq*Vin","v":1.3200000000000001E-4},{"$f":"IF(Ext_VCC=1,  (Qg_Q1+Qg_Q2)*Fsw*VCC, (Qg_Q1+Qg_Q2)*Fsw*Vin)","v":0.84599999999999997},0.80465934065934064,{"$f":"(Qg_Q1+Qg_Q2)*Fsw*(Vin-VCC)","v":0.77549999999999997},{"$f":"SUM(AO41:AP41)","v":0.846132},{"$f":" SUM(U41,X41,AA41,AG41,AK41,AL41,AM41,AS41,AN41)","v":3.6936781826390082},{"$f":"Vout*K41","v":26.408000000000001},0.87729328045340282,{"$f":"ThetaJA_Q1*BC41","v":76.828423840229718},{"$f":"ThetaJA_Q2*BD41","v":16.128564508509232},null,87.729328045340282,{"$f":"U41","v":0.46918149103511547},{"$f":"AG41+AK41+AM41","v":2.229732212925434},{"$f":"AG41+AM41*0.66","v":1.8292481866721362},{"$f":"AK41+AM41*0.33","v":0.39627922625329803},{"$f":"AN41","v":9.729127779569656E-2}]
["RGateTop",{"$f":"Rgate1","v":1.2},"W","Gate Resistance",null,null,33,60,1,{"$f":"Iout*G42/100","v":8.25},8.25,0.50431944444444443,5.623749238395058E-2,3.2160375714075804,9.8580187857037895,6.6419812142962096,0,8.3020725206656731,0.27569763255356833,0.2,0.4864261557170339,0.92839007878805846,8.6190813839209736E-4,8.6190813839209736E-4,1.912629529168401,3.6581517158469391E-3,3.6581517158469391E-3,1.9687904606003976,2.4032042442056981E-2,1.1442743594720499,0.41363999999999995,0,1.5883592166200908,8.065250911201769,0.21465929846011519,4.8509999999999991E-2,0.27269918991478892,4.8509999999999991E-2,{"$f":"IF(QrrSky_Q2>0,QrrSky_Q2,Qrr_Q2*K42/(Iout/Number_of_Phases))*Fsw*Vin","v":0.43362000000000006},0.10338661220758813,1.3200000000000001E-4,0.84599999999999997,0.80465934065934064,0.77549999999999997,0.846132,3.7836532343137406,27.233250000000002,0.8780131850774866,78.731033498043814,16.92280724953191,null,87.801318507748661,0.4864261557170339,2.2946784065348798,1.8745484166200908,0.41579378991478894,0.10338661220758813]
["GfsTop",{"$f":"Gfs_Q1","v":99},"S","Transconductance of Top FET",null,null,34,60,1,8.5,8.5,0.51960185185185193,5.6274494441397545E-2,3.2180086481461925,10.109004324073096,6.890995675926904,0,8.5506119647443146,0.29245185988651451,0.2,0.50424935277168659,0.92895907963087399,8.6296497162864053E-4,8.6296497162864053E-4,1.9704973063681872,3.8828596344042815E-3,3.8828596344042815E-3,2.0283971851908116,2.5509249873518044E-2,1.1789493400621121,0.41363999999999995,0,1.6250628846466484,8.3065377763986969,0.22769528044143739,4.997999999999999E-2,0.28836460801694286,4.997999999999999E-2,0.44676000000000005,0.10966944745744295,1.3200000000000001E-4,0.84599999999999997,0.80465934065934064,0.77549999999999997,0.846132,3.8749641174987532,28.058500000000002,0.87865506531828574,80.636828355159238,17.736873106289575,null,87.865506531828572,0.50424935277168659,2.3601874926635915,1.9199244846466486,0.43579540801694289,0.10966944745744295]
["VthTop",{"$f":"Vth_Q1","v":3},"V","Threshold Voltage of Top FET",null,null,35,60,1,8.75,8.75,0.53488425925925931,5.6311496930623338E-2,3.2199795589579341,10.359989779478967,7.1400102205210327,0,8.7992341918681909,0.30970608945336903,0.2,0.52265566071830782,0.92952803257472794,8.6402236334224452E-4,8.6402236334224452E-4,2.0284193500516219,4.1144850596638435E-3,4.1144850596638435E-3,2.0880621102860388,2.7032020933755549E-2,1.2136243206521742,0.41363999999999995,0,1.6618434031773666,8.5478955882094194,0.24111951265686921,5.1449999999999989E-2,0.30452335041311257,5.1449999999999989E-2,0.45989999999999998,0.11613978354501339,1.3200000000000001E-4,0.84599999999999997,0.80465934065934064,0.77549999999999997,0.846132,3.9676227052768063,28.883750000000003,0.87922505580293453,82.545850933449401,18.571017261813683,null,87.922505580293446,0.52265566071830782,2.4262667535904789,1.9653774031773665,0.45629035041311256,0.11613978354501339]
["VspTop",{"$f":"Vsp_Q1","v":3.2525252525252526},"V",null,null,null,36,60,1,9,9,0.55016666666666669,5.6348499851635515E-2,3.2219503038399013,10.61097515191995,7.3890248480800498,0,9.047932377806978,0.32746032125347135,0.2,0.54164982737171374,0.93009693761878187,8.6508031336783619E-4,8.6508031336783619E-4,2.086394084271959,4.3530402748850269E-3,4.3530402748850269E-3,2.1477836171020432,2.8600441688530001E-2,1.2482993012422363,0.41363999999999995,0,1.6987017913477462,8.7893177122843777,0.25493194929667046,5.2919999999999988E-2,0.32118193800738554,5.2919999999999988E-2,0.47304000000000002,0.12279762047005176,1.3200000000000001E-4,0.84599999999999997,0.80465934065934064,0.77549999999999997,0.846132,4.0616412977851502,29.709000000000003,0.87972862990755429,84.458144036605347,19.425505116900595,null,87.972862990755431,0.54164982737171374,2.4929237293551321,2.0109081913477462,0.47728513800738559,0.12279762047005176]
["VsdTop",{"$f":"Vsd_Q1","v":0.7},"V",null,null,null,37,60,1,9.25,9.25,0.56544907407407408,5.638550320444162E-2,3.2239208827891885,10.861960441394594,7.6380395586054055,0,9.2967004265782567,0.34571455528616141,0.2,0.5612367729971165,0.93066579476219702,8.6613882154035183E-4,8.6613882154035183E-4,2.1444200991315125,4.598537561559206E-3,4.598537561559206E-3,2.2075602576662523,3.0214598205610437E-2,1.2829742818322984,0.41363999999999995,0,1.7356390751016466,9.0307982222123009,0.26913254455003238,5.4389999999999987E-2,0.33834714989513615,5.4389999999999987E-2,0.48618000000000006,0.12964295823231053,1.3200000000000001E-4,0.84599999999999997,0.80465934065934064,0.77549999999999997,0.846132,4.1570326326093099,30.53425,0.880170685049801,86.373750754269153,20.300612580732043,null,88.017068504980102,0.5612367729971165,2.5601662249967827,2.0565178751016466,0.49878654989513616,0.12964295823231053]
["θJATop",{"$f":"ThetaJA_Q1","v":42},"°C/W","Junction to Ambient Resistance",null,null,38,60,1,9.5,9.5,0.58073148148148146,5.6422506989049243E-2,3.2258912958028936,11.112945647901446,7.887054352098553,0,9.5455328760470337,0.36446879155077905,0.2,0.58142159359881829,0.93123460400413571,8.6719788769473955E-4,8.6719788769473955E-4,2.2024961292609868,4.8509891994096294E-3,4.8509891994096294E-3,2.2673907326795355,3.187457655477445E-2,1.3176492624223606,0.41363999999999995,0,1.7726562872909408,9.272331807752229,0.28372125260507725,5.5859999999999993E-2,0.35602603085873663,5.5859999999999993E-2,0.49931999999999999,0.13667579683154213,1.3200000000000001E-4,0.84599999999999997,0.80465934065934064,0.77549999999999997,0.846132,4.2538098956671426,31.359500000000001,0.88055561507399571,88.292714466219522,21.196626375950583,null,88.055561507399574,0.58142159359881829,2.6280023181496777,2.1022074872909409,0.52080163085873665,0.13667579683154213]
["Low-side FET","Input Value","Units","Description",null,null,39,60,1,9.75,9.75,0.59601388888888895,5.6459511205465912E-2,3.2278615428781099,11.363930771439055,8.1360692285609453,0,9.7944248178066058,0.38372303004666386,0.2,0.60220956434700901,0.93180336534375885,8.6825751166595461E-4,8.6825751166595461E-4,2.2606210355544536,5.1104074663912901E-3,5.1104074663912901E-3,2.3272738727272166,3.3580462807808166E-2,1.3523242430124227,0.41363999999999995,0,1.8097544677764312,9.5139136969486557,0.29869802764885789,5.7329999999999992E-2,0.37422589923469174,5.7329999999999992E-2,0.51246000000000003,0.14389613626749895,1.3200000000000001E-4,0.84599999999999997,0.80465934065934064,0.77549999999999997,0.846132,4.3519867326036881,32.184750000000001,0.8808873719496636,90.215078846610112,22.113844358851956,null,88.088737194966356,0.60220956434700901,2.6964403670111228,2.1479780677764313,0.54333769923469177,0.14389613626749895]
["RdsonBot",{"$f":"Rdson2*1000","v":3.3},"mW","Drain-Source Resistance of Low-side FET",null,null,40,60,1,10,10,0.61129629629629634,5.6496515853699206E-2,3.229831624011934,11.614915812005966,8.3850841879940337,0,10.043371828887397,0.40347727077315587,0.2,0.62360614314710539,0.93237207878022821,8.6931769328896409E-4,8.6931769328896409E-4,2.3187937896007123,5.3768046386908326E-3,5.3768046386908326E-3,2.3872086222638194,3.5332343038506478E-2,1.3869992236024846,0.41363999999999995,0,1.8469346635300519,9.7555395897448047,0.31406282386735818,5.8799999999999991E-2,0.39295435516945698,5.8799999999999991E-2,0.52560000000000007,0.15130397653993344,1.3200000000000001E-4,0.84599999999999997,0.80465934065934064,0.77549999999999997,0.846132,4.451577260718528,33.010000000000005,0.88116951857800274,92.140887868262183,23.052575855396903,null,88.116951857800274,0.62360614314710539,2.7654890186995091,2.193830663530052,0.56640235516945703,0.15130397653993344]
["RdsonBotTc",{"$f":"RdsonBotTc*1000000","v":4000},"ppm","Drain To Source Resitance Temp Co",null,null,41,60,1,10.25,10.25,0.62657870370370372,5.6533520933756659E-2,3.231801539201459,11.86590076960073,8.6340992303992703,0,10.292369913309507,0.423731513729595,0.2,0.64561697435627541,0.93294074431270468,8.7037843239874343E-4,8.7037843239874343E-4,2.3770134603586968,5.6501929907264263E-3,5.6501929907264263E-3,2.4471940259062244,3.7130303322672906E-2,1.4216742041925468,0.41363999999999995,0,1.884197928738373,9.99720560116514,0.32981559544549327,6.026999999999999E-2,0.41221928928226975,6.026999999999999E-2,0.53874,0.15889931764859813,1.3200000000000001E-4,0.84599999999999997,0.80465934065934064,0.77549999999999997,0.846132,4.552596081448641,33.835250000000002,0.88140527416439929,94.070185807011654,24.013142013788382,null,88.140527416439923,0.64561697435627541,2.835157218020643,2.2397663287383729,0.59000348928226976,0.15889931764859813]
["QgBot",{"$f":"Qg_Q2*1000000000","v":31},"nC","Gate Charge Of Top FET",null,null,42,60,1,10.5,10.5,0.6418611111111111,5.657052644564585E-2,3.2337712884437835,12.116885644221892,8.8831143557781083,0,10.541415451865573,0.44448575891532111,0.2,0.66824789265204165,0.93350936194035072,8.7143972883028074E-4,8.7143972883028074E-4,2.4352792027091406,5.9305847951476674E-3,5.9305847951476674E-3,2.5072292166569121,3.8974429738119806E-2,1.4563491847826089,0.41363999999999995,0,1.9215453249074372,10.238908212498647,0.34595629656710836,6.1739999999999989E-2,0.43202889175445003,6.1739999999999989E-2,0.55188000000000004,0.16668215959324539,1.3200000000000001E-4,0.84599999999999997,0.80465934065934064,0.77549999999999997,0.846132,4.6550582934311526,34.660499999999999,0.88159755334801082,96.003017246112364,24.995876174406117,null,88.159755334801076,0.66824789265204165,2.9054542166618873,2.2857861249074372,0.61414929175444999,0.16668215959324539]
["RGateBot",{"$f":"Rgate2","v":1},"W","Gate Resistance",null,null,43,60,1,10.75,10.75,0.6571435185185186,5.6607532389374333E-2,3.235740871736001,12.367870435868001,9.1321295641319988,0,10.790505158815252,0.46574000632967427,0.2,0.69150492705807676,0.93407793166232733,8.7250158241857151E-4,8.7250158241857151E-4,2.4935902475818796,6.2179923228354592E-3,6.2179923228354592E-3,2.5673134057480422,4.0864808364668388E-2,1.491024165372671,0.41363999999999995,0,1.9589779209689495,10.480644229201035,0.36248488141498036,6.3209999999999988E-2,0.45239166186584379,6.3209999999999988E-2,0.56502000000000008,0.17465250237362784,1.3200000000000001E-4,0.84599999999999997,0.80465934065934064,0.77549999999999997,0.846132,4.7589795061717526,35.485750000000003,0.88174900006615931,97.939427080695893,26.001124257939843,null,88.174900006615928,0.69150492705807676,2.9763895828347935,2.3318911209689497,0.63884826186584376,0.17465250237362784]
["VsdBot",{"$f":"Vsd_Q2","v":0.7},"V","Diode Forward Voltage of Bottom FET Body Diode",null,null,44,60,1,11,11,0.67242592592592587,5.6644538764949674E-2,3.2377102890752063,12.618855144537603,9.3811448554623968,0,11.039636044408287,0.48749425597199458,0.2,0.71539430513257096,0.93464645347779574,8.7356399299862142E-4,8.7356399299862142E-4,2.5519458934119079,6.5124278429019014E-3,6.5124278429019014E-3,2.6274458738523969,4.2801525284148705E-2,1.5256991459627331,0.41363999999999995,0,1.996496793387843,10.722410744462957,0.37940130417081636,6.4679999999999988E-2,0.47331641800035268,6.4679999999999988E-2,0.57816000000000012,0.18281034598949797,1.3200000000000001E-4,0.84599999999999997,0.80465934065934064,0.77549999999999997,0.846132,4.8643758543461653,36.311,0.8818620169600051,99.879460522289421,27.029245172614356,null,88.186201696000509,0.71539430513257096,3.0479732113881957,2.3780823933878432,0.66410921800035272,0.18281034598949797]
["QrrBot",{"$f":"Qrr_Q2*1000000000","v":73},"nC","Reverse Recovery Charge of Body Diode",null,null,45,60,1,11.25,11.25,0.68770833333333337,5.6681545572379421E-2,3.2396795404584955,12.869839770229248,9.6301602297707518,0,11.28880538234252,0.50974850784162185,0.2,0.7399224573248081,0.93521492738591783,8.7462696040544754E-4,8.7462696040544754E-4,2.6103454987204606,6.8139036226901708E-3,6.8139036226901708E-3,2.6876259634516342,4.4784666580399812E-2,1.5603741265527953,0.41363999999999995,0,2.0341030262712474,10.964205107575566,0.39670551901525419,6.6149999999999987E-2,0.49481230814387933,6.6149999999999987E-2,0.59130000000000016,0.19115569044060818,1.3200000000000001E-4,0.84599999999999997,0.80465934065934064,0.77549999999999997,0.846132,4.9712640127636387,37.136250000000004,0.88193879098973282,101.8231631033924,28.080611241455895,null,88.193879098973284,0.7399224573248081,3.1202153344151267,2.4243610262712476,0.68994130814387944,0.19115569044060818]
["TrrBot",{"$f":"Trr_Q2*1000000000","v":40},"ns","Reverse Recovery Time of Body Diode",null,null,46,60,1,11.5,11.5,0.70299074074074075,5.6718552811671138E-2,3.2416486258829629,13.120824312941481,9.8791756870585186,0,11.538010681416189,0.53250276193789625,0.2,0.76509602150586176,0.93578335338585461,8.7569048447407526E-4,8.7569048447407526E-4,2.6687884756522822,7.1224319277744322E-3,7.1224319277744322E-3,2.7478530721881453,4.6814318339269738E-2,1.5950491071428574,0.41363999999999995,0,2.0717977114788835,11.206024896373391,0.41439748012786287,6.7619999999999986E-2,0.51688882089946664,6.7619999999999986E-2,0.60443999999999998,0.19968853572671111,1.3200000000000001E-4,0.84599999999999997,0.80465934065934064,0.77549999999999997,0.846132,5.0796612120231712,37.961500000000001,0.88198131581533146,103.77058068211309,29.155608650608293,null,88.198131581533147,0.76509602150586176,3.1931265323783502,2.4707281114788833,0.71635402089946665,0.19968853572671111]
["θJABot",{"$f":"ThetaJA_Q2","v":40.700000000000003},"°C/W","Junction to Ambient Resistance",null,null,47,60,1,11.75,11.75,0.71827314814814824,5.6755560482832382E-2,3.2436175453457028,13.371808772672852,10.128191227327148,0,11.787249660757999,0.55575701826015822,0.2,0.79092184767961748,0.93635173147676742,8.7675456503954043E-4,8.7675456503954043E-4,2.7272742843285323,7.4380250219597075E-3,7.4380250219597075E-3,2.8081266470559596,4.8890566648615623E-2,1.6297240877329195,0.41363999999999995,0,2.1095819487349123,11.447867893155205,0.43247714168714152,6.9089999999999985E-2,0.53955579704597267,6.9089999999999985E-2,0.61758000000000002,0.20840888184755935,1.3200000000000001E-4,0.84599999999999997,0.80465934065934064,0.77549999999999997,0.846132,5.1895852548950607,38.786750000000005,0.88199141140762982,105.72175944686633,30.254637919771092,null,88.199141140762976,0.79092184767961748,3.2667177457808849,2.5171847487349126,0.7433571970459727,0.20840888184755935]
["Bottom Schottky","Input Value","Units","Std Units",null,null,48,60,1,12,12,0.73355555555555563,5.6792568585870715E-2,3.2455862988438118,13.622793149421906,10.377206850578094,0,12.036520228119791,0.57951127680774772,0.2,0.81740700288062329,0.93692006165781805,8.7781920193688958E-4,8.7781920193688958E-4,2.7858024278978872,7.7606951672817628E-3,7.7606951672817628E-3,2.8684461793098679,5.1013497598303752E-2,1.6643990683229817,0.41363999999999995,0,2.1474568457412557,11.689732063582104,0.4509444578705204,7.0559999999999984E-2,0.56282344166829279,7.0559999999999984E-2,0.63072000000000006,0.21731672880290537,1.3200000000000001E-4,0.84599999999999997,0.80465934065934064,0.77549999999999997,0.846132,5.3010545334622954,39.612000000000002,0.88197074127940311,107.67674592113275,31.378114395899519,null,88.197074127940311,0.81740700288062329,3.3410002874095488,2.563732045741256,0.77096104166829282,0.21731672880290537]
["VfdSky",{"$f":"VfdSky_Q2","v":0},"V","Diode Forward Voltage",null,null,49,60,1,12.25,12.25,0.7488379629629629,5.6829577120793701E-2,3.2475548863743828,13.873777443187191,10.626222556812809,0,12.285820460799561,0.60376553758000451,0.2,0.84455877626559728,0.93748834392816727,8.7888439500117762E-4,8.7888439500117762E-4,2.8443724481872992,8.0904546240070114E-3,8.0904546240070114E-3,2.9288111999914035,5.3183197280209524E-2,1.6990740489130438,0.41363999999999995,0,2.1854235182924318,11.931615538132549,0.46979938285436007,7.2029999999999983E-2,0.58670233688891038,7.2029999999999983E-2,0.6438600000000001,0.2264120765925017,1.3200000000000001E-4,0.84599999999999997,0.80465934065934064,0.77549999999999997,0.846132,5.4140880470584491,40.437249999999999,0.88192082766479296,109.63558696828213,32.52646877137866,null,88.192082766479302,0.84455877626559728,3.4159858551813422,2.6103711182924316,0.79917613688891043,0.2264120765925017]
["QrrSky",{"$f":"QrrSky_Q2*1000000000","v":0},"nC","Diode Reverse Recovery Charge",null,null,50,60,1,12.5,12.5,0.76412037037037039,5.6866586087608882E-2,3.2495233079345116,14.124761653967255,10.875238346032745,0,12.535148588830827,0.62851980057626988,0.2,0.87238468440574946,0.93805657828697675,8.7995014406747096E-4,8.7995014406747096E-4,2.902983921869426,8.4273156506323946E-3,8.4273156506323946E-3,2.9892212759863237,5.5399751788217697E-2,1.7337490295031059,0.41363999999999995,0,2.2234830903919094,12.173516595760578,0.48904187081395212,7.3499999999999982E-2,0.61120345523247199,7.3499999999999982E-2,0.65700000000000003,0.23569492521610119,1.3200000000000001E-4,0.84599999999999997,0.80465934065934064,0.77549999999999997,0.846132,5.5287054210409323,41.262500000000003,0.88184306492444409,111.59832979646019,33.700147627961613,null,88.184306492444406,0.87238468440574946,3.4916865456243813,2.6571030903919093,0.82801345523247205,0.23569492521610119]
["Ireverse",{"$f":"Ireverse","v":0},"mA","Reverse Leakage Current",null,null,51,60,1,12.75,12.75,0.77940277777777778,5.6903595486323857E-2,3.2514915635212933,14.375745781760646,11.124254218239354,0,12.784502980130704,0.65377406579588326,0.2,0.90089247678742213,0.93862476473340795,8.810164489708454E-4,8.810164489708454E-4,2.9616364570766049,8.7712905038852644E-3,8.7712905038852644E-3,3.0496760065414419,5.7663247218222254E-2,1.7684240100931681,0.41363999999999995,0,2.2616366943700341,12.415433649458093,0.5086718759235177,7.4969999999999981E-2,0.63633817365710721,7.4969999999999981E-2,0.67013999999999996,0.24516527467345625,1.3200000000000001E-4,0.84599999999999997,0.80465934065934064,0.77549999999999997,0.846132,5.6449269264408759,42.08775,0.88173873141160575,113.56502196354143,34.899614007844264,null,88.17387314116057,0.90089247678742213,3.5681148680271413,2.703929094370034,0.85748437365710717,0.24516527467345625]
["Controller","Input Value","Units","Std Units",null,null,52,60,1,13,13,0.79468518518518527,5.6940605316946141E-2,3.253459653131821,14.62672982656591,11.37327017343409,0,13.03388212734588,0.6795283332381854,0.2,0.93009014152893965,0.93919290326662175,8.820833095463859E-4,8.820833095463859E-4,3.0203296904019066,9.122391438723277E-3,9.122391438723277E-3,3.1101750201796428,5.9973769668126536E-2,1.8030989906832302,0.41363999999999995,0,2.2998854710035306,12.657365233467702,0.52868935235620973,7.643999999999998E-2,0.66211828828840513,7.643999999999998E-2,0.68328,0.25482312496431953,1.3200000000000001E-4,0.84599999999999997,0.80465934065934064,0.77549999999999997,0.846132,5.7627735005334646,42.913000000000004,0.88160899999934661,115.53571138214828,36.12534801333809,null,88.160899999934657,0.93009014152893965,3.6452837592919356,2.7508502710035305,0.8876006882884051,0.25482312496431953]
["θJA",30,"°C/W","Junction to Ambient Resistance",null,null,53,60,1,13.25,13.25,0.80996759259259266,5.6977615579483325E-2,3.2554275767631902,14.877713788381595,11.622286211618405,0,13.283284636174487,0.70578260290251671,0.2,0.95998591132191891,0.93976099388577949,8.8315072562918811E-4,8.8315072562918811E-4,3.0790632842366672,9.4806307083342908E-3,9.4806307083342908E-3,3.1707179719610323,6.2331405237843432E-2,1.8377739712732923,0.41363999999999995,0,2.3382305696366257,12.899309991930284,0.54909425428411118,7.7909999999999979E-2,0.68855602989428111,7.7909999999999979E-2,0.69642000000000004,0.26466847608844379,1.3200000000000001E-4,0.84599999999999997,0.80465934065934064,0.77549999999999997,0.846132,5.8822667683752323,43.738250000000001,0.8814549474397213,117.51044632473828,37.377847436697245,null,88.145494743972137,0.95998591132191891,3.7232065995309069,2.7978677696366256,0.91837462989428109,0.26466847608844379]
["Theta Ja",2,"°C/W","Junction to Ambient Resistance",null,null,54,60,1,13.5,13.5,0.82525000000000004,5.7014626273942957E-2,3.2573953344124948,15.128697667206247,11.871302332793753,0,13.532709214974449,0.73253687478821761,0.2,0.99058826960572532,0.94032903659004252,8.8421869705435758E-4,8.8421869705435758E-4,3.1378369244013036,9.846020564136233E-3,9.846020564136233E-3,3.2313045410457821,6.4736240029295178E-2,1.8724489518633545,0.41363999999999995,0,2.3766731483038117,13.141266668783162,0.56988653587823535,7.9379999999999992E-2,0.71566408014148142,7.9379999999999992E-2,0.70956000000000008,0.27470132804558162,1.3200000000000001E-4,0.84599999999999997,0.80465934065934064,0.77549999999999997,0.846132,6.0034290653577891,44.563500000000005,0.88127756270114099,119.4892754287601,38.657628421758297,null,88.127756270114105,0.99058826960572532,3.8018972284452932,2.8449827483038117,0.94981888014148141,0.27470132804558162]
[null,null,null,null,null,null,55,60,1,13.75,13.75,0.84053240740740742,5.705163740033261E-2,3.2593629260768306,15.379681463038416,12.120318536961584,0,13.78215466549614,0.75979114889462818,0.2,1.0219059569841695,0.94089703137857228,8.8528722365701013E-4,8.8528722365701013E-4,3.1966503180324568,1.0218573255777007E-2,1.0218573255777007E-2,3.2919344285206549,6.7188360146413578E-2,1.9071239324534164,0.41363999999999995,0,2.4152143738542908,13.383234098751222,0.59106615130852558,8.0849999999999991E-2,0.74345558867715145,8.0849999999999991E-2,0.72270000000000012,0.28492168083548552,1.3200000000000001E-4,0.84599999999999997,0.80465934065934064,0.77549999999999997,0.846132,6.1262834608305319,45.388750000000002,0.88107775440952285,121.47224770188022,39.965226159160068,null,88.107775440952281,1.0219059569841695,3.8813699625314424,2.8921963738542908,0.98194658867715146,0.28492168083548552]
[null,null,null,null,null,null,56,60,1,14,14,0.85581481481481481,5.7088648958659831E-2,3.2613303517532901,15.630665175876645,12.369334824123355,0,14.031619874600091,0.78754542522108906,0.2,1.0539479778940044,0.94146497825052955,8.8635630527227006E-4,8.8635630527227006E-4,3.2555031916946993,1.0598301031134374E-2,1.0598301031134374E-2,3.3526073554565423,6.9687851695140121E-2,1.9417989130434785,0.41363999999999995,0,2.4538554220781146,13.625211199295626,0.6126330547438561,8.231999999999999E-2,0.77194419108177637,8.231999999999999E-2,0.73584000000000016,0.29532953445790844,1.3200000000000001E-4,0.84599999999999997,0.80465934065934064,0.77549999999999997,0.846132,6.2508537828482114,46.213999999999999,0.88085635750133862,123.45941252728082,41.301195617028299,null,88.085635750133861,1.0539479778940044,3.9616396131598912,2.9395098220781146,1.0147713910817764,0.29532953445790844]
["Outputs",null,null,null,null,null,57,60,1,14.25,14.25,0.8710972222222223,5.7125660948932191E-2,3.2632976114389689,15.881648805719484,12.618351194280516,0,14.281103806839837,0.81579970376694122,0.2,1.0867236075352449,0.94203287720507578,8.8742594173527338E-4,8.8742594173527338E-4,3.314395289689485,1.0985216136315845E-2,1.0985216136315845E-2,3.4133230611688958,7.2234800783425895E-2,1.9764738936335406,0.41363999999999995,0,2.4925974778340612,13.867196963403524,0.63458720035203209,8.3789999999999989E-2,0.80114402774289384,8.3789999999999989E-2,0.7489800000000002,0.30592488891260294,1.3200000000000001E-4,0.84599999999999997,0.80465934065934064,0.77549999999999997,0.846132,6.3771646441028542,47.039250000000003,0.88061413918189868,125.45081966903057,42.666112309135784,null,88.061413918189871,1.0867236075352449,4.0427215055769556,2.9869242778340612,1.0483074277428939,0.30592488891260294]
["Design","Value","Units",null,null,null,58,60,1,14.5,14.5,0.88637962962962957,5.7162673371157248E-2,3.2652647051309605,16.13263235256548,12.86736764743452,0,14.530605497806386,0.84455398453152464,0.2,1.1202423990738419,0.94260072824137209,8.8849613288116507E-4,8.8849613288116507E-4,3.3733263725377292,1.1379330815658555E-2,1.1379330815658555E-2,3.4740813016567755,7.482929352123166E-2,2.0111488742236028,0.41363999999999995,0,2.5314417351792837,14.109190453118137,0.65692854229978781,8.5259999999999989E-2,0.83106976370230035,8.5259999999999989E-2,0.76212000000000013,0.31670774419932174,1.3200000000000001E-4,0.84599999999999997,0.80465934065934064,0.77549999999999997,0.846132,6.5052414691032876,47.8645,0.88035180426965931,127.44651927752992,44.060573102683627,null,88.035180426965937,1.1202423990738419,4.124631498881584,3.0344409351792838,1.0825693637023004,0.31670774419932174]
["Dmax",{"$f":"D1_Vinmin","v":6.6020000000000009E-2},"index",null,null,null,59,60,1,14.75,14.75,0.90166203703703707,5.7199686225342557E-2,3.2672316328263586,16.38361581641318,13.11638418358682,0,14.780124048144694,0.8738082675141805,0.2,1.1545141911277721,0.94316853135857937,8.8956687854509957E-4,8.8956687854509957E-4,3.4322962156156001,1.178065731172917E-2,1.178065731172917E-2,3.5348818481995021,7.7471416020528039E-2,2.0458238548136651,0.41363999999999995,0,2.5703893975007466,14.351190793722129,0.67965703475278882,8.6729999999999988E-2,0.86173660953305942,8.6729999999999988E-2,0.77526000000000006,0.32767810031781769,1.3200000000000001E-4,0.84599999999999997,0.80465934065934064,0.77549999999999997,0.846132,6.6351105226696703,48.689750000000004,0.88006999999663993,129.44656189503135,45.485197067995522,null,88.006999999663989,1.1545141911277721,4.2073860070338061,3.0820609975007467,1.1175724095330595,0.32767810031781769]
["Dprime",{"$f":"1-B68","v":0.93398000000000003},"index",null,null,null,60,60,1,15,15,0.91694444444444445,5.7236699511495695E-2,3.2691983945222582,16.634599197261128,13.36540080273887,0,15.029658618164362,0.90356255271424912,0.2,1.1895491155481417,0.94373628655585917,8.906381785622427E-4,8.906381785622427E-4,3.4913046079257781,1.2189207865323771E-2,1.2189207865323771E-2,3.5957244860926658,8.0161254395295464E-2,2.080498835403727,0.41363999999999995,0,2.609441677648503,14.593197168498612,0.70277263187563055,8.8199999999999987E-2,0.89316034330644289,8.8199999999999987E-2,0.78839999999999999,0.33883595726784344,1.3200000000000001E-4,0.84599999999999997,0.80465934065934064,0.77549999999999997,0.846132,6.7667989398148167,49.515000000000001,0.87976932032590283,131.45099846123713,46.940626372572225,null,87.976932032590284,1.1895491155481417,4.291002020954946,3.1297856776485031,1.1533323433064429,0.33883595726784344]
["Ipp",{"$f":"Iripple_Vinnom","v":3.2800965978754864},"A",null,null,null,61,60,1,15.25,15.25,0.93222685185185195,5.7273713229624205E-2,3.2711649902157527,16.885582495107876,13.614417504892124,0,15.279208422976884,0.93381684013107114,0.2,1.2253576055075197,0.94430399383237218,8.9171003276776884E-4,8.9171003276776884E-4,3.5503513509887621,1.2604994715467728E-2,1.2604994715467728E-2,3.6566090135076239,8.2898894761524233E-2,2.1151738159937894,0.41363999999999995,0,2.6485997980708258,14.835208814004019,0.72627528783183837,8.9669999999999986E-2,0.9253573337130947,8.9669999999999986E-2,0.80154000000000003,0.35018131504915168,1.3200000000000001E-4,0.84599999999999997,0.80465934065934064,0.77549999999999997,0.846132,6.9003347570888272,50.340250000000005,0.87945030983922168,133.45988031897468,48.427527222122961,null,87.945030983922166,1.2253576055075197,4.3754971317839209,3.177616198070826,1.1898655337130948,0.35018131504915168]
["Top FET","Value","Units",null,null,null,62,60,1,15.5,15.5,0.94750925925925933,5.7310727379735679E-2,3.2731314199039367,17.136565709951967,13.863434290048032,0,15.528772728100469,0.96457112976398751,0.2,1.2619504039083038,0.94487165318727995,8.9278244099686343E-4,8.9278244099686343E-4,3.6094362578407742,1.3028030099415611E-2,1.3028030099415611E-2,3.7175352404606583,8.5684423237214688E-2,2.1498487965838513,0.41363999999999995,0,2.6878649909512449,15.077225015795513,0.75016495678386896,9.1139999999999985E-2,0.9583445644071561,9.1139999999999985E-2,0.81468000000000007,0.36171417366149533,1.3200000000000001E-4,0.84599999999999997,0.80465934065934064,0.77549999999999997,0.846132,7.0357469454686123,51.165500000000002,0.87911346724133388,135.4732592199523,49.946590851371255,null,87.911346724133381,1.2619504039083038,4.4608895553584009,3.2255537909512451,1.2271889644071561,0.36171417366149533]
["Tr",{"$f":"(Qgd_Q1+Qgs_Q1/2)*(RdsonDRT+Rgate1)/(VCC-Vsp_Q1)*1000000000","v":10.890000000000002},"ns","Turn on of MOSFET -> Rise time of current",null,null,63,60,1,15.75,15.75,0.96279166666666682,5.7347741961837645E-2,3.275097683583903,17.387548841791951,14.112451158208049,0,15.778350845480801,0.99582542161233889,0.2,1.2993385721245907,0.94543926461974315,8.938554030847207E-4,8.938554030847207E-4,3.6685591521264929,1.3458326252651052E-2,1.3458326252651052E-2,3.7785029878796772,8.8517925942377007E-2,2.1845237771739132,0.41363999999999995,0,2.7272384983475098,15.319245104562727,0.77444159289310799,9.2609999999999984E-2,0.99213965964689732,9.2609999999999984E-2,0.82782,0.3734345331046271,1.3200000000000001E-4,0.84599999999999997,0.80465934065934064,0.77549999999999997,0.846132,7.1730654448793594,51.990750000000006,0.87875924852138343,137.49118733059541,51.498534567628724,null,87.87592485213834,1.2993385721245907,4.5471981579944067,3.2735996983475095,1.2653202596468973,0.3734345331046271]
["Tf",{"$f":"(Qgd_Q1+Qgs_Q1/2)*(RdsonDRT2+Rgate1)/(Vsp_Q1)*1000000000","v":4.5211024844720491},"ns","Turn off of MOSFET -> Fall time of current",null,null,64,{"$f":"Vin","v":60},{"$f":"MODE","v":1},16,{"$f":"Iout*G73/100/Number_of_Phases","v":16},{"$f":"Vout*K73/(Vin*Efficiency)","v":0.9780740740740741},{"$f":"(Vout+(Rdson2+Rs+Rdcr)*K73)/(Vin+(Rs+Rdson2-Rdson1)*K73)","v":5.7384756975937687E-2},{"$f":"(Vin-(Rdson1+Rdcr)*K73-Vout)*M73/(Fsw*Lf)","v":3.2770637812527452},17.638531890626371,14.361468109373627,{"$f":"IF(MIN(Vin, -P73/(Coss_Q1+Coss_Q2)*0.00000002)<0, 0, MIN(Vin, -P73/(Coss_Q1+Coss_Q2)*0.00000002))","v":0},16.027942129882629,{"$f":"R73^2*Rdcr","v":1.0275797156754658},{"$f":"Core_Loss_Ch1","v":0.2},{"$f":"(T73+S73*(1+Ltc*(Ta-25)))/(1-S73*Ltc*ThetaCa)","v":1.3375334990917114},0.94600682812892267,8.9492891886654505E-4,8.9492891886654505E-4,3.7277198672763303,1.3895895408886661E-2,1.3895895408886661E-2,3.839512086757892,{"$f":"Rdson1*AB73^2","v":9.1399488999031636E-2},{"$f":"(Vin*K73/2)*Fsw*(Tr_buck+Tf_buck)","v":2.2191987577639756},{"$f":"(0.5*Coss_Q1*(Vin-Q73)^2-0.5*Coss_Q2*(Vin-Q73)^2+(Qoss_Q2*(Vin-Q73)/Vin)*Vin)*Fsw","v":0.41363999999999995},{"$f":"IF(K73>N73/2,0,ABS(K73-N73/2)*Vsd_Q1*Deadtime*Fsw)","v":0},{"$f":"(AF73+AE73+AD73+AC73*(1+RdsonTopTc*Ta-RdsonTopTc*25))/(1-AC73*RdsonTopTc*ThetaJA_Q1)","v":2.766721572332524},{"$f":"SQRT((1-M73))*SQRT(K73^2+(N73^2)/12)","v":15.561268452620004},{"$f":"Rdson2*AH73^2","v":0.79910515031987162},{"$f":"IF(K73<N73/2,Deadtime*Fsw*IF(VfdSky_Q2>0,0,Vsd_Q2)*(K73+N73/2),2*Deadtime*Fsw*IF(VfdSky_Q2>0,0,Vsd_Q2)*K73)","v":9.4079999999999983E-2},{"$f":"(AJ73+AI73*(1+RdsonBotTc*Ta-RdsonBotTc*25))/(1-AI73*RdsonBotTc*ThetaJA_Q2)","v":1.0267609113105893},{"$f":"2*Deadtime*Fsw*IF(VfdSky_Q2>0,VfdSky_Q2,Vsd_Q2)*K73","v":9.4079999999999983E-2},{"$f":"IF(QrrSky_Q2>0,QrrSky_Q2,Qrr_Q2*K73/(Iout/Number_of_Phases))*Fsw*Vin","v":0.84096000000000004},{"$f":"Rs*R73^2","v":0.38534239337829973},{"$f":"Iq*Vin","v":1.3200000000000001E-4},{"$f":"IF(Ext_VCC=1,  (Qg_Q1+Qg_Q2)*Fsw*VCC, (Qg_Q1+Qg_Q2)*Fsw*Vin)","v":0.84599999999999997},{"$f":"(Vin-VCC)*Fsw*(Qg_Q1+Qg_Q2)+(RdsonDRT+RdsonDRT2)*Fsw*Qg_Q1*VCC/(RdsonDRT+2*Rgate1+RdsonDRT2)+(RdsonDRB+RdsonDRB2)*Fsw*Qg_Q2*VCC/(RdsonDRB+2*Rgate2+RdsonDRB2)","v":0.80465934065934064},{"$f":"(Qg_Q1+Qg_Q2)*Fsw*(Vin-VCC)","v":0.77549999999999997},0.846132,{"$f":" SUM(U73,X73,AA73,AG73,AK73,AL73,AM73,AS73,AN73)","v":7.3123212004408762},{"$f":"Vout*K73","v":52.816000000000003},0.87838806980715667,{"$f":"ThetaJA_Q1*BC73","v":139.51371723796601},{"$f":"ThetaJA_Q2*BD73","v":53.084102850340997},null,87.838806980715674,{"$f":"U73","v":1.3375334990917114},4.6344424836431131,3.3217551723325238,1.3042777113105894,0.38534239337829973]
["Part Power","Value","Units",null,null,null,65,60,1,{"$f":"Iout*G74/100","v":16.25},16.25,0.99335648148148148,5.7421772422043361E-2,3.2790297129075583,{"$f":"K74+N74/2","v":17.889514856453779},{"$f":"K74-N74/2","v":14.610485143546221},0,{"$f":"SQRT(K74^2+(N74^2)/12)","v":16.277545975612465},1.0598340119527101,0.2,1.3765469107583177,{"$f":"N74/SQRT(12)","v":0.94657434371398008},{"$f":"RCoutEsr*V74^2","v":8.9600298817755207E-4},{"$f":"W74","v":8.9600298817755207E-4},{"$f":"SQRT(M74*(1-M74))*SQRT(K74^2+(N74^2)/12)","v":3.7869182457591961},{"$f":"RCinEsr*Y74^2","v":1.4340749800063907E-2},{"$f":"Z74","v":1.4340749800063907E-2},{"$f":"SQRT(M74)*SQRT(K74^2+(N74^2)/12)","v":3.9005623773851417},9.4329198531209052E-2,2.2538737383540375,0.41363999999999995,0,2.8063154751372781,15.8032944707205,0.82415558322340698,9.5549999999999982E-2,1.0622273073719439,9.5549999999999982E-2,0.85410000000000008,0.39743775448226631,1.3200000000000001E-4,0.84599999999999997,0.80465934065934064,0.77549999999999997,0.846132,7.4535462005380468,53.641249999999999,{"$f":"AU74/(AU74+AT74)","v":0.8780003099433793},141.54090195576569,54.70406851003812,null,{"$f":"AV74*100","v":87.800030994337931},1.3765469107583177,{"$f":"AG74+AK74+AM74","v":4.7226427825092223},{"$f":"AG74+AM74*0.66","v":3.3700214751372783},{"$f":"AK74+AM74*0.33","v":1.3440803073719438},{"$f":"AN74","v":0.39743775448226631}]
["Power Dis",{"$f":"AS9","v":0.846132},"W",null,null,null,66,60,1,16.5,16.5,1.0086388888888889,5.7458788300162232E-2,3.2809954785454356,18.140497739272718,14.859502260727282,0,16.527161813537525,1.092588310443412,0.2,1.41639087991666,0.94714181137407616,8.9707761085296611E-4,8.9707761085296611E-4,3.8461541384027984,1.4792901656352973E-2,1.4792901656352973E-2,3.961653708648698,9.7307140664949901E-2,2.2885487189440998,0.41363999999999995,0,2.8460214792958296,16.045322605158269,0.84959284576188965,9.7019999999999981E-2,1.0985585619254818,9.7019999999999981E-2,0.86724000000000012,0.40972061641627949,1.3200000000000001E-4,0.84599999999999997,0.80465934065934064,0.77549999999999997,{"$f":"SUM(AO75:AP75)","v":0.846132},7.5967735168214565,54.466500000000003,0.87759631282158446,143.57279493042486,56.359233910367109,null,87.759631282158452,1.41639087991666,4.8118200412213117,3.4183998792958299,1.3847477619254818,0.40972061641627949]
["Temp rise",{"$f":"B75*B62","v":25.383959999999998},"°C",null,null,null,67,60,1,16.75,16.75,1.0239212962962962,5.7495804610301862E-2,3.2829610781634702,18.391480539081734,15.108519460918265,0,16.776789108370171,1.125842611146912,0.2,1.4570778364275423,0.9477092311083718,8.9815278672802121E-4,8.9815278672802121E-4,3.9054274037744827,1.5252363206152695E-2,1.5252363206152695E-2,4.0227859373963373,0.10033340152830512,2.3232236995341617,0.41363999999999995,0,2.8858408677923477,16.287352335128453,0.87541689209242712,9.848999999999998E-2,1.1357751468587536,9.848999999999998E-2,0.88038000000000016,0.42219097918009196,1.3200000000000001E-4,0.84599999999999997,0.80465934065934064,0.77549999999999997,0.846132,7.7420373462516165,55.29175,0.87717638948578891,145.60945004727861,58.050432257151279,null,87.717638948578895,1.4570778364275423,4.9019960146511021,3.466891667792348,1.4263005468587537,0.42219097918009196]
["Current (switching)",{"$f":"(Qg_Q1+Qg_Q2)*Fsw+Iq","v":1.41022E-2},"A",null,null,null,68,60,1,17,17,1.0392037037037039,5.7532821352469815E-2,3.2849265117587558,18.642463255879377,15.357536744120623,0,17.02642735619067,1.1595969140625522,0.2,1.4986205778572661,0.94827660291602811,8.9922851563796252E-4,8.9922851563796252E-4,3.9647379076163949,1.571914667609043E-2,1.571914667609043E-2,4.083958927855301,0.10340806725133592,2.3578986801242241,0.41363999999999995,0,2.9257749342102874,16.529383170319122,0.90162767637105568,9.9959999999999979E-2,1.1738983252753576,9.9959999999999979E-2,0.89352000000000009,0.43484884277345703,1.3200000000000001E-4,0.84599999999999997,0.80465934065934064,0.77549999999999997,0.846132,7.8893730553080959,56.117000000000004,0.87674082003536014,147.65092163683207,59.778528958707057,null,87.674082003536014,1.4986205778572661,4.9931932594856452,3.5154981342102873,1.4687599252753576,0.43484884277345703]
["Qrr Current",{"$f":"Qrr_Q2*Fsw","v":2.1900000000000003E-2},"A",null,null,null,69,60,1,17.25,17.25,1.0544861111111112,5.7569838526673654E-2,3.2868917793283852,18.893445889664193,15.606554110335807,0,17.276076082184229,1.193851219189672,0.2,1.5410322805447956,0.94884392679620566,9.0030479741804326E-4,9.0030479741804326E-4,4.0240855223295027,1.6193264291021907E-2,1.6193264291021907E-2,4.1451725511015187,0.10653122396611393,2.392573660714286,0.41363999999999995,0,2.9658249828837078,16.771414648711435,0.9282251527527412,0.10142999999999998,1.2129501867803876,0.10142999999999998,0.90666000000000002,0.44769420719612696,1.3200000000000001E-4,0.84599999999999997,0.80465934065934064,0.77549999999999997,0.846132,8.0388172264934568,56.942250000000001,0.87628985534395865,149.69726448111572,61.54442306196178,null,87.628985534395866,1.5410322805447956,5.0854351696640947,3.5642205828837077,1.5121479867803875,0.44769420719612696]
["Diode Current",{"$f":"Deadtime*Fsw*(Iripple_Vinnom/2)*(Vsd_Q2)/Vin","v":8.0362366647949402E-5},null,null,null,null,70,60,1,17.5,17.5,1.0697685185185186,5.760685613292095E-2,3.2888568808694534,19.144428440434726,15.855571559565274,0,17.525734838571065,1.2286055265276143,0.2,1.584326511118352,0.94941120274806601,9.0138163190352932E-4,9.0138163190352932E-4,4.0834701265016262,1.6674728274031207E-2,1.6674728274031207E-2,4.2064266845740894,0.10970295780672118,2.4272486413043484,0.41363999999999995,0,3.0059923290507888,17.013446334567451,0.95520927539138178,0.10289999999999998,1.2529536847482101,0.10289999999999998,0.91979999999999995,0.46072707244785538,1.3200000000000001E-4,0.84599999999999997,0.80465934065934064,0.77549999999999997,0.846132,8.1904077072711399,57.767500000000005,0.87582371861125241,151.74853382013313,63.349048769252157,null,87.582371861125239,1.584326511118352,5.1787460137989996,3.6130603290507888,1.5564876847482101,0.46072707244785538]
["Total",{"$f":"SUM(B77:B79)","v":3.6082562366647954E-2},"A",null,null,null,71,60,1,17.75,17.75,1.085050925925926,5.7643874171219252E-2,3.2908218163790521,19.395410908189525,16.104589091810475,0,17.775403202710471,1.2638598360757187,0.2,1.6285172384816287,0.94997843077076949,9.0245901892969374E-4,9.0245901892969374E-4,4.1428916044751327,1.716355084643054E-2,1.716355084643054E-2,4.2677212116305858,0.11292335490925014,2.4619236218944103,0.41363999999999995,0,3.0462782990095767,17.255477816587057,0.98257999843980248,0.10436999999999998,1.2939326757014313,0.10436999999999998,0.93293999999999999,0.47394743852839455,1.3200000000000001E-4,0.84599999999999997,0.80465934065934064,0.77549999999999997,0.846132,8.344183661586392,58.592750000000002,0.87534260676217779,153.80478535840223,65.193377041048265,null,87.534260676217784,1.6285172384816287,5.2731509747110081,3.6620186990095767,1.6018028757014313,0.47394743852839455]
[null,null,null,null,null,null,72,60,1,18,18,1.1003333333333334,5.768089264157613E-2,3.2927865858542744,19.646393292927137,16.353606707072863,0,18.025080775362195,1.2996141478333272,0.2,1.6736188462909432,0.95054561086347711,9.0353695833182094E-4,9.0353695833182094E-4,4.2023498459505033,1.7659744227760218E-2,1.7659744227760218E-2,4.3290560211392393,0.11619250141180379,2.4965986024844726,0.41363999999999995,0,3.086684230276012,17.497508706217864,1.0103372760497609,0.10583999999999998,1.3359119609397017,0.10583999999999998,0.94608000000000003,0.48735530543749772,1.3200000000000001E-4,0.84599999999999997,0.80465934065934064,0.77549999999999997,0.846132,8.500185624130248,59.418000000000006,0.87484669170681917,155.86607527159251,67.078417290245866,null,87.484669170681912,1.6736188462909432,5.3686761912157142,3.711097030276012,1.6481183609397017,0.48735530543749772]
[null,null,null,null,null,null,73,60,1,18.25,18.25,1.1156157407407408,5.7717911543999162E-2,3.2947511892922154,19.897375594646107,16.602624405353893,0,18.274767179090002,1.3358684617997807,0.2,1.7196461459457368,0.9511127430253502,9.0461544994520587E-4,9.0461544994520587E-4,4.2618447456223105,1.8163320635788498E-2,1.8163320635788498E-2,4.3904310071044836,0.11951048345449583,2.5312735830745345,0.41363999999999995,0,3.1272114717442681,17.739538636103269,1.0384810623719423,0.10730999999999997,1.3789173305675142,0.10730999999999997,0.95922000000000007,0.5009506731749177,1.3200000000000001E-4,0.84599999999999997,0.80465934065934064,0.77549999999999997,0.846132,8.6584555575181721,60.243250000000003,0.87433612147249085,157.93246021325925,69.005219174097832,null,87.433612147249079,1.7196461459457368,5.465348802311782,3.7602966717442681,1.6954599305675142,0.5009506731749177]
[null,null,null,null,null,null,74,60,1,18.5,18.5,1.1308981481481482,5.7754930878495883E-2,3.296715626689966,20.148357813344983,16.851642186655017,0,18.524462056794125,1.3726227779744209,0.2,1.7666143901160782,0.95167982725554889,9.056944936051514E-4,9.056944936051514E-4,4.3213762028445863,1.8674292286511494E-2,1.8674292286511494E-2,4.4518460683227152,0.1228773871794506,2.5659485636645969,0.41363999999999995,0,3.1678613838494565,17.981567258655868,1.0670113115559636,0.10877999999999997,1.4229756100817028,0.10877999999999997,0.97236000000000011,0.51473354174040786,1.3200000000000001E-4,0.84599999999999997,0.80465934065934064,0.77549999999999997,0.846132,8.8190369125677641,61.0685,0.87381102121826459,160.00399732167716,70.974874490325305,null,87.381102121826459,1.7666143901160782,5.5631969939311592,3.8096189838494565,1.7438544100817028,0.51473354174040786]
[null,null,null,null,null,null,75,60,1,18.75,18.75,1.1461805555555555,5.7791950645073885E-2,3.2986798980446204,20.399339949022309,17.100660050977691,0,18.774165070360571,1.4098770963565879,0.2,1.8145392868320902,0.95224686355323451,9.0677408914697241E-4,9.0677408914697241E-4,4.3809441213228277,1.9192671394153041E-2,1.9192671394153041E-2,4.5133011080654697,0.12629329873080297,2.6006235442546588,0.41363999999999995,0,3.2086353387327295,18.223594244744419,1.0959279777503703,0.11024999999999999,1.4681147096917779,0.11024999999999999,0.98550000000000015,0.52870391113372039,1.3200000000000001E-4,0.84599999999999997,0.80465934065934064,0.77549999999999997,0.846132,8.9819746918736172,61.893750000000004,0.87327149414101923,162.08074422677464,72.98851918445537,null,87.327149414101925,1.8145392868320902,5.6622500484245073,3.8590653387327296,1.793329709691778,0.52870391113372039]
[null,null,null,null,null,null,76,60,1,19,19,1.1614629629629629,5.782897084374073E-2,3.3006440033532716,20.650322001676635,17.349677998323365,0,19.023875899416659,1.4476314169456239,0.2,1.8634370141615981,0.95281385191756773,9.0785423640599269E-4,9.0785423640599269E-4,4.4405484088302236,1.9718470171164629E-2,1.9718470171164629E-2,4.5747960337875053,0.12975830425469892,2.6352985248447212,0.41363999999999995,0,3.2495347204088394,18.465619282484084,1.1252310151026386,0.11171999999999999,1.5143636765598711,0.11171999999999999,0.99863999999999997,0.54286178135460894,1.3200000000000001E-4,0.84599999999999997,0.80465934065934064,0.77549999999999997,0.846132,9.1473155168924905,62.719000000000001,0.87271762228102023,164.16275905717126,75.047335475986756,null,87.27176222810202,1.8634370141615981,5.7625383969687105,3.9086371204088395,1.8439148765598712,0.54286178135460894]
[null,null,null,null,null,null,77,60,1,19.25,19.25,1.1767453703703705,5.7865991474503969E-2,3.3026079426130122,20.901303971306508,17.598696028693492,0,19.273594240183058,1.4858857397408705,0.2,1.9133242355037166,0.95338079234770945,9.0893493521754633E-4,9.0893493521754633E-4,4.5001889769458829,2.0251700828225232E-2,2.0251700828225232E-2,4.6363307568575234,0.13327248989929494,2.6699735054347831,0.41363999999999995,0,3.290560924936182,18.707642076120511,1.1549203777591739,0.11318999999999999,1.5617527501618176,0.11318999999999999,1.0117799999999999,0.55720715240282637,1.3200000000000001E-4,0.84599999999999997,0.80465934065934064,0.77549999999999997,0.846132,9.3151076987679851,63.544250000000005,0.87214946723411069,166.25010044731965,77.152554111585985,null,87.214946723411074,1.9133242355037166,5.8640936750979993,3.9583357249361821,1.8956401501618176,0.55720715240282637]
[null,null,null,null,null,null,78,60,1,19.5,19.5,1.1920277777777779,5.7903012537371172E-2,3.3045717158209342,21.152285857910467,17.847714142089533,0,19.523319804413823,1.524640064741668,0.2,1.9642181155276552,0.95394768484282,9.100161854169763E-4,9.100161854169763E-4,4.5598657408131249,2.0792375574241226E-2,2.0792375574241226E-2,4.6979051923095261,0.13683594181475858,2.7046484860248454,0.41363999999999995,0,3.3317153605893952,18.949662344999403,1.1849960198653113,0.11465999999999998,1.6103134209870649,0.11465999999999998,1.0249200000000001,0.57174002427812554,1.3200000000000001E-4,0.84599999999999997,0.80465934065934064,0.77549999999999997,0.846132,9.4854013131419013,64.369500000000002,0.8715670707767359,168.34282754475458,79.305456754173548,null,87.156707077673587,1.9642181155276552,5.9669487815764599,4.0081625605893949,1.9485370209870649,0.57174002427812554]
[null,null,null,null,null,null,79,60,1,19.75,19.75,1.2073101851851851,5.7940034032349909E-2,3.3065353229741321,21.403267661487067,18.096732338512933,0,19.773052318416589,1.5638943919473587,0.2,2.0161363367876368,0.95451452940206072,9.1109798683963739E-4,9.1109798683963739E-4,4.619578618916047,2.1340506616346292E-2,2.1340506616346292E-2,4.7595192586129729,0.14044874615326827,2.7393234666149073,0.41363999999999995,0,3.3729994480345309,19.191679822614066,1.2154578955653152,0.11612999999999998,1.660078492812658,0.11612999999999998,1.03806,0.58646039698025954,1.3200000000000001E-4,0.84599999999999997,0.80465934065934064,0.77549999999999997,0.846132,9.658248279218272,65.194749999999999,0.87097045540926943,170.44100001745028,81.507378517475175,null,87.097045540926942,2.0161363367876368,6.0711379408471888,4.0581190480345306,2.0026382928126578,0.58646039698025954]
[null,null,null,null,null,null,80,60,1,20,20,1.2225925925925927,5.7977055959447743E-2,3.3084987640696975,21.654249382034848,18.345750617965152,0,20.02279152214598,1.6036487213572836,0.2,2.069097117046542,0.95508132602459206,9.1218033932089317E-4,9.1218033932089317E-4,4.679327532872783,2.1896106159901289E-2,2.1896106159901289E-2,4.8211728774601115,0.14411098906901346,2.7739984472049692,0.41363999999999995,0,3.4144146205068777,19.433694255724099,1.2463059590023806,0.11759999999999998,1.7110821488057766,0.11759999999999998,1.0512000000000001,0.60136827050898134,1.3200000000000001E-4,0.84599999999999997,0.80465934065934064,0.77549999999999997,0.846132,9.8337024433674003,66.02000000000001,0.87035962482241036,172.54467806128886,83.759710656395114,null,87.035962482241032,2.069097117046542,6.1766967693126542,4.1082066205068779,2.0579781488057765,0.60136827050898134]
[null,null,null,null,null,null,81,60,1,20.25,20.25,1.2378750000000001,5.8014078318672245E-2,3.3104620391047233,21.90523101955236,18.59476898044764,0,20.272537168363908,1.6439030529707845,0.2,2.1231192273427641,0.9556480747095748,9.132632426961171E-4,9.132632426961171E-4,4.7391124072440087,2.2459186408494102E-2,2.2459186408494102E-2,4.8828659735689932,0.14782275671819481,2.8086734277950316,0.41363999999999995,0,3.4559623239914612,19.675705403539112,1.2775401643186322,0.11906999999999998,1.7633600217302616,0.11906999999999998,1.0643400000000001,0.61646364486404426,1.3200000000000001E-4,0.84599999999999997,0.80465934065934064,0.77549999999999997,0.846132,10.011819667579722,66.845250000000007,0.86973456429079854,174.65392240764135,86.063903424421653,null,86.97345642907986,2.1231192273427641,6.2836623457217229,4.158426723991461,2.1145922217302617,0.61646364486404426]
[null,null,null,null,null,null,82,60,1,20.5,20.5,1.2531574074074074,5.8051101110030971E-2,3.3124251480763016,22.15621257403815,18.84378742596185,0,20.522289021861102,1.6846573867872028,0.2,2.1782220108366821,0.9562147754561694,9.1434669680069247E-4,9.1434669680069247E-4,4.7989331693554176,2.3029759563939631E-2,2.3029759563939631E-2,4.9445984745008484,0.15158413525902392,2.8433484083850935,0.41363999999999995,0,3.4976440174062859,19.917713036961963,1.309160465655123,0.12053999999999998,1.8169492685555284,0.12053999999999998,1.07748,0.63174652004520104,1.3200000000000001E-4,0.84599999999999997,0.80465934065934064,0.77549999999999997,0.846132,10.19265792310444,67.670500000000004,0.86909524099741209,176.76879433106399,88.421469110210012,null,86.909524099741205,2.1782220108366821,6.3920732859618141,4.2087808174062857,2.1725176685555283,0.63174652004520104]
[null,null,null,null,null,null,83,60,1,20.75,20.75,1.2684398148148148,5.8088124333531485E-2,3.3143880909815255,22.407194045490762,19.092805954509238,0,20.772046858734697,1.72591172280588,0.2,2.2344254024752646,0.95678142826353685,9.1543070147001354E-4,9.1543070147001354E-4,4.8587897491329644,2.3607837826279576E-2,2.3607837826279576E-2,5.0063703104906123,0.15539521085172359,2.8780233889751559,0.41363999999999995,0,3.5394611727883647,20.159716937886508,1.3411668171518369,0.12200999999999998,1.871888649791384,0.12200999999999998,1.0906200000000001,0.647216896052205,1.3200000000000001E-4,0.84599999999999997,0.80465934065934064,0.77549999999999997,0.846132,10.37627738963497,68.495750000000001,0.86844160429178252,178.88935565711131,90.833985266509345,null,86.844160429178245,2.2344254024752646,6.5019698225797491,4.2592703727883645,2.2317932497913842,0.647216896052205]
[null,null,null,null,null,null,84,60,1,21,21,1.2837222222222222,5.8125147989181371E-2,3.3163508678174871,22.658175433908745,19.341824566091255,0,21.021810465717255,1.7676660610261581,0.2,2.2917499495155171,0.95734803313083761,9.1651525653948336E-4,9.1651525653948336E-4,4.9186820789498453,2.4193433393782372E-2,2.4193433393782372E-2,5.0681814142895165,0.15925606965852804,2.9126983695652178,0.41363999999999995,0,3.5814152754825921,20.401716898545324,1.3735591729476864,0.12347999999999998,1.9282186138997626,0.12347999999999998,1.1037600000000001,0.66287477288480934,1.3200000000000001E-4,0.84599999999999997,0.80465934065934064,0.77549999999999997,0.846132,10.562740560433003,69.320999999999998,0.86777358588457487,181.01566877026889,93.303098145720341,null,86.777358588457489,2.2917499495155171,6.6133938893823547,4.3098968754825924,2.2924594138997625,0.66287477288480934]
[null,null,null,null,null,null,85,60,1,21.25,21.25,1.2990046296296298,5.8162172076988171E-2,3.3183134785812785,22.909156739290641,19.590843260709359,0,21.271579639552971,1.809920401447378,0.2,2.3502168329498576,0.95791459005723234,9.1760036184451547E-4,9.1760036184451547E-4,4.9786100934842343,2.4786558462943094E-2,2.4786558462943094E-2,5.1300317210187378,0.16316679784368254,2.9473733501552801,0.41363999999999995,0,3.6235078243335113,20.643712720903331,1.4063374871805137,0.12494999999999998,1.9859813871646022,0.12494999999999998,1.1169,0.6787201505427668,1.3200000000000001E-4,0.84599999999999997,0.80465934065934064,0.77549999999999997,0.846132,10.752112353815525,70.146250000000009,0.86709109998061162,183.14779662200746,95.830526357599311,null,86.709109998061166,2.3502168329498576,6.7263892114981134,4.3606618243335111,2.3545583871646021,0.6787201505427668]
[null,null,null,null,null,null,86,60,1,21.5,21.5,1.3142870370370372,5.8199196596959477E-2,3.3202759232699925,23.160137961634994,19.839862038365006,0,21.521354186417277,1.852674744068882,0.2,2.4098478898790034,0.95848109904188172,9.1868601722053342E-4,9.1868601722053342E-4,5.0385737295869042,2.5387225228483284E-2,2.5387225228483284E-2,5.1919211680332369,0.16712748157344398,2.982048330745342,0.41363999999999995,0,3.6657403318800301,20.885704216093572,1.4395017139870909,0.12641999999999998,2.045221069434187,0.12641999999999998,1.1300400000000002,0.69475302902583069,1.3200000000000001E-4,0.84599999999999997,0.80465934065934064,0.77549999999999997,0.846132,10.944460231464758,70.971500000000006,0.86639404335199532,185.28580273896125,98.418064765971423,null,86.639404335199529,2.4098478898790034,6.8410014013142169,4.41156673188003,2.4181342694341872,0.69475302902583069]
[null,null,null,null,null,null,87,60,1,21.75,21.75,1.3295694444444446,5.8236221549102837E-2,3.3222382018807206,23.411119100940361,20.088880899059639,0,21.771133921376325,1.8959290888900115,0.2,2.4706656368806512,0.9590475600839462,9.1977222250297038E-4,9.1977222250297038E-4,5.0985729261579591,2.5995445883350933E-2,2.5995445883350933E-2,5.2538496947949369,0.17113820701608048,3.0167233113354044,0.41363999999999995,0,3.7081143245531494,21.127691203891779,1.47305180750312,0.12788999999999998,2.1059837361866904,0.12788999999999998,1.1431800000000001,0.71097340833375433,1.3200000000000001E-4,0.84599999999999997,0.80465934065934064,0.77549999999999997,0.846132,11.139854324060099,71.796750000000003,0.86568229535256724,187.42975123123227,101.06758864279831,null,86.568229535256719,2.4706656368806512,6.9572780607398395,4.4626131245531493,2.4832331361866906,0.71097340833375433]
[null,null,null,null,null,null,88,60,1,22,22,1.3448518518518517,5.827324693342583E-2,3.3242003144105561,23.662100157205277,20.337899842794723,0,22.020918667883208,1.9396834359101087,0.2,2.53269329442506,0.95961397318258668,9.2085897752727016E-4,9.2085897752727016E-4,5.1586076240319221,2.6611232618720271E-2,2.6611232618720271E-2,5.3158172427545329,0.17519906034187169,3.0513982919254663,0.41363999999999995,0,3.750631342876749,21.369673512226637,1.5069877218632304,0.12935999999999998,2.1683175474096785,0.12935999999999998,1.1563200000000002,0.7273812884662908,1.3200000000000001E-4,0.84599999999999997,0.80465934065934064,0.77549999999999997,0.846132,11.338367564774027,72.622,0.8649557178745475,189.57970680082346,103.78105809957393,null,86.49557178745475,2.53269329442506,7.075268890286428,4.513802542876749,2.5499031474096787,0.7273812884662908]
[null,null,null,null,null,null,89,60,1,22.25,22.25,1.3601342592592591,5.8310272749936012E-2,3.3261622608565902,23.913081130428296,20.586918869571704,0,22.270708257308048,1.9839377851285156,0.2,2.5959548123917284,0.96018033833696337,9.2194628212888545E-4,9.2194628212888545E-4,5.2186777658705568,2.7234597623991708E-2,2.7234597623991708E-2,5.3778237552412333,0.17931012772310889,3.0860732725155287,0.41363999999999995,0,3.7932929416715018,21.611650976722995,1.5413094112009835,0.13082999999999997,2.2322728638284448,0.13082999999999997,1.1694600000000002,0.74397666942319329,1.3200000000000001E-4,0.84599999999999997,0.80465934065934064,0.77549999999999997,0.846132,11.540075831220989,73.447249999999997,0.86421415524782141,191.73573475020308,106.56052281781771,null,86.421415524782148,2.5959548123917284,7.1950258054999461,4.5651365416715022,2.618194663828445,0.74397666942319329]
[null,null,null,null,null,null,90,60,1,22.5,22.5,1.3754166666666667,5.8347298998640953E-2,3.3281240412159145,24.164062020607957,20.835937979392043,0,22.520502528499296,2.0286921365445729,0.2,2.6604748967445682,0.96074665554623673,9.2303413614327925E-4,9.2303413614327925E-4,5.2787832960628061,2.7865553086791704E-2,2.7865553086791704E-2,5.4398691773598271,0.18347149533409476,3.1207482531055906,0.41363999999999995,0,3.8361006902619641,21.853623440275385,1.5760168296488675,0.13229999999999997,2.2979023710665487,0.13229999999999997,1.1826000000000003,0.76075955120421479,1.3200000000000001E-4,0.84599999999999997,0.80465934065934064,0.77549999999999997,0.846132,11.745058096500234,74.272500000000008,0.86345743408195985,193.8979009910025,109.40812710240854,null,86.345743408195986,2.6604748967445682,7.3166030613285127,4.6166166902619645,2.6881603710665489,0.76075955120421479]
[null,null,null,null,null,null,91,60,1,22.75,22.75,1.3906990740740741,5.8384325679548231E-2,3.3300856554856222,24.415042827742813,21.084957172257187,0,22.770301327373907,2.0739464901576241,0.2,2.7262790374265049,0.96131292480956776,9.2412253940592573E-4,9.2412253940592573E-4,5.3389241606313087,2.8504111192972727E-2,2.8504111192972727E-2,5.5019534558945216,0.18768324935114394,3.1554232336956529,0.41363999999999995,0,3.8790561726869202,22.095590752649638,1.6111099313383015,0.13376999999999997,2.3652612123756365,0.13376999999999997,1.1957400000000002,0.77772993380910893,1.3200000000000001E-4,0.84599999999999997,0.80465934065934064,0.77549999999999997,0.846132,11.953396590030552,75.097750000000005,0.86268536305069754,196.06627205285068,112.32611528368842,null,86.268536305069759,2.7262790374265049,7.4400573850625573,4.6682445726869206,2.7598554123756367,0.77772993380910893]
[null,null,null,null,null,null,92,60,1,23,23,1.4059814814814815,5.8421352792665401E-2,3.3320471036628048,24.666023551831401,21.333976448168599,0,23.020104506534114,2.1197008459670088,0.2,2.7933935375380661,0.96187914612611669,9.2521149175230739E-4,9.2521149175230739E-4,5.3991003071449768,2.9150284126612986E-2,2.9150284126612986E-2,5.5640765392190179,0.19194547595258241,3.1900982142857148,0.41363999999999995,0,3.9221609879130166,22.337552770110353,1.6465886703996335,0.13523999999999997,2.4344071306307145,0.13523999999999997,1.20888,0.79488781723762825,1.3200000000000001E-4,0.84599999999999997,0.80465934065934064,0.77549999999999997,0.846132,12.165176968937791,75.923000000000002,0.86189773261822022,198.24091509234671,115.31683749667009,null,86.189773261822026,2.7933935375380661,7.5654481185437303,4.7200217879130166,2.8333375306307147,0.79488781723762825]
[null,null,null,null,null,null,93,60,1,23.25,23.25,1.4212638888888889,5.8458380338000035E-2,3.334008385744553,24.917004192872277,21.582995807127723,0,23.269911924908911,2.1659552039720715,0.2,2.8618455438685881,0.96244531949504375,9.2630099301791683E-4,9.2630099301791683E-4,5.4593116846372203,2.9804084070016484E-2,2.9804084070016484E-2,5.6262383772123847,0.19625826131874816,3.2247731948757772,0.41363999999999995,0,3.965416750051785,22.579509355072368,1.6824530009621419,0.13670999999999997,2.5054006203525914,0.13670999999999997,1.2220200000000001,0.81223320148952682,1.3200000000000001E-4,0.84599999999999997,0.80465934065934064,0.77549999999999997,0.846132,12.380488500825528,76.748249999999999,0.86109431470623965,200.42189790217498,118.38275586835049,null,86.10943147062396,2.8618455438685881,7.6928373704043764,4.771949950051785,2.9086672203525916,0.81223320148952682]
[null,null,null,null,null,null,94,60,1,23.5,23.5,1.4365462962962965,5.8495408315559695E-2,3.3359695017279596,25.16798475086398,21.83201524913602,0,23.519723447418301,2.2127095641721528,0.2,2.9316630788527887,0.96301144491550961,9.2739104303825759E-4,9.2739104303825759E-4,5.5195582435293504,3.0465523203712808E-2,3.0465523203712808E-2,5.6884389211802695,0.20062169163199101,3.2594481754658391,0.41363999999999995,0,4.0088250885800845,22.821460375774372,1.7187028771540314,0.13817999999999997,2.5783050905916061,0.13817999999999997,1.23516,0.82976608656455719,1.3200000000000001E-4,0.84599999999999997,0.80465934065934064,0.77549999999999997,0.846132,12.599424258835789,77.57350000000001,0.86027486230046268,202.60928892036353,121.52645114707836,null,86.027486230046264,2.9316630788527887,7.8222901791716914,4.8240306885800841,2.9859078905916059,0.82976608656455719]
[null,null,null,null,null,null,95,60,1,23.75,23.75,1.4518287037037039,5.8532436725351973E-2,3.3379304516101165,25.41896522580506,22.08103477419494,0,23.769538944658748,2.2599639265665954,0.2,3.0028750740301211,0.96357752238667493,9.284816416488431E-4,9.284816416488431E-4,5.5798399355588213,3.1134613706457072E-2,3.1134613706457072E-2,5.7506781237810829,0.20503585307667277,3.294123156055901,0.41363999999999995,0,4.0523876485640518,23.063405705973146,1.7553382531024384,0.13964999999999997,2.653187039587126,0.13964999999999997,1.2483000000000002,0.84748647246247333,1.3200000000000001E-4,0.84599999999999997,0.80465934065934064,0.77549999999999997,0.846132,12.822081329991878,78.398750000000007,0.85943910899465581,204.80315723969019,124.75062981119603,null,85.943910899465578,3.0028750740301211,7.9538746881511777,4.8762656485640523,3.0651260395871258,0.84748647246247333]
[null,null,null,null,null,null,96,60,1,24,24,{"$f":"Vout*K105/(Vin*Efficiency)","v":1.4671111111111113},5.8569465567384404E-2,{"$f":"(Vin-(Rdson1+Rdcr)*K105-Vout)*M105/(Fsw*Lf)","v":3.3398912353881141},25.669945617694058,22.330054382305942,{"$f":"IF(MIN(Vin, -P105/(Coss_Q1+Coss_Q2)*0.00000002)<0, 0, MIN(Vin, -P105/(Coss_Q1+Coss_Q2)*0.00000002))","v":0},24.019358292608175,{"$f":"R105^2*Rdcr","v":2.3077182911547403},0.2,{"$f":"(T105+S105*(1+Ltc*(Ta-25)))/(1-S105*Ltc*ThetaCa)","v":3.0755114050890642},0.96414355190769974,9.2957278868519531E-4,9.2957278868519531E-4,5.6401567137119253,3.1811367755229705E-2,3.1811367755229705E-2,5.8129559389567618,{"$f":"Rdson1*AB105^2","v":0.20950083183916665},3.3287981366459634,0.41363999999999995,0,{"$f":"(AF105+AE105+AD105+AC105*(1+RdsonTopTc*Ta-RdsonTopTc*25))/(1-AC105*RdsonTopTc*ThetaJA_Q1)","v":4.0961060908866234},23.305345224656776,{"$f":"Rdson2*AH105^2","v":1.7923590829334271},0.14111999999999997,{"$f":"(AJ105+AI105*(1+RdsonBotTc*Ta-RdsonBotTc*25))/(1-AI105*RdsonBotTc*ThetaJA_Q2)","v":2.7301162422063627},0.14111999999999997,1.2614400000000001,0.86539435918302754,1.3200000000000001E-4,0.84599999999999997,0.80465934065934064,0.77549999999999997,0.846132,{"$f":" SUM(U105,X105,AA105,AG105,AK105,AL105,AM105,AS105,AN105)","v":13.048561037908993},79.224000000000004,0.85858676847011794,207.00357261723821,128.05813169779896,null,85.858676847011793,3.0755114050890642,8.087662333092986,4.9286564908866239,3.1463914422063626,0.86539435918302754]
[null,null,null,null,null,null,97,60,1,24.25,24.25,{"$f":"Vout*K106/(Vin*Efficiency)","v":1.4823935185185186},5.8606494841664573E-2,{"$f":"(Vin-(Rdson1+Rdcr)*K106-Vout)*M106/(Fsw*Lf)","v":3.3418518530590444},25.920925926529524,22.579074073470476,{"$f":"IF(MIN(Vin, -P106/(Coss_Q1+Coss_Q2)*0.00000002)<0, 0, MIN(Vin, -P106/(Coss_Q1+Coss_Q2)*0.00000002))","v":0},24.26918137234923,{"$f":"R106^2*Rdcr","v":2.3559726579359315},0.2,{"$f":"(T106+S106*(1+Ltc*(Ta-25)))/(1-S106*Ltc*ThetaCa)","v":3.1496029285838012},0.96470953347774457,9.3066448398284761E-4,9.3066448398284761E-4,5.7005085321606632,3.2495797525236521E-2,3.2495797525236521E-2,5.8752723218678327,{"$f":"Rdson1*AB106^2","v":0.21401671410785866},3.3634731172360253,0.41363999999999995,0,{"$f":"(AF106+AE106+AD106+AC106*(1+RdsonTopTc*Ta-RdsonTopTc*25))/(1-AC106*RdsonTopTc*ThetaJA_Q1)","v":4.1399820924786921},23.547278815775648,{"$f":"Rdson2*AH106^2","v":1.8297653207719928},0.14258999999999997,{"$f":"(AJ106+AI106*(1+RdsonBotTc*Ta-RdsonBotTc*25))/(1-AI106*RdsonBotTc*ThetaJA_Q2)","v":2.8091659512650993},0.14258999999999997,1.27458,0.88348974672597425,1.3200000000000001E-4,0.84599999999999997,0.80465934065934064,0.77549999999999997,0.846132,{"$f":" SUM(U106,X106,AA106,AG106,AK106,AL106,AM106,AS106,AN106)","v":13.278969181062788},80.049250000000001,0.8577175339079306,209.21060548410506,131.45193819648955,null,85.771753390793066,3.1496029285838012,8.2237280437437921,4.9812048924786918,3.2297773512650991,0.88348974672597425]
[null,null,null,null,null,null,98,60,1,24.5,24.5,{"$f":"Vout*K107/(Vin*Efficiency)","v":1.4976759259259258},5.8643524548200064E-2,{"$f":"(Vin-(Rdson1+Rdcr)*K107-Vout)*M107/(Fsw*Lf)","v":3.3438123046200006},26.171906152310001,22.828093847689999,{"$f":"IF(MIN(Vin, -P107/(Coss_Q1+Coss_Q2)*0.00000002)<0, 0, MIN(Vin, -P107/(Coss_Q1+Coss_Q2)*0.00000002))","v":0},24.519008069809377,{"$f":"R107^2*Rdcr","v":2.4047270269095091},0.2,{"$f":"(T107+S107*(1+Ltc*(Ta-25)))/(1-S107*Ltc*ThetaCa)","v":3.2251815204162302},0.96527546709597012,9.3175672737734331E-4,9.3175672737734331E-4,5.7608953462034362,3.3187915189908407E-2,3.3187915189908407E-2,5.9376272288324055,{"$f":"Rdson1*AB107^2","v":0.21858358607314632},3.3981480978260876,0.41363999999999995,0,{"$f":"(AF107+AE107+AD107+AC107*(1+RdsonTopTc*Ta-RdsonTopTc*25))/(1-AC107*RdsonTopTc*ThetaJA_Q1)","v":4.1840173465539729},23.789206367989777,{"$f":"Rdson2*AH107^2","v":1.8675569207420577},0.14405999999999997,{"$f":"(AJ107+AI107*(1+RdsonBotTc*Ta-RdsonBotTc*25))/(1-AI107*RdsonBotTc*ThetaJA_Q2)","v":2.8904131139430116},0.14405999999999997,1.2877200000000002,0.90177263509106598,1.3200000000000001E-4,0.84599999999999997,0.80465934065934064,0.77549999999999997,0.846132,{"$f":" SUM(U107,X107,AA107,AG107,AK107,AL107,AM107,AS107,AN107)","v":13.513416287921567},80.874499999999998,0.85683107733091435,211.42432695526685,134.93518105748058,null,85.683107733091433,3.2251815204162302,8.3621504604969843,5.0339125465539727,3.3153607139430115,0.90177263509106598]
[null,null,null,null,null,null,99,60,1,24.75,24.75,{"$f":"Vout*K108/(Vin*Efficiency)","v":1.5129583333333334},5.8680554686998412E-2,{"$f":"(Vin-(Rdson1+Rdcr)*K108-Vout)*M108/(Fsw*Lf)","v":3.345772590068071},26.422886295034036,23.077113704965964,{"$f":"IF(MIN(Vin, -P108/(Coss_Q1+Coss_Q2)*0.00000002)<0, 0, MIN(Vin, -P108/(Coss_Q1+Coss_Q2)*0.00000002))","v":0},24.768838275516764,{"$f":"R108^2*Rdcr","v":2.4539813980748173},0.2,{"$f":"(T108+S108*(1+Ltc*(Ta-25)))/(1-S108*Ltc*ThetaCa)","v":3.3022801161823176},0.96584135276153615,9.3284951870423421E-4,9.3284951870423421E-4,5.8213171122093463,3.3887732920901366E-2,3.3887732920901366E-2,6.0000206172688717,{"$f":"Rdson1*AB108^2","v":0.22320153392743952},3.4328230784161495,0.41363999999999995,0,{"$f":"(AF108+AE108+AD108+AC108*(1+RdsonTopTc*Ta-RdsonTopTc*25))/(1-AC108*RdsonTopTc*ThetaJA_Q1)","v":4.2282135628476558},24.031127774431493,{"$f":"Rdson2*AH108^2","v":1.9057338369664738},0.14552999999999996,{"$f":"(AJ108+AI108*(1+RdsonBotTc*Ta-RdsonBotTc*25))/(1-AI108*RdsonBotTc*ThetaJA_Q2)","v":2.9739386046289651},0.14552999999999996,1.3008599999999999,0.92024302427805649,1.3200000000000001E-4,0.84599999999999997,0.80465934065934064,0.77549999999999997,0.846132,{"$f":" SUM(U108,X108,AA108,AG108,AK108,AL108,AM108,AS108,AN108)","v":13.752017890376601},81.699750000000009,0.85592704887173621,213.64480883960152,138.51115186839888,null,85.592704887173625,3.3022801161823176,8.503012167476621,5.0867811628476556,3.403222404628965,0.92024302427805649]
[null,null,null,null,null,null,100,60,1,25,25,{"$f":"Vout*K109/(Vin*Efficiency)","v":1.5282407407407408},5.8717585258067209E-2,{"$f":"(Vin-(Rdson1+Rdcr)*K109-Vout)*M109/(Fsw*Lf)","v":3.3477327094003493},26.673866354700174,23.326133645299826,{"$f":"IF(MIN(Vin, -P109/(Coss_Q1+Coss_Q2)*0.00000002)<0, 0, MIN(Vin, -P109/(Coss_Q1+Coss_Q2)*0.00000002))","v":0},25.018671884370665,{"$f":"R109^2*Rdcr","v":2.503735771431197},0.2,{"$f":"(T109+S109*(1+Ltc*(Ta-25)))/(1-S109*Ltc*ThetaCa)","v":3.3809327534881244},0.96640719047360346,9.3394285779908371E-4,9.3394285779908371E-4,5.8817737875658125,3.4595262888096286E-2,3.4595262888096286E-2,6.0624524456420268,{"$f":"Rdson1*AB109^2","v":0.22787064386516012},3.4674980590062119,0.41363999999999995,0,{"$f":"(AF109+AE109+AD109+AC109*(1+RdsonTopTc*Ta-RdsonTopTc*25))/(1-AC109*RdsonTopTc*ThetaJA_Q1)","v":4.2725724678589154},24.273042932482284,{"$f":"Rdson2*AH109^2","v":1.9442960235670228},0.14699999999999996,{"$f":"(AJ109+AI109*(1+RdsonBotTc*Ta-RdsonBotTc*25))/(1-AI109*RdsonBotTc*ThetaJA_Q2)","v":3.0598274756684209},0.14699999999999996,1.3140000000000001,0.93890091428669886,1.3200000000000001E-4,0.84599999999999997,0.80465934065934064,0.77549999999999997,0.846132,{"$f":" SUM(U109,X109,AA109,AG109,AK109,AL109,AM109,AS109,AN109)","v":13.994894817048054},82.525000000000006,0.85500507596309394,215.87212365007443,142.18331225970473,null,85.50050759630939,3.3809327534881244,8.6463999435273369,5.1398124678589152,3.4934474756684208,0.93890091428669886]

{"sheet":"Efficiency Plot Management","index":10,"n_rows":2,"n_cols":1,"rows_kept":2,"cut":false,"hidden":true,"merged":[]}
[]
[{"$f":"IF(PLOT_TYPE=1, \"EFF_Ch1\", \"EFF_Ch2\")","v":"EFF_Ch1"}]

{"sheet":"Input Filter Calculations","index":11,"n_rows":97,"n_cols":40,"rows_kept":97,"cut":false,"hidden":true,"merged":[[10,29,10,30],[10,31,10,34],[9,0,11,0],[9,1,10,1],[10,8,10,9],[10,11,10,14],[10,16,10,19],[11,17,11,19]]}
[]
[null,null,null,null,null,null,null,null,null,null,null,null,null,null,null,null,null,null,null,null,null,null,null,null,null,null,null,null,null,"AEF comparison Values"]
[null,null,null,{"$f":"L_infilter*0.000001","v":6.8000000000000005E-7},null,null,null,null,null,null,null,"Lfilter Passive",{"$f":"'Input Filters'!O9*0.000001","v":6.8000000000000005E-7},null,null,null,null,null,null,null,null,null,null,null,null,null,null,null,null,"Lfilter",{"$f":"'Input Filters'!G9*0.000001","v":9.9999999999999995E-7}]
[null,null,null,null,null,null,null,null,null,null,null,"Cfilter Passive",{"$f":"'Input Filters'!O10*0.000001","v":4.6999999999999995E-7},null,null,null,null,null,null,null,null,null,null,null,null,null,null,null,null,"Cinj",{"$f":"'Input Filters'!G10*0.000001","v":9.9999999999999995E-7}]
[null,null,null,null,null,null,null,null,null,null,null,"Cdamp passive",{"$f":"'Input Filters'!O11*0.000001","v":9.9999999999999995E-7},null,null,null,null,null,null,null,null,null,null,null,null,null,null,null,null,"Cdamp",{"$f":"'Input Filters'!G11*0.000001","v":9.9999999999999995E-7}]
[null,null,null,null,null,null,null,null,null,null,null,"Rdamp passive",{"$f":"'Input Filters'!O12","v":0.35},null,null,null,null,null,null,null,null,null,null,null,null,null,null,null,null,"Rdamp",{"$f":"'Input Filters'!G12","v":10}]
[]
[]
[]
["Freq (Hz)","(kHz)",null,null,null,null,null,null,null,null,null,null,null,null,null,null,null,null,null,null,null,null,"AEF",null,null,null,"Passive",null,null,"AEFCompare"]
[null,null,null,null,null,null,null,null,"AEF Numerator",null,null,"AEF Denominator",null,null,null,null,"Passive",null,null,null,null,null,"Magnitude","Phase",null,null,"Magnitude","Phase",null,"AEF Numerator",null,"AEF Denominator"]
[null,null,"jω","-ω^2","-jω^3",null,"Gop",null,null,null,null,null,null,null,null,null,"Numerator","Denominator",null,null,null,null,null,null,null,null,null,null,null,null,null,null,null,null,null,null,null,null,"Magnitude","Phase"]
[1,{"$f":"A13/1000","v":1E-3},{"$f":"COMPLEX(0,2*Pi*A13)","v":"6.2831853i"},{"$f":"COMPLEX(-POWER(2*Pi*A13,2),0)","v":"-39.4784175141361"},{"$f":"COMPLEX(0,-POWER(2*Pi*A13,3))","v":"-248.050212592082i"},null,{"$f":"IMSUM(IMPRODUCT(C13,Rcomp_AEF*Csen_AEF),Csen_AEF/Ccomp_AEF)","v":"100+0.00062831853i"},null,{"$f":"IMPRODUCT((RdampSel*CdampSel+RdampSel*CinjSel),C13)","v":{"$error":"#REF!"}},{"$f":"IMSUM(1,I13)","v":{"$error":"#REF!"}},null,{"$f":"IMPRODUCT(G13,L_infilterStd*RdampSel*CinjSel*CdampSel,E13)","v":{"$error":"#REF!"}},{"$f":"IMPRODUCT(G13,L_infilterStd*CinjSel,D13)","v":{"$error":"#REF!"}},{"$f":"J13","v":{"$error":"#REF!"}},{"$f":"IMSUM(L13:N13)","v":{"$error":"#REF!"}},0,{"$f":"IMSUM(IMPRODUCT(C13,RdampPssv*CdampPssv),1)","v":"1+0.000002199114855i"},{"$f":"IMPRODUCT(RdampPssv*CdampPssv*CfilterPssv*LinfilterPssv,E13)","v":"-2.77468967805503E-17i"},{"$f":"IMPRODUCT(D13,LinfilterPssv*(CfilterPssv+CdampPssv))","v":"-3.94626261471304E-11"},{"$f":"IMSUM(S13,R13,Q13)","v":"0.999999999960537+2.19911485497225E-06i"},1,{"$f":"CHOOSE(INFILTER_TYPE,U13,IMDIV(J13,O13))","v":1},{"$f":"20*LOG10(IMABS(V13))","v":0},{"$f":"IMARGUMENT(V13)*180/Pi","v":0},null,{"$f":"IMDIV(Q13,T13)","v":"1.00000000003946-5.9033537744459E-17i"},{"$f":"20*LOG10(IMABS(Z13))","v":3.4274512546547312E-10},{"$f":"IMARGUMENT(Z13)*180/Pi","v":-3.3823725662152017E-15},null,{"$f":"IMPRODUCT((RdampCom*CdampCom+RdampCom*CinjCom),C13)","v":"0.000125663706i"},{"$f":"IMSUM(1,AD13)","v":"1+0.000125663706i"},{"$f":"IMPRODUCT(G13,L_infilterStd*RdampSel*CinjSel*CdampSel,E13)","v":{"$error":"#REF!"}},{"$f":"IMPRODUCT(G13,LAEFCom*CinjCom,D13)","v":"-3.94784175141361E-09-2.48050212592082E-14i"},{"$f":"AE13","v":"1+0.000125663706i"},{"$f":"IMSUM(AF13:AH13)","v":{"$error":"#REF!"}},null,{"$f":"IMDIV(AE13,AI13)","v":{"$error":"#REF!"}},null,{"$f":"20*LOG10(IMABS(AK13))","v":{"$error":"#REF!"}},{"$f":"IMARGUMENT(AK13)*180/Pi","v":{"$error":"#REF!"}}]
[2,{"$f":"A14/1000","v":2E-3},"12.5663706i","-157.913670056544","-1984.40170073666i",null,"100+0.00125663706i",null,{"$error":"#REF!"},{"$f":"IMSUM(1,I14)","v":{"$error":"#REF!"}},null,{"$error":"#REF!"},{"$error":"#REF!"},{"$f":"J14","v":{"$error":"#REF!"}},{"$f":"IMSUM(L14:N14)","v":{"$error":"#REF!"}},0,"1+0.00000439822971i","-2.21975174244403E-16i","-1.57850504588521E-10",{"$f":"IMSUM(S14,R14,Q14)","v":"0.999999999842149+4.39822970977802E-06i"},1,{"$f":"CHOOSE(INFILTER_TYPE,U14,IMDIV(J14,O14),IMDIV(Q14,T14))","v":1},{"$f":"20*LOG10(IMABS(V14))","v":0},0,null,"1.00000000015785-4.72284395630731E-16i",{"$f":"20*LOG10(IMABS(Z14))","v":1.3710672912527204E-9},-2.7059902626176745E-14,null,"0.000251327412i",{"$f":"IMSUM(1,AD14)","v":"1+0.000251327412i"},{"$error":"#REF!"},"-1.57913670056544E-08-1.98440170073665E-13i",{"$f":"AE14","v":"1+0.000251327412i"},{"$f":"IMSUM(AF14:AH14)","v":{"$error":"#REF!"}},null,{"$f":"IMDIV(AE14,AI14)","v":{"$error":"#REF!"}},null,{"$f":"20*LOG10(IMABS(AK14))","v":{"$error":"#REF!"}},{"$error":"#REF!"}]
[3,3.0000000000000001E-3,"18.8495559i","-355.305757627225","-6697.35573998623i",null,"100+0.00188495559i",null,{"$error":"#REF!"},{"$error":"#REF!"},null,{"$error":"#REF!"},{"$error":"#REF!"},{"$error":"#REF!"},{"$error":"#REF!"},0,"1+0.000006597344565i","-7.4916621307486E-16i","-3.55163635324174E-10","0.999999999644836+6.59734456425083E-06i",1,1,0,0,null,"1.00000000035516-1.59396947052946E-15i",3.0848797076462865E-9,-9.1327723405961694E-14,null,"0.000376991118i","1+0.000376991118i",{"$error":"#REF!"},"-3.55305757627225E-08-6.69735573998623E-13i","1+0.000376991118i",{"$error":"#REF!"},null,{"$error":"#REF!"},null,{"$error":"#REF!"},{"$error":"#REF!"}]
[4,4.0000000000000001E-3,"25.1327412i","-631.654680226178","-15875.2136058933i",null,"100+0.00251327412i",null,{"$error":"#REF!"},{"$error":"#REF!"},null,{"$error":"#REF!"},{"$error":"#REF!"},{"$error":"#REF!"},{"$error":"#REF!"},0,"1+0.00000879645942i","-1.77580139395522E-15i","-6.31402018354088E-10","0.999999999368598+0.0000087964594182242i",1,1,0,0,null,"1.0000000006314-3.77830227167012E-15i",5.484271092367277E-9,-2.1648077400206861E-13,null,"0.000502654824i","1+0.000502654824i",{"$error":"#REF!"},"-6.31654680226178E-08-1.58752136058933E-12i","1+0.000502654824i",{"$error":"#REF!"},null,{"$error":"#REF!"},null,{"$error":"#REF!"},{"$error":"#REF!"}]
[5,5.0000000000000001E-3,"31.4159265i","-986.960437853402","-31006.2765740103i",null,"100+0.00314159265i",null,{"$error":"#REF!"},{"$error":"#REF!"},null,{"$error":"#REF!"},{"$error":"#REF!"},{"$error":"#REF!"},{"$error":"#REF!"},0,"1+0.000010995574275i","-3.46836209756879E-15i","-9.86565653678261E-10","0.999999999013434+0.0000109955742715316i",1,1,0,0,null,"1.00000000098657-7.37945946308484E-15i",8.5692375875376739E-9,-4.2281188238863731E-13,null,"0.00062831853i","1+0.00062831853i",{"$error":"#REF!"},"-9.86960437853402E-08-3.10062765740103E-12i","1+0.00062831853i",{"$error":"#REF!"},null,{"$error":"#REF!"},null,{"$error":"#REF!"},{"$error":"#REF!"}]
[6,6.0000000000000001E-3,"37.6991118i","-1421.2230305089","-53578.8459198898i",null,"100+0.00376991118i",null,{"$error":"#REF!"},{"$error":"#REF!"},null,{"$error":"#REF!"},{"$error":"#REF!"},{"$error":"#REF!"},{"$error":"#REF!"},0,"1+0.00001319468913i","-5.99332970459887E-15i","-1.4206545412967E-09","0.999999998579345+0.0000131946891240067i",1,1,0,0,null,"1.00000000142066-1.27518015159367E-14i",1.2339696260264985E-8,-7.3062440784858933E-13,null,"0.000753982236i","1+0.000753982236i",{"$error":"#REF!"},"-1.4212230305089E-07-5.35788459198898E-12i","1+0.000753982236i",{"$error":"#REF!"},null,{"$error":"#REF!"},null,{"$error":"#REF!"},{"$error":"#REF!"}]
[7,7.0000000000000001E-3,"43.9822971i","-1934.44245819267","-85081.2229190843i",null,"100+0.00439822971i",null,{"$error":"#REF!"},{"$error":"#REF!"},null,{"$error":"#REF!"},{"$error":"#REF!"},{"$error":"#REF!"},{"$error":"#REF!"},0,"1+0.000015393803985i","-9.51718559572877E-15i","-1.93366868120939E-09","0.999999998066331+0.0000153938039754828i",1,1,0,0,null,"1.00000000193367-2.02493221373488E-14i",1.6795643252346658E-8,-1.1602006955531912E-12,null,"0.000879645942i","1+0.000879645942i",{"$error":"#REF!"},"-1.93444245819267E-07-8.50812229190843E-12i","1+0.000879645942i",{"$error":"#REF!"},null,{"$error":"#REF!"},null,{"$error":"#REF!"},{"$error":"#REF!"}]
[8,8.0000000000000002E-3,"50.2654824i","-2526.61872090471","-127001.708847146i",null,"100+0.00502654824i",null,{"$error":"#REF!"},{"$error":"#REF!"},null,{"$error":"#REF!"},{"$error":"#REF!"},{"$error":"#REF!"},{"$error":"#REF!"},0,"1+0.00001759291884i","-1.42064111516417E-14i","-2.52560807341635E-09","0.999999997474392+0.0000175929188257936i",1,1,0,0,null,"1.00000000252561-3.02264148354676E-14i",2.1937169209509332E-8,-1.7318459974888673E-12,null,"0.001005309648i","1+0.001005309648i",{"$error":"#REF!"},"-2.52661872090471E-07-1.27001708847146E-11i","1+0.001005309648i",{"$error":"#REF!"},null,{"$error":"#REF!"},null,{"$error":"#REF!"},{"$error":"#REF!"}]
[9,8.9999999999999993E-3,"56.5486677i","-3197.75181864502","-180828.604979628i",null,"100+0.00565486677i",null,{"$error":"#REF!"},{"$error":"#REF!"},null,{"$error":"#REF!"},{"$error":"#REF!"},{"$error":"#REF!"},{"$error":"#REF!"},0,"1+0.000019792033695i","-2.02274877530212E-14i","-3.19647271791756E-09","0.999999996803527+0.0000197920336747725i",1,1,0,0,null,"1.00000000319647-4.30372020696133E-14i",2.7764185412408903E-8,-2.4658500355761629E-12,null,"0.001130973354i","1+0.001130973354i",{"$error":"#REF!"},"-3.19775181864502E-07-1.80828604979628E-11i","1+0.001130973354i",{"$error":"#REF!"},null,{"$error":"#REF!"},null,{"$error":"#REF!"},{"$error":"#REF!"}]
[10,0.01,"62.831853i","-3947.84175141361","-248050.212592082i",null,"100+0.0062831853i",null,{"$error":"#REF!"},{"$error":"#REF!"},null,{"$error":"#REF!"},{"$error":"#REF!"},{"$error":"#REF!"},{"$error":"#REF!"},0,"1+0.00002199114855i","-2.77468967805503E-14i","-3.94626261471304E-09","0.999999996053737+0.0000219911485222531i",1,1,0,0,null,"1.00000000394626-5.90359570729332E-14i",3.4276778649137416E-8,-3.3825111703113878E-12,null,"0.00125663706i","1+0.00125663706i",{"$error":"#REF!"},"-3.94784175141361E-07-2.48050212592082E-11i","1+0.00125663706i",{"$error":"#REF!"},null,{"$error":"#REF!"},null,{"$error":"#REF!"},{"$error":"#REF!"}]
[20,0.02,"125.663706i","-15791.3670056544","-1984401.70073666i",null,"100+0.0125663706i",null,{"$error":"#REF!"},{"$error":"#REF!"},null,{"$error":"#REF!"},{"$error":"#REF!"},{"$error":"#REF!"},{"$error":"#REF!"},0,"1+0.0000439822971i","-2.21975174244403E-13i","-1.57850504588521E-08","0.99999998421495+0.0000439822968780248i",1,1,0,0,null,"1.00000001578505-4.72287580174405E-13i",1.3710720057442979E-7,-2.7060084664215768E-11,null,"0.00251327412i","1+0.00251327412i",{"$error":"#REF!"},"-1.57913670056544E-06-1.98440170073665E-10i","1+0.00251327412i",{"$error":"#REF!"},null,{"$error":"#REF!"},null,{"$error":"#REF!"},{"$error":"#REF!"}]
[30,0.03,"188.495559i","-35530.5757627225","-6697355.73998623i",null,"100+0.0188495559i",null,{"$error":"#REF!"},{"$error":"#REF!"},null,{"$error":"#REF!"},{"$error":"#REF!"},{"$error":"#REF!"},{"$error":"#REF!"},0,"1+0.00006597344565i","-7.4916621307486E-13i","-3.55163635324174E-08","0.999999964483636+0.0000659734449008338i",1,1,0,0,null,"1.00000003551637-1.59397081397336E-12i",3.0849126526975555E-7,-9.1327797168431367E-11,null,"0.00376991118i","1+0.00376991118i",{"$error":"#REF!"},"-3.55305757627225E-06-6.69735573998623E-10i","1+0.00376991118i",{"$error":"#REF!"},null,{"$error":"#REF!"},null,{"$error":"#REF!"},{"$error":"#REF!"}]
[40,0.04,"251.327412i","-63165.4680226178","-15875213.6058933i",null,"100+0.0251327412i",null,{"$error":"#REF!"},{"$error":"#REF!"},null,{"$error":"#REF!"},{"$error":"#REF!"},{"$error":"#REF!"},{"$error":"#REF!"},0,"1+0.0000879645942i","-1.77580139395522E-12i","-6.31402018354088E-08","0.999999936859798+0.0000879645924241986i",1,1,0,0,null,"1.00000006314021-3.77830129983406E-12i",5.4842887803037698E-7,-2.1648070478801279E-10,null,"0.00502654824i","1+0.00502654824i",{"$error":"#REF!"},"-6.31654680226178E-06-1.58752136058933E-09i","1+0.00502654824i",{"$error":"#REF!"},null,{"$error":"#REF!"},null,{"$error":"#REF!"},{"$error":"#REF!"}]
[50,0.05,"314.159265i","-98696.0437853402","-31006276.5740103i",null,"100+0.0314159265i",null,{"$error":"#REF!"},{"$error":"#REF!"},null,{"$error":"#REF!"},{"$error":"#REF!"},{"$error":"#REF!"},{"$error":"#REF!"},0,"1+0.00010995574275i","-3.46836209756879E-12i","-9.86565653678261E-08","0.999999901343435+0.000109955739281638i",1,1,0,0,null,"1.00000009865657-7.37949525076775E-12i",8.5692003703246746E-7,-4.2281389157559421E-10,null,"0.0062831853i","1+0.0062831853i",{"$error":"#REF!"},"-9.86960437853402E-06-3.10062765740103E-09i","1+0.0062831853i",{"$error":"#REF!"},null,{"$error":"#REF!"},null,{"$error":"#REF!"},{"$error":"#REF!"}]
[60,0.06,"376.991118i","-142122.30305089","-53578845.9198898i",null,"100+0.0376991118i",null,{"$error":"#REF!"},{"$error":"#REF!"},null,{"$error":"#REF!"},{"$error":"#REF!"},{"$error":"#REF!"},{"$error":"#REF!"},0,"1+0.0001319468913i","-5.99332970459887E-12i","-1.4206545412967E-07","0.999999857934546+0.00013194688530667i",1,1,0,0,null,"1.00000014206547-1.27517683815965E-11i",1.2339649066219747E-6,-7.3062240663248992E-10,null,"0.00753982236i","1+0.00753982236i",{"$error":"#REF!"},"-0.000014212230305089-5.35788459198898E-09i","1+0.00753982236i",{"$error":"#REF!"},null,{"$error":"#REF!"},null,{"$error":"#REF!"},{"$error":"#REF!"}]
[70,7.0000000000000007E-2,"439.822971i","-193444.245819267","-85081222.9190843i",null,"100+0.0439822971i",null,{"$error":"#REF!"},{"$error":"#REF!"},null,{"$error":"#REF!"},{"$error":"#REF!"},{"$error":"#REF!"},{"$error":"#REF!"},0,"1+0.00015393803985i","-9.51718559572877E-12i","-1.93366868120939E-07","0.999999806633132+0.000153938030332814i",1,1,0,0,null,"1.0000001933669-2.02493379799158E-11i",1.6795633910819215E-6,-1.1602013811643187E-9,null,"0.00879645942i","1+0.00879645942i",{"$error":"#REF!"},"-0.0000193444245819267-8.50812229190843E-09i","1+0.00879645942i",{"$error":"#REF!"},null,{"$error":"#REF!"},null,{"$error":"#REF!"},{"$error":"#REF!"}]
[80,0.08,"502.654824i","-252661.872090471","-127001708.847146i",null,"100+0.0502654824i",null,{"$error":"#REF!"},{"$error":"#REF!"},null,{"$error":"#REF!"},{"$error":"#REF!"},{"$error":"#REF!"},{"$error":"#REF!"},0,"1+0.0001759291884i","-1.42064111516417E-11i","-2.52560807341635E-07","0.999999747439193+0.000175929174193589i",1,1,0,0,null,"1.00000025256087-3.02264211687963E-11i",2.1937155666510632E-6,-1.731845927339326E-9,null,"0.01005309648i","1+0.01005309648i",{"$error":"#REF!"},"-0.0000252661872090471-1.27001708847146E-08i","1+0.01005309648i",{"$error":"#REF!"},null,{"$error":"#REF!"},null,{"$error":"#REF!"},{"$error":"#REF!"}]
[90,0.09,"565.486677i","-319775.181864502","-180828604.979628i",null,"100+0.0565486677i",null,{"$error":"#REF!"},{"$error":"#REF!"},null,{"$error":"#REF!"},{"$error":"#REF!"},{"$error":"#REF!"},{"$error":"#REF!"},0,"1+0.00019792033695i","-2.02274877530212E-11i","-3.19647271791756E-07","0.999999680352728+0.000197920316722512i",1,1,0,0,null,"1.00000031964737-4.30372335896138E-11i",2.7764213343660625E-6,-2.4658510612183728E-9,null,"0.01130973354i","1+0.01130973354i",{"$error":"#REF!"},"-0.0000319775181864502-1.80828604979628E-08i","1+0.01130973354i",{"$error":"#REF!"},null,{"$error":"#REF!"},null,{"$error":"#REF!"},{"$error":"#REF!"}]
[100,0.1,"628.31853i","-394784.175141361","-248050212.592082i",null,"100+0.062831853i",null,{"$error":"#REF!"},{"$error":"#REF!"},null,{"$error":"#REF!"},{"$error":"#REF!"},{"$error":"#REF!"},{"$error":"#REF!"},0,"1+0.0002199114855i","-2.77468967805503E-11i","-3.94626261471305E-07","0.999999605373739+0.000219911457753103i",1,1,0,0,null,"1.0000003946264-5.90359940073355E-11i",3.4276806823585146E-6,-3.382511965016509E-9,null,"0.0125663706i","1+0.0125663706i",{"$error":"#REF!"},"-0.0000394784175141361-2.48050212592082E-08i","1+0.0125663706i",{"$error":"#REF!"},null,{"$error":"#REF!"},null,{"$error":"#REF!"},{"$error":"#REF!"}]
[200,0.2,"1256.63706i","-1579136.70056544","-1984401700.73666i",null,"100+0.125663706i",null,{"$error":"#REF!"},{"$error":"#REF!"},null,{"$error":"#REF!"},{"$error":"#REF!"},{"$error":"#REF!"},{"$error":"#REF!"},0,"1+0.000439822971i","-2.21975174244403E-10i","-1.57850504588521E-06","0.999998421494954+0.000439822749024826i",1,1,0,0,null,"1.00000157850733-4.72289004721146E-10i",1.3710729639650269E-5,-2.7060123997272546E-8,null,"0.0251327412i","1+0.0251327412i",{"$error":"#REF!"},"-0.000157913670056544-1.98440170073665E-07i","1+0.0251327412i",{"$error":"#REF!"},null,{"$error":"#REF!"},null,{"$error":"#REF!"},{"$error":"#REF!"}]
[300,0.3,"1884.95559i","-3553057.57627225","-6697355739.98623i",null,"100+0.188495559i",null,{"$error":"#REF!"},{"$error":"#REF!"},null,{"$error":"#REF!"},{"$error":"#REF!"},{"$error":"#REF!"},{"$error":"#REF!"},0,"1+0.0006597344565i","-7.4916621307486E-10i","-3.55163635324174E-06","0.999996448363647+0.000659733707333787i",1,1,0,0,null,"1.00000355164792-1.59398129480179E-09i",3.084916708360373E-5,-9.1328076554125626E-8,null,"0.0376991118i","1+0.0376991118i",{"$error":"#REF!"},"-0.000355305757627225-6.69735573998623E-07i","1+0.0376991118i",{"$error":"#REF!"},null,{"$error":"#REF!"},null,{"$error":"#REF!"},{"$error":"#REF!"}]
[400,0.4,"2513.27412i","-6316546.80226177","-15875213605.8933i",null,"100+0.251327412i",null,{"$error":"#REF!"},{"$error":"#REF!"},null,{"$error":"#REF!"},{"$error":"#REF!"},{"$error":"#REF!"},{"$error":"#REF!"},0,"1+0.000879645942i","-1.77580139395522E-09i","-6.31402018354087E-06","0.999993685979816+0.000879644166198606i",1,1,0,0,null,"1.00000631405673-3.77834562794476E-09i",5.4843026783634755E-5,-2.1648189139136651E-7,null,"0.0502654824i","1+0.0502654824i",{"$error":"#REF!"},"-0.000631654680226177-1.58752136058933E-06i","1+0.0502654824i",{"$error":"#REF!"},null,{"$error":"#REF!"},null,{"$error":"#REF!"},{"$error":"#REF!"}]
[500,0.5,"3141.59265i","-9869604.37853402","-31006276574.0103i",null,"100+0.314159265i",null,{"$error":"#REF!"},{"$error":"#REF!"},null,{"$error":"#REF!"},{"$error":"#REF!"},{"$error":"#REF!"},{"$error":"#REF!"},0,"1+0.0010995574275i","-3.46836209756879E-09i","-9.86565653678261E-06","0.999990134343463+0.0010995539591379i",1,1,0,0,null,"1.00000986574575-7.37963050952798E-09i",8.5692356072072088E-5,-4.228175116350063E-7,null,"0.062831853i","1+0.062831853i",{"$error":"#REF!"},"-0.000986960437853402-3.10062765740103E-06i","1+0.062831853i",{"$error":"#REF!"},null,{"$error":"#REF!"},null,{"$error":"#REF!"},{"$error":"#REF!"}]
[600,0.6,"3769.91118i","-14212230.305089","-53578845919.8898i",null,"100+0.376991118i",null,{"$error":"#REF!"},{"$error":"#REF!"},null,{"$error":"#REF!"},{"$error":"#REF!"},{"$error":"#REF!"},{"$error":"#REF!"},0,"1+0.001319468913i","-5.99332970459887E-09i","-0.000014206545412967","0.999985793454587+0.0013194629196703i",1,1,0,0,null,"1.00001420673042-1.27521054564846E-08i",1.2339721601309145E-4,-7.3063144351324126E-7,null,"0.0753982236i","1+0.0753982236i",{"$error":"#REF!"},"-0.0014212230305089-5.35788459198898E-06i","1+0.0753982236i",{"$error":"#REF!"},null,{"$error":"#REF!"},null,{"$error":"#REF!"},{"$error":"#REF!"}]
[700,0.7,"4398.22971i","-19344424.5819267","-85081222919.0843i",null,"100+0.439822971i",null,{"$error":"#REF!"},{"$error":"#REF!"},null,{"$error":"#REF!"},{"$error":"#REF!"},{"$error":"#REF!"},{"$error":"#REF!"},0,"1+0.0015393803985i","-9.51718559572877E-09i","-0.0000193366868120939","0.999980663313188+0.0015393708813144i",1,1,0,0,null,"1.00001933702955-2.02500661951286E-08i",1.6795768070547058E-4,-1.1602208939414706E-6,null,"0.0879645942i","1+0.0879645942i",{"$error":"#REF!"},"-0.00193444245819267-8.50812229190843E-06i","1+0.0879645942i",{"$error":"#REF!"},null,{"$error":"#REF!"},null,{"$error":"#REF!"},{"$error":"#REF!"}]
[800,0.8,"5026.54824i","-25266187.2090471","-127001708847.146i",null,"100+0.502654824i",null,{"$error":"#REF!"},{"$error":"#REF!"},null,{"$error":"#REF!"},{"$error":"#REF!"},{"$error":"#REF!"},{"$error":"#REF!"},0,"1+0.001759291884i","-1.42064111516417E-08i","-0.0000252560807341635","0.999974743919266+0.00175927767758885i",1,1,0,0,null,"1.00002525666544-3.02278400042037E-08i",2.1937383832667357E-4,-1.7318839164039424E-6,null,"0.1005309648i","1+0.1005309648i",{"$error":"#REF!"},"-0.00252661872090471-0.0000127001708847146i","1+0.1005309648i",{"$error":"#REF!"},null,{"$error":"#REF!"},null,{"$error":"#REF!"},{"$error":"#REF!"}]
[900,0.9,"5654.86677i","-31977518.1864502","-180828604979.628i",null,"100+0.565486677i",null,{"$error":"#REF!"},{"$error":"#REF!"},null,{"$error":"#REF!"},{"$error":"#REF!"},{"$error":"#REF!"},{"$error":"#REF!"},0,"1+0.0019792033695i","-2.02274877530212E-08i","-0.0000319647271791756","0.999968035272821+0.00197918314201225i",1,1,0,0,null,"1.00003196566377-4.30397908600739E-08i",2.7764579017865241E-4,-2.4659195454707077E-6,null,"0.1130973354i","1+0.1130973354i",{"$error":"#REF!"},"-0.00319775181864502-0.0000180828604979628i","1+0.1130973354i",{"$error":"#REF!"},null,{"$error":"#REF!"},null,{"$error":"#REF!"},{"$error":"#REF!"}]
[1000,1,"6283.1853i","-39478417.5141361","-248050212592.082i",null,"100+0.62831853i",null,{"$error":"#REF!"},{"$error":"#REF!"},null,{"$error":"#REF!"},{"$error":"#REF!"},{"$error":"#REF!"},{"$error":"#REF!"},0,"1+0.002199114855i","-2.77468967805503E-08i","-0.0000394626261471304","0.999960537373853+0.00219908710810322i",1,1,0,0,null,"1.00003946405367-5.90403247598128E-08i",3.4277365128982361E-4,-3.3826279414737456E-6,null,"0.125663706i","1+0.125663706i",{"$error":"#REF!"},"-0.00394784175141361-0.0000248050212592082i","1+0.125663706i",{"$error":"#REF!"},null,{"$error":"#REF!"},null,{"$error":"#REF!"},{"$error":"#REF!"}]
[2000,2,"12566.3706i","-157913670.056544","-1984401700736.66i",null,"100+1.25663706i",null,{"$error":"#REF!"},{"$error":"#REF!"},null,{"$error":"#REF!"},{"$error":"#REF!"},{"$error":"#REF!"},{"$error":"#REF!"},0,"1+0.00439822971i","-2.21975174244403E-07i","-0.000157850504588521","0.999842149495412+0.00439800773482576i",1,1,0,0,null,"1.00015787334724-4.72427600959129E-07i",1.3711622397485389E-3,-2.7063835033150666E-5,null,"0.251327412i","1+0.251327412i",{"$error":"#REF!"},"-0.0157913670056544-0.000198440170073665i","1+0.251327412i",{"$error":"#REF!"},null,{"$error":"#REF!"},null,{"$error":"#REF!"},{"$error":"#REF!"}]
[3000,3,"18849.5559i","-355305757.627225","-6697355739986.23i",null,"100+1.88495559i",null,{"$error":"#REF!"},{"$error":"#REF!"},null,{"$error":"#REF!"},{"$error":"#REF!"},{"$error":"#REF!"},{"$error":"#REF!"},0,"1+0.006597344565i","-7.4916621307486E-07i","-0.000355163635324174","0.999644836364676+0.00659659539878692i",1,1,0,0,null,"1.00035527929582-1.59503405307709E-06i",3.0853687138606856E-3,-9.135626253668961E-5,null,"0.376991118i","1+0.376991118i",{"$error":"#REF!"},"-0.0355305757627225-0.000669735573998623i","1+0.376991118i",{"$error":"#REF!"},null,{"$error":"#REF!"},null,{"$error":"#REF!"},{"$error":"#REF!"}]
[4000,4,"25132.7412i","-631654680.226177","-15875213605893.3i",null,"100+2.51327412i",null,{"$error":"#REF!"},{"$error":"#REF!"},null,{"$error":"#REF!"},{"$error":"#REF!"},{"$error":"#REF!"},{"$error":"#REF!"},0,"1+0.00879645942i","-1.77580139395522E-06i","-0.000631402018354087","0.999368597981646+0.00879468361860604i",1,1,0,0,null,"1.00063176764934-3.78278365967147E-06i",5.4857314697180446E-3,-2.1660069744338419E-4,null,"0.502654824i","1+0.502654824i",{"$error":"#REF!"},"-0.0631654680226177-0.00158752136058933i","1+0.502654824i",{"$error":"#REF!"},null,{"$error":"#REF!"},null,{"$error":"#REF!"},{"$error":"#REF!"}]
[5000,5,"31415.9265i","-986960437.853402","-31006276574010.3i",null,"100+3.14159265i",null,{"$error":"#REF!"},{"$error":"#REF!"},null,{"$error":"#REF!"},{"$error":"#REF!"},{"$error":"#REF!"},{"$error":"#REF!"},0,"1+0.010995574275i","-3.46836209756879E-06i","-0.000986565653678261","0.999013434346322+0.0109921059129024i",1,1,0,0,null,"1.00098745857977-7.39318105431537E-06i",8.5727245740982051E-3,-4.2318019914624398E-4,null,"0.62831853i","1+0.62831853i",{"$error":"#REF!"},"-0.0986960437853402-0.00310062765740103i","1+0.62831853i",{"$error":"#REF!"},null,{"$error":"#REF!"},null,{"$error":"#REF!"},{"$error":"#REF!"}]
[6000,6,{"$f":"COMPLEX(0,2*Pi*A45)","v":"37699.1118i"},{"$f":"COMPLEX(-POWER(2*Pi*A45,2),0)","v":"-1421223030.5089"},{"$f":"COMPLEX(0,-POWER(2*Pi*A45,3))","v":"-53578845919889.8i"},null,{"$f":"IMSUM(IMPRODUCT(C45,Rcomp_AEF*Csen_AEF),Csen_AEF/Ccomp_AEF)","v":"100+3.76991118i"},null,{"$f":"IMPRODUCT((RdampSel*CdampSel+RdampSel*CinjSel),C45)","v":{"$error":"#REF!"}},{"$error":"#REF!"},null,{"$f":"IMPRODUCT(G45,L_infilterStd*RdampSel*CinjSel*CdampSel,E45)","v":{"$error":"#REF!"}},{"$f":"IMPRODUCT(G45,L_infilterStd*CinjSel,D45)","v":{"$error":"#REF!"}},{"$error":"#REF!"},{"$error":"#REF!"},0,{"$f":"IMSUM(IMPRODUCT(C45,RdampPssv*CdampPssv),1)","v":"1+0.01319468913i"},{"$f":"IMPRODUCT(RdampPssv*CdampPssv*CfilterPssv*LinfilterPssv,E45)","v":"-5.99332970459887E-06i"},{"$f":"IMPRODUCT(D45,LinfilterPssv*(CfilterPssv+CdampPssv))","v":"-0.0014206545412967"},"0.998579345458703+0.0131886958002954i",1,{"$f":"CHOOSE(INFILTER_TYPE,U45,IMDIV(J45,O45),IMDIV(Q45,T45))","v":1},0,{"$f":"IMARGUMENT(V45)*180/Pi","v":0},null,{"$f":"IMDIV(Q45,T45)","v":"1.00142250680344-0.000012785844067251i"},1.2346958077157324E-2,{"$f":"IMARGUMENT(Z45)*180/Pi","v":-7.3153429085745297E-4},null,{"$f":"IMPRODUCT((RdampCom*CdampCom+RdampCom*CinjCom),C45)","v":"0.753982236i"},"1+0.753982236i",{"$f":"IMPRODUCT(G45,L_infilterStd*RdampSel*CinjSel*CdampSel,E45)","v":{"$error":"#REF!"}},{"$f":"IMPRODUCT(G45,LAEFCom*CinjCom,D45)","v":"-0.14212230305089-0.00535788459198898i"},"1+0.753982236i",{"$error":"#REF!"},null,{"$error":"#REF!"},null,{"$error":"#REF!"},{"$f":"IMARGUMENT(AK45)*180/Pi","v":{"$error":"#REF!"}}]
[7000,7,"43982.2971i","-1934442458.19267","-85081222919084.3i",null,"100+4.39822971i",null,{"$error":"#REF!"},{"$error":"#REF!"},null,{"$error":"#REF!"},{"$error":"#REF!"},{"$error":"#REF!"},{"$error":"#REF!"},0,"1+0.015393803985i","-9.51718559572877E-06i","-0.00193366868120939","0.998066331318791+0.0153842867994043i",1,1,0,0,null,"1.00193710173868-0.0000203230411399365i",1.680917841515581E-2,-1.1621732375608322E-3,null,"0.879645942i","1+0.879645942i",{"$error":"#REF!"},"-0.193444245819267-0.00850812229190843i","1+0.879645942i",{"$error":"#REF!"},null,{"$error":"#REF!"},null,{"$error":"#REF!"},{"$error":"#REF!"}]
[8000,8,"50265.4824i","-2526618720.90471","-127001708847146i",null,"100+5.02654824i",null,{"$error":"#REF!"},{"$error":"#REF!"},null,{"$error":"#REF!"},{"$error":"#REF!"},{"$error":"#REF!"},{"$error":"#REF!"},0,"1+0.01759291884i","-0.0000142064111516418i","-0.00252560807341635","0.997474391926584+0.0175787124288484i",1,1,0,0,null,"1.00253146769905-0.0000303702348632679i",2.1960268903701091E-2,-1.7356924326137229E-3,null,"1.005309648i","1+1.005309648i",{"$error":"#REF!"},"-0.252661872090471-0.0127001708847146i","1+1.005309648i",{"$error":"#REF!"},null,{"$error":"#REF!"},null,{"$error":"#REF!"},{"$error":"#REF!"}]
[9000,9,"56548.6677i","-3197751818.64502","-180828604979628i",null,"100+5.65486677i",null,{"$error":"#REF!"},{"$error":"#REF!"},null,{"$error":"#REF!"},{"$error":"#REF!"},{"$error":"#REF!"},{"$error":"#REF!"},0,"1+0.019792033695i","-0.0000202274877530212i","-0.00319647271791756","0.996803527282082+0.019771806207247i",1,1,0,0,null,"1.00320586412249-0.0000432966329094656i",2.7801250322054171E-2,-2.4727869152797537E-3,null,"1.130973354i","1+1.130973354i",{"$error":"#REF!"},"-0.319775181864502-0.0180828604979628i","1+1.130973354i",{"$error":"#REF!"},null,{"$error":"#REF!"},null,{"$error":"#REF!"},{"$error":"#REF!"}]
[10000,10,"62831.853i","-3947841751.41361","-248050212592082i",null,"100+6.2831853i",null,{"$error":"#REF!"},{"$error":"#REF!"},null,{"$error":"#REF!"},{"$error":"#REF!"},{"$error":"#REF!"},{"$error":"#REF!"},0,"1+0.02199114855i","-0.0000277468967805503i","-0.00394626261471305","0.996053737385287+0.0219634016532194i",1,1,0,0,null,"1.0039605858368-0.0000594757476545141i",3.4333281589256678E-2,-3.394266041884357E-3,null,"1.25663706i","1+1.25663706i",{"$error":"#REF!"},"-0.394784175141361-0.0248050212592082i","1+1.25663706i",{"$error":"#REF!"},null,{"$error":"#REF!"},null,{"$error":"#REF!"},{"$error":"#REF!"}]
[11000,11,"69115.0383i","-4776888519.21047","-330154832960062i",null,"100+6.91150383i",null,{"$error":"#REF!"},{"$error":"#REF!"},null,{"$error":"#REF!"},{"$error":"#REF!"},{"$f":"J50","v":{"$error":"#REF!"}},{"$f":"IMSUM(L50:N50)","v":{"$error":"#REF!"}},0,"1+0.024190263405i","-0.0000369311196149125i","-0.00477497776380279",{"$f":"IMSUM(S50,R50,Q50)","v":"0.995225022236197+0.0241533322853851i"},1,1,0,0,null,"1.00479596336193-0.0000792859658181959i",4.1557660533084087E-2,-4.5210683336785549E-3,null,"1.382300766i","1+1.382300766i",{"$error":"#REF!"},"-0.477688851921047-0.0330154832960062i","1+1.382300766i",{"$error":"#REF!"},null,{"$error":"#REF!"},null,{"$error":"#REF!"},{"$error":"#REF!"}]
[12000,12,"75398.2236i","-5684892122.0356","-428630767359119i",null,"100+7.53982236i",null,{"$error":"#REF!"},{"$error":"#REF!"},null,{"$error":"#REF!"},{"$error":"#REF!"},{"$f":"J51","v":{"$error":"#REF!"}},{"$f":"IMSUM(L51:N51)","v":{"$error":"#REF!"}},0,"1+0.02638937826i","-0.000047946637636791i","-0.00568261816518679",{"$f":"IMSUM(S51,R51,Q51)","v":"0.994317381834813+0.0263414316223632i"},1,1,0,0,null,"1.00571236324959-0.000103111129481765i",4.9475824752593413E-2,-5.8742765248443194E-3,null,"1.507964472i","1+1.507964472i",{"$error":"#REF!"},"-0.56848921220356-0.0428630767359119i","1+1.507964472i",{"$error":"#REF!"},null,{"$error":"#REF!"},null,{"$error":"#REF!"},{"$error":"#REF!"}]
[13000,13,"81681.4089i","-6671852559.889","-544966317064805i",null,"100+8.16814089i",null,{"$error":"#REF!"},{"$error":"#REF!"},null,{"$error":"#REF!"},{"$error":"#REF!"},{"$f":"J52","v":{"$error":"#REF!"}},{"$f":"IMSUM(L52:N52)","v":{"$error":"#REF!"}},0,"1+0.028588493115i","-0.0000609599322268691i","-0.00666918381886504",{"$f":"IMSUM(S52,R52,Q52)","v":"0.993330816181135+0.0285275331827731i"},1,1,0,0,null,"1.00671018846073-0.00013134112988737i",5.808935257490936E-2,-7.4751328348372729E-3,null,"1.633628178i","1+1.633628178i",{"$error":"#REF!"},"-0.6671852559889-0.0544966317064805i","1+1.633628178i",{"$error":"#REF!"},null,{"$error":"#REF!"},null,{"$error":"#REF!"},{"$error":"#REF!"}]
[15000,15,"94247.7795i","-8882643940.68062","-837169467498278i",null,"100+9.42477795i",null,{"$error":"#REF!"},{"$error":"#REF!"},null,{"$error":"#REF!"},{"$error":"#REF!"},{"$f":"J53","v":{"$error":"#REF!"}},{"$f":"IMSUM(L53:N53)","v":{"$error":"#REF!"}},0,"1+0.032986722825i","-0.0000936457766343574i","-0.00887909088310435",{"$f":"IMSUM(S53,R53,Q53)","v":"0.991120909116896+0.0328930770483656i"},1,1,0,0,null,"1.00895191127968-0.00020260911556929i",7.7409522394356958E-2,-1.1505649516535831E-2,null,"1.88495559i","1+1.88495559i",{"$error":"#REF!"},"-0.888264394068062-0.0837169467498278i","1+1.88495559i",{"$error":"#REF!"},null,{"$error":"#REF!"},null,{"$error":"#REF!"},{"$error":"#REF!"}]
[16000,16,"100530.9648i","-10106474883.6188","-1016013670777170i",null,"100+10.05309648i",null,{"$error":"#REF!"},{"$error":"#REF!"},null,{"$error":"#REF!"},{"$error":"#REF!"},{"$f":"J54","v":{"$error":"#REF!"}},{"$f":"IMSUM(L54:N54)","v":{"$error":"#REF!"}},0,"1+0.03518583768i","-0.000113651289213134i","-0.0101024322936654",{"$f":"IMSUM(S54,R54,Q54)","v":"0.989897567706335+0.0350721863907869i"},1,1,0,0,null,"1.01019680079824-0.000246462681525396i",8.8120034652894183E-2,-1.3978732840646416E-2,null,"2.010619296i","1+2.010619296i",{"$error":"#REF!"},"-1.01064748836188-0.101601367077717i","1+2.010619296i",{"$error":"#REF!"},null,{"$error":"#REF!"},null,{"$error":"#REF!"},{"$error":"#REF!"}]
[17500,17.5,"109955.74275i","-12090265363.7042","-1329394108110690i",null,"100+10.995574275i",null,{"$error":"#REF!"},{"$error":"#REF!"},null,{"$error":"#REF!"},{"$error":"#REF!"},{"$error":"#REF!"},{"$error":"#REF!"},0,"1+0.0384845099625i","-0.000148706024933262i","-0.0120854292575587","0.987914570742441+0.0383358039375667i",1,1,0,0,null,"1.01222071263725-0.000323696833892721i",0.10550484102978921,-1.8322547228315767E-2,null,"2.199114855i","1+2.199114855i",{"$error":"#REF!"},"-1.20902653637042-0.132939410811069i","1+2.199114855i",{"$error":"#REF!"},null,{"$error":"#REF!"},null,{"$error":"#REF!"},{"$error":"#REF!"}]
[19000,19,"119380.5207i","-14251708722.6031","-1701376408169090i",null,"100+11.93805207i",null,{"$error":"#REF!"},{"$error":"#REF!"},null,{"$error":"#REF!"},{"$error":"#REF!"},{"$error":"#REF!"},{"$error":"#REF!"},0,"1+0.041783182245i","-0.000190315965017794i","-0.0142460080391141","0.985753991960886+0.0415928662799822i",1,1,0,0,null,"1.01443433812182-0.000415975520938413i",0.12447955922984369,-2.3494512681856306E-2,null,"2.387610414i","1+2.387610414i",{"$error":"#REF!"},"-1.42517087226031-0.170137640816909i","1+2.387610414i",{"$error":"#REF!"},null,{"$error":"#REF!"},null,{"$error":"#REF!"},{"$error":"#REF!"}]
[20000,20,"125663.706i","-15791367005.6544","-1984401700736660i",null,"100+12.5663706i",null,{"$error":"#REF!"},{"$error":"#REF!"},null,{"$error":"#REF!"},{"$error":"#REF!"},{"$error":"#REF!"},{"$error":"#REF!"},0,"1+0.0439822971i","-0.000221975174244403i","-0.0157850504588521","0.984214949541148+0.0437603219257556i",1,1,0,0,null,"1.01601657935512-0.000486596443905099i",0.13801689257265934,-2.744041881657654E-2,null,"2.51327412i","1+2.51327412i",{"$error":"#REF!"},"-1.57913670056544-0.198440170073665i","1+2.51327412i",{"$error":"#REF!"},null,{"$error":"#REF!"},null,{"$error":"#REF!"},{"$error":"#REF!"}]
[25000,25,"157079.6325i","-24674010946.3351","-3875784571751290i",null,"100+15.70796325i",null,{"$error":"#REF!"},{"$error":"#REF!"},null,{"$error":"#REF!"},{"$error":"#REF!"},{"$error":"#REF!"},{"$error":"#REF!"},0,"1+0.054977871375i","-0.000433545262196099i","-0.0246641413419566","0.975335858658043+0.0545443261128039i",1,1,0,0,null,"1.02523378537434-0.000966656304033977i",0.21646204909008521,-5.4022127344881758E-2,null,"3.14159265i","1+3.14159265i",{"$error":"#REF!"},"-2.46740109463351-0.387578457175129i","1+3.14159265i",{"$error":"#REF!"},null,{"$error":"#REF!"},null,{"$error":"#REF!"},{"$error":"#REF!"}]
[30000,30,"188495.559i","-35530575762.7225","-6697355739986230i",null,"100+18.8495559i",null,{"$error":"#REF!"},{"$error":"#REF!"},null,{"$error":"#REF!"},{"$error":"#REF!"},{"$error":"#REF!"},{"$error":"#REF!"},0,"1+0.06597344565i","-0.00074916621307486i","-0.0355163635324174","0.964483636467583+0.0652242794369251i",1,1,0,0,null,"1.03670887459481-0.00170572482425677i",0.31314808208663503,-9.4270192682177109E-2,null,"3.76991118i","1+3.76991118i",{"$error":"#REF!"},"-3.55305757627225-0.669735573998623i","1+3.76991118i",{"$error":"#REF!"},null,{"$error":"#REF!"},null,{"$error":"#REF!"},{"$error":"#REF!"}]
[35000,35,"219911.4855i","-48361061454.8167","-10635152864885500i",null,"100+21.99114855i",null,{"$error":"#REF!"},{"$error":"#REF!"},null,{"$error":"#REF!"},{"$error":"#REF!"},{"$error":"#REF!"},{"$error":"#REF!"},0,"1+0.076969019925i","-0.00118964819946609i","-0.0483417170302348","0.951658282969765+0.0757793717255339i",1,1,0,0,null,"1.05057619978726-0.00277724104542023i",0.42858150735745315,-0.15146337803870516,null,"4.39822971i","1+4.39822971i",{"$error":"#REF!"},"-4.83610614548167-1.06351528648855i","1+4.39822971i",{"$error":"#REF!"},null,{"$error":"#REF!"},null,{"$error":"#REF!"},{"$error":"#REF!"}]
[40000,40,"251327.412i","-63165468022.6178","-15875213605893300i",null,"100+25.1327412i",null,{"$error":"#REF!"},{"$error":"#REF!"},null,{"$error":"#REF!"},{"$error":"#REF!"},{"$error":"#REF!"},{"$error":"#REF!"},0,"1+0.0879645942i","-0.00177580139395522i","-0.0631402018354088","0.936859798164591+0.0861887928060448i",1,1,0,0,null,"1.06700286965865-0.00426861635465528i",0.56338125510820847,-0.22921437604912545,null,"5.02654824i","1+5.02654824i",{"$error":"#REF!"},"-6.31654680226178-1.58752136058933i","1+5.02654824i",{"$error":"#REF!"},null,{"$error":"#REF!"},null,{"$error":"#REF!"},{"$error":"#REF!"}]
[45000,45,"282743.3385i","-79943795466.1256","-22603575622453500i",null,"100+28.27433385i",null,{"$error":"#REF!"},{"$error":"#REF!"},null,{"$error":"#REF!"},{"$error":"#REF!"},{"$error":"#REF!"},{"$error":"#REF!"},0,"1+0.098960168475i","-0.00252843596912765i","-0.0799118179479392","0.920088182052061+0.0964317325058724i",1,1,0,0,null,"1.08619356566251-0.00628565719175738i",0.71828994959670589,-0.33155932819996564,null,"5.65486677i","1+5.65486677i",{"$error":"#REF!"},"-7.99437954661256-2.26035756224535i","1+5.65486677i",{"$error":"#REF!"},null,{"$error":"#REF!"},null,{"$error":"#REF!"},{"$error":"#REF!"}]
[50000,50,"314159.265i","-98696043785.3402","-31006276574010300i",null,"100+31.4159265i",null,{"$error":"#REF!"},{"$error":"#REF!"},null,{"$error":"#REF!"},{"$error":"#REF!"},{"$error":"#REF!"},{"$error":"#REF!"},0,"1+0.10995574275i","-0.00346836209756879i","-0.0986565653678261","0.901343434632174+0.106487380652431i",1,1,0,0,null,"1.10839666057698-0.00895831050462997i",0.89418785513768861,-0.46306726345210286,null,"6.2831853i","1+6.2831853i",{"$error":"#REF!"},"-9.86960437853402-3.10062765740103i","1+6.2831853i",{"$error":"#REF!"},null,{"$error":"#REF!"},null,{"$error":"#REF!"},{"$error":"#REF!"}]
[55000,55,"345575.1915i","-119422212980.262","-41269354120007700i",null,"100+34.55751915i",null,{"$error":"#REF!"},{"$error":"#REF!"},null,{"$error":"#REF!"},{"$error":"#REF!"},{"$error":"#REF!"},{"$error":"#REF!"},0,"1+0.120951317025i","-0.00461638995186406i","-0.11937444409507","0.88062555590493+0.116334927073136i",1,1,0,0,null,"1.1339119415625-0.0124482487823856i",1.0921099587044569,-0.628976061964027,null,"6.91150383i","1+6.91150383i",{"$error":"#REF!"},"-11.9422212980262-4.12693541200078i","1+6.91150383i",{"$error":"#REF!"},null,{"$error":"#REF!"},null,{"$error":"#REF!"},{"$error":"#REF!"}]
[60000,60,"376991.118i","-142122303050.89","-53578845919889800i",null,"100+37.6991118i",null,{"$error":"#REF!"},{"$error":"#REF!"},null,{"$error":"#REF!"},{"$error":"#REF!"},{"$error":"#REF!"},{"$error":"#REF!"},0,"1+0.1319468913i","-0.00599332970459887i","-0.14206545412967","0.85793454587033+0.125953561595401i",1,1,0,0,null,"1.1631003258263-0.0169590294511739i",1.3132667689997053,-0.83536384612322845,null,"7.53982236i","1+7.53982236i",{"$error":"#REF!"},"-14.212230305089-5.35788459198898i","1+7.53982236i",{"$error":"#REF!"},null,{"$error":"#REF!"},null,{"$error":"#REF!"},{"$error":"#REF!"}]
[65000,65,"408407.0445i","-166796313997.225","-68120789633100600i",null,"100+40.84070445i",null,{"$error":"#REF!"},{"$error":"#REF!"},null,{"$error":"#REF!"},{"$error":"#REF!"},{"$error":"#REF!"},{"$error":"#REF!"},0,"1+0.142942465575i","-0.00761999152835863i","-0.166729595471626","0.833270404528374+0.135322474046641i",1,1,0,0,null,"1.19639605981863-0.0227498889631618i",1.5590695347266561,-1.0893679748558442,null,"8.16814089i","1+8.16814089i",{"$error":"#REF!"},"-16.6796313997225-6.81207896331006i","1+8.16814089i",{"$error":"#REF!"},null,{"$error":"#REF!"},null,{"$error":"#REF!"},{"$error":"#REF!"}]
[70000,70,"439822.971i","-193444245819.267","-85081222919084300i",null,"100+43.9822971i",null,{"$error":"#REF!"},{"$error":"#REF!"},null,{"$error":"#REF!"},{"$error":"#REF!"},{"$error":"#REF!"},{"$error":"#REF!"},0,"1+0.15393803985i","-0.00951718559572877i","-0.193366868120939","0.806633131879061+0.144420854254271i",1,1,0,0,null,"1.23432201043572-0.0301547238275632i",1.8311607132208529,-1.3994685289579945,null,"8.79645942i","1+8.79645942i",{"$error":"#REF!"},"-19.3444245819267-8.50812229190843i","1+8.79645942i",{"$error":"#REF!"},null,{"$error":"#REF!"},null,{"$error":"#REF!"},{"$error":"#REF!"}]
[75000,75,"471238.8975i","-222066098517.016","-104646183437285000i",null,"100+47.12388975i",null,{"$error":"#REF!"},{"$error":"#REF!"},null,{"$error":"#REF!"},{"$error":"#REF!"},{"$error":"#REF!"},{"$error":"#REF!"},0,"1+0.164933614125i","-0.0117057220792947i","-0.221977272077609","0.778022727922391+0.153227892045705i",1,1,0,0,null,"1.27750877655212-0.0396085636961541i",2.1314506343374608,-1.775860031243816,null,"9.42477795i","1+9.42477795i",{"$error":"#REF!"},"-22.2066098517016-10.4646183437285i","1+9.42477795i",{"$error":"#REF!"},null,{"$error":"#REF!"},null,{"$error":"#REF!"},{"$error":"#REF!"}]
[80000,80,"502654.824i","-252661872090.471","-127001708847146000i",null,"100+50.2654824i",null,{"$error":"#REF!"},{"$error":"#REF!"},null,{"$error":"#REF!"},{"$error":"#REF!"},{"$error":"#REF!"},{"$error":"#REF!"},0,"1+0.1759291884i","-0.0142064111516417i","-0.252560807341635","0.747439192658365+0.161722777248358i",1,1,0,0,null,"1.32671843606306-0.0516850094110243i",2.4621613570964245,-2.2309452403961947,null,"10.05309648i","1+10.05309648i",{"$error":"#REF!"},"-25.2661872090471-12.7001708847146i","1+10.05309648i",{"$error":"#REF!"},null,{"$error":"#REF!"},null,{"$error":"#REF!"},{"$error":"#REF!"}]
[90000,90,"565486.677i","-319775181864.502","-180828604979628000i",null,"100+56.5486677i",null,{"$error":"#REF!"},{"$error":"#REF!"},null,{"$error":"#REF!"},{"$error":"#REF!"},{"$error":"#REF!"},{"$error":"#REF!"},0,"1+0.19792033695i","-0.0202274877530212i","-0.319647271791756","0.680352728208244+0.177692849196979i",1,1,0,0,null,"1.44709298035524-0.0870397594174791i",3.2256122149724868,-3.4420800766964819,null,"11.30973354i","1+11.30973354i",{"$error":"#REF!"},"-31.9775181864502-18.0828604979628i","1+11.30973354i",{"$error":"#REF!"},null,{"$error":"#REF!"},null,{"$error":"#REF!"},{"$error":"#REF!"}]
[100000,100,"628318.53i","-394784175141.361","-248050212592082000i",null,"100+62.831853i",null,{"$error":"#REF!"},{"$error":"#REF!"},null,{"$error":"#REF!"},{"$error":"#REF!"},{"$error":"#REF!"},{"$error":"#REF!"},0,"1+0.2199114855i","-0.0277468967805503i","-0.394626261471305","0.605373738528695+0.19216458871945i",1,1,0,0,null,"1.60541786286688-0.146344269997555i",4.1477004385549856,-5.208487782900634,null,"12.5663706i","1+12.5663706i",{"$error":"#REF!"},"-39.4784175141361-24.8050212592082i","1+12.5663706i",{"$error":"#REF!"},null,{"$error":"#REF!"},null,{"$error":"#REF!"},{"$error":"#REF!"}]
[110000,110,"691150.383i","-477688851921.047","-330154832960062000i",null,"100+69.1150383i",null,{"$error":"#REF!"},{"$error":"#REF!"},null,{"$error":"#REF!"},{"$error":"#REF!"},{"$f":"J72","v":{"$error":"#REF!"}},{"$f":"IMSUM(L72:N72)","v":{"$error":"#REF!"}},1,"1+0.24190263405i","-0.0369311196149125i","-0.477497776380279",{"$f":"IMSUM(S72,R72,Q72)","v":"0.522502223619721+0.204971514435088i"},1,1,0,0,null,"1.81601781079008-0.249432980334241i",5.2635704959533189,-7.8207323086855629,null,"13.82300766i","1+13.82300766i",{"$error":"#REF!"},"-47.7688851921047-33.0154832960062i","1+13.82300766i",{"$error":"#REF!"},null,{"$error":"#REF!"},null,{"$error":"#REF!"},{"$error":"#REF!"}]
[120000,120,"753982.236i","-568489212203.56","-428630767359118000i",null,"100+75.3982236i",null,{"$error":"#REF!"},{"$error":"#REF!"},null,{"$error":"#REF!"},{"$error":"#REF!"},{"$error":"#REF!"},{"$error":"#REF!"},2,"1+0.2638937826i","-0.0479466376367909i","-0.568261816518679","0.431738183481321+0.215947144963209i",1,1,0,0,null,"2.09725415352119-0.43777055480966i",6.6182385434260986,-11.79034914070173,null,"15.07964472i","1+15.07964472i",{"$error":"#REF!"},"-56.848921220356-42.8630767359119i","1+15.07964472i",{"$error":"#REF!"},null,{"$error":"#REF!"},null,{"$error":"#REF!"},{"$error":"#REF!"}]
[130000,130,"816814.089i","-667185255988.9","-544966317064805000i",null,"100+81.6814089i",null,{"$error":"#REF!"},{"$error":"#REF!"},null,{"$error":"#REF!"},{"$error":"#REF!"},{"$error":"#REF!"},{"$error":"#REF!"},3,"1+0.28588493115i","-0.0609599322268691i","-0.666918381886505","0.333081618113495+0.224924998923131i",1,1,0,0,null,"2.4600564712321-0.802936137717432i",8.2585333921617039,-18.076129196132914,null,"16.33628178i","1+16.33628178i",{"$error":"#REF!"},"-66.71852559889-54.4966317064805i","1+16.33628178i",{"$error":"#REF!"},null,{"$error":"#REF!"},null,{"$error":"#REF!"},{"$error":"#REF!"}]
[150000,150,"942477.795i","-888264394068.062","-837169467498278000i",null,"100+94.2477795i",null,{"$error":"#REF!"},{"$error":"#REF!"},null,{"$error":"#REF!"},{"$error":"#REF!"},{"$error":"#REF!"},{"$error":"#REF!"},4,"1+0.32986722825i","-0.0936457766343574i","-0.887909088310435","0.112090911689565+0.236221451615643i",1,1,0,0,null,"2.77938675294686-2.91445167327342i",12.100245900170394,-46.358872275853109,null,"18.8495559i","1+18.8495559i",{"$error":"#REF!"},"-88.8264394068062-83.7169467498278i","1+18.8495559i",{"$error":"#REF!"},null,{"$error":"#REF!"},null,{"$error":"#REF!"},{"$error":"#REF!"}]
[160000,160,"1005309.648i","-1010647488361.88","-1016013670777170000i",null,"100+100.5309648i",null,{"$error":"#REF!"},{"$error":"#REF!"},null,{"$error":"#REF!"},{"$error":"#REF!"},{"$error":"#REF!"},{"$error":"#REF!"},5,"1+0.3518583768i","-0.113651289213134i","-1.01024322936654","-0.01024322936654+0.238207087586866i",1,1,0,0,null,"1.29419724044521-4.25368014631354i",12.959790177872241,-73.077431398381563,null,"20.10619296i","1+20.10619296i",{"$error":"#REF!"},"-101.064748836188-101.601367077717i","1+20.10619296i",{"$error":"#REF!"},null,{"$error":"#REF!"},null,{"$error":"#REF!"},{"$error":"#REF!"}]
[175000,175,{"$f":"COMPLEX(0,2*Pi*A77)","v":"1099557.4275i"},{"$f":"COMPLEX(-POWER(2*Pi*A77,2),0)","v":"-1209026536370.42"},{"$f":"COMPLEX(0,-POWER(2*Pi*A77,3))","v":"-1329394108110690000i"},null,"100+109.95574275i",null,{"$f":"IMPRODUCT((RdampSel*CdampSel+RdampSel*CinjSel),C77)","v":{"$error":"#REF!"}},{"$error":"#REF!"},null,{"$f":"IMPRODUCT(G77,L_infilterStd*RdampSel*CinjSel*CdampSel,E77)","v":{"$error":"#REF!"}},{"$f":"IMPRODUCT(G77,L_infilterStd*CinjSel,D77)","v":{"$error":"#REF!"}},{"$error":"#REF!"},{"$error":"#REF!"},6,{"$f":"IMSUM(IMPRODUCT(C77,RdampPssv*CdampPssv),1)","v":"1+0.384845099625i"},{"$f":"IMPRODUCT(RdampPssv*CdampPssv*CfilterPssv*LinfilterPssv,E77)","v":"-0.148706024933262i"},{"$f":"IMPRODUCT(D77,LinfilterPssv*(CfilterPssv+CdampPssv))","v":"-1.20854292575587"},"-0.20854292575587+0.236139074691738i",1,1,0,0,null,{"$f":"IMDIV(Q77,T77)","v":"-1.18552956082797-3.18780870043445i"},10.632434371784214,{"$f":"IMARGUMENT(Z77)*180/Pi","v":-110.39990747553254},null,{"$f":"IMPRODUCT((RdampCom*CdampCom+RdampCom*CinjCom),C77)","v":"21.99114855i"},"1+21.99114855i",{"$f":"IMPRODUCT(G77,L_infilterStd*RdampSel*CinjSel*CdampSel,E77)","v":{"$error":"#REF!"}},{"$f":"IMPRODUCT(G77,LAEFCom*CinjCom,D77)","v":"-120.902653637042-132.939410811069i"},"1+21.99114855i",{"$error":"#REF!"},null,{"$error":"#REF!"},null,{"$error":"#REF!"},{"$f":"IMARGUMENT(AK77)*180/Pi","v":{"$error":"#REF!"}}]
[190000,190,"1193805.207i","-1425170872260.31","-1701376408169090000i",null,"100+119.3805207i",null,{"$error":"#REF!"},{"$error":"#REF!"},null,{"$error":"#REF!"},{"$error":"#REF!"},{"$error":"#REF!"},{"$error":"#REF!"},7,"1+0.41783182245i","-0.190315965017794i","-1.42460080391141","-0.42460080391141+0.227515857432206i",1,1,0,0,null,"-1.42011816933091-1.74500664759685i",{"$f":"20*LOG10(IMABS(Z78))","v":7.0430359282769261},-129.13932379003126,null,"23.87610414i",{"$f":"IMSUM(1,AD78)","v":"1+23.87610414i"},{"$error":"#REF!"},"-142.517087226031-170.137640816909i",{"$f":"AE78","v":"1+23.87610414i"},{"$f":"IMSUM(AF78:AH78)","v":{"$error":"#REF!"}},null,{"$f":"IMDIV(AE78,AI78)","v":{"$error":"#REF!"}},null,{"$f":"20*LOG10(IMABS(AK78))","v":{"$error":"#REF!"}},{"$error":"#REF!"}]
[200000,200,"1256637.06i","-1579136700565.44","-1984401700736660000i",null,"100+125.663706i",null,{"$error":"#REF!"},{"$error":"#REF!"},null,{"$error":"#REF!"},{"$error":"#REF!"},{"$error":"#REF!"},{"$error":"#REF!"},0,"1+0.439822971i","-0.221975174244403i","-1.57850504588521","-0.57850504588521+0.217847796755597i",1,1,0,0,null,"-1.26317208366406-1.23594812428182i",4.9459582998103908,-135.6241223057485,null,"25.1327412i","1+25.1327412i",{"$error":"#REF!"},"-157.913670056544-198.440170073665i","1+25.1327412i",{"$error":"#REF!"},null,{"$error":"#REF!"},null,{"$error":"#REF!"},{"$error":"#REF!"}]
[300000,300,"1884955.59i","-3553057576272.25","-6697355739986230000i",null,"100+188.495559i",null,{"$error":"#REF!"},{"$error":"#REF!"},null,{"$error":"#REF!"},{"$error":"#REF!"},{"$error":"#REF!"},{"$error":"#REF!"},0,"1+0.6597344565i","-0.74916621307486i","-3.55163635324174","-2.55163635324174-0.08943175657486i",1,1,0,0,null,"-0.400475408867723-0.244517302172491i",-6.5724330903943216,-148.59311414511541,null,"37.6991118i","1+37.6991118i",{"$error":"#REF!"},"-355.305757627225-669.735573998623i","1+37.6991118i",{"$error":"#REF!"},null,{"$error":"#REF!"},null,{"$error":"#REF!"},{"$error":"#REF!"}]
[400000,400,"2513274.12i","-6316546802261.78","-15875213605893300000i",null,"100+251.327412i",null,{"$error":"#REF!"},{"$error":"#REF!"},null,{"$error":"#REF!"},{"$error":"#REF!"},{"$error":"#REF!"},{"$error":"#REF!"},0,"1+0.879645942i","-1.77580139395522i","-6.31402018354088","-5.31402018354088-0.89615545195522i",1,1,0,0,null,"-0.210121191022436-0.130098243366712i",-12.141260868793136,-148.23594278994108,null,"50.2654824i","1+50.2654824i",{"$error":"#REF!"},"-631.654680226178-1587.52136058933i","1+50.2654824i",{"$error":"#REF!"},null,{"$error":"#REF!"},null,{"$error":"#REF!"},{"$error":"#REF!"}]
[500000,500,"3141592.65i","-9869604378534.03","-31006276574010300000i",null,"100+314.159265i",null,{"$error":"#REF!"},{"$error":"#REF!"},null,{"$error":"#REF!"},{"$error":"#REF!"},{"$error":"#REF!"},{"$error":"#REF!"},0,"1+1.0995574275i","-3.46836209756879i","-9.86565653678262","-8.86565653678262-2.36880467006879i",1,1,0,0,null,"-0.136208802833546-0.0876308907321328i",-15.811684145573038,-147.2445124058745,null,"62.831853i","1+62.831853i",{"$error":"#REF!"},"-986.960437853403-3100.62765740103i","1+62.831853i",{"$error":"#REF!"},null,{"$error":"#REF!"},null,{"$error":"#REF!"},{"$error":"#REF!"}]
[600000,600,"3769911.18i","-14212230305089","-53578845919889800000i",null,{"$f":"IMSUM(IMPRODUCT(C83,Rcomp_AEF*Csen_AEF),Csen_AEF/Ccomp_AEF)","v":"100+376.991118i"},null,{"$error":"#REF!"},{"$error":"#REF!"},null,{"$error":"#REF!"},{"$error":"#REF!"},{"$error":"#REF!"},{"$error":"#REF!"},0,"1+1.319468913i","-5.99332970459887i","-14.206545412967","-13.206545412967-4.67386079159887i",1,{"$f":"CHOOSE(INFILTER_TYPE,U83,IMDIV(J83,O83),IMDIV(Q83,T83))","v":1},0,{"$f":"IMARGUMENT(V83)*180/Pi","v":0},null,"-0.0987148424567274-0.0649745603002369i",-18.549182102928064,-146.64690503853296,null,"75.3982236i","1+75.3982236i",{"$error":"#REF!"},"-1421.2230305089-5357.88459198898i","1+75.3982236i",{"$error":"#REF!"},null,{"$error":"#REF!"},null,{"$error":"#REF!"},{"$error":"#REF!"}]
[700000,700,"4398229.71i","-19344424581926.7","-85081222919084300000i",null,"100+439.822971i",null,{"$error":"#REF!"},{"$error":"#REF!"},null,{"$error":"#REF!"},{"$error":"#REF!"},{"$error":"#REF!"},{"$error":"#REF!"},0,"1+1.5393803985i","-9.51718559572877i","-19.3366868120939","-18.3366868120939-7.97780519722877i",1,1,0,0,null,"-0.0765669830392885-0.050638587700621i",-20.743388875708668,-146.52081538204177,null,"87.9645942i","1+87.9645942i",{"$error":"#REF!"},"-1934.44245819267-8508.12229190843i","1+87.9645942i",{"$error":"#REF!"},null,{"$error":"#REF!"},null,{"$error":"#REF!"},{"$error":"#REF!"}]
[800000,800,"5026548.24i","-25266187209047.1","-127001708847146000000i",null,"100+502.654824i",null,{"$error":"#REF!"},{"$error":"#REF!"},null,{"$error":"#REF!"},{"$error":"#REF!"},{"$error":"#REF!"},{"$error":"#REF!"},0,"1+1.759291884i","-14.2064111516417i","-25.2560807341635","-24.2560807341635-12.4471192676417i",1,1,0,0,null,"-0.0620946151681225-0.040665794855093i",-22.588919033913939,-146.77919071706401,null,"100.5309648i","1+100.5309648i",{"$error":"#REF!"},"-2526.61872090471-12700.1708847146i","1+100.5309648i",{"$error":"#REF!"},null,{"$error":"#REF!"},null,{"$error":"#REF!"},{"$error":"#REF!"}]
[900000,900,"5654866.77i","-31977518186450.2","-180828604979628000000i",null,"100+565.486677i",null,{"$error":"#REF!"},{"$error":"#REF!"},null,{"$error":"#REF!"},{"$error":"#REF!"},{"$error":"#REF!"},{"$error":"#REF!"},0,"1+1.9792033695i","-20.2274877530212i","-31.9647271791756","-30.9647271791756-18.2482843835212i",1,1,0,0,null,"-0.0519283597315569-0.033315323192724i",-24.194781244722876,-147.31726418522518,null,"113.0973354i","1+113.0973354i",{"$error":"#REF!"},"-3197.75181864502-18082.8604979628i","1+113.0973354i",{"$error":"#REF!"},null,{"$error":"#REF!"},null,{"$error":"#REF!"},{"$error":"#REF!"}]
[1000000,1000,"6283185.3i","-39478417514136.1","-248050212592083000000i",null,"100+628.31853i",null,{"$error":"#REF!"},{"$error":"#REF!"},null,{"$error":"#REF!"},{"$error":"#REF!"},{"$error":"#REF!"},{"$error":"#REF!"},0,"1+2.199114855i","-27.7468967805504i","-39.4626261471305","-38.4626261471305-25.5477819255504i",1,1,0,0,null,"-0.044391344457259-0.0276895930961649i",-25.626768047686518,-148.04569057314714,null,"125.663706i","1+125.663706i",{"$error":"#REF!"},"-3947.84175141361-24805.0212592082i","1+125.663706i",{"$error":"#REF!"},null,{"$error":"#REF!"},null,{"$error":"#REF!"},{"$error":"#REF!"}]
[2000000,2000,"12566370.6i","-157913670056544","-1.98440170073666E+21i",null,"100+1256.63706i",null,{"$error":"#REF!"},{"$error":"#REF!"},null,{"$error":"#REF!"},{"$error":"#REF!"},{"$error":"#REF!"},{"$error":"#REF!"},0,"1+4.39822971i","-221.975174244403i","-157.850504588521","-156.850504588521-217.576944534403i",1,1,0,0,null,"-0.0154820114155727-0.00656485596685991i",-35.485359346827785,-157.02154019060663,null,"251.327412i","1+251.327412i",{"$error":"#REF!"},"-15791.3670056544-198440.170073666i","1+251.327412i",{"$error":"#REF!"},null,{"$error":"#REF!"},null,{"$error":"#REF!"},{"$error":"#REF!"}]
[3000000,3000,"18849555.9i","-355305757627225","-6.69735573998623E+21i",null,"100+1884.95559i",null,{"$error":"#REF!"},{"$error":"#REF!"},null,{"$error":"#REF!"},{"$error":"#REF!"},{"$error":"#REF!"},{"$error":"#REF!"},0,"1+6.597344565i","-749.16621307486i","-355.163635324174","-354.163635324174-742.56886850986i",1,1,0,0,null,"-0.00776127767315144-0.00235501700871593i",-41.818827844809874,-163.12054420169724,null,"376.991118i","1+376.991118i",{"$error":"#REF!"},"-35530.5757627225-669735.573998623i","1+376.991118i",{"$error":"#REF!"},null,{"$error":"#REF!"},null,{"$error":"#REF!"},{"$error":"#REF!"}]
[4000000,4000,"25132741.2i","-631654680226178","-1.58752136058933E+22i",null,"100+2513.27412i",null,{"$error":"#REF!"},{"$error":"#REF!"},null,{"$error":"#REF!"},{"$error":"#REF!"},{"$error":"#REF!"},{"$error":"#REF!"},0,"1+8.79645942i","-1775.80139395522i","-631.402018354088","-630.402018354088-1767.00493453522i",1,1,0,0,null,"-0.00459520096124435-0.00107346840047734i",-46.523147642689807,-166.85114049434898,null,"502.654824i","1+502.654824i",{"$error":"#REF!"},"-63165.4680226178-1587521.36058933i","1+502.654824i",{"$error":"#REF!"},null,{"$error":"#REF!"},null,{"$error":"#REF!"},{"$error":"#REF!"}]
[5000000,5000,"31415926.5i","-986960437853403","-3.10062765740103E+22i",null,"100+3141.59265i",null,{"$error":"#REF!"},{"$error":"#REF!"},null,{"$error":"#REF!"},{"$error":"#REF!"},{"$error":"#REF!"},{"$error":"#REF!"},0,"1+10.995574275i","-3468.36209756879i","-986.565653678262","-985.565653678262-3457.36652329379i",1,1,0,0,null,"-0.00301757308495533-0.000570959537178404i",-50.254080822840123,-169.28564289756036,null,"628.31853i","1+628.31853i",{"$error":"#REF!"},"-98696.0437853403-3100627.65740103i","1+628.31853i",{"$error":"#REF!"},null,{"$error":"#REF!"},null,{"$error":"#REF!"},{"$error":"#REF!"}]
[6000000,6000,"37699111.8i","-1421223030508900","-5.35788459198898E+22i",null,"100+3769.91118i",null,{"$error":"#REF!"},{"$error":"#REF!"},null,{"$error":"#REF!"},{"$error":"#REF!"},{"$error":"#REF!"},{"$error":"#REF!"},0,"1+13.19468913i","-5993.32970459887i","-1420.6545412967","-1419.6545412967-5980.13501546887i",1,1,0,0,null,"-0.00212628728062533-0.000337549802608077i",-53.339467507298949,-170.979524286046,null,"753.982236i","1+753.982236i",{"$error":"#REF!"},"-142122.30305089-5357884.59198898i","1+753.982236i",{"$error":"#REF!"},null,{"$error":"#REF!"},null,{"$error":"#REF!"},{"$error":"#REF!"}]
[7000000,7000,"43982297.1i","-1934442458192670","-8.50812229190843E+22i",null,"100+4398.22971i",null,{"$error":"#REF!"},{"$error":"#REF!"},null,{"$error":"#REF!"},{"$error":"#REF!"},{"$error":"#REF!"},{"$error":"#REF!"},0,"1+15.393803985i","-9517.18559572877i","-1933.66868120939","-1932.66868120939-9501.79179174377i",1,1,0,0,null,"-0.00157628762603077-0.000215374297002146i",-55.966960551322785,-172.21963347996476,null,"879.645942i","1+879.645942i",{"$error":"#REF!"},"-193444.245819267-8508122.29190843i","1+879.645942i",{"$error":"#REF!"},null,{"$error":"#REF!"},null,{"$error":"#REF!"},{"$error":"#REF!"}]
[8000000,8000,"50265482.4i","-2526618720904710","-1.27001708847146E+23i",null,"100+5026.54824i",null,{"$error":"#REF!"},{"$error":"#REF!"},null,{"$error":"#REF!"},{"$error":"#REF!"},{"$error":"#REF!"},{"$error":"#REF!"},0,"1+17.59291884i","-14206.4111516417i","-2525.60807341635","-2524.60807341635-14188.8182328017i",1,1,0,0,null,"-0.00121401992445827-0.000145531817287078i",-58.253518683206799,-173.1642323462458,null,"1005.309648i","1+1005.309648i",{"$error":"#REF!"},"-252661.872090471-12700170.8847146i","1+1005.309648i",{"$error":"#REF!"},null,{"$error":"#REF!"},null,{"$error":"#REF!"},{"$error":"#REF!"}]
[9000000,9000,"56548667.7i","-3197751818645020","-1.80828604979628E+23i",null,"100+5654.86677i",null,{"$error":"#REF!"},{"$error":"#REF!"},null,{"$error":"#REF!"},{"$error":"#REF!"},{"$error":"#REF!"},{"$error":"#REF!"},0,"1+19.792033695i","-20227.4877530212i","-3196.47271791756","-3195.47271791756-20207.6957193262i",1,1,0,0,null,"-0.000963171180292813-0.000102821581350465i",-60.27671706539698,-173.90657129969617,null,"1130.973354i","1+1130.973354i",{"$error":"#REF!"},"-319775.181864502-18082860.4979628i","1+1130.973354i",{"$error":"#REF!"},null,{"$error":"#REF!"},null,{"$error":"#REF!"},{"$error":"#REF!"}]
[10000000,10000,"62831853i","-3947841751413610","-2.48050212592082E+23i",null,"100+6283.1853i",null,{"$error":"#REF!"},{"$error":"#REF!"},null,{"$error":"#REF!"},{"$error":"#REF!"},{"$error":"#REF!"},{"$error":"#REF!"},0,"1+21.99114855i","-27746.8967805503i","-3946.26261471304","-3945.26261471304-27724.9056320003i",1,1,0,0,null,"-0.000782478973720499-0.0000752783461022707i",-62.09053569388221,-174.50477476720093,null,"1256.63706i","1+1256.63706i",{"$error":"#REF!"},"-394784.175141361-24805021.2592083i","1+1256.63706i",{"$error":"#REF!"},null,{"$error":"#REF!"},null,{"$error":"#REF!"},{"$error":"#REF!"}]
[{"$f":"Fsw","v":300000},{"$f":"A97/1000","v":300},"1884955.59i","-3553057576272.25","-6697355739986230000i",null,"100+188.495559i",null,{"$error":"#REF!"},{"$f":"IMSUM(1,I97)","v":{"$error":"#REF!"}},null,{"$error":"#REF!"},{"$error":"#REF!"},{"$f":"J97","v":{"$error":"#REF!"}},{"$f":"IMSUM(L97:N97)","v":{"$error":"#REF!"}},2,"1+0.6597344565i","-0.74916621307486i","-3.55163635324174",{"$f":"IMSUM(S97,R97,Q97)","v":"-2.55163635324174-0.08943175657486i"},1,1,{"$f":"20*LOG10(IMABS(V97))","v":0},0,null,"-0.400475408867723-0.244517302172491i",-6.5724330903943216,-148.59311414511541,null,"37.6991118i","1+37.6991118i",{"$error":"#REF!"},"-355.305757627225-669.735573998623i","1+37.6991118i",{"$error":"#REF!"},null,{"$error":"#REF!"},null,{"$error":"#REF!"},{"$error":"#REF!"}]

{"sheet":"Standard Value Calculator","index":12,"n_rows":159,"n_cols":20,"rows_kept":159,"cut":false,"hidden":true,"merged":[]}
[]
["Capacitors","Css","Cc1ea","Cc2ea","Cout","Cin","Cres","Cdither","Cc3ea","Cc4ea","Cin_Passive","Cdamp_Pssv","Cinj_AEF","Cdamp_AEF"]
["Inputs",{"$f":"Css","v":0},{"$f":"Cc1ea","v":1.3641816806205589E-8},{"$f":"Cc2ea","v":5.1384168359347224E-10},{"$f":"Cout","v":1E-4},{"$f":"Cin","v":2.0000000000000001E-4},{"$f":"Cres","v":5.0000000000000008E-7},{"$f":"Cdither_init","v":2.0226537216828479E-9},{"$f":"Cc3ea","v":0},{"$f":"Cc4ea","v":0},{"$f":"'Variable Management'!B291*0.000001","v":9.8514626242187148E-5},{"$f":"K3*4","v":3.9405850496874859E-4},{"$f":"Cinj_AEF*0.000001","v":9.8514626242187153E-7},{"$f":"'Variable Management'!B294*0.000001","v":3.2838208747395716E-7},null,null,"Resistors","inputs","Standard Result"]
["Standard Result",{"$f":"SUM(B6:B158)/1000000000000","v":0},{"$f":"IF(C3=\"OPEN\",\"OPEN\",SUM(C6:C158)/1000000000000)","v":1.4999999999999999E-8},{"$f":"SUM(D6:D158)/1000000000000","v":4.7000000000000003E-10},{"$f":"SUM(E6:E158)/1000000000000","v":1E-4},{"$f":"SUM(F6:F158)/1000000000000","v":2.2000000000000001E-4},{"$f":"SUM(G6:G158)/1000000000000","v":4.7E-7},{"$f":"IF(H3=\"OPEN\",\"OPEN\",SUM(H6:H158)/1000000000000)","v":2.1999999999999998E-9},0,0,1E-4,3.8999999999999999E-4,9.9999999999999995E-7,3.3000000000000002E-7,null,null,"Rt",{"$f":"Rfadj","v":73.2},{"$f":"IF(R4>(INT(0.5+100*POWER(10,IF(96*(LOG(R4)-INT(LOG(R4)))-ROUND(96*(LOG(R4)-INT(LOG(R4))),0)<0,ROUND(96*(LOG(R4)-INT(LOG(R4))),0)-1,ROUND(96*(LOG(R4)-INT(LOG(R4))),0))/96))*POWER(10,INT(LOG(R4))-2)+INT(0.5+100*POWER(10,(IF(96*(LOG(R4)-INT(LOG(R4)))-ROUND(96*(LOG(R4)-INT(LOG(R4))),0)<0,ROUND(96*(LOG(R4)-INT(LOG(R4))),0)-1,ROUND(96*(LOG(R4)-INT(LOG(R4))),0))+1)/96))*POWER(10,INT(LOG(R4))-2))/2,INT(0.5+100*POWER(10,(IF(96*(LOG(R4)-INT(LOG(R4)))-ROUND(96*(LOG(R4)-INT(LOG(R4))),0)<0,ROUND(96*(LOG(R4)-INT(LOG(R4))),0)-1,ROUND(96*(LOG(R4)-INT(LOG(R4))),0))+1)/96))*POWER(10,INT(LOG(R4))-2),INT(0.5+100*POWER(10,IF(96*(LOG(R4)-INT(LOG(R4)))-ROUND(96*(LOG(R4)-INT(LOG(R4))),0)<0,ROUND(96*(LOG(R4)-INT(LOG(R4))),0)-1,ROUND(96*(LOG(R4)-INT(LOG(R4))),0))/96))*POWER(10,INT(LOG(R4))-2))","v":73.2},"Ω"]
["(pF)"]
[0.47,{"$f":"IF(IF((B$3*10^12-$A7)*(B$3*10^12-$A6)*-1<0,0,1)*IF(ABS(B$3*10^12-$A7)>(B$3*10^12-$A6),$A6,$A7)=B7,0,IF((B$3*10^12-$A7)*(B$3*10^12-$A6)*-1<0,0,1)*IF(ABS(B$3*10^12-$A7)>(B$3*10^12-$A6),$A6,$A7))","v":0},0,0,0,0,0,0,0,0,0,0,0,0]
[0.56000000000000005,{"$f":"IF(IF((B$3*10^12-$A8)*(B$3*10^12-$A7)*-1<0,0,1)*IF(ABS(B$3*10^12-$A8)>(B$3*10^12-$A7),$A7,$A8)=B8,0,IF((B$3*10^12-$A8)*(B$3*10^12-$A7)*-1<0,0,1)*IF(ABS(B$3*10^12-$A8)>(B$3*10^12-$A7),$A7,$A8))","v":0},{"$f":"IF(IF((C$3*10^12-$A8)*(C$3*10^12-$A7)*-1<0,0,1)*IF(ABS(C$3*10^12-$A8)>(C$3*10^12-$A7),$A7,$A8)=C8,0,IF((C$3*10^12-$A8)*(C$3*10^12-$A7)*-1<0,0,1)*IF(ABS(C$3*10^12-$A8)>(C$3*10^12-$A7),$A7,$A8))","v":0},{"$f":"IF(IF((D$3*10^12-$A8)*(D$3*10^12-$A7)*-1<0,0,1)*IF(ABS(D$3*10^12-$A8)>(D$3*10^12-$A7),$A7,$A8)=D8,0,IF((D$3*10^12-$A8)*(D$3*10^12-$A7)*-1<0,0,1)*IF(ABS(D$3*10^12-$A8)>(D$3*10^12-$A7),$A7,$A8))","v":0},{"$f":"IF(IF((E$3*10^12-$A8)*(E$3*10^12-$A7)*-1<0,0,1)*IF(ABS(E$3*10^12-$A8)>(E$3*10^12-$A7),$A7,$A8)=E8,0,IF((E$3*10^12-$A8)*(E$3*10^12-$A7)*-1<0,0,1)*IF(ABS(E$3*10^12-$A8)>(E$3*10^12-$A7),$A7,$A8))","v":0},{"$f":"IF(IF((F$3*10^12-$A8)*(F$3*10^12-$A7)*-1<0,0,1)*IF(ABS(F$3*10^12-$A8)>(F$3*10^12-$A7),$A7,$A8)=F8,0,IF((F$3*10^12-$A8)*(F$3*10^12-$A7)*-1<0,0,1)*IF(ABS(F$3*10^12-$A8)>(F$3*10^12-$A7),$A7,$A8))","v":0},{"$f":"IF(IF((G$3*10^12-$A8)*(G$3*10^12-$A7)*-1<0,0,1)*IF(ABS(G$3*10^12-$A8)>(G$3*10^12-$A7),$A7,$A8)=G8,0,IF((G$3*10^12-$A8)*(G$3*10^12-$A7)*-1<0,0,1)*IF(ABS(G$3*10^12-$A8)>(G$3*10^12-$A7),$A7,$A8))","v":0},0,0,0,{"$f":"IF(IF((K$3*10^12-$A8)*(K$3*10^12-$A7)*-1<0,0,1)*IF(ABS(K$3*10^12-$A8)>(K$3*10^12-$A7),$A7,$A8)=K8,0,IF((K$3*10^12-$A8)*(K$3*10^12-$A7)*-1<0,0,1)*IF(ABS(K$3*10^12-$A8)>(K$3*10^12-$A7),$A7,$A8))","v":0},0,0,0,null,null,"Rc1ea",{"$f":"Rcea1","v":1944.449500809375},{"$f":"IF(R7>(INT(0.5+100*POWER(10,IF(96*(LOG(R7)-INT(LOG(R7)))-ROUND(96*(LOG(R7)-INT(LOG(R7))),0)<0,ROUND(96*(LOG(R7)-INT(LOG(R7))),0)-1,ROUND(96*(LOG(R7)-INT(LOG(R7))),0))/96))*POWER(10,INT(LOG(R7))-2)+INT(0.5+100*POWER(10,(IF(96*(LOG(R7)-INT(LOG(R7)))-ROUND(96*(LOG(R7)-INT(LOG(R7))),0)<0,ROUND(96*(LOG(R7)-INT(LOG(R7))),0)-1,ROUND(96*(LOG(R7)-INT(LOG(R7))),0))+1)/96))*POWER(10,INT(LOG(R7))-2))/2,INT(0.5+100*POWER(10,(IF(96*(LOG(R7)-INT(LOG(R7)))-ROUND(96*(LOG(R7)-INT(LOG(R7))),0)<0,ROUND(96*(LOG(R7)-INT(LOG(R7))),0)-1,ROUND(96*(LOG(R7)-INT(LOG(R7))),0))+1)/96))*POWER(10,INT(LOG(R7))-2),INT(0.5+100*POWER(10,IF(96*(LOG(R7)-INT(LOG(R7)))-ROUND(96*(LOG(R7)-INT(LOG(R7))),0)<0,ROUND(96*(LOG(R7)-INT(LOG(R7))),0)-1,ROUND(96*(LOG(R7)-INT(LOG(R7))),0))/96))*POWER(10,INT(LOG(R7))-2))","v":1960},"Ω"]
[0.68,0,0,0,0,0,0,0,0,0,0,0,0,0,null,null,"Rc1ea",{"$f":"Rcea2","v":0},{"$f":"IF(R8>(INT(0.5+100*POWER(10,IF(96*(LOG(R8)-INT(LOG(R8)))-ROUND(96*(LOG(R8)-INT(LOG(R8))),0)<0,ROUND(96*(LOG(R8)-INT(LOG(R8))),0)-1,ROUND(96*(LOG(R8)-INT(LOG(R8))),0))/96))*POWER(10,INT(LOG(R8))-2)+INT(0.5+100*POWER(10,(IF(96*(LOG(R8)-INT(LOG(R8)))-ROUND(96*(LOG(R8)-INT(LOG(R8))),0)<0,ROUND(96*(LOG(R8)-INT(LOG(R8))),0)-1,ROUND(96*(LOG(R8)-INT(LOG(R8))),0))+1)/96))*POWER(10,INT(LOG(R8))-2))/2,INT(0.5+100*POWER(10,(IF(96*(LOG(R8)-INT(LOG(R8)))-ROUND(96*(LOG(R8)-INT(LOG(R8))),0)<0,ROUND(96*(LOG(R8)-INT(LOG(R8))),0)-1,ROUND(96*(LOG(R8)-INT(LOG(R8))),0))+1)/96))*POWER(10,INT(LOG(R8))-2),INT(0.5+100*POWER(10,IF(96*(LOG(R8)-INT(LOG(R8)))-ROUND(96*(LOG(R8)-INT(LOG(R8))),0)<0,ROUND(96*(LOG(R8)-INT(LOG(R8))),0)-1,ROUND(96*(LOG(R8)-INT(LOG(R8))),0))/96))*POWER(10,INT(LOG(R8))-2))","v":{"$error":"#NUM!"}},"Ω"]
[0.82,0,0,0,0,0,0,0,0,0,0,0,0,0]
[1,0,0,0,0,0,0,0,0,0,0,0,0,0,null,null,"Rfb1",{"$f":"Rfb1_","v":100000},{"$f":"IF(R10>(INT(0.5+100*POWER(10,IF(96*(LOG(R10)-INT(LOG(R10)))-ROUND(96*(LOG(R10)-INT(LOG(R10))),0)<0,ROUND(96*(LOG(R10)-INT(LOG(R10))),0)-1,ROUND(96*(LOG(R10)-INT(LOG(R10))),0))/96))*POWER(10,INT(LOG(R10))-2)+INT(0.5+100*POWER(10,(IF(96*(LOG(R10)-INT(LOG(R10)))-ROUND(96*(LOG(R10)-INT(LOG(R10))),0)<0,ROUND(96*(LOG(R10)-INT(LOG(R10))),0)-1,ROUND(96*(LOG(R10)-INT(LOG(R10))),0))+1)/96))*POWER(10,INT(LOG(R10))-2))/2,INT(0.5+100*POWER(10,(IF(96*(LOG(R10)-INT(LOG(R10)))-ROUND(96*(LOG(R10)-INT(LOG(R10))),0)<0,ROUND(96*(LOG(R10)-INT(LOG(R10))),0)-1,ROUND(96*(LOG(R10)-INT(LOG(R10))),0))+1)/96))*POWER(10,INT(LOG(R10))-2),INT(0.5+100*POWER(10,IF(96*(LOG(R10)-INT(LOG(R10)))-ROUND(96*(LOG(R10)-INT(LOG(R10))),0)<0,ROUND(96*(LOG(R10)-INT(LOG(R10))),0)-1,ROUND(96*(LOG(R10)-INT(LOG(R10))),0))/96))*POWER(10,INT(LOG(R10))-2))","v":100000},"Ω"]
[1.2,0,0,0,0,0,0,0,0,0,0,0,{"$f":"IF(IF((M$3*10^12-$A12)*(M$3*10^12-$A11)*-1<0,0,1)*IF(ABS(M$3*10^12-$A12)>(M$3*10^12-$A11),$A11,$A12)=M12,0,IF((M$3*10^12-$A12)*(M$3*10^12-$A11)*-1<0,0,1)*IF(ABS(M$3*10^12-$A12)>(M$3*10^12-$A11),$A11,$A12))","v":0},0,null,null,"Rfb2",{"$f":"Rfb2_","v":31987.205117952813},{"$f":"IF(R11=\"OPEN\",\"OPEN\",IF(R11>(INT(0.5+100*POWER(10,IF(96*(LOG(R11)-INT(LOG(R11)))-ROUND(96*(LOG(R11)-INT(LOG(R11))),0)<0,ROUND(96*(LOG(R11)-INT(LOG(R11))),0)-1,ROUND(96*(LOG(R11)-INT(LOG(R11))),0))/96))*POWER(10,INT(LOG(R11))-2)+INT(0.5+100*POWER(10,(IF(96*(LOG(R11)-INT(LOG(R11)))-ROUND(96*(LOG(R11)-INT(LOG(R11))),0)<0,ROUND(96*(LOG(R11)-INT(LOG(R11))),0)-1,ROUND(96*(LOG(R11)-INT(LOG(R11))),0))+1)/96))*POWER(10,INT(LOG(R11))-2))/2,INT(0.5+100*POWER(10,(IF(96*(LOG(R11)-INT(LOG(R11)))-ROUND(96*(LOG(R11)-INT(LOG(R11))),0)<0,ROUND(96*(LOG(R11)-INT(LOG(R11))),0)-1,ROUND(96*(LOG(R11)-INT(LOG(R11))),0))+1)/96))*POWER(10,INT(LOG(R11))-2),INT(0.5+100*POWER(10,IF(96*(LOG(R11)-INT(LOG(R11)))-ROUND(96*(LOG(R11)-INT(LOG(R11))),0)<0,ROUND(96*(LOG(R11)-INT(LOG(R11))),0)-1,ROUND(96*(LOG(R11)-INT(LOG(R11))),0))/96))*POWER(10,INT(LOG(R11))-2)))","v":31600},"Ω"]
[1.5,0,0,0,0,0,0,0,0,0,0,0,0,0,null,null,"Rt1",{"$f":"'Variable Management'!B27*1000","v":72996.296296296292},{"$f":"IF(R12>(INT(0.5+100*POWER(10,IF(96*(LOG(R12)-INT(LOG(R12)))-ROUND(96*(LOG(R12)-INT(LOG(R12))),0)<0,ROUND(96*(LOG(R12)-INT(LOG(R12))),0)-1,ROUND(96*(LOG(R12)-INT(LOG(R12))),0))/96))*POWER(10,INT(LOG(R12))-2)+INT(0.5+100*POWER(10,(IF(96*(LOG(R12)-INT(LOG(R12)))-ROUND(96*(LOG(R12)-INT(LOG(R12))),0)<0,ROUND(96*(LOG(R12)-INT(LOG(R12))),0)-1,ROUND(96*(LOG(R12)-INT(LOG(R12))),0))+1)/96))*POWER(10,INT(LOG(R12))-2))/2,INT(0.5+100*POWER(10,(IF(96*(LOG(R12)-INT(LOG(R12)))-ROUND(96*(LOG(R12)-INT(LOG(R12))),0)<0,ROUND(96*(LOG(R12)-INT(LOG(R12))),0)-1,ROUND(96*(LOG(R12)-INT(LOG(R12))),0))+1)/96))*POWER(10,INT(LOG(R12))-2),INT(0.5+100*POWER(10,IF(96*(LOG(R12)-INT(LOG(R12)))-ROUND(96*(LOG(R12)-INT(LOG(R12))),0)<0,ROUND(96*(LOG(R12)-INT(LOG(R12))),0)-1,ROUND(96*(LOG(R12)-INT(LOG(R12))),0))/96))*POWER(10,INT(LOG(R12))-2))","v":73200},"Ω"]
[1.8,0,0,0,0,0,0,0,0,0,0,0,0,0,null,null,"Rd",{"$f":"'Variable Management'!B28*1000","v":0},{"$f":"IF(R13=\"OPEN\",\"OPEN\",IF(R13>(INT(0.5+100*POWER(10,IF(96*(LOG(R13)-INT(LOG(R13)))-ROUND(96*(LOG(R13)-INT(LOG(R13))),0)<0,ROUND(96*(LOG(R13)-INT(LOG(R13))),0)-1,ROUND(96*(LOG(R13)-INT(LOG(R13))),0))/96))*POWER(10,INT(LOG(R13))-2)+INT(0.5+100*POWER(10,(IF(96*(LOG(R13)-INT(LOG(R13)))-ROUND(96*(LOG(R13)-INT(LOG(R13))),0)<0,ROUND(96*(LOG(R13)-INT(LOG(R13))),0)-1,ROUND(96*(LOG(R13)-INT(LOG(R13))),0))+1)/96))*POWER(10,INT(LOG(R13))-2))/2,INT(0.5+100*POWER(10,(IF(96*(LOG(R13)-INT(LOG(R13)))-ROUND(96*(LOG(R13)-INT(LOG(R13))),0)<0,ROUND(96*(LOG(R13)-INT(LOG(R13))),0)-1,ROUND(96*(LOG(R13)-INT(LOG(R13))),0))+1)/96))*POWER(10,INT(LOG(R13))-2),INT(0.5+100*POWER(10,IF(96*(LOG(R13)-INT(LOG(R13)))-ROUND(96*(LOG(R13)-INT(LOG(R13))),0)<0,ROUND(96*(LOG(R13)-INT(LOG(R13))),0)-1,ROUND(96*(LOG(R13)-INT(LOG(R13))),0))/96))*POWER(10,INT(LOG(R13))-2)))","v":{"$error":"#NUM!"}},"Ω"]
[2.2000000000000002,{"$f":"IF(IF((B$3*10^12-$A15)*(B$3*10^12-$A14)*-1<0,0,1)*IF(ABS(B$3*10^12-$A15)>(B$3*10^12-$A14),$A14,$A15)=B15,0,IF((B$3*10^12-$A15)*(B$3*10^12-$A14)*-1<0,0,1)*IF(ABS(B$3*10^12-$A15)>(B$3*10^12-$A14),$A14,$A15))","v":0},0,0,0,0,0,0,0,0,0,0,0,0,null,null,"Rd_AEF",{"$f":"'Variable Management'!B300","v":5.8309518948453008E-2},{"$f":"IF(R14=\"OPEN\",\"OPEN\",IF(R14>(INT(0.5+100*POWER(10,IF(96*(LOG(R14)-INT(LOG(R14)))-ROUND(96*(LOG(R14)-INT(LOG(R14))),0)<0,ROUND(96*(LOG(R14)-INT(LOG(R14))),0)-1,ROUND(96*(LOG(R14)-INT(LOG(R14))),0))/96))*POWER(10,INT(LOG(R14))-2)+INT(0.5+100*POWER(10,(IF(96*(LOG(R14)-INT(LOG(R14)))-ROUND(96*(LOG(R14)-INT(LOG(R14))),0)<0,ROUND(96*(LOG(R14)-INT(LOG(R14))),0)-1,ROUND(96*(LOG(R14)-INT(LOG(R14))),0))+1)/96))*POWER(10,INT(LOG(R14))-2))/2,INT(0.5+100*POWER(10,(IF(96*(LOG(R14)-INT(LOG(R14)))-ROUND(96*(LOG(R14)-INT(LOG(R14))),0)<0,ROUND(96*(LOG(R14)-INT(LOG(R14))),0)-1,ROUND(96*(LOG(R14)-INT(LOG(R14))),0))+1)/96))*POWER(10,INT(LOG(R14))-2),INT(0.5+100*POWER(10,IF(96*(LOG(R14)-INT(LOG(R14)))-ROUND(96*(LOG(R14)-INT(LOG(R14))),0)<0,ROUND(96*(LOG(R14)-INT(LOG(R14))),0)-1,ROUND(96*(LOG(R14)-INT(LOG(R14))),0))/96))*POWER(10,INT(LOG(R14))-2)))","v":5.9000000000000004E-2},"Ω"]
[2.7,0,0,0,0,0,0,0,0,0,{"$f":"IF(IF((K$3*10^12-$A16)*(K$3*10^12-$A15)*-1<0,0,1)*IF(ABS(K$3*10^12-$A16)>(K$3*10^12-$A15),$A15,$A16)=K16,0,IF((K$3*10^12-$A16)*(K$3*10^12-$A15)*-1<0,0,1)*IF(ABS(K$3*10^12-$A16)>(K$3*10^12-$A15),$A15,$A16))","v":0},0,0,0]
[3.3,0,0,0,0,0,0,0,0,0,0,0,0,0,null,null,"Rs",{"$f":"Rs_ideal*1000","v":1.8963308599631434},{"$f":"IF(R16=0,0,IF(R16>(INT(0.5+100*POWER(10,IF(96*(LOG(R16)-INT(LOG(R16)))-ROUND(96*(LOG(R16)-INT(LOG(R16))),0)<0,ROUND(96*(LOG(R16)-INT(LOG(R16))),0)-1,ROUND(96*(LOG(R16)-INT(LOG(R16))),0))/96))*POWER(10,INT(LOG(R16))-2)+INT(0.5+100*POWER(10,(IF(96*(LOG(R16)-INT(LOG(R16)))-ROUND(96*(LOG(R16)-INT(LOG(R16))),0)<0,ROUND(96*(LOG(R16)-INT(LOG(R16))),0)-1,ROUND(96*(LOG(R16)-INT(LOG(R16))),0))+1)/96))*POWER(10,INT(LOG(R16))-2))/2,INT(0.5+100*POWER(10,(IF(96*(LOG(R16)-INT(LOG(R16)))-ROUND(96*(LOG(R16)-INT(LOG(R16))),0)<0,ROUND(96*(LOG(R16)-INT(LOG(R16))),0)-1,ROUND(96*(LOG(R16)-INT(LOG(R16))),0))+1)/96))*POWER(10,INT(LOG(R16))-2),INT(0.5+100*POWER(10,IF(96*(LOG(R16)-INT(LOG(R16)))-ROUND(96*(LOG(R16)-INT(LOG(R16))),0)<0,ROUND(96*(LOG(R16)-INT(LOG(R16))),0)-1,ROUND(96*(LOG(R16)-INT(LOG(R16))),0))/96))*POWER(10,INT(LOG(R16))-2)))","v":1.9100000000000001},"mΩ"]
[3.9,0,0,0,0,0,0,0,0,0,0,0,0,0,null,null,"Cres",{"$f":"Cres","v":5.0000000000000008E-7},{"$f":"G4*1000000000000","v":470000},"pF"]
[4.7,0,0,0,0,0,0,0,0,0,0,0,0,0]
[5.6,0,0,0,0,0,0,0,0,0,0,0,0,0]
[6.8,0,0,0,0,0,0,0,0,0,0,0,0,0]
[8.1999999999999993,0,0,0,0,0,0,0,0,0,0,0,0,0,null,null,"Cdither",{"$f":"Cdither_init","v":2.0226537216828479E-9},{"$f":"H4","v":2.1999999999999998E-9}]
[10,0,0,0,0,0,0,0,0,0,{"$f":"IF(IF((K$3*10^12-$A23)*(K$3*10^12-$A22)*-1<0,0,1)*IF(ABS(K$3*10^12-$A23)>(K$3*10^12-$A22),$A22,$A23)=K23,0,IF((K$3*10^12-$A23)*(K$3*10^12-$A22)*-1<0,0,1)*IF(ABS(K$3*10^12-$A23)>(K$3*10^12-$A22),$A22,$A23))","v":0},0,0,0]
[12,0,0,0,0,0,0,0,0,0,0,0,0,0,null,null,"Cin_Passive",{"$f":"K4","v":1E-4},{"$f":"R23*1000000","v":100},"uF"]
[15,0,0,0,0,0,0,0,0,0,0,0,0,0,null,null,"Cinj_AEF",{"$f":"Cinj_AEF","v":0.98514626242187164},{"$f":"M4*1000000","v":1},"uF"]
[18,0,0,0,0,0,0,0,0,0,0,0,0,0,null,null,"Cdamp_AEF",{"$f":"'Variable Management'!B294","v":0.3283820874739572},{"$f":"N4*1000000","v":0.33},"uF"]
[22,0,0,0,0,0,0,0,0,0,0,0,0,0,null,null,"Rdamp_AEF",{"$f":"'Variable Management'!B295","v":9.0558787129064058},{"$f":"IF(R26=\"OPEN\",\"OPEN\",IF(R26>(INT(0.5+100*POWER(10,IF(96*(LOG(R26)-INT(LOG(R26)))-ROUND(96*(LOG(R26)-INT(LOG(R26))),0)<0,ROUND(96*(LOG(R26)-INT(LOG(R26))),0)-1,ROUND(96*(LOG(R26)-INT(LOG(R26))),0))/96))*POWER(10,INT(LOG(R26))-2)+INT(0.5+100*POWER(10,(IF(96*(LOG(R26)-INT(LOG(R26)))-ROUND(96*(LOG(R26)-INT(LOG(R26))),0)<0,ROUND(96*(LOG(R26)-INT(LOG(R26))),0)-1,ROUND(96*(LOG(R26)-INT(LOG(R26))),0))+1)/96))*POWER(10,INT(LOG(R26))-2))/2,INT(0.5+100*POWER(10,(IF(96*(LOG(R26)-INT(LOG(R26)))-ROUND(96*(LOG(R26)-INT(LOG(R26))),0)<0,ROUND(96*(LOG(R26)-INT(LOG(R26))),0)-1,ROUND(96*(LOG(R26)-INT(LOG(R26))),0))+1)/96))*POWER(10,INT(LOG(R26))-2),INT(0.5+100*POWER(10,IF(96*(LOG(R26)-INT(LOG(R26)))-ROUND(96*(LOG(R26)-INT(LOG(R26))),0)<0,ROUND(96*(LOG(R26)-INT(LOG(R26))),0)-1,ROUND(96*(LOG(R26)-INT(LOG(R26))),0))/96))*POWER(10,INT(LOG(R26))-2)))","v":9.09},"Ω"]
[27,0,0,0,0,0,0,0,0,0,0,0,{"$f":"IF(IF((M$3*10^12-$A28)*(M$3*10^12-$A27)*-1<0,0,1)*IF(ABS(M$3*10^12-$A28)>(M$3*10^12-$A27),$A27,$A28)=M28,0,IF((M$3*10^12-$A28)*(M$3*10^12-$A27)*-1<0,0,1)*IF(ABS(M$3*10^12-$A28)>(M$3*10^12-$A27),$A27,$A28))","v":0},0,null,null,"Rdamp_Passive",{"$f":"SQRT(L_infilterStd/K4)","v":8.2462112512353219E-2},{"$f":"IF(R27=\"OPEN\",\"OPEN\",IF(R27>(INT(0.5+100*POWER(10,IF(96*(LOG(R27)-INT(LOG(R27)))-ROUND(96*(LOG(R27)-INT(LOG(R27))),0)<0,ROUND(96*(LOG(R27)-INT(LOG(R27))),0)-1,ROUND(96*(LOG(R27)-INT(LOG(R27))),0))/96))*POWER(10,INT(LOG(R27))-2)+INT(0.5+100*POWER(10,(IF(96*(LOG(R27)-INT(LOG(R27)))-ROUND(96*(LOG(R27)-INT(LOG(R27))),0)<0,ROUND(96*(LOG(R27)-INT(LOG(R27))),0)-1,ROUND(96*(LOG(R27)-INT(LOG(R27))),0))+1)/96))*POWER(10,INT(LOG(R27))-2))/2,INT(0.5+100*POWER(10,(IF(96*(LOG(R27)-INT(LOG(R27)))-ROUND(96*(LOG(R27)-INT(LOG(R27))),0)<0,ROUND(96*(LOG(R27)-INT(LOG(R27))),0)-1,ROUND(96*(LOG(R27)-INT(LOG(R27))),0))+1)/96))*POWER(10,INT(LOG(R27))-2),INT(0.5+100*POWER(10,IF(96*(LOG(R27)-INT(LOG(R27)))-ROUND(96*(LOG(R27)-INT(LOG(R27))),0)<0,ROUND(96*(LOG(R27)-INT(LOG(R27))),0)-1,ROUND(96*(LOG(R27)-INT(LOG(R27))),0))/96))*POWER(10,INT(LOG(R27))-2)))","v":8.2500000000000004E-2},"Ω"]
[33,0,0,0,0,0,0,0,0,0,0,0,0,0,null,null,"Cdamp_Passive",{"$f":"L4","v":3.8999999999999999E-4},{"$f":"R28*1000000","v":390},"uF"]
[39,0,0,0,0,0,0,0,0,0,0,0,0,0]
[47,0,0,0,0,0,0,0,0,0,0,0,0,0]
[56,0,0,0,0,0,0,0,0,0,0,0,0,0]
[68,0,0,0,0,0,0,0,0,0,0,0,0,0,null,null,"Rc1",{"$f":"S7/1000&\" kΩ\"","v":"1.96 kΩ"},{"$f":"S7/1000","v":1.96},"kΩ"]
[82,0,0,0,0,0,0,0,0,0,0,0,0,0,null,null,"Cc1",{"$f":"C4*1000000000&\" nF\"","v":"15 nF"},{"$f":"C4*1000000000","v":14.999999999999998},"nF"]
[{"$f":"A22*10","v":100},0,0,0,0,0,0,0,0,0,0,0,0,0,null,null,"Cc2",{"$f":"D4*1000000000000&\" pF\"","v":"470 pF"},{"$f":"D4*1000000000000","v":470.00000000000006},"pF"]
[{"$f":"A23*10","v":120},0,0,0,0,0,0,0,0,0,0,0,0,0]
[150,0,0,0,0,0,0,0,0,0,0,0,0,0,null,null,"Rc2",{"$f":"S8/1000&\" kΩ\"","v":{"$error":"#NUM!"}},{"$f":"S8/1000","v":{"$error":"#NUM!"}},"kΩ"]
[180,0,0,0,0,0,0,0,0,0,0,0,0,0,null,null,"Cc3",{"$f":"I4*1000000000&\" nF\"","v":"0 nF"},{"$f":"I4*1000000000","v":0},"nF"]
[220,0,0,0,0,0,0,0,0,0,0,0,0,0,null,null,"Cc4",{"$f":"J4*1000000000000&\" pF\"","v":"0 pF"},{"$f":"J4*1000000000000","v":0},"pF"]
[270,0,{"$f":"IF(IF((C$3*10^12-$A40)*(C$3*10^12-$A39)*-1<0,0,1)*IF(ABS(C$3*10^12-$A40)>(C$3*10^12-$A39),$A39,$A40)=C40,0,IF((C$3*10^12-$A40)*(C$3*10^12-$A39)*-1<0,0,1)*IF(ABS(C$3*10^12-$A40)>(C$3*10^12-$A39),$A39,$A40))","v":0},0,0,0,0,0,0,0,0,0,0,0]
[330,0,0,0,0,0,0,0,0,0,0,0,0,0,null,null,"Rent",{"$f":"'Variable Management'!B185/1000","v":499.99999999999994},{"$f":"IF(R40>(INT(0.5+100*POWER(10,IF(96*(LOG(R40)-INT(LOG(R40)))-ROUND(96*(LOG(R40)-INT(LOG(R40))),0)<0,ROUND(96*(LOG(R40)-INT(LOG(R40))),0)-1,ROUND(96*(LOG(R40)-INT(LOG(R40))),0))/96))*POWER(10,INT(LOG(R40))-2)+INT(0.5+100*POWER(10,(IF(96*(LOG(R40)-INT(LOG(R40)))-ROUND(96*(LOG(R40)-INT(LOG(R40))),0)<0,ROUND(96*(LOG(R40)-INT(LOG(R40))),0)-1,ROUND(96*(LOG(R40)-INT(LOG(R40))),0))+1)/96))*POWER(10,INT(LOG(R40))-2))/2,INT(0.5+100*POWER(10,(IF(96*(LOG(R40)-INT(LOG(R40)))-ROUND(96*(LOG(R40)-INT(LOG(R40))),0)<0,ROUND(96*(LOG(R40)-INT(LOG(R40))),0)-1,ROUND(96*(LOG(R40)-INT(LOG(R40))),0))+1)/96))*POWER(10,INT(LOG(R40))-2),INT(0.5+100*POWER(10,IF(96*(LOG(R40)-INT(LOG(R40)))-ROUND(96*(LOG(R40)-INT(LOG(R40))),0)<0,ROUND(96*(LOG(R40)-INT(LOG(R40))),0)-1,ROUND(96*(LOG(R40)-INT(LOG(R40))),0))/96))*POWER(10,INT(LOG(R40))-2))","v":499},"kΩ"]
[390,0,0,0,0,0,0,0,0,0,0,0,0,0,null,null,"Renb",{"$f":"'Variable Management'!B186/1000","v":14.705882352941174},{"$f":"IF(R41>(INT(0.5+100*POWER(10,IF(96*(LOG(R41)-INT(LOG(R41)))-ROUND(96*(LOG(R41)-INT(LOG(R41))),0)<0,ROUND(96*(LOG(R41)-INT(LOG(R41))),0)-1,ROUND(96*(LOG(R41)-INT(LOG(R41))),0))/96))*POWER(10,INT(LOG(R41))-2)+INT(0.5+100*POWER(10,(IF(96*(LOG(R41)-INT(LOG(R41)))-ROUND(96*(LOG(R41)-INT(LOG(R41))),0)<0,ROUND(96*(LOG(R41)-INT(LOG(R41))),0)-1,ROUND(96*(LOG(R41)-INT(LOG(R41))),0))+1)/96))*POWER(10,INT(LOG(R41))-2))/2,INT(0.5+100*POWER(10,(IF(96*(LOG(R41)-INT(LOG(R41)))-ROUND(96*(LOG(R41)-INT(LOG(R41))),0)<0,ROUND(96*(LOG(R41)-INT(LOG(R41))),0)-1,ROUND(96*(LOG(R41)-INT(LOG(R41))),0))+1)/96))*POWER(10,INT(LOG(R41))-2),INT(0.5+100*POWER(10,IF(96*(LOG(R41)-INT(LOG(R41)))-ROUND(96*(LOG(R41)-INT(LOG(R41))),0)<0,ROUND(96*(LOG(R41)-INT(LOG(R41))),0)-1,ROUND(96*(LOG(R41)-INT(LOG(R41))),0))/96))*POWER(10,INT(LOG(R41))-2))","v":14.700000000000001},"kΩ"]
[470,0,0,470,0,0,0,0,0,0,0,0,0,0]
[560,0,0,0,0,0,0,0,0,0,0,0,{"$f":"IF(IF((M$3*10^12-$A44)*(M$3*10^12-$A43)*-1<0,0,1)*IF(ABS(M$3*10^12-$A44)>(M$3*10^12-$A43),$A43,$A44)=M44,0,IF((M$3*10^12-$A44)*(M$3*10^12-$A43)*-1<0,0,1)*IF(ABS(M$3*10^12-$A44)>(M$3*10^12-$A43),$A43,$A44))","v":0},0]
[680,0,0,0,0,0,0,0,0,0,0,0,0,0]
[{"$f":"A33*10","v":820},0,0,0,0,0,0,0,0,0,0,0,0,0]
[1000,0,0,0,0,0,0,0,0,0,0,0,0,0]
[1200,0,0,0,0,0,0,0,0,0,0,0,0,0]
[1500,0,0,0,0,0,0,0,0,0,0,0,0,0]
[1800,0,0,0,0,0,0,2200,0,0,0,0,0,0]
[2200,0,0,0,0,0,0,0,0,0,0,0,0,0]
[2700,0,0,0,0,0,0,0,0,0,0,0,0,0]
[3300,0,0,0,0,0,0,0,0,0,0,0,0,0]
[3900,0,0,0,0,0,0,0,0,0,0,0,0,0]
[4700,0,0,0,0,0,0,0,0,0,0,0,0,0]
[5600,0,0,0,0,0,0,0,0,0,0,0,0,0]
[6800,0,0,0,0,0,0,0,0,0,0,0,0,0]
[8200,0,0,0,0,0,0,0,0,0,0,0,0,0]
[10000,0,0,0,0,0,0,0,0,0,0,0,0,0]
[12000,0,15000,0,0,0,0,0,0,0,0,0,{"$f":"IF(IF((M$3*10^12-$A60)*(M$3*10^12-$A59)*-1<0,0,1)*IF(ABS(M$3*10^12-$A60)>(M$3*10^12-$A59),$A59,$A60)=M60,0,IF((M$3*10^12-$A60)*(M$3*10^12-$A59)*-1<0,0,1)*IF(ABS(M$3*10^12-$A60)>(M$3*10^12-$A59),$A59,$A60))","v":0},0]
[15000,0,0,0,0,0,0,0,0,0,0,0,0,0]
[18000,0,0,0,0,0,0,0,0,0,0,0,0,0]
[22000,0,0,0,0,0,0,0,0,0,0,0,0,0]
[27000,0,0,0,0,0,0,0,0,0,0,0,0,0]
[33000,0,0,0,0,0,0,0,0,0,0,0,0,0]
[39000,0,0,0,0,0,0,0,0,0,0,0,0,0]
[47000,0,0,0,0,0,0,0,0,0,0,0,0,0]
[56000,0,0,0,0,0,0,0,0,0,0,0,0,0]
[68000,0,0,0,0,0,0,0,0,0,0,0,0,0]
[82000,0,0,0,0,0,0,0,0,{"$f":"IF(IF((J$3*10^12-$A70)*(J$3*10^12-$A69)*-1<0,0,1)*IF(ABS(J$3*10^12-$A70)>(J$3*10^12-$A69),$A69,$A70)=J70,0,IF((J$3*10^12-$A70)*(J$3*10^12-$A69)*-1<0,0,1)*IF(ABS(J$3*10^12-$A70)>(J$3*10^12-$A69),$A69,$A70))","v":0},0,0,0,0]
[100000,0,0,{"$f":"IF(IF((D$3*10^12-$A71)*(D$3*10^12-$A70)*-1<0,0,1)*IF(ABS(D$3*10^12-$A71)>(D$3*10^12-$A70),$A70,$A71)=D71,0,IF((D$3*10^12-$A71)*(D$3*10^12-$A70)*-1<0,0,1)*IF(ABS(D$3*10^12-$A71)>(D$3*10^12-$A70),$A70,$A71))","v":0},0,0,0,0,0,0,0,0,0,0]
[120000,{"$f":"IF(IF((B$3*10^12-$A72)*(B$3*10^12-$A71)*-1<0,0,1)*IF(ABS(B$3*10^12-$A72)>(B$3*10^12-$A71),$A71,$A72)=B72,0,IF((B$3*10^12-$A72)*(B$3*10^12-$A71)*-1<0,0,1)*IF(ABS(B$3*10^12-$A72)>(B$3*10^12-$A71),$A71,$A72))","v":0},{"$f":"IF(IF((C$3*10^12-$A72)*(C$3*10^12-$A71)*-1<0,0,1)*IF(ABS(C$3*10^12-$A72)>(C$3*10^12-$A71),$A71,$A72)=C72,0,IF((C$3*10^12-$A72)*(C$3*10^12-$A71)*-1<0,0,1)*IF(ABS(C$3*10^12-$A72)>(C$3*10^12-$A71),$A71,$A72))","v":0},0,0,{"$f":"IF(IF((F$3*10^12-$A72)*(F$3*10^12-$A71)*-1<0,0,1)*IF(ABS(F$3*10^12-$A72)>(F$3*10^12-$A71),$A71,$A72)=F72,0,IF((F$3*10^12-$A72)*(F$3*10^12-$A71)*-1<0,0,1)*IF(ABS(F$3*10^12-$A72)>(F$3*10^12-$A71),$A71,$A72))","v":0},{"$f":"IF(IF((G$3*10^12-$A72)*(G$3*10^12-$A71)*-1<0,0,1)*IF(ABS(G$3*10^12-$A72)>(G$3*10^12-$A71),$A71,$A72)=G72,0,IF((G$3*10^12-$A72)*(G$3*10^12-$A71)*-1<0,0,1)*IF(ABS(G$3*10^12-$A72)>(G$3*10^12-$A71),$A71,$A72))","v":0},{"$f":"IF(IF((H$3*10^12-$A72)*(H$3*10^12-$A71)*-1<0,0,1)*IF(ABS(H$3*10^12-$A72)>(H$3*10^12-$A71),$A71,$A72)=H72,0,IF((H$3*10^12-$A72)*(H$3*10^12-$A71)*-1<0,0,1)*IF(ABS(H$3*10^12-$A72)>(H$3*10^12-$A71),$A71,$A72))","v":0},{"$f":"IF(IF((I$3*10^12-$A72)*(I$3*10^12-$A71)*-1<0,0,1)*IF(ABS(I$3*10^12-$A72)>(I$3*10^12-$A71),$A71,$A72)=I72,0,IF((I$3*10^12-$A72)*(I$3*10^12-$A71)*-1<0,0,1)*IF(ABS(I$3*10^12-$A72)>(I$3*10^12-$A71),$A71,$A72))","v":0},0,0,0,0,0]
[150000,0,0,0,0,0,0,0,0,0,0,0,0,0]
[180000,0,0,0,0,0,0,0,0,0,0,0,0,0]
[220000,0,0,0,0,0,0,0,0,0,0,0,0,0]
[270000,0,0,0,0,0,0,0,0,0,0,0,0,330000]
[330000,0,0,0,0,0,0,0,0,0,0,0,0,0]
[390000,0,0,0,0,0,0,0,0,0,0,0,0,0]
[470000,0,0,0,0,0,470000,0,0,0,0,0,0,0]
[560000,0,0,0,0,0,0,0,0,0,0,0,0,0]
[680000,0,0,0,0,0,0,0,0,0,0,0,0,0]
[820000,0,0,0,0,0,0,0,0,0,0,0,1000000,0]
[1000000,0,0,0,0,0,0,0,0,0,0,0,0,0]
[1200000,0,0,0,0,0,0,0,0,0,0,0,0,0]
[1500000,0,0,0,0,0,0,0,0,0,0,0,0,0]
[1800000,0,0,0,0,0,0,0,0,0,0,{"$f":"IF(IF((L$3*10^12-$A86)*(L$3*10^12-$A85)*-1<0,0,1)*IF(ABS(L$3*10^12-$A86)>(L$3*10^12-$A85),$A85,$A86)=L86,0,IF((L$3*10^12-$A86)*(L$3*10^12-$A85)*-1<0,0,1)*IF(ABS(L$3*10^12-$A86)>(L$3*10^12-$A85),$A85,$A86))","v":0},0,0]
[2200000,0,0,0,0,0,0,0,0,0,0,0,0,0]
[2700000,0,0,0,0,0,0,0,0,0,0,0,0,0]
[3300000,0,0,0,0,0,0,0,0,0,0,0,0,0]
[3900000,0,0,0,0,0,0,0,0,0,0,0,0,0]
[4700000,0,0,0,0,0,0,0,0,0,0,0,0,0]
[5600000,0,0,0,0,0,0,0,0,0,0,0,0,0]
[6800000,0,0,0,0,0,0,0,0,0,0,0,0,0]
[8200000,0,0,0,0,0,0,0,0,0,0,0,0,0]
[10000000,0,0,0,0,0,0,0,0,0,0,0,0,0]
[12000000,0,0,0,0,0,0,0,0,0,0,0,0,0]
[15000000,0,0,0,0,0,0,0,0,0,0,0,0,0]
[18000000,0,0,0,0,0,0,0,0,0,0,0,0,0]
[22000000,0,0,0,0,0,0,0,0,0,0,0,0,0]
[{"$f":"A87*10","v":27000000},0,0,0,0,0,0,0,0,0,0,0,0,0]
[33000000,0,0,0,0,0,0,0,0,0,0,0,0,0]
[39000000,0,0,0,0,0,0,0,0,0,0,0,0,0]
[47000000,0,0,0,0,0,0,0,0,0,0,0,0,0]
[56000000,0,0,0,0,{"$f":"IF(IF((F$3*10^12-$A104)*(F$3*10^12-$A103)*-1<0,0,1)*IF(ABS(F$3*10^12-$A104)>(F$3*10^12-$A103),$A103,$A104)=F104,0,IF((F$3*10^12-$A104)*(F$3*10^12-$A103)*-1<0,0,1)*IF(ABS(F$3*10^12-$A104)>(F$3*10^12-$A103),$A103,$A104))","v":0},{"$f":"IF(IF((G$3*10^12-$A104)*(G$3*10^12-$A103)*-1<0,0,1)*IF(ABS(G$3*10^12-$A104)>(G$3*10^12-$A103),$A103,$A104)=G104,0,IF((G$3*10^12-$A104)*(G$3*10^12-$A103)*-1<0,0,1)*IF(ABS(G$3*10^12-$A104)>(G$3*10^12-$A103),$A103,$A104))","v":0},{"$f":"IF(IF((H$3*10^12-$A104)*(H$3*10^12-$A103)*-1<0,0,1)*IF(ABS(H$3*10^12-$A104)>(H$3*10^12-$A103),$A103,$A104)=H104,0,IF((H$3*10^12-$A104)*(H$3*10^12-$A103)*-1<0,0,1)*IF(ABS(H$3*10^12-$A104)>(H$3*10^12-$A103),$A103,$A104))","v":0},{"$f":"IF(IF((I$3*10^12-$A104)*(I$3*10^12-$A103)*-1<0,0,1)*IF(ABS(I$3*10^12-$A104)>(I$3*10^12-$A103),$A103,$A104)=I104,0,IF((I$3*10^12-$A104)*(I$3*10^12-$A103)*-1<0,0,1)*IF(ABS(I$3*10^12-$A104)>(I$3*10^12-$A103),$A103,$A104))","v":0},0,0,0,0,0]
[68000000,0,0,0,0,0,0,0,0,0,0,0,0,0]
[82000000,0,0,0,0,0,0,0,0,0,100000000,0,0,0]
[100000000,0,0,0,100000000,0,0,0,0,0,0,0,0,0]
[120000000,0,0,0,0,0,0,0,0,0,0,0,0,0]
[150000000,0,0,0,0,0,0,0,0,0,0,0,0,0]
[180000000,0,0,0,0,220000000,0,0,0,0,0,0,0,0]
[220000000,0,0,0,0,0,0,0,0,0,0,0,0,0]
[270000000,0,0,0,0,0,0,0,0,0,0,0,0,0]
[330000000,0,0,0,0,0,0,0,0,0,0,0,0,0]
[390000000,0,0,0,0,0,0,0,0,0,0,390000000,0,0]
[470000000,0,0,0,0,0,0,0,0,0,0,0,0,0]
[560000000,0,0,0,0,0,0,0,0,0,0,0,0,0]
[680000000,0,0,0,0,0,0,0,0,0,0,0,0,0]
[820000000,0,0,0,0,0,0,0,0,0,0,0,0,0]
[1000000000,0,0,0,0,0,0,0,0,0,0,0,0,0]
[1200000000,0,0,0,0,0,0,0,0,0,0,0,0,0]
[1500000000,0,0,0,0,0,0,0,0,0,0,0,0,0]
[1800000000,0,0,0,0,0,0,0,0,0,0,0,0,0]
[2200000000,0,0,0,0,0,0,0,0,0,0,0,0,0]
[2700000000,0,0,0,0,0,0,0,0,0,0,0,0,0]
[3300000000,0,0,0,0,0,0,0,0,0,0,0,0,0]
[3900000000,0,0,0,0,0,0,0,0,0,0,0,0,0]
[4700000000,0,0,0,0,0,0,0,0,0,0,0,0,0]
[5600000000,0,0,0,0,0,0,0,0,0,0,0,0,0]
[6800000000,0,0,0,0,0,0,0,0,0,0,0,0,0]
[8200000000,0,0,0,0,0,0,0,0,0,0,0,0,0]
[10000000000,0,0,0,0,0,0,0,0,0,0,0,0,0]
[12000000000,0,0,0,0,0,0,0,0,0,0,0,0,0]
[15000000000,0,0,0,0,0,0,0,0,0,{"$f":"IF(IF((K$3*10^12-$A133)*(K$3*10^12-$A132)*-1<0,0,1)*IF(ABS(K$3*10^12-$A133)>(K$3*10^12-$A132),$A132,$A133)=K133,0,IF((K$3*10^12-$A133)*(K$3*10^12-$A132)*-1<0,0,1)*IF(ABS(K$3*10^12-$A133)>(K$3*10^12-$A132),$A132,$A133))","v":0},{"$f":"IF(IF((L$3*10^12-$A133)*(L$3*10^12-$A132)*-1<0,0,1)*IF(ABS(L$3*10^12-$A133)>(L$3*10^12-$A132),$A132,$A133)=L133,0,IF((L$3*10^12-$A133)*(L$3*10^12-$A132)*-1<0,0,1)*IF(ABS(L$3*10^12-$A133)>(L$3*10^12-$A132),$A132,$A133))","v":0},0,0]
[18000000000,0,0,0,0,0,0,0,0,{"$f":"IF(IF((J$3*10^12-$A134)*(J$3*10^12-$A133)*-1<0,0,1)*IF(ABS(J$3*10^12-$A134)>(J$3*10^12-$A133),$A133,$A134)=J134,0,IF((J$3*10^12-$A134)*(J$3*10^12-$A133)*-1<0,0,1)*IF(ABS(J$3*10^12-$A134)>(J$3*10^12-$A133),$A133,$A134))","v":0},0,0,{"$f":"IF(IF((M$3*10^12-$A134)*(M$3*10^12-$A133)*-1<0,0,1)*IF(ABS(M$3*10^12-$A134)>(M$3*10^12-$A133),$A133,$A134)=M134,0,IF((M$3*10^12-$A134)*(M$3*10^12-$A133)*-1<0,0,1)*IF(ABS(M$3*10^12-$A134)>(M$3*10^12-$A133),$A133,$A134))","v":0},{"$f":"IF(IF((N$3*10^12-$A134)*(N$3*10^12-$A133)*-1<0,0,1)*IF(ABS(N$3*10^12-$A134)>(N$3*10^12-$A133),$A133,$A134)=N134,0,IF((N$3*10^12-$A134)*(N$3*10^12-$A133)*-1<0,0,1)*IF(ABS(N$3*10^12-$A134)>(N$3*10^12-$A133),$A133,$A134))","v":0}]
[22000000000,0,0,0,{"$f":"IF(IF((E$3*10^12-$A135)*(E$3*10^12-$A134)*-1<0,0,1)*IF(ABS(E$3*10^12-$A135)>(E$3*10^12-$A134),$A134,$A135)=E135,0,IF((E$3*10^12-$A135)*(E$3*10^12-$A134)*-1<0,0,1)*IF(ABS(E$3*10^12-$A135)>(E$3*10^12-$A134),$A134,$A135))","v":0},0,0,0,0,0,0,0,{"$f":"IF(IF((M$3*10^12-$A135)*(M$3*10^12-$A134)*-1<0,0,1)*IF(ABS(M$3*10^12-$A135)>(M$3*10^12-$A134),$A134,$A135)=M135,0,IF((M$3*10^12-$A135)*(M$3*10^12-$A134)*-1<0,0,1)*IF(ABS(M$3*10^12-$A135)>(M$3*10^12-$A134),$A134,$A135))","v":0},{"$f":"IF(IF((N$3*10^12-$A135)*(N$3*10^12-$A134)*-1<0,0,1)*IF(ABS(N$3*10^12-$A135)>(N$3*10^12-$A134),$A134,$A135)=N135,0,IF((N$3*10^12-$A135)*(N$3*10^12-$A134)*-1<0,0,1)*IF(ABS(N$3*10^12-$A135)>(N$3*10^12-$A134),$A134,$A135))","v":0}]
[27000000000,{"$f":"IF(IF((B$3*10^12-$A136)*(B$3*10^12-$A135)*-1<0,0,1)*IF(ABS(B$3*10^12-$A136)>(B$3*10^12-$A135),$A135,$A136)=B136,0,IF((B$3*10^12-$A136)*(B$3*10^12-$A135)*-1<0,0,1)*IF(ABS(B$3*10^12-$A136)>(B$3*10^12-$A135),$A135,$A136))","v":0},{"$f":"IF(IF((C$3*10^12-$A136)*(C$3*10^12-$A135)*-1<0,0,1)*IF(ABS(C$3*10^12-$A136)>(C$3*10^12-$A135),$A135,$A136)=C136,0,IF((C$3*10^12-$A136)*(C$3*10^12-$A135)*-1<0,0,1)*IF(ABS(C$3*10^12-$A136)>(C$3*10^12-$A135),$A135,$A136))","v":0},0,0,0,0,0,0,0,0,0,0,0]
[33000000000,0,0,0,0,0,0,0,0,0,0,0,0,0]
[39000000000,0,0,0,0,0,0,0,0,0,0,0,0,0]
[47000000000,0,0,0,0,0,0,0,0,0,0,0,0,0]
[56000000000,0,0,0,0,0,0,0,0,0,0,0,0,0]
[68000000000,0,0,0,0,0,0,0,0,0,0,0,0,0]
[82000000000,0,0,0,0,0,0,0,0,0,0,0,0,0]
[100000000000,0,0,0,0,0,0,0,0,0,0,0,0,0]
[120000000000,0,0,0,0,0,0,0,0,0,0,0,0,0]
[150000000000,0,0,0,0,0,0,0,0,0,0,0,0,0]
[180000000000,0,0,0,0,0,0,0,0,0,0,0,0,0]
[220000000000,0,0,0,0,0,0,0,0,0,0,0,0,0]
[270000000000,0,0,0,0,0,0,0,0,0,0,0,0,0]
[330000000000,0,0,0,0,0,0,0,0,0,0,0,0,0]
[390000000000,0,0,0,0,0,0,0,0,0,0,0,0,0]
[470000000000,0,0,0,0,0,0,0,0,0,0,0,0,0]
[560000000000,0,0,0,0,0,0,0,0,0,0,0,0,0]
[680000000000,0,0,0,0,0,0,0,0,0,0,0,0,0]
[820000000000,0,0,0,0,0,0,0,0,0,0,0,0,0]
[1000000000000,0,0,0,0,0,0,0,0,0,0,0,0,0]
[1200000000000,0,0,0,0,0,0,0,0,0,0,0,0,0]
[1500000000000,0,0,0,0,0,0,0,0,0,0,0,0,0]
[1800000000000,0,0,0,0,0,0,0,0,0,0,0,0,0]
[2200000000000,0,0,0,0,0,0,0,0,0,0,0,0,0]
[2700000000000,2700000000000,2700000000000,2700000000000,2700000000000,2700000000000,2700000000000,2700000000000,2700000000000,2700000000000,2700000000000,2700000000000,2700000000000,2700000000000]

{"sheet":"Snubber","index":13,"n_rows":6,"n_cols":5,"rows_kept":6,"cut":false,"hidden":true,"merged":[]}
[null,null,"UNITS","STD UNITS"]
["Frequency of Ringing",85,"MHz",{"$f":"B2*1000000","v":85000000},"Hz"]
["SW capacitance",3000,"pF",{"$f":"B3*0.000000000001","v":3E-9},"F"]
["Lpar",{"$f":"1000000000*1/((D2*2*3.14159)^2*D3)","v":1.1686430773614742},"nH",{"$f":"B4/1000000000","v":1.1686430773614743E-9},"H"]
["Csnub",{"$f":"4*B3","v":12000},"pF",{"$f":"B5*0.000000000001","v":1.2E-8},"F"]
["Rsnub",{"$f":"SQRT(D4/D3)","v":0.62413755891936573},"Ω",{"$f":"B6","v":0.62413755891936573},"Ω"]

{"sheet":"Parallel Output Caps","index":14,"n_rows":17,"n_cols":5,"rows_kept":17,"cut":false,"hidden":true,"merged":[]}
[]
[]
[]
["Fsw",{"$f":"Fsw","v":300000}]
[]
["C1",20,"uF",{"$f":"B6/1000000","v":2.0000000000000002E-5},"F"]
["R1",0.5,"mOhms",{"$f":"B7/1000","v":5.0000000000000001E-4},"Ohms"]
[]
["C2",68,"uF",{"$f":"B9/1000000","v":6.7999999999999999E-5},"F"]
["R2",20,"mOhms",{"$f":"B10/1000","v":0.02},"Ohms"]
[]
[]
["I1 ",{"$f":"(D6/(D6+D9))*SQRT((D10*D9*B4)^2+1)/SQRT((((D7+D10)*D6*D9/(D9+D6))*B4)^2+1)","v":0.2443600307654302},"%"]
["I2 ",{"$f":"1-B13","v":0.75563996923456977},"%"]
[]
["I1 ",{"$f":"B13*(Iripple1/(2*SQRT(3)))","v":{"$error":"#NAME?"}},"A"]
["I2 ",{"$f":"B14*(Iripple1/(2*SQRT(3)))","v":{"$error":"#NAME?"}},"A"]