{"text_format":"1","workbook":"xlsx","n_sheets":10,"sheets":["Design Regulator","BOM & Schematic","EVM","Variable Mgmt","Schematic Mgmt","Efficiency Plots","PFM Efficiency","COT Efficiency","Standard Value Calculator","Ripple Injection"],"not_rendered":{"charts":23,"images":64,"macros":1,"external_links":0,"defined_names":235,"comments":3,"pivot_tables":0},"unopened":[],"bounds":{"document_bytes":16777216,"sheet_cells":100000,"rows_first":2000,"rows_last":500,"rows_between":2000,"halvings":0,"cell_chars":16384,"cell_head_chars":4096},"cells_cut":0,"cells_raw":0,"read":"whole","date_system":"1900"}

{"sheet":"Design Regulator","index":0,"n_rows":51,"n_cols":17,"rows_kept":51,"cut":false,"hidden":false,"merged":[[2,14,2,15],[0,0,0,16]]}
["                         LM5165 Low IQ DC/DC Converter Design Tool  "]
[null,null,null,null,null,null,null,null,null,null,null,null,null,null,"http://www.ti.com/product/lm5165"]
["About",null,"xx",null,null,"= Input Box",null,null,null,null,null,null,null,null,"Terms Of Use",null,"                "]
[]
["Step 1: Operating Specifications"]
[null,null,null,"Input Voltage - Min, VIN(min) ",6,"V"]
{"$rows_left_out":46}
{"sheet":"BOM & Schematic","index":1,"n_rows":50,"n_cols":17,"rows_kept":50,"cut":false,"hidden":false,"merged":[[45,7,45,9],[30,3,30,5],[29,3,29,5],[39,3,39,5],[36,3,36,5],[37,3,37,5],[35,3,35,5],[34,3,34,5],[33,3,33,5],[38,3,38,5],[40,3,40,5],[41,3,41,5],[42,3,42,5],[31,3,31,5],[32,3,32,5]]}
[]
[]
[]
[]
[]
[]
{"$rows_left_out":45}
{"sheet":"EVM","index":2,"n_rows":6,"n_cols":14,"rows_kept":6,"cut":false,"hidden":false,"merged":[[0,0,0,16]]}
[" LM5165 Low IQ DC/DC Converter Design Tool"]
[]
[]
[]
[]
[null,"LM5165EVM-HD PCB Design, 0.6\" x 0.5\" (15.2mm x 12.7mm)",null,null,null,null,null,null,null,null,null,null,null,"LM5165EVM-HD 3D image - minimum solution size denoted by yellow border"]
{"$rows_left_out":1}
{"sheet":"Variable Mgmt","index":3,"n_rows":305,"n_cols":21,"rows_kept":305,"cut":false,"hidden":true,"merged":[[4,4,4,7],[0,0,0,8]]}
["EXCEL Variables Names/Calculations"]
[null,"Input from user ="]
[null,"Output ="]
[null,"Constant"]
["Variable Name","Value","STD Units",null,"Notes",null,null,null,"Iteration"]
["Step 1: Operational Specs"]
{"$rows_left_out":300}
{"sheet":"Schematic Mgmt","index":4,"n_rows":2,"n_cols":1,"rows_kept":2,"cut":false,"hidden":true,"merged":[]}
[]
[{"$f":"'Variable Mgmt'!K27","v":"SCH_COT_VOUTAdj_UVLOInt_SSAdj_IlimGND"}]

{"sheet":"Efficiency Plots","index":5,"n_rows":2,"n_cols":1,"rows_kept":2,"cut":false,"hidden":true,"merged":[]}
[]
[{"$f":"IF(PLOT_TYPE=1, \"EFF_LINEAR\", \"EFF_LOG\")","v":"EFF_LINEAR"}]

{"sheet":"PFM Efficiency","index":6,"n_rows":132,"n_cols":68,"rows_kept":132,"cut":false,"hidden":true,"merged":[[0,0,2,4],[1,6,1,7],[3,0,3,4]]}
["LM5165 (PFM) Efficiency Calculator"]
[null,null,null,null,null,null,"TERMS OF USE",null,null,null,null,null,null,null,null,{"$f":"Iripple","v":4.2242796969696975E-2},null,null,null,null,null,null,null,null,null,null,null,null,null,null,null,null,null,null,null,null,null,null,null,null,{"$f":"Ifb","v":9.8832335329341323E-6}]
[]
[null,null,null,null,null,null,null,"Currents",null,null,"Miscellaneous",null,null,null,null,null,"Inductor Loss",null,null,null,"Cout",null,null,"Cin",null,null,"High-side MOSFET Losses ",null,null,null,null,null,null,null,"Low-side MOSFET Losses ",null,null,"Diode",null,null,null,null,null,null,"RESULTS",null,null,null,null,null,null,null,null,null,null,null,null,null,null,null,null,null,null,null,null,"Consolidated Results"]
["Input Parameters",null,null,null,null,null,null,"Step","Iout (A)","Ripple Current pk-pk (A)","Input Current (A)","Off Time (sec)","Burst Mode Low Freq Component (Hz)","Output Charge Time (sec)","Output Discharge Time (sec)","Burst Frequency Duty Cycle","Irms (A)","Inductor DCR Loss @ 25°C (W)","Inductor Core Loss  (W)","Inductor Total Loss (W)","Irms (A)","Cout ESR Loss (W)","Total Cout Loss (W)","Irms (A)","Cin ESR Loss (W)","Total Cin Loss (W)","Irms (A)","Rdson HS Loss @ 25°C (W)","HS Gate Qg Loss (W)     ","SW Rise Time (ns)","SW Fall Time (ns)","HS Switching  Loss (W)","Coss Loss (W)","Total HS FET Loss (W)","Irms (A)","Rdson LS Loss @ 25°C (W)","LS Gate Qg Loss (W)","Leakage Loss (W)","DeadTime Loss @ 25°C (W)","Total LS FET Loss (W)","Quiescent Loss (W)","LDO + Quiescent Loss (W)","Total Gate Drive Loss (W)","Total Power Loss in IC (W)","Total Converter Power Loss (W)","Pout (W)","EFF (%)","High-side MOSFET Rdson %","Low-side MOSFET Rdson %","Gate Drive (Qg) Loss from Vin %","High-side MOSFET Switching Loss %","Leakage Loss %","Low-side MOSFET Deadtime Loss %","Inductor Cu Loss %","Inductor Core Loss %","Cin Cout ESR %","Quiescent Current Loss %","Total Loss %","Overall Eff (%)","Overall Eff","Current (mA)","Keep for \"previous\" data series","Keep for \"previous\" data series","Burst Mode Frequency (kHz)",null,"Total Power Loss in IC (mW)","LDO + Quiescent Loss (mW)","Total Inductor Loss (mW)"]
["Design","Input Value","Units","Std Units","Description",null,null,0.1,{"$f":"IF(PLOT_TYPE=1, H6/100*Iout_maxload_PFM, min_I*EXP(H6*rr/100))","v":1.1E-4},{"$f":"IripplePFM","v":0.24305499999999999},{"$f":"I6*D*P6","v":2.8682861132699138E-8},{"$f":"OffTime","v":1.5450797974779576E-5},{"$f":"1/(N6+O6)","v":40.717846796258861},{"$f":"Cout*Vout_hys/(Ioutmax-I6)","v":2.197749871643684E-5},{"$f":"Cout*Vout_hys/I6","v":2.4537277930573101E-2},{"$f":"N6/(N6+O6)","v":8.9487642570085105E-4},{"$f":"IripplePFM/SQRT(3)*SQRT(P6)","v":4.1978359827840551E-3},{"$f":"Q6^2*Rdcr","v":5.2865480815069716E-6},{"$f":"P6*Fsw^2.5*(IripplePFM/2)^2.5*k_core","v":1.0376921619663318E-7},{"$f":"R6+S6","v":5.3903172977036051E-6},{"$f":"SQRT((((I6*(1-P6)/P6)^2+Ilim^2/12)*P6)+I6^2*(1-P6))","v":4.2199889922601985E-3},{"$f":"RCoutEsr*U6^2","v":2.6712460642195872E-8},{"$f":"V6","v":2.6712460642195872E-8},{"$f":"SQRT((K6^2*(1-D)+(K6-Ilim)^2*D/3))*P6+(K6^2*(1-P6))","v":6.6961921443399363E-5},{"$f":"RCinEsr*X6^2","v":1.3451696770175963E-11},{"$f":"Y6","v":1.3451696770175963E-11},{"$f":"Ilim*SQRT(P6*D/3)","v":2.2384449860957329E-3},{"$f":"RdsonTop*AA6^2","v":1.0021271911554251E-5},{"$f":"QgTop*P6*Vdd*Fsw","v":3.6937304425328488E-7},20,10,{"$f":"Vin*Ilim*Tf/2*Fsw*P6","v":1.1824862390028495E-6},{"$f":"Coss*Vin^2*Fsw*P6/2","v":1.0342445239091977E-7},{"$f":"AB6+AF6+AG6","v":1.130718260294802E-5},{"$f":"Ilim*SQRT(P6*(1-D)/3)","v":3.490746685655069E-3},{"$f":"RdsonBot*AI6^2","v":1.2185312423411849E-5},{"$f":"QgBot*P6*Vdd*Fsw","v":1.5390543510553537E-7},{"$f":"Vin*Idss","v":0},{"$f":"dead1*P6*Ilim*((Ilim)*BDserR+VSD)*Fsw","v":2.7198661604864287E-7},{"$f":"AJ6+AL6+AM6","v":1.2457299039460493E-5},{"$f":"Vin*(Iq_active*(N6+Tsleep)+Iq_sleep*(O6-Tsleep))/(N6+O6)+Vout*Ifb/0.7","v":1.7479018259231618E-4},{"$f":"(Vin-Vdd)*Fsw*(QgBot+QgTop)*P6+AO6","v":1.7552277246341854E-4},{"$f":"AC6+AK6","v":5.232784793588202E-7},{"$f":"AH6+AN6+AP6+AQ6","v":1.9981053258518586E-4},{"$f":"SUM(T6,W6,Z6,AR6)","v":2.0522757579522844E-4},{"$f":"Vout*I6","v":3.6311000000000004E-4},{"$f":"100*AT6/(AT6+AS6)","v":63.889845659409339},{"$f":"AB6/($AT6+$AS6)","v":1.7632604878416322E-2},{"$f":"AJ6/($AT6+$AS6)","v":2.1440272370451548E-2},{"$f":"Vin*Fsw*P6*(QgBot+QgTop)/($AT6+$AS6)","v":2.2097225380601211E-3},{"$f":"(AF6+AG6)/($AT6+$AS6)","v":2.2625825674019513E-3},{"$f":"AL6/(AS6+AT6)","v":0},{"$f":"AM6/($AT6+$AS6)","v":4.7856525352573098E-4},{"$f":"R6/($AT6+$AS6)","v":9.3017746963324315E-3},{"$f":"S6/($AT6+$AS6)","v":1.8258376819698638E-4},{"$f":"(W6+Z6)/($AT6+$AS6)","v":4.7024714671681978E-5},{"$f":"AO6/($AT6+$AS6)","v":0.30754641261884985},{"$f":"SUM(AV6:BE6)","v":0.36110154340590661},{"$f":"AU6/100","v":0.63889845659409339},{"$f":"BG6*100","v":63.889845659409339},{"$f":"I6*1000","v":0.11},47.143854993629823,{"$f":"BJ6/100","v":0.47143854993629825},17.13727728426694,null,{"$f":"1000*AR6","v":0.19981053258518586},{"$f":"1000*AP6","v":0.17552277246341855},{"$f":"1000*T6","v":5.3903172977036052E-3}]
{"$rows_left_out":127}
{"sheet":"COT Efficiency","index":7,"n_rows":110,"n_cols":78,"rows_kept":110,"cut":false,"hidden":true,"merged":[[0,0,2,4],[1,6,1,7],[3,0,3,4],[3,10,3,17]]}
["LM5165 (COT) Efficiency Calculator"]
[null,null,null,null,null,null,"TERMS OF USE",null,null,null,null,null,null,null,null,null,null,null,null,null,null,null,null,null,null,null,null,null,1.9257738538542499E-2,7.417209872377299E-4,1.2403450565440797E-3,20,7.1523178807947021,0,8.3629954314142624E-4,1.5780205303791562E-3,null,{"$f":"Ifb","v":9.8832335329341323E-6}]
[]
[null,null,null,null,null,null,null,"Currents",null,null,"Miscellaneous",null,null,null,null,null,null,null,"Inductor",null,null,null,"Cout",null,null,"Cin",null,null,"High-side MOSFET Losses ",null,null,null,null,null,null,null,"Low-side MOSFET Losses ",null,null,"Diode",null,null,null,null,null,null,"RESULTS"]
["Input Parameters",null,null,null,null,null,null,"Step","Iout (A)","Ripple Current pk-pk (A)","Peak Current (A)","Valley Current (A)","Off Time (sec)","Duty Cycle","Switching Frequency (Hz)","Active Mode Duration (sec)","Sleep Mode Duration (sec)","Operating Quiescent Current (A)","Irms (A)","Inductor DCR Loss @ 25°C (W)","Inductor Core Loss  (W)","Total Inductor Loss (W)","Irms (A)","Cout ESR Loss (W)","Total Cout Loss (W)","Irms (A)","Cin ESR Loss (W)","Total Cin Loss (W)","Irms (A)","Rdson HS Loss @ 25°C (W)","HS Gate Qg Loss (W)     ","SW Rise Time (ns)","SW Fall Time (ns)","HS Switching  Loss (W)","Coss Loss (W)","Total HS FET Loss (W)","Irms (A)","Rdson LS Loss @ 25°C (W)","LS Gate Qg Loss (W)","Reverse Recovery & Leakage Losses","DeadTime Loss @ 25°C (W)","Total LS FET Loss (W)","Quiescent Loss (W)","LDO + Quiescent Loss (W)","Total Gate Drive Loss (W)","Total Power Loss in IC (W)","Total Converter Power Loss (W)","Pout (W)","EFF (%)","High-side MOSFET Rdson %","Low-side MOSFET Rdson %","Gate Drive (Qg) Loss from Vin %","High-side MOSFET Switching Loss %","Reverse Recovery & Leakage Loss %","Deadtime Loss %","Inductor Cu Loss %","Inductor Core Loss %","Cin Cout ESR %","Quiescent Current Loss %","Total Loss %","Overall Eff %","Overall Eff","Current (mA)","Keep for \"previous\" data series","Keep for \"previous\" data series","Frequency (kHz)",null,"Coss",null,"Total Power Loss in IC (mW)","LDO + Quiescent Loss (mW)","Total Inductor Loss (mW)",null,null,"COT / PFM Overall Eff","COT / PFM Total Power Loss in IC (mW)","COT / PFM LDO + Quiescent Loss (mW)","COT / PFM Total Inductor Loss (mW)"]
["Design","Input Value","Units","Std Units","Description",null,null,0.1,{"$f":"IF(PLOT_TYPE=1, H6/100*Iout_maxload_COT, min_I*EXP(H6*rr/100))","v":1.1E-4},{"$f":"IF(I6<Icrit, (Vin-(Rdcr+RdsonTop)*Iripple/2-Vout)/L*OnTime, (Vin-(Rdcr+RdsonTop)*I6-Vout)/L*OnTime)","v":4.3265210615581043E-2},{"$f":"IF(I6<Icrit, (Vin-(Rdcr+RdsonTop)*Iripple/2-Vout)/L*OnTime, I6+((Vin-(Rdcr+RdsonTop)*J6-Vout)/L*OnTime)/2)","v":4.3265210615581043E-2},{"$f":"IF(I6<Icrit, 0, I6-((Vin-(Rdcr+RdsonTop)*K6-Vout)/L*OnTime)/2)","v":0},{"$f":"IF(I6<Icrit, L*J6/(Vout+J6/2*(RdsonBot+Rdcr)), L*J6/(Vout+I6*(RdsonBot+Rdcr)))","v":2.8591157756416169E-6},{"$f":"OnTime*O6","v":1.4131015179130863E-3},{"$f":"IF(I6<Icrit,I6/((OnTime+M6)*J6/2),1/(OnTime+M6))","v":1284.2485773217988},{"$f":"IF(1/O6-OnTime-M6>Tsleep, OnTime+M6+Tsleep, 1/O6)","v":4.9594491089749503E-6},{"$f":"IF(1/O6-OnTime-M6>Tsleep, 1/O6-OnTime-M6-Tsleep, 0)","v":7.7370600371591558E-4},{"$f":"P6*O6*Iq_active+Q6*O6*Iq_sleep","v":1.2343873401394021E-5},{"$f":"IF(I6<Icrit,Iripple*SQRT((OnTime+OffTime)*O6/3), SQRT(I6^2+Iripple^2/12))","v":1.7034840669976027E-3},{"$f":"S6^2*Rdcr","v":8.7055738995440781E-7},{"$f":"(O6/Fsw)*Fsw^2.5*(Iripple/2)^2.5*k_core","v":5.2039820054093663E-6},{"$f":"T6+U6","v":6.0745393953637743E-6},{"$f":"Iripple/SQRT(12)*SQRT((OnTime+M6)*O6)","v":8.6956884650259678E-4},{"$f":"RCoutEsr*W6^2","v":1.1342249682117851E-9},{"$f":"X6","v":1.1342249682117851E-9},{"$f":"SQRT($N6)*SQRT($I6^2*(1-N6)+(Iripple^2)/12)","v":4.5842296710483268E-4},{"$f":"RCinEsr*Z6^2","v":6.3045485030759551E-10},{"$f":"AA6","v":6.3045485030759551E-10},{"$f":"IF(I6<Icrit,Iripple*SQRT((OnTime)*O6/3), SQRT(OnTime*O6*(I6^2+Iripple^2/12)))","v":9.1680868757399586E-4},{"$f":"RdsonTop*AC6^2","v":1.6810763392223054E-6},{"$f":"QgTop*O6*Vdd","v":1.155823719589619E-5},20,{"$f":"IF(I6<Icrit, Csw*Vin/Iripple*1000000000, Csw*Vin/(I6+Iripple/2)*1000000000)","v":9.9425234626695893},{"$f":"IF(I6<Icrit, Vin*(I6+Iripple/2)*AG6/1000000000/2*O6, Vin*(I6-Iripple/2)*AF6/1000000000/2*O6+Vin*(I6+Iripple/2)*AG6/1000000000/2*O6)","v":1.626580530689335E-6},{"$f":"IF(I6<Icrit, Csw*(Vin)^2*O6/2, Csw*Vin^2*O6/2)","v":3.2363064148509331E-6},{"$f":"AD6+AH6+AI6","v":6.5439632847625733E-6},{"$f":"IF(I6<Icrit,Iripple*SQRT((OffTime)*O6/3), SQRT(OffTime*O6*(I6^2+Iripple^2/12)))","v":1.4357297088601114E-3},{"$f":"RdsonBot*AK6^2","v":2.0613197969035401E-6},{"$f":"QgBot*O6*Vdd","v":4.8159321649567459E-6},{"$f":"IF(I6<Icrit, Vin*Idss*N6, QrrBot*(I6-Iripple/2)/0.1*O6*Vin+Vin*Idss*N6)","v":0},{"$f":"IF(I6<Icrit, dead1*O6*(I6+Iripple/2)*((I6+Iripple/2)*BDserR+VSD), dead1*O6*(I6+Iripple/2)*((I6+Iripple/2)*BDserR+VSD)+dead2*O6*(I6-Iripple/2)*((I6-Iripple/2)*BDserR+VSD))","v":6.5613015015336183E-7},{"$f":"AL6+AN6+AO6","v":2.717449947056902E-6},{"$f":"Vin*R6+Vout*Ifb/0.7","v":1.9473298637703623E-4},{"$f":"(Vin-Vdd)*(O6*QgBot+O6*QgTop)+AQ6","v":2.1765682348223034E-4},{"$f":"AE6+AM6","v":1.6374169360852934E-5},{"$f":"AJ6+AP6+AR6+AS6","v":2.4329240607490275E-4},{"$f":"SUM(V6,Y6,AB6,AT6)","v":2.4936871015008503E-4},{"$f":"Vout*I6","v":3.6311000000000004E-4},{"$f":"AV6/(AV6+AU6)","v":0.59285326001130978},{"$f":"AD6/($AV6+$AU6)","v":2.7447098345840712E-3},{"$f":"AL6/($AV6+$AU6)","v":3.365537059073324E-3},{"$f":"Vin*O6*(QgBot+QgTop)/($AV6+$AU6)","v":6.4162240768201151E-2},{"$f":"AH6/($AV6+$AU6)","v":2.6557339932530045E-3},{"$f":"AN6/(AU6+AV6)","v":0},{"$f":"AO6/($AV6+$AU6)","v":1.0712701344224359E-3},{"$f":"T6/($AV6+$AU6)","v":1.4213675929096079E-3},{"$f":"U6/($AV6+$AU6)","v":8.4965924842255406E-3},{"$f":"(Y6+AB6)/($AV6+$AU6)","v":2.8812100555902653E-6},{"$f":"AQ6/($AV6+$AU6)","v":0.31794245767223128},{"$f":"AU6/($AV6+$AU6)","v":0.40714673998869022},{"$f":"AW6","v":0.59285326001130978},{"$f":"100*BI6","v":59.285326001130976},{"$f":"CHOOSE(MODE, I6*1000, 'PFM Efficiency'!BI6)","v":0.11},59.702372085750142,{"$f":"BL6/100","v":0.59702372085750144},{"$f":"O6/1000","v":1.2842485773217989},null,{"$f":"AI6/($AV6+$AU6)","v":5.2839492397342121E-3},null,{"$f":"1000*AT6","v":0.24329240607490274},{"$f":"1000*AR6","v":0.21765682348223034},{"$f":"1000*V6","v":6.0745393953637742E-3},null,null,{"$f":"IF(MODE=1, BJ6, 'PFM Efficiency'!BH6)","v":59.285326001130976},{"$f":"IF(MODE=1, BR6, 'PFM Efficiency'!BN6)","v":0.24329240607490274},{"$f":"IF(MODE=1, BS6, 'PFM Efficiency'!BO6)","v":0.21765682348223034},{"$f":"IF(MODE=1, BT6, 'PFM Efficiency'!BP6)","v":6.0745393953637742E-3}]
{"$rows_left_out":105}
{"sheet":"Standard Value Calculator","index":8,"n_rows":159,"n_cols":11,"rows_kept":159,"cut":false,"hidden":true,"merged":[]}
[]
["Capacitors","Css","Cout","Cin","Cb"]
["Inputs",{"$f":"Css","v":4.8599999999999998E-8},{"$f":"Cout","v":1E-4},{"$f":"Cin","v":4.6999999999999999E-6},{"$f":"Cb","v":0},null,null,"Resistors","inputs","Standard Result"]
["Standard Result",{"$f":"SUM(B6:B158)/1000000000000","v":4.6999999999999997E-8},{"$f":"SUM(C6:C158)/1000000000000","v":1E-4},{"$f":"SUM(D6:D158)/1000000000000","v":4.6999999999999999E-6},{"$f":"IF(E3=\"OPEN\",\"OPEN\",SUM(E6:E158)/1000000000000)","v":0},null,null,"Rt",{"$f":"Rt","v":82525},{"$f":"IF(I4>(INT(0.5+100*POWER(10,IF(96*(LOG(I4)-INT(LOG(I4)))-ROUND(96*(LOG(I4)-INT(LOG(I4))),0)<0,ROUND(96*(LOG(I4)-INT(LOG(I4))),0)-1,ROUND(96*(LOG(I4)-INT(LOG(I4))),0))/96))*POWER(10,INT(LOG(I4))-2)+INT(0.5+100*POWER(10,(IF(96*(LOG(I4)-INT(LOG(I4)))-ROUND(96*(LOG(I4)-INT(LOG(I4))),0)<0,ROUND(96*(LOG(I4)-INT(LOG(I4))),0)-1,ROUND(96*(LOG(I4)-INT(LOG(I4))),0))+1)/96))*POWER(10,INT(LOG(I4))-2))/2,INT(0.5+100*POWER(10,(IF(96*(LOG(I4)-INT(LOG(I4)))-ROUND(96*(LOG(I4)-INT(LOG(I4))),0)<0,ROUND(96*(LOG(I4)-INT(LOG(I4))),0)-1,ROUND(96*(LOG(I4)-INT(LOG(I4))),0))+1)/96))*POWER(10,INT(LOG(I4))-2),INT(0.5+100*POWER(10,IF(96*(LOG(I4)-INT(LOG(I4)))-ROUND(96*(LOG(I4)-INT(LOG(I4))),0)<0,ROUND(96*(LOG(I4)-INT(LOG(I4))),0)-1,ROUND(96*(LOG(I4)-INT(LOG(I4))),0))/96))*POWER(10,INT(LOG(I4))-2))","v":82500},"Ω"]
["(pF)"]
[0.47,{"$f":"IF(IF((B$3*10^12-$A7)*(B$3*10^12-$A6)*-1<0,0,1)*IF(ABS(B$3*10^12-$A7)>(B$3*10^12-$A6),$A6,$A7)=B7,0,IF((B$3*10^12-$A7)*(B$3*10^12-$A6)*-1<0,0,1)*IF(ABS(B$3*10^12-$A7)>(B$3*10^12-$A6),$A6,$A7))","v":0},0,0,0,null,null,"Rshunt",{"$f":"Rshunt","v":{"$error":"#NAME?"}},{"$error":"#NAME?"},"Ω"]
{"$rows_left_out":154}
{"sheet":"Ripple Injection","index":9,"n_rows":21,"n_cols":8,"rows_kept":21,"cut":false,"hidden":true,"merged":[]}
[]
[]
[]
[null,null,null,"RFB1",{"$f":"Rfb1_","v":210000},"W"]
[null,null,null,"RFB2",{"$f":"Rfb2_u","v":124000},"W"]
[]
{"$rows_left_out":15}