{"text_format":"1","workbook":"xlsx","n_sheets":10,"sheets":["Design Regulator","BOM & Schematic","EVM","Variable Mgmt","Schematic Mgmt","Efficiency Plots","PFM Efficiency","COT Efficiency","Standard Value Calculator","Ripple Injection"],"not_rendered":{"charts":23,"images":64,"macros":1,"external_links":0,"defined_names":235,"comments":3,"pivot_tables":0},"unopened":[],"bounds":{"document_bytes":16777216,"sheet_cells":100000,"rows_first":2000,"rows_last":500,"rows_between":2000,"halvings":0,"cell_chars":16384,"cell_head_chars":4096},"cells_cut":0,"cells_raw":0,"read":"whole","date_system":"1900"}

{"sheet":"Design Regulator","index":0,"n_rows":51,"n_cols":17,"rows_kept":51,"cut":false,"hidden":false,"merged":[[2,14,2,15],[0,0,0,16]]}
["                         LM5165 Low IQ DC/DC Converter Design Tool  "]
[null,null,null,null,null,null,null,null,null,null,null,null,null,null,"http://www.ti.com/product/lm5165"]
["About",null,"xx",null,null,"= Input Box",null,null,null,null,null,null,null,null,"Terms Of Use",null,"                "]
[]
["Step 1: Operating Specifications"]
[null,null,null,"Input Voltage - Min, VIN(min) ",6,"V"]
[null,null,null,"Input Voltage - Nom, VIN(nom)",12,"V"]
[null,null,null,"Input Voltage - Max, VIN(max)",20,"V"]
[null,null,null,"Output Voltage, VOUT ",3.3010000000000002,"V"]
[null,null,null,"Full Load Current, IOUT",110,"mA"]
[null,null,null,"Mode of Operation"]
[null,null,null,"Switching Frequency at VIN(nom)",250,"kHz"]
[null,null,null,{"$f":"CHOOSE(MODE, \"RT Resistance\", \"*Connect RT pin to GND\")","v":"RT Resistance"},{"$f":"'Standard Value Calculator'!J4/1000","v":82.5},"kΩ"]
[]
["Step 2: Filter Inductor"]
[null,null,null,"Peak Inductor Current Setting, IL(pk)"]
[null,null,null,"Recommended Filter Inductance ",{"$f":"Lopt*1000000","v":174.0327212121212},"µH"]
[null,null,null,"Inductance, LF ",220,"µH"]
[null,null,null,"Inductor DCR ",300,"mΩ"]
[null,null,null,{"$f":"CHOOSE(MODE, \"Pk-to-Pk Ripple Current\", \"Resulting PFM Switching Frequency\")","v":"Pk-to-Pk Ripple Current"},{"$f":"CHOOSE(MODE, 'Variable Mgmt'!B85*1000, 'Variable Mgmt'!B65)","v":43.843068838675784},{"$f":"CHOOSE(MODE, \"mApk-pk\", \"kHz\")","v":"mApk-pk"}]
[null,null,null,{"$f":"CHOOSE(MODE, 'Variable Mgmt'!H85, 'Variable Mgmt'!H86)","v":"% Ripple Current at Nom VIN"},{"$f":"IF(MODE=1, 'Variable Mgmt'!B93*100, Ilim/2*1000)","v":39.85733530788707},{"$f":"IF(MODE=1, \"%\", \"mA\")","v":"%"}]
[]
["Step 3: Input & Output Capacitors"]
[null,null,null,"Minimum Output Capacitance ",{"$f":"'Variable Mgmt'!B116","v":5.3127014648501394},"µF"]
[null,null,null,"Output Capacitance, COUT ",100,"µF"]
[null,null,null,{"$f":"CHOOSE(MODE, \"Recommended ESR\", \"*Higher Cout Improves Light-Load Eff\")","v":"Recommended ESR"},{"$f":"'Variable Mgmt'!B259","v":">1.23"},{"$f":"IF(MODE=1, \"Ω\", \"\")","v":"Ω"}]
[null,null,null,{"$f":"CHOOSE(MODE, \"Total ESR & Series Resistance\", \"*PFM Hysteresis Sets Output Ripple\")","v":"Total ESR & Series Resistance"},1.5,"Ω"]
[null,null,null,{"$f":"CHOOSE(MODE, \"Resulting Output Voltage Ripple\", \"Output Voltage Ripple\")","v":"Resulting Output Voltage Ripple"},{"$f":"CHOOSE(MODE, Vripple2*1000, Vripple_PFM*1000)","v":65.764968615905772},"mVpk-pk"]
[null,null,null,"Minimum Input Capacitance ",{"$f":"'Variable Mgmt'!B142","v":0.47},"µF"]
[null,null,null,"Input Capacitance, CIN ",4.7,"µF"]
[null,null,null,"Input Capacitor ESR ",3,"mΩ"]
[null,null,null,"Resulting Input Voltage Ripple ",{"$f":"CHOOSE(MODE, Vinripple2*1000, 'Variable Mgmt'!B150*1000)","v":19.164894313608361},"mVpk-pk"]
[]
["Step 4: Feedback, Soft-start, UVLO"]
[null,null,null,{"$f":"CHOOSE(MODE_VOUT, \"*Connect VOUT pin to Point of Regulation\", \"Upper Feedback Resistor, R1\")","v":"Upper Feedback Resistor, R1"},210,"kΩ"]
[null,null,null,{"$f":"CHOOSE(MODE_VOUT, \"\", \"Lower Feedback Resistor, R2\")","v":"Lower Feedback Resistor, R2"},{"$f":"IF(Vout=Vref,\"OPEN\",Rfb2_u/1000)","v":124},{"$f":"IF(Vout=Vref,\"\",\"kΩ\")","v":"kΩ"}]
[null,null,null,"Soft-Start Configuration",null,null,null,null,null,null,null,null,null,null,null,null," "]
[null,null,null,{"$f":"CHOOSE(MODE_SS,\"Soft-Start Time\",\"*Leave SS pin Open Circuit\",\"*Connect 100kΩ Resistor from SS to GND\")","v":"Soft-Start Time"},6,"ms"]
[null,null,null,"Soft-Start Capacitance, CSS ",{"$f":"IF(Tss>0.0001,Css_u*1000000000,\"N/A\")","v":47},"nF"]
[null,null,null,"Input UVLO Configuration"]
[null,null,null,{"$f":"CHOOSE(MODE_UVLO, \"Input Voltage UVLO On\", \"*Connect EN pin to VIN or Logic HIGH\")","v":"*Connect EN pin to VIN or Logic HIGH"},20,"V"]
[null,null,null,{"$f":"CHOOSE(MODE_UVLO, \"Input Voltage UVLO Off\", \"*Connect HYS pin to GND\")","v":"*Connect HYS pin to GND"},18,"V"]
[null,null,null,"Upper UVLO Resistor, RUV1",1,"MΩ"]
[null,null,null,"Lower UVLO Resistor, RUV2",{"$f":"'Variable Mgmt'!F263","v":""},{"$f":"'Variable Mgmt'!G263","v":""}]
[null,null,null,"UVLO Hysteresis Resistor, RHYS",{"$f":"'Variable Mgmt'!F264","v":""},{"$f":"'Variable Mgmt'!G264","v":""}]
[]
["Step 5: Efficiency & Thermals"]
[null,null,null,"Estimated Thermal Impedance, JJA",157,"°C/W"]
[null,null,null,"Ambient Temp, TA",85,"°C"]
[null,null,null,"LM5165 Power Dissipation at Full Load, PD",{"$f":"1000*'Variable Mgmt'!B26","v":38.657740594177461},"mW"]
[null,null,null,"LM5165 Junction Temp at Full Load, TJ",{"$f":"E49+E48*'Variable Mgmt'!B26","v":91.069265273285865},"°C"]

{"sheet":"BOM & Schematic","index":1,"n_rows":50,"n_cols":17,"rows_kept":50,"cut":false,"hidden":false,"merged":[[45,7,45,9],[30,3,30,5],[29,3,29,5],[39,3,39,5],[36,3,36,5],[37,3,37,5],[35,3,35,5],[34,3,34,5],[33,3,33,5],[38,3,38,5],[40,3,40,5],[41,3,41,5],[42,3,42,5],[31,3,31,5],[32,3,32,5]]}
[]
[]
[]
[]
[]
[]
[]
[]
[]
[]
[]
[]
[]
[]
[]
[]
[]
[]
[]
[]
[]
[]
[]
[]
[]
[]
[]
[{"$f":"\"VIN = \"&Vin&\" V, VOUT = \"&Vout&\" V, IOUT = \"&Iout*1000&\" mA \"&'Variable Mgmt'!B33&\" Converter\"","v":"VIN = 12 V, VOUT = 3.301 V, IOUT = 110 mA COT Converter"}]
["Low IQ, High Efficiency, Synchronous Buck Converter BOM"]
["Count","Ref Des","Value","Description",null,null,"Size","Part Number","MFR","Footprint (mm)","Area (mm2)"]
[{"$f":"ROUNDUP('Design Regulator'!E30/10,0)","v":1},"CIN",{"$f":"Cin*1000000","v":4.7},{"$f":"IF(VIN_max>35, \"Capacitor, Ceramic, \"&'Variable Mgmt'!B244&\", 100V, X7R, 10%\", \"Capacitor, Ceramic, \"&'Variable Mgmt'!B244&\", 50V, X7R, 10%\")","v":"Capacitor, Ceramic, 4.7µF, 50V, X7R, 10%"},null,null,null,"Std","Std",{"$f":"CHOOSE(Q31,'Variable Mgmt'!T39,'Variable Mgmt'!T40,'Variable Mgmt'!T41,'Variable Mgmt'!T42,'Variable Mgmt'!T43)","v":"3.2 x 1.6"},{"$f":"CHOOSE(Q31,'Variable Mgmt'!U39,'Variable Mgmt'!U40,'Variable Mgmt'!U41,'Variable Mgmt'!U42,'Variable Mgmt'!U43)","v":5.0999999999999996},null,null,null,null,null,4]
[{"$f":"ROUNDUP('Design Regulator'!E25/22,0)","v":5},"COUT",{"$f":"Cout*1000000","v":100},{"$f":"CHOOSE(Cout_Voltage_Rating, \"Capacitor, Ceramic, \"&'Variable Mgmt'!B240&\", 6.3V, X7R, 10%\", \"Capacitor, Ceramic, \"&'Variable Mgmt'!B240&\", 10V, X7R, 10%\", \"Capacitor, Ceramic, \"&'Variable Mgmt'!B240&\", 16V, X7R, 10%\", \"Capacitor, Ceramic, \"&'Variable Mgmt'!B240&\", 25V, X7R, 10%\",  \"Capacitor, Ceramic, \"&'Variable Mgmt'!B240&\", 50V, X7R, 10%\")","v":"Capacitor, Ceramic, 100µF, 6.3V, X7R, 10%"},null,null,null,"Std","Std",{"$f":"CHOOSE(Q32,'Variable Mgmt'!T39,'Variable Mgmt'!T40,'Variable Mgmt'!T41,'Variable Mgmt'!T42,'Variable Mgmt'!T43)","v":"3.2 x 1.6"},{"$f":"CHOOSE(Q32,'Variable Mgmt'!U39,'Variable Mgmt'!U40,'Variable Mgmt'!U41,'Variable Mgmt'!U42,'Variable Mgmt'!U43)","v":5.0999999999999996},null,null,null,null,null,4]
[{"$f":"CHOOSE(MODE_SS, \"1\", \"-\", \"1\")","v":"1"},{"$f":"CHOOSE(MODE_SS, \"Css\", \"-\", \"Rss\")","v":"Css"},{"$f":"CHOOSE(MODE_SS, 'Standard Value Calculator'!B4*1000000000&\"nF\", \"-\", \"100k\")","v":"47nF"},{"$f":"CHOOSE(MODE_SS, \"Capacitor, Ceramic, \"&'Standard Value Calculator'!B4*1000000000&\"nF\"&\", 16V, X7R, 10%\", \"-\", \"Resistor, Chip, 100 kΩ, 1/16W, 1%\")","v":"Capacitor, Ceramic, 47nF, 16V, X7R, 10%"},null,null,"0603",{"$f":"CHOOSE(MODE_SS, \"Std\", \"-\", \"Std\")","v":"Std"},{"$f":"CHOOSE(MODE_SS, \"Std\", \"-\", \"Std\")","v":"Std"},{"$f":"CHOOSE(MODE_SS,CHOOSE(Q33,'Variable Mgmt'!T39,'Variable Mgmt'!T40,'Variable Mgmt'!T41),\"-\",CHOOSE(Q33,'Variable Mgmt'!T39,'Variable Mgmt'!T40,'Variable Mgmt'!T41))","v":"1.0 x 0.5"},{"$f":"CHOOSE(MODE_SS, CHOOSE(Q33,'Variable Mgmt'!U39,'Variable Mgmt'!U40,'Variable Mgmt'!U41), \"-\", CHOOSE(Q33,'Variable Mgmt'!U39,'Variable Mgmt'!U40,'Variable Mgmt'!U41))","v":0.5},null,null,null,null,null,1]
[1,"LF",{"$f":"'Design Regulator'!E18","v":220},{"$f":"\"Inductor, \"&Lf*1000000&\" µH, \"&Rdcr*1000&\" mΩ, >\"&ROUNDUP(Ilim*1.2,2)&\"A\"","v":"Inductor, 220 µH, 300 mΩ, >0.29A"},null,null,"-","Various","Various",{"$f":"CHOOSE(Q34,'Variable Mgmt'!T48,'Variable Mgmt'!T49,'Variable Mgmt'!T50,'Variable Mgmt'!T51,'Variable Mgmt'!T52)","v":"4.0 x 4.0"},{"$f":"CHOOSE(Q34,'Variable Mgmt'!U48,'Variable Mgmt'!U49,'Variable Mgmt'!U50,'Variable Mgmt'!U51,'Variable Mgmt'!U52)","v":16},null,null,null,null,null,2]
[{"$f":"CHOOSE(SHORT_ILIM, \"-\", \"1\")","v":"-"},"RILIM",{"$f":"CHOOSE(SHORT_ILIM, \"-\", 'Variable Mgmt'!C271)","v":"-"},{"$f":"CHOOSE(SHORT_ILIM, \"Tie ILIM to GND\", \"Resistor, Chip, \"&'Variable Mgmt'!C271&\" kΩ, 1/16W, 1%\")","v":"Tie ILIM to GND"},null,null,{"$f":"CHOOSE(SHORT_ILIM, \"-\", \"0603\")","v":"-"},{"$f":"CHOOSE(SHORT_ILIM, \"-\", \"Std\")","v":"-"},{"$f":"CHOOSE(SHORT_ILIM, \"-\", \"Std\")","v":"-"},{"$f":"CHOOSE(SHORT_ILIM, \"-\", CHOOSE(Q35,'Variable Mgmt'!T39,'Variable Mgmt'!T40,'Variable Mgmt'!T41))","v":"-"},{"$f":"CHOOSE(SHORT_ILIM, \"-\", CHOOSE(Q35,'Variable Mgmt'!U39,'Variable Mgmt'!U40,'Variable Mgmt'!U41,'Variable Mgmt'!U42,'Variable Mgmt'!U43))","v":"-"},null,null,null,null,null,1]
[{"$f":"CHOOSE(MODE, \"1\", \"-\")","v":"1"},"RT",{"$f":"CHOOSE(MODE, 'Design Regulator'!E13, \"N/A\")","v":82.5},{"$f":"CHOOSE(MODE, \"Resistor, Chip, \"&'Variable Mgmt'!B255&\", 1/16W, 1%\", \"-\")","v":"Resistor, Chip, 82.5kΩ, 1/16W, 1%"},null,null,"0603",{"$f":"CHOOSE(MODE, \"Std\", \"-\")","v":"Std"},{"$f":"CHOOSE(MODE, \"Std\", \"-\")","v":"Std"},{"$f":"CHOOSE(MODE, CHOOSE(Q36,'Variable Mgmt'!T39,'Variable Mgmt'!T40,'Variable Mgmt'!T41), \"-\")","v":"1.0 x 0.5"},{"$f":"CHOOSE(MODE, CHOOSE(Q36,'Variable Mgmt'!U39,'Variable Mgmt'!U40,'Variable Mgmt'!U41,'Variable Mgmt'!U42,'Variable Mgmt'!U43),\"-\")","v":0.5},null,null,null,null,null,1]
[{"$f":"CHOOSE(MODE_VOUT, \"-\", \"1\")","v":"1"},"RFB1",{"$f":"IF(MODE_VOUT=2, Rfb1_/1000, \"N/A\")","v":210},{"$f":"CHOOSE(MODE_VOUT, \"-\", \"Resistor, Chip, \"&'Variable Mgmt'!B250&\", 1/16W, 1%\")","v":"Resistor, Chip, 210kΩ, 1/16W, 1%"},null,null,"0603",{"$f":"CHOOSE(MODE_VOUT, \"-\", \"Std\")","v":"Std"},{"$f":"CHOOSE(MODE_VOUT, \"-\", \"Std\")","v":"Std"},{"$f":"CHOOSE(MODE_VOUT, \"-\", CHOOSE(Q37,'Variable Mgmt'!T39,'Variable Mgmt'!T40,'Variable Mgmt'!T41))","v":"1.0 x 0.5"},{"$f":"CHOOSE(MODE_VOUT, \"-\", CHOOSE(Q37,'Variable Mgmt'!U39,'Variable Mgmt'!U40,'Variable Mgmt'!U41,'Variable Mgmt'!U42,'Variable Mgmt'!U43))","v":0.5},null,null,null,null,null,1]
[{"$f":"CHOOSE(MODE_VOUT, \"-\", \"1\")","v":"1"},"RFB2",{"$f":"IF(MODE_VOUT=2, Rfb2_u/1000, \"N/A\")","v":124},{"$f":"CHOOSE(MODE_VOUT, \"-\", \"Resistor, Chip, \"&'Variable Mgmt'!B251&\", 1/16W, 1%\")","v":"Resistor, Chip, 124kΩ, 1/16W, 1%"},null,null,"0603",{"$f":"CHOOSE(MODE_VOUT, \"-\", \"Std\")","v":"Std"},{"$f":"CHOOSE(MODE_VOUT, \"-\", \"Std\")","v":"Std"},{"$f":"CHOOSE(MODE_VOUT, \"-\", CHOOSE(Q38,'Variable Mgmt'!T39,'Variable Mgmt'!T40,'Variable Mgmt'!T41))","v":"1.0 x 0.5"},{"$f":"CHOOSE(MODE_VOUT, \"-\", CHOOSE(Q38,'Variable Mgmt'!U39,'Variable Mgmt'!U40,'Variable Mgmt'!U41,'Variable Mgmt'!U42,'Variable Mgmt'!U43))","v":0.5},null,null,null,null,null,1]
[{"$f":"CHOOSE(MODE, \"1\", \"-\")","v":"1"},"RESR",{"$f":"CHOOSE(MODE,  'Design Regulator'!E27, \"N/A\")","v":1.5},{"$f":"CHOOSE(MODE, \"Resistor, Chip, \"&'Variable Mgmt'!B258&\", 1/16W, 1%\", \"-\")","v":"Resistor, Chip, 1.5Ω, 1/16W, 1%"},null,null,"0603",{"$f":"CHOOSE(MODE, \"Std\", \"-\")","v":"Std"},{"$f":"CHOOSE(MODE, \"Std\", \"-\")","v":"Std"},{"$f":"CHOOSE(MODE, CHOOSE(Q39,'Variable Mgmt'!T39,'Variable Mgmt'!T40,'Variable Mgmt'!T41), \"-\")","v":"1.0 x 0.5"},{"$f":"CHOOSE(MODE, CHOOSE(Q39,'Variable Mgmt'!U39,'Variable Mgmt'!U40,'Variable Mgmt'!U41,'Variable Mgmt'!U42,'Variable Mgmt'!U43),\"-\")","v":0.5},null,null,null,null,null,1]
[1,"RPGOOD",10,{"$f":"C40","v":10},null,null,"0603","Std","Std",{"$f":"CHOOSE(Q40,'Variable Mgmt'!T39,'Variable Mgmt'!T40,'Variable Mgmt'!T41)","v":"1.0 x 0.5"},{"$f":"CHOOSE(Q40,'Variable Mgmt'!U39,'Variable Mgmt'!U40,'Variable Mgmt'!U41,'Variable Mgmt'!U42,'Variable Mgmt'!U43)","v":0.5},null,null,null,null,null,1]
[{"$f":"CHOOSE(MODE_UVLO, \"1\", \"-\")","v":"-"},"RUV1",{"$f":"CHOOSE(MODE_UVLO, 'Variable Mgmt'!H262, \"N/A\")","v":"N/A"},{"$f":"CHOOSE(MODE_UVLO, \"Resistor, Chip, \"&'Variable Mgmt'!C262&\", 1/16W, 1%\", \"-\")","v":"-"},null,null,"0603",{"$f":"CHOOSE(MODE_UVLO, \"Std\", \"-\")","v":"-"},"-",{"$f":"CHOOSE(MODE_UVLO, CHOOSE(Q41,'Variable Mgmt'!T39,'Variable Mgmt'!T40,'Variable Mgmt'!T41), \"-\")","v":"-"},{"$f":"CHOOSE(MODE_UVLO, CHOOSE(Q41,'Variable Mgmt'!U39,'Variable Mgmt'!U40,'Variable Mgmt'!U41,'Variable Mgmt'!U42,'Variable Mgmt'!U43),\"-\")","v":"-"},null,null,null,null,null,1]
[{"$f":"CHOOSE(MODE_UVLO, \"1\", \"-\")","v":"-"},"RUV2",{"$f":"CHOOSE(MODE_UVLO, 'Variable Mgmt'!H263, \"N/A\")","v":"N/A"},{"$f":"CHOOSE(MODE_UVLO, \"Resistor, Chip, \"&'Variable Mgmt'!C263&\", 1/16W, 1%\", \"-\")","v":"-"},null,null,"0603","-","-",{"$f":"CHOOSE(MODE_UVLO, CHOOSE(Q42,'Variable Mgmt'!T39,'Variable Mgmt'!T40,'Variable Mgmt'!T41), \"-\")","v":"-"},{"$f":"CHOOSE(MODE_UVLO, CHOOSE(Q42,'Variable Mgmt'!U39,'Variable Mgmt'!U40,'Variable Mgmt'!U41,'Variable Mgmt'!U42,'Variable Mgmt'!U43),\"-\")","v":"-"},null,null,null,null,null,1]
[{"$f":"CHOOSE(MODE_UVLO, \"1\", \"-\")","v":"-"},"RHYS",{"$f":"CHOOSE(MODE_UVLO, 'Variable Mgmt'!H264, \"N/A\")","v":"N/A"},{"$f":"CHOOSE(MODE_UVLO, \"Resistor, Chip, \"&'Variable Mgmt'!C264&\", 1/16W, 1%\", \"-\")","v":"-"},null,null,"0603","-","-",{"$f":"CHOOSE(MODE_UVLO, CHOOSE(Q43,'Variable Mgmt'!T39,'Variable Mgmt'!T404,'Variable Mgmt'!T41), \"-\")","v":"-"},{"$f":"CHOOSE(MODE_UVLO, CHOOSE(Q43,'Variable Mgmt'!U39,'Variable Mgmt'!U40,'Variable Mgmt'!U41,'Variable Mgmt'!U42,'Variable Mgmt'!U43),\"-\")","v":"-"},null,null,null,null,null,1]
[1,"U1","LM5165","IC, LM5165, Low IQ Buck Converter, 3V–65V Input",null,null,"VSON-10",{"$f":"CHOOSE(MODE_VOUT, IF(Vout=5, \"LM5165XQDRC\", \"LM5165YQDRC\"), \"LM5165QDRC\")","v":"LM5165QDRC"},"TI","3.0 x 3.0",9]
[]
[null,null,null,null,null,null,null,"Total Solution Size (buffered by 25%)",null,null,{"$f":"SUM(K31:K44)*1.25","v":47.75},"mm2  =",{"$f":"K46/25.4/25.4","v":7.4012648025296057E-2},"in2"]
[]
["NOTES:"]
["* Choose an inductor with saturation current rating higher than the peak inductor current setting for all operating temperatures *"]
["** Appropriately derate effective input and output capacitances for applied voltage and temperature, particularly with ceramics **"]

{"sheet":"EVM","index":2,"n_rows":6,"n_cols":14,"rows_kept":6,"cut":false,"hidden":false,"merged":[[0,0,0,16]]}
[" LM5165 Low IQ DC/DC Converter Design Tool"]
[]
[]
[]
[]
[null,"LM5165EVM-HD PCB Design, 0.6\" x 0.5\" (15.2mm x 12.7mm)",null,null,null,null,null,null,null,null,null,null,null,"LM5165EVM-HD 3D image - minimum solution size denoted by yellow border"]

{"sheet":"Variable Mgmt","index":3,"n_rows":305,"n_cols":21,"rows_kept":305,"cut":false,"hidden":true,"merged":[[4,4,4,7],[0,0,0,8]]}
["EXCEL Variables Names/Calculations"]
[null,"Input from user ="]
[null,"Output ="]
[null,"Constant"]
["Variable Name","Value","STD Units",null,"Notes",null,null,null,"Iteration"]
["Step 1: Operational Specs"]
["VIN_min",{"$f":"'Design Regulator'!E6","v":6},"V","Minimum input voltage",null,null,null,null,1]
["VIN_nom",{"$f":"'Design Regulator'!E7","v":12},"V","Nominal input voltage"]
["VIN_max",{"$f":"'Design Regulator'!E8","v":20},"V","Maximum input voltage"]
[]
["Vout",{"$f":"'Design Regulator'!E9","v":3.3010000000000002},"V","Output Voltage",null,null,null,null,1]
["Iout",{"$f":"'Design Regulator'!E10/1000","v":0.11},"A","Maximum Output Current",null,null,null,null,1]
["Rout",{"$f":"Vout/Iout","v":30.009090909090911},"W","Load resistance"]
["Pout",{"$f":"Vout*Iout","v":0.36311000000000004},"W","Output power"]
[]
["Efficiency",0.9,null,"Estimate of efficiency"]
["Pin",{"$f":"Pout/Efficiency","v":0.40345555555555557},"W","Calculate input power assuming 90% efficiency"]
["Iin_Vinmin",{"$f":"Pin/VIN_min","v":6.724259259259259E-2},"A"]
["Iin_Vinnom",{"$f":"Pin/VIN_nom","v":3.3621296296296295E-2},"A","Input currents at min, nom, max Vin"]
["Iin_Vinmax",{"$f":"Pin/VIN_max","v":2.0172777777777779E-2},"A"]
[]
["Fsw",{"$f":"'Design Regulator'!E12*1000","v":250000},"Hz","Nominal Switching Frequency",null,null,null,null,1]
["Vref",1.2230000000000001,"V","Reference Voltage"]
["Rt",{"$f":"'COT Efficiency'!$D$11","v":82525},"W","Frequency Set Resistor"]
[null,null,null,null,null,null,null,null,null,null,{"$f":"B33&\"_\"&F33&\"_\"&F37&\"_\"&I38&\"_\"&I33","v":"COT_VOUTAdj_UVLOInt_SSAdj_IlimGND"}]
["Internal PD at Full Load",{"$f":"IF(MODE=1, 'COT Efficiency'!AT106, 'PFM Efficiency'!AR106)","v":3.865774059417746E-2},"W"]
[null,null,null,null,null,null,null,null,null,null,{"$f":"\"SCH_\"&B33&\"_\"&F33&\"_\"&F37&\"_\"&I38&\"_\"&I33","v":"SCH_COT_VOUTAdj_UVLOInt_SSAdj_IlimGND"}]
[]
["Step 2: Circuit Configuration for COT / PFM, Fixed / Adj Vout, ILIM, UVLO, SS"]
[]
["COT/PFM ","COT",1,null,"VOUT Fixed/Adjustable","Fixed",1,null,"ILIM pin shorted if 240mA selected",1,{"$f":"B33&\", \"&F33&\", \"&I33&\", \"&F37&\", \"&I38","v":"COT, VOUTAdj, IlimGND, UVLOInt, SSAdj"},null,null,null,null,null,"Vout<=5V","6.3V",1]
[null,"PFM",2,null,null,"Adjustable",2,null,"ILIM resistor needed (60/120/180mA)",2,{"$f":"C33&\", \"&G33&\", \"&J33&\", \"&G37&\", \"&J38","v":"1, 2, 1, 2, 1"},null,null,null,null,null,"Vout<=8V","10V",2]
["MODE",{"$f":"CHOOSE(C33, \"COT\", \"PFM\")","v":"COT"},1,null,"MODE_VOUT",{"$f":"CHOOSE(G33, \"VOUTfixed\", \"VOUTAdj\")","v":"VOUTAdj"},{"$f":"IF(OR(Vout=3.3,Vout=5),1,2)","v":2},"SHORT_ILIM",{"$f":"CHOOSE(J33, \"IlimGND\", \"IlimRes\")","v":"IlimGND"},{"$f":"IF(C39=4, 1, 2)","v":1},{"$f":"C33&G33&J33&G37&J38","v":"12121"},null,null,null,null,null,"Vout<=12V","16V",3]
[null,null,null,null,null,null,null,null,null,null,null,null,null,null,null,null,"Vout<=20V","25V",4]
["Current Limit","60 mA",1,null,"UVLO","Adjustable",1,"Soft Start","Adjustable",1,null,null,null,null,null,null,"Vout>20V","50V",5]
[null,"120 mA",2,null,null,"Internal",2,null,"0.9ms Fixed",2,null,"Iout Linear Axis",1,null,null,null,"Cout Voltage Rating",{"$f":"CHOOSE(S36,\"6.3V\",\"10V\",\"16V\",\"25V\",\"50V\")","v":"6.3V"},{"$f":"IF(Vout<=5, 1, IF(Vout<=8, 2, IF(Vout<=12, 3, IF(Vout<=20, 4, 5))))","v":1}]
[null,"180 mA",3,null,"MODE_UVLO",{"$f":"CHOOSE(G37, \"UVLOAdj\", \"UVLOInt\")","v":"UVLOInt"},2,null,"None",3,null,"Iout Log Axis",2]
[null,"240 mA",4,null,null,null,null,"MODE_SS",{"$f":"CHOOSE(J38, \"SSAdj\", \"SSfix\", \"SSno\")","v":"SSAdj"},1,null,"PLOT_TYPE",1]
["MODE_ILIM",{"$f":"CHOOSE(C39, 60.1,120.1,180.1, 240.1)","v":240.1},4,null,null,null,null,null,null,null,null,null,null,null,null,null,null,"0402",1,"1.0 x 0.5",0.5]
[null,null,null,null,null,null,null,null,null,null,null,null,null,null,null,null,null,"0603",2,"1.6 x 0.8",1.3]
[null,null,null,null,null,null,null,null,null,null,null,null,null,null,null,null,null,"0805",3,"2.0 x 1.25",2.5]
["Step 3: Filter Inductor",null,null,null,null,null,null,null,null,null,null,null,null,null,null,null,null,"1206",4,"3.2 x 1.6",5.0999999999999996]
["Don1",{"$f":"Vout/VIN_nom","v":0.27508333333333335},{"$f":"(Vout-VIN_nom)/Vout","v":-2.6352620418055133},null,"Ideal Duty Cycle at VIN(nom)",null,null,null,1,null,null,null,null,null,null,null,null,"1210",5,"3.2 x 2.5",8]
["Doff1",{"$f":"1-43:43","v":0.72491666666666665},null,null,"Ideal 1- Duty Cycle at VIN(nom)",null,null,null,1,null,null,null,null,null,null,null,"Component Size",{"$f":"CHOOSE(S44,\"0402\",\"0603\",\"0805\",\"1206\",\"1210\")","v":"1210"},5,{"$f":"CHOOSE(S44,T39,T40, T41,T42,T43)","v":"3.2 x 2.5"}]
[]
["Don_Vinmin",{"$f":"Vout/VIN_min","v":0.55016666666666669},{"$f":"IF(VIN_min>Vout, \"BUCK\", \"BOOST\")","v":"BUCK"}]
["Don_Vinnom",{"$f":"Vout/VIN_nom","v":0.27508333333333335},{"$f":"IF(VIN_nom>Vout, \"BUCK\", \"BOOST\")","v":"BUCK"}]
["Don_Vinmax",{"$f":"Vout/VIN_max","v":0.16505},{"$f":"IF(VIN_max>Vout, \"BUCK\", \"BOOST\")","v":"BUCK"},null,null,null,null,null,null,null,null,null,null,null,null,null,null,"3mm x 3mm",1,"3.0 x 3.0",9]
[null,null,null,null,null,null,null,null,null,null,null,null,null,null,null,null,null,"4mm x 4mm",2,"4.0 x 4.0",16]
["Lf_Vinmin",{"$f":"(VIN_min-Vout)*Don_Vinmin/(Fsw*Iout*0.4)","v":1.3499089393939395E-4},"H","COT",null,null,null,null,null,null,null,null,null,null,null,null,null,"5mm x 5mm",3,"5.0 x 5.0",25]
["Lf_Vinnom",{"$f":"(VIN_nom-Vout)*Don_Vinnom/(Fsw*Iout*0.4)","v":2.1754090151515152E-4},"H","COT",null,null,null,null,1,null,null,null,null,null,null,null,null,"6mm x 6mm",4,"6.0 x 6.0",36]
["Lf_Vinmax",{"$f":"(VIN_max-Vout)*Don_Vinmax/(Fsw*Iout*0.7)","v":1.4317765974025974E-4},"H","COT",null,null,null,null,null,null,null,null,null,null,null,null,null,"7mm x 7mm",5,"7.0 x 7.0",49]
[null,null,null,null,null,null,null,null,null,null,null,null,null,null,null,null,"Inductor Size"]
["L_Vinmin_COT",{"$f":"(VIN_min-Vout)*Don_Vinmin/(Fsw*Iout*0.3)","v":1.799878585858586E-4},"H","COT","Calculated Inductance for 30% ripple at VIN(min)"]
["L_Vinnom_COT",{"$f":"(VIN_nom-Vout)*Don_Vinnom/(Fsw*Iout*0.5)","v":1.7403272121212121E-4},"H","COT","Calculated Inductance for 40% ripple at VIN(nom)",null,null,null,null,null,"Pk-to-Pk Ripple Current at VIN(nom), DIL"]
["L_Vinmax_COT",{"$f":"(VIN_max-Vout)*Don_Vinmax/(Fsw*Iout*0.7)","v":1.4317765974025974E-4},"H","COT","Calculated Inductance for 70% ripple at VIN(max)"]
[]
["L_PFM",{"$f":"(Vin-Vout-(Rdcr+Rdson1)*Ioutmax)*PFM_Duty_Cycle/Fsw/IripplePFM","v":4.0359176307290915E-5},null,"PFM","Calculated Inductance for given pulse frequency at VIN(nom)"]
[]
["Lopt",{"$f":"CHOOSE(MODE, B55, B58)","v":1.7403272121212121E-4},"H"]
[]
["Lf",{"$f":"'Design Regulator'!E18/1000000","v":2.2000000000000001E-4},"H",null,"Chosen Inductance",null,null,null,2]
["Rdcr",{"$f":"'Design Regulator'!E19/1000","v":0.3},"W",null,"Chosen Inductor DCR",null,null,null,1]
[]
["Actual PFM Pulse Freq (Fsw) at Vin(nom)",{"$f":"(Vin-Vout-(Rdcr+Rdson1)*Ioutmax)*PFM_Duty_Cycle/Lf/IripplePFM/1000","v":45.862700349194213},"kHz"]
[]
["Don2",{"$f":"(Vout+Iout*Rdcr)/Vin","v":0.27783333333333332},null,null,"**Edit to add Rdson**",null,null,null,2]
["Doff2",{"$f":"1-_Don2","v":0.72216666666666662},null,null,null,null,null,null,2]
[]
["Rdson1",2,"W","PMOS"]
["Rdson2",{"$f":"RdsonBot","v":1},"W","NMOS"]
[]
["Don_Vinmin_2",{"$f":"(Vout+Iout*(Rdcr+Rdson2))/(VIN_min+Iout*Rdson2)","v":0.56366612111292957},null,null,"Duty cycles adjusted for DCR and shunt voltage drops",null,null,null,2]
["Don_Vinnom_2",{"$f":"(Vout+Iout*(Rdcr+Rdson2))/(VIN_nom+Iout*Rdson2)","v":0.28439306358381505},null,null,"need to include RDS(on) later"]
["Don_Vinmax_2",{"$f":"(Vout+Iout*(Rdcr+Rdson2))/(VIN_max+Iout*Rdson2)","v":0.17125808055693684}]
[]
["Iripple_Vinmin",{"$f":"(VIN_min-Vout-Rdson1*Iout)*Don_Vinmin_2/(Fsw*Lf)","v":2.5405969349799135E-2},"A","COT"]
["Iripple_Vinnom",{"$f":"(VIN_nom-Vout-Rdson1*Iout)*Don_Vinnom_2/(Fsw*Lf)","v":4.3843068838675781E-2},"A","COT"]
["Iripple_Vinmax",{"$f":"(VIN_max-Vout)*Don_Vinmax_2/(Fsw*Lf)","v":5.1997067040368876E-2},"A","COT"]
[]
["ILpk_Vinmin",{"$f":"Iout+Iripple_Vinmin/2","v":0.12270298467489957},"A","COT"]
["ILpk_Vinnom",{"$f":"Iout+Iripple_Vinnom/2","v":0.1319215344193379},"A","COT"]
["ILpk_Vinmax",{"$f":"Iout+Iripple_Vinmax/2","v":0.13599853352018443},"A","COT"]
[]
["Ripple current",{"$f":"IF(MODE=1, Iripple_Vinnom, Iripple)","v":4.3843068838675781E-2},"A",null,null,null,null,"% Ripple Current at Nom VIN"]
[null,null,null,null,null,null,null,"Maximum Load Current"]
["Max inductor ripple current",{"$f":"MAX(B77:B79)","v":5.1997067040368876E-2},"A"]
[null,null,null,null,null,"Ripple I","Iin"]
["% Ripple Current",{"$f":"B77/Iout","v":0.23096335772544668},null,"COT",null,{"$f":"B77","v":2.5405969349799135E-2},{"$f":"Iin_Vinmin","v":6.724259259259259E-2}]
[null,{"$f":"B78/Iout","v":0.39857335307887071},null,"COT",null,{"$f":"B78","v":4.3843068838675781E-2},{"$f":"Iin_Vinnom","v":3.3621296296296295E-2}]
[null,{"$f":"B79/Iout","v":0.47270060945789888},null,"COT",null,{"$f":"B79","v":5.1997067040368876E-2},{"$f":"Iin_Vinmax","v":2.0172777777777779E-2}]
[]
[null,{"$f":"IF(MODE=1, B90, Ilim/Iout)","v":0.39857335307887071}]
[]
["Iripple1",{"$f":"(Vin-Vout)*Don_Vinnom_2/(Fsw*Lf)","v":4.4980641093011038E-2},"A","inductor ripple current with chosen inductance (pk-pk)",null,null,null,null,1]
["Temp",100]
["DCR at hot",{"$f":"Rdcr*(1+0.0039*(B96-25))","v":0.38774999999999998},"W"]
[]
[]
[]
["Step 3: Output Capacitor"]
["Icoutrms_VINmin",{"$f":"Iripple_Vinmin/SQRT(12)","v":7.3340716215649559E-3},"A","Output Cap RMS current"]
["Icoutrms_VINnom",{"$f":"Iripple_Vinnom/SQRT(12)","v":1.2656403798054378E-2},"A"]
["Icoutrms_VINmax",{"$f":"Iripple_Vinmax/SQRT(12)","v":1.5010260326413994E-2},"A",null,null,null,{"$f":"Vripple1","v":5.3982011447260827E-3}]
[]
["Output Ripple Spec (pk-pk)",{"$f":"Vout/Vref*0.002","v":5.3982011447260827E-3},"V","Vout capacitive ripple spec at Vin(nom) = Vripple1 = 2mV at FB"]
[]
["Coutmin",{"$f":"2/Pi/CoutEsr/Fsw","v":1.6976527282534012E-6},null," = 2/Pi*ESR*Fsw"]
["COT",{"$f":"Iripple_Vinnom/Fsw*100/Vout","v":5.3127014648501392E-6},"F","COT","Min recommended Cout based on ripple spec above",null,null,null,1,null,{"$f":"Iripple_Vinnom/Fsw*100/Vout","v":5.3127014648501392E-6},null,"Use 100/Vout as the scale factor"]
[null,{"$f":"Lf*B82^2/((1.05*Vout)^2-Vout^2)","v":3.4279869104060568E-6},"F","COT","Min recommended Cout based on 5% load-off transient spec"]
[null,{"$f":"MAX(B109:B110, 0.0000022)","v":5.3127014648501392E-6},"F","COT","max of 2 results and 2.2uF"]
[]
["Coutmin"]
["PFM",{"$f":"MIN(100*L*(IL_peak/Vout)^2, 0.0001)","v":1E-4},"F","PFM","Min recommneded Cout based on 0.5% ripple per switching pulse, max 100uF"]
[]
["Reported Countmin",{"$f":"CHOOSE(MODE, Coutmin*1000000, B114*1000000)","v":5.3127014648501394},"µF"]
[]
["Cout",{"$f":"'Design Regulator'!E25/1000000","v":1E-4},"F","Chosen Output Capacitance",null,null,null,null,1]
["Resrmax",{"$f":"SQRT((Vripple1/Iripple_Vinnom)^2-(1/(Fsw*Cout*8))^2)","v":0.12302396700929008},"W","Max ESR before ripple exceeds Vripple1",null,null,null,null,1]
["ESR for sufficient (20mV) COT ripple at FB pin",{"$f":"0.02*Vout/Vref/Iripple_Vinnom","v":1.2312553130323094},"W","(a)"]
[]
["Output Cap RC Time Constant",{"$f":"Cout*B126*1000000","v":123.12553130323096},"µs"]
["Ton @ Vin(min)",{"$f":"Vout/VIN_min/(Fsw)","v":2.200666666666667E-6},"µs",null,null,null,{"$f":"Vref","v":1.2230000000000001}]
["ESR so that RC > Ton/2",{"$f":"B123/2/Cout","v":1.1003333333333334E-2},"W","(b)"]
[]
["Need ESR of…",{"$f":"IF(MODE=1, MAX(B120,B124), 0)","v":1.2312553130323094},"W","Max of (a) and (b)",null,null,{"$f":"Iout","v":0.11}]
[]
["Reported Cout ESR max",{"$f":"IF(OR(CoutEsrMax>0.5, CoutEsrMax<0, (ISERROR(CoutEsrMax))), \"N/A\", CoutEsrMax*1000)","v":123.02396700929008},"mW"]
[]
["CoutEsr",{"$f":"'Design Regulator'!E27","v":1.5},"W","Chosen ESR",null,null,null,null,1]
[]
["Actual Output Ripple - PFM",{"$f":"Iout*0.000004/Cout+Vout/123","v":3.1237398373983739E-2},"Vp-p","includes 4us wakep delay",null,null,{"$f":"Cout","v":1E-4}]
[]
["Actual Output Ripple - COT",{"$f":"Iripple_Vinnom*SQRT(CoutEsr^2+(1/(8*Fsw*Cout))^2)","v":6.5764968615905778E-2},"Vp-p","Vripple2"]
[]
[]
["Step 5: Input Capacitor"]
["Vinripple1",{"$f":"0.02*VIN_nom","v":0.24},"Vp-p","Input voltage ripple spec (pk-pk) at Vin(nom) = 20%"]
[]
["Icinrms",{"$f":"Iout*SQRT(Don_Vinnom_2*(1-Don_Vinnom_2))","v":4.9623735777626105E-2},"A"]
["Cinmin",{"$f":"Iout*Don_Vinnom_2*(1-Don_Vinnom_2)/(Vinripple1*Fsw)*1000000","v":0.3731083564435832},"µF"]
["Reported Cinmin",{"$f":"IF(Cinmin<0.47, 0.47,Cinmin)","v":0.47},"µF"]
["Cin",{"$f":"'Design Regulator'!E30/1000000","v":4.6999999999999999E-6},"F","Input capacitance"]
["CinEsrMax",{"$f":"-(Iout*Don_Vinnom_2*(1-Don_Vinnom_2)/(Cin*Fsw)-Vinripple1)/(Iout+Iripple_Vinnom/2)","v":1.6748414833627214},"W"]
["RCinEsr",{"$f":"'Design Regulator'!E31/1000","v":3.0000000000000001E-3},"W","Input capacitance series resistance (ESR)"]
["Reported Cin ESR max",{"$f":"IF(OR(CinEsrMax>12, CinEsrMax<0), \"N/A\",CinEsrMax*1000)","v":1674.8414833627214},"mΩ"]
[]
["COT input voltage ripple - Vinripple2",{"$f":"Iout*Don_Vinnom_2*(1-Don_Vinnom_2)/(Cin*Fsw)+(Iout +Iripple_Vinnom/2)*RCinEsr*Don_Vinnom_2","v":1.916489431360836E-2},"Vp-p",null,{"$f":"Iout*Don_Vinmax_2*(1-Don_Vinmax_2)/(Cin*Fsw)","v":1.328694684604082E-2},"Vp-p"]
[]
["PFM input voltage ripple",{"$f":"'PFM Efficiency'!N111*'PFM Efficiency'!N109/Cin","v":0.17220138021455825},"Vp-p"]
[]
[]
["Step 6: Soft Start"]
["Tss",{"$f":"'Design Regulator'!E38/1000","v":6.0000000000000001E-3},"s","Soft-start time"]
["Iss",1.0000000000000001E-5,"A","Soft-start current"]
["Css",{"$f":"8.1*Tss/1000000","v":4.8599999999999998E-8},"F","Required soft-start cap"]
["Css_u",{"$f":"'Standard Value Calculator'!B4","v":4.6999999999999997E-8},"F","User selected SS cap"]
[]
["Step 7: Other Components - UVLO, HYS, PGOOD"]
[]
["Rising UVLO/EN Threshold",1.212,"V"]
["Falling UVLO/EN Threshold",1.1439999999999999,"V"]
["Voltage Hysteresis",{"$f":"B161-B162","v":6.800000000000006E-2},"V"]
[]
["VINUVLO_ON",{"$f":"'Design Regulator'!E41","v":20},"V"]
["VINUVLO_OFF",{"$f":"'Design Regulator'!E42","v":18},"V"]
[]
["RUV1",{"$f":"'Design Regulator'!E43*1000","v":1000},"kΩ",{"$f":"'Standard Value Calculator'!J16","v":1000},"kΩ",{"$f":"IF(Ruvlo1<0,\"N/A\",D168)","v":1000},{"$f":"IF(Ruvlo1<0,\"N/A\",D168&\"kΩ\")","v":"1000kΩ"}]
["RUV2",{"$f":"Vuvlo_on*Ruvlo1/(VINuvlo_on-Vuvlo_on)","v":64.509261230572704},"kΩ",{"$f":"'Standard Value Calculator'!J17","v":64.900000000000006},"kΩ",{"$f":"IF(F168=\"N/A\",\"N/A\",D169)","v":64.900000000000006},{"$f":"IF(G168=\"N/A\",\"N/A\",D169&\"kΩ\")","v":"64.9kΩ"}]
["RHYS",{"$f":"(Vuvlo_off*Ruvlo1-Ruvlo2*(VINuvlo_off-Vuvlo_off))/(VINuvlo_off-Vuvlo_off)","v":3.3597468377709037},"kΩ",{"$f":"IF(Rhys<0, 0, 'Standard Value Calculator'!J18)","v":3.3200000000000003},"kΩ",{"$f":"IF(F169=\"N/A\",\"N/A\",D170)","v":3.3200000000000003},{"$f":"IF(G169=\"N/A\",\"N/A\",D170&\"kΩ\")","v":"3.32kΩ"}]
[]
[]
["VINUVLO_ON_ACTUAL",{"$f":"(D168+D169)/D169*Vuvlo_on","v":19.886884437596301},"V"]
["VINUVLO_OFF_ACTUAL",{"$f":"(D168+D169+D170)/(D169+D170)*Vuvlo_off","v":17.913275872178247},"V"]
[]
["RPG",10,"kΩ"]
[]
[]
["Step 8: FB Divider"]
["Pi",3.1415926500000002,null,"p"]
["Toff_Vinmax",{"$f":"(1-Don_Vinmax_2)/Fsw","v":3.3149676777722526E-6},"sec"]
["Ton_Vinmin",{"$f":"IF(VIN_min>Vout, (1-Don_Vinmin_2)/Fsw, Don_Vinmin_2/Fsw)","v":1.7453355155482817E-6},"sec"]
[]
["Rfb1",{"$f":"'Design Regulator'!E35*1000","v":210000},"W","Upper Feedback Resistance - chosen by user",null,null,null,null,1]
["Rfb2",{"$f":"IF(Vout=Vref,100000000,Vref*B184/((Vout-Vref)))","v":123594.80269489894},"W","Lower Feedback Resistance"]
["Rfb2_u",{"$f":"IF(Vout=Vref,\"N/A\",'Standard Value Calculator'!J10)","v":124000},"W","Std Value Lower Feedback Resistance"]
[]
["Ifb",{"$f":"CHOOSE(MODE_VOUT, IF(Vout=5, 0.000007, 0.0000038), Vout/(Rfb1_+Rfb2_u))","v":9.8832335329341323E-6}]
[]
[]
["Other Input Variables"]
["Rfets",0,"W","Series resistance due to FETs",null,null,null,{"$f":"_Don2*RdsonTop+Doff2*RdsonBot+B196*Vin^2*Fsw/2/(((Iripple1/SQRT(3))^2))","v":134.72596018607993}]
["Diode loss eq res",{"$f":"0.00000002*Fsw*0.6*4/Iripple1","v":0.26678143548880023}]
["Fet loss eq res",{"$f":"_Don2*RdsonTop+Doff2*RdsonBot","v":1.2778333333333332}]
["cap loss eq res",{"$f":"B196*Vin^2*Fsw/2/(((Iripple1/SQRT(3))^2))","v":133.44812685274661}]
["Sw cap",5.0000000000000001E-9]
[]
["Step 8: Efficiency"]
[]
["Design"]
["Ta",25,"°C","Ambient Temperature"]
["Components"]
["LTc",{"$f":"4000/1000000","v":4.0000000000000001E-3},"%/°C","Inductor DCR Temp Co"]
["θCA",20,"°C/W","Inductor Core to Ambient Thermal Resistance"]
["RCinEsr",{"$f":"RCinEsr","v":3.0000000000000001E-3},"W","Input Capacitor ESR"]
["Part Characteristics"]
["Vcc",5,"V"]
["Deadtime"]
["Deadtime",2.4999999999999999E-8,"s","Total Deadtime",null,null,"25ns for LM5165"]
["IQ"]
["IQ ",1.0499999999999999E-5,"A","Quiescent Current Of Controller (Not Switching!)"]
[]
[]
["IC Power Disipation","Value","Units"]
["Power Dis",{"$f":"#REF!","v":{"$error":"#REF!"}},"W"]
["Temp rise",{"$f":"B215*ThetaJaCtrl","v":{"$error":"#REF!"}},"°C"]
["Current (switching)",{"$f":"(Qg_Q1+Qg_Q2)*Fsw+Iq","v":{"$error":"#NAME?"}},"A"]
["Qrr Current",{"$f":"Qrr_Q2*Fsw","v":{"$error":"#NAME?"}},"A"]
["Diode Current",{"$f":"C219/Vin","v":{"$error":"#NAME?"}},{"$f":"Deadtime*Fsw*(Ipp/2)*(Vsd_Q1+Vsd_Q2)","v":{"$error":"#NAME?"}}]
["Total Application Switching IQ",{"$f":"SUM(B217:B219)","v":{"$error":"#NAME?"}},"A"]
[]
[]
["SCHEMATIC LABELS"]
[]
[]
[{"$f":"\"RUV1 = \"&'Design Regulator'!E43&\"MΩ\"","v":"RUV1 = 1MΩ"},{"$f":"C262","v":""}]
[{"$f":"\"RUV2 = \"&'Design Regulator'!E44&\"kΩ\"","v":"RUV2 = kΩ"},{"$f":"C263","v":""}]
[{"$f":"\"Rhys = \"&'Design Regulator'!E45&\"kΩ\"","v":"Rhys = kΩ"},{"$f":"C264","v":""}]
[]
[{"$f":"\"LF = \"&'Design Regulator'!E18&\"µH\"","v":"LF = 220µH"},{"$f":"'Design Regulator'!E18&\"µH\"","v":"220µH"}]
[{"$f":"\"Rdcr = \"&Rdcr*1000&\"mΩ\"","v":"Rdcr = 300mΩ"},{"$f":"Rdcr*1000&\"mΩ\"","v":"300mΩ"}]
[{"$f":"\"Rt = \"&'Design Regulator'!I35&\"kΩ\"","v":"Rt = kΩ"},{"$f":"'Design Regulator'!I35&\"kΩ\"","v":"kΩ"}]
[{"$f":"\"Css = \"&ROUND(Css_u*1000000000,1)&\"nF\"","v":"Css = 47nF"},{"$f":"ROUND(Css_u*1000000000,1)&\"nF\"","v":"47nF"}]
[]
["VIN",{"$f":"VIN_nom&\"V\"","v":"12V"}]
["VIN range",{"$f":"VIN_min&\"V...\"&VIN_max&\"V\"","v":"6V...20V"}]
[]
[{"$f":"\"VOUT = \"&'Design Regulator'!E9&\"V\"","v":"VOUT = 3.301V"},{"$f":"'Design Regulator'!E9&\"V\"","v":"3.301V"}]
[]
[{"$f":"\"COUT = \"&'Design Regulator'!$E$25&\"µF\"","v":"COUT = 100µF"},{"$f":"'Design Regulator'!$E$25&\"µF\"","v":"100µF"}]
["Capacitance per component (Cout)",{"$f":"\"22µF\"","v":"22µF"}]
["# of output caps",{"$f":"ROUNDUP(Cout*1000000/22,0)&\" x\"","v":"5 x"}]
[]
["CIN",{"$f":"Cin*1000000&\"µF\"","v":"4.7µF"}]
["Capacitance per component (Cin)",{"$f":"\"10µF\"","v":"10µF"}]
["# of input caps",{"$f":"ROUNDUP(Cin*1000000/10,0)&\" x\"","v":"1 x"}]
[]
["Fixed VOUT?",{"$f":"IF(MODE_VOUT=1, \"YES\", \"NO\")","v":"NO"}]
["FB resistor ref des shown or not?",{"$f":"IF(MODE_VOUT=2, \"YES\", \"NO\")","v":"YES"},{"$f":"IF(MODE_VOUT=2, \"R1\", \"\")","v":"R1"},{"$f":"IF(MODE_VOUT=2, \"R2\", \"\")","v":"R2"}]
[{"$f":"\"RFB1 = \"&'Design Regulator'!E35&\"kΩ\"","v":"RFB1 = 210kΩ"},{"$f":"IF(MODE_VOUT=1, \"\", 'Design Regulator'!E35&\"kΩ\")","v":"210kΩ"},{"$f":"IF(MODE=1,'Design Regulator'!E35&\"kΩ\", \"\")","v":"210kΩ"}]
[{"$f":"\"RFB2 = \"&IF(Vout=Vref,\"OPEN\",'Design Regulator'!E36&\"kΩ\")","v":"RFB2 = 124kΩ"},{"$f":"IF(MODE_VOUT=1, \"\", IF(Vout=Vref,\"OPEN\",Rfb2_u/1000&\"kΩ\"))","v":"124kΩ"},{"$f":"IF(MODE=1, IF(Vout=Vref, \"OPEN\",Rfb2_u/1000&\"kΩ\" ), \"\")","v":"124kΩ"}]
[]
[]
["Show Rt resistor ref des?",{"$f":"IF(MODE=1, \"YES\", \"NO\")","v":"YES"},{"$f":"IF(MODE=1,\"Rt\", \"\")","v":"Rt"}]
["Rt",{"$f":"IF(MODE=2, \"\", 'Standard Value Calculator'!J4/1000&\"kΩ\")","v":"82.5kΩ"}]
[]
["Show ESR resistor ref des?",{"$f":"IF(MODE=1, \"YES\", \"NO\")","v":"YES"},{"$f":"IF(MODE=1,\"Resr\", \"\")","v":"Resr"}]
[{"$f":"\"RESR = \"&'Design Regulator'!E27&\"mΩ\"","v":"RESR = 1.5mΩ"},{"$f":"IF(MODE=1, 'Design Regulator'!E27&\"Ω\", \"\")","v":"1.5Ω"},null,null,null,{"$f":"B120","v":1.2312553130323094}]
["Resr",{"$f":"IF(MODE=1, \">\"&ROUND(B120,2), \"\")","v":">1.23"}]
[]
["Adjustable UVLO?",{"$f":"IF(MODE_UVLO=1, \"YES\", \"NO\")","v":"NO"},{"$f":"IF(MODE_UVLO=1, \"Ruv1\", \"\")","v":""},{"$f":"IF(MODE_UVLO=1, \"Ruv2\", \"\")","v":""},{"$f":"IF(MODE_UVLO=1, \"Rhys\", \"\")","v":""},"Value","Units","BOM display"]
[{"$f":"\"RUV1 = \"&C262","v":"RUV1 = "},{"$f":"'Design Regulator'!E43&\" MΩ\"","v":"1 MΩ"},{"$f":"IF(MODE_UVLO=1,'Design Regulator'!E43&\"MΩ\", \"\")","v":""},null,null,{"$f":"IF(MODE_UVLO=1,'Design Regulator'!E43, \"\")","v":""},{"$f":"IF(MODE_UVLO=1,\"MΩ\", \"\")","v":""},{"$f":"IF(MODE_UVLO=1,'Design Regulator'!E43&\"M\", \"\")","v":""}]
[{"$f":"\"RUV2 = \"&C263","v":"RUV2 = "},{"$f":"IF(D169>=1000, D169/1000&\" MΩ\", D169&\" kΩ\")","v":"64.9 kΩ"},{"$f":"IF(MODE_UVLO=1, IF(D169<1, D169*1000&\"Ω\", IF(D169<1000, D169&\"kΩ\", D169/1000&\"MΩ\")), \"\")","v":""},null,null,{"$f":"IF(MODE_UVLO=1, IF(D169<1, D169*1000, IF(D169<1000, D169, D169/1000)), \"\")","v":""},{"$f":"IF(MODE_UVLO=1, IF(D169<1, \"Ω\", IF(D169<1000,\"kΩ\", \"MΩ\")), \"\")","v":""},{"$f":"IF(MODE_UVLO=1, IF(D169<1, D169*1000, IF(D169<1000, D169&\"k\", D169/1000&\"M\")), \"\")","v":""}]
[{"$f":"\"RHYS = \"&C264","v":"RHYS = "},{"$f":"IF(D170<1000, D170&\" kΩ\", D170&\" MΩ\")","v":"3.32 kΩ"},{"$f":"IF(MODE_UVLO=1, IF(D170<1, D170*1000&\"Ω\", IF(D170<1000, D170&\"kΩ\", D170/1000&\"MΩ\")), \"\")","v":""},null,null,{"$f":"IF(MODE_UVLO=1, IF(D170<1, D170*1000, IF(D170<1000, D170, D170/1000)), \"\")","v":""},{"$f":"IF(MODE_UVLO=1, IF(D170<1, \"Ω\", IF(D170<1000,\"kΩ\", \"MΩ\")), \"\")","v":""},{"$f":"IF(MODE_UVLO=1, IF(D170<1, D170*1000, IF(D170<1000, D170&\"k\", D170&\"M\")), \"\")","v":""}]
[]
[{"$f":"\"Css = \"&Css*1000000000&\"nF\"","v":"Css = 48.6nF"},{"$f":"Css*1000000000&\"nF\"","v":"48.6nF"}]
["Css",{"$f":"CHOOSE(MODE_SS,'Standard Value Calculator'!B4*1000000000&\"nF\",\"\",\"100kΩ\")","v":"47nF"},{"$f":"CHOOSE(MODE_SS,\"Css\",\"\",\"Rss\")","v":"Css"},{"$f":"B267","v":"47nF"}]
[null,null,{"$f":"C267","v":"Css"}]
[]
["Show Rilim resistor ref des?",{"$f":"IF(SHORT_ILIM, \"YES\", \"NO\")","v":"YES"},{"$f":"IF(SHORT_ILIM=1, \"\", \"R3\")","v":""},null,null,{"$f":"SHORT_ILIM","v":1}]
["Rilim",{"$f":"IF(MODE_ILIM=4, \"\", C271&\"kΩ\")","v":""},{"$f":"IF(MODE_ILIM=1, 100, IF(MODE_ILIM=2,56.2, IF(MODE_ILIM=3, 24.9, 0)))","v":0}]
[]
[]
["Rpgood","100kΩ"]
[]
["Full-load efficiency",{"$f":"ROUND('COT Efficiency'!BW106,1)&\"%\"","v":"89.3%"}]
["Full-load efficiency",{"$f":"ROUND('COT Efficiency'!BW107,1)&\"%\"","v":"0%"}]
["10% load efficiency",{"$f":"ROUND('COT Efficiency'!BW16,1)&\"%\"","v":"82%"},"linear scale only"]
["1% load efficiency",{"$f":"ROUND('COT Efficiency'!BW56,1)&\"%\"","v":"88.9%"},"log scale only"]
[]
["Blank out",{"$f":"IF(C281=\"y\",\"\",\"|\")","v":"|"},"n"]
[]
["OUTPUT CURRENT",{"$f":"'Design Regulator'!$E$10&\"mA\"","v":"110mA"}]
[]
["VIN ",2]
["RT",5]
["EN",7]
["PGOOD",6]
["SS",4]
["ILIM",3]
["GND",10]
["FB",8]
["SW",1]
["HYS",9]
[]
[]
[]
[null,"COT RT Resistor"]
[null,null,1.8,3.3,5,12]
[null,100,{"$f":"$C$299/B300/1.6*10000","v":112.50000000000001},{"$f":"$D$299/B300/1.6*10000","v":206.25},{"$f":"$E$299/B300/1.6*10000","v":312.5},{"$f":"$F$299/B300/1.6*10000","v":750}]
[null,200,{"$f":"$C$299/B301/1.6*10000","v":56.250000000000007},{"$f":"$D$299/B301/1.6*10000","v":103.125},{"$f":"$E$299/B301/1.6*10000","v":156.25},{"$f":"$F$299/B301/1.6*10000","v":375}]
[null,300,37.5,68.749999999999986,104.16666666666666,249.99999999999997]
[null,400,28.125000000000004,51.5625,78.125,187.5]
[null,500,22.5,41.249999999999993,62.499999999999993,150]
[null,600,18.75,34.374999999999993,52.083333333333329,124.99999999999999]

{"sheet":"Schematic Mgmt","index":4,"n_rows":2,"n_cols":1,"rows_kept":2,"cut":false,"hidden":true,"merged":[]}
[]
[{"$f":"'Variable Mgmt'!K27","v":"SCH_COT_VOUTAdj_UVLOInt_SSAdj_IlimGND"}]

{"sheet":"Efficiency Plots","index":5,"n_rows":2,"n_cols":1,"rows_kept":2,"cut":false,"hidden":true,"merged":[]}
[]
[{"$f":"IF(PLOT_TYPE=1, \"EFF_LINEAR\", \"EFF_LOG\")","v":"EFF_LINEAR"}]

{"sheet":"PFM Efficiency","index":6,"n_rows":132,"n_cols":68,"rows_kept":132,"cut":false,"hidden":true,"merged":[[0,0,2,4],[1,6,1,7],[3,0,3,4]]}
["LM5165 (PFM) Efficiency Calculator"]
[null,null,null,null,null,null,"TERMS OF USE",null,null,null,null,null,null,null,null,{"$f":"Iripple","v":4.2242796969696975E-2},null,null,null,null,null,null,null,null,null,null,null,null,null,null,null,null,null,null,null,null,null,null,null,null,{"$f":"Ifb","v":9.8832335329341323E-6}]
[]
[null,null,null,null,null,null,null,"Currents",null,null,"Miscellaneous",null,null,null,null,null,"Inductor Loss",null,null,null,"Cout",null,null,"Cin",null,null,"High-side MOSFET Losses ",null,null,null,null,null,null,null,"Low-side MOSFET Losses ",null,null,"Diode",null,null,null,null,null,null,"RESULTS",null,null,null,null,null,null,null,null,null,null,null,null,null,null,null,null,null,null,null,null,"Consolidated Results"]
["Input Parameters",null,null,null,null,null,null,"Step","Iout (A)","Ripple Current pk-pk (A)","Input Current (A)","Off Time (sec)","Burst Mode Low Freq Component (Hz)","Output Charge Time (sec)","Output Discharge Time (sec)","Burst Frequency Duty Cycle","Irms (A)","Inductor DCR Loss @ 25°C (W)","Inductor Core Loss  (W)","Inductor Total Loss (W)","Irms (A)","Cout ESR Loss (W)","Total Cout Loss (W)","Irms (A)","Cin ESR Loss (W)","Total Cin Loss (W)","Irms (A)","Rdson HS Loss @ 25°C (W)","HS Gate Qg Loss (W)     ","SW Rise Time (ns)","SW Fall Time (ns)","HS Switching  Loss (W)","Coss Loss (W)","Total HS FET Loss (W)","Irms (A)","Rdson LS Loss @ 25°C (W)","LS Gate Qg Loss (W)","Leakage Loss (W)","DeadTime Loss @ 25°C (W)","Total LS FET Loss (W)","Quiescent Loss (W)","LDO + Quiescent Loss (W)","Total Gate Drive Loss (W)","Total Power Loss in IC (W)","Total Converter Power Loss (W)","Pout (W)","EFF (%)","High-side MOSFET Rdson %","Low-side MOSFET Rdson %","Gate Drive (Qg) Loss from Vin %","High-side MOSFET Switching Loss %","Leakage Loss %","Low-side MOSFET Deadtime Loss %","Inductor Cu Loss %","Inductor Core Loss %","Cin Cout ESR %","Quiescent Current Loss %","Total Loss %","Overall Eff (%)","Overall Eff","Current (mA)","Keep for \"previous\" data series","Keep for \"previous\" data series","Burst Mode Frequency (kHz)",null,"Total Power Loss in IC (mW)","LDO + Quiescent Loss (mW)","Total Inductor Loss (mW)"]
["Design","Input Value","Units","Std Units","Description",null,null,0.1,{"$f":"IF(PLOT_TYPE=1, H6/100*Iout_maxload_PFM, min_I*EXP(H6*rr/100))","v":1.1E-4},{"$f":"IripplePFM","v":0.24305499999999999},{"$f":"I6*D*P6","v":2.8682861132699138E-8},{"$f":"OffTime","v":1.5450797974779576E-5},{"$f":"1/(N6+O6)","v":40.717846796258861},{"$f":"Cout*Vout_hys/(Ioutmax-I6)","v":2.197749871643684E-5},{"$f":"Cout*Vout_hys/I6","v":2.4537277930573101E-2},{"$f":"N6/(N6+O6)","v":8.9487642570085105E-4},{"$f":"IripplePFM/SQRT(3)*SQRT(P6)","v":4.1978359827840551E-3},{"$f":"Q6^2*Rdcr","v":5.2865480815069716E-6},{"$f":"P6*Fsw^2.5*(IripplePFM/2)^2.5*k_core","v":1.0376921619663318E-7},{"$f":"R6+S6","v":5.3903172977036051E-6},{"$f":"SQRT((((I6*(1-P6)/P6)^2+Ilim^2/12)*P6)+I6^2*(1-P6))","v":4.2199889922601985E-3},{"$f":"RCoutEsr*U6^2","v":2.6712460642195872E-8},{"$f":"V6","v":2.6712460642195872E-8},{"$f":"SQRT((K6^2*(1-D)+(K6-Ilim)^2*D/3))*P6+(K6^2*(1-P6))","v":6.6961921443399363E-5},{"$f":"RCinEsr*X6^2","v":1.3451696770175963E-11},{"$f":"Y6","v":1.3451696770175963E-11},{"$f":"Ilim*SQRT(P6*D/3)","v":2.2384449860957329E-3},{"$f":"RdsonTop*AA6^2","v":1.0021271911554251E-5},{"$f":"QgTop*P6*Vdd*Fsw","v":3.6937304425328488E-7},20,10,{"$f":"Vin*Ilim*Tf/2*Fsw*P6","v":1.1824862390028495E-6},{"$f":"Coss*Vin^2*Fsw*P6/2","v":1.0342445239091977E-7},{"$f":"AB6+AF6+AG6","v":1.130718260294802E-5},{"$f":"Ilim*SQRT(P6*(1-D)/3)","v":3.490746685655069E-3},{"$f":"RdsonBot*AI6^2","v":1.2185312423411849E-5},{"$f":"QgBot*P6*Vdd*Fsw","v":1.5390543510553537E-7},{"$f":"Vin*Idss","v":0},{"$f":"dead1*P6*Ilim*((Ilim)*BDserR+VSD)*Fsw","v":2.7198661604864287E-7},{"$f":"AJ6+AL6+AM6","v":1.2457299039460493E-5},{"$f":"Vin*(Iq_active*(N6+Tsleep)+Iq_sleep*(O6-Tsleep))/(N6+O6)+Vout*Ifb/0.7","v":1.7479018259231618E-4},{"$f":"(Vin-Vdd)*Fsw*(QgBot+QgTop)*P6+AO6","v":1.7552277246341854E-4},{"$f":"AC6+AK6","v":5.232784793588202E-7},{"$f":"AH6+AN6+AP6+AQ6","v":1.9981053258518586E-4},{"$f":"SUM(T6,W6,Z6,AR6)","v":2.0522757579522844E-4},{"$f":"Vout*I6","v":3.6311000000000004E-4},{"$f":"100*AT6/(AT6+AS6)","v":63.889845659409339},{"$f":"AB6/($AT6+$AS6)","v":1.7632604878416322E-2},{"$f":"AJ6/($AT6+$AS6)","v":2.1440272370451548E-2},{"$f":"Vin*Fsw*P6*(QgBot+QgTop)/($AT6+$AS6)","v":2.2097225380601211E-3},{"$f":"(AF6+AG6)/($AT6+$AS6)","v":2.2625825674019513E-3},{"$f":"AL6/(AS6+AT6)","v":0},{"$f":"AM6/($AT6+$AS6)","v":4.7856525352573098E-4},{"$f":"R6/($AT6+$AS6)","v":9.3017746963324315E-3},{"$f":"S6/($AT6+$AS6)","v":1.8258376819698638E-4},{"$f":"(W6+Z6)/($AT6+$AS6)","v":4.7024714671681978E-5},{"$f":"AO6/($AT6+$AS6)","v":0.30754641261884985},{"$f":"SUM(AV6:BE6)","v":0.36110154340590661},{"$f":"AU6/100","v":0.63889845659409339},{"$f":"BG6*100","v":63.889845659409339},{"$f":"I6*1000","v":0.11},47.143854993629823,{"$f":"BJ6/100","v":0.47143854993629825},17.13727728426694,null,{"$f":"1000*AR6","v":0.19981053258518586},{"$f":"1000*AP6","v":0.17552277246341855},{"$f":"1000*T6","v":5.3903172977036052E-3}]
[null,null,null,null,null,null,null,1,1.1000000000000001E-3,0.24305499999999999,2.8682861132699135E-6,1.5450797974779576E-5,{"$f":"1/(N7+O7)","v":403.89616099516712},2.2156101298312633E-5,2.4537277930573101E-3,{"$f":"N7/(N7+O7)","v":8.9487642570085096E-3},1.3274722949408992E-2,{"$f":"Q7^2*Rdcr","v":5.2865480815069728E-5},1.0376921619663317E-6,{"$f":"R7+S7","v":5.3903172977036058E-5},1.3303911866363684E-2,{"$f":"RCoutEsr*U7^2","v":2.6549110642195864E-7},{"$f":"V7","v":2.6549110642195864E-7},{"$f":"SQRT((K7^2*(1-D)+(K7-Ilim)^2*D/3))*P7+(K7^2*(1-P7))","v":6.6961130350618348E-4},{"$f":"RCinEsr*X7^2","v":1.3451378933497507E-9},{"$f":"Y7","v":1.3451378933497507E-9},{"$f":"Ilim*SQRT(P7*D/3)","v":7.0785845730464538E-3},{"$f":"RdsonTop*AA7^2","v":1.002127191155425E-4},{"$f":"QgTop*P7*Vdd*Fsw","v":3.6937304425328489E-6},20,10,{"$f":"Vin*Ilim*Tf/2*Fsw*P7","v":1.1824862390028494E-5},{"$f":"Coss*Vin^2*Fsw*P7/2","v":1.0342445239091976E-6},{"$f":"AB7+AF7+AG7","v":1.1307182602948018E-4},{"$f":"Ilim*SQRT(P7*(1-D)/3)","v":1.1038710261353836E-2},{"$f":"RdsonBot*AI7^2","v":1.2185312423411848E-4},{"$f":"QgBot*P7*Vdd*Fsw","v":1.5390543510553535E-6},0,{"$f":"dead1*P7*Ilim*((Ilim)*BDserR+VSD)*Fsw","v":2.7198661604864291E-6},{"$f":"AJ7+AL7+AM7","v":1.2457299039460491E-4},1.9443561497592854E-4,{"$f":"(Vin-Vdd)*Fsw*(QgBot+QgTop)*P7+AO7","v":2.0176151368695203E-4},{"$f":"AC7+AK7","v":5.232784793588202E-6},{"$f":"AH7+AN7+AP7+AQ7","v":4.4463911490462535E-4},{"$f":"SUM(T7,W7,Z7,AR7)","v":4.9880912412597676E-4},3.6311000000000004E-3,{"$f":"100*AT7/(AT7+AS7)","v":87.922031474928858},{"$f":"AB7/($AT7+$AS7)","v":2.4265114825438385E-2},{"$f":"AJ7/($AT7+$AS7)","v":2.9505037658644984E-2},{"$f":"Vin*Fsw*P7*(QgBot+QgTop)/($AT7+$AS7)","v":3.0409103753026314E-3},{"$f":"(AF7+AG7)/($AT7+$AS7)","v":3.1136537215353611E-3},{"$f":"AL7/(AS7+AT7)","v":0},{"$f":"AM7/($AT7+$AS7)","v":6.5857772622588664E-4},1.2800640214149454E-2,2.5126271081956096E-4,{"$f":"(W7+Z7)/($AT7+$AS7)","v":6.4610681808108703E-5},{"$f":"AO7/($AT7+$AS7)","v":4.7079877336787028E-2},{"$f":"SUM(AV7:BE7)","v":0.12077968525071139},{"$f":"AU7/100","v":0.87922031474928852},{"$f":"BG7*100","v":87.922031474928858},1.1000000000000001,84.462030988011534,{"$f":"BJ7/100","v":0.84462030988011538},18.137277284266901,null,{"$f":"1000*AR7","v":0.44463911490462532},{"$f":"1000*AP7","v":0.20176151368695203},{"$f":"1000*T7","v":5.3903172977036055E-2}]
["Vin",{"$f":"Vin","v":12},"V",{"$f":"B8","v":12},"Vin",null,null,2,2.2000000000000001E-3,0.24305499999999999,1.1473144453079654E-5,1.5450797974779576E-5,{"$f":"1/(N8+O8)","v":800.49830650717558},2.2357984231234084E-5,1.226863896528655E-3,{"$f":"N8/(N8+O8)","v":1.7897528514017019E-2},1.8773293231799569E-2,1.0573096163013946E-4,2.0753843239326634E-6,{"$f":"R8+S8","v":1.0780634595407212E-4},1.8750150449954924E-2,5.2735221284391724E-7,{"$f":"V8","v":5.2735221284391724E-7},1.3391747339465082E-3,5.3801669041221035E-9,{"$f":"Y8","v":5.3801669041221035E-9},1.001063030560726E-2,2.00425438231085E-4,7.3874608850656979E-6,20,10,2.3649724780056989E-5,2.0684890478183951E-6,{"$f":"AB8+AF8+AG8","v":2.2614365205896037E-4},1.5611093762713647E-2,2.4370624846823693E-4,3.078108702110707E-6,0,5.4397323209728581E-6,{"$f":"AJ8+AL8+AM8","v":2.4914598078920976E-4},2.1624770015941144E-4,2.3089949758145842E-4,{"$f":"AC8+AK8","v":1.0465569587176404E-5},{"$f":"AH8+AN8+AP8+AQ8","v":7.1665470001680499E-4},8.2499377835062516E-4,7.2622000000000008E-3,{"$f":"100*AT8/(AT8+AS8)","v":89.79876331689826},{"$f":"AB8/($AT8+$AS8)","v":2.4783063658944688E-2},{"$f":"AJ8/($AT8+$AS8)","v":3.0134834795307763E-2},3.1058198551470878E-3,{"$f":"(AF8+AG8)/($AT8+$AS8)","v":3.1801159379564888E-3},0,6.726353380495212E-4,1.3073875132457028E-2,2.566260164914628E-4,6.5873576712624472E-5,{"$f":"AO8/($AT8+$AS8)","v":2.6739522519950661E-2},{"$f":"SUM(AV8:BE8)","v":0.10201236683101733},0.89798763316898256,{"$f":"BG8*100","v":89.79876331689826},2.2000000000000002,88.347522731946256,{"$f":"BJ8/100","v":0.8834752273194626},19.841529281164359,null,{"$f":"1000*AR8","v":0.71665470001680498},{"$f":"1000*AP8","v":0.23089949758145842},{"$f":"1000*T8","v":0.10780634595407211}]
["Vout",{"$f":"Vout","v":3.3010000000000002},"V",{"$f":"B9","v":3.3010000000000002},"Vout",null,null,3,3.3E-3,0.24305499999999999,2.5814575019429218E-5,1.5450797974779576E-5,1189.8064365360251,2.2563580046839554E-5,8.1790926435243677E-4,2.6846292771025525E-2,2.2992494604776949E-2,1.5859644244520913E-4,3.1130764858989946E-6,1.6170951893110813E-4,2.2884977886026399E-2,7.8558331926587601E-7,7.8558331926587601E-7,2.0086426322545392E-3,1.2103935672331331E-8,1.2103935672331331E-8,1.2260468126189706E-2,3.0063815734662747E-4,1.1081191327598544E-5,20,10,3.5474587170085482E-5,3.1027335717275923E-6,3.3921547808844055E-4,1.9119607022696761E-2,3.6555937270235531E-4,4.6171630531660601E-6,0,8.1595984814592855E-6,3.7371897118381462E-4,2.3804276111075661E-4,2.6002045724382708E-4,1.5698354380764606E-5,9.8865326089684681E-4,1.1511604670828932E-3,1.08933E-2,90.442407360387975,2.4960699415989739E-2,3.0350830051824807E-2,3.1280812135007982E-3,3.2029098229217987E-3,0,6.7745653728194756E-4,1.3167583793283883E-2,2.5846541606466545E-4,6.6228558524332392E-5,1.9763671586728149E-2,9.5575926396120114E-2,0.90442407360387977,90.442407360387975,3.3,89.723560477667675,0.89723560477667674,21.303960092010822,null,0.9886532608968468,0.26002045724382705,0.16170951893110813]
["Iout_maxload",{"$f":"MIN(Iout, ROUND(Ilim/2,3))","v":0.11},"A",{"$f":"B10","v":0.11},"Iout(rated)",null,null,4,4.4000000000000003E-3,0.24305499999999999,4.5892577812318615E-5,1.5450797974779576E-5,1571.8205510817161,2.2772992122669556E-5,6.1343194826432752E-4,3.5795057028034039E-2,2.6549445898817983E-2,2.1146192326027891E-4,4.1507686478653268E-6,2.1561269190814423E-4,2.6333558130110138E-2,1.0401844256878347E-6,1.0401844256878347E-6,2.6779676028423675E-3,2.1514531445619888E-8,2.1514531445619888E-8,1.4157169146092908E-2,4.0085087646217E-4,1.4774921770131396E-5,20,10,4.7299449560113978E-5,4.1369780956367903E-6,4.5228730411792074E-4,2.2077420522707673E-2,4.8741249693647391E-4,6.156217404221414E-6,0,1.0879464641945716E-5,4.9829196157841964E-4,2.5982079782996417E-4,2.8912439267405812E-4,2.0931139174352808E-5,1.2606347975447514E-3,1.4773091884100291E-3,1.4524400000000002E-2,90.767803795109359,2.5050503776965563E-2,3.0460027188189666E-2,3.1393355189101644E-3,3.2144333489703683E-3,0,6.7989391094706723E-4,1.3214958525395518E-2,2.593953307732721E-4,6.6349097126601857E-5,1.6237065351628267E-2,9.2321962048906484E-2,0.90767803795109359,90.767803795109359,4.4000000000000004,90.427928272599317,0.90427928272599312,22.839218285921966,null,1.2606347975447514,0.28912439267405815,0.21561269190814422]
["FB Hysteresis",10,"mV",{"$f":"B11/1000","v":0.01},"FB hysteresis",null,null,5,5.5000000000000005E-3,0.24305499999999999,7.170715283174785E-5,1.5450797974779576E-5,1946.540650144248,2.2986327709995072E-5,4.90745558611462E-4,4.4743821285042548E-2,2.9683182897355005E-2,2.6432740407534856E-4,5.1884608098316593E-6,2.6951586488518019E-4,2.933888809651556E-2,1.2911555321097938E-6,1.2911555321097938E-6,3.3471025466675275E-3,3.3609286373724746E-8,3.3609286373724746E-8,1.5828196289813197E-2,5.0106359557771252E-4,1.8468652212664244E-5,20,10,5.9124311950142474E-5,5.1712226195459878E-6,5.6535913014740097E-4,2.4683306528311643E-2,6.0926562117059218E-4,7.695271755276768E-6,0,1.3599330802432145E-5,6.2286495197302427E-4,2.8158181031703394E-4,3.1821130387215139E-4,2.616392396794101E-5,1.5325993099605179E-3,1.8034399396641815E-3,1.8155500000000001E-2,90.964249879422582,2.5104719844461998E-2,3.0525950927874947E-2,3.1461298903089417E-3,3.2213902523908424E-3,0,6.8136538531319213E-4,1.3243559270903642E-2,2.5995673244753284E-4,6.6374507989316002E-5,1.4108054394083802E-2,9.035750120577421E-2,0.90964249879422576,90.964249879422582,5.5000000000000009,90.856002505810849,0.90856002505810851,24.445889178539353,null,1.532599309960518,0.31821130387215141,0.2695158648851802]
["ILIM",{"$f":"'Variable Mgmt'!B39","v":240.1},"mA",{"$f":"B12/1000","v":0.24010000000000001},"Current limit setting",null,null,6,6.6E-3,0.24305499999999999,1.0325830007771687E-4,1.5450797974779576E-5,2313.966733723621,2.3203698116977365E-5,4.0895463217621838E-4,5.3692585542051051E-2,3.2516297702865779E-2,3.1719288489041826E-4,6.2261529717979893E-6,3.2341903786221627E-4,3.2025996092047392E-2,1.5384966385317521E-6,1.5384966385317521E-6,4.016000694362809E-3,4.838478473136769E-8,4.838478473136769E-8,1.7338920305100529E-2,6.0127631469325483E-4,2.2162382655197089E-5,20,10,7.0949174340170963E-5,6.2054671434551846E-6,6.7843095617688099E-4,2.7039207558741632E-2,7.3111874540471061E-4,9.2343261063321202E-6,0,1.6319196962918571E-5,7.4743794236762924E-4,3.03325798571966E-4,3.4728119083810688E-4,3.1396708761529212E-5,1.8045467981441464E-3,2.129552717429626E-3,2.17866E-2,91.095755481283362,2.5141013347646689E-2,3.0570081820554922E-2,3.150678201379562E-3,3.2260473661968781E-3,0,6.8235042465778612E-4,1.3262705278648529E-2,2.603325478541743E-4,6.635186863088692E-5,1.2682884331596866E-2,8.9042445187166294E-2,0.91095755481283358,91.095755481283362,6.6,91.143744732156421,0.91143744732156418,26.121791295441582,null,1.8045467981441465,0.34728119083810688,0.32341903786221626]
["Tamb",25,"°C",{"$f":"B13","v":25},"Ambient temperature",null,null,7,7.7000000000000011E-3,0.24305499999999999,1.405460195502258E-4,1.5450797974779576E-5,2674.0988018198359,2.342521890231936E-5,3.5053254186532997E-4,6.2641349799059567E-2,3.5121615647418052E-2,3.7005836570548818E-4,7.2638451337643227E-6,3.773222108392525E-4,3.4469384918153198E-2,1.7822077449537108E-6,1.7822077449537108E-6,4.6846156394498469E-3,6.5836871068134289E-8,6.5836871068134289E-8,1.8728174414619242E-2,7.0148903380879758E-4,2.585611309772994E-5,20,10,8.2774036730199466E-5,7.239711667364383E-6,7.9150278220636145E-4,2.9205682146439062E-2,8.5297186963882938E-4,1.0773380457387474E-5,0,1.9039063123405E-5,8.7201093276223442E-4,3.2505276259476044E-4,3.7633405357192482E-4,3.6629493555117414E-5,2.0764772620956383E-3,2.4556475175509128E-3,2.5417700000000005E-2,91.189979904621524,2.5167017824719234E-2,3.0601701826511559E-2,3.1539370890750493E-3,3.2293842115980217E-3,0,6.8305621028894134E-4,1.3276423489230161E-2,2.6060182147804532E-4,6.6301495177721053E-5,1.1661776985705988E-2,8.8100200953784735E-2,0.91189979904621521,91.189979904621524,7.7000000000000011,91.350479962854209,0.91350479962854214,27.863940510836141,null,2.0764772620956382,0.37633405357192484,0.37732221083925249]
["Vdd",5,"V",{"$f":"B14","v":5},"Gate drive rail",null,null,8,8.8000000000000005E-3,0.24305499999999999,1.8357031124927446E-4,1.5450797974779576E-5,3026.9368544328913,2.3651010080116379E-5,3.0671597413216376E-4,7.1590114056068077E-2,3.7546586463599138E-2,4.2292384652055782E-4,8.3015372957306535E-6,4.3122538381628846E-4,3.6717741863897077E-2,2.0222888513756697E-6,2.0222888513756697E-6,5.3529013716573136E-3,8.596065928407225E-8,8.596065928407225E-8,2.0021260611214519E-2,8.0170175292434E-4,2.9549843540262791E-5,20,10,9.4598899120227955E-5,8.2739561912735805E-6,9.0457460823584147E-4,3.1222187525427294E-2,9.748249938729477E-4,1.2312434808442828E-5,0,2.1758929283891432E-5,9.9658392315683905E-4,3.4676270238541721E-4,4.0536989207360508E-4,4.1862278348705616E-5,2.3483907018149912E-3,2.7817243351419395E-3,2.9048800000000003E-2,91.260827795818543,2.5186570742073356E-2,3.0625477092650621E-2,3.1563874656620693E-3,3.2318932050367302E-3,0,6.8358689460446182E-4,1.3286738291446743E-2,2.608042898798712E-4,6.6233577821781756E-5,1.089403048263895E-2,8.7391722041814585E-2,0.91260827795818544,91.260827795818543,8.8000000000000007,91.506224006568289,0.91506224006568293,29.668530022158009,null,2.3483907018149912,0.40536989207360508,0.43122538381628844]
["Izx",4,"mA",{"$f":"B15/1000","v":4.0000000000000001E-3},"Zero cross current (DC test)",null,null,9,9.8999999999999991E-3,0.24305499999999999,2.3233117517486299E-4,1.5450797974779576E-5,3372.4808915627882,2.3881196336669332E-5,2.7263642145081227E-4,8.0538878313076587E-2,3.9824168848226968E-2,4.7578932733562736E-4,9.3392294576969852E-6,4.8512855679332437E-4,3.8804982135439148E-2,2.2587399577976273E-6,2.2587399577976273E-6,6.0208123103644949E-3,1.0875054262990995E-7,1.0875054262990995E-7,2.1235753719139362E-2,9.0191447203988252E-4,3.324357398279564E-5,20,10,1.0642376151025644E-4,9.3082007151827773E-6,1.0176464342653217E-3,3.3116130784061504E-2,1.096678118107066E-3,1.3851489159498184E-5,0,2.4478795444377858E-5,1.1211569135514438E-3,3.6845561794393626E-4,4.3438870634314762E-4,4.7095063142293825E-5,2.6202871173022072E-3,3.1077831645959591E-3,3.2679899999999998E-2,91.316053765474194,2.5201812251767351E-2,3.0644009925515043E-2,3.1582975355421076E-3,3.2338489667844876E-3,0,6.8400056331655034E-4,1.3294778685375094E-2,2.6096211410902675E-4,6.6153779487174204E-5,1.0295598523361302E-2,8.6839462345258148E-2,0.91316053765474192,91.316053765474194,9.8999999999999986,91.627793739029357,0.91627793739029362,31.530928740731923,null,2.6202871173022073,0.43438870634314763,0.48512855679332439]
["Outputs",null,null,null,null,null,null,10,1.1000000000000001E-2,0.24305499999999999,2.868286113269914E-4,1.5450797974779576E-5,3710.7309132095274,2.4115907260083282E-5,2.45372779305731E-4,8.948764257008511E-2,4.1978359827840553E-2,5.2865480815069723E-4,1.0376921619663319E-5,5.390317297703605E-4,4.0755867178600483E-2,2.4915610642195859E-6,2.4915610642195859E-6,6.6883033381908751E-3,1.3420020463096561E-7,1.3420020463096561E-7,2.2384449860957327E-2,1.002127191155425E-3,3.6937304425328494E-5,20,10,1.1824862390028496E-4,1.0342445239091977E-5,1.1307182602948019E-3,3.490746685655069E-2,1.2185312423411848E-3,1.5390543510553539E-5,0,2.7198661604864291E-5,1.245729903946049E-3,3.9013150927031759E-4,4.6339049638055243E-4,5.2327847935882034E-5,2.8921665085572851E-3,3.4338239995964962E-3,3.6311000000000003E-2,91.360324052180076,2.5214030163162853E-2,3.0658866230066979E-2,3.1598286873126386E-3,3.235416746107177E-3,0,6.8433216876593586E-4,1.3301224032494502E-2,2.6108862929594725E-4,6.6065489908250915E-5,9.8159073310848804E-3,8.6396759478199164E-2,0.91360324052180075,91.360324052180076,11.000000000000002,91.725343535721109,0.91725343535721104,33.445700153587367,null,2.8921665085572852,0.46339049638055241,0.53903172977036051]
["Design","Value","Units","Std Units","Description",null,null,11,1.21E-2,0.24305499999999999,3.4706261970565949E-4,1.5450797974779576E-5,4041.6869193731059,2.4355277583539741E-5,2.2306616300521003E-4,9.8436406827093592E-2,4.4027275219109603E-2,5.8152028896576676E-4,1.1414613781629647E-5,5.9293490274739641E-4,4.2589139230884872E-2,2.7207521706415455E-6,2.7207521706415455E-6,7.3553298347523123E-3,1.6230263093399245E-7,1.6230263093399245E-7,2.3477009075593157E-2,1.1023399102709668E-3,4.0631034867861329E-5,20,10,1.3007348629031341E-4,1.1376689763001172E-5,1.2437900863242813E-3,3.6611260106356659E-2,1.3403843665753027E-3,1.6929597861608887E-5,0,2.9918527765350706E-5,1.3703028943406533E-3,4.1179037636456119E-4,4.9237526218581947E-4,5.7560632729470215E-5,3.1640288755802248E-3,3.7598468331291966E-3,3.9942100000000001E-2,91.396614783579935,2.5224045841255621E-2,3.0671044740716118E-2,3.1610838546443048E-3,3.2367019390103064E-3,0,6.8460400356055366E-4,1.3306507629653993E-2,2.6119234058873906E-4,6.5970855087626825E-5,9.4227009596834412E-3,8.6033852164200703E-2,0.91396614783579933,91.396614783579935,12.1,91.805367362427361,0.91805367362427359,35.406642987935072,null,3.1640288755802248,0.49237526218581945,0.59293490274739635]
["On-Time",{"$f":"L*IripplePFM/(Vin-(Rdcr+RdsonTop)*Ioutmax-Vout)*10^6","v":6.353413124569034},"µs",{"$f":"B18/1000000","v":6.353413124569034E-6},"On Time - depends on Vin, Vout, L, Ilim, DCR, etc.",null,null,12,1.32E-2,0.24305499999999999,4.1303320031086754E-4,1.5450797974779576E-5,4365.3489100535262,2.4599447443202287E-5,2.0447731608810919E-4,0.10738517108410212,4.5984989209553899E-2,6.3438576978083652E-4,1.2452305943595982E-5,6.4683807572443253E-4,4.4319395882341059E-2,2.9463132770635044E-6,2.9463132770635044E-6,8.0218477106042217E-3,1.9305012207637857E-7,1.9305012207637857E-7,2.4520936252379413E-2,1.2025526293865099E-3,4.4324765310394184E-5,20,10,1.4189834868034193E-4,1.2410934286910371E-5,1.3568619123537622E-3,3.823921404539353E-2,1.4622374908094219E-3,1.8468652212664244E-5,0,3.2638393925837142E-5,1.4948758847352591E-3,4.3343221922666718E-4,5.2134300375894895E-4,6.2793417523058424E-5,3.4358742183710289E-3,4.085851657494601E-3,4.3573199999999999E-2,91.426913638865727,2.5232407854624255E-2,3.0681212486515737E-2,3.1621317842912074E-3,3.2377749367781738E-3,0,6.8483095636051345E-4,1.3310918864686987E-2,2.612789283573124E-4,6.5871293908681958E-5,9.094436505819729E-3,8.5730863611342592E-2,0.91426913638865726,91.426913638865727,13.2,91.872211787054709,0.91872211787054714,37.406854113512679,null,3.4358742183710289,0.52134300375894893,0.64683807572443253]
["Off Time",{"$f":"L/(Vout+(Rdcr+RdsonBot)*Ioutmax)*IripplePFM*1000000","v":15.450797974779576},"µs",{"$f":"B19/1000000","v":1.5450797974779576E-5},"Off Time - depends on Vout, L, Ilim, DCR, etc.",null,null,13,1.43E-2,0.24305499999999999,4.8474035314261541E-4,1.5450797974779576E-5,4681.7168852507884,2.4848562651792836E-5,1.8874829177363924E-4,0.11633393534111064,4.7862694261672674E-2,6.8725125059590627E-4,1.3489998105562315E-5,7.0074124870146855E-4,4.5958273709133614E-2,3.1682443834854627E-6,3.1682443834854627E-6,8.6878134413920071E-3,2.264343071772949E-7,2.264343071772949E-7,2.5522199635827362E-2,1.3027653485020527E-3,4.8018495752927032E-5,20,10,1.5372321107037044E-4,1.3445178810819569E-5,1.4699337383832429E-3,3.9800635862301752E-2,1.5840906150435402E-3,2.0007706563719601E-5,0,3.5358260086323581E-5,1.6194488751298639E-3,4.550570378566355E-4,5.5029372109994081E-4,6.8026202316646633E-5,3.7077025369296941E-3,4.4118384643218253E-3,4.7204300000000005E-2,91.452598749959989,2.5239496546270151E-2,3.0689831943520866E-2,3.1630201409352369E-3,3.2386845443066288E-3,0,6.8502335002770419E-4,1.331465838094318E-2,2.6135233101342692E-4,6.5767777126706826E-5,8.8161774862561756E-3,8.5474012500400071E-2,0.9145259874995999,91.452598749959989,14.3,91.928895820277532,0.91928895820277534,39.43881309499821,null,3.7077025369296939,0.55029372109994079,0.70074124870146859]
["Duty Cycle",{"$f":"B18/(B18+B19)","v":0.29138468232674736},null,null,"Ton/(Ton+Toff)",null,null,14,1.5400000000000002E-2,0.24305499999999999,5.621840782009033E-4,1.5450797974779576E-5,4990.790844964893,2.5102774988960783E-5,1.7526627093266499E-4,0.12528269959811916,4.9669465181033719E-2,7.4011673141097625E-4,1.4527690267528647E-5,7.5464442167850489E-4,4.7515229066811986E-2,3.386545489907422E-6,3.386545489907422E-6,9.353184102228922E-3,2.6244615855056354E-7,2.6244615855056354E-7,2.6485638255643332E-2,1.4029780676175952E-3,5.1712226195459894E-5,20,10,1.6554807346039896E-4,1.4479423334728769E-5,1.5830055644127229E-3,4.1303071789851889E-2,1.705943739277659E-3,2.1546760914774958E-5,0,3.8078126246810007E-5,1.744021865524469E-3,4.7666483225446615E-4,5.7922741420879495E-4,7.3258987110234855E-5,3.9795138312562223E-3,4.7378072445831854E-3,5.083540000000001E-2,91.474655720819527,2.524558392757412E-2,3.0697233862527162E-2,3.1637830131119749E-3,3.2394656655824966E-3,0,6.8518856720333594E-4,1.3317869673305864E-2,2.6141536520630961E-4,6.5660987180358541E-5,8.5772417301131637E-3,8.5253442791804787E-2,0.91474655720819531,91.474655720819527,15.400000000000002,91.977581799582111,0.91977581799582109,41.494486721232725,null,3.9795138312562224,0.57922741420879498,0.75464442167850487]
["DIL",{"$f":"Ilim*1000+(Vin-Vout)/L*0.0001-Izx*1000+Vout/L*0.0002","v":243.05500000000001},"mA",{"$f":"B21/1000","v":0.24305499999999999},"Inductor pk-pk ripple current",null,null,15,1.6500000000000001E-2,0.24305499999999999,6.4536437548573045E-4,1.5450797974779576E-5,5292.5707891958355,2.5362242509660044E-5,1.6358185287048736E-4,0.13423146385512763,5.1412780908578426E-2,7.9298221222604589E-4,1.5565382429494974E-5,8.0854759465554091E-4,4.8998072045944696E-2,3.601216596329381E-6,3.601216596329381E-6,1.0017917402321186E-2,3.0107600723918899E-7,3.0107600723918899E-7,2.7415240166129652E-2,1.5031907867331371E-3,5.5405956637992721E-5,20,10,1.7737293585042739E-4,1.5513667858637963E-5,1.6960773904422025E-3,4.2752741005832325E-2,1.8277968635117766E-3,2.3085815265830299E-5,0,4.0797992407296426E-5,1.8685948559190731E-3,4.9825560242015897E-4,6.0814408308551126E-4,7.8491771903823024E-5,4.2513081013506098E-3,5.0637579886097196E-3,5.4466500000000008E-2,91.493808090704732,2.5250869684131916E-2,3.0703661050175524E-2,3.164445425471181E-3,3.240143923884413E-3,0,6.8533202753971842E-4,1.33206580824456E-2,2.6147009865929338E-4,6.5551414279360569E-5,8.3697873863656548E-3,8.5061919092952659E-2,0.91493808090704731,91.493808090704732,16.5,92.019859122876866,0.92019859122876868,43.565450767835173,null,4.2513081013506095,0.60814408308551127,0.80854759465554094]
["IL_PEAK",{"$f":"Ilim*1000+(Vin-Vout)/L*0.00012","v":244.84490909090908},"mA",{"$f":"B22/1000","v":0.24484490909090909},"<- PFM peak inductor current - PFM valley inductor current ->",{"$f":"Izx-Vout/L*0.0000002","v":9.9909090909090954E-4},"A",16,1.7600000000000001E-2,0.24305499999999999,7.3428124499709784E-4,1.5450797974779576E-5,5587.0567179436212,2.5627129871850528E-5,1.5335798706608188E-4,0.14318022811213615,5.3098891797635966E-2,8.4584769304111565E-4,1.6603074591461307E-5,8.6245076763257693E-4,5.0413342828734935E-2,3.8122577027513402E-6,3.8122577027513402E-6,1.0681971719860182E-2,3.4231355947167812E-7,3.4231355947167812E-7,2.8314338292185815E-2,1.60340350584868E-3,5.9099687080525583E-5,20,10,1.8919779824045591E-4,1.6547912382547161E-5,1.8091492164716829E-3,4.4154841045415345E-2,1.9496499877458956E-3,2.4624869616885656E-5,0,4.3517858567782865E-5,1.9931678463136785E-3,5.1982934835371412E-4,6.3704372773008985E-4,8.3724556697411232E-5,4.5230853472128631E-3,5.3896906861076628E-3,5.8097600000000006E-2,91.510599006728384,2.5255503716108928E-2,3.0709295776776929E-2,3.1650261635397929E-3,3.2407385541185878E-3,0,6.8545779946639726E-4,1.3323102685593174E-2,2.6151808357281818E-4,6.543941657179779E-5,8.187927736967731E-3,8.4894009932716147E-2,0.91510599006728388,91.510599006728384,17.600000000000001,92.056922219446761,0.92056922219446757,45.643025278963023,null,4.5230853472128629,0.63704372773008988,0.86245076763257689]
["Nominal Sw Freq",{"$f":"1/((OnTime+OffTime)*1000)","v":45.86270034919422},"kHz",{"$f":"B23*1000","v":45862.700349194223},"Switching frequency",null,null,17,1.8700000000000001E-2,0.24305499999999999,8.2893468673500515E-4,1.5450797974779576E-5,5874.2486312082492,2.5897608684951749E-5,1.4433692900337117E-4,0.15212899236914468,5.473308487122408E-2,8.9871317385618551E-4,1.764076675342764E-5,9.1635394060961316E-4,5.1766583875271617E-2,4.0196688091732975E-6,4.0196688091732975E-6,1.134530613720108E-2,3.8614791404043746E-7,3.8614791404043746E-7,2.9185751874538222E-2,1.7036162249642226E-3,6.2793417523058424E-5,20,10,2.0102266063048443E-4,1.7582156906456359E-5,1.9222210425011634E-3,4.5513768378151395E-2,2.0715031119800139E-3,2.6163923967941014E-5,0,4.6237724728269277E-5,2.1177408367082833E-3,5.4138607005513165E-4,6.6592634814253092E-4,8.8957341490999441E-5,4.7948455688429769E-3,5.7156053261758037E-3,6.1728700000000004E-2,91.52544414456662,2.5259600743534269E-2,3.0714277535542248E-2,3.1655396040611026E-3,3.241264276942565E-3,0,6.8556899659138397E-4,1.3325264001309033E-2,2.6156050786071457E-4,6.5325259143914622E-5,8.0271576293486462E-3,8.4745558554333883E-2,0.91525444144566626,91.52544414456662,18.700000000000003,92.089686061935154,0.9208968606193515,47.718418863865701,null,4.7948455688429767,0.66592634814253093,0.91635394060961317]
["Iout_max",{"$f":"1000*(IL_peak+IL_valley)/2","v":122.922},"mA",{"$f":"B24/1000","v":0.122922},"Max output current {= ~IL_PEAK/2}",null,null,18,1.9799999999999998E-2,0.24305499999999999,9.2932470069945195E-4,1.5450797974779576E-5,6154.146528989716,2.6173857880598138E-5,1.3631821072540614E-4,0.16107775662615317,5.63198796953987E-2,9.5157865467125472E-4,1.867845891539397E-5,9.7025711358664874E-4,5.3062541185505838E-2,4.2234499155952549E-6,4.2234499155952549E-6,1.2007880476347224E-2,4.3256758060272257E-7,4.3256758060272257E-7,3.0031890916821777E-2,1.8038289440797646E-3,6.6487147965591279E-5,20,10,2.1284752302051289E-4,1.8616401430365555E-5,2.035292868530643E-3,4.6833281288140946E-2,2.1933562362141329E-3,2.7702978318996367E-5,0,4.8957590888755716E-5,2.2423138271028885E-3,5.6292576752441147E-4,6.9479194432283417E-4,9.419012628458765E-5,5.0665887662409538E-3,6.0415018973238007E-3,6.5359799999999996E-2,91.538667031573766,2.5263250054931758E-2,3.0718714896378414E-2,3.1659969366956767E-3,3.2417325496911422E-3,0,6.8566804228804552E-4,1.3327189132204337E-2,2.6159829609625172E-4,6.5209140064328305E-5,7.8839706359123199E-3,8.4613329684262273E-2,0.91538667031573762,91.538667031573766,19.799999999999997,92.118863379516469,0.92118863379516469,49.782876963860851,null,5.0665887662409537,0.6947919443228342,0.97025711358664879]
["VOUT Hysteresis",{"$f":"Vout/1.223*FB_hys*1000","v":26.991005723630416},"mV",{"$f":"B25/1000","v":2.6991005723630414E-2},"Output hysteresis",null,null,19,2.0900000000000002E-2,0.24305499999999999,1.0354512868904389E-3,1.5450797974779576E-5,6426.750411288026,2.6456064107379204E-5,1.291435680556479E-4,0.17002652088316167,5.7863175839973982E-2,1.0044441354863246E-3,1.9716151077360304E-5,1.024160286563685E-3,5.430531601981041E-2,4.4236010220172151E-6,4.4236010220172151E-6,1.266965533475916E-2,4.8156049890477374E-7,4.8156049890477374E-7,3.0854834817215498E-2,1.9040416631953075E-3,7.0180878408124107E-5,20,10,2.2467238541054138E-4,1.9650645954274753E-5,2.1483646945601237E-3,4.8116622496266824E-2,2.3152093604482506E-3,2.9242032670051715E-5,0,5.1677457049242135E-5,2.3668868174974928E-3,5.8444844076155356E-4,7.236405162709997E-4,9.9422911078175818E-5,5.3383149394067913E-3,6.3673803874913981E-3,6.8990900000000008E-2,91.550523240776741,2.5266522184486526E-2,3.0722693624953636E-2,3.1664070008055717E-3,3.2421524231777844E-3,0,6.8575685091959708E-4,1.3328915287364369E-2,2.6163217865349481E-4,6.5091208234844343E-5,7.7555968336369468E-3,8.4494767592232761E-2,0.91550523240776738,91.550523240776741,20.900000000000002,92.145017611092783,0.92145017611092783,51.8278288042996,null,5.338314939406791,0.72364051627099968,1.024160286563685]
["Tf",20,"ns",{"$f":"B26/1000000000","v":2E-8},"Switch fall time (for MOSFET turn-off loss calculations)",null,null,20,2.2000000000000002E-2,0.24305499999999999,1.1473144453079656E-3,1.5450797974779576E-5,6692.0602781031766,2.6744422151394557E-5,1.226863896528655E-4,0.17897528514017022,5.936636579471001E-2,1.0573096163013942E-3,2.0753843239326637E-5,1.0780634595407208E-3,5.5498481231106213E-2,4.6201221284391729E-6,4.6201221284391729E-6,1.3330592121506949E-2,5.3311405892994942E-7,5.3311405892994942E-7,3.1656392579626394E-2,2.0042543823108501E-3,7.3874608850656989E-5,20,10,2.3649724780056992E-4,2.0684890478183955E-5,2.2614365205896039E-3,4.93666130566233E-2,2.43706248468237E-3,3.0781087021107079E-5,0,5.4397323209728581E-5,2.4914598078920984E-3,6.0595408976655803E-4,7.5247206398702771E-4,1.0465569587176407E-4,5.6100240883404946E-3,6.693240784068584E-3,7.2622000000000006E-2,91.561217342464388,2.5269473590420321E-2,3.0726282371343224E-2,3.1667768717495333E-3,3.2425311420149149E-3,0,6.8583695481455218E-4,1.3330472250344191E-2,2.6166274015138958E-4,6.4971575909332808E-5,7.6398190786085476E-3,8.4387826575355998E-2,0.91561217342464385,91.561217342464388,22.000000000000004,92.168600048761547,0.92168600048761551,53.845027826144907,null,5.6100240883404942,0.75247206398702771,1.0780634595407208]
[null,null,null,null,null,null,null,21,2.3099999999999999E-2,0.24305499999999999,1.2649141759520318E-3,1.5450797974779576E-5,6950.0761294351678,2.7039135384615028E-5,1.1684418062177669E-4,0.18792404939717869,6.0832422745234142E-2,1.1101750971164639E-3,2.1791535401292967E-5,1.1319666325177568E-3,5.664517181461648E-2,4.8130132348611317E-6,4.8130132348611317E-6,1.3990653093783985E-2,5.8721512197182215E-7,5.8721512197182215E-7,3.2438149619132044E-2,2.1044671014263925E-3,7.7568339293189817E-5,20,10,2.4832211019059838E-4,2.1719135002093146E-5,2.3745083466190841E-3,5.0585725347339711E-2,2.5589156089164873E-3,3.2320141372162419E-5,0,5.7117189370214993E-5,2.6160327982867023E-3,6.2744271453942478E-4,7.812865874709179E-4,1.0988848066535224E-4,5.8817162130420566E-3,7.019083073916646E-3,7.6253100000000004E-2,91.570915022503797,2.527214999945852E-2,3.0729536736716304E-2,3.1671122800124387E-3,3.2428745737695993E-3,0,6.85909595038656E-4,1.3331884143484213E-2,2.616904540853659E-4,6.4850327654307255E-5,7.5348416647426494E-3,8.4290849774962054E-2,0.91570915022503796,91.570915022503797,23.099999999999998,92.189976417374325,0.9218997641737432,55.826680785579171,null,5.8817162130420568,0.78128658747091795,1.1319666325177569]
["Components","Input Value","Units","Std Units","Description",null,null,22,2.4199999999999999E-2,0.24305499999999999,1.388250478822638E-3,1.5450797974779576E-5,7200.7979652840004,2.7340416243218749E-5,1.1153308150260502E-4,0.19687281365418718,6.2263969729197684E-2,1.1630405779315335E-3,2.2829227563259294E-5,1.1858698054947928E-3,5.7748156341613129E-2,5.0022743412830889E-6,5.0022743412830889E-6,1.4649801393800378E-2,6.438500426333866E-7,6.438500426333866E-7,3.320150463866009E-2,2.2046798205419349E-3,8.1262069735722658E-5,20,10,2.6014697258062682E-4,2.2753379526002345E-5,2.4875801726485644E-3,5.1776140577978635E-2,2.6807687331506058E-3,3.3859195723217773E-5,0,5.9837055530701412E-5,2.740605788681307E-3,6.489143150801537E-4,8.1008408672267026E-4,1.1512126545894043E-4,6.1533913135114818E-3,7.3449072433901912E-3,7.9884200000000002E-2,91.579751902199192,2.5274588840974239E-2,3.0732502233120605E-2,3.1674179162528688E-3,3.2431875213083301E-3,0,6.8597578745981699E-4,1.3333170712000646E-2,2.6171570803264395E-4,6.4727526881163988E-5,7.4391947319777862E-3,8.4202480978008087E-2,0.91579751902199191,91.579751902199192,24.2,92.20944623676111,0.92209446236761106,57.7655613816029,null,6.1533913135114817,0.81008408672267029,1.1858698054947927]
["L",{"$f":"'Design Regulator'!E18","v":220},"µH",{"$f":"B29/1000000","v":2.2000000000000001E-4},"Filter inductance",null,null,23,2.53E-2,0.24305499999999999,1.5173233539197842E-3,1.5450797974779576E-5,7444.2257856496744,2.7648486738266388E-5,1.0668381708944827E-4,0.20582157791119571,6.3663334784018435E-2,1.2159060587466034E-3,2.3866919725225631E-5,1.239772978471829E-3,5.8809893995852146E-2,5.1879054477050498E-6,5.1879054477050498E-6,1.5308001086073194E-2,7.0300469175365419E-7,7.0300469175365419E-7,3.3947699035851292E-2,2.3048925396574774E-3,8.4955800178255526E-5,20,10,2.7197183497065536E-4,2.3787624049911543E-5,2.6006519986780442E-3,5.2939794648116309E-2,2.8026218573847243E-3,3.5398250074273134E-5,0,6.2556921691187851E-5,2.8651787790759122E-3,6.7036889138874501E-4,8.388645617422851E-4,1.2035405025252865E-4,6.4250493897487701E-3,7.6707132783600581E-3,8.3515300000000001E-2,91.587840061672665,2.5276821047340015E-2,3.0735216472610419E-2,3.1676976569236363E-3,3.2434739538147518E-3,0,6.8603637161132082E-4,1.3334348273729804E-2,2.6173882229468679E-4,6.4603220687757759E-5,7.351663564261062E-3,8.4121599383273446E-2,0.91587840061672665,91.587840061672665,25.3,92.227257154029004,0.92227257154029008,59.655105160909137,null,6.4250493897487697,0.83886456174228508,1.239772978471829]
["Rdcr",{"$f":"'Design Regulator'!E19","v":300},"mW",{"$f":"B30/1000","v":0.3},"Inductor DCR at 25°C","LPS5030-105",null,24,2.64E-2,0.24305499999999999,1.6521328012434704E-3,1.5450797974779576E-5,7680.3595905321909,2.7963579001295473E-5,1.022386580440546E-4,0.21477034216820426,6.5032595405731572E-2,1.2687715395616739E-3,2.4904611887191967E-5,1.2936761514488659E-3,5.9832580612500227E-2,5.3699065541270074E-6,5.3699065541270074E-6,1.5965217195130811E-2,7.6466448026310153E-7,7.6466448026310153E-7,3.4677840610201065E-2,2.4051052587730202E-3,8.8649530620788368E-5,20,10,2.8379669736068391E-4,2.4821868573820745E-5,2.7137238247075248E-3,5.4078415117483278E-2,2.9244749816188438E-3,3.6937304425328488E-5,0,6.5276787851674297E-5,2.9897517694705182E-3,6.918064434651988E-4,8.6762801252976245E-4,1.2558683504611685E-4,6.6966904417539224E-3,7.996501164237179E-3,8.7146399999999999E-2,91.595272935356988,2.5278872405007806E-2,3.0737710810085229E-2,3.1679547335894723E-3,3.2437371801576913E-3,0,6.8609204736139455E-4,1.3335430431866907E-2,2.6176006388749099E-4,6.4477443501544218E-5,7.2712355309724223E-3,8.4047270646429972E-2,0.91595272935356986,91.595272935356988,26.4,92.243615707125457,0.92243615707125459,61.489483479942351,null,6.6966904417539226,0.8676280125297624,1.2936761514488659]
["Kcore",5.0000000000000002E-14,null,{"$f":"B31","v":5.0000000000000002E-14},"Core loss constant - consult inductor vendor",null,null,25,2.75E-2,0.24305499999999999,1.7926788207936956E-3,1.5450797974779576E-5,7909.1993799315469,2.8285935867651497E-5,9.8149111722292413E-5,0.22371910642521273,6.6373614747044951E-2,1.3216370203767429E-3,2.5942304049158294E-5,1.3475793244259013E-3,6.0818186208561914E-2,5.548277660548966E-6,5.548277660548966E-6,1.66214157436478E-2,8.2881438396954894E-7,8.2881438396954894E-7,3.5392922865232268E-2,2.5053179778885622E-3,9.2343261063321195E-5,20,10,2.9562155975071234E-4,2.5856113097729937E-5,2.8267956507370042E-3,5.519355130676918E-2,3.0463281058529619E-3,3.8476358776383835E-5,0,6.7996654012160716E-5,3.1143247598651226E-3,7.1322697130951466E-4,8.9637443908510174E-4,1.3081961983970502E-4,6.9683144695269327E-3,8.3222708859973533E-3,9.0777500000000011E-2,91.602129034615899,2.5280764581894301E-2,3.0740011592533392E-2,3.1681918616792196E-3,3.2439799807233113E-3,0,6.8614340279739771E-4,1.333642861694535E-2,2.617796571800541E-4,6.4350219859283129E-5,7.1970597402288491E-3,8.397870965384116E-2,0.91602129034615898,91.602129034615899,27.5,92.258695515072404,0.92258695515072409,63.263655392098094,null,6.9683144695269323,0.89637443908510173,1.3475793244259013]
["Cin",{"$f":"'Design Regulator'!E30","v":4.7},"µF",{"$f":"B32/1000000","v":4.6999999999999999E-6},"Input capacitance",null,null,26,2.86E-2,0.24305499999999999,1.9389614125704614E-3,1.5450797974779576E-5,8130.7451538477453,2.8615811500636555E-5,9.4374145886819621E-5,0.23266787068222125,6.7688071356574411E-2,1.3745025011918128E-3,2.6979996211124624E-5,1.4014824974029373E-3,6.176848585360728E-2,5.723018766970924E-6,5.723018766970924E-6,1.7276563791026541E-2,8.9543896927622808E-7,8.9543896927622808E-7,3.6093840866580719E-2,2.6055306970041046E-3,9.6036991505854064E-5,20,10,3.0744642214074083E-4,2.6890357621639135E-5,2.9398674767664849E-3,5.6286599027540116E-2,3.16818123008708E-3,4.0015413127439196E-5,0,7.0716520172647149E-5,3.2388977502597273E-3,7.3463047492169301E-4,9.2510384140830353E-4,1.3605240463329327E-4,7.2399214730678087E-3,8.6480224282069924E-3,9.4408600000000009E-2,91.608474812735579,2.5282515918074185E-2,3.0742141120471425E-2,3.1684113395757129E-3,3.2442047088753674E-3,0,6.861909356859707E-4,1.3337352503953265E-2,2.6179779208191956E-4,6.4221566555393482E-5,7.1284159873710529E-3,8.39152518726443E-2,0.91608474812735574,91.608474812735579,28.6,92.272643585130709,0.92272643585130709,64.973397391543287,null,7.2399214730678088,0.92510384140830348,1.4014824974029374]
["RCinESR",{"$f":"'Design Regulator'!E31","v":3},"mW",{"$f":"B33/1000","v":3.0000000000000001E-3},"Input capacitor ESR",null,null,27,2.9700000000000001E-2,0.24305499999999999,2.0909805765737667E-3,1.5450797974779576E-5,8344.9969122807834,2.8953472059846832E-5,9.0878807150270754E-5,0.24161663493922975,6.8977483814330845E-2,1.427367982006882E-3,2.8017688373090954E-5,1.4553856703799729E-3,6.268508527229788E-2,5.8941298733928855E-6,5.8941298733928855E-6,1.7930629472440916E-2,9.6452241983390049E-7,9.6452241983390049E-7,3.6781404378569124E-2,2.7057434161196479E-3,9.9730721948386919E-5,20,10,3.1927128453076932E-4,2.7924602145548333E-5,3.0529393027959656E-3,5.7358821068090288E-2,3.2900343543211981E-3,4.1554467478494543E-5,0,7.3436386333133568E-5,3.3634707406543316E-3,7.5601695430173354E-4,9.5381621949936759E-4,1.4128518942688146E-4,7.5115114523765462E-3,8.9737557750497465E-3,9.8039700000000007E-2,91.614366894278007,2.5284142041046894E-2,3.0744118396074369E-2,3.1686151257211636E-3,3.2444133699050825E-3,0,6.8623507017194474E-4,1.333821033690675E-2,2.6181463041419971E-4,6.409149432239795E-5,7.0646905926572204E-3,8.385633105722004E-2,0.9161436689427801,91.614366894278007,29.7,92.285585223360243,0.92285585223360245,66.615311912313558,null,7.5115114523765465,0.95381621949936757,1.4553856703799728]
["Cout",{"$f":"'Design Regulator'!E25","v":100},"µF",{"$f":"B34/1000000","v":1E-4},"Output capacitance",null,null,28,3.0800000000000004E-2,0.24305499999999999,2.2487363128036128E-3,1.5450797974779576E-5,8551.9546552306656,2.9299196417392603E-5,8.7633135466332494E-5,0.25056539919623827,7.0243231294836103E-2,1.4802334628219527E-3,2.9055380535057291E-5,1.50928884335701E-3,6.3569442238729998E-2,6.0616109798148455E-6,6.0616109798148455E-6,1.8583582038357069E-2,1.0360485641290424E-6,1.0360485641290424E-6,3.7456348829238484E-2,2.8059561352351903E-3,1.0342445239091976E-4,20,10,3.3109614692079786E-4,2.8958846669457532E-5,3.1660111288254458E-3,5.8411364292878125E-2,3.4118874785553175E-3,4.3093521829549897E-5,0,7.615625249362E-5,3.4880437310489377E-3,7.7738640944963644E-4,9.8251157335829393E-4,1.4651797422046966E-4,7.7830844074531468E-3,9.2994709103541E-3,0.10167080000000002,91.61985382745749,2.5285656349365363E-2,3.0745959711241635E-2,3.1688048992256448E-3,3.2446076830894744E-3,0,6.8627616990447676E-4,1.3339009183979914E-2,2.6183031091750057E-4,6.3960009160269959E-5,7.0053574085408681E-3,8.3801461725425158E-2,0.91619853827457487,91.61985382745749,30.800000000000004,92.297627896528766,0.92297627896528767,68.186816296537415,null,7.7830844074531464,0.98251157335829398,1.50928884335701]
["RCoutESR",{"$f":"'Design Regulator'!E27","v":1.5},"mW",{"$f":"B35/1000","v":1.5E-3},"Output capacitor ESR",null,null,29,3.1899999999999998E-2,0.24305499999999999,2.4122286212599968E-3,1.5450797974779576E-5,8751.6183826973847,2.9653276926051296E-5,8.4611303208872771E-5,0.25951416345324674,7.1486570851618039E-2,1.5330989436370217E-3,3.0093072697023614E-5,1.5631920163340454E-3,6.4422884579093481E-2,6.2254620862368006E-6,6.2254620862368006E-6,1.9235391894545407E-2,1.1100009040102295E-6,1.1100009040102295E-6,3.8119344527094978E-2,2.9061688543507319E-3,1.071181828334526E-4,20,10,3.429210093108263E-4,2.9993091193366724E-5,3.2790829548549247E-3,5.9445274015597196E-2,3.5337406027894352E-3,4.4632576180605251E-5,0,7.8876118654106405E-5,3.6126167214435415E-3,7.9873884036540162E-4,1.0111899029850826E-3,1.5175075901405785E-4,8.0546403382976053E-3,9.6251678176218977E-3,0.1053019,91.624977474500525,2.5287070396353795E-2,3.0747679114176463E-2,3.1689821079546876E-3,3.2447891309292905E-3,0,6.8631454845150268E-4,1.33397551399284E-2,2.6184495322527845E-4,6.3827113399322929E-5,6.9499627505760662E-3,8.3750225254994801E-2,0.91624977474500524,91.624977474500525,31.9,92.308864297653088,0.92308864297653093,69.686114572778393,null,8.054640338297606,1.0111899029850826,1.5631920163340454]
["Controller",null,"Units","Std Units","Description",null,null,30,3.3000000000000002E-2,0.24305499999999999,2.5814575019429218E-3,1.5450797974779576E-5,8943.9880946809481,3.0016020243800643E-5,8.179092643524368E-5,0.26846292771025526,7.2708652040228139E-2,1.5859644244520913E-3,3.1130764858989947E-5,1.6170951893110814E-3,6.5246625418018164E-2,6.385683192658761E-6,6.385683192658761E-6,1.988603064259736E-2,1.1863626441549634E-6,1.1863626441549634E-6,3.8771004458656173E-2,3.0063815734662738E-3,1.1081191327598544E-4,20,10,3.5474587170085479E-4,3.1027335717275925E-5,3.3921547808844045E-3,6.0461506159072427E-2,3.6555937270235529E-3,4.6171630531660598E-5,0,8.1595984814592851E-5,3.7371897118381459E-3,8.2007424704902919E-4,1.0398512083797337E-3,1.5698354380764605E-4,8.3261792449099304E-3,9.9508464800578261E-3,0.10893300000000002,91.629774124336535,2.5288394197192962E-2,3.0749288782784802E-2,3.1691480070133011E-3,3.2449589985536192E-3,0,6.8635047763431986E-4,1.3340453488087036E-2,2.6185866104367657E-4,6.3692806558743851E-5,6.8981133377661406E-3,8.3702258756634604E-2,0.91629774124336538,91.629774124336535,33,92.319374800396361,0.92319374800396359,71.112154808729358,null,8.3261792449099303,1.0398512083797338,1.6170951893110814]
["Deadtime1",30,"ns",{"$f":"B37/1000000000","v":2.9999999999999997E-8},"PMOS off to NMOS on deadtime",null,null,31,3.4099999999999998E-2,0.24305499999999999,2.7564229548523861E-3,1.5450797974779576E-5,9129.0637911813519,3.0387748219619473E-5,7.9152509453461625E-5,0.27741169196726373,7.3910529364161218E-2,1.6388299052671614E-3,3.2168457020956277E-5,1.6709983622881176E-3,6.6041776167719363E-2,6.5422742990807172E-6,6.5422742990807172E-6,2.0535471120959638E-2,1.2651167224793019E-6,1.2651167224793019E-6,3.9411890925086408E-2,3.1065942925818167E-3,1.1450564371851827E-4,20,10,3.6657073409088322E-4,3.2061580241185114E-5,3.5052266069138852E-3,6.1460937604771962E-2,3.7774468512576723E-3,4.7710684882715945E-5,0,8.431585097507927E-5,3.8617627022327515E-3,8.4139262950051882E-4,1.0684954895422468E-3,1.6221632860123422E-4,8.5977011272901169E-3,1.0276506880599794E-2,0.1125641,91.63427539023111,2.5289636476653072E-2,3.0750799325904698E-2,3.1693036897919077E-3,3.2451184055084991E-3,0,6.8638419425128439E-4,1.334110883105692E-2,2.6187152471677215E-4,6.3557086046870057E-5,6.8494665637588922E-3,8.3657246097688903E-2,0.91634275390231112,91.63427539023111,34.1,92.329229439893751,0.92329229439893756,72.464575024486365,null,8.5977011272901169,1.0684954895422469,1.6709983622881177]
["Deadtime2",30,"ns",{"$f":"B38/1000000000","v":2.9999999999999997E-8},"PMOS off to NMOS on deadtime - not relevant in PFM",null,null,32,{"$f":"IF(PLOT_TYPE=1, H38/100*Iout_maxload_PFM, min_I*EXP(H38*rr/100))","v":3.5200000000000002E-2},{"$f":"IripplePFM","v":0.24305499999999999},{"$f":"I38*D*P38","v":2.9371249799883914E-3},1.5450797974779576E-5,9306.8454721985981,{"$f":"Cout*Vout_hys/(Ioutmax-I38)","v":3.0768798845934221E-5},{"$f":"Cout*Vout_hys/I38","v":7.667899353304094E-5},0.28636045622427231,{"$f":"IripplePFM/SQRT(3)*SQRT(P38)","v":7.5093172927198276E-2},1.6916953860822313E-3,{"$f":"P38*Fsw^2.5*(IripplePFM/2)^2.5*k_core","v":3.3206149182922614E-5},1.7249015352651539E-3,{"$f":"SQRT((((I38*(1-P38)/P38)^2+Ilim^2/12)*P38)+I38^2*(1-P38))","v":6.6809357655459603E-2},6.6952354055026779E-6,6.6952354055026779E-6,2.1183687446497963E-2,1.3462458414927463E-6,1.3462458414927463E-6,4.0042521222429038E-2,3.20680701169736E-3,1.1819937416105117E-4,20,10,3.7839559648091182E-4,3.3095824765094322E-5,3.6182984329433659E-3,6.2444375050854588E-2,3.8992999754917908E-3,4.9249739233771312E-5,0,8.703571713556573E-5,3.9863356926273562E-3,{"$f":"Vin*(Iq_active*(N38+Tsleep)+Iq_sleep*(O38-Tsleep))/(N38+O38)+Vout*Ifb/0.7","v":8.6269398771987094E-4},1.0971227464726225E-3,1.6744911339482246E-4,8.8692059854381684E-3,1.0602149001950318E-2,{"$f":"Vout*I38","v":0.11619520000000001},91.638508939341278,2.5290804870439637E-2,3.0752220028131768E-2,3.1694501131990741E-3,3.2452683315932476E-3,0,6.8641590554252823E-4,{"$f":"R38/($AT38+$AS38)","v":1.3341725196921984E-2},{"$f":"S38/($AT38+$AS38)","v":2.6188362331149251E-4},6.3419947737801158E-5,6.8037225897096742E-3,8.3614910606587198E-2,0.91638508939341279,91.638508939341278,{"$f":"I38*1000","v":35.200000000000003},92.338489523289027,0.92338489523289025,73.743640691099685,null,8.8692059854381675,1.0971227464726225,1.7249015352651538]
["Sleep Delay",1,"µs",{"$f":"B39/1000000","v":9.9999999999999995E-7},"Delay time to enter sleep mode",null,null,33,3.6299999999999999E-2,0.24305499999999999,3.1235635773509355E-3,{"$f":"OffTime","v":1.5450797974779576E-5},9477.3331377326831,3.1159527283635121E-5,7.4355387668403349E-5,0.29530922048128078,7.6257477598316012E-2,{"$f":"Q39^2*Rdcr","v":1.7445608668973003E-3},3.4243841344888944E-5,1.7788047082421892E-3,6.7550309705308453E-2,6.8445665119246337E-6,6.8445665119246337E-6,{"$f":"SQRT((K39^2*(1-D)+(K39-Ilim)^2*D/3))*P39+(K39^2*(1-P39))","v":2.1830655056601214E-2},1.4297325006009246E-6,1.4297325006009246E-6,{"$f":"Ilim*SQRT(P39*D/3)","v":4.0663372528682996E-2},{"$f":"RdsonTop*AA39^2","v":3.307019730812902E-3},{"$f":"QgTop*P39*Vdd*Fsw","v":1.2189310460358397E-4},20,10,{"$f":"Vin*Ilim*Tf/2*Fsw*P39","v":3.9022045887094026E-4},{"$f":"Coss*Vin^2*Fsw*P39/2","v":3.4130069289003517E-5},3.7313702589728457E-3,{"$f":"Ilim*SQRT(P39*(1-D)/3)","v":6.3412562633329284E-2},{"$f":"RdsonBot*AI39^2","v":4.0211530997259094E-3},{"$f":"QgBot*P39*Vdd*Fsw","v":5.078879358482666E-5},{"$f":"Vin*Idss","v":0},{"$f":"dead1*P39*Ilim*((Ilim)*BDserR+VSD)*Fsw","v":8.9755583296052149E-5},4.1109086830219618E-3,8.8397832170708545E-4,{"$f":"(Vin-Vdd)*Fsw*(QgBot+QgTop)*P39+AO39","v":1.1257329791708604E-3},1.7268189818841063E-4,9.1406938193540777E-3,1.0927772826608792E-2,0.1198263,91.642499089798946,2.5291906089979287E-2,3.0753559050189637E-2,{"$f":"Vin*Fsw*P39*(QgBot+QgTop)/($AT39+$AS39)","v":3.1695881183124927E-3},3.2454096380054587E-3,0,6.8644579366239572E-4,1.3342306126178869E-2,2.618950263239543E-4,6.3281386450562E-5,6.7606178729079994E-3,8.3575009102010656E-2,0.91642499089798946,91.642499089798946,36.299999999999997,92.347208948299397,0.92347208948299397,74.950176722447694,null,9.1406938193540785,1.1257329791708603,1.7788047082421892]
["IQ (active)",205,"µA",{"$f":"B40/1000000","v":2.05E-4},"LM5165 quiescent current - active state ",null,null,34,3.7400000000000003E-2,0.24305499999999999,3.3157387469400198E-3,1.5450797974779576E-5,9640.5267877836122,3.1560306966196314E-5,7.2168464501685587E-5,0.3042579847382893,7.7404270935402739E-2,1.7974263477123699E-3,3.5281533506855281E-5,1.8327078812192252E-3,6.8265499428562471E-2,6.9902676183465939E-6,6.9902676183465939E-6,2.2476350751836221E-2,1.515559029358706E-6,1.515559029358706E-6,4.1274886129027931E-2,3.4072324499284444E-3,1.2558683504611685E-4,20,10,4.0204532126096875E-4,3.5164313812912712E-5,3.8444420850023259E-3,6.4366188515089406E-2,4.143006223960027E-3,5.232784793588202E-5,0,9.2475449456538554E-5,4.2354816734165657E-3,9.0524563146216202E-4,1.1543261876369604E-3,1.7791468298199886E-4,9.4121646290378502E-3,1.1253378336904781E-2,0.12345740000000001,91.646267302560858,2.5292946058162694E-2,3.0754823593985774E-2,3.1697184473903342E-3,3.2455430847592791E-3,0,6.8647401936363381E-4,1.3342854743345765E-2,2.6190579508506711E-4,6.3141396350874482E-5,6.7199198359480109E-3,8.3537326974391438E-2,0.91646267302560858,91.646267302560858,37.400000000000006,92.355435289750346,0.92355435289750343,76.085496631192584,null,9.41216462903785,1.1543261876369604,1.8327078812192252]
["IQ (sleep)",10.5,"µA",1.0499999999999999E-5,"LM5165 quiescent current - sleep state",null,null,35,3.85E-2,0.24305499999999999,3.5136504887556441E-3,1.5450797974779576E-5,9796.4264223513801,3.197153079011444E-5,7.0106508373066011E-5,0.31320674899529782,7.8534320067247032E-2,1.8502918285274398E-3,3.6319225668821611E-5,1.8866110541962615E-3,6.8955728429036522E-2,7.1323387247685542E-6,7.1323387247685542E-6,2.3120752739162191E-2,1.603707621676428E-6,1.603707621676428E-6,4.1877471085560947E-2,3.5074451690439864E-3,1.2928056548864968E-4,20,10,4.1387018365099729E-4,3.6198558336821914E-5,3.9575139110318049E-3,6.5305890608689715E-2,4.2648593481941473E-3,5.3866902286937374E-5,0,9.5195315617025E-5,4.3600546638111722E-3,9.2649591698510119E-4,1.1829023718709232E-3,1.8314746777558705E-4,9.6836184144894859E-3,1.1578965515032192E-2,0.12708849999999999,91.649832589045943,2.5293930021846139E-2,3.0756020039407278E-2,3.1698417579699642E-3,3.2456693451214029E-3,0,6.8650072505078996E-4,1.3343373816310646E-2,2.6191598392547559E-4,6.2999971291016039E-5,6.6814224486180206E-3,8.3501674109540736E-2,0.91649832589045943,91.649832589045943,38.5,92.36321070035909,0.92363210700359089,77.151331197989634,null,9.6836184144894855,1.1829023718709231,1.8866110541962615]
["High-side P-ch MOSFET",null,"Units","Std Units","Description",null,null,36,3.9599999999999996E-2,0.24305499999999999,3.7172988027978078E-3,1.5450797974779576E-5,9945.0320414359921,3.2393612399642844E-5,6.8159105362703069E-5,0.32215551325230635,7.9648337696453936E-2,1.9031573093425094E-3,3.7356917830787941E-5,1.9405142271732975E-3,6.9621739091515131E-2,7.2707798311905097E-6,7.2707798311905097E-6,2.3763840675712786E-2,1.6941603709819844E-6,1.6941603709819844E-6,4.2471507438278724E-2,3.6076578881595301E-3,1.3297429593118256E-4,20,10,4.2569504604102578E-4,3.7232802860731109E-5,4.0705857370612868E-3,6.6232261568123008E-2,4.3867124724282641E-3,5.5405956637992735E-5,0,9.7915181777511433E-5,4.4846276542057752E-3,9.4772917827590241E-4,1.2114615318727477E-3,1.883802525691753E-4,9.9550551757089864E-3,1.1904534343084456E-2,0.13071959999999999,91.653211850914431,2.5294862645625294E-2,3.0757154058344456E-2,3.1699586346197006E-3,3.2457890176439369E-3,0,6.8652603732531712E-4,1.3343865805799998E-2,2.6192564114657711E-4,6.285710509980871E-5,6.6449425452506242E-3,8.3467881490855697E-2,0.91653211850914429,91.653211850914431,39.599999999999994,92.370572661788287,0.92370572661788286,78.149758631970101,null,9.9550551757089867,1.2114615318727477,1.9405142271732976]
["RdsonTop",2000,"mW",{"$f":"B43/1000","v":2},"Drain-source Resistance of High-side MOSFET @ Vdd, 25°C",null,null,37,4.07E-2,0.24305499999999999,3.9266836890665124E-3,1.5450797974779576E-5,10086.343645037443,3.2826987574652055E-5,6.631696737992731E-5,0.33110427750931487,8.0746987356754882E-2,1.9560227901575795E-3,3.8394609992754278E-5,1.9944174001503339E-3,7.0264220091558541E-2,7.4055909376124687E-6,7.4055909376124687E-6,2.4405595713152744E-2,1.786899306341579E-6,1.786899306341579E-6,4.3057349008473987E-2,3.7078706072750716E-3,1.3666802637371541E-4,20,10,4.3751990843105432E-4,3.8267047384640311E-5,4.1836575630907662E-3,6.7145853160581581E-2,4.5085655966623835E-3,5.6945010989048082E-5,0,1.0063504793799787E-4,4.6092006446003817E-3,9.6894541533456603E-4,1.240003667642435E-3,1.936130373627635E-4,1.0226474912696345E-2,1.2230084803090633E-2,0.13435070000000002,91.656420164812246,2.5295748090420182E-2,3.0758230710246005E-2,3.1700695987871034E-3,3.245902636248286E-3,0,6.8655006911844552E-4,1.3344332906834983E-2,2.6193480983426097E-4,6.2712791832181711E-5,6.6103167385561431E-3,8.3435798351877574E-2,0.91656420164812247,91.656420164812246,40.700000000000003,92.377554614223854,0.92377554614223856,79.083137810464862,null,10.226474912696345,1.2400036676424351,1.9944174001503339]
["FOM",null,"mΩ*nC",null,"FOM",null,null,38,4.1800000000000004E-2,0.24305499999999999,4.1418051475617555E-3,1.5450797974779576E-5,10220.361233155736,3.327211573140506E-5,6.4571784027823948E-5,0.34005304176632339,8.1830888034870417E-2,2.0088882709726492E-3,3.9432302154720608E-5,2.04832057312737E-3,7.0883811240811209E-2,7.5367720440344304E-6,7.5367720440344304E-6,2.5046000542614594E-2,1.8819064295419516E-6,1.8819064295419516E-6,4.3635325863287736E-2,3.8080833263906149E-3,1.4036175681624827E-4,20,10,4.4934477082108281E-4,3.9301291908549513E-5,4.2967293891202473E-3,6.8047180109806912E-2,4.6304187208965012E-3,5.8484065340103443E-5,0,1.033549140984843E-4,4.7337736349949856E-3,9.9014462816109225E-4,1.2685287791799845E-3,1.9884582215635172E-4,1.0497877625451568E-2,1.2555616877052514E-2,0.13798180000000002,91.659471022206418,2.5296590079666153E-2,3.0759254522603335E-2,3.1701751170940384E-3,3.2460106787186413E-3,0,6.8657292148766383E-4,1.3344777083649282E-2,2.6194352854430803E-4,6.2567025985764321E-5,6.5773988201867899E-3,8.3405289777935987E-2,0.91659471022206418,91.659471022206418,41.800000000000004,92.384186486797105,0.92384186486797104,79.95404580207925,null,10.497877625451569,1.2685287791799846,2.0483205731273699]
["QgTop",1.8,"nC",{"$f":"B45/1000000000","v":1.8E-9},"Gate Charge of High-side MOSFET @ Vdd",null,null,39,4.2900000000000001E-2,0.24305499999999999,4.3626631782835382E-3,1.5450797974779576E-5,10347.08480579087,3.3729481547112558E-5,6.2916097257879747E-5,0.34900180602333186,8.2900618248352431E-2,2.0617537517877193E-3,4.0469994316686938E-5,2.102223746104406E-3,7.1481107762617416E-2,7.6643231504563855E-6,7.6643231504563855E-6,2.5685039440219826E-2,1.9791637531369438E-6,1.9791637531369438E-6,4.4205746490168882E-2,3.9082960455061565E-3,1.440554872587811E-4,20,10,4.6116963321111125E-4,4.0335536432458701E-5,4.4098012151497267E-3,6.8936723487054569E-2,4.7522718451306206E-3,6.002311969115879E-5,0,1.0607478025897072E-4,4.8583466253895912E-3,1.0113268167554804E-3,1.2970368664853961E-3,2.0407860694993989E-4,1.0769263313974655E-2,1.2881130546982655E-2,0.14161290000000001,91.662376532363552,2.5297391955332656E-2,3.0760229559066512E-2,3.1702756083569696E-3,3.2461135738902154E-3,0,6.8659468513712358E-4,1.3345200099240898E-2,2.6195183188246061E-4,6.2419802690439114E-5,6.5460575607672374E-3,8.33762346763645E-2,0.91662376532363554,91.662376532363552,42.9,92.390495146604792,0.9239049514660479,80.765220518524714,null,10.769263313974655,1.2970368664853962,2.1022237461044058]
["Coss",35,"pF",{"$f":"B46/1000000000000","v":3.5000000000000002E-11},"Coss",null,null,40,4.4000000000000004E-2,0.24305499999999999,4.5892577812318624E-3,1.5450797974779576E-5,10466.514362942844,3.4199596720344668E-5,6.134319482643275E-5,0.35795057028034044,8.3956719655681106E-2,2.1146192326027889E-3,4.1507686478653274E-5,2.156126919081442E-3,7.2056664077092103E-2,7.7882442568783434E-6,7.7882442568783434E-6,2.6322698313187304E-2,2.0786533394612212E-6,2.0786533394612212E-6,4.4768899721914654E-2,4.0085087646217002E-3,1.4774921770131398E-4,20,10,4.7299449560113984E-4,4.1369780956367909E-5,4.5228730411792078E-3,6.9814933713101379E-2,4.8741249693647392E-3,6.1562174042214157E-5,0,1.0879464641945716E-4,4.9829196157841959E-3,1.0324919811177311E-3,1.3255279295586704E-3,2.0931139174352814E-4,1.1040631978265601E-2,1.3206625794943382E-2,0.14524400000000001,91.665147594914174,2.5298156725548401E-2,3.0761159477353646E-2,3.170371449555353E-3,3.2462117077604034E-3,0,6.866154417102283E-4,1.3345603540495908E-2,2.6195975099757481E-4,6.2271117875600367E-5,6.5161748395611624E-3,8.3348524050858269E-2,0.91665147594914176,91.665147594914174,44.000000000000007,92.396504780537882,0.9239650478053788,81.519509019961532,null,11.040631978265601,1.3255279295586704,2.1561269190814421]
["Low-side N-ch MOSFET",null,"Units","Std Units","Description",null,null,41,4.5099999999999994E-2,0.24305499999999999,4.8215889564067237E-3,1.5450797974779576E-5,10578.649904611661,3.4683001880741195E-5,5.9847019342861234E-5,0.36689933453734885,8.4999700262566771E-2,2.1674847134178581E-3,4.2545378640619598E-5,2.2100300920584776E-3,7.2610997162047497E-2,7.9085353633003048E-6,7.9085353633003048E-6,2.6958964746530402E-2,2.1803573406140072E-6,2.1803573406140072E-6,4.5325056446392002E-2,4.1087214837372422E-3,1.5144294814384675E-4,20,10,4.8481935799116823E-4,4.2404025480277098E-5,4.6359448672086872E-3,7.0682233224473437E-2,4.9959780935988568E-3,6.3101228393269498E-5,0,1.1151451257994355E-4,5.1074926061788007E-3,1.0536401212478438E-3,1.3540019683998066E-3,2.1454417653711625E-4,1.1311983618324412E-2,1.3532102603086803E-2,0.14887509999999998,91.667794047189886,2.5298887105264074E-2,3.0762047578694648E-2,3.1704629809275004E-3,3.2463054287065508E-3,0,6.8663526489325826E-4,1.3345988839639444E-2,2.6196731400267938E-4,6.2120968418937349E-5,6.4876440475541931E-3,8.3322059528101289E-2,0.91667794047189888,91.667794047189886,45.099999999999994,92.40223722136399,0.92402237221363992,82.219821723483165,null,11.311983618324412,1.3540019683998066,2.2100300920584774]
["RdsonBot",1000,"mW",{"$f":"B48/1000","v":1},"Drain-source resistance of Low-side MOSFET @ Vdd, 25°C",null,null,42,4.6199999999999998E-2,0.24305499999999999,5.0596567038081273E-3,1.5450797974779576E-5,10683.491430797318,3.5180268663004629E-5,5.8422090310888343E-5,0.37584809879435738,8.6030037278323673E-2,2.2203501942329282E-3,4.3583070802585934E-5,2.263933265035514E-3,7.3144589545740435E-2,8.0251964697222612E-6,8.0251964697222612E-6,2.7593828050342675E-2,2.2842580394156346E-6,2.2842580394156346E-6,4.5874471129664182E-2,4.208934202852785E-3,1.5513667858637963E-4,20,10,4.9664422038119677E-4,4.3438270004186293E-5,4.7490166932381683E-3,7.1539018848688268E-2,5.1178312178329754E-3,6.4640282744324838E-5,0,1.1423437874042999E-4,5.2320655965734054E-3,1.074771237145819E-3,1.3824589830088053E-3,2.1977696133070447E-4,1.1583318234151083E-2,1.3857560953695735E-2,0.15250620000000001,91.670324790533726,2.5299585551112082E-2,3.0762896850218654E-2,3.1705505103392121E-3,3.246395051959092E-3,0,6.8665422136149595E-4,1.3346357292625293E-2,2.6197454633594436E-4,6.1969352279835392E-5,6.4603687184311828E-3,8.3296752094662793E-2,0.9167032479053373,91.670324790533726,46.199999999999996,92.407712227333235,0.92407712227333239,82.869092537697924,null,11.583318234151083,1.3824589830088052,2.2639332650355142]
["FOM",null,"mΩ*nC",null,"FOM",null,null,43,4.7300000000000002E-2,0.24305499999999999,5.3034610234360697E-3,1.5450797974779576E-5,10781.038941499817,3.5692001961903171E-5,5.7063437047844427E-5,0.3847968630513659,8.7048179667890385E-2,2.2732156750479974E-3,4.4620762964552258E-5,2.3178364380125496E-3,7.365789197881524E-2,8.138227576144223E-6,8.138227576144223E-6,2.8227279307670095E-2,2.3903378913396612E-6,2.3903378913396612E-6,4.6417383176824645E-2,4.309146921968327E-3,1.5883040902891249E-4,20,10,5.084690827712252E-4,4.4472514528095495E-5,4.8620885192676476E-3,7.2385663926409452E-2,5.2396843420670948E-3,6.6179337095380206E-5,0,1.1695424490091643E-4,5.356638586968011E-3,1.0958853288116565E-3,1.4108989733856662E-3,2.2500974612429269E-4,1.1854635825745618E-2,1.4183000829225651E-2,0.15613730000000001,91.672747899003255,2.5300254291406876E-2,3.0763710001432812E-2,3.1706343170434239E-3,3.24648086345113E-3,0,6.8667237159346286E-4,1.3346710074962074E-2,2.6198147107133146E-4,6.1816268619913469E-5,6.4342613503863121E-3,8.3272521009967335E-2,0.9167274789900326,91.672747899003255,47.300000000000004,92.412947722856345,0.92412947722856342,83.470244767533572,null,11.854635825745618,1.4108989733856663,2.3178364380125496]
["QgBot",0.75,"nC",{"$f":"B50/1000000000","v":7.5E-10},"Gate charge of low-side MOSFET @ Vdd",null,null,44,4.8399999999999999E-2,0.24305499999999999,5.5530019152905518E-3,1.5450797974779576E-5,10871.292436719157,3.6218842386986946E-5,5.5766540751302508E-5,0.39374562730837437,8.8054550438219206E-2,2.3260811558630671E-3,4.5658455126518588E-5,2.3717396109895856E-3,7.4151325825711226E-2,8.2476286825661832E-6,8.2476286825661832E-6,2.8859311422966327E-2,2.4985795674232643E-6,2.4985795674232643E-6,4.6954018151186314E-2,4.4093596410838673E-3,1.6252413947144532E-4,20,10,5.2029394516125364E-4,4.550675905200469E-5,4.9751603452971253E-3,7.3222520212713318E-2,5.3615374663012107E-3,6.7718391446435546E-5,0,1.1967411106140282E-4,5.4812115773626132E-3,1.1169823962453563E-3,1.4393219395303896E-3,2.3024253091788086E-4,1.212593639310801E-2,1.4508422212347586E-2,0.1597684,91.67507071326456,2.5300895352058251E-2,3.0764489495731372E-2,3.170714654927667E-3,3.2465631231435844E-3,0,6.8668977057422995E-4,1.3347048255383345E-2,2.6198810918692361E-4,6.1661717912756808E-5,6.4092423884363073E-3,8.3249292867354441E-2,0.91675070713264561,91.67507071326456,48.4,92.417960006434967,0.92417960006434963,84.026162499271365,null,12.12593639310801,1.4393219395303896,2.3717396109895854]
["VSD",0.8,"V",{"$f":"B51","v":0.8},"Body diode forward voltage",null,null,45,4.9500000000000002E-2,0.24305499999999999,5.8082793793715753E-3,1.5450797974779576E-5,10954.251916455338,3.6761468937961937E-5,5.4527284290162451E-5,0.40269439156538295,8.9049548692065009E-2,2.3789466366781367E-3,4.6696147288484931E-5,2.4256427839666216E-3,7.4625285209898931E-2,8.3533997889881402E-6,8.3533997889881402E-6,2.9489919171125409E-2,2.6089659981585299E-6,2.6089659981585299E-6,4.7484588869439591E-2,4.5095723601994127E-3,1.662178699139782E-4,20,10,5.3211880755128229E-4,4.6541003575913891E-5,5.088232171326609E-3,7.404991958493494E-2,5.483390590535331E-3,6.9257445797490914E-5,0,1.2239397722188928E-4,5.6057845677572205E-3,1.1380624394469185E-3,1.4677278814429753E-3,2.3547531571146911E-4,1.2397219936238275E-2,1.4833825085992043E-2,0.1633995,91.677299921978587,2.5301510579032759E-2,3.0765237577707567E-2,3.1707917553289375E-3,3.2466420679073947E-3,0,6.8670646840504146E-4,1.3347372807696703E-2,2.6199447979750976E-4,6.1505702044540044E-5,6.3852393422938096E-3,8.322700078021425E-2,0.91677299921978583,91.677299921978587,49.5,92.42276393092682,0.92422763930926821,84.539667081645888,null,12.397219936238276,1.4677278814429753,2.4256427839666217]
["BDserR",500,"mW",{"$f":"B52*0.001","v":0.5},"Series resistance of body diode",null,null,46,5.0599999999999999E-2,0.24305499999999999,6.0692934156791377E-3,1.5450797974779576E-5,11029.917380708361,3.7320601924214507E-5,5.3341908544724137E-5,0.41164315582239147,9.0033551477457688E-2,2.4318121174932068E-3,4.7733839450451268E-5,2.4795459569436581E-3,7.5080138942377639E-2,8.4555408954100973E-6,8.4555408954100973E-6,3.0119099247084332E-2,2.7214804183671481E-6,2.7214804183671481E-6,4.8009296387860938E-2,4.6097850793149547E-3,1.6991160035651105E-4,20,10,5.4394366994131073E-4,4.7575248099823093E-5,5.2013039973560883E-3,7.4868175580612692E-2,5.6052437147694504E-3,7.0796500148546267E-5,0,1.2511384338237573E-4,5.7303575581518261E-3,1.1591254584163431E-3,1.4961167991234233E-3,2.4070810050505731E-4,1.2668486455136395E-2,1.5159209433393831E-2,0.1670306,91.679441632581643,2.5302101657887901E-2,3.0765956296906129E-2,3.1708658294817352E-3,3.2467179140301221E-3,0,6.8672251083349255E-4,1.3347684621088783E-2,2.6200060035686093E-4,6.134822440693872E-5,6.362186019191726E-3,8.3205583674183667E-2,0.91679441632581637,91.679441632581643,50.6,92.42737306034725,0.92427373060347251,85.013498258999789,null,12.668486455136396,1.4961167991234232,2.479545956943658]
["Idss",0,"μA",{"$f":"B53/1000000","v":0},"Leakage current of low-side device",null,null,47,5.1699999999999996E-2,0.24305499999999999,6.3360440242132381E-3,1.5450797974779576E-5,11098.288829478224,3.7897006154882498E-5,5.220697432036831E-5,0.42059192007939994,9.1006915457165063E-2,2.4846775983082769E-3,4.8771531612417584E-5,2.5334491299206945E-3,7.551623225873165E-2,8.5540520018320547E-6,8.5540520018320547E-6,3.0746850315985855E-2,2.8361064130609187E-6,2.8361064130609187E-6,4.8528330892533784E-2,4.7099977984304976E-3,1.7360533079904385E-4,20,10,5.5576853233133916E-4,4.8609492623732281E-5,5.3143758233855695E-3,7.5677584785744628E-2,5.7270968390035672E-3,7.2335554499601621E-5,0,1.2783370954286212E-4,5.8549305485464291E-3,1.1801714531536297E-3,1.5244886925717335E-3,2.4594088529864547E-4,1.2939735949802378E-2,1.5484575238137966E-2,0.1706617,91.681501433037838,2.530267013081498E-2,3.0766647528546357E-2,3.1709370706538647E-3,3.2467908594028395E-3,0,6.8673793971608488E-4,1.334798450911583E-2,2.620064868342055E-4,6.1189289983490033E-5,6.340021854554059E-3,8.3184985669621694E-2,0.91681501433037838,91.681501433037838,51.699999999999996,92.431799806694343,0.92431799806694348,85.450299481057854,null,12.939735949802378,1.5244886925717336,2.5334491299206947]
[null,null,null,null,null,null,null,48,5.28E-2,0.24305499999999999,6.6085312049738807E-3,1.5450797974779576E-5,11159.36626276493,3.8491494429181158E-5,5.1119329022027298E-5,0.42954068433640846,9.1969978419107798E-2,2.5375430791233461E-3,4.9809223774383928E-5,2.5873523028977301E-3,7.593388838656083E-2,8.6489331082540173E-6,8.6489331082540173E-6,3.1373173063889696E-2,2.9528279642903224E-6,2.9528279642903224E-6,4.9041872504758825E-2,4.8102105175460395E-3,1.7729906124157674E-4,20,10,5.675933947213677E-4,4.9643737147641483E-5,5.4274476494150488E-3,7.647842809078706E-2,5.8489499632376875E-3,7.3874608850656975E-5,0,1.3055357570334857E-4,5.9795035389410365E-3,1.2012004236587786E-3,1.5528435617879058E-3,2.511736700922337E-4,1.3210968420236226E-2,1.5809922484206502E-2,0.1742928,91.683484445878989,2.5303217411553197E-2,3.0767312991656977E-2,3.1710056560154847E-3,3.2468610854338945E-3,0,6.8675279342301262E-4,1.334827321757142E-2,2.6201215386866444E-4,6.1028905430369094E-5,6.3186913262569021E-3,8.3165155541209901E-2,0.91683484445878993,91.683484445878989,52.8,92.436055549705159,0.92436055549705154,85.852606905132433,null,13.210968420236226,1.5528435617879059,2.5873523028977301]
[null,null,null,null,null,null,null,49,5.3899999999999997E-2,0.24305499999999999,6.8867549579610622E-3,1.5450797974779576E-5,11213.149680568475,3.9104931360479865E-5,5.007607740933287E-5,0.43848944859341699,9.2923060645862934E-2,2.5904085599384162E-3,5.0846915936350258E-5,2.6412554758747666E-3,7.633340996215647E-2,8.7401842146759733E-6,8.7401842146759733E-6,3.1998070249017879E-2,3.0716294989832494E-6,3.0716294989832494E-6,4.9550092011325181E-2,4.9104232366615833E-3,1.8099279168410959E-4,20,10,5.7941825711139625E-4,5.0677981671550685E-5,5.5405194754445299E-3,7.7270971829476856E-2,5.9708030874718061E-3,7.5413663201712329E-5,0,1.3327344186383501E-4,6.1040765293356412E-3,1.2222123699317899E-3,1.5811814067719406E-3,2.5640645488582192E-4,1.3482183866437934E-2,1.6135251156026358E-2,0.1779239,91.685395375632993,2.5303744798479164E-2,3.0767954264992094E-2,3.1710717482794815E-3,3.2469287587285202E-3,0,6.8676710719342093E-4,1.334855143139161E-2,2.6201761490479057E-4,6.0867079152388716E-5,6.2981434405487719E-3,8.3146046243670238E-2,0.91685395375632994,91.685395375632993,53.9,92.440150741976623,0.92440150741976623,86.22284161520011,null,13.482183866437934,1.5811814067719407,2.6412554758747664]
[null,null,null,null,null,null,null,50,5.5E-2,0.24305499999999999,7.1707152831747825E-3,1.5450797974779576E-5,11259.639082888863,3.9738237571965503E-5,4.9074555861146206E-5,0.44743821285042545,9.3866466158997838E-2,2.6432740407534858E-3,5.1884608098316588E-5,2.6951586488518026E-3,7.6715080312795225E-2,8.8278053210979328E-6,8.8278053210979328E-6,3.2621546753517576E-2,3.1924959377757995E-6,3.1924959377757995E-6,5.0053151528036299E-2,5.0106359557771252E-3,1.8468652212664239E-4,20,10,5.9124311950142468E-4,5.1712226195459873E-5,5.6535913014740093E-3,7.8055468813568243E-2,6.0926562117059246E-3,7.695271755276767E-5,0,1.3599330802432143E-4,6.228649519730246E-3,1.2432072919726636E-3,1.6095022275238377E-3,2.6163923967941003E-4,1.3753382288407503E-2,1.6460561238518179E-2,0.18155500000000002,91.687238550564857,2.530425348612678E-2,3.0768572801038903E-2,3.1711354971451491E-3,3.2469940325670537E-3,0,6.8678091344806828E-4,1.3348819780732026E-2,2.6202288231185709E-4,6.0703821374900764E-5,6.2783312796066935E-3,8.3127614494351451E-2,0.91687238550564854,91.687238550564857,55,92.444095001495995,0.92444095001495996,86.563304603609339,null,13.753382288407503,1.6095022275238378,2.6951586488518027]
[null,null,null,null,null,null,null,51,5.6100000000000004E-2,0.24305499999999999,7.4604121806150477E-3,1.5450797974779576E-5,11298.834469726091,4.0392394306710989E-5,4.8112309667790396E-5,0.45638697710743409,9.4800483851939579E-2,2.6961395215685567E-3,5.2922300260282931E-5,2.7490618218288395E-3,7.7079164618894205E-2,8.9117964275198891E-6,8.9117964275198891E-6,3.3243609635722114E-2,3.3154127448368284E-6,3.3154127448368284E-6,5.0551205103798805E-2,5.110848674892669E-3,1.8838025256917533E-4,20,10,6.0306798189145334E-4,5.2746470719369089E-5,5.7666631275034913E-3,7.8832159274879965E-2,6.2145093359400431E-3,7.8491771903823051E-5,0,1.3871317418480791E-4,6.3532225101248507E-3,1.2641851897813997E-3,1.6378060240435975E-3,2.6687202447299836E-4,1.4024563686144938E-2,1.6785852717146135E-2,0.18518610000000002,91.689017959511403,2.5304744575353061E-2,3.0769169938378627E-2,3.1711970405721699E-3,3.2470570482093868E-3,0,6.8679424206523516E-4,1.3349078846330683E-2,2.6202796748912236E-4,6.0539144212169134E-5,6.2592116022754992E-3,8.3109820404885959E-2,0.91689017959511399,91.689017959511403,56.1,92.447897193306034,0.92447897193306039,86.876174091204305,null,14.024563686144939,1.6378060240435974,2.7490618218288394]
[null,null,null,null,null,null,null,52,5.7200000000000001E-2,0.24305499999999999,7.7558456502818457E-3,1.5450797974779576E-5,11330.735841080161,4.1068448500700548E-5,4.718707294340981E-5,0.4653357413644425,9.5725388523345348E-2,2.7490050023836251E-3,5.3959992422249248E-5,2.8029649948058742E-3,7.7425910968451417E-2,8.9921575339418473E-6,8.9921575339418473E-6,3.3864268182888145E-2,3.4403659786877109E-6,3.4403659786877109E-6,5.1044399271654717E-2,5.2110613940082092E-3,1.9207398301170813E-4,20,10,6.1489284428148166E-4,5.378071524327827E-5,5.8797349535329698E-3,7.960127172460349E-2,6.3363624601741591E-3,8.0030826254878391E-5,0,1.414330403452943E-4,6.4777955005194537E-3,1.2851460633579977E-3,1.6660927963312189E-3,2.7210480926658653E-4,1.4295728059650228E-2,1.7111125577968733E-2,0.18881720000000002,91.690737284468369,2.53052190823316E-2,3.076974691262218E-2,3.1712565059076768E-3,3.2471179360489977E-3,0,6.8680712062481569E-4,1.3349329164252318E-2,2.6203288095895708E-4,6.0373061732696631E-5,6.2407444908370059E-3,8.309262715531622E-2,0.91690737284468371,91.690737284468369,57.2,92.451565501764364,0.92451565501764366,87.163504797093893,null,14.295728059650228,1.6660927963312189,2.8029649948058744]
[null,null,null,null,null,null,null,53,5.8300000000000005E-2,0.24305499999999999,8.0570156921751894E-3,1.5450797974779576E-5,11355.343196951073,4.1767518373975446E-5,4.6296750812402077E-5,0.47428450562145102,9.6641441821451443E-2,2.8018704831986952E-3,5.4997684584215585E-5,2.8568681677829106E-3,7.7755551314633076E-2,9.0688886403638057E-6,9.0688886403638057E-6,3.4483533964384382E-2,3.5673423440185538E-6,3.5673423440185538E-6,5.1532873552344004E-2,5.3112741131237521E-3,1.9576771345424098E-4,20,10,6.2671770667151021E-4,5.4814959767187472E-5,5.99280677956245E-3,8.0363023738584408E-2,6.4582155844082811E-3,8.1569880605933745E-5,0,1.4415290650578072E-4,6.602368490914062E-3,1.3060899127024584E-3,1.6943625443867031E-3,2.7733759406017475E-4,1.4566875408923392E-2,1.7436379807690684E-2,0.19244830000000002,91.692399929491287,2.5305677946528871E-2,3.0770304866108839E-2,3.1713140108858466E-3,3.2471768166364499E-3,0,6.8681957462480116E-4,1.3349571230096174E-2,2.6203763244943772E-4,6.0205590021913241E-5,6.2228930377347148E-3,8.3076000705087041E-2,0.91692399929491286,91.692399929491287,58.300000000000004,92.455107494637488,0.9245510749463749,87.427228807536096,null,14.566875408923392,1.694362544386703,2.8568681677829106]
[null,null,null,null,null,null,null,54,5.9400000000000001E-2,0.24305499999999999,8.3639223062950685E-3,1.5450797974779576E-5,11372.656537338824,4.249079960270523E-5,4.5439403575135377E-5,0.48323326987845955,9.7548893108597337E-2,2.8547359640137644E-3,5.6035376746181921E-5,2.9107713407599462E-3,7.8068302346025881E-2,9.141989746785766E-6,9.141989746785766E-6,3.5101420885303651E-2,3.6963292445016941E-6,3.6963292445016941E-6,5.2016760915301587E-2,5.4114868322392932E-3,1.9946144389677384E-4,20,10,6.3854256906153875E-4,5.5849204291096674E-5,6.1058786055919285E-3,8.111762267622491E-2,6.5800687086423979E-3,8.3108934956989099E-5,0,1.4687277266626714E-4,6.726941481308665E-3,1.3270167378147814E-3,1.7226152682100495E-3,2.8257037885376292E-4,1.4838005733964406E-2,1.7761615393715638E-2,0.19607940000000001,91.694009046387279,2.5306122037794653E-2,3.0770844856527806E-2,3.1713696645164777E-3,3.247233801589226E-3,0,6.8683162767372186E-4,1.33498055027364E-2,2.620422309677673E-4,6.0036747242572031E-5,6.2056230670787388E-3,8.3059909536127352E-2,0.91694009046387281,91.694009046387279,59.4,92.458530180085759,0.92458530180085763,87.669157732427976,null,14.838005733964406,1.7226152682100495,2.910771340759946]
[null,null,null,null,null,null,null,55,6.0500000000000005E-2,0.24305499999999999,8.6765654926414908E-3,1.5450797974779576E-5,11382.675862243419,4.3239572143844181E-5,4.4613232601042005E-5,0.49218203413546807,9.8447980254021031E-2,2.9076014448288345E-3,5.7073068908148251E-5,2.9646745137369827E-3,7.8364366277910283E-2,9.211460853207723E-6,9.211460853207723E-6,3.5717945240467681E-2,3.827314836603144E-6,3.827314836603144E-6,5.2496188201405808E-2,5.5116995513548369E-3,2.0315517433930669E-4,20,10,6.5036743145156729E-4,5.6883448815005869E-5,6.2189504316214096E-3,8.1865266339739687E-2,6.7019218328765156E-3,8.4647989308044453E-5,0,1.4959263882675358E-4,6.8515144717032688E-3,1.3479265386949664E-3,1.7508509678012579E-3,2.8780316364735115E-4,1.5109119034773287E-2,1.8086832324200081E-2,0.19971050000000001,91.695567557605756,2.5306552162679616E-2,3.0771367864600083E-2,3.1714235678767036E-3,3.2472889944023821E-3,0,6.868433016621109E-4,1.3350032407654804E-2,2.620466848656929E-4,5.9866553693146826E-5,6.1889028865079188E-3,8.3044324423942467E-2,0.91695567557605751,91.695567557605756,60.500000000000007,92.461840057442586,0.9246184005744259,87.890985876194023,null,15.109119034773288,1.750850967801258,2.9646745137369828]
[null,null,null,null,null,null,null,56,6.1600000000000009E-2,0.24305499999999999,8.9949452512144527E-3,1.5450797974779576E-5,11385.401171664853,4.4015207794315932E-5,4.3816567733166247E-5,0.50113079839247665,9.9338930362067437E-2,2.960466925643905E-3,5.8110761070114588E-5,3.0185776867140196E-3,7.8643931571904871E-2,9.2773019596296852E-6,9.2773019596296852E-6,3.6333125768790324E-2,3.9602880843922063E-6,3.9602880843922063E-6,5.2971276511286663E-2,5.6119122704703806E-3,2.0684890478183957E-4,20,10,6.6219229384159584E-4,5.7917693338915077E-5,6.3320222576508916E-3,8.2606143579703778E-2,6.8237749571106359E-3,8.6187043659099834E-5,0,1.5231250498724003E-4,6.9760874620978762E-3,1.3688193153430139E-3,1.7790696431603291E-3,2.9303594844093942E-4,1.5380215311350037E-2,1.8412030588108079E-2,0.20334160000000004,91.69707817667836,2.5306969070076311E-2,3.0771874800937626E-2,3.1714758148179306E-3,3.2473424911723986E-3,0,6.868546169156069E-4,1.3350252339916659E-2,2.6205100189791825E-4,5.9695031864482925E-5,6.1727030656174471E-3,8.3029218233216365E-2,0.91697078176678359,91.69707817667836,61.600000000000009,92.46504316256231,0.9246504316256231,88.094294186393796,null,15.380215311350037,1.7790696431603292,3.0185776867140195]
[null,null,null,null,null,null,null,57,6.2699999999999992E-2,0.24305499999999999,9.3190615820139457E-3,1.5450797974779576E-5,11380.832465603129,4.4819178578643035E-5,4.3047856018549308E-5,0.51007956264948495,0.10022196044212689,3.0133324064589742E-3,5.9148453232080905E-5,3.0724808596910552E-3,7.8907173590456459E-2,9.3395130660516443E-6,9.3395130660516443E-6,3.694698370796156E-2,4.095238815349131E-6,4.095238815349131E-6,5.3442141562562405E-2,5.71212498958592E-3,2.1054263522437235E-4,20,10,6.7401715623162405E-4,5.8951937862824252E-5,6.4450940836803684E-3,8.3340434852145762E-2,6.9456280813447518E-3,8.7726098010155134E-5,0,1.5503237114772639E-4,7.1006604524924783E-3,1.3896950677589235E-3,1.8072712942872619E-3,2.9826873323452748E-4,1.5651294563694636E-2,1.873721017526709E-2,0.20697269999999998,91.698543426508238,2.530737345626681E-2,3.0772366512180922E-2,3.1715264925984052E-3,3.2473943812448779E-3,0,6.8686559233195154E-4,1.3350465666833492E-2,2.6205518927437105E-4,5.9522206494914169E-5,6.156996237692022E-3,8.3014565734917764E-2,0.91698543426508239,91.698543426508238,62.699999999999989,92.468145108402524,0.92468145108402522,88.280554777425039,null,15.651294563694636,1.807271294287262,3.0724808596910553]
[null,null,null,null,null,null,null,58,6.3799999999999996E-2,0.24305499999999999,9.6489144850399871E-3,1.5450797974779576E-5,11368.969744058248,4.5653066072917711E-5,4.2305651604436385E-5,0.51902832690649348,0.1010972780259034,3.066197887274043E-3,6.0186145394047228E-5,3.1263840326680903E-3,7.9154255191887193E-2,9.3980941724736018E-6,9.3980941724736018E-6,3.7559542849411404E-2,4.2321577771703141E-6,4.2321577771703141E-6,5.3908894018990336E-2,5.8123377087014637E-3,2.142363656669052E-4,20,10,6.858420186216526E-4,5.9986182386733447E-5,6.5581659097098495E-3,8.4068312731842496E-2,7.0674812055788712E-3,8.9265152361210501E-5,0,1.5775223730821281E-4,7.225233442887084E-3,1.4105537959426958E-3,1.8354559211820579E-3,3.035015180281157E-4,1.5922356791807105E-2,1.906237107642484E-2,0.21060380000000001,91.699965655768466,2.530776596944842E-2,3.0772843786502024E-2,3.1715756824503795E-3,3.2474447477952714E-3,0,6.868762455038204E-4,1.3350672730350522E-2,2.6205925370706597E-4,5.9348104624029487E-5,6.1417569219339363E-3,8.3000343442315466E-2,0.91699965655768467,91.699965655768466,63.8,92.471151121415275,0.92471151121415274,88.451135857864216,null,15.922356791807104,1.8354559211820578,3.1263840326680903]
[null,null,null,null,null,null,null,59,6.4899999999999999E-2,0.24305499999999999,9.9845039602925682E-3,1.5450797974779576E-5,11349.813007030205,4.6518571789373706E-5,4.1588606661988314E-5,0.527977091163502,0.10196508173698669,3.1190633680891131E-3,6.1223837556013565E-5,3.1802872056451268E-3,7.9385327271041556E-2,9.4530452788955612E-6,9.4530452788955612E-6,3.81708295935086E-2,4.3710366955700159E-6,4.3710366955700159E-6,5.4371639794184093E-2,5.9125504278170066E-3,2.1793009610943803E-4,20,10,6.9766688101168103E-4,6.1020426910642649E-5,6.6712377357393297E-3,8.4789942385951583E-2,7.1893343298129889E-3,9.0804206712265842E-5,0,1.6047210346869928E-4,7.3498064332816878E-3,1.4313954998943302E-3,1.8636235238447157E-3,3.0873430282170387E-4,1.6193401995687435E-2,1.9387513283307026E-2,0.21423490000000001,91.701347053633782,2.5308147213799349E-2,3.0773307358548236E-2,3.1716234600896193E-3,3.2474936683505873E-3,0,6.8688659282917133E-4,1.3350873849191503E-2,2.6206320145220495E-4,5.9172755645245055E-5,6.1269613637563065E-3,8.2986529463662237E-2,0.91701347053633786,91.701347053633782,64.900000000000006,92.474066074243098,0.924740660742431,88.607306918069966,null,16.193401995687434,1.8636235238447156,3.1802872056451266]
[null,null,null,null,null,"Eff (%)","Iout (mA)",60,6.6000000000000003E-2,0.24305499999999999,1.0325830007771689E-2,1.5450797974779576E-5,11323.362254519005,4.7417528765030063E-5,4.089546321762184E-5,0.53692585542051063,0.10282556181715685,3.1719288489041836E-3,6.2261529717979908E-5,3.2341903786221636E-3,7.9600529249988949E-2,9.5043663853175191E-6,9.5043663853175191E-6,3.878087300494594E-2,4.5118683330772343E-6,4.5118683330772343E-6,5.4830480332259311E-2,6.0127631469325503E-3,2.2162382655197094E-4,20,10,7.0949174340170968E-4,6.2054671434551864E-5,6.7843095617688117E-3,8.5505482011664663E-2,7.3111874540471092E-3,9.2343261063321223E-5,0,1.6319196962918576E-4,7.4743794236762952E-3,1.452220179613827E-3,1.8917741022752362E-3,3.1396708761529215E-4,1.6464430175335634E-2,1.9712636788676192E-2,0.21786600000000003,91.702689663039706,2.5308517753138058E-2,3.0773757913891628E-2,3.1716698961740003E-3,3.2475412152589474E-3,0,6.8689664961055967E-4,1.3351069320789066E-2,2.6206703834806875E-4,5.8996191357314897E-5,6.1125873910353396E-3,8.297310336960298E-2,0.91702689663039705,91.702689663039706,66,92.476894515150917,0.9247689451515092,88.750244059636927,null,16.464430175335632,1.8917741022752361,3.2341903786221637]
[null,null,null,null,null,{"$f":"AU56","v":91.687238550564857},{"$f":"I56*1000","v":55},61,6.7099999999999993E-2,0.24305499999999999,1.0672892627477346E-2,1.5450797974779576E-5,11289.617486524647,4.8351914520494447E-5,4.0225045787824767E-5,0.54587461967751905,0.10367890061337219,3.2247943297192523E-3,6.3299221879946238E-5,3.2880935515991988E-3,7.9799989522720605E-2,9.5520574917394772E-6,9.5520574917394772E-6,3.9389704868259455E-2,4.654646548825748E-6,4.654646548825748E-6,5.528551286751391E-2,6.1129758660480923E-3,2.2531755699450377E-4,20,10,7.2131660579173812E-4,6.3088915958461046E-5,6.8973813877982919E-3,8.6215083241166252E-2,7.433040578281226E-3,9.3882315414376563E-5,0,1.6591183578967215E-4,7.5989524140708982E-3,1.4730278351011859E-3,1.9199076564736183E-3,3.1919987240888032E-4,1.6735441330751687E-2,2.0037741586391451E-2,0.22149709999999997,91.703995392638035,2.5308878114222798E-2,3.0774196093041089E-2,3.1717150567169981E-3,3.2475874561129743E-3,0,6.8690643014469334E-4,1.3351259423025385E-2,2.6207076984918374E-4,5.8818446014894361E-5,6.0986142844916139E-3,8.2960046073619634E-2,0.91703995392638038,91.703995392638035,67.099999999999994,92.479640694567323,0.92479640694567322,88.881035370214562,null,16.735441330751687,1.9199076564736184,3.2880935515991987]
[null,null,null,null,null,{"$f":"AU81","v":91.719228968677498},{"$f":"I81*1000","v":82.5},62,6.8199999999999997E-2,0.24305499999999999,1.1025691819409548E-2,1.5450797974779576E-5,11248.578703047127,4.9323865581722911E-5,3.9576254726730813E-5,0.55482338393452757,0.10452527302897167,3.2776598105343216E-3,6.4336914041912555E-5,3.3419967245762339E-3,7.9983825857321236E-2,9.5961185981614337E-6,9.5961185981614337E-6,3.9997359743425165E-2,4.7993663593349039E-6,4.7993663593349039E-6,5.5736830665026313E-2,6.2131885851636351E-3,2.2901128743703662E-4,20,10,7.3314146818176666E-4,6.4123160482370241E-5,7.0104532138277722E-3,8.6918891516835073E-2,7.5548937025153437E-3,9.5421369765431917E-5,0,1.6863170195015857E-4,7.7235254044655021E-3,1.4938184663564073E-3,1.9480241864398634E-3,3.2443265720246854E-4,1.7006435461935608E-2,2.0362827671469338E-2,0.2251282,91.705266027595897,2.530922878973195E-2,3.0774622495066298E-2,3.1717590034611959E-3,3.2476324541322286E-3,0,6.869159478033206E-4,1.3351444415804395E-2,2.6207440105718253E-4,5.8639556378252767E-5,6.085022660606251E-3,8.2947339724041058E-2,0.917052660275959,91.705266027595897,68.2,92.482308589061347,0.92482308589061346,89.00068626625567,null,17.00643546193561,1.9480241864398633,3.3419967245762341]
[null,null,null,null,null,{"$f":"AU106","v":91.737913781765229},{"$f":"I106*1000","v":110},63,6.93E-2,0.24305499999999999,1.1384227583568284E-2,1.5450797974779576E-5,11200.245904086451,5.0335693789173123E-5,3.8948060207258897E-5,0.56377214819153598,0.10536484694225413,3.3305252913493921E-3,6.5374606203878885E-5,3.3958998975532708E-3,8.0152145758689869E-2,9.6365497045833989E-6,9.6365497045833989E-6,4.0603875021472433E-2,4.9460240002780593E-6,4.9460240002780593E-6,5.6184523243857712E-2,6.3134013042791754E-3,2.327050178795694E-4,20,10,7.4496633057179499E-4,6.5157405006279436E-5,7.1235250398572498E-3,8.761704643931717E-2,7.6767468267494613E-3,9.6960424116487257E-5,0,1.7135156811064496E-4,7.848098394860106E-3,1.5145920733794908E-3,1.9761236921739703E-3,3.2966544199605665E-4,1.7277412568887384E-2,2.0687895040145517E-2,0.2287593,91.70650323936654,2.5309570240960658E-2,3.0775037680876634E-2,3.1718017942162164E-3,3.2476762685092323E-3,0,6.8692521510641956E-4,1.3351624542474348E-2,2.6207793674872806E-4,5.8459561762218127E-5,6.0717943656802215E-3,8.2934967606334689E-2,0.91706503239366544,91.70650323936654,69.3,92.484901923038976,0.92484901923038976,89.110124742644544,null,17.277412568887385,1.9761236921739702,3.3958998975532708]
[null,null,null,null,null,null,null,64,{"$f":"IF(PLOT_TYPE=1, H70/100*Iout_maxload_PFM, min_I*EXP(H70*rr/100))","v":7.0400000000000004E-2},{"$f":"IripplePFM","v":0.24305499999999999},{"$f":"I70*D*P70","v":1.1748499919953566E-2},1.5450797974779576E-5,11144.619089642614,{"$f":"Cout*Vout_hys/(Ioutmax-I70)","v":5.1389904656392399E-5},{"$f":"Cout*Vout_hys/I70","v":3.833949676652047E-5},0.57272091244854462,{"$f":"IripplePFM/SQRT(3)*SQRT(P70)","v":0.10619778359527193},3.3833907721644626E-3,{"$f":"P70*Fsw^2.5*(IripplePFM/2)^2.5*k_core","v":6.6412298365845228E-5},3.4498030705303077E-3,{"$f":"SQRT((((I70*(1-P70)/P70)^2+Ilim^2/12)*P70)+I70^2*(1-P70))","v":8.0305046794521176E-2},9.6733508110053541E-6,9.6733508110053541E-6,4.1209290980049072E-2,5.0946169892350618E-6,5.0946169892350618E-6,5.662867658437163E-2,6.41361402339472E-3,2.3639874832210233E-4,20,10,7.5679119296182364E-4,6.6191649530188644E-5,7.2365968658867318E-3,8.8309682090830691E-2,7.7985999509835825E-3,9.8499478467542625E-5,0,1.7407143427113146E-4,7.9726713852547142E-3,{"$f":"Vin*(Iq_active*(N70+Tsleep)+Iq_sleep*(O70-Tsleep))/(N70+O70)+Vout*Ifb/0.7","v":1.535348656170437E-3},2.0042061736759401E-3,3.3489822678964493E-4,1.7548372651607032E-2,2.1012943689937578E-2,{"$f":"Vout*I70","v":0.23239040000000002},91.707708594544485,2.5309902900264681E-2,3.077544217619279E-2,3.1718434831649947E-3,3.247718954723059E-3,0,6.8693424378852685E-4,{"$f":"R70/($AT70+$AS70)","v":1.3351800031117007E-2},{"$f":"S70/($AT70+$AS70)","v":2.6208138140081848E-4},5.827850408442277E-5,6.0589123798187837E-3,8.2922914054555097E-2,0.9170770859454449,91.707708594544485,{"$f":"I70*1000","v":70.400000000000006},92.487424188408724,0.92487424188408729,89.210206482112255,null,17.548372651607032,2.0042061736759402,3.4498030705303075]
[null,null,null,null,null,null,null,65,7.1500000000000008E-2,0.24305499999999999,1.2118508828565385E-2,{"$f":"OffTime","v":1.5450797974779576E-5},11081.698259715622,5.2489218084925551E-5,3.7749658354727844E-5,0.58166967670555314,0.10702423795538922,{"$f":"Q71^2*Rdcr","v":3.4362562529795322E-3},6.7449990527811572E-5,3.5037062435073437E-3,8.0442616886935048E-2,{"$f":"RCoutEsr*U71^2","v":9.7065219174273128E-6},9.7065219174273128E-6,{"$f":"SQRT((K71^2*(1-D)+(K71-Ilim)^2*D/3))*P71+(K71^2*(1-P71))","v":4.181365083886876E-2},{"$f":"RCinEsr*X71^2","v":5.2451441894244906E-6},5.2451441894244906E-6,{"$f":"Ilim*SQRT(P71*D/3)","v":5.7069373321030348E-2},{"$f":"RdsonTop*AA71^2","v":6.5138267425102611E-3},{"$f":"QgTop*P71*Vdd*Fsw","v":2.4009247876463516E-4},20,10,{"$f":"Vin*Ilim*Tf/2*Fsw*P71","v":7.6861605535185219E-4},{"$f":"Coss*Vin^2*Fsw*P71/2","v":6.7225894054097839E-5},7.3496686919162111E-3,{"$f":"Ilim*SQRT(P71*(1-D)/3)","v":8.8996927335822665E-2},{"$f":"RdsonBot*AI71^2","v":7.9204530752176993E-3},{"$f":"QgBot*P71*Vdd*Fsw","v":1.0003853281859798E-4},{"$f":"Vin*Idss","v":0},{"$f":"dead1*P71*Ilim*((Ilim)*BDserR+VSD)*Fsw","v":1.7679130043161791E-4},8.0972443756493172E-3,1.5560882147292454E-3,{"$f":"(Vin-Vdd)*Fsw*(QgBot+QgTop)*P71+AO71","v":2.0322716309457717E-3},3.4013101158323315E-4,1.7819315710094534E-2,{"$f":"SUM(T71,W71,Z71,AR71)","v":2.1337973619708728E-2},0.23602150000000005,91.708883562903495,2.5310227173278719E-2,3.0775836474244114E-2,{"$f":"Vin*Fsw*P71*(QgBot+QgTop)/($AT71+$AS71)","v":3.1718841211417739E-3},3.2477605648239894E-3,{"$f":"AL71/(AS71+AT71)","v":0},{"$f":"AM71/($AT71+$AS71)","v":6.8694304485894433E-4},1.3351971095717927E-2,2.6208473921375861E-4,{"$f":"(W71+Z71)/($AT71+$AS71)","v":5.8096427912909724E-5},6.0463607297729528E-3,8.2911164370965088E-2,{"$f":"AU71/100","v":0.91708883562903498},91.708883562903495,71.500000000000014,92.489878662434649,0.92489878662434644,89.301719789125713,null,17.819315710094536,2.0322716309457718,3.5037062435073438]
[null,null,null,null,null,null,null,66,7.2599999999999998E-2,0.24305499999999999,1.2494254309403742E-2,1.5450797974779576E-5,{"$f":"1/(N72+O72)","v":11011.483414305469},5.3636591796093974E-5,3.7177693834201674E-5,{"$f":"N72/(N72+O72)","v":0.59061844096256155},0.10784435905190097,3.4891217337946001E-3,6.8487682689777888E-5,{"$f":"R72+S72","v":3.557609416484378E-3},8.0564934571848199E-2,9.7360630238492717E-6,{"$f":"V72","v":9.7360630238492717E-6},4.2417000814966771E-2,5.3976058744106752E-6,{"$f":"Y72","v":5.3976058744106752E-6},5.7506692921893032E-2,6.6140394616258039E-3,2.4378620920716793E-4,20,10,7.8044091774188051E-4,6.8260138578007034E-5,{"$f":"AB72+AF72+AG72","v":7.4627405179456914E-3},8.9678906100887607E-2,8.042306199451817E-3,1.0157758716965332E-4,0,1.795111665921043E-4,{"$f":"AJ72+AL72+AM72","v":8.2218173660439219E-3},1.5768107490559157E-3,2.0603200639834657E-3,{"$f":"AC72+AK72","v":3.4536379637682127E-4},{"$f":"AH72+AN72+AP72+AQ72","v":1.8090241744349898E-2},2.1662984829732536E-2,0.23965259999999999,{"$f":"100*AT72/(AT72+AS72)","v":91.710029524703756},{"$f":"AB72/($AT72+$AS72)","v":2.5310543440933177E-2},{"$f":"AJ72/($AT72+$AS72)","v":3.0776221038220915E-2},3.1719237558848492E-3,{"$f":"(AF72+AG72)/($AT72+$AS72)","v":3.2478011476922909E-3},0,6.8695162865647604E-4,1.3352137937230321E-2,2.6208801413204249E-4,5.7913380513147391E-5,{"$f":"AO72/($AT72+$AS72)","v":6.0341244096992173E-3},{"$f":"SUM(AV72:BE72)","v":8.2899704752962433E-2},0.91710029524703751,{"$f":"BG72*100","v":91.710029524703756},72.599999999999994,92.492268423968255,{"$f":"BJ72/100","v":0.9249226842396826},89.385390322784559,null,{"$f":"1000*AR72","v":18.090241744349896},{"$f":"1000*AP72","v":2.0603200639834656},{"$f":"1000*T72","v":3.5576094164843779}]
[null,null,null,null,null,null,null,67,7.3700000000000002E-2,0.24305499999999999,1.2875736362468641E-2,1.5450797974779576E-5,10933.974553412158,5.4835247904657292E-5,3.6622802881452392E-5,0.59956720521957008,0.1086582902897837,3.5419872146096707E-3,6.9525374851744218E-5,3.6115125894614149E-3,8.0672069227918988E-2,9.7619741302712308E-6,9.7619741302712308E-6,4.3019390177685385E-2,5.5520037937798015E-6,5.5520037937798015E-6,5.7940711855919355E-2,6.7142521807413477E-3,2.4747993964970082E-4,20,10,7.9226578013190906E-4,6.9294383101916229E-5,7.5758123439751733E-3,9.0355737635669481E-2,8.1641593236859381E-3,1.0311664152070869E-4,0,1.8223103275259069E-4,8.3463903564385284E-3,1.5975162591504487E-3,2.0883514727890219E-3,3.5059658117040949E-4,1.8361150754373133E-2,2.1987977321758598E-2,0.24328370000000002,91.711147777345076,2.5310852061290218E-2,3.0776596303507001E-2,3.171962432266663E-3,3.2478407492738267E-3,0,6.8696000489926179E-4,1.335230074454369E-2,2.6209120986336626E-4,5.7729411894493721E-5,6.0221893090107673E-3,8.2888522226549299E-2,0.91711147777345081,91.711147777345076,73.7,92.494596368229239,0.92494596368229243,89.461885611413308,null,18.361150754373131,2.088351472789022,3.6115125894614151]
[null,null,null,null,null,null,null,68,7.4800000000000005E-2,0.24305499999999999,1.3262954987760082E-2,1.5450797974779576E-5,10849.171677035685,5.608870313708993E-5,3.6084232250842793E-5,0.60851596947657871,0.10946616974244816,3.594852695424742E-3,7.0563067013710562E-5,3.6654157624384526E-3,8.0764081276654937E-2,9.7842552366931867E-6,9.7842552366931867E-6,4.3620871303305803E-2,5.708341239778703E-6,5.708341239778703E-6,5.8371503749076445E-2,6.8144648998568905E-3,2.511736700922337E-4,20,10,8.0409064252193771E-4,7.0328627625825438E-5,7.6888841700046536E-3,9.102753675630279E-2,8.2860124479200558E-3,1.0465569587176405E-4,0,1.8495089891307711E-4,8.4709633468331332E-3,1.618204745012844E-3,2.1163658573624409E-3,3.5582936596399776E-4,1.8632042740164223E-2,2.2312951099079149E-2,0.24691480000000002,91.712239541432822,2.5311153371217972E-2,3.0776962679715362E-2,3.1720001925036158E-3,3.2478794127948794E-3,0,6.8696818273021522E-4,1.3352459695366959E-2,2.620943298959641E-4,5.7544574856142604E-5,6.0105421465906934E-3,8.2877604585671796E-2,0.91712239541432827,91.712239541432822,74.800000000000011,92.496865220283595,0.92496865220283597,89.53181933822033,null,18.632042740164223,2.1163658573624407,3.6654157624384527]
[null,null,null,null,null,null,null,69,7.5899999999999995E-2,0.24305499999999999,1.3655910185278055E-2,1.5450797974779576E-5,10757.074785176057,5.7400803291290052E-5,3.5561272363149429E-5,0.61746473373358712,0.11026813042518693,3.6477181762398108E-3,7.1600759175676892E-5,3.7193189354154878E-3,8.08410223550525E-2,9.8029063431151461E-6,9.8029063431151461E-6,4.4221499729238244E-2,5.8666231149090549E-6,5.8666231149090549E-6,5.879913953015143E-2,6.9146776189724334E-3,2.5486740053476652E-4,20,10,8.1591550491196603E-4,7.1362872149734633E-5,7.8019559960341338E-3,9.1694414072800379E-2,8.4078655721541717E-3,1.0619475022281939E-4,0,1.8767076507356355E-4,8.5955363372277362E-3,1.6388762066431009E-3,2.1443632177037212E-3,3.6106215075758593E-4,1.8902917701723174E-2,2.2637906166596687E-2,0.25054589999999999,91.713305966316568,2.5311447687919066E-2,3.0777320552546856E-2,3.17203707634762E-3,3.2479171789582891E-3,0,6.8697617075850982E-4,1.3352614957034862E-2,2.6209737751443565E-4,5.7358925032578235E-5,5.9991704107221462E-3,8.2866940336834366E-2,0.91713305966316572,91.713305966316568,75.899999999999991,92.49907754735132,0.92499077547351316,89.5957553928111,null,18.902917701723176,2.1443632177037211,3.7193189354154876]
[null,null,null,null,null,null,null,70,7.6999999999999999E-2,0.24305499999999999,1.4054601955022577E-2,1.5450797974779576E-5,10657.683877833269,5.8775762648905561E-5,3.5053254186533006E-5,0.62641349799059565,0.11106430055085029,3.7005836570548809E-3,7.2638451337643222E-5,3.7732221083925242E-3,8.0902935461935305E-2,9.817927449537104E-6,9.817927449537104E-6,4.4821334207677609E-2,6.026856000468994E-6,6.026856000468994E-6,5.9223687567087437E-2,7.0148903380879736E-3,2.5856113097729935E-4,20,10,8.2774036730199458E-4,7.2397116673643828E-5,7.9150278220636115E-3,9.2356476201662721E-2,8.5297186963882929E-3,1.0773380457387475E-4,0,1.9039063123405E-4,8.7201093276223426E-3,1.6595306440412212E-3,2.1723435538128651E-3,3.662949355511741E-4,1.9173775639049991E-2,2.2962842530892522E-2,0.25417699999999999,91.71434813515387,2.5311735310328144E-2,3.0777670285489511E-2,3.1720731212612442E-3,3.2479540861227881E-3,0,6.869839770975093E-4,1.3352766687245195E-2,2.621003558142178E-4,5.7172520938557923E-5,5.9880623041641328E-3,8.2856518648461303E-2,0.91714348135153867,91.71434813515387,77,92.501235770060475,0.92501235770060475,89.654211687682206,null,19.173775639049989,2.172343553812865,3.7732221083925244]
[null,null,null,null,null,null,null,71,7.8100000000000003E-2,0.24305499999999999,1.4459030296993634E-2,1.5450797974779576E-5,10550.998955007321,6.0218209191090121E-5,3.4559546381088877E-5,0.63536226224760417,0.11185480376914156,3.7534491378699492E-3,7.3676143499609552E-5,3.827125281369559E-3,8.0949855078968749E-2,9.8293185559590655E-6,9.8293185559590655E-6,4.5420436758626406E-2,6.1890482260331425E-6,6.1890482260331425E-6,5.9645213794585046E-2,7.1151030572035165E-3,2.6225486141983229E-4,20,10,8.3956522969202312E-4,7.3431361197553023E-5,8.0280996480930934E-3,9.3013825964866167E-2,8.6515718206224123E-3,1.092728589249301E-4,0,1.9311049739453642E-4,8.8446823180169491E-3,1.6801680572072031E-3,2.2003068656898704E-3,3.7152772034476238E-4,1.9444616552144675E-2,2.3287760200296225E-2,0.25780810000000004,91.715367069546161,2.5312016520391351E-2,3.0778012221374201E-2,3.1721083625780478E-3,3.2479901704671704E-3,0,6.8699160939949297E-4,1.335291503473374E-2,2.6210326771483313E-4,5.6985424013638054E-5,5.9772066938658967E-3,8.2846329304538363E-2,0.91715367069546161,91.715367069546161,78.100000000000009,92.503342172751601,0.92503342172751601,89.707663742243938,null,19.444616552144677,2.2003068656898703,3.8271252813695589]
[null,null,null,null,null,null,null,72,7.9199999999999993E-2,0.24305499999999999,1.4869195211191231E-2,1.5450797974779576E-5,10437.020016698219,6.1733236639747511E-5,3.4079552681351534E-5,0.64431102650461269,0.1126397593907974,3.8063146186850189E-3,7.4713835661575882E-5,3.881028454346595E-3,8.0981807267151151E-2,9.8370796623810237E-6,9.8370796623810237E-6,4.6018872722182434E-2,6.3532099398612794E-6,6.3532099398612794E-6,6.0063781833643554E-2,7.2153157763190584E-3,2.6594859186236512E-4,20,10,8.5139009208205156E-4,7.4465605721462218E-5,8.1411714741225719E-3,9.3666562576281892E-2,8.7734249448565317E-3,1.1081191327598547E-4,0,1.9583036355502287E-4,8.9692553084115539E-3,1.7007884461410475E-3,2.2282531533347385E-3,3.767605051383506E-4,1.9715440441007218E-2,2.3612659184956055E-2,0.26143919999999998,91.716363733788185,2.5312291584239057E-2,3.0778346683800757E-2,3.1721428336495589E-3,3.2480254661407838E-3,0,6.869990748874865E-4,1.3353060139892967E-2,2.6210611597203364E-4,5.6797698666252956E-5,5.9665930648692602E-3,8.2836362662118163E-2,0.91716363733788187,91.716363733788185,79.199999999999989,92.505398912924278,0.92505398912924275,89.756548039575279,null,19.715440441007217,2.2282531533347383,3.8810284543465952]
[null,null,null,null,null,null,null,73,8.0299999999999996E-2,0.24305499999999999,1.5285096697615366E-2,1.5450797974779576E-5,10315.747062905953,6.3326464557342244E-5,3.3612709493935759E-5,0.65325979076162111,0.113419282597803,3.859180099500089E-3,7.5751527823542212E-5,3.9349316273236314E-3,8.0998809739415242E-2,9.8412107688029838E-6,9.8412107688029838E-6,4.6616710809983197E-2,6.5193531802248133E-6,6.5193531802248133E-6,6.0479453103655802E-2,7.315528495434603E-3,2.6964232230489789E-4,20,10,8.6321495447207999E-4,7.5499850245371413E-5,8.2542433001520556E-3,9.4314781816482229E-2,8.8952780690906477E-3,1.123509676270408E-4,0,1.9855022971550926E-4,9.0938282988061569E-3,1.7213918108427543E-3,2.2561824167474688E-3,3.8199328993193866E-4,1.9986247305637622E-2,2.3937539496910281E-2,0.26507029999999998,91.717339038768102,2.5312560753262239E-2,3.0778673978446681E-2,3.172176565980156E-3,3.2480600054016423E-3,0,6.8700638038447369E-4,1.3353202135339816E-2,2.6210890318894637E-4,5.6609412317352393E-5,5.9562114779974935E-3,8.2826609612318802E-2,0.91717339038768098,91.717339038768102,80.3,92.50740802990839,0.92507408029908389,89.801265163129671,null,19.986247305637622,2.2561824167474689,3.9349316273236314]
[null,null,null,null,null,null,null,74,8.14E-2,0.24305499999999999,1.5706734756266046E-2,1.5450797974779576E-5,10187.180093630528,6.5004107999687904E-5,3.3158483689963655E-5,0.66220855501862963,0.11419348464069158,3.9120455803151591E-3,7.6789219985508542E-5,3.9888348003006679E-3,8.1000871909813171E-2,9.8417118752249407E-6,9.8417118752249407E-6,4.7214023155694521E-2,6.6874919476393757E-6,6.6874919476393757E-6,6.0892286927615648E-2,7.4157412145501433E-3,2.7333605274743077E-4,20,10,8.7503981686210843E-4,7.6534094769280608E-5,8.3673151261815324E-3,9.495857619680681E-2,9.0171311933247653E-3,1.1389002197809614E-4,0,2.0127009587599573E-4,9.2184012892007616E-3,1.7419781513123233E-3,2.284094655928061E-3,3.8722607472552694E-4,2.025703714603588E-2,2.4262401150159412E-2,0.26870140000000003,91.718293845551358,2.5312824265101556E-2,3.0778994394269919E-2,3.1722095893510311E-3,3.2480938187433505E-3,0,6.8701353234024349E-4,1.3353341146437502E-2,2.6211163182631564E-4,5.6420635443599485E-5,5.9460525309728189E-3,8.2817061544486328E-2,0.91718293845551357,91.718293845551358,81.400000000000006,92.509371452833022,0.92509371452833022,89.842182722097107,null,20.257037146035881,2.2840946559280608,3.9888348003006677]
[null,null,null,null,null,null,null,75,8.2500000000000004E-2,0.24305499999999999,1.6134109387143266E-2,1.5450797974779576E-5,10051.319108871947,6.6773058541463594E-5,3.2716370574097466E-5,0.67115731927563826,0.11496247302388475,3.9649110611302291E-3,7.7826912147474885E-5,4.0427379732777043E-3,8.0987994919604803E-2,9.8385829816468995E-6,9.8385829816468995E-6,4.7810885364425189E-2,6.8576422779906204E-6,6.8576422779906204E-6,6.1302340630948533E-2,7.515953933665687E-3,2.7702978318996365E-4,20,10,8.8686467925213708E-4,7.7568339293189817E-5,8.4803869522110126E-3,9.5598035113483817E-2,9.1389843175588847E-3,1.1542907632915153E-4,0,2.0398996203648215E-4,9.3429742795953664E-3,1.7625474675497547E-3,2.3119898708765163E-3,3.9245885951911521E-4,2.052780996220201E-2,2.4587244160739354E-2,0.27233250000000003,91.719228968677498,2.5313082344557314E-2,3.0779308204615174E-2,3.1722419319342135E-3,3.2481269350118562E-3,0,6.8702053685608345E-4,1.3353477291775514E-2,2.6211430421192467E-4,5.6231441620126519E-5,5.9361073226426742E-3,8.2807710313224883E-2,0.91719228968677502,91.719228968677498,82.5,92.511291007958761,0.92511291007958762,89.879638075182214,null,20.52780996220201,2.3119898708765163,4.0427379732777045]
[null,null,null,null,null,null,null,76,8.3600000000000008E-2,0.24305499999999999,1.6567220590247022E-2,1.5450797974779576E-5,9908.1641086302061,6.8640978901455711E-5,3.2285892013911974E-5,0.68010608353264679,0.11572635167994796,4.0177765419452983E-3,7.8864604309441215E-5,4.0966411462547399E-3,8.0960171640417772E-2,9.8318240880688584E-6,9.8318240880688584E-6,4.840737656094541E-2,7.0298223165395008E-6,7.0298223165395008E-6,6.1709669634430996E-2,7.6161666527812298E-3,2.8072351363249654E-4,20,10,8.9868954164216562E-4,7.8602583817099025E-5,8.5934587782404946E-3,9.6233244992533648E-2,9.2608374417930024E-3,1.1696813068020689E-4,0,2.067098281969686E-4,9.4675472699899711E-3,1.7830997595550484E-3,2.3398680615928334E-3,3.9769164431270344E-4,2.0798565754136002E-2,2.4912068546795351E-2,0.27596360000000003,91.720145179196919,2.5313335204427415E-2,3.0779615668232937E-2,3.1722736203975907E-3,3.2481593815129844E-3,0,6.8702739970752705E-4,1.3353610683611697E-2,2.6211692254927337E-4,5.6041907562843882E-5,5.9263674200285884E-3,8.2798548208030842E-2,0.91720145179196921,91.720145179196919,83.600000000000009,92.513168425431559,0.92513168425431558,89.913940863261431,null,20.798565754136003,2.3398680615928336,4.0966411462547399]
[null,null,null,null,null,null,null,77,8.4699999999999998E-2,0.24305499999999999,1.7006068365577314E-2,1.5450797974779576E-5,9757.7150929053078,7.0616413907253445E-5,3.1866594715030006E-5,0.6890548477896552,0.11648522113356082,4.0706420227603684E-3,7.9902296471407545E-5,4.1505443192317764E-3,8.0917386654500142E-2,9.8214351944908159E-6,9.8214351944908159E-6,4.9003579436581353E-2,7.2040523927920168E-6,7.2040523927920168E-6,6.2114327541625894E-2,7.7163793718967701E-3,2.8441724407502931E-4,20,10,9.1051440403219406E-4,7.9636828341008207E-5,8.7065306042699714E-3,9.6864289426119896E-2,9.3826905660271218E-3,1.1850718503126223E-4,0,2.0942969435745499E-4,9.5921202603845776E-3,1.8036350273282046E-3,2.3677292280770128E-3,4.0292442910629155E-4,2.1069304521837855E-2,2.5236874328656914E-2,0.27959470000000003,91.721043207470515,2.5313583046280126E-2,3.0779917030219085E-2,3.1723046800017501E-3,3.2481911841115959E-3,0,6.8703412636532347E-4,1.3353741428279896E-2,2.6211948892558015E-4,5.585211317029334E-5,5.9168248279412132E-3,8.2789567925294877E-2,0.91721043207470521,91.721043207470515,84.7,92.515005345511099,0.92515005345511103,89.945375361806484,null,21.069304521837854,2.367729228077013,4.1505443192317761]
[null,null,null,null,null,null,null,78,8.5800000000000001E-2,0.24305499999999999,1.7450652713134153E-2,1.5450797974779576E-5,9599.97206169725,7.2708921188595479E-5,3.1458048628939874E-5,0.69800361204666372,0.11723917865593449,4.1235075035754368E-3,8.0939988633373875E-5,4.2044474922088102E-3,8.0859616211937657E-2,9.8074163009127768E-6,9.8074163009127768E-6,4.9599580294653521E-2,7.3803550962173455E-6,7.3803550962173455E-6,6.2516366221223682E-2,7.8165920910123147E-3,2.8811097451756219E-4,20,10,9.2233926642222249E-4,8.0671072864917402E-5,8.8196024302994551E-3,9.7491249300956442E-2,9.5045436902612395E-3,1.2004623938231758E-4,0,2.1214956051794143E-4,9.7166932507791806E-3,1.8241532708692227E-3,2.3955733703290545E-3,4.0815721389987977E-4,2.1340026265307569E-2,2.556166152891351E-2,0.28322580000000003,91.72192374575414,2.5313826061167326E-2,3.07802125228821E-2,3.1723351346893591E-3,3.2482223673231054E-3,0,6.8704072201479797E-4,1.3353869626566197E-2,2.6212200531916676E-4,5.5662141565034797E-5,5.9074719609313433E-3,8.2780762542458433E-2,0.91721923745754141,91.72192374575414,85.8,92.51680332432062,0.92516803324320618,89.97420266416259,null,21.340026265307568,2.3955733703290547,4.2044474922088106]
[null,null,null,null,null,null,null,79,8.6900000000000005E-2,0.24305499999999999,1.7900973632917531E-2,1.5450797974779576E-5,9434.9350150060309,7.4929225816529945E-5,3.1059845481738103E-5,0.70695237630367225,0.11798831841034813,4.1763729843905077E-3,8.1977680795340205E-5,4.2583506651858475E-3,8.0786828164558011E-2,9.7897674073347363E-6,9.7897674073347363E-6,5.0195469094322043E-2,7.5587553527971183E-6,7.5587553527971183E-6,6.2915835884647747E-2,7.9168048101278584E-3,2.9180470496009502E-4,20,10,9.3416412881225104E-4,8.170531738882661E-5,8.9326742563289353E-3,9.8114202919329457E-2,9.6263968144953572E-3,1.2158529373337292E-4,0,2.1486942667842785E-4,9.8412662411737854E-3,1.8446544901781032E-3,2.4234004883489585E-3,4.1338999869346794E-4,2.1610730984545148E-2,2.5886430172491127E-2,0.28685690000000003,91.722787450586495,2.5314064430283473E-2,3.0780502366544452E-2,3.1723650071677572E-3,3.2482529543980446E-3,0,6.8704719157373646E-4,1.3353995374056614E-2,2.6212447360628296E-4,5.5472079134552318E-5,5.8983016173700595E-3,8.2772125494134957E-2,0.91722787450586496,91.722787450586495,86.9,92.518563839160237,0.92518563839160239,90.00066270680108,null,21.61073098454515,2.4234004883489586,4.2583506651858478]
[null,null,null,null,null,null,null,80,8.8000000000000009E-2,0.24305499999999999,1.835703112492745E-2,1.5450797974779576E-5,9262.603952831656,7.7289404168233262E-5,3.0671597413216375E-5,0.71590114056068088,0.11873273158942002,4.2292384652055769E-3,8.3015372957306549E-5,4.3122538381628831E-3,8.0698981876091813E-2,9.7684885137566925E-6,9.7684885137566925E-6,5.0791339492697728E-2,7.7392805023874273E-6,7.7392805023874273E-6,6.3312785159252788E-2,8.0170175292434004E-3,2.9549843540262796E-4,20,10,9.4598899120227969E-4,8.2739561912735819E-5,9.0457460823584156E-3,9.87332261132466E-2,9.7482499387294801E-3,1.2312434808442831E-4,0,2.1758929283891432E-4,9.9658392315683936E-3,1.8651386852548465E-3,2.4512105821367252E-3,4.1862278348705627E-4,2.1881418679550593E-2,2.621118028672962E-2,0.29048800000000002,91.723634944997698,2.5314298325575205E-2,3.0780786770283761E-2,3.1723943189853397E-3,3.2482829674002835E-3,0,6.870535397089304E-4,1.3354118761458603E-2,2.6212689556741824E-4,5.5282015571663706E-5,5.8893069554717742E-3,8.2763650550022966E-2,0.91723634944997701,91.723634944997698,88.000000000000014,92.520288293422482,0.92520288293422481,90.024976147565738,null,21.881418679550592,2.4512105821367252,4.3122538381628832]
[null,null,null,null,null,null,null,81,8.9100000000000013E-2,0.24305499999999999,1.8818825189163904E-2,1.5450797974779576E-5,9082.9788751741216,7.9803103671073321E-5,3.0292935716756913E-5,0.72484990481768929,0.11947250654468092,4.282103946020647E-3,8.4053065119272879E-5,4.3661570111399196E-3,8.0596028108001497E-2,9.7435796201786506E-6,9.7435796201786506E-6,5.1387288885072775E-2,7.9219603768737712E-6,7.9219603768737712E-6,6.3707261157418094E-2,8.1172302483589441E-3,2.9919216584516073E-4,20,10,9.5781385359230801E-4,8.3773806436645E-5,9.1588179083878975E-3,9.9348392352184525E-2,9.870103062963596E-3,1.2466340243548363E-4,0,2.2030915899940072E-4,1.0090412221962997E-2,1.8856058560994514E-3,2.4790036516923533E-3,4.2385556828064433E-4,2.2152089350323895E-2,2.6535911901460867E-2,0.29411910000000008,91.724466820554326,2.5314527910305713E-2,3.0781065932618989E-2,3.1724230906022893E-3,3.248312427279442E-3,0,6.8705977085149359E-4,1.3354239874898824E-2,2.6212927289314552E-4,5.5092043914414599E-5,5.8804814710923916E-3,8.2755331794456724E-2,0.91724466820554329,91.724466820554326,89.100000000000009,92.521978021143966,0.92521978021143969,90.047346107738051,null,22.152089350323894,2.4790036516923535,4.3661570111399195]
[null,null,null,null,null,null,null,82,9.0199999999999989E-2,0.24305499999999999,1.9286355825626895E-2,1.5450797974779576E-5,8896.0597820334315,8.2485806868866216E-5,2.9923509671430617E-5,0.73379866907469771,0.12020772890896986,4.3349694268357162E-3,8.5090757281239195E-5,4.4200601841169552E-3,8.047790888022463E-2,9.7150407266006089E-6,9.7150407266006089E-6,5.1983418443122043E-2,8.106827379098163E-6,8.106827379098163E-6,6.4099309541813643E-2,8.2174429674744826E-3,3.028858962876935E-4,20,10,9.6963871598233645E-4,8.4808050960554195E-5,9.2718897344173726E-3,9.9959772844868525E-2,9.9919561871977154E-3,1.26202456786539E-4,0,2.2302902515988711E-4,1.0214985212357603E-2,1.9060560027119181E-3,2.5067796970158437E-3,4.290883530742325E-4,2.2422742996865055E-2,2.6860625049087709E-2,0.29775019999999996,91.725283639254542,2.5314753339577757E-2,3.0781340042146565E-2,3.1724513414561261E-3,3.2483413539380183E-3,0,6.8706588921105954E-4,1.3354358796199055E-2,2.6213160718953772E-4,5.4902260585437191E-5,5.8718189771511291E-3,8.2747163607454682E-2,0.9172528363925454,91.725283639254542,90.199999999999989,92.523634291224241,0.92523634291224244,90.067959788482781,null,22.422742996865054,2.5067796970158436,4.4200601841169549]
[null,null,null,null,null,null,null,83,9.1299999999999992E-2,0.24305499999999999,1.9759623034316429E-2,1.5450797974779576E-5,8701.8466734095782,8.5355150602841069E-5,2.9562985458521815E-5,0.74274743333170612,0.1209384817121331,4.3878349076507863E-3,8.6128449443205525E-5,4.4739633570939916E-3,8.0344557305904132E-2,9.6828718330225707E-6,9.6828718330225707E-6,5.2579833150920602E-2,8.2939165625359466E-6,8.2939165625359466E-6,6.4488974587095224E-2,8.3176556865900281E-3,3.0657962673022638E-4,20,10,9.8146357837236489E-4,8.5842295484463377E-5,9.384961560446858E-3,0.1005674366354827,1.011380931143183E-2,1.2774151113759431E-4,0,2.2574889132037353E-4,1.0339558202752203E-2,1.926489125092248E-3,2.5345387181071972E-3,4.3432113786782067E-4,2.269337961917408E-2,2.718531976466363E-2,0.30138129999999996,91.726085935286065,2.5314974760818863E-2,3.0781609278130145E-2,3.1724790900225027E-3,3.2483697662936298E-3,0,6.8707189878894738E-4,1.3354475603132115E-2,2.6213389998319111E-4,5.4712765430750155E-5,5.8633135845391083E-3,8.2739140647139248E-2,0.91726085935286061,91.726085935286065,91.3,92.525258311340167,0.92525258311340164,90.086989971926442,null,22.693379619174081,2.5345387181071972,4.4739633570939912]
[null,null,null,null,null,null,null,84,9.2399999999999996E-2,0.24305499999999999,2.0238626815232509E-2,1.5450797974779576E-5,8500.3395493025673,8.8431314211488135E-5,2.9211045155444171E-5,0.75169619758871475,0.12166484549046828,4.4407003884658555E-3,8.7166141605171869E-5,4.5278665300710272E-3,8.0195897398992202E-2,9.6470729394445277E-6,9.6470729394445277E-6,5.317664183862101E-2,8.4832657116989356E-6,8.4832657116989356E-6,6.4876299238264087E-2,8.4178684057055701E-3,3.1027335717275927E-4,20,10,9.9328844076239354E-4,8.6876540008372585E-5,9.4980333864763365E-3,0.10117145069467942,1.0235662435665949E-2,1.2928056548864968E-4,0,2.2846875748085997E-4,1.0464131193146809E-2,1.9469052232404403E-3,2.562280714966413E-3,4.3955392266140894E-4,2.2963999217250966E-2,2.7509996085973137E-2,0.30501240000000002,91.726874216658629,2.5315192314231801E-2,3.0781873811048605E-2,3.1725063538716684E-3,3.2483976823368343E-3,0,6.8707780339039091E-4,1.3354590369659549E-2,2.6213615272589096E-4,5.4523661757976412E-5,5.8549596843909153E-3,8.2731257833413646E-2,0.91726874216658627,91.726874216658629,92.399999999999991,92.526851231580764,0.92526851231580765,90.104596416780069,null,22.963999217250965,2.5622807149664131,4.5278665300710275]
[null,null,null,null,null,null,null,85,9.35E-2,0.24305499999999999,2.0723367168375122E-2,1.5450797974779576E-5,8291.538409712397,9.1737494812148767E-5,2.8867385800674241E-5,0.76064496184572328,0.12238689839032234,4.4935658692809256E-3,8.8203833767138199E-5,4.5817697030480636E-3,8.0031843853416607E-2,9.6076440458664865E-6,9.6076440458664865E-6,5.3773957213629806E-2,8.6749154232398665E-6,8.6749154232398665E-6,6.5261325165909365E-2,8.5180811248211103E-3,3.1396708761529209E-4,20,10,1.005113303152422E-3,8.7910784532281794E-5,9.6111052125058133E-3,0.10177188000572687,1.0357515559900068E-2,1.3081961983970504E-4,0,2.3118862364134645E-4,1.0588704183541416E-2,1.9673042971564952E-3,2.5900056875934911E-3,4.4478670745499711E-4,2.3234601791095717E-2,2.7834654053612885E-2,0.30864350000000002,91.727648966720778,2.5315406133213265E-2,3.0782133803104936E-2,3.1725331497209309E-3,3.2484251191848439E-3,0,6.8708360663590027E-4,1.3354703166152478E-2,2.6213836679894585E-4,5.4335056373951969E-5,5.8467519316069286E-3,8.2723510332792183E-2,0.91727648966720776,91.727648966720778,93.5,92.528414147825814,0.9252841414782581,90.120927158053377,null,23.234601791095717,2.5900056875934911,4.5817697030480637]
[null,null,null,null,null,null,null,86,9.4600000000000004E-2,0.24305499999999999,2.1213844093744279E-2,1.5450797974779576E-5,8075.443254639069,9.5300493339560812E-5,2.8531718523922213E-5,0.7695937261027318,0.12310471626622049,4.5464313500959957E-3,8.9241525929104515E-5,4.6356728760251001E-3,7.9852301792281671E-2,9.5645851522884471E-6,9.5645851522884471E-6,5.4371895889120121E-2,8.8689091877319528E-6,8.8689091877319528E-6,6.5644092818534158E-2,8.6182938439366558E-3,3.1766081805782498E-4,20,10,1.0169381655424504E-3,8.8945029056190989E-5,9.724177038535297E-3,0.10236878764610914,1.0479368684134188E-2,1.3235867419076041E-4,0,2.3390848980183287E-4,1.071327717393602E-2,1.9876863468404112E-3,2.617713635988431E-3,4.5001949224858539E-4,2.3505187340708333E-2,2.8159293711073452E-2,0.31227460000000001,91.728410645570946,2.5315616344743302E-2,3.0782389408699821E-2,3.1725594934834587E-3,3.2484520931314949E-3,0,6.8708931197183085E-4,1.3354814059597002E-2,2.621405435172206E-4,5.4147059621698307E-5,5.8386852295246559E-3,8.2715893544290486E-2,0.91728410645570946,91.728410645570946,94.600000000000009,92.529948104888888,0.92529948104888893,90.136119720016168,null,23.505187340708332,2.617713635988431,4.6356728760251]
[null,null,null,null,null,null,null,87,9.5699999999999993E-2,0.24305499999999999,2.1710057591339971E-2,1.5450797974779576E-5,7852.0540840825824,9.9151442670011039E-5,2.8203767736290927E-5,0.77854249035974021,0.12381837277387479,4.5992968309110658E-3,9.0279218091070859E-5,4.6895760490021365E-3,7.9657166485342684E-2,9.5178962587104029E-6,9.5178962587104029E-6,5.497057840971481E-2,9.0652934720958124E-6,9.0652934720958124E-6,6.6024641472151119E-2,8.7185065630521943E-3,3.2135454850035775E-4,20,10,1.0287630279324788E-3,8.9979273580100171E-5,9.8372488645647738E-3,0.10296223486486833,1.0601221808368307E-2,1.3389772854181575E-4,0,2.3662835596231926E-4,1.0837850164330627E-2,2.00805137229219E-3,2.6454045601512332E-3,4.552522770421735E-4,2.3775755866088811E-2,2.8483915104821754E-2,0.31590570000000001,91.729159691371038,2.531582306974775E-2,3.0782640774872427E-2,3.1725854003137131E-3,3.2484786196937672E-3,0,6.8709492268022299E-4,1.335492311378547E-2,2.6214268413289003E-4,5.3959785416729412E-5,5.830754715646696E-3,8.270840308628967E-2,0.91729159691371043,91.729159691371038,95.699999999999989,92.53145409944392,0.92531454099443922,90.150302251128011,null,23.775755866088812,2.645404560151233,4.6895760490021363]
[null,null,null,null,null,"Eff (%)","Iout (mA)",88,9.6799999999999997E-2,0.24305499999999999,2.2212007661162211E-2,1.5450797974779576E-5,7621.3708980429374,1.0332671971376773E-4,2.7883270375651254E-5,0.78749125461674885,0.12452793945839538,4.6521623117261358E-3,9.1316910253037202E-5,4.743479221979173E-3,7.9446323032734328E-2,9.4675773651323588E-6,9.4675773651323588E-6,5.5570129274172757E-2,9.2641178026448156E-6,9.2641178026448156E-6,6.640300927732018E-2,8.8187192821677397E-3,3.2504827894289063E-4,20,10,1.0405878903225075E-3,9.1013518104009379E-5,9.9503206905942575E-3,0.10355228115595727,1.0723074932602423E-2,1.3543678289287109E-4,0,2.3934822212280568E-4,1.0962423154725228E-2,2.0283993735118314E-3,2.6730784600818981E-3,4.6048506183576172E-4,2.4046307367237146E-2,2.8808518284384098E-2,0.31953680000000001,91.72989652157024,2.5316026423436139E-2,3.0782888041711125E-2,3.1726108846497781E-3,3.248504713655126E-3,0,6.8710044188796942E-4,1.335503038949465E-2,2.6214478983893619E-4,5.3773351282662825E-5,5.822955748341292E-3,8.2701034784297675E-2,0.91729896521570242,91.72989652157024,96.8,92.532933082752166,0.92532933082752167,90.163594589142591,null,24.046307367237148,2.6730784600818982,4.7434792219791726]
[null,null,null,null,null,{"$f":"AU56","v":91.687238550564857},{"$f":"I56*1000","v":55},89,9.7900000000000001E-2,0.24305499999999999,2.2719694303210986E-2,1.5450797974779576E-5,7383.3936965201319,1.0786909808820403E-4,2.7569975202891127E-5,0.79644001887375737,0.1252334858380032,4.7050277925412042E-3,9.2354602415003532E-5,4.7973823949562077E-3,7.921964601264983E-2,9.4136284715543183E-6,9.4136284715543183E-6,5.6170676954909168E-2,9.4654348487182927E-6,9.4654348487182927E-6,6.6779233303787197E-2,8.9189320012832817E-3,3.2874200938542357E-4,20,10,1.0524127527125359E-3,9.2047762627918588E-5,1.0063392516623736E-2,0.10413898432785171,1.0844928056836544E-2,1.3697583724392649E-4,0,2.4206808828329212E-4,1.1086996145119836E-2,2.0487303504993356E-3,2.7007353357804257E-3,4.6571784662935005E-4,2.431684184415335E-2,2.9133103302429832E-2,0.32316790000000001,91.730621534046321,2.5316226515616529E-2,3.0783131342736501E-2,3.1726359602528304E-3,3.248530389105937E-3,0,6.8710587257536356E-4,1.3355135944651887E-2,2.6214686177241026E-4,5.3587878386102793E-5,5.8152838944390403E-3,8.2693784659536612E-2,0.91730621534046319,91.730621534046321,97.9,92.534385963205779,0.92534385963205779,90.176109263921944,null,24.316841844153352,2.7007353357804256,4.797382394956208]
[null,null,null,null,null,{"$f":"AU81","v":91.719228968677498},{"$f":"I81*1000","v":82.5},90,9.9000000000000005E-2,0.24305499999999999,2.3233117517486298E-2,1.5450797974779576E-5,7138.122479514167,1.1282921880959123E-4,2.7263642145081225E-5,0.80538878313076578,0.12593507948352164,4.7578932733562734E-3,9.3392294576969835E-5,4.8512855679332433E-3,7.8976999090352371E-2,9.3560495779762796E-6,9.3560495779762796E-6,5.6772353914180104E-2,9.6693005068707624E-6,9.6693005068707624E-6,6.7153349582871974E-2,9.0191447203988237E-3,3.3243573982795634E-4,20,10,1.0642376151025644E-3,9.3082007151827769E-5,1.0176464342653216E-2,0.10472240056965205,1.096678118107066E-2,1.385148915949818E-4,0,2.4478795444377857E-4,1.1211569135514439E-2,2.0690443032547012E-3,2.7283751872468147E-3,4.7095063142293817E-4,2.4587359296837408E-2,2.94576702148555E-2,0.32679900000000001,91.731335108170796,2.5316423450989563E-2,3.0783370805258701E-2,3.1726606402439788E-3,3.2485556594811882E-3,0,6.8711121758407762E-4,1.335523983449019E-2,2.6214890101747626E-4,5.340349157076275E-5,5.8077349176560746E-3,8.2686648918292013E-2,0.91731335108170797,91.731335108170796,99,92.535813608701574,0.92535813608701578,90.187952444546454,null,24.587359296837409,2.7283751872468147,4.8512855679332434]
[null,null,null,null,null,{"$f":"AU106","v":91.737913781765229},{"$f":"I106*1000","v":110},91,0.10010000000000001,0.24305499999999999,2.375227730398816E-2,1.5450797974779576E-5,6885.5572470250436,1.1826748630107098E-4,2.6964041681948462E-5,0.81433754738777442,0.12663278609390416,4.8107587541713461E-3,9.4429986738936192E-5,4.9051887409102823E-3,7.8718234585548802E-2,9.2948406843982377E-6,9.2948406843982377E-6,5.737529661676101E-2,9.8757739855839228E-6,9.8757739855839228E-6,6.7525393147742446E-2,9.1193574395143657E-3,3.3612947027048922E-4,20,10,1.076062477492593E-3,9.4116251675736978E-5,1.0289536168682696E-2,0.10530258451388921,1.108863430530478E-2,1.4005394594603719E-4,0,2.4750782060426504E-4,1.1336142125909044E-2,2.0893412317779295E-3,2.7559980144810665E-3,4.7618341621652645E-4,2.4857859725289335E-2,2.9782219080869601E-2,0.33043010000000006,91.732037605803455,2.5316617329422929E-2,3.0783606550711332E-2,3.1726849371386703E-3,3.2485805375957128E-3,0,6.8711647962461323E-4,1.3355342111693033E-2,2.6215090860825374E-4,5.3220319390793105E-5,5.8003047677801962E-3,8.2679623941965541E-2,0.91732037605803451,91.732037605803455,100.10000000000001,92.53721684885879,0.92537216848858794,90.199224835859255,null,24.857859725289334,2.7559980144810665,4.9051887409102823]
[null,null,null,null,null,null,null,92,0.1012,0.24305499999999999,2.4277173662716547E-2,1.5450797974779576E-5,6625.6979990527652,1.2425654048260016E-4,2.6670954272362069E-5,0.82328631164478283,0.12732666956803687,4.8636242349864136E-3,9.5467678900902522E-5,4.9590919138873162E-3,7.8443192994761907E-2,9.2300017908201961E-6,9.2300017908201961E-6,5.7979645538949222E-2,1.0084917890466583E-5,1.0084917890466583E-5,6.7895398071702584E-2,9.2195701586299094E-3,3.3982320071302211E-4,20,10,1.0878873398826215E-3,9.5150496199646173E-5,1.0402607994712177E-2,0.10587958929623262,1.1210487429538897E-2,1.4159300029709253E-4,0,2.5022768676475141E-4,1.1460715116303649E-2,2.1096211360690201E-3,2.7836038174831805E-3,4.8141620101011461E-4,2.512834312950912E-2,3.0106749963077724E-2,0.3340612,91.732729372222309,2.5316808246208002E-2,3.0783838694963428E-2,3.1727088628788406E-3,3.24860503567712E-3,0,6.8712166128326638E-4,1.3355442826529701E-2,2.6215288553147473E-4,5.3038494143279446E-5,5.7929895705619086E-3,8.2672706277777008E-2,0.9173272937222231,91.732729372222309,101.2,92.538596477091943,0.92538596477091939,90.21002252728519,null,25.128343129509119,2.7836038174831805,4.959091913887316]
[null,null,null,null,null,null,null,93,0.1023,0.24305499999999999,2.4807806593671482E-2,1.5450797974779576E-5,6358.5447355973247,1.3088452004476002E-4,2.6384169817820542E-5,0.83223507590179135,0.12801679207303865,4.9164897158014836E-3,9.6505371062868852E-5,5.0129950868643526E-3,7.8151702464894751E-2,9.1615328972421545E-6,9.1615328972421545E-6,5.8585545173721464E-2,1.0296798309906474E-5,1.0296798309906474E-5,6.8263397504612425E-2,9.3197828777454514E-3,3.4351693115555488E-4,20,10,1.0997122022726499E-3,9.6184740723555368E-5,1.0515679820741655E-2,0.10645346661228565,1.1332340553773015E-2,1.4313205464814788E-4,0,2.5294755292523788E-4,1.1585288106698254E-2,2.1298840161279729E-3,2.8111925962531568E-3,4.8664898580370278E-4,2.5398809509496766E-2,3.0431262927568266E-2,0.3376923,91.73341073699325,2.5316996292299838E-2,3.0784067348611312E-2,3.1727324288630043E-3,3.2486291653965904E-3,0,6.8712676502864247E-4,1.3355542026981981E-2,2.6215483272896929E-4,5.2858151899875092E-5,5.7857856182573332E-3,8.2665892630067558E-2,0.91733410736993248,91.73341073699325,102.3,92.539953252550276,0.92539953252550278,90.220437793026676,null,25.398809509496765,2.8111925962531568,5.0129950868643522]
[null,null,null,null,null,null,null,94,0.10339999999999999,0.24305499999999999,2.5344176096852949E-2,1.5450797974779576E-5,6084.0974566587292,1.3825942897054808E-4,2.6103487160184155E-5,0.84118384015879977,0.1287032141092645,4.9693551966165537E-3,9.7543063224835155E-5,5.0668982598413891E-3,7.7843578213680598E-2,9.0894340036641132E-6,9.0894340036641132E-6,5.9193144031879009E-2,1.0511484901136322E-5,1.0511484901136322E-5,6.8629423707550527E-2,9.4199955968609968E-3,3.4721066159808771E-4,20,10,1.1115370646626783E-3,9.7218985247464549E-5,1.0628751646771141E-2,0.10702426677163986,1.1454193678007134E-2,1.4467110899920319E-4,0,2.5566741908572424E-4,1.1709861097092858E-2,2.1501298719547876E-3,2.8387643507909949E-3,4.9188177059729084E-4,2.5669258865252283E-2,3.0755758043998473E-2,0.3413234,91.734082014784164,2.5317181554541893E-2,3.0784292617251817E-2,3.1727556459744022E-3,3.2486529378977125E-3,0,6.8713179321775255E-4,1.3355639758862618E-2,2.6215675109999214E-4,5.2679432537531753E-5,5.7786893607744997E-3,8.2659179852158204E-2,0.91734082014784168,91.734082014784164,103.39999999999999,92.541287901933401,0.925412879019334,90.230559836610553,null,25.669258865252285,2.8387643507909948,5.0668982598413894]
[null,null,null,null,null,null,null,95,0.1045,0.24305499999999999,2.5886282172260962E-2,1.5450797974779576E-5,5802.3561622369707,1.4651506743909674E-4,2.5828713611129583E-5,0.85013260441580829,0.12938599457220532,5.0222206774316229E-3,9.8580755386801512E-5,5.1208014328184247E-3,7.7518621892145256E-2,9.013705110086072E-6,9.013705110086072E-6,5.9802594639015681E-2,1.0729050976675282E-5,1.0729050976675282E-5,6.8993508085821151E-2,9.5202083159765371E-3,3.5090439204062059E-4,20,10,1.1233619270527068E-3,9.8253229771373758E-5,1.0741823472800617E-2,0.10759203874934824,1.1576046802241252E-2,1.4621016335025856E-4,0,2.5838728524621066E-4,1.1834434087487463E-2,2.1703587035494655E-3,2.8663190810966962E-3,4.9711455539087912E-4,2.5939691196775659E-2,3.1080235385680846E-2,0.3449545,91.734743506127614,2.5317364115876463E-2,3.07845146017382E-2,3.1727785246073877E-3,3.2486763638234863E-3,0,6.8713674810172844E-4,1.3355736065926388E-2,2.6215864150340245E-4,5.2502479768290965E-5,5.7716973973785494E-3,8.2652564938723888E-2,0.91734743506127614,91.734743506127614,104.5,92.542601121192305,0.92542601121192303,90.240475462699294,null,25.939691196775659,2.8663190810966963,5.1208014328184248]
[null,null,null,null,null,null,null,96,{"$f":"IF(PLOT_TYPE=1, H102/100*Iout_maxload_PFM, min_I*EXP(H102*rr/100))","v":0.1056},0.24305499999999999,2.6434124819895519E-2,1.5450797974779576E-5,5513.3208523320536,1.558192225125875E-4,2.5559664511013649E-5,0.85908136867281681,{"$f":"IripplePFM/SQRT(3)*SQRT(P102)","v":0.13006519081146312},5.0750861582466921E-3,9.9618447548767829E-5,5.1747046057954603E-3,7.7176620883563918E-2,8.934346216508031E-6,8.934346216508031E-6,6.0414053528146966E-2,1.0949573591105421E-5,1.0949573591105421E-5,6.9355681220402116E-2,9.6204210350920773E-3,3.5459812248315342E-4,20,10,1.1351867894427354E-3,9.9287474295282953E-5,1.0854895298830096E-2,0.10815683023496653,1.169789992647537E-2,1.4774921770131392E-4,0,2.6110715140669714E-4,1.1959007077882068E-2,2.1905705109120052E-3,2.8938567871702597E-3,5.0234734018446739E-4,2.6210106504066893E-2,3.1404695029669964E-2,0.3485856,91.735395498135574,2.5317544055542016E-2,3.0784733398420052E-2,3.1728010746921434E-3,3.2486994533416427E-3,0,6.8714163183117522E-4,1.3355830989974166E-2,2.6216050475970587E-4,5.2327441168098508E-5,5.7648064689151167E-3,8.2646045018644101E-2,0.91735395498135575,91.735395498135574,105.6,92.54389357712418,0.92543893577124181,90.250269642615493,null,26.210106504066893,2.8938567871702596,5.1747046057954602]
[null,null,null,null,null,null,null,97,0.1067,0.24305499999999999,2.6987704039756616E-2,1.5450797974779576E-5,5216.991526943978,1.6638519124417714E-4,2.5296162815023816E-5,0.86803013292982545,0.13074085868696853,5.1279516390617622E-3,1.0065613971073419E-4,5.2286077787724967E-3,7.6817347532659092E-2,8.8513573229299884E-6,8.8513573229299884E-6,6.1027681227842502E-2,1.117313362814148E-5,1.117313362814148E-5,6.9715972897922113E-2,{"$f":"RdsonTop*AA103^2","v":9.7206337542076211E-3},3.582918529256863E-4,20,10,1.1470116518327641E-3,1.0032171881919216E-4,1.0967967124859578E-2,0.10871868767930144,{"$f":"RdsonBot*AI103^2","v":1.1819753050709491E-2},1.4928827205236929E-4,0,2.6382701756718361E-4,1.2083580068276674E-2,2.2107652940424076E-3,{"$f":"(Vin-Vdd)*Fsw*(QgBot+QgTop)*P103+AO103","v":2.9213774690116856E-3},5.0758012497805556E-4,2.6480504787125995E-2,3.1729137056849564E-2,0.35221670000000005,91.736038265170322,2.5317721449258267E-2,3.0784949099368356E-2,3.1728233057178833E-3,3.2487222161683904E-3,0,6.8714644646119605E-4,1.3355924570950571E-2,2.6216234165297216E-4,5.2154468204603833E-5,5.7580134505145495E-3,8.2639617348296779E-2,0.91736038265170317,91.736038265170322,106.7,92.545165908868611,0.9254516590886861,90.260025913237968,null,26.480504787125994,2.9213774690116856,5.2286077787724965]
[null,null,null,null,null,null,null,98,0.10779999999999999,0.24305499999999999,2.7547019831844245E-2,1.5450797974779576E-5,4913.3681860727474,1.7848833304873955E-4,2.5038038704666435E-5,0.87697889718683386,0.13141305262259698,5.1808171198768323E-3,1.0169383187270049E-4,5.2825109517495332E-3,7.6440558297943495E-2,8.7647384293519478E-6,8.7647384293519478E-6,6.1643642245709424E-2,1.1399815887951034E-5,1.1399815887951034E-5,7.0074412139250808E-2,{"$f":"RdsonTop*AA104^2","v":9.8208464733231613E-3},3.6198558336821913E-4,20,10,1.1588365142227923E-3,1.0135596334310136E-4,1.1081038950889055E-2,0.10927765633899551,{"$f":"RdsonBot*AI104^2","v":1.1941606174943607E-2},1.5082732640342463E-4,0,2.6654688372766997E-4,1.2208153058671277E-2,2.2309430529406718E-3,2.9488811266209732E-3,5.1281290977164373E-4,2.6750886045952951E-2,3.2053561552019785E-2,0.35584779999999999,91.736672069473727,2.5317896369399906E-2,3.078516179258672E-2,3.1728452267546225E-3,3.2487446615907137E-3,0,6.8715119395610714E-4,1.3356016847035624E-2,2.6216415293263352E-4,5.1983716263905921E-5,5.7513153447425825E-3,8.2633279305262819E-2,0.91736672069473724,91.736672069473727,107.8,92.546418729312109,0.92546418729312108,90.269826505675894,null,26.750886045952953,2.9488811266209733,5.2825109517495328]
[null,null,null,null,null,null,null,99,0.1089,0.24305499999999999,2.8112072196158418E-2,1.5450797974779576E-5,4602.4508297183538,1.9249041309107404E-4,2.4785129222801114E-5,0.88592766144384238,0.13208182565732882,5.2336826006919007E-3,1.0273152403466685E-4,5.3364141247265679E-3,7.6045992819143815E-2,8.674489535773909E-6,8.674489535773909E-6,6.2262105047079491E-2,1.1629709174680684E-5,1.1629709174680684E-5,7.0431027226779477E-2,{"$f":"RdsonTop*AA105^2","v":9.9210591924387033E-3},3.6567931381075201E-4,20,10,1.1706613766128209E-3,1.0239020786701055E-4,1.1194110776918535E-2,0.10983378031907,{"$f":"RdsonBot*AI105^2","v":1.2063459299177728E-2},1.5236638075447997E-4,0,2.6926674988815639E-4,1.2332726049065884E-2,2.2511037876067987E-3,2.9763677599981236E-3,5.1804569456523201E-4,2.7021250280547776E-2,3.23779686039848E-2,0.35947889999999999,91.737297161758747,2.5318068885159809E-2,3.0785371562209885E-2,3.1728668464736294E-3,3.2487667984873137E-3,0,6.8715587619386752E-4,1.3356107854730811E-2,2.621659393151752E-4,5.1815344676206906E-5,5.7447092751659566E-3,8.2627028382412648E-2,0.91737297161758746,91.737297161758747,108.89999999999999,92.547652626407782,0.92547652626407784,90.27975203107151,null,27.021250280547775,2.9763677599981238,5.3364141247265682]
[null,null,null,null,null,null,null,100,0.11,0.24305499999999999,2.868286113269913E-2,1.5450797974779576E-5,4284.2394578808016,2.0887637922636132E-4,2.4537277930573103E-5,0.89487642570085091,0.1327472294940899,5.2865480815069716E-3,1.0376921619663318E-4,5.3903172977036052E-3,7.5633372890525283E-2,8.580610642195867E-6,8.580610642195867E-6,6.288324202875975E-2,1.1862906384142731E-5,1.1862906384142731E-5,7.0785845730464536E-2,{"$f":"RdsonTop*AA106^2","v":1.0021271911554249E-2},3.6937304425328478E-4,20,10,1.1824862390028494E-3,1.0342445239091975E-4,1.1307182602948017E-2,0.11038710261353836,{"$f":"RdsonBot*AI106^2","v":1.2185312423411847E-2},1.5390543510553534E-4,0,2.7198661604864287E-4,1.245729903946049E-2,2.2712474980407875E-3,3.0038373691431359E-3,5.2327847935882007E-4,2.7291597490910459E-2,{"$f":"SUM(T106,W106,Z106,AR106)","v":3.2702358305640403E-2},0.36311000000000004,91.737913781765229,2.5318239062702461E-2,3.0785578488690162E-2,3.1728881731666533E-3,3.2487886353482882E-3,0,6.8716049497024255E-4,1.3356197628940069E-2,2.6216770148572302E-4,5.1649516740334868E-5,5.7381924803039221E-3,8.2620862182347848E-2,0.91737913781765235,91.737913781765229,110,92.54886816441558,0.92548868164415576,90.289880442384444,null,27.291597490910458,3.0038373691431359,5.3903172977036053]
[]
[null,null,null,null,null,null,null,1.0000000000000001E-5,"A","min_I"]
[null,null,null,null,null,null,null,{"$f":"Iout_maxload_PFM","v":0.11},"A","max_I",null,null,null,{"$f":"O106","v":2.4537277930573103E-5},"OutputDischargeTime_Ioutmax",null,null,null,null,null,null,null,null,null,null,null,null,null,null,null,null,null,null,null,null,null,null,null,null,null,null,null,null,null,null,null,"100mA",{"$f":"AV106","v":2.5318239062702461E-2},{"$f":"AW106","v":3.0785578488690162E-2},{"$f":"AX106","v":3.1728881731666533E-3},{"$f":"AY106","v":3.2487886353482882E-3},null,{"$f":"BA106","v":6.8716049497024255E-4},{"$f":"BB106","v":1.3356197628940069E-2},{"$f":"BC106","v":2.6216770148572302E-4},null,{"$f":"BE106","v":5.7381924803039221E-3}]
[null,null,null,null,null,null,null,{"$f":"LOG(max_I/min_I,EXP(1))","v":9.3056505517805075},null,"rr",null,null,null,{"$f":"AT106+AS106","v":0.39581235830564043},"InputPower_Ioutmax",null,null,null,null,null,null,null,null,null,null,null,null,null,null,null,null,null,null,null,null,null,null,null,null,null,null,null,null,null,null,null,"1mA",{"$f":"AV56","v":2.530425348612678E-2},{"$f":"AW56","v":3.0768572801038903E-2},3.1711354971451491E-3,3.2469940325670537E-3,null,6.8678091344806828E-4,1.3348819780732026E-2,2.6202288231185709E-4,null,6.2783312796066935E-3]
[null,null,null,null,null,null,null,null,null,null,null,null,null,{"$f":"N110/VIN_nom","v":3.2984363192136705E-2},"InputCurrent_Ioutmax"]
[]
[]
[]
[]
[]
[]
[]
[]
[]
[]
[]
[]
[]
[null,null,null,null,null,null,null,null,null,null,null,null,null,null,null,null,null,null,null,null,null,null,null,null,null,null,null,null,null,null,null,null,null,null,null,null,null,null,null,null,null,null,null,null,null,"PFM","1mA",1.0297657167620348E-2,1.8557479052598299E-2,2.1886458807960196E-2,2.0607602979573505E-2,0,2.370003140169575E-3,1.2764483100900866E-2,2.3876651606253522E-2,4.2888258889496483E-5,4.9146718244167699E-2,0.1595499423581335]
[null,null,null,null,null,null,null,null,null,null,null,null,null,null,null,null,null,null,null,null,null,null,null,null,null,null,null,null,null,null,null,null,null,null,null,null,null,null,null,null,null,null,null,null,null,"COT","1mA",3.6409104085968987E-3,6.5692245841190103E-3,5.4394694205683519E-2,4.5907837520612008E-3,0,7.3751579484765363E-4,7.2151246180390156E-3,1.4929120352630757E-2,5.5024434421027814E-6,8.2551506228875166E-2]
[]
[]
[]
[]
[null,null,null,null,null,null,null,null,null,null,null,null,null,null,null,null,null,null,null,null,null,null,null,null,null,null,null,null,null,null,null,null,null,null,null,null,null,null,null,null,null,null,null,null,null,"PFM","100mA",1.0757450496859163E-2,1.9386075784552374E-2,2.2863695435355675E-2,2.1527738329525089E-2,0,2.4758244562599445E-3,1.3334420911554554E-2,2.4942750909659597E-2,3.6915573345206084E-5,6.6987357062394748E-3]
[null,null,null,null,null,null,null,null,null,null,null,null,null,null,null,null,null,null,null,null,null,null,null,null,null,null,null,null,null,null,null,null,null,null,null,null,null,null,null,null,null,null,null,null,null,"COT","100mA",8.1000709018000279E-3,1.4614802049391215E-2,2.4831534664325892E-2,9.9057039827182662E-3,1.1631608311305648E-2,1.6465542803473395E-3,1.6051760250250457E-2,6.8152413568584669E-3,1.7517781122613987E-5,1.2837829865088564E-2]

{"sheet":"COT Efficiency","index":7,"n_rows":110,"n_cols":78,"rows_kept":110,"cut":false,"hidden":true,"merged":[[0,0,2,4],[1,6,1,7],[3,0,3,4],[3,10,3,17]]}
["LM5165 (COT) Efficiency Calculator"]
[null,null,null,null,null,null,"TERMS OF USE",null,null,null,null,null,null,null,null,null,null,null,null,null,null,null,null,null,null,null,null,null,1.9257738538542499E-2,7.417209872377299E-4,1.2403450565440797E-3,20,7.1523178807947021,0,8.3629954314142624E-4,1.5780205303791562E-3,null,{"$f":"Ifb","v":9.8832335329341323E-6}]
[]
[null,null,null,null,null,null,null,"Currents",null,null,"Miscellaneous",null,null,null,null,null,null,null,"Inductor",null,null,null,"Cout",null,null,"Cin",null,null,"High-side MOSFET Losses ",null,null,null,null,null,null,null,"Low-side MOSFET Losses ",null,null,"Diode",null,null,null,null,null,null,"RESULTS"]
["Input Parameters",null,null,null,null,null,null,"Step","Iout (A)","Ripple Current pk-pk (A)","Peak Current (A)","Valley Current (A)","Off Time (sec)","Duty Cycle","Switching Frequency (Hz)","Active Mode Duration (sec)","Sleep Mode Duration (sec)","Operating Quiescent Current (A)","Irms (A)","Inductor DCR Loss @ 25°C (W)","Inductor Core Loss  (W)","Total Inductor Loss (W)","Irms (A)","Cout ESR Loss (W)","Total Cout Loss (W)","Irms (A)","Cin ESR Loss (W)","Total Cin Loss (W)","Irms (A)","Rdson HS Loss @ 25°C (W)","HS Gate Qg Loss (W)     ","SW Rise Time (ns)","SW Fall Time (ns)","HS Switching  Loss (W)","Coss Loss (W)","Total HS FET Loss (W)","Irms (A)","Rdson LS Loss @ 25°C (W)","LS Gate Qg Loss (W)","Reverse Recovery & Leakage Losses","DeadTime Loss @ 25°C (W)","Total LS FET Loss (W)","Quiescent Loss (W)","LDO + Quiescent Loss (W)","Total Gate Drive Loss (W)","Total Power Loss in IC (W)","Total Converter Power Loss (W)","Pout (W)","EFF (%)","High-side MOSFET Rdson %","Low-side MOSFET Rdson %","Gate Drive (Qg) Loss from Vin %","High-side MOSFET Switching Loss %","Reverse Recovery & Leakage Loss %","Deadtime Loss %","Inductor Cu Loss %","Inductor Core Loss %","Cin Cout ESR %","Quiescent Current Loss %","Total Loss %","Overall Eff %","Overall Eff","Current (mA)","Keep for \"previous\" data series","Keep for \"previous\" data series","Frequency (kHz)",null,"Coss",null,"Total Power Loss in IC (mW)","LDO + Quiescent Loss (mW)","Total Inductor Loss (mW)",null,null,"COT / PFM Overall Eff","COT / PFM Total Power Loss in IC (mW)","COT / PFM LDO + Quiescent Loss (mW)","COT / PFM Total Inductor Loss (mW)"]
["Design","Input Value","Units","Std Units","Description",null,null,0.1,{"$f":"IF(PLOT_TYPE=1, H6/100*Iout_maxload_COT, min_I*EXP(H6*rr/100))","v":1.1E-4},{"$f":"IF(I6<Icrit, (Vin-(Rdcr+RdsonTop)*Iripple/2-Vout)/L*OnTime, (Vin-(Rdcr+RdsonTop)*I6-Vout)/L*OnTime)","v":4.3265210615581043E-2},{"$f":"IF(I6<Icrit, (Vin-(Rdcr+RdsonTop)*Iripple/2-Vout)/L*OnTime, I6+((Vin-(Rdcr+RdsonTop)*J6-Vout)/L*OnTime)/2)","v":4.3265210615581043E-2},{"$f":"IF(I6<Icrit, 0, I6-((Vin-(Rdcr+RdsonTop)*K6-Vout)/L*OnTime)/2)","v":0},{"$f":"IF(I6<Icrit, L*J6/(Vout+J6/2*(RdsonBot+Rdcr)), L*J6/(Vout+I6*(RdsonBot+Rdcr)))","v":2.8591157756416169E-6},{"$f":"OnTime*O6","v":1.4131015179130863E-3},{"$f":"IF(I6<Icrit,I6/((OnTime+M6)*J6/2),1/(OnTime+M6))","v":1284.2485773217988},{"$f":"IF(1/O6-OnTime-M6>Tsleep, OnTime+M6+Tsleep, 1/O6)","v":4.9594491089749503E-6},{"$f":"IF(1/O6-OnTime-M6>Tsleep, 1/O6-OnTime-M6-Tsleep, 0)","v":7.7370600371591558E-4},{"$f":"P6*O6*Iq_active+Q6*O6*Iq_sleep","v":1.2343873401394021E-5},{"$f":"IF(I6<Icrit,Iripple*SQRT((OnTime+OffTime)*O6/3), SQRT(I6^2+Iripple^2/12))","v":1.7034840669976027E-3},{"$f":"S6^2*Rdcr","v":8.7055738995440781E-7},{"$f":"(O6/Fsw)*Fsw^2.5*(Iripple/2)^2.5*k_core","v":5.2039820054093663E-6},{"$f":"T6+U6","v":6.0745393953637743E-6},{"$f":"Iripple/SQRT(12)*SQRT((OnTime+M6)*O6)","v":8.6956884650259678E-4},{"$f":"RCoutEsr*W6^2","v":1.1342249682117851E-9},{"$f":"X6","v":1.1342249682117851E-9},{"$f":"SQRT($N6)*SQRT($I6^2*(1-N6)+(Iripple^2)/12)","v":4.5842296710483268E-4},{"$f":"RCinEsr*Z6^2","v":6.3045485030759551E-10},{"$f":"AA6","v":6.3045485030759551E-10},{"$f":"IF(I6<Icrit,Iripple*SQRT((OnTime)*O6/3), SQRT(OnTime*O6*(I6^2+Iripple^2/12)))","v":9.1680868757399586E-4},{"$f":"RdsonTop*AC6^2","v":1.6810763392223054E-6},{"$f":"QgTop*O6*Vdd","v":1.155823719589619E-5},20,{"$f":"IF(I6<Icrit, Csw*Vin/Iripple*1000000000, Csw*Vin/(I6+Iripple/2)*1000000000)","v":9.9425234626695893},{"$f":"IF(I6<Icrit, Vin*(I6+Iripple/2)*AG6/1000000000/2*O6, Vin*(I6-Iripple/2)*AF6/1000000000/2*O6+Vin*(I6+Iripple/2)*AG6/1000000000/2*O6)","v":1.626580530689335E-6},{"$f":"IF(I6<Icrit, Csw*(Vin)^2*O6/2, Csw*Vin^2*O6/2)","v":3.2363064148509331E-6},{"$f":"AD6+AH6+AI6","v":6.5439632847625733E-6},{"$f":"IF(I6<Icrit,Iripple*SQRT((OffTime)*O6/3), SQRT(OffTime*O6*(I6^2+Iripple^2/12)))","v":1.4357297088601114E-3},{"$f":"RdsonBot*AK6^2","v":2.0613197969035401E-6},{"$f":"QgBot*O6*Vdd","v":4.8159321649567459E-6},{"$f":"IF(I6<Icrit, Vin*Idss*N6, QrrBot*(I6-Iripple/2)/0.1*O6*Vin+Vin*Idss*N6)","v":0},{"$f":"IF(I6<Icrit, dead1*O6*(I6+Iripple/2)*((I6+Iripple/2)*BDserR+VSD), dead1*O6*(I6+Iripple/2)*((I6+Iripple/2)*BDserR+VSD)+dead2*O6*(I6-Iripple/2)*((I6-Iripple/2)*BDserR+VSD))","v":6.5613015015336183E-7},{"$f":"AL6+AN6+AO6","v":2.717449947056902E-6},{"$f":"Vin*R6+Vout*Ifb/0.7","v":1.9473298637703623E-4},{"$f":"(Vin-Vdd)*(O6*QgBot+O6*QgTop)+AQ6","v":2.1765682348223034E-4},{"$f":"AE6+AM6","v":1.6374169360852934E-5},{"$f":"AJ6+AP6+AR6+AS6","v":2.4329240607490275E-4},{"$f":"SUM(V6,Y6,AB6,AT6)","v":2.4936871015008503E-4},{"$f":"Vout*I6","v":3.6311000000000004E-4},{"$f":"AV6/(AV6+AU6)","v":0.59285326001130978},{"$f":"AD6/($AV6+$AU6)","v":2.7447098345840712E-3},{"$f":"AL6/($AV6+$AU6)","v":3.365537059073324E-3},{"$f":"Vin*O6*(QgBot+QgTop)/($AV6+$AU6)","v":6.4162240768201151E-2},{"$f":"AH6/($AV6+$AU6)","v":2.6557339932530045E-3},{"$f":"AN6/(AU6+AV6)","v":0},{"$f":"AO6/($AV6+$AU6)","v":1.0712701344224359E-3},{"$f":"T6/($AV6+$AU6)","v":1.4213675929096079E-3},{"$f":"U6/($AV6+$AU6)","v":8.4965924842255406E-3},{"$f":"(Y6+AB6)/($AV6+$AU6)","v":2.8812100555902653E-6},{"$f":"AQ6/($AV6+$AU6)","v":0.31794245767223128},{"$f":"AU6/($AV6+$AU6)","v":0.40714673998869022},{"$f":"AW6","v":0.59285326001130978},{"$f":"100*BI6","v":59.285326001130976},{"$f":"CHOOSE(MODE, I6*1000, 'PFM Efficiency'!BI6)","v":0.11},59.702372085750142,{"$f":"BL6/100","v":0.59702372085750144},{"$f":"O6/1000","v":1.2842485773217989},null,{"$f":"AI6/($AV6+$AU6)","v":5.2839492397342121E-3},null,{"$f":"1000*AT6","v":0.24329240607490274},{"$f":"1000*AR6","v":0.21765682348223034},{"$f":"1000*V6","v":6.0745393953637742E-3},null,null,{"$f":"IF(MODE=1, BJ6, 'PFM Efficiency'!BH6)","v":59.285326001130976},{"$f":"IF(MODE=1, BR6, 'PFM Efficiency'!BN6)","v":0.24329240607490274},{"$f":"IF(MODE=1, BS6, 'PFM Efficiency'!BO6)","v":0.21765682348223034},{"$f":"IF(MODE=1, BT6, 'PFM Efficiency'!BP6)","v":6.0745393953637742E-3}]
[null,null,null,null,null,null,null,1,1.1000000000000001E-3,4.3265210615581043E-2,4.3265210615581043E-2,0,2.8591157756416169E-6,{"$f":"OnTime*O7","v":1.4131015179130861E-2},12842.485773217988,{"$f":"IF(1/O7-OnTime-M7>Tsleep, OnTime+M7+Tsleep, 1/O7)","v":4.9594491089749503E-6},{"$f":"IF(1/O7-OnTime-M7>Tsleep, 1/O7-OnTime-M7-Tsleep, 0)","v":7.2907096173514111E-5},{"$f":"P7*O7*Iq_active+Q7*O7*Iq_sleep","v":2.8938734013940229E-5},{"$f":"IF(I7<Icrit,Iripple*SQRT((OnTime+OffTime)*O7/3), SQRT(I7^2+Iripple^2/12))","v":5.3868896095192933E-3},{"$f":"S7^2*Rdcr","v":8.7055738995440768E-6},{"$f":"(O7/Fsw)*Fsw^2.5*(Iripple/2)^2.5*k_core","v":5.2039820054093663E-5},{"$f":"T7+U7","v":6.0745393953637739E-5},{"$f":"Iripple/SQRT(12)*SQRT((OnTime+M7)*O7)","v":2.7498181372735487E-3},{"$f":"RCoutEsr*W7^2","v":1.1342249682117854E-8},{"$f":"X7","v":1.1342249682117854E-8},{"$f":"SQRT($N7)*SQRT($I7^2*(1-N7)+(Iripple^2)/12)","v":1.4554045254947983E-3},{"$f":"RCinEsr*Z7^2","v":6.354606998492217E-9},{"$f":"AA7","v":6.354606998492217E-9},{"$f":"IF(I7<Icrit,Iripple*SQRT((OnTime)*O7/3), SQRT(OnTime*O7*(I7^2+Iripple^2/12)))","v":2.8992036313635382E-3},{"$f":"RdsonTop*AC7^2","v":1.6810763392223052E-5},{"$f":"QgTop*O7*Vdd","v":1.155823719589619E-4},20,9.9425234626695893,1.7024264400641519E-5,3.2363064148509328E-5,6.6198091941373899E-5,4.5401759843683815E-3,{"$f":"RdsonBot*AK7^2","v":2.0613197969035402E-5},4.8159321649567459E-5,0,6.8680963480281412E-6,{"$f":"AL7+AN7+AO7","v":2.7481294317063542E-5},3.9387131372759068E-4,6.2310968477953174E-4,1.6374169360852935E-4,{"$f":"AJ7+AP7+AR7+AS7","v":8.8053076464649849E-4},9.4129385545681688E-4,3.6311000000000004E-3,{"$f":"AV7/(AV7+AU7)","v":0.79413543863168046},3.6765781609474951E-3,{"$f":"AL7/($AV7+$AU7)","v":4.5081851259237121E-3},8.5946241090206502E-2,{"$f":"AH7/($AV7+$AU7)","v":3.7232716469348557E-3},{"$f":"AN7/(AU7+AV7)","v":0},{"$f":"AO7/($AV7+$AU7)","v":1.5020789033367216E-3},1.9039422619192376E-3,1.138130740683853E-2,3.8703701474644769E-6,{"$f":"AQ7/($AV7+$AU7)","v":8.6141160665224425E-2},{"$f":"AU7/($AV7+$AU7)","v":0.20586456136831946},{"$f":"AW7","v":0.79413543863168046},{"$f":"100*BI7","v":79.413543863168044},{"$f":"CHOOSE(MODE, I7*1000, 'PFM Efficiency'!BI7)","v":1.1000000000000001},83.682599061581868,{"$f":"BL7/100","v":0.83682599061581864},12.842485773217987,null,{"$f":"AI7/($AV7+$AU7)","v":7.0779257368405344E-3},null,{"$f":"1000*AT7","v":0.88053076464649849},{"$f":"1000*AR7","v":0.62310968477953177},6.074539395363774E-2,null,null,{"$f":"IF(MODE=1, BJ7, 'PFM Efficiency'!BH7)","v":79.413543863168044},{"$f":"IF(MODE=1, BR7, 'PFM Efficiency'!BN7)","v":0.88053076464649849},{"$f":"IF(MODE=1, BS7, 'PFM Efficiency'!BO7)","v":0.62310968477953177},{"$f":"IF(MODE=1, BT7, 'PFM Efficiency'!BP7)","v":6.074539395363774E-2}]
["Vin",{"$f":"Vin","v":12},"V",{"$f":"B8","v":12},"Vin",null,null,2,2.2000000000000001E-3,4.3265210615581043E-2,4.3265210615581043E-2,0,2.8591157756416169E-6,{"$f":"OnTime*O8","v":2.8262030358261723E-2},25684.971546435976,4.9594491089749503E-6,3.3973823532269581E-5,4.7377468027880453E-5,7.6182123447888911E-3,1.7411147799088154E-5,1.0407964010818733E-4,{"$f":"T8+U8","v":1.2149078790727548E-4},3.8888301037917736E-3,2.2684499364235705E-8,{"$f":"X8","v":2.2684499364235705E-8},2.0822135245856725E-3,1.3006839485902467E-8,{"$f":"AA8","v":1.3006839485902467E-8},4.1000930955556424E-3,3.3621526784446097E-5,2.311647439179238E-4,20,9.9425234626695893,3.5733993454056749E-5,6.4726128297018656E-5,1.3408164853552149E-4,6.420778452654383E-3,4.122639593807081E-5,9.6318643299134917E-5,0,1.4418136170848418E-5,{"$f":"AL8+AN8+AO8","v":5.5644532108919228E-5},6.1513612189487339E-4,1.0736128639987556E-3,3.2748338721705871E-4,{"$f":"AJ8+AP8+AR8+AS8","v":1.590822431860255E-3},1.7123489111063807E-3,7.2622000000000008E-3,{"$f":"AV8/(AV8+AU8)","v":0.80919944522367282},3.7463194103090846E-3,{"$f":"AL8/($AV8+$AU8)","v":4.5937011816885205E-3},8.7576560906396331E-2,3.9817035717343331E-3,0,1.6065583143689112E-3,1.9400582660529183E-3,1.1597200164499008E-2,3.9769507307457693E-6,{"$f":"AQ8/($AV8+$AU8)","v":6.8542288641785271E-2},0.19080055477632718,{"$f":"AW8","v":0.80919944522367282},{"$f":"100*BI8","v":80.919944522367288},{"$f":"CHOOSE(MODE, I8*1000, 'PFM Efficiency'!BI8)","v":2.2000000000000002},85.591306536493136,0.85591306536493139,25.684971546435975,null,{"$f":"AI8/($AV8+$AU8)","v":7.2121873687620497E-3},null,{"$f":"1000*AT8","v":1.5908224318602551},{"$f":"1000*AR8","v":1.0736128639987557},0.12149078790727548,null,null,{"$f":"IF(MODE=1, BJ8, 'PFM Efficiency'!BH8)","v":80.919944522367288},{"$f":"IF(MODE=1, BR8, 'PFM Efficiency'!BN8)","v":1.5908224318602551},{"$f":"IF(MODE=1, BS8, 'PFM Efficiency'!BO8)","v":1.0736128639987557},{"$f":"IF(MODE=1, BT8, 'PFM Efficiency'!BP8)","v":0.12149078790727548}]
["Vout",{"$f":"Vout","v":3.3010000000000002},"V",{"$f":"B9","v":3.3010000000000002},"Vout",null,null,3,3.3E-3,4.3265210615581043E-2,4.3265210615581043E-2,0,2.8591157756416169E-6,4.2393045537392586E-2,38527.457319653964,4.9594491089749503E-6,2.0996065985188068E-5,6.5816202041820687E-5,9.3303664984522861E-3,2.611672169863223E-5,1.56119460162281E-4,1.8223618186091322E-4,4.7628247253321959E-3,3.4026749046353561E-8,3.4026749046353561E-8,2.5973304282109842E-3,2.0238376059931961E-8,2.0238376059931961E-8,5.0215679910098378E-3,5.0432290176669159E-5,3.4674711587688568E-4,20,9.9425234626695893,5.612918716024568E-5,9.7089192445527984E-5,2.0365066978244282E-4,7.8638154802300776E-3,6.1839593907106209E-5,1.4447796494870236E-4,0,2.265039917780098E-5,8.4489993084907192E-5,8.3640093006215625E-4,1.5241160432179794E-3,4.9122508082558806E-4,2.3034817869109175E-3,2.4857722338969372E-3,1.08933E-2,{"$f":"AV9/(AV9+AU9)","v":0.81420443881011151},3.7694908357617627E-3,4.6221137628983501E-3,8.8118232219007914E-2,4.1952974151703839E-3,0,1.6929723363339354E-3,1.9520577542337691E-3,1.1668930209281628E-2,4.0559707098972486E-6,6.2515615091984361E-2,0.18579556118988855,0.81420443881011151,81.420443881011153,{"$f":"CHOOSE(MODE, I9*1000, 'PFM Efficiency'!BI9)","v":3.3},86.246143423411425,0.86246143423411425,38.527457319653962,null,7.2567955945065342E-3,null,2.3034817869109174,1.5241160432179794,0.18223618186091323,null,null,{"$f":"IF(MODE=1, BJ9, 'PFM Efficiency'!BH9)","v":81.420443881011153},{"$f":"IF(MODE=1, BR9, 'PFM Efficiency'!BN9)","v":2.3034817869109174},{"$f":"IF(MODE=1, BS9, 'PFM Efficiency'!BO9)","v":1.5241160432179794},{"$f":"IF(MODE=1, BT9, 'PFM Efficiency'!BP9)","v":0.18223618186091323}]
["Iout",{"$f":"MIN(Iout, 0.15)","v":0.11},"A",{"$f":"B10","v":0.11},"Iout(max)",null,null,4,4.4000000000000003E-3,4.3265210615581043E-2,4.3265210615581043E-2,0,2.8591157756416169E-6,5.6524060716523446E-2,51369.943092871952,4.9594491089749503E-6,1.4507187211647313E-5,8.4254936055760908E-5,1.0773779219038587E-2,3.4822295598176307E-5,2.0815928021637465E-4,2.4298157581455096E-4,5.4996362745470973E-3,4.5368998728471416E-8,4.5368998728471416E-8,3.0721056139441632E-3,2.8313498709681734E-8,2.8313498709681734E-8,5.7984072627270764E-3,6.7243053568892208E-5,4.623294878358476E-4,20,9.9425234626695893,7.8209845519208314E-5,1.2945225659403731E-4,2.7490515568213785E-4,9.0803519687367631E-3,8.2452791876141607E-5,1.9263728659826983E-4,0,3.1565165078225957E-5,1.1401795695436756E-4,1.0576657382294389E-3,1.9746192224372031E-3,6.5496677443411741E-4,3.0185091095078259E-3,3.2615643678198152E-3,1.4524400000000002E-2,0.81662144934232683,3.780680776048062E-3,4.6358347611065503E-3,8.8379816024255653E-2,4.3972788824829514E-3,0,1.7747232832275811E-3,1.9578525447391743E-3,1.1703570068598455E-2,4.1427327703111248E-6,5.9466313794211557E-2,0.18337855065767311,0.81662144934232683,81.662144934232686,{"$f":"CHOOSE(MODE, I10*1000, 'PFM Efficiency'!BI10)","v":4.4000000000000004},86.576655770717792,0.86576655770717792,51.369943092871949,null,7.2783377902328169E-3,null,3.0185091095078258,1.9746192224372032,0.24298157581455096,null,null,{"$f":"IF(MODE=1, BJ10, 'PFM Efficiency'!BH10)","v":81.662144934232686},{"$f":"IF(MODE=1, BR10, 'PFM Efficiency'!BN10)","v":3.0185091095078258},{"$f":"IF(MODE=1, BS10, 'PFM Efficiency'!BO10)","v":1.9746192224372032},{"$f":"IF(MODE=1, BT10, 'PFM Efficiency'!BP10)","v":0.24298157581455096}]
["Rt",{"$f":"Vout/(Fsw/1000)*100000/16","v":82.525000000000006},"kW",{"$f":"B11*1000","v":82525},"RT pin resistance to get Fsw",null,null,5,5.5000000000000005E-3,4.3265210615581043E-2,4.3265210615581043E-2,0,2.8591157756416169E-6,7.0655075895654312E-2,64212.428866089947,4.9594491089749503E-6,1.0613859947522857E-5,1.0269367006970114E-4,1.204545135417244E-2,4.3527869497720398E-5,2.6019910027046833E-4,3.0372696976818875E-4,6.1487802807055026E-3,5.6711248410589259E-8,5.6711248410589259E-8,3.5345481944020624E-3,3.7479092815652637E-8,3.7479092815652637E-8,6.4828164003431126E-3,8.405381696111527E-5,5.7791185979480953E-4,20,9.9425234626695893,1.0197596853094468E-4,1.6181532074254667E-4,3.4784510623460662E-4,1.0152142130859725E-2,1.0306598984517705E-4,2.4079660824783729E-4,0,4.11627135814635E-5,1.4422870342664055E-4,1.2789305463967217E-3,2.4251224016564269E-3,8.1870846804264676E-4,3.7359046793603206E-3,4.039725839469736E-3,1.8155500000000001E-2,0.81799122619036857,3.787022379003799E-3,4.6436107742546581E-3,8.8528061733355881E-2,4.5945001537042694E-3,0,1.8545751180537172E-3,1.9611365891269669E-3,1.1723201293485227E-2,4.2437207851583723E-6,5.7621875787467837E-2,0.18200877380963151,0.81799122619036857,81.799122619036851,{"$f":"CHOOSE(MODE, I11*1000, 'PFM Efficiency'!BI11)","v":5.5000000000000009},86.775636491192159,0.86775636491192154,64.212428866089951,null,7.2905462603940138E-3,null,3.7359046793603206,2.4251224016564268,0.30372696976818875,null,null,{"$f":"IF(MODE=1, BJ11, 'PFM Efficiency'!BH11)","v":81.799122619036851},{"$f":"IF(MODE=1, BR11, 'PFM Efficiency'!BN11)","v":3.7359046793603206},{"$f":"IF(MODE=1, BS11, 'PFM Efficiency'!BO11)","v":2.4251224016564268},{"$f":"IF(MODE=1, BT11, 'PFM Efficiency'!BP11)","v":0.30372696976818875}]
["Tamb",25,"°C",{"$f":"B12","v":25},"Ambient temperature",null,null,6,6.6E-3,4.3265210615581043E-2,4.3265210615581043E-2,0,2.8591157756416169E-6,8.4786091074785172E-2,77054.914639307928,4.9594491089749503E-6,8.0183084381065579E-6,1.2113240408364138E-4,1.319513084402279E-2,5.2233443397264474E-5,3.12238920324562E-4,3.6447236372182649E-4,6.7356513217707034E-3,6.8053498092707135E-8,6.8053498092707135E-8,3.9985266932436227E-3,4.7964647149745343E-8,4.7964647149745343E-8,7.1015695572647286E-3,1.0086458035333831E-4,6.9349423175377135E-4,20,9.9425234626695893,1.2742755619545474E-4,1.9417838489105597E-4,4.2247052143984902E-4,1.1121114504140869E-2,1.2367918781421242E-4,2.8895592989740471E-4,0,5.1443324396853742E-5,1.7512251221106615E-4,1.5001953545640046E-3,2.8756255808756511E-3,9.8245016165117612E-4,4.4556687761777422E-3,4.8202571580448113E-3,2.17866E-2,0.81883402728054389,3.7909242626516316E-3,4.6483952268228327E-3,8.8619274871774817E-2,4.7892750142767586E-3,0,1.9334611409111658E-3,1.9631572074445946E-3,1.1735280062198324E-2,4.3604603337141386E-6,5.6383786542425499E-2,0.18116597271945609,0.81883402728054389,81.883402728054392,{"$f":"CHOOSE(MODE, I12*1000, 'PFM Efficiency'!BI12)","v":6.6},86.908342895294993,0.86908342895294988,77.054914639307924,null,7.2980579306167496E-3,null,4.4556687761777418,2.875625580875651,0.36447236372182651,null,null,{"$f":"IF(MODE=1, BJ12, 'PFM Efficiency'!BH12)","v":81.883402728054392},{"$f":"IF(MODE=1, BR12, 'PFM Efficiency'!BN12)","v":4.4556687761777418},{"$f":"IF(MODE=1, BS12, 'PFM Efficiency'!BO12)","v":2.875625580875651},{"$f":"IF(MODE=1, BT12, 'PFM Efficiency'!BP12)","v":0.36447236372182651}]
["VDD",5,"V",{"$f":"B13","v":5},"Gate drive rail",null,null,7,7.7000000000000011E-3,4.3265210615581043E-2,4.3265210615581043E-2,0,2.8591157756416169E-6,9.8917106253916032E-2,89897.400412525923,4.9594491089749503E-6,6.1643430742377712E-6,1.3957113809758161E-4,1.4252370246945895E-2,6.0939017296808578E-5,3.6427874037865563E-4,4.2521775767546423E-4,7.2753349418806816E-3,7.9395747774824977E-8,7.9395747774824977E-8,4.4714745470690979E-3,5.9982253875260378E-8,5.9982253875260378E-8,7.6705718087233029E-3,1.1767534374556137E-4,8.0907660371273339E-4,20,9.9425234626695893,1.5456460851273848E-4,2.2654144903956532E-4,4.9878140129786517E-4,1.2012176563106615E-2,1.4429238578324784E-4,3.3711525154697224E-4,0,6.2407277233736822E-5,2.0669966301698465E-4,1.7214601627312874E-3,3.3261287600948753E-3,1.1461918552597057E-3,5.1778016796694302E-3,5.6031588153465442E-3,2.5417700000000005E-2,0.81937447803429075,3.793426366627392E-3,4.6514632828883488E-3,8.8677765789720683E-2,4.9826024944310291E-3,0,2.0117843160055542E-3,1.964452939860614E-3,1.1743025637911762E-2,4.4930413590333187E-6,5.5493633267163181E-2,0.18062552196570927,0.81937447803429075,81.93744780342908,{"$f":"CHOOSE(MODE, I13*1000, 'PFM Efficiency'!BI13)","v":7.7000000000000011},87.002989620240314,0.87002989620240312,89.897400412525926,null,7.3028748297417024E-3,null,5.1778016796694306,3.3261287600948752,0.42521775767546421,null,null,{"$f":"IF(MODE=1, BJ13, 'PFM Efficiency'!BH13)","v":81.93744780342908},{"$f":"IF(MODE=1, BR13, 'PFM Efficiency'!BN13)","v":5.1778016796694306},{"$f":"IF(MODE=1, BS13, 'PFM Efficiency'!BO13)","v":3.3261287600948752},{"$f":"IF(MODE=1, BT13, 'PFM Efficiency'!BP13)","v":0.42521775767546421}]
[null,null,null,null,null,null,null,8,8.8000000000000005E-3,4.3265210615581043E-2,4.3265210615581043E-2,0,2.8591157756416169E-6,0.11304812143304689,102739.8861857439,4.9594491089749503E-6,4.7738690513361821E-6,1.5800987211152183E-4,1.5236424689577782E-2,6.9644591196352614E-5,4.163185604327493E-4,4.8596315162910192E-4,7.7776602075835472E-3,9.073799745694282E-8,9.073799745694282E-8,4.9573719027625265E-3,7.3726608546898062E-8,7.3726608546898062E-8,8.2001861911112847E-3,1.3448610713778439E-4,9.2465897567169521E-4,20,9.9425234626695893,1.8338712548279597E-4,2.5890451318807462E-4,5.7677774580865496E-4,1.2841556905308766E-2,1.6490558375228324E-4,3.8527457319653967E-4,0,7.4054851801452892E-5,2.3896043555373612E-4,1.9427249708985699E-3,3.7766319393140986E-3,1.3099335488682348E-3,5.9023036695447246E-3,6.3884312857798303E-3,2.9048800000000003E-2,0.81972543977092927,3.7950512006210448E-3,4.6534556388567573E-3,8.8715749036108155E-2,5.1749845805923655E-3,0,2.0897471138262838E-3,1.9652943717501834E-3,1.174805551470407E-2,4.6410117279629816E-6,5.4821578899086905E-2,0.18027456022907087,0.81972543977092927,81.972543977092926,{"$f":"CHOOSE(MODE, I14*1000, 'PFM Efficiency'!BI14)","v":8.8000000000000007},87.073765890198644,0.8707376589019864,102.7398861857439,null,7.3060028617971413E-3,null,5.9023036695447244,3.7766319393140986,0.48596315162910192,null,null,{"$f":"IF(MODE=1, BJ14, 'PFM Efficiency'!BH14)","v":81.972543977092926},{"$f":"IF(MODE=1, BR14, 'PFM Efficiency'!BN14)","v":5.9023036695447244},{"$f":"IF(MODE=1, BS14, 'PFM Efficiency'!BO14)","v":3.7766319393140986},{"$f":"IF(MODE=1, BT14, 'PFM Efficiency'!BP14)","v":0.48596315162910192}]
["Outputs",null,null,null,null,null,null,9,9.8999999999999991E-3,4.3265210615581043E-2,4.3265210615581043E-2,0,2.8591157756416169E-6,0.12717913661217775,115582.37195896188,4.9594491089749503E-6,3.6923892557460574E-6,1.7644860612546205E-4,1.6160668828557882E-2,7.8350165095896718E-5,4.6835838048684298E-4,5.4670854558273971E-4,8.2494544118206451E-3,1.0208024713906065E-7,1.0208024713906065E-7,5.4581746066720439E-3,8.9375010110758559E-8,8.9375010110758559E-8,8.6976108940906155E-3,1.5129687053000752E-4,1.040241347630657E-3,20,9.9425234626695893,2.138951071056271E-4,2.9126757733658392E-4,6.5645955497221854E-4,1.3620527953105145E-2,1.8551878172131864E-4,4.3343389484610709E-4,0,8.6386327809342058E-5,2.7190510953066071E-4,2.1639897790658525E-3,4.227135118533322E-3,1.4736752424767642E-3,6.6291750255129652E-3,7.176075026352955E-3,3.2679899999999998E-2,0.81994983132119847,3.7960900575125648E-3,4.6547294752832613E-3,8.8740034075334304E-2,5.3667011524419789E-3,0,2.167462413156949E-3,1.9658323512118632E-3,1.1751271426107686E-2,4.8036776699912154E-6,5.4295241243879057E-2,0.18005016867880166,0.81994983132119847,81.994983132119842,{"$f":"CHOOSE(MODE, I15*1000, 'PFM Efficiency'!BI15)","v":9.8999999999999986},87.128587175766796,0.87128587175766792,115.58237195896189,null,7.3080028062040003E-3,null,6.6291750255129651,4.2271351185333224,0.54670854558273974,null,null,{"$f":"IF(MODE=1, BJ15, 'PFM Efficiency'!BH15)","v":81.994983132119842},{"$f":"IF(MODE=1, BR15, 'PFM Efficiency'!BN15)","v":6.6291750255129651},{"$f":"IF(MODE=1, BS15, 'PFM Efficiency'!BO15)","v":4.2271351185333224},{"$f":"IF(MODE=1, BT15, 'PFM Efficiency'!BP15)","v":0.54670854558273974}]
["Design","Value","Units","Std Units","Description",null,null,10,1.1000000000000001E-2,4.3265210615581043E-2,4.3265210615581043E-2,0,2.8591157756416169E-6,0.14131015179130862,128424.85773217989,4.9594491089749503E-6,2.8272054192739543E-6,1.9488734013940227E-4,1.7034840669976029E-2,8.7055738995440795E-5,5.2039820054093665E-4,6.074539395363775E-4,8.6956884650259691E-3,1.1342249682117854E-7,1.1342249682117854E-7,5.9745951300580998E-3,1.0708736090434189E-7,1.0708736090434189E-7,9.1680868757399569E-3,1.6810763392223049E-4,1.1558237195896191E-3,20,9.9425234626695893,2.4608855338123205E-4,3.2363064148509333E-4,7.3782682878855582E-4,1.4357297088601114E-2,2.0613197969035404E-4,4.8159321649567457E-4,0,9.9401984966744552E-5,3.0553396465709859E-4,2.3852545872331352E-3,4.6776382977525462E-3,1.6374169360852935E-3,7.3584160272834945E-3,7.966090476677597E-3,3.6311000000000003E-2,0.82008550266251945,3.7967181698801791E-3,4.6554996606864097E-3,8.8754717265685679E-2,5.5579206025485372E-3,0,2.2449981219769466E-3,1.9661576236879503E-3,1.1753215826479155E-2,4.9802246568498272E-6,5.3871077831763543E-2,0.17991449733748055,0.82008550266251945,82.008550266251945,{"$f":"CHOOSE(MODE, I16*1000, 'PFM Efficiency'!BI16)","v":11.000000000000002},87.172217484522335,0.8717221748452233,128.4248577321799,null,7.3092120101152921E-3,null,7.3584160272834946,4.6776382977525461,0.6074539395363775,null,null,{"$f":"IF(MODE=1, BJ16, 'PFM Efficiency'!BH16)","v":82.008550266251945},{"$f":"IF(MODE=1, BR16, 'PFM Efficiency'!BN16)","v":7.3584160272834946},{"$f":"IF(MODE=1, BS16, 'PFM Efficiency'!BO16)","v":4.6776382977525461},{"$f":"IF(MODE=1, BT16, 'PFM Efficiency'!BP16)","v":0.6074539395363775}]
["On-Time",{"$f":"Vout/Vin/Fsw*1000000","v":1.1003333333333334},"µs",{"$f":"B17/1000000","v":1.1003333333333335E-6},"On Time - fixed",null,null,11,1.21E-2,4.3265210615581043E-2,4.3265210615581043E-2,0,2.8591157756416169E-6,0.15544116697043944,141267.34350539785,4.9594491089749503E-6,2.1193277348876924E-6,2.1332607415334247E-4,1.7866291621839607E-2,9.5761312894984831E-5,5.7243802059503022E-4,6.6819933349001508E-4,9.1201150030503584E-3,1.2476474650329636E-7,1.2476474650329636E-7,6.5065650604228887E-3,1.2700616665654772E-7,1.2700616665654772E-7,9.6155706360687085E-3,1.8491839731445356E-4,1.2714060915485807E-3,20,9.9425234626695893,2.7996746430961061E-4,3.5599370563360258E-4,8.2087956725766667E-4,1.5058060222332406E-2,2.2674517765938946E-4,5.29752538145242E-4,0,1.1310210298300036E-4,3.3984728064238981E-4,2.6065193954004176E-3,5.1281414769717686E-3,1.8011586296938227E-3,8.0900269545656472E-3,8.758478058968823E-3,3.9942100000000001E-2,0.82015658934553781,3.7970472771503071E-3,4.655903208886686E-3,8.8762410705494288E-2,5.748750332503519E-3,0,2.3223975462067681E-3,1.966328054238551E-3,1.1754234619184538E-2,5.1697725816516728E-6,5.3521323550704637E-2,0.17984341065446222,0.82015658934553781,82.015658934553784,{"$f":"CHOOSE(MODE, I17*1000, 'PFM Efficiency'!BI17)","v":12.1},87.207695786257617,0.87207695786257622,141.26734350539783,null,7.3098455875112937E-3,null,8.0900269545656478,5.128141476971769,0.66819933349001503,null,null,{"$f":"IF(MODE=1, BJ17, 'PFM Efficiency'!BH17)","v":82.015658934553784},{"$f":"IF(MODE=1, BR17, 'PFM Efficiency'!BN17)","v":8.0900269545656478},{"$f":"IF(MODE=1, BS17, 'PFM Efficiency'!BO17)","v":5.128141476971769},{"$f":"IF(MODE=1, BT17, 'PFM Efficiency'!BP17)","v":0.66819933349001503}]
["Off Time",{"$f":"L*Iripple*1000000/(Vout+(Rdcr+RdsonBot)*Iout)","v":2.698436507936508},"µs",{"$f":"B18/1000000","v":2.6984365079365078E-6},"Off Time - depends on Vout, L, Iout, DCR, etc.",null,null,12,1.32E-2,4.3265210615581043E-2,4.3265210615581043E-2,0,2.8591157756416169E-6,0.16957218214957034,154109.82927861586,4.9594491089749503E-6,1.5294296645658044E-6,2.3176480816728274E-4,1.8660732996904572E-2,1.0446688679452892E-4,6.2447784064912401E-4,7.2894472744365287E-4,9.5256494506643918E-3,1.3610699618541424E-7,1.3610699618541424E-7,7.0535224412505626E-3,1.4925653648767589E-7,1.4925653648767589E-7,1.0043135982019676E-2,2.0172916070667664E-4,1.3869884635075427E-3,20,9.9425234626695893,3.1553183989076292E-4,3.8835676978211193E-4,9.0561777037955155E-4,1.5727630960460155E-2,2.4735837562842483E-4,5.7791185979480942E-4,0,1.274869615674498E-4,3.7484533719587464E-4,2.8277842035677007E-3,5.5786446561909937E-3,1.9649003233023522E-3,8.8240080870687718E-3,9.5532381780450981E-3,4.3573199999999999E-2,0.82017920821213564,3.7971519948431765E-3,4.6560316127243692E-3,8.8764858658912857E-2,5.9392620832834008E-3,0,2.3996896072760766E-3,1.9663822830437868E-3,1.1754558785896438E-2,5.3714034379029528E-6,5.322743817477122E-2,0.17982079178786442,0.82017920821213564,82.017920821213565,{"$f":"CHOOSE(MODE, I18*1000, 'PFM Efficiency'!BI18)","v":13.2},87.237051991392704,0.872370519913927,154.10982927861585,null,7.3100471836751767E-3,null,8.8240080870687727,5.5786446561909937,0.72894472744365291,null,null,{"$f":"IF(MODE=1, BJ18, 'PFM Efficiency'!BH18)","v":82.017920821213565},{"$f":"IF(MODE=1, BR18, 'PFM Efficiency'!BN18)","v":8.8240080870687727},{"$f":"IF(MODE=1, BS18, 'PFM Efficiency'!BO18)","v":5.5786446561909937},{"$f":"IF(MODE=1, BT18, 'PFM Efficiency'!BP18)","v":0.72894472744365291}]
["DIL",{"$f":"(Vin-Vout-(Rdcr+RdsonTop)*Iout)/L*OnTime*1000","v":42.242796969696975},"mA",{"$f":"B19/1000","v":4.2242796969696975E-2},"Inductor pk-pk ripple current in CCM",null,null,13,1.43E-2,4.3265210615581043E-2,4.3265210615581043E-2,0,2.8591157756416169E-6,0.18370319732870119,166952.31505183384,4.9594491089749503E-6,1.0302851435242083E-6,2.5020354218122294E-4,1.9422706702386001E-2,1.1317246069407301E-4,6.7651766070321757E-4,7.8969012139729056E-4,9.9146102921406545E-3,1.474492458675321E-7,1.474492458675321E-7,7.6145952597500913E-3,1.739461829094257E-7,1.739461829094257E-7,1.0453227350892635E-2,2.1853992409889971E-4,1.5025708354665045E-3,20,9.9425234626695893,3.5278168012468892E-4,4.2071983393062129E-4,9.9204143815420989E-4,1.636983731127039E-2,2.6797157359746015E-4,6.2607118144437696E-4,0,1.4255684042943287E-4,4.1052841402689302E-4,3.0490490117349831E-3,6.029147835410217E-3,2.1286420169108816E-3,9.5603597045022005E-3,1.0350371221328269E-2,4.7204300000000005E-2,0.82016453223187402,3.7970840500243263E-3,4.6559482994345865E-3,8.8763270333702252E-2,6.1295056098584245E-3,0,2.4768943580830496E-3,1.9663470973340252E-3,1.1754348454214044E-2,5.5841762615760883E-6,5.2976569008791143E-2,0.17983546776812598,0.82016453223187402,82.016453223187398,{"$f":"CHOOSE(MODE, I19*1000, 'PFM Efficiency'!BI19)","v":14.3},87.261693661062651,0.87261693661062656,166.95231505183384,null,7.3099163804225395E-3,null,9.5603597045022006,6.0291478354102166,0.78969012139729056,null,null,{"$f":"IF(MODE=1, BJ19, 'PFM Efficiency'!BH19)","v":82.016453223187398},{"$f":"IF(MODE=1, BR19, 'PFM Efficiency'!BN19)","v":9.5603597045022006},{"$f":"IF(MODE=1, BS19, 'PFM Efficiency'!BO19)","v":6.0291478354102166},{"$f":"IF(MODE=1, BT19, 'PFM Efficiency'!BP19)","v":0.78969012139729056}]
["CCM Freq",{"$f":"'Design Regulator'!E12","v":250},"kHz",{"$f":"B20*1000","v":250000},"Frequency in CCM",{"$f":"0.0000765*Rt/Vin","v":0.52609687500000002},null,14,1.5400000000000002E-2,4.3265210615581043E-2,4.3265210615581043E-2,0,2.8591157756416169E-6,0.19783421250783206,179794.80082505185,4.9594491089749503E-6,6.0244698263141024E-7,2.6864227619516324E-4,2.0155895299193659E-2,1.2187803459361712E-4,7.2855748075731125E-4,8.5043551535092835E-4,1.0288877345614534E-2,1.5879149554964995E-7,1.5879149554964995E-7,8.1887203278838902E-3,2.0116542182489654E-7,2.0116542182489654E-7,1.0847826683053218E-2,2.3535068749112276E-4,1.6181532074254668E-3,20,9.9425234626695893,3.9171698501138871E-4,4.5308289807913064E-4,1.080150570581642E-3,1.6987783009165605E-2,2.8858477156649563E-4,6.7423050309394449E-4,0,1.5831201927828985E-4,4.468967908447855E-4,3.2703138199022667E-3,6.479651014629443E-3,2.2923837105194114E-3,1.0299082086575281E-2,1.1149877558843583E-2,5.083540000000001E-2,0.82012055123478589,3.7968804329011944E-3,4.6556986260574149E-3,8.8758510438607247E-2,6.3195165116349712E-3,0,2.5540261415785671E-3,1.9662416527524039E-3,1.1753718131949642E-2,5.8071356869029701E-6,5.2759525304984019E-2,0.17987944876521411,0.82012055123478589,82.012055123478589,{"$f":"CHOOSE(MODE, I20*1000, 'PFM Efficiency'!BI20)","v":15.400000000000002},87.282627535503536,0.87282627535503532,179.79480082505185,null,7.3095243890617728E-3,null,10.299082086575281,6.479651014629443,0.85043551535092832,null,null,{"$f":"IF(MODE=1, BJ20, 'PFM Efficiency'!BH20)","v":82.012055123478589},{"$f":"IF(MODE=1, BR20, 'PFM Efficiency'!BN20)","v":10.299082086575281},{"$f":"IF(MODE=1, BS20, 'PFM Efficiency'!BO20)","v":6.479651014629443},{"$f":"IF(MODE=1, BT20, 'PFM Efficiency'!BP20)","v":0.85043551535092832}]
["Icrit_Skip",{"$f":"1000*Iripple/2","v":21.121398484848488},"mA",{"$f":"Iripple/2","v":2.1121398484848487E-2},"CCM-DCM (critical conduction) boundary",null,null,15,1.6500000000000001E-2,4.3265210615581043E-2,4.3265210615581043E-2,0,2.8591157756416169E-6,0.21196522768696294,192637.28659826983,4.9594491089749503E-6,2.3165390985765308E-7,2.8708101020910343E-4,2.0863333745526E-2,1.3058360849316117E-4,7.8059730081140504E-4,9.1118090930456625E-4,1.0649999850759555E-2,1.7013374523176781E-7,1.7013374523176781E-7,8.774720746336933E-3,2.3098717252858735E-7,2.3098717252858735E-7,1.122856738153505E-2,2.5216145088334578E-4,1.7337355793844284E-3,20,9.9425234626695893,4.3233775455086204E-4,4.8544596222763995E-4,1.1699451676618479E-3,1.7584025976309609E-2,3.0919796953553111E-4,7.2238982474351191E-4,0,1.7475277782336068E-4,4.8395074735889181E-4,3.491578628069549E-3,6.9301541938486654E-3,2.4561254041279403E-3,1.1040175512997345E-2,1.1951757543219671E-2,5.4466500000000008E-2,0.82005313018875237,3.7965682962890039E-3,4.6553158871162782E-3,8.8751213716669067E-2,6.5093209388929138E-3,0,2.6310954892131218E-3,1.9660800105782334E-3,1.1752751874037872E-2,6.0393170883674243E-6,5.2569560798813635E-2,0.17994686981124769,0.82005313018875237,82.005313018875242,{"$f":"CHOOSE(MODE, I21*1000, 'PFM Efficiency'!BI21)","v":16.5},87.300592726200748,0.87300592726200743,192.63728659826984,null,7.3089234825492169E-3,null,11.040175512997346,6.930154193848665,0.9111809093045663,null,null,{"$f":"IF(MODE=1, BJ21, 'PFM Efficiency'!BH21)","v":82.005313018875242},{"$f":"IF(MODE=1, BR21, 'PFM Efficiency'!BN21)","v":11.040175512997346},{"$f":"IF(MODE=1, BS21, 'PFM Efficiency'!BO21)","v":6.930154193848665},{"$f":"IF(MODE=1, BT21, 'PFM Efficiency'!BP21)","v":0.9111809093045663}]
["Tr",20,"ns",{"$f":"B22/1000000000","v":2E-8},"Switch rise time",null,null,16,1.7600000000000001E-2,4.3265210615581043E-2,4.3265210615581043E-2,0,2.8591157756416169E-6,0.22609624286609378,205479.77237148781,4.8666590801555662E-6,0,2.9999999999999997E-4,2.1547558438077173E-2,1.3928918239270523E-4,8.326371208654986E-4,9.7192630325820383E-4,1.0999272549094195E-2,1.8147599491388567E-7,1.8147599491388567E-7,9.3713563178157815E-3,2.634669577063973E-7,2.634669577063973E-7,1.1596814525454153E-2,2.6897221427556883E-4,1.8493179513433904E-3,20,9.9425234626695893,4.7464398874310905E-4,5.1780902637614925E-4,1.2614252293948272E-3,1.8160703937473526E-2,3.2981116750456643E-4,7.7054914639307934E-4,0,1.9187939577398566E-4,5.2169056327855206E-4,3.6466065055603077E-3,7.3144204423913652E-3,2.6198670977364696E-3,1.1717403332801215E-2,1.2689774579012039E-2,5.8097600000000006E-2,0.82073392812657775,3.7997201602009575E-3,4.6591806726273624E-3,8.8824893873543656E-2,6.7052068474911007E-3,0,2.7106443333311096E-3,1.9677122258183522E-3,1.1762508862878064E-2,6.2856258657204868E-6,5.1514928011491767E-2,0.17926607187342228,0.82073392812657775,82.073392812657772,{"$f":"CHOOSE(MODE, I22*1000, 'PFM Efficiency'!BI22)","v":17.600000000000001},87.316144106391718,0.87316144106391713,205.4797723714878,null,7.3149912601741824E-3,null,11.717403332801215,7.3144204423913655,0.97192630325820384,null,null,{"$f":"IF(MODE=1, BJ22, 'PFM Efficiency'!BH22)","v":82.073392812657772},{"$f":"IF(MODE=1, BR22, 'PFM Efficiency'!BN22)","v":11.717403332801215},{"$f":"IF(MODE=1, BS22, 'PFM Efficiency'!BO22)","v":7.3144204423913655},{"$f":"IF(MODE=1, BT22, 'PFM Efficiency'!BP22)","v":0.97192630325820384}]
["Tf",20,"ns",{"$f":"B23/1000000000","v":2E-8},"Switch fall time",null,null,17,1.8700000000000001E-2,4.3265210615581043E-2,4.3265210615581043E-2,0,2.8591157756416169E-6,0.24022725804522466,218322.25814470582,4.5803850166170034E-6,0,2.9999999999999997E-4,2.2210714853590323E-2,1.4799475629224935E-4,8.8467694091959239E-4,1.0326716972118418E-3,1.1337790631218045E-2,1.9281824459600352E-7,1.9281824459600352E-7,9.9773560865863472E-3,2.9864290343562489E-7,2.9864290343562489E-7,1.1953722802286154E-2,2.8578297766779188E-4,1.9649003233023522E-3,20,9.9425234626695893,5.1863568758813003E-4,5.5017209052465865E-4,1.3545907557805806E-3,1.8719625142443474E-2,3.5042436547360185E-4,8.1870846804264676E-4,0,2.0969215283950492E-4,5.6011651831310678E-4,3.6466065055603077E-3,7.5436588134433066E-3,2.783608791344999E-3,1.2241974878881994E-2,1.3275138037241868E-2,6.1728700000000004E-2,0.82300721690201617,3.8102447174222106E-3,4.6720857844581853E-3,8.907092322276669E-2,6.9147886449572142E-3,0,2.7957523018406856E-3,1.9731624429507873E-3,1.1795088945719302E-2,6.5524799915919213E-6,4.8618932057178835E-2,0.17699278309798397,0.82300721690201617,82.300721690201613,{"$f":"CHOOSE(MODE, I23*1000, 'PFM Efficiency'!BI23)","v":18.700000000000003},87.329706350284411,0.87329706350284408,218.32225814470581,null,7.3352525006984328E-3,null,12.241974878881994,7.5436588134433062,1.0326716972118419,null,null,{"$f":"IF(MODE=1, BJ23, 'PFM Efficiency'!BH23)","v":82.300721690201613},{"$f":"IF(MODE=1, BR23, 'PFM Efficiency'!BN23)","v":12.241974878881994},{"$f":"IF(MODE=1, BS23, 'PFM Efficiency'!BO23)","v":7.5436588134433062},{"$f":"IF(MODE=1, BT23, 'PFM Efficiency'!BP23)","v":1.0326716972118419}]
[null,null,null,null,null,null,null,18,1.9799999999999998E-2,4.3265210615581043E-2,4.3265210615581043E-2,0,2.8591157756416169E-6,0.2543582732243555,231164.74391792377,4.3259191823605039E-6,0,2.9999999999999997E-4,2.2854637034366673E-2,1.5670033019179338E-4,9.3671676097368596E-4,1.0934170911654794E-3,1.1666490311375321E-2,2.0416049427812135E-7,2.0416049427812135E-7,1.0591438982891936E-2,3.3653573918496894E-7,3.3653573918496894E-7,1.2300279286666929E-2,3.0259374106001498E-4,2.0804826952613141E-3,20,9.9425234626695893,5.6431285108592447E-4,5.8253515467316785E-4,1.4494417468191073E-3,1.9262335357963147E-2,3.7103756344263722E-4,8.6686778969221419E-4,0,2.2819132872925853E-4,5.9922889217189576E-4,3.6466065055603077E-3,7.772897184495248E-3,2.9473504849535283E-3,1.276891830843978E-2,1.3862876095838722E-2,6.5359799999999996E-2,0.82501378672101067,3.8195344561947858E-3,4.6834767736674129E-3,8.9288086599488406E-2,7.1231228089701677E-3,0,2.880378951768894E-3,1.9779732005294416E-3,1.1823846493654212E-2,6.8250185440465201E-6,4.6029832432684645E-2,0.17498621327898931,0.82501378672101067,82.501378672101069,{"$f":"CHOOSE(MODE, I24*1000, 'PFM Efficiency'!BI24)","v":19.799999999999997},87.341610005832351,0.87341610005832349,231.16474391792377,null,7.3531365434872801E-3,null,12.76891830843978,7.7728971844952479,1.0934170911654795,null,null,{"$f":"IF(MODE=1, BJ24, 'PFM Efficiency'!BH24)","v":82.501378672101069},{"$f":"IF(MODE=1, BR24, 'PFM Efficiency'!BN24)","v":12.76891830843978},{"$f":"IF(MODE=1, BS24, 'PFM Efficiency'!BO24)","v":7.7728971844952479},{"$f":"IF(MODE=1, BT24, 'PFM Efficiency'!BP24)","v":1.0934170911654795}]
["Components","Input Value","Units","Std Units","Description",null,null,19,2.0900000000000002E-2,4.3265210615581043E-2,4.3265210615581043E-2,0,2.8591157756416169E-6,0.26848928840348635,244007.22969114178,4.0982392253941612E-6,0,2.9999999999999997E-4,2.3480907427903881E-2,1.6540590409133747E-4,9.8875658102777963E-4,1.154162485119117E-3,1.1986179373490653E-2,2.1550274396023918E-7,2.1550274396023918E-7,1.1212326517640122E-2,3.7714879781452757E-7,3.7714879781452757E-7,1.263733564585981E-2,3.1940450445223792E-4,2.1960650672202759E-3,20,9.9425234626695893,6.1167547923649283E-4,6.1489821882167726E-4,1.5459782025104081E-3,1.9790168301752079E-2,3.9165076141167276E-4,9.1502711134178161E-4,0,2.4737720315258673E-4,6.3902796456425954E-4,3.6466065055603077E-3,8.0021355555471886E-3,3.1110921785620577E-3,1.3298233901183915E-2,1.4452989037844807E-2,6.8990900000000008E-2,0.82679391859013363,3.8277758639386574E-3,4.6935823093533545E-3,8.9480743462982126E-2,7.3303807659189507E-3,0,2.9645934052809097E-3,1.9822410723968047E-3,1.1849358801809234E-2,7.1023959766062424E-6,4.3701300929375908E-2,0.17320608140986637,0.82679391859013363,82.679391859013364,{"$f":"CHOOSE(MODE, I25*1000, 'PFM Efficiency'!BI25)","v":20.900000000000002},87.352116204047192,0.87352116204047192,244.00722969114179,null,7.3690024028338214E-3,null,13.298233901183915,8.0021355555471878,1.154162485119117,null,null,{"$f":"IF(MODE=1, BJ25, 'PFM Efficiency'!BH25)","v":82.679391859013364},{"$f":"IF(MODE=1, BR25, 'PFM Efficiency'!BN25)","v":13.298233901183915},{"$f":"IF(MODE=1, BS25, 'PFM Efficiency'!BO25)","v":8.0021355555471878},{"$f":"IF(MODE=1, BT25, 'PFM Efficiency'!BP25)","v":1.154162485119117}]
["L",{"$f":"'Design Regulator'!E18","v":220},"µH",{"$f":"B26/1000000","v":2.2000000000000001E-4},"Filter inductance",null,null,20,2.2000000000000002E-2,4.3255103636363645E-2,4.3505297936864883E-2,4.9614111630762181E-4,2.8580378423834699E-6,0.27797628986475204,252629.16376681489,3.9583711757168036E-6,0,2.9999999999999997E-4,2.5153617857449188E-2,1.8981134739557597E-4,1.0236940460746152E-3,1.213505393470191E-3,1.2194445100888629E-2,2.2305673697788003E-7,2.2305673697788003E-7,1.1767657850976601E-2,4.1543331389295368E-7,4.1543331389295368E-7,1.326185684877898E-2,3.517536941550119E-4,2.2736624739013341E-3,20,9.7399438505589018,6.6326073661921153E-4,6.3662549269237348E-4,1.6516399234665969E-3,2.0768173481018812E-2,4.3131702973769307E-4,9.4735936412555593E-4,5.32704878536761E-5,2.6818623967255867E-4,7.5277375726392776E-4,3.6466065055603077E-3,8.1560370787979539E-3,3.2210218380268902E-3,1.3781472597555369E-2,1.4995616481076432E-2,7.2622000000000006E-2,0.82885158164151651,4.0146457788084577E-3,4.922720419253227E-3,8.8229430584135446E-2,7.5699472692510629E-3,6.07988324644524E-4,3.0608712088222721E-3,2.1663605450459979E-3,1.1683655492907771E-2,7.2872337380774811E-6,4.1619558394947867E-2,0.17114841835848355,0.82885158164151651,82.885158164151647,{"$f":"CHOOSE(MODE, I26*1000, 'PFM Efficiency'!BI26)","v":22.000000000000004},87.361433972791943,0.87361433972791946,252.62916376681488,null,7.2659531069288012E-3,null,13.78147259755537,8.1560370787979544,1.2135053934701909,null,null,{"$f":"IF(MODE=1, BJ26, 'PFM Efficiency'!BH26)","v":82.885158164151647},{"$f":"IF(MODE=1, BR26, 'PFM Efficiency'!BN26)","v":13.78147259755537},{"$f":"IF(MODE=1, BS26, 'PFM Efficiency'!BO26)","v":8.1560370787979544},{"$f":"IF(MODE=1, BT26, 'PFM Efficiency'!BP26)","v":1.2135053934701909}]
["Rdcr",{"$f":"'Design Regulator'!E19","v":300},"mW",{"$f":"B27/1000","v":0.3},"Inductor DCR at 25°C",null,null,21,2.3099999999999999E-2,4.3242449803030304E-2,4.4605370718454891E-2,1.6024684515952396E-3,2.8559751658395954E-6,0.27812121667543355,252760.87550024252,3.9563084991729287E-6,0,2.9999999999999997E-4,2.6121150267907164E-2,2.0469434739557596E-4,1.0242277632246768E-3,1.2289221106202527E-3,1.2194445100888629E-2,2.2305673697788003E-7,2.2305673697788003E-7,1.2185673964497682E-2,4.4547194990710998E-7,4.4547194990710998E-7,1.3775563018650266E-2,3.7953227296160967E-4,2.2748478795021829E-3,20,9.4976643523362103,6.969709724089074E-4,6.3695740626061115E-4,1.7134606516311282E-3,2.1572641435680745E-2,4.6537885851244979E-4,9.4785328312590946E-4,1.2002713229659258E-4,2.8174707333282007E-4,8.6715306414186246E-4,3.6466065055603077E-3,8.1583881332396371E-3,3.2227011626280921E-3,1.3961703011640719E-2,1.5191293650947856E-2,7.6253100000000004E-2,0.8338739747246342,4.150415982966886E-3,5.089200550542728E-3,8.458126826047635E-2,7.6218010157004627E-3,1.3125696120283525E-3,3.0810754173544639E-3,2.2384570472074447E-3,1.1200552842356347E-2,7.3107673438880126E-6,3.9877857569702517E-2,0.16612602527536571,0.8338739747246342,83.387397472463419,{"$f":"CHOOSE(MODE, I27*1000, 'PFM Efficiency'!BI27)","v":23.099999999999998},87.369732614756487,0.8736973261475649,252.76087550024252,null,6.9655162096862872E-3,null,13.961703011640719,8.1583881332396366,1.2289221106202526,null,null,{"$f":"IF(MODE=1, BJ27, 'PFM Efficiency'!BH27)","v":83.387397472463419},{"$f":"IF(MODE=1, BR27, 'PFM Efficiency'!BN27)","v":13.961703011640719},{"$f":"IF(MODE=1, BS27, 'PFM Efficiency'!BO27)","v":8.1583881332396366},{"$f":"IF(MODE=1, BT27, 'PFM Efficiency'!BP27)","v":1.2289221106202526}]
["Kcore",4.9999999999999999E-13,null,{"$f":"B28","v":4.9999999999999999E-13},"Core loss constant - consult inductor vendor",null,null,22,2.4199999999999999E-2,4.322979596969697E-2,4.57054435000449E-2,2.7087957868828748E-3,2.8539142595359983E-6,0.27826617010972127,252892.6114296164,3.954247592869332E-6,0,2.9999999999999997E-4,2.7098791325787699E-2,2.2030334739557599E-4,1.024761578420608E-3,1.2450649258161839E-3,1.2194445100888629E-2,2.2305673697788003E-7,2.2305673697788003E-7,1.2609358297945798E-2,4.7698775005792369E-7,4.7698775005792369E-7,1.4294867230596952E-2,4.0868645828078914E-4,2.2760335028665477E-3,20,9.267145631889786,7.3071605000877421E-4,6.3728938080263333E-4,1.7766918890921965E-3,2.2385875968831775E-2,5.0112744289191994E-4,9.4834729286106146E-4,1.868533384122815E-4,2.9532559441892395E-4,9.8330637572312534E-4,3.6466065055603077E-3,8.1607396195789595E-3,3.224380795727609E-3,1.4145118680121891E-2,1.5390883650425111E-2,7.9884200000000002E-2,0.83845846090362963,4.2895418468516409E-3,5.2597953598299881E-3,8.1222850857205556E-2,7.6695398420205301E-3,1.9611983663836729E-3,3.0997148793120606E-3,2.3122871054502927E-3,1.075581924630549E-2,7.3476134600347858E-6,3.8274503320722478E-2,0.16154153909637042,0.83845846090362963,83.845846090362969,{"$f":"CHOOSE(MODE, I28*1000, 'PFM Efficiency'!BI28)","v":24.2},87.377150716774679,0.87377150716774676,252.89261142961641,null,6.6889406588286921E-3,null,14.145118680121891,8.1607396195789601,1.2450649258161839,null,null,{"$f":"IF(MODE=1, BJ28, 'PFM Efficiency'!BH28)","v":83.845846090362969},{"$f":"IF(MODE=1, BR28, 'PFM Efficiency'!BN28)","v":14.145118680121891},{"$f":"IF(MODE=1, BS28, 'PFM Efficiency'!BO28)","v":8.1607396195789601},{"$f":"IF(MODE=1, BT28, 'PFM Efficiency'!BP28)","v":1.2450649258161839}]
["Cin",{"$f":"'Design Regulator'!E30","v":4.7},"µF",{"$f":"B29/1000000","v":4.6999999999999999E-6},"Input capacitance",null,null,23,2.53E-2,4.3217142136363643E-2,4.6805516281634915E-2,3.8151231221704961E-3,2.8518551211947607E-6,0.27841115017495216,253024.37156160449,3.9521884545280944E-6,0,2.9999999999999997E-4,2.8085485420739777E-2,2.3663834739557594E-4,1.0252954916894288E-3,1.2619338390850048E-3,1.2194445100888629E-2,2.2305673697788003E-7,2.2305673697788003E-7,1.3038176006013719E-2,5.0998210069137557E-7,5.0998210069137557E-7,1.4819216631781654E-2,4.3921836315934798E-4,2.2772193440544404E-3,20,9.0475516401575913,7.644959790205529E-4,6.376214163352433E-4,1.8413357585151443E-3,2.3207011308524036E-2,5.3856537387396246E-4,9.4884139335601689E-4,2.5374912537061916E-4,3.0892181253272663E-4,1.1012363117773082E-3,3.6466065055603077E-3,8.1630915379349474E-3,3.2260607374104571E-3,1.4331724345637857E-2,1.5594391223560532E-2,8.3515300000000001E-2,0.84265523349896787,4.4316389016751997E-3,5.4340334151493528E-3,7.8120975599856632E-2,7.713634959230057E-3,2.5602857020131393E-3,3.1169687718620317E-3,2.3876408499931018E-3,1.0345057875083902E-2,7.39623773033203E-6,3.6793642080214954E-2,0.15734476650103221,0.84265523349896787,84.265523349896782,{"$f":"CHOOSE(MODE, I29*1000, 'PFM Efficiency'!BI29)","v":25.3},87.383802813648998,0.87383802813649003,253.02437156160448,null,6.4334921082234873E-3,null,14.331724345637857,8.1630915379349478,1.2619338390850048,null,null,{"$f":"IF(MODE=1, BJ29, 'PFM Efficiency'!BH29)","v":84.265523349896782},{"$f":"IF(MODE=1, BR29, 'PFM Efficiency'!BN29)","v":14.331724345637857},{"$f":"IF(MODE=1, BS29, 'PFM Efficiency'!BO29)","v":8.1630915379349478},{"$f":"IF(MODE=1, BT29, 'PFM Efficiency'!BP29)","v":1.2619338390850048}]
["RCinESR",{"$f":"'Design Regulator'!E31","v":3},"mW",{"$f":"B30/1000","v":3.0000000000000001E-3},"Input capacitor ESR",null,null,24,2.64E-2,4.3204488303030308E-2,4.7905589063224924E-2,4.9214504574581208E-3,2.8497977485418691E-6,0.27855615687846597,253156.15590287725,3.9501310818752028E-6,0,2.9999999999999997E-4,2.9080311059522499E-2,2.5369934739557598E-4,1.0258295030581689E-3,1.279528850453745E-3,1.2194445100888629E-2,2.2305673697788003E-7,2.2305673697788003E-7,1.3471654028914341E-2,5.4445638682429192E-7,5.4445638682429192E-7,1.5348128573552163E-2,4.7113010142057674E-4,2.2784054031258954E-3,20,8.8381237377496564,7.9831076904951395E-4,6.3795351287525065E-4,1.9073943833453413E-3,2.4035291623122949E-2,5.7769524340856417E-4,9.4933558463578959E-4,3.2071451234852655E-4,3.2253573727961316E-4,1.2209454930367039E-3,3.6466065055603077E-3,8.165443888426667E-3,3.2277409877616847E-3,1.4521524752570396E-2,1.5801821116147943E-2,8.7146399999999999E-2,0.84650709895880516,4.576379235237486E-3,5.6115126336840583E-3,7.5247326147464197E-2,7.7544882310190289E-3,3.115299214220428E-3,3.1329899029117056E-3,2.4643393022726252E-3,9.9645189779511631E-3,7.4553315781556876E-6,3.542175344094721E-2,0.15349290104119484,0.84650709895880516,84.65070989588051,{"$f":"CHOOSE(MODE, I30*1000, 'PFM Efficiency'!BI30)","v":26.4},87.389784389255496,0.87389784389255498,253.15615590287726,null,6.1968386239088149E-3,null,14.521524752570397,8.1654438884266671,1.279528850453745,null,null,{"$f":"IF(MODE=1, BJ30, 'PFM Efficiency'!BH30)","v":84.65070989588051},{"$f":"IF(MODE=1, BR30, 'PFM Efficiency'!BN30)","v":14.521524752570397},{"$f":"IF(MODE=1, BS30, 'PFM Efficiency'!BO30)","v":8.1654438884266671},{"$f":"IF(MODE=1, BT30, 'PFM Efficiency'!BP30)","v":1.279528850453745}]
["Cout",{"$f":"'Design Regulator'!E25","v":100},"µF",{"$f":"B31/1000000","v":1E-4},"Output capacitance",null,null,25,2.75E-2,4.3191834469696974E-2,4.9005661844814946E-2,6.0277777927457456E-3,2.8477421393072099E-6,0.27870119022760498,253287.96446010747,3.9480754726405436E-6,0,2.9999999999999997E-4,3.0082461523595217E-2,2.7148634739557599E-4,1.0263636125538676E-3,1.2978499599494435E-3,1.2194445100888629E-2,2.2305673697788003E-7,2.2305673697788003E-7,1.3909373244241812E-2,5.8041199214288998E-7,5.8041199214288998E-7,1.5881180492403797E-2,5.0442378766461381E-4,2.2795916801409671E-3,20,8.6381719384497195,8.3216042970445689E-4,6.382856704394708E-4,1.9748698878085417E-3,2.4870055174813673E-2,6.1851964439827638E-4,9.4982986672540294E-4,3.8774951852997216E-4,3.3616737826849851E-4,1.3424365411967469E-3,3.6466065055603077E-3,8.1677966711732261E-3,3.22942154686637E-3,1.4714524647044884E-2,1.6013178075723448E-2,9.0777500000000011E-2,0.85005078753813346,4.7234814569389241E-3,5.791887976960822E-3,7.2577605575118276E-2,7.7924444782941265E-3,3.6309303912746538E-3,3.1479093899013165E-3,2.5422288938278829E-3,9.6109850695590728E-3,7.5237721456459337E-6,3.4147236175189007E-2,0.14994921246186652,0.85005078753813346,85.005078753813351,{"$f":"CHOOSE(MODE, I31*1000, 'PFM Efficiency'!BI31)","v":27.5},87.395175679622284,0.87395175679622283,253.28796446010747,null,5.9769792826567993E-3,null,14.714524647044884,8.1677966711732264,1.2978499599494435,null,null,{"$f":"IF(MODE=1, BJ31, 'PFM Efficiency'!BH31)","v":85.005078753813351},{"$f":"IF(MODE=1, BR31, 'PFM Efficiency'!BN31)","v":14.714524647044884},{"$f":"IF(MODE=1, BS31, 'PFM Efficiency'!BO31)","v":8.1677966711732264},{"$f":"IF(MODE=1, BT31, 'PFM Efficiency'!BP31)","v":1.2978499599494435}]
["RCoutESR",{"$f":"'Design Regulator'!E27","v":1.5},"mW",{"$f":"B32/1000","v":1.5E-3},"Output capacitor ESR",null,null,26,2.86E-2,4.317918063636364E-2,5.0105734626404955E-2,7.1341051280333738E-3,2.8456882912245596E-6,0.27884625022971421,253419.79723997044,3.9460216245578928E-6,0,2.9999999999999997E-4,3.1091228527007207E-2,2.89999347395576E-4,1.0268978202035743E-3,1.3168971675991503E-3,1.2194445100888629E-2,2.2305673697788003E-7,2.2305673697788003E-7,1.4350961628654216E-2,6.1785029900131699E-7,6.1785029900131699E-7,1.6418001359312956E-2,5.3910153726880415E-4,2.2807781751597342E-3,20,8.4470673150512017,8.6604497059771337E-4,6.3861788904472549E-4,2.043764396911243E-3,2.5710720929189294E-2,6.6104117069865239E-4,9.5032423964988913E-4,4.5485416310597575E-4,3.4981674511182925E-4,1.4657120789164572E-3,3.6466065055603077E-3,8.1701498862937795E-3,3.2311024148096233E-3,1.4910728776931104E-2,1.6228466851566235E-2,9.4408600000000009E-2,0.85331799447161061,4.8727027262217438E-3,5.9748616762004686E-3,7.0090847635602485E-2,7.8278012536216572E-3,4.1112276025558484E-3,3.1618403765272729E-3,2.6211771122299108E-3,9.2816797247642947E-3,7.6005904703473496E-6,3.2960079377851698E-2,0.14668200552838948,0.85331799447161061,85.33179944716106,{"$f":"CHOOSE(MODE, I32*1000, 'PFM Efficiency'!BI32)","v":28.6},87.400044599948558,0.87400044599948556,253.41979723997045,null,5.7721874523437335E-3,null,14.910728776931105,8.17014988629378,1.3168971675991503,null,null,{"$f":"IF(MODE=1, BJ32, 'PFM Efficiency'!BH32)","v":85.33179944716106},{"$f":"IF(MODE=1, BR32, 'PFM Efficiency'!BN32)","v":14.910728776931105},{"$f":"IF(MODE=1, BS32, 'PFM Efficiency'!BO32)","v":8.17014988629378},{"$f":"IF(MODE=1, BT32, 'PFM Efficiency'!BP32)","v":1.3168971675991503}]
["Controller",null,"Units","Std Units","Description",null,null,27,2.9700000000000001E-2,4.3166526803030306E-2,5.120580740799497E-2,8.2404324633209985E-3,2.8436362020315749E-6,0.27899133689214139,253551.6542491439,3.9439695353649085E-6,0,2.9999999999999997E-4,3.2105988402766655E-2,3.092383473955761E-4,1.0274321260343477E-3,1.3366704734299238E-3,1.2194445100888629E-2,2.2305673697788003E-7,2.2305673697788003E-7,1.4796088316626104E-2,6.5677268842019857E-7,6.5677268842019857E-7,1.6958264451117259E-2,5.7516546638805468E-4,2.2819648882422949E-3,20,8.2642353914211082,8.9996440134514793E-4,6.3895016870784262E-4,2.114080036441045E-3,2.6556777235174564E-2,7.0526241711868596E-4,9.5081870343428963E-4,5.2202846527461084E-4,3.6348384742558516E-4,1.5907747298188819E-3,3.6466065055603077E-3,8.1725035339075269E-3,3.2327835916765844E-3,1.5110141891844038E-2,1.6447692194699361E-2,9.8039700000000007E-2,0.85633621415074157,5.0238323658374339E-3,6.1601754009673283E-3,6.7768864949157445E-2,7.860816672412731E-3,4.5597026473171796E-3,3.1748810105433956E-3,2.701069012644464E-3,8.9741945059511677E-3,7.6849459886537081E-6,3.1851598989684572E-2,0.14366378584925851,0.85633621415074157,85.63362141507416,{"$f":"CHOOSE(MODE, I33*1000, 'PFM Efficiency'!BI33)","v":29.7},87.404449022298479,0.8740444902229848,253.55165424914389,null,5.5809653487541421E-3,null,15.110141891844039,8.1725035339075269,1.3366704734299237,null,null,{"$f":"IF(MODE=1, BJ33, 'PFM Efficiency'!BH33)","v":85.63362141507416},{"$f":"IF(MODE=1, BR33, 'PFM Efficiency'!BN33)","v":15.110141891844039},{"$f":"IF(MODE=1, BS33, 'PFM Efficiency'!BO33)","v":8.1725035339075269},{"$f":"IF(MODE=1, BT33, 'PFM Efficiency'!BP33)","v":1.3366704734299237}]
["Deadtime1",30,"ns",{"$f":"B34/1000000000","v":2.9999999999999997E-8},"PMOS off to NMOS on deadtime",null,null,28,3.0800000000000004E-2,4.3153872969696971E-2,5.2305880189584986E-2,9.3467597986086268E-3,2.841585869469786E-6,0.2791364502222371,253683.53549430813,3.9419192028031197E-6,0,2.9999999999999997E-4,3.3126190413607585E-2,3.2920334739557609E-4,1.027966530073258E-3,1.3571698774688342E-3,1.2194445100888629E-2,2.2305673697788003E-7,2.2305673697788003E-7,1.5244458447636798E-2,6.9718054008517488E-7,6.9718054008517488E-7,1.7501681232887225E-2,6.1261769195519375E-4,2.2831518194487729E-3,20,8.0891503745332063,9.3391873156616089E-4,6.3928250944565647E-4,2.1858189329670109E-3,2.7407772244771176E-2,7.5118597942124921E-4,9.5131325810365549E-4,5.8927244424100906E-4,3.771686948292815E-4,1.7176271184915397E-3,3.6466065055603077E-3,8.1748576141337081E-3,3.2344650775524286E-3,1.5312768743144687E-2,1.6670858857890585E-2,0.10167080000000002,0.85912941377719221,5.1766867041372943E-3,6.3476039348350135E-3,6.5595803380174081E-2,7.8917157371238798E-3,4.9794167998661485E-3,3.1871168485326094E-3,2.7818044006878138E-3,8.6864299520060077E-3,7.7761059456510793E-6,3.0814225022308489E-2,0.14087058622280779,0.85912941377719221,85.912941377719221,{"$f":"CHOOSE(MODE, I34*1000, 'PFM Efficiency'!BI34)","v":30.800000000000004},87.408438566030782,0.87408438566030777,253.68353549430813,null,5.4020073371908069E-3,null,15.312768743144687,8.1748576141337086,1.3571698774688343,null,null,{"$f":"IF(MODE=1, BJ34, 'PFM Efficiency'!BH34)","v":85.912941377719221},{"$f":"IF(MODE=1, BR34, 'PFM Efficiency'!BN34)","v":15.312768743144687},{"$f":"IF(MODE=1, BS34, 'PFM Efficiency'!BO34)","v":8.1748576141337086},{"$f":"IF(MODE=1, BT34, 'PFM Efficiency'!BP34)","v":1.3571698774688343}]
["Deadtime2",30,"ns",{"$f":"B35/1000000000","v":2.9999999999999997E-8},"NMOS off to PMOS on deadtime",null,null,29,3.1899999999999998E-2,4.3141219136363637E-2,5.3405952971174994E-2,1.0453087133896252E-2,2.839537291284589E-6,0.27928159022735438,253815.44098214572,3.9398706246179227E-6,0,2.9999999999999997E-4,3.4151346844869625E-2,3.4989434739557591E-4,1.0285010323473839E-3,1.3783953797429599E-3,1.2194445100888629E-2,2.2305673697788003E-7,2.2305673697788003E-7,1.5695808701109155E-2,7.3907523234544162E-7,7.3907523234544162E-7,1.8047996172447036E-2,6.5146033168132572E-4,2.2843389688393112E-3,20,7.921330104486402,9.6790797088368774E-4,6.3961491127500721E-4,2.2589832138400203E-3,2.8263305792556009E-2,7.9881445432353009E-4,9.5180790368304651E-4,6.5658611921736115E-4,3.9087129694596949E-4,1.8462718704868608E-3,3.6466065055603077E-3,8.1772121270916077E-3,3.2361468725223578E-3,1.5518614083940847E-2,1.6897971595653129E-2,0.1053019,0.86171858141089719,5.3311048790373634E-3,6.5369500302481934E-3,6.3557779502036213E-2,7.9206954822865633E-3,5.3730508112965741E-3,3.1986228122998575E-3,2.8632955405496702E-3,8.4165475701201108E-3,7.8734286440735225E-6,2.9841328455945972E-2,0.13828141858910284,0.86171858141089719,86.171858141089714,{"$f":"CHOOSE(MODE, I35*1000, 'PFM Efficiency'!BI35)","v":31.9},87.412056018390444,0.87412056018390449,253.81544098214573,null,5.2341700766382762E-3,null,15.518614083940847,8.1772121270916074,1.3783953797429598,null,null,{"$f":"IF(MODE=1, BJ35, 'PFM Efficiency'!BH35)","v":86.171858141089714},{"$f":"IF(MODE=1, BR35, 'PFM Efficiency'!BN35)","v":15.518614083940847},{"$f":"IF(MODE=1, BS35, 'PFM Efficiency'!BO35)","v":8.1772121270916074},{"$f":"IF(MODE=1, BT35, 'PFM Efficiency'!BP35)","v":1.3783953797429598}]
["Sleep delay",1,"µs",{"$f":"B36/1000000","v":9.9999999999999995E-7},"Delay time to enter sleep mode",null,null,30,3.3000000000000002E-2,4.3128565303030303E-2,5.4506025752765003E-2,1.155941446918388E-2,2.8374904652252358E-6,0.27942675691484919,253947.37071934188,3.937823798558569E-6,0,2.9999999999999997E-4,3.5181024591654328E-2,3.7131134739557594E-4,1.0290356328838152E-3,1.4003469802793911E-3,1.2194445100888629E-2,2.2305673697788003E-7,2.2305673697788003E-7,1.6149903428114672E-2,7.8245814221229019E-7,7.8245814221229019E-7,1.8596982336607618E-2,6.9169550405619152E-4,2.2855263364740769E-3,20,7.7603316203586417,1.0019321289242036E-3,6.399473742127415E-4,2.3335750071931368E-3,2.9123022499347024E-2,8.4815043949747302E-4,9.5230264019753195E-4,7.2396950942292418E-4,4.0459166340223889E-4,1.9767116123226361E-3,3.6466065055603077E-3,8.1795670729005593E-3,3.2378289766716089E-3,1.5727682669087941E-2,1.7129035164246523E-2,0.10893300000000002,0.86412217491230359,5.4869454007701818E-3,6.7280401938015332E-3,6.1642583620733077E-2,7.9479291891391707E-3,5.7429622525105393E-3,3.2094647914821888E-3,2.94546527756587E-3,8.1629305091186419E-3,7.9763497224210456E-6,2.8927079439968858E-2,0.13587782508769639,0.86412217491230359,86.412217491230365,{"$f":"CHOOSE(MODE, I36*1000, 'PFM Efficiency'!BI36)","v":33},87.415338471423681,0.87415338471423676,253.94737071934188,null,5.0764480628839002E-3,null,15.72768266908794,8.179567072900559,1.4003469802793911,null,null,{"$f":"IF(MODE=1, BJ36, 'PFM Efficiency'!BH36)","v":86.412217491230365},{"$f":"IF(MODE=1, BR36, 'PFM Efficiency'!BN36)","v":15.72768266908794},{"$f":"IF(MODE=1, BS36, 'PFM Efficiency'!BO36)","v":8.179567072900559},{"$f":"IF(MODE=1, BT36, 'PFM Efficiency'!BP36)","v":1.4003469802793911}]
["IQ(active)",300,"µA",{"$f":"B37/1000000","v":2.9999999999999997E-4},"LM5165 quiescent current - active state ",null,null,31,3.4099999999999998E-2,4.3115911469696983E-2,5.5606098534355011E-2,1.2665741804471501E-2,2.8354453890448282E-6,0.27957195029207998,254079.32471258403,3.9357787223781614E-6,0,2.9999999999999997E-4,3.6214837999342019E-2,3.9345434739557601E-4,1.02957033170965E-3,1.423024679105226E-3,1.2194445100888629E-2,2.2305673697788003E-7,2.2305673697788003E-7,1.6606531299036536E-2,8.2733064535764028E-7,8.2733064535764028E-7,1.9148437643167194E-2,7.3332532834852475E-4,2.2867139224132561E-3,20,7.6057472560250101,1.0359912153177218E-3,6.4027989827571173E-4,2.4095964419419582E-3,2.9986605902806253E-2,8.9919653357021481E-4,9.5279746767219006E-4,7.9142263408401984E-4,4.1832980382821894E-4,2.1089489714824538E-3,3.6466065055603077E-3,8.1819224516799325E-3,3.2395113900854462E-3,1.5939979255189789E-2,1.7364054321677352E-2,0.1125641,0.86635649207571086,5.6440833180232131E-3,6.9207212113856064E-3,5.9839434930754741E-2,7.9735698604076598E-3,6.0912327910439511E-3,3.2197009648310257E-3,3.0282454903612197E-3,7.9241511363320853E-3,8.0843708418651227E-6,2.8066330385422125E-2,0.13364350792428917,0.86635649207571086,86.635649207571092,{"$f":"CHOOSE(MODE, I37*1000, 'PFM Efficiency'!BI37)","v":34.1},87.418318239176173,0.87418318239176174,254.07932471258403,null,4.9279534648856843E-3,null,15.939979255189789,8.1819224516799327,1.4230246791052259,null,null,{"$f":"IF(MODE=1, BJ37, 'PFM Efficiency'!BH37)","v":86.635649207571092},{"$f":"IF(MODE=1, BR37, 'PFM Efficiency'!BN37)","v":15.939979255189789},{"$f":"IF(MODE=1, BS37, 'PFM Efficiency'!BO37)","v":8.1819224516799327},{"$f":"IF(MODE=1, BT37, 'PFM Efficiency'!BP37)","v":1.4230246791052259}]
["IQ(sleep)",10.5,"µA",{"$f":"B38/1000000","v":1.0499999999999999E-5},"LM5165 quiescent current - sleep state",null,null,32,{"$f":"IF(PLOT_TYPE=1, H38/100*Iout_maxload_COT, min_I*EXP(H38*rr/100))","v":3.5200000000000002E-2},{"$f":"IF(I38<Icrit, (Vin-(Rdcr+RdsonTop)*Iripple/2-Vout)/L*OnTime, (Vin-(Rdcr+RdsonTop)*I38-Vout)/L*OnTime)","v":4.3103257636363648E-2},{"$f":"IF(I38<Icrit, (Vin-(Rdcr+RdsonTop)*Iripple/2-Vout)/L*OnTime, I38+((Vin-(Rdcr+RdsonTop)*J38-Vout)/L*OnTime)/2)","v":5.6706171315945034E-2},{"$f":"IF(I38<Icrit, 0, I38-((Vin-(Rdcr+RdsonTop)*K38-Vout)/L*OnTime)/2)","v":1.3772069139759126E-2},{"$f":"IF(I38<Icrit, L*J38/(Vout+J38/2*(RdsonBot+Rdcr)), L*J38/(Vout+I38*(RdsonBot+Rdcr)))","v":2.8334020605003056E-6},0.27971717036640809,{"$f":"IF(I38<Icrit,I38/((OnTime+M38)*J38/2),1/(OnTime+M38))","v":254211.30296856232},3.9337353938336389E-6,0,2.9999999999999997E-4,3.7252442756396345E-2,4.1632334739557592E-4,1.0301051288519982E-3,1.4464284762475742E-3,1.2194445100888629E-2,2.2305673697788003E-7,2.2305673697788003E-7,1.7065502396282611E-2,8.7369411611258268E-7,8.7369411611258268E-7,1.970218166354187E-2,7.7635192460641096E-4,2.2879017267170608E-3,20,{"$f":"IF(I38<Icrit, Csw*Vin/Iripple*1000000000, Csw*Vin/(I38+Iripple/2)*1000000000)","v":7.4572011934857736},{"$f":"IF(I38<Icrit, Vin*(I38+Iripple/2)*AG38/1000000000/2*O38, Vin*(I38-Iripple/2)*AF38/1000000000/2*O38+Vin*(I38+Iripple/2)*AG38/1000000000/2*O38)","v":1.0700852396977982E-3},{"$f":"IF(I38<Icrit, Csw*(Vin)^2*O38/2, Csw*Vin^2*O38/2)","v":6.4061248348077705E-4},{"$f":"AD38+AH38+AI38","v":2.4870496477849861E-3},{"$f":"IF(I38<Icrit,Iripple*SQRT((OffTime)*O38/3), SQRT(OffTime*O38*(I38^2+Iripple^2/12)))","v":3.0853773450333875E-2},9.5195533612452751E-4,{"$f":"QgBot*O38*Vdd","v":9.5329238613210861E-4},{"$f":"IF(I38<Icrit, Vin*Idss*N38, QrrBot*(I38-Iripple/2)/0.1*O38*Vin+Vin*Idss*N38)","v":8.5894551243404231E-4},{"$f":"IF(I38<Icrit, dead1*O38*(I38+Iripple/2)*((I38+Iripple/2)*BDserR+VSD), dead1*O38*(I38+Iripple/2)*((I38+Iripple/2)*BDserR+VSD)+dead2*O38*(I38-Iripple/2)*((I38-Iripple/2)*BDserR+VSD))","v":4.3208572785758065E-4},2.2429865764161507E-3,{"$f":"Vin*R38+Vout*Ifb/0.7","v":3.6466065055603077E-3},{"$f":"(Vin-Vdd)*(O38*QgBot+O38*QgTop)+AQ38","v":8.184278263549144E-3},{"$f":"AE38+AM38","v":3.2411941128491694E-3},1.6155508600599451E-2,{"$f":"SUM(V38,Y38,AB38,AT38)","v":1.7603033827700117E-2},{"$f":"Vout*I38","v":0.11619520000000001},0.86843597763503688,{"$f":"AD38/($AV38+$AU38)","v":5.8024078674025334E-3},7.1148572659816764E-3,{"$f":"Vin*O38*(QgBot+QgTop)/($AV38+$AU38)","v":5.8138778430030034E-2},7.9977531024498436E-3,6.419707404659445E-3,3.229382896144974E-3,{"$f":"T38/($AV38+$AU38)","v":3.1115758069848671E-3},{"$f":"U38/($AV38+$AU38)","v":7.6989441443489105E-3},{"$f":"(Y38+AB38)/($AV38+$AU38)","v":8.1970503026431083E-6},2.7254518996538163E-2,0.13156402236496323,0.86843597763503688,86.843597763503695,{"$f":"CHOOSE(MODE, I38*1000, 'PFM Efficiency'!BI38)","v":35.200000000000003},87.421023603167043,0.87421023603167047,254.21130296856231,null,4.787899400120121E-3,null,16.15550860059945,8.1842782635491442,{"$f":"1000*V38","v":1.4464284762475741},null,null,{"$f":"IF(MODE=1, BJ38, 'PFM Efficiency'!BH38)","v":86.843597763503695},{"$f":"IF(MODE=1, BR38, 'PFM Efficiency'!BN38)","v":16.15550860059945},{"$f":"IF(MODE=1, BS38, 'PFM Efficiency'!BO38)","v":8.1842782635491442},{"$f":"IF(MODE=1, BT38, 'PFM Efficiency'!BP38)","v":1.4464284762475741}]
["High-side P-ch MOSFET",null,"Units","Std Units","Description",null,null,33,3.6299999999999999E-2,4.3090603803030307E-2,5.7806244097535042E-2,1.4878396475046751E-2,2.8313604773524405E-6,0.27986241714519755,254343.30549396927,{"$f":"IF(1/O39-OnTime-M39>Tsleep, OnTime+M39+Tsleep, 1/O39)","v":3.9316938106857742E-6},{"$f":"IF(1/O39-OnTime-M39>Tsleep, 1/O39-OnTime-M39-Tsleep, 0)","v":0},{"$f":"P39*O39*Iq_active+Q39*O39*Iq_sleep","v":2.9999999999999997E-4},{"$f":"IF(I39<Icrit,Iripple*SQRT((OnTime+OffTime)*O39/3), SQRT(I39^2+Iripple^2/12))","v":3.8293530671884859E-2},{"$f":"S39^2*Rdcr","v":4.3991834739557593E-4},{"$f":"(O39/Fsw)*Fsw^2.5*(Iripple/2)^2.5*k_core","v":1.0306400243379787E-3},1.4705583717335546E-3,{"$f":"Iripple/SQRT(12)*SQRT((OnTime+M39)*O39)","v":1.2194445100888629E-2},2.2305673697788003E-7,2.2305673697788003E-7,{"$f":"SQRT($N39)*SQRT($I39^2*(1-N39)+(Iripple^2)/12)","v":1.7526645690356776E-2},9.2154992746590522E-7,9.2154992746590522E-7,{"$f":"IF(I39<Icrit,Iripple*SQRT((OnTime)*O39/3), SQRT(OnTime*O39*(I39^2+Iripple^2/12)))","v":2.0258052888390384E-2},{"$f":"RdsonTop*AC39^2","v":8.2077741365764402E-4},{"$f":"QgTop*O39*Vdd","v":2.2890897494457236E-3},20,7.3143464123539834,1.1042142117015312E-3,6.4094512984480252E-4,2.5659367552039775E-3,3.1724272217014751E-2,{"$f":"RdsonBot*AK39^2","v":1.0064294476992541E-3},9.5378739560238472E-4,9.2653816371345726E-4,4.4585944512753791E-4,2.3788270565402491E-3,3.6466065055603077E-3,8.186634508627659E-3,3.2428771450481084E-3,1.6374275465419995E-2,1.7845978443817995E-2,0.1198263,0.87037347935589904,5.9618205127083086E-3,7.3103275334399503E-3,5.6532115514392009E-2,8.0205995294262856E-3,6.7300270917762407E-3,3.2385564484536844E-3,3.1954025339611131E-3,7.4861841177312075E-3,8.3139952166251255E-6,2.6487587383457401E-2,0.12962652064410102,0.87037347935589904,87.037347935589906,{"$f":"CHOOSE(MODE, I39*1000, 'PFM Efficiency'!BI39)","v":36.299999999999997},87.423479422514077,0.87423479422514072,254.34330549396927,null,4.6555859835381653E-3,null,16.374275465419995,8.1866345086276588,1.4705583717335546,null,null,{"$f":"IF(MODE=1, BJ39, 'PFM Efficiency'!BH39)","v":87.037347935589906},{"$f":"IF(MODE=1, BR39, 'PFM Efficiency'!BN39)","v":16.374275465419995},{"$f":"IF(MODE=1, BS39, 'PFM Efficiency'!BO39)","v":8.1866345086276588},{"$f":"IF(MODE=1, BT39, 'PFM Efficiency'!BP39)","v":1.4705583717335546}]
["RdsonTop",2000,"mW",{"$f":"B40/1000","v":2},"Drain-source resistance of high-side MOSFET @ VDD, 25°C",null,null,34,3.7400000000000003E-2,4.3077949969696973E-2,5.8906316879125058E-2,1.5984723810334379E-2,2.8293206373658305E-6,0.28000769063581499,254475.3322954998,3.9296539706991642E-6,0,2.9999999999999997E-4,3.9337825198129429E-2,4.6423934739557598E-4,1.0311750181947205E-3,1.4954143655902966E-3,1.2194445100888629E-2,2.2305673697788003E-7,2.2305673697788003E-7,1.7989806845939493E-2,9.7089945106263439E-7,9.7089945106263439E-7,2.081590638322155E-2,8.6660391711008739E-4,2.2902779906594983E-3,20,7.1768619833775897,1.1383781409695646E-3,6.4127783738465954E-4,2.6462598954643114E-3,3.2597875234280989E-2,1.0626214697897498E-3,9.5428249610812429E-4,9.9420060716980986E-4,4.5965096527884956E-4,2.5164730422384094E-3,3.6466065055603077E-3,8.1889911870349791E-3,3.2445604867676224E-3,1.6596284611505321E-2,1.8092892933283658E-2,0.12345740000000001,0.87218046279980987,6.1222333006300481E-3,7.5070241662487476E-3,5.5011861910540055E-2,8.0422167794884872E-3,7.0236563031233178E-3,3.2472625506716189E-3,3.2796777581688514E-3,7.2848667199914598E-3,8.4348549430643491E-6,2.5761914228457642E-2,0.1278195372001901,0.87218046279980987,87.218046279980982,{"$f":"CHOOSE(MODE, I40*1000, 'PFM Efficiency'!BI40)","v":37.400000000000006},87.425707636537126,0.87425707636537131,254.47533229549981,null,4.5303886279268275E-3,null,16.596284611505322,8.1889911870349792,1.4954143655902965,null,null,{"$f":"IF(MODE=1, BJ40, 'PFM Efficiency'!BH40)","v":87.218046279980982},{"$f":"IF(MODE=1, BR40, 'PFM Efficiency'!BN40)","v":16.596284611505322},{"$f":"IF(MODE=1, BS40, 'PFM Efficiency'!BO40)","v":8.1889911870349792},{"$f":"IF(MODE=1, BT40, 'PFM Efficiency'!BP40)","v":1.4954143655902965}]
["FOM",null,"mΩ*nC",null,"FOM",null,null,35,3.85E-2,4.3065296136363639E-2,6.0006389660715073E-2,1.7091051145622E-2,2.8272825383088879E-6,0.28015299084562983,254607.38337985135,3.9276158716422212E-6,0,2.9999999999999997E-4,4.038507758217863E-2,4.8928634739557608E-4,1.0317101104493629E-3,1.520996457844939E-3,1.2194445100888629E-2,2.2305673697788003E-7,2.2305673697788003E-7,1.8454846312035578E-2,1.0217440572025596E-6,1.0217440572025596E-6,2.1375611773140315E-2,9.1383355735202973E-4,2.2914664504186623E-3,20,7.0444506615646407,1.1725770371460872E-3,6.4161060611722545E-4,2.7280212006153422E-3,3.3474378334008265E-2,1.1205340048483219E-3,9.5477768767444253E-4,1.0619328620577232E-3,4.7346029795582021E-4,2.6559271648618657E-3,3.6466065055603077E-3,8.1913482988906546E-3,3.2462441380931048E-3,1.6821540802460969E-2,1.8343782061100086E-2,0.12708849999999999,0.87386719233771371,6.2835674748478688E-3,7.7048505941586945E-3,5.3571227935144718E-2,8.0627012141187143E-3,7.3019060624488867E-3,3.2555378437705224E-3,3.3643585898625551E-3,7.0940928370766621E-3,8.559315555933206E-6,2.5074257612407322E-2,0.12613280766228616,0.87386719233771371,87.386719233771373,{"$f":"CHOOSE(MODE, I41*1000, 'PFM Efficiency'!BI41)","v":38.5},87.427727681316185,0.87427727681316181,254.60738337985134,null,4.411748182894271E-3,null,16.821540802460969,8.1913482988906541,1.5209964578449391,null,null,{"$f":"IF(MODE=1, BJ41, 'PFM Efficiency'!BH41)","v":87.386719233771373},{"$f":"IF(MODE=1, BR41, 'PFM Efficiency'!BN41)","v":16.821540802460969},{"$f":"IF(MODE=1, BS41, 'PFM Efficiency'!BO41)","v":8.1913482988906541},{"$f":"IF(MODE=1, BT41, 'PFM Efficiency'!BP41)","v":1.5209964578449391}]
["QgTop",1.8,"nC",{"$f":"B42/1000000000","v":1.8E-9},"Gate charge of high-side MOSFET @ VDD",null,null,36,3.9599999999999996E-2,4.3052642303030304E-2,6.1106462442305082E-2,1.8197378480909628E-2,2.8252461779538334E-6,0.28029831778201397,254739.45875372365,3.9255795112871671E-6,0,2.9999999999999997E-4,4.1435063549107615E-2,5.1505934739557596E-4,1.032245301129054E-3,1.54730464852463E-3,1.2194445100888629E-2,2.2305673697788003E-7,2.2305673697788003E-7,1.8921637656738998E-2,1.0740851148387699E-6,1.0740851148387699E-6,2.1937051505985777E-2,9.6246845755254562E-4,2.2926551287835127E-3,20,6.9168367409192753,1.2068109098788355E-3,6.4194343605938355E-4,2.8112228034907647E-3,3.4353597428576077E-2,1.1801696562846688E-3,9.5527297032646378E-4,1.1297349476389038E-3,4.8728745280630264E-4,2.7971920567298751E-3,3.6466065055603077E-3,8.1937058443142755E-3,3.2479280991099765E-3,1.7050048803644892E-2,1.859865059402134E-2,0.13071959999999999,0.87544288444291474,6.4457523023718219E-3,7.9037200850511618E-3,5.2204117091203428E-2,8.0821393572310975E-3,7.5659535464992801E-3,3.2634152279963397E-3,3.4494065216177858E-3,6.9130551491365048E-3,8.6870951585377556E-6,2.4421706596837917E-2,0.12455711555708535,0.87544288444291474,87.544288444291467,{"$f":"CHOOSE(MODE, I42*1000, 'PFM Efficiency'!BI42)","v":39.599999999999994},87.42955683691271,0.87429556836912714,254.73945875372365,null,4.2991625839814583E-3,null,17.050048803644891,8.193705844314275,1.54730464852463,null,null,{"$f":"IF(MODE=1, BJ42, 'PFM Efficiency'!BH42)","v":87.544288444291467},{"$f":"IF(MODE=1, BR42, 'PFM Efficiency'!BN42)","v":17.050048803644891},{"$f":"IF(MODE=1, BS42, 'PFM Efficiency'!BO42)","v":8.193705844314275},{"$f":"IF(MODE=1, BT42, 'PFM Efficiency'!BP42)","v":1.54730464852463}]
["Coss",35,"pF",{"$f":"B43/1000000000000","v":3.5000000000000002E-11},"Capacitance (Coss)",null,null,37,4.07E-2,4.303998846969697E-2,6.2206535223895097E-2,1.9303705816197256E-2,2.823211554076685E-6,0.2804436714523425,254871.55842381928,3.9235448874100187E-6,0,2.9999999999999997E-4,4.248758043615318E-2,5.4155834739557588E-4,1.0327805902609537E-3,1.5743389376565295E-3,1.2194445100888629E-2,2.2305673697788003E-7,2.2305673697788003E-7,1.9390066112799292E-2,1.1279239915761822E-6,1.1279239915761822E-6,2.2500119351481856E-2,1.0125107416618566E-3,2.2938440258143734E-3,20,6.7937641382042795,1.2410797688190986E-3,6.4227632722802463E-4,2.8958668377089799E-3,3.5235366160525763E-2,1.2415310284663241E-3,9.5576834408932232E-4,1.1976068831821478E-3,5.0113243948169989E-4,2.9402703511301718E-3,3.6466065055603077E-3,8.1960638234254823E-3,3.2496123699036956E-3,1.7281813382168332E-2,1.8857503300553417E-2,0.13435070000000002,0.87691583809282037,6.6087240751435605E-3,8.103554520711747E-3,5.0905039806968998E-2,8.100609119372236E-3,7.8168587411260489E-3,3.2709243283704096E-3,3.5347868830051064E-3,6.741026707525021E-3,8.8179398977990766E-6,2.3801640036249516E-2,0.12308416190717966,0.87691583809282037,87.691583809282037,{"$f":"CHOOSE(MODE, I43*1000, 'PFM Efficiency'!BI43)","v":40.700000000000003},87.431210518356053,0.87431210518356051,254.87155842381929,null,4.1921797488092107E-3,null,17.28181338216833,8.196063823425483,1.5743389376565295,null,null,{"$f":"IF(MODE=1, BJ43, 'PFM Efficiency'!BH43)","v":87.691583809282037},{"$f":"IF(MODE=1, BR43, 'PFM Efficiency'!BN43)","v":17.28181338216833},{"$f":"IF(MODE=1, BS43, 'PFM Efficiency'!BO43)","v":8.196063823425483},{"$f":"IF(MODE=1, BT43, 'PFM Efficiency'!BP43)","v":1.5743389376565295}]
["Low-side N-ch MOSFET",null,"Units","Std Units","Description",null,null,38,4.1800000000000004E-2,4.3027334636363643E-2,6.3306608005485113E-2,2.0410033151484885E-2,2.8211786644572537E-6,0.28058905186399291,255003.68239684295,3.9215119977905874E-6,0,2.9999999999999997E-4,4.3542444709944651E-2,5.6878334739557607E-4,1.033315977872231E-3,1.6020993252678071E-3,1.2194445100888629E-2,2.2305673697788003E-7,2.2305673697788003E-7,1.986002730503382E-2,1.1832620536700666E-6,1.1832620536700666E-6,2.306471910095249E-2,1.0639625344116854E-3,2.2950331415715866E-3,20,6.6749946777031077,1.275383623621713E-3,6.4260927964004423E-4,2.9819554376734427E-3,3.6119533866304121E-2,1.3046207267190903E-3,9.5626380898816102E-4,1.2655486879633378E-3,5.1499526763696551E-4,3.0851646823193933E-3,3.6466065055603077E-3,8.1984222363439534E-3,3.2512969505597475E-3,1.7516839306896535E-2,1.9120344950954989E-2,0.13798180000000002,0.87829354617071531,6.7724252571079724E-3,8.3042833509776315E-3,4.9669039743406508E-2,8.1181808435516218E-3,8.0555786705421729E-3,3.2780918923655659E-3,3.6204683747197847E-3,6.57735117617151E-3,8.951620559267214E-6,2.3211691391602101E-2,0.12170645382928465,0.87829354617071531,87.82935461707153,{"$f":"CHOOSE(MODE, I44*1000, 'PFM Efficiency'!BI44)","v":41.800000000000004},87.432702520740989,0.8743270252074099,255.00368239684295,null,4.0903915082805362E-3,null,17.516839306896536,8.1984222363439532,1.6020993252678071,null,null,{"$f":"IF(MODE=1, BJ44, 'PFM Efficiency'!BH44)","v":87.82935461707153},{"$f":"IF(MODE=1, BR44, 'PFM Efficiency'!BN44)","v":17.516839306896536},{"$f":"IF(MODE=1, BS44, 'PFM Efficiency'!BO44)","v":8.1984222363439532},{"$f":"IF(MODE=1, BT44, 'PFM Efficiency'!BP44)","v":1.6020993252678071}]
["RdsonBot",1000,"mW",{"$f":"B45/1000","v":1},"Drain-source resistance of low-side MOSFET @ VDD, 25°C",null,null,39,4.2900000000000001E-2,4.3014680803030308E-2,6.4406680787075121E-2,2.1516360486772506E-2,2.8191475068791334E-6,0.28073445902434535,255135.83067950196,3.9194808402124666E-6,0,2.9999999999999997E-4,4.4599489810070551E-2,5.9673434739557609E-4,1.0338514639900644E-3,1.6305858113856405E-3,1.2194445100888629E-2,2.2305673697788003E-7,2.2305673697788003E-7,2.0331426134800729E-2,1.2401006660245744E-6,1.2401006660245744E-6,2.3630763437896146E-2,1.1168259613156186E-3,2.2962224761155173E-3,20,6.5603065528066926,1.3097224839450699E-3,6.4294229331234498E-4,3.0694907385730333E-3,3.7005963807574108E-2,1.3694413573274848E-3,9.5675936504813241E-4,1.3335603812654499E-3,5.288759469306057E-4,3.2318776855235405E-3,3.6466065055603077E-3,8.2007810831894179E-3,3.2529818411636499E-3,1.7755131348449641E-2,1.9387180317238285E-2,0.14161290000000001,0.87958279102074144,6.9368037526130345E-3,8.5058426966564595E-3,4.8491630584341056E-2,8.1349182023037637E-3,8.282979602480766E-3,3.2849421310132032E-3,3.7064226689810143E-3,6.4214344611067233E-3,9.0879296464909522E-6,2.264971854905258E-2,0.12041720897925848,0.87958279102074144,87.958279102074144,{"$f":"CHOOSE(MODE, I45*1000, 'PFM Efficiency'!BI45)","v":42.9},87.434045226663045,0.87434045226663049,255.13583067950196,null,3.9934284010633815E-3,null,17.755131348449641,8.2007810831894172,1.6305858113856404,null,null,{"$f":"IF(MODE=1, BJ45, 'PFM Efficiency'!BH45)","v":87.958279102074144},{"$f":"IF(MODE=1, BR45, 'PFM Efficiency'!BN45)","v":17.755131348449641},{"$f":"IF(MODE=1, BS45, 'PFM Efficiency'!BO45)","v":8.2007810831894172},{"$f":"IF(MODE=1, BT45, 'PFM Efficiency'!BP45)","v":1.6305858113856404}]
["FOM",null,"mΩ*nC",null,"FOM",null,null,40,4.4000000000000004E-2,4.3002026969696974E-2,6.550675356866513E-2,2.2622687822060138E-2,2.8171180791296927E-6,0.28087989294078292,255268.00327850608,3.917451412463026E-6,0,2.9999999999999997E-4,4.5658564271323587E-2,6.2541134739557594E-4,1.0343870486416433E-3,1.6597983960372192E-3,1.2194445100888629E-2,2.2305673697788003E-7,2.2305673697788003E-7,2.0804175800315232E-2,1.2984411921912658E-6,1.2984411921912658E-6,2.4198172954476006E-2,1.171103148669468E-3,2.2974120295065547E-3,20,6.4494929435171695,1.3440963594511151E-3,6.4327536826183532E-4,3.1584748763824185E-3,3.7894531631030626E-2,1.4359955275351807E-3,9.5725501229439766E-4,1.4016419823785597E-3,5.4277448702468197E-4,3.3804119969384223E-3,3.6466065055603077E-3,8.203140364081641E-3,3.2546670418009526E-3,1.7996694279203432E-2,1.965801417316982E-2,0.14524400000000001,0.88078972672507083,7.1018122764689119E-3,8.7081745770987828E-3,4.7368741609908109E-2,8.1508789700993518E-3,8.4998475573903089E-3,3.2914970126119501E-3,3.7926240654574898E-3,6.2727375031052957E-3,9.2266788662227217E-6,2.211377783251858E-2,0.11921027327492918,0.88078972672507083,88.078972672507078,{"$f":"CHOOSE(MODE, I46*1000, 'PFM Efficiency'!BI46)","v":44.000000000000007},87.435249782574815,0.8743524978257482,255.26800327850609,null,3.900955191404197E-3,null,17.996694279203432,8.2031403640816407,1.6597983960372191,null,null,{"$f":"IF(MODE=1, BJ46, 'PFM Efficiency'!BH46)","v":88.078972672507078},{"$f":"IF(MODE=1, BR46, 'PFM Efficiency'!BN46)","v":17.996694279203432},{"$f":"IF(MODE=1, BS46, 'PFM Efficiency'!BO46)","v":8.2031403640816407},{"$f":"IF(MODE=1, BT46, 'PFM Efficiency'!BP46)","v":1.6597983960372191}]
["QgBot",0.75,"nC",{"$f":"B47/1000000000","v":7.5E-10},"Gate charge of low-side MOSFET at VDD",null,null,41,4.5099999999999994E-2,4.298937313636364E-2,6.6606826350255138E-2,2.3729015157347752E-2,2.8150903790000685E-6,0.28102535362069114,255400.20020056749,3.9154237123334018E-6,0,2.9999999999999997E-4,4.6719530084522322E-2,6.5481434739557583E-4,1.0349227318541664E-3,1.6897370792497424E-3,1.2194445100888629E-2,2.2305673697788003E-7,2.2305673697788003E-7,2.1278196934637353E-2,1.3582849943676313E-6,1.3582849943676313E-6,2.4766875292935375E-2,1.2267962235516254E-3,2.2986018018051075E-3,20,6.342360771739008,1.3785052598053492E-3,6.436085045054301E-4,3.2489099878624046E-3,3.8785124023850238E-2,1.5042858455454448E-3,9.5775075075212805E-4,1.4697935105998381E-3,5.5669089758481093E-4,3.5307702537300937E-3,3.6466065055603077E-3,8.2055000791404365E-3,3.2563525525572358E-3,1.8241532873290171E-2,1.9932851294271258E-2,0.14887509999999998,0.88191995020706293,7.2674078095589017E-3,8.9112262426734104E-3,4.6296670661641927E-2,8.1661156908556781E-3,8.7068973903820963E-3,3.2977765165479096E-3,3.8790491939214595E-3,6.1307700491551919E-3,9.3676969551562634E-6,2.1602101545580815E-2,0.11808004979293717,0.88191995020706293,88.191995020706287,{"$f":"CHOOSE(MODE, I47*1000, 'PFM Efficiency'!BI47)","v":45.099999999999994},87.436326249363404,0.87436326249363405,255.4002002005675,null,3.812666995664629E-3,null,18.241532873290172,8.2055000791404371,1.6897370792497424,null,null,{"$f":"IF(MODE=1, BJ47, 'PFM Efficiency'!BH47)","v":88.191995020706287},{"$f":"IF(MODE=1, BR47, 'PFM Efficiency'!BN47)","v":18.241532873290172},{"$f":"IF(MODE=1, BS47, 'PFM Efficiency'!BO47)","v":8.2055000791404371},{"$f":"IF(MODE=1, BT47, 'PFM Efficiency'!BP47)","v":1.6897370792497424}]
["VSD",0.8,"V",{"$f":"B48","v":0.8},"Body diode forward voltage",null,null,42,4.6199999999999998E-2,4.2976719303030306E-2,6.7706899131845147E-2,2.483534249263538E-2,2.8130644042851565E-6,0.28117084107145845,255532.42145240086,3.9133977376184902E-6,0,2.9999999999999997E-4,4.7782261262089579E-2,6.8494334739557588E-4,1.035458513654843E-3,1.7204018610504188E-3,1.2194445100888629E-2,2.2305673697788003E-7,2.2305673697788003E-7,2.1753416845755651E-2,1.4196334333956171E-6,1.4196334333956171E-6,2.5336804394234767E-2,1.2839073138234283E-3,2.2997917930716078E-3,20,6.2387295785978987,1.4129491946768319E-3,6.4394170206005016E-4,3.3407982105603104E-3,3.9677637537050822E-2,1.5743149205215844E-3,9.582465804465032E-4,1.5380149852335632E-3,5.7062518828016799E-4,3.6829550940353155E-3,3.6466065055603077E-3,8.2078602284856635E-3,3.258038373518111E-3,1.8489651906599399E-2,2.0211696457820193E-2,0.15250620000000001,0.88297856289167964,7.433551126747158E-3,9.1149495958923465E-3,4.5272043353961476E-2,8.1806762567994285E-3,8.9047806670640231E-3,3.3037988534067256E-3,3.9656767563912947E-3,5.995085251097384E-3,9.5108277952809699E-6,2.1113078495897806E-2,0.11702143710832034,0.88297856289167964,88.297856289167967,{"$f":"CHOOSE(MODE, I48*1000, 'PFM Efficiency'!BI48)","v":46.199999999999996},87.437283731440814,0.87437283731440818,255.53242145240085,null,3.7282859232674161E-3,null,18.489651906599399,8.2078602284856643,1.7204018610504188,null,null,{"$f":"IF(MODE=1, BJ48, 'PFM Efficiency'!BH48)","v":88.297856289167967},{"$f":"IF(MODE=1, BR48, 'PFM Efficiency'!BN48)","v":18.489651906599399},{"$f":"IF(MODE=1, BS48, 'PFM Efficiency'!BO48)","v":8.2078602284856643},{"$f":"IF(MODE=1, BT48, 'PFM Efficiency'!BP48)","v":1.7204018610504188}]
["BDserR",100,"mW",{"$f":"B49*0.001","v":0.1},"Series resistance of body diode",null,null,43,4.7300000000000002E-2,4.2964065469696971E-2,6.8806971913435169E-2,2.5941669827923012E-2,2.8110401527836019E-6,0.28131635530047605,255664.66704072343,3.9113734861169355E-6,0,2.9999999999999997E-4,4.8846642579798531E-2,7.1579834739557598E-4,1.0359943940708917E-3,1.7517927414664677E-3,1.2194445100888629E-2,2.2305673697788003E-7,2.2305673697788003E-7,2.2229768845402974E-2,1.482487868760146E-6,1.482487868760146E-6,2.5907899838944072E-2,1.3424385481295167E-3,2.3009820033665107E-3,20,6.1384305100546364,1.447428173738182E-3,6.4427496094262302E-4,3.4341416828103217E-3,4.0571977553323466E-2,1.6460853625873831E-3,9.5874250140271281E-4,1.6063064255911175E-3,5.8457736878348744E-4,3.8369691569619881E-3,3.6466065055603077E-3,8.2102208122372209E-3,3.2597245047692232E-3,1.8741056156778756E-2,2.0494554442850962E-2,0.15613730000000001,0.88397022435450945,7.6002063861242038E-3,9.3193006877475334E-3,4.429177758521112E-2,8.1946044121191958E-3,9.0940925160859706E-3,3.3095806564870031E-3,4.0524873027768145E-3,5.8652749660514187E-3,9.6559287741037291E-6,2.0645237050037107E-2,0.11602977564549068,0.88397022435450945,88.39702243545095,{"$f":"CHOOSE(MODE, I49*1000, 'PFM Efficiency'!BI49)","v":47.300000000000004},87.438130487841121,0.87438130487841126,255.66466704072343,null,3.6475581540762088E-3,null,18.741056156778754,8.2102208122372211,1.7517927414664678,null,null,{"$f":"IF(MODE=1, BJ49, 'PFM Efficiency'!BH49)","v":88.39702243545095},{"$f":"IF(MODE=1, BR49, 'PFM Efficiency'!BN49)","v":18.741056156778754},{"$f":"IF(MODE=1, BS49, 'PFM Efficiency'!BO49)","v":8.2102208122372211},{"$f":"IF(MODE=1, BT49, 'PFM Efficiency'!BP49)","v":1.7517927414664678}]
["QrrBot",2,"nC",{"$f":"B50*0.000000001","v":2.0000000000000001E-9},"Reverse recovery charge of body diode at 100mA",null,null,44,4.8399999999999999E-2,4.2951411636363644E-2,6.9907044695025178E-2,2.7047997163210633E-2,2.8090176222977959E-6,0.28146189631513768,255796.93697225477,3.9093509556311296E-6,0,2.9999999999999997E-4,4.9912568470462292E-2,7.473793473955759E-4,1.0365303731295419E-3,1.7839097205251178E-3,1.2194445100888629E-2,2.2305673697788003E-7,2.2305673697788003E-7,2.2707191655124269E-2,1.5468496585876358E-6,1.5468496585876358E-6,2.6480106267707769E-2,1.4023920558981925E-3,2.302172432750293E-3,20,6.0413053988195449,1.4819422066655779E-3,6.4460828117008197E-4,3.5289425437338524E-3,4.1468057379476377E-2,1.7195997828275452E-3,9.5923851364595547E-4,1.6746678509909916E-3,5.9854744877106409E-4,3.9928150825896012E-3,3.6466065055603077E-3,8.2125818305150543E-3,3.2614109463962484E-3,1.8995750403234757E-2,2.0781430030155441E-2,0.1597684,0.88489919914804382,7.7673407704895916E-3,9.5242392781003313E-3,4.3353052561963999E-2,8.2079401925665828E-3,9.2753776102214459E-3,3.3151371489582382E-3,4.1394630350565743E-3,5.740965654503361E-3,9.802869353407344E-6,2.0197230343286677E-2,0.11510080085195606,0.88489919914804382,88.489919914804389,{"$f":"CHOOSE(MODE, I50*1000, 'PFM Efficiency'!BI50)","v":48.4},87.438874028184088,0.87438874028184088,255.79693697225477,null,3.5702513874558586E-3,null,18.995750403234759,8.2125818305150542,1.7839097205251178,null,null,{"$f":"IF(MODE=1, BJ50, 'PFM Efficiency'!BH50)","v":88.489919914804389},{"$f":"IF(MODE=1, BR50, 'PFM Efficiency'!BN50)","v":18.995750403234759},{"$f":"IF(MODE=1, BS50, 'PFM Efficiency'!BO50)","v":8.2125818305150542},{"$f":"IF(MODE=1, BT50, 'PFM Efficiency'!BP50)","v":1.7839097205251178}]
["TrrBot",10,"ns",{"$f":"B51*0.000000001","v":1E-8},"Reverse recovery time of body diode (not used)",null,null,45,4.9500000000000002E-2,4.2938757803030303E-2,7.10071174766152E-2,2.8154324498498261E-2,2.8069968106338615E-6,0.2816074641228401,255929.23125371709,3.9073301439671952E-6,0,2.9999999999999997E-4,5.097994204899204E-2,7.7968634739557599E-4,1.0370664508580331E-3,1.8167527982536091E-3,1.2194445100888629E-2,2.2305673697788003E-7,2.2305673697788003E-7,2.3185628879721459E-2,1.6127201596445213E-6,1.6127201596445213E-6,2.7053372870510864E-2,1.4637699673417865E-3,2.303363081283454E-3,20,5.9472059320675887,1.5164913031387628E-3,6.4494166275936703E-4,3.625202933239916E-3,4.2365797446621278E-2,1.7948607932881421E-3,9.5973461720143911E-4,1.7430992807587916E-3,6.1253543792275686E-4,4.1504955119696903E-3,3.6466065055603077E-3,8.2149432834391582E-3,3.2630976984848931E-3,1.9253739427133661E-2,2.1072328002283893E-2,0.1633995,0.88576939779648622,7.9349241734822731E-3,9.729728450817543E-3,4.2453281680857984E-2,8.2207203103120303E-3,9.4491354026003949E-3,3.320482290201912E-3,4.2265876358417338E-3,5.621814789221872E-3,9.9515298162474608E-6,1.9767823331349868E-2,0.11423060220351371,0.88576939779648622,88.576939779648626,{"$f":"CHOOSE(MODE, I51*1000, 'PFM Efficiency'!BI51)","v":49.5},87.439521195857154,0.87439521195857151,255.92923125371709,null,3.4961526090118334E-3,null,19.253739427133659,8.2149432834391583,1.8167527982536091,null,null,{"$f":"IF(MODE=1, BJ51, 'PFM Efficiency'!BH51)","v":88.576939779648626},{"$f":"IF(MODE=1, BR51, 'PFM Efficiency'!BN51)","v":19.253739427133659},{"$f":"IF(MODE=1, BS51, 'PFM Efficiency'!BO51)","v":8.2149432834391583},{"$f":"IF(MODE=1, BT51, 'PFM Efficiency'!BP51)","v":1.8167527982536091}]
["Idss",0,"μA",{"$f":"B52/1000000","v":0},"Leakage current of low-side device",null,null,46,5.0599999999999999E-2,4.2926103969696976E-2,7.2107190258205209E-2,2.9260651833785883E-2,2.804977715601653E-6,0.28175305873098233,256061.54989183487,3.9053110489349863E-6,0,2.9999999999999997E-4,5.2048674251306215E-2,8.1271934739557601E-4,1.0376026272836136E-3,1.8503219746791896E-3,1.2194445100888629E-2,2.2305673697788003E-7,2.2305673697788003E-7,2.3665028539568467E-2,1.6801007273357704E-6,1.6801007273357704E-6,2.7627652935573524E-2,1.5265744134570088E-3,2.304553949026514E-3,20,5.8559928957426441,1.5510754728410424E-3,6.4527510572742384E-4,3.7229249920254755E-3,4.3265124603738825E-2,1.8718710069770465E-3,9.6023081209438074E-4,1.8116007342272372E-3,6.2654134592198733E-4,4.3100130871262712E-3,3.6466065055603077E-3,8.2173051711295596E-3,3.2647847611208948E-3,1.9515028011402202E-2,2.1367253143545706E-2,0.1670306,0.88658441278911293,8.1029289240035461E-3,9.9357342758614898E-3,4.1590088718898875E-2,8.2329784918474293E-3,9.6158247241115158E-3,3.325628904298647E-3,4.3138461178553978E-3,5.5075077022933719E-3,1.0101800166818145E-5,1.9355881421758314E-2,0.11341558721088708,0.88658441278911293,88.658441278911297,{"$f":"CHOOSE(MODE, I52*1000, 'PFM Efficiency'!BI52)","v":50.6},87.440078240358233,0.87440078240358232,256.06154989183489,null,3.4250661297916718E-3,null,19.515028011402201,8.2173051711295599,1.8503219746791897,null,null,{"$f":"IF(MODE=1, BJ52, 'PFM Efficiency'!BH52)","v":88.658441278911297},{"$f":"IF(MODE=1, BR52, 'PFM Efficiency'!BN52)","v":19.515028011402201},{"$f":"IF(MODE=1, BS52, 'PFM Efficiency'!BO52)","v":8.2173051711295599},{"$f":"IF(MODE=1, BT52, 'PFM Efficiency'!BP52)","v":1.8503219746791897}]
["Csw",35,"pF",{"$f":"B53/1000000000000","v":3.5000000000000002E-11},"Effective SW node capacitance (CossHS + CossLS)",null,null,47,5.1699999999999996E-2,4.2913450136363641E-2,7.3207263039795217E-2,3.0366979169073507E-2,2.8029603350147412E-6,0.28189868014696656,256193.8928933352,3.9032936683480745E-6,0,2.9999999999999997E-4,5.3118683072141251E-2,8.4647834739557564E-4,1.0381389024335427E-3,1.8846172498291182E-3,1.2194445100888629E-2,2.2305673697788003E-7,2.2305673697788003E-7,2.4145342654456867E-2,1.7489927157034027E-6,1.7489927157034027E-6,2.8202903450046786E-2,1.5908075260253219E-3,2.3057450360400166E-3,20,5.7675354873524833,1.5856947254592889E-3,6.4560861009120465E-4,3.8221108615758156E-3,4.4165971492364821E-2,1.950633037864382E-3,9.6072709835000694E-4,1.8801722307361687E-3,6.4056518245574382E-4,4.4713704510562944E-3,3.6466065055603077E-3,8.2196674937063414E-3,3.2664721343900237E-3,1.9779620940728476E-2,2.1666210240010274E-2,0.1706617,0.88734755026988787,8.2713295435910359E-3,1.0142225511784241E-2,4.076128687070394E-2,8.2447457754855503E-3,9.775867831090454E-3,3.3305887931521132E-3,4.4012246914097728E-3,5.3977548091591393E-3,1.025357916186121E-5,1.8960360464633688E-2,0.11265244973011211,0.88734755026988787,88.734755026988793,{"$f":"CHOOSE(MODE, I53*1000, 'PFM Efficiency'!BI53)","v":51.699999999999996},87.440550880412815,0.87440550880412815,256.1938928933352,null,3.3568118599403242E-3,null,19.779620940728474,8.219667493706341,1.8846172498291183,null,null,{"$f":"IF(MODE=1, BJ53, 'PFM Efficiency'!BH53)","v":88.734755026988793},{"$f":"IF(MODE=1, BR53, 'PFM Efficiency'!BN53)","v":19.779620940728474},{"$f":"IF(MODE=1, BS53, 'PFM Efficiency'!BO53)","v":8.219667493706341},{"$f":"IF(MODE=1, BT53, 'PFM Efficiency'!BP53)","v":1.8846172498291183}]
[null,null,null,null,null,null,null,48,5.28E-2,4.2900796303030307E-2,7.4307335821385226E-2,3.1473306504361136E-2,2.8009446666904087E-6,0.28204432837819737,256326.2602649476,3.9012780000237424E-6,0,2.9999999999999997E-4,5.4189892888975029E-2,8.8096334739557586E-4,1.0386752763350898E-3,1.9196386237306656E-3,1.2194445100888629E-2,2.2305673697788003E-7,2.2305673697788003E-7,2.4626526872629308E-2,1.8193974774250004E-6,1.8193974774250004E-6,2.8779084745812297E-2,1.656471437613292E-3,2.3069363423845286E-3,20,5.6817106901202159,1.620349070683943E-3,6.4594217586766791E-4,3.9227626841649025E-3,4.5068275991909934E-2,2.0311495008829652E-3,9.6122347599355347E-4,1.9488137896325501E-3,6.5460695721458284E-4,4.6345702477300988E-3,3.6466065055603077E-3,8.2220302512896228E-3,3.268159818378082E-3,2.0047523001562706E-2,2.1969204079507774E-2,0.1742928,0.88806185801196735,8.4401025322366433E-3,1.0349173343099694E-2,3.9964860243299462E-2,8.256050773982327E-3,9.9296539784800384E-3,3.3353728363509157E-3,4.4887106474194999E-3,5.2922891580904864E-3,1.0406773455627512E-5,1.8580297916875595E-2,0.11193814198803259,0.88806185801196735,88.806185801196733,{"$f":"CHOOSE(MODE, I54*1000, 'PFM Efficiency'!BI54)","v":52.8},87.462211050621846,0.87462211050621841,256.32626026494762,null,3.2912237847423083E-3,null,20.047523001562706,8.2220302512896222,1.9196386237306657,null,null,{"$f":"IF(MODE=1, BJ54, 'PFM Efficiency'!BH54)","v":88.806185801196733},{"$f":"IF(MODE=1, BR54, 'PFM Efficiency'!BN54)","v":20.047523001562706},{"$f":"IF(MODE=1, BS54, 'PFM Efficiency'!BO54)","v":8.2220302512896222},{"$f":"IF(MODE=1, BT54, 'PFM Efficiency'!BP54)","v":1.9196386237306657}]
[null,null,null,null,null,null,null,49,5.3899999999999997E-2,4.2888142469696973E-2,7.5407408602975234E-2,3.2579633839648764E-2,2.7989307084496419E-6,0.28219000343208245,256458.65201340418,3.8992640417829756E-6,0,2.9999999999999997E-4,5.526223386109709E-2,9.161743473955757E-4,1.0392117490155342E-3,1.9553860964111099E-3,1.2194445100888629E-2,2.2305673697788003E-7,2.2305673697788003E-7,2.5108540139510482E-2,1.8913163638122271E-6,1.8913163638122271E-6,2.9356160184644008E-2,1.7235682815729561E-3,2.3081278681206375E-3,20,5.5984027021946847,1.6550385182090128E-3,6.4627580307377857E-4,4.0248826028557476E-3,4.5971980726620246E-2,2.1134230119287433E-3,9.6171994505026557E-4,2.0175254302704677E-3,6.6866667989262858E-4,4.7996151220918394E-3,3.6466065055603077E-3,8.2243934439995732E-3,3.2698478131709032E-3,2.0318738982118063E-2,2.2276239451629962E-2,0.1779239,0.88873015017548429,8.6092261788328316E-3,1.055655114785454E-2,3.919894747878646E-2,8.2669199069608235E-3,1.0077542582121523E-2,3.3399910795475947E-3,4.5762922538669414E-3,5.190864261443817E-3,1.0561296843157083E-5,1.8214805022357932E-2,0.11126984982451568,0.88873015017548429,88.873015017548425,{"$f":"CHOOSE(MODE, I55*1000, 'PFM Efficiency'!BI55)","v":53.9},87.500809495614803,0.87500809495614806,256.45865201340416,null,3.2281486159000615E-3,null,20.318738982118063,8.2243934439995741,1.9553860964111098,null,null,{"$f":"IF(MODE=1, BJ55, 'PFM Efficiency'!BH55)","v":88.873015017548425},{"$f":"IF(MODE=1, BR55, 'PFM Efficiency'!BN55)","v":20.318738982118063},{"$f":"IF(MODE=1, BS55, 'PFM Efficiency'!BO55)","v":8.2243934439995741},{"$f":"IF(MODE=1, BT55, 'PFM Efficiency'!BP55)","v":1.9553860964111098}]
[null,null,null,null,null,null,null,50,5.5E-2,4.2875488636363639E-2,7.6507481384565257E-2,3.3685961174936392E-2,2.796918458117124E-6,0.28233570531603186,256591.06814543938,3.8972517914504573E-6,0,2.9999999999999997E-4,5.6335641394401351E-2,9.5211134739557602E-4,1.0397483205021648E-3,1.9918596678977409E-3,1.2194445100888629E-2,2.2305673697788003E-7,2.2305673697788003E-7,2.5591344401374859E-2,1.964750724809341E-6,1.964750724809341E-6,2.9934095877796132E-2,1.7921001920421828E-3,2.3093196133089546E-3,20,5.5175024153503767,1.6897630777320785E-3,6.466094917265072E-4,4.128472761500768E-3,4.6877032626449884E-2,2.1974561878612469E-3,9.6221650554539765E-4,2.0863071720111427E-3,6.8274436018757789E-4,4.9665077200599676E-3,3.6466065055603077E-3,8.2267570719564004E-3,3.2715361188543524E-3,2.0593273672371487E-2,2.2587321147731015E-2,0.18155500000000002,0.8893550292720277,8.778680393005325E-3,1.0764334291423192E-2,3.8461827224784223E-2,8.277377607111917E-3,1.0219866024259375E-2,3.3444528128662668E-3,4.6639586639487876E-3,5.0932521716049919E-3,1.0717069588936324E-5,1.7863059874397035E-2,0.11064497072797227,0.8893550292720277,88.935502927202776,{"$f":"CHOOSE(MODE, I56*1000, 'PFM Efficiency'!BI56)","v":55},87.537838791529083,0.87537838791529088,256.59106814543935,null,3.1674445949822299E-3,null,20.593273672371488,8.2267570719564009,1.9918596678977409,null,null,{"$f":"IF(MODE=1, BJ56, 'PFM Efficiency'!BH56)","v":88.935502927202776},{"$f":"IF(MODE=1, BR56, 'PFM Efficiency'!BN56)","v":20.593273672371488},{"$f":"IF(MODE=1, BS56, 'PFM Efficiency'!BO56)","v":8.2267570719564009},{"$f":"IF(MODE=1, BT56, 'PFM Efficiency'!BP56)","v":1.9918596678977409}]
[null,null,null,null,null,null,null,51,5.6100000000000004E-2,4.2862834803030304E-2,7.7607554166155279E-2,3.479228851022402E-2,2.794907913521225E-6,0.28248143403745851,256723.50866779019,3.8952412468545583E-6,0,2.9999999999999997E-4,5.7410055663782343E-2,9.8877434739557605E-4,1.0402849908222817E-3,2.029059338217858E-3,1.2194445100888629E-2,2.2305673697788003E-7,2.2305673697788003E-7,2.6074904339816202E-2,2.0397019089916976E-6,2.0397019089916976E-6,3.051286043576569E-2,1.8620693039450304E-3,2.3105115780101115E-3,20,5.438906938242094,1.7245227589542927E-3,6.4694324184283122E-4,4.2335353047421543E-3,4.7783382535187116E-2,2.2832516465040253E-3,9.6271315750421325E-4,2.1551590342229233E-3,6.96840007800699E-4,5.1352506885276481E-3,3.6466065055603077E-3,8.2291211352803623E-3,3.2732247355143247E-3,2.0871131864064491E-2,2.2902453960928319E-2,0.18518610000000002,0.88993890569671319,8.9484465555691312E-3,1.0972499943138338E-2,3.7751905213918732E-2,8.2874465035597152E-3,1.0356932148356347E-2,3.3487666406271477E-3,4.7516998343947008E-3,4.9992417700091777E-3,1.0874017829901607E-5,1.7524301246502061E-2,0.1100610943032868,0.88993890569671319,88.993890569671322,{"$f":"CHOOSE(MODE, I57*1000, 'PFM Efficiency'!BI57)","v":56.1},87.573389266063103,0.87573389266063106,256.72350866779021,null,3.1089804293815424E-3,null,20.871131864064491,8.2291211352803622,2.0290593382178579,null,null,{"$f":"IF(MODE=1, BJ57, 'PFM Efficiency'!BH57)","v":88.993890569671322},{"$f":"IF(MODE=1, BR57, 'PFM Efficiency'!BN57)","v":20.871131864064491},{"$f":"IF(MODE=1, BS57, 'PFM Efficiency'!BO57)","v":8.2291211352803622},{"$f":"IF(MODE=1, BT57, 'PFM Efficiency'!BP57)","v":2.0290593382178579}]
[null,null,null,null,null,null,null,52,5.7200000000000001E-2,4.285018096969697E-2,7.8707626947745288E-2,3.5898615845511642E-2,2.792899072493996E-6,0.28262718960377803,256855.973587196,3.8932324058273292E-6,0,2.9999999999999997E-4,5.8485421186126263E-2,1.0261633473955759E-3,1.0408217600031929E-3,2.066985107398769E-3,1.2194445100888629E-2,2.2305673697788003E-7,2.2305673697788003E-7,2.6559187133421269E-2,2.1161712635642698E-6,2.1161712635642698E-6,3.109242474455887E-2,1.9334777529921134E-3,2.311703762284764E-3,20,5.3625191598340818,1.7593175715803809E-3,6.472770534397339E-4,4.3400723780122278E-3,4.8690984860085662E-2,2.3708120066450911E-3,9.6320990095198492E-4,2.2240810362812941E-3,7.1095363243683408E-4,5.3058466753632197E-3,3.6466065055603077E-3,8.2314856340917567E-3,3.2749136632367489E-3,2.1152318350703952E-2,2.3221642686103262E-2,0.18881720000000002,0.89048401513641551,9.1185073852453665E-3,1.1181026912860388E-2,3.7067702748234808E-2,8.2971475852885515E-3,1.0489026482632547E-2,3.3529405434895299E-3,4.8395064526676416E-3,4.9086372422056553E-3,1.1032073043357821E-5,1.7197823093944384E-2,0.10951598486358449,0.89048401513641551,89.048401513641551,{"$f":"CHOOSE(MODE, I58*1000, 'PFM Efficiency'!BI58)","v":57.2},87.607544443240442,0.87607544443240437,256.85597358719599,null,3.0526343439722776E-3,null,21.152318350703951,8.2314856340917562,2.0669851073987688,null,null,{"$f":"IF(MODE=1, BJ58, 'PFM Efficiency'!BH58)","v":89.048401513641551},{"$f":"IF(MODE=1, BR58, 'PFM Efficiency'!BN58)","v":21.152318350703951},{"$f":"IF(MODE=1, BS58, 'PFM Efficiency'!BO58)","v":8.2314856340917562},{"$f":"IF(MODE=1, BT58, 'PFM Efficiency'!BP58)","v":2.0669851073987688}]
[null,null,null,null,null,null,null,53,5.8300000000000005E-2,4.2837527136363636E-2,7.9807699729335296E-2,3.7004943180799263E-2,2.7908919328711588E-6,0.28277297202240886,256988.46291039881,3.8912252662044925E-6,0,2.9999999999999997E-4,5.9561686437831718E-2,1.0642783473955759E-3,1.0413586280722191E-3,2.1056369754677952E-3,1.2194445100888629E-2,2.2305673697788003E-7,2.2305673697788003E-7,2.7044162243511707E-2,2.1941601343601526E-6,2.1941601343601526E-6,3.1672761765284732E-2,2.0063276756809648E-3,2.3128961661935893E-3,20,5.2882473491086275,1.7941475253186465E-3,6.4761092653420501E-4,4.4480861275338164E-3,4.9599797258026906E-2,2.4601398880373733E-3,9.6370673591399548E-4,2.2930731975688828E-3,7.2508524380440233E-4,5.478298329410658E-3,3.6466065055603077E-3,8.2338505685109267E-3,3.2766029021075848E-3,2.1436837927562985E-2,2.3544892119902117E-2,0.19244830000000002,0.89099243411879436,9.2888468196127786E-3,1.1389895505001382E-2,3.6407846413477815E-2,8.3065003471159381E-3,1.0616414226129646E-2,3.3569819339578674E-3,4.9273698719391754E-3,4.821256715786394E-3,1.1191171571723368E-5,1.6882969642561713E-2,0.10900756588120554,0.89099243411879436,89.099243411879442,{"$f":"CHOOSE(MODE, I59*1000, 'PFM Efficiency'!BI59)","v":58.300000000000004},87.640381672202352,0.8764038167220235,256.98846291039882,null,2.998293234051114E-3,null,21.436837927562983,8.2338505685109276,2.105636975467795,null,null,{"$f":"IF(MODE=1, BJ59, 'PFM Efficiency'!BH59)","v":89.099243411879442},{"$f":"IF(MODE=1, BR59, 'PFM Efficiency'!BN59)","v":21.436837927562983},{"$f":"IF(MODE=1, BS59, 'PFM Efficiency'!BO59)","v":8.2338505685109276},{"$f":"IF(MODE=1, BT59, 'PFM Efficiency'!BP59)","v":2.105636975467795}]
[null,null,null,null,null,null,null,54,5.9400000000000001E-2,4.2824873303030309E-2,8.0907772510925305E-2,3.8111270516086891E-2,2.7888864924921018E-6,0.28291878130077214,257120.97664414308,3.8892198258254355E-6,0,2.9999999999999997E-4,6.0638803511601273E-2,1.1031193473955759E-3,1.0418955950566896E-3,2.1450149424522653E-3,1.2194445100888629E-2,2.2305673697788003E-7,2.2305673697788003E-7,2.7529801221216441E-2,2.2736698658390706E-6,2.2736698658390706E-6,3.2253846354321811E-2,2.0806212092963966E-3,2.3140887897972876E-3,20,5.2160047875848843,1.8290126298809686E-3,6.4794486114324061E-4,4.5575787003206067E-3,5.050978035389931E-2,2.5512379113991528E-3,9.6420366241553655E-4,2.3621355374754561E-3,7.3923485161539915E-4,5.6526083004900078E-3,3.6466065055603077E-3,8.2362159386582621E-3,3.278292452212824E-3,2.1724695391681703E-2,2.3872207060736787E-2,0.19607940000000001,0.89146609392972165,9.4594499085512932E-3,1.1599087387866466E-2,3.5771058872682657E-2,8.3155229203481576E-3,1.0739342026372114E-2,3.3608977060634476E-3,5.0152820528879503E-3,4.7369310412402835E-3,1.1351254197144882E-5,1.6579130992906747E-2,0.10853390607027838,0.89146609392972165,89.146609392972167,{"$f":"CHOOSE(MODE, I60*1000, 'PFM Efficiency'!BI60)","v":59.4},87.671972687530356,0.87671972687530353,257.12097664414307,null,2.9458519071621013E-3,null,21.724695391681703,8.2362159386582618,2.1450149424522653,null,null,{"$f":"IF(MODE=1, BJ60, 'PFM Efficiency'!BH60)","v":89.146609392972167},{"$f":"IF(MODE=1, BR60, 'PFM Efficiency'!BN60)","v":21.724695391681703},{"$f":"IF(MODE=1, BS60, 'PFM Efficiency'!BO60)","v":8.2362159386582618},{"$f":"IF(MODE=1, BT60, 'PFM Efficiency'!BP60)","v":2.1450149424522653}]
[null,null,null,null,null,null,null,55,6.0500000000000005E-2,4.2812219469696974E-2,8.2007845292515327E-2,3.9217597851374519E-2,2.786882749199868E-6,0.28306461744629174,257253.51479517572,3.8872160825332017E-6,0,2.9999999999999997E-4,6.1716727807933781E-2,1.142686347395576E-3,1.0424326609839436E-3,2.1851190083795194E-3,1.2194445100888629E-2,2.2305673697788003E-7,2.2305673697788003E-7,2.8016077533479979E-2,2.3547018010858851E-6,2.3547018010858851E-6,3.2835655101663967E-2,2.1563604919108618E-3,2.3152816331565816E-3,20,5.1457094315526239,1.8639128949828063E-3,6.4827885728384283E-4,4.668552244177511E-3,5.1420897487446757E-2,2.6441086984145081E-3,9.6470068048190886E-4,2.4312680753979265E-3,7.5340246558540012E-4,5.828779239397835E-3,3.6466065055603077E-3,8.2385817446541942E-3,3.2799823136384905E-3,2.201589554186803E-2,2.4203592308785615E-2,0.19971050000000001,0.89190679309541632,9.6303027186746375E-3,1.1808585476470087E-2,3.5156150609210714E-2,8.3242321899615109E-3,1.0858039573700079E-2,3.3646942799224577E-3,5.1032355115004117E-3,4.655502698536684E-3,1.151226575998148E-5,1.6285739177735653E-2,0.10809320690458368,0.89190679309541632,89.190679309541636,{"$f":"CHOOSE(MODE, I61*1000, 'PFM Efficiency'!BI61)","v":60.500000000000007},87.702384109642679,0.87702384109642684,257.2535147951757,null,2.8952124031114703E-3,null,22.01589554186803,8.2385817446541942,2.1851190083795196,null,null,{"$f":"IF(MODE=1, BJ61, 'PFM Efficiency'!BH61)","v":89.190679309541636},{"$f":"IF(MODE=1, BR61, 'PFM Efficiency'!BN61)","v":22.01589554186803},{"$f":"IF(MODE=1, BS61, 'PFM Efficiency'!BO61)","v":8.2385817446541942},{"$f":"IF(MODE=1, BT61, 'PFM Efficiency'!BP61)","v":2.1851190083795196}]
[null,null,null,null,null,null,null,56,6.1600000000000009E-2,4.2799565636363647E-2,8.3107918074105336E-2,4.0323925186662155E-2,2.7848807008411517E-6,0.28321048046639419,257386.07737024612,3.8852140341744849E-6,0,2.9999999999999997E-4,6.2795417757337893E-2,1.1829793473955763E-3,1.0429698258813311E-3,2.2259491732769072E-3,1.2194445100888629E-2,2.2305673697788003E-7,2.2305673697788003E-7,2.8502966405908783E-2,2.4372572818090938E-6,2.4372572818090938E-6,3.3418166185361052E-2,2.2335476623848178E-3,2.3164746963322148E-3,20,5.0772836012549822,1.8988483303431984E-3,6.4861291497302022E-4,4.7810089077010365E-3,5.2333114485321471E-2,2.7387548717337641E-3,9.6519779013842289E-4,2.5004708307403561E-3,7.6758809543356105E-4,6.0068137979076815E-3,3.6466065055603077E-3,8.2409479866192015E-3,3.2816724864706374E-3,2.2310443178698559E-2,2.4539052665994252E-2,0.20334160000000004,0.89231620859906335,9.8013922474521741E-3,1.2018373827233021E-2,3.4562012506930292E-2,8.3326438999029428E-3,1.0972721033958542E-2,3.3683776417764541E-3,5.1912232721637612E-3,4.5768248145664952E-3,1.1674154815969428E-5,1.6002264619213443E-2,0.10768379140093676,0.89231620859906335,89.231620859906329,{"$f":"CHOOSE(MODE, I62*1000, 'PFM Efficiency'!BI62)","v":61.600000000000009},87.731677892610605,0.87731677892610604,257.38607737024614,null,2.8462833829236709E-3,null,22.310443178698559,8.2409479866192008,2.225949173276907,null,null,{"$f":"IF(MODE=1, BJ62, 'PFM Efficiency'!BH62)","v":89.231620859906329},{"$f":"IF(MODE=1, BR62, 'PFM Efficiency'!BN62)","v":22.310443178698559},{"$f":"IF(MODE=1, BS62, 'PFM Efficiency'!BO62)","v":8.2409479866192008},{"$f":"IF(MODE=1, BT62, 'PFM Efficiency'!BP62)","v":2.225949173276907}]
[null,1500,null,null,null,"Eff (%)","Iout (mA)",57,6.2699999999999992E-2,4.2786911803030313E-2,8.420799085569533E-2,4.1430252521949762E-2,2.7828803452662866E-6,0.28335637036850886,257518.66437610614,3.8832136785996199E-6,0,2.9999999999999997E-4,6.3874834569794273E-2,1.2239983473955756E-3,1.0435070897762118E-3,2.2675054371717874E-3,1.2194445100888629E-2,2.2305673697788003E-7,2.2305673697788003E-7,2.8990444680614701E-2,2.5213376483393439E-6,2.5213376483393439E-6,3.4001359240235458E-2,2.3121848603670902E-3,2.3176679793849553E-3,20,5.0106536945445859,1.9338189456847667E-3,6.4894703422778747E-4,4.8949508402796448E-3,5.324639945549306E-2,2.8351790549739314E-3,9.6569499141039802E-4,2.5697438229139585E-3,7.8179175088261932E-4,6.1867146287705099E-3,3.6466065055603077E-3,8.243314664673802E-3,3.2833629707953536E-3,2.2608343104519306E-2,2.4878592936076409E-2,0.20697269999999998,0.8926959059791153,9.9727063458929319E-3,1.2228437543178235E-2,3.3987609170165203E-2,8.3407727478920675E-3,1.1083586338345162E-2,3.3719533800407432E-3,5.2792388254355935E-3,4.500760278545941E-3,1.1836873327568113E-5,1.5728212939341735E-2,0.10730409402088464,0.8926959059791153,89.269590597911531,{"$f":"CHOOSE(MODE, I63*1000, 'PFM Efficiency'!BI63)","v":62.699999999999989},87.759911725729523,0.87759911725729522,257.51866437610613,null,2.7989795787194869E-3,null,22.608343104519307,8.243314664673802,2.2675054371717875,null,null,{"$f":"IF(MODE=1, BJ63, 'PFM Efficiency'!BH63)","v":89.269590597911531},{"$f":"IF(MODE=1, BR63, 'PFM Efficiency'!BN63)","v":22.608343104519307},{"$f":"IF(MODE=1, BS63, 'PFM Efficiency'!BO63)","v":8.243314664673802},{"$f":"IF(MODE=1, BT63, 'PFM Efficiency'!BP63)","v":2.2675054371717875}]
[null,null,null,null,null,{"$f":"BJ56","v":88.935502927202776},{"$f":"I56*1000","v":55},58,6.3799999999999996E-2,4.2774257969696972E-2,8.5308063637285353E-2,4.253657985723739E-2,2.7808816803292421E-6,0.28350228716006765,257651.27581951011,3.8812150136625758E-6,0,2.9999999999999997E-4,6.4954942008430633E-2,1.265743347395576E-3,1.0440444526959546E-3,2.3097878000915306E-3,1.2194445100888629E-2,2.2305673697788003E-7,2.2305673697788003E-7,2.9478490687436989E-2,2.6069442396279276E-6,2.6069442396279276E-6,3.4585215239284248E-2,2.3922742262952388E-3,2.318861482375591E-3,20,4.9457499227940254,1.968824750733717E-3,6.4928121506516547E-4,5.010380192094121E-3,5.4160722601523346E-2,2.933383872719162E-3,9.6619228432316294E-4,2.6390870713371029E-3,7.9601344165889808E-4,6.3684843857151627E-3,3.6466065055603077E-3,8.2456817789385625E-3,3.285053766698754E-3,2.2909600123446599E-2,2.5222217924514734E-2,0.21060380000000001,0.8930473484372361,1.0144233648812147E-2,1.2438762688424419E-2,3.3431972898769084E-2,8.3486324709257306E-3,1.119082234676008E-2,3.3754267178174252E-3,5.3672760899551222E-3,4.4271809441744523E-3,1.2000376385576163E-5,1.5463122083194168E-2,0.10695265156276387,0.8930473484372361,89.304734843723608,{"$f":"CHOOSE(MODE, I64*1000, 'PFM Efficiency'!BI64)","v":63.8},87.787139394322296,0.877871393943223,257.65127581951009,null,2.7532212975456892E-3,null,22.909600123446598,8.2456817789385628,2.3097878000915304,null,null,{"$f":"IF(MODE=1, BJ64, 'PFM Efficiency'!BH64)","v":89.304734843723608},{"$f":"IF(MODE=1, BR64, 'PFM Efficiency'!BN64)","v":22.909600123446598},{"$f":"IF(MODE=1, BS64, 'PFM Efficiency'!BO64)","v":8.2456817789385628},{"$f":"IF(MODE=1, BT64, 'PFM Efficiency'!BP64)","v":2.3097878000915304}]
[null,null,null,null,null,{"$f":"BJ81","v":89.575407073424842},{"$f":"I81*1000","v":82.5},59,6.4899999999999999E-2,4.2761604136363637E-2,8.6408136418875375E-2,4.3642907192525018E-2,2.7788847038876108E-6,0.28364823084850566,257783.91170721504,3.8792180372209445E-6,0,2.9999999999999997E-4,6.6035706184749673E-2,1.3082143473955759E-3,1.0445819146679409E-3,2.3527962620635166E-3,1.2194445100888629E-2,2.2305673697788003E-7,2.2305673697788003E-7,2.9967084127117901E-2,2.6940783932452851E-6,2.6940783932452851E-6,3.5169716386373638E-2,2.4738179013959168E-3,2.3200552053649357E-3,20,4.8825060670686184,2.003865755219842E-3,6.4961545750218184E-4,5.1272991141179409E-3,5.5076056054525029E-2,3.033371950521183E-3,9.6668966890205643E-4,2.7085005954353204E-3,8.102531774923054E-4,6.5521257234488085E-3,3.6466065055603077E-3,8.2480493295340965E-3,3.286744874266992E-3,2.3214219041367841E-2,2.5569932438561579E-2,0.21423490000000001,0.8933719050673733,1.0315963511826698E-2,1.2649336210930354E-2,3.2894198244573521E-2,8.35623592253186E-3,1.1294603898898671E-2,3.3788025422710928E-3,5.4553293780297048E-3,4.3559669087801416E-3,1.2164621957610216E-5,1.5206559719744491E-2,0.10662809493262668,0.8933719050673733,89.337190506737329,{"$f":"CHOOSE(MODE, I65*1000, 'PFM Efficiency'!BI65)","v":64.900000000000006},87.752210991841338,0.8775221099184134,257.78391170721505,null,2.7089339730825249E-3,null,23.214219041367841,8.248049329534096,2.3527962620635168,null,null,{"$f":"IF(MODE=1, BJ65, 'PFM Efficiency'!BH65)","v":89.337190506737329},{"$f":"IF(MODE=1, BR65, 'PFM Efficiency'!BN65)","v":23.214219041367841},{"$f":"IF(MODE=1, BS65, 'PFM Efficiency'!BO65)","v":8.248049329534096},{"$f":"IF(MODE=1, BT65, 'PFM Efficiency'!BP65)","v":2.3527962620635168}]
[null,null,null,null,null,{"$f":"BJ106","v":89.322244880175305},{"$f":"I106*1000","v":110},60,6.6000000000000003E-2,4.2748950303030303E-2,8.7508209200465384E-2,4.4749234527812647E-2,2.7768894138026061E-6,0.28379420144126027,257916.57204598023,3.8772227471359398E-6,0,2.9999999999999997E-4,6.7117095373076058E-2,1.3514113473955761E-3,1.0451194757195603E-3,2.3965308231151364E-3,1.2194445100888629E-2,2.2305673697788003E-7,2.2305673697788003E-7,3.04562059651751E-2,2.782741445379502E-6,2.782741445379502E-6,3.5754846019003035E-2,2.5568180276852345E-3,2.3212491484138221E-3,20,4.8208592527706422,2.0389419688765197E-3,6.4994976155587016E-4,5.2457097581176245E-3,5.5992373720889443E-2,3.1351459148997508E-3,9.6718714517242572E-4,2.7779844146412994E-3,8.2451096811633621E-4,6.7376412976573857E-3,3.6466065055603077E-3,8.2504173165810542E-3,3.2884362935862478E-3,2.352220466594231E-2,2.5921741287239803E-2,0.21786600000000003,0.89367085830333914,1.0487885954333922E-2,1.2860145872576114E-2,3.237343708479605E-2,8.3635951426866938E-3,1.139509476552463E-2,3.3820854312147982E-3,5.5433933644895321E-3,4.2870058609229302E-3,1.2329570660469913E-5,1.4958120889531272E-2,0.10632914169666077,0.89367085830333914,89.36708583033392,{"$f":"CHOOSE(MODE, I66*1000, 'PFM Efficiency'!BI66)","v":66},87.806983051998316,0.87806983051998311,257.91657204598022,null,2.6660477599243803E-3,null,23.522204665942311,8.2504173165810535,2.3965308231151363,null,null,{"$f":"IF(MODE=1, BJ66, 'PFM Efficiency'!BH66)","v":89.36708583033392},{"$f":"IF(MODE=1, BR66, 'PFM Efficiency'!BN66)","v":23.522204665942311},{"$f":"IF(MODE=1, BS66, 'PFM Efficiency'!BO66)","v":8.2504173165810535},{"$f":"IF(MODE=1, BT66, 'PFM Efficiency'!BP66)","v":2.3965308231151363}]
[null,null,null,null,null,null,null,61,6.7099999999999993E-2,4.2736296469696976E-2,8.8608281982055392E-2,4.5855561863100261E-2,2.7748958079390521E-6,0.28394019894577177,258049.25684256744,3.8752291412723858E-6,0,2.9999999999999997E-4,6.8199079842169316E-2,1.3953343473955754E-3,1.0456571358782123E-3,2.4409914832737877E-3,1.2194445100888629E-2,2.2305673697788003E-7,2.2305673697788003E-7,3.0945838335360538E-2,2.8729347308348099E-6,2.8729347308348099E-6,3.6340588520063367E-2,2.641276747969123E-3,2.322443311583107E-3,20,4.7607497411428206,2.0740534014407168E-3,6.5028412724326995E-4,5.3656142766531096E-3,5.6909651144099363E-2,3.2387083933430897E-3,9.6768471315962783E-4,2.8475385483948939E-3,8.3878682326807481E-4,6.9250337650060582E-3,3.6466065055603077E-3,8.2527857402001359E-3,3.2901280247427346E-3,2.3833561806602038E-2,2.627764928134364E-2,0.22149709999999997,0.89394541067013311,1.0659991607821193E-2,1.3071180185780743E-2,3.1868894156024168E-2,8.3707214211956194E-3,1.1492448510810788E-2,3.3852796772105621E-3,5.631463058453948E-3,4.2201924889888123E-3,1.249518555378397E-5,1.4717425872237103E-2,0.10605458932986694,0.89394541067013311,89.394541067013307,{"$f":"CHOOSE(MODE, I67*1000, 'PFM Efficiency'!BI67)","v":67.099999999999994},87.859261931365808,0.87859261931365806,258.04925684256744,null,2.6244971657902252E-3,null,23.833561806602038,8.2527857402001352,2.4409914832737876,null,null,{"$f":"IF(MODE=1, BJ67, 'PFM Efficiency'!BH67)","v":89.394541067013307},{"$f":"IF(MODE=1, BR67, 'PFM Efficiency'!BN67)","v":23.833561806602038},{"$f":"IF(MODE=1, BS67, 'PFM Efficiency'!BO67)","v":8.2527857402001352},{"$f":"IF(MODE=1, BT67, 'PFM Efficiency'!BP67)","v":2.4409914832737876}]
[null,null,null,null,null,null,null,62,6.8199999999999997E-2,4.2723642636363642E-2,8.9708354763645415E-2,4.6961889198387889E-2,2.7729038841653737E-6,0.28408622336948325,258181.9661037412,3.873237217498707E-6,0,2.9999999999999997E-4,6.9281631702194965E-2,1.4399833473955758E-3,1.0461948951713076E-3,2.4861782425668836E-3,1.2194445100888629E-2,2.2305673697788003E-7,2.2305673697788003E-7,3.1435964451723572E-2,2.9646595830300843E-6,2.9646595830300843E-6,3.6926929237642445E-2,2.7271962058437048E-3,2.3236376949336709E-3,20,4.7021207361777284,2.1092000626529942E-3,6.5061855458142782E-4,5.4870148230781266E-3,5.7827865379143577E-2,3.3440620143083523E-3,9.6818237288902949E-4,2.9171630161431328E-3,8.5308075268819691E-4,7.1143057831396829E-3,3.6466065055603077E-3,8.2551546005120886E-3,3.2918200678227006E-3,2.4148295274552596E-2,2.6637661233439486E-2,0.2251282,0.89419669091378196,1.08322716689338E-2,1.3282428355954541E-2,3.1379822999311219E-2,8.3776253552395874E-3,1.1586809275298504E-2,3.3883893094513442E-3,5.7195337776967739E-3,4.1554279442249983E-3,1.2661431952651778E-5,1.4484118250564332E-2,0.10580330908621809,0.89419669091378196,89.419669091378196,{"$f":"CHOOSE(MODE, I68*1000, 'PFM Efficiency'!BI68)","v":68.2},87.909156839141303,0.879091568391413,258.18196610374122,null,2.5842207175903356E-3,null,24.148295274552595,8.255154600512089,2.4861782425668837,null,null,{"$f":"IF(MODE=1, BJ68, 'PFM Efficiency'!BH68)","v":89.419669091378196},{"$f":"IF(MODE=1, BR68, 'PFM Efficiency'!BN68)","v":24.148295274552595},{"$f":"IF(MODE=1, BS68, 'PFM Efficiency'!BO68)","v":8.255154600512089},{"$f":"IF(MODE=1, BT68, 'PFM Efficiency'!BP68)","v":2.4861782425668837}]
[null,null,null,null,null,null,null,63,6.93E-2,4.2710988803030307E-2,9.0808427545235423E-2,4.8068216533675517E-2,2.7709136403535938E-6,0.28423227471984042,258314.69983626815,3.8712469736869271E-6,0,2.9999999999999997E-4,7.0364724765457493E-2,1.4853583473955761E-3,1.0467327536262663E-3,2.5320911010218421E-3,1.2194445100888629E-2,2.2305673697788003E-7,2.2305673697788003E-7,3.1926568528407702E-2,3.0579173339973394E-6,3.0579173339973394E-6,3.7513854412041227E-2,2.81457854569565E-3,2.3248322985264134E-3,20,4.6449182056211784,2.1443819622575001E-3,6.5095304358739575E-4,5.6099135515405461E-3,5.8746994878223747E-2,3.4512094072220471E-3,9.6868012438600559E-4,2.9868578373402092E-3,8.6739276612096921E-4,7.3054600106832257E-3,3.6466065055603077E-3,8.2575238976376943E-3,3.2935124229124188E-3,2.4466409882773883E-2,2.7001781957866702E-2,0.2287593,0.89442575957543502,1.1004717856797757E-2,1.3493880229168679E-2,3.0905522272899822E-2,8.384316901704221E-3,1.1678312487872003E-2,3.3914181136591413E-3,5.807601125335674E-3,4.0926193524576269E-3,1.2828277257271368E-5,1.4257863149644631E-2,0.10557424042456505,0.89442575957543502,89.442575957543497,{"$f":"CHOOSE(MODE, I69*1000, 'PFM Efficiency'!BI69)","v":69.3},87.956770566861337,0.87956770566861342,258.31469983626818,null,2.5451606577682208E-3,null,24.466409882773885,8.2575238976376948,2.5320911010218423,null,null,{"$f":"IF(MODE=1, BJ69, 'PFM Efficiency'!BH69)","v":89.442575957543497},{"$f":"IF(MODE=1, BR69, 'PFM Efficiency'!BN69)","v":24.466409882773885},{"$f":"IF(MODE=1, BS69, 'PFM Efficiency'!BO69)","v":8.2575238976376948},{"$f":"IF(MODE=1, BT69, 'PFM Efficiency'!BP69)","v":2.5320911010218423}]
[null,null,null,null,null,null,null,64,{"$f":"IF(PLOT_TYPE=1, H70/100*Iout_maxload_COT, min_I*EXP(H70*rr/100))","v":7.0400000000000004E-2},{"$f":"IF(I70<Icrit, (Vin-(Rdcr+RdsonTop)*Iripple/2-Vout)/L*OnTime, (Vin-(Rdcr+RdsonTop)*I70-Vout)/L*OnTime)","v":4.2698334969696973E-2},{"$f":"IF(I70<Icrit, (Vin-(Rdcr+RdsonTop)*Iripple/2-Vout)/L*OnTime, I70+((Vin-(Rdcr+RdsonTop)*J70-Vout)/L*OnTime)/2)","v":9.1908500326825432E-2},{"$f":"IF(I70<Icrit, 0, I70-((Vin-(Rdcr+RdsonTop)*K70-Vout)/L*OnTime)/2)","v":4.9174543868963153E-2},{"$f":"IF(I70<Icrit, L*J70/(Vout+J70/2*(RdsonBot+Rdcr)), L*J70/(Vout+I70*(RdsonBot+Rdcr)))","v":2.7689250743793212E-6},0.28437835300429187,{"$f":"IF(I70<Icrit,I70/((OnTime+M70)*J70/2),1/(OnTime+M70))","v":258447.45804691775},3.8692584077126545E-6,0,2.9999999999999997E-4,7.1448334419485157E-2,1.5314593473955761E-3,1.0472707112705189E-3,2.578730058666095E-3,1.2194445100888629E-2,2.2305673697788003E-7,2.2305673697788003E-7,3.2417635706408411E-2,3.1527093143802166E-6,3.1527093143802166E-6,3.8101351109262147E-2,2.9034259127025436E-3,2.3260271224222594E-3,20,{"$f":"IF(I70<Icrit, Csw*Vin/Iripple*1000000000, Csw*Vin/(I70+Iripple/2)*1000000000)","v":4.5890907148838158},{"$f":"IF(I70<Icrit, Vin*(I70+Iripple/2)*AG70/1000000000/2*O70, Vin*(I70-Iripple/2)*AF70/1000000000/2*O70+Vin*(I70+Iripple/2)*AG70/1000000000/2*O70)","v":2.1795991100019806E-3},{"$f":"IF(I70<Icrit, Csw*(Vin)^2*O70/2, Csw*Vin^2*O70/2)","v":6.512875942782327E-4},{"$f":"AD70+AH70+AI70","v":5.7343126169827566E-3},{"$f":"IF(I70<Icrit,Iripple*SQRT((OffTime)*O70/3), SQRT(OffTime*O70*(I70^2+Iripple^2/12)))","v":5.9667019386596645E-2},3.5601532024804997E-3,{"$f":"QgBot*O70*Vdd","v":9.6917796767594154E-4},{"$f":"IF(I70<Icrit, Vin*Idss*N70, QrrBot*(I70-Iripple/2)/0.1*O70*Vin+Vin*Idss*N70)","v":3.0566230314474953E-3},{"$f":"IF(I70<Icrit, dead1*O70*(I70+Iripple/2)*((I70+Iripple/2)*BDserR+VSD), dead1*O70*(I70+Iripple/2)*((I70+Iripple/2)*BDserR+VSD)+dead2*O70*(I70-Iripple/2)*((I70-Iripple/2)*BDserR+VSD))","v":8.8172287331425353E-4},7.4984991072422486E-3,{"$f":"Vin*R70+Vout*Ifb/0.7","v":3.6466065055603077E-3},{"$f":"(Vin-Vdd)*(O70*QgBot+O70*QgTop)+AQ70","v":8.2598936316977886E-3},{"$f":"AE70+AM70","v":3.2952050900982009E-3},2.4787910446020994E-2,{"$f":"SUM(V70,Y70,AB70,AT70)","v":2.7370016270738446E-2},{"$f":"Vout*I70","v":0.23239040000000002},0.89463361406761943,{"$f":"AD70/($AV70+$AU70)","v":1.1177322374154237E-2},1.3705526244498648E-2,{"$f":"Vin*O70*(QgBot+QgTop)/($AV70+$AU70)","v":3.0445332394266569E-2},8.3908054248352706E-3,1.1767085514144281E-2,3.3943696502059307E-3,{"$f":"T70/($AV70+$AU70)","v":5.8956609686034445E-3},{"$f":"U70/($AV70+$AU70)","v":4.0316793694193508E-3},{"$f":"(Y70+AB70)/($AV70+$AU70)","v":1.2995690797783688E-5},1.4038345633691884E-2,0.10536638593238051,0.89463361406761943,89.463361406761948,{"$f":"CHOOSE(MODE, I70*1000, 'PFM Efficiency'!BI70)","v":70.400000000000006},88.002199959420324,0.88002199959420324,{"$f":"O70/1000","v":258.44745804691775},null,2.5072626677631292E-3,null,24.787910446020994,8.2598936316977891,{"$f":"1000*V70","v":2.5787300586660948},null,null,{"$f":"IF(MODE=1, BJ70, 'PFM Efficiency'!BH70)","v":89.463361406761948},{"$f":"IF(MODE=1, BR70, 'PFM Efficiency'!BN70)","v":24.787910446020994},{"$f":"IF(MODE=1, BS70, 'PFM Efficiency'!BO70)","v":8.2598936316977891},{"$f":"IF(MODE=1, BT70, 'PFM Efficiency'!BP70)","v":2.5787300586660948}]
[null,null,null,null,null,null,null,65,7.1500000000000008E-2,4.2685681136363639E-2,9.3008573108415454E-2,5.0280871204250781E-2,2.7669381841217463E-6,0.28452445823028882,258580.24074246178,{"$f":"IF(1/O71-OnTime-M71>Tsleep, OnTime+M71+Tsleep, 1/O71)","v":3.8672715174550796E-6},{"$f":"IF(1/O71-OnTime-M71>Tsleep, 1/O71-OnTime-M71-Tsleep, 0)","v":0},{"$f":"P71*O71*Iq_active+Q71*O71*Iq_sleep","v":2.9999999999999997E-4},{"$f":"IF(I71<Icrit,Iripple*SQRT((OnTime+OffTime)*O71/3), SQRT(I71^2+Iripple^2/12))","v":7.2532437511216921E-2},{"$f":"S71^2*Rdcr","v":1.5782863473955762E-3},{"$f":"(O71/Fsw)*Fsw^2.5*(Iripple/2)^2.5*k_core","v":1.0478087681315058E-3},2.626095115527082E-3,{"$f":"Iripple/SQRT(12)*SQRT((OnTime+M71)*O71)","v":1.2194445100888629E-2},{"$f":"RCoutEsr*W71^2","v":2.2305673697788003E-7},2.2305673697788003E-7,{"$f":"SQRT($N71)*SQRT($I71^2*(1-N71)+(Iripple^2)/12)","v":3.2909151986605448E-2},{"$f":"RCinEsr*Z71^2","v":3.249036853432492E-6},3.249036853432492E-6,{"$f":"IF(I71<Icrit,Iripple*SQRT((OnTime)*O71/3), SQRT(OnTime*O71*(I71^2+Iripple^2/12)))","v":3.8689407160314902E-2},{"$f":"RdsonTop*AC71^2","v":2.9937404528332522E-3},{"$f":"QgTop*O71*Vdd","v":2.3272221666821562E-3},20,4.5345892727878203,2.214851515637775E-3,6.5162220667100369E-4,5.860214175142031E-3,6.0587919847526511E-2,{"$f":"RdsonBot*AK71^2","v":3.6708960314502971E-3},9.6967590278423162E-4,3.1264586179335432E-3,8.9607108401950643E-4,7.693425733403347E-3,3.6466065055603077E-3,8.2622638028132505E-3,3.2968980694663879E-3,2.5112801780825016E-2,2.774236898994251E-2,0.23602150000000005,0.89482119330377141,1.135007787191431E-2,1.3917357390561593E-2,2.9998632477676618E-2,{"$f":"AH71/($AV71+$AU71)","v":8.3970997397002402E-3},{"$f":"AN71/(AU71+AV71)","v":1.1853248247783157E-2},{"$f":"AO71/($AV71+$AU71)","v":3.3972472706399145E-3},5.9837094194874615E-3,3.9725257752094133E-3,1.3163643692771142E-5,1.382526924375436E-2,{"$f":"AU71/($AV71+$AU71)","v":0.10517880669622851},0.89482119330377141,89.482119330377145,{"$f":"CHOOSE(MODE, I71*1000, 'PFM Efficiency'!BI71)","v":71.500000000000014},88.045536344900114,{"$f":"BL71/100","v":0.8804553634490011},258.5802407424618,null,2.4704756158086621E-3,null,25.112801780825016,8.2622638028132513,2.626095115527082,null,null,{"$f":"IF(MODE=1, BJ71, 'PFM Efficiency'!BH71)","v":89.482119330377145},{"$f":"IF(MODE=1, BR71, 'PFM Efficiency'!BN71)","v":25.112801780825016},{"$f":"IF(MODE=1, BS71, 'PFM Efficiency'!BO71)","v":8.2622638028132513},{"$f":"IF(MODE=1, BT71, 'PFM Efficiency'!BP71)","v":2.626095115527082}]
[null,null,null,null,null,null,null,66,7.2599999999999998E-2,4.2673027303030305E-2,9.4108645890005449E-2,5.1387198539538395E-2,2.7649529674636319E-6,{"$f":"OnTime*O72","v":0.28467059040528531},258713.04792967459,3.8652863007969656E-6,0,2.9999999999999997E-4,7.3617012241183666E-2,1.6258393473955756E-3,1.0483469242366782E-3,{"$f":"T72+U72","v":2.6741862716322539E-3},1.2194445100888629E-2,2.2305673697788003E-7,{"$f":"X72","v":2.2305673697788003E-7},3.3401104168458026E-2,3.3469012790165525E-6,{"$f":"AA72","v":3.3469012790165525E-6},3.9278011105759174E-2,3.0855243128482821E-3,2.3284174313670716E-3,20,4.4813671881763435,2.2501391889198216E-3,6.5195688078277991E-4,5.9876203825508833E-3,6.1509678315438514E-2,3.783440526468727E-3,9.7017392973627967E-4,3.1963646162740831E-3,9.1043740799178234E-4,{"$f":"AL72+AN72+AO72","v":7.890242550734592E-3},3.6466065055603077E-3,8.2646344111049989E-3,3.2985913611033512E-3,{"$f":"AJ72+AP72+AR72+AS72","v":2.5441088705493824E-2},2.8118844935142072E-2,0.23965259999999999,0.89498938192624378,1.1522977416787809E-2,{"$f":"AL72/($AV72+$AU72)","v":1.4129365165823147E-2},2.956483753734666E-2,8.4032081518805573E-3,1.1936913650551077E-2,3.4000541327784332E-3,6.0717428170482344E-3,3.9150811039265305E-3,1.3332108720028477E-5,{"$f":"AQ72/($AV72+$AU72)","v":1.3618354662288827E-2},0.10501061807375632,{"$f":"AW72","v":0.89498938192624378},{"$f":"100*BI72","v":89.498938192624379},{"$f":"CHOOSE(MODE, I72*1000, 'PFM Efficiency'!BI72)","v":72.599999999999994},88.086865927368436,0.88086865927368441,258.71304792967459,null,{"$f":"AI72/($AV72+$AU72)","v":2.4347513266050193E-3},null,{"$f":"1000*AT72","v":25.441088705493822},{"$f":"1000*AR72","v":8.2646344111049981},2.6741862716322538,null,null,{"$f":"IF(MODE=1, BJ72, 'PFM Efficiency'!BH72)","v":89.498938192624379},{"$f":"IF(MODE=1, BR72, 'PFM Efficiency'!BN72)","v":25.441088705493822},{"$f":"IF(MODE=1, BS72, 'PFM Efficiency'!BO72)","v":8.2646344111049981},{"$f":"IF(MODE=1, BT72, 'PFM Efficiency'!BP72)","v":2.6741862716322538}]
[null,null,null,null,null,null,null,67,7.3700000000000002E-2,4.266037346969697E-2,9.5208718671595471E-2,5.2493525874826023E-2,2.7629694222913064E-6,0.28481674953673819,258845.87961533305,3.8633027556246401E-6,0,2.9999999999999997E-4,7.4702038066699269E-2,1.6741183473955759E-3,1.0488851796134964E-3,2.7230035270090725E-3,1.2194445100888629E-2,2.2305673697788003E-7,2.2305673697788003E-7,3.3893479793818231E-2,3.4463039176018945E-6,3.4463039176018945E-6,3.9867152144968665E-2,3.1787796403001593E-3,2.3296129165379974E-3,20,4.429379936503592,2.2854621396066564E-3,6.5229161663063928E-4,6.1165333965374552E-3,6.2432277876465804E-2,3.8977893208442414E-3,9.7067204855749885E-4,3.2663410459520346E-3,9.2482185498973519E-4,8.0889522217860114E-3,3.6466065055603077E-3,8.2670054566940029E-3,3.3002849650954963E-3,2.5772776040112966E-2,2.8499448927776616E-2,0.24328370000000002,{"$f":"AV73/(AV73+AU73)","v":0.89513901417283948},1.1696014461679833E-2,1.4341541542297883E-2,2.914339592972346E-2,8.4091384937702383E-3,1.2018188246174262E-2,3.4027932145105004E-3,6.1597577112496192E-3,3.8592723049662874E-3,1.3501060198382153E-5,1.3417338491906843E-2,0.10486098582716041,0.89513901417283948,89.513901417283947,{"$f":"CHOOSE(MODE, I73*1000, 'PFM Efficiency'!BI73)","v":73.7},88.126270146331038,0.88126270146331043,258.84587961533305,null,2.4000443706831084E-3,null,25.772776040112966,8.2670054566940028,2.7230035270090727,null,null,{"$f":"IF(MODE=1, BJ73, 'PFM Efficiency'!BH73)","v":89.513901417283947},{"$f":"IF(MODE=1, BR73, 'PFM Efficiency'!BN73)","v":25.772776040112966},{"$f":"IF(MODE=1, BS73, 'PFM Efficiency'!BO73)","v":8.2670054566940028},{"$f":"IF(MODE=1, BT73, 'PFM Efficiency'!BP73)","v":2.7230035270090727}]
[null,null,null,null,null,null,null,68,7.4800000000000005E-2,4.2647719636363636E-2,9.6308791453185494E-2,5.3599853210113652E-2,2.7609875464946561E-6,0.28496293563210684,258978.7358062164,3.8613208798279898E-6,0,2.9999999999999997E-4,7.5787495613185346E-2,1.7231233473955763E-3,1.0494235342894316E-3,2.7725468816850079E-3,1.2194445100888629E-2,2.2305673697788003E-7,2.2305673697788003E-7,3.4386267095375997E-2,3.5472460942636143E-6,3.5472460942636143E-6,4.0456820089657154E-2,3.2735085835337734E-3,2.3308086222559475E-3,20,4.378585035604357,2.3208203774604161E-3,6.5262641423166536E-4,6.2469553752258549E-3,6.3355702575671025E-2,4.0139450488568878E-3,9.7117025927331152E-4,3.3363879264575024E-3,9.3922443477561775E-4,8.2895574100900083E-3,3.6466065055603077E-3,8.2693769397012701E-3,3.301978881529259E-3,2.6107868606546392E-2,2.8884185791062642E-2,0.24691480000000002,0.89527087741742295,1.186918281858255E-2,1.455387893230955E-2,2.873378701136263E-2,8.4148981578148468E-3,1.2097172572581734E-2,3.4054673264358811E-3,6.247750848152012E-3,3.8050304328691204E-3,1.3670473879471648E-5,1.3221972137065332E-2,0.10472912258257711,0.89527087741742295,89.527087741742292,{"$f":"CHOOSE(MODE, I74*1000, 'PFM Efficiency'!BI74)","v":74.800000000000011},88.1638260061073,0.88163826006107304,258.97873580621638,null,2.3663118715239813E-3,null,26.107868606546393,8.2693769397012709,2.7725468816850078,null,null,{"$f":"IF(MODE=1, BJ74, 'PFM Efficiency'!BH74)","v":89.527087741742292},{"$f":"IF(MODE=1, BR74, 'PFM Efficiency'!BN74)","v":26.107868606546393},{"$f":"IF(MODE=1, BS74, 'PFM Efficiency'!BO74)","v":8.2693769397012709},{"$f":"IF(MODE=1, BT74, 'PFM Efficiency'!BP74)","v":2.7725468816850078}]
[null,null,null,null,null,null,null,69,7.5899999999999995E-2,4.2635065803030316E-2,9.7408864234775488E-2,5.4706180545401273E-2,2.7590073379671177E-6,0.28510914869885351,259111.61650910645,3.8593406713004514E-6,0,2.9999999999999997E-4,7.6873366592849213E-2,1.7728543473955753E-3,1.0499619882919644E-3,2.82281633568754E-3,1.2194445100888629E-2,2.2305673697788003E-7,2.2305673697788003E-7,3.487945494930067E-2,3.6497291326808847E-6,3.6497291326808847E-6,4.1047005321257969E-2,3.3697132916867601E-3,2.332004548581958E-3,20,4.3289419299144614,2.3562139122468391E-3,6.5296127360294821E-4,6.3788884775365477E-3,6.4279937350302116E-2,4.1319103457587653E-3,9.7166856190914917E-4,3.4065052772877832E-3,9.5364515711528642E-4,8.4920607801618336E-3,3.6466065055603077E-3,8.271748860247858E-3,3.3036731104911072E-3,2.6446371228437345E-2,2.9273060349994544E-2,0.25054589999999999,0.89538571541621015,1.2042476633720456E-2,1.4766370158014368E-2,2.8335518991498575E-2,8.4204941269873639E-3,1.2173961596551439E-2,3.4080791234535261E-3,6.3357191563363259E-3,3.7522903629499706E-3,1.3840326848526368E-5,1.3032020778717681E-2,0.10461428458378988,0.89538571541621015,89.53857154162101,{"$f":"CHOOSE(MODE, I75*1000, 'PFM Efficiency'!BI75)","v":75.899999999999991},88.199606378038467,0.88199606378038464,259.11161650910645,null,2.3335133287116475E-3,null,26.446371228437346,8.2717488602478575,2.82281633568754,null,null,{"$f":"IF(MODE=1, BJ75, 'PFM Efficiency'!BH75)","v":89.53857154162101},{"$f":"IF(MODE=1, BR75, 'PFM Efficiency'!BN75)","v":26.446371228437346},{"$f":"IF(MODE=1, BS75, 'PFM Efficiency'!BO75)","v":8.2717488602478575},{"$f":"IF(MODE=1, BT75, 'PFM Efficiency'!BP75)","v":2.82281633568754}]
[null,null,null,null,null,null,null,70,7.6999999999999999E-2,4.2622411969696974E-2,9.8508937016365511E-2,5.5812507880688901E-2,2.7570287946056672E-6,0.28525538874444356,259244.52173078779,3.8573621279390005E-6,0,2.9999999999999997E-4,7.7959633730018171E-2,1.8233113473955761E-3,1.0505005416485871E-3,2.8738118890441634E-3,1.2194445100888629E-2,2.2305673697788003E-7,2.2305673697788003E-7,3.5373032831690056E-2,3.7537543551354678E-6,3.7537543551354678E-6,4.1637698751791435E-2,3.467395914689868E-3,2.33320069557709E-3,20,4.2804118824789752,2.3916427537352728E-3,6.5329619476158526E-4,6.5123348631867259E-3,6.5204967968510497E-2,4.2516878477744796E-3,9.7216695649045423E-4,3.4766931179473744E-3,9.680840317782026E-4,8.6964649975000557E-3,3.6466065055603077E-3,8.2741212184548694E-3,3.3053676520675441E-3,2.6788288731209191E-2,2.9666077431345469E-2,0.25417699999999999,0.895484231287899,1.2215890364733466E-2,1.4979008423423174E-2,2.7948126960682603E-2,8.4259330027654147E-3,1.2248645094359575E-2,3.410631115399874E-3,6.4236597344410817E-3,3.7009905302435179E-3,1.4010597433278038E-5,1.2847262433033375E-2,0.10451576871210097,0.895484231287899,89.548423128789906,{"$f":"CHOOSE(MODE, I76*1000, 'PFM Efficiency'!BI76)","v":77},88.233680278117845,0.88233680278117843,259.24452173078777,null,2.3016104555856265E-3,null,26.788288731209192,8.2741212184548694,2.8738118890441635,null,null,{"$f":"IF(MODE=1, BJ76, 'PFM Efficiency'!BH76)","v":89.548423128789906},{"$f":"IF(MODE=1, BR76, 'PFM Efficiency'!BN76)","v":26.788288731209192},{"$f":"IF(MODE=1, BS76, 'PFM Efficiency'!BO76)","v":8.2741212184548694},{"$f":"IF(MODE=1, BT76, 'PFM Efficiency'!BP76)","v":2.8738118890441635}]
[null,null,null,null,null,null,null,71,7.8100000000000003E-2,4.260975813636364E-2,9.9609009797955533E-2,5.6918835215976529E-2,2.7550519143108221E-6,0.28540165577634435,259377.45147804695,3.8553852476441558E-6,0,2.9999999999999997E-4,7.9046280692506882E-2,1.8744943473955758E-3,1.0510391943868E-3,2.925533541782376E-3,1.2194445100888629E-2,2.2305673697788003E-7,2.2305673697788003E-7,3.5866990778477451E-2,3.8593230825101596E-6,3.8593230825101596E-6,4.2228891787893887E-2,3.5665586032673034E-3,2.3343970633024225E-3,20,4.2329578741438096,2.4271069116986602E-3,6.5363117772467829E-4,6.6472966926906414E-3,6.613078097302022E-2,4.3732801921015736E-3,9.7266544304267606E-4,3.5469514679479642E-3,9.8254106853743048E-4,8.9027727285869683E-3,3.6466065055603077E-3,8.2764940144434453E-3,3.3070625063450986E-3,2.7133625942066152E-2,3.0063241863668017E-2,0.25780810000000004,0.89556709025275072,1.2389418759705428E-2,1.5191787288686415E-2,2.7571171078874079E-2,8.4312210308454573E-3,1.2321308001641069E-2,3.4131256768266589E-3,6.511569839707459E-3,3.6510726895647638E-3,1.4181265120240415E-5,1.2667487086252897E-2,0.10443290974724938,0.89556709025275072,89.556709025275069,{"$f":"CHOOSE(MODE, I77*1000, 'PFM Efficiency'!BI77)","v":78.100000000000009},88.266113122354795,0.88266113122354795,259.37745147804696,null,2.2705670300249242E-3,null,27.133625942066153,8.2764940144434451,2.925533541782376,null,null,{"$f":"IF(MODE=1, BJ77, 'PFM Efficiency'!BH77)","v":89.556709025275069},{"$f":"IF(MODE=1, BR77, 'PFM Efficiency'!BN77)","v":27.133625942066153},{"$f":"IF(MODE=1, BS77, 'PFM Efficiency'!BO77)","v":8.2764940144434451},{"$f":"IF(MODE=1, BT77, 'PFM Efficiency'!BP77)","v":2.925533541782376}]
[null,null,null,null,null,null,null,72,7.9199999999999993E-2,4.2597104303030306E-2,0.10070908257954553,5.8025162551264151E-2,2.7530766949866235E-6,0.28554794980202669,259510.40575767343,3.8534100283199571E-6,0,2.9999999999999997E-4,8.013329202846084E-2,1.9264033473955756E-3,1.0515779465341149E-3,2.9779812939296907E-3,1.2194445100888629E-2,2.2305673697788003E-7,2.2305673697788003E-7,3.6361319348484022E-2,3.9664366342873156E-6,3.9664366342873156E-6,4.2820576297716503E-2,3.6672035089371207E-3,2.3355936518190609E-3,20,4.1865445093793481,2.4626063959135606E-3,6.5396622250933709E-4,6.7837761273600184E-3,6.7057363629291239E-2,4.4966900169109911E-3,9.7316402159127531E-4,3.6172803468084462E-3,9.9701627716964323E-4,9.1109866408890811E-3,3.6466065055603077E-3,8.2788672483347786E-3,3.308757673410336E-3,2.7482387689994215E-2,3.0464558477295171E-2,0.26143919999999998,0.89563492215306717,1.2563056837866522E-2,1.5404700646431561E-2,2.7204234908138312E-2,8.4363641248048783E-3,1.2392030735328149E-2,3.4155650559983901E-3,6.5994468774385959E-3,3.6024816947189415E-3,1.4352310477670889E-5,1.2492495898588946E-2,0.10436507784693277,0.89563492215306717,89.563492215306724,{"$f":"CHOOSE(MODE, I78*1000, 'PFM Efficiency'!BI78)","v":79.199999999999989},88.296966961937997,0.88296966961937995,259.51040575767342,null,2.240348757140802E-3,null,27.482387689994216,8.2788672483347785,2.9779812939296906,null,null,{"$f":"IF(MODE=1, BJ78, 'PFM Efficiency'!BH78)","v":89.563492215306724},{"$f":"IF(MODE=1, BR78, 'PFM Efficiency'!BN78)","v":27.482387689994216},{"$f":"IF(MODE=1, BS78, 'PFM Efficiency'!BO78)","v":8.2788672483347785},{"$f":"IF(MODE=1, BT78, 'PFM Efficiency'!BP78)","v":2.9779812939296906}]
[null,null,null,null,null,null,null,73,8.0299999999999996E-2,4.2584450469696972E-2,0.10180915536113554,5.9131489886551772E-2,2.7511031345406348E-6,0.28569427082896387,259643.38457645912,3.8514364678739681E-6,0,2.9999999999999997E-4,8.1220653108175542E-2,1.9790383473955757E-3,1.0521167981180539E-3,3.0311551455136296E-3,1.2194445100888629E-2,2.2305673697788003E-7,2.2305673697788003E-7,3.6856009589334292E-2,4.075096328547304E-6,4.075096328547304E-6,4.3412744580431553E-2,3.7693327840115786E-3,2.336790461188132E-3,20,4.1411379282326157,2.4981412161601381E-3,6.5430132913267699E-4,6.9217753293043943E-3,6.7984703877765992E-2,4.6219199613475306E-3,9.7366269216172174E-4,3.6876797740549223E-3,1.011509667455124E-3,9.3211094028575782E-3,3.6466065055603077E-3,8.2812409202501023E-3,3.3104531533498537E-3,2.7834578805761932E-2,3.0870032104341086E-2,0.26507029999999998,0.89568832377515517,1.2736799871815401E-2,1.5617742699964122E-2,2.6846923876663122E-2,8.4413678879003105E-3,1.2460889490232578E-2,3.4179513831811585E-3,6.6872883912890146E-3,3.5551652951011227E-3,1.4523715084599434E-5,1.2322100470829392E-2,0.10431167622484486,0.89568832377515517,89.56883237751552,{"$f":"CHOOSE(MODE, I79*1000, 'PFM Efficiency'!BI79)","v":80.3},88.326300700046502,0.88326300700046501,259.64338457645914,null,2.2109231427840221E-3,null,27.834578805761932,8.2812409202501023,3.0311551455136296,null,null,{"$f":"IF(MODE=1, BJ79, 'PFM Efficiency'!BH79)","v":89.56883237751552},{"$f":"IF(MODE=1, BR79, 'PFM Efficiency'!BN79)","v":27.834578805761932},{"$f":"IF(MODE=1, BS79, 'PFM Efficiency'!BO79)","v":8.2812409202501023},{"$f":"IF(MODE=1, BT79, 'PFM Efficiency'!BP79)","v":3.0311551455136296}]
[null,null,null,null,null,null,null,74,8.14E-2,4.2571796636363637E-2,0.10290922814272556,6.02378172218394E-2,2.7491312308839332E-6,0.2858406188646318,259776.38794119819,3.8494645642172664E-6,0,2.9999999999999997E-4,8.2308350070442959E-2,2.0323993473955761E-3,1.052655749166148E-3,3.0850550965617241E-3,1.2194445100888629E-2,2.2305673697788003E-7,2.2305673697788003E-7,3.735105300598187E-2,4.1853034819670023E-6,4.1853034819670023E-6,4.4005389338111198E-2,3.8729485815975013E-3,2.3379874914707839E-3,20,4.0967057239476814,2.5337113822221668E-3,6.5463649761181948E-4,7.0612964614314884E-3,6.8912790289831313E-2,4.7489726655302687E-3,9.7416145477949322E-4,3.7581497692206946E-3,1.0260212491777633E-3,9.533143683928727E-3,3.6466065055603077E-3,8.283615030310696E-3,3.3121489462502769E-3,2.8190204121921188E-2,3.1279667578701854E-2,0.26870140000000003,0.89572786099077584,1.2910643371123442E-2,1.5830907943163268E-2,2.6498863862184086E-2,8.4462376331714065E-3,1.2527956512571317E-2,3.4202866782870561E-3,6.7750920543089392E-3,3.5090739481083324E-3,1.469546146537505E-5,1.2156122167955141E-2,0.10427213900922409,0.89572786099077584,89.572786099077589,{"$f":"CHOOSE(MODE, I80*1000, 'PFM Efficiency'!BI80)","v":81.400000000000006},88.354170291966327,0.88354170291966327,259.77638794119821,null,2.1822593768857481E-3,null,28.190204121921187,8.2836150303106955,3.0850550965617241,null,null,{"$f":"IF(MODE=1, BJ80, 'PFM Efficiency'!BH80)","v":89.572786099077589},{"$f":"IF(MODE=1, BR80, 'PFM Efficiency'!BN80)","v":28.190204121921187},{"$f":"IF(MODE=1, BS80, 'PFM Efficiency'!BO80)","v":8.2836150303106955},{"$f":"IF(MODE=1, BT80, 'PFM Efficiency'!BP80)","v":3.0850550965617241}]
[null,null,null,null,null,null,null,75,8.2500000000000004E-2,4.2559142803030303E-2,0.10400930092431557,6.1344144557127028E-2,2.7471609819310984E-6,0.28598699391650939,259909.41585868769,3.8474943152644316E-6,0,2.9999999999999997E-4,8.3396369773021825E-2,2.0864863473955765E-3,1.0531947997059403E-3,3.1396811471015168E-3,1.2194445100888629E-2,2.2305673697788003E-7,2.2305673697788003E-7,3.7846441531616808E-2,4.2970594098182689E-6,4.2970594098182689E-6,4.4598503649767543E-2,3.978053055596658E-3,2.3391847427281891E-3,20,4.0532168658330967,2.5693169038870363E-3,6.5497172796389301E-4,7.2023416874475877E-3,6.9841612027165031E-2,4.8778507705530428E-3,9.7466030947007893E-4,3.8286903518462865E-3,1.0405510321250676E-3,9.7470921545243956E-3,3.6466065055603077E-3,8.2859895786378829E-3,3.313845052198268E-3,2.8549268472808136E-2,3.1693469736056447E-2,0.27233250000000003,0.8957540707342484,1.3084583067197347E-2,1.6044191141920551E-2,2.6159699884126759E-2,8.4509784020017006E-3,1.2593300352500171E-2,3.4225728579319503E-3,6.8628556606759039E-3,3.4641606459483807E-3,1.4867533029235423E-5,1.1994391494667871E-2,0.10424592926575148,0.8957540707342484,89.575407073424842,{"$f":"CHOOSE(MODE, I81*1000, 'PFM Efficiency'!BI81)","v":82.5},88.380628930000583,0.88380628930000582,259.90941585868768,null,2.1543282257516158E-3,null,28.549268472808137,8.2859895786378832,3.1396811471015167,null,null,{"$f":"IF(MODE=1, BJ81, 'PFM Efficiency'!BH81)","v":89.575407073424842},{"$f":"IF(MODE=1, BR81, 'PFM Efficiency'!BN81)","v":28.549268472808137},{"$f":"IF(MODE=1, BS81, 'PFM Efficiency'!BO81)","v":8.2859895786378832},{"$f":"IF(MODE=1, BT81, 'PFM Efficiency'!BP81)","v":3.1396811471015167}]
[null,null,null,null,null,null,null,76,8.3600000000000008E-2,4.2546488969696976E-2,0.10510937370590559,6.2450471892414663E-2,2.7451923856002128E-6,0.28613339599207815,260042.46833572685,3.8455257189335465E-6,0,2.9999999999999997E-4,8.4484699746868896E-2,2.1412993473955769E-3,1.0537339497649816E-3,3.1950332971605582E-3,1.2194445100888629E-2,2.2305673697788003E-7,2.2305673697788003E-7,3.8342167500748765E-2,4.4103654259664244E-6,4.4103654259664244E-6,4.5192080947363517E-2,4.0846483607061132E-3,2.3403822150215416E-3,20,4.010641626990564,2.6049577909457453E-3,6.5530702020603166E-4,7.3449131718578906E-3,7.0771158804168774E-2,5.0085569184848758E-3,9.7515925625897559E-4,3.899301541479429E-3,1.0550990260881545E-3,9.9629574860524584E-3,3.6466065055603077E-3,8.2883645653530312E-3,3.3155414712805172E-3,2.8911776694543895E-2,3.2111443413867395E-2,0.27596360000000003,0.89576746282973352,1.3258614899288691E-2,1.6257587316984939E-2,2.5829094894854632E-2,8.4555949812729556E-3,1.2656986097511036E-2,3.4248117419583917E-3,6.9505771180528872E-3,3.4203807555725873E-3,1.5039914014455803E-5,1.1836747518238482E-2,0.10423253717026648,0.89576746282973352,89.576746282973346,{"$f":"CHOOSE(MODE, I82*1000, 'PFM Efficiency'!BI82)","v":83.600000000000009},88.405727214510961,0.88405727214510965,260.04246833572682,null,2.1271019325174402E-3,null,28.911776694543896,8.2883645653530316,3.1950332971605584,null,null,{"$f":"IF(MODE=1, BJ82, 'PFM Efficiency'!BH82)","v":89.576746282973346},{"$f":"IF(MODE=1, BR82, 'PFM Efficiency'!BN82)","v":28.911776694543896},{"$f":"IF(MODE=1, BS82, 'PFM Efficiency'!BO82)","v":8.2883645653530316},{"$f":"IF(MODE=1, BT82, 'PFM Efficiency'!BP82)","v":3.1950332971605584}]
[null,null,null,null,null,null,null,77,8.4699999999999998E-2,4.2533835136363642E-2,0.1062094464874956,6.3556799227702271E-2,2.743225439812847E-6,0.28627982509882255,260175.54537911771,3.8435587731461803E-6,0,2.9999999999999997E-4,8.5573328153803779E-2,2.1968383473955759E-3,1.0542731993708355E-3,3.2511115467664113E-3,1.2194445100888629E-2,2.2305673697788003E-7,2.2305673697788003E-7,3.8838223624279952E-2,4.5252228428687322E-6,4.5252228428687322E-6,4.5786114993623409E-2,4.1927366524186129E-3,2.3415799084120594E-3,20,3.9689515165511224,2.6406340531929143E-3,6.5564237435537668E-4,7.4890130799669039E-3,7.1701420853219081E-2,5.1410937523704396E-3,9.7565829517169136E-4,3.9699833576750752E-3,1.0696652408617587E-3,1.0180742350907273E-2,3.6466065055603077E-3,8.2907399905775593E-3,3.3172382035837507E-3,2.9277733625035489E-2,3.2533593451381744E-2,0.27959470000000003,0.89576852168177667,1.3432735001550537E-2,1.6471091728091723E-2,2.550672866137044E-2,8.4600919192358605E-3,1.2719075588363649E-2,3.4270050594704376E-3,7.038254440518265E-3,3.3776918705867107E-3,1.5212589436677332E-5,1.1683037334544991E-2,0.10423147831822333,0.89576852168177667,89.576852168177666,{"$f":"CHOOSE(MODE, I83*1000, 'PFM Efficiency'!BI83)","v":84.7},88.429513312295569,0.88429513312295571,260.17554537911769,null,2.1005541250540363E-3,null,29.277733625035488,8.2907399905775598,3.2511115467664111,null,null,{"$f":"IF(MODE=1, BJ83, 'PFM Efficiency'!BH83)","v":89.576852168177666},{"$f":"IF(MODE=1, BR83, 'PFM Efficiency'!BN83)","v":29.277733625035488},{"$f":"IF(MODE=1, BS83, 'PFM Efficiency'!BO83)","v":8.2907399905775598},{"$f":"IF(MODE=1, BT83, 'PFM Efficiency'!BP83)","v":3.2511115467664111}]
[null,null,null,null,null,null,null,78,8.5800000000000001E-2,4.2521181303030307E-2,0.10730951926908561,6.4663126562989906E-2,2.7412601424940561E-6,0.28642628124422964,260308.64699566457,3.8415934758273893E-6,0,2.9999999999999997E-4,8.6662243747312392E-2,2.2531033473955756E-3,1.0548125485510739E-3,3.3079158959466496E-3,1.2194445100888629E-2,2.2305673697788003E-7,2.2305673697788003E-7,3.9334602966399596E-2,4.6416329715728764E-6,4.6416329715728764E-6,4.6380599861488084E-2,4.3023200870229367E-3,2.3427778229609814E-3,20,3.9281192160942129,2.676345700426774E-3,6.559777904290747E-4,7.6346435778787856E-3,7.2632388892494126E-2,5.275463916230504E-3,9.7615742623374216E-4,4.040735819995399E-3,1.0842496862442318E-3,1.0400449422470136E-2,3.6466065055603077E-3,8.2931158544329205E-3,3.3189352491947233E-3,2.9647144103976564E-2,3.2959924689631763E-2,0.28322580000000003,0.89575770784090503,1.3606939691050562E-2,1.6684699859264376E-2,2.5192296729671219E-2,8.4644735402076652E-3,1.277962761905772E-2,3.4291544544224201E-3,7.1258857420183151E-3,3.3360536741071371E-3,1.53855450410544E-5,1.1533115573575689E-2,0.10424229215909496,0.89575770784090503,89.575770784090508,{"$f":"CHOOSE(MODE, I84*1000, 'PFM Efficiency'!BI84)","v":85.8},88.452033103389056,0.88452033103389061,260.30864699566456,null,2.0746597306788065E-3,null,29.647144103976565,8.2931158544329211,3.3079158959466497,null,null,{"$f":"IF(MODE=1, BJ84, 'PFM Efficiency'!BH84)","v":89.575770784090508},{"$f":"IF(MODE=1, BR84, 'PFM Efficiency'!BN84)","v":29.647144103976565},{"$f":"IF(MODE=1, BS84, 'PFM Efficiency'!BO84)","v":8.2931158544329211},{"$f":"IF(MODE=1, BT84, 'PFM Efficiency'!BP84)","v":3.3079158959466497}]
[null,null,null,null,null,null,null,79,8.6900000000000005E-2,4.2508527469696973E-2,0.10840959205067563,6.5769453898277541E-2,2.7392964915723735E-6,0.28657276443578911,260441.77319217427,3.8396298249057072E-6,0,2.9999999999999997E-4,8.7751435836222011E-2,2.3100943473955767E-3,1.0553519973332791E-3,3.3654463447288559E-3,1.2194445100888629E-2,2.2305673697788003E-7,2.2305673697788003E-7,3.9831298923147615E-2,4.7595971217154211E-6,4.7595971217154211E-6,4.6975529915075302E-2,4.4134008216042695E-3,2.3439759587295683E-3,20,3.8881185199514974,2.7120927424491795E-3,6.5631326844427912E-4,7.7818068324977284E-3,7.3564054096157433E-2,5.4116700550623769E-3,9.7665664947065348E-4,4.1115589480098013E-3,1.0988523720375438E-3,1.0622081375109723E-2,3.6466065055603077E-3,8.2954921570406182E-3,3.3206326082002215E-3,3.0020012972848294E-2,3.3390441971435841E-2,0.28685690000000003,0.89573545945491695,1.3781225456659427E-2,1.6898407405189532E-2,2.4885509464716696E-2,8.4687439581967918E-3,1.2838698122204952E-2,3.4312614907996792E-3,7.213469230297696E-3,3.2954278116300805E-3,1.5558767257895692E-5,1.1386843941035934E-2,0.10426454054508301,0.89573545945491695,89.573545945491702,{"$f":"CHOOSE(MODE, I85*1000, 'PFM Efficiency'!BI85)","v":86.9},88.47333031726599,0.88473330317265986,260.44177319217425,null,2.0493948970943159E-3,null,30.020012972848292,8.2954921570406182,3.3654463447288561,null,null,{"$f":"IF(MODE=1, BJ85, 'PFM Efficiency'!BH85)","v":89.573545945491702},{"$f":"IF(MODE=1, BR85, 'PFM Efficiency'!BN85)","v":30.020012972848292},{"$f":"IF(MODE=1, BS85, 'PFM Efficiency'!BO85)","v":8.2954921570406182},{"$f":"IF(MODE=1, BT85, 'PFM Efficiency'!BP85)","v":3.3654463447288561}]
[null,null,null,null,null,null,null,80,8.8000000000000009E-2,4.2495873636363639E-2,0.10950966483226565,6.6875781233565162E-2,2.7373344849797979E-6,0.2867192746809939,260574.92397545642,3.8376678183131316E-6,0,2.9999999999999997E-4,8.8840894251006886E-2,2.3678113473955763E-3,1.0558915457450448E-3,3.4237028931406212E-3,1.2194445100888629E-2,2.2305673697788003E-7,2.2305673697788003E-7,4.032830520250965E-2,4.879116601520301E-6,4.879116601520301E-6,4.7570899792018742E-2,4.5259810140445772E-3,2.3451743157791079E-3,20,3.8489242791212668,2.7478751890656046E-3,6.5664880841815015E-4,7.9305050115283313E-3,7.4496408066700603E-2,5.5497148148403747E-3,9.7715596490796142E-4,4.1824527612949088E-3,1.1134733080472863E-3,1.0845640884182569E-2,3.6466065055603077E-3,8.2978688985222045E-3,3.3223302806870691E-3,3.0396345074920176E-2,3.3825150141399293E-2,0.29048800000000002,0.89570219361548653,1.3955588948740643E-2,1.7112210258574838E-2,2.4586091159647733E-2,8.4729070895445992E-3,1.2896340341029572E-2,3.4333276574255965E-3,7.3010032012677233E-3,3.2557777730711198E-3,1.5732243161505021E-5,1.1244090793020267E-2,0.1042978063845134,0.89570219361548653,89.570219361548652,{"$f":"CHOOSE(MODE, I86*1000, 'PFM Efficiency'!BI86)","v":88.000000000000014},88.493446659333912,0.88493446659333908,260.57492397545644,null,2.0247369190298133E-3,null,30.396345074920177,8.2978688985222053,3.423702893140621,null,null,{"$f":"IF(MODE=1, BJ86, 'PFM Efficiency'!BH86)","v":89.570219361548652},{"$f":"IF(MODE=1, BR86, 'PFM Efficiency'!BN86)","v":30.396345074920177},{"$f":"IF(MODE=1, BS86, 'PFM Efficiency'!BO86)","v":8.2978688985222053},{"$f":"IF(MODE=1, BT86, 'PFM Efficiency'!BP86)","v":3.423702893140621}]
[null,null,null,null,null,null,null,81,8.9100000000000013E-2,4.2483219803030312E-2,0.11060973761385566,6.7982108568852798E-2,2.7353741206517938E-6,0.28686581198733929,260708.09935232287,3.8357074539851275E-6,0,2.9999999999999997E-4,8.9930609312505988E-2,2.4262543473955764E-3,1.0564311938139738E-3,3.4826855412095504E-3,1.2194445100888629E-2,2.2305673697788003E-7,2.2305673697788003E-7,4.0825615805918099E-2,5.000192717797289E-6,5.000192717797289E-6,4.8166704387070956E-2,4.6400628230229609E-3,2.3463728941709059E-3,20,3.8105123485412409,2.7836930500851446E-3,6.5698441036785363E-4,8.0807402834759592E-3,7.542944280926546E-2,5.689600842516249E-3,9.7765537257121066E-4,4.253417279434582E-3,1.1281125040826726E-3,1.1071130626033503E-2,3.6466065055603077E-3,8.3002460789992714E-3,3.3240282667421168E-3,3.077614525525085E-2,3.4264054045915177E-2,0.29411910000000008,0.89565830760878717,1.4130026969575235E-2,1.7326104498407727E-2,2.429377920849626E-2,8.4769666646661267E-3,1.2952604989109339E-2,3.4353543724259909E-3,7.388486033776058E-3,3.2170687832124949E-3,1.5905960431955785E-5,1.1104730741000287E-2,0.10434169239121294,0.89565830760878717,89.565830760878711,{"$f":"CHOOSE(MODE, I87*1000, 'PFM Efficiency'!BI87)","v":89.100000000000009},88.512421928518876,0.88512421928518881,260.70809935232285,null,2.0006641701114567E-3,null,30.776145255250849,8.3002460789992707,3.4826855412095505,null,null,{"$f":"IF(MODE=1, BJ87, 'PFM Efficiency'!BH87)","v":89.565830760878711},{"$f":"IF(MODE=1, BR87, 'PFM Efficiency'!BN87)","v":30.776145255250849},{"$f":"IF(MODE=1, BS87, 'PFM Efficiency'!BO87)","v":8.3002460789992707},{"$f":"IF(MODE=1, BT87, 'PFM Efficiency'!BP87)","v":3.4826855412095505}]
[null,null,null,null,null,"Eff (%)","Iout (mA)",82,9.0199999999999989E-2,4.2470565969696977E-2,0.11170981039544564,6.9088435904140405E-2,2.7334153965272783E-6,0.28701237636232346,260841.29932958807,3.833748729860612E-6,0,2.9999999999999997E-4,9.1020571802854458E-2,2.4854233473955755E-3,1.0569709415676795E-3,3.5423942889632552E-3,1.2194445100888629E-2,2.2305673697788003E-7,2.2305673697788003E-7,4.132322501104535E-2,5.1228267759404519E-6,5.1228267759404519E-6,4.8762938836866825E-2,4.7556484080160293E-3,2.3475716939662925E-3,20,3.7728595374874359,2.8195463353205179E-3,6.5732007431056191E-4,8.2325148176471095E-3,7.6363150707783489E-2,5.8313307860196539E-3,9.7815487248595519E-4,4.3244525220199129E-3,1.1427699699565396E-3,1.1298553277996108E-2,3.6466065055603077E-3,8.3026236985934542E-3,3.3257265664522477E-3,3.1159418360688917E-2,3.470715853316509E-2,0.29775019999999996,0.89560418007802112,1.4304536464460955E-2,1.7540086379041406E-2,2.4008323337169145E-2,8.4809262389638086E-3,1.3007540398864467E-2,3.4373429873790565E-3,7.4759161847447464E-3,3.1792676998672565E-3,1.6079907319557919E-5,1.0968644284636979E-2,0.10439581992197895,0.89560418007802112,89.560418007802113,{"$f":"CHOOSE(MODE, I88*1000, 'PFM Efficiency'!BI88)","v":90.199999999999989},88.530294126670512,0.88530294126670517,260.84129932958808,null,1.9771560395315762E-3,null,31.159418360688917,8.3026236985934538,3.5423942889632554,null,null,{"$f":"IF(MODE=1, BJ88, 'PFM Efficiency'!BH88)","v":89.560418007802113},{"$f":"IF(MODE=1, BR88, 'PFM Efficiency'!BN88)","v":31.159418360688917},{"$f":"IF(MODE=1, BS88, 'PFM Efficiency'!BO88)","v":8.3026236985934538},{"$f":"IF(MODE=1, BT88, 'PFM Efficiency'!BP88)","v":3.5423942889632554}]
[null,null,null,null,null,{"$f":"BL51","v":87.439521195857154},{"$f":"I56*1000","v":55},83,9.1299999999999992E-2,4.2457912136363636E-2,0.11280988317703566,7.0194763239428026E-2,2.7314583105486167E-6,0.28715896781344741,260974.52391406908,3.8317916438819499E-6,0,2.9999999999999997E-4,9.2110772938449409E-2,2.545318347395575E-3,1.0575107890337854E-3,3.6028291364293601E-3,1.2194445100888629E-2,2.2305673697788003E-7,2.2305673697788003E-7,4.182112735578615E-2,5.2470200799266545E-6,5.2470200799266545E-6,4.9359598505753104E-2,4.8727399292982877E-3,2.3487707152266219E-3,20,3.7359435628850077,2.855435054588074E-3,6.5765580026345407E-4,8.3858307841498166E-3,7.7297524502784778E-2,5.9749072942586129E-3,9.7865446467775897E-4,4.3955585086492398E-3,1.1574457154853513E-3,1.1527911518393205E-2,3.6466065055603077E-3,8.3050017574264404E-3,3.3274251799043806E-3,3.1546169239873842E-2,3.5154468453120105E-2,0.30138129999999996,0.89554017210501302,1.4479114513431186E-2,1.7754152320040614E-2,2.3729484887972468E-2,8.4847892029813778E-3,1.3061192659708466E-2,3.4392947911763656E-3,7.5632921846467615E-3,3.142342919133418E-3,1.6254072611798841E-5,1.0835717470157368E-2,0.10445982789498696,0.89554017210501302,89.5540172105013,{"$f":"CHOOSE(MODE, I89*1000, 'PFM Efficiency'!BI89)","v":91.3},88.547099560447151,0.88547099560447151,260.9745239140691,null,1.9541928731271444E-3,null,31.546169239873841,8.3050017574264405,3.6028291364293601,null,null,{"$f":"IF(MODE=1, BJ89, 'PFM Efficiency'!BH89)","v":89.5540172105013},{"$f":"IF(MODE=1, BR89, 'PFM Efficiency'!BN89)","v":31.546169239873841},{"$f":"IF(MODE=1, BS89, 'PFM Efficiency'!BO89)","v":8.3050017574264405},{"$f":"IF(MODE=1, BT89, 'PFM Efficiency'!BP89)","v":3.6028291364293601}]
[null,null,null,null,null,{"$f":"BL81","v":88.380628930000583},{"$f":"I81*1000","v":82.5},84,9.2399999999999996E-2,4.2445258303030309E-2,0.11390995595862569,7.1301090574715648E-2,2.7295028606616158E-6,0.28730558634821463,261107.77311258519,3.8298361939949491E-6,0,2.9999999999999997E-4,9.3201204344786154E-2,2.6059393473955757E-3,1.0580507362399245E-3,3.6639900836355002E-3,1.2194445100888629E-2,2.2305673697788003E-7,2.2305673697788003E-7,4.2319317623334393E-2,5.3727739323139836E-6,5.3727739323139836E-6,4.9956678972598166E-2,4.9913395479424631E-3,2.3499699580132667E-3,20,3.6997430053335423,2.8913592177077807E-3,6.5799158824371461E-4,8.5406903538939576E-3,7.8232557270741979E-2,6.1203330171199239E-3,9.7915414917219444E-4,4.4667352589281319E-3,1.1721397504891966E-3,1.1759208026537252E-2,3.6466065055603077E-3,8.3073802556199519E-3,3.3291241071854612E-3,3.1936402743236628E-2,3.5605988657541422E-2,0.30501240000000002,0.89546662821736323,1.4653758323543618E-2,1.79682988967261E-2,2.3457036153377409E-2,8.488558791858886E-3,1.3113605746690906E-2,3.4412110136181422E-3,7.6506126332938334E-3,3.1062642871688625E-3,1.6428445602559425E-5,1.0705841572242933E-2,0.10453337178263669,0.89546662821736323,89.546662821736319,{"$f":"CHOOSE(MODE, I90*1000, 'PFM Efficiency'!BI90)","v":92.399999999999991},88.562872936280286,0.8856287293628029,261.10777311258516,null,1.9317559185134333E-3,null,31.936402743236627,8.3073802556199521,3.6639900836355004,null,null,{"$f":"IF(MODE=1, BJ90, 'PFM Efficiency'!BH90)","v":89.546662821736319},{"$f":"IF(MODE=1, BR90, 'PFM Efficiency'!BN90)","v":31.936402743236627},{"$f":"IF(MODE=1, BS90, 'PFM Efficiency'!BO90)","v":8.3073802556199521},{"$f":"IF(MODE=1, BT90, 'PFM Efficiency'!BP90)","v":3.6639900836355004}]
[null,null,null,null,null,{"$f":"BL106","v":88.698181382326453},{"$f":"I106*1000","v":110},85,9.35E-2,4.2432604469696975E-2,0.11501002874021569,7.2407417910003283E-2,2.7275490448155133E-6,0.28745223197413172,261241.04693195852,3.827882378148847E-6,0,2.9999999999999997E-4,9.4291858033016748E-2,2.667286347395575E-3,1.0585907832137414E-3,3.7258771306093166E-3,1.2194445100888629E-2,2.2305673697788003E-7,2.2305673697788003E-7,4.2817790828269212E-2,5.5000896342402452E-6,5.5000896342402452E-6,5.0554176018504732E-2,5.1114494258199181E-3,2.3511694223876268E-3,20,3.6642372676644559,2.9273188345032421E-3,6.583274382685355E-4,8.6970956985916968E-3,7.9168242404828337E-2,6.2676106054696595E-3,9.7965392599484442E-4,4.5379827924694133E-3,1.1868520847917953E-3,1.1992445482730868E-2,3.6466065055603077E-3,8.3097591932957664E-3,3.3308233483824714E-3,3.2330123723000807E-2,3.6061723999981345E-2,0.30864350000000002,0.89538387732707148,1.4828465221693867E-2,1.8182522831362711E-2,2.319075975511866E-2,8.4922380941444622E-3,1.316482164038703E-2,3.4430928287639165E-3,7.7378761959108547E-3,3.0710030179693436E-3,1.6603016063424774E-5,1.0578912797563244E-2,0.10461612267292848,0.89538387732707148,89.53838773270715,{"$f":"CHOOSE(MODE, I91*1000, 'PFM Efficiency'!BI91)","v":93.5},88.577647448964157,0.88577647448964159,261.24104693195852,null,1.9098272739509485E-3,null,32.33012372300081,8.3097591932957666,3.7258771306093168,null,null,{"$f":"IF(MODE=1, BJ91, 'PFM Efficiency'!BH91)","v":89.53838773270715},{"$f":"IF(MODE=1, BR91, 'PFM Efficiency'!BN91)","v":32.33012372300081},{"$f":"IF(MODE=1, BS91, 'PFM Efficiency'!BO91)","v":8.3097591932957666},{"$f":"IF(MODE=1, BT91, 'PFM Efficiency'!BP91)","v":3.7258771306093168}]
[null,null,null,null,null,null,null,86,9.4600000000000004E-2,4.241995063636364E-2,0.11611010152180572,7.3513745245290918E-2,2.725596860962973E-6,0.28759890469870814,261374.34537901374,3.8259301942963067E-6,0,2.9999999999999997E-4,9.5382726378095251E-2,2.7293593473955761E-3,1.0591309299828899E-3,3.7884902773784659E-3,1.2194445100888629E-2,2.2305673697788003E-7,2.2305673697788003E-7,4.3316542203571694E-2,5.6289684854214232E-6,5.6289684854214232E-6,5.11520856153539E-2,5.2330717256009905E-3,2.3523691084111234E-3,20,3.6294065358619991,2.9633139148016905E-3,6.5866335035511458E-4,8.855048990757796E-3,8.0104573596977563E-2,6.4167427111535948E-3,9.8015379517130152E-4,4.6093011288931528E-3,1.2015827282204977E-3,1.2227626568267244E-2,3.6466065055603077E-3,8.3121385705757032E-3,3.3325229035824251E-3,3.2727337033183174E-2,3.6521679335784041E-2,0.31227460000000001,0.89529223360601029,1.5003232647912349E-2,1.8396820984940141E-2,2.2930448065067065E-2,8.4958300600131292E-3,1.3214880438721098E-2,3.4449413580577254E-3,7.8250815994743983E-3,3.0365316166783736E-3,1.6777774216925046E-5,1.0454832008255862E-2,0.10470776639398967,0.89529223360601029,89.529223360601023,{"$f":"CHOOSE(MODE, I92*1000, 'PFM Efficiency'!BI92)","v":94.600000000000009},88.591454864366881,0.88591454864366881,261.37434537901373,null,1.8883898406525815E-3,null,32.727337033183176,8.3121385705757032,3.7884902773784659,null,null,{"$f":"IF(MODE=1, BJ92, 'PFM Efficiency'!BH92)","v":89.529223360601023},{"$f":"IF(MODE=1, BR92, 'PFM Efficiency'!BN92)","v":32.727337033183176},{"$f":"IF(MODE=1, BS92, 'PFM Efficiency'!BO92)","v":8.3121385705757032},{"$f":"IF(MODE=1, BT92, 'PFM Efficiency'!BP92)","v":3.7884902773784659}]
[null,null,null,null,null,null,null,87,9.5699999999999993E-2,4.2407296803030306E-2,0.11721017430339573,7.4620072580578525E-2,2.7236463070600796E-6,0.28774560452945575,261507.66846057776,3.8239796403934129E-6,0,2.9999999999999997E-4,9.6473802098386199E-2,2.7921583473955757E-3,1.0596711765750349E-3,3.8518295239706106E-3,1.2194445100888629E-2,2.2305673697788003E-7,2.2305673697788003E-7,4.3815567188500985E-2,5.759411784150133E-6,5.759411784150133E-6,5.1750403915116316E-2,5.3562086107553719E-3,2.3535690161452E-3,20,3.5952317421921052,2.9993444684339897E-3,6.5899932452065596E-4,9.0145524037100171E-3,8.104154482114502E-2,6.5677319869976575E-3,9.8065375672716656E-4,4.6806902878266674E-3,1.2163316906062852E-3,1.2464753965430609E-2,3.6466065055603077E-3,8.3145183875816212E-3,3.3342227728723663E-3,3.3128047529594612E-2,3.6985859522086349E-2,0.31590570000000001,0.89519199730315024,1.5178058149107259E-2,1.8611190349500564E-2,2.2675902664633873E-2,8.4993375089388347E-3,1.3263820461349737E-2,3.4467576732453951E-3,7.9122276292947821E-3,3.0028238079996173E-3,1.6952710711556677E-5,1.0333504463804209E-2,0.10480800269684978,0.89519199730315024,89.519199730315023,{"$f":"CHOOSE(MODE, I93*1000, 'PFM Efficiency'!BI93)","v":95.699999999999989},88.604325596716222,0.88604325596716227,261.50766846057775,null,1.8674272782639658E-3,null,33.12804752959461,8.3145183875816215,3.8518295239706104,null,null,{"$f":"IF(MODE=1, BJ93, 'PFM Efficiency'!BH93)","v":89.519199730315023},{"$f":"IF(MODE=1, BR93, 'PFM Efficiency'!BN93)","v":33.12804752959461},{"$f":"IF(MODE=1, BS93, 'PFM Efficiency'!BO93)","v":8.3145183875816215},{"$f":"IF(MODE=1, BT93, 'PFM Efficiency'!BP93)","v":3.8518295239706104}]
[null,null,null,null,null,null,null,88,9.6799999999999997E-2,4.2394642969696972E-2,0.11831024708498573,7.572639991586616E-2,2.7216973810663272E-6,0.28789233147388943,261641.01618348018,3.8220307143996609E-6,0,2.9999999999999997E-4,9.7565078236624123E-2,2.8556833473955758E-3,1.0602115230178501E-3,3.9158948704134259E-3,1.2194445100888629E-2,2.2305673697788003E-7,2.2305673697788003E-7,4.4314861417264616E-2,5.8914208272941037E-6,5.8914208272941037E-6,5.2349127239871382E-2,5.4808622455524876E-3,2.3547691456513213E-3,20,3.5616945303948806,3.0354105052346385E-3,6.5933536078237006E-4,9.175608111569495E-3,8.197915031767776E-2,6.7205810868084057E-3,9.8115381068805078E-4,4.7521502889045376E-3,1.2310989817837744E-3,1.2703830357496717E-2,3.6466065055603077E-3,8.3168986444354283E-3,3.3359229563393721E-3,3.3532260069841009E-2,3.7454269417818709E-2,0.31953680000000001,0.89508345550800705,1.5352939373219285E-2,1.8825628040971262E-2,2.2426933839748531E-2,8.5027631368616245E-3,1.3311678347176437E-2,3.4485427990998529E-3,7.9993131258230803E-3,2.9698544693200417E-3,1.7127816598447347E-5,1.0214839579900966E-2,0.10491654449199292,0.89508345550800705,89.508345550800712,{"$f":"CHOOSE(MODE, I94*1000, 'PFM Efficiency'!BI94)","v":96.8},88.616288780873063,0.88616288780873065,261.64101618348019,null,1.846923963273408E-3,null,33.532260069841008,8.3168986444354278,3.915894870413426,null,null,{"$f":"IF(MODE=1, BJ94, 'PFM Efficiency'!BH94)","v":89.508345550800712},{"$f":"IF(MODE=1, BR94, 'PFM Efficiency'!BN94)","v":33.532260069841008},{"$f":"IF(MODE=1, BS94, 'PFM Efficiency'!BO94)","v":8.3168986444354278},{"$f":"IF(MODE=1, BT94, 'PFM Efficiency'!BP94)","v":3.915894870413426}]
[null,null,null,null,null,null,null,89,9.7900000000000001E-2,4.2381989136363638E-2,0.11941031986657576,7.6832727251153782E-2,2.7197500809446162E-6,0.28803908553952667,261774.38855455312,3.8200834142779499E-6,0,2.9999999999999997E-4,9.8656548142120729E-2,2.9199343473955757E-3,1.0607519693390211E-3,3.9806863167345967E-3,1.2194445100888629E-2,2.2305673697788003E-7,2.2305673697788003E-7,4.4814420708423085E-2,6.0249969102946192E-6,6.0249969102946192E-6,5.2948252072480356E-2,5.6070347950618405E-3,2.3559694969909782E-3,20,3.5287772228072605,3.0715120350417705E-3,6.5967145915747389E-4,9.3382182892610861E-3,8.2917384578708508E-2,6.8752926653734472E-3,9.816539570795741E-4,4.8236811517685923E-3,1.2458846115912172E-3,1.2944858428733257E-2,3.6466065055603077E-3,8.3192793412590806E-3,3.3376234540705525E-3,3.3939979513323976E-2,3.7926913883705844E-2,0.32316790000000001,0.89496688286439752,1.5527874063756678E-2,1.9040131292463545E-2,2.2183360108708514E-2,8.5061095228883051E-3,1.3358489145518735E-2,3.4502977159690438E-3,8.0863369816658991E-3,2.9375995681861183E-3,1.7303083309539714E-5,1.0098750703007142E-2,0.10503311713560246,0.89496688286439752,89.496688286439749,{"$f":"CHOOSE(MODE, I95*1000, 'PFM Efficiency'!BI95)","v":97.9},88.627372339969995,0.8862737233996999,261.77438855455313,null,1.8268649501289366E-3,null,33.939979513323976,8.3192793412590813,3.9806863167345967,null,null,{"$f":"IF(MODE=1, BJ95, 'PFM Efficiency'!BH95)","v":89.496688286439749},{"$f":"IF(MODE=1, BR95, 'PFM Efficiency'!BN95)","v":33.939979513323976},{"$f":"IF(MODE=1, BS95, 'PFM Efficiency'!BO95)","v":8.3192793412590813},{"$f":"IF(MODE=1, BT95, 'PFM Efficiency'!BP95)","v":3.9806863167345967}]
[null,null,null,null,null,null,null,90,9.9000000000000005E-2,4.2369335303030303E-2,0.12051039264816577,7.7939054586441417E-2,2.7178044046612438E-6,0.28818586673388791,261907.7855806312,3.8181377379945775E-6,0,2.9999999999999997E-4,9.9748205454126271E-2,2.9849113473955761E-3,1.0612925155662422E-3,4.0462038629618183E-3,1.2194445100888629E-2,2.2305673697788003E-7,2.2305673697788003E-7,4.5314241054974426E-2,6.1601413271649887E-6,6.1601413271649887E-6,5.3547775047864545E-2,5.7347284251534096E-3,2.3571700702256808E-3,20,3.4964627892920901,3.1076490676971574E-3,6.6000761966319066E-4,9.5023851125137591E-3,8.3856242334497177E-2,7.0318693784619168E-3,9.8215419592736705E-4,4.8952828960679342E-3,1.2606885898705025E-3,1.3187840864400353E-2,3.6466065055603077E-3,8.3216604781745744E-3,3.3393242661530478E-3,3.4351210721241733E-2,3.8403797782267692E-2,0.32679900000000001,0.89484254223823367,1.5702860054682355E-2,1.9254697448003358E-2,2.1945007780431767E-2,8.5093791355616167E-3,1.3404286401405063E-2,3.4520233621597811E-3,8.1732981387923724E-3,2.9060361038060283E-3,1.747850263717997E-5,9.9851548994276829E-3,0.10515745776176628,0.89484254223823367,89.48425422382337,{"$f":"CHOOSE(MODE, I96*1000, 'PFM Efficiency'!BI96)","v":99},88.637603048760539,0.88637603048760538,261.90778558063118,null,1.807235934859087E-3,null,34.351210721241735,8.3216604781745751,4.0462038629618187,null,null,{"$f":"IF(MODE=1, BJ96, 'PFM Efficiency'!BH96)","v":89.48425422382337},{"$f":"IF(MODE=1, BR96, 'PFM Efficiency'!BN96)","v":34.351210721241735},{"$f":"IF(MODE=1, BS96, 'PFM Efficiency'!BO96)","v":8.3216604781745751},{"$f":"IF(MODE=1, BT96, 'PFM Efficiency'!BP96)","v":4.0462038629618187}]
[null,null,null,null,null,null,null,91,0.10010000000000001,4.2356681469696976E-2,0.12161046542975579,7.9045381921729052E-2,2.7158603501858967E-6,0.28833267506449628,262041.20726855157,3.8161936835192304E-6,0,2.9999999999999997E-4,0.10084004408625864,3.050614347395576E-3,1.0618331617272189E-3,4.1124475091227951E-3,1.2194445100888629E-2,2.2305673697788003E-7,2.2305673697788003E-7,4.5814318615068378E-2,6.2968553704890026E-6,6.2968553704890026E-6,5.4147692944842965E-2,5.8639453024979934E-3,2.358370865416964E-3,20,3.4647348178588775,3.1438216130462095E-3,6.6034384231674996E-4,9.6681107578609534E-3,8.479571854064874E-2,7.1903138828249202E-3,9.8265452725706842E-4,4.9669555414589188E-3,1.2755109264671592E-3,1.3432780350750998E-2,3.6466065055603077E-3,8.3240420553039526E-3,3.3410253926740323E-3,3.4765958556589933E-2,3.8884925977820194E-2,0.33043010000000006,0.89471068534277431,1.587789526562659E-2,1.9469323956661178E-2,2.1711710540852025E-2,8.5125743387300373E-3,1.3449102235437388E-2,3.453720636169734E-3,8.2601955859190664E-3,2.875142052278666E-3,1.7654066715006733E-5,9.873972757824671E-3,0.10528931465722569,0.89471068534277431,89.471068534277435,{"$f":"CHOOSE(MODE, I97*1000, 'PFM Efficiency'!BI97)","v":100.10000000000001},88.647006592994998,0.88647006592995004,262.0412072685516,null,1.788023221011343E-3,null,34.765958556589936,8.324042055303952,4.112447509122795,null,null,{"$f":"IF(MODE=1, BJ97, 'PFM Efficiency'!BH97)","v":89.471068534277435},{"$f":"IF(MODE=1, BR97, 'PFM Efficiency'!BN97)","v":34.765958556589936},{"$f":"IF(MODE=1, BS97, 'PFM Efficiency'!BO97)","v":8.324042055303952},{"$f":"IF(MODE=1, BT97, 'PFM Efficiency'!BP97)","v":4.112447509122795}]
[null,null,null,null,null,null,null,92,0.1012,4.2344027636363642E-2,0.12271053821134578,8.0151709257016673E-2,2.7139179154916453E-6,0.28847951053887783,262174.65362515399,3.8142512488249794E-6,0,2.9999999999999997E-4,0.10193205821192165,3.1170433473955753E-3,1.0623739078496673E-3,4.1794172552452429E-3,1.2194445100888629E-2,2.2305673697788003E-7,2.2305673697788003E-7,4.6314649703304428E-2,6.4351403314193909E-6,6.4351403314193909E-6,5.4748002678488679E-2,5.9946875945676072E-3,2.359571882626386E-3,20,3.4335774868697553,3.1800296809379775E-3,6.6068012713538802E-4,9.8353974026409718E-3,8.5735808366142974E-2,7.3506288361959915E-3,9.831549510943274E-4,5.0386991076051789E-3,1.2903516312303559E-3,1.3679679575031528E-2,3.6466065055603077E-3,8.3264240727693069E-3,3.3427268337207134E-3,3.5184227884162526E-2,3.9370303336476169E-2,0.3340612,0.8945715533244607,1.6052977697401612E-2,1.9684008367051968E-2,2.1483309065387264E-2,8.5156973970475329E-3,1.3492967418619517E-2,3.4553903987787002E-3,8.3470283560597158E-3,2.8448963152753275E-3,1.7829768000044655E-5,9.7651282041798567E-3,0.10542844667553934,0.8945715533244607,89.457155332446064,{"$f":"CHOOSE(MODE, I98*1000, 'PFM Efficiency'!BI98)","v":101.2},88.65560762511214,0.88655607625112143,262.17465362515401,null,1.7692136877377744E-3,null,35.184227884162524,8.3264240727693064,4.1794172552452427,null,null,{"$f":"IF(MODE=1, BJ98, 'PFM Efficiency'!BH98)","v":89.457155332446064},{"$f":"IF(MODE=1, BR98, 'PFM Efficiency'!BN98)","v":35.184227884162524},{"$f":"IF(MODE=1, BS98, 'PFM Efficiency'!BO98)","v":8.3264240727693064},{"$f":"IF(MODE=1, BT98, 'PFM Efficiency'!BP98)","v":4.1794172552452427}]
[null,null,null,null,null,null,null,93,0.1023,4.2331373803030314E-2,0.1238106109929358,8.1258036592304295E-2,2.7119770985549372E-6,0.28862637316456113,262308.12465728063,3.8123104318882713E-6,0,2.9999999999999997E-4,0.10302424225064015,3.1841983473955759E-3,1.0629147539613125E-3,4.2471131013568884E-3,1.2194445100888629E-2,2.2305673697788003E-7,2.2305673697788003E-7,4.6815230782571472E-2,6.574997499676283E-6,6.574997499676283E-6,5.5348701292965444E-2,6.1269574696358291E-3,2.3607731219155255E-3,20,3.4029755387317233,3.2162732812251564E-3,6.6101647413634721E-4,1.0004247224997332E-2,8.6676507182116835E-2,7.5128168972915512E-3,9.8365546746480249E-4,5.1105136141776182E-3,1.3052107140129044E-3,1.3928541225482073E-2,3.6466065055603077E-3,8.3288065306927669E-3,3.3444285893803279E-3,3.5606023570552502E-2,3.9859934726146046E-2,0.3376923,0.89442537731220662,1.6228105427795864E-2,1.9898748322178257E-2,2.1259650655583658E-2,8.5187504811302453E-3,1.35359114425173E-2,3.4570334750094289E-3,8.4337955242278044E-3,2.8152786719228074E-3,1.800559925591506E-5,9.6585483283004245E-3,0.1055746226877933,0.89442537731220662,89.442537731220668,{"$f":"CHOOSE(MODE, I99*1000, 'PFM Efficiency'!BI99)","v":102.3},88.663429816513059,0.88663429816513062,262.30812465728064,null,1.7507947598715955E-3,null,35.606023570552502,8.3288065306927663,4.2471131013568888,null,null,{"$f":"IF(MODE=1, BJ99, 'PFM Efficiency'!BH99)","v":89.442537731220668},{"$f":"IF(MODE=1, BR99, 'PFM Efficiency'!BN99)","v":35.606023570552502},{"$f":"IF(MODE=1, BS99, 'PFM Efficiency'!BO99)","v":8.3288065306927663},{"$f":"IF(MODE=1, BT99, 'PFM Efficiency'!BP99)","v":4.2471131013568888}]
[null,null,null,null,null,null,null,94,0.10339999999999999,4.231871996969698E-2,0.1249106837745258,8.2364363927591902E-2,2.7100378973555883E-6,0.2887732629490779,262441.62037177628,3.810371230688922E-6,0,2.9999999999999997E-4,0.10411659085524547,3.2520793473955751E-3,1.0634557000898908E-3,4.3155350474854658E-3,1.2194445100888629E-2,2.2305673697788003E-7,2.2305673697788003E-7,4.7316058456390343E-2,6.7164281635456438E-6,6.7164281635456438E-6,5.5949785954810351E-2,6.2607570967781875E-3,2.3619745833459867E-3,20,3.3729142549832893,3.2525524237640826E-3,6.6135288333687623E-4,1.0174662403879146E-2,8.761781055134478E-2,7.6768807258113447E-3,9.841560763941611E-4,5.1823990808544116E-3,1.3200881846712599E-3,1.4179367991337016E-2,3.6466065055603077E-3,8.3311894291965144E-3,3.346130659740148E-3,3.6031350484152826E-2,4.0353825016538815E-2,0.3413234,0.89427237893277434,1.6403276607628071E-2,2.0113541554591552E-2,2.1040588898193671E-2,8.5217356723947656E-3,1.357796258508704E-2,3.4586506559673761E-3,8.5204962052809318E-3,2.7862697336573047E-3,1.8181553537083128E-5,9.5541632210365528E-3,0.10572762106722559,0.89427237893277434,89.427237893277436,{"$f":"CHOOSE(MODE, I100*1000, 'PFM Efficiency'!BI100)","v":103.39999999999999},88.670495906660364,0.88670495906660363,262.44162037177631,null,1.7327543798512433E-3,null,36.031350484152824,8.331189429196515,4.3155350474854659,null,null,{"$f":"IF(MODE=1, BJ100, 'PFM Efficiency'!BH100)","v":89.427237893277436},{"$f":"IF(MODE=1, BR100, 'PFM Efficiency'!BN100)","v":36.031350484152824},{"$f":"IF(MODE=1, BS100, 'PFM Efficiency'!BO100)","v":8.331189429196515},{"$f":"IF(MODE=1, BT100, 'PFM Efficiency'!BP100)","v":4.3155350474854659}]
[null,null,null,null,null,null,null,95,0.1045,4.2306066136363639E-2,0.12601075655611582,8.3470691262879537E-2,2.7081003098767771E-6,0.28892017989996216,262575.14077548817,3.8084336432101103E-6,0,2.9999999999999997E-4,0.10520909889985079,3.3206863473955756E-3,1.0639967462631487E-3,4.3846830936587243E-3,1.2194445100888629E-2,2.2305673697788003E-7,2.2305673697788003E-7,4.7817129461723805E-2,6.8594336098777643E-6,6.8594336098777643E-6,5.6551253946630221E-2,6.3960886458725207E-3,2.3631762669793937E-3,20,3.3433794326900226,3.2888671184147381E-3,6.6168935475423014E-4,1.0346645119041488E-2,8.8559714218367488E-2,7.8428229824389212E-3,9.846567779080806E-4,5.2543555273210163E-3,1.3349840530655244E-3,1.4432162562825462E-2,3.6466065055603077E-3,8.3335727684027711E-3,3.3478330448874745E-3,3.6460213495157198E-2,4.0851979079162777E-2,0.3449545,0.89411277079465412,1.6578489457042326E-2,2.0328385881849511E-2,2.0825983345088651E-2,8.5246549676007456E-3,1.3619147972481009E-2,3.4602427005680277E-3,8.6071295518969533E-3,2.7578509018373163E-3,1.835762417406786E-5,9.4519058214469973E-3,0.10588722920534585,0.89411277079465412,89.411277079465407,{"$f":"CHOOSE(MODE, I101*1000, 'PFM Efficiency'!BI101)","v":104.5},88.676827749227442,0.88676827749227438,262.57514077548819,null,1.7150809813602419E-3,null,36.460213495157198,8.3335727684027709,4.3846830936587242,null,null,{"$f":"IF(MODE=1, BJ101, 'PFM Efficiency'!BH101)","v":89.411277079465407},{"$f":"IF(MODE=1, BR101, 'PFM Efficiency'!BN101)","v":36.460213495157198},{"$f":"IF(MODE=1, BS101, 'PFM Efficiency'!BO101)","v":8.3335727684027709},{"$f":"IF(MODE=1, BT101, 'PFM Efficiency'!BP101)","v":4.3846830936587242}]
[null,null,null,null,null,null,null,96,{"$f":"IF(PLOT_TYPE=1, H102/100*Iout_maxload_COT, min_I*EXP(H102*rr/100))","v":0.1056},{"$f":"IF(I102<Icrit, (Vin-(Rdcr+RdsonTop)*Iripple/2-Vout)/L*OnTime, (Vin-(Rdcr+RdsonTop)*I102-Vout)/L*OnTime)","v":4.2293412303030305E-2},{"$f":"IF(I102<Icrit, (Vin-(Rdcr+RdsonTop)*Iripple/2-Vout)/L*OnTime, I102+((Vin-(Rdcr+RdsonTop)*J102-Vout)/L*OnTime)/2)","v":0.12711082933770584},{"$f":"IF(I102<Icrit, 0, I102-((Vin-(Rdcr+RdsonTop)*K102-Vout)/L*OnTime)/2)","v":8.4577018598167159E-2},2.7061643341050372E-6,0.28906712402475115,262708.68587526609,3.8064976674383705E-6,0,2.9999999999999997E-4,0.1063017614685598,3.3900193473955756E-3,1.0645378925088422E-3,4.454557239904418E-3,1.2194445100888629E-2,2.2305673697788003E-7,2.2305673697788003E-7,4.8318440662220824E-2,7.0040151240856643E-6,7.0040151240856643E-6,5.7153102661182585E-2,6.532954287599352E-3,2.364378172877395E-3,20,3.3143573620694973,{"$f":"IF(I102<Icrit, Vin*(I102+Iripple/2)*AG102/1000000000/2*O102, Vin*(I102-Iripple/2)*AF102/1000000000/2*O102+Vin*(I102+Iripple/2)*AG102/1000000000/2*O102)","v":3.3252173750407564E-3},6.6202588840567054E-4,{"$f":"AD102+AH102+AI102","v":1.0520197551045779E-2},8.9502214100222466E-2,8.010646328842061E-3,9.851575720322477E-4,5.3263829732701721E-3,1.3498983290594457E-3,1.4686927631171678E-2,3.6466065055603077E-3,{"$f":"(Vin-Vdd)*(O102*QgBot+O102*QgTop)+AQ102","v":8.3359565484338073E-3},3.3495357449096425E-3,3.6892617475560906E-2,{"$f":"SUM(V102,Y102,AB102,AT102)","v":4.1354401787326384E-2},0.3485856,0.89394675694267167,1.6753742262027357E-2,2.0543279202247824E-2,2.0615699212535674E-2,8.5275102831187163E-3,1.3659493637113912E-2,3.461810337159719E-3,8.6936947526724782E-3,2.7300043279207915E-3,1.8533804759546563E-5,9.351711773210614E-3,0.10605324305732838,0.89394675694267167,89.394675694267164,{"$f":"CHOOSE(MODE, I102*1000, 'PFM Efficiency'!BI102)","v":105.6},88.682446355503387,0.88682446355503386,262.7086858752661,null,1.6977634645617612E-3,null,36.892617475560904,8.3359565484338081,4.4545572399044184,null,null,{"$f":"IF(MODE=1, BJ102, 'PFM Efficiency'!BH102)","v":89.394675694267164},{"$f":"IF(MODE=1, BR102, 'PFM Efficiency'!BN102)","v":36.892617475560904},{"$f":"IF(MODE=1, BS102, 'PFM Efficiency'!BO102)","v":8.3359565484338081},{"$f":"IF(MODE=1, BT102, 'PFM Efficiency'!BP102)","v":4.4545572399044184}]
[null,null,null,null,null,null,null,97,0.1067,4.228075846969697E-2,0.12821090211929587,8.5683345933454794E-2,2.7042299680302507E-6,0.28921409533098463,262842.25567796238,{"$f":"IF(1/O103-OnTime-M103>Tsleep, OnTime+M103+Tsleep, 1/O103)","v":3.8045633013635848E-6},0,{"$f":"P103*O103*Iq_active+Q103*O103*Iq_sleep","v":2.9999999999999997E-4},0.10739457384485766,3.4600783473955755E-3,1.0650791388547383E-3,4.5251574862503136E-3,1.2194445100888629E-2,2.2305673697788003E-7,2.2305673697788003E-7,4.8819989041865422E-2,7.1501739901435802E-6,7.1501739901435802E-6,5.7755329595814212E-2,{"$f":"RdsonTop*AC103^2","v":6.6713561934422664E-3},2.3655803011016613E-3,20,3.2858348052715551,3.3616032035094154E-3,6.6236248430846518E-4,1.0695321881260145E-2,9.0445306277734797E-2,{"$f":"RdsonBot*AK103^2","v":8.180353427673254E-3},9.8565845879235886E-4,5.3984814384018991E-3,1.3648310225204221E-3,1.4943665888595576E-2,3.6466065055603077E-3,8.3383407694119366E-3,3.3512387598940204E-3,3.7328567299161682E-2,4.1861098016139117E-2,0.35221670000000005,0.89377453328536738,1.6929033371144257E-2,2.0758219490807837E-2,2.0409607098485293E-2,8.5303034589422448E-3,1.3699024572251615E-2,3.4633542650492743E-3,8.78019103033526E-3,2.7027128760273847E-3,1.8710089135291743E-5,9.2535192896377374E-3,0.10622546671463264,0.89377453328536738,89.377453328536731,{"$f":"CHOOSE(MODE, I103*1000, 'PFM Efficiency'!BI103)","v":106.7},88.687371935243902,0.88687371935243897,262.84225567796238,null,1.6807911728164361E-3,null,37.328567299161683,8.3383407694119374,4.5251574862503139,null,null,{"$f":"IF(MODE=1, BJ103, 'PFM Efficiency'!BH103)","v":89.377453328536731},{"$f":"IF(MODE=1, BR103, 'PFM Efficiency'!BN103)","v":37.328567299161683},{"$f":"IF(MODE=1, BS103, 'PFM Efficiency'!BO103)","v":8.3383407694119374},{"$f":"IF(MODE=1, BT103, 'PFM Efficiency'!BP103)","v":4.5251574862503139}]
[null,null,null,null,null,null,null,98,0.10779999999999999,4.2268104636363636E-2,0.12931097490088586,8.6789673268742415E-2,2.7022972096456406E-6,0.28936109382620545,262975.85019043204,{"$f":"IF(1/O104-OnTime-M104>Tsleep, OnTime+M104+Tsleep, 1/O104)","v":3.8026305429789743E-6},0,{"$f":"P104*O104*Iq_active+Q104*O104*Iq_sleep","v":2.9999999999999997E-4},0.10848753150163656,3.5308633473955758E-3,1.0656204853286143E-3,4.5964838327241901E-3,1.2194445100888629E-2,2.2305673697788003E-7,2.2305673697788003E-7,4.9321771699001968E-2,7.297911490585415E-6,7.297911490585415E-6,5.8357932347232251E-2,{"$f":"RdsonTop*AC104^2","v":6.8112965356882729E-3},2.3667826517138886E-3,20,3.2577989762448984,3.3980246136916452E-3,6.6269914247988877E-4,1.0872020291859807E-2,9.1388986987328738E-2,{"$f":"RdsonBot*AK104^2","v":8.3519469425701407E-3},9.8615943821412028E-4,5.470650942423513E-3,1.3797821433195029E-3,1.5202380028313157E-2,3.6466065055603077E-3,8.3407254314595194E-3,3.3529420899280089E-3,3.776806784156049E-2,4.2372072642512242E-2,0.35584779999999999,0.8935962879970325,1.7104361192448254E-2,2.0973204795502017E-2,2.0207582716624452E-2,8.5330362624622229E-3,1.3737764783362772E-2,3.464875155937166E-3,8.8666176400625865E-3,2.6759600877207784E-3,1.8886471379882585E-5,9.1572690266864699E-3,0.10640371200296743,0.8935962879970325,89.359628799703245,{"$f":"CHOOSE(MODE, I104*1000, 'PFM Efficiency'!BI104)","v":107.8},88.69162393514253,0.88691623935142527,262.97585019043203,null,1.6641538707808372E-3,null,37.768067841560487,8.3407254314595196,4.5964838327241901,null,null,{"$f":"IF(MODE=1, BJ104, 'PFM Efficiency'!BH104)","v":89.359628799703245},{"$f":"IF(MODE=1, BR104, 'PFM Efficiency'!BN104)","v":37.768067841560487},{"$f":"IF(MODE=1, BS104, 'PFM Efficiency'!BO104)","v":8.3407254314595196},{"$f":"IF(MODE=1, BT104, 'PFM Efficiency'!BP104)","v":4.5964838327241901}]
[null,null,null,null,null,null,null,99,0.1089,4.2255450803030309E-2,0.13041104768247588,8.789600060403005E-2,2.7003660569477648E-6,0.28950811951795885,263109.4694195324,{"$f":"IF(1/O105-OnTime-M105>Tsleep, OnTime+M105+Tsleep, 1/O105)","v":3.800699390281098E-6},0,{"$f":"P105*O105*Iq_active+Q105*O105*Iq_sleep","v":2.9999999999999997E-4},0.10958063009181224,3.6023743473955756E-3,1.0661619319582575E-3,4.6685362793538326E-3,1.2194445100888629E-2,2.2305673697788003E-7,2.2305673697788003E-7,4.982378584071117E-2,7.447228906503152E-6,7.447228906503152E-6,5.8960908606585184E-2,{"$f":"RdsonTop*AC105^2","v":6.9527774874281814E-3},2.3679852247757917E-3,20,3.2302375216256656,3.4344816154620308E-3,6.6303586293722165E-4,1.1050294965827434E-2,9.2333252613324424E-2,{"$f":"RdsonBot*AK105^2","v":8.5254295381559809E-3},9.8666051032324665E-4,5.5428915050496179E-3,1.3947517013313889E-3,1.5463072744536987E-2,3.6466065055603077E-3,8.3431105346989613E-3,3.3546457350990383E-3,3.8211123980162423E-2,4.2887330545159738E-2,0.35947889999999999,0.89341220189613735,1.7279724190591171E-2,2.1188233233701073E-2,2.0009506646045602E-2,8.5357103920194917E-3,1.3775737336455001E-2,3.4663736552683895E-3,8.9529738678983447E-3,2.6497301488589914E-3,1.90629457971378E-5,9.0629039634354432E-3,0.10658779810386265,0.89341220189613735,89.341220189613736,{"$f":"CHOOSE(MODE, I105*1000, 'PFM Efficiency'!BI105)","v":108.89999999999999},88.695221075083666,0.88695221075083663,263.10946941953239,null,1.6478417237919909E-3,null,38.211123980162427,8.3431105346989618,4.668536279353833,null,null,{"$f":"IF(MODE=1, BJ105, 'PFM Efficiency'!BH105)","v":89.341220189613736},{"$f":"IF(MODE=1, BR105, 'PFM Efficiency'!BN105)","v":38.211123980162427},{"$f":"IF(MODE=1, BS105, 'PFM Efficiency'!BO105)","v":8.3431105346989618},{"$f":"IF(MODE=1, BT105, 'PFM Efficiency'!BP105)","v":4.668536279353833}]
[null,null,null,null,null,null,null,100,0.11,4.2242796969696975E-2,0.13151112046406588,8.9002327939317671E-2,2.6984365079365083E-6,0.28965517241379307,263243.11337212333,{"$f":"IF(1/O106-OnTime-M106>Tsleep, OnTime+M106+Tsleep, 1/O106)","v":3.798769841269842E-6},0,{"$f":"P106*O106*Iq_active+Q106*O106*Iq_sleep","v":2.9999999999999997E-4},0.11067386543949112,3.6746113473955762E-3,1.0667034787714652E-3,4.741314826167041E-3,1.2194445100888629E-2,2.2305673697788003E-7,2.2305673697788003E-7,5.032602877751343E-2,7.5981275175453299E-6,7.5981275175453299E-6,5.9564256154832379E-2,{"$f":"RdsonTop*AC106^2","v":7.0958012225569743E-3},2.3691880203491099E-3,20,3.2031385025879842,3.4709742186988073E-3,6.6337264569775076E-4,1.1230148086953533E-2,9.3278099680686552E-2,{"$f":"RdsonBot*AK106^2","v":8.7008038800400964E-3},9.8716167514546261E-4,5.6152031460021123E-3,1.4097397064344354E-3,1.5725746732476644E-2,3.6466065055603077E-3,8.3454960792527094E-3,3.3563496954945723E-3,3.865774059417746E-2,4.3406876604599021E-2,0.36311000000000004,0.89322244880175306,1.745512088409246E-2,2.1403302988827651E-2,1.9815264095473083E-2,8.5383274802508877E-3,1.3812964403600324E-2,3.4678503835048075E-3,9.0392590292621665E-3,2.6240078583723851E-3,1.9239506905221374E-5,8.9703692895072591E-3,0.10677755119824696,0.89322244880175306,89.322244880175305,{"$f":"CHOOSE(MODE, I106*1000, 'PFM Efficiency'!BI106)","v":110},88.698181382326453,0.88698181382326458,263.24311337212333,null,1.6318452784507245E-3,null,38.657740594177461,8.34549607925271,4.7413148261670406,null,null,{"$f":"IF(MODE=1, BJ106, 'PFM Efficiency'!BH106)","v":89.322244880175305},{"$f":"IF(MODE=1, BR106, 'PFM Efficiency'!BN106)","v":38.657740594177461},{"$f":"IF(MODE=1, BS106, 'PFM Efficiency'!BO106)","v":8.34549607925271},{"$f":"IF(MODE=1, BT106, 'PFM Efficiency'!BP106)","v":4.7413148261670406}]
[]
[null,null,null,null,null,null,null,1.0000000000000001E-5,"A","min_I",null,null,null,null,null,null,null,null,null,null,null,null,null,null,null,null,null,null,null,4.9516878778202269E-3,3.7188236700537959E-3,20,18.943591787921068,4.1453367485397245E-3,7.1640215182307235E-3,null,9.1940431932401354E-2,8.4530430239165271E-3,9.3281530185295868E-4,9.1178757202630047E-3,1.2140752334887425E-3,1.8784993977668273E-2,null,null,null,null,null,null,"1mA",3.6409104085968987E-3,6.5692245841190103E-3,5.4394694205683519E-2,4.5907837520612008E-3,0,7.3751579484765363E-4,7.2151246180390156E-3,1.4929120352630757E-2,5.5024434421027814E-6,8.2551506228875166E-2]
[null,null,null,null,null,null,null,{"$f":"Iout_maxload_COT","v":0.11},"A","max_I",null,null,null,null,null,null,null,null,null,null,null,null,null,null,null,null,null,null,null,null,null,null,null,null,null,null,null,null,null,null,null,null,null,null,null,null,null,null,"100mA",8.1000709018000279E-3,1.4614802049391215E-2,2.4831534664325892E-2,9.9057039827182662E-3,1.1631608311305648E-2,1.6465542803473395E-3,1.6051760250250457E-2,6.8152413568584669E-3,1.7517781122613987E-5,1.2837829865088564E-2]
[null,null,null,null,null,null,null,{"$f":"LOG(max_I/min_I,EXP(1))","v":9.3056505517805075},null,"rr"]

{"sheet":"Standard Value Calculator","index":8,"n_rows":159,"n_cols":11,"rows_kept":159,"cut":false,"hidden":true,"merged":[]}
[]
["Capacitors","Css","Cout","Cin","Cb"]
["Inputs",{"$f":"Css","v":4.8599999999999998E-8},{"$f":"Cout","v":1E-4},{"$f":"Cin","v":4.6999999999999999E-6},{"$f":"Cb","v":0},null,null,"Resistors","inputs","Standard Result"]
["Standard Result",{"$f":"SUM(B6:B158)/1000000000000","v":4.6999999999999997E-8},{"$f":"SUM(C6:C158)/1000000000000","v":1E-4},{"$f":"SUM(D6:D158)/1000000000000","v":4.6999999999999999E-6},{"$f":"IF(E3=\"OPEN\",\"OPEN\",SUM(E6:E158)/1000000000000)","v":0},null,null,"Rt",{"$f":"Rt","v":82525},{"$f":"IF(I4>(INT(0.5+100*POWER(10,IF(96*(LOG(I4)-INT(LOG(I4)))-ROUND(96*(LOG(I4)-INT(LOG(I4))),0)<0,ROUND(96*(LOG(I4)-INT(LOG(I4))),0)-1,ROUND(96*(LOG(I4)-INT(LOG(I4))),0))/96))*POWER(10,INT(LOG(I4))-2)+INT(0.5+100*POWER(10,(IF(96*(LOG(I4)-INT(LOG(I4)))-ROUND(96*(LOG(I4)-INT(LOG(I4))),0)<0,ROUND(96*(LOG(I4)-INT(LOG(I4))),0)-1,ROUND(96*(LOG(I4)-INT(LOG(I4))),0))+1)/96))*POWER(10,INT(LOG(I4))-2))/2,INT(0.5+100*POWER(10,(IF(96*(LOG(I4)-INT(LOG(I4)))-ROUND(96*(LOG(I4)-INT(LOG(I4))),0)<0,ROUND(96*(LOG(I4)-INT(LOG(I4))),0)-1,ROUND(96*(LOG(I4)-INT(LOG(I4))),0))+1)/96))*POWER(10,INT(LOG(I4))-2),INT(0.5+100*POWER(10,IF(96*(LOG(I4)-INT(LOG(I4)))-ROUND(96*(LOG(I4)-INT(LOG(I4))),0)<0,ROUND(96*(LOG(I4)-INT(LOG(I4))),0)-1,ROUND(96*(LOG(I4)-INT(LOG(I4))),0))/96))*POWER(10,INT(LOG(I4))-2))","v":82500},"Ω"]
["(pF)"]
[0.47,{"$f":"IF(IF((B$3*10^12-$A7)*(B$3*10^12-$A6)*-1<0,0,1)*IF(ABS(B$3*10^12-$A7)>(B$3*10^12-$A6),$A6,$A7)=B7,0,IF((B$3*10^12-$A7)*(B$3*10^12-$A6)*-1<0,0,1)*IF(ABS(B$3*10^12-$A7)>(B$3*10^12-$A6),$A6,$A7))","v":0},0,0,0,null,null,"Rshunt",{"$f":"Rshunt","v":{"$error":"#NAME?"}},{"$error":"#NAME?"},"Ω"]
[0.56000000000000005,{"$f":"IF(IF((B$3*10^12-$A8)*(B$3*10^12-$A7)*-1<0,0,1)*IF(ABS(B$3*10^12-$A8)>(B$3*10^12-$A7),$A7,$A8)=B8,0,IF((B$3*10^12-$A8)*(B$3*10^12-$A7)*-1<0,0,1)*IF(ABS(B$3*10^12-$A8)>(B$3*10^12-$A7),$A7,$A8))","v":0},{"$f":"IF(IF((C$3*10^12-$A8)*(C$3*10^12-$A7)*-1<0,0,1)*IF(ABS(C$3*10^12-$A8)>(C$3*10^12-$A7),$A7,$A8)=C8,0,IF((C$3*10^12-$A8)*(C$3*10^12-$A7)*-1<0,0,1)*IF(ABS(C$3*10^12-$A8)>(C$3*10^12-$A7),$A7,$A8))","v":0},{"$f":"IF(IF((D$3*10^12-$A8)*(D$3*10^12-$A7)*-1<0,0,1)*IF(ABS(D$3*10^12-$A8)>(D$3*10^12-$A7),$A7,$A8)=D8,0,IF((D$3*10^12-$A8)*(D$3*10^12-$A7)*-1<0,0,1)*IF(ABS(D$3*10^12-$A8)>(D$3*10^12-$A7),$A7,$A8))","v":0},{"$f":"IF(IF((E$3*10^12-$A8)*(E$3*10^12-$A7)*-1<0,0,1)*IF(ABS(E$3*10^12-$A8)>(E$3*10^12-$A7),$A7,$A8)=E8,0,IF((E$3*10^12-$A8)*(E$3*10^12-$A7)*-1<0,0,1)*IF(ABS(E$3*10^12-$A8)>(E$3*10^12-$A7),$A7,$A8))","v":0},null,null,"Rc1ea",{"$f":"Rcea1","v":{"$error":"#NAME?"}},{"$error":"#NAME?"},"Ω"]
[0.68,0,0,0,0]
[0.82,0,0,0,0,null,null,"Rfb1",{"$f":"Rfb1_","v":210000},210000,"Ω"]
[1,0,0,0,0,null,null,"Rfb2",{"$f":"Rfb2_","v":123594.80269489894},{"$f":"IF(I10=\"OPEN\",\"OPEN\",IF(I10>(INT(0.5+100*POWER(10,IF(96*(LOG(I10)-INT(LOG(I10)))-ROUND(96*(LOG(I10)-INT(LOG(I10))),0)<0,ROUND(96*(LOG(I10)-INT(LOG(I10))),0)-1,ROUND(96*(LOG(I10)-INT(LOG(I10))),0))/96))*POWER(10,INT(LOG(I10))-2)+INT(0.5+100*POWER(10,(IF(96*(LOG(I10)-INT(LOG(I10)))-ROUND(96*(LOG(I10)-INT(LOG(I10))),0)<0,ROUND(96*(LOG(I10)-INT(LOG(I10))),0)-1,ROUND(96*(LOG(I10)-INT(LOG(I10))),0))+1)/96))*POWER(10,INT(LOG(I10))-2))/2,INT(0.5+100*POWER(10,(IF(96*(LOG(I10)-INT(LOG(I10)))-ROUND(96*(LOG(I10)-INT(LOG(I10))),0)<0,ROUND(96*(LOG(I10)-INT(LOG(I10))),0)-1,ROUND(96*(LOG(I10)-INT(LOG(I10))),0))+1)/96))*POWER(10,INT(LOG(I10))-2),INT(0.5+100*POWER(10,IF(96*(LOG(I10)-INT(LOG(I10)))-ROUND(96*(LOG(I10)-INT(LOG(I10))),0)<0,ROUND(96*(LOG(I10)-INT(LOG(I10))),0)-1,ROUND(96*(LOG(I10)-INT(LOG(I10))),0))/96))*POWER(10,INT(LOG(I10))-2)))","v":124000},"Ω"]
[1.2,0,0,0,0]
[1.5,0,0,0,0]
[1.8,0,0,0,0,null,null,"Rs",{"$f":"Rs_ideal*1000","v":{"$error":"#NAME?"}},{"$f":"IF(I13=0,0,IF(I13>(INT(0.5+100*POWER(10,IF(96*(LOG(I13)-INT(LOG(I13)))-ROUND(96*(LOG(I13)-INT(LOG(I13))),0)<0,ROUND(96*(LOG(I13)-INT(LOG(I13))),0)-1,ROUND(96*(LOG(I13)-INT(LOG(I13))),0))/96))*POWER(10,INT(LOG(I13))-2)+INT(0.5+100*POWER(10,(IF(96*(LOG(I13)-INT(LOG(I13)))-ROUND(96*(LOG(I13)-INT(LOG(I13))),0)<0,ROUND(96*(LOG(I13)-INT(LOG(I13))),0)-1,ROUND(96*(LOG(I13)-INT(LOG(I13))),0))+1)/96))*POWER(10,INT(LOG(I13))-2))/2,INT(0.5+100*POWER(10,(IF(96*(LOG(I13)-INT(LOG(I13)))-ROUND(96*(LOG(I13)-INT(LOG(I13))),0)<0,ROUND(96*(LOG(I13)-INT(LOG(I13))),0)-1,ROUND(96*(LOG(I13)-INT(LOG(I13))),0))+1)/96))*POWER(10,INT(LOG(I13))-2),INT(0.5+100*POWER(10,IF(96*(LOG(I13)-INT(LOG(I13)))-ROUND(96*(LOG(I13)-INT(LOG(I13))),0)<0,ROUND(96*(LOG(I13)-INT(LOG(I13))),0)-1,ROUND(96*(LOG(I13)-INT(LOG(I13))),0))/96))*POWER(10,INT(LOG(I13))-2)))","v":{"$error":"#NAME?"}},"mΩ"]
[2.2000000000000002,{"$f":"IF(IF((B$3*10^12-$A15)*(B$3*10^12-$A14)*-1<0,0,1)*IF(ABS(B$3*10^12-$A15)>(B$3*10^12-$A14),$A14,$A15)=B15,0,IF((B$3*10^12-$A15)*(B$3*10^12-$A14)*-1<0,0,1)*IF(ABS(B$3*10^12-$A15)>(B$3*10^12-$A14),$A14,$A15))","v":0},0,0,0,null,null,"Cslope_ideal",{"$f":"Cslope_ideal","v":{"$error":"#NAME?"}},{"$f":"#REF!*1000000000000","v":{"$error":"#REF!"}},"pF"]
[2.7,0,0,0,0]
[3.3,0,0,0,0,null,null,"Ruv1",{"$f":"Ruvlo1","v":1000},{"$f":"IF(I16=\"OPEN\",\"OPEN\",IF(I16>(INT(0.5+100*POWER(10,IF(96*(LOG(I16)-INT(LOG(I16)))-ROUND(96*(LOG(I16)-INT(LOG(I16))),0)<0,ROUND(96*(LOG(I16)-INT(LOG(I16))),0)-1,ROUND(96*(LOG(I16)-INT(LOG(I16))),0))/96))*POWER(10,INT(LOG(I16))-2)+INT(0.5+100*POWER(10,(IF(96*(LOG(I16)-INT(LOG(I16)))-ROUND(96*(LOG(I16)-INT(LOG(I16))),0)<0,ROUND(96*(LOG(I16)-INT(LOG(I16))),0)-1,ROUND(96*(LOG(I16)-INT(LOG(I16))),0))+1)/96))*POWER(10,INT(LOG(I16))-2))/2,INT(0.5+100*POWER(10,(IF(96*(LOG(I16)-INT(LOG(I16)))-ROUND(96*(LOG(I16)-INT(LOG(I16))),0)<0,ROUND(96*(LOG(I16)-INT(LOG(I16))),0)-1,ROUND(96*(LOG(I16)-INT(LOG(I16))),0))+1)/96))*POWER(10,INT(LOG(I16))-2),INT(0.5+100*POWER(10,IF(96*(LOG(I16)-INT(LOG(I16)))-ROUND(96*(LOG(I16)-INT(LOG(I16))),0)<0,ROUND(96*(LOG(I16)-INT(LOG(I16))),0)-1,ROUND(96*(LOG(I16)-INT(LOG(I16))),0))/96))*POWER(10,INT(LOG(I16))-2)))","v":1000},"kΩ"]
[3.9,0,0,0,0,null,null,"Ruv2",{"$f":"Ruvlo2","v":64.509261230572704},{"$f":"IF(I17=\"OPEN\",\"OPEN\",IF(I17>(INT(0.5+100*POWER(10,IF(96*(LOG(I17)-INT(LOG(I17)))-ROUND(96*(LOG(I17)-INT(LOG(I17))),0)<0,ROUND(96*(LOG(I17)-INT(LOG(I17))),0)-1,ROUND(96*(LOG(I17)-INT(LOG(I17))),0))/96))*POWER(10,INT(LOG(I17))-2)+INT(0.5+100*POWER(10,(IF(96*(LOG(I17)-INT(LOG(I17)))-ROUND(96*(LOG(I17)-INT(LOG(I17))),0)<0,ROUND(96*(LOG(I17)-INT(LOG(I17))),0)-1,ROUND(96*(LOG(I17)-INT(LOG(I17))),0))+1)/96))*POWER(10,INT(LOG(I17))-2))/2,INT(0.5+100*POWER(10,(IF(96*(LOG(I17)-INT(LOG(I17)))-ROUND(96*(LOG(I17)-INT(LOG(I17))),0)<0,ROUND(96*(LOG(I17)-INT(LOG(I17))),0)-1,ROUND(96*(LOG(I17)-INT(LOG(I17))),0))+1)/96))*POWER(10,INT(LOG(I17))-2),INT(0.5+100*POWER(10,IF(96*(LOG(I17)-INT(LOG(I17)))-ROUND(96*(LOG(I17)-INT(LOG(I17))),0)<0,ROUND(96*(LOG(I17)-INT(LOG(I17))),0)-1,ROUND(96*(LOG(I17)-INT(LOG(I17))),0))/96))*POWER(10,INT(LOG(I17))-2)))","v":64.900000000000006},"kΩ"]
[4.7,0,0,0,0,null,null,"Rhys",{"$f":"Rhys","v":3.3597468377709037},{"$f":"IF(I18=\"OPEN\",\"OPEN\",IF(I18>(INT(0.5+100*POWER(10,IF(96*(LOG(I18)-INT(LOG(I18)))-ROUND(96*(LOG(I18)-INT(LOG(I18))),0)<0,ROUND(96*(LOG(I18)-INT(LOG(I18))),0)-1,ROUND(96*(LOG(I18)-INT(LOG(I18))),0))/96))*POWER(10,INT(LOG(I18))-2)+INT(0.5+100*POWER(10,(IF(96*(LOG(I18)-INT(LOG(I18)))-ROUND(96*(LOG(I18)-INT(LOG(I18))),0)<0,ROUND(96*(LOG(I18)-INT(LOG(I18))),0)-1,ROUND(96*(LOG(I18)-INT(LOG(I18))),0))+1)/96))*POWER(10,INT(LOG(I18))-2))/2,INT(0.5+100*POWER(10,(IF(96*(LOG(I18)-INT(LOG(I18)))-ROUND(96*(LOG(I18)-INT(LOG(I18))),0)<0,ROUND(96*(LOG(I18)-INT(LOG(I18))),0)-1,ROUND(96*(LOG(I18)-INT(LOG(I18))),0))+1)/96))*POWER(10,INT(LOG(I18))-2),INT(0.5+100*POWER(10,IF(96*(LOG(I18)-INT(LOG(I18)))-ROUND(96*(LOG(I18)-INT(LOG(I18))),0)<0,ROUND(96*(LOG(I18)-INT(LOG(I18))),0)-1,ROUND(96*(LOG(I18)-INT(LOG(I18))),0))/96))*POWER(10,INT(LOG(I18))-2)))","v":3.3200000000000003},"kΩ"]
[5.6,0,0,0,0]
[6.8,0,0,0,0]
[8.1999999999999993,0,0,0,0]
[10,0,0,0,0]
[12,0,0,0,0]
[15,0,0,0,0]
[18,0,0,0,0]
[22,0,0,0,0]
[27,0,0,0,0]
[33,0,0,0,0]
[39,0,0,0,0]
[47,0,0,0,0]
[56,0,0,0,0]
[68,0,0,0,0]
[82,0,0,0,0]
[{"$f":"A22*10","v":100},0,0,0,0]
[{"$f":"A23*10","v":120},0,0,0,0]
[150,0,0,0,0]
[180,0,0,0,0]
[220,0,0,0,{"$f":"IF(IF((E$3*10^12-$A39)*(E$3*10^12-$A38)*-1<0,0,1)*IF(ABS(E$3*10^12-$A39)>(E$3*10^12-$A38),$A38,$A39)=E39,0,IF((E$3*10^12-$A39)*(E$3*10^12-$A38)*-1<0,0,1)*IF(ABS(E$3*10^12-$A39)>(E$3*10^12-$A38),$A38,$A39))","v":0}]
[270,0,0,0,0]
[330,0,0,0,0]
[390,0,0,0,0]
[470,0,0,0,0]
[560,0,0,0,0]
[680,0,0,0,0]
[{"$f":"A33*10","v":820},0,0,0,0]
[1000,0,0,0,0]
[1200,0,0,0,0]
[1500,0,0,0,0]
[1800,0,0,0,0]
[2200,0,0,0,0]
[2700,0,0,0,0]
[3300,0,0,0,0]
[3900,0,0,0,0]
[4700,0,0,0,0]
[5600,0,0,0,0]
[6800,0,0,0,0]
[8200,0,0,0,0]
[10000,0,0,0,0]
[12000,0,0,0,0]
[15000,0,0,0,0]
[18000,0,0,0,0]
[22000,0,0,0,0]
[27000,0,0,0,0]
[33000,0,0,0,0]
[39000,0,0,0,0]
[47000,47000,0,0,0]
[56000,0,0,0,0]
[68000,0,0,0,0]
[82000,0,0,0,0]
[100000,0,{"$f":"IF(IF((C$3*10^12-$A71)*(C$3*10^12-$A70)*-1<0,0,1)*IF(ABS(C$3*10^12-$A71)>(C$3*10^12-$A70),$A70,$A71)=C71,0,IF((C$3*10^12-$A71)*(C$3*10^12-$A70)*-1<0,0,1)*IF(ABS(C$3*10^12-$A71)>(C$3*10^12-$A70),$A70,$A71))","v":0},0,{"$f":"IF(IF((E$3*10^12-$A71)*(E$3*10^12-$A70)*-1<0,0,1)*IF(ABS(E$3*10^12-$A71)>(E$3*10^12-$A70),$A70,$A71)=E71,0,IF((E$3*10^12-$A71)*(E$3*10^12-$A70)*-1<0,0,1)*IF(ABS(E$3*10^12-$A71)>(E$3*10^12-$A70),$A70,$A71))","v":0}]
[120000,{"$f":"IF(IF((B$3*10^12-$A72)*(B$3*10^12-$A71)*-1<0,0,1)*IF(ABS(B$3*10^12-$A72)>(B$3*10^12-$A71),$A71,$A72)=B72,0,IF((B$3*10^12-$A72)*(B$3*10^12-$A71)*-1<0,0,1)*IF(ABS(B$3*10^12-$A72)>(B$3*10^12-$A71),$A71,$A72))","v":0},{"$f":"IF(IF((C$3*10^12-$A72)*(C$3*10^12-$A71)*-1<0,0,1)*IF(ABS(C$3*10^12-$A72)>(C$3*10^12-$A71),$A71,$A72)=C72,0,IF((C$3*10^12-$A72)*(C$3*10^12-$A71)*-1<0,0,1)*IF(ABS(C$3*10^12-$A72)>(C$3*10^12-$A71),$A71,$A72))","v":0},{"$f":"IF(IF((D$3*10^12-$A72)*(D$3*10^12-$A71)*-1<0,0,1)*IF(ABS(D$3*10^12-$A72)>(D$3*10^12-$A71),$A71,$A72)=D72,0,IF((D$3*10^12-$A72)*(D$3*10^12-$A71)*-1<0,0,1)*IF(ABS(D$3*10^12-$A72)>(D$3*10^12-$A71),$A71,$A72))","v":0},0]
[150000,0,0,0,0]
[180000,0,0,0,0]
[220000,0,0,0,0]
[270000,0,0,0,0]
[330000,0,0,0,0]
[390000,0,0,0,0]
[470000,0,0,0,0]
[560000,0,0,0,0]
[680000,0,0,0,0]
[820000,0,0,0,0]
[1000000,0,0,0,0]
[1200000,0,0,0,0]
[1500000,0,0,0,0]
[1800000,0,0,0,0]
[2200000,0,0,0,0]
[2700000,0,0,0,0]
[3300000,0,0,0,0]
[3900000,0,0,0,0]
[4700000,0,0,4700000,0]
[5600000,0,0,0,0]
[6800000,0,0,0,0]
[8200000,0,0,0,0]
[10000000,0,0,0,0]
[12000000,0,0,0,0]
[15000000,0,0,0,0]
[18000000,0,0,0,0]
[22000000,0,0,0,0]
[{"$f":"A87*10","v":27000000},0,0,0,0]
[33000000,0,0,0,0]
[39000000,0,0,0,0]
[47000000,0,0,0,{"$f":"IF(IF((E$3*10^12-$A103)*(E$3*10^12-$A102)*-1<0,0,1)*IF(ABS(E$3*10^12-$A103)>(E$3*10^12-$A102),$A102,$A103)=E103,0,IF((E$3*10^12-$A103)*(E$3*10^12-$A102)*-1<0,0,1)*IF(ABS(E$3*10^12-$A103)>(E$3*10^12-$A102),$A102,$A103))","v":0}]
[56000000,0,0,{"$f":"IF(IF((D$3*10^12-$A104)*(D$3*10^12-$A103)*-1<0,0,1)*IF(ABS(D$3*10^12-$A104)>(D$3*10^12-$A103),$A103,$A104)=D104,0,IF((D$3*10^12-$A104)*(D$3*10^12-$A103)*-1<0,0,1)*IF(ABS(D$3*10^12-$A104)>(D$3*10^12-$A103),$A103,$A104))","v":0},0]
[68000000,0,0,0,0]
[82000000,0,0,0,0]
[100000000,0,100000000,0,0]
[120000000,0,0,0,0]
[150000000,0,0,0,0]
[180000000,0,0,0,0]
[220000000,0,0,0,0]
[270000000,0,0,0,0]
[330000000,0,0,0,0]
[390000000,0,0,0,0]
[470000000,0,0,0,0]
[560000000,0,0,0,0]
[680000000,0,0,0,0]
[820000000,0,0,0,0]
[1000000000,0,0,0,0]
[1200000000,0,0,0,0]
[1500000000,0,0,0,0]
[1800000000,0,0,0,0]
[2200000000,0,0,0,0]
[2700000000,0,0,0,0]
[3300000000,0,0,0,0]
[3900000000,0,0,0,0]
[4700000000,0,0,0,0]
[5600000000,0,0,0,0]
[6800000000,0,0,0,0]
[8200000000,0,0,0,0]
[10000000000,0,0,0,0]
[12000000000,0,0,0,0]
[15000000000,0,0,0,0]
[18000000000,0,0,0,0]
[22000000000,0,{"$f":"IF(IF((C$3*10^12-$A135)*(C$3*10^12-$A134)*-1<0,0,1)*IF(ABS(C$3*10^12-$A135)>(C$3*10^12-$A134),$A134,$A135)=C135,0,IF((C$3*10^12-$A135)*(C$3*10^12-$A134)*-1<0,0,1)*IF(ABS(C$3*10^12-$A135)>(C$3*10^12-$A134),$A134,$A135))","v":0},0,{"$f":"IF(IF((E$3*10^12-$A135)*(E$3*10^12-$A134)*-1<0,0,1)*IF(ABS(E$3*10^12-$A135)>(E$3*10^12-$A134),$A134,$A135)=E135,0,IF((E$3*10^12-$A135)*(E$3*10^12-$A134)*-1<0,0,1)*IF(ABS(E$3*10^12-$A135)>(E$3*10^12-$A134),$A134,$A135))","v":0}]
[27000000000,{"$f":"IF(IF((B$3*10^12-$A136)*(B$3*10^12-$A135)*-1<0,0,1)*IF(ABS(B$3*10^12-$A136)>(B$3*10^12-$A135),$A135,$A136)=B136,0,IF((B$3*10^12-$A136)*(B$3*10^12-$A135)*-1<0,0,1)*IF(ABS(B$3*10^12-$A136)>(B$3*10^12-$A135),$A135,$A136))","v":0},0,0,0]
[33000000000,0,0,0,0]
[39000000000,0,0,0,0]
[47000000000,0,0,0,0]
[56000000000,0,0,0,0]
[68000000000,0,0,0,0]
[82000000000,0,0,0,0]
[100000000000,0,0,0,0]
[120000000000,0,0,0,0]
[150000000000,0,0,0,0]
[180000000000,0,0,0,0]
[220000000000,0,0,0,0]
[270000000000,0,0,0,0]
[330000000000,0,0,0,0]
[390000000000,0,0,0,0]
[470000000000,0,0,0,0]
[560000000000,0,0,0,0]
[680000000000,0,0,0,0]
[820000000000,0,0,0,0]
[1000000000000,0,0,0,0]
[1200000000000,0,0,0,0]
[1500000000000,0,0,0,0]
[1800000000000,0,0,0,0]
[2200000000000,0,0,0,0]
[2700000000000,2700000000000,2700000000000,2700000000000,2700000000000]

{"sheet":"Ripple Injection","index":9,"n_rows":21,"n_cols":8,"rows_kept":21,"cut":false,"hidden":true,"merged":[]}
[]
[]
[]
[null,null,null,"RFB1",{"$f":"Rfb1_","v":210000},"W"]
[null,null,null,"RFB2",{"$f":"Rfb2_u","v":124000},"W"]
[]
[null,null,null,"Parallel (RFB1, RFB2)",{"$f":"Rfb1_*Rfb2_u/(Rfb1_+Rfb2_u)","v":77964.071856287424},"W"]
[]
[]
[null,null,null,"Cr",{"$f":"5/(Pi*Fsw*E7)","v":8.1655531572096197E-11},"F",{"$f":"E10*1000000000000","v":81.655531572096194},"pF"]
[]
[]
[]
[]
[null,null,null,null,{"$f":"1/(2*Pi*Fsw*Rfb1_)","v":3.0315227290239307E-12},null,{"$f":"E15*1000000000000","v":3.0315227290239308}]
[]
[]
[]
[null,null,null,"Cr",2.1999999999999998E-9,"F"]
[]
[null,null,null,"Rr",{"$f":"(VIN_nom-Vout)/(Cr*0.03*Fsw)","v":527212.12121212122},"W"]