{"text_format":"1","workbook":"xlsx","n_sheets":13,"sheets":["Design Regulator","Input Filters","BOM & Schematic","EVM","Variable Management","Schematic Management","Stability Calculations","Bode Plot Management","Efficiency Calculations","Efficiency Plot Management","Standard Value Calculator","Snubber","Parallel Output Caps"],"not_rendered":{"charts":10,"images":32,"macros":1,"external_links":0,"defined_names":303,"comments":2,"pivot_tables":0},"unopened":[],"bounds":{"document_bytes":16777216,"sheet_cells":100000,"rows_first":2000,"rows_last":500,"rows_between":2000,"halvings":0,"cell_chars":16384,"cell_head_chars":4096},"cells_cut":0,"cells_raw":0,"read":"whole","date_system":"1900"}

{"sheet":"Design Regulator","index":0,"n_rows":103,"n_cols":16,"rows_kept":103,"cut":false,"hidden":false,"merged":[[67,5,67,7],[2,13,2,14],[0,0,0,15],[78,5,78,6],[33,10,34,15]]}
["                      LM70XX0/-Q1 Synchronous Buck Converter Design Tool"]
[null,null,null,null,null,null,null,null,null,null,null,null,null,"http://www.ti.com/product/lm5175"]
["About",null,"xx",null,null,"= Input Box",null,null,null,null,null,null,null,"TERMS OF USE",null,"                "]
[]
["Step 1: Operating Specifications"]
[null,null,null,"Input Voltage – Min, VIN(min) ",12,"V"]
[null,null,null,"Input Voltage – Nom, VIN(nom)",12,"V"]
[null,null,null,"Input Voltage – Max, VIN(max)",12,"V"]
[null,null,null,"Output Voltage, VOUT ",3.3,"V"]
[null,null,null,"Full Load Output Current, IOUT ",4,"A"]
[null,null,null,"Switching Frequency, FSW",2200,"kHz"]
[null,null,null,"Frequency Set Resistor, RT ",{"$f":"'Variable Management'!C443","v":9.09},"kΩ"]
[null,null,null,"Ambient Temperature, TA",25,"°C"]
[]
["Step 2: Current Sense Resistor"]
[null,null,null,"Required IOCP Setpoint at VIN(nom)",7,"A"]
[null,null,null,"Recommended Sense Resistance",{"$f":"Rs_ideal*1000","v":6.8569555028853149},"mΩ"]
[null,null,null,"Sense Resistance, RS",5,"mΩ"]
[null,null,null,"Min Inductor Sat Current, ILO(SAT)",{"$f":"'Variable Management'!B95","v":11.2},"A"]
[null,null,null,"Max power loss in shunt",{"$f":"'Variable Management'!B105","v":0.50558588714403374},"W"]
[null,null,null,"VIN(min)",{"$f":"'Variable Management'!B97","v":10.033110193520148},"A"]
[null,null,"IOUT(typ) at OCP Inception:","VIN(nom)",{"$f":"'Variable Management'!B98","v":10.033110193520148},"A"]
[null,null,null,"VIN(max)",{"$f":"'Variable Management'!B99","v":10.033110193520148},"A"]
[]
["Step 3: Buck Inductance"]
[null,null,null,"Recommended Inductance",{"$f":"Lopt*1000000","v":0.3125},"µH"]
[null,null,null,"Inductance, LO ",0.47,"µH"]
[null,null,null,"Inductor DCR ",3.5,"mΩ"]
[null,null,null,"DIL as a % at VIN(nom)",{"$f":"'Variable Management'!B68*100","v":58.344490323992581},"%"]
[]
["Step 4: Output Capacitors"]
[null,null,null,"Output Voltage Ripple Spec",100,"mVpk-pk"]
[null,null,null,"Minimum Output Capacitance",{"$f":"'Variable Management'!B121","v":2.2000000000000002},"µF"]
[null,null,null,"Output Capacitance (derated), COUT ",40,"µF",null,null,null,null,{"$f":"CHOOSE(SCH_MODE, \"\", \"** For Single-Output Operation in 2-Phase Mode, tie MODE to VDDA and use FB1 to set VOUT **\", \"** For Single-Output Operation in 3-Phase Mode, tie both MODE pins to VDDA. Use FB1 of master IC to set VOUT. Connect FB2 of master IC to AGND. Connect FB2 of slave IC to VDDA to configure it as a slave **\", \"** For Single-Output Operation in 4-Phase Mode, tie both MODE pins to VDDA. Use FB1 of master IC to set VOUT. Connect FB2 of master IC to AGND. Connect FB2 of slave IC to VDDA to configure it as a slave **\")","v":""}]
[null,null,null,"Maximum Permitted ESR",{"$f":"'Variable Management'!B125","v":42.825396747946613},"mΩ"]
[null,null,null,"Output Capacitor ESR",1,"mΩ",null,null,null,null,{"$f":"CHOOSE(SCH_MODE,  \"\", \"** Tie VCCX to GND if not used **\", \"** Slave controller (CNTRL2) not shown **\",\"** Slave controller (CNTRL2) not shown **\")","v":""},null,null,null,null,{"$f":"IF(SCH_MODE=1,  \"** Tie VCCX to GND if not used **\", \"\")","v":"** Tie VCCX to GND if not used **"}]
[null,null,null,"Resulting Output Voltage Ripple (max) ",{"$f":"'Variable Management'!B127*1000","v":4.0541259218133856},"mVpk-pk",null,null,null,null,{"$f":"IF(OR(SCH_MODE=3, SCH_MODE=4),\"** Tie VCCX to GND if not used **\", \"\")","v":""}]
[null,null,null,"Output Capacitor RMS Current (max) ",{"$f":"'Variable Management'!B114","v":0.67370414388577271},"A (rms)"]
[]
["Step 5: Input Capacitors"]
[null,null,null,"Input Voltage Ripple Spec",300,"mVpk-pk"]
[null,null,null,"Minimum Input Capacitance",{"$f":"'Variable Management'!B148","v":2.2000000000000002},"µF"]
[null,null,null,"Input Capacitance (derated), CIN ",44,"µF"]
[null,null,null,"Maximum Permitted ESR",{"$f":"'Variable Management'!B154","v":56.062628067725733},"mΩ",null,null,null,null,null,null,null,null,null," "]
[null,null,null,"Input Capacitor ESR",1,"mΩ"]
[null,null,null,"Resulting Input Voltage Ripple (max)",{"$f":"'Variable Management'!B161*1000","v":13.449383601686161},"mVpk-pk"]
[null,null,null,"Input Capacitor RMS Current (max)",{"$f":"'Variable Management'!B138","v":1.8256160638616385},"A (rms)"]
[]
["Step 6: Enable, CNFG, FPWM/PFM"]
[]
[]
[null,null,null,"Input Voltage UVLO Turn-ON",6,"V"]
[null,null,null,"Input Voltage UVLO Turn-OFF",5,"V"]
[null,null,null,"Upper Enable Resistor, RUV1",{"$f":"IF(UVLO_TYPE=1,'Variable Management'!B187,0)","v":0},"kΩ"]
[null,null,null,"Lower Enable Resistor, RUV2",{"$f":"IF(UVLO_TYPE=1,'Variable Management'!B188,\"DNP\")","v":"DNP"},"kΩ"]
[null,null,null,"Configuration Resistor, RCNFG",{"$f":"IF(DITHER=1,\"41.2\",\"29.4\")","v":"41.2"},"kΩ"]
[null,null,null,{"$f":"IF(DEMB=1, \"* Tie PFM to GND\", \"* Tie PFM to VDDA\")","v":"* Tie PFM to GND"}]
[]
["Step 7: Compensation Design"]
[null,null,null,"Load Pole Frequency",{"$f":"Fp_dominant","v":7181.7823146584406},"Hz"]
[null,null,null,"ESR Zero Frequency",{"$f":"Fesr/1000","v":3978.8735818439091},"kHz"]
[null,null,null,"Desired Crossover Frequency",50,{"$f":"\"     kHz \"","v":"     kHz "}]
[null,null,null,"Error Amp Pole Frequency",{"$f":"Fp1_u","v":1.1302558515377561},"Hz"]
[null,null,null,{"$f":"CHOOSE(VOUT_setting, \"Upper Feedback Resistor\",\"\",\"\",\"\")","v":""},100,"kΩ"]
[null,null,null,{"$f":"CHOOSE(VOUT_setting, \"Lower Feedback Resistor\", \"PULLUP FB to VDDA with \"&'Variable Management'!D419,\"TIE FB TO VDDA\",\"PULLUP FB to VDDA with\"&'Variable Management'!D419)","v":"TIE FB TO VDDA"},{"$f":"IF(Vout=Vref,\"OPEN\",Rfb2_u/1000)","v":792},{"$f":"IF(Vout=Vref,\"\",\"kΩ\")","v":"kΩ"}]
[]
["Compensation Components"]
[null,"Calculated /","Std Values",{"$f":"C68","v":"Std Values"},null,"Actual P/Z Frequencies"]
["RC1",{"$f":"Rcea1/1000","v":2.3231263560113509},{"$f":"'Standard Value Calculator'!S32","v":2.3199999999999998},6,"kΩ",{"$f":"Fp1_u","v":1.1302558515377561},"Hz   (FPEA)"]
["CC1",{"$f":"Cc1ea*1000000000","v":13.701789647551891},{"$f":"'Standard Value Calculator'!S33","v":14.999999999999998},2.2000000000000002,"nF",{"$f":"Fz1_u/1000","v":12.057192672254269},"kHz (FZCOMP)"]
["CC2",{"$f":"IF(Cc2ea<0, \"N/A\", Cc2ea*1000000000000)","v":30.449873379575507},{"$f":"'Standard Value Calculator'!S34","v":33},22,"pF",{"$f":"Fp2_u/1000","v":492.76122437736711},"kHz (FPCOMP)"]
[null,null,null,null,null,null,null,null,null,null,null,null,"** Specify Inductor Core Loss **",0.1,"W"]
[]
["Efficiency / Power Loss Analyzer"]
[]
["Step 8: Efficiency"]
[null,null,null,null,null,"Power MOSFETs","(Q1, Q2) "]
[null,null,null,null,"Internal NEXFETs"]
[null,null,null,null,"High-side","  Low-side"]
[null,null,null,"On-State Resistance, RDS(on) ",24,18,"mΩ"]
[null,null,null,"Total Gate Charge, QG ",3,4.0999999999999996,"nC"]
[null,null,null,"Gate-Drain Charge, QGD ",0.7,1,"nC"]
[null,null,null,"Gate-Source Charge, QGS ",0.7,0.9,"nC"]
[null,null,null,"Output Charge, QOSS ",null,3,"nC"]
[null,null,null,"Output Capacitance, COSS ",250,350,"pF"]
[null,null,null,"Gate Resistance, RG ",3.5,3,"Ω"]
[null,null,null,"Transconductance, gFS ",71,90,"S"]
[null,null,null,"Gate-Source Threshold Voltage, VTH ",1.8,1.8,"V"]
[null,null,null,"Body Diode Forward Voltage, VBD ",0.8,0.8,"V"]
[null,null,null,"Body Diode Rev Recovery Charge, QRR ",null,30,"nC"]
[null,null,null,"Thermal Resistance, θJA ",15,15,"°C/W"]
[]
["External Schottky Diode (if applicable)"]
[null,null,null,"Schottky Fwd Voltage, VFWDsch ",null,0,"V"]
[null,null,null,"Schottky Rev Recovery Charge, QRRsch ",null,0,"nC"]
[]
[]
[]
["Step 9: IC Power Loss"]
[null,null,null,"BIAS Voltage",12,"V"]
[null,null,null,"IC Power Dissipation",{"$f":"'Variable Management'!B362","v":0.18744},"W"]
[null,null,null,"IC Junction Temperature (estimate)",{"$f":"'Variable Management'!B364","v":31.391704000000001},"°C"]
[null,null,null,null,{"$f":"CHOOSE(Ext_VCC, \"\", \"* Tie BIAS to PGND\")","v":""}]

{"sheet":"Input Filters","index":1,"n_rows":17,"n_cols":17,"rows_kept":17,"cut":false,"hidden":true,"merged":[[0,0,0,16],[2,14,2,15]]}
["                           LM(2)5149-Q1 Synchronous Buck Controller Design Tool"]
[null,null,null,null,null,null,null,null,null,null,null,null,null,null,"http://www.ti.com/product/lm5175"]
["About",null,"xx",null,null,"= Input Box",null,null,null,null,null,null,null,null,"TERMS OF USE",null,"                "]
[]
[]
[]
[null,null,null,null,"AEF",null,null,null,null,null,null,null,"Passive"]
[]
[null,"Design tab - LAEF",{"$f":"'Design Regulator'!E48 & \" µH\"","v":" µH"},null,null,"LAEF",1,"µH",null,"Suggested LIN Inductor","0.1-10","µH",null,"Chosen LIN",0.68,"µH"]
[null,"Design tab - CINJ",{"$f":"'Design Regulator'!#REF! & \" µF\"","v":{"$error":"#REF!"}},null,null,"CINJ",1,"µF",null,"Suggested CF","0.1-10","µF",null,"Chosen CF",0.47,"µF"]
[null,"Design tab - CDAMP",{"$f":"'Design Regulator'!#REF! & \" µF\"","v":{"$error":"#REF!"}},null,null,"CDAMP",1,"µF",null,"Suggested CDAMP","1-10","µF",null,"Chosen CDAMP",1,"µF"]
[null,"Design tab - RDAMP",{"$f":"'Design Regulator'!#REF! & \" Ω\"","v":{"$error":"#REF!"}},null,null,"RDAMP",10,"Ω",null,"Suggested RDAMP",{"$f":"Rdamp_PassiveStd","v":{"$error":"#REF!"}},"Ω",null,"Chosen RDAMP",0.35,"Ω"]
[]
[null,null,"VIN Ripple at Fsw",null,null,{"$f":"VinRipple_dBuV","v":82.57404761313181},"dBµV","VIN Ripple",{"$f":"VinRipple_dBuV","v":82.57404761313181},"dBµV"]
[]
[null,null,null,"AEF Attenuation at Fsw",{"$f":"-#REF!","v":{"$error":"#REF!"}},"dB",null,null,null,null,null,"Passive Attenuation at Fsw",{"$f":"-#REF!","v":{"$error":"#REF!"}},"dB"]
[null,null,null,"AEF EMI at Fsw",{"$f":"VinRipple_dBuV-E16","v":{"$error":"#REF!"}},"dB-µV",null,null,null,null,null,"Passive EMI at Fsw",{"$f":"VinRipple_dBuV-M16","v":{"$error":"#REF!"}},"dB-µV"]

{"sheet":"BOM & Schematic","index":2,"n_rows":71,"n_cols":10,"rows_kept":71,"cut":false,"hidden":true,"merged":[[50,3,50,5],[47,3,47,5],[62,3,62,6],[63,3,63,6],[61,3,61,6],[52,3,52,5],[55,3,55,6],[41,3,41,6],[46,3,46,5],[60,3,60,6],[58,3,58,6],[59,3,59,6],[54,3,54,6],[57,3,57,6],[56,3,56,6],[53,3,53,6],[42,3,42,5],[43,3,43,5],[48,3,48,5],[49,3,49,5],[51,3,51,5],[44,3,44,5],[45,3,45,5],[64,0,65,0],[64,9,65,9],[64,3,65,6],[64,2,65,2],[64,1,65,1],[64,7,65,7],[64,8,65,8]]}
[]
[]
[]
[]
[]
[]
[]
[]
[]
[]
[]
[]
[]
[]
[]
[]
[]
[]
[]
[]
[]
[]
[]
[]
[]
[]
[]
[]
[]
[]
[]
[]
[]
[]
[]
["   ** Tie DEMB to VDDA for FPWM, AGND for DEM **"]
["   ** Tie VCCX to GND if not used **",null,null,null,null,null,null,null,{"$f":"IF(OR(SCH_MODE=3, SCH_MODE=4),\"** Tie VCCX to GND if not used **\", \"\")","v":""}]
["   ** Tie DITH to VDDA to disable spread spectrum **"]
["   ** Tie OSC to VDDA for 2.2MHz, AGND for 440kHz **"]
[{"$f":"\"VIN = \"&VIN_min&\" V to \"&VIN_max&\" V, VOUT = \"& Vout &\" V, IOUT = \" &Iout & \" A,  Fsw = \" & Fsw/1000 &\" kHz, Current Limit = \"&ROUNDUP(Ilimit_DC,0)&\" A\"","v":"VIN = 12 V to 12 V, VOUT = 3.3 V, IOUT = 4 A,  Fsw = 2200 kHz, Current Limit = 7 A"}]
["High Efficiency Synchronous Buck Regulator BOM"]
["Count","Ref Des","Value","Description",null,null,null,"Size","Part Number","MFR"]
[1,"CBOOT",0.1,{"$f":"C43","v":0.1},null,null,null,"0603","Std","Std"]
[1,"CC1",{"$f":"'Design Regulator'!D70","v":2.2000000000000002},2.2000000000000002,null,null,null,"0603","Std","Std"]
[1,"CC2",{"$f":"'Design Regulator'!D71","v":22},22,null,null,null,"0603","Std","Std"]
[1,"CRES",{"$f":"Cres_u*1000000000","v":82},{"$f":"C46","v":82},null,null,null,"0603","Std","Std"]
[1,"CDITH",{"$f":"Cdither*1000000000","v":2.1999999999999997},{"$f":"C47","v":2.1999999999999997},null,null,null,"0603","Std","Std"]
[{"$f":"ROUNDUP('Design Regulator'!E43/10,0)","v":5},"CIN",10,{"$f":"C48","v":10},null,null,null,1210,"Std","Std"]
[{"$f":"ROUNDUP('Design Regulator'!E34/47,0)","v":1},"COUT",47,{"$f":"C49","v":47},null,null,null,1210,"Std","Std"]
[1,"CSS",{"$f":"'Design Regulator'!#REF!","v":{"$error":"#REF!"}},{"$f":"C50","v":{"$error":"#REF!"}},null,null,null,"0603","Std","Std"]
[2,"CVCC, CVCCX",2.2000000000000002,2.2000000000000002,null,null,null,"0603","Std","Std"]
[1,"CVDDA",0.47,0.47,null,null,null,"0603","Std","Std"]
[1,"DBOOT","See description","Schottky Diode, 60V, 200mA",null,null,null,"-","-","Various"]
[1,"LO",{"$f":"'Design Regulator'!E27","v":0.47},{"$f":"\"Inductor, \"&Lf*1000000&\"µH, \"&Rdcr*1000&\"mΩ, >\"&ROUNDUP(Ilimit_DC*1.1,0)&\"A\"","v":"Inductor, 0.47µH, 3.5mΩ, >8A"},null,null,null,"-","-","Various"]
[2,"Q1, Q2","See description",{"$f":"'Design Regulator'!E80","v":24},null,null,null,"Std",{"$f":"'Design Regulator'!E78","v":"Internal NEXFETs"},"-"]
[1,"RC1",{"$f":"'Design Regulator'!D69","v":6},{"$f":"C56","v":6},null,null,null,"0603","Std","Std"]
[1,"RS",{"$f":"Rs*1000","v":5},5,null,null,null,"0508","Std","Std"]
[1,"RT",{"$f":"'Design Regulator'!E12","v":9.09},9.09,null,null,null,"0603","Std","Std"]
[1,"RFB1",{"$f":"'Design Regulator'!E64","v":100},100,null,null,null,"0603","Std","Std"]
[1,"RFB2",{"$f":"'Design Regulator'!E65","v":792},792,null,null,null,"0603","Std","Std"]
[1,"RPGOOD",100,100,null,null,null,"0603","Std","Std"]
[1,"RCS",100,100,null,null,null,"0603","Std","Std"]
[1,"RDEMB",100,100,null,null,null,"0603","Std","Std"]
[1,"RVIN",2.2000000000000002,2.2000000000000002,null,null,null,"0603","Std","Std"]
[1,"U1","LM5141-Q1","IC, LM5141-Q1, Synchronous Buck PWM Controller, 3.8V–65V Input",null,null,null,"VQFN-24","LM5141QRGEQ1","TI"]
[]
[]
["NOTES:"]
["** For information on TI NexFETTM MOSFETs, see **",null,null,"http://www.ti.com/nexfet","   **"]
["** Inductor saturation current should be higher than the peak inductor current at the OCP setpoint for all input voltages and operating temperatures **"]
["** Effective input and output capacitances should be appropriately derated for applied voltage and temperature, particularly with ceramics **"]

{"sheet":"EVM","index":3,"n_rows":6,"n_cols":2,"rows_kept":6,"cut":false,"hidden":true,"merged":[[0,0,0,16]]}
[" LM25149-Q1 Quickstart Design Tool"]
[]
[]
[]
[]
[null,"LM25149-Q1EVM-2100 PCB Layout"]

{"sheet":"Variable Management","index":4,"n_rows":451,"n_cols":27,"rows_kept":451,"cut":false,"hidden":true,"merged":[[4,4,4,7],[0,0,0,8]]}
["EXCEL Variables Names/Calculations"]
[null,"Input from user ="]
[null,"Output ="]
[null,"Constant"]
["Variable Name","Value","STD Units",null,"Notes",null,null,null,"Iteration"]
["Step 1: Operational Specs"]
["VIN_min",{"$f":"'Design Regulator'!E6","v":12},"V","Minimum input voltage",null,null,null,null,1]
["VIN_nom",{"$f":"'Design Regulator'!E7","v":12},"V","Nominal input voltage",null,null,null,null,null,null,{"$f":"CHOOSE(SCH_MODE, \"Efficiency vs. IOUT (Ch1)\", \"Efficiency vs. IOUT - 2 Ph\", \"Efficiency vs. IOUT - 3 Ph\", \"Efficiency vs. IOUT - 4 Ph\")","v":"Efficiency vs. IOUT (Ch1)"},1,null,"DITHER Enabled",1,null,null,null,null,"Dual  Outputs",1,null,"FPWM",1]
["VIN_max",{"$f":"'Design Regulator'!E8","v":12},"V","Maximum input voltage",null,{"$f":"CHOOSE(GPN_setting,80,80,80,80,65,65,45)","v":80},"IC max voltage",null,null,null,{"$f":"IF(MODE=1, \"Efficiency vs. IOUT (Ch2)\", \"N/A - Do Not Use\")","v":"Efficiency vs. IOUT (Ch2)"},2,null,"DITHER Disabled",2,null,null,null,null,"Single Output – 2  Phases",2,null,"PFM",2]
[null,null,null,null,null,null,null,null,null,null,"PLOT_TYPE",1,null,"DITHER Yes/No",1,"1 = Yes, 2 = No",null,null,null,"Single Output – 3  Phases",3,null,"FPWM/PFM",1]
["Vout",{"$f":"'Design Regulator'!E9","v":3.3},"V","Output voltage - channel 1",null,null,null,null,null,null,null,null,null,null,null,null,null,null,null,"Single Output – 4  Phases",4]
["Iout",{"$f":"'Design Regulator'!E10","v":4},"A","Output current - channel 1",null,{"$f":"CHOOSE(GPN_setting,10,8,6,4,10,6,10)","v":8},"IC max current",null,1,null,null,null,null,null,null,null,null,null,null,"Single/Dual Yes/No",1]
[null,null,null,null,null,null,null,null,1,null,"Adjustable",1,null,"3.3V",1,null,null,null,null,"MODE (Single/Dual), DUAL = 1, SINGLE = 2",{"$f":"IF(U12=1, 1, 2)","v":1},null,"BIAS Connected",1]
["Rout",{"$f":"Vout/Iout","v":0.82499999999999996},"W","Load resistance - Channel 1",null,null,null,null,null,null,"5V",2,null,"5V",2,null,null,null,null,"SINGLE OUTPUT (1 = YES)",{"$f":"IF(U12=1, 2, 1)","v":2},null,"No External BIAS",2]
[null,null,null,null,null,null,null,null,null,null,"3.3V",3,null,"Adjustable",3,null,null,null,null,"Number of Phases",{"$f":"SCH_MODE","v":1},null,"Ext_VCC",1]
["Pout",{"$f":"Vout*Iout","v":13.2},"W","Output power",null,null,null,null,null,null,"12V",4,null,"Ch2 Output Setting",{"$f":"IF(Vout2=3.3, 1, IF(Vout2=5, 2, 3))","v":3}]
[null,null,null,null,null,null,null,null,null,null,"Output Voltage Setting",{"$f":"IF(Vout=3.3, 3, IF(Vout=5, 2,  IF(Vout=12,4,1)))","v":3}]
["Efficiency",0.9,null,"Estimate of efficiency"]
["Pin",{"$f":"Pout/Efficiency","v":14.666666666666666},"W","Calculate input power assuming finite efficiency",null,null,null,null,null,null,null,null,null,null,null,null,null,null,null,null,null,null,null,null,null,"Internal Compensation",1]
[null,null,null,null,null,null,null,null,null,null,null,null,null,null,null,null,null,null,null,null,null,null,null,null,null,"External Compensation",2]
["Iin_Vinmin",{"$f":"Pin/VIN_min","v":1.2222222222222221},"A",null,null,null,null,null,null,null,null,{"$f":"Vout","v":3.3},null,null,null,null,null,null,null,null,null,null,null,null,null,"COMP_TYPE",2]
["Iin_Vinnom",{"$f":"Pin/VIN_nom","v":1.2222222222222221},"A","Input currents at min, nom, max Vin",null,null,null,{"$f":"AND(OSC=1, OR(Fsw/1000>2530, Fsw/1000<1800))","v":false}]
["Iin_Vinmax",{"$f":"Pin/VIN_max","v":1.2222222222222221},"A",null,null,null,null,{"$f":"AND(OSC=2, OR(Fsw/1000>500, Fsw/1000<300))","v":false}]
[null,null,null,null,null,null,null,{"$f":"OR(H22,H23)","v":false}]
["OSC setting",{"$f":"CHOOSE(OSC, 2200, 440)","v":{"$error":"#VALUE!"}},"kHz",null,null,null,null,null,null,null,"SetVout_IntComp_nEN",1,null,"LM708A0(-Q1)",1,null,null,null,null,null,null,null,null,null,null,"UVLO Divider",1]
["Fsw",{"$f":"'Design Regulator'!E11*1000","v":2200000},"Hz","Nominal switching frequency - determines RT resistor (SYNCIN must be 80-120% of this)",null,null,null,null,null,null,"SetVout_IntComp_EN",2,null,"LM70880(-Q1)",2,null,null,null,null,null,null,null,null,null,null,"No UVLO Divider",2]
["RT resistor to AGND",{"$f":"((1000000000/Fsw)-53)/45+0.1","v":9.0232323232323228},"kΩ",null,null,null,null,null,null,null,"SetVout_ExtComp_nEN",3,null,"LM70860(-Q1)",3,null,null,null,null,null,null,null,null,null,null,"UVLO_TYPE",2]
[null,null,"kΩ",null,null,null,null,null,1,null,"SetVout_ExtComp_EN",4,null,"LM70840(-Q1)",4]
["Tsw",{"$f":"1/Fsw","v":4.5454545454545452E-7},"sec","Switching period",null,null,null,null,null,null,"AdjVout_IntComp_nEN",5,null,"LM706A0(-Q1)",5]
["Vref",0.8,"V","Reference voltage",null,null,null,null,null,null,"AdjVout_IntComp_EN",6,null,"LM70660(-Q1)",6]
["Rt",{"$f":"'Standard Value Calculator'!S12/1000","v":9.09},"kΩ","Frequency set resistor",null,{"$f":"IF(OR((Fsw=440000),(Fsw=2200000)),\"N/A\",Rfadj/1000)","v":"N/A"},null,null,null,null,"AdjVout_ExtComp_nEN",7,null,"LM704A0(-Q1)",7]
[null,null,null,null,null,null,null,null,null,null,"AdjVout_ExtComp_EN",8,null,"GPN setting",2]
["Step 2: Buck Inductor","Channel 1",null,null,null,null,null,null,null,null,"Schematic setting",{"$f":"(IF(OR(Vout=3.3,Vout=5,Vout=12),CHOOSE(COMP_TYPE,IF(UVLO_TYPE=2,1,2),IF(UVLO_TYPE=2,3,4)),CHOOSE(COMP_TYPE,IF(UVLO_TYPE=2,5,6),IF(UVLO_TYPE=2,7,8))))","v":3}]
["Don1",{"$f":"Vout/VIN_nom","v":0.27499999999999997},null,null,null,"Ideal Duty Cycle at VIN(nom)"]
["Doff1",{"$f":"1-34:34","v":0.72500000000000009},null,null,null,"Ideal 1- Duty Cycle at VIN(nom)"]
[]
["D_Vinmin",{"$f":"Vout/VIN_min","v":0.27499999999999997}]
["D_Vinnom",{"$f":"Vout/VIN_nom","v":0.27499999999999997}]
["D_Vinmax",{"$f":"Vout/VIN_max","v":0.27499999999999997}]
[]
["L_Vinnom",{"$f":"(VIN_nom-Vout)*D1_Vinnom/(Fsw*(Iout/Number_of_Phases)*0.3)","v":9.062499999999999E-7},"H",null,null,"Calculated inductance for 35% ripple at VIN(nom)"]
["L_slopecomp",{"$f":"1000*Vout*Rs/24/Fsw","v":3.1250000000000003E-7},"H",null,null,"Calculated inductance based on one times inductor downslope"]
[]
["Lopt",{"$f":"B42","v":3.1250000000000003E-7},"H",null,null,"Slope comp"]
[]
["Lo",{"$f":"'Design Regulator'!E27/1000000","v":4.6999999999999995E-7},"H",null,null,"Chosen inductance"]
["Rdcr",{"$f":"'Design Regulator'!E28/1000","v":3.5000000000000001E-3},"W",null,null,"Chosen inductor DCR"]
[]
["Don2",{"$f":"(Vout+Iout*(Rdcr+Rs))/(Vin+Iout*Rs)","v":0.27737104825291181}]
["Doff2",{"$f":"1-_Don2","v":0.72262895174708819}]
[]
["D_Vinmin_2",{"$f":"CHOOSE(MODE, (Vout+Iout*(Rdcr+Rs))/(VIN_min+Iout*Rs), (Vout+Iout/Number_of_Phases*(Rdcr+Rs))/(VIN_min+Iout/Number_of_Phases*Rs))","v":0.27737104825291181},null,null,null,"Duty cycles adjusted for DCR/shunt voltage drops"]
["D_Vinnom_2",{"$f":"CHOOSE(MODE, (Vout+Iout*(Rdcr+Rs))/(VIN_nom+Iout*Rs), (Vout+Iout/Number_of_Phases*(Rdcr+Rs))/(VIN_nom+Iout/Number_of_Phases*Rs))","v":0.27737104825291181},null,null,null,"need to include RDS(on) later"]
["D_Vinmax_2",{"$f":"CHOOSE(MODE, (Vout+Iout*(Rdcr+Rs))/(VIN_max+Iout*Rs), (Vout+Iout/Number_of_Phases*(Rdcr+Rs))/(VIN_max+Iout/Number_of_Phases*Rs))","v":0.27737104825291181}]
[]
["Iripple_Vinmin",{"$f":"(VIN_min-Vout)*D1_Vinmin_2/(Fsw*Lf)","v":2.3337796129597033},"A"]
["Iripple_Vinnom",{"$f":"(VIN_nom-Vout)*D1_Vinnom_2/(Fsw*Lf)","v":2.3337796129597033},"A"]
["Iripple_Vinmax",{"$f":"(VIN_max-Vout)*D1_Vinmax_2/(Fsw*Lf)","v":2.3337796129597033},"A"]
[]
["Ishunt_rms_Vinmin",{"$f":"SQRT((Iout/Number_of_Phases)^2+(Iripple_Vinmin^2)/12)","v":4.0563379141152502},"A"]
["Ishunt_rms_Vinnom",{"$f":"SQRT((Iout/Number_of_Phases)^2+(Iripple_Vinnom^2)/12)","v":4.0563379141152502},"A"]
["Ishunt_rms_Vinmax",{"$f":"SQRT((Iout/Number_of_Phases)^2+(Iripple_Vinmax^2)/12)","v":4.0563379141152502},"A"]
["Max shunt power loss at full load",{"$f":"B61^2*Rs","v":8.2269386367444297E-2},"W",null,null,"Note this is power loss at full load - not loss near OCP!"]
[]
["Max inductor ripple current",{"$f":"MAX(B56:B58)","v":2.3337796129597033},"A",null,null,"Ripple current at Vin(max)"]
[]
[null,{"$f":"B56/(Iout/Number_of_Phases)","v":0.58344490323992582}]
["% ripple current",{"$f":"B57/(Iout/Number_of_Phases)","v":0.58344490323992582}]
[null,{"$f":"B58/(Iout/Number_of_Phases)","v":0.58344490323992582}]
[]
["Inductor copper temerature",100,"°C"]
["DCR at hot",{"$f":"Rdcr*(1+0.0039*(B71-25))","v":4.52375E-3},"W"]
[]
[]
["Step 3: Sense Resistors, Slope Comp, Current Limit"]
[]
["Ilimit_DC",{"$f":"'Design Regulator'!E16","v":7},"A",null,null,"Chosen OCP level - based on output current"]
[]
["Ilimit_inductor_Vinmin",{"$f":"CHOOSE(MODE, Ilimit_DC+Iripple_Vinmin/2, Ilimit_DC/Number_of_Phases+Iripple_Vinmin/2)","v":8.1668898064798512},"A",null,null,"Peak inductor current at current limit inception"]
["Ilimit_inductor_Vinnom",{"$f":"CHOOSE(MODE, Ilimit_DC+Iripple_Vinnom/2, Ilimit_DC/Number_of_Phases+Iripple_Vinnom/2)","v":8.1668898064798512},"A"]
["Ilimit_inductor_Vinmax",{"$f":"CHOOSE(MODE, Ilimit_DC+Iripple_Vinmax/2, Ilimit_DC/Number_of_Phases+Iripple_Vinmax/2)","v":8.1668898064798512},"A"]
[]
[]
["CS threshold_min",0.05,"V"]
["CS threshold",5.6000000000000001E-2,"V"]
["CS threshold_max",6.2E-2,"V"]
[]
["Shunt required to get OCP at VIN(min)",{"$f":"Buck_CS_threshold/B79","v":6.8569555028853146E-3},"W"]
["Shunt required to get OCP at VIN(nom)",{"$f":"Buck_CS_threshold/B80","v":6.8569555028853146E-3},"W"]
["Shunt required to get OCP at VIN(max)",{"$f":"Buck_CS_threshold/B81","v":6.8569555028853146E-3},"W"]
[]
["Rs_ideal",{"$f":"B89","v":6.8569555028853146E-3},"W",null,null,"Ideal Rs for the required OCP -- based on 73mV CL threshold"]
["Rs",{"$f":"'Design Regulator'!E18/1000","v":5.0000000000000001E-3},"W",null,null,"Selected (starndard value) current limit sense resistor"]
[]
["Current limit - peak",{"$f":"Buck_CS_threshold/Rs","v":11.2},"A",null,null,"Peak inductor current limit = min sat current"]
[]
["Iout_OCP_Vinmin",{"$f":"Number_of_Phases*(Buck_CS_threshold/Rs-Iripple_Vinmin/2)","v":10.033110193520148},"A",null,null,"Current limit setpoints (i.e. IOUT) after standard components are selected"]
["Iout_OCP_Vinnom",{"$f":"Number_of_Phases*(Buck_CS_threshold/Rs-Iripple_Vinnom/2)","v":10.033110193520148},"A"]
["Iout_OCP_Vinmax",{"$f":"Number_of_Phases*(Buck_CS_threshold/Rs-Iripple_Vinmax/2)","v":10.033110193520148},"A"]
[]
["Irms_OCP_Vinmin",{"$f":"SQRT((Iout_OCP_Vinmin/Number_of_Phases)^2+(Iripple_Vinmin^2)/12)","v":10.055703726184793},"A"]
["Irms_OCP_Vinnom",{"$f":"SQRT((Iout_OCP_Vinnom/Number_of_Phases)^2+(Iripple_Vinnom^2)/12)","v":10.055703726184793},"A"]
["Irms_OCP_Vinmax",{"$f":"SQRT((Iout_OCP_Vinmax/Number_of_Phases)^2+(Iripple_Vinmax^2)/12)","v":10.055703726184793},"A"]
[]
["Pshunt_Vinmin",{"$f":"B101^2*Rs","v":0.50558588714403374},"W",null,null,"Max power dissipations in shunt"]
["Pshunt_Vinnom",{"$f":"B102^2*Rs","v":0.50558588714403374},"W"]
["Pshunt_Vinmax",{"$f":"B103^2*Rs","v":0.50558588714403374},"W"]
[]
[]
["Step 4: Output Capacitor"]
["Icoutrms_VINmin",{"$f":"Iripple_Vinmin/SQRT(12)","v":0.67370414388577271},"A",null,null,"Output Cap RMS current"]
["Icoutrms_VINnom",{"$f":"Iripple_Vinnom/SQRT(12)","v":0.67370414388577271},"A"]
["Icoutrms_VINmax",{"$f":"Iripple_Vinmax/SQRT(12)","v":0.67370414388577271},"A"]
["Max Cout rms current",{"$f":"MAX(B111:B113)","v":0.67370414388577271},"A"]
[]
["Vripple1",{"$f":"'Design Regulator'!E32/1000","v":0.1},"V",null,null,"Output voltage ripple spec(pk-pk)"]
[]
["Output Ripple Spec (pk-pk)",{"$f":"Vo1_ripple*1000","v":100},"mV",null,null,"Vout ripple spec at Vin(nom)"]
[]
["Coutmin",{"$f":"Iripple_Vinnom/(Fsw*8*Vo1_ripple)","v":1.3260111437271041E-6},"F",null,null,"Minimum output capacitnace",null,{"$f":"Vo2_ripple","v":0},1]
["Reported Coutmin",{"$f":"IF(Cout_min*1000000<2, 2.2,Cout_min*1000000)","v":2.2000000000000002},"uF"]
["Cout",{"$f":"'Design Regulator'!E34/1000000","v":4.0000000000000003E-5},"F",null,null,"Chosen output capacitance",null,null,1]
["Resrmax",{"$f":"SQRT((Vo1_ripple/Iripple_Vinnom)^2-(1/(Fsw*Cout*8))^2)","v":4.2825396747946609E-2},"W",null,null,"Max ESR before ripple exceeds Vripple1",null,null,1]
[]
["Reported Cout ESR max",{"$f":"IF(OR(CoutEsrMax>0.3, CoutEsrMax<0, (ISERROR(CoutEsrMax))), \"N/A\", CoutEsrMax*1000)","v":42.825396747946613},"mΩ"]
["CoutEsr",{"$f":"'Design Regulator'!E36/1000","v":1E-3},"W",null,null,"Chosen ESR",null,null,1,null,{"$f":"ISERROR(CoutEsrMax)","v":false},{"$f":"ISERROR(B125)","v":false}]
["Vripple",{"$f":"Iripple_Vinnom*SQRT(Cout_ESR^2+(1/(8*Fsw*Cout))^2)","v":4.0541259218133856E-3},"Vp-p",null,null,null,null,null,null,null,null,{"$f":"OR(CoutEsrMax>0.3,CoutEsrMax<0)","v":false}]
[null,null,null,null,null,null,null,null,null,null,{"$f":"OR(TRUE, FALSE, TRUE)","v":true}]
["Step 5: Input Capacitor"]
[null,null,null,null,null,null,null,null,null,null,"Two channels operating at full load"]
["Icinrms_VINmin",{"$f":"SQRT(D1_Vinmin_2*(Iout^2*(1-D1_Vinmin_2)+Iripple_Vinmin^2/12))","v":1.8256160638616385},"A",{"$f":"D1_Vinmax","v":0.27499999999999997},null,"Calculate input cap rms current with one output unloaded",null,null,null,null,{"$f":"SQRT(Iout^2*D1_Vinmin*(1-D1_Vinmin)+Iout2^2*D2_Vinmin*(1-D2_Vinmin)-2*Iout*Iout2*D1_Vinmin*D2_Vinmin)","v":{"$error":"#NAME?"}},"A",{"$f":"SQRT(Iout^2*D1_Vinmin*(1-D1_Vinmin)+Iout2^2*D2_Vinmin*(1-D2_Vinmin)-2*Iout*Iout2*(0.5-D2_Vinmin*(1-D1_Vinmin)))","v":{"$error":"#NAME?"}},"A"]
["Icinrms_VINnom",{"$f":"SQRT(D1_Vinnom_2*(Iout^2*(1-D1_Vinnom_2)+Iripple_Vinnom^2/12))","v":1.8256160638616385},"A",{"$f":"D1_Vinmin","v":0.27499999999999997},null,null,null,null,null,null,{"$f":"SQRT(Iout^2*D1_Vinnom*(1-D1_Vinnom)+Iout2^2*D2_Vinnom*(1-D2_Vinnom)-2*Iout*Iout2*D1_Vinnom*D2_Vinnom)","v":{"$error":"#NAME?"}},"A"]
["Icinrms_VINmax",{"$f":"SQRT(D1_Vinmax_2*(Iout^2*(1-D1_Vinmax_2)+Iripple_Vinmax^2/12))","v":1.8256160638616385},"A",null,null,null,null,null,null,null,{"$f":"SQRT(Iout^2*D1_Vinmax*(1-D1_Vinmax)+Iout2^2*D2_Vinmax*(1-D2_Vinmax)-2*Iout*Iout2*D1_Vinmax*D2_Vinmax)","v":{"$error":"#NAME?"}},"A"]
["Icinrms - multiphase",{"$f":"Iout*SQRT((D1_Vinmin-F136/Number_of_Phases)*((F136+1)/Number_of_Phases-D1_Vinmin))","v":1.7860571099491751},"A",null,null,null,null,null,null,null,{"$f":"MAX(K131:K133)","v":{"$error":"#NAME?"}},"A"]
["Max Cin rms current",{"$f":"MAX(B131:B133)","v":1.8256160638616385},"A",null,null,{"$f":"Number_of_Phases*D1_Vinnom","v":0.27499999999999997},"N*D"]
[null,null,null,null,null,{"$f":"FLOOR(Number_of_Phases*D1_Vinnom,1)","v":0},"floor(N*D)"]
["Icinrms - multiphase - max",{"$f":"Iout/2/Number_of_Phases","v":2},"A"]
["Final result",{"$f":"IF(D1_Vinmin<0.5, B135, B137)","v":1.8256160638616385},"A","…report this"]
[]
["Vinripple1",{"$f":"'Design Regulator'!E41/1000","v":0.3},"Vp-p",null,null,"Input voltage ripple spec (pk-pk)"]
[]
["Cinmin_Vinmin",{"$f":"Iout/Number_of_Phases*D1_Vinmin*(1-D1_Vinmin)/(Vinripple1*Fsw)","v":1.2083333333333333E-6},"F"]
["Cinmin_Vinnom",{"$f":"Iout/Number_of_Phases*D1_Vinnom*(1-D1_Vinnom)/(Vinripple1*Fsw)","v":1.2083333333333333E-6},"F"]
["Cinmin_Vinmax",{"$f":"Iout/Number_of_Phases*D1_Vinmax*(1-D1_Vinmax)/(Vinripple1*Fsw)","v":1.2083333333333333E-6},"F",null,null,"Calculate cap at Vinmax and 50% duty cycle (Vin = 2*Vout)"]
[]
["Cinmin_50%D",{"$f":"Iout*0.5*(1-0.5)/(Vinripple1*Fsw)","v":1.5151515151515152E-6},"F",null,null,"Buck 50% typically worst case"]
["Cinmin",{"$f":"IF(D1_Vinmin<0.5, B142,B146)","v":1.2083333333333333E-6},"F",{"$f":"(VIN_min+VIN_max)/2","v":12}]
["Reported Cinmin",{"$f":"IF(Cinmin*1000000<2.2, 2.2,Cinmin*1000000)","v":2.2000000000000002},"uF",{"$f":"2*Vout","v":6.6},null,"…report this"]
[]
["Cin",{"$f":"'Design Regulator'!E43/1000000","v":4.3999999999999999E-5},"F",null,null,"Input capacitance"]
["CinEsrMax_Vinmax",{"$f":"-(Iout/Number_of_Phases*D1_Vinmax*(1-D1_Vinmax)/(Cin*Fsw)-Vinripple1)/(Iout/Number_of_Phases+Iripple_Vinmax/2)","v":5.6467502610654211E-2},"W"]
["CinEsrMax_50%D",{"$f":"-(Iout/Number_of_Phases*0.5*(1-0.5)/(Cin*Fsw)-Vinripple1)/(Iout/Number_of_Phases+Iripple_Vinmax/2)","v":5.6062628067725731E-2},"W",null,null,"Calculate ESR at Vinmax and 50% duty cycle (Vin = 2*Vout)"]
["CinEsrMax",{"$f":"IF(VIN_max<2*Vout, B151,B152)","v":5.6062628067725731E-2},"W"]
["Reported Cin ESR max",{"$f":"IF(OR(CinEsrMax>0.3, CinEsrMax<0), \"N/A\",CinEsrMax*1000)","v":56.062628067725733},"mΩ",null,null,"…report this"]
["RCinEsr",{"$f":"'Design Regulator'!E45/1000","v":1E-3},"W",null,null,"Input capacitance series resistance (ESR)"]
[]
["Vinripple2_Vinmin",{"$f":"Iout/Number_of_Phases*D1_Vinmin_2*(1-D1_Vinmin_2)/(Cin*Fsw)+(Iout/Number_of_Phases +Iripple_Vinmin/2)*RCinEsr","v":1.3449383601686161E-2},"Vp-p"]
["Vinripple2_Vinnom",{"$f":"Iout/Number_of_Phases*D1_Vinnom_2*(1-D1_Vinnom_2)/(Cin*Fsw)+(Iout/Number_of_Phases +Iripple_Vinnom/2)*RCinEsr","v":1.3449383601686161E-2},"Vp-p"]
["Vinripple2_Vinmax",{"$f":"Iout/Number_of_Phases*D1_Vinmax_2*(1-D1_Vinmax_2)/(Cin*Fsw)+(Iout/Number_of_Phases +Iripple_Vinmax/2)*RCinEsr","v":1.3449383601686161E-2},"Vp-p"]
["Vinripple2_50%D",{"$f":"Iout/Number_of_Phases*0.5*(1-0.5)/(Cin*Fsw)+(Iout/Number_of_Phases +Iripple_Vinmax/2)*RCinEsr","v":1.5497468318876547E-2},"Vp-p",null,null,"Calculate ripple at Vinmax and 50% duty cycle (Vin = 2*Vout)"]
["Vinripple2",{"$f":"IF(D1_Vinmin<0.5, B157,B160)","v":1.3449383601686161E-2},"Vp-p",null,null,"…report highest of these"]
[]
[null,{"$f":"Iout*D1_Vinmax_2*(1-D1_Vinmax_2)/(Cin*Fsw)","v":8.2824937952063089E-3},"Vp-p"]
[]
["Step 6a: Soft Start"]
["Tss",{"$f":"'Design Regulator'!E50/1000","v":0},"s","Soft-start time"]
["Iss",{"$f":"Cout*Vout/Tss","v":{"$error":"#DIV/0!"}},"A","Load cap current during soft start"]
["Css",{"$f":"0.000022*Tss/1.2","v":0},"F"]
["Css_u",{"$f":"'Standard Value Calculator'!B4","v":0},"F"]
[]
["Step 6b: Other Components - Dither, Hiccup, DEMB, MODE"]
["Tres",{"$f":"'Design Regulator'!E53/1000","v":5.0000000000000001E-3},"s","Hiccup time"]
["Cres",{"$f":"0.00002*Tres/1.2","v":8.3333333333333338E-8},"F"]
["Cres_u",{"$f":"'Standard Value Calculator'!G4","v":8.2000000000000006E-8},"F"]
[]
["RPG1/2",100,"kΩ"]
["RFB1/2",null,"W",null,"Tie to VDDA or AGND for 3.3V/5V output, respectively. "]
["R_MODE",null,"W",null,"Tie to VDDA or AGND for Single/Dual operation, respectively. "]
["R_DEMB",null,"W",null,"Tie to VDDA or AGND for FPWM/DEM, respectively. "]
[]
["Enable Hysteresis Current",1.0000000000000001E-5,"A",null,"10 µA Hysteresis Current"]
["Turn ON Voltage",{"$f":"'Design Regulator'!E52","v":6}]
["Hysteresis Voltage",{"$f":"'Design Regulator'!E52-'Design Regulator'!E53","v":1}]
[]
["Upper FB resistor",{"$f":"B183/B181","v":99999.999999999985},"W"]
["Lower FB resister",{"$f":"B185/(B182-1)","v":19999.999999999996},"W"]
["Standard upper FB resistor",{"$f":"'Standard Value Calculator'!S40","v":100},"kΩ"]
["Standard lower FB resistor",{"$f":"'Standard Value Calculator'!S41","v":20},"kΩ"]
[]
["Dither Modulation Frequency",{"$f":"'Design Regulator'!E56*1000","v":41200},"Hz"]
["Cdither_calculated",{"$f":"10*10^-6/Fdither/0.12","v":2.0226537216828479E-9},"F"]
["Cdither_stdvalue",{"$f":"'Standard Value Calculator'!S21","v":2.1999999999999998E-9},"F"]
[]
[]
["Step 7: Compensation"]
["Pi",3.1415926500000002,null,"p"]
["CS Amp Gain",10]
["Ri",{"$f":"Rs*CSAmp_gain","v":0.05},"W",null,null,"Current Sense effective resistance = shunt resistor Rs * CS amp gain"]
["gm",{"$f":"IF(COMP_TYPE=1,0.00003,0.0012)","v":1.1999999999999999E-3},"S",null,null,"Error Amp Transconductance"]
[]
["Se_ext",{"$f":"B205/Ri*1000","v":10000000},"A/s",null,null,"Slope Comp Slope - referred to inductor current"]
["Sn",{"$f":"(Vin-Vout)/Lf","v":18510638.297872342},"A/s",null,null,"On-time Slope"]
["Sf",{"$f":"Vout/Lf","v":7021276.5957446815},"A/s",null,null,"Off-time Slope"]
[]
["Se_int",{"$f":"Fsw*0.001*(5/22)","v":500},"mV/μs",null,null,"Slope Comp Slope - referred to IC"]
["Sn_int",{"$f":"Sn*Ri/1000","v":925.53191489361711},"mV/μs",null,null,"etc"]
["Sf_int",{"$f":"Sf*Ri/1000","v":351.06382978723406},"mV/μs",null,null,"etc"]
[]
["mc_buck",{"$f":"1+Se_ext/Sn","v":1.5402298850574712},null,null,null,"mc = 1 + Se/Sn for peak current-mode buck"]
["k_buck",{"$f":"mc_buck*(1-D1_Vinnom_2)","v":1.1130147072886185},null,null,null,"mc*(1-d)"]
[]
["mc",{"$f":"1+Se_ext/Sn","v":1.5402298850574712}]
["k",{"$f":"mc_buck*(1-D1_Vinnom_2)","v":1.1130147072886185}]
["Q",{"$f":"1/Pi/(k-0.5)","v":0.51925326221846524},null,null,null,"1/(Pi*(k-0.5))",null,"Q = 2/Pi = 0.636 gives ideal one-cycle damping"]
[]
["Error Amp (EA)"]
["GBW",6,"MHz",null,null,"EA gain-bandwidth product"]
["Cbw",{"$f":"gm/(2*Pi*GBW*1000000)","v":3.1830988654751269E-11},"F",null,null,"EA effective bandwidth limiting capacitance = gm/(2*Pi*GBW)"]
["RoEA",64000000,"W",null,null,"EA output resistance"]
["AEA",{"$f":"gm*RoEA","v":76800},"V/V",null,null,"EA DC gain = gm*RoEA"]
["Afb",{"$f":"IF(VOUT_setting=1,Vref/Vout,SQRT((1+(Fcross*zterm1)^2)/((1+Afbr-pterm4*(Fcross)^2)^2+(Fcross*pterm3)^2)))","v":0.22538540516538388},"V/V",null,null,"Feedback gain from Vout to FB"]
["Acs",{"$f":"1/Ri","v":20},null,null,null,"Acs = 1/Ri"]
["Am_buck",{"$f":"(Ro/Number_of_Phases)/Ri/((1+Ro/Number_of_Phases*(k-0.5)/(Fsw*Lf)))","v":11.080462780730052}]
["Am",{"$f":"(Ro*Number_of_Phases)/Ri/((1+Ro*Number_of_Phases*(k-0.5)/(Fsw*Lf)))","v":11.080462780730052},null,null,null,"Buck modulator gain"]
[]
["Scaling factor to calculate Rcomp - buck",{"$f":"2*Pi*Ri/gm","v":261.79938750000002},null,null,null,"2*Pi*Ri/gm -- scaling factor to calculate Rcomp given desired buck crossover frequency"]
["DC Gain is Adc = AEA*Afb*Am"]
[]
["Ro",{"$f":"Rout","v":0.82499999999999996},"W",null,null,"Output Resistance"]
[]
["Fp_load_buck",{"$f":"1/(2*Pi*Ro*Cout)+(k-0.5)/(2*Pi*Fsw*Lf*Cout/Number_of_Phases)","v":7181.7823146584406},"Hz",null,null,"Buck dominant pole frequency -- note slope comp influence"]
["Fp_dominant",{"$f":"Fload_u","v":7181.7823146584406},"Hz"]
[null,{"$f":"Cbw","v":3.1830988654751269E-11}]
["Fp_EA",{"$f":"1/(2*Pi*(RoEA+Rcea1_u)*Cc1ea_u)","v":1.1302558515377561},"Hz",null,null,"Error Amp LF pole -- related to amplifier ouptut resistance and comp cap"]
["Fp_HF",{"$f":"1/(2*Pi*Rcea1_u*(Cc2ea_u+Cbw))","v":492761.22437736712},"Hz",null,null,"Error Amp HF pole cancels zero related to Output Cap ESR"]
["Fesr",{"$f":"1/(2*Pi*Cout*Cout_ESR)","v":3978873.5818439089},"Hz",null,null,"Cout ESR zero frequency"]
["F_mod",{"$f":"Fsw/2","v":1100000},"Hz",null,null,"Zero-order sample-and-hold effects of current-mode control modeled as pole at Fsw/2"]
[null,null,null,"Internal Comp Crossover"]
["Desired Crossover Frequency",{"$f":"CHOOSE(COMP_TYPE,Fcross_Ch2,'Design Regulator'!E62*1000)","v":50000},"Hz",{"$f":"Fsw/50","v":44000}]
["Rcea1",{"$f":"Fcross*Cout/Number_of_Phases*2*Pi*Ri/(gm*Afb)","v":2323.1263560113507},"W",null,null,"This component will largely determine the crossover frequency",null,null,null,null,{"$f":"Fcross/Fp_dominant/(gm*Afb*Am)","v":2323.1263560113512}]
["Cc1ea, Cc3ea",{"$f":"10/(Rcea1*Fcross*2*Pi)","v":1.370178964755189E-8},"F",null,null,"This along with Rcea1 will set a zero at Fcrossover/5 to optimize phase margin"]
["Cc2ea, Cc4ea",{"$f":"MAX(1/(Rcea1*2*Pi*Fesr)-Cbw, 1/(Rcea1*2*Pi*(Fsw/2))-Cbw)","v":3.0449873379575508E-11},"F",null,null,"This along with Rcea1 places a pole at the output cap ESR zero"]
[]
[{"$f":"CHOOSE(COMP_TYPE,\"Internal Compensation\",\"External Compensation\")","v":"External Compensation"}]
["Chosen Compensation Components from the standard value sheet",null,null,"Internal Values"]
["Rcea1_u",{"$f":"CHOOSE(COMP_TYPE,D246,'Design Regulator'!D69*1000)","v":6000},"W",400000,null,null,{"$f":"1/(Rcea1*2*Pi*(Fsw/2))-Cbw","v":3.0449873379575508E-11}]
["Cc1ea_u",{"$f":"CHOOSE(COMP_TYPE,Cc3ea_u,'Design Regulator'!D70*0.000000001)","v":2.2000000000000003E-9},"F",{"$f":"50*0.000000000001","v":5.0000000000000002E-11}]
["Cc2ea_u",{"$f":"CHOOSE(COMP_TYPE,Cc4ea_u,'Design Regulator'!D71*0.000000000001)","v":2.1999999999999998E-11},"F",{"$f":"0.000000000001","v":9.9999999999999998E-13}]
[]
["Resulting Pole/Zero Locations",null,null,null,null,{"$f":"Cout","v":4.0000000000000003E-5},{"$f":"Cout_ESR","v":1E-3}]
["Fz1",{"$f":"1/(2*Pi*Rcea1_u*Cc1ea_u)","v":12057.192672254268},"Hz",null,null,"This zero is set at or close to the dominant load pole"]
["Fp2",{"$f":"1/(2*Pi*Rcea1_u*(Cc1ea_u*(Cc2ea_u+Cbw)/(Cc1ea_u+Cc2ea_u+Cbw)))","v":504818.41704962141},"Hz",null,null,"This pole cancels the zero from the Output Cap ESR"]
[null,null,null,"Internal Values"]
["Rfb1",{"$f":"IF(VOUT_setting=1,'Design Regulator'!E64*1000,2500000)","v":2500000},"W",null,null,"Upper Feedback Resistance - chosen by user"]
["Rfb2",{"$f":"IF(Vout=Vref,100000000,Vref*B254/((Vout-Vref)))","v":800000},"W",null,null,"Lower Feedback Resistance"]
["Rfb2_u",{"$f":"IF(Vout=Vref,\"N/A\",CHOOSE(VOUT_setting,'Standard Value Calculator'!S11,471000,792000,177000))","v":792000},"W",null,null,"Std Value Lower Feedback Resistance"]
[]
["Rff",20000,"W"]
["Cff",3.67E-13,"F"]
["Cfb",2.1999999999999999E-12,"F"]
[]
["wff",{"$f":"1/(2*Pi*Rff*Cff)","v":21683234.778440922},"Hz"]
["wfbt",{"$f":"1/(2*Pi*Rfb1_*Cfb)","v":28937.262413410252},"Hz"]
["wfbb",{"$f":"1/(2*Pi*Rfb2_u*Cfb)","v":91342.368729199035},"Hz"]
["w1",{"$f":"1/(2*Pi*Rff*Cfb)","v":3617157.8016762817},"Hz"]
["wfft",{"$f":"1/(2*Pi*Cff*Rfb1_)","v":173465.8782275274},"Hz"]
["Cfb*(Rff+RFBT)/(Rff*RFBT))",{"$f":"2*Pi*Cfb*(Rff+Rfb1_)/(Rff*Rfb1_)","v":6.96679586064E-16},"Hz"]
[]
[]
[]
[]
["Other Input Variables"]
["Rfets",0,"W","Series resistance due to FETs"]
["Diode loss eq res",{"$f":"0.00000002*Fsw*0.6*4/Iripple1","v":{"$error":"#NAME?"}}]
["Fet loss eq res",{"$f":"_Don2*RdsonTop+Doff2*RdsonBot","v":{"$error":"#NAME?"}}]
["cap loss eq res",{"$f":"B277*Vin^2*Fsw/2/(((Iripple1/SQRT(3))^2))","v":{"$error":"#NAME?"}}]
["Sw cap",5.0000000000000001E-9]
[]
["Step 8: AEF"]
[]
["VinRipple_dBuV",{"$f":"20*LOG10(Vinripple2*1000000)","v":82.57404761313181},"dBuV"]
["CISPR 25 limit",{"$f":"CHOOSE(OSC,35,50)","v":{"$error":"#VALUE!"}},"dBuV","Chooses CISPR conducted limit 35 at 2.1MHz and 50 at 440kHz"]
["Attenuation required",{"$f":"VinRipple_dBuV-B282+3","v":{"$error":"#VALUE!"}},"dBuV","Margin of attenuation req"]
["Filter Frequency Required",{"$f":"Fsw/(POWER(10,Attn_req/40))","v":{"$error":"#VALUE!"}},"Hz","assume 40db/decade drop and set frequency based on attenuation"]
[]
["Lfilter",{"$f":"'Design Regulator'!E48","v":0},"uH","user input"]
[]
["Gop_AEF",{"$f":"CHOOSE(OSC,20,100)","v":{"$error":"#VALUE!"}}]
["n",3,null,null,null,"n should be 2 or 3"]
[]
["Passive Cf",{"$f":"1000000/(LinfilterPssv*POWER(2*Pi*Fx_infilter,2))","v":{"$error":"#REF!"}},"uF",{"$f":"#REF!*0.000001","v":{"$error":"#REF!"}}]
["Cinj_AEF",{"$f":"1000000/(L_infilter*Gop_AEF*0.000001*POWER(2*Pi*Fx_infilter,2))","v":{"$error":"#VALUE!"}},"uF",{"$f":"'Design Regulator'!#REF!*0.000001","v":{"$error":"#REF!"}}]
[]
["Cdamp_AEF",{"$f":"CHOOSE(OSC,0,Cinj_AEF/nAEF)","v":{"$error":"#VALUE!"}},"uF",{"$f":"'Design Regulator'!#REF!*0.000001","v":{"$error":"#REF!"}}]
["Rdamp_AEF",{"$f":"CHOOSE(OSC,SQRT(L_infilter*Gop_AEF/(Cinj_AEF)),1.09*SQRT(L_infilter*Gop_AEF/Cinj_AEF))","v":{"$error":"#VALUE!"}},"Ω",{"$f":"'Design Regulator'!#REF!","v":{"$error":"#REF!"}}]
["Ccomp_AEF",{"$f":"CHOOSE(OSC,5,1)","v":{"$error":"#VALUE!"}},"nF",{"$f":"B296*0.000000001","v":{"$error":"#VALUE!"}},null,"AEF Comp network & sense is specifically defined at 2.2MHz at 440kHz"]
["Rcomp_AEF",{"$f":"CHOOSE(OSC,200,1000)","v":{"$error":"#VALUE!"}},"Ω"]
["Csen_AEF",{"$f":"Gop_AEF*B296","v":{"$error":"#VALUE!"}},"nF",{"$f":"B298*0.000000001","v":{"$error":"#VALUE!"}}]
[]
["Rd_AEF",{"$f":"SQRT(L_infilter*0.000001/Cin)","v":0},null,{"$f":"'Standard Value Calculator'!S14","v":{"$error":"#NUM!"}}]
[]
["Attenuation at Fsw",{"$f":"#REF!","v":{"$error":"#REF!"}},"dBuV"]
["Conducted EMC at Fsw",{"$f":"VinRipple_dBuV+B302","v":{"$error":"#REF!"}},"dBuV"]
[]
[]
["Step 8: Efficiency"]
["VAR",0]
["Design"]
["Ta",{"$f":"'Design Regulator'!E13","v":25},"°C","Ambient Temperature"]
["Components"]
["LTc",{"$f":"4000/1000000","v":4.0000000000000001E-3},"%/°C","Inductor DCR Temp Co"]
["θCA",20,"°C/W","Inductor Core to Ambient Thermal Resistance"]
["RCinEsr",{"$f":"RCinEsr","v":1E-3},"W","Input Capacitor ESR"]
[]
["Controller Characteristics"]
["BIAS",{"$f":"'Design Regulator'!E100","v":12},"V"]
["VCC",{"$f":"CHOOSE(VOUT_setting,8,5,5,8)","v":5},"V","with 170mA current limit"]
["Top Driver"]
["RdsonDRT",1,"W","Drain-Source Resistance of Pullup High-side FET Driver"]
["RdsonDRT2",0.5,"W","Drain-Source Resistance of Pulldown High-side FET Driver"]
["Bottom Driver"]
["RdsonDRB",1,"W","Drain-Source Resistance of Pullup Low-side FET Driver"]
["RdsonDRB2",0.5,"W","Drain-Source Resistance of Pulldown Low-side FET Driver"]
["Deadtime"]
["Deadtime",1.4E-8,"s","Total Deadtime",null,null,"14ns for LM513-Q1"]
["IQ"]
["IQ ",2.2000000000000001E-6,"A","Quiescent Current of LM5143-Q1 Controller (One channel disabled)"]
[]
["High- & low-side MOSFETs - Ch1","Q1: high-side",null,"Q2: low-side"]
["Rdson",{"$f":"'Design Regulator'!E80/1000","v":2.4E-2},"W",{"$f":"'Design Regulator'!F80/1000","v":1.7999999999999999E-2},"W","Drain-Source Resistances of Channel 1 FETs"]
["RdsonTopTc",{"$f":"4000/1000000","v":4.0000000000000001E-3},"%/°C",4.0000000000000001E-3,"%/°C","Drain-Source Resistance Temp Co"]
["Qg",{"$f":"'Design Regulator'!E81/1000000000","v":3E-9},"C",{"$f":"'Design Regulator'!F81/1000000000","v":4.0999999999999995E-9},"C","Gate Charge at VCC = 5V"]
["Qgd",{"$f":"'Design Regulator'!E82/1000000000","v":6.9999999999999996E-10},"C",{"$f":"'Design Regulator'!F82/1000000000","v":1.0000000000000001E-9},"C","Gate to Drain Charge"]
["Qgs",{"$f":"'Design Regulator'!E83/1000000000","v":6.9999999999999996E-10},"C",{"$f":"'Design Regulator'!F83/1000000000","v":8.9999999999999999E-10},"C","Gate to Source Charge"]
["Qoss",{"$f":"'Design Regulator'!E84/1000000000","v":0},"C",{"$f":"'Design Regulator'!F84/1000000000","v":3E-9},"C","Output Charge"]
["Coss",{"$f":"'Design Regulator'!E85/1000000000000","v":2.5000000000000002E-10},"F",{"$f":"'Design Regulator'!F85/1000000000000","v":3.4999999999999998E-10},"F","Output Capacitance"]
["Rgate",{"$f":"'Design Regulator'!E86","v":3.5},"W",{"$f":"'Design Regulator'!F86","v":3},"W","Gate Resistance"]
["Gfs",{"$f":"'Design Regulator'!E87","v":71},"S",{"$f":"'Design Regulator'!F87","v":90},"S","Transconductance"]
["Vth",{"$f":"'Design Regulator'!E88","v":1.8},"V",{"$f":"'Design Regulator'!F88","v":1.8},"V","Threshold Voltage"]
["Vsp",{"$f":"Vth_Q1+(Iout/Number_of_Phases)/Gfs_Q1","v":1.8563380281690141},"V",{"$f":"Vth_Q2+(Iout/Number_of_Phases)/Gfs_Q2","v":1.8444444444444446},"V","Switch Point Voltage of FETs"]
[]
["Vsd - Buck",{"$f":"'Design Regulator'!E89","v":0.8},"V",{"$f":"'Design Regulator'!F89","v":0.8},"V","Diode Forward Voltage of MOSFET Body diode"]
["QrrTop",null,"C",{"$f":"'Design Regulator'!F90/1000000000","v":2.9999999999999997E-8},"C","Reverse Recovery Charge of Body Diode"]
["TrrTop",4.0000000000000001E-8,"s",4.0000000000000001E-8,"s","Reverse Recovery Time of Body Diode"]
["θJA-MOSFET",{"$f":"'Design Regulator'!E91","v":15},"°C/W",{"$f":"'Design Regulator'!F91","v":15},"°C/W","Junction-to-Ambient Resistance"]
[]
[]
[]
["Anti-parallel Schottky Diode (optional)"]
["VfdSky",{"$f":"'Design Regulator'!F94","v":0},"V",{"$f":"'Design Regulator'!#REF!","v":{"$error":"#REF!"}},"V","Diode Forward Voltage"]
["QrrSky",{"$f":"'Design Regulator'!F95/1000000000","v":0},"C",{"$f":"'Design Regulator'!#REF!/1000000000","v":{"$error":"#REF!"}},"C","Diode Reverse Recovery Charge"]
["Ireverse",0,"A",0,"A","Reverse Leakage Current"]
[]
["Controller"]
["θJACtrl",34.1,"°C/W",null,null,"Junction-to-ambient thermal resistance of controller"]
["Outputs"]
["Top FET"]
["Tr",{"$f":"(Qgd_Q1+Qgs_Q1/2)*(RdsonDRT+Rgate1)/(VCC-Vsp_Q1)","v":1.5030241935483868E-9},"s"]
["Tf",{"$f":"(Qgd_Q1+Qgs_Q1/2)*(RdsonDRT2+Rgate1)/(Vsp_Q1)","v":2.2625189681335355E-9},"s"]
[]
["IC Power Disipation","Value","Units"]
["Power Dis",{"$f":"CHOOSE(Ext_VCC, (Qg_Q1+Qg_Q2)*Fsw*BIAS, (Qg_Q1+Qg_Q2)*Fsw*Vin)","v":0.18744},"W"]
["Temp rise",{"$f":"B362*ThetaJaCtrl","v":6.3917039999999998},"°C"]
["Junction temperature",{"$f":"B363 + Ta","v":31.391704000000001},"°C"]
[]
["Current (switching)",{"$f":"(Qg_Q1+Qg_Q2)*Fsw+Iq","v":1.5622199999999999E-2},"A"]
["Qrr Current",{"$f":"Qrr_Q2*Fsw","v":6.5999999999999989E-2},"A"]
["Diode Current",{"$f":"C368/Vin","v":{"$error":"#NAME?"}},{"$f":"Deadtime*Fsw*(Ipp/2)*(Vsd_Q1+Vsd_Q2)","v":{"$error":"#NAME?"}}]
["Total Application Switching IQ",{"$f":"SUM(B366:B368)","v":{"$error":"#NAME?"}},"A"]
[]
["Low-side MOSFET/Diode"]
["Part Power"]
["Power Dis"]
[]
["SCHEMATIC LABELS"]
[{"$f":"\"RC1 = \"&'Design Regulator'!D69&\"kΩ\"","v":"RC1 = 6kΩ"},{"$f":"'Design Regulator'!D69&\" kΩ\"","v":"6 kΩ"},null,{"$f":"'Design Regulator'!D72&\"kΩ\"","v":"kΩ"}]
[{"$f":"\"RC2 = \"&'Design Regulator'!D72&\"kΩ\"","v":"RC2 = kΩ"},{"$f":"'Design Regulator'!D72&\"kΩ\"","v":"kΩ"}]
[]
[{"$f":"\"Lo = \"&'Design Regulator'!E27&\"µH\"","v":"Lo = 0.47µH"},{"$f":"'Design Regulator'!E27&\" µH\"","v":"0.47 µH"},null,{"$f":"IF(MODE = 1, 'Design Regulator'!I27&\"µH\", 'Design Regulator'!E27&\"µH\")","v":"µH"}]
[{"$f":"\"Rdcr = \"&Rdcr*1000&\"mΩ\"","v":"Rdcr = 3.5mΩ"},{"$f":"Rdcr*1000&\" mΩ\"","v":"3.5 mΩ"},null,{"$f":"IF(MODE=1, Rdcr2*1000&\"mΩ\", Rdcr*1000&\"mΩ\")","v":"0mΩ"}]
[{"$f":"\"Rs = \"&'Design Regulator'!E18&\"mΩ\"","v":"Rs = 5mΩ"},{"$f":"'Design Regulator'!E18&\" mΩ\"","v":"5 mΩ"},null,{"$f":"IF(MODE = 1, 'Design Regulator'!I18&\"mΩ\", 'Design Regulator'!E18&\"mΩ\")","v":"mΩ"}]
[]
["IC",{"$f":"CHOOSE(GPN_setting,\"LM708A0(-Q1)\",\"LM70880(-Q1)\",\"LM70860(-Q1)\",\"LM70840(-Q1)\",\"LM706A0(-Q1)\",\"LM70660(-Q1)\",\"LM704A0(-Q1)\")","v":"LM70880(-Q1)"},null,null,null,{"$f":"GPN_setting","v":2}]
[]
[{"$f":"IF((INFILTER_TYPE=1),\"AEF IS DISABLED!\",\"AEF\")","v":"AEF"},{"$f":"IF((INFILTER_TYPE=1),\"\",\"0.1µF\")","v":"0.1µF"},{"$f":"IF((INFILTER_TYPE=1),\"\",\"0.47Ω\")","v":"0.47Ω"},{"$f":"IF((INFILTER_TYPE=1),\"\",\"3Ω\")","v":"3Ω"},{"$f":"IF((INFILTER_TYPE=1),\"\",\"50kΩ\")","v":"50kΩ"}]
[{"$f":"\"LAEF =\"&L_infilter&\" uF\"","v":"LAEF =0 uF"},{"$f":"IF((INFILTER_TYPE=1),\"\",L_infilter&\"µH\")","v":"0µH"}]
[{"$f":"\"Cinj =\"&CinjSel*1000000&\" uF\"","v":{"$error":"#REF!"}},{"$f":"IF((INFILTER_TYPE=1),\"\",CinjSel*1000000&\"µF\")","v":{"$error":"#REF!"}}]
[{"$f":"\"Cdamp =\"&CdampSel*1000000&\" uF\"","v":{"$error":"#REF!"}},{"$f":"IF((INFILTER_TYPE=1),\"\",IF(OSC=1,\"DNP\",CdampSel*1000000&\"µF\"))","v":{"$error":"#REF!"}}]
[{"$f":"\"Rdamp =\"&RdampSel&\"Ω\"","v":{"$error":"#REF!"}},{"$f":"IF((INFILTER_TYPE=1),\"\",RdampSel&\"Ω\")","v":{"$error":"#REF!"}}]
[{"$f":"\"Rcomp =\"&Rcomp_AEF&\"Ω\"","v":{"$error":"#VALUE!"}},{"$f":"IF((INFILTER_TYPE=1),\"\",Rcomp_AEF&\"Ω\")","v":{"$error":"#VALUE!"}}]
[{"$f":"\"Ccomp =\"&Ccomp_AEF*1000000000000&\"pF\"","v":{"$error":"#VALUE!"}},{"$f":"IF((INFILTER_TYPE=1),\"\",Ccomp_AEF*1000000000000&\"pF\")","v":{"$error":"#VALUE!"}}]
[{"$f":"\"Csen =\"&Csen_AEF*1000000&\"µF\"","v":{"$error":"#VALUE!"}},{"$f":"IF((INFILTER_TYPE=1),\"\",Csen_AEF*1000000&\"µF\")","v":{"$error":"#VALUE!"}}]
[null,"CDAMP"]
[]
[{"$f":"\"VOUT = \"&'Design Regulator'!E9&\"V\"","v":"VOUT = 3.3V"},{"$f":"'Design Regulator'!E9&\" V\"","v":"3.3 V"},null,{"$f":"IF(MODE=1, 'Design Regulator'!I10&\"V\", \"\")","v":"V"}]
[]
[{"$f":"\"COUT = \"&'Design Regulator'!$E$34&\"µF\"","v":"COUT = 40µF"},{"$f":"ROUND('Design Regulator'!$E$34/Number_of_Phases, 0)&\" µF\"","v":"40 µF"},null,{"$f":"IF(MODE=1, 'Design Regulator'!$I$34&\"µF\", ROUND('Design Regulator'!$E$34/Number_of_Phases, 0)&\"µF\")","v":"µF"}]
["Capacitance per component (Cout)",{"$f":"\"22µF\"","v":"22µF"}]
["# of output caps",{"$f":"ROUNDUP(Cout*1000000/22,0)&\" x\"","v":"2 x"}]
[]
["CIN",{"$f":"Cin*1000000&\"µF\"","v":"44µF"}]
["Capacitance per component (Cin)",{"$f":"\"10µF\"","v":"10µF"}]
["# of input caps",{"$f":"ROUNDUP(Cin*1000000/10,0)&\" x\"","v":"5 x"}]
["Cd",{"$f":"CHOOSE(INFILTER_TYPE,\"\",4*Cin*1000000&\"µF\")","v":{"$error":"#VALUE!"}}]
["Rd",{"$f":"CHOOSE(INFILTER_TYPE,\"\",D300&\"Ω\")","v":{"$error":"#VALUE!"}}]
[]
[{"$f":"\"RC1 = \"&Rcea1_u/1000&\"kΩ\"","v":"RC1 = 6kΩ"},{"$f":"IF(COMP_TYPE=1,\"100 kΩ\",ROUND(Rcea1_u/1000,2)&\" kΩ\")","v":"6 kΩ"}]
[{"$f":"\"CC1 = \"&Cc1ea_u*10^9&\"nF\"","v":"CC1 = 2.2nF"},{"$f":"IF(COMP_TYPE=1,\"\",Cc1ea_u*10^9&\" nF\")","v":"2.2 nF"}]
[{"$f":"\"CC2 = \"&IF(Cc2ea_u>0, Cc2ea_u*10^12&\"pF\", \"OPEN\")","v":"CC2 = 22pF"},{"$f":"IF(COMP_TYPE=1,\"\",IF(Cc2ea_u>0, ROUND(Cc2ea_u*10^12,1)&\" pF\", \"N/A\"))","v":"22 pF"}]
[]
[{"$f":"\"gm = \"&$B$199*1000&\"mS\"","v":"gm = 1.2mS"},{"$f":"$B$199*1000&\"mS\"","v":"1.2mS"}]
[{"$f":"\"RoEA = \"&RoEA/1000000&\"MΩ\"","v":"RoEA = 64MΩ"},{"$f":"RoEA/1000000&\"MΩ\"","v":"64MΩ"}]
[{"$f":"\"GBW = \"&GBW&\"MHz\"","v":"GBW = 6MHz"},{"$f":"GBW&\"MHz\"","v":"6MHz"}]
[]
[{"$f":"\"Cslope = \"&Cslope&\"pF\"","v":{"$error":"#NAME?"}},{"$f":"ROUND(Cslope*1,0)&\"pF\"","v":{"$error":"#NAME?"}}]
["Cd",{"$f":"IF(DITHER=1, ROUND(Cdither*1000000000,1)&\"nF\", \"\")","v":"2.2nF"},{"$f":"IF(DITHER=1, \"Cd\", \"\")","v":"Cd"}]
[{"$f":"\"RFB1 = \"&'Design Regulator'!E64&\"kΩ\"","v":"RFB1 = 100kΩ"},{"$f":"IF(VOUT_setting=1, 'Design Regulator'!E64&\" kΩ\", \"\")","v":""},null,{"$f":"'Design Regulator'!I64&\"kΩ\"","v":"kΩ"}]
[{"$f":"\"RFB2 = \"&IF(Vout=Vref,\"OPEN\",'Design Regulator'!E65&\"kΩ\")","v":"RFB2 = 792kΩ"},{"$f":"IF(VOUT_setting=1, IF(Vout=Vref,\"OPEN\",Rfb2_u/1000&\" kΩ\"), \"\")","v":""},null,{"$f":"IF(Vout2=Vref,\"OPEN\",Rfb4_u/1000&\"kΩ\")","v":"0kΩ"}]
[{"$f":"\"RFBSET = \"&CHOOSE(VOUT_setting,\"\",\"24.9kΩ\",\"0Ω\",\"48.7kΩ\")","v":"RFBSET = 0Ω"},null,null,{"$f":"CHOOSE(VOUT_setting,\"\",\"24.9 kΩ\",\"0 Ω\",\"48.7 kΩ\")","v":"0 Ω"}]
[]
["RENT",{"$f":"IF((UVLO_TYPE=1),B187&\" kΩ\",\"\")","v":""}]
["RENB",{"$f":"IF((UVLO_TYPE=1),B188&\" kΩ\",\"\")","v":""}]
[]
[{"$f":"\"Crossover Frequency = \"&ROUND('Stability Calculations'!U4,1)&\" kHz\"","v":"Crossover Frequency = 108.4 kHz"},{"$f":" ROUND('Stability Calculations'!U4,1)&\" kHz\"","v":"108.4 kHz"},null,{"$f":"'Stability Calculations'!U4","v":108.4}]
[{"$f":"\"Phase Margin = \"&ROUND('Stability Calculations'!U5,0)&\"°\"","v":"Phase Margin = 51°"},{"$f":"ROUND('Stability Calculations'!U5,0)&\"°\"","v":"51°"}]
[{"$f":"IF(loopPM<45,CHOOSE(COMP_TYPE,\"Phase Margin too low, Increase COUT\",\"Phase Margin too low, Re-compensate\"),\"\")","v":""}]
[]
["Full-load/high line efficiency",{"$f":"IF(PLOT_TYPE=1, ROUND('Efficiency Calculations'!AZ109,1)&\"%\", ROUND(#REF!,1)&\"%\")","v":"86.3%"}]
["Half-load/mid-line efficiency",{"$f":"IF(PLOT_TYPE=1, ROUND('Efficiency Calculations'!AZ59,1)&\"%\", ROUND(#REF!,1)&\"%\")","v":"86.1%"}]
["OSC pin setting",{"$f":"IF(VOUT_setting=1, \"\", IF(OSC=1, \"Tie OSC to VDDA\", \"Tie OSC to AGND\"))","v":"Tie OSC to AGND"}]
[]
[{"$f":"\"CDITH = \"&Cdither*1000000000&\"nF\"","v":"CDITH = 2.2nF"},{"$f":"Cdither*1000000000&\"nF\"","v":"2.2nF"}]
[{"$f":"\"Rs = \"&Rs&\"Ω\"","v":"Rs = 0.005Ω"},{"$f":"'Standard Value Calculator'!S6&\"Ω\"","v":"Ω"}]
["Rset",{"$f":"'Standard Value Calculator'!S16&\"mΩ\"","v":"6.81mΩ"}]
["Rs",{"$f":"'Standard Value Calculator'!S6&\"mΩ\"","v":"mΩ"}]
[{"$f":"\"Rshunt = \"&ROUND(Rshunt,1)&\"mΩ\"","v":{"$error":"#NAME?"}},{"$f":"IF(Rshunt=\"0\", \"N/A\",ROUND(Rshunt,1)&\"mΩ\")","v":{"$error":"#NAME?"}}]
[]
["Rpgood","20kΩ"]
["RFB1"]
["RFB2"]
["VCCX",{"$f":"IF((Ext_VCC=1),\"5V\",\"GND\")","v":"5V"}]
["RCNFG",{"$f":" 'Design Regulator'!E56&\" kΩ\"","v":"41.2 kΩ"}]
["Rt",{"$f":" Rfadj&\" kΩ\"","v":"9.09 kΩ"},{"$f":"Rfadj","v":9.09},{"$f":"Fsw","v":2200000},null,{"$f":"OR((Fsw=440000),(Fsw=2200000))","v":true},null,{"$f":"OR(OR(AND(OSC=1, OR(Fsw/1000>2530, Fsw/1000<1800)), AND(OSC=2, OR(Fsw/1000>500, Fsw/1000<300))), OR((Fsw=440000),(Fsw=2200000)))","v":true}]
["Css",{"$f":"'Standard Value Calculator'!B4*1000000000&\"nF\"","v":"0nF"},{"$f":"IF(MODE=1,\"Css\",\"\")","v":"Css"}]
["Cres",{"$f":"IF(Cres_u = 0, \"N/A\", Cres_u*1000000000 &\"nF\")","v":"82nF"},{"$f":"IF(Cres_u = 0, \"N/A\", Cres_u*1000000 &\"µF\")","v":"0.082µF"},{"$f":"Cres_u","v":8.2000000000000006E-8}]
[]
["Blank out",{"$f":"IF(B76=\"y\",\"\",\"|\")","v":"|"}]
["OUTPUT CURRENT",{"$f":"'Design Regulator'!$E$10&\" A\"","v":"4 A"},null,{"$f":"IF(MODE=1,'Design Regulator'!#REF!&\"A\",\"\")","v":{"$error":"#REF!"}}]
["VIN",{"$f":"VIN_nom&\" V\"","v":"12 V"}]
["VIN range",{"$f":"VIN_min&\"V\"&\"...\"&VIN_max&\"V\"","v":"12V...12V"}]
[null,{"$f":"IF(INFILTER_TYPE=1,B450,\"\")","v":""},{"$f":"IF(INFILTER_TYPE=1,\"\",B450)","v":"12V...12V"}]

{"sheet":"Schematic Management","index":5,"n_rows":17,"n_cols":14,"rows_kept":17,"cut":false,"hidden":true,"merged":[]}
[null,null,null,null,null,null,null,null,null,null,null,null,null,"3.3V or 5V fixed (FB1/2)"]
[{"$f":"IF(MODE=1, CHOOSE(SCH_SETTING, \"SCH_SetVout_IntComp_nEN\",\"SCH_SetVout_IntComp_EN\",\"SCH_SetVout_ExtComp_nEN\",\"SCH_SetVout_ExtComp_EN\",\"SCH_AdjVout_IntComp_nEN\",\"SCH_AdjVout_IntComp_EN\",\"SCH_AdjVout_ExtComp_nEN\",\"SCH_AdjVout_ExtComp_EN\"))","v":"SCH_SetVout_ExtComp_nEN"},null,null,null,null,null,null,null,null,"With/without dither (DITH)",null,null,null,"With/without VOUT connected to VCCX"]
[null,null,null,null,null,null,null,null,null,"FPWM or DEM (DEMB)"]
[null,null,null,null,null,null,null,null,null,"Shunt or inductor DCR current sensing"]
[]
[]
[]
[]
[]
[]
[]
[]
[]
[]
[]
[]
[null," "]

{"sheet":"Stability Calculations","index":6,"n_rows":687,"n_cols":35,"rows_kept":687,"cut":false,"hidden":true,"merged":[[9,1,10,1],[1,0,1,3],[1,9,1,11],[9,0,11,0],[9,18,9,19],[1,19,1,21],[10,6,10,7],[1,4,1,6],[9,2,9,7],[9,8,9,13],[9,20,9,22],[9,14,9,17],[1,12,1,14],[1,15,1,18],[9,27,9,28],[9,30,9,31],[10,2,10,3],[10,4,10,5],[10,8,10,9],[10,10,10,11],[10,12,10,13],[10,18,10,19],[10,14,10,15],[10,16,10,17]]}
[]
["Divider Network & EA Poles/Zeros",null,null,null,"Modulator",null,null,null,null,"Power Stage Poles/Zeros",null,null,"Complex Pole Pair",null,null,"Feedback natural frequencies",null,null,null,"Total System"]
[null,"Afb1",{"$f":"Afb","v":0.22538540516538388},"V/V","Acs",{"$f":"Acs","v":20},"A/V","gm",{"$f":"gm","v":1.1999999999999999E-3},"z_ESR",{"$f":"Fesr","v":3978873.5818439089},"Hz","p3",{"$f":"Fsw/2","v":1100000},"Hz","zterm1",{"$f":"((1/wffHz)+(1/wfftHz))","v":5.8109410928520001E-6},null,null,"Adc",{"$f":"IF(VOUT_setting=1,Am*Afb*AEA,Am*AEA)","v":850979.54156006803},"V/V"]
[null,"EA zero, z1",{"$f":"Fz1_u","v":12057.192672254268},"Hz","Am",{"$f":"Am","v":11.080462780730052},"V/V",null,null,"p_dom",{"$f":"Fp_dominant","v":7181.7823146584406},"Hz","pterm1",{"$f":"Q*pole3","v":571178.58844031172},null,"pterm3",{"$f":"((1/wfbtHz)+(1/wffHz)+(1/wfftHz)+(Afbr/wffHz))","v":4.051403656893155E-5},null,null,"Crossover",{"$f":"AI7","v":108.4},"kHz"]
[null,"EA pole, p1",{"$f":"Fp1_u","v":1.1302558515377561},"Hz","Q",{"$f":"Q","v":0.51925326221846524},null,null,null,null,null,null,"pterm2",{"$f":"pole3^2","v":1210000000000},null,"pterm4",{"$f":"1/(wffHz*wfbtHz)","v":1.5937437150456741E-12},null,null,"Phase Margin",{"$f":"AI9","v":51.251490800069917},"°"]
[null,"Aea",{"$f":"AEA","v":76800},"V/V","mc",{"$f":"mc","v":1.5402298850574712},null,null,null,null,null,null,null,null,null,"Afbr",{"$f":"Rfb1_/Rfb2_u","v":3.1565656565656566},null,null,"radconv",{"$f":"180/Pi","v":57.295779578552292},null,null,null,null,null,null,null,null,null,null,null,null,"XOVER SEARCH"]
[null,"EA pole, p2",{"$f":"Fp2_u","v":492761.22437736712},"Hz","k",{"$f":"k","v":1.1130147072886185},null,null,null,null,null,null,null,null,null,null,null,null,null,null,null,null,null,null,null,null,null,null,null,null,null,null,null,"xover",{"$f":"SUM(AH12:AH613)/1000","v":108.4}]
[]
[null,null,null,null,null,null,null,null,null,null,null,null,null,null,null,null,null,null,null,null,null,null,null,null,null,null,null,null,null,null,null,null,null,"phase margin",{"$f":"SUM(AI13:AI613)","v":51.251490800069917}]
["Freq (Hz)",null,"Power Stage",null,null,null,null,null,"Error Amplifier",null,null,null,null,null,"Feedback Gain",null,null,null,"Sampling Double Pole",null,"System Response",null,null,null,null,null,null,"ERROR AMP Response",null,null,"PLANT Response"]
[null,null,"p_dom",null,"z_ESR",null,"z_RHP",null,"p1",null,"z1",null,"p2",null,"z1",null,"p1p2",null,"p3"]
[null,null,"Gain(V/V)","Phase(rad)","Gain(V/V)","Phase(rad)","Gain(V/V)","Phase(rad)","Gain(V/V)","Phase(rad)","Gain(V/V)","Phase(rad)","Gain(V/V)","Phase(rad)","Gain(V/V)","Phase(rad)","Gain(V/V)","Phase(rad)","Gain(V/V)","Phase(rad)","Gain (dB)","Phase (°)","Phase Margin (°)",null,null,"Fsquare",null,"Gain(dB)","Phase(Deg)",null,"Gain(dB)","Phase(Deg)"]
[1,{"$f":"A13/1000","v":1E-3},{"$f":"SQRT(1+(A13/pole1)^2)","v":1.000000009694056},{"$f":"ATAN(A13/pole1)","v":1.3924120082228571E-4},{"$f":"SQRT(1+(A13/Zero1)^2)","v":1.0000000000000315},{"$f":"ATAN(A13/Zero1)","v":2.5132741199999476E-7},{"$f":"IF(VIN_nom>Vout, 1, SQRT(1+(A13/z_RHP)^2))","v":1},{"$f":"IF(VIN_nom>Vout, 0, -ATAN(A13/z_RHP))","v":0},{"$f":"SQRT(1+(A13/Pole2)^2)","v":1.3352124055300987},{"$f":"ATAN(A13/Pole2)","v":0.72432855920636174},{"$f":"SQRT(1+(A13/Zero2)^2)","v":1.0000000034393597},{"$f":"ATAN(A13/Zero2)","v":8.2938045769830835E-5},{"$f":"SQRT(1+(A13/pole4)^2)","v":1.0000000000020592},{"$f":"ATAN(A13/pole4)","v":2.0293804595972141E-6},{"$f":"IF(VOUT_setting=1,1,SQRT(1+(A13*zterm1)^2))","v":1.0000000000168834},{"$f":"IF(VOUT_setting=1,0,ATAN(((A13*zterm1))))","v":5.8109410927865939E-6},{"$f":"IF(VOUT_setting=1,1,SQRT((1+Afbr-pterm4*(A13)^2)^2+(A13*$Q$4)^2))","v":4.1565656567615079},{"$f":"IF(VOUT_setting=1,0,ATAN(A13*$Q$4/(1+Afbr-$Q$5*(A13)^2)))","v":9.7469978619653573E-6},{"$f":"SQRT((1-(Z13/pterm2))^2+(A13/pterm1)^2)","v":1.0000000000007061},{"$f":"IF((ATAN((A13/pterm1)/(1-A13^2/pterm2))>0),ATAN((A13/pterm1)/(1-A13^2/pterm2)),PI()+ATAN((A13/pterm1)/(1-A13^2/pterm2)))","v":1.7507659079631361E-6},{"$f":"20*LOG10(((E13*K13*G13*O13)/(C13*I13*S13*M13*Q13))*Adc)","v":103.71268225781876},{"$f":"((F13+L13+H13+P13)-(D13+J13+T13+N13+R13))*radconv","v":-41.504623109773632},{"$f":"IF(V13>0,V13,V13+180)","v":138.49537689022637},null,{"$f":"IF(U13<0,A13,1000000000)","v":1000000000},{"$f":"A13^2","v":1},null,{"$f":"20*LOG10((K13/(I13*M13))*AEA)","v":95.196217255620894},{"$f":"(L13-(J13+N13))*radconv","v":-41.496333745684453},null,{"$f":"20*LOG10((E13*G13/(C13*S13))*Acs*Am)","v":46.911757814754878},{"$f":"(F13+H13-(D13+T13))*radconv","v":-8.063844648122917E-3},null,{"$f":"SUM((U14<0)*(U13>0))*A13","v":0},{"$f":"IF(AH13>0,W11,0)","v":0}]
[1.0965,{"$f":"A14/1000","v":1.0965E-3},1.0000000116552823,1.5267797650201227E-4,1.000000000000038,2.7558050725799308E-7,1,0,1.3932554010833589,0.77024011804848436,1.0000000041351842,9.0941567144433259E-5,1.0000000000024758,2.2252156739477273E-6,1.0000000000202993,6.3716969082259915E-6,{"$f":"IF(VOUT_setting=1,1,SQRT((1+Afbr-pterm4*(A14)^2)^2+(A14*$Q$4)^2))","v":4.1565656568011313},1.068758315557737E-5,1.0000000000008491,1.919714818081503E-6,103.34307471535089,-44.135514241457535,135.86448575854246,null,1000000000,1.2023122500000001,null,94.826609730242325,-44.126424953745193,null,46.911757797718707,-8.84200564522916E-3,null,0,0]
[1.2022999999999999,1.2022999999999999E-3,1.0000000140130032,1.6740969526661171E-4,1.0000000000000457,3.0217094744759085E-7,1,0,1.4599814640900735,0.81627470265521795,1.0000000049716815,9.9716412327202525E-5,1.0000000000029767,2.4399241265722383E-6,1.0000000000244056,6.9864944758222864E-6,{"$f":"IF(VOUT_setting=1,1,SQRT((1+Afbr-$Q$5*(A15)^2)^2+(A15*$Q$4)^2))","v":4.1565656568487643},1.1718815529277612E-5,1.000000000001021,2.1049458511438947E-6,102.93674256793059,-46.773488209072354,133.22651179092765,null,1000000000,1.4455252899999997,null,94.42027760336623,-46.763521906655562,null,46.911757777238378,-9.6951603928203227E-3,null,0,0]
[1.3183,1.3183000000000001E-3,1.0000000168474443,1.8356167416862734E-4,1.0000000000000548,3.3132492723958794E-7,1,0,1.5363678479897291,0.8620456945090812,1.0000000059773144,1.0933722555337272E-4,1.0000000000035787,2.6753322598842972E-6,1.0000000000293421,7.6605636425569403E-6,4.1565656569060287,1.2849467281132298E-5,1.0000000000012272,2.3080346964674693E-6,102.49378519272071,-49.396396691533354,130.60360330846663,null,1000000000,1.7379148900000001,null,93.977320252854497,-49.385468822904762,null,46.911757752617021,-1.063056634946416E-2,null,0,0]
[1.4454,1.4454000000000001E-3,1.0000000202526393,2.0125923025185693E-4,1.0000000000000659,3.632686413047841E-7,1,0,1.6233898636290454,0.90714792266757382,1.0000000071854456,1.1987865105632969E-4,1.0000000000043019,2.9332665162974272E-6,1.0000000000352727,8.3991342554107729E-6,4.1565656569748253,1.4088310709204675E-5,1.0000000000014753,2.5305570433693789E-6,102.01523277470029,-51.981028392100889,128.01897160789912,null,1000000000,2.0891811599999999,null,93.498767864505524,-51.969046945327577,null,46.911757723037809,-1.1655480973227344E-2,null,0,0]
[1.5849,1.5849E-3,1.0000000243505769,2.2068337702694032E-4,1.0000000000000795,3.9832881527877901E-7,1,0,1.7222955369699871,0.95130578958297074,1.0000000086393552,1.3144850828491713E-4,1.0000000000051725,3.2163650904089488E-6,1.0000000000424099,9.2097605378007458E-6,4.1565656570576177,1.5448016910698209E-5,1.0000000000017737,2.7747888875299552E-6,101.50153582631376,-54.511597484156539,125.48840251584346,null,1000000000,2.51190801,null,92.985070951826728,-54.49845967113518,null,46.911757687441103,-1.2780387259263058E-2,null,0,0]
[1.7378,1.7378000000000001E-3,1.0000000292755531,2.4197335563016782E-4,1.0000000000000955,4.3675677657357228E-7,1,0,1.8341189436224521,0.99414371050404515,1.0000000103866904,1.4412973527126743E-4,1.0000000000062186,3.5266573626782593E-6,1.0000000000509872,1.0098253430814951E-5,4.1565656571571177,1.693833288345301E-5,1.0000000000021325,3.0424809948571376E-6,100.95513939270003,-56.966588200217089,123.03341179978291,null,1000000000,3.0199488400000001,null,92.438674561127186,-56.952182943483962,null,46.911757644660327,-1.4013349048522012E-2,null,0,0]
[1.9055,1.9055000000000001E-3,1.0000000351984411,2.653241036555801E-4,1.0000000000001146,4.7890438356596348E-7,1,0,1.9601693196823375,1.0354255056830217,1.0000000124880752,1.5803844526104938E-4,1.0000000000074767,3.866984465748525E-6,1.000000000061303,1.1072748251976958E-5,4.1565656572767793,1.85729044244463E-5,1.0000000000025639,3.3360844376220418E-6,100.37781754117866,-59.332473552603808,120.6675264473962,null,1000000000,3.63093025,null,91.8613527612154,-59.316678169590425,null,46.911757593211199,-1.5365655718520511E-2,null,0,0]
[2.0893000000000002,2.0893000000000001E-3,1.0000000423162456,2.9091663455110996E-4,1.0000000000001379,5.2509836189155188E-7,1,0,2.1016718112512245,1.0749096841576735,1.0000000150134052,1.732824576898549E-4,1.0000000000089888,4.2399845942168716E-6,1.0000000000736995,1.214079922469917E-5,4.1565656574205816,2.03644026308603E-5,1.0000000000030824,3.6578752115049762E-6,99.772391263299056,-61.595421878100353,118.40457812189965,null,1000000000,4.3651744900000002,null,91.255926545357383,-61.578102910071429,null,46.911757531382435,-1.6847790260818885E-2,null,0,0]
[2.2909000000000002,2.2909000000000002E-3,1.0000000508765652,3.1898765820596642E-4,1.0000000000001656,5.7576596815073657E-7,1,0,2.2601477188371772,1.112468695579482,1.000000018050526,1.9000276720333077E-4,1.0000000000108071,4.6491076948641441E-6,1.0000000000886085,1.3312284948828261E-5,4.1565656575935286,2.2329397399008777E-5,1.0000000000037059,4.0108296185494214E-6,99.140952706402231,-63.748131291232305,116.25186870876769,null,1000000000,5.2482228100000006,null,90.624488063051629,-63.729141187542318,null,46.91175745702327,-1.847346120259917E-2,null,0,0]
[2.5118999999999998,2.5118999999999996E-3,1.000000061166018,3.4975996034361203E-4,1.0000000000001994,6.3130932620271621E-7,1,0,2.4370346805999801,1.1479752256794897,1.0000000217011271,2.0833207463289682E-4,1.0000000000129927,5.0976007764250847E-6,1.000000000106529,1.4596502930098304E-5,4.1565656578014085,2.4483483925403831E-5,1.0000000000044555,4.3977488842080416E-6,98.486454952229991,-65.783313067521789,114.21668693247821,null,1000000000,6.309641609999999,null,89.969990398537405,-65.762491014554016,null,46.911757367644007,-2.0255570683962196E-2,null,0,0]
[2.7542,2.7542000000000001E-3,1.0000000735354004,3.8349809898271668E-4,1.0000000000002396,6.9220595813028958E-7,1,0,2.6340011535941934,1.1813777848470171,1.0000000260896675,2.2842796220995899E-4,1.0000000000156204,5.5893196617721155E-6,1.0000000001280718,1.6004493956566494E-5,4.15656565805131,2.6845181505894124E-5,1.0000000000053566,4.8219594637058679E-6,97.811369856405861,-67.698024011487021,112.30197598851298,null,1000000000,7.5856176399999997,null,89.29490541049492,-67.675193445848038,null,46.911757260197447,-2.2209439994676776E-2,null,0,0]
[3.02,3.0200000000000001E-3,1.0000000884136655,4.2050840441513153E-4,1.000000000000288,7.5900878423985437E-7,1,0,2.8529594613219067,1.2126772966327599,1.0000000313683359,2.5047289356125478E-4,1.0000000000187805,6.1287289879152654E-6,1.0000000001539844,1.7549042098611521E-5,4.1565656583518988,2.9435933535657382E-5,1.0000000000064402,5.2873130420402856E-6,97.117776975959231,-69.492325076675144,110.50767492332486,null,1000000000,9.1204000000000001,null,88.601312659691317,-69.467291198390583,null,46.911757130957497,-2.4352809572917654E-2,null,0,0]
[3.3113000000000001,3.3113000000000001E-3,1.0000001062924861,4.6106935859045094E-4,1.0000000000003464,8.3222045935540798E-7,1,0,3.0956561990701998,1.2418634632175725,1.0000000377115734,2.7463274468279283E-4,1.0000000000225784,6.7198875157723301E-6,1.0000000001851228,1.9241769238386101E-5,4.1565656587131095,3.2275234010264357E-5,1.0000000000077427,5.7973111510270515E-6,96.408634442166701,-71.165633548767914,108.83436645123209,null,1000000000,10.964707690000001,null,87.89217028168737,-71.13818497916111,null,46.91175697565324,-2.6701807082080507E-2,null,0,0]
[3.6307999999999998,3.6308E-3,1.0000001277939092,5.0555691214142402E-4,1.0000000000004163,9.1251956748934691E-7,1,0,3.3644198719623897,1.2690081304275023,1.0000000453400761,3.0113144816935287E-4,1.0000000000271458,7.3682745725823342E-6,1.0000000002225704,2.1098364916796457E-5,4.1565656591475078,3.5389399823735829E-5,1.000000000009309,6.3566808586174314E-6,95.685484977867162,-72.722075755175979,107.27792424482402,null,1000000000,13.182708639999998,null,87.169021004742305,-72.691978734322205,null,46.911756788881284,-2.9278204867795119E-2,null,0,0]
[3.9811000000000001,3.9811000000000004E-3,1.0000001536426077,5.5433309139663858E-4,1.0000000000005005,1.0005595599128662E-6,1,0,3.6615018956037937,1.294169816952891,1.0000000545109515,3.3018464277223672E-4,1.0000000000326366,8.0791665475377765E-6,1.0000000002675895,2.3133937580626164E-5,4.1565656596697353,3.8803773170244016E-5,1.0000000000111917,6.9699741561718308E-6,94.950503355464306,-74.165014069308057,105.83498593069194,null,1000000000,15.849157210000001,null,86.434039607574235,-74.132013284981383,null,46.911756564346746,-3.2102968880679532E-2,null,0,0]
[4.3651999999999997,4.3651999999999996E-3,1.0000001847199418,6.0781561890713121E-4,1.0000000000006017,1.0970944188619599E-6,1,0,3.9894964706489313,1.3174362269926541,1.0000000655368979,3.620411424065565E-4,1.0000000000392379,8.8586515820141898E-6,1.0000000003217151,2.536592005307715E-5,4.1565656602975984,4.2547595043018512E-5,1.0000000000134555,7.6424433414137369E-6,94.205326742511275,-75.499484532482853,104.50051546751715,null,1000000000,19.054971039999998,null,85.688863265416146,-75.463299804425404,null,46.911756294393719,-3.5200290594435565E-2,null,0,0]
[4.7862999999999998,4.7862999999999994E-3,1.0000002220778856,6.6645006513356279E-4,1.0000000000007234,1.2029283920550199E-6,1,0,4.3511752026701194,1.3389005487354884,1.0000000787911461,3.9696634852672577E-4,1.0000000000471734,9.7132236934780085E-6,1.0000000003867788,2.7812907345545897E-5,4.1565656610523503,4.6652055834749327E-5,1.0000000000161768,8.3796908652481059E-6,93.451556820731838,-76.730838126201746,103.26916187379825,null,1000000000,22.908667689999998,null,84.935093669158235,-76.691162748269704,null,46.911755969884226,-3.8595974232756132E-2,null,0,0]
[5.2481,5.2481000000000003E-3,1.0000002669990249,7.3075162068475768E-4,1.00000000000087,1.3189913909164353E-6,1,0,4.7497468616088989,1.3586715390474358,1.0000000947287453,4.3526713151447003E-4,1.0000000000567155,1.0650391589624066E-5,1.0000000004650151,3.0496399939942391E-5,4.1565656619599034,5.1153219436904177E-5,1.0000000000194489,9.1881945615337091E-6,92.690278693902286,-77.865319678270623,102.13468032172938,null,1000000000,27.542553609999999,null,84.173815933752749,-77.821816273778182,null,46.911755579677113,-4.231985591574626E-2,null,0,0]
[5.7544000000000004,5.7544000000000007E-3,1.000000321000386,8.0124939972242397E-4,1.0000000000010458,1.4462384596117921E-6,1,0,5.1885152490025863,1.3768493473473762,1.0000001138879229,4.7725865543622633E-4,1.0000000000681863,1.1677866916191392E-5,1.0000000005590659,3.3438479412244672E-5,4.1565656630509062,5.6088124440544812E-5,1.0000000000233826,1.0074607340719892E-5,91.922825729665306,-78.908681211438349,101.09131878856165,null,1000000000,33.113119360000006,null,83.406363440061057,-78.860980904253793,null,46.911755110594754,-4.6402578115477752E-2,null,0,0]
[6.3095999999999997,6.3095999999999994E-3,1.0000003859304998,8.7855606034509324E-4,1.0000000000012572,1.5857754387538709E-6,1,0,5.6713120021709962,1.3935435710420467,1.0000001369245204,5.2330584702028156E-4,1.0000000000819786,1.2804578947192358E-5,1.0000000006721506,3.6664713903029506E-5,4.1565656643627058,6.1499657635184538E-5,1.0000000000281124,1.104663257280048E-5,91.15001650772453,-79.867218270431479,100.13278172956852,null,1000000000,39.811052159999996,null,82.633554783894141,-79.814915711403657,null,46.9117545465799,-5.0879621565910256E-2,null,0,0]
[6.9183000000000003,6.9183000000000005E-3,1.000000463985288,9.6331210789932979E-4,1.0000000000015117,1.738758434437848E-6,1,0,6.2021515296050946,1.4088550659525829,1.0000001646176311,5.7379022039441064E-4,1.0000000000985589,1.4039862832728179E-5,1.0000000008080936,4.0201833741020095E-5,4.1565656659396666,6.7432655209572959E-5,1.0000000000337981,1.211232378095052E-5,90.372839420950243,-80.746726274697764,99.253273725302236,null,1000000000,47.862874890000008,null,81.856378377256576,-80.689377983840075,null,46.911753868557739,-5.5788079713088079E-2,null,0,0]
[7.5857999999999999,7.5858000000000002E-3,1.0000005578381159,1.0562555152109139E-3,1.0000000000018174,1.9065194819472904E-6,1,0,6.7856669235625668,1.422888173356706,1.0000001979157407,6.2915134603073227E-4,1.000000000118495,1.5394474289217569E-5,1.0000000009715513,4.4080636913605635E-5,4.1565656678357987,7.3938776250501644E-5,1.0000000000406346,1.3280960024480109E-5,89.591835577352128,-81.55320290312298,98.44679709687702,null,1000000000,57.544361639999998,null,81.075375351452607,-81.490321467136596,null,46.911753053306114,-6.1170690616309017E-2,null,0,0]
[8.3176000000000005,8.3176000000000014E-3,1.0000006706585201,1.1581521016278701E-3,1.0000000000021849,2.0904408820481553E-6,1,0,7.4266745911494496,1.4357363250661435,1.0000002379433726,6.8984538164747265E-4,1.00000000014246,1.6879574909165852E-5,1.0000000011680434,4.8333083596269033E-5,4.1565656701151381,8.1071629243752519E-5,1.0000000000488529,1.4562170515880289E-5,88.807797805224226,-82.292021498884182,97.707978501115818,null,1000000000,69.182469760000004,null,80.291338562394245,-82.223073913383672,null,46.911752073292952,-6.7071805005370896E-2,null,0,0]
[9.1201000000000008,9.1201000000000008E-3,1.000000806314659,1.2698930012040653E-3,1.0000000000026268,2.2921311301771867E-6,1,0,8.130786967384088,1.4474948083786356,1.0000002860729147,7.5640312870216579E-4,1.0000000001712759,1.8508152727484627E-5,1.0000000014043073,5.2996363811304073E-5,4.1565656728558338,8.889359497237843E-5,1.0000000000587344,1.5967160156958365E-5,88.021033297163342,-82.9686650048438,97.0313349951562,null,1000000000,83.176224010000013,null,79.504575236383758,-82.89306521406553,null,46.911750894917581,-7.3543030934183129E-2,null,0,0]
[10,0.01,1.000000969405143,1.3924111173479676E-3,1.0000000000031584,2.5132741199947084E-6,1,0,8.9038877344757257,1.4582483783656999,1.0000003439359142,8.2938026943089492E-4,1.0000000002059193,2.029380459321408E-5,1.0000000016883517,5.8109410863113912E-5,4.1565656761507928,9.7469978317772332E-5,1.0000000000706144,1.7507659079292888E-5,87.232090515559491,-83.58801400770794,96.41198599229206,null,1000000000,100,null,78.715633875881394,-83.505120417873144,null,46.911749478234327,-8.0638395437838767E-2,null,0,0]
[10.965,1.0964999999999999E-2,1.0000011655275645,1.5267785905485136E-3,1.0000000000037972,2.7558050725730243E-6,1,0,9.7527463447377283,1.4680805837543807,1.0000004135183485,9.0941542324476108E-4,1.0000000002475793,2.2252156735841218E-5,1.000000002029926,6.3716968996895023E-5,4.1565656801131068,1.0687583115779298E-4,1.0000000000849005,1.9197148180368809E-5,86.441144341565575,-84.154883629188532,95.845116370811468,null,1000000000,120.23122499999999,null,77.924689410815006,-84.063990819375292,null,46.91174777461989,-8.8419989160000004E-2,null,0,0]
[12.023,1.2022999999999999E-2,1.0000014012993479,1.6740954043664086E-3,1.0000000000045652,3.0217094744668037E-6,1,0,10.684315024776247,1.4770639918962909,1.0000004971680241,9.9716379607178284E-4,1.0000000002976615,2.4399241260928988E-5,1.0000000024405551,6.9864944645686754E-5,4.156565684876468,1.1718815476812008E-4,1.000000000102075,2.1049458510850704E-5,85.648747900338776,-84.673460535025413,95.326539464974587,null,1000000000,144.55252899999999,null,77.132295024002985,-84.573797599592169,null,46.911745726592322,-9.6951515217131232E-2,null,0,0]
[13.183,1.3183E-2,1.00000168474303,1.8356147006106415E-3,1.0000000000054889,3.3132492723838765E-6,1,0,11.706520252989746,1.485269615529625,1.0000005977312707,1.0933718241956693E-3,1.0000000003578702,2.6753322592523989E-5,1.0000000029342118,7.6605636277216478E-5,4.1565656906029576,1.2849467211968491E-4,1.0000000001227218,2.3080346963899227E-5,84.855123579500741,-85.147846336854002,94.852153663145998,null,1000000000,173.79148899999998,null,76.338673172971681,-85.038567767544251,null,46.911743264464263,-0.10630554654957836,null,0,0]
[14.454000000000001,1.4454E-2,1.000002025261892,2.012589612344926E-3,1.0000000000065983,3.6326864130320218E-6,1,0,12.827293749398311,1.4927583767721273,1.0000007185442976,1.1987859420519856E-3,1.0000000004302025,2.9332665154645741E-5,1.0000000035272727,8.3991342358575899E-5,4.1565656974825558,1.4088310618045523E-4,1.0000000001475264,2.5305570432671702E-5,84.060977270599992,-85.581564495949181,94.418435504050819,null,1000000000,208.91811600000003,null,75.544529831205395,-85.461750182392791,null,46.911740306554684,-0.11655465559661971,null,0,0]
[15.849,1.5848999999999999E-2,1.0000024350547592,2.2068302235931851E-3,1.0000000000079332,3.9832881527669331E-6,1,0,14.058100571082626,1.499602836115504,1.0000008639351532,1.3144843333339129E-3,1.0000000005172502,3.2163650893109298E-5,1.0000000042409845,9.2097605120221667E-5,4.156565705761718,1.5448016790515579E-4,1.000000000177377,2.774788887395205E-5,83.265142850479862,-85.978819917225493,94.021180082774507,null,1000000000,251.19080099999999,null,74.748698981842224,-85.847441990275641,null,46.911736746899322,-0.12780366938297574,null,0,0]
[17.378,1.7378000000000001E-2,1.0000029275510707,2.41972888094158E-3,1.0000000000095377,4.367567765708229E-6,1,0,15.407765247935012,1.5058483365915445,1.0000010386685045,1.4412963646734886E-3,1.0000000006218654,3.5266573612308088E-5,1.0000000050987361,1.0098253396832654E-4,4.1565657157117686,1.6938332725023708E-4,1.0000000002132521,3.0424809946795053E-5,82.468879935457707,-86.342247098470821,93.657752901529179,null,1000000000,301.99488400000001,null,73.952440358216947,-86.198194799089237,null,46.911732468844519,-0.14013322260671829,null,0,0]
[19.055,1.9054999999999999E-2,1.0000035198379695,2.6532348728452652E-3,1.0000000000114675,4.7890438356233884E-6,1,0,16.888646369155577,1.511550296465443,1.00000124880675,1.5803831500390915E-3,1.0000000007476784,3.8669844638402926E-5,1.0000000061302876,1.1072748207176732E-4,4.156565727677922,1.8572904215582593E-4,1.0000000002563962,3.3360844373878616E-5,81.67177281518093,-86.675072419344929,93.324927580655071,null,1000000000,363.09302500000001,null,73.15533839886568,-86.517118942459831,null,46.91172732396447,-0.15365620403047278,null,0,{"$f":"IF(AH45>0,W43,0)","v":0}]
[20.893000000000001,2.0893000000000002E-2,1.0000042316156983,2.9091582206225248E-3,1.0000000000137863,5.2509836188677394E-6,1,0,18.512224075480511,1.5167516606229496,1.0000015013394101,1.7328228598722005E-3,1.0000000008988734,4.2399845917014738E-5,1.0000000073699502,1.2140799165644294E-4,4.1565657420581958,2.0364402355539809E-4,1.0000000003082443,3.6578752111962839E-5,80.874493679035297,-86.979803932696854,93.020196067303146,null,1000000000,436.51744900000006,null,72.358065464831682,-86.806614718053581,null,46.91172114113543,-0.16847743708618987,null,0,0]
[22.909000000000002,2.2909000000000002E-2,1.0000050876437074,3.1898658709874571E-3,1.0000000000165752,5.7576596814443786E-6,1,0,20.293515493784945,1.5214995381697571,1.0000018050509916,1.9000254084692797E-3,1.00000000108071,4.649107691548082E-5,1.0000000088608465,1.3312284870975905E-4,4.1565657593528185,2.2329397036052333E-4,1.0000000003706002,4.0108296181424705E-5,80.076515076609383,-87.259202896378525,92.740797103621475,null,1000000000,524.82228100000009,null,71.560094321443785,-87.069302473341537,null,46.911713705287866,-0.1847339983265299,null,0,0]
[25.119,2.5118999999999999E-2,1.0000061165832854,3.497585483879915E-3,1.0000000000199276,6.3130932619441315E-6,1,0,22.24665825342549,1.5258306041164971,1.0000021701103741,2.0833177624497994E-3,1.0000000012992767,5.0976007720537772E-5,1.0000000106528948,1.45965028274716E-4,4.1565657801408493,2.4483483446946573E-4,1.0000000004455518,4.3977488836715907E-5,79.278359360973852,-87.515429082931902,92.484570917068098,null,1000000000,630.96416099999999,null,70.76194757151049,-87.307209362460853,null,46.911704767460421,-0.2025548978483393,null,0,0]
[27.542000000000002,2.7542000000000001E-2,1.0000073535132801,3.8349623775385026E-3,1.0000000000239575,6.9220595811934454E-6,1,0,24.388444142945122,1.5297818030982422,1.0000026089633833,2.2842756887695801E-3,1.0000000015620247,5.5893196560098833E-5,1.0000000128071913,1.6004493821284569E-4,4.1565658051310148,2.6845180875194552E-4,1.000000000535654,4.8219594629987218E-5,78.479966150691396,-87.75066867120681,92.24933132879319,null,1000000000,758.56176400000004,null,69.963565139250164,-87.522364081506836,null,46.911694022947742,-0.22209333354078009,null,0,0]
[30.2,3.0199999999999998E-2,1.0000088413278669,4.205059506476685E-3,1.0000000000288047,7.5900878422542481E-6,1,0,26.738320231357438,1.5333880955102563,1.0000031368287317,2.5047237500662655E-3,1.0000000018780659,6.1287289803185611E-5,1.0000000153984439,1.7549041920261082E-4,4.1565658351899355,2.9435932704167559E-4,1.0000000006440319,5.2873130411080115E-5,77.680957271582045,-87.967005108456036,92.032994891543964,null,1000000000,912.04,null,69.16456922423491,-87.716667731890311,null,46.911681099159821,-0.24352668982345368,null,0,0]
[33.113,3.3112999999999997E-2,1.000010629192688,4.6106612408996408E-3,1.0000000000346296,8.3222045933638732E-6,1,0,29.31396817703423,1.5366762769282294,1.0000037711503014,2.746320611349148E-3,1.0000000022578444,6.719887505758507E-5,1.0000000185122839,1.92417690032881E-4,4.1565658713109528,3.2275232914211015E-4,1.0000000007742667,5.7973111497981457E-5,76.882137364548868,-88.166046720345236,91.833953279654764,null,1000000000,1096.470769,null,68.365764895762567,-87.891562878003541,null,46.911665569033865,-0.26701621758784239,null,0,0]
[36.308,3.6308E-2,1.0000127793100928,5.0555264813861552E-3,1.0000000000416347,9.1251956746427181E-6,1,0,32.139261153385931,1.5396767121113373,1.0000045339974493,3.0113054705495079E-3,1.0000000027145735,7.3682745593811982E-5,1.0000000222570498,2.1098364606868806E-4,4.1565659147508036,3.5389398378818236E-4,1.0000000009308894,6.356680856997376E-5,76.08289972084016,-88.349631900020142,91.650368099979858,null,1000000000,1318.2708640000001,null,67.56654598706605,-88.048664135227298,null,46.911646892270397,-0.29277960558338695,null,0,0]
[39.811,3.9810999999999999E-2,1.00001536414393,5.5432747033430834E-3,1.000000000050056,1.0005595598798108E-5,1,0,35.237190767015143,1.5424134093190522,1.0000054510804552,3.3018345486718914E-3,1.0000000032636465,8.079166530135198E-5,1.0000000267589531,2.3133937172059804E-4,4.1565659669735604,3.8803771265461694E-4,1.0000000011191792,6.9699741540361692E-5,75.283577377876881,-88.519231178065695,91.480768821934305,null,1000000000,1584.9157210000001,null,66.767246166956383,-88.189226556289114,null,46.911624439442569,-0.3210264681741079,null,0,0]
[43.652000000000001,4.3652000000000003E-2,1.0000184718252747,6.078082088774933E-3,1.0000000000601807,1.0970944188183842E-5,1,0,38.634287995665559,1.5449096922294379,1.0000065536685372,3.6203957643335016E-3,1.0000000039237853,8.8586515590729557E-5,1.0000000321714946,2.5365919514477858E-4,4.1565660297598583,4.2547592532008041E-4,1.0000000013455559,7.6424433385983675E-5,74.484127165231001,-88.676290464326016,91.323709535673984,null,1000000000,1905.497104,null,65.967823032899858,-88.314447430517475,null,46.911597445043697,-0.35199866030851956,null,0,0]
[47.863,4.7863000000000003E-2,1.0000222075444543,6.6644029714173015E-3,1.0000000000723519,1.2029283919975774E-5,1,0,42.358854616633998,1.5471863184386891,1.0000078790838809,3.9696428423563364E-3,1.0000000047173356,9.7132236632364546E-5,1.00000003867789,2.7812906635554503E-4,4.1565661052350276,4.6652052524689654E-4,1.0000000016176827,8.3796908615368365E-5,73.684680212281648,-88.82211593531531,91.17788406468469,null,1000000000,2290.8667689999997,null,65.168408630798055,-88.425367754133774,null,46.911564995401207,-0.38595414567839814,null,0,0]
[52.481000000000002,5.2481E-2,1.0000266995496288,7.3073874383940791E-3,1.0000000000869869,1.3189913908407104E-5,1,0,46.4436166220543,1.549263178510353,1.0000094728301181,4.352644102130012E-3,1.0000000056715419,1.0650391549757331E-4,1.0000000465015195,3.0496399003977325E-4,4.1565661959903073,5.1153215073329963E-4,1.0000000019449018,9.1881945566412275E-5,72.885018443231175,-88.957982337972382,91.042017662027618,null,1000000000,2754.255361,null,64.368786002264002,-88.522955672903564,null,46.911525976579014,-0.42319118126577454,null,0,0]
[57.544000000000004,5.7544000000000005E-2,1.0000320995285767,8.0123242508626166E-3,1.0000000001045803,1.4462384595119684E-5,1,0,50.922186214981352,1.5511572586520468,1.0000113887280873,4.7725506812146693E-3,1.0000000068186288,1.1677866863637547E-4,1.0000000559065938,3.3438478178419946E-4,4.1565663050905854,5.6088118688315484E-4,1.000000002338264,1.0074607334270439E-4,72.085367836953196,-89.085001639901321,90.914998360098679,null,1000000000,3311.3119360000005,null,63.569182447785337,-88.608008296398424,null,46.911479071072854,-0.46401605540101959,null,0,0]
[63.095999999999997,6.3095999999999999E-2,1.0000385923127342,8.7853368331744994E-3,1.0000000001257341,1.5857754386222762E-5,1,0,55.833484421061158,1.552884969805046,1.0000136923592358,5.2330111797346578E-3,1.0000000081978619,1.2804578877912044E-4,1.00000006721506,3.6664712276511757E-4,4.156566436270495,6.1499650052176513E-4,1.000000002811235,1.1046632564298339E-4,71.285577437187811,-89.204274734768703,90.795725265231297,null,1000000000,3981.1052159999995,null,62.769448621457556,-88.681261969000417,null,46.911422673535057,-0.50878339456187183,null,0,0]
[69.183000000000007,6.9183000000000008E-2,1.0000463974632032,9.6328261000753462E-3,1.000000000151164,1.7387584342643756E-5,1,0,61.218202845381548,1.5544605895312185,1.0000164616289717,5.7378398642246057E-3,1.0000000098558874,1.4039862741400478E-4,1.0000000808093685,4.0201831596888249E-4,4.1565665939665131,6.7432645213390285E-4,1.0000000033798098,1.2112323769742703E-4,70.485816584198389,-89.316787545043596,90.683212454956404,null,1000000000,4786.2874890000012,null,61.969755776436017,-88.743321542018933,null,46.911354877022589,-0.5578638960774952,null,0,0]
[75.858000000000004,7.5858000000000009E-2,1.000055782271331,1.0562166293219292E-2,1.0000000001817408,1.9065194817186056E-5,1,0,67.123226678647583,1.5558978029190806,1.000019791380184,6.2914312797495387E-3,1.0000000118494918,1.539447416882255E-4,1.0000000971551228,4.4080634087050432E-4,4.1565667835797111,7.393876307278535E-4,1.0000000040634625,1.3280960009705124E-4,69.685918732749826,-89.423517560905822,90.576482439094178,null,1000000000,5754.4361640000006,null,61.169939696156561,-88.794725486954349,null,46.911273360106769,-0.61168462618151598,null,0,0]
[83.176000000000002,8.3176E-2,1.0000670636257314,1.158100841932367E-2,1.0000000002184972,2.0904408817466969E-5,1,0,73.597211552357635,1.5572084373713788,1.0000237940569994,6.8983454844386448E-3,1.0000000142460024,1.6879574750457987E-4,1.0000001168043418,4.8333079870230088E-4,4.1565670115135855,8.1071611872543222E-4,1.0000000048852808,1.4562170496403519E-4,68.886084486129548,-89.525343064635962,90.474656935364038,null,1000000000,6918.2469760000004,null,60.370203744573807,-88.835896587102084,null,46.911175370706893,-0.67068868040057417,null,0,0]
[91.201000000000008,9.1201000000000004E-2,1.000080628247954,1.26982542814339E-2,1.0000000002626932,2.2921311297797821E-5,1,0,80.69677608738958,1.5584039408267061,1.0000286068863902,7.5638884768699632E-3,1.0000000171275858,1.8508152518264647E-4,1.0000001404307193,5.299635889937502E-4,4.1565672855830806,8.889357207241829E-4,1.000000005873442,1.5967160131282704E-4,68.086111586451963,-89.623153372247572,90.376846627752428,null,1000000000,8317.6224010000005,null,59.570349032708158,-88.867194191297628,null,46.911057550396052,-0.73539159281544897,null,0,0]
[100,0.1,1.0000969358630043,1.392322040219951E-2,1.0000000003158274,2.513274119470827E-5,1,0,88.481193927380573,1.5594942495350694,1.000034393005899,8.2936144346645556E-3,1.0000000205919251,2.0293804317407667E-4,1.0000001688351676,5.8109404387912688E-4,4.156567615078897,9.7469948129665107E-4,1.0000000070614437,1.7507659045445681E-4,67.28612393529913,-89.717762011520506,90.282237988479494,null,1000000000,10000,null,58.770503466805195,-88.888877164212929,null,46.910915906968647,-0.80633291692437159,null,0,0]
[109.65,0.10965000000000001,1.000116546032866,1.5266611598097904E-2,1.0000000003797229,2.7558050718823722E-5,1,0,97.01858650011097,1.5604888409442779,1.0000413509884492,9.0939060451903191E-3,1.0000000247579237,2.2252156372235874E-4,1.000000202992587,6.3716960460408483E-4,4.1565680113100045,1.0687579135974772E-3,1.00000000849006,1.9197148135746835E-4,66.485934101257811,-89.809992573065486,90.190007426934514,null,1000000000,12023.122500000001,null,57.970484489517489,-88.901131775727123,null,46.910745581523059,-0.8841326087176129,null,0,0]
[120.23,0.12023,1.0001401202161271,1.6739406004233268E-2,1.0000000004565364,3.0217094735563204E-5,1,0,106.37884542927671,1.5613958231105283,1.0000497155789472,9.9713107799929319E-3,1.0000000297661484,2.4399240781589854E-4,1.0000002440554956,6.9864933392079062E-4,4.1565684876457789,1.1718810230255984E-3,1.0000000102074951,2.1049458452025781E-4,65.685794728787144,-89.900597261031052,90.099402738968948,null,1000000000,14455.252900000001,null,57.170550506497364,-88.904056626470393,null,46.910540830793153,-0.96942645601212274,null,0,0]
[131.83000000000001,0.13183,1.0001684602554737,1.835410634297676E-2,1.0000000005488809,3.3132492711836141E-5,1,0,116.64159482519911,1.5622229507872523,1.0000597713586272,1.093328693483187E-2,1.0000000357870129,2.6753321960625817E-4,1.0000002934211336,7.660562144192922E-4,4.1565690602943874,1.2849460295594692E-3,1.0000000122721879,2.3080346886352122E-4,64.885671577191445,-89.990347907496258,90.009652092503742,null,1000000000,17379.148900000004,null,56.370674260380127,-88.897679166955257,null,46.91029469318142,-1.0629385440671693,null,0,0]
[144.54,0.14454,1.0002025058899591,2.0123206603348546E-2,1.0000000006598204,3.6326864114500532E-5,1,0,127.88645938227901,1.5629768109860489,1.000071851874238,1.1987290958218665E-2,1.0000000430202614,2.9332664321792473E-4,1.000000352727219,8.3991322805399232E-4,4.1565697482535713,1.4088301502141061E-3,1.0000000147526349,2.5305570330463206E-4,64.086057537647989,-90.079949043181799,89.920050956818201,null,1000000000,20891.811599999997,null,55.571356825688405,-88.881960046853507,null,46.90999901081657,-1.1653924577576795,null,0,0]
[158.49,0.15849000000000002,1.0002434761320727,2.2064756595612744E-2,1.0000000007933292,3.9832881506812952E-5,1,0,140.22845348454558,1.5636650460094215,1.0000863898210461,1.3144093895767213E-2,1.0000000517250205,3.2163649795090103E-4,1.0000004240983558,9.2097579341657071E-4,4.1565705761690017,1.5448004772269141E-3,1.0000000177376966,2.7747888739202157E-4,63.28559519623866,-90.17031118322879,89.82968881677121,null,1000000000,25119.080100000003,null,54.77125140286666,-88.856735118121975,null,46.909643202383364,-1.2778335435275581,null,0,0]
[173.78,0.17377999999999999,1.000292712695241,2.4192615090951091E-2,1.0000000009537824,4.3675677629588608E-5,1,0,153.75605026647696,1.5642924718355424,1.0001038615107785,1.4411975730668181E-2,1.0000000621865588,3.5266572164857624E-4,1.0000005098734819,1.0098249998605005E-3,4.1565715711726314,1.6938316882120772E-3,1.0000000213251983,3.042480976916264E-4,62.485396540426748,-90.262072673444692,89.737927326555308,null,1000000000,30199.488400000002,null,53.971481659755156,-88.821817535374635,null,46.909215623885899,-1.4010644416240159,null,0,0]
[190.55,0.19055000000000002,1.0003519224917021,2.6526187619782055E-2,1.0000000011467469,4.7890438319987867E-5,1,0,168.59311260617733,1.5648648516100652,1.0001248729563543,1.5802529124133588E-2,1.0000000747678415,3.8669842730170887E-4,1.0000006130285815,1.1072743727157327E-3,4.1565727677862192,1.8572883329254749E-3,1.0000000256396091,3.3360844139698677E-4,61.684910856875995,-90.356071239641579,89.643928760358421,null,1000000000,36309.302500000005,null,53.171511740590844,-88.77688957044829,null,46.908701464041002,-1.5362090346482793,null,0,0]
[208.93,0.20893,1.0004230729697994,2.908346144051947E-2,1.0000000013786414,5.2509836140898518E-5,1,0,184.85465647930002,1.5653866449588778,1.0001501227852951,1.7326511881617178E-2,1.0000000898873427,4.2399843401616641E-4,1.0000007369947574,1.214079326016184E-3,4.1565742058109159,2.0364374823558747E-3,1.0000000308244332,3.657875180327093E-4,60.884698953102962,-90.45303221670224,89.54696778329776,null,1000000000,43651.744900000005,null,52.371919573905402,-88.721605479956096,null,46.908083655202539,-1.6843090850858815,null,0,0]
[229.09,0.22909000000000002,1.0005086363095033,3.1887954171568443E-2,1.0000000016575321,5.7576596751456639E-5,1,0,202.69108788905581,1.5658626907518902,1.0001804889739341,1.8997991010791252E-2,1.0000001080710059,4.6491073599418353E-4,1.0000008860842604,1.3312277085748749E-3,4.1565759352692329,2.2329360740515271E-3,1.000000037060029,4.0108295774474547E-4,60.084132115592837,-90.553847039183665,89.446152960816335,null,1000000000,52482.2281,null,51.572097954833033,-88.655456297262702,null,46.907340755796099,-1.8467266581684647,null,0,0]
[251.19,0.25119000000000002,1.0006114732494142,3.4961745636140885E-2,1.0000000019927573,6.3130932536410261E-5,1,0,222.2439658224053,1.5662967518765409,1.0002169877310456,2.0830194522052464E-2,1.00000012992766,5.0976003349230534E-4,1.0000010652889217,1.459649256481409E-3,4.1565780140668362,2.4483435601390679E-3,1.0000000445551782,4.3977488300265139E-4,59.283646815684072,-90.659306906031929,89.340693093968071,null,1000000000,63096.416100000002,null,50.772508234906574,-88.577918314723746,null,46.906447963272122,-2.0247405804152496,null,0,0]
[275.42,0.27542,1.0007350838575775,3.8331027891763736E-2,1.0000000023957454,6.9220595702483399E-5,1,0,243.681391926744,1.5666925961043163,1.0002608626540104,2.2838824788534166E-2,1.0000001562024592,5.5893190797867329E-4,1.0000012807183143,1.6004480293112884E-3,4.1565805130751938,2.6845117805508033E-3,1.000000053565411,4.821959392284095E-4,58.483103447556381,-90.770309969324686,89.229690030675314,null,1000000000,75856.176400000011,null,49.973041238166545,-88.488329822224685,null,46.905374942799909,-2.2198678693598732,null,0,0]
[302,0.30199999999999999,1.0008837461914797,4.2026083388236428E-2,1.0000000028804716,7.5900878278246464E-5,1,0,267.19801062032974,1.567053775223757,1.0003136341819643,2.5042053905252666E-2,1.0000001878065774,6.1287282206483578E-4,1.0000015398432076,1.7549024085250272E-3,4.1565835189556459,2.9435849555613986E-3,1.0000000644031901,5.2873129478805936E-4,57.682049995808057,-90.887847693628686,89.112152306371314,null,1000000000,91204,null,49.173282127222663,-88.385878718331739,null,46.904084632570161,-2.4338624820930628,null,0,0]
[331.13,0.33112999999999998,1.0010623606127604,4.6074308593738289E-2,1.0000000034629544,8.3222045743430579E-5,1,0,292.97077162819085,1.5673830103871429,1.0003770446598845,2.7456373726053796E-2,1.0000002257844156,6.7198865043763896E-4,1.0000018512267039,1.9241745493540233E-3,4.1565871310404363,3.227512330955589E-3,1.0000000774266651,5.797311026907616E-4,56.881223892350093,-91.012786312027572,88.987213687972428,null,1000000000,109647.0769,null,48.374010892254269,-88.269799254869909,null,46.90253460750597,-2.6683113029066354,null,0,0]
[363.08,0.36307999999999996,{"$f":"SQRT(1+(A77/pole1)^2)","v":1.0012771236524085},{"$f":"ATAN(A77/pole1)","v":5.0512690049550939E-2},{"$f":"SQRT(1+(A77/Zero1)^2)","v":1.0000000041634598},{"$f":"ATAN(A77/Zero1)","v":9.1251956495677446E-5},{"$f":"IF(VIN_nom>Vout, 1, SQRT(1+(A77/z_RHP)^2))","v":1},{"$f":"IF(VIN_nom>Vout, 0, -ATAN(A77/z_RHP))","v":0},{"$f":"SQRT(1+(A77/Pole2)^2)","v":321.23855738151082},{"$f":"ATAN(A77/Pole2)","v":1.5676833704199336},{"$f":"SQRT(1+(A77/Zero2)^2)","v":1.000453298033239},{"$f":"ATAN(A77/Zero2)","v":3.0104048460597381E-2},{"$f":"SQRT(1+(A77/pole4)^2)","v":1.0000002714573142},{"$f":"ATAN(A77/pole4)","v":7.3682732392679165E-4},{"$f":"IF(VOUT_setting=1,1,SQRT(1+(A77*zterm1)^2))","v":1.0000022257025347},{"$f":"IF(VOUT_setting=1,0,ATAN(((A77*zterm1))))","v":2.10983336141863E-3},4.1565914750009778,{"$f":"IF(VOUT_setting=1,0,ATAN(A77*$Q$4/(1+Afbr-$Q$5*(A77)^2)))","v":3.5389253888135643E-3},{"$f":"SQRT((1-(Z77/pterm2))^2+(A77/pterm1)^2)","v":1.0000000930889539},{"$f":"IF((ATAN((A77/pterm1)/(1-A77^2/pterm2))>0),ATAN((A77/pterm1)/(1-A77^2/pterm2)),PI()+ATAN((A77/pterm1)/(1-A77^2/pterm2)))","v":6.3566806949918564E-4},{"$f":"20*LOG10(((E77*K77*G77*O77)/(C77*I77*S77*M77*Q77))*Adc)","v":56.079948925966335},{"$f":"((F77+L77+H77+P77)-(D77+J77+T77+N77+R77))*radconv","v":-91.146260653868737},{"$f":"IF(V77>0,V77,V77+180)","v":88.853739346131263},null,{"$f":"IF(U77<0,A77,1000000000)","v":1000000000},{"$f":"A77^2","v":131827.0864},null,{"$f":"20*LOG10((K77/(I77*M77))*AEA)","v":47.574605109181931},{"$f":"(L77-(J77+N77))*radconv","v":-88.139023011461177},null,{"$f":"20*LOG10((E77*G77/(C77*S77))*Acs*Am)","v":46.900671248978668},{"$f":"(F77+H77-(D77+T77))*radconv","v":-2.9253567006084635},null,{"$f":"SUM((U78<0)*(U77>0))*A77","v":0},{"$f":"IF(AH77>0,W75,0)","v":0}]
[398.11,{"$f":"A78/1000","v":0.39811000000000002},1.0015352477030792,5.5376639808661129E-2,1.000000005005597,1.0005595565742681E-4,1,0,352.23140307914304,1.5679572802629189,1.0005449610399648,3.3006474199871433E-2,1.0000003263646073,8.0791647898779506E-4,1.0000026758917606,2.3133896315555083E-3,4.156596697241322,3.8803580788935956E-3,1.0000001119179307,6.9699739404701841E-4,55.278490062484913,-91.289323904725919,88.710676095274081,null,1000000000,158491.57210000002,null,46.775392293117484,-87.992493252607503,null,46.898432204010795,-3.2070499733532061,null,0,0]
[436.52,0.43651999999999996,1.001845496658931,6.0706884395733622E-2,1.0000000060180807,1.0970944144607983E-4,1,0,386.21473417414154,1.5682070907330037,1.0006551543876072,3.6188310213987128E-2,1.0000003923784624,8.8586492649504983E-4,1.0000032171443269,2.536586565475619E-3,{"$f":"IF(VOUT_setting=1,1,SQRT((1+Afbr-$Q$5*(A79)^2)^2+(A79*$Q$4)^2))","v":4.1566029758200074},4.2547341433665717E-3,1.0000001345556049,7.6424430570615058E-4,54.476731886128434,-91.443159637838875,88.556840362161125,null,1000000000,190549.71039999998,null,45.976332964161806,-87.828966680384895,null,46.895741775472445,-3.515750352547732,null,0,0]
[478.63,0.47863,1.0022183186353797,6.6546609256192379E-2,1.0000000072351836,1.2029283862533284E-4,1,0,423.4716713586796,1.5684348915513342,1.0007876013341563,3.9675805006458523E-2,1.0000004717334614,9.7132206390827325E-4,1.0000038677815972,2.7812835636744212E-3,4.1566105232630886,4.6651721523008937E-3,1.0000001617682677,8.3796904904098204E-4,53.674728220963729,-91.608994845185705,88.391005154814295,null,1000000000,229086.67689999999,null,45.177571369043257,-87.647096306257623,null,46.892509825663218,-3.8539596736035926,null,0,0]
[524.80999999999995,0.52481,1.0026664356665977,7.2945516892330586E-2,1.0000000086986913,1.3189913832682007E-4,1,0,464.32957314135808,1.5686426824205664,1.0009468392462522,4.3499258895912184E-2,1.0000005671540444,1.0650387563086582E-3,1.0000046501412374,3.0496305407992988E-3,4.1566195986842942,5.1152778722701065E-3,1.0000001944901935,9.1881940673931538E-4,52.872174429024014,-91.788213987313654,88.211786012686346,null,1000000000,275425.53609999997,null,44.37891282949743,-87.44530364577129,null,46.888626742304133,-4.224557467351393,null,0,0]
[575.44000000000005,0.57544000000000006,1.0032048687846973,7.9954146957439381E-2,1.0000000104580284,1.4462384495295984E-4,1,0,509.12464573159656,1.5688321699791357,1.0011382315084001,4.7689682606129026E-2,1.0000006818626461,1.1677861608257283E-3,1.0000055906439036,3.3438354796774517E-3,4.1566305085577531,5.6087543476151594E-3,1.000000233826432,1.0074606689325027E-3,52.069200553895357,-91.982196263724376,88.017803736275624,null,1000000000,331131.19360000006,null,43.580616991076894,-87.221953882560101,null,46.883963334347555,-4.6304720889436144,null,0,0]
[630.96,0.63096000000000008,1.0038518872241493,8.7630628581151962E-2,1.0000000125734188,1.5857754254627881E-4,1,0,558.24618069422377,1.5690050014452732,1.0013683091626235,5.2282898872221595E-2,1.0000008197858741,1.2804571949887546E-3,1.0000067214836448,3.6664549626048686E-3,4.1566436263255646,6.1498891768439262E-3,1.0000002811235107,1.1046631714084253E-3,51.265544338904618,-92.192502256654052,87.807497743345948,null,1000000000,398110.52160000004,null,42.782578929130601,-86.975140064147794,null,46.878362770472648,-5.0750718931693886,null,0,0]
[691.83,0.69183000000000006,1.0046291394903473,9.6034913484769613E-2,1.0000000151164044,1.7387584169170834E-4,1,0,612.10116481005662,1.5691626091966802,1.0016448237238795,5.731618176774439E-2,1.0000009855882563,1.4039853608641092E-3,1.0000080809045389,4.0201617185782468E-3,4.1566593956050122,6.7431645622169686E-3,1.0000003379810085,1.2112322648961142E-3,50.461247914805583,-92.420710048915538,87.579289951084462,null,1000000000,478628.74890000006,null,41.985026741547252,-86.702862098357642,null,46.871639678322325,-5.561831379837014,null,0,0]
[758.58,0.75858000000000003,1.0055629097338243,0.10523538622985336,1.0000000181740825,1.9065194588501058E-4,1,0,671.15851777006503,1.5693063652678938,1.0019772029376084,6.2832326847144931E-2,1.0000011849484913,1.5394462129337712E-3,1.0000097154655712,4.4080351434824683E-3,4.1566783564586469,7.3937445344022983E-3,1.0000004063462897,1.328095853220691E-3,49.655994472986301,-92.668590992890955,87.331409007109045,null,1000000000,575443.61640000006,null,41.187868794090562,-86.402808217056034,null,46.863569607590719,-6.0947142286871676,null,0,0]
[831.76,0.83175999999999994,1.0066842478648683,0.1153015729819528,1.0000000218497151,2.0904408516008422E-4,1,0,735.90485446710318,1.5694374550580339,1.0023766098705571,6.8875431050933633E-2,1.0000014245992312,1.6879558879698653E-3,1.0000116803666523,4.8332707271557512E-3,4.1567011491724228,8.1069874819552946E-3,1.0000004885281464,1.4562168548726746E-3,48.849811045393103,-92.937905120282309,87.062094879717691,null,1000000000,691824.69759999996,null,40.391397150412168,-86.072583719952547,null,46.853888384987101,-6.6777512467441529,null,0,0]
[912.01,0.91200999999999999,1.0080309021464662,0.12631327528218944,1.0000000262693252,2.2921310900393758E-4,1,0,806.90641780185956,1.5695570253915168,1.0028566493340128,7.5496562819772656E-2,1.0000017127571206,1.8508131596309714E-3,1.0000140429743098,5.2995867714745876E-3,4.1567285551482192,8.8891282184083136E-3,1.0000005873442712,1.5967157563716891E-3,48.04228816653567,-93.230638007577411,86.769361992422589,null,1000000000,831762.24009999994,null,39.595523298058595,-85.709402723375831,null,46.842276105045372,-7.315569708669992,null,0,0]
[1000,1,1.0096475188188359,0.13835165234430397,1.0000000315827335,2.5132740670826242E-4,1,0,884.75599341370548,1.5696660714246509,1.0034334653915342,8.2748657812642859E-2,1.0000020591904049,2.0293776736835024E-3,1.0000168833756682,5.810875688090673E-3,4.1567615033222625,9.7466929489601895E-3,1.0000007061444436,1.7507655660725487E-3,47.233308849309388,-93.54875013125627,86.45124986874373,null,1000000000,1000000,null,38.80050787013873,-85.310367157697684,null,46.828356392857287,-8.0128772553183421,null,0,0]
[1096.5,1.0965,1.011588139941846,0.15150796220349119,1.0000000379723073,2.7558050028171513E-4,1,0,970.13484250796353,1.5697655420696506,1.0041266696389877,9.0692097391759638E-2,1.0000024757893331,2.2252120011809454E-3,1.0000202990547198,6.3716106832546185E-3,4.156801124398088,1.0687181182571994E-2,1.0000008490061369,1.9197143673550584E-3,46.422398624665611,-93.894394037626626,86.105605962373374,null,1000000000,1202312.25,null,38.006330886295267,-84.872161323089713,null,46.811676275447823,-8.7749687384523298,null,0,0]
[1202.3,1.2022999999999999,1.0139161733560116,0.16587153845774896,1.0000000456536398,3.0217093825079801E-4,1,0,1063.7419214671359,1.5698562490118271,1.0049593837331547,9.9387865067780773E-2,1.0000029766104417,2.439919284784747E-3,1.0000244052547229,6.9863808064263141E-3,4.1568487550342592,1.1718285617526287E-2,1.0000010207497108,2.1049452569534594E-3,45.609479260277453,-94.269578122086841,85.730421877913159,null,1000000000,1445525.2899999998,null,37.21344324338552,-84.391429481218566,null,46.791708415317508,-9.6070304658248062,null,0,{"$f":"IF(AH90>0,W90,0)","v":0}]
[1318.3,1.3183,1.0167078680626438,0.18154068306138413,1.0000000548881023,3.313249151157362E-4,1,0,1166.373509788606,1.5699389683980209,1.0059595563376216,0.10890462937095345,1.0000035786949468,2.6753258771079762E-3,1.0000293416871948,7.6604137965430794E-3,4.1569060156439779,1.2848768726162838E-2,1.000001227219061,2.3080339131643555E-3,44.794125635808591,-94.676429212037078,85.323570787962922,null,1000000000,1737914.89,null,36.422050778645179,-83.864386327346267,null,46.76782402677712,-10.514772044268023,null,0,0]
[1445.4,1.4454,1.0200516059765579,0.19860606705375722,1.0000000659820507,3.6326862532532758E-4,1,0,1278.8258870282266,1.5700143594355747,1.0071598140894855,0.11930929854315216,1.0000043020169742,2.9332581036896118E-3,1.0000352721060612,8.398936757048418E-3,4.1569748054226201,1.4087390019350839E-2,1.0000014752638773,2.5305560109617014E-3,43.976387816506445,-95.116730937604345,84.883269062395655,null,1000000000,2089181.1600000001,null,35.632926433184032,-83.28734071213853,null,46.739302779260839,-11.503465861206049,null,0,0]
[1584.9,1.5849000000000002,1.024061108761199,0.21720204336593152,1.0000000793329193,3.9832879421174269E-4,1,0,1402.2492348604569,1.5700831867482479,1.0086023550088339,0.13069917543413712,1.0000051724888201,3.2163539993852169E-3,1.000042408945325,9.2095001616366492E-3,4.1570575880829939,1.5446803118270513E-2,1.0000017737702338,2.7747875264217772E-3,43.154348137509864,-95.593205142712819,84.406794857287181,null,1000000000,2511908.0100000002,null,34.845074796286056,-82.654912550941077,null,46.705225720243256,-12.580921456403798,null,0,0]
[1737.8,1.7378,1.0288591288997788,0.23741002872189784,1.0000000953782364,4.3675674880220791E-4,1,0,1537.5283084726404,1.5701459322200511,1.0103333018747103,0.14314397334683077,1.0000062186367413,3.5266427420891579E-3,1.0000509860613906,1.0097910196628722E-2,4.1571570756115106,1.6936732862265318E-2,1.0000021325206552,3.0424792005929327E-3,42.328537481619925,-96.106976689620865,83.893023310379135,null,1000000000,3019948.84,null,34.060001336708723,-81.963251438965429,null,46.664621897475847,-13.751889574628315,null,0,0]
[1905.5,1.9055,1.0345998662692988,0.25934854892718889,1.0000001146746977,4.7890434695385941E-4,1,0,1685.9017651761083,1.5702031723897618,1.0124110581164163,0.15674208796943603,1.0000074767564784,3.8669651908679091E-3,1.0000613009980246,1.1072295758167122E-2,4.157276718413728,1.857079512511382E-2,1.0000025639621011,3.3360820721717041E-3,41.497693880339426,-96.6598294064313,83.3401705935687,null,1000000000,3630930.25,null,33.277651753453263,-81.206915521022367,null,46.616288266013328,-15.023281518510432,null,0,0]
[2089.3000000000002,2.0893000000000002,1.0414569088702852,0.2831027479014494,1.0000001378641354,5.2509831363011699E-4,1,0,1848.5197868045673,1.5702553533869223,1.014902365128838,0.17157867794450582,1.0000089886942813,4.2399591864519647E-3,1.0000736967873063,1.214020276413354E-2,4.1574204940737474,2.0361622304709816E-2,1.000003082445065,3.6578720934099906E-3,40.661616893312583,-97.252342264399331,82.747657735600669,null,1000000000,4365174.4900000012,null,32.499149544339673,-80.381202264780029,null,46.558906215362221,-16.400087357799638,null,0,0]
[2290.9,2.2909000000000002,1.0496442887903465,0.3087843775468081,1.0000001657532114,5.7576590452743538E-4,1,0,2026.8864573440949,1.5703029592276383,1.0178904913662277,0.18776461950689283,1.0000108070427833,4.6490741997471862E-3,1.0000886045399076,1.3311498645794839E-2,4.1575934011434317,2.2325732263360251E-2,1.0000037060054305,4.0108255079489459E-3,39.8187768404906,-97.885317895651355,82.114682104348645,null,1000000000,5248222.8100000005,null,31.724563261660279,-79.479984302130518,null,46.490884207169373,-17.888856051099214,null,0,0]
[2511.9,2.5119000000000002,1.0594017367534925,0.3364609722994199,1.0000001992757128,6.3130924233306782E-4,1,0,2222.4173852917561,1.5703463662967643,1.0214706332424266,0.20539418573626811,1.0000129926824333,5.0975566225321079E-3,1.0001065232753052,1.4595466430222533E-2,4.1578012248919274,2.4478652751821657E-2,1.0000044555214516,4.3977434655238425E-3,38.96867488943667,-98.557927109010407,81.442072890989593,null,1000000000,6309641.6100000003,null,30.955116741242044,-78.49806775329229,null,46.41050731836043,-19.493594490702005,null,0,0]
[2754.2,2.7542,1.0710139151025244,0.3662001804988203,1.0000002395745156,6.9220584757381397E-4,1,0,2436.7936057728689,1.5703859514452163,1.0257579323283426,0.22457482481375302,1.0000156201251469,5.5892614585516497E-3,1.0001280637132675,1.6003127683794718E-2,4.1580510447830488,2.6838813540267265E-2,1.0000053565463518,4.8219523208293362E-3,38.110138699731721,-99.268719693923828,80.731280306076172,null,1000000000,7585617.6399999987,null,30.191611481427394,-77.429538758375514,null,46.315811185213782,-21.218341867133425,null,0,0]
[3020,3.02,1.0848167306181395,0.39806010381038781,1.0000002880471257,7.59008638486497E-4,1,0,2671.9615805520452,1.5704220699078877,1.0308912032959028,0.24542369480144693,1.0000187804831508,6.1286522553397555E-3,1.0001539725855424,1.7547240913621379E-2,4.1583515157826145,2.9427538984993836E-2,1.0000064403266093,5.287303625151279E-3,37.241604140472106,-100.0152678487572,79.984732151242795,null,1000000000,9120400,null,29.434713767348299,-76.267960750774108,null,46.204576971238581,-23.066616158358233,null,0,0]
[3311.3,3.3113000000000001,1.1011743656475368,0.43202100960242912,1.0000003462953866,8.3222026722624292E-4,1,0,2929.6908203497783,1.5704549938417836,1.0370261077930671,0.26802475093281869,1.0000225781892258,6.7197863688774739E-3,1.0001851057096953,1.9239395040826026E-2,4.1587125551823663,3.2264169633386519E-2,1.0000077426774816,5.7972987378745282E-3,36.362787761902517,-100.7924947080031,79.207505291996895,null,1000000000,10964707.690000001,null,28.686386288813928,-75.008771512758543,null,46.074571798011441,-25.037458581128885,null,0,0]
[3630.8,3.6308000000000002,1.1205301579895373,0.46808328447523084,1.000000416345894,9.1251931420715734E-4,1,0,3212.3701646689819,1.5704850301619153,1.0443563350497274,0.29249450514561914,1.000027145366654,7.3681412322394594E-3,1.0002225457378444,2.1095235173355899E-2,4.1591467068077055,3.5374815579108598E-2,1.0000093089112607,6.3566644944715598E-3,35.47190881195214,-101.59490974609997,78.405090253900028,null,1000000000,13182708.640000001,null,27.947451058642102,-73.645626820758068,null,45.92320966657843,-27.131123233939682,null,0,0]
[3981.1,3.9811000000000001,1.1433657503908441,0.50616391591062337,1.0000005005595911,1.0005592260201944E-3,1,0,3522.2999775019412,1.5705124213865496,1.0531010902313602,0.31891407193934868,1.0000326359335008,8.0789907709677387E-3,1.0002675537415853,2.312981197638236E-2,4.1596685776164959,3.8784550185657726E-2,1.0000111918159926,6.9699525839215367E-3,34.568325970109349,-102.41422285771974,77.585777142280264,null,1000000000,15849157.209999999,null,27.219815380685542,-72.174195225237213,null,45.747961461463397,-29.343077202683943,null,0,0]
[4365.2,4.3651999999999997,1.1702307112608188,0.54614652373529682,1.0000006018079008,1.0970939787025261E-3,1,0,3862.1345250159634,1.5705374026158716,1.0635195344931865,0.34736137827571323,1.0000392370841533,8.8584198635052094E-3,1.000321663216595,2.5360481760722194E-2,4.160295925017758,4.2522258615193848E-2,1.0000134555936349,7.6424149034546932E-3,33.65117061041493,-103.24058143861302,76.75941856138698,null,1000000000,19054971.039999999,null,26.505245085962198,-70.590373948277289,null,45.546216424243298,-31.666910106505636,null,0,0]
[4786.3,4.7862999999999998,1.20173034447531,0.58785270197178752,1.0000007235180965,1.2029278118289206E-3,1,0,4234.7050244770717,1.5705601828359872,1.075909986205829,0.37788844571064051,1.0000471722446524,9.712918240826731E-3,1.0003867041376604,2.7805739048864662E-2,4.161049931771621,4.6618664158748165E-2,1.0000161768746636,8.3796533778337998E-3,32.720053048024916,-104.06214231577505,75.937857684224952,null,1000000000,22908667.690000001,null,25.805870163201995,-68.891566182493818,null,45.315483123349722,-34.092674922957499,null,0,0]
[5248.1,5.2481,1.238546777976506,0.6310679924993513,1.0000008698687664,1.3189906260180568E-3,1,0,4643.2850708699316,1.5705809620278259,1.0906225285158293,0.41053478361001039,1.0000567138122822,1.0649988923139559E-2,1.0004649071356144,3.0486951028391877E-2,4.1619564079622586,5.1109211479660563E-2,1.0000194490885816,9.188145142784987E-3,31.774549125329191,-104.86591998663532,75.134080013364681,null,1000000000,27542553.610000003,null,25.123714141080594,-67.075949557423328,null,45.053348246437118,-36.608401939984574,null,0,0]
[5370.3,5.3703000000000003,1.248661493194777,0.6420704727623896,1.0000009108494901,1.3497027810795653E-3,1,0,4751.402181756187,1.5705858626057732,1.0947068599722314,0.4190238106522286,1.0000593856005002,1.0897950428823622E-2,1.000486804236792,3.1196372764211971E-2,4.1622102016499918,5.2297151806358889E-2,1.0000203653659783,9.4020852036503268E-3,31.536071276508029,-105.06233345997468,74.937666540025319,null,1000000000,28840122.090000004,null,24.956229535707315,-66.604052065383542,null,44.982694542011302,-37.249295809656559,null,0,0]
[5432.85,5.4328500000000002,1.2538966424828457,0.6476332396165303,1.0000009321910932,1.3654232817272788E-3,1,0,4806.7436325839062,1.5705882857418156,1.0968278418925832,0.4233444315179391,1.00006077698955,1.1024872925118428E-2,1.0004982074391298,3.1559489375389216E-2,4.1623423641102661,5.290516156705094E-2,1.0000208425375019,9.5115937393101709E-3,31.41576721294209,-105.16031914406804,74.83968085593196,null,1000000000,29515859.122500002,null,24.872446642149612,-66.363909683459141,null,44.946350172060306,-37.573392531759445,null,0,0]
[5495.4,5.4954000000000001,1.2591702694820301,0.65314958028885461,1.0000009537798309,1.3811437817001064E-3,1,0,4862.0850834392049,1.5705906537163945,1.0989692198808154,0.42764829472132793,1.0000621844888538,1.1151795066193421E-2,1.0005097425578142,3.1922597661524332E-2,4.1624760527368263,5.3513132653502417E-2,1.0000213252347363,9.621102231367161E-3,31.296627081822557,-105.25660002499582,74.743399975004181,null,1000000000,30199421.159999996,null,24.789943776702895,-66.124724263989719,null,44.909891738259375,-37.894829227122713,null,0,0]
[5559.4,5.5593999999999992,1.2646054707155534,0.65874600269433636,1.000000976124821,1.3972287050264167E-3,1,0,4918.7094296656487,1.5705930214317341,1.1011812247743784,0.43203451904351481,1.0000636412907398,1.1281659075218772E-2,1.0005216816113822,3.2294114609667503E-2,4.1626144199513577,5.4135156905627459E-2,1.0000218248409343,9.733149243932605E-3,31.175906419216034,-105.35336682133989,74.64663317866011,null,1000000000,30906928.359999996,null,24.706824245890992,-65.880988441776111,null,44.872475686373861,-38.220978834408605,null,0,0]
[5623.4,5.6233999999999993,1.2700799396083593,0.66429435273078064,1.0000009987285361,1.4133136276297312E-3,1,0,4975.333775919039,1.5705953352530682,1.1034143300753487,0.43640307332626077,1.0000651149583104,1.1411522703706387E-2,1.0005337587584913,3.2665622640144568E-2,4.16275438459658,5.4757139737401331E-2,1.000022330232007,9.8451962097869453E-3,31.056357578403144,-105.44838671790484,74.551613282095161,null,1000000000,31622627.559999995,null,24.624986810824424,-65.638261928545205,null,44.834951486506618,-38.544374095199387,null,0,0]
[5688.9,5.6888999999999994,1.2757228477672005,0.66992325833878075,1.0000010221299178,1.4297755398492633E-3,1,0,5033.2852553146968,1.5705976493991494,1.1057214883821156,0.44085565776896146,1.0000666406281384,1.1544429612397102E-2,1.0005462619448378,3.3045828549785099E-2,4.1628992835241485,5.5393656912179602E-2,1.0000228534580244,9.9598692274762476E-3,30.935196786382075,-105.543845187456,74.456154812544,null,1000000000,32363583.209999997,null,24.542529696087506,-65.39089522750993,null,44.796441603423915,-38.872513712035001,null,0,0]
[5754.4,5.7543999999999995,1.2814058199228529,0.67550241157742541,1.0000010458022941,1.4462374512938722E-3,1,0,5091.2367347366953,1.5705999108632611,1.1080504766375416,0.44528961222137159,1.0000681839633359,1.1677336113223651E-2,1.0005589097630567,3.3426024902206232E-2,4.1630458552960219,5.6030129703828313E-2,1.000023382743267,1.0074542195099553E-2,30.815216758779187,-105.63751543601106,74.362484563988943,null,1000000000,33113119.359999996,null,24.461357249537702,-65.144592904468482,null,44.757830042118059,-39.197802725258342,null,0,0]
[5821.4,5.8213999999999997,1.2872598340246268,0.68115818457880029,1.0000010702971609,1.4630763522658601E-3,1,0,5150.5153473015534,1.5706021714650213,1.110455242858174,0.44980577382708153,1.0000697809188297,1.1813285847499778E-2,1.000571996858318,3.3814918039090411E-2,4.1631975142362414,5.6681131762740318E-2,1.0000239304185046,1.0191841208818171E-2,30.693687409725378,-105.73150290378976,74.26849709621024,null,1000000000,33888697.959999993,null,24.379625778422561,-64.893754773515624,null,44.718234974839291,-39.527610588967818,null,0,0]
[5888.4,5.8883999999999999,1.2931546511248779,0.68676257206248015,1.0000010950755764,1.4799152524081409E-3,1,0,5209.7939598921339,1.5706043806231595,1.1128825594594918,0.45430232634275008,1.000071396357884,1.1949235145082893E-2,1.000585235273987,3.4203800944151562E-2,4.1633509231407908,5.7332086314432443E-2,1.0000244844336745,1.0309140168931375E-2,30.573346991237177,-105.82366460510399,74.176335394896014,null,1000000000,34673254.559999995,null,24.299180052345385,-64.644037188140416,null,44.678545420369304,-39.854474276358076,null,0,0]
[5957,5.9569999999999999,1.2992319361638491,0.69244792021476187,1.0000011207395021,1.4971562746692569E-3,1,0,5270.4881811673386,1.5706065910490556,1.1153910526550104,0.45888588657392293,1.000073069525423,1.2088430535349836E-2,1.0005989466086407,3.4601959881489203E-2,4.1635098084881577,5.7998536263304756E-2,1.0000250582479036,1.0429240242056109E-2,30.451341309618734,-105.91615969161388,74.083840308386115,null,1000000000,35485849,null,24.218116002008408,-64.389520487924131,null,44.637816236422204,-40.186114120424477,null,0,0]
[6025.6,6.0256000000000007,1.3053508246949317,0.69808014837184995,1.0000011467006809,1.5143972960403043E-3,1,0,5331.182402467708,1.5706087511446241,1.1179228736786484,0.46344878102837012,1.0000747620696691,1.2227625457160236E-2,1.000612816564423,3.5000107843814632E-2,4.1636705279654498,5.8664935264065868E-2,1.0000256387084916,1.0549340257675644E-2,30.330535453552528,-106.00679008428639,73.993209915713607,null,1000000000,36307855.360000007,null,24.138341058699396,-64.136184938939977,null,44.59700020926347,-40.514710409711242,null,0,0]
[6095.8,6.0958000000000006,1.3116548906699457,0.70378915310792833,1.0000011735751018,1.5320404394266374E-3,1,0,5393.2922324533092,1.5706109112893707,1.1205377312464009,0.46809665290413383,1.0000765141499433,1.2370066417161141E-2,1.0006271742245345,3.540753056280966E-2,4.1638368945770106,5.9346823750436893E-2,1.0000262395882158,1.0672241379616677E-2,30.208130759381206,-106.09763011982659,73.90236988017341,null,1000000000,37158777.640000001,null,24.058010471615138,-63.878166529461289,null,44.555148523110759,-40.847843124620653,null,0,0]
[6166,6.1660000000000004,1.318001297302279,0.70944336094694804,1.0000012007608035,1.5496835818591815E-3,1,0,5455.4020624635041,1.5706130222475598,1.1231766824543263,0.47272278358366432,1.0000782865211257,1.2512506875175093E-2,1.0006416979772421,3.5814941522406281E-2,4.1640051814207508,6.0028657658418451E-2,1.0000268474279577,1.0795142439935701E-2,30.086935918882091,-106.18657089945104,73.813429100548959,null,1000000000,38019556,null,23.978970743524929,-63.62139095182588,null,44.51321838332273,-41.177836205118581,null,0,0]
[6237.8,6.2378,1.3245355161896259,0.71517020207492887,1.0000012288881259,1.5677288461980769E-3,1,0,5518.9275011594764,1.5706151321687194,1.1259005277178691,0.47743181672487234,1.0000801202780047,1.2658193314053557E-2,1.00065672456223,3.6231625896964166E-2,4.1641792899993177,6.0725974836058239E-2,1.0000274763213766,1.0920844599538286E-2,29.964206998880467,-106.27560247015077,73.724397529849227,null,1000000000,38910148.840000004,null,23.899435185678989,-63.360051334606375,null,44.470257760075107,-41.512128317809889,null,0,0]
[6309.6,6.3096000000000005,1.3311127481729754,0.72084063325191983,1.0000012573410806,1.5857741095159678E-3,1,0,5582.4529398794566,1.5706171940702471,1.1286492189875215,0.48211801677979266,1.0000819752610448,1.2803879215576684E-2,1.0006719248818745,3.6648297684899744E-2,4.1643554068440913,6.1423233608262531E-2,1.0000281124957049,1.1046546693176272E-2,29.842697130039767,-106.3627048171555,73.637295182844497,null,1000000000,39811052.160000004,null,23.821190696454639,-63.100017174755479,null,44.427227786897667,-41.843188374662262,null,0,0]
[6383.05,6.3830499999999999,1.3378849739293139,0.7265834946029146,1.0000012867848409,1.6042340609639452E-3,1,0,5647.4382250564177,1.5706192553573042,1.1314865967801278,0.48688824159213218,1.0000838948358493,1.2952912489697523E-2,1.0006876542735266,3.7074531625370263E-2,4.1645376486995449,6.2136454611983388E-2,1.0000287708234534,1.1175137414904673E-2,29.719632953312882,-106.44984304241378,73.550156957586225,null,1000000000,40743327.302500002,null,23.742454225042735,-62.835360506040288,null,44.383143657002975,-42.178540121117848,null,0,0]
[6456.5,6.4565000000000001,1.3447008784609469,0.73226832401949304,1.0000013165693715,1.6226940113185729E-3,1,0,5712.4235102568264,1.5706212697454127,1.1343495924567144,0.49163449472250953,1.0000858366233485,1.3101945188396285E-2,1.000703565459746,3.7500752089033612E-2,4.1647219916412412,6.284961309335603E-2,1.0000294367706049,1.1303728065994488E-2,29.597797882761135,-106.53502422478684,73.464975775213162,null,1000000000,41686392.25,null,23.665009294540202,-62.572074593449877,null,44.338999881948411,-42.510566878665955,null,0,0]
[6531.7,6.5316999999999998,1.351723739097906,0.7380290123045935,1.0000013474165861,1.6415937823533399E-3,1,0,5778.9571174562079,1.5706232851915993,1.1373071397638348,0.4964689622388711,1.0000878476880706,1.3254528097142369E-2,1.0007200440758146,3.7937113443838315E-2,4.1649129031695677,6.3579697583285785E-2,1.0000301264783127,1.1435382409415972E-2,29.474309967756568,-106.62024005619419,73.379759943805809,null,1000000000,42663104.890000001,null,23.587027273781537,-62.303937841520181,null,44.293749111528477,-42.847090365995761,null,0,0]
[6606.9,6.6068999999999996,1.3587909928494084,0.74372996392578439,1.0000013786210022,1.6604935522153469E-3,1,0,5845.4907246785287,1.5706252547580091,1.1402911300524758,0.50127823935272564,1.0000898820362878,1.3407110388683051E-2,1.0007367132339233,3.8373460344882732E-2,4.1651060165014639,6.4309715034017209E-2,1.0000308241728368,1.1567036677068439E-2,29.352063629477747,-106.70347085134442,73.29652914865558,null,1000000000,43651127.609999992,null,23.510339137662623,-62.037241729259179,null,44.248448955121205,-43.180191190323399,null,0,0]
[6683.85,6.6838500000000005,1.3660679465899574,0.74950232963703955,1.0000014109213524,1.6798331426213086E-3,1,0,5913.5726539003726,1.5706272242805128,1.1433717187984871,0.50617333256203567,1.0000919878287919,1.3563242818608861E-2,1.0007539675395563,3.8819946460561812E-2,4.1653059027655832,6.5056650733226112E-2,1.0000315463713831,1.170175462825407E-2,29.228234207641574,-106.7866186241033,73.213381375896702,null,1000000000,44673850.822500005,null,23.43317561867023,-61.765832122339425,null,44.202050126639058,-43.517534076889632,null,0,0]
[6760.8,6.7608000000000006,1.3733899347626952,0.75521333524167222,1.0000014435957227,1.6991727317706871E-3,1,0,5981.6545831446329,1.570629148969638,1.1464795573308855,0.51104200299899094,1.0000941180007712,1.3719374587225476E-2,1.000771421338442,3.9266417091498355E-2,4.1655080938507485,6.5803514628718252E-2,1.0000322769328109,1.183647249825517E-2,29.105657848738137,-106.86775879698624,73.132241203013763,null,1000000000,45708416.640000001,null,23.357306634036803,-61.495933822106764,null,44.15561288386796,-43.851361283732373,null,0,0]
[6839.55,6.83955,1.3809290769332092,0.76099503467042828,1.0000014774216521,1.7189647076542316E-3,1,0,6051.3290721597159,1.5706310738409377,1.1496880766200002,0.51599718711829168,1.0000963232427373,1.3879157868323702E-2,1.000789489950028,3.9723315262704437E-2,4.1657174005242883,6.6567773834046301E-2,1.0000330332420055,1.1974341578430438E-2,28.981487967968768,-106.94875564043377,73.051244359566226,null,1000000000,46779444.202500001,null,23.280972923013469,-61.221287879692028,null,44.108056328458531,-44.189393579532599,null,0,0]
[6918.3,6.9183000000000003,1.3885138786888549,0.76671375809455711,1.0000015116393042,1.7387566821910612E-3,1,0,6121.0035611967105,1.5706329548911802,1.1529246676536005,0.5209246704099334,1.0000985540177467,1.4038940440690423E-2,1.0008077674747944,4.0180196840829498E-2,4.1659291203926525,6.7331956115700642E-2,1.0000337983099177,1.211221057159804E-2,28.858583264256197,-107.02772535215188,72.972274647848124,null,1000000000,47862874.890000001,null,23.205934396589907,-60.948226526424008,null,44.060472964747468,-44.523817611144949,null,0,0]
[6998.9,6.9988999999999999,1.3963233676786313,0.77250229756339484,1.0000015470664341,1.7590136096396188E-3,1,0,6192.314847775855,1.5706348362975739,1.1562661155456122,0.52593922000396309,1.0001008636379103,1.4202475892981115E-2,1.0008266906969172,4.0647794129522206E-2,4.1661483125107566,6.8114010052671814E-2,1.0000345904206365,1.2253318300763608E-2,28.734077638236059,-107.10649067299255,72.89350932700745,null,1000000000,48984601.209999993,null,23.130443732285446,-60.670391686072506,null,44.011750771952038,-44.862400733530293,null,0,0]
[7079.5,7.0795000000000003,1.404179122210947,0.77822625846464955,1.0000015829039075,1.7792705356445772E-3,1,0,6263.6261343764199,1.5706366748644023,1.159636470584517,0.53092474589170102,1.0001032000044916,1.436601058556666E-2,1.0008458327387155,4.1115373634041871E-2,4.1663700317530452,6.8895981566050854E-2,1.0000353917064433,1.2394425936662117E-2,28.610849853600971,-107.18321264345644,72.816787356543557,null,1000000000,50119320.25,null,23.056248822455995,-60.394217283545089,null,43.963014014544896,-45.197283771280802,null,0,0]
[7161.95,7.16195,1.4122622543614305,0.78401551754311261,1.0000016199885329,1.7999924143954581E-3,1,0,6336.5742185196232,1.5706385128137665,1.1631138328900461,0.53599467904587017,1.0001056176714807,1.4533298070833818E-2,1.0008656405430258,4.159366680922455E-2,4.1665994544609575,6.9695815302868253E-2,1.0000362208774507,1.2538772297846439E-2,28.486091929336744,-107.25962323492472,72.740376765075283,null,1000000000,51293527.802499995,null,22.981660961804561,-60.113421684689598,null,43.913150328191819,-45.536067044459571,null,0,0]
[7244.4,7.2443999999999997,1.4203921795779295,0.78973869443551781,1.0000016575025552,1.8207142916005178E-3,1,0,6409.5223026837439,1.5706403089269756,1.1666209134568557,0.54103425875895272,1.0001080633263921,1.4700584742615989E-2,1.0008856773006323,4.2071940943887498E-2,4.1668315207749886,7.0495560817836353E-2,1.0000370596495858,1.2683118559159507E-2,28.362623432432557,-107.33398030702025,72.666019692979745,null,1000000000,52481331.359999992,null,22.908367715212044,-59.834362766259652,null,43.863284955984682,-45.871064081638281,null,0,0]
[7328.75,7.3287500000000003,1.4287570429515397,0.79552616263160358,1.0000016963254144,1.8419136877051185E-3,1,0,6484.1514221618236,1.5706421046093155,1.1702392869066893,0.5461585800880967,1.0001105943022159,1.4871725561927816E-2,1.0009064127045164,4.2561216625781419E-2,4.1670716701150816,7.1313643550652894E-2,1.0000379276861748,1.2830791070035263E-2,28.237619999775816,-107.40796998743656,72.592030012563441,null,1000000000,53710576.5625,null,22.834694359699643,-59.550669312575067,null,43.812275518976946,-46.209907959425628,null,0,0]
[7413.1,7.4131,1.4371692042321862,0.80124606915053531,1.0000017355976887,1.8631130821541524E-3,1,0,6558.780541660336,1.5706438594272933,1.1738881993770396,0.55125117758595499,1.0001131545703101,1.5042865510018561E-2,1.0009273877061191,4.3050471918695099E-2,4.1673145853646174,7.2131631841126032E-2,1.0000388057715113,1.2978463473949519E-2,28.113918041848173,-107.4798996702839,72.520100329716101,null,1000000000,54954051.610000007,null,22.762314354243259,-59.268791109262438,null,43.761277867288406,-46.544880832217217,null,0,0]
[7499.45,7.4994499999999995,1.445828955442793,0.80703245923183764,1.0000017762666626,1.8848151279673478E-3,1,0,6635.1791720150586,1.5706456149636316,1.1776549675950305,0.55643169667520509,1.0001158058863087,1.5218062398146196E-2,1.0009491082112008,4.355130644825983E-2,4.1675661248664131,7.2968916290940974E-2,1.0000397150858684,1.3129637186148282E-2,27.988606906031734,-107.55144748873441,72.448552511265589,null,1000000000,56241750.302499995,null,22.689526853774645,-58.982107856530362,null,43.709090012172645,-46.883834742929935,null,0,0]
[7585.8,7.5857999999999999,1.4545365389826168,0.81274975838799368,1.0000018174066161,1.9065171720051258E-3,1,0,6711.5778023897674,1.5706473305330424,1.1814531394292844,0.56157904418762417,1.0001184878996483,1.5393258352001818E-2,1.0009710797786449,4.4052119116553184E-2,4.167820561964561,7.3806099509495515E-2,1.000040634931169,1.3280810783642417E-2,27.864611180576567,-107.62093038261942,72.37906961738058,null,1000000000,57544361.640000001,null,22.61803272197092,-58.697322851686579,null,43.656928031315118,-47.218830028754226,null,0,0]
[7674.15,7.67415,1.4634944201068314,0.81852886927584034,1.0000018599869034,1.9287218672016729E-3,1,0,6789.7459436211593,1.5706490458786564,1.1853714710250036,0.56681132884359831,1.0001212638043928,1.557251113783124E-2,1.0009938200766386,4.4564508496257385E-2,4.1680838907100926,7.4662567225494705E-2,1.0000415869811641,1.3435485676151377E-2,27.739080514355884,-107.68993414777849,72.310065852221513,null,1000000000,58892578.222499996,null,22.546190106988298,-58.407903733515568,null,43.603591423568446,-47.557538675570235,null,0,0]
[7762.5,7.7625000000000002,1.4725005835585556,0.82423747605559772,1.0000019030602403,1.9509265604963114E-3,1,0,6867.9140848720745,1.57065072217737,1.1893220399552384,0.57200899486971135,1.0001240718444162,1.5751762922847169E-2,1.0010168231664485,4.5076874461341961E-2,4.1683502517018285,7.5518926551767673E-2,1.0000425500556009,1.35901604457836E-2,27.614877934287737,-107.75687465627564,72.243125343724358,null,1000000000,60256406.25,null,22.475639061989177,-58.1204658221654,null,43.550295340053097,-47.892207727618441,null,0,0]
[7852.9,7.8529,1.4817647759897661,0.83000652017213583,1.0000019476433575,1.9736464710553405E-3,1,0,6947.8959747510489,1.5706523983297775,1.1933973086711154,0.57729149757540887,1.0001269783019748,1.5935172869440101E-2,1.0010406319909084,4.5601104425844301E-2,4.1686259311054865,7.6395042664634344E-2,1.0000435468875422,1.3748424031606629E-2,27.489143417423463,-107.82328374977305,72.176716250226946,null,1000000000,61668038.409999996,null,22.404756483399687,-57.828405363848034,null,43.495811247380928,-48.230515688239741,null,0,0]
[7943.3,7.9432999999999998,{"$f":"SQRT(1+(A141/pole1)^2)","v":1.4910776705653674},{"$f":"ATAN(A141/pole1)","v":0.83570368795153593},{"$f":"SQRT(1+(A141/Zero1)^2)","v":1.00000199274267},{"$f":"ATAN(A141/Zero1)","v":1.9963663795767969E-3},{"$f":"IF(VIN_nom>Vout, 1, SQRT(1+(A141/z_RHP)^2))","v":1},{"$f":"IF(VIN_nom>Vout, 0, -ATAN(A141/z_RHP))","v":0},{"$f":"SQRT(1+(A141/Pole2)^2)","v":7027.8778646491},{"$f":"ATAN(A141/Pole2)","v":1.5706540363307433},{"$f":"SQRT(1+(A141/Zero2)^2)","v":1.1975056517427392},{"$f":"ATAN(A141/Zero2)","v":0.58253789995093519},{"$f":"SQRT(1+(A141/pole4)^2)","v":1.000129918402817},{"$f":"ATAN(A141/pole4)","v":1.6118581743855352E-2},{"$f":"IF(VOUT_setting=1,1,SQRT(1+(A141*zterm1)^2))","v":1.0010647159052775},{"$f":"IF(VOUT_setting=1,0,ATAN(((A141*zterm1))))","v":4.6125309310238762E-2},4.1689047838651696,{"$f":"IF(VOUT_setting=1,0,ATAN(A141*$Q$4/(1+Afbr-$Q$5*(A141)^2)))","v":7.7271042716650779E-2},{"$f":"SQRT((1-(Z141/pterm2))^2+(A141/pterm1)^2)","v":1.0000445552614903},{"$f":"IF((ATAN((A141/pterm1)/(1-A141^2/pterm2))>0),ATAN((A141/pterm1)/(1-A141^2/pterm2)),PI()+ATAN((A141/pterm1)/(1-A141^2/pterm2)))","v":1.3906687485788221E-2},{"$f":"20*LOG10(((E141*K141*G141*O141)/(C141*I141*S141*M141*Q141))*Adc)","v":27.364749877164186},{"$f":"((F141+L141+H141+P141)-(D141+J141+T141+N141+R141))*radconv","v":-107.88763556147488},{"$f":"IF(V141>0,V141,V141+180)","v":72.11236443852512},null,{"$f":"IF(U141<0,A141,1000000000)","v":1000000000},{"$f":"A141^2","v":63096014.890000001},null,{"$f":"20*LOG10((K141/(I141*M141))*AEA)","v":22.335163344392637},{"$f":"(L141-(J141+N141))*radconv","v":-57.538411054743015},null,{"$f":"20*LOG10((E141*G141/(C141*S141))*Acs*Am)","v":43.441382883469927},{"$f":"(F141+H141-(D141+T141))*radconv","v":-48.564705430665725},null,{"$f":"SUM((U142<0)*(U141>0))*A141","v":0},0]
[8035.8,{"$f":"A142/1000","v":8.0358000000000001},1.500656370969393,0.8414598149980278,1.0000020394239648,2.0196140714502293E-3,1,0,7109.7177409465994,1.5706556742345934,1.2017433138917533,0.58786889528685138,1.0001329616268184,1.6306250099965405E-2,1.0010896440200747,4.6661665261073647E-2,4.1691933985232001,7.8167270830165156E-2,1.0000455990073713,1.4068627276171372E-2,27.238829750661033,-107.95140589201422,72.048594107985778,null,1000000000,64574081.640000001,null,22.265256690433088,-57.243813970785581,null,43.385754427255861,-48.902453689053161,null,0,0]
[8128.3,8.1282999999999994,1.5102841609691906,0.84714273979585186,1.000002086645716,2.0428617611406366E-3,1,0,7191.5576172627379,1.5706572748597745,1.2060148884230881,0.59316227655457765,1.0001360400746997,1.6493917307387612E-2,1.0011148601116537,4.7197994346713401E-2,{"$f":"IF(VOUT_setting=1,1,SQRT((1+Afbr-$Q$5*(A143)^2)^2+(A143*$Q$4)^2))","v":4.1694853343279741},7.9063374665486408E-2,1.0000466548377591,1.423056692551603E-2,27.114263622858754,-108.01312937897441,71.986870621025588,null,1000000000,66069260.890000001,null,22.196636951596545,-56.951369812462858,null,43.330197438461589,-49.236007759580446,null,0,0]
[8222.9500000000007,8.2229500000000009,1.5201855734157217,0.85288305171205037,1.0000021355244988,2.066649800251424E-3,1,0,7275.2997177497282,1.5706588754125557,1.210420477552179,0.59853986521009528,1.0001392265368245,1.6685945306535516E-2,1.0011409603791253,4.7746761330911727E-2,4.1697874927751997,7.9980176759945565E-2,1.0000477477181793,1.4396270429833808E-2,26.988178473373047,-108.07422400556585,71.925775994434147,null,1000000000,67616906.702500015,null,22.127722635634008,-56.654350777023637,null,43.273429591268837,-49.573034563056382,null,0,0]
[8270.2750000000015,8.2702750000000016,1.525154881013318,0.8557252110016208,1.0000021601760922,2.0785438189314066E-3,1,0,7317.1707680000927,1.5706596619506803,1.2126363267920173,0.6012139680347719,1.0001408335977782,1.6781958845486392E-2,1.0011541235667296,4.8021134051857775E-2,4.1699398754876489,8.0438527996521667E-2,1.0000482989032002,1.447912212543514E-2,26.925650099267319,-108.10400593550949,71.895994064490509,null,1000000000,68397448.575625017,null,22.093748891469303,-56.506682206889892,null,43.24507817389933,-49.739943870655033,null,0,0]
[8317.6,8.3176000000000005,1.530136428533599,0.85854888697807186,1.0000021849691536,2.0904378370232945E-3,1,0,7359.0418182549301,1.5706604395384067,1.2148608157147567,0.60387829694229056,1.0001424498786002,1.6877972074996896E-2,1.0011673621196218,4.8295499537332663E-2,4.1700931270658286,8.0896845777191861E-2,1.0000488532514309,1.4561973783041556E-2,26.863460393454915,-108.13328681880866,71.866713181191344,null,1000000000,69182469.760000005,null,22.060092257892528,-56.359573110409571,null,43.216749460047467,-49.905794160276059,null,0,0]
[8366.0499999999993,8.3660499999999995,1.5352489517781376,0.86142068027137619,1.000002210498143,2.102614596612388E-3,1,0,7401.9082183619048,1.5706612264973057,1.217147085455158,0.60659585309741015,1.0001441141324976,1.6976267388505627E-2,1.0011809934474363,4.857637964338804E-2,4.1702509217014176,8.1366023739216656E-2,1.00004942405441,1.4646794933333245E-2,26.800139987377626,-108.16275184136899,71.837248158631013,null,1000000000,69990792.602499992,null,22.02596008765401,-56.209545607993512,null,43.187771627188553,-50.074498012801705,null,0,0]
[8414.5,8.4145000000000003,1.5403740524147205,0.86427338701906209,1.0000022361754057,2.1147913555779568E-3,1,0,7444.7746184734124,1.5706620043937154,{"$f":"SQRT(1+(A148/Zero2)^2)","v":1.2194423102186496},{"$f":"ATAN(A148/Zero2)","v":0.60930319925820586},1.0001457880497238,1.7074562373935613E-2,1.0011947037599029,4.8857252078884451E-2,4.1704096267989748,8.1835166240318155E-2,1.0000499981727811,1.4731616043341E-2,26.737168128008996,-108.19170614242006,71.80829385757994,null,1000000000,70803810.25,null,21.992152290817629,-56.060102557121823,null,43.158819167835254,-50.242108284544308,null,0,0]
[8462.9500000000007,8.4629500000000011,1.5455116053189606,0.86710715090049484,1.0000022620009426,2.1269681139163901E-3,1,0,7487.6410185893728,1.5706627733832828,1.2217464395353725,0.61200035339104875,1.0001474716302303,1.7172857029389071E-2,1.0012084930537772,4.9138116799822239E-2,4.170569242254567,8.2304273080561569E-2,1.0000505756065459,1.4816437112831539E-2,26.674541637487664,-108.22015692464743,71.779843075352574,null,1000000000,71621522.702500015,null,21.958664918714767,-55.911242937206424,null,43.129892852419076,-50.408633207711944,null,0,0]
[8511.4,8.5114000000000001,1.5506614867226818,0.86992211491020666,1.0000022879747532,2.1391448716240762E-3,1,0,7530.5074187097098,1.570663533618111,1.2240594231204105,0.61468733392044039,1.0001491648739684,1.727115135296825E-2,1.0012223613257958,4.9418973762209037E-2,4.1707297679636826,8.2773344060104795E-2,1.0000511563557066,1.4901258141571576E-2,26.612257381698157,-108.24811132505164,71.751888674948361,null,1000000000,72443929.959999993,null,21.925494084648566,-55.7629657012073,null,43.1009934331436,-50.574080975274676,null,0,0]
[8560.9500000000007,8.5609500000000001,1.5559409140556506,0.87278169267876726,1.0000023146916299,2.1515980875709338E-3,1,0,7574.3470497969829,1.5706643022129319,1.2264340261454032,0.61742481614409972,1.0001509065555643,1.7371676987777022E-2,1.0012366261452808,4.9706199179445409E-2,4.170894879597288,8.3253027442599339E-2,1.0000517537192519,1.4988004889150147E-2,26.548909792088384,-108.27619435130133,71.723805648698672,null,1000000000,73289864.902500018,null,21.891893558643911,-55.611923254973753,null,43.071466470865793,-50.742179418602333,null,0,0]
[8610.5,8.6105,1.5612329784958541,0.87562190749199986,1.0000023415635899,2.1640513028504393E-3,1,0,7618.1866808886762,1.5706650619618385,1.2288177842719572,0.62015169796664005,1.0001526583440528,1.7472202271456096E-2,1.0012509735628683,4.9993416388787675E-2,4.1710609430631198,8.3732672895074037E-2,1.0000523545504509,1.5074751593613312E-2,26.485913659028849,-108.30377308784024,71.696226912159759,null,1000000000,74140710.25,null,21.858616077290979,-55.46148764003437,null,43.041969174208432,-50.909168443877427,null,0,0]
[8660.0499999999993,8.66005,1.5665375519715785,0.87844290999330876,1.0000023685906323,2.1765045174587309E-3,1,0,7662.0263119847177,1.5706658130166713,1.2312106443242474,0.62286800052279523,1.0001544202393813,1.7572727201975641E-2,1.0012654035750075,5.0280625343202469E-2,4.1712279582475018,8.4212280204068374E-2,1.0000529588493059,1.5161498254711536E-2,26.423265765715716,-108.33085495400246,71.669145045997539,null,1000000000,74996466.002499983,null,21.825657675914869,-55.311657654041589,null,43.012502290631772,-51.075056682317189,null,0,0]
[8709.6,8.7096,1.5718545078392414,0.88124485001817632,1.000002395772758,2.1889577313919453E-3,1,0,7705.8659430850339,1.570666555525815,1.2336125533367772,0.6255737454080863,1.0001561922414963,1.767325177730587E-2,1.0012799161781274,5.0567825995664582E-2,4.1713959250361281,8.4691849156225518E-2,1.0000535666158195,1.52482448721953E-2,26.360962939054428,-108.35744729623795,71.64255270376205,null,1000000000,75857132.160000011,null,21.793014452144472,-55.162432068048737,null,42.98306654899929,-51.239852718848297,null,0,{"$f":"IF(AH154>0,W154,0)","v":0}]
[8760.3250000000007,8.7603249999999999,1.5773102424996266,0.88409364330697993,1.0000024237601077,2.2017062529239985E-3,1,0,7750.7451618091318,1.5706673069417214,1.2360807381303844,0.62833273960331815,1.0001580167329147,1.7776159764147897E-2,1.0012948584729369,5.0861828509372847E-2,4.1715688604923713,8.5182750374118765E-2,1.0000541923865371,1.5337048503282689E-2,26.29753686903873,-108.3841707531479,71.615829246852101,null,1000000000,76743294.105625018,null,21.759919612843408,-55.010292591071348,null,42.952965785441741,-51.407434187981345,null,0,0]
[8811.0499999999993,8.8110499999999998,1.5827786897078293,0.88692277445380885,1.0000024519099824,2.2144547737403858E-3,1,0,7795.6243805375534,1.570668049705862,1.2385582944886944,0.63108071671069399,1.0001598518160217,1.787906737445066E-2,1.0013098873145609,5.1155822223018482E-2,4.1717427929750963,8.5673610942303913E-2,1.0000548217913279,1.5425852088133383E-2,26.234465831751397,-108.41039654020041,71.589603459799591,null,1000000000,77634602.102499992,null,21.72714699448354,-54.858783829447574,null,42.922899145811719,-51.573889096753625,null,0,0]
[8861.7749999999996,8.8617749999999997,1.5882597181542919,0.88973240149557398,1.0000024802223824,2.2272032938369653E-3,1,0,7840.5035992702278,1.5706687839668052,1.2410451662850335,0.6338177013341344,1.0001616974907588,1.798197460603667E-2,1.0013250026991032,5.1449807086177801E-2,4.1719177223596091,8.6164430632224537E-2,1.0000554548301948,1.5514655626479678E-2,26.171746559111931,-108.43613230070893,71.563867699291066,null,1000000000,78531056.15062499,null,21.694692604991467,-54.707904381864182,null,42.892867353651653,-51.739226499998011,null,0,0]
[8912.5,8.9124999999999996,1.5937531980357511,0.89252268152946779,1.0000025086973074,2.2399518132095921E-3,1,0,7885.3828180070823,1.5706695098697376,{"$f":"SQRT(1+(A158/Zero2)^2)","v":1.2435412976315117},{"$f":"ATAN(A158/Zero2)","v":0.63654371853988034},1.0001635537570674,1.8084881456728472E-2,1.0013402046226441,5.1743783048436222E-2,4.172093648520522,8.6655209215440496E-2,1.0000560915031402,1.5603459118053869E-2,26.109375826965948,-108.46138559746831,71.538614402531692,null,1000000000,79432656.25,null,21.662552515202883,-54.557652820325202,null,42.86287111351853,-51.903455398705539,null,0,0]
[8964.4,8.9643999999999995,1.5993866831392543,0.89535773436821176,1.000002538000045,2.2529956400644323E-3,1,0,7931.3016243680158,1.5706702440848939,1.2461047753940016,0.63932155671786683,1.0001654639845203,1.819017165758283E-2,1.001355848250375,5.204455944010259E-2,4.1722746814026719,8.7157313468601449E-2,1.0000567466853809,1.569431961569704E-2,26.045917758400915,-108.48673231122166,71.513267688778342,null,1000000000,80360467.359999999,null,21.629989199730165,-54.404569167944082,null,42.832217549046035,-52.070350528064786,null,0,0]
[9016.2999999999993,9.0162999999999993,1.6050329330525583,0.89817286317368705,1.0000025674729243,2.2660394661526157E-3,1,0,7977.2204307331758,1.5706709698474106,1.2486778290573981,0.64208796801756696,1.0001673852997914,1.8295461455080798E-2,1.0013715824643674,5.2345326406981536E-2,4.1724567575071765,8.7659374205143817E-2,1.000057405672016,1.5785180063809148E-2,25.982817872679217,-108.5115897103329,71.488410289667101,null,1000000000,81293665.689999983,null,21.597746787765722,-54.252139720051346,null,42.801602635629294,-52.236104091611566,null,0,0]
[9068.2000000000007,9.0682000000000009,1.6106918135352668,0.90096823308975327,1.0000025971159456,2.2790832914697037E-3,1,0,8023.1392371024913,1.5706716873024191,1.2512603995469325,0.64484298072023793,1.000169317702817,1.8400750846890239E-2,1.001387407260351,5.2646083895103397E-2,4.1726398766974793,8.8161391180764354E-2,1.000058068463048,1.5876040462103461E-2,25.920072853051636,-108.53596563371175,71.464034366288246,null,1000000000,82232251.24000001,null,21.565821266827562,-54.1003628644321,null,42.771027068507919,-52.400725551375871,null,0,0]
[9120.1,9.1201000000000008,1.6163631919286789,0.90374400818542666,1.0000026269291085,2.2921271160112576E-3,1,0,8069.0580434758876,1.5706723965917462,1.2538524280569432,0.64758662356669483,1.0001712611935329,1.8506039830679066E-2,1.001403322634032,5.294683185050874E-2,4.1728240388362678,8.86633641512901E-2,1.0000587350584802,1.5966900810293227E-2,25.857679426901285,-108.55986783217092,71.440132167829077,null,1000000000,83176224.010000005,null,21.534208687839381,-53.949236962351392,null,42.740491523645545,-52.564224307803727,null,0,0]
[9173.2000000000007,9.1732000000000014,1.6221784984509857,0.90656385337936118,1.0000026576076815,2.305472531064424E-3,1,0,8116.0385563591808,1.5706731139743086,1.2565141153885138,0.65038196646071311,1.0001732610955807,1.8613762817125901E-2,1.0014196997320586,5.3254523593721757E-2,4.1730135383140725,8.9176897635710642E-2,1.0000594210038878,1.6059861923627468E-2,25.794203891845335,-108.58384039255826,71.416159607441742,null,1000000000,84147598.24000001,null,21.502185007785766,-53.795288787529422,null,42.709292060790531,-52.730351179980751,null,0,0]
[9226.2999999999993,9.2262999999999984,1.6280066115596472,0.90936353113248403,1.0000026884643549,2.3188179452963784E-3,1,0,8163.0190692466012,1.5706738230993866,1.2591855794954383,0.65316546993582203,1.0001752726038344,1.8721485371527364E-2,1.0014361716355971,5.3562205244062994E-2,4.1732041292335262,8.9690384539915069E-2,1.0000601109316611,1.6152822983906159E-2,25.73108960374606,-108.60733320100134,71.392666798998661,null,1000000000,85124611.689999983,null,21.470480742740243,-53.642018463570231,null,42.678135863676459,-52.895322539921544,null,0,0]
[9279.4,9.279399999999999,1.633847394207169,0.91214321360795025,1.0000027194991288,2.332163358702369E-3,1,0,8209.9995821380799,1.5706745241087372,1.2618667582832757,0.65593716619100451,1.0001772957182242,1.8829207491386012E-2,1.001452738339969,5.3869876743776711E-2,4.1733958114451051,9.0203824602826929E-2,1.0000608048418034,1.6245783990822212E-2,25.668333195138658,-108.63035427316872,71.36964572683128,null,1000000000,86107264.359999999,null,21.439091860975847,-53.489424153586988,null,42.647023596025775,-53.059148251830997,null,0,0]
[9332.5,9.3324999999999996,1.6397007110029531,0.91490307175456309,1.0000027507120033,2.3455087712776408E-3,1,0,8256.9800950335502,1.5706752171408906,1.264557589959358,0.65869708787831416,1.0001793304386792,1.8936929174204462E-2,1.0014693998404696,5.4177538035118662E-2,4.17358858479846,9.0717217563515501E-2,1.0000615027343176,1.6338744944068544E-2,25.605931342976614,-108.65291152901557,71.347088470984431,null,1000000000,87095556.25,null,21.408014394682947,-53.337503994548932,null,42.615955902058936,-53.221838110336712,null,0,0]
[9386.85,9.3868500000000008,1.6457046583636901,0.91770754561903956,1.0000027828440829,2.3591683405341686E-3,1,0,8305.066552210279,1.5706759183675674,1.2673216973686203,0.66150982041653672,1.000181425076476,1.9047186222981547E-2,1.0014865517256277,5.4492431191981036E-2,4.1737870259462717,9.124264699520615E-2,1.0000622211796621,1.6433894187771664E-2,25.542424272348502,-108.67552763717873,71.324472362821268,null,1000000000,88112952.922499999,null,21.376523772145546,-53.182703731918323,null,42.584203671651139,-53.387191641134585,null,0,0]
[9441.2000000000007,9.4412000000000003,1.6517214551547024,0.92049160929260898,1.0000028151627469,2.3728279089103295E-3,1,0,8353.1530093910442,1.5706766115207642,1.2700957874613852,0.66431028812459225,1.0001835318730441,1.915744280860588E-2,1.0015038029124819,5.4807313531817774E-2,4.1739866098911564,9.1768026528268695E-2,1.000062943797086,1.6529043374597485E-2,25.479281741490919,-108.69767431901599,71.302325680984012,null,1000000000,89136257.440000013,null,21.345351187404894,-53.028605703180517,null,42.552499443014646,-53.551375750924706,null,0,0]
[9495.5499999999993,9.4955499999999997,1.6577509614652142,0.92325544208629728,1.0000028476679952,2.3864874764010255E-3,1,0,8401.2394665757765,1.5706772967391127,1.2728797949694401,0.66709852740908737,1.0001856508283067,1.9267698928399721E-2,1.0015211533959008,5.5122184992747729E-2,4.1741873364691982,9.2293355883387579E-2,1.0000636705865926,1.6624192504216699E-2,25.416500325777491,-108.71935975766048,71.280640242339516,null,1000000000,90165469.80249998,null,21.314492585358135,-52.87520783018018,null,42.520843846034531,-53.714400713453507,null,0,0]
[9549.9,9.5498999999999992,1.6637930391191609,0.92599922195099804,1.0000028803598278,2.4001470430011608E-3,1,0,8449.3259237644088,1.5706779741580879,1.2756736549620149,0.66987457511992465,1.0001877819421865,1.9377954579685407E-2,1.0015386031707236,5.543704551290269E-2,4.174389205515574,9.2818634781410767E-2,1.000064401548185,1.6719341576300034E-2,25.354076645447826,-108.74059203274416,71.259407967255839,null,1000000000,91200590.00999999,null,21.283943975460176,-52.722508009182143,null,42.489237490900862,-53.876276724537611,null,0,0]
[9605.5249999999996,9.6055250000000001,1.6699897330194819,0.92878678850514473,1.0000029140117812,2.4141270492886472E-3,1,0,8498.5404441201281,1.5706786595308666,1.2785431907754112,0.67270316127896845,1.0001899756397243,1.9490796237173036E-2,1.001556565108124,5.5759280972081576E-2,4.1745969930319573,9.3356183691845979E-2,1.0000651539774981,1.6816722696410165E-2,25.290555505331909,-108.76186148608359,71.238138513916411,null,1000000000,92266110.52562499,null,21.25299561147019,-52.566946579796969,null,42.456941285015716,-54.040771055218734,null,0,0]
[9661.15,9.6611499999999992,1.676199307615637,0.93155372303328454,1.0000029478591759,2.4281070546324952E-3,1,0,8547.7549644797964,1.5706793370114462,1.2814229102224213,0.67551905661845202,1.0001921820728652,1.960363739823803E-2,1.0015746310391063,5.608150484005521E-2,4.1748059768956347,9.3893679158927837E-2,1.0000659107769465,1.6914103755555333E-2,25.227402058377994,-108.78267305978582,71.217326940214178,null,1000000000,93337819.32249999,null,21.222363697942104,-52.412111800179368,null,42.424697890308352,-54.204083254446537,null,0,0]
[9716.7749999999996,9.7167750000000002,1.6824216202852822,0.93430021185119083,1.0000029819020118,2.4420870590272405E-3,1,0,8596.969484843341,1.5706800067353666,1.2843127448010219,0.67832230199941923,1.0001944012415243,1.9716478060010038E-2,1.0015928009580428,5.6403717050540793E-2,4.175016156926965,9.4431120883931338E-2,1.0000666719465343,1.701148475338253E-2,25.164612821501816,-108.80303508205651,71.19696491794349,null,1000000000,94415716.40062499,null,21.192044158384149,-52.258001336765389,null,42.392507899538401,-54.366223997308587,null,0,0]
[9772.4,9.7723999999999993,1.688656530217771,0.93702643976521061,1.0000030161402886,2.4560670624674181E-3,1,0,8646.1840052106963,1.5706806688350814,1.2872126263848085,0.68111293871187051,1.0001966331456169,1.982931821961879E-2,1.0016110748592748,5.6725917537269945E-2,4.1752275329453159,9.4968508568314611E-2,1.000067437486265,1.7108865689538743E-2,25.102184357008888,-108.822955769873,71.177044230126995,null,1000000000,95499801.75999999,null,21.162032981504602,-52.104612831236828,null,42.360371885651759,-54.527203872408705,null,0,0]
[9829.2999999999993,9.8292999999999999,1.6950472414575211,0.93979438474631327,1.0000030513655649,2.4703675054425522E-3,1,0,8696.5265887454061,1.5706813383576166,1.2901893016151262,0.68395453857006161,1.000198929384521,1.9944744305276929E-2,1.0016298752017607,5.7055491094587144E-2,4.1754449912193055,9.5518157679097604E-2,1.0000682250947477,1.720847866387621E-2,25.038694681857482,-108.84288489304177,71.15711510695823,null,1000000000,96615138.48999998,null,21.131648838793261,-51.948452940488551,null,42.327555694901648,-54.690683485923742,null,0,0]
[9886.2000000000007,9.8862000000000005,1.7014508417202747,0.94254151570278133,1.0000030867953447,2.4846679474072914E-3,1,0,8746.8691722839703,1.5706820001732813,1.2931763467144184,0.68678303383336636,1.0002012389491954,2.0060169859412159E-2,1.0016487843359203,5.7385052244314977E-2,4.1756637005504214,9.6067749612161496E-2,1.0000690172760165,1.7308091572935905E-2,24.97557537235253,-108.86236925757609,71.137630742423909,null,1000000000,97736950.440000013,null,21.101579069339621,-51.793043415695166,null,42.294797134995846,-54.852970539988931,null,0,0]
[9943.1,9.9431000000000012,1.7078671860249437,0.94526802552754274,1.0000031224296275,2.4989683883557857E-3,1,0,8797.2117558263217,1.5706826544143846,1.2961736899902894,0.6895984699988571,1.0002035618395479,2.0175594878952513E-2,1.0016678022555925,5.7714600915570499E-2,4.1758836607421062,9.6617284048562402E-2,1.0000698140300752,1.7407704416339979E-2,24.912822890615871,-108.88141730180699,71.118582698193009,null,1000000000,98865237.610000014,null,21.071819582839872,-51.638381657471221,null,42.262096757651442,-55.014076086533628,null,0,0]
[10000,10,1.7142961312746221,0.94797410545495742,1.0000031582684139,2.5132688282821871E-3,1,0,8847.5543393723929,1.5706833012102241,1.2991812601659198,0.69240089297259244,1.0002058980554858,2.029101936082614E-2,1.0016869289545809,5.8044137037487016E-2,4.1761048715967233,9.7166760669561272E-2,1.0000706153569281,1.7507317193710591E-2,24.850433744678504,-108.9000373454417,71.099962654558297,null,1000000000,100000000,null,21.042366354716165,-51.484465042825455,null,42.229455094764973,-55.174011082458264,null,0,0]
[10058.25,10.058249999999999,1.7208905141115816,0.95072342458472159,1.000003195169344,2.5279085570189572E-3,1,0,8899.0913427427713,1.5706839557714303,1.3022707072153659,0.69525637413592545,1.000208303503576,2.0409181824728246E-2,1.0017066221252171,5.8381478605533478E-2,4.1763326261805203,9.7729213860275346E-2,1.0000714404327551,1.7609293298584267E-2,24.786937134350286,-108.91866437471678,71.081335625283216,null,1000000000,101168393.0625,null,21.012527433802838,-51.327665737581206,null,42.196100336728755,-55.336539471064654,null,0,0]
[10116.5,10.1165,1.7274978053730199,0.95345173314912623,1.0000032322845962,2.5425482846721534E-3,1,0,8950.6283461169151,1.570684602794814,1.3053707223720998,0.69809831589613447,1.0002107229168753,2.0527343718632959E-2,1.0017264292849097,5.8718806871441265E-2,4.1765616910546646,9.8291605784255179E-2,1.0000722703009453,1.7711269333452549E-2,24.72381404275292,-108.93686012126555,71.063139878734447,null,1000000000,102343572.25,null,20.983001145726231,-51.171641718450104,null,42.162808178699819,-55.497864039000468,null,0,0]
[10174.75,10.17475,1.7341178575089029,0.95615923092339894,1.000003269614171,2.5571880112355014E-3,1,0,9002.1653494947659,1.5706852424098368,1.3084812305231794,0.70092676874086712,1.0002131562952821,2.0645505039244807E-2,1.0017463504268971,5.9056121759232312E-2,4.1767920660035927,9.8853936100206014E-2,1.0000731049615035,1.7813245297910053E-2,24.661060867236042,-108.95463313064059,71.045366869359412,null,1000000000,103525537.5625,null,20.953783378014474,-51.016390099931826,null,42.129579129722984,-55.657996232520219,null,0,0]
[10233,10.233000000000001,1.7407505249309061,0.95884611586724533,1.0000033071580681,2.5718277367027262E-3,1,0,9053.7023528762566,1.5706858747430115,1.3116021570151513,0.70374178354296157,1.0002156036386949,2.0763665783268433E-2,1.0017663855443792,5.939342319294675E-2,4.1770237508105561,9.941620446706291E-2,1.000073944414434,1.7915221191551405E-2,24.59867405181329,-108.97199182214636,71.028008177853636,null,1000000000,104714289,null,20.924870084672563,-50.86190797428727,null,42.096413679026071,-55.816947393856715,null,0,0]
[10292.5,10.2925,1.747538399173552,0.96156958215153632,1.0000033457288984,2.5867816182306345E-3,1,0,9106.3453005400152,1.570686513256204,1.3148007351285562,0.70660338598041672,1.0002181179178384,2.0884361566868705E-2,1.0017869682633709,5.9737948885642718E-2,4.177261759490321,9.9990474366875415E-2,1.000074806829117,1.8019385335557178E-2,24.535323051010668,-108.98930389167265,71.010696108327352,null,1000000000,105935556.25,null,20.895646540577491,-50.704902174913755,null,42.062602671935224,-55.978101889306139,null,0,0]
[10352,10.352,1.754339135017438,0.96427195319197057,1.0000033845233482,2.6017354986016357E-3,1,0,9158.9882482074427,1.5706871444294555,1.3180100275322555,0.7094510759079552,1.0002206467675583,2.1005056741918861E-2,1.0018076698875304,6.0082460380486244E-2,4.1775011343874597,0.10056467891168827,1.0000756742440702,1.8123549404819868E-2,24.472346947639014,-109.00620103013857,70.99379896986143,null,1000000000,107163904,null,20.866732351352365,-50.548693048226802,null,42.028858992589733,-56.138047712097226,null,0,0]
[10411.5,10.4115,1.7611525834663617,0.96695343412541468,1.000003423541417,2.6166893778090416E-3,1,0,9211.6311958784772,1.5706877683886058,1.3212299561506138,0.71228490868898375,1.0002231901877439,2.1125751304907115E-2,1.001828490409487,6.0426957596581121E-2,4.1777418752671469,0.1011388177387548,1.000076546659298,1.8227713398907431E-2,24.409742097009499,-109.02269180976687,70.977308190233131,null,1000000000,108399332.25,null,20.838123411074683,-50.393277429145762,null,41.99518310137762,-56.296796615682283,null,0,0]
[10471,10.471,1.7679785975445472,0.9696142281311958,1.0000034627831054,2.6316432558461649E-3,1,0,9264.274143553057,1.570688385256634,1.324460443409738,0.7151049400396785,1.0002257481782837,2.1246445252321795E-2,1.0018494298218277,6.0771440453051433E-2,4.1779839818932674,0.10171289048558367,1.0000774240748056,1.8331877317387842E-2,24.347504901527614,-109.03878467025903,70.961215329740966,null,1000000000,109641841,null,20.809815680477726,-50.238652132213858,null,41.961575439120949,-56.454360241354877,null,0,0]
[10532,10.532,1.7749895890402807,0.9723208358415284,1.0000035032462264,2.6469741211833215E-3,1,0,9318.2442243659098,1.5706890104402442,1.3277832521164208,0.7179817955802591,1.0002283857818277,2.1370181261569851E-2,1.0018710205347281,6.1124592759438774E-2,4.1782336096255541,0.10230136667532656,1.0000783288009913,1.8438667138063847E-2,24.284076658548422,-109.05487883709343,70.945121162906574,null,1000000000,110923024,null,20.781102845548808,-50.080945822775554,null,41.927191796973638,-56.614677652277287,null,0,0]
[10593,10.593,1.7820134812505211,0.97500612664459863,1.0000035439443835,2.6623049852762103E-3,1,0,9372.2143051823623,1.5706896284235903,1.3311169950364528,0.72084426471458496,1.0002310386993876,2.149391661634115E-2,1.0018927361921328,6.1477729800973269E-2,4.1784846723267046,0.10288977264028441,1.0000792387827599,1.8545456878352885E-2,24.221027331848823,-109.07057231191951,70.929427688080494,null,1000000000,112211649,null,20.752698209858472,-49.92406334365544,null,41.892880744588972,-56.773773689845349,null,0,0]
[10654,10.654,1.7890501222288981,0.97767031311432828,1.000003584877577,2.6776358481176246E-3,1,0,9426.1843860023509,1.5706902393303483,1.334461590222503,0.72369240852950256,1.0002337069308413,2.1617651312852024E-2,1.0019145767859177,6.1830851490573893E-2,4.1787371697380937,0.10347810799069788,1.0000801540201165,1.8652246537789411E-2,24.158353193354195,-109.08587376380827,70.914126236191734,null,1000000000,113507716,null,20.724597630297797,-49.768001201704365,null,41.858642696070447,-56.931660533621375,null,0,0]
[10715,10.715,1.79609936213654,0.98031360569488402,1.0000036260458065,2.6929667097003573E-3,1,0,9480.1544668258193,1.5706908432813786,1.337816956281294,0.72652628843163158,1.0002363904760663,2.1741385347318929E-2,1.0019365423079123,6.2183957741182516E-2,4.1789911015996797,0.10406637233709554,1.0000810745130668,1.8759036115907887E-2,24.096050563295634,-109.10079172133683,70.899208278663167,null,1000000000,114811225,null,20.696797031585731,-49.612755885290177,null,41.824478045994397,-57.08835024114169,null,0,0]
[10777.5,10.7775,1.803334856962248,0.98300044421972377,1.0000036684701463,2.7086745583696416E-3,1,0,9535.4516807878354,1.5706914549927724,1.3412659182275033,0.72941512408272247,1.0002391558932331,2.1868161331357584E-2,1.0019591775310901,6.2545730828237542E-2,4.1792527652078961,0.10466902814876256,1.0000820230921312,1.8868451582429911E-2,24.032597427291343,-109.11568753034514,70.884312469654859,null,1000000000,116154506.25,null,20.668619756436918,-49.454536571905123,null,41.789549802113953,-57.247663800041394,null,0,0]
[10840,10.84,1.8105832661410037,0.98566578911622682,1.0000037111412232,2.7243824057022648E-3,1,0,9590.7488947533802,1.5706920596502987,1.3447260160640271,0.73228911716136924,1.0002419373863047,2.1994936612351326E-2,1.0019819438845161,6.2907487522712482E-2,4.1795159341231818,0.10527160859463489,1.0000829771884503,1.8977866962596013E-2,23.969526626065782,-109.13019843369517,70.86980156630483,null,1000000000,117505600,null,20.640748947543536,-49.297167230840863,null,41.754699388747511,-57.40574585987833,null,0,0]
[10902.5,10.9025,1.8178444351900982,0.98830985984866138,1.0000037540590379,2.7400902516904763E-3,1,0,9646.0461087223903,1.5706926573752691,1.3481971640513246,0.735148334651193,1.0002447349551471,2.2121711186230981E-2,1.0020048413592524,6.3269227731043279E-2,4.1797806080612236,0.1058741132567473,1.0000839368020298,1.9087282255905471E-2,23.906834353784426,-109.14433315598689,70.855666844013115,null,1000000000,118864506.25,null,20.613180434172417,-49.140644030936116,null,41.719927169770983,-57.562608995000581,null,0,0]
[10965,10.965,1.8251182118154419,0.99093287358177429,1.0000037972235896,2.7557980963265239E-3,1,0,9701.3433226948073,1.5706932482862295,1.3516792770581634,0.73799284381520136,1.0002475485996254,2.2248485048927499E-2,1.0020278699463101,6.3630951359691629E-2,4.1800467867361535,0.10647654171745845,1.0000849019328752,1.9196697461857558E-2,23.84451685410594,-109.15810027391835,70.84189972608165,null,1000000000,120231225,null,20.585910114437876,-48.984963124863434,null,41.685233489700607,-57.718265648003388,null,0,0]
[11028.75,11.02875,1.8325502966057725,0.9935868775008484,1.0000038415056212,2.7718200964542555E-3,1,0,9757.7464809501234,1.5706938441157552,1.3552422408344897,0.74087916067438309,1.0002504350779724,2.2377793651997366E-2,1.0020514941676477,6.3999892283545551E-2,4.1803198388664429,0.10709093981191703,1.0000858920502318,1.9308300881413828E-2,23.781335250249821,-109.17177277052733,70.828227229472674,null,1000000000,121633326.5625,null,20.558397403752174,-48.827032326042165,null,41.649927184459337,-57.875805283490656,null,0,0]
[11092.5,11.092499999999999,1.8399951850696112,0.9962194228654524,1.0000038860443581,2.7878420951589059E-3,1,0,9814.1496392088629,1.5706944330966657,1.3588164356333683,0.74375031716507223,1.0002533382811252,2.2507101506601217E-2,1.0020752547791927,6.436881576139955E-2,4.1805944559192803,0.10770525774975521,1.0000868879077647,1.9419904209031148E-2,23.718535818956873,-109.18508037414,70.81491962586,null,1000000000,123043556.25,null,20.531186525972775,-48.669969717071695,null,41.614703255818377,-58.032115429184749,null,0,0]
[11156.25,11.15625,1.8474527224177459,0.99883073282789892,1.0000039308398005,2.8038640924322499E-3,1,0,9870.5527974709676,1.5706950153463659,1.3624017730626774,0.74660638545353308,1.0002562582089378,2.2636408608421393E-2,1.0020991517712432,6.473772169407388E-2,4.1808706375863141,0.1083194950888207,1.0000878895054801,1.9531507444178153E-2,23.65611472749886,-109.19803172241831,70.801968277581693,null,1000000000,124461914.0625,null,20.504273340612585,-48.513771169609065,null,41.579562010428049,-58.187208870741429,null,0,0]
[11220,11.22,1.8549227560893384,1.0014210281134128,1.0000039758919486,2.8198860882660617E-3,1,0,9926.9559557363809,1.5706955909795923,1.3659981653841839,0.74944743793417656,1.000259194861264,2.2765714953140403E-2,1.0021231851340424,6.5106609982417338E-2,4.1811483835575185,0.10893365138731899,1.0000888968433845,1.9643110586323457E-2,23.594068193021535,-109.21063530075646,70.789364699243535,null,1000000000,125888400,null,20.477653775827203,-48.358432542086604,null,41.544503736164195,-58.34109825475452,null,0,0]
[11285.5,11.285500000000001,1.8626107070626186,1.0040607710890663,1.0000040224481943,2.836347902085356E-3,1,0,9984.9074359967817,1.5706961756409594,1.3697047049299031,0.75235091664250842,1.0002622295468921,2.2898570090693793E-2,1.0021480202632969,6.5485606134234986E-2,4.1814353829063871,0.1095645820062765,1.0000899378124213,1.9757777246710767E-2,23.530704617140398,-109.22323139859587,70.776768601404129,null,1000000000,127362510.25,null,20.450605090669601,-48.199721003308959,null,41.508569780012039,-58.497971109674097,null,0,0]
[11351,11.351000000000001,1.8703115304055018,1.0066787944199234,1.0000040692754322,2.8528097143673947E-3,1,0,10042.858916260555,1.5706967535548471,1.3734227289635417,0.75523869943879274,1.0002652818875288,2.303142441976894E-2,1.0021729993320254,6.5864583447598338E-2,4.1817240329526113,0.11019542612991257,1.0000909848411339,1.9872443807783031E-2,23.467728506047216,-109.23547804699179,70.764521953008213,null,1000000000,128845201,null,20.42385786946161,-48.041908341123779,null,41.472723970258237,-58.65359951501064,null,0,0]
[11416.5,11.416499999999999,1.8780250677689192,1.0092753296206596,1.0000041163736628,2.8692715251032561E-3,1,0,10100.810396527642,1.5706973248373926,1.3771521444679244,0.75811086548048678,1.0002683518830129,2.3164277935683441E-2,1.0021981223294651,6.6243541815059745E-2,4.1820143333544104,0.11082618328023393,1.0000920379295295,1.9987110268963916E-2,23.405135915530309,-109.24738396049243,70.752616039507572,null,1000000000,130336472.25,null,20.397407913045299,-47.884990026528762,null,41.436966560621116,-58.807996735545458,null,0,0]
[11482,11.481999999999999,1.8857511631353585,1.0118506055801741,1.0000041637428856,2.8857333342840186E-3,1,0,10158.761876797991,1.5706978896020829,1.3808928591472753,0.76096749410186704,1.0002714395331813,2.3297130633755051E-2,1.0022233892447927,6.6622481129204131E-2,4.1823062837681473,0.11145685297965424,1.0000930970776152,2.0101776629677076E-2,23.342922953175673,-109.25895769293894,70.741042307061065,null,1000000000,131836324,null,20.371251092714992,-47.728961520238705,null,41.401297786157969,-58.961175885613969,null,0,0]
[11548.75,11.54875,1.8936374636981417,1.0144533906200386,1.0000042122949002,2.9025092985194012E-3,1,0,10217.819301351603,1.5706984585539243,1.3847164913830894,0.7638627358170792,1.0002746042710839,2.3432517842409163E-2,1.0022492864057733,6.7008632396264409E-2,4.1826055029425158,0.1120994678961251,1.0000941826727159,2.02186311757581E-2,23.27990930798547,-109.27041923902851,70.729580760971487,null,1000000000,133373626.5625,null,20.344892474316453,-47.570866103301377,null,41.365039722989607,-59.116038563914366,null,0,0]
[11615.5,11.615500000000001,1.9015364862310002,1.0170345689777665,1.0000042611283488,2.9192852611210555E-3,1,0,10276.876725908485,1.5706990209666525,1.388551666918328,0.76674200825889527,1.0002777873435997,2.3567904191889602E-2,1.0022753330072161,6.7394763650709386E-2,4.1829064349808567,0.11274199099187984,1.0000952745610143,2.0335485616291647E-2,23.21728191724835,-109.28155324124397,70.718446758756031,null,1000000000,134919840.25,null,20.318829846928907,-47.413685234441971,null,41.328874146330307,-59.269663264563796,null,0,0]
[11682.25,11.68225,{"$f":"SQRT(1+(A205/pole1)^2)","v":1.909448072848849},{"$f":"ATAN(A205/pole1)","v":1.0195943746193401},{"$f":"SQRT(1+(A205/Zero1)^2)","v":1.0000043102432317},{"$f":"ATAN(A205/Zero1)","v":2.936061222079539E-3},{"$f":"IF(VIN_nom>Vout, 1, SQRT(1+(A205/z_RHP)^2))","v":1},{"$f":"IF(VIN_nom>Vout, 0, -ATAN(A205/z_RHP))","v":0},{"$f":"SQRT(1+(A205/Pole2)^2)","v":10335.93415046858},{"$f":"ATAN(A205/Pole2)","v":1.5706995769523568},1.392398290369554,0.76960539584011178,{"$f":"SQRT(1+(A205/pole4)^2)","v":1.0002809887505542},{"$f":"ATAN(A205/pole4)","v":2.3703289677241481E-2},{"$f":"IF(VOUT_setting=1,1,SQRT(1+(A205*zterm1)^2))","v":1.0023015290374708},{"$f":"IF(VOUT_setting=1,0,ATAN(((A205*zterm1))))","v":6.7780874778961456E-2},4.183209079513535,{"$f":"IF(VOUT_setting=1,0,ATAN(A205*$Q$4/(1+Afbr-$Q$5*(A205)^2)))","v":0.1133844217627818},{"$f":"SQRT((1-(Z205/pterm2))^2+(A205/pterm1)^2)","v":1.0000963727425183},{"$f":"IF((ATAN((A205/pterm1)/(1-A205^2/pterm2))>0),ATAN((A205/pterm1)/(1-A205^2/pterm2)),PI()+ATAN((A205/pterm1)/(1-A205^2/pterm2)))","v":2.0452339950667753E-2},{"$f":"20*LOG10(((E205*K205*G205*O205)/(C205*I205*S205*M205*Q205))*Adc)","v":23.155036821761833},{"$f":"((F205+L205+H205+P205)-(D205+J205+T205+N205+R205))*radconv","v":-109.29236825207823},{"$f":"IF(V205>0,V205,V205+180)","v":70.707631747921766},null,{"$f":"IF(U205<0,A205,1000000000)","v":1000000000},{"$f":"A205^2","v":136474965.0625},null,{"$f":"20*LOG10((K205/(I205*M205))*AEA)","v":20.293059057641795},{"$f":"(L205-(J205+N205))*radconv","v":-47.257414083301846},null,{"$f":"20*LOG10((E205*G205/(C205*S205))*Acs*Am)","v":41.29280124856102},{"$f":"(F205+H205-(D205+T205))*radconv","v":-59.422063392791259},null,{"$f":"SUM((U206<0)*(U205>0))*A205","v":0},0]
[11749,{"$f":"A206/1000","v":11.749000000000001},1.9173720680234354,1.0221330387726595,1.0000043596395485,2.95283718138541E-3,1,0,10394.991575031834,1.5707001266205796,1.3962562671212841,0.77245298308663746,1.0002842084917709,2.3838674293510088E-2,1.0023278744848216,6.8166965667478888E-2,4.1835134361689175,0.11402675970514205,1.0000974772172353,2.0569194178276445E-2,23.09317011443634,-109.30287266054044,70.697127339459556,null,1000000000,138039001,null,20.26757602351806,-47.102047812895599,null,41.256821204195177,-59.573252196945099,null,0,0]
[11817.5,11.817500000000001,1.9255165485242083,1.0247165191403587,1.0000044106234982,2.970052958121039E-3,1,0,10455.597321590609,1.5707006842437572,1.4002270945905126,0.77535888779918138,1.0002875317070667,2.3977607410438535E-2,1.0023550659688276,6.8563157627354057E-2,{"$f":"IF(VOUT_setting=1,1,SQRT((1+Afbr-$Q$5*(A207)^2)^2+(A207*$Q$4)^2))","v":4.1838275518621968},0.11468584092931236,1.0000986171910882,2.0689111888224865E-2,23.030070788635463,-109.31333816971414,70.686661830285857,null,1000000000,139653306.25,null,20.241719855492821,-46.943543967707768,null,41.219994564366644,-59.727159105965953,null,0,0]
[11886,11.885999999999999,1.9336737723267001,1.0272782196059116,1.0000044619038322,2.9872687330961168E-3,1,0,10516.203068152601,1.5707012354396779,1.4042096790430405,0.77824833348709954,1.000290874230195,2.4116539601544456E-2,1.0023824147820224,6.8959328030158765E-2,4.1841434698297677,0.11534482332038117,1.0000997637924778,2.0809029484432619E-2,22.967361779167774,-109.32349395975533,70.676506040244675,null,1000000000,141276996,null,20.216158236423837,-46.785982733866554,null,41.183266027403675,-59.879818112098214,null,0,0]
[11954.5,11.954499999999999,1.9418435788361632,1.0298183812348942,1.0000045134805504,3.0044845063004386E-3,1,0,10576.80881471775,1.5707017803188275,1.4082039207280217,0.78112141175184369,1.0002942360609623,2.4255470861473782E-2,1.0024099209115285,6.9355476753303835E-2,4.1844611896634571,0.11600370633548157,1.0001009170214119,2.0928946966240515E-2,22.905039028897512,-109.33334857623397,70.666651423766027,null,1000000000,142910070.25,null,20.190886974308437,-46.629358869018979,null,41.146635726708709,-60.0312430273448,null,0,0]
[12023,12.023,1.9500258099034953,1.0323372421680528,1.0000045653536529,3.0217002777237997E-3,1,0,10637.414561286003,1.5707023189891736,1.4122097207328066,0.7839782142409254,1.000297617199174,2.4394401184872655E-2,1.0024375843443962,6.9751603674240811E-2,4.1847807109528832,0.11666248943225357,1.0001020768778992,2.1048864332989338E-2,22.843098534644927,-109.34291039438268,70.657089605617315,null,1000000000,144552529,null,20.165901948597789,-46.473667128028751,null,41.110103778178669,-60.181447496128207,null,0,0]
[12093,12.093,1.9583998874982407,1.0348894999650142,1.0000046186688529,3.0392930349920576E-3,1,0,10699.347440993939,1.5707028631507847,1.4163150776716256,0.78688085556443632,1.0003010923229643,2.453637280503889E-2,1.0024660160402894,7.0156382256264249E-2,4.1851090896890648,0.11733559464811881,1.0001032689795484,2.1171407507925243E-2,22.780192472403119,-109.35238764956178,70.647612350438223,null,1000000000,146240649,null,20.140661297767053,-46.315523583380454,null,41.072873569128333,-60.333694312287911,null,0,0]
[12163,12.163,1.9667866134679126,1.0374200075715945,1.0000046722935596,3.0568857903789564E-3,1,0,10761.280320705006,1.5707034010489225,1.4204322984917364,0.7897666940734358,1.0003045876086241,2.4678343435906122E-2,1.0024946119765972,7.0561137812163582E-2,4.1854393487671686,0.1180085943782388,1.0001044680022046,2.1293950561315968E-2,22.717677306680315,-109.36157629398573,70.638423706014265,null,1000000000,147938569,null,20.115711078303981,-46.158342353535453,null,41.035746257922732,-60.484694927477506,null,0,0]
[12233,12.233000000000001,1.9751858266958473,1.0399290098414296,1.0000047262277727,3.0744785438736066E-3,1,0,10823.213200419152,1.5707039327911101,1.4245612803273275,0.7926358275975427,1.0003081030559418,2.4820313071761732E-2,1.0025233721392648,7.0965870211295065E-2,4.1857714877421452,0.1186814880454945,1.0001056739458773,2.1416493492458069E-2,22.655548934273611,-109.37048473172283,70.629515268277174,null,1000000000,149646289,null,20.091047114875753,-46.002117839102795,null,40.99872191509612,-60.634463370737294,null,0,0]
[12303,12.303000000000001,1.983597368556395,1.0424167485671971,1.0000047804714922,3.0920712954651181E-3,1,0,10885.146080136323,1.5707044584824235,1.4287019212095768,0.79548835393721151,1.0003116386647048,2.4962281706893335E-2,1.0025522965141589,7.1370579323060263E-2,4.1861055061665553,0.1193542750733305,1.0001068868105758,2.1539036300648073E-2,22.593803306938266,-109.37912119302162,70.620878806978382,null,1000000000,151363809,null,20.066665303871446,-45.846844442222299,null,40.961800594410775,-60.783013495727516,null,0,0]
[12374.5,12.374499999999999,1.9922017231118418,1.0449360923207802,1.0000048361971028,3.1100410326146623E-3,1,0,10948.406092993362,1.5707049892985618,{"$f":"SQRT(1+(A215/Zero2)^2)","v":1.4329432215003699},{"$f":"ATAN(A215/Zero2)","v":0.79838496267924841},1.0003152708504117,2.5107291488004401E-2,1.0025820102104872,7.1783936595957665E-2,4.1864486219527217,0.12004136827557052,1.0001081328103176,2.1664204898492679E-2,22.531125541815506,-109.38767031914402,70.612329680855979,null,1000000000,153128250.25,null,20.042048118591758,-45.689219848192984,null,40.924194498729108,-60.933503302408887,null,0,0]
[12446,12.446,2.0008186135553365,1.0474337517865753,1.0000048922456266,3.1280107677556651E-3,1,0,11011.66610585345,1.5707055140158166,1.4371964736552127,0.80126445096243926,1.0003189240704315,2.5252300212997191E-2,1.0026118952020528,7.2197269297480438E-2,4.1867936976479037,0.1207283490050237,1.0001093860308983,2.1789373366575784E-2,22.468838734550104,-109.39595250347824,70.604047496521758,null,1000000000,154902916,null,20.017716875600659,-45.532575774248578,null,40.886695949937788,-61.082750683597105,null,0,0]
[12517.5,12.5175,2.0094478786181491,1.0499099749601286,1.0000049486170632,3.1459805008765213E-3,1,0,11074.926118716534,1.5707060327386979,1.4414615718767168,0.80412692279665077,1.0003225983245341,2.5397307875784959E-2,1.002641951473539,7.2610577288601277E-2,4.1871407327675643,0.12141521664911002,1.0001106464723277,2.1914541704147743E-2,22.406938742700593,-109.40397597426045,70.596024025739553,null,1000000000,156687806.25,null,19.99366742412456,-45.376906266701944,null,40.849304954633006,-61.230769848348089,null,0,0]
[12589,12.589,2.0180893595602338,1.0523650066499797,1.0000050053114127,3.1639502319656251E-3,1,0,11138.186131582564,1.5707065455693425,1.4457384113230198,0.80697248208154937,1.0003262936124873,2.5542314470281227E-2,1.0026721790095425,7.3023860430343326E-2,4.1874897268245821,0.12210197059587538,1.0001119141346158,2.2039709910458911E-2,22.345421479729787,-109.41174878333581,70.58825121666419,null,1000000000,158482921,null,19.969895685235194,-45.222205378043967,null,40.812021503461011,-61.377574823115637,null,0,{"$f":"IF(AH218>0,W218,0)","v":0}]
[12662.25,12.66225,2.0269548499585919,1.0548584033151611,1.0000050637282509,3.1823597795287342E-3,1,0,11202.994466444823,1.5707070649458148,1.4501319958482988,0.80987025788107858,1.0003301011566803,2.5690869063035263E-2,1.0027033239676486,7.3447232979368879E-2,4.1878492936253222,0.12280541466097454,1.0001132203117371,2.2167941537364344E-2,22.282791229686779,-109.41946013237177,70.580539867628232,null,1000000000,160332575.0625,null,19.945825921681283,-45.064716363847765,null,40.773937018927853,-61.526728270496626,null,0,0]
[12735.5,12.7355,2.0358328321910975,1.0573300685271134,1.0000051224840021,3.2007693249347597E-3,1,0,11267.802801310068,1.5707075783477551,1.454537683660887,0.81275050344440625,1.0003339307764569,2.5839422521632235E-2,1.0027346486434421,7.3870579152593263E-2,4.1882109153856053,0.12350873809679259,1.000114534067533,2.2296173024912165E-2,22.220554165612491,-109.42692495391748,70.573075046082522,null,1000000000,162192960.25,null,19.922039189365943,-44.908231350903051,null,40.73596533848427,-61.674636589462466,null,0,0]
[12808.75,12.80875,2.0447231435428952,1.0597802553489295,1.0000051815786664,3.2191788681712233E-3,1,0,11332.611136178251,1.5707080858776639,1.4589553651139002,0.81561333001025949,1.0003377824715636,2.5987974839528614E-2,1.0027661530200802,7.4293898800749533E-2,4.1885745915732207,0.12421194024739655,1.0001158554020146,2.2424404372296324E-2,22.158706069983339,-109.43415135033315,70.565848649666847,null,1000000000,164064076.5625,null,19.898531327487508,-44.75274397119815,null,40.698106403503111,-61.821314279414871,null,0,0]
[12882,12.882,2.053625623892728,1.0622092134962713,1.000005241012244,3.2375884092256477E-3,1,0,11397.419471049319,1.5707085876357103,1.4633849315877683,0.81845884861808926,1.0003416562417453,2.6136526010181172E-2,1.0027978370806268,7.4717191774627503E-2,4.1889403216531189,0.12491502045755633,1.0001171843151933,2.2552635578710786E-2,22.097242782838016,-109.44114724350648,70.558852756493522,null,1000000000,165945924,null,19.875298248050008,-44.598247868005537,null,40.660360140104046,-61.966775647961903,null,0,0]
[12957.25,12.95725,2.0627836817396816,1.0646826442036652,1.0000053024215008,3.2565005975798448E-3,1,0,11463.99731677306,1.5707090971860929,1.4679477050074023,0.82136415374966987,1.0003456587675283,2.6289131983960299E-2,1.0028305733270324,7.5152014302433262E-2,4.1893181757483386,0.12563716972918657,1.0001185574046145,2.2684367830831709E-2,22.034497717765802,-109.44810225830187,70.551897741698127,null,1000000000,167890327.5625,null,19.851712736811454,-44.44055901890048,null,40.621700496928085,-62.114956902081197,null,0,0]
[13032.5,13.032500000000001,2.0719542478030406,1.0671341947597577,1.0000053641884301,3.2754127836045234E-3,1,0,11530.575162499748,1.5707096008521608,1.4725227922285866,0.82425142972234444,1.0003496845897581,2.6441736732993822E-2,1.0028634991668477,7.5586808360406252E-2,4.1896981962710127,0.1263591889110193,1.0001199384922601,2.281609993245531E-2,21.972150043688888,-109.45483038928222,70.545169610717778,null,1000000000,169846056.25,null,19.828408701308419,-44.283902757190951,null,40.583159556860835,-62.261884507384977,null,0,0]
[13107.75,13.107749999999999,2.0811371567298096,1.0695641251354482,1.0000054263130325,3.2943249672861543E-3,1,0,11597.153008229325,1.5707100987352574,1.4771100788318579,0.82712079614650003,1.0003537337081529,2.6594340250188794E-2,1.0028966145813989,7.6021573786966626E-2,4.1900803826317263,0.12708107729501547,1.0001213275781424,2.29478318827077E-2,21.910195433981432,-109.46133965255351,70.538660347446495,null,1000000000,171813110.0625,null,19.805381939636323,-44.128272235106692,null,40.544737193072812,-62.407573359059306,null,0,0]
[13183,13.183,2.0903322458519917,1.0719726917578261,1.0000054887953072,3.3132371486112103E-3,1,0,11663.730853961742,1.5707105909344121,1.4817094515114808,0.82997237233293997,1.0003578061224301,2.67469425284526E-2,1.0029299195519077,7.6456310420599097E-2,4.1904647342379233,0.12780283417393459,1.0001227246622737,2.307956368071502E-2,21.848629621937739,-109.46763787825078,70.532362121749216,null,1000000000,173791489,null,19.782628324438924,-43.973660621909858,null,40.506433264095485,-62.552038149244886,null,0,0]
[13259.75,13.25975,2.0997230066634747,1.0744075251496661,1.0000055528915137,3.3325263144978901E-3,1,0,11731.635832834563,1.5707110871901679,1.4864128395544507,0.83286258825100423,1.0003619837111704,2.6902585429019389E-2,1.0029640836506934,7.689968307376821E-2,4.1908589771374309,0.12853884203738261,1.0001241578342595,2.3213921204005433E-2,21.786232721552107,-109.47385218983585,70.526147810164147,null,1000000000,175820970.0625,null,19.759698312943165,-43.817009562418271,null,40.467487639857325,-62.698136757816528,null,0,0]
[13336.5,13.336499999999999,2.1091261046104344,1.0768206623498988,1.0000056173597944,3.3518154779046813E-3,1,0,11799.540811710238,1.5707115777341363,1.4911285657313678,0.83573454729332797,1.0003661855331896,2.7058227025867774E-2,1.0029984448980123,7.7343025435498022E-2,4.1912554712097663,0.12927471161722554,1.0001255993265654,2.334827856708447E-2,21.72423149414929,-109.47986284464562,70.520137155354377,null,1000000000,177862232.25,null,19.737044003551858,-43.661404142896011,null,40.428664877713267,-62.842992257138789,null,0,0]
[13413.25,13.41325,2.1185413754185878,1.0792123643338105,1.0000056822001491,3.371104638817232E-3,1,0,11867.445790588721,1.5707120626643643,1.4958565133533817,0.83858837497212757,1.000370411588182,2.7213867311473607E-2,1.003033003273603,7.7786337334630612E-2,4.1916542158161505,0.1300104421656722,1.0001270491392047,2.3482635769024963E-2,21.662621598967444,-109.48567757623782,70.514322423762181,null,1000000000,179915275.5625,null,19.714661246878286,-43.506837177209412,null,40.389964784005336,-62.986619599941854,null,0,0]
[13490,13.49,2.1279686575102073,1.0815828884419185,1.0000057474125772,3.3903937972211882E-3,1,0,11935.350769469962,1.5707125420766688,1.5005965669017349,0.84142419640123989,1.0003746618758405,2.7369506278313135E-2,1.0030677587570904,7.8229618600079417E-2,4.19205521031442,0.13074603293581225,1.000128507272191,2.3616992808899735E-2,21.601398755842155,-109.49130393265752,70.508696067342484,null,1000000000,181980100,null,19.69254596766276,-43.353301501922452,null,40.35138715153434,-63.129033530698976,null,0,0]
[13568.5,13.5685,2.1376231534891934,1.0839858203569843,1.00000581449683,3.4101227709592017E-3,1,0,12004.804070348044,1.570713026809716,1.5054571037756141,0.84430618144819347,1.0003790341430436,2.752869264432822E-2,1.0031035105901396,7.8682975388314425E-2,4.1924676747642806,0.13149825076100788,1.0001300072596051,2.375441319572447E-2,21.539175943866709,-109.49687138746421,70.503128612535789,null,1000000000,184104192.25,null,19.670198954836856,-43.197324402020456,null,40.312056350664669,-63.273454609309361,null,0,0]
[13647,13.647,2.1472898812479619,1.0863671307510252,1.0000058819703175,3.4298517420425444E-3,1,0,12074.257371228912,1.5707135059662198,1.5103300641905155,0.8471695931572909,1.0003834317599289,2.76878776148324E-2,1.0031394685787178,7.9136299768157906E-2,4.1928824915069907,0.13225032078327467,1.0001315159511499,2.3891833411046635E-2,21.477349168223071,-109.50225717347641,70.497742826523591,null,1000000000,186240609,null,19.648123363300122,-43.04241107652102,null,40.272853179722816,-63.416636856342677,null,0,0]
[13725.5,13.7255,2.1569686763317173,1.0887270834957692,1.0000059498330394,3.4495807104558593E-3,1,0,12143.710672112522,1.5707139796418614,1.5152153282834335,0.85001456399569197,1.0003878547261618,2.784706118177668E-2,1.0031756327006565,7.9589591556785869E-2,4.193299659844504,0.13300224220632414,1.0001330333468401,2.4029253453874196E-2,21.415914039417935,-109.50746878943737,70.492531210562632,null,1000000000,188389350.25,null,19.626315063284981,-42.888553940635902,null,40.233777376490629,-63.558595390479333,null,0,0]
[13804,13.804,2.1666593770207685,1.0910659387025594,1.0000060180849957,3.4693096761837876E-3,1,0,12213.163972998827,1.5707144479301465,1.5201127774314962,0.85284122592394551,1.0003923030414061,2.8006243337112501E-2,1.0032120029336631,8.0042850571454133E-2,4.1937191790750985,0.13375401423485039,1.0001345594466899,2.4166673323215117E-2,21.354866229926181,-109.51251354758996,70.487486452410039,null,1000000000,190550416,null,19.60476999953508,-42.735745438478915,null,40.194828666194375,-63.699345114945537,null,0,0]
[13884.25,13.88425,2.1765782535192448,1.0934353927129901,1.0000060882608393,3.4894784568271827E-3,1,0,12284.165595882148,1.5707149211842917,1.5251318786847958,0.85571211378052248,1.0003968767255302,2.8168972671679542E-2,1.0032493969992318,8.0506180018181162E-2,4.1941504800005465,0.13452239025792395,1.000136128565275,2.4307156512463839E-2,21.292853406568714,-109.51750571325255,70.482494286747453,null,1000000000,192772398.0625,null,19.58301258933599,-42.580606500203253,null,40.155142748253361,-63.841998337484263,null,0,0]
[13964.5,13.964499999999999,2.1865092390985068,1.0957833359878193,1.000006158843465,3.5096472346316685E-3,1,0,12355.167218768189,1.5707153889991239,1.5301634675476063,0.85856414451280527,1.0004014769007576,2.8331700513989651E-2,1.0032870064204571,8.0969474827435259E-2,4.1945842363094989,0.13529060847363758,1.0001377067804602,2.4447639518308004E-2,21.231236411665371,-109.52233837357656,70.477661626423441,null,1000000000,195007260.25,null,19.56152194380509,-42.426547598414921,null,40.115589034346549,-63.983419075311751,null,0,0]
[14044.75,14.044750000000001,2.1964521695094477,1.0981100345878818,1.0000062298328729,3.5298160095808368E-3,1,0,12426.168841656903,1.5707158514678814,1.5352074212368172,0.8613974573612676,1.0004061035667229,2.8494426855445294E-2,1.0033248311731209,8.1432734804237669E-2,4.195020447240366,0.13605866803551628,1.000139294092262,2.4588122339687751E-2,21.170010815883813,-109.52701876229521,70.472981237704786,null,1000000000,197255002.5625,null,19.540293961773639,-42.273560760072002,null,40.076167193593584,-64.123622572531147,null,0,0]
[14125,14.125,2.2064068832678556,1.1004157507011696,1.0000063012290628,3.5499847816582806E-3,1,0,12497.170464548244,1.5707163086816842,1.5402636182778797,0.86421219094685586,1.0004107567230587,2.8657151687449402E-2,1.0033628712328708,8.1895959753698774E-2,4.1954591120275611,0.13682656809817853,1.0001408905006959,2.472860497554322E-2,21.109172253116228,-109.53155392667666,70.468446073323335,null,1000000000,199515625,null,19.519324616780729,-42.121638047507524,null,40.036876883617218,-64.262623851348081,null,0,0]
[14207.25,14.20725,2.2166217509780912,1.1027574270639835,1.0000063748267118,3.5706561992638799E-3,1,0,12569.94159829314,1.5707167719303625,1.5454584055744323,0.86707793844450154,1.0004155533344119,2.8823930391636984E-2,1.0034020827286843,8.2370692698712916E-2,4.1959112548166093,0.13761343946239135,1.0001425361345451,2.4872588542653503E-2,21.047214583332249,-109.53605860032137,70.463941399678632,null,1000000000,201845952.5625,null,19.498096921360347,-41.967025068622313,null,39.996743494753105,-64.403857289813544,null,0,0]
[14289.5,14.2895,2.2268486618692642,1.1050776075268391,1.0000064488516711,3.5913276138179306E-3,1,0,12642.712732040703,1.5707172298461454,1.5506657998631119,0.86992446187295291,1.0004203777721925,2.8990707491912689E-2,1.0034415203448956,8.2845388434456116E-2,4.196365973655384,0.13840014148352983,1.0001441913241256,2.5016571912622538E-2,20.985654390206673,-109.54042512837177,70.459574871628234,null,1000000000,204189810.25,null,19.477132584327205,-41.813513150318485,null,39.956747511308819,-64.543859092812639,null,0,0]
[14371.75,14.37175,2.2370874507741179,1.1073765620868585,1.0000065233039406,3.6119990253027662E-3,1,0,12715.483865790884,1.5707176825205942,1.5558856745608849,0.87275190835679783,1.0004252300359981,2.9157482979022119E-2,1.0034811840548445,8.3320046751396024E-2,4.1968232677066135,0.13918667325502823,1.0001458560694552,2.5160555084309241E-2,20.92448717278468,-109.54466051561992,70.455339484380076,null,1000000000,206547198.0625,null,19.456427504634103,-41.661093867693928,null,39.916888530392995,-64.682644729976587,null,0,0]
[14454,14.454000000000001,2.2473379553452797,1.1096545567211982,1.0000065981835198,3.6326704337007231E-3,1,0,12788.254999543646,1.5707181300431854,1.5611179044763699,0.87556042427536218,1.000430110125424,2.9324256843711403E-2,1.0035210738317224,8.3794667440100737E-2,4.1972831361286467,0.1399730338715505,1.0001475303705512,2.530453805657254E-2,20.863708495251426,-109.54877157917646,70.45122842082354,null,1000000000,208918116,null,19.435977656860416,-41.509758838427445,null,39.877166138612793,-64.820229440609566,null,0,0]
[14622.5,14.6225,2.2683733849817376,1.1142569769679547,1.0000067529186258,3.6750185372396377E-3,1,0,12937.336288759283,1.5707190311307293,1.5718748813977041,0.88125553763880393,1.0004401945249535,2.9665910050745651E-2,1.003603499153529,8.4766872288575087E-2,4.1982332729743872,0.14158345928095939,1.0001509902381904,2.5599505584955318E-2,20.740390301742423,-109.55683316203665,70.443166837963346,null,1000000000,213817506.25,null,19.394863896204896,-41.203079793836665,null,39.79621430773183,-65.098402723478699,null,0,0]
[14706.75,14.70675,2.2789088687067283,1.1165263011632429,1.000006830958694,3.6961925840755887E-3,1,0,13011.876933370975,1.5707194739314623,1.5772722926170128,0.88407391820338055,1.0004452805159159,2.983673406141743E-2,1.0036450674911068,8.5252914600667792E-2,4.1987123894114529,0.14238839876860582,1.0001527352112882,2.5746989030425403E-2,20.679324315614206,-109.56069587254264,70.439304127457362,null,1000000000,216288495.5625,null,19.374692148575047,-41.051411347715572,null,39.755951521339306,-65.235662417827044,null,0,0]
[14791,14.791,2.289455980383106,1.1187747281125255,1.0000069094471056,3.7173666275972213E-3,1,0,13086.41757798519,1.5707199116877817,1.5826821470235302,0.88687305354725532,1.0004503957004172,3.0007556330267995E-2,1.0036868729072423,8.5738916538440249E-2,4.1991942032948231,0.14319315482099593,1.000154490210597,2.5894472261779492E-2,20.618647720841899,-109.56445533128247,70.435544668717526,null,1000000000,218773681,null,19.354771779119989,-40.900845182695143,null,39.71583017783032,-65.371724776096414,null,0,0]
[14877.25,14.87725,2.3002653468760359,1.1210551594917062,1.0000069902631776,3.7390433155831885E-3,1,0,13162.72773345335,1.5707203546999622,1.5882331822877969,0.88971886105145592,1.0004556625544605,3.0182431912446375E-2,1.0037299162932123,8.62364135564197E-2,4.1996902481850489,0.14401682384709744,1.0001562972576834,2.6045456355663337E-2,20.556929474584148,-109.56820372909102,70.431796270908976,null,1000000000,221332567.5625,null,19.33463481053532,-40.747837438749883,null,39.674902402689604,-65.509792638368154,null,0,0]
[14963.5,14.9635,2.3110865636585665,1.1233142471679132,1.0000070715491316,3.7607200000553467E-3,1,0,13239.03788892406,1.5707207926050755,1.5937969903915341,0.89254482237113431,1.0004609600035852,3.0357305648037271E-2,1.0037732080842898,8.673386778435821E-2,4.2001891181361799,0.14484029857775724,1.0001581148126948,2.619644022254377E-2,20.495610002558919,-109.57185723357233,70.428142766427669,null,1000000000,223906332.25,null,19.314753021842904,-40.595966399003416,null,39.634121809335582,-65.646637583733934,null,0,0]
[15049.75,15.04975,2.3219194650472419,1.1255522666570905,1.0000071533049675,3.7823966809933237E-3,1,0,13315.34804439728,1.5707212254909273,1.5993734380344953,0.8953510997233195,1.0004662880473052,3.0532177526374535E-2,1.0038167482483362,8.7231278981607263E-2,4.2006908121417794,0.14566357797938401,1.0001599428756518,2.6347423861105061E-2,20.434684692356655,-109.57542229518938,70.424577704810616,null,1000000000,226494975.0625,null,19.295122344618608,-40.445222773524378,null,39.593487850203807,-65.782275398020289,null,0,0]
[15136,15.135999999999999,2.3327638882589579,1.1277694892044745,1.000007235530685,3.8040733583767508E-3,1,0,13391.658199872967,1.5707216534433217,1.6049623934683115,0.89813785431328574,1.000471646685132,3.0707047536792705E-2,1.0038605367530333,8.7728646907645189E-2,4.2011953291901989,0.14648666101992922,1.000161781446576,2.6498407270031461E-2,20.374149000091158,-109.57890517764727,70.421094822352728,null,1000000000,229098496,null,19.275738787208184,-40.295597330236035,null,39.55299996946578,-65.916721622360299,null,0,0]
[15224,15.224,2.3438400521622453,1.1300105417705464,1.0000073199090298,3.8261898487181411E-3,1,0,13469.516677346315,1.5707220850811905,1.6106775039327075,0.90096119700056421,1.0004771455799626,3.0885463698159588E-2,1.0039054696363878,8.8236061510317057E-2,4.2017129913038911,0.14732624084912349,1.0001636681517976,2.6652453872407049E-2,20.312781958900011,-109.58238033951631,70.417619660483695,null,1000000000,231770176,null,19.256212568470495,-40.14407893403412,null,39.511840564971671,-66.0526835148288,null,0,0]
[15312,15.311999999999999,2.3549278768058732,1.1322305020790249,1.0000074047765173,3.8483063353164345E-3,1,0,13547.375154822141,1.5707225117577046,1.6164053626826962,0.90376455243146958,1.0004826763219576,3.1063877892610371E-2,1.0039506609716853,8.8743430562594594E-2,4.2022335900367018,0.14816561410255191,1.0001655657957675,2.6806500232967552E-2,20.251811163165797,-109.58578255280364,70.414217447196364,null,1000000000,234457344,null,19.236935441466663,-39.993705326307079,null,39.470832033612282,-66.187436896314878,null,0,0]
[15400,15.4,2.3660271982539758,1.1344296449330395,1.000007490133147,3.8704228181499975E-3,1,0,13625.233632300404,1.5707229335579156,1.6221458346742366,0.90654808850340662,1.0004882389105891,3.1242290108819338E-2,1.0039961107240261,8.9250753809429068E-2,4.2027571242974213,0.14900477968907319,1.0001674743785092,2.6960546350315525E-2,20.191231999679115,-109.58911789899685,70.410882101003153,null,1000000000,237160000,null,19.217903403028551,-39.844466891466368,null,39.429973761470279,-66.320997511799263,null,0,0]
[15488,15.488,2.3771378554640736,1.1366082408114631,1.0000075759789193,3.8925392971971935E-3,1,0,13703.092109781066,1.5707233505649423,1.6278987864728223,0.90931197197671187,1.0004938333453259,3.1420700335461529E-2,1.0040418188583171,8.9758030995912161E-2,4.2032835929892345,0.14984373651924837,1.0001693939000453,2.7114592223053527E-2,20.131039924419085,-109.59239227694988,70.40760772305012,null,1000000000,239878144,null,19.199112526129824,-39.696354078962003,null,39.38926512765628,-66.453380858501021,null,0,0]
[15578.25,15.578250000000001,2.3885442004874822,1.1388214765651037,1.0000076645276739,3.9152212504463633E-3,1,0,13782.941286972487,1.5707237733405899,1.6338116552050785,0.91212628366016879,1.0004996038969129,3.1603670108832783E-2,1.0040889640054727,9.0278230228929585E-2,4.2038265693057939,0.15070392597991439,1.0001713738621791,2.7272576513138882E-2,20.069706219348291,-109.59569304004016,70.40430695995984,null,1000000000,242681873.0625,null,19.180087654951912,-39.545613516146233,null,39.34767041703104,-66.587942179264815,null,0,0]
[15668.5,15.6685,2.3999621343380855,1.1410136638235862,1.0000077535909031,3.9379031996669778E-3,1,0,13862.790464166343,1.570724191245892,1.6397373709128538,0.91492027650836083,1.0005054079427764,3.1786637765472359E-2,1.0041363808408164,9.0798380473506662E-2,4.2043726296731245,0.15156389355723063,1.0001733653296785,2.7430560542968687E-2,20.0087701869884,-109.5989416755386,70.401058324461403,null,1000000000,245501892.25,null,19.161308307220423,-39.396036736507078,null,39.306231751178991,-66.721297495408834,null,0,0]
[15758.75,15.758749999999999,2.4113914923966684,1.1431850806590711,1.000007843168607,3.960585144835699E-3,1,0,13942.63964136259,1.5707246043645262,1.6456757948187748,0.91769412662451477,1.0005112454823337,3.1969603293166712E-2,1.0041840693258612,9.131848145514318E-2,4.2049217728898078,0.15242363808166806,1.0001753683025685,2.7588544311035551E-2,19.948227144602736,-109.60214397856299,70.397856021437008,null,1000000000,248338201.5625,null,19.142770485596557,-39.247613654167431,null,39.264948440439767,-66.853462739209277,null,0,0]
[15849,15.849,2.4228321129871189,1.1453360006828504,1.0000079332607859,3.9832670859291904E-3,1,0,14022.488818561191,1.5707250127782633,1.6516267898458723,0.92044800882178768,1.0005171165149986,3.2152566679703183E-2,1.0042320294219074,9.1838532899497519E-2,4.2054739977482676,0.15328315838561482,1.0001773827808751,2.77465278158321E-2,19.888072480714261,-109.60530556254926,70.394694437450738,null,1000000000,251190801,null,19.124470269773372,-39.100334257056574,null,39.223819789360263,-66.9844535873534,null,0,0]
[15941.25,15.94125,2.4345377397029653,1.1475136836200883,1.0000080258811694,4.0064516696807287E-3,1,0,14104.107506614229,1.5707254254634675,1.6577225140091159,0.92324246294847978,1.0005231522677125,3.2339582430951162E-2,1.0042813330113678,9.2370057548028919E-2,4.2060416438483728,0.15416149328845416,1.0001794537920801,2.7908012066469839E-2,19.826981405594484,-109.60850078592573,70.391499214074273,null,1000000000,254123451.5625,null,19.106006068732913,-38.95096268775297,null,39.181938809054088,-67.11714961614706,null,0,0]
[16033.5,16.0335,2.4462548012111389,1.1496705153900888,1.0000081190390822,4.0296362491251082E-3,1,0,14185.72619466964,1.5707258333998384,1.6638310883722558,0.92601641953764069,1.0005292230131919,3.2526595919290843E-2,1.0043309203009323,9.2901529860279913E-2,4.2066125071151408,0.15503959146219831,1.0001815368243414,2.8069496038854749E-2,19.766286592483329,-109.61166476544325,70.388335234556749,null,1000000000,257073122.25,null,19.087782077387789,-38.802765139098454,null,39.140217933094313,-67.248650945362797,null,0,0]
[16125.75,16.12575,2.4579831339846905,1.1518067742571094,1.0000082127345238,4.0528208242374079E-3,1,0,14267.344882727384,1.5707262366688755,1.669952371919776,0.92877006106778004,1.0005353287507999,3.271360713168231E-2,1.0043807912485807,9.3432949543782173E-2,4.2071865862390752,0.15591745166614326,1.0001836318776869,2.8230979731377025E-2,19.705983339130348,-109.61480293872275,70.385197061277253,null,1000000000,260039813.0625,null,19.069794347536153,-38.655731159766994,null,39.098656402792194,-67.378973518277363,null,0,0]
[16218,16.218,2.4697225774471074,1.1539227339534011,1.0000083069674943,4.0760053949927023E-3,1,0,14348.963570787426,1.5707266353502236,1.6760862254049302,0.93150356858682837,1.0005414694798955,3.2900616055086568E-2,1.0044309458120615,9.3964316306244244E-2,4.2077638799040145,0.15679507266171522,1.0001857389521445,2.8392463142426862E-2,19.646067015640195,-109.61792056569197,70.382079434308025,null,1000000000,263023524,null,19.05203900780727,-38.509850380292534,null,39.057253454960843,-67.508133018502676,null,0,0]
[16312.5,16.3125,2.4817597044653508,1.1560695360175302,1.0000084040561843,4.0997554385397367E-3,1,0,14432.572958558583,1.5707270390799708,1.6823825749057175,0.93428305815431367,1.0005477962642706,3.3092183784704327E-2,1.0044826176895494,9.4508588055378553E-2,4.208358585621764,0.15769384972392664,1.0001879098831759,2.8557884879721735E-2,19.585085754357184,-109.62109824479373,70.378901755206272,null,1000000000,266097656.25,null,19.034087604526992,-38.361596513114144,null,39.015004308510541,-67.639252906505277,null,0,0]
[16407,16.407,2.4938081588692564,1.1581956039068926,1.0000085017089435,4.1235054774616938E-3,1,0,14516.182346332067,1.5707274381589638,1.6886918247773008,0.93704179957779032,1.0005541597664787,3.3283749084619119E-2,1.0045345870960043,9.5052803650121392E-2,4.2089566617823424,0.15859237314249633,1.0001900934289258,2.8723306318226619E-2,19.524500919387368,-109.62426498643882,70.375735013561183,null,1000000000,269189649,null,19.016372081353001,-38.214531021341244,null,38.972919940634171,-67.76918479694632,null,0,0]
[16501.5,16.5015,2.5058677772693367,1.1603012176142566,1.0000085999257715,4.1472555117317792E-3,1,0,14599.791734107836,1.5707278326671039,1.6950138309648215,0.93977998278746355,1.0005605599858192,3.3475311940817577E-2,1.0045868539852505,9.5596962776851493E-2,4.2095581069492738,0.15949064159300924,1.0001922895894251,2.8888727456211051E-2,19.46430776143589,-109.62742589659526,70.372574103404745,null,1000000000,272299502.25,null,18.998888516329703,-38.068643026549736,null,38.930999518909026,-67.897944732132117,null,0,0]
[16596,16.596,2.5179383992563493,1.1623866524963764,1.0000086987066685,4.1710055413232026E-3,1,0,14683.40112188585,1.5707282226824726,1.7013484512654786,0.94249779612654094,1.0005669969215876,3.3666872339287432E-2,1.0046394183108585,9.6141065122146471E-2,4.2101629196788135,0.16038865375343705,1.0001944983647046,2.9054148291944571E-2,19.40450160524891,-109.63058590655642,70.369414093443581,null,1000000000,275427216,null,18.981633064733639,-37.923921741139615,null,38.889242207697265,-68.025548488744903,null,0,0]
[16692.5,16.692499999999999,2.5302756758551834,1.1644956810354055,1.0000088001602687,4.1952582121874632E-3,1,0,14768.78002051859,1.5707286163950278,1.7078300091162106,0.94525230230610524,1.0005736079783161,3.3862484375221394E-2,1.0046934020058464,9.6696623938740192E-2,4.2107840063933262,0.16130540560714343,1.000196766904657,2.9223069784034297E-2,19.343824301689523,-109.63381681363553,70.366183186364466,null,1000000000,278639556.25,null,18.964243907831207,-37.777330464389102,null,38.84676859763988,-68.15467583593481,null,0,0]
[16789,16.789000000000001,2.5426240978752479,1.1665842335162517,1.0000089022020657,4.2195108781164616E-3,1,0,14854.158919153591,1.5707290055816123,1.7143244267533009,0.94798595916830464,1.0005802573205547,3.4058093818765942E-2,1.0047476957616535,9.7252122885081019E-2,4.211408601655207,0.16222188742902763,1.0001990485990639,2.9391990957296926E-2,19.283540930843863,-109.63705663968288,70.362943360317118,null,1000000000,281870521,null,18.947084757651606,-37.631933357678712,null,38.804463305516421,-68.282629973423752,null,0,0]
[16885.5,16.8855,2.5549835037166404,1.1686525887359225,1.0000090048320598,4.2437635390816667E-3,1,0,14939.537817790817,1.5707293903198234,1.7208315585782699,0.95069896214241034,1.0005869449475406,3.4253700655003667E-2,1.0048022995280175,9.7807561628071346E-2,4.2120367039037339,0.16313809781910646,1.0002013434479586,2.9560911809889817E-2,19.223646744626997,-109.64031010367714,70.359689896322863,null,1000000000,285120110.25,null,18.930151758305325,-37.487719227327261,null,38.762325433615878,-68.409426874999681,null,0,0]
[16982,16.981999999999999,{"$f":"SQRT(1+(A269/pole1)^2)","v":2.5673537347489015},{"$f":"ATAN(A269/pole1)","v":1.1707010208165625},{"$f":"SQRT(1+(A269/Zero1)^2)","v":1.0000091080502505},{"$f":"ATAN(A269/Zero1)","v":4.2680161950545518E-3},{"$f":"IF(VIN_nom>Vout, 1, SQRT(1+(A269/z_RHP)^2))","v":1},{"$f":"IF(VIN_nom>Vout, 0, -ATAN(A269/z_RHP))","v":0},{"$f":"SQRT(1+(A269/Pole2)^2)","v":15024.916716430231},{"$f":"ATAN(A269/Pole2)","v":1.5707297706854944},1.7273512609036781,0.95339150493199853,{"$f":"SQRT(1+(A269/pole4)^2)","v":1.0005936708585059},{"$f":"ATAN(A269/pole4)","v":3.4449304869018385E-2},{"$f":"IF(VOUT_setting=1,1,SQRT(1+(A269*zterm1)^2))","v":1.0048572132544009},{"$f":"IF(VOUT_setting=1,0,ATAN(((A269*zterm1))))","v":9.8362939834834268E-2},4.2126683115703578,{"$f":"IF(VOUT_setting=1,0,ATAN(A269*$Q$4/(1+Afbr-$Q$5*(A269)^2)))","v":0.16405403538003677},{"$f":"SQRT((1-(Z269/pterm2))^2+(A269/pterm1)^2)","v":1.0002036514513746},{"$f":"IF((ATAN((A269/pterm1)/(1-A269^2/pterm2))>0),ATAN((A269/pterm1)/(1-A269^2/pterm2)),PI()+ATAN((A269/pterm1)/(1-A269^2/pterm2)))","v":2.9729832339970338E-2},{"$f":"20*LOG10(((E269*K269*G269*O269)/(C269*I269*S269*M269*Q269))*Adc)","v":19.164137069699891},{"$f":"((F269+L269+H269+P269)-(D269+J269+T269+N269+R269))*radconv","v":-109.64358175565987},{"$f":"IF(V269>0,V269,V269+180)","v":70.356418244340134},null,{"$f":"IF(U269<0,A269,1000000000)","v":1000000000},{"$f":"A269^2","v":288388324},null,{"$f":"20*LOG10((K269/(I269*M269))*AEA)","v":18.913441130497063},{"$f":"(L269-(J269+N269))*radconv","v":-37.344676978427664},null,{"$f":"20*LOG10((E269*G269/(C269*S269))*Acs*Am)","v":38.720354082353197},{"$f":"(F269+H269-(D269+T269))*radconv","v":-68.535082246600638},null,{"$f":"SUM((U270<0)*(U269>0))*A269","v":0},0]
[17081,{"$f":"A270/1000","v":17.081},2.5800555243719945,1.1727820995340288,1.0000092145537391,4.2928971529590928E-3,1,0,15112.507503637664,1.5707301564389522,1.7340527820245266,0.95613274179631458,1.0006006107996064,3.4649973809081129E-2,1.0049138716720338,9.8932642820378322E-2,4.2133199232929082,0.16499341690859401,1.000206032917782,2.9903128712501777E-2,19.103480454758465,-109.64696166259205,70.353038337407952,null,1000000000,291760561,null,18.896524790020482,-37.199135260680393,null,38.677467493405025,-68.66282285096473,null,0,0]
[17180,17.18,2.5927683784195272,1.1748427792256009,1.0000093216762951,4.3177781055484619E-3,1,0,15200.09829084732,1.5707305377465901,1.7407672330922015,0.95885285208615822,1.000607591032356,3.4850639957493497E-2,1.0049708562091741,9.9502281383419738E-2,{"$f":"IF(VOUT_setting=1,1,SQRT((1+Afbr-$Q$5*(A271)^2)^2+(A271*$Q$4)^2))","v":4.213975221044401},0.16593250831777911,1.0002084282291928,3.0076424741665005E-2,19.043218802883313,-109.65036988946369,70.34963011053631,null,1000000000,295152400,null,18.879834673727633,-37.054803591810845,null,38.634754242256633,-68.789394657868542,null,0,0]
[17279,17.279,2.6054921349331424,1.1768833411132409,1.0000094294179187,4.3426590527918564E-3,1,0,15287.68907805916,1.5707309146848252,1.7474944650633271,0.96155203930573396,1.0006146115559114,3.5051303298153653E-2,1.0050281668103496,0.10007185516526641,4.2146342031056276,0.16687130810754652,1.0002108373856438,3.0249720425470472E-2,18.983347304252881,-109.65381082712297,70.346189172877033,null,1000000000,298563841,null,18.86336694085557,-36.911670315342782,null,38.592213353782412,-68.914813780031423,null,0,0]
[17378,17.378,2.6182266349651946,1.1789040616248923,1.0000095377786096,4.367539994658472E-3,1,0,15375.279865273149,1.570731287328333,1.7542343308992252,0.96423050506016139,1.0006216723694243,3.5251963814961151E-2,1.0050858034197827,0.10064136380747594,4.2152968677487941,0.16780981478082513,1.0002132603871716,3.0423015761928629E-2,18.923861225835715,-109.65728870060728,70.342711299392718,null,1000000000,301994884,null,18.847117827948303,-36.769723883509812,null,38.549843852311831,-69.039096055495676,null,0,0]
[17479.25,17.47925,2.6312615054348494,1.1809504678538227,1.0000096492423749,4.3929864068830314E-3,1,0,15464.861352198728,1.5707316640748163,1.7611402921621768,0.96694861993051562,1.0006289353289675,3.5457181860431813E-2,1.0051450871000802,0.10122374807748741,4.2159784002179537,0.16876934640933108,1.0002157527775986,3.0600249267408973E-2,18.863416996440655,-109.66088805598858,70.339111944011421,null,1000000000,305524180.5625,null,18.830721703327946,-36.625767086911111,null,38.506687664593187,-69.165043255554707,null,0,0]
[17580.5,17.580500000000001,2.6443072863822947,1.1829766904674854,1.000009761353666,4.4184328134184618E-3,1,0,15554.442839126479,1.5707320364817667,1.7680591632900151,0.96964548122817162,1.0006362404288311,3.5662396918174681E-2,1.0052047116566027,0.10180606345576594,4.2166637808783776,0.16972856828866997,1.0002182596496545,3.0777482405364806E-2,18.803366131382987,-109.66453447474768,70.335465525252317,null,1000000000,309073980.25,null,18.814546526348924,-36.483027610507854,null,38.463708678199055,-69.289833998910609,null,0,0]
[17681.75,17.681750000000001,2.6573638171192968,1.1849830102115519,1.000009874112483,4.4438792142318133E-3,1,0,15644.02432605636,1.5707324046237314,1.7749907933157243,0.97232129848990678,1.0006435876680928,3.5867608970970834E-2,1.0052646770286955,0.10238830955968918,4.2173530078540349,0.17068747882709534,1.0002207810033796,3.0954715173667855E-2,18.743703807455471,-109.66823197074072,70.33176802925928,null,1000000000,312644283.0625,null,18.798588510497144,-36.341493452011726,null,38.420905849825772,-69.413484370985458,null,0,0]
[17783,17.783000000000001,2.6704309399691102,1.1869697029843718,1.0000099875188257,4.4693256092901337E-3,1,0,15733.60581298834,1.5707327685735608,1.7819350333450614,0.97497627920064345,1.0006509770458238,3.6072818001602877E-2,1.0053249831553719,0.10297048600691368,4.2180460792596017,0.1716460764361693,1.0002233168388142,3.1131947570189868E-2,18.68442527928141,-109.67198439773165,70.328015602268351,null,1000000000,316235089,null,18.782843946239797,-36.201152726599872,null,38.378278136988769,-69.536010179470239,null,0,0]
[17886.5,17.886500000000002,2.6837992300291496,1.1889805407362315,1.0000101041145786,4.4953374738115962E-3,1,0,15825.177999632049,1.5707331363523822,1.7890464703751627,0.97766893713629888,1.0006585741844665,3.6282584091340733E-2,1.0053869815515546,0.10356552731491669,4.2187585238059917,0.17262565112627659,1.0002259239941986,3.1313118077930822E-2,18.624221273064865,-109.6758808379069,70.324119162093098,null,1000000000,319926882.25,null,18.76696633834009,-36.058914574853084,null,38.334883053319757,-69.66011263149062,null,0,0]
[17990,17.989999999999998,2.6971782643490321,1.1909714374253322,1.0000102213869553,4.5213493322497746E-3,1,0,15916.75018627787,1.5707334998993963,{"$f":"SQRT(1+(A279/Zero2)^2)","v":1.7961707759526722},{"$f":"ATAN(A279/Zero2)","v":0.9803402540740056},1.0006662153532304,3.6492346986726508E-2,1.0054493358853116,0.10416049502893822,4.2194749815308246,0.17360489547864039,1.0002285462821621,3.1494288192686369E-2,18.564408524780994,-109.67984233047075,70.320157669529252,null,1000000000,323640100,null,18.751304174030025,-35.917898746733144,null,38.291668755660012,-69.783072522606759,null,0,0]
[18093.5,18.093499999999999,2.710567883831672,1.1929426726649195,1.0000103393359556,4.5473611845694706E-3,1,0,16008.322372925775,1.5707338592872244,1.8033077975587686,0.98299044504838129,1.0006739005511069,3.6702106669374256E-2,1.0055120460904252,0.1047553887414877,4.2201954503903067,0.17458380780736463,1.000231183702748,3.1675457912183215E-2,18.504982208243685,-109.68387250523806,70.316127494761943,null,1000000000,327374742.25,null,18.735853728825621,-35.778092924771492,null,38.248634135117008,-69.904905873349293,null,0,0]
[18197,18.196999999999999,2.7239679323834949,1.1948945211839608,1.0000104579615792,4.5733730307354883E-3,1,0,16099.894559575721,1.5707342145868357,1.8104573848095193,0.9856197228934227,1.0006816297770813,3.6911863120899731E-2,1.0055751121003162,0.10535020804538542,4.2209199283305994,0.17556238643022545,1.0002338362560008,3.1856627234148109E-2,18.44593757591857,-109.68797483835935,70.312025161640648,null,1000000000,331130809,null,18.720611354678386,-35.639484917491224,null,38.205778084982107,-70.025628424400324,null,0,0]
[18303,18.303000000000001,2.737702303570654,1.1968737030339813,1.0000105801538917,4.6000131759492396E-3,1,0,16193.678634794176,1.5707345743034962,1.8177925370711896,0.98829105299554465,1.0006895913344325,3.712668278503807E-2,1.0056400701738848,0.10595931741387424,4.221666059088431,0.17656425457005617,1.0002365685660015,3.2042172212265345E-2,18.385857489965222,-109.69225453131371,70.307745468686292,null,1000000000,334999809,null,18.705212744517564,-35.498757847150586,null,38.162070803228346,-70.148131767704996,null,0,{"$f":"IF(AH282>0,W282,0)","v":0}]
[18409,18.408999999999999,2.7514472916916217,1.1988331182981362,1.0000107030559089,4.6266533146337137E-3,1,0,16287.462710014699,1.5707349298776214,1.8251405567889774,0.99094089231914295,1.0006975990703586,3.7341499021049607E-2,1.0057054013059437,0.10656834787219167,4.222416390548843,0.17756576912857125,1.0002393167486392,3.2227716768587857E-2,18.326167916502488,-109.69661681817328,70.303383181826717,null,1000000000,338891281,null,18.690024871292799,-35.35926167395224,null,38.118548481216884,-70.269502545269901,null,0,0]
[18515,18.515000000000001,2.7652027384256832,1.2007730468031423,1.0000108266676304,4.6532934467510981E-3,1,0,16381.246785237259,1.5707352813803606,1.8325012891739316,0.99356946239721156,1.000705652983751,3.7556311809191029E-2,1.0057711054237959,0.10717729898395824,4.2231709204729748,0.17856692831075155,1.0002420808039629,3.2413260900673667E-2,18.266864002287747,-109.7010649638856,70.298935036114401,null,1000000000,342805225,null,18.675044053821136,-35.220983707935908,null,38.075209939024354,-70.38975678984724,null,0,0]
[18621,18.620999999999999,2.7789684884674868,1.2026937634241992,1.0000109509890562,4.6799335722635827E-3,1,0,16475.030860461822,1.5707356288812426,1.8398745816484723,0.99617698239643693,1.0007137530734949,3.7771121129720961E-2,1.0058371824543482,0.10778617031314355,4.2239296466110421,0.17956773032568271,1.0002448607320207,3.259880460608084E-2,18.207940974078671,-109.70560208539919,70.294397914600808,null,1000000000,346741641,null,18.660266687312216,-35.083911394628068,null,38.032054000300043,-70.508910250488057,null,0,0]
[18729.5,18.729500000000002,2.7930694140889467,1.2046401648944047,1.0000110789775998,4.7072019957431948E-3,1,0,16571.026824255037,1.5707359805042767,1.8474346234823549,0.99882442617641154,1.0007220920247122,3.799099309595573E-2,1.0059052040378038,0.1084093187331603,4.2247106107057117,0.18059176439447611,1.0002477226631548,3.2788723897834958E-2,18.148017818537419,-109.71034146603759,70.28965853396241,null,1000000000,350794170.25,null,18.645347818731597,-34.944841921592769,null,37.988068123264988,-70.629750048393234,null,0,0]
[18838,18.838000000000001,2.8071808148660664,1.2065670048951131,1.0000112077097185,4.7344704122225158E-3,1,0,16667.022788050275,1.5707363280768702,1.8550075083128763,1.0014502723807159,1.0007304793537122,3.8210861387234792E-2,1.0059736161753738,0.10903238263956026,4.2254959664782445,0.181615420466049,1.0002506012246701,3.2978642737369439E-2,18.088483857191807,-109.71518022345282,70.284819776547181,null,1000000000,354870244,null,18.630634705669035,-34.807009455859919,null,37.944271083143072,-70.749469031144699,null,0,0]
[18946.5,18.9465,2.8213025336170681,1.2084745627487561,1.0000113371854116,4.7617388216610003E-3,1,0,16763.018751847507,1.5707366716686095,1.86259307948983,1.0040547484505671,1.0007389150592783,3.8430725982393048E-2,1.0060424187873835,0.10965536156587653,4.2262857114805428,0.1826386966332274,1.0002534964166199,3.3168561122065503E-2,18.029334221337447,-109.72012125029971,70.279878749700288,null,1000000000,358969862.25,null,18.616123719146035,-34.670400968781991,null,37.900661631624551,-70.86808320259118,null,0,0]
[19055,19.055,2.8354344161777214,1.2103631127765908,1.0000114674046792,4.7890072240180962E-3,1,0,16859.014715646696,1.5707370113474963,1.8701911826442172,1.0066380793000012,1.0007473991401872,3.8650586860267538E-2,1.0061116117937254,0.11027825504603328,4.2270798432526631,0.1836615909934142,1.0002564082390573,3.3358479049304363E-2,17.970564123371446,-109.72516729763284,70.274832702367164,null,1000000000,363093025,null,18.60181130628235,-34.535003576417608,null,37.857238525365226,-70.985608280035237,null,0,0]
[19165.75,19.165749999999999,2.8498696813466804,1.2122715028714683,1.0000116010912099,4.8168410928114986E-3,1,0,16957.001379157988,1.5707373541040168,1.8779596166806414,1.0092534049603041,1.0007561090474872,3.8875003209415282E-2,1.0061826422163169,0.11091397706608633,4.2278949647961968,0.18470530171210034,1.0002593975963359,3.3552334892234748E-2,17.910961827340056,-109.73042901045937,70.269570989540625,null,1000000000,367325973.0625,null,18.587403273442366,-34.39803420203539,null,37.813105835994001,-71.104463336696568,null,0,0]
[19276.5,19.276499999999999,2.8643152209696217,1.2141606507030314,1.0000117355524738,4.8446749541413998E-3,1,0,17054.988042671248,1.5707376929220336,1.8857407899426495,1.0118471648896386,1.000764869354686,3.909941564095766E-2,1.0062540792225587,0.11154960907935507,4.2287146517190184,0.18574861063317985,1.000262404281111,3.3746190253024777E-2,17.851745145090753,-109.73580550655942,70.264194493440584,null,1000000000,371583452.25,null,18.573194889631448,-34.262300002899316,null,37.76916469962508,-71.222215865683481,null,0,0]
[19387.25,19.387250000000002,2.878770880376341,1.2160308325578904,1.0000118707884704,4.8725088079646728E-3,1,0,17152.974706186444,1.5707380278690428,1.8935345453809012,1.0144195902647437,1.0007736800604601,3.9323824132394603E-2,1.0063259227258636,0.11218515059143633,4.2295389013669995,0.18679151574808858,1.00026542829344,3.3940045128889387E-2,17.792909236106404,-109.74129928620407,70.258700713795932,null,1000000000,375865462.5625,null,18.559182609936858,-34.12778773613595,null,37.725413811364554,-71.338881696895584,null,0,0]
[19498,19.498000000000001,2.8932365078805047,1.2178823197336348,1.0000120067991993,4.9003426542381951E-3,1,0,17250.961369703542,1.5707383590110073,1.9013407282692085,1.0169709096044939,1.0007825411634781,3.9548228661228431E-2,1.006398172639176,0.11282060110836012,4.2303677110733107,0.18783401505330768,1.0002684696333812,3.4133899517043563E-2,17.734449341098099,-109.74691271627572,70.253087283724284,null,1000000000,380172004,null,18.545362964341901,-33.994484311068639,null,37.681851872610565,-71.454476374382651,null,0,0]
[19611.75,19.611750000000001,2.9081042013548974,1.2197647787259742,1.0000121473006869,4.9289304568402807E-3,1,0,17351.602299502963,1.5707386952296214,1.9093711421767794,1.0195696050634473,1.0007916947584456,3.9778707719349576E-2,1.0064728026411973,0.11347316948757023,4.231223715808123,0.18890432907076646,1.0002716113953352,3.4333004529234157E-2,17.674792397512768,-109.75280510924159,70.247194890758408,null,1000000000,384620738.0625,null,18.531365935951488,-33.858814770079839,null,37.637305265530038,-71.572103246328339,null,0,0]
[19725.5,19.7255,2.92298209528145,1.2216280809421873,1.0000122886194469,4.9575182513858429E-3,1,0,17452.24322930432,1.5707390275705271,1.917414342426242,1.0221465157051894,1.0008009015150909,4.0009182549180546E-2,1.0065478611814587,0.11412564082020456,4.2320845252495873,0.189974210727714,1.0002747714364828,3.4532109020978766E-2,17.615522193774908,-109.7588283719996,70.241171628000401,null,1000000000,389095350.25,null,18.517564933800088,-33.724392942736635,null,37.592955227435894,-71.688632486493873,null,0,0]
[19839.25,19.83925,2.9378700346894808,1.2234725045811385,1.0000124307554787,4.9861060378281578E-3,1,0,17552.88415910758,1.5707393561004241,1.9254701687817655,1.024701880521744,1.0008101614319462,4.0239653126353345E-2,1.0066233481640983,0.11477801457249559,4.2329501364666688,0.19104365787011404,1.0002779497568877,3.4731212989259921E-2,17.556633830202973,-109.76498466035687,70.235015339643127,null,1000000000,393595840.5625,null,18.503956433032172,-33.59120513823013,null,37.54880037326275,-71.804080034329914,null,0,0]
[19953,19.952999999999999,2.9527678676301838,1.2252983227467018,1.0000125737087817,5.0146938161205025E-3,1,0,17653.52508891272,1.5707396808844907,1.9335384634284698,1.027235935650981,1.0008194745075365,4.0470119426502693E-2,1.0066992634927368,0.11543029021116769,4.2338205465143846,0.19211266834962948,1.0002811463566144,3.493031643106017E-2,17.498122490422627,-109.77127600194149,70.228723998058513,null,1000000000,398122209,null,18.490536984273962,-33.459237829195395,null,37.504839325726955,-71.918461537365587,null,0,0]
[20069,20.068999999999999,2.967970417548734,1.2271413727742635,1.0000127203314124,5.0438470585086855E-3,1,0,17756.156718430182,1.5707400083011829,1.9417790302656392,1.02979841067466,1.0008290265426414,4.0705139970704483E-2,1.0067771214817707,0.11609536640914529,4.2347131125490378,0.19320237216600891,1.0002844250111045,3.5133357637365394E-2,17.438837159541286,-109.77783284771117,70.222167152288833,null,1000000000,402764761,null,18.47704329497715,-33.325903269954786,null,37.460206894375162,-72.034023571948964,null,0,0]
[20185,20.184999999999999,2.9831829463940989,1.228965631941437,1.000012867803965,5.0730002923231494E-3,1,0,17858.788347949525,1.5707403319546511,1.9500322395539307,1.0323392117075976,1.0008386338571367,4.0940156015838489E-2,1.0068554247258663,0.11676033945513904,4.2356106629058203,0.19429161737973785,1.0002877226753424,3.533639828981789E-2,17.379934055842867,-109.78453401422239,70.215465985777612,null,1000000000,407434225,null,18.463739197112922,-33.193810065515827,null,37.415773145004408,-72.148508938295251,null,0,0]
[20301,20.300999999999998,2.9984053022808315,1.2307713742062798,1.0000130161264396,5.1021535175143446E-3,1,0,17961.419977470719,1.5707406519094047,1.958297931449243,1.0348585801843881,1.0008482964494299,4.1175167536073587E-2,1.0069341731211492,0.11742520878519465,4.23651319441701,0.19538040173090335,1.0002910393493978,3.5539438385217607E-2,17.32140832831475,-109.79138126979659,70.208618730203412,null,1000000000,412130601,null,18.45062126325838,-33.062944384911333,null,37.371536642980644,-72.261933332864444,null,0,0]
[20417,20.417000000000002,3.0136373362951443,1.2325588684765147,1.0000131652988353,5.1313067340327187E-3,1,0,18064.051606993729,1.5707409682284872,1.9665759485550929,1.0373567545720048,1.0008580143179207,4.141017450558164E-2,1.0070133665631869,0.11808997383590053,4.2374207039000167,0.19646872296584644,1.0002943750333404,3.5742477920364564E-2,17.263255208891273,-109.79837626366812,70.201623736331882,null,1000000000,416853889,null,18.437686139843223,-32.93329256712245,null,37.327495962717897,-72.374312162753625,null,0,0]
[20536,20.536000000000001,3.0292732060186145,1.2343739056800869,1.0000133192123142,5.161213903983157E-3,1,0,18169.337502799368,1.5707412890148813,1.9750806973488726,1.0398977603921904,1.0008680409479271,4.165125448568982E-2,1.0070950704617758,0.11877182213672263,4.2383568528521387,0.19758470684740284,1.0002978167387417,3.5950767892444307E-2,17.203980405173269,-109.80570728918964,70.194292710810359,null,1000000000,421727296,null,18.424603011869806,-32.801534902848879,null,37.282518298671278,-72.488526716007755,null,0,0]
[20655,20.655000000000001,3.0449189527486342,1.2361702962924284,1.0000134740202433,5.191121064700736E-3,1,0,18274.623398606851,1.5707416061049713,1.9835980892654683,1.0424169606607634,1.0008781257467732,4.189232962158887E-2,1.0071772424999981,0.11945355949525804,4.2392982337537664,0.19870019856418597,1.0003012784501653,3.6159057268095644E-2,17.145087826665321,-109.81319694439019,70.186803055609815,null,1000000000,426629025,null,18.411705353165736,-32.671026115318746,null,37.237743706488182,-72.601672864637038,null,0,0]
[20774,20.774000000000001,3.0605744250105618,1.2379483147733645,1.0000136297226228,5.2210282161319595E-3,1,0,18379.909294416153,1.5707419195622778,1.9921279621369428,1.0449146032962247,1.0008882687127003,4.2133399885404398E-2,1.007259882563281,0.12013518530504019,4.2402448431205002,0.19981519570378764,1.0003047601676871,3.6367346043863914E-2,17.086572586728664,-109.82084664835024,70.179153351649759,null,1000000000,431559076,null,18.398989773564541,-32.541752001890615,null,37.193170677572937,-72.713766333836219,null,0,0]
[20893,20.893000000000001,3.0762394743200607,1.2397082304620959,1.0000137863194518,5.2509353582233321E-3,1,0,18485.195190227241,1.5707422294488746,2.0006701563253557,1.0473909330681119,1.0008984698439403,4.2374465249265428E-2,1.0073429905364379,0.12081669896021549,4.2411966774517049,0.20092969586082474,1.0003082618913848,3.6575634216294464E-2,17.028429883217775,-109.8286577074672,70.171342292532799,null,1000000000,436517449,null,18.386452956824218,-32.413698540262708,null,37.148797713848637,-72.824822555409924,null,0,0]
[21014.75,21.014749999999999,3.0922762908608661,1.2414903569747058,1.0000139474608081,5.281533622027699E-3,1,0,18592.914163464346,1.5707425428645407,2.0094223419931008,1.0499026836122629,1.000908966910832,4.2621096351189533E-2,1.0074285032056061,0.12151384517706472,4.2421759117637432,0.20206943442980038,1.000311865242359,3.6788735142845322E-2,16.969324173856421,-109.83681751461658,70.163182485383416,null,1000000000,441619717.5625,null,18.373808048004562,-32.283934713376702,null,37.10360482692267,-72.937387515594736,null,0,0]
[21136.5,21.136500000000002,3.108322827036309,1.2432540887914405,1.000014109538431,5.3121318759422661E-3,1,0,18700.633136703262,1.5707428526695466,2.0181870948869758,1.0523926332681803,1.0009195248586347,4.2867722265062601E-2,1.0075145054147179,0.12221087271476121,4.2431606078554935,0.20320864770977684,1.000315489535013,3.7001835430535097E-2,16.91059851174273,-109.84514864501797,70.154851354982029,null,1000000000,446751632.25,null,18.361343465880246,-32.155419481248529,null,37.058618220386073,-73.048898501301863,null,0,0]
[21258.25,21.25825,3.1243789330888205,1.2449996984435721,1.0000142725523198,5.3427301199097414E-3,1,0,18808.352109943946,1.5707431589259293,2.0269642519819633,1.0548610341662463,1.0009301436854217,4.3114342961047554E-2,1.0076009970384212,0.12290778092648304,4.2441507619256251,0.20434733314771925,1.0003191347694307,3.7214935075664139E-2,16.852248017295256,-109.85365215997454,70.146347840025456,null,1000000000,451913193.0625,null,18.349055887257872,-32.028138399716305,null,37.013836324653354,-73.159371127214314,null,0,0]
[21380,21.38,3.1404444622350778,1.2467274533324044,1.0000144365024743,5.3733283538728365E-3,1,0,18916.07108318638,1.5707434616943126,2.0357536528358362,1.0573081351421501,1.0009408233892554,4.3360958409311146E-2,1.0076879779506942,0.12360456916609341,4.2451463701552932,0.20548548819839721,1.0003228009456964,3.7428034074532823E-2,16.794267895987538,-109.86232901596311,70.137670984036887,null,1000000000,457104400,null,18.336942062065091,-31.902077213309383,null,36.969257582019551,-73.268820714089571,null,0,0]
[21504.5,21.5045,3.1568824626748078,1.2484760425884669,1.0000146051240404,5.4046177079716089E-3,1,0,19026.22313385495,1.5707437677560676,2.044754079452666,1.0597887382863702,1.0009518072715475,4.3613138769105199E-2,1.0077774293831463,0.12431697120912182,4.2461701028013472,0.20664879992707277,1.0003265715876797,3.7645945725635496E-2,16.735356269992515,-109.87138200788672,70.128617992113277,null,1000000000,462443520.25,null,18.324730991664701,-31.774415528691939,null,36.923880404773399,-73.379700168671931,null,0,0]
[21629,21.629000000000001,3.1733300154693289,1.2502065110116871,1.0000147747246444,5.4359070514877848E-3,1,0,19136.375184525285,1.5707440702943414,2.0537669779176615,1.0622475843365451,1.0009628548079044,4.3865313578352425E-2,1.0078673921885049,0.12502924643478103,4.2471995306461405,0.20781155167984486,1.0003303641284136,3.7863856693129028E-2,16.676822061718774,-109.88061796560969,70.119382034390313,null,1000000000,467813641,null,18.312694964813762,-31.647999913835665,null,36.878712405369043,-73.489541337448401,null,0,0]
[21753.5,21.753499999999999,3.1897869728537374,1.2519191286278499,1.0000149453042853,5.4671963843601033E-3,1,0,19246.527235197347,1.5707443693696308,2.0627921847521695,1.0646849289419731,1.0009739659962182,4.4117482805164455E-2,1.0079578662298458,0.12574139415439881,4.2482346495498096,0.20897374076057834,1.0003341785679909,3.8081766973057513E-2,16.618660408751186,-109.8900375992409,70.109962400759102,null,1000000000,473214762.25,null,18.300830731511319,-31.522815722753865,null,36.833751957052129,-73.598359691533688,null,0,0]
[21878,21.878,3.2062531900132698,1.2536141603393312,1.000015116862963,5.4984857065273037E-3,1,0,19356.679285871112,1.5707446650410557,2.0718295391047667,1.0671010243223658,1.0009851408343691,4.4369646417657213E-2,1.0080488513695165,0.12645341368006682,4.2492754553536454,0.21013536448178652,1.0003380149065035,3.8299676561465046E-2,16.560866534040485,-109.8996415222134,70.1003584777866,null,1000000000,478646884,null,18.289135113864177,-31.398848505882036,null,36.788997446269562,-73.706170408492781,null,0,0]
[22005.25,22.00525,3.2230925398938517,1.2553287301677658,1.0000152932228021,5.5304661471744189E-3,1,0,19469.26441397113,1.5707449637860444,2.081078901949819,1.0695487878347461,1.0009966282783203,4.4627374074248882E-2,1.008142374234043,0.12718102735674416,4.2503451232039859,0.2113220595404964,1.0003419586133584,3.8522398695154079E-2,16.502171255809081,-109.90964856201455,70.090351437985447,null,1000000000,484231027.5625,null,18.277352168133241,-31.273385811046666,null,36.74346552720278,-73.815336717455764,null,0,0]
[22132.5,22.1325,3.2399412663515195,1.2570254723227212,1.0000154706054054,5.5624465765088706E-3,1,0,19581.849542072861,1.5707452590957864,2.0903406232870418,1.0719748750493847,1.0010081822104873,4.4885095798421509E-2,1.0082364307317997,0.12790850566305659,4.2514207231128811,0.21250815833882419,1.0003459251974534,3.8745120098079323E-2,16.443850356514879,-109.9198491267411,70.080150873258901,null,1000000000,489847556.25,null,18.265738878804562,-31.149164539861069,null,36.698145377610992,-73.923481534747182,null,0,0]
[22259.75,22.25975,3.2567992238599128,1.2587046537987117,1.0000156490107717,5.5944269944652476E-3,1,0,19694.434670176284,1.5707455510291954,2.0996145395708359,1.0743795444467701,1.0010198026285679,4.51428115561451E-2,1.0083310207134557,0.12863584786699517,4.2525022505794086,0.21369365803542598,1.0003499146588881,3.8967840766017024E-2,16.385899000301176,-109.93024358454227,70.069756415457732,null,1000000000,495496470.0625,null,18.254292074425116,-31.026169883909898,null,36.653035317536641,-74.03062015778761,null,0,0]
[22387,22.387,3.2736662698113466,1.2603665364883181,1.0000158284389009,5.6264074009781404E-3,1,0,19807.019798281366,1.5707458396438456,2.1089004899189168,1.0767630509545767,1.001031489530247,4.5400521313394414E-2,1.0084261440288891,0.12936305323740085,4.2535897010824337,0.21487855579851839,1.0003539269977642,3.9190560694743443E-2,16.328312436747751,-109.94083221523185,70.05916778476815,null,1000000000,501177769,null,18.243008654446026,-30.904387238262533,null,36.608133681494223,-74.136767591678364,null,0,0]
[22517.5,22.517499999999998,3.2909733979681333,1.2620531660382932,1.0000160135119522,5.6592045839154205E-3,1,0,19922.480381526384,1.5707461322417451,2.1184359392469374,1.07918571565949,1.0010435439684662,4.5664806780779027E-2,1.0085242506018433,0.13010868874769979,4.2547110724956845,0.21609308803010949,1.000358065574332,3.9418968179512383E-2,16.269629095673132,-109.95189316166757,70.04810683833243,null,1000000000,507037806.25,null,18.231603574877774,-30.780737981846926,null,36.562299992826325,-74.244611991341458,null,0,0]
[22648,22.648,3.3082897900523824,1.2637221438374917,1.0000161996606753,5.6920017546778683E-3,1,0,20037.94096477309,1.5707464214676889,2.1279837108470283,1.081586654476747,1.0010556683246954,4.5929085864798214E-2,1.0086229177770987,0.13085417879082886,4.2558386636646777,0.21730698118681099,1.0003622282120734,3.9647374877830752E-2,16.211319566888804,-109.96315865401137,70.036841345988634,null,1000000000,512931904,null,18.220363947819315,-30.658332968162895,null,36.516682009200792,-74.351444975820158,null,0,0]
[22778.5,22.778500000000001,3.3256153013530119,1.2653737363965829,1.0000163868850702,5.724798913194936E-3,1,0,20153.401548021455,1.5707467073796317,2.1375436395994236,1.0839661310391016,1.0010678625963936,4.6193358528768262E-2,1.0087221453901514,0.1315995225809761,4.2569724696472866,0.21852023224580616,1.0003664149110991,3.9875780785142978E-2,16.153378994649657,-109.97462872994646,70.02537127005354,null,1000000000,518860062.25,null,18.209286649522362,-30.537157093385002,null,36.471277981584727,-74.457281814794001,null,0,0]
[22909,22.908999999999999,3.3429497900834919,1.2670082050821534,1.0000165751851355,5.7575960593960716E-3,1,0,20268.862131271442,1.5707469900342077,2.1471155631167225,1.0863244052592884,1.0010801267810063,4.6457624736010845E-2,1.008821933275627,0.1323447193332879,4.2581124854794243,0.21973283819498593,1.0003706256715208,4.0104185896893546E-2,16.095802609795168,-109.9863033460465,70.013696653953502,null,1000000000,524822281,null,18.198368626830302,-30.417195466753917,null,36.426086176873355,-74.562137483208446,null,0,0]
[23042.25,23.042249999999999,3.3606586838197758,1.2686597139784161,1.0000167685631203,5.7910843204178782E-3,1,0,20386.75579194789,1.5707472753415606,2.1569014044743304,1.0887107639133153,1.0010927215419492,4.6727453071016313E-2,1.0089244019047885,0.13310546693268829,4.2592829269694423,0.2209703283800418,1.0003749499918579,4.0337403317564031E-2,16.037383842322889,-109.99843490402608,70.001565095973916,null,1000000000,530945285.0625,null,18.187381775739993,-30.295943559031134,null,36.38015924842059,-74.668205610807377,null,0,0]
[23175.5,23.1755,3.3783766475816681,1.2702939045502919,1.000016963062587,5.8245725684505645E-3,1,0,20504.649452625985,1.5707475573681036,2.1666994177632239,1.0910755532679066,1.0011053891879433,4.6997274597034996E-2,1.0090274543169511,0.13386605958123152,4.2604598322547291,0.22220713966757233,1.0003792993985945,4.057061989919112E-2,15.97933499142751,-110.0107793795701,69.989220620429904,null,1000000000,537103800.25,null,18.176554767421688,-30.17592690303173,null,36.334449980037789,-74.773281424180126,null,0,0]
[23308.75,23.30875,3.3961035394102614,1.2719110391935382,1.0000171586835351,5.8580608034190249E-3,1,0,20622.543113305688,1.5707478361701033,2.1765094385999126,1.0934190383474909,1.0011181297162224,4.7267089275038129E-2,1.0091310903332666,0.13462649644651623,4.2616431959805068,0.22344326888577382,1.0003836738918512,4.0803835636925287E-2,15.92165124743579,-110.02333648874286,69.976663511257144,null,1000000000,543297826.5625,null,18.165884567675576,-30.057130314962091,null,36.288956577841027,-74.877379957222644,null,0,0]
[23442,23.442,3.4138392202244292,1.2735113752120475,1.0000173554259637,5.8915490252481563E-3,1,0,20740.436773986974,1.5707481118025468,2.1863313053515867,1.0957414803588876,1.0011309431240036,4.7536897066002913E-2,1.0092353097739493,0.13538677669720262,4.2628330127685734,0.22467871287462177,1.0003880734717494,4.1037050525917114E-2,15.864327886826883,-110.03610587514059,69.963894124859408,null,1000000000,549527364,null,18.155368211296462,-29.939538829688551,null,36.243677265035956,-74.980515952088481,null,0,0]
[23578.5,23.578499999999998,3.4320164493359648,1.2751335893439317,1.0000175581298316,5.9258540192731086E-3,1,0,20861.205889808443,1.5707483909274464,2.1964048465348815,1.0980990171885927,1.0011441446185034,4.7813278352959725E-2,1.0093426759059849,0.13616543710976478,4.2640585349012303,0.22594357585035946,1.0003926063705095,4.1275952697817607E-2,15.80597522185947,-110.0494063715992,69.950593628400796,null,1000000000,555945662.25,null,18.144751847041103,-29.820313393121289,null,36.197513724946091,-75.085184530224097,null,0,0]
[23715,23.715,3.4502026148897338,1.2767387061426378,1.0000177620105524,5.9601589993504263E-3,1,0,20981.975005631521,1.5707486668391437,2.2064904837875603,1.1004350147944417,1.0011574225849962,4.8089652329949564E-2,1.0094506538842385,0.13694393141220856,4.2652908172185144,0.22720771308834392,1.0003971655948336,4.1514853968767008E-2,15.747990968973573,-110.0629286515906,69.937071348409404,null,1000000000,562401225,null,18.134290837268932,-29.702321460243194,null,36.151571125111829,-75.188873452504993,null,0,0]
[23851.5,23.851500000000001,3.4683975763139476,1.2783269863457265,1.0000179670681251,5.994463965399377E-3,1,0,21102.74412145618,1.5707489395928049,2.2165880519956365,1.1027497418695826,1.0011707770204392,4.8366018955043819E-2,1.0095592435123883,0.137722258714367,4.2665298538633172,0.2284711212303169,1.0004017511448544,4.1753754333552419E-2,15.690370319512159,-110.07667211834644,69.923327881653563,null,1000000000,568894052.25,null,18.123982207972425,-29.585547636829332,null,36.105847610800907,-75.291597657798917,null,0,0]
[23988,23.988,3.4866011959038539,1.279898685589236,1.0000181733025491,6.0287689173392249E-3,1,0,21223.51323728239,1.5707492092423412,2.2266973888465764,1.1050434631480299,1.0011842079217725,4.8642378186320563E-2,1.0096684445930866,0.13850041812726438,4.2677756389532462,0.22973379693114046,1.0004063630207058,4.199265378696105E-2,15.633108551589658,-110.0906361102563,69.909363889743702,null,1000000000,575424144,null,18.113823053394601,-29.469976755424902,null,36.060341345729455,-75.393371792677954,null,0,0]
[24127.75,24.127749999999999,3.5052470639904936,1.2814908901143467,1.0000183856665312,6.0638906391477692E-3,1,0,21347.1578082489,1.5707494821512513,2.2370594498763943,1.1073703072254453,1.0011980378217464,4.8925309695547634E-2,1.0097808789558167,0.13929693028530801,4.2690580707978478,0.23102577405251692,1.0004111119767658,4.2237240372966126E-2,15.574850367134657,-110.1051602863315,69.894839713668503,null,1000000000,582148320.0625,null,18.103573905185357,-29.352884827968907,null,36.013974769655604,-75.496599844881118,null,0,0]
[24267.5,24.267499999999998,3.5239017242309756,1.283066241127631,1.0000185992640709,6.0990123459960894E-3,1,0,21470.802379216981,1.5707497519169438,2.2474335110762751,1.1096756824545775,1.0012119478656445,4.9208233365770772E-2,1.0098939538125786,0.14009326458222832,4.2703475637086292,0.23231697638553189,1.000415888527477,4.2481825992620903E-2,15.516958611021725,-110.11991401654996,69.880085983450044,null,1000000000,588911556.25,null,18.093475481637505,-29.237022345677016,null,35.967832074589843,-75.598862207474937,null,0,0]
[24407.25,24.407250000000001,3.5425650377304834,1.2846249971158457,1.0000188140951674,6.1341340377975484E-3,1,0,21594.446950186604,1.5707500185934102,2.2578194070337516,1.1119598604283134,1.0012259380501265,4.949114915202394E-2,1.010007668948254,0.14088942006794461,4.2716441112914314,0.23360740038335395,1.0004206926729851,4.2726410640331468E-2,15.459428486252145,-110.13489640140445,69.865103598595553,null,1000000000,595713852.5625,null,18.083524875123448,-29.122373747940156,null,35.921911349299464,-75.700173690344073,null,0,0]
[24547,24.547000000000001,{"$f":"SQRT(1+(A333/pole1)^2)","v":3.5612368684420579},{"$f":"ATAN(A333/pole1)","v":1.2861674114710395},{"$f":"SQRT(1+(A333/Zero1)^2)","v":1.0000190301598195},{"$f":"ATAN(A333/Zero1)","v":6.1692557144655061E-3},{"$f":"IF(VIN_nom>Vout, 1, SQRT(1+(A333/z_RHP)^2))","v":1},{"$f":"IF(VIN_nom>Vout, 0, -ATAN(A333/z_RHP))","v":0},{"$f":"SQRT(1+(A333/Pole2)^2)","v":21718.091521157745},{"$f":"ATAN(A333/Pole2)","v":1.570750282233413},2.2682169751789827,1.1142231086528793,{"$f":"SQRT(1+(A333/pole4)^2)","v":1.0012400083718331},{"$f":"ATAN(A333/pole4)","v":4.9774057009348671E-2},{"$f":"IF(VOUT_setting=1,1,SQRT(1+(A333*zterm1)^2))","v":1.0101220241466031},{"$f":"IF(VOUT_setting=1,0,ATAN(((A333*zterm1))))","v":0.14168539579370953},4.2729477071248949,{"$f":"IF(VOUT_setting=1,0,ATAN(A333*$Q$4/(1+Afbr-$Q$5*(A333)^2)))","v":0.23489704251372495},{"$f":"SQRT((1-(Z333/pterm2))^2+(A333/pterm1)^2)","v":1.0004255244134364},{"$f":"IF((ATAN((A333/pterm1)/(1-A333^2/pterm2))>0),ATAN((A333/pterm1)/(1-A333^2/pterm2)),PI()+ATAN((A333/pterm1)/(1-A333^2/pterm2)))","v":4.2970994310503934E-2},{"$f":"20*LOG10(((E333*K333*G333*O333)/(C333*I333*S333*M333*Q333))*Adc)","v":15.402255282946109},{"$f":"((F333+L333+H333+P333)-(D333+J333+T333+N333+R333))*radconv","v":-110.15010648431954},{"$f":"IF(V333>0,V333,V333+180)","v":69.849893515680463},null,{"$f":"IF(U333<0,A333,1000000000)","v":1000000000},{"$f":"A333^2","v":602555209},null,{"$f":"20*LOG10((K333/(I333*M333))*AEA)","v":18.073719245305412},{"$f":"(L333-(J333+N333))*radconv","v":-29.008923708227666},null,{"$f":"20*LOG10((E333*G333/(C333*S333))*Acs*Am)","v":35.876210702303993},{"$f":"(F333+H333-(D333+T333))*radconv","v":-75.800548811467962},null,{"$f":"SUM((U334<0)*(U333>0))*A333","v":0},0]
[24690,{"$f":"A334/1000","v":24.69},3.5803516053941573,1.2877290389330633,1.0000192525261506,6.2051941585559061E-3,1,0,21844.611547269298,1.5707505489151579,2.2788682630818058,1.1165175998775458,1.0012544888611787,5.0063535864614483E-2,1.0102397011049447,0.14249969551529956,4.2742889084393587,0.23621586329877475,1.000430497085119,4.3221264955268027E-2,15.344117115102122,-110.16590493830761,69.834095061692395,null,1000000000,609596100,null,18.063832756535248,-28.894060241196691,null,35.829673111944025,-75.90230380484229,null,0,0]
[24833,24.832999999999998,3.5994749809327926,1.2892740768272619,1.0000194761840779,6.2411325866172009E-3,1,0,21971.131573382387,1.5707508125255472,2.2895314368537658,1.1187907304302802,1.0012690532512245,5.0353006322658149E-2,1.0103580477808047,0.14331380501321347,{"$f":"IF(VOUT_setting=1,1,SQRT((1+Afbr-$Q$5*(A335)^2)^2+(A335*$Q$4)^2))","v":4.2756374759520837},0.23753385799154866,1.0004354986504682,4.3471534564648244E-2,15.286342956098611,-110.18193960833197,69.818060391668027,null,1000000000,616677889,null,18.054092256899722,-28.780419993415279,null,35.783362010800857,-76.003108227590445,null,0,0]
[24976,24.975999999999999,3.618606858100065,1.2908027808494238,1.0000197011336005,6.2770709985565665E-3,1,0,22097.651599496978,1.5707510731173355,2.3002063311952345,1.1210427740499465,1.0012837015383098,5.0642468335335873E-2,1.0104770639388725,0.14412772327533677,4.2769934026957372,0.23885102285521187,1.0004405291096445,4.3721803132651491E-2,15.228928030474236,-110.19820930441166,69.801790695588338,null,1000000000,623800576,null,18.04449491045667,-28.667987281066019,null,35.737275435605284,-76.102976729663951,null,0,0]
[25119,25.119,3.6377471027590156,1.2923154016228664,1.0000199273747175,6.3130093942811803E-3,1,0,22224.171625613057,1.5707513307420771,2.3108927836808872,1.123274000275845,1.001298433718752,5.0931921854512348E-2,1.0105967493426165,0.14494144929104386,4.2783566816738201,0.24016735416907264,1.0004455884628083,4.3972070653284692E-2,15.171867649975617,-110.21471278732328,69.785287212676721,null,1000000000,630964161,null,18.035037947397747,-28.556746660880425,null,35.69141144408119,-76.201923670383096,null,0,0]
[25265.25,25.265250000000002,3.6573308709731696,1.2938460204529263,1.0000201600936363,6.3497645548583536E-3,1,0,22353.567106869647,1.570751591205469,2.3218338989178728,1.1255346803151491,1.0013135874926424,5.1227945027358036E-2,1.0107198468550997,0.14577346917822231,4.279758541720609,0.24151273606146653,1.0004507926879116,4.4228024982521985E-2,15.113872369411979,-110.23183182666033,69.768168173339674,null,1000000000,638332857.5625,null,18.025508439578534,-28.444195037565429,null,35.644733315955243,-76.30218085674035,null,0,0]
[25411.5,25.4115,3.6769231162759932,1.2953603311938144,1.0000203941635237,6.3865196982789791E-3,1,0,22482.962588127739,1.5707518486707877,2.3327867689484969,1.12777414307936,1.0013288290087006,5.1523959214433833E-2,1.0108436438748736,0.14660528584781171,4.2811680770966962,0.24285723826481456,1.0004560271356335,4.4483978203561148E-2,15.056238284605319,-110.24919263353665,69.750807366463349,null,1000000000,645744332.25,null,18.016120112707721,-28.332858387943794,null,35.598283961057156,-76.401503595902966,null,0,0]
[25557.75,25.557749999999999,3.6965237038771712,1.2968585862626081,1.0000206295843788,6.4232748244437612E-3,1,0,22612.358069387301,1.5707521031895009,2.3437512289744817,1.1299926637210229,1.0013441582629201,5.1819964364275134E-2,1.0109681401449662,0.14743689822357928,4.2825852802240574,0.24420085685158935,1.0004612918061484,4.4739930309991377E-2,14.998960650731055,-110.26679374157735,69.733206258422655,null,1000000000,653198585.0625,null,18.006870206983169,-28.222720946936118,null,35.552061368613643,-76.499906349942606,null,0,0]
[25704,25.704000000000001,3.7161325017733815,1.2983410330404428,1.0000208663562002,6.4600299332534051E-3,1,0,22741.753550648311,1.5707523548119053,2.3547271170942183,1.1321905130952437,1.0013595752512716,5.211596042542678E-2,1.0110933354070806,0.14826830523095119,4.2840101434935045,0.24554358791209796,1.000466586699633,4.4995881295401913E-2,14.942034810017935,-110.28463364295456,69.71536635704544,null,1000000000,660695616,null,17.997756027406815,-28.113767195621598,null,35.506063550015597,-76.597403292392599,null,0,0]
[25853.75,25.853750000000002,3.7362189424046472,1.2998428300957559,1.0000211101942045,6.4976646334178228E-3,1,0,22874.24567590679,1.5707526095062705,2.3659773515292315,1.1344198197973721,1.0013754520976439,5.2419030681713906E-2,1.0112222508081661,0.14911939523816617,4.2854770353900111,0.24691752900235789,1.0004720396252527,4.5257956435262169E-2,14.884106388440033,-110.30314630047047,69.696853699529527,null,1000000000,668416389.0625,null,17.988561619384885,-28.003416569716698,null,35.459195782001906,-76.696309415406873,null,0,0]
[26003.5,26.003499999999999,3.7563137195511715,1.3013285624441022,1.0000213554486086,6.5352993151757887E-3,1,0,23006.737801166732,1.5707528612671475,{"$f":"SQRT(1+(A343/Zero2)^2)","v":2.3772392330911223},{"$f":"ATAN(A343/Zero2)","v":1.1366280152489647},1.0013914209190122,5.2722091299936658E-2,1.0113518985052903,0.14997026765492369,4.2869519422092761,0.2482905313394094,1.0004775242380974,4.5520030386201935E-2,14.826537187044369,-110.32190599668991,69.678094003310093,null,1000000000,676182012.25,null,17.979503993484194,-27.894274809072236,null,35.41255952551343,-76.794295031446268,null,0,0]
[26153.25,26.15325,3.7764167001340909,1.3027984800249119,1.0000216021194115,6.5729339784207043E-3,1,0,23139.229926428114,1.5707531101449264,2.3885125970306342,1.138815376685941,1.0014074817109768,5.30251422248878E-2,1.0114822782168649,0.15082092133309549,4.2884348556822829,0.24966259078449107,1.0004830405383587,4.5782103141339348E-2,14.769322476530569,-110.34091099562441,69.659089004375588,null,1000000000,683992485.5625,null,17.970580456379281,-27.786326028964048,null,35.366152716568457,-76.891374460597078,null,0,0]
[26303,26.303000000000001,3.7965277538394471,1.3042528277582905,1.0000218502066123,6.6105686230459775E-3,1,0,23271.722051690911,1.57075335618885,2.3997972815278263,1.1409821769350152,1.0014236344691125,5.3328183401370743E-2,1.0116133896598571,0.15167135512640972,4.2899257675065883,0.25103370321862656,1.0004885885262305,4.6044174693792614E-2,14.712457614844165,-110.36015952729028,69.639840472709722,null,1000000000,691847809,null,17.961788378485743,-27.679554597231757,null,35.319973314600716,-76.987561735359492,null,0,0]
[26456,26.456,3.8170834795825739,1.3057229082448805,1.0000221051408493,6.6490200269280625E-3,1,0,23407.089632094408,1.5707536046959076,2.411338402126233,1.1431750467944004,1.0014402327650331,5.3637791305907616E-2,1.0117481020220478,0.15254001746132212,4.2914572882926914,0.2524335903566029,1.0004942896480262,4.6311932693431139E-2,14.654715204765729,-110.38007545075401,69.619924549245994,null,1000000000,699919936,null,17.952938586650419,-27.571665873783687,null,35.273024453660334,-77.084929443048267,null,0,{"$f":"IF(AH346>0,W346,0)","v":0}]
[26609,26.609000000000002,3.8376473661829422,1.3071772371063721,1.0000223615536288,6.6874714111485765E-3,1,0,23542.457212499339,1.570753850345167,2.422891007576915,1.1453470153356282,1.0014569270528773,5.3947388917792709E-2,1.0118835776196962,0.1534084478504176,4.292997140743938,0.25383248030255101,1.0005000238481911,4.6579689423092589E-2,14.597328467112735,-110.40024175941478,69.599758240585217,null,1000000000,708038881,null,17.94422066856152,-27.464973954188377,null,35.226308744836473,-77.181394577459571,null,0,0]
[26762,26.762,3.8582192831511257,1.3086160601027261,1.0000226194449495,6.7259227755938344E-3,1,0,23677.824792905671,1.5707540931856423,2.4344549343772011,1.1474983597700166,1.0014737173278445,5.425697617819196E-2,1.012019816146287,0.15427664507721903,4.2945453158987954,0.25523036872772198,1.0005057911269348,4.6847444875437565E-2,14.540292720372037,-110.42065647194595,69.579343528054054,null,1000000000,716204644,null,17.935632014651471,-27.359462954844627,null,35.179824085935479,-77.276971219187985,null,0,0]
[26915,26.914999999999999,3.878799102715575,1.3100396180380376,1.0000228788148104,6.7643741201501486E-3,1,0,23813.192373313384,1.5707543332652338,2.4460300219576134,1.14962935283297,1.001490603585107,5.4566553028283164E-2,1.0121568172937447,0.15514460792730847,4.2961018047602479,0.25662725132511111,1.0005115914844682,4.711519904312679E-2,14.483603369655055,-110.4413175805862,69.558682419413799,null,1000000000,724417225,null,17.927170077450626,-27.25511724853903,null,35.133568399197408,-77.371673164877862,null,0,0]
[27071.75,27.071750000000002,3.899891394324897,1.3114824829217666,1.0000231460751166,6.8037678788770671E-3,1,0,23951.877786575631,1.5707545764148554,2.4579002222591506,1.1517917509525226,1.0015080032560337,5.4883706688613636E-2,1.0122979668761842,0.15603360004521907,4.2977050552694287,0.25805732365198775,1.0005175683127068,4.7389514473020193E-2,14.425879094172489,-110.46273849324558,69.537261506754419,null,1000000000,732879648.0625,null,17.918629553334178,-27.149406460182018,null,35.086414306715305,-77.467803253507014,null,0,0]
[27228.5,27.2285,3.9209917175989504,1.3129098215589949,1.0000234148873264,6.8431616164865696E-3,1,0,24090.563199839282,1.5707548167649321,2.469781805111213,1.153933353352379,1.0015255036615833,5.5200849297116335E-2,1.0124399162613382,0.15692234358263318,4.2993170127826295,0.25948633115948511,1.0005235798615679,4.7663828538917305E-2,14.368508909202156,-110.48441368687007,69.51558631312993,null,1000000000,741391212.25,null,17.910216812821304,-27.044886385171701,null,35.039496210336779,-77.56304367679769,null,0,0]
[27385.25,27.385249999999999,3.9420999435678548,1.3143218774955618,1.0000236852514381,6.8825553328564042E-3,1,0,24229.248613104308,1.5707550543635369,2.4816746070241407,1.1560544392203544,1.0015431047964751,5.5517980790576245E-2,1.0125826651128442,0.1578108372404145,4.3009376675106461,0.26091426928737482,1.0005296261312822,4.7938141232926133E-2,14.311488143616312,-110.5063409311653,69.493659068834702,null,1000000000,749951917.5625,null,17.901929308196085,-26.94154102635699,null,34.992811953726999,-77.657408388453433,null,0,0]
[27542,27.542000000000002,3.9632159459615286,1.3157188893335645,1.0000239571674505,6.9219490278643213E-3,1,0,24367.934026370684,1.570755289257648,2.4935784674743329,1.1581552831591035,1.0015608066553985,5.5835101105791707E-2,1.012726213092636,0.15869907972173522,4.3025670096262401,0.26234113349957366,1.000535707122082,4.8212452547154762E-2,14.254812213189037,-110.52851797648094,69.471482023519059,null,1000000000,758561764,null,17.893764552853817,-26.839354649235148,null,34.94635940624444,-77.750911058922256,null,0,0]
[27702.5,27.702500000000001,3.9848450444679648,1.3171339783818767,1.0000242371966648,6.9622851335048759E-3,1,0,24509.937272491701,1.5707555270168654,2.5057784032075681,1.1602856944906959,1.0015790363655457,5.6159796382846724E-2,1.0128740229135704,0.15960831040931989,4.3042443225366798,0.26380101574636372,1.0005419695683677,4.8493324895084532E-2,14.197133008821105,-110.5514820421142,69.448517957885798,null,1000000000,767428506.25,null,17.885529123038289,-26.735908362792642,null,34.899033445507747,-77.845771400637219,null,0,0]
[27863,27.863,4.006482036370012,1.3185337858414157,1.0000245188529189,7.0026212164897824E-3,1,0,24651.940518614087,1.570755762036941,2.5179896015626491,1.1623954521094273,1.0015973716653388,5.6484479806349817E-2,1.0130226698331515,0.16051727501436927,4.3059307224976289,0.26525976253185279,1.0005482684174034,4.8774195779680576E-2,14.13980587943546,-110.57470317740642,69.42529682259358,null,1000000000,776346769,null,17.877417298575029,-26.633644610829929,null,34.851945973229718,-77.939756089265472,null,0,0]
[28023.5,28.023499999999999,4.0281267944700838,1.3199185525243,1.0000248021362115,7.0429572766878045E-3,1,0,24793.943764737818,1.5707559943649387,2.5302118994740583,1.1644848364027907,1.0016158125489791,5.6809151308498028E-2,1.0131721534829365,0.16142597215232643,4.3076261988373847,0.26671736906553034,1.0005546036694428,4.9055065192471284E-2,14.082826174055118,-110.59817891804273,69.401821081957266,null,1000000000,785316552.25,null,17.86942659827098,-26.532547327138765,null,34.805094783870615,-78.032878921847171,null,0,0]
[28184,28.184000000000001,4.0497791942447448,1.3212885143260971,1.0000250870465413,7.0832933139677104E-3,1,0,24935.947010862878,1.5707562240468504,2.5424451368650907,1.1665541230807159,1.0016343590106349,5.7133810821503428E-2,1.0133224734926261,0.16233440044121586,4.3093307408436514,0.26817383058361688,1.0005609753247402,4.9335933124985139E-2,14.026189328622909,-110.62190678733845,69.378093212661554,null,1000000000,794337856,null,17.861554600877067,-26.432600713454946,null,34.758477698765383,-78.125153413724902,null,0,0]
[28348,28.347999999999999,4.0719115313479479,1.3226732984348366,1.0000253798505123,7.1245089294969107E-3,1,0,25081.04690098577,1.5707564560508958,2.5549562790928695,1.1686480566603348,1.0016534189627677,5.7465537682296841E-2,1.0134769350378727,0.16326235955049812,4.3110818067225871,0.26966086527466188,1.0005675235287337,4.9622924365516137E-2,13.96866690840444,-110.64640993485195,69.353590065148055,null,1000000000,803609104,null,17.853631095661953,-26.33164699857392,null,34.711083620192241,-78.218577604819018,null,0,0]
[28512,28.512,4.0940515924259797,1.3240431077073707,1.0000256743532525,7.1657245208205265E-3,1,0,25226.146791110001,1.5707566853859829,2.5674785144691703,1.1707215739812882,1.0016725891353555,5.7797251882306819E-2,1.0136322690299122,0.16419003504837398,4.3128423152250175,0.27114669449670886,1.0005741097415204,4.9909914042623439E-2,13.911493099009661,-110.67117106783776,69.328828932162239,null,1000000000,812934144,null,17.845826600000265,-26.231862170819721,null,34.663929452661563,-78.311143712807961,null,0,0]
[28676,28.675999999999998,4.1161992528425468,1.3253981786824685,1.0000259705547603,7.206940087798549E-3,1,0,25371.246681235541,1.5707569120979044,2.5800116814702911,1.1727749546165971,1.0016918695220702,5.812895334926247E-2,1.0137884750677122,0.16511742546889671,4.3146122547930936,0.27263131325426015,1.000580733963377,5.0196902147269531E-2,13.854663299461951,-110.6961875163596,69.303812483640399,null,1000000000,822312976,null,17.838138713939792,-26.133230210321038,null,34.617012956576865,-78.402865289855143,null,0,0]
[28840,28.84,4.1383543905871454,1.3267387430526707,1.0000262684550341,7.2481556302909731E-3,1,0,25516.346571362374,1.5707571362314099,2.5925556215562873,1.1748084734148143,1.0017112601165479,5.846064201090969E-2,1.0139455527482368,0.16604452934898167,4.3163916138260614,0.27411471658114722,1.0005873961945819,5.0483888670416983E-2,13.798172994959677,-110.72145660496247,69.278543395037531,null,1000000000,831745600,null,17.830565095795674,-26.035735367839923,null,34.570331920145421,-78.493755610455537,null,0,0]
[29008,29.007999999999999,4.161057525808773,1.3280971996874207,1.0000265753825879,7.2903764043823127E-3,1,0,25664.985483200926,1.570757363203785,2.6054165191722585,1.176871278264406,1.0017312379181986,5.8800407286799534E-2,1.0141073649596566,0.1669939468836131,4.3182241265698549,0.27563303505751585,1.0005942603307632,5.0777873215585204E-2,13.740652263842833,-110.74760117030669,69.252398829693306,null,1000000000,841464064,null,17.8229228494402,-25.937025476779155,null,34.522754182750177,-78.58601444390068,null,0,0]
[29176,29.175999999999998,4.1837682565180909,1.3294409105712026,1.000026884092782,7.3325971524816503E-3,1,0,25813.624395040788,1.5707575875622748,2.6182883943226694,1.1789138096549108,1.0017513313555271,5.9140158971675655E-2,1.0142700909888738,0.16794306063092831,4.3200664990875639,0.27715006763555661,1.0006011643536146,5.1071856081969548E-2,13.683478467999969,-110.77400515601042,69.225994843989582,null,1000000000,851238976,null,17.815395718841003,-25.839476240889194,null,34.475418920143333,-78.677428313350646,null,0,0]
[29344,29.344000000000001,4.2064864596914751,1.3307701097265796,1.0000271945856143,7.3748178744384822E-3,1,0,25962.263306881938,1.5707578093517744,2.6311710858988979,1.1809363482052107,1.0017715404215746,5.9479896987922345E-2,1.0144337303961299,0.16889186902757736,4.3219187187709167,0.27866580907280897,1.0006081082634404,5.136583725985551E-2,13.626647022375195,-110.80066567908112,69.199334320918879,null,1000000000,861070336,null,17.807981366321911,-25.743071580017705,null,34.428323843041298,-78.768010626762631,null,0,0]
[29512,29.512,4.2292120149086507,1.3320850263536608,1.0000275068610833,7.4170385701023108E-3,1,0,26110.902218724343,1.5707580286161562,2.6440644357981333,1.1829391697218021,1.0017918651093434,5.9819621257942789E-2,1.0145982827394833,0.16984037051341508,4.3237807729659146,0.28018025415929487,1.0006150920605466,5.1659816739528713E-2,13.570153428171242,-110.82757985756923,69.172420142430767,null,1000000000,870958144,null,17.800677511372779,-25.647795689684152,null,34.381466691145903,-78.857774515787625,null,0,0]
[29684,29.684000000000001,4.2524861483927792,1.3334166882496563,1.0000278284184885,7.4602644930281542E-3,1,0,26263.080152278573,1.5707582505298721,2.6572756502103876,1.1849695337093391,1.0018127934947423,6.0167419878991484E-2,1.0147676983317264,0.17081113578330454,4.3256973370551846,0.28172940903947369,1.00062228346199,5.1960793961134323E-2,13.512660152424052,-110.85539462960675,69.144605370393251,null,1000000000,881139856,null,17.793311907322089,-25.551404510038683,null,34.333738052524289,-78.94884118384897,null,0,0]
[29856,29.856000000000002,4.2757677408067005,1.3347338506391242,1.0000281518444247,7.5034903880747831E-3,1,0,26415.258085834081,1.5707584698867041,2.6704977105069831,1.1869798006035561,1.0018338430582328,6.0515203926891713E-2,1.0149380699062578,0.17178157605436498,4.3276241825528254,0.28327719415542524,1.0006295166733745,5.2261769382090262E-2,13.45551173265536,-110.88346917604453,69.116530823955472,null,1000000000,891380736,null,17.786057464171044,-25.456163827543691,null,34.286254100272465,-79.039076989808052,null,0,0]
[30028,30.027999999999999,4.2990566709686497,1.3360367445552062,1.0000284771388905,7.5467162550806894E-3,1,0,26567.436019390843,1.5707586867305898,2.6837304563831492,1.1889702513156011,1.0018550137921769,6.0862973318433163E-2,1.0151093969817337,0.17275168966286511,4.3295612957328649,0.28482360402219031,1.0006367916950349,5.256274299197207E-2,13.398703608881203,-110.9118004173049,69.088199582695097,null,1000000000,901680784,null,17.778911910347436,-25.362057544925797,null,34.239012500557614,-79.128495170300823,null,0,0]
[30200,30.2,4.3223528202707939,1.3373255962463868,1.0000288043018839,7.5899420938843705E-3,1,0,26719.613952948843,1.5707589011044658,2.6969737305519743,1.1909411618738328,1.0018763056888935,6.1210727970426683E-2,1.0152816790744363,0.17372147494865303,4.3315086628208093,0.28636863319067413,1.0006441085273068,5.286371478035546E-2,13.342231307214119,-110.94038528122637,69.059614718773631,null,1000000000,912040000,null,17.771873030186853,-25.269069844618688,null,34.192010949625946,-79.217108687822531,null,0,0]
[30375.75,30.37575,4.3461642159688481,1.3386282736308266,1.0000291405278683,7.6341103271998978E-3,1,0,26875.10971936183,1.5707591176444717,2.7105164534400732,1.1929351412238058,1.0018981869444517,6.1566049170948017E-2,1.015458703288258,0.17471206294740055,4.3335090643415946,0.28794591577610035,1.0006516280717914,5.3171246561313563E-2,13.284870095590096,-110.96985215169308,69.030147848306925,null,1000000000,922686188.0625,null,17.76478862520203,-25.175194055311561,null,34.144230245919623,-79.306836223878108,null,0,0]
[30551.5,30.551500000000001,4.3699829065889517,1.3399167526368936,1.0000294787047412,7.6782785307291206E-3,1,0,27030.605485776061,1.5707593316931496,2.7240698460364317,1.1949092865870106,1.0019201946872829,6.1921354806664546E-2,1.0156367235878165,0.17570230465801101,4.3355201425324852,0.2895217454141466,1.0006591912706144,5.3478776418477245E-2,13.227850331306845,-110.99957736877326,69.000422631226741,null,1000000000,933394152.25,null,17.757811090656453,-25.082453635198267,null,34.096695403487431,-79.395750144257391,null,0,0]
[30727.25,30.727250000000002,4.3938087734945235,1.3411912599275968,1.0000298188325005,7.7224467042997409E-3,1,0,27186.101252191522,1.5707595432932482,2.7376337498712675,1.1968638772696345,1.0019423289090525,6.2276644788895844E-2,1.0158157394494238,0.17669219832103691,4.3375418825440981,0.29109611640777028,1.0006667981241404,5.3786304340725961E-2,13.171167506899206,-111.02955768736847,68.970442312631533,null,1000000000,944163892.5625,null,17.75093823341313,-24.990832578581344,null,34.04940405908544,-79.48386343516691,null,0,0]
[30903,30.902999999999999,4.4176417005730082,1.3424520174583883,1.0000301609111442,7.7666148477394583E-3,1,0,27341.597018608183,1.5707597524865435,2.7512080094782294,1.1987991876696411,1.0019645896013787,6.2631919028985086E-2,1.0159957503468335,0.17768174218099572,4.3395742694760715,0.2926690230991858,1.0006744486327366,5.4093830316939311E-2,13.114817200128449,-111.05978987584521,68.940210124154788,null,1000000000,954995409,null,17.744167914544878,-24.900315160929516,null,34.002353880375736,-79.571188813090018,null,0,0]
[31083,31.082999999999998,4.4420581569118571,1.3437292373007803,1.0000305132841774,7.8118510372038605E-3,1,0,27500.852995593752,1.5707599642864181,2.7651210979454812,1.2007615942878571,1.0019875196896839,6.2995768127662305E-2,1.0161811451488094,0.17869485084263906,4.3416668243525187,0.29427844222524857,1.0006823293982439,5.4408790881118808E-2,13.05744436878274,-111.09101085961446,68.908989140385543,null,1000000000,966152889,null,17.737337983372516,-24.808736696885312,null,33.954413509560744,-79.659822187973703,null,0,0]
[31263,31.263000000000002,4.4664817803061734,1.3449924909936672,1.0000308677035843,7.8570871946966533E-3,1,0,27660.108972580547,1.5707601736473726,2.7790447283573521,1.2027043441406122,1.0020105824211945,6.3359600525471238E-2,1.0163675825669685,0.17970758886419291,4.3437705155054633,0.29588631348646777,1.0006902559564756,5.4723749380395682E-2,13.000411207167517,-111.12248922854371,68.877510771456286,null,1000000000,977375169,null,17.730611235785368,-24.718283385913097,null,33.906721254443468,-79.747655244955425,null,0,0]
[31443,31.443000000000001,4.4909124538228413,1.3462420024005677,1.0000312241693627,7.9023233200327357E-3,1,0,27819.364949568539,1.5707603806112929,2.7929787430519157,1.2046277166518329,1.0020337777867518,6.3723416127244428E-2,1.01655506202766,0.18071995437275304,4.3458853267641322,0.29749263093287698,1.0006982283078325,5.5038705802823724E-2,12.943713229294964,-111.15422156193091,68.84577843806909,null,1000000000,988662249,null,17.723985540645291,-24.628939215148336,null,33.859274707158505,-79.834700809796104,null,0,0]
[31623,31.623000000000001,4.5153500630260606,1.3474779907124463,1.0000315826815109,7.94755941302701E-3,1,0,27978.620926557705,1.5707605852191113,2.8069229873814554,1.2065319862726476,1.0020571057771452,6.4087214837841078E-2,1.0167435829544502,0.18173194549984681,4.3480112419038202,0.29909738865784541,1.0007062464527174,5.5353660136456935E-2,12.88734603429592,-111.18620445845271,68.813795541547293,null,1000000000,1000014129,null,17.717458819829719,-24.540688456593781,null,33.812071491831816,-79.920971440539162,null,0,0]
[31807,31.806999999999999,4.5403377821914015,1.3487276916897684,1.0000319512756803,7.9938007189116773E-3,1,0,28141.415925258938,1.5707607919801998,2.8211875190146198,1.2084591092954662,1.0020810892360912,6.445908040680623E-2,1.0169373690708499,0.18276603642450207,4.3501958594046037,0.30073618946352393,1.0007144901103084,5.5675611283906502E-2,12.830063630241966,-111.21915354282437,68.780846457175628,null,1000000000,1011685249,null,17.71088724875105,-24.451590614867637,null,33.764068378401376,-80.008371042584827,null,0,0]
[31991,31.991,4.5653325146123986,1.3499637106077043,1.0000323220081748,8.0400419906100223E-3,1,0,28304.210923961367,1.5707609963628668,2.8354624225423781,1.2103668354575894,1.002105211260176,6.4830928124578246E-2,1.0171322422281179,0.18379973220961285,4.3523920453211593,0.30237334811395827,1.0007227816201687,5.5997560223451995E-2,12.773117837855798,-111.25235732883908,68.747642671160918,null,1000000000,1023424081,null,17.70441487138757,-24.363602972324884,null,33.716314611565167,-80.094986595826896,null,0,0]
[32175,32.174999999999997,4.5903341457258584,1.3511862672198141,1.0000326948789922,8.0862832279243266E-3,1,0,28467.005922664961,1.5707611984079168,2.849747542100618,1.2122554424635297,1.0021294718393934,6.5202757889618657E-2,1.0173282018015735,0.18483303087382444,4.3545997821517357,0.30400885844051789,1.0007311209827368,5.6319506942333827E-2,12.716504219036498,-111.28581225203912,68.714187747960878,null,1000000000,1035230625,null,17.698039629890491,-24.276709614189169,null,33.668807753977063,-80.180830690497132,null,0,0]
[32359,32.359000000000002,4.6153425634196932,1.3523955766796336,1.0000330698881299,8.132524430656882E-3,1,0,28629.800921369704,1.5707613981552266,2.8640427248244267,1.2141252030249416,1.0021538709636808,6.5574569600418617E-2,1.0175252471635361,0.18586593044069633,4.356819052338099,0.30564271432200274,1.0007395081984529,5.6641451427792644E-2,12.660218420011645,-111.31951477285901,68.680485227140991,null,1000000000,1047104881,null,17.691759517824913,-24.190894911702394,null,33.621545401094664,-80.265915653265381,null,0,0]
[32547.5,32.547499999999999,4.6409695229026493,1.3536209447750025,1.0000334562860878,8.1798964963018979E-3,1,0,28796.577319500462,1.5707616004456815,2.8786977966063638,1.2160214279292827,1.0021790104641013,6.5955455704361204E-2,1.0177282368554696,0.18692367521972997,4.3591045396428303,0.30731480665313776,1.0007481501596971,5.6971267226196443E-2,12.602891544913259,-111.35429462143404,68.645705378565964,null,1000000000,1059339756.25,null,17.685422418633831,-24.104083984197242,null,33.573378243038505,-80.352306907415709,null,0,0]
[32736,32.735999999999997,4.6666033743840396,1.3548328526749824,1.0000338449282316,8.2272685252329034E-3,1,0,28963.353717632388,1.5707618004064836,2.893363114355429,1.2178984370918506,1.0022042953475583,6.6336322644598184E-2,1.0179323647513265,0.18798099695821749,4.361402093848338,0.30898514977273112,1.000756842344299,5.7301080653488906E-2,12.545899732563754,-111.38932688929513,68.610673110704866,null,1000000000,1071645696,null,17.679181054767078,-24.018372806118446,null,33.525462689804264,-80.437926815426835,null,0,0]
[32924.5,32.924500000000002,4.6922440049103651,1.3560315174487154,1.0000342358145586,8.2746405172373291E-3,1,0,29130.130115765453,1.5707619980776468,2.9080385230595502,1.2197565081022401,1.0022297256030477,6.671717031208739E-2,1.0181376301665064,0.18903789354729919,4.3637116958959812,0.31065373725438472,1.0007655847527401,5.7630891695952209E-2,12.48923856412045,-111.42460785677024,68.575392143229763,null,1000000000,1084022700.25,null,17.673033427123976,-23.933745468798744,null,33.47779625980089,-80.522787813670689,null,0,0]
[33113,33.113,4.7178913039540777,1.3572171515993381,1.0000346289450666,8.3220124721026002E-3,1,0,29296.906513899645,1.570762193498273,2.9227238707144068,1.2215959134998364,1.0022553012195043,6.7097998597819994E-2,1.0183440324131472,0.19009436288361006,4.3660333266676163,0.31232056272401859,1.0007743773855051,5.7960700339868762E-2,12.432903704986813,-111.46013383456268,68.539866165437317,null,1000000000,1096470769,null,17.666977586864768,-23.850186352876193,null,33.430376505312779,-80.606902076906351,null,0,0]
[33305.75,33.305750000000003,4.7441236408116305,1.3584162596634719,1.0000350332599053,8.3704524562896732E-3,1,0,29467.443122602996,1.5707623910375244,2.9377504426933054,1.2234577680468113,1.002281603776902,6.7487393041985339E-2,1.01855626313892,0.19117420782384317,4.3684197205081592,0.31402314050281127,1.0007834201968191,5.8297942493127544E-2,12.375631694566289,-111.49671034344817,68.503289656551829,null,1000000000,1109272983.0625,null,17.660878144734784,-23.765831921552813,null,33.382140170627018,-80.692153053660761,null,0,0]
[33498.5,33.4985,4.7703627240278985,1.359602178178666,1.0000354399212565,8.4188924011944621E-3,1,0,29637.979731307481,1.5707625863034982,2.9527870947217827,1.2253006664644708,1.0023080583002981,6.7876766990141474E-2,1.0187696810719449,0.19225360159759813,4.3708186509786042,0.31572386260746088,1.0007925155237789,5.8635182109454197E-2,12.318691967761737,-111.53353533300134,68.466464666998661,null,1000000000,1122149502.25,null,17.654870708771814,-23.682562291852314,null,33.33415668983092,-80.776648181821599,null,0,0]
[33691.25,33.691249999999997,4.7966084428882363,1.3607751202902219,1.0000358489291172,8.4673323065896991E-3,1,0,29808.516340013088,1.5707627793352115,2.967833673586878,1.2271248844550844,1.0023346647776605,6.8266120325848376E-2,1.018984285466269,0.19333254197396407,4.3732300974497536,0.31742272239271624,1.0008016633669123,5.8972419174183027E-2,12.26208015035281,-111.57060496078564,68.429395039214356,null,1000000000,1135100326.5625,null,17.648953348885708,-23.600361662762218,null,33.286423552213861,-80.86039967288778,null,0,0]
[33884,33.884,4.8228606890603132,1.3619352946471797,1.0000362602834845,8.515772172248106E-3,1,0,29979.052948719789,1.5707629701707932,2.9828900290669025,1.2289306926572503,1.0023614231968889,6.8655452932703323E-2,1.0192000755724231,0.19441102672812638,4.3756540392303789,0.31911971327055083,1.000810863726749,5.9309653672648635E-2,12.205791951626374,-111.60791541975539,68.392084580244614,null,1000000000,1148125456,null,17.643124183719046,-23.51921452334831,null,33.238938281733418,-80.943419480741525,null,0,0]
[34081.5,34.081499999999998,4.8497665374681036,1.363111029555639,1.0000366842089439,8.5654057155788374E-3,1,0,30153.792145709616,1.570763163470186,2.9983274100876125,1.2307621838914431,1.0023889986242194,6.905435836463579E-2,1.0194224125775015,0.19551561400472525,4.3781506542742168,0.32085657824973118,1.0008203452884872,5.9655196071656494E-2,12.148447902845678,-111.64639119524875,68.353608804751246,null,1000000000,1161548642.25,null,17.637240932434054,-23.437144478234035,null,33.190537367778482,-81.027738457469638,null,0,0]
[34279,34.279000000000003,4.8766790159815576,1.3642737892171843,1.0000371105979802,8.6150392167070166E-3,1,0,30328.531342700557,1.5707633545421726,3.013774745524473,1.2325749062545301,1.0024167335484537,6.9453241786160719E-2,1.019645992849852,0.19661971821685403,4.3806603438887439,0.32259146725463383,1.0008298819883303,6.0000735745187404E-2,12.091434758902516,-111.68511184106077,68.314888158939226,null,1000000000,1175049841,null,17.631446427813788,-23.356148421497153,null,33.142391533928347,-81.111313853570294,null,0,0]
[34476.5,34.476500000000001,4.9035980154363994,1.3654237841499222,1.00003753945059,8.6646726753881499E-3,1,0,30503.270539692592,1.5707635434250322,3.0292318830921454,1.2343691350549182,1.0024446279563535,6.9852103072179192E-2,1.0198708155718124,0.19772333699119182,4.3831830856173779,0.3243243733850048,1.0008394738268589,6.0346272677465743E-2,12.034748163748105,-111.72407337974231,68.275926620257692,null,1000000000,1188629052.25,null,17.625738795869818,-23.276210574153456,null,33.094498226058832,-81.19415772995265,null,0,0]
[34674,34.673999999999999,4.9305234290261915,1.3665612204101578,1.0000379707667708,8.7143060913777524E-3,1,0,30678.009736685701,1.5707637301561721,3.0446986735020829,1.2361451404884696,1.0024726818346053,7.0250942097634411E-2,1.0200968799218986,0.19882646796123427,4.3857188569385475,0.32605528980363296,1.0008491208046562,6.0691806852716239E-2,11.97838384476025,-111.76327187430289,68.236728125697113,null,1000000000,1202286276,null,17.620116210219045,-23.197315450098426,null,33.046854925765132,-81.276281891883499,null,0,0]
[34875.75,34.875749999999996,4.9580347642384153,1.3677103759296878,1.0000384139080969,8.7650075238840854E-3,1,0,30856.509144248113,1.5707639187219191,3.060508108046494,1.2379408237047633,1.0025015040447209,7.0658340620770907E-2,1.0203290900830932,0.19995283107602285,4.3883226251878718,0.32782139234922869,1.0008590323081041,6.1044773710446559E-2,11.921135018002643,-111.80355448849454,68.196445511505459,null,1000000000,1216317938.0625,null,17.614458592366191,-23.117783400348475,null,32.998441943002234,-81.359442186409808,null,0,0]
[35077.5,35.077500000000001,4.9855525745605229,1.36884684738406,1.0000388596201546,8.8157089113260322E-3,1,0,31035.008551811603,1.5707641051185757,3.0763273096840886,1.2397180449482124,1.0025304926339937,7.1065715651319625E-2,1.0205625941395162,0.2010786801963329,4.3909399421186164,0.32958540440680806,1.0008690013506778,6.1397737657939142E-2,11.864213731421918,-111.84407619151692,68.155923808483081,null,1000000000,1230431006.25,null,17.608886013604522,-23.039307673419383,null,32.950284642331809,-81.441875573372357,null,0,0]
[35279.25,35.279249999999998,5.0130767533628848,1.369970840737857,1.0000393079029406,8.8664102534429783E-3,1,0,31213.507959376166,1.5707642893833544,3.092156128512074,1.2414770764268959,1.002559647587991,7.1473067056112949E-2,1.0207973912032442,0.20220401282176223,4.3935707835193085,0.33134731889183472,1.00087902793301,6.1750698678379262E-2,11.807615687295357,-111.88483291879953,68.115167081200468,null,1000000000,1244625480.5625,null,17.603396671926991,-22.961872667439199,null,32.902380450808458,-81.523593852723963,null,0,0]
[35481,35.481000000000002,{"$f":"SQRT(1+(A397/pole1)^2)","v":5.0406071963204555},{"$f":"ATAN(A397/pole1)","v":1.3710825575836505},{"$f":"SQRT(1+(A397/Zero1)^2)","v":1.0000397587564516},{"$f":"ATAN(A397/Zero1)","v":8.9171115499743214E-3},{"$f":"IF(VIN_nom>Vout, 1, SQRT(1+(A397/z_RHP)^2))","v":1},{"$f":"IF(VIN_nom>Vout, 0, -ATAN(A397/z_RHP))","v":0},{"$f":"SQRT(1+(A397/Pole2)^2)","v":31392.007366941772},{"$f":"ATAN(A397/Pole2)","v":1.5707644715526217},3.1079944175912289,1.2432181852555546,{"$f":"SQRT(1+(A397/pole4)^2)","v":1.0025889688921992},{"$f":"ATAN(A397/pole4)","v":7.1880394702030004E-2},{"$f":"IF(VOUT_setting=1,1,SQRT(1+(A397*zterm1)^2))","v":1.0210334803822569},{"$f":"IF(VOUT_setting=1,0,ATAN(((A397*zterm1))))","v":0.20332882645943501},4.3962151251114703,{"$f":"IF(VOUT_setting=1,0,ATAN(A397*$Q$4/(1+Afbr-$Q$5*(A397)^2)))","v":0.33310712878830939},{"$f":"SQRT((1-(Z397/pterm2))^2+(A397/pterm1)^2)","v":1.0008891120557373},{"$f":"IF((ATAN((A397/pterm1)/(1-A397^2/pterm2))>0),ATAN((A397/pterm1)/(1-A397^2/pterm2)),PI()+ATAN((A397/pterm1)/(1-A397^2/pterm2)))","v":6.2103656754952524E-2},{"$f":"20*LOG10(((E397*K397*G397*O397)/(C397*I397*S397*M397*Q397))*Adc)","v":11.751336670211984},{"$f":"((F397+L397+H397+P397)-(D397+J397+T397+N397+R397))*radconv","v":-111.92582065055059},{"$f":"IF(V397>0,V397,V397+180)","v":68.074179349449409},null,{"$f":"IF(U397<0,A397,1000000000)","v":1000000000},{"$f":"A397^2","v":1258901361},null,{"$f":"20*LOG10((K397/(I397*M397))*AEA)","v":17.597988811236519},{"$f":"(L397-(J397+N397))*radconv","v":-22.885463072316991},null,{"$f":"20*LOG10((E397*G397/(C397*S397))*Acs*Am)","v":32.854726831794331},{"$f":"(F397+H397-(D397+T397))*radconv","v":-81.604608573919691},null,{"$f":"SUM((U398<0)*(U397>0))*A397","v":0},0]
[35687.75,{"$f":"A398/1000","v":35.687750000000001},5.0688263224840213,1.3722092960129995,1.0000402234506083,8.969069336647156E-3,1,0,31574.930551647623,1.5707646560997377,3.1242349038760451,1.2449841239915005,1.0026191894406664,7.2297792420456142E-2,1.0212767602029313,0.20448097547926056,4.3989389825484295,0.33490836157357273,1.0008995057925485,6.2465359171787922E-2,11.693989541686493,-111.9680596925277,68.031940307472297,null,1000000000,1273615500.0625,null,17.592529671680921,-22.808207937195423,null,32.806149554635319,-81.686912990665803,null,0,0]
[35894.5,35.894500000000001,5.0970518124642092,1.3733235569657705,1.0000406908444825,9.0210270748927301E-3,1,0,31757.853736354533,1.5707648385208945,3.1404850324245035,1.2467317927807924,1.0026495846557588,7.2715164904859075E-2,1.021521395067972,0.20563257419179137,{"$f":"IF(VOUT_setting=1,1,SQRT((1+Afbr-$Q$5*(A399)^2)^2+(A399*$Q$4)^2))","v":4.4016769657860815},0.33670736946278007,1.0009099599585252,6.2827058461279006E-2,11.636968742019462,-112.01053292770442,67.989467072295582,null,1000000000,1288415130.25,null,17.587152509684305,-22.73199802529874,null,32.757830144197129,-81.768502324255238,null,0,0]
[36101.25,36.10125,5.1252835611223473,1.3744255438421178,1.0000411609380706,9.0729847644305806E-3,1,0,31940.77692106249,1.5707650188526185,3.1567446543287523,1.248461463176362,1.002680154521592,7.3132512012127893E-2,1.0217673840040913,0.20678361993894454,4.404429048482994,0.33850414512900467,1.0009204745543638,6.3188754605331215E-2,11.58026999064818,-112.05323617658175,67.946763823418252,null,1000000000,1303300251.5625,null,17.581855576530273,-22.656817771683155,null,32.709765985136769,-81.849388227637746,null,0,0]
[36308,36.308,5.1535214656005586,1.3755154557049312,1.0000416337313689,9.124942404980246E-3,1,0,32123.700105771477,1.5707651971306029,3.1730136236470563,1.2501734015974839,1.0027108990221922,7.3549833599204431E-2,1.0220147260335541,0.20793411007105028,4.4071952042280511,0.34029868132070257,1.0009310495807653,6.3550447585850406E-2,11.523889089243616,-112.09616530908291,67.903834690917094,null,1000000000,1318270864,null,17.57663716831787,-22.582651905497109,null,32.661954499444256,-81.929582105256145,null,0,0]
[36519.5,36.519500000000001,5.1824143895058805,1.3766181166602043,1.0000421201803629,9.1780937009211198E-3,1,0,32310.825878763811,1.5707653774157655,3.189665889021831,1.2519065959188427,1.002742530547966,7.3976716430236192E-2,1.0222691497054908,0.20911045459874783,4.4100394454511678,0.34213212155220402,1.0009419300940416,6.3920447028201641E-2,11.466537453087867,-112.14031019465808,67.859689805341915,null,1000000000,1333673880.25,null,17.571378390015454,-22.507816099865344,null,32.613303361814857,-82.010913985855936,null,0,0]
[36731,36.731000000000002,5.2113135446333017,1.3777085493943337,1.0000426094545336,9.2312449450032506E-3,1,0,32497.951651757186,1.5707655556247357,3.2063276364911384,1.2536217821882032,1.0027743447909125,7.4403572252289149E-2,1.0225249872745212,0.21028621210578316,4.412898357665223,0.34396320311475764,1.0009528738480107,6.4290443121684138E-2,11.40950980667453,-112.18468287681597,67.81531712318403,null,1000000000,1349166361,null,17.566198316941808,-22.434010413153942,null,32.564911300237796,-82.09154505208771,null,0,0]
[36942.5,36.942500000000003,5.2402188278895778,1.3787869536467465,1.0000431015538767,9.2843961369264063E-3,1,0,32685.077424751584,1.5707657317931727,3.2229987189978968,1.2553192296768581,1.0028063417336412,7.4830400912390085E-2,1.0227822376796341,0.21146137978314322,4.4157719123771999,0.34579191848987778,1.0009638808434358,6.4660435846929043E-2,11.352801909841045,-112.22927909402698,67.770720905973022,null,1000000000,1364748306.25,null,17.561095261979609,-22.361219410532694,null,32.516775671945375,-82.171486747085041,null,0,0]
[37154,37.154000000000003,5.2691301384220299,1.379853524886359,1.000043596478388,9.3375472763903549E-3,1,0,32872.203197746981,1.570765905955924,3.2396789924304437,1.256999202524028,1.0028385213586644,7.5257202257624736E-2,1.0230408998550282,0.21263595483114903,4.4186600810224599,0.34761826024131243,1.0009749510810841,6.5030425184567933E-2,11.29640960397747,-112.27409463825927,67.725905361740729,null,1000000000,1380419716,null,17.556067581420361,-22.2894279511743,null,32.468893872240855,-82.250750269299417,null,0,0]
[37370.25,37.370249999999999,5.2986968864175203,1.3809320144871677,1.0000441054392755,9.391892063015609E-3,1,0,33063.531559025803,1.5707660819918463,3.2567432376921679,1.2586991074194374,1.0028716125581798,7.569356057469899E-2,1.0233068297989554,0.2138362935743664,4.4216281940785391,0.34948315727932439,1.0009863353305681,6.5408720452659191E-2,11.239072857806276,-112.32013912153691,67.679860878463089,null,1000000000,1396535585.0625,null,17.55100325054282,-22.217042151050169,null,32.420196482440375,-82.331104167125559,null,0,0]
[37586.5,37.586500000000001,5.3282697291354149,1.3819985336996248,1.0000446173536461,9.4462367941640906E-3,1,0,33254.859920305636,1.57076625600216,{"$f":"SQRT(1+(A407/Zero2)^2)","v":3.2738167957670452},{"$f":"ATAN(A407/Zero2)","v":1.2603812864988784},1.0029048947004333,7.6129890013101206E-2,1.0235742333694178,0.21503600688059377,4.4246115242379052,0.35134555741979107,1.000997785696478,6.5787012138324233E-2,11.182057497026234,-112.36640416697108,67.63359583302892,null,1000000000,1412744982.25,null,17.546014375655091,-22.145670194685771,null,32.371759062275288,-82.410772010139894,null,0,0]
[37802.75,37.802750000000003,5.3578485656555781,1.3830532783303431,1.0000451322214952,9.5005814695148846E-3,1,0,33446.188281586466,1.5707664280216274,3.2908995217073023,1.2620460062060783,1.0029383677664159,7.6566190409574908E-2,1.0238431094117857,0.21623509178771394,4.4276100407432457,0.35320545298011852,1.0010093021796482,6.6165300220861589E-2,11.125359328154932,-112.41288544835986,67.587114551640141,null,1000000000,1429047907.5625,null,17.541099332170059,-22.075296808617853,null,32.323578946665251,-82.489765016067295,null,0,0]
[38019,38.018999999999998,5.3874332972539873,1.3840964399910038,1.0000456500428183,9.5549260887470861E-3,1,0,33637.516642868279,1.5707665980842203,3.307991273482219,1.2636935278696395,1.0029720317370117,7.7002461600929634E-2,1.0241134567662882,0.21743354534394027,4.4306237127641594,0.35506283636713243,1.0010208847809177,6.6543584679570403E-2,11.068974238410615,-112.45957869671464,67.540421303285356,null,1000000000,1445444361,null,17.536256537439762,-22.005907012416735,null,32.275653509234175,-82.568094162280659,null,0,0]
[38240.5,38.240499999999997,5.4177422814533438,1.385153114731795,1.0000461834974201,9.6105899986025731E-3,1,0,33833.489970147515,1.5707667702814827,3.3255071812565848,1.2653634856298301,1.0030067108759948,7.744929389947354E-2,1.0243918915748116,0.21866043670206092,4.4337262286684931,0.3569627000596417,1.0010328171245224,6.6931049144329402E-2,11.011540619127338,-112.50762088506958,67.492379114930415,null,1000000000,1462335840.25,null,17.531369461766882,-21.935836951745696,null,32.22682588684475,-82.647647936773055,null,0,{"$f":"IF(AH410>0,W410,0)","v":0}]
[38462,38.462000000000003,5.4480572475842033,1.3861980311856346,1.0000467200506324,9.6662538489000228E-3,1,0,34029.463297427748,1.5707669404954008,3.3430322658706308,1.2670159392123599,1.0030415902605274,7.7896095211269445E-2,1.0246718675225774,0.21988665944645619,4.4368445791899633,0.35885991228072323,1.0010448188373524,6.7318509763207149E-2,10.954426981508439,-112.55587657334677,67.444123426653235,null,1000000000,1479325444,null,17.526554953715831,-21.866767917532485,null,32.17826000229028,-82.726527794107696,null,0,0]
[38683.5,38.683500000000002,5.4783780963423307,1.3872313822852336,1.0000472597024503,9.7219176392945913E-3,1,0,34225.436624708957,1.5707671087600441,3.3605663837549069,1.2686511535113694,1.0030766698697202,7.8342865361167968E-2,1.0249533833466546,0.22111221043900653,4.4399787309678338,0.3607544651615287,1.0010568899203247,6.7705966513959812E-2,10.897629156457123,-112.60434135807118,67.395658641928819,null,1000000000,1496413172.25,null,17.521811441203766,-21.798684724377516,null,32.129953154983561,-82.804744787259978,null,0,0]
[38905,38.905000000000001,5.5087047305907788,1.3882533568147934,1.0000478024528692,9.7775813694414258E-3,1,0,34421.409951991125,1.5707672751087067,3.3781093942475207,1.2702693882915039,1.0031119496825673,7.8789604174093947E-2,1.0252364377785566,0.2223370865531013,4.4431286505666945,0.36264635093101338,1.0010690303743623,6.8093419374344114E-2,10.841143055286809,-112.65301089687831,67.346989103121686,null,1000000000,1513599025,null,17.517137392931946,-21.731572480739473,null,32.081902683925236,-82.882309731513175,null,0,0]
[39131.5,39.131500000000003,5.5397218228399572,1.3892868285291871,1.0000483606592938,9.8345015545364348E-3,1,0,34621.807056413818,1.5707674432649725,3.3960574618860724,1.2719068586992071,1.0031482328910095,7.9246394796243125E-2,1.0255274714707561,0.22358891109355411,4.4463659452699247,0.36457817683186355,1.0010815166178944,6.8489614302696136E-2,10.783700053300183,-112.70298634928996,67.297013650710042,null,1000000000,1531274292.25,null,17.512428115639473,-21.663934146637867,null,32.0330299428324,-82.960962309967954,null,0,0]
[39358,39.357999999999997,5.5707447659742373,1.3903087907153453,1.0000489221057791,9.8914216759037124E-3,1,0,34822.204160837471,1.570767609485805,3.4140145396486545,1.2735271078373114,1.0031847253988608,7.9703152280659856E-2,1.0258201113174887,0.22484002336756476,4.4496196567483999,0.36650719772813095,1.0010940754016844,6.8885805116019203E-2,10.726574609027882,-112.75316691364569,67.246833086354314,null,1000000000,1549052164,null,17.507788360715882,-21.597280509058876,null,31.984419778978786,-83.038955208907481,null,0,0]
[39584.5,39.584499999999998,5.6017734627860083,1.391319432477401,1.0000494867923193,9.9483417331745327E-3,1,0,35022.601265262085,1.5707677738044274,3.4319804861048344,1.2751303975843586,1.0032214271832809,8.015987644038651E-2,1.0261143559445667,0.22609042006952715,4.452889749018194,0.36843340562665278,1.0011067067267361,6.928199179053128E-2,10.669762598777776,-112.803548141552,67.196451858448,null,1000000000,1566932640.25,null,17.503216615149803,-21.531596554658975,null,31.936069470811997,-83.116299261858899,null,0,0]
[39811,39.811,5.6328078181917238,1.3923189388456212,1.0000500547189093,1.0005261725980175E-2,1,0,35222.99836968763,1.5707679362533067,3.449955162701098,1.2767169847140298,1.0032583382213025,8.0616567088548349E-2,1.0264102039718452,0.22734009790656579,4.456176186020115,0.37035679264039095,1.0011194105940584,6.967817430245106E-2,10.613259978430847,-112.85412564899958,67.145874351000415,null,1000000000,1584915721,null,17.498711405304604,-21.466867562543008,null,31.887976336963128,-83.193005068934227,null,0,0]
[40042.75,40.042749999999998,5.664567272807,1.3933302758698107,1.0000506391629254,1.0063500989258985E-2,1,0,35428.040440110752,1.5707681005653984,3.4683553653179886,1.2783233218114276,1.003296321374282,8.1083808401001767E-2,1.0267145675362546,0.2286179943133177,4.4595556784257999,0.37232183363730437,1.0011324840068627,7.0083535519486068E-2,10.555763787910637,-112.90607413351933,67.093925866480674,null,1000000000,1603421827.5625,null,17.494169139971682,-21.401611595919363,null,31.839031891108448,-83.270839035101119,null,0,0]
[40274.5,40.274500000000003,5.6963324565478262,1.3943303346126243,1.0000512269989212,1.012174018426857E-2,1,0,35633.082510534805,1.5707682629865007,3.4867644229288524,1.2799127010295099,1.0033345235447282,8.1551014234826399E-2,1.0270206067499292,0.22989513121053698,4.4629522054379667,0.37428390509845016,1.0011456333659541,7.048889232835634E-2,10.498583177157121,-112.95821902007555,67.041780979924454,null,1000000000,1622035350.25,null,17.4896935303791,-21.337325103089697,null,31.790351126074036,-83.34802655468657,null,0,0]
[40506.25,40.506250000000001,5.7281032741016418,1.3953193007212152,1.0000518182268905,1.0179979310613974E-2,1,0,35838.124580959804,1.5707684235490704,3.5051821960156144,1.2814853815869756,1.0033729447076249,8.2018184390121804E-2,1.0273283201153505,0.23117150511264073,4.4663657281972213,0.37624299891902341,1.0011588586724325,7.0894244703590306E-2,10.441714060357764,-113.01055581763676,66.989444182363243,null,1000000000,1640756289.0625,null,17.485283118293729,-21.273993222322755,null,31.741931295498635,-83.424578263052169,null,0,0]
[40738,40.738,5.7598796322421046,1.3962973558338789,1.0000524128468276,1.0238218367900252E-2,1,0,36043.166651385698,1.5707685822848263,3.5236085479118557,1.2830416176145638,1.003411584837816,8.248531866708031E-2,1.0276377061286068,0.23244711254815356,4.469796207768729,0.37819910710948879,1.0011721599274033,7.1299592619717078E-2,10.38515243062106,-113.06308010275848,66.936919897241523,null,1000000000,1659584644,null,17.480936483567771,-21.211601383368947,null,31.693769693869779,-83.500504565868908,null,0,0]
[40975.25,40.975250000000003,5.7924157660405031,1.3972875056704515,1.0000530250922306,1.0297839509936539E-2,1,0,36253.074876666222,1.5707687429277757,3.5424809495080707,1.2846180125167681,1.0034513687912503,8.2963501820229657E-2,1.0279561657223442,0.23375219572200626,4.4733256255947502,0.3801985376031729,1.0011858555287234,7.1714555797544363E-2,10.327562870824888,-113.11704058534875,66.882959414651253,null,1000000000,1678971112.5625,null,17.476551314197085,-21.148687689227533,null,31.644729810080744,-83.577595571612576,null,0,0]
[41212.5,41.212499999999999,5.8249575152607429,1.3982665933017164,1.0000536408924983,1.0357460578759269E-2,1,0,36462.98310194767,1.5707689017211628,3.5613620609314101,1.2861776962581966,1.003491382174776,8.3441646948393663E-2,1.0282763750880617,0.23505646829998642,4.4768727318250701,0.38219482249603237,1.0011996307285691,7.2129514248082158E-2,10.270287312882038,-113.17118839201514,66.828811607984861,null,1000000000,1698470156.25,null,17.472230090540759,-21.086729189427142,null,31.595954947180012,-83.654052493020401,null,0,0]
[41449.75,41.449750000000002,5.8575047863122967,1.3992348012364162,1.0000542602476241,1.0417081573944708E-2,1,0,36672.891327230027,1.5707690586967475,3.5802517443832849,1.2877209256981152,1.0035316249609487,8.3919753837504191E-2,1.028598332591613,0.2363599266037392,4.4804374844523576,0.38418795358961105,1.0012134855281472,7.2544467944005139E-2,10.21332170231107,-113.22551899181687,66.77448100818313,null,1000000000,1718081775.0625,null,17.467971405440792,-21.025711156570402,null,31.547442330507462,-83.729885785531664,null,0,0]
[41687,41.686999999999998,5.8900574876575842,1.400192308031216,1.0000548831576017,1.0476702495069129E-2,1,0,36882.799552513279,1.570769213885566,3.5991498648960696,1.2892479526181877,1.0035720971221718,8.4397822273597281E-2,1.0289220365919816,0.23766256697056873,4.4840198413942165,0.38617792281074736,1.0012274199286715,7.2959416857988721E-2,10.156662063060706,-113.28002792454714,66.719972075452858,null,1000000000,1737805969,null,17.463773888636894,-20.9656191541496,null,31.499189226981819,-83.805105678148436,null,0,0]
[41929.75,41.929749999999999,5.9233703625993481,1.4011611181088426,1.0000555241874776,1.0537705489005469E-2,1,0,37097.573932651205,1.5707693708542754,3.6184946820866655,1.2907938666576897,1.0036137449049645,8.4886933410679044E-2,1.0292550507736928,0.2389945551304021,4.4877034228365824,0.38821074312886727,1.0012417597522176,7.3383980262991783E-2,10.099001549491113,-113.33598050273659,66.664019497263411,null,1000000000,1758103935.0625,null,17.459540983787253,-20.905077801639123,null,31.450083304794983,-83.88144488398558,null,0,0]
[42172.5,42.172499999999999,5.9566887349871713,1.4021190911179855,1.0000561689389207,1.0598708404509705E-2,1,0,37312.34831279004,1.5707695260159229,3.6378480549550534,1.2923233357766479,1.0036556327620172,8.537600383836437E-2,1.029589889868785,0.24032567928293358,4.4914053449054556,0.39024023657693885,1.0012561829127478,7.3808538603900076E-2,10.041653179506298,-113.39211055386946,66.607889446130542,null,1000000000,1778519756.25,null,17.455369327260339,-20.845476237657699,null,31.401243408499681,-83.957162885878162,null,0,0]
[42415.25,42.41525,5.9900125130853743,1.4030664061526246,1.0000568174119235,1.0659711241127962E-2,1,0,37527.12269292977,1.5707696794015353,3.657209847675376,1.2938366139472843,1.0036977606632727,8.5865033327803389E-2,1.0299265520973668,0.24165593555594878,4.4951255622921202,0.39226639491216014,1.0012706894115846,7.423309185144697E-2,9.984612936588702,-113.44841352433696,66.551586475663044,null,1000000000,1799053432.5625,null,17.451257563915526,-20.786799899334437,null,31.352666740572019,-84.032269943504545,null,0,0]
[42658,42.658000000000001,6.0233416071736485,1.4040032384202854,1.0000574696064792,1.0720713998406368E-2,1,0,37741.897073070373,1.5707698310414324,3.6765799272244766,1.295333950089729,1.0037401285785061,8.635402165026293E-2,1.0302650356721896,0.24298532009456719,4.4988640296141762,0.39428921002742462,1.0012852792500579,7.4657639976366721E-2,9.9278768819831438,-113.50488493406442,66.495115065935579,null,1000000000,1819704964,null,17.44720437426373,-20.729034513228171,null,31.304350545684557,-84.106776093865705,null,0,0]
[42906.5,42.906500000000001,6.0574655796229315,1.4049515821379632,1.0000581411043328,1.0783161640504009E-2,1,0,37961.758796922702,1.5707699844959144,3.6964172718938015,1.2968504952798121,1.0037837486365566,8.6854549720461319E-2,1.0306134215773746,0.24434528670112102,4.5027099057436795,0.39635646813850151,1.0013003010023804,7.5092239002429617E-2,9.8701079741449753,-113.56286384782887,66.437136152171135,null,1000000000,1840967742.25,null,17.44311450704236,-20.670829812573395,null,31.255156856668993,-84.182434890143995,null,0,0]
[43155,43.155000000000001,6.0915949388509238,1.4058893001265775,1.000058816502116,1.0845609198496141E-2,1,0,38181.620520775912,1.5707701361831186,3.7162630272154025,1.2983508464439666,1.0038276201490006,8.735503416564909E-2,1.030963712321231,0.24570433166757699,4.5065748101482264,0.39842020601373374,1.0013154100920625,7.5526832598251964E-2,9.8126497243968398,-113.6210100058365,66.378989994163504,null,1000000000,1862354025,null,17.439083332739017,-20.613550360472157,null,31.206230415251536,-84.257484570681044,null,0,0]
[43403.5,43.403500000000001,6.1257295948206911,1.4068165683536598,1.0000594957998208,1.090805667189588E-2,1,0,38401.482244630002,1.5707702861333996,3.7361170591604931,1.2998352549422243,1.0038717430828707,8.7855474740834896E-2,1.0313159059627992,0.24706245091529866,4.5104586939176521,0.40048041539513907,1.0013306065205558,7.596142073244172E-2,9.7554981482594307,-113.67931883488781,66.320681165112191,null,1000000000,1883863812.25,null,17.435109544862037,-20.557181742757717,null,31.157568397818935,-84.331935215902973,null,0,0]
[43652,43.652000000000001,6.1598694594772194,1.4077335589584714,1.000060178997439,1.0970504060216348E-2,1,0,38621.343968484944,1.5707704343764213,3.7559792364788724,1.3013039671020692,1.0039161174050164,8.8355871201158301E-2,1.0316700005532342,0.2484196403848635,4.5143615080703494,0.40253708817175649,1.00134589028932,7.6396003373607801E-2,9.6986493384942403,-113.73778583807417,66.262214161925826,null,1000000000,1905497104,null,17.431191871417703,-20.501709833574974,null,31.109168023632531,-84.405796686892316,null,0,0]
[43906,43.905999999999999,6.1947702280538595,1.4086603990906621,1.000060881346466,1.1034333495460458E-2,1,0,38846.071847194682,1.5707705841662971,3.776289303314091,1.3027892159842311,1.0039617336160493,8.8867296989623576E-2,1.0320338947346341,0.2498059031733996,4.5183702148434239,0.40463561769482398,1.0013616025934504,7.6840198834642978E-2,9.6408512088504423,-113.7977057407912,66.202294259208799,null,1000000000,1927736836,null,17.427244190785835,-20.445922462577734,null,31.059963956549058,-84.480694082783785,null,0,0]
[44160,44.16,6.2296762585117937,1.4095768534887672,1.0000615877699321,1.1098162840788951E-2,1,0,39070.799725905279,1.5707707322330466,3.796607611370812,1.3042585708635803,1.0040076123957347,8.9378676171966293E-2,1.0323997708005386,0.2511911860566568,4.5223985955391983,0.4067304356628838,1.0013774061499157,7.7284388490497125E-2,9.5833613802017954,-113.8577816355358,66.142218364464199,null,1000000000,1950105600,null,17.423352554452734,-20.39104298180029,null,31.011027501496994,-84.554996092483719,null,0,0]
[44414,44.414000000000001,6.2645874628940481,1.4104830942327526,1.0000622982678284,1.1161992095681918E-2,1,0,39295.527604616727,1.5707708786062333,3.8169340290399956,1.305712279266489,1.0040537537080789,8.9890008487133452E-2,1.0327676266445951,0.25257548476217734,4.5264465976352009,0.40882153388711906,1.0013933009603011,7.7728572307651719E-2,9.5261759180413605,-113.91800896000231,66.081991039997689,null,1000000000,1972603396,null,17.419515708972789,-20.337057195762789,null,30.962355822532412,-84.628712573557237,null,0,0]
[44668,44.667999999999999,6.2995037551805497,1.4113792896553878,1.0000630128401469,1.1225821259619443E-2,1,0,39520.255483329012,1.5707710233147476,3.8372684274492137,1.3071505837402488,1.00410015751689,9.0401293674218008E-2,1.033137460152062,0.2539587950386597,4.5305141685413126,0.41090890433678401,1.0014092870262012,7.8172750252589351E-2,9.4692909641130854,-113.97838323028154,66.021616769718463,null,1000000000,1995230224,null,17.415732434065745,-20.283951194235513,null,30.913946126981212,-84.701853168870997,null,0,0]
[44928.25,44.928249999999998,6.3352843974680724,1.4122872901935606,1.0000637492214763,1.1291220928179541E-2,1,0,39750.513083467144,1.5707711698869089,3.858111325912335,1.3086085509468171,1.0041479753781821,9.0925110543096113E-2,1.0335184429298623,0.255375113827705,4.5347020692595041,0.41304376252283415,1.0014257611030313,7.8627851647160157E-2,9.4113140163672195,-114.04039089420282,65.959609105797185,null,1000000000,2018547648.0625,null,17.41191038854527,-20.230436720360238,null,30.86461410464787,-84.77620603175825,null,0,0]
[45188.5,45.188499999999998,6.3710702043048304,1.4131850911279313,1.0000644898801887,1.135662050014794E-2,1,0,39980.770683606119,1.5707713147707909,3.8789623372967204,1.3100508468499887,1.0041960687354412,9.1448877381984719E-2,1.033901497372864,0.25679038597836473,4.5389104016828625,0.4151746906607181,1.0014423309849678,7.9082946805734952E-2,9.3536445843259113,-114.10254354120622,65.897456458793783,null,1000000000,2042000532.25,null,17.408142091027759,-20.177817182791554,null,30.81555131715038,-84.849974148632313,null,0,0]
[45448.75,45.448749999999997,6.406861089150369,1.41407286193417,1.0000652348162746,1.1422019974965411E-2,1,0,40211.028283745931,1.570771457995396,3.8998213314713239,1.3114777168641074,1.0042444375490867,9.1972593910720671E-2,1.0342866211793047,0.25820460698712044,4.543139109038747,0.41730168062428974,1.0014589966737555,7.9538035692264503E-2,9.2962787547416355,-114.1648365963412,65.835163403658797,null,1000000000,2065588876.5625,null,17.404426330592109,-20.126078505932867,null,30.766754896428257,-84.92316722770039,null,0,0]
[45709,45.709000000000003,6.4426569673751182,1.4149507683855147,1.0000659840297244,1.1487419352072734E-2,1,0,40441.285883886558,1.5707715995890661,3.920688181025116,1.3128894014331605,1.0042930817793185,9.249625984930504E-2,1.0346738120384245,0.25961777237395928,4.5473881344913369,0.41942472445871415,1.0014757581711491,7.9993118270700769E-2,9.2392126903617413,-114.22726556574399,65.772734434256009,null,1000000000,2089312681,null,17.400761928496273,-20.075206898939594,null,30.718222018483662,-84.995794765036038,null,0,0]
[45975.25,45.975250000000003,6.4792831918893325,1.4158388757384688,1.0000667549425177,1.1554326394100957E-2,1,0,40676.852016596094,1.5707717427882559,3.9420441097218575,1.3143181630687668,1.0043431324629049,9.3031946132906287E-2,1.0350720661540325,0.26106242088745041,4.5517560869927802,0.42159262278881393,1.0014930052499333,8.0458686101000751E-2,9.1811372694658608,-114.29126986779869,65.70873013220131,null,1000000000,2113723612.5625,null,17.397064996071407,-20.024045655133289,null,30.668840054050051,-85.069521148824407,null,0,0]
[46241.5,46.241500000000002,6.5159144693845681,1.4167169982238625,1.0000675303321553,1.1621233332677642E-2,1,0,40912.418149306453,1.5707718843384169,3.9634079988192079,1.3157315247057797,1.0043934713238181,9.3567578874435925E-2,1.0354724788103911,0.26250595513321323,4.5561451847127907,0.42375637464025312,1.0015103526096827,8.0924247252667142E-2,9.1233677055710167,-114.35540716217096,65.644592837829038,null,1000000000,2138276322.25,null,17.393419420328076,-19.973763604034769,null,30.619728082235838,-85.142675065111746,null,0,0]
[46507.75,46.507750000000001,6.5525507151165048,1.4175853019564297,1.0000683101986267,1.1688140167204011E-2,1,0,41147.984282017627,1.5707720242678702,3.9847797202811464,1.3171297284378862,1.004444098318731,9.4103157774618487E-2,1.035875047504379,0.26394837039084623,4.5605553666064447,0.42591597204681753,1.0015278002523087,8.1389801687104954E-2,9.0659001246761957,-114.41967289191444,65.580327108085555,null,1000000000,2162970810.0625,null,17.38982403720501,-19.924346859172989,null,30.570883216774263,-85.215266029394186,null,0,0]
[46774,46.774000000000001,6.589191846214189,1.4184439494159631,1.0000690945419215,1.1755046897081284E-2,1,0,41383.550414729601,1.5707721626042925,4.0061591487573516,1.3185130114308241,1.004495013404078,9.4638682534362181E-2,1.0362797697232966,0.2653896619658882,4.5649865715720406,0.42807140722650189,1.0015453481797323,8.1855349365720712E-2,9.0087307280493363,-114.48406258320868,65.515937416791317,null,1000000000,2187807076,null,17.386277713658654,-19.875781816401147,null,30.522302615966943,-85.287303348901219,null,0,0]
[47046.25,47.046250000000001,6.6266636602594833,1.4193121271135263,1.0000699011898364,1.1823461275414655E-2,1,0,41624.425080010529,1.5707723024390485,4.0280282088093999,1.3199122801573386,1.0045473737278443,9.5186219162012711E-2,1.0366958366821273,0.26686226653594181,4.5695393100133659,0.43027110369915833,1.0015633952555925,8.2331381233519685E-2,8.9505774657232369,-114.55002691776181,65.449973082238188,null,1000000000,2213349639.0625,null,17.382701054385986,-19.826989173746021,null,30.472897590918357,-85.360401028724581,null,0,0]
[47318.5,47.3185,6.6641404128646755,1.4201705408076211,1.0000707125185979,1.1891875543062983E-2,1,0,41865.299745292272,1.5707724406647081,4.0499050703677018,1.3212964343717191,1.0046000351798094,9.5733698549694435E-2,1.0371141499758056,0.26833368636364074,4.574113900340298,0.43246643236668014,1.0015815471911562,8.2807405955968111E-2,8.8927281780188796,-114.61611166295694,65.383888337043061,null,1000000000,2239040442.25,null,17.37917338977169,-19.779059157043484,null,30.423763004701851,-85.432938869300784,null,0,0]
[47590.75,47.59075,6.7016220211776494,1.4210193530501811,1.0000715285281949,1.1960289699386114E-2,1,0,42106.1744105748,1.5707725773088868,4.0717896076847468,1.3226657124337002,1.00465299771262,9.6281120378238425E-2,1.0375347068872993,0.26980391651437341,4.5787102770625054,0.43465738550053512,1.0015998039885134,8.328342349180877E-2,8.8351790357102473,-114.68231229621522,65.317687703784785,null,1000000000,2264879485.5625,null,17.37569360280872,-19.731978092581947,null,30.374895958022279,-85.504926181842407,null,0,0]
[47863,47.863,6.7391084041789044,1.421858722832398,1.0000723492186159,1.2028703743743893E-2,1,0,42347.049075858107,1.5707727123985711,4.0936816976583206,1.3240203478300645,1.0047062612786624,9.6828484328680783E-2,1.0379575046894187,0.27127295208207691,4.5833283746410993,0.43684395556950234,1.0016181656497662,8.3759433799786009E-2,8.7779262839646162,-114.74862437978692,65.251375620213082,null,1000000000,2290866769,null,17.372260606316988,-19.685732585825132,null,30.326293596547277,-85.57637207354658,null,0,0]
[48141.75,48.141750000000002,6.7774946431808623,1.4227085117553298,1.0000731943528938,1.2098751064587994E-2,1,0,42593.674651424459,1.5707728491304718,4.1161041632290924,1.3253923929185938,1.0047611083682926,9.738885635601055E-2,1.0383927157604695,0.27277581824429858,4.5880791662658549,0.43907818130746773,1.0016370743492358,8.4246801376648847E-2,8.7196098606462247,-114.816630598407,65.183369401592998,null,1000000000,2317628093.0625,null,17.368793021092564,-19.639234979181637,null,30.276802153229561,-85.648972081765677,null,0,0]
[48420.5,48.420499999999997,6.815885721360682,1.4235487282570412,1.0000740443941494,1.216879826669838E-2,1,0,42840.300226991589,1.5707729842880795,4.1385342934259111,1.326749568051395,1.0048162709352981,9.7949167032481924E-2,1.0388302701840653,0.27427742178378645,4.5928525891108363,0.44130779684017724,1.001656092984148,8.4734161288870513E-2,8.6615964140881392,-114.88474450335202,65.115255496647976,null,1000000000,2344544820.25,null,17.365372272415996,-19.593585752898282,null,30.22758226940654,-85.721023198299861,null,0,0]
[48699.25,48.699249999999999,6.8542815574051348,1.424379532007491,1.0000748993423705,1.223884534938797E-2,1,0,43086.92580255949,1.5707731178984283,4.1609719642980059,1.3280921087427291,1.0048717489277246,9.8509416016410681E-2,1.0392701650004048,0.27577775752793304,4.5976485726936458,0.4435327947199077,1.0016752215567979,8.5221513492174633E-2,8.6038821445402967,-114.95296159818339,65.047038401816607,null,1000000000,2371616950.5625,null,17.361997284516487,-19.548771394973745,null,30.178631022097427,-85.792534569066405,null,0,0]
[48978,48.978000000000002,6.8926820718028532,1.4252010791710654,1.0000757591975447,1.2308892311969685E-2,1,0,43333.551378128162,1.5707732499879357,4.1834170545126135,1.3294202456660582,1.0049275422933317,9.9069602966342776E-2,1.0397123972388784,0.27727682033569218,4.6024670464932553,0.44575316771097995,1.001694460069493,8.5708857942286595E-2,8.546463326158209,-115.02127747328419,64.978722526715814,null,1000000000,2398844484,null,17.358667010444407,-19.504778670741931,null,30.129945533894464,-85.863515139128182,null,0,0]
[49263.25,49.263249999999999,6.931982786352008,1.4260323599588898,1.0000766441830604,1.2380572531580075E-2,1,0,43585.927863979923,1.570773383610041,4.2063930849569848,1.3307646768137482,1.0049849631052661,9.964278799495363E-2,1.0401673583237452,0.27880951573094936,4.6074210886967588,0.44802052097454242,1.0017142610110394,8.620755840555322E-2,8.4880076477401012,-115.09128411545858,64.908715884541422,null,1000000000,2426867800.5625,null,17.355304306726971,-19.460597179085052,null,30.080396950542223,-85.935610477671361,null,0,0]
[49548.5,49.548499999999997,6.9712882370821738,1.4268542674705593,1.0000775343070147,1.2452252623960092E-2,1,0,43838.304349832448,1.5707735156936253,4.229376635821561,1.3320944983547298,1.0050427140582512,0.10021590734004905,1.0406247607831884,0.28034086734067554,4.6123985326903991,0.45028301648864194,1.0017341770845907,8.6706250656025746E-2,8.4298536949387817,-115.1613851271636,64.838614872836402,null,1000000000,2455053852.25,null,17.351986296740801,-19.417248904694887,null,30.031120710595186,-86.007168303781341,null,0,0]
[49833.75,49.833750000000002,7.0105983443320792,1.4276669582608066,1.0000784295693939,1.2523932588373489E-2,1,0,44090.680835685729,1.5707736462651083,4.2523675851653602,1.3334099425130077,1.0051007950953799,0.10078896063648358,1.0410846013993411,0.28187086975865022,4.6173993028020641,0.45254064718092957,1.0017542082926625,8.7204934646265525E-2,8.3719977036732232,-115.23157605532379,64.768423944676215,null,1000000000,2483402639.0625,null,17.348711946467851,-19.374720522708486,null,29.982113872936896,-86.07819758470778,null,0,0]
[50119,50.119,7.0499130302078727,1.4284705854415005,1.000079329970184,1.2595612424084024E-2,1,0,44343.057321539767,1.5707737753503077,4.275365813631538,1.3347112367172782,1.0051592061594319,0.10136194751936942,1.0415468769428811,0.28339951761344145,4.6224233233332566,0.45479340620597647,1.001774354637784,8.7703610328835863E-2,8.314435983112535,-115.30185253534171,64.698147464658291,null,1000000000,2511914161,null,17.345480249666942,-19.33299898299412,null,29.933373542515859,-86.148707090438791,null,0,0]
[50410.75,50.41075,7.0901282378953656,1.4292833052137912,1.0000802562037974,1.2668925496381234E-2,1,0,44601.18471767693,1.5707739058658021,4.2988955114443312,1.3360277784179437,1.0052192895712293,0.1019479219900349,1.0420222017814806,0.28496159203442389,4.6275857986096209,0.45709245256916975,1.0017950791632952,8.8213640705379723E-2,8.2558632353164487,-115.37381444764239,64.626185552357612,null,1000000000,2541243715.5625,null,17.34221801394839,-19.291148042003726,null,29.88379528037024,-86.220294561773343,null,0,0]
[50702.5,50.702500000000001,7.1303480758802662,1.4300868569671499,1.0000811878126388,1.274223843248536E-2,1,0,44859.312113814856,1.570774034879284,4.3224325793250156,1.3373299843496107,1.005279718099906,0.10253382621465111,1.0425000669117521,0.28652223820141831,4.6327724357468449,0.45938638894916611,1.001815924138302,8.872366229095556E-2,8.1975907390206455,-115.44585689592336,64.554143104076644,null,1000000000,2570743506.25,null,17.338998353702074,-19.250114369212824,null,29.834489827197217,-86.291356248433914,null,0,0]
[50994.25,50.994250000000001,7.1705724662483741,1.4308813939431353,1.0000821247966931,1.2815551231608708E-2,1,0,45117.439509953518,1.5707741624165332,4.3459768975285105,1.338618083051587,1.00534049168323,0.10311965980365861,1.0429804688420188,0.28808145048055755,4.6379831536928542,0.4616752087489403,1.0018368895655569,8.9233675034816134E-2,8.1396147713712157,-115.51797548705096,64.482024512949039,null,1000000000,2600413533.0625,null,17.335820276858399,-19.20988484944057,null,29.785454229041726,-86.361900927652627,null,0,0]
[51286,51.286000000000001,{"$f":"SQRT(1+(A461/pole1)^2)","v":7.210801332815298},{"$f":"ATAN(A461/pole1)","v":1.4316670660096953},{"$f":"SQRT(1+(A461/Zero1)^2)","v":1.0000830671559451},{"$f":"ATAN(A461/Zero1)","v":1.2888863892963578E-2},{"$f":"IF(VIN_nom>Vout, 1, SQRT(1+(A461/z_RHP)^2))","v":1},{"$f":"IF(VIN_nom>Vout, 0, -ATAN(A461/z_RHP))","v":0},{"$f":"SQRT(1+(A461/Pole2)^2)","v":45375.566906092899},{"$f":"ATAN(A461/Pole2)","v":1.5707742885027436},4.3695283488541303,1.3398922983254753,{"$f":"SQRT(1+(A461/pole4)^2)","v":1.0054016102586283},{"$f":"ATAN(A461/pole4)","v":0.10370542236778588},{"$f":"IF(VOUT_setting=1,1,SQRT(1+(A461*zterm1)^2))","v":1.0434634040685153},{"$f":"IF(VOUT_setting=1,0,ATAN(((A461*zterm1))))","v":0.28963922327620983},4.6432178713839516,{"$f":"IF(VOUT_setting=1,0,ATAN(A461*$Q$4/(1+Afbr-$Q$5*(A461)^2)))","v":0.46395890561328912},{"$f":"SQRT((1-(Z461/pterm2))^2+(A461/pterm1)^2)","v":1.0018579754478287},{"$f":"IF((ATAN((A461/pterm1)/(1-A461^2/pterm2))>0),ATAN((A461/pterm1)/(1-A461^2/pterm2)),PI()+ATAN((A461/pterm1)/(1-A461^2/pterm2)))","v":8.9743678886216399E-2},{"$f":"20*LOG10(((E461*K461*G461*O461)/(C461*I461*S461*M461*Q461))*Adc)","v":8.0819316819562648},{"$f":"((F461+L461+H461+P461)-(D461+J461+T461+N461+R461))*radconv","v":-115.59016591769614},{"$f":"IF(V461>0,V461,V461+180)","v":64.40983408230386},null,{"$f":"IF(U461<0,A461,1000000000)","v":1000000000},{"$f":"A461^2","v":2630253796},null,{"$f":"20*LOG10((K461/(I461*M461))*AEA)","v":17.33268281805341},{"$f":"(L461-(J461+N461))*radconv","v":-19.170446638939559},null,{"$f":"20*LOG10((E461*G461/(C461*S461))*Acs*Am)","v":29.736685578391192},{"$f":"(F461+H461-(D461+T461))*radconv","v":-86.431937183368007},null,{"$f":"SUM((U462<0)*(U461>0))*A461","v":0},0]
[51584.75,{"$f":"A462/1000","v":51.58475},7.2519999771758945,1.4324625554118728,1.0000840376955402,1.2963935412030003E-2,1,0,45639.887590229511,1.5707744161361969,4.3936521456363602,1.3411829278691958,1.0054645527026813,0.10430516521013723,1.0439605479553593,0.2912328744309276,4.6486029721277262,0.46629208037815473,1.0018796920744655,9.0265910065818786E-2,8.0231643580872518,-115.66415846694984,64.335841533050157,null,1000000000,2660986432.5625,null,17.329511192087359,-19.130869059642375,null,29.687020456871267,-86.503135730158732,null,0,0]
[51883.5,51.883499999999998,7.2932031587782609,1.4332490570220691,1.0000850138713309,1.3039006784965968E-2,1,0,45904.208274366858,1.5707745422997998,4.4177831810978514,1.3424594600379243,1.0055278567584114,0.10490483275328809,1.0444603406859312,0.29282500444551907,{"$f":"IF(VOUT_setting=1,1,SQRT((1+Afbr-$Q$5*(A463)^2)^2+(A463*$Q$4)^2))","v":4.654013066032193},0.46861987071003269,1.0019015350115759,9.0788131813437603E-2,7.9646966130189103,-115.73821749278642,64.261782507213582,null,1000000000,2691897572.25,null,17.326380190053523,-19.092094801892738,null,29.637629220970364,-86.573818782361002,null,0,0]
[52182.25,52.182250000000003,7.3344108011545792,1.4340267213499458,1.0000859956833008,1.3114078010925744E-2,1,0,46168.52895850494,1.5707746670187972,4.441921337264775,1.343722120459695,1.0055915223575262,0.1055044245802178,1.0449627784595032,0.29441560743671169,4.6594480660475535,0.47094227056242233,1.0019235042621837,9.1310344074594374E-2,7.9065247517256774,-115.81233865636786,64.187661343632143,null,1000000000,2722987215.0625,null,17.323288857021446,-19.054110915709462,null,29.588508894122509,-86.643994960470309,null,0,0]
[52481,52.481000000000002,7.3756228295377495,1.4347956955845178,1.0000869831314332,1.3189149089063608E-2,1,0,46432.849642643712,1.5707747903178599,4.466066498679357,1.3449711300623306,1.0056555494313604,0.10610394027422877,1.04546785746256,0.29600467756342014,4.664907885129896,0.47325927414716679,1.0019455998293287,9.1832546794813175E-2,7.8486451511527253,-115.88651771026996,64.113482289730044,null,1000000000,2754255361,null,17.320236263848173,-19.016904720399207,null,29.539656546782659,-86.713672694723186,null,0,0]
[52786.5,52.786499999999997,7.4177704679568075,1.4355732072802787,1.0000879987187092,1.32659161800698E-2,1,0,46703.14242592275,1.5707749149594583,4.4907643260255101,1.3462344684123608,1.005721396887876,0.10671692234469692,1.0459870757238852,0.29762806011845555,4.6705166400084757,0.47562304214720869,1.0019683252598475,9.2366538314095858E-2,7.789756349572448,-115.96242831172697,64.037571688273033,null,1000000000,2786414582.25,null,17.31715382068646,-18.979649191795435,null,29.48997454848034,-86.784417863523714,null,0,0]
[53092,53.091999999999999,7.459922539927196,1.4363419328226432,1.0000890201996782,1.3342683114710109E-2,1,0,46973.435209202507,1.5707750381666405,4.5154692423264056,1.3474839848515425,1.0057876221916449,0.10732982392278038,1.0465090478095966,0.29924982754007962,4.6761511640936488,0.47798115585313472,1.0019911827859005,9.2900519741221654E-2,7.7311657244898813,-116.03839075063271,63.961609249367285,null,1000000000,2818760464,null,17.314110001615347,-18.943180906289083,null,29.440566726348681,-86.854659053537006,null,0,0]
[53397.5,53.397500000000001,7.5020789707162798,1.437102019411417,1.0000900475743217,1.3419449892080215E-2,1,0,47243.727992482978,1.5707751599640269,4.54018113186065,1.3487199011410647,1.0058542252680343,0.10794264456395276,1.0470337696011471,0.3008699737193275,4.6818113643561148,0.48033360990090535,1.0020141724107947,9.3434491017946375E-2,7.6728696236316658,-116.11440077027163,63.885599229728371,null,1000000000,2851293006.25,null,17.31110389148272,-18.907487133841084,null,29.39143009411131,-86.924404695405343,null,0,0]
[53703,53.703000000000003,7.5442396872541773,1.4378536109963629,1.0000910808426222,1.3496216511275808E-2,1,0,47514.020775764126,1.5707752803756767,4.5648998813803452,1.3499424344070379,1.0059212060420062,0.1085553838240482,1.0475612369665661,0.30248849259348654,4.6874971477930139,0.48268039920033057,1.0020372941378553,9.3968452086028817E-2,7.6148644658265239,-116.19045420631362,63.809545793686382,null,1000000000,2884012209,null,17.308134599893016,-18.872555409971334,null,29.342561712816941,-86.993663033557468,null,0,0]
[54015.75,54.015749999999997,7.5874053094530458,1.4386143862211891,1.0000921447371158,1.357480475942283E-2,1,0,47790.728035899636,1.5707754022339793,4.5902122364736435,1.3511803390877524,1.0059901675462946,0.10918257959523917,1.0481040617241724,0.30414372951758462,4.6933442679010771,0.48507700851253693,1.0020611014255549,9.4515074262229729E-2,7.5557804691266366,-116.26835323251552,63.731646767484477,null,1000000000,2917701248.0625,null,17.305132077382194,-18.837571348871059,null,29.29280846296356,-87.064068611924995,null,0,0]
[54328.5,54.328499999999998,7.630575273396845,1.4393665537087132,1.000093214808278,1.365339283988086E-2,1,0,48067.435296035837,1.5707755226892914,{"$f":"SQRT(1+(A471/Zero2)^2)","v":4.6155315484864969},{"$f":"ATAN(A471/Zero2)","v":1.352404664138789},1.0060595247271551,0.10980968913603954,1.0486497551094964,0.3057972482730979,4.6992180027044537,0.48746767109292277,1.0020850471669207,9.5061685615988295E-2,7.4969940137061721,-116.34628921684474,63.653710783155262,null,1000000000,2951585912.25,null,17.302166329319341,-18.803360322216683,null,29.243330261664635,-87.133980392800993,null,0,0]
[54641.25,54.641249999999999,7.6737495058099334,1.440110257887756,1.0000942910560888,1.3731980751679704E-2,1,0,48344.14255617273,1.5707756417657039,4.6408577035534755,1.3536156281801797,1.0061292775027606,0.11043671197109116,1.0491983126465747,0.30744904250613719,4.7051182525388091,0.48985238235751055,1.002109131365581,9.5608286084827007E-2,7.4385014774489164,-116.42425798048659,63.575742019513413,null,1000000000,2985666201.5625,null,17.299236475953276,-18.769909778147326,null,29.194124103577206,-87.203406647823215,null,0,0]
[54954,54.954000000000001,7.7169279350493385,1.440845639992584,1.0000953734805287,1.3810568493849181E-2,1,0,48620.849816310307,1.5707757594867593,4.6661905902507694,1.3548134452430529,1.0061994257908393,0.11106364762543999,1.0497497298453311,0.30909910591370121,4.7110449177903391,0.49223113801318918,1.0021333540251856,9.6154875606271603E-2,7.3802993087853777,-116.50225543825849,63.497744561741513,null,1000000000,3019942116,null,17.296341661398117,-18.737207427718662,null,29.145187031181198,-87.272355465595169,null,0,0]
[55274,55.274000000000001,7.7611115739217809,1.4415895996909951,1.0000964873901845,1.3890977837629182E-2,1,0,48903.971553302283,1.5707758785579067,4.6921175839037668,1.356025640340544,1.006271609503588,0.11170502582978532,1.0503168848657334,0.31078562219564104,4.7171362089586593,0.49465886821161537,1.0021582815178436,9.6714124471861368E-2,7.3210448392270857,-116.5820865254134,63.417913474586598,null,1000000000,3055215076,null,17.29341513893969,-18.704508851103483,null,29.095391005262528,-87.342416700185765,null,0,{"$f":"IF(AH474>0,W474,0)","v":0}]
[55594,55.594000000000001,7.8052994597498069,1.4423251362833964,1.0000976077661121,1.3971387001769281E-2,1,0,49187.093290294935,1.570775996258303,4.7180513964517177,1.3572245109868937,1.0063442071027813,0.11234631175994658,1.0508870241119272,0.3124703132888883,4.7232549436305344,0.49708035530975725,1.0021833539730989,9.7273361744306577E-2,7.2620870517197664,-116.66193929186474,63.338060708135259,null,1000000000,3090692836,null,17.290523559039748,-18.672568343844343,null,29.04587057008623,-87.411994672405427,null,0,0]
[55914,55.914000000000001,7.8494915208100515,1.443052391231525,1.0000987346082899,1.4051795985230287E-2,1,0,49470.215027288265,1.5707761126114832,4.7439919160647879,1.3584102722847169,1.0064172184988533,0.11298750490849495,1.051460142729451,0.31415317260736719,4.7294010153013222,0.49949559563781376,1.0022085713949271,9.7832587356697268E-2,7.2034223598957956,-116.74180965389195,63.258190346108051,null,1000000000,3126375396,null,17.287666077582401,-18.641373553744156,null,28.996622706741025,-87.481097483640511,null,0,0]
[56234,56.234000000000002,7.8936876869785886,1.4437715028644755,1.0000998679166964,1.4132204786973031E-2,1,0,49753.336764282256,1.5707762276404458,4.7699390333172076,1.3595831348055181,1.0064906436017524,0.11362860476845361,1.0520362358490818,0.31583419362081661,4.735574317544696,0.50190458583346609,1.0022339337873263,9.8391801242127125E-2,7.145047247219992,-116.82169362231569,63.178306377684308,null,1000000000,3162262756,null,17.284841873400669,-18.610912388214501,null,28.947644444517017,-87.549733055790455,null,0,0]
[56561.5,56.561500000000002,7.9389238798042525,1.4444991779875904,1.000101034482328,1.4214497980765529E-2,1,0,50043.094166987721,1.570776344017718,4.796501005798361,1.3607703456018683,1.0065662178758583,0.11428463328392711,1.0526289059461813,0.31755270337055047,4.7419203909660119,0.50436356196761345,1.0022600407220021,9.8964109490724719E-2,7.085600208916313,-116.90345989413682,63.096540105863184,null,1000000000,3199203282.25,null,17.281985099659302,-18.5804845532599,null,28.897794357150268,-87.619501563819526,null,0,0]
[56889,56.889000000000003,7.9841642287421379,1.4452186070954423,1.0001022078207982,1.4296790982019527E-2,1,0,50332.851569693863,1.570776459055063,4.8230696643316371,1.3619444781529733,1.0066422252841487,0.11494056301363759,1.0532246812427046,0.31926927397373805,4.7482947610668775,0.50681598540900297,1.0022862995109247,9.9536405314428922E-2,7.0264492464515556,-116.98523225797329,63.014767742026706,null,1000000000,3236358321,null,17.279161511440705,-18.550800309782652,null,28.848220510793414,-87.688796909113364,null,0,0]
[57216.5,57.216500000000003,8.0294086635415081,1.4459299288318792,1.0001033879320824,1.43790837896211E-2,1,0,50622.608972400652,1.5707765727754899,4.8496448990289274,1.3631057441943777,1.0067186657285185,0.11559639341560483,1.0538235564721126,0.32098389861170962,4.7546973140525042,0.50926185353476938,1.0023127101584521,0.10010868864152982,6.9675908061202012,-117.06700673260157,62.93299326739843,null,1000000000,3273727872.25,null,17.276370298418207,-18.521847496494829,null,28.79891987129897,-87.757627031334508,null,0,0]
[57544,57.543999999999997,8.0746571155198819,1.4466332787662799,1.0001045748161572,1.4461376402456348E-2,1,0,50912.366375108089,1.5707766852014831,4.876226602370763,1.3642543509852303,1.0067955391103336,0.11625212394835457,1.0544255263524585,0.32269657052701428,4.7611279362384522,0.5117011640465382,1.0023392726689677,0.10068095940032155,6.9090214033984765,-117.14877943220606,62.851220567793945,null,1000000000,3311311936,null,17.273610672348209,-18.493614208585985,null,28.749889453131626,-87.825999693991534,null,0,0]
[57879,57.878999999999998,8.1209458778128401,1.447344626415993,1.0001057958879773,1.4545553376275224E-2,1,0,51208.759443527044,1.5707767988857864,4.9034236298837355,1.3654163758170439,1.0068746207707615,0.11692276732087463,1.0550444780473791,0.32444643664304218,4.7677347469558926,0.51418954997669442,1.0023666006053242,0.10126632251824697,6.8494061968681708,-117.23241899952311,62.767581000476895,null,1000000000,3349978641,null,17.270819729669793,-18.465466638436101,null,28.700012713006306,-87.895472762973782,null,0,0]
[58214,58.213999999999999,8.1672387028487776,1.4480479104216928,1.0001070240462928,1.4629730143947382E-2,1,0,51505.152511946646,1.5707769112616676,4.9306272054496878,1.3665655797891592,1.0069541552144201,0.11759330505317823,1.0556666565276136,0.32619424546774767,4.7743706869596636,0.51667107066558848,1.0023940874492256,0.10185167233386354,6.7900862566820663,-117.31604878192101,62.683951218078988,null,1000000000,3388869796,null,17.268060236538908,-18.438047521731889,null,28.650412544636055,-87.964483068831214,null,0,0]
[58549,58.548999999999999,8.2135355219328474,1.4487432664375293,1.0001082592910773,1.4713906704280676E-2,1,0,51801.545580366903,1.570777022351586,4.9578372212814239,1.367702170934419,1.0070341423340288,0.1182637365673917,1.0562920560912266,0.32793998996742252,4.781035634971845,0.51914572468567832,1.0024217332054435,0.10243700877043876,6.7310580668992337,-117.3996649174648,62.600335082535196,null,1000000000,3427985401,null,17.265331416478642,-18.411344907246509,null,28.60108590398837,-88.033038379645959,null,0,0]
[58884,58.884,8.259836267904495,1.4494308271070624,1.0001095016223049,1.4798083056082979E-2,1,0,52097.938648787785,1.5707771321774895,4.9850535719198596,1.3688263528745401,1.0071145820217298,0.11893406128620632,1.0569206710202936,0.32968366317529368,4.7877294698611772,0.52161351095017061,1.0024495378787757,0.10302233175124458,6.6723181799596514,-117.48326364015591,62.516736359844089,null,1000000000,3467325456,null,17.262632514211656,-18.385347096495146,null,28.55202979593653,-88.101146291006344,null,0,0]
[59227,59.226999999999997,8.3072467034318596,1.450126865781614,1.0001107809634224,1.4884269372115651E-2,1,0,52401.409760634291,1.5707772433388478,5.0129263210355921,1.3699647318378536,1.0071974114524833,0.11962028250582475,1.0575676231206184,0.33146682305693681,4.7946129610486459,0.52413311292003695,1.0024781712043276,0.1036216185725483,6.6124707313182407,-117.56883687430124,62.43116312569876,null,1000000000,3507837529,null,17.25989939132694,-18.359446735154354,null,28.502079421522062,-88.170424862933245,null,0,0]
[59570,59.57,8.3546611178914034,1.4508150044620851,1.0001120677334248,1.4970455467009444E-2,1,0,52704.88087248143,1.570777353220087,5.0408054945896525,1.3710905201858452,1.0072807150939247,0.12030639054541742,1.0582179338076481,0.33324779697165224,4.8015264787529377,0.52664551397833337,1.0025069711379591,0.10422089112496646,6.5529184172141193,-117.65438416312466,62.345615836875339,null,1000000000,3548584900,null,17.257196094908231,-18.334261204850556,null,28.452406452896618,-88.23924999366406,null,0,0]
[59913,59.912999999999997,8.4020794439216751,1.4514953762453888,1.0001133619322835,1.505664133948482E-2,1,0,53008.351984329209,1.5707774618431933,5.0686909865735865,1.3722039228435383,1.0073644928284098,0.12099238478718009,1.0588715968933102,0.33502657765941524,4.8084698934747498,0.5291507140446613,1.0025359376849075,0.10482014932615684,6.4936577488703682,-117.73990176375843,62.260098236241575,null,1000000000,3589567569,null,17.254521878957053,-18.309778730106945,null,28.40300782793981,-88.307629304445612,null,0,0]
[60256,60.256,8.4495016156678613,1.4521681112695881,1.0001146635599696,1.5142826988262272E-2,1,0,53311.823096177599,1.5707775692296515,5.0965826932752414,1.3733051403744052,1.0074487445376641,0.12167826461394196,1.0595286061729419,0.33680315793358662,4.8154430759033051,0.53164871339673214,1.0025650708504401,0.10541939309378226,6.4346853053436925,-117.82538603002507,62.174613969974928,null,1000000000,3630785536,null,17.251876017898443,-18.285987785352724,null,28.353880533903116,-88.375570246995395,null,0,0]
[60607,60.606999999999999,8.4980337580341541,1.4528487636497036,1.0001160032370373,1.5231022565024314E-2,1,0,53622.372251451656,1.570777677862407,5.1251312633844606,1.3744196323282487,1.0075354518632007,0.12238002254562093,1.0602043969657871,0.33861888906696647,4.822609580688618,0.53419752119267638,1.0025950560053651,0.10603259836407837,6.3746322984063486,-117.91282588395551,62.087174116044494,null,1000000000,3673208449,null,17.249197064146689,-18.262346091992619,null,28.303885218612706,-88.444649595413452,null,0,0]
[60958,60.957999999999998,8.5465697927202768,1.4535216854785715,1.0001173506934464,1.5319217904820878E-2,1,0,53932.921406726338,1.5707777852441336,5.1536861288482774,1.375521775577921,1.0076226552783365,0.12308165935729423,1.0608836786649605,0.34043230095455151,4.8298069846036693,0.53673879018290305,1.0026252156530633,0.10664578834523201,6.3148740798724994,-118.00022340603302,61.999776593966985,null,1000000000,3715877764,null,17.246546328716843,-18.239404915920986,null,28.254167809147894,-88.513285153444969,null,0,0]
[61309,61.308999999999997,8.5951096537871869,1.4541870071136509,1.0001187059291652,1.5407413006280882E-2,1,0,54243.470562001632,1.5707778913963188,5.1822471856019909,1.3766117715966846,1.0077103546542825,0.12378317438967229,1.0615664445691138,0.34224338613330907,4.8370351497333104,0.53927252180249918,1.0026555497992742,0.10725896294902629,6.2554071934024149,-118.08757498992772,61.912425010072283,null,1000000000,3758793481,null,17.24392309626575,-18.217152677026782,null,28.204725230881643,-88.581484385046323,null,0,0]
[61660,61.66,8.6436532767718681,1.4548448560112601,1.0001200689441618,1.5495607868033268E-2,1,0,54554.01971727753,1.5707779963399597,5.2108143318401439,1.3776898175565684,1.007798549861562,0.12448456698417376,1.0622526879597993,0.3440521372203979,4.8442939383978612,0.54179871786088563,1.0026860584497705,0.10787212208725006,6.1962282497836103,-118.17487712639492,61.825122873605082,null,1000000000,3801955600,null,17.241326671077378,-18.195578041654041,null,28.155554458902845,-88.649254587951049,null,0,0]
[62019,62.018999999999998,8.6933071329393776,1.4555100983509053,1.0001214710722515,1.5585812619690805E-2,1,0,54871.646915979138,1.5707781024466902,5.240038776572213,1.3787802737762989,1.0078892679919604,0.12520181839338881,1.0629581624833637,0.3458996912963464,4.8517497047362568,0.54437469816638684,1.0027174429757439,0.10849924027226533,6.1359948961517219,-118.26411434617852,61.735885653821484,null,1000000000,3846356361,null,17.238698093574897,-18.174201060560929,null,28.105541053102346,-88.718133040140103,null,0,0]
[62378,62.378,8.7429647926073617,1.4561677841881171,1.0001228813382037,1.5676017117688207E-2,1,0,55189.274114681357,1.5707782073320826,5.2692693830869555,1.3798586329301137,1.0079805045370864,0.12591894032860193,1.0636672605476925,0.34774478830473704,4.8592372159091202,0.54694280050234956,1.0027490100635823,0.10912634209205219,6.0760557965133,-118.35329271486536,61.646707285134639,null,1000000000,3891014884,null,17.236096147215385,-18.153509701998676,null,28.055805738676334,-88.786577613506495,null,0,0]
[62737,62.737000000000002,8.792626191333321,1.4568180409880986,1.0001242997419844,1.5766221360558583E-2,1,0,55506.901313384173,1.5707783110171034,5.2985060494050762,1.3809250927405465,1.0080722593561815,0.12663593208748838,1.0643799749106935,0.34958742060607845,4.866756325416068,0.54950302798963546,1.0027807597195668,0.10975342745224829,6.0164075316065126,-118.44240877916818,61.557591220831824,null,1000000000,3935931169,null,17.233520147273477,-18.133492598261629,null,28.006345433779703,-88.854595605945875,null,0,0]
[63096,63.095999999999997,8.8422912661176856,1.4574609933777383,1.0001257262835588,1.5856425346835082E-2,1,0,55824.528512087578,1.570778413522242,5.3277486757648589,1.3819798466987638,1.0081645323077382,0.12735279296851379,1.0650962983127756,0.35142758064822222,4.874306887044356,0.5520553841382686,1.0028126919500133,0.11038049625849779,5.9570467484455003,-118.53145918292718,61.468540817072821,null,1000000000,3981105216,null,17.230969427842254,-18.114138624101557,null,27.957157106510682,-88.922194152730825,null,0,0]
[63463.25,63.463250000000002,8.893101408751642,1.4581112900576527,1.0001271940281959,1.5948701998907806E-2,1,0,56149.454943073768,1.5707785171830122,5.3576693776482278,1.3830469244045953,1.0082594617193503,0.12808599151750641,1.0658328099968186,0.35330746257527684,4.8820633568281888,0.55465825402530433,1.0028455469218984,0.11102195819300362,5.8966158637944401,-118.62248466859184,61.377515331408162,null,1000000000,4027584100.5625,null,17.228385574999365,-18.095014696850075,null,27.907116721550068,-88.990919406853948,null,0,0]
[63830.5,63.830500000000001,8.9439152694211099,1.4587541978302361,1.0001286702888714,1.6040978379352526E-2,1,0,56474.381374060555,1.5707786196509541,5.3875961123034752,1.384102148606974,1.0083549330489727,0.12881905162162441,1.0665730830774336,0.35518474160122993,4.8898524323305832,0.55725289529767874,1.0028785929694533,0.11166340260425159,5.8364789324635327,-118.71343463803109,61.286565361968911,null,1000000000,4074332730.25,null,17.225826825882635,-18.076561924668621,null,27.857354695094884,-89.059220319325703,null,0,0]
[64197.75,64.197749999999999,8.9947327851132979,1.4593898413947308,1.0001301550655479,1.6133254486598997E-2,1,0,56799.307805047923,1.5707787209465387,5.4175287797544875,1.3851457134134424,1.0084509461426927,0.12955197253244111,1.0673171097280978,0.3570594099241457,4.8976739580064548,0.55983931294344569,1.0029118300995534,0.11230482939125136,5.7766325694534011,-118.80430579984949,61.195694200150513,null,1000000000,4121351105.0625,null,17.223292524840627,-18.058769144305423,null,27.807867936813082,-89.127104029190079,null,0,0]
[64565,64.564999999999998,9.0455538942269431,1.4600183426717468,1.0001316483581872,1.6225530319076992E-2,1,0,57124.234236035874,1.5707788210897713,5.4474672822029335,1.3861778087672456,1.0085475008457838,0.13028475350241198,1.0680648821044669,0.35893145983717234,4.9055277786568157,0.56241751235408743,1.0029452583191136,0.11294623845301988,5.7170734552344094,-118.89509495973566,61.104905040264342,null,1000000000,4168639225,null,17.220782034274855,-18.041625431129255,null,27.758653406567667,-89.194577516287524,null,0,0]
[64941,64.941000000000003,9.0975895134351319,1.4606545433592462,1.0001331860523051,1.6320004404484365E-2,1,0,57456.902277020716,1.5707789224455422,5.4781250366692058,1.3872228060275036,1.0086469169923626,0.13103484775368704,1.0688343431509404,0.36084539202977911,4.9136020189543288,0.56504863102427716,1.002979680970695,0.1136029110858808,5.6563894983228593,-118.9879590459431,61.0120409540569,null,1000000000,4217333481,null,17.218235750154097,-18.024734540587438,null,27.708545215416439,-89.263240734700474,null,0,0]
[65317,65.316999999999993,9.1496287730203782,1.4612835074123569,1.0001347326729373,1.6414478198543182E-2,1,0,57789.570318006139,1.5707790226343958,5.5087887067648067,1.3882561708315158,1.0087469005333942,0.13178479373329219,1.0696077138418769,0.36275656351031393,4.9217097833643422,0.56767114789177908,1.0030143039406958,0.11425956492461187,5.5959998021357134,-119.0807307020187,60.919269297981302,null,1000000000,4266310489,null,17.215713127492343,-18.008501578494268,null,27.658716086157021,-89.331488264373348,null,0,0]
[65693,65.692999999999998,9.2016716112191705,1.4619053571161049,1.0001362882200417,1.6508951699568373E-2,1,0,58122.238358992145,1.5707791216763691,5.5394581942518428,1.3892780941648408,1.0088474513001806,0.13253459064186987,1.0703849857029306,0.364664966316529,4.929850906504317,0.570285070019522,1.0030491272366615,0.11491619986086246,5.5359010067449086,-119.17340680182777,60.826593198172233,null,1000000000,4315570249,null,17.213213537074928,-17.992915557531511,null,27.609162912780391,-89.399327105610524,null,0,0]
[66069,66.069000000000003,9.2537179676532251,1.4625202120267033,1.0001378526935774,1.6603424905874919E-2,1,0,58454.906399978703,1.5707792195910426,5.5701334030375982,1.3902887629027325,1.0089485691231348,0.13328423768105077,1.0711661502416661,0.36657059258989644,4.9380252234041651,0.57289040488842402,1.0030841508661812,0.1155728157862902,5.4760898170916956,-119.26598431642662,60.734015683573375,null,1000000000,4365112761,null,17.210736367058878,-17.977965725914515,null,27.559882639877237,-89.466764102367421,null,0,0]
[66453.75,66.453749999999999,9.3069790896681273,1.4631422564803127,1.0001394628148079,1.6700096317452347E-2,1,0,58795.316050962196,1.570779318637322,5.6015282875978087,1.3913114914376457,1.0090526269129629,0.13405117399055028,1.0719695142115844,0.36851768292503173,4.9464239568761261,0.57554748812296275,1.0031201969290564,0.11624469220994096,5.4151810966360134,-119.36061111454808,60.639388885451922,null,1000000000,4416100889.0625,null,17.208224138585592,-17.963315585883102,null,27.509734917125513,-89.535361443853702,null,0,0]
[66838.5,66.838499999999996,9.3602437719351244,1.4637572216531112,1.0001410822826735,1.6796767416864873E-2,1,0,59135.725701946278,1.5707794165432987,5.6329289658951573,1.3923228186507226,1.0091572780961677,0.13481795168600183,1.0727769360945159,0.37046184967986323,4.954857098867091,0.57819559693689226,1.0031564527742227,0.11691654849816038,5.3545667438185438,-119.45512857072747,60.544871429272533,null,1000000000,4467385082.25,null,17.205734143237304,-17.949309540224444,null,27.459866628770598,-89.603552036637581,null,0,0]
[67223.25,67.223249999999993,9.413511954019059,1.4643652272544156,1.0001427110971286,1.6893438202307185E-2,1,0,59476.135352930905,1.5707795133285523,5.6643353415755646,1.3933229321025502,1.0092625224881608,0.13558456991523582,1.0735884067348631,0.37240308477023182,4.9633244740107152,0.58083474066336083,1.0031929184099475,0.11758838453489168,5.2942434284461104,-119.54953374106155,60.450466258938448,null,1000000000,4518965340.5625,null,17.203265778321327,-17.93593679480464,null,27.410274658676997,-89.671342733011556,null,0,0]
[67608,67.608000000000004,9.4667835768410828,1.4649663903198717,1.0001443492581279,1.6990108671973998E-2,1,0,59816.545003916086,1.5707796090122166,5.6957473203928464,1.3943120153069981,1.0093683599033849,0.13635102782718686,1.074403916958848,0.37434138022472074,4.9718259074258855,0.58346492906586922,1.0032295938445448,0.11826020020408713,5.2342078844413074,-119.64382377855289,60.356176221447114,null,1000000000,4570841664,null,17.200818457820663,-17.923186787387269,null,27.360955941591229,-89.738740232078541,null,0,0]
[68001.75,68.001750000000001,9.5213048216411131,1.4655746505732465,1.0001460354156844,1.7089040110351478E-2,1,0,60164.917453755283,1.5707797058130626,5.7278997874241346,1.3953130020199591,1.009477286846296,0.1371352477060053,1.0752426762830998,0.37632196413890801,4.980561285437763,0.58614738097924668,1.0032673444104032,0.11894770965085963,5.1730626051919639,-119.74019735549625,60.25980264450375,null,1000000000,4624238003.0625,null,17.198335084088235,-17.910772508918228,null,27.31076333976203,-89.807314013316088,null,0,0]
[68395.5,68.395499999999998,9.5758295490239647,1.4661759841850839,1.0001477313620668,1.7187971214181971E-2,1,0,60513.28990359504,1.5707798014993517,5.7600579295888625,1.3963028127886439,1.0095868344843759,0.13791929787961496,1.0760856468904785,0.37829945274966353,4.989331964715479,0.58882047574681184,1.0033053147228497,0.11963519752019049,5.112211995072121,-119.836444618032,60.163555381967996,null,1000000000,4677944420.25,null,17.195872560124993,-17.898988777637381,null,27.260850587020713,-89.875489710098662,null,0,0]
[68789.25,68.789249999999996,9.6303576998370453,1.4667705083749931,1.000149437097225,1.7286901981530635E-2,1,0,60861.662353435335,1.5707798960902235,5.7922216523628105,1.3972816318344896,1.0096970026155967,0.13870317743944452,1.0769328188918217,0.38027383787796692,4.9981377594455605,0.59148422518767041,1.0033435047909454,0.12032266368772652,5.0516527514306651,-119.93256281507173,60.067437184928266,null,1000000000,4731960915.5625,null,17.193430308585182,-17.887824987473184,null,27.211214556446862,-89.943274031601135,null,0,0]
[69183,69.183000000000007,9.6848892162562592,1.4673583377420318,1.0001511526211093,1.7385832410462671E-2,1,0,61210.034803276176,1.570779989604381,5.824390863293476,1.398249639394286,1.0098077910368748,0.13948688547815674,1.0777841823798489,0.38224511146723278,5.0069784843804079,0.59413864156225482,1.0033819146238021,0.12101010802912482,4.9913816349989606,-120.02854929200137,59.971450707998628,null,1000000000,4786287489,null,17.191007768134842,-17.877270760703276,null,27.161852172296392,-90.010673536852352,null,0,0]
[69586,69.585999999999999,9.7407052166629366,1.4679531607746259,1.0001529185825,1.7487086566858143E-2,1,0,61566.591240828107,1.5707800842195017,5.8573213840632992,1.3992293760317214,1.0099218242127894,0.14028882587773334,1.0786598761382744,0.3842594640186171,5.0160628741777824,0.59684576438421366,1.0034214543619473,0.12171367912561032,4.9299896696901948,-120.1266516197152,59.873348380284796,null,1000000000,4842211396,null,17.188548158756007,-17.867089207696115,null,27.111610371244389,-90.079264604851943,null,0,0]
[69989,69.989000000000004,9.7965246241991082,1.4685412055545086,1.0001546947978264,1.7588340364648972E-2,1,0,61923.147678380592,1.5707801777450254,5.8902574643129082,1.4001981569608715,1.0100365067310186,0.14109058468348307,1.0795399395734737,0.38627054043483977,5.0251834638062407,0.59954313785449043,1.0034612243310685,0.12241722709489669,4.8688928582103621,-120.2246106384823,59.775389361517696,null,1000000000,4898460121,null,17.186108056746288,-17.857524903546825,null,27.061648864586093,-90.14746600303387,null,0,0]
[70392,70.391999999999996,9.852347380954523,1.4691225868869076,1.0001564812670336,1.7689593801760897E-2,1,0,62279.704115933608,1.5707802701996665,5.9231990113014685,1.4011561631366427,1.0101518383704029,0.14189216092666274,1.080424362007441,0.38827833247427934,5.0343400565464203,0.60223077650408552,1.003501224541099,0.12312075180370419,4.8080879233950844,-120.32242380103027,59.677576198969732,null,1000000000,4955033664,null,17.183686909029451,-17.848567425870307,null,27.011964514138576,-90.215284301735664,null,0,0]
[70795,70.795000000000002,9.9081734303205735,1.469697417007894,1.0001582779900673,1.7790846876119707E-2,1,0,62636.26055348714,1.5707803616017129,5.9561459343246055,1.4021035715901837,1.0102678189086325,0.14269355363990852,1.0813131327443022,0.39028283202813152,5.0435324563338648,0.60490869531458824,1.0035414550020278,0.12382425311876463,4.7475716507428869,-120.42008865596181,59.579911344038194,null,1000000000,5011932025,null,17.181284177906242,-17.840206577150852,null,26.962554233197832,-90.282725924093626,null,0,0]
[71207.25,71.207250000000002,9.9652841959708756,1.4702787770292485,1.0001601265625228,1.7894423619970078E-2,1,0,63001.000978751821,1.5707804540312182,5.989854553300189,1.4030619409555884,1.0103871327090859,0.14351314969856455,1.0822267912931973,0.39232992554051244,5.0529726934947288,0.60763803904056668,1.0035828471162325,0.12454387745224203,4.6859617461185943,-120.5198392873877,59.480160712612303,null,1000000000,5070472452.5625,null,17.178844807746337,-17.832260748176552,null,26.912290257619098,-90.351332326638101,null,0,0]
[71619.5,71.619500000000002,10.022398291297494,1.4708535113136247,1.0001619858647985,1.7997999979833059E-2,1,0,63365.741404017019,1.5707805453966539,6.023568612211319,1.4040095831503356,1.0105071250641255,0.14433255166217576,1.0831449773507378,0.39437355694716159,5.0624499874016484,0.61035724473245678,1.0036244801937919,0.12526347702366539,4.6246472961221681,-120.6194298325801,59.380570167419904,null,1000000000,5129352780.25,null,17.176423618181246,-17.824918359014156,null,26.862306703290919,-90.4195577056568,null,0,0]
[72031.75,72.031750000000002,10.079515659699064,1.4714217321158178,1.0001638558968344,1.8101575953488443E-2,1,0,63730.481829282755,1.5707806357162897,6.0572880202241235,1.4049466756044739,1.0106277957320555,0.1451517584997489,1.0840676794127657,0.39641371799668013,5.071964130355898,0.61306632983623288,1.0036663542455793,0.12598305169041565,4.5636250529792788,-120.71885796355402,59.281142036445985,null,1000000000,5188573008.0625,null,17.174020080361643,-17.818169185645889,null,26.812600426135301,-90.487408484831434,null,0,0]
[72444,72.444000000000003,10.136636245846748,1.4719835491774138,1.0001657366585703,1.8205151538716088E-2,1,0,64095.222254548993,1.5707807250079793,6.0910126885018778,1.4058733918935322,1.0107491444699301,0.14597076918182941,1.0849948859577707,0.39845040058122433,5.0815149154097607,0.61576531225455911,1.0037084692825269,0.1267026013098867,4.5028918307189763,-120.81812144718229,59.181878552817707,null,1000000000,5248133136,null,17.171633680171905,-17.812003224966091,null,26.763168333736537,-90.554890943848235,null,0,0]
[72865.75,72.865750000000006,10.19507640758936,1.4725517979814973,1.0001676718644588,1.8311113543345366E-2,1,0,64468.36785638344,1.5707808153117726,6.1255198700062587,1.4068109031626834,1.0108739910345701,0.14680844930674944,1.085948108650806,0.40053040909635995,5.091323494735267,0.61851605530696541,1.0037518042203264,0.12743870635611326,4.441054884638735,-120.91949977121561,59.080500228784388,null,1000000000,5309417523.0625,null,17.169209500534237,-17.806288495757379,null,26.712877678328372,-90.623553738887097,null,0,0]
[73287.5,73.287499999999994,10.253519823863549,1.4731135691114166,1.000169618300133,1.8417075136737876E-2,1,0,64841.513458218418,1.5707809045762176,6.1600323750762609,1.4077379101440879,1.0109995467620883,0.14764592195672732,1.0869060213755175,0.40260676027260711,5.1011699886576354,0.62125626402169365,1.003795391401255,0.12817478488546091,4.3795138788785994,-121.02070133747445,58.979298662525551,null,1000000000,5371057656.25,null,17.166802214065889,-17.801163670915205,null,26.662867603098995,-90.691843894791731,null,0,0]
[73709.25,73.709249999999997,10.311966439333814,1.4736689723528846,1.000171575965527,1.8523036316516577E-2,1,0,65214.659060053898,1.5707809928191547,6.1945501147322606,1.4086545868294049,1.0111258113883048,0.14848318603453167,1.0878686117426115,0.40467944589170329,5.1110541780810834,0.62398595899228504,1.0038392308372148,0.12891083674527856,4.3182655926753002,-121.12172404756922,58.878275952430783,null,1000000000,5433053535.5625,null,17.164411315071035,-17.796618719607288,null,26.613134957572964,-90.759767693210108,null,0,0]
[74131,74.131,{"$f":"SQRT(1+(A525/pole1)^2)","v":10.370416199909121},{"$f":"ATAN(A525/pole1)","v":1.4742181150324349},{"$f":"SQRT(1+(A525/Zero1)^2)","v":1.0001735448605749},{"$f":"ATAN(A525/Zero1)","v":1.8628997080304494E-2},{"$f":"IF(VIN_nom>Vout, 1, SQRT(1+(A525/z_RHP)^2))","v":1},{"$f":"IF(VIN_nom>Vout, 0, -ATAN(A525/z_RHP))","v":0},{"$f":"SQRT(1+(A525/Pole2)^2)","v":65587.804661889881},{"$f":"ATAN(A525/Pole2)","v":1.5707810800580193},6.2290730019535676,1.4095611034234194,{"$f":"SQRT(1+(A525/pole4)^2)","v":1.0112527846476818},{"$f":"ATAN(A525/pole4)","v":0.14932024044464709},{"$f":"IF(VOUT_setting=1,1,SQRT(1+(A525*zterm1)^2))","v":1.0888358673462146},{"$f":"IF(VOUT_setting=1,0,ATAN(((A525*zterm1))))","v":0.40674845789035469},5.1209758447658889,{"$f":"IF(VOUT_setting=1,0,ATAN(A525*$Q$4/(1+Afbr-$Q$5*(A525)^2)))","v":0.62670516127269149},{"$f":"SQRT((1-(Z525/pterm2))^2+(A525/pterm1)^2)","v":1.0038833225401746},{"$f":"IF((ATAN((A525/pterm1)/(1-A525^2/pterm2))>0),ATAN((A525/pterm1)/(1-A525^2/pterm2)),PI()+ATAN((A525/pterm1)/(1-A525^2/pterm2)))","v":0.12964686178292967},{"$f":"20*LOG10(((E525*K525*G525*O525)/(C525*I525*S525*M525*Q525))*Adc)","v":4.2573068662270286},{"$f":"((F525+L525+H525+P525)-(D525+J525+T525+N525+R525))*radconv","v":-121.22256589675808},{"$f":"IF(V525>0,V525,V525+180)","v":58.777434103241916},null,{"$f":"IF(U525<0,A525,1000000000)","v":1000000000},{"$f":"A525^2","v":5495405161},null,{"$f":"20*LOG10((K525/(I525*M525))*AEA)","v":17.162036311974262},{"$f":"(L525-(J525+N525))*radconv","v":-17.792643828048305},null,{"$f":"20*LOG10((E525*G525/(C525*S525))*Acs*Am)","v":26.563676643129167},{"$f":"(F525+H525-(D525+T525))*radconv","v":-90.827331274890398},null,{"$f":"SUM((U526<0)*(U525>0))*A525","v":0},0]
[74562.75,{"$f":"A526/1000","v":74.562749999999994},10.430255049569368,1.4747739028416986,1.0001755720716963,1.8737469817673859E-2,1,0,65969.797818008199,1.5707811683431032,6.2644196952413393,1.4104787637144054,1.0113835022926296,0.15017692369949487,1.0898308767886222,0.40886271410635566,5.1311713551752236,0.6294779914522497,1.0039287210121877,0.13040031056785473,4.1951994670092194,-121.32560943821721,58.674390561782786,null,1000000000,5559603687.5625,null,17.159620962663457,-17.78915515958909,null,26.513326619282509,-90.896129976156615,null,0,0]
[74994.5,74.994500000000002,10.490097084378188,1.4753233497007514,1.0001776110511706,1.8845942114050721E-2,1,0,66351.790974127027,1.5707812556116572,6.2997716046000631,1.4113861256450295,1.0115149620060375,0.1510333849081881,1.0908307489614455,0.41097310382232771,{"$f":"IF(VOUT_setting=1,1,SQRT((1+Afbr-$Q$5*(A527)^2)^2+(A527*$Q$4)^2))","v":5.1414056810772513},0.63223987155128247,1.003974383881489,0.13115373091992077,4.133389009304965,-121.42845947894311,58.571540521056889,null,1000000000,5624175030.25,null,17.157221272810148,-17.786243763164787,null,26.463257680008137,-90.964563763921404,null,0,0]
[75426.25,75.426249999999996,10.549942250134594,1.4758665631832257,1.0001796617989258,1.8954413966885169E-2,1,0,66733.784130246349,1.5707813418811372,6.335128642708038,1.4122833601373617,1.0116471634986188,0.15188962290106212,1.0918354705052298,0.41307961888837158,5.1516785911749841,0.63499082559209863,1.0040203111611334,0.13190712267542243,4.071872291561264,-121.53111415741914,58.46888584258086,null,1000000000,5689119189.0625,null,17.154836758054085,-17.783899779645456,null,26.413466662646066,-91.0326387924664,null,0,0]
[75858,75.858000000000004,10.609790493857689,1.4764036484504333,1.0001817243148894,1.9062885373627343E-2,1,0,67115.777286366181,1.570781427168602,6.3704907241696249,1.4131706343844261,1.0117801064796057,0.15274563651037104,1.0928450280449753,0.4151822513220324,5.1619898551441814,0.63773087805945439,1.0040665028642486,0.13266048567067085,4.010646172495326,-121.63357170456207,58.366428295437927,null,1000000000,5754436164,null,17.152466947600626,-17.782113563646906,null,26.363950456707428,-91.100361077858309,null,0,0]
[76299.75,76.299750000000003,10.671028047492241,1.4769469379018116,1.0001838467820674,1.9173868682108547E-2,1,0,67506.617996768371,1.5707815134324485,6.4066769791352582,1.4140683208972182,1.0119168957698426,0.15362124326795687,1.0938829598451156,0.41732955726945042,5.1725794014498421,0.64052313716193876,1.0041140381337408,0.13343126778409969,3.9482995194164832,-121.73819654368809,58.26180345631191,null,1000000000,5821651850.0625,null,17.150056990489901,-17.780853429413799,null,26.313568620618501,-91.169292957406313,null,0,0]
[76741.5,76.741500000000002,10.732268714879584,1.4774840272538718,1.0001859815687522,1.9284851518193487E-2,1,0,67897.458707171056,1.5707815987031672,6.4428683388688093,1.4149559230155628,1.0120544606737374,0.15449661266040374,1.09492592587909,0.41947278227309154,5.1832086142036724,0.64330403714249618,1.0041618502455067,0.13420201944294768,3.8862506157396175,-121.84261155286538,58.157388447134622,null,1000000000,5889257822.25,null,17.147661471177855,-17.780157431499418,null,26.263468047994554,-91.237867879577777,null,0,0]
[77183.25,77.183250000000001,10.793512443018905,1.4780150217344807,1.0001881286748651,1.9395833879151208E-2,1,0,68288.299417574235,1.5707816829978103,6.4790647178262208,1.4158336083435075,1.0121928008750538,0.15537174344322427,1.0959739117746539,0.42161191832237838,5.1938772499135375,0.64607360566058503,1.0042099392138426,0.13497274047194052,3.8244962826869466,-121.94681512173155,58.053184878268453,null,1000000000,5957254080.5625,null,17.145279926639308,-17.780015896572355,null,26.213645569474984,-91.306091863599377,null,0,0]
[77625,77.625,10.854759180102922,1.4785400242104867,1.0001902881003266,1.9506815762250811E-2,1,0,68679.140127977895,1.5707817663330421,6.5152660323527085,1.4167015408219017,1.0123319160559472,0.15624663437407141,1.09702690314544,0.42374695758695391,5.2045850661844701,0.64883187083591032,1.0042583050531233,0.13574343069582226,3.7630334009227133,-122.05080573067953,57.949194269320472,null,1000000000,6025640625,null,17.142911906851459,-17.780419361287375,null,26.164098068065094,-91.373970793422387,null,0,0]
[78077,78.076999999999998,10.917430097249436,1.4790711111304164,1.0001925103826561,1.9620372279296649E-2,1,0,69079.049581521002,1.5707818506258397,6.5523123554540224,1.4175796844281738,1.0124750609778717,0.15714157598908973,1.0981094932699984,0.42592728807422281,5.2155816408274989,0.65164246651109381,1.0043080797301358,0.13653197130702541,3.7004428661677591,-122.15698732956956,57.84301267043044,null,1000000000,6096017929,null,17.140502484398031,-17.781386645915411,null,26.113682331706084,-91.443073572401602,null,0,0]
[78529,78.528999999999996,10.980104058541531,1.4795961353544724,1.0001947455624931,1.9733928290267159E-2,1,0,69478.959035064589,1.5707819339482862,{"$f":"SQRT(1+(A535/Zero2)^2)","v":6.5893636744640327},{"$f":"ATAN(A535/Zero2)","v":1.4184479532741023},1.0126190165821807,0.15803626386773434,1.0991972933353291,0.42810331344228753,5.2266187254630934,0.6544412892001642,1.0043581443064256,0.13732047929581556,3.6381510414529212,-122.26294303265787,57.737056967342127,null,1000000000,6166803841,null,17.13810630824328,-17.782905119015123,null,26.063548041843841,-91.511827144363778,null,0,0]
[78981,78.980999999999995,11.042781012147513,1.4801151998232183,1.0001969936397515,1.984748379223715E-2,1,0,69878.868488608656,1.5707820163170416,6.6264199055795627,1.4193065117041743,1.0127637825231799,0.15893069668617618,1.1002902878890357,0.43027502588317862,5.2376960640404642,0.65722837044760773,1.0044084987976487,0.13810895447451263,3.5761547685501318,-122.36867149100759,57.631328508992411,null,1000000000,6237998361,null,17.135722935842733,-17.784965289445722,null,26.013692022355816,-91.580237396783076,null,0,0]
[79433,79.433000000000007,11.10546090740336,1.4806284051662202,1.0001992546143439,1.9961038782281493E-2,1,0,70278.777942153189,1.5707820977483862,6.6634809668506021,1.4201555204646543,1.0129093584534272,0.15982487312297311,1.1013884614664182,0.43244241778257553,5.2488134017405086,0.66000374225243874,1.0044591432195471,0.13889739665545731,3.5144509478520392,-122.4741714444976,57.5258285555024,null,1000000000,6309601489,null,17.133351937114895,-17.787557872344419,null,25.964111149679635,-91.648310084724457,null,0,0]
[79895.5,79.895499999999998,11.169599855460179,1.4811475700589471,1.0002015814617082,2.0077231131840591E-2,1,0,70687.977327694272,1.5707821801176562,6.7014078760272922,1.4210145307744624,1.0130591541931409,0.16073955459713285,1.1025174904542527,0.43465567838987806,5.2602301353586585,0.66283149941388686,1.0045112642439364,0.13970412006584074,3.4516132901900116,-122.58188441850054,57.418115581499464,null,1000000000,6383290920.25,null,17.130938232063265,-17.790752314517544,null,25.913660113181201,-91.717620557436192,null,0,{"$f":"IF(AH538>0,W538,0)","v":0}]
[80358,80.358000000000004,11.233741779705584,1.4816608064789984,1.0002039218123933,2.0193422939217543E-2,1,0,71097.176713235822,1.5707822615387745,6.7393396745047127,1.4218638719726264,1.0132097972498662,0.16165396484821662,1.1036519090836454,0.4368643998779515,5.2716882122385202,0.66564706597996826,1.0045636888593128,0.14051080853012751,3.389075445396692,-122.68935575257734,57.310644247422658,null,1000000000,6457408164,null,17.128536609403863,-17.794485161717468,null,25.863490702265253,-91.786589382485175,null,0,0]
[80820.5,80.820499999999996,11.29788662944909,1.4821682151320994,1.0002062756663042,2.0309614201278865E-2,1,0,71506.376098777822,1.5707823420280187,6.7772762801879489,1.4227037051953346,1.0133612872457245,0.16256810246836323,1.1047917007520742,0.43906857471230476,5.2831873634323792,0.66845047762990917,1.0046164170828213,0.1413174618473422,3.3268342735795038,-122.79658436921365,57.203415630786353,null,1000000000,6531953220.25,null,17.12614664627872,-17.798747101788802,null,25.81359973411417,-91.855222318548925,null,0,0]
[81283,81.283000000000001,11.362034355142622,1.4826698944618801,1.0002086430233457,2.0425804914891151E-2,1,0,71915.575484320303,1.5707824216012958,6.8152176127997093,1.4235341880448333,1.0135136238009399,0.16348196605237342,1.1059368488469852,0.4412681955661476,5.2947273213691028,0.67124177048783551,1.0046694489317023,0.14212407981653263,3.2648866926501805,-122.90356927748991,57.096430722510092,null,1000000000,6606926089,null,17.123767931775632,-17.803529025187416,null,25.763984078661512,-91.923524994697786,null,0,0]
[81756.25,81.756249999999994,11.427676008503106,1.483177404208246,1.0002110793829055,2.0544695706535228E-2,1,0,72334.28599071638,1.5707825020921802,6.8540456361564344,1.4243744559072087,1.0136703770568214,0.16441678566252912,1.1071141411829946,0.44351422133166568,5.3065774681747069,0.67408543559507239,1.0047240277240754,0.14294940940380882,3.2017999991942987,-123.01278764545009,56.987212354549911,null,1000000000,6684084414.0625,null,17.121345155549029,-17.808951053074978,null,25.713496969259634,-91.993079122779804,null,0,0]
[82229.5,82.229500000000002,11.493320571624576,1.4836791167579151,1.0002135298804002,2.0663585917301032E-2,1,0,72752.996497112923,1.5707825816565768,6.8928784442904885,1.4252052566193223,1.0138280158724025,0.16535131538134762,1.1082970066203892,0.44575546409765976,5.318469778349102,0.67691648989848219,1.0047789244571543,0.14377470155513869,3.1390143530810679,-123.121749011837,56.878250988163003,null,1000000000,6761690670.25,null,17.118933323082526,-17.814898846083178,null,25.663291653134927,-92.062298984317863,null,0,0]
[82702.75,82.702749999999995,11.558967994932539,1.484175130629058,1.0002159945157263,2.0782475543831846E-2,1,0,73171.707003509931,1.5707826603103907,6.9317159567861388,1.4260267481542148,1.0139865398346641,0.16628555371207934,1.1094854273340711,0.44799191668194294,5.3304039697383176,0.67973497346170852,1.0048341391497158,0.14459995605530596,3.0765266305325678,-123.23045258013943,56.769547419860572,null,1000000000,6839744857.5625,null,17.116532030464416,-17.821363268177347,null,25.613364940959826,-92.131190211848676,null,0,0]
[83176,83.176000000000002,11.624618229970213,1.4846655421256758,1.0002184732887787,2.0901364582771059E-2,1,0,73590.417509907391,1.5707827380691648,6.9705580950102126,1.4268390850147263,1.0141459485285271,0.16721949916094259,1.1106793854916968,0.45022357212466779,5.3423797617204372,0.68254092677936962,1.004889671820639,0.14542517268912056,3.0143337647627195,-123.33889763791603,56.661102362083966,null,1000000000,6918246976,null,17.114140885232281,-17.828335382299986,null,25.563713696343161,-92.199758311047901,null,0,0]
[83660.5,83.660499999999999,11.691831951990544,1.4851619061517838,1.0002210256324353,2.1023079214858836E-2,1,0,74019.081514872581,1.5707828167650562,7.0103282921128995,1.4276614066599269,1.014310062746014,0.1681753412009305,1.1119074440076084,0.45250330142673301,5.3546830440555073,0.68540064476724727,1.0049468540290001,0.14626996674818452,2.9509647733081517,-123.44965216916422,56.550347830835776,null,1000000000,6999079260.25,null,17.111703012119754,-17.835990046351416,null,25.513164300176818,-92.26962727434433,null,0,0]
[84145,84.144999999999996,11.759048521681285,1.4856525957080493,1.0002235927937426,2.1144793223967236E-2,1,0,74447.745519838238,1.5707828945546984,7.0501031762052779,1.4284744501917588,1.0144751033713406,0.1691308731099638,1.1131412685225439,0.454777988748294,5.3670293380366267,0.68824731691482077,1.0050043695536199,0.14711472066283349,2.8878984953798827,-123.56013450106023,56.439865498939767,null,1000000000,7080381025,null,17.10927497725886,-17.844158486022252,null,25.462897136283168,-92.339168850055955,null,0,0]
[84629.5,84.629499999999993,11.826267890486799,1.4861377073155635,1.000226174772586,2.1266506606494862E-2,1,0,74876.40952480433,1.5707829714536565,7.089882668404039,1.4292783706974264,1.0146410699524409,0.17008609329492697,1.1143808398844395,0.45704762733632304,5.3794183475700041,0.69108098798737827,1.0050622184150937,0.14795943420224947,2.8251318162978336,-123.67034412638935,56.329655873610648,null,1000000000,7162152270.25,null,17.106856394403462,-17.852831725083217,null,25.412909004208203,-92.408388555415428,null,0,0]
[85114,85.114000000000004,11.893490010947156,1.4866173353239036,1.0002287715688507,2.1388219358840416E-2,1,0,75305.073529770874,1.5707830474771407,7.1296666915773299,1.4300733198503186,1.0148079620350088,0.17104100016601911,1.1156261389373434,0.45931221067579303,5.391849778263615,0.69390170316341637,1.0051204006341281,0.14880410713564396,2.7626616776795077,-123.78028061932564,56.219719380674363,null,1000000000,7244392996,null,17.104446888302029,-17.862000983071891,null,25.363196756720036,-92.477291783238442,null,0,0]
[85609.5,85.609499999999997,11.96224112795062,1.4871022770724727,1.0002314426480443,2.1512694799849737E-2,1,0,75743.469844448133,1.5707831243366241,7.1703585718374194,1.4308771927783226,1.0149795999879396,0.17201726135121004,1.1169056152954395,0.46162297345062342,5.4046070216681494,0.69677310638633372,1.0051802486296058,0.14966791513006208,2.6990768143601818,-123.89243022472159,56.107569775278407,null,1000000000,7328986490.25,null,17.101991685496536,-17.871882506381624,null,25.312637977230143,-92.547437533788255,null,0,0]
[86105,86.105000000000004,12.030995025944597,1.487581676309603,1.0002341292248766,2.1637169574118559E-2,1,0,76181.866159125842,1.5707832003115161,7.2110550333709309,1.4316719927068591,1.0151522049759643,0.17299319148148462,1.1181910418435457,0.46392843579605691,5.4174080169939343,0.69963105557715743,1.0052404453356256,0.15053168016554477,2.6357958132220944,-124.00429350326137,55.995706496738634,null,1000000000,7414071025,null,17.0995452160521,-17.882264855536089,null,25.262361258957313,-92.617263298660063,null,0,0]
[86600.5,86.600499999999997,12.099751657522175,1.4880556272987195,1.0002368312992223,2.1761643677795053E-2,1,0,76620.262473803989,1.5707832754170008,7.2517559990482905,1.4324578713916676,1.0153257765058958,0.17396878886712761,1.1194823980850497,0.46622859150496537,5.4302524548840809,0.70247560030794598,1.0053009907747039,0.15139540199532128,2.5728155760730114,-124.11587024692834,55.884129753071662,null,1000000000,7499646600.25,null,17.097107111940005,-17.893139239628322,null,25.212363400643675,-92.686774464832098,null,0,0]
[87096,87.096000000000004,12.168510976346056,1.4885242221825874,1.0002395488709563,2.1886117107027522E-2,1,0,77058.658788482557,1.5707833496679164,7.2924613934533973,1.4332349772448221,1.0155003140821239,0.17494405182210931,1.1207796635234699,0.46852343462336793,5.4431400278569306,0.70530679053945255,1.0053618849694792,0.15225908037265393,2.5101330600961491,-124.22716032573805,55.772839674261945,null,1000000000,7585713216,null,17.09467701564456,-17.904497059520637,null,25.162641254309488,-92.755976297779554,null,0,0]
[87603.25,87.603250000000003,12.238903550131567,1.4889984749614638,1.0002423469384696,2.2013541524419269E-2,1,0,77507.450979443034,1.5707834248095083,7.3341365625201975,1.4340215751194367,1.0156799907016725,0.17594209342109257,1.1221137912145269,0.47086718731624061,5.4563775717508483,0.70819133725386962,1.0054245844567242,0.15314319425093373,2.4462694019124784,-124.34079247435811,55.659207525641889,null,1000000000,7674329410.5625,null,17.092197225775003,-17.916616197841407,null,25.112022390516714,-92.826504093023019,null,0,0]
[88110.5,88.110500000000002,12.309298845154558,1.489467303463639,1.0002451612468093,2.2140965226832576E-2,1,0,77956.243170403948,1.5707834990859235,7.3758162182008267,1.4347992835722789,1.0158606786684186,0.17693978097648025,1.1234540682154635,0.47320536064916202,5.4696596746580894,0.71106199573790452,1.0054876494845701,0.15402726206834114,2.3827114705875783,-124.45412416505451,55.545875834945491,null,1000000000,7763460210.25,null,17.089725102051943,-17.92922432773787,null,25.061685959619339,-92.896718501975911,null,0,0]
[88617.75,88.617750000000001,12.379696814993295,1.4899308000177689,1.0002479917958378,2.226838821013559E-2,1,0,78405.035361365284,1.5707835725120189,7.4175002848631317,1.4355682515220018,1.0160423774428029,0.17793711269153115,1.1248004725443044,0.47553794904662205,5.4829860128202812,0.71391882075743662,1.005551080077705,0.15491128356027478,2.3194561726811043,-124.56715549574787,55.432844504252131,null,1000000000,7853105615.0625,null,17.087260292932417,-17.942312814705208,null,25.01162875031255,-92.966624799756715,null,0,0]
[89125,89.125,12.450097414274252,1.4903890548734575,1.0002508385854176,2.2395810470196589E-2,1,0,78853.827552327057,1.5707836451023134,7.459188688557651,1.4363286245999907,1.0162250864826357,0.17893408677361708,1.1261529822239453,0.47786494720281097,5.4963562645460637,0.71676186743870196,1.0056148762609518,0.15579525846217041,2.2565004694355966,-124.67988663899727,55.320113361002726,null,1000000000,7943265625,null,17.084802456964951,-17.955873212801528,null,24.961847604828755,-93.036228142365175,null,0,0]
[89644,89.644000000000005,12.522131456757613,1.4908525915770685,1.0002537681274342,2.2526183601937769E-2,1,0,79313.015619570753,1.5707837185238303,7.5018471809264096,1.4370978637751961,1.0164130728877345,0.17995378286254904,1.1275431178109447,0.4802400569902126,5.5100813442074497,0.71965656787379728,1.005680528643746,0.15669966136773078,2.1923934239326965,-124.79491865718917,55.205081342810828,null,1000000000,8036046736,null,17.08229455880204,-17.97022754366737,null,24.911195814309327,-93.107135478469829,null,0,0]
[90163,90.162999999999997,12.594168159046072,1.4913108256610881,1.0002567146708181,2.2656555967791911E-2,1,0,79772.203686814872,1.570783791100083,7.5445100621544459,1.4378584035709536,1.0166021157474368,0.1809731007746172,1.128939598348442,0.48260930416845421,5.5238517207265723,0.72253696209371454,1.0057465638029717,0.15760401493959819,2.128593746696164,-124.90963701329711,55.090362986702885,null,1000000000,8129366569,null,17.07979326832762,-17.985058595892237,null,24.860826503802024,-93.177736214120884,null,0,0]
[90682,90.682000000000002,12.66620747575819,1.491763847407692,1.0002596782154187,2.2786927563333923E-2,1,0,80231.391754059412,1.570783862845585,7.5871772582057755,1.4386103898652389,1.0167922144724915,0.18199203860318663,1.1303424003198466,0.48497268391701531,5.5376670562569732,0.72540311021196158,1.0058129817656534,0.15850831889451641,2.0650983514304904,-125.02404211797591,54.97595788202409,null,1000000000,8223225124,null,17.077298250479465,-18.000357902873205,null,24.810736457431695,-93.248035506130108,null,0,0]
[91201,91.200999999999993,12.73824936253749,1.4922117450653423,1.000262658761085,2.291729838413889E-2,1,0,80690.57982130436,1.5707839337745189,7.6298486966930863,1.4393539653118139,1.0169833684707987,0.18301059444620107,1.1317515002189737,0.48733019170140263,5.551527015217804,0.72825507266755174,1.0058797825589634,0.15941257294927111,2.0019042057252165,-125.13813445259854,54.861865547401464,null,1000000000,8317622401,null,17.074809179860551,-18.016117182984583,null,24.760922512996835,-93.318038394788502,null,0,0]
[91732,91.731999999999999,12.811959572355413,1.4926647855287176,1.0002657258161858,2.30506827527538E-2,1,0,81160.384953688335,1.5707840055127762,7.6735110749289932,1.4401061739406653,1.0171800337486341,0.18405230339873557,1.1331996739960017,0.48973612671893052,5.5657532710385782,0.73115835836603726,1.0059485241181008,0.16033768267275728,1.9375575942088115,-125.2545416325701,54.745458367429904,null,1000000000,8414759824,null,17.072268383993915,-18.032708440017633,null,24.710239309704178,-93.38935822273767,null,0,0]
[92263,92.263000000000005,12.885672381687828,1.493112642824663,1.0002688106672948,2.3184066301021093E-2,1,0,81630.190086072733,1.5707840764252849,7.7171777458424708,1.4408498704322221,1.0173778023996132,0.18509360848409073,1.1346543905595587,0.49213590640052102,5.5800255342341867,0.73404692380064251,1.0060176664736922,0.16126273956223686,1.8735200687053917,-125.3706226468819,54.629377353118102,null,1000000000,8512461169,null,17.069733154057602,-18.04976421939606,null,24.659838593885965,-93.460378096905131,null,0,0]
[92794,92.793999999999997,12.959387746176731,1.4935554052203783,1.000271913314247,2.3317449024202293E-2,1,0,82099.995218457523,1.5707841465262211,7.7608486369748437,1.4415851976521585,1.0175766737804057,0.18613450768019749,1.1361156247769038,0.49452952680336787,5.59434345275828,0.73692083464990799,1.0060872096553155,0.16218774331453031,1.8097885476519142,-125.48637822413772,54.513621775862276,null,1000000000,8610726436,null,17.067203170928448,-18.067276220475879,null,24.60971714573132,-93.531103057529464,null,0,0]
[93325,93.325000000000003,13.033105622466159,1.4939931589941287,1.0002750337568773,2.345083091755908E-2,1,0,82569.800350842706,1.5707842158294374,7.8045236774823072,1.4423122953048437,1.0177766472445988,0.18717499897008089,1.1375833515321141,0.49691698428718889,5.6087066770390903,0.73978015687704002,1.006157153692709,0.16311269362650505,1.7463600025833137,-125.60180915936635,54.398190840633646,null,1000000000,8709555625,null,17.064678124738183,-18.085236324015909,null,24.55987179922402,-93.601538030894417,null,0,0]
[93868.5,93.868499999999997,13.10856141061997,1.4944361188585613,1.0002782460850683,2.3587351821693588E-2,1,0,83050.664926081066,1.5707842859521062,7.8492310745784577,1.4430481293364115,1.017982468808295,0.18823955941190701,1.1390923266921016,0.49935425796061367,5.6234545744834108,0.74269175027749956,1.0062291593995463,0.16405936206324159,1.6817489701773616,-125.71962209678186,54.280377903218138,null,1000000000,8811295292.25,null,17.062098436337827,-18.104074977692704,null,24.50913574716737,-93.673335796103174,null,0,0]
[94412,94.412000000000006,13.184019741408033,1.4948740082738234,1.0002814770562825,2.3723871846430558E-2,1,0,83531.529501319848,1.5707843552674268,7.8939426735133802,1.4437756281729133,1.0181894435730801,0.18930368825742216,1.1406080504784804,0.50178506838520542,5.6382492026883426,0.74558820080170141,1.006301585120529,0.16500597387155411,1.6174490903891443,-125.83709681525009,54.162903184749908,null,1000000000,8913625744,null,17.059523291541751,-18.123366427963987,null,24.45868240471777,-93.744839851789962,null,0,0]
[94955.5,94.955500000000001,13.259480571420744,1.4953069136396067,1.0002847266703394,2.3860390986689697E-2,1,0,84012.394076558994,1.5707844237892625,7.9386584032911003,1.444494931885558,1.018397570835839,0.19036738336053588,1.1421304960229024,0.50420941262384478,5.6530901948400096,0.74846957999621033,1.0063744308880662,0.16595252872654925,1.553457279719922,-125.95423436672887,54.045765633271131,null,1000000000,9016546980.25,null,17.056952386242628,-18.143102527173049,null,24.408508544415394,-93.816055129968518,null,0,0]
[95499,95.498999999999995,13.334943858229675,1.4957349194074088,1.0002879949270569,2.3996909237390906E-2,1,0,84493.258651798533,1.5707844915311611,7.983378194499779,1.4452061774414136,1.0186068498901182,0.19143064258083298,1.1436596364812519,0.50662728805905299,5.6679771868230553,0.75133595964561317,1.0064476967347424,0.16689902630338654,1.4897705070910774,-126.07103586504063,53.928964134959372,null,1000000000,9120059001,null,17.054385425209137,-18.163275305824413,null,24.35861099279732,-93.886986451032328,null,0,0]
[96611.5,96.611500000000007,13.489418515455517,1.4965960785476127,1.0002947429153928,2.42763481235461E-2,1,0,85477.549065698535,1.5707846278164987,8.0749283268825334,1.4466374705733018,1.0190388157317318,0.1936056789197006,1.1468104264054153,0.51155629948220993,5.6985915687897721,0.75715673269794259,1.0065989760352123,0.16883624936487288,1.3603476462712987,-126.3090760191849,53.6909239808151,null,1000000000,9333781932.25,null,17.049142169239737,-18.20589646124921,null,24.257323359373544,-94.0313112720101,null,0,0]
[97724,97.724000000000004,13.643902949842181,1.49743773718197,1.0003015690117776,2.4555783217717633E-2,1,0,86461.839479600079,1.5707847609988641,8.1664946306507566,1.4480366699511065,1.0194755983263086,0.19577886179351514,1.1499889251967439,0.51645818248155129,5.7293941083039472,0.7629155815364016,1.0067520158349559,0.17077322829256672,1.2321655093376669,-126.54572391730333,53.454276082696666,null,1000000000,9549980176,null,17.043911895676583,-18.250250079821491,null,24.157154310226701,-94.174505025731904,null,0,0]
[98862,98.861999999999995,13.801938149371018,1.498279193116411,1.0003086323839081,2.4841619372243922E-2,1,0,87468.691156922927,1.5707848941326858,8.2601759285238554,1.4494358423352798,1.0199273697428535,0.19799992036806144,1.1532687094353569,0.52144434428729736,5.7610942139431538,0.76874301094836994,1.0069103853030319,0.17275434989492672,1.102303865097753,-126.78636781373105,53.213632186268953,null,1000000000,9773695044,null,17.038572860318268,-18.297348317829854,null,24.055820290666382,-94.3198496008185,null,0,0]
[100000,100,13.959982900072395,1.4991015969207429,1.0003157774824039,2.5127451466757555E-2,1,0,88475.542834247302,1.5707850242363817,8.3538730345050602,1.4508036310902848,1.0203841680945775,0.20021900126591358,1.1565770029902722,0.52640210375433727,5.7929848646880409,0.77450696620042414,1.0070705975107077,0.17473521015193763,0.97369034070160643,-127.025580558168,52.974419441831998,null,1000000000,10000000000,null,17.033242857968432,-18.346131219196057,null,23.955604218830977,-94.464087827893948,null,0,0]
[101165,101.16500000000001,14.121786953387311,1.4999244441206314,1.0003231767604046,2.542006091200788E-2,1,0,89506.28290813537,1.5707851543948423,8.4498090086478133,1.4521724471658111,1.0208570045749881,0.2024886630642434,1.1599930658368298,0.53144806947022594,5.8258262614112599,0.7803426261331583,1.0072365200527189,0.17676279414354543,0.84329306977278384,-127.2690012104235,52.730998789576503,null,1000000000,10234357225,null,17.027793558712752,-18.397753334694571,null,23.854142139737192,-94.610640218868085,null,0,0]
[102330,102.33,14.283600351617322,1.5007286484177957,1.000330661685092,2.5712666003439435E-2,1,0,90537.022982024908,1.5707852815896637,8.5457604593552556,1.453510527679343,1.0213350949770941,0.20475621166179345,1.1634384902800019,0.53646427588111067,5.8588607712427336,0.78611318977735745,1.0074043744803691,0.17879009792749603,0.7141535439135358,-127.51095300844888,52.48904699155112,null,1000000000,10471428900,null,17.022349398099806,-18.451015220888209,null,23.753799060896679,-94.756108644936319,null,0,0]
[103520,103.52,14.448895461777459,1.5015315132437037,1.000338395651756,2.6011545627124141E-2,1,0,91589.881941621716,1.5707854085583095,8.6437863964559938,1.4548466497819514,1.021828861410387,0.207070217247149,1.1669878939167857,0.54155741493519016,5.8928001735579461,0.79194113019272416,1.0075778258068289,0.18086061347351493,0.58351611907043499,-127.75659792392383,52.243402076076165,null,1000000000,10716390400,null,17.016791637057448,-18.507051092136745,null,23.652431665520464,-94.903616672332419,null,0,0]
[104710,104.71,14.614199674890116,1.502316215828152,1.0003462189762915,2.6310420602660652E-2,1,0,92642.740901219964,1.5707855326410289,8.7418274185499651,1.4561528045177936,1.0223280940484634,0.20938197520817914,1.1705673852590071,0.54661953589925949,5.9269342757969232,0.79770267538298378,1.0077532935498348,0.18293082992528423,0.45414073430539292,-128.00074644746337,51.999253552536629,null,1000000000,10964184100,null,17.011235147162928,-18.564675022286735,null,23.55217933751269,-95.05006720942626,null,0,0]
[105930,105.93,14.783680351518026,1.5031024828084096,1.0003543322906476,2.66168253602686E-2,1,0,93722.142523666684,1.5707856569577259,8.8423551979937791,1.4574618163399262,1.0228455786508399,0.2117496570473511,1.1742680628612239,0.55177709911954487,5.9621275260792803,0.80354134909151564,1.0079352785488844,0.18505292264943571,0.32278862223665489,-128.24951668773662,51.750483312263384,null,1000000000,11221164900,null,17.005537923815545,-18.625339469051514,null,23.450530846737724,-95.199148246531507,null,0,0]
[107150,107.15,14.953169960470875,1.5038709260632221,1.0003625395206168,2.6923225118996259E-2,1,0,94801.544146114815,1.570785778443506,8.9428977882660927,1.4587413965793021,1.0233687914232068,0.21411493110851354,1.1779997797934869,0.55690212126297012,5.9975183630896085,0.8093118767821984,1.0081193837136513,0.18717469377420909,0.19271229806282053,-128.49675573880285,51.503244261197153,null,1000000000,11481122500,null,16.999838144035916,-18.687552103576866,null,23.350001609092899,-95.347189919520034,null,0,0]
[108400,108.4,15.126836297222976,1.5046404044788264,1.0003710459734068,2.7237154053214748E-2,1,0,95907.488431411432,1.5707859000803994,9.0459275825060086,1.460022937733374,1.0239108020871994,0.21653584653696781,1.1818551463945901,0.5621194595427611,6.0339807664464553,0.81515448802590407,1.0083102154941923,0.1893483022125729,6.073502927508076E-2,-128.74850919993008,51.251490800069917,null,1000000000,11750560000,null,16.993993676916958,-18.752840410139989,null,23.248134682308127,-95.497829572167205,null,108400,51.251490800069917]
[109650,109.65,15.300511387206626,1.5053924147343856,1.0003796510124572,2.7551077617679293E-2,1,0,97013.43271670946,1.5707860189439937,9.1489718986806352,1.4612756130655875,1.0244588073495147,0.21895418612586526,1.1857424741122984,0.56730272919525826,6.0706432736141087,0.8209273175033347,1.0085032738716324,0.19152156526330194,-6.9954113573623203E-2,-128.99870226161369,51.001297738386313,null,109650,12023122500,null,16.988142826291227,-18.819634862835848,null,23.147389703521924,-95.647448891377266,null,0,0]
[110925,110.925,15.477668690986228,1.5061420784579804,1.0003885297132158,2.7871274057490607E-2,1,0,98141.495887714816,1.5707861374250387,9.2540915585884047,1.4625246003330505,1.0250239383807094,0.22141821385056429,1.1897401498135562,0.57255462570307458,6.1082414421585902,0.82674463218163585,1.0087024877252841,0.19373793367751743,-0.20195563525018984,-129.25231703411382,50.747682965886185,null,110925,12304355625,null,16.982166615419139,-18.889258341516502,null,23.045759209818897,-95.799044110330868,null,0,0]
[112200,112.2,15.654834496276438,1.5068747746927498,1.0003975109777421,2.8191464780876762E-2,1,0,99269.559058721512,1.5707862532133325,9.3592253302982105,1.4637455292963542,1.025595285895174,0.22387951114120086,1.1937704211111353,0.57777120358529255,6.1460403000472956,0.8324912020068721,1.0089040190848815,0.19595393448586793,-0.33266812054202832,-129.50436015883531,50.495639841164689,null,112200,12588840000,null,16.97618029245907,-18.960332845976151,null,22.945243295516185,-95.949646429047164,null,0,0]
[113510,113.51,15.836872231497512,1.5076105093328402,1.0004068456095065,2.8520439030726898E-2,1,0,100428.588669718,1.570786369470859,9.4672593311563098,1.4649717284909483,1.0261887813427746,0.22640550304010715,1.1979449315451685,0.58309427326594065,6.1850819359657017,0.83832281470970849,1.0091134969983824,0.19823037942449431,-0.46565209925856449,-129.76171316617729,50.238286833822713,null,113510,12884520100,null,16.97001743281621,-19.034812143325841,null,22.843102438637644,-96.103382770133919,null,0,0]
[114820,114.82,16.018918344464954,1.5083295219234174,1.0004162885073313,2.884940710582358E-2,1,0,101587.6182807158,1.5707864830755838,9.5753072454304924,1.4661702565527168,1.026788816932821,0.22892855874017343,1.2021531495329281,0.58838022432773263,6.2243276351078363,0.84408173211900195,1.009325422453353,0.20050642737433513,-0.59732725721501312,-130.01746434068178,49.982535659318216,null,114820,13183632400,null,16.963840596113307,-19.110708496006723,null,22.74208498637028,-96.256138616363003,null,0,0]
[116155,116.155,16.204446946649362,1.509045635099808,1.0004260229949502,2.9184646771447602E-2,1,0,102768.76677742098,1.5707865962120418,9.685430974931716,1.4673641443116852,1.0274070202703431,0.23149671567179195,1.2064759904252396,0.59372896235288053,6.2645282702579417,0.8498767963248911,1.0095439108991193,0.20282549824976434,-0.73019481972027023,-130.2764786714188,49.723521328581199,null,116155,13491984025,null,16.9575299290712,-19.189454801846043,null,22.640268960948742,-96.410834034788834,null,0,0]
[117490,117.49,16.389983670633917,1.509745535641787,1.000435869913886,2.9519879875467201E-2,1,0,103949.91527412746,1.5707867067774355,9.7955681993208685,1.4685311865654171,1.028031991623247,0.23406176698536474,1.2108331003594295,0.59903935717364698,6.3049328734372239,0.85559844973110066,1.0097649423385633,0.20514414736618442,-0.86175509453866095,-130.53389112039116,49.466108879608839,null,117490,13803900100,null,16.951201663555061,-19.269561155717934,null,22.539566804253781,-96.564576748628028,null,0,0]
[118860,118.86,16.58039281134247,1.5104474999478548,1.0004460918796758,2.9863894961646643E-2,1,0,105162.0302108238,1.5707868176593465,9.908606474768078,1.4697018505358097,1.028680371554155,0.23669080859034314,1.2153396835551131,0.60444923173122311,6.3466047484212336,0.86139487811962867,1.009994413097413,0.20752314153543736,-0.99543166518834925,-130.79641956518691,49.203580434813091,null,118860,14127699600,null,16.944687713934808,-19.353126392276984,null,22.43735600416132,-96.72139205377124,null,0,0]
[120230,120.23,{"$f":"SQRT(1+(A589/pole1)^2)","v":16.770809936582616},{"$f":"ATAN(A589/pole1)","v":1.5111335242671871},{"$f":"SQRT(1+(A589/Zero1)^2)","v":1.0004564322422111},{"$f":"ATAN(A589/Zero1)","v":3.020790297730187E-2},{"$f":"IF(VIN_nom>Vout, 1, SQRT(1+(A589/z_RHP)^2))","v":1},{"$f":"IF(VIN_nom>Vout, 0, -ATAN(A589/z_RHP))","v":0},{"$f":"SQRT(1+(A589/Pole2)^2)","v":106374.14514752138},{"$f":"ATAN(A589/Pole2)","v":1.5707869260142968},10.021658023162791,1.4708461041729941,{"$f":"SQRT(1+(A589/pole4)^2)","v":1.029335852593569},{"$f":"ATAN(A589/pole4)","v":0.23931651997748038},{"$f":"IF(VOUT_setting=1,1,SQRT(1+(A589*zterm1)^2))","v":1.2198815723761207},{"$f":"IF(VOUT_setting=1,0,ATAN(((A589*zterm1))))","v":0.60981897815512776},6.3884832033962011,{"$f":"IF(VOUT_setting=1,0,ATAN(A589*$Q$4/(1+Afbr-$Q$5*(A589)^2)))","v":0.86711620895722696},{"$f":"SQRT((1-(Z589/pterm2))^2+(A589/pterm1)^2)","v":1.0102265631955161},{"$f":"IF((ATAN((A589/pterm1)/(1-A589^2/pterm2))>0),ATAN((A589/pterm1)/(1-A589^2/pterm2)),PI()+ATAN((A589/pterm1)/(1-A589^2/pterm2)))","v":0.20990168134852008},{"$f":"20*LOG10(((E589*K589*G589*O589)/(C589*I589*S589*M589*Q589))*Adc)","v":-1.1277842238562159},{"$f":"((F589+L589+H589+P589)-(D589+J589+T589+N589+R589))*radconv","v":-131.05732773683175},{"$f":"IF(V589>0,V589,V589+180)","v":48.942672263168248},null,{"$f":"IF(U589<0,A589,1000000000)","v":120230},{"$f":"A589^2","v":14455252900},null,{"$f":"20*LOG10((K589/(I589*M589))*AEA)","v":16.938152321266152},{"$f":"(L589-(J589+N589))*radconv","v":-19.438013877254559},null,{"$f":"20*LOG10((E589*G589/(C589*S589))*Acs*Am)","v":22.336265096400972},{"$f":"(F589+H589-(D589+T589))*radconv","v":-96.877268437368201},null,{"$f":"SUM((U590<0)*(U589>0))*A589","v":0},0]
[126030,{"$f":"A590/1000","v":126.03},17.577037912304625,1.5138731836625638,1.0005015205176424,3.1664207078259787E-2,1,0,111505.72663136364,1.5707873586456345,10.50040759107198,1.4754173814942773,1.032189236403988,0.25039509558506323,1.2394921455286623,0.63211097568950991,6.5679761314879448,0.89053122360499626,1.0112390861593554,0.21996625973238709,-1.6740158459786922,-132.14472610073986,47.855273899260141,null,126030,15883560900,null,16.910217583904974,-19.810879393468053,null,21.920122219411557,-97.527457144071292,null,0,0]
[131830,131.83000000000001,18.383386244238658,1.5163725217474522,1.0005487304844793,3.3120376838530807E-2,1,0,116637.30811522492,1.5707877532088275,10.979357443395553,1.4795899163314397,1.0351685983491374,0.26141124548109645,1.2596993106450489,0.65369823593238052,{"$f":"IF(VOUT_setting=1,1,SQRT((1+Afbr-$Q$5*(A591)^2)^2+(A591*$Q$4)^2))","v":6.7508118559802126},0.91270165025449501,1.0122996935168211,0.23002221140745552,-2.1987603726707543,-133.20620467438886,46.793795325611143,null,131830,17379148900,null,16.881791339401314,-20.203012260207302,null,21.521830456129727,-98.163389877089188,null,0,0]
[144540,144.54,20.150751562995115,1.5211499943450537,1.0006596029907244,3.6310897297068399E-2,1,0,127882.54960836252,1.5707885071197096,12.029501700721825,1.4875713222462894,1.0421326808793638,0.28532326784201539,1.3059305350734873,0.69860906362239361,7.1619063353521648,0.95730901578766403,1.0147922855797817,0.25202654707133659,-3.281162860802771,-135.45329908382772,44.546700916172284,null,144540,20891811600,null,16.817491124777483,-21.115812544563475,null,20.704117134300315,-99.515071103020915,null,0,0]
[158490,158.49,22.090983336469261,1.525513515158849,1.0007930147891793,3.981183450154948E-2,1,0,140224.88783260755,1.5707891953932214,13.182833735341509,1.4948671646947707,1.0504523044616196,0.31118673518580531,1.3594840534865722,0.74428395261377089,7.6273175849309611,1.0007048702862487,1.0177948480921026,0.27612295259494674,-4.3760457665666035,-137.81665074420656,42.183349255793445,null,158490,25119080100,null,16.743371105898291,-22.179698523029735,null,19.881137282608886,-100.94511584288443,null,0,0]
[173780,173.78,24.217990651664657,1.5294929668708319,1.0009533279922844,4.3647938004177864E-2,1,0,153752.79833078614,1.5707898228482311,14.447622945334128,1.5015254027673191,1.0603646172606662,0.33904766338186099,1.4211781111454627,0.79028677965398197,8.1515823006195856,1.0425671699555583,1.0214075145480226,0.30246206892780342,-5.4815894780426868,-140.31161006204451,39.688389937955492,null,173780,30199488400,null,16.657587251746566,-23.394559133342497,null,19.05329133866298,-102.4624492939918,null,0,0]
[190550,190.55,26.551249176724429,1.5331244055435738,1.001146090281527,4.7853876510339323E-2,1,0,168590.14686285547,1.5707903952501496,15.835450923924384,1.5076048305426042,1.0721640213068591,0.36898719236784272,1.491997834655534,0.83626115467578432,8.7405347452613444,1.0827175267503295,1.0257580996787872,0.3312561129200397,-6.5989226589245895,-142.96189507528206,37.038104924717942,null,190550,36309302500,null,16.557964724956939,-24.761675029246664,null,18.219108743556273,-104.07931007592258,null,0,0]
[208930,208.93,29.108846255674518,1.5364357481166138,1.0013776924300903,5.2461654383522197E-2,1,0,184851.95163449051,1.5707909170602892,17.357076581068956,1.5131510176675795,1.0861743384899676,0.40102202780736074,1.57289225895781,0.88178876485254898,9.3996249685230318,1.1209755435872095,1.0309948259407105,0.36269034509538667,-7.7284599224179082,-145.78986427708176,34.210135722918238,null,208930,43651744900,null,16.44228442793618,-26.279392681929224,null,17.37808658649125,-105.80607864266746,null,0,0]
[229090,229.09,31.914437640383479,1.5394574162393249,1.0016561608160788,5.7513099688160839E-2,1,0,202688.62106849745,1.5707913931188238,19.026574156631671,1.5182140302252554,1.1027882949993459,0.43518430357669163,1.6649832749302218,0.9265367099954146,10.135696939499237,1.1572716434048365,1.0373048439793429,0.39700575520865899,-8.8732095069691113,-148.82273196530139,31.177268034698614,null,229090,52482228100,null,16.308006043984978,-27.946684928947356,null,16.528259187013887,-107.65590915065583,null,0,0]
[251190,251.19,34.99029005828848,1.5422130776038654,1.0019907757327442,6.3047262857221981E-2,1,0,222241.71603340015,1.5707918271896117,20.857194101001216,1.5228328512709739,1.1224327760550286,0.47142514991947243,1.769344222639085,0.97014350685090234,10.955219440054572,1.191534295587068,1.0449064742456042,0.4344095663994989,-10.035618156734035,-152.0830694678622,27.916930532137798,null,251190,63096416100,null,16.152623620390646,-29.758518390619429,null,15.668533113436812,-109.63979324509356,null,0,0]
[275420,275.42,38.362847436450458,1.5447264871304776,1.0023928824990289,6.9110355949936322E-2,1,0,243679.34006057103,1.5707922230411695,{"$f":"SQRT(1+(A599/Zero2)^2)","v":22.864674879498384},{"$f":"ATAN(A599/Zero2)","v":1.5270467838745796},1.1456024366337696,0.50967489310106495,1.8871773283120832,1.0123232207328621,11.865748567769206,1.2237615078884003,1.0540687782617975,0.47513844259286431,-11.219854597114473,-155.59317493800086,24.406825061999143,null,275420,75856176400,null,15.97347223805475,-31.70864937189673,null,14.796921698410033,-111.77000407077377,null,0,0]
[302000,302,42.062731607567862,1.5470200719875051,1.0028763350211902,7.5755626613387264E-2,1,0,267196.13934423123,1.5707925842258519,25.067244171004184,1.5308930402111733,1.172865375941559,0.5498311368008203,2.0198239493630856,1.0528548572168501,12.875980698899218,1.2539972224901681,1.0651233734149697,0.5194512108630247,-12.431388762637772,-159.37329316665949,20.626706833340506,null,302000,91204000000,null,15.767789337067462,-33.789079098714403,null,13.910757805881019,-114.05960544333639,null,0,0]
[331130,331.13,46.117782205918687,1.5491110173132758,1.0034569791125578,8.3030710972516186E-2,1,0,292969.06497003662,1.570792913465233,27.481475259606793,1.5344001433644865,1.2048107246617297,0.59167807904292313,2.1685148916128973,1.0915110606223981,13.993861698575685,1.2822695503124342,1.0784548412340531,0.56753740559829047,-13.674564334359346,-163.43317748056737,16.566822519432634,null,331130,109647076900,null,15.533213461547081,-35.98580893224986,null,13.008325489025784,-116.51771217029966,null,0,0]
[363080,363.08,50.56558463659421,1.5510187408673675,1.0041548285053028,9.0999932139576148E-2,1,0,321237.00090362289,1.5707932138284664,30.129745196150967,1.5376004375405876,1.2421411762715557,0.63501724174228047,2.334825480189918,1.1281884045335886,15.230032473498751,1.3086812041558378,1.0945535951533887,0.61965650094176561,-14.956394639882348,-167.78370770569308,12.216292294306925,null,363080,131827086400,null,15.267203153256578,-38.28561390523646,null,12.085930223664491,-119.15661813778439,null,0,{"$f":"IF(AH602>0,W602,0)","v":0}]
[398110,398.11,55.442333930564111,1.5527585899642424,1.004993131483662,9.9724054155773179E-2,1,0,352229.98355634313,1.5707934877407368,33.033605047962837,1.5405194982154244,1.2855852056775305,0.67954956368448027,2.5202759138143027,1.1627879785436381,16.594788898134535,1.3333176573078056,1.1139985937053227,0.67599231926064363,-16.28277587220764,-172.42477813530445,7.5752218646955498,null,398110,158491572100,null,14.967800071461648,-40.669893844373057,null,11.140496834005383,-121.98425340485829,null,0,0]
[436520,436.52,60.789794997022469,1.5543454552848228,1.0060000803374671,0.10927243332301696,1,0,386213.4395566819,1.5707937375530485,36.217923773817311,1.543182178956203,1.3359480074300352,0.72495068386498762,2.7265910958834718,1.1952741902939821,18.100014327522477,1.356289039915741,1.1375020307867174,0.73671978323029885,-17.660360397657495,-177.35163134839436,2.6483686516056366,null,436520,190549710400,null,14.633356628791553,-43.118640363234213,null,10.1680610173613,-125.00751965235811,null,0,0]
[478630,478.63,66.652518394487359,1.5557925798426255,1.0072091973190747,0.11971759819231534,1,0,423470.4906416898,1.5707939653552636,39.709230465652077,1.5456106025636798,1.3940829047279677,0.77085178156959189,2.955601149361748,1.2256433401581843,19.758418465886106,1.3777078620905836,1.165925192156914,0.80195387229296144,-19.09550165329383,-182.55171740442935,-2.551717404429354,null,478630,229086676900,null,14.26281874388102,-45.609454168098978,null,9.1644065639823573,-128.22960790597369,null,0,0]
[524810,524.80999999999995,73.082017024435245,1.5571126430571109,1.0086611833976447,0.13114212560854097,1,0,464328.49631983158,1.5707941731471926,43.538201582777958,1.5478259718286549,1.4609272432976008,0.81688311908940969,3.2094086836574052,1.2539368937359228,21.584729487222837,1.3976999833691239,1.2003304732626368,0.87177464867211008,-20.595039121166863,-188.0080549937399,-8.0080549937399041,null,524810,275425536100,null,13.855555608300417,-48.119936132849837,null,8.1244369206519309,-131.65110056573448,null,0,0]
[575440,575.44000000000005,80.131197128968353,1.5583164688355642,1.0104039077619564,0.14362799378928223,1,0,509123.66365385498,1.5707943626355549,47.736344516173745,1.5498463951689807,1.5374413020492059,0.86264415578445686,3.4901746463989309,1.2802052056390434,23.594128028795797,1.4163812716376747,1.241991872975436,0.94614199263731369,-22.164713773225209,-193.69403549119787,-13.694035491197866,null,575440,331131193600,null,13.411771044152518,-50.626099531136077,null,7.0432505427326744,-135.26562209872981,null,0,0]
[630960,630.96,87.861319609291726,1.5594145083139244,1.0124953518024626,0.15726800502769114,1,0,558245.28503220517,1.5707945354676309,52.340143247906973,1.5516893701360206,1.6246760970507417,0.90776684572029542,3.8003963566919818,1.3045307579546745,25.804234965784154,1.4338766166065677,1.2924779115989489,1.0249464145579437,-23.810554730955069,-199.57900708694214,-19.579007086942141,null,630960,398110521600,null,12.932085445414344,-53.105854442759487,null,5.9152016313363465,-139.06218083746526,null,0,0]
[691830,691.83,96.336430871792629,1.5604158513068453,1.015003846757907,0.17215470637300648,1,0,612100.34795189276,1.570794693075845,57.387741660058829,1.5533701206927832,1.7237103828303806,0.95189102302712347,4.1426892689194013,1.3269993088747731,28.233537668701342,1.4503020296638778,1.3536729440812378,1.1079265015593629,-25.537364446530507,-205.62343538862311,-25.623435388623108,null,691830,478628748900,null,12.417868612527233,-55.537692696675151,null,4.7350256422374217,-143.02101718017968,null,0,0]
[758580,758.58,105.63032439766194,1.5613292069731515,1.0180118689634881,0.18839110409981943,1,0,671157.77278990857,1.5707948368322671,62.923089614807722,1.554903240398021,1.8357282987381971,0.99471379597163756,4.520069195517066,1.3477150923578112,30.903395250165513,1.4657781494886091,1.4278873981618476,1.1947191977446279,-27.349894296374519,-211.78386543138728,-31.783865431387284,null,758580,575443616400,null,11.870764639079624,-57.903423804183859,null,3.4971632424265993,-147.11592672946719,null,0,0]
[831760,831.76,115.81957908426182,1.5621621007599611,1.0216160877812712,0.20607648178886701,1,0,735904.1750318096,1.5707949679223234,68.991796726793837,1.5563013423803385,1.9619379428724573,1.0359601303901873,4.9356731795795925,1.3667773222053212,33.836059678797014,1.4804153476820983,1.5178804528349166,1.2847796987918383,-29.251103464826702,-218.00798325999983,-38.007983259999833,null,831760,691824697600,null,11.293042843181089,-60.186566857352112,null,2.197121356011654,-151.31043714318841,null,0,0]
[912010,912.01,126.99330565907275,1.5629218145948878,1.025933063693464,0.22532090758992715,1,0,806905.7981516982,1.5707950874928587,75.6469372376894,1.5575766359017116,2.1036913211355999,1.0754289370860366,5.3931573150418828,1.384296924680849,37.057497718828763,1.4943283838497727,1.6270269012209924,1.3774688931093209,-31.243678403382006,-224.24127985939552,-44.241279859395519,null,912010,831762240100,null,10.686954355714697,-62.374900820414474,null,0.83062719366991611,-155.5620408077319,null,0,0]
[1000000,1000,139.24479256701619,1.5636146679503999,1.0310991552816915,0.24622760133479116,1,0,884755.42828652519,1.570795196539045,82.944074337248921,1.5587397183467431,2.2623848147046752,1.1129564896441799,5.8963578914950547,1.4003763891572458,40.595014662057451,1.5076228703555021,1.7593470828318045,1.4719889678297258,-33.328083043699401,-230.42268291097923,-50.422682910979233,null,1000000,1000000000000,null,10.055137436043299,-64.458437732392426,null,-0.60484323532195139,-159.81947443127618,null,0,0]
[]
[]
["Pole/Zero Locations for Chart"]
[{"$f":"U4*1000","v":108400},null,{"$f":"SQRT(1+(A617/pole1)^2)","v":15.126836297222976},{"$f":"ATAN(A617/pole1)","v":1.5046404044788264},{"$f":"SQRT(1+(A617/Zero1)^2)","v":1.0003710459734068},{"$f":"ATAN(A617/Zero1)","v":2.7237154053214748E-2},{"$f":"IF(VIN_nom>Vout, 1, SQRT(1+(A617/z_RHP)^2))","v":1},{"$f":"IF(VIN_nom>Vout, 0, -ATAN(A617/z_RHP))","v":0},{"$f":"SQRT(1+(A617/Pole2)^2)","v":95907.488431411432},{"$f":"ATAN(A617/Pole2)","v":1.5707859000803994},{"$f":"SQRT(1+(A617/Zero2)^2)","v":9.0459275825060086},{"$f":"ATAN(A617/Zero2)","v":1.460022937733374},{"$f":"SQRT(1+(A617/pole4)^2)","v":1.0239108020871994},{"$f":"ATAN(A617/pole4)","v":0.21653584653696781},{"$f":"IF(VOUT_setting=1,1,SQRT(1+(A617*zterm1)^2))","v":1.1818551463945901},{"$f":"IF(VOUT_setting=1,0,ATAN(((A617*zterm1))))","v":0.5621194595427611},{"$f":"IF(VOUT_setting=1,1,SQRT((1+Afbr-$Q$5*(A617)^2)^2+(A617*$Q$4)^2))","v":6.0339807664464553},{"$f":"IF(VOUT_setting=1,0,ATAN(A617*$Q$4/(1+Afbr-$Q$5*(A617)^2)))","v":0.81515448802590407},{"$f":"SQRT((1-(A617^2/(pole3^2)))^2+(A617/(Q*pole3))^2)","v":1.0083102154941923},{"$f":"ATAN((A617/(Q*pole3))/(1-A617^2/pole3^2))","v":0.1893483022125729},{"$f":"20*LOG10(((E617*K617*G617*O617)/(C617*I617*S617*M617*Q617))*Adc)","v":6.073502927508076E-2},{"$f":"((F617+L617+H617+P617)-(D617+J617+T617+N617+R617))*radconv","v":-128.74850919993008},{"$f":"IF(V617>0,V617,V617+180)","v":51.251490800069917},"crossover",null,null,null,{"$f":"20*LOG10((K617/(I617*M617))*AEA)","v":16.993993676916958},{"$f":"(L617-(J617+N617))*radconv","v":-18.752840410139989},null,{"$f":"20*LOG10((E617*G617/(C617*S617))*Acs*Am)","v":23.248134682308127},{"$f":"(F617+H617-(D617+T617))*radconv","v":-95.497829572167205}]
[{"$f":"A617","v":108400},null,null,null,null,null,null,null,null,null,null,null,null,null,null,null,null,null,null,null,null,-135]
[{"$f":"A618","v":108400}]
[1000000,null,null,null,null,null,null,null,null,null,null,null,null,null,null,null,null,null,null,null,null,{"$f":"V617","v":-128.74850919993008}]
[]
[{"$f":"pole1","v":7181.7823146584406},null,1.4142135623730951,0.78539816339744828,1.0000016289728402,1.8049768025184569E-3,{"$f":"IF(VIN_nom>Vout, 1, SQRT(1+(A622/z_RHP)^2))","v":1},{"$f":"IF(VIN_nom>Vout, 0, -ATAN(A622/z_RHP))","v":0},6354.1209663512545,1.5706389486131742,1.1639547128418961,0.53720965870262183,1.0001062033867352,{"$f":"ATAN(A622/pole4)","v":1.4573536858807152E-2},{"$f":"IF(VOUT_setting=1,1,SQRT(1+(A622*zterm1)^2))","v":1.0008704392220844},{"$f":"IF(VOUT_setting=1,0,ATAN(((A622*zterm1))))","v":4.1708711408408476E-2},{"$f":"IF(VOUT_setting=1,1,SQRT((1+Afbr-$Q$5*(A622)^2)^2+(A622*$Q$4)^2))","v":4.1666550336564079},{"$f":"IF(VOUT_setting=1,0,ATAN(A622*$Q$4/(1+Afbr-$Q$5*(A622)^2)))","v":6.9888192163943874E-2},{"$f":"SQRT((1-(A622^2/(pole3^2)))^2+(A622/(Q*pole3))^2)","v":1.0000364217566171},{"$f":"ATAN((A622/(Q*pole3))/(1-A622^2/pole3^2))","v":1.2573492991962096E-2},{"$f":"20*LOG10(((E622*K622*G622*O622)/(C622*I622*S622*M622*Q622))*Adc)","v":28.456276235742916},{"$f":"((F622+L622+H622+P622)-(D622+J622+T622+N622+R622))*radconv","v":-107.2776948596826},72.722305140317403,"p1",null,null,null,{"$f":"20*LOG10((K622/(I622*M622))*AEA)","v":22.963914072201369},{"$f":"(L622-(J622+N622))*radconv","v":-60.046138960276942},null,{"$f":"20*LOG10((E622*G622/(C622*S622))*Acs*Am)","v":43.901155741791783},{"$f":"(F622+H622-(D622+T622))*radconv","v":-45.616990581398426}]
[{"$f":"Zero1","v":3978873.5818439089},null,554.02404152514885,1.5689913499923782,1.4142135623730951,0.78539816339744828,1,0,3520330.000000142,1.5707960427306185,330.00151514803684,1.5677660330400338,8.1363348714165564,1.4475793119405971,{"$f":"IF(VOUT_setting=1,1,SQRT(1+(A623*zterm1)^2))","v":23.142615258436109},{"$f":"IF(VOUT_setting=1,0,ATAN(((A623*zterm1))))","v":1.5275725407479201},{"$f":"IF(VOUT_setting=1,1,SQRT((1+Afbr-$Q$5*(A623)^2)^2+(A623*$Q$4)^2))","v":162.57200376170826},{"$f":"IF(VOUT_setting=1,0,ATAN(A623*$Q$4/(1+Afbr-$Q$5*(A623)^2)))","v":-1.440797554945729},13.947945330699207,-0.52294518031738024,-71.854686224795074,72.027256048388438,72.027256048388438,"z1",null,null,null,{"$f":"20*LOG10((K623/(I623*M623))*AEA)","v":-1.0627007508078981},{"$f":"(L623-(J623+N623))*radconv","v":-83.113791946773475},null,-27.838719095463865,-14.934030715267607]
[{"$f":"Pole2","v":1.1302558515377561},null,1.0000000123839461,1.5737818172231226E-4,1.0000000000000404,2.8406427806483288E-7,1,0,1.4142135623730951,0.78539816339744828,1.0000000043937074,9.3741211486816418E-5,1.0000000000026306,2.2937191394552584E-6,1.0000000000215683,6.5678501730427377E-6,4.1565656568158529,1.101660136831671E-5,1.0000000000009019,1.9788134121480401E-6,103.21338946089013,-45.004129598306591,134.99587040169342,"p2",null,null,{"$f":"Pole2","v":1.1302558515377561},{"$f":"20*LOG10((K624/(I624*M624))*AEA)","v":94.696924482130825},{"$f":"(L624-(J624+N624))*radconv","v":-44.994760496055441},null,46.911757791389171,-9.1142075832623248E-3]
[{"$f":"Zero2","v":12057.192672254268},null,1.9541146778939338,1.0335866680922747,1.0000045913576874,3.0302937548627655E-3,1,0,10667.666713537272,1.5707025855834098,1.4142135623730951,0.78539816339744828,1.0002993121626795,2.4463749723506081E-2,1.0024514517623764,6.9949327419759122E-2,4.1849408781001607,0.11699129208944477,1.0001026583152481,2.1108722614095559E-2,22.812321918537357,-109.34757631149886,70.652423688501145,"z2",null,null,{"$f":"Zero2","v":12057.192672254268},{"$f":"20*LOG10((K625/(I625*M625))*AEA)","v":20.153536179701142},{"$f":"(L625-(J625+N625))*radconv","v":-46.396298687452095},null,41.091905208823967,-60.255971585390405]
[{"$f":"pole3","v":1100000},null,153.1685863060959,1.5642675265470289,1.0375115499633571,0.26972319630225494,1,0,973230.97111506993,1.5707952992895771,91.237330933518223,1.5598356814902508,2.4460674378000355,1.1496362051626838,6.4697846969865358,1.4156095351689859,44.621105449020504,1.5208409807494632,1.9258424987598257,{"$error":"#DIV/0!"},-35.580813665842562,{"$error":"#DIV/0!"},{"$error":"#DIV/0!"},"p3",null,null,null,{"$f":"20*LOG10((K626/(I626*M626))*AEA)","v":9.3769888917034496},{"$f":"(L626-(J626+N626))*radconv","v":-66.497242452219837},null,-2.164192704404162,{"$error":"#DIV/0!"}]
[{"$f":"Fp2_u","v":492761.22437736712},null,{"$f":"SQRT(1+(A627/pole1)^2)","v":68.619951941788372},{"$f":"ATAN(A627/pole1)","v":1.5562227899360894},{"$f":"SQRT(1+(A627/Zero1)^2)","v":1.0076395368473847},{"$f":"ATAN(A627/Zero1)","v":0.12321701485429963},1,0,{"$f":"SQRT(1+(A627/Pole2)^2)","v":435973.16811785841},{"$f":"ATAN(A627/Pole2)","v":1.5707940330757573},{"$f":"SQRT(1+(A627/Zero2)^2)","v":40.880885559653549},{"$f":"ATAN(A627/Zero2)","v":1.5463325770713905},{"$f":"SQRT(1+(A627/pole4)^2)","v":1.4142135623730951},0.78539816339744828,3.0330012338806238,1.2348037293399565,20.316518418777015,1.3841721389159614,1.1760919849996985,0.82351480314085967,-19.561970892617492,-184.24882337819466,{"$f":"IF(V627>0,V627,V627+180)","v":-4.2488233781946576},"p4",null,null,null,null,null,null,8.8400278942117154,-129.28910566431227]
[{"$f":"z_RHP","v":0},null,{"$f":"SQRT(1+(A628/pole1)^2)","v":1},{"$f":"ATAN(A628/pole1)","v":0},{"$f":"SQRT(1+(A628/Zero1)^2)","v":1},{"$f":"ATAN(A628/Zero1)","v":0},1,0,{"$f":"SQRT(1+(A628/Pole2)^2)","v":1},{"$f":"ATAN(A628/Pole2)","v":0},{"$f":"SQRT(1+(A628/Zero2)^2)","v":1},{"$f":"ATAN(A628/Zero2)","v":0},{"$f":"SQRT(1+(A628/pole4)^2)","v":1},0,1,0,4.1565656565656566,0,1,0,106.22368948729809,0,{"$f":"IF(V628>0,V628,V628+180)","v":180},"z_RHP",null,null,null,null,null,null,46.911757898962243,0]
[{"$f":"Fp2_u","v":492761.22437736712},null,null,null,null,null,null,null,null,null,null,null,null,null,null,null,null,null,null,null,-25]
[]
[null,null,null,"System","Plant"]
["p1","p-dom",{"$f":"pole1","v":7181.7823146584406},{"$f":"U622","v":28.456276235742916},{"$f":"AE622","v":43.901155741791783}]
["z1","ESR zero",{"$f":"Zero1","v":3978873.5818439089},{"$f":"U623","v":-71.854686224795074},{"$f":"AE623","v":-27.838719095463865}]
["p2","EA pole",{"$f":"Pole2","v":1.1302558515377561},{"$f":"U624","v":103.21338946089013},{"$f":"AE624","v":46.911757791389171}]
["z2","EA zero",{"$f":"Zero2","v":12057.192672254268},{"$f":"U625","v":22.812321918537357},{"$f":"AE625","v":41.091905208823967}]
["p3","p_sampling",{"$f":"pole3","v":1100000},{"$f":"U626","v":-35.580813665842562},{"$f":"AE626","v":-2.164192704404162}]
[]
[]
[{"$f":"U4*1000","v":108400}]
[{"$f":"U4*1000","v":108400}]
[]
[]
[]
[]
[]
[]
[]
[]
[]
[]
[]
[]
[]
[]
[]
[]
[]
[]
[]
[]
[]
[]
[]
[]
[]
[]
[]
[]
[]
[]
[]
[]
[]
[]
[]
[]
[]
[]
[]
[]
[]
[]
[]
[]
[]
[]
[null,null,null,null,null,null,null,null,null,null,null,null,null,null,null,null,null,null,null,null,null,null,null,null,null,null,null,null,null,null,null,null,null,"phase margin",{"$f":"SUM(AI689:AI1306)","v":0}]

{"sheet":"Bode Plot Management","index":7,"n_rows":6,"n_cols":14,"rows_kept":6,"cut":false,"hidden":true,"merged":[]}
[null,null,null,null,null,null,null,null,null,"Single or dual output (MODE)",null,null,null,"3.3V or 5V fixed (FB1/2)"]
[{"$f":"CHOOSE(BODE_PLOT_TYPE, \"BODE_PLOT_Ch1\", \"BODE_PLOT_Ch2\")","v":{"$error":"#VALUE!"}},null,null,null,null,null,null,null,null,"With/without dither (DITH)",null,null,null,"With/without VOUT connected to VCCX"]
[null,null,null,null,null,null,null,null,null,"FPWM or DEM (DEMB)"]
[null,null,null,null,null,null,null,null,null,"Shunt or inductor DCR current sensing"]
[]
[null,null,null,null,null,{"$f":"INDIRECT(A2)","v":{"$error":"#VALUE!"}}]

{"sheet":"Efficiency Calculations","index":8,"n_rows":109,"n_cols":59,"rows_kept":109,"cut":false,"hidden":true,"merged":[[6,24,6,26],[0,0,3,3],[5,0,6,3],[6,6,6,13],[6,17,6,20],[6,21,6,23],[6,51,6,56],[6,27,6,32],[6,33,6,36],[6,40,6,44],[6,45,6,49]]}
["BUCK CONTROLLER POWER DESIGN TOOL"]
[null,null,null,null,null,null,null,{"$f":"AV19","v":0.78024276455544561},"10% load"]
[null,null,null,null,null,null,null,{"$f":"AV59","v":0.86140188115787442},"50% load",null,null,null,null,null,null,null,null,null,null,null,null,null,null,null,null,null,null,null,null,null,null,null,null,null,null,null,null,null,null,null,null,{"$f":"IF(MODE=1, (Qg_Q1+Qg_Q2)*Fsw*Vin, (Qg_Q1+Qg_Q2+Qg_Q3+Qg_Q4)*Fsw*Vin)","v":0.18744}]
[null,null,null,null,null,null,null,{"$f":"AV109","v":0.86256259345011033},"100% load",null,null,null,null,null,null,null,null,null,null,null,null,null,null,null,null,null,null,null,null,null,null,null,null,null,null,null,null,null,null,null,"I_VCC",{"$f":"(Qg_Q1+Qg_Q2)*Fsw*1000","v":15.62},"mA",{"$f":"AP4*5/1000","v":7.8099999999999989E-2}]
[]
["Enter the values of your design and MOSFET datasheet specifications below. Note that thermal resistance (θJA) will change when components are placed on the PCB"]
[null,null,null,null,null,null,"Operating Point Condtions",null,null,null,null,null,null,null,null,null,null,"Filter Inductor",null,null,null,"Cout",null,null,"Cin",null,null,"High-side BUCK \"Control\" MOSFET Losses ",null,null,null,null,null,"Low-side BUCK \"Sync\" MOSFET Losses ",null,null,null,"External Diode","Diode/FET","Sense Rs","Controller IC Losses",null,null,null,null,"RESULTS",null,null,null,null,null,"Consolidated Buck/Boost Efficiency & Losses"]
["Input Parameters",null,null,null,null,null,"Step","Vin","Mode","Iout","Iout/ phase","Iin","Duty Cycle BUCK Leg","Ripple Current pk-pk","Peak Inductor Current","Valley Inductor Current","SW node voltage at Q1 turn-on","Irms Lf","DCR    Loss","Core Loss","Total Inductor Loss","Irms Cout","Cout ESR Loss","Total Cout Loss","Irms Cin","Cin ESR Loss","Total Cin Loss","Irms","RDS(on) Loss","Transition Loss (not including capacitive loss)","MOSFET Output Capacitance Loss","Dead Time Loss ","Total Control MOSFET Loss","Irms","RDS(on) Loss","Deadtime Loss","Total Sync MOSFET Loss","Deadtime Loss","Reverse Recovery Loss","Isense Shunt Loss","IQ Loss","Switching Current Loss","Switching Current Diss","LDO Loss Saved from Gate Drive Current (ext VCC)","Total IC Loss","Total Loss","Pout","EFF, h",{"$f":"IF(Vin>Vout, \"High-side MOSFET Temp Rise\", \"Boost ''CONTROL'' MOSFET Temp Rise\")","v":"High-side MOSFET Temp Rise"},{"$f":"IF(Vin>Vout, \"Low-side MOSFET Temp Rise\", \"Boost ''SYNC'' MOSFET Temp Rise\")","v":"Low-side MOSFET Temp Rise"},null,"h","Inductor Cu & Core Loss","Total MOSFET Loss","Control MOSFET Loss","SYNC MOSFET Loss","Shunt Loss","FETs+IC Losses","Temp rise"]
["Design","Input Value","Units","Description",null,null,0,{"$f":"Vin","v":12},{"$f":"MODE","v":1},0,{"$f":"Iout*G9/100/Number_of_Phases","v":0},{"$f":"Vout*K9/(Vin*Efficiency)","v":0},{"$f":"(Vout+(Rdson2+Rs+Rdcr)*K9)/(Vin+(Rs+Rdson2-Rdson1)*K9)","v":0.27499999999999997},{"$f":"(Vin-(Rdson1+Rdcr)*K9-Vout)*M9/(Fsw*Lf)","v":2.3138297872340425},{"$f":"K9+N9/2","v":1.1569148936170213},{"$f":"K9-N9/2","v":-1.1569148936170213},{"$f":"IF(MIN(Vin, -P9/(Coss_Q1+Coss_Q2)*0.00000002)<0, 0, MIN(Vin, -P9/(Coss_Q1+Coss_Q2)*0.00000002))","v":12},{"$f":"SQRT(K9^2+(N9^2)/12)","v":0.66794512525927441},{"$f":"R9^2*Rdcr","v":1.5615274162516972E-3},{"$f":"Core_Loss_Ch1","v":0.1},{"$f":"(T9+S9*(1+Ltc*(Ta-25)))/(1-S9*Ltc*ThetaCa)","v":0.10157421629013341},{"$f":"N9/SQRT(12)","v":0.66794512525927452},{"$f":"RCoutEsr*V9^2","v":4.4615069035762797E-4},{"$f":"W9","v":4.4615069035762797E-4},{"$f":"SQRT(M9*(1-M9))*SQRT(K9^2+(N9^2)/12)","v":0.29824703500630484},{"$f":"RCinEsr*Y9^2","v":8.895129389005202E-5},{"$f":"Z9","v":8.895129389005202E-5},{"$f":"SQRT(M9)*SQRT(K9^2+(N9^2)/12)","v":0.35027337873202352},{"$f":"Rdson1*AB9^2","v":2.9445945563603419E-3},{"$f":"(Vin*K9/2)*Fsw*(Tr_buck+Tf_buck)","v":0},{"$f":"(0.5*Coss_Q1*(Vin-Q9)^2-0.5*Coss_Q2*(Vin-Q9)^2+(Qoss_Q2*(Vin-Q9)/Vin)*Vin)*Fsw","v":0},{"$f":"IF(K9>N9/2,0,ABS(K9-N9/2)*Vsd_Q1*Deadtime*Fsw)","v":2.8506382978723405E-2},{"$f":"(AF9+AE9+AD9+AC9*(1+RdsonTopTc*Ta-RdsonTopTc*25))/(1-AC9*RdsonTopTc*ThetaJA_Q1)","v":3.1456535139611788E-2},{"$f":"SQRT((1-M9))*SQRT(K9^2+(N9^2)/12)","v":0.5687347804638645},{"$f":"Rdson2*AH9^2","v":5.8222665091670423E-3},{"$f":"IF(K9<N9/2,Deadtime*Fsw*IF(VfdSky_Q2>0,0,Vsd_Q2)*(K9+N9/2),2*Deadtime*Fsw*IF(VfdSky_Q2>0,0,Vsd_Q2)*K9)","v":2.8506382978723401E-2},{"$f":"(AJ9+AI9*(1+RdsonBotTc*Ta-RdsonBotTc*25))/(1-AI9*RdsonBotTc*ThetaJA_Q2)","v":3.4340645911446047E-2},{"$f":"2*Deadtime*Fsw*IF(VfdSky_Q2>0,VfdSky_Q2,Vsd_Q2)*K9","v":0},{"$f":"IF(QrrSky_Q2>0,QrrSky_Q2,Qrr_Q2*K9/(Iout/Number_of_Phases))*Fsw*Vin","v":0},{"$f":"Rs*R9^2","v":2.2307534517881388E-3},{"$f":"Iq*Vin","v":2.6400000000000001E-5},{"$f":"IF(Ext_VCC=1,  (Qg_Q1+Qg_Q2)*Fsw*VCC, (Qg_Q1+Qg_Q2)*Fsw*Vout)","v":7.8099999999999989E-2},{"$f":"(Vin-VCC)*Fsw*(Qg_Q1+Qg_Q2)+(RdsonDRT+RdsonDRT2)*Fsw*Qg_Q1*VCC/(RdsonDRT+2*Rgate1+RdsonDRT2)+(RdsonDRB+RdsonDRB2)*Fsw*Qg_Q2*VCC/(RdsonDRB+2*Rgate2+RdsonDRB2)","v":0.12418352941176468},{"$f":"(Qg_Q1+Qg_Q2)*Fsw*(Vin-VCC)","v":0.10933999999999999},{"$f":"SUM(AO9:AP9)","v":7.8126399999999985E-2},{"$f":" SUM(U9,X9,AA9,AG9,AK9,AL9,AM9,AS9,AN9)","v":0.24826365277722706},{"$f":"Vout*K9","v":0},{"$f":"AU9/(AU9+AT9)","v":0},{"$f":"ThetaJA_Q1*BC9","v":0.47184802709417684},{"$f":"ThetaJA_Q2*BD9","v":0.51510968867169071},null,{"$f":"AV9*100","v":0},{"$f":"U9","v":0.10157421629013341},{"$f":"AG9+AK9+AM9","v":6.5797181051057835E-2},{"$f":"AG9+AM9*0.66","v":3.1456535139611788E-2},{"$f":"AK9+AM9*0.33","v":3.4340645911446047E-2},{"$f":"AN9","v":2.2307534517881388E-3},{"$f":"BB9+AS9","v":0.14392358105105782},{"$f":"BF9*$B$63","v":2.8209021886007335}]
[null,null,null,null,null,null,1,12,1,{"$f":"Iout*G10/100","v":0.04},0.04,1.2222222222222221E-2,0.27508925029750098,2.3142880845386191,{"$f":"K10+N10/2","v":1.1971440422693096},{"$f":"K10-N10/2","v":-1.1171440422693095},12,{"$f":"SQRT(K10^2+(N10^2)/12)","v":0.66927381904054728},1.5677460569859174E-3,0.1,0.10158048624952867,{"$f":"N10/SQRT(12)","v":0.66807742429535766},4.4632744485311935E-4,{"$f":"W10","v":4.4632744485311935E-4},{"$f":"SQRT(M10*(1-M10))*SQRT(K10^2+(N10^2)/12)","v":0.29887040786190794},8.9323520695543199E-5,{"$f":"Z10","v":8.9323520695543199E-5},{"$f":"SQRT(M10)*SQRT(K10^2+(N10^2)/12)","v":0.35102710008248622},2.9572805998156751E-3,1.988206789368055E-3,0,2.7526429201515788E-2,3.2477679327359628E-2,0.56983104501316828,5.8447335574943896E-3,2.9497629201515788E-2,3.5354761108530267E-2,1.9711999999999998E-3,7.92E-3,2.2396372242655962E-3,2.6400000000000001E-5,7.8099999999999989E-2,0.12418352941176468,0.10933999999999999,{"$f":"SUM(AO10:AP10)","v":7.8126399999999985E-2},0.26020581487523281,0.13200000000000001,{"$f":"AU10/(AU10+AT10)","v":0.33655798816239224},0.5655731899103944,0.56952541662795397,null,{"$f":"AV10*100","v":33.655798816239226},0.10158048624952867,7.5752440435889898E-2,3.7704879327359629E-2,3.7968361108530267E-2,2.2396372242655962E-3,{"$f":"BB10+AS10","v":0.1538788404358899},{"$f":"BF10*$B$63","v":3.016025272543442}]
["Vin",{"$f":"Vin","v":12},"V","Vin",null,null,2,12,1,0.08,0.08,2.4444444444444442E-2,0.27517850119000792,2.3147461969540153,1.2373730984770077,-1.0773730984770076,12,0.6729815473147015,1.5851645705913144E-3,0.1,0.10159804854075036,0.6682096699585317,4.4650416302608988E-4,4.4650416302608988E-4,0.30055637215340397,9.033413284201547E-5,9.033413284201547E-5,0.3530290197196746,2.9911077303416255E-3,3.9764135787361101E-3,0,2.6546473146473466E-2,3.352001017324422E-2,0.57295259338086213,5.9089441367133986E-3,3.0488873146473468E-2,3.6410726220019549E-2,3.9423999999999996E-3,1.584E-2,2.2645208151304492E-3,2.6400000000000001E-5,7.8099999999999989E-2,0.12418352941176468,0.10933999999999999,7.8126399999999985E-2,0.27223894404501264,0.26400000000000001,0.49231784250611887,0.65961615259866335,0.6245688933002933,null,49.231784250611888,0.10159804854075036,8.5770736393263769E-2,4.3974410173244223E-2,4.163792622001955E-2,2.2645208151304492E-3,0.16389713639326375,{"$f":"BF11*$B$63","v":3.2123838733079699}]
["Vout",{"$f":"Vout","v":3.3},"V","Vout",null,null,3,12,1,0.12,0.12,3.666666666666666E-2,0.27526775267752679,2.3152041244783828,1.2776020622391915,-1.0376020622391913,12,0.67902934018603078,1.6137829569171673E-3,0.1,0.10162690325807254,0.66834186224826309,4.4668084483347626E-4,4.4668084483347626E-4,0.3032878425142374,9.1983515416940874E-5,9.1983515416940874E-5,0.35625929876982365,3.0460965110391952E-3,5.9646203681041647E-3,0,2.5566514813573672E-2,3.4583552383012223E-2,0.57806587589435676,6.0148828237231774E-3,3.1480114813573677E-2,3.7508534203584305E-2,5.9135999999999998E-3,2.3759999999999996E-2,2.3054042241673818E-3,2.6400000000000001E-5,7.8099999999999989E-2,0.12418352941176468,0.10933999999999999,7.8126399999999985E-2,0.28436305842908682,0.39599999999999996,0.58204218335183833,0.7539772857451833,0.68024001305376458,null,58.204218335183832,0.10162690325807254,9.5852086586596524E-2,5.026515238301222E-2,4.5349334203584307E-2,2.3054042241673818E-3,0.17397848658659651,3.409978337097292]
["Fsw",{"$f":"Fsw/1000","v":2200},"kHz","Switching Frequency",null,null,4,12,1,0.16,0.16,4.8888888888888885E-2,0.27535700476006342,2.3156618671098723,1.3178309335549361,-0.99783093355493613,12,0.68735543224174178,1.6536012158128108E-3,0.1,0.10166705055648549,0.66847400116401812,4.468574902322317E-4,4.468574902322317E-4,0.30703754364415109,9.4272053207033988E-5,9.4272053207033988E-5,0.36068612308599318,3.1222675052833011E-3,7.9528271574722201E-3,0,2.4586554202793626E-2,3.566833082976819E-2,0.58511794609756029,6.1625341952176943E-3,3.2471354202793623E-2,3.864817864135893E-2,7.8847999999999991E-3,3.168E-2,2.3622874511611582E-3,2.6400000000000001E-5,7.8099999999999989E-2,0.12418352941176468,0.10933999999999999,7.8126399999999985E-2,0.29657817702221306,0.52800000000000002,0.64032739977033903,0.84865696244652278,0.736538679620384,null,64.032739977033899,0.10166705055648549,0.10599650947112711,5.6577130829768188E-2,4.9102578641358932E-2,2.3622874511611582E-3,0.18412290947112708,3.6088090256340912]
["Iout",{"$f":"Iout","v":4},"A","Max Output Current",null,null,5,12,1,0.2,0.2,6.1111111111111109E-2,0.27544625743762396,2.3161194248466366,1.3580597124233182,-0.95805971242331833,12,0.69787828392874229,1.7046193471276418E-3,0.1,0.10171849065169768,0.66860608670526345,4.4703409917932623E-4,4.4703409917932623E-4,0.31176935496973096,9.720013069824211E-5,9.720013069824211E-5,0.36626727926945646,3.2196412767228001E-3,9.9410339468402765E-3,0,2.3606591314110564E-2,3.6774370554555416E-2,0.59403903854534368,6.3518828276857729E-3,3.3462591314110557E-2,3.982965373941353E-2,9.8560000000000002E-3,3.9599999999999996E-2,2.435170495896631E-3,2.6400000000000001E-5,7.8099999999999989E-2,0.12418352941176468,0.10933999999999999,7.8126399999999985E-2,0.30888431967144081,0.66,0.68119587302621765,0.94365555831833137,0.79346480609120296,null,68.119587302621767,0.10171849065169768,0.11620402429396895,6.2910370554555423E-2,5.2897653739413533E-2,2.435170495896631E-3,0.19433042429396893,3.8088763161617916]
["Ta",{"$f":"Ta","v":25},"°C","Ambient Temperature",null,null,6,12,1,0.24,0.24,7.333333333333332E-2,0.2755355107102142,2.3165767976868246,1.3982883988434123,-0.91828839884341229,12,0.71050029671474813,1.7668373507111078E-3,0.1,0.10178122382013884,0.66873811887146473,4.4721067163174531E-4,4.4721067163174531E-4,0.31743996609711006,1.0076813207573439E-4,1.0076813207573439E-4,0.37295209641456517,3.3382383892804584E-3,1.1929240736208329E-2,0,2.2626626147501678E-2,3.7901696766940433E-2,0.60474573616663552,6.5829132974110664E-3,3.4453826147501677E-2,4.1052954327249071E-2,1.18272E-2,4.7519999999999993E-2,2.5240533581587254E-3,2.6400000000000001E-5,7.8099999999999989E-2,0.12418352941176468,0.10933999999999999,7.8126399999999985E-2,0.32128150707619457,0.79199999999999993,0.71141036203864139,1.0389734515041062,0.85101831490873603,null,71.141036203864132,0.10178122382013884,0.12647465109418948,6.926489676694042E-2,5.6734554327249068E-2,2.5240533581587254E-3,0.20460105109418947,4.0101806014461134]
["Vcc",{"$f":"VCC","v":5},"V","Subregulated VCC Voltage",null,null,7,12,1,0.28000000000000003,0.28000000000000003,8.5555555555555551E-2,0.27562476457784013,2.317033985628588,1.438516992814294,-0.87851699281429396,12,0.72511185864423122,1.8402552264127204E-3,0.1,0.10185525039896347,0.66887009766208838,4.4738720754649165E-4,4.4738720754649165E-4,0.32400068090035328,1.0497644122389255E-4,1.0497644122389255E-4,0.38068356320971058,3.4780794071530012E-3,1.3917447525576386E-2,0,2.1646658702944202E-2,3.9050334845601727E-2,0.6171444176596349,6.8556101804720972E-3,3.5445058702944204E-2,4.2318075857316222E-2,1.3798400000000001E-2,5.544000000000001E-2,2.6289360377324579E-3,2.6400000000000001E-5,7.8099999999999989E-2,0.12418352941176468,0.10933999999999999,7.8126399999999985E-2,0.33376976078838422,0.92400000000000004,0.73463365776962741,1.1346110226840262,0.90919913785974338,null,73.463365776962746,0.10185525039896347,0.13680841070291797,7.5640734845601743E-2,6.0613275857316226E-2,2.6289360377324579E-3,0.21493481070291795,4.2127222897771919]
["Components","Input Value","Units","Description",null,null,8,12,1,0.32,0.32,9.7777777777777769E-2,0.27571401904050774,2.3174909886700781,1.4787454943350391,-0.83874549433503898,12,0.74159537948977594,1.924872974082047E-3,0.1,0.10194057078605553,0.66900202307660084,4.4756370688058477E-4,4.4756370688058477E-4,0.33139921805324241,1.098254417263005E-4,1.098254417263005E-4,0.38940044164132864,3.6391848948110835E-3,1.590565431494444E-2,0,2.0666688980415363E-2,4.0220310338921879E-2,0.63113469476025719,7.169958052742214E-3,3.6436288980415364E-2,4.3625014404557433E-2,1.5769599999999998E-2,6.336E-2,2.7498185344029241E-3,2.6400000000000001E-5,7.8099999999999989E-2,0.12418352941176468,0.10933999999999999,7.8126399999999985E-2,0.34634910321254464,1.056,0.75302219510169222,1.2305686550838282,0.9680072160683616,null,75.302219510169223,0.10194057078605553,0.1472053247434793,8.2037910338921882E-2,6.4533814404557438E-2,2.7498185344029241E-3,0.22533172474347929,4.416501804972194]
["L",{"$f":"Lf*1000000","v":0.47},"uH","Filter Inductance",null,null,9,12,1,0.36,0.36,0.10999999999999999,0.27580327409822292,2.3179478068094466,1.5189739034047234,-0.7989739034047233,12,0.75982903971292137,2.020690593568711E-3,0.1,0.10203718544003375,0.6691338951144683,4.4774016959106029E-4,4.4774016959106029E-4,0.33958138474559224,1.1531551686573396E-4,1.1531551686573396E-4,0.3990392324592128,3.8215754169993042E-3,1.7893861104312493E-2,0,1.9686716979892382E-2,4.1411648965584039E-2,0.64661260469420367,7.5259414898896041E-3,3.7427516979892383E-2,4.497376666597247E-2,1.7740799999999998E-2,7.1279999999999982E-2,2.8867008479553013E-3,2.6400000000000001E-5,7.8099999999999989E-2,0.12418352941176468,0.10933999999999999,7.8126399999999985E-2,0.35901955760600229,1.1879999999999999,0.76792823604532734,1.3268467344837602,1.027442499989587,null,76.792823604532728,0.10203718544003375,0.1576654156315565,8.8456448965584022E-2,6.8496166665972469E-2,2.8867008479553013E-3,0.23579181563155649,4.6215195863785077]
["Rdcr",{"$f":"Rdcr*1000","v":3.5},"mW","Inductor DCR at 25°C",null,null,10,12,1,0.4,0.4,0.12222222222222222,0.27589252975099171,2.3184044400448429,1.5592022200224216,-0.75920222002242144,12,0.77969006382983375,2.1277080847223961E-3,0.1,0.10214509488025772,0.66926571377515687,4.4791659563497025E-4,4.4791659563497025E-4,0.34849253883569842,1.2144704962415078E-4,1.2144704962415078E-4,0.40953589274609692,4.0252715387362227E-3,1.9882067893680553E-2,0,1.8706742701352468E-2,4.2624376615171967E-2,0.66347339674445693,7.9235450673772953E-3,3.8418742701352468E-2,4.6364329960207271E-2,1.9712E-2,7.9199999999999993E-2,3.0395829781748513E-3,2.6400000000000001E-5,7.8099999999999989E-2,0.12418352941176468,0.10933999999999999,7.8126399999999985E-2,0.37178114807907092,1.32,0.78024276455544561,1.4234456492275795,1.087504949403109,null,78.024276455544566,0.10214509488025772,0.16818870657537924,9.4896376615171973E-2,7.2500329960207277E-2,3.0395829781748513E-3,0.24631510657537922,4.8277760888774335]
["LTc",{"$f":"Ltc*1000000","v":4000},"ppm","Inductor Series Resistance Temp Co",null,null,11,12,1,0.44,0.44,0.13444444444444442,0.27598178599881995,2.318860888374418,1.5994304441872089,-0.71943044418720903,12,0.80105741677446751,2.2459254473928404E-3,0.1,0.10226429968683497,0.66939747905813252,4.4809298496938294E-4,4.4809298496938294E-4,0.35807879395836967,1.2822042268268057E-4,1.2822042268268057E-4,0.42082725203432847,4.2502938253143416E-3,2.1870274683048606E-2,0,1.7726766144772831E-2,4.3858519348774307E-2,0.68161382682177063,8.3627533604631356E-3,3.9409966144772823E-2,4.7796702227166116E-2,2.16832E-2,8.7119999999999989E-2,3.208464924846915E-3,2.6400000000000001E-5,7.8099999999999989E-2,0.12418352941176468,0.10933999999999999,7.8126399999999985E-2,0.38463389959527428,1.452,0.79057671772255034,1.5203657902316146,1.1481945334074917,null,79.057671772255034,0.10226429968683497,0.17877522157594039,0.1013577193487743,7.6546302227166116E-2,3.208464924846915E-3,0.25690162157594038,5.0352717828884321]
["ThetaCa",{"$f":"ThetaCa","v":20},"°C/W","Core to Ambient Thermal Resistance",null,null,12,12,1,0.48,0.48,0.14666666666666664,0.27607104284171363,2.3193171517963238,1.6396585758981619,-0.67965857589816192,12,0.8238138974012178,2.3753426814298447E-3,0.1,0.1023948005006287,0.6695291909628619,4.4826933755138436E-4,4.4826933755138436E-4,0.36828795584652874,1.3563601842161473E-4,1.3563601842161473E-4,0.43285211303920601,4.4966628423001344E-3,2.3858481472416659E-2,0,1.6746787310130712E-2,4.5114103399592743E-2,0.70093393824873296,8.8435509441998142E-3,4.0401187310130704E-2,4.927088202764715E-2,2.3654399999999999E-2,9.5039999999999986E-2,3.3933466877569215E-3,2.6400000000000001E-5,7.8099999999999989E-2,0.12418352941176468,0.10933999999999999,7.8126399999999985E-2,0.39757783797159846,1.5839999999999999,0.79936299732814386,1.617607550993891,1.2095112304147071,null,79.93629973281439,0.1023948005006287,0.18942498542723987,0.10784050339959272,8.0634082027647144E-2,3.3933466877569215E-3,0.26755138542723989,5.244007154373902]
["Cin",{"$f":"Cin*1000000","v":44},"μF","Input Capacitance",null,null,13,12,1,0.52,0.52,0.15888888888888889,0.27616030027967881,2.3197732303087109,1.6798866151543554,-0.63988661515435541,12,0.84784765927498784,2.5159597866832657E-3,0.1,0.10253659802326646,0.66966084948881099,4.4844565333807598E-4,4.4844565333807598E-4,0.37907020315555834,1.4369421892039628E-4,1.4369421892039628E-4,0.44555205249284274,4.7643991555340378E-3,2.5846688261784715E-2,0,1.5766806197403317E-2,4.6391155173554063E-2,0.72133835462804197,9.3659223934348355E-3,4.1392406197403316E-2,5.0786868543000907E-2,2.5625599999999998E-2,0.10296000000000001,3.5942282666903795E-3,2.6400000000000001E-5,7.8099999999999989E-2,0.12418352941176468,0.10933999999999999,7.8126399999999985E-2,0.41061298987877026,1.716,0.80691691820138012,1.7151713276033109,1.2714550281450137,null,80.691691820138018,0.10253659802326646,0.20013802371655498,0.11434475517355407,8.4763668543000908E-2,3.5942282666903795E-3,0.27826442371655496,5.4539827048444778]
["RCinEsr",{"$f":"RCinEsr*1000","v":1},"mW","Input Capacitor ESR",null,null,14,12,1,0.56000000000000005,0.56000000000000005,0.1711111111111111,0.27624955831272124,2.3202291239097286,1.7201145619548643,-0.60011456195486423,12,0.87305322420032083,2.6677767630030147E-3,0.1,0.10268969301714952,0.66979245463544568,4.4862193228657553E-4,4.4862193228657553E-4,0.39037854187648385,1.5239540595760967E-4,1.5239540595760967E-4,0.45887195613856752,5.0535233311304511E-3,2.7834895051152771E-2,0,1.4786822806567854E-2,4.7689701249926345E-2,0.74273714068716146,9.9298522828105244E-3,4.2383622806567857E-2,5.2344661574812275E-2,2.7596800000000001E-2,0.11088000000000002,3.8111096614328781E-3,2.6400000000000001E-5,7.8099999999999989E-2,0.12418352941176468,0.10933999999999999,7.8126399999999985E-2,0.4237393828415652,1.8480000000000001,0.81347359382767837,1.8130575187488955,1.3340259236221843,null,81.347359382767834,0.10268969301714952,0.21091436282473863,0.12087050124992636,8.8935061574812291E-2,3.8111096614328781E-3,0.28904076282473862,5.6651989513648777]
["Cout",{"$f":"Cout*1000000","v":40},"μF","Output Capcitance",null,null,15,12,1,0.6,0.6,0.18333333333333329,0.276338816940847,2.3206848325975291,1.7603424162987644,-0.56034241629876458,12,0.89933207123621384,2.8307936102390644E-3,0.1,0.10285408630546311,0.6699240064022326,4.4879817435401862E-4,4.4879817435401862E-4,0.40216907018189618,1.6173996101097093E-4,1.6173996101097093E-4,0.47276033108215237,5.3640559354777521E-3,2.9823101840520821E-2,0,1.3806837137601559E-2,4.900976838193926E-2,0.765046301676645,1.0535325186764017E-2,4.3374837137601555E-2,5.3944261544605507E-2,2.9567999999999997E-2,0.11879999999999999,4.0439908717700918E-3,2.6400000000000001E-5,7.8099999999999989E-2,0.12418352941176468,0.10933999999999999,7.8126399999999985E-2,0.43695704523914297,1.9799999999999998,0.81921191106815527,1.9112665257290886,1.3972239231690826,null,81.921191106815527,0.10285408630546311,0.22175402992654475,0.12741776838193924,9.314826154460551E-2,4.0439908717700918E-3,0.29988042992654473,5.8776564265602769]
["RCoutEsr",{"$f":"Cout_ESR*1000","v":1},"mW","Output Capacitor ESR",null,null,16,12,1,0.64,0.64,0.19555555555555554,0.27642807616406206,2.3211403563702642,1.800570178185132,-0.52057017818513207,12,0.92659288767913406,3.0050103282414473E-3,0.1,0.10302977877218761,0.67005550478863796,4.4897437949755641E-4,4.4897437949755641E-4,0.41440109224918498,1.7172826525731753E-4,1.7172826525731753E-4,0.48716944071674162,5.6960175352383079E-3,3.1811308629888881E-2,0,1.2826849190481654E-2,5.0351383497408322E-2,0.78818799504261261,1.1182325679527282E-2,4.4366049190481649E-2,5.5585669493572437E-2,3.1539199999999996E-2,0.12672,4.2928718974877813E-3,2.6400000000000001E-5,7.8099999999999989E-2,0.12418352941176468,0.10933999999999999,7.8126399999999985E-2,0.45026600630541103,2.1120000000000001,0.82427038988248547,2.0097987524611249,1.4610490424035867,null,82.42703898824854,0.10302977877218761,0.23265705299098077,0.13398658349740833,9.7403269493572447E-2,4.2928718974877813E-3,0.31078345299098076,6.0913556786232235]
["Top Driver","Input Value","Units","Description",null,null,17,12,1,0.68,0.68,0.20777777777777778,0.27651733598237227,2.3215956952260823,1.8407978476130413,-0.48079784761304112,12,0.95475156332647948,3.190426916860248E-3,0.1,0.10321677136211026,0.67018694979412752,4.4915054767435644E-4,4.4915054767435644E-4,0.42703711732424116,1.8236069957259772E-4,1.8236069957259772E-4,0.50205530477845317,6.0494286973484523E-3,3.3799515419256937E-2,0,1.1846858965185334E-2,5.1714573699363213E-2,0.81209052365987566,1.1870838335127079E-2,4.5357258965185339E-2,5.7268887082323632E-2,3.3510400000000003E-2,0.13464000000000001,4.557752738371783E-3,2.6400000000000001E-5,7.8099999999999989E-2,0.12418352941176468,0.10933999999999999,7.8126399999999985E-2,0.46366629612941584,2.2440000000000002,0.82875796149908776,2.1086546054904485,1.5255013062348546,null,82.87579614990878,0.10321677136211026,0.24362346078168684,0.14057697369936323,0.10170008708232364,4.557752738371783E-3,0.32174986078168683,6.3062972713210623]
["RdsonDRT",0.7,"W","Drain to Source Resistance of pullup Top FET Driver",null,null,18,12,1,0.72,0.72,0.21999999999999997,0.27660659639578372,2.3220508491631358,1.8810254245815679,-0.4410254245815679,12,0.98373099922773766,3.3870433759456116E-3,0.1,0.10341506508083802,0.67031834141816782,4.4932667884160337E-4,4.4932667884160337E-4,0.44004277579783224,1.9363764453186126E-4,1.9363764453186126E-4,0.51737760183039583,6.4243099890185186E-3,3.5787722208624986E-2,0,1.0866866461689833E-2,5.3099366266680395E-2,0.83668817128356232,1.260084772738497E-2,4.634846646168983E-2,5.8993916590662859E-2,3.5481599999999995E-2,0.14255999999999996,4.8386333942080162E-3,2.6400000000000001E-5,7.8099999999999989E-2,0.12418352941176468,0.10933999999999999,7.8126399999999985E-2,0.47715794565576269,2.3759999999999999,0.83276146825930664,2.2078344940002057,1.5905807488599428,null,83.276146825930667,0.10341506508083802,0.25465328285734323,0.14718896626668038,0.10603871659066286,4.8386333942080162E-3,0.33277968285734322,6.5224817840039275]
["RdsonDRT2",{"$f":"RdsonDRT2","v":0.5},"W","Drain to Source Resistance of pulldown Top FET Driver",null,null,19,12,1,0.76,0.76,0.23222222222222222,0.27669585740430225,2.3225058181795748,1.9212529090897874,-0.40125290908978739,12,1.0134607900439454,3.5948597053477426E-3,0.1,0.103624660994811,0.67044967966022484,4.4950277295649813E-4,4.4950277295649813E-4,0.45338667868525739,2.0555948040924883E-4,2.0555948040924883E-4,0.53309950516346816,6.8206819777328308E-3,3.777592899799305E-2,0,9.8868716799723616E-3,5.4505788654719813E-2,0.86192093056785868,1.3372338429917342E-2,4.7339671679972356E-2,6.0760760917384492E-2,3.7452800000000001E-2,0.15048,5.1355138647824891E-3,2.6400000000000001E-5,7.8099999999999989E-2,0.12418352941176468,0.10933999999999999,7.8126399999999985E-2,0.49074098668506355,2.508,0.83635099234510757,2.3073388298207971,1.6562874137607673,null,83.635099234510761,0.103624660994811,0.26574654957210431,0.15382258865471982,0.11041916091738449,5.1355138647824891E-3,0.34387294957210429,6.739909811613245]
["Bottom Driver","Input Value","Units","Description",null,null,20,12,1,0.8,0.8,0.24444444444444444,0.27678511900793384,2.3229606022735498,1.961480301136775,-0.36148030113677487,12,1.0438768270137324,3.8138759049169027E-3,0.1,0.1038455602313168,0.67058096451976468,4.4967882997625793E-4,4.4967882997625793E-4,0.46704024149743456,2.1812658717798201E-4,2.1812658717798201E-4,0.54918747676490642,7.2385652312497118E-3,3.9764135787361106E-2,0,8.9068746200101339E-3,5.59338684959656E-2,0.88773416366660873,1.4185295016135357E-2,4.8330874620010129E-2,6.2569423580093875E-2,3.9424000000000001E-2,0.15839999999999999,5.4483941498812893E-3,2.6400000000000001E-5,7.8099999999999989E-2,0.12418352941176468,0.10933999999999999,7.8126399999999985E-2,0.50441545187441172,2.64,0.83958371290481804,2.407168027439484,1.7226213537014081,null,83.958371290481807,0.1038455602313168,0.27690329207605946,0.1604778684959656,0.11484142358009387,5.4483941498812893E-3,0.35502969207605944,6.9585819646907652]
["RdsonDRB",0.7,"W","Drain to Source Resistance of pullup Bottom FET Driver",null,null,21,12,1,0.84,0.84,0.25666666666666665,0.27687438120668445,2.3234152014432117,2.0017076007216059,-0.32170760072160587,10.723586690720197,1.0749208574858506,4.0440919745034082E-3,0.1,0.10407776397850579,0.67071219599625342,4.4985484985811668E-4,4.4985484985811668E-4,0.48097748856921874,2.3133934451035295E-4,2.3133934451035295E-4,0.5656110382292131,7.6779803176014816E-3,4.1752342576729155E-2,8.2451124382749742E-3,7.9268752817803698E-3,6.5632546138232592E-2,0.91407822602411215,1.5039702059244981E-2,4.932207528178037E-2,6.4419908715050836E-2,4.1395199999999993E-2,0.16632,5.7772742492905827E-3,2.6400000000000001E-5,7.8099999999999989E-2,0.12418352941176468,0.10933999999999999,7.8126399999999985E-2,0.52643028727544827,2.7719999999999998,0.84039975338988071,2.6310561920734887,1.7895826307257625,null,84.039975338988071,0.10407776397850579,0.29637245485328345,0.17540374613823259,0.11930550871505083,5.7772742492905827E-3,0.37449885485328344,7.340177555124356]
["RdsonDRB2",0.5,"W","Drain to Source Resistance of pulldown Bottom FET Driver",null,null,22,12,1,0.88,0.88,0.26888888888888884,0.27696364400056006,2.3238696156867107,2.0419348078433552,-0.28193480784335534,9.3978269281118454,1.1065400275450161,4.285507913957637E-3,0.1,0.10432127348540692,0.67084337408915728,4.5003083255932506E-4,4.5003083255932506E-4,0.49517484970231973,2.4519813177771495E-4,2.4519813177771495E-4,0.58234253254615564,8.1389478050944881E-3,4.3740549366097212E-2,1.642949875789524E-2,6.9468736652602758E-3,7.5292637765279974E-2,0.9409080759282783,1.5935544132246984E-2,5.0313273665260269E-2,6.6312221077036076E-2,4.3366399999999999E-2,0.17423999999999998,6.1221541627966246E-3,2.6400000000000001E-5,7.8099999999999989E-2,0.12418352941176468,0.10933999999999999,7.8126399999999985E-2,0.54847631545485653,2.9039999999999999,0.84113538650515096,2.8543655664791991,1.8571713161555412,null,84.113538650515096,0.10432127348540692,0.31584485884231606,0.19029103776527995,0.12381142107703608,6.1221541627966246E-3,0.39397125884231604,7.7218366733093946]
["Deadtime","Input Value","Units","Description",null,null,23,12,1,0.92,0.92,0.28111111111111109,0.27705290738956651,2.324323845002199,2.0821619225010997,-0.24216192250109947,8.0720640833699822,1.1386864265622694,4.5381237231300262E-3,0.1,0.10457609006194463,0.6709744987979428,4.5020677803715053E-4,4.5020677803715053E-4,0.50961095754552943,2.5970332805047141E-4,2.5970332805047141E-4,0.59935688666787734,8.6214882623090582E-3,4.5728756155465268E-2,2.4227222187591387E-2,5.9668697704270907E-3,8.4588092890792138E-2,0.96818288584385725,1.6872805807936909E-2,5.1304469770427095E-2,6.8246366039240655E-2,4.5337599999999999E-2,0.18215999999999999,6.4830338901857524E-3,2.6400000000000001E-5,7.8099999999999989E-2,0.12418352941176468,0.10933999999999999,7.8126399999999985E-2,0.57022749298825082,3.036,0.8418770046823254,3.0722053933618825,1.9253874905886099,null,84.187700468232535,0.10457609006194463,0.33499445893003277,0.20481369289079215,0.12835916603924066,6.4830338901857524E-3,0.41312085893003275,8.0971688350286417]
["Deadtime",{"$f":"Deadtime*1000000000","v":14},"ns","Total Deadtime",null,null,24,12,1,0.96,0.96,0.29333333333333328,0.27714217137370989,2.3247778893878248,2.1223889446939124,-0.20238894469391244,6.7462981564637481,1.1713166464491469,4.8019394018710649E-3,0.1,0.10484221507895644,0.67110557012207539,4.5038268624887585E-4,4.5038268624887585E-4,0.52426645143292028,2.7485531209806658E-4,2.7485531209806658E-4,0.61663138158396447,9.1256222580995711E-3,4.7716962944833317E-2,3.163828003065388E-2,4.9868635972580028E-3,9.3518933938751075E-2,0.99586566639016483,1.7851471658905087E-2,5.2295663597257999E-2,7.0222349593178149E-2,4.7308799999999998E-2,0.19007999999999997,6.8599134312443792E-3,2.6400000000000001E-5,7.8099999999999989E-2,0.12418352941176468,0.10933999999999999,7.8126399999999985E-2,0.59168385004047686,3.1679999999999997,0.84262404137142888,3.2845760090812659,1.9942312438976724,null,84.262404137142894,0.10484221507895644,0.35382128353192921,0.21897173393875105,0.13294874959317815,6.8599134312443792E-3,0.43194768353192919,8.4661745972258124]
["IQ","Input Value","Units","Description",null,null,25,12,1,1,1,0.30555555555555552,0.27723143595299604,2.3252317488417393,2.1626158744208697,-0.16261587442086967,5.4205291473623225,1.204391363781641,5.0769549500313043E-3,0.1,0.10511964996821144,0.67123658806102127,4.5055855715180114E-4,4.5055855715180114E-4,0.53912379134014743,2.9065446238897482E-4,2.9065446238897482E-4,0.63414543421292546,9.6513703615943944E-3,4.9705169734201374E-2,3.8662669590330705E-2,4.0068551457302292E-3,0.10208518054500891,1.0239229099003015,1.8871526257536617E-2,5.3286855145730228E-2,7.2240178348620149E-2,4.9279999999999997E-2,0.19799999999999995,7.2527927857590057E-3,2.6400000000000001E-5,7.8099999999999989E-2,0.12418352941176468,0.10933999999999999,7.8126399999999985E-2,0.61284541466714015,3.3,0.84337602186635985,3.4914777081751334,2.063702675229302,null,84.337602186635991,0.10511964996821144,0.372325358893629,0.23276518054500889,0.13758017834862013,7.2527927857590057E-3,0.45045175889362898,8.8288544743151292]
["IQ ",{"$f":"Iq*1000","v":2.2000000000000001E-3},"mA","Quiescent Current Of Controller (Not Switching!)",null,null,26,12,1,1.04,1.04,0.31777777777777777,0.27732070112743101,2.3256854233620938,2.2028427116810469,-0.12284271168104688,4.0947570560348963,1.2378749495418524,5.3631703674613526E-3,0.1,0.10540839622242951,0.67136755261424685,4.5073439070324352E-4,4.5073439070324352E-4,0.55416708409169435,3.0710115709069104E-4,3.0710115709069104E-4,0.65188039362408978,1.0198753142195958E-2,5.169337652356943E-2,4.5300388169827593E-2,3.0268444158209951E-3,0.11028684955261903,1.0523242575897152,1.9932954176011413E-2,5.4278044415820993E-2,7.4299859533554391E-2,5.1251199999999997E-2,0.20592000000000002,7.6616719535162183E-3,2.6400000000000001E-5,7.8099999999999989E-2,0.12418352941176468,0.10933999999999999,7.8126399999999985E-2,0.63371221280991297,3.4319999999999999,0.84413254563043971,3.6929107432892856,2.1338018930033158,null,84.413254563043978,0.10540839622242951,0.39050670908617346,0.24619404955261903,0.14225345953355439,7.6616719535162183E-3,0.46863310908617345,9.1852089380889996]
["High-side FET","Input Value","Units","Description",null,null,27,12,1,1.08,1.08,0.32999999999999996,0.27740996689702074,2.3261389129470404,2.2430694564735205,-8.3069456473520153E-2,2.7689818824506718,1.2717351087630382,5.6605856540118786E-3,0.1,0.10570845539530135,0.67149846378121869,4.5091018686053671E-4,4.5091018686053671E-4,0.5693819228511916,3.2419577406972032E-4,3.2419577406972032E-4,0.66981935281029004,1.0767791169580699E-2,5.3681583312937493E-2,5.1551433072307938E-2,2.0468314075075367E-3,0.11812395500711215,1.0810421922669535,2.1035739986304133E-2,5.5269231407507544E-2,7.6401400994165841E-2,5.3222400000000003E-2,0.21383999999999997,8.0865509343026835E-3,2.6400000000000001E-5,7.8099999999999989E-2,0.12418352941176468,0.10933999999999999,7.8126399999999985E-2,0.65428426829181219,3.5640000000000001,0.8448932725539704,3.8888753251066821,2.2045290149124876,null,84.489327255397043,0.10570845539530135,0.40836535600127799,0.25925835500711214,0.14696860099416584,8.0865509343026835E-3,0.48649175600127798,9.5352384176250489]
["RdsonTop",{"$f":"Rdson1*1000","v":24},"mW","Drain-Source Resistance of Top FET ",null,null,28,12,1,1.1200000000000001,1.1200000000000001,0.34222222222222221,0.27749923326177106,2.3265922175947256,2.2832961087973631,-4.3296108797362676E-2,1.443203626578756,1.305942550643415,5.9692008095335999E-3,0.1,0.10601982910150955,0.67162932156140165,4.5108594558102867E-4,4.5108594558102867E-4,0.58475524015742442,3.4193869089156712E-4,3.4193869089156712E-4,0.68794697632700019,1.1358505013699092E-2,5.5669790102305543E-2,5.7415801600893435E-2,1.0668161207670163E-3,0.12559650815171775,1.1100517570562045,2.2179868260184202E-2,5.6260416120767022E-2,7.854481119484058E-2,5.5193600000000002E-2,0.22176000000000004,8.527429727905142E-3,2.6400000000000001E-5,7.8099999999999989E-2,0.12418352941176468,0.10933999999999999,7.8126399999999985E-2,0.67456160281244559,3.6960000000000002,0.84565791215976305,4.079371622275767,2.2758841679226092,null,84.565791215976304,0.10601982910150955,0.42590131934655839,0.27195810815171778,0.1517256111948406,8.527429727905142E-3,0.50402771934655832,9.8789432991925441]
["RdsonTopTc",{"$f":"RdsonTopTc*1000000","v":4000},"ppm","Drain to Source Resistance Temp Co",null,null,29,12,1,1.1599999999999999,1.1599999999999999,0.35444444444444434,0.27758850022168813,2.3270453373033027,2.323522668651651,-3.5226686516514061E-3,0.1174222883883802,1.34047068853522,6.2890158338773034E-3,0.1,0.10634251901675017,0.67176012595426271,4.5126166682208692E-4,4.5126166682208692E-4,0.60027517424988242,3.603302848207267E-4,3.603302848207267E-4,0.70624934350340163,1.1970915244775658E-2,5.7657996891673585E-2,6.2893491058662876E-2,8.6798555576690642E-5,0.13270451742252867,1.1393302996160073,2.3365323569215814E-2,5.7251598555576676E-2,8.0730099218192963E-2,5.7164799999999995E-2,0.22967999999999997,8.9843083341104336E-3,2.6400000000000001E-5,7.8099999999999989E-2,0.12418352941176468,0.10933999999999999,7.8126399999999985E-2,0.69454423594322512,3.8279999999999994,0.84642621504433535,4.2643997613379296,2.347867488272894,null,84.642621504433535,0.10634251901675017,0.4431146166407216,0.28429331742252867,0.15652449921819295,8.9843083341104336E-3,0.52124101664072153,10.216323926158143]
["QgTop",{"$f":"Qg_Q1*1000000000","v":3},"nC","Gate Charge Of Top FET",null,null,30,12,1,1.2,1.2,0.36666666666666659,0.27767776777677766,2.3274982720709216,2.3637491360354606,3.6250863964539137E-2,0,1.3752953684722034,6.6200307268938271E-3,0.1,0.10667652687775535,0.67189087695926775,4.5143735054109388E-4,4.5143735054109388E-4,0.61593094809456816,3.7937093282067365E-4,3.7937093282067365E-4,0.72471380653874207,1.2605042433308958E-2,5.9646203681041642E-2,6.3360000000000014E-2,0,0.13571388687251965,1.1688572407070164,2.4592090484757956E-2,5.9135999999999994E-2,8.3851815971498891E-2,5.9135999999999994E-2,0.23759999999999998,9.4571867527054685E-3,2.6400000000000001E-5,7.8099999999999989E-2,0.12418352941176468,0.10933999999999999,7.8126399999999985E-2,0.71139262475784093,3.9599999999999995,0.84771294517451989,4.3879483030877946,2.4338972395724832,null,84.771294517451992,0.10667652687775535,0.45716570284401853,0.29252988687251963,0.16225981597149888,9.4571867527054685E-3,0.53529210284401851,10.491725215742763]
["QgdTop",{"$f":"Qgd_Q1*1000000000","v":0.7},"nC","Gate to Drain Charge",null,null,31,12,1,1.24,1.24,0.37888888888888883,0.27776703592704577,2.3279510218957316,2.4039755109478658,7.6024489052134214E-2,0,1.4103946244563783,6.9622454884340698E-3,0.1,0.10702185448231676,0.67202157457588252,4.516129966954484E-4,4.516129966954484E-4,0.63171276032216772,3.9906101155385253E-4,3.9906101155385253E-4,0.74332886256330111,1.3260907150071624E-2,6.1634410470409698E-2,6.3360000000000014E-2,0,0.13836540867071118,1.198613865586327,2.5860153577964354E-2,6.1107199999999993E-2,8.7102502623656708E-2,6.1107199999999993E-2,0.24551999999999999,9.9460649834772416E-3,2.6400000000000001E-5,7.8099999999999989E-2,0.12418352941176468,0.10933999999999999,7.8126399999999985E-2,0.72804010476841108,4.0919999999999996,0.84895559187398273,4.5061291300606676,2.5218615393548505,null,84.895559187398277,0.10702185448231676,0.4709879112943679,0.30040860867071117,0.16812410262365671,9.9460649834772416E-3,0.54911431129436794,10.762640501369612]
["QgsTop",{"$f":"Qgs_Q1*1000000000","v":0.7},"nC",null,null,null,32,{"$f":"Vin","v":12},{"$f":"MODE","v":1},1.28,{"$f":"Iout*G41/100/Number_of_Phases","v":1.28},{"$f":"Vout*K41/(Vin*Efficiency)","v":0.39111111111111108},{"$f":"(Vout+(Rdson2+Rs+Rdcr)*K41)/(Vin+(Rs+Rdson2-Rdson1)*K41)","v":0.27785630467249839},{"$f":"(Vin-(Rdson1+Rdcr)*K41-Vout)*M41/(Fsw*Lf)","v":2.3284035867758841},2.4442017933879421,0.11579820661205797,{"$f":"IF(MIN(Vin, -P41/(Coss_Q1+Coss_Q2)*0.00000002)<0, 0, MIN(Vin, -P41/(Coss_Q1+Coss_Q2)*0.00000002))","v":0},1.4457484584956564,{"$f":"R41^2*Rdcr","v":7.3156601183489833E-3},{"$f":"Core_Loss_Ch1","v":0.1},{"$f":"(T41+S41*(1+Ltc*(Ta-25)))/(1-S41*Ltc*ThetaCa)","v":0.10737850368930962},0.67215221880357345,4.517886052425669E-4,4.517886052425669E-4,0.6476116871873665,4.1940089738166746E-4,4.1940089738166746E-4,0.7620840386212423,{"$f":"Rdson1*AB41^2","v":1.3938529966110317E-2},{"$f":"(Vin*K41/2)*Fsw*(Tr_buck+Tf_buck)","v":6.3622617259777761E-2},{"$f":"(0.5*Coss_Q1*(Vin-Q41)^2-0.5*Coss_Q2*(Vin-Q41)^2+(Qoss_Q2*(Vin-Q41)/Vin)*Vin)*Fsw","v":6.3360000000000014E-2},{"$f":"IF(K41>N41/2,0,ABS(K41-N41/2)*Vsd_Q1*Deadtime*Fsw)","v":0},{"$f":"(AF41+AE41+AD41+AC41*(1+RdsonTopTc*Ta-RdsonTopTc*25))/(1-AC41*RdsonTopTc*ThetaJA_Q1)","v":0.14103909988909993},{"$f":"SQRT((1-M41))*SQRT(K41^2+(N41^2)/12)","v":1.2285831365118534},{"$f":"Rdson2*AH41^2","v":2.7169497419783455E-2},{"$f":"IF(K41<N41/2,Deadtime*Fsw*IF(VfdSky_Q2>0,0,Vsd_Q2)*(K41+N41/2),2*Deadtime*Fsw*IF(VfdSky_Q2>0,0,Vsd_Q2)*K41)","v":6.3078399999999993E-2},{"$f":"(AJ41+AI41*(1+RdsonBotTc*Ta-RdsonBotTc*25))/(1-AI41*RdsonBotTc*ThetaJA_Q2)","v":9.0395257041961191E-2},{"$f":"2*Deadtime*Fsw*IF(VfdSky_Q2>0,VfdSky_Q2,Vsd_Q2)*K41","v":6.3078399999999993E-2},{"$f":"IF(QrrSky_Q2>0,QrrSky_Q2,Qrr_Q2*K41/(Iout/Number_of_Phases))*Fsw*Vin","v":0.25344},{"$f":"Rs*R41^2","v":1.0450943026212833E-2},{"$f":"Iq*Vin","v":2.6400000000000001E-5},{"$f":"IF(Ext_VCC=1,  (Qg_Q1+Qg_Q2)*Fsw*VCC, (Qg_Q1+Qg_Q2)*Fsw*Vout)","v":7.8099999999999989E-2},0.12418352941176468,{"$f":"(Qg_Q1+Qg_Q2)*Fsw*(Vin-VCC)","v":0.10933999999999999},{"$f":"SUM(AO41:AP41)","v":7.8126399999999985E-2},{"$f":" SUM(U41,X41,AA41,AG41,AK41,AL41,AM41,AS41,AN41)","v":0.74477979314920784},{"$f":"Vout*K41","v":4.2240000000000002},0.85010811020925381,{"$f":"ThetaJA_Q1*BC41","v":4.6246424983364989},{"$f":"ThetaJA_Q2*BD41","v":2.6104568556294176},null,85.010811020925388,{"$f":"U41","v":0.10737850368930962},{"$f":"AG41+AK41+AM41","v":0.48487435693106112},{"$f":"AG41+AM41*0.66","v":0.30830949988909995},{"$f":"AK41+AM41*0.33","v":0.17403045704196118},{"$f":"AN41","v":1.0450943026212833E-2},0.56300075693106111,11.034814835848799]
["RGateTop",{"$f":"Rgate1","v":3.5},"W","Gate Resistance",null,null,33,12,1,{"$f":"Iout*G42/100","v":1.32},1.32,0.40333333333333332,0.27794557401314141,2.3288559667095292,2.4844279833547649,0.15557201664523546,0,1.4813386433020241,7.6802746164895859E-3,0.1,0.10774647641871797,0.67228280964180642,4.5196417613988134E-4,4.5196417613988134E-4,0.66361959462064712,4.4039096636447204E-4,4.4039096636447204E-4,0.78096978848805254,1.4637931452745764E-2,6.5610824049145811E-2,6.3360000000000014E-2,0,0.14373499448168664,1.2587495245714329,2.8520106580958545E-2,6.5049599999999999E-2,9.3730098124259406E-2,6.5049599999999999E-2,{"$f":"IF(QrrSky_Q2>0,QrrSky_Q2,Qrr_Q2*K42/(Iout/Number_of_Phases))*Fsw*Vin","v":0.26135999999999998},1.0971820880699408E-2,2.6400000000000001E-5,7.8099999999999989E-2,0.12418352941176468,0.10933999999999999,7.8126399999999985E-2,0.76161174504786777,4.3559999999999999,0.85117828725775202,4.7434889172252994,2.6996834718638909,null,85.117828725775198,0.10774647641871797,0.49882509260594604,0.31623259448168661,0.17997889812425941,1.0971820880699408E-2,0.57695149260594603,11.308249255076543]
["GfsTop",{"$f":"Gfs_Q1","v":71},"S","Transconductance of Top FET",null,null,34,12,1,1.36,1.36,0.41555555555555557,0.27803484394898087,2.3293081616948186,2.5246540808474096,0.19534591915259081,0,1.5171485455764842,8.056088982706943E-3,0.1,0.10812577465166039,0.67241334709004796,4.5213970934484133E-4,4.5213970934484133E-4,0.67972905945057183,4.6203159426155897E-4,4.6203159426155897E-4,0.7999774002425728,1.5359132181572772E-2,6.7599030838513874E-2,6.3360000000000014E-2,0,0.14645312659587412,1.2890988590662764,2.9911965632027557E-2,6.7020800000000005E-2,9.7107045388284477E-2,6.7020800000000005E-2,0.26928000000000002,1.1508698546724205E-2,2.6400000000000001E-5,7.8099999999999989E-2,0.12418352941176468,0.10933999999999999,7.8126399999999985E-2,0.77853601648614956,4.4880000000000004,0.85217303858759308,4.8626688989381117,2.789541680824267,null,85.217303858759308,0.10812577465166039,0.51284017198415865,0.32417792659587413,0.18596944538828447,1.1508698546724205E-2,0.59096657198415858,11.58294481088951]
["VthTop",{"$f":"Vth_Q1","v":1.8},"V","Threshold Voltage of Top FET",null,null,35,12,1,1.4,1.4,0.4277777777777777,0.27812411448002267,2.3297601717299004,2.5648800858649503,0.23511991413504973,0,1.5531629678867929,8.4431032168521877E-3,0.1,0.10851640043041662,0.67254383114776339,4.523152048149113E-4,4.523152048149113E-4,0.69593329890956568,4.8432315653115088E-4,4.8432315653115088E-4,0.8190989135543042,1.6102152724460198E-2,6.9587237627881909E-2,6.3360000000000014E-2,0,0.14919353057322959,1.3196181927470798,3.1345059143323244E-2,6.8991999999999998E-2,0.10052611897200081,6.8991999999999998E-2,0.27719999999999995,1.2061576024074554E-2,2.6400000000000001E-5,7.8099999999999989E-2,0.12418352941176468,0.10933999999999999,7.8126399999999985E-2,0.79555266436106753,4.6199999999999992,0.85309852684168708,4.9821829585984441,2.8800317845800123,null,85.309852684168703,0.10851640043041662,0.52691964954523041,0.3321455305732296,0.19200211897200081,1.2061576024074554E-2,0.60504604954523034,11.858902571086515]
["VspTop",{"$f":"Vsp_Q1","v":1.8563380281690141},"V",null,null,null,36,12,1,1.44,1.44,0.43999999999999995,0.27821338560627273,2.3302119968129253,2.6051059984064624,0.27489400159353727,0,1.5893680072618717,8.8413173187765048E-3,0.1,0.10891835585845523,0.67267426181441892,4.5249066250757343E-4,4.5249066250757343E-4,0.71222610758830585,5.0726602833038906E-4,5.0726602833038906E-4,0.83832704570747585,1.6867013653550984E-2,7.1575444417249973E-2,6.3360000000000014E-2,0,0.15195624095025195,1.350295681302043,3.2819371684973071E-2,7.096319999999999E-2,0.10398733963397179,7.096319999999999E-2,0.28511999999999993,1.2630453312537863E-2,2.6400000000000001E-5,7.8099999999999989E-2,0.12418352941176468,0.10933999999999999,7.8126399999999985E-2,0.8126617464460546,4.7519999999999998,0.85396026147230386,5.1020316142537787,2.9711540945095765,null,85.396026147230387,0.10891835585845523,0.54106358058422366,0.34013544095025194,0.19807693963397177,1.2630453312537863E-2,0.61918998058422359,12.136123619450784]
["VsdTop",{"$f":"Vsd_Q1","v":0.8},"V",null,null,null,37,12,1,1.48,1.48,0.45222222222222214,0.27830265732773707,2.3306636369420448,2.6453318184710222,0.31466818152897758,0,1.6257509287650205,9.2507312883311436E-3,0.1,0.10933164310046188,0.67280463908948096,4.5266608238032674E-4,4.5266608238032674E-4,0.72860180106511141,5.3086058451532413E-4,5.3086058451532413E-4,0.85765512545501443,1.7653735541262157E-2,7.3563651206618022E-2,6.3360000000000014E-2,0,0.15474129245914339,1.3811204756143001,3.4334887826899266E-2,7.2934399999999996E-2,0.10749072875375076,7.2934399999999996E-2,0.29303999999999997,1.3215330411901633E-2,2.6400000000000001E-5,7.8099999999999989E-2,0.12418352941176468,0.10933999999999999,7.8126399999999985E-2,0.82986332139215313,4.8839999999999995,0.85476318303148324,5.2222153868871501,3.0629089313062612,null,85.476318303148318,0.10933164310046188,0.5552720212128941,0.34814769245914334,0.20419392875375075,1.3215330411901633E-2,0.63339842121289402,12.414609055772724]
["θJATop",{"$f":"ThetaJA_Q1","v":15},"°C/W","Junction to Ambient Resistance",null,null,38,12,1,1.52,1.52,0.46444444444444444,0.27839192964442161,2.3311150921154078,2.6855575460577041,0.35444245394229612,0,1.6623000524546361,9.6713451253674001E-3,0.1,0.10975626438236843,0.67293496297241506,4.5284146439068562E-4,4.5284146439068562E-4,0.74505516550179407,5.5510719964090569E-4,5.5510719964090569E-4,0.87707703387171199,1.8462338960284805E-2,7.5551857995986099E-2,6.3360000000000014E-2,0,0.15754872002858653,1.4120826254314887,3.5891592138818741E-2,7.4905600000000003E-2,0.11103630833229453,7.4905600000000003E-2,0.30096000000000001,1.381620732195343E-2,2.6400000000000001E-5,7.8099999999999989E-2,0.12418352941176468,0.10933999999999999,7.8126399999999985E-2,0.8471574487292346,5.016,0.85551173473725406,5.342734800428798,3.1552966249844179,null,85.551173473725413,0.10975626438236843,0.56954502836088106,0.35618232002858652,0.21035310833229454,1.381620732195343E-2,0.6476714283608811,12.69435999587327]
["Low-side FET","Input Value","Units","Description",null,null,39,12,1,1.56,1.56,0.47666666666666663,0.2784812025563323,2.3315663623311651,2.7257831811655828,0.3942168188344175,0,1.6990046522879747,1.0103158829736636E-2,0.1,0.11019222199138309,0.67306523346268743,4.5301680849618194E-4,4.5301680849618194E-4,0.76158141256268297,5.8000624796097151E-4,5.8000624796097151E-4,0.89658715145229406,1.9292844483584135E-2,7.7540064785354149E-2,6.3360000000000014E-2,0,0.16037855878452617,1.4431729932155892,3.748946919024318E-2,7.6876799999999995E-2,0.11462410099240002,7.6876799999999995E-2,0.30887999999999999,1.4433084042480908E-2,2.6400000000000001E-5,7.8099999999999989E-2,0.12418352941176468,0.10933999999999999,7.8126399999999985E-2,0.86454418886724715,5.1479999999999997,0.85620992350159741,5.4635903817678928,3.2483175148860006,null,85.620992350159739,0.11019222199138309,0.58388265977692622,0.36423935878452618,0.21655450099240003,1.4433084042480908E-2,0.66200905977692615,12.975377571627753]
["RdsonBot",{"$f":"Rdson2*1000","v":18},"mW","Drain-Source Resistance of Low-side FET",null,null,40,12,1,1.6,1.6,0.48888888888888887,0.27857047606347513,2.3320174475874671,2.7660087237937336,0.43399127620626654,0,1.7358548656654347,1.0546172401290275E-2,0.1,0.11063951827602105,0.67319545055976415,4.531921146543639E-4,4.531921146543639E-4,0.77817613907664862,6.0555810342823957E-4,6.0555810342823957E-4,0.91618031077401763,2.0145272684399411E-2,7.9528271574722212E-2,6.3360000000000014E-2,0,0.16323084405095631,1.4743831770623228,3.9128503550478998E-2,7.8848000000000001E-2,0.11825412997916392,7.8848000000000001E-2,0.31679999999999997,1.5065960573271822E-2,2.6400000000000001E-5,7.8099999999999989E-2,0.12418352941176468,0.10933999999999999,7.8126399999999985E-2,0.88202360309749561,5.28,0.85686137218719438,5.5847826607643443,3.3419719496874589,null,85.686137218719438,0.11063951827602105,0.59828497403012015,0.37231884405095628,0.22279812997916393,1.5065960573271822E-2,0.67641137403012008,13.257662930990355]
["RdsonBotTc",{"$f":"RdsonBotTc*1000000","v":4000},"ppm","Drain To Source Resitance Temp Co",null,null,41,12,1,1.64,1.64,0.50111111111111095,0.27865975016585598,2.3324683478824642,2.806234173941232,0.47376582605876782,0,1.7728416124467508,1.1000385839879783E-2,0.1,0.1110981556461363,0.67332561426311122,4.5336738282279607E-4,4.5336738282279607E-4,0.79483529092151817,6.3176313969429446E-4,6.3176313969429446E-4,0.93585175411324328,2.1019644136244027E-2,8.1516478364090247E-2,6.3360000000000014E-2,0,0.16610561135071181,1.5057054416936804,4.0808679788627296E-2,8.0819199999999994E-2,0.1219264191604649,8.0819199999999994E-2,0.3247199999999999,1.5714836914113978E-2,2.6400000000000001E-5,7.8099999999999989E-2,0.12418352941176468,0.10933999999999999,7.8126399999999985E-2,0.89959575359394406,5.411999999999999,0.85746936452929556,5.7063121702606763,3.4362602874069732,null,85.74693645292956,0.1110981556461363,0.61275203051117666,0.38042081135071176,0.22908401916046489,1.5714836914113978E-2,0.69087843051117659,13.541217238019062]
["QgBot",{"$f":"Qg_Q2*1000000000","v":4.0999999999999996},"nC","Gate Charge Of Top FET",null,null,42,12,1,1.68,1.68,0.51333333333333331,0.27874902486348085,2.3329190632143049,2.8464595316071524,0.5135404683928475,0,1.8099565223946841,1.1465799145356705E-2,0.1,0.11156813657295407,0.67345572457219427,4.5354261295905919E-4,4.5354261295905919E-4,0.81155513066555196,6.5862173010958116E-4,6.5862173010958116E-4,0.95559709547018867,2.1915979412905462E-2,8.3504685153458311E-2,6.3360000000000014E-2,0,0.16900289640626545,1.5371326566331214,4.2529982473583951E-2,8.2790399999999986E-2,0.12564099302746926,8.2790399999999986E-2,0.33263999999999999,1.6379713064795291E-2,2.6400000000000001E-5,7.8099999999999989E-2,0.12418352941176468,0.10933999999999999,7.8126399999999985E-2,0.91726070341455268,5.5439999999999996,0.85803688389638688,5.8281794460939818,3.5311828954120386,null,85.803688389638694,0.11156813657295407,0.6272838894337347,0.38854529640626545,0.23541219302746924,1.6379713064795291E-2,0.70541028943373463,13.8260416729012]
["RGateBot",{"$f":"Rgate2","v":3},"W","Gate Resistance",null,null,43,12,1,1.72,1.72,0.52555555555555544,0.27883830015635575,2.3333695935811409,2.8866847967905702,0.55331520320942951,0,1.8471918701154872,1.1942412317572629E-2,0.1,0.11204946358910416,0.67358578148647974,4.5371780502075169E-4,4.5371780502075169E-4,0.82833220855125023,6.8613424772339196E-4,6.8613424772339196E-4,0.9754122865154109,2.283429908844533E-2,8.549289194282636E-2,6.3360000000000014E-2,0,0.17192273514052986,1.5686582407699674,4.4292396174039524E-2,8.4761599999999993E-2,0.1293978766951592,8.4761599999999993E-2,0.34055999999999997,1.7060589025103757E-2,2.6400000000000001E-5,7.8099999999999989E-2,0.12418352941176468,0.10933999999999999,7.8126399999999985E-2,0.93501851650264112,5.6759999999999993,0.85856664685348905,5.9503850271079468,3.6267401504273877,null,85.856664685348903,0.11204946358910416,0.64188061183568901,0.39669233514052982,0.24178267669515918,1.7060589025103757E-2,0.72000701183568894,14.112137431979503]
["VsdBot",{"$f":"Vsd_Q2","v":0.8},"V","Diode Forward Voltage of Bottom FET Body Diode",null,null,44,12,1,1.76,1.76,0.53777777777777769,0.27892757604448654,2.3338199389811214,2.9269099694905609,0.59309003050943931,0,1.8845405166685822,1.2430225356379205E-2,0.1,0.11254213928865497,0.67371578500543328,4.5389295896548722E-4,4.5389295896548722E-4,0.84516333645269892,7.1430106528385794E-4,7.1430106528385794E-4,0.99529358602540208,2.3774623737199307E-2,8.7481098732194423E-2,6.3360000000000014E-2,0,0.17486516367766453,1.6002761126075034,4.6095905458479282E-2,8.6732799999999999E-2,0.13319709590288428,8.6732799999999999E-2,0.34847999999999996,1.7757464794827437E-2,2.6400000000000001E-5,7.8099999999999989E-2,0.12418352941176468,0.10933999999999999,7.8126399999999985E-2,0.95286925768828035,5.8079999999999998,0.85906113232337655,6.0729294551649673,3.7229324385432641,null,85.90611323233766,0.11254213928865497,0.65654225958054879,0.40486196367766447,0.24819549590288426,1.7757464794827437E-2,0.73466865958054872,14.399505727778756]
["QrrBot",{"$f":"Qrr_Q2*1000000000","v":29.999999999999996},"nC","Reverse Recovery Charge of Body Diode",null,null,45,12,1,1.8,1.8,0.54999999999999993,0.27901685252787917,2.3342700994123979,2.967135049706199,0.63286495029380108,0,1.9219958571107529,1.2929238261628142E-2,0.1,0.11304616632714873,0.67384573512852131,4.5406807475089728E-4,4.5406807475089728E-4,0.86204556447901182,7.4312255523793812E-4,7.4312255523793812E-4,1.015237532423185,2.4736973933777225E-2,8.9469305521562473E-2,6.3360000000000014E-2,0,0.17783021834388835,1.6319806455685006,4.794049489518324E-2,8.8703999999999991E-2,0.13703867701493588,8.8703999999999991E-2,0.35639999999999994,1.8470340373754487E-2,2.6400000000000001E-5,7.8099999999999989E-2,0.12418352941176468,0.10933999999999999,7.8126399999999985E-2,0.97081299268971621,5.9399999999999995,0.85952260700490002,6.1958132751583248,3.8197601552240381,null,85.952260700490001,0.11304616632714873,0.67126889535882417,0.41305421834388834,0.25465067701493588,1.8470340373754487E-2,0.7493952953588241,14.688147789032953]
["TrrBot",{"$f":"Trr_Q2*1000000000","v":40},"ns","Reverse Recovery Time of Body Diode",null,null,46,12,1,1.84,1.84,0.56222222222222218,0.27910612960653963,2.3347200748731183,3.007360037436559,0.67263996256344094,0,1.9595517733233354,1.34394510331712E-2,0.1,0.11356154742163715,0.67397563185520903,4.5424315233462826E-4,4.5424315233462826E-4,0.87897615993348144,7.7259908973140916E-4,7.7259908973140916E-4,1.035240919083231,2.5721370253063029E-2,9.1457512310930536E-2,6.3360000000000014E-2,0,0.18081793566829671,1.6637666278028107,4.9826149052226057E-2,9.0675199999999997E-2,0.14092264702114463,9.0675199999999997E-2,0.36431999999999998,1.9199215761673143E-2,2.6400000000000001E-5,7.8099999999999989E-2,0.12418352941176468,0.10933999999999999,7.8126399999999985E-2,0.98884978811481772,6.0720000000000001,0.85995314759714891,6.3190370350244507,3.9172237053171695,null,85.995314759714887,0.11356154742163715,0.68606058268944126,0.42126913566829671,0.26114824702114464,1.9199215761673143E-2,0.76418698268944119,14.978064860713049]
["θJABot",{"$f":"ThetaJA_Q2","v":15},"°C/W","Junction to Ambient Resistance",null,null,47,12,1,1.88,1.88,0.57444444444444442,0.27919540728047393,2.3351698653614341,3.0475849326807172,0.71241506731928284,0,1.9972025915450702,1.3960863670860206E-2,0.1,0.11408828535071809,0.67410547518496311,4.5441819167434496E-4,4.5441819167434496E-4,0.89595258837109037,8.0273104060885644E-4,8.0273104060885644E-4,1.0553007720987804,2.6727833270214767E-2,9.3445719100298585E-2,6.3360000000000014E-2,0,0.18382835238368433,1.6956292260049255,5.1752852497477124E-2,9.264639999999999E-2,0.14484903353750123,9.264639999999999E-2,0.37223999999999996,1.9944090958371723E-2,2.6400000000000001E-5,7.8099999999999989E-2,0.12418352941176468,0.10933999999999999,7.8126399999999985E-2,1.0069797114625585,6.2039999999999997,0.86035466028813457,6.4426012857552646,4.0153235030625183,null,86.03546602881346,0.11408828535071809,0.70091738592118547,0.4295067523836843,0.26768823353750121,1.9944090958371723E-2,0.77904378592118539,15.269258204055236]
["Bottom Schottky","Input Value","Units","Std Units",null,null,48,12,1,1.92,1.92,0.58666666666666656,0.27928468554968794,2.3356194708754954,3.0878097354377476,0.75219026456225224,0,2.0349430440992022,1.4493476174547049E-2,0.1,0.11462638295457318,0.67423526511724929,4.5459319272772748E-4,4.5459319272772748E-4,0.91297249652640866,8.3351877941366327E-4,8.3351877941366327E-4,1.0754143302440979,2.7756383560664684E-2,9.5433925889666635E-2,6.3360000000000014E-2,0,0.18686150542737323,1.7275639528056164,5.3720589798600581E-2,9.4617599999999996E-2,0.14881786480679995,9.4617599999999996E-2,0.38015999999999994,2.070496596363864E-2,2.6400000000000001E-5,7.8099999999999989E-2,0.12418352941176468,0.10933999999999999,7.8126399999999985E-2,1.0252028311245263,6.3359999999999994,0.86072889789291229,6.5665065814105974,4.114059972101999,null,86.072889789291224,0.11462638295457318,0.7158393702341731,0.43776710542737318,0.27427066480679996,2.070496596363864E-2,0.79396577023417314,15.561729096589795]
["VfdSky",{"$f":"VfdSky_Q2","v":0},"V","Diode Forward Voltage",null,null,49,12,1,1.96,1.96,0.5988888888888888,0.27937396441418766,2.3360688914134511,3.1280344457067253,0.79196555429327442,0,2.0727682348618894,1.5037288544083654E-2,0.1,0.11517584313500599,0.67436500165153335,4.547681554524726E-4,4.547681554524726E-4,0.93003369690995585,8.6496267738799958E-4,8.6496267738799958E-4,1.0955790268947414,2.8807041700119083E-2,9.7422132679034698E-2,6.3360000000000014E-2,0,0.18991743194204583,1.7595666373516077,5.5729345523055189E-2,9.6588799999999989E-2,0.15282916969930563,9.6588799999999989E-2,0.38807999999999993,2.1481840777262364E-2,2.6400000000000001E-5,7.8099999999999989E-2,0.12418352941176468,0.10933999999999999,7.8126399999999985E-2,1.0435192163864602,6.468,0.86107747496538223,6.6907534791306862,4.2134335454895844,null,86.107747496538224,0.11517584313500599,0.73082660164135138,0.44605023194204574,0.28089556969930563,2.1481840777262364E-2,0.80895300164135131,15.855478832170487]
["QrrSky",{"$f":"QrrSky_Q2*1000000000","v":0},"nC","Diode Reverse Recovery Charge",null,null,50,12,1,2,2,0.61111111111111105,0.27946324387397897,2.3365181269734512,3.1682590634867256,0.83174093651327441,0,2.1106736080707256,1.5592300779322032E-2,0.1,0.11573666885548135,0.67449468478728114,4.5494307980629376E-4,4.5494307980629376E-4,0.94713415389416389,8.9706310547281378E-4,8.9706310547281378E-4,1.1157924736959832,2.9879828264558435E-2,9.9410339468402747E-2,6.3360000000000014E-2,0,0.19299616927658328,1.7916333987313624,5.7779104238094472E-2,9.8559999999999995E-2,0.15688297771344373,9.8559999999999995E-2,0.39599999999999991,2.2274715399031475E-2,2.6400000000000001E-5,7.8099999999999989E-2,0.12418352941176468,0.10933999999999999,7.8126399999999985E-2,1.0619289374298189,6.6,0.86140188115787442,6.8153425391487481,4.3134446657016552,null,86.140188115787439,0.11573666885548135,0.74587914699002689,0.45435616927658318,0.28756297771344369,2.2274715399031475E-2,0.82400554699002693,16.150508721004528]
["Ireverse",{"$f":"Ireverse","v":0},"mA","Reverse Leakage Current",null,null,51,12,1,2.04,2.04,0.62333333333333318,0.27955252392906788,2.3369671775536456,3.208483588776823,0.87151641122317725,0,2.1486549201179144,1.6158512880114224E-2,0.1,0.11630886314116526,0.67462431452395866,4.5511796574692113E-4,4.5511796574692113E-4,0.96427197113045915,9.2982043430782108E-4,9.2982043430782108E-4,1.1360524457934256,3.0974763830237378E-2,0.1013985462577708,6.3360000000000014E-2,0,0.19609775498690973,1.8237606219440361,5.9869850510766542E-2,0.1005312,0.16097931897651346,0.1005312,0.40391999999999995,2.3083589828734607E-2,2.6400000000000001E-5,7.8099999999999989E-2,0.12418352941176468,0.10933999999999999,7.8126399999999985E-2,1.0804320653333779,6.7319999999999993,0.86170349306105964,6.9402743248036458,4.4140937846477009,null,86.170349306105962,0.11630886314116526,0.76099707396342309,0.4626849549869097,0.29427291897651342,2.3083589828734607E-2,0.83912347396342302,16.446820089683094]
["Controller","Input Value","Units","Std Units",null,null,52,12,1,2.08,2.08,0.63555555555555554,0.27964180457946042,2.3374160431521869,3.2487080215760935,0.91129197842390663,0,2.1867082140130409,1.6735924846312363E-2,0.1,0.11689242907896584,0.67475389086103255,4.5529281323210226E-4,4.5529281323210226E-4,0.98144538015698879,9.6323503423149633E-4,9.6323503423149633E-4,1.1563568684609704,3.2091868973684684E-2,0.10338675304713886,6.3360000000000014E-2,0,0.19922222683684118,1.8559449361431068,6.2001568907914334E-2,0.10250239999999999,0.16511822424542463,0.10250239999999999,0.41184000000000004,2.3908464066160519E-2,2.6400000000000001E-5,7.8099999999999989E-2,0.12418352941176468,0.10933999999999999,7.8126399999999985E-2,1.0990286720748557,6.8639999999999999,0.86198358472210657,7.0655494025526187,4.51538136368137,null,86.198358472210657,0.11689242907896584,0.77618045108226585,0.47103662683684122,0.30102542424542467,2.3908464066160519E-2,0.85430685108226578,16.744414281212411]
["θJA",30,"°C/W","Junction to Ambient Resistance",null,null,53,12,1,2.12,2.12,0.64777777777777767,0.27973108582516243,2.337864723767221,3.2889323618836106,0.95106763811638961,0,2.2248297962360177,1.7324536677768603E-2,0.1,0.11748736981757493,0.67488341379796757,4.5546762221959874E-4,4.5546762221959874E-4,0.99865273007239985,9.9730727528105751E-4,9.9730727528105751E-4,1.176703804979955,3.3231164271703299E-2,0.10537495983650691,6.3360000000000014E-2,0,0.2023696227989403,1.8881831949165568,6.4174243996175329E-2,0.1044736,0.16929972490745712,0.1044736,0.41975999999999997,2.4749338111098002E-2,2.6400000000000001E-5,7.8099999999999989E-2,0.12418352941176468,0.10933999999999999,7.8126399999999985E-2,1.1177188305325707,6.9959999999999996,0.86224333701008904,7.1911683419841053,4.6173078736118569,null,86.224333701008902,0.11748736981757493,0.79142934770639739,0.47941122279894033,0.30782052490745715,2.4749338111098002E-2,0.86955574770639732,17.043292655045388]
["Theta Ja",19.600000000000001,"°C/W","Junction to Ambient Resistance",null,null,54,12,1,2.16,2.16,0.65999999999999992,0.2798203676661799,2.3383132193968996,3.3291566096984502,0.99084339030155033,0,2.2630162157322671,1.7924348374335167E-2,0.1,0.11809368856751071,0.67501288333423026,4.5564239266719116E-4,4.5564239266719116E-4,1.0158924781651173,1.0320375271924633E-3,1.0320375271924633E-3,1.1970914456397055,3.4392670301370241E-2,0.10736316662587499,6.3360000000000014E-2,0,0.20553998105537649,1.9204724583923172,6.6387860341981741E-2,0.10644480000000001,0.17352385298104425,0.10644480000000001,0.42767999999999995,2.5606211963335956E-2,2.6400000000000001E-5,7.8099999999999989E-2,0.12418352941176468,0.10933999999999999,7.8126399999999985E-2,1.1365026144871271,7.1280000000000001,0.86248384597339056,7.3171317158306479,4.7198737947156637,null,86.248384597339054,0.11809368856751071,0.80674383403642069,0.48780878105537651,0.31465825298104422,2.5606211963335956E-2,0.88487023403642073,17.343456587113849]
[null,null,null,null,null,null,55,12,1,2.2000000000000002,2.2000000000000002,0.67222222222222217,0.27990965010251878,2.3387615300393731,3.3693807650196868,1.0306192349803136,0,2.3012642448299316,1.8535359935864363E-2,0.1,0.11871138860116107,0.67514229946928661,4.5581712453267585E-4,4.5581712453267585E-4,1.0331631813999171,1.0674261594003983E-3,1.0674261594003983E-3,1.2175180977442874,3.557640764003684E-2,0.10935137341524304,6.3360000000000014E-2,0,0.20873333999879171,1.9528099769813261,6.8642402511560521E-2,0.108416,0.17779064111657927,0.108416,0.43559999999999999,2.6479085622663379E-2,2.6400000000000001E-5,7.8099999999999989E-2,0.12418352941176468,0.10933999999999999,7.8126399999999985E-2,1.1553800986231284,7.26,0.86270613031345256,7.4434400999818759,4.8230796167486893,null,86.270613031345249,0.11871138860116107,0.82212398111537099,0.49622933999879171,0.32153864111657926,2.6479085622663379E-2,0.90025038111537103,17.644907469861273]
[null,null,null,null,null,null,56,12,1,2.2400000000000002,2.2400000000000002,0.68444444444444441,0.27999893313418506,2.3392096556927897,3.4096048278463948,1.0703951721536054,0,2.3395708618834066,1.9157571362208532E-2,0.1,0.1193404732528278,0.67527166220260204,4.5599181777386511E-4,4.5599181777386511E-4,1.0504634886745294,1.1034735410382632E-3,1.1034735410382632E-3,1.2379821765230254,3.6782396865328498E-2,0.11133958020461109,6.3360000000000014E-2,0,0.21194973823317129,1.9851931765914315,7.0937855070933198E-2,0.1103872,0.18210012259724537,0.1103872,0.44352000000000008,2.7367959088869333E-2,2.6400000000000001E-5,7.8099999999999989E-2,0.12418352941176468,0.10933999999999999,7.8126399999999985E-2,1.174351358530926,7.3920000000000003,0.86291113808197561,7.5700940734975708,4.926925838958681,null,86.291113808197565,0.1193404732528278,0.83756986083041673,0.50467293823317139,0.32846172259724538,2.7367959088869333E-2,0.91569626083041666,17.947646712276168]
["Outputs",null,null,null,null,null,57,12,1,2.2799999999999998,2.2799999999999998,0.69666666666666655,0.28008821676118462,2.3396575963553001,3.4498287981776499,1.1101712018223497,0,2.3779332354691096,1.9790982653220057E-2,0.1,0.11998094591877169,0.67540097153364265,4.5616647234858839E-4,4.5616647234858839E-4,1.0677921337686314,1.1401800409381669E-3,1.1401800409381669E-3,1.2584821968536932,3.8010658555144745E-2,0.11332778699397913,6.3360000000000014E-2,0,0.21518921457472084,2.0176196451637978,7.3274202585916007E-2,0.11235839999999998,0.18645233133986883,0.11235839999999998,0.45143999999999995,2.8272832361742939E-2,2.6400000000000001E-5,7.8099999999999989E-2,0.12418352941176468,0.10933999999999999,7.8126399999999985E-2,1.193416470708391,7.5239999999999991,0.8630997526941131,7.6970942186208138,5.0314129700980317,null,86.309975269411311,0.11998094591877169,0.85308154591458962,0.5131396145747209,0.3354275313398688,2.8272832361742939E-2,0.93120794591458966,18.251675739925957]
["Design","Value","Units",null,null,null,58,12,1,2.3199999999999998,2.3199999999999998,0.70888888888888868,0.28017750098352345,2.3401053520250539,3.4900526760125268,1.1499473239874729,0,2.4163487099784855,2.0435593808751418E-2,0.1,0.1206328100572585,0.67553022746187441,4.5634108821469176E-4,4.5634108821469176E-4,1.0851479289161057,1.1775460276309136E-3,1.1775460276309136E-3,1.2790167657172484,3.9261213287659462E-2,0.11531599378334717,6.3360000000000014E-2,0,0.21845180805274869,2.0500871203997355,7.5651429622119834E-2,0.11432959999999999,0.1908473018957963,0.11432959999999999,0.45935999999999994,2.9193705441073456E-2,2.6400000000000001E-5,7.8099999999999989E-2,0.12418352941176468,0.10933999999999999,7.8126399999999985E-2,1.2125755125627224,7.6559999999999988,0.86327279833778758,7.8244411207912306,5.1365415284369451,null,86.327279833778761,0.1206328100572585,0.86865910994854501,0.52162940805274871,0.34243610189579632,2.9193705441073456E-2,0.94678550994854493,18.556995994991482]
["Dmax",{"$f":"D1_Vinmin","v":0.27499999999999997},"index",null,null,null,59,12,1,2.36,2.36,0.72111111111111104,0.28026678580120751,2.3405529227002009,3.5302764613501001,1.1897235386498994,0,2.4548147924701036,2.1091404828655135E-2,0.1,0.12129606918860565,0.6756594299867632,4.5651566533003781E-4,4.5651566533003781E-4,1.1025297589389571,1.2155718693459949E-3,1.2155718693459949E-3,1.2995845753118014,4.0534081641320524E-2,0.11730420057271525,6.3360000000000014E-2,0,0.22173755791055338,2.0825934785602502,7.8069520744950285E-2,0.11630079999999998,0.195285069451795,0.11630079999999998,0.46727999999999992,3.0130578326650191E-2,2.6400000000000001E-5,7.8099999999999989E-2,0.12418352941176468,0.10933999999999999,7.8126399999999985E-2,1.23182856241228,7.7879999999999994,0.86343104484872413,7.9521353686582996,5.2423120417769251,null,86.343104484872413,0.12129606918860565,0.88430262736234833,0.53014235791055331,0.34948746945179499,3.0130578326650191E-2,0.96242902736234837,18.863608936302029]
["Dprime",{"$f":"1-B68","v":0.72500000000000009},"index",null,null,null,60,12,1,2.4,2.4,0.73333333333333317,0.28035607121424283,2.3410003083788906,3.5705001541894452,1.2294998458105546,0,2.4933291406576279,2.1758415712783769E-2,0.1,0.12197072689522991,0.67578857910777479,4.5669020365250517E-4,4.5669020365250517E-4,1.1199365758879292,1.2542579340115794E-3,1.2542579340115794E-3,1.320184396761334,4.1829284194850103E-2,0.11929240736208328,6.3360000000000014E-2,0,0.22504650360631775,2.1151367242333099,8.0528460519607492E-2,0.11827199999999999,0.19976566983097688,0.11827199999999999,0.47519999999999996,3.1083451018262528E-2,2.6400000000000001E-5,7.8099999999999989E-2,0.12418352941176468,0.10933999999999999,7.8126399999999985E-2,1.2511756994884511,7.919999999999999,0.86357521211176447,8.0801775540947656,5.3487250474646526,null,86.357521211176447,0.12197072689522991,0.90001217343729456,0.53867850360631775,0.35658166983097683,3.1083451018262528E-2,0.97813857343729449,19.171516039370974]
["Ipp",{"$f":"Iripple_Vinnom","v":2.3337796129597033},"A",null,null,null,61,12,1,2.44,2.44,0.74555555555555542,0.28044535722263525,2.3414475090592726,3.6107237545296362,1.2692762454703637,0,2.5318895519236198,2.2436626460989959E-2,0.1,0.12265678682169585,0.67591767482437493,4.5686470313998945E-4,4.5686470313998945E-4,1.1373673941407412,1.2936045892545001E-3,1.2936045892545001E-3,1.3408150743615572,4.3146841527244517E-2,0.12128061415145135,6.3360000000000014E-2,0,0.22837868481400811,2.1477149809750826,8.3028233511086375E-2,0.12024319999999999,0.2042891394937463,0.12024319999999999,0.48311999999999999,3.2052323515699942E-2,2.6400000000000001E-5,7.8099999999999989E-2,0.12418352941176468,0.10933999999999999,7.8126399999999985E-2,1.2706170039375446,8.0519999999999996,0.86370597404131466,8.2085682722101225,5.4557810924061947,null,86.370597404131473,0.12265678682169585,0.91578782430775441,0.54723788481400815,0.36371873949374633,3.2052323515699942E-2,0.99391422430775433,19.480718796431987]
["Top FET","Value","Units",null,null,null,62,12,1,2.48,2.48,0.75777777777777766,0.28053464382639076,2.3418945247394976,3.6509472623697485,1.3090527376302512,0,2.5704939532608133,2.3126037073126417E-2,0.1,0.12335425267476517,0.67604671713602982,4.5703916375040312E-4,4.5703916375040312E-4,1.1548212859140798,1.333612202400249E-3,1.333612202400249E-3,1.3614755203114248,4.4486774217774361E-2,0.1232688209408194,6.3360000000000014E-2,0,0.23173414142427926,2.1803264827413207,8.556882428417649E-2,0.12221439999999999,0.20885551553877157,0.12221439999999999,0.49103999999999998,3.3037195818752023E-2,2.6400000000000001E-5,7.8099999999999989E-2,0.12418352941176468,0.10933999999999999,7.8126399999999985E-2,1.2901525568227186,8.1839999999999993,0.86382396218713753,8.33730812136419,5.5634807330815734,null,86.382396218713751,0.12335425267476517,0.93162965696305089,0.55582054142427928,0.37089871553877157,3.3037195818752023E-2,1.0097560569630508,19.791218716475797]
["Tr",{"$f":"(Qgd_Q1+Qgs_Q1/2)*(RdsonDRT+Rgate1)/(VCC-Vsp_Q1)*1000000000","v":1.5030241935483868},"ns","Turn on of MOSFET -> Rise time of current",null,null,63,12,1,2.52,2.52,0.76999999999999991,0.28062393102551536,2.3423413554177142,3.6911706777088571,1.3488293222911429,0,2.6091403920528453,2.3826647549045864E-2,0.1,0.12406312822344684,0.67617570604220512,4.5721358544167456E-4,4.5721358544167456E-4,1.1722973771500813,1.3742811404729601E-3,1.3742811404729601E-3,1.3821647098842258,4.5849102845984306E-2,0.12525702773018749,6.3360000000000014E-2,0,0.23511291354538552,2.2129695660339137,8.8150217403461892E-2,0.12418559999999999,0.21346483570397989,0.12418559999999999,0.4989599999999999,3.4038067927208378E-2,2.6400000000000001E-5,7.8099999999999989E-2,0.12418352941176468,0.10933999999999999,7.8126399999999985E-2,1.309782440125935,8.3159999999999989,0.86392976900599883,8.4663977031807818,5.671824535559697,null,86.392976900599876,0.12406312822344684,0.94753774924936529,0.56442651354538542,0.37812163570397983,3.4038067927208378E-2,1.0256641492493652,20.10301732528756]
["Tf",{"$f":"(Qgd_Q1+Qgs_Q1/2)*(RdsonDRT2+Rgate1)/(Vsp_Q1)*1000000000","v":2.2625189681335356},"ns","Turn off of MOSFET -> Fall time of current",null,null,64,{"$f":"Vin","v":12},{"$f":"MODE","v":1},2.56,{"$f":"Iout*G73/100/Number_of_Phases","v":2.56},{"$f":"Vout*K73/(Vin*Efficiency)","v":0.78222222222222215},{"$f":"(Vout+(Rdson2+Rs+Rdcr)*K73)/(Vin+(Rs+Rdson2-Rdson1)*K73)","v":0.28071321882001493},{"$f":"(Vin-(Rdson1+Rdcr)*K73-Vout)*M73/(Fsw*Lf)","v":2.342788001092071},3.7313940005460355,1.3886059994539646,{"$f":"IF(MIN(Vin, -P73/(Coss_Q1+Coss_Q2)*0.00000002)<0, 0, MIN(Vin, -P73/(Coss_Q1+Coss_Q2)*0.00000002))","v":0},2.6478270276156164,{"$f":"R73^2*Rdcr","v":2.4538457888601126E-2},{"$f":"Core_Loss_Ch1","v":0.1},{"$f":"(T73+S73*(1+Ltc*(Ta-25)))/(1-S73*Ltc*ThetaCa)","v":0.1247834172990482},0.67630464154236625,4.5738796817174852E-4,4.5738796817174852E-4,1.1897948437421504,1.4156117701954081E-3,1.4156117701954081E-3,1.4028816769969907,{"$f":"Rdson1*AB73^2","v":4.7233847991693334E-2},{"$f":"(Vin*K73/2)*Fsw*(Tr_buck+Tf_buck)","v":0.12724523451955552},{"$f":"(0.5*Coss_Q1*(Vin-Q73)^2-0.5*Coss_Q2*(Vin-Q73)^2+(Qoss_Q2*(Vin-Q73)/Vin)*Vin)*Fsw","v":6.3360000000000014E-2},{"$f":"IF(K73>N73/2,0,ABS(K73-N73/2)*Vsd_Q1*Deadtime*Fsw)","v":0},{"$f":"(AF73+AE73+AD73+AC73*(1+RdsonTopTc*Ta-RdsonTopTc*25))/(1-AC73*RdsonTopTc*ThetaJA_Q1)","v":0.23851504150409708},{"$f":"SQRT((1-M73))*SQRT(K73^2+(N73^2)/12)","v":2.2456426626954391},{"$f":"Rdson2*AH73^2","v":9.0772397433321494E-2},{"$f":"IF(K73<N73/2,Deadtime*Fsw*IF(VfdSky_Q2>0,0,Vsd_Q2)*(K73+N73/2),2*Deadtime*Fsw*IF(VfdSky_Q2>0,0,Vsd_Q2)*K73)","v":0.12615679999999999},{"$f":"(AJ73+AI73*(1+RdsonBotTc*Ta-RdsonBotTc*25))/(1-AI73*RdsonBotTc*ThetaJA_Q2)","v":0.21811713836757671},{"$f":"2*Deadtime*Fsw*IF(VfdSky_Q2>0,VfdSky_Q2,Vsd_Q2)*K73","v":0.12615679999999999},{"$f":"IF(QrrSky_Q2>0,QrrSky_Q2,Qrr_Q2*K73/(Iout/Number_of_Phases))*Fsw*Vin","v":0.50688},{"$f":"Rs*R73^2","v":3.5054939840858751E-2},{"$f":"Iq*Vin","v":2.6400000000000001E-5},{"$f":"IF(Ext_VCC=1,  (Qg_Q1+Qg_Q2)*Fsw*VCC, (Qg_Q1+Qg_Q2)*Fsw*Vout)","v":7.8099999999999989E-2},{"$f":"(Vin-VCC)*Fsw*(Qg_Q1+Qg_Q2)+(RdsonDRT+RdsonDRT2)*Fsw*Qg_Q1*VCC/(RdsonDRT+2*Rgate1+RdsonDRT2)+(RdsonDRB+RdsonDRB2)*Fsw*Qg_Q2*VCC/(RdsonDRB+2*Rgate2+RdsonDRB2)","v":0.12418352941176468},{"$f":"(Qg_Q1+Qg_Q2)*Fsw*(Vin-VCC)","v":0.10933999999999999},7.8126399999999985E-2,{"$f":" SUM(U73,X73,AA73,AG73,AK73,AL73,AM73,AS73,AN73)","v":1.3295067367499478},{"$f":"Vout*K73","v":8.4480000000000004},0.86402395083474237,{"$f":"ThetaJA_Q1*BC73","v":8.5958376225614579},{"$f":"ThetaJA_Q2*BD73","v":5.7808130755136506},null,86.402395083474232,{"$f":"U73","v":0.1247834172990482},0.96351217987167381,0.57305584150409716,0.38538753836757672,3.5054939840858751E-2,1.0416385798716739,20.416116165484809]
["Part Power","Value","Units",null,null,null,65,12,1,{"$f":"Iout*G74/100","v":2.6},2.6,0.7944444444444444,0.28080250720989547,2.3432344617607188,{"$f":"K74+N74/2","v":3.7716172308803593},{"$f":"K74-N74/2","v":1.4283827691196407},0,{"$f":"SQRT(K74^2+(N74^2)/12)","v":2.6865521234285756},2.5261468091645062E-2,0.1,0.12551512379522684,{"$f":"N74/SQRT(12)","v":0.67643352363597942},{"$f":"RCoutEsr*V74^2","v":4.5756231189858715E-4},{"$f":"W74","v":4.5756231189858715E-4},{"$f":"SQRT(M74*(1-M74))*SQRT(K74^2+(N74^2)/12)","v":1.2073129080685712},{"$f":"RCinEsr*Y74^2","v":1.4576044579889902E-3},{"$f":"Z74","v":1.4576044579889902E-3},{"$f":"SQRT(M74)*SQRT(K74^2+(N74^2)/12)","v":1.4236255101411934},4.864103023499456E-2,0.12923344130892359,6.3360000000000014E-2,0,0.24194056584662318,2.2783442932914717,9.3435348937928681E-2,0.12812799999999999,0.22281246254908826,0.12812799999999999,0.51480000000000004,3.6087811559492942E-2,2.6400000000000001E-5,7.8099999999999989E-2,0.12418352941176468,0.10933999999999999,7.8126399999999985E-2,1.3493255305203189,8.58,{"$f":"AU74/(AU74+AT74)","v":0.86410703059610416},8.725628487699348,5.8904469382363249,null,{"$f":"AV74*100","v":86.410703059610412},0.12551512379522684,{"$f":"AG74+AK74+AM74","v":0.97955302839571146},{"$f":"AG74+AM74*0.66","v":0.58170856584662323},{"$f":"AK74+AM74*0.33","v":0.3926964625490883},{"$f":"AN74","v":3.6087811559492942E-2},{"$f":"BB74+AS74","v":1.0576794283957114},20.730516796555946]
["Power Dis",{"$f":"AS9","v":7.8126399999999985E-2},"W",null,null,null,66,12,1,2.64,2.64,0.80666666666666664,0.28089179619516291,2.343680737421808,3.8118403687109041,1.4681596312890961,0,2.7253140399924867,2.5995678158030593E-2,0.1,0.12625825166804325,0.67656235232251083,4.5773661658016928E-4,4.5773661658016928E-4,1.2248508358056174,1.5002595699737196E-3,1.5002595699737196E-3,1.4443953486415371,5.0070670156255381E-2,0.13122164809829162,6.3360000000000014E-2,0,0.24538952733954006,2.3110730610266006,9.6139056481251497E-2,0.1300992,0.22755084791042857,0.1300992,0.52271999999999996,3.713668308290085E-2,2.6400000000000001E-5,7.8099999999999989E-2,0.12418352941176468,0.10933999999999999,{"$f":"SUM(AO75:AP75)","v":7.8126399999999985E-2},1.3692389061874664,8.7119999999999997,0.86417950026488499,8.855770910093101,6.0007267186564288,null,86.417950026488498,0.12625825166804325,0.99566037524996864,0.59038472733954006,0.4000484479104286,3.713668308290085E-2,1.0737867752499686,{"$f":"BF75*$B$63","v":21.046220794899387}]
["Temp rise",{"$f":"B75*B62","v":2.3437919999999997},"°C",null,null,null,67,12,1,2.68,2.68,0.81888888888888878,0.28098108577582326,2.3441268280734864,3.8520634140367433,1.507936585963257,0,2.7641112282566507,2.6741088087610717E-2,0.1,0.12701280493601461,0.67669112760142547,4.5791088217448869E-4,4.5791088217448869E-4,1.2424079329947222,1.5435774719682182E-3,1.5435774719682182E-3,1.4651903792129628,5.1522788336117419E-2,0.13320985488765971,6.3360000000000014E-2,0,0.24886196697072568,2.3438276461455656,9.8883504627052712E-2,0.1320704,0.23233233475699014,0.1320704,0.53064,3.8201554410872453E-2,2.6400000000000001E-5,7.8099999999999989E-2,0.12418352941176468,0.10933999999999999,7.8126399999999985E-2,1.3892469494287456,8.8439999999999994,0.86424182311887843,8.986265504560885,6.1116530213548517,null,86.424182311887847,0.12701280493601461,1.0118343017277158,0.59908436697072565,0.40744353475699013,3.8201554410872453E-2,1.0899607017277158,21.36322975386323]
["Current (switching)",{"$f":"(Qg_Q1+Qg_Q2)*Fsw+Iq","v":1.5622199999999999E-2},"A",null,null,null,68,12,1,2.72,2.72,0.83111111111111113,0.28107037595188245,2.3445727337139042,3.8922863668569523,1.5477136331430481,0,2.8029422235642958,2.7497697880238457E-2,0.1,0.12777878768016904,0.67681984947218976,4.5808510863955758E-4,4.5808510863955758E-4,1.2599835433408244,1.5875585294896992E-3,1.5875585294896992E-3,1.4860098327890319,5.2997405355496477E-2,0.13519806167702775,6.3360000000000014E-2,0,0.25235792595029988,2.3766068007758188,0.1016686779388897,0.13404160000000001,0.23715696403875899,0.13404160000000001,0.53856000000000004,3.9282425543197795E-2,2.6400000000000001E-5,7.8099999999999989E-2,0.12418352941176468,0.10933999999999999,7.8126399999999985E-2,1.4093497468505549,8.9760000000000009,0.86429443579616061,9.1171128892544999,6.223226460581385,null,86.429443579616063,0.12777878768016904,1.028074889989059,0.60780752595029996,0.41488176403875898,3.9282425543197795E-2,1.106201289989059,21.681545283785557]
["Qrr Current",{"$f":"Qrr_Q2*Fsw","v":6.5999999999999989E-2},"A",null,null,null,69,12,1,2.76,2.76,0.84333333333333316,0.28115966672334636,2.3450184543412105,3.932509227170605,1.5874907728293945,0,2.8418056400699543,2.8265507535766905E-2,0.1,0.12855620404410115,0.67694851793426902,4.5825929593340336E-4,4.5825929593340336E-4,1.2775770457212992,1.6322031077539625E-3,1.6322031077539625E-3,1.5068529815974994,5.4494541795582573E-2,0.13718626846639578,6.3360000000000014E-2,0,0.25587744571157089,2.409409344172162,0.1044945609801143,0.13601279999999999,0.24202477735145325,0.13601279999999999,0.54647999999999985,4.037929647966701E-2,2.6400000000000001E-5,7.8099999999999989E-2,0.12418352941176468,0.10933999999999999,7.8126399999999985E-2,1.4295473859904795,9.1079999999999988,0.86433775017789782,9.2483136856735619,6.3354476602717984,null,86.433775017789785,0.12855620404410115,1.044382223063024,0.6165542457115708,0.42236317735145323,4.037929647966701E-2,1.1225086230630239,22.00116901203527]
["Diode Current",{"$f":"Deadtime*Fsw*(Iripple_Vinnom/2)*(Vsd_Q2)/Vin","v":2.3960137359719615E-3},null,null,null,null,70,12,1,2.8,2.8,0.8555555555555554,0.28124895809022105,2.3454639899535557,3.9727319949767779,1.627268005023222,0,2.8807001655871911,2.904451705404925E-2,0.1,0.12934505823402809,0.67707713298712957,4.5843344401407118E-4,4.5843344401407118E-4,1.2951878518868938,1.6775115716753863E-3,1.6775115716753863E-3,1.527719136461281,5.6014218237840058E-2,0.13917447525576382,6.3360000000000014E-2,0,0.25942056791198825,2.4422341583279987,0.10736113831387323,0.137984,0.24693581693768701,0.137984,0.55439999999999989,4.1492167220070354E-2,2.6400000000000001E-5,7.8099999999999989E-2,0.12418352941176468,0.10933999999999999,7.8126399999999985E-2,1.449839955319463,9.2399999999999984,0.8643721551136978,9.3798685186798227,6.4483172540653042,null,86.437215511369786,0.12934505823402809,1.0607563848496753,0.62532456791198821,0.42988781693768696,4.1492167220070354E-2,1.1388827848496752,22.322102583053635]
["Total",{"$f":"SUM(B77:B79)","v":8.4018213735971958E-2},"A",null,null,null,71,12,1,2.84,2.84,0.86777777777777776,0.28133825005251245,2.3459093405490887,4.012954670274544,1.6670453297254555,0,2.9196245568291177,2.9834726434938678E-2,0.1,0.13014535451884651,0.67720569463023694,4.5860755283962172E-4,4.5860755283962172E-4,1.3128154043379101,1.7234842858669104E-3,1.7234842858669104E-3,1.548607644305138,5.7556455264007406E-2,0.14116268204513191,6.3360000000000014E-2,0,0.26298733443410077,2.4750801839211825,0.11026839450310764,0.13995519999999997,0.25189012568815677,0.13995519999999997,0.56231999999999993,4.2621037764198108E-2,2.6400000000000001E-5,7.8099999999999989E-2,0.12418352941176468,0.10933999999999999,7.8126399999999985E-2,1.4702275442440085,9.3719999999999999,0.86439801800465521,9.51177801651151,6.5618358853223517,null,86.439801800465517,0.13014535451884651,1.0771974601222576,0.63411853443410071,0.43745572568815677,4.2621037764198108E-2,1.1553238601222575,22.644347658396249]
[null,null,null,null,null,null,72,12,1,2.88,2.88,0.87999999999999989,0.2814275426102264,2.3463545061259574,4.0531772530629784,1.7068227469370212,0,2.9585776350077637,3.0636135678288462E-2,0.1,0.13095709723019078,0.67733420286305646,4.5878162236813214E-4,4.5878162236813214E-4,1.3304591743605021,1.7701216146400289E-3,1.7701216146400289E-3,1.56951788585032,5.9121273456097398E-2,0.14315088883449995,6.3360000000000014E-2,0,0.26657778738652138,2.5079464165655683,0.11321631411055334,0.14192639999999998,0.25688774714285401,0.14192639999999998,0.57023999999999986,4.3765908111840661E-2,2.6400000000000001E-5,7.8099999999999989E-2,0.12418352941176468,0.10933999999999999,7.8126399999999985E-2,1.4907102431084147,9.5039999999999996,0.86441568625759768,9.6440428107978207,6.6760042071428103,null,86.441568625759771,0.13095709723019078,1.0937055345293754,0.64293618738652136,0.445066947142854,4.3765908111840661E-2,1.1718319345293753,22.967905916775756]
[null,null,null,null,null,null,73,12,1,2.92,2.92,0.89222222222222214,0.28151683576336906,2.3467994866823143,4.0933997433411573,1.7466002566588428,0,2.9975582817616235,3.1448744783951939E-2,0.1,0.13178029076249151,0.67746265768505487,4.5895565255769786E-4,4.5895565255769786E-4,1.3481186602093989,1.8174239220047847E-3,1.8174239220047847E-3,1.5904492734810958,6.070869339639709E-2,0.14513909562386801,6.3360000000000014E-2,0,0.27019196910489862,2.5408319033421223,0.11620488169874073,0.14389759999999999,0.26192872549230084,0.14389759999999999,0.5781599999999999,4.4926778262788486E-2,2.6400000000000001E-5,7.8099999999999989E-2,0.12418352941176468,0.10933999999999999,7.8126399999999985E-2,1.5112881431970417,9.6359999999999992,0.86442548862259827,9.7766635365734782,6.7908228823845125,null,86.442548862259827,0.13178029076249151,1.1102806945971992,0.65177756910489859,0.45272152549230082,4.4926778262788486E-2,1.1884070945971992,23.292779054105104]
[null,null,null,null,null,null,74,12,1,2.96,2.96,0.90444444444444427,0.28160612951194625,2.3472442822163062,4.1336221411081535,1.7863778588918469,0,3.036565435383606,3.22725537517825E-2,0.1,0.13261493957303533,0.67759105909569717,4.5912964336642861E-4,4.5912964336642861E-4,1.3657933854246596,1.8653915716697526E-3,1.8653915716697526E-3,1.611401249268626,6.2318735667467734E-2,0.14712730241323604,6.3360000000000014E-2,0,0.27382992215289315,2.5737357395859308,0.11923408182999487,0.14586879999999999,0.26701310557881075,0.14586879999999999,0.58607999999999993,4.6103648216832147E-2,2.6400000000000001E-5,7.8099999999999989E-2,0.12418352941176468,0.10933999999999999,7.8126399999999985E-2,1.5319613367366074,9.7679999999999989,0.86442773642453608,9.9096408322933964,6.9062925836821609,null,86.442773642453602,0.13261493957303533,1.1269230277317037,0.6606427221528931,0.46041950557881073,4.6103648216832147E-2,1.2050494277317036,23.618968783541394]
[null,null,null,null,null,null,75,12,1,3,3,0.91666666666666652,0.28169542385596397,2.3476888927260831,4.1738444463630415,1.8261555536369585,0,3.0755980873242286,3.3107562581633589E-2,0.1,0.13346104818202534,0.67771940709444933,4.5930359475245192E-4,4.5930359475245192E-4,1.383482897271243,1.9140249270420326E-3,1.9140249270420326E-3,1.6323732831390119,6.3951420852144877E-2,0.14911550920260414,6.3360000000000014E-2,0,0.27749168932316176,2.6066570659076769,0.12230389906643553,0.14784,0.27214093289777402,0.14784,0.59399999999999997,4.7296517973762268E-2,2.6400000000000001E-5,7.8099999999999989E-2,0.12418352941176468,0.10933999999999999,7.8126399999999985E-2,1.5527299168985178,9.8999999999999986,0.86442272469837411,10.042975339847427,7.0224139934666105,null,86.442272469837405,0.13346104818202534,1.1436326222209359,0.66953168932316176,0.46816093289777405,4.7296517973762268E-2,1.2217590222209358,23.946476835530344]
[null,null,null,null,null,null,76,12,1,3.04,3.04,0.92888888888888888,0.28178471879542816,2.3481333182097943,4.2140666591048976,1.8659333408951029,0,3.1146552789472404,3.395377127335869E-2,0.1,0.13431862117264259,0.67784770168077702,4.5947750667391167E-4,4.5947750667391167E-4,1.401186765291208,1.9633243512272389E-3,1.9633243512272389E-3,1.6533648711735598,6.5606769533538292E-2,0.1511037159919722,6.3360000000000014E-2,0,0.2811773136383463,2.6395950654301412,0.12541431796997671,0.14981120000000001,0.27731225359896661,0.14981120000000001,0.60192000000000001,4.8505387533369561E-2,2.6400000000000001E-5,7.8099999999999989E-2,0.12418352941176468,0.10933999999999999,7.8126399999999985E-2,1.5735939778012262,10.032,0.86441073323682172,10.176667704575195,7.1391878039844991,null,86.441073323682176,0.13431862117264259,1.1604095672373129,0.67844451363834635,0.47594585359896663,4.8505387533369561E-2,1.2385359672373129,24.275304957851333]
[null,null,null,null,null,null,77,12,1,3.08,3.08,0.94111111111111101,0.28187401433034481,2.3485775586655904,4.2542887793327955,1.9057112206672049,0,3.1537360985169589,3.4811179826811395E-2,0.1,0.13518766319110836,0.67797594285414642,4.5965137908896881E-4,4.5965137908896881E-4,1.4189045799593047,2.0132902070294908E-3,2.0132902070294908E-3,1.6743755340304245,6.7284802295032073E-2,0.15309192278134023,6.3360000000000014E-2,0,0.28488683835207085,2.6725489612220947,0.12856532310232735,0.15178239999999998,0.28252711448788553,0.15178239999999998,0.60983999999999994,4.9730256895444844E-2,2.6400000000000001E-5,7.8099999999999989E-2,0.12418352941176468,0.10933999999999999,7.8126399999999985E-2,1.5945536145126278,10.164,0.86439202755816835,10.310718575281062,7.2566147173182829,null,86.439202755816837,0.13518766319110836,1.1772539528399564,0.68738123835207077,0.48377431448788555,4.9730256895444844E-2,1.2553803528399563,24.605454915663145]
[null,null,null,null,null,null,78,12,1,3.12,3.12,0.95333333333333325,0.28196331046071976,2.349021614091618,4.2945108070458087,1.9454891929541911,0,3.192839678398494,3.5679788241845291E-2,0.1,0.13606817894674716,0.67810413061402253,4.5982521195579934E-4,4.5982521195579934E-4,1.4366359514335572,2.0639228569514024E-3,2.0639228569514024E-3,1.6954048154777637,6.8985539720284553E-2,0.1550801295707083,6.3360000000000014E-2,0,0.28862030694994339,2.7055180139135295,0.13175689902499096,0.15375359999999999,0.28778556302710767,0.15375359999999999,0.61775999999999998,5.0971126059778993E-2,2.6400000000000001E-5,7.8099999999999989E-2,0.12418352941176468,0.10933999999999999,7.8126399999999985E-2,1.6156089230524844,10.295999999999999,0.86436685980129824,10.445128604249152,7.3746954454066156,null,86.436685980129823,0.13606817894674716,1.1941658699770512,0.69634190694994347,0.49164636302710768,5.0971126059778993E-2,1.2722922699770511,24.936928491550205]
[null,null,null,null,null,null,79,12,1,3.16,3.16,0.96555555555555539,0.28205260718655911,2.3494654844860277,4.3347327422430144,1.9852672577569863,0,3.2319651924537487,3.6559596518314086E-2,0.1,0.13696017321205098,0.67823226495987132,4.5999900523259712E-4,4.5999900523259712E-4,1.4543805083932022,2.115222663194069E-3,2.115222663194069E-3,1.7164522810294445,7.0709002393228387E-2,0.15706833636007633,6.3360000000000014E-2,0,0.29237776315056513,2.7385015194776527,0.13498903029926543,0.1557248,0.29308764733767378,0.1557248,0.62568000000000001,5.2227995026162981E-2,2.6400000000000001E-5,7.8099999999999989E-2,0.12418352941176468,0.10933999999999999,7.8126399999999985E-2,1.6367600003948795,10.427999999999999,0.86433546955419682,10.579898447258477,7.4934307100651072,null,86.433546955419686,0.13696017321205098,1.2111454104882389,0.70532656315056519,0.49956204733767379,5.2227995026162981E-2,1.2892718104882388,25.269727485569483]
[null,null,null,null,null,null,80,12,1,3.2,3.2,0.97777777777777775,0.28214190450786875,2.3499091698469696,4.3749545849234845,2.0250454150765154,0,3.2711118536176005,3.7450604656071508E-2,0.1,0.13786365082274393,0.67836034589115901,4.6017275887757294E-4,4.6017275887757294E-4,1.4721378969570291,2.1671899876570646E-3,2.1671899876570646E-3,1.7375175166751369,7.245521089807043E-2,0.15905654314944442,6.3360000000000014E-2,0,0.29615925090654577,2.7714988071663749,0.13826170148624348,0.157696,0.29843341620049746,0.157696,0.63359999999999994,5.3500863794387871E-2,2.6400000000000001E-5,7.8099999999999989E-2,0.12418352941176468,0.10933999999999999,7.8126399999999985E-2,1.6580069444707095,10.56,0.8642980846216457,10.715028763598186,7.6128212430074624,null,86.429808462164573,0.13786365082274393,1.2281926671070431,0.7143352509065457,0.50752141620049751,5.3500863794387871E-2,1.306319067107043,25.603853715298044]
[null,null,null,null,null,null,81,12,1,3.24,3.24,0.99,0.2822312024246546,2.3503526701725908,4.4151763350862954,2.0648236649137051,0,3.3102789116400682,3.8352812654971341E-2,0.1,0.13877861667784827,0.67848837340735058,4.6034647284895242E-4,4.6034647284895242E-4,1.4899077796757836,2.219825191938423E-3,2.219825191938423E-3,1.7586001276973577,7.422418581929191E-2,0.16104474993881246,6.3360000000000014E-2,0,0.29996481440552553,2.8045092375871739,0.14157489714681223,0.15966720000000001,0.3038229190577994,0.15966720000000001,0.64151999999999998,5.4789732364244774E-2,2.6400000000000001E-5,7.8099999999999989E-2,0.12418352941176468,0.10933999999999999,7.8126399999999985E-2,1.6793498541702052,10.692,0.86425492173724927,10.850520216082881,7.7328677858669908,null,86.425492173724933,0.13877861667784827,1.2453077334633249,0.72336801440552545,0.51552451905779939,5.4789732364244774E-2,1.3234341334633248,25.939309015881168]
[null,null,null,null,null,null,82,12,1,3.28,3.28,1.0022222222222219,0.28232050093692274,2.3507959854610423,4.4553979927305214,2.1046020072694787,0,3.3494656509815082,3.9266220514867424E-2,0.1,0.13970507573975088,0.67861634750791222,4.6052014710497947E-4,4.6052014710497947E-4,1.507689834592856,2.2731286373346335E-3,2.2731286373346335E-3,1.7796997375686756,7.6015947741648313E-2,0.16303295672818049,6.3360000000000014E-2,0,0.30379449807120368,2.8375322009103199,0.14492860184165335,0.16163839999999999,0.30925620601456605,0.16163839999999999,0.6494399999999998,5.6094600735524892E-2,2.6400000000000001E-5,7.8099999999999989E-2,0.12418352941176468,0.10933999999999999,7.8126399999999985E-2,1.7007888293454849,10.823999999999998,0.86420618722444653,10.986373471068054,7.8535710902184892,null,86.420618722444658,0.13970507573975088,1.2624907040857696,0.73242489807120359,0.52357140601456598,5.6094600735524892E-2,1.3406171040857695,26.276095240081084]
[null,null,null,null,null,null,83,12,1,3.32,3.32,1.0144444444444443,0.28240980004467903,2.3512391157104724,4.4956195578552363,2.1443804421447634,0,3.3886713888490152,4.01908282356137E-2,0.1,0.140643033034271,0.67874426819230949,4.6069378160391373E-4,4.6069378160391373E-4,1.5254837543679807,2.3271006848406299E-3,2.3271006848406299E-3,1.8008159869228888,7.7830517250169387E-2,0.16502116351754853,6.3360000000000014E-2,0,0.30764834656437379,2.8705671151963776,0.14832280013124335,0.16360959999999999,0.31473332784003488,0.16360959999999999,0.65735999999999994,5.7415468908019573E-2,2.6400000000000001E-5,7.8099999999999989E-2,0.12418352941176468,0.10933999999999999,7.8126399999999985E-2,1.7223239708131437,10.956,0.86415207761072232,11.122589198465608,7.9749319176005233,null,86.415207761072239,0.140643033034271,1.2797416744044086,0.74150594656437385,0.53166212784003486,5.7415468908019573E-2,1.3578680744044085,26.61421425832641]
[null,null,null,null,null,null,84,12,1,3.36,3.36,1.0266666666666666,0.28249909974792942,2.351682060919031,4.5358410304595154,2.1841589695404844,0,3.4278954733632165,4.1126635817064106E-2,0.1,0.14159249365072837,0.67887213546000824,4.6086737630403183E-4,4.6086737630403183E-4,1.5432892454591189,2.3817416951497769E-3,2.3817416951497769E-3,1.8219485325945142,7.9667914930159289E-2,0.16700937030691662,6.3360000000000014E-2,0,0.31152640478396554,2.9036134248347745,0.15175747657585309,0.16558079999999997,0.32025433596920277,0.16558079999999997,0.66527999999999998,5.8752336881520151E-2,2.6400000000000001E-5,7.8099999999999989E-2,0.12418352941176468,0.10933999999999999,7.8126399999999985E-2,1.7439553803568706,11.087999999999999,0.86409278019883751,11.259168071759483,8.0969510395380411,null,86.409278019883757,0.14159249365072837,1.2970607407531682,0.75061120478396548,0.53979673596920275,5.8752336881520151E-2,1.3751871407531682,26.953667958762097]
[null,null,null,null,null,null,85,12,1,3.4,3.4,1.0388888888888888,0.28258840004667984,2.3521248210848653,4.5760624105424323,2.2239375894575675,0,3.4671372818455897,4.2073643259072681E-2,0.1,0.14255346274201292,0.67899994931047369,4.6104093116362582E-4,4.6104093116362582E-4,1.5611060273581245,2.4370520286538656E-3,2.4370520286538656E-3,1.8430970467214087,8.1528161367196289E-2,0.16899757709628468,6.3360000000000014E-2,0,0.31542871786809284,2.9366705990850326,0.15523261573554797,0.16755199999999998,0.32581928250436182,0.16755199999999998,0.67319999999999991,6.0105204655818117E-2,2.6400000000000001E-5,7.8099999999999989E-2,0.12418352941176468,0.10933999999999999,7.8126399999999985E-2,1.7656831607301031,11.219999999999999,0.86402847359854806,11.396110768021392,8.2196292375654263,null,86.402847359854803,0.14255346274201292,1.3144480003724546,0.75974071786809283,0.54797528250436178,6.0105204655818117E-2,1.3925744003724545,27.29445824730011]
[null,null,null,null,null,null,86,12,1,3.44,3.44,1.0511111111111109,0.28267770094093636,2.3525673962061258,4.6162836981030626,2.2637163018969373,0,3.5063962192172471,4.3031850561493515E-2,0.1,0.14352594552465467,0.67912770974317183,4.612144461410058E-4,4.612144461410058E-4,1.5789338318761483,2.4930320454430973E-3,2.4930320454430973E-3,1.8642612159057945,8.3411277147133242E-2,0.17098578388565272,6.3360000000000014E-2,0,0.31935533119510978,2.9697381307129511,0.15874820217018815,0.16952319999999999,0.33142822021665969,0.16952319999999999,0.68111999999999995,6.1474072230705022E-2,2.6400000000000001E-5,7.8099999999999989E-2,0.12418352941176468,0.10933999999999999,7.8126399999999985E-2,1.7875074156587132,11.351999999999999,0.86395932822196275,11.533417967926646,8.3429673032498943,null,86.395932822196272,0.14352594552465467,1.3319035514117694,0.76889453119510975,0.55619782021665964,6.1474072230705022E-2,1.4100299514117693,27.63658704767068]
[null,null,null,null,null,null,87,12,1,3.48,3.48,1.0633333333333332,0.28276700243070491,2.3530097862809618,4.6565048931404807,2.3034951068595193,0,3.5456717165009084,4.4001257724180745E-2,0.1,0.14450994727889488,0.67925541675756862,4.6138792119449824E-4,4.6138792119449824E-4,1.5967724024750929,2.54968210530608E-3,2.54968210530608E-3,1.8854407404293332,8.531728285609709E-2,0.17297399067502078,6.3360000000000014E-2,0,0.32330629038467218,3.0028155347146761,0.16230422043942816,0.17149439999999999,0.33708120254768537,0.17149439999999999,0.68903999999999999,6.2858939605972497E-2,2.6400000000000001E-5,7.8099999999999989E-2,0.12418352941176468,0.10933999999999999,7.8126399999999985E-2,1.8094282498437253,11.484,0.86388550674541043,11.671090355770083,8.4669660382152809,null,86.388550674541037,0.14450994727889488,1.3494274929323575,0.77807269038467219,0.56446440254768537,6.2858939605972497E-2,1.4275538929323575,27.980056301474207]
[null,null,null,null,null,null,88,12,1,3.52,3.52,1.0755555555555554,0.28285630451599136,2.353451991307522,4.696725995653761,2.343274004346239,0,3.5849632294184617,4.4981864746988565E-2,0.1,0.14550547334875821,0.67938307035312939,4.6156135628244515E-4,4.6156135628244515E-4,1.6146214936417183,2.6070025677298134E-3,2.6070025677298134E-3,1.9066353335182846,8.7246199080489126E-2,0.17496219746438885,6.3360000000000014E-2,0,0.32728164129880671,3.0359023471221973,0.16590065510271718,0.1734656,0.34277828361108098,0.1734656,0.69695999999999991,6.4259806781412229E-2,2.6400000000000001E-5,7.8099999999999989E-2,0.12418352941176468,0.10933999999999999,7.8126399999999985E-2,1.8314457689640702,11.616,0.86380716454042583,11.809128619482101,8.5916262541662149,null,86.380716454042584,0.14550547334875821,1.3670199249098878,0.78727524129880666,0.57277508361108098,6.4259806781412229E-2,1.4451463249098877,28.3248679682338]
[null,null,null,null,null,null,89,12,1,3.56,3.56,1.0877777777777777,0.28294560719680167,2.3538940112839537,4.7369470056419765,2.3830529943580232,0,3.624270237077142,4.5973671629771215E-2,0.1,0.1465125291421254,0.67951067052931935,4.6173475136320521E-4,4.6173475136320521E-4,1.6324808703012954,2.6649937918996748E-3,2.6649937918996748E-3,1.9278447206550926,8.9198046406985088E-2,0.17695040425375688,6.3360000000000014E-2,0,0.33128143004298677,3.0689981238843225,0.16953749071929883,0.1754368,0.34851951819417931,0.1754368,0.70487999999999995,6.5676673756816017E-2,2.6400000000000001E-5,7.8099999999999989E-2,0.12418352941176468,0.10933999999999999,7.8126399999999985E-2,1.8535600796793701,11.747999999999999,0.86372445007623977,11.947533450644801,8.7169487729126907,null,86.37244500762398,0.1465125291421254,1.384680948237166,0.7965022300429867,0.58112991819417936,6.5676673756816017E-2,1.462807348237166,28.671024025448453]
[null,null,null,null,null,null,90,12,1,3.6,3.6,1.0999999999999999,0.28303491047314194,2.3543358462084081,4.7771679231042041,2.422832076895796,0,3.6635922407379287,4.6976678372383056E-2,0.1,0.14753112013080727,0.67963821728560492,4.6190810639515513E-4,4.6190810639515513E-4,1.6503503072679524,2.7236561366994249E-3,2.7236561366994249E-3,1.9490686389330396,9.1172845422535009E-2,0.17893861104312495,6.3360000000000014E-2,0,0.3353057029672154,3.1021024398176902,0.17321471184821158,0.17740799999999998,0.35430496175966714,0.17740799999999998,0.71279999999999988,6.7109540531975792E-2,2.6400000000000001E-5,7.8099999999999989E-2,0.12418352941176468,0.10933999999999999,7.8126399999999985E-2,1.8757712896327599,11.879999999999999,0.86363750529594352,12.086305544508228,8.842934426395006,null,86.363750529594355,0.14753112013080727,1.4024106647268824,0.80575370296721527,0.58952896175966707,6.7109540531975792E-2,1.4805370647268823,29.018526468646893]
[null,null,null,null,null,null,91,12,1,3.64,3.64,1.1122222222222222,0.283124214345018,2.3547774960790342,4.8173887480395177,2.462611251960483,0,3.702928762660266,4.7990884974678412E-2,0.1,0.148561251850619,0.67976571062145175,4.6208142133668731E-4,4.6208142133668731E-4,1.6682295887290746,2.7829899607111773E-3,2.7829899607111773E-3,1.9703068364508938,9.3170616714363108E-2,0.18092681783249301,6.3360000000000014E-2,0,0.33935450666711453,3.1352148876227859,0.17693230304828803,0.17937919999999999,0.36013467044727437,0.17937919999999999,0.72072000000000003,6.8558407106683442E-2,2.6400000000000001E-5,7.8099999999999989E-2,0.12418352941176468,0.10933999999999999,7.8126399999999985E-2,1.8980795074537391,12.012,0.86354646596831819,12.225445600006719,8.9695840567091167,null,86.354646596831813,0.148561251850619,1.420209177114389,0.81502970666711461,0.59797227044727441,6.8558407106683442E-2,1.4983355771143889,29.367377311442024]
[null,null,null,null,null,null,92,12,1,3.68,3.68,1.1244444444444444,0.28321351881243578,2.355218960893978,4.8576094804469889,2.5023905195530114,0,3.7422793450177139,4.9016291436511733E-2,0.1,0.14960292990145621,0.67989315053632449,4.622546961462092E-4,4.622546961462092E-4,1.6861185077613621,2.8429956222154025E-3,2.8429956222154025E-3,1.9915590717447151,9.5191380869968117E-2,0.18291502462186107,6.3360000000000014E-2,0,0.34342788798502222,3.1683350769603802,0.18069024887815568,0.18135039999999999,0.36600870107548972,0.18135039999999999,0.72863999999999995,7.0023273480731049E-2,2.6400000000000001E-5,7.8099999999999989E-2,0.12418352941176468,0.10933999999999999,7.8126399999999985E-2,1.9204848427610608,12.144,0.86345146201714407,12.364954319775334,9.096898516132347,null,86.345146201714414,0.14960292990145621,1.4380765890605118,0.82433028798502228,0.60645990107548975,7.0023273480731049E-2,1.5162029890605118,29.717578585586033]
[null,null,null,null,null,null,93,12,1,3.72,3.72,1.1366666666666665,0.28330282387540134,2.3556602406513911,4.897830120325696,2.5421698796743044,0,3.7816435488795279,5.0052897757737524E-2,0.1,0.15065615994737105,0.68002053702968968,4.6242793078214755E-4,4.6242793078214755E-4,1.7040168658763077,2.9036734791909147E-3,2.9036734791909147E-3,2.0128251132542032,9.7235158477123107E-2,0.18490323141122911,6.3360000000000014E-2,0,0.34752589401109663,3.2014626335841174,0.18448853389623635,0.1833216,0.37192711114330174,0.1833216,0.73655999999999999,7.1504139653910753E-2,2.6400000000000001E-5,7.8099999999999989E-2,0.12418352941176468,0.10933999999999999,7.8126399999999985E-2,1.9429874061656531,12.276,0.86335261782965411,12.504832410166449,9.2248786671495271,null,86.335261782965418,0.15065615994737105,1.4560130051543982,0.83365549401109662,0.61499191114330176,7.1504139653910753E-2,1.5341394051543982,30.069132341026208]
[null,null,null,null,null,null,94,12,1,3.76,3.76,1.1488888888888888,0.28339212953392062,2.3561013353494218,4.9380506676747107,2.5819493323252889,0,3.8210209532535861,5.1100703938210305E-2,0.1,0.15172094771664976,0.68014787010101274,4.6260112520294413E-4,4.6260112520294413E-4,1.7219244725930509,2.9650238893148564E-3,2.9650238893148564E-3,2.0341047388211861,9.9301970123875358E-2,0.18689143820059717,6.3360000000000014E-2,0,0.35164857208442646,3.234597198525365,0.18832714266074649,0.18529279999999998,0.37788995883196719,0.18529279999999998,0.74447999999999992,7.300100562601472E-2,2.6400000000000001E-5,7.8099999999999989E-2,0.12418352941176468,0.10933999999999999,7.8126399999999985E-2,1.9655873092735756,12.407999999999999,0.8632500525456569,12.645080581266395,9.353525382479507,null,86.325005254565696,0.15172094771664976,1.4740185309163936,0.84300537208442639,0.62356835883196715,7.300100562601472E-2,1.5521449309163935,30.422040645961314]
[null,null,null,null,null,null,95,12,1,3.8,3.8,1.161111111111111,0.2834814357879995,2.356542244986219,4.9782711224931093,2.6217288775068903,0,3.8604111541864365,5.2159709977784692E-2,0.1,0.1527972990018909,0.68027514974975933,4.6277427936705753E-4,4.6277427936705753E-4,1.7398411450367228,3.027047209962695E-3,3.027047209962695E-3,2.055397735218039,0.10139183639854667,0.18887964498996521,6.3360000000000014E-2,0,0.35579596979414974,3.2677384273267056,0.19220605972969698,0.18726399999999999,0.38389730300680469,0.18726399999999999,0.75239999999999996,7.4513871396835282E-2,2.6400000000000001E-5,7.8099999999999989E-2,0.12418352941176468,0.10933999999999999,7.8126399999999985E-2,1.98828466468901,12.54,0.86314388032872624,12.785699546912245,9.4828395451020704,null,86.314388032872628,0.1527972990018909,1.4920932728009544,0.85237996979414965,0.63218930300680465,7.4513871396835282E-2,1.5702196728009543,30.776305586898708]
[null,null,null,null,null,null,96,12,1,3.84,3.84,{"$f":"Vout*K105/(Vin*Efficiency)","v":1.1733333333333331},0.28357074263764404,{"$f":"(Vin-(Rdson1+Rdcr)*K105-Vout)*M105/(Fsw*Lf)","v":2.3569829695599309},5.0184914847799655,2.6615085152200342,{"$f":"IF(MIN(Vin, -P105/(Coss_Q1+Coss_Q2)*0.00000002)<0, 0, MIN(Vin, -P105/(Coss_Q1+Coss_Q2)*0.00000002))","v":0},3.8998137639165491,{"$f":"R105^2*Rdcr","v":5.322991587631537E-2},0.1,{"$f":"(T105+S105*(1+Ltc*(Ta-25)))/(1-S105*Ltc*ThetaCa)","v":0.15388521966008456},0.68040237597539488,4.6294739323296264E-4,4.6294739323296264E-4,1.757766707560537,3.0897437982082107E-3,3.0897437982082107E-3,2.0767038977039736,{"$f":"Rdson1*AB105^2","v":0.10350477788973303},0.19086785177933327,6.3360000000000014E-2,0,{"$f":"(AF105+AE105+AD105+AC105*(1+RdsonTopTc*Ta-RdsonTopTc*25))/(1-AC105*RdsonTopTc*ThetaJA_Q1)","v":0.35996813498057906},3.3008859893207587,{"$f":"Rdson2*AH105^2","v":0.19612526966089347},0.18923519999999999,{"$f":"(AJ105+AI105*(1+RdsonBotTc*Ta-RdsonBotTc*25))/(1-AI105*RdsonBotTc*ThetaJA_Q2)","v":0.38994920321901627},0.18923519999999999,0.76031999999999988,7.6042736966164814E-2,2.6400000000000001E-5,7.8099999999999989E-2,0.12418352941176468,0.10933999999999999,7.8126399999999985E-2,{"$f":" SUM(U105,X105,AA105,AG105,AK105,AL105,AM105,AS105,AN105)","v":2.0110795860172859},12.671999999999999,0.8630342106207447,12.926690024708684,9.6128220482852438,null,86.303421062074477,0.15388521966008456,1.5102373381995953,0.8617793349805789,0.64085480321901622,7.6042736966164814E-2,1.5883637381995952,31.131929268712067]
[null,null,null,null,null,null,97,12,1,3.88,3.88,{"$f":"Vout*K106/(Vin*Efficiency)","v":1.1855555555555553},0.2836600500828601,{"$f":"(Vin-(Rdson1+Rdcr)*K106-Vout)*M106/(Fsw*Lf)","v":2.3574235090687057},5.058711754534353,2.7012882454656468,{"$f":"IF(MIN(Vin, -P106/(Coss_Q1+Coss_Q2)*0.00000002)<0, 0, MIN(Vin, -P106/(Coss_Q1+Coss_Q2)*0.00000002))","v":0},3.9392284100771753,{"$f":"R106^2*Rdcr","v":5.4311321633657025E-2},0.1,{"$f":"(T106+S106*(1+Ltc*(Ta-25)))/(1-S106*Ltc*ThetaCa)","v":0.15498471561269236},0.6805295487773847,4.6312046675915083E-4,4.6312046675915083E-4,1.7757009913900146,3.1531140108234808E-3,3.1531140108234808E-3,2.0980230296073272,{"$f":"Rdson1*AB106^2","v":0.105640815186305},0.19285605856870133,6.3360000000000014E-2,0,{"$f":"(AF106+AE106+AD106+AC106*(1+RdsonTopTc*Ta-RdsonTopTc*25))/(1-AC106*RdsonTopTc*ThetaJA_Q1)","v":0.36416511573633437},3.3340395669512448,{"$f":"Rdson2*AH106^2","v":0.20008475701193598},0.1912064,{"$f":"(AJ106+AI106*(1+RdsonBotTc*Ta-RdsonBotTc*25))/(1-AI106*RdsonBotTc*ThetaJA_Q2)","v":0.39604571970753394},0.1912064,0.76823999999999992,7.7587602333795747E-2,2.6400000000000001E-5,7.8099999999999989E-2,0.12418352941176468,0.10933999999999999,7.8126399999999985E-2,{"$f":" SUM(U106,X106,AA106,AG106,AK106,AL106,AM106,AS106,AN106)","v":2.0339721878679389},12.803999999999998,0.862921148380977,13.068052736045015,9.74347379561301,null,86.292114838097703,0.15498471561269236,1.5284508354438682,0.87120351573633437,0.64956491970753394,7.7587602333795747E-2,1.6065772354438681,31.488913814699817]
[null,null,null,null,null,null,98,12,1,3.92,3.92,{"$f":"Vout*K107/(Vin*Efficiency)","v":1.1977777777777776},0.28374935812365376,{"$f":"(Vin-(Rdson1+Rdcr)*K107-Vout)*M107/(Fsw*Lf)","v":2.3578638635106954},5.0989319317553479,2.741068068244652,{"$f":"IF(MIN(Vin, -P107/(Coss_Q1+Coss_Q2)*0.00000002)<0, 0, MIN(Vin, -P107/(Coss_Q1+Coss_Q2)*0.00000002))","v":0},3.9786547349454855,{"$f":"R107^2*Rdcr","v":5.5403927249664461E-2},0.1,{"$f":"(T107+S107*(1+Ltc*(Ta-25)))/(1-S107*Ltc*ThetaCa)","v":0.15609579284572872},0.68065666815519554,4.6329349990413202E-4,4.6329349990413202E-4,1.7936438342878669,3.217158204278881E-3,3.217158204278881E-3,2.1193549419320901,{"$f":"Rdson1*AB107^2","v":0.10779996887740734},0.1948442653580694,6.3360000000000014E-2,0,{"$f":"(AF107+AE107+AD107+AC107*(1+RdsonTopTc*Ta-RdsonTopTc*25))/(1-AC107*RdsonTopTc*ThetaJA_Q1)","v":0.36838696040748287},3.3671988551334713,{"$f":"Rdson2*AH107^2","v":0.20408450634021888},0.19317759999999998,{"$f":"(AJ107+AI107*(1+RdsonBotTc*Ta-RdsonBotTc*25))/(1-AI107*RdsonBotTc*ThetaJA_Q2)","v":0.40218691340089391},0.19317759999999998,0.77615999999999985,7.9148467499520661E-2,2.6400000000000001E-5,7.8099999999999989E-2,0.12418352941176468,0.10933999999999999,7.8126399999999985E-2,{"$f":" SUM(U107,X107,AA107,AG107,AK107,AL107,AM107,AS107,AN107)","v":2.0569625858578093},12.936,0.86280479431076218,13.20978840611224,9.8747957010134062,null,86.280479431076216,0.15609579284572872,1.5467338738083765,0.88065256040748274,0.65831971340089379,7.9148467499520661E-2,1.6248602738083764,31.84726136664418]
[null,null,null,null,null,null,99,12,1,3.96,3.96,{"$f":"Vout*K108/(Vin*Efficiency)","v":1.21},0.28383866676003078,{"$f":"(Vin-(Rdson1+Rdcr)*K108-Vout)*M108/(Fsw*Lf)","v":2.3583040328840434},5.1391520164420221,2.7808479835579782,{"$f":"IF(MIN(Vin, -P108/(Coss_Q1+Coss_Q2)*0.00000002)<0, 0, MIN(Vin, -P108/(Coss_Q1+Coss_Q2)*0.00000002))","v":0},4.0180923947348983,{"$f":"R108^2*Rdcr","v":5.650773272419251E-2},0.1,{"$f":"(T108+S108*(1+Ltc*(Ta-25)))/(1-S108*Ltc*ThetaCa)","v":0.15721845740984253},0.68078373410829129,4.6346649262642863E-4,4.6346649262642863E-4,1.8115950802381482,3.2818767347430624E-3,3.2818767347430624E-3,2.140699452987068,{"$f":"Rdson1*AB108^2","v":0.10998225955245917},0.1968324721474374,6.3360000000000014E-2,0,{"$f":"(AF108+AE108+AD108+AC108*(1+RdsonTopTc*Ta-RdsonTopTc*25))/(1-AC108*RdsonTopTc*ThetaJA_Q1)","v":0.37263371759468633},3.4003635606516105,{"$f":"Rdson2*AH108^2","v":0.20812450220293136},0.19514879999999998,{"$f":"(AJ108+AI108*(1+RdsonBotTc*Ta-RdsonBotTc*25))/(1-AI108*RdsonBotTc*ThetaJA_Q2)","v":0.40837284591913825},0.19514879999999998,0.78407999999999989,8.0725332463132154E-2,2.6400000000000001E-5,7.8099999999999989E-2,0.12418352941176468,0.10933999999999999,7.8126399999999985E-2,{"$f":" SUM(U108,X108,AA108,AG108,AK108,AL108,AM108,AS108,AN108)","v":2.0800508966141686},13.068,0.86268524506482258,13.351897763920295,10.006788688787072,null,86.268524506482265,0.15721845740984253,1.5650865635138245,0.89012651759468631,0.66711924591913818,8.0725332463132154E-2,1.6432129635138244,32.206974084870957]
[null,null,null,null,null,null,100,12,1,4,4,{"$f":"Vout*K109/(Vin*Efficiency)","v":1.2222222222222221},0.28392797599199732,{"$f":"(Vin-(Rdson1+Rdcr)*K109-Vout)*M109/(Fsw*Lf)","v":2.3587440171869027},5.1793720085934511,2.8206279914065489,{"$f":"IF(MIN(Vin, -P109/(Coss_Q1+Coss_Q2)*0.00000002)<0, 0, MIN(Vin, -P109/(Coss_Q1+Coss_Q2)*0.00000002))","v":0},4.0575410589277574,{"$f":"R109^2*Rdcr","v":5.7622738057096064E-2},0.1,{"$f":"(T109+S109*(1+Ltc*(Ta-25)))/(1-S109*Ltc*ThetaCa)","v":0.15835271542040003},0.68091074663613882,4.6363944488458404E-4,4.6363944488458404E-4,1.82955457914842,3.3472699580829523E-3,3.3472699580829523E-3,2.1620563880361887,{"$f":"Rdson1*AB109^2","v":0.11218770780115417},0.19882067893680549,6.3360000000000014E-2,0,{"$f":"(AF109+AE109+AD109+AC109*(1+RdsonTopTc*Ta-RdsonTopTc*25))/(1-AC109*RdsonTopTc*ThetaJA_Q1)","v":0.37690543615435679},3.4335334015903349,{"$f":"Rdson2*AH109^2","v":0.2122047291570569},0.19711999999999999,{"$f":"(AJ109+AI109*(1+RdsonBotTc*Ta-RdsonBotTc*25))/(1-AI109*RdsonBotTc*ThetaJA_Q2)","v":0.41460357957574184},0.19711999999999999,0.79199999999999982,8.2318197224422948E-2,2.6400000000000001E-5,7.8099999999999989E-2,0.12418352941176468,0.10933999999999999,7.8126399999999985E-2,{"$f":" SUM(U109,X109,AA109,AG109,AK109,AL109,AM109,AS109,AN109)","v":2.103237237777889},13.2,0.86256259345011033,13.494381542315349,10.139453693636126,null,86.256259345011031,0.15835271542040003,1.5835090157300984,0.89962543615435664,0.67596357957574171,8.2318197224422948E-2,1.6616354157300983,32.568054148309926]

{"sheet":"Efficiency Plot Management","index":9,"n_rows":2,"n_cols":1,"rows_kept":2,"cut":false,"hidden":true,"merged":[]}
[]
[{"$f":"IF(PLOT_TYPE=1, \"EFF_Ch1\", \"EFF_Ch2\")","v":"EFF_Ch1"}]

{"sheet":"Standard Value Calculator","index":10,"n_rows":159,"n_cols":20,"rows_kept":159,"cut":false,"hidden":true,"merged":[]}
[]
["Capacitors","Css","Cc1ea","Cc2ea","Cout","Cin","Cres","Cdither","Cc3ea","Cc4ea","Cin_Passive","Cdamp_Pssv","Cinj_AEF","Cdamp_AEF"]
["Inputs",{"$f":"Css","v":0},{"$f":"Cc1ea","v":1.370178964755189E-8},{"$f":"Cc2ea","v":3.0449873379575508E-11},{"$f":"Cout","v":4.0000000000000003E-5},{"$f":"Cin","v":4.3999999999999999E-5},{"$f":"Cres","v":8.3333333333333338E-8},{"$f":"Cdither_init","v":2.0226537216828479E-9},{"$f":"Cc3ea","v":0},{"$f":"Cc4ea","v":0},{"$f":"'Variable Management'!B291*0.000001","v":{"$error":"#REF!"}},{"$f":"K3*4","v":{"$error":"#REF!"}},{"$f":"Cinj_AEF*0.000001","v":{"$error":"#VALUE!"}},{"$f":"'Variable Management'!B294*0.000001","v":{"$error":"#VALUE!"}},null,null,"Resistors","inputs","Standard Result"]
["Standard Result",{"$f":"SUM(B6:B158)/1000000000000","v":0},{"$f":"IF(C3=\"OPEN\",\"OPEN\",SUM(C6:C158)/1000000000000)","v":1.4999999999999999E-8},{"$f":"SUM(D6:D158)/1000000000000","v":3.3000000000000002E-11},{"$f":"SUM(E6:E158)/1000000000000","v":3.8999999999999999E-5},{"$f":"SUM(F6:F158)/1000000000000","v":4.6999999999999997E-5},{"$f":"SUM(G6:G158)/1000000000000","v":8.2000000000000006E-8},{"$f":"IF(H3=\"OPEN\",\"OPEN\",SUM(H6:H158)/1000000000000)","v":2.1999999999999998E-9},0,0,{"$error":"#REF!"},{"$error":"#REF!"},{"$error":"#VALUE!"},{"$error":"#VALUE!"},null,null,"Rt",{"$f":"Rfadj","v":9.09},{"$f":"IF(R4>(INT(0.5+100*POWER(10,IF(96*(LOG(R4)-INT(LOG(R4)))-ROUND(96*(LOG(R4)-INT(LOG(R4))),0)<0,ROUND(96*(LOG(R4)-INT(LOG(R4))),0)-1,ROUND(96*(LOG(R4)-INT(LOG(R4))),0))/96))*POWER(10,INT(LOG(R4))-2)+INT(0.5+100*POWER(10,(IF(96*(LOG(R4)-INT(LOG(R4)))-ROUND(96*(LOG(R4)-INT(LOG(R4))),0)<0,ROUND(96*(LOG(R4)-INT(LOG(R4))),0)-1,ROUND(96*(LOG(R4)-INT(LOG(R4))),0))+1)/96))*POWER(10,INT(LOG(R4))-2))/2,INT(0.5+100*POWER(10,(IF(96*(LOG(R4)-INT(LOG(R4)))-ROUND(96*(LOG(R4)-INT(LOG(R4))),0)<0,ROUND(96*(LOG(R4)-INT(LOG(R4))),0)-1,ROUND(96*(LOG(R4)-INT(LOG(R4))),0))+1)/96))*POWER(10,INT(LOG(R4))-2),INT(0.5+100*POWER(10,IF(96*(LOG(R4)-INT(LOG(R4)))-ROUND(96*(LOG(R4)-INT(LOG(R4))),0)<0,ROUND(96*(LOG(R4)-INT(LOG(R4))),0)-1,ROUND(96*(LOG(R4)-INT(LOG(R4))),0))/96))*POWER(10,INT(LOG(R4))-2))","v":9.09},"Ω"]
["(pF)"]
[0.47,{"$f":"IF(IF((B$3*10^12-$A7)*(B$3*10^12-$A6)*-1<0,0,1)*IF(ABS(B$3*10^12-$A7)>(B$3*10^12-$A6),$A6,$A7)=B7,0,IF((B$3*10^12-$A7)*(B$3*10^12-$A6)*-1<0,0,1)*IF(ABS(B$3*10^12-$A7)>(B$3*10^12-$A6),$A6,$A7))","v":0},0,0,0,0,0,0,0,0,{"$error":"#REF!"},{"$error":"#REF!"},{"$error":"#VALUE!"},{"$error":"#VALUE!"}]
[0.56000000000000005,{"$f":"IF(IF((B$3*10^12-$A8)*(B$3*10^12-$A7)*-1<0,0,1)*IF(ABS(B$3*10^12-$A8)>(B$3*10^12-$A7),$A7,$A8)=B8,0,IF((B$3*10^12-$A8)*(B$3*10^12-$A7)*-1<0,0,1)*IF(ABS(B$3*10^12-$A8)>(B$3*10^12-$A7),$A7,$A8))","v":0},{"$f":"IF(IF((C$3*10^12-$A8)*(C$3*10^12-$A7)*-1<0,0,1)*IF(ABS(C$3*10^12-$A8)>(C$3*10^12-$A7),$A7,$A8)=C8,0,IF((C$3*10^12-$A8)*(C$3*10^12-$A7)*-1<0,0,1)*IF(ABS(C$3*10^12-$A8)>(C$3*10^12-$A7),$A7,$A8))","v":0},{"$f":"IF(IF((D$3*10^12-$A8)*(D$3*10^12-$A7)*-1<0,0,1)*IF(ABS(D$3*10^12-$A8)>(D$3*10^12-$A7),$A7,$A8)=D8,0,IF((D$3*10^12-$A8)*(D$3*10^12-$A7)*-1<0,0,1)*IF(ABS(D$3*10^12-$A8)>(D$3*10^12-$A7),$A7,$A8))","v":0},{"$f":"IF(IF((E$3*10^12-$A8)*(E$3*10^12-$A7)*-1<0,0,1)*IF(ABS(E$3*10^12-$A8)>(E$3*10^12-$A7),$A7,$A8)=E8,0,IF((E$3*10^12-$A8)*(E$3*10^12-$A7)*-1<0,0,1)*IF(ABS(E$3*10^12-$A8)>(E$3*10^12-$A7),$A7,$A8))","v":0},{"$f":"IF(IF((F$3*10^12-$A8)*(F$3*10^12-$A7)*-1<0,0,1)*IF(ABS(F$3*10^12-$A8)>(F$3*10^12-$A7),$A7,$A8)=F8,0,IF((F$3*10^12-$A8)*(F$3*10^12-$A7)*-1<0,0,1)*IF(ABS(F$3*10^12-$A8)>(F$3*10^12-$A7),$A7,$A8))","v":0},{"$f":"IF(IF((G$3*10^12-$A8)*(G$3*10^12-$A7)*-1<0,0,1)*IF(ABS(G$3*10^12-$A8)>(G$3*10^12-$A7),$A7,$A8)=G8,0,IF((G$3*10^12-$A8)*(G$3*10^12-$A7)*-1<0,0,1)*IF(ABS(G$3*10^12-$A8)>(G$3*10^12-$A7),$A7,$A8))","v":0},0,0,0,{"$f":"IF(IF((K$3*10^12-$A8)*(K$3*10^12-$A7)*-1<0,0,1)*IF(ABS(K$3*10^12-$A8)>(K$3*10^12-$A7),$A7,$A8)=K8,0,IF((K$3*10^12-$A8)*(K$3*10^12-$A7)*-1<0,0,1)*IF(ABS(K$3*10^12-$A8)>(K$3*10^12-$A7),$A7,$A8))","v":{"$error":"#REF!"}},{"$error":"#REF!"},{"$error":"#VALUE!"},{"$error":"#VALUE!"},null,null,"Rc1ea",{"$f":"Rcea1","v":2323.1263560113507},{"$f":"IF(R7>(INT(0.5+100*POWER(10,IF(96*(LOG(R7)-INT(LOG(R7)))-ROUND(96*(LOG(R7)-INT(LOG(R7))),0)<0,ROUND(96*(LOG(R7)-INT(LOG(R7))),0)-1,ROUND(96*(LOG(R7)-INT(LOG(R7))),0))/96))*POWER(10,INT(LOG(R7))-2)+INT(0.5+100*POWER(10,(IF(96*(LOG(R7)-INT(LOG(R7)))-ROUND(96*(LOG(R7)-INT(LOG(R7))),0)<0,ROUND(96*(LOG(R7)-INT(LOG(R7))),0)-1,ROUND(96*(LOG(R7)-INT(LOG(R7))),0))+1)/96))*POWER(10,INT(LOG(R7))-2))/2,INT(0.5+100*POWER(10,(IF(96*(LOG(R7)-INT(LOG(R7)))-ROUND(96*(LOG(R7)-INT(LOG(R7))),0)<0,ROUND(96*(LOG(R7)-INT(LOG(R7))),0)-1,ROUND(96*(LOG(R7)-INT(LOG(R7))),0))+1)/96))*POWER(10,INT(LOG(R7))-2),INT(0.5+100*POWER(10,IF(96*(LOG(R7)-INT(LOG(R7)))-ROUND(96*(LOG(R7)-INT(LOG(R7))),0)<0,ROUND(96*(LOG(R7)-INT(LOG(R7))),0)-1,ROUND(96*(LOG(R7)-INT(LOG(R7))),0))/96))*POWER(10,INT(LOG(R7))-2))","v":2320},"Ω"]
[0.68,0,0,0,0,0,0,0,0,0,{"$error":"#REF!"},{"$error":"#REF!"},{"$error":"#VALUE!"},{"$error":"#VALUE!"},null,null,"Rc1ea",{"$f":"Rcea2","v":0},{"$f":"IF(R8>(INT(0.5+100*POWER(10,IF(96*(LOG(R8)-INT(LOG(R8)))-ROUND(96*(LOG(R8)-INT(LOG(R8))),0)<0,ROUND(96*(LOG(R8)-INT(LOG(R8))),0)-1,ROUND(96*(LOG(R8)-INT(LOG(R8))),0))/96))*POWER(10,INT(LOG(R8))-2)+INT(0.5+100*POWER(10,(IF(96*(LOG(R8)-INT(LOG(R8)))-ROUND(96*(LOG(R8)-INT(LOG(R8))),0)<0,ROUND(96*(LOG(R8)-INT(LOG(R8))),0)-1,ROUND(96*(LOG(R8)-INT(LOG(R8))),0))+1)/96))*POWER(10,INT(LOG(R8))-2))/2,INT(0.5+100*POWER(10,(IF(96*(LOG(R8)-INT(LOG(R8)))-ROUND(96*(LOG(R8)-INT(LOG(R8))),0)<0,ROUND(96*(LOG(R8)-INT(LOG(R8))),0)-1,ROUND(96*(LOG(R8)-INT(LOG(R8))),0))+1)/96))*POWER(10,INT(LOG(R8))-2),INT(0.5+100*POWER(10,IF(96*(LOG(R8)-INT(LOG(R8)))-ROUND(96*(LOG(R8)-INT(LOG(R8))),0)<0,ROUND(96*(LOG(R8)-INT(LOG(R8))),0)-1,ROUND(96*(LOG(R8)-INT(LOG(R8))),0))/96))*POWER(10,INT(LOG(R8))-2))","v":{"$error":"#NUM!"}},"Ω"]
[0.82,0,0,0,0,0,0,0,0,0,{"$error":"#REF!"},{"$error":"#REF!"},{"$error":"#VALUE!"},{"$error":"#VALUE!"}]
[1,0,0,0,0,0,0,0,0,0,{"$error":"#REF!"},{"$error":"#REF!"},{"$error":"#VALUE!"},{"$error":"#VALUE!"},null,null,"Rfb1",{"$f":"Rfb1_","v":2500000},{"$f":"IF(R10>(INT(0.5+100*POWER(10,IF(96*(LOG(R10)-INT(LOG(R10)))-ROUND(96*(LOG(R10)-INT(LOG(R10))),0)<0,ROUND(96*(LOG(R10)-INT(LOG(R10))),0)-1,ROUND(96*(LOG(R10)-INT(LOG(R10))),0))/96))*POWER(10,INT(LOG(R10))-2)+INT(0.5+100*POWER(10,(IF(96*(LOG(R10)-INT(LOG(R10)))-ROUND(96*(LOG(R10)-INT(LOG(R10))),0)<0,ROUND(96*(LOG(R10)-INT(LOG(R10))),0)-1,ROUND(96*(LOG(R10)-INT(LOG(R10))),0))+1)/96))*POWER(10,INT(LOG(R10))-2))/2,INT(0.5+100*POWER(10,(IF(96*(LOG(R10)-INT(LOG(R10)))-ROUND(96*(LOG(R10)-INT(LOG(R10))),0)<0,ROUND(96*(LOG(R10)-INT(LOG(R10))),0)-1,ROUND(96*(LOG(R10)-INT(LOG(R10))),0))+1)/96))*POWER(10,INT(LOG(R10))-2),INT(0.5+100*POWER(10,IF(96*(LOG(R10)-INT(LOG(R10)))-ROUND(96*(LOG(R10)-INT(LOG(R10))),0)<0,ROUND(96*(LOG(R10)-INT(LOG(R10))),0)-1,ROUND(96*(LOG(R10)-INT(LOG(R10))),0))/96))*POWER(10,INT(LOG(R10))-2))","v":2490000},"Ω"]
[1.2,0,0,0,0,0,0,0,0,0,{"$error":"#REF!"},{"$error":"#REF!"},{"$f":"IF(IF((M$3*10^12-$A12)*(M$3*10^12-$A11)*-1<0,0,1)*IF(ABS(M$3*10^12-$A12)>(M$3*10^12-$A11),$A11,$A12)=M12,0,IF((M$3*10^12-$A12)*(M$3*10^12-$A11)*-1<0,0,1)*IF(ABS(M$3*10^12-$A12)>(M$3*10^12-$A11),$A11,$A12))","v":{"$error":"#VALUE!"}},{"$error":"#VALUE!"},null,null,"Rfb2",{"$f":"Rfb2_","v":800000},{"$f":"IF(R11=\"OPEN\",\"OPEN\",IF(R11>(INT(0.5+100*POWER(10,IF(96*(LOG(R11)-INT(LOG(R11)))-ROUND(96*(LOG(R11)-INT(LOG(R11))),0)<0,ROUND(96*(LOG(R11)-INT(LOG(R11))),0)-1,ROUND(96*(LOG(R11)-INT(LOG(R11))),0))/96))*POWER(10,INT(LOG(R11))-2)+INT(0.5+100*POWER(10,(IF(96*(LOG(R11)-INT(LOG(R11)))-ROUND(96*(LOG(R11)-INT(LOG(R11))),0)<0,ROUND(96*(LOG(R11)-INT(LOG(R11))),0)-1,ROUND(96*(LOG(R11)-INT(LOG(R11))),0))+1)/96))*POWER(10,INT(LOG(R11))-2))/2,INT(0.5+100*POWER(10,(IF(96*(LOG(R11)-INT(LOG(R11)))-ROUND(96*(LOG(R11)-INT(LOG(R11))),0)<0,ROUND(96*(LOG(R11)-INT(LOG(R11))),0)-1,ROUND(96*(LOG(R11)-INT(LOG(R11))),0))+1)/96))*POWER(10,INT(LOG(R11))-2),INT(0.5+100*POWER(10,IF(96*(LOG(R11)-INT(LOG(R11)))-ROUND(96*(LOG(R11)-INT(LOG(R11))),0)<0,ROUND(96*(LOG(R11)-INT(LOG(R11))),0)-1,ROUND(96*(LOG(R11)-INT(LOG(R11))),0))/96))*POWER(10,INT(LOG(R11))-2)))","v":806000},"Ω"]
[1.5,0,0,0,0,0,0,0,0,0,{"$error":"#REF!"},{"$error":"#REF!"},{"$error":"#VALUE!"},{"$error":"#VALUE!"},null,null,"Rt1",{"$f":"'Variable Management'!B27*1000","v":9023.2323232323233},{"$f":"IF(R12>(INT(0.5+100*POWER(10,IF(96*(LOG(R12)-INT(LOG(R12)))-ROUND(96*(LOG(R12)-INT(LOG(R12))),0)<0,ROUND(96*(LOG(R12)-INT(LOG(R12))),0)-1,ROUND(96*(LOG(R12)-INT(LOG(R12))),0))/96))*POWER(10,INT(LOG(R12))-2)+INT(0.5+100*POWER(10,(IF(96*(LOG(R12)-INT(LOG(R12)))-ROUND(96*(LOG(R12)-INT(LOG(R12))),0)<0,ROUND(96*(LOG(R12)-INT(LOG(R12))),0)-1,ROUND(96*(LOG(R12)-INT(LOG(R12))),0))+1)/96))*POWER(10,INT(LOG(R12))-2))/2,INT(0.5+100*POWER(10,(IF(96*(LOG(R12)-INT(LOG(R12)))-ROUND(96*(LOG(R12)-INT(LOG(R12))),0)<0,ROUND(96*(LOG(R12)-INT(LOG(R12))),0)-1,ROUND(96*(LOG(R12)-INT(LOG(R12))),0))+1)/96))*POWER(10,INT(LOG(R12))-2),INT(0.5+100*POWER(10,IF(96*(LOG(R12)-INT(LOG(R12)))-ROUND(96*(LOG(R12)-INT(LOG(R12))),0)<0,ROUND(96*(LOG(R12)-INT(LOG(R12))),0)-1,ROUND(96*(LOG(R12)-INT(LOG(R12))),0))/96))*POWER(10,INT(LOG(R12))-2))","v":9090},"Ω"]
[1.8,0,0,0,0,0,0,0,0,0,{"$error":"#REF!"},{"$error":"#REF!"},{"$error":"#VALUE!"},{"$error":"#VALUE!"},null,null,"Rd",{"$f":"'Variable Management'!B28*1000","v":0},{"$f":"IF(R13=\"OPEN\",\"OPEN\",IF(R13>(INT(0.5+100*POWER(10,IF(96*(LOG(R13)-INT(LOG(R13)))-ROUND(96*(LOG(R13)-INT(LOG(R13))),0)<0,ROUND(96*(LOG(R13)-INT(LOG(R13))),0)-1,ROUND(96*(LOG(R13)-INT(LOG(R13))),0))/96))*POWER(10,INT(LOG(R13))-2)+INT(0.5+100*POWER(10,(IF(96*(LOG(R13)-INT(LOG(R13)))-ROUND(96*(LOG(R13)-INT(LOG(R13))),0)<0,ROUND(96*(LOG(R13)-INT(LOG(R13))),0)-1,ROUND(96*(LOG(R13)-INT(LOG(R13))),0))+1)/96))*POWER(10,INT(LOG(R13))-2))/2,INT(0.5+100*POWER(10,(IF(96*(LOG(R13)-INT(LOG(R13)))-ROUND(96*(LOG(R13)-INT(LOG(R13))),0)<0,ROUND(96*(LOG(R13)-INT(LOG(R13))),0)-1,ROUND(96*(LOG(R13)-INT(LOG(R13))),0))+1)/96))*POWER(10,INT(LOG(R13))-2),INT(0.5+100*POWER(10,IF(96*(LOG(R13)-INT(LOG(R13)))-ROUND(96*(LOG(R13)-INT(LOG(R13))),0)<0,ROUND(96*(LOG(R13)-INT(LOG(R13))),0)-1,ROUND(96*(LOG(R13)-INT(LOG(R13))),0))/96))*POWER(10,INT(LOG(R13))-2)))","v":{"$error":"#NUM!"}},"Ω"]
[2.2000000000000002,{"$f":"IF(IF((B$3*10^12-$A15)*(B$3*10^12-$A14)*-1<0,0,1)*IF(ABS(B$3*10^12-$A15)>(B$3*10^12-$A14),$A14,$A15)=B15,0,IF((B$3*10^12-$A15)*(B$3*10^12-$A14)*-1<0,0,1)*IF(ABS(B$3*10^12-$A15)>(B$3*10^12-$A14),$A14,$A15))","v":0},0,0,0,0,0,0,0,0,{"$error":"#REF!"},{"$error":"#REF!"},{"$error":"#VALUE!"},{"$error":"#VALUE!"},null,null,"Rd_AEF",{"$f":"'Variable Management'!B300","v":0},{"$f":"IF(R14=\"OPEN\",\"OPEN\",IF(R14>(INT(0.5+100*POWER(10,IF(96*(LOG(R14)-INT(LOG(R14)))-ROUND(96*(LOG(R14)-INT(LOG(R14))),0)<0,ROUND(96*(LOG(R14)-INT(LOG(R14))),0)-1,ROUND(96*(LOG(R14)-INT(LOG(R14))),0))/96))*POWER(10,INT(LOG(R14))-2)+INT(0.5+100*POWER(10,(IF(96*(LOG(R14)-INT(LOG(R14)))-ROUND(96*(LOG(R14)-INT(LOG(R14))),0)<0,ROUND(96*(LOG(R14)-INT(LOG(R14))),0)-1,ROUND(96*(LOG(R14)-INT(LOG(R14))),0))+1)/96))*POWER(10,INT(LOG(R14))-2))/2,INT(0.5+100*POWER(10,(IF(96*(LOG(R14)-INT(LOG(R14)))-ROUND(96*(LOG(R14)-INT(LOG(R14))),0)<0,ROUND(96*(LOG(R14)-INT(LOG(R14))),0)-1,ROUND(96*(LOG(R14)-INT(LOG(R14))),0))+1)/96))*POWER(10,INT(LOG(R14))-2),INT(0.5+100*POWER(10,IF(96*(LOG(R14)-INT(LOG(R14)))-ROUND(96*(LOG(R14)-INT(LOG(R14))),0)<0,ROUND(96*(LOG(R14)-INT(LOG(R14))),0)-1,ROUND(96*(LOG(R14)-INT(LOG(R14))),0))/96))*POWER(10,INT(LOG(R14))-2)))","v":{"$error":"#NUM!"}},"Ω"]
[2.7,0,0,0,0,0,0,0,0,0,{"$f":"IF(IF((K$3*10^12-$A16)*(K$3*10^12-$A15)*-1<0,0,1)*IF(ABS(K$3*10^12-$A16)>(K$3*10^12-$A15),$A15,$A16)=K16,0,IF((K$3*10^12-$A16)*(K$3*10^12-$A15)*-1<0,0,1)*IF(ABS(K$3*10^12-$A16)>(K$3*10^12-$A15),$A15,$A16))","v":{"$error":"#REF!"}},{"$error":"#REF!"},{"$error":"#VALUE!"},{"$error":"#VALUE!"}]
[3.3,0,0,0,0,0,0,0,0,0,{"$error":"#REF!"},{"$error":"#REF!"},{"$error":"#VALUE!"},{"$error":"#VALUE!"},null,null,"Rs",{"$f":"Rs_ideal*1000","v":6.8569555028853149},{"$f":"IF(R16=0,0,IF(R16>(INT(0.5+100*POWER(10,IF(96*(LOG(R16)-INT(LOG(R16)))-ROUND(96*(LOG(R16)-INT(LOG(R16))),0)<0,ROUND(96*(LOG(R16)-INT(LOG(R16))),0)-1,ROUND(96*(LOG(R16)-INT(LOG(R16))),0))/96))*POWER(10,INT(LOG(R16))-2)+INT(0.5+100*POWER(10,(IF(96*(LOG(R16)-INT(LOG(R16)))-ROUND(96*(LOG(R16)-INT(LOG(R16))),0)<0,ROUND(96*(LOG(R16)-INT(LOG(R16))),0)-1,ROUND(96*(LOG(R16)-INT(LOG(R16))),0))+1)/96))*POWER(10,INT(LOG(R16))-2))/2,INT(0.5+100*POWER(10,(IF(96*(LOG(R16)-INT(LOG(R16)))-ROUND(96*(LOG(R16)-INT(LOG(R16))),0)<0,ROUND(96*(LOG(R16)-INT(LOG(R16))),0)-1,ROUND(96*(LOG(R16)-INT(LOG(R16))),0))+1)/96))*POWER(10,INT(LOG(R16))-2),INT(0.5+100*POWER(10,IF(96*(LOG(R16)-INT(LOG(R16)))-ROUND(96*(LOG(R16)-INT(LOG(R16))),0)<0,ROUND(96*(LOG(R16)-INT(LOG(R16))),0)-1,ROUND(96*(LOG(R16)-INT(LOG(R16))),0))/96))*POWER(10,INT(LOG(R16))-2)))","v":6.8100000000000005},"mΩ"]
[3.9,0,0,0,0,0,0,0,0,0,{"$error":"#REF!"},{"$error":"#REF!"},{"$error":"#VALUE!"},{"$error":"#VALUE!"},null,null,"Cres",{"$f":"Cres","v":8.3333333333333338E-8},{"$f":"G4*1000000000000","v":82000},"pF"]
[4.7,0,0,0,0,0,0,0,0,0,{"$error":"#REF!"},{"$error":"#REF!"},{"$error":"#VALUE!"},{"$error":"#VALUE!"}]
[5.6,0,0,0,0,0,0,0,0,0,{"$error":"#REF!"},{"$error":"#REF!"},{"$error":"#VALUE!"},{"$error":"#VALUE!"}]
[6.8,0,0,0,0,0,0,0,0,0,{"$error":"#REF!"},{"$error":"#REF!"},{"$error":"#VALUE!"},{"$error":"#VALUE!"}]
[8.1999999999999993,0,0,0,0,0,0,0,0,0,{"$error":"#REF!"},{"$error":"#REF!"},{"$error":"#VALUE!"},{"$error":"#VALUE!"},null,null,"Cdither",{"$f":"Cdither_init","v":2.0226537216828479E-9},{"$f":"H4","v":2.1999999999999998E-9}]
[10,0,0,0,0,0,0,0,0,0,{"$f":"IF(IF((K$3*10^12-$A23)*(K$3*10^12-$A22)*-1<0,0,1)*IF(ABS(K$3*10^12-$A23)>(K$3*10^12-$A22),$A22,$A23)=K23,0,IF((K$3*10^12-$A23)*(K$3*10^12-$A22)*-1<0,0,1)*IF(ABS(K$3*10^12-$A23)>(K$3*10^12-$A22),$A22,$A23))","v":{"$error":"#REF!"}},{"$error":"#REF!"},{"$error":"#VALUE!"},{"$error":"#VALUE!"}]
[12,0,0,0,0,0,0,0,0,0,{"$error":"#REF!"},{"$error":"#REF!"},{"$error":"#VALUE!"},{"$error":"#VALUE!"},null,null,"Cin_Passive",{"$f":"K4","v":{"$error":"#REF!"}},{"$f":"R23*1000000","v":{"$error":"#REF!"}},"uF"]
[15,0,0,0,0,0,0,0,0,0,{"$error":"#REF!"},{"$error":"#REF!"},{"$error":"#VALUE!"},{"$error":"#VALUE!"},null,null,"Cinj_AEF",{"$f":"Cinj_AEF","v":{"$error":"#VALUE!"}},{"$f":"M4*1000000","v":{"$error":"#VALUE!"}},"uF"]
[18,0,0,0,0,0,0,0,0,0,{"$error":"#REF!"},{"$error":"#REF!"},{"$error":"#VALUE!"},{"$error":"#VALUE!"},null,null,"Cdamp_AEF",{"$f":"'Variable Management'!B294","v":{"$error":"#VALUE!"}},{"$f":"N4*1000000","v":{"$error":"#VALUE!"}},"uF"]
[22,0,0,0,0,0,0,0,0,0,{"$error":"#REF!"},{"$error":"#REF!"},{"$error":"#VALUE!"},{"$error":"#VALUE!"},null,null,"Rdamp_AEF",{"$f":"'Variable Management'!B295","v":{"$error":"#VALUE!"}},{"$f":"IF(R26=\"OPEN\",\"OPEN\",IF(R26>(INT(0.5+100*POWER(10,IF(96*(LOG(R26)-INT(LOG(R26)))-ROUND(96*(LOG(R26)-INT(LOG(R26))),0)<0,ROUND(96*(LOG(R26)-INT(LOG(R26))),0)-1,ROUND(96*(LOG(R26)-INT(LOG(R26))),0))/96))*POWER(10,INT(LOG(R26))-2)+INT(0.5+100*POWER(10,(IF(96*(LOG(R26)-INT(LOG(R26)))-ROUND(96*(LOG(R26)-INT(LOG(R26))),0)<0,ROUND(96*(LOG(R26)-INT(LOG(R26))),0)-1,ROUND(96*(LOG(R26)-INT(LOG(R26))),0))+1)/96))*POWER(10,INT(LOG(R26))-2))/2,INT(0.5+100*POWER(10,(IF(96*(LOG(R26)-INT(LOG(R26)))-ROUND(96*(LOG(R26)-INT(LOG(R26))),0)<0,ROUND(96*(LOG(R26)-INT(LOG(R26))),0)-1,ROUND(96*(LOG(R26)-INT(LOG(R26))),0))+1)/96))*POWER(10,INT(LOG(R26))-2),INT(0.5+100*POWER(10,IF(96*(LOG(R26)-INT(LOG(R26)))-ROUND(96*(LOG(R26)-INT(LOG(R26))),0)<0,ROUND(96*(LOG(R26)-INT(LOG(R26))),0)-1,ROUND(96*(LOG(R26)-INT(LOG(R26))),0))/96))*POWER(10,INT(LOG(R26))-2)))","v":{"$error":"#VALUE!"}},"Ω"]
[27,0,0,33,0,0,0,0,0,0,{"$error":"#REF!"},{"$error":"#REF!"},{"$f":"IF(IF((M$3*10^12-$A28)*(M$3*10^12-$A27)*-1<0,0,1)*IF(ABS(M$3*10^12-$A28)>(M$3*10^12-$A27),$A27,$A28)=M28,0,IF((M$3*10^12-$A28)*(M$3*10^12-$A27)*-1<0,0,1)*IF(ABS(M$3*10^12-$A28)>(M$3*10^12-$A27),$A27,$A28))","v":{"$error":"#VALUE!"}},{"$error":"#VALUE!"},null,null,"Rdamp_Passive",{"$f":"SQRT(L_infilterStd/K4)","v":{"$error":"#REF!"}},{"$f":"IF(R27=\"OPEN\",\"OPEN\",IF(R27>(INT(0.5+100*POWER(10,IF(96*(LOG(R27)-INT(LOG(R27)))-ROUND(96*(LOG(R27)-INT(LOG(R27))),0)<0,ROUND(96*(LOG(R27)-INT(LOG(R27))),0)-1,ROUND(96*(LOG(R27)-INT(LOG(R27))),0))/96))*POWER(10,INT(LOG(R27))-2)+INT(0.5+100*POWER(10,(IF(96*(LOG(R27)-INT(LOG(R27)))-ROUND(96*(LOG(R27)-INT(LOG(R27))),0)<0,ROUND(96*(LOG(R27)-INT(LOG(R27))),0)-1,ROUND(96*(LOG(R27)-INT(LOG(R27))),0))+1)/96))*POWER(10,INT(LOG(R27))-2))/2,INT(0.5+100*POWER(10,(IF(96*(LOG(R27)-INT(LOG(R27)))-ROUND(96*(LOG(R27)-INT(LOG(R27))),0)<0,ROUND(96*(LOG(R27)-INT(LOG(R27))),0)-1,ROUND(96*(LOG(R27)-INT(LOG(R27))),0))+1)/96))*POWER(10,INT(LOG(R27))-2),INT(0.5+100*POWER(10,IF(96*(LOG(R27)-INT(LOG(R27)))-ROUND(96*(LOG(R27)-INT(LOG(R27))),0)<0,ROUND(96*(LOG(R27)-INT(LOG(R27))),0)-1,ROUND(96*(LOG(R27)-INT(LOG(R27))),0))/96))*POWER(10,INT(LOG(R27))-2)))","v":{"$error":"#REF!"}},"Ω"]
[33,0,0,0,0,0,0,0,0,0,{"$error":"#REF!"},{"$error":"#REF!"},{"$error":"#VALUE!"},{"$error":"#VALUE!"},null,null,"Cdamp_Passive",{"$f":"L4","v":{"$error":"#REF!"}},{"$f":"R28*1000000","v":{"$error":"#REF!"}},"uF"]
[39,0,0,0,0,0,0,0,0,0,{"$error":"#REF!"},{"$error":"#REF!"},{"$error":"#VALUE!"},{"$error":"#VALUE!"}]
[47,0,0,0,0,0,0,0,0,0,{"$error":"#REF!"},{"$error":"#REF!"},{"$error":"#VALUE!"},{"$error":"#VALUE!"}]
[56,0,0,0,0,0,0,0,0,0,{"$error":"#REF!"},{"$error":"#REF!"},{"$error":"#VALUE!"},{"$error":"#VALUE!"}]
[68,0,0,0,0,0,0,0,0,0,{"$error":"#REF!"},{"$error":"#REF!"},{"$error":"#VALUE!"},{"$error":"#VALUE!"},null,null,"Rc1",{"$f":"S7/1000&\" kΩ\"","v":"2.32 kΩ"},{"$f":"S7/1000","v":2.3199999999999998},"kΩ"]
[82,0,0,0,0,0,0,0,0,0,{"$error":"#REF!"},{"$error":"#REF!"},{"$error":"#VALUE!"},{"$error":"#VALUE!"},null,null,"Cc1",{"$f":"C4*1000000000&\" nF\"","v":"15 nF"},{"$f":"C4*1000000000","v":14.999999999999998},"nF"]
[{"$f":"A22*10","v":100},0,0,0,0,0,0,0,0,0,{"$error":"#REF!"},{"$error":"#REF!"},{"$error":"#VALUE!"},{"$error":"#VALUE!"},null,null,"Cc2",{"$f":"D4*1000000000000&\" pF\"","v":"33 pF"},{"$f":"D4*1000000000000","v":33},"pF"]
[{"$f":"A23*10","v":120},0,0,0,0,0,0,0,0,0,{"$error":"#REF!"},{"$error":"#REF!"},{"$error":"#VALUE!"},{"$error":"#VALUE!"}]
[150,0,0,0,0,0,0,0,0,0,{"$error":"#REF!"},{"$error":"#REF!"},{"$error":"#VALUE!"},{"$error":"#VALUE!"},null,null,"Rc2",{"$f":"S8/1000&\" kΩ\"","v":{"$error":"#NUM!"}},{"$f":"S8/1000","v":{"$error":"#NUM!"}},"kΩ"]
[180,0,0,0,0,0,0,0,0,0,{"$error":"#REF!"},{"$error":"#REF!"},{"$error":"#VALUE!"},{"$error":"#VALUE!"},null,null,"Cc3",{"$f":"I4*1000000000&\" nF\"","v":"0 nF"},{"$f":"I4*1000000000","v":0},"nF"]
[220,0,0,0,0,0,0,0,0,0,{"$error":"#REF!"},{"$error":"#REF!"},{"$error":"#VALUE!"},{"$error":"#VALUE!"},null,null,"Cc4",{"$f":"J4*1000000000000&\" pF\"","v":"0 pF"},{"$f":"J4*1000000000000","v":0},"pF"]
[270,0,{"$f":"IF(IF((C$3*10^12-$A40)*(C$3*10^12-$A39)*-1<0,0,1)*IF(ABS(C$3*10^12-$A40)>(C$3*10^12-$A39),$A39,$A40)=C40,0,IF((C$3*10^12-$A40)*(C$3*10^12-$A39)*-1<0,0,1)*IF(ABS(C$3*10^12-$A40)>(C$3*10^12-$A39),$A39,$A40))","v":0},0,0,0,0,0,0,0,{"$error":"#REF!"},{"$error":"#REF!"},{"$error":"#VALUE!"},{"$error":"#VALUE!"}]
[330,0,0,0,0,0,0,0,0,0,{"$error":"#REF!"},{"$error":"#REF!"},{"$error":"#VALUE!"},{"$error":"#VALUE!"},null,null,"Rent",{"$f":"'Variable Management'!B185/1000","v":99.999999999999986},{"$f":"IF(R40>(INT(0.5+100*POWER(10,IF(96*(LOG(R40)-INT(LOG(R40)))-ROUND(96*(LOG(R40)-INT(LOG(R40))),0)<0,ROUND(96*(LOG(R40)-INT(LOG(R40))),0)-1,ROUND(96*(LOG(R40)-INT(LOG(R40))),0))/96))*POWER(10,INT(LOG(R40))-2)+INT(0.5+100*POWER(10,(IF(96*(LOG(R40)-INT(LOG(R40)))-ROUND(96*(LOG(R40)-INT(LOG(R40))),0)<0,ROUND(96*(LOG(R40)-INT(LOG(R40))),0)-1,ROUND(96*(LOG(R40)-INT(LOG(R40))),0))+1)/96))*POWER(10,INT(LOG(R40))-2))/2,INT(0.5+100*POWER(10,(IF(96*(LOG(R40)-INT(LOG(R40)))-ROUND(96*(LOG(R40)-INT(LOG(R40))),0)<0,ROUND(96*(LOG(R40)-INT(LOG(R40))),0)-1,ROUND(96*(LOG(R40)-INT(LOG(R40))),0))+1)/96))*POWER(10,INT(LOG(R40))-2),INT(0.5+100*POWER(10,IF(96*(LOG(R40)-INT(LOG(R40)))-ROUND(96*(LOG(R40)-INT(LOG(R40))),0)<0,ROUND(96*(LOG(R40)-INT(LOG(R40))),0)-1,ROUND(96*(LOG(R40)-INT(LOG(R40))),0))/96))*POWER(10,INT(LOG(R40))-2))","v":100},"kΩ"]
[390,0,0,0,0,0,0,0,0,0,{"$error":"#REF!"},{"$error":"#REF!"},{"$error":"#VALUE!"},{"$error":"#VALUE!"},null,null,"Renb",{"$f":"'Variable Management'!B186/1000","v":19.999999999999996},{"$f":"IF(R41>(INT(0.5+100*POWER(10,IF(96*(LOG(R41)-INT(LOG(R41)))-ROUND(96*(LOG(R41)-INT(LOG(R41))),0)<0,ROUND(96*(LOG(R41)-INT(LOG(R41))),0)-1,ROUND(96*(LOG(R41)-INT(LOG(R41))),0))/96))*POWER(10,INT(LOG(R41))-2)+INT(0.5+100*POWER(10,(IF(96*(LOG(R41)-INT(LOG(R41)))-ROUND(96*(LOG(R41)-INT(LOG(R41))),0)<0,ROUND(96*(LOG(R41)-INT(LOG(R41))),0)-1,ROUND(96*(LOG(R41)-INT(LOG(R41))),0))+1)/96))*POWER(10,INT(LOG(R41))-2))/2,INT(0.5+100*POWER(10,(IF(96*(LOG(R41)-INT(LOG(R41)))-ROUND(96*(LOG(R41)-INT(LOG(R41))),0)<0,ROUND(96*(LOG(R41)-INT(LOG(R41))),0)-1,ROUND(96*(LOG(R41)-INT(LOG(R41))),0))+1)/96))*POWER(10,INT(LOG(R41))-2),INT(0.5+100*POWER(10,IF(96*(LOG(R41)-INT(LOG(R41)))-ROUND(96*(LOG(R41)-INT(LOG(R41))),0)<0,ROUND(96*(LOG(R41)-INT(LOG(R41))),0)-1,ROUND(96*(LOG(R41)-INT(LOG(R41))),0))/96))*POWER(10,INT(LOG(R41))-2))","v":20},"kΩ"]
[470,0,0,0,0,0,0,0,0,0,{"$error":"#REF!"},{"$error":"#REF!"},{"$error":"#VALUE!"},{"$error":"#VALUE!"}]
[560,0,0,0,0,0,0,0,0,0,{"$error":"#REF!"},{"$error":"#REF!"},{"$f":"IF(IF((M$3*10^12-$A44)*(M$3*10^12-$A43)*-1<0,0,1)*IF(ABS(M$3*10^12-$A44)>(M$3*10^12-$A43),$A43,$A44)=M44,0,IF((M$3*10^12-$A44)*(M$3*10^12-$A43)*-1<0,0,1)*IF(ABS(M$3*10^12-$A44)>(M$3*10^12-$A43),$A43,$A44))","v":{"$error":"#VALUE!"}},{"$error":"#VALUE!"}]
[680,0,0,0,0,0,0,0,0,0,{"$error":"#REF!"},{"$error":"#REF!"},{"$error":"#VALUE!"},{"$error":"#VALUE!"}]
[{"$f":"A33*10","v":820},0,0,0,0,0,0,0,0,0,{"$error":"#REF!"},{"$error":"#REF!"},{"$error":"#VALUE!"},{"$error":"#VALUE!"}]
[1000,0,0,0,0,0,0,0,0,0,{"$error":"#REF!"},{"$error":"#REF!"},{"$error":"#VALUE!"},{"$error":"#VALUE!"}]
[1200,0,0,0,0,0,0,0,0,0,{"$error":"#REF!"},{"$error":"#REF!"},{"$error":"#VALUE!"},{"$error":"#VALUE!"}]
[1500,0,0,0,0,0,0,0,0,0,{"$error":"#REF!"},{"$error":"#REF!"},{"$error":"#VALUE!"},{"$error":"#VALUE!"}]
[1800,0,0,0,0,0,0,2200,0,0,{"$error":"#REF!"},{"$error":"#REF!"},{"$error":"#VALUE!"},{"$error":"#VALUE!"}]
[2200,0,0,0,0,0,0,0,0,0,{"$error":"#REF!"},{"$error":"#REF!"},{"$error":"#VALUE!"},{"$error":"#VALUE!"}]
[2700,0,0,0,0,0,0,0,0,0,{"$error":"#REF!"},{"$error":"#REF!"},{"$error":"#VALUE!"},{"$error":"#VALUE!"}]
[3300,0,0,0,0,0,0,0,0,0,{"$error":"#REF!"},{"$error":"#REF!"},{"$error":"#VALUE!"},{"$error":"#VALUE!"}]
[3900,0,0,0,0,0,0,0,0,0,{"$error":"#REF!"},{"$error":"#REF!"},{"$error":"#VALUE!"},{"$error":"#VALUE!"}]
[4700,0,0,0,0,0,0,0,0,0,{"$error":"#REF!"},{"$error":"#REF!"},{"$error":"#VALUE!"},{"$error":"#VALUE!"}]
[5600,0,0,0,0,0,0,0,0,0,{"$error":"#REF!"},{"$error":"#REF!"},{"$error":"#VALUE!"},{"$error":"#VALUE!"}]
[6800,0,0,0,0,0,0,0,0,0,{"$error":"#REF!"},{"$error":"#REF!"},{"$error":"#VALUE!"},{"$error":"#VALUE!"}]
[8200,0,0,0,0,0,0,0,0,0,{"$error":"#REF!"},{"$error":"#REF!"},{"$error":"#VALUE!"},{"$error":"#VALUE!"}]
[10000,0,0,0,0,0,0,0,0,0,{"$error":"#REF!"},{"$error":"#REF!"},{"$error":"#VALUE!"},{"$error":"#VALUE!"}]
[12000,0,15000,0,0,0,0,0,0,0,{"$error":"#REF!"},{"$error":"#REF!"},{"$f":"IF(IF((M$3*10^12-$A60)*(M$3*10^12-$A59)*-1<0,0,1)*IF(ABS(M$3*10^12-$A60)>(M$3*10^12-$A59),$A59,$A60)=M60,0,IF((M$3*10^12-$A60)*(M$3*10^12-$A59)*-1<0,0,1)*IF(ABS(M$3*10^12-$A60)>(M$3*10^12-$A59),$A59,$A60))","v":{"$error":"#VALUE!"}},{"$error":"#VALUE!"}]
[15000,0,0,0,0,0,0,0,0,0,{"$error":"#REF!"},{"$error":"#REF!"},{"$error":"#VALUE!"},{"$error":"#VALUE!"}]
[18000,0,0,0,0,0,0,0,0,0,{"$error":"#REF!"},{"$error":"#REF!"},{"$error":"#VALUE!"},{"$error":"#VALUE!"}]
[22000,0,0,0,0,0,0,0,0,0,{"$error":"#REF!"},{"$error":"#REF!"},{"$error":"#VALUE!"},{"$error":"#VALUE!"}]
[27000,0,0,0,0,0,0,0,0,0,{"$error":"#REF!"},{"$error":"#REF!"},{"$error":"#VALUE!"},{"$error":"#VALUE!"}]
[33000,0,0,0,0,0,0,0,0,0,{"$error":"#REF!"},{"$error":"#REF!"},{"$error":"#VALUE!"},{"$error":"#VALUE!"}]
[39000,0,0,0,0,0,0,0,0,0,{"$error":"#REF!"},{"$error":"#REF!"},{"$error":"#VALUE!"},{"$error":"#VALUE!"}]
[47000,0,0,0,0,0,0,0,0,0,{"$error":"#REF!"},{"$error":"#REF!"},{"$error":"#VALUE!"},{"$error":"#VALUE!"}]
[56000,0,0,0,0,0,0,0,0,0,{"$error":"#REF!"},{"$error":"#REF!"},{"$error":"#VALUE!"},{"$error":"#VALUE!"}]
[68000,0,0,0,0,0,0,0,0,0,{"$error":"#REF!"},{"$error":"#REF!"},{"$error":"#VALUE!"},{"$error":"#VALUE!"}]
[82000,0,0,0,0,0,82000,0,0,{"$f":"IF(IF((J$3*10^12-$A70)*(J$3*10^12-$A69)*-1<0,0,1)*IF(ABS(J$3*10^12-$A70)>(J$3*10^12-$A69),$A69,$A70)=J70,0,IF((J$3*10^12-$A70)*(J$3*10^12-$A69)*-1<0,0,1)*IF(ABS(J$3*10^12-$A70)>(J$3*10^12-$A69),$A69,$A70))","v":0},{"$error":"#REF!"},{"$error":"#REF!"},{"$error":"#VALUE!"},{"$error":"#VALUE!"}]
[100000,0,0,{"$f":"IF(IF((D$3*10^12-$A71)*(D$3*10^12-$A70)*-1<0,0,1)*IF(ABS(D$3*10^12-$A71)>(D$3*10^12-$A70),$A70,$A71)=D71,0,IF((D$3*10^12-$A71)*(D$3*10^12-$A70)*-1<0,0,1)*IF(ABS(D$3*10^12-$A71)>(D$3*10^12-$A70),$A70,$A71))","v":0},0,0,0,0,0,0,{"$error":"#REF!"},{"$error":"#REF!"},{"$error":"#VALUE!"},{"$error":"#VALUE!"}]
[120000,{"$f":"IF(IF((B$3*10^12-$A72)*(B$3*10^12-$A71)*-1<0,0,1)*IF(ABS(B$3*10^12-$A72)>(B$3*10^12-$A71),$A71,$A72)=B72,0,IF((B$3*10^12-$A72)*(B$3*10^12-$A71)*-1<0,0,1)*IF(ABS(B$3*10^12-$A72)>(B$3*10^12-$A71),$A71,$A72))","v":0},{"$f":"IF(IF((C$3*10^12-$A72)*(C$3*10^12-$A71)*-1<0,0,1)*IF(ABS(C$3*10^12-$A72)>(C$3*10^12-$A71),$A71,$A72)=C72,0,IF((C$3*10^12-$A72)*(C$3*10^12-$A71)*-1<0,0,1)*IF(ABS(C$3*10^12-$A72)>(C$3*10^12-$A71),$A71,$A72))","v":0},0,0,{"$f":"IF(IF((F$3*10^12-$A72)*(F$3*10^12-$A71)*-1<0,0,1)*IF(ABS(F$3*10^12-$A72)>(F$3*10^12-$A71),$A71,$A72)=F72,0,IF((F$3*10^12-$A72)*(F$3*10^12-$A71)*-1<0,0,1)*IF(ABS(F$3*10^12-$A72)>(F$3*10^12-$A71),$A71,$A72))","v":0},{"$f":"IF(IF((G$3*10^12-$A72)*(G$3*10^12-$A71)*-1<0,0,1)*IF(ABS(G$3*10^12-$A72)>(G$3*10^12-$A71),$A71,$A72)=G72,0,IF((G$3*10^12-$A72)*(G$3*10^12-$A71)*-1<0,0,1)*IF(ABS(G$3*10^12-$A72)>(G$3*10^12-$A71),$A71,$A72))","v":0},{"$f":"IF(IF((H$3*10^12-$A72)*(H$3*10^12-$A71)*-1<0,0,1)*IF(ABS(H$3*10^12-$A72)>(H$3*10^12-$A71),$A71,$A72)=H72,0,IF((H$3*10^12-$A72)*(H$3*10^12-$A71)*-1<0,0,1)*IF(ABS(H$3*10^12-$A72)>(H$3*10^12-$A71),$A71,$A72))","v":0},{"$f":"IF(IF((I$3*10^12-$A72)*(I$3*10^12-$A71)*-1<0,0,1)*IF(ABS(I$3*10^12-$A72)>(I$3*10^12-$A71),$A71,$A72)=I72,0,IF((I$3*10^12-$A72)*(I$3*10^12-$A71)*-1<0,0,1)*IF(ABS(I$3*10^12-$A72)>(I$3*10^12-$A71),$A71,$A72))","v":0},0,{"$error":"#REF!"},{"$error":"#REF!"},{"$error":"#VALUE!"},{"$error":"#VALUE!"}]
[150000,0,0,0,0,0,0,0,0,0,{"$error":"#REF!"},{"$error":"#REF!"},{"$error":"#VALUE!"},{"$error":"#VALUE!"}]
[180000,0,0,0,0,0,0,0,0,0,{"$error":"#REF!"},{"$error":"#REF!"},{"$error":"#VALUE!"},{"$error":"#VALUE!"}]
[220000,0,0,0,0,0,0,0,0,0,{"$error":"#REF!"},{"$error":"#REF!"},{"$error":"#VALUE!"},{"$error":"#VALUE!"}]
[270000,0,0,0,0,0,0,0,0,0,{"$error":"#REF!"},{"$error":"#REF!"},{"$error":"#VALUE!"},{"$error":"#VALUE!"}]
[330000,0,0,0,0,0,0,0,0,0,{"$error":"#REF!"},{"$error":"#REF!"},{"$error":"#VALUE!"},{"$error":"#VALUE!"}]
[390000,0,0,0,0,0,0,0,0,0,{"$error":"#REF!"},{"$error":"#REF!"},{"$error":"#VALUE!"},{"$error":"#VALUE!"}]
[470000,0,0,0,0,0,0,0,0,0,{"$error":"#REF!"},{"$error":"#REF!"},{"$error":"#VALUE!"},{"$error":"#VALUE!"}]
[560000,0,0,0,0,0,0,0,0,0,{"$error":"#REF!"},{"$error":"#REF!"},{"$error":"#VALUE!"},{"$error":"#VALUE!"}]
[680000,0,0,0,0,0,0,0,0,0,{"$error":"#REF!"},{"$error":"#REF!"},{"$error":"#VALUE!"},{"$error":"#VALUE!"}]
[820000,0,0,0,0,0,0,0,0,0,{"$error":"#REF!"},{"$error":"#REF!"},{"$error":"#VALUE!"},{"$error":"#VALUE!"}]
[1000000,0,0,0,0,0,0,0,0,0,{"$error":"#REF!"},{"$error":"#REF!"},{"$error":"#VALUE!"},{"$error":"#VALUE!"}]
[1200000,0,0,0,0,0,0,0,0,0,{"$error":"#REF!"},{"$error":"#REF!"},{"$error":"#VALUE!"},{"$error":"#VALUE!"}]
[1500000,0,0,0,0,0,0,0,0,0,{"$error":"#REF!"},{"$error":"#REF!"},{"$error":"#VALUE!"},{"$error":"#VALUE!"}]
[1800000,0,0,0,0,0,0,0,0,0,{"$error":"#REF!"},{"$f":"IF(IF((L$3*10^12-$A86)*(L$3*10^12-$A85)*-1<0,0,1)*IF(ABS(L$3*10^12-$A86)>(L$3*10^12-$A85),$A85,$A86)=L86,0,IF((L$3*10^12-$A86)*(L$3*10^12-$A85)*-1<0,0,1)*IF(ABS(L$3*10^12-$A86)>(L$3*10^12-$A85),$A85,$A86))","v":{"$error":"#REF!"}},{"$error":"#VALUE!"},{"$error":"#VALUE!"}]
[2200000,0,0,0,0,0,0,0,0,0,{"$error":"#REF!"},{"$error":"#REF!"},{"$error":"#VALUE!"},{"$error":"#VALUE!"}]
[2700000,0,0,0,0,0,0,0,0,0,{"$error":"#REF!"},{"$error":"#REF!"},{"$error":"#VALUE!"},{"$error":"#VALUE!"}]
[3300000,0,0,0,0,0,0,0,0,0,{"$error":"#REF!"},{"$error":"#REF!"},{"$error":"#VALUE!"},{"$error":"#VALUE!"}]
[3900000,0,0,0,0,0,0,0,0,0,{"$error":"#REF!"},{"$error":"#REF!"},{"$error":"#VALUE!"},{"$error":"#VALUE!"}]
[4700000,0,0,0,0,0,0,0,0,0,{"$error":"#REF!"},{"$error":"#REF!"},{"$error":"#VALUE!"},{"$error":"#VALUE!"}]
[5600000,0,0,0,0,0,0,0,0,0,{"$error":"#REF!"},{"$error":"#REF!"},{"$error":"#VALUE!"},{"$error":"#VALUE!"}]
[6800000,0,0,0,0,0,0,0,0,0,{"$error":"#REF!"},{"$error":"#REF!"},{"$error":"#VALUE!"},{"$error":"#VALUE!"}]
[8200000,0,0,0,0,0,0,0,0,0,{"$error":"#REF!"},{"$error":"#REF!"},{"$error":"#VALUE!"},{"$error":"#VALUE!"}]
[10000000,0,0,0,0,0,0,0,0,0,{"$error":"#REF!"},{"$error":"#REF!"},{"$error":"#VALUE!"},{"$error":"#VALUE!"}]
[12000000,0,0,0,0,0,0,0,0,0,{"$error":"#REF!"},{"$error":"#REF!"},{"$error":"#VALUE!"},{"$error":"#VALUE!"}]
[15000000,0,0,0,0,0,0,0,0,0,{"$error":"#REF!"},{"$error":"#REF!"},{"$error":"#VALUE!"},{"$error":"#VALUE!"}]
[18000000,0,0,0,0,0,0,0,0,0,{"$error":"#REF!"},{"$error":"#REF!"},{"$error":"#VALUE!"},{"$error":"#VALUE!"}]
[22000000,0,0,0,0,0,0,0,0,0,{"$error":"#REF!"},{"$error":"#REF!"},{"$error":"#VALUE!"},{"$error":"#VALUE!"}]
[{"$f":"A87*10","v":27000000},0,0,0,0,0,0,0,0,0,{"$error":"#REF!"},{"$error":"#REF!"},{"$error":"#VALUE!"},{"$error":"#VALUE!"}]
[33000000,0,0,0,0,0,0,0,0,0,{"$error":"#REF!"},{"$error":"#REF!"},{"$error":"#VALUE!"},{"$error":"#VALUE!"}]
[39000000,0,0,0,39000000,47000000,0,0,0,0,{"$error":"#REF!"},{"$error":"#REF!"},{"$error":"#VALUE!"},{"$error":"#VALUE!"}]
[47000000,0,0,0,0,0,0,0,0,0,{"$error":"#REF!"},{"$error":"#REF!"},{"$error":"#VALUE!"},{"$error":"#VALUE!"}]
[56000000,0,0,0,0,{"$f":"IF(IF((F$3*10^12-$A104)*(F$3*10^12-$A103)*-1<0,0,1)*IF(ABS(F$3*10^12-$A104)>(F$3*10^12-$A103),$A103,$A104)=F104,0,IF((F$3*10^12-$A104)*(F$3*10^12-$A103)*-1<0,0,1)*IF(ABS(F$3*10^12-$A104)>(F$3*10^12-$A103),$A103,$A104))","v":0},{"$f":"IF(IF((G$3*10^12-$A104)*(G$3*10^12-$A103)*-1<0,0,1)*IF(ABS(G$3*10^12-$A104)>(G$3*10^12-$A103),$A103,$A104)=G104,0,IF((G$3*10^12-$A104)*(G$3*10^12-$A103)*-1<0,0,1)*IF(ABS(G$3*10^12-$A104)>(G$3*10^12-$A103),$A103,$A104))","v":0},{"$f":"IF(IF((H$3*10^12-$A104)*(H$3*10^12-$A103)*-1<0,0,1)*IF(ABS(H$3*10^12-$A104)>(H$3*10^12-$A103),$A103,$A104)=H104,0,IF((H$3*10^12-$A104)*(H$3*10^12-$A103)*-1<0,0,1)*IF(ABS(H$3*10^12-$A104)>(H$3*10^12-$A103),$A103,$A104))","v":0},{"$f":"IF(IF((I$3*10^12-$A104)*(I$3*10^12-$A103)*-1<0,0,1)*IF(ABS(I$3*10^12-$A104)>(I$3*10^12-$A103),$A103,$A104)=I104,0,IF((I$3*10^12-$A104)*(I$3*10^12-$A103)*-1<0,0,1)*IF(ABS(I$3*10^12-$A104)>(I$3*10^12-$A103),$A103,$A104))","v":0},0,{"$error":"#REF!"},{"$error":"#REF!"},{"$error":"#VALUE!"},{"$error":"#VALUE!"}]
[68000000,0,0,0,0,0,0,0,0,0,{"$error":"#REF!"},{"$error":"#REF!"},{"$error":"#VALUE!"},{"$error":"#VALUE!"}]
[82000000,0,0,0,0,0,0,0,0,0,{"$error":"#REF!"},{"$error":"#REF!"},{"$error":"#VALUE!"},{"$error":"#VALUE!"}]
[100000000,0,0,0,0,0,0,0,0,0,{"$error":"#REF!"},{"$error":"#REF!"},{"$error":"#VALUE!"},{"$error":"#VALUE!"}]
[120000000,0,0,0,0,0,0,0,0,0,{"$error":"#REF!"},{"$error":"#REF!"},{"$error":"#VALUE!"},{"$error":"#VALUE!"}]
[150000000,0,0,0,0,0,0,0,0,0,{"$error":"#REF!"},{"$error":"#REF!"},{"$error":"#VALUE!"},{"$error":"#VALUE!"}]
[180000000,0,0,0,0,0,0,0,0,0,{"$error":"#REF!"},{"$error":"#REF!"},{"$error":"#VALUE!"},{"$error":"#VALUE!"}]
[220000000,0,0,0,0,0,0,0,0,0,{"$error":"#REF!"},{"$error":"#REF!"},{"$error":"#VALUE!"},{"$error":"#VALUE!"}]
[270000000,0,0,0,0,0,0,0,0,0,{"$error":"#REF!"},{"$error":"#REF!"},{"$error":"#VALUE!"},{"$error":"#VALUE!"}]
[330000000,0,0,0,0,0,0,0,0,0,{"$error":"#REF!"},{"$error":"#REF!"},{"$error":"#VALUE!"},{"$error":"#VALUE!"}]
[390000000,0,0,0,0,0,0,0,0,0,{"$error":"#REF!"},{"$error":"#REF!"},{"$error":"#VALUE!"},{"$error":"#VALUE!"}]
[470000000,0,0,0,0,0,0,0,0,0,{"$error":"#REF!"},{"$error":"#REF!"},{"$error":"#VALUE!"},{"$error":"#VALUE!"}]
[560000000,0,0,0,0,0,0,0,0,0,{"$error":"#REF!"},{"$error":"#REF!"},{"$error":"#VALUE!"},{"$error":"#VALUE!"}]
[680000000,0,0,0,0,0,0,0,0,0,{"$error":"#REF!"},{"$error":"#REF!"},{"$error":"#VALUE!"},{"$error":"#VALUE!"}]
[820000000,0,0,0,0,0,0,0,0,0,{"$error":"#REF!"},{"$error":"#REF!"},{"$error":"#VALUE!"},{"$error":"#VALUE!"}]
[1000000000,0,0,0,0,0,0,0,0,0,{"$error":"#REF!"},{"$error":"#REF!"},{"$error":"#VALUE!"},{"$error":"#VALUE!"}]
[1200000000,0,0,0,0,0,0,0,0,0,{"$error":"#REF!"},{"$error":"#REF!"},{"$error":"#VALUE!"},{"$error":"#VALUE!"}]
[1500000000,0,0,0,0,0,0,0,0,0,{"$error":"#REF!"},{"$error":"#REF!"},{"$error":"#VALUE!"},{"$error":"#VALUE!"}]
[1800000000,0,0,0,0,0,0,0,0,0,{"$error":"#REF!"},{"$error":"#REF!"},{"$error":"#VALUE!"},{"$error":"#VALUE!"}]
[2200000000,0,0,0,0,0,0,0,0,0,{"$error":"#REF!"},{"$error":"#REF!"},{"$error":"#VALUE!"},{"$error":"#VALUE!"}]
[2700000000,0,0,0,0,0,0,0,0,0,{"$error":"#REF!"},{"$error":"#REF!"},{"$error":"#VALUE!"},{"$error":"#VALUE!"}]
[3300000000,0,0,0,0,0,0,0,0,0,{"$error":"#REF!"},{"$error":"#REF!"},{"$error":"#VALUE!"},{"$error":"#VALUE!"}]
[3900000000,0,0,0,0,0,0,0,0,0,{"$error":"#REF!"},{"$error":"#REF!"},{"$error":"#VALUE!"},{"$error":"#VALUE!"}]
[4700000000,0,0,0,0,0,0,0,0,0,{"$error":"#REF!"},{"$error":"#REF!"},{"$error":"#VALUE!"},{"$error":"#VALUE!"}]
[5600000000,0,0,0,0,0,0,0,0,0,{"$error":"#REF!"},{"$error":"#REF!"},{"$error":"#VALUE!"},{"$error":"#VALUE!"}]
[6800000000,0,0,0,0,0,0,0,0,0,{"$error":"#REF!"},{"$error":"#REF!"},{"$error":"#VALUE!"},{"$error":"#VALUE!"}]
[8200000000,0,0,0,0,0,0,0,0,0,{"$error":"#REF!"},{"$error":"#REF!"},{"$error":"#VALUE!"},{"$error":"#VALUE!"}]
[10000000000,0,0,0,0,0,0,0,0,0,{"$error":"#REF!"},{"$error":"#REF!"},{"$error":"#VALUE!"},{"$error":"#VALUE!"}]
[12000000000,0,0,0,0,0,0,0,0,0,{"$error":"#REF!"},{"$error":"#REF!"},{"$error":"#VALUE!"},{"$error":"#VALUE!"}]
[15000000000,0,0,0,0,0,0,0,0,0,{"$f":"IF(IF((K$3*10^12-$A133)*(K$3*10^12-$A132)*-1<0,0,1)*IF(ABS(K$3*10^12-$A133)>(K$3*10^12-$A132),$A132,$A133)=K133,0,IF((K$3*10^12-$A133)*(K$3*10^12-$A132)*-1<0,0,1)*IF(ABS(K$3*10^12-$A133)>(K$3*10^12-$A132),$A132,$A133))","v":{"$error":"#REF!"}},{"$f":"IF(IF((L$3*10^12-$A133)*(L$3*10^12-$A132)*-1<0,0,1)*IF(ABS(L$3*10^12-$A133)>(L$3*10^12-$A132),$A132,$A133)=L133,0,IF((L$3*10^12-$A133)*(L$3*10^12-$A132)*-1<0,0,1)*IF(ABS(L$3*10^12-$A133)>(L$3*10^12-$A132),$A132,$A133))","v":{"$error":"#REF!"}},{"$error":"#VALUE!"},{"$error":"#VALUE!"}]
[18000000000,0,0,0,0,0,0,0,0,{"$f":"IF(IF((J$3*10^12-$A134)*(J$3*10^12-$A133)*-1<0,0,1)*IF(ABS(J$3*10^12-$A134)>(J$3*10^12-$A133),$A133,$A134)=J134,0,IF((J$3*10^12-$A134)*(J$3*10^12-$A133)*-1<0,0,1)*IF(ABS(J$3*10^12-$A134)>(J$3*10^12-$A133),$A133,$A134))","v":0},{"$error":"#REF!"},{"$error":"#REF!"},{"$f":"IF(IF((M$3*10^12-$A134)*(M$3*10^12-$A133)*-1<0,0,1)*IF(ABS(M$3*10^12-$A134)>(M$3*10^12-$A133),$A133,$A134)=M134,0,IF((M$3*10^12-$A134)*(M$3*10^12-$A133)*-1<0,0,1)*IF(ABS(M$3*10^12-$A134)>(M$3*10^12-$A133),$A133,$A134))","v":{"$error":"#VALUE!"}},{"$f":"IF(IF((N$3*10^12-$A134)*(N$3*10^12-$A133)*-1<0,0,1)*IF(ABS(N$3*10^12-$A134)>(N$3*10^12-$A133),$A133,$A134)=N134,0,IF((N$3*10^12-$A134)*(N$3*10^12-$A133)*-1<0,0,1)*IF(ABS(N$3*10^12-$A134)>(N$3*10^12-$A133),$A133,$A134))","v":{"$error":"#VALUE!"}}]
[22000000000,0,0,0,{"$f":"IF(IF((E$3*10^12-$A135)*(E$3*10^12-$A134)*-1<0,0,1)*IF(ABS(E$3*10^12-$A135)>(E$3*10^12-$A134),$A134,$A135)=E135,0,IF((E$3*10^12-$A135)*(E$3*10^12-$A134)*-1<0,0,1)*IF(ABS(E$3*10^12-$A135)>(E$3*10^12-$A134),$A134,$A135))","v":0},0,0,0,0,0,{"$error":"#REF!"},{"$error":"#REF!"},{"$f":"IF(IF((M$3*10^12-$A135)*(M$3*10^12-$A134)*-1<0,0,1)*IF(ABS(M$3*10^12-$A135)>(M$3*10^12-$A134),$A134,$A135)=M135,0,IF((M$3*10^12-$A135)*(M$3*10^12-$A134)*-1<0,0,1)*IF(ABS(M$3*10^12-$A135)>(M$3*10^12-$A134),$A134,$A135))","v":{"$error":"#VALUE!"}},{"$f":"IF(IF((N$3*10^12-$A135)*(N$3*10^12-$A134)*-1<0,0,1)*IF(ABS(N$3*10^12-$A135)>(N$3*10^12-$A134),$A134,$A135)=N135,0,IF((N$3*10^12-$A135)*(N$3*10^12-$A134)*-1<0,0,1)*IF(ABS(N$3*10^12-$A135)>(N$3*10^12-$A134),$A134,$A135))","v":{"$error":"#VALUE!"}}]
[27000000000,{"$f":"IF(IF((B$3*10^12-$A136)*(B$3*10^12-$A135)*-1<0,0,1)*IF(ABS(B$3*10^12-$A136)>(B$3*10^12-$A135),$A135,$A136)=B136,0,IF((B$3*10^12-$A136)*(B$3*10^12-$A135)*-1<0,0,1)*IF(ABS(B$3*10^12-$A136)>(B$3*10^12-$A135),$A135,$A136))","v":0},{"$f":"IF(IF((C$3*10^12-$A136)*(C$3*10^12-$A135)*-1<0,0,1)*IF(ABS(C$3*10^12-$A136)>(C$3*10^12-$A135),$A135,$A136)=C136,0,IF((C$3*10^12-$A136)*(C$3*10^12-$A135)*-1<0,0,1)*IF(ABS(C$3*10^12-$A136)>(C$3*10^12-$A135),$A135,$A136))","v":0},0,0,0,0,0,0,0,{"$error":"#REF!"},{"$error":"#REF!"},{"$error":"#VALUE!"},{"$error":"#VALUE!"}]
[33000000000,0,0,0,0,0,0,0,0,0,{"$error":"#REF!"},{"$error":"#REF!"},{"$error":"#VALUE!"},{"$error":"#VALUE!"}]
[39000000000,0,0,0,0,0,0,0,0,0,{"$error":"#REF!"},{"$error":"#REF!"},{"$error":"#VALUE!"},{"$error":"#VALUE!"}]
[47000000000,0,0,0,0,0,0,0,0,0,{"$error":"#REF!"},{"$error":"#REF!"},{"$error":"#VALUE!"},{"$error":"#VALUE!"}]
[56000000000,0,0,0,0,0,0,0,0,0,{"$error":"#REF!"},{"$error":"#REF!"},{"$error":"#VALUE!"},{"$error":"#VALUE!"}]
[68000000000,0,0,0,0,0,0,0,0,0,{"$error":"#REF!"},{"$error":"#REF!"},{"$error":"#VALUE!"},{"$error":"#VALUE!"}]
[82000000000,0,0,0,0,0,0,0,0,0,{"$error":"#REF!"},{"$error":"#REF!"},{"$error":"#VALUE!"},{"$error":"#VALUE!"}]
[100000000000,0,0,0,0,0,0,0,0,0,{"$error":"#REF!"},{"$error":"#REF!"},{"$error":"#VALUE!"},{"$error":"#VALUE!"}]
[120000000000,0,0,0,0,0,0,0,0,0,{"$error":"#REF!"},{"$error":"#REF!"},{"$error":"#VALUE!"},{"$error":"#VALUE!"}]
[150000000000,0,0,0,0,0,0,0,0,0,{"$error":"#REF!"},{"$error":"#REF!"},{"$error":"#VALUE!"},{"$error":"#VALUE!"}]
[180000000000,0,0,0,0,0,0,0,0,0,{"$error":"#REF!"},{"$error":"#REF!"},{"$error":"#VALUE!"},{"$error":"#VALUE!"}]
[220000000000,0,0,0,0,0,0,0,0,0,{"$error":"#REF!"},{"$error":"#REF!"},{"$error":"#VALUE!"},{"$error":"#VALUE!"}]
[270000000000,0,0,0,0,0,0,0,0,0,{"$error":"#REF!"},{"$error":"#REF!"},{"$error":"#VALUE!"},{"$error":"#VALUE!"}]
[330000000000,0,0,0,0,0,0,0,0,0,{"$error":"#REF!"},{"$error":"#REF!"},{"$error":"#VALUE!"},{"$error":"#VALUE!"}]
[390000000000,0,0,0,0,0,0,0,0,0,{"$error":"#REF!"},{"$error":"#REF!"},{"$error":"#VALUE!"},{"$error":"#VALUE!"}]
[470000000000,0,0,0,0,0,0,0,0,0,{"$error":"#REF!"},{"$error":"#REF!"},{"$error":"#VALUE!"},{"$error":"#VALUE!"}]
[560000000000,0,0,0,0,0,0,0,0,0,{"$error":"#REF!"},{"$error":"#REF!"},{"$error":"#VALUE!"},{"$error":"#VALUE!"}]
[680000000000,0,0,0,0,0,0,0,0,0,{"$error":"#REF!"},{"$error":"#REF!"},{"$error":"#VALUE!"},{"$error":"#VALUE!"}]
[820000000000,0,0,0,0,0,0,0,0,0,{"$error":"#REF!"},{"$error":"#REF!"},{"$error":"#VALUE!"},{"$error":"#VALUE!"}]
[1000000000000,0,0,0,0,0,0,0,0,0,{"$error":"#REF!"},{"$error":"#REF!"},{"$error":"#VALUE!"},{"$error":"#VALUE!"}]
[1200000000000,0,0,0,0,0,0,0,0,0,{"$error":"#REF!"},{"$error":"#REF!"},{"$error":"#VALUE!"},{"$error":"#VALUE!"}]
[1500000000000,0,0,0,0,0,0,0,0,0,{"$error":"#REF!"},{"$error":"#REF!"},{"$error":"#VALUE!"},{"$error":"#VALUE!"}]
[1800000000000,0,0,0,0,0,0,0,0,0,{"$error":"#REF!"},{"$error":"#REF!"},{"$error":"#VALUE!"},{"$error":"#VALUE!"}]
[2200000000000,0,0,0,0,0,0,0,0,0,{"$error":"#REF!"},{"$error":"#REF!"},{"$error":"#VALUE!"},{"$error":"#VALUE!"}]
[2700000000000,2700000000000,2700000000000,2700000000000,2700000000000,2700000000000,2700000000000,2700000000000,2700000000000,2700000000000,{"$error":"#REF!"},{"$error":"#REF!"},{"$error":"#VALUE!"},{"$error":"#VALUE!"}]

{"sheet":"Snubber","index":11,"n_rows":6,"n_cols":5,"rows_kept":6,"cut":false,"hidden":true,"merged":[]}
[null,null,"UNITS","STD UNITS"]
["Frequency of Ringing",85,"MHz",{"$f":"B2*1000000","v":85000000},"Hz"]
["SW capacitance",3000,"pF",{"$f":"B3*0.000000000001","v":3E-9},"F"]
["Lpar",{"$f":"1000000000*1/((D2*2*3.14159)^2*D3)","v":1.1686430773614742},"nH",{"$f":"B4/1000000000","v":1.1686430773614743E-9},"H"]
["Csnub",{"$f":"4*B3","v":12000},"pF",{"$f":"B5*0.000000000001","v":1.2E-8},"F"]
["Rsnub",{"$f":"SQRT(D4/D3)","v":0.62413755891936573},"Ω",{"$f":"B6","v":0.62413755891936573},"Ω"]

{"sheet":"Parallel Output Caps","index":12,"n_rows":17,"n_cols":5,"rows_kept":17,"cut":false,"hidden":true,"merged":[]}
[]
[]
[]
["Fsw",{"$f":"Fsw","v":2200000}]
[]
["C1",20,"uF",{"$f":"B6/1000000","v":2.0000000000000002E-5},"F"]
["R1",0.5,"mOhms",{"$f":"B7/1000","v":5.0000000000000001E-4},"Ohms"]
[]
["C2",68,"uF",{"$f":"B9/1000000","v":6.7999999999999999E-5},"F"]
["R2",20,"mOhms",{"$f":"B10/1000","v":0.02},"Ohms"]
[]
[]
["I1 ",{"$f":"(D6/(D6+D9))*SQRT((D10*D9*B4)^2+1)/SQRT((((D7+D10)*D6*D9/(D9+D6))*B4)^2+1)","v":0.5881964665933066},"%"]
["I2 ",{"$f":"1-B13","v":0.4118035334066934},"%"]
[]
["I1 ",{"$f":"B13*(Iripple1/(2*SQRT(3)))","v":{"$error":"#NAME?"}},"A"]
["I2 ",{"$f":"B14*(Iripple1/(2*SQRT(3)))","v":{"$error":"#NAME?"}},"A"]