{"text_format":"1","workbook":"xlsx","n_sheets":13,"sheets":["Design Regulator","Input Filters","BOM & Schematic","EVM","Efficiency Calculations","Bode Plot Management","Stability Calculations","Variable Management","Schematic Management","Efficiency Plot Management","Standard Value Calculator","Snubber","Parallel Output Caps"],"not_rendered":{"charts":10,"images":40,"macros":1,"external_links":0,"defined_names":319,"comments":2,"pivot_tables":0},"unopened":[],"bounds":{"document_bytes":16777216,"sheet_cells":100000,"rows_first":2000,"rows_last":500,"rows_between":2000,"halvings":0,"cell_chars":16384,"cell_head_chars":4096},"cells_cut":0,"cells_raw":0,"read":"whole","date_system":"1900"}

{"sheet":"Design Regulator","index":0,"n_rows":106,"n_cols":16,"rows_kept":106,"cut":false,"hidden":false,"merged":[[69,5,69,7],[2,13,2,14],[0,0,0,15],[80,5,80,6],[35,10,36,15]]}
["                      LM70XX0/-Q1 Synchronous Buck Converter Design Tool"]
[null,null,null,null,null,null,null,null,null,null,null,null,null,"http://www.ti.com/product/lm5175"]
["About",null,"xx",null,null,"= Input Box",null,null,null,null,null,null,null,"TERMS OF USE",null,"                "]
[]
["Step 1: Operating Specifications"]
[null,null,null,"Input Voltage – Min, VIN(min) ",15,"V"]
[null,null,null,"Input Voltage – Nom, VIN(nom)",48,"V"]
[null,null,null,"Input Voltage – Max, VIN(max)",72,"V"]
[null,null,null,"Output Voltage, VOUT ",12,"V"]
[null,null,null,"Full Load Output Current, IOUT ",8,"A"]
[null,null,null,"Switching Frequency, FSW",400,"kHz"]
[null,null,null,"Frequency Set Resistor, RT ",{"$f":"'Variable Management'!C445","v":54.9},"kΩ"]
[null,null,null,"Ambient Temperature, TA",25,"°C"]
[null,null,null,"IC Junction Temperature (estimate), TJ",{"$f":"'Variable Management'!B366","v":73.863012988933818},"°C"]
[]
["Step 2: Current Sense Resistor"]
[null,null,null,"Required IOCP Setpoint at VIN(nom)",11.2,"A"]
[null,null,null,"Recommended Sense Resistance",{"$f":"Rs_ideal*1000","v":4.3513515673553496},"mΩ"]
[null,null,null,"Sense Resistance, RS",5,"mΩ"]
[null,null,null,"Min Inductor Sat Current, ILO(SAT)",{"$f":"'Variable Management'!B95","v":11.2},"A"]
[null,null,null,"Max power loss in shunt",{"$f":"'Variable Management'!B105","v":0.57874347384954494},"W"]
[null,null,null,"VIN(min)",{"$f":"'Variable Management'!B97","v":10.755596839799749},"A"]
[null,null,"IOUT(typ) at OCP Inception:","VIN(nom)",{"$f":"'Variable Management'!B98","v":9.5304354214625064},"A"]
[null,null,null,"VIN(max)",{"$f":"'Variable Management'!B99","v":9.3444132344775781},"A"]
[]
["Step 3: Buck Inductance"]
[null,null,null,"Recommended Starting Inductance",{"$f":"Lopt*1000000","v":6.25},"µH"]
[null,null,null,"Inductance, LO ",6.8,"µH"]
[null,null,null,"Inductor DCR ",10,"mΩ"]
[null,null,null,"DIL as a % at VIN(nom)",{"$f":"'Variable Management'!B68*100","v":41.739114463437325},"%"]
[]
["Step 4: Output Capacitors"]
[null,null,null,"Output Voltage Ripple Spec",120,"mVpk-pk"]
[null,null,null,"Maximum Load Step",50,"%"]
[null,null,null,"Minimum Output Capacitance",{"$f":"Total_COUT_with_stead_state_load_step","v":46.285477481154324},"µF"]
[null,null,null,"Output Capacitance (derated), COUT ",100,"µF",null,null,null,null,{"$f":"CHOOSE(SCH_MODE, \"\", \"** For Single-Output Operation in 2-Phase Mode, tie MODE to VDDA and use FB1 to set VOUT **\", \"** For Single-Output Operation in 3-Phase Mode, tie both MODE pins to VDDA. Use FB1 of master IC to set VOUT. Connect FB2 of master IC to AGND. Connect FB2 of slave IC to VDDA to configure it as a slave **\", \"** For Single-Output Operation in 4-Phase Mode, tie both MODE pins to VDDA. Use FB1 of master IC to set VOUT. Connect FB2 of master IC to AGND. Connect FB2 of slave IC to VDDA to configure it as a slave **\")","v":""}]
[null,null,null,"Maximum Permitted ESR",{"$f":"'Variable Management'!B128","v":35.801386420504407},"mΩ"]
[null,null,null,"Output Capacitor ESR",1,"mΩ",null,null,null,null,{"$f":"CHOOSE(SCH_MODE,  \"\", \"** Tie VCCX to GND if not used **\", \"** Slave controller (CNTRL2) not shown **\",\"** Slave controller (CNTRL2) not shown **\")","v":""},null,null,null,null,{"$f":"IF(SCH_MODE=1,  \"** Tie VCCX to GND if not used **\", \"\")","v":"** Tie VCCX to GND if not used **"}]
[null,null,null,"Resulting Output Voltage Ripple (max) ",{"$f":"'Variable Management'!B130*1000","v":10.956020641164542},"mVpk-pk",null,null,null,null,{"$f":"IF(OR(SCH_MODE=3, SCH_MODE=4),\"** Tie VCCX to GND if not used **\", \"\")","v":""}]
[null,null,null,"Output Capacitor RMS Current (max) ",{"$f":"'Variable Management'!B114","v":1.0713235185790773},"A (rms)"]
[]
["Step 5: Input Capacitors"]
[null,null,null,"Input Voltage Ripple Spec",480,"mVpk-pk"]
[null,null,null,"Minimum Input Capacitance",{"$f":"'Variable Management'!B151","v":10.416666666666666},"µF"]
[null,null,null,"Input Capacitance (derated), CIN ",15,"µF"]
[null,null,null,"Maximum Permitted ESR",{"$f":"'Variable Management'!B157","v":14.881576323770737},"mΩ",null,null,null,null,null,null,null,null,null," "]
[null,null,null,"Input Capacitor ESR",1,"mΩ"]
[null,null,null,"Resulting Input Voltage Ripple (max)",{"$f":"'Variable Management'!B164*1000","v":343.1889200988557},"mVpk-pk"]
[null,null,null,"Input Capacitor RMS Current (max)",{"$f":"'Variable Management'!B141","v":4},"A (rms)"]
[]
["Step 6: Enable, CNFG, FPWM/PFM"]
[]
[]
[null,null,null,"Input Voltage UVLO Turn-ON",6,"V"]
[null,null,null,"Input Voltage UVLO Turn-OFF",5,"V"]
[null,null,null,"Upper Enable Resistor, RUV1",{"$f":"IF(UVLO_TYPE=1,'Variable Management'!B190,0)","v":0},"kΩ"]
[null,null,null,"Lower Enable Resistor, RUV2",{"$f":"IF(UVLO_TYPE=1,'Variable Management'!B191,\"DNP\")","v":"DNP"},"kΩ"]
[null,null,null,"Configuration Resistor, RCNFG",{"$f":"IF(DITHER=1,\"41.2\",\"29.4\")","v":"29.4"},"kΩ"]
[null,null,null,null,{"$f":"IF(DEMB=1, \"* Tie PFM to GND\", \"* Tie PFM to VDDA\")","v":"* Tie PFM to VDDA"}]
[]
["Step 7: Compensation Design"]
[null,null,null,"Load Pole Frequency",{"$f":"Fp_dominant","v":1356.230043307482},"Hz"]
[null,null,null,"ESR Zero Frequency",{"$f":"Fesr/1000","v":1591.5494327375638},"kHz"]
[null,null,null,"Desired Crossover Frequency",40,{"$f":"\"     kHz \"","v":"     kHz "}]
[null,null,null,"Error Amp Pole Frequency",{"$f":"Fp1_u","v":0.92081398048870167},"Hz"]
[null,null,null,{"$f":"CHOOSE(VOUT_setting, \"Upper Feedback Resistor\",\"\",\"\",\"\")","v":""},100,"kΩ"]
[null,null,null,{"$f":"CHOOSE(VOUT_setting, \"Lower Feedback Resistor\", \"PULLUP FB to VDDA with \"&'Variable Management'!D421,\"TIE FB TO VDDA\",\"PULLUP FB to VDDA with \"&'Variable Management'!D421)","v":"PULLUP FB to VDDA with 49.9kΩ"},{"$f":"IF(Vout=Vref,\"OPEN\",Rfb2_u/1000)","v":177},{"$f":"IF(Vout=Vref,\"\",\"kΩ\")","v":"kΩ"}]
[]
["Compensation Components"]
[null,"Calculated /","Std Values",{"$f":"C70","v":"Std Values"},null,"Actual P/Z Frequencies"]
["RC1",{"$f":"Rcea1/1000","v":15.5148012085958},{"$f":"'Standard Value Calculator'!S32","v":15.4},{"$f":"C71","v":15.4},"kΩ",{"$f":"Fp1_u","v":0.92081398048870167},"Hz   (FPEA)"]
["CC1",{"$f":"Cc1ea*1000000000","v":2.5645662669783094},{"$f":"'Standard Value Calculator'!S33","v":2.7},{"$f":"C72","v":2.7},"nF",{"$f":"Fz1_u/1000","v":3.827680213414054},"kHz (FZCOMP)"]
["CC2",{"$f":"IF(Cc2ea<0, \"N/A\", Cc2ea*1000000000000)","v":19.460336684814923},{"$f":"'Standard Value Calculator'!S34","v":18},{"$f":"C73","v":18},"pF",{"$f":"Fp2_u/1000","v":207.39577630741132},"kHz (FPCOMP)"]
[null,null,null,null,null,null,null,null,null,null,null,null,"** Specify Inductor Core Loss **",0.5,"W"]
[]
["Efficiency / Power Loss Analyzer"]
[]
["Step 8: Efficiency"]
[null,null,null,null,null,"Power MOSFETs","(Q1, Q2) "]
[null,null,null,null,"Internal NEXFETs"]
[null,null,null,null,"High-side","  Low-side"]
[null,null,null,"On-State Resistance, RDS(on) ",24,18,"mΩ"]
[null,null,null,"Total Gate Charge, QG ",3,4.0999999999999996,"nC"]
[null,null,null,"Gate-Drain Charge, QGD ",0.7,1,"nC"]
[null,null,null,"Gate-Source Charge, QGS ",0.7,0.9,"nC"]
[null,null,null,"Output Charge, QOSS ",null,3,"nC"]
[null,null,null,"Output Capacitance, COSS ",250,350,"pF"]
[null,null,null,"Gate Resistance, RG ",3.5,3,"Ω"]
[null,null,null,"Transconductance, gFS ",71,90,"S"]
[null,null,null,"Gate-Source Threshold Voltage, VTH ",1.8,1.8,"V"]
[null,null,null,"Body Diode Forward Voltage, VBD ",0.8,0.8,"V"]
[null,null,null,"Body Diode Rev Recovery Charge, QRR ",null,30,"nC"]
[null,null,null,"Thermal Resistance, θJA ",15,15,"°C/W"]
[]
["External Schottky Diode (if applicable)"]
[null,null,null,"Schottky Fwd Voltage, VFWDsch ",null,0,"V"]
[null,null,null,"Schottky Rev Recovery Charge, QRRsch ",null,0,"nC"]
[]
[]
[]
["Step 9: IC Power Loss"]
[null,null,null,null,null,{"$f":"IF(Ext_VCC=1, \"Ext. Power Supply Voltage\", \"\")","v":"Ext. Power Supply Voltage"},12,{"$f":"IF(Ext_VCC=1, \"V\", \"\")","v":"V"}]
[null,null,null,null,null,"PCB RθJA",18.600000000000001,"°C/W"]
[null,null,null,null,null,"IC Power Dissipation",{"$f":"'Variable Management'!B364","v":2.627043709082463},"W"]
[null,null,null,null,null,"IC Junction Temperature (estimate)",{"$f":"'Variable Management'!B366","v":73.863012988933818},"°C"]
[null,null,null,null,null,null,null,{"$f":"CHOOSE(Ext_VCC, \"* Tie BIAS to Ext. Power Supply\", \"* Tie BIAS to VOUT except for Fixed-VOUT = 3.3V\", \"* Tie BIAS to PGND\")","v":"* Tie BIAS to Ext. Power Supply"}]

{"sheet":"Input Filters","index":1,"n_rows":17,"n_cols":17,"rows_kept":17,"cut":false,"hidden":true,"merged":[[0,0,0,16],[2,14,2,15]]}
["                           LM(2)5149-Q1 Synchronous Buck Controller Design Tool"]
[null,null,null,null,null,null,null,null,null,null,null,null,null,null,"http://www.ti.com/product/lm5175"]
["About",null,"xx",null,null,"= Input Box",null,null,null,null,null,null,null,null,"TERMS OF USE",null,"                "]
[]
[]
[]
[null,null,null,null,"AEF",null,null,null,null,null,null,null,"Passive"]
[]
[null,"Design tab - LAEF",{"$f":"'Design Regulator'!E50 & \" µH\"","v":" µH"},null,null,"LAEF",1,"µH",null,"Suggested LIN Inductor","0.1-10","µH",null,"Chosen LIN",0.68,"µH"]
[null,"Design tab - CINJ",{"$f":"'Design Regulator'!#REF! & \" µF\"","v":{"$error":"#REF!"}},null,null,"CINJ",1,"µF",null,"Suggested CF","0.1-10","µF",null,"Chosen CF",0.47,"µF"]
[null,"Design tab - CDAMP",{"$f":"'Design Regulator'!#REF! & \" µF\"","v":{"$error":"#REF!"}},null,null,"CDAMP",1,"µF",null,"Suggested CDAMP","1-10","µF",null,"Chosen CDAMP",1,"µF"]
[null,"Design tab - RDAMP",{"$f":"'Design Regulator'!#REF! & \" Ω\"","v":{"$error":"#REF!"}},null,null,"RDAMP",10,"Ω",null,"Suggested RDAMP",{"$f":"Rdamp_PassiveStd","v":{"$error":"#REF!"}},"Ω",null,"Chosen RDAMP",0.35,"Ω"]
[]
[null,null,"VIN Ripple at Fsw",null,null,{"$f":"VinRipple_dBuV","v":110.7106651629271},"dBµV","VIN Ripple",{"$f":"VinRipple_dBuV","v":110.7106651629271},"dBµV"]
[]
[null,null,null,"AEF Attenuation at Fsw",{"$f":"-#REF!","v":{"$error":"#REF!"}},"dB",null,null,null,null,null,"Passive Attenuation at Fsw",{"$f":"-#REF!","v":{"$error":"#REF!"}},"dB"]
[null,null,null,"AEF EMI at Fsw",{"$f":"VinRipple_dBuV-E16","v":{"$error":"#REF!"}},"dB-µV",null,null,null,null,null,"Passive EMI at Fsw",{"$f":"VinRipple_dBuV-M16","v":{"$error":"#REF!"}},"dB-µV"]

{"sheet":"BOM & Schematic","index":2,"n_rows":71,"n_cols":10,"rows_kept":71,"cut":false,"hidden":true,"merged":[[50,3,50,5],[47,3,47,5],[62,3,62,6],[63,3,63,6],[61,3,61,6],[52,3,52,5],[55,3,55,6],[41,3,41,6],[46,3,46,5],[60,3,60,6],[58,3,58,6],[59,3,59,6],[54,3,54,6],[57,3,57,6],[56,3,56,6],[53,3,53,6],[42,3,42,5],[43,3,43,5],[48,3,48,5],[49,3,49,5],[51,3,51,5],[44,3,44,5],[45,3,45,5],[64,0,65,0],[64,9,65,9],[64,3,65,6],[64,2,65,2],[64,1,65,1],[64,7,65,7],[64,8,65,8]]}
[]
[]
[]
[]
[]
[]
[]
[]
[]
[]
[]
[]
[]
[]
[]
[]
[]
[]
[]
[]
[]
[]
[]
[]
[]
[]
[]
[]
[]
[]
[]
[]
[]
[]
[]
["   ** Tie DEMB to VDDA for FPWM, AGND for DEM **"]
["   ** Tie VCCX to GND if not used **",null,null,null,null,null,null,null,{"$f":"IF(OR(SCH_MODE=3, SCH_MODE=4),\"** Tie VCCX to GND if not used **\", \"\")","v":""}]
["   ** Tie DITH to VDDA to disable spread spectrum **"]
["   ** Tie OSC to VDDA for 2.2MHz, AGND for 440kHz **"]
[{"$f":"\"VIN = \"&VIN_min&\" V to \"&VIN_max&\" V, VOUT = \"& Vout &\" V, IOUT = \" &Iout & \" A,  Fsw = \" & Fsw/1000 &\" kHz, Current Limit = \"&ROUNDUP(Ilimit_DC,0)&\" A\"","v":"VIN = 15 V to 72 V, VOUT = 12 V, IOUT = 8 A,  Fsw = 400 kHz, Current Limit = 12 A"}]
["High Efficiency Synchronous Buck Regulator BOM"]
["Count","Ref Des","Value","Description",null,null,null,"Size","Part Number","MFR"]
[1,"CBOOT",0.1,{"$f":"C43","v":0.1},null,null,null,"0603","Std","Std"]
[1,"CC1",{"$f":"'Design Regulator'!D72","v":2.7},2.7,null,null,null,"0603","Std","Std"]
[1,"CC2",{"$f":"'Design Regulator'!D73","v":18},18,null,null,null,"0603","Std","Std"]
[1,"CRES",{"$f":"Cres_u*1000000000","v":82},{"$f":"C46","v":82},null,null,null,"0603","Std","Std"]
[1,"CDITH",{"$f":"Cdither*1000000000","v":2.7},{"$f":"C47","v":2.7},null,null,null,"0603","Std","Std"]
[{"$f":"ROUNDUP('Design Regulator'!E45/10,0)","v":2},"CIN",10,{"$f":"C48","v":10},null,null,null,1210,"Std","Std"]
[{"$f":"ROUNDUP('Design Regulator'!E36/47,0)","v":3},"COUT",47,{"$f":"C49","v":47},null,null,null,1210,"Std","Std"]
[1,"CSS",{"$f":"'Design Regulator'!#REF!","v":{"$error":"#REF!"}},{"$f":"C50","v":{"$error":"#REF!"}},null,null,null,"0603","Std","Std"]
[2,"CVCC, CVCCX",2.2000000000000002,2.2000000000000002,null,null,null,"0603","Std","Std"]
[1,"CVDDA",0.47,0.47,null,null,null,"0603","Std","Std"]
[1,"DBOOT","See description","Schottky Diode, 60V, 200mA",null,null,null,"-","-","Various"]
[1,"LO",{"$f":"'Design Regulator'!E28","v":6.8},{"$f":"\"Inductor, \"&Lf*1000000&\"µH, \"&Rdcr*1000&\"mΩ, >\"&ROUNDUP(Ilimit_DC*1.1,0)&\"A\"","v":"Inductor, 6.8µH, 10mΩ, >13A"},null,null,null,"-","-","Various"]
[2,"Q1, Q2","See description",{"$f":"'Design Regulator'!E82","v":24},null,null,null,"Std",{"$f":"'Design Regulator'!E80","v":"Internal NEXFETs"},"-"]
[1,"RC1",{"$f":"'Design Regulator'!D71","v":15.4},{"$f":"C56","v":15.4},null,null,null,"0603","Std","Std"]
[1,"RS",{"$f":"Rs*1000","v":5},5,null,null,null,"0508","Std","Std"]
[1,"RT",{"$f":"'Design Regulator'!E12","v":54.9},54.9,null,null,null,"0603","Std","Std"]
[1,"RFB1",{"$f":"'Design Regulator'!E66","v":100},100,null,null,null,"0603","Std","Std"]
[1,"RFB2",{"$f":"'Design Regulator'!E67","v":177},177,null,null,null,"0603","Std","Std"]
[1,"RPGOOD",100,100,null,null,null,"0603","Std","Std"]
[1,"RCS",100,100,null,null,null,"0603","Std","Std"]
[1,"RDEMB",100,100,null,null,null,"0603","Std","Std"]
[1,"RVIN",2.2000000000000002,2.2000000000000002,null,null,null,"0603","Std","Std"]
[1,"U1","LM5141-Q1","IC, LM5141-Q1, Synchronous Buck PWM Controller, 3.8V–65V Input",null,null,null,"VQFN-24","LM5141QRGEQ1","TI"]
[]
[]
["NOTES:"]
["** For information on TI NexFETTM MOSFETs, see **",null,null,"http://www.ti.com/nexfet","   **"]
["** Inductor saturation current should be higher than the peak inductor current at the OCP setpoint for all input voltages and operating temperatures **"]
["** Effective input and output capacitances should be appropriately derated for applied voltage and temperature, particularly with ceramics **"]

{"sheet":"EVM","index":3,"n_rows":6,"n_cols":2,"rows_kept":6,"cut":false,"hidden":true,"merged":[[0,0,0,16]]}
[" LM25149-Q1 Quickstart Design Tool"]
[]
[]
[]
[]
[null,"LM25149-Q1EVM-2100 PCB Layout"]

{"sheet":"Efficiency Calculations","index":4,"n_rows":109,"n_cols":60,"rows_kept":109,"cut":false,"hidden":true,"merged":[[6,24,6,26],[0,0,3,3],[5,0,6,3],[6,6,6,13],[6,17,6,20],[6,21,6,23],[6,52,6,57],[6,27,6,32],[6,33,6,36],[6,40,6,44],[6,45,6,50]]}
["BUCK CONTROLLER POWER DESIGN TOOL"]
[null,null,null,null,null,null,null,{"$f":"AW19","v":0.92921553852826244},"10% load"]
[null,null,null,null,null,null,null,{"$f":"AW59","v":0.96494981051128881},"50% load",null,null,null,null,null,null,null,null,null,null,null,null,null,null,null,null,null,null,null,null,null,null,null,null,null,null,null,null,null,null,null,null,{"$f":"IF(MODE=1, (Qg_Q1+Qg_Q2)*Fsw*Vin, (Qg_Q1+Qg_Q2+Qg_Q3+Qg_Q4)*Fsw*Vin)","v":0.13632}]
[null,null,null,null,null,null,null,{"$f":"AW109","v":0.95829993298171123},"100% load",null,null,null,null,null,null,null,null,null,null,null,null,null,null,null,null,null,null,null,null,null,null,null,null,null,null,null,null,null,null,null,"I_VCC",{"$f":"(Qg_Q1+Qg_Q2)*Fsw*1000","v":2.84},"mA",{"$f":"AP4*5/1000","v":1.4199999999999999E-2}]
[]
["Enter the values of your design and MOSFET datasheet specifications below. Note that thermal resistance (θJA) will change when components are placed on the PCB"]
[null,null,null,null,null,null,"Operating Point Condtions",null,null,null,null,null,null,null,null,null,null,"Filter Inductor",null,null,null,"Cout",null,null,"Cin",null,null,"High-side BUCK \"Control\" MOSFET Losses ",null,null,null,null,null,"Low-side BUCK \"Sync\" MOSFET Losses ",null,null,null,"External Diode","Diode/FET","Sense Rs","Controller IC Losses",null,null,null,null,"RESULTS",null,null,null,null,null,null,"Consolidated Buck/Boost Efficiency & Losses"]
["Input Parameters",null,null,null,null,null,"Step","Vin","Mode","Iout","Iout/ phase","Iin","Duty Cycle BUCK Leg","Ripple Current pk-pk","Peak Inductor Current","Valley Inductor Current","SW node voltage at Q1 turn-on","Irms Lf","DCR    Loss","Core Loss","Total Inductor Loss","Irms Cout","Cout ESR Loss","Total Cout Loss","Irms Cin","Cin ESR Loss","Total Cin Loss","Irms","RDS(on) Loss","Transition Loss (not including capacitive loss)","MOSFET Output Capacitance Loss","Dead Time Loss ","Total Control MOSFET Loss","Irms","RDS(on) Loss","Deadtime Loss","Total Sync MOSFET Loss","Deadtime Loss","Reverse Recovery Loss","Isense Shunt Loss","IQ Loss","Switching Current Loss","Switching Current Diss","LDO Loss Saved from Gate Drive Current (ext VCC)","Total IC Bias Power","Total Loss","Total IC Loss ","Pout","EFF, h",{"$f":"IF(Vin>Vout, \"High-side MOSFET Temp Rise\", \"Boost ''CONTROL'' MOSFET Temp Rise\")","v":"High-side MOSFET Temp Rise"},{"$f":"IF(Vin>Vout, \"Low-side MOSFET Temp Rise\", \"Boost ''SYNC'' MOSFET Temp Rise\")","v":"Low-side MOSFET Temp Rise"},null,"h","Inductor Cu & Core Loss","Total MOSFET Loss","Control MOSFET Loss","SYNC MOSFET Loss","Shunt Loss","FETs+IC Losses","Temp rise"]
["Design","Input Value","Units","Description",null,null,0,{"$f":"Vin","v":48},{"$f":"MODE","v":1},0,{"$f":"Iout*G9/100/Number_of_Phases","v":0},{"$f":"Vout*K9/(Vin*Efficiency)","v":0},{"$f":"(Vout+(Rdson2+Rs+Rdcr)*K9)/(Vin+(Rs+Rdson2-Rdson1)*K9)","v":0.25},{"$f":"(Vin-(Rdson1+Rdcr)*K9-Vout)*M9/(Fsw*Lf)","v":3.3088235294117645},{"$f":"K9+N9/2","v":1.6544117647058822},{"$f":"K9-N9/2","v":-1.6544117647058822},{"$f":"IF(MIN(Vin, -P9/(Coss_Q1+Coss_Q2)*0.00000002)<0, 0, MIN(Vin, -P9/(Coss_Q1+Coss_Q2)*0.00000002))","v":48},{"$f":"SQRT(K9^2+(N9^2)/12)","v":0.95517507770342491},{"$f":"R9^2*Rdcr","v":9.1235942906574396E-3},{"$f":"Core_Loss_Ch1","v":0.5},{"$f":"(T9+S9*(1+Ltc*(Ta-25)))/(1-S9*Ltc*ThetaCa)","v":0.50949546868659545},{"$f":"N9/SQRT(12)","v":0.95517507770342502},{"$f":"RCoutEsr*V9^2","v":9.1235942906574405E-4},{"$f":"W9","v":9.1235942906574405E-4},{"$f":"SQRT(M9*(1-M9))*SQRT(K9^2+(N9^2)/12)","v":0.41360294117647056},{"$f":"RCinEsr*Y9^2","v":1.7106739294982698E-4},{"$f":"Z9","v":1.7106739294982698E-4},{"$f":"SQRT(M9)*SQRT(K9^2+(N9^2)/12)","v":0.47758753885171246},{"$f":"Rdson1*AB9^2","v":5.4741565743944634E-3},{"$f":"(Vin*K9/2)*Fsw*(Tr_buck+Tf_buck)","v":0},{"$f":"(0.5*Coss_Q1*(Vin-Q9)^2-0.5*Coss_Q2*(Vin-Q9)^2+(Qoss_Q2*(Vin-Q9)/Vin)*Vin)*Fsw","v":0},{"$f":"IF(K9>N9/2,0,ABS(K9-N9/2)*Vsd_Q1*Deadtime*Fsw)","v":7.4117647058823521E-3},{"$f":"(AF9+AE9+AD9+AC9*(1+RdsonTopTc*Ta-RdsonTopTc*25))/(1-AC9*RdsonTopTc*ThetaJA_Q1)","v":1.2893332192791663E-2},{"$f":"SQRT((1-M9))*SQRT(K9^2+(N9^2)/12)","v":0.82720588235294112},{"$f":"Rdson2*AH9^2","v":1.2316852292387541E-2},{"$f":"IF(K9<N9/2,Deadtime*Fsw*IF(VfdSky_Q2>0,0,Vsd_Q2)*(K9+N9/2),2*Deadtime*Fsw*IF(VfdSky_Q2>0,0,Vsd_Q2)*K9)","v":7.4117647058823529E-3},{"$f":"(AJ9+AI9*(1+RdsonBotTc*Ta-RdsonBotTc*25))/(1-AI9*RdsonBotTc*ThetaJA_Q2)","v":1.975416445647574E-2},{"$f":"2*Deadtime*Fsw*IF(VfdSky_Q2>0,VfdSky_Q2,Vsd_Q2)*K9","v":0},{"$f":"IF(QrrSky_Q2>0,QrrSky_Q2,Qrr_Q2*K9/(Iout/Number_of_Phases))*Fsw*Vin","v":0},{"$f":"Rs*R9^2","v":4.5617971453287198E-3},{"$f":"Iq*Vin","v":1.0560000000000001E-4},{"$f":"CHOOSE(Ext_VCC, (Qg_Q1+Qg_Q2)*Fsw*'Design Regulator'!$G$102, (Qg_Q1+Qg_Q2)*Fsw*Vout, (Qg_Q1+Qg_Q2)*Fsw*Vin)","v":3.4079999999999999E-2},{"$f":"(Vin-VCC)*Fsw*(Qg_Q1+Qg_Q2)+(RdsonDRT+RdsonDRT2)*Fsw*Qg_Q1*VCC/(RdsonDRT+2*Rgate1+RdsonDRT2)+(RdsonDRB+RdsonDRB2)*Fsw*Qg_Q2*VCC/(RdsonDRB+2*Rgate2+RdsonDRB2)","v":0.12233890909090907},{"$f":"(Qg_Q1+Qg_Q2)*Fsw*(Vin-VCC)","v":0.11359999999999998},{"$f":"SUM(AO9:AP9)","v":3.4185599999999997E-2},{"$f":" SUM(U9,X9,AA9,AG9,AK9,AL9,AM9,AS9,AN9)","v":0.58197378930320709},{"$f":" SUM(AG9,AK9,AL9,AM9,AS9)","v":6.6833096649267398E-2},{"$f":"Vout*K9","v":0},{"$f":"AV9/(AV9+AT9)","v":0},{"$f":"ThetaJA_Q1*BD9","v":0.19339998289187496},{"$f":"ThetaJA_Q2*BE9","v":0.29631246684713608},null,{"$f":"AW9*100","v":0},{"$f":"U9","v":0.50949546868659545},{"$f":"AG9+AK9+AM9","v":3.2647496649267402E-2},{"$f":"AG9+AM9*0.66","v":1.2893332192791663E-2},{"$f":"AK9+AM9*0.33","v":1.975416445647574E-2},{"$f":"AN9","v":4.5617971453287198E-3},{"$f":"BC9+AS9","v":6.6833096649267398E-2},{"$f":"BG9*$B$63","v":1.3099286943256412}]
[null,null,null,null,null,null,1,48,1,{"$f":"Iout*G10/100","v":0.08},0.08,2.222222222222222E-2,0.25005541675902793,3.3093069310997874,{"$f":"K10+N10/2","v":1.7346534655498937},{"$f":"K10-N10/2","v":-1.5746534655498936},48,{"$f":"SQRT(K10^2+(N10^2)/12)","v":0.95865845344006173},9.1902603035209102E-3,0.5,0.50956490303155277,{"$f":"N10/SQRT(12)","v":0.95531462375077836},9.1262603035209122E-4,{"$f":"W10","v":9.1262603035209122E-4},{"$f":"SQRT(M10*(1-M10))*SQRT(K10^2+(N10^2)/12)","v":0.41514195474645121},1.7234284259070454E-4,{"$f":"Z10","v":1.7234284259070454E-4},{"$f":"SQRT(M10)*SQRT(K10^2+(N10^2)/12)","v":0.47938234952080488},5.5153784887700917E-3,4.6080000000000001E-3,0,7.0544475256635233E-3,1.7187779711034849E-2,0.8301919015022996,1.240593467976007E-2,7.7712475256635251E-3,2.0203499751736971E-2,7.1680000000000008E-4,5.7600000000000004E-3,4.5951301517604551E-3,1.0560000000000001E-4,{"$f":"CHOOSE(Ext_VCC, (Qg_Q1+Qg_Q2)*Fsw*'Design Regulator'!$G$102, (Qg_Q1+Qg_Q2)*Fsw*Vout, (Qg_Q1+Qg_Q2)*Fsw*Vin)","v":3.4079999999999999E-2},0.12233890909090907,0.11359999999999998,3.4185599999999997E-2,0.59329868151902787,7.8053679462771822E-2,0.96,{"$f":"AV10/(AV10+AT10)","v":0.61803953832058933},0.31484069566552275,0.33156449627605455,null,{"$f":"AW10*100","v":61.80395383205893},0.50956490303155277,4.3151279462771822E-2,2.0989379711034852E-2,2.2104299751736972E-2,4.5951301517604551E-3,{"$f":"BC10+AS10","v":7.7336879462771818E-2},{"$f":"BG10*$B$63","v":1.5158028374703278}]
["Vin",{"$f":"Vin","v":48},"V","Vin",null,null,2,48,1,0.16,0.16,4.4444444444444439E-2,0.25011083370277903,3.3097902243987876,1.8148951121993937,-1.4948951121993939,48,0.9687582829549457,9.3849261079381463E-3,0.5,0.50976765665112922,0.95545413850891603,9.1289261079381494E-4,9.1289261079381494E-4,0.41954661397851439,1.7601936130083658E-4,1.7601936130083658E-4,0.48448650064737481,5.6334520634289294E-3,9.2160000000000002E-3,0,6.6971301026532851E-3,2.1559334781378298E-2,0.83890729016040622,1.2667777946716967E-2,8.1307301026532844E-3,2.0826209337883487E-2,1.4336000000000002E-3,1.1520000000000001E-2,4.6924630539690732E-3,1.0560000000000001E-4,{"$f":"CHOOSE(Ext_VCC, (Qg_Q1+Qg_Q2)*Fsw*'Design Regulator'!$G$102, (Qg_Q1+Qg_Q2)*Fsw*Vout, (Qg_Q1+Qg_Q2)*Fsw*Vin)","v":3.4079999999999999E-2},0.12233890909090907,0.11359999999999998,3.4185599999999997E-2,0.60507377579645483,8.9524744119261784E-2,1.92,0.76037382289727229,0.43743802172067447,0.36941714006825227,null,76.037382289727233,0.50976765665112922,5.3905544119261788E-2,2.9162534781378299E-2,2.4627809337883486E-2,4.6924630539690732E-3,8.8091144119261777E-2,{"$f":"BG11*$B$63","v":1.7265864247375309}]
["Vout",{"$f":"Vout","v":12},"V","Vout",null,null,3,48,1,0.24,0.24,6.6666666666666666E-2,0.25016625083125416,3.3102734093082233,1.8951367046541117,-1.4151367046541117,47.171223488470396,0.98527111515786558,9.7075917036442399E-3,0.5,0.51010374201196051,0.9555936219776815,9.1315917036442404E-4,9.1315917036442404E-4,0.42672943696410043,1.8209801237169815E-4,1.8209801237169815E-4,0.49279933249764729,5.8284283706430415E-3,1.3823999999999999E-2,9.8079440371426135E-4,6.3398124368504198E-3,2.6989552411871495E-2,0.85317523888958324,1.3102343788577353E-2,8.4902124368504209E-3,2.1622303024439109E-2,2.1504000000000002E-3,1.7279999999999997E-2,4.8537958518221199E-3,1.0560000000000001E-4,{"$f":"CHOOSE(Ext_VCC, (Qg_Q1+Qg_Q2)*Fsw*'Design Regulator'!$G$102, (Qg_Q1+Qg_Q2)*Fsw*Vout, (Qg_Q1+Qg_Q2)*Fsw*Vin)","v":3.4079999999999999E-2},0.12233890909090907,0.11359999999999998,3.4185599999999997E-2,0.61828065048282932,0.10222785543631059,2.88,0.82326156410650053,0.57591528617807242,0.40987054536658662,null,82.326156410650057,0.51010374201196051,6.5891855436310598E-2,3.8394352411871495E-2,2.7324703024439109E-2,4.8537958518221199E-3,0.10007745543631059,1.9615181265516879]
["Fsw",{"$f":"Fsw/1000","v":400},"kHz","Switching Frequency",null,null,4,48,1,0.32,0.32,8.8888888888888878E-2,0.25022166814445429,3.310756485827552,1.9753782429137761,-1.3353782429137759,44.512608097125863,1.0078817931867969,1.0158257090374335E-2,0.5,0.51057317978026695,0.95573307415691833,9.1342570903743363E-4,9.1342570903743363E-4,0.43655453110709319,1.90579858630134E-4,1.90579858630134E-4,0.50416426237821499,6.1003584830248711E-3,1.8432E-2,3.9416322377643226E-3,5.9824945282537165E-3,3.4478570070971493E-2,0.87272223850321573,1.3709593900405145E-2,8.8496945282537185E-3,2.2591809504706271E-2,2.8672000000000003E-3,2.3040000000000001E-2,5.0791285451871676E-3,1.0560000000000001E-4,{"$f":"CHOOSE(Ext_VCC, (Qg_Q1+Qg_Q2)*Fsw*'Design Regulator'!$G$102, (Qg_Q1+Qg_Q2)*Fsw*Vout, (Qg_Q1+Qg_Q2)*Fsw*Vin)","v":3.4079999999999999E-2},0.12233890909090907,0.11359999999999998,3.4185599999999997E-2,0.6339194934687995,0.11716317957567776,3.84,0.85830780048809108,0.74527455106457241,0.45292514257059407,null,85.830780048809103,0.51057317978026695,8.0110379575677765E-2,4.9684970070971494E-2,3.0195009504706272E-2,5.0791285451871676E-3,0.11429597957567776,2.2402011996832845]
["Iout",{"$f":"Iout","v":8},"A","Max Output Current",null,null,5,48,1,0.4,0.4,0.11111111111111112,0.25027708564238033,3.3112394539562335,2.0556197269781169,-1.2556197269781166,41.853990899270556,1.036191211498324,1.0736922267863644E-2,0.5,0.51117599882503018,0.95587249504647054,9.1369222678636488E-4,9.1369222678636488E-4,0.44884959890630544,2.0146596243835127E-4,2.0146596243835127E-4,0.51838263994559941,6.4492934735272556E-3,2.3040000000000001E-2,6.6197423635503509E-3,5.6251763768619626E-3,4.1762492764001784E-2,0.89720213184621644,1.4489489977009119E-2,9.2091763768619647E-3,2.3734776358306862E-2,3.5840000000000004E-3,2.8799999999999999E-2,5.3684611339318219E-3,1.0560000000000001E-4,{"$f":"CHOOSE(Ext_VCC, (Qg_Q1+Qg_Q2)*Fsw*'Design Regulator'!$G$102, (Qg_Q1+Qg_Q2)*Fsw*Vout, (Qg_Q1+Qg_Q2)*Fsw*Vin)","v":3.4079999999999999E-2},0.12233890909090907,0.11359999999999998,3.4185599999999997E-2,0.64972648727049553,0.13206686912230864,4.8000000000000007,0.88077814752939798,0.91155739146002679,0.49858164537460292,null,88.077814752939801,0.51117599882503018,9.4297269122308652E-2,6.0770492764001788E-2,3.3238776358306861E-2,5.3684611339318219E-3,0.12848286912230866,2.5182642347972499]
["Ta",{"$f":"Ta","v":25},"°C","Ambient Temperature",null,null,6,48,1,0.48,0.48,0.13333333333333333,0.25033250332503326,3.3117223136937248,2.1358611568468624,-1.1758611568468624,39.195371894895416,1.0697470371937206,1.1443587235847435E-2,0.5,0.5119122362224322,0.95601188464618125,9.1395872358474343E-4,9.1395872358474343E-4,0.46341923319378026,2.1475738569391129E-4,2.1475738569391129E-4,0.53522909485267012,6.875284415443406E-3,2.7647999999999999E-2,9.0151242047415512E-3,5.267857982673943E-3,4.8841525537691249E-2,0.92622272678224371,1.5441993712942827E-2,9.5686579826739452E-3,2.5051270058865548E-2,4.3008000000000005E-3,3.4559999999999994E-2,5.7217936179237176E-3,1.0560000000000001E-4,{"$f":"CHOOSE(Ext_VCC, (Qg_Q1+Qg_Q2)*Fsw*'Design Regulator'!$G$102, (Qg_Q1+Qg_Q2)*Fsw*Vout, (Qg_Q1+Qg_Q2)*Fsw*Vin)","v":3.4079999999999999E-2},0.12233890909090907,0.11359999999999998,3.4185599999999997E-2,0.66570194154619144,0.1469391955965568,5.76,0.89640012132495417,1.0747668830653687,0.54684105088298318,null,89.640012132495414,0.5119122362224322,0.10845279559655679,7.1651125537691249E-2,3.6456070058865545E-2,5.7217936179237176E-3,0.14263839559655678,2.7957125536925131]
["Vcc",{"$f":"VCC","v":8},"V","Subregulated VCC Voltage",null,null,7,48,1,0.56000000000000005,0.56000000000000005,0.15555555555555556,0.25038792119241393,3.312205065039485,2.2161025325197423,-1.0961025325197424,36.536751083991412,1.1080727410265545,1.2278251994061018E-2,0.5,0.51278193726155696,0.95615124295589438,9.1422519940610183E-4,9.1422519940610183E-4,0.4800574859636309,2.304551898297217E-4,2.304551898297217E-4,0.55446604879555506,7.3783823824069162E-3,3.2256000000000007E-2,1.1127777185002866E-2,4.910539345688446E-3,5.5715863672527136E-2,0.95937093980334154,1.6567066802504641E-2,9.9281393456884474E-3,2.6541375986838547E-2,5.0176000000000014E-3,4.0320000000000002E-2,6.139125997030509E-3,1.0560000000000001E-4,{"$f":"CHOOSE(Ext_VCC, (Qg_Q1+Qg_Q2)*Fsw*'Design Regulator'!$G$102, (Qg_Q1+Qg_Q2)*Fsw*Vout, (Qg_Q1+Qg_Q2)*Fsw*Vin)","v":3.4079999999999999E-2},0.12233890909090907,0.11359999999999998,3.4185599999999997E-2,0.68184618330718894,0.16178043965936567,6.7200000000000006,0.90788160596407641,1.2349059550879071,0.59770463980257826,null,90.788160596407636,0.51278193726155696,0.12257723965936568,8.2327063672527137E-2,3.9846975986838548E-2,6.139125997030509E-3,0.15676283965936566,3.0725516573235674]
["Components","Input Value","Units","Description",null,null,8,48,1,0.64,0.64,0.17777777777777776,0.25044333924452322,3.3126877079929682,2.296343853996484,-1.0163438539964842,33.878128466549477,1.1506918154849175,1.3240916542239753E-2,0.5,0.51378515545135761,0.95629056997545236,9.1449165422397558E-4,9.1449165422397558E-4,0.49855835748087551,2.4856043581402847E-4,2.4856043581402847E-4,0.57585582861481666,7.9586384483917704E-3,3.6864000000000001E-2,1.2957700727995023E-2,4.5532204659042494E-3,6.2385692685396774E-2,0.99623376718234069,1.7864670939737728E-2,1.028762046590425E-2,2.8205198447492696E-2,5.7344000000000006E-3,4.6080000000000003E-2,6.6204582711198766E-3,1.0560000000000001E-4,{"$f":"CHOOSE(Ext_VCC, (Qg_Q1+Qg_Q2)*Fsw*'Design Regulator'!$G$102, (Qg_Q1+Qg_Q2)*Fsw*Vout, (Qg_Q1+Qg_Q2)*Fsw*Vin)","v":3.4079999999999999E-2},0.12233890909090907,0.11359999999999998,3.4185599999999997E-2,0.69815955694540499,0.17659089113288945,7.68,0.91666910230103715,1.3919773902809516,0.65117397671239052,null,91.66691023010371,0.51378515545135761,0.13667089113288947,9.2798492685396777E-2,4.3411598447492698E-2,6.6204582711198766E-3,0.17085649113288948,3.3487872262046339]
["L",{"$f":"Lf*1000000","v":6.8},"uH","Filter Inductance",null,null,9,48,1,0.72,0.72,0.2,0.25049875748136219,3.3131702425536376,2.3765851212768188,-0.93658512127681881,31.219504042560626,1.1971458090023583,1.4331580880119111E-2,0.5,0.5149219525288885,0.95642986570470023,9.1475808801191091E-4,9.1475808801191091E-4,0.51872361055807914,2.6907418415040972E-4,2.6907418415040972E-4,0.59916969242556695,8.6161036877123644E-3,4.1472000000000002E-2,1.450489425737447E-2,4.1959013433201485E-3,6.8851188331063656E-2,1.0364138978663699,1.9334767818430122E-2,1.0647101343320149E-2,3.0042860694042949E-2,6.4512000000000007E-3,5.1839999999999997E-2,7.1657904400595556E-3,1.0560000000000001E-4,{"$f":"CHOOSE(Ext_VCC, (Qg_Q1+Qg_Q2)*Fsw*'Design Regulator'!$G$102, (Qg_Q1+Qg_Q2)*Fsw*Vout, (Qg_Q1+Qg_Q2)*Fsw*Vin)","v":3.4079999999999999E-2},0.12233890909090907,0.11359999999999998,3.4185599999999997E-2,0.71464242426621705,0.19137084902510659,8.64,0.92360558620472621,1.545983824965955,0.70725091041064425,null,92.360558620472617,0.5149219525288885,0.15073404902510662,0.10306558833106366,4.7150060694042949E-2,7.1657904400595556E-3,0.1849196490251066,3.6244251208920897]
["Rdcr",{"$f":"Rdcr*1000","v":10},"mW","Inductor DCR at 25°C",null,null,10,48,1,0.8,0.8,0.22222222222222224,0.25055417590293172,3.3136526687209491,2.4568263343604748,-0.85682633436047451,28.560877812015814,1.2470062151984072,1.5550245007434562E-2,0.5,0.51619239846880771,0.95656913014348099,9.1502450074345588E-4,9.1502450074345588E-4,0.54036792547093826,2.9199749487776551E-4,2.9199749487776551E-4,0.62419378584911001,9.3508291750234711E-3,4.6080000000000003E-2,1.5769357196793444E-2,3.8385819779349259E-3,7.5112516602475712E-2,1.0795400031730236,2.0977319132114612E-2,1.1006581977934929E-2,3.2054504955958268E-2,7.1680000000000008E-3,5.7599999999999998E-2,7.7751225037172812E-3,1.0560000000000001E-4,{"$f":"CHOOSE(Ext_VCC, (Qg_Q1+Qg_Q2)*Fsw*'Design Regulator'!$G$102, (Qg_Q1+Qg_Q2)*Fsw*Vout, (Qg_Q1+Qg_Q2)*Fsw*Vin)","v":3.4079999999999999E-2},0.12233890909090907,0.11359999999999998,3.4185599999999997E-2,0.73129516452658017,0.20612062155843397,9.6000000000000014,0.92921553852826244,1.6969277490371357,0.76593757433937393,null,92.92155385282625,0.51619239846880771,0.16476702155843398,0.11312851660247572,5.1062504955958266E-2,7.7751225037172812E-3,0.19895262155843396,3.8994713825453058]
["LTc",{"$f":"Ltc*1000000","v":4000},"ppm","Inductor Series Resistance Temp Co",null,null,11,48,1,0.88,0.88,0.24444444444444444,0.2506095945092327,3.3141349864943606,2.5370674932471804,-0.77706749324718027,25.902249774906011,1.2998811070217786,1.6896908923921646E-2,0.5,0.51759657149415128,0.956708363291638,9.1529089239216475E-4,9.1529089239216475E-4,0.56332177977627607,3.1733142757031131E-4,3.1733142757031131E-4,0.6507324714414856,1.0162865985320253E-2,5.0687999999999997E-2,1.6751088969899963E-2,3.4812623697473683E-3,8.1169833729903593E-2,1.1252724750049745,2.2792286574068777E-2,1.136606236974737E-2,3.4240292472449411E-2,7.8848000000000008E-3,6.336E-2,8.4484544619608231E-3,1.0560000000000001E-4,{"$f":"CHOOSE(Ext_VCC, (Qg_Q1+Qg_Q2)*Fsw*'Design Regulator'!$G$102, (Qg_Q1+Qg_Q2)*Fsw*Vout, (Qg_Q1+Qg_Q2)*Fsw*Vin)","v":3.4079999999999999E-2},0.12233890909090907,0.11359999999999998,3.4185599999999997E-2,0.74811817447842766,0.220840526202353,10.56,0.93384238093948524,1.8448115059485539,0.82723638708674119,null,93.384238093948525,0.51759657149415128,0.178770126202353,0.12298743372990359,5.514909247244941E-2,8.4484544619608231E-3,0.21295572620235298,4.1739322335661191]
["ThetaCa",{"$f":"ThetaCa","v":20},"°C/W","Core to Ambient Thermal Resistance",null,null,12,48,1,0.96,0.96,0.26666666666666666,0.25066501330026597,3.3146171958733284,2.6173085979366641,-0.69730859793666422,23.243619931222145,1.3554177448047511,1.8371572629315974E-2,0.5,0.51913455808838072,0.95684756514901437,9.155572629315974E-4,9.155572629315974E-4,0.58743258450444358,3.4507704133757025E-4,3.4507704133757025E-4,0.67860964460242468,1.10522651939383E-2,5.5295999999999998E-2,1.7450089000337801E-2,3.123942518756256E-3,8.7023286178906561E-2,1.1733056776408135,2.4779631837315033E-2,1.1725542518756257E-2,3.6600403531154201E-2,8.6016000000000009E-3,6.9119999999999987E-2,9.1857863146579868E-3,1.0560000000000001E-4,{"$f":"CHOOSE(Ext_VCC, (Qg_Q1+Qg_Q2)*Fsw*'Design Regulator'!$G$102, (Qg_Q1+Qg_Q2)*Fsw*Vout, (Qg_Q1+Qg_Q2)*Fsw*Vin)","v":3.4079999999999999E-2},0.12233890909090907,0.11359999999999998,3.4185599999999997E-2,0.76511186841736856,0.23553088971006075,11.52,0.9377203987548276,1.9896372926835983,0.89115005296731287,null,93.772039875482761,0.51913455808838072,0.19274368971006076,0.13264248617890656,5.9410003531154193E-2,9.1857863146579868E-3,0.22692928971006077,4.4478140783171911]
["Cin",{"$f":"Cin*1000000","v":15},"μF","Input Capacitance",null,null,13,48,1,1.04,1.04,0.28888888888888886,0.25072043227603263,3.3150992968573143,2.697549648428657,-0.61754964842865712,20.58498828095524,1.4133023782387553,1.9974236123353219E-2,0.5,0.5208064530087102,0.95698673571545478,9.1582361233532173E-4,9.1582361233532173E-4,0.61256460461274265,3.7523539482436577E-4,3.7523539482436577E-4,0.70766864528751494,1.20190778765536E-2,5.9903999999999999E-2,1.7866356711746478E-2,2.766622424960384E-3,9.2673010647122828E-2,1.22336777005619,2.6939316614620588E-2,1.2085022424960384E-2,3.9135037512038465E-2,9.318400000000001E-3,7.4880000000000002E-2,9.9871180616766097E-3,1.0560000000000001E-4,{"$f":"CHOOSE(Ext_VCC, (Qg_Q1+Qg_Q2)*Fsw*'Design Regulator'!$G$102, (Qg_Q1+Qg_Q2)*Fsw*Vout, (Qg_Q1+Qg_Q2)*Fsw*Vin)","v":3.4079999999999999E-2},0.12233890909090907,0.11359999999999998,3.4185599999999997E-2,0.78227667823670788,0.2501920481591613,12.48,0.94101490285446865,2.1314071597068427,0.95768156268057703,null,94.101490285446872,0.5208064530087102,0.20668804815916131,0.14209381064712284,6.3845437512038472E-2,9.9871180616766097E-3,0.24087364815916129,4.7211235039195616]
["RCinEsr",{"$f":"RCinEsr*1000","v":1},"mW","Input Capacitor ESR",null,null,14,48,1,1.1200000000000001,1.1200000000000001,0.31111111111111112,0.25077585143653353,3.315581289445773,2.7777906447228866,-0.5377906447228864,17.926354824096212,1.4732582735477537,2.1704899405769078E-2,0.5,0.5226123593007157,0.95712587499080182,9.1608994057690795E-4,9.1608994057690795E-4,0.63859811009022882,4.0780754621081203E-4,4.0780754621081203E-4,0.73777128087409671,1.3063355109182528E-2,6.4512000000000014E-2,1.7999891527761332E-2,2.4093020883585309E-3,9.8119134059881527E-2,1.2752189920536405,2.9271302598497452E-2,1.2444502088358534E-2,4.1844412936533772E-2,1.0035200000000003E-2,8.0640000000000003E-2,1.0852449702884539E-2,1.0560000000000001E-4,{"$f":"CHOOSE(Ext_VCC, (Qg_Q1+Qg_Q2)*Fsw*'Design Regulator'!$G$102, (Qg_Q1+Qg_Q2)*Fsw*Vout, (Qg_Q1+Qg_Q2)*Fsw*Vin)","v":3.4079999999999999E-2},0.12233890909090907,0.11359999999999998,3.4185599999999997E-2,0.79961305348680334,0.26482434699641527,13.440000000000001,0.94384587204137516,2.2701230108982231,1.0268341940480066,null,94.384587204137517,0.5226123593007157,0.22060354699641532,0.15134153405988154,6.8455612936533766E-2,1.0852449702884539E-2,0.25478914699641531,4.9938672811297407]
["Cout",{"$f":"Cout*1000000","v":100},"μF","Output Capcitance",null,null,15,48,1,1.2,1.2,0.33333333333333326,0.25083127078176953,3.3160631736381641,2.8580315868190818,-0.45803158681908207,15.26771956063607,1.5350427510756612,2.3563562476299347E-2,0.5,0.52455238831423001,0.95726498297489937,9.1635624762993447E-4,9.1635624762993447E-4,0.66542809770275535,4.4279455321230771E-4,4.4279455321230771E-4,0.76879635275382152,1.4185147968181881E-2,6.9119999999999987E-2,1.785069287201339E-2,2.0519815089494876E-3,0.10336177356463289,1.3286490942390907,3.177555148120241E-2,1.2803981508949487E-2,4.4728767521935713E-2,1.0752000000000001E-2,8.6400000000000005E-2,1.1781781238149673E-2,1.0560000000000001E-4,{"$f":"CHOOSE(Ext_VCC, (Qg_Q1+Qg_Q2)*Fsw*'Design Regulator'!$G$102, (Qg_Q1+Qg_Q2)*Fsw*Vout, (Qg_Q1+Qg_Q2)*Fsw*Vin)","v":3.4079999999999999E-2},0.12233890909090907,0.11359999999999998,3.4185599999999997E-2,0.81712146143979059,0.2794281410865686,14.399999999999999,0.94630249462683358,2.4057866034694935,1.0986115128290357,null,94.630249462683352,0.52455238831423001,0.23449054108656861,0.16038577356463291,7.3240767521935715E-2,1.1781781238149673E-2,0.26867614108656862,5.266052365296745]
["RCoutEsr",{"$f":"Cout_ESR*1000","v":1},"mW","Output Capacitor ESR",null,null,16,48,1,1.28,1.28,0.35555555555555551,0.25088669031174166,3.3165449494339452,2.9382724747169728,-0.37827247471697256,12.609082490565752,1.5984437848945405,2.5550225334679842E-2,0.5,0.52662665972052858,0.95740405966759101,9.1662253346798416E-4,9.1662253346798416E-4,0.69296282229245765,4.8019747307952827E-4,4.8019747307952827E-4,0.80063796256092157,1.5384507530248887E-2,7.3728000000000002E-2,1.7418760168129526E-2,1.6946606867320373E-3,0.10840103652419325,1.383474389489838,3.4452024954737037E-2,1.3163460686732039E-2,4.7788358241089214E-2,1.1468800000000001E-2,9.2160000000000006E-2,1.2775112667339921E-2,1.0560000000000001E-4,{"$f":"CHOOSE(Ext_VCC, (Qg_Q1+Qg_Q2)*Fsw*'Design Regulator'!$G$102, (Qg_Q1+Qg_Q2)*Fsw*Vout, (Qg_Q1+Qg_Q2)*Fsw*Vin)","v":3.4079999999999999E-2},0.12233890909090907,0.11359999999999998,3.4185599999999997E-2,0.83480238715969857,0.29400379476528243,15.36,0.94845244991556155,2.5383995478628987,1.1730173736163383,null,94.845244991556157,0.52662665972052858,0.24834939476528245,0.16922663652419326,7.8201158241089225E-2,1.2775112667339921E-2,0.28253499476528243,5.5376858973995358]
["Top Driver","Input Value","Units","Description",null,null,17,48,1,1.36,1.36,0.37777777777777777,0.25094211002645073,3.3170266168325742,3.0185133084162872,-0.29851330841628698,9.9504436138762333,1.663276524834234,2.7664887980646462E-2,0.5,0.52883530153081137,0.9575431050687202,9.168887980646462E-4,9.168887980646462E-4,0.72112229378824311,5.2001736259841723E-4,5.2001736259841723E-4,0.83320377840650839,1.6661484872421167E-2,7.8336000000000003E-2,1.6704092839732291E-2,1.3373396217049656E-3,0.1132370205088,1.4395347379322823,3.7300684710847756E-2,1.3522939621704968E-2,5.1023461387389779E-2,1.2185600000000003E-2,9.7920000000000007E-2,1.3832443990323231E-2,1.0560000000000001E-4,{"$f":"CHOOSE(Ext_VCC, (Qg_Q1+Qg_Q2)*Fsw*'Design Regulator'!$G$102, (Qg_Q1+Qg_Q2)*Fsw*Vout, (Qg_Q1+Qg_Q2)*Fsw*Vin)","v":3.4079999999999999E-2},0.12233890909090907,0.11359999999999998,3.4185599999999997E-2,0.85265633357798754,0.30855168189618976,16.32,0.95034802321695722,2.6679633076320002,1.2500559208108466,null,95.034802321695722,0.52883530153081137,0.26218048189618981,0.17786422050880002,8.3337061387389777E-2,1.3832443990323231E-2,0.29636608189618979,5.8087752051653201]
["RdsonDRT",0.7,"W","Drain to Source Resistance of pullup Top FET Driver",null,null,18,48,1,1.44,1.44,0.4,0.2509975299258978,3.3175081758335101,3.0987540879167552,-0.2187540879167551,7.2918029305585037,1.7293799586538279,2.9907550413935155E-2,0.5,0.5311784501159863,0.95768211917813073,9.1715504139351547E-4,9.1715504139351547E-4,0.74983683431142434,5.6225527809017838E-4,5.6225527809017838E-4,0.86641337016645725,1.8016131072076766E-2,8.2944000000000004E-2,1.570669031044011E-2,9.8001831386706302E-4,0.11786981328697396,1.4966906538728426,4.0321492441025709E-2,1.3882418313867065E-2,5.4434372645132754E-2,1.2902400000000001E-2,0.10367999999999999,1.4953775206967578E-2,1.0560000000000001E-4,{"$f":"CHOOSE(Ext_VCC, (Qg_Q1+Qg_Q2)*Fsw*'Design Regulator'!$G$102, (Qg_Q1+Qg_Q2)*Fsw*Vout, (Qg_Q1+Qg_Q2)*Fsw*Vin)","v":3.4079999999999999E-2},0.12233890909090907,0.11359999999999998,3.4185599999999997E-2,0.87068382157454438,0.32307218593210668,17.28,0.95203024689683491,2.7944791993046092,1.3297315896769912,null,95.203024689683488,0.5311784501159863,0.27598418593210672,0.18629861328697395,8.8648772645132753E-2,1.4953775206967578E-2,0.3101697859321067,6.0793278042692922]
["RdsonDRT2",{"$f":"RdsonDRT2","v":1},"W","Drain to Source Resistance of pulldown Top FET Driver",null,null,19,48,1,1.52,1.52,0.42222222222222222,0.25105295001008365,3.3179896264362094,3.1789948132181047,-0.1389948132181047,4.6331604406034899,1.7966138325828929,3.2278212634281912E-2,0.5,0.53365625022775909,0.95782110199566572,9.1742126342819156E-4,9.1742126342819156E-4,0.77904574667426874,6.0691227541126891E-4,6.0691227541126891E-4,0.90019667311589346,1.9448497206934146E-2,8.7552000000000005E-2,1.4426552003867056E-2,6.2269676321710914E-4,0.122299492815183,1.5548206369672575,4.3514409836506826E-2,1.4241896763217111E-2,5.8021407165245266E-2,1.3619200000000001E-2,0.10944,1.6139106317140956E-2,1.0560000000000001E-4,{"$f":"CHOOSE(Ext_VCC, (Qg_Q1+Qg_Q2)*Fsw*'Design Regulator'!$G$102, (Qg_Q1+Qg_Q2)*Fsw*Vout, (Qg_Q1+Qg_Q2)*Fsw*Vin)","v":3.4079999999999999E-2},0.12233890909090907,0.11359999999999998,3.4185599999999997E-2,0.888885390064168,0.33756569998042824,18.240000000000002,0.9535317729214966,2.9179483922277454,1.4120491074786792,null,95.353177292149667,0.53365625022775909,0.28976089998042825,0.19452989281518301,9.4136607165245273E-2,1.6139106317140956E-2,0.32394649998042824,6.3493513996163937]
["Bottom Driver","Input Value","Units","Description",null,null,20,48,1,1.6,1.6,0.44444444444444448,0.25110837027900929,3.3184709686401308,3.2592354843200653,-5.9235484320065313E-2,1.9745161440021772,1.8648558829417037,3.477687464142281E-2,0.5,0.53626885502103605,0.95796005352116886,9.1768746414228075E-4,9.1768746414228075E-4,0.80869611718703793,6.5398940995339144E-4,6.5398940995339144E-4,0.93449260642367238,2.0958634355052207E-2,9.2160000000000006E-2,1.2863677343623056E-2,2.6537496975389261E-4,0.12652612722630335,1.6138187731842049,4.6879398588271899E-2,1.4601374969753894E-2,6.1784899646438282E-2,1.4336000000000002E-2,0.1152,1.7388437320711405E-2,1.0560000000000001E-4,{"$f":"CHOOSE(Ext_VCC, (Qg_Q1+Qg_Q2)*Fsw*'Design Regulator'!$G$102, (Qg_Q1+Qg_Q2)*Fsw*Vout, (Qg_Q1+Qg_Q2)*Fsw*Vin)","v":3.4079999999999999E-2},0.12233890909090907,0.11359999999999998,3.4185599999999997E-2,0.90726159608858492,0.35203262687274167,19.200000000000003,0.95487890821169441,3.03837190839455,1.4970134946965743,null,95.487890821169444,0.53626885502103605,0.30351102687274167,0.20255812722630334,9.980089964643829E-2,1.7388437320711405E-2,0.33769662687274166,6.6188538867057369]
["RdsonDRB",0.7,"W","Drain to Source Resistance of pullup Bottom FET Driver",null,null,21,48,1,1.68,1.68,0.46666666666666662,0.25116379073267564,3.3189522024447324,3.3394761012223659,2.052389877763372E-2,0,1.9339993907727568,3.7403536435093948E-2,0.5,0.53901642607764666,0.95809897375448383,9.1795364350939518E-4,9.1795364350939518E-4,0.83874175801821427,7.0348773664348475E-4,7.0348773664348475E-4,0.96924785260767776,2.2546593594830272E-2,9.6767999999999993E-2,1.1520000000000028E-2,0,0.13114506541648113,1.6735926158192742,5.0416420387046405E-2,1.5052800000000002E-2,6.5817640821141249E-2,1.5052800000000002E-2,0.12095999999999998,1.8701768217546974E-2,1.0560000000000001E-4,{"$f":"CHOOSE(Ext_VCC, (Qg_Q1+Qg_Q2)*Fsw*'Design Regulator'!$G$102, (Qg_Q1+Qg_Q2)*Fsw*Vout, (Qg_Q1+Qg_Q2)*Fsw*Vin)","v":3.4079999999999999E-2},0.12233890909090907,0.11359999999999998,3.4185599999999997E-2,0.92650074191296905,0.36716110623762238,20.16,0.95606190172315353,3.1646799812472173,1.5860166123171187,null,95.606190172315351,0.53901642607764666,0.31792270623762237,0.21097866541648114,0.10573444082114125,1.8701768217546974E-2,0.35210830623762235,6.9013228022573987]
["RdsonDRB2",0.5,"W","Drain to Source Resistance of pulldown Bottom FET Driver",null,null,22,48,1,1.76,1.76,0.48888888888888887,0.25121921137108361,3.3194333278494721,3.4197166639247358,0.10028333607526396,0,2.0039510476813427,4.0158198015031517E-2,0.5,0.54189913343139251,0.95823786269545408,9.1821980150315189E-4,9.1821980150315189E-4,0.86914228406154403,7.5540830994371767E-4,7.5540830994371767E-4,1.0044157921607979,2.4212426005008079E-2,0.10137599999999999,1.1520000000000028E-2,0,0.13745788583842322,1.7340613362742241,5.412543692330065E-2,1.5769600000000002E-2,7.0294532764717657E-2,1.5769600000000002E-2,0.12672,2.0079099007515758E-2,1.0560000000000001E-4,{"$f":"CHOOSE(Ext_VCC, (Qg_Q1+Qg_Q2)*Fsw*'Design Regulator'!$G$102, (Qg_Q1+Qg_Q2)*Fsw*Vout, (Qg_Q1+Qg_Q2)*Fsw*Vin)","v":3.4079999999999999E-2},0.12233890909090907,0.11359999999999998,3.4185599999999997E-2,0.94807947915349622,0.38442761860314084,21.12,0.95703842375368031,3.3163962875763486,1.6816819914707648,null,95.703842375368026,0.54189913343139251,0.33447241860314086,0.22109308583842324,0.11211213276471765,2.0079099007515758E-2,0.36865801860314085,7.2256971646215611]
["Deadtime","Input Value","Units","Description",null,null,23,48,1,1.84,1.84,0.51111111111111107,0.25127463219423413,3.3199143448538075,3.4999571724269041,0.18004282757309631,0,2.0746291085630642,4.3040859380971741E-2,0.5,0.54491715559442921,0.95837672034392296,9.1848593809717397E-4,9.1848593809717397E-4,0.89986231383000026,8.0975218385148184E-4,8.0975218385148184E-4,1.0399555812763075,2.5956182664665824E-2,0.10598399999999999,1.1520000000000028E-2,0,0.14385223743458098,1.795154123486179,5.8006409887249762E-2,1.6486400000000002E-2,7.4949301577597452E-2,1.6486400000000002E-2,0.13247999999999999,2.1520429690485871E-2,1.0560000000000001E-4,{"$f":"CHOOSE(Ext_VCC, (Qg_Q1+Qg_Q2)*Fsw*'Design Regulator'!$G$102, (Qg_Q1+Qg_Q2)*Fsw*Vout, (Qg_Q1+Qg_Q2)*Fsw*Vin)","v":3.4079999999999999E-2},0.12233890909090907,0.11359999999999998,3.4185599999999997E-2,0.97011936241904229,0.4019535390121784,22.080000000000002,0.95791261003182804,3.4693355615187143,1.7800155236639619,null,95.791261003182797,0.54491715559442921,0.3512815390121784,0.23128903743458096,0.11866770157759746,2.1520429690485871E-2,0.38546713901217838,7.5551559246386972]
["Deadtime",{"$f":"Deadtime*1000000000","v":14},"ns","Total Deadtime",null,null,24,48,1,1.92,1.92,0.53333333333333333,0.25133005320212809,3.320395253457197,3.5801976267285984,0.25980237327140143,0,2.145961801445937,4.6051520532650915E-2,0.5,0.54807067958499112,0.95851554669973427,9.1875205326509047E-4,9.1875205326509047E-4,0.93087078152629754,8.6652041189938002E-4,8.6652041189938002E-4,1.0758313578581937,2.7777914653224118E-2,0.110592,1.1520000000000028E-2,0,0.15032837457290277,1.8568088061817474,6.2059300968853544E-2,1.7203200000000002E-2,7.978238104255235E-2,1.7203200000000002E-2,0.13823999999999997,2.3025760266325457E-2,1.0560000000000001E-4,{"$f":"CHOOSE(Ext_VCC, (Qg_Q1+Qg_Q2)*Fsw*'Design Regulator'!$G$102, (Qg_Q1+Qg_Q2)*Fsw*Vout, (Qg_Q1+Qg_Q2)*Fsw*Vin)","v":3.4079999999999999E-2},0.12233890909090907,0.11359999999999998,3.4185599999999997E-2,0.99262126793193606,0.41973955561545512,23.04,0.95869692045384802,3.6235016185935414,1.881023715638285,null,95.869692045384795,0.54807067958499112,0.36835075561545511,0.24156677457290276,0.12540158104255233,2.3025760266325457E-2,0.40253635561545509,7.8897125700629207]
["IQ","Input Value","Units","Description",null,null,25,48,1,2,2,0.55555555555555547,0.25138547439476649,3.3208760536590991,3.6604380268295493,0.33956197317045045,0,2.2178859634752497,4.9190181469805368E-2,0.5,0.55135990095646314,0.95865434176273157,9.1901814698053621E-4,9.1901814698053621E-4,0.96214034691162575,9.2571404715522353E-4,9.2571404715522353E-4,1.1120115603873761,2.9677673050444012E-2,0.1152,1.1520000000000028E-2,0,0.15688655598145898,1.9189706711008818,6.6284071857816637E-2,1.7920000000000002E-2,8.4794225040919366E-2,1.7920000000000002E-2,0.14399999999999999,2.4595090734902684E-2,1.0560000000000001E-4,{"$f":"CHOOSE(Ext_VCC, (Qg_Q1+Qg_Q2)*Fsw*'Design Regulator'!$G$102, (Qg_Q1+Qg_Q2)*Fsw*Vout, (Qg_Q1+Qg_Q2)*Fsw*Vin)","v":3.4079999999999999E-2},0.12233890909090907,0.11359999999999998,3.4185599999999997E-2,1.01558610490788,0.43778638102237827,24,0.95940186647441261,3.7788983397218843,1.9847133756137905,null,95.940186647441266,0.55135990095646314,0.38568078102237835,0.25192655598145897,0.13231422504091936,2.4595090734902684E-2,0.41986638102237833,8.2293810680386166]
["IQ ",{"$f":"Iq*1000","v":2.2000000000000001E-3},"mA","Quiescent Current Of Controller (Not Switching!)",null,null,26,48,1,2.08,2.08,0.57777777777777772,0.25144089577215012,3.3213567454589694,3.7406783727294846,0.41932162727051536,0,2.29034587327267,5.2456842192171491E-2,0.5,0.5547850238278127,0.95879310553275776,9.1928421921715E-4,9.1928421921715E-4,0.99364689010836282,9.8733414222202092E-4,9.8733414222202092E-4,1.1484683448044146,3.1655508936427004E-2,0.119808,1.1520000000000028E-2,0,0.16352704477829635,1.9815914513843054,7.0680684243588435E-2,1.8636800000000002E-2,8.9985307670984199E-2,1.8636800000000002E-2,0.14976,2.6228421096085745E-2,1.0560000000000001E-4,{"$f":"CHOOSE(Ext_VCC, (Qg_Q1+Qg_Q2)*Fsw*'Design Regulator'!$G$102, (Qg_Q1+Qg_Q2)*Fsw*Vout, (Qg_Q1+Qg_Q2)*Fsw*Vin)","v":3.4079999999999999E-2},0.12233890909090907,0.11359999999999998,3.4185599999999997E-2,1.0390148157346182,0.45609475244928055,24.96,0.96003637741281622,3.9355296716744452,2.0910916150647632,null,96.003637741281622,0.5547850238278127,0.40327235244928056,0.26236864477829636,0.13940610767098421,2.6228421096085745E-2,0.43745795244928054,8.5741758680058986]
["High-side FET","Input Value","Units","Description",null,null,27,48,1,2.16,2.16,0.6,0.25149631733428007,3.3218373288562693,3.8209186644281345,0.49908133557186551,0,2.3632922523354107,5.5851502699485786E-2,0.5,0.55834626091538686,0.95893183800965731,9.1955026994857976E-4,9.1955026994857976E-4,1.0253690795211112,1.0513817492379708E-3,1.0513817492379708E-3,1.1851770857769011,3.3711473391615072E-2,0.124416,1.1520000000000028E-2,0,0.17025010850189662,2.04462846143204,7.524909981536311E-2,1.9353600000000002E-2,9.535612337215503E-2,1.9353600000000002E-2,0.15551999999999999,2.7925751349742893E-2,1.0560000000000001E-4,{"$f":"CHOOSE(Ext_VCC, (Qg_Q1+Qg_Q2)*Fsw*'Design Regulator'!$G$102, (Qg_Q1+Qg_Q2)*Fsw*Vout, (Qg_Q1+Qg_Q2)*Fsw*Vin)","v":3.4079999999999999E-2},0.12233890909090907,0.11359999999999998,3.4185599999999997E-2,1.062908376158368,0.47466543187405164,25.92,0.96060808711422907,4.0933996275284494,2.2001658505823256,null,96.060808711422908,0.55834626091538686,0.42112623187405163,0.27289330850189664,0.14667772337215504,2.7925751349742893E-2,0.45531183187405161,8.9241119047314115]
["RdsonTop",{"$f":"Rdson1*1000","v":24},"mW","Drain-Source Resistance of Top FET ",null,null,28,48,1,2.2400000000000002,2.2400000000000002,0.62222222222222223,0.25155173908115713,3.3223178038504542,3.9011589019252275,0.57884109807477313,0,2.4366814110893684,5.9374162991484757E-2,0.5,0.56204383356608578,0.95907053919327301,9.1981629914847547E-4,9.1981629914847547E-4,1.0572880023325981,1.1178579198764559E-3,1.1178579198764559E-3,1.2221159501862362,3.584561749679057E-2,0.12902400000000003,1.1520000000000028E-2,0,0.17705601914224675,2.1080438570980609,7.9989280262079646E-2,2.0070400000000006E-2,0.10090718705498861,2.0070400000000006E-2,0.16128000000000001,2.9687081495742378E-2,1.0560000000000001E-4,{"$f":"CHOOSE(Ext_VCC, (Qg_Q1+Qg_Q2)*Fsw*'Design Regulator'!$G$102, (Qg_Q1+Qg_Q2)*Fsw*Vout, (Qg_Q1+Qg_Q2)*Fsw*Vin)","v":3.4079999999999999E-2},0.12233890909090907,0.11359999999999998,3.4185599999999997E-2,1.0872677954780887,0.49349920619723536,26.880000000000003,0.96112356046256753,4.252512287133702,2.3119438058248289,null,96.11235604625675,0.56204383356608578,0.43924320619723534,0.28350081914224678,0.15412958705498861,2.9687081495742378E-2,0.47342880619723532,9.2792046014658123]
["RdsonTopTc",{"$f":"RdsonTopTc*1000000","v":7000},"ppm","Drain to Source Resistance Temp Co",null,null,29,48,1,2.3199999999999998,2.3199999999999998,0.64444444444444426,0.2516071610127823,3.3227981704409832,3.9813990852204917,0.65860091477950822,0,2.5104745182515784,6.3024823067904953E-2,0.5,0.56587797179192179,0.95920920908344887,9.2008230679049559E-4,9.2008230679049559E-4,1.0893868483445317,1.1867637053460318E-3,1.1867637053460318E-3,1.2592655321832833,3.8057992333076343E-2,0.13363199999999997,1.1520000000000028E-2,0,0.18394505317252779,2.1718040027234609,8.490118727242163E-2,2.0787200000000002E-2,0.10663903423713494,2.0787200000000002E-2,0.16703999999999997,3.1512411533952477E-2,1.0560000000000001E-4,{"$f":"CHOOSE(Ext_VCC, (Qg_Q1+Qg_Q2)*Fsw*'Design Regulator'!$G$102, (Qg_Q1+Qg_Q2)*Fsw*Vout, (Qg_Q1+Qg_Q2)*Fsw*Vin)","v":3.4079999999999999E-2},0.12233890909090907,0.11359999999999998,3.4185599999999997E-2,1.1120941167476734,0.51259688740966269,27.839999999999996,0.9615884739714089,4.4128717975879166,2.4264335135570239,null,96.158847397140889,0.56587797179192179,0.45762408740966271,0.29419145317252776,0.16176223423713493,3.1512411533952477E-2,0.49180968740966269,9.6394698732293893]
["QgTop",{"$f":"Qg_Q1*1000000000","v":3},"nC","Gate Charge Of Top FET",null,null,30,48,1,2.4,2.4,0.66666666666666652,0.25166258312915646,3.3232784286273134,4.0616392143136562,0.73836078568634322,0,2.5846369750601923,6.680348292848301E-2,0.5,0.5698489143059754,0.95934784768002801,9.2034829284830223E-4,9.2034829284830223E-4,1.1216506391878101,1.2581001563904228E-3,1.2581001563904228E-3,1.2966085406091747,4.03486489819357E-2,0.13823999999999997,1.1520000000000028E-2,0,0.19091749158143043,2.2358789290271615,8.9984782534817634E-2,2.1504000000000002E-2,0.1125522211852702,2.1504000000000002E-2,0.17280000000000001,3.3401741464241505E-2,1.0560000000000001E-4,{"$f":"CHOOSE(Ext_VCC, (Qg_Q1+Qg_Q2)*Fsw*'Design Regulator'!$G$102, (Qg_Q1+Qg_Q2)*Fsw*Vout, (Qg_Q1+Qg_Q2)*Fsw*Vin)","v":3.4079999999999999E-2},0.12233890909090907,0.11359999999999998,3.4185599999999997E-2,1.1373884169861563,0.53195931276670072,28.799999999999997,0.96200776095950935,4.5744823737214562,2.5436433177790532,null,96.200776095950928,0.5698489143059754,0.47626971276670066,0.30496549158143044,0.16957622118527022,3.3401741464241505E-2,0.51045531276670064,10.004924130227334]
["QgdTop",{"$f":"Qgd_Q1*1000000000","v":0.7},"nC","Gate to Drain Charge",null,null,31,48,1,2.48,2.48,0.68888888888888877,0.25171800543028056,3.3237585784089037,4.1418792892044518,0.81812071079554816,0,2.6591378785793651,7.0710142572955659E-2,0.5,0.57395690855975512,0.95948645498285423,9.2061425729556478E-4,9.2061425729556478E-4,1.1540659960715038,1.3318683232885122E-3,1.3318683232885122E-3,1.3341295308985242,4.2717638525172387E-2,0.142848,1.1520000000000028E-2,0,0.19797361990610263,2.3002418681695302,9.5240027737440905E-2,2.2220800000000002E-2,0.11864732506308899,2.2220800000000002E-2,0.17855999999999997,3.5355071286477829E-2,1.0560000000000001E-4,{"$f":"CHOOSE(Ext_VCC, (Qg_Q1+Qg_Q2)*Fsw*'Design Regulator'!$G$102, (Qg_Q1+Qg_Q2)*Fsw*Vout, (Qg_Q1+Qg_Q2)*Fsw*Vin)","v":3.4079999999999999E-2},0.12233890909090907,0.11359999999999998,3.4185599999999997E-2,1.1631518073960088,0.5515873449691916,29.759999999999998,0.9623857291572131,4.7373482985915398,2.6635818759463348,null,96.238572915721306,0.57395690855975512,0.49518094496919163,0.31582321990610263,0.17757212506308898,3.5355071286477829E-2,0.52936654496919167,10.375584281396158]
["QgsTop",{"$f":"Qgs_Q1*1000000000","v":0.7},"nC",null,null,null,32,{"$f":"Vin","v":48},{"$f":"MODE","v":1},2.56,{"$f":"Iout*G41/100/Number_of_Phases","v":2.56},{"$f":"Vout*K41/(Vin*Efficiency)","v":0.71111111111111103},{"$f":"(Vout+(Rdson2+Rs+Rdcr)*K41)/(Vin+(Rs+Rdson2-Rdson1)*K41)","v":0.25177342791615553},{"$f":"(Vin-(Rdson1+Rdcr)*K41-Vout)*M41/(Fsw*Lf)","v":3.3242386197852123},4.222119309892606,0.89788069010739391,{"$f":"IF(MIN(Vin, -P41/(Coss_Q1+Coss_Q2)*0.00000002)<0, 0, MIN(Vin, -P41/(Coss_Q1+Coss_Q2)*0.00000002))","v":0},2.7339495606367645,{"$f":"R41^2*Rdcr","v":7.4744802001059582E-2},{"$f":"Core_Loss_Ch1","v":0.5},{"$f":"(T41+S41*(1+Ltc*(Ta-25)))/(1-S41*Ltc*ThetaCa)","v":0.57820221078197753},0.95962503099177121,9.2088020010595785E-4,9.2088020010595785E-4,1.1866209402561261,1.4080692558543326E-3,1.4080692558543326E-3,1.3718146747546145,{"$f":"Rdson1*AB41^2","v":4.5165012044930612E-2},{"$f":"(Vin*K41/2)*Fsw*(Tr_buck+Tf_buck)","v":0.147456},{"$f":"(0.5*Coss_Q1*(Vin-Q41)^2-0.5*Coss_Q2*(Vin-Q41)^2+(Qoss_Q2*(Vin-Q41)/Vin)*Vin)*Fsw","v":1.1520000000000028E-2},{"$f":"IF(K41>N41/2,0,ABS(K41-N41/2)*Vsd_Q1*Deadtime*Fsw)","v":0},{"$f":"(AF41+AE41+AD41+AC41*(1+RdsonTopTc*Ta-RdsonTopTc*25))/(1-AC41*RdsonTopTc*ThetaJA_Q1)","v":0.20511372826573945},{"$f":"SQRT((1-M41))*SQRT(K41^2+(N41^2)/12)","v":2.3648688543413665},{"$f":"Rdson2*AH41^2","v":0.10066688456820924},{"$f":"IF(K41<N41/2,Deadtime*Fsw*IF(VfdSky_Q2>0,0,Vsd_Q2)*(K41+N41/2),2*Deadtime*Fsw*IF(VfdSky_Q2>0,0,Vsd_Q2)*K41)","v":2.2937600000000002E-2},{"$f":"(AJ41+AI41*(1+RdsonBotTc*Ta-RdsonBotTc*25))/(1-AI41*RdsonBotTc*ThetaJA_Q2)","v":0.12492494408543277},{"$f":"2*Deadtime*Fsw*IF(VfdSky_Q2>0,VfdSky_Q2,Vsd_Q2)*K41","v":2.2937600000000002E-2},{"$f":"IF(QrrSky_Q2>0,QrrSky_Q2,Qrr_Q2*K41/(Iout/Number_of_Phases))*Fsw*Vin","v":0.18432000000000001},{"$f":"Rs*R41^2","v":3.7372401000529791E-2},{"$f":"Iq*Vin","v":1.0560000000000001E-4},{"$f":"CHOOSE(Ext_VCC, (Qg_Q1+Qg_Q2)*Fsw*'Design Regulator'!$G$102, (Qg_Q1+Qg_Q2)*Fsw*Vout, (Qg_Q1+Qg_Q2)*Fsw*Vin)","v":3.4079999999999999E-2},0.12233890909090907,{"$f":"(Qg_Q1+Qg_Q2)*Fsw*(Vin-VCC)","v":0.11359999999999998},{"$f":"SUM(AO41:AP41)","v":3.4185599999999997E-2},{"$f":" SUM(U41,X41,AA41,AG41,AK41,AL41,AM41,AS41,AN41)","v":1.1893854335896399},{"$f":" SUM(AG41,AK41,AL41,AM41,AS41)","v":0.57148187235117232},{"$f":"Vout*K41","v":30.72},0.96272615666431405,{"$f":"ThetaJA_Q1*BD41","v":4.9014739239860914},{"$f":"ThetaJA_Q2*BE41","v":2.7862581612814918},null,96.272615666431406,{"$f":"U41","v":0.57820221078197753},{"$f":"AG41+AK41+AM41","v":0.51435867235117227},{"$f":"AG41+AM41*0.66","v":0.32676492826573944},{"$f":"AK41+AM41*0.33","v":0.18575054408543279},{"$f":"AN41","v":3.7372401000529791E-2},0.54854427235117231,10.751467738082978]
["RGateTop",{"$f":"Rgate1","v":3.5},"W","Gate Resistance",null,null,33,48,1,{"$f":"Iout*G42/100","v":2.64},2.64,0.73333333333333328,0.25182885058678228,3.3247185527556957,4.3023592763778478,0.97764072362215226,0,2.8090471909978945,7.8907461212531615E-2,0.5,0.58258508601877357,0.95976357570662196,9.2114612125316069E-4,9.2114612125316069E-4,1.2193047213215666,1.4867040034370633E-3,1.4867040034370633E-3,1.4096515619071592,4.7690820623695049E-2,0.152064,1.1520000000000028E-2,0,0.21233811139582107,2.4297383800042889,0.10626531471478559,2.3654400000000003E-2,0.13138569767863398,2.3654400000000003E-2,{"$f":"IF(QrrSky_Q2>0,QrrSky_Q2,Qrr_Q2*K42/(Iout/Number_of_Phases))*Fsw*Vin","v":0.19008},3.9453730606265808E-2,1.0560000000000001E-4,{"$f":"CHOOSE(Ext_VCC, (Qg_Q1+Qg_Q2)*Fsw*'Design Regulator'!$G$102, (Qg_Q1+Qg_Q2)*Fsw*Vout, (Qg_Q1+Qg_Q2)*Fsw*Vin)","v":3.4079999999999999E-2},0.12233890909090907,0.11359999999999998,3.4185599999999997E-2,1.2160904758241846,0.59164380907445513,31.68,0.96303237077007964,5.066863670937316,2.9116814651795093,null,96.303237077007964,0.58258508601877357,0.53380380907445502,0.33779091139582107,0.19411209767863397,3.9453730606265808E-2,0.56798940907445505,11.132592417859319]
["GfsTop",{"$f":"Gfs_Q1","v":71},"S","Transconductance of Top FET",null,null,34,48,1,2.72,2.72,0.75555555555555554,0.25188427344216169,3.3251983773198122,4.3825991886599063,1.0574008113400941,0,2.8844084351407067,8.3198120207108595E-2,0.5,0.58710580817533764,0.95990208912725017,9.2141202071085939E-4,9.2141202071085939E-4,1.252107669060859,1.5677736149210177E-3,1.5677736149210177E-3,1.4476290291411396,5.0295115344290833E-2,0.15667200000000001,1.1520000000000028E-2,0,0.21964706868300785,2.4948310994331342,0.11203527986457734,2.4371200000000006E-2,0.13803022664715681,2.4371200000000006E-2,0.19584000000000001,4.1599060103554297E-2,1.0560000000000001E-4,{"$f":"CHOOSE(Ext_VCC, (Qg_Q1+Qg_Q2)*Fsw*'Design Regulator'!$G$102, (Qg_Q1+Qg_Q2)*Fsw*Vout, (Qg_Q1+Qg_Q2)*Fsw*Vin)","v":3.4079999999999999E-2},0.12233890909090907,0.11359999999999998,3.4185599999999997E-2,1.2432681492446884,0.61207409533016466,32.64,0.96330731310307782,5.2335220302451182,3.0398613997073518,null,96.330731310307783,0.58710580817533764,0.55351729533016469,0.34890146868300786,0.2026574266471568,4.1599060103554297E-2,0.58770289533016473,11.51897674847123]
["VthTop",{"$f":"Vth_Q1","v":1.8},"V","Threshold Voltage of Top FET",null,null,35,48,1,2.8,2.8,0.77777777777777757,0.25193969648229481,3.3256780934770211,4.4628390467385106,1.1371609532614892,0,2.9600131584931755,8.7616778984527438E-2,0.5,0.59176466005902706,0.96004057125349984,9.2167789845274632E-4,9.2167789845274632E-4,1.2850210654793317,1.651279138725637E-3,1.651279138725637E-3,1.4857370125334479,5.2977947289883559E-2,0.16127999999999998,1.1520000000000028E-2,0,0.22704090420069972,2.5601295725101356,0.11797674170473672,2.5088000000000003E-2,0.14485919334662289,2.5088000000000003E-2,0.20159999999999995,4.3808389492263719E-2,1.0560000000000001E-4,{"$f":"CHOOSE(Ext_VCC, (Qg_Q1+Qg_Q2)*Fsw*'Design Regulator'!$G$102, (Qg_Q1+Qg_Q2)*Fsw*Vout, (Qg_Q1+Qg_Q2)*Fsw*Vin)","v":3.4079999999999999E-2},0.12233890909090907,0.11359999999999998,3.4185599999999997E-2,1.2709197041357916,0.6327736975473226,33.599999999999994,0.9635535937991031,5.4014535630104961,3.170807900199343,null,96.355359379910311,0.59176466005902706,0.57350009754732256,0.36009690420069973,0.21138719334662287,4.3808389492263719E-2,0.6076856975473226,11.910639671927523]
["VspTop",{"$f":"Vsp_Q1","v":1.9126760563380283},"V",null,null,null,36,48,1,2.88,2.88,0.8,0.25199511970718241,3.3261577012267787,4.543078850613389,1.2169211493866106,0,3.0358431702662965,9.2163437544525162E-2,0.5,0.59656193342392971,0.96017902208521377,9.2194375445251743E-4,9.2194375445251743E-4,1.3180370339279106,1.7372216228054842E-3,1.7372216228054842E-3,1.5239664194678979,5.5739367543979318E-2,0.16588800000000001,1.1520000000000028E-2,0,0.23451992674526975,2.6256180428209115,0.12408966192216084,2.5804800000000003E-2,0.1518732818633107,2.5804800000000003E-2,0.20735999999999999,4.6081718772262581E-2,1.0560000000000001E-4,{"$f":"CHOOSE(Ext_VCC, (Qg_Q1+Qg_Q2)*Fsw*'Design Regulator'!$G$102, (Qg_Q1+Qg_Q2)*Fsw*Vout, (Qg_Q1+Qg_Q2)*Fsw*Vin)","v":3.4079999999999999E-2},0.12233890909090907,0.11359999999999998,3.4185599999999997E-2,1.2990464261820309,0.6537436086085805,34.56,0.96377353678781741,5.5706629011790465,3.3045312279496604,null,96.377353678781745,0.59656193342392971,0.59375320860858039,0.37137752674526975,0.22030208186331068,4.6081718772262581E-2,0.62793880860858042,12.307600648728178]
["VsdTop",{"$f":"Vsd_Q1","v":0.8},"V",null,null,null,37,48,1,2.96,2.96,0.82222222222222208,0.25205054311682557,3.3266372005685447,4.6233186002842723,1.2966813997157276,0,3.1118820010861397,9.6838095886838768E-2,0.5,0.60149792901690879,0.9603174416222362,9.2220958868387704E-4,9.2220958868387704E-4,1.3511484428626757,1.8256021146502331E-3,1.8256021146502331E-3,1.5623090175338854,5.8579427190424666E-2,0.17049599999999998,1.1520000000000028E-2,0,0.24208444987297781,2.6912822450304579,0.13037400220349127,2.6521600000000003E-2,0.15907319820022184,2.6521600000000003E-2,0.21311999999999998,4.8419047943419384E-2,1.0560000000000001E-4,{"$f":"CHOOSE(Ext_VCC, (Qg_Q1+Qg_Q2)*Fsw*'Design Regulator'!$G$102, (Qg_Q1+Qg_Q2)*Fsw*Vout, (Qg_Q1+Qg_Q2)*Fsw*Vin)","v":3.4079999999999999E-2},0.12233890909090907,0.11359999999999998,3.4185599999999997E-2,1.327649636736862,0.67498484807319969,35.519999999999996,0.96396921785173495,5.741154748094667,3.4410419730033275,null,96.39692178517349,0.60149792901690879,0.61427764807319962,0.38274364987297782,0.22940279820022183,4.8419047943419384E-2,0.64846324807319966,12.709879662234714]
["θJATop",{"$f":"ThetaJA_Q1","v":15},"°C/W","Junction to Ambient Resistance",null,null,38,48,1,3.04,3.04,0.84444444444444444,0.25210596671122504,3.3271165915017749,4.7035582957508879,1.3764417042491126,0,3.1881147095298394,0.10164075401120533,0.5,0.6065729566251401,0.96045582986441003,9.2247540112053248E-4,9.2247540112053248E-4,1.384348822112643,1.9164216612846622E-3,1.9164216612846622E-3,1.6007573378639484,6.14981773134066E-2,0.17510400000000001,1.1520000000000028E-2,0,0.24973479193757653,2.7571092372982355,0.13682972423511464,2.7238400000000003E-2,0.16645967046981316,2.7238400000000003E-2,0.21887999999999999,5.0820377005602664E-2,1.0560000000000001E-4,{"$f":"CHOOSE(Ext_VCC, (Qg_Q1+Qg_Q2)*Fsw*'Design Regulator'!$G$102, (Qg_Q1+Qg_Q2)*Fsw*Vout, (Qg_Q1+Qg_Q2)*Fsw*Vin)","v":3.4079999999999999E-2},0.12233890909090907,0.11359999999999998,3.4185599999999997E-2,1.3567306931005378,0.69649846240738966,36.480000000000004,0.96414249676841302,5.9129338790636483,3.5803510570471975,null,96.414249676841308,0.6065729566251401,0.63507446240738963,0.39419559193757653,0.23869007046981316,5.0820377005602664E-2,0.66926006240738967,13.117497223184838]
["Low-side FET","Input Value","Units","Description",null,null,39,48,1,3.12,3.12,0.86666666666666659,0.25216139049038189,3.3275958740259295,4.7837979370129649,1.4562020629870354,0,3.2645277134275026,0.10657141191736198,0.5,0.61178733512515782,0.96059418681157926,9.2274119173619933E-4,9.2274119173619933E-4,1.4176322898652696,2.0096813092686477E-3,2.0096813092686477E-3,1.6393045908434847,6.4495668997452599E-2,0.17971200000000001,1.1520000000000028E-2,0,0.25747127612861465,2.8230872551473984,0.14345678970316209,2.7955200000000003E-2,0.17403344909349383,2.7955200000000003E-2,0.22463999999999995,5.3285705958680991E-2,1.0560000000000001E-4,{"$f":"CHOOSE(Ext_VCC, (Qg_Q1+Qg_Q2)*Fsw*'Design Regulator'!$G$102, (Qg_Q1+Qg_Q2)*Fsw*Vout, (Qg_Q1+Qg_Q2)*Fsw*Vin)","v":3.4079999999999999E-2},0.12233890909090907,0.11359999999999998,3.4185599999999997E-2,1.3862909888069523,0.71828552522210853,37.44,0.96429504458186333,6.0860051419292187,3.7224697364024073,null,96.429504458186329,0.61178733512515782,0.65614472522210843,0.40573367612861461,0.24816464909349381,5.3285705958680991E-2,0.69033032522210847,13.530474374353327]
["RdsonBot",{"$f":"Rdson2*1000","v":18},"mW","Drain-Source Resistance of Low-side FET",null,null,40,48,1,3.2,3.2,0.88888888888888895,0.25221681445429694,3.3280750481404637,4.8640375240702323,1.5359624759297683,0,3.3411086424276295,0.11163006960504598,0.5,0.61714139253341882,0.96073251246358682,9.2300696050459598E-4,9.2300696050459598E-4,1.4509934888541558,2.1053821046971553E-3,2.1053821046971553E-3,1.6779445924432708,6.7571953327430739E-2,0.18432000000000001,1.1520000000000028E-2,0,0.26529423051045009,2.8892055837539465,0.15025516029350969,2.8672000000000003E-2,0.18179530700799457,2.8672000000000003E-2,0.23039999999999999,5.5815034802522992E-2,1.0560000000000001E-4,{"$f":"CHOOSE(Ext_VCC, (Qg_Q1+Qg_Q2)*Fsw*'Design Regulator'!$G$102, (Qg_Q1+Qg_Q2)*Fsw*Vout, (Qg_Q1+Qg_Q2)*Fsw*Vin)","v":3.4079999999999999E-2},0.12233890909090907,0.11359999999999998,3.4185599999999997E-2,1.4163319539195882,0.74034713751844472,38.400000000000006,0.96442836684306477,6.2603734576567511,3.8674096051199185,null,96.442836684306471,0.61714139253341882,0.67748953751844465,0.41735823051045007,0.25782730700799456,5.5815034802522992E-2,0.71167513751844469,13.948832695361517]
["RdsonBotTc",{"$f":"RdsonBotTc*1000000","v":7000},"ppm","Drain To Source Resitance Temp Co",null,null,41,48,1,3.28,3.28,0.91111111111111098,0.25227223860297121,3.3285541138448385,4.9442770569224193,1.6157229430775806,0,3.4178462088571875,0.1168167270739945,0.5,0.62263546605840525,0.96087080682027692,9.2327270739944994E-4,9.2327270739944994E-4,1.4844275304642622,2.2035250932002284E-3,2.2035250932002284E-3,1.7166716996918456,7.0727081388549357E-2,0.18892800000000001,1.1520000000000028E-2,0,0.27320398806197965,2.9554544460838099,0.15722479769177808,2.93888E-2,0.18974603987871655,2.93888E-2,0.23615999999999995,5.840836353699725E-2,1.0560000000000001E-4,{"$f":"CHOOSE(Ext_VCC, (Qg_Q1+Qg_Q2)*Fsw*'Design Regulator'!$G$102, (Qg_Q1+Qg_Q2)*Fsw*Vout, (Qg_Q1+Qg_Q2)*Fsw*Vin)","v":3.4079999999999999E-2},0.12233890909090907,0.11359999999999998,3.4185599999999997E-2,1.4468550553366983,0.76268442794069613,39.36,0.96454382349792278,6.4360438209296937,4.0151825981807479,null,96.454382349792283,0.62263546605840525,0.6991100279406961,0.42906958806197959,0.26767883987871655,5.840836353699725E-2,0.73329562794069614,14.372594307637645]
["QgBot",{"$f":"Qg_Q2*1000000000","v":4.0999999999999996},"nC","Gate Charge Of Top FET",null,null,42,48,1,3.36,3.36,0.93333333333333324,0.25232766293640557,3.3290330711385088,5.024516535569254,1.6954834644307455,0,3.4947300943555697,0.12213138432394489,0.5,0.62826990215427858,0.96100906988149237,9.235384323944911E-4,9.235384323944911E-4,1.5179299456638271,2.3041113199429894E-3,2.3041113199429894E-3,1.7554807540286215,7.3961104266357547E-2,0.19353599999999999,1.1520000000000028E-2,0,0.28120088671709648,3.0218249046941144,0.16436566358333266,3.0105600000000003E-2,0.19788646632017468,3.0105600000000003E-2,0.24191999999999997,6.1065692161972447E-2,1.0560000000000001E-4,{"$f":"CHOOSE(Ext_VCC, (Qg_Q1+Qg_Q2)*Fsw*'Design Regulator'!$G$102, (Qg_Q1+Qg_Q2)*Fsw*Vout, (Qg_Q1+Qg_Q2)*Fsw*Vin)","v":3.4079999999999999E-2},0.12233890909090907,0.11359999999999998,3.4185599999999997E-2,1.4778617971058596,0.78529855303727114,40.32,0.96464264597362281,6.6130213007564462,4.1658009948026198,null,96.464264597362288,0.62826990215427858,0.72100735303727115,0.44086808671709643,0.27772006632017465,6.1065692161972447E-2,0.75519295303727119,14.801781879530516]
["RGateBot",{"$f":"Rgate2","v":3},"W","Gate Resistance",null,null,43,48,1,3.44,3.44,0.95555555555555549,0.25238308745460086,3.3295119200209338,5.1047559600104666,1.7752440399895331,0,3.5717508501382702,0.12757404135463457,0.5,0.63404505657610188,0.96114730164707696,9.2380413546345726E-4,9.2380413546345726E-4,1.5514966418351086,2.4071418296256193E-3,2.4071418296256193E-3,1.7943670314666282,7.7274073046744635E-2,0.19814399999999999,1.1520000000000028E-2,0,0.28928526940588351,3.0883087753411407,0.17167771965328371,3.0822400000000003E-2,0.20621742812365224,3.0822400000000003E-2,0.24767999999999996,6.3787020677317285E-2,1.0560000000000001E-4,{"$f":"CHOOSE(Ext_VCC, (Qg_Q1+Qg_Q2)*Fsw*'Design Regulator'!$G$102, (Qg_Q1+Qg_Q2)*Fsw*Vout, (Qg_Q1+Qg_Q2)*Fsw*Vin)","v":3.4079999999999999E-2},0.12233890909090907,0.11359999999999998,3.4185599999999997E-2,1.5093537207480439,0.80819069752953565,41.28,0.96472595191321675,6.7913110410882522,4.3192774218547836,null,96.472595191321673,0.63404505657610188,0.7431826975295357,0.45275406940588347,0.28795182812365222,6.3787020677317285E-2,0.77736829752953573,15.236418631578902]
["VsdBot",{"$f":"Vsd_Q2","v":0.8},"V","Diode Forward Voltage of Bottom FET Body Diode",null,null,44,48,1,3.52,3.52,0.97777777777777775,0.25243851215755825,3.3299906604915734,5.184995330245787,1.8550046697542133,0,3.6488998090630127,0.13314469816580091,0.5,0.63996129443664584,0.96128550211687491,9.2406981658009241E-4,9.2406981658009241E-4,1.5851238647132173,2.5126176664833659E-3,2.5126176664833659E-3,1.8333261986521099,8.0666038815940685E-2,0.20275199999999999,1.1520000000000028E-2,0,0.29745748409655431,3.1548985508120375,0.17916092758648611,3.1539200000000003E-2,0.21473979049218847,3.1539200000000003E-2,0.25344,6.6572349082900453E-2,1.0560000000000001E-4,{"$f":"CHOOSE(Ext_VCC, (Qg_Q1+Qg_Q2)*Fsw*'Design Regulator'!$G$102, (Qg_Q1+Qg_Q2)*Fsw*Vout, (Qg_Q1+Qg_Q2)*Fsw*Vin)","v":3.4079999999999999E-2},0.12233890909090907,0.11359999999999998,3.4185599999999997E-2,1.5413324055913527,0.83136207458874278,42.24,0.96479475792759317,6.9709182614483147,4.4756248573828268,null,96.479475792759317,0.63996129443664584,0.76563727458874276,0.4647278840965543,0.29837499049218846,6.6572349082900453E-2,0.79982287458874279,15.67652834193936]
["QrrBot",{"$f":"Qrr_Q2*1000000000","v":29.999999999999996},"nC","Reverse Recovery Charge of Body Diode",null,null,45,48,1,3.6,3.6,1,0.25249393704527839,3.330469292549882,5.2652346462749406,1.9347653537250591,0,3.7261690079380649,0.13884335475718143,0.5,0.64601899026479837,0.96142367129072848,9.243354757181427E-4,9.243354757181427E-4,1.6188081647578005,2.6205398742865185E-3,2.6205398742865185E-3,1.872354274041508,8.4137052660516062E-2,0.20735999999999999,1.1520000000000028E-2,0,0.30571788383815007,3.2215873336286638,0.18681524906753957,3.2256000000000007E-2,0.22345444228302649,3.2256000000000007E-2,0.25919999999999999,6.9421677378590715E-2,1.0560000000000001E-4,{"$f":"CHOOSE(Ext_VCC, (Qg_Q1+Qg_Q2)*Fsw*'Design Regulator'!$G$102, (Qg_Q1+Qg_Q2)*Fsw*Vout, (Qg_Q1+Qg_Q2)*Fsw*Vin)","v":3.4079999999999999E-2},0.12233890909090907,0.11359999999999998,3.4185599999999997E-2,1.5737994691145702,0.85481392612117657,43.2,0.96484999066920396,7.1518482575722508,4.6348566342453976,null,96.484999066920395,0.64601899026479837,0.78837232612117658,0.47678988383815007,0.30899044228302652,6.9421677378590715E-2,0.82255792612117662,16.122135351975064]
["TrrBot",{"$f":"Trr_Q2*1000000000","v":40},"ns","Reverse Recovery Time of Body Diode",null,null,46,48,1,3.68,3.68,1.0222222222222221,0.25254936211776235,3.3309478161953194,5.3454739080976594,2.0145260919023404,0,3.8035511187377731,0.14467001112851366,0.5,0.65221852806559144,0.96156180916848188,9.2460111285136393E-4,9.2460111285136393E-4,1.6525463673798724,2.730909496340412E-3,2.730909496340412E-3,1.9114475935289388,8.7687165667381717E-2,0.21196799999999999,1.1520000000000028E-2,0,0.31406682680400383,3.2883687764671095,0.19464064578078827,3.2972800000000003E-2,0.23236229625765134,3.2972800000000003E-2,0.26495999999999997,7.233500556425683E-2,1.0560000000000001E-4,{"$f":"CHOOSE(Ext_VCC, (Qg_Q1+Qg_Q2)*Fsw*'Design Regulator'!$G$102, (Qg_Q1+Qg_Q2)*Fsw*Vout, (Qg_Q1+Qg_Q2)*Fsw*Vin)","v":3.4079999999999999E-2},0.12233890909090907,0.11359999999999998,3.4185599999999997E-2,1.6067565673006949,0.87854752306165518,44.160000000000004,0.9648924964796679,7.3341064020600575,4.7969864438647702,null,96.489249647966787,0.65221852806559144,0.81138912306165512,0.48894042680400385,0.31979909625765135,7.233500556425683E-2,0.84557472306165515,16.573264572008441]
["θJABot",{"$f":"ThetaJA_Q2","v":15},"°C/W","Junction to Ambient Resistance",null,null,47,48,1,3.76,3.76,1.0444444444444443,0.25260478737501102,3.331426231427344,5.4257131157136715,2.094286884286328,0,3.8810393875807954,0.15062466727953516,0.5,0.6585603013818675,0.96169991574997882,9.2486672795351636E-4,9.2486672795351636E-4,1.6863355465284531,2.8437275754854166E-3,2.8437275754854166E-3,1.9506027799523602,9.1316428923789023E-2,0.21657599999999999,1.1520000000000028E-2,0,0.32250467633598262,3.3552370293014531,0.2026370794103215,3.36896E-2,0.24146428933955541,3.36896E-2,0.27071999999999996,7.5312333639767581E-2,1.0560000000000001E-4,{"$f":"CHOOSE(Ext_VCC, (Qg_Q1+Qg_Q2)*Fsw*'Design Regulator'!$G$102, (Qg_Q1+Qg_Q2)*Fsw*Vout, (Qg_Q1+Qg_Q2)*Fsw*Vin)","v":3.4079999999999999E-2},0.12233890909090907,0.11359999999999998,3.4185599999999997E-2,1.6402053950006119,0.90256416567553799,45.12,0.96492304982099208,7.5176981450397387,4.9620283400933314,null,96.492304982099213,0.6585603013818675,0.83468896567553796,0.5011798763359826,0.3308018893395554,7.5312333639767581E-2,0.868874565675538,17.029941487240546]
["Bottom Schottky","Input Value","Units","Std Units",null,null,48,48,1,3.84,3.84,1.0666666666666667,0.25266021281702533,3.331904538245412,5.5059522691227061,2.1740477308772936,0,3.9586275804877586,0.15670732320998368,0.5,0.6650447133576014,0.96183799103506218,9.2513232099836445E-4,9.2513232099836445E-4,1.7201730012114851,2.9589951540969278E-3,2.9589951540969278E-3,1.9898167159871998,9.5024893517330025E-2,0.22118399999999999,1.1520000000000028E-2,0,0.33103180098951729,3.4221866924199622,0.21080451163997305,3.4406400000000004E-2,0.25076138287986932,3.4406400000000004E-2,0.27647999999999995,7.8353661604991839E-2,1.0560000000000001E-4,{"$f":"CHOOSE(Ext_VCC, (Qg_Q1+Qg_Q2)*Fsw*'Design Regulator'!$G$102, (Qg_Q1+Qg_Q2)*Fsw*Vout, (Qg_Q1+Qg_Q2)*Fsw*Vin)","v":3.4079999999999999E-2},0.12233890909090907,0.11359999999999998,3.4185599999999997E-2,1.6741476863070752,0.92686518386938654,46.08,0.96494236066562411,7.7026290148427581,5.1299967431980402,null,96.494236066562408,0.6650447133576014,0.85827318386938656,0.51350860098951723,0.34199978287986932,7.8353661604991839E-2,0.8924587838693866,17.492192163839977]
["VfdSky",{"$f":"VfdSky_Q2","v":0},"V","Diode Forward Voltage",null,null,49,48,1,3.92,3.92,1.0888888888888888,0.25271563844380623,3.3323827366489831,5.5861913683244913,2.2538086316755086,0,4.036309935071845,0.16291797891959683,0.5,0.67167217680289715,0.96197603502357609,9.2539789195968049E-4,9.2539789195968049E-4,1.7540562345846722,3.0767132740853586E-3,3.0767132740853586E-3,2.0290865200045185,9.8812610535937137E-2,0.22579199999999999,1.1520000000000028E-2,0,0.33964857457943254,3.4892127745804831,0.21914290415332138,3.51232E-2,0.26025456293100607,3.51232E-2,0.28223999999999994,8.1458989459798417E-2,1.0560000000000001E-4,{"$f":"CHOOSE(Ext_VCC, (Qg_Q1+Qg_Q2)*Fsw*'Design Regulator'!$G$102, (Qg_Q1+Qg_Q2)*Fsw*Vout, (Qg_Q1+Qg_Q2)*Fsw*Vin)","v":3.4079999999999999E-2},0.12233890909090907,0.11359999999999998,3.4185599999999997E-2,1.7085852149391791,0.95145193751043866,47.04,0.96495108099228333,7.8889046186914875,5.3009064439650908,null,96.495108099228332,0.67167217680289715,0.8821431375104386,0.52592697457943249,0.35339376293100605,8.1458989459798417E-2,0.91632873751043864,17.960043255204599]
["QrrSky",{"$f":"QrrSky_Q2*1000000000","v":0},"nC","Diode Reverse Recovery Charge",null,null,50,48,1,4,4,1.1111111111111109,0.25277106425535462,3.3328608266375133,5.6664304133187571,2.3335695866812434,0,4.1140811174320859,0.16925663440811242,0.5,0.67844311426068216,0.96211404771536357,9.2566344081124088E-4,9.2566344081124088E-4,1.787982935292207,3.1968829768961363E-3,3.1968829768961363E-3,2.0684095245288843,0.10267963106788332,0.23039999999999999,1.1520000000000028E-2,0,0.34835537622658658,3.5563106556724531,0.22765221863368978,3.5840000000000004E-2,0.26994484052846718,3.5840000000000004E-2,0.28799999999999998,8.4628317204056211E-2,1.0560000000000001E-4,{"$f":"CHOOSE(Ext_VCC, (Qg_Q1+Qg_Q2)*Fsw*'Design Regulator'!$G$102, (Qg_Q1+Qg_Q2)*Fsw*Vout, (Qg_Q1+Qg_Q2)*Fsw*Vin)","v":3.4079999999999999E-2},0.12233890909090907,0.11359999999999998,3.4185599999999997E-2,1.7435197946374998,0.9763258167550537,48,0.96494981051128881,8.0765306433987973,5.474772607927008,null,96.494981051128875,0.67844311426068216,0.90630021675505379,0.53843537622658655,0.36498484052846719,8.4628317204056211E-2,0.94048581675505383,18.433522008399056]
["Ireverse",{"$f":"Ireverse","v":0},"mA","Reverse Leakage Current",null,null,51,48,1,4.08,4.08,1.1333333333333333,0.25282649025167137,3.3333388082104616,5.7466694041052309,2.4133305958947693,0,4.1919361836181173,0.17572328967526826,0.5,0.68535795807511501,0.96225202911026819,9.2592896752682842E-4,9.2592896752682842E-4,1.8219509607861808,3.3195053035096874E-3,3.3195053035096874E-3,2.1077832569805617,0.10662600620178203,0.23500799999999999,1.1520000000000028E-2,0,0.35715259040533393,3.6234760533387331,0.23633241676414635,3.6556800000000007E-2,0.27983325198096776,3.6556800000000007E-2,0.29375999999999997,8.7861644837634131E-2,1.0560000000000001E-4,{"$f":"CHOOSE(Ext_VCC, (Qg_Q1+Qg_Q2)*Fsw*'Design Regulator'!$G$102, (Qg_Q1+Qg_Q2)*Fsw*Vout, (Qg_Q1+Qg_Q2)*Fsw*Vin)","v":3.4079999999999999E-2},0.12233890909090907,0.11359999999999998,3.4185599999999997E-2,1.7789532795700875,1.0014882423863019,48.96,0.96493910172391395,8.2655128560800097,5.6516107797145159,null,96.493910172391395,0.68535795807511501,0.93074584238630176,0.55103419040533397,0.37677405198096775,8.7861644837634131E-2,0.9649314423863018,18.912656270771517]
["Controller","Input Value","Units","Std Units",null,null,52,48,1,4.16,4.16,1.1555555555555554,0.25288191643275754,3.3338166813672871,5.8269083406836435,2.4930916593163568,0,4.269870545119633,0.18231794472080232,0.5,0.69241715046173169,0.96238997920813407,9.2619447208023274E-4,9.2619447208023274E-4,1.8559583223880434,3.4445812944414404E-3,3.4445812944414404E-3,2.1472054224288377,0.11065178702658729,0.239616,1.1520000000000028E-2,0,0.36604060699182123,3.6907049930836284,0.24518346022750365,3.7273600000000004E-2,0.28992085916903926,3.7273600000000004E-2,0.29952000000000001,9.1158972360401158E-2,1.0560000000000001E-4,{"$f":"CHOOSE(Ext_VCC, (Qg_Q1+Qg_Q2)*Fsw*'Design Regulator'!$G$102, (Qg_Q1+Qg_Q2)*Fsw*Vout, (Qg_Q1+Qg_Q2)*Fsw*Vin)","v":3.4079999999999999E-2},0.12233890909090907,0.11359999999999998,3.4185599999999997E-2,1.8148875647495151,1.0269406661608604,49.92,0.96491946440440091,8.4558571048773192,5.8314368875355891,null,96.491946440440088,0.69241715046173169,0.95548146616086049,0.56372380699182123,0.38876245916903929,9.1158972360401158E-2,0.98966706616086053,19.397474496752867]
["θJA",30,"°C/W","Junction to Ambient Resistance",null,null,53,48,1,4.24,4.24,1.1777777777777778,0.25293734279861391,3.3342944461074451,5.9071472230537232,2.5728527769462777,0,4.3478799379059732,0.18904059954445249,0.5,0.69962114357934979,0.96252789800880378,9.2645995444524617E-4,9.2645995444524617E-4,1.8900031718867041,3.5721119897418026E-3,3.5721119897418026E-3,2.1866738881193664,0.11475702463159362,0.244224,1.1520000000000028E-2,0,0.37501982131312911,3.7579937814560287,0.25420531070631924,3.7990400000000007E-2,0.30020874985227941,3.7990400000000007E-2,0.30528,9.4520299772226243E-2,1.0560000000000001E-4,{"$f":"CHOOSE(Ext_VCC, (Qg_Q1+Qg_Q2)*Fsw*'Design Regulator'!$G$102, (Qg_Q1+Qg_Q2)*Fsw*Vout, (Qg_Q1+Qg_Q2)*Fsw*Vin)","v":3.4079999999999999E-2},0.12233890909090907,0.11359999999999998,3.4185599999999997E-2,1.8513245864611718,1.0526845711654085,50.88,0.96489136958003696,8.6475693196969363,6.0142672477841916,null,96.489136958003698,0.69962114357934979,0.98050857116540846,0.57650462131312907,0.40095114985227942,9.4520299772226243E-2,1.0146941711654085,19.888005754842009]
["Theta Ja",19.600000000000001,"°C/W","Junction to Ambient Resistance",null,null,54,48,1,4.32,4.32,1.2,0.25299276934924142,3.334772102430394,5.9873860512151973,2.6526139487848033,0,4.42596039460315,0.19589125414595671,0.5,0.70697039960375252,0.96266578551212123,9.2672541459566942E-4,9.2672541459566942E-4,1.9240837894946685,3.7020984289961637E-3,3.7020984289961637E-3,2.2261866695693255,0.11894177010643596,0.248832,1.1520000000000028E-2,0,0.38409063419727235,3.8253389819501624,0.26339792988289507,3.8707200000000004E-2,0.3106980379854189,3.8707200000000004E-2,0.31103999999999998,9.7945627072978353E-2,1.0560000000000001E-4,{"$f":"CHOOSE(Ext_VCC, (Qg_Q1+Qg_Q2)*Fsw*'Design Regulator'!$G$102, (Qg_Q1+Qg_Q2)*Fsw*Vout, (Qg_Q1+Qg_Q2)*Fsw*Vin)","v":3.4079999999999999E-2},0.12233890909090907,0.11359999999999998,3.4185599999999997E-2,1.8882663227030141,1.0787214721826912,51.84,0.9648552530736485,8.8406555129590849,6.2001185697812833,null,96.485525307364853,0.70697039960375252,1.0058286721826912,0.58937703419727239,0.41334123798541889,9.7945627072978353E-2,1.0400142721826913,20.384279734780751]
[null,null,null,null,null,null,55,48,1,4.4000000000000004,4.4000000000000004,1.2222222222222223,0.25304819608464107,3.335249650335594,6.0676248251677976,2.7323751748322032,0,4.504108219448697,0.20286990852505313,0.5,0.71446539080317772,0.9628036417179302,9.2699085250530857E-4,9.2699085250530857E-4,1.9581985730065503,3.8345416513248898E-3,3.8345416513248898E-3,2.2657419180507041,0.12320607454109002,0.25344,1.1520000000000028E-2,0,0.39325345202406997,3.892737393312478,0.27276127943927803,3.9424000000000008E-2,0.32138986404338338,3.9424000000000008E-2,0.31679999999999997,0.10143495426252656,1.0560000000000001E-4,{"$f":"CHOOSE(Ext_VCC, (Qg_Q1+Qg_Q2)*Fsw*'Design Regulator'!$G$102, (Qg_Q1+Qg_Q2)*Fsw*Vout, (Qg_Q1+Qg_Q2)*Fsw*Vin)","v":3.4079999999999999E-2},0.12233890909090907,0.11359999999999998,3.4185599999999997E-2,1.9257147936369878,1.1050529160674534,52.800000000000004,0.96481151866360104,9.0351217803610488,6.3890079606507513,null,96.481151866360108,0.71446539080317772,1.0314433160674534,0.60234145202406997,0.4259338640433834,0.10143495426252656,1.0656289160674535,20.886326754922088]
[null,null,null,null,null,null,56,48,1,4.4800000000000004,4.4800000000000004,1.2444444444444445,0.25310362300481382,3.3357270898225009,6.1478635449112513,2.81213645508875,0,4.5823199657103801,0.20997656268147979,0.5,0.72210659961563195,0.96294146662607394,9.2725626814797431E-4,9.2725626814797431E-4,1.9923460280240752,3.9694426953833092E-3,3.9694426953833092E-3,2.3053379093048361,0.12754998902587183,0.25804800000000006,1.1520000000000028E-2,0,0.40250868677689916,3.960186029982681,0.28229532105725974,4.0140800000000011E-2,0.33228539535553536,4.0140800000000011E-2,0.32256000000000001,0.1049882813407399,1.0560000000000001E-4,{"$f":"CHOOSE(Ext_VCC, (Qg_Q1+Qg_Q2)*Fsw*'Design Regulator'!$G$102, (Qg_Q1+Qg_Q2)*Fsw*Vout, (Qg_Q1+Qg_Q2)*Fsw*Vin)","v":3.4079999999999999E-2},0.12233890909090907,0.11359999999999998,3.4185599999999997E-2,1.9636720620523378,1.1316804821324347,53.760000000000005,0.96476054090861696,9.2309743016534878,6.5809529303330301,null,96.476054090861695,0.72210659961563195,1.0573540821324345,0.61539828677689923,0.43873019535553537,0.1049882813407399,1.0915396821324346,21.394177769795718]
["Outputs",null,null,null,null,null,57,48,1,4.5599999999999996,4.5599999999999996,1.2666666666666666,0.25315905010976042,3.3362044208905726,6.2281022104452859,2.8918977895547133,0,4.6605924152941629,0.21721121661497478,0.5,0.72989451872805666,0.9630792602363959,9.2752166149748358E-4,9.2752166149748358E-4,2.0265247591287157,4.1068025993616988E-3,4.1068025993616988E-3,2.3449730333509686,0.13197356465143784,0.262656,1.1520000000000028E-2,0,0.41185675609534433,4.0276821044310624,0.29200001641837614,4.0857600000000001E-2,0.34338582644928412,4.0857600000000001E-2,0.32831999999999995,0.10860560830748739,1.0560000000000001E-4,{"$f":"CHOOSE(Ext_VCC, (Qg_Q1+Qg_Q2)*Fsw*'Design Regulator'!$G$102, (Qg_Q1+Qg_Q2)*Fsw*Vout, (Qg_Q1+Qg_Q2)*Fsw*Vin)","v":3.4079999999999999E-2},0.12233890909090907,0.11359999999999998,3.4185599999999997E-2,2.0021402338410317,1.1586057825446285,54.72,0.96470266767813995,9.4282193414301645,6.7759713967392612,null,96.470266767813996,0.72989451872805666,1.0835625825446284,0.62854795609534431,0.4517314264492841,0.10860560830748739,1.1177481825446285,21.90786437787472]
["Design","Value","Units",null,null,null,58,48,1,4.6399999999999997,4.6399999999999997,1.2888888888888885,0.25321447739948194,3.3366816435392668,6.3083408217696331,2.9716591782303663,0,4.7389225603007752,0.22457387032527656,0.5,0.7378296511573692,0.96321702254873931,9.2778703252765864E-4,9.2778703252765864E-4,2.0607334618978013,4.2466224009852973E-3,4.2466224009852973E-3,2.3846457852686198,0.13647685250878541,0.26726399999999995,1.1520000000000028E-2,0,0.42129808332875818,4.0952230111836716,0.30187532720390864,4.1574400000000004E-2,0.35469237940326342,4.1574400000000004E-2,0.33407999999999993,0.11228693516263828,1.0560000000000001E-4,{"$f":"CHOOSE(Ext_VCC, (Qg_Q1+Qg_Q2)*Fsw*'Design Regulator'!$G$102, (Qg_Q1+Qg_Q2)*Fsw*Vout, (Qg_Q1+Qg_Q2)*Fsw*Vin)","v":3.4079999999999999E-2},0.12233890909090907,0.11359999999999998,3.4185599999999997E-2,2.0411214584855419,1.1858304627320215,55.679999999999993,0.96463822242342312,9.6268632499313718,6.9740816910489505,null,96.463822242342317,0.7378296511573692,1.1100704627320215,0.64179088332875811,0.46493877940326339,0.11228693516263828,1.1442560627320215,22.427418829547623]
["Dmax",{"$f":"D1_Vinmin","v":0.8},"index",null,null,null,59,48,1,4.72,4.72,1.3111111111111111,0.25326990487397927,3.337158757768043,6.3885793788840211,3.0514206211159784,0,4.8173075863195951,0.23206452381212322,0.5,0.74591251033340544,0.96335475356294842,9.2805238121232902E-4,9.2805238121232902E-4,2.0949709156726439,4.3889031375142764E-3,4.3889031375142764E-3,2.4243547568481336,0.14105990368925214,0.271872,1.1520000000000028E-2,0,0.43083309759074284,4.1628063123522994,0.31192121509488263,4.2291200000000001E-2,0.3662063042102735,4.2291200000000001E-2,0.33983999999999992,0.11603226190606161,1.0560000000000001E-4,{"$f":"CHOOSE(Ext_VCC, (Qg_Q1+Qg_Q2)*Fsw*'Design Regulator'!$G$102, (Qg_Q1+Qg_Q2)*Fsw*Vout, (Qg_Q1+Qg_Q2)*Fsw*Vin)","v":3.4079999999999999E-2},0.12233890909090907,0.11359999999999998,3.4185599999999997E-2,2.0806179295592098,1.2133562018010162,56.64,0.96456750621978971,9.8269124638611434,7.1753025631541014,null,96.456750621978969,0.74591251033340544,1.1368794018010162,0.65512749759074285,0.47835350421027345,0.11603226190606161,1.1710650018010162,22.952874035299921]
["Dprime",{"$f":"1-B68","v":0.19999999999999996},"index",null,null,null,60,48,1,4.8,4.8,1.333333333333333,0.25332533253325334,3.3376357635763569,6.4688178817881781,3.1311821182118216,0,4.8957448572740514,0.23968317707525322,0.5,0.75414362018378789,0.96349245327886601,9.2831770752532783E-4,9.2831770752532783E-4,2.1292359769982609,4.5336458457437391E-3,4.5336458457437391E-3,2.4640986290166058,0.14572276928451641,0.27647999999999995,1.1520000000000028E-2,0,0.44046223381457017,4.2304297245083511,0.32213764177206844,4.3008000000000005E-2,0.37792887915020429,4.3008000000000005E-2,0.34560000000000002,0.11984158853762661,1.0560000000000001E-4,{"$f":"CHOOSE(Ext_VCC, (Qg_Q1+Qg_Q2)*Fsw*'Design Regulator'!$G$102, (Qg_Q1+Qg_Q2)*Fsw*Vout, (Qg_Q1+Qg_Q2)*Fsw*Vin)","v":3.4079999999999999E-2},0.12233890909090907,0.11359999999999998,3.4185599999999997E-2,2.1206318852394577,1.2411847129647746,57.599999999999994,0.9644907996064993,10.028373507218552,7.379653187253064,null,96.449079960649925,0.75414362018378789,1.1639911129647746,0.66855823381457014,0.49197687915020427,0.11984158853762661,1.1981767129647747,23.484263574109587]
["Ipp",{"$f":"Iripple_Vinnom","v":3.3391291570749861},"A",null,null,null,61,48,1,4.88,4.88,1.3555555555555556,0.253380760377305,3.338112660963668,6.5490563304818341,3.2109436695181657,0,4.9742319016548171,0.24742983011440497,0.5,0.76252351522074979,0.96363012169633588,9.2858301144049522E-4,9.2858301144049522E-4,2.163527573663834,4.6808515620037159E-3,4.6808515620037159E-3,2.5038761649573518,0.15046550038659684,0.281088,1.1520000000000028E-2,0,0.45018593280955244,4.2980911067587861,0.33252456891598137,4.3724800000000001E-2,0.38986141117315082,4.3724800000000001E-2,0.35135999999999995,0.12371491505720249,1.0560000000000001E-4,{"$f":"CHOOSE(Ext_VCC, (Qg_Q1+Qg_Q2)*Fsw*'Design Regulator'!$G$102, (Qg_Q1+Qg_Q2)*Fsw*Vout, (Qg_Q1+Qg_Q2)*Fsw*Vin)","v":3.4079999999999999E-2},0.12233890909090907,0.11359999999999998,3.4185599999999997E-2,2.1611656088340996,1.2693177439827033,58.56,0.96440836424721599,10.231252992143286,7.587153167597263,null,96.440836424721596,0.76252351522074979,1.1914073439827031,0.68208353280955247,0.50581021117315084,0.12371491505720249,1.2255929439827031,24.021621702060983]
["Top FET","Value","Units",null,null,null,62,48,1,4.96,4.96,1.3777777777777775,0.2534361884061353,3.3385894499294331,6.6292947249647165,3.2907052750352834,0,5.0527663999963108,0.25530448292931679,0.5,0.77105274062993745,0.96376775881520149,9.2884829293167633E-4,9.2884829293167633E-4,2.1978446992813572,4.8305213221591587E-3,4.8305213221591587E-3,2.543686203850728,0.15528814808785266,0.28569600000000001,1.1520000000000028E-2,0,0.4600046413183782,4.3657884498989583,0.34308195820688064,4.4441600000000005E-2,0.40200523629294505,4.4441600000000005E-2,0.35711999999999994,0.12765224146465839,1.0560000000000001E-4,{"$f":"CHOOSE(Ext_VCC, (Qg_Q1+Qg_Q2)*Fsw*'Design Regulator'!$G$102, (Qg_Q1+Qg_Q2)*Fsw*Vout, (Qg_Q1+Qg_Q2)*Fsw*Vin)","v":3.4079999999999999E-2},0.12233890909090907,0.11359999999999998,3.4185599999999997E-2,2.2022214293210096,1.2977570776113232,59.519999999999996,0.96432044443113896,10.435557619775672,7.797822544394176,null,96.432044443113895,0.77105274062993745,1.2191298776113231,0.69570384131837815,0.51985483629294504,0.12765224146465839,1.2533154776113231,24.564983361181934]
["Tr",{"$f":"(Qgd_Q1+Qgs_Q1/2)*(RdsonDRT+Rgate1)/(VCC-Vsp_Q1)*1000000000","v":1.1211823229986118},"ns","Turn on of MOSFET -> Rise time of current",null,null,63,48,1,5.04,5.04,1.4,0.25349161661974512,3.3390661304731113,6.7095330652365561,3.3704669347634444,0,5.1313461734687831,0.26330713551972723,0.5,0.77973185236122522,0.96390536463530652,9.2911355197272314E-4,9.2911355197272314E-4,2.2321864083471881,4.9826561616099201E-3,4.9826561616099201E-3,2.5835276551724768,0.16019076348098391,0.29030400000000001,1.1520000000000028E-2,0,0.46991881207543013,4.4335198665317517,0.35380977132477098,4.5158400000000008E-2,0.41436171999133775,4.5158400000000008E-2,0.36287999999999998,0.13165356775986362,1.0560000000000001E-4,{"$f":"CHOOSE(Ext_VCC, (Qg_Q1+Qg_Q2)*Fsw*'Design Regulator'!$G$102, (Qg_Q1+Qg_Q2)*Fsw*Vout, (Qg_Q1+Qg_Q2)*Fsw*Vin)","v":3.4079999999999999E-2},0.12233890909090907,0.11359999999999998,3.4185599999999997E-2,2.243801721901439,1.3265045320667681,60.480000000000004,0.96422726843232831,10.641294181131451,8.0116817998700665,null,96.422726843232837,0.77973185236122522,1.247160532066768,0.70941961207543014,0.53411211999133779,0.13165356775986362,1.2813461320667681,25.114384188508655]
["Tf",{"$f":"(Qgd_Q1+Qgs_Q1/2)*(RdsonDRT2+Rgate1)/(Vsp_Q1)*1000000000","v":2.4703608247422673},"ns","Turn off of MOSFET -> Fall time of current",null,null,64,{"$f":"Vin","v":48},{"$f":"MODE","v":1},5.12,{"$f":"Iout*G73/100/Number_of_Phases","v":5.12},{"$f":"Vout*K73/(Vin*Efficiency)","v":1.4222222222222221},{"$f":"(Vout+(Rdson2+Rs+Rdcr)*K73)/(Vin+(Rs+Rdson2-Rdson1)*K73)","v":0.25354704501813524},{"$f":"(Vin-(Rdson1+Rdcr)*K73-Vout)*M73/(Fsw*Lf)","v":3.3395427025941582},6.7897713512970794,3.4502286487029208,{"$f":"IF(MIN(Vin, -P73/(Coss_Q1+Coss_Q2)*0.00000002)<0, 0, MIN(Vin, -P73/(Coss_Q1+Coss_Q2)*0.00000002))","v":0},5.2099691734728619,{"$f":"R73^2*Rdcr","v":0.27143778788537498},{"$f":"Core_Loss_Ch1","v":0.5},{"$f":"(T73+S73*(1+Ltc*(Ta-25)))/(1-S73*Ltc*ThetaCa)","v":0.78856141722156514},0.96404293915649386,9.293787885374914E-4,9.293787885374914E-4,2.2665518117375476,5.1372571152907588E-3,5.1372571152907588E-3,2.6233994934930558,{"$f":"Rdson1*AB73^2","v":0.16517339765903091},{"$f":"(Vin*K73/2)*Fsw*(Tr_buck+Tf_buck)","v":0.29491200000000001},{"$f":"(0.5*Coss_Q1*(Vin-Q73)^2-0.5*Coss_Q2*(Vin-Q73)^2+(Qoss_Q2*(Vin-Q73)/Vin)*Vin)*Fsw","v":1.1520000000000028E-2},{"$f":"IF(K73>N73/2,0,ABS(K73-N73/2)*Vsd_Q1*Deadtime*Fsw)","v":0},{"$f":"(AF73+AE73+AD73+AC73*(1+RdsonTopTc*Ta-RdsonTopTc*25))/(1-AC73*RdsonTopTc*ThetaJA_Q1)","v":0.47992890386609638},{"$f":"SQRT((1-M73))*SQRT(K73^2+(N73^2)/12)","v":4.5012835820549988},{"$f":"Rdson2*AH73^2","v":0.3647079699494018},{"$f":"IF(K73<N73/2,Deadtime*Fsw*IF(VfdSky_Q2>0,0,Vsd_Q2)*(K73+N73/2),2*Deadtime*Fsw*IF(VfdSky_Q2>0,0,Vsd_Q2)*K73)","v":4.5875200000000005E-2},{"$f":"(AJ73+AI73*(1+RdsonBotTc*Ta-RdsonBotTc*25))/(1-AI73*RdsonBotTc*ThetaJA_Q2)","v":0.42693225763306519},{"$f":"2*Deadtime*Fsw*IF(VfdSky_Q2>0,VfdSky_Q2,Vsd_Q2)*K73","v":4.5875200000000005E-2},{"$f":"IF(QrrSky_Q2>0,QrrSky_Q2,Qrr_Q2*K73/(Iout/Number_of_Phases))*Fsw*Vin","v":0.36864000000000002},{"$f":"Rs*R73^2","v":0.13571889394268749},{"$f":"Iq*Vin","v":1.0560000000000001E-4},{"$f":"CHOOSE(Ext_VCC, (Qg_Q1+Qg_Q2)*Fsw*'Design Regulator'!$G$102, (Qg_Q1+Qg_Q2)*Fsw*Vout, (Qg_Q1+Qg_Q2)*Fsw*Vin)","v":3.4079999999999999E-2},{"$f":"(Vin-VCC)*Fsw*(Qg_Q1+Qg_Q2)+(RdsonDRT+RdsonDRT2)*Fsw*Qg_Q1*VCC/(RdsonDRT+2*Rgate1+RdsonDRT2)+(RdsonDRB+RdsonDRB2)*Fsw*Qg_Q2*VCC/(RdsonDRB+2*Rgate2+RdsonDRB2)","v":0.12233890909090907},{"$f":"(Qg_Q1+Qg_Q2)*Fsw*(Vin-VCC)","v":0.11359999999999998},{"$f":"SUM(AO73:AP73)","v":3.4185599999999997E-2},{"$f":" SUM(U73,X73,AA73,AG73,AK73,AL73,AM73,AS73,AN73)","v":2.2859089085672424},{"$f":" SUM(AG73,AK73,AL73,AM73,AS73)","v":1.3555619614991616},{"$f":"Vout*K73","v":61.44},0.96412904974259339,{"$f":"ThetaJA_Q1*BD73","v":10.848469557991447},{"$f":"ThetaJA_Q2*BE73","v":8.2287518644959796},null,96.412904974259334,{"$f":"U73","v":0.78856141722156514},{"$f":"AG73+AK73+AM73","v":1.2755011614991616},{"$f":"AG73+AM73*0.66","v":0.72323130386609646},{"$f":"AK73+AM73*0.33","v":0.54858345763306526},{"$f":"AN73","v":0.13571889394268749},1.3096867614991616,25.669860525383569]
["Part Power","Value","Units",null,null,null,65,48,1,{"$f":"Iout*G74/100","v":5.2},5.2,1.4444444444444444,0.25360247360130683,3.3400191662920347,{"$f":"K74+N74/2","v":6.8700095831460173},{"$f":"K74-N74/2","v":3.5299904168539831},0,{"$f":"SQRT(K74^2+(N74^2)/12)","v":5.288633472136242},0.27969644002599842,0.5,0.79754201296990657,{"$f":"N74/SQRT(12)","v":0.96418048237860787},{"$f":"RCoutEsr*V74^2","v":9.2964400259984491E-4},{"$f":"W74","v":9.2964400259984491E-4},{"$f":"SQRT(M74*(1-M74))*SQRT(K74^2+(N74^2)/12)","v":2.3009400725945324},{"$f":"RCinEsr*Y74^2","v":5.2943252176713322E-3},{"$f":"Z74","v":5.2943252176713322E-3},{"$f":"SQRT(M74)*SQRT(K74^2+(N74^2)/12)","v":2.6633007537278393},0.17023610171537465,0.29952000000000006,1.1520000000000028E-2,0,0.49003538158709398,4.5690779264302952,0.37577651576026616,4.6592000000000008E-2,0.43971827489204623,4.6592000000000008E-2,0.37439999999999996,0.13984822001299921,1.0560000000000001E-4,{"$f":"CHOOSE(Ext_VCC, (Qg_Q1+Qg_Q2)*Fsw*'Design Regulator'!$G$102, (Qg_Q1+Qg_Q2)*Fsw*Vout, (Qg_Q1+Qg_Q2)*Fsw*Vin)","v":3.4079999999999999E-2},0.12233890909090907,0.11359999999999998,3.4185599999999997E-2,2.3285454586823171,1.3849312564791403,62.400000000000006,{"$f":"AV74/(AV74+AT74)","v":0.96402598819142826},11.057090723806409,8.4490541233806926,null,{"$f":"AW74*100","v":96.402598819142824},0.79754201296990657,1.3041536564791403,0.73713938158709391,0.56327027489204617,0.13984822001299921,{"$f":"BC74+AS74","v":1.3383392564791403},26.231449426991151]
["Power Dis",{"$f":"AS9","v":3.4185599999999997E-2},"W",null,null,null,66,48,1,5.28,5.28,1.4666666666666666,0.25365790236926061,3.3404955215661962,6.9502477607830979,3.6097522392169021,0,5.3673372536234067,0.28808309194133658,0.5,0.80667422841421332,0.96431799430149145,9.2990919413365124E-4,9.2990919413365124E-4,2.3353504025640723,5.4538615027561743E-3,5.4538615027561743E-3,2.7032305267936412,0.17537892674373665,0.30412800000000001,1.1520000000000028E-2,0,0.50023871630781835,4.6369013266560488,0.38701537043660322,4.7308800000000005E-2,0.45272122818897043,4.7308800000000005E-2,0.38016,0.14404154597066829,1.0560000000000001E-4,{"$f":"CHOOSE(Ext_VCC, (Qg_Q1+Qg_Q2)*Fsw*'Design Regulator'!$G$102, (Qg_Q1+Qg_Q2)*Fsw*Vout, (Qg_Q1+Qg_Q2)*Fsw*Vin)","v":3.4079999999999999E-2},0.12233890909090907,0.11359999999999998,3.4185599999999997E-2,2.3717138895785599,1.4146143444967889,63.36,0.9639182709648686,11.267164744617276,8.6726104228345573,null,96.391827096486864,0.80667422841421332,1.3331199444967887,0.75114431630781842,0.57817402818897046,0.14404154597066829,1.3673055444967888,{"$f":"BG75*$B$63","v":26.799188672137063}]
["Temp rise",{"$f":"B75*B62","v":1.0255679999999998},"°C",null,null,null,67,48,1,5.36,5.36,1.4888888888888889,0.25371333132199764,3.3409717684161002,7.0304858842080504,3.6895141157919502,0,5.4460788061790648,0.2965977436311279,0.5,0.81595866351060931,0.96445547492498784,9.3017436311278396E-4,9.3017436311278396E-4,2.369782058351507,5.6158670040847057E-3,5.6158670040847057E-3,2.743187955631937,0.18060192383817902,0.30873600000000007,1.1520000000000028E-2,0,0.5105393853327358,4.7047522998760156,0.39842449565739579,4.8025600000000009E-2,0.46594260514052865,4.8025600000000009E-2,0.38591999999999993,0.14829887181556395,1.0560000000000001E-4,{"$f":"CHOOSE(Ext_VCC, (Qg_Q1+Qg_Q2)*Fsw*'Design Regulator'!$G$102, (Qg_Q1+Qg_Q2)*Fsw*Vout, (Qg_Q1+Qg_Q2)*Fsw*Vin)","v":3.4079999999999999E-2},0.12233890909090907,0.11359999999999998,3.4185599999999997E-2,2.4154167671666351,1.4446131904732644,64.320000000000007,0.96380607353373116,11.478698779991035,8.8994430771079287,null,96.380607353373122,0.81595866351060931,1.3624019904732645,0.76524658533273571,0.59329620514052861,0.14829887181556395,1.3965875904732645,27.373116773275985]
["Current (switching)",{"$f":"(Qg_Q1+Qg_Q2)*Fsw+Iq","v":2.8421999999999996E-3},"A",null,null,null,68,48,1,5.44,5.44,1.5111111111111111,0.25376876045951874,3.3414479068412066,7.1107239534206039,3.7692760465793969,0,5.5248565148346733,0.30524039509511136,0.5,0.82539592946468721,0.96459292424894116,9.3043950951112353E-4,9.3043950951112353E-4,2.4042343385641947,5.7803427547312115E-3,5.7803427547312115E-3,2.7831722315634755,0.18590514409310438,0.31334400000000001,1.1520000000000028E-2,0,0.52093787226483401,4.7726294470621875,0.41000385310137216,4.8742400000000012E-2,0.47938392502056787,4.8742400000000012E-2,0.39168000000000003,0.15262019754755568,1.0560000000000001E-4,{"$f":"CHOOSE(Ext_VCC, (Qg_Q1+Qg_Q2)*Fsw*'Design Regulator'!$G$102, (Qg_Q1+Qg_Q2)*Fsw*Vout, (Qg_Q1+Qg_Q2)*Fsw*Vin)","v":3.4079999999999999E-2},0.12233890909090907,0.11359999999999998,3.4185599999999997E-2,2.4596567065618871,1.4749297972854021,65.28,0.96368956050047971,11.691700083972512,9.1295748753085189,null,96.36895605004797,0.82539592946468721,1.392001797285402,0.77944667226483411,0.60863832502056792,0.15262019754755568,1.426187397285402,27.953272986793881]
["Qrr Current",{"$f":"Qrr_Q2*Fsw","v":1.1999999999999999E-2},"A",null,null,null,69,48,1,5.52,5.52,1.5333333333333332,0.25382418978182486,3.341923936840971,7.1909619684204849,3.8490380315795143,0,5.6036688547149671,0.31401104633302551,0.5,0.83498664883500839,0.96473034227319432,9.3070463330255468E-4,9.3070463330255468E-4,2.4387065808138617,5.9472897873048365E-3,5.9472897873048365E-3,2.823182590942769,0.19128863860325582,0.31795199999999996,1.1520000000000028E-2,0,0.5314346670701503,4.8405314472173639,0.42175340444700404,4.9459200000000002E-2,0.49304673923343978,4.9459200000000002E-2,0.39743999999999996,0.15700552316651276,1.0560000000000001E-4,{"$f":"CHOOSE(Ext_VCC, (Qg_Q1+Qg_Q2)*Fsw*'Design Regulator'!$G$102, (Qg_Q1+Qg_Q2)*Fsw*Vout, (Qg_Q1+Qg_Q2)*Fsw*Vin)","v":3.4079999999999999E-2},0.12233890909090907,0.11359999999999998,3.4185599999999997E-2,2.5044363727257184,1.5055662063035902,66.239999999999995,0.96356888637289995,11.906176006052254,9.3630290885015963,null,96.356888637289998,0.83498664883500839,1.4219214063035901,0.79374506707015025,0.62420193923343981,0.15700552316651276,1.4561070063035901,28.539697323550367]
["Diode Current",{"$f":"Deadtime*Fsw*(Iripple_Vinnom/2)*(Vsd_Q2)/Vin","v":1.5582602733016601E-4},null,null,null,null,70,48,1,5.6,5.6,1.5555555555555551,0.253879619288917,3.3423998584148538,7.2711999292074267,3.9288000707925725,0,5.6825143848881687,0.32290969734460967,0.5,0.84473145563883434,0.96486772899759143,9.3096973446096961E-4,9.3096973446096961E-4,2.4731981590543035,6.1167091339495959E-3,6.1167091339495959E-3,2.863218312084304,0.19675245846371739,0.32255999999999996,1.1520000000000028E-2,0,0.54203026614339023,4.9084570520486448,0.43367311137250925,5.0176000000000005E-2,0.50693263179984294,5.0176000000000005E-2,0.40319999999999989,0.16145484867230483,1.0560000000000001E-4,{"$f":"CHOOSE(Ext_VCC, (Qg_Q1+Qg_Q2)*Fsw*'Design Regulator'!$G$102, (Qg_Q1+Qg_Q2)*Fsw*Vout, (Qg_Q1+Qg_Q2)*Fsw*Vin)","v":3.4079999999999999E-2},0.12233890909090907,0.11359999999999998,3.4185599999999997E-2,2.5497584811227827,1.5365244979432331,67.199999999999989,0.96344419627183586,12.122133992150852,9.5998294769976429,null,96.344419627183584,0.84473145563883434,1.4521628979432331,0.80814226614339013,0.63998863179984289,0.16145484867230483,1.4863484979432331,29.132430559687371]
["Total",{"$f":"SUM(B77:B79)","v":1.4998026027330164E-2},"A",null,null,null,71,48,1,5.68,5.68,1.5777777777777775,0.25393504898079605,3.3428756715623109,7.3514378357811552,4.0085621642188443,0,5.7613917427094181,0.33193634812960271,0.5,0.85463099546011445,0.96500508442197563,9.312348129602644E-4,9.312348129602644E-4,2.5077084811325938,6.2886018263443406E-3,6.2886018263443406E-3,2.9032787124352568,0.20229665476991335,0.32716800000000001,1.1520000000000028E-2,0,0.55272517237465768,4.9764050810681137,0.44576293555584967,5.0892800000000002E-2,0.52104321985544433,5.0892800000000002E-2,0.40895999999999988,0.16596817406480135,1.0560000000000001E-4,{"$f":"CHOOSE(Ext_VCC, (Qg_Q1+Qg_Q2)*Fsw*'Design Regulator'!$G$102, (Qg_Q1+Qg_Q2)*Fsw*Vout, (Qg_Q1+Qg_Q2)*Fsw*Vin)","v":3.4079999999999999E-2},0.12233890909090907,0.11359999999999998,3.4185599999999997E-2,2.5956257983943223,1.5678067922301018,68.16,0.96331562657943126,12.339581585619863,9.840000297831665,null,96.331562657943124,0.85463099546011445,1.482728392230102,0.82263877237465755,0.65600001985544432,0.16596817406480135,1.516913992230102,29.731514247710003]
[null,null,null,null,null,null,72,48,1,5.76,5.76,1.6,0.2539904788574629,3.3433513762828011,7.4316756881414001,4.0883243118585995,0,5.8402996386122465,0.3410909986877434,0.5,0.86468592555977697,0.9651424085461906,9.3149986877434188E-4,9.3149986877434188E-4,2.542236986534252,6.4629688957027545E-3,6.4629688957027545E-3,2.9433631459721408,0.20792127861760845,0.33177600000000002,1.1520000000000028E-2,0,0.56351989521731316,5.0443744170815981,0.45802283867473159,5.1609600000000005E-2,0.53538015416259677,5.1609600000000005E-2,0.41471999999999998,0.1705454993438717,1.0560000000000001E-4,{"$f":"CHOOSE(Ext_VCC, (Qg_Q1+Qg_Q2)*Fsw*'Design Regulator'!$G$102, (Qg_Q1+Qg_Q2)*Fsw*Vout, (Qg_Q1+Qg_Q2)*Fsw*Vin)","v":3.4079999999999999E-2},0.12233890909090907,0.11359999999999998,3.4185599999999997E-2,2.6420411430480355,1.5994152493799099,69.12,0.96318330553361109,12.558526428259697,10.083566312438952,null,96.318330553361108,0.86468592555977697,1.5136200493799099,0.8372350952173131,0.67223775416259679,0.1705454993438717,1.5478056493799099,30.336990727846239]
[null,null,null,null,null,null,73,48,1,5.84,5.84,1.622222222222222,0.25404590891891843,3.3438269725757803,7.5119134862878898,4.1680865137121099,0,5.9192368513075317,0.35037364901877105,0.5,0.87489691498834965,0.96527970137007912,9.317649018771092E-4,9.317649018771092E-4,2.5767831443048057,6.6398113727733615E-3,6.6398113727733615E-3,2.9834710008011109,0.21362638110290841,0.33638400000000002,1.1520000000000028E-2,0,0.57441495075697835,5.1123640020303638,0.47045278240660648,5.2326400000000002E-2,0.54994511963546766,5.2326400000000002E-2,0.42047999999999996,0.17518682450938552,1.0560000000000001E-4,{"$f":"CHOOSE(Ext_VCC, (Qg_Q1+Qg_Q2)*Fsw*'Design Regulator'!$G$102, (Qg_Q1+Qg_Q2)*Fsw*Vout, (Qg_Q1+Qg_Q2)*Fsw*Vin)","v":3.4079999999999999E-2},0.12233890909090907,0.11359999999999998,3.4185599999999997E-2,2.6890073861648318,1.631352070392446,70.08,0.96304735377390793,12.778976261354675,10.330552794532014,null,96.304735377390799,0.87489691498834965,1.5448400703924459,0.85193175075697836,0.68870351963546761,0.17518682450938552,1.5790256703924459,30.948903139691943]
[null,null,null,null,null,null,74,48,1,5.92,5.92,1.6444444444444442,0.25410133916516375,3.3443024604407099,7.5921512302203551,4.2478487697796448,0,5.9982022233534673,0.35978429912242477,0.5,0.88526464470095223,0.96541696289348589,9.3202991224248231E-4,9.3202991224248231E-4,2.6113464511319662,6.8191302878395149E-3,6.8191302878395149E-3,3.0236016969436958,0.21941201332225913,0.34099199999999996,1.1520000000000028E-2,0,0.58541086178170465,5.1803728331541619,0.4830527284286702,5.3043200000000006E-2,0.56473983587890497,5.3043200000000006E-2,0.42623999999999995,0.17989214956121238,1.0560000000000001E-4,{"$f":"CHOOSE(Ext_VCC, (Qg_Q1+Qg_Q2)*Fsw*'Design Regulator'!$G$102, (Qg_Q1+Qg_Q2)*Fsw*Vout, (Qg_Q1+Qg_Q2)*Fsw*Vin)","v":3.4079999999999999E-2},0.12233890909090907,0.11359999999999998,3.4185599999999997E-2,2.7365274521228562,1.6636194976606098,71.039999999999992,0.96290788484320133,13.000938926725569,10.580985538183574,null,96.290788484320132,0.88526464470095223,1.5763906976606097,0.86672926178170462,0.70539903587890496,0.17989214956121238,1.6105762976606097,31.567295434147955]
[null,null,null,null,null,null,75,48,1,6,6,1.6666666666666665,0.25415676959619954,3.3447778398770436,7.6723889199385216,4.3276110800614784,0,6.0771946570637656,0.36932294899844381,0.5,0.89578980767469718,0.96555419311625312,9.3229489984437866E-4,9.3229489984437866E-4,2.6459264295742178,7.0009266707193683E-3,7.0009266707193683E-3,3.0637546842915873,0.22527822637244746,0.34560000000000002,1.1520000000000028E-2,0,0.59650815785332634,5.2483999594472355,0.49582263841786334,5.3760000000000002E-2,0.57976605774138112,5.3760000000000002E-2,0.43199999999999994,0.18466147449922191,1.0560000000000001E-4,{"$f":"CHOOSE(Ext_VCC, (Qg_Q1+Qg_Q2)*Fsw*'Design Regulator'!$G$102, (Qg_Q1+Qg_Q2)*Fsw*Vout, (Qg_Q1+Qg_Q2)*Fsw*Vin)","v":3.4079999999999999E-2},0.12233890909090907,0.11359999999999998,3.4185599999999997E-2,2.7846043193391901,1.6962198155947075,72,0.96276500564944356,13.224422367799894,10.834890866120718,null,96.276500564944357,0.89578980767469718,1.6082742155947074,0.88162815785332627,0.72232605774138114,0.18466147449922191,1.6424598155947074,32.192212385656269]
[null,null,null,null,null,null,76,48,1,6.08,6.08,1.6888888888888889,0.25421220021202684,3.3452531108842409,7.7526265554421201,4.40737344455788,0,6.1562131107245408,0.37898959864656723,0.5,0.90647310902853773,0.96569139203822485,9.3255986465672449E-4,9.3255986465672449E-4,2.6805226264230435,7.1852015507658908E-3,7.1852015507658908E-3,3.1039294407157012,0.23122507135060044,0.35020800000000002,1.1520000000000028E-2,0,0.60770737538001618,5.3164444783816789,0.50876247405087072,5.4476800000000006E-2,0.59502557588236349,5.4476800000000006E-2,0.43775999999999998,0.18949479932328361,1.0560000000000001E-4,{"$f":"CHOOSE(Ext_VCC, (Qg_Q1+Qg_Q2)*Fsw*'Design Regulator'!$G$102, (Qg_Q1+Qg_Q2)*Fsw*Vout, (Qg_Q1+Qg_Q2)*Fsw*Vin)","v":3.4079999999999999E-2},0.12233890909090907,0.11359999999999998,3.4185599999999997E-2,2.8332410210296235,1.7291553512623796,72.960000000000008,0.96261881689102713,13.449434630700242,11.092295638235454,null,96.261881689102708,0.90647310902853773,1.6404929512623796,0.89662897538001618,0.73948637588236354,0.18949479932328361,1.6746785512623796,32.823699604742643]
[null,null,null,null,null,null,77,48,1,6.16,6.16,1.711111111111111,0.2542676310126466,3.3457282734617602,7.8328641367308798,4.4871358632691205,0,6.2352565950932162,0.3887842480665345,0.5,0.91731526614560421,0.96582855965924463,9.3282480665345102E-4,9.3282480665345102E-4,2.715134611187235,7.3719559568668578E-3,7.3719559568668578E-3,3.1441254703162032,0.23725259935418605,0.35481600000000002,1.1520000000000028E-2,0,0.6190090576900652,5.3845055328750808,0.52187219700412246,5.5193600000000009E-2,0.61052021735447493,5.5193600000000009E-2,0.44352000000000003,0.19439212403326725,1.0560000000000001E-4,{"$f":"CHOOSE(Ext_VCC, (Qg_Q1+Qg_Q2)*Fsw*'Design Regulator'!$G$102, (Qg_Q1+Qg_Q2)*Fsw*Vout, (Qg_Q1+Qg_Q2)*Fsw*Vin)","v":3.4079999999999999E-2},0.12233890909090907,0.11359999999999998,3.4185599999999997E-2,2.8824406459869318,1.7624284750445403,73.92,0.96246941344906933,13.675983865350979,11.353227260317123,null,96.246941344906929,0.91731526614560421,1.6730492750445403,0.91173225769006527,0.75688181735447491,0.19439212403326725,1.7072348750445403,33.461803550872993]
[null,null,null,null,null,null,78,48,1,6.24,6.24,1.7333333333333332,0.25432306199805976,3.3462033276090599,7.9131016638045306,4.5668983361954698,0,6.3143241701553858,0.39870689725808506,0.5,0.92831700879806778,0.96596569597915616,9.3308972580849556E-4,9.3308972580849556E-4,2.7497619746888695,7.5611909174448317E-3,7.5611909174448317E-3,3.1843423018014567,0.2433608614810128,0.35942400000000002,1.1520000000000028E-2,0,0.63041375510690389,5.4525823084815785,0.53515176895379335,5.5910400000000006E-2,0.62625184620081253,5.5910400000000006E-2,0.4492799999999999,0.19935344862904253,1.0560000000000001E-4,{"$f":"CHOOSE(Ext_VCC, (Qg_Q1+Qg_Q2)*Fsw*'Design Regulator'!$G$102, (Qg_Q1+Qg_Q2)*Fsw*Vout, (Qg_Q1+Qg_Q2)*Fsw*Vin)","v":3.4079999999999999E-2},0.12233890909090907,0.11359999999999998,3.4185599999999997E-2,2.9322063393780802,1.7960416013077163,74.88,0.96231688474955634,13.904078326603557,11.617713693012188,null,96.231688474955632,0.92831700879806778,1.7059456013077163,0.92693855510690382,0.77451424620081255,0.19935344862904253,1.7401312013077164,34.10657154563124]
[null,null,null,null,null,null,79,48,1,6.32,6.32,1.7555555555555555,0.25437849316826716,3.3466782733255958,7.9933391366627982,4.6466608633372024,0,6.3934149421178512,0.40875754622095806,0.5,0.93947907927457408,0.96610280099780244,9.3335462209579942E-4,9.3335462209579942E-4,2.7844043277615329,7.752907460457154E-3,7.752907460457154E-3,3.2245794869850184,0.24954990882922953,0.36403200000000002,1.1520000000000028E-2,0,0.64192202502538831,5.5206740307874762,0.54860115157580225,5.6627200000000009E-2,0.64222236406781252,5.6627200000000009E-2,0.45504,0.20437877311047903,1.0560000000000001E-4,{"$f":"CHOOSE(Ext_VCC, (Qg_Q1+Qg_Q2)*Fsw*'Design Regulator'!$G$102, (Qg_Q1+Qg_Q2)*Fsw*Vout, (Qg_Q1+Qg_Q2)*Fsw*Vin)","v":3.4079999999999999E-2},0.12233890909090907,0.11359999999999998,3.4185599999999997E-2,2.9825413035608066,1.829997189093201,75.84,0.96216131509799374,14.133726375380824,11.885783461017189,null,96.216131509799368,0.93947907927457408,1.7391843890932006,0.9422484250253883,0.79238556406781258,0.20437877311047903,1.7733699890932006,34.758051786226737]
[null,null,null,null,null,null,80,48,1,6.4,6.4,1.7777777777777779,0.25443392452326974,3.3471531106108263,8.0735765553054133,4.7264234446945874,0,6.4725280606181474,0.4189361949548932,0.5,0.9508022325102915,0.96623987471502693,9.3361949548931094E-4,9.3361949548931094E-4,2.8190613000422582,7.9471066133959475E-3,7.9471066133959475E-3,3.264836599390835,0.25581979249732589,0.36864000000000002,1.1520000000000028E-2,0,0.65353443198937067,5.5887799629943755,0.56222030654581345,5.7344000000000006E-2,0.65843371083406188,5.7344000000000006E-2,0.46079999999999999,0.2094680974774466,1.0560000000000001E-4,{"$f":"CHOOSE(Ext_VCC, (Qg_Q1+Qg_Q2)*Fsw*'Design Regulator'!$G$102, (Qg_Q1+Qg_Q2)*Fsw*Vout, (Qg_Q1+Qg_Q2)*Fsw*Vin)","v":3.4079999999999999E-2},0.12233890909090907,0.11359999999999998,3.4185599999999997E-2,3.0334487989200558,1.8642977428234324,76.800000000000011,0.96200278398894501,14.36493647984056,12.157465662510928,null,96.200278398894497,0.9508022325102915,1.7727681428234323,0.95766243198937073,0.81049771083406186,0.2094680974774466,1.8069537428234324,35.416293359339278]
[null,null,null,null,null,null,81,48,1,6.48,6.48,1.8,0.25448935606306849,3.3476278394642098,8.1538139197321051,4.8061860802678957,0,6.5516627161326761,0.42924284345962999,0.5,0.96228723621961543,0.96637691713067353,9.3388434596298467E-4,9.3388434596298467E-4,2.8537325388494468,8.143789403288108E-3,8.143789403288108E-3,3.3051132329577118,0.26217056358413227,0.37324800000000002,1.1520000000000028E-2,0,0.66525154777057616,5.6568994036743145,0.57600919553923458,5.806080000000001E-2,0.6748878652554583,5.806080000000001E-2,0.46655999999999997,0.21462142172981499,1.0560000000000001E-4,{"$f":"CHOOSE(Ext_VCC, (Qg_Q1+Qg_Q2)*Fsw*'Design Regulator'!$G$102, (Qg_Q1+Qg_Q2)*Fsw*Vout, (Qg_Q1+Qg_Q2)*Fsw*Vin)","v":3.4079999999999999E-2},0.12233890909090907,0.11359999999999998,3.4185599999999997E-2,3.0849321447247151,1.8989458130260346,77.760000000000005,0.96184136639261175,14.597717216558642,12.432789978831874,null,96.184136639261169,0.96228723621961543,1.8066994130260343,0.97318114777057618,0.82885266525545831,0.21462142172981499,1.8408850130260344,36.08134625531028]
[null,null,null,null,null,null,82,48,1,6.56,6.56,1.822222222222222,0.25454478778766432,3.3481024598852041,8.234051229942601,4.8859487700573974,0,6.630818137567247,0.43967749173490772,0.5,0.97393487103157361,0.96651392824458549,9.341491734907798E-4,9.341491734907798E-4,2.88841770813975,8.3429568566952862E-3,8.3429568566952862E-3,3.3454090008349446,0.26860227318881907,0.37785600000000003,1.1520000000000028E-2,0,0.67707395144880811,5.725031684682917,0.58996778023121965,5.8777599999999999E-2,0.69158684562715478,5.8777599999999999E-2,0.47231999999999991,0.21983874586745386,1.0560000000000001E-4,{"$f":"CHOOSE(Ext_VCC, (Qg_Q1+Qg_Q2)*Fsw*'Design Regulator'!$G$102, (Qg_Q1+Qg_Q2)*Fsw*Vout, (Qg_Q1+Qg_Q2)*Fsw*Vin)","v":3.4079999999999999E-2},0.12233890909090907,0.11359999999999998,3.4185599999999997E-2,3.136994720005176,1.9339439970759627,78.72,0.9616771330203927,14.832077271732121,12.71178668440732,null,96.167713302039274,0.97393487103157361,1.8409807970759626,0.9888051514488081,0.84745244562715472,0.21983874586745386,1.8751663970759627,36.753261382688869]
[null,null,null,null,null,null,83,48,1,6.64,6.64,1.8444444444444441,0.25460021969705809,3.3485769718732659,8.3142884859366326,4.9657115140633667,0,6.7099935900153183,0.45024013978046662,0.5,0.98574593062798421,0.96665090805660603,9.3441397804666106E-4,9.3441397804666106E-4,2.9231164875375555,8.5446099997138949E-3,8.5446099997138949E-3,3.3857235342617824,0.27511497241089827,0.38246399999999997,1.1520000000000028E-2,0,0.68900222949350431,5.7931761692177606,0.60409602229666615,5.9494400000000003E-2,0.70853271046271438,5.9494400000000003E-2,0.47807999999999995,0.22512006989023331,1.0560000000000001E-4,{"$f":"CHOOSE(Ext_VCC, (Qg_Q1+Qg_Q2)*Fsw*'Design Regulator'!$G$102, (Qg_Q1+Qg_Q2)*Fsw*Vout, (Qg_Q1+Qg_Q2)*Fsw*Vin)","v":3.4079999999999999E-2},0.12233890909090907,0.11359999999999998,3.4185599999999997E-2,3.1896399644521964,1.9692949399562185,79.679999999999993,0.96151015057118105,15.068025442402565,12.994486656940715,null,96.151015057118101,0.98574593062798421,1.8756149399562188,1.0045350294935043,0.86629911046271435,0.22512006989023331,1.9098005399562188,37.432090583141893]
[null,null,null,null,null,null,84,48,1,6.72,6.72,1.8666666666666665,0.25465565179125077,3.3490513754278544,8.3945256877139265,5.045474312286073,0,6.7891883726705204,0.46093078759604589,0.5,0.99772122188440326,0.96678785656657917,9.3467875960460045E-4,9.3467875960460045E-4,2.957828571431258,8.7487498579750765E-3,8.7487498579750765E-3,3.4260564815239936,0.2817087123502216,0.38707199999999997,1.1520000000000028E-2,0,0.70103697584666569,5.8613322500104035,0.61839388341021628,6.0211200000000006E-2,0.72572755919093579,6.0211200000000006E-2,0.48383999999999994,0.23046539379802294,1.0560000000000001E-4,{"$f":"CHOOSE(Ext_VCC, (Qg_Q1+Qg_Q2)*Fsw*'Design Regulator'!$G$102, (Qg_Q1+Qg_Q2)*Fsw*Vout, (Qg_Q1+Qg_Q2)*Fsw*Vin)","v":3.4079999999999999E-2},0.12233890909090907,0.11359999999999998,3.4185599999999997E-2,3.2428713793376067,2.0050013350376013,80.64,0.96134048195998689,15.305570637699986,13.280921387864037,null,96.134048195998687,0.99772122188440326,1.9106045350376015,1.0203713758466657,0.8853947591909358,0.23046539379802294,1.9447901350376016,38.117886646736991]
[null,null,null,null,null,null,85,48,1,6.8,6.8,1.8888888888888886,0.25471108407024329,3.3495256705484251,8.4747628352742126,5.1252371647257871,0,6.8684018168813168,0.47174943518138579,0.5,1.0098615650139224,0.96692477377434749,9.349435181385731E-4,9.349435181385731E-4,2.9925536681310718,8.9553774566447329E-3,8.9553774566447329E-3,3.4664075069814819,0.28838354410698175,0.39167999999999997,1.1520000000000028E-2,0,0.71317879200718337,5.9294993476415021,0.63286132524625793,6.0928000000000003E-2,0.74317353287081767,6.0928000000000003E-2,0.48959999999999992,0.2358747175906929,1.0560000000000001E-4,{"$f":"CHOOSE(Ext_VCC, (Qg_Q1+Qg_Q2)*Fsw*'Design Regulator'!$G$102, (Qg_Q1+Qg_Q2)*Fsw*Vout, (Qg_Q1+Qg_Q2)*Fsw*Vin)","v":3.4079999999999999E-2},0.12233890909090907,0.11359999999999998,3.4185599999999997E-2,3.2966925284573994,2.041065924878001,81.599999999999994,0.9611681865303251,15.544721880107751,13.571122993062266,null,96.11681865303251,1.0098615650139224,1.9459523248780011,1.0363147920071833,0.90474153287081771,0.2358747175906929,1.9801379248780011,38.810703327608827]
[null,null,null,null,null,null,86,48,1,6.88,6.88,1.911111111111111,0.25476651653403659,3.3499998572344398,8.5549999286172191,5.2050000713827798,0,6.9476332843366562,0.48269608253622553,0.5,1.0221677937138556,0.96706165967975588,9.3520825362256401E-4,9.3520825362256401E-4,3.0272914990835407,9.1644938204234715E-3,9.1644938204234715E-3,3.5067762901613788,0.29513951878171207,0.39628799999999997,1.1520000000000028E-2,0,0.72542828711658636,5.9976769089693844,0.64749830947892184,6.1644800000000007E-2,0.7608728149251337,6.1644800000000007E-2,0.49535999999999991,0.24134804126811277,1.0560000000000001E-4,{"$f":"CHOOSE(Ext_VCC, (Qg_Q1+Qg_Q2)*Fsw*'Design Regulator'!$G$102, (Qg_Q1+Qg_Q2)*Fsw*Vout, (Qg_Q1+Qg_Q2)*Fsw*Vin)","v":3.4079999999999999E-2},0.12233890909090907,0.11359999999999998,3.4185599999999997E-2,3.3511070390977338,2.07749150204172,82.56,0.96099332025167983,15.785488306748796,13.865124223877006,null,96.099332025167982,1.0221677937138556,1.9816611020417199,1.0523658871165864,0.92434161492513367,0.24134804126811277,2.0158467020417197,39.51059536001771]
[null,null,null,null,null,null,87,48,1,6.96,6.96,1.9333333333333331,0.25482194918263146,3.3504739354853506,8.6352369677426744,5.2847630322573247,0,7.0268821653725313,0.49377072966030555,0.5,1.0346407553153745,0.96719851428264603,9.3547296603055787E-4,9.3547296603055787E-4,3.0620417981383992,9.3760999735466415E-3,9.3760999735466415E-3,3.5471625249115557,0.30197668747528617,0.40089599999999997,1.1520000000000028E-2,0,0.73778607804623353,6.0658644056633539,0.6623047977820854,6.2361600000000003E-2,0.77882763189313409,6.2361600000000003E-2,0.50112000000000001,0.24688536483015278,1.0560000000000001E-4,{"$f":"CHOOSE(Ext_VCC, (Qg_Q1+Qg_Q2)*Fsw*'Design Regulator'!$G$102, (Qg_Q1+Qg_Q2)*Fsw*Vout, (Qg_Q1+Qg_Q2)*Fsw*Vin)","v":3.4079999999999999E-2},0.12233890909090907,0.11359999999999998,3.4185599999999997E-2,3.4061186030244714,2.1142809099393673,83.52,0.96081593590322856,16.027879170693502,14.162958478397011,null,96.081593590322854,1.0346407553153745,2.0177337099393675,1.0685252780462335,0.94419723189313409,0.24688536483015278,2.0519193099393673,40.217618474811601]
[null,null,null,null,null,null,88,48,1,7.04,7.04,1.9555555555555555,0.25487738201602905,3.3509479053006208,8.71547395265031,5.3645260473496901,0,7.1061478773901507,0.50497337655336549,0.5,1.0472813109361381,0.96733533758286305,9.3573765533655159E-4,9.3573765533655159E-4,3.0968043108637486,9.5901969397842977E-3,9.5901969397842977E-3,3.5875659186099451,0.30889510128891884,0.40550399999999998,1.1520000000000028E-2,0,0.75025278948597818,6.1340613328336495,0.67728075182936864,6.3078400000000007E-2,0.79704025420287172,6.3078400000000007E-2,0.50688,0.25248668827668275,1.0560000000000001E-4,{"$f":"CHOOSE(Ext_VCC, (Qg_Q1+Qg_Q2)*Fsw*'Design Regulator'!$G$102, (Qg_Q1+Qg_Q2)*Fsw*Vout, (Qg_Q1+Qg_Q2)*Fsw*Vin)","v":3.4079999999999999E-2},0.12233890909090907,0.11359999999999998,3.4185599999999997E-2,3.4617309774967913,2.1514370436888495,84.48,0.96063608324490912,16.271903842289671,14.464659813043076,null,96.063608324490914,1.0472813109361381,2.0541730436888499,1.0847935894859781,0.96431065420287176,0.25248668827668275,2.0883586436888497,40.931829416301454]
[null,null,null,null,null,null,89,48,1,7.12,7.12,1.9777777777777776,0.25493281503423004,3.3514217666797039,8.7957108833398525,5.4442891166601477,0,7.1854298633773155,0.51630402321514546,0.5,1.0600903356359732,0.9674721295802492,9.3600232151454254E-4,9.3600232151454254E-4,3.1315787939059105,9.806785742441199E-3,9.806785742441199E-3,3.6279861914254234,0.31589481132416519,0.41011199999999998,1.1520000000000028E-2,0,0.76282905403432544,6.2022672077508076,0.69242613329413794,6.379520000000001E-2,0.81551299696370028,6.379520000000001E-2,0.51263999999999998,0.25815201160757273,1.0560000000000001E-4,{"$f":"CHOOSE(Ext_VCC, (Qg_Q1+Qg_Q2)*Fsw*'Design Regulator'!$G$102, (Qg_Q1+Qg_Q2)*Fsw*Vout, (Qg_Q1+Qg_Q2)*Fsw*Vin)","v":3.4079999999999999E-2},0.12233890909090907,0.11359999999999998,3.4185599999999997E-2,3.5179479863055265,2.1889628509980255,85.44,0.96045380917681356,16.51757181051488,14.770262954455504,null,96.045380917681356,1.0600903356359732,2.0909820509980257,1.1011714540343254,0.98468419696370024,0.25815201160757273,2.1251676509980255,41.653285959561302]
[null,null,null,null,null,null,90,48,1,7.2,7.2,2,0.25498824823723559,3.3518955196220608,8.8759477598110301,5.5240522401889702,0,7.264727590525232,0.52776266964538543,0.5,1.0730687185756609,0.96760889027464869,9.3626696453853709E-4,9.3626696453853709E-4,3.1663650143906041,1.0025867404356811E-2,1.0025867404356811E-2,3.6684230756264156,0.32297586868292089,0.41471999999999998,1.1520000000000028E-2,0,0.77551551229011384,6.2704815686476714,0.70774090384950294,6.4512000000000014E-2,0.83424822077948046,6.4512000000000014E-2,0.51839999999999997,0.26388133482269271,1.0560000000000001E-4,{"$f":"CHOOSE(Ext_VCC, (Qg_Q1+Qg_Q2)*Fsw*'Design Regulator'!$G$102, (Qg_Q1+Qg_Q2)*Fsw*Vout, (Qg_Q1+Qg_Q2)*Fsw*Vin)","v":3.4079999999999999E-2},0.12233890909090907,0.11359999999999998,3.4185599999999997E-2,3.5747735208368434,2.2268613330695946,86.4,0.96026915788780531,16.764892684351707,15.079803311692206,null,96.026915788780528,1.0730687185756609,2.1281637330695942,1.1176595122901138,1.0053202207794805,0.26388133482269271,2.162349333069594,42.382046928164044]
[null,null,null,null,null,null,91,48,1,7.28,7.28,2.0222222222222221,0.25504368162504648,3.3523691641271469,8.9561845820635746,5.6038154179364268,0,7.3440405489337097,0.53934931584382551,0.5,1.0862173631788825,0.96774561966590456,9.365315843825456E-4,9.365315843825456E-4,3.2011627493623744,1.0247442947905276E-2,1.0247442947905276E-2,3.7088763149336654,0.3301383244674222,0.41932799999999998,1.1520000000000028E-2,0,0.78831281294574362,6.3387039735979638,0.72322502516831899,6.5228800000000003E-2,0.85324833258307731,6.5228800000000003E-2,0.52415999999999996,0.26967465792191275,1.0560000000000001E-4,{"$f":"CHOOSE(Ext_VCC, (Qg_Q1+Qg_Q2)*Fsw*'Design Regulator'!$G$102, (Qg_Q1+Qg_Q2)*Fsw*Vout, (Qg_Q1+Qg_Q2)*Fsw*Vin)","v":3.4079999999999999E-2},0.12233890909090907,0.11359999999999998,3.4185599999999997E-2,3.6322115411619036,2.2651355455288207,87.36,0.96008217099417559,17.013876194186153,15.393316988746159,null,96.008217099417564,1.0862173631788825,2.1657211455288206,1.1342584129457436,1.0262211325830772,0.26967465792191275,2.1999067455288204,43.118172212364883]
[null,null,null,null,null,null,92,48,1,7.36,7.36,2.0444444444444443,0.25509911519766365,3.3528427001944223,9.0364213500972106,5.6835786499027892,0,7.4233682503982372,0.55106396181020589,0.5,1.0995371872973856,0.9678823177538608,9.3679618102058561E-4,9.3679618102058561E-4,3.2359717852594825,1.0471513394995443E-2,1.0471513394995443E-2,3.7493456639139393,0.33738222978024623,0.42393599999999998,1.1520000000000028E-2,0,0.80122161288198235,6.4069339994657604,0.73887845892318571,6.5945600000000007E-2,0.87251578649272488,6.5945600000000007E-2,0.52991999999999995,0.27553198090510295,1.0560000000000001E-4,{"$f":"CHOOSE(Ext_VCC, (Qg_Q1+Qg_Q2)*Fsw*'Design Regulator'!$G$102, (Qg_Q1+Qg_Q2)*Fsw*Vout, (Qg_Q1+Qg_Q2)*Fsw*Vin)","v":3.4079999999999999E-2},0.12233890909090907,0.11359999999999998,3.4185599999999997E-2,3.6902660771532112,2.3037885993747071,88.320000000000007,0.95989288766909098,17.264532193229737,15.710840797390873,null,95.989288766909098,1.0995371872973856,2.2036573993747073,1.1509688128819824,1.0473893864927248,0.27553198090510295,2.2378429993747071,43.861722787744263]
[null,null,null,null,null,null,93,48,1,7.44,7.44,2.0666666666666664,0.25515454895508805,3.3533161278233417,9.1166580639116717,5.7633419360883291,0,7.5027102272729875,0.5629066075442668,0.5,1.1130291233794254,0.96801898453835999,9.3706075442667768E-4,9.3706075442667768E-4,3.2707919174216529,1.0698079767070812E-2,1.0698079767070812E-2,3.7898308874116822,0.34470763572431085,0.42854399999999998,1.1520000000000028E-2,0,0.81424257726437232,6.4751712409207425,0.75470116678644705,6.6662400000000011E-2,0.8920530846908703,6.6662400000000011E-2,0.53567999999999993,0.2814533037721334,1.0560000000000001E-4,{"$f":"CHOOSE(Ext_VCC, (Qg_Q1+Qg_Q2)*Fsw*'Design Regulator'!$G$102, (Qg_Q1+Qg_Q2)*Fsw*Vout, (Qg_Q1+Qg_Q2)*Fsw*Vin)","v":3.4079999999999999E-2},0.12233890909090907,0.11359999999999998,3.4185599999999997E-2,3.7489412296282998,2.3428236619552423,89.28,0.95970134476351199,17.516870658965587,16.032412270363054,null,95.970134476351205,1.1130291233794254,2.2419756619552427,1.1677913772643724,1.0688274846908703,0.2814533037721334,2.2761612619552425,44.612760734322755]
[null,null,null,null,null,null,94,48,1,7.52,7.52,2.0888888888888886,0.25520998289732061,3.3537894470133658,9.1968947235066825,5.8431052764933167,0,7.5820660314042927,0.57487725304574844,0.5,1.1266941186415445,0.96815562001924649,9.373253045748517E-4,9.373253045748517E-4,3.3056229496283387,1.0927143085109559E-2,1.0927143085109559E-2,3.8303317600158877,0.35211459340287377,0.43315199999999998,1.1520000000000028E-2,0,0.82737637964126909,6.5434153095144758,0.77069311043019151,6.73792E-2,0.91186277832612783,6.73792E-2,0.54143999999999992,0.28743862652287422,1.0560000000000001E-4,{"$f":"CHOOSE(Ext_VCC, (Qg_Q1+Qg_Q2)*Fsw*'Design Regulator'!$G$102, (Qg_Q1+Qg_Q2)*Fsw*Vout, (Qg_Q1+Qg_Q2)*Fsw*Vin)","v":3.4079999999999999E-2},0.12233890909090907,0.11359999999999998,3.4185599999999997E-2,3.8082411715214999,2.3822439579673969,90.24,0.95950757691920918,17.770901694619035,16.358069674891915,null,95.950757691920913,1.1266941186415445,2.2806791579673966,1.184726779641269,1.0905379783261278,0.28743862652287422,2.3148647579673964,45.371349256160975]
[null,null,null,null,null,null,95,48,1,7.6,7.6,2.1111111111111107,0.25526541702436217,3.3542626577639489,9.2771313288819748,5.9228686711180254,0,7.661435233129569,0.58697589831439134,0.5,1.140533135243754,0.96829222419636285,9.375898314391395E-4,9.375898314391395E-4,3.340464693665318,1.1158704369624527E-2,1.1158704369624527E-2,3.8708480655596995,0.35960315391953446,0.43775999999999993,1.1520000000000028E-2,0,0.84062370204354364,6.6116658328133813,0.78685425152625343,6.8096000000000004E-2,0.93194746843899001,6.8096000000000004E-2,0.54719999999999991,0.29348794915719567,1.0560000000000001E-4,{"$f":"CHOOSE(Ext_VCC, (Qg_Q1+Qg_Q2)*Fsw*'Design Regulator'!$G$102, (Qg_Q1+Qg_Q2)*Fsw*Vout, (Qg_Q1+Qg_Q2)*Fsw*Vin)","v":3.4079999999999999E-2},0.12233890909090907,0.11359999999999998,3.4185599999999997E-2,3.868170149084547,2.4220527704825332,91.199999999999989,0.95931161667445009,18.026635530653152,16.687852026584849,null,95.931161667445011,1.140533135243754,2.3197711704825332,1.2017757020435436,1.11252346843899,0.29348794915719567,2.353956770482533,46.137552701457651]
[null,null,null,null,null,null,96,48,1,7.68,7.68,{"$f":"Vout*K105/(Vin*Efficiency)","v":2.1333333333333333},0.25532085133621379,{"$f":"(Vin-(Rdson1+Rdcr)*K105-Vout)*M105/(Fsw*Lf)","v":3.3547357600745529},9.3573678800372768,6.0026321199627235,{"$f":"IF(MIN(Vin, -P105/(Coss_Q1+Coss_Q2)*0.00000002)<0, 0, MIN(Vin, -P105/(Coss_Q1+Coss_Q2)*0.00000002))","v":0},7.7408174203370521,{"$f":"R105^2*Rdcr","v":0.59920254334993572},0.5,{"$f":"(T105+S105*(1+Ltc*(Ta-25)))/(1-S105*Ltc*ThetaCa)","v":1.1545471504681717},0.96842879706955354,9.3785433499358247E-4,9.3785433499358247E-4,3.3753169689176161,1.1392764640663204E-2,1.1392764640663204E-2,3.9113795966503955,{"$f":"Rdson1*AB105^2","v":0.36717336837823228},0.44236799999999998,1.1520000000000028E-2,0,{"$f":"(AF105+AE105+AD105+AC105*(1+RdsonTopTc*Ta-RdsonTopTc*25))/(1-AC105*RdsonTopTc*ThetaJA_Q1)","v":0.85398523508597046},6.6799224535843651,{"$f":"Rdson2*AH105^2","v":0.80318455174621006},6.8812800000000007E-2,{"$f":"(AJ105+AI105*(1+RdsonBotTc*Ta-RdsonBotTc*25))/(1-AI105*RdsonBotTc*ThetaJA_Q2)","v":0.95230980691196088},6.8812800000000007E-2,0.5529599999999999,0.29960127167496786,1.0560000000000001E-4,{"$f":"CHOOSE(Ext_VCC, (Qg_Q1+Qg_Q2)*Fsw*'Design Regulator'!$G$102, (Qg_Q1+Qg_Q2)*Fsw*Vout, (Qg_Q1+Qg_Q2)*Fsw*Vin)","v":3.4079999999999999E-2},0.12233890909090907,0.11359999999999998,3.4185599999999997E-2,{"$f":" SUM(U105,X105,AA105,AG105,AK105,AL105,AM105,AS105,AN105)","v":3.9287324831167272},2.4622534419979312,92.16,0.95911349456288197,18.284082526289556,17.021799103679413,null,95.911349456288193,1.1545471504681717,2.3592550419979315,1.2189388350859705,1.1347866069119608,0.29960127167496786,2.3934406419979313,46.911436583159457]
[null,null,null,null,null,null,97,48,1,7.76,7.76,{"$f":"Vout*K106/(Vin*Efficiency)","v":2.1555555555555554},0.2553762858328763,{"$f":"(Vin-(Rdson1+Rdcr)*K106-Vout)*M106/(Fsw*Lf)","v":3.3552087539446322},9.4376043769723168,6.0823956230276837,{"$f":"IF(MIN(Vin, -P106/(Coss_Q1+Coss_Q2)*0.00000002)<0, 0, MIN(Vin, -P106/(Coss_Q1+Coss_Q2)*0.00000002))","v":0},7.8202121975821237,{"$f":"R106^2*Rdcr","v":0.61155718815212234},0.5,{"$f":"(T106+S106*(1+Ltc*(Ta-25)))/(1-S106*Ltc*ThetaCa)","v":1.1687371569011942},0.96856533863866123,9.3811881521222449E-4,9.3811881521222449E-4,3.4101796019869268,1.1629324917807715E-2,1.1629324917807715E-2,3.9519261542276629,{"$f":"Rdson1*AB106^2","v":0.37482528788324754},0.44697599999999998,1.1520000000000028E-2,0,{"$f":"(AF106+AE106+AD106+AC106*(1+RdsonTopTc*Ta-RdsonTopTc*25))/(1-AC106*RdsonTopTc*ThetaJA_Q1)","v":0.86746167807033958},6.7481848290294764,{"$f":"Rdson2*AH106^2","v":0.81968397276138438},6.9529600000000011E-2,{"$f":"(AJ106+AI106*(1+RdsonBotTc*Ta-RdsonBotTc*25))/(1-AI106*RdsonBotTc*ThetaJA_Q2)","v":0.97295249744482093},6.9529600000000011E-2,0.55871999999999988,0.30577859407606117,1.0560000000000001E-4,{"$f":"CHOOSE(Ext_VCC, (Qg_Q1+Qg_Q2)*Fsw*'Design Regulator'!$G$102, (Qg_Q1+Qg_Q2)*Fsw*Vout, (Qg_Q1+Qg_Q2)*Fsw*Vin)","v":3.4079999999999999E-2},0.12233890909090907,0.11359999999999998,3.4185599999999997E-2,3.9899325702254362,2.5028493755151606,93.12,0.95891323920609151,18.543253171055092,17.359951461672313,null,95.891323920609153,1.1687371569011942,2.3991341755151607,1.2362168780703395,1.1573300974448208,0.30577859407606117,2.4333197755151605,47.693067600097152]
[null,null,null,null,null,null,98,48,1,7.84,7.84,{"$f":"Vout*K107/(Vin*Efficiency)","v":2.1777777777777776},0.2554317205143507,{"$f":"(Vin-(Rdson1+Rdcr)*K107-Vout)*M107/(Fsw*Lf)","v":3.3556816393736471},9.5178408196868229,6.1621591803131768,{"$f":"IF(MIN(Vin, -P107/(Coss_Q1+Coss_Q2)*0.00000002)<0, 0, MIN(Vin, -P107/(Coss_Q1+Coss_Q2)*0.00000002))","v":0},7.8996191852562809,{"$f":"R107^2*Rdcr","v":0.62403983272069108},0.5,{"$f":"(T107+S107*(1+Ltc*(Ta-25)))/(1-S107*Ltc*ThetaCa)","v":1.1831041626192571},0.96870184890352995,9.3838327206911733E-4,9.3838327206911733E-4,3.4450524263318316,1.186838622017484E-2,1.186838622017484E-2,3.9924875471481904,{"$f":"Rdson1*AB107^2","v":0.38255896353920099},0.45158399999999999,1.1520000000000028E-2,0,{"$f":"(AF107+AE107+AD107+AC107*(1+RdsonTopTc*Ta-RdsonTopTc*25))/(1-AC107*RdsonTopTc*ThetaJA_Q1)","v":0.88105373909031759},6.8164526300661503,{"$f":"Rdson2*AH107^2","v":0.83635247624284326},7.0246400000000001E-2,{"$f":"(AJ107+AI107*(1+RdsonBotTc*Ta-RdsonBotTc*25))/(1-AI107*RdsonBotTc*ThetaJA_Q2)","v":0.99387829655572535},7.0246400000000001E-2,0.56447999999999987,0.31201991636034554,1.0560000000000001E-4,{"$f":"CHOOSE(Ext_VCC, (Qg_Q1+Qg_Q2)*Fsw*'Design Regulator'!$G$102, (Qg_Q1+Qg_Q2)*Fsw*Vout, (Qg_Q1+Qg_Q2)*Fsw*Vin)","v":3.4079999999999999E-2},0.12233890909090907,0.11359999999999998,3.4185599999999997E-2,4.0517748841178891,2.5438440356460426,94.08,0.95871087740028593,18.804158086354761,17.702350448335878,null,95.871087740028599,1.1831041626192571,2.4394120356460425,1.2536105390903174,1.1801566965557253,0.31201991636034554,2.4735976356460423,48.482513658662434]
[null,null,null,null,null,null,99,48,1,7.92,7.92,{"$f":"Vout*K108/(Vin*Efficiency)","v":2.1999999999999997},0.25548715538063782,{"$f":"(Vin-(Rdson1+Rdcr)*K108-Vout)*M108/(Fsw*Lf)","v":3.3561544163610519},9.5980772081805252,6.2419227918194737,{"$f":"IF(MIN(Vin, -P108/(Coss_Q1+Coss_Q2)*0.00000002)<0, 0, MIN(Vin, -P108/(Coss_Q1+Coss_Q2)*0.00000002))","v":0},7.9790380188051691,{"$f":"R108^2*Rdcr","v":0.63665047705538325},0.5,{"$f":"(T108+S108*(1+Ltc*(Ta-25)))/(1-S108*Ltc*ThetaCa)","v":1.1976491913782603},0.96883832786400237,9.3864770553831617E-4,9.3864770553831617E-4,3.4799352819292437,1.2109949566415965E-2,1.2109949566415965E-2,4.033063591794777,{"$f":"Rdson1*AB108^2","v":0.39037444645105412},0.45619199999999999,1.1520000000000028E-2,0,{"$f":"(AF108+AE108+AD108+AC108*(1+RdsonTopTc*Ta-RdsonTopTc*25))/(1-AC108*RdsonTopTc*ThetaJA_Q1)","v":0.89476213513809333},6.8847255406499483,{"$f":"Rdson2*AH108^2","v":0.85319002386139897},7.0963200000000004E-2,{"$f":"(AJ108+AI108*(1+RdsonBotTc*Ta-RdsonBotTc*25))/(1-AI108*RdsonBotTc*ThetaJA_Q2)","v":1.0150900146088897},7.0963200000000004E-2,0.57023999999999997,0.31832523852769162,1.0560000000000001E-4,{"$f":"CHOOSE(Ext_VCC, (Qg_Q1+Qg_Q2)*Fsw*'Design Regulator'!$G$102, (Qg_Q1+Qg_Q2)*Fsw*Vout, (Qg_Q1+Qg_Q2)*Fsw*Vin)","v":3.4079999999999999E-2},0.12233890909090907,0.11359999999999998,3.4185599999999997E-2,4.1142639769248897,2.585240949746983,95.039999999999992,0.95850643419750103,19.066808027071399,18.049038219133344,null,95.850643419750099,1.1976491913782603,2.4800921497469832,1.2711205351380932,1.2032692146088897,0.31832523852769162,2.514277749746983,49.279843895040869]
[null,null,null,null,null,null,100,48,1,8,8,{"$f":"Vout*K109/(Vin*Efficiency)","v":2.2222222222222219},0.2555425904317386,{"$f":"(Vin-(Rdson1+Rdcr)*K109-Vout)*M109/(Fsw*Lf)","v":3.3566270849063073},9.6783135424531537,6.3216864575468463,{"$f":"IF(MIN(Vin, -P109/(Coss_Q1+Coss_Q2)*0.00000002)<0, 0, MIN(Vin, -P109/(Coss_Q1+Coss_Q2)*0.00000002))","v":0},8.0584683479923083,{"$f":"R109^2*Rdcr","v":0.64938912115593883},0.5,{"$f":"(T109+S109*(1+Ltc*(Ta-25)))/(1-S109*Ltc*ThetaCa)","v":1.2123732828067226},0.96897477551992273,9.389121155938847E-4,9.389121155938847E-4,3.514828014955655,1.2354015974717112E-2,1.2354015974717112E-2,4.0736541117082927,{"$f":"Rdson1*AB109^2","v":0.39827178772410915},0.46079999999999999,1.1520000000000028E-2,0,{"$f":"(AF109+AE109+AD109+AC109*(1+RdsonTopTc*Ta-RdsonTopTc*25))/(1-AC109*RdsonTopTc*ThetaJA_Q1)","v":0.90858759221283703},6.9530032571368761,{"$f":"Rdson2*AH109^2","v":0.87019657728760813},7.1680000000000008E-2,{"$f":"(AJ109+AI109*(1+RdsonBotTc*Ta-RdsonBotTc*25))/(1-AI109*RdsonBotTc*ThetaJA_Q2)","v":1.0365905168696259},7.1680000000000008E-2,0.57599999999999996,0.32469456057796942,1.0560000000000001E-4,{"$f":"CHOOSE(Ext_VCC, (Qg_Q1+Qg_Q2)*Fsw*'Design Regulator'!$G$102, (Qg_Q1+Qg_Q2)*Fsw*Vout, (Qg_Q1+Qg_Q2)*Fsw*Vin)","v":3.4079999999999999E-2},0.12233890909090907,0.11359999999999998,3.4185599999999997E-2,4.177404480557465,2.627043709082463,96,0.95829993298171123,19.331213883192557,18.40005775304439,null,95.829993298171118,1.2123732828067226,2.521178109082463,1.2887475922128371,1.2266705168696259,0.32469456057796942,2.5553637090824628,50.085128698016277]

{"sheet":"Bode Plot Management","index":5,"n_rows":6,"n_cols":14,"rows_kept":6,"cut":false,"hidden":true,"merged":[]}
[null,null,null,null,null,null,null,null,null,"Single or dual output (MODE)",null,null,null,"3.3V or 5V fixed (FB1/2)"]
[{"$f":"CHOOSE(BODE_PLOT_TYPE, \"BODE_PLOT_Ch1\", \"BODE_PLOT_Ch2\")","v":"BODE_PLOT_Ch1"},null,null,null,null,null,null,null,null,"With/without dither (DITH)",null,null,null,"With/without VOUT connected to VCCX"]
[null,null,null,null,null,null,null,null,null,"FPWM or DEM (DEMB)"]
[null,null,null,null,null,null,null,null,null,"Shunt or inductor DCR current sensing"]
[]
[null,null,null,null,null,{"$f":"INDIRECT(A2)","v":0}]

{"sheet":"Stability Calculations","index":6,"n_rows":687,"n_cols":38,"rows_kept":687,"cut":false,"hidden":true,"merged":[[9,1,10,1],[1,0,1,3],[1,9,1,11],[9,0,11,0],[9,18,9,19],[1,19,1,21],[10,6,10,7],[1,4,1,6],[9,2,9,7],[9,8,9,13],[9,20,9,22],[9,14,9,17],[1,12,1,14],[1,15,1,18],[9,27,9,28],[9,30,9,31],[10,2,10,3],[10,4,10,5],[10,8,10,9],[10,10,10,11],[10,12,10,13],[10,18,10,19],[10,14,10,15],[10,16,10,17]]}
[]
["Divider Network & EA Poles/Zeros",null,null,null,"Modulator",null,null,null,null,"Power Stage Poles/Zeros",null,null,"Complex Pole Pair",null,null,"Feedback natural frequencies",null,null,null,"Total System"]
[null,"Afb1",{"$f":"Afb","v":6.749667855362608E-2},"V/V","Acs",{"$f":"Acs","v":20},"A/V","gm",{"$f":"gm","v":1.1999999999999999E-3},"z_ESR",{"$f":"Fesr","v":1591549.4327375637},"Hz","p3",{"$f":"Fsw/2","v":200000},"Hz","zterm1",{"$f":"((1/wffHz)+(1/wfftHz))","v":5.8109410928520001E-6},null,null,"Adc",{"$f":"IF(VOUT_setting=1,Am*Afb*AEA,Am*AEA)","v":1802511.26329802},"V/V"]
[null,"EA zero, z1",{"$f":"Fz1_u","v":3827.6802134140539},"Hz","Am",{"$f":"Am","v":23.470198740859637},"V/V",null,null,"p_dom",{"$f":"Fp_dominant","v":1356.230043307482},"Hz","pterm1",{"$f":"Q*pole3","v":126188.35599400751},null,"pterm3",{"$f":"((1/wfbtHz)+(1/wffHz)+(1/wfftHz)+(Afbr/wffHz))","v":4.1019852617174042E-5},null,null,"Crossover",{"$f":"AI7","v":38.683500000000002},"kHz"]
[null,"EA pole, p1",{"$f":"Fp1_u","v":0.92081398048870167},"Hz","Q",{"$f":"Q","v":0.63094177997003753},null,null,null,null,null,null,"pterm2",{"$f":"pole3^2","v":40000000000},null,"pterm4",{"$f":"1/(wffHz*wfbtHz)","v":1.5937437150456741E-12},null,null,"Phase Margin",{"$f":"AI9","v":66.198776162693392},"°",null,null,null,null,null,null,null,null,null,null,null,"Gain",null,null,"Phase"]
[null,"Aea",{"$f":"AEA","v":76800},"V/V","mc",{"$f":"mc","v":1.3434343434343434},null,null,null,null,null,null,null,null,null,"Afbr",{"$f":"Rfb1_/Rfb2_u","v":14.124293785310735},null,null,"radconv",{"$f":"180/Pi","v":57.295779578552292},null,null,null,null,null,null,null,null,null,null,null,null,"XOVER SEARCH",null,null,"XOVER SEARCH"]
[null,"EA pole, p2",{"$f":"Fp2_u","v":207395.77630741132},"Hz","k",{"$f":"k","v":1.0044996173222651},null,null,null,null,null,null,null,null,null,null,null,null,null,"Gain Margin",{"$f":"AL9","v":-14.551371436681197},null,null,null,null,null,null,null,null,null,null,null,null,"xover",{"$f":"SUM(AH12:AH613)/1000","v":38.683500000000002},null,"Phase xover",{"$f":"SUM(AK12:AK613)/1000","v":158.49}]
[]
[null,null,null,null,null,null,null,null,null,null,null,null,null,null,null,null,null,null,null,null,null,null,null,null,null,null,null,null,null,null,null,null,null,"phase margin",{"$f":"SUM(AI13:AI613)","v":66.198776162693392},null,"gain margin",{"$f":"SUM(AL13:AL613)","v":-14.551371436681197}]
["Freq (Hz)",null,"Power Stage",null,null,null,null,null,"Error Amplifier",null,null,null,null,null,"Feedback Gain",null,null,null,"Sampling Double Pole",null,"System Response",null,null,null,null,null,null,"ERROR AMP Response",null,null,"PLANT Response"]
[null,null,"p_dom",null,"z_ESR",null,"z_RHP",null,"p1",null,"z1",null,"p2",null,"z1",null,"p1p2",null,"p3"]
[null,null,"Gain(V/V)","Phase(rad)","Gain(V/V)","Phase(rad)","Gain(V/V)","Phase(rad)","Gain(V/V)","Phase(rad)","Gain(V/V)","Phase(rad)","Gain(V/V)","Phase(rad)","Gain(V/V)","Phase(rad)","Gain(V/V)","Phase(rad)","Gain(V/V)","Phase(rad)","Gain (dB)","Phase (°)","Phase Margin (°)",null,null,"Fsquare",null,"Gain(dB)","Phase(Deg)",null,"Gain(dB)","Phase(Deg)"]
[1,{"$f":"A13/1000","v":1E-3},{"$f":"SQRT(1+(A13/pole1)^2)","v":1.0000002718336547},{"$f":"ATAN(A13/pole1)","v":7.3733790496106856E-4},{"$f":"SQRT(1+(A13/Zero1)^2)","v":1.0000000000001974},{"$f":"ATAN(A13/Zero1)","v":6.2831852999991738E-7},{"$f":"IF(VIN_nom>Vout, 1, SQRT(1+(A13/z_RHP)^2))","v":1},{"$f":"IF(VIN_nom>Vout, 0, -ATAN(A13/z_RHP))","v":0},{"$f":"SQRT(1+(A13/Pole2)^2)","v":1.4762745697985986},{"$f":"ATAN(A13/Pole2)","v":0.8266000739323186},{"$f":"SQRT(1+(A13/Zero2)^2)","v":1.0000000341270463},{"$f":"ATAN(A13/Zero2)","v":2.6125483883009603E-4},{"$f":"SQRT(1+(A13/pole4)^2)","v":1.0000000000116245},{"$f":"ATAN(A13/pole4)","v":4.8216989651226337E-6},{"$f":"IF(VOUT_setting=1,1,SQRT(1+(A13*zterm1)^2))","v":1.0000000000168834},{"$f":"IF(VOUT_setting=1,0,ATAN(((A13*zterm1))))","v":5.8109410927865939E-6},{"$f":"IF(VOUT_setting=1,1,SQRT((1+Afbr-pterm4*(A13)^2)^2+(A13*$Q$4)^2))","v":15.124293785364769},{"$f":"IF(VOUT_setting=1,0,ATAN(A13*$Q$4/(1+Afbr-$Q$5*(A13)^2)))","v":2.7121830083013699E-6},{"$f":"SQRT((1-(Z13/pterm2))^2+(A13/pterm1)^2)","v":1.0000000000064002},{"$f":"IF((ATAN((A13/pterm1)/(1-A13^2/pterm2))>0),ATAN((A13/pterm1)/(1-A13^2/pterm2)),PI()+ATAN((A13/pterm1)/(1-A13^2/pterm2)))","v":7.9246614485694302E-6},{"$f":"20*LOG10(((E13*K13*G13*O13)/(C13*I13*S13*M13*Q13))*Adc)","v":98.140712808179416},{"$f":"((F13+L13+H13+P13)-(D13+J13+T13+N13+R13))*radconv","v":-47.388489952955794},{"$f":"IF(V13>0,V13,V13+180)","v":132.61151004704419},null,{"$f":"IF(U13<0,A13,1000000000)","v":1000000000},{"$f":"A13^2","v":1},null,{"$f":"20*LOG10((K13/(I13*M13))*AEA)","v":94.323881923110505},{"$f":"(L13-(J13+N13))*radconv","v":-47.346003098982813},null,{"$f":"20*LOG10((E13*G13/(C13*S13))*Acs*Am)","v":53.430932894735442},{"$f":"(F13+H13-(D13+T13))*radconv","v":-4.2664399733152808E-2},null,{"$f":"SUM((U14<0)*(U13>0))*A13","v":0},{"$f":"IF(AH13>0,W11,0)","v":0},null,{"$f":"SUM((V14<-182)*(V13>-182))*A13","v":0},{"$f":"IF(AK13>0,U13,0)","v":0}]
[1.0965,{"$f":"A14/1000","v":1.0965E-3},1.0000003268289239,8.0849098314769816E-4,1.0000000000002374,6.8895126814489105E-7,1,0,1.5549890556525665,0.87226806445236826,1.0000000410313659,2.8646592945863215E-4,1.0000000000139762,5.2869929152486789E-6,1.0000000000202993,6.3716969082259915E-6,{"$f":"IF(VOUT_setting=1,1,SQRT((1+Afbr-pterm4*(A14)^2)^2+(A14*$Q$4)^2))","v":15.1242937853757},2.9739086686010407E-6,1.000000000007695,8.6893912783635314E-6,97.689508429988706,-50.007755221586017,129.99224477841398,null,1000000000,1.2023122500000001,null,93.872678022590009,-49.961168387903015,null,53.430932417041852,-4.6781512609034466E-2,null,0,0,null,{"$f":"SUM((V15<-183)*(V14>-183))*A14","v":0},{"$f":"IF(AK14>0,U14,0)","v":0}]
[1.2022999999999999,1.2022999999999999E-3,1.0000003929423986,8.8650129155933531E-4,1.0000000000002853,7.5542736861885632E-7,1,0,1.6446377001765928,0.91721109961217329,1.0000000493315082,3.1410668954154244E-4,1.0000000000168034,5.7971286657469264E-6,1.0000000000244056,6.9864944758222864E-6,{"$f":"IF(VOUT_setting=1,1,SQRT((1+Afbr-$Q$5*(A15)^2)^2+(A15*$Q$4)^2))","v":15.12429378538884},3.2608576308773277E-6,1.0000000000092517,9.5278204596322883E-6,97.202649833964585,-52.585742094169497,127.41425790583051,null,1000000000,1.4455252899999997,null,93.385820000804983,-52.534660153738749,null,53.430931842774605,-5.1295403698204713E-2,null,0,0,null,0,0]
[1.3183,1.3183000000000001E-3,1.0000004724237086,9.7203243012351174E-4,1.0000000000003431,8.2831231809881071E-7,1,0,1.7463314526888558,0.96108725045255938,1.0000000593099014,3.4441224824752664E-4,1.0000000000202021,6.3564457456848186E-6,1.0000000000293421,7.6605636425569403E-6,15.124293785404641,3.5754708598375044E-6,1.0000000000111229,1.0447081187680431E-5,96.68152053779005,-55.102884499086223,124.89711550091377,null,1000000000,1.7379148900000001,null,92.864691394977996,-55.046874086941322,null,53.430931152393271,-5.6244470720529863E-2,null,0,0,null,0,0]
[1.4454,1.4454000000000001E-3,1.0000005679096657,1.0657479974691619E-3,1.0000000000004123,9.0817160326175039E-7,1,0,1.8611695990503245,1.0035679490297333,1.000000071297581,3.7761773468751901E-4,1.0000000000242855,6.9692836841294292E-6,1.0000000000352727,8.3991342554107729E-6,15.124293785423621,3.9201893201887803E-6,1.0000000000133711,1.145430565781299E-5,96.128334332919451,-57.540381894437303,122.4596181055627,null,1000000000,2.0891811599999999,null,92.311506019465781,-57.478971407757584,null,53.430930322994286,-6.166711132147204E-2,null,0,0,null,0,0]
[1.5849,1.5849E-3,1.0000006828209942,1.1686065253845412E-3,1.0000000000004958,9.9582203819667106E-7,1,0,1.9906056015887399,1.0444706734548179,1.0000000857239988,4.1406277981890122E-4,1.0000000000291993,7.6419106897333245E-6,1.0000000000424099,9.2097605378007458E-6,15.124293785446461,4.2985388498415901E-6,1.0000000000160765,1.2559795929914912E-5,95.544348023436328,-59.887812678511921,120.11218732148808,null,1000000000,2.51190801,null,91.727520708063025,-59.820475281995577,null,53.430929324865019,-6.761878879164257E-2,null,0,0,null,0,0]
[1.7378,1.7378000000000001E-3,1.0000008209235045,1.2813453421922994E-3,1.000000000000596,1.0918919414335663E-6,1,0,2.1358106683393219,1.0835365955266514,1.0000001030619305,4.5400863805425293E-4,1.000000000035105,8.3791484614589473E-6,1.0000000000509872,1.0098253430814951E-5,15.124293785473913,4.7132316318037793E-6,1.0000000000193281,1.3771476665437082E-5,94.932796381881133,-62.130374881540305,117.86962511845969,null,1000000000,3.0199488400000001,null,91.115970266018735,-62.056541253580583,null,53.430928125295381,-7.4142166981748719E-2,null,0,0,null,0,0]
[1.9055,1.9055000000000001E-3,1.0000009870086866,1.404996708024422E-3,1.0000000000007168,1.1972609589144282E-6,1,0,2.2983190601209533,1.1206463236570035,1.0000001239129195,4.9782106559254958E-4,1.0000000000422073,9.1877473778538528E-6,1.000000000061303,1.1072748251976958E-5,15.124293785506925,5.168064722286355E-6,1.0000000000232383,1.5100442390410608E-5,94.295843775684745,-64.261266780735781,115.73873321926422,null,1000000000,3.63093025,null,90.479019102380889,-64.180308118871466,null,53.430926682666211,-8.1296975310298503E-2,null,0,0,null,0,0]
[2.0893000000000002,2.0893000000000001E-3,1.0000011866007918,1.5405191453578509E-3,1.0000000000008615,1.3127459047282461E-6,1,0,2.4795621234178338,1.1556793075584666,1.0000001489705037,5.4583969297697594E-4,1.0000000000507425,1.0073975647568003E-5,1.0000000000736995,1.214079922469917E-5,15.1242937855466,5.6665639591993055E-6,1.0000000000279377,1.6556995164722691E-5,93.636548760658314,-66.273617485095684,113.72638251490432,null,1000000000,4.3651744900000002,null,89.819725820942239,-66.184849754918005,null,53.430924948993535,-8.913867653440434E-2,null,0,0,null,0,0]
[2.2909000000000002,2.2909000000000002E-3,1.000001426642763,1.689166106032685E-3,1.0000000000010361,1.439414920376006E-6,1,0,2.6813585520119063,1.188615034873951,1.0000001791063302,5.9850865242829822E-4,1.0000000000610074,1.1046030158835785E-5,1.0000000000886085,1.3312284948828261E-5,15.124293785594311,6.2133400536556694E-6,1.0000000000335891,1.8154606912841343E-5,92.956948973692036,-68.166298972231829,111.83370102776817,null,1000000000,5.2482228100000006,null,89.140128118896769,-68.068965912974946,null,53.430922863970622,-9.773979883882368E-2,null,0,0,null,0,0]
[2.5118999999999998,2.5118999999999996E-3,1.0000017151717004,1.8521173013179048E-3,1.0000000000012454,1.5782733155056895E-6,1,0,2.9054271286547966,1.2194273415650623,1.0000002153294123,6.5624595038177476E-4,1.0000000000733458,1.211162562999318E-5,1.000000000106529,1.4596502930098304E-5,15.124293785651664,6.8127324984673267E-6,1.0000000000403824,1.9905957093091362E-5,92.259844872603679,-69.937856622466754,110.06214337753325,null,1000000000,6.309641609999999,null,88.443026523869449,-69.831133996081846,null,53.43092035778686,-0.10716860357983975,null,0,0,null,0,0]
[2.7542,2.7542000000000001E-3,1.00000206202432,2.0307736341964007E-3,1.0000000000014975,1.7305148953242725E-6,1,0,3.1537875385891416,1.2481482914319459,1.0000002588746959,7.1954796929471086E-4,1.0000000000881781,1.3279923289063006E-5,1.0000000001280718,1.6004493956566494E-5,15.124293785720608,7.4698944413481948E-6,1.0000000000485489,2.1826102562234449E-5,91.547393327843608,-71.590180363291807,108.40981963670819,null,1000000000,7.5856176399999997,null,87.730577991748504,-71.473163208944101,null,53.430917345000239,-0.11750615088031729,null,0,0,null,0,0]
[3.02,3.0200000000000001E-3,1.0000024792289273,2.2267571960944491E-3,1.0000000000018003,1.8975219605977226E-6,1,0,3.4287720245301521,1.2748453626255221,1.0000003112522706,7.8898946750097297E-4,1.0000000001060192,1.4561530873753999E-5,1.0000000001539844,1.7549042098611521E-5,15.124293785803538,8.1907926849140592E-6,1.0000000000583715,2.3932477575469989E-5,90.821266609847328,-73.127197552621695,106.87280244737831,null,1000000000,9.1204000000000001,null,87.0044548974424,-72.998887441375004,null,53.430913721132598,-0.1288462994423156,null,0,0,null,0,0]
[3.3113000000000001,3.3113000000000001E-3,1.0000029805725263,2.4415425956979724E-3,1.0000000000021645,2.0805511483859983E-6,1,0,3.732509796649647,1.2995667733949687,1.0000003741930241,8.6509295169231721E-4,1.000000000127458,1.5966091781977637E-5,1.0000000001851228,1.9241769238386101E-5,15.124293785903189,8.9808515951783272E-6,1.0000000000701754,2.6240931455711301E-5,90.084015881971794,-74.551726477592723,105.44827352240728,null,1000000000,10.964707690000001,null,86.267208524056286,-74.411040010648904,null,53.430909366429951,-0.14127437421937997,null,0,0,null,0,0]
[3.6307999999999998,3.6308E-3,1.0000035834979337,2.6771205548514702E-3,1.0000000000026021,2.2812989187200426E-6,1,0,4.0678630745583799,1.3224211554606629,1.0000004498868156,9.4856380590787681E-4,1.000000000153241,1.7506624600914441E-5,1.0000000002225704,2.1098364916796457E-5,15.124293786023037,9.8473940662590949E-6,1.0000000000843712,2.8772860788891353E-5,89.33670390770159,-75.870066317013055,104.12993368298694,null,1000000000,13.182708639999998,null,85.519901786575488,-75.715805386253379,null,53.430904129384089,-0.15490556390558638,null,0,0,null,0,0]
[3.9811000000000001,3.9811000000000004E-3,1.0000043083256318,2.9354080342758274E-3,1.0000000000031286,2.5013988997777836E-6,1,0,4.4375988688582826,1.3434970500084018,1.0000005408847861,1.0400812874870151E-3,1.0000000001842366,1.9195665747840779E-5,1.0000000002675895,2.3133937580626164E-5,15.124293786167112,1.0797471773972346E-5,1.0000000001014366,3.1548869694804851E-5,88.581064079249472,-77.087362365921877,102.91263763407812,null,1000000000,15.849157210000001,null,84.7642682537073,-76.918218404158551,null,53.430897833491883,-0.1698507891889656,null,0,0,null,0,0]
[4.3651999999999997,4.3651999999999996E-3,1.0000051797697056,3.2186168915626276E-3,1.0000000000037614,2.7427360471491227E-6,1,0,4.8449125494181517,1.3628999063552254,1.0000006502896801,1.1404291540012693E-3,1.0000000002215024,2.1047680319608354E-5,1.0000000003217151,2.536592005307715E-5,15.124293786340331,1.1839221267335537E-5,1.0000000001219544,3.4592732157835143E-5,87.81829945455442,-78.209739799549638,101.79026020045036,null,1000000000,19.054971039999998,null,84.001511198045463,-78.024276787978167,null,53.430890264088021,-0.18623803432351307,null,0,0,null,0,0]
[4.7862999999999998,4.7862999999999994E-3,1.0000062273283175,3.5291064028045065E-3,1.0000000000045219,3.0073209801299339E-6,1,0,5.2932197972430268,1.3807331558680733,1.0000007818048724,1.2504434118066452E-3,1.0000000002662994,2.3078097752848186E-5,1.0000000003867788,2.7812907345545897E-5,15.124293786548558,1.2981321531965464E-5,1.0000000001466185,3.7929807094667157E-5,87.04961178401085,-79.243213729279148,100.75678627072085,null,1000000000,22.908667689999998,null,83.232832626190557,-79.039859702919628,null,53.430881164953803,-0.20420381363109816,null,0,0,null,0,0]
[5.2481,5.2481000000000003E-3,1.0000074869659958,3.8696044458955809E-3,1.0000000000054365,3.2974784772810484E-6,1,0,5.7864772363747274,1.3971076259702377,1.0000009399455787,1.3710906916913675E-3,1.0000000003201654,2.5304758333655057E-5,1.0000000004650151,3.0496399939942391E-5,15.12429378679894,1.423380764497987E-5,1.0000000001762759,4.1589415752726291E-5,86.275715799693529,-80.194236922790125,99.805763077209875,null,1000000000,27.542553609999999,null,82.458947582585978,-79.97126273090764,null,53.430870223705313,-0.22390596978598881,null,0,0,null,0,0]
[5.7544000000000004,5.7544000000000007E-3,1.0000090012209641,4.2429125483021109E-3,1.0000000000065361,3.6155961490162457E-6,1,0,6.328757337528633,1.4121224293126964,1.0000011300523408,1.5033637461810683E-3,1.0000000003849199,2.7745984517996719E-5,1.0000000005590659,3.3438479412244672E-5,15.124293787099933,1.5606985901793316E-5,1.0000000002119283,4.5601671845603083E-5,85.497620399420171,-81.068593715570927,98.931406284429073,null,1000000000,33.113119360000006,null,81.680865334511793,-80.824108777815596,null,53.430857070862075,-0.24550660707707136,null,0,0,null,0,0]
[6.3095999999999997,6.3095999999999994E-3,1.000010821926717,4.6522745238742691E-3,1.0000000000078584,3.9644385968672308E-6,1,0,6.9247831493657479,1.4258807881621571,1.0000013586327237,1.648412075528373E-3,1.0000000004627791,3.0422991781187451E-5,1.0000000006721506,3.6664713903029506E-5,15.124293787461845,1.7112789907619791E-5,1.0000000002547957,5.0001443883785324E-5,84.715851889528366,-81.872320576967084,98.127679423032916,null,1000000000,39.811052159999996,null,80.899112638498934,-81.604247397928475,null,53.430841256208737,-0.26919342176619032,null,0,0,null,0,0]
[6.9183000000000003,6.9183000000000005E-3,1.0000130106573319,5.1010815067339399E-3,1.0000000000094478,4.346896086071622E-6,1,0,7.5795008768936194,1.4384757279049549,1.000001633417245,1.807437424400433E-3,1.0000000005563767,3.3357959938293364E-5,1.0000000008080936,4.0201833741020095E-5,15.124293787896907,1.8763695704267954E-5,1.0000000003063287,5.4825185310086026E-5,83.931146673375352,-82.610875288912624,97.389124711087376,null,1000000000,47.862874890000008,null,80.114426432694827,-82.316940969189204,null,53.430822244928898,-0.2951626345549388,null,0,0,null,0,0]
[7.5857999999999999,7.5858000000000002E-3,1.0000156423739117,5.5932405654082777E-3,1.0000000000113589,4.766298704837907E-6,1,0,8.2986173147379354,1.4500007730314814,1.0000019638172035,1.9818244068595357E-3,1.000000000668918,3.6576443993599634E-5,1.0000000009715513,4.4080636913605635E-5,15.124293788420026,2.0574077861642619E-5,1.0000000003682914,6.0114896830380942E-5,83.143824078196232,-83.289763674853731,96.710236325146269,null,1000000000,57.544361639999998,null,79.327126695390234,-82.967470181836205,null,53.430799385935011,-0.32364031964363288,null,0,0,null,0,0]
[8.3176000000000005,8.3176000000000014E-3,1.0000188059493149,6.1328059809425232E-3,1.0000000000136562,5.2261022050804225E-6,1,0,9.0880623988719051,1.4605386106092535,1.000002360990607,2.1730098765885535E-3,1.000000000804204,4.0104963291113103E-5,1.0000000011680434,4.8333083596269033E-5,15.124293789048867,2.2558853386238123E-5,1.0000000004427767,6.5914164082897097E-5,82.354488801368731,-83.913876164544092,96.086123835455908,null,1000000000,69.182469760000004,null,78.537818895837731,-83.560491849658504,null,53.430771907314465,-0.35486106949851093,null,0,0,null,0,0]
[9.1201000000000008,9.1201000000000008E-3,1.0000226098444212,6.7244952858979056E-3,1.0000000000164184,5.7303278253902794E-6,1,0,9.9547438182996455,1.470171985588115,1.000002838554874,2.3826658009387029E-3,1.0000000009668728,4.3974376703810631E-5,1.0000000014043073,5.2996363811304073E-5,15.124293789804989,2.4735380249239481E-5,1.0000000005323384,7.2273704901250235E-5,81.563284152493765,-84.48813149973229,95.51186850026771,null,1000000000,83.176224010000013,null,77.746647285627674,-84.100652880473973,null,53.430738867031629,-0.3890978543431714,null,0,0,null,0,0]
[10,0.01,1.0000271829996994,7.3732467679770066E-3,1.0000000000197393,6.2831852999173176E-6,1,0,10.905900262857889,1.4789738649370516,1.0000034126988726,2.6125425038601049E-3,1.000000001162439,4.8216989614233795E-5,1.0000000016883517,5.8109410863113912E-5,15.124293790714027,2.7121830076712929E-5,1.0000000006400129,7.9246614517598313E-5,80.770620746999555,-85.01689649899663,94.98310350100337,null,1000000000,100,null,76.954023600027895,-84.592035538440996,null,53.430699145192087,-0.42663641815403525,null,0,0,null,0,0]
[10.965,1.0964999999999999E-2,1.0000326823636654,8.0847354410812297E-3,1.0000000000237326,6.8895126813409956E-6,1,0,11.949857585759171,1.4870153422003911,1.0000041031282436,2.8646515369262289E-3,1.0000000013976147,5.2869929103718208E-5,1.000000002029926,6.3716968996895023E-5,15.124293791807181,2.9739086677703871E-5,1.0000000007694954,8.6893912825695494E-5,79.976554819626358,-85.504458402417484,94.495541597582516,null,1000000000,120.23122499999999,null,76.16000543684433,-85.0386000574143,null,53.430651378663363,-0.46780513425908515,null,0,0,null,0,0]
[12.023,1.2022999999999999E-2,1.0000392934755953,8.8647830194336068E-3,1.0000000000285336,7.5542736860463008E-6,1,0,13.095163858624117,1.494357842939728,1.0000049331387773,3.1410566685405325E-3,1.000000001680335,5.7971286593177891E-5,1.0000000024405551,6.9864944645686754E-5,15.124293793121334,3.2608576297822814E-5,1.0000000009251548,9.5278204651770619E-5,79.181540455918025,-85.95455603232638,94.04544396767362,null,1000000000,144.55252899999999,null,75.365048492956518,-85.443749800089606,null,53.43059395603089,-0.51294086490553747,null,0,0,null,0,0]
[13.183,1.3183E-2,1.0000472412661499,9.7200212390513192E-3,1.000000000034305,8.2831231808005649E-6,1,0,14.351562781280542,1.501060997058975,1.0000059309727181,3.4441090007139873E-3,1.00000000202022,6.3564457372094818E-5,1.0000000029342118,7.6605636277216478E-5,15.124293794701199,3.5754708583939391E-5,1.000000001112288,1.0447081194989936E-4,78.385714929430307,-86.370855843718886,93.629144156281114,null,1000000000,173.79148899999998,null,74.569291995308404,-85.810769086442164,null,53.430524923810751,-0.56242734302541575,null,0,0,null,0,0]
[14.454000000000001,1.4454E-2,1.0000567893701919,1.0657080537851315E-2,1.0000000000412388,9.0817160323703215E-6,1,0,15.728802485978218,1.5071757863811837,1.0000071297329387,3.7761595776947803E-3,1.0000000024285458,6.9692836729587807E-5,1.0000000035272727,8.3991342358575899E-5,15.124293796599193,3.9201893182861358E-5,1.0000000013371031,1.1454305667447051E-4,77.5897131376923,-86.756528721989639,93.243471278010361,null,1000000000,208.91811600000003,null,73.77337313086602,-86.142446741221931,null,53.4304419924539,-0.61664822717509682,null,0,0,null,0,0]
[15.849,1.5848999999999999E-2,1.0000682797916596,1.1685538650620018E-2,1.000000000049583,9.9582203816408286E-6,1,0,17.240970567449121,1.5127623814402458,1.0000085723635188,4.1406043716526479E-3,1.0000000029199398,7.6419106750061374E-5,1.0000000042409845,9.2097605120221667E-5,15.124293798883309,4.2985388473331766E-5,1.0000000016076536,1.2559795942616292E-4,76.792304835545821,-87.115383091663688,92.884616908336312,null,1000000000,251.19080099999999,null,72.976064624401502,-86.442039298621907,null,53.430342191884478,-0.67615771578139428,null,0,0,null,0,0]
[17.378,1.7378000000000001E-2,1.0000820890148501,1.2812759245228776E-2,1.0000000000596114,1.0918919413906073E-5,1,0,18.898907934036981,1.5178584943411917,1.0000103061404795,4.5400554988601185E-3,1.0000000035105063,8.3791484420450121E-5,1.0000000050987361,1.0098253396832654E-4,15.124293801628404,4.7132316284970926E-5,1.0000000019328064,1.3771476682180515E-4,75.994699978336968,-87.449857108720607,92.550142891279393,null,1000000000,301.99488400000001,null,72.178579700427235,-86.711560602491005,null,53.430222252776069,-0.74138189643224472,null,0,0,null,0,0]
[19.055,1.9054999999999999E-2,1.0000986960469145,1.404905193765175E-2,1.0000000000716716,1.1972609588577937E-5,1,0,20.717795495938418,1.5225098813219657,1.0000123912159435,4.9781699434663746E-3,1.0000000042207351,9.1877473522596826E-5,1.0000000061302876,1.1072748207176732E-4,15.124293804929716,5.1680647179270162E-5,1.0000000023238425,1.5100442412484155E-4,75.196437202696103,-87.762960814947505,92.237039185052495,null,1000000000,363.09302500000001,null,71.380461154824175,-86.953426630076919,null,53.430078015674255,-0.81291731930740352,null,0,{"$f":"IF(AH45>0,W43,0)","v":0},null,0,0]
[20.893000000000001,2.0893000000000002E-2,1.0001186531103166,1.5403985157771595E-2,1.0000000000861651,1.3127459046535914E-5,1,0,22.711733363810779,1.5267519830834821,1.0000148969405209,5.4583432634801414E-3,1.0000000050742492,1.0073975613830213E-4,1.0000000073699502,1.2140799165644294E-4,15.124293808897052,5.666563953452902E-5,1.0000000027937683,1.6556995193819655E-4,74.398150856722395,-88.057085210408388,91.942914789591612,null,1000000000,436.51744900000006,null,70.582348130331255,-87.169477024242866,null,53.429904685704336,-0.89131764970209792,null,0,0,null,0,0]
[22.909000000000002,2.2909000000000002E-2,1.0001426542029521,1.6890070840478374E-2,1.0000000001035958,1.4394149202775887E-5,1,0,24.899164010961066,1.530623531202399,1.0000179104742362,5.9850157759896586E-3,1.000000006100739,1.104603011435908E-4,1.0000000088608465,1.3312284870975905E-4,15.124293813668421,6.2133400460801546E-5,1.0000000033589307,1.8154606951200025E-4,73.599278884681837,-88.334920705654355,91.665079294345645,null,1000000000,524.82228100000009,null,69.783684596446605,-87.361681225909251,null,53.429696237338888,-0.97730687552435147,null,0,0,null,0,0]
[25.119,2.5118999999999999E-2,1.0001715026105609,1.851907682326176E-2,1.0000000001245475,1.5782733153759537E-5,1,0,27.297448232249213,1.5341546672858877,1.000021532711723,6.562366242252044E-3,1.0000000073345736,1.2111625571362996E-4,1.0000000106528948,1.45965028274716E-4,15.124293819403576,6.8127324884811159E-5,1.0000000040382524,1.990595714365663E-4,72.800314104652713,-88.598637377876045,91.401362622123955,null,1000000000,630.96416099999999,null,68.984970344595325,-87.53153121678038,null,53.429445696889211,-1.071565932991988,null,0,0,null,0,0]
[27.542000000000002,2.7542000000000001E-2,1.00020618138921,2.0304973272773499E-2,1.000000000149734,1.7305148951532557E-5,1,0,29.927204745114697,1.537375691982821,1.0000258871378693,7.1953567567444076E-3,1.000000008817818,1.3279923211777041E-4,1.0000000128071913,1.6004493821284569E-4,15.12429382629805,7.4698944281844295E-5,1.0000000048548936,2.1826102628889291E-4,72.001168685779561,-88.850497269462139,91.149502730537861,null,1000000000,758.56176400000004,null,68.186126077016837,-87.680484038080166,null,53.429144530842059,-1.1749031966381618,null,0,0,null,0,0]
[30.2,3.0199999999999998E-2,1.0002478924747207,2.2263929421903441E-2,1.0000000001800293,1.8975219603722601E-5,1,0,32.812311098428587,1.5403152411067516,1.0000311247475335,7.8897326017210879E-3,1.0000000106019089,1.4561530771863183E-4,1.0000000153984439,1.7549041920261082E-4,15.124293834590929,8.1907926675594604E-5,1.0000000058371743,2.3932477663345136E-4,71.201438642859941,-89.092749708924828,90.907250291075172,null,1000000000,912.04,null,67.386758240270481,-87.809857298429449,null,53.42878230692407,-1.2882542923596316,null,0,0,null,0,0]
[33.113,3.3112999999999997E-2,1.0002980132908761,2.4410624726034658E-2,1.0000000002164346,2.0805511480887976E-5,1,0,35.974476204783841,1.542995259658325,1.0000374186093466,8.6507158767653112E-3,1.0000000127458042,1.5966091647667187E-4,1.0000000185122839,1.92417690032881E-4,15.124293844556265,8.98085157230184E-5,1.0000000070175554,2.6240931571546572E-4,70.4019049017584,-89.327204254096799,90.672795745903201,null,1000000000,1096.470769,null,66.587659712863854,-87.920614674740378,null,53.428347071905776,-1.4124686519904044,null,0,0,null,0,0]
[36.308,3.6308E-2,1.0003582862509328,2.6764876589683437E-2,1.0000000002602163,2.2812989183282459E-5,1,0,39.443009511642948,1.5454405749702063,1.0000449876797346,9.4853564216964073E-3,1.0000000153240951,1.7506624423854143E-4,1.0000000222570498,2.1098364606868806E-4,15.124293856540772,9.8473940361012261E-5,1.0000000084371048,2.8772860941595992E-4,69.601935980552526,-89.556028886638828,90.443971113361172,null,1000000000,1318.2708640000001,null,65.788214130505182,-88.013782201424078,null,53.42782370741466,-1.5486930165134236,null,0,0,null,0,0]
[39.811,3.9810999999999999E-2,1.0004307407224831,2.9345737838779466E-2,1.0000000003128497,2.5013988992612919E-5,1,0,43.246137077075801,1.5476708130561023,1.000054087030533,1.0400441606638652E-2,1.000000018423679,1.9195665514428622E-4,1.0000000267589531,2.3133937172059804E-4,15.124293870948375,1.079747173421632E-4,1.0000000101436666,3.154886989610982E-4,68.80184039376536,-89.781064289100598,90.218935710899402,null,1000000000,1584.9157210000001,null,64.988747610617196,-88.09010266140946,null,53.427194609686737,-1.698029901736188,null,0,0,null,0,0]
[43.652000000000001,4.3652000000000003E-2,1.0005178442307343,3.217517243361883E-2,1.00000000037613,2.74273604646825E-5,1,0,47.416429232397391,1.5497050265740973,1.000065026874901,1.1403802116070441E-2,1.0000000221502421,2.104768001190896E-4,1.0000000321714946,2.5365919514477858E-4,15.124293888270326,1.1839221214926505E-4,1.0000000121954293,3.4592732423208719E-4,68.001548683171606,-90.004227378446586,89.995772621553414,null,1000000000,1905.497104,null,64.189212093024651,-88.150227314310214,null,53.426438379620805,-1.8617502913783306,null,0,0,null,0,0]
[47.863,4.7863000000000003E-2,1.000622540992071,3.5276570103748073E-2,1.0000000004521989,3.007320979232395E-5,1,0,51.988629354817114,1.5515601652202342,1.0000781774619447,1.2503788960792312E-2,1.0000000266299294,2.3078097347233238E-4,1.00000003867789,2.7812906635554503E-4,15.124293909092978,1.2981321462878924E-4,1.0000000146618457,3.7929807444487434E-4,67.20116357718193,-90.227367492385042,89.772632507614958,null,1000000000,2290.8667689999997,null,63.389735829528313,-88.194657668913408,null,53.425529492572096,-2.0412076958201797,null,0,0,null,0,0]
[52.481000000000002,5.2481E-2,1.0007484193365579,3.867694037067046E-2,1.0000000005436682,3.2974784760978443E-5,1,0,57.002911159942443,1.5532524631684483,1.0000939901849644,1.3710056437448636E-2,1.0000000320165392,2.5304757798942353E-4,1.0000000465015195,3.0496399003977325E-4,15.124293934131222,1.4233807553904693E-4,1.0000000176275934,4.1589416213886173E-4,66.400434915966827,-90.45242828208697,89.54757171791303,null,1000000000,2754.255361,null,62.590099756145747,-88.223780946144629,null,53.424436851163847,-2.237965114493345,null,0,0,null,0,0]
[57.544000000000004,5.7544000000000005E-2,1.0008997213982085,4.2403946362569334E-2,1.0000000006536267,3.6155961474565005E-5,1,0,62.500535547563523,1.5547957811661282,1.0001129989135584,1.5032516353262859E-2,1.000000038491982,2.7745983813118097E-4,1.0000000559065938,3.3438478178419946E-4,15.12429396423062,1.5606985781734556E-4,1.0000000211928286,4.5601672453521568E-4,65.599552816358596,-90.681240622802818,89.318759377197182,null,1000000000,3311.3119360000005,null,61.79053073306055,-88.237833901597426,null,53.423123710235473,-2.4536234137845327,null,0,0,null,0,0]
[63.095999999999997,6.3095999999999999E-2,1.0010816135834255,4.6489559597300396E-2,1.0000000007858385,3.9644385948110604E-5,1,0,68.529279629761035,1.5562035060616162,1.0001358541364818,1.6482642869143867E-2,1.0000000462779204,3.042299085196504E-4,1.00000006721506,3.6664712276511757E-4,15.124294000421514,1.7112789749349576E-4,1.0000000254795938,5.00014446851878E-4,64.798324393390473,-90.915768674244376,89.084231325755624,null,1000000000,3981.1052159999995,null,60.990880600587907,-88.236938279753915,null,53.421545342300369,-2.6900328209250004,null,0,0,null,0,0]
[69.183000000000007,6.9183000000000008E-2,1.0013002288994588,5.0967080189125116E-2,1.0000000009447751,4.3468960833611077E-5,1,0,75.139093382094487,1.5574872824961923,1.0001633285197935,1.8072426108308167E-2,1.0000000556376731,3.3357958713360305E-4,1.0000000808093685,4.0201831596888249E-4,15.12429404392787,1.8763695495630691E-4,1.0000000306328665,5.4825186366522433E-4,63.996870675300045,-91.157924369053106,88.842075630946894,null,1000000000,4786.2874890000012,null,60.191323442587702,-88.221086994045251,null,53.419648689117224,-2.9491205222141734,null,0,0,null,0,0]
[75.858000000000004,7.5858000000000009E-2,1.0015630280969532,5.5874769404362472E-2,1.0000000011358801,4.7662987012647048E-5,1,0,82.387528993451582,1.558658269396576,1.0001963626340491,1.9815675992953675E-2,1.0000000668918105,3.6576442378801095E-4,1.0000000971551228,4.4080634087050432E-4,15.12429409623978,2.0574077586601344E-4,1.0000000368291464,6.0114898223054519E-4,63.194967597559426,-91.40977541412235,88.59022458587765,null,1000000000,5754.4361640000006,null,59.391699686684532,-88.190142795544745,null,53.417369255345108,-3.2331008833766099,null,0,0,null,0,0]
[83.176000000000002,8.3176E-2,1.0018788475805698,6.1252111241304953E-2,1.0000000013656072,5.2261022003701317E-5,1,0,90.334311402583552,1.5597261098450392,1.0002360714745528,2.1726713624276275E-2,1.0000000804204008,4.0104961162443453E-4,1.0000001168043418,4.8333079870230088E-4,15.124294159123885,2.2558853023671525E-4,1.0000000442776908,6.5914165918755743E-4,62.392748705514464,-91.673344467378314,88.326655532621686,null,1000000000,6918.2469760000004,null,58.592219183267574,-88.143852847959039,null,53.414630732160553,-3.5442591636213514,null,0,0,null,0,0]
[91.201000000000008,9.1201000000000004E-2,1.0022584596822883,6.7144878054492971E-2,1.0000000016418329,5.7303278191808406E-5,1,0,99.048939665185216,1.5607001360388217,1.0002838156146141,2.3822195733451082E-2,1.0000000966872857,4.3974373897647158E-4,1.0000001404307193,5.299635889937502E-4,15.124294234736237,2.4735379771278441E-4,1.0000000532338811,7.2273707321409374E-4,61.589930934624391,-91.950867499790164,88.049132500209836,null,1000000000,8317.6224010000005,null,57.792691788012853,-88.08181516721541,null,53.411340194733341,-3.8852446808827183,null,0,0,null,0,0]
[100,0.1,1.0027146522472969,7.3600615835055283E-2,1.0000000019739208,6.2831852917316603E-5,1,0,108.60417144078941,1.5615884472289998,1.0003412122566873,2.6119543006151453E-2,1.0000001162438978,4.8216985914979759E-4,1.0000001688351676,5.8109404387912688E-4,15.124294325640024,2.7121829446635835E-4,1.0000000640013245,7.9246617707998037E-4,60.786543125113596,-92.244569240548913,87.755430759451087,null,1000000000,10000,null,56.993256484586496,-88.003514184042814,null,53.407387494137112,-4.2588096291412025,null,0,0,null,0,0]
[109.65,0.10965000000000001,1.0032629662988504,8.0673644714674211E-2,1.0000000023732691,6.8895126705495553E-5,1,0,119.08362453331945,1.5623987678762659,1.0004102295220203,2.8638761526235696E-2,1.0000001397614606,5.286992422686087E-4,1.000000202992587,6.3716960460408483E-4,15.124294434955257,2.9739085847050955E-4,1.0000000769495836,8.6893917031711989E-4,59.982283131567641,-92.556898109881033,87.443101890118967,null,1000000000,12023.122500000001,null,56.193744769516591,-87.90826748547866,null,53.402638981753334,-4.6680985125463188,null,0,0,null,0,0]
[120.23,0.12023,1.0039217347566469,8.8419011900424782E-2,1.0000000028533524,7.5542736718199971E-5,1,0,130.57308929646084,1.5631377060086349,1.00049319347462,3.1400345859724253E-2,1.0000001680334898,5.7971280164041043E-4,1.0000002440554956,6.9864933392079062E-4,15.124294566370382,3.260857520277717E-4,1.0000000925155521,9.5278210196540986E-4,59.17726912421729,-92.890253265069035,87.109746734930965,null,1000000000,14455.252900000001,null,55.394432120514338,-87.795301256227205,null,53.396937342209199,-5.1162983297089637,null,0,0,null,0,0]
[131.83000000000001,0.13183,1.0047131313980595,9.6898856592404242E-2,1.0000000034305063,8.2831231620464636E-5,1,0,143.17030218066768,1.5638115812441322,1.0005929232516255,3.4427617831990179E-2,1.0000002020219922,6.3564448896759947E-4,1.0000002934211336,7.660562144192922E-4,15.124294724357039,3.5754707140374094E-4,1.0000001112288923,1.0447081925940036E-3,58.371305104019626,-93.247267374420716,86.752732625579284,null,1000000000,17379.148900000004,null,54.595312353650812,-87.663666205164986,null,53.390092750822504,-5.6070070190697701,null,0,0,null,0,0]
[144.54,0.14454,1.005663063128831,0.10617406847090573,1.0000000041238783,9.0817160076520718E-5,1,0,156.97300011241248,1.5644257613898069,1.0007127218493135,3.7743841782322124E-2,1.0000002428545458,6.9692825558943057E-4,1.000000352727219,8.3991322805399232E-4,15.124294914156485,3.9201891280216095E-4,1.0000001337104278,1.1454306630852423E-3,57.56469608579097,-93.630450273020784,86.369549726979216,null,1000000000,20891.811599999997,null,53.796911535274575,-87.512361800105865,null,53.381884144846055,-6.1437509268760859,null,0,0,null,0,0]
[158.49,0.15849000000000002,1.0068050578661669,0.116333056048772,1.0000000049583075,9.9582203490527213E-5,1,0,172.12235941551782,1.5649864736813899,1.0008568729105458,4.1382641246832712E-2,1.0000002919939524,7.6419092022879181E-4,1.0000004240983558,9.2097579341657071E-4,15.124295142568171,4.2985385964917504E-4,1.0000001607655506,1.2559797212752914E-3,56.755842591971096,-94.043364883019933,85.956635116980067,null,1000000000,25119.080100000003,null,52.997915567738261,-87.339854262729261,null,53.372026129817847,-6.7316498343539912,null,0,0,null,0,0]
[173.78,0.17377999999999999,1.0081758164281907,0.12744017416267026,1.00000000596114,1.0918919370947195E-4,1,0,188.72697769508366,1.5654976424649139,1.0010300888172772,4.5369711438856583E-2,1.000000351050583,8.3791465006522272E-4,1.0000005098734819,1.0098249998605005E-3,15.124295417077487,4.7132312978284343E-4,1.0000001932809039,1.377147835652238E-3,55.945593880734449,-94.488502763055038,85.511497236944962,null,1000000000,30199.488400000002,null,52.199484282226443,-87.144923840365507,null,53.360208116710908,-7.3744328071401428,null,0,0,null,0,0]
[190.55,0.19055000000000002,1.009821857296562,0.13958606400039925,1.0000000071671689,1.1972609531943525E-4,1,0,206.93889199749918,1.5659639635676961,1.0012383625006225,4.9741047399970463E-2,1.0000004220734202,9.1877447928438369E-4,1.0000006130285815,1.1072743727157327E-3,15.124295747208606,5.1680642819932569E-4,1.0000002323846244,1.5100444619835743E-3,55.133068126385766,-94.969336305431,85.030663694569,null,1000000000,36309.302500000005,null,51.401127971243397,-86.925815896743259,null,53.346037966946412,-8.0773517298849704,null,0,0,null,0,0]
[208.93,0.20893,1.0117964369967685,0.15285044443439605,1.0000000086165091,1.3127458971881422E-4,1,0,226.89927994351055,1.5663890706873671,1.0014885971872491,5.4529862067924054E-2,1.000000507424798,1.0073972240053294E-3,1.0000007369947574,1.214079326016184E-3,15.124296143942225,5.6665633788126519E-4,1.0000002793773783,1.6556998103511137E-3,54.318450843346767,-95.488805479558749,84.511194520441251,null,1000000000,43651.744900000005,null,50.603477816601881,-86.680871580158765,null,53.329069989637425,-8.8450285042222436,null,0,0,null,0,0]
[229.09,0.22909000000000002,1.0141660986310757,0.16733716633433782,1.0000000103595765,1.4394149104358475E-4,1,0,248.79275882644549,1.5667769063851327,1.0017894623750827,5.9779561120415894E-2,1.0000006100737253,1.1046025666691783E-3,1.0000008860842604,1.3312277085748749E-3,15.124296621079024,6.2133392885289213E-4,1.0000003358938625,1.8154610787060289E-3,53.500648272605375,-96.050687282853019,83.949312717146981,null,1000000000,52482.2281,null,49.805993564865567,-86.407876784932455,null,53.308750649678281,-9.6834844154477011,null,0,0,null,0,0]
[251.19,0.25119000000000002,1.0170071108043992,0.18313668670571726,1.0000000124547332,1.5782733024023515E-4,1,0,272.79308642125181,1.5671305365331558,1.0021509809955642,6.5530641076300244E-2,1.0000007334571082,1.2111619708349837E-3,1.0000010652889217,1.459649256481409E-3,15.124297194594581,6.8127314898602624E-4,1.000000403826399,1.9905962200170938E-3,52.679571310758313,-96.658102585268026,83.341897414731974,null,1000000000,63096.416100000002,null,49.009213958494769,-86.104731094588047,null,53.284452067021846,-10.597969156564247,null,0,0,null,0,0]
[275.42,0.27542,1.0204119407957402,0.20035307252290177,1.000000014973409,1.730514878051529E-4,1,0,299.10660037117464,1.5674530309207857,1.0025854051342746,7.1831011818652396E-2,1.0000008817814241,1.3279915483188711E-3,1.0000012807183143,1.6004480293112884E-3,15.124297884041644,7.4698931118083228E-4,1.0000004854910356,2.1826109294353626E-3,51.854451660144321,-97.314543023721939,82.685456976278061,null,1000000000,75856.176400000011,null,48.213124371694398,-85.768917850339804,null,53.255420527964183,-11.594524755975524,null,0,0,null,0,0]
[302,0.30199999999999999,1.0244923816271465,0.21910141133830752,1.0000000180029478,1.8975219378260079E-4,1,0,327.97221827771631,1.5677472833280526,1.0031076943088848,7.8735855333535568E-2,1.0000010601903451,1.4561520582794542E-3,1.0000015398432076,1.7549024085250272E-3,15.124298713329273,8.190790932100418E-4,1.0000005837198434,2.3932486450829343E-3,51.02408949280516,-98.023720425649714,81.976279574350286,null,1000000000,91204,null,47.417425280310141,-85.397501935683266,null,53.2207556775424,-12.679837216365213,null,0,0,null,0,0]
[331.13,0.33112999999999998,1.0293743436512144,0.23946972530152616,1.000000021643465,2.0805511183687764E-4,1,0,359.60713816727264,1.5680155107801741,1.003734955994138,8.6294472719768811E-2,1.0000012745796218,1.5966078216642927E-3,1.0000018512267039,1.9241745493540233E-3,15.124299709862397,8.9808492846544076E-4,1.0000007017590065,2.6240943155025295E-3,50.188401458927181,-98.788083724968942,81.211916275031058,null,1000000000,109647.0769,null,46.623028235134868,-84.987840883436149,null,53.17946255651087,-13.859033446279078,null,0,0,null,0,0]
[363.08,0.36307999999999996,{"$f":"SQRT(1+(A77/pole1)^2)","v":1.0352149955880146},{"$f":"ATAN(A77/pole1)","v":0.2615787196942046},{"$f":"SQRT(1+(A77/Zero1)^2)","v":1.0000000260216233},{"$f":"ATAN(A77/Zero1)","v":2.2812988791485997E-4},{"$f":"IF(VIN_nom>Vout, 1, SQRT(1+(A77/z_RHP)^2))","v":1},{"$f":"IF(VIN_nom>Vout, 0, -ATAN(A77/z_RHP))","v":0},{"$f":"SQRT(1+(A77/Pole2)^2)","v":394.30457762186273},{"$f":"ATAN(A77/Pole2)","v":1.5682602135242609},{"$f":"SQRT(1+(A77/Zero2)^2)","v":1.0044887945298677},{"$f":"ATAN(A77/Zero2)","v":9.4573437423536397E-2},{"$f":"SQRT(1+(A77/pole4)^2)","v":1.0000015324083509},{"$f":"ATAN(A77/pole4)","v":1.7506606717856955E-3},{"$f":"IF(VOUT_setting=1,1,SQRT(1+(A77*zterm1)^2))","v":1.0000022257025347},{"$f":"IF(VOUT_setting=1,0,ATAN(((A77*zterm1))))","v":2.10983336141863E-3},15.12430090831278,{"$f":"IF(VOUT_setting=1,0,ATAN(A77*$Q$4/(1+Afbr-$Q$5*(A77)^2)))","v":9.84739102031576E-4},{"$f":"SQRT((1-(Z77/pterm2))^2+(A77/pterm1)^2)","v":1.0000008437155044},{"$f":"IF((ATAN((A77/pterm1)/(1-A77^2/pterm2))>0),ATAN((A77/pterm1)/(1-A77^2/pterm2)),PI()+ATAN((A77/pterm1)/(1-A77^2/pterm2)))","v":2.8772876211982314E-3},{"$f":"20*LOG10(((E77*K77*G77*O77)/(C77*I77*S77*M77*Q77))*Adc)","v":49.345706936842362},{"$f":"((F77+L77+H77+P77)-(D77+J77+T77+N77+R77))*radconv","v":-99.611017230165075},{"$f":"IF(V77>0,V77,V77+180)","v":80.388982769834925},null,{"$f":"IF(U77<0,A77,1000000000)","v":1000000000},{"$f":"A77^2","v":131827.0864},null,{"$f":"20*LOG10((K77/(I77*M77))*AEA)","v":45.829476638372142},{"$f":"(L77-(J77+N77))*radconv","v":-84.536338159261931},null,{"$f":"20*LOG10((E77*G77/(C77*S77))*Acs*Am)","v":53.130317066810036},{"$f":"(F77+H77-(D77+T77))*radconv","v":-15.139142223594082},null,{"$f":"SUM((U78<0)*(U77>0))*A77","v":0},{"$f":"IF(AH77>0,W75,0)","v":0},null,0,0]
[398.11,{"$f":"A78/1000","v":0.39811000000000002},1.0421932154133577,0.28552121848806644,1.0000000312849817,2.5013988476121885E-4,1,0,432.34689452906105,1.5684833672147886,1.0053943000869394,0.10363553886198229,1.0000018423662209,1.9195642173264772E-3,1.0000026758917606,2.3133896315555083E-3,15.124302349072321,1.0797467758616398E-3,1.0000010143739273,3.1548890026484333E-3,48.49516809460529,-100.49448935324911,79.505510646750892,null,1000000000,158491.57210000002,null,45.037289895598114,-84.0395812177062,null,53.071961884491152,-16.525590664681385,null,0,0,null,{"$f":"SUM((V79<-183)*(V78>-183))*A78","v":0},{"$f":"IF(AK78>0,U78,0)","v":0}]
[436.52,0.43651999999999996,1.0505216144428404,0.31139179805494105,1.0000000376130045,2.7427359783809734E-4,1,0,474.05988663363507,1.5686868871021098,1.0064818914564075,0.11355238086806407,1.0000022150217815,2.1047649242051042E-3,1.0000032171443269,2.536586565475619E-3,{"$f":"IF(VOUT_setting=1,1,SQRT((1+Afbr-$Q$5*(A79)^2)^2+(A79*$Q$4)^2))","v":15.124304081266382},1.1839215974027472E-3,1.0000012195534327,3.4592758960371849E-3,47.635405466944071,-101.44008109319877,78.559918906801229,null,1000000000,190549.71039999998,null,44.246660304804372,-83.493660073493345,null,53.002825141176785,-18.023923013559767,null,0,0,null,0,0]
[478.63,0.47863,1.0604465824089722,0.33926676333403705,1.0000000452198963,3.0073208894785077E-4,1,0,519.79107170021223,1.5688724757106591,1.0077877274309652,0.12439871748727027,1.0000026629894345,2.3078056785868018E-3,1.0000038677815972,2.7812835636744212E-3,15.124306163530033,1.2981314554231498E-3,1.0000014661997327,3.7929842426206993E-3,46.765077721063982,-102.44814422731037,77.551855772689635,null,1000000000,229086.67689999999,null,43.458006267244336,-82.894477583640764,null,52.921146977357417,-19.638644999945416,null,0,0,null,0,0]
[524.80999999999995,0.52481,1.0722592412574061,0.36921676855175195,1.0000000543668199,3.2974783577773914E-4,1,0,569.9422673138298,1.5690417622180386,1.0093556956833174,0.1362595496603782,1.0000032016488476,2.5304704327876988E-3,1.0000046501412374,3.0496305407992988E-3,15.124308667352111,1.4233798446398004E-3,1.0000017627812612,4.1589462329386971E-3,45.882318330354252,-103.51814130446742,76.48185869553258,null,1000000000,275425.53609999997,null,42.671464037368992,-82.237359110921219,null,52.82492445900747,-21.373959494972819,null,0,0,null,0,0]
[575.44000000000005,0.57544000000000006,1.0862896618771283,0.401272338437486,1.0000000653626755,3.6155959914819824E-4,1,0,624.92615113565648,1.5691961370365537,1.0112373903229233,0.14921901485207367,1.0000038491908783,2.7745913325581519E-3,1.0000055906439036,3.3438354796774517E-3,15.124311677288741,1.5606973775875767E-3,1.0000021193145521,4.5601733244597133E-3,44.985620135348498,-104.64727658564971,75.352723414350294,null,1000000000,331131.19360000006,null,41.887679373671631,-81.517668572679796,null,52.712004487244819,-23.231774300625368,null,0,0,null,0,0]
[630.96,0.63096000000000008,1.1029232545737171,0.43544743088458976,1.0000000785838639,3.9644383891940764E-4,1,0,685.22056059155011,1.5693369421639041,1.0134952752386097,0.16337217633483836,1.0000046277814394,3.0422897930239769E-3,1.0000067214836448,3.6664549626048686E-3,15.124315296373366,1.7112773922355257E-3,1.0000025480051908,5.0001524824210188E-3,44.07296300701789,-105.83120735413168,74.168792645868322,null,1000000000,398110.52160000004,null,41.107011055845334,-80.730157683548228,null,52.58000793289122,-25.213073093692284,null,0,0,null,0,0]
[691.83,0.69183000000000006,1.1225929090328721,0.47170490212449873,1.0000000944775234,4.3468958123097008E-4,1,0,751.32505310838098,1.5694653445640829,1.0162029185055617,0.17881343672982608,1.0000055637519827,3.3357836220871103E-3,1.0000080809045389,4.0201617185782468E-3,15.124319647002292,1.8763674631947318E-3,1.0000030633528902,5.4825292008220004E-3,43.142644320595672,-107.06270114621927,72.937298853780732,null,1000000000,478628.74890000006,null,40.330227417144265,-79.869611504897634,null,52.426463576042117,-27.315920004439832,null,0,0,null,0,0]
[758.58,0.75858000000000003,1.145796633383878,0.50997804320059925,1.0000001135880103,4.7662983439444384E-4,1,0,823.81520583482961,1.5695824620367624,1.0194490583831122,0.19564754702961454,1.0000066891589097,3.6576280900243591E-3,1.0000097154655712,4.4080351434824683E-3,15.124324878183399,2.0574050082542111E-3,1.0000036830103836,6.0115037487332938E-3,42.192598740244989,-108.33227198116813,71.667728018831866,null,1000000000,575443.61640000006,null,39.557880804405528,-78.930238698352881,null,52.248753415204085,-29.536714468913988,null,0,0,null,0,0]
[831.76,0.83175999999999994,1.1730824876951509,0.55013304674388308,1.0000001365607121,5.2261017293412206E-4,1,0,903.28831590909749,1.5696892603282395,1.0233376118782618,0.21397476752904734,1.0000080420080746,4.0104748297532695E-3,1.0000116803666523,4.8332707271557512E-3,15.124331166579982,2.2558816767119234E-3,1.0000044279074474,6.5914349499742514E-3,41.221310354633928,-109.62684834964087,70.373151650359134,null,1000000000,691824.69759999996,null,38.791005426747056,-77.906502032722216,null,52.044326951941322,-31.868019831841082,null,0,0,null,0,0]
[912.01,0.91200999999999999,1.2050734419409095,0.59200242488108978,1.0000001641832714,5.7303271982370933E-4,1,0,990.43942009582292,1.5697866737564472,1.0279937636256056,0.23390575110508077,1.0000096686823032,4.3974093284555376E-3,1.0000140429743098,5.2995867714745876E-3,15.124338727794848,2.4735331975344883E-3,1.0000053235881068,7.2273949329591646E-3,40.227005965599659,-110.93087825693098,69.069121743069019,null,1000000000,831762.24009999994,null,38.030391675769273,-76.792291883025612,null,51.810620135197141,-34.300507316555041,null,0,0,null,0,0]
[1000,1,1.2424441167077809,0.63534808104745177,1.000000197392068,6.2831844731661539E-4,1,0,1085.9961350916667,1.56987551307466,1.033563783187998,0.25554308743297821,1.0000116243228929,4.8216615994736032E-3,1.0000168833756682,5.810875688090673E-3,15.124347818144223,2.7121766439196274E-3,1.0000064004215543,7.924693673571322E-3,39.208661202845569,-112.22523454933737,67.774765450662628,null,1000000000,1000000,null,37.277303498971641,-75.581961812715576,null,51.545344098784646,-36.820815114036876,null,0,0,null,0,0]
[1096.5,1.0965,1.285946326514759,0.67989707564933954,1.0000002373268968,6.889511591405738E-4,1,0,1190.7946771795969,1.5699565513603055,1.040222444109973,0.27899444410331892,1.0000139760493783,5.286943654930501E-3,1.0000202990547198,6.3716106832546185E-3,15.12435874962488,2.9739002782186788E-3,1.0000076953762704,8.6894337613934967E-3,38.165340340942905,-113.48855230372568,66.511447696274317,null,1000000000,1202312.25,null,36.532889712982005,-74.269599899956816,null,51.246413633142119,-39.41362687020758,null,0,0,null,0,0]
[1202.3,1.2022999999999999,1.3363700653933999,0.72530712710621426,1.0000002853352139,7.554272249190089E-4,1,0,1305.692982611974,1.57003044989192,1.0481712736496553,0.30434795312457968,1.00001680320921,5.7970637263318418E-3,1.0000244052547229,6.9863808064263141E-3,15.124371891075924,3.2608465698890201E-3,1.000009252159286,9.5278764642786114E-3,37.097289820519144,-114.69661684766403,65.303383152335968,null,1000000000,1445525.2899999998,null,35.798902114282242,-72.850412636679991,null,50.912322593321598,-42.059661599413047,null,0,{"$f":"IF(AH90>0,W90,0)","v":0},null,0,0]
[1318.3,1.3183,1.3945779434543739,0.77121716708268873,1.0000003430505893,8.2831212866369297E-4,1,0,1431.6684471798521,1.5700978409944422,1.0576482430956684,0.33168823218889232,1.0000202019971991,6.3563601383815997E-3,1.0000293416871948,7.6604137965430794E-3,15.124387689652929,3.5754562784918922E-3,1.0000111237624101,1.0447155016069982E-2,36.005109594282743,-115.82439367219536,64.175606327804644,null,1000000000,1737914.89,null,35.077024904972582,-71.319836583494563,null,50.541985773318679,-44.73860791424282,null,0,0,null,0,0]
[1445.4,1.4454,1.4614443725870323,0.81721530679540189,1.0000004123877455,9.0817135358284555E-4,1,0,1569.6984667219197,1.5701592617223095,1.0689224326891638,0.36106370879804522,1.0000242851626511,6.9691708527017992E-3,1.0000352721060612,8.398936757048418E-3,15.124406669469041,3.9201701017393667E-3,1.0000133723046027,1.1454402963658067E-2,34.890929038638738,-116.84600458779533,63.153995412204665,null,1000000000,2089181.1600000001,null,34.36961261155141,-69.675376366778124,null,50.135176901839728,-47.427242648083563,null,0,0,null,0,0]
[1584.9,1.5849000000000002,1.5380645157110842,0.86299107982396961,1.000000495830643,9.9582170902439348E-4,1,0,1721.1948353037983,1.5702153350118937,1.0823345163246123,0.39257039407782546,1.000029198973206,7.6417619356255271E-3,1.000042408945325,9.2095001616366492E-3,15.124429510451739,4.298513512619213E-3,1.0000160783791674,1.2559924214159184E-2,33.755097520401272,-117.73886781246462,62.261132187535381,null,1000000000,2511908.0100000002,null,33.677600272110169,-67.911925665010969,null,49.691308853133123,-50.108320956008981,null,0,0,null,0,0]
[1737.8,1.7378,1.6253761666349262,0.90810317524626039,1.0000005961138283,1.0918915075062575E-3,1,0,1887.2435484038776,1.570266453452561,1.0982367102553865,0.42618253317268295,1.00003510444831,8.3789523695509318E-3,1.0000509860613906,1.0097910196628722E-2,15.124456961115285,4.7131982313905535E-3,1.0000193307269609,1.3771645771284495E-2,32.602221548231405,-118.47971322283342,61.520286777166575,null,1000000000,3019948.84,null,33.004279636233022,-66.031258723786863,null,49.211694785209936,-52.75697576890083,null,0,0,null,0,0]
[1905.5,1.9055,1.7245342407119151,0.95223124707321738,1.0000007167166449,1.1972603868507152E-3,1,0,2069.3649997318648,1.5703130867482882,1.117061258075311,0.46190297559482074,1.0000422064602492,9.1874888642203747E-3,1.0000613009980246,1.1072295758167122E-2,15.124489973839134,5.168020689295681E-3,1.0000232422737301,1.5100665324206279E-2,31.435276544269421,-119.05077377001442,60.949226229985584,null,1000000000,3630930.25,null,32.351655617906466,-64.033625748132479,null,48.697303169202058,-55.35543806479911,null,0,0,null,0,0]
[2089.3000000000002,2.0893000000000002,1.836628158320444,0.99503202791130019,1.000000861650534,1.3127451506439818E-3,1,0,2268.9709834831206,1.5703555983591198,1.1392721490532558,0.49964354882564505,1.0000507412053423,1.0073634882901038E-2,1.0000736967873063,1.214020276413354E-2,15.124529646640532,5.6665059158626709E-3,1.0000279432463837,1.655728902386816E-2,30.259432349687199,-119.43812660864012,60.561873391359882,null,1000000000,4365174.4900000012,null,31.722754452200597,-61.924458345975452,null,48.150275262919692,-57.884583770341571,null,0,0,null,0,0]
[2290.9,2.2909000000000002,1.9629792564511956,1.03627437215088,1.0000010359571199,1.4394139262629642E-3,1,0,2487.9076921074438,1.5703943826109952,1.1654238252995071,0.5393222522642539,1.0000610055303025,1.104558093251699E-2,1.0000886045399076,1.3311498645794839E-2,15.124577359509901,6.2132635351094612E-3,1.0000335973488828,1.81549942957531E-2,29.07853005982308,-119.6341279841006,60.365872015899399,null,1000000000,5248222.8100000005,null,31.119687118959767,-59.708946680361784,null,47.572338230764359,-60.331880218037369,null,0,0,null,0,0]
[2511.9,2.5119000000000002,2.1048387925613627,1.0757234642922546,1.0000012454725538,1.5782720050440781E-3,1,0,2727.9127185310122,1.5704297461431025,1.1961015304049849,0.58075358882403183,1.0000733430481064,1.2111033458626668E-2,1.0001065232753052,1.4595466430222533E-2,15.124634709894536,6.812631630475274E-3,1.00004039414891,1.9906467729041543E-2,27.898184718271331,-119.63679724007382,60.363202759926182,null,1000000000,6309641.6100000003,null,30.54533888252184,-57.398178067416062,null,46.966218436350971,-62.684542759840404,null,0,0,null,0,0]
[2754.2,2.7542,2.2636370936731245,1.113229074453564,1.0000014973397804,1.7305131678819483E-3,1,0,2991.0494543822165,1.5704619959742663,1.2319697475286231,0.62372536898812236,1.0000881742939389,1.3279142706116286E-2,1.0001280637132675,1.6003127683794718E-2,15.12470365290822,7.4697614784770376E-3,1.0000485657379468,2.1826775646559146E-2,26.723152831254254,-119.45068475871722,60.549315241282784,null,1000000000,7585617.6399999987,null,30.001987553732327,-55.00485193222196,null,46.334390395224517,-64.934758695658203,null,0,0,null,0,0]
[3020,3.02,2.4409965180651678,1.1487054101844676,1.000001800293175,1.8975196832056466E-3,1,0,3279.7070900006597,1.5704914215127928,1.2737757409248676,0.66799115215359095,1.0001060134712805,1.4560501805526099E-2,1.0001539725855424,1.7547240913621379E-2,15.124786579223432,8.1906173929791968E-3,1.0000583960306608,2.3933364891379427E-2,25.557514680935746,-119.08614967844758,60.913850321552417,null,1000000000,9120400,null,29.491461924049066,-52.543711804791435,null,45.67910048791849,-67.078532912494381,null,0,0,null,0,0]
[3311.3,3.3113000000000001,2.6383998818861465,1.1820618648359311,1.0000021643441983,2.0805481463743434E-3,1,0,3596.0576166248488,1.5705182444837942,1.3222655514137227,0.71319142667626534,1.0001274499216757,1.5964735319585779E-2,1.0001851057096953,1.9239395040826026E-2,15.124886228999545,8.9806205306605831E-3,1.0000702106550377,2.624210101500455E-2,24.406655569457275,-118.55964691599078,61.440353084009217,null,1000000000,10964707.690000001,null,29.015958296929934,-50.035920335782748,null,45.003531857381589,-69.111511063288546,null,0,0,null,0,0]
[3630.8,3.6308000000000002,2.8577978775675001,1.2133108600354898,1.0000026021589927,2.2812949611962113E-3,1,0,3943.0332224514113,1.5705427149295372,1.3783228335940383,0.75900746466628255,1.0001532292128943,1.7504836443628449E-2,1.0002225457378444,2.1095235173355899E-2,15.125006068924824,9.8470894588063487E-3,1.0000844217868647,2.8774402477326658E-2,23.273320012623387,-117.89156163766542,62.108438362334581,null,1000000000,13182708.640000001,null,28.576303861448935,-47.500498069741461,null,44.309594423508464,-71.035534845452233,null,0,0,null,0,0]
[3981.1,3.9811000000000001,3.1010755916880424,1.2424599108476617,1.0000031284933342,2.5013936827212356E-3,1,0,4323.4574961357384,1.5705650304285486,1.4428339699115396,0.80504272330828675,1.0001842198233251,1.9193308572728301E-2,1.0002675537415853,2.312981197638236E-2,15.125150137488916,1.079707022562631E-2,1.0001015100057375,3.1550901838352345E-2,22.160891281596786,-117.10640229890875,62.893597701091252,null,1000000000,15849157.209999999,null,28.173327734066575,-44.960892948593511,null,43.599833715445193,-72.852123403265765,null,0,0,null,0,0]
[4365.2,4.3651999999999997,3.3703955615267418,1.2695600099872755,1.0000037612934385,2.7427291696840426E-3,1,0,4740.588424606115,1.5705853825158647,1.5167662255492025,0.85091242938093337,1.0002214778972542,2.1044573073790301E-2,1.000321663216595,2.5360481760722194E-2,15.125323346213257,1.183869192691967E-2,1.0001220602998462,3.4595410734256697E-2,21.071419355536634,-116.23070133768556,63.769298662314441,null,1000000000,19054971.039999999,null,27.807028836109595,-42.439988111625439,null,42.876290304492784,-74.565454715885153,null,0,0,null,0,0]
[4786.3,4.7862999999999998,3.6680642598360924,1.2946777024162011,1.0000045219795146,3.0073119141384537E-3,1,0,5197.9011939364063,1.5706039414514938,1.6011278387583299,0.89622864012910297,1.0002662638498208,2.3074001944898066E-2,1.0003867041376604,2.7805739048864662E-2,15.125531557141068,1.2980623757310409E-2,1.0001467716719783,3.7933337519797994E-2,20.006378210587137,-115.29216713680786,64.707832863192138,null,1000000000,22908667.690000001,null,27.476871746925969,-39.96090154721746,null,42.140961077165215,-76.180682127561909,null,0,0,null,0,0]
[5248.1,5.2481,3.9967471831716894,1.3179059266405444,1.0000054366673754,3.297466525809378E-3,1,0,5699.4139880414814,1.5706208701589637,1.6970244667757073,0.94064541060543816,1.0003201141607612,2.5299359274545356E-2,1.0004649071356144,3.0486951028391877E-2,15.125781917032262,1.4232887803218991E-2,1.0001764973952987,4.1594069000515481E-2,18.9659989826479,-114.3178735312061,65.682126468793896,null,1000000000,27542553.610000003,null,27.181602366075118,-37.54448158294894,null,41.395316025434916,-77.704681172062536,null,0,0,null,0,0]
[5370.3,5.3703000000000003,4.0840462419223025,1.3234259729663866,1.0000056927957011,3.3742461957319385E-3,1,0,5832.1226574917218,1.5706248626361969,1.722920892477128,0.95156460876898397,1.0003351926628925,2.5888184997440958E-2,1.000486804236792,3.1196372764211971E-2,15.125852021404867,1.456425081000535E-2,1.0001848233601014,4.2562795055702748E-2,18.709884125076616,-114.07193449240621,65.928065507593786,null,1000000000,28840122.090000004,null,27.11308720522862,-36.952823592720627,null,41.207566480291248,-78.072061293097406,null,0,0,null,0,0]
[5432.85,5.4328500000000002,4.1287782563745115,1.326161130123592,1.0000058261800764,3.4135470670864673E-3,1,0,5900.0516859561967,1.5706268367534504,1.7362540772059349,0.95702740763989347,1.0003430450311173,2.6189577821647689E-2,1.0004982074391298,3.1559489375389216E-2,15.125888529654437,1.4733863018450638E-2,1.0001891596766932,4.3058658742635397E-2,18.581614799842047,-113.94810591625658,66.05189408374342,null,1000000000,29515859.122500002,null,27.079394508341142,-36.657209918140346,null,41.112911818265431,-78.254933377134478,null,0,0,null,0,0]
[5495.4,5.4954000000000001,4.1735404963236711,1.3288376364921957,1.0000059611090188,3.4528479278961108E-3,1,0,5967.9807144431388,1.5706287659309248,1.7496382849379069,0.9624067874627662,1.0003509882667065,2.6490965886842986E-2,1.0005097425578142,3.1922597661524332E-2,15.125925460578355,1.4903474415544548E-2,1.0001935464788201,4.3554526524051305E-2,18.455194377073212,-113.82569427501271,66.174305724987292,null,1000000000,30199421.159999996,null,27.046593533425867,-36.3663729554181,null,41.019213435299655,-78.43444525371649,null,0,0,null,0,0]
[5559.4,5.5593999999999992,4.2193706713716921,1.3315173898355723,1.0000061007644998,3.493059828794623E-3,1,0,6037.4844366584821,1.5706306948971975,1.7633843571373884,0.96782618732086678,1.0003592096872314,2.6799335583097852E-2,1.0005216816113822,3.2294114609667503E-2,15.125963685096808,1.507701680206305E-2,1.0001980872377607,4.4061893528794638E-2,18.327707461035171,-113.7019258049675,66.298074195032498,null,1000000000,30906928.359999996,null,27.013924097846619,-36.073643019472023,null,40.924314256956279,-78.614749826462386,null,0,0,null,0,0]
[5623.4,5.6233999999999993,4.2652304947812922,1.3341395361751678,1.0000062420369871,3.5332717183965581E-3,1,0,6106.9881588957778,1.5706325799562832,1.777181417697866,0.97316159537271429,1.0003675262322147,2.7107700181418778E-2,1.0005337587584913,3.2665622640144568E-2,15.126002352106564,1.5250558319409259E-2,1.00020268086997,4.4569264919117363E-2,18.202057232086119,-113.57966697802955,66.42033302197045,null,1000000000,31622627.559999995,null,26.982126408068289,-35.785722651756835,null,40.830379076351136,-78.791754012939876,null,0,0,null,0,0]
[5688.9,5.6888999999999994,4.3121948695382359,1.3367653719097479,1.000006388294846,3.5744260623285142E-3,1,0,6178.1208746449684,1.5706344652799382,1.791353412349078,0.97853679632777224,1.0003761361885499,2.7423286735391773E-2,1.0005462619448378,3.3045828549785099E-2,15.126042383539991,1.5428166305668393E-2,1.0002074369227603,4.5088532419623448E-2,18.075314313011162,-113.45611561317061,66.54388438682939,null,1000000000,32363583.209999997,null,26.950455424441483,-35.495936121368374,null,40.735221585665812,-78.96959718443054,null,0,0,null,0,0]
[5754.4,5.7543999999999995,4.3591883361599031,1.3393346103176578,1.0000065362463952,3.6155803941525541E-3,1,0,6249.2535904156193,1.5706363076838461,1.8055763508397082,0.98382746476934879,1.0003848457754985,2.7738867825652293E-2,1.0005589097630567,3.3426024902206232E-2,15.126082878442341,1.5605773360348145E-2,1.0002122483781755,4.5607804619813778E-2,17.950396351045246,-113.33416280862825,66.66583719137175,null,1000000000,33113119.359999996,null,26.919636503515054,-35.210990175071522,null,40.641036001268787,-79.144197837933376,null,0,0,null,0,0]
[5821.4,5.8213999999999997,4.4072871177171233,1.341905982514324,1.0000066893384618,3.6576771789185477E-3,1,0,6322.015299698649,1.5706381493851997,1.8201764676307461,0.98915359591453778,1.0003938578950884,2.8061670245570561E-2,1.000571996858318,3.3814918039090411E-2,15.126124780216129,1.5787446777162168E-2,1.000217227351625,4.6138973468068792E-2,17.82445638586325,-113.21107643487775,66.788923565122246,null,1000000000,33888697.959999993,null,26.888963122199772,-34.924426076984176,null,40.5456798699079,-79.319548377675687,null,0,0,null,0,0]
[5888.4,5.8883999999999999,4.4554144107640443,1.3444218192303772,1.0000068442026788,3.6997739507206614E-3,1,0,6394.7770090026324,1.5706399491756822,1.8348273960176849,0.99439481643475791,1.0004029742552367,2.8384466815928721E-2,1.000585235273987,3.4203800944151562E-2,15.126167166921567,1.5969119196559686E-2,1.0002222643182455,4.6670147347269944E-2,17.700327363804128,-113.08967121453946,66.910328785460536,null,1000000000,34673254.559999995,null,26.859121138310712,-34.642724262877792,null,40.451302250541247,-79.491717257756733,null,0,0,null,0,0]
[5957,5.9569999999999999,4.5047195988645372,1.3469420211992886,1.0000070046012812,3.7428760049780414E-3,1,0,6469.2763113855981,1.5706417499990002,1.8498795826761132,0.99967503392783374,1.0004124163208035,2.8714965830251973E-2,1.0005989466086407,3.4601959881489203E-2,15.126211068283196,1.615512901638742E-2,1.0002274816705863,4.7214011248353199E-2,17.575061071635634,-112.96710964300748,67.032890356992525,null,1000000000,35485849,null,26.829398101075711,-34.359229463519178,null,40.355665180356802,-79.664805734658017,null,0,0,null,0,0]
[6025.6,6.0256000000000007,4.5540527786864065,1.3494076368183154,1.0000071668576829,3.7859780453284278E-3,1,0,6543.7756137890647,1.5706435098184426,1.8649825119015169,1.0048698742050528,1.000421967658947,2.9045458569921492E-2,1.000612816564423,3.5000107843814632E-2,15.126255478005245,1.634113776626037E-2,1.0002327598453034,4.7757880545278769E-2,17.451594818850257,-112.84631042675886,67.153689573241138,null,1000000000,36307855.360000007,null,26.800487305118914,-34.080623709441142,null,40.261014824826972,-79.834766954044085,null,0,0,null,0,0]
[6095.8,6.0958000000000006,4.6045646265728548,1.3518760483131567,1.0000073348217902,3.8300853665161768E-3,1,0,6620.0125092720045,1.5706452696779498,1.8804889520851842,1.010099346836312,1.0004318548908062,2.9383653024048183E-2,1.0006271742245345,3.540753056280966E-2,15.126301449801788,1.6531483792111386E-2,1.00023822410708,4.8314440490695755E-2,17.327063179649546,-112.7245150181448,67.2754849818552,null,1000000000,37158777.640000001,null,26.771713690157863,-33.800474945669187,null,40.165158566969367,-80.005557887563967,null,0,0,null,0,0]
[6166,6.1660000000000004,4.6551039213676297,1.3542908764086565,1.0000075047313668,3.874192672801334E-3,1,0,6696.2494047749815,1.5706469894654054,1.896045976747494,1.0152431427562045,1.0004418565452784,2.9721840754834312E-2,1.0006416979772421,3.5814941522406281E-2,15.126347953939369,1.6721828671435762E-2,1.0002437520903715,4.8871006217005339E-2,17.204318371933258,-112.60455667983135,67.395443320168653,null,1000000000,38019556,null,26.743732200134239,-33.525232414688233,null,40.07029588131212,-80.173279050520705,null,0,0,null,0,0]
[6237.8,6.2378,4.7068225797771355,1.3567070842935889,1.0000076805260121,3.9193052582218151E-3,1,0,6774.2238933578783,1.5706487084079974,1.9120086174712487,1.0204174477657919,1.0004522045183273,3.0067729432724837E-2,1.00065672456223,3.6231625896964166E-2,15.126396068674199,1.6916510695818825E-2,1.0002494719996402,4.94402632507807E-2,17.080575354327163,-112.48375727158258,67.516242728417424,null,1000000000,38910148.840000004,null,26.715903470010105,-33.24868302498971,null,39.974278787771254,-80.341748829692023,null,0,0,null,0,0]
[6309.6,6.3096000000000005,4.75856811950276,1.3590707571562619,1.0000078583558174,3.9644178276895085E-3,1,0,6852.1983819603338,1.5706503882292266,1.9280216007862914,1.0255059378282665,1.0004626721819707,3.0413610914051665E-2,1.0006719248818745,3.6648297684899744E-2,15.12644474028242,1.7111191492907681E-2,1.0002552585998112,5.000952647144679E-2,16.958603878806326,-112.3648630149892,67.635136985010803,null,1000000000,39811052.160000004,null,26.688845955910768,-32.977047815763797,null,39.879260833901945,-80.507208929204566,null,0,0,null,0,0]
[6383.05,6.3830499999999999,4.8115297084232092,1.3614361287779715,1.0000080423780908,4.0105670899243341E-3,1,0,6931.9647634262701,1.570652067549849,1.9444533648899989,1.0306245075401164,1.0004735042418793,3.0767433392654957E-2,1.0006876542735266,3.7074531625370263E-2,15.126495106599279,1.7310344867688402E-2,1.0002612472033023,5.0591878121635042E-2,16.835613780746538,-112.2451965126,67.754803487399997,null,1000000000,40743327.302500002,null,26.661936272364382,-32.704144126524405,null,39.783072809681073,-80.673456874093063,null,0,0,null,0,0]
[6456.5,6.4565000000000001,4.8645176315004957,1.3637499823581758,1.0000082285301353,4.0567163350760287E-3,1,0,7011.7311449113104,1.5706537086621242,1.9609352186467994,1.0356571631022475,1.0004844615486912,3.112124816542337E-2,1.000703565459746,3.7500752089033612E-2,15.126546055666639,1.750949692824684E-2,1.0002673056327089,5.1174236395536365E-2,16.714380428791475,-112.1274992087109,67.872500791289099,null,1000000000,41686392.25,null,26.6357772651075,-32.43616032478112,null,39.687889614011752,-80.836753433120762,null,0,0,null,0,0]
[6531.7,6.5316999999999998,4.9187944246786222,1.3660673045179954,1.0000084213238771,4.1039651018612653E-3,1,0,7093.3980188266187,1.5706553506364098,1.9778603509830308,1.0407226964605358,1.00049580967566,3.148348475841499E-2,1.0007200440758146,3.7937113443838315E-2,15.12659882236926,1.7713392555048568E-2,1.0002735807684389,5.1770476722535687E-2,16.592030096546676,-112.00902260614542,67.990977393854578,null,1000000000,42663104.890000001,null,26.609744823766974,-32.166775348220902,null,39.591458992855372,-81.000981112226796,null,0,0,null,0,0]
[6606.9,6.6068999999999996,4.973097055046936,1.3683340316588068,1.000008616350083,4.1512138503226464E-3,1,0,7175.0648927606153,1.5706569552326621,1.9948353725344363,1.0457021456264659,1.0005072890800479,3.18457130866317E-2,1.0007367132339233,3.8373460344882732E-2,15.126652199909548,1.79172867722143E-2,1.0002799291350226,5.2366724152575088E-2,16.471424420092131,-111.89257792369081,68.107422076309192,null,1000000000,43651127.609999992,null,26.584443806447567,-31.90232001743097,null,39.496040302658429,-81.162310318300072,null,0,0,null,0,0]
[6683.85,6.6838500000000005,5.0286892498477922,1.3706028195835163,1.0000088182257931,4.1995621182897638E-3,1,0,7258.6322591253283,1.5706585597931442,2.0122557515665305,1.0507103789618195,1.0005191715155719,3.2216362276090489E-2,1.0007539675395563,3.8819946460561812E-2,15.126707451932127,1.8125924391970746E-2,1.0002865010635453,5.2976854458745011E-2,16.349769813532415,-111.77550785691558,68.224492143084419,null,1000000000,44673850.822500005,null,26.559283762412225,-31.636697952974494,null,39.399427709019321,-81.324490030976747,null,0,0,null,0,0]
[6760.8,6.7608000000000006,5.0843067631903267,1.3728219819302434,1.0000090224390779,4.2479103666233572E-3,1,0,7342.199625508305,1.5706601278280887,2.02972573570531,1.0556325216001101,1.0005311913999657,3.2587002610876888E-2,1.000771421338442,3.9266417091498355E-2,15.12676334353935,1.8334560501380867E-2,1.000293149712596,5.3586992373674779E-2,16.229845703587209,-111.66052572521961,68.339474274780386,null,1000000000,45708416.640000001,null,26.534835157328466,-31.376005922026206,null,39.303832811322195,-81.483826844550649,null,0,0,null,0,0]
[6839.55,6.83955,5.1412506274640997,1.3750433321619107,1.0000092338495146,4.2973895475707184E-3,1,0,7427.721784105639,1.5706616960114497,2.0476544088356272,1.0605827207342344,1.0005436347553187,3.296630362130893E-2,1.000789489950028,3.9723315262704437E-2,15.126821204746394,1.8548075405745112E-2,1.0003000333414351,5.4211410488681507E-2,16.108859997074781,-111.54499313780404,68.455006862195958,null,1000000000,46779444.202500001,null,26.510524383093419,-31.114202600943301,null,39.20703428370156,-81.644042412228032,null,0,0,null,0,0]
[6918.3,6.9183000000000003,5.1982193048282044,1.3772160041754158,1.000009447708162,4.3468687074763113E-3,1,0,7513.2439427208237,1.5706632284940061,2.0656323869270952,1.0654468704390709,1.0005562220545481,3.3345595142865857E-2,1.0008077674747944,4.0180196840829498E-2,15.12687973579504,1.8761588691477097E-2,1.0003069973677385,5.4835836756001004E-2,15.989590924862416,-111.43160050015713,68.568399499842869,null,1000000000,47862874.890000001,null,26.486905347467072,-30.857326959815801,null,39.111259225968659,-81.801469391746011,null,0,0,null,0,0]
[6998.9,6.9988999999999999,5.2565511463396097,1.3793909404230016,1.0000096691259457,4.3975102129060724E-3,1,0,7600.7751933340296,1.5706647612667171,2.0840824291561919,1.0703382706746545,1.0005692541056443,3.3733787065549942E-2,1.0008266906969172,4.0647794129522206E-2,15.126940335481066,1.8980116149334144E-2,1.0003142082706282,5.5474940623431536E-2,15.869249804534959,-111.31773391816765,68.682266081832353,null,1000000000,48984601.209999993,null,26.463421417214054,-30.599399950330998,null,39.014272601500849,-81.959800469368574,null,0,0,null,0,0]
[7079.5,7.0795000000000003,5.3149073072972985,1.3815181261946821,1.000009893108315,4.4481516957803231E-3,1,0,7688.306443964686,1.5706662591382405,2.1025814589318883,1.0751437127170975,1.0005824369315512,3.4121968817753666E-2,1.0008458327387155,4.1115373634041871E-2,15.127001636833725,1.919864187216622E-2,1.0003215034428798,5.61140532271854E-2,15.750611701147522,-111.20605531610201,68.79394468389799,null,1000000000,50119320.25,null,26.440609791859352,-30.346395400117004,null,38.91831519589843,-82.115396148095655,null,0,0,null,0,0]
[7161.95,7.16195,5.3746272459115909,1.383646331801323,1.0000101248852753,4.4999555215881511E-3,1,0,7777.8467865937619,1.5706677565067189,2.1215544452150112,1.0799726291394249,1.0005960783403127,3.4519049804013983E-2,1.0008656405430258,4.159366680922455E-2,15.127065071227808,1.9422181567901778E-2,1.0003290532799367,5.676784443192405E-2,15.630965176831815,-111.09404787902591,68.905952120974092,null,1000000000,51293527.802499995,null,26.417944425104778,-30.09255572673797,null,38.821198560844508,-82.271824683603896,null,0,0,null,0,0]
[7244.4,7.2443999999999997,5.4343709925149319,1.385727753031943,1.0000103593458975,4.5517593232433399E-3,1,0,7867.387129239879,1.5706692197914829,2.1405760251813484,1.0847158331314863,1.0006098775120533,3.4916119900782208E-2,1.0008856773006323,4.2071940943887498E-2,15.127129239850536,1.9645719405815172E-2,1.0003366913541116,5.7421644988829387E-2,15.513006232302409,-110.98426980010993,69.015730199890072,null,1000000000,52481331.359999992,null,26.395931406415901,-29.843624437095674,null,38.725115595445793,-82.425573209039428,null,0,0,null,0,0]
[7328.75,7.3287500000000003,5.4955153176722646,1.3878102977420663,1.0000106019866313,4.6047568803684116E-3,1,0,7958.990863668073,1.5706706827252199,2.1600848911745874,1.0894817845132694,1.0006241579269834,3.5322328788887372E-2,1.0009064127045164,4.2561216625781419E-2,15.127195646985792,1.987440656505083E-2,1.0003445967821698,5.8090521690487437E-2,15.394028305182053,-110.87423645093281,69.125763549067187,null,1000000000,53710576.5625,null,26.37406098620216,-29.593913412087591,null,38.627866274766902,-82.580181507425323,null,0,0,null,0,0]
[7413.1,7.4131,5.5566829522519017,1.38984700206808,1.0000108474361342,4.6577544116261733E-3,1,0,8050.5945981129134,1.5706721123669578,2.1796419430166374,1.0941623146919415,1.0006386034458354,3.5728526015709208E-2,1.0009273877061191,4.3050471918695099E-2,15.12726282255924,2.0103091734636772E-2,1.0003525946210854,5.8759408405150544E-2,15.276722861207684,-110.76646996939242,69.233530030607582,null,1000000000,54954051.610000007,null,26.352823310857382,-29.349094085870931,null,38.53165505796192,-82.732163920452493,null,0,0,null,0,0]
[7499.45,7.4994499999999995,5.6193242663396346,1.3918860600256309,1.0000111016148781,4.7120085258854352E-3,1,0,8144.3703239068291,1.5706735425939404,2.1997112781574715,1.0988675078763401,1.0006535624934401,3.6144342256217848E-2,1.0009491082112008,4.355130644825983E-2,15.12733238688838,2.0337197111485149E-2,1.0003608778504343,5.9444165402074089E-2,15.15832171439129,-110.65846083418715,69.341539165812847,null,1000000000,56241750.302499995,null,26.331712857405464,-29.103412835934424,null,38.434215822429849,-82.885118489925006,null,0,0,null,0,0]
[7585.8,7.5857999999999999,5.6819884290081859,1.3938801503674993,1.0000113587371615,4.7662626124048276E-3,1,0,8238.1460497170283,1.5706749402600597,2.2198284311679148,1.1034875203570302,1.0006686945520031,3.6560145992716495E-2,1.0009710797786449,4.4052119116553184E-2,15.127402756506367,2.0571300354724015E-2,1.0003692579908725,6.0128933133372135E-2,15.04158014601707,-110.55275490411812,69.447245095881883,null,1000000000,57544361.640000001,null,26.311216582569664,-28.862609498794907,null,38.337820274428303,-83.035497221424919,null,0,0,null,0,0]
[7674.15,7.67415,5.7461268597812074,1.3958754031561984,1.0000116248613891,4.8217732787166371E-3,1,0,8334.0937668766837,1.5706763377438526,2.2404596771789964,1.1081285669047729,1.0006843561525065,3.6985567297857944E-2,1.0009938200766386,4.4564508496257385E-2,15.127475589464657,2.0810823558473652E-2,1.0003779325678051,6.0829572385167049E-2,14.923805950563642,-110.44694606830217,69.553053931697832,null,1000000000,58892578.222499996,null,26.290857185287344,-28.621152034032406,null,38.240249969709225,-83.186779930643382,null,0,0,null,0,0]
[7762.5,7.7625000000000002,5.8102876609910963,1.3978265979319604,1.0000118940670848,4.8772839153122796E-3,1,0,8430.0414840522481,1.570677703416324,2.2611382999148559,1.1126848232551292,1.0007001988544661,3.7410975209775044E-2,1.0010168231664485,4.5076874461341961E-2,15.127549265423353,2.1050344476688743E-2,1.000386708669414,6.1530223132189754E-2,14.807676681834494,-110.34347029565652,69.656529704343484,null,1000000000,60256406.25,null,26.271092968810365,-28.384550099700089,null,38.143727618959495,-83.335538961994573,null,0,0,null,0,0]
[7852.9,7.8529,5.8759595868122982,1.3997789534810989,1.0000121727087508,4.9340825434867437E-3,1,0,8528.2154923609742,1.5706790689696004,2.2823444274184372,1.1172612444555883,1.0007165966017462,3.7846239910540098E-2,1.0010406319909084,4.5601104425844301E-2,15.127625523452712,2.1295420646202864E-2,1.0003957935287813,6.2247143231374286E-2,14.690509462178383,-110.23996731928359,69.760032680716407,null,1000000000,61668038.409999996,null,26.251462721472592,-28.14735755013286,null,38.046027843832583,-83.485222869495047,null,0,0,null,0,0]
[7943.3,7.9432999999999998,{"$f":"SQRT(1+(A141/pole1)^2)","v":5.9416534148266305},{"$f":"ATAN(A141/pole1)","v":1.4016881437771167},{"$f":"SQRT(1+(A141/Zero1)^2)","v":1.0000124545765383},{"$f":"ATAN(A141/Zero1)","v":4.9908811398254376E-3},{"$f":"IF(VIN_nom>Vout, 1, SQRT(1+(A141/z_RHP)^2))","v":1},{"$f":"IF(VIN_nom>Vout, 0, -ATAN(A141/z_RHP))","v":0},{"$f":"SQRT(1+(A141/Pole2)^2)","v":8626.3895006852435},{"$f":"ATAN(A141/Pole2)","v":1.5706804034410808},{"$f":"SQRT(1+(A141/Zero2)^2)","v":2.3035974748524204},{"$f":"ATAN(A141/Zero2)","v":1.1217533139454199},{"$f":"SQRT(1+(A141/pole4)^2)","v":1.0007331839339151},{"$f":"ATAN(A141/pole4)","v":3.8281490264582295E-2},{"$f":"IF(VOUT_setting=1,1,SQRT(1+(A141*zterm1)^2))","v":1.0010647159052775},{"$f":"IF(VOUT_setting=1,0,ATAN(((A141*zterm1))))","v":4.6125309310238762E-2},15.127702664030684,{"$f":"IF(VOUT_setting=1,0,ATAN(A141*$Q$4/(1+Afbr-$Q$5*(A141)^2)))","v":2.1540494367250793E-2},{"$f":"SQRT((1-(Z141/pterm2))^2+(A141/pterm1)^2)","v":1.0004049847582024},{"$f":"IF((ATAN((A141/pterm1)/(1-A141^2/pterm2))>0),ATAN((A141/pterm1)/(1-A141^2/pterm2)),PI()+ATAN((A141/pterm1)/(1-A141^2/pterm2)))","v":6.29640756413406E-2},{"$f":"20*LOG10(((E141*K141*G141*O141)/(C141*I141*S141*M141*Q141))*Adc)","v":14.574972747840278},{"$f":"((F141+L141+H141+P141)-(D141+J141+T141+N141+R141))*radconv","v":-110.13882355411661},{"$f":"IF(V141>0,V141,V141+180)","v":69.861176445883387},null,{"$f":"IF(U141<0,A141,1000000000)","v":1000000000},{"$f":"A141^2","v":63096014.890000001},null,{"$f":"20*LOG10((K141/(I141*M141))*AEA)","v":26.232408982942609},{"$f":"(L141-(J141+N141))*radconv","v":-27.914995394722411},null,{"$f":"20*LOG10((E141*G141/(C141*S141))*Acs*Am)","v":37.949380189782957},{"$f":"(F141+H141-(D141+T141))*radconv","v":-83.632434297347146},null,{"$f":"SUM((U142<0)*(U141>0))*A141","v":0},0,null,0,0]
[8035.8,{"$f":"A142/1000","v":8.0358000000000001},6.0088952382282663,1.4035984662672201,1.0000127463315434,5.0489991392475685E-3,1,0,8726.8440999263894,1.5706817378334419,2.3253914579953747,1.126264647015931,1.0007503528235966,3.8726836501085202E-2,1.0010896440200747,4.6661665261073647E-2,15.127782510116299,2.1791258608733721E-2,1.0004144996485034,6.3697675343146673E-2,14.458394254838682,-110.03772859117416,69.962271408825842,null,1000000000,64574081.640000001,null,26.213486466757292,-27.682107964362366,null,37.851553768289364,-83.780589964393201,null,0,0,null,{"$f":"SUM((V143<-183)*(V142>-183))*A142","v":0},{"$f":"IF(AK142>0,U142,0)","v":0}]
[8128.3,8.1282999999999994,6.0761585046950284,1.4054665007886553,1.0000130414642914,5.1071171045614016E-3,1,0,8827.2986991827202,1.5706830418550506,2.3472318883892638,1.1306921150570806,1.0007677201885352,3.9172167368795002E-2,1.0011148601116537,4.7197994346713401E-2,{"$f":"IF(VOUT_setting=1,1,SQRT((1+Afbr-$Q$5*(A143)^2)^2+(A143*$Q$4)^2))","v":15.127863280201408},2.204202022707499E-2,1.0004241259951885,6.4431288229597539E-2,14.343432047377823,-109.93901534399987,70.06098465600013,null,1000000000,66069260.890000001,null,26.195122108511583,-27.454023025556065,null,37.75478351151952,-83.926323466686384,null,0,0,null,0,0]
[8222.9500000000007,8.2229500000000009,6.1450066495562012,1.4073356159437749,1.0000133469532986,5.1665858841636143E-3,1,0,8930.088189139653,1.5706843458176756,2.369626700666041,1.135137920675654,1.0007856966652653,3.9627833077992572E-2,1.0011409603791253,4.7746761330911727E-2,15.127946884094026,2.2298607611962815E-2,1.0004340915084635,6.5181966462334678E-2,14.227425608230233,-109.84042701530447,70.159572984695529,null,1000000000,67616906.702500015,null,26.176886345581082,-27.225479560376026,null,37.65683438896982,-84.073019261090465,null,0,0,null,0,0]
[8270.2750000000015,8.2702750000000016,6.1794386379900557,1.4082545533745801,1.0000135010240201,5.1963202602870323E-3,1,0,8981.4829341237164,1.5706849866064889,2.380841422443869,1.1373294380518471,1.0007947628244167,3.9855659770370144E-2,1.0011541235667296,4.8021134051857775E-2,15.127989048824091,2.2426900252546331E-2,1.0004391180594756,6.5557310863960161E-2,14.170025953810807,-109.79203600145665,70.207963998543349,null,1000000000,68397448.575625017,null,26.167972337587525,-27.113005086290276,null,37.608258748946561,-84.145472493413678,null,0,0,null,0,0]
[8317.6,8.3176000000000005,6.2138757867939711,1.409163306107827,1.0000136559788864,5.2260546272218924E-3,1,0,9032.8776791114233,1.570685620103456,2.3920674715547654,1.1395003960510366,1.0008038809288793,4.0083482323214688E-2,1.0011673621196218,4.8295499537332663E-2,15.128031455407305,2.255519218650864E-2,1.0004441738148755,6.593265881570444E-2,14.113021411955851,-109.74423933599461,70.255760664005393,null,1000000000,69182469.760000005,null,26.159190708488545,-27.001707922767821,null,37.559945329038001,-84.21734238948379,null,0,0,null,0,0]
[8366.0499999999993,8.3660499999999995,6.2491368250519272,1.4100832850373182,1.0000138155332281,5.2564958237336515E-3,1,0,9085.4941692293341,1.570686261235072,2.403571952673432,1.1417019429022068,1.000813269597769,4.0316716313243052E-2,1.0011809934474363,4.857637964338804E-2,15.128075120614231,2.2686533113256455E-2,1.0004493800150547,6.6316933158982641E-2,14.05506553171497,-109.69591614238654,70.304083857613463,null,1000000000,69990792.602499992,null,26.150334773098738,-26.888968637069947,null,37.510752193556456,-84.290326445429542,null,0,0,null,0,0]
[8414.5,8.4145000000000003,6.2844030929822203,1.410992939413676,1.0000139760142488,5.2869370105032877E-3,1,0,9138.1106593509376,1.5706868949835218,{"$f":"SQRT(1+(A148/Zero2)^2)","v":2.4150879724241392},{"$f":"ATAN(A148/Zero2)","v":1.1438825046826497},1.0008227127079699,4.0549945914670919E-2,1.0011947037599029,4.8857252078884451E-2,15.128119039305213,2.2817873290828711E-2,1.0004546168376842,6.6701211265487365E-2,13.997512604669758,-109.64820368971341,70.351796310286588,null,1000000000,70803810.25,null,26.141612189915516,-26.777431032886373,null,37.46182812090764,-84.362719164229901,null,0,0,null,0,0]
[8462.9500000000007,8.4629500000000011,6.3196745030339674,1.4118924405891298,1.000014137421948,5.3173781874743887E-3,1,0,9190.7271494761681,1.5706875214756102,2.4266153665297887,1.1460423595695535,1.0008322102579412,4.0783171102249334E-2,1.0012084930537772,4.9138116799822239E-2,15.128163211478052,2.2949212714895476E-2,1.0004598842894368,6.7085493156615009E-2,13.940357144711296,-109.60109586667674,70.398904133323256,null,1000000000,71621522.702500015,null,26.133020326305193,-26.667079177656934,null,37.413170257670046,-84.434530364873567,null,0,0,null,0,0]
[8511.4,8.5114000000000001,6.3549509695873692,1.4127819561777448,1.0000142997563251,5.3478193545905403E-3,1,0,9243.3436396049656,1.5706881408352547,2.4381539736593045,1.1481817812547808,1.000841762246133,4.1016391850732206E-2,1.0012223613257958,4.9418973762209037E-2,15.128207637130526,2.3080551381126975E-2,1.0004651823770228,6.7469778853755186E-2,13.88359377206614,-109.55458660462108,70.445413395378921,null,1000000000,72443929.959999993,null,26.124556612291933,-26.557897395646471,null,37.364775794100098,-84.505769652167885,null,0,0,null,0,0]
[8560.9500000000007,8.5609500000000001,6.3910334893784295,1.4136815098053268,1.0000144667347877,5.3789516421839543E-3,1,0,9297.1547249725136,1.570688767005745,2.4499659839035473,1.1503489222542618,1.0008515874054891,4.1254902983005451E-2,1.0012366261452808,4.9706199179445409E-2,15.128253333590019,2.3214871148230194E-2,1.0004706324455162,6.7862793262458879E-2,13.825941697544605,-109.50763422597055,70.492365774029452,null,1000000000,73289864.902500018,null,26.116030672073833,-26.44743092081271,null,37.315552145970237,-84.57804459677746,null,0,0,null,0,0]
[8610.5,8.6105,6.4271211227026281,1.4145709623411422,1.0000146346824832,5.4100839193505041E-3,1,0,9350.9658103436595,1.5706893859695115,2.4617893899646122,1.1524952566977635,1.0008614694997306,4.1493409418924987E-2,1.0012509735628683,4.9993416388787675E-2,15.128299295164986,2.334919011353645E-2,1.0004761145710566,6.825581169718839E-2,13.768688664180566,-109.46129519885153,70.538704801148469,null,1000000000,74140710.25,null,26.107633522662038,-26.338155891828023,null,37.266598185549377,-84.649741022731376,null,0,0,null,0,0]
[8660.0499999999993,8.66005,6.4632137839050694,1.415450481589154,1.0000148035994114,5.4412161860298456E-3,1,0,9404.7768957183507,1.570689997850258,2.4736240284336346,1.1546210633035194,1.000871408527171,4.1731911131495311E-2,1.0012654035750075,5.0280625343202469E-2,15.12834552185301,2.348350827241482E-2,1.0004816287609468,6.8648834180800936E-2,13.711829245884267,-109.415563177628,70.584436822371998,null,1000000000,74996466.002499983,null,26.099362607271026,-26.230056344854923,null,37.217911043592082,-84.720868545801594,null,0,0,null,0,0]
[8709.6,8.7096,6.4993113892217238,1.4163202316876022,1.0000149734855717,5.4723484421616382E-3,1,0,9458.5879810965216,1.5706906027688727,2.4854697388602816,1.1567266162260095,1.0008814044861141,4.1970408093724133E-2,1.0012799161781274,5.0567825995664582E-2,15.128392013651666,2.361782562023455E-2,1.0004871750225315,6.9041860736145974E-2,13.655358121937038,-109.37043186795522,70.629568132044781,null,1000000000,75857132.160000011,null,26.091215430349592,-26.123116577378589,null,37.169487894989985,-84.791436571729164,null,0,{"$f":"IF(AH154>0,W154,0)","v":0},null,0,0]
[8760.3250000000007,8.7603249999999999,6.5362700280882668,1.4172006547709408,1.0000151484042934,5.5042189395944404E-3,1,0,9513.6751113888204,1.5706912149437842,2.497607656028733,1.1588614007294753,1.0008916964542274,4.2214555685949701E-2,1.0012948584729369,5.0861828509372847E-2,15.128439882542546,2.3755327246871464E-2,1.00049288603417,6.9444211537135384E-2,13.597944642578895,-109.32484607166461,70.675153928335391,null,1000000000,76743294.105625018,null,26.083000687705077,-26.014826136687876,null,37.120187021661891,-84.863108056458785,null,0,0,null,0,0]
[8811.0499999999993,8.8110499999999998,6.5732336765338983,1.4180711766537655,1.0000153243387591,5.536089425845549E-3,1,0,9568.7622416846407,1.5706918200701434,2.509756845429814,1.1609755267311204,1.0009020480823108,4.2458698242633167E-2,1.0013098873145609,5.1155822223018482E-2,15.1284880292613,2.389282801370719E-2,1.0004986306723092,6.984656665369128E-2,13.540927134437592,-109.27987663381889,70.720123366181113,null,1000000000,77634602.102499992,null,26.074910518299209,-25.907718648596312,null,37.07115695691909,-84.934212492090595,null,0,0,null,0,0]
[8861.7749999999996,8.8617749999999997,6.6102022505192926,1.418931962127473,1.0000155012889678,5.5679599008502259E-3,1,0,9623.8493719839262,1.570692418268989,2.5219171441535511,1.1630692740313813,1.0009124593685133,4.2702835734826694E-2,1.0013250026991032,5.1449807086177801E-2,15.12853645380528,2.4030327915774228E-2,1.0005044089449657,7.0248926110302146E-2,13.484300215789261,-109.23551697417297,70.764483025827033,null,1000000000,78531056.15062499,null,26.06694243324522,-25.801778086996155,null,37.02239480798896,-85.004759321882943,null,0,0,null,0,0]
[8912.5,8.9124999999999996,6.6471756678635998,1.4197831723754495,1.0000156792549189,5.5998303645437338E-3,1,0,9678.9365022866168,1.5706930096586036,{"$f":"SQRT(1+(A158/Zero2)^2)","v":2.5340883922694415},{"$f":"ATAN(A158/Zero2)","v":1.1651429177772294},1.0009229303109732,4.2946968133586075E-2,1.0013402046226441,5.1743783048436222E-2,15.128585156171816,2.4167826948105257E-2,1.0005102208602019,7.06512899314478E-2,13.428058609686801,-109.19176057222342,70.808239427776584,null,1000000000,79432656.25,null,26.05909400368391,-25.696988692245903,null,36.973897726848492,-85.074757782369915,null,0,0,null,0,0]
[8964.4,8.9643999999999995,6.6850104710210783,1.4206443540957536,1.0000158623946025,5.6324390677161152E-3,1,0,9735.2996775036772,1.5706936078201466,2.5465527456690782,1.1672440703760909,1.00093370554674,4.3196750342625538E-2,1.001355848250375,5.204455944010259E-2,15.128635274233401,2.4308510119186225E-2,1.0005162022323559,7.1062978699413359E-2,13.370907623633343,-109.1476082345618,70.852391765438199,null,1000000000,80360467.359999999,null,26.051185145203405,-25.590947254604323,null,36.924548677989335,-85.145819548228545,null,0,0,null,0,0]
[9016.2999999999993,9.0162999999999993,6.7228501762039024,1.4214958420823873,1.0000160465976302,5.66504775891012E-3,1,0,9791.6628527241774,1.5706941990953649,2.5590282321487887,1.1693247454809133,1.000944543230567,4.3446527158236423E-2,1.0013715824643674,5.2345326406981536E-2,15.128685683131957,2.444919236925109E-2,1.0005222188409675,7.1474672088276597E-2,13.314149156140022,-109.10407380995368,70.895926190046325,null,1000000000,81293665.689999983,null,26.043396590802466,-25.486078387369492,null,36.875471226870054,-85.216326169503759,null,0,0,null,0,0]
[9068.2000000000007,9.0682000000000009,6.7606947011019534,1.4223377978787868,1.0000162318640011,5.6976564380564077E-3,1,0,9848.0260279480644,1.5706947836024965,2.5715146896749839,1.1713852232407498,1.0009554433604255,4.3696298549428039E-2,1.001387407260351,5.2646083895103397E-2,15.128736382864572,2.4589873692979929E-2,1.0005282706948213,7.1886370124229784E-2,13.257777879019699,-109.0611505120888,70.938849487911199,null,1000000000,82232251.24000001,null,26.035725923194594,-25.382366044181904,null,36.826662462660678,-85.286286903457324,null,0,0,null,0,0]
[9120.1,9.1201000000000008,6.7985439652274824,1.4231703794857193,1.000016418193715,5.7302651050856364E-3,1,0,9904.3892031752785,1.5706953614570867,2.5840119592048594,1.173425779078177,1.000966405934276,4.3946064485213751E-2,1.001403322634032,5.294683185050874E-2,15.128787373428331,2.4730554085052998E-2,1.0005343578027541,7.2298072833455379E-2,13.201788567997655,-109.01883162232893,70.981168377671068,null,1000000000,83176224.010000005,null,26.02817078376027,-25.279794449335174,null,36.778119519777078,-85.355710804370517,null,0,0,null,0,0]
[9173.2000000000007,9.1732000000000014,6.8372731796240585,1.4240126708908256,1.0000166099321357,5.7636277171211779E-3,1,0,9962.055573208816,1.5706959459051966,2.5968092100186282,1.1754931795983987,1.0009776866022724,4.4201599677549497E-2,1.0014196997320586,5.3254523593721757E-2,15.128839843957106,2.4874486233189937E-2,1.0005406221485222,7.2719299544363153E-2,13.144894679776812,-108.9761528572264,71.023847142773604,null,1000000000,84147598.24000001,null,26.02055812475875,-25.176015699292687,null,36.728726366244466,-85.426193522973804,null,0,0,null,0,0]
[9226.2999999999993,9.2262999999999984,6.8760071901112996,1.4248454732680853,1.0000168027836382,5.7969903163260107E-3,1,0,10019.721943245715,1.570696523625974,2.609617451086061,1.1775402948152984,1.000989032630869,4.4457129093680693E-2,1.0014361716355971,5.3562205244062994E-2,15.128892618915101,2.5018417394825496E-2,1.0005469234163369,7.3140531202563641E-2,13.088389883389215,-108.93409276269456,71.065907237305439,null,1000000000,85124611.689999983,null,26.013061584008277,-25.073398495118106,null,36.679605541004008,-85.496132844523345,null,0,0,null,0,0]
[9279.4,9.279399999999999,6.9147459160910953,1.4256689449346358,1.0000169967482222,5.8303529026258738E-3,1,0,10077.388313285923,1.570697094734907,2.6224365213746834,1.1795674049221294,1.001000444017843,4.4712652700434619E-2,1.001452738339969,5.3869876743776711E-2,15.12894569829913,2.5162347564263058E-2,1.0005532616158248,7.3561767836065911E-2,13.03226890497899,-108.89264436505459,71.107355634945407,null,1000000000,86107264.359999999,null,26.00567881549615,-24.971926787636903,null,36.630754116289971,-85.565537841531949,null,0,0,null,0,0]
[9332.5,9.3324999999999996,6.9534892787517135,1.4264832407304424,1.0000171918258869,5.8637154759465047E-3,1,0,10135.054683329379,1.5706976593448563,2.6352662628505112,1.1815747853202518,1.0010119207609594,4.4968170464643055E-2,1.0014693998404696,5.4177538035118662E-2,15.128999082105993,2.5306276735806234E-2,1.0005596367566689,7.3983009472868122E-2,12.97652657368522,-108.85180076580389,71.148199234196113,null,1000000000,87095556.25,null,25.998407530490269,-24.871584802079457,null,36.582169210051383,-85.6344173872846,null,0,0,null,0,0]
[9386.85,9.3868500000000008,6.9931494003968098,1.4273073610855778,1.0000173926484672,5.897863407060183E-3,1,0,10194.078547962854,1.5706982306308443,2.6484089118100056,1.1836092710975747,1.0010237353519063,4.5229697157051024E-2,1.0014865517256277,5.4492431191981036E-2,15.129054037847027,2.5453593031168936E-2,1.0005662002376317,7.441417255462536E-2,12.919858871499354,-108.81061488900454,71.18938511099546,null,1000000000,88112952.922499999,null,25.991078196470436,-24.770034461424427,null,36.53271363360367,-85.704383298059255,null,0,0,null,0,0]
[9441.2000000000007,9.4412000000000003,7.0328142180393645,1.4281221859709823,1.0000175946371488,5.9320113244189319E-3,1,0,10253.102412599617,1.5706987953394069,2.6615624145976176,1.1856236561929983,1.0010356184074649,4.5491217658303412E-2,1.0015038029124819,5.4807313531817774E-2,15.129109312505269,2.5600908269027247E-2,1.0005728024403606,7.4845340937334429E-2,12.863577211066177,-108.77004823736378,71.229951762636219,null,1000000000,89136257.440000013,null,25.983860981374988,-24.669635073423077,null,36.483531304284888,-85.773816922159384,null,0,0,null,0,0]
[9495.5499999999993,9.4955499999999997,7.0724836526692787,1.428927870709833,1.0000177977919305,5.9661592279431205E-3,1,0,10312.126277239611,1.5706993535834868,2.6747266110857435,1.1876182209256234,1.0010475699251968,4.5752731932849004E-2,1.0015211533959008,5.5122184992747729E-2,15.129164906077229,2.5748222443273752E-2,1.0005794433754174,7.5276514650981827E-2,12.807676366483161,-108.73009365849508,71.269906341504921,null,1000000000,90165469.80249998,null,25.976753606952236,-24.570370581408199,null,36.434619274529084,-85.842727160670194,null,0,0,null,0,0]
[9549.9,9.5498999999999992,7.1121576270301325,1.4297245672076033,1.0000180021128118,6.0003071175531216E-3,1,0,10371.150141882785,1.5706999054734549,2.6879013441548096,1.1895932407561451,1.0010595899026502,4.6014239945141713E-2,1.0015386031707236,5.543704551290269E-2,15.129220818559396,2.5895535547801288E-2,1.0005861230534256,7.5707693725541883E-2,12.752151214059378,-108.69074408240978,71.309255917590221,null,1000000000,91200590.00999999,null,25.969753850923141,-24.472225206931672,null,36.385974643009774,-85.911122718856163,null,0,0,null,0,0]
[9605.5249999999996,9.6055250000000001,7.1527669374960476,1.430530801492734,1.0000182124343222,6.0352560701195388E-3,1,0,10431.558651007941,1.5707004638433486,2.7013958934695479,1.191594637122539,1.0010719627424822,4.6281876168588462E-2,1.001556565108124,5.5759280972081576E-2,15.1292783729122,2.6046303365499832E-2,1.0005929995584826,7.6148993438886675E-2,12.695707267005101,-108.65109056897529,71.348909431024708,null,1000000000,92266110.52562499,null,25.96269906011014,-24.372920060177638,null,36.336462755103454,-85.980598724366814,null,0,0,null,0,0]
[9661.15,9.6611499999999992,7.1933808448617294,1.4313279322758636,1.0000184239772838,6.0702050079425047E-3,1,0,10491.967160136312,1.5707010157835055,2.7149011558671283,1.1935761294876344,1.0010844072864706,4.6549505757199024E-2,1.0015746310391063,5.608150484005521E-2,15.129336261305875,2.6197070049758197E-2,1.0005999166682686,7.6590298831109641E-2,12.639646302981273,-108.61205605542929,71.387943944570708,null,1000000000,93337819.32249999,null,25.955752458745046,-24.274754580149853,null,36.287224953366788,-86.049553463853911,null,0,0,null,0,0]
[9716.7749999999996,9.7167750000000002,7.2339992717019292,1.4321161118820258,1.0000186367416957,6.1051539309366562E-3,1,0,10552.37566926784,1.5707015614043496,2.7284169722630058,1.1955379979715901,1.0010969235319414,4.6817128672883304E-2,1.0015928009580428,5.6403717050540793E-2,15.129394483736588,2.6347835594030145E-2,1.000606874394369,7.7031609934304204E-2,12.583963145401746,-108.57363322906126,71.426366770938742,null,1000000000,94415716.40062499,null,25.948911836266149,-24.177712721289851,null,36.238258271868439,-86.117995666742715,null,0,0,null,0,0]
[9772.4,9.7723999999999993,7.2746221423121193,1.4328954892788615,1.0000188507275571,6.1401028390166259E-3,1,0,10612.784178402479,1.5707021008137902,2.7419431865862238,1.1974805177778884,1.0011095114762052,4.7084744877556928E-2,1.0016110748592748,5.6725917537269945E-2,15.129453040200486,2.6498599991769737E-2,1.0006138727484355,7.747292678055008E-2,12.528652719043041,-108.53581486635564,71.464185133644364,null,1000000000,95499801.75999999,null,25.942175036744022,-24.081778719600248,null,36.189559791407973,-86.185933870093265,null,0,0,null,0,0]
[9829.2999999999993,9.8292999999999999,7.3161806644408918,1.4336837757792353,1.0000190708820282,6.1758528076720351E-3,1,0,10674.577332019313,1.5707026462705669,2.7557900385163787,1.1994478256127405,1.0011224621330819,4.7358488223261927E-2,1.0016298752017607,5.7055491094587144E-2,15.12951328445912,2.6652818919705584E-2,1.0006210735619412,7.7924365179393801E-2,12.47245495996969,-108.49774762310113,71.502252376898866,null,1000000000,96615138.48999998,null,25.935389048525757,-23.984775874299253,null,36.140019573485958,-86.254916552332844,null,0,0,null,0,0]
[9886.2000000000007,9.8862000000000005,7.3577436814537416,1.4344631568864108,1.0000192923145834,6.211602760541027E-3,1,0,10736.370485639287,1.5707031854485931,2.7696474495104271,1.2013954548120387,1.0011354878075456,4.763222446618403E-2,1.0016487843359203,5.7385052244314977E-2,15.129573878231193,2.6807036634091626E-2,1.0006283169121308,7.8375809655442677E-2,12.416636786031019,-108.46029786493449,71.539702135065511,null,1000000000,97736950.440000013,null,25.928707302117218,-23.888899765057989,null,36.090753959069872,-86.323389342229405,null,0,0,null,0,0]
[9943.1,9.9431000000000012,7.3993111176053947,1.4352337817301319,1.000019515025222,6.2473526975322293E-3,1,0,10798.163639262346,1.5707037184556607,2.7835152618671124,1.2033236846128297,1.0011485884966684,4.7905953565578308E-2,1.0016678022555925,5.7714600915570499E-2,15.129634821512507,2.6961253127922392E-2,1.0006356028116923,7.8827260242988181E-2,12.361193077915047,-108.42345814672781,71.57654185327219,null,1000000000,98865237.610000014,null,25.922127657239926,-23.794134396613668,null,36.041759969228153,-86.39136078625782,null,0,0,null,0,0]
[10000,10,7.4408828988351772,1.4359957961495602,1.0000197390139427,6.2831026185542743E-3,1,0,10859.956792888441,1.5707042453971081,2.7973933208951305,1.2052327892941834,1.0011617641975059,4.8179675480706272E-2,1.0016869289545809,5.8044137037487016E-2,15.129696114298847,2.7115468394192765E-2,1.0006429312733855,7.9278716976306507E-2,12.306118816586828,-108.38722111874588,71.612778881254116,null,1000000000,100000000,null,25.915648026786819,-23.700464057634445,null,35.993034672135387,-86.45883924235568,null,0,0,null,0,0]
[10058.25,10.058249999999999,7.4834454306120373,1.4367671196190768,1.0000199696409096,6.3197007196591536E-3,1,0,10923.216040672194,1.5707047786649619,2.8116111042620329,1.2071676592010103,1.0011753302021529,4.8459884192278896E-2,1.0017066221252171,5.8381478605533478E-2,15.129759223345117,2.7273341267487299E-2,1.0006504777111938,7.9740891299491107E-2,12.250115433838594,-108.3507410717544,71.649258928245601,null,1000000000,101168393.0625,null,25.909116138798876,-23.605689508511389,null,35.94342864495524,-86.52741654326303,null,0,0,null,0,0]
[10116.5,10.1165,7.5260123642297438,1.4375297183663591,1.0000202016073234,6.356298803834334E-3,1,0,10986.47528845902,1.5707053057917884,2.8258393075763419,1.2090830519383102,1.0011889748138714,4.8740085288254326E-2,1.0017264292849097,5.8718806871441265E-2,15.129822698668724,2.7431212839424592E-2,1.0006580687820339,8.0203072136181622E-2,12.194488903095436,-108.31487736817691,71.685122631823091,null,1000000000,102343572.25,null,25.902684804967041,-23.512030130803819,null,35.894098140716387,-86.595494328574759,null,0,0,null,0,0]
[10174.75,10.17475,7.568583625418313,1.4382837387195466,1.0000204349131836,6.3928968709817905E-3,1,0,11049.734536248861,1.5707058268830585,2.8400777742327055,1.2109792462863649,1.0012026980294475,4.9020278724946152E-2,1.0017463504268971,5.9056121759232312E-2,15.129886540265057,2.7589083102490093E-2,1.0006657044998335,8.0665259523101565E-2,12.139234149957222,-108.27962242863711,71.720377571362889,null,1000000000,103525537.5625,null,25.896351949316127,-23.419469955118188,null,35.845040161105743,-86.663080984385388,null,0,0,null,0,0]
[10233,10.233000000000001,7.6111591415619388,1.4390293237721596,1.000020669558489,6.4294949210034922E-3,1,0,11112.993784041671,1.5707063420418423,2.854326350638754,1.2128565160171241,1.0012164998456492,4.9300464458675183E-2,1.0017663855443792,5.939342319294675E-2,15.129950748129485,2.7746952049169649E-2,1.0006733848785991,8.1127453496957214E-2,12.084346199508726,-108.2449687752457,71.755031224754305,null,1000000000,104714289,null,25.89011554774418,-23.327993298880049,null,35.796251755422475,-86.730184711458492,null,0,0,null,0,0]
[10292.5,10.2925,7.6546526144630578,1.43978234523922,1.0000209106219691,6.466878319122603E-3,1,0,11177.610526425318,1.570706862235457,2.8688909713565423,1.214754811913106,1.0012306789835703,4.9586654763701457E-2,1.0017869682633709,5.9737948885642718E-2,15.13001671198241,2.7908207374611249E-2,1.0006812761958426,8.1599572635059431E-2,12.028654018588265,-108.21018459010976,71.789815409890238,null,1000000000,105935556.25,null,25.883842846811117,-23.235656257181979,null,35.746691682106729,-86.79823818658609,null,0,0,null,0,0]
[10352,10.352,7.698150378820662,1.4405268573529877,1.0000211530829963,6.5042616991663063E-3,1,0,11242.227268811956,1.5707073764492572,2.8834658257422454,1.216633924154839,1.0012449401248544,4.9872836939515712E-2,1.0018076698875304,6.0082460380486244E-2,15.130083057981903,2.8069461310716186E-2,1.000689214141196,8.2071698723195141E-2,11.973334365804414,-108.17601232209799,71.823987677902011,null,1000000000,107163904,null,25.877666673947584,-23.144417549521602,null,35.697406800808963,-86.865804510926296,null,0,0,null,0,0]
[10411.5,10.4115,7.7416523622979643,1.4412630027286362,1.0000213969415694,6.5416450610301276E-3,1,0,11306.844011201531,1.5707078847857636,2.8980507593946179,1.2184941290057971,1.0012592832659972,5.0159010939589528E-2,1.001828490409487,6.0426957596581121E-2,15.130149786122942,2.823071384947733E-2,1.0006971987298463,8.2543831800428277E-2,11.918382244596019,-108.14244432335539,71.857555676644608,null,1000000000,108399332.25,null,25.871585029896472,-23.054261350375924,null,35.64839411434702,-86.932891857970887,null,0,0,null,0,0]
[10471,10.471,7.7851584941680478,1.4419909208301473,1.0000216421976877,6.5790284046095939E-3,1,0,11371.460753593994,1.5707083873451673,2.9126456208993252,1.220335697721352,1.0012737084034748,5.0445176717402514E-2,1.0018494298218277,6.0771440453051433E-2,15.130216896400471,2.8391964982887992E-2,1.0007052299770667,8.3015971905803523E-2,11.863792756209881,-108.10947305228483,71.890526947715173,null,1000000000,109641841,null,25.865595965528087,-22.965172121032051,null,35.599650673220012,-86.999508220660431,null,0,0,null,0,0]
[10532,10.532,7.8297656534696261,1.442728791574476,1.0000218950875697,6.6173541663311951E-3,1,0,11437.706489495098,1.5707088966792355,2.9276185710833333,1.2222046245554594,1.0012885823192632,5.0738548174030534E-2,1.0018710205347281,6.1124592759438774E-2,15.130286095236885,2.8557279803600445E-2,1.000713512146582,8.3500022039910277E-2,11.808198495441722,-108.07628227109716,71.923717728902844,null,1000000000,110923024,null,25.859550037148033,-22.874928630102694,null,35.549954879769786,-87.067323225577908,null,0,0,null,0,0]
[10593,10.593,7.8743770274132618,1.4434583020692193,1.0000221494463468,6.6556799086125353E-3,1,0,11503.952225399136,1.5707094001472832,2.9426016430239001,1.2240545254782902,1.0013035424102028,5.1031910889606624E-2,1.0018927361921328,6.1477729800973269E-2,15.130355695709195,2.8722593130169484E-2,1.0007218433896454,8.3984079644034315E-2,11.75297525924128,-108.04370296850503,71.956297031494969,null,1000000000,112211649,null,25.853597421538787,-22.785774406668523,null,35.500535949331969,-87.134659652592248,null,0,0,null,0,0]
[10654,10.654,7.9189925447698286,1.4441795928359353,1.0000224052740185,6.6940056313410396E-3,1,0,11570.197961306056,1.5707098978500689,2.957594682891628,1.2258856770777211,1.0013185886724312,5.1325264814029131E-2,1.0019145767859177,6.1830851490573893E-2,15.130425697811869,2.8887904953968847E-2,1.0007302237229996,8.4468144760184632E-2,11.698118073192807,-108.01172735829357,71.98827264170643,null,1000000000,113507716,null,25.847736172982959,-22.697693606313933,null,35.451390853342502,-87.20152555540902,null,0,0,null,0,0]
[10715,10.715,7.9636121358998819,1.4448928012815014,1.0000226625705833,6.7323313344041322E-3,1,0,11636.443697215809,1.5707103898860566,2.9725975398593127,1.2276983508663499,1.0013337211020636,5.1618609897205438E-2,1.0019365423079123,6.2183957741182516E-2,15.130496101539334,2.9053215266372796E-2,1.000738653163483,8.4952217430348448E-2,11.643622060435625,-107.98034776644853,72.019652233551469,null,1000000000,114811225,null,25.841964394883554,-22.610670675284446,null,35.402516611672809,-87.267928809274565,null,0,0,null,0,0]
[10777.5,10.7775,8.0093330841626749,1.4456153052546121,1.0000229277176294,6.7715994522740105E-3,1,0,11704.318426634429,1.5707108882443748,2.98797934707944,1.2295367123379122,1.0013493150082982,5.1919159161663932E-2,1.0019591775310901,6.2545730828237542E-2,15.130568653060388,2.9222589009838863E-2,1.0007473408363026,8.5448201405639398E-2,11.588155586604019,-107.94880682012895,72.051193179871049,null,1000000000,116154506.25,null,25.836141552354842,-22.522589079861376,null,35.352718404733686,-87.335493128759367,null,0,0,null,0,0]
[10840,10.84,8.0550581659293137,1.4463296069118661,1.0000231944066951,6.8108675492601686E-3,1,0,11772.193156055921,1.5707113808559414,3.0033711489387467,1.2313562372830438,1.0013649993634546,5.2219699038278083E-2,1.0019819438845161,6.2907487522712482E-2,15.130641626189187,2.9391961148333163E-2,1.0007560800971471,8.5944193400188953E-2,11.533058205308379,-107.91787560997967,72.082124390020326,null,1000000000,117505600,null,25.830408755440338,-22.435585870756235,null,35.303198354247449,-87.40258795082903,null,0,0,null,0,0]
[10902.5,10.9025,8.1007873112048188,1.4470358444249383,1.0000234626377791,6.8501356252415237E-3,1,0,11840.067885480237,1.5707118678195884,3.0187727925583845,1.2331572018703962,1.001380774163283,5.2520229473198253E-2,1.0020048413592524,6.3269227731043279E-2,15.130715020919634,2.9561331672579402E-2,1.0007648709644408,8.6440193459086684E-2,11.478324973762899,-107.88754623935336,72.112453760646645,null,1000000000,118864506.25,null,25.824764115241656,-22.349645227248121,null,35.253953406474416,-87.469221194727766,null,0,0,null,0,0]
[10965,10.965,8.1465204515596916,1.4477341528954104,1.0000237324108803,6.8894036800969897E-3,1,0,11907.94261490733,1.570712349231894,3.034184128066816,1.2349398771447129,1.0013966394035088,5.2820750412584966E-2,1.0020278699463101,6.3630951359691629E-2,15.130788837245598,2.9730700573301839E-2,1.0007737134567143,8.6936201627397638E-2,11.423951046213187,-107.85781092914628,72.142189070853718,null,1000000000,120231225,null,25.819205790835554,-22.264751622065926,null,35.204980556732025,-87.535400603794997,null,0,0,null,0,0]
[11028.75,11.02875,8.1931723010726252,1.4484383960335774,1.0000240091680284,6.9294570741601051E-3,1,0,11977.174838925775,1.570712834651331,3.0499135225022163,1.2367396401425486,1.0014129151157789,5.3127271932636382E-2,1.0020514941676477,6.3999892283545551E-2,15.130864564219394,2.9903455169865485E-2,1.0007827860022154,8.7442138360102145E-2,11.368854868276317,-107.82808496719218,72.171915032807817,null,1000000000,121633326.5625,null,25.813623361815804,-22.179222999982311,null,35.155305499383395,-87.60244391248925,null,0,0,null,0,0]
[11092.5,11.092499999999999,8.2398281680442622,1.4491346643295011,1.0000242875294882,6.9695104459893756E-3,1,0,12046.407062947008,1.5707133144912344,3.0656526946603546,1.2385209287639289,1.0014292849131787,5.3433783460418036E-2,1.0020752547791927,6.436881576139955E-2,15.130940729808172,3.0076208057822705E-2,1.000791912297625,8.7948083624470749E-2,11.31412262422498,-107.7989610838258,72.201038916174198,null,1000000000,123043556.25,null,25.808127013224535,-22.094751989501315,null,35.105907369671229,-87.669030786482395,null,0,0,null,0,0]
[11156.25,11.15625,8.2864879846154516,1.4498230918173036,1.000024567495259,7.0095637954563066E-3,1,0,12115.639286970987,1.5707137888472531,3.0814014947133779,1.2402840148806622,1.0014457487910946,5.3740284938828251E-2,1.0020991517712432,6.473772169407388E-2,15.131017334005318,3.0248959227331753E-2,1.000801092362948,8.8454037468247051E-2,11.25974946812175,-107.77043139159969,72.229568608400314,null,1000000000,124461914.0625,null,25.802714936669311,-22.011323015724344,null,35.056783130210903,-87.735168908106829,null,0,0,null,0,0]
[11220,11.22,8.3331516844412121,1.4505038095589791,1.0000248490653389,7.0496171224324047E-3,1,0,12184.871510997657,1.5707142578128626,3.0971597757901526,1.2420291652891908,1.0014623067448865,5.4046776310776666E-2,1.0021231851340424,6.5106609982417338E-2,15.131094376804171,3.0421708668551484E-2,1.0008103262183035,8.8959999939147494E-2,11.205730648814075,-107.74248812344584,72.257511876554162,null,1000000000,125888400,null,25.797385369754902,-21.928920794425938,null,35.007929792406365,-87.800865789403005,null,0,0,null,0,0]
[11285.5,11.285500000000001,8.3811003250161242,1.4511953182573836,1.0000251400357658,7.0907699289415073E-3,1,0,12256.004227451349,1.5707147341336547,3.1133603608033118,1.2438038159652762,1.0014794172108727,5.4361670584953919E-2,1.0021480202632969,6.5485606134234986E-2,15.131173991323388,3.0599198440846305E-2,1.0008198695984918,8.9479860611650044E-2,11.150593124502386,-107.71438053880297,72.28561946119703,null,1000000000,127362510.25,null,25.791993633981335,-21.845310204554945,null,34.958014450365546,-87.867914259735912,null,0,0,null,0,0]
[11351,11.351000000000001,8.4290529277046549,1.4518789593394776,1.0000254326997877,7.1319227114330251E-3,1,0,12327.13694390779,1.5707152049573079,3.1295706494538527,1.2455600877502133,1.0014966269785608,5.4676554068035989E-2,1.0021729993320254,6.5864583447598338E-2,15.131254068840551,3.0776686367602023E-2,1.000829469805856,8.9999730493462007E-2,11.09581978612837,-107.6868757752522,72.313124224747796,null,1000000000,128845201,null,25.786685371238764,-21.762751714333017,null,34.908378844571381,-87.934512477889569,null,0,0,null,0,0]
[11416.5,11.416499999999999,8.4770094252683528,1.4525548656877958,1.0000257270574033,7.1730754697675904E-3,1,0,12398.269660366932,1.5707156703784386,3.1457904917329689,1.2472982540123128,1.0015139360428311,5.4991426698138383E-2,1.0021981223294651,6.6243541815059745E-2,15.131334609348315,3.095417243814658E-2,1.0008391268625949,9.0519609636247625E-2,11.041405777443963,-107.65996579393983,72.340034206060167,null,1000000000,130336472.25,null,25.781458812749666,-21.681229662785071,null,34.859019887731179,-88.000668060440503,null,0,0,null,0,0]
[11482,11.481999999999999,8.524969751976343,1.4532231672231903,1.0000260231086109,7.2142282038058373E-3,1,0,12469.40237682873,1.5707161304895043,3.1620197406222754,1.2490185829501506,1.0015313443985356,5.5306288413389471E-2,1.0022233892447927,6.6622481129204131E-2,15.131415612839296,3.1131656641808603E-2,1.000848840791035,9.1039498091640192E-2,10.987346337507304,-107.63364268239775,72.366357317602251,null,1000000000,131836324,null,25.776312235108257,-21.600728685017064,null,34.809934542487724,-88.066388454271561,null,0,0,null,0,0]
[11548.75,11.54875,8.5738492250192451,1.4538965302300539,1.0000263265520304,7.2561662702233546E-3,1,0,12541.892587882177,1.5707165940118215,3.1785682364180956,1.2507536638329033,1.0015491871212352,5.5627147646667915E-2,1.0022492864057733,6.7008632396264409E-2,15.131498638511593,3.1312526016882246E-2,1.0008587986331008,9.1569317716752266E-2,10.932615179419418,-107.60741293499704,72.392587065002957,null,1000000000,133373626.5625,null,25.77114798671705,-21.51972631098608,null,34.760190853941026,-88.132922866936582,null,0,0,null,0,0]
[11615.5,11.615500000000001,8.6227325415221028,1.4545622587828286,1.0000266317542965,7.2981043111161291E-3,1,0,12614.382798938288,1.5707170522067548,3.1951262021725828,1.2524707665696775,1.0015671329503923,5.5947995414826028E-2,1.0022753330072161,6.7394763650709386E-2,15.131582144991215,3.1493393430763933E-2,1.000868815585475,9.2099147121476016E-2,10.878242561021969,-107.58177647141055,72.418223528589451,null,1000000000,134919840.25,null,25.766063325236729,-21.439753046704705,null,34.710725104629752,-88.199020419395836,null,0,0,null,0,0]
[11682.25,11.68225,{"$f":"SQRT(1+(A205/pole1)^2)","v":8.6716196364863087},{"$f":"ATAN(A205/pole1)","v":1.4552204814062946},{"$f":"SQRT(1+(A205/Zero1)^2)","v":1.0000269387154077},{"$f":"ATAN(A205/Zero1)","v":7.3400423263366614E-3},{"$f":"IF(VIN_nom>Vout, 1, SQRT(1+(A205/z_RHP)^2))","v":1},{"$f":"IF(VIN_nom>Vout, 0, -ATAN(A205/z_RHP))","v":0},{"$f":"SQRT(1+(A205/Pole2)^2)","v":12686.873009997016},{"$f":"ATAN(A205/Pole2)","v":1.570717505165623},3.211693491417916,1.2541701591727763,{"$f":"SQRT(1+(A205/pole4)^2)","v":1.0015851818804644},{"$f":"ATAN(A205/pole4)","v":5.6268831652423607E-2},{"$f":"IF(VOUT_setting=1,1,SQRT(1+(A205*zterm1)^2))","v":1.0023015290374708},{"$f":"IF(VOUT_setting=1,0,ATAN(((A205*zterm1))))","v":6.7780874778961456E-2},15.131666132270208,{"$f":"IF(VOUT_setting=1,0,ATAN(A205*$Q$4/(1+Afbr-$Q$5*(A205)^2)))","v":3.1674258872161812E-2},{"$f":"SQRT((1-(Z205/pterm2))^2+(A205/pterm1)^2)","v":1.0008788916721949},{"$f":"IF((ATAN((A205/pterm1)/(1-A205^2/pterm2))>0),ATAN((A205/pterm1)/(1-A205^2/pterm2)),PI()+ATAN((A205/pterm1)/(1-A205^2/pterm2)))","v":9.262898636035713E-2},{"$f":"20*LOG10(((E205*K205*G205*O205)/(C205*I205*S205*M205*Q205))*Adc)","v":10.824223733745439},{"$f":"((F205+L205+H205+P205)-(D205+J205+T205+N205+R205))*radconv","v":-107.55672531006888},{"$f":"IF(V205>0,V205,V205+180)","v":72.443274689931116},null,{"$f":"IF(U205<0,A205,1000000000)","v":1000000000},{"$f":"A205^2","v":136474965.0625},null,{"$f":"20*LOG10((K205/(I205*M205))*AEA)","v":25.761056563505655},{"$f":"(L205-(J205+N205))*radconv","v":-21.360793537681801},null,{"$f":"20*LOG10((E205*G205/(C205*S205))*Acs*Am)","v":34.661534233338472},{"$f":"(F205+H205-(D205+T205))*radconv","v":-88.264688478710525},null,{"$f":"SUM((U206<0)*(U205>0))*A205","v":0},0,null,0,0]
[11749,{"$f":"A206/1000","v":11.749000000000001},8.7205104463658127,1.4558713237693299,1.0000272474353622,7.3819803157374559E-3,1,0,12759.36322105832,1.5707179529776694,3.228269960611299,1.2558521045635898,1.0016033339058783,5.6589656294034681E-2,1.0023278744848216,6.8166965667478888E-2,15.131750600340578,3.1855122329784769E-2,1.0008890269174349,9.3158835487907141E-2,10.770554041755512,-107.53225159733726,72.467748402662735,null,1000000000,138039001,null,25.756126057650004,-21.282832720996009,null,34.612615228300299,-88.329934248308703,null,0,0,null,{"$f":"SUM((V207<-183)*(V206>-183))*A206","v":0},{"$f":"IF(AK206>0,U206,0)","v":0}]
[11817.5,11.817500000000001,8.7706868349083589,1.4565316852479582,1.0000275660777125,7.4250177759890264E-3,1,0,12833.753924547082,1.5707184072705789,3.2452904154683777,1.2575602770540815,1.0016220690062947,5.691887994397743E-2,1.0023550659688276,6.8563157627354057E-2,{"$f":"IF(VOUT_setting=1,1,SQRT((1+Afbr-$Q$5*(A207)^2)^2+(A207*$Q$4)^2))","v":15.131837782785338},3.2040725451685979E-2,1.0008994894115231,9.3702586129166349E-2,10.715835477076157,-107.507728503716,72.492271496284005,null,1000000000,139653306.25,null,25.751143888795049,-21.203850801244226,null,34.562693246073287,-88.396458926081451,null,0,0,null,0,0]
[11886,11.885999999999999,8.8208670046346036,1.4571845336766061,1.0000278865723358,7.4680552087345326E-3,1,0,12908.144628038459,1.5707188563272332,3.2623202407827661,1.2592506205752267,1.0016409126666679,5.7248091242370763E-2,1.0023824147820224,6.8959328030158765E-2,15.13192547154476,3.2226326460339481E-2,1.0009100142587675,9.4246347300606603E-2,10.66147494923956,-107.48379717998972,72.516202820010278,null,1000000000,141276996,null,25.746238653224736,-21.125889398483245,null,34.513051300842037,-88.46255374270946,null,0,0,null,0,0]
[11954.5,11.954499999999999,8.8710508913783794,1.4578299959988599,1.0000282089192301,7.5110926138145699E-3,1,0,12982.535331532412,1.5707193002376447,3.2793592905711488,1.2609234033013517,1.0016598648808708,5.7577290118553892E-2,1.0024099209115285,6.9355476753303835E-2,15.132013666610048,3.2411925343545089E-2,1.000920601485745,9.4790119061026676E-2,10.607467715881329,-107.46044954504485,72.539550454955148,null,1000000000,142910070.25,null,25.741408708076278,-21.048933148564767,null,34.463686293317679,-88.52822597490254,null,0,0,null,0,0]
[12023,12.023,8.9212384324126202,1.4584681963266946,1.0000285331183936,7.5541299910697373E-3,1,0,13056.926035028891,1.570719739089774,3.2964074217902835,1.2625788882567106,1.0016789256427421,5.7906476501882145E-2,1.0024375843443962,6.9751603674240811E-2,15.132102367972356,3.2597522089103513E-2,1.000931251119185,9.5333901469186522E-2,10.553809127419793,-107.43767765048453,72.562322349515469,null,1000000000,144552529,null,25.736652452932365,-20.972966982301223,null,34.414595174549753,-88.593482737128895,null,0,0,null,0,0]
[12093,12.093,8.9725286820820624,1.4591129958496574,1.0000288663303611,7.5981097637329844E-3,1,0,13132.945732035161,1.5707201824156103,3.3138381058009951,1.264253023059678,1.0016985159262384,5.8242858366461966E-2,1.0024660160402894,7.0156382256264249E-2,15.132193534739608,3.2787180775904999E-2,1.000942198455524,9.5889602582462985E-2,10.499330969821049,-107.41499375607334,72.585006243926657,null,1000000000,146240649,null,25.731866551982165,-20.896344785512206,null,34.364708897276408,-88.659746501606335,null,0,0,null,0,0]
[12163,12.163,9.0238226198196827,1.4597504651926176,1.0000292014766041,7.6420895070028472E-3,1,0,13208.965429043987,1.5707206206386253,3.3312779803858734,1.2659096336362756,1.0017182195502448,5.8579227035955486E-2,1.0024946119765972,7.0561137812163582E-2,15.132285230201411,3.2976837204659604E-2,1.0009532110183024,9.644531493885132E-2,10.445207362540375,-107.39289472489311,72.607105275106889,null,1000000000,147938569,null,25.727154354618193,-20.820725604541671,null,34.315102353851344,-88.725590923573066,null,0,0,null,0,0]
[12233,12.233000000000001,9.0751201830889414,1.460380728135648,1.0000295385571196,7.6860692207092246E-3,1,0,13284.985126055317,1.5707210538464171,3.3487269019538215,1.2675489847580259,1.0017380365080728,5.8915582435027439E-2,1.0025233721392648,7.0965870211295065E-2,15.132377454348164,3.316649136235171E-2,1.0009642888365371,9.7001038600929818E-2,10.391433629025887,-107.37137248976627,72.628627510233727,null,1000000000,149646289,null,25.722514282117569,-20.746094269801446,null,34.265772446677673,-88.791023098700052,null,0,0,null,0,0]
[12303,12.303000000000001,9.1264213107549388,1.4610039056988657,1.0000298775719065,7.7300489046820114E-3,1,0,13361.00482306911,1.570721482124591,3.366184729817288,1.2691713360791417,1.0017579667929968,5.9251924488360565E-2,1.0025522965141589,7.1370579323060263E-2,15.13247020717021,3.3356143235966661E-2,1.0009754319394102,9.7556773631233426E-2,10.338005183988665,-107.35041911846335,72.64958088153665,null,1000000000,151363809,null,25.71794479665289,-20.67243590479044,null,34.216716128527281,-88.856049964521986,null,0,0,null,0,0]
[12374.5,12.374499999999999,9.1788253659439878,1.4616332453412859,1.0000302258481819,7.7749709795812139E-3,1,0,13438.653513592846,1.5707219145779352,{"$f":"SQRT(1+(A215/Zero2)^2)","v":3.384025705287296},{"$f":"ATAN(A215/Zero2)","v":1.2708111666948139},1.0017784411441932,5.9595460015342869E-2,1.0025820102104872,7.1783936595957665E-2,15.132565493332434,3.3549856706752652E-2,1.0009868812516367,9.8124429070546679E-2,10.283783635440455,-107.3295959167309,72.670404083269105,null,1000000000,153128250.25,null,25.713348708243814,-20.598188444871596,null,34.166887932512232,-88.922058885579972,null,0,0,null,0,0]
[12446,12.446,9.231233015299237,1.4622554394410565,1.0000305761425097,7.819893023100136E-3,1,0,13516.302204119065,1.5707223420625482,3.4018756850917611,1.2724337929273111,1.001799033717093,5.9938981459712305E-2,1.0026118952020528,7.2197269297480438E-2,15.132661331049675,3.3743567767078958E-2,1.0009983987384661,9.8692096502261295E-2,10.229912942946013,-107.30934991118527,72.690650088814735,null,1000000000,154902916,null,25.708823146342436,-20.524925631937318,null,34.117338905935725,-88.987659086113268,null,0,0,null,0,0]
[12517.5,12.5175,9.2836441979517623,1.4628706085336529,1.0000309284548878,7.8648150350575045E-3,1,0,13593.950894647727,1.5707227646635742,3.4197345282309795,1.2740394757034024,1.0018197445044057,6.0282488741263941E-2,1.002641951473539,7.2610577288601277E-2,15.132757720311471,3.3937276403079288E-2,1.0010099844315332,9.9259775992877664E-2,10.176388500191024,-107.28967306927255,72.710326930727447,null,1000000000,156687806.25,null,25.704366596338041,-20.452632516267954,null,34.068065957347102,-89.052857476116486,null,0,0,null,0,0]
[12589,12.589,9.3360588543954197,1.4634788704692443,1.0000312827853142,7.9097370152720493E-3,1,0,13671.599585178787,1.5707231824642234,3.4376020965660121,1.2756284708785213,1.0018405734988003,6.0625981779812807E-2,1.0026721790095425,7.3023860430343326E-2,15.132854661107281,3.4130982600888468E-2,1.0010216383626525,9.9827467608847906E-2,10.123205790474039,-107.27055749503312,72.729442504966883,null,1000000000,158482921,null,25.699977582935038,-20.381294438600325,null,34.019066045594798,-89.117660811724775,null,0,{"$f":"IF(AH218>0,W218,0)","v":0},null,0,0]
[12662.25,12.66225,9.3897599285930671,1.464094977587312,1.000031647880903,7.9557584514055955E-3,1,0,13751.14876813788,1.5707236055977267,3.4559158896611644,1.2772393145681202,1.0018620348683067,6.0977867136647414E-2,1.0027033239676486,7.3447232979368879E-2,15.132954546516688,3.4329427316553113E-2,1.0010336483270341,0.10040906641842974,10.069071157352239,-107.25154798487299,72.748452015127015,null,1000000000,160332575.0625,null,25.695549680151043,-20.309185683231625,null,33.969146850334681,-89.183647472494712,null,0,0,null,0,0]
[12735.5,12.7355,9.4434645264932247,1.4647040773822573,1.0000320150945299,8.0017798538383009E-3,1,0,13830.697951099406,1.5707240238638076,3.4742385556728239,1.2788331716120827,1.0018836202863575,6.1329737374425763E-2,1.0027346486434421,7.3870579152593263E-2,15.13305501076611,3.4527869443756784E-2,1.0010457299788504,0.10099067809521853,10.015285871727876,-107.23311120471689,72.766888795283108,null,1000000000,162192960.25,null,25.691189647074214,-20.238049045826202,null,33.919507916351122,-89.249233382391168,null,0,0,null,0,0]
[12808.75,12.80875,9.4971725883184153,1.4653062882809171,1.0000323844261925,8.0478012223752574E-3,1,0,13910.247134063326,1.5707244373459728,3.4925699549541243,1.2804103013207004,1.0019053297449343,6.1681592406995882E-2,1.0027661530200802,7.4293898800749533E-2,15.133156053844035,3.4726308967594599E-2,1.0010578833528991,0.10157230271050696,9.9618453549997703,-107.21523909418019,72.784760905819809,null,1000000000,164064076.5625,null,25.686896018045289,-20.167869668847185,null,33.870146130980253,-89.314425330868005,null,0,0,null,0,0]
[12882,12.882,9.5508840556319381,1.4659017260663774,1.0000327558758886,8.0938225568215564E-3,1,0,13989.796317029593,1.5707248461258296,3.5109099507088635,1.2819709579227494,1.0019271632359745,6.2033432148228325E-2,1.0027978370806268,7.4717191774627503E-2,15.133257675738873,3.4924745873162827E-2,1.0010701084841762,0.10215394033553345,9.9087451176135932,-107.19792373243806,72.802076267561944,null,1000000000,165945924,null,25.682667365634355,-20.098632985799586,null,33.821058432377228,-89.379229955900243,null,0,0,null,0,0]
[12957.25,12.95725,9.6060655338551744,1.4665064874500648,1.0000331396731215,8.1411004107702079E-3,1,0,14071.51749134206,1.5707252612540652,3.5297595081472144,1.2835573342916493,1.0019497220132922,6.2394862421511182E-2,1.0028305733270324,7.5152014302433262E-2,15.133362675019198,3.512859810909999E-2,1.0010827421672561,0.10275147247355497,9.8545447610859807,-107.1807071762215,72.819292823778497,null,1000000000,167890327.5625,null,25.678389456378845,-20.028472529405384,null,33.770912704849778,-89.445407479010015,null,0,0,null,0,0]
[13032.5,13.032500000000001,9.6612504852316459,1.4671043402702304,1.0000335257056223,8.1883782283241804E-3,1,0,14153.238665656922,1.5707256715883777,3.5486178541609963,1.2851268536816358,1.0019724116712445,6.2756276372832639E-2,1.0028634991668477,7.5586808360406252E-2,15.133468285130689,3.5332447549955584E-2,1.001095451655061,0.10334901849368111,9.8006941929180655,-107.16406168089549,72.835938319104514,null,1000000000,169846056.25,null,25.674177185292169,-19.959276696908308,null,33.721049844853439,-89.511189968058304,null,0,0,null,0,0]
[13107.75,13.107749999999999,9.7164388505835646,1.4676954018155866,1.0000339139733885,8.2356560092721673E-3,1,0,14234.959839974139,1.5707260772113316,3.5674848493763931,1.2866797757474837,1.0019952322009402,6.3117673908888894E-2,1.0028966145813989,7.6021573786966626E-2,15.13357450606058,3.5536294179575482E-2,1.001108236986187,0.10394657847296508,9.7471888244993785,-107.14797910162937,72.852020898370625,null,1000000000,171813110.0625,null,25.670029123194858,-19.891030610570276,null,33.671466693265387,-89.576584147620238,null,0,0,null,0,0]
[13183,13.183,9.7716305720664192,1.4682797867442112,1.0000343044764173,8.2829337534028637E-3,1,0,14316.681014293674,1.5707264782036054,3.5863603572891836,1.2882163550015495,1.0020181835934376,6.347905493640181E-2,1.0029299195519077,7.6456310420599097E-2,15.133681337796014,3.5740137981806884E-2,1.0011210981994512,0.10454415248839814,9.6940241566603742,-107.13245143739336,72.867548562606643,null,1000000000,173791489,null,25.665943878461309,-19.823719687185534,null,33.622160142851598,-89.641596591543177,null,0,0,null,0,0]
[13259.75,13.25975,9.8279258592710335,1.4688690591945792,1.0000347050660985,8.3311538728932568E-3,1,0,14400.031182123581,1.5707268825007727,3.6056207514628946,1.2897669877121531,1.0020417272810931,6.3847622470305163E-2,1.0029640836506934,7.689968307376821E-2,15.133790928244482,3.5948042186406064E-2,1.0011342939890113,0.10515365281661926,9.6401461087675919,-107.11717771932533,72.882822280674674,null,1000000000,175820970.0625,null,25.661840503263846,-19.756015505895213,null,33.572152495086584,-89.707518403092436,null,0,0,null,0,0]
[13336.5,13.336499999999999,9.8842245202703012,1.4694516190779503,1.0000351079810386,8.379373953639923E-3,1,0,14483.381349955815,1.5707272821445741,3.6248897230724832,1.2913011385580404,1.002065407081721,6.4216172635037497E-2,1.0029984448980123,7.7343025435498022E-2,15.133901154065013,3.6155943415836549E-2,1.0011475687983296,0.10576316790772836,9.5866133000887821,-107.10246489216563,72.897535107834372,null,1000000000,177862232.25,null,25.65779966493664,-19.689254404094306,null,33.522426216659539,-89.773056460953626,null,0,0,null,0,0]
[13413.25,13.41325,9.9405264977412671,1.470027580053092,1.0000355132212346,8.4275939954186647E-3,1,0,14566.731517790337,1.5707276772148886,3.6441671360552839,1.2928190618238029,1.0020892229856717,6.4584705331713982E-2,1.003033003273603,7.7786337334630612E-2,15.134012015243735,3.6363841652964662E-2,1.0011609226693008,0.10637269784321195,9.5334212300647501,-107.08830491106586,72.911695088934138,null,1000000000,179915275.5625,null,25.653820000332324,-19.623421811259941,null,33.472978170492937,-89.838217281976171,null,0,0,null,0,0]
[13490,13.49,9.9968317356490033,1.4705970532358668,1.0000359207866838,8.4758139980052952E-3,1,0,14650.081685627105,1.5707280677897775,3.663452857153541,1.2943210067421005,1.0021131749832419,6.4953220461478056E-2,1.0030677587570904,7.8229618600079417E-2,15.134123511766699,3.6571736880658207E-2,1.0011743556440595,0.10698224270448796,9.4805654854208647,-107.07468987482351,72.925310125176495,null,1000000000,181980100,null,25.649900182126991,-19.558503446221103,null,33.42380527097221,-89.903007237307762,null,0,0,null,0,0]
[13568.5,13.5685,10.054424122046388,1.4711729130024751,1.000036340050539,8.5251334387018343E-3,1,0,14735.332345892406,1.5707284626994495,3.6831867762181432,1.2958409235823565,1.0021378138910575,6.5330119941038448E-2,1.0031035105901396,7.8682975388314425E-2,15.134238207780445,3.678436925941532E-2,1.0011881767821669,0.10760570150775163,9.4268479658255284,-107.06132003464433,72.938679965355675,null,1000000000,184104192.25,null,25.645951548661326,-19.493036002125763,null,33.373792630567578,-89.968897333928524,null,0,0,null,0,0]
[13647,13.647,10.112019804656292,1.4717422130329452,1.0000367617468879,8.5744528379242107E-3,1,0,14820.583006159975,1.5707288530659385,3.702929113284569,1.2973446368523807,1.0021625951487625,6.5707000834357807E-2,1.0031394685787178,7.9136299768157906E-2,15.134353568412324,3.6996998453686661E-2,1.0012020807624513,0.10822917609728983,9.3734732149131332,-107.04850400150887,72.951495998491126,null,1000000000,186240609,null,25.642062823101206,-19.428495629000409,null,33.324061457871665,-90.034412492216617,null,0,0,null,0,0]
[13725.5,13.7255,10.169618727474367,1.4723050644146407,1.0000371858757273,8.6237721954325504E-3,1,0,14905.833666429782,1.5707292389671959,3.7226797344242741,1.2988323976006693,1.0021875187457969,6.6083863035755128E-2,1.0031756327006565,7.9589591556785869E-2,15.134469593647156,3.7209624445146167E-2,1.0012160676307711,0.10885266655999262,9.3204367797355214,-107.0362337690635,72.9637662309365,null,1000000000,188389350.25,null,25.638232694444216,-19.364867941236977,null,33.274608611304423,-90.099559082001335,null,0,0,null,0,0]
[13804,13.804,10.227220835754805,1.4728615757488002,1.000037612437054,8.673091510986974E-3,1,0,14991.084326701779,1.5707296204793995,3.7424385084803213,1.30030445185975,1.002212584671542,6.6460706439581199E-2,1.0032120029336631,8.0042850571454133E-2,15.134586283469663,3.7422247215469447E-2,1.0012301374332446,0.10947617298267336,9.2677342935059563,-107.02450147579503,72.975498524204966,null,1000000000,190550416,null,25.634459886237813,-19.302138840521391,null,33.225431000899356,-90.164343330663058,null,0,0,null,0,0]
[13884.25,13.88425,10.286110304512805,1.4734240503187579,1.0000380510221394,8.723510258111862E-3,1,0,15078.235479402454,1.5707300060372655,3.7626460585782113,1.3017933380911435,1.0022383565041655,6.6845931270198514E-2,1.0032493969992318,8.0506180018181162E-2,15.134706261617939,3.7639606635126763E-2,1.0012446066700746,0.1101135958180248,9.2141976505890639,-107.01305565766097,72.986944342339029,null,1000000000,192772398.0625,null,25.630660928094716,-19.23892579101167,null,33.175438417733403,-90.230203606492623,null,0,0,null,0,0]
[13964.5,13.964499999999999,10.345002990515042,1.4739801208815078,1.0000384921493695,8.7739289608844643E-3,1,0,15165.386632105345,1.5707303871637495,3.782861860519533,1.3032663141946341,1.0022642770594659,6.7231136232610594E-2,1.0032870064204571,8.0969474827435259E-2,15.13482693428292,3.785696264970697E-2,1.001259162678283,0.11075103551610684,9.161001049187794,-107.00215586604808,72.997844133951915,null,1000000000,195007260.25,null,25.626919282752574,-19.176622932419534,null,33.125727108959779,-90.295697928441299,null,0,0,null,0,0]
[14044.75,14.044750000000001,10.403898839126565,1.4745298958483106,1.0000389358187407,8.8243476190485066E-3,1,0,15252.537784810413,1.5707307639348123,3.8030857827130178,1.3047236275460645,1.0022903463259039,6.7616321214047703E-2,1.0033248311731209,8.1432734804237669E-2,15.134948301448011,3.8074315239638147E-2,1.0012738055079897,0.11138849216941758,9.108140089146243,-106.9917941521278,73.008205847872205,null,1000000000,197255002.5625,null,25.623233691589181,-19.115216089044253,null,33.076293933444163,-90.360832513331189,null,0,0,null,0,0]
[14125,14.125,10.462797796939702,1.4750734812046991,1.0000393820302496,8.8747662323477167E-3,1,0,15339.688937517618,1.570731136424689,3.8233176962993665,1.3061655205543834,1.0023165642918765,6.8001486101775546E-2,1.0033628712328708,8.1895959753698774E-2,15.135070363096517,3.8291664385350269E-2,1.001288535209599,0.11202596587036939,9.0556104552022987,-106.98196271256288,73.018037287437124,null,1000000000,199515625,null,25.619602929224886,-19.05469136967028,null,33.027135801705647,-90.425613438995569,null,0,0,null,0,0]
[14207.25,14.20725,10.523167813325694,1.475624299351189,1.0000398420002514,8.9264413374720315E-3,1,0,15429.01208157174,1.5707315138311493,3.8440619926252766,1.307627595531538,1.0023435899574666,6.8396229145396961E-2,1.0034020827286843,8.2370692698712916E-2,15.135196187423398,3.8514426737682711E-2,1.0013037222060439,0.11267934455319228,9.0021110585016118,-106.97242850028938,73.027571499710618,null,1000000000,201845952.5625,null,25.615937327843177,-18.993559378266781,null,32.977034777027853,-90.491648069664151,null,0,0,null,0,0]
[14289.5,14.2895,10.583540986023237,1.4761688334433807,1.0000403046406738,8.9781163949222767E-3,1,0,15518.33522562803,1.5707318868929256,3.8648144180385939,1.3090739721194651,1.0023707718018739,6.8790950841589663E-2,1.0034415203448956,8.2845388434456116E-2,15.135322741245227,3.8737185430360872E-2,1.0013190005665467,0.11333274134026421,8.9489507936023749,-106.96343517990529,73.036564820094711,null,1000000000,204189810.25,null,25.612326818347317,-18.933325366262562,null,32.927216266253026,-90.557323690571423,null,0,0,null,0,0]
[14371.75,14.37175,10.643917261323761,1.4767071900920783,1.000040769951513,9.0297914044225411E-3,1,0,15607.658369686458,1.5707322556846124,3.8855748422896519,1.310504895844562,1.0023981098123931,6.9185651069095896E-2,1.0034811840548445,8.3320046751396024E-2,15.135450024543726,3.8959940442321025E-2,1.0013343703463078,0.11398615633079677,8.8961252782022591,-106.95497480595849,73.045025194041514,null,1000000000,206547198.0625,null,25.608770183467001,-18.873975263357682,null,32.877677104788681,-90.622646415766667,null,0,0,null,0,0]
[14454,14.454000000000001,10.704296586727706,1.4772394735171732,1.000041237932765,9.081466365696917E-3,1,0,15696.981513746983,1.5707326202791057,3.9063431378479772,1.3119206072679575,1.0024256039762476,6.9580329706697877E-2,1.0035210738317224,8.3794667440100737E-2,15.135578037300503,3.9182691752501532E-2,1.0013498316008413,0.11463958962390469,8.8436302145099148,-106.9470395803902,73.052960419609803,null,1000000000,208918116,null,25.605266238230804,-18.815495283646115,null,32.828414180256814,-90.687622222304526,null,0,0,null,0,0]
[14622.5,14.6225,10.828000927818499,1.4783113881749939,1.0000422049932871,9.1873292045103888E-3,1,0,15879.971784564312,1.5707333543907749,3.9489137940547474,1.3147743630531097,1.0024824169817954,7.038881314898783E-2,1.003603499153529,8.4766872288575087E-2,15.135842566205799,3.9639015614797685E-2,1.0013817919146917,0.11597829169281994,8.7371013816976042,-106.93239103602824,73.067608963971765,null,1000000000,213817506.25,null,25.598247651903534,-18.698351871811749,null,32.72834234233968,-90.819674893049736,null,0,0,null,0,0]
[14706.75,14.70675,10.889857684383962,1.4788382128167381,1.0000426927263222,9.2402605468419729E-3,1,0,15971.46691997613,1.5707337151383929,3.970210988030904,1.3161782856523112,1.0025110691891743,7.079302037503675E-2,1.0036450674911068,8.5252914600667792E-2,15.135975978626401,3.98671716302351E-2,1.0013979162769071,0.11664767195402133,8.6843393862081708,-106.92586118720023,73.074138812799774,null,1000000000,216288495.5625,null,25.594816482991952,-18.641093069466308,null,32.678728321643064,-90.885179642976652,null,0,0,null,0,0]
[14791,14.791,10.951717429223789,1.4793590861629089,1.0000431832612011,9.2931918373947604E-3,1,0,16062.962055390002,1.5707340717763516,3.9915159237732998,1.3175672239366572,1.002539885180924,7.1197204430872726E-2,1.0036868729072423,8.5738916538440249E-2,15.136110156332053,4.0095323671696222E-2,1.0014141368572465,0.11731707184121296,8.6319066125485087,-106.91985054227158,73.080149457728425,null,1000000000,218773681,null,25.591435862023431,-18.584691242100426,null,32.629391376544412,-90.95034453623731,null,0,0,null,0,0]
[14877.25,14.87725,11.015048697611608,1.4798862639610608,1.0000436883432229,9.3473796031533982E-3,1,0,16156.629182151104,1.5707344326962351,4.0133345055574319,1.3189738555527264,1.0025695548796836,7.1610959222855416E-2,1.0037299162932123,8.62364135564197E-2,15.136248311995091,4.0328887645134349E-2,1.0014308422313611,0.11800238296793787,8.578565805999375,-106.91422708815107,73.085772911848935,null,1000000000,221332567.5625,null,25.588026189108092,-18.527824269625,null,32.579167034710729,-91.016710304135756,null,0,0,null,0,0]
[14963.5,14.9635,11.078382992261597,1.4804074142298567,1.000044196361684,9.4015673140168121E-3,1,0,16250.296308914287,1.5707347894554156,4.0351609422922747,1.320365272781155,1.0025993962011857,7.2024689455705782E-2,1.0037732080842898,8.673386778435821E-2,15.1363872696652,4.0562447405699531E-2,1.0014476485766028,0.11868771488817829,8.5255612347916827,-106.90913176154731,73.090868238452686,null,1000000000,223906332.25,null,25.584667163786104,-18.471827371824901,null,32.529226606590775,-91.082731914566708,null,0,0,null,0,0]
[15049.75,15.04975,11.141720261566059,1.4809226394777466,1.0000447073165797,9.4557549696668575E-3,1,0,16343.963435679514,1.5707351421254276,4.0569951072000716,1.3217417158352751,1.002629409130106,7.2438394989984431E-2,1.0038167482483362,8.7231278981607263E-2,15.136527029320305,4.079600292912345E-2,1.0014645559595827,0.1193730677154049,8.4728885738624911,-106.90455668757843,73.095443312421565,null,1000000000,226494975.0625,null,25.58135765492738,-18.416686781599346,null,32.479566898781187,-91.148415247351451,null,0,0,null,0,0]
[15136,15.135999999999999,11.20506045508176,1.4814320399080798,1.0000452212079058,9.5099425697854033E-3,1,0,16437.630562446753,1.5707354907761761,4.0788368761732343,1.3231034200128464,1.0026595936510345,7.2852075686302406E-2,1.0038605367530333,8.7728646907645189E-2,15.136667590938213,4.1029554191140488E-2,1.0014815644472901,0.12005844156296584,8.4205435813089622,-106.90049414082686,73.099505859173135,null,1000000000,229098496,null,25.578096561628335,-18.362389013398598,null,32.430184770815146,-91.213766050231499,null,0,0,null,0,0]
[15224,15.224,11.269688774594858,1.481945874341188,1.0000457485524124,9.5652295708939551E-3,1,0,16533.198181643183,1.5707358424294626,4.1011295224692876,1.3244778016349152,1.0026905674451321,7.327412416040506E-2,1.0039054696363878,8.8236061510317057E-2,15.136811831043259,4.126783975726131E-2,1.0014990223072926,0.12075774332845739,8.3674699078544794,-106.89686953339309,73.103130466606913,null,1000000000,231770176,null,25.574818088475034,-18.307844491516569,null,32.380083567107157,-91.280105922636167,null,0,0,null,0,0]
[15312,15.311999999999999,11.334320035663881,1.4824538488701422,1.0000462789537077,9.620516513525617E-3,1,0,16628.76580084164,1.5707361900407575,4.1234298317195002,1.3258373199565172,1.0027217198323486,7.3696146485416641E-2,1.0039506609716853,8.8743430562594594E-2,15.136956905937595,4.1506120836269707E-2,1.0015165855585384,0.12145706721392621,8.3147286686837489,-106.89376267623287,73.106237323767132,null,1000000000,234457344,null,25.571587792260509,-18.254149844200278,null,32.330264880323149,-91.346111317995877,null,0,0,null,0,0]
[15400,15.4,11.39895418825359,1.4829560629107148,1.0000468124117874,9.6758033973425011E-3,1,0,16724.33342004208,1.5707365336793517,4.1457376802646406,1.327182209845436,1.0027530507960392,7.4118142513454527E-2,1.0039961107240261,8.9250753809429068E-2,15.13710281559724,4.174439740240158E-2,1.0015342542733991,0.12215641333936175,8.2623156126856188,-106.89116582404591,73.108834175954087,null,1000000000,237160000,null,25.568404594946376,-18.201291610013996,null,32.280725537965147,-91.411787939309093,null,0,0,null,0,0]
[15488,15.488,11.463591183454971,1.4834526136482447,1.0000473489266464,9.7310902220067181E-3,1,0,16819.901039244472,1.5707368734129619,4.1680529470514633,1.3285127013538669,1.0027845603194654,7.4540112096692021E-2,1.0040418188583171,8.9758030995912161E-2,15.137249559998079,4.1982669429895821E-2,1.0015520285246566,0.12285578182461768,8.210226570064286,-106.88907137954781,73.110928620452185,null,1000000000,239878144,null,25.565267447295884,-18.149256603347872,null,32.231462420052054,-91.477141361772027,null,0,0,null,0,0]
[15578.25,15.578250000000001,11.52988373158353,1.4839560774496412,1.0000479023342226,9.7877905684615064E-3,1,0,16917.912148712556,1.5707372178462395,4.1909463556786992,1.3298624918508803,1.0028170609327556,7.4972843052499086E-2,1.0040889640054727,9.0278230228929585E-2,15.137400923389292,4.2227028898740575E-2,1.0015703669263298,0.12357305524054783,8.1571379668233295,-106.88743741843531,73.112562581564688,null,1000000000,242681873.0625,null,25.562096849600326,-18.096732696587669,null,32.181223428226666,-91.543835761746806,null,0,0,null,0,0]
[15668.5,15.6685,11.59617916884317,1.4844537847638606,1.0000484589568785,9.8444908519802459E-3,1,0,17015.923258182625,1.5707375583116705,4.2138473169599342,1.3311976133678387,1.002849749317446,7.5405545879167979E-2,1.0041363808408164,9.0798380473506662E-2,15.137553164701195,4.2471383539017596E-2,1.0015888164865245,0.12429035242921853,8.1043815276179423,-106.88631616238655,73.113683837613451,null,1000000000,245501892.25,null,25.558972540163435,-18.04504742145356,null,32.131268484074397,-91.610201704984817,null,0,0,null,0,0]
[15758.75,15.758749999999999,11.662477445964033,1.4849458335147834,1.0000490187946089,9.9011910721984696E-3,1,0,17113.934367654641,1.570737894877426,4.2367557084219509,1.3325182990540603,1.0028826254551753,7.5838220417425814E-2,1.0041840693258612,9.131848145514318E-2,15.137706283907328,4.2715733322948667E-2,1.0016073772850949,0.12500767351946324,8.0519530077541805,-106.8856998798734,73.1143001201266,null,1000000000,248338201.5625,null,25.555893475710249,-17.994187414253865,null,32.081594386809932,-91.676244809513619,null,0,0,null,0,0]
[15849,15.849,11.728778514788193,1.4854323194231953,1.0000495818474082,9.9578912287517085E-3,1,0,17211.945477128578,1.5707382276101245,4.2596714101868507,1.3338247772456651,1.0029156893274795,7.627086650806289E-2,1.0042320294219074,9.1838532899497519E-2,15.137860280981071,4.2960078222759004E-2,1.0016260494023483,0.12572501863996174,7.9998482437204634,-106.88558098881278,73.114419011187223,null,1000000000,251190801,null,25.552858640972271,-17.944139586987514,null,32.032197988827271,-91.741970567123943,null,0,0,null,0,0]
[15941.25,15.94125,11.79655169555666,1.485923934475001,1.0000501607005567,1.0015847832293208E-2,1,0,17312.128577950141,1.5707385638227669,4.2831023720761623,1.3351457574216667,1.0029496799190019,7.671307075777696E-2,1.0042813330113678,9.2370057548028919E-2,15.138018597968845,4.3209832891408069E-2,1.0016452504365794,0.12645828557398905,7.9469191488833859,-106.8859657694359,73.114034230564101,null,1000000000,254123451.5625,null,25.549801234462489,-17.893808698781452,null,31.981990709709478,-91.808830466612349,null,0,0,null,0,0]
[16033.5,16.0335,11.864327694806136,1.4864099328560481,1.0000507429128376,1.0073804368546711E-2,1,0,17412.31167877364,1.5707388961665574,4.3065407265943634,1.3364523609837702,1.0029838666186015,7.7155244948892046E-2,1.0043309203009323,9.2901529860279913E-2,15.138177832106887,4.3459582398395945E-2,1.0016645679490759,0.1271915778865006,7.894319772346206,-106.88685467477252,73.113145325227478,null,1000000000,257073122.25,null,25.546787980414326,-17.844299585976646,null,31.932067089089191,-91.875370012506352,null,0,0,null,0,0]
[16125.75,16.12575,11.932106464508539,1.4868904100490676,1.0000513284842452,1.0131760837122991E-2,1,0,17512.494779599041,1.5707392247078937,4.3299863536918464,1.3377448169697204,1.0030182494062259,7.7597388911584533E-2,1.0043807912485807,9.3432949543782173E-2,15.138337983366279,4.3709326714071149E-2,1.001684002027073,0.12792489571441801,7.8420459174702506,-106.88824006968365,73.111759930316353,null,1000000000,260039813.0625,null,25.543817879610721,-17.795599119751071,null,31.882423930236342,-91.941594683430793,null,0,0,null,0,0]
[16218,16.218,11.999887957718965,1.48736545938978,1.0000519174147735,1.0189717237632821E-2,1,0,17612.677880426312,1.5707395495116621,4.3534391358682809,1.3390233496731543,1.0030528282617106,7.803950247610128E-2,1.0044309458120615,9.3964316306244244E-2,15.138499051717945,4.3959065808785946E-2,1.0017035527582996,0.12865823919449135,7.7900934676006841,-106.8901144677309,73.109885532269104,null,1000000000,263023524,null,25.540889959695679,-17.747694443017505,null,31.833058089547436,-92.007509834986053,null,0,0,null,0,0]
[16312.5,16.3125,12.069325434074511,1.4878465626233346,1.0000525241924694,1.0249087137902999E-2,1,0,17715.304471519561,1.5707398784283366,4.3774712358868868,1.3403188588828687,1.0030884537821114,7.8492367601572799E-2,1.0044826176895494,9.4508588055378553E-2,15.138664999452629,4.4214890656421556E-2,1.0017237013845832,0.12940949584195219,7.7372029229288923,-106.89253394885048,73.107466051149515,null,1000000000,266097656.25,null,25.537933374668924,-17.69943333884083,null,31.782772518995877,-92.074717210370679,null,0,0,null,0,0]
[16407,16.407,12.138765672039463,1.4883221616298281,1.0000531344951311,1.0308456965919076E-2,1,0,17817.931062614709,1.5707402035560643,4.4015106025737341,1.3416002190724539,1.0031242850080986,7.8945200467561483E-2,1.0045345870960043,9.5052803650121392E-2,15.138831909499041,4.4470709962340073E-2,1.0017439726118527,0.13016077969810111,7.6846411562024226,-106.89545113768075,73.104548862319248,null,1000000000,269189649,null,25.535019070356874,-17.651980848379861,null,31.732771447102976,-92.141610779857714,null,0,0,null,0,0]
[16501.5,16.5015,12.20820862448976,1.4887923501199793,1.0000537483227525,1.0367826721262657E-2,1,0,17920.557653711719,1.5707405249599402,4.4255571175124775,1.3428676566380771,1.0031603219176297,7.9398000891820475E-2,1.0045868539852505,9.5596962776851493E-2,15.138999781825389,4.4726523694683502E-2,1.001764366536029,0.13091209090937309,7.6324039902110252,-106.89885844975127,73.101141550248727,null,1000000000,272299502.25,null,25.532146083694368,-17.605323993377386,null,31.683051660483311,-92.208195921089938,null,0,0,null,0,0]
[16596,16.596,12.277654245365655,1.4892572196939908,1.0000543656753267,1.0427196403515342E-2,1,0,18023.184244810556,1.5707408427035767,4.4496106648117104,1.3441213932616407,1.003196564488539,7.9850768692182231E-2,1.0046394183108585,9.6141065122146471E-2,15.139168616399683,4.4982331821598123E-2,1.001784883253577,0.13166342962200966,7.5804873272488624,-106.90274844967244,73.097251550327556,null,1000000000,275427216,null,25.529313477594808,-17.559450065603283,null,31.633609999281408,-92.27447789077533,null,0,0,null,0,0]
[16692.5,16.692499999999999,12.348572321779702,1.4897265318680843,1.0000549997312027,1.0487822511117304E-2,1,0,18127.982827257259,1.5707411634592936,4.4741804212085388,1.3453877506158318,1.0032337863111918,8.031308502373595E-2,1.0046934020058464,9.6696623938740192E-2,15.139342017170058,4.5243548059390813E-2,1.0018059610072638,0.13243069821542305,7.5277984708599472,-106.90721132188888,73.09278867811112,null,1000000000,278639556.25,null,25.526461646092979,-17.513400286346982,null,31.583405741613117,-92.341855129763616,null,0,0,null,0,0]
[16789,16.789000000000001,12.419493086953249,1.4901904841857445,1.0000556374628011,1.0548448541620029E-2,1,0,18232.781409705807,1.5707414805277238,4.4987572742945021,1.3466402736599492,1.0032712225454754,8.0775366952188427E-2,1.0047476957616535,9.7252122885081019E-2,15.139516421281471,4.5504758384855098E-2,1.0018271670119725,0.13319799579419864,7.4754354358268991,-106.91216231883237,73.087837681167628,null,1000000000,281870521,null,25.523650026739865,-17.468140972252829,null,31.533485012300627,-92.408926936755506,null,0,0,null,0,0]
[16885.5,16.8855,12.490416495085851,1.4906491677489464,1.0000562788701151,1.0609074494578005E-2,1,0,18337.579992156163,1.5707417939720856,4.5233411083934136,1.3478791839952824,1.0033088731673889,8.1237614283818232E-2,1.0048022995280175,9.7807561628071346E-2,15.139691828699275,4.576596276408551E-2,1.001848501372179,0.1339653225134291,7.4233941026195263,-106.91759398201991,73.082406017980091,null,1000000000,285120110.25,null,25.520877700284675,-17.423659419024887,null,31.483844611891072,-92.475698540421376,null,0,0,null,0,0]
[16982,16.981999999999999,{"$f":"SQRT(1+(A269/pole1)^2)","v":12.56134250140976},{"$f":"ATAN(A269/pole1)","v":1.4911026716110662},{"$f":"SQRT(1+(A269/Zero1)^2)","v":1.0000569239531372},{"$f":"ATAN(A269/Zero1)","v":1.0669700369545718E-2},{"$f":"IF(VIN_nom>Vout, 1, SQRT(1+(A269/z_RHP)^2))","v":1},{"$f":"IF(VIN_nom>Vout, 0, -ATAN(A269/z_RHP))","v":0},{"$f":"SQRT(1+(A269/Pole2)^2)","v":18442.378574608305},{"$f":"ATAN(A269/Pole2)","v":1.5707421038541602},4.5479318102977295,1.3491046985995236,{"$f":"SQRT(1+(A269/pole4)^2)","v":1.0033467381527974},{"$f":"ATAN(A269/pole4)","v":8.1699826824992119E-2},{"$f":"IF(VOUT_setting=1,1,SQRT(1+(A269*zterm1)^2))","v":1.0048572132544009},{"$f":"IF(VOUT_setting=1,0,ATAN(((A269*zterm1))))","v":9.8362939834834268E-2},15.139868239388633,{"$f":"IF(VOUT_setting=1,0,ATAN(A269*$Q$4/(1+Afbr-$Q$5*(A269)^2)))","v":4.6027161163181306E-2},{"$f":"SQRT((1-(Z269/pterm2))^2+(A269/pterm1)^2)","v":1.0018699641929507},{"$f":"IF((ATAN((A269/pterm1)/(1-A269^2/pterm2))>0),ATAN((A269/pterm1)/(1-A269^2/pterm2)),PI()+ATAN((A269/pterm1)/(1-A269^2/pterm2)))","v":0.13473267852799206},{"$f":"20*LOG10(((E269*K269*G269*O269)/(C269*I269*S269*M269*Q269))*Adc)","v":7.3716704297606963},{"$f":"((F269+L269+H269+P269)-(D269+J269+T269+N269+R269))*radconv","v":-106.92349900040283},{"$f":"IF(V269>0,V269,V269+180)","v":73.076500999597172},null,{"$f":"IF(U269<0,A269,1000000000)","v":1000000000},{"$f":"A269^2","v":288388324},null,{"$f":"20*LOG10((K269/(I269*M269))*AEA)","v":25.518143772279643},{"$f":"(L269-(J269+N269))*radconv","v":-17.379943187202574},null,{"$f":"20*LOG10((E269*G269/(C269*S269))*Acs*Am)","v":31.434481394186108},{"$f":"(F269+H269-(D269+T269))*radconv","v":-92.542175052043177},null,{"$f":"SUM((U270<0)*(U269>0))*A269","v":0},0,null,0,0]
[17081,{"$f":"A270/1000","v":17.081},12.634108623201207,1.4915626327973504,1.0000575895679276,1.0731896781521795E-2,1,0,18549.892146244962,1.5707424181256386,4.573166597887,1.3503482641773688,1.0033858068365578,8.217397742737248E-2,1.0049138716720338,9.8932642820378322E-2,15.140050262861839,4.6295120110122344E-2,1.0018921166517645,0.13551994483774416,7.3189327207510271,-106.9300413958546,73.069958604145398,null,1000000000,291760561,null,25.515378008421354,-17.335876962793254,null,31.384124140907584,-92.61007233182923,null,0,0,null,{"$f":"SUM((V271<-183)*(V270>-183))*A270","v":0},{"$f":"IF(AK270>0,U270,0)","v":0}]
[17180,17.18,12.706877387305479,1.492017325938515,1.0000582590513289,1.0794093110464392E-2,1,0,18657.40571788343,1.570742728775129,4.5984083800473519,1.3515781791719543,1.0034251010827093,8.2648091000747728E-2,1.0049708562091741,9.9502281383419738E-2,{"$f":"IF(VOUT_setting=1,1,SQRT((1+Afbr-$Q$5*(A271)^2)^2+(A271*$Q$4)^2))","v":15.140233342188006},4.6563072690794599E-2,1.0019144045392845,0.13630724230991817,7.2665209707084388,-106.93706686284357,73.062933137156435,null,1000000000,295152400,null,25.512650827889864,-17.292590530063155,null,31.334052076736075,-92.677669565096011,null,0,0,null,0,0]
[17279,17.279,12.779648748585693,1.4924668408386683,1.000058932403334,1.085628935589248E-2,1,0,18764.919289523677,1.5707430358648882,4.6236570422230754,1.3527946634590269,1.0034646208647535,8.3122167336334443E-2,1.0050281668103496,0.10007185516526641,15.140417477328862,4.6831018868609374E-2,1.0019368279708949,0.13709457111102899,7.2144310592265395,-106.94456796844167,73.055432031558325,null,1000000000,298563841,null,25.509961341165855,-17.250071282664617,null,31.284261971696342,-92.744971906808104,null,0,0,null,0,0]
[17378,17.378,12.852422662925648,1.4929112652764174,1.0000596096239347,1.0918485517325027E-2,1,0,18872.432861165671,1.5707433394557537,4.6489124723162236,1.3539979322973557,1.003504366156045,8.3596206225448985E-2,1.0050858034197827,0.10064136380747594,15.14060266824592,4.7098958606983314E-2,1.0019593870626335,0.13788193140734759,7.16265894397133,-106.95253742809811,73.047462571901889,null,1000000000,301994884,null,25.507308682844794,-17.208306878707671,null,31.234750649775687,-92.811984395863405,null,0,0,null,0,0]
[17479.25,17.47925,12.926853125681845,1.4933606143722669,1.0000603062373834,1.0982095140499012E-2,1,0,18982.389923074043,1.5707436463892936,4.6747487755277604,1.3552150983912732,1.0035452479767895,8.4080979775570344E-2,1.0051450871000802,0.10122374807748741,15.140793160048361,4.7372981186114445E-2,1.0019825993025619,0.13868721900592529,7.1100347689000278,-106.96116501341568,73.03883498658432,null,1000000000,305524180.5625,null,25.504632952811388,-17.166361462949801,null,31.184399174941973,-92.880225220410011,null,0,0,null,0,0]
[17580.5,17.580500000000001,13.001286168673124,1.4938048184628243,1.0000610068972544,1.1045704674798389E-2,1,0,19092.346984984175,1.5707439497874369,4.7005919282105966,1.3564188826573313,1.0035863656168347,8.456571371657165E-2,1.0052047116566027,0.10180606345576594,15.140984756080039,4.7646996952394029E-2,1.0020059536866552,0.13949253989857416,7.0577346886565318,-106.97026753146459,73.029732468535414,null,1000000000,309073980.25,null,25.501993987184733,-17.125180297452594,null,31.134332747346711,-92.94817317056939,null,0,0,null,0,0]
[17681.75,17.681750000000001,13.075721747835821,1.4942439652375055,1.0000617116035397,1.1109314119708596E-2,1,0,19202.304046896046,1.570744249710917,4.7264418180104864,1.3576095011417788,1.0036277190471969,8.5050407825542268E-2,1.0052646770286955,0.10238830955968918,15.141177456299072,4.7921005866704822E-2,1.0020294503411642,0.14029789426236058,7.005754619795078,-106.97983764850403,73.020162351495969,null,1000000000,312644283.0625,null,25.499390933529511,-17.084750994385754,null,31.084548136976046,-93.01583328074959,null,0,0,null,0,0]
[17783,17.783000000000001,13.150159820102463,1.4946781404081235,1.0000624203562303,1.1172923474715071E-2,1,0,19312.261108809627,1.5707445462190845,4.7522983349887991,1.3587871653401207,1.0036693082387311,8.5535061879683044E-2,1.0053249831553719,0.10297048600691368,15.141371260663345,4.8195007889935568E-2,1.0020530893930544,0.14110328227407801,6.9540905560035604,-106.98986817811912,73.010131821880876,null,1000000000,316235089,null,25.496822962556337,-17.045061426584521,null,31.035042167809188,-93.083210472034793,null,0,0,null,0,0]
[17886.5,17.886500000000002,13.226254604746018,1.4951169125979613,1.0000631490412566,1.1237946277485426E-2,1,0,19424.661660989688,1.5707448458467137,4.7787361789439924,1.3599778261350257,1.0037120652820957,8.6030444392165686E-2,1.0053869815515546,0.10356552731491669,15.14157051296986,4.8475091683813892E-2,1.002077401069277,0.14192660275880006,6.901600925712934,-107.00059014951054,72.999409850489457,null,1000000000,319926882.25,null,25.494233346294358,-17.00524208276769,null,30.984720812330742,-93.151797523548964,null,0,0,null,0,0]
[17990,17.989999999999998,13.302351906589426,1.4955506647988719,1.0000638819545085,1.1302968985224631E-2,1,0,19537.06221317147,1.5707451420267096,{"$f":"SQRT(1+(A279/Zero2)^2)","v":4.8051807230315795},{"$f":"ATAN(A279/Zero2)","v":1.3611553833612875},1.0037550686192289,8.6525784579386339E-2,1.0054493358853116,0.10416049502893822,15.141770918950224,4.8755168194312276E-2,1.0021018618125446,0.14274995877623523,6.8494332738502024,-107.01177849394689,72.988221506053108,null,1000000000,323640100,null,25.491678707735218,-16.966170895537811,null,30.934684076015024,-93.220098992203475,null,0,0,null,0,0]
[18093.5,18.093499999999999,13.378451682678813,1.4959794825108625,1.000064619095977,1.1367991597383074E-2,1,0,19649.462765354951,1.5707454348182368,4.8316318572378316,1.3623200489355416,1.0037983182184769,8.7021082203725231E-2,1.0055120460904252,0.1047553887414877,15.141972478558658,4.9035237379673281E-2,1.0021264717607883,0.14357335051433234,6.7975835585728799,-107.02342598981927,72.976574010180727,null,1000000000,327374742.25,null,25.489158231315994,-16.927835712741327,null,30.884928733669966,-93.28811978758803,null,0,0,null,0,0]
[18197,18.196999999999999,13.45455389103072,1.496403449306859,1.0000653604656522,1.1433014113411145E-2,1,0,19761.863317540094,1.5707457242791136,4.8580894739178957,1.3634720302995782,1.0038418140480099,8.7516337027686908E-2,1.0055751121003162,0.10535020804538542,15.142175191749146,4.9315299198146124E-2,1.0021512310527183,0.14439677816073529,6.7460478141140934,-107.03552556139,72.964474438609997,null,1000000000,331130809,null,25.486671123641372,-16.890224638544414,null,30.835451614017284,-93.355864708861262,null,0,0,null,0,0]
[18303,18.303000000000001,13.532496795197309,1.4968327141117639,1.0000661241254343,1.1499607121398138E-2,1,0,19876.978858910148,1.570746017338539,4.8851927726508562,1.3646389019848495,1.0038866156915043,8.8023509916934264E-2,1.0056400701738848,0.10595931741387424,15.142383997060163,4.9602118115272438E-2,1.0021767433391859,0.14524013277936221,6.6935886173277561,-107.04837873666241,72.951621263337586,null,1000000000,334999809,null,25.484157721948002,-16.852443472807419,null,30.785064521091346,-93.42496493253222,null,0,{"$f":"IF(AH282>0,W282,0)","v":0},null,0,0]
[18409,18.408999999999999,13.610442164413136,1.4972570622980539,1.0000668922201317,1.1566200027387815E-2,1,0,19992.094400281891,1.5707463070230612,4.9123026496060866,1.3657928958300469,1.0039316755359848,8.8530637409352839E-2,1.0057054013059437,0.10656834787219167,15.142594012256319,4.9888929216703806E-2,1.0022024125681437,0.14608352545934913,6.6414505588179438,-107.06169152192312,72.938308478076877,null,1000000000,338891281,null,25.481677704218633,-16.815397358542352,null,30.734962689101984,-93.493785641306076,null,0,0,null,0,0]
[18515,18.515000000000001,13.688389956568244,1.4976765777038348,1.0000676647497337,1.1632792830789784E-2,1,0,20107.209941655296,1.5707465933906444,4.9394189964703674,1.3669342208257496,1.003976993546686,8.9037719250228325E-2,1.0057711054237959,0.10717729898395824,15.14280523728732,5.01757324576124E-2,1.0022282388911354,0.14692695640126238,6.5896296143049318,-107.07545676915025,72.92454323084975,null,1000000000,342805225,null,25.479230285884526,-16.779074310198094,null,30.68514287953154,-93.562331650277855,null,0,0,null,0,0]
[18621,18.620999999999999,13.766340130505125,1.4980913422752138,1.0000684417142305,1.169938553101366E-2,1,0,20222.325483030327,1.5707468764979342,4.9665417072703821,1.3680630815309367,1.0040225696886498,8.9544755184986141E-2,1.0058371824543482,0.10778617031314355,15.14301767210258,5.0462527793177926E-2,1.0022542224605602,0.14777042580532518,6.5381218351247208,-107.08966747572374,72.910332524276257,null,1000000000,346741641,null,25.476814703762503,-16.743462596067971,null,30.635601908098842,-93.630607666119445,null,0,0,null,0,0]
[18729.5,18.729500000000002,13.846131176657574,1.4985110524066954,1.0000692415963739,1.1767548706316787E-2,1,0,20340.156013590393,1.5707471629635212,4.9943105872673446,1.3692058665850568,1.0040694880379877,9.0063701705932475E-2,1.0059052040378038,0.1084093187331603,15.143236370039519,5.0756078935689314E-2,1.0022809818631204,0.14863382839787623,6.4857195370211826,-107.10466752248497,72.895332477515026,null,1000000000,350794170.25,null,25.4743743468287,-16.707735694247766,null,30.585178029712029,-93.700219147662523,null,0,0,null,0,0]
[18838,18.838000000000001,13.925924633946726,1.4989259528584933,1.00007004612505,1.1835711772265839E-2,1,0,20457.986544152111,1.5707474461292339,5.0220859174888108,1.3703360124447268,1.0041166767634406,9.0582599590555424E-2,1.0059736161753738,0.10903238263956026,15.143456335390791,5.1049621700564714E-2,1.0023079063427203,0.14949727171161942,6.4336372131925943,-107.12011989336189,72.879880106638112,null,1000000000,354870244,null,25.471965793138942,-16.672729989201891,null,30.535039715052182,-93.769557394276561,null,0,0,null,0,0]
[18946.5,18.9465,14.00572046116236,1.4993361256941602,1.0000708553002478,1.190387472822768E-2,1,0,20575.817074715444,1.5707477260517639,5.0498675915020197,1.3714537248012473,1.0041641358268913,9.1101448566299717E-2,1.0060424187873835,0.10965536156587653,15.143677568101214,5.1343156039761938E-2,1.0023349960655799,0.15036075596015142,6.3818708629382881,-107.13601752888663,72.863982471113374,null,1000000000,358969862.25,null,25.469588289418358,-16.638433683318858,null,30.485183718000691,-93.838627120131278,null,0,0,null,0,0]
[19055,19.055,14.085518618026891,1.4997416511240489,1.0000716691219556,1.1972037573569181E-2,1,0,20693.647605280374,1.5707480027865119,5.0776555051794956,1.3725592049690762,1.0042118651900112,9.1620248360766862E-2,1.0061116117937254,0.11027825504603328,15.143900068115292,5.1636681905247235E-2,1.0023622511988568,0.15122428135668353,6.3304165605591347,-107.15235351407647,72.847646485923534,null,1000000000,363093025,null,25.467241102969954,-16.604835229696778,null,30.435606846869518,-93.907432933193718,null,0,0,null,0,0]
[19165.75,19.165749999999999,14.166973937115031,1.5001508745146741,1.0000725046121823,1.2041613819394113E-2,1,0,20813.921626112093,1.5707482820285932,5.1060259952224145,1.3736751991335319,1.0042608630582555,9.2149755671925279E-2,1.0061826422163169,0.11091397706608633,15.14412848912389,5.1936285923654582E-2,1.0023902422965509,0.15210575661970122,6.2782130546928592,-107.16947330937904,72.830526690620957,null,1000000000,367325973.0625,null,25.464875768900921,-16.571248007617278,null,30.385286493512488,-93.977398093510487,null,0,0,null,0,0]
[19276.5,19.276499999999999,14.248431601532337,1.5005554189477122,1.0000733449436059,1.2111189948630217E-2,1,0,20934.195646945416,1.5707485580619944,5.1344027742478602,1.3747788589234222,1.0043101424716241,9.2679211167870632E-2,1.0062540792225587,0.11154960907935507,15.144358230424272,5.2235881012157773E-2,1.002418406091053,0.15298727520267541,6.2263266385898808,-107.18703570922236,72.812964290777643,null,1000000000,371583452.25,null,25.462540542602284,-16.538364340507265,null,30.335250411106035,-94.047097658035426,null,0,0,null,0,0]
[19387.25,19.387250000000002,14.329891571283024,1.5009553640838782,1.0000741901162142,1.2180765960604176E-2,1,0,21054.469667780311,1.5707488309417046,5.1627857385553844,1.375870385056293,1.0043597033886744,9.3208614559414676E-2,1.0063259227258636,0.11218515059143633,15.144589291956407,5.2535467119699877E-2,1.0024467427631556,0.15386883733110207,6.174753367093385,-107.20503380250263,72.794966197497374,null,1000000000,375865462.5625,null,25.460234706956825,-16.506172714679835,null,30.285495373030408,-94.116536203949821,null,0,0,null,0,0]
[19498,19.498000000000001,14.41135380727451,1.5013507877886751,1.0000750401299949,1.2250341854642676E-2,1,0,21174.743688616763,1.5707491007214633,5.1911747866901248,1.3769499739761146,1.0044095457677358,9.3737965557542879E-2,1.006398172639176,0.11282060110836012,15.144821673659916,5.2835044195233362E-2,1.0024752524946672,0.15475044323004933,6.1234893686371361,-107.22346082000553,72.776539179994472,null,1000000000,380172004,null,25.457957564426124,-16.474661861244314,null,30.236018206685088,-94.185718205552419,null,0,0,null,0,0]
[19611.75,19.611750000000001,14.495025014276402,1.5017522958845499,1.0000759182086219,1.2321802299533864E-2,1,0,21298.275696475197,1.5707493746371437,5.2203390673867949,1.378046582157197,1.004461031236602,9.4281600789741335E-2,1.0064728026411973,0.11347316948757023,15.14506172436062,5.3142726769487163E-2,1.0025047148455208,0.15565597590244987,6.0711546912381742,-107.24282653482547,72.757173465174532,null,1000000000,384620738.0625,null,25.4556478954167,-16.442994539264614,null,30.185486788608294,-94.256511743412631,null,0,0,null,0,0]
[19725.5,19.7255,14.578698531180725,1.5021491951832227,1.0000768013942229,1.2393262618573991E-2,1,0,21421.807704335213,1.5707496453936738,5.2495095560420291,1.3791310043597902,1.0045128135326622,9.4825180134150075E-2,1.0065478611814587,0.11412564082020456,15.145303167592878,5.345039970665702E-2,1.0025343601505154,0.15656155522868984,6.019138220707168,-107.26263069548763,72.73736930451237,null,1000000000,389095350.25,null,25.453367064172486,-16.412022039281904,null,30.135241885808846,-94.327043896923072,null,0,0,null,0,0]
[19839.25,19.83925,14.662374318441842,1.502541564463534,1.000077689686784,1.2464722811033557E-2,1,0,21545.339712196779,1.5707499130453937,5.2786861497386353,1.3802034400767016,1.004564892610015,9.5368703278204556E-2,1.0066233481640983,0.11477801457249559,15.145546003290155,5.3758062951464874E-2,1.002564188609981,0.15746718145120117,5.9674359927817102,-107.28286641214356,72.717133587856438,null,1000000000,393595840.5625,null,25.451114375310194,-16.381732916405113,null,30.085280230978686,-94.397319193710956,null,0,0,null,0,0]
[19953,19.952999999999999,14.746052337410648,1.5029294807218216,1.0000785830862919,1.253618287618307E-2,1,0,21668.871720059873,1.5707501776454036,5.3078687478010025,1.3812640845251727,1.0046172684225048,9.5912169909537728E-2,1.0066992634927368,0.11543029021116769,15.145790231385527,5.4065716448643317E-2,1.0025942004253754,0.15837285481192864,5.9160441172294522,-107.30352693767156,72.696473062328437,null,1000000000,398122209,null,25.448889152536172,-16.352115970655316,null,30.035598611758378,-94.467342059245667,null,0,0,null,0,0]
[20069,20.068999999999999,14.831387785186983,1.5033205620472645,1.0000794994168949,1.2609056305258232E-2,1,0,21794.847218189934,1.5707504443902007,5.3376346656650506,1.3823337633645048,1.0046709857893823,9.646632790614347E-2,1.0067771214817707,0.11609536640914529,15.14604072427994,5.43794453035783E-2,1.0026249949231216,0.15929649138712781,5.8639513627921245,-107.32502677964094,72.674973220359064,null,1000000000,402764761,null,25.44664751890997,-16.322594085433419,null,29.985219404188349,-94.538494506359399,null,0,0,null,0,0]
[20185,20.184999999999999,14.916725475389979,1.5037071687257433,1.0000804210584471,1.2681929600404832E-2,1,0,21920.822716321527,1.5707507080691177,5.3674066231757998,1.3833915768033209,1.0047250116487174,9.7020426476761207E-2,1.0068554247258663,0.11676033945513904,15.146292665059351,5.4693163905395942E-2,1.002655980528915,0.16022017749043527,5.8121734157613592,-107.34695466821448,72.65304533178552,null,1000000000,407434225,null,25.444433086141348,-16.293748457063778,null,29.935124841946386,-94.60939342051212,null,0,0,null,0,0]
[20301,20.300999999999998,15.0020653697522,1.5040893770033574,1.0000813480109336,1.2754802760849251E-2,1,0,22046.798214454629,1.5707509687347097,5.3971845203855269,1.384437718849493,1.0047793459507481,9.7574465290759818E-2,1.0069341731211492,0.11742520878519465,15.146546053651576,5.5006872195518586E-2,1.0026871574600278,0.16114391337685582,5.7607063766399849,-107.36930388381818,72.630696116181824,null,1000000000,412130601,null,25.442245194420842,-16.265567953781581,null,29.885311687046112,-94.680043184938526,null,0,0,null,0,0]
[20417,20.417000000000002,15.087407430871057,1.5044672614062671,1.0000822802743399,1.2827675785817878E-2,1,0,22172.773712589213,1.5707512264383376,5.4269682595204465,1.3854723793554204,1.0048339886454394,9.8128444017726274E-2,1.0070133665631869,0.11808997383590053,15.146800889984014,5.5320570115380371E-2,1.0027185259349505,0.16206769930085521,5.7095464183196629,-107.39206784630622,72.607932153693781,null,1000000000,416853889,null,25.440083202022791,-16.238041681857077,null,29.835776755815083,-94.750448084297233,null,0,0,null,0,0]
[20536,20.536000000000001,15.174958827482136,1.5048505019709804,1.0000832421667138,1.2902433316396546E-2,1,0,22302.007197746028,1.570751487781463,5.4575282380323484,1.3865220622521324,1.0048903649198426,9.8696686996575925E-2,1.0070950704617758,0.11877182213672263,15.147063821221446,5.5642370075086933E-2,1.0027509049322609,0.1630154285016864,5.6573785170674897,-107.41584475367846,72.584155246321544,null,1000000000,421727296,null,25.437891554597236,-16.210472180301029,null,29.785246577906545,-94.822423743615715,null,0,0,null,0,0]
[20655,20.655000000000001,15.26251242731937,1.5052293456618975,1.0000842096482305,1.2977190702752129E-2,1,0,22431.24068290435,1.5707517461132274,5.4880941628625965,1.387560053870132,1.004947065636961,9.9264866036522112E-2,1.0071772424999981,0.11945355949525804,15.147328275894424,5.5964158996379493E-2,1.0027834859786866,0.1639632109024827,5.6055258522042903,-107.4400445441665,72.559955455833503,null,1000000000,426629025,null,25.435725851164751,-16.183568703705472,null,29.735002583290928,-94.894150537019186,null,0,0,null,0,0]
[20774,20.774000000000001,15.350068192682523,1.505603867607757,1.0000851827188739,1.3051947944049463E-2,1,0,22560.474168064153,1.5707520014853806,5.5186659352075722,1.3885865462525606,1.0050040907418814,9.9832980781570477E-2,1.007259882563281,0.12013518530504019,15.147594253923224,5.6285936816068881E-2,1.0028162693141029,0.16491104677617982,5.5539845178040084,-107.46466054844988,72.535339451550115,null,1000000000,431559076,null,25.433585454444071,-16.157320231377003,null,29.685041505198832,-94.965632784753211,null,0,0,null,0,0]
[20893,20.893000000000001,15.437626086725722,1.5059741412377736,1.0000861613786276,1.3126705039453386E-2,1,0,22689.70765322541,1.5707522539484939,5.5492434584222732,1.3896017273079162,1.0050614401793883,0.1004010308759732,1.0073429905364379,0.12081669896021549,15.147861755227675,5.6607703470979286E-2,1.0028492551797319,0.16585893639510307,5.5027506804464634,-107.48968623660764,72.510313763392361,null,1000000000,436517449,null,25.431469744694123,-16.131715979466396,null,29.635360131836329,-95.036874709652807,null,0,0,null,0,0]
[21014.75,21.014749999999999,15.527209542960881,1.5063486497452223,1.0000871684387937,1.3203189562932538E-2,1,0,22821.927626490611,1.5707525092867227,5.5805334582369044,1.3906288537365579,1.0051204505229325,0.10098214089873957,1.0074285032056061,0.12151384517706472,15.148137014685883,5.6936894289284973E-2,1.002883213181522,0.16682878693218761,5.4506471823196048,-107.51570757641296,72.484292423587036,null,1000000000,441619717.5625,null,25.429330063266381,-16.106175751589809,null,29.584816841360407,-95.109518568744392,null,0,0,null,0,0]
[21136.5,21.136500000000002,15.616795152004634,1.5067188615745337,1.0000881813493403,1.3279673931928816E-2,1,0,22954.147599757282,1.5707527616833641,5.6118292797946685,1.3916445251529006,1.0051798002445356,0.10156318249570997,1.0075145054147179,0.12221087271476121,15.148413868465484,5.7266073287086099E-2,1.0029173836974687,0.1677986943019536,5.3988576642098547,-107.54214435717826,72.457855642821741,null,1000000000,446751632.25,null,25.427214964344902,-16.081287758523121,null,29.53455970189377,-95.181919511436504,null,0,0,null,0,0]
[21258.25,21.25825,15.7063828770196,1.507084850146889,1.0000892001102495,1.3356158145547845E-2,1,0,23086.3675730254,1.5707530111889596,5.6431308262364439,1.3926489300611873,1.0052394892840866,0.10214415528670888,1.0076009970384212,0.12290778092648304,15.148692316479142,5.7595240396768901E-2,1.0029517669902763,0.16876865879403893,5.3473782448557348,-107.56899001607556,72.43100998392444,null,1000000000,451913193.0625,null,25.425123837569554,-16.057041180882123,null,29.484585444585598,-95.254081761099215,null,0,0,null,0,0]
[21380,21.38,15.795972682003237,1.5074466872223655,1.0000902247215036,1.3432642202895258E-2,1,0,23218.587546294941,1.5707532578528984,5.6744380028227743,1.39364225289765,1.005299517581145,0.10272505889183653,1.0076879779506942,0.12360456916609341,15.148972358639027,5.7924395550734566E-2,1.0029863633241214,0.16973868069739742,5.2962051148489833,-107.59623812805485,72.40376187194515,null,1000000000,457104400,null,25.423056089404778,-16.033425432312264,null,29.434890855624353,-95.326009445889227,null,0,0,null,0,0]
[21504.5,21.5045,15.887588190319804,1.5078124770738321,1.000091278525961,1.3510853663681769E-2,1,0,23353.794007668523,1.5707535071999317,5.706458048812916,1.3946467398340894,1.0053612525285776,0.10331901157981736,1.0077774293831463,0.12431697120912182,15.149260374658464,5.8260972986449208E-2,1.0030219616848621,0.17073067241782747,5.2441889727432471,-107.62451133795901,72.375488662040993,null,1000000000,462443520.25,null,25.42096521175165,-16.00991783903579,null,29.384359724559367,-95.399323412930684,null,0,0,null,0,0]
[21629,21.629000000000001,15.979205800054558,1.5081740724228425,1.0000923384479965,1.358906495916591E-2,1,0,23489.000469043538,1.5707537536764014,5.7384837883261994,1.3956400159387967,1.0054233421035195,0.10391289111859481,1.0078673921885049,0.12502924643478103,15.149550057464902,5.8597537777330656E-2,1.0030577833827972,0.1717227247812764,5.1924852782644679,-107.65319222397157,72.346807776028427,null,1000000000,467813641,null,25.418897576939855,-15.987048223491328,null,29.334114412155682,-95.472400536744161,null,0,0,null,0,0]
[21753.5,21.753499999999999,16.070825475267789,1.5085315449125174,1.0000934044875907,1.3667276088391366E-2,1,0,23624.206930419965,1.5707539973315947,5.7705151265672976,1.3966222659247169,1.0054857862402748,0.1045066971028447,1.0079578662298458,0.12574139415439881,15.14984140696281,5.8934089851144338E-2,1.0030938287051796,0.17271483809447874,5.1410901797205719,-107.68227434021819,72.317725659781814,null,1000000000,473214762.25,null,25.416852601374138,-15.964805982007263,null,29.28415165255479,-95.545244939807461,null,0,0,null,0,0]
[21878,21.878,16.162447180833915,1.5088849645657245,1.0000944766447237,1.3745487050401838E-2,1,0,23759.413391797778,1.5707542382136759,5.8025519708176585,1.3975936705116521,1.0055485848727894,0.1051004291275508,1.0080488513695165,0.12645341368006682,15.150134423056121,5.9270629135672395E-2,1.0031300979408688,0.1737070126634038,5.0899998964986182,-107.71175137664751,72.288248623352487,null,1000000000,478646884,null,25.41482971756195,-15.943180739655546,null,29.234468234886165,-95.617860651720932,null,0,0,null,0,0]
[22005.25,22.00525,16.25609472139476,1.5092420738158623,1.0000955788057431,1.3825425389990511E-2,1,0,23897.606341279723,1.5707544815997749,5.8353020515827403,1.3985755085046496,1.0056131368821351,0.1057071988657068,1.008142374234043,0.12718102735674416,15.150435633512364,5.9614588727547685E-2,1.0031673999933761,0.17472116635278218,5.0380922390283169,-107.74228118335206,72.257718816647937,null,1000000000,484231027.5625,null,25.412784406226422,-15.921704856595515,null,29.183972771514348,-95.691848101362751,null,0,0,null,0,0]
[22132.5,22.1325,16.349744311298338,1.5095950921432715,1.000096687357497,1.3905363552875558E-2,1,0,24035.799290763065,1.5707547221871949,5.8680576948198855,1.3995463861369535,1.0056780590799728,0.10631389048637804,1.0082364307317997,0.12790850566305659,15.150738584797153,5.99585348064096E-2,1.0032049365755036,0.17573538467771263,4.9864952448580437,-107.77321063908605,72.226789360913955,null,1000000000,489847556.25,null,25.410761023815304,-15.900852319791207,null,29.133762514631883,-95.76560487186633,null,0,0,null,0,0]
[22259.75,22.25975,16.443395915529969,1.5099440893574438,1.0000978022999647,1.3985301538035944E-2,1,0,24173.992240247786,1.5707549600239328,5.9008188078966874,1.4005064841173189,1.0057433513946146,0.10692050355812009,1.0083310207134557,0.12863584786699517,15.151043276806156,6.0302467295203076E-2,1.0032427080008712,0.17674966796238434,4.9352050962698151,-107.80453342397908,72.19546657602092,null,1000000000,495496470.0625,null,25.408759013191823,-15.880612753423677,null,29.083834206096981,-95.839134981654141,null,0,0,null,0,0]
[22387,22.387,16.537049499867397,1.5102891336904434,1.0000989236331244,1.4065239344450645E-2,1,0,24312.185189733857,1.5707551951568939,5.9335853002112477,1.4014559792433521,1.0058090137539815,0.10752703764983143,1.0084261440288891,0.12936305323740085,15.151349709434447,6.0646386116891722E-2,1.0032807145848477,0.17776401653013232,4.8842180457430899,-107.8362433517337,72.1637566482663,null,1000000000,501177769,null,25.406777832599658,-15.860976005723456,null,29.03418464259731,-95.912442358719701,null,0,0,null,0,0]
[22517.5,22.517499999999998,16.633097044083083,1.5106389547993431,1.0001000802430255,1.4147218597706707E-2,1,0,24453.907625161031,1.5707554335349887,5.967194152003672,1.4024188934029549,1.0058767374141377,0.10814898030631753,1.0085242506018433,0.13010868874769979,15.151665776196657,6.099907444405183E-2,1.0033199364439453,0.17880433998246772,4.8322397273772912,-107.86915891765447,72.130841082345526,null,1000000000,507037806.25,null,25.404767135144994,-15.841453435697096,null,28.983553231480421,-95.987394709857966,null,0,0,null,0,0]
[22648,22.648,16.729146600398053,1.510984758989447,1.0001012435741814,1.4229197660794985E-2,1,0,24595.630060589578,1.5707556691659676,6.0008084746221089,1.4033710206550203,1.0059448501076815,0.10877083897963741,1.0086229177770987,0.13085417879082886,15.151983673399927,6.1351748233016735E-2,1.0033594063045521,0.17984473278119184,4.7805724228840667,-107.90246889190772,72.097531108092284,null,1000000000,512931904,null,25.402777238676677,-15.822543940668197,null,28.933208333263693,-96.062120892653567,null,0,0,null,0,0]
[22778.5,22.778500000000001,16.825198134353052,1.511326614972581,1.0001024136265693,1.4311176532614257E-2,1,0,24737.352496019477,1.5707559020970461,6.034428176642102,1.4043125395504572,1.0060133517555936,0.10939261320594279,1.0087221453901514,0.1315995225809761,15.152303400929153,6.170440740075725E-2,1.0033991245125442,0.18088519527222144,4.7292123090756482,-107.93616701745533,72.063832982544668,null,1000000000,518860062.25,null,25.400807606016919,-15.804237266551953,null,28.883146664622458,-96.136624863886738,null,0,0,null,0,0]
[22909,22.908999999999999,16.921251612270556,1.5116645899041405,1.0001035904001647,1.4393155212063309E-2,1,0,24879.074931450701,1.5707561323743635,6.0680531686508488,1.4052436247587321,1.006082242278425,0.11001430252177261,1.008821933275627,0.1323447193332879,15.152624958668573,6.2057051864265314E-2,1.0034390914157263,0.18192572780050698,4.6781556330431009,-107.97024717032419,72.029752829675814,null,1000000000,524822281,null,25.398857714873998,-15.786523381614327,null,28.833364997638498,-96.210910491105551,null,0,0,null,0,0]
[23042.25,23.042249999999999,17.019331177264128,1.5120057505224938,1.0001047989067988,1.447686121193955E-2,1,0,25023.783854986228,1.5707563648128853,6.1023921008007243,1.4061837422822601,1.0061529856875382,0.11064900447586498,1.0089244019047885,0.13310546693268829,15.152955180876001,6.2417112274427151E-2,1.003480157508216,0.18298825988350886,4.62633231864835,-108.00543344714426,71.994566552855744,null,1000000000,530945285.0625,null,25.396886576319137,-15.769037676214399,null,28.782819908664166,-96.286540158200111,null,0,0,null,0,0]
[23175.5,23.1755,17.117412700446927,1.5123430015289294,1.0001060144208449,1.4560567008932226E-2,1,0,25168.49277852309,1.5707565945785473,6.1367363660106369,1.4071133378781275,1.0062241343648424,0.11128361692783401,1.0090274543169511,0.13386605958123152,15.153287310995641,6.2777157179265741E-2,1.0035214836267559,0.18405086571038948,4.574817674030931,-108.04100552699009,71.958994473009909,null,1000000000,537103800.25,null,25.394934964886357,-15.752149551624928,null,28.732560116122123,-96.361950057869393,null,0,0,null,0,0]
[23308.75,23.30875,17.215496148349892,1.5126764096698548,1.000107236942277,1.464427260186908E-2,1,0,25313.201702061269,1.5707568217171894,6.171085875239517,1.4080325856276743,1.0062956882243759,0.11191813938555976,1.0091310903332666,0.13462649644651623,15.153621348902153,6.3137186490482944E-2,1.0035630701478215,0.18511354564521576,4.5236079198053085,-108.07695729801367,71.923042701986333,null,1000000000,543297826.5625,null,25.393002369507947,-15.735849008149884,null,28.682582354611725,-96.437144035327506,null,0,0,null,0,0]
[23442,23.442,17.313581488261729,1.5130060401826055,1.0001084664710695,1.4727977989577878E-2,1,0,25457.910625600736,1.5707570462736093,6.2054405414043563,1.4089416558280703,1.0063676471797118,0.1125525713573518,1.0092353097739493,0.13538677669720262,15.153957294469489,6.3497200119804073E-2,1.0036049174499795,0.18617630005098038,4.4726993457426687,-108.11328277856455,71.886717221435447,null,1000000000,549527364,null,25.391088293271697,-15.720126262875093,null,28.632883413748278,-96.512125849263555,null,0,0,null,0,0]
[23578.5,23.578499999999998,17.414061081909651,1.5133398601573613,1.0001097332541538,1.4813724758086058E-2,1,0,25606.149035081507,1.5707572736753164,6.2406383843684861,1.4098625196877321,1.0064417811775614,0.11320238294284991,1.0093426759059849,0.13616543710976478,15.154303411719351,6.3865978216814279E-2,1.0036480562153935,0.18726505289185044,4.4208575802702788,-108.15087562009342,71.849124379906584,null,1000000000,555945662.25,null,25.389146229397419,-15.70460914067842,null,28.582258108638214,-96.588720339794094,null,0,0,null,0,0]
[23715,23.715,17.514542593841274,1.5136698498959986,1.0001110073905346,1.4899471308742787E-2,1,0,25754.387444563588,1.570757498459243,6.2758414599704961,1.410773053509577,1.0065163400878756,0.11385209853150809,1.0094506538842385,0.13694393141220856,15.154651530551451,6.4234739670179106E-2,1.0036914694489898,0.18835388464832986,4.3693241992459457,-108.18884832043753,71.811151679562471,null,1000000000,562401225,null,25.387222586990006,-15.689678235849998,null,28.531918742791234,-96.665099907973556,null,0,0,null,0,0]
[23851.5,23.851500000000001,17.615025991229178,1.5139960748737837,1.0001122888801839,1.4985217640288004E-2,1,0,25902.62585404695,1.5707577206703329,6.3110496806473275,1.4116734286593522,1.0065913238162338,0.11450171759618986,1.0095592435123883,0.137722258714367,15.155001650827973,6.4603484385083343E-2,1.0037351575645326,0.18944279570707898,4.3180954291096025,-108.22719485268819,71.772805147311814,null,1000000000,568894052.25,null,25.385316875108408,-15.67532370222813,null,28.481862036787945,-96.741268327484605,null,0,0,null,0,0]
[23988,23.988,17.7155112419901,1.514318599083684,1.0001135777230732,1.5070963751461665E-2,1,0,26050.864263531585,1.5707579403525072,6.3462629607664107,1.4125638127661198,1.0066667322677054,0.11515123961024126,1.0096684445930866,0.13850041812726438,15.155353772410326,6.4972212266738258E-2,1.0037791209780824,0.19053178645354857,4.2671675652602037,-108.26590931893644,71.734090681063563,null,1000000000,575424144,null,25.383428616446608,-15.661535907716472,null,28.432084766548968,-96.817229287011074,null,0,0,null,0,0]
[24127.75,24.127749999999999,17.818390886069416,1.5146450337639477,1.0001149048706082,1.5158751207090711E-2,1,0,26202.632158957607,1.5707581626900777,6.3823198064407531,1.4134652170189841,1.0067443760710171,0.11581612534048484,1.0097808789558167,0.13929693028530801,15.155716351042644,6.5349701845510089E-2,1.0038244167845534,0.19164678850863998,4.2153350736964121,-108.30592071021999,71.694079289780007,null,1000000000,582148320.0625,null,25.381512996178884,-15.647997133582583,null,28.381408508206,-96.894787677768917,null,0,0,null,0,0]
[24267.5,24.267499999999998,17.921272407069466,1.5149677205193457,1.0001162397256458,1.5246538429056484E-2,1,0,26354.400054384922,1.570758382466884,6.4183817796712912,1.4143564928267645,1.0068224648601121,0.1164809082279758,1.0098939538125786,0.14009326458222832,15.156081027119098,6.5727173578913958E-2,1.0038700020444931,0.19276187490503383,4.1638103434457348,-108.34630565322291,71.653694346777087,null,1000000000,588911556.25,null,25.379614699482147,-15.635032637429035,null,28.331018483597767,-96.972136174038383,null,0,0,null,0,0]
[24407.25,24.407250000000001,18.02415577284998,1.5152867234624867,1.0001175822881547,1.5334325416006843E-2,1,0,26506.167949813487,1.5707585997269127,6.4544487945127491,1.4152378085526087,1.0069009985314592,0.11714558770912692,1.010007668948254,0.14088942006794461,15.156447800488426,6.6104627365314986E-2,1.0039158772118628,0.1938770460523887,4.1125896127400923,-108.38705821722,71.612941782779998,null,1000000000,595713852.5625,null,25.377733255685854,-15.622632742987083,null,28.280911405129711,-97.04927847275053,null,0,0,null,0,0]
[24547,24.547000000000001,{"$f":"SQRT(1+(A333/pole1)^2)","v":18.127040951999781},{"$f":"ATAN(A333/pole1)","v":1.5156021052534607},{"$f":"SQRT(1+(A333/Zero1)^2)","v":1.0001189325581044},{"$f":"ATAN(A333/Zero1)","v":1.5422112166589666E-2},{"$f":"IF(VIN_nom>Vout, 1, SQRT(1+(A333/z_RHP)^2))","v":1},{"$f":"IF(VIN_nom>Vout, 0, -ATAN(A333/z_RHP))","v":0},{"$f":"SQRT(1+(A333/Pole2)^2)","v":26657.935845243293},{"$f":"ATAN(A333/Pole2)","v":1.570758814513149},6.4905207669183165,1.4161093288795352,{"$f":"SQRT(1+(A333/pole4)^2)","v":1.0069799769809711},{"$f":"ATAN(A333/pole4)","v":0.11781016322089179},{"$f":"IF(VOUT_setting=1,1,SQRT(1+(A333*zterm1)^2))","v":1.0101220241466031},{"$f":"IF(VOUT_setting=1,0,ATAN(((A333*zterm1))))","v":0.14168539579370953},15.156816670998504,{"$f":"IF(VOUT_setting=1,0,ATAN(A333*$Q$4/(1+Afbr-$Q$5*(A333)^2)))","v":6.6482063103108002E-2},{"$f":"SQRT((1-(Z333/pterm2))^2+(A333/pterm1)^2)","v":1.0039620427431408},{"$f":"IF((ATAN((A333/pterm1)/(1-A333^2/pterm2))>0),ATAN((A333/pterm1)/(1-A333^2/pterm2)),PI()+ATAN((A333/pterm1)/(1-A333^2/pterm2)))","v":0.19499230235900417},{"$f":"20*LOG10(((E333*K333*G333*O333)/(C333*I333*S333*M333*Q333))*Adc)","v":4.0616691884261424},{"$f":"((F333+L333+H333+P333)-(D333+J333+T333+N333+R333))*radconv","v":-108.42817259893967},{"$f":"IF(V333>0,V333,V333+180)","v":71.571827401060332},null,{"$f":"IF(U333<0,A333,1000000000)","v":1000000000},{"$f":"A333^2","v":602555209},null,{"$f":"20*LOG10((K333/(I333*M333))*AEA)","v":25.375868207219867},{"$f":"(L333-(J333+N333))*radconv","v":-15.610787984817515},null,{"$f":"20*LOG10((E333*G333/(C333*S333))*Acs*Am)","v":28.231084040739098},{"$f":"(F333+H333-(D333+T333))*radconv","v":-97.126218187535386},null,{"$f":"SUM((U334<0)*(U333>0))*A333","v":0},0,null,0,0]
[24690,{"$f":"A334/1000","v":24.69},18.232320654827067,1.5159211369387273,1.000120322208037,1.551194022342431E-2,1,0,26813.233226614582,1.5707590317774782,6.5274366685075957,1.4169911454102786,1.0070612524434011,0.11849008576598824,1.0102397011049447,0.14249969551529956,15.157196290596872,6.6868257627146183E-2,1.0040095829416511,0.19613358343625309,4.0098716492135349,-108.47061174254604,71.529388257453959,null,1000000000,609596100,null,25.373976293191426,-15.599232759846767,null,28.180384132955819,-97.204741177147852,null,0,0,null,{"$f":"SUM((V335<-183)*(V334>-183))*A334","v":0},{"$f":"IF(AK334>0,U334,0)","v":0}]
[24833,24.832999999999998,18.33760219205406,1.516236505347367,1.0001217199279979,1.5601768029905403E-2,1,0,26968.530607987126,1.5707592465395885,6.5643575887431815,1.4178630431415391,1.0071429933896119,0.11916989825864004,1.0103580477808047,0.14331380501321347,{"$f":"IF(VOUT_setting=1,1,SQRT((1+Afbr-$Q$5*(A335)^2)^2+(A335*$Q$4)^2))","v":15.157578105686627},6.7254433038194714E-2,1.0040574281414902,0.19727495454028926,3.9583809356268125,-108.51341782872322,71.48658217127678,null,1000000000,616677889,null,25.372100616758662,-15.588239391317678,null,28.129970426254197,-97.283059448969325,null,0,0,null,0,0]
[24976,24.975999999999999,18.442885532265656,1.5165482731528166,1.0001231257179533,1.5691595584584352E-2,1,0,27123.827989360896,1.5707594588424594,6.6012834434173415,1.4187251871859445,1.0072251997062751,0.1198496000973739,1.0104770639388725,0.14412772327533677,15.157962116101999,6.7640589227491082E-2,1.0041055788398967,0.19841641610409702,3.9071933031582025,-108.55658503278805,71.44341496721195,null,1000000000,623800576,null,25.370240727517999,-15.577798386974187,null,28.079839630358432,-97.361176618814412,null,0,0,null,0,0]
[25119,25.119,18.548170644759487,1.5168565016083355,1.0001245395778688,1.5781422886012593E-2,1,0,27279.125370735874,1.5707596687280916,6.638214150184873,1.4195777390405442,1.0073078712794541,0.12052919068132127,1.0105967493426165,0.14494144929104386,15.158348321676291,6.8026726086306041E-2,1.0041540355368579,0.19955796855913693,3.8563050754369192,-108.60010765565238,71.39989234434762,null,1000000000,630964161,null,25.368396187622942,-15.56790046169619,null,28.029988510591583,-97.439096221040217,null,0,0,null,0,0]
[25265.25,25.265250000000002,18.655850402606088,1.5171681367231571,1.0001259939180855,1.5873291453559424E-2,1,0,27437.952238052425,1.5707598809263585,6.6759891260354793,1.4204399100231508,1.0073929028703368,0.12122411080393716,1.0107198468550997,0.14577346917822231,15.158745575036107,6.8421618675072862E-2,1.0042039105556977,0.20072555984948201,3.8045662243489242,-108.64498124483246,71.355018755167535,null,1000000000,638332857.5625,null,25.366525159358069,-15.558329851352964,null,27.979290379434229,-97.518585969901068,null,0,0,null,0,0]
[25411.5,25.4115,18.763531951447529,1.5174761949981892,1.0001274566991747,1.5965159753148647E-2,1,0,27596.779105370195,1.5707600906821098,6.713769008562525,1.4212923783748992,1.0074784208630765,0.12191891328794742,1.0108436438748736,0.14660528584781171,15.159145124112978,6.8816490814782499E-2,1.0042541067067978,0.20189324711735976,3.7531329748917526,-108.69021492217179,71.309785077828209,null,1000000000,645744332.25,null,25.364669298148065,-15.549308280667272,null,27.928878110460595,-97.597876295398137,null,0,0,null,0,0]
[25557.75,25.557749999999999,18.871215260624883,1.5177807376051622,1.0001289279210992,1.6057027783230756E-2,1,0,27755.605972689165,1.5707602980372755,6.7515537153966774,1.4221353057470447,1.0075644251338216,0.12261359749255944,1.0109681401449662,0.14743689822357928,15.159546968725545,6.9211342389231642E-2,1.0043046245339262,0.20306103081932139,3.7020016048025539,-108.73580297755825,71.264197022441749,null,1000000000,653198585.0625,null,25.362828173724278,-15.540826453392116,null,27.878748415853391,-97.676970728660663,null,0,0,null,0,0]
[25704,25.704000000000001,18.978900300174534,1.5180818243301117,1.000130407583822,1.614889554225625E-2,1,0,27914.432840009315,1.5707605030328327,6.7893431659918395,1.4229688502467674,1.0076509155580591,0.12330816277765537,1.0110933354070806,0.14826830523095119,15.15995110869142,6.9606173282254255E-2,1.0043554645838479,0.20422891141021374,3.6511684593569491,-108.78173982433931,71.218260175660689,null,1000000000,660695616,null,25.361001367828205,-15.532875276325113,null,27.828898063344209,-97.755872721325744,null,0,0,null,0,0]
[25853.75,25.853750000000002,19.089164179991901,1.5183865966490786,1.0001319314034558,1.624296156345938E-2,1,0,28077.060692189611,1.5707607105311012,6.828041812652196,1.4238127819520254,1.0077399794522321,0.12401922624761609,1.0112222508081661,0.14911939523816617,15.160367298599324,7.0010431568675896E-2,1.0044078557749794,0.20542484214820803,3.5994240617914555,-108.82913171775631,71.170868282243688,null,1000000000,668416389.0625,null,25.359145255477952,-15.52527437597759,null,27.77814084181275,-97.836467086873554,null,0,0,null,0,0]
[26003.5,26.003499999999999,19.199429812562119,1.5186878682759106,1.0001334640726465,1.6337027297189128E-2,1,0,28239.6885443711,1.5707609156394713,{"$f":"SQRT(1+(A343/Zero2)^2)","v":6.8667452675701623},{"$f":"ATAN(A343/Zero2)","v":1.4246472008385784},1.0078295527808787,0.12473016368195444,1.0113518985052903,0.14997026765492369,15.160785894647912,7.0414667925566304E-2,1.0044605859659148,0.20662087542769358,3.5479847884324971,-108.87687782462277,71.123122175377233,null,1000000000,676182012.25,null,25.357303304549319,-15.51821116175342,null,27.727669806958232,-97.91686676920213,null,0,0,null,0,0]
[26153.25,26.15325,19.309697167858555,1.5189856991271873,1.0001350055913529,1.6431092741782172E-2,1,0,28402.316396553768,1.5707611183989951,6.9054534498982569,1.4254722657055345,1.007919635408179,0.12544097439570773,1.0114822782168649,0.15082092133309549,15.16120689663806,7.0818882228340707E-2,1.0045136557533769,0.20781701173134293,3.4968469253801464,-108.92497252888884,71.075027471111156,null,1000000000,683992485.5625,null,25.355475102633239,-15.511676498240559,null,27.677481661862373,-97.997075229029008,null,0,0,null,0,0]
[26303,26.303000000000001,19.419966216536078,1.5192801477611051,1.0001365559595348,1.6525157895575213E-2,1,0,28564.944248737589,1.5707613188497911,6.9441662805818707,1.4262881318624552,1.0080102271975899,0.12615165770466963,1.0116133896598571,0.15167135512640972,15.161630304369522,7.1223074352456006E-2,1.004567065737372,0.2090132515399131,3.4460068260086412,-108.97341033638749,71.026589663612512,null,1000000000,691847809,null,25.353660248860088,-15.50566144995309,null,27.627573165363934,-98.077095849132348,null,0,0,null,0,0]
[26456,26.456,19.532630135593127,1.5195775531818292,1.0001381491147103,1.6621264228102933E-2,1,0,28731.101586863129,1.5707615213072901,6.9837240099208788,1.4271123623090693,1.0081033108005562,0.1268776325650775,1.0117481020220478,0.15254001746132212,15.162065385665937,7.1636015557382096E-2,1.0046219868486932,0.2102355605442543,3.3943671546811638,-109.02324814400141,70.976751855998586,null,1000000000,699919936,null,25.35181938809459,-15.500043419503699,null,27.5768670164064,-98.158662584608621,null,0,{"$f":"IF(AH346>0,W346,0)","v":0},null,0,0]
[26609,26.609000000000002,19.645295762494968,1.5198715473925022,1.0001397515075598,1.6717370253561167E-2,1,0,28897.258924989834,1.5707617214365546,7.0232864302468476,1.4279273074657468,1.0081969256155134,0.12760347298906899,1.0118835776196962,0.1534084478504176,15.162502977833453,7.2048933347820629E-2,1.0046772643599768,0.21145797860340176,3.3430308238761546,-109.07343288950334,70.926567110496663,null,1000000000,708038881,null,25.349991650366302,-15.494949560942537,null,27.526446118604063,-98.240040138119639,null,0,0,null,0,0]
[26762,26.762,19.757963068025731,1.5201621886978551,1.0001413631380387,1.6813475970176048E-2,1,0,29063.416263117684,1.5707619192775166,7.062853462730394,1.4287331222930615,1.0082910714945006,0.12832917824938656,1.012019816146287,0.15427664507721903,15.162943080654872,7.2461827591079164E-2,1.0047328989217521,0.21268050622383255,3.2919941515105977,-109.12395908675761,70.876040913242392,null,1000000000,716204644,null,25.348176643033902,-15.49037095630189,null,27.476307187487521,-98.321231879401054,null,0,0,null,0,0]
[26915,26.914999999999999,19.870632023631725,1.5204495340825341,1.0001429840061018,1.6909581376173755E-2,1,0,29229.573601246662,1.5707621148691999,7.1024250302896528,1.4295299583461367,1.0083857482887726,0.12905474761961291,1.0121568172937447,0.15514460792730847,15.163385693911776,7.2874698154511752E-2,1.0047888911881151,0.2139031439098894,3.2412535219468759,-109.17482136886946,70.825178631130541,null,1000000000,724417225,null,25.346373984446299,-15.486298882728061,null,27.426446994066552,-98.402241102430935,null,0,0,null,0,0]
[27071.75,27.071750000000002,19.986064155305982,1.5207405623922212,1.0001446541812531,1.7008041982843475E-2,1,0,29399.803423154452,1.5707623129620216,7.1429711135749203,1.4303371680934012,1.0084832960300636,0.1297979588673594,1.0122979668761842,0.15603360004521907,15.163841758788134,7.3297663398341623E-2,1.0048466274645111,0.21515586287616659,3.1895725530656649,-109.22727332820705,70.772726671792952,null,1000000000,732879648.0625,null,25.34453956164915,-15.482643388688976,null,27.375650487225982,-98.485049928862651,null,0,0,null,0,0]
[27228.5,27.2285,20.101497960308031,1.5210282482383111,1.0001463340522652,1.7106502259713878E-2,1,0,29570.033245063383,1.5707625087740678,7.1835217985892887,1.4311352650241869,1.0085814007122396,0.13054102594121131,1.0124399162613382,0.15692234358263318,15.164300458200586,7.372060350562723E-2,1.0049047405963101,0.21640869843435595,3.1381948405452236,-109.280067014693,70.719932985306997,null,1000000000,741391212.25,null,25.342717323161569,-15.479501629339682,null,27.325139860832714,-98.56767394535747,null,0,0,null,0,0]
[27385.25,27.385249999999999,20.216933409974985,1.5213126488275659,1.0001480236190894,1.7204962204877602E-2,1,0,29740.263066973435,1.570762702344503,7.2240770078405321,1.4319244015883092,1.0086800621727949,0.13128394806278917,1.0125826651128442,0.1578108372404145,15.164761791910275,7.4143518333881955E-2,1.0049632312985146,0.21766165111975283,3.087116702931449,-109.33319702599901,70.666802974000987,null,1000000000,749951917.5625,null,25.340906892134264,-15.476864827595303,null,27.274911815732604,-98.650116460400866,null,0,0,null,0,0]
[27542,27.542000000000002,20.332370476294468,1.5215938200697356,1.0001497228816767,1.7303421816427311E-2,1,0,29910.49288888459,1.5707628937116003,7.2646366655582941,1.4327047268761859,1.0087792802483668,0.13202672445465718,1.012726213092636,0.15869907972173522,15.165225759677002,7.4566407740671567E-2,1.005022100290041,0.21891472146524876,3.0363345251351377,-109.38665807769878,70.613341922301217,null,1000000000,758561764,null,25.339107902299446,-15.474724398853196,null,27.224963108580994,-98.73238070802725,null,0,0,null,0,0]
[27702.5,27.702500000000001,20.450570841454308,1.5218784288096356,1.0001514728428988,1.7404236573402988E-2,1,0,30084.795194574646,1.5707630874128859,7.3061711820112123,1.4334947425232756,1.0088814485391107,0.13278711880473346,1.0128740229135704,0.15960831040931989,15.165703556233176,7.4999387629214209E-2,1.0050827703581675,0.22019789204025822,2.9846404200955927,-109.44173571781536,70.558264282184638,null,1000000000,767428506.25,null,25.337277357671788,-15.473038321814851,null,27.1741055681128,-98.816431585988184,null,0,0,null,0,0]
[27863,27.863,20.568772844115038,1.5221597664656301,1.0001532329692402,1.7505050976564254E-2,1,0,30259.097500265816,1.570763278882606,7.3477102068722067,1.4342758262161819,1.00898420004634,0.133547358722375,1.0130226698331515,0.16051727501436927,15.16618411387139,7.5432340563339639E-2,1.0051438385701299,0.22148118709535008,2.9332491404233005,-109.49714957920892,70.502850420791077,null,1000000000,776346769,null,25.335458063516839,-15.471855031868579,null,27.123534182723148,-98.900302197102121,null,0,0,null,0,0]
[28023.5,28.023499999999999,20.686976456207439,1.5224378890648771,1.000155003260647,1.7605865023863722E-2,1,0,30433.399805958084,1.5707634681591032,7.3892536641086153,1.4350481276439422,1.0090875345918944,0.1343074433761087,1.0131721534829365,0.16142597215232643,15.166667432329415,7.5865266390317224E-2,1.0052053057104158,0.22276460719466196,2.8821570112705261,-109.55289435302454,70.447105646975459,null,1000000000,785316552.25,null,25.333649658886905,-15.471165907021247,null,27.073245644475854,-98.983995783928748,null,0,0,null,0,0]
[28184,28.184000000000001,20.805181650299776,1.5227128513632706,1.0001567837170653,1.7706678713254043E-2,1,0,30607.702111651433,1.570763655279847,7.4308014793800599,1.4358117931902148,1.0091914519966763,0.13506737193551868,1.0133224734926261,0.16233440044121586,15.167153511343555,7.6298164957475198E-2,1.0052671725677971,0.22404815289962998,2.8313604239290324,-109.60896484666469,70.391035153335309,null,1000000000,794337856,null,25.331851792996567,-15.470962514674568,null,27.023236701440268,-99.067515516034945,null,0,0,null,0,0]
[28348,28.347999999999999,20.925966133982655,1.5229906009764997,1.0001586134995082,1.7809690460176331E-2,1,0,30785.805402205227,1.5707638442924214,7.4732597477730494,1.4365833404049899,1.0092982373890682,0.13584371004552917,1.0134769350378727,0.16326235955049812,15.167653041446734,7.674047536353934E-2,1.0053308022588336,0.22535981902327862,2.7797577149940533,-109.66658922868584,70.333410771314163,null,1000000000,803609104,null,25.330025252579048,-15.471247842374765,null,26.972422701809897,-99.152680191408109,null,0,0,null,0,0]
[28512,28.512,21.046752213467077,1.5232651626331501,1.0001604538950155,1.7912701829087833E-2,1,0,30963.908692760109,1.570764031130609,7.5157224146207637,1.4373461698252235,1.0094056309574573,0.13661988342956835,1.0136322690299122,0.16419003504837398,15.168155453255512,7.718275698582637E-2,1.0053948509689095,0.22667161746691389,2.7284561647139056,-109.72454308798082,70.27545691201918,null,1000000000,812934144,null,25.328209006079135,-15.472023100223295,null,26.921893933367468,-99.237669813359048,null,0,0,null,0,0]
[28676,28.675999999999998,21.167539861435188,1.5235365908654686,1.0001623049035282,1.8015712817804456E-2,1,0,31142.011983316064,1.5707642158317159,7.5581894057903201,1.4381004275028526,1.0095136325077478,0.13739589120515375,1.0137884750677122,0.16511742546889671,15.168660746483798,7.7625009661649813E-2,1.0054593195533656,0.22798354882067082,2.6774521269036189,-109.78282124104118,70.217178758958823,null,1000000000,822312976,null,25.326402709997538,-15.473279871635514,null,26.871647099911073,-99.322487540292741,null,0,0,null,0,0]
[28840,28.84,21.288329051188775,1.5238049389699169,1.0001641665249879,1.8118723424142173E-2,1,0,31320.115273873067,1.5707643984321997,7.6006606487981783,1.4388462562648705,1.009622241844828,0.13817173249097731,1.0139455527482368,0.16604452934898167,15.169168920843905,7.8067233228388822E-2,1.0055242088721945,0.2292956136716742,2.6267420207646817,-109.84141861801508,70.158581381984916,null,1000000000,831745600,null,25.324606030513692,-15.475009924821144,null,26.821678960976975,-99.407136459636405,null,0,0,null,0,0]
[29008,29.007999999999999,21.412065890117322,1.5240766928670166,1.0001660845561688,1.8224246085527928E-2,1,0,31502.562547127651,1.5707645833454971,7.6441721103585021,1.4396016821748361,1.0097341301887841,0.13896632318461821,1.0141073649596566,0.1669939468836131,15.169692476794239,7.8520212383150448E-2,1.0055911180134203,0.23063981913595469,2.5750961795170473,-109.90177101382216,70.098228986177844,null,1000000000,841464064,null,25.322775161757502,-15.477264496385382,null,26.770777730505042,-99.493678107866643,null,0,0,null,0,0]
[29176,29.175999999999998,21.53580429215976,1.5243453239477183,1.0001680137241884,1.8329768341015185E-2,1,0,31685.009820383304,1.5707647661292747,7.6876878848240082,1.4403485564055134,1.0098466559114849,0.13976073729960198,1.0142700909888738,0.16794306063092831,15.170219055517039,7.8973160646305385E-2,1.0056584705047942,0.23198416592645857,2.5237513796673126,-109.96244797776133,70.037552022238671,null,1000000000,851238976,null,25.320953705035066,-15.479998803856821,null,26.720162245264998,-99.580048952549291,null,0,0,null,0,0]
[29344,29.344000000000001,21.65954423052645,1.5246108856944161,1.0001699540289823,1.843529018825632E-2,1,0,31867.457093640001,1.5707649468201084,7.7312078993680151,1.4410870225322192,1.0099598187998879,0.14055497389241842,1.0144337303961299,0.16889186902757736,15.170748656697818,7.9426077843257531E-2,1.0057262672859297,0.23332865466439209,2.4727039752508491,-110.02344441122153,69.976555588778467,null,1000000000,861070336,null,25.319141331034963,-15.483204569012262,null,26.6698291957048,-99.666252093726811,null,0,0,null,0,0]
[29512,29.512,21.783285679036116,1.5248734303760183,1.0001719054704854,1.8540811624903779E-2,1,0,32049.904366897721,1.5707651254537409,7.7747320827874464,1.441817220952395,1.0100736186398398,0.14134903202087479,1.0145982827394833,0.16984037051341508,15.171281280020333,7.9878963799484601E-2,1.0057945093015401,0.23467328596757303,2.4219503856141738,-110.08475532779718,69.915244672202817,null,1000000000,870958144,null,25.317337719756821,-15.486873695735101,null,26.619775328305554,-99.752290561719946,null,0,0,null,0,0]
[29684,29.684000000000001,21.909974890296958,1.5251391537905057,1.0001739149124191,1.8648845048884085E-2,1,0,32236.695622853109,1.5707653062457727,7.8192968025403218,1.4425563830834183,1.0101907876553635,0.14216181042410844,1.0147676983317264,0.17081113578330454,15.17182971545043,8.0342600207187378E-2,1.0058648383807895,0.23605008064061392,2.3702890965829324,-110.1478467396671,69.852153260332898,null,1000000000,881139856,null,25.315499918817178,-15.491101956061463,null,26.568815594385221,-99.840210056769251,null,0,0,null,0,0]
[29856,29.856000000000002,22.036665630809761,1.5254018218885201,1.0001759360275564,1.8756878037506104E-2,1,0,32423.486878809534,1.5707654849547239,7.8638657460271482,1.4432871671161385,1.0103086238566983,0.14297439976906576,1.0149380699062578,0.17178157605436498,15.172381317970492,8.0806203498820922E-2,1.0059356361689509,0.23742702604817575,2.3189283873612316,-110.21125755792475,69.788742442075247,null,1000000000,891380736,null,25.313670652596759,-15.495799294468432,null,26.518141768051294,-99.927963156475471,null,0,0,null,0,0]
[30028,30.027999999999999,22.163357874349881,1.525661487028753,1.0001779688158265,1.8864910588250749E-2,1,0,32610.278134766988,1.5707656616163899,7.9084388418378664,1.4440097139238304,1.0104271270104226,0.14378679904897154,1.0151093969817337,0.17275168966286511,15.17293608723541,8.1269773487340935E-2,1.0060069036964074,0.23880412284210473,2.2678646180552273,-110.27498277752539,69.725017222474605,null,1000000000,901680784,null,25.311849606043729,-15.500957583878863,null,26.467750532224517,-100.015552898263,null,0,0,null,0,0]
[30200,30.2,22.290051595288585,1.5259182003811369,1.0001800132771581,1.8972942698598991E-2,1,0,32797.069390725439,1.5707658362657508,7.9530160201567259,1.4447241612561992,1.0105462968819026,0.14459900725852501,1.0152816790744363,0.17372147494865303,15.173494022898145,8.1733309985786026E-2,1.0060786419991177,0.24018137167044193,2.2170942138658853,-110.33901750390015,69.660982496099848,null,1000000000,912040000,null,25.310036473041507,-15.506568876220728,null,26.417638626020885,-100.10298225122736,null,0,0,null,0,0]
[30375.75,30.37575,22.41950903398649,1.5261775136897384,1.0001821143700125,1.9083329702665876E-2,1,0,32987.933130463083,1.5707660126798473,7.9985692306033647,1.445445959064221,1.010668753368543,0.14542872508705815,1.015458703288258,0.17471206294740055,15.174067393195386,8.2206917870175769E-2,1.0061524317304831,0.24158880543898981,2.1655162727628339,-110.40476305840413,69.595236941595871,null,1000000000,922686188.0625,null,25.308191674292956,-15.512762345711234,null,26.366719359465797,-100.19215511491956,null,0,0,null,0,0]
[30551.5,30.551500000000001,22.548967962937812,1.5264338494580139,1.0001842276503254,1.9193716241606422E-2,1,0,33178.796870201739,1.5707661870642711,8.0441265610430239,1.4461595815409092,1.0107919054627015,0.14625824130548346,1.0156367235878165,0.17570230465801101,15.174644068726504,8.2680490393853626E-2,1.0062267151934756,0.24299639929934716,2.11423728340454,-110.47082177076,69.529178229240003,null,1000000000,933394152.25,null,25.306354519009183,-15.519412559483847,null,26.316085025968103,-100.28116657735234,null,0,0,null,0,0]
[30727.25,30.727250000000002,22.678428356621392,1.5266872586440818,1.0001863531180195,1.9304102312733419E-2,1,0,33369.660609941398,1.5707663594538488,8.0896879418701015,1.4468651660844005,1.0109157529101565,0.14708755484611677,1.0158157394494238,0.17669219832103691,15.175224049115021,8.3154027357632068E-2,1.0063014935112953,0.24440415393042594,2.0632536326632565,-110.53718875759026,69.462811242409742,null,1000000000,944163892.5625,null,25.304524707634542,-15.526511586026821,null,26.265732320390033,-100.37001959726362,null,0,0,null,0,0]
[30903,30.902999999999999,22.807890190095222,1.5269377910505937,1.0001884907730172,1.941448791335974E-2,1,0,33560.524349682026,1.5707665298826157,8.1352533050321654,1.447562847047003,1.0110402954553759,0.14791666464291078,1.0159957503468335,0.17768174218099572,15.175807333982364,8.3627528562415829E-2,1.0063767678131896,0.24581207000689884,2.0125617717973583,-110.60385924341072,69.396140756589276,null,1000000000,954995409,null,25.302701949120824,-15.53405166838999,null,26.215657993510749,-100.45871706694497,null,0,0,null,0,0]
[31083,31.082999999999998,22.940484146536633,1.5271914507400943,1.0001906927538089,1.952754237654698E-2,1,0,33756.003571039008,1.5707667024349501,8.1819245917353527,1.4482693440787775,1.0111685699439676,0.14876561173045616,1.0161811451488094,0.17869485084263906,15.176408148800135,8.411244273522353E-2,1.0064543777103385,0.24725420046730501,1.9609428936820528,-110.67245167695808,69.327548323041924,null,1000000000,966152889,null,25.300842127796003,-15.542223341906901,null,26.164657985443643,-100.54940114198236,null,0,0,null,0,0]
[31263,31.263000000000002,23.073079562078036,1.527442195003633,1.0001929075182934,1.9640596340497751E-2,1,0,33951.482792396986,1.5707668730003082,8.228599916020741,1.448967826488982,1.0112975730078491,0.1496143428429145,1.0163675825669685,0.17970758886419291,15.177012429036862,8.4597318976239316E-2,1.0065325102865474,0.24869650169446439,1.9096227537245747,-110.74135266018641,69.258647339813592,null,1000000000,977375169,null,25.298989112733487,-15.550841731108356,null,26.113943257835572,-100.63992798823486,null,0,0,null,0,0]
[31443,31.443000000000001,23.205676411707866,1.5276900737854933,1.0001951350663854,1.9753649802325461E-2,1,0,34146.96201375594,1.5707670416128139,8.2752792095684153,1.4496584292171553,1.0114273043682411,0.15046285684040328,1.01655506202766,0.18071995437275304,15.177620174278994,8.508215707187658E-2,1.0066111667746587,0.25013897439920835,1.8585977395449333,-110.81055739583584,69.189442604164157,null,1000000000,988662249,null,25.297142617195423,-15.559899041173004,null,26.06351049427041,-100.73030050819214,null,0,0,null,0,0]
[31623,31.623000000000001,23.338274670982738,1.5279351358963356,1.0001973753979996,1.9866702759143578E-2,1,0,34342.441235115861,1.5707672083058151,8.3219624055855839,1.4503412842054397,1.0115577637449333,0.15131115258487346,1.0167435829544502,0.18173194549984681,15.178231384110676,8.5566956808652395E-2,1.0066903484141323,0.25158161928760181,1.8078643030563357,-110.88006119297251,69.119938807027495,null,1000000000,1000014129,null,25.295302362619523,-15.569387649078172,null,26.013356434491079,-100.82052153911897,null,0,0,null,0,0]
[31807,31.806999999999999,23.473820990349399,1.5281827822464567,1.0001996787274674,1.998226747891757E-2,1,0,34542.264439173632,1.5707673767530745,8.3696869714814763,1.4510314401693347,1.0116918743888932,0.15217807258082908,1.0169373690708499,0.18276603642450207,15.178859756878966,8.6062490003773764E-2,1.0067718337291613,0.25305650164707461,1.7563011971145914,-110.95141384689758,69.04858615310242,null,1000000000,1011685249,null,25.29342738225802,-15.579525133413586,null,25.96237256554986,-100.91259379367035,null,0,0,null,0,0]
[31991,31.991,23.60936873280497,1.5284275850027036,1.000201995414745,2.0097831664888443E-2,1,0,34742.087643232371,1.5707675432626458,8.4174154787797573,1.4517137697976772,1.0118267451682756,0.15304476211694168,1.0171322422281179,0.18379973220961285,15.179491749043367,8.6557982665476749E-2,1.0068538704351702,0.25453156540446714,1.7050354734154383,-111.0230694168482,68.976930583151798,null,1000000000,1023424081,null,25.291558359671086,-15.590097718348002,null,25.911673209775095,-101.00451354621381,null,0,0,null,0,0]
[32175,32.174999999999997,23.744917873978366,1.5286695928339069,1.000204325459739,2.0213395313973179E-2,1,0,34941.910847292071,1.570767707867772,8.4651478608127508,1.4523884048406273,1.0119623757791563,0.15391121998358837,1.0173282018015735,0.18483303087382444,15.180127360152218,8.705343456606747E-2,1.0069364598774864,0.25600681129835645,1.654063540512734,-111.09502321818456,68.904976781815435,null,1000000000,1035230625,null,25.289695022069711,-15.601097787751684,null,25.86125505854163,-101.09628362776192,null,0,0,null,0,0]
[32359,32.359000000000002,23.880468390051583,1.528908853305206,1.0002066688623568,2.0328958423088853E-2,1,0,35141.734051352701,1.57076787060094,8.5128840524026721,1.4530554741215536,1.0120987659160618,0.15477744497318421,1.0175252471635361,0.18586593044069633,15.180766589751352,8.7548845477967763E-2,1.0070196034086241,0.25748224006200193,1.6033818706818752,-111.16727067021657,68.832729329783433,null,1000000000,1047104881,null,25.287837104461136,-15.612517893261153,null,25.811114859193939,-101.18790680578572,null,0,0,null,0,0]
[32547.5,32.547499999999999,24.01933540168184,1.5291511648859355,1.0002090834279929,2.044734724073273E-2,1,0,35346.44423594838,1.5707680354059961,8.5617915890331542,1.4537311437071774,1.0122392789765526,0.1556646120630284,1.0177282368554696,0.18692367521972997,15.18142520452159,8.8056329675198705E-2,1.0071053563440113,0.2589939430752155,1.5517580790113985,-111.24158487218006,68.758415127819944,null,1000000000,1059339756.25,null,25.285939099988642,-15.624645250278546,null,25.760033293677374,-101.28162125973756,null,0,0,null,0,0]
[32736,32.735999999999997,24.158203807391587,1.5293906907252319,1.000211512012404,2.0565735485123048E-2,1,0,35551.154420545012,1.5707681983130954,8.6107029899702852,1.4543991375791019,1.0123805885140815,0.1565515321866599,1.0179323647513265,0.18798099695821749,15.18208761596474,8.8563770371183487E-2,1.0071916936985537,0.2605058395529945,1.5004316248585428,-111.31619785359825,68.683802146401746,null,1000000000,1071645696,null,25.28404624480741,-15.637198134429562,null,25.70923670555382,-101.37518722001039,null,0,0,null,0,0]
[32924.5,32.924500000000002,24.297073583277502,1.5296274785610369,1.0002139546154876,2.0684123152945391E-2,1,0,35755.864605142568,1.5707683593548367,8.6596181897347417,1.4550595852084667,1.0125226941951753,0.15743820405242215,1.0181376301665064,0.18903789354729919,15.182753823584306,8.9071167321616893E-2,1.0072786169498407,0.26201793026617193,1.449398913528346,-111.39110501055158,68.608894989448416,null,1000000000,1084022700.25,null,25.282158277794963,-15.65016905542562,null,25.658721772228134,-101.46860746614219,null,0,0,null,0,0]
[33113,33.113,24.435944705979406,1.5298615750473445,1.0002164112371414,2.0802510240885429E-2,1,0,35960.57478974104,1.5707685185630766,8.7085371243133363,1.4557126131839431,1.0126655956846691,0.15832462637094299,1.0183440324131472,0.19009436288361006,15.183423826881031,8.9578520282323965E-2,1.0073661275833321,0.26353021597959575,1.3986564140446311,-111.46630184160639,68.533698158393605,null,1000000000,1096470769,null,25.280274945328095,-15.663550688219805,null,25.608485227372594,-101.56188471522233,null,0,0,null,0,0]
[33305.75,33.305750000000003,24.577948244136717,1.5300982140198924,1.0002189377429449,2.0923565930631969E-2,1,0,36169.900455956064,1.5707686794973503,8.75856280256769,1.4563728210815234,1.0128125416646929,0.15923077494736854,1.01855626313892,0.19117420782384317,15.184112860840147,9.0097266492634956E-2,1.0074562202206399,0.26507680075570556,1.3470663398000742,-111.54348905096003,68.456510949039966,null,1000000000,1109272983.0625,null,25.278353686278976,-15.677651271998984,null,25.557400557155503,-101.65711992994822,null,0,0,null,0,0]
[33498.5,33.4985,24.719953142797547,1.5303321342386658,1.0002214789063626,2.1044621007044156E-2,1,0,36379.226122172018,1.5707688385795957,8.8085922550928366,1.4570255298015895,1.0129603190287255,0.16013665987752215,1.0187696810719449,0.19225360159759813,15.18480586249914,9.0615966191280276E-2,1.0075469301920177,0.26662359102249678,1.2957724416076546,-111.62096994038967,68.379030059610329,null,1000000000,1122149502.25,null,25.27643675969674,-15.692166315067968,null,25.50660023734206,-101.75221118044738,null,0,0,null,0,0]
[33691.25,33.691249999999997,24.861959378649384,1.5305633822646765,1.0002240347272828,2.1165675466578715E-2,1,0,36588.551788388875,1.5707689958415998,8.858625417942724,1.4576708658483972,1.0131089274129561,0.16104227979031285,1.018984285466269,0.19333254197396407,15.185502831315286,9.1134619117620899E-2,1.0076382591111286,0.26817058757810414,1.2447711411830311,-111.69874001156938,68.301259988430616,null,1000000000,1135100326.5625,null,25.274523917149093,-15.707088492530298,null,25.456080950022013,-101.84716118040201,null,0,0,null,0,0]
[33884,33.884,25.003966928909112,1.5307920036023408,1.0002266052055933,2.1286729305692476E-2,1,0,36797.877454606627,1.5707691513144262,8.9086622286031627,1.4583089529089637,1.0132583664517434,0.16194763331719061,1.0192000755724231,0.19441102672812638,15.186203766742851,9.16532250111632E-2,1.0077302086001854,0.26971779121397771,1.1940589234927215,-111.77679486643082,68.223205133569181,null,1000000000,1148125456,null,25.272614917363217,-15.722410641009597,null,25.405839433427872,-101.94197258257293,null,0,0,null,0,0]
[34081.5,34.081499999999998,25.149475356832852,1.5310235808551906,1.000229254232557,2.1410765666096395E-2,1,0,37012.361600278127,1.5707693087945074,8.9599358322660692,1.4589553718756347,1.0134123493922425,0.16287502001879317,1.0194224125775015,0.19551561400472525,15.18692608941441,9.2184562017968583E-2,1.0078250694331676,0.27130333870319945,1.1423932338086851,-111.85706415240577,68.142935847594231,null,1000000000,1161548642.25,null,25.270662614421703,-15.738517929362944,null,25.354644568521078,-102.03897940129598,null,0,0,null,0,0]
[34279,34.279000000000003,25.294985117956333,1.5312524938173275,1.0002319186479849,2.1534801367593066E-2,1,0,37226.845745950544,1.5707694644599315,9.0112131372979984,1.4595944343565035,1.0135672036488128,0.16380212414259471,1.019645992849852,0.19661971821685403,15.18765257543752,9.2715849092074767E-2,1.0079205852745063,0.27288910526541982,1.0910237757239274,-111.93762339320203,68.062376606797969,null,1000000000,1175049841,null,25.268713855136294,-15.755030418817688,null,25.303734575298144,-102.13584615711643,null,0,0,null,0,0]
[34476.5,34.476500000000001,25.440496189403405,1.5314787881810896,1.000234598451754,2.1658836406371229E-2,1,0,37441.329891623842,1.5707696183418847,9.0624940808698096,1.4602262647071251,1.0137229288221532,0.16472894422472717,1.0198708155718124,0.19772333699119182,15.188383224215292,9.3247085953731546E-2,1.0080167578971642,0.27447509172998197,1.0399469648085209,-112.01846816735161,67.981531832648386,null,1000000000,1188629052.25,null,25.266768401814858,-15.771940902238736,null,25.253106120089019,-102.23257551574869,null,0,0,null,0,0]
[34674,34.673999999999999,25.586008548818111,1.5317025086004594,1.0002372936437405,2.1782870778619748E-2,1,0,37655.81403729802,1.5707697704708419,9.113778601562057,1.4608509845073856,1.0138795245109624,0.16565547880417122,1.0200968799218986,0.19882646796123427,15.189118035147526,9.377827232335248E-2,1.0081135890834643,0.27606129891870257,0.98915927994335673,-112.09959415223734,67.900405847762656,null,1000000000,1202286276,null,25.264826023656024,-15.7892423316476,null,25.202755925699073,-102.32917008298244,null,0,0,null,0,0]
[34875.75,34.875749999999996,25.734653493972726,1.5319284310149033,1.0002400627218886,2.1909573552792952E-2,1,0,37874.913664588865,1.570769924094445,9.1661703441801876,1.4614819295420862,1.0140403883769513,0.16660165516877043,1.0203290900830932,0.19995283107602285,15.18987295530547,9.4320836861630369E-2,1.0082131858156307,0.27768186842645287,0.93757362401777034,-112.18275184440412,67.817248155595877,null,1000000000,1216317938.0625,null,25.262844789571961,-15.807312558425817,null,25.151606202895692,-102.42770674292905,null,0,0,null,0,0]
[35077.5,35.077500000000001,25.883299737561323,1.5321517585227875,1.0002428478573944,2.2036275623402733E-2,1,0,38094.013291880583,1.5707700759509005,9.2185656942968901,1.4621057026471531,1.014202159773852,0.16754753053819998,1.0205625941395162,0.2010786801963329,15.190632217399305,9.4863348122166707E-2,1.0083134735491794,0.27930266996949549,0.88628243939016582,-112.26619416575187,67.73380583424813,null,1000000000,1230431006.25,null,25.260866298571575,-15.825776359500491,null,25.100740107219991,-102.52610806063555,null,0,0,null,0,0]
[35279.25,35.279249999999998,26.031947257341166,1.5323725355539166,1.0002456490501239,2.216297698638698E-2,1,0,38313.112919173182,1.5707702260705252,9.270964590748255,1.4627224249388693,1.0143648382674644,0.1684931033643631,1.0207973912032442,0.20220401282176223,15.191395820778583,9.5405805807469463E-2,1.0084144542141429,0.28092370439926478,0.83528216773029451,-112.34991681074047,67.650083189259533,null,1000000000,1244625480.5625,null,25.258890325447091,-15.844626708457383,null,25.050154319715084,-102.62437663075859,null,0,0,null,0,0]
[35481,35.481000000000002,{"$f":"SQRT(1+(A397/pole1)^2)","v":26.180596031574467},{"$f":"ATAN(A397/pole1)","v":1.5325908055300448},{"$f":"SQRT(1+(A397/Zero1)^2)","v":1.0002484662999422},{"$f":"ATAN(A397/Zero1)","v":2.228967763768373E-2},{"$f":"IF(VIN_nom>Vout, 1, SQRT(1+(A397/z_RHP)^2))","v":1},{"$f":"IF(VIN_nom>Vout, 0, -ATAN(A397/z_RHP))","v":0},{"$f":"SQRT(1+(A397/Pole2)^2)","v":38532.212546466624},{"$f":"ATAN(A397/Pole2)","v":1.5707703744829471},9.3233669737412779,1.4633322148322927,{"$f":"SQRT(1+(A397/pole4)^2)","v":1.0145284234214322},{"$f":"ATAN(A397/pole4)","v":0.16943837210231727},{"$f":"IF(VOUT_setting=1,1,SQRT(1+(A397*zterm1)^2))","v":1.0210334803822569},{"$f":"IF(VOUT_setting=1,0,ATAN(((A397*zterm1))))","v":0.20332882645943501},15.192163764789266,{"$f":"IF(VOUT_setting=1,0,ATAN(A397*$Q$4/(1+Afbr-$Q$5*(A397)^2)))","v":9.5948209620228653E-2},{"$f":"SQRT((1-(Z397/pterm2))^2+(A397/pterm1)^2)","v":1.0085161297506748},{"$f":"IF((ATAN((A397/pterm1)/(1-A397^2/pterm2))>0),ATAN((A397/pterm1)/(1-A397^2/pterm2)),PI()+ATAN((A397/pterm1)/(1-A397^2/pterm2)))","v":0.28254497255882471},{"$f":"20*LOG10(((E397*K397*G397*O397)/(C397*I397*S397*M397*Q397))*Adc)","v":0.78456931332002255},{"$f":"((F397+L397+H397+P397)-(D397+J397+T397+N397+R397))*radconv","v":-112.43391557008231},{"$f":"IF(V397>0,V397,V397+180)","v":67.566084429917694},null,{"$f":"IF(U397<0,A397,1000000000)","v":1000000000},{"$f":"A397^2","v":1258901361},null,{"$f":"20*LOG10((K397/(I397*M397))*AEA)","v":25.25691665154244},{"$f":"(L397-(J397+N397))*radconv","v":-15.863856733792293},null,{"$f":"20*LOG10((E397*G397/(C397*S397))*Acs*Am)","v":24.999845577543375},{"$f":"(F397+H397-(D397+T397))*radconv","v":-102.72251498971816},null,{"$f":"SUM((U398<0)*(U397>0))*A397","v":0},0,null,0,0]
[35687.75,{"$f":"A398/1000","v":35.687750000000001},26.332930069549544,1.5328119282896626,1.000251370028874,2.2419517587293072E-2,1,0,38756.742152132523,1.5707705248325907,9.3770716087988966,1.4639500461054713,1.0146970029153182,0.17040675047604636,1.0212767602029313,0.20448097547926056,15.192955243507861,9.6503999704068255E-2,1.0086210480837809,0.28420666420969737,0.73289423256217912,-112.52027824205892,67.479721757941078,null,1000000000,1273615500.0625,null,25.254896227125137,-15.883950217597388,null,24.948574100523778,-102.82295302803564,null,0,0,null,{"$f":"SUM((V399<-183)*(V398>-183))*A398","v":0},{"$f":"IF(AK398>0,U398,0)","v":0}]
[35894.5,35.894500000000001,26.485265380269279,1.5330305073961485,1.000254290620358,2.2549356780865192E-2,1,0,38981.271757799303,1.5707706734502258,9.4307797824628441,1.4645608405267456,1.0148665336314509,0.1713748062273352,1.021521395067972,0.20563257419179137,{"$f":"IF(VOUT_setting=1,1,SQRT((1+Afbr-$Q$5*(A399)^2)^2+(A399*$Q$4)^2))","v":15.19375127927063},9.7059732580407329E-2,1.0087267003154941,0.28586860308457523,0.68151375380911117,-112.60692223196796,67.393077768032043,null,1000000000,1288415130.25,null,25.252877772522172,-15.904428299177098,null,24.897586808341114,-102.92325953397379,null,0,0,null,0,0]
[36101.25,36.10125,26.637601941897948,1.5332465864687794,1.0002572280742463,2.2679195214029019E-2,1,0,39205.801363466919,1.5707708203656099,9.4844914346185387,1.4651647171877145,1.0150370150932126,0.17234253770390084,1.0217673840040913,0.20678361993894454,15.194551871361984,9.7615407929880174E-2,1.0088330885667842,0.28753079006312143,0.63042431000635024,-112.69384330725011,67.306156692749894,null,1000000000,1303300251.5625,null,25.250861072429331,-15.92528406212158,null,24.846880364743878,-103.02343705738454,null,0,0,null,0,0]
[36308,36.308,26.789939733096279,1.533460208135635,1.0002601823903905,2.2809032882413632E-2,1,0,39430.330969135379,1.5707709656078224,9.5382065065016217,1.4657617925177286,1.0152084468216349,0.17330994325699664,1.0220147260335541,0.20793411007105028,15.195357019062387,9.8171025433326162E-2,1.0089402149697029,0.28919322601557229,0.57962239682549488,-112.78103733024356,67.218962669756436,null,1000000000,1318270864,null,25.248845917851735,-15.94651074272034,null,24.79645148996071,-103.12348809078823,null,0,0,null,0,0]
[36519.5,36.519500000000001,26.945778675704631,1.5336762383713467,1.0002632220284429,2.2941852724310929E-2,1,0,39660.019054257762,1.5707711124852732,9.5931591396377911,1.4663656665869655,1.0153847998902461,0.17429923561572308,1.0222691497054908,0.20911045459874783,15.196185377766779,9.8739347843228839E-2,1.0090505685787625,0.29089411429785983,0.52794725543960241,-112.87051281031398,67.129487189686017,null,1000000000,1333673880.25,null,25.246785853560851,-15.968601999538528,null,24.745147877448588,-103.22570941528055,null,0,0,null,0,0]
[36731,36.731000000000002,27.101618861385113,1.5338897841755221,1.000266279312142,2.3074671756631613E-2,1,0,39889.707139380997,1.57077125767126,9.6481152312017731,1.4669626614849682,1.0155621463696223,0.17528818342401953,1.0225249872745212,0.21028621210578316,15.197018502275602,9.9307609043591732E-2,1.0091616991955095,0.29259526493749749,0.47656578422490664,-112.96026545733464,67.039734542665357,null,1000000000,1349166361,null,25.244726983494907,-15.991067565636191,null,24.694127966572239,-103.32780347068541,null,0,0,null,0,0]
[36942.5,36.942500000000003,27.257460268816523,1.5341008881418745,1.0002693542413255,2.3207489974697033E-2,1,0,40119.395224505068,1.5707714011948344,9.7030747224302321,1.4675528936761304,1.0157404857394201,0.17627678492845145,1.0227822376796341,0.21146137978314322,15.197856391805784,9.9875808693420387E-2,1.0092736091381971,0.29429667883514582,0.42547442594838292,-113.05029113330654,66.949708866693456,null,1000000000,1364748306.25,null,25.242669103075571,-16.013900669295229,null,24.643388421539981,-103.42977274931495,null,0,0,null,0,0]
[37154,37.154000000000003,27.41330287716233,1.5343095918964309,1.0002724468158313,2.3340307373828716E-2,1,0,40349.083309629954,1.5707715430843863,9.7580375558801116,1.4681364770199616,1.0159198174767492,0.17726503837951965,1.0230408998550282,0.21263595483114903,15.198699045569949,0.10044394645194951,1.0093863007371184,0.29599835688092441,0.37466968578030058,-113.14058579309726,66.859414206902741,null,1000000000,1380419716,null,25.240612013757243,-16.037094688233992,null,24.592925962998361,-103.53161968743298,null,0,0,null,0,0]
[37370.25,37.370249999999999,27.572646717268569,1.5345205435519065,1.000275627089356,2.3476106818029443E-2,1,0,40583.929874208829,1.5707716865000017,9.8142381763704378,1.4687264082878349,1.0161042022602846,0.17827512496342371,1.0233068297989554,0.2138362935743664,15.199565549290295,0.10102477945890261,1.0095023338605915,0.29773852631181685,0.32301671009829108,-113.23318234114394,66.766817658856056,null,1000000000,1396535585.0625,null,25.238509342271826,-16.061176031719548,null,24.541613319416051,-103.63562995610678,null,0,0,null,0,0]
[37586.5,37.586500000000001,27.731991770273826,1.5347290710053589,1.0002788258093354,2.3611905396207861E-2,1,0,40818.776438788525,1.5707718282653633,{"$f":"SQRT(1+(A407/Zero2)^2)","v":9.8704421735054435},{"$f":"ATAN(A407/Zero2)","v":1.4693096214163397},1.0162896233726462,0.17928484399845934,1.0235742333694178,0.21503600688059377,15.20043703196546,0.10160554704360267,1.0096191891098061,0.29947897373692717,0.27165617534911729,-113.32605182412259,66.673948175877413,null,1000000000,1412744982.25,null,25.236407096477677,-16.085621142685998,null,24.490583589561318,-103.73951730575065,null,0,0,null,0,0]
[37802.75,37.802750000000003,27.891338015389973,1.5349352157876843,1.0002820429755923,2.3747703103363712E-2,1,0,41053.623003369037,1.5707719684087922,9.9266494899301545,1.4698862301249709,1.0164760802467059,0.1802941936274495,1.0238431094117857,0.21623509178771394,15.201313492739887,0.102186248842557,1.0097368690144863,0.30121970007316806,0.22058453880361842,-113.41919020285727,66.580809797142734,null,1000000000,1429047907.5625,null,25.234305082432648,-16.110423400700519,null,24.4398334429609,-103.8432841687314,null,0,0,null,0,0]
[38019,38.018999999999998,28.050685432301105,1.5351390184869023,1.0002852785879488,2.3883499934496927E-2,1,0,41288.469567950342,1.5707721069579648,9.9828600695779546,1.4704563455897328,1.0166635723125854,0.1813031719975865,1.0241134567662882,0.21743354534394027,15.202194930753322,0.10276688449252881,1.0098553761174025,0.30296070622569216,0.16979831970140555,-113.51259352884301,66.487406471156987,null,1000000000,1445444361,null,25.232203111951691,-16.135576331274933,null,24.389359605425149,-103.94693292271916,null,0,0,null,0,0]
[38240.5,38.240499999999997,28.213902593281041,1.5353453823895413,1.000288611875829,2.4022592653903271E-2,1,0,41529.017609822877,1.5707722472462424,10.040438624876678,1.4710336839815963,1.0168566888051269,0.18233625897651143,1.0243918915748116,0.21866043670206092,15.203102926893788,0.1033615475426021,1.0099776205079227,0.30474427060173925,0.11807146160516561,-113.6085350898162,66.391464910183799,null,1000000000,1462335840.25,null,25.230049965315835,-16.161696839788682,null,24.337943480081151,-104.05297798895978,null,0,{"$f":"IF(AH410>0,W410,0)","v":0},null,0,0]
[38462,38.462000000000003,28.37712094195831,1.5355493723900919,1.0002919645159483,2.4161684443617132E-2,1,0,41769.565651696226,1.5707723859186991,10.098020488684684,1.4716044382574429,1.0170508901441802,0.1833689525305304,1.0246718675225774,0.21988665944645619,15.204016143034201,0.10395614042224777,1.0101007381908254,0.30652813042969534,6.663684830740306E-2,-113.70474651380236,66.295253486197637,null,1000000000,1479325444,null,25.227896482420363,-16.188171956196033,null,24.286810464772756,-104.15890402204454,null,0,0,null,0,0]
[38683.5,38.683500000000002,28.54034045795607,1.5357510291997962,1.0002953365081122,2.4300775298266009E-2,1,0,42010.113693570354,1.5707725230030909,10.15560560472464,1.4721687200435378,1.0172461757084239,0.18440125068295737,1.0249533833466546,0.22111221043900653,15.20493457823485,0.10455066274196972,1.0102247319409905,0.30831228664348093,1.5490932094506051E-2,-113.80122383730661,66.198776162693392,null,1000000000,1496413172.25,null,25.225742478596231,-16.214995173117643,null,24.235957216444447,-104.26471340837328,null,38683.5,66.198776162693392,null,0,0]
[38905,38.905000000000001,28.703561121360824,1.53595039260466,1.0002987278521249,2.4439865212477603E-2,1,0,42250.661735445268,1.5707726585265425,10.213193917985302,1.4727266384651749,1.0174425448735473,0.18543315146199058,1.0252364377785566,0.2223370865531013,15.205858231550881,0.10514511411255938,1.0103496045475304,0.31009674016380423,-3.5369772763116467E-2,-113.89796318596062,66.10203681403938,null,38905,1513599025,null,25.223587774707777,-16.24216012671295,null,24.18538044856836,-104.37040848057674,null,0,0,null,0,0]
[39131.5,39.131500000000003,28.870467390394559,1.5361519251791074,1.0003022157620072,2.458209387575503E-2,1,0,42496.639755692879,1.5707727955226398,10.272085443437335,1.4732906816824043,1.0176444666653441,0.18648793273334149,1.0255274714707561,0.22358891109355411,15.206808129969543,0.105752910475218,1.0104782077080474,0.31192178319643393,-8.7087201865036712E-2,-113.99715328526277,66.002846714737231,null,39131.5,1531274292.25,null,25.221383526921912,-16.270285195390898,null,24.133944539127693,-104.4783736077182,null,0,0,null,0,0]
[39358,39.357999999999997,29.037374818533241,1.5363511409347961,1.0003057239068542,2.4724321544297056E-2,1,0,42742.617775941268,1.5707729309419487,10.330980199640395,1.4738482940906601,1.0178475202013146,0.18754229433422029,1.0258201113174887,0.22484002336756476,15.207763482728618,0.1063606318272534,1.0106077357943983,0.31374713901416429,-0.13851357781586687,-114.09660945348051,65.903390546519489,null,39358,1549052164,null,25.2191781851778,-16.298754586592114,null,24.082790957927894,-104.58622396918307,null,0,0,null,0,0]
[39584.5,39.584499999999998,29.20428338590342,1.5365480795790836,1.0003092522864532,2.4866548212360003E-2,1,0,42988.595796190435,1.5707730648115363,10.389878131654187,1.4743995847047222,1.0180517048042694,0.18859623417222285,1.0261143559445667,0.22609042006952715,15.208724288801156,0.10696827775344263,1.0107381918348219,0.31557280855817305,-0.18965243606930679,-114.19632782111736,65.803672178882636,null,39584.5,1566932640.25,null,25.21697157470966,-16.327561935894732,null,24.031916365982788,-104.69396189428994,null,0,0,null,0,0]
[39811,39.811,29.371193073083266,1.5367427799174511,1.0003128009005902,2.5008773874200457E-2,1,0,43234.573816440359,1.5707731971578536,10.448779185774256,1.4749446600968226,1.0182570197937917,0.18964975016036686,1.0264102039718452,0.22734009790656579,15.209690547154608,0.10757584783888371,1.0108695788729711,0.31739879275489641,-0.24050725048407146,-114.29630460567037,65.703695394329628,null,39811,1584915721,null,25.214763526034908,-16.356701019099855,null,23.981317480699573,-104.80158965983908,null,0,0,null,0,0]
[40042.75,40.042749999999998,29.541972667093706,1.5369397160045948,1.0003164527106398,2.5154295109874159E-2,1,0,43486.253313981622,1.5707733310221206,10.509048672855249,1.4754960453705328,1.0184682630186934,0.19072724452196627,1.0267145675362546,0.2286179943133177,15.210684844453617,0.10819742174426278,1.0110049781137513,0.31926742771654215,-0.29225038329882225,-114.39886234736291,65.601137652637092,null,40042.75,1603421827.5625,null,25.212502637408644,-16.386852519291363,null,23.929827774087649,-104.91160041071119,null,0,0,null,0,0]
[40274.5,40.274500000000003,29.712753393683911,1.5371343882303914,1.0003201257036662,2.5299815279974578E-2,1,0,43737.932811523657,1.5707734633458077,10.569321318518801,1.4760411421455326,1.0186806881880361,0.1918042907544435,1.0270206067499292,0.22989513121053698,15.211684847512634,0.10881891537460169,1.0111413585071518,0.32113639400116728,-0.34370331863524034,-114.50168288134556,65.498317118654441,null,40274.5,1622035350.25,null,25.210239900346117,-16.417338559742728,null,23.87861992598873,-105.02150049634382,null,0,0,null,0,0]
[40506.25,40.506250000000001,29.883535233436223,1.5373268353932783,1.0003238198794357,2.5445334378350375E-2,1,0,43989.612309066448,1.5707735941553576,10.629597069034903,1.4765800570730025,1.0188942945625636,0.19288088664006045,1.0273283201153505,0.23117150511264073,15.212690555207461,0.10944032828652764,1.0112787233632694,0.32300569255272615,-0.39486958664720134,-114.60476242313342,65.395237576866577,null,40506.25,1640756289.0625,null,25.207975149356635,-16.448152904239439,null,23.827690595334129,-105.13129219416072,null,0,0,null,0,0]
[40738,40.738,30.054318167374205,1.5375170954104755,1.0003275352377134,2.5590852398850495E-2,1,0,44241.291806609988,1.5707737234766106,10.689875871882649,1.4771128944131044,1.0191090813995298,0.1939570299671089,1.0276377061286068,0.23244711254815356,15.213701966407777,0.1100616600370268,1.0114170760089254,0.32487532429868926,-0.44575265612511378,-114.70809727332552,65.291902726674479,null,40738,1659584644,null,25.205708224006283,-16.47928945387325,null,23.777036497448421,-105.24097773015116,null,0,0,null,0,0]
[40975.25,40.975250000000003,30.229155316308358,1.5377096438358531,1.0003313607129185,2.5739822798483171E-2,1,0,44498.94428036351,1.5707738543516454,10.751588347879576,1.477652188060731,1.0193301876974084,0.19505824173439412,1.0279561657223442,0.23375219572200626,15.214743287856949,0.11069765298917694,1.0115597388273514,0.32678967312507506,-0.49755350550153699,-114.81414520812758,65.185854791872416,null,40975.25,1678971112.5625,null,25.20338508416852,-16.51149248918556,null,23.725461989332484,-105.35315867550176,null,0,0,null,0,0]
[41212.5,41.212499999999999,30.403993573095693,1.5378999777676174,1.0003352083874872,2.5888792055426692E-2,1,0,44756.596754117796,1.5707739837198507,10.813303915150794,1.4781853259610909,1.0195525295667169,0.19615897453613024,1.0282763750880617,0.23505646829998642,15.215790584323631,0.11133355994342503,1.0117034439864958,0.32870437306240136,-0.54906472104003856,-114.92045313014265,65.079546869857353,null,41212.5,1698470156.25,null,25.201059340789726,-16.544020693796888,null,23.674169141958448,-105.46523292236074,null,0,0,null,0,0]
[41449.75,41.449750000000002,30.578832918733347,1.5380881351770179,1.0003390782611632,2.6037760163082471E-2,1,0,45014.24922787281,1.5707741116071008,10.875022521067514,1.4787124126149431,1.0197761061992803,0.19725922601915627,1.028598332591613,0.2363599266037392,15.216843854575227,0.11196938042564239,1.0118481951098823,0.33061942505152603,-0.60028983384653911,-115.02701733204081,64.972982667959187,null,41449.75,1718081775.0625,null,25.198730837134342,-16.576867946911104,null,23.623154606640547,-105.5772027006057,null,0,0,null,0,0]
[41687,41.686999999999998,30.753673334650479,1.5382741531724335,1.0003429703336888,2.6186727114852239E-2,1,0,45271.901701628558,1.5707742380386815,10.936744114186377,1.4792335501776666,1.0200009167831456,0.19835899383702998,1.0289220365919816,0.23766256697056873,15.217903097372464,0.11260511396210271,1.0119939958392083,0.3325348300148393,-0.65123231375523771,-115.13383418985269,64.866165810147308,null,41687,1737805969,null,25.196399421317576,-16.610028262463658,null,23.572415091205801,-105.68907018961725,null,0,0,null,0,0]
[41929.75,41.929749999999999,30.932568041898683,1.5384623069346208,1.0003469756098713,2.6339146259491502E-2,1,0,45535.527151594346,1.5707743659203304,10.999899595049143,1.4797607155065644,1.0202322153335366,0.1994837537450769,1.0292550507736928,0.2389945551304021,15.218993076387868,0.11325549477610135,1.0121442667682066,0.33449500475096872,-0.70306677682044361,-115.24338512235676,64.756614877643244,null,41929.75,1758103935.0625,null,25.194010790214051,-16.64427523682668,null,23.520780598490273,-105.80342737200432,null,0,0,null,0,0]
[42172.5,42.172499999999999,31.111463831623066,1.5386482968761266,1.0003510041255239,2.6491564180056736E-2,1,0,45799.152601560869,1.5707744923297751,11.063058097917807,1.480281861852442,1.020464803978204,0.20060800235480492,1.029589889868785,0.24032567928293358,15.220089305427035,0.11390578356432325,1.0122956443031914,0.33645555091058199,-0.75461251002293417,-115.35319314222113,64.64680685777887,null,42172.5,1778519756.25,null,25.191618803523919,-16.678837693927257,null,23.469427227283362,-105.91768192773092,null,0,0,null,0,0]
[42415.25,42.41525,31.290360685257173,1.5388321600977064,1.0003550558803656,2.6643980869481051E-2,1,0,46062.778051528119,1.5707746172922921,11.12621957132869,1.4807970914357134,1.0206986818352188,0.20173173717476706,1.0299265520973668,0.24165593555594878,15.221191783140792,0.11455597982064747,1.0124481324037817,0.33841646942108755,-0.80587304022319517,-115.46325462346758,64.536745376532423,null,42415.25,1799053432.5625,null,25.189223313292054,-16.713709635665921,null,23.418351626583846,-106.03183603605525,null,0,0,null,0,0]
[42658,42.658000000000001,31.469258584656604,1.5390139328570496,1.0003591308741142,2.6796396320697923E-2,1,0,46326.403501496075,1.5707747408325836,11.189383964977738,1.4813065041813727,1.0209338480185741,0.20285495572098336,1.0302650356721896,0.24298532009456719,15.222300508172664,0.11520608303940313,1.0126017350492855,0.34037776118925223,-0.85685183322653413,-115.57356602157638,64.426433978423617,null,42658,1819704964,null,25.186824176206834,-16.748885195855983,null,23.367550501899164,-106.14589182674867,null,0,0,null,0,0]
[42906.5,42.906500000000001,31.652395089115842,1.5391978829221138,1.0003633264627336,2.6952420734695455E-2,1,0,46596.273426592736,1.5707748658512086,11.254047502091485,1.4818220601798997,1.0211759180979045,0.20400424250847149,1.0306134215773746,0.24434528670112102,15.223441965102943,0.11587148830477925,1.0127601347012305,0.34238589746922982,-0.90874988604807905,-115.68674560631389,64.313254393686108,null,42906.5,1840967742.25,null,25.184364288599419,-16.785202458492016,null,23.315826978835585,-106.26254958235805,null,0,0,null,0,0]
[43155,43.155000000000001,31.835532652294471,1.5393797166054592,1.000367546403611,2.7108443836147338E-2,1,0,46866.143351690109,1.5707749894300409,11.318713996329468,1.4823317253255188,1.0214193363674127,0.20515298303100216,1.030963712321231,0.24570433166757699,15.224589965915927,0.11653679500192107,1.0129197108255426,0.34439442675521603,-0.96035985664829915,-115.8001798224831,64.199820177516898,null,43155,1862354025,null,25.181900289656902,-16.821825860967163,null,23.264384278106501,-106.37910867101596,null,0,0,null,0,0]
[43403.5,43.403500000000001,32.018671256025776,1.539559470210442,1.0003717906964378,2.7264465617474028E-2,1,0,47136.013276788195,1.5707751115938102,11.383383397295368,1.4828355997495948,1.0216641018634525,0.20630117464835024,1.0313159059627992,0.24706245091529866,15.225744509132733,0.11720200258984666,1.0130804677547807,0.34640334995207911,-1.0116852734014667,-115.91386511812372,64.086134881876276,null,43403.5,1883863812.25,null,25.179432039775325,-16.858749516319957,null,23.213219041289797,-106.49557122503086,null,0,0,null,0,0]
[43652,43.652000000000001,32.201810882556224,1.5397371792150993,1.0003760593409043,2.7420486071096362E-2,1,0,47405.883201886973,1.5707752323666837,11.448055655729378,1.4833337813327621,1.0219102136179707,0.20744881472860216,1.0316700005532342,0.2484196403848635,15.226905593266507,0.11786711052807809,1.0132424098428627,0.34841266794157744,-1.0627296037161211,-116.02779802099339,63.972201979006613,null,43652,1905497104,null,25.176959403804918,-16.895967666990273,null,23.162327966577333,-106.61193932809985,null,0,0,null,0,0]
[43906,43.905999999999999,32.389004940166515,1.5399167445324544,1.0003804476281462,2.7579958313714063E-2,1,0,47681.726103195891,1.5707753543997718,11.514162195023747,1.4838372054449303,1.0221631627844479,0.20862128257948331,1.0320338947346341,0.2498059031733996,15.228099133555409,0.11854683562060858,1.0134091655127291,0.35046686664759785,-1.1146167481816982,-116.14450493211362,63.85549506788638,null,43906,1927736836,null,25.1744273725147,-16.934308041552892,null,23.11059048177637,-106.73078749275176,null,0,0,null,0,0]
[44160,44.16,32.576200030115956,1.5400942461558629,1.0003848613562356,2.773942915319464E-2,1,0,47957.569004505502,1.570775475029037,11.580271619102771,1.4843348817895425,1.0224175164026597,0.20979316867538816,1.0323997708005386,0.2511911860566568,15.229299504336348,0.11922645546336777,1.0135771686499724,0.35252147960387331,-1.1662173626442693,-116.26146344181963,63.738536558180371,null,44160,1950105600,null,25.171890486921424,-16.972944326400459,null,23.059132629309058,-106.84954123163531,null,0,0,null,0,0]
[44414,44.414000000000001,32.763396134709602,1.5402697194472499,1.0003893005248361,2.789889858144573E-2,1,0,48233.41190581581,1.5707755942785648,11.646383878840957,1.4848269080018643,1.0226732734246842,0.21096447023285275,1.0327676266445951,0.25257548476217734,15.230506703995758,0.11990596948084026,1.013746423972786,0.35457650767644078,-1.2175349615525852,-116.37867008591422,63.621329914085777,null,44414,1972603396,null,25.169348616188849,-17.011870769343563,null,23.007951058405347,-106.96820262092352,null,0,0,null,0,0]
[44668,44.667999999999999,32.950593236654534,1.5404431989654621,1.0003937651336092,2.8058366590375403E-2,1,0,48509.254807126803,1.5707757121718924,11.712498926219906,1.485313379523709,1.0229304327978679,0.21213518447760496,1.033137460152062,0.2539587950386597,15.231720730911409,0.12058537709807199,1.0139169362223741,0.35663195170562856,-1.2685729988386094,-116.49612147770493,63.503878522295068,null,44668,1995230224,null,25.16680163372812,-17.051081744363607,null,22.957042474671674,-107.08677368930334,null,0,0,null,0,0]
[44928.25,44.928249999999998,33.14239758329397,1.540618914524635,1.0003983659863824,2.8221757036248726E-2,1,0,48791.885181403806,1.5707758315835239,11.780243662530394,1.4858061574788546,1.0231953733415053,0.21333409360804653,1.0335184429298623,0.255375113827705,15.232971710144453,0.12128139146214753,1.0140929528292573,0.35873840489245834,-1.3205804782864448,-116.61671330655821,63.383286693441789,null,44928.25,2018547648.0625,null,25.164186549452118,-17.091546922319431,null,22.90516097767064,-107.20817074376336,null,0,0,null,0,0]
[45188.5,45.188499999999998,33.334202941460525,1.5407926079507277,1.0004029935459822,2.8385145974895026E-2,1,0,49074.515555681501,1.5707759496197224,11.847991226725586,1.4862933000800558,1.0234617838462068,0.21453238030007529,1.033901497372864,0.25679038597836473,15.234229853278611,0.12197729290510018,1.0142702991315851,0.36084529646088453,-1.3723016213982282,-116.7375551176487,63.262444882351303,null,45188.5,2042000532.25,null,25.161565842800474,-17.132299240372095,null,22.853559241391132,-107.32947714230522,null,0,0,null,0,0]
[45448.75,45.448749999999997,33.526009293793074,1.5409643139397722,1.0004076478120381,2.8548533397611639E-2,1,0,49357.145929959872,1.5707760663041161,11.915741570571228,1.4867749032183437,1.0237296631643658,0.21573004159976303,1.0342866211793047,0.25820460698712044,15.235495158540699,0.12267308081033255,1.0144489803038856,0.36295262723003047,-1.4237399548576144,-116.85864350700234,63.141356492997659,null,45448.75,2065588876.5625,null,25.158939390579462,-17.173333036476375,null,22.802233898127792,-107.45069492029603,null,0,0,null,0,0]
[45709,45.709000000000003,33.717816623325454,1.5411340663987876,1.0004123287841773,2.8711919295696376E-2,1,0,49639.776304238905,1.5707761816597949,11.983494646921907,1.4872510606265423,1.0239990101432519,0.21692707456344051,1.0346738120384245,0.25961777237395928,15.236767624148015,0.1233687545618784,1.0146290015456971,0.36506039799015105,-1.4748989446871223,-116.97997514668675,63.020024853313245,null,45709,2089312681,null,25.156307073685433,-17.214642772800214,null,22.751181636859204,-107.57182606624177,null,0,0,null,0,0]
[45975.25,45.975250000000003,33.91404701781903,1.541305745406951,1.0004171453113258,2.8879070428802767E-2,1,0,49928.922652565394,1.5707762983234828,12.052812533524943,1.4877326557693917,1.0242760844489538,0.21815105153781059,1.0350720661540325,0.26106242088745041,15.238076834137443,0.12408034812798918,1.0148145653494667,0.36721721900622634,-1.5269518665701134,-117.10435239178021,62.89564760821979,null,45975.25,2113723612.5625,null,25.153607880271458,-17.257184802919085,null,22.69923158190316,-107.69566223590044,null,0,0,null,0,0]
[46241.5,46.241500000000002,34.110278400383692,1.5414754491322247,1.0004219897893607,2.9046219947742338E-2,1,0,50218.069000892552,1.570776413643715,12.122133183612743,1.4882087429995707,1.0245546924114726,0.21937436466998092,1.0354724788103911,0.26250595513321323,15.239393534632896,0.12479182091394883,1.0150015428142898,0.36937450211511824,-1.5787195666068032,-117.22897742041862,62.771022579581384,null,46241.5,2138276322.25,null,25.150902308988851,-17.300004300857566,null,22.647560511136167,-107.81941179863915,null,0,0,null,0,0]
[46507.75,46.507750000000001,34.30651075406432,1.5416432114604506,1.0004268622178762,2.921336784319864E-2,1,0,50507.21534922038,1.5707765276435643,12.191456550045761,1.488679416057092,1.0248348327800048,0.22059701084149597,1.035875047504379,0.26394837039084623,15.240717723694718,0.12550317226226917,1.0151899395883468,0.3715322480683324,-1.6302055681217944,-117.35384690223779,62.646153097762209,null,46507.75,2162970810.0625,null,25.148190244730095,-17.343095718356189,null,22.596165055137231,-107.94307673956556,null,0,0,null,0,0]
[46774,46.774000000000001,34.502744062291406,1.541809065507014,1.0004317625964636,2.9380514105855772E-2,1,0,50796.361697548855,1.5707766403455792,12.260782586748753,1.489144766571556,1.025116504298238,0.22181898694527571,1.0362797697232966,0.2653896619658882,15.242049399372899,0.12621440151616717,1.0153797613468094,0.37369045758516384,-1.6814133339974879,-117.47895758097789,62.521042419022109,null,46774,2187807076,null,25.145471576302736,-17.386453628694923,null,22.545041901130304,-108.0666589977978,null,0,0,null,0,0]
[47046.25,47.046250000000001,34.703400499762381,1.5419767175541681,1.0004368023076504,2.9551425346742526E-2,1,0,51092.024019924822,1.5707767542682793,12.331673614627206,1.4896151933595667,1.0254061053247026,0.22306780442558569,1.0366958366821273,0.26686226653594181,15.243418824187492,0.12694153153549134,1.015575340234123,0.37589778287597603,-1.7334909121331767,-117.6071337495346,62.392866250465403,null,47046.25,2213349639.0625,null,25.142684701145637,-17.431058657516807,null,22.493044858422479,-108.19294268307262,null,0,0,null,0,0]
[47318.5,47.3185,34.904057901434136,1.5421424420005978,1.0004418712419536,2.9722334860711193E-2,1,0,51387.686342301444,1.5707768668800564,12.402567340324278,1.4900802422811066,1.0256973046137439,0.22431591476358376,1.0371141499758056,0.26833368636364074,15.244796072688578,0.12766853250890103,1.0157724211414585,0.3781055942762388,-1.7852847087634633,-117.73555545029218,62.264444549707818,null,47318.5,2239040442.25,null,25.139890697649996,-17.475931224010228,null,22.441325698953499,-108.31914387592629,null,0,0,null,0,0]
[47590.75,47.59075,35.10471625077264,1.5423062718915836,1.0004469693989295,2.9893242637803547E-2,1,0,51683.348664678706,1.5707769782034082,12.473463717840291,1.4905400048330584,1.025990100804492,0.22556331467447999,1.0375347068872993,0.26980391651437341,15.246181142757827,0.1283954037365119,1.0159710102232296,0.38031389244955166,-1.8367982392015505,-117.86421942852903,62.135780571470974,null,47590.75,2264879485.5625,null,25.137089458809143,-17.521065898874369,null,22.389881056393723,-108.4452645083059,null,0,0,null,0,0]
[47863,47.863,35.305375531619681,1.5424682395215625,1.0004520967781307,3.0064148668061962E-2,1,0,51979.010987056608,1.5707770882603214,12.544362702213773,1.4909945704528502,1.026284492530172,0.2268100008860662,1.0379575046894187,0.27127295208207691,15.247574032265652,0.12912214451922538,1.0161711136628904,0.38252267802366147,-1.888034958649212,-117.99312250154792,62.006877498452084,null,47863,2290866769,null,25.134280881357213,-17.566457371498092,null,22.338707620906376,-108.57130646708418,null,0,0,null,0,0]
[48141.75,48.141750000000002,35.510826524472201,1.542632177623021,1.0004573768507103,3.0239133279120985E-2,1,0,52281.732281319295,1.5707771996551401,12.616957063041028,1.4914546956500749,1.0265875645885838,0.22808570900779937,1.0383927157604695,0.27277581824429858,15.249008276636708,0.12986610043861946,1.0163775701058726,0.38478470421947308,-1.9402117041718725,-118.12534762541557,61.874652374584429,null,48141.75,2317628093.0625,null,25.131397541233042,-17.613193213421738,null,22.28659001218729,-108.70027810302113,null,0,0,null,0,0]
[48420.5,48.420499999999997,35.716278460723309,1.5427942296756081,1.0004626875565847,3.0414116037813806E-2,1,0,52584.453575582615,1.5707773097673901,12.689554064506705,1.4919095561856335,1.0268923063598894,0.22936066204211542,1.0388302701840653,0.27427742178378645,15.250450713729196,0.13060991812927084,1.0165856272928984,0.38704724258343792,-1.9921054068375641,-118.25781686696585,61.742183133034146,null,48420.5,2344544820.25,null,25.128506300286752,-17.66018736143177,null,22.234749868937946,-108.82917112752405,null,0,0,null,0,0]
[48699.25,48.699249999999999,35.921731324185892,1.5429544280322756,1.0004680288952661,3.0589096933454425E-2,1,0,52887.174869846574,1.5707774186190955,12.762153661547305,1.4923592417163469,1.0271987163580143,0.23063485651802176,1.0392701650004048,0.27577775752793304,15.251901341220735,0.13135359684338851,1.0167952919548016,0.38931029367148273,-2.0437195884441746,-118.39052703130534,61.609472968694661,null,48699.25,2371616950.5625,null,25.125607059076497,-17.707434480959414,null,22.183183814376854,-108.95798742674505,null,0,0,null,0,0]
[48978,48.978000000000002,36.127185099040979,1.543112804310401,1.0004734008662641,3.0764075955357535E-2,1,0,53189.896164111153,1.5707775262317789,12.834755810117342,1.4928038398788759,1.0275067930905262,0.2319082889785076,1.0397123972388784,0.27727682033569218,15.253360156776663,0.13209713583406188,1.017006570853789,0.39157385799943506,-2.0950577106858499,-118.5234749938591,61.476525006140903,null,48978,2398844484,null,25.122699721754138,-17.754929353954882,null,22.131888528359568,-109.08672884239338,null,0,0,null,0,0]
[49263.25,49.263249999999999,36.337430651641526,1.5432730195981474,1.0004789298145276,3.0943133254641122E-2,1,0,53499.676430260552,1.5707776350930625,12.909053520141917,1.4932536280282998,1.0278237775972727,0.23321062336018517,1.0401673583237452,0.27880951573094936,15.254861463796841,0.13285786752672593,1.0172244546614393,0.39389073682056219,-2.1473107147296866,-118.6597660805142,61.340233919485797,null,49263.25,2426867800.5625,null,25.119716112171574,-17.803782892250723,null,22.079674026255304,-109.21839665289906,null,0,0,null,0,0]
[49548.5,49.548499999999997,36.547677126253845,1.5434313915607636,1.0004844908393073,3.1122188569145667E-2,1,0,53809.456696410576,1.5707777427009204,12.983353811898581,1.4936982682301574,1.0281425042934205,0.23451215249451565,1.0406247607831884,0.28034086734067554,15.2563713402125,0.13361845132402406,1.0174440432943519,0.39620815406010262,-2.1992817825800528,-118.79629978127898,61.203700218721025,null,49548.5,2455053852.25,null,25.116723832436968,-17.852885177125103,null,22.027736209191712,-109.34998981147656,null,0,0,null,0,0]
[49833.75,49.833750000000002,36.757924507056906,1.5435879518204998,1.0004900839400688,3.1301241887423059E-2,1,0,54119.236962561219,1.5707778490768765,13.057656641315852,1.4941378481882142,1.0284629715592253,0.23581287272268592,1.0410846013993411,0.28187086975865022,15.257889783481925,0.13437888642845863,1.0176653441000141,0.39852611013926942,-2.2509744373177996,-118.93307296336796,61.066927036632038,null,49833.75,2483402639.0625,null,25.11372279076976,-17.902230975121061,null,21.976071695243135,-109.48151015473705,null,0,0,null,0,0]
[50119,50.119,36.968172778589491,1.5437427312805876,1.0004957091162741,3.1480293198025935E-2,1,0,54429.017228712466,1.5707779542419649,13.131961965318204,1.4945724536291227,1.0287851777681216,0.23711278040137768,1.0415468769428811,0.28339951761344145,15.259416791049993,0.13513917204351622,1.0178883644596901,0.4008446054345432,-2.3023921420530655,-119.07008256243907,60.929917437560931,null,50119,2511914161,null,25.110712898834805,-17.951815166921648,null,21.924677159140245,-109.61295947553188,null,0,0,null,0,0]
[50410.75,50.41075,37.183212889223988,1.5438992270520717,1.0005014956530958,3.1663422467272134E-2,1,0,54745.856466748592,1.5707780605723074,13.207963023503762,1.4950119039348386,1.0291165232293258,0.23844146479898376,1.0420222017814806,0.28496159203442389,15.260987451160974,0.1359166268418896,1.0181182532952053,0.4032164904812825,-2.3547006323817543,-119.21045563809808,60.789544361901918,null,50410.75,2541243715.5625,null,25.107625176753583,-18.002770619724181,null,21.872387362303634,-109.74733249133835,null,0,0,null,0,0]
[50702.5,50.702500000000001,37.398253900037318,1.5440539231171413,1.000507315742676,3.184654961208306E-2,1,0,55062.695704785314,1.5707781656789677,13.283966603179385,1.4954463257358315,1.0294496843237255,0.23976929153445728,1.0425000669117521,0.28652223820141831,15.262567064877897,0.13669392357815632,1.0183499566710634,0.40558894025097614,-2.4067286412915641,-119.3510697543381,60.648930245661901,null,50702.5,2570743506.25,null,25.104528020097312,-18.053964974092626,null,21.820373127081126,-109.88163486952585,null,0,0,null,0,0]
[50994.25,50.994250000000001,37.613295795590084,1.5442068503360518,1.0005131693844296,3.2029674620213347E-2,1,0,55379.534942822647,1.5707782695829484,13.359972661311543,1.4958758046895311,1.0297846592891129,0.24109625676025884,1.0429804688420188,0.28808145048055755,15.264155629423575,0.13747106140332765,1.0185834825932985,0.40796195499998827,-2.4584796883414515,-119.49192184181138,60.508078158188624,null,50994.25,2600413533.0625,null,25.101421344814831,-18.105393102973327,null,21.768631071344441,-110.01586839364701,null,0,0,null,0,0]
[51286,51.286000000000001,{"$f":"SQRT(1+(A461/pole1)^2)","v":37.828338560793917},{"$f":"ATAN(A461/pole1)","v":1.5443580388676694},{"$f":"SQRT(1+(A461/Zero1)^2)","v":1.0005190565777677},{"$f":"ATAN(A461/Zero1)","v":3.2212797479418506E-2},{"$f":"IF(VIN_nom>Vout, 1, SQRT(1+(A461/z_RHP)^2))","v":1},{"$f":"IF(VIN_nom>Vout, 0, -ATAN(A461/z_RHP))","v":0},{"$f":"SQRT(1+(A461/Pole2)^2)","v":55696.37418086057},{"$f":"ATAN(A461/Pole2)","v":1.5707783723047748},13.435981155839062,1.4963004245224705,{"$f":"SQRT(1+(A461/pole4)^2)","v":1.0301214463559838},{"$f":"ATAN(A461/pole4)","v":0.24242235664597581},{"$f":"IF(VOUT_setting=1,1,SQRT(1+(A461*zterm1)^2))","v":1.0434634040685153},{"$f":"IF(VOUT_setting=1,0,ATAN(((A461*zterm1))))","v":0.28963922327620983},15.26575314200624,{"$f":"IF(VOUT_setting=1,0,ATAN(A461*$Q$4/(1+Afbr-$Q$5*(A461)^2)))","v":0.13824803946951239},{"$f":"SQRT((1-(Z461/pterm2))^2+(A461/pterm1)^2)","v":1.0188188391041855},{"$f":"IF((ATAN((A461/pterm1)/(1-A461^2/pterm2))>0),ATAN((A461/pterm1)/(1-A461^2/pterm2)),PI()+ATAN((A461/pterm1)/(1-A461^2/pterm2)))","v":0.4103355349349101},{"$f":"20*LOG10(((E461*K461*G461*O461)/(C461*I461*S461*M461*Q461))*Adc)","v":-2.509957233368187},{"$f":"((F461+L461+H461+P461)-(D461+J461+T461+N461+R461))*radconv","v":-119.63300889759014},{"$f":"IF(V461>0,V461,V461+180)","v":60.366991102409855},null,{"$f":"IF(U461<0,A461,1000000000)","v":51286},{"$f":"A461^2","v":2630253796},null,{"$f":"20*LOG10((K461/(I461*M461))*AEA)","v":25.098305070152122},{"$f":"(L461-(J461+N461))*radconv","v":-18.157049990898855},null,{"$f":"20*LOG10((E461*G461/(C461*S461))*Acs*Am)","v":21.71715786952457},{"$f":"(F461+H461-(D461+T461))*radconv","v":-110.15003480421593},null,{"$f":"SUM((U462<0)*(U461>0))*A461","v":0},0,null,0,0]
[51584.75,{"$f":"A462/1000","v":51.58475},38.04854176400233,1.5445110839117866,1.000525119791523,3.2400311792231504E-2,1,0,56020.815388620656,1.5707784762871324,13.513815815022179,1.4967302824085891,1.0304681899878285,0.24377937312271017,1.0439605479553593,0.2912328744309276,15.267398253658044,0.13904349324378715,1.0190617479944204,0.41276665036969412,-2.5623900153112351,-119.77772149887261,60.222278501127391,null,51584.75,2660986432.5625,null,25.095103997635508,-18.210178222891386,null,21.664724855306964,-110.28735251467589,null,0,0,null,{"$f":"SUM((V463<-183)*(V462>-183))*A462","v":0},{"$f":"IF(AK462>0,U462,0)","v":0}]
[51883.5,51.883499999999998,38.26874584815738,1.5446623676712903,1.0005312181849328,3.2587823825779856E-2,1,0,56345.256596381339,1.5707785790720099,13.591652942658708,1.4971552169237576,1.0308168299417135,0.24513547416273967,1.0444603406859312,0.29282500444551907,{"$f":"IF(VOUT_setting=1,1,SQRT((1+Afbr-$Q$5*(A463)^2)^2+(A463*$Q$4)^2))","v":15.2690527419094},0.13983877770495007,1.0193065935539054,0.41519835871456712,-2.6145431702294619,-119.92267431090724,60.07732568909276,null,51883.5,2691897572.25,null,25.091892698322557,-18.263536023990422,null,21.612566869530735,-110.42460341279889,null,0,0,null,0,0]
[52182.25,52.182250000000003,38.488950798138774,1.5448119203694499,1.0005373517573539,3.2775333566919217E-2,1,0,56669.697804142612,1.5707786806799746,13.669492496580883,1.4975753120201158,1.0311673642941872,0.24649065570937023,1.0449627784595032,0.29441560743671169,15.270716603715377,0.14063389194621492,1.0195533845347067,0.41763066002777188,-2.666420227283584,-120.06786431322539,59.932135686774615,null,52182.25,2722987215.0625,null,25.088671095559668,-18.317118352839671,null,21.560680517569978,-110.56178923434088,null,0,0,null,0,0]
[52481,52.481000000000002,38.709156599170214,1.5449597715421208,1.0005435205081392,3.2962841002506231E-2,1,0,56994.139011904466,1.5707787811311251,13.747334435574679,1.4979906497552666,1.0315197911139675,0.2478449137249164,1.04546785746256,0.29600467756342014,15.272389836015114,0.14142883506202489,1.0198021297279016,0.42006355431193676,-2.71802465587181,-120.21328855005042,59.786711449949578,null,52481,2754255361,null,25.085439115864055,-18.370920277694012,null,21.509062461527819,-110.69891167248535,null,0,0,null,0,0]
[52786.5,52.786499999999997,38.934338626461191,1.5451092337332613,1.0005498650154601,3.3154582609795265E-2,1,0,57325.910690469893,1.5707788826760329,13.82693757095406,1.4984105354514183,1.0318821357833952,0.24922881078527617,1.0459870757238852,0.29762806011845555,15.274110560820557,0.14224156132466112,1.0200585252475913,0.42255203091871385,-2.7705166582232255,-120.36223774157661,59.637762258423393,null,52786.5,2786414582.25,null,25.082123307739799,-18.426159878423558,null,21.456552177277473,-110.83906844752528,null,0,0,null,0,0]
[53092,53.091999999999999,39.15952151350146,1.5452569769930968,1.0005562463073734,3.3346321778375598E-2,1,0,57657.682369035902,1.5707789830523291,13.906543116169537,1.4988256140973213,1.0322464552940191,0.25061173363152373,1.0465090478095966,0.29924982754007962,15.27584107781527,0.14305410673030319,1.0203169830020655,0.42504112742113032,-2.8227307258290106,-120.51142581908864,59.488574180911357,null,53092,2818760464,null,25.078796502756919,-18.481619017531017,null,21.404315566085124,-110.97916239218767,null,0,0,null,0,0]
[53397.5,53.397500000000001,39.384705245544126,1.5454030307993112,1.0005626643831753,3.353805849419586E-2,1,0,57989.454047602485,1.5707790822800711,13.986151030072623,1.4992359676326052,1.0326127475555895,0.25199367800800387,1.0470337696011471,0.3008699737193275,15.277581383674734,0.14386647031464248,1.020577512516992,0.42753084364014576,-2.8746703836214555,-120.6608498193705,59.339150180629503,null,53397.5,2851293006.25,null,25.075458631961411,-18.537292757539571,null,21.352349234441803,-111.11919518596625,null,0,0,null,0,0]
[53703,53.703000000000003,39.609889808177556,1.5455474239595504,1.000569119242158,3.3729792743205762E-2,1,0,58321.225726169636,1.5707791803788602,14.065761272445169,1.4996416761482809,1.0329810104695094,0.25337463968003043,1.0475612369665661,0.30248849259348654,15.279331475057139,0.14467865111474013,1.0208401233597357,0.43002117933495243,-2.9263390970485337,-120.81050684179843,59.189493158201572,null,53703,2884012209,null,25.072109629432582,-18.59317626806574,null,21.300649845428346,-111.25916846642527,null,0,0,null,0,0]
[54015.75,54.015749999999997,39.840419203663494,1.5456935529640086,1.0005757653873719,3.3926074580349179E-2,1,0,58660.870873377658,1.5707792796562305,14.147263163226786,1.5000522828269161,1.0333600520045578,0.25478735140275943,1.0481040617241724,0.30414372951758462,15.281133231996694,0.14550991590832427,1.0211111324109756,0.43257125603476526,-2.9789568826606514,-120.9639538809791,59.036046119020895,null,54015.75,2917701248.0625,null,25.068669552883442,-18.650598345961022,null,21.247996642191005,-111.40240355327938,null,0,0,null,0,0]
[54328.5,54.328499999999998,40.070949440100563,1.5458380005961403,1.0005824500808149,3.4122353802414213E-2,1,0,59000.516020586256,1.5707793777905914,{"$f":"SQRT(1+(A471/Zero2)^2)","v":14.228767411881581},{"$f":"ATAN(A471/Zero2)","v":1.5004581855553587},1.0337411543576986,0.25619902431138014,1.0486497551094964,0.3057972482730979,15.282945237279181,0.14634098710130886,1.0213843431730965,0.43512198125147794,-3.0312978762909735,-121.11763917438657,58.882360825613432,null,54328.5,2951585912.25,null,25.065217679486555,-18.708230355195887,null,21.195616300729089,-111.54557961170958,null,0,0,null,0,0]
[54641.25,54.641249999999999,40.301480503057661,1.54598079570304,1.0005891733217143,3.4318630394329905E-2,1,0,59340.161167795406,1.5707794748015691,14.31027397812171,1.5008594645751143,1.0341243152505333,0.25760965393108548,1.0491983126465747,0.30744904250613719,15.284767487263098,0.14717186366506119,1.0216597660450628,0.43767335452403194,-3.0833656111550449,-121.27155980163664,58.728440198363359,null,54641.25,2985666201.5625,null,25.061753947758518,-18.766067443007685,null,21.143505416915644,-111.68869826897944,null,0,0,null,0,0]
[54954,54.954000000000001,40.532012378431986,1.5461219664757864,1.0005959351092926,3.4514904341026519E-2,1,0,59679.806315005117,1.5707795707083443,14.391782822570871,1.5012561983159103,1.0345095323957403,0.25901923581028796,1.0497497298453311,0.30909910591370121,15.286599978288081,0.14800254457248058,1.0219374114705224,0.44022537532250511,-3.1351635609883735,-121.42571290309641,58.574287096903589,null,54954,3019942116,null,25.05827829913126,-18.824104861745816,null,21.09166064332809,-111.83176111081991,null,0,0,null,0,0]
[55274,55.274000000000001,40.767889144573431,1.546264757275897,1.0006028935415179,3.4715725449727057E-2,1,0,60027.324930855742,1.5707796677150325,14.47518347851411,1.5016575043305391,1.03490580534499,0.26046040477514515,1.0503168848657334,0.31078562219564104,15.288485545179446,0.14885227828984623,1.022223804494284,0.44283722526641439,-3.1878865864132386,-121.58367719709204,58.416322802907956,null,55274,3055215076,null,25.054709687303745,-18.883690178207832,null,21.038886034067552,-111.97808419772853,null,0,{"$f":"IF(AH474>0,W474,0)","v":0},null,0,0]
[55594,55.594000000000001,41.003766732376675,1.5464059052468855,1.0006098923266127,3.4916543757232139E-2,1,0,60374.843546706928,1.5707797636049767,14.55858643892614,1.5020542124195169,1.0353042261124032,0.26190046750602392,1.0508870241119272,0.3124703132888883,15.290381825606516,0.1497018050040122,1.0225125465723188,0.44544975176115181,-3.2403343466223471,-121.74187899832725,58.258121001672748,null,55594,3090692836,null,25.051128484559122,-18.943475489881564,null,20.98638310190276,-112.12435208146572,null,0,0,null,0,0]
[55914,55.914000000000001,41.239645127742797,1.5465454385725477,1.0006169314637305,3.5117359247403501E-2,1,0,60722.36216255866,1.5707798583973502,14.64199166442717,1.502446401030435,1.0357047922192755,0.26333941931029181,1.051460142729451,0.31415317260736719,15.292288815587403,0.15055112361980677,1.0228036490349026,0.44806295401359686,-3.2925103780678571,-121.900315429217,58.099684570782998,null,55914,3126375396,null,25.04753463702847,-19.003456034281612,null,20.934148437249824,-112.27056633232617,null,0,0,null,0,0]
[56234,56.234000000000002,41.475524316893534,1.5466833847957879,1.0006240109520197,3.5318171904104266E-2,1,0,61069.88077841093,1.5707799521108905,14.725399116528546,1.502834146839152,1.0361075011773988,0.26477725552095621,1.0520362358490818,0.31583419362081661,15.294206511119713,0.15140023304376815,1.0230971232599992,0.45067683115406987,-3.344418157846281,-122.05898367092621,57.94101632907379,null,56234,3162262756,null,25.043928093639323,-19.063627151879494,null,20.882178687223004,-112.41672847949768,null,0,0,null,0,0]
[56561.5,56.561500000000002,41.716932732398298,1.5468229488867049,1.0006312981457719,3.5523688156745677E-2,1,0,61425.544361822787,1.5707800469228916,14.810763697024653,1.5032264584310393,1.0365218647947485,0.26624763105456783,1.0526289059461813,0.31755270337055047,15.296180233301854,0.15226902572691756,1.0233999435062997,0.45335266885178011,-3.3972683377091188,-122.22160784187427,57.778392158125726,null,56561.5,3199203282.25,null,25.040223825749052,-19.12540109818363,null,20.829261756328346,-112.56626390589275,null,0,0,null,0,0]
[56889,56.889000000000003,41.95834195112085,1.5469609070036605,1.0006386276025017,3.5729201407345E-2,1,0,61781.20794523519,1.5707801406432609,14.896130530895217,1.5036142735588154,1.0369384675829165,0.26771682827954346,1.0532246812427046,0.31926927397373805,15.298165160190647,0.1531375969854929,1.0237052722603153,0.45602921135368291,-3.4498447290448508,-122.38446902358066,57.615530976419336,null,56889,3236358321,null,25.036506160246631,-19.187365098246588,null,20.776615373763917,-112.71574787106779,null,0,0,null,0,0]
[57216.5,57.216500000000003,42.199751959276469,1.5470972867030024,1.0006459993212802,3.5934711638608403E-2,1,0,62136.871528648131,1.570780233290743,14.981499579620039,1.5039976689713928,1.0373573068441495,0.26918484227670103,1.0538235564721126,0.32098389861170962,15.300161287429226,0.15400594565294642,1.024013121871892,0.45870645747669381,-3.502150874912938,-122.54756437379226,57.452435626207745,null,57216.5,3273727872.25,null,25.032775050897804,-19.249514473905215,null,20.72423612153575,-112.86518188709023,null,0,0,null,0,0]
[57544,57.543999999999997,42.441162743394003,1.54723211491434,1.0006534133011737,3.6140218833243587E-2,1,0,62492.535112061596,1.5707803248836563,15.066870805550957,1.5043767196834652,1.037778379870578,0.2706516681551781,1.0544255263524585,0.32269657052701428,15.302168610638411,0.15487407056464042,1.0243235047417087,0.46138440595259106,-3.554190259072886,-122.71089110703224,57.289108892967761,null,57544,3311311936,null,25.029030454153901,-19.311844647957919,null,20.672120638400983,-113.01456742524009,null,0,0,null,0,0]
[57879,57.878999999999998,42.688102807847059,1.5473684530403624,1.0006610407898013,3.6350429139749681E-2,1,0,62856.343663034684,1.5707804175017088,15.154199311930967,1.5047600322975585,1.0382114040405654,0.27215085115347826,1.0550444780473791,0.32444643664304218,15.304233481993569,0.15576184348666655,1.024643629539759,0.46412440674481464,-3.6071489607481206,-122.87819469287412,57.121805307125882,null,57879,3349978641,null,25.025186106370416,-19.375784618153197,null,20.619081123967803,-113.1673253425064,null,0,0,null,0,0]
[58214,58.213999999999999,42.935043656662685,1.5475032228717505,1.0006687124953371,3.65606362323566E-2,1,0,63220.152214008311,1.5707805090537963,15.241530019380406,1.5051389523681891,1.0386467596935152,0.27364878073118221,1.0556666565276136,0.32619424546774767,15.306310058643282,0.15664937982829619,1.0249664313603266,0.46686513946887004,-3.6598357323778075,-123.04573465926856,56.954265340731439,null,58214,3388869796,null,25.021327562428812,-19.439904385765004,null,20.566310659841911,-113.3200355238568,null,0,0,null,0,0]
[58549,58.548999999999999,43.181985276384509,1.5476364513090368,1.0006764284167637,3.6770840092561638E-2,1,0,63583.960764982461,1.570780599558216,15.32886289027986,1.5055135548622953,1.0390844438988922,0.27514545174591676,1.0562920560912266,0.32793998996742252,15.308398335828446,0.15753667834928994,1.0252919236382749,0.46960660248910507,-3.7122541187869587,-123.2135081979108,56.786491802089202,null,58549,3427985401,null,25.0174547838817,-19.504199361916243,null,20.513805824582562,-113.47269941792244,null,0,0,null,0,0]
[58884,58.884,43.428927653862146,1.5477681646411365,1.0006841885530586,3.6981040701863782E-2,1,0,63947.769315957121,1.5707806890328491,15.416197887861451,1.505883913052932,1.0395244537154367,0.27664085908649977,1.0569206710202936,0.32968366317529368,15.310498308765743,0.15842373781153665,1.0256201198624078,0.47234879407546504,-3.764407605669895,-123.38151255514668,56.618487444853315,null,58884,3467325456,null,25.013567734855876,-19.568665056545449,null,20.461563253437916,-113.62531843288235,null,0,0,null,0,0]
[59227,59.226999999999997,43.681767934436337,1.5479014803872171,1.0006921798162591,3.719625763960907E-2,1,0,64320.265832328718,1.5707807795954705,15.505620663264471,1.5062587928633708,1.039977377725972,0.27817066304167215,1.0575676231206184,0.33146682305693681,15.312660543329031,0.15933173180233837,1.0259589693265632,0.47515722379952718,-3.8175356645680742,-123.55376528905985,56.446234710940146,null,59227,3507837529,null,25.009573040201118,-19.634842524628041,null,20.408341376152208,-113.78153701068925,null,0,0,null,0,0]
[59570,59.57,43.934608982434661,1.5480332616873209,1.0007002174291089,3.741147113008253E-2,1,0,64692.762348700831,1.570780869115185,15.59504559275782,1.5066293734624738,1.0404327334733621,0.27969913150344466,1.0582179338076481,0.33324779697165224,15.314835028691132,0.16023947256030924,1.0263006822131415,0.47796641332727513,-3.8703932324331807,-123.72625432303533,56.273745676964666,null,59570,3548584900,null,25.005563317152451,-19.701189741486075,null,20.355387476214361,-113.93771140227628,null,0,0,null,0,0]
[59913,59.912999999999997,44.18745078468347,1.5481635348772567,1.0007083013904909,3.7626681153431436E-2,1,0,65065.258865073461,1.5707809576099048,15.684472639496899,1.506995728285103,1.0408905177661893,0.28122625908756066,1.0588715968933102,0.33502657765941524,15.317021759639251,0.16114695876349855,1.0266452731734286,0.48077636049224853,-3.9229838667841865,-123.89897686826249,56.101023131737506,null,59913,3589567569,null,25.001538535055165,-19.76770219214297,null,20.302698118473423,-114.09384299358264,null,0,0,null,0,0]
[60256,60.256,44.440293328308911,1.5482923256936916,1.0007164316992825,3.7841887689805009E-2,1,0,65437.755381446594,1.5707810450971336,15.773901767471775,1.5073579291053798,1.0413507274016427,0.28275204044422281,1.0595286061729419,0.33680315793358662,15.319220730934223,0.16205418909233538,1.026992756916012,0.48358706302300108,-3.9753110659415731,-124.07193018862273,55.92806981137727,null,60256,3630785536,null,24.997498665731644,-19.834375458726569,null,20.250269924626075,-114.24993313020379,null,0,0,null,0,0]
[60607,60.606999999999999,44.699033828507964,1.5484226119797457,1.0007247996165882,3.8062109989987436E-2,1,0,65818.939863216699,1.5707811335997142,15.865418823908227,1.5077243504852074,1.0418241782901074,0.28431200930083655,1.0602043969657871,0.33861888906696647,15.321483656605645,0.16298231304219432,1.0273513554151683,0.48646410081564229,-4.0285895904453266,-124.24915351621887,55.750846483781132,null,60607,3673208449,null,24.99334892600438,-19.902765762697392,null,20.196885821318521,-114.40962229936848,null,0,0,null,0,0]
[60958,60.957999999999998,44.957775078718043,1.5485513986191732,1.0007332160660936,3.8282328596586146E-2,1,0,66200.124344987315,1.5707812210830883,15.956937986075005,1.5080865687787794,1.0423001621538295,0.28587055717537779,1.0608836786649605,0.34043230095455151,15.32375938907575,0.16391016625443883,1.0277130145567783,0.48934192446998498,-4.0815994761503847,-124.42661287388303,55.57338712611697,null,60958,3715877764,null,24.989183334963393,-19.971315411100022,null,20.143768225401494,-114.56927078329615,null,0,0,null,0,0]
[61309,61.308999999999997,45.216517066063858,1.5486787113519001,1.0007416810465743,3.8502543488335032E-2,1,0,66581.308826758439,1.5707813075647605,16.048459217947212,1.5084446557983686,1.0427786755242239,0.2874276784472532,1.0615664445691138,0.34224338613330907,15.326047922644806,0.16483774732280385,1.0280777502857996,0.49222053120855641,-4.134344288128335,-124.60430548993897,55.395694510061034,null,61309,3758793481,null,24.985001869953187,-20.040019968360983,null,20.090913693254642,-114.72887989885699,null,0,0,null,0,0]
[61660,61.66,45.475259777963096,1.548804575332231,1.0007501945567985,3.8722754643970181E-2,1,0,66962.493308530044,1.5707813930618375,16.139982484316263,1.5087986817316681,1.0432597149206537,0.28898336753382592,1.0622526879597993,0.3440521372203979,15.328349251584422,0.1657650548436794,1.0284455786077444,0.49509991813749432,-4.1868275323028739,-124.78222864327931,55.217771356720689,null,61660,3801955600,null,24.980804510696885,-20.108875094140284,null,20.038318838144093,-114.88845092269868,null,0,0,null,0,0]
[62019,62.018999999999998,45.739900496345662,1.5489318349706442,1.0007589523073361,3.8947980970307834E-2,1,0,67352.365755698658,1.5707814795064783,16.233593819772491,1.5091566471526323,1.0437543275795689,0.29057302662162732,1.0629581624833637,0.3458996912963464,15.330716262607572,0.16671321314791762,1.0288250063525592,0.49804573604651831,-4.2402399912163187,-124.9644427189826,55.035557281017404,null,62019,3846356361,null,24.976495024642318,-20.179450895896764,null,19.984790390493668,-115.05162077853529,null,0,0,null,0,0]
[62378,62.378,46.004541946964196,1.549057630487148,1.0007677608223811,3.9173203343295174E-2,1,0,67742.238202867768,1.5707815649561006,16.327207211535953,1.5095105077698638,1.044251575319902,0.29216117580390305,1.0636672605476925,0.34774478830473704,15.33309664669995,0.16766108233160543,1.029207703329565,0.50099236361789723,-4.2933860582174423,-125.14689235734505,54.853107642654948,null,62378,3891014884,null,24.972168875940856,-20.25017531735859,null,19.931526602094689,-115.21475336311184,null,0,0,null,0,0]
[62737,62.737000000000002,46.269184117254426,1.5491819870003909,1.0007766201005932,3.9398421740188039E-2,1,0,68132.110650037372,1.570781649427786,16.420822624438284,1.5098603336986625,1.0447514543791654,0.29374780923098726,1.0643799749106935,0.34958742060607845,15.335490397639955,0.16860866090164831,1.0295936868565212,0.50393979737558725,-4.3462693011432929,-125.32957480036906,54.670425199630941,null,62737,3935931169,null,24.967826050124447,-20.32104400703253,null,19.878524025755475,-115.37784991776137,null,0,0,null,0,0]
[63096,63.095999999999997,46.533826994937804,1.5493049290577925,1.0007855301406239,3.9623636138244676E-2,1,0,68521.983097207441,1.570781732938227,16.514440024107788,1.5102061934684456,1.0452539609821769,0.2953329210949005,1.0650962983127756,0.35142758064822222,15.337897509174931,0.16955594736790675,1.0299829743148283,0.50688803371491331,-4.398893228841799,-125.51248733835338,54.487512661646619,null,63096,3981105216,null,24.963466535004333,-20.392052706655882,null,19.825779271099041,-115.54091164371772,null,0,0,null,0,0]
[63463.25,63.463250000000002,46.804552218093555,1.5494292578112505,1.000794697461449,3.9854021914645113E-2,1,0,68920.815008693186,1.5707818173901558,16.610210819311739,1.5105559671832014,1.0457707303004298,0.29695287919783542,1.0658328099968186,0.35330746257527684,15.34037375546065,0.17052469915157145,1.0303846446758067,0.50990484856904061,-4.4524617563920525,-125.69983860906075,54.300161390939252,null,63463.25,4027584100.5625,null,24.958989556640773,-20.464833750124217,null,19.772085715821177,-115.70768578281981,null,0,0,null,0,0]
[63830.5,63.830500000000001,47.075278156415742,1.5495521565583239,1.0008039179010857,4.0084403458169882E-2,1,0,69319.646920179439,1.5707819008702928,16.705983623336994,1.5109017305433179,1.0462902412822987,0.29857123283953274,1.0665730830774336,0.35518474160122993,15.34286397012732,0.17149314210666242,1.0307898095628378,0.51292249527153611,-4.5057661584643753,-125.88742508289654,54.112574917103458,null,63830.5,4074332730.25,null,24.954495094285122,-20.537752585450999,null,19.718654967174032,-115.874425892518,null,0,0,null,0,0]
[64197.75,64.197749999999999,47.346004797636354,1.5496736498257961,1.0008131914580662,4.031478074448102E-2,1,0,69718.478831666172,1.5707819833953161,16.801758401831716,1.5112435520458762,1.0468124898458941,0.30018797593794733,1.0673171097280978,0.3570594099241457,15.345368146380922,0.17246127464760824,1.0311984877856615,0.5159409695437166,-4.5588100084487104,-126.07524400544374,53.924755994556264,null,64197.75,4121351105.0625,null,24.949983141818663,-20.610804940522659,null,19.665483571968135,-116.04113313433734,null,0,0,null,0,0]
[64565,64.564999999999998,47.616732129766305,1.5497937615828246,1.0008225181309138,4.0545153749243272E-2,1,0,70117.310743153343,1.5707820649815236,16.89753512122218,1.5115814986386999,1.04733747189598,0.30180310245681086,1.0680648821044669,0.35893145983717234,15.347886277393796,0.17342909519212774,1.0316106982206925,0.5189602669647978,-4.611596820844027,-126.2632926683013,53.736707331698696,null,64565,4168639225,null,24.945453695308345,-20.683986634592554,null,19.612568133808587,-116.20780862971148,null,0,0,null,0,0]
[64941,64.941000000000003,47.893910442262651,1.5499153282752156,1.0008321220462464,4.0781011098238763E-2,1,0,70525.64511679353,1.5707821475555805,16.995595767587048,1.5119235508917588,1.0478777896905787,0.3034550294789824,1.0688343431509404,0.36084539202977911,15.350478854999377,0.17441964988523875,1.0320364091029899,0.52205234939117695,-4.6653786305343568,-126.45605696268579,53.543943037314207,null,64941,4217333481,null,24.940798205312142,-20.759041661784106,null,19.558653635481075,-116.37842353058333,null,0,0,null,0,0]
[65317,65.316999999999993,48.171089454411856,1.5500354959669314,1.0008417816354873,4.101686390761642E-2,1,0,70933.979490434198,1.5707822291789555,17.093658379617626,1.5122616786247709,1.0484209640480595,0.30510524931324828,1.0696077138418769,0.36275656351031393,15.353086045658616,0.17540987419168053,1.0324658627731365,0.52514528482209533,-4.7188982808162887,-126.64905647058914,53.350943529410856,null,65317,4266310489,null,24.936124376095869,-20.834223678279201,null,19.505000408008016,-116.54900740828185,null,0,0,null,0,0]
[65693,65.692999999999998,48.448269154205512,1.5501542886661388,1.0008514968970252,4.1252712151268717E-2,1,0,71342.313864075331,1.5707823098679725,17.191722923677091,1.5125959489181622,1.0489669905308805,0.30675375563081109,1.0703849857029306,0.364664966316529,15.355707841935089,0.17639976642416605,1.0328990797012727,0.52823906804843823,-4.7721593602134114,-126.84228842503877,53.157711574961226,null,65693,4315570249,null,24.931432210102319,-20.909528478974462,null,19.451604983199474,-116.71956134140926,null,0,0,null,0,0]
[66069,66.069000000000003,48.725449529908403,1.5502717298348703,1.0008612678292383,4.1488555803091139E-2,1,0,71750.648237716916,1.5707823896385837,17.289789366891096,1.5129264273339507,1.0495158646874578,0.30840054215326229,1.0711661502416661,0.36657059258989644,15.358344236355808,0.1773893248990828,1.0333360804273113,0.5313336937037848,-4.8251653982459324,-127.03575010289005,52.964249897109951,null,66069,4365112761,null,24.926721711876553,-20.984951948630627,null,19.398463949836461,-116.89008636826338,null,0,0,null,0,0]
[66453.75,66.453749999999999,49.009080934523638,1.5503905288543223,1.000871323770858,4.1729883057179444E-2,1,0,72168.485073511532,1.5707824703311088,17.390139873874951,1.5132607379838072,1.0500804550361988,0.3100838647100429,1.0719695142115844,0.36851768292503173,15.361057086879425,0.17840156441210128,1.0337871891209558,0.5345012015488062,-4.879144562843309,-127.23394888903412,52.766051110965876,null,66453.75,4416100889.0625,null,24.921882624100739,-21.062249260839728,null,19.344346096958422,-117.06455084884119,null,0,0,null,0,0]
[66838.5,66.838499999999996,49.292713022854343,1.5505079607275389,1.0008814380008928,4.1971205447942236E-2,1,0,72586.321909306629,1.5707825500946351,17.490492302141131,1.5135912124276836,1.0506480176636821,0.31176537335730514,1.0727769360945159,0.37046184967986323,15.363785206939257,0.1794134508979279,1.0342423035036383,0.53766957961338191,-4.9328639716224334,-127.43238257969377,52.567617420306235,null,66838.5,4467385082.25,null,24.917024357012771,-21.139662388873422,null,19.29048756374992,-117.23898713626545,null,0,0,null,0,0]
[67223.25,67.223249999999993,49.576345783165664,1.5506240489161205,1.0008916105175756,4.2212522947419839E-2,1,0,73004.158745102177,1.5707826289451134,17.590846618807987,1.5139179162484784,1.0512185477556251,0.31344506153197965,1.0735884067348631,0.37240308477023182,15.366528588410123,0.1804249825646991,1.034701445803847,0.54083882163449204,-4.9863272230502851,-127.63104838965339,52.368951610346613,null,67223.25,4518965340.5625,null,24.912146921878652,-21.217187199986178,null,19.236884872283021,-117.41339621754419,null,0,0,null,0,0]
[67608,67.608000000000004,49.859979203989745,1.5507388163479598,1.0009018413191295,4.2453835527655984E-2,1,0,73421.995580898161,1.5707827068981324,17.691202791739354,1.5142409135442341,1.0517920404830476,0.31512292272628972,1.074403916958848,0.37434138022472074,15.369287223127229,0.18143615762464477,1.035164638322557,0.54400892117559452,-5.039537856588777,-127.82994357517411,52.170056424825887,null,67608,4570841664,null,24.907250331981263,-21.294819649655672,null,19.18353460166372,-117.58777903916398,null,0,0,null,0,0]
[68001.75,68.001750000000001,50.150247996891807,1.5508549243171716,1.0009123717817141,4.2700787724251912E-2,1,0,73849.606377765856,1.5707827857613139,17.79390836662057,1.5145676941073714,1.052382010589209,0.31683813381848919,1.0752426762830998,0.37632196413890801,15.372126171371452,0.18247061482435023,1.0356428825381006,0.54725405603648458,-5.0937352651962753,-128.03372594524947,51.966274054750528,null,68001.75,4624238003.0625,null,24.902219385775439,-21.374375377736417,null,19.129194207312217,-117.7662147488449,null,0,0,null,0,0]
[68395.5,68.395499999999998,50.440517458091165,1.5509696959575465,1.0009229632840408,4.2947734709541933E-2,1,0,74277.217174634003,1.5707828637164714,17.89661581982466,1.5148907239621057,1.0529750732749912,0.3185514178442222,1.0760856468904785,0.37829945274966353,15.374981077381133,0.18350469476337061,1.0361254161596443,0.55050007480686181,-5.1476754164345548,-128.23774285952987,51.762257140470126,null,68395.5,4677944420.25,null,24.897168412531705,-21.454035540777639,null,19.075111109153042,-117.94462483539232,null,0,0,null,0,0]
[68789.25,68.789249999999996,50.730787576116299,1.5510831542045507,1.0009336158241722,4.3194676453572944E-2,1,0,74704.8279715026,1.5707829407791976,17.999325119197461,1.515210067248284,1.0535712233178891,0.32026276800813713,1.0769328188918217,0.38027383787796692,15.377851932276817,0.18453839553894255,1.036612263319042,0.55374697002196704,-5.2013619206509931,-128.4419915023467,51.558008497653304,null,68789.25,4731960915.5625,null,24.892097432624386,-21.53379607538524,null,19.021281817884695,-118.1230101869286,null,0,0,null,0,0]
[69183,69.183000000000007,51.021058339756749,1.5511953214718461,1.0009443294001592,4.3441612926395617E-2,1,0,75132.438768371634,1.5707830169647297,18.102036233313996,1.5155257866530802,1.0541704554800548,0.32197217757552365,1.0777841823798489,0.38224511146723278,15.380738727136103,0.18557171525286342,1.0371034482230388,0.55699473402582733,-5.2547983291378806,-128.64646909711055,51.353530902889446,null,69183,4786287489,null,24.887006468362539,-21.613653004851269,null,18.967702901342481,-118.30137165072308,null,0,0,null,0,0]
[69586,69.585999999999999,51.318148819716939,1.5513088098113041,1.0009553578615931,4.3694344956854425E-2,1,0,75570.095025231072,1.5707830940472112,18.207162090585285,1.515845234318052,1.0547869509377406,0.32371972822121031,1.0786598761382744,0.3842594640186171,15.383709835462941,0.18662891320822286,1.0376106892094765,0.56031968615996475,-5.3092347371075448,-128.85598451721299,51.144015482787012,null,69586,4842211396,null,24.881775238011446,-21.695481694950651,null,18.913121048783069,-118.48389929948256,null,0,0,null,0,0]
[69989,69.989000000000004,51.615239953025764,1.5514209917016404,1.0009664502561171,4.3947071402062124E-2,1,0,76007.751282090932,1.5707831702420034,18.312289784506945,1.5161610142271602,1.0554066638753816,0.32546523194124383,1.0795399395734737,0.38627054043483977,15.386697622425647,0.18768570797890932,1.0381225256853186,0.56364553153914354,-5.3634165046113207,-129.06573400628437,50.934265993715627,null,69989,4898460121,null,24.876523126552989,-21.777403200919657,null,18.858794375542342,-118.66640359340343,null,0,0,null,0,0]
[70392,70.391999999999996,51.912331728465986,1.551531889570243,1.0009776065816058,4.4199792229921354E-2,1,0,76445.407538951244,1.5707832455643529,18.417419283627851,1.5164731891252485,1.0560295886286082,0.32720868171228357,1.080424362007441,0.38827833247427934,15.389702078319202,0.18874209754473201,1.0386389838396024,0.5669722613317657,-5.4173472555431159,-129.27571470505794,50.724285294942064,null,70392,4955033664,null,24.871250163792908,-21.859413526209337,null,18.804719379560055,-118.84888531330618,null,0,0,null,0,0]
[70795,70.795000000000002,52.209424135075679,1.5516415253341449,1.0009888268359215,4.4452507408339011E-2,1,0,76883.063795811962,1.5707833200291583,18.522550557210387,1.5167818203354855,1.0566557195170858,0.32895007057745312,1.0813131327443022,0.39028283202813152,15.392723193392035,0.18979807989058223,1.0391600899382387,0.57029986649578812,-5.4710305546460303,-129.48592379089334,50.514076209106662,null,70795,5011932025,null,24.865956381392106,-21.94150875951491,null,18.750892616052909,-119.03134519871215,null,0,0,null,0,0]
[71207.25,71.207250000000002,52.513336302096896,1.5517523939921138,1.0010003707715407,4.4711017242356918E-2,1,0,77330.765512663114,1.5707833953310297,18.630096698226208,1.5170939313722325,1.0572995333220312,0.33072928969840792,1.0822267912931973,0.39232992554051244,15.395830878592259,0.19087787660146571,1.0396979935671975,0.57370474578627761,-5.5256936580596445,-129.70119117949767,50.29880882050233,null,71207.25,5070472452.5625,null,24.860519584539023,-22.025572175405024,null,18.696083686208155,-119.217971195752,null,0,0,null,0,0]
[71619.5,71.619500000000002,52.817249107176352,1.5518619867650196,1.0010119815998009,4.4969521096691861E-2,1,0,77778.467229514688,1.5707834697660088,18.73764463322852,1.5174024596087654,1.0579466900564214,0.33250633770629151,1.0831449773507378,0.39437355694716159,15.39895597570839,0.19195724293473126,1.0402408167986652,0.57711052127834417,-5.5801051821403487,-129.9166916957231,50.083308304276898,null,71619.5,5129352780.25,null,24.855061074039515,-22.109716425341229,null,18.641527400751265,-119.40457578114111,null,0,0,null,0,0]
[72031.75,72.031750000000002,53.121162539362807,1.5519703255487456,1.0010236593183743,4.5228018937003858E-2,1,0,78226.168946366699,1.5707835433489796,18.845194331502942,1.5177074663270598,1.058597183589314,0.33428120736977646,1.0840676794127657,0.39641371799668013,15.40209847415165,0.19303617674993592,1.0407885879897543,0.58051718260882534,-5.6342687591681075,-130.13242242777511,49.867577572224889,null,72031.75,5188573008.0625,null,24.849580889416735,-22.193937584653231,null,18.587220250061559,-119.59115961762326,null,0,0,null,0,0]
[72444,72.444000000000003,53.425076587954209,1.5520774317410659,1.0010354039249201,4.5486510728957756E-2,1,0,78673.870663219117,1.5707836160944875,18.952745763031754,1.5180090114207154,1.0592510077732546,0.33605389153014975,1.0849948859577707,0.39845040058122433,15.405258363282979,0.1941146759122854,1.041341335575672,0.58392471918385447,-5.6881879622744878,-130.3483804978886,49.651619502111402,null,72444,5248133136,null,24.844079071966988,-22.278231812359866,null,18.533158781833269,-119.77772332618402,null,0,0,null,0,0]
[72865.75,72.865750000000006,53.735994740680944,1.5521857523980025,1.0010474883926952,4.5750952980532403E-2,1,0,79131.889338980647,1.5707836896645515,19.062777401742434,1.5183139842419591,1.0599233390942542,0.33786515688436031,1.085948108650806,0.40053040909635995,15.408509055042659,0.1952175762868959,1.0419120002899718,0.58741167439117226,-5.7431004734294291,-130.56954745393344,49.430452546066562,null,72865.75,5309417523.0625,null,24.83842812767465,-22.364540232563719,null,18.478102205403818,-119.96856603466895,null,0,0,null,0,0]
[73287.5,73.287499999999994,54.04691351665744,1.5522928267712848,1.0010596428617324,4.6015388829092778E-2,1,0,79589.908014742585,1.5707837623878635,19.172810793101586,1.5186154565928836,1.0605991432716186,0.33967411992312807,1.0869060213755175,0.40260676027260711,15.411777925549787,0.19632001724338632,1.0424879338475583,0.59089952247631983,-5.7977645997471807,-130.79094635624764,49.209053643752355,null,73287.5,5371057656.25,null,24.832754634909755,-22.450917253469974,null,18.423295633522418,-120.15938886135734,null,0,0,null,0,0]
[73709.25,73.709249999999997,54.357832905189014,1.5523986762441535,1.0010718673294818,4.6279818237890735E-2,1,0,80047.926690504944,1.5707838342789582,19.282845907105884,1.5189134883431843,1.0612784136709787,0.34148077321691167,1.0878686117426115,0.40467944589170329,15.415064963250419,0.19742199651444048,1.0430691669385692,0.59438825134658591,-5.8521839834158405,-131.01257422507933,48.987425774920666,null,73709.25,5433053535.5625,null,24.827058643270657,-22.537359019949129,null,18.368735547732658,-120.35019234066287,null,0,0,null,0,0]
[74131,74.131,{"$f":"SQRT(1+(A525/pole1)^2)","v":54.668752895824241},{"$f":"ATAN(A525/pole1)","v":1.5525033217135058},{"$f":"SQRT(1+(A525/Zero1)^2)","v":1.0010841617933794},{"$f":"ATAN(A525/Zero1)","v":4.6544241170183527E-2},{"$f":"IF(VIN_nom>Vout, 1, SQRT(1+(A525/z_RHP)^2))","v":1},{"$f":"IF(VIN_nom>Vout, 0, -ATAN(A525/z_RHP))","v":0},{"$f":"SQRT(1+(A525/Pole2)^2)","v":80505.945366267712},{"$f":"ATAN(A525/Pole2)","v":1.5707839053520396},19.392882714432481,1.5192081380062119,{"$f":"SQRT(1+(A525/pole4)^2)","v":1.061961143640956},{"$f":"ATAN(A525/pole4)","v":0.34328510941544166},{"$f":"IF(VOUT_setting=1,1,SQRT(1+(A525*zterm1)^2))","v":1.0888358673462146},{"$f":"IF(VOUT_setting=1,0,ATAN(((A525*zterm1))))","v":0.40674845789035469},15.418370156536275,{"$f":"IF(VOUT_setting=1,0,ATAN(A525*$Q$4/(1+Afbr-$Q$5*(A525)^2)))","v":0.19852351183902073},{"$f":"SQRT((1-(Z525/pterm2))^2+(A525/pterm1)^2)","v":1.0436557303317209},{"$f":"IF((ATAN((A525/pterm1)/(1-A525^2/pterm2))>0),ATAN((A525/pterm1)/(1-A525^2/pterm2)),PI()+ATAN((A525/pterm1)/(1-A525^2/pterm2)))","v":0.59787784865675864},{"$f":"20*LOG10(((E525*K525*G525*O525)/(C525*I525*S525*M525*Q525))*Adc)","v":-5.9063622074254418},{"$f":"((F525+L525+H525+P525)-(D525+J525+T525+N525+R525))*radconv","v":-131.23442811206058},{"$f":"IF(V525>0,V525,V525+180)","v":48.765571887939416},null,{"$f":"IF(U525<0,A525,1000000000)","v":74131},{"$f":"A525^2","v":5495405161},null,{"$f":"20*LOG10((K525/(I525*M525))*AEA)","v":24.821340204048678},{"$f":"(L525-(J525+N525))*radconv","v":-22.623861759107591},null,{"$f":"20*LOG10((E525*G525/(C525*S525))*Acs*Am)","v":18.314418486974059},{"$f":"(F525+H525-(D525+T525))*radconv","v":-120.54097696466614},null,{"$f":"SUM((U526<0)*(U525>0))*A525","v":0},0,null,0,0]
[74562.75,{"$f":"A526/1000","v":74.562749999999994},54.987045639154715,1.5526092225603778,1.0010968202706005,4.6814927015968337E-2,1,0,80974.823998776905,1.5707839772774708,19.505530298792724,1.5195063304077014,1.0626636382609709,0.3451298199934098,1.0898308767886222,0.40886271410635566,15.421772512600482,0.1996506619634314,1.0442617551533286,0.60145107328061942,-5.9615789120494789,-131.46177339005138,48.538226609948623,null,74562.75,5559603687.5625,null,24.81546297946494,-22.712474844684987,null,18.259061711376276,-120.73626617012398,null,0,0,null,{"$f":"SUM((V527<-183)*(V526>-183))*A526","v":0},{"$f":"IF(AK526>0,U526,0)","v":0}]
[74994.5,74.994500000000002,55.305338992066105,1.5527139044470524,1.0011095520971558,4.7085605996574416E-2,1,0,81443.702631286505,1.5707840483747399,19.618179597641515,1.5198010983415802,1.0633697442946597,0.34697208695900172,1.0908307489614455,0.41097310382232771,{"$f":"IF(VOUT_setting=1,1,SQRT((1+Afbr-$Q$5*(A527)^2)^2+(A527*$Q$4)^2))","v":15.42519387062868},0.20077732110452956,1.0448734315438126,0.60502518102335479,-6.0165502997138267,-131.68934937337445,48.310650626625545,null,74994.5,5624175030.25,null,24.809562344150422,-22.801144081677517,null,18.203952460621664,-120.93153652663716,null,0,0,null,0,0]
[75426.25,75.426249999999996,55.623632944093856,1.5528173882969063,1.0011223572702466,4.7356278072600684E-2,1,0,81912.581263796528,1.5707841186580684,19.730830581613237,1.5200925004110326,1.0640794545525942,0.34881190268421197,1.0918354705052298,0.41307961888837158,15.428634217991492,0.20190348685719528,1.0454907927569597,0.60860015781937904,-6.0712800300412724,-131.91715299240849,48.082847007591511,null,75426.25,5689119189.0625,null,24.803638358276618,-22.889865676132327,null,18.149087200327727,-121.1267884293857,null,0,0,null,0,0]
[75858,75.858000000000004,55.941927485011561,1.5529196945572274,1.0011352357870582,4.7626943204652168E-2,1,0,82381.459896306929,1.570784188141354,19.843483222008693,1.5203805938907837,1.0647927618278654,0.35064925962769794,1.0928450280449753,0.4151822513220324,15.432093542000734,0.20302915682330261,1.0461138721248617,0.61217598932663864,-6.1257717032198435,-132.14518120628256,47.854818793717442,null,75858,5754436164,null,24.797691083632483,-22.978635915158598,null,18.094462453762766,-121.32202223043093,null,0,0,null,0,0]
[76299.75,76.299750000000003,56.267594820517871,1.5530231724129999,1.0011484884988775,4.7903870133016765E-2,1,0,82861.198485563786,1.5707842584200926,19.958746757534794,1.5206719940207487,1.0655263058226381,0.35252661996936918,1.0938829598451156,0.41732955726945042,15.43565261705643,0.2041803834144589,1.0467573361737759,0.61583551202734088,-6.1812827904803438,-132.37872022261962,47.62127977738038,null,76299.75,5821651850.0625,null,24.791582022839268,-23.069508768543994,null,18.038817880456417,-121.52175953662177,null,0,0,null,0,0]
[76741.5,76.741500000000002,56.593262751584696,1.5531254593358992,1.0011618179852604,4.8180789708597259E-2,1,0,83340.937074821049,1.5707843278897351,20.074011968375959,1.5209600477290504,1.0662636000706742,0.35440139061687548,1.09492592587909,0.41947278227309154,15.43923153093521,0.20533108593009136,1.0474068571660977,0.61949589822984408,-6.236552105489233,-132.61248800429522,47.387511995704784,null,76741.5,5889257822.25,null,24.785448717787869,-23.160424932863538,null,17.983417907042405,-121.7214785036775,null,0,0,null,0,0]
[77183.25,77.183250000000001,56.918931267989322,1.5532265757659636,1.0011752242431402,4.8457701889217351E-2,1,0,83820.675664078706,1.5707843965641737,20.189278825837924,1.5212448122847511,1.0670046367977621,0.35627356377355163,1.0959739117746539,0.42161191832237838,15.442830269857,0.20648126182444476,1.0480624710451061,0.62315713167584497,-6.2915833196638351,-132.8464813792373,47.153518620762696,null,77183.25,5957254080.5625,null,24.779291239560891,-23.251380680921624,null,17.928258988822041,-121.92117937361051,null,0,0,null,0,0]
[77625,77.625,57.244600359741682,1.5533265416781887,1.0011887072694332,4.8734606632707511E-2,1,0,84300.414253336756,1.5707844644569844,20.304547301877587,1.5215263436586137,1.0677494082118644,0.35814313173715562,1.09702690314544,0.42374695758695391,15.446448819978281,0.20763090855953514,1.0487242138307571,0.62681919580571299,-6.3463800448408447,-133.08069720136197,46.919302798638029,null,77625,6025640625,null,24.773109660779117,-23.342372365301639,null,17.873337638906467,-122.12086234452291,null,0,0,null,0,0]
[78077,78.076999999999998,57.577826591881625,1.5534276566068266,1.0012025826024158,4.90179287018584E-2,1,0,84791.28429825994,1.5707845331299191,20.42249201863201,1.5218111179286955,1.0685153182142795,0.36005337509994451,1.0981094932699984,0.42592728807422281,15.450171823480593,0.20880668038424943,1.0494076926674942,0.63056707365990516,-6.4022092205509171,-133.32057456643597,46.679425433564035,null,78077,6096017929,null,24.766759781228401,-23.435508818818462,null,17.81738426259643,-122.32516022778354,null,0,0,null,0,0]
[78529,78.528999999999996,57.911053405935682,1.5535276078827855,1.0012165383010949,4.9301242895444533E-2,1,0,85282.154343183516,1.5707846010123139,{"$f":"SQRT(1+(A535/Zero2)^2)","v":20.540438372556693},{"$f":"ATAN(A535/Zero2)","v":1.5220926217861388},1.0692851216669059,0.36196087495687529,1.0991972933353291,0.42810331344228753,15.45391553868828,0.20998189285757926,1.0500976646632805,0.63431578515419818,-6.4578003643262036,-133.56067823534613,46.439321764653869,null,78529,6166803841,null,24.760384828253216,-23.528675416575425,null,17.761672401248919,-122.52943965395292,null,0,0,null,0,0]
[78981,78.980999999999995,58.244280791916133,1.5536264154765327,1.0012305743621099,4.9584549168314652E-2,1,0,85773.024388107486,1.5707846681177409,20.658386335610007,1.5223709112026849,1.0700588101668649,0.36386562336293821,1.1002902878890357,0.43027502588317862,15.457679950567016,0.21115654328617672,1.0507941686379219,0.63806531157340751,-6.5131571599900964,-133.80100491426575,46.198995085734254,null,78981,6237998361,null,24.753984884301197,-23.6218684971901,null,17.706198499399214,-122.73370069754033,null,0,0,null,0,0]
[79433,79.433000000000007,58.577508740062477,1.5537240989042043,1.0012446907820813,4.9867847475325133E-2,1,0,86263.894433031834,1.5707847344594636,20.776335880386721,1.5226460408810625,1.0708363752932166,0.36576761247588613,1.1013884614664182,0.43244241778257553,15.46146504401405,0.21233062898532667,1.0514972434848369,0.64181563387475671,-6.568283231587615,-134.04155133254508,45.958448667454917,null,79433,6309601489,null,24.747560033278329,-23.715084477859254,null,17.650959059593902,-122.93794338825386,null,0,0,null,0,0]
[79895.5,79.895499999999998,58.918478174890005,1.5538229077801642,1.0012592183049493,5.0157718534415037E-2,1,0,86766.167432539994,1.5707848015653099,20.897027012853716,1.5229243469222928,1.0716360072775057,0.36771092070580508,1.1025174904542527,0.43465567838987806,15.465359457491745,0.21353140144785368,1.052223493076123,0.64565388011761382,-6.6244547797747524,-134.28790973222729,45.712090267772709,null,79895.5,6383290920.25,null,24.740960239715729,-23.810485921141932,null,17.594675509121505,-123.14691164222238,null,0,{"$f":"IF(AH538>0,W538,0)","v":0},null,0,0]
[80358,80.358000000000004,59.259448178330459,1.5539205795940749,1.001273829956409,5.0447581157647234E-2,1,0,87268.440432048534,1.5707848678987015,21.017719745295523,1.5231994566800835,1.0724396801943303,0.36965132367253739,1.1036519090836454,0.4368643998779515,15.469275492356941,0.21473157697946199,1.0529567049827504,0.64949291826345068,-6.6803922506811908,-134.53449133981704,45.465508660182962,null,80358,6457408164,null,24.734334550645674,-23.9059039943985,null,17.538630212256315,-123.35586060337202,null,0,0,null,0,0]
[80820.5,80.820499999999996,59.60041874062486,1.5540171338592561,1.001288525732777,5.0737435296683384E-2,1,0,87770.713431557451,1.5707849334728998,21.138414050306302,1.5234714248620256,1.0732473849658539,0.37158881330725868,1.1047917007520742,0.43906857471230476,15.47321313220912,0.215931152732208,1.0536969210938751,0.65333272685182708,-6.7360993408125758,-134.78129271897751,45.218707281022489,null,80820.5,6531953220.25,null,24.727683060362629,-24.001335101565097,null,17.482819602619401,-123.56479016291048,null,0,0,null,0,0]
[81283,81.283000000000001,59.941389852236256,1.5541125896451129,1.0013033056303497,5.1027280903193688E-2,1,0,88272.986431066747,1.5707849983008642,21.259109901102232,1.523740304935213,1.0740591124960737,0.37352338165284471,1.1059368488469852,0.4412681955661476,15.47717236057402,0.21713012586773389,1.0544441833674565,0.65717328406718267,-6.7915796866451767,-135.02831045369715,44.971689546302855,null,81283,6606926089,null,24.721005864538348,-24.096775724035787,null,17.427240172088212,-123.77370016626386,null,0,0,null,0,0]
[81756.25,81.756249999999994,60.290286797228816,1.5542091464984462,1.0013185161335931,5.132385457891659E-2,1,0,88786.93388407852,1.5707850638763987,21.382612687707404,1.524012292553657,1.0748938617978347,0.37549988352887143,1.1071141411829946,0.44351422133166568,15.481245944009505,0.21835634028656387,1.0552161520067702,0.66110386008968547,-6.8481185964780646,-135.2812900955924,44.718709904407604,null,81756.25,6684084414.0625,null,24.714146961513688,-24.194440954428117,null,17.3706045972026,-123.9874454638983,null,0,0,null,0,0]
[82229.5,82.229500000000002,60.639184297853085,1.5543045922412506,1.0013338147060729,5.1620419218503022E-2,1,0,89300.881337090686,1.5707851286971282,21.506117037971844,1.5242811562755647,1.075732803710131,0.37747331023780212,1.1082970066203892,0.44575546409765976,15.485342096061029,0.21958191776717015,1.0559955872573894,0.66503517259725664,-6.9044276154836837,-135.53448909132072,44.465510908679278,null,82229.5,6761690670.25,null,24.707261350967357,-24.292108933564567,null,17.314203822882639,-124.2011698148074,null,0,0,null,0,0]
[82702.75,82.702749999999995,60.988082344573172,1.5543989459409544,1.0013492013437522,5.1916974770202289E-2,1,0,89814.828790103216,1.5707851927760104,21.62962292511024,1.5245469495743966,1.0765759284314529,0.37944365361611737,1.1094854273340711,0.44799191668194294,15.489460798841035,0.22080685530000554,1.0567825342752586,0.66896719707079755,-6.9605104527688075,-135.78790383976792,44.212096160232079,null,82702.75,6839744857.5625,null,24.700349139547924,-24.389776130648766,null,17.258034272007595,-124.41487290959856,null,0,0,null,0,0]
[83176,83.176000000000002,61.336980928070126,1.5544922262312257,1.0013646760425716,5.2213521182273251E-2,1,0,90328.776243116095,1.5707852561257079,21.753130322945264,1.5248097247109496,1.0774232261421777,0.38141090562154883,1.1106793854916968,0.45022357212466779,15.493602034382571,0.22203114988616307,1.0575770382782186,0.67289990860750826,-7.0163707571043883,-136.04153075726333,43.958469242736669,null,83176,6918246976,null,24.693410435198015,-24.487439091295073,null,17.202092426003691,-124.62855439204152,null,0,0,null,0,0]
[83660.5,83.660499999999999,61.69417400226709,1.5545866309866869,1.0013806098245095,5.2517107511492842E-2,1,0,90854.941147468824,1.5707853202388702,21.879575251083772,1.5250756731777111,1.078294978332762,0.38342171198225555,1.1119074440076084,0.45250330142673301,15.497865038260182,0.22328387897268187,1.0583983049245786,0.67692679309299242,-7.0733321779137057,-136.30140291051387,43.698597089486128,null,83660.5,6999079260.25,null,24.68627945434184,-24.587415757996073,null,17.145053017039629,-124.84729265656816,null,0,0,null,0,0]
[84145,84.144999999999996,62.051367619968289,1.5546799488764798,1.0013966358954083,5.2820684151669794E-2,1,0,91381.106051821916,1.570785383613716,22.006021708949891,1.5253385653865623,1.0791710833848225,0.38542926157743113,1.1131412685225439,0.454777988748294,15.502151620557056,0.22453592785443233,1.0592275882095115,0.68095434364807383,-7.1300679112842609,-136.56148988986504,43.438510110134956,null,84145,7080381025,null,24.679120938917478,-24.687380894154195,null,17.088244986821451,-125.06600736639713,null,0,0,null,0,0]
[84629.5,84.629499999999993,62.408561771841548,1.5547721985609262,1.0014127542508371,5.3124251047316134E-2,1,0,91907.270956175358,1.5707854462629254,22.132469670324866,1.5255984536841927,1.0800515307056315,0.38743354617030767,1.1143808398844395,0.45704762733632304,15.506461761738006,0.22578729334838363,1.060064936831727,0.6849825323124562,-7.1865816841774439,-136.82178789974253,43.178212100257468,null,84629.5,7162152270.25,null,24.671935008643658,-24.787331029319553,null,17.031664742490197,-125.28469799185831,null,0,0,null,0,0]
[85114,85.114000000000004,62.765756448767071,1.5548633982756448,1.0014289648863397,5.3427808142954621E-2,1,0,92433.435860529164,1.5707855081988906,22.258919109585392,1.5258553892294426,1.0809363096845579,0.38943455765581442,1.1156261389373434,0.45931221067579303,15.510795442182257,0.22703797228333411,1.0609103995425275,0.68901133071194787,-7.2428771627300836,-137.08229315915267,42.91770684084733,null,85114,7244392996,null,24.664721784449455,-24.887262768630183,null,16.975308750192905,-125.50336395523298,null,0,0,null,0,0]
[85609.5,85.609499999999997,63.131061342540896,1.5549556011459205,1.0014456390070186,5.3738246949673441E-2,1,0,92971.546717304154,1.5707855708159404,22.388240936448032,1.5261151562261577,1.0818456457409962,0.39147760601461246,1.1169056152954395,0.46162297345062342,15.515251840160163,0.22831633299604132,1.0617835008529106,0.69313219887433242,-7.3002287370597818,-137.34892331749964,42.65107668250036,null,85609.5,7328986490.25,null,24.657316689296159,-24.989440852171317,null,16.917901586335514,-125.72696831102665,null,0,0,null,0,0]
[86105,86.105000000000004,63.496366766839735,1.5550467430992967,1.0014624096360503,5.4048675389005103E-2,1,0,93509.657574079523,1.5707856327123177,22.517564256691568,1.5263719394421318,1.0827594898757702,0.39351721422765168,1.1181910418435457,0.46392843579605691,15.51973281661555,0.22959396894987613,1.062665192165374,0.69725364342875507,-7.3573595590847161,-137.61576228615337,42.38423771384663,null,86105,7414071025,null,24.649883306303604,-25.091592746631481,null,16.860721680250457,-125.95054549959822,null,0,0,null,0,0]
[86600.5,86.600499999999997,63.861672712559368,1.5551368423404361,1.0014792767685867,5.4359093401642571E-2,1,0,94047.768430855242,1.570785693900393,22.64688904473249,1.5266257899597402,1.0836778306841595,0.39555337404992302,1.1194823980850497,0.46622859150496537,15.524238350285639,0.23087087679131452,1.0635555257726474,0.70137563269531689,-7.414273361176555,-137.88280606143712,42.117193938562878,null,86600.5,7499646600.25,null,24.642421768440084,-25.193715053510726,null,16.803765435376064,-126.17409475227151,null,0,0,null,0,0]
[87096,87.096000000000004,64.226979170802679,1.5552259166598963,1.0014962403997518,5.4669500928290829E-2,1,0,94585.879287631295,1.5707857543922552,22.776215275568052,1.5268767577026816,1.0846006567440465,0.39758607737864748,1.1207796635234699,0.46852343462336793,15.528768419815881,0.23214705317992188,1.0644545540075778,0.70549813455136845,-7.4709738145828553,-138.15005065134557,41.849949348654434,null,87096,7585713216,null,24.634932209791724,-25.295804448829411,null,16.747029314423671,-126.39761525127557,null,0,0,null,0,0]
[87603.25,87.603250000000003,64.60094881662728,1.5553160597212128,1.0015137062497508,5.4987258355414854E-2,1,0,95136.75059358454,1.5707858156097469,22.908609742743756,1.5271307415633091,1.0855500002773404,0.39966339433266507,1.1221137912145269,0.47086718731624061,15.533431305902711,0.23345273092610974,1.0653839622936581,0.70971889199575322,-7.5288016022587794,-138.42383638219113,41.576163617808874,null,87603.25,7674329410.5625,null,24.62723616383601,-25.400277247350488,null,16.689172169486916,-126.62640549693135,null,0,0,null,0,0]
[88110.5,88.110500000000002,64.97491898134183,1.5554051651269933,1.0015312732188377,5.5305004667620027E-2,1,0,95687.621899538135,1.5707858761223836,23.041005670720651,1.5273818066065377,1.086504020027748,0.4017370721887884,1.1234540682154635,0.47320536064916202,15.538119859723214,0.23475763507534175,1.0663225935541014,0.71394011709230421,-7.5864133981040114,-138.69782413160678,41.302175868393221,null,88110.5,7763460210.25,null,24.619511040159232,-25.504708736453836,null,16.631538395050139,-126.85516372063765,null,0,0,null,0,0]
[88617.75,88.617750000000001,65.348889656038011,1.5554932506903172,1.0015489413016923,5.5622739801331846E-2,1,0,96238.493205492065,1.5707859359422689,23.173403034460875,1.5276300028289673,1.0874627036880793,0.4038071027139597,1.1248004725443044,0.47553794904662205,15.542834058071577,0.23606176208672874,1.0672705040352128,0.71816177395535108,-7.6438129499039897,-138.97200964870697,41.027990351293028,null,88617.75,7853105615.0625,null,24.611756985946766,-25.609095580519327,null,16.574124381216944,-127.08388889055382,null,0,0,null,0,0]
[89125,89.125,65.722860832010269,1.5555803338188934,1.0015667104929629,5.594046369298928E-2,1,0,96789.364511446358,1.5707859950812308,23.305801809495254,1.5278753790925208,1.088426038934444,0.40587347782908717,1.1261529822239453,0.47786494720281097,15.547573877643284,0.23736510843391551,1.0682277500076345,0.72238382622596919,-7.701003943707752,-139.24638869146179,40.753611308538211,null,89125,7943265625,null,24.603974149409126,-25.713434517744837,null,16.516926577925542,-127.31257992449693,null,0,0,null,0,0]
[89644,89.644000000000005,66.105495231229796,1.5556684143602422,1.0015849959349776,5.626553567711217E-2,1,0,97352.996266577844,1.5707860548973858,23.441268921444337,1.5281235703897802,1.0894164905823702,0.40798392703794167,1.1275431178109447,0.4802400569902126,15.552449984892682,0.2386978339911581,1.0692168908203374,0.72670404946037848,-7.7593076371669598,-139.52731936911047,40.472680630889528,null,89644,8036046736,null,24.595981395797217,-25.82013746377924,null,16.458623977610337,-127.5465318731986,null,0,0,null,0,0]
[90163,90.162999999999997,66.488130137404866,1.5557554811065764,1.0016033872124057,5.6590595757746574E-2,1,0,97916.628021709679,1.5707861140249082,23.576737460756856,1.5283689095590798,1.0904117856593629,0.41009053290626674,1.128939598348442,0.48260930416845421,15.557352864426807,0.24002973487652135,1.0702159238669524,0.73102460812403403,-7.8174006130784877,-139.80844368207465,40.191556317925347,null,90163,8129366569,null,24.587958827973424,-25.926783578060995,null,16.400540388072933,-127.78044563642437,null,0,0,null,0,0]
[90682,90.682000000000002,66.870765541833023,1.5558415514594097,1.0016218843194171,5.691564386685577E-2,1,0,98480.259776841849,1.570786172475622,23.712207402969106,1.5286114454540078,1.0914119109147671,0.41219328727696647,1.1303424003198466,0.48497268391701531,15.562282490966536,0.24136080736036647,1.0712249094660073,0.7353454617579317,-7.8752866270850728,-140.08975710986434,39.910242890135663,null,90682,8223225124,null,24.579906607717774,-26.033369594795971,null,16.342672193337787,-128.01431989697562,null,0,0,null,0,0]
[91201,91.200999999999993,67.253401436009923,1.5559266424242948,1.001640487250149,5.7240679936418147E-2,1,0,99043.891531974354,1.5707862302610818,23.847678724172997,1.5288512258194011,1.0924168530822636,0.41429218215898106,1.1317515002189737,0.48733019170140263,15.567238839126967,0.24269104772914857,1.0722439079404691,0.73966656940098574,-7.9329693725353341,-140.37125513809323,39.628744861906767,null,91201,8317622401,null,24.571824897734782,-26.13989232121456,null,16.285015837764092,-128.24815328619871,null,0,0,null,0,0]
[91732,91.731999999999999,67.644884901082122,1.5560127045253673,1.0016596298224913,5.7573218759578847E-2,1,0,99620.555235202744,1.5707862887058932,23.986283733078725,1.5290937470701322,1.0934500023154718,0.41643560386633915,1.1331996739960017,0.48973612671893052,15.572337413872592,0.24405118004768017,1.0732968928036013,0.74408780669267705,-7.9917792382867407,-140.65944814076289,39.34055185923711,null,91732,8414759824,null,24.563525977639976,-26.248809243419267,null,16.226241983796058,-128.48734944758792,null,0,0,null,0,0]
[92263,92.263000000000005,68.036368861412868,1.5560977762175896,1.0016788831561871,5.7905744836009937E-2,1,0,100197.21893843147,1.5707863464779714,24.124890136564161,1.5293334815865254,1.0944881656410379,0.41857496915424908,1.1346543905595587,0.49213590640052102,15.577463906110561,0.2454104335143594,1.0743604866575591,0.74850922154000976,-8.0503839544387805,-140.94782483483399,39.052175165166005,null,92263,8512461169,null,24.555196535699832,-26.357653379480983,null,16.167682536416002,-128.72649976625263,null,0,0,null,0,0]
[92794,92.793999999999997,68.427853308501867,1.5561818744984841,1.0016982472448497,5.8238258092911346E-2,1,0,100773.88264166053,1.5707864035888655,24.263497910729509,1.5295704770993208,1.0955313288043802,0.42071026999936312,1.1361156247769038,0.49452952680336787,15.582618288314272,0.24676880420461947,1.0754347540845153,0.75293076847277907,-8.1087872821242595,-141.23638040034626,38.763619599653737,null,92794,8610726436,null,24.546836748874693,-26.466421535587489,null,16.10933387578752,-128.96560261499954,null,0,0,null,0,0]
[93325,93.325000000000003,68.819338234042206,1.556265015978862,1.0017177220820561,5.8570758457499955E-2,1,0,101350.54634488992,1.5707864600498609,24.402107032217724,1.5298047802560233,1.0965794775366384,0.42284149855704412,1.1375833515321141,0.49691698428718889,15.587800532843884,0.24812628821170116,1.0765197596465315,0.75735240149144445,-8.1669929195493189,-141.52511002082849,38.474889979171508,null,93325,8709555625,null,24.5384467949421,-26.575110590215665,null,16.051192442973083,-129.20465631414854,null,0,0,null,0,0]
[93868.5,93.868499999999997,69.220039393422951,1.5563491407419185,1.0017377700495662,5.8911072616408322E-2,1,0,101940.78499405253,1.5707865171784603,24.543980451741437,1.5300418584342195,1.0976574482908326,0.425018672066454,1.1390923266921016,0.49935425796061367,15.593133594866023,0.2495148057598999,1.0776414944090786,0.76187816250573137,-8.226367815678767,-141.8208117030768,38.179188296923201,null,93868.5,8811295292.25,null,24.529828283055828,-26.6862731379019,null,15.991893283092928,-129.44928474849326,null,0,0,null,0,0]
[94412,94.412000000000006,69.620741037033383,1.5564322971466948,1.0017579340274094,5.925137311463638E-2,1,0,102531.02364321546,1.570786573649317,24.685855234928969,1.5302762115495179,1.0987406118104321,0.42719156324420804,1.1406080504784804,0.50178506838520542,15.59849578748465,0.25090238616290977,1.0787746155946247,0.76640391451645173,-8.2855432479078086,-142.11668552911846,37.883314470881544,null,94412,8913625744,null,24.521178546351585,-26.797346422974751,null,15.932803867838651,-129.69385796682832,null,0,0,null,0,0]
[94955.5,94.955500000000001,70.021443156560395,1.5565145018165043,1.0017782140085805,5.9591659874194791E-2,1,0,103121.26229237874,1.5707866294737256,24.8277313584029,1.5305078862924277,1.099828952753195,0.42936016425458556,1.1421304960229024,0.50420941262384478,15.603887080697564,0.25228902528975672,1.079919192325929,0.77092960651313114,-8.3445229850554696,-142.41272634130408,37.587273658695921,null,94955.5,9016546980.25,null,24.512497777825907,-26.908327321958495,null,15.873920571303389,-129.93837400338302,null,0,0,null,0,0]
[95499,95.498999999999995,70.42214574388008,1.556595770996366,1.0017986099860343,5.9931932817113266E-2,1,0,103711.50094154231,1.570786684662723,24.969608799316887,1.5307369282934404,1.1009224557643571,0.43152446745418332,1.1436596364812519,0.50662728805905299,15.609307444381319,0.25367471902919164,1.0810752936756622,0.77545518693022752,-8.4033107321859575,-142.70892898306067,37.291071016939327,null,95499,9120059001,null,24.50378617117897,-27.019212783116185,null,15.815239829224105,-130.18283083890793,null,0,0,null,0,0]
[96611.5,96.611500000000007,71.242352557466589,1.5567592715226357,1.0018407205744198,6.0628400257188388E-2,1,0,104919.6711295736,1.5707867956937289,25.260024319324536,1.5311977350998396,1.1031767996157418,0.43594118548326544,1.1468104264054153,0.51155629948220993,15.620493010922422,0.25650815537592303,1.0834779670563826,0.78471811173645833,-8.5230609917240656,-143.3157144975811,36.684285502418902,null,96611.5,9333781932.25,null,24.485858878449488,-27.245876162171395,null,15.695742125630288,-130.68302058204236,null,0,0,null,0,0]
[97724,97.724000000000004,72.062561232180585,1.5569190501606829,1.0018833170815844,6.1324808812418807E-2,1,0,106127.84131760616,1.5707869041967584,25.550445081185213,1.5316480664202132,1.1054525755601803,0.44033980378421472,1.1499889251967439,0.51645818248155129,15.631799991275541,0.25933757871722035,1.0859298072412225,0.79397989612320974,-8.6420524776893508,-143.9231122304231,36.076887769576899,null,97724,9549980176,null,24.467804867535513,-27.47210255948897,null,15.577049201126938,-131.18293510931954,null,0,0,null,0,0]
[98862,98.861999999999995,72.901572055733098,1.5570787712693142,1.0019273926468069,6.2037118369459382E-2,1,0,107363.7043953432,1.5707870126602397,25.847527917732506,1.5320982494779798,1.1078025522471131,0.44482045697735306,1.1532687094353569,0.52144434428729736,15.643491488805061,0.26222766827497201,1.088489331794757,0.80345231020877506,-8.7630170052600818,-144.54501964348088,35.454980356519116,null,98862,9773695044,null,24.449207681683465,-27.703037702462908,null,15.456438853241234,-131.69400347290517,null,0,0,null,0,0]
[100000,100,73.740584696744705,1.5572348578017974,1.0019719765299895,6.2749364897807955E-2,1,0,108599.56747308148,1.5707871186550919,26.144615873614754,1.5325382015328157,1.1101746750427386,0.44928205170042251,1.1565770029902722,0.52640210375433727,15.655309470922054,0.26511348614522384,1.0911015492333047,0.81292254081020709,-8.8832487515572005,-145.16747398393636,34.832526016063639,null,100000,10000000000,null,24.430481474951982,-27.933466927383396,null,15.336611774799291,-132.20474209746936,null,0,0,null,0,0]
[101165,101.16500000000001,74.599505431697722,1.5573910106971893,1.0020181446836049,6.3478444034436601E-2,1,0,109864.75243403623,1.5707872246945609,26.448757612113916,1.5329783536044685,1.1126258710299242,0.45382970182412025,1.1599930658368298,0.53144806947022594,15.667538567592693,0.2680633098072272,1.0938309816035265,0.82261466102059677,-9.0056046718353429,-145.80521359706563,34.194786402934369,null,101165,10234357225,null,24.411179222699314,-28.168815306006742,null,15.214723605100623,-132.72723342506001,null,0,0,null,0,0]
[102330,102.33,75.458427944254083,1.5575436087053891,1.0020648454171206,6.4207455601805283E-2,1,0,111129.93739499217,1.5707873283195672,26.752904358126703,1.5334084978111906,1.1150999759291931,0.45835726522998294,1.1634384902800019,0.53646427588111067,15.679899613132626,0.27100858044592463,1.0966169647142541,0.83230339075092274,-9.1272537843880048,-146.44342574088412,33.556574259115877,null,102330,10471428900,null,24.391745616965949,-28.403586070557136,null,15.093597518595532,-133.24933068385269,null,0,0,null,0,0]
[103520,103.52,76.335784043223597,1.5576959359823819,1.0021130980805295,6.4952040638591668E-2,1,0,112422.27224781533,1.5707874317603094,27.063582852651663,1.533837890949223,1.1176506666048767,0.46296119510603545,1.1669878939167857,0.54155741493519016,15.692661819780604,0.27401231425158046,1.0995218110436251,0.84219593781907132,-9.2508141626444775,-147.09576822805059,32.904231771949412,null,103520,10716390400,null,24.371761409063364,-28.642775334059273,null,14.970629639940299,-133.78219801008098,null,0,0,null,0,0]
[104710,104.71,77.213141873205046,1.5578448015326503,1.0021619062686511,6.5696553561211041E-2,1,0,113714.60710063967,1.5707875328499012,27.374266223853411,1.5342575373954157,1.1202249390210246,0.46754406212637295,1.1705673852590071,0.54661953589925949,15.7055610395948,0.27701121799085349,1.1024870657408943,0.85208373068031296,-9.3736978215025424,-147.74849606881935,32.25150393118065,null,104710,10964184100,null,24.351644291044803,-28.881316094419354,null,14.848398511615162,-134.3145987298243,null,0,0,null,0,0]
[105930,105.93,78.112619703767265,1.5579939483683325,1.002212521538806,6.6459760000140797E-2,1,0,115039.52182370446,1.5707876341301137,27.692786839765613,1.5346779880635335,1.1228884202457943,0.47222054842143124,1.1742680628612239,0.55177709911954487,15.718927334921567,0.28008066875028081,1.1055905238386994,0.8622152012492974,-9.499007289340847,-148.41802220046651,31.58197779953349,null,105930,11221164900,null,24.330884235540182,-29.12517477650772,null,14.723821528070014,-134.85990621067569,null,0,0,null,0,0]
[107150,107.15,79.0120992323656,1.5581396994101784,1.0022637205226275,6.7222888909267073E-2,1,0,116364.43654677039,1.5707877331039917,28.011312239839175,1.5350888766505892,1.1255763419735454,0.47687480082370948,1.1779997797934869,0.55690212126297012,15.73243691875571,0.28314495928115968,1.1087589689026427,0.87234032525107841,-9.6236662281065861,-149.08783721164878,30.912162788351225,null,107150,11481122500,null,24.309988948554544,-29.368307285121805,null,14.599960532532606,-135.40465993748683,null,0,0,null,0,0]
[108400,108.4,79.933698811267647,1.5582856322868932,1.002316783824879,6.8004701953470748E-2,1,0,117721.93114007681,1.5707878322009809,28.337675025092736,1.5355002884166207,1.1283555268695917,0.48162039743011265,1.1818551463945901,0.5621194595427611,15.74642693724666,0.28627920566997972,1.1120735137389883,0.88270711550295777,-9.750746232850263,-149.77436109422172,30.225638905778283,null,108400,11750560000,null,24.288441946077782,-29.6166434622277,null,14.473767169067637,-135.9622000167808,null,0,0,null,0,0]
[109650,109.65,80.855300053663953,1.5584282384354913,1.0023704597097753,6.8786431744915888E-2,1,0,119079.42573338437,1.5707879290385769,28.664042497548362,1.5359023316184404,1.1311599979066207,0.48634256854751007,1.1857424741122984,0.56730272919525826,15.760566591941343,0.28940794723104607,1.1154578676641589,0.89306575052476667,-9.8772039612819285,-150.46106293232501,29.538937067674993,null,109650,12023122500,null,24.266757781528305,-29.864174107415348,null,14.348267159193384,-136.51908699836099,null,0,0,null,0,0]
[110925,110.925,81.79533497632714,1.5585703861224274,1.0024258400929524,6.9583709388302495E-2,1,0,120464.07021855918,1.5707880255645115,28.99694198407531,1.5363030921191714,1.1340464135881043,0.4911350128224945,1.1897401498135562,0.57255462570307458,15.775142778068661,0.29259354741169119,1.1189826492530317,0.90362235865846219,-10.005579820914615,-151.16161626060168,28.838383739398324,null,110925,12304355625,null,24.244501145094581,-30.115804583452338,null,14.220942563582801,-137.08639990950627,null,0,0,null,0,0]
[112200,112.2,82.735371514186966,1.5587093036575403,1.0024818575991221,7.0380898436504219E-2,1,0,121848.71470373511,1.5707881198966749,29.329846022051509,1.5366947551371719,1.1369587429097472,0.49590301436936784,1.1937704211111353,0.57777120358529255,15.789873797943676,0.29577332951110463,1.1225817214266745,0.91416885565758876,-10.133367982327526,-151.86222117880092,28.137778821199078,null,112200,12588840000,null,24.222106898436699,-30.366555715998619,null,14.094281932779962,-137.65295349737733,null,0,0,null,0,0]
[113510,113.51,83.701214601728694,1.5588487846262211,1.0025400763260144,7.1199877779734758E-2,1,0,123271.36903752481,1.5707882146111201,29.671893181802552,1.5370880159022957,1.1399778001976373,0.50077641379215998,1.1979449315451685,0.58309427326594065,15.805170011736609,0.29903429266396653,1.1263578391003661,0.92499345599912586,-10.264081804966466,-152.58204116756897,27.417958832431026,null,113510,12884520100,null,24.198957273110281,-30.623254179747704,null,13.964807183190636,-138.23422502347978,null,0,0,null,0,0]
[114820,114.82,84.667059280520405,1.5589850833220698,1.0025989674054132,7.2018761461053779E-2,1,0,124694.02337131559,1.5707883071643403,30.013944825838806,1.5374723131928092,1.1430237885861421,0.50562395406614613,1.2021531495329281,0.58838022432773263,15.820628747760168,0.30228901841353495,1.1302141444398657,0.93580558806339764,-10.394234835823974,-153.30177111555844,26.698228884441562,null,114820,13183632400,null,24.175667855451334,-30.878984468843186,null,13.835976037461254,-138.81460532013736,null,0,0,null,0,0]
[116155,116.155,85.651337691027464,1.5591208206452705,1.0026596739593798,7.2853173156290973E-2,1,0,126143.82759697366,1.5707883993360661,30.362528629562117,1.5378550362366614,1.1461553911433118,0.51053737910901087,1.2064759904252396,0.59372896235288053,15.836549209736072,0.30559939112108686,1.1342274514060808,0.94681027710294297,-10.526324173607779,-154.03506791446625,25.964932085533746,null,116155,13491984025,null,24.151793022435527,-31.138579852965591,null,13.705320137379328,-139.40509646486026,null,0,0,null,0,0]
[117490,117.49,86.63561764377009,1.5592534737076134,1.0027210785231915,7.3687483237060647E-2,1,0,127593.6318226328,1.5707884894131581,30.711116779735118,1.5382290710980946,1.1493145127148856,0.51542391051412351,1.2108331003594295,0.59903935717364698,15.852637455987109,0.30890318751148105,1.138325868871656,0.95780007808429846,-10.657889465231559,-154.7681176902222,25.231882309777802,null,117490,13803900100,null,24.127778788036196,-31.397132021318445,null,13.575276517870382,-139.99456369363264,null,0,0,null,0,0]
[118860,118.86,87.645704237829847,1.559386506925716,1.0027848185095498,7.4543559771949375E-2,1,0,129081.44589690577,1.5707885797481149,31.068848310519858,1.5386041858692987,1.1525848310521549,0.52041058097439363,1.2153396835551131,0.60444923173122311,15.869321397008408,0.31228671209617814,1.142621175189346,0.96906148536200765,-10.792388180421186,-155.52004802153741,24.479951978462594,null,118860,14127699600,null,24.102993073010506,-31.661359875405164,null,13.442432200990497,-140.59836747225626,null,0,0,null,0,0]
[120230,120.23,{"$f":"SQRT(1+(A589/pole1)^2)","v":88.655792347683615},{"$f":"ATAN(A589/pole1)","v":1.5595165087531289},{"$f":"SQRT(1+(A589/Zero1)^2)","v":1.0028492933101096},{"$f":"ATAN(A589/Zero1)","v":7.5399526856995511E-2},{"$f":"IF(VIN_nom>Vout, 1, SQRT(1+(A589/z_RHP)^2))","v":1},{"$f":"IF(VIN_nom>Vout, 0, -ATAN(A589/z_RHP))","v":0},{"$f":"SQRT(1+(A589/Pole2)^2)","v":130569.25997117977},{"$f":"ATAN(A589/Pole2)","v":1.5707886680243694},31.426584113508206,1.5389707606612164,{"$f":"SQRT(1+(A589/pole4)^2)","v":1.1558836479852879},{"$f":"ATAN(A589/pole4)","v":0.5253689108814581},{"$f":"IF(VOUT_setting=1,1,SQRT(1+(A589*zterm1)^2))","v":1.2198815723761207},{"$f":"IF(VOUT_setting=1,0,ATAN(((A589*zterm1))))","v":0.60981897815512776},15.886180943998603,{"$f":"IF(VOUT_setting=1,0,ATAN(A589*$Q$4/(1+Afbr-$Q$5*(A589)^2)))","v":0.31566320808337367},{"$f":"SQRT((1-(Z589/pterm2))^2+(A589/pterm1)^2)","v":1.1470080393576381},{"$f":"IF((ATAN((A589/pterm1)/(1-A589^2/pterm2))>0),ATAN((A589/pterm1)/(1-A589^2/pterm2)),PI()+ATAN((A589/pterm1)/(1-A589^2/pterm2)))","v":0.98030509755385897},{"$f":"20*LOG10(((E589*K589*G589*O589)/(C589*I589*S589*M589*Q589))*Adc)","v":-10.926392715588607},{"$f":"((F589+L589+H589+P589)-(D589+J589+T589+N589+R589))*radconv","v":-156.27155321111178},{"$f":"IF(V589>0,V589,V589+180)","v":23.72844678888822},null,{"$f":"IF(U589<0,A589,1000000000)","v":120230},{"$f":"A589^2","v":14455252900},null,{"$f":"20*LOG10((K589/(I589*M589))*AEA)","v":24.078066715153902},{"$f":"(L589-(J589+N589))*radconv","v":-31.924453122218118},null,{"$f":"20*LOG10((E589*G589/(C589*S589))*Acs*Am)","v":13.310177162439627},{"$f":"(F589+H589-(D589+T589))*radconv","v":-141.20098425268424},null,{"$f":"SUM((U590<0)*(U589>0))*A589","v":0},0,null,0,0]
[126030,{"$f":"A590/1000","v":126.03},92.932093431042787,1.5600355738374685,1.0031303895746624,7.9022088222292494E-2,1,0,136868.03488417523,1.5707890204870296,32.941130178229699,1.5404344766872158,1.1701595734961407,0.54604649634163749,1.2394921455286623,0.63211097568950991,15.95948965180148,0.32987884141325657,1.1666162120965826,1.0276837418766238,-11.48884400354299,-159.44648457344061,20.553515426559386,null,126030,15883560900,null,23.971051868793772,-33.025346944792858,null,12.756208449570156,-143.73776337569541,null,0,0,null,{"$f":"SUM((V591<-183)*(V590>-183))*A590","v":0},{"$f":"IF(AK590>0,U590,0)","v":0}]
[131830,131.83000000000001,97.208417350013008,1.560508970352287,1.00342464239381,8.2642572454555835E-2,1,0,143166.8097971862,1.5707893419357564,34.455740613626929,1.5417695108855536,1.1849236368598737,0.56621724802245221,1.2596993106450489,0.65369823593238052,{"$f":"IF(VOUT_setting=1,1,SQRT((1+Afbr-$Q$5*(A591)^2)^2+(A591*$Q$4)^2))","v":16.035892708654131},0.34396391440453744,1.1879517535277553,1.0746417289787595,-12.044745943319137,-162.60604607533523,17.393953924664771,null,131830,17379148900,null,23.861801977645392,-34.104572479528137,null,12.210576995491094,-146.24794300997883,null,0,0,null,0,0]
[144540,144.54,106.57953153238685,1.5614135245006622,1.0041154100051024,9.0568709391718114E-2,1,0,156969.81482212257,1.570789956143309,37.775013845943164,1.5443207088103574,1.2188966940288477,0.60866149048033202,1.3059305350734873,0.69860906362239361,16.213924939290873,0.37435676725091799,1.2410531700777196,1.1756764731948564,-13.246981406171281,-169.44652304117452,10.553476958825485,null,144540,20891811600,null,23.615656143348925,-36.390310757313181,null,11.037323994944002,-151.63450038460078,null,0,0,null,0,0]
[158490,158.49,116.86498425489009,1.5622393393435012,1.0049460758257571,9.9254975818170832E-2,1,0,172119.45448369483,1.5707905168764129,41.418354050786739,1.5466500949382955,1.2585658464781813,0.65252170091365913,1.3594840534865722,0.74428395261377089,16.425619847068599,0.40693724379134605,1.3099182602924999,1.282828058320407,-14.551371436681197,-176.76480445595519,3.2351955440448137,null,158490,25119080100,null,23.336963061946303,-38.769883840070662,null,9.7752184063473013,-157.32346328612422,null,0,0,null,158490,-14.551371436681197]
[173780,173.78,128.13850643209668,1.5629921922012502,1.0059434775958762,0.10875834394662852,1,0,188724.3283493694,1.5707910280609774,45.411878594985858,1.5487738765703885,1.3046460398991604,0.69743603467833237,1.4211781111454627,0.79028677965398197,16.676487075829598,0.44167456532465132,1.3987733778864186,1.3947254016659152,-15.971652627276907,-184.48096379294199,-4.4809637929419921,null,173780,30199488400,null,23.024201987415147,-41.221631171821663,null,8.4138665250075348,-163.23334121172476,null,0,0,null,0,0]
[190550,190.55,140.50332193182558,1.5636789972611147,1.0071416673127076,0.11915890139575827,1,0,206936.47581359991,1.5707914943940544,49.792153427301812,1.5507114907762225,1.3579937477176061,0.74309158381283058,1.491997834655534,0.83626115467578432,16.973280606833807,0.47856750129668069,1.5128604971432678,1.5097697260779726,-17.521768651353671,-192.50051278261034,-12.500512782610343,null,190550,36309302500,null,22.675746202677093,-43.72651105404109,null,6.9430370254598621,-169.2683384492255,null,0,0,null,0,0]
[208930,208.93,154.05528202354975,1.5643051048805323,1.0085797033967259,0.13052820707101837,1,0,226897.07631409349,1.5707919195102535,54.593134147841695,1.5524779806371363,1.4194540688400568,0.78908329853646808,1.57289225895781,0.88178876485254898,17.323232353037717,0.51752113413913969,1.6582145260063168,1.6258795527698497,-19.209425381875292,-200.69485784848553,-20.694857848485526,null,208930,43651744900,null,22.290980073817593,-46.260454146951666,null,5.3587935672812659,-175.30540157849089,null,0,0,null,0,0]
[229090,229.09,168.91973127073371,1.5648763206856051,1.0103064649550844,0.14295955510421102,1,0,248790.7491155446,1.5707923073528411,59.859225903425788,1.5540896870905461,1.4900160478324882,0.83505931530914979,1.6649832749302218,0.9265367099954146,17.734972571127294,0.55844781022982437,1.8420847654003198,1.741020769469203,-21.03947193391852,-208.93539547660998,-28.935395476609983,null,229090,52482228100,null,21.869342852540736,-48.80236411390257,null,3.6601980435187746,-181.22297182898853,null,0,0,null,0,0]
[251190,251.19,185.21464150199287,1.5653971593726643,1.0123781243114722,0.15653611059595224,1,0,272791.25352590129,1.5707926609882146,65.632223110081128,1.5555593189950554,1.5706415103882021,0.88060786246686162,1.769344222639085,0.97014350685090234,18.217585111269752,0.60115467945636558,2.0726490418379599,1.8531175318914077,-23.00898436858985,-217.08402341469977,-37.084023414699772,null,251190,63096416100,null,21.411416447553187,-51.32792018812615,null,1.853768594708475,-186.89760574791941,null,0,0,null,0,0]
[275420,275.42,203.08010468415932,1.5658721416176569,1.01486295529468,0.17135443245853282,1,0,299104.92872335215,1.5707929834865657,{"$f":"SQRT(1+(A599/Zero2)^2)","v":71.961757818006305},{"$f":"ATAN(A599/Zero2)","v":1.5568996097398216},1.6623969519465931,0.92536751680463736,1.8871773283120832,1.0123232207328621,18.781366185143703,0.64542382195459713,2.3595186789990281,1.9604951746863892,-25.111528419673178,-225.0219765478995,-45.021976547899499,null,275420,75856176400,null,20.918093599461805,-53.815684951786672,null,-5.0732709308509816E-2,-192.22807867601557,null,0,0,null,0,0]
[302000,302,222.67833305479616,1.566305529026204,1.0178437482784835,0.18752276574285442,1,0,327970.69375632628,1.5707932777419811,78.90530008615994,1.5581225676164259,1.7664602498139164,0.96902457133543107,2.0198239493630856,1.0528548572168501,19.437875794028706,0.69100531470370596,2.7140911625402113,2.0619569147626189,-27.338226177275011,-232.65440701196127,-52.654407011961268,null,302000,91204000000,null,20.390569766107404,-56.246996459893523,null,-2.0414903238748785,-197.13986218050078,null,0,0,null,0,0]
[331130,331.13,244.15679258904163,1.5667005865730113,1.0214141818139337,0.20512872903707269,1,0,359605.74775975966,1.5707935459717139,86.51509628125234,1.5592373930192873,1.8839216725592796,1.0112430799860517,2.1685148916128973,1.0915110606223981,20.198617643139897,0.73753697184681,3.1492160788783439,2.1566275273524163,-29.67496422644107,-239.89883450651189,-59.898834506511889,null,331130,109647076900,null,19.831272970971121,-58.602079403555415,null,-4.1024524990284581,-201.57797646996144,null,0,0,null,0,0]
[363080,363.08,267.71456271613818,1.5670609964665541,1.0256915947621452,0.22429151418149529,1,0,394303.30956581584,1.5707937906761886,94.861680019209999,1.5602544670909715,2.0161396404514331,1.0518132331695984,2.334825480189918,1.1281884045335886,21.077220066836883,0.78470347326951484,3.6808842418401664,2.2442322363045308,-32.110969936802661,-246.70814083247222,-66.708140832472225,null,363080,131827086400,null,19.242020018467439,-60.868317926535376,null,-6.2212119250592792,-205.5200598161974,null,0,{"$f":"IF(AH602>0,W602,0)","v":0},null,0,0]
[398110,398.11,293.54334987124719,1.567389668341685,1.0308103436415237,0.24511031994862817,1,0,432345.73804991192,1.570794013831192,104.01297345671325,1.5611819933821183,2.1644250589783485,1.0905287950667195,2.5202759138143027,1.1627879785436381,22.087322885561615,0.83211465919859029,4.3276401999959138,2.3247201536522164,-34.632957043472395,-253.04491964573546,-73.044919645735462,null,398110,158491572100,null,18.625499926865022,-63.033425671161652,null,-8.3839572353658234,-208.95767959227595,null,0,0,null,0,0]
[436520,436.52,321.86435405554255,1.5676894229199871,1.0369310537560774,0.26769076165472888,1,0,474058.83191445231,1.570794217352075,114.04734906900616,1.5620279264557477,2.330246439686722,1.1272568253295512,2.7265910958834718,1.1952741902939821,23.243810153869749,0.87939777346233305,5.1119791414906119,2.3983222392342332,-37.22940589659018,-258.88912363634086,-78.889123636340855,null,436520,190549710400,null,17.984246395767343,-65.089330063418032,null,-10.579306228711134,-211.89817912577186,null,0,0,null,0,0]
[478630,478.63,352.91352218761614,1.5679627676499288,1.0442412531478737,0.29212830862429479,1,0,519790.10977533535,1.5707944029414389,125.04840486975115,1.5627993382706631,2.5151512799017159,1.1619070677613133,2.955601149361748,1.2256433401581843,24.56219387551716,0.92618165958182985,6.0607598346151477,2.4654026243820613,-39.88903672592344,-264.22965954781478,-84.229659547814776,null,478630,229086676900,null,17.320945051552886,-67.030454708307261,null,-12.796955298914545,-214.35709528203313,null,0,0,null,0,0]
[524810,524.80999999999995,386.96366814199536,1.5682121019816508,1.0529642173797293,0.31852015381146959,1,0,569941.39003219362,1.5707945722285193,137.11280176684355,1.5635029971231826,2.7209020463773297,1.1944497735264055,3.2094086836574052,1.2539368937359228,26.059506891457424,0.97214258166013301,7.2067700412625415,2.5264339403105063,-42.602510501301694,-269.06515919770663,-89.065159197706635,null,524810,275425536100,null,16.63792241618863,-68.854707421636462,null,-15.029009599954819,-216.35607656725441,null,0,0,null,0,0]
[575440,575.44000000000005,424.29497934942083,1.568439473722238,1.063355704893217,0.34693557270361991,1,0,624925.35104140651,1.5707947266037725,150.33981371252386,1.5641446797733147,2.9493044218391828,1.224875609478042,3.4901746463989309,1.2802052056390434,27.753020619370272,1.0169708005160807,8.5888580250747353,2.5818833606858447,-45.359672002325944,-273.39704029425963,-93.397040294259625,null,575440,331131193600,null,15.937749660292022,-70.561222549183739,null,-17.267559769702739,-217.9180381984925,null,0,0,null,0,0]
[630960,630.96,465.23188355859736,1.568646859388694,1.0757173113253096,0.3774369846816864,1,0,685219.83089983475,1.5707948674092296,164.8443900500873,1.5647299624303874,3.2024341203049045,1.2532226620045965,3.8003963566919818,1.3045307579546745,29.661870460210633,1.0604270956891992,10.254433672657315,2.6322447287665374,-48.152212049664485,-277.23356542563579,-97.233565425635788,null,630960,398110521600,null,15.222505285453281,-72.151862863894507,null,-19.506724605131694,-219.06781218922131,null,0,0,null,0,0]
[691830,691.83,510.11355540789754,1.5688359777120431,1.0903921569020147,0.41004912318325032,1,0,751324.38761783286,1.5707949958118799,180.74670558331425,1.5652636942721549,3.4824610436733754,1.2795427336272314,4.1426892689194013,1.3269993088747731,31.805761332969894,1.1023089833963267,12.259893822221255,2.677969910121619,-50.971193323686634,-280.58548118292981,-100.58548118292981,null,691830,478628748900,null,14.494357146897842,-73.629318661046696,null,-21.740481829909108,-219.82996988392941,null,0,0,null,0,0]
[758580,758.58,559.33078323459824,1.5690084750214739,1.1077797765985962,0.44477732419398341,1,0,823814.59890298289,1.5707951129295423,198.18522305715445,1.5657505205135454,3.7918811379184003,1.3039182255058219,4.520069195517066,1.3477150923578112,34.206750798272985,1.1424877538080769,14.673970991420632,2.7195000724303235,-53.80929256222089,-283.46896166610952,-103.46896166610952,null,758580,575443616400,null,13.754965813818377,-74.998045092169207,null,-23.964323653027208,-220.22957692697889,null,0,0,null,0,0]
[831760,831.76,613.28910224872243,1.5691657737010121,1.1283268332289353,0.48157174085015059,1,0,903287.76237636129,1.5707952197279778,217.30363062936632,1.5661944546280564,4.1332893466417033,1.3264335737121991,4.9356731795795925,1.3667773222053212,36.887558369560587,1.1808701828608137,17.578222833775225,2.7572214785163154,-56.658315547854635,-285.90265766959379,-105.90265766959379,null,831760,691824697600,null,13.006125345124959,-76.262650088063339,null,-26.173170680164493,-220.29170205949256,null,0,0,null,0,0]
[912010,912.01,672.46040810690874,1.5693092498510188,1.1525478601219166,0.52035460691554181,1,0,990438.91526976565,1.570795317141515,238.26912945897408,1.5665993796788173,4.5097070957896568,1.3471938049061618,5.3931573150418828,1.384296924680849,39.874179669257963,1.2174327981106794,21.072245660970736,2.7915045653105448,-59.511950214240827,-287.91042286403621,-107.91042286403621,null,912010,831762240100,null,12.249059335556797,-77.428928803482734,null,-28.363436179470604,-220.0421042760855,null,0,0,null,0,0]
[1000000,1000,737.33871669794871,1.56944009758312,1.1810098116194299,0.56098211559387845,1,0,1085995.6746852347,1.5707954059809162,261.2567586070968,1.5669686652746058,4.9243051195701737,1.3662996627536554,5.8963578914950547,1.4003763891572458,43.19379693820202,1.2521807066195438,25.274498196283378,2.822669950419904,-62.363223000121181,-289.5189347987727,-109.5189347987727,null,1000000,1000000000000,null,11.485114078950724,-78.502460407396811,null,-30.530986241517027,-219.50746155254922,null,0,0,null,0,0]
[]
[]
["Pole/Zero Locations for Chart"]
[{"$f":"U4*1000","v":38683.5},null,{"$f":"SQRT(1+(A617/pole1)^2)","v":28.54034045795607},{"$f":"ATAN(A617/pole1)","v":1.5357510291997962},{"$f":"SQRT(1+(A617/Zero1)^2)","v":1.0002953365081122},{"$f":"ATAN(A617/Zero1)","v":2.4300775298266009E-2},{"$f":"IF(VIN_nom>Vout, 1, SQRT(1+(A617/z_RHP)^2))","v":1},{"$f":"IF(VIN_nom>Vout, 0, -ATAN(A617/z_RHP))","v":0},{"$f":"SQRT(1+(A617/Pole2)^2)","v":42010.113693570354},{"$f":"ATAN(A617/Pole2)","v":1.5707725230030909},{"$f":"SQRT(1+(A617/Zero2)^2)","v":10.15560560472464},{"$f":"ATAN(A617/Zero2)","v":1.4721687200435378},{"$f":"SQRT(1+(A617/pole4)^2)","v":1.0172461757084239},{"$f":"ATAN(A617/pole4)","v":0.18440125068295737},{"$f":"IF(VOUT_setting=1,1,SQRT(1+(A617*zterm1)^2))","v":1.0249533833466546},{"$f":"IF(VOUT_setting=1,0,ATAN(((A617*zterm1))))","v":0.22111221043900653},{"$f":"IF(VOUT_setting=1,1,SQRT((1+Afbr-$Q$5*(A617)^2)^2+(A617*$Q$4)^2))","v":15.20493457823485},{"$f":"IF(VOUT_setting=1,0,ATAN(A617*$Q$4/(1+Afbr-$Q$5*(A617)^2)))","v":0.10455066274196972},{"$f":"SQRT((1-(A617^2/(pole3^2)))^2+(A617/(Q*pole3))^2)","v":1.0102247319409905},{"$f":"ATAN((A617/(Q*pole3))/(1-A617^2/pole3^2))","v":0.30831228664348093},{"$f":"20*LOG10(((E617*K617*G617*O617)/(C617*I617*S617*M617*Q617))*Adc)","v":1.5490932094506051E-2},{"$f":"((F617+L617+H617+P617)-(D617+J617+T617+N617+R617))*radconv","v":-113.80122383730661},{"$f":"IF(V617>0,V617,V617+180)","v":66.198776162693392},"crossover",null,null,null,{"$f":"20*LOG10((K617/(I617*M617))*AEA)","v":25.225742478596231},{"$f":"(L617-(J617+N617))*radconv","v":-16.214995173117643},null,{"$f":"20*LOG10((E617*G617/(C617*S617))*Acs*Am)","v":24.235957216444447},{"$f":"(F617+H617-(D617+T617))*radconv","v":-104.26471340837328}]
[{"$f":"A617","v":38683.5},null,null,null,null,null,null,null,null,null,null,null,null,null,null,null,null,null,null,null,null,-180]
[{"$f":"A618","v":38683.5}]
[1000000,null,null,null,null,null,null,null,null,null,null,null,null,null,null,null,null,null,null,null,null,{"$f":"V617","v":-113.80122383730661}]
[]
[{"$f":"pole1","v":1356.230043307482},null,1.4142135623730951,0.78539816339744828,1.0000003630750305,8.5214426089126019E-4,{"$f":"IF(VIN_nom>Vout, 1, SQRT(1+(A622/z_RHP)^2))","v":1},{"$f":"IF(VIN_nom>Vout, 0, -ATAN(A622/z_RHP))","v":0},1472.8603003850174,1.5701173757249494,1.0609165120009487,0.3405196590326614,1.0000213812094403,{"$f":"ATAN(A622/pole4)","v":6.5392397851640671E-3},{"$f":"IF(VOUT_setting=1,1,SQRT(1+(A622*zterm1)^2))","v":1.0000310543846591},{"$f":"IF(VOUT_setting=1,0,ATAN(((A622*zterm1))))","v":7.8808097343868351E-3},{"$f":"IF(VOUT_setting=1,1,SQRT((1+Afbr-$Q$5*(A622)^2)^2+(A622*$Q$4)^2))","v":15.124393170990691},{"$f":"IF(VOUT_setting=1,0,ATAN(A622*$Q$4/(1+Afbr-$Q$5*(A622)^2)))","v":3.6783282023001218E-3},{"$f":"SQRT((1-(A622^2/(pole3^2)))^2+(A622/(Q*pole3))^2)","v":1.0000117731297802},{"$f":"ATAN((A622/(Q*pole3))/(1-A622^2/pole3^2))","v":1.0747744325369747E-2},{"$f":"20*LOG10(((E622*K622*G622*O622)/(C622*I622*S622*M622*Q622))*Adc)","v":35.664078574432509},{"$f":"((F622+L622+H622+P622)-(D622+J622+T622+N622+R622))*radconv","v":-116.15162230320109},63.848377696798906,"p1",null,null,null,{"$f":"20*LOG10((K622/(I622*M622))*AEA)","v":34.857431737112663},{"$f":"(L622-(J622+N622))*radconv","v":-70.825430587234578},null,{"$f":"20*LOG10((E622*G622/(C622*S622))*Acs*Am)","v":50.420536193391371},{"$f":"(F622+H622-(D622+T622))*radconv","v":-45.566976171511854}]
[{"$f":"Zero1","v":1591549.4327375637},null,1173.510363115138,1.5699441825340053,1.4142135623730951,0.78539816339744828,1,0,1728415.8000002892,1.57079574823041,415.80120249946367,1.5683913290267522,7.7388532830924488,1.4412158876451755,{"$f":"IF(VOUT_setting=1,1,SQRT(1+(A623*zterm1)^2))","v":9.3023063032776978},{"$f":"IF(VOUT_setting=1,0,ATAN(((A623*zterm1))))","v":1.46308796904677},{"$f":"IF(VOUT_setting=1,1,SQRT((1+Afbr-$Q$5*(A623)^2)^2+(A623*$Q$4)^2))","v":66.219901766763329},{"$f":"IF(VOUT_setting=1,0,ATAN(A623*$Q$4/(1+Afbr-$Q$5*(A623)^2)))","v":1.4025725706981065},63.589093181509554,-0.19966766777133255,-76.526271444183067,-112.75713507152842,67.242864928471576,"z1",null,null,null,{"$f":"20*LOG10((K623/(I623*M623))*AEA)","v":7.558442403106957},{"$f":"(L623-(J623+N623))*radconv","v":-82.71335089633277},null,-41.016156005005698,-33.511061100088959]
[{"$f":"Pole2","v":0.92081398048870167},null,1.0000002304873219,6.7895106994715572E-4,1.0000000000001674,5.7856448662404515E-7,1,0,1.4142135623730951,0.78539816339744828,1.0000000289362676,2.4056710889756202E-4,1.0000000000098563,4.4398878167980595E-6,1.0000000000143157,5.3507957980433502E-6,15.124293785356549,2.4974160316886973E-6,1.0000000000054268,7.2971390524780652E-6,98.513755939431164,-45.025593448406035,134.97440655159397,"p2",null,null,{"$f":"Pole2","v":0.92081398048870167},{"$f":"20*LOG10((K624/(I624*M624))*AEA)","v":94.696924695242046},{"$f":"(L624-(J624+N624))*radconv","v":-44.986470958208457},null,53.430933253873228,-3.9285976815721713E-2]
[{"$f":"Zero2","v":3827.6802134140539},null,2.9942185406591948,1.2302766677622352,1.0000028920141022,2.4049977681445444E-3,1,0,4156.8442761277101,1.5705557596859991,1.4142135623730951,0.78539816339744828,1.000170296022973,1.8453826660347249E-2,1.0002473321314984,2.2238757366475785E-2,15.125085408406338,1.0381012342928113E-2,1.0000938318448109,3.0334876052269963E-2,22.63283710795552,-117.45406913748286,62.545930862517139,"z2",null,null,{"$f":"Zero2","v":3827.6802134140539},{"$f":"20*LOG10((K625/(I625*M625))*AEA)","v":28.340770205681011},{"$f":"(L625-(J625+N625))*radconv","v":-46.043542956086831},null,43.904475495736705,-72.089924926563882]
[{"$f":"pole3","v":200000},null,147.47099825277891,1.564015280516958,1.0078647563069434,0.12500843621459273,1,0,217199.13493925685,1.5707917227249941,52.26053727924613,1.5516602618753841,1.3892268484394479,0.76724636986542005,1.5331932218033837,0.8602690958699768,17.150076356419977,0.49879021110621569,1.5849322897074409,{"$error":"#DIV/0!"},-18.391272874909131,{"$error":"#DIV/0!"},{"$error":"#DIV/0!"},"p3",null,null,null,{"$f":"20*LOG10((K626/(I626*M626))*AEA)","v":22.478076623010821},{"$f":"(L626-(J626+N626))*radconv","v":-45.056130854108467},null,6.1246337630700562,{"$error":"#DIV/0!"}]
[{"$f":"Fp2_u","v":207395.77630741132},null,{"$f":"SQRT(1+(A627/pole1)^2)","v":152.92406454449866},{"$f":"ATAN(A627/pole1)","v":1.5642570870097325},{"$f":"SQRT(1+(A627/Zero1)^2)","v":1.00845468658514},{"$f":"ATAN(A627/Zero1)","v":0.1295804391497212},1,0,{"$f":"SQRT(1+(A627/Pole2)^2)","v":225230.91601995961},{"$f":"ATAN(A627/Pole2)","v":1.5707918869070798},{"$f":"SQRT(1+(A627/Zero2)^2)","v":54.192378521162354},{"$f":"ATAN(A627/Zero2)","v":1.5523425001345494},{"$f":"SQRT(1+(A627/pole4)^2)","v":1.4142135623730951},0.78539816339744828,1.5660210110867361,0.87816934014603276,17.293070125258776,0.51432933096510869,1.6452665236098902,-1.5249973397338108,-19.069140481917621,-20.035580628426132,{"$f":"IF(V627>0,V627,V627+180)","v":159.96441937157385},"p4",null,null,null,null,null,null,5.4898211538804684,5.1749944529835528]
[{"$f":"z_RHP","v":0},null,{"$f":"SQRT(1+(A628/pole1)^2)","v":1},{"$f":"ATAN(A628/pole1)","v":0},{"$f":"SQRT(1+(A628/Zero1)^2)","v":1},{"$f":"ATAN(A628/Zero1)","v":0},1,0,{"$f":"SQRT(1+(A628/Pole2)^2)","v":1},{"$f":"ATAN(A628/Pole2)","v":0},{"$f":"SQRT(1+(A628/Zero2)^2)","v":1},{"$f":"ATAN(A628/Zero2)","v":0},{"$f":"SQRT(1+(A628/pole4)^2)","v":1},0,1,0,15.124293785310735,0,1,0,101.52405764675422,0,{"$f":"IF(V628>0,V628,V628+180)","v":180},"z_RHP",null,null,null,null,null,null,53.430935255906121,0]
[{"$f":"Fp2_u","v":207395.77630741132},null,null,null,null,null,null,null,null,null,null,null,null,null,null,null,null,null,null,null,-25]
[]
[null,null,null,"System","Plant"]
["p1","p-dom",{"$f":"pole1","v":1356.230043307482},{"$f":"U622","v":35.664078574432509},{"$f":"AE622","v":50.420536193391371}]
["z1","ESR zero",{"$f":"Zero1","v":1591549.4327375637},{"$f":"U623","v":-76.526271444183067},{"$f":"AE623","v":-41.016156005005698}]
["p2","EA pole",{"$f":"Pole2","v":0.92081398048870167},{"$f":"U624","v":98.513755939431164},{"$f":"AE624","v":53.430933253873228}]
["z2","EA zero",{"$f":"Zero2","v":3827.6802134140539},{"$f":"U625","v":22.63283710795552},{"$f":"AE625","v":43.904475495736705}]
["p3","p_sampling",{"$f":"pole3","v":200000},{"$f":"U626","v":-18.391272874909131},{"$f":"AE626","v":6.1246337630700562}]
[]
[]
[{"$f":"U4*1000","v":38683.5}]
[{"$f":"U4*1000","v":38683.5}]
[]
[]
[]
[]
["Gain Margin"]
[{"$f":"AL7*1000","v":158490},0]
[{"$f":"AL7*1000","v":158490},{"$f":"AL9","v":-14.551371436681197}]
[]
[]
[]
[]
[]
[]
[]
[]
[]
[]
[]
[]
[]
[]
[]
[]
[]
[]
[]
[]
[]
[]
[]
[]
[]
[]
[]
[]
[]
[]
[]
[]
[]
[]
[]
[]
[]
[]
[]
[null,null,null,null,null,null,null,null,null,null,null,null,null,null,null,null,null,null,null,null,null,null,null,null,null,null,null,null,null,null,null,null,null,"phase margin",{"$f":"SUM(AI689:AI1306)","v":0}]

{"sheet":"Variable Management","index":7,"n_rows":454,"n_cols":30,"rows_kept":454,"cut":false,"hidden":true,"merged":[[4,4,4,7],[0,0,0,8]]}
["EXCEL Variables Names/Calculations"]
[null,"Input from user ="]
[null,"Output ="]
[null,"Constant"]
["Variable Name","Value","STD Units",null,"Notes",null,null,null,"Iteration"]
["Step 1: Operational Specs"]
["VIN_min",{"$f":"'Design Regulator'!E6","v":15},"V","Minimum input voltage",null,null,null,null,1]
["VIN_nom",{"$f":"'Design Regulator'!E7","v":48},"V","Nominal input voltage",null,null,null,null,null,null,{"$f":"CHOOSE(SCH_MODE, \"Efficiency vs. IOUT (Ch1)\", \"Efficiency vs. IOUT - 2 Ph\", \"Efficiency vs. IOUT - 3 Ph\", \"Efficiency vs. IOUT - 4 Ph\")","v":"Efficiency vs. IOUT (Ch1)"},1,null,"DITHER Enabled",1,null,null,null,null,"Dual  Outputs",1,null,"FPWM",1,null,"Internal Compensation",1,null,{"$f":"CHOOSE(SCH_MODE, \"Bode Plot (Ch1)\", \"Bode Plot - 2 Ph\", \"Bode Plot - 3 Ph\", \"Bode Plot - 4 Ph\")","v":"Bode Plot (Ch1)"},1]
["VIN_max",{"$f":"'Design Regulator'!E8","v":72},"V","Maximum input voltage",null,{"$f":"CHOOSE(GPN_setting,80,80,80,80,65,65,45)","v":80},"IC max voltage",null,null,null,{"$f":"IF(MODE=1, \"Efficiency vs. IOUT (Ch2)\", \"N/A - Do Not Use\")","v":"Efficiency vs. IOUT (Ch2)"},2,null,"DITHER Disabled",2,null,null,null,null,"Single Output – 2  Phases",2,null,"PFM",2,null,"External Compensation",2,null,{"$f":"IF(MODE=1, \"Bode Plot (Ch2)\", \"N/A - Do Not Use\")","v":"Bode Plot (Ch2)"},2]
[null,null,null,null,null,null,null,null,null,null,"PLOT_TYPE",1,null,"DITHER Yes/No",2,"1 = Yes, 2 = No",null,null,null,"Single Output – 3  Phases",3,null,"FPWM/PFM",2,null,"COMP_TYPE",2,null,"BODE_PLOT_TYPE",1]
["Vout",{"$f":"'Design Regulator'!E9","v":12},"V","Output voltage - channel 1",null,null,null,null,null,null,null,null,null,null,null,null,null,null,null,"Single Output – 4  Phases",4]
["Iout",{"$f":"'Design Regulator'!E10","v":8},"A","Output current - channel 1",null,{"$f":"CHOOSE(GPN_setting,10,8,6,4,10,6,10)","v":8},"IC max current",null,1,null,null,null,null,null,null,null,null,null,null,"Single/Dual Yes/No",1]
[null,null,null,null,null,null,null,null,1,null,"Adjustable",1,null,"3.3V",1,null,null,null,null,"MODE (Single/Dual), DUAL = 1, SINGLE = 2",{"$f":"IF(U12=1, 1, 2)","v":1},null,"BIAS connected to ext. power supply",1,null,"UVLO Divider",1]
["Rout",{"$f":"Vout/Iout","v":1.5},"W","Load resistance - Channel 1",null,null,null,null,null,null,"5V",2,null,"5V",2,null,null,null,null,"SINGLE OUTPUT (1 = YES)",{"$f":"IF(U12=1, 2, 1)","v":2},null,"BIAS connected to VOUT",2,null,"No UVLO Divider",2]
[null,null,null,null,null,null,null,null,null,null,"3.3V",3,null,"Adjustable",3,null,null,null,null,"Number of Phases",{"$f":"SCH_MODE","v":1},null,"BIAS connected to GND",3,null,"UVLO_TYPE",2]
["Pout",{"$f":"Vout*Iout","v":96},"W","Output power",null,null,null,null,null,null,"12V",4,null,"Ch2 Output Setting",{"$f":"IF(Vout2=3.3, 1, IF(Vout2=5, 2, 3))","v":3},null,null,null,null,null,null,null,"Ext_VCC",1]
[null,null,null,null,null,null,null,null,null,null,"Output Voltage Setting",{"$f":"IF(Vout=3.3, 3, IF(Vout=5, 2,  IF(Vout=12,4,1)))","v":4},null,null,null,null,null,null,null,null,null,null,"BIAS pin connection",{"$f":"IF(AND(VOUT_setting=3,Ext_VCC=1),\"Connect BIAS pin to an external bias supply from 5V to 30V\", IF(AND(VOUT_setting=3,Ext_VCC=2), \"BIAS pin cannot be connected to VOUT. Connect BIAS pin to an external bias supply from 5V to 30V\", IF(AND(VOUT_setting=2,Ext_VCC=2),\"Connect BIAS pin to VOUT\", IF(AND(VOUT_setting=2,Ext_VCC=1),\"Connect BIAS pin to an external bias supply from 5V to 30V\",IF(AND(VOUT_setting=4,Ext_VCC=2),\"Connect BIAS pin to VOUT\",IF(AND(VOUT_setting=4,Ext_VCC=1),\"Connect BIAS pin to an external bias supply from 10V to 30V\",IF(AND(VOUT_setting=1,Ext_VCC=2),\"Connect BIAS pin to VOUT. If VOUT < 5V, connect BIAS pin to an external bias supply from 10V to 30V\", IF(AND(VOUT_setting=1,Ext_VCC=1),\"Connect BIAS pin to an external bias supply from 10V to 30V\",\"\"))))))))","v":"Connect BIAS pin to an external bias supply from 10V to 30V"}]
["Efficiency",0.9,null,"Estimate of efficiency"]
["Pin",{"$f":"Pout/Efficiency","v":106.66666666666666},"W","Calculate input power assuming finite efficiency"]
[]
["Iin_Vinmin",{"$f":"Pin/VIN_min","v":7.1111111111111107},"A",null,null,null,null,null,null,null,null,{"$f":"Vout","v":12}]
["Iin_Vinnom",{"$f":"Pin/VIN_nom","v":2.2222222222222219},"A","Input currents at min, nom, max Vin",null,null,null,{"$f":"AND(OSC=1, OR(Fsw/1000>2530, Fsw/1000<1800))","v":false}]
["Iin_Vinmax",{"$f":"Pin/VIN_max","v":1.4814814814814814},"A",null,null,null,null,{"$f":"AND(OSC=2, OR(Fsw/1000>500, Fsw/1000<300))","v":false}]
[null,null,null,null,null,null,null,{"$f":"OR(H22,H23)","v":false}]
["OSC setting",{"$f":"CHOOSE(OSC, 2200, 440)","v":{"$error":"#VALUE!"}},"kHz",null,null,null,null,null,null,null,null,"SetVout_IntComp_nEN",1,null,"LM708A0(-Q1)",1]
["Fsw",{"$f":"'Design Regulator'!E11*1000","v":400000},"Hz","Nominal switching frequency - determines RT resistor (SYNCIN must be 80-120% of this)",null,null,null,null,null,null,null,"SetVout_IntComp_EN",2,null,"LM70880(-Q1)",2]
["RT resistor to AGND",{"$f":"((1000000000/Fsw)-53)/45+0.1","v":54.477777777777781},"kΩ",null,null,null,null,null,null,null,null,"SetVout_ExtComp_nEN",3,null,"LM70860(-Q1)",3]
[null,null,"kΩ",null,null,null,null,null,1,null,null,"SetVout_ExtComp_EN",4,null,"LM70840(-Q1)",4]
["Tsw",{"$f":"1/Fsw","v":2.5000000000000002E-6},"sec","Switching period",null,null,null,null,null,null,null,"AdjVout_IntComp_nEN",5,null,"LM706A0(-Q1)",5]
["Vref",0.8,"V","Reference voltage",null,null,null,null,null,null,null,"AdjVout_IntComp_EN",6,null,"LM70660(-Q1)",6]
["Rt",{"$f":"'Standard Value Calculator'!S12/1000","v":54.9},"kΩ","Frequency set resistor",null,{"$f":"IF(OR((Fsw=440000),(Fsw=2200000)),\"N/A\",Rfadj/1000)","v":5.4899999999999997E-2},null,null,null,null,null,"AdjVout_ExtComp_nEN",7,null,"LM704A0(-Q1)",7]
[null,null,null,null,null,null,null,null,null,null,null,"AdjVout_ExtComp_EN",8,null,"GPN setting",2]
["Step 2: Buck Inductor","Channel 1",null,null,null,null,null,null,null,null,null,"SetVout_IntComp_nEN_BIAS_GND",9]
["Don1",{"$f":"Vout/VIN_nom","v":0.25},null,null,null,"Ideal Duty Cycle at VIN(nom)",null,null,null,null,null,"SetVout_IntComp_EN_BIAS_GND",10]
["Doff1",{"$f":"1-34:34","v":0.75},null,null,null,"Ideal 1- Duty Cycle at VIN(nom)",null,null,null,null,null,"SetVout_ExtComp_nEN_BIAS_GND",11]
[null,null,null,null,null,null,null,null,null,null,null,"SetVout_ExtComp_EN_BIAS_GND",12]
["D_Vinmin",{"$f":"Vout/VIN_min","v":0.8},null,null,null,null,null,null,null,null,null,"AdjVout_IntComp_nEN_BIAS_GND",13]
["D_Vinnom",{"$f":"Vout/VIN_nom","v":0.25},null,null,null,null,null,null,null,null,null,"AdjVout_IntComp_EN_BIAS_GND",14]
["D_Vinmax",{"$f":"Vout/VIN_max","v":0.16666666666666666},null,null,null,null,null,null,null,null,null,"AdjVout_ExtComp_nEN_BIAS_GND",15]
[null,null,null,null,null,null,null,null,null,null,null,"AdjVout_ExtComp_EN_BIAS_GND",16]
["L_Vinnom",{"$f":"(VIN_nom-Vout)*D1_Vinnom/(Fsw*(Iout/Number_of_Phases)*0.3)","v":9.3749999999999992E-6},"H",null,null,"Calculated inductance for 35% ripple at VIN(nom)",null,null,null,null,null,"PRE_schematic setting",{"$f":"IF(OR(Vout=3.3,Vout=5,Vout=12),CHOOSE(COMP_TYPE,IF(UVLO_TYPE=2,1,2),IF(UVLO_TYPE=2,3,4)),CHOOSE(COMP_TYPE,IF(UVLO_TYPE=2,5,6),IF(UVLO_TYPE=2,7,8)))","v":3}]
["L_slopecomp",{"$f":"1000*Vout*Rs/24/Fsw","v":6.2500000000000003E-6},"H",null,null,"Calculated inductance based on one times inductor downslope",null,null,null,null,null,"Schematic_setting",{"$f":"IF(Ext_VCC=3, PRE_schematic_setting+8, PRE_schematic_setting)","v":3}]
[]
["Lopt",{"$f":"B42","v":6.2500000000000003E-6},"H",null,null,"Slope comp"]
[]
["Lo",{"$f":"'Design Regulator'!E28/1000000","v":6.8000000000000001E-6},"H",null,null,"Chosen inductance"]
["Rdcr",{"$f":"'Design Regulator'!E29/1000","v":0.01},"W",null,null,"Chosen inductor DCR"]
[]
["Don2",{"$f":"(Vout+Iout*(Rdcr+Rs))/(Vin+Iout*Rs)","v":0.25228975853455454}]
["Doff2",{"$f":"1-_Don2","v":0.74771024146544551}]
[]
["D_Vinmin_2",{"$f":"CHOOSE(MODE, (Vout+Iout*(Rdcr+Rs))/(VIN_min+Iout*Rs), (Vout+Iout/Number_of_Phases*(Rdcr+Rs))/(VIN_min+Iout/Number_of_Phases*Rs))","v":0.80585106382978722},null,null,null,"Duty cycles adjusted for DCR/shunt voltage drops"]
["D_Vinnom_2",{"$f":"CHOOSE(MODE, (Vout+Iout*(Rdcr+Rs))/(VIN_nom+Iout*Rs), (Vout+Iout/Number_of_Phases*(Rdcr+Rs))/(VIN_nom+Iout/Number_of_Phases*Rs))","v":0.25228975853455454},null,null,null,"need to include RDS(on) later"]
["D_Vinmax_2",{"$f":"CHOOSE(MODE, (Vout+Iout*(Rdcr+Rs))/(VIN_max+Iout*Rs), (Vout+Iout/Number_of_Phases*(Rdcr+Rs))/(VIN_max+Iout/Number_of_Phases*Rs))","v":0.16823986674069957}]
[]
["Iripple_Vinmin",{"$f":"(VIN_min-Vout)*D1_Vinmin_2/(Fsw*Lf)","v":0.88880632040050045},"A"]
["Iripple_Vinnom",{"$f":"(VIN_nom-Vout)*D1_Vinnom_2/(Fsw*Lf)","v":3.3391291570749861},"A"]
["Iripple_Vinmax",{"$f":"(VIN_max-Vout)*D1_Vinmax_2/(Fsw*Lf)","v":3.7111735310448433},"A"]
[]
["Ishunt_rms_Vinmin",{"$f":"SQRT((Iout/Number_of_Phases)^2+(Iripple_Vinmin^2)/12)","v":8.0041134043439595},"A"]
["Ishunt_rms_Vinnom",{"$f":"SQRT((Iout/Number_of_Phases)^2+(Iripple_Vinnom^2)/12)","v":8.0578625346491464},"A"]
["Ishunt_rms_Vinmax",{"$f":"SQRT((Iout/Number_of_Phases)^2+(Iripple_Vinmax^2)/12)","v":8.0714146270316611},"A"]
["Max shunt power loss at full load",{"$f":"B61^2*Rs","v":0.32464574313651184},"W",null,null,"Note this is power loss at full load - not loss near OCP!"]
[]
["Max inductor ripple current",{"$f":"MAX(B56:B58)","v":3.7111735310448433},"A",null,null,"Ripple current at Vin(max)"]
[]
[null,{"$f":"B56/(Iout/Number_of_Phases)","v":0.11110079005006256}]
["% ripple current",{"$f":"B57/(Iout/Number_of_Phases)","v":0.41739114463437327}]
[null,{"$f":"B58/(Iout/Number_of_Phases)","v":0.46389669138060541}]
[]
["Inductor copper temerature",100,"°C"]
["DCR at hot",{"$f":"Rdcr*(1+0.0039*(B71-25))","v":1.2925000000000001E-2},"W"]
[]
[]
["Step 3: Sense Resistors, Slope Comp, Current Limit"]
[]
["Ilimit_DC",{"$f":"'Design Regulator'!E17","v":11.2},"A",null,null,"Chosen OCP level - based on output current"]
[]
["Ilimit_inductor_Vinmin",{"$f":"CHOOSE(MODE, Ilimit_DC+Iripple_Vinmin/2, Ilimit_DC/Number_of_Phases+Iripple_Vinmin/2)","v":11.64440316020025},"A",null,null,"Peak inductor current at current limit inception"]
["Ilimit_inductor_Vinnom",{"$f":"CHOOSE(MODE, Ilimit_DC+Iripple_Vinnom/2, Ilimit_DC/Number_of_Phases+Iripple_Vinnom/2)","v":12.869564578537492},"A"]
["Ilimit_inductor_Vinmax",{"$f":"CHOOSE(MODE, Ilimit_DC+Iripple_Vinmax/2, Ilimit_DC/Number_of_Phases+Iripple_Vinmax/2)","v":13.05558676552242},"A"]
[]
[]
["CS threshold_min",0.05,"V"]
["CS threshold",5.6000000000000001E-2,"V"]
["CS threshold_max",6.2E-2,"V"]
[]
["Shunt required to get OCP at VIN(min)",{"$f":"Buck_CS_threshold/B79","v":4.8091773558136541E-3},"W"]
["Shunt required to get OCP at VIN(nom)",{"$f":"Buck_CS_threshold/B80","v":4.3513515673553492E-3},"W"]
["Shunt required to get OCP at VIN(max)",{"$f":"Buck_CS_threshold/B81","v":4.2893514482157521E-3},"W"]
[]
["Rs_ideal",{"$f":"B89","v":4.3513515673553492E-3},"W",null,null,"Ideal Rs for the required OCP -- based on 73mV CL threshold"]
["Rs",{"$f":"'Design Regulator'!E19/1000","v":5.0000000000000001E-3},"W",null,null,"Selected (starndard value) current limit sense resistor"]
[]
["Current limit - peak",{"$f":"Buck_CS_threshold/Rs","v":11.2},"A",null,null,"Peak inductor current limit = min sat current"]
[]
["Iout_OCP_Vinmin",{"$f":"Number_of_Phases*(Buck_CS_threshold/Rs-Iripple_Vinmin/2)","v":10.755596839799749},"A",null,null,"Current limit setpoints (i.e. IOUT) after standard components are selected"]
["Iout_OCP_Vinnom",{"$f":"Number_of_Phases*(Buck_CS_threshold/Rs-Iripple_Vinnom/2)","v":9.5304354214625064},"A"]
["Iout_OCP_Vinmax",{"$f":"Number_of_Phases*(Buck_CS_threshold/Rs-Iripple_Vinmax/2)","v":9.3444132344775781},"A"]
[]
["Irms_OCP_Vinmin",{"$f":"SQRT((Iout_OCP_Vinmin/Number_of_Phases)^2+(Iripple_Vinmin^2)/12)","v":10.758656736317457},"A"]
["Irms_OCP_Vinnom",{"$f":"SQRT((Iout_OCP_Vinnom/Number_of_Phases)^2+(Iripple_Vinnom^2)/12)","v":9.5790577798638203},"A"]
["Irms_OCP_Vinmax",{"$f":"SQRT((Iout_OCP_Vinmax/Number_of_Phases)^2+(Iripple_Vinmax^2)/12)","v":9.4056255920667162},"A"]
[]
["Pshunt_Vinmin",{"$f":"B101^2*Rs","v":0.57874347384954494},"W",null,null,"Max power dissipations in shunt"]
["Pshunt_Vinnom",{"$f":"B102^2*Rs","v":0.45879173974984794},"W"]
["Pshunt_Vinmax",{"$f":"B103^2*Rs","v":0.44232896389070187},"W"]
[]
[]
["Step 4: Output Capacitor"]
["Icoutrms_VINmin",{"$f":"Iripple_Vinmin/SQRT(12)","v":0.25657628417033485},"A",null,null,"Output Cap RMS current"]
["Icoutrms_VINnom",{"$f":"Iripple_Vinnom/SQRT(12)","v":0.96392355884808578},"A"]
["Icoutrms_VINmax",{"$f":"Iripple_Vinmax/SQRT(12)","v":1.0713235185790773},"A"]
["Max Cout rms current",{"$f":"MAX(B111:B113)","v":1.0713235185790773},"A"]
[]
["Vripple1",{"$f":"'Design Regulator'!E33/1000","v":0.12},"V",null,null,"Output voltage ripple spec(pk-pk)"]
[]
["Output Ripple Spec (pk-pk)",{"$f":"Vo1_ripple*1000","v":120},"mV",null,null,"Vout ripple spec at Vin(nom)"]
[]
["Coutmin",{"$f":"Iripple_Vinnom/(Fsw*8*Vo1_ripple)","v":8.6956488465494438E-6},"F",null,null,"Minimum output capacitnace",null,{"$f":"Vo2_ripple","v":0},1]
["Reported Coutmin",{"$f":"IF(Cout_min*1000000<2, 2.2,Cout_min*1000000)","v":8.6956488465494441},"uF"]
["Cout",{"$f":"'Design Regulator'!E36/1000000","v":1E-4},"F",null,null,"Chosen output capacitance",null,null,1]
["Resrmax",{"$f":"SQRT((Vo1_ripple/Iripple_Vinnom)^2-(1/(Fsw*Cout*8))^2)","v":3.5801386420504407E-2},"W",null,null,"Max ESR before ripple exceeds Vripple1",null,null,1]
["Cout_min_loadoff",{"$f":"Lf*((Load_Step/100)*Iout)^2/((Vout+Vo1_ripple)^2-Vout^2)*1000000","v":37.589828634604878},"uF",{"$f":"IF(Load_Step=0, Cout_min*1000000, Cout_min_loadoff)","v":37.589828634604878}]
["Total COUT with stead-state+load step",{"$f":"Lf*((Load_Step/100)*Iout)^2/((Vout+Vo1_ripple)^2-Vout^2)*1000000 + (Cout_min*1000000)","v":46.285477481154324},"uF"]
[]
[]
["Reported Cout ESR max",{"$f":"IF(OR(CoutEsrMax>0.3, CoutEsrMax<0, (ISERROR(CoutEsrMax))), \"N/A\", CoutEsrMax*1000)","v":35.801386420504407},"mΩ"]
["CoutEsr",{"$f":"'Design Regulator'!E38/1000","v":1E-3},"W",null,null,"Chosen ESR",null,null,1,null,{"$f":"ISERROR(CoutEsrMax)","v":false},{"$f":"ISERROR(B128)","v":false}]
["Vripple",{"$f":"Iripple_Vinnom*SQRT(Cout_ESR^2+(1/(8*Fsw*Cout))^2)","v":1.0956020641164542E-2},"Vp-p",null,null,null,null,null,null,null,null,{"$f":"OR(CoutEsrMax>0.3,CoutEsrMax<0)","v":false}]
[null,null,null,null,null,null,null,null,null,null,{"$f":"OR(TRUE, FALSE, TRUE)","v":true}]
["Step 5: Input Capacitor"]
[null,null,null,null,null,null,null,null,null,null,"Two channels operating at full load"]
["Icinrms_VINmin",{"$f":"SQRT(D1_Vinmin_2*(Iout^2*(1-D1_Vinmin_2)+Iripple_Vinmin^2/12))","v":3.1727241303979556},"A",{"$f":"D1_Vinmax","v":0.16666666666666666},null,"Calculate input cap rms current with one output unloaded",null,null,null,null,{"$f":"SQRT(Iout^2*D1_Vinmin*(1-D1_Vinmin)+Iout2^2*D2_Vinmin*(1-D2_Vinmin)-2*Iout*Iout2*D1_Vinmin*D2_Vinmin)","v":{"$error":"#NAME?"}},"A",{"$f":"SQRT(Iout^2*D1_Vinmin*(1-D1_Vinmin)+Iout2^2*D2_Vinmin*(1-D2_Vinmin)-2*Iout*Iout2*(0.5-D2_Vinmin*(1-D1_Vinmin)))","v":{"$error":"#NAME?"}},"A"]
["Icinrms_VINnom",{"$f":"SQRT(D1_Vinnom_2*(Iout^2*(1-D1_Vinnom_2)+Iripple_Vinnom^2/12))","v":3.5081834906836318},"A",{"$f":"D1_Vinmin","v":0.8},null,null,null,null,null,null,{"$f":"SQRT(Iout^2*D1_Vinnom*(1-D1_Vinnom)+Iout2^2*D2_Vinnom*(1-D2_Vinnom)-2*Iout*Iout2*D1_Vinnom*D2_Vinnom)","v":{"$error":"#NAME?"}},"A"]
["Icinrms_VINmax",{"$f":"SQRT(D1_Vinmax_2*(Iout^2*(1-D1_Vinmax_2)+Iripple_Vinmax^2/12))","v":3.0247228507127821},"A",null,null,null,null,null,null,null,{"$f":"SQRT(Iout^2*D1_Vinmax*(1-D1_Vinmax)+Iout2^2*D2_Vinmax*(1-D2_Vinmax)-2*Iout*Iout2*D1_Vinmax*D2_Vinmax)","v":{"$error":"#NAME?"}},"A"]
["Icinrms - multiphase",{"$f":"Iout*SQRT((D1_Vinmin-F139/Number_of_Phases)*((F139+1)/Number_of_Phases-D1_Vinmin))","v":3.1999999999999997},"A",null,null,null,null,null,null,null,{"$f":"MAX(K134:K136)","v":{"$error":"#NAME?"}},"A"]
["Max Cin rms current",{"$f":"MAX(B134:B136)","v":3.5081834906836318},"A",null,null,{"$f":"Number_of_Phases*D1_Vinnom","v":0.25},"N*D"]
[null,null,null,null,null,{"$f":"FLOOR(Number_of_Phases*D1_Vinnom,1)","v":0},"floor(N*D)"]
["Icinrms - multiphase - max",{"$f":"Iout/2/Number_of_Phases","v":4},"A"]
["Final result",{"$f":"IF(D1_Vinmin<0.5, B138, B140)","v":4},"A","…report this"]
[]
["Vinripple1",{"$f":"'Design Regulator'!E43/1000","v":0.48},"Vp-p",null,null,"Input voltage ripple spec (pk-pk)"]
[]
["Cinmin_Vinmin",{"$f":"Iout/Number_of_Phases*D1_Vinmin*(1-D1_Vinmin)/(Vinripple1*Fsw)","v":6.6666666666666658E-6},"F"]
["Cinmin_Vinnom",{"$f":"Iout/Number_of_Phases*D1_Vinnom*(1-D1_Vinnom)/(Vinripple1*Fsw)","v":7.8125000000000002E-6},"F"]
["Cinmin_Vinmax",{"$f":"Iout/Number_of_Phases*D1_Vinmax*(1-D1_Vinmax)/(Vinripple1*Fsw)","v":5.7870370370370376E-6},"F",null,null,"Calculate cap at Vinmax and 50% duty cycle (Vin = 2*Vout)"]
[]
["Cinmin_50%D",{"$f":"Iout*0.5*(1-0.5)/(Vinripple1*Fsw)","v":1.0416666666666666E-5},"F",null,null,"Buck 50% typically worst case"]
["Cinmin",{"$f":"IF(D1_Vinmin<0.5, B145,B149)","v":1.0416666666666666E-5},"F",{"$f":"(VIN_min+VIN_max)/2","v":43.5}]
["Reported Cinmin",{"$f":"IF(Cinmin*1000000<2.2, 2.2,Cinmin*1000000)","v":10.416666666666666},"uF",{"$f":"2*Vout","v":24},null,"…report this"]
[]
["Cin",{"$f":"'Design Regulator'!E45/1000000","v":1.5E-5},"F",null,null,"Input capacitance"]
["CinEsrMax_Vinmax",{"$f":"-(Iout/Number_of_Phases*D1_Vinmax*(1-D1_Vinmax)/(Cin*Fsw)-Vinripple1)/(Iout/Number_of_Phases+Iripple_Vinmax/2)","v":2.9913471600306826E-2},"W"]
["CinEsrMax_50%D",{"$f":"-(Iout/Number_of_Phases*0.5*(1-0.5)/(Cin*Fsw)-Vinripple1)/(Iout/Number_of_Phases+Iripple_Vinmax/2)","v":1.4881576323770736E-2},"W",null,null,"Calculate ESR at Vinmax and 50% duty cycle (Vin = 2*Vout)"]
["CinEsrMax",{"$f":"IF(VIN_max<2*Vout, B154,B155)","v":1.4881576323770736E-2},"W"]
["Reported Cin ESR max",{"$f":"IF(OR(CinEsrMax>0.3, CinEsrMax<0), \"N/A\",CinEsrMax*1000)","v":14.881576323770737},"mΩ",null,null,"…report this"]
["RCinEsr",{"$f":"'Design Regulator'!E47/1000","v":1E-3},"W",null,null,"Input capacitance series resistance (ESR)"]
[]
["Vinripple2_Vinmin",{"$f":"Iout/Number_of_Phases*D1_Vinmin_2*(1-D1_Vinmin_2)/(Cin*Fsw)+(Iout/Number_of_Phases +Iripple_Vinmin/2)*RCinEsr","v":0.21705123883245017},"Vp-p"]
["Vinripple2_Vinnom",{"$f":"Iout/Number_of_Phases*D1_Vinnom_2*(1-D1_Vinnom_2)/(Cin*Fsw)+(Iout/Number_of_Phases +Iripple_Vinnom/2)*RCinEsr","v":0.26118907960937848},"Vp-p"]
["Vinripple2_Vinmax",{"$f":"Iout/Number_of_Phases*D1_Vinmax_2*(1-D1_Vinmax_2)/(Cin*Fsw)+(Iout/Number_of_Phases +Iripple_Vinmax/2)*RCinEsr","v":0.19643587207188404},"Vp-p"]
["Vinripple2_50%D",{"$f":"Iout/Number_of_Phases*0.5*(1-0.5)/(Cin*Fsw)+(Iout/Number_of_Phases +Iripple_Vinmax/2)*RCinEsr","v":0.34318892009885571},"Vp-p",null,null,"Calculate ripple at Vinmax and 50% duty cycle (Vin = 2*Vout)"]
["Vinripple2",{"$f":"IF(D1_Vinmin<0.5, B160,B163)","v":0.34318892009885571},"Vp-p",null,null,"…report highest of these"]
[]
[null,{"$f":"Iout*D1_Vinmax_2*(1-D1_Vinmax_2)/(Cin*Fsw)","v":0.18658028530636162},"Vp-p"]
[]
["Step 6a: Soft Start"]
["Tss",{"$f":"'Design Regulator'!E52/1000","v":0},"s","Soft-start time"]
["Iss",{"$f":"Cout*Vout/Tss","v":{"$error":"#DIV/0!"}},"A","Load cap current during soft start"]
["Css",{"$f":"0.000022*Tss/1.2","v":0},"F"]
["Css_u",{"$f":"'Standard Value Calculator'!B4","v":0},"F"]
[]
["Step 6b: Other Components - Dither, Hiccup, DEMB, MODE"]
["Tres",{"$f":"'Design Regulator'!E55/1000","v":5.0000000000000001E-3},"s","Hiccup time"]
["Cres",{"$f":"0.00002*Tres/1.2","v":8.3333333333333338E-8},"F"]
["Cres_u",{"$f":"'Standard Value Calculator'!G4","v":8.2000000000000006E-8},"F"]
[]
["RPG1/2",100,"kΩ"]
["RFB1/2",null,"W",null,"Tie to VDDA or AGND for 3.3V/5V output, respectively. "]
["R_MODE",null,"W",null,"Tie to VDDA or AGND for Single/Dual operation, respectively. "]
["R_DEMB",null,"W",null,"Tie to VDDA or AGND for FPWM/DEM, respectively. "]
[]
["Enable Hysteresis Current",1.0000000000000001E-5,"A",null,"10 µA Hysteresis Current"]
["Turn ON Voltage",{"$f":"'Design Regulator'!E54","v":6}]
["Hysteresis Voltage",{"$f":"'Design Regulator'!E54-'Design Regulator'!E55","v":1}]
[]
["Upper FB resistor",{"$f":"B186/B184","v":99999.999999999985},"W"]
["Lower FB resister",{"$f":"B188/(B185-1)","v":19999.999999999996},"W"]
["Standard upper FB resistor",{"$f":"'Standard Value Calculator'!S40","v":100},"kΩ"]
["Standard lower FB resistor",{"$f":"'Standard Value Calculator'!S41","v":20},"kΩ"]
[]
["Dither Modulation Frequency",{"$f":"'Design Regulator'!E58*1000","v":29400},"Hz"]
["Cdither_calculated",{"$f":"10*10^-6/Fdither/0.12","v":2.8344671201814057E-9},"F"]
["Cdither_stdvalue",{"$f":"'Standard Value Calculator'!S21","v":2.7000000000000002E-9},"F"]
[]
[]
["Step 7: Compensation"]
["Pi",3.1415926500000002,null,"p"]
["CS Amp Gain",10]
["Ri",{"$f":"Rs*CSAmp_gain","v":0.05},"W",null,null,"Current Sense effective resistance = shunt resistor Rs * CS amp gain"]
["gm",{"$f":"IF(COMP_TYPE=1,0.00003,0.0012)","v":1.1999999999999999E-3},"S",null,null,"Error Amp Transconductance"]
[]
["Se_ext",{"$f":"B208/Ri*1000","v":1818181.8181818181},"A/s",null,null,"Slope Comp Slope - referred to inductor current"]
["Sn",{"$f":"(Vin-Vout)/Lf","v":5294117.6470588231},"A/s",null,null,"On-time Slope"]
["Sf",{"$f":"Vout/Lf","v":1764705.8823529412},"A/s",null,null,"Off-time Slope"]
[]
["Se_int",{"$f":"Fsw*0.001*(5/22)","v":90.909090909090907},"mV/μs",null,null,"Slope Comp Slope - referred to IC"]
["Sn_int",{"$f":"Sn*Ri/1000","v":264.70588235294116},"mV/μs",null,null,"etc"]
["Sf_int",{"$f":"Sf*Ri/1000","v":88.235294117647058},"mV/μs",null,null,"etc"]
[]
["mc_buck",{"$f":"1+Se_ext/Sn","v":1.3434343434343434},null,null,null,"mc = 1 + Se/Sn for peak current-mode buck"]
["k_buck",{"$f":"mc_buck*(1-D1_Vinnom_2)","v":1.0044996173222651},null,null,null,"mc*(1-d)"]
[]
["mc",{"$f":"1+Se_ext/Sn","v":1.3434343434343434}]
["k",{"$f":"mc_buck*(1-D1_Vinnom_2)","v":1.0044996173222651}]
["Q",{"$f":"1/Pi/(k-0.5)","v":0.63094177997003753},null,null,null,"1/(Pi*(k-0.5))",null,"Q = 2/Pi = 0.636 gives ideal one-cycle damping"]
[]
["Error Amp (EA)"]
["GBW",6,"MHz",null,null,"EA gain-bandwidth product"]
["Cbw",{"$f":"gm/(2*Pi*GBW*1000000)","v":3.1830988654751269E-11},"F",null,null,"EA effective bandwidth limiting capacitance = gm/(2*Pi*GBW)"]
["RoEA",64000000,"W",null,null,"EA output resistance"]
["AEA",{"$f":"gm*RoEA","v":76800},"V/V",null,null,"EA DC gain = gm*RoEA"]
["Afb",{"$f":"IF(VOUT_setting=1,Vref/Vout,SQRT((1+(Fcross*zterm1)^2)/((1+Afbr-pterm4*(Fcross)^2)^2+(Fcross*pterm3)^2)))","v":6.749667855362608E-2},"V/V",null,null,"Feedback gain from Vout to FB"]
["Acs",{"$f":"1/Ri","v":20},null,null,null,"Acs = 1/Ri"]
["Am_buck",{"$f":"(Ro/Number_of_Phases)/Ri/((1+Ro/Number_of_Phases*(k-0.5)/(Fsw*Lf)))","v":23.470198740859637}]
["Am",{"$f":"(Ro*Number_of_Phases)/Ri/((1+Ro*Number_of_Phases*(k-0.5)/(Fsw*Lf)))","v":23.470198740859637},null,null,null,"Buck modulator gain"]
[]
["Scaling factor to calculate Rcomp - buck",{"$f":"2*Pi*Ri/gm","v":261.79938750000002},null,null,null,"2*Pi*Ri/gm -- scaling factor to calculate Rcomp given desired buck crossover frequency"]
["DC Gain is Adc = AEA*Afb*Am"]
[]
["Ro",{"$f":"Rout","v":1.5},"W",null,null,"Output Resistance"]
[]
["Fp_load_buck",{"$f":"1/(2*Pi*Ro*Cout)+(k-0.5)/(2*Pi*Fsw*Lf*Cout/Number_of_Phases)","v":1356.230043307482},"Hz",null,null,"Buck dominant pole frequency -- note slope comp influence"]
["Fp_dominant",{"$f":"Fload_u","v":1356.230043307482},"Hz"]
[null,{"$f":"Cbw","v":3.1830988654751269E-11}]
["Fp_EA",{"$f":"1/(2*Pi*(RoEA+Rcea1_u)*Cc1ea_u)","v":0.92081398048870167},"Hz",null,null,"Error Amp LF pole -- related to amplifier ouptut resistance and comp cap"]
["Fp_HF",{"$f":"1/(2*Pi*Rcea1_u*(Cc2ea_u+Cbw))","v":207395.77630741132},"Hz",null,null,"Error Amp HF pole cancels zero related to Output Cap ESR"]
["Fesr",{"$f":"1/(2*Pi*Cout*Cout_ESR)","v":1591549.4327375637},"Hz",null,null,"Cout ESR zero frequency"]
["F_mod",{"$f":"Fsw/2","v":200000},"Hz",null,null,"Zero-order sample-and-hold effects of current-mode control modeled as pole at Fsw/2"]
[null,null,null,"Internal Comp Crossover"]
["Desired Crossover Frequency",{"$f":"CHOOSE(COMP_TYPE,Fcross_Ch2,'Design Regulator'!E64*1000)","v":40000},"Hz",{"$f":"Fsw/50","v":8000}]
["Rcea1",{"$f":"Fcross*Cout/Number_of_Phases*2*Pi*Ri/(gm*Afb)","v":15514.8012085958},"W",null,null,"This component will largely determine the crossover frequency",null,null,null,null,{"$f":"Fcross/Fp_dominant/(gm*Afb*Am)","v":15514.8012085958}]
["Cc1ea, Cc3ea",{"$f":"10/(Rcea1*Fcross*2*Pi)","v":2.5645662669783093E-9},"F",null,null,"This along with Rcea1 will set a zero at Fcrossover/5 to optimize phase margin"]
["Cc2ea, Cc4ea",{"$f":"MAX(1/(Rcea1*2*Pi*Fesr)-Cbw, 1/(Rcea1*2*Pi*(Fsw/2))-Cbw)","v":1.9460336684814922E-11},"F",null,null,"This along with Rcea1 places a pole at the output cap ESR zero"]
[]
[{"$f":"CHOOSE(COMP_TYPE,\"Internal Compensation\",\"External Compensation\")","v":"External Compensation"}]
["Chosen Compensation Components from the standard value sheet",null,null,"Internal Values"]
["Rcea1_u",{"$f":"CHOOSE(COMP_TYPE,D249,'Design Regulator'!D71*1000)","v":15400},"W",400000,null,null,{"$f":"1/(Rcea1*2*Pi*(Fsw/2))-Cbw","v":1.9460336684814922E-11}]
["Cc1ea_u",{"$f":"CHOOSE(COMP_TYPE,Cc3ea_u,'Design Regulator'!D72*0.000000001)","v":2.7000000000000002E-9},"F",{"$f":"50*0.000000000001","v":5.0000000000000002E-11}]
["Cc2ea_u",{"$f":"CHOOSE(COMP_TYPE,Cc4ea_u,'Design Regulator'!D73*0.000000000001)","v":1.7999999999999999E-11},"F",{"$f":"0.000000000001","v":9.9999999999999998E-13}]
[]
["Resulting Pole/Zero Locations",null,null,null,null,{"$f":"Cout","v":1E-4},{"$f":"Cout_ESR","v":1E-3}]
["Fz1",{"$f":"1/(2*Pi*Rcea1_u*Cc1ea_u)","v":3827.6802134140539},"Hz",null,null,"This zero is set at or close to the dominant load pole"]
["Fp2",{"$f":"1/(2*Pi*Rcea1_u*(Cc1ea_u*(Cc2ea_u+Cbw)/(Cc1ea_u+Cc2ea_u+Cbw)))","v":211223.45652082539},"Hz",null,null,"This pole cancels the zero from the Output Cap ESR"]
[null,null,null,"Internal Values"]
["Rfb1",{"$f":"IF(VOUT_setting=1,'Design Regulator'!E66*1000,2500000)","v":2500000},"W",null,null,"Upper Feedback Resistance - chosen by user"]
["Rfb2",{"$f":"IF(Vout=Vref,100000000,Vref*B257/((Vout-Vref)))","v":178571.42857142858},"W",null,null,"Lower Feedback Resistance"]
["Rfb2_u",{"$f":"IF(Vout=Vref,\"N/A\",CHOOSE(VOUT_setting,'Standard Value Calculator'!S11,471000,792000,177000))","v":177000},"W",null,null,"Std Value Lower Feedback Resistance"]
[]
["Rff",20000,"W"]
["Cff",3.67E-13,"F"]
["Cfb",2.1999999999999999E-12,"F"]
[]
["wff",{"$f":"1/(2*Pi*Rff*Cff)","v":21683234.778440922},"Hz"]
["wfbt",{"$f":"1/(2*Pi*Rfb1_*Cfb)","v":28937.262413410252},"Hz"]
["wfbb",{"$f":"1/(2*Pi*Rfb2_u*Cfb)","v":408718.39566963637},"Hz"]
["w1",{"$f":"1/(2*Pi*Rff*Cfb)","v":3617157.8016762817},"Hz"]
["wfft",{"$f":"1/(2*Pi*Cff*Rfb1_)","v":173465.8782275274},"Hz"]
["Cfb*(Rff+RFBT)/(Rff*RFBT))",{"$f":"2*Pi*Cfb*(Rff+Rfb1_)/(Rff*Rfb1_)","v":6.96679586064E-16},"Hz"]
[]
[]
[]
[]
["Other Input Variables"]
["Rfets",0,"W","Series resistance due to FETs"]
["Diode loss eq res",{"$f":"0.00000002*Fsw*0.6*4/Iripple1","v":{"$error":"#NAME?"}}]
["Fet loss eq res",{"$f":"_Don2*RdsonTop+Doff2*RdsonBot","v":{"$error":"#NAME?"}}]
["cap loss eq res",{"$f":"B280*Vin^2*Fsw/2/(((Iripple1/SQRT(3))^2))","v":{"$error":"#NAME?"}}]
["Sw cap",5.0000000000000001E-9]
[]
["Step 8: AEF"]
[]
["VinRipple_dBuV",{"$f":"20*LOG10(Vinripple2*1000000)","v":110.7106651629271},"dBuV"]
["CISPR 25 limit",{"$f":"CHOOSE(OSC,35,50)","v":{"$error":"#VALUE!"}},"dBuV","Chooses CISPR conducted limit 35 at 2.1MHz and 50 at 440kHz"]
["Attenuation required",{"$f":"VinRipple_dBuV-B285+3","v":{"$error":"#VALUE!"}},"dBuV","Margin of attenuation req"]
["Filter Frequency Required",{"$f":"Fsw/(POWER(10,Attn_req/40))","v":{"$error":"#VALUE!"}},"Hz","assume 40db/decade drop and set frequency based on attenuation"]
[]
["Lfilter",{"$f":"'Design Regulator'!E50","v":0},"uH","user input"]
[]
["Gop_AEF",{"$f":"CHOOSE(OSC,20,100)","v":{"$error":"#VALUE!"}}]
["n",3,null,null,null,"n should be 2 or 3"]
[]
["Passive Cf",{"$f":"1000000/(LinfilterPssv*POWER(2*Pi*Fx_infilter,2))","v":{"$error":"#REF!"}},"uF",{"$f":"#REF!*0.000001","v":{"$error":"#REF!"}}]
["Cinj_AEF",{"$f":"1000000/(L_infilter*Gop_AEF*0.000001*POWER(2*Pi*Fx_infilter,2))","v":{"$error":"#VALUE!"}},"uF",{"$f":"'Design Regulator'!#REF!*0.000001","v":{"$error":"#REF!"}}]
[]
["Cdamp_AEF",{"$f":"CHOOSE(OSC,0,Cinj_AEF/nAEF)","v":{"$error":"#VALUE!"}},"uF",{"$f":"'Design Regulator'!#REF!*0.000001","v":{"$error":"#REF!"}}]
["Rdamp_AEF",{"$f":"CHOOSE(OSC,SQRT(L_infilter*Gop_AEF/(Cinj_AEF)),1.09*SQRT(L_infilter*Gop_AEF/Cinj_AEF))","v":{"$error":"#VALUE!"}},"Ω",{"$f":"'Design Regulator'!#REF!","v":{"$error":"#REF!"}}]
["Ccomp_AEF",{"$f":"CHOOSE(OSC,5,1)","v":{"$error":"#VALUE!"}},"nF",{"$f":"B299*0.000000001","v":{"$error":"#VALUE!"}},null,"AEF Comp network & sense is specifically defined at 2.2MHz at 440kHz"]
["Rcomp_AEF",{"$f":"CHOOSE(OSC,200,1000)","v":{"$error":"#VALUE!"}},"Ω"]
["Csen_AEF",{"$f":"Gop_AEF*B299","v":{"$error":"#VALUE!"}},"nF",{"$f":"B301*0.000000001","v":{"$error":"#VALUE!"}}]
[]
["Rd_AEF",{"$f":"SQRT(L_infilter*0.000001/Cin)","v":0},null,{"$f":"'Standard Value Calculator'!S14","v":{"$error":"#NUM!"}}]
[]
["Attenuation at Fsw",{"$f":"#REF!","v":{"$error":"#REF!"}},"dBuV"]
["Conducted EMC at Fsw",{"$f":"VinRipple_dBuV+B305","v":{"$error":"#REF!"}},"dBuV"]
[]
[]
["Step 8: Efficiency"]
["VAR",0]
["Design"]
["Ta",{"$f":"'Design Regulator'!E13","v":25},"°C","Ambient Temperature"]
["Components"]
["LTc",{"$f":"4000/1000000","v":4.0000000000000001E-3},"%/°C","Inductor DCR Temp Co"]
["θCA",20,"°C/W","Inductor Core to Ambient Thermal Resistance"]
["RCinEsr",{"$f":"RCinEsr","v":1E-3},"W","Input Capacitor ESR"]
[]
["Controller Characteristics"]
["BIAS",{"$f":"'Design Regulator'!G102","v":12},"V"]
["VCC",{"$f":"CHOOSE(VOUT_setting,8,5,5,8)","v":8},"V","with 170mA current limit"]
["Top Driver"]
["RdsonDRT",3,"W","Drain-Source Resistance of Pullup High-side FET Driver"]
["RdsonDRT2",1,"W","Drain-Source Resistance of Pulldown High-side FET Driver"]
["Bottom Driver"]
["RdsonDRB",3,"W","Drain-Source Resistance of Pullup Low-side FET Driver"]
["RdsonDRB2",1,"W","Drain-Source Resistance of Pulldown Low-side FET Driver"]
["Deadtime"]
["Deadtime",1.4E-8,"s","Total Deadtime",null,null,"14ns for LM513-Q1"]
["IQ"]
["IQ ",2.2000000000000001E-6,"A","Quiescent Current of LM5143-Q1 Controller (One channel disabled)"]
[]
["High- & low-side MOSFETs - Ch1","Q1: high-side",null,"Q2: low-side"]
["Rdson",{"$f":"CHOOSE(VOUT_setting,0.024,0.04,0.04,0.024)","v":2.4E-2},"W",{"$f":"CHOOSE(VOUT_setting,0.018,0.029,0.029,0.018)","v":1.7999999999999999E-2},"W","Drain-Source Resistances of Channel 1 FETs"]
["RdsonTopTc",{"$f":"7000/1000000","v":7.0000000000000001E-3},"%/°C",7.0000000000000001E-3,"%/°C","Drain-Source Resistance Temp Co"]
["Qg",{"$f":"'Design Regulator'!E83/1000000000","v":3E-9},"C",{"$f":"'Design Regulator'!F83/1000000000","v":4.0999999999999995E-9},"C","Gate Charge at VCC = 5V"]
["Qgd",{"$f":"'Design Regulator'!E84/1000000000","v":6.9999999999999996E-10},"C",{"$f":"'Design Regulator'!F84/1000000000","v":1.0000000000000001E-9},"C","Gate to Drain Charge"]
["Qgs",{"$f":"'Design Regulator'!E85/1000000000","v":6.9999999999999996E-10},"C",{"$f":"'Design Regulator'!F85/1000000000","v":8.9999999999999999E-10},"C","Gate to Source Charge"]
["Qoss",{"$f":"0.00000000225","v":2.2499999999999999E-9},"C",{"$f":"'Design Regulator'!F86/1000000000","v":3E-9},"C","Output Charge"]
["Coss",{"$f":"'Design Regulator'!E87/1000000000000","v":2.5000000000000002E-10},"F",{"$f":"'Design Regulator'!F87/1000000000000","v":3.4999999999999998E-10},"F","Output Capacitance"]
["Rgate",{"$f":"'Design Regulator'!E88","v":3.5},"W",{"$f":"'Design Regulator'!F88","v":3},"W","Gate Resistance"]
["Gfs",{"$f":"'Design Regulator'!E89","v":71},"S",{"$f":"'Design Regulator'!F89","v":90},"S","Transconductance"]
["Vth",{"$f":"'Design Regulator'!E90","v":1.8},"V",{"$f":"'Design Regulator'!F90","v":1.8},"V","Threshold Voltage"]
["Vsp",{"$f":"Vth_Q1+(Iout/Number_of_Phases)/Gfs_Q1","v":1.9126760563380283},"V",{"$f":"Vth_Q2+(Iout/Number_of_Phases)/Gfs_Q2","v":1.8888888888888888},"V","Switch Point Voltage of FETs"]
[]
["Vsd - Buck",{"$f":"'Design Regulator'!E91","v":0.8},"V",{"$f":"'Design Regulator'!F91","v":0.8},"V","Diode Forward Voltage of MOSFET Body diode"]
["QrrTop",null,"C",{"$f":"0.00000003","v":2.9999999999999997E-8},"C","Reverse Recovery Charge of Body Diode"]
["TrrTop",4.0000000000000001E-8,"s",4.0000000000000001E-8,"s","Reverse Recovery Time of Body Diode"]
["θJA-MOSFET",{"$f":"'Design Regulator'!E93","v":15},"°C/W",{"$f":"'Design Regulator'!F93","v":15},"°C/W","Junction-to-Ambient Resistance"]
[]
[]
[]
["Anti-parallel Schottky Diode (optional)"]
["VfdSky",{"$f":"'Design Regulator'!F96","v":0},"V",{"$f":"'Design Regulator'!#REF!","v":{"$error":"#REF!"}},"V","Diode Forward Voltage"]
["QrrSky",{"$f":"'Design Regulator'!F97/1000000000","v":0},"C",{"$f":"'Design Regulator'!#REF!/1000000000","v":{"$error":"#REF!"}},"C","Diode Reverse Recovery Charge"]
["Ireverse",0,"A",0,"A","Reverse Leakage Current"]
[]
["Controller"]
["Outputs"]
["Top FET","Fixed",null,null,"Calculated"]
["Tr",{"$f":"CHOOSE(VOUT_setting, 0.000000003, 0.000000005,0.000000005,0.000000003)","v":3E-9},"s",null,{"$f":"(Qgd_Q1+Qgs_Q1/2)*(RdsonDRT+Rgate1)/(VCC-Vsp_Q1)","v":1.1211823229986117E-9},"s"]
["Tf",{"$f":"0.000000003","v":3E-9},"s",null,{"$f":"(Qgd_Q1+Qgs_Q1/2)*(RdsonDRT2+Rgate1)/(Vsp_Q1)","v":2.4703608247422675E-9},"s"]
[]
["IC Power Disipation","Value","Units"]
["Power Dis",{"$f":"'Efficiency Calculations'!AU109","v":2.627043709082463},"W"]
["Temp rise",{"$f":"B364*ThetaJaCtrl","v":48.863012988933818},"°C"]
["Junction temperature",{"$f":"B365 + Ta","v":73.863012988933818},"°C"]
[]
["Current (switching)",{"$f":"(Qg_Q1+Qg_Q2)*Fsw+Iq","v":2.8421999999999996E-3},"A"]
["Qrr Current",{"$f":"Qrr_Q2*Fsw","v":1.1999999999999999E-2},"A"]
["Diode Current",{"$f":"C370/Vin","v":{"$error":"#NAME?"}},{"$f":"Deadtime*Fsw*(Ipp/2)*(Vsd_Q1+Vsd_Q2)","v":{"$error":"#NAME?"}}]
["Total Application Switching IQ",{"$f":"SUM(B368:B370)","v":{"$error":"#NAME?"}},"A"]
[]
["Low-side MOSFET/Diode"]
["Part Power"]
["Power Dis"]
[]
["SCHEMATIC LABELS"]
[{"$f":"\"RC1 = \"&'Design Regulator'!D71&\"kΩ\"","v":"RC1 = 15.4kΩ"},{"$f":"'Design Regulator'!D71&\"kΩ\"","v":"15.4kΩ"},null,{"$f":"'Design Regulator'!D74&\"kΩ\"","v":"kΩ"}]
[{"$f":"\"RC2 = \"&'Design Regulator'!D74&\"kΩ\"","v":"RC2 = kΩ"},{"$f":"'Design Regulator'!D74&\"kΩ\"","v":"kΩ"}]
[]
[{"$f":"\"Lo = \"&'Design Regulator'!E28&\"µH\"","v":"Lo = 6.8µH"},{"$f":"'Design Regulator'!E28&\"µH\"","v":"6.8µH"},null,{"$f":"IF(MODE = 1, 'Design Regulator'!I28&\"µH\", 'Design Regulator'!E28&\"µH\")","v":"µH"}]
[{"$f":"\"Rdcr = \"&Rdcr*1000&\"mΩ\"","v":"Rdcr = 10mΩ"},{"$f":"Rdcr*1000&\"mΩ\"","v":"10mΩ"},null,{"$f":"IF(MODE=1, Rdcr2*1000&\"mΩ\", Rdcr*1000&\"mΩ\")","v":"0mΩ"}]
[{"$f":"\"Rs = \"&'Design Regulator'!E19&\"mΩ\"","v":"Rs = 5mΩ"},{"$f":"'Design Regulator'!E19&\"mΩ\"","v":"5mΩ"},null,{"$f":"IF(MODE = 1, 'Design Regulator'!I19&\"mΩ\", 'Design Regulator'!E19&\"mΩ\")","v":"mΩ"}]
[]
["IC",{"$f":"CHOOSE(GPN_setting,\"LM708A0(-Q1)\",\"LM70880(-Q1)\",\"LM70860(-Q1)\",\"LM70840(-Q1)\",\"LM706A0(-Q1)\",\"LM70660(-Q1)\",\"LM704A0(-Q1)\")","v":"LM70880(-Q1)"},null,null,null,{"$f":"GPN_setting","v":2}]
[]
[{"$f":"IF((INFILTER_TYPE=1),\"AEF IS DISABLED!\",\"AEF\")","v":"AEF"},{"$f":"IF((INFILTER_TYPE=1),\"\",\"0.1µF\")","v":"0.1µF"},{"$f":"IF((INFILTER_TYPE=1),\"\",\"0.47Ω\")","v":"0.47Ω"},{"$f":"IF((INFILTER_TYPE=1),\"\",\"3Ω\")","v":"3Ω"},{"$f":"IF((INFILTER_TYPE=1),\"\",\"50kΩ\")","v":"50kΩ"}]
[{"$f":"\"LAEF =\"&L_infilter&\" uF\"","v":"LAEF =0 uF"},{"$f":"IF((INFILTER_TYPE=1),\"\",L_infilter&\"µH\")","v":"0µH"}]
[{"$f":"\"Cinj =\"&CinjSel*1000000&\" uF\"","v":{"$error":"#REF!"}},{"$f":"IF((INFILTER_TYPE=1),\"\",CinjSel*1000000&\"µF\")","v":{"$error":"#REF!"}}]
[{"$f":"\"Cdamp =\"&CdampSel*1000000&\" uF\"","v":{"$error":"#REF!"}},{"$f":"IF((INFILTER_TYPE=1),\"\",IF(OSC=1,\"DNP\",CdampSel*1000000&\"µF\"))","v":{"$error":"#REF!"}}]
[{"$f":"\"Rdamp =\"&RdampSel&\"Ω\"","v":{"$error":"#REF!"}},{"$f":"IF((INFILTER_TYPE=1),\"\",RdampSel&\"Ω\")","v":{"$error":"#REF!"}}]
[{"$f":"\"Rcomp =\"&Rcomp_AEF&\"Ω\"","v":{"$error":"#VALUE!"}},{"$f":"IF((INFILTER_TYPE=1),\"\",Rcomp_AEF&\"Ω\")","v":{"$error":"#VALUE!"}}]
[{"$f":"\"Ccomp =\"&Ccomp_AEF*1000000000000&\"pF\"","v":{"$error":"#VALUE!"}},{"$f":"IF((INFILTER_TYPE=1),\"\",Ccomp_AEF*1000000000000&\"pF\")","v":{"$error":"#VALUE!"}}]
[{"$f":"\"Csen =\"&Csen_AEF*1000000&\"µF\"","v":{"$error":"#VALUE!"}},{"$f":"IF((INFILTER_TYPE=1),\"\",Csen_AEF*1000000&\"µF\")","v":{"$error":"#VALUE!"}}]
[null,"CDAMP"]
[]
[{"$f":"\"VOUT = \"&'Design Regulator'!E9&\"V\"","v":"VOUT = 12V"},{"$f":"'Design Regulator'!E9&\"V\"","v":"12V"},null,{"$f":"IF(MODE=1, 'Design Regulator'!I10&\"V\", \"\")","v":"V"}]
[]
[{"$f":"\"COUT = \"&'Design Regulator'!$E$36&\"µF\"","v":"COUT = 100µF"},{"$f":"ROUND('Design Regulator'!$E$36/Number_of_Phases, 0)&\"µF\"","v":"100µF"},null,{"$f":"IF(MODE=1, 'Design Regulator'!$I$36&\"µF\", ROUND('Design Regulator'!$E$36/Number_of_Phases, 0)&\"µF\")","v":"µF"}]
["Capacitance per component (Cout)",{"$f":"\"22µF\"","v":"22µF"}]
["# of output caps",{"$f":"ROUNDUP(Cout*1000000/22,0)&\" x\"","v":"5 x"}]
[]
["CIN",{"$f":"Cin*1000000&\"µF\"","v":"15µF"}]
["Capacitance per component (Cin)",{"$f":"\"10µF\"","v":"10µF"}]
["# of input caps",{"$f":"ROUNDUP(Cin*1000000/10,0)&\" x\"","v":"2 x"}]
["Cd",{"$f":"CHOOSE(INFILTER_TYPE,\"\",4*Cin*1000000&\"µF\")","v":{"$error":"#VALUE!"}}]
["Rd",{"$f":"CHOOSE(INFILTER_TYPE,\"\",D303&\"Ω\")","v":{"$error":"#VALUE!"}}]
[]
[{"$f":"\"RC1 = \"&Rcea1_u/1000&\"kΩ\"","v":"RC1 = 15.4kΩ"},{"$f":"IF(COMP_TYPE=1,\"100kΩ\",ROUND(Rcea1_u/1000,2)&\"kΩ\")","v":"15.4kΩ"}]
[{"$f":"\"CC1 = \"&Cc1ea_u*10^9&\"nF\"","v":"CC1 = 2.7nF"},{"$f":"IF(COMP_TYPE=1,\"\",Cc1ea_u*10^9&\"nF\")","v":"2.7nF"}]
[{"$f":"\"CC2 = \"&IF(Cc2ea_u>0, Cc2ea_u*10^12&\"pF\", \"OPEN\")","v":"CC2 = 18pF"},{"$f":"IF(COMP_TYPE=1,\"\",IF(Cc2ea_u>0, ROUND(Cc2ea_u*10^12,1)&\"pF\", \"N/A\"))","v":"18pF"}]
[]
[{"$f":"\"gm = \"&$B$202*1000&\"mS\"","v":"gm = 1.2mS"},{"$f":"$B$202*1000&\"mS\"","v":"1.2mS"}]
[{"$f":"\"RoEA = \"&RoEA/1000000&\"MΩ\"","v":"RoEA = 64MΩ"},{"$f":"RoEA/1000000&\"MΩ\"","v":"64MΩ"}]
[{"$f":"\"GBW = \"&GBW&\"MHz\"","v":"GBW = 6MHz"},{"$f":"GBW&\"MHz\"","v":"6MHz"}]
[]
[{"$f":"\"Cslope = \"&Cslope&\"pF\"","v":{"$error":"#NAME?"}},{"$f":"ROUND(Cslope*1,0)&\"pF\"","v":{"$error":"#NAME?"}}]
["Cd",{"$f":"IF(DITHER=1, ROUND(Cdither*1000000000,1)&\"nF\", \"\")","v":""},{"$f":"IF(DITHER=1, \"Cd\", \"\")","v":""}]
[{"$f":"\"RFB1 = \"&'Design Regulator'!E66&\"kΩ\"","v":"RFB1 = 100kΩ"},{"$f":"IF(VOUT_setting=1, 'Design Regulator'!E66&\" kΩ\", \"\")","v":""},null,{"$f":"'Design Regulator'!I66&\"kΩ\"","v":"kΩ"}]
[{"$f":"\"RFB2 = \"&IF(Vout=Vref,\"OPEN\",'Design Regulator'!E67&\"kΩ\")","v":"RFB2 = 177kΩ"},{"$f":"IF(VOUT_setting=1, IF(Vout=Vref,\"OPEN\",Rfb2_u/1000&\" kΩ\"), \"\")","v":""},null,{"$f":"IF(Vout2=Vref,\"OPEN\",Rfb4_u/1000&\"kΩ\")","v":"0kΩ"}]
[{"$f":"\"RFBSET = \"&CHOOSE(VOUT_setting,\"\",\"24.9kΩ\",\"0Ω\",\"49.9kΩ\")","v":"RFBSET = 49.9kΩ"},null,null,{"$f":"CHOOSE(VOUT_setting,\"\",\"24.9kΩ\",\"0Ω\",\"49.9kΩ\")","v":"49.9kΩ"}]
["Rboot resistor",null,null,{"$f":"IF(OR(VOUT_setting=1,VOUT_setting=4),\"1Ω\",\"0Ω\")","v":"1Ω"}]
["RENT",{"$f":"IF((UVLO_TYPE=1),B190&\"kΩ\",\"\")","v":""}]
["RENB",{"$f":"IF((UVLO_TYPE=1),B191&\"kΩ\",\"\")","v":""}]
[]
[{"$f":"\"Crossover Frequency = \"&ROUND('Stability Calculations'!U4,1)&\"kHz\"","v":"Crossover Frequency = 38.7kHz"},{"$f":" ROUND('Stability Calculations'!U4,1)&\"kHz\"","v":"38.7kHz"},null,{"$f":"'Stability Calculations'!U4","v":38.683500000000002}]
[{"$f":"\"Phase Margin = \"&ROUND('Stability Calculations'!U5,0)&\"°\"","v":"Phase Margin = 66°"},{"$f":"ROUND('Stability Calculations'!U5,0)&\"°\"","v":"66°"}]
[{"$f":"IF(loopPM<45,CHOOSE(COMP_TYPE,\"Phase Margin too low, Increase COUT\",\"Phase Margin too low, Re-compensate\"),\"\")","v":""}]
[{"$f":"\"Gain Margin = \"&ROUND('Stability Calculations'!U7*-1,1)&\"dB\"","v":"Gain Margin = 14.6dB"},{"$f":"ROUND('Stability Calculations'!U7*-1,1)&\"dB\"","v":"14.6dB"}]
["Full-load/high line efficiency",{"$f":"IF(PLOT_TYPE=1, ROUND('Efficiency Calculations'!BA109,1)&\"%\", ROUND(#REF!,1)&\"%\")","v":"95.8%"}]
["Half-load/mid-line efficiency",{"$f":"IF(PLOT_TYPE=1, ROUND('Efficiency Calculations'!BA59,1)&\"%\", ROUND(#REF!,1)&\"%\")","v":"96.5%"}]
["OSC pin setting",{"$f":"IF(VOUT_setting=1, \"\", IF(OSC=1, \"Tie OSC to VDDA\", \"Tie OSC to AGND\"))","v":"Tie OSC to AGND"}]
[]
[{"$f":"\"CDITH = \"&Cdither*1000000000&\"nF\"","v":"CDITH = 2.7nF"},{"$f":"Cdither*1000000000&\"nF\"","v":"2.7nF"}]
[{"$f":"\"Rs = \"&Rs&\"Ω\"","v":"Rs = 0.005Ω"},{"$f":"'Standard Value Calculator'!S6&\"Ω\"","v":"Ω"}]
["Rset",{"$f":"'Standard Value Calculator'!S16&\"mΩ\"","v":"4.32mΩ"}]
["Rs",{"$f":"'Standard Value Calculator'!S6&\"mΩ\"","v":"mΩ"}]
[{"$f":"\"Rshunt = \"&ROUND(Rshunt,1)&\"mΩ\"","v":{"$error":"#NAME?"}},{"$f":"IF(Rshunt=\"0\", \"N/A\",ROUND(Rshunt,1)&\"mΩ\")","v":{"$error":"#NAME?"}}]
[]
["Rpgood","20kΩ"]
["RFB1"]
["RFB2"]
["VCCX",{"$f":"IF((Ext_VCC=1),\"5V\",\"GND\")","v":"5V"}]
["RCNFG",{"$f":" 'Design Regulator'!E58&\"kΩ\"","v":"29.4kΩ"}]
["Rt",{"$f":" Rfadj&\"kΩ\"","v":"54.9kΩ"},{"$f":"Rfadj","v":54.9},{"$f":"Fsw","v":400000},null,{"$f":"OR((Fsw=440000),(Fsw=2200000))","v":false},null,{"$f":"OR(OR(AND(OSC=1, OR(Fsw/1000>2530, Fsw/1000<1800)), AND(OSC=2, OR(Fsw/1000>500, Fsw/1000<300))), OR((Fsw=440000),(Fsw=2200000)))","v":false}]
["Css",{"$f":"'Standard Value Calculator'!B4*1000000000&\"nF\"","v":"0nF"},{"$f":"IF(MODE=1,\"Css\",\"\")","v":"Css"}]
["Cres",{"$f":"IF(Cres_u = 0, \"N/A\", Cres_u*1000000000 &\"nF\")","v":"82nF"},{"$f":"IF(Cres_u = 0, \"N/A\", Cres_u*1000000 &\"µF\")","v":"0.082µF"},{"$f":"Cres_u","v":8.2000000000000006E-8}]
[]
["Blank out",{"$f":"IF(B76=\"y\",\"\",\"|\")","v":"|"}]
["OUTPUT CURRENT",{"$f":"'Design Regulator'!$E$10&\"A\"","v":"8A"},null,{"$f":"IF(MODE=1,'Design Regulator'!#REF!&\"A\",\"\")","v":{"$error":"#REF!"}}]
["VIN",{"$f":"VIN_nom&\"V\"","v":"48V"}]
["VIN range",{"$f":"VIN_min&\"V\"&\"...\"&VIN_max&\"V\"","v":"15V...72V"}]
[null,{"$f":"IF(INFILTER_TYPE=1,B452,\"\")","v":""},{"$f":"IF(INFILTER_TYPE=1,\"\",B452)","v":"15V...72V"}]
["PFM/FPWM",{"$f":"IF((DEMB=1),\"GND\",\"VDDA\")","v":"VDDA"}]

{"sheet":"Schematic Management","index":8,"n_rows":17,"n_cols":14,"rows_kept":17,"cut":false,"hidden":true,"merged":[]}
[null,null,null,null,null,null,null,null,null,null,null,null,null,"3.3V or 5V fixed (FB1/2)"]
[{"$f":"IF(MODE=1, CHOOSE(SCH_SETTING, \"SCH_SetVout_IntComp_nEN\",\"SCH_SetVout_IntComp_EN\",\"SCH_SetVout_ExtComp_nEN\",\"SCH_SetVout_ExtComp_EN\",\"SCH_AdjVout_IntComp_nEN\",\"SCH_AdjVout_IntComp_EN\",\"SCH_AdjVout_ExtComp_nEN\",\"SCH_AdjVout_ExtComp_EN\",  \"SCH_SetVout_IntComp_nEN_BIAS_GND\",\"SCH_SetVout_IntComp_EN_BIAS_GND\",\"SCH_SetVout_ExtComp_nEN_BIAS_GND\",\"SCH_SetVout_ExtComp_EN_BIAS_GND\",\"SCH_AdjVout_IntComp_nEN_BIAS_GND\",\"SCH_AdjVout_IntComp_EN_BIAS_GND\",\"SCH_AdjVout_ExtComp_nEN_BIAS_GND\",\"SCH_AdjVout_ExtComp_EN_BIAS_GND\", \"\"))","v":"SCH_SetVout_ExtComp_nEN"},null,null,null,null,null,null,null,null,"With/without dither (DITH)",null,null,null,"With/without VOUT connected to VCCX"]
[null,null,null,null,null,null,null,null,null,"FPWM or DEM (DEMB)"]
[null,null,null,null,null,null,null,null,null,"Shunt or inductor DCR current sensing"]
[]
[]
[]
[]
[]
[]
[]
[]
[]
[]
[]
[]
[null," "]

{"sheet":"Efficiency Plot Management","index":9,"n_rows":2,"n_cols":1,"rows_kept":2,"cut":false,"hidden":true,"merged":[]}
[]
[{"$f":"IF(PLOT_TYPE=1, \"EFF_Ch1\", \"EFF_Ch2\")","v":"EFF_Ch1"}]

{"sheet":"Standard Value Calculator","index":10,"n_rows":159,"n_cols":20,"rows_kept":159,"cut":false,"hidden":true,"merged":[]}
[]
["Capacitors","Css","Cc1ea","Cc2ea","Cout","Cin","Cres","Cdither","Cc3ea","Cc4ea","Cin_Passive","Cdamp_Pssv","Cinj_AEF","Cdamp_AEF"]
["Inputs",{"$f":"Css","v":0},{"$f":"Cc1ea","v":2.5645662669783093E-9},{"$f":"Cc2ea","v":1.9460336684814922E-11},{"$f":"Cout","v":1E-4},{"$f":"Cin","v":1.5E-5},{"$f":"Cres","v":8.3333333333333338E-8},{"$f":"Cdither_init","v":2.8344671201814057E-9},{"$f":"Cc3ea","v":0},{"$f":"Cc4ea","v":0},{"$f":"'Variable Management'!B294*0.000001","v":{"$error":"#REF!"}},{"$f":"K3*4","v":{"$error":"#REF!"}},{"$f":"Cinj_AEF*0.000001","v":{"$error":"#VALUE!"}},{"$f":"'Variable Management'!B297*0.000001","v":{"$error":"#VALUE!"}},null,null,"Resistors","inputs","Standard Result"]
["Standard Result",{"$f":"SUM(B6:B158)/1000000000000","v":0},{"$f":"IF(C3=\"OPEN\",\"OPEN\",SUM(C6:C158)/1000000000000)","v":2.7000000000000002E-9},{"$f":"SUM(D6:D158)/1000000000000","v":1.7999999999999999E-11},{"$f":"SUM(E6:E158)/1000000000000","v":1E-4},{"$f":"SUM(F6:F158)/1000000000000","v":1.5E-5},{"$f":"SUM(G6:G158)/1000000000000","v":8.2000000000000006E-8},{"$f":"IF(H3=\"OPEN\",\"OPEN\",SUM(H6:H158)/1000000000000)","v":2.7000000000000002E-9},0,0,{"$error":"#REF!"},{"$error":"#REF!"},{"$error":"#VALUE!"},{"$error":"#VALUE!"},null,null,"Rt",{"$f":"Rfadj","v":54.9},{"$f":"IF(R4>(INT(0.5+100*POWER(10,IF(96*(LOG(R4)-INT(LOG(R4)))-ROUND(96*(LOG(R4)-INT(LOG(R4))),0)<0,ROUND(96*(LOG(R4)-INT(LOG(R4))),0)-1,ROUND(96*(LOG(R4)-INT(LOG(R4))),0))/96))*POWER(10,INT(LOG(R4))-2)+INT(0.5+100*POWER(10,(IF(96*(LOG(R4)-INT(LOG(R4)))-ROUND(96*(LOG(R4)-INT(LOG(R4))),0)<0,ROUND(96*(LOG(R4)-INT(LOG(R4))),0)-1,ROUND(96*(LOG(R4)-INT(LOG(R4))),0))+1)/96))*POWER(10,INT(LOG(R4))-2))/2,INT(0.5+100*POWER(10,(IF(96*(LOG(R4)-INT(LOG(R4)))-ROUND(96*(LOG(R4)-INT(LOG(R4))),0)<0,ROUND(96*(LOG(R4)-INT(LOG(R4))),0)-1,ROUND(96*(LOG(R4)-INT(LOG(R4))),0))+1)/96))*POWER(10,INT(LOG(R4))-2),INT(0.5+100*POWER(10,IF(96*(LOG(R4)-INT(LOG(R4)))-ROUND(96*(LOG(R4)-INT(LOG(R4))),0)<0,ROUND(96*(LOG(R4)-INT(LOG(R4))),0)-1,ROUND(96*(LOG(R4)-INT(LOG(R4))),0))/96))*POWER(10,INT(LOG(R4))-2))","v":54.900000000000006},"Ω"]
["(pF)"]
[0.47,{"$f":"IF(IF((B$3*10^12-$A7)*(B$3*10^12-$A6)*-1<0,0,1)*IF(ABS(B$3*10^12-$A7)>(B$3*10^12-$A6),$A6,$A7)=B7,0,IF((B$3*10^12-$A7)*(B$3*10^12-$A6)*-1<0,0,1)*IF(ABS(B$3*10^12-$A7)>(B$3*10^12-$A6),$A6,$A7))","v":0},0,0,0,0,0,0,0,0,{"$error":"#REF!"},{"$error":"#REF!"},{"$error":"#VALUE!"},{"$error":"#VALUE!"}]
[0.56000000000000005,{"$f":"IF(IF((B$3*10^12-$A8)*(B$3*10^12-$A7)*-1<0,0,1)*IF(ABS(B$3*10^12-$A8)>(B$3*10^12-$A7),$A7,$A8)=B8,0,IF((B$3*10^12-$A8)*(B$3*10^12-$A7)*-1<0,0,1)*IF(ABS(B$3*10^12-$A8)>(B$3*10^12-$A7),$A7,$A8))","v":0},{"$f":"IF(IF((C$3*10^12-$A8)*(C$3*10^12-$A7)*-1<0,0,1)*IF(ABS(C$3*10^12-$A8)>(C$3*10^12-$A7),$A7,$A8)=C8,0,IF((C$3*10^12-$A8)*(C$3*10^12-$A7)*-1<0,0,1)*IF(ABS(C$3*10^12-$A8)>(C$3*10^12-$A7),$A7,$A8))","v":0},{"$f":"IF(IF((D$3*10^12-$A8)*(D$3*10^12-$A7)*-1<0,0,1)*IF(ABS(D$3*10^12-$A8)>(D$3*10^12-$A7),$A7,$A8)=D8,0,IF((D$3*10^12-$A8)*(D$3*10^12-$A7)*-1<0,0,1)*IF(ABS(D$3*10^12-$A8)>(D$3*10^12-$A7),$A7,$A8))","v":0},{"$f":"IF(IF((E$3*10^12-$A8)*(E$3*10^12-$A7)*-1<0,0,1)*IF(ABS(E$3*10^12-$A8)>(E$3*10^12-$A7),$A7,$A8)=E8,0,IF((E$3*10^12-$A8)*(E$3*10^12-$A7)*-1<0,0,1)*IF(ABS(E$3*10^12-$A8)>(E$3*10^12-$A7),$A7,$A8))","v":0},{"$f":"IF(IF((F$3*10^12-$A8)*(F$3*10^12-$A7)*-1<0,0,1)*IF(ABS(F$3*10^12-$A8)>(F$3*10^12-$A7),$A7,$A8)=F8,0,IF((F$3*10^12-$A8)*(F$3*10^12-$A7)*-1<0,0,1)*IF(ABS(F$3*10^12-$A8)>(F$3*10^12-$A7),$A7,$A8))","v":0},{"$f":"IF(IF((G$3*10^12-$A8)*(G$3*10^12-$A7)*-1<0,0,1)*IF(ABS(G$3*10^12-$A8)>(G$3*10^12-$A7),$A7,$A8)=G8,0,IF((G$3*10^12-$A8)*(G$3*10^12-$A7)*-1<0,0,1)*IF(ABS(G$3*10^12-$A8)>(G$3*10^12-$A7),$A7,$A8))","v":0},0,0,0,{"$f":"IF(IF((K$3*10^12-$A8)*(K$3*10^12-$A7)*-1<0,0,1)*IF(ABS(K$3*10^12-$A8)>(K$3*10^12-$A7),$A7,$A8)=K8,0,IF((K$3*10^12-$A8)*(K$3*10^12-$A7)*-1<0,0,1)*IF(ABS(K$3*10^12-$A8)>(K$3*10^12-$A7),$A7,$A8))","v":{"$error":"#REF!"}},{"$error":"#REF!"},{"$error":"#VALUE!"},{"$error":"#VALUE!"},null,null,"Rc1ea",{"$f":"Rcea1","v":15514.8012085958},{"$f":"IF(R7>(INT(0.5+100*POWER(10,IF(96*(LOG(R7)-INT(LOG(R7)))-ROUND(96*(LOG(R7)-INT(LOG(R7))),0)<0,ROUND(96*(LOG(R7)-INT(LOG(R7))),0)-1,ROUND(96*(LOG(R7)-INT(LOG(R7))),0))/96))*POWER(10,INT(LOG(R7))-2)+INT(0.5+100*POWER(10,(IF(96*(LOG(R7)-INT(LOG(R7)))-ROUND(96*(LOG(R7)-INT(LOG(R7))),0)<0,ROUND(96*(LOG(R7)-INT(LOG(R7))),0)-1,ROUND(96*(LOG(R7)-INT(LOG(R7))),0))+1)/96))*POWER(10,INT(LOG(R7))-2))/2,INT(0.5+100*POWER(10,(IF(96*(LOG(R7)-INT(LOG(R7)))-ROUND(96*(LOG(R7)-INT(LOG(R7))),0)<0,ROUND(96*(LOG(R7)-INT(LOG(R7))),0)-1,ROUND(96*(LOG(R7)-INT(LOG(R7))),0))+1)/96))*POWER(10,INT(LOG(R7))-2),INT(0.5+100*POWER(10,IF(96*(LOG(R7)-INT(LOG(R7)))-ROUND(96*(LOG(R7)-INT(LOG(R7))),0)<0,ROUND(96*(LOG(R7)-INT(LOG(R7))),0)-1,ROUND(96*(LOG(R7)-INT(LOG(R7))),0))/96))*POWER(10,INT(LOG(R7))-2))","v":15400},"Ω"]
[0.68,0,0,0,0,0,0,0,0,0,{"$error":"#REF!"},{"$error":"#REF!"},{"$error":"#VALUE!"},{"$error":"#VALUE!"},null,null,"Rc1ea",{"$f":"Rcea2","v":0},{"$f":"IF(R8>(INT(0.5+100*POWER(10,IF(96*(LOG(R8)-INT(LOG(R8)))-ROUND(96*(LOG(R8)-INT(LOG(R8))),0)<0,ROUND(96*(LOG(R8)-INT(LOG(R8))),0)-1,ROUND(96*(LOG(R8)-INT(LOG(R8))),0))/96))*POWER(10,INT(LOG(R8))-2)+INT(0.5+100*POWER(10,(IF(96*(LOG(R8)-INT(LOG(R8)))-ROUND(96*(LOG(R8)-INT(LOG(R8))),0)<0,ROUND(96*(LOG(R8)-INT(LOG(R8))),0)-1,ROUND(96*(LOG(R8)-INT(LOG(R8))),0))+1)/96))*POWER(10,INT(LOG(R8))-2))/2,INT(0.5+100*POWER(10,(IF(96*(LOG(R8)-INT(LOG(R8)))-ROUND(96*(LOG(R8)-INT(LOG(R8))),0)<0,ROUND(96*(LOG(R8)-INT(LOG(R8))),0)-1,ROUND(96*(LOG(R8)-INT(LOG(R8))),0))+1)/96))*POWER(10,INT(LOG(R8))-2),INT(0.5+100*POWER(10,IF(96*(LOG(R8)-INT(LOG(R8)))-ROUND(96*(LOG(R8)-INT(LOG(R8))),0)<0,ROUND(96*(LOG(R8)-INT(LOG(R8))),0)-1,ROUND(96*(LOG(R8)-INT(LOG(R8))),0))/96))*POWER(10,INT(LOG(R8))-2))","v":{"$error":"#NUM!"}},"Ω"]
[0.82,0,0,0,0,0,0,0,0,0,{"$error":"#REF!"},{"$error":"#REF!"},{"$error":"#VALUE!"},{"$error":"#VALUE!"}]
[1,0,0,0,0,0,0,0,0,0,{"$error":"#REF!"},{"$error":"#REF!"},{"$error":"#VALUE!"},{"$error":"#VALUE!"},null,null,"Rfb1",{"$f":"Rfb1_","v":2500000},{"$f":"IF(R10>(INT(0.5+100*POWER(10,IF(96*(LOG(R10)-INT(LOG(R10)))-ROUND(96*(LOG(R10)-INT(LOG(R10))),0)<0,ROUND(96*(LOG(R10)-INT(LOG(R10))),0)-1,ROUND(96*(LOG(R10)-INT(LOG(R10))),0))/96))*POWER(10,INT(LOG(R10))-2)+INT(0.5+100*POWER(10,(IF(96*(LOG(R10)-INT(LOG(R10)))-ROUND(96*(LOG(R10)-INT(LOG(R10))),0)<0,ROUND(96*(LOG(R10)-INT(LOG(R10))),0)-1,ROUND(96*(LOG(R10)-INT(LOG(R10))),0))+1)/96))*POWER(10,INT(LOG(R10))-2))/2,INT(0.5+100*POWER(10,(IF(96*(LOG(R10)-INT(LOG(R10)))-ROUND(96*(LOG(R10)-INT(LOG(R10))),0)<0,ROUND(96*(LOG(R10)-INT(LOG(R10))),0)-1,ROUND(96*(LOG(R10)-INT(LOG(R10))),0))+1)/96))*POWER(10,INT(LOG(R10))-2),INT(0.5+100*POWER(10,IF(96*(LOG(R10)-INT(LOG(R10)))-ROUND(96*(LOG(R10)-INT(LOG(R10))),0)<0,ROUND(96*(LOG(R10)-INT(LOG(R10))),0)-1,ROUND(96*(LOG(R10)-INT(LOG(R10))),0))/96))*POWER(10,INT(LOG(R10))-2))","v":2490000},"Ω"]
[1.2,0,0,0,0,0,0,0,0,0,{"$error":"#REF!"},{"$error":"#REF!"},{"$f":"IF(IF((M$3*10^12-$A12)*(M$3*10^12-$A11)*-1<0,0,1)*IF(ABS(M$3*10^12-$A12)>(M$3*10^12-$A11),$A11,$A12)=M12,0,IF((M$3*10^12-$A12)*(M$3*10^12-$A11)*-1<0,0,1)*IF(ABS(M$3*10^12-$A12)>(M$3*10^12-$A11),$A11,$A12))","v":{"$error":"#VALUE!"}},{"$error":"#VALUE!"},null,null,"Rfb2",{"$f":"Rfb2_","v":178571.42857142858},{"$f":"IF(R11=\"OPEN\",\"OPEN\",IF(R11>(INT(0.5+100*POWER(10,IF(96*(LOG(R11)-INT(LOG(R11)))-ROUND(96*(LOG(R11)-INT(LOG(R11))),0)<0,ROUND(96*(LOG(R11)-INT(LOG(R11))),0)-1,ROUND(96*(LOG(R11)-INT(LOG(R11))),0))/96))*POWER(10,INT(LOG(R11))-2)+INT(0.5+100*POWER(10,(IF(96*(LOG(R11)-INT(LOG(R11)))-ROUND(96*(LOG(R11)-INT(LOG(R11))),0)<0,ROUND(96*(LOG(R11)-INT(LOG(R11))),0)-1,ROUND(96*(LOG(R11)-INT(LOG(R11))),0))+1)/96))*POWER(10,INT(LOG(R11))-2))/2,INT(0.5+100*POWER(10,(IF(96*(LOG(R11)-INT(LOG(R11)))-ROUND(96*(LOG(R11)-INT(LOG(R11))),0)<0,ROUND(96*(LOG(R11)-INT(LOG(R11))),0)-1,ROUND(96*(LOG(R11)-INT(LOG(R11))),0))+1)/96))*POWER(10,INT(LOG(R11))-2),INT(0.5+100*POWER(10,IF(96*(LOG(R11)-INT(LOG(R11)))-ROUND(96*(LOG(R11)-INT(LOG(R11))),0)<0,ROUND(96*(LOG(R11)-INT(LOG(R11))),0)-1,ROUND(96*(LOG(R11)-INT(LOG(R11))),0))/96))*POWER(10,INT(LOG(R11))-2)))","v":178000},"Ω"]
[1.5,0,0,0,0,0,0,0,0,0,{"$error":"#REF!"},{"$error":"#REF!"},{"$error":"#VALUE!"},{"$error":"#VALUE!"},null,null,"Rt1",{"$f":"'Variable Management'!B27*1000","v":54477.777777777781},{"$f":"IF(R12>(INT(0.5+100*POWER(10,IF(96*(LOG(R12)-INT(LOG(R12)))-ROUND(96*(LOG(R12)-INT(LOG(R12))),0)<0,ROUND(96*(LOG(R12)-INT(LOG(R12))),0)-1,ROUND(96*(LOG(R12)-INT(LOG(R12))),0))/96))*POWER(10,INT(LOG(R12))-2)+INT(0.5+100*POWER(10,(IF(96*(LOG(R12)-INT(LOG(R12)))-ROUND(96*(LOG(R12)-INT(LOG(R12))),0)<0,ROUND(96*(LOG(R12)-INT(LOG(R12))),0)-1,ROUND(96*(LOG(R12)-INT(LOG(R12))),0))+1)/96))*POWER(10,INT(LOG(R12))-2))/2,INT(0.5+100*POWER(10,(IF(96*(LOG(R12)-INT(LOG(R12)))-ROUND(96*(LOG(R12)-INT(LOG(R12))),0)<0,ROUND(96*(LOG(R12)-INT(LOG(R12))),0)-1,ROUND(96*(LOG(R12)-INT(LOG(R12))),0))+1)/96))*POWER(10,INT(LOG(R12))-2),INT(0.5+100*POWER(10,IF(96*(LOG(R12)-INT(LOG(R12)))-ROUND(96*(LOG(R12)-INT(LOG(R12))),0)<0,ROUND(96*(LOG(R12)-INT(LOG(R12))),0)-1,ROUND(96*(LOG(R12)-INT(LOG(R12))),0))/96))*POWER(10,INT(LOG(R12))-2))","v":54900},"Ω"]
[1.8,0,0,0,0,0,0,0,0,0,{"$error":"#REF!"},{"$error":"#REF!"},{"$error":"#VALUE!"},{"$error":"#VALUE!"},null,null,"Rd",{"$f":"'Variable Management'!B28*1000","v":0},{"$f":"IF(R13=\"OPEN\",\"OPEN\",IF(R13>(INT(0.5+100*POWER(10,IF(96*(LOG(R13)-INT(LOG(R13)))-ROUND(96*(LOG(R13)-INT(LOG(R13))),0)<0,ROUND(96*(LOG(R13)-INT(LOG(R13))),0)-1,ROUND(96*(LOG(R13)-INT(LOG(R13))),0))/96))*POWER(10,INT(LOG(R13))-2)+INT(0.5+100*POWER(10,(IF(96*(LOG(R13)-INT(LOG(R13)))-ROUND(96*(LOG(R13)-INT(LOG(R13))),0)<0,ROUND(96*(LOG(R13)-INT(LOG(R13))),0)-1,ROUND(96*(LOG(R13)-INT(LOG(R13))),0))+1)/96))*POWER(10,INT(LOG(R13))-2))/2,INT(0.5+100*POWER(10,(IF(96*(LOG(R13)-INT(LOG(R13)))-ROUND(96*(LOG(R13)-INT(LOG(R13))),0)<0,ROUND(96*(LOG(R13)-INT(LOG(R13))),0)-1,ROUND(96*(LOG(R13)-INT(LOG(R13))),0))+1)/96))*POWER(10,INT(LOG(R13))-2),INT(0.5+100*POWER(10,IF(96*(LOG(R13)-INT(LOG(R13)))-ROUND(96*(LOG(R13)-INT(LOG(R13))),0)<0,ROUND(96*(LOG(R13)-INT(LOG(R13))),0)-1,ROUND(96*(LOG(R13)-INT(LOG(R13))),0))/96))*POWER(10,INT(LOG(R13))-2)))","v":{"$error":"#NUM!"}},"Ω"]
[2.2000000000000002,{"$f":"IF(IF((B$3*10^12-$A15)*(B$3*10^12-$A14)*-1<0,0,1)*IF(ABS(B$3*10^12-$A15)>(B$3*10^12-$A14),$A14,$A15)=B15,0,IF((B$3*10^12-$A15)*(B$3*10^12-$A14)*-1<0,0,1)*IF(ABS(B$3*10^12-$A15)>(B$3*10^12-$A14),$A14,$A15))","v":0},0,0,0,0,0,0,0,0,{"$error":"#REF!"},{"$error":"#REF!"},{"$error":"#VALUE!"},{"$error":"#VALUE!"},null,null,"Rd_AEF",{"$f":"'Variable Management'!B303","v":0},{"$f":"IF(R14=\"OPEN\",\"OPEN\",IF(R14>(INT(0.5+100*POWER(10,IF(96*(LOG(R14)-INT(LOG(R14)))-ROUND(96*(LOG(R14)-INT(LOG(R14))),0)<0,ROUND(96*(LOG(R14)-INT(LOG(R14))),0)-1,ROUND(96*(LOG(R14)-INT(LOG(R14))),0))/96))*POWER(10,INT(LOG(R14))-2)+INT(0.5+100*POWER(10,(IF(96*(LOG(R14)-INT(LOG(R14)))-ROUND(96*(LOG(R14)-INT(LOG(R14))),0)<0,ROUND(96*(LOG(R14)-INT(LOG(R14))),0)-1,ROUND(96*(LOG(R14)-INT(LOG(R14))),0))+1)/96))*POWER(10,INT(LOG(R14))-2))/2,INT(0.5+100*POWER(10,(IF(96*(LOG(R14)-INT(LOG(R14)))-ROUND(96*(LOG(R14)-INT(LOG(R14))),0)<0,ROUND(96*(LOG(R14)-INT(LOG(R14))),0)-1,ROUND(96*(LOG(R14)-INT(LOG(R14))),0))+1)/96))*POWER(10,INT(LOG(R14))-2),INT(0.5+100*POWER(10,IF(96*(LOG(R14)-INT(LOG(R14)))-ROUND(96*(LOG(R14)-INT(LOG(R14))),0)<0,ROUND(96*(LOG(R14)-INT(LOG(R14))),0)-1,ROUND(96*(LOG(R14)-INT(LOG(R14))),0))/96))*POWER(10,INT(LOG(R14))-2)))","v":{"$error":"#NUM!"}},"Ω"]
[2.7,0,0,0,0,0,0,0,0,0,{"$f":"IF(IF((K$3*10^12-$A16)*(K$3*10^12-$A15)*-1<0,0,1)*IF(ABS(K$3*10^12-$A16)>(K$3*10^12-$A15),$A15,$A16)=K16,0,IF((K$3*10^12-$A16)*(K$3*10^12-$A15)*-1<0,0,1)*IF(ABS(K$3*10^12-$A16)>(K$3*10^12-$A15),$A15,$A16))","v":{"$error":"#REF!"}},{"$error":"#REF!"},{"$error":"#VALUE!"},{"$error":"#VALUE!"}]
[3.3,0,0,0,0,0,0,0,0,0,{"$error":"#REF!"},{"$error":"#REF!"},{"$error":"#VALUE!"},{"$error":"#VALUE!"},null,null,"Rs",{"$f":"Rs_ideal*1000","v":4.3513515673553496},{"$f":"IF(R16=0,0,IF(R16>(INT(0.5+100*POWER(10,IF(96*(LOG(R16)-INT(LOG(R16)))-ROUND(96*(LOG(R16)-INT(LOG(R16))),0)<0,ROUND(96*(LOG(R16)-INT(LOG(R16))),0)-1,ROUND(96*(LOG(R16)-INT(LOG(R16))),0))/96))*POWER(10,INT(LOG(R16))-2)+INT(0.5+100*POWER(10,(IF(96*(LOG(R16)-INT(LOG(R16)))-ROUND(96*(LOG(R16)-INT(LOG(R16))),0)<0,ROUND(96*(LOG(R16)-INT(LOG(R16))),0)-1,ROUND(96*(LOG(R16)-INT(LOG(R16))),0))+1)/96))*POWER(10,INT(LOG(R16))-2))/2,INT(0.5+100*POWER(10,(IF(96*(LOG(R16)-INT(LOG(R16)))-ROUND(96*(LOG(R16)-INT(LOG(R16))),0)<0,ROUND(96*(LOG(R16)-INT(LOG(R16))),0)-1,ROUND(96*(LOG(R16)-INT(LOG(R16))),0))+1)/96))*POWER(10,INT(LOG(R16))-2),INT(0.5+100*POWER(10,IF(96*(LOG(R16)-INT(LOG(R16)))-ROUND(96*(LOG(R16)-INT(LOG(R16))),0)<0,ROUND(96*(LOG(R16)-INT(LOG(R16))),0)-1,ROUND(96*(LOG(R16)-INT(LOG(R16))),0))/96))*POWER(10,INT(LOG(R16))-2)))","v":4.32},"mΩ"]
[3.9,0,0,0,0,0,0,0,0,0,{"$error":"#REF!"},{"$error":"#REF!"},{"$error":"#VALUE!"},{"$error":"#VALUE!"},null,null,"Cres",{"$f":"Cres","v":8.3333333333333338E-8},{"$f":"G4*1000000000000","v":82000},"pF"]
[4.7,0,0,0,0,0,0,0,0,0,{"$error":"#REF!"},{"$error":"#REF!"},{"$error":"#VALUE!"},{"$error":"#VALUE!"}]
[5.6,0,0,0,0,0,0,0,0,0,{"$error":"#REF!"},{"$error":"#REF!"},{"$error":"#VALUE!"},{"$error":"#VALUE!"}]
[6.8,0,0,0,0,0,0,0,0,0,{"$error":"#REF!"},{"$error":"#REF!"},{"$error":"#VALUE!"},{"$error":"#VALUE!"}]
[8.1999999999999993,0,0,0,0,0,0,0,0,0,{"$error":"#REF!"},{"$error":"#REF!"},{"$error":"#VALUE!"},{"$error":"#VALUE!"},null,null,"Cdither",{"$f":"Cdither_init","v":2.8344671201814057E-9},{"$f":"H4","v":2.7000000000000002E-9}]
[10,0,0,0,0,0,0,0,0,0,{"$f":"IF(IF((K$3*10^12-$A23)*(K$3*10^12-$A22)*-1<0,0,1)*IF(ABS(K$3*10^12-$A23)>(K$3*10^12-$A22),$A22,$A23)=K23,0,IF((K$3*10^12-$A23)*(K$3*10^12-$A22)*-1<0,0,1)*IF(ABS(K$3*10^12-$A23)>(K$3*10^12-$A22),$A22,$A23))","v":{"$error":"#REF!"}},{"$error":"#REF!"},{"$error":"#VALUE!"},{"$error":"#VALUE!"}]
[12,0,0,0,0,0,0,0,0,0,{"$error":"#REF!"},{"$error":"#REF!"},{"$error":"#VALUE!"},{"$error":"#VALUE!"},null,null,"Cin_Passive",{"$f":"K4","v":{"$error":"#REF!"}},{"$f":"R23*1000000","v":{"$error":"#REF!"}},"uF"]
[15,0,0,0,0,0,0,0,0,0,{"$error":"#REF!"},{"$error":"#REF!"},{"$error":"#VALUE!"},{"$error":"#VALUE!"},null,null,"Cinj_AEF",{"$f":"Cinj_AEF","v":{"$error":"#VALUE!"}},{"$f":"M4*1000000","v":{"$error":"#VALUE!"}},"uF"]
[18,0,0,18,0,0,0,0,0,0,{"$error":"#REF!"},{"$error":"#REF!"},{"$error":"#VALUE!"},{"$error":"#VALUE!"},null,null,"Cdamp_AEF",{"$f":"'Variable Management'!B297","v":{"$error":"#VALUE!"}},{"$f":"N4*1000000","v":{"$error":"#VALUE!"}},"uF"]
[22,0,0,0,0,0,0,0,0,0,{"$error":"#REF!"},{"$error":"#REF!"},{"$error":"#VALUE!"},{"$error":"#VALUE!"},null,null,"Rdamp_AEF",{"$f":"'Variable Management'!B298","v":{"$error":"#VALUE!"}},{"$f":"IF(R26=\"OPEN\",\"OPEN\",IF(R26>(INT(0.5+100*POWER(10,IF(96*(LOG(R26)-INT(LOG(R26)))-ROUND(96*(LOG(R26)-INT(LOG(R26))),0)<0,ROUND(96*(LOG(R26)-INT(LOG(R26))),0)-1,ROUND(96*(LOG(R26)-INT(LOG(R26))),0))/96))*POWER(10,INT(LOG(R26))-2)+INT(0.5+100*POWER(10,(IF(96*(LOG(R26)-INT(LOG(R26)))-ROUND(96*(LOG(R26)-INT(LOG(R26))),0)<0,ROUND(96*(LOG(R26)-INT(LOG(R26))),0)-1,ROUND(96*(LOG(R26)-INT(LOG(R26))),0))+1)/96))*POWER(10,INT(LOG(R26))-2))/2,INT(0.5+100*POWER(10,(IF(96*(LOG(R26)-INT(LOG(R26)))-ROUND(96*(LOG(R26)-INT(LOG(R26))),0)<0,ROUND(96*(LOG(R26)-INT(LOG(R26))),0)-1,ROUND(96*(LOG(R26)-INT(LOG(R26))),0))+1)/96))*POWER(10,INT(LOG(R26))-2),INT(0.5+100*POWER(10,IF(96*(LOG(R26)-INT(LOG(R26)))-ROUND(96*(LOG(R26)-INT(LOG(R26))),0)<0,ROUND(96*(LOG(R26)-INT(LOG(R26))),0)-1,ROUND(96*(LOG(R26)-INT(LOG(R26))),0))/96))*POWER(10,INT(LOG(R26))-2)))","v":{"$error":"#VALUE!"}},"Ω"]
[27,0,0,0,0,0,0,0,0,0,{"$error":"#REF!"},{"$error":"#REF!"},{"$f":"IF(IF((M$3*10^12-$A28)*(M$3*10^12-$A27)*-1<0,0,1)*IF(ABS(M$3*10^12-$A28)>(M$3*10^12-$A27),$A27,$A28)=M28,0,IF((M$3*10^12-$A28)*(M$3*10^12-$A27)*-1<0,0,1)*IF(ABS(M$3*10^12-$A28)>(M$3*10^12-$A27),$A27,$A28))","v":{"$error":"#VALUE!"}},{"$error":"#VALUE!"},null,null,"Rdamp_Passive",{"$f":"SQRT(L_infilterStd/K4)","v":{"$error":"#REF!"}},{"$f":"IF(R27=\"OPEN\",\"OPEN\",IF(R27>(INT(0.5+100*POWER(10,IF(96*(LOG(R27)-INT(LOG(R27)))-ROUND(96*(LOG(R27)-INT(LOG(R27))),0)<0,ROUND(96*(LOG(R27)-INT(LOG(R27))),0)-1,ROUND(96*(LOG(R27)-INT(LOG(R27))),0))/96))*POWER(10,INT(LOG(R27))-2)+INT(0.5+100*POWER(10,(IF(96*(LOG(R27)-INT(LOG(R27)))-ROUND(96*(LOG(R27)-INT(LOG(R27))),0)<0,ROUND(96*(LOG(R27)-INT(LOG(R27))),0)-1,ROUND(96*(LOG(R27)-INT(LOG(R27))),0))+1)/96))*POWER(10,INT(LOG(R27))-2))/2,INT(0.5+100*POWER(10,(IF(96*(LOG(R27)-INT(LOG(R27)))-ROUND(96*(LOG(R27)-INT(LOG(R27))),0)<0,ROUND(96*(LOG(R27)-INT(LOG(R27))),0)-1,ROUND(96*(LOG(R27)-INT(LOG(R27))),0))+1)/96))*POWER(10,INT(LOG(R27))-2),INT(0.5+100*POWER(10,IF(96*(LOG(R27)-INT(LOG(R27)))-ROUND(96*(LOG(R27)-INT(LOG(R27))),0)<0,ROUND(96*(LOG(R27)-INT(LOG(R27))),0)-1,ROUND(96*(LOG(R27)-INT(LOG(R27))),0))/96))*POWER(10,INT(LOG(R27))-2)))","v":{"$error":"#REF!"}},"Ω"]
[33,0,0,0,0,0,0,0,0,0,{"$error":"#REF!"},{"$error":"#REF!"},{"$error":"#VALUE!"},{"$error":"#VALUE!"},null,null,"Cdamp_Passive",{"$f":"L4","v":{"$error":"#REF!"}},{"$f":"R28*1000000","v":{"$error":"#REF!"}},"uF"]
[39,0,0,0,0,0,0,0,0,0,{"$error":"#REF!"},{"$error":"#REF!"},{"$error":"#VALUE!"},{"$error":"#VALUE!"}]
[47,0,0,0,0,0,0,0,0,0,{"$error":"#REF!"},{"$error":"#REF!"},{"$error":"#VALUE!"},{"$error":"#VALUE!"}]
[56,0,0,0,0,0,0,0,0,0,{"$error":"#REF!"},{"$error":"#REF!"},{"$error":"#VALUE!"},{"$error":"#VALUE!"}]
[68,0,0,0,0,0,0,0,0,0,{"$error":"#REF!"},{"$error":"#REF!"},{"$error":"#VALUE!"},{"$error":"#VALUE!"},null,null,"Rc1",{"$f":"S7/1000&\" kΩ\"","v":"15.4 kΩ"},{"$f":"S7/1000","v":15.4},"kΩ"]
[82,0,0,0,0,0,0,0,0,0,{"$error":"#REF!"},{"$error":"#REF!"},{"$error":"#VALUE!"},{"$error":"#VALUE!"},null,null,"Cc1",{"$f":"C4*1000000000&\" nF\"","v":"2.7 nF"},{"$f":"C4*1000000000","v":2.7},"nF"]
[{"$f":"A22*10","v":100},0,0,0,0,0,0,0,0,0,{"$error":"#REF!"},{"$error":"#REF!"},{"$error":"#VALUE!"},{"$error":"#VALUE!"},null,null,"Cc2",{"$f":"D4*1000000000000&\" pF\"","v":"18 pF"},{"$f":"D4*1000000000000","v":18},"pF"]
[{"$f":"A23*10","v":120},0,0,0,0,0,0,0,0,0,{"$error":"#REF!"},{"$error":"#REF!"},{"$error":"#VALUE!"},{"$error":"#VALUE!"}]
[150,0,0,0,0,0,0,0,0,0,{"$error":"#REF!"},{"$error":"#REF!"},{"$error":"#VALUE!"},{"$error":"#VALUE!"},null,null,"Rc2",{"$f":"S8/1000&\" kΩ\"","v":{"$error":"#NUM!"}},{"$f":"S8/1000","v":{"$error":"#NUM!"}},"kΩ"]
[180,0,0,0,0,0,0,0,0,0,{"$error":"#REF!"},{"$error":"#REF!"},{"$error":"#VALUE!"},{"$error":"#VALUE!"},null,null,"Cc3",{"$f":"I4*1000000000&\" nF\"","v":"0 nF"},{"$f":"I4*1000000000","v":0},"nF"]
[220,0,0,0,0,0,0,0,0,0,{"$error":"#REF!"},{"$error":"#REF!"},{"$error":"#VALUE!"},{"$error":"#VALUE!"},null,null,"Cc4",{"$f":"J4*1000000000000&\" pF\"","v":"0 pF"},{"$f":"J4*1000000000000","v":0},"pF"]
[270,0,{"$f":"IF(IF((C$3*10^12-$A40)*(C$3*10^12-$A39)*-1<0,0,1)*IF(ABS(C$3*10^12-$A40)>(C$3*10^12-$A39),$A39,$A40)=C40,0,IF((C$3*10^12-$A40)*(C$3*10^12-$A39)*-1<0,0,1)*IF(ABS(C$3*10^12-$A40)>(C$3*10^12-$A39),$A39,$A40))","v":0},0,0,0,0,0,0,0,{"$error":"#REF!"},{"$error":"#REF!"},{"$error":"#VALUE!"},{"$error":"#VALUE!"}]
[330,0,0,0,0,0,0,0,0,0,{"$error":"#REF!"},{"$error":"#REF!"},{"$error":"#VALUE!"},{"$error":"#VALUE!"},null,null,"Rent",{"$f":"'Variable Management'!B188/1000","v":99.999999999999986},{"$f":"IF(R40>(INT(0.5+100*POWER(10,IF(96*(LOG(R40)-INT(LOG(R40)))-ROUND(96*(LOG(R40)-INT(LOG(R40))),0)<0,ROUND(96*(LOG(R40)-INT(LOG(R40))),0)-1,ROUND(96*(LOG(R40)-INT(LOG(R40))),0))/96))*POWER(10,INT(LOG(R40))-2)+INT(0.5+100*POWER(10,(IF(96*(LOG(R40)-INT(LOG(R40)))-ROUND(96*(LOG(R40)-INT(LOG(R40))),0)<0,ROUND(96*(LOG(R40)-INT(LOG(R40))),0)-1,ROUND(96*(LOG(R40)-INT(LOG(R40))),0))+1)/96))*POWER(10,INT(LOG(R40))-2))/2,INT(0.5+100*POWER(10,(IF(96*(LOG(R40)-INT(LOG(R40)))-ROUND(96*(LOG(R40)-INT(LOG(R40))),0)<0,ROUND(96*(LOG(R40)-INT(LOG(R40))),0)-1,ROUND(96*(LOG(R40)-INT(LOG(R40))),0))+1)/96))*POWER(10,INT(LOG(R40))-2),INT(0.5+100*POWER(10,IF(96*(LOG(R40)-INT(LOG(R40)))-ROUND(96*(LOG(R40)-INT(LOG(R40))),0)<0,ROUND(96*(LOG(R40)-INT(LOG(R40))),0)-1,ROUND(96*(LOG(R40)-INT(LOG(R40))),0))/96))*POWER(10,INT(LOG(R40))-2))","v":100},"kΩ"]
[390,0,0,0,0,0,0,0,0,0,{"$error":"#REF!"},{"$error":"#REF!"},{"$error":"#VALUE!"},{"$error":"#VALUE!"},null,null,"Renb",{"$f":"'Variable Management'!B189/1000","v":19.999999999999996},{"$f":"IF(R41>(INT(0.5+100*POWER(10,IF(96*(LOG(R41)-INT(LOG(R41)))-ROUND(96*(LOG(R41)-INT(LOG(R41))),0)<0,ROUND(96*(LOG(R41)-INT(LOG(R41))),0)-1,ROUND(96*(LOG(R41)-INT(LOG(R41))),0))/96))*POWER(10,INT(LOG(R41))-2)+INT(0.5+100*POWER(10,(IF(96*(LOG(R41)-INT(LOG(R41)))-ROUND(96*(LOG(R41)-INT(LOG(R41))),0)<0,ROUND(96*(LOG(R41)-INT(LOG(R41))),0)-1,ROUND(96*(LOG(R41)-INT(LOG(R41))),0))+1)/96))*POWER(10,INT(LOG(R41))-2))/2,INT(0.5+100*POWER(10,(IF(96*(LOG(R41)-INT(LOG(R41)))-ROUND(96*(LOG(R41)-INT(LOG(R41))),0)<0,ROUND(96*(LOG(R41)-INT(LOG(R41))),0)-1,ROUND(96*(LOG(R41)-INT(LOG(R41))),0))+1)/96))*POWER(10,INT(LOG(R41))-2),INT(0.5+100*POWER(10,IF(96*(LOG(R41)-INT(LOG(R41)))-ROUND(96*(LOG(R41)-INT(LOG(R41))),0)<0,ROUND(96*(LOG(R41)-INT(LOG(R41))),0)-1,ROUND(96*(LOG(R41)-INT(LOG(R41))),0))/96))*POWER(10,INT(LOG(R41))-2))","v":20},"kΩ"]
[470,0,0,0,0,0,0,0,0,0,{"$error":"#REF!"},{"$error":"#REF!"},{"$error":"#VALUE!"},{"$error":"#VALUE!"}]
[560,0,0,0,0,0,0,0,0,0,{"$error":"#REF!"},{"$error":"#REF!"},{"$f":"IF(IF((M$3*10^12-$A44)*(M$3*10^12-$A43)*-1<0,0,1)*IF(ABS(M$3*10^12-$A44)>(M$3*10^12-$A43),$A43,$A44)=M44,0,IF((M$3*10^12-$A44)*(M$3*10^12-$A43)*-1<0,0,1)*IF(ABS(M$3*10^12-$A44)>(M$3*10^12-$A43),$A43,$A44))","v":{"$error":"#VALUE!"}},{"$error":"#VALUE!"}]
[680,0,0,0,0,0,0,0,0,0,{"$error":"#REF!"},{"$error":"#REF!"},{"$error":"#VALUE!"},{"$error":"#VALUE!"}]
[{"$f":"A33*10","v":820},0,0,0,0,0,0,0,0,0,{"$error":"#REF!"},{"$error":"#REF!"},{"$error":"#VALUE!"},{"$error":"#VALUE!"}]
[1000,0,0,0,0,0,0,0,0,0,{"$error":"#REF!"},{"$error":"#REF!"},{"$error":"#VALUE!"},{"$error":"#VALUE!"}]
[1200,0,0,0,0,0,0,0,0,0,{"$error":"#REF!"},{"$error":"#REF!"},{"$error":"#VALUE!"},{"$error":"#VALUE!"}]
[1500,0,0,0,0,0,0,0,0,0,{"$error":"#REF!"},{"$error":"#REF!"},{"$error":"#VALUE!"},{"$error":"#VALUE!"}]
[1800,0,0,0,0,0,0,0,0,0,{"$error":"#REF!"},{"$error":"#REF!"},{"$error":"#VALUE!"},{"$error":"#VALUE!"}]
[2200,0,2700,0,0,0,0,0,0,0,{"$error":"#REF!"},{"$error":"#REF!"},{"$error":"#VALUE!"},{"$error":"#VALUE!"}]
[2700,0,0,0,0,0,0,2700,0,0,{"$error":"#REF!"},{"$error":"#REF!"},{"$error":"#VALUE!"},{"$error":"#VALUE!"}]
[3300,0,0,0,0,0,0,0,0,0,{"$error":"#REF!"},{"$error":"#REF!"},{"$error":"#VALUE!"},{"$error":"#VALUE!"}]
[3900,0,0,0,0,0,0,0,0,0,{"$error":"#REF!"},{"$error":"#REF!"},{"$error":"#VALUE!"},{"$error":"#VALUE!"}]
[4700,0,0,0,0,0,0,0,0,0,{"$error":"#REF!"},{"$error":"#REF!"},{"$error":"#VALUE!"},{"$error":"#VALUE!"}]
[5600,0,0,0,0,0,0,0,0,0,{"$error":"#REF!"},{"$error":"#REF!"},{"$error":"#VALUE!"},{"$error":"#VALUE!"}]
[6800,0,0,0,0,0,0,0,0,0,{"$error":"#REF!"},{"$error":"#REF!"},{"$error":"#VALUE!"},{"$error":"#VALUE!"}]
[8200,0,0,0,0,0,0,0,0,0,{"$error":"#REF!"},{"$error":"#REF!"},{"$error":"#VALUE!"},{"$error":"#VALUE!"}]
[10000,0,0,0,0,0,0,0,0,0,{"$error":"#REF!"},{"$error":"#REF!"},{"$error":"#VALUE!"},{"$error":"#VALUE!"}]
[12000,0,0,0,0,0,0,0,0,0,{"$error":"#REF!"},{"$error":"#REF!"},{"$f":"IF(IF((M$3*10^12-$A60)*(M$3*10^12-$A59)*-1<0,0,1)*IF(ABS(M$3*10^12-$A60)>(M$3*10^12-$A59),$A59,$A60)=M60,0,IF((M$3*10^12-$A60)*(M$3*10^12-$A59)*-1<0,0,1)*IF(ABS(M$3*10^12-$A60)>(M$3*10^12-$A59),$A59,$A60))","v":{"$error":"#VALUE!"}},{"$error":"#VALUE!"}]
[15000,0,0,0,0,0,0,0,0,0,{"$error":"#REF!"},{"$error":"#REF!"},{"$error":"#VALUE!"},{"$error":"#VALUE!"}]
[18000,0,0,0,0,0,0,0,0,0,{"$error":"#REF!"},{"$error":"#REF!"},{"$error":"#VALUE!"},{"$error":"#VALUE!"}]
[22000,0,0,0,0,0,0,0,0,0,{"$error":"#REF!"},{"$error":"#REF!"},{"$error":"#VALUE!"},{"$error":"#VALUE!"}]
[27000,0,0,0,0,0,0,0,0,0,{"$error":"#REF!"},{"$error":"#REF!"},{"$error":"#VALUE!"},{"$error":"#VALUE!"}]
[33000,0,0,0,0,0,0,0,0,0,{"$error":"#REF!"},{"$error":"#REF!"},{"$error":"#VALUE!"},{"$error":"#VALUE!"}]
[39000,0,0,0,0,0,0,0,0,0,{"$error":"#REF!"},{"$error":"#REF!"},{"$error":"#VALUE!"},{"$error":"#VALUE!"}]
[47000,0,0,0,0,0,0,0,0,0,{"$error":"#REF!"},{"$error":"#REF!"},{"$error":"#VALUE!"},{"$error":"#VALUE!"}]
[56000,0,0,0,0,0,0,0,0,0,{"$error":"#REF!"},{"$error":"#REF!"},{"$error":"#VALUE!"},{"$error":"#VALUE!"}]
[68000,0,0,0,0,0,0,0,0,0,{"$error":"#REF!"},{"$error":"#REF!"},{"$error":"#VALUE!"},{"$error":"#VALUE!"}]
[82000,0,0,0,0,0,82000,0,0,{"$f":"IF(IF((J$3*10^12-$A70)*(J$3*10^12-$A69)*-1<0,0,1)*IF(ABS(J$3*10^12-$A70)>(J$3*10^12-$A69),$A69,$A70)=J70,0,IF((J$3*10^12-$A70)*(J$3*10^12-$A69)*-1<0,0,1)*IF(ABS(J$3*10^12-$A70)>(J$3*10^12-$A69),$A69,$A70))","v":0},{"$error":"#REF!"},{"$error":"#REF!"},{"$error":"#VALUE!"},{"$error":"#VALUE!"}]
[100000,0,0,{"$f":"IF(IF((D$3*10^12-$A71)*(D$3*10^12-$A70)*-1<0,0,1)*IF(ABS(D$3*10^12-$A71)>(D$3*10^12-$A70),$A70,$A71)=D71,0,IF((D$3*10^12-$A71)*(D$3*10^12-$A70)*-1<0,0,1)*IF(ABS(D$3*10^12-$A71)>(D$3*10^12-$A70),$A70,$A71))","v":0},0,0,0,0,0,0,{"$error":"#REF!"},{"$error":"#REF!"},{"$error":"#VALUE!"},{"$error":"#VALUE!"}]
[120000,{"$f":"IF(IF((B$3*10^12-$A72)*(B$3*10^12-$A71)*-1<0,0,1)*IF(ABS(B$3*10^12-$A72)>(B$3*10^12-$A71),$A71,$A72)=B72,0,IF((B$3*10^12-$A72)*(B$3*10^12-$A71)*-1<0,0,1)*IF(ABS(B$3*10^12-$A72)>(B$3*10^12-$A71),$A71,$A72))","v":0},{"$f":"IF(IF((C$3*10^12-$A72)*(C$3*10^12-$A71)*-1<0,0,1)*IF(ABS(C$3*10^12-$A72)>(C$3*10^12-$A71),$A71,$A72)=C72,0,IF((C$3*10^12-$A72)*(C$3*10^12-$A71)*-1<0,0,1)*IF(ABS(C$3*10^12-$A72)>(C$3*10^12-$A71),$A71,$A72))","v":0},0,0,{"$f":"IF(IF((F$3*10^12-$A72)*(F$3*10^12-$A71)*-1<0,0,1)*IF(ABS(F$3*10^12-$A72)>(F$3*10^12-$A71),$A71,$A72)=F72,0,IF((F$3*10^12-$A72)*(F$3*10^12-$A71)*-1<0,0,1)*IF(ABS(F$3*10^12-$A72)>(F$3*10^12-$A71),$A71,$A72))","v":0},{"$f":"IF(IF((G$3*10^12-$A72)*(G$3*10^12-$A71)*-1<0,0,1)*IF(ABS(G$3*10^12-$A72)>(G$3*10^12-$A71),$A71,$A72)=G72,0,IF((G$3*10^12-$A72)*(G$3*10^12-$A71)*-1<0,0,1)*IF(ABS(G$3*10^12-$A72)>(G$3*10^12-$A71),$A71,$A72))","v":0},{"$f":"IF(IF((H$3*10^12-$A72)*(H$3*10^12-$A71)*-1<0,0,1)*IF(ABS(H$3*10^12-$A72)>(H$3*10^12-$A71),$A71,$A72)=H72,0,IF((H$3*10^12-$A72)*(H$3*10^12-$A71)*-1<0,0,1)*IF(ABS(H$3*10^12-$A72)>(H$3*10^12-$A71),$A71,$A72))","v":0},{"$f":"IF(IF((I$3*10^12-$A72)*(I$3*10^12-$A71)*-1<0,0,1)*IF(ABS(I$3*10^12-$A72)>(I$3*10^12-$A71),$A71,$A72)=I72,0,IF((I$3*10^12-$A72)*(I$3*10^12-$A71)*-1<0,0,1)*IF(ABS(I$3*10^12-$A72)>(I$3*10^12-$A71),$A71,$A72))","v":0},0,{"$error":"#REF!"},{"$error":"#REF!"},{"$error":"#VALUE!"},{"$error":"#VALUE!"}]
[150000,0,0,0,0,0,0,0,0,0,{"$error":"#REF!"},{"$error":"#REF!"},{"$error":"#VALUE!"},{"$error":"#VALUE!"}]
[180000,0,0,0,0,0,0,0,0,0,{"$error":"#REF!"},{"$error":"#REF!"},{"$error":"#VALUE!"},{"$error":"#VALUE!"}]
[220000,0,0,0,0,0,0,0,0,0,{"$error":"#REF!"},{"$error":"#REF!"},{"$error":"#VALUE!"},{"$error":"#VALUE!"}]
[270000,0,0,0,0,0,0,0,0,0,{"$error":"#REF!"},{"$error":"#REF!"},{"$error":"#VALUE!"},{"$error":"#VALUE!"}]
[330000,0,0,0,0,0,0,0,0,0,{"$error":"#REF!"},{"$error":"#REF!"},{"$error":"#VALUE!"},{"$error":"#VALUE!"}]
[390000,0,0,0,0,0,0,0,0,0,{"$error":"#REF!"},{"$error":"#REF!"},{"$error":"#VALUE!"},{"$error":"#VALUE!"}]
[470000,0,0,0,0,0,0,0,0,0,{"$error":"#REF!"},{"$error":"#REF!"},{"$error":"#VALUE!"},{"$error":"#VALUE!"}]
[560000,0,0,0,0,0,0,0,0,0,{"$error":"#REF!"},{"$error":"#REF!"},{"$error":"#VALUE!"},{"$error":"#VALUE!"}]
[680000,0,0,0,0,0,0,0,0,0,{"$error":"#REF!"},{"$error":"#REF!"},{"$error":"#VALUE!"},{"$error":"#VALUE!"}]
[820000,0,0,0,0,0,0,0,0,0,{"$error":"#REF!"},{"$error":"#REF!"},{"$error":"#VALUE!"},{"$error":"#VALUE!"}]
[1000000,0,0,0,0,0,0,0,0,0,{"$error":"#REF!"},{"$error":"#REF!"},{"$error":"#VALUE!"},{"$error":"#VALUE!"}]
[1200000,0,0,0,0,0,0,0,0,0,{"$error":"#REF!"},{"$error":"#REF!"},{"$error":"#VALUE!"},{"$error":"#VALUE!"}]
[1500000,0,0,0,0,0,0,0,0,0,{"$error":"#REF!"},{"$error":"#REF!"},{"$error":"#VALUE!"},{"$error":"#VALUE!"}]
[1800000,0,0,0,0,0,0,0,0,0,{"$error":"#REF!"},{"$f":"IF(IF((L$3*10^12-$A86)*(L$3*10^12-$A85)*-1<0,0,1)*IF(ABS(L$3*10^12-$A86)>(L$3*10^12-$A85),$A85,$A86)=L86,0,IF((L$3*10^12-$A86)*(L$3*10^12-$A85)*-1<0,0,1)*IF(ABS(L$3*10^12-$A86)>(L$3*10^12-$A85),$A85,$A86))","v":{"$error":"#REF!"}},{"$error":"#VALUE!"},{"$error":"#VALUE!"}]
[2200000,0,0,0,0,0,0,0,0,0,{"$error":"#REF!"},{"$error":"#REF!"},{"$error":"#VALUE!"},{"$error":"#VALUE!"}]
[2700000,0,0,0,0,0,0,0,0,0,{"$error":"#REF!"},{"$error":"#REF!"},{"$error":"#VALUE!"},{"$error":"#VALUE!"}]
[3300000,0,0,0,0,0,0,0,0,0,{"$error":"#REF!"},{"$error":"#REF!"},{"$error":"#VALUE!"},{"$error":"#VALUE!"}]
[3900000,0,0,0,0,0,0,0,0,0,{"$error":"#REF!"},{"$error":"#REF!"},{"$error":"#VALUE!"},{"$error":"#VALUE!"}]
[4700000,0,0,0,0,0,0,0,0,0,{"$error":"#REF!"},{"$error":"#REF!"},{"$error":"#VALUE!"},{"$error":"#VALUE!"}]
[5600000,0,0,0,0,0,0,0,0,0,{"$error":"#REF!"},{"$error":"#REF!"},{"$error":"#VALUE!"},{"$error":"#VALUE!"}]
[6800000,0,0,0,0,0,0,0,0,0,{"$error":"#REF!"},{"$error":"#REF!"},{"$error":"#VALUE!"},{"$error":"#VALUE!"}]
[8200000,0,0,0,0,0,0,0,0,0,{"$error":"#REF!"},{"$error":"#REF!"},{"$error":"#VALUE!"},{"$error":"#VALUE!"}]
[10000000,0,0,0,0,0,0,0,0,0,{"$error":"#REF!"},{"$error":"#REF!"},{"$error":"#VALUE!"},{"$error":"#VALUE!"}]
[12000000,0,0,0,0,0,0,0,0,0,{"$error":"#REF!"},{"$error":"#REF!"},{"$error":"#VALUE!"},{"$error":"#VALUE!"}]
[15000000,0,0,0,0,15000000,0,0,0,0,{"$error":"#REF!"},{"$error":"#REF!"},{"$error":"#VALUE!"},{"$error":"#VALUE!"}]
[18000000,0,0,0,0,0,0,0,0,0,{"$error":"#REF!"},{"$error":"#REF!"},{"$error":"#VALUE!"},{"$error":"#VALUE!"}]
[22000000,0,0,0,0,0,0,0,0,0,{"$error":"#REF!"},{"$error":"#REF!"},{"$error":"#VALUE!"},{"$error":"#VALUE!"}]
[{"$f":"A87*10","v":27000000},0,0,0,0,0,0,0,0,0,{"$error":"#REF!"},{"$error":"#REF!"},{"$error":"#VALUE!"},{"$error":"#VALUE!"}]
[33000000,0,0,0,0,0,0,0,0,0,{"$error":"#REF!"},{"$error":"#REF!"},{"$error":"#VALUE!"},{"$error":"#VALUE!"}]
[39000000,0,0,0,0,0,0,0,0,0,{"$error":"#REF!"},{"$error":"#REF!"},{"$error":"#VALUE!"},{"$error":"#VALUE!"}]
[47000000,0,0,0,0,0,0,0,0,0,{"$error":"#REF!"},{"$error":"#REF!"},{"$error":"#VALUE!"},{"$error":"#VALUE!"}]
[56000000,0,0,0,0,{"$f":"IF(IF((F$3*10^12-$A104)*(F$3*10^12-$A103)*-1<0,0,1)*IF(ABS(F$3*10^12-$A104)>(F$3*10^12-$A103),$A103,$A104)=F104,0,IF((F$3*10^12-$A104)*(F$3*10^12-$A103)*-1<0,0,1)*IF(ABS(F$3*10^12-$A104)>(F$3*10^12-$A103),$A103,$A104))","v":0},{"$f":"IF(IF((G$3*10^12-$A104)*(G$3*10^12-$A103)*-1<0,0,1)*IF(ABS(G$3*10^12-$A104)>(G$3*10^12-$A103),$A103,$A104)=G104,0,IF((G$3*10^12-$A104)*(G$3*10^12-$A103)*-1<0,0,1)*IF(ABS(G$3*10^12-$A104)>(G$3*10^12-$A103),$A103,$A104))","v":0},{"$f":"IF(IF((H$3*10^12-$A104)*(H$3*10^12-$A103)*-1<0,0,1)*IF(ABS(H$3*10^12-$A104)>(H$3*10^12-$A103),$A103,$A104)=H104,0,IF((H$3*10^12-$A104)*(H$3*10^12-$A103)*-1<0,0,1)*IF(ABS(H$3*10^12-$A104)>(H$3*10^12-$A103),$A103,$A104))","v":0},{"$f":"IF(IF((I$3*10^12-$A104)*(I$3*10^12-$A103)*-1<0,0,1)*IF(ABS(I$3*10^12-$A104)>(I$3*10^12-$A103),$A103,$A104)=I104,0,IF((I$3*10^12-$A104)*(I$3*10^12-$A103)*-1<0,0,1)*IF(ABS(I$3*10^12-$A104)>(I$3*10^12-$A103),$A103,$A104))","v":0},0,{"$error":"#REF!"},{"$error":"#REF!"},{"$error":"#VALUE!"},{"$error":"#VALUE!"}]
[68000000,0,0,0,0,0,0,0,0,0,{"$error":"#REF!"},{"$error":"#REF!"},{"$error":"#VALUE!"},{"$error":"#VALUE!"}]
[82000000,0,0,0,0,0,0,0,0,0,{"$error":"#REF!"},{"$error":"#REF!"},{"$error":"#VALUE!"},{"$error":"#VALUE!"}]
[100000000,0,0,0,100000000,0,0,0,0,0,{"$error":"#REF!"},{"$error":"#REF!"},{"$error":"#VALUE!"},{"$error":"#VALUE!"}]
[120000000,0,0,0,0,0,0,0,0,0,{"$error":"#REF!"},{"$error":"#REF!"},{"$error":"#VALUE!"},{"$error":"#VALUE!"}]
[150000000,0,0,0,0,0,0,0,0,0,{"$error":"#REF!"},{"$error":"#REF!"},{"$error":"#VALUE!"},{"$error":"#VALUE!"}]
[180000000,0,0,0,0,0,0,0,0,0,{"$error":"#REF!"},{"$error":"#REF!"},{"$error":"#VALUE!"},{"$error":"#VALUE!"}]
[220000000,0,0,0,0,0,0,0,0,0,{"$error":"#REF!"},{"$error":"#REF!"},{"$error":"#VALUE!"},{"$error":"#VALUE!"}]
[270000000,0,0,0,0,0,0,0,0,0,{"$error":"#REF!"},{"$error":"#REF!"},{"$error":"#VALUE!"},{"$error":"#VALUE!"}]
[330000000,0,0,0,0,0,0,0,0,0,{"$error":"#REF!"},{"$error":"#REF!"},{"$error":"#VALUE!"},{"$error":"#VALUE!"}]
[390000000,0,0,0,0,0,0,0,0,0,{"$error":"#REF!"},{"$error":"#REF!"},{"$error":"#VALUE!"},{"$error":"#VALUE!"}]
[470000000,0,0,0,0,0,0,0,0,0,{"$error":"#REF!"},{"$error":"#REF!"},{"$error":"#VALUE!"},{"$error":"#VALUE!"}]
[560000000,0,0,0,0,0,0,0,0,0,{"$error":"#REF!"},{"$error":"#REF!"},{"$error":"#VALUE!"},{"$error":"#VALUE!"}]
[680000000,0,0,0,0,0,0,0,0,0,{"$error":"#REF!"},{"$error":"#REF!"},{"$error":"#VALUE!"},{"$error":"#VALUE!"}]
[820000000,0,0,0,0,0,0,0,0,0,{"$error":"#REF!"},{"$error":"#REF!"},{"$error":"#VALUE!"},{"$error":"#VALUE!"}]
[1000000000,0,0,0,0,0,0,0,0,0,{"$error":"#REF!"},{"$error":"#REF!"},{"$error":"#VALUE!"},{"$error":"#VALUE!"}]
[1200000000,0,0,0,0,0,0,0,0,0,{"$error":"#REF!"},{"$error":"#REF!"},{"$error":"#VALUE!"},{"$error":"#VALUE!"}]
[1500000000,0,0,0,0,0,0,0,0,0,{"$error":"#REF!"},{"$error":"#REF!"},{"$error":"#VALUE!"},{"$error":"#VALUE!"}]
[1800000000,0,0,0,0,0,0,0,0,0,{"$error":"#REF!"},{"$error":"#REF!"},{"$error":"#VALUE!"},{"$error":"#VALUE!"}]
[2200000000,0,0,0,0,0,0,0,0,0,{"$error":"#REF!"},{"$error":"#REF!"},{"$error":"#VALUE!"},{"$error":"#VALUE!"}]
[2700000000,0,0,0,0,0,0,0,0,0,{"$error":"#REF!"},{"$error":"#REF!"},{"$error":"#VALUE!"},{"$error":"#VALUE!"}]
[3300000000,0,0,0,0,0,0,0,0,0,{"$error":"#REF!"},{"$error":"#REF!"},{"$error":"#VALUE!"},{"$error":"#VALUE!"}]
[3900000000,0,0,0,0,0,0,0,0,0,{"$error":"#REF!"},{"$error":"#REF!"},{"$error":"#VALUE!"},{"$error":"#VALUE!"}]
[4700000000,0,0,0,0,0,0,0,0,0,{"$error":"#REF!"},{"$error":"#REF!"},{"$error":"#VALUE!"},{"$error":"#VALUE!"}]
[5600000000,0,0,0,0,0,0,0,0,0,{"$error":"#REF!"},{"$error":"#REF!"},{"$error":"#VALUE!"},{"$error":"#VALUE!"}]
[6800000000,0,0,0,0,0,0,0,0,0,{"$error":"#REF!"},{"$error":"#REF!"},{"$error":"#VALUE!"},{"$error":"#VALUE!"}]
[8200000000,0,0,0,0,0,0,0,0,0,{"$error":"#REF!"},{"$error":"#REF!"},{"$error":"#VALUE!"},{"$error":"#VALUE!"}]
[10000000000,0,0,0,0,0,0,0,0,0,{"$error":"#REF!"},{"$error":"#REF!"},{"$error":"#VALUE!"},{"$error":"#VALUE!"}]
[12000000000,0,0,0,0,0,0,0,0,0,{"$error":"#REF!"},{"$error":"#REF!"},{"$error":"#VALUE!"},{"$error":"#VALUE!"}]
[15000000000,0,0,0,0,0,0,0,0,0,{"$f":"IF(IF((K$3*10^12-$A133)*(K$3*10^12-$A132)*-1<0,0,1)*IF(ABS(K$3*10^12-$A133)>(K$3*10^12-$A132),$A132,$A133)=K133,0,IF((K$3*10^12-$A133)*(K$3*10^12-$A132)*-1<0,0,1)*IF(ABS(K$3*10^12-$A133)>(K$3*10^12-$A132),$A132,$A133))","v":{"$error":"#REF!"}},{"$f":"IF(IF((L$3*10^12-$A133)*(L$3*10^12-$A132)*-1<0,0,1)*IF(ABS(L$3*10^12-$A133)>(L$3*10^12-$A132),$A132,$A133)=L133,0,IF((L$3*10^12-$A133)*(L$3*10^12-$A132)*-1<0,0,1)*IF(ABS(L$3*10^12-$A133)>(L$3*10^12-$A132),$A132,$A133))","v":{"$error":"#REF!"}},{"$error":"#VALUE!"},{"$error":"#VALUE!"}]
[18000000000,0,0,0,0,0,0,0,0,{"$f":"IF(IF((J$3*10^12-$A134)*(J$3*10^12-$A133)*-1<0,0,1)*IF(ABS(J$3*10^12-$A134)>(J$3*10^12-$A133),$A133,$A134)=J134,0,IF((J$3*10^12-$A134)*(J$3*10^12-$A133)*-1<0,0,1)*IF(ABS(J$3*10^12-$A134)>(J$3*10^12-$A133),$A133,$A134))","v":0},{"$error":"#REF!"},{"$error":"#REF!"},{"$f":"IF(IF((M$3*10^12-$A134)*(M$3*10^12-$A133)*-1<0,0,1)*IF(ABS(M$3*10^12-$A134)>(M$3*10^12-$A133),$A133,$A134)=M134,0,IF((M$3*10^12-$A134)*(M$3*10^12-$A133)*-1<0,0,1)*IF(ABS(M$3*10^12-$A134)>(M$3*10^12-$A133),$A133,$A134))","v":{"$error":"#VALUE!"}},{"$f":"IF(IF((N$3*10^12-$A134)*(N$3*10^12-$A133)*-1<0,0,1)*IF(ABS(N$3*10^12-$A134)>(N$3*10^12-$A133),$A133,$A134)=N134,0,IF((N$3*10^12-$A134)*(N$3*10^12-$A133)*-1<0,0,1)*IF(ABS(N$3*10^12-$A134)>(N$3*10^12-$A133),$A133,$A134))","v":{"$error":"#VALUE!"}}]
[22000000000,0,0,0,{"$f":"IF(IF((E$3*10^12-$A135)*(E$3*10^12-$A134)*-1<0,0,1)*IF(ABS(E$3*10^12-$A135)>(E$3*10^12-$A134),$A134,$A135)=E135,0,IF((E$3*10^12-$A135)*(E$3*10^12-$A134)*-1<0,0,1)*IF(ABS(E$3*10^12-$A135)>(E$3*10^12-$A134),$A134,$A135))","v":0},0,0,0,0,0,{"$error":"#REF!"},{"$error":"#REF!"},{"$f":"IF(IF((M$3*10^12-$A135)*(M$3*10^12-$A134)*-1<0,0,1)*IF(ABS(M$3*10^12-$A135)>(M$3*10^12-$A134),$A134,$A135)=M135,0,IF((M$3*10^12-$A135)*(M$3*10^12-$A134)*-1<0,0,1)*IF(ABS(M$3*10^12-$A135)>(M$3*10^12-$A134),$A134,$A135))","v":{"$error":"#VALUE!"}},{"$f":"IF(IF((N$3*10^12-$A135)*(N$3*10^12-$A134)*-1<0,0,1)*IF(ABS(N$3*10^12-$A135)>(N$3*10^12-$A134),$A134,$A135)=N135,0,IF((N$3*10^12-$A135)*(N$3*10^12-$A134)*-1<0,0,1)*IF(ABS(N$3*10^12-$A135)>(N$3*10^12-$A134),$A134,$A135))","v":{"$error":"#VALUE!"}}]
[27000000000,{"$f":"IF(IF((B$3*10^12-$A136)*(B$3*10^12-$A135)*-1<0,0,1)*IF(ABS(B$3*10^12-$A136)>(B$3*10^12-$A135),$A135,$A136)=B136,0,IF((B$3*10^12-$A136)*(B$3*10^12-$A135)*-1<0,0,1)*IF(ABS(B$3*10^12-$A136)>(B$3*10^12-$A135),$A135,$A136))","v":0},{"$f":"IF(IF((C$3*10^12-$A136)*(C$3*10^12-$A135)*-1<0,0,1)*IF(ABS(C$3*10^12-$A136)>(C$3*10^12-$A135),$A135,$A136)=C136,0,IF((C$3*10^12-$A136)*(C$3*10^12-$A135)*-1<0,0,1)*IF(ABS(C$3*10^12-$A136)>(C$3*10^12-$A135),$A135,$A136))","v":0},0,0,0,0,0,0,0,{"$error":"#REF!"},{"$error":"#REF!"},{"$error":"#VALUE!"},{"$error":"#VALUE!"}]
[33000000000,0,0,0,0,0,0,0,0,0,{"$error":"#REF!"},{"$error":"#REF!"},{"$error":"#VALUE!"},{"$error":"#VALUE!"}]
[39000000000,0,0,0,0,0,0,0,0,0,{"$error":"#REF!"},{"$error":"#REF!"},{"$error":"#VALUE!"},{"$error":"#VALUE!"}]
[47000000000,0,0,0,0,0,0,0,0,0,{"$error":"#REF!"},{"$error":"#REF!"},{"$error":"#VALUE!"},{"$error":"#VALUE!"}]
[56000000000,0,0,0,0,0,0,0,0,0,{"$error":"#REF!"},{"$error":"#REF!"},{"$error":"#VALUE!"},{"$error":"#VALUE!"}]
[68000000000,0,0,0,0,0,0,0,0,0,{"$error":"#REF!"},{"$error":"#REF!"},{"$error":"#VALUE!"},{"$error":"#VALUE!"}]
[82000000000,0,0,0,0,0,0,0,0,0,{"$error":"#REF!"},{"$error":"#REF!"},{"$error":"#VALUE!"},{"$error":"#VALUE!"}]
[100000000000,0,0,0,0,0,0,0,0,0,{"$error":"#REF!"},{"$error":"#REF!"},{"$error":"#VALUE!"},{"$error":"#VALUE!"}]
[120000000000,0,0,0,0,0,0,0,0,0,{"$error":"#REF!"},{"$error":"#REF!"},{"$error":"#VALUE!"},{"$error":"#VALUE!"}]
[150000000000,0,0,0,0,0,0,0,0,0,{"$error":"#REF!"},{"$error":"#REF!"},{"$error":"#VALUE!"},{"$error":"#VALUE!"}]
[180000000000,0,0,0,0,0,0,0,0,0,{"$error":"#REF!"},{"$error":"#REF!"},{"$error":"#VALUE!"},{"$error":"#VALUE!"}]
[220000000000,0,0,0,0,0,0,0,0,0,{"$error":"#REF!"},{"$error":"#REF!"},{"$error":"#VALUE!"},{"$error":"#VALUE!"}]
[270000000000,0,0,0,0,0,0,0,0,0,{"$error":"#REF!"},{"$error":"#REF!"},{"$error":"#VALUE!"},{"$error":"#VALUE!"}]
[330000000000,0,0,0,0,0,0,0,0,0,{"$error":"#REF!"},{"$error":"#REF!"},{"$error":"#VALUE!"},{"$error":"#VALUE!"}]
[390000000000,0,0,0,0,0,0,0,0,0,{"$error":"#REF!"},{"$error":"#REF!"},{"$error":"#VALUE!"},{"$error":"#VALUE!"}]
[470000000000,0,0,0,0,0,0,0,0,0,{"$error":"#REF!"},{"$error":"#REF!"},{"$error":"#VALUE!"},{"$error":"#VALUE!"}]
[560000000000,0,0,0,0,0,0,0,0,0,{"$error":"#REF!"},{"$error":"#REF!"},{"$error":"#VALUE!"},{"$error":"#VALUE!"}]
[680000000000,0,0,0,0,0,0,0,0,0,{"$error":"#REF!"},{"$error":"#REF!"},{"$error":"#VALUE!"},{"$error":"#VALUE!"}]
[820000000000,0,0,0,0,0,0,0,0,0,{"$error":"#REF!"},{"$error":"#REF!"},{"$error":"#VALUE!"},{"$error":"#VALUE!"}]
[1000000000000,0,0,0,0,0,0,0,0,0,{"$error":"#REF!"},{"$error":"#REF!"},{"$error":"#VALUE!"},{"$error":"#VALUE!"}]
[1200000000000,0,0,0,0,0,0,0,0,0,{"$error":"#REF!"},{"$error":"#REF!"},{"$error":"#VALUE!"},{"$error":"#VALUE!"}]
[1500000000000,0,0,0,0,0,0,0,0,0,{"$error":"#REF!"},{"$error":"#REF!"},{"$error":"#VALUE!"},{"$error":"#VALUE!"}]
[1800000000000,0,0,0,0,0,0,0,0,0,{"$error":"#REF!"},{"$error":"#REF!"},{"$error":"#VALUE!"},{"$error":"#VALUE!"}]
[2200000000000,0,0,0,0,0,0,0,0,0,{"$error":"#REF!"},{"$error":"#REF!"},{"$error":"#VALUE!"},{"$error":"#VALUE!"}]
[2700000000000,2700000000000,2700000000000,2700000000000,2700000000000,2700000000000,2700000000000,2700000000000,2700000000000,2700000000000,{"$error":"#REF!"},{"$error":"#REF!"},{"$error":"#VALUE!"},{"$error":"#VALUE!"}]

{"sheet":"Snubber","index":11,"n_rows":6,"n_cols":5,"rows_kept":6,"cut":false,"hidden":true,"merged":[]}
[null,null,"UNITS","STD UNITS"]
["Frequency of Ringing",85,"MHz",{"$f":"B2*1000000","v":85000000},"Hz"]
["SW capacitance",3000,"pF",{"$f":"B3*0.000000000001","v":3E-9},"F"]
["Lpar",{"$f":"1000000000*1/((D2*2*3.14159)^2*D3)","v":1.1686430773614742},"nH",{"$f":"B4/1000000000","v":1.1686430773614743E-9},"H"]
["Csnub",{"$f":"4*B3","v":12000},"pF",{"$f":"B5*0.000000000001","v":1.2E-8},"F"]
["Rsnub",{"$f":"SQRT(D4/D3)","v":0.62413755891936573},"Ω",{"$f":"B6","v":0.62413755891936573},"Ω"]

{"sheet":"Parallel Output Caps","index":12,"n_rows":17,"n_cols":5,"rows_kept":17,"cut":false,"hidden":true,"merged":[]}
[]
[]
[]
["Fsw",{"$f":"Fsw","v":400000}]
[]
["C1",20,"uF",{"$f":"B6/1000000","v":2.0000000000000002E-5},"F"]
["R1",0.5,"mOhms",{"$f":"B7/1000","v":5.0000000000000001E-4},"Ohms"]
[]
["C2",68,"uF",{"$f":"B9/1000000","v":6.7999999999999999E-5},"F"]
["R2",20,"mOhms",{"$f":"B10/1000","v":0.02},"Ohms"]
[]
[]
["I1 ",{"$f":"(D6/(D6+D9))*SQRT((D10*D9*B4)^2+1)/SQRT((((D7+D10)*D6*D9/(D9+D6))*B4)^2+1)","v":0.25667257397349275},"%"]
["I2 ",{"$f":"1-B13","v":0.74332742602650725},"%"]
[]
["I1 ",{"$f":"B13*(Iripple1/(2*SQRT(3)))","v":{"$error":"#NAME?"}},"A"]
["I2 ",{"$f":"B14*(Iripple1/(2*SQRT(3)))","v":{"$error":"#NAME?"}},"A"]