{"text_format":"1","workbook":"xlsx","n_sheets":13,"sheets":["Design Regulator","Input Filters","BOM & Schematic","EVM","Efficiency Calculations","Bode Plot Management","Stability Calculations","Variable Management","Schematic Management","Efficiency Plot Management","Standard Value Calculator","Snubber","Parallel Output Caps"],"not_rendered":{"charts":10,"images":40,"macros":1,"external_links":0,"defined_names":319,"comments":2,"pivot_tables":0},"unopened":[],"bounds":{"document_bytes":16777216,"sheet_cells":100000,"rows_first":2000,"rows_last":500,"rows_between":2000,"halvings":0,"cell_chars":16384,"cell_head_chars":4096},"cells_cut":0,"cells_raw":0,"read":"whole","date_system":"1900"}

{"sheet":"Design Regulator","index":0,"n_rows":108,"n_cols":16,"rows_kept":108,"cut":false,"hidden":false,"merged":[[86,5,86,6],[70,5,70,7],[2,13,2,14],[0,0,0,15],[36,10,37,15]]}
["                   LM70XX0/-Q1 65V/80V 4A/6A/8A/10A Synchronous Buck Converter Design Tool"]
[null,null,null,null,null,null,null,null,null,null,null,null,null,"http://www.ti.com/product/lm5175"]
["About",null,"xx",null,null,"= Input Box",null,null,null,null,null,null,null,"TERMS OF USE",null,"                "]
[]
["Step 1: Operating Specifications"]
[null,null,null,"Input Voltage – Min, VIN(min) ",33,"V"]
[null,null,null,"Input Voltage – Nom, VIN(nom)",33,"V"]
[null,null,null,"Input Voltage – Max, VIN(max)",51,"V"]
[null,null,null,"Output Voltage, VOUT ",20,"V"]
[null,null,null,"Full-Load Output Current, IOUT ",0.4,"A"]
[null,null,null,"Switching Frequency, FSW",433,"kHz"]
[null,null,null,"Frequency Set Resistor, RT ",{"$f":"'Variable Management'!C446","v":49.9},"kΩ"]
[null,null,null,"Ambient Temperature, TA",50,"°C"]
[null,null,null,"Junction Temperature (estimate), TJ",{"$f":"'Variable Management'!B366","v":60.022098378332458},"°C"]
[]
["Step 2: Current Sense Resistor"]
[null,null,null,"Required IOCP Setpoint at VIN(nom)",1.2,"A"]
[null,null,null,"Recommended Sense Resistance",{"$f":"Rs_ideal*1000","v":40.171621398383877},"mΩ"]
[null,null,null,"Sense Resistance, RS",39,"mΩ"]
[null,null,null,"Min Inductor Sat Current, ILO(SAT)",{"$f":"'Variable Management'!B95","v":1.5897435897435896},"A"]
[null,null,null,"Max Power Loss in Shunt",{"$f":"'Variable Management'!B105","v":6.0637591750625053E-2},"W"]
[null,null,null,"VIN(min)",{"$f":"'Variable Management'!B97","v":1.2418785227785121},"A"]
[null,null,"IOUT(typ) at OCP Inception:","VIN(nom)",{"$f":"'Variable Management'!B98","v":1.2418785227785121},"A"]
[null,null,null,"VIN(max)",{"$f":"'Variable Management'!B99","v":1.1364789538478375},"A"]
[]
["Step 3: Buck Inductance"]
[null,null,null,"Recommended Starting Inductance",{"$f":"Lopt*1000000","v":129.97010687541868},"µH"]
[null,null,null,"Inductance, LO ",47,"µH"]
[null,null,null,"Inductor DCR ",100,"mΩ"]
[null,null,null,"DIL as a % at VIN(nom)",{"$f":"'Variable Management'!B68*100","v":97.009456559461896},"%"]
[null,null,null,"Estimated Inductor Core Loss at VIN(nom)",0.12,"W"]
[]
["Step 4: Output Capacitors"]
[null,null,null,"Output Voltage Ripple Spec",10,"mVPK-PK"]
[null,null,null,"Maximum Load Step",100,"%"]
[null,null,null,"Minimum Output Capacitance",{"$f":"Total_COUT_with_stead_state_load_step","v":29.997316943694212},"µF"]
[null,null,null,"Output Capacitance (derated), COUT ",50,"µF",null,null,null,null,{"$f":"CHOOSE(SCH_MODE, \"\", \"** For Single-Output Operation in 2-Phase Mode, tie MODE to VDDA and use FB1 to set VOUT **\", \"** For Single-Output Operation in 3-Phase Mode, tie both MODE pins to VDDA. Use FB1 of master IC to set VOUT. Connect FB2 of master IC to AGND. Connect FB2 of slave IC to VDDA to configure it as a slave **\", \"** For Single-Output Operation in 4-Phase Mode, tie both MODE pins to VDDA. Use FB1 of master IC to set VOUT. Connect FB2 of master IC to AGND. Connect FB2 of slave IC to VDDA to configure it as a slave **\")","v":""}]
[null,null,null,"Maximum Permitted ESR",{"$f":"'Variable Management'!B128","v":25.115589546258384},"mΩ"]
[null,null,null,"Output Capacitor ESR",2,"mΩ",null,null,null,null,{"$f":"CHOOSE(SCH_MODE,  \"\", \"** Tie VCCX to GND if not used **\", \"** Slave controller (CNTRL2) not shown **\",\"** Slave controller (CNTRL2) not shown **\")","v":""},null,null,null,null,{"$f":"IF(SCH_MODE=1,  \"** Tie VCCX to GND if not used **\", \"\")","v":"** Tie VCCX to GND if not used **"}]
[null,null,null,"Resulting Output Voltage Ripple (max) ",{"$f":"'Variable Management'!B130*1000","v":2.3710123808016017},"mVPK-PK",null,null,null,null,{"$f":"IF(OR(SCH_MODE=3, SCH_MODE=4),\"** Tie VCCX to GND if not used **\", \"\")","v":""}]
[null,null,null,"Output Capacitor RMS Current (max) ",{"$f":"'Variable Management'!B114","v":0.17286934121168476},"ARMS"]
[]
["Step 5: Input Capacitors"]
[null,null,null,"Input Voltage Ripple Spec",5,"mVPK-PK"]
[null,null,null,"Minimum Input Capacitance",{"$f":"'Variable Management'!B151","v":46.18937644341802},"µF"]
[null,null,null,"Input Capacitance (derated), CIN ",50,"µF"]
[null,null,null,"Maximum Permitted ESR",{"$f":"'Variable Management'!B157","v":0.54482740367615312},"mΩ",null,null,null,null,null,null,null,null,null," "]
[null,null,null,"Input Capacitor ESR",1,"mΩ"]
[null,null,null,"Resulting Input Voltage Ripple (max)",{"$f":"'Variable Management'!B164*1000","v":5.3183561263914001},"mVPK-PK"]
[null,null,null,"Input Capacitor RMS Current (max)",{"$f":"'Variable Management'!B141","v":0.2},"ARMS"]
[]
["Step 6: Enable, CNFG, FPWM/PFM"]
[]
[]
[null,null,null,"Input Voltage UVLO Turn-ON",13,"V"]
[null,null,null,"Input Voltage UVLO Turn-OFF",{"$f":"0.9*E55","v":11.700000000000001},"V"]
[null,null,null,"Upper Enable Resistor RUV1",237,"kΩ"]
[null,null,null,"Lower Enable Resistor RUV2",{"$f":"'Variable Management'!B191","v":19.600000000000001},"kΩ"]
[null,null,null,"Configuration Resistor, RCNFG",{"$f":"IF(DITHER=1,\"41.2\",\"29.4\")","v":"29.4"},"kΩ"]
[null,null,null,null,{"$f":"IF(DEMB=1, \"* Tie PFM/SYNCIN to GND\", \"* Tie PFM/SYNCIN to VDDA\")","v":"* Tie PFM/SYNCIN to GND"}]
[]
["Step 7: Compensation Design"]
[null,null,null,"Load Pole Frequency",{"$f":"Fp_dominant","v":145.43423911239387},"Hz"]
[null,null,null,"ESR Zero Frequency",{"$f":"Fesr/1000","v":1591.5494327375638},"kHz"]
[null,null,null,"Desired Crossover Frequency",10,{"$f":"\"     kHz \"","v":"     kHz "}]
[null,null,null,"Error Amp Pole Frequency",{"$f":"Fp1_u","v":0.52883119831639314},"Hz"]
[null,null,null,{"$f":"CHOOSE(VOUT_setting, \"Upper Feedback Resistor\",\"\",\"\",\"\")","v":"Upper Feedback Resistor"},274,"kΩ"]
[null,null,null,{"$f":"CHOOSE(VOUT_setting, \"Lower Feedback Resistor\", \"Pullup FB to VDDA with \"&'Variable Management'!D421,\"Tie FB to VDDA\",\"Pullup FB to VDDA with \"&'Variable Management'!D421)","v":"Lower Feedback Resistor"},{"$f":"IF(Vout=Vref,\"OPEN\",Rfb2_u/1000)","v":11.5},{"$f":"IF(Vout=Vref,\"\",\"kΩ\")","v":"kΩ"}]
[]
["Compensation Components"]
[null,"Calculated /","Std Values","Std Values",null,"Actual P/Z Frequencies"]
["RC1",{"$f":"Rcea1/1000","v":25.525440281250006},{"$f":"'Standard Value Calculator'!S32","v":25.5},33.200000000000003,"kΩ",{"$f":"Fp1_u","v":0.52883119831639314},"Hz   (FPEA)"]
["CC1",{"$f":"Cc1ea*1000000000","v":6.2351497768547954},{"$f":"'Standard Value Calculator'!S33","v":6.8},4.7,"nF",{"$f":"Fz1_u/1000","v":1.0199624665070262},"kHz (FZCOMP)"]
["CC2",{"$f":"IF(Cc2ea<0, \"N/A\", Cc2ea*1000000000000)","v":"N/A"},{"$f":"'Standard Value Calculator'!S34","v":0},0,"pF",{"$f":"Fp2_u/1000","v":150.60240963855424},"kHz (FPCOMP)"]
[]
[]
["Efficiency / Power Loss Analyzer"]
[]
["Step 8: IC Power Loss"]
[null,null,null,null,null,"Ext. Power Supply Voltage",8,"V"]
[null,null,null,null,null,"System-Level Thermal RθJA",18.600000000000001,"°C/W"]
[null,null,null,null,null,"IC Power Dissipation",{"$f":"'Variable Management'!B364","v":0.53882249345873434},"W"]
[null,null,null,null,null,"Junction Temperature (estimate)",{"$f":"'Variable Management'!B366","v":60.022098378332458},"°C"]
[null,null,null,null,null,null,null,{"$f":"CHOOSE(Ext_VCC, \"* Tie BIAS to Ext. Power Supply\", \"* Tie BIAS to VOUT except for Fixed-VOUT = 3.3V\", \"* Tie BIAS to PGND\")","v":"* Tie BIAS to VOUT except for Fixed-VOUT = 3.3V"}]
[null,null,null,null,null,"Power MOSFETs","(Q1, Q2) "]
[null,null,null,null,"Internal NEXFETs"]
[null,null,null,null,null,"  Low-side"]
[null,null,null,"On-State Resistance, RDS(on) ",24,18,"mΩ"]
[null,null,null,"Total Gate Charge, QG ",3,4.0999999999999996,"nC"]
[null,null,null,"Gate-Drain Charge, QGD ",0.7,1,"nC"]
[null,null,null,"Gate-Source Charge, QGS ",0.7,0.9,"nC"]
[null,null,null,"Output Charge, QOSS ",null,3,"nC"]
[]
[]
[]
[]
[null,null,null,"Output Capacitance, COSS ",250,350,"pF"]
[]
[null,null,null,"Gate Resistance, RG ",3.5,3,"Ω"]
[null,null,null,"Transconductance, gFS ",71,90,"S"]
[null,null,null,"Gate-Source Threshold Voltage, VTH ",1.8,1.8,"V"]
[null,null,null,"Body Diode Forward Voltage, VBD ",0.8,0.8,"V"]
[null,null,null,"Body Diode Rev Recovery Charge, QRR ",null,30,"nC"]
[null,null,null,"Thermal Resistance, θJA ",15,15,"°C/W"]
[]
["External Schottky Diode (if applicable)"]
[null,null,null,"Schottky Fwd Voltage, VFWDsch ",null,0,"V"]
[null,null,null,"Schottky Rev Recovery Charge, QRRsch ",null,0,"nC"]

{"sheet":"Input Filters","index":1,"n_rows":17,"n_cols":17,"rows_kept":17,"cut":false,"hidden":true,"merged":[[0,0,0,16],[2,14,2,15]]}
["                           LM(2)5149-Q1 Synchronous Buck Controller Design Tool"]
[null,null,null,null,null,null,null,null,null,null,null,null,null,null,"http://www.ti.com/product/lm5175"]
["About",null,"xx",null,null,"= Input Box",null,null,null,null,null,null,null,null,"TERMS OF USE",null,"                "]
[]
[]
[]
[null,null,null,null,"AEF",null,null,null,null,null,null,null,"Passive"]
[]
[null,"Design tab - LAEF",{"$f":"'Design Regulator'!E51 & \" µH\"","v":" µH"},null,null,"LAEF",1,"µH",null,"Suggested LIN Inductor","0.1-10","µH",null,"Chosen LIN",0.68,"µH"]
[null,"Design tab - CINJ",{"$f":"'Design Regulator'!#REF! & \" µF\"","v":{"$error":"#REF!"}},null,null,"CINJ",1,"µF",null,"Suggested CF","0.1-10","µF",null,"Chosen CF",0.47,"µF"]
[null,"Design tab - CDAMP",{"$f":"'Design Regulator'!#REF! & \" µF\"","v":{"$error":"#REF!"}},null,null,"CDAMP",1,"µF",null,"Suggested CDAMP","1-10","µF",null,"Chosen CDAMP",1,"µF"]
[null,"Design tab - RDAMP",{"$f":"'Design Regulator'!#REF! & \" Ω\"","v":{"$error":"#REF!"}},null,null,"RDAMP",10,"Ω",null,"Suggested RDAMP",{"$f":"Rdamp_PassiveStd","v":{"$error":"#REF!"}},"Ω",null,"Chosen RDAMP",0.35,"Ω"]
[]
[null,null,"VIN Ripple at Fsw",null,null,{"$f":"VinRipple_dBuV","v":74.515548301687019},"dBµV","VIN Ripple",{"$f":"VinRipple_dBuV","v":74.515548301687019},"dBµV"]
[]
[null,null,null,"AEF Attenuation at Fsw",{"$f":"-#REF!","v":{"$error":"#REF!"}},"dB",null,null,null,null,null,"Passive Attenuation at Fsw",{"$f":"-#REF!","v":{"$error":"#REF!"}},"dB"]
[null,null,null,"AEF EMI at Fsw",{"$f":"VinRipple_dBuV-E16","v":{"$error":"#REF!"}},"dB-µV",null,null,null,null,null,"Passive EMI at Fsw",{"$f":"VinRipple_dBuV-M16","v":{"$error":"#REF!"}},"dB-µV"]

{"sheet":"BOM & Schematic","index":2,"n_rows":71,"n_cols":10,"rows_kept":71,"cut":false,"hidden":true,"merged":[[64,0,65,0],[64,9,65,9],[64,3,65,6],[64,2,65,2],[64,1,65,1],[64,7,65,7],[64,8,65,8],[41,3,41,6],[46,3,46,5],[60,3,60,6],[58,3,58,6],[59,3,59,6],[54,3,54,6],[57,3,57,6],[56,3,56,6],[53,3,53,6],[42,3,42,5],[43,3,43,5],[48,3,48,5],[49,3,49,5],[51,3,51,5],[44,3,44,5],[45,3,45,5],[50,3,50,5],[47,3,47,5],[62,3,62,6],[63,3,63,6],[61,3,61,6],[52,3,52,5],[55,3,55,6]]}
[]
[]
[]
[]
[]
[]
[]
[]
[]
[]
[]
[]
[]
[]
[]
[]
[]
[]
[]
[]
[]
[]
[]
[]
[]
[]
[]
[]
[]
[]
[]
[]
[]
[]
[]
["   ** Tie DEMB to VDDA for FPWM, AGND for DEM **"]
["   ** Tie VCCX to GND if not used **",null,null,null,null,null,null,null,{"$f":"IF(OR(SCH_MODE=3, SCH_MODE=4),\"** Tie VCCX to GND if not used **\", \"\")","v":""}]
["   ** Tie DITH to VDDA to disable spread spectrum **"]
["   ** Tie OSC to VDDA for 2.2MHz, AGND for 440kHz **"]
[{"$f":"\"VIN = \"&VIN_min&\" V to \"&VIN_max&\" V, VOUT = \"& Vout &\" V, IOUT = \" &Iout & \" A,  Fsw = \" & Fsw/1000 &\" kHz, Current Limit = \"&ROUNDUP(Ilimit_DC,0)&\" A\"","v":"VIN = 33 V to 51 V, VOUT = 20 V, IOUT = 0,4 A,  Fsw = 433 kHz, Current Limit = 2 A"}]
["High Efficiency Synchronous Buck Regulator BOM"]
["Count","Ref Des","Value","Description",null,null,null,"Size","Part Number","MFR"]
[1,"CBOOT",0.1,{"$f":"C43","v":0.1},null,null,null,"0603","Std","Std"]
[1,"CC1",{"$f":"'Design Regulator'!D73","v":4.7},4.7,null,null,null,"0603","Std","Std"]
[1,"CC2",{"$f":"'Design Regulator'!D74","v":0},0,null,null,null,"0603","Std","Std"]
[1,"CRES",{"$f":"Cres_u*1000000000","v":180},{"$f":"C46","v":180},null,null,null,"0603","Std","Std"]
[1,"CDITH",{"$f":"Cdither*1000000000","v":2.7},{"$f":"C47","v":2.7},null,null,null,"0603","Std","Std"]
[{"$f":"ROUNDUP('Design Regulator'!E46/10,0)","v":5},"CIN",10,{"$f":"C48","v":10},null,null,null,1210,"Std","Std"]
[{"$f":"ROUNDUP('Design Regulator'!E37/47,0)","v":2},"COUT",47,{"$f":"C49","v":47},null,null,null,1210,"Std","Std"]
[1,"CSS",{"$f":"'Design Regulator'!#REF!","v":{"$error":"#REF!"}},{"$f":"C50","v":{"$error":"#REF!"}},null,null,null,"0603","Std","Std"]
[2,"CVCC, CVCCX",2.2000000000000002,2.2000000000000002,null,null,null,"0603","Std","Std"]
[1,"CVDDA",0.47,0.47,null,null,null,"0603","Std","Std"]
[1,"DBOOT","See description","Schottky Diode, 60V, 200mA",null,null,null,"-","-","Various"]
[1,"LO",{"$f":"'Design Regulator'!E28","v":47},{"$f":"\"Inductor, \"&Lf*1000000&\"µH, \"&Rdcr*1000&\"mΩ, >\"&ROUNDUP(Ilimit_DC*1.1,0)&\"A\"","v":"Inductor, 47µH, 100mΩ, >2A"},null,null,null,"-","-","Various"]
[2,"Q1, Q2","See description",{"$f":"'Design Regulator'!E88","v":24},null,null,null,"Std",{"$f":"'Design Regulator'!E86","v":"Internal NEXFETs"},"-"]
[1,"RC1",{"$f":"'Design Regulator'!D72","v":33.200000000000003},{"$f":"C56","v":33.200000000000003},null,null,null,"0603","Std","Std"]
[1,"RS",{"$f":"Rs*1000","v":39},39,null,null,null,"0508","Std","Std"]
[1,"RT",{"$f":"'Design Regulator'!E12","v":49.9},49.9,null,null,null,"0603","Std","Std"]
[1,"RFB1",{"$f":"'Design Regulator'!E67","v":274},274,null,null,null,"0603","Std","Std"]
[1,"RFB2",{"$f":"'Design Regulator'!E68","v":11.5},11.5,null,null,null,"0603","Std","Std"]
[1,"RPGOOD",100,100,null,null,null,"0603","Std","Std"]
[1,"RCS",100,100,null,null,null,"0603","Std","Std"]
[1,"RDEMB",100,100,null,null,null,"0603","Std","Std"]
[1,"RVIN",2.2000000000000002,2.2000000000000002,null,null,null,"0603","Std","Std"]
[1,"U1","LM5141-Q1","IC, LM5141-Q1, Synchronous Buck PWM Controller, 3.8V–65V Input",null,null,null,"VQFN-24","LM5141QRGEQ1","TI"]
[]
[]
["NOTES:"]
["** For information on TI NexFETTM MOSFETs, see **",null,null,"http://www.ti.com/nexfet","   **"]
["** Inductor saturation current should be higher than the peak inductor current at the OCP setpoint for all input voltages and operating temperatures **"]
["** Effective input and output capacitances should be appropriately derated for applied voltage and temperature, particularly with ceramics **"]

{"sheet":"EVM","index":3,"n_rows":6,"n_cols":2,"rows_kept":6,"cut":false,"hidden":false,"merged":[[0,0,0,16]]}
[" LM70XX0-Q1 Quickstart Design Tool"]
[]
[]
[]
[]
[null,"LM706A0QEVM PCB Layout"]

{"sheet":"Efficiency Calculations","index":4,"n_rows":109,"n_cols":60,"rows_kept":109,"cut":false,"hidden":true,"merged":[[6,52,6,57],[6,27,6,32],[6,33,6,36],[6,40,6,44],[6,45,6,50],[6,24,6,26],[0,0,3,3],[5,0,6,3],[6,6,6,13],[6,17,6,20],[6,21,6,23]]}
["BUCK CONTROLLER POWER DESIGN TOOL"]
[null,null,null,null,null,null,null,{"$f":"AW19","v":0.76169214350674286},"10% load"]
[null,null,null,null,null,null,null,{"$f":"AW59","v":0.90153381287135148},"50% load",null,null,null,null,null,null,null,null,null,null,null,null,null,null,null,null,null,null,null,null,null,null,null,null,null,null,null,null,null,null,null,null,{"$f":"IF(MODE=1, (Qg_Q1+Qg_Q2)*Fsw*Vin, (Qg_Q1+Qg_Q2+Qg_Q3+Qg_Q4)*Fsw*Vin)","v":0.10145189999999998}]
[null,null,null,null,null,null,null,{"$f":"AW109","v":0.9211519790686995},"100% load",null,null,null,null,null,null,null,null,null,null,null,null,null,null,null,null,null,null,null,null,null,null,null,null,null,null,null,null,null,null,null,"I_VCC",{"$f":"(Qg_Q1+Qg_Q2)*Fsw*1000","v":3.0742999999999996},"mA",{"$f":"AP4*5/1000","v":1.5371499999999998E-2}]
[]
["Enter the values of your design and MOSFET datasheet specifications below. Note that thermal resistance (θJA) will change when components are placed on the PCB"]
[null,null,null,null,null,null,"Operating Point Condtions",null,null,null,null,null,null,null,null,null,null,"Filter Inductor",null,null,null,"Cout",null,null,"Cin",null,null,"High-side BUCK \"Control\" MOSFET Losses ",null,null,null,null,null,"Low-side BUCK \"Sync\" MOSFET Losses ",null,null,null,"External Diode","Diode/FET","Sense Rs","Controller IC Losses",null,null,null,null,"RESULTS",null,null,null,null,null,null,"Consolidated Buck/Boost Efficiency & Losses"]
["Input Parameters",null,null,null,null,null,"Step","Vin","Mode","Iout","Iout/ phase","Iin","Duty Cycle BUCK Leg","Ripple Current pk-pk","Peak Inductor Current","Valley Inductor Current","SW node voltage at Q1 turn-on","Irms Lf","DCR    Loss","Core Loss","Total Inductor Loss","Irms Cout","Cout ESR Loss","Total Cout Loss","Irms Cin","Cin ESR Loss","Total Cin Loss","Irms","RDS(on) Loss","Transition Loss (not including capacitive loss)","MOSFET Output Capacitance Loss","Dead Time Loss ","Total Control MOSFET Loss","Irms","RDS(on) Loss","Deadtime Loss","Total Sync MOSFET Loss","Deadtime Loss","Reverse Recovery Loss","Isense Shunt Loss","IQ Loss","Switching Current Loss","Switching Current Diss","LDO Loss Saved from Gate Drive Current (ext VCC)","Total IC Bias Power","Total Loss","Total IC Loss ","Pout","EFF, h",{"$f":"IF(Vin>Vout, \"High-side MOSFET Temp Rise\", \"Boost ''CONTROL'' MOSFET Temp Rise\")","v":"High-side MOSFET Temp Rise"},{"$f":"IF(Vin>Vout, \"Low-side MOSFET Temp Rise\", \"Boost ''SYNC'' MOSFET Temp Rise\")","v":"Low-side MOSFET Temp Rise"},null,"h","Inductor Cu & Core Loss","Total MOSFET Loss","Control MOSFET Loss","SYNC MOSFET Loss","Shunt Loss","FETs+IC Losses","Temp rise"]
["Design","Input Value","Units","Description",null,null,0,{"$f":"Vin","v":33},{"$f":"MODE","v":1},0,{"$f":"Iout*G9/100/Number_of_Phases","v":0},{"$f":"Vout*K9/(Vin*Efficiency)","v":0},{"$f":"(Vout+(Rdson2+Rs+Rdcr)*K9)/(Vin+(Rs+Rdson2-Rdson1)*K9)","v":0.60606060606060608},{"$f":"(Vin-(Rdson1+Rdcr)*K9-Vout)*M9/(Fsw*Lf)","v":0.38714499920337475},{"$f":"K9+N9/2","v":0.19357249960168738},{"$f":"K9-N9/2","v":-0.19357249960168738},{"$f":"IF(MIN(Vin, -P9/(Coss_Q1+Coss_Q2)*0.00000002)<0, 0, MIN(Vin, -P9/(Coss_Q1+Coss_Q2)*0.00000002))","v":6.4524166533895793},{"$f":"SQRT(K9^2+(N9^2)/12)","v":0.11175913475274293},{"$f":"R9^2*Rdcr","v":1.2490104200681754E-3},{"$f":"Core_Loss_Ch1","v":0.12},{"$f":"(T9+S9*(1+Ltc*(Ta-25)))/(1-S9*Ltc*ThetaCa)","v":0.12138604045642545},{"$f":"N9/SQRT(12)","v":0.11175913475274293},{"$f":"RCoutEsr*V9^2","v":2.4980208401363506E-5},{"$f":"W9","v":2.4980208401363506E-5},{"$f":"SQRT(M9*(1-M9))*SQRT(K9^2+(N9^2)/12)","v":5.4607936369905657E-2},{"$f":"RCinEsr*Y9^2","v":2.982026714579665E-6},{"$f":"Z9","v":2.982026714579665E-6},{"$f":"SQRT(M9)*SQRT(K9^2+(N9^2)/12)","v":8.7004368405415741E-2},{"$f":"Rdson1*AB9^2","v":1.8167424291900731E-4},{"$f":"(Vin*K9/2)*Fsw*(Tr_buck+Tf_buck)","v":0},{"$f":"(0.5*Coss_Q1*(Vin-Q9)^2-0.5*Coss_Q2*(Vin-Q9)^2+(Qoss_Q2*(Vin-Q9)/Vin)*Vin)*Fsw","v":1.9226949736792783E-2},{"$f":"IF(K9>N9/2,0,ABS(K9-N9/2)*Vsd_Q1*Deadtime*Fsw)","v":9.3874919406834322E-4},{"$f":"(AF9+AE9+AD9+AC9*(1+RdsonTopTc*Ta-RdsonTopTc*25))/(1-AC9*RdsonTopTc*ThetaJA_Q1)","v":2.0379554922513178E-2},{"$f":"SQRT((1-M9))*SQRT(K9^2+(N9^2)/12)","v":7.0145164331238463E-2},{"$f":"Rdson2*AH9^2","v":8.856619342301608E-5},{"$f":"IF(K9<N9/2,Deadtime*Fsw*IF(VfdSky_Q2>0,0,Vsd_Q2)*(K9+N9/2),2*Deadtime*Fsw*IF(VfdSky_Q2>0,0,Vsd_Q2)*K9)","v":9.3874919406834311E-4},{"$f":"(AJ9+AI9*(1+RdsonBotTc*Ta-RdsonBotTc*25))/(1-AI9*RdsonBotTc*ThetaJA_Q2)","v":1.0428241690319283E-3},{"$f":"2*Deadtime*Fsw*IF(VfdSky_Q2>0,VfdSky_Q2,Vsd_Q2)*K9","v":0},{"$f":"IF(QrrSky_Q2>0,QrrSky_Q2,Qrr_Q2*K9/(Iout/Number_of_Phases))*Fsw*Vin","v":0},{"$f":"Rs*R9^2","v":4.8711406382658835E-4},{"$f":"Iq*Vin","v":7.2600000000000003E-5},{"$f":"CHOOSE(Ext_VCC, (Qg_Q1+Qg_Q2)*Fsw*'Design Regulator'!$G$80, (Qg_Q1+Qg_Q2)*Fsw*Vout, (Qg_Q1+Qg_Q2)*Fsw*Vin)","v":6.1485999999999985E-2},{"$f":"(Vin-VCC)*Fsw*(Qg_Q1+Qg_Q2)+(RdsonDRT+RdsonDRT2)*Fsw*Qg_Q1*VCC/(RdsonDRT+2*Rgate1+RdsonDRT2)+(RdsonDRB+RdsonDRB2)*Fsw*Qg_Q2*VCC/(RdsonDRB+2*Rgate2+RdsonDRB2)","v":8.6317369090909091E-2},{"$f":"(Qg_Q1+Qg_Q2)*Fsw*(Vin-VCC)","v":7.6857499999999981E-2},{"$f":"SUM(AO9:AP9)","v":6.1558599999999984E-2},{"$f":" SUM(U9,X9,AA9,AG9,AK9,AL9,AM9,AS9,AN9)","v":0.20488209584691308},{"$f":" SUM(AG9,AK9,AL9,AM9,AS9)","v":8.2980979091545087E-2},{"$f":"Vout*K9","v":0},{"$f":"AV9/(AV9+AT9)","v":0},{"$f":"ThetaJA_Q1*BD9","v":0.30569332383769765},{"$f":"ThetaJA_Q2*BE9","v":1.5642362535478925E-2},null,{"$f":"AW9*100","v":0},{"$f":"U9","v":0.12138604045642545},{"$f":"AG9+AK9+AM9","v":2.1422379091545107E-2},{"$f":"AG9+AM9*0.66","v":2.0379554922513178E-2},{"$f":"AK9+AM9*0.33","v":1.0428241690319283E-3},{"$f":"AN9","v":4.8711406382658835E-4},{"$f":"BC9+AS9","v":8.2980979091545087E-2},{"$f":"BG9*$B$63","v":1.6264271901942837}]
[null,null,null,null,null,null,1,33,1,{"$f":"Iout*G10/100","v":4.0000000000000001E-3},4.0000000000000001E-3,2.6936026936026937E-3,0.60607721205478815,0.38714083545845751,{"$f":"K10+N10/2","v":0.19757041772922876},{"$f":"K10-N10/2","v":-0.18957041772922875},6.3190139243076251,{"$f":"SQRT(K10^2+(N10^2)/12)","v":0.11182949315791446},1.2505835539956039E-3,0.12,0.12138778635493687,{"$f":"N10/SQRT(12)","v":0.11175793278311853},2.4979671079912078E-5,{"$f":"W10","v":2.4979671079912078E-5},{"$f":"SQRT(M10*(1-M10))*SQRT(K10^2+(N10^2)/12)","v":5.4641911888578011E-2},2.9857385348391232E-6,{"$f":"Z10","v":2.9857385348391232E-6},{"$f":"SQRT(M10)*SQRT(K10^2+(N10^2)/12)","v":8.706033504686414E-2},1.8190804652333379E-4,1.7146800000000001E-4,1.9246506773245967E-2,9.1934069781966776E-4,2.055144996551278E-2,7.0187845112126043E-2,8.8674004826708313E-5,9.5813749781966772E-4,1.0623393446888886E-3,3.8796800000000001E-5,4.2866999999999992E-3,4.8772758605828548E-4,7.2600000000000003E-5,{"$f":"CHOOSE(Ext_VCC, (Qg_Q1+Qg_Q2)*Fsw*'Design Regulator'!$G$80, (Qg_Q1+Qg_Q2)*Fsw*Vout, (Qg_Q1+Qg_Q2)*Fsw*Vin)","v":6.1485999999999985E-2},8.6317369090909091E-2,7.6857499999999981E-2,6.1558599999999984E-2,0.20940136546081153,{"$f":" SUM(AG10,AK10,AL10,AM10,AS10)","v":8.749788611020165E-2},0.08,{"$f":"AV10/(AV10+AT10)","v":0.27643269710430229},0.35071007948269167,3.7154255170333328E-2,null,{"$f":"AW10*100","v":27.643269710430229},0.12138778635493687,2.5900489310201669E-2,2.338067196551278E-2,2.4769503446888884E-3,4.8772758605828548E-4,{"$f":"BC10+AS10","v":8.745908931020166E-2},{"$f":"BG10*$B$63","v":1.7141981504799526}]
["Vin",{"$f":"Vin","v":33},"V","Vin",null,null,2,33,1,8.0000000000000002E-3,8.0000000000000002E-3,5.3872053872053875E-3,0.60609381791612338,0.38713667081923414,0.20156833540961708,-0.18556833540961706,6.1856111803205698,0.11204270089754474,1.2553566824416674E-3,0.12,0.12139308368018985,0.1117567305553302,2.4979133648833349E-5,2.4979133648833349E-5,5.4745685089159238E-2,2.997090035881392E-6,2.997090035881392E-6,8.7227514266290343E-2,1.8260734188182124E-4,3.4293600000000001E-4,1.9265293232479237E-2,8.99932199402479E-4,2.0723122398994015E-2,7.0320179033765168E-2,8.9008696428134141E-5,9.7752579940247903E-4,1.0821211311156187E-3,7.7593600000000002E-5,8.5733999999999984E-3,4.895891061522502E-4,7.2600000000000003E-5,{"$f":"CHOOSE(Ext_VCC, (Qg_Q1+Qg_Q2)*Fsw*'Design Regulator'!$G$80, (Qg_Q1+Qg_Q2)*Fsw*Vout, (Qg_Q1+Qg_Q2)*Fsw*Vin)","v":6.1485999999999985E-2},8.6317369090909091E-2,7.6857499999999981E-2,6.1558599999999984E-2,0.21392548614013643,9.201483713010962E-2,0.16,0.42789273780615383,0.39572349598491019,5.8670146966734282E-2,null,42.789273780615382,0.12139308368018985,3.0378643530109634E-2,2.6381566398994014E-2,3.9113431311156186E-3,4.895891061522502E-4,9.1937243530109625E-2,{"$f":"BG11*$B$63","v":1.8019699731901488}]
["Vout",{"$f":"Vout","v":20},"V","Vout",null,null,3,33,1,1.2000000000000002E-2,1.2000000000000002E-2,8.0808080808080825E-3,0.60611042364461321,0.38713250528571508,0.20556625264285755,-0.18156625264285753,6.0522084214285838,0.11239794506158102,1.2633298054066187E-3,0.12,0.12140193244032214,0.11175552806938091,2.4978596108132369E-5,2.4978596108132369E-5,5.4918857229532186E-2,3.0160808793977396E-6,3.0160808793977396E-6,8.7505277758422789E-2,1.8377216725388933E-4,5.144040000000001E-4,1.928330911423428E-2,8.8052369881680176E-4,2.0894572292861981E-2,7.0541650239326417E-2,8.9570239532774296E-5,9.9691409881680197E-4,1.1021694960343172E-3,1.1639040000000002E-4,1.2860100000000001E-2,4.9269862410858119E-4,7.2600000000000003E-5,{"$f":"CHOOSE(Ext_VCC, (Qg_Q1+Qg_Q2)*Fsw*'Design Regulator'!$G$80, (Qg_Q1+Qg_Q2)*Fsw*Vout, (Qg_Q1+Qg_Q2)*Fsw*Vin)","v":6.1485999999999985E-2},8.6317369090909091E-2,7.6857499999999981E-2,6.1558599999999984E-2,0.21845445793031454,9.6531832188896285E-2,0.24000000000000005,0.52349801784778416,0.44073357439292976,8.0190037440514769E-2,null,52.349801784778414,0.12140193244032214,3.4856841788896302E-2,2.9382238292861983E-2,5.3460024960343177E-3,4.9269862410858119E-4,9.6415441788896286E-2,1.8897426590623674]
["Fsw",{"$f":"Fsw/1000","v":433},"kHz","Switching Frequency",null,null,4,33,1,1.6E-2,1.6E-2,1.0774410774410775E-2,0.60612702924025941,0.38712833885791165,0.20956416942895584,-0.17756416942895581,5.91880564763186,0.11289388481626085,1.2745029228907172E-3,0.12,0.12141433264892713,0.11175432532527398,2.4978058457814348E-5,2.4978058457814348E-5,5.5160771631468139E-2,3.0427107269789802E-6,3.0427107269789802E-6,8.7892586172542322E-2,1.8540256089834669E-4,6.8587200000000002E-4,1.9300554418252784E-2,8.6111519606266412E-4,2.1065799716958572E-2,7.0851411593625943E-2,9.0358605446569064E-5,1.0163023960626642E-3,1.1224844072055783E-3,1.551872E-4,1.7146799999999997E-2,4.9705613992737975E-4,7.2600000000000003E-5,{"$f":"CHOOSE(Ext_VCC, (Qg_Q1+Qg_Q2)*Fsw*'Design Regulator'!$G$80, (Qg_Q1+Qg_Q2)*Fsw*Vout, (Qg_Q1+Qg_Q2)*Fsw*Vin)","v":6.1485999999999985E-2},8.6317369090909091E-2,7.6857499999999981E-2,6.1558599999999984E-2,0.22298828088220343,0.10104887132416412,0.32,0.58933131941648886,0.48574031575437854,0.10171392610808366,null,58.933131941648888,0.12141433264892713,3.9335084124164144E-2,3.2382687716958569E-2,6.7809284072055777E-3,4.9705613992737975E-4,0.10089368412416413,1.9775162088336171]
["Iout",{"$f":"Iout","v":0.4},"A","Max Output Current",null,null,5,33,1,0.02,0.02,1.3468013468013469E-2,0.60614363470306343,0.38712417153583417,0.21356208576791708,-0.1735620857679171,5.7854028589305697,0.1135286763286799,1.2888760348942164E-3,0.12,0.12143028432505379,0.11175312232301236,2.4977520697884331E-5,2.4977520697884331E-5,5.5470525868387424E-2,3.0769792401154387E-6,3.0769792401154387E-6,8.8388008489412903E-2,1.8749856107338865E-4,8.5733999999999995E-4,1.9317029144276437E-2,8.417066911400908E-4,2.1236804741062491E-2,7.1248300360202521E-2,9.1373765475917428E-5,1.0356906911400906E-3,1.1430658324283697E-3,1.9398399999999999E-4,2.1433500000000001E-2,5.0266165360874444E-4,7.2600000000000003E-5,{"$f":"CHOOSE(Ext_VCC, (Qg_Q1+Qg_Q2)*Fsw*'Design Regulator'!$G$80, (Qg_Q1+Qg_Q2)*Fsw*Vout, (Qg_Q1+Qg_Q2)*Fsw*Vin)","v":6.1485999999999985E-2},8.6317369090909091E-2,7.6857499999999981E-2,6.1558599999999984E-2,0.22752695505209139,0.10556595457349086,0.4,0.63742281790396682,0.53074372111593737,0.12324181248642554,null,63.742281790396682,0.12143028432505379,4.3813370573490863E-2,3.5382914741062491E-2,8.2161208324283697E-3,5.0266165360874444E-4,0.10537197057349085,2.0652906232404207]
["Ta",{"$f":"Ta","v":50},"°C","Ambient Temperature",null,null,6,33,1,2.4000000000000004E-2,2.4000000000000004E-2,1.6161616161616165E-2,0.60616024003302715,0.38712000331949376,0.21756000165974687,-0.16956000165974688,5.6520000553248968,0.11430000618623666,1.306449141417374E-3,0.12,0.12144978749320678,0.11175191906259928,2.4976982828347481E-5,2.4976982828347481E-5,5.5846988103182331E-2,3.1188860801969888E-6,3.1188860801969888E-6,8.8989748013605333E-2,1.9006020603659941E-4,1.0288080000000002E-3,1.9332733292046954E-2,8.2229818404910837E-4,2.1407587434889321E-2,7.1730859207517955E-2,9.2615690927677722E-5,1.0550789840491084E-3,1.1639137395400222E-3,2.3278080000000003E-4,2.5720200000000002E-2,5.0951516515277588E-4,7.2600000000000003E-5,{"$f":"CHOOSE(Ext_VCC, (Qg_Q1+Qg_Q2)*Fsw*'Design Regulator'!$G$80, (Qg_Q1+Qg_Q2)*Fsw*Vout, (Qg_Q1+Qg_Q2)*Fsw*Vin)","v":6.1485999999999985E-2},8.6317369090909091E-2,7.6857499999999981E-2,6.1558599999999984E-2,0.23207048050169743,0.11008308197442933,0.48000000000000009,0.67409057550287788,0.57574379152333977,0.14477369609310034,null,67.409057550287784,0.12144978749320678,4.8291701174429345E-2,3.838291943488932E-2,9.6515797395400234E-3,5.0951516515277588E-4,0.10985030117442933,2.1530659030188151]
["Vcc",{"$f":"VCC","v":8},"V","Subregulated VCC Voltage",null,null,7,33,1,2.8000000000000004E-2,2.8000000000000004E-2,1.8855218855218858E-2,0.60617684523015181,0.38711583420890044,0.22155791710445022,-0.16555791710445023,5.5185972368150082,0.11520513193692548,1.3272222424604409E-3,0.12,0.12147284218334653,0.11175071554403761,2.497644484920882E-5,2.497644484920882E-5,5.6288816904541752E-2,3.1684309085130257E-6,3.1684309085130257E-6,8.9695673912065441E-2,1.9308753404494983E-4,1.2002760000000001E-3,1.9347666861306026E-2,8.0288967478974187E-4,2.15781478680915E-2,7.2297361681217878E-2,9.4084353109166949E-5,1.0744672747897417E-3,1.1850280964162089E-3,2.7157760000000005E-4,3.0006900000000003E-2,5.1761667455957187E-4,7.2600000000000003E-5,{"$f":"CHOOSE(Ext_VCC, (Qg_Q1+Qg_Q2)*Fsw*'Design Regulator'!$G$80, (Qg_Q1+Qg_Q2)*Fsw*Vout, (Qg_Q1+Qg_Q2)*Fsw*Vin)","v":6.1485999999999985E-2},8.6317369090909091E-2,7.6857499999999981E-2,6.1558599999999984E-2,0.23661885729817153,0.1146002535645077,0.56000000000000005,0.70297105682296701,0.62074052802137258,0.16630957644624317,null,70.297105682296703,0.12147284218334653,5.2770075964507709E-2,4.1382701868091502E-2,1.1087305096416211E-2,5.1761667455957187E-4,0.11432867596450769,2.240842048904351]
["Components","Input Value","Units","Description",null,null,8,33,1,3.2000000000000001E-2,3.2000000000000001E-2,2.154882154882155E-2,0.60619345029443905,0.38711166420406562,0.22555583210203281,-0.16155583210203281,5.3851944034010932,0.11624092816317655,1.3511953380236771E-3,0.12,0.12149944843088943,0.11174951176733065,2.4975906760473545E-5,2.4975906760473545E-5,5.6794483766053463E-2,3.2256133862525104E-6,3.2256133862525104E-6,9.0503357063610276E-2,1.9658058335480009E-4,1.371744E-3,1.936182985179536E-2,7.834811633620184E-4,2.1748486110258362E-2,7.2945841145698187E-2,9.5779723328161804E-5,1.0938555633620184E-3,1.2064088709709362E-3,3.1037440000000001E-4,3.4293599999999994E-2,5.2696618182923409E-4,7.2600000000000003E-5,{"$f":"CHOOSE(Ext_VCC, (Qg_Q1+Qg_Q2)*Fsw*'Design Regulator'!$G$80, (Qg_Q1+Qg_Q2)*Fsw*Vout, (Qg_Q1+Qg_Q2)*Fsw*Vin)","v":6.1485999999999985E-2},8.6317369090909091E-2,7.6857499999999981E-2,6.1558599999999984E-2,0.24117208551409466,0.11911746938122927,0.64,0.72630535002321406,0.66573393165387551,0.18784945306456405,null,72.630535002321409,0.12149944843088943,5.7248494981229289E-2,4.4382262110258364E-2,1.2523296870970936E-2,5.2696618182923409E-4,0.11880709498122927,2.3286190616320939]
["L",{"$f":"Lf*1000000","v":47},"uH","Filter Inductance",null,null,9,33,1,3.6000000000000004E-2,3.6000000000000004E-2,2.4242424242424246E-2,0.60621005522589066,0.38710749330499983,0.22955374665249992,-0.15755374665249991,5.2517915550833303,0.11740393639513699,1.3783684281073374E-3,0.12,0.12152960627670785,0.11174830773248146,2.4975368562146752E-5,2.4975368562146752E-5,5.7362297500221662E-2,3.2904331745039365E-6,3.2904331745039365E-6,9.1410108900743192E-2,2.0053939222189752E-4,1.5432120000000002E-3,1.9375222263256667E-2,7.6407264976596366E-4,2.1918602230916184E-2,7.3674122131367412E-2,9.7701772892897529E-5,1.1132438497659636E-3,1.2280560311565213E-3,3.4917120000000002E-4,3.8580299999999998E-2,5.3756368696186154E-4,7.2600000000000003E-5,{"$f":"CHOOSE(Ext_VCC, (Qg_Q1+Qg_Q2)*Fsw*'Design Regulator'!$G$80, (Qg_Q1+Qg_Q2)*Fsw*Vout, (Qg_Q1+Qg_Q2)*Fsw*Vin)","v":6.1485999999999985E-2},8.6317369090909091E-2,7.6857499999999981E-2,6.1558599999999984E-2,0.24573016522747904,0.12363472946207268,0.72000000000000008,0.74554987089007729,0.71072400346374276,0.20939332546734782,null,74.554987089007724,0.12152960627670785,6.1726958262072702E-2,4.7381600230916185E-2,1.3959555031156522E-2,5.3756368696186154E-4,0.12328555826207269,2.4163969419366249]
["Rdcr",{"$f":"Rdcr*1000","v":100},"mW","Inductor DCR at 25°C",null,null,10,33,1,0.04,0.04,2.6936026936026938E-2,0.60622666002450809,0.38710332151171373,0.23355166075585687,-0.15355166075585686,5.1183886918618953,0.11869041716632717,1.4087415127116772E-3,0.12,0.12156331576713036,0.1117471034394931,2.497483025423354E-5,2.497483025423354E-5,5.7990429678140457E-2,3.3628899342553539E-6,3.3628899342553539E-6,9.2413021922728669E-2,2.049639989013775E-4,1.7146799999999999E-3,1.938784409543165E-2,7.4466413400160346E-4,2.2088496299528155E-2,7.447985302231766E-2,9.9850473112068742E-5,1.1326321340016034E-3,1.2499695449635804E-3,3.8796799999999998E-4,4.2867000000000002E-2,5.4940918995755408E-4,7.2600000000000003E-5,{"$f":"CHOOSE(Ext_VCC, (Qg_Q1+Qg_Q2)*Fsw*'Design Regulator'!$G$80, (Qg_Q1+Qg_Q2)*Fsw*Vout, (Qg_Q1+Qg_Q2)*Fsw*Vin)","v":6.1485999999999985E-2},8.6317369090909091E-2,7.6857499999999981E-2,6.1558599999999984E-2,0.25029309652176818,0.12815203384449173,0.8,0.76169214350674286,0.75571074449292241,0.23094119317445372,null,76.169214350674281,0.12156331576713036,6.6205465844491745E-2,5.0380716299528158E-2,1.5396079544963581E-2,5.4940918995755408E-4,0.12776406584449174,2.5041756905520383]
["LTc",{"$f":"Ltc*1000000","v":4000},"ppm","Inductor Series Resistance Temp Co",null,null,11,33,1,4.4000000000000004E-2,4.4000000000000004E-2,2.9629629629629634E-2,0.60624326469029299,0.38709914882421786,0.23754957441210894,-0.14954957441210892,4.984985813736964,0.12009640260378117,1.4423145918369498E-3,0.12,0.12160057695394196,0.1117458988883686,2.4974291836738998E-5,2.4974291836738998E-5,5.8676940329181783E-2,3.4429833263943597E-6,3.4429833263943597E-6,9.3509010628157099E-2,2.0985444164776313E-4,1.8861480000000003E-3,1.9399695348062046E-2,7.2525561606896338E-4,2.2258168385494489E-2,7.5360539075252767E-2,1.0222579529482857E-4,1.1520204160689635E-3,1.2721493804210124E-3,4.2676480000000005E-4,4.7153699999999993E-2,5.6250269081641036E-4,7.2600000000000003E-5,{"$f":"CHOOSE(Ext_VCC, (Qg_Q1+Qg_Q2)*Fsw*'Design Regulator'!$G$80, (Qg_Q1+Qg_Q2)*Fsw*Vout, (Qg_Q1+Qg_Q2)*Fsw*Vin)","v":6.1485999999999985E-2},8.6317369090909091E-2,7.6857499999999981E-2,6.1558599999999984E-2,0.25486087948583697,0.13266938256591548,0.88000000000000012,0.77542544280731152,0.80069415578241732,0.25249305570631514,null,77.54254428073115,0.12160057695394196,7.0684017765915486E-2,5.3379610385494485E-2,1.683287038042101E-2,5.6250269081641036E-4,0.13224261776591548,2.5919553082119435]
["ThetaCa",{"$f":"ThetaCa","v":20},"°C/W","Core to Ambient Thermal Resistance",null,null,12,33,1,4.8000000000000008E-2,4.8000000000000008E-2,3.232323232323233E-2,0.60625986922324704,0.38709497524252345,0.24154748762126174,-0.14554748762126171,4.851582920708724,0.12161774810788989,1.4790876654834156E-3,0.12,0.12164138989438417,0.11174469407911122,2.4973753309668309E-5,2.4973753309668309E-5,5.9419803194794653E-2,3.5307130117081291E-6,3.5307130117081291E-6,9.4694851742092773E-2,2.1521075871496634E-4,2.0576160000000004E-3,1.9410776020889572E-2,7.0584709596807074E-4,2.2427618558152368E-2,7.6313574863042702E-2,1.0482771075079E-4,1.171408695968071E-3,1.2945955055959852E-3,4.6556160000000007E-4,5.1440400000000004E-2,5.7684418953853208E-4,7.2600000000000003E-5,{"$f":"CHOOSE(Ext_VCC, (Qg_Q1+Qg_Q2)*Fsw*'Design Regulator'!$G$80, (Qg_Q1+Qg_Q2)*Fsw*Vout, (Qg_Q1+Qg_Q2)*Fsw*Vin)","v":6.1485999999999985E-2},8.6317369090909091E-2,7.6857499999999981E-2,6.1558599999999984E-2,0.25943351421399241,0.13718677566374834,0.96000000000000019,0.78725079211783433,0.84567423837228561,0.27404891258393982,null,78.725079211783438,0.12164138989438417,7.5162614063748356E-2,5.6378282558152373E-2,1.8269927505595987E-2,5.7684418953853208E-4,0.13672121406374835,2.6797357956494676]
["Cin",{"$f":"Cin*1000000","v":50},"μF","Input Capacitance",null,null,13,33,1,5.2000000000000005E-2,5.2000000000000005E-2,3.5016835016835016E-2,0.60627647362337156,0.38709080076664087,0.24554540038332046,-0.14154540038332042,4.7181800127773474,0.12325018189241456,1.5190607336513274E-3,0.12,0.12168575465115528,0.11174348901172396,2.4973214673026544E-5,2.4973214673026544E-5,6.0216929935719768E-2,3.626078650883384E-6,3.626078650883384E-6,9.5967222780377379E-2,2.2103298835628597E-4,2.2290840000000005E-3,1.942108611365595E-2,6.864385736989508E-4,2.259684688677599E-2,7.7336275371488433E-2,1.0765619079002438E-4,1.1907969736989509E-3,1.3173078885939148E-3,5.0435840000000003E-4,5.5727099999999995E-2,5.9243368612401769E-4,7.2600000000000003E-5,{"$f":"CHOOSE(Ext_VCC, (Qg_Q1+Qg_Q2)*Fsw*'Design Regulator'!$G$80, (Qg_Q1+Qg_Q2)*Fsw*Vout, (Qg_Q1+Qg_Q2)*Fsw*Vin)","v":6.1485999999999985E-2},8.6317369090909091E-2,7.6857499999999981E-2,6.1558599999999984E-2,0.26401100080597306,0.14170421317536988,1.04,0.79753928406831298,0.89065099330163977,0.29560876332890867,null,79.753928406831292,0.12168575465115528,7.9641254775369902E-2,5.9376732886775987E-2,1.9707250888593913E-2,5.9243368612401769E-4,0.14119985477536989,2.7675171535972503]
["RCinEsr",{"$f":"RCinEsr*1000","v":1},"mW","Input Capacitor ESR",null,null,14,33,1,5.6000000000000008E-2,5.6000000000000008E-2,3.7710437710437715E-2,0.60629307789066833,0.38708662539658084,0.24954331269829044,-0.1375433126982904,4.5847770899430129,0.12498935140006691,1.5622337963409408E-3,0.12,0.12173367129241068,0.11174228368620989,2.497267592681882E-5,2.497267592681882E-5,6.1066192811623815E-2,3.7290799045064164E-6,3.7290799045064164E-6,9.7322738184268759E-2,2.273211688244094E-4,2.4005520000000002E-3,1.9430625626102913E-2,6.6703004926162916E-4,2.276585344057663E-2,7.8425905131695367E-2,1.1071120672306227E-4,1.2101852492616293E-3,1.3402864975584547E-3,5.4315520000000009E-4,6.0013800000000006E-2,6.0927118057296694E-4,7.2600000000000003E-5,{"$f":"CHOOSE(Ext_VCC, (Qg_Q1+Qg_Q2)*Fsw*'Design Regulator'!$G$80, (Qg_Q1+Qg_Q2)*Fsw*Vout, (Qg_Q1+Qg_Q2)*Fsw*Vin)","v":6.1485999999999985E-2},8.6317369090909091E-2,7.6857499999999981E-2,6.1558599999999984E-2,0.26859333936695007,0.14622169513813507,1.1200000000000001,0.80657163494000339,0.93562442160864956,0.31717260746337689,null,80.657163494000343,0.12173367129241068,8.4119939938135088E-2,6.2374961440576637E-2,2.1144840497558458E-2,6.0927118057296694E-4,0.14567853993813507,2.8552993827874475]
["Cout",{"$f":"Cout*1000000","v":50},"μF","Output Capcitance",null,null,15,33,1,0.06,0.06,4.0404040404040401E-2,0.60630968202513902,0.38708244913235412,0.25354122456617706,-0.13354122456617706,4.4513741522059025,0.12683086586286924,1.608606853552513E-3,0.12,0.12178513989176301,0.11174107810257214,2.4972137071050254E-5,2.4972137071050254E-5,6.1965445476193419E-2,3.8397164330630994E-6,3.8397164330630994E-6,9.8757982456147989E-2,2.3407533837141201E-4,2.5720199999999999E-3,1.9439394557972185E-2,6.4762152265613227E-4,2.29346382887026E-2,7.9579704929814199E-2,1.139927298608933E-4,1.2295735226561322E-3,1.3635313006714793E-3,5.8195199999999995E-4,6.4300499999999983E-2,6.2735667288548E-4,7.2600000000000003E-5,{"$f":"CHOOSE(Ext_VCC, (Qg_Q1+Qg_Q2)*Fsw*'Design Regulator'!$G$80, (Qg_Q1+Qg_Q2)*Fsw*Vout, (Qg_Q1+Qg_Q2)*Fsw*Vin)","v":6.1485999999999985E-2},8.6317369090909091E-2,7.6857499999999981E-2,6.1558599999999984E-2,0.27318053000752668,0.15073922158937406,1.2,0.81456411862425915,0.98059452433053895,0.33874044451007213,null,81.456411862425909,0.12178513989176301,8.8598669589374068E-2,6.5372968288702593E-2,2.2582696300671473E-2,6.2735667288548E-4,0.15015726958937406,2.943082483951732]
["RCoutEsr",{"$f":"Cout_ESR*1000","v":2},"mW","Output Capacitor ESR",null,null,16,33,1,6.4000000000000001E-2,6.4000000000000001E-2,4.30976430976431E-2,0.60632628602678529,0.38707827197397182,0.25753913598698591,-0.12953913598698591,4.3179711995661965,0.12877033452182615,1.6581799052863011E-3,0.12,0.12184016052828252,0.1117398722608139,2.4971598105726017E-5,2.4971598105726017E-5,6.2912541650603185E-2,3.9579878969388803E-6,3.9579878969388803E-6,0.10026953991798754,2.4129553524875752E-4,2.7434880000000001E-3,1.9447392909005528E-2,6.282129938824869E-4,2.3103201500239361E-2,8.0794915789906704E-2,1.1750073151496607E-4,1.2489617938824869E-3,1.3870422661530681E-3,6.2074880000000002E-4,6.8587199999999987E-2,6.4669016306165739E-4,7.2600000000000003E-5,{"$f":"CHOOSE(Ext_VCC, (Qg_Q1+Qg_Q2)*Fsw*'Design Regulator'!$G$80, (Qg_Q1+Qg_Q2)*Fsw*Vout, (Qg_Q1+Qg_Q2)*Fsw*Vin)","v":6.1485999999999985E-2},8.6317369090909091E-2,7.6857499999999981E-2,6.1558599999999984E-2,0.27777257284373924,0.15525679256639241,1.28,0.8216860550210735,1.0255613025035903,0.36031227399229598,null,82.168605502107354,0.12184016052828252,9.3077443766392418E-2,6.8370753500239356E-2,2.4020818266153064E-2,6.4669016306165739E-4,0.15463604376639239,3.0308664578212912]
["Top Driver","Input Value","Units","Description",null,null,17,33,1,6.8000000000000005E-2,6.8000000000000005E-2,4.5791245791245792E-2,0.60634288989560836,0.38707409392144415,0.26153704696072211,-0.12553704696072207,4.1845682320240689,0.13080340024412815,1.7109529515425582E-3,0.12,0.12189873328649727,0.11173866616093814,2.4971059030851163E-5,2.4971059030851163E-5,6.3905351547572098E-2,4.0838939564187761E-6,4.0838939564187761E-6,0.10185402088841342,2.489817977072966E-4,2.9149560000000002E-3,1.945462067894466E-2,6.0880446294071778E-4,2.3271543144209435E-2,8.2068800066092268E-2,1.2123518299718806E-4,1.2683500629407179E-3,1.4108193622614875E-3,6.5954560000000008E-4,7.2873899999999991E-2,6.6727165110159776E-4,7.2600000000000003E-5,{"$f":"CHOOSE(Ext_VCC, (Qg_Q1+Qg_Q2)*Fsw*'Design Regulator'!$G$80, (Qg_Q1+Qg_Q2)*Fsw*Vout, (Qg_Q1+Qg_Q2)*Fsw*Vin)","v":6.1485999999999985E-2},8.6317369090909091E-2,7.6857499999999981E-2,6.1558599999999984E-2,0.28236946799705703,0.15977440810647089,1.36,0.82807189642814105,1.0705247571631415,0.38188809543392227,null,82.807189642814109,0.12189873328649727,9.7556262506470912E-2,7.1368317144209437E-2,2.5459206362261486E-2,6.6727165110159776E-4,0.15911486250647089,3.1186513051268299]
["RdsonDRT",0.7,"W","Drain to Source Resistance of pullup Top FET Driver",null,null,18,33,1,7.2000000000000008E-2,7.2000000000000008E-2,4.8484848484848492E-2,0.60635949363161001,0.38706991497478205,0.26553495748739103,-0.12153495748739102,4.051165249579701,0.13292576846953122,1.7669259923215421E-3,0.12,0.12196085825639363,0.111737459802948,2.4970519846430838E-5,2.4970519846430838E-5,6.4941776012728492E-2,4.2174342716873977E-6,4.2174342716873977E-6,0.10350808422478991,2.5713416399726884E-4,3.0864240000000004E-3,1.9461077867531356E-2,5.8939592983085147E-4,2.3439663289572556E-2,8.3398659601514089E-2,1.2519605561992593E-4,1.2877383298308515E-3,1.43486255729318E-3,6.9834240000000004E-4,7.7160599999999996E-2,6.891011370054014E-4,7.2600000000000003E-5,{"$f":"CHOOSE(Ext_VCC, (Qg_Q1+Qg_Q2)*Fsw*'Design Regulator'!$G$80, (Qg_Q1+Qg_Q2)*Fsw*Vout, (Qg_Q1+Qg_Q2)*Fsw*Vin)","v":6.1485999999999985E-2},8.6317369090909091E-2,7.6857499999999981E-2,6.1558599999999984E-2,0.28697121559438282,0.16429206824686571,1.4400000000000002,0.83382976334344161,1.1154848893435885,0.40346790835939772,null,83.382976334344164,0.12196085825639363,0.10203512584686573,7.4365659289572561E-2,2.6897860557293179E-2,6.891011370054014E-4,0.16359372584686571,3.206437026598568]
["RdsonDRT2",{"$f":"RdsonDRT2","v":1},"W","Drain to Source Resistance of pulldown Top FET Driver",null,null,19,33,1,7.6000000000000012E-2,7.6000000000000012E-2,5.1178451178451191E-2,0.60637609723479202,0.38706573513399611,0.26953286756699807,-0.11753286756699804,3.9177622522332682,0.13513323157623025,1.8260990276235071E-3,0.12,0.1220265355334164,0.11173625318684653,2.4969980552470143E-5,2.4969980552470143E-5,6.6019758427526387E-2,4.3586085028289418E-6,4.3586085028289418E-6,0.10522845630030837,2.6575267236830184E-4,3.2578920000000005E-3,1.9466764474507337E-2,5.6998739455291377E-4,2.3607562005225562E-2,8.4781851011222695E-2,1.2938332069600491E-4,1.3071265945529139E-3,1.4591718195827454E-3,7.3713920000000011E-4,8.14473E-2,7.1217862077316773E-4,7.2600000000000003E-5,{"$f":"CHOOSE(Ext_VCC, (Qg_Q1+Qg_Q2)*Fsw*'Design Regulator'!$G$80, (Qg_Q1+Qg_Q2)*Fsw*Vout, (Qg_Q1+Qg_Q2)*Fsw*Vin)","v":6.1485999999999985E-2},8.6317369090909091E-2,7.6857499999999981E-2,6.1558599999999984E-2,0.29157781576805314,0.16880977302480829,1.5200000000000002,0.8390475897694557,1.1604417000783833,0.42505171229374117,null,83.904758976945573,0.1220265355334164,0.10651403382480831,7.7362780005225562E-2,2.8336780819582744E-2,7.1217862077316773E-4,0.1680726338248083,3.2942236229662432]
["Bottom Driver","Input Value","Units","Description",null,null,20,33,1,0.08,0.08,5.3872053872053877E-2,0.60639270070515572,0.38706155439909729,0.27353077719954866,-0.11353077719954864,3.7843592399849548,0.13742168887947462,1.888472057448712E-3,0.12,0.12209576521846942,0.11173504631263691,2.4969441148974228E-5,2.4969441148974228E-5,6.713729447801127E-2,4.5074163098272022E-6,4.5074163098272022E-6,0.10701194658179741,2.7483736106941108E-4,3.4293599999999998E-3,1.9471680499614383E-2,5.5057885710693114E-4,2.3775239360002545E-2,8.6215798223189088E-2,1.3379694953870978E-4,1.3265148571069312E-3,1.4837471175029272E-3,7.7593599999999997E-4,8.5734000000000005E-2,7.3650410240499759E-4,7.2600000000000003E-5,{"$f":"CHOOSE(Ext_VCC, (Qg_Q1+Qg_Q2)*Fsw*'Design Regulator'!$G$80, (Qg_Q1+Qg_Q2)*Fsw*Vout, (Qg_Q1+Qg_Q2)*Fsw*Vin)","v":6.1485999999999985E-2},8.6317369090909091E-2,7.6857499999999981E-2,6.1558599999999984E-2,0.29618926865583867,0.17332752247750546,1.6,0.84379762423937776,1.2053951904000382,0.44663950676254399,null,84.379762423937777,0.12209576521846942,0.11099298647750548,8.0359679360002545E-2,2.9775967117502931E-2,7.3650410240499759E-4,0.17255158647750546,3.3820110949591071]
["RdsonDRB",0.7,"W","Drain to Source Resistance of pullup Bottom FET Driver",null,null,21,33,1,8.4000000000000005E-2,8.4000000000000005E-2,5.6565656565656569E-2,0.60640930404270277,0.38705737277009622,0.27752868638504813,-0.1095286863850481,3.6509562128349371,0.13978716256500132,1.9540450817974106E-3,0.12,0.12216854741791573,0.11173383918032219,2.4968901635948207E-5,2.4968901635948207E-5,6.8292439937123098E-2,4.6638573525655654E-6,4.6638573525655654E-6,0.10885546004316153,2.8438826834900009E-4,3.6008279999999999E-3,1.9475825942594237E-2,5.3117031749292927E-4,2.3942695422674781E-2,8.7698002467363909E-2,1.3843691346178378E-4,1.3459031174929293E-3,1.5085884194645952E-3,8.1473280000000003E-4,9.0020699999999995E-2,7.6207758190099018E-4,7.2600000000000003E-5,{"$f":"CHOOSE(Ext_VCC, (Qg_Q1+Qg_Q2)*Fsw*'Design Regulator'!$G$80, (Qg_Q1+Qg_Q2)*Fsw*Vout, (Qg_Q1+Qg_Q2)*Fsw*Vin)","v":6.1485999999999985E-2},8.6317369090909091E-2,7.6857499999999981E-2,6.1558599999999984E-2,0.30080557440094458,0.17784531664213934,1.6800000000000002,0.84813977793256301,1.2503453613401216,0.46823129129196894,null,84.813977793256299,0.12216854741791573,0.11547198384213937,8.3356357422674776E-2,3.1215419419464596E-2,7.6207758190099018E-4,0.17703058384213935,3.4697994433059316]
["RdsonDRB2",0.5,"W","Drain to Source Resistance of pulldown Bottom FET Driver",null,null,22,33,1,8.8000000000000009E-2,8.8000000000000009E-2,5.9259259259259268E-2,0.60642590724743484,0.38705319024700358,0.28152659512350181,-0.10552659512350178,3.5175531707833927,0.14222580991753431,2.02281810066986E-3,0.12,0.12224488224357816,0.11173263178990549,2.4968362013397197E-5,2.4968362013397197E-5,6.9483316636635997E-2,4.8279312908270165E-6,4.8279312908270165E-6,0.11075600669468239,2.9440543245486074E-4,3.7722960000000005E-3,1.9479200803188674E-2,5.1176177571093419E-4,2.410993026195082E-2,8.9226049939163346E-2,1.4330318377942929E-4,1.3652913757109344E-3,1.5336956939167319E-3,8.535296000000001E-4,9.4307399999999986E-2,7.8889905926124546E-4,7.2600000000000003E-5,{"$f":"CHOOSE(Ext_VCC, (Qg_Q1+Qg_Q2)*Fsw*'Design Regulator'!$G$80, (Qg_Q1+Qg_Q2)*Fsw*Vout, (Qg_Q1+Qg_Q2)*Fsw*Vin)","v":6.1485999999999985E-2},8.6317369090909091E-2,7.6857499999999981E-2,6.1558599999999984E-2,0.30542673315201119,0.18236315555586752,1.7600000000000002,0.85212415030287469,1.2952922139292622,0.48982706540875098,null,85.212415030287474,0.12224488224357816,0.11995102595586754,8.6352814261950808E-2,3.265513769391673E-2,7.8889905926124546E-4,0.18150962595586753,3.5575886687350038]
["Deadtime","Input Value","Units","Description",null,null,23,33,1,9.2000000000000012E-2,9.2000000000000012E-2,6.1952861952861968E-2,0.6064425103193537,0.38704900682983018,0.28552450341491509,-0.10152450341491508,3.3841501138305028,0.14473393223658079,2.0947911140663162E-3,0.12,0.12232476981273965,0.11173142414138988,2.4967822281326325E-5,2.4967822281326325E-5,7.0708116820448183E-2,4.9996377842941477E-6,4.9996377842941477E-6,0.11271070853335331,3.0488889163417254E-4,3.9437640000000006E-3,1.9481805081139451E-2,4.9235323176097224E-4,2.4276943946476445E-2,9.0797617383787319E-2,1.4839573180630745E-4,1.3846796317609721E-3,1.5590689093464159E-3,8.9232640000000006E-4,9.859409999999999E-2,8.1696853448586329E-4,7.2600000000000003E-5,{"$f":"CHOOSE(Ext_VCC, (Qg_Q1+Qg_Q2)*Fsw*'Design Regulator'!$G$80, (Qg_Q1+Qg_Q2)*Fsw*Vout, (Qg_Q1+Qg_Q2)*Fsw*Vin)","v":6.1485999999999985E-2},8.6317369090909091E-2,7.6857499999999981E-2,6.1558599999999984E-2,0.31005274506311398,0.18688103925582283,1.8400000000000003,0.85579295867273597,1.3402357491971466,0.51142682864019617,null,85.579295867273601,0.12232476981273965,0.12443011285582285,8.9349049946476439E-2,3.409512190934641E-2,8.1696853448586329E-4,0.18598871285582283,3.6453787719741277]
["Deadtime",{"$f":"Deadtime*1000000000","v":14},"ns","Total Deadtime",null,null,24,33,1,9.6000000000000016E-2,9.6000000000000016E-2,6.464646464646466E-2,0.60645911325846047,0.38704482251858663,0.28952241125929334,-9.7522411259293298E-2,3.2507470419764437,0.14730798084241858,2.1699641219870363E-3,0.12,0.12240821024814375,0.11173021623477847,2.496728243974071E-5,2.496728243974071E-5,7.1965106076133642E-2,5.1789764925491676E-6,5.1789764925491676E-6,0.11471680422775608,3.1583868413350357E-4,4.1152320000000008E-3,1.9483638776188368E-2,4.729446856430689E-4,2.4443736544834792E-2,9.2410475854423801E-2,1.5371452885753879E-4,1.404067885643069E-3,1.5847080342788081E-3,9.3112320000000013E-4,0.10288080000000001,8.4628600757494406E-4,7.2600000000000003E-5,{"$f":"CHOOSE(Ext_VCC, (Qg_Q1+Qg_Q2)*Fsw*'Design Regulator'!$G$80, (Qg_Q1+Qg_Q2)*Fsw*Vout, (Qg_Q1+Qg_Q2)*Fsw*Vin)","v":6.1485999999999985E-2},8.6317369090909091E-2,7.6857499999999981E-2,6.1558599999999984E-2,0.31468361029376457,0.19139896777911361,1.9200000000000004,0.85918202968678992,1.3851759681725222,0.53303058051418217,null,85.918202968678997,0.12240821024814375,0.12890924457911362,9.2345064544834807E-2,3.5535372034278812E-2,8.4628600757494406E-4,0.19046784457911362,3.733169753750627]
["IQ","Input Value","Units","Description",null,null,25,33,1,0.1,0.1,6.7340067340067339E-2,0.60647571606475703,0.38704063731328381,0.29352031865664191,-9.3520318656641899E-2,3.1173439552213966,0.14994456056930755,2.2483371244322744E-3,0.12,0.12249520367799502,0.11172900807007437,2.4966742488645485E-5,2.4966742488645485E-5,7.325262503879218E-2,5.3659470750738836E-6,5.3659470750738836E-6,0.116771651846458,3.272548481988096E-4,4.2867000000000001E-3,1.9484701888077161E-2,4.5353613735725051E-4,2.4610308125546241E-2,9.40624928936733E-2,1.5925954624870209E-4,1.4234561373572506E-3,1.6106130372771331E-3,9.6991999999999998E-4,0.10716749999999998,8.7685147852858687E-4,7.2600000000000003E-5,{"$f":"CHOOSE(Ext_VCC, (Qg_Q1+Qg_Q2)*Fsw*'Design Regulator'!$G$80, (Qg_Q1+Qg_Q2)*Fsw*Vout, (Qg_Q1+Qg_Q2)*Fsw*Vin)","v":6.1485999999999985E-2},8.6317369090909091E-2,7.6857499999999981E-2,6.1558599999999984E-2,0.31931932900891064,0.19591694116282335,2,0.86232196445956333,1.4301128718831935,0.55463832055915685,null,86.232196445956333,0.12249520367799502,0.13338842116282335,9.5340858125546227E-2,3.6975888037277124E-2,8.7685147852858687E-4,0.19494702116282334,3.8209616147913374]
["IQ ",{"$f":"Iq*1000","v":2.2000000000000001E-3},"mA","Quiescent Current Of Controller (Not Switching!)",null,null,26,33,1,0.10400000000000001,0.10400000000000001,7.0033670033670031E-2,0.60649231873824527,0.3870364512139326,0.29751822560696628,-8.951822560696629E-2,2.9839408535655432,0.15264043112499029,2.3299101214022903E-3,0.12,0.12258575023595968,0.11172779964728073,2.496620242804581E-5,2.496620242804581E-5,7.456909005244558E-2,5.5605491912497381E-6,5.5605491912497381E-6,0.11887272992494879,3.3913742207543563E-4,4.4581680000000011E-3,1.9484994416547621E-2,4.3412758690354375E-4,2.4776658757068543E-2,9.5751633376214978E-2,1.6503075529583552E-4,1.4428443869035437E-3,1.6367838869426679E-3,1.0087168000000001E-3,0.11145419999999999,9.0866494734689321E-4,7.2600000000000003E-5,{"$f":"CHOOSE(Ext_VCC, (Qg_Q1+Qg_Q2)*Fsw*'Design Regulator'!$G$80, (Qg_Q1+Qg_Q2)*Fsw*Vout, (Qg_Q1+Qg_Q2)*Fsw*Vin)","v":6.1485999999999985E-2},8.6317369090909091E-2,7.6857499999999981E-2,6.1558599999999984E-2,0.32395990137893699,0.20043495944401118,2.08,0.86523905777583465,1.4750464613560281,0.57625004830413995,null,86.523905777583465,0.12258575023595968,0.13786764264401119,9.8336430757068535E-2,3.8416669886942666E-2,9.0866494734689321E-4,0.19942624264401118,3.9087543558226194]
["High-side FET","Input Value","Units","Description",null,null,27,33,1,0.10800000000000001,0.10800000000000001,7.2727272727272738E-2,0.60650892127892619,0.38703226422054304,0.30151613211027151,-8.5516132110271509E-2,2.8505377370090503,0.15539250666931578,2.4146831128973351E-3,0.12,0.1226798500611659,0.11172659096640045,2.496566225794671E-5,2.496566225794671E-5,7.5912992961401346E-2,5.7627825003577704E-6,5.7627825003577704E-6,0.12101763714574013,3.5148644400811248E-4,4.6296360000000003E-3,1.9484516361341544E-2,4.1471903428197274E-4,2.4942788507796857E-2,9.7475959234240572E-2,1.7102812731543591E-4,1.4622326342819726E-3,1.663220551914722E-3,1.0475136000000001E-3,0.11574090000000001,9.4172641402996064E-4,7.2600000000000003E-5,{"$f":"CHOOSE(Ext_VCC, (Qg_Q1+Qg_Q2)*Fsw*'Design Regulator'!$G$80, (Qg_Q1+Qg_Q2)*Fsw*Vout, (Qg_Q1+Qg_Q2)*Fsw*Vin)","v":6.1485999999999985E-2},8.6317369090909091E-2,7.6857499999999981E-2,6.1558599999999984E-2,0.32860532757966571,0.20495302265971158,2.16,0.86795602985417697,1.5199767376169528,0.59786576327872087,null,86.795602985417702,0.1226798500611659,0.14234690905971159,0.10133178250779686,3.9857717551914723E-2,9.4172641402996064E-4,0.20390550905971158,3.9965479775703474]
["RdsonTop",{"$f":"Rdson1*1000","v":24},"mW","Drain-Source Resistance of Top FET ",null,null,28,33,1,0.11200000000000002,0.11200000000000002,7.542087542087543E-2,0.60652552368680168,0.38702807633312658,0.30551403816656331,-8.1514038166563274E-2,2.7171346055521091,0.158197853933537,2.5026560989176707E-3,0.12,0.12277750329820457,0.11172538202743684,2.4965121978353415E-5,2.4965121978353415E-5,7.7282900188713671E-2,5.9726466615786802E-6,5.9726466615786802E-6,0.12320409088191869,3.6430195224096195E-4,4.8011040000000005E-3,1.9483267722200714E-2,3.9531047949256524E-4,2.5108697446063682E-2,9.9233628267521398E-2,1.7725163362445918E-4,1.4816208794925655E-3,1.6899230008706283E-3,1.0863104000000002E-3,0.12002760000000001,9.7603587857789153E-4,7.2600000000000003E-5,{"$f":"CHOOSE(Ext_VCC, (Qg_Q1+Qg_Q2)*Fsw*'Design Regulator'!$G$80, (Qg_Q1+Qg_Q2)*Fsw*Vout, (Qg_Q1+Qg_Q2)*Fsw*Vin)","v":6.1485999999999985E-2},8.6317369090909091E-2,7.6857499999999981E-2,6.1558599999999984E-2,0.33325560779235675,0.20947113084693431,2.2400000000000002,0.87049261379895992,1.5649037016909555,0.61948546501305946,null,87.049261379895995,0.12277750329820457,0.14682622044693433,0.10432691344606369,4.129903100087063E-2,9.7603587857789153E-4,0.20838482044693432,4.0843424807599131]
["RdsonTopTc",{"$f":"RdsonTopTc*1000000","v":7000},"ppm","Drain to Source Resistance Temp Co",null,null,29,33,1,0.11600000000000002,0.11600000000000002,7.8114478114478123E-2,0.60654212596187329,0.38702388755169365,0.30951194377584684,-7.7511943775846803E-2,2.5837314591948934,0.16105368916803958,2.5938290794635509E-3,0.12,0.12287871009712967,0.11172417283039289,2.4964581589271002E-5,2.4964581589271002E-5,7.8677451242352564E-2,6.190141333992766E-6,6.190141333992766E-6,0.1254299248281506,3.7758398501749223E-4,4.9725720000000006E-3,1.9481248498866916E-2,3.7590192253534666E-4,2.5274385640138952E-2,0.10102289221874415,1.8370124554031994E-4,1.5010091225353469E-3,1.7168912025257207E-3,1.1251072000000003E-3,0.1243143,1.011593340990785E-3,7.2600000000000003E-5,{"$f":"CHOOSE(Ext_VCC, (Qg_Q1+Qg_Q2)*Fsw*'Design Regulator'!$G$80, (Qg_Q1+Qg_Q2)*Fsw*Vout, (Qg_Q1+Qg_Q2)*Fsw*Vin)","v":6.1485999999999985E-2},8.6317369090909091E-2,7.6857499999999981E-2,6.1558599999999984E-2,0.33791074220370831,0.21398928404266468,2.3200000000000003,0.87286603088727421,1.6098273546020843,0.64110915303788585,null,87.286603088727418,0.12287871009712967,0.15130557684266469,0.10732182364013895,4.2740610202525724E-2,1.011593340990785E-3,0.21286417684266468,4.1721378661162278]
["QgTop",{"$f":"Qg_Q1*1000000000","v":3},"nC","Gate Charge Of Top FET",null,null,30,33,1,0.12,0.12,8.0808080808080801E-2,0.60655872810414269,0.38701969787625506,0.3135098489381275,-7.3509848938127537E-2,2.4503282979375847,0.16395737417192408,2.6882020545352316E-3,0.12,0.12298347061345891,0.11172296337527175,2.4964041090704627E-5,2.4964041090704627E-5,8.009535677291145E-2,6.4152661765799723E-6,6.4152661765799723E-6,0.12769308591642045,3.9133258058060002E-4,5.1440399999999999E-3,1.9478458691081967E-2,3.5649336341034331E-4,2.5439853158230046E-2,0.10284209427318165,1.9037693438089166E-4,1.5203973634103432E-3,1.7441251256333234E-3,1.1639039999999999E-3,0.12860099999999997,1.0483988012687402E-3,7.2600000000000003E-5,{"$f":"CHOOSE(Ext_VCC, (Qg_Q1+Qg_Q2)*Fsw*'Design Regulator'!$G$80, (Qg_Q1+Qg_Q2)*Fsw*Vout, (Qg_Q1+Qg_Q2)*Fsw*Vin)","v":6.1485999999999985E-2},8.6317369090909091E-2,7.6857499999999981E-2,6.1558599999999984E-2,0.34257073100585816,0.21850748228386332,2.4,0.87509137790578773,1.6547476973734503,0.66273682688449964,null,87.509137790578777,0.12298347061345891,0.15578497828386334,0.11031651315823002,4.4182455125633312E-2,1.0483988012687402E-3,0.21734357828386333,4.2599341343637214]
["QgdTop",{"$f":"Qgd_Q1*1000000000","v":0.7},"nC","Gate to Drain Charge",null,null,31,33,1,0.124,0.124,8.3501683501683507E-2,0.60657533011361131,0.38701550730682122,0.31750775365341061,-6.9507753653410609E-2,2.3169251217803537,0.16690641162438813,2.7857750241329689E-3,0.12,0.12309178500817441,0.11172175366207641,2.4963500482659373E-5,2.4963500482659373E-5,8.1535396290322165E-2,6.6480208482198821E-6,6.6480208482198821E-6,0.12999163068773731,4.0554777717257009E-4,5.3155079999999992E-3,1.9474898298587638E-2,3.3708480211758012E-4,2.5605100068481778E-2,0.10468966612074276,1.9727867146450669E-4,1.5397856021175801E-3,1.7716247389847337E-3,1.2027008E-3,0.1328877,1.0864522594118578E-3,7.2600000000000003E-5,{"$f":"CHOOSE(Ext_VCC, (Qg_Q1+Qg_Q2)*Fsw*'Design Regulator'!$G$80, (Qg_Q1+Qg_Q2)*Fsw*Vout, (Qg_Q1+Qg_Q2)*Fsw*Vin)","v":6.1485999999999985E-2},8.6317369090909091E-2,7.6857499999999981E-2,6.1558599999999984E-2,0.34723557439638358,0.2230257256074665,2.48,0.87718194495677326,1.6996647310272266,0.68436848608477097,null,87.718194495677324,0.12309178500817441,0.1602644248074665,0.11331098206848178,4.5624565738984733E-2,1.0864522594118578E-3,0.22182302480746649,4.3477312862263435]
["QgsTop",{"$f":"Qgs_Q1*1000000000","v":0.7},"nC",null,null,null,32,{"$f":"Vin","v":33},{"$f":"MODE","v":1},0.128,{"$f":"Iout*G41/100/Number_of_Phases","v":0.128},{"$f":"Vout*K41/(Vin*Efficiency)","v":8.61952861952862E-2},{"$f":"(Vout+(Rdson2+Rs+Rdcr)*K41)/(Vin+(Rs+Rdson2-Rdson1)*K41)","v":0.60659193199028094},{"$f":"(Vin-(Rdson1+Rdcr)*K41-Vout)*M41/(Fsw*Lf)","v":0.38701131584340337},0.32150565792170172,-6.5505657921701682E-2,{"$f":"IF(MIN(Vin, -P41/(Coss_Q1+Coss_Q2)*0.00000002)<0, 0, MIN(Vin, -P41/(Coss_Q1+Coss_Q2)*0.00000002))","v":2.1835219307233893},0.16989843990622813,{"$f":"R41^2*Rdcr","v":2.8865479882570211E-3},{"$f":"Core_Loss_Ch1","v":0.12},{"$f":"(T41+S41*(1+Ltc*(Ta-25)))/(1-S41*Ltc*ThetaCa)","v":0.12320365344772315},0.11172054369081011,2.4962959765140419E-5,2.4962959765140419E-5,8.2996415631590506E-2,6.888405007691721E-6,6.888405007691721E-6,0.13232372126642619,{"$f":"Rdson1*AB41^2","v":4.2022961303507647E-4},{"$f":"(Vin*K41/2)*Fsw*(Tr_buck+Tf_buck)","v":5.4869760000000002E-3},{"$f":"(0.5*Coss_Q1*(Vin-Q41)^2-0.5*Coss_Q2*(Vin-Q41)^2+(Qoss_Q2*(Vin-Q41)/Vin)*Vin)*Fsw","v":1.9470567321125752E-2},{"$f":"IF(K41>N41/2,0,ABS(K41-N41/2)*Vsd_Q1*Deadtime*Fsw)","v":3.1767623865708446E-4},{"$f":"(AF41+AE41+AD41+AC41*(1+RdsonTopTc*Ta-RdsonTopTc*25))/(1-AC41*RdsonTopTc*ThetaJA_Q1)","v":2.5770126438976488E-2},{"$f":"SQRT((1-M41))*SQRT(K41^2+(N41^2)/12)","v":0.10656412469858399},{"$f":"Rdson2*AH41^2","v":2.0440642810995644E-4},{"$f":"IF(K41<N41/2,Deadtime*Fsw*IF(VfdSky_Q2>0,0,Vsd_Q2)*(K41+N41/2),2*Deadtime*Fsw*IF(VfdSky_Q2>0,0,Vsd_Q2)*K41)","v":1.5591738386570846E-3},{"$f":"(AJ41+AI41*(1+RdsonBotTc*Ta-RdsonBotTc*25))/(1-AI41*RdsonBotTc*ThetaJA_Q2)","v":1.7993900114092094E-3},{"$f":"2*Deadtime*Fsw*IF(VfdSky_Q2>0,VfdSky_Q2,Vsd_Q2)*K41","v":1.2414976E-3},{"$f":"IF(QrrSky_Q2>0,QrrSky_Q2,Qrr_Q2*K41/(Iout/Number_of_Phases))*Fsw*Vin","v":0.13717439999999997},{"$f":"Rs*R41^2","v":1.1257537154202382E-3},{"$f":"Iq*Vin","v":7.2600000000000003E-5},{"$f":"CHOOSE(Ext_VCC, (Qg_Q1+Qg_Q2)*Fsw*'Design Regulator'!$G$80, (Qg_Q1+Qg_Q2)*Fsw*Vout, (Qg_Q1+Qg_Q2)*Fsw*Vin)","v":6.1485999999999985E-2},8.6317369090909091E-2,{"$f":"(Qg_Q1+Qg_Q2)*Fsw*(Vin-VCC)","v":7.6857499999999981E-2},{"$f":"SUM(AO41:AP41)","v":6.1558599999999984E-2},{"$f":" SUM(U41,X41,AA41,AG41,AK41,AL41,AM41,AS41,AN41)","v":0.3519052725783019},{"$f":" SUM(AG41,AK41,AL41,AM41,AS41)","v":0.22754401405038566},{"$f":"Vout*K41","v":2.56},0.87914947787202125,{"$f":"ThetaJA_Q1*BD41","v":1.7445784565846472},{"$f":"ThetaJA_Q2*BE41","v":0.70600413017113817},null,87.914947787202124,{"$f":"U41","v":0.12320365344772315},{"$f":"AG41+AK41+AM41","v":0.16474391645038566},{"$f":"AG41+AM41*0.66","v":0.11630523043897648},{"$f":"AK41+AM41*0.33","v":4.7066942011409207E-2},{"$f":"AN41","v":1.1257537154202382E-3},0.22630251645038565,4.4355293224275592]
["RGateTop",{"$f":"Rgate1","v":3.5},"W","Gate Resistance",null,null,33,33,1,{"$f":"Iout*G42/100","v":0.13200000000000001},0.13200000000000001,8.8888888888888892E-2,0.60660853373415313,0.38700712348601202,0.32550356174300599,-6.1503561743006002E-2,2.0501187247668669,0.17293122757060519,2.9905209469076443E-3,0.12,0.12331907610401779,0.11171933346147589,2.4962418938152892E-5,2.4962418938152892E-5,8.4477324257308001E-2,7.1364183136743583E-6,7.1364183136743583E-6,0.134687621060917,4.3537812640918015E-4,5.6584440000000003E-3,1.9465465758438123E-2,2.9826767302888193E-4,2.5934932337734015E-2,0.10846406871414731,2.1176017563649083E-4,1.5785620730288817E-3,1.8274209117739486E-3,1.2802944000000001E-3,{"$f":"IF(QrrSky_Q2>0,QrrSky_Q2,Qrr_Q2*K42/(Iout/Number_of_Phases))*Fsw*Vin","v":0.14146109999999998},1.1663031692939812E-3,7.2600000000000003E-5,{"$f":"CHOOSE(Ext_VCC, (Qg_Q1+Qg_Q2)*Fsw*'Design Regulator'!$G$80, (Qg_Q1+Qg_Q2)*Fsw*Vout, (Qg_Q1+Qg_Q2)*Fsw*Vin)","v":6.1485999999999985E-2},8.6317369090909091E-2,7.6857499999999981E-2,6.1558599999999984E-2,0.35657982576007158,0.23206234764950792,2.64,0.88100439618035997,1.7894888750660101,0.72764375867660913,null,88.100439618035992,0.12331907610401779,0.16922345324950794,0.119299258337734,4.8509583911773943E-2,1.1663031692939812E-3,0.23078205324950793,4.5233282436903561]
["GfsTop",{"$f":"Gfs_Q1","v":71},"S","Transconductance of Top FET",null,null,34,33,1,0.13600000000000001,0.13600000000000001,9.1582491582491585E-2,0.60662513534522944,0.38700293023465787,0.32950146511732892,-5.7501465117328926E-2,1.9167155039109642,0.17600266759583774,3.0976939000850953E-3,0.12,0.12343805315443719,0.11171812297407685,2.4961878001701918E-5,2.4961878001701918E-5,8.5977092441802891E-2,7.3920604247463194E-6,7.3920604247463194E-6,0.13708169029440848,4.50993355535331E-4,5.8299120000000005E-3,1.945959361026655E-2,2.7885910523299838E-4,2.6099517832711711E-2,0.11038817503192463,2.1933988536381889E-4,1.5979503052329983E-3,1.8557174089840797E-3,1.3190912000000002E-3,0.14574779999999998,1.2081006210331873E-3,7.2600000000000003E-5,{"$f":"CHOOSE(Ext_VCC, (Qg_Q1+Qg_Q2)*Fsw*'Design Regulator'!$G$80, (Qg_Q1+Qg_Q2)*Fsw*Vout, (Qg_Q1+Qg_Q2)*Fsw*Vin)","v":6.1485999999999985E-2},8.6317369090909091E-2,7.6857499999999981E-2,6.1558599999999984E-2,0.36125923415559258,0.23658072644169575,2.72,0.88275597517045834,1.8343959874906755,0.74928737113476118,null,88.275597517045838,0.12343805315443719,0.17370303524169578,0.1222930658327117,4.9952491408984077E-2,1.2081006210331873E-3,0.23526163524169577,4.6111280507372374]
["VthTop",{"$f":"Vth_Q1","v":1.8},"V","Threshold Voltage of Top FET",null,null,35,33,1,0.14000000000000001,0.14000000000000001,9.4276094276094291E-2,0.6066417368235113,0.38699873608935154,0.33349936804467578,-5.3499368044675755E-2,1.7833122681558586,0.17911077152950991,3.20806684778963E-3,0.12,0.12356058478182716,0.11171691222861603,2.4961336955792597E-5,2.4961336955792597E-5,8.7494748410323328E-2,7.6553309993857766E-6,7.6553309993857766E-6,0.13950438145051317,4.6707533865336681E-4,6.0013799999999997E-3,1.9452950876352855E-2,2.5945053526945955E-4,2.6263882991804509E-2,0.11233519499251345,2.2714552861210829E-4,1.6173385352694597E-3,1.8842794719826422E-3,1.357888E-3,0.15003450000000002,1.2511460706379556E-3,7.2600000000000003E-5,{"$f":"CHOOSE(Ext_VCC, (Qg_Q1+Qg_Q2)*Fsw*'Design Regulator'!$G$80, (Qg_Q1+Qg_Q2)*Fsw*Vout, (Qg_Q1+Qg_Q2)*Fsw*Vin)","v":6.1485999999999985E-2},8.6317369090909091E-2,7.6857499999999981E-2,6.1558599999999984E-2,0.36594349798420744,0.24109915046378716,2.8000000000000003,0.88441249876467865,1.8792997948770678,0.77093496707973974,null,88.441249876467865,0.12356058478182716,0.17818266246378717,0.12528665299180453,5.1395664471982648E-2,1.2511460706379556E-3,0.23974126246378716,4.698928744290229]
["VspTop",{"$f":"Vsp_Q1","v":1.8056338028169014},"V",null,null,null,36,33,1,0.14400000000000002,0.14400000000000002,9.6969696969696983E-2,0.60665833816900061,0.38699454105010378,0.33749727052505191,-4.9497270525051873E-2,1.6499090175017292,0.18225366361260079,3.3216397900215043E-3,0.12,0.12368667117450113,0.11171570122509655,2.4960795800430078E-5,2.4960795800430078E-5,8.9029375466587207E-2,7.9262296959705603E-6,7.9262296959705603E-6,0.14195423470296592,4.8362411400251364E-4,6.1728480000000007E-3,1.9445537556438849E-2,2.4004196313829159E-4,2.6428027882844912E-2,0.11430395071960681,2.3517707670198541E-4,1.6367267631382917E-3,1.9131070697505732E-3,1.3966848000000001E-3,0.15432119999999999,1.2954395181083867E-3,7.2600000000000003E-5,{"$f":"CHOOSE(Ext_VCC, (Qg_Q1+Qg_Q2)*Fsw*'Design Regulator'!$G$80, (Qg_Q1+Qg_Q2)*Fsw*Vout, (Qg_Q1+Qg_Q2)*Fsw*Vin)","v":6.1485999999999985E-2},8.6317369090909091E-2,7.6857499999999981E-2,6.1558599999999984E-2,0.37063261747070136,0.24561761975259547,2.8800000000000003,0.88598138852150932,1.9242002982426736,0.79258654604625856,null,88.598138852150925,0.12368667117450113,0.18266233495259548,0.1282800198828449,5.2839103069750572E-2,1.2954395181083867E-3,0.24422093495259548,4.7867303250708719]
["VsdTop",{"$f":"Vsd_Q1","v":0.8},"V",null,null,null,37,33,1,0.14800000000000002,0.14800000000000002,9.9663299663299676E-2,0.60667493938169881,0.38699034511692554,0.34149517255846279,-4.5495172558462749E-2,1.5165057519487584,0.18542957495450871,3.4384127267809762E-3,0.12,0.12381631252624092,0.11171448996352157,2.4960254535619522E-5,2.4960254535619522E-5,9.0580109145320498E-2,8.2047561727781747E-6,8.2047561727781747E-6,0.14442987338459831,5.006397198213864E-4,6.344316E-3,1.9437353650266383E-2,2.2063338883952094E-4,2.6591952573603056E-2,0.11629333145936897,2.434345009545358E-4,1.6561149888395211E-3,1.9422001713066935E-3,1.4354816000000002E-3,0.15860790000000002,1.3409809634445807E-3,7.2600000000000003E-5,{"$f":"CHOOSE(Ext_VCC, (Qg_Q1+Qg_Q2)*Fsw*'Design Regulator'!$G$80, (Qg_Q1+Qg_Q2)*Fsw*Vout, (Qg_Q1+Qg_Q2)*Fsw*Vin)","v":6.1485999999999985E-2},8.6317369090909091E-2,7.6857499999999981E-2,6.1558599999999984E-2,0.37532659284530367,0.25013613434490972,2.9600000000000004,0.88746931300508125,1.9690974986040461,0.81424210756960058,null,88.746931300508123,0.12381631252624092,0.18714205274490978,0.13127316657360308,5.4282807171306707E-2,1.3409809634445807E-3,0.24870065274490977,4.8745327938002321]
["θJATop",{"$f":"ThetaJA_Q1","v":15},"°C/W","Junction to Ambient Resistance",null,null,38,33,1,0.15200000000000002,0.15200000000000002,0.10235690235690238,0.60669154046160745,0.38698614828982741,0.3454930741449137,-4.1493074144913683E-2,1.3831024714971227,0.18863683781457702,3.5583856580683037E-3,0.12,0.12394950903629748,0.11171327844389416,2.4959713161366054E-5,2.4959713161366054E-5,9.2146134416945469E-2,8.4909100879857822E-6,8.4909100879857822E-6,0.14692999953889438,5.181221943479881E-4,6.515784000000001E-3,1.942839915757727E-2,2.0122481237317341E-4,2.6755657131786684E-2,0.11830228998706464,2.5191777269130362E-4,1.6755032123731734E-3,1.9715587457076896E-3,1.4742784000000002E-3,0.1628946,1.3877704066466382E-3,7.2600000000000003E-5,{"$f":"CHOOSE(Ext_VCC, (Qg_Q1+Qg_Q2)*Fsw*'Design Regulator'!$G$80, (Qg_Q1+Qg_Q2)*Fsw*Vout, (Qg_Q1+Qg_Q2)*Fsw*Vin)","v":6.1485999999999985E-2},8.6317369090909091E-2,7.6857499999999981E-2,6.1558599999999984E-2,0.3800254243436878,0.25465469427749438,3.0400000000000005,0.88888228092145971,2.0139913969768006,0.83590165118561532,null,88.888228092145965,0.12394950903629748,0.19162181587749438,0.1342660931317867,5.5726776745707689E-2,1.3877704066466382E-3,0.25318041587749435,4.9623361511988895]
["Low-side FET","Input Value","Units","Description",null,null,39,33,1,0.15600000000000003,0.15600000000000003,0.10505050505050507,0.60670814140872809,0.38698195056882007,0.34949097528441009,-3.7490975284410005E-2,1.2496991761470002,0.19187388003278977,3.6815585838837401E-3,0.12,0.12408626090939155,0.11171206666621736,2.4959171677674785E-5,2.4959171677674785E-5,9.3726682965259239E-2,8.7846910996702173E-6,8.7846910996702173E-6,0.14945338958737112,5.360715758197087E-4,6.6872520000000012E-3,1.9418674078113329E-2,1.818162337392748E-4,2.6919141625041183E-2,0.12032983910769129,2.6062686323429169E-4,1.6948914337392752E-3,2.0011827620481011E-3,1.5130752000000003E-3,0.1671813,1.4358078477146586E-3,7.2600000000000003E-5,{"$f":"CHOOSE(Ext_VCC, (Qg_Q1+Qg_Q2)*Fsw*'Design Regulator'!$G$80, (Qg_Q1+Qg_Q2)*Fsw*Vout, (Qg_Q1+Qg_Q2)*Fsw*Vin)","v":6.1485999999999985E-2},8.6317369090909091E-2,7.6857499999999981E-2,6.1558599999999984E-2,0.38472911220697281,0.25917329958708929,3.1200000000000006,0.89022572076484852,2.0588819943756178,0.85756517643072161,null,89.022572076484849,0.12408626090939155,0.19610162438708928,0.1372587996250412,5.7171011762048106E-2,1.4358078477146586E-3,0.25766022438708924,5.0501403979869499]
["RdsonBot",{"$f":"Rdson2*1000","v":18},"mW","Drain-Source Resistance of Low-side FET",null,null,40,33,1,0.16,0.16,0.10774410774410775,0.6067247422230625,0.3869777519539141,0.35348887597695705,-3.3488875976957044E-2,1.1162958658985682,0.19513921964145348,3.8079315042275422E-3,0.12,0.12422656835571461,0.11171085463049427,2.4958630084550846E-5,2.4958630084550846E-5,9.5321030553640052E-2,9.0860988658079802E-6,9.0860988658079802E-6,0.15199889013757745,5.5448790247332816E-4,6.8587199999999996E-3,1.940817841161643E-2,1.6240765293785089E-4,2.7082406120949653E-2,0.12237504827055261,2.6956174390596144E-4,1.7142796529378509E-3,2.0310721894603017E-3,1.5518719999999999E-3,0.17146800000000001,1.4850932866487415E-3,7.2600000000000003E-5,{"$f":"CHOOSE(Ext_VCC, (Qg_Q1+Qg_Q2)*Fsw*'Design Regulator'!$G$80, (Qg_Q1+Qg_Q2)*Fsw*Vout, (Qg_Q1+Qg_Q2)*Fsw*Vin)","v":6.1485999999999985E-2},8.6317369090909091E-2,7.6857499999999981E-2,6.1558599999999984E-2,0.38943765668172364,0.26369195031040993,3.2,0.89150454919956967,2.103769291814245,0.8792326828419047,null,89.150454919956971,0.12422656835571461,0.20058147831040996,0.14025128612094967,5.861551218946031E-2,1.4850932866487415E-3,0.26214007831040992,5.137945534884035]
["RdsonBotTc",{"$f":"RdsonBotTc*1000000","v":7000},"ppm","Drain To Source Resitance Temp Co",null,null,41,33,1,0.16400000000000003,0.16400000000000003,0.11043771043771046,0.60674134290461212,0.38697355244512061,0.35748677622256031,-2.9486776222560268E-2,0.98289254075200905,0.19843145968066586,3.9375044190999723E-3,0.12,0.12437043159092954,0.11170964233672807,2.4958088381999419E-5,2.4958088381999419E-5,9.6928494490914702E-2,9.3951330442752807E-6,9.3951330442752807E-6,0.15456541394948489,5.7337121254501483E-4,7.0301880000000014E-3,1.9396912157828378E-2,1.4299906996892827E-4,2.7245450687032862E-2,0.12443704031205542,2.7872238602923388E-4,1.7336678699689284E-3,2.0612269971144906E-3,1.5906688000000002E-3,0.17575470000000001,1.5356267234489891E-3,7.2600000000000003E-5,{"$f":"CHOOSE(Ext_VCC, (Qg_Q1+Qg_Q2)*Fsw*'Design Regulator'!$G$80, (Qg_Q1+Qg_Q2)*Fsw*Vout, (Qg_Q1+Qg_Q2)*Fsw*Vin)","v":6.1485999999999985E-2},8.6317369090909091E-2,7.6857499999999981E-2,6.1558599999999984E-2,0.39415105801995215,0.26821064648414733,3.2800000000000007,0.89272322999360687,2.1486532903054929,0.90090416995671752,null,89.272322999360682,0.12437043159092954,0.20506137768414737,0.14324355268703287,6.0060277997114497E-2,1.5356267234489891E-3,0.26661997768414736,5.2257515626092887]
["QgBot",{"$f":"Qg_Q2*1000000000","v":4.0999999999999996},"nC","Gate Charge Of Top FET",null,null,42,33,1,0.16800000000000001,0.16800000000000001,0.11313131313131314,0.60675794345337863,0.38696935204245009,0.36148467602122503,-2.5484676021225033E-2,0.84948920070750122,0.20174928323295924,4.0702773285012815E-3,0.12,0.12451785083617158,0.11170842978492182,2.4957546570025616E-5,2.4957546570025616E-5,9.8548431204398046E-2,9.7117932928479754E-6,9.7117932928479754E-6,0.1571519360722721,5.9272154427032395E-4,7.2016559999999999E-3,1.9384875316491051E-2,1.235904848325329E-4,2.7408275390749328E-2,0.12651498833636002,2.8810876092748761E-4,1.7530560848325329E-3,2.0916471542186703E-3,1.6294656000000001E-3,0.18004139999999999,1.5874081581154996E-3,7.2600000000000003E-5,{"$f":"CHOOSE(Ext_VCC, (Qg_Q1+Qg_Q2)*Fsw*'Design Regulator'!$G$80, (Qg_Q1+Qg_Q2)*Fsw*Vout, (Qg_Q1+Qg_Q2)*Fsw*Vin)","v":6.1485999999999985E-2},8.6317369090909091E-2,7.6857499999999981E-2,6.1558599999999984E-2,0.39886931647911783,0.27272938814496794,3.3600000000000003,0.89388582499251834,2.1935339908612397,0.92257963731327997,null,89.388582499251839,0.12451785083617158,0.20954132254496799,0.14623559939074932,6.1505309154218667E-2,1.5874081581154996E-3,0.27109992254496795,5.3135584818813726]
["RGateBot",{"$f":"Rgate2","v":3},"W","Gate Resistance",null,null,43,33,1,0.17199999999999999,0.17199999999999999,0.11582491582491582,0.60677454386936358,0.38696515074591337,0.3654825753729567,-2.1482575372956697E-2,0.71608584576522327,0.20509144868647566,4.2062502324317283E-3,0.12,0.12466882631804908,0.1117072169750786,2.4957004648634578E-5,2.4957004648634578E-5,0.10018023392467015,1.0036079269201634E-5,1.0036079269201634E-5,0.15975749015880811,6.1253893588420003E-4,7.3731239999999983E-3,1.9372067887346276E-2,1.0418189752869081E-4,2.7570880299495309E-2,0.12860811273973199,2.9772083992456107E-4,1.7724442975286907E-3,2.1223326300186369E-3,1.6682623999999999E-3,0.18432809999999994,1.640437590648374E-3,7.2600000000000003E-5,{"$f":"CHOOSE(Ext_VCC, (Qg_Q1+Qg_Q2)*Fsw*'Design Regulator'!$G$80, (Qg_Q1+Qg_Q2)*Fsw*Vout, (Qg_Q1+Qg_Q2)*Fsw*Vin)","v":6.1485999999999985E-2},8.6317369090909091E-2,7.6857499999999981E-2,6.1558599999999984E-2,0.4035924323221291,0.27724817532951385,3.4399999999999995,0.89499603836031694,2.2384113944924291,0.94425908445027917,null,89.499603836031696,0.12466882631804908,0.21402131292951387,0.14922742629949526,6.2950605630018613E-2,1.640437590648374E-3,0.27557991292951384,5.4013662934184712]
["VsdBot",{"$f":"Vsd_Q2","v":0.8},"V","Diode Forward Voltage of Bottom FET Body Diode",null,null,44,33,1,0.17600000000000002,0.17600000000000002,0.11851851851851854,0.60679114415256852,0.38696094855552082,0.36948047427776043,-1.7480474277760394E-2,0.5826824759253465,0.20845678523117378,4.3454231308915712E-3,0.12,0.12482335826864441,0.11170600390720144,2.4956462617831405E-5,2.4956462617831405E-5,0.10182333048428294,1.0367990630911502E-5,1.0367990630911502E-5,0.16238116496135668,6.3282342562097599E-4,7.544592000000001E-3,1.9358489870135914E-2,8.47733080574268E-5,2.7733265480604823E-2,0.13071567838139533,3.0755859434475092E-4,1.791832508057427E-3,2.1532833937979606E-3,1.7070592000000002E-3,0.18861479999999997,1.6947150210477127E-3,7.2600000000000003E-5,{"$f":"CHOOSE(Ext_VCC, (Qg_Q1+Qg_Q2)*Fsw*'Design Regulator'!$G$80, (Qg_Q1+Qg_Q2)*Fsw*Vout, (Qg_Q1+Qg_Q2)*Fsw*Vin)","v":6.1485999999999985E-2},8.6317369090909091E-2,7.6857499999999981E-2,6.1558599999999984E-2,0.40832040581734363,0.28176700807440275,3.5200000000000005,0.89605725510254386,2.2832855022090723,0.96594251090696936,null,89.605725510254388,0.12482335826864441,0.21850134887440276,0.15221903348060481,6.4396167393797957E-2,1.6947150210477127E-3,0.28005994887440272,5.489174997938294]
["QrrBot",{"$f":"Qrr_Q2*1000000000","v":29.999999999999996},"nC","Reverse Recovery Charge of Body Diode",null,null,45,33,1,0.18,0.18,0.1212121212121212,0.60680774430299511,0.38695674547128367,0.37347837273564183,-1.3478372735641841E-2,0.44927909118806142,0.21184418858871407,4.4877960238810652E-3,0.12,0.12498144692551486,0.11170479058129357,2.4955920477621304E-5,2.4955920477621304E-5,0.10347718123070677,1.0707527035452534E-5,1.0707527035452534E-5,0.16502210100902301,6.5357505171437268E-4,7.7160600000000003E-3,1.9344141264601832E-2,6.5364716418768676E-5,2.7895431001349717E-2,0.13283699190127146,3.1762199551281224E-4,1.8112207164187686E-3,2.1844994148779752E-3,1.7458559999999998E-3,0.19290149999999998,1.7502404493136155E-3,7.2600000000000003E-5,{"$f":"CHOOSE(Ext_VCC, (Qg_Q1+Qg_Q2)*Fsw*'Design Regulator'!$G$80, (Qg_Q1+Qg_Q2)*Fsw*Vout, (Qg_Q1+Qg_Q2)*Fsw*Vin)","v":6.1485999999999985E-2},8.6317369090909091E-2,7.6857499999999981E-2,6.1558599999999984E-2,0.41305323723856918,0.28628588641622765,3.5999999999999996,0.89707257471550617,2.3281563150202458,0.98762991622316953,null,89.707257471550619,0.12498144692551486,0.22298143041622767,0.15521042100134971,6.5841994414877966E-2,1.7502404493136155E-3,0.28454003041622766,5.5769845961580629]
["TrrBot",{"$f":"Trr_Q2*1000000000","v":40},"ns","Reverse Recovery Time of Body Diode",null,null,46,33,1,0.18400000000000002,0.18400000000000002,0.12390572390572394,0.60682434432064492,0.3869525414932124,0.37747627074660622,-9.4762707466061746E-3,0.31587569155353917,0.21525261697364959,4.6333689114004704E-3,0.12,0.12514309253169353,0.11170357699735801,2.4955378228009382E-5,2.4955378228009382E-5,0.1051412770523517,1.1054688140199379E-5,1.1054688140199379E-5,0.16767948746511155,6.7479385239750005E-4,7.8875280000000013E-3,1.9329022070485865E-2,4.5956122612741302E-5,2.8057376928939608E-2,0.13497139918309431,3.2791101475395946E-4,1.8306089226127415E-3,2.2159806626177577E-3,1.7846528000000001E-3,0.19718819999999998,1.8070138754461833E-3,7.2600000000000003E-5,{"$f":"CHOOSE(Ext_VCC, (Qg_Q1+Qg_Q2)*Fsw*'Design Regulator'!$G$80, (Qg_Q1+Qg_Q2)*Fsw*Vout, (Qg_Q1+Qg_Q2)*Fsw*Vin)","v":6.1485999999999985E-2},8.6317369090909091E-2,7.6857499999999981E-2,6.1558599999999984E-2,0.41779092686506525,0.29080481039155731,3.6800000000000006,0.89804484066621515,2.3730238339340941,1.0093212999392662,null,89.804484066621512,0.12514309253169353,0.22746155759155734,0.1582015889289396,6.7288086662617749E-2,1.8070138754461833E-3,0.2890201575915573,5.6647950887945235]
["θJABot",{"$f":"ThetaJA_Q2","v":15},"°C/W","Junction to Ambient Resistance",null,null,47,33,1,0.188,0.188,0.1265993265993266,0.60684094420551971,0.38694833662131783,0.38147416831065895,-5.4741683106589167E-3,0.18247227702196389,0.21868108728122876,4.7821417934500393E-3,0.12,0.1253082953356903,0.1117023631553979,2.495483586900079E-5,2.495483586900079E-5,0.10681513751536519,1.1409473602426374E-5,1.1409473602426374E-5,0.17035255916075634,6.9647986590285578E-4,8.0589960000000006E-3,1.931313228752992E-2,2.6547526639371481E-5,2.8219103330522022E-2,0.13711828295993717,3.3842562339386507E-4,1.8499971266393717E-3,2.2477271064141198E-3,1.8234496E-3,0.20147489999999998,1.8650352994455152E-3,7.2600000000000003E-5,{"$f":"CHOOSE(Ext_VCC, (Qg_Q1+Qg_Q2)*Fsw*'Design Regulator'!$G$80, (Qg_Q1+Qg_Q2)*Fsw*Vout, (Qg_Q1+Qg_Q2)*Fsw*Vin)","v":6.1485999999999985E-2},8.6317369090909091E-2,7.6857499999999981E-2,6.1558599999999984E-2,0.42253347498154337,0.2953237800369361,3.76,0.89897666629352968,2.4178880599578303,1.0310166615962117,null,89.897666629352969,0.1253082953356903,0.23194173043693611,0.16119253733052202,6.8734444106414119E-2,1.8650352994455152E-3,0.29350033043693607,5.7526064765639475]
["Bottom Schottky","Input Value","Units","Std Units",null,null,48,33,1,0.19200000000000003,0.19200000000000003,0.12929292929292932,0.60685754395762082,0.38694413085561036,0.38547206542780521,-1.472065427805147E-3,4.9068847593504897E-2,0.22212867149537524,4.9341146700300331E-3,0.12,0.12547705559149272,0.11170114905541621,2.4954293400600621E-5,2.4954293400600621E-5,0.10849830910805754,1.1771883079307602E-5,1.1771883079307602E-5,0.17304059379982756,7.1863313046232615E-4,8.2304640000000016E-3,1.9296471915475847E-2,7.1389284986838412E-6,2.8380610273182297E-2,0.13927706055809552,3.4916579275866131E-4,1.8693853284986841E-3,2.279738715701586E-3,1.8622464000000003E-3,0.20576160000000002,1.9243047213117128E-3,7.2600000000000003E-5,{"$f":"CHOOSE(Ext_VCC, (Qg_Q1+Qg_Q2)*Fsw*'Design Regulator'!$G$80, (Qg_Q1+Qg_Q2)*Fsw*Vout, (Qg_Q1+Qg_Q2)*Fsw*Vin)","v":6.1485999999999985E-2},8.6317369090909091E-2,7.6857499999999981E-2,6.1558599999999984E-2,0.42728088187816815,0.29984279538888386,3.8400000000000007,0.8998704576273151,2.4627489940977347,1.0527160007355238,null,89.987045762731512,0.12547705559149272,0.23642194898888391,0.1641832662731823,7.0181066715701595E-2,1.9243047213117128E-3,0.29798054898888388,5.840418760182124]
["VfdSky",{"$f":"VfdSky_Q2","v":0},"V","Diode Forward Voltage",null,null,49,33,1,0.19600000000000001,0.19600000000000001,0.13198653198653199,0.6068741435769498,0.38693992419610107,0.38946996209805052,2.5300379019494723E-3,0,0.22559449330913875,5.0892875411407057E-3,0.12,0.12564937355856709,0.11169993469741618,2.4953750822814078E-5,2.4953750822814078E-5,0.11019036358918512,1.2141916227916813E-5,1.2141916227916813E-5,0.17574290932912787,7.4125368430718545E-4,8.4019319999999991E-3,1.9290150000000006E-2,0,2.8565278361432959E-2,0.14144718177447363,3.6013149417493765E-4,1.9010432000000001E-3,2.3242855957422226E-3,1.9010432000000001E-3,0.21004829999999999,1.9848221410448748E-3,7.2600000000000003E-5,{"$f":"CHOOSE(Ext_VCC, (Qg_Q1+Qg_Q2)*Fsw*'Design Regulator'!$G$80, (Qg_Q1+Qg_Q2)*Fsw*Vout, (Qg_Q1+Qg_Q2)*Fsw*Vin)","v":6.1485999999999985E-2},8.6317369090909091E-2,7.6857499999999981E-2,6.1558599999999984E-2,0.43206879852383789,0.30439750715717517,3.92,0.90072105508295497,2.5079573454214947,1.0746033689361336,null,90.072105508295493,0.12564937355856709,0.24093786395717517,0.16719715636143298,7.1640224595742236E-2,1.9848221410448748E-3,0.30249646395717517,5.9289306935606341]
["QrrSky",{"$f":"QrrSky_Q2*1000000000","v":0},"nC","Diode Reverse Recovery Charge",null,null,50,33,1,0.2,0.2,0.13468013468013468,0.60689074306350854,0.38693571664280069,0.39346785832140035,6.5321416785996678E-3,0,0.22907772494902937,5.2476604067823156E-3,0.12,0.12582524950185928,0.11169872008140087,2.4953208135646294E-5,2.4953208135646294E-5,0.11189089643589202,1.2519572705227514E-5,1.2519572705227514E-5,0.17845886146720405,7.6434156566809741E-4,8.5734000000000001E-3,1.9290150000000006E-2,0,2.8763959816118494E-2,0.14362812688207147,3.7132269896974351E-4,1.93984E-3,2.3762368181096611E-3,1.93984E-3,0.21433499999999997,2.0465875586451032E-3,7.2600000000000003E-5,{"$f":"CHOOSE(Ext_VCC, (Qg_Q1+Qg_Q2)*Fsw*'Design Regulator'!$G$80, (Qg_Q1+Qg_Q2)*Fsw*Vout, (Qg_Q1+Qg_Q2)*Fsw*Vin)","v":6.1485999999999985E-2},8.6317369090909091E-2,7.6857499999999981E-2,6.1558599999999984E-2,0.43688294647557335,0.30897363663422811,4,0.90153381287135148,2.5533758972417768,1.0966018022716448,null,90.153381287135147,0.12582524950185928,0.24547519663422812,0.17022505981611846,7.3106786818109656E-2,2.0465875586451032E-3,0.30703379663422808,6.017862414030871]
["Ireverse",{"$f":"Ireverse","v":0},"mA","Reverse Leakage Current",null,null,51,33,1,0.20400000000000001,0.20400000000000001,0.13737373737373737,0.60690734241729838,0.38693150819571975,0.39746575409785989,1.0534245902140138E-2,0,0.23257758419407318,5.4092332669551206E-3,0.12,0.12600468369179607,0.11169750520737334,2.495266533910239E-5,2.495266533910239E-5,0.11359952538682941,1.29048521681129E-5,1.29048521681129E-5,0.18118784138465174,7.8789681277511333E-4,8.7448679999999994E-3,1.9290150000000006E-2,0,2.8963192855781344E-2,0.14581940475780814,3.8273937847058657E-4,1.9786368E-3,2.4284531634916557E-3,1.9786368E-3,0.21862169999999997,2.1096009741124969E-3,7.2600000000000003E-5,{"$f":"CHOOSE(Ext_VCC, (Qg_Q1+Qg_Q2)*Fsw*'Design Regulator'!$G$80, (Qg_Q1+Qg_Q2)*Fsw*Vout, (Qg_Q1+Qg_Q2)*Fsw*Vin)","v":6.1485999999999985E-2},8.6317369090909091E-2,7.6857499999999981E-2,6.1558599999999984E-2,0.44170272500268876,0.31355058281927295,4.08,0.90231495702707309,2.5988027228367199,1.118604212452375,null,90.231495702707306,0.12600468369179607,0.250013346019273,0.17325351485578133,7.4573614163491661E-2,2.1096009741124969E-3,0.31157194601927296,6.1068101419777507]
["Controller","Input Value","Units","Std Units",null,null,52,33,1,0.20800000000000002,0.20800000000000002,0.14006734006734006,0.60692394163832097,0.38692729885486882,0.4014636494274344,1.4536350572565609E-2,0,0.23609333158010576,5.5740061216593764E-3,0.12,0.12618767640428574,0.11169629007533666,2.4952122433187501E-5,2.4952122433187501E-5,0.11531588907581607,1.3297754273345915E-5,1.3297754273345915E-5,0.18392927352853974,8.1191946385767344E-4,8.9163360000000021E-3,1.9290150000000006E-2,0,2.9162977558888709E-2,0.14802055112671811,3.9438150400543262E-4,2.0174336000000001E-3,2.4809346028519847E-3,2.0174336000000001E-3,0.22290839999999998,2.1738623874471568E-3,7.2600000000000003E-5,{"$f":"CHOOSE(Ext_VCC, (Qg_Q1+Qg_Q2)*Fsw*'Design Regulator'!$G$80, (Qg_Q1+Qg_Q2)*Fsw*Vout, (Qg_Q1+Qg_Q2)*Fsw*Vin)","v":6.1485999999999985E-2},8.6317369090909091E-2,7.6857499999999981E-2,6.1558599999999984E-2,0.44652813443018008,0.31812834576174065,4.16,0.9030662309228652,2.6442378233833308,1.1406105990427797,null,90.306623092286515,0.12618767640428574,0.25455231216174068,0.17628252155888871,7.6040706602851976E-2,2.1738623874471568E-3,0.31611091216174064,6.1957738783701171]
["θJA",30,"°C/W","Junction to Ambient Resistance",null,null,53,33,1,0.21200000000000002,0.21200000000000002,0.14276094276094278,0.60694054072657799,0.38692308862025915,0.4054615443101296,1.8538455689870448E-2,0,0.23962426777969176,5.7419789708953424E-3,0.12,0.12637422792071959,0.11169507468529404,2.4951579417906824E-5,2.4951579417906824E-5,0.11703964575134025,1.3698278677599218E-5,1.3698278677599218E-5,0.18668261358347912,8.3640955714460604E-4,9.0878039999999997E-3,1.9290150000000006E-2,0,2.9363314004073472E-2,0.15023112691647772,4.06249046902707E-4,2.0562304000000002E-3,2.5336811071918507E-3,2.0562304000000002E-3,0.22719509999999998,2.2393717986491837E-3,7.2600000000000003E-5,{"$f":"CHOOSE(Ext_VCC, (Qg_Q1+Qg_Q2)*Fsw*'Design Regulator'!$G$80, (Qg_Q1+Qg_Q2)*Fsw*Vout, (Qg_Q1+Qg_Q2)*Fsw*Vin)","v":6.1485999999999985E-2},8.6317369090909091E-2,7.6857499999999981E-2,6.1558599999999984E-2,0.45135917508872953,0.32270692551126529,4.24,0.90378925206037064,2.6896812000611017,1.1626209616078775,null,90.378925206037067,0.12637422792071959,0.2590920951112653,0.17931208000407345,7.750806410719184E-2,2.2393717986491837E-3,0.32065069511126526,6.2847536241807997]
["Theta Ja",19.600000000000001,"°C/W","Junction to Ambient Resistance",null,null,54,33,1,0.21600000000000003,0.21600000000000003,0.14545454545454548,0.6069571396820711,0.38691887749190118,0.40945943874595059,2.2540561254049435E-2,0,0.24316973114808665,5.9131518146632745E-3,0.12,0.12656433852797266,0.1116938590372485,2.4951036293265477E-5,2.4951036293265477E-5,0.11877047207721793,1.4106425037445203E-5,1.4106425037445203E-5,0.18944734656188431,8.6136713086412881E-4,9.2592720000000007E-3,1.9290150000000006E-2,0,2.9564202270134357E-2,0.15245071671623606,4.1834197849129295E-4,2.0950272000000002E-3,2.5866926475498616E-3,2.0950272000000002E-3,0.23148180000000002,2.306129207718677E-3,7.2600000000000003E-5,{"$f":"CHOOSE(Ext_VCC, (Qg_Q1+Qg_Q2)*Fsw*'Design Regulator'!$G$80, (Qg_Q1+Qg_Q2)*Fsw*Vout, (Qg_Q1+Qg_Q2)*Fsw*Vin)","v":6.1485999999999985E-2},8.6317369090909091E-2,7.6857499999999981E-2,6.1558599999999984E-2,0.45619584731470619,0.32728632211768421,4.32,0.90448552322845155,2.7351328540520154,1.1846352997132479,null,90.44855232284516,0.12656433852797266,0.26363269491768426,0.18234219027013437,7.8975686647549864E-2,2.306129207718677E-3,0.32519129491768423,6.3737493803866112]
[null,null,null,null,null,null,55,33,1,0.22,0.22,0.14814814814814817,0.60697373850480163,0.38691466546980552,0.41345733273490276,2.6542667265097242E-2,0,0.24672909542580154,6.0875246529634285E-3,0.12,0.12675800851840507,0.11169264313120311,2.4950493059268588E-5,2.4950493059268588E-5,0.12050806200979253,1.4522193009356001E-5,1.4522193009356001E-5,0.19222298501608379,8.8679222324384568E-4,9.43074E-3,1.9290150000000006E-2,0,2.97656424360359E-2,0.15467892733381852,4.3066027010053273E-4,2.1338239999999999E-3,2.6399691950020165E-3,2.1338239999999999E-3,0.23576849999999999,2.3741346146557369E-3,7.2600000000000003E-5,{"$f":"CHOOSE(Ext_VCC, (Qg_Q1+Qg_Q2)*Fsw*'Design Regulator'!$G$80, (Qg_Q1+Qg_Q2)*Fsw*Vout, (Qg_Q1+Qg_Q2)*Fsw*Vin)","v":6.1485999999999985E-2},8.6317369090909091E-2,7.6857499999999981E-2,6.1558599999999984E-2,0.4610381514501673,0.33186653563103785,4.4000000000000004,0.90515644249518423,2.7805927865405384,1.2066536129250303,null,90.515644249518417,0.12675800851840507,0.26817411163103788,0.18537285243603591,8.0443574195002018E-2,2.3741346146557369E-3,0.32973271163103784,6.462761147968342]
[null,null,null,null,null,null,56,33,1,0.22400000000000003,0.22400000000000003,0.15084175084175086,0.60699033719477136,0.38691045255398282,0.41745522627699144,3.0544773723008622E-2,0,0.25030176758856632,6.2650974857960673E-3,0.12,0.12695523818986304,0.11169142696716096,2.4949949715921301E-5,2.4949949715921301E-5,0.12225212574717667,1.4945582249703497E-5,1.4945582249703497E-5,0.19500906736512197,9.1268487251075232E-4,9.602208000000001E-3,1.9290150000000006E-2,0,2.9967634580908571E-2,0.15691538644551711,4.4320389306022753E-4,2.1726208000000004E-3,2.6935107206616945E-3,2.1726208000000004E-3,0.24005520000000002,2.4433880194604661E-3,7.2600000000000003E-5,{"$f":"CHOOSE(Ext_VCC, (Qg_Q1+Qg_Q2)*Fsw*'Design Regulator'!$G$80, (Qg_Q1+Qg_Q2)*Fsw*Vout, (Qg_Q1+Qg_Q2)*Fsw*Vin)","v":6.1485999999999985E-2},8.6317369090909091E-2,7.6857499999999981E-2,6.1558599999999984E-2,0.4658860878428594,0.33644756610157028,4.4800000000000004,0.90580331217331878,2.8260609987136287,1.2286759008099255,null,90.580331217331874,0.12695523818986304,0.2727163453015703,0.18840406658090858,8.1911726720661701E-2,2.4433880194604661E-3,0.33427494530157026,6.5517889279107777]
["Outputs",null,null,null,null,null,57,33,1,0.22800000000000001,0.22800000000000001,0.15353535353535355,0.60700693575198195,0.38690623874444424,0.42145311937222213,3.4546880627777887E-2,0,0.25388718583578496,6.4458703131614406E-3,0.12,0.12715602784567998,0.11169021054512525,2.4949406263228816E-5,2.4949406263228816E-5,0.12400238874618219,1.5376592414759291E-5,1.5376592414759291E-5,0.19780515632932308,9.3904511689123064E-4,9.7736760000000002E-3,1.9290150000000006E-2,0,3.0170178784048807E-2,0.1591597413328712,4.5597281870063638E-4,2.2114176E-3,2.7473171956796335E-3,2.2114176E-3,0.24434189999999997,2.5138894221329619E-3,7.2600000000000003E-5,{"$f":"CHOOSE(Ext_VCC, (Qg_Q1+Qg_Q2)*Fsw*'Design Regulator'!$G$80, (Qg_Q1+Qg_Q2)*Fsw*Vout, (Qg_Q1+Qg_Q2)*Fsw*Vin)","v":6.1485999999999985E-2},8.6317369090909091E-2,7.6857499999999981E-2,6.1558599999999984E-2,0.47073965684621932,0.34102941357972838,4.5600000000000005,0.9064273468801749,2.8715374917607321,1.2507021629351944,null,90.642734688017484,0.12715602784567998,0.27725939597972843,0.1914358327840488,8.3380144195679629E-2,2.5138894221329619E-3,0.33881799597972839,6.6408327212026768]
["Design","Value","Units",null,null,null,58,33,1,0.23200000000000004,0.23200000000000004,0.15622895622895625,0.60702353417643473,0.38690202404120017,0.42545101202060009,3.8548987979399957E-2,0,0.25748481770892462,6.6298431350598139E-3,0.12,0.12736037779467785,0.11168899386509899,2.4948862701196243E-5,2.4948862701196243E-5,0.125758590802755,1.5815223160694778E-5,1.5815223160694778E-5,0.20061083746595998,9.658729946110515E-4,9.9451440000000012E-3,1.9290150000000006E-2,0,3.0373275124919105E-2,0.16141165770106047,4.6896701835247762E-4,2.2502144000000005E-3,2.8013885912439242E-3,2.2502144000000005E-3,0.24862860000000001,2.5856388226733274E-3,7.2600000000000003E-5,{"$f":"CHOOSE(Ext_VCC, (Qg_Q1+Qg_Q2)*Fsw*'Design Regulator'!$G$80, (Qg_Q1+Qg_Q2)*Fsw*Vout, (Qg_Q1+Qg_Q2)*Fsw*Vin)","v":6.1485999999999985E-2},8.6317369090909091E-2,7.6857499999999981E-2,6.1558599999999984E-2,0.47559885881937602,0.34561207811616301,4.6400000000000006,0.90702968079691471,2.9170222668737864,1.272732398868659,null,90.702968079691473,0.12736037779467785,0.28180326371616304,0.19446815112491911,8.4848826591243931E-2,2.5856388226733274E-3,0.34336186371616301,6.7298925288367952]
["Dmax",{"$f":"D1_Vinmin","v":0.60606060606060608},"index",null,null,null,59,33,1,0.23600000000000002,0.23600000000000002,0.15892255892255894,0.60704013246813149,0.38689780844426142,0.42944890422213072,4.2551095777869308E-2,0,0.26109415833165317,6.8170159514914369E-3,0.12,0.12756828835116812,0.1116877769270853,2.4948319029828734E-5,2.4948319029828734E-5,0.12752048519191359,1.6261474143581052E-5,1.6261474143581052E-5,0.20342571779966093,9.931685438953747E-4,1.0116612000000001E-2,1.9290150000000006E-2,0,3.0576923683148047E-2,0.16367081857376745,4.8218646334692778E-4,2.2890112000000002E-3,2.8557248785799874E-3,2.2890112000000002E-3,0.25291529999999995,2.6586362210816606E-3,7.2600000000000003E-5,{"$f":"CHOOSE(Ext_VCC, (Qg_Q1+Qg_Q2)*Fsw*'Design Regulator'!$G$80, (Qg_Q1+Qg_Q2)*Fsw*Vout, (Qg_Q1+Qg_Q2)*Fsw*Vin)","v":6.1485999999999985E-2},8.6317369090909091E-2,7.6857499999999981E-2,6.1558599999999984E-2,0.48046369412715112,0.35019555976172795,4.7200000000000006,0.90761137421846916,2.9625153252472201,1.2947666081786995,null,90.761137421846911,0.12756828835116812,0.28634794856172796,0.19750102168314801,8.6317773878579973E-2,2.6586362210816606E-3,0.34790654856172792,6.8189683518098674]
["Dprime",{"$f":"1-B68","v":0.39393939393939392},"index",null,null,null,60,33,1,0.24,0.24,0.1616161616161616,0.60705673062707377,0.38689359195363848,0.43344679597681923,4.655320402318075E-2,0,0.26471472876393881,7.0073887624565699E-3,0.12,0.12777975983495318,0.11168655973108721,2.4947775249131421E-5,2.4947775249131421E-5,0.12928783786338524,1.671534501938899E-5,1.671534501938899E-5,0.20624942454149495,1.0209318029687476E-3,1.028808E-2,1.9290150000000006E-2,0,3.0781124538530397E-2,0.16593692325961659,4.9563112501562184E-4,2.3278079999999998E-3,2.9103260289505637E-3,2.3278079999999998E-3,0.25720199999999993,2.7328816173580622E-3,7.2600000000000003E-5,{"$f":"CHOOSE(Ext_VCC, (Qg_Q1+Qg_Q2)*Fsw*'Design Regulator'!$G$80, (Qg_Q1+Qg_Q2)*Fsw*Vout, (Qg_Q1+Qg_Q2)*Fsw*Vin)","v":6.1485999999999985E-2},8.6317369090909091E-2,7.6857499999999981E-2,6.1558599999999984E-2,0.48533416314006067,0.35477985856748084,4.8,0.90817341947368579,3.0080166680779556,1.3168047904342581,null,90.817341947368575,0.12777975983495318,0.29089345056748089,0.20053444453853037,8.7786986028950548E-2,2.7328816173580622E-3,0.35245205056748086,6.9080601911226251]
["Ipp",{"$f":"Iripple_Vinnom","v":0.38803782623784761},"A",null,null,null,61,33,1,0.24400000000000002,0.24400000000000002,0.16430976430976435,0.60707332865326313,0.38688937456934236,0.43744468728467123,5.0555312715328843E-2,0,0.26834607446272574,7.2009615679554748E-3,0.12,0.1279947925713274,0.11168534227710789,2.4947231359109486E-5,2.4947231359109486E-5,0.1310604266893301,1.717683544398927E-5,1.717683544398927E-5,0.20908160389099159,1.0491628100551082E-3,1.0459548000000001E-2,1.9290150000000006E-2,0,3.0985877771027157E-2,0.16820968638555045,5.0930097469065422E-4,2.3666048000000003E-3,2.965192013655703E-3,2.3666048000000003E-3,0.26148869999999996,2.8083750115026349E-3,7.2600000000000003E-5,{"$f":"CHOOSE(Ext_VCC, (Qg_Q1+Qg_Q2)*Fsw*'Design Regulator'!$G$80, (Qg_Q1+Qg_Q2)*Fsw*Vout, (Qg_Q1+Qg_Q2)*Fsw*Vin)","v":6.1485999999999985E-2},8.6317369090909091E-2,7.6857499999999981E-2,6.1558599999999984E-2,0.49021026623431591,0.35936497458468281,4.8800000000000008,0.90871674628523258,3.0535262965654071,1.3388469452048355,null,90.871674628523252,0.1279947925713274,0.29543976978468284,0.20356841977102713,8.9256463013655696E-2,2.8083750115026349E-3,0.3569983697846828,6.9971680477797831]
["Top FET","Value","Units",null,null,null,62,33,1,0.248,0.248,0.16700336700336701,0.60708992654670124,0.38688515629138387,0.44144257814569193,5.4557421854308064E-2,0,0.27198776384220674,7.3977343679884032E-3,0.12,0.12821338689107847,0.11168412456515046,2.494668735976809E-5,2.494668735976809E-5,0.13283804076074091,1.7645945073152262E-5,1.7645945073152262E-5,0.21192191991566345,1.077861603377781E-3,1.0631015999999998E-2,1.9290150000000006E-2,0,3.1191183460765607E-2,0.17048883699275785,5.2319598370457684E-4,2.4054015999999999E-3,3.0203228040327364E-3,2.4054015999999999E-3,0.26577539999999999,2.8851164035154772E-3,7.2600000000000003E-5,{"$f":"CHOOSE(Ext_VCC, (Qg_Q1+Qg_Q2)*Fsw*'Design Regulator'!$G$80, (Qg_Q1+Qg_Q2)*Fsw*Vout, (Qg_Q1+Qg_Q2)*Fsw*Vin)","v":6.1485999999999985E-2},8.6317369090909091E-2,7.6857499999999981E-2,6.1558599999999984E-2,0.49509200379182516,0.36395090786479828,4.96,0.90924222663014898,3.099044211911484,1.360893072060491,null,90.924222663014902,0.12821338689107847,0.29998690626479835,0.2066029474607656,9.0726204804032734E-2,2.8851164035154772E-3,0.36154550626479831,7.0862919227900472]
["Tr",{"$f":"(Qgd_Q1+Qgs_Q1/2)*(RdsonDRT+Rgate1)/(VCC-Vsp_Q1)*1000000000","v":1.101807639836289},"ns","Turn on of MOSFET -> Rise time of current",null,null,63,33,1,0.252,0.252,0.16969696969696971,0.60710652430738965,0.38688093711977345,0.44544046855988673,5.8559531440113277E-2,0,0.27563938692711565,7.597707162555617E-3,0.12,0.12843554313048872,0.11168290659521794,2.4946143251112352E-5,2.4946143251112352E-5,0.1346204797293048,1.8122673562548165E-5,1.8122673562548165E-5,0.21477005350291509,1.1070282211594804E-3,1.0802484000000001E-2,1.9290150000000006E-2,0,3.1397041688039404E-2,0.17277411769102213,5.3731612339040101E-4,2.4441984E-3,3.0757183714562805E-3,2.4441984E-3,0.27006209999999997,2.9631057933966905E-3,7.2600000000000003E-5,{"$f":"CHOOSE(Ext_VCC, (Qg_Q1+Qg_Q2)*Fsw*'Design Regulator'!$G$80, (Qg_Q1+Qg_Q2)*Fsw*Vout, (Qg_Q1+Qg_Q2)*Fsw*Vin)","v":6.1485999999999985E-2},8.6317369090909091E-2,7.6857499999999981E-2,6.1558599999999984E-2,0.49997937620019473,0.3685376584594956,5.04,0.90975067915449082,3.1445704153205911,1.3829431705718442,null,90.975067915449088,0.12843554313048872,0.30453486005949565,0.20963802768803941,9.2196211371456283E-2,2.9631057933966905E-3,0.36609346005949561,7.1754318171661149]
["Tf",{"$f":"(Qgd_Q1+Qgs_Q1/2)*(RdsonDRT2+Rgate1)/(Vsp_Q1)*1000000000","v":2.616809672386895},"ns","Turn off of MOSFET -> Fall time of current",null,null,64,{"$f":"Vin","v":33},{"$f":"MODE","v":1},0.25600000000000001,{"$f":"Iout*G73/100/Number_of_Phases","v":0.25600000000000001},{"$f":"Vout*K73/(Vin*Efficiency)","v":0.1723905723905724},{"$f":"(Vout+(Rdson2+Rs+Rdcr)*K73)/(Vin+(Rs+Rdson2-Rdson1)*K73)","v":0.60712312193533002},{"$f":"(Vin-(Rdson1+Rdcr)*K73-Vout)*M73/(Fsw*Lf)","v":0.38687671705452181},0.44943835852726088,6.2561641472739099E-2,{"$f":"IF(MIN(Vin, -P73/(Coss_Q1+Coss_Q2)*0.00000002)<0, 0, MIN(Vin, -P73/(Coss_Q1+Coss_Q2)*0.00000002))","v":0},0.27930055409285121,{"$f":"R73^2*Rdcr","v":7.8008799516573711E-3},{"$f":"Core_Loss_Ch1","v":0.12},{"$f":"(T73+S73*(1+Ltc*(Ta-25)))/(1-S73*Ltc*ThetaCa)","v":0.12866126163133629},0.11168168836731343,2.4945599033147426E-5,2.4945599033147426E-5,0.13640755319170161,1.8607020567746904E-5,1.8607020567746904E-5,0.21762570137952339,{"$f":"Rdson1*AB73^2","v":1.1366627016223077E-3},{"$f":"(Vin*K73/2)*Fsw*(Tr_buck+Tf_buck)","v":1.0973952E-2},{"$f":"(0.5*Coss_Q1*(Vin-Q73)^2-0.5*Coss_Q2*(Vin-Q73)^2+(Qoss_Q2*(Vin-Q73)/Vin)*Vin)*Fsw","v":1.9290150000000006E-2},{"$f":"IF(K73>N73/2,0,ABS(K73-N73/2)*Vsd_Q1*Deadtime*Fsw)","v":0},{"$f":"(AF73+AE73+AD73+AC73*(1+RdsonTopTc*Ta-RdsonTopTc*25))/(1-AC73*RdsonTopTc*ThetaJA_Q1)","v":3.160345253330861E-2},{"$f":"SQRT((1-M73))*SQRT(K73^2+(N73^2)/12)","v":0.17506528386760239},{"$f":"Rdson2*AH73^2","v":5.5166136508159576E-4},{"$f":"IF(K73<N73/2,Deadtime*Fsw*IF(VfdSky_Q2>0,0,Vsd_Q2)*(K73+N73/2),2*Deadtime*Fsw*IF(VfdSky_Q2>0,0,Vsd_Q2)*K73)","v":2.4829952000000001E-3},{"$f":"(AJ73+AI73*(1+RdsonBotTc*Ta-RdsonBotTc*25))/(1-AI73*RdsonBotTc*ThetaJA_Q2)","v":3.1313786873382056E-3},{"$f":"2*Deadtime*Fsw*IF(VfdSky_Q2>0,VfdSky_Q2,Vsd_Q2)*K73","v":2.4829952000000001E-3},{"$f":"IF(QrrSky_Q2>0,QrrSky_Q2,Qrr_Q2*K73/(Iout/Number_of_Phases))*Fsw*Vin","v":0.27434879999999995},{"$f":"Rs*R73^2","v":3.0423431811463742E-3},{"$f":"Iq*Vin","v":7.2600000000000003E-5},{"$f":"CHOOSE(Ext_VCC, (Qg_Q1+Qg_Q2)*Fsw*'Design Regulator'!$G$80, (Qg_Q1+Qg_Q2)*Fsw*Vout, (Qg_Q1+Qg_Q2)*Fsw*Vin)","v":6.1485999999999985E-2},{"$f":"(Vin-VCC)*Fsw*(Qg_Q1+Qg_Q2)+(RdsonDRT+RdsonDRT2)*Fsw*Qg_Q1*VCC/(RdsonDRT+2*Rgate1+RdsonDRT2)+(RdsonDRB+RdsonDRB2)*Fsw*Qg_Q2*VCC/(RdsonDRB+2*Rgate2+RdsonDRB2)","v":8.6317369090909091E-2},{"$f":"(Qg_Q1+Qg_Q2)*Fsw*(Vin-VCC)","v":7.6857499999999981E-2},{"$f":"SUM(AO73:AP73)","v":6.1558599999999984E-2},{"$f":" SUM(U73,X73,AA73,AG73,AK73,AL73,AM73,AS73,AN73)","v":0.50487238385273037},{"$f":" SUM(AG73,AK73,AL73,AM73,AS73)","v":0.37312522642064672},{"$f":"Vout*K73","v":5.12},0.9102428731890766,{"$f":"ThetaJA_Q1*BD73","v":3.1901049079996291},{"$f":"ThetaJA_Q2*BE73","v":1.404997240310073},null,91.024287318907653,{"$f":"U73","v":0.12866126163133629},{"$f":"AG73+AK73+AM73","v":0.30908363122064675},{"$f":"AG73+AM73*0.66","v":0.21267366053330861},{"$f":"AK73+AM73*0.33","v":9.3666482687338196E-2},{"$f":"AN73","v":3.0423431811463742E-3},0.37064223122064671,7.2645877319246761]
["Part Power","Value","Units",null,null,null,65,33,1,{"$f":"Iout*G74/100","v":0.26},0.26,0.17508417508417509,0.60713971943052381,0.38687249609563995,{"$f":"K74+N74/2","v":0.45343624804782001},{"$f":"K74-N74/2","v":6.6563751952180034E-2},0,{"$f":"SQRT(K74^2+(N74^2)/12)","v":0.2829708948866283},8.0072527352939241E-3,0.12,0.12889054274089656,{"$f":"N74/SQRT(12)","v":0.11168046988144009},{"$f":"RCoutEsr*V74^2","v":2.4945054705878495E-5},{"$f":"W74","v":2.4945054705878495E-5},{"$f":"SQRT(M74*(1-M74))*SQRT(K74^2+(N74^2)/12)","v":0.13819908011350235},{"$f":"RCinEsr*Y74^2","v":1.9098985744218242E-5},{"$f":"Z74","v":1.9098985744218242E-5},{"$f":"SQRT(M74)*SQRT(K74^2+(N74^2)/12)","v":0.22048857519417298},1.1667650829877553E-3,1.114542E-2,1.9290150000000006E-2,0,3.181041607719981E-2,0.17736210294700153,5.6623168011208974E-4,2.5217920000000001E-3,3.187303723127634E-3,2.5217920000000001E-3,0.27863549999999998,3.1228285667646303E-3,7.2600000000000003E-5,{"$f":"CHOOSE(Ext_VCC, (Qg_Q1+Qg_Q2)*Fsw*'Design Regulator'!$G$80, (Qg_Q1+Qg_Q2)*Fsw*Vout, (Qg_Q1+Qg_Q2)*Fsw*Vin)","v":6.1485999999999985E-2},8.6317369090909091E-2,7.6857499999999981E-2,6.1558599999999984E-2,0.50977102714843869,0.37771361180032742,5.2,{"$f":"AV74/(AV74+AT74)","v":0.91071953240775971},3.2356476911579972,1.4270552808469144,null,{"$f":"AW74*100","v":91.071953240775969},0.12889054274089656,0.31363321980032743,0.21570984607719981,9.5137018723127631E-2,3.1228285667646303E-3,{"$f":"BC74+AS74","v":0.3751918198003274},7.3537596680864175]
["Power Dis",{"$f":"AS9","v":6.1558599999999984E-2},"W",null,null,null,66,33,1,0.26400000000000001,0.26400000000000001,0.17777777777777778,0.60715631679297266,0.38686827424313847,0.45743413712156922,7.056586287843078E-2,0,0.28665005692421441,8.2168255134655362E-3,0.12,0.12912338681194341,0.11167925113760098,2.4944510269310699E-5,2.4944510269310699E-5,0.13999488829000747,1.9598568747331672E-5,1.9598568747331672E-5,0.22335840065881252,1.1973354034767029E-3,1.1316888000000001E-2,1.9290150000000006E-2,0,3.2017932400506099E-2,0.17966435369820233,5.8102703981626944E-4,2.5605888000000002E-3,3.2434934503109171E-3,2.5605888000000002E-3,0.28292219999999996,3.2045619502515592E-3,7.2600000000000003E-5,{"$f":"CHOOSE(Ext_VCC, (Qg_Q1+Qg_Q2)*Fsw*'Design Regulator'!$G$80, (Qg_Q1+Qg_Q2)*Fsw*Vout, (Qg_Q1+Qg_Q2)*Fsw*Vin)","v":6.1485999999999985E-2},8.6317369090909091E-2,7.6857499999999981E-2,6.1558599999999984E-2,0.51467530649202853,0.38230281465081695,5.28,0.91118133816481217,3.281198766007591,1.4491172917546635,null,91.118133816481219,0.12912338681194341,0.31818362585081694,0.21874658440050607,9.6607819450310897E-2,3.2045619502515592E-3,0.37974222585081691,{"$f":"BG75*$B$63","v":7.4429476266760117}]
["Temp rise",{"$f":"B75*B62","v":1.8467579999999995},"°C",null,null,null,67,33,1,0.26800000000000002,0.26800000000000002,0.18047138047138048,0.60717291402267826,0.38686405149702802,0.46143202574851405,7.4567974251486008E-2,0,0.2903377048571622,8.4295982861724624E-3,0.12,0.12935979420275059,0.11167803213579919,2.4943965723449192E-5,2.4943965723449192E-5,0.14179481384153825,2.0105769232356487E-5,2.0105769232356487E-5,0.22623491674487184,1.2283737013094181E-3,1.1488356000000002E-2,1.9290150000000006E-2,0,3.2226001584187237E-2,0.18197182558617567,5.9604741552897965E-4,2.5993856000000003E-3,3.2999478404116254E-3,2.5993856000000003E-3,0.28720889999999999,3.2875433316072603E-3,7.2600000000000003E-5,{"$f":"CHOOSE(Ext_VCC, (Qg_Q1+Qg_Q2)*Fsw*'Design Regulator'!$G$80, (Qg_Q1+Qg_Q2)*Fsw*Vout, (Qg_Q1+Qg_Q2)*Fsw*Vin)","v":6.1485999999999985E-2},8.6317369090909091E-2,7.6857499999999981E-2,6.1558599999999984E-2,0.51958522229391257,0.38689283502459881,5.36,0.91162893254378297,3.3267581337628087,1.4711832726061744,null,91.162893254378304,0.12935979420275059,0.32273484942459885,0.22178387558418725,9.8078884840411634E-2,3.2875433316072603E-3,0.38429344942459881,7.5321516087221374]
["Current (switching)",{"$f":"(Qg_Q1+Qg_Q2)*Fsw+Iq","v":3.0764999999999994E-3},"A",null,null,null,68,33,1,0.27200000000000002,0.27200000000000002,0.18316498316498317,0.60718951111964214,0.38685982785731921,0.46542991392865962,7.8570086071340417E-2,0,0.2940335194057806,8.645571053414956E-3,0.12,0.12959976527709316,0.11167681287603777,2.4943421068299109E-5,2.4943421068299109E-5,0.14359870074085551,2.0620586854461781E-5,2.0620586854461781E-5,0.22911787493063818,1.2598800147055574E-3,1.1659824000000001E-2,1.9290150000000006E-2,0,3.2434623709369607E-2,0.18428431816467181,6.1129277858552379E-4,2.6381824000000003E-3,3.3566668649905327E-3,2.6381824000000003E-3,0.29149559999999997,3.3717727108318325E-3,7.2600000000000003E-5,{"$f":"CHOOSE(Ext_VCC, (Qg_Q1+Qg_Q2)*Fsw*'Design Regulator'!$G$80, (Qg_Q1+Qg_Q2)*Fsw*Vout, (Qg_Q1+Qg_Q2)*Fsw*Vin)","v":6.1485999999999985E-2},8.6317369090909091E-2,7.6857499999999981E-2,6.1558599999999984E-2,0.52450077497020775,0.3914836729743601,5.44,0.91206292114651832,3.3723257956405437,1.4932532229748579,null,91.206292114651831,0.12959976527709316,0.32728689057436011,0.22482171970936959,9.9550214864990522E-2,3.3717727108318325E-3,0.38884549057436008,7.6213716152574582]
["Qrr Current",{"$f":"Qrr_Q2*Fsw","v":1.2989999999999998E-2},"A",null,null,null,69,33,1,0.27600000000000002,0.27600000000000002,0.18585858585858589,0.60720610808386588,0.38685560332402308,0.46942780166201159,8.2572198337988484E-2,0,0.29773719645340391,8.864743815193284E-3,0.12,0.12984330040424885,0.11167559335831991,2.4942876303865652E-5,2.4942876303865652E-5,0.14540640037053537,2.114302126871643E-5,2.114302126871643E-5,0.232007038496336,1.291854381884168E-3,1.1831292000000002E-2,1.9290150000000006E-2,0,3.2643798857346404E-2,0.18660164050750597,6.2676310032166484E-4,2.6769792E-3,3.413650495645603E-3,2.6769792E-3,0.2957823,3.4572500879253808E-3,7.2600000000000003E-5,{"$f":"CHOOSE(Ext_VCC, (Qg_Q1+Qg_Q2)*Fsw*'Design Regulator'!$G$80, (Qg_Q1+Qg_Q2)*Fsw*Vout, (Qg_Q1+Qg_Q2)*Fsw*Vin)","v":6.1485999999999985E-2},8.6317369090909091E-2,7.6857499999999981E-2,6.1558599999999984E-2,0.52942196494273885,0.39607532855299199,5.5200000000000005,0.91248387564781974,3.417901752860196,1.5153271424346839,null,91.248387564781979,0.12984330040424885,0.33183974935299199,0.22786011685734642,0.1010218094956456,3.4572500879253808E-3,0.39339834935299195,7.7106076473186427]
["Diode Current",{"$f":"Deadtime*Fsw*(Iripple_Vinnom/2)*(Vsd_Q2)/Vin","v":2.8512549123076756E-5},null,null,null,null,70,33,1,0.28000000000000003,0.28000000000000003,0.18855218855218858,0.60722270491535091,0.38685137789715007,0.47342568894857506,8.657431105142499E-2,0,0.30144844619781502,9.0871165715076981E-3,0.12,0.13009039995899938,0.11167437358264863,2.4942331430153944E-5,2.4942331430153944E-5,0.1472177711082773,2.167307213008913E-5,2.167307213008913E-5,0.23490218186368586,1.3242968410636835E-3,1.2002759999999999E-2,1.9290150000000006E-2,0,3.2853527109577584E-2,0.18892361067573538,6.4245835207362302E-4,2.715776E-3,3.4708987040119746E-3,2.715776E-3,0.30006900000000003,3.5439754628880018E-3,7.2600000000000003E-5,{"$f":"CHOOSE(Ext_VCC, (Qg_Q1+Qg_Q2)*Fsw*'Design Regulator'!$G$80, (Qg_Q1+Qg_Q2)*Fsw*Vout, (Qg_Q1+Qg_Q2)*Fsw*Vin)","v":6.1485999999999985E-2},8.6317369090909091E-2,7.6857499999999981E-2,6.1558599999999984E-2,0.53434879263903723,0.40066780181358957,5.6000000000000005,0.91289233613839604,3.4634860066436643,1.5374050305601799,null,91.289233613839599,0.13009039995899938,0.33639342581358961,0.23089906710957761,0.10249366870401198,3.5439754628880018E-3,0.39795202581358957,7.7998597059463561]
["Total",{"$f":"SUM(B77:B79)","v":1.6095012549123076E-2},"A",null,null,null,71,33,1,0.28400000000000003,0.28400000000000003,0.19124579124579127,0.60723930161409923,0.38684715157671118,0.47742357578835559,9.0576424211644441E-2,0,0.30516699235596334,9.3126893223584584E-3,0.12,0.13034106432163214,0.11167315354902708,2.4941786447169161E-5,2.4941786447169161E-5,0.14903267793825736,2.2210739093448345E-5,2.2210739093448345E-5,0.23780308997693933,1.3572074304619274E-3,1.2174228000000002E-2,1.9290150000000006E-2,0,3.3063808547689998E-2,0.1912500552183039,6.5837850517807726E-4,2.7545728000000001E-3,3.528411461761945E-3,2.7545728000000001E-3,0.30435569999999995,3.6319488357197988E-3,7.2600000000000003E-5,{"$f":"CHOOSE(Ext_VCC, (Qg_Q1+Qg_Q2)*Fsw*'Design Regulator'!$G$80, (Qg_Q1+Qg_Q2)*Fsw*Vout, (Qg_Q1+Qg_Q2)*Fsw*Vin)","v":6.1485999999999985E-2},8.6317369090909091E-2,7.6857499999999981E-2,6.1558599999999984E-2,0.53928125849234443,0.40526109280945183,5.6800000000000006,0.91328881327629885,3.5090785582153496,1.5594868869264291,null,91.328881327629887,0.13034106432163214,0.3409479200094519,0.23393857054768999,0.10396579246176194,3.6319488357197988E-3,0.40250652000945186,7.8891277921852572]
[null,null,null,null,null,null,72,33,1,0.28800000000000003,0.28800000000000003,0.19393939393939397,0.60725589818011205,0.38684292436271683,0.48142146218135845,9.4578537818641617E-2,0,0.30889257141837878,9.5414620677458234E-3,0.12,0.13059529387794139,0.11167193325745831,2.4941241354916447E-5,2.4941241354916447E-5,0.15085099208676883,2.2756021813562394E-5,2.2756021813562394E-5,0.24070955772258937,1.3905861882961099E-3,1.2345696000000001E-2,1.9290150000000006E-2,0,3.3274643253477461E-2,0.1935808087038941,6.7452353097216555E-4,2.7933696000000002E-3,3.5861887406049594E-3,2.7933696000000002E-3,0.30864239999999998,3.7211702064208711E-3,7.2600000000000003E-5,{"$f":"CHOOSE(Ext_VCC, (Qg_Q1+Qg_Q2)*Fsw*'Design Regulator'!$G$80, (Qg_Q1+Qg_Q2)*Fsw*Vout, (Qg_Q1+Qg_Q2)*Fsw*Vin)","v":6.1485999999999985E-2},8.6317369090909091E-2,7.6857499999999981E-2,6.1558599999999984E-2,0.54421936294161311,0.40985520159408234,5.7600000000000007,0.91367379026486251,3.554679408802162,1.5815727111090743,null,91.367379026486248,0.13059529387794139,0.34550323199408239,0.23697862725347746,0.10543818074060496,3.7211702064208711E-3,0.40706183199408236,7.9784119070840145]
[null,null,null,null,null,null,73,33,1,0.29200000000000004,0.29200000000000004,0.19663299663299666,0.60727249461339106,0.38683869625517769,0.48541934812758891,9.858065187241119E-2,0,0.3126249319499334,9.7734348076700499E-3,0.12,0.13085308901922998,0.11167071270794536,2.4940696153400939E-5,2.4940696153400939E-5,0.15267259068051264,2.3308919945099357E-5,2.3308919945099357E-5,0.24362138938515107,1.4244331527828336E-3,1.2517164000000001E-2,1.9290150000000006E-2,0,3.3486031308900738E-2,0.19591571328188331,6.9089340079348395E-4,2.8321664000000002E-3,3.6442305122875943E-3,2.8321664000000002E-3,0.31292910000000002,3.8116395749913192E-3,7.2600000000000003E-5,{"$f":"CHOOSE(Ext_VCC, (Qg_Q1+Qg_Q2)*Fsw*'Design Regulator'!$G$80, (Qg_Q1+Qg_Q2)*Fsw*Vout, (Qg_Q1+Qg_Q2)*Fsw*Vin)","v":6.1485999999999985E-2},8.6317369090909091E-2,7.6857499999999981E-2,6.1558599999999984E-2,0.54916310643150812,0.41445012822118832,5.8400000000000007,0.91404772467325102,3.6002885596335115,1.6036625026843141,null,91.404772467325103,0.13085308901922998,0.35005936182118835,0.24001923730890076,0.10691083351228761,3.8116395749913192E-3,0.41161796182118832,8.0677120516952918]
[null,null,null,null,null,null,74,33,1,0.29600000000000004,0.29600000000000004,0.19932659932659935,0.60728909091393801,0.38683446725410492,0.48941723362705247,0.10258276637294758,0,0.31636383393383316,1.0008607542131398E-2,0.12,0.13111445014231066,0.11166949190049148,2.4940150842627866E-5,2.4940150842627866E-5,0.15449735642601514,2.3869433142627164E-5,2.3869433142627164E-5,0.2465383981365856,1.4587483621380864E-3,1.2688632E-2,1.9290150000000006E-2,0,3.3697972796087744E-2,0.1982546182704463,7.0748808598008681E-4,2.8709632000000003E-3,3.7025367485935433E-3,2.8709632000000003E-3,0.31721580000000005,3.9033569414312448E-3,7.2600000000000003E-5,{"$f":"CHOOSE(Ext_VCC, (Qg_Q1+Qg_Q2)*Fsw*'Design Regulator'!$G$80, (Qg_Q1+Qg_Q2)*Fsw*Vout, (Qg_Q1+Qg_Q2)*Fsw*Vin)","v":6.1485999999999985E-2},8.6317369090909091E-2,7.6857499999999981E-2,6.1558599999999984E-2,0.55411248941240854,0.4190458727446813,5.9200000000000008,0.91441105011403667,3.6459060119413169,1.6257562612289034,null,91.441105011403664,0.13111445014231066,0.35461630954468132,0.24306040079608779,0.10838375074859356,3.9033569414312448E-3,0.41617490954468128,8.1570282270757541]
[null,null,null,null,null,null,75,33,1,0.3,0.3,0.20202020202020202,0.60730568708175425,0.38683023735950889,0.49341511867975441,0.10658488132024554,0,0.32010904815593882,1.0246980271130116E-2,0.12,0.13137937764950777,0.11166827083509966,2.4939605422602337E-5,2.4939605422602337E-5,0.15632517730875448,2.4437561060613527E-5,2.4437561060613527E-5,0.24946040555711152,1.4935318545772453E-3,1.2860099999999999E-2,1.9290150000000006E-2,0,3.3910467797333456E-2,0.20059737976998254,7.2430755787048677E-4,2.90976E-3,3.7611074213436024E-3,2.90976E-3,0.32150249999999991,3.9963223057407453E-3,7.2600000000000003E-5,{"$f":"CHOOSE(Ext_VCC, (Qg_Q1+Qg_Q2)*Fsw*'Design Regulator'!$G$80, (Qg_Q1+Qg_Q2)*Fsw*Vout, (Qg_Q1+Qg_Q2)*Fsw*Vin)","v":6.1485999999999985E-2},8.6317369090909091E-2,7.6857499999999981E-2,6.1558599999999984E-2,0.55906751234040875,0.42364243521867695,6,0.9147641777907356,3.6915317669600012,1.6478539863201536,null,91.476417779073557,0.13137937764950777,0.35917407521867695,0.2461021177973334,0.10985693242134358,3.9963223057407453E-3,0.42073267521867691,8.2463604342860677]
[null,null,null,null,null,null,76,33,1,0.30400000000000005,0.30400000000000005,0.20471380471380476,0.60732228311684155,0.38682600657140043,0.49741300328570026,0.11058699671429983,0,0.32386035562671883,1.0488552994666479E-2,0.12,0.13164787194865862,0.111667049511773,2.493905989332953E-5,2.493905989332953E-5,0.15815594631067798,2.5013303353426054E-5,2.5013303353426054E-5,0.25238724118530304,1.5287836683150798E-3,1.3031568000000002E-2,1.9290150000000006E-2,0,3.4123516395100105E-2,0.20294386030017383,7.4135178780365641E-4,2.9485568000000005E-3,3.81994250239566E-3,2.9485568000000005E-3,0.3257892,4.090535667919927E-3,7.2600000000000003E-5,{"$f":"CHOOSE(Ext_VCC, (Qg_Q1+Qg_Q2)*Fsw*'Design Regulator'!$G$80, (Qg_Q1+Qg_Q2)*Fsw*Vout, (Qg_Q1+Qg_Q2)*Fsw*Vin)","v":6.1485999999999985E-2},8.6317369090909091E-2,7.6857499999999981E-2,6.1558599999999984E-2,0.56402817567732111,0.42823981569749575,6.080000000000001,0.91510749792691515,3.7371658259265015,1.669955677535935,null,91.510749792691513,0.13164787194865862,0.36373265889749579,0.24914438839510011,0.11133037850239566,4.090535667919927E-3,0.42529125889749575,8.3357086743909168]
[null,null,null,null,null,null,77,33,1,0.308,0.308,0.20740740740740743,0.60733887901920136,0.38682177488978997,0.50141088744489504,0.11458911255510501,0,0.32761754703832224,1.0733325712740729E-2,0.12,0.13191993345311523,0.11166582793051454,2.4938514254814562E-5,2.4938514254814562E-5,0.15998956114488247,2.5596659675332087E-5,2.5596659675332087E-5,0.25531874209552119,1.5645038415657425E-3,1.3203036E-2,1.9290150000000006E-2,0,3.4337118672017178E-2,0.20529392845909505,7.5862074711902474E-4,2.9873536000000001E-3,3.8790419636446742E-3,2.9873536000000001E-3,0.33007589999999998,4.1859970279688845E-3,7.2600000000000003E-5,{"$f":"CHOOSE(Ext_VCC, (Qg_Q1+Qg_Q2)*Fsw*'Design Regulator'!$G$80, (Qg_Q1+Qg_Q2)*Fsw*Vout, (Qg_Q1+Qg_Q2)*Fsw*Vin)","v":6.1485999999999985E-2},8.6317369090909091E-2,7.6857499999999981E-2,6.1558599999999984E-2,0.56899447989067609,0.43283801423566182,6.16,0.9154413810873091,3.7828081900802575,1.6920613344546702,null,91.544138108730905,0.13191993345311523,0.36829206063566183,0.25218721267201716,0.11280408896364467,4.1859970279688845E-3,0.4298506606356618,8.4250729484589719]
[null,null,null,null,null,null,78,33,1,0.31200000000000006,0.31200000000000006,0.21010101010101015,0.60735547478883567,0.3868175423146889,0.50540877115734451,0.1185912288426556,0,0.33138042225444064,1.0981298425353139E-2,0.12,0.13219556258174586,0.11166460609132756,2.4937968507062694E-5,2.4937968507062694E-5,0.16182592400631882,2.6187629680498873E-5,2.6187629680498873E-5,0.25825475250086394,1.6006924125427798E-3,1.3374504000000002E-2,1.9290150000000006E-2,0,3.4551274710881479E-2,0.20764745860291403,7.7611440715648014E-4,3.0261504000000006E-3,3.9384057770226657E-3,3.0261504000000006E-3,0.33436260000000001,4.2827063858877235E-3,7.2600000000000003E-5,{"$f":"CHOOSE(Ext_VCC, (Qg_Q1+Qg_Q2)*Fsw*'Design Regulator'!$G$80, (Qg_Q1+Qg_Q2)*Fsw*Vout, (Qg_Q1+Qg_Q2)*Fsw*Vin)","v":6.1485999999999985E-2},8.6317369090909091E-2,7.6857499999999981E-2,6.1558599999999984E-2,0.57396642545372523,0.43743703088790414,6.2400000000000011,0.91576617940034744,3.8284588606632224,1.71417095665534,null,91.576617940034737,0.13219556258174586,0.37285228048790414,0.2552305907108815,0.11427806377702267,4.2827063858877235E-3,0.43441088048790411,8.5144532575629217]
[null,null,null,null,null,null,79,33,1,0.316,0.316,0.21279461279461281,0.60737207042574548,0.38681330884610732,0.50940665442305366,0.12259334557694634,0,0.33514878983078472,1.1232471132503951E-2,0.12,0.13247475975893655,0.11166338399421497,2.4937422650079006E-5,2.4937422650079006E-5,0.16366494133745763,2.6786213022993448E-5,2.6786213022993448E-5,0.26119512337994261,1.6373494194591226E-3,1.3545972E-2,1.9290150000000006E-2,0,3.4765984594657247E-2,0.2100043305448154,7.9383273925636951E-4,3.0649471999999998E-3,3.9980339144987023E-3,3.0649471999999998E-3,0.33864929999999993,4.3806637416765404E-3,7.2600000000000003E-5,{"$f":"CHOOSE(Ext_VCC, (Qg_Q1+Qg_Q2)*Fsw*'Design Regulator'!$G$80, (Qg_Q1+Qg_Q2)*Fsw*Vout, (Qg_Q1+Qg_Q2)*Fsw*Vin)","v":6.1485999999999985E-2},8.6317369090909091E-2,7.6857499999999981E-2,6.1558599999999984E-2,0.57894401284544206,0.44203686570915585,6.32,0.9160822276905739,3.8741178389198581,1.7362845437174801,null,91.608222769057392,0.13247475975893655,0.37741331850915588,0.25827452259465722,0.11575230291449867,4.3806637416765404E-3,0.43897191850915585,8.6038496027794551]
[null,null,null,null,null,null,80,33,1,0.32,0.32,0.21548821548821551,0.60738866592993268,0.38680907448405616,0.51340453724202806,0.12659546275797193,0,0.33892246656416031,1.1486843834193437E-2,0.12,0.13275752541459288,0.11166216163917991,2.4936876683868685E-5,2.4936876683868685E-5,0.16550652360793133,2.7392409356782732E-5,2.7392409356782732E-5,0.26413971212591686,1.6744749005270934E-3,1.3717439999999999E-2,1.9290150000000006E-2,0,3.4981248406476137E-2,0.21236442927188187,8.1177571475949805E-4,3.1037439999999999E-3,4.0579263480788833E-3,3.1037439999999999E-3,0.34293600000000002,4.4798690953354401E-3,7.2600000000000003E-5,{"$f":"CHOOSE(Ext_VCC, (Qg_Q1+Qg_Q2)*Fsw*'Design Regulator'!$G$80, (Qg_Q1+Qg_Q2)*Fsw*Vout, (Qg_Q1+Qg_Q2)*Fsw*Vin)","v":6.1485999999999985E-2},8.6317369090909091E-2,7.6857499999999981E-2,6.1558599999999984E-2,0.58392724255052408,0.44663751875455499,6.4,0.91638984452861028,3.9197851260971421,1.7584020952211836,null,91.638984452861024,0.13275752541459288,0.38197517475455506,0.26131900840647615,0.1172268063480789,4.4798690953354401E-3,0.44353377475455502,8.6932619851892792]
[null,null,null,null,null,null,81,33,1,0.32400000000000001,0.32400000000000001,0.2181818181818182,0.60740526130139905,0.38680483922854608,0.51740241961427302,0.13059758038572697,0,0.34270127706826314,1.1744416530421846E-2,0.12,0.13304385998414153,0.11166093902622551,2.4936330608436901E-5,2.4936330608436901E-5,0.16735058510723361,2.800621833573344E-5,2.800621833573344E-5,0.26708838221632464,1.7120688939584044E-3,1.3888908E-2,1.9290150000000006E-2,0,3.5197066229637419E-2,0.2147276446787533,8.2994330500712858E-4,3.1425407999999999E-3,4.1180830498063238E-3,3.1425407999999999E-3,0.34722269999999994,4.5803224468645197E-3,7.2600000000000003E-5,{"$f":"CHOOSE(Ext_VCC, (Qg_Q1+Qg_Q2)*Fsw*'Design Regulator'!$G$80, (Qg_Q1+Qg_Q2)*Fsw*Vout, (Qg_Q1+Qg_Q2)*Fsw*Vin)","v":6.1485999999999985E-2},8.6317369090909091E-2,7.6857499999999981E-2,6.1558599999999984E-2,0.58891611505939401,0.45123899007944362,6.48,0.91668933320558355,3.9654607234445609,1.7805236107470945,null,91.668933320558352,0.13304385998414153,0.38653784927944368,0.26436404822963738,0.1187015740498063,4.5803224468645197E-3,0.44809644927944364,8.782690405877096]
[null,null,null,null,null,null,82,33,1,0.32800000000000007,0.32800000000000007,0.22087542087542092,0.6074218565401458,0.38680060307958791,0.521400301539794,0.13459969846020611,0,0.34648505337444852,1.2005189221189445E-2,0.12,0.13333376390853202,0.11165971615535485,2.4935784423788824E-5,2.4935784423788824E-5,0.16919704374962402,2.8627639613612185E-5,2.8627639613612185E-5,0.27004100290234884,1.750131437964153E-3,1.4060376000000003E-2,1.9290150000000006E-2,0,3.5413438147607883E-2,0.2170938713169675,8.4833548134098473E-4,3.1813376000000004E-3,4.1785039917611472E-3,3.1813376000000004E-3,0.35150940000000003,4.6820237962638834E-3,7.2600000000000003E-5,{"$f":"CHOOSE(Ext_VCC, (Qg_Q1+Qg_Q2)*Fsw*'Design Regulator'!$G$80, (Qg_Q1+Qg_Q2)*Fsw*Vout, (Qg_Q1+Qg_Q2)*Fsw*Vin)","v":6.1485999999999985E-2},8.6317369090909091E-2,7.6857499999999981E-2,6.1558599999999984E-2,0.59391063086820239,0.455841279739369,6.5600000000000014,0.91698098263828531,4.0111446322141191,1.8026490898764176,null,91.698098263828527,0.13333376390853202,0.39110134213936903,0.26740964214760793,0.12017660599176117,4.6820237962638834E-3,0.452659942139369,8.872134865931633]
[null,null,null,null,null,null,83,33,1,0.33200000000000002,0.33200000000000002,0.22356902356902358,0.6074384516461746,0.38679636603719236,0.5253981830185962,0.13860181698140384,0,0.35027363455584953,1.2269161906496483E-2,0.12,0.13362723763423831,0.11165849302657102,2.4935238129929618E-5,2.4935238129929618E-5,0.17104582089044262,2.9256672844085378E-5,2.9256672844085378E-5,0.27299744891625727,1.7886625707548281E-3,1.4231844000000002E-2,1.9290150000000006E-2,0,3.5630364244022023E-2,0.2194630081589613,8.6695221510324559E-4,3.2201344000000001E-3,4.2391891460604571E-3,3.2201344000000001E-3,0.3557961,4.7849731435336282E-3,7.2600000000000003E-5,{"$f":"CHOOSE(Ext_VCC, (Qg_Q1+Qg_Q2)*Fsw*'Design Regulator'!$G$80, (Qg_Q1+Qg_Q2)*Fsw*Vout, (Qg_Q1+Qg_Q2)*Fsw*Vin)","v":6.1485999999999985E-2},8.6317369090909091E-2,7.6857499999999981E-2,6.1558599999999984E-2,0.59891079047882845,0.46044438779008245,6.6400000000000006,0.91726506821073661,4.0568368536603296,1.8247785321909069,null,91.726506821073656,0.13362723763423831,0.39566565339008247,0.270455790244022,0.12165190214606046,4.7849731435336282E-3,0.45722425339008244,8.9615953664456161]
[null,null,null,null,null,null,84,33,1,0.33600000000000002,0.33600000000000002,0.22626262626262628,0.60745504661948735,0.38679212810137009,0.52939606405068507,0.14260393594931497,0,0.35406686637333384,1.2536334586343227E-2,0.12,0.13392428161326073,0.11165726963987713,2.4934691726864453E-5,2.4934691726864453E-5,0.17289684115309725,2.9893317680719346E-5,2.9893317680719346E-5,0.27595760019583832,1.8276623305403074E-3,1.4403312E-2,1.9290150000000006E-2,0,3.5847844602682068E-2,0.22183495837578462,8.8579347763654962E-4,3.2589312000000001E-3,4.3001384848583421E-3,3.2589312000000001E-3,0.36008279999999998,4.8891704886738583E-3,7.2600000000000003E-5,{"$f":"CHOOSE(Ext_VCC, (Qg_Q1+Qg_Q2)*Fsw*'Design Regulator'!$G$80, (Qg_Q1+Qg_Q2)*Fsw*Vout, (Qg_Q1+Qg_Q2)*Fsw*Vin)","v":6.1485999999999985E-2},8.6317369090909091E-2,7.6857499999999981E-2,6.1558599999999984E-2,0.60391659439888257,0.46504831428754034,6.7200000000000006,0.91754185255731335,4.102537389040231,1.8469119372728751,null,91.754185255731329,0.13392428161326073,0.4002307830875404,0.27350249260268206,0.12312746248485834,4.8891704886738583E-3,0.46178938308754036,9.0510719085157909]
[null,null,null,null,null,null,85,33,1,0.34,0.34,0.228956228956229,0.60747164146008537,0.38678788927213165,0.53339394463606582,0.1466060553639342,0,0.35786460094189149,1.2806707260729924E-2,0.12,0.13422489630312742,0.11165604599527619,2.4934145214598466E-5,2.4934145214598466E-5,0.1747500322660348,3.0537573776980202E-5,3.0537573776980202E-5,0.27892134162473836,1.8671307555298562E-3,1.4574780000000001E-2,1.9290150000000006E-2,0,3.606587930755803E-2,0.22420962912764303,9.0485924028399414E-4,3.2977280000000002E-3,4.3613519803458456E-3,3.2977280000000002E-3,0.36436949999999996,4.9946158316846708E-3,7.2600000000000003E-5,{"$f":"CHOOSE(Ext_VCC, (Qg_Q1+Qg_Q2)*Fsw*'Design Regulator'!$G$80, (Qg_Q1+Qg_Q2)*Fsw*Vout, (Qg_Q1+Qg_Q2)*Fsw*Vin)","v":6.1485999999999985E-2},8.6317369090909091E-2,7.6857499999999981E-2,6.1558599999999984E-2,0.60892804314170756,0.4696530592879038,6.8000000000000007,0.91781158629211146,4.1482462396133704,1.8690493047051877,null,91.781158629211149,0.13422489630312742,0.40479673128790383,0.27654974930755805,0.12460328698034584,4.9946158316846708E-3,0.4663553312879038,9.1405644932429144]
[null,null,null,null,null,null,86,33,1,0.34399999999999997,0.34399999999999997,0.23164983164983163,0.60748823616797032,0.38678364954948813,0.53739182477474401,0.15060817522525591,0,0.36166669641614557,1.3080279929656841E-2,0.12,0.13452908216689635,0.11165482209277143,2.4933598593136877E-5,2.4933598593136877E-5,0.1766053249090582,3.1189440786234013E-5,3.1189440786234013E-5,0.28188856278768276,1.9070678839321288E-3,1.4746247999999997E-2,1.9290150000000006E-2,0,3.6284468442787793E-2,0.22658693136644717,9.2414947438913461E-4,3.3365247999999998E-3,4.4228296047509608E-3,3.3365247999999998E-3,0.36865619999999988,5.101309172566168E-3,7.2600000000000003E-5,{"$f":"CHOOSE(Ext_VCC, (Qg_Q1+Qg_Q2)*Fsw*'Design Regulator'!$G$80, (Qg_Q1+Qg_Q2)*Fsw*Vout, (Qg_Q1+Qg_Q2)*Fsw*Vin)","v":6.1485999999999985E-2},8.6317369090909091E-2,7.6857499999999981E-2,6.1558599999999984E-2,0.61394513722638044,0.47425862284753861,6.879999999999999,0.91807450868880913,4.1939634066418154,1.8911906340712636,null,91.80745086888092,0.13452908216689635,0.40936349804753863,0.27959756044278772,0.12607937560475091,5.101309172566168E-3,0.4709220980475386,9.230073121731758]
[null,null,null,null,null,null,87,33,1,0.34800000000000003,0.34800000000000003,0.23434343434343438,0.60750483074314376,0.38677940893345003,0.54138970446672507,0.15461029553327502,0,0.36547301669376692,1.3357052593124245E-2,0.12,0.13483683967315707,0.11165359793236587,2.4933051862484837E-5,2.4933051862484837E-5,0.17846265256839222,3.1848918361746672E-5,3.1848918361746672E-5,0.28485915773963127,1.9474737539551712E-3,1.4917716000000003E-2,1.9290150000000006E-2,0,3.6503612092677218E-2,0.22896677964960396,9.4366415129598516E-4,3.3753216000000003E-3,4.4845713303386112E-3,3.3753216000000003E-3,0.37294290000000002,5.2092505113184549E-3,7.2600000000000003E-5,{"$f":"CHOOSE(Ext_VCC, (Qg_Q1+Qg_Q2)*Fsw*'Design Regulator'!$G$80, (Qg_Q1+Qg_Q2)*Fsw*Vout, (Qg_Q1+Qg_Q2)*Fsw*Vin)","v":6.1485999999999985E-2},8.6317369090909091E-2,7.6857499999999981E-2,6.1558599999999984E-2,0.61896787717771562,0.47886500502301582,6.9600000000000009,0.91833084831490153,4.2396888913901591,1.9133359249550794,null,91.833084831490154,0.13483683967315707,0.41393108342301588,0.28264592609267725,0.12755572833033862,5.2092505113184549E-3,0.47548968342301584,9.3195977950911111]
[null,null,null,null,null,null,88,33,1,0.35200000000000004,0.35200000000000004,0.23703703703703707,0.60752142518560748,0.38677516742402818,0.54538758371201412,0.15861241628798595,0,0.36928343113565737,1.3637025251132379E-2,0.12,0.13514816929603235,0.11165237351406263,2.4932505022647505E-5,2.4932505022647505E-5,0.18032195139994439,3.2516006156683912E-5,3.2516006156683912E-5,0.28783302478798467,1.9883484038064141E-3,1.5089184000000002E-2,1.9290150000000006E-2,0,3.6723310341700094E-2,0.23134909196433689,9.6340324234901764E-4,3.4141184000000004E-3,4.5465771294106432E-3,3.4141184000000004E-3,0.37722959999999994,5.3184398479416278E-3,7.2600000000000003E-5,{"$f":"CHOOSE(Ext_VCC, (Qg_Q1+Qg_Q2)*Fsw*'Design Regulator'!$G$80, (Qg_Q1+Qg_Q2)*Fsw*Vout, (Qg_Q1+Qg_Q2)*Fsw*Vin)","v":6.1485999999999985E-2},8.6317369090909091E-2,7.6857499999999981E-2,6.1558599999999984E-2,0.62399626352626403,0.48347220587111067,7.0400000000000009,0.91858082362384164,4.2854226951255008,1.9354851769411592,null,91.858082362384167,0.13514816929603235,0.41849948747111065,0.28569484634170006,0.12903234512941061,5.3184398479416278E-3,0.48005808747111062,9.4091385144337689]
[null,null,null,null,null,null,89,33,1,0.35600000000000004,0.35600000000000004,0.23973063973063977,0.60753801949536268,0.38677092502123289,0.54938546251061648,0.16261453748938359,0,0.37309781430184635,1.3920197903681503E-2,0.12,0.13546307151518022,0.1116511488378647,2.4931958073630033E-5,2.4931958073630033E-5,0.18218316010024463,3.3190703824111364E-5,3.3190703824111364E-5,0.29081006628702105,2.0296918716926778E-3,1.5260652000000003E-2,1.9290150000000006E-2,0,3.6943563274498312E-2,0.23373378956187194,9.8336671889316164E-4,3.4529152000000005E-3,4.6088469743058007E-3,3.4529152000000005E-3,0.38151630000000003,5.4288771824357865E-3,7.2600000000000003E-5,{"$f":"CHOOSE(Ext_VCC, (Qg_Q1+Qg_Q2)*Fsw*'Design Regulator'!$G$80, (Qg_Q1+Qg_Q2)*Fsw*Vout, (Qg_Q1+Qg_Q2)*Fsw*Vin)","v":6.1485999999999985E-2},8.6317369090909091E-2,7.6857499999999981E-2,6.1558599999999984E-2,0.6290302968083179,0.48808022544880408,7.120000000000001,0.9188246435083105,4.3311648191174754,1.957638389614587,null,91.882464350831043,0.13546307151518022,0.42306871024880416,0.28874432127449834,0.13050922597430581,5.4288771824357865E-3,0.48462731024880412,9.4986952808765608]
[null,null,null,null,null,null,90,33,1,0.36,0.36,0.2424242424242424,0.60755461367241126,0.38676668172507539,0.55338334086253771,0.16661665913746229,0,0.37691604570211495,1.4206570550771881E-2,0.12,0.13578154681579557,0.1116499239037753,2.4931411015437633E-5,2.4931411015437633E-5,0.18404621978458177,3.387301101699458E-5,3.387301101699458E-5,0.29379018844379512,2.0715041958201757E-3,1.5432120000000001E-2,1.9290150000000006E-2,0,3.7164370975881926E-2,0.23612079680087092,1.003554552273807E-3,3.4917119999999997E-3,4.6713808373997244E-3,3.4917119999999997E-3,0.38580299999999995,5.5405625148010331E-3,7.2600000000000003E-5,{"$f":"CHOOSE(Ext_VCC, (Qg_Q1+Qg_Q2)*Fsw*'Design Regulator'!$G$80, (Qg_Q1+Qg_Q2)*Fsw*Vout, (Qg_Q1+Qg_Q2)*Fsw*Vin)","v":6.1485999999999985E-2},8.6317369090909091E-2,7.6857499999999981E-2,6.1558599999999984E-2,0.63406997756591077,0.49268906381328154,7.1999999999999993,0.91906250781756227,4.376915264638229,1.9797955625609958,null,91.906250781756228,0.13578154681579557,0.42763875181328159,0.29179435097588191,0.13198637083739972,5.5405625148010331E-3,0.48919735181328156,9.5882680955403199]
[null,null,null,null,null,null,91,33,1,0.36399999999999999,0.36399999999999999,0.2451178451178451,0.60757120771675477,0.38676243753556627,0.55738121876778313,0.17061878123221685,0,0.38073800956042952,1.4496143192403775E-2,0.12,0.13610359568861238,0.11164869871179751,2.4930863848075473E-5,2.4930863848075473E-5,0.18591107387188896,3.4562927388198955E-5,3.4562927388198955E-5,0.29677330113478489,2.1137854143945052E-3,1.5603588E-2,1.9290150000000006E-2,0,3.7385733530829156E-2,0.23851004099953524,1.0239667138367996E-3,3.5305087999999997E-3,4.7341786911049288E-3,3.5305087999999997E-3,0.39008969999999998,5.653495845037472E-3,7.2600000000000003E-5,{"$f":"CHOOSE(Ext_VCC, (Qg_Q1+Qg_Q2)*Fsw*'Design Regulator'!$G$80, (Qg_Q1+Qg_Q2)*Fsw*Vout, (Qg_Q1+Qg_Q2)*Fsw*Vin)","v":6.1485999999999985E-2},8.6317369090909091E-2,7.6857499999999981E-2,6.1558599999999984E-2,0.63911530634682023,0.49729872102193401,7.2799999999999994,0.91929460784153527,4.422674032962437,2.0019566953665739,null,91.929460784153534,0.13610359568861238,0.43220961222193405,0.29484493553082913,0.13346377969110493,5.653495845037472E-3,0.49376821222193401,9.6778569595499064]
[null,null,null,null,null,null,92,33,1,0.36800000000000005,0.36800000000000005,0.24781144781144787,0.60758780162839476,0.3867581924527162,0.56137909622635818,0.17462090377364195,0,0.38456359459233058,1.4788915828577441E-2,0.12,0.13642921862990529,0.1116474732619344,2.4930316571548716E-5,2.4930316571548716E-5,0.18777766797595979,3.5260452590489796E-5,3.5260452590489796E-5,0.29975931773262254,2.1565355656206564E-3,1.5775056000000003E-2,1.9290150000000006E-2,0,3.7607651024486516E-2,0.24090145229584448,1.0446031749284464E-3,3.5693056000000003E-3,4.7972405078707935E-3,3.5693056000000003E-3,0.39437639999999996,5.7676771731452019E-3,7.2600000000000003E-5,{"$f":"CHOOSE(Ext_VCC, (Qg_Q1+Qg_Q2)*Fsw*'Design Regulator'!$G$80, (Qg_Q1+Qg_Q2)*Fsw*Vout, (Qg_Q1+Qg_Q2)*Fsw*Vin)","v":6.1485999999999985E-2},8.6317369090909091E-2,7.6857499999999981E-2,6.1558599999999984E-2,0.64416628370456974,0.50190919713235727,7.3600000000000012,0.9195211267641944,4.4684411253672964,2.0241217876180615,null,91.952112676419446,0.13642921862990529,0.43678129153235729,0.29789607502448645,0.13494145250787076,5.7676771731452019E-3,0.49833989153235725,9.7674618740342023]
[null,null,null,null,null,null,93,33,1,0.37200000000000005,0.37200000000000005,0.25050505050505056,0.60760439540733269,0.38675394647653549,0.56537697323826785,0.17862302676173231,0,0.38839269379447816,1.5084888459293129E-2,0.12,0.13675841614149156,0.11164624755418895,2.4929769185862483E-5,2.4929769185862483E-5,0.18964594980260524,3.5965586276532264E-5,3.5965586276532264E-5,0.30274815494228613,2.1997546877030039E-3,1.5946524000000004E-2,1.9290150000000006E-2,0,3.7830123542168859E-2,0.24329496351542662,1.0654639068955099E-3,3.6081024000000003E-3,4.8605662601835407E-3,3.6081024000000003E-3,0.39866309999999999,5.8831064991243199E-3,7.2600000000000003E-5,{"$f":"CHOOSE(Ext_VCC, (Qg_Q1+Qg_Q2)*Fsw*'Design Regulator'!$G$80, (Qg_Q1+Qg_Q2)*Fsw*Vout, (Qg_Q1+Qg_Q2)*Fsw*Vin)","v":6.1485999999999985E-2},8.6317369090909091E-2,7.6857499999999981E-2,6.1558599999999984E-2,0.6492229101984307,0.5065204922023524,7.4400000000000013,0.91974224008836158,4.514216543132533,2.046290838902753,null,91.97422400883616,0.13675841614149156,0.4413537898023524,0.30094776954216884,0.13641938926018354,5.8831064991243199E-3,0.50291238980235242,9.8570828401261075]
[null,null,null,null,null,null,94,33,1,0.376,0.376,0.2531986531986532,0.60762098905357032,0.38674969960703554,0.56937484980351782,0.18262515019648223,0,0.39222520424561069,1.5384061084551101E-2,0.12,0.1370911887307332,0.11164502158856444,2.4929221691022044E-5,2.4929221691022044E-5,0.1915158690523881,3.667832809889147E-5,3.667832809889147E-5,0.30573973264617538,2.2434428188453153E-3,1.6117992000000001E-2,1.9290150000000006E-2,0,3.8053151169359409E-2,0.2456905100465954,1.0865488810852114E-3,3.6468992E-3,4.9241559205662304E-3,3.6468992E-3,0.40294979999999997,5.9997838229749294E-3,7.2600000000000003E-5,{"$f":"CHOOSE(Ext_VCC, (Qg_Q1+Qg_Q2)*Fsw*'Design Regulator'!$G$80, (Qg_Q1+Qg_Q2)*Fsw*Vout, (Qg_Q1+Qg_Q2)*Fsw*Vin)","v":6.1485999999999985E-2},8.6317369090909091E-2,7.6857499999999981E-2,6.1558599999999984E-2,0.6542851863934237,0.51113260628992563,7.52,0.91995811603410671,4.5600002875403911,2.0684638488084932,null,91.995811603410672,0.1370911887307332,0.44592710708992561,0.30400001916935943,0.13789758992056622,5.9997838229749294E-3,0.50748570708992558,9.9467198589625418]
[null,null,null,null,null,null,95,33,1,0.38,0.38,0.25589225589225589,0.60763758256710931,0.38674545184422682,0.57337272592211341,0.1866272740778866,0,0.39606102691822159,1.5686433704351625E-2,0.12,0.13742753691053874,0.11164379536506391,2.4928674087032533E-5,2.4928674087032533E-5,0.19338737732859501,3.7398677710032383E-5,3.7398677710032383E-5,0.30873397375752876,2.2875999972507472E-3,1.6289459999999999E-2,1.9290150000000006E-2,0,3.8276733991709923E-2,0.24808802972211652,1.1078580688452318E-3,3.685696E-3,4.988009461578743E-3,3.685696E-3,0.40723649999999995,6.1177091446971334E-3,7.2600000000000003E-5,{"$f":"CHOOSE(Ext_VCC, (Qg_Q1+Qg_Q2)*Fsw*'Design Regulator'!$G$80, (Qg_Q1+Qg_Q2)*Fsw*Vout, (Qg_Q1+Qg_Q2)*Fsw*Vin)","v":6.1485999999999985E-2},8.6317369090909091E-2,7.6857499999999981E-2,6.1558599999999984E-2,0.6593531128603215,0.5157455394532886,7.6,0.92016891591259509,4.6057923598756485,2.0906408169236808,null,92.016891591259508,0.13742753691053874,0.45050124345328862,0.30705282399170991,0.13937605446157872,6.1177091446971334E-3,0.51205984345328859,10.036372931684458]
[null,null,null,null,null,null,96,33,1,0.38400000000000006,0.38400000000000006,{"$f":"Vout*K105/(Vin*Efficiency)","v":0.25858585858585864},0.60765417594795113,{"$f":"(Vin-(Rdson1+Rdcr)*K105-Vout)*M105/(Fsw*Lf)","v":0.38674120318811994},0.57737060159406006,0.19062939840594009,{"$f":"IF(MIN(Vin, -P105/(Coss_Q1+Coss_Q2)*0.00000002)<0, 0, MIN(Vin, -P105/(Coss_Q1+Coss_Q2)*0.00000002))","v":0},0.39990006650030657,{"$f":"R105^2*Rdcr","v":1.5992006318694962E-2},0.12,{"$f":"(T105+S105*(1+Ltc*(Ta-25)))/(1-S105*Ltc*ThetaCa)","v":0.13776746119936531},0.11164256888369041,2.4928126373899117E-5,2.4928126373899117E-5,0.19526042805012986,3.8126634762319937E-5,3.8126634762319937E-5,0.31173080408167902,{"$f":"Rdson1*AB105^2","v":2.3322262611218439E-3},1.6460928000000003E-2,1.9290150000000006E-2,0,{"$f":"(AF105+AE105+AD105+AC105*(1+RdsonTopTc*Ta-RdsonTopTc*25))/(1-AC105*RdsonTopTc*ThetaJA_Q1)","v":3.8500872095040668E-2},0.25048746270729694,{"$f":"Rdson2*AH105^2","v":1.1293914415237104E-3},3.7244928000000005E-3,{"$f":"(AJ105+AI105*(1+RdsonBotTc*Ta-RdsonBotTc*25))/(1-AI105*RdsonBotTc*ThetaJA_Q2)","v":5.0521268558177679E-3},3.7244928000000005E-3,0.41152320000000003,6.2368824642910353E-3,7.2600000000000003E-5,{"$f":"CHOOSE(Ext_VCC, (Qg_Q1+Qg_Q2)*Fsw*'Design Regulator'!$G$80, (Qg_Q1+Qg_Q2)*Fsw*Vout, (Qg_Q1+Qg_Q2)*Fsw*Vin)","v":6.1485999999999985E-2},8.6317369090909091E-2,7.6857499999999981E-2,6.1558599999999984E-2,{"$f":" SUM(U105,X105,AA105,AG105,AK105,AL105,AM105,AS105,AN105)","v":0.66442669017565104},0.52035929175085849,7.6800000000000015,0.92037479447714288,4.6515927614256105,2.1128217428372666,null,92.03747944771429,0.13776746119936531,0.45507619895085849,0.3101061840950407,0.14085478285581779,6.2368824642910353E-3,0.51663479895085851,10.126042059436827]
[null,null,null,null,null,null,97,33,1,0.38800000000000007,0.38800000000000007,{"$f":"Vout*K106/(Vin*Efficiency)","v":0.26127946127946133},0.6076707691960973,{"$f":"(Vin-(Rdson1+Rdcr)*K106-Vout)*M106/(Fsw*Lf)","v":0.3867369536387254},0.58136847681936277,0.19463152318063737,{"$f":"IF(MIN(Vin, -P106/(Coss_Q1+Coss_Q2)*0.00000002)<0, 0, MIN(Vin, -P106/(Coss_Q1+Coss_Q2)*0.00000002))","v":0},0.40374223122657543,{"$f":"R106^2*Rdcr","v":1.630077892758135E-2},0.12,{"$f":"(T106+S106*(1+Ltc*(Ta-25)))/(1-S106*Ltc*ThetaCa)","v":0.13811096212122057},0.11164134214444697,2.4927578551626946E-5,2.4927578551626946E-5,0.19713497636903221,3.8862198908018889E-5,3.8862198908018889E-5,0.31473015218467537,{"$f":"Rdson1*AB106^2","v":2.3773216486605341E-3},1.6632396000000004E-2,1.9290150000000006E-2,0,{"$f":"(AF106+AE106+AD106+AC106*(1+RdsonTopTc*Ta-RdsonTopTc*25))/(1-AC106*RdsonTopTc*ThetaJA_Q1)","v":3.8725565565340528E-2},0.25288875139401629,{"$f":"Rdson2*AH106^2","v":1.1511489704692421E-3},3.7632896000000006E-3,{"$f":"(AJ106+AI106*(1+RdsonBotTc*Ta-RdsonBotTc*25))/(1-AI106*RdsonBotTc*ThetaJA_Q2)","v":5.1165080759167786E-3},3.7632896000000006E-3,0.41580990000000001,6.3573037817567261E-3,7.2600000000000003E-5,{"$f":"CHOOSE(Ext_VCC, (Qg_Q1+Qg_Q2)*Fsw*'Design Regulator'!$G$80, (Qg_Q1+Qg_Q2)*Fsw*Vout, (Qg_Q1+Qg_Q2)*Fsw*Vin)","v":6.1485999999999985E-2},8.6317369090909091E-2,7.6857499999999981E-2,6.1558599999999984E-2,0.66950591892169431,0.52497386324125728,7.7600000000000016,0.92057590025307945,4.6974014934801076,2.1350066261387517,null,92.057590025307945,0.13811096212122057,0.45965197364125732,0.31316009956534052,0.14233377507591677,6.3573037817567261E-3,0.52121057364125734,10.215727243368644]
[null,null,null,null,null,null,98,33,1,0.39200000000000002,0.39200000000000002,{"$f":"Vout*K107/(Vin*Efficiency)","v":0.26397306397306397},0.60768736231154963,{"$f":"(Vin-(Rdson1+Rdcr)*K107-Vout)*M107/(Fsw*Lf)","v":0.38673270319605446},0.58536635159802719,0.19863364840197278,{"$f":"IF(MIN(Vin, -P107/(Coss_Q1+Coss_Q2)*0.00000002)<0, 0, MIN(Vin, -P107/(Coss_Q1+Coss_Q2)*0.00000002))","v":0},0.4075874327185649,{"$f":"R107^2*Rdcr","v":1.6612751531011067E-2},0.12,{"$f":"(T107+S107*(1+Ltc*(Ta-25)))/(1-S107*Ltc*ThetaCa)","v":0.13845804020566477},0.11164011514733685,2.4927030620221264E-5,2.4927030620221264E-5,0.1990109790923455,3.9605369799293981E-5,3.9605369799293981E-5,0.31773194926883375,{"$f":"Rdson1*AB107^2","v":2.422886198068146E-3},1.6803863999999998E-2,1.9290150000000006E-2,0,{"$f":"(AF107+AE107+AD107+AC107*(1+RdsonTopTc*Ta-RdsonTopTc*25))/(1-AC107*RdsonTopTc*ThetaJA_Q1)","v":3.8950814488767055E-2},0.25529184030034713,{"$f":"Rdson2*AH107^2","v":1.173130627030883E-3},3.8020864000000002E-3,{"$f":"(AJ107+AI107*(1+RdsonBotTc*Ta-RdsonBotTc*25))/(1-AI107*RdsonBotTc*ThetaJA_Q2)","v":5.1811530945460359E-3},3.8020864000000002E-3,0.42009659999999999,6.4789730970943159E-3,7.2600000000000003E-5,{"$f":"CHOOSE(Ext_VCC, (Qg_Q1+Qg_Q2)*Fsw*'Design Regulator'!$G$80, (Qg_Q1+Qg_Q2)*Fsw*Vout, (Qg_Q1+Qg_Q2)*Fsw*Vin)","v":6.1485999999999985E-2},8.6317369090909091E-2,7.6857499999999981E-2,6.1558599999999984E-2,0.67459079968649172,0.52958925398331302,7.84,0.92077237584789984,4.7432185573315069,2.1571954664181905,null,92.077237584789984,0.13845804020566477,0.4642285675833131,0.31621457048876711,0.14381303109454605,6.4789730970943159E-3,0.52578716758331312,10.305428484632937]
[null,null,null,null,null,null,99,33,1,0.39600000000000002,0.39600000000000002,{"$f":"Vout*K108/(Vin*Efficiency)","v":0.26666666666666666},0.60770395529430954,{"$f":"(Vin-(Rdson1+Rdcr)*K108-Vout)*M108/(Fsw*Lf)","v":0.38672845186011756},0.58936422593005877,0.20263577406994124,{"$f":"IF(MIN(Vin, -P108/(Coss_Q1+Coss_Q2)*0.00000002)<0, 0, MIN(Vin, -P108/(Coss_Q1+Coss_Q2)*0.00000002))","v":0},0.41143558583312118,{"$f":"R108^2*Rdcr","v":1.6927924128984362E-2},0.12,{"$f":"(T108+S108*(1+Ltc*(Ta-25)))/(1-S108*Ltc*ThetaCa)","v":0.13880869598781279},0.11163888789236306,2.4926482579687218E-5,2.4926482579687218E-5,0.20088839460807542,4.0356147088209821E-5,4.0356147088209821E-5,0.3207361290548007,{"$f":"Rdson1*AB108^2","v":2.4689199475453863E-3},1.6975332000000003E-2,1.9290150000000006E-2,0,{"$f":"(AF108+AE108+AD108+AC108*(1+RdsonTopTc*Ta-RdsonTopTc*25))/(1-AC108*RdsonTopTc*ThetaJA_Q1)","v":3.9176618951646577E-2},0.25769667597543017,{"$f":"Rdson2*AH108^2","v":1.1953363825581453E-3},3.8408832000000003E-3,{"$f":"(AJ108+AI108*(1+RdsonBotTc*Ta-RdsonBotTc*25))/(1-AI108*RdsonBotTc*ThetaJA_Q2)","v":5.2460618844125577E-3},3.8408832000000003E-3,0.42438329999999996,6.6018904103039011E-3,7.2600000000000003E-5,{"$f":"CHOOSE(Ext_VCC, (Qg_Q1+Qg_Q2)*Fsw*'Design Regulator'!$G$80, (Qg_Q1+Qg_Q2)*Fsw*Vout, (Qg_Q1+Qg_Q2)*Fsw*Vin)","v":6.1485999999999985E-2},8.6317369090909091E-2,7.6857499999999981E-2,6.1558599999999984E-2,0.67968133306384371,0.53420546403605906,7.92,0.920964358243064,4.7890439542746988,2.1793882632661883,null,92.096435824306397,0.13880869598781279,0.46880598083605912,0.31926959695164658,0.14529255088441256,6.6018904103039011E-3,0.53036458083605909,10.395145784386759]
[null,null,null,null,null,null,100,33,1,0.4,0.4,{"$f":"Vout*K109/(Vin*Efficiency)","v":0.26936026936026936},0.60772054814437859,{"$f":"(Vin-(Rdson1+Rdcr)*K109-Vout)*M109/(Fsw*Lf)","v":0.38672419963092536},0.59336209981546273,0.20663790018453734,{"$f":"IF(MIN(Vin, -P109/(Coss_Q1+Coss_Q2)*0.00000002)<0, 0, MIN(Vin, -P109/(Coss_Q1+Coss_Q2)*0.00000002))","v":0},0.41528660851876142,{"$f":"R109^2*Rdcr","v":1.7246296721501502E-2},0.12,{"$f":"(T109+S109*(1+Ltc*(Ta-25)))/(1-S109*Ltc*ThetaCa)","v":0.13916293000833624},0.11163766037952867,2.4925934430029972E-5,2.4925934430029972E-5,0.20276718281499848,4.1114530426731014E-5,4.1114530426731014E-5,0.32374262766975082,{"$f":"Rdson1*AB109^2","v":2.5154229352923577E-3},1.71468E-2,1.9290150000000006E-2,0,{"$f":"(AF109+AE109+AD109+AC109*(1+RdsonTopTc*Ta-RdsonTopTc*25))/(1-AC109*RdsonTopTc*ThetaJA_Q1)","v":3.940297904047424E-2},0.26010320690929606,{"$f":"Rdson2*AH109^2","v":1.2177662084010014E-3},3.8796799999999999E-3,{"$f":"(AJ109+AI109*(1+RdsonBotTc*Ta-RdsonBotTc*25))/(1-AI109*RdsonBotTc*ThetaJA_Q2)","v":5.3112344182601199E-3},3.8796799999999999E-3,0.42866999999999994,6.7260557213855848E-3,7.2600000000000003E-5,{"$f":"CHOOSE(Ext_VCC, (Qg_Q1+Qg_Q2)*Fsw*'Design Regulator'!$G$80, (Qg_Q1+Qg_Q2)*Fsw*Vout, (Qg_Q1+Qg_Q2)*Fsw*Vin)","v":6.1485999999999985E-2},8.6317369090909091E-2,7.6857499999999981E-2,6.1558599999999984E-2,0.68477751965331302,0.53882249345873434,8,0.9211519790686995,4.834877685607113,2.2015850162739015,null,92.115197906869952,0.13916293000833624,0.47338421345873427,0.3223251790404742,0.1467723344182601,6.7260557213855848E-3,0.53494281345873429,10.484879143791193]

{"sheet":"Bode Plot Management","index":5,"n_rows":6,"n_cols":14,"rows_kept":6,"cut":false,"hidden":true,"merged":[]}
[null,null,null,null,null,null,null,null,null,"Single or dual output (MODE)",null,null,null,"3.3V or 5V fixed (FB1/2)"]
[{"$f":"CHOOSE(BODE_PLOT_TYPE, \"BODE_PLOT_Ch1\", \"BODE_PLOT_Ch2\")","v":"BODE_PLOT_Ch1"},null,null,null,null,null,null,null,null,"With/without dither (DITH)",null,null,null,"With/without VOUT connected to VCCX"]
[null,null,null,null,null,null,null,null,null,"FPWM or DEM (DEMB)"]
[null,null,null,null,null,null,null,null,null,"Shunt or inductor DCR current sensing"]
[]
[null,null,null,null,null,{"$f":"INDIRECT(A2)","v":0}]

{"sheet":"Stability Calculations","index":6,"n_rows":687,"n_cols":38,"rows_kept":687,"cut":false,"hidden":true,"merged":[[9,27,9,28],[9,30,9,31],[10,2,10,3],[10,4,10,5],[10,8,10,9],[10,10,10,11],[10,12,10,13],[10,18,10,19],[10,14,10,15],[10,16,10,17],[9,1,10,1],[1,0,1,3],[1,9,1,11],[9,0,11,0],[9,18,9,19],[1,19,1,21],[10,6,10,7],[1,4,1,6],[9,2,9,7],[9,8,9,13],[9,20,9,22],[9,14,9,17],[1,12,1,14],[1,15,1,18]]}
[]
["Divider Network & EA Poles/Zeros",null,null,null,"Modulator",null,null,null,null,"Power Stage Poles/Zeros",null,null,"Complex Pole Pair",null,null,"Feedback natural frequencies",null,null,null,"Total System"]
[null,"Afb1",{"$f":"Afb","v":0.04},"V/V","Acs",{"$f":"Acs","v":2.5641025641025639},"A/V","gm",{"$f":"gm","v":1.1999999999999999E-3},"z_ESR",{"$f":"Fesr","v":1591549.4327375637},"Hz","p3",{"$f":"Fsw/2","v":216500},"Hz","zterm1",{"$f":"((1/wffHz)+(1/wfftHz))","v":6.7794312749939999E-7},null,null,"Adc",{"$f":"IF(VOUT_setting=1,Am*Afb*AEA,Am*AEA)","v":172401.11450104861},"V/V"]
[null,"EA zero, z1",{"$f":"Fz1_u","v":1019.9624665070261},"Hz","Am",{"$f":"Am","v":56.12015445997676},"V/V",null,null,"p_dom",{"$f":"Fp_dominant","v":145.43423911239387},"Hz","pterm1",{"$f":"Q*pole3","v":131815.47276102245},null,"pterm3",{"$f":"((1/wfbtHz)+(1/wffHz)+(1/wfftHz)+(Afbr/wffHz))","v":5.564272526160965E-6},null,null,"Crossover",{"$f":"AI7","v":12.95725},"kHz"]
[null,"EA pole, p1",{"$f":"Fp1_u","v":0.52883119831639314},"Hz","Q",{"$f":"Q","v":0.60884744924259793},null,null,null,null,null,null,"pterm2",{"$f":"pole3^2","v":46872250000},null,"pterm4",{"$f":"1/(wffHz*wfbtHz)","v":1.746743111690059E-13},null,null,"Phase Margin",{"$f":"AI9","v":76.059461509825638},"°",null,null,null,null,null,null,null,null,null,null,null,"Gain",null,null,"Phase"]
[null,"Aea",{"$f":"AEA","v":76800},"V/V","mc",{"$f":"mc","v":2.6056015779092703},null,null,null,null,null,null,null,null,null,"Afbr",{"$f":"Rfb1_/Rfb2_u","v":23.826086956521738},null,null,"radconv",{"$f":"180/Pi","v":57.295779578552292},null,null,null,null,null,null,null,null,null,null,null,null,"XOVER SEARCH",null,null,"XOVER SEARCH"]
[null,"EA pole, p2",{"$f":"Fp2_u","v":150602.40963855424},"Hz","k",{"$f":"k","v":1.022807292604228},null,null,null,null,null,null,null,null,null,null,null,null,null,"Gain Margin",{"$f":"AL9","v":-23.315836875959597},null,null,null,null,null,null,null,null,null,null,null,null,"xover",{"$f":"SUM(AH12:AH613)/1000","v":12.95725},null,"Phase xover",{"$f":"SUM(AK12:AK613)/1000","v":126.03}]
[]
[null,null,null,null,null,null,null,null,null,null,null,null,null,null,null,null,null,null,null,null,null,null,null,null,null,null,null,null,null,null,null,null,null,"phase margin",{"$f":"SUM(AI13:AI613)","v":76.059461509825638},null,"gain margin",{"$f":"SUM(AL13:AL613)","v":-23.315836875959597}]
["Freq (Hz)",null,"Power Stage",null,null,null,null,null,"Error Amplifier",null,null,null,null,null,"Feedback Gain",null,null,null,"Sampling Double Pole",null,"System Response",null,null,null,null,null,null,"ERROR AMP Response",null,null,"PLANT Response"]
[null,null,"p_dom",null,"z_ESR",null,"z_RHP",null,"p1",null,"z1",null,"p2",null,"z1",null,"p1p2",null,"p3"]
[null,null,"Gain(V/V)","Phase(rad)","Gain(V/V)","Phase(rad)","Gain(V/V)","Phase(rad)","Gain(V/V)","Phase(rad)","Gain(V/V)","Phase(rad)","Gain(V/V)","Phase(rad)","Gain(V/V)","Phase(rad)","Gain(V/V)","Phase(rad)","Gain(V/V)","Phase(rad)","Gain (dB)","Phase (°)","Phase Margin (°)",null,null,"Fsquare",null,"Gain(dB)","Phase(Deg)",null,"Gain(dB)","Phase(Deg)"]
[1,{"$f":"A13/1000","v":1E-3},{"$f":"SQRT(1+(A13/pole1)^2)","v":1.0000236391330475},{"$f":"ATAN(A13/pole1)","v":6.8758515666034982E-3},{"$f":"SQRT(1+(A13/Zero1)^2)","v":1.0000000000001974},{"$f":"ATAN(A13/Zero1)","v":6.2831852999991738E-7},{"$f":"IF(VIN_nom>Vout, 1, SQRT(1+(A13/z_RHP)^2))","v":1},{"$f":"IF(VIN_nom>Vout, 0, -ATAN(A13/z_RHP))","v":0},{"$f":"SQRT(1+(A13/Pole2)^2)","v":2.139097806975347},{"$f":"ATAN(A13/Pole2)","v":1.0843506732671384},{"$f":"SQRT(1+(A13/Zero2)^2)","v":1.0000004806196456},{"$f":"ATAN(A13/Zero2)","v":9.8042792007005885E-4},{"$f":"SQRT(1+(A13/pole4)^2)","v":1.0000000000220448},{"$f":"ATAN(A13/pole4)","v":6.6399999999024141E-6},{"$f":"IF(VOUT_setting=1,1,SQRT(1+(A13*zterm1)^2))","v":1},{"$f":"IF(VOUT_setting=1,0,ATAN(((A13*zterm1))))","v":0},{"$f":"IF(VOUT_setting=1,1,SQRT((1+Afbr-pterm4*(A13)^2)^2+(A13*$Q$4)^2))","v":1},{"$f":"IF(VOUT_setting=1,0,ATAN(A13*$Q$4/(1+Afbr-$Q$5*(A13)^2)))","v":0},{"$f":"SQRT((1-(Z13/pterm2))^2+(A13/pterm1)^2)","v":1.0000000000074418},{"$f":"IF((ATAN((A13/pterm1)/(1-A13^2/pterm2))>0),ATAN((A13/pterm1)/(1-A13^2/pterm2)),PI()+ATAN((A13/pterm1)/(1-A13^2/pterm2)))","v":7.5863628074613113E-6},{"$f":"20*LOG10(((E13*K13*G13*O13)/(C13*I13*S13*M13*Q13))*Adc)","v":98.125987380947862},{"$f":"((F13+L13+H13+P13)-(D13+J13+T13+N13+R13))*radconv","v":-62.467279165690307},{"$f":"IF(V13>0,V13,V13+180)","v":117.53272083430969},null,{"$f":"IF(U13<0,A13,1000000000)","v":1000000000},{"$f":"A13^2","v":1},null,{"$f":"20*LOG10((K13/(I13*M13))*AEA)","v":91.10261572551849},{"$f":"(L13-(J13+N13))*radconv","v":-62.072923223344141},null,{"$f":"20*LOG10((E13*G13/(C13*S13))*Acs*Am)","v":43.160879688340152},{"$f":"(F13+H13-(D13+T13))*radconv","v":-0.39435594234617671},null,{"$f":"SUM((U14<0)*(U13>0))*A13","v":0},{"$f":"IF(AH13>0,W11,0)","v":0},null,{"$f":"SUM((V14<-182)*(V13>-182))*A13","v":0},{"$f":"IF(AK13>0,U13,0)","v":0}]
[1.0965,{"$f":"A14/1000","v":1.0965E-3},1.0000284215512811,7.5393472056602285E-3,1.0000000000002374,6.8895126814489105E-7,1,0,2.3019894258792841,1.1214166738326594,1.0000005778548595,1.0750391446690702E-3,1.0000000000265046,7.2807599998713497E-6,1,0,{"$f":"IF(VOUT_setting=1,1,SQRT((1+Afbr-pterm4*(A14)^2)^2+(A14*$Q$4)^2))","v":1},0,1.0000000000089475,8.3184468183849452E-6,97.488493048934515,-64.623674424135189,115.37632557586481,null,1000000000,1.2023122500000001,null,90.465162931993575,-64.191264510578165,null,43.160838149851699,-0.43240991355702468,null,0,0,null,{"$f":"SUM((V15<-183)*(V14>-183))*A14","v":0},{"$f":"IF(AK14>0,U14,0)","v":0}]
[1.2022999999999999,1.2022999999999999E-3,1.0000341707847185,8.266778297667603E-3,1.0000000000002853,7.5542736861885632E-7,1,0,2.4837112902559291,1.156415447667219,1.0000006947477784,1.1787683200286526E-3,1.0000000000318663,7.9832719998304007E-6,1,0,{"$f":"IF(VOUT_setting=1,1,SQRT((1+Afbr-$Q$5*(A15)^2)^2+(A15*$Q$4)^2))","v":1},0,1.0000000000107574,9.1210840034194714E-6,96.828488386172324,-66.664774372714632,113.33522562728537,null,1000000000,1.4455252899999997,null,89.805208204891045,-66.190643548728133,null,43.160788214192046,-0.47413082398650008,null,0,0,null,0,0]
[1.3183,1.3183000000000001E-3,1.000041082443007,9.0643297142000718E-3,1.0000000000003431,8.2831231809881071E-7,1,0,2.6859506314050923,1.1893021305289453,1.0000008352758905,1.2924978214335207E-3,1.000000000038312,8.7535119997764236E-6,1,0,1,0,1.0000000000129332,1.0001102089092117E-5,96.148491286218814,-68.588312991573517,111.41168700842648,null,1000000000,1.7379148900000001,null,89.125271136598258,-68.068439592100532,null,43.160728182531329,-0.5198733994729684,null,0,0,null,0,0]
[1.4454,1.4454000000000001E-3,1.0000493857956494,9.9381852740700691E-3,1.0000000000004123,9.0817160326175039E-7,1,0,2.9103895693949675,1.2200523185846079,1.0000010041012461,1.4171100211154313E-3,1.0000000000460556,9.5974559997053211E-6,1,0,1,0,1.0000000000155476,1.096532880193026E-5,95.451358647689005,-70.393196495776422,109.60680350422358,null,1000000000,2.0891811599999999,null,88.428210616832985,-69.823204190240446,null,43.160656063766766,-0.56999230553597469,null,0,0,null,0,0]
[1.5849,1.5849E-3,1.0000593782666001,1.0897277513215757E-2,1.0000000000004958,9.9582203819667106E-7,1,0,3.1594190146893415,1.2487441568988773,1.0000012072718991,1.5538794577659801E-3,1.0000000000553744,1.0523735999611501E-5,1,0,1,0,1.0000000000186935,1.202362641358452E-5,94.738151576766612,-72.084342051489813,107.91565794851019,null,1000000000,2.51190801,null,87.71509033471736,-71.459342194437554,null,43.160569274960032,-0.62499985705225203,null,0,0,null,0,0]
[1.7378,1.7378000000000001E-3,1.0000713872681408,1.1948474514725287E-2,1.000000000000596,1.0918919414335663E-6,1,0,3.4349017652834308,1.2753894350911505,1.0000014514460371,1.7037865367775494E-3,1.0000000000665743,1.1538991999487866E-5,1,0,1,0,1.000000000022474,1.318358128686353E-5,94.011907523313425,-73.662763272342062,106.33723672765794,null,1000000000,3.0199488400000001,null,86.988950583338607,-72.977473307478945,null,43.16046497288557,-0.68528996486311777,null,0,0,null,0,0]
[1.9055,1.9055000000000001E-3,1.0000858293744224,1.3101391984885084E-2,1.0000000000007168,1.1972609589144282E-6,1,0,3.7394198018597997,1.3000805999196374,1.0000017450953069,1.8682038268286055E-3,1.0000000000800431,1.2652519999324833E-5,1,0,1,0,1.0000000000270211,1.4455814329699307E-5,93.273986595191815,-75.134230355164433,104.86576964483557,null,1000000000,3.63093025,null,86.251155087936695,-74.382816228674798,null,43.160339540165879,-0.75141412648965045,null,0,0,null,0,0]
[2.0893000000000002,2.0893000000000001E-3,1.0001031848366377,1.4364954913032729E-2,1.0000000000008615,1.3127459047282461E-6,1,0,4.0753805384465851,1.3228889412410871,1.0000020979869204,2.0484058447202197E-3,1.0000000000962292,1.3872951999110008E-5,1,0,1,0,1.0000000000324851,1.5850187813743611E-5,92.526560052600274,-76.5032672605073,103.4967327394927,null,1000000000,4.3651744900000002,null,85.503879278775429,-75.679383036087074,null,43.160188806735619,-0.82388422442021991,null,0,0,null,0,0]
[2.2909000000000002,2.2909000000000002E-3,1.0001240572085488,1.5750833930119272E-2,1.0000000000010361,1.439414920376006E-6,1,0,4.4459281626710618,1.3439303541199012,1.0000025223964124,2.2460592647887013E-3,1.0000000001156959,1.521157599882672E-5,1,0,1,0,1.0000000000390565,1.7379598555771879E-5,91.770496986355397,-77.777088795415892,102.22291120458411,null,1000000000,5.2482228100000006,null,84.747997487108393,-76.87371918112936,null,43.160007532157749,-0.90336961428651175,null,0,0,null,0,0]
[2.5118999999999998,2.5118999999999996E-3,1.0001491450983113,1.7270006588679814E-2,1.0000000000012454,1.5782733155056895E-6,1,0,4.8540327852422873,1.3632962327332714,1.0000030325338458,2.4627327026374439E-3,1.0000000001390947,1.6679015998453356E-5,1,0,1,0,1.0000000000469556,1.905618473627963E-5,91.00747825134556,-78.961471799474666,101.03852820052533,null,1000000000,6.309641609999999,null,83.985196633044339,-77.970971898089275,null,43.159789651211995,-0.99049990138540256,null,0,0,null,0,0]
[2.7542,2.7542000000000001E-3,1.0001793034692261,1.8935505373748565E-2,1.0000000000014975,1.7305148953242725E-6,1,0,5.3032246868876225,1.3810960910846848,1.000003645791093,2.7002888795413919E-3,1.0000000001672236,1.8287887997961224E-5,1,0,1,0,1.0000000000564513,2.0894360444605827E-5,90.238475221293612,-80.063332423520606,99.936667576479394,null,1000000000,7.5856176399999997,null,83.216455512342264,-78.977309873947348,null,43.159527741862114,-1.0860225495732594,null,0,0,null,0,0]
[3.02,3.0200000000000001E-3,1.0002155776604611,2.0762415055943638E-2,1.0000000000018003,1.8975219605977226E-6,1,0,5.7976007000627936,1.3974442527994353,1.0000043834348629,2.9608846147582747E-3,1.0000000002010574,2.0052799997312157E-5,1,0,1,0,1.0000000000678728,2.291081567893321E-5,89.464001155231458,-81.089963359883882,98.910036640116118,null,1000000000,9.1204000000000001,null,82.442296457802456,-79.89916063027502,null,43.15921273033976,-1.1908027296088672,null,0,0,null,0,0]
[3.3113000000000001,3.3113000000000001E-3,1.0002591656640758,2.276443296389432E-2,1.0000000000021645,2.0805511483859983E-6,1,0,6.3408940695700613,1.4124287049747373,1.0000052698413062,3.246480606323134E-3,1.0000000002417146,2.1987031996456938E-5,1,0,1,0,1.0000000000815978,2.5120723164884902E-5,88.685586399014355,-82.047079915512867,97.952920084487133,null,1000000000,10.964707690000001,null,81.664260212442684,-80.741453877565533,null,43.158834219482436,-1.3056260379473281,null,0,0,null,0,0]
[3.6307999999999998,3.6308E-3,1.0003115829448064,2.4960050602316687E-2,1.0000000000026021,2.2812989187200426E-6,1,0,6.9381504054997665,1.4261619521742166,1.0000063358502074,3.5597237968622679E-3,1.0000000002906102,2.4108511995329207E-5,1,0,1,0,1.000000000098104,2.7544566082052089E-5,87.90327625081305,-82.942038057222121,97.057961942777879,null,1000000000,13.182708639999998,null,80.882405225205389,-81.510485021055459,null,43.158379058518406,-1.4315530361666728,null,0,0,null,0,0]
[3.9811000000000001,3.9811000000000004E-3,1.000374594603741,2.7367049780459219E-2,1.0000000000031286,2.5013988997777836E-6,1,0,7.5942383642669835,1.438734015932293,1.0000076173891415,3.903163021952013E-3,1.0000000003493914,2.643450399384267E-5,1,0,1,0,1.0000000001179474,3.0202068973748574E-5,87.117929973140036,-83.780870449794378,96.219129550205622,null,1000000000,15.849157210000001,null,80.097606072303464,-82.211266866371176,null,43.157831933747339,-1.5696035834231956,null,0,0,null,0,0]
[4.3651999999999997,4.3651999999999996E-3,1.0004503469134991,3.0005931684862742E-2,1.0000000000037614,2.7427360471491227E-6,1,0,8.3147826936994331,1.4502367661212812,1.0000091581536954,4.2797391983172969E-3,1.0000000004200629,2.8984927991882996E-5,1,0,1,0,1.0000000001418043,3.3115990928415783E-5,86.329952070124989,-84.569849315864005,95.430150684135995,null,1000000000,19.054971039999998,null,79.310285874408791,-82.848895808682258,null,43.157174228626964,-1.7209535071817541,null,0,0,null,0,0]
[4.7862999999999998,4.7862999999999994E-3,1.0005414008867837,3.2898533011216126E-2,1.0000000000045219,3.0073209801299339E-6,1,0,9.1057908112176271,1.4607541471314185,1.0000110102977817,4.6925892128851371E-3,1.0000000005050169,3.1781031989300023E-5,1,0,1,0,1.0000000001704832,3.6310608307062657E-5,85.539842353233908,-85.314858227985653,94.685141772014347,null,1000000000,22.908667689999998,null,78.520966650539066,-83.428002994307377,null,43.156383735605601,-1.8868552336782904,null,0,0,null,0,0]
[5.2481,5.2481000000000003E-3,1.0006508779636991,3.6070074149252361E-2,1.0000000000054365,3.2974784772810484E-6,1,0,9.9742165048568037,1.4703690984972897,1.0000132374079249,5.1453400086782959E-3,1.0000000006071701,3.4847383985894473E-5,1,0,1,0,1.000000000204968,3.9813990652110054E-5,84.747688916844737,-86.021889367523301,93.978110632476699,null,1000000000,27.542553609999999,null,77.729763553715713,-83.95313410765317,null,43.155433396039783,-2.0687552598701471,null,0,0,null,0,0]
[5.7544000000000004,5.7544000000000007E-3,1.0007824685575928,3.9546395128538546E-2,1.0000000000065361,3.6155961490162457E-6,1,0,10.927208539843226,1.479153424036491,1.0000159146928813,5.6417163735256832E-3,1.0000000007299721,3.8209215981405557E-5,1,0,1,0,1.0000000002464233,4.3654966142269851E-5,83.953961197810287,-86.696326860818857,93.303673139181143,null,1000000000,33.113119360000006,null,76.937177997851876,-84.428191235490189,null,43.154291232869198,-2.268135625328676,null,0,0,null,0,0]
[6.3095999999999997,6.3095999999999994E-3,1.0009406674545178,4.3357367691011915E-2,1.0000000000078584,3.9644385968672308E-6,1,0,11.973050942470039,1.4871780165507418,1.0000191337953319,6.1860310784659809E-3,1.0000000008776266,4.1895743975487442E-5,1,0,1,0,1.0000000002962683,4.7866914773952611E-5,83.158704263149701,-87.343700415462578,92.656299584537422,null,1000000000,39.811052159999996,null,76.143293978915239,-84.856990806534128,null,43.152918317145222,-2.4867096089284582,null,0,0,null,0,0]
[6.9183000000000003,6.9183000000000005E-3,1.0011308108740342,4.753412017206414E-2,1.0000000000094478,4.346896086071622E-6,1,0,13.120410392680338,1.4945052135742374,1.0000230035789186,6.7827926338248799E-3,1.0000000010551275,4.5937511967686708E-5,1,0,1,0,1.0000000003561889,5.2484733816148397E-5,82.362236232938443,-87.969110496611108,92.030889503388892,null,1000000000,47.862874890000008,null,75.348475805152532,-85.242847929832152,null,43.151268460696684,-2.7262625667789737,null,0,0,null,0,0]
[7.5857999999999999,7.5858000000000002E-3,1.0013593909272334,5.211243149980356E-2,1.0000000000113589,4.766298704837907E-6,1,0,14.379278242113466,1.5011956266815731,1.000027656574908,7.437195374311153E-3,1.0000000012685539,5.0369711957402197E-5,1,0,1,0,1.0000000004282374,5.7548630991837148E-5,81.564500333595547,-88.577786389090193,91.422213610909807,null,1000000000,57.544361639999998,null,74.552722858567506,-85.588939795698678,null,43.149285507938814,-2.988846593391508,null,0,0,null,0,0]
[8.3176000000000005,8.3176000000000014E-3,1.0016340977992777,5.7129251143629413E-2,1.0000000000136562,5.2261022050804225E-6,1,0,15.760028072115848,1.5073020085742668,1.0000332499093185,8.1546291206295463E-3,1.0000000015251136,5.5228863943846463E-5,1,0,1,0,1.0000000005148466,6.3100331296591454E-5,80.765768419750842,-89.174563119841253,90.825436880158747,null,1000000000,69.182469760000004,null,73.756373453038677,-85.897982189754799,null,43.146902999622931,-3.2765809300864532,null,0,0,null,0,0]
[9.1201000000000008,9.1201000000000008E-3,1.0019643078129583,6.2627434443540117E-2,1.0000000000164184,5.7303278253902794E-6,1,0,17.274735993601833,1.5128759424966072,1.000039975337909,8.9413652497562258E-3,1.0000000018336033,6.0557463925974422E-5,1,0,1,0,1.0000000006189862,6.9188387452553645E-5,79.965875171160818,-89.76449728404792,90.23550271595208,null,1000000000,83.176224010000013,null,72.959343221943854,-86.172573725603741,null,43.144039982127723,-3.5919235584441891,null,0,0,null,0,0]
[10,0.01,1.002361153721725,6.8651543185147795E-2,1.0000000000197393,6.2831852999173176E-6,1,0,18.936048763685474,1.5179624224809978,1.0000480608212008,9.8039682181141601E-3,1.0000000022044799,6.6399999902415002E-5,1,0,1,0,1.0000000007441865,7.5863628090762833E-5,79.164946983388148,-90.352349156511551,89.647650843488449,null,1000000000,100,null,72.161854556283714,-86.414918804734739,null,43.140600460015193,-3.9374303517768143,null,0,0,null,0,0]
[10.965,1.0964999999999999E-2,1.002838167918785,7.5252527822822241E-2,1.0000000000237326,6.8895126813409956E-6,1,0,20.758505044583618,1.5226046494213907,1.000057783833165,1.0749981472174912E-2,1.0000000026504732,7.2807599871350248E-5,1,0,1,0,1.0000000008947445,8.3184468205140194E-5,78.362764664959371,-90.943087003637459,89.056912996362541,null,1000000000,120.23122499999999,null,71.363804788650526,-86.627063377817493,null,43.136467909219618,-4.3160236258199438,null,0,0,null,0,0]
[12.023,1.2022999999999999E-2,1.0034113183076745,8.2482105653245333E-2,1.0000000000285336,7.5542736860463008E-6,1,0,22.757024790918457,1.5268396974606535,1.0000694723887653,1.178714274055309E-2,1.0000000031866316,7.983271983040167E-5,1,0,1,0,1.0000000010757404,9.1210840062262187E-5,77.559515190232233,-91.541361015954578,88.458638984045422,null,1000000000,144.55252899999999,null,70.565518129095381,-86.810691303083956,null,43.131505094047611,-4.7306697128705961,null,0,0,null,0,0]
[13.183,1.3183E-2,1.0040999240006669,9.0398728089927563E-2,1.000000000034305,8.2831231808005649E-6,1,0,24.948608767515303,1.5307031909613091,1.0000835241358046,1.2924265754868245E-2,1.0000000038311985,8.7535119776423705E-5,1,0,1,0,1.0000000012933328,1.0001102092792166E-4,76.755061450044067,-92.152063360760849,87.847936639239151,null,1000000000,173.79148899999998,null,69.767023165135967,-86.967342140528331,null,43.125546317818852,-5.1847212202324968,null,0,0,null,0,0]
[14.454000000000001,1.4454E-2,1.0049265659865538,9.9059828145385109E-2,1.0000000000412388,9.0817160323703215E-6,1,0,27.350260411270352,1.5342254523478305,1.0001004051344309,1.4170161195847982E-2,1.0000000046055579,9.5974559705322399E-5,1,0,1,0,1.0000000015547403,1.0965328806806994E-4,75.949757530910986,-92.77972425140463,87.22027574859537,null,1000000000,208.91811600000003,null,68.968867109628292,-87.098251846274138,null,43.118398454193461,-5.6814724051304815,null,0,0,null,0,0]
[15.849,1.5848999999999999E-2,1.0059204769254089,0.10854873286052524,1.000000000049583,9.9582203816408286E-6,1,0,29.986544499792849,1.5374418519489685,1.000120719976141,1.5537556626747207E-2,1.0000000055374509,1.0523735961150218E-4,1,0,1,0,1.000000001869328,1.202362642001392E-4,75.142048381386871,-93.430425438992458,86.569574561007542,null,1000000000,251.19080099999999,null,68.169744395490056,-87.204722700993671,null,43.109812018807588,-6.2257027379987893,null,0,0,null,0,0]
[17.378,1.7378000000000001E-2,1.00711367940386,0.11892656099227493,1.0000000000596114,1.0918919413906073E-5,1,0,32.876359496068339,1.5403746414721873,1.0001451341770731,1.7036233502289853E-2,1.0000000066574168,1.1538991948786745E-4,1,0,1,0,1.0000000022474052,1.3183581295339006E-4,74.332817518654352,-94.108391054306779,85.891608945693221,null,1000000000,301.99488400000001,null,67.370810456376574,-87.287473001978583,null,43.099515095188551,-6.8209180523282011,null,0,0,null,0,0]
[19.055,1.9054999999999999E-2,1.0085467820347491,0.13027931390106368,1.0000000000716716,1.1972609588577937E-5,1,0,36.046165475042123,1.5430505651336399,1.000174494458818,1.8679886991033151E-2,1.000000008004313,1.2652519932483512E-4,1,0,1,0,1.0000000027020894,1.4455814340872869E-4,73.52121439395836,-94.819307175240141,85.180692824759859,null,1000000000,363.09302500000001,null,66.571558397251593,-87.347255730798722,null,43.08716402961754,-7.4720514444414317,null,0,{"$f":"IF(AH45>0,W43,0)","v":0},null,0,0]
[20.893000000000001,2.0893000000000002E-2,1.0102663173829869,0.14268320825969022,1.0000000000861651,1.3127459046535914E-5,1,0,39.520534577797882,1.5454903244608851,1.0002097769089309,2.048122279234476E-2,1.0000000096229398,1.3872951911000946E-4,1,0,1,0,1.0000000032485041,1.5850187828472405E-4,72.707449493873654,-95.568008951123616,84.431991048876384,null,1000000000,436.51744900000006,null,65.772590015520564,-87.384533960434695,null,43.072367511263856,-8.1834749906889144,null,0,0,null,0,0]
[22.909000000000002,2.2909000000000002E-2,1.0123304701177578,0.15623756713992687,1.0000000001035958,1.4394149202775887E-5,1,0,43.33160189472769,1.5477164326289761,1.0002522081549006,2.2456854581394212E-2,1.0000000115696022,1.5211575882672078E-4,1,0,1,0,1.0000000039056567,1.7379598575188927E-4,71.890450556714455,-96.360538436107944,83.639461563892056,null,1000000000,524.82228100000009,null,64.973319787123202,-87.399652174878085,null,43.054638802502026,-8.9608862612298505,null,0,0,null,0,0]
[25.119,2.5118999999999999E-2,1.0148060130331737,0.17102988083345025,1.0000000001245475,1.5782733153759537E-5,1,0,47.509614058848129,1.5497464009319846,1.0003032078768899,2.4622399728432789E-2,1.0000000139094787,1.6679015845335723E-4,1,0,1,0,1.0000000046955504,1.905618476187562E-4,71.070143763939456,-97.202029434269804,82.797970565730196,null,1000000000,630.96416099999999,null,64.174227461351194,-87.392724975073051,null,43.033424335499014,-9.8093044591967526,null,0,0,null,0,0]
[27.542000000000002,2.7542000000000001E-2,1.0177739969259512,0.18716124902277823,1.000000000149734,1.7305148951532557E-5,1,0,52.090490571326278,1.5515977855191743,1.0003645133388972,2.6996394142511405E-2,1.0000000167223422,1.8287887796122453E-4,1,0,1,0,1.0000000056451146,2.0894360478346301E-4,70.245770765340481,-98.098233197732412,81.901766802267588,null,1000000000,758.56176400000004,null,63.375220851180892,-87.363703453352656,null,43.008057947070355,-10.734529744379756,null,0,0,null,0,0]
[30.2,3.0199999999999998E-2,1.0213325508691888,0.20474421626969033,1.0000000001800293,1.8975219603722601E-5,1,0,57.115824319857801,1.5532871494530391,1.000438248416186,2.9600284614261448E-2,1.0000000201057393,2.0052799731215757E-4,1,0,1,0,1.000000006787279,2.2910815723415341E-4,69.41613443972976,-99.055335378319612,80.944664621680388,null,1000000000,912.04,null,62.575900987532968,-87.312316162471333,null,42.977741485107558,-11.743019215848284,null,0,0,null,0,0]
[33.113,3.3112999999999997E-2,1.0255924383005794,0.22386731679142283,1.0000000002164346,2.0805511480887976E-5,1,0,62.623428205032631,1.5548271834217964,1.0005268467354402,3.2453521631610256E-2,1.0000000241714786,2.1987031645693953E-4,1,0,1,0,1.0000000081597882,2.512072322352036E-4,68.581143054826853,-100.07803688724175,79.921963112758249,null,1000000000,1096.470769,null,61.777062346468334,-87.238183403311609,null,42.941588741269278,-12.839853483930158,null,0,0,null,0,0]
[36.308,3.6308E-2,1.0306921448009618,0.24465143918778798,1.0000000002602163,2.2812989183282459E-5,1,0,68.664351048660293,1.5562322140080973,1.0006333864386887,3.5582363720411077E-2,1.0000000290610171,2.4108511532921418E-4,1,0,1,0,1.0000000098103947,2.7544566159350711E-4,67.739095107504724,-101.17260151706121,78.82739848293879,null,1000000000,1318.2708640000001,null,60.978097534018332,-87.140631797869375,null,42.898505606397151,-14.031969719191848,null,0,0,null,0,0]
[39.811,3.9810999999999999E-2,1.0367897341601726,0.26719334342732159,1.0000000003128497,2.5013988992612919E-5,1,0,75.287752213294596,1.5575135633106967,1.0007614519108747,3.9012025080548803E-2,1.0000000349391496,2.6434503384267289E-4,1,0,1,0,1.0000000117947299,3.0202069075648533E-4,66.889111959511581,-102.34379750371318,77.656202496286824,null,1000000000,1584.9157210000001,null,60.179348846340339,-87.018875278918884,null,42.847271146082022,-15.324922224794285,null,0,0,null,0,0]
[43.652000000000001,4.3652000000000003E-2,1.0440735912444543,0.29159385552749306,1.00000000037613,2.74273604646825E-5,1,0,82.550355083090722,1.5586822122276023,1.0009154005840153,4.2771552006604728E-2,1.0000000420063018,2.8984927188300267E-4,1,0,1,0,1.0000000141804537,3.3115991062747076E-4,66.029747196163186,-103.59639005480119,76.403609945198809,null,1000000000,1905.497104,null,59.380792553581728,-86.871890188792761,null,42.786462675492217,-16.724499866008426,null,0,0,null,0,0]
[47.863,4.7863000000000003E-2,1.0527627884992599,0.31793940025593814,1.0000000004521989,3.007320979232395E-5,1,0,90.512665576512205,1.5597479244696251,1.0011004303660085,4.6891837033961381E-2,1.0000000505016984,3.1781030930002637E-4,1,0,1,0,1.0000000170483232,3.6310608484140607E-4,65.159556145383974,-104.93414528381683,75.065854716183168,null,1000000000,2290.8667689999997,null,58.582589824423259,-86.698478109214264,null,42.714474353871481,-18.235667174602568,null,0,0,null,0,0]
[52.481000000000002,5.2481E-2,1.0631170946571089,0.34631427265795922,1.0000000005436682,3.2974784760978443E-5,1,0,99.244644634235982,1.5607200458450048,1.0013228745553981,5.1408518143162336E-2,1.0000000607170068,3.484738258944749E-4,1,0,1,0,1.0000000204967991,3.9813990885547768E-4,64.276519777963102,-106.36041533766712,73.639584662332879,null,1000000000,2754.255361,null,57.784565002371096,-86.497146686090133,null,42.62946280850278,-19.863268651576981,null,0,0,null,0,0]
[57.544000000000004,5.7544000000000005E-2,1.0754324419613379,0.3767682599433792,1.0000000006536267,3.6155961474565005E-5,1,0,108.81814484414937,1.5616065535553973,1.0015902175560676,5.6358017799835895E-2,1.0000000729972067,3.8209214140556066E-4,1,0,1,0,1.0000000246423399,4.3654966449996314E-4,63.37891299883006,-107.87645262596564,72.123547374034359,null,1000000000,3311.3119360000005,null,56.986998896314262,-86.266280582701896,null,42.529422135426572,-21.610172043263731,null,0,0,null,0,0]
[63.095999999999997,6.3095999999999999E-2,1.0900559510546095,0.40933900254785582,1.0000000007858385,3.9644385948110604E-5,1,0,119.31636470785668,1.5624151486564051,1.0019115707868691,6.1782370625526759E-2,1.0000000877626645,4.1895741548745398E-4,1,0,1,0,1.0000000296268521,4.786691517962007E-4,62.464412147453423,-109.48248089923833,70.517519100761675,null,1000000000,3981.1052159999995,null,56.189811222876287,-86.003929370138351,null,42.412108957487902,-23.47855152909996,null,0,0,null,0,0]
[69.183000000000007,6.9183000000000008E-2,1.1073798120473921,0.44401893989333502,1.0000000009447751,4.3468960833611077E-5,1,0,130.82628515415175,1.563152528479977,1.0022977445351193,6.7725230939952127E-2,1.0000001055127448,4.5937508768671584E-4,1,0,1,0,1.0000000356189116,5.2484734350913254E-4,61.53090299310476,-111.17598532791003,68.824014672089973,null,1000000000,4786.2874890000012,null,55.39325835222413,-85.707993069371369,null,42.275152673791389,-25.467992258538636,null,0,0,null,0,0]
[75.858000000000004,7.5858000000000009E-2,1.127857694842737,0.48077521496001679,1.0000000011358801,4.7662987012647048E-5,1,0,143.44812399056244,1.5638251091039792,1.0027618817397255,7.4236648984852646E-2,1.0000001268553862,5.0369707740220856E-4,1,0,1,0,1.0000000428237457,5.7548631696804204E-4,60.575772653362954,-112.95262458281157,67.047375417188434,null,1000000000,5754.4361640000006,null,54.597282173062148,-85.375991790461796,null,42.115998513211572,-27.576632792349759,null,0,0,null,0,0]
[83.176000000000002,8.3176E-2,1.1519924424306305,0.51951261126432646,1.0000000013656072,5.2261022003701317E-5,1,0,157.28588138605434,1.5644384342214985,1.0033195365482188,8.1368049207992565E-2,1.0000001525113593,5.5228858384647839E-4,1,0,1,0,1.0000000514846721,6.3100332225897394E-4,59.596797592244648,-114.80435723872351,65.195642761276488,null,1000000000,6918.2469760000004,null,53.802213646339794,-85.005317684176347,null,41.93209197881562,-29.799039554547178,null,0,0,null,0,0]
[91.201000000000008,9.1201000000000004E-2,1.1803590187354391,0.56010399847317172,1.0000000016418329,5.7303278191808406E-5,1,0,172.46057626270496,1.5649978676607537,1.0039896550187029,8.9178871548735758E-2,1.0000001833603054,6.0557456597444212E-4,1,0,1,0,1.0000000618986398,6.918838867763067E-4,58.591304910791273,-116.72085079418387,63.279149205816125,null,1000000000,8317.6224010000005,null,53.008010907805314,-84.592896765924948,null,41.720802035896725,-32.12795402825892,null,0,0,null,0,0]
[100,0.1,1.2135848750848603,0.60235252651549687,1.0000000019739208,6.2831852917316603E-5,1,0,189.09890078492631,1.5655080641089794,1.0047947030236579,9.7730480746096415E-2,1.0000002204479757,6.6399990241504435E-4,1,0,1,0,1.0000000744186737,7.5863629705733178E-4,57.557162384439657,-118.68762952462608,61.312370475373925,null,1000000000,10000,null,52.214989137677023,-84.135505278748852,null,41.479681279673393,-34.552124245877202,null,0,0,null,0,0]
[109.65,0.10965000000000001,1.2523733881995871,0.646023685595015,1.0000000023732691,6.8895126705495553E-5,1,0,207.34645685084746,1.5659734622431272,1.0057619502298436,0.10709265949745717,1.0000002650472957,7.2807587135030713E-4,1,0,1,0,1.0000000894744878,8.318447033421253E-4,56.492093367260068,-120.68757306328713,59.312426936712868,null,1000000000,12023.122500000001,null,51.423193757414516,-83.629428580138679,null,41.206407642756332,-37.058144483148467,null,0,0,null,0,0]
[120.23,0.12023,1.2974696030329687,0.69080874649455049,1.0000000028533524,7.5542736718199971E-5,1,0,227.35262860465838,1.5663978589585468,1.0069235126832357,0.11733542871266604,1.0000003186631083,7.9832703040175299E-4,1,0,1,0,1.0000001075740876,9.1210842869007445E-4,55.394783910284467,-122.6992597220728,57.300740277927204,null,1000000000,14455.252900000001,null,50.633151680691746,-83.070902368494785,null,40.899140262503487,-39.628357353577975,null,0,0,null,0,0]
[131.83000000000001,0.13183,1.3496909786371456,0.73637151057337147,1.0000000034305063,8.2831231620464636E-5,1,0,249.28760086184423,1.5667848850766086,1.008318166447997,0.12853725432611915,1.0000003831197883,8.7535097642381561E-4,1,0,1,0,1.0000001293333465,1.0001102462796785E-3,54.264048333747397,-124.69920912142756,55.300790878572442,null,1000000000,17379.148900000004,null,49.845159348589043,-82.455673147454164,null,40.55639701806912,-42.243535973973422,null,0,0,null,0,0]
[144.54,0.14454,1.4098724419438655,0.78231431608619306,1.0000000041238783,9.0817160076520718E-5,1,0,273.32155871140174,1.5671376244381003,1.0099911063991067,0.14077374987987198,1.0000004605557022,9.5974530532255556E-4,1,0,1,0,1.0000001554741362,1.0965329294479707E-3,53.10007284777101,-126.66055139562438,53.339448604375619,null,1000000000,20891.811599999997,null,49.060093616149707,-81.779619510963371,null,40.177487264532068,-44.880931884660988,null,0,0,null,0,0]
[158.49,0.15849000000000002,1.479053950937635,0.82832905657948752,1.0000000049583075,9.9582203490527213E-5,1,0,299.70032549833121,1.5674596542240424,1.0120007176674617,0.15415524402013295,1.0000005537449437,1.0523732115024439E-3,1,0,1,0,1.0000001869329382,1.2023627062952979E-3,51.900986789575285,-128.55961822090038,51.440381779099624,null,1000000000,25119.080100000003,null,48.277091708118633,-81.036674507999663,null,39.761403114367411,-47.522943712900712,null,0,0,null,0,0]
[173.78,0.17377999999999999,1.5581387371598467,0.87396441172639827,1.00000000596114,1.0918919370947195E-4,1,0,328.61299635204978,1.5677532288209568,1.0144106376648216,0.16875831227958188,1.0000006657414602,1.1538986878678796E-3,1,0,1,0,1.0000002247407089,1.3183582142885393E-3,50.669252390483976,-130.36637046999701,49.633629530002992,null,1000000000,30199.488400000002,null,47.497799806303718,-80.222617894545834,null,39.308960617091017,-50.143752575451146,null,0,0,null,0,0]
[190.55,0.19055000000000002,1.648229703428729,0.91887911835742087,1.0000000071671689,1.1972609531943525E-4,1,0,360.32430468317267,1.5680210455532437,1.01730130079305,0.18469154330218371,1.0000008004309915,1.2652513248357696E-3,1,0,1,0,1.0000002702092041,1.4455815458226952E-3,49.405558265275253,-132.05529715289074,47.944702847109255,null,1000000000,36309.302500000005,null,46.722338299564569,-79.331435806504459,null,38.820727998621457,-52.723861346386308,null,0,0,null,0,0]
[208.93,0.20893,1.7503723043564752,0.96269884558541818,1.0000000086165091,1.3127458971881422E-4,1,0,395.08007458171284,1.5682651916349326,1.0207643128662716,0.20204588077080013,1.0000009622935229,1.3872943100104757E-3,1,0,1,0,1.0000003248507892,1.5850189301348482E-3,48.112988637861676,-133.5999608727108,46.400039127289205,null,1000000000,43651.744900000005,null,45.952023064461784,-78.358086600229882,null,38.298473606310665,-55.241874272480914,null,0,0,null,0,0]
[229.09,0.22909000000000002,1.8658236982319798,1.0051562375702832,1.0000000103595765,1.4394149104358475E-4,1,0,433.20176855169564,1.5684879315834492,1.0249136509362311,0.2209396854150168,1.0000011569595528,1.5211564267224055E-3,1,0,1,0,1.000000390566226,1.7379600516888311E-3,46.793317064394735,-134.97852389318996,45.021476106810042,null,1000000000,52482.2281,null,45.187155483727544,-77.295983127261209,null,37.743669613577957,-57.682540765928742,null,0,0,null,0,0]
[251.19,0.25119000000000002,1.9957766430211104,1.0459753615799972,1.0000000124547332,1.5782733024023515E-4,1,0,474.9919397232652,1.5686910263569609,1.0298790069127748,0.24146855826947869,1.0000013909469063,1.667900053359792E-3,1,0,1,0,1.0000004695558291,1.9056187321465569E-3,45.450545925902624,-136.16992444965584,43.830075550344162,null,1000000000,63096.416100000002,null,44.429211629928965,-76.139809617058887,null,37.158842328884425,-60.030114832596958,null,0,0,null,0,0]
[275.42,0.27542,2.1415860668818816,1.0849650103958908,1.000000014973409,1.730514878051529E-4,1,0,520.8098701024619,1.5688762391163362,1.0358165642510575,0.26373937108916828,1.0000016722328393,1.8287867612285947E-3,1,0,1,0,1.0000005645126018,2.0894363852380603E-3,44.088144341116873,-137.15733292624986,42.842667073750135,null,1000000000,75856.176400000011,null,43.679282787914993,-74.883616073494238,null,36.546369586112647,-62.273716852755634,null,0,0,null,0,0]
[302,0.30199999999999999,2.3047815398636819,1.1220008591774622,1.0000000180029478,1.8975219378260079E-4,1,0,571.07157062288252,1.5690452319015455,1.0429136538585653,0.28786517048451177,1.0000020105719181,2.0052773121640123E-3,1,0,1,0,1.0000006787295512,2.2910820171607653E-3,42.709339099064714,-137.92741557101832,42.072584428981685,null,1000000000,91204,null,42.938363194230561,-73.521104326258069,null,35.908483937744926,-64.406311244760275,null,0,0,null,0,0]
[331.13,0.33112999999999998,2.4867619407439876,1.1569549718999899,1.000000021643465,2.0805511183687764E-4,1,0,626.15523316114479,1.5691992780566058,1.0513786681478299,0.31391458085172347,1.0000024171449595,2.1986996569497565E-3,1,0,1,0,1.0000008159811866,2.512072908703345E-3,41.319632178354667,-138.46913907841102,41.530860921588982,null,1000000000,109647.0769,null,42.20874633753369,-72.048491530284736,null,35.248393873731743,-66.420647548126311,null,0,0,null,0,0]
[363.08,0.36307999999999996,{"$f":"SQRT(1+(A77/pole1)^2)","v":2.6893548920588159},{"$f":"ATAN(A77/pole1)","v":1.1898098610828423},{"$f":"SQRT(1+(A77/Zero1)^2)","v":1.0000000260216233},{"$f":"ATAN(A77/Zero1)","v":2.2812988791485997E-4},{"$f":"IF(VIN_nom>Vout, 1, SQRT(1+(A77/z_RHP)^2))","v":1},{"$f":"IF(VIN_nom>Vout, 0, -ATAN(A77/z_RHP))","v":0},{"$f":"SQRT(1+(A77/Pole2)^2)","v":686.57141689220191},{"$f":"ATAN(A77/Pole2)","v":1.5693398135626702},{"$f":"SQRT(1+(A77/Zero2)^2)","v":1.0614694557903213},{"$f":"ATAN(A77/Zero2)","v":0.34198681978220369},{"$f":"SQRT(1+(A77/pole4)^2)","v":1.0000029060975315},{"$f":"ATAN(A77/pole4)","v":2.4108465292303535E-3},{"$f":"IF(VOUT_setting=1,1,SQRT(1+(A77*zterm1)^2))","v":1},{"$f":"IF(VOUT_setting=1,0,ATAN(((A77*zterm1))))","v":0},1,{"$f":"IF(VOUT_setting=1,0,ATAN(A77*$Q$4/(1+Afbr-$Q$5*(A77)^2)))","v":0},{"$f":"SQRT((1-(Z77/pterm2))^2+(A77/pterm1)^2)","v":1.0000009810429016},{"$f":"IF((ATAN((A77/pterm1)/(1-A77^2/pterm2))>0),ATAN((A77/pterm1)/(1-A77^2/pterm2)),PI()+ATAN((A77/pterm1)/(1-A77^2/pterm2)))","v":2.7544573889160249E-3},{"$f":"20*LOG10(((E77*K77*G77*O77)/(C77*I77*S77*M77*Q77))*Adc)","v":39.922241170185004},{"$f":"((F77+L77+H77+P77)-(D77+J77+T77+N77+R77))*radconv","v":-138.77610937268943},{"$f":"IF(V77>0,V77,V77+180)","v":41.223890627310567},null,{"$f":"IF(U77<0,A77,1000000000)","v":1000000000},{"$f":"A77^2","v":131827.0864},null,{"$f":"20*LOG10((K77/(I77*M77))*AEA)","v":41.491634810982532},{"$f":"(L77-(J77+N77))*radconv","v":-70.46027792805836},null,{"$f":"20*LOG10((E77*G77/(C77*S77))*Acs*Am)","v":34.568114392113245},{"$f":"(F77+H77-(D77+T77))*radconv","v":-68.315831444631058},null,{"$f":"SUM((U78<0)*(U77>0))*A77","v":0},{"$f":"IF(AH77>0,W75,0)","v":0},null,0,0]
[398.11,{"$f":"A78/1000","v":0.39811000000000002},2.9143258716197407,1.2205464473124659,1.0000000312849817,2.5013988476121885E-4,1,0,752.81177151599104,1.5694679731055361,1.0734749009996361,0.37213230857194118,1.0000034939089049,2.6434442426984638E-3,1,0,1,0,1.0000011794779615,3.0202079265561465E-3,38.522108689424414,-138.84461193385454,41.155388066145463,null,1000000000,158491.57210000002,null,40.789303916957486,-68.753738515314126,null,33.870312805377687,-70.090873418540411,null,0,0,null,{"$f":"SUM((V79<-183)*(V78>-183))*A78","v":0},{"$f":"IF(AK78>0,U78,0)","v":0}]
[436.52,0.43651999999999996,3.1636950537953559,1.2491951081518693,1.0000000376130045,2.7427359783809734E-4,1,0,825.44358525246059,1.5695848566684383,1.0877333830613032,0.40438909369067988,1.0000042006214331,2.8984846830432134E-3,1,0,{"$f":"IF(VOUT_setting=1,1,SQRT((1+Afbr-$Q$5*(A79)^2)^2+(A79*$Q$4)^2))","v":1},0,1.0000014180525472,3.3116004495744515E-3,37.123561805463055,-138.67450411802855,41.325495881971449,null,1000000000,190549.71039999998,null,40.103889126275092,-66.926870540948158,null,33.157180712098729,-71.747633577080393,null,0,0,null,0,0]
[478.63,0.47863,3.439614641914662,1.275806367850838,1.0000000452198963,3.0073208894785077E-4,1,0,905.07196563397849,1.5696914420548624,1.1046298782400992,0.43875654320382312,1.0000050501572229,3.1780925000906043E-3,1,0,1,0,1.0000017048426959,3.6310626191727209E-3,35.731220779807472,-138.26902229090547,41.730977709094532,null,1000000000,229086.67689999999,null,39.437853995253192,-64.979887969626915,null,32.430874817465053,-73.289134321278496,null,0,0,null,0,0]
[524.80999999999995,0.52481,3.7445688263426598,1.3004621998342134,1.0000000543668199,3.2974783577773914E-4,1,0,992.39656834230266,1.5697886649376003,1.1246110042092605,0.47521067983377746,1.0000060716824255,3.4847242945766823E-3,1,0,1,0,1.0000020496949202,3.9814014228989527E-3,34.349036460119194,-137.63457885208385,42.365421147916152,null,1000000000,275425.53609999997,null,38.793513160611987,-62.914358961118616,null,31.693031332417974,-74.72021989096524,null,0,0,null,0,0]
[575.44000000000005,0.57544000000000006,4.0811142745937188,1.3232445362670369,1.0000000653626755,3.6155959914819824E-4,1,0,1088.1359587534212,1.5698773238589889,1.1481708890235249,0.51366294290751036,1.0000072996942939,3.8209030057219455E-3,1,0,1,0,1.0000024642556773,4.3654997222120255E-3,32.981609412114551,-136.78128412431641,43.218715875683586,null,1000000000,331131.19360000006,null,38.173628379645777,-60.735547975099848,null,30.945489065379537,-76.04573614921658,null,0,0,null,0,0]
[630.96,0.63096000000000008,4.4522126682085776,1.3442561831860866,1.0000000785838639,3.9644383891940764E-4,1,0,1193.1221600112149,1.5699581895524624,1.1758739590879406,0.553991779450975,1.0000087762283154,4.1895498877096019E-3,1,0,1,0,1.0000029627165816,4.7866955745538061E-3,31.632699291491694,-135.72237988396273,44.277620116037269,null,1000000000,398110.52160000004,null,37.580665383562305,-58.450631019287442,null,30.189541940840158,-77.271748864675303,null,0,0,null,0,0]
[691.83,0.69183000000000006,4.860967477057601,1.3635965673893762,1.0000000944775234,4.3468958123097008E-4,1,0,1308.2250145611579,1.5700319322249621,1.208336405980851,0.59600618815769835,1.0000105512193798,4.5937188871208665E-3,1,0,1,0,1.0000035619364993,5.2484787826084693E-3,30.306333539403614,-134.47490320494759,45.525096795052406,null,1000000000,478628.74890000006,null,37.01724098494622,-56.070765040715635,null,29.42660058736816,-78.404138164231952,null,0,0,null,0,0]
[758.58,0.75858000000000003,5.3109601751093214,1.3813757473957236,1.0000001135880103,4.7662983439444384E-4,1,0,1434.4467322424971,1.5700991938456406,1.2462500339095353,0.63947830962884233,1.0000126854589744,5.0369286028505789E-3,1,0,1,0,1.000004282440107,5.7548702191428788E-3,29.005609243336913,-133.05866503985541,46.941334960144587,null,1000000000,575443.61640000006,null,36.485529369891239,-53.609243804264942,null,28.65758790635644,-79.449421235590464,null,0,0,null,0,0]
[831.76,0.83175999999999994,5.8059158400487485,1.3976950365671994,1.0000001365607121,5.2261017293412206E-4,1,0,1572.827342189471,1.5701605290562961,1.2903523712278222,0.68410954404625146,1.0000152510207969,5.5228302474959043E-3,1,0,1,0,1.0000051485619246,6.3100425153196108E-3,27.733756132612129,-131.49703897801092,48.50296102198908,null,1000000000,691824.69759999996,null,35.987637410286503,-51.083416797004944,null,27.883626755236392,-80.413622181005948,null,0,0,null,0,0]
[912.01,0.91200999999999999,6.3501764787294581,1.4126621503960319,1.0000001641832714,5.7303271982370933E-4,1,0,1724.5770601763281,1.5702164744478313,1.3414629098329178,0.72957939372721781,1.0000183358641286,6.0556723760546455E-3,1,0,1,0,1.0000061900008927,6.9188511180108747E-3,26.492795167314497,-129.81508915242708,50.184910847572922,null,1000000000,831762.24009999994,null,35.524986426855094,-48.511921352184302,null,27.105316773370166,-81.30316780024279,null,0,0,null,0,0]
[1000,1,6.9482965468864091,1.4263746340993315,1.000000197392068,6.2831844731661539E-4,1,0,1890.9628308897932,1.5702674956458782,1.4004426166180679,0.77551589231878459,1.0000220445570187,6.6399024176000739E-3,1,0,1,0,1.0000074420652509,7.5863791194489471E-3,25.284626588240656,-128.04026521163024,51.959734788369758,null,1000000000,1000000,null,35.09867944363441,-45.916351069272089,null,26.323455177517015,-82.123914142358174,null,0,0,null,0,0]
[1096.5,1.0965,7.6055184140892971,1.4389310269423221,1.0000002373268968,6.889511591405738E-4,1,0,2073.4406952840573,1.5703140366377477,1.4682336506884166,0.82154536498383879,1.0000265043818477,7.2806313543579805E-3,1,0,1,0,1.0000089477348377,8.3184683228323536E-3,24.109990176223505,-126.20024829780861,53.799751702191386,null,1000000000,1202312.25,null,34.709065296821763,-43.318434215679758,null,25.538432912312508,-82.881814082128841,null,0,0,null,0,0]
[1202.3,1.2022999999999999,8.3272286554082857,1.4504178317977321,1.0000002853352139,7.554272249190089E-4,1,0,2273.5045135967448,1.5703564772031038,1.5457994822856651,0.8672651792866114,1.0000318658081981,7.9831024081733568E-3,1,0,1,0,1.0000107578222615,9.121112352273331E-3,22.969570574731915,-124.32370094351836,55.676299056481639,null,1000000000,1445525.2899999998,null,34.356094357366302,-40.741562104953303,null,24.750984250276382,-83.582138838565058,null,0,{"$f":"IF(AH90>0,W90,0)","v":0},null,0,0]
[1318.3,1.3183,9.1195709209068365,1.4609210990514703,1.0000003430505893,8.2831212866369297E-4,1,0,2492.8561519561076,1.5703951804928786,1.6341825108919354,0.912301915156711,1.000038311252291,8.7532884339911118E-3,1,0,1,0,1.0000129339323542,1.0001139459962234E-2,21.862937949318656,-122.43767072332781,57.562329276672187,null,1000000000,1737914.89,null,34.03895843358525,-38.207493157532234,null,23.961487548644172,-84.2301775657956,null,0,0,null,0,0]
[1445.4,1.4454,9.988695122751313,1.470515158102137,1.0000004123877455,9.0817135358284555E-4,1,0,2733.1974765177547,1.5704304549430081,1.7344173374736465,0.95628110293487423,1.0000460545203265,9.5971613386777004E-3,1,0,1,0,1.0000155482773558,1.0965378056528778E-2,20.789746645163952,-120.56859060557738,59.431409394422616,null,1000000000,2089181.1600000001,null,33.756476286718978,-35.738042741609441,null,23.170778391355743,-84.830547863967951,null,0,0,null,0,0]
[1584.9,1.5849000000000002,10.943493910923641,1.4792901830475336,1.000000495830643,9.9582170902439348E-4,1,0,2996.9867384392223,1.5704626583119068,1.8478488184767075,0.99896871684918664,1.0000553729766155,1.0523347527999275E-2,1,0,1,0,1.0000186945424379,1.2023691348580197E-2,19.746674655253884,-118.73606894961561,61.263931050384386,null,1000000000,2511908.0100000002,null,33.5063757579004,-33.347134300918832,null,22.377806930264249,-85.388934648696761,null,0,0,null,0,0]
[1737.8,1.7378,11.990814502101522,1.4873021801506305,1.0000005961138283,1.0918915075062575E-3,1,0,3286.1149001742515,1.5704920160675446,1.9755743926147189,1.0400444763038372,1.0000665719522757,1.1538479908380445E-2,1,0,1,0,1.0000224758756522,1.3183666884404E-2,18.733272301841403,-116.96245709510775,63.037542904892248,null,1000000000,3019948.84,null,33.286859054802669,-31.053511517788849,null,21.5839212799495,-85.908945577318903,null,0,0,null,0,0]
[1905.5,1.9055,13.140247924848131,1.4946206119903445,1.0000007167166449,1.1972603868507152E-3,1,0,3603.2293091810275,1.5705187979653301,2.1190077063387878,1.0793301917071261,1.0000800399279801,1.2651844899964652E-2,1,0,1,0,1.0000270235292852,1.4455927172839158E-2,17.746619201262995,-115.26305022015194,64.736949779848061,null,1000000000,3630930.25,null,33.095341904049562,-28.867931432316773,null,20.788785330124206,-86.395118787835173,null,0,0,null,0,0]
[2089.3000000000002,2.0893000000000002,14.400705551667242,1.5012993551543761,1.000000861650534,1.3127451506439818E-3,1,0,3950.7882166915988,1.570543212743768,2.2794688508806469,1.1166462630666611,1.000096224768994,1.3872062112205963E-2,1,0,1,0,1.0000324888495908,1.5850336556000013E-2,16.785013748474125,-113.65224976026984,66.347750239730161,null,1000000000,4365174.4900000012,null,32.929386885205602,-26.801190193157691,null,19.993134896179289,-86.851059567112159,null,0,0,null,0,0]
[2290.9,2.2909000000000002,15.783846403472324,1.5073979522162779,1.0000010359571199,1.4394139262629642E-3,1,0,4332.0062589557383,1.5705654868678274,2.4586173324743794,1.1519216518879838,1.0001156893301912,1.5210402883642487E-2,1,0,1,0,1.0000390620731023,1.7379794634592129E-2,15.845246639298631,-112.13887412865469,67.861125871345308,null,1000000000,5248222.8100000005,null,32.786256864102953,-24.858016781847088,null,19.196497808106443,-87.280857346807593,null,0,0,null,0,0]
[2511.9,2.5119000000000002,17.300648568272269,1.5129627914436339,1.0000012454725538,1.5782720050440781E-3,1,0,4749.9089759917506,1.5705857964431695,2.658021235423889,1.1850834675060775,1.0001390851150296,1.6677469615315344E-2,1,0,1,0,1.0000469634609617,1.9056443197677828E-2,14.925411790670042,-110.73101314200025,69.268986857999749,null,1000000000,6309641.6100000003,null,32.663479588626728,-23.043205088805298,null,18.399440234954085,-87.687808053194971,null,0,0,null,0,0]
[2754.2,2.7542,18.964152714694652,1.5180407925275299,1.0000014973397804,1.7305131678819483E-3,1,0,5208.0891965877763,1.5706043177934379,2.8795130626004286,1.2161263097948958,1.0001672094442511,1.8285849633523161E-2,1,0,1,0,1.0000564626465862,2.0894701124620482E-2,14.023015639676554,-109.43315355061708,70.566846449382922,null,1000000000,7585617.6399999987,null,32.558584947491923,-21.35779582173766,null,17.601938725095401,-88.075357728879425,null,0,0,null,0,0]
[3020,3.02,20.789463548866301,1.5226764692505657,1.000001800293175,1.8975196832056466E-3,1,0,5710.7070383069558,1.5706212171283698,3.1252022239308497,1.2450886950319817,1.0002010371859449,2.0050112805833985E-2,1,0,1,0,1.0000678894150283,2.2911264782891239E-2,13.135380556400625,-108.24736073451318,71.75263926548682,null,1000000000,9120400,null,32.469243258153128,-19.800426475533023,null,16.803645331158265,-88.446934258980136,null,0,0,null,0,0]
[3311.3,3.3113000000000001,22.790315816005723,1.5269039485407019,1.0000021643441983,2.0805481463743434E-3,1,0,6261.5444262185647,1.5706366217866461,3.3970149224915782,1.2719937022065047,1.0002416855821243,2.1983489966817087E-2,1,0,1,0,1.0000816219083162,2.5121315108803634E-2,12.26132514770622,-107.17583086687449,72.824169133125508,null,1000000000,10964707.690000001,null,32.393445167315321,-18.370540088465162,null,16.005388013301665,-88.805290778409343,null,0,0,null,0,0]
[3630.8,3.6308000000000002,24.985255122653214,1.5307620277961649,1.0000026021589927,2.2812949611962113E-3,1,0,6865.7069591802838,1.5706506753697074,3.6975316844592507,1.2969351891619301,1.0002905679605572,2.4103842842243175E-2,1,0,1,0,1.0000981386773005,2.7545346347815698E-2,11.398305184704521,-106.21751788281807,73.782482117181928,null,1000000000,13182708.640000001,null,32.329233749619902,-17.063790631482306,null,15.20657946799539,-89.153727251335766,null,0,0,null,0,0]
[3981.1,3.9811000000000001,27.392143556122367,1.5342813948437071,1.0000031284933342,2.5013936827212356E-3,1,0,7528.1111398082103,1.5706634913486115,4.0292476106114217,1.3199898405052359,1.0003493304849691,2.6428349252942147E-2,1,0,1,0,1.0001179975000374,3.020309742907511E-2,10.54500830352411,-105.37181444053485,74.628185559465152,null,1000000000,15849157.209999999,null,32.274949383524721,-15.876775118294601,null,14.407566952910161,-89.495039322240245,null,0,0,null,0,0]
[4365.2,4.3651999999999997,30.031594019314394,1.5374919045463782,1.0000037612934385,2.7427291696840426E-3,1,0,8254.4298557467664,1.5706751797235758,4.3950416679024542,1.3412568243292176,1.0004199748361511,2.8976815091425703E-2,1,0,1,0,1.0001418770976569,3.3117346483559421E-2,9.6999053430903377,-104.63708737741244,75.362912622587558,null,1000000000,19054971.039999999,null,32.229095620957054,-14.804952732315925,null,13.608317755044048,-89.832134645096531,null,0,0,null,0,0]
[4786.3,4.7862999999999998,32.925596251053271,1.5404201479003803,1.0000045219795146,3.0073119141384537E-3,1,0,9050.7141871597833,1.5706858382763824,4.7979909118373341,1.3608365400671485,1.0005048895407682,3.1770338505489541E-2,1,0,1,0,1.0001705881071672,3.6312394871276625E-2,8.8618332094304577,-104.01159939147539,75.988400608524614,null,1000000000,22908667.690000001,null,32.190371502497335,-13.843785447056673,null,12.808969739843892,-90.167813944418697,null,0,0,null,0,0]
[5248.1,5.2481,36.099578522771218,1.5430916283625322,1.0000054366673754,3.297466525809378E-3,1,0,9923.9606954964238,1.5706955605754027,5.2416591914064936,1.3788403740341044,1.0006069858698985,3.4833288742348874E-2,1,0,1,0,1.0002051195807755,3.9816345278019742E-2,8.0294287889240383,-103.49330834846144,76.50669165153856,null,1000000000,27542553.610000003,null,32.157628677553106,-12.988292912849944,null,12.009308144281693,-90.505015435611497,null,0,0,null,0,0]
[5370.3,5.3703000000000003,36.939505715262506,1.5437217310911273,1.0000056927957011,3.3742461957319385E-3,1,0,10155.036319973116,1.5706978534886369,5.3593157384972798,1.3831052873458738,1.0006355727470913,3.5643689548020469E-2,1,0,1,0,1.0002147905302403,4.0743566984518108E-2,7.8222022778815283,-103.38033970213336,76.619660297866645,null,1000000000,28840122.090000004,null,32.150262895197322,-12.79049530000048,null,11.809447415594978,-90.589844402132911,null,0,0,null,0,0]
[5432.85,5.4328500000000002,37.369441196360853,1.5440332991828722,1.0000058261800764,3.4135470670864673E-3,1,0,10273.316027939203,1.5706989872407682,5.4195765819222457,1.3852166787294147,1.0006504596622976,3.6058487944266075E-2,1,0,1,0,1.0002198271540714,4.1218183070396625E-2,7.7180569320817174,-103.3259903047979,76.674009695202102,null,1000000000,29515859.122500002,null,32.146670604850648,-12.693352641378095,null,11.708894360141835,-90.6326376634198,null,0,0,null,0,0]
[5495.4,5.4954000000000001,37.799380222563116,1.5443377796063493,1.0000059611090188,3.4528479278961108E-3,1,0,10391.595735918192,1.5707000951836065,5.4798610542425861,1.3872816239158177,1.0006655187419899,3.6473273927221571E-2,1,0,1,0,1.000224922287394,4.1692801226263572E-2,7.6151735228509398,-103.27389391427018,76.726106085729825,null,1000000000,30199421.159999996,null,32.143191775738416,-12.598868963836502,null,11.60948978002329,-90.675024950433652,null,0,0,null,0,0]
[5559.4,5.5593999999999992,38.239289405487675,1.544642231602134,1.0000061007644998,3.493059828794623E-3,1,0,10512.617339618631,1.5707012030051493,5.5415666608690692,1.3893479268096136,1.0006811051022304,3.689766225616465E-2,1,0,1,0,1.0002301960997191,4.2178423888599645E-2,7.5111789981468622,-103.22284658402644,76.777153415973558,null,1000000000,30906928.359999996,null,32.139744520696681,-12.504857662340809,null,11.508942510360949,-90.717988921685631,null,0,0,null,0,0]
[5623.4,5.6233999999999993,38.679202052226955,1.5449397583381987,1.0000062420369871,3.5332717183965581E-3,1,0,10633.638943331678,1.5707022856104251,5.6032954066401226,1.3913687112910951,1.000696871684962,3.7322037288549853E-2,1,0,1,0,1.0002355311792996,4.2664048767956465E-2,7.4084412583316386,-103.17400839959785,76.825991600402148,null,1000000000,31622627.559999995,null,32.136405738932872,-12.413452167141525,null,11.409543552309529,-90.760556232456338,null,0,0,null,0,0]
[5688.9,5.6888999999999994,39.129428616254899,1.5452373314119716,1.000006388294846,3.5744260623285142E-3,1,0,10757.49699089436,1.5707033683676448,5.6664940897551075,1.393391262127452,1.0007131943960246,3.7756344684242174E-2,1,0,1,0,1.0002410547451484,4.3161057802340641E-2,7.3045648390340565,-103.12623902203089,76.873760977969113,null,1000000000,32363583.209999997,null,32.133096017883048,-12.322514558467116,null,11.308976854061779,-90.803724463563739,null,0,0,null,0,0]
[5754.4,5.7543999999999995,39.579658566355292,1.5455281345531569,1.0000065362463952,3.6155803941525541E-3,1,0,10881.355038469366,1.5707044264756926,5.7297154414601712,1.3953691874868599,1.0007297058583475,3.8190637830207375E-2,1,0,1,0,1.0002466424987835,4.3658069212384257E-2,7.2019408680145105,-103.08063651545567,76.919363484544334,null,1000000000,33113119.359999996,null,32.129890029459787,-12.234131572540837,null,11.209558871465488,-90.846504942914819,null,0,0,null,0,0]
[5821.4,5.8213999999999997,40.040202510196458,1.5458188310759529,1.0000066893384618,3.6576771789185477E-3,1,0,11008.049529894288,1.5707054841802572,5.794407290067368,1.3973477456567647,1.0007467907205985,3.8634861707729368E-2,1,0,1,0,1.0002524246338165,4.4166465049197794E-2,7.0982306721844086,-103.03615888964525,76.96384111035475,null,1000000000,33888697.959999993,null,32.126713152024415,-12.146281295132251,null,11.109025553070763,-90.88987759451301,null,0,0,null,0,0]
[5888.4,5.8883999999999999,40.500749760662544,1.5461029164121356,1.0000068442026788,3.6997739507206614E-3,1,0,11134.744021331242,1.5707065178150559,5.8591213210426911,1.3992826048879774,1.0007640730583052,3.9079070330175533E-2,1,0,1,0,1.0002582739466002,4.4674863428954194E-2,6.9957674645766641,-102.99380412879822,77.006195871201783,null,1000000000,34673254.559999995,null,32.123635347456386,-12.060932529335311,null,11.009640150031043,-90.932871599462899,null,0,0,null,0,0]
[5957,5.9569999999999999,40.972298463987883,1.5463871687646749,1.0000070046012812,3.7428760049780414E-3,1,0,11264.46405287426,1.5707075520430203,5.9254029859698241,1.4012198733755235,1.0007819727033809,3.9533870931600094E-2,1,0,1,0,1.0002643325565497,4.5195405330502592E-2,6.8921177047229349,-102.95256598084838,77.047434019151623,null,1000000000,35485849,null,32.120582097559584,-11.976052632997286,null,10.909043640074119,-90.976513347851082,null,0,0,null,0,0]
[6025.6,6.0256000000000007,41.443850402515515,1.5466649526404554,1.0000071668576829,3.7859780453284278E-3,1,0,11394.184084429053,1.570708562722114,5.9917063969347835,1.4031142737411746,1.0008000793463598,3.9988655170433443E-2,1,0,1,0,1.0002704616090559,4.571594995924641E-2,6.7897120279682515,-102.91341124923827,77.086588750761734,null,1000000000,36307855.360000007,null,32.117623627469158,-11.893626612363986,null,10.809596433409865,-91.019784636874277,null,0,0,null,0,0]
[6095.8,6.0958000000000006,41.926403872365086,1.5469427465652377,1.0000073348217902,3.8300853665161768E-3,1,0,11526.929656090189,1.5707095734242169,6.0595780111431861,1.4050099330012005,1.0008188225861046,4.0454029487000734E-2,1,0,1,0,1.0002768065490713,4.6248638426293801E-2,6.6861743105964049,-102.87542992447027,77.124570075529732,null,1000000000,37158777.640000001,null,32.114689870398529,-11.811735230473978,null,10.708992473108644,-91.063694693996297,null,0,0,null,0,0]
[6166,6.1660000000000004,42.408960504023305,1.5472142186720261,1.0000075047313668,3.874192672801334E-3,1,0,11659.675227762835,1.5707105611126035,6.1274709181540103,1.406863590663278,1.000837782568293,4.091938627214315E-2,1,0,1,0,1.0002832252756628,4.6781329814939841E-2,6.5838765618830566,-102.83949074569358,77.160509254306419,null,1000000000,38019556,null,32.11184666199523,-11.732248039816474,null,10.609537932798588,-91.107242705877084,null,0,0,null,0,0]
[6237.8,6.2378,42.902518736951286,1.5474855608891736,1.0000076805260121,3.9193052582218151E-3,1,0,11795.446339542083,1.5707115483157774,6.1969325386866432,1.4087174743183464,1.0008573988827261,4.1395331135360786E-2,1,0,1,0,1.0002898666369675,4.7326165374711564E-2,6.4804986156138593,-102.80477601223124,77.195223987768756,null,1000000000,38910148.840000004,null,32.109028101573557,-11.653354525101312,null,10.50897854695107,-91.151421487129895,null,0,0,null,0,0]
[6309.6,6.3096000000000005,43.396080056794233,1.5477507309540428,1.0000078583558174,3.9644178276895085E-3,1,0,11931.217451332563,1.5707125130512238,6.2664149851501811,1.4105302521065453,1.0008772419059759,4.1871257234568512E-2,1,0,1,0,1.0002965852082959,4.7871004061032452E-2,6.3783554144730727,-102.77206065082751,77.227939349172487,null,1000000000,39811052.160000004,null,32.106295936627049,-11.57681384066915,null,10.409567510756792,-91.195246810158352,null,0,0,null,0,0]
[6383.05,6.3830499999999999,43.900986748817076,1.5480158252350076,1.0000080423780908,4.0105670899243341E-3,1,0,12070.10865135787,1.5707134774991671,6.3375150081774319,1.4123435522450609,1.0008977755012929,4.235810071476085E-2,1,0,1,0,1.0003035380792604,4.8428366685705153E-2,6.2751114460075827,-102.74059469293,77.259405307069997,null,1000000000,40743327.302500002,null,32.103586346388099,-11.500868731150128,null,10.309033132530249,-91.239725961779882,null,0,0,null,0,0]
[6456.5,6.4565000000000001,44.405896455822948,1.5482748911147997,1.0000082285301353,4.0567163350760287E-3,1,0,12208.99985139415,1.5707144200037353,6.4086354069052058,1.4141166115885548,1.0009185463162054,4.2844924104622678E-2,1,0,1,0,1.000310571773362,4.8985732657410457E-2,6.1730976393496135,-102.71108674520507,77.288913254794934,null,1000000000,41686392.25,null,32.100959199328514,-11.427226840998804,null,10.209646472931873,-91.283859904206253,null,0,0,null,0,0]
[6531.7,6.5316999999999998,44.922839023517184,1.5485340960973806,1.0000084213238771,4.1039651018612653E-3,1,0,12351.200235921509,1.5707153630033628,6.4814707104386287,1.4158915968467369,1.0009400577603826,4.334332536431932E-2,1,0,1,0,1.0003178567976807,4.955638178851305E-2,6.0698968023524271,-102.682837883166,77.317162116833998,null,1000000000,42663104.890000001,null,32.09835100442443,-11.354137995506878,null,10.109053830838768,-91.328699887659141,null,0,0,null,0,0]
[6606.9,6.6068999999999996,45.43978454077849,1.5487874034078761,1.000008616350083,4.1512138503226464E-3,1,0,12493.400620459603,1.5707162845364717,6.5543259804351006,1.4176271274174905,1.0009618178311668,4.38417050781598E-2,1,0,1,0,1.0003252265683591,5.0127034508559543E-2,5.9679237160041074,-102.65650943873504,77.343490561264957,null,1000000000,43651127.609999992,null,32.095821587282643,-11.28330727266165,null,10.009610161632235,-91.373202166073412,null,0,0,null,0,0]
[6683.85,6.6838500000000005,45.968762989674602,1.5490407078961879,1.0000088182257931,4.1995621182897638E-3,1,0,12638.910189489039,1.5707172060490371,6.6288966676346996,1.4193635497606043,1.0009843416423774,4.4351660163581205E-2,1,0,1,0,1.0003328555845099,5.0710970803550734E-2,5.8648177163551471,-102.63149105152871,77.368508948471288,null,1000000000,44673850.822500005,null,32.093311150980384,-11.213088673785414,null,9.9090145982855322,-91.418402377743263,null,0,0,null,0,0]
[6760.8,6.7608000000000006,46.497744320962262,1.5492882489658601,1.0000090224390779,4.2479103666233572E-3,1,0,12784.419758528962,1.5707181065846791,6.7034868973188066,1.4210613345104095,1.0010071257520052,4.4861592167242191E-2,1,0,1,0,1.0003405733657407,5.1294910942676061E-2,5.7629358500178522,-102.60835391278893,77.391646087211072,null,1000000000,45708416.640000001,null,32.090875883329083,-11.145081321562209,null,9.8095679995995351,-91.463272591226712,null,0,0,null,0,0]
[6839.55,6.83955,47.039102367411424,1.5495358161021671,1.0000092338495146,4.2973895475707184E-3,1,0,12933.333060188495,1.5707190072055577,6.7798414882077127,1.4227601502487677,1.0010307123076247,4.5383428231885313E-2,1,0,1,0,1.0003485635991025,5.1892514525785312E-2,5.6599075421987335,-102.58655931361126,77.413440686388739,null,1000000000,46779444.202500001,null,32.088457928635641,-11.077696955383932,null,9.7089576464738574,-91.508862358227347,null,0,0,null,0,0]
[6918.3,6.9183000000000003,47.580463231258825,1.5497777497156553,1.000009447708162,4.3468687074763113E-3,1,0,13082.246361858281,1.5707198873231643,6.8562152097109657,1.4244211233153068,1.0010545714439099,4.5905239563735531E-2,1,0,1,0,1.0003566468301361,5.2490122227270113E-2,5.5581001722955756,-102.56660780807069,77.433392191929315,null,1000000000,47862874.890000001,null,32.086111691738331,-11.012478222753273,null,9.6094965134680148,-91.554129585317426,null,0,0,null,0,0]
[6998.9,6.9988999999999999,48.13454459714012,1.5500197315974538,1.0000096691259457,4.3975102129060724E-3,1,0,13234.657944275958,1.5707207676074086,6.9344022578746634,1.4260832249591615,1.0010792733213032,4.6439283414666035E-2,1,0,1,0,1.0003650162701321,5.3101773280133921E-2,5.4551349090146175,-102.54803331392024,77.451966686079757,null,1000000000,48984601.209999993,null,32.083781202894045,-10.947895708670051,null,9.5088617390313406,-91.600137605250211,null,0,0,null,0,0]
[7079.5,7.0795000000000003,48.68862871740042,1.5502562059104052,1.000009893108315,4.4481516957803231E-3,1,0,13387.069526703663,1.5707216278476075,7.0126080356833338,1.4277082589381425,1.0011042606952056,4.6973300758625505E-2,1,0,1,0,1.0003734831628392,5.3713428745981978E-2,5.3533877477225786,-102.53126466703615,77.468735332963846,null,1000000000,50119320.25,null,32.081519127725201,-10.885434348166141,null,9.4093766529081453,-91.645830318870011,null,0,0,null,0,0]
[7161.95,7.16195,49.255433402375537,1.5504926031021047,1.0000101248852753,4.4999555215881511E-3,1,0,13542.979389879483,1.5707224877989032,7.0926275927290217,1.4293335080537271,1.0011301169795068,4.751954758245823E-2,1,0,1,0,1.0003822452469071,5.4339128068349445E-2,5.2505351875944681,-102.51591801240369,77.484081987596312,null,1000000000,51293527.802499995,null,32.079272666347002,-10.823661342273057,null,9.3087705541582348,-91.692256670130618,null,0,0,null,0,0]
[7244.4,7.2443999999999997,49.822240777293601,1.5507236215170153,1.0000103593458975,4.5517593232433399E-3,1,0,13698.889253065094,1.5707233281756352,7.1726654664430702,1.4309224898401804,1.0011562719711293,4.8065766028106749E-2,1,0,1,0,1.0003911093462439,5.4964832114310372E-2,5.1488967404164177,-102.50233866599343,77.497661334006565,null,1000000000,52481331.359999992,null,32.077091373766265,-10.763963553785711,null,9.2093133995609175,-91.738375112207748,null,0,0,null,0,0]
[7328.75,7.3287500000000003,50.402112502979968,1.5509545866549352,1.0000106019866313,4.6047568803684116E-3,1,0,13858.391945127107,1.5707241683507693,7.2545660769557969,1.43251180147496,1.0011833387728792,4.8624541974493396E-2,1,0,1,0,1.0004002833010892,5.5604959996591652E-2,5.0461423014225488,-102.49021487615938,77.509785123840615,null,1000000000,53710576.5625,null,32.07492414326682,-10.704966346625001,null,9.1087261910664932,-91.785248529534371,null,0,0,null,0,0]
[7413.1,7.4131,50.981986856198937,1.5511802977622813,1.0000108474361342,4.6577544116261733E-3,1,0,14017.894637198679,1.5707249894060284,7.3364846027060446,1.4340656247409511,1.0012107181577035,4.9183287534446847E-2,1,0,1,0,1.0004095640682835,5.6245092935713323E-2,4.9445983437864012,-102.47982084101851,77.520179158981492,null,1000000000,54954051.610000007,null,32.072818978098574,-10.647999636717497,null,9.0092873985985946,-91.831821204301022,null,0,0,null,0,0]
[7499.45,7.4994499999999995,51.575613082316146,1.5514061032678572,1.0000111016148781,4.7120085258854352E-3,1,0,14181.179254403032,1.5707258107973983,7.4203634144136252,1.4356207491589141,1.0012390704892298,4.9755249521688354E-2,1,0,1,0,1.0004191755526195,5.6900409191280261E-2,4.8418704837329853,-102.47091287179335,77.529087128206655,null,1000000000,56241750.302499995,null,32.070725209805168,-10.591715641055837,null,8.9086533068385876,-91.879197230737518,null,0,0,null,0,0]
[7585.8,7.5857999999999999,52.169241878330212,1.5516267699461226,1.0000113587371615,4.7662626124048276E-3,1,0,14344.463871616736,1.5707266134887905,7.5042597704205143,1.4371411051291751,1.001267750348009,5.0327178929983382E-2,1,0,1,0,1.0004288990197308,5.7555730867404273E-2,4.7403511587053817,-102.46369992886561,77.536300071134391,null,1000000000,57544361.640000001,null,32.068690601746276,-10.53742079264406,null,8.8091685898698717,-91.926279136221538,null,0,0,null,0,0]
[7674.15,7.67415,52.776622607890509,1.5518474097049664,1.0000116248613891,4.8217732787166371E-3,1,0,14511.530413963435,1.5707274160754712,7.5901168479714336,1.4386618844889896,1.0012974334416316,5.0912321004042943E-2,1,0,1,0,1.0004389636250337,5.8226236484638628E-2,4.6377013583905011,-102.458016188144,77.541983811855999,null,1000000000,58892578.222499996,null,32.066667249590729,-10.483858709783529,null,8.7085421417105398,-91.974157478360496,null,0,0,null,0,0]
[7762.5,7.7625000000000002,53.384005848253103,1.552063028760899,1.0000118940670848,4.8772839153122796E-3,1,0,14678.596956319276,1.5707282003926424,7.6759910870000549,1.4401486401464103,1.0013274593503367,5.1497428186166691E-2,1,0,1,0,1.0004491455101037,5.8896747905972491E-2,4.5362569495718326,-102.4539914852145,77.546008514785498,null,1000000000,60256406.25,null,32.06470020055005,-10.432242995549332,null,8.6090647819325472,-92.021748489665157,null,0,0,null,0,0]
[7852.9,7.8529,54.005484815221074,1.5522786307395302,1.0000121727087508,4.9340825434867437E-3,1,0,14849.53997193642,1.5707289846413588,7.7638750499376092,1.4416358470780766,1.0013585367620739,5.2096075178923174E-2,1,0,1,0,1.0004596850669856,5.9582823393207016E-2,4.4336765311620931,-102.4515336766089,77.548466323391096,null,1000000000,61668038.409999996,null,32.062743060500381,-10.381377195288822,null,8.5084415035724845,-92.070156481320083,null,0,0,null,0,0]
[7943.3,7.9432999999999998,{"$f":"SQRT(1+(A141/pole1)^2)","v":54.62696623547086},{"$f":"ATAN(A141/pole1)","v":1.5524893269959272},{"$f":"SQRT(1+(A141/Zero1)^2)","v":1.0000124545765383},{"$f":"ATAN(A141/Zero1)","v":4.9908811398254376E-3},{"$f":"IF(VIN_nom>Vout, 1, SQRT(1+(A141/z_RHP)^2))","v":1},{"$f":"IF(VIN_nom>Vout, 0, -ATAN(A141/z_RHP))","v":0},{"$f":"SQRT(1+(A141/Pole2)^2)","v":15020.482987562489},{"$f":"ATAN(A141/Pole2)","v":1.5707297510395386},{"$f":"SQRT(1+(A141/Zero2)^2)","v":7.8517758004628835},{"$f":"ATAN(A141/Zero2)","v":1.4430897585569304},{"$f":"SQRT(1+(A141/pole4)^2)","v":1.0013899730165536},{"$f":"ATAN(A141/pole4)","v":5.2694684800002521E-2},{"$f":"IF(VOUT_setting=1,1,SQRT(1+(A141*zterm1)^2))","v":1},{"$f":"IF(VOUT_setting=1,0,ATAN(((A141*zterm1))))","v":0},1,{"$f":"IF(VOUT_setting=1,0,ATAN(A141*$Q$4/(1+Afbr-$Q$5*(A141)^2)))","v":0},{"$f":"SQRT((1-(Z141/pterm2))^2+(A141/pterm1)^2)","v":1.0004703474635857},{"$f":"IF((ATAN((A141/pterm1)/(1-A141^2/pterm2))>0),ATAN((A141/pterm1)/(1-A141^2/pterm2)),PI()+ATAN((A141/pterm1)/(1-A141^2/pterm2)))","v":6.0268905095577197E-2},{"$f":"20*LOG10(((E141*K141*G141*O141)/(C141*I141*S141*M141*Q141))*Adc)","v":4.3322985704715986},{"$f":"((F141+L141+H141+P141)-(D141+J141+T141+N141+R141))*radconv","v":-102.45069967367417},{"$f":"IF(V141>0,V141,V141+180)","v":77.549300326325834},null,{"$f":"IF(U141<0,A141,1000000000)","v":1000000000},{"$f":"A141^2","v":63096014.890000001},null,{"$f":"20*LOG10((K141/(I141*M141))*AEA)","v":32.0608394816947},{"$f":"(L141-(J141+N141))*radconv","v":-10.332415919953821},null,{"$f":"20*LOG10((E141*G141/(C141*S141))*Acs*Am)","v":8.4089671216876702},{"$f":"(F141+H141-(D141+T141))*radconv","v":-92.11828375372032},null,{"$f":"SUM((U142<0)*(U141>0))*A141","v":0},0,null,0,0]
[8035.8,{"$f":"A142/1000","v":8.0358000000000001},55.262887177202117,1.5527000123857138,1.0000127463315434,5.0489991392475685E-3,1,0,15195.397024578178,1.5707305173922792,7.9417352888168651,1.4445441268500347,1.0014225109462414,5.3307161047758858E-2,1,0,1,0,1.0004813847309648,6.0970931043006174E-2,4.2297805470849479,-102.45147131290416,77.548528687095839,null,1000000000,64574081.640000001,null,32.058944515854215,-10.284222967672337,null,8.308344064141501,-92.16724834523184,null,0,0,null,{"$f":"SUM((V143<-183)*(V142>-183))*A142","v":0},{"$f":"IF(AK142>0,U142,0)","v":0}]
[8128.3,8.1282999999999994,55.898810516148068,1.5529059041312463,1.0000130414642914,5.1071171045614016E-3,1,0,15370.311061602588,1.5707312663028417,8.031711199107658,1.4459659127319364,1.0014554245122125,5.3919597266283224E-2,1,0,{"$f":"IF(VOUT_setting=1,1,SQRT((1+Afbr-$Q$5*(A143)^2)^2+(A143*$Q$4)^2))","v":1},0,1.0004925506710105,6.167296364590362E-2,4.1284622151660892,-102.4538322216153,77.546167778384699,null,1000000000,66069260.890000001,null,32.057100477328675,-10.237893557171999,null,8.2088697707481799,-92.215938664443314,null,0,0,null,0,0]
[8222.9500000000007,8.2229500000000009,56.549517173022871,1.5531117880806169,1.0000133469532986,5.1665858841636143E-3,1,0,15549.290668144935,1.570732015179529,8.1237948710922812,1.4473881417700871,1.0014894918918273,5.4546226578039828E-2,1,0,1,0,1.0005041093692317,6.239132073076907E-2,4.0260011484997822,-102.45783842301981,77.542161576980192,null,1000000000,67616906.702500015,null,32.055263798519455,-10.192351958089381,null,8.1082453828910896,-92.265486464930447,null,0,0,null,0,0]
[8270.2750000000015,8.2702750000000016,56.874871384921079,1.5532129634110599,1.0000135010240201,5.1963202602870323E-3,1,0,15638.780471419323,1.5707323831899263,8.1698427650079282,1.4480872329461045,1.0015066730425313,5.4859525185780439E-2,1,0,1,0,1.00050993926211,6.2750501940820949E-2,3.975221302265211,-102.46042805511887,77.539571944881132,null,1000000000,68397448.575625017,null,32.054363753214417,-10.170268757576951,null,8.0583655819615601,-92.290159297541919,null,0,0,null,0,0]
[8317.6,8.3176000000000005,57.20022617239286,1.553312987772308,1.0000136559788864,5.2260546272218924E-3,1,0,15728.2702746958,1.5707327470125552,8.2158946069996759,1.4487784873464475,1.0015239524937636,5.5172813013490342E-2,1,0,1,0,1.0005158028564025,6.3109684942637689E-2,3.9247371359204477,-102.46340000130758,77.536599998692424,null,1000000000,69182469.760000005,null,32.053475514415545,-10.148633713644454,null,8.0087696544156728,-92.314766287663119,null,0,0,null,0,0]
[8366.0499999999993,8.3660499999999995,57.533315811874878,1.5534142179428745,1.0000138155332281,5.2564958237336515E-3,1,0,15819.887410857371,1.5707331152198269,8.2630452047915384,1.4494781917999588,1.0015417445366555,5.5493537022807113E-2,1,0,1,0,1.0005218407558751,6.3477408234247593E-2,3.8733555194221965,-102.46683202015113,77.533167979848869,null,1000000000,69990792.602499992,null,32.052578097002858,-10.126940830371989,null,7.9582854553301088,-92.339891189779138,null,0,0,null,0,0]
[8414.5,8.4145000000000003,57.86640603414488,1.553514282713585,1.0000139760142488,5.2869370105032877E-3,1,0,15911.504547021064,1.5707334791868843,{"$f":"SQRT(1+(A148/Zero2)^2)","v":8.3101998021495653},{"$f":"ATAN(A148/Zero2)","v":1.4501699559178354},1.0015596395983608,5.5814249604235623E-2,1,0,1,0,1.0005279139870411,6.3845133425047496E-2,3.8222764439934527,-102.47065142587932,77.529348574120675,null,1000000000,70803810.25,null,32.051692464387493,-10.105701997103667,null,7.9080920125167271,-92.364949428775631,null,0,0,null,0,0]
[8462.9500000000007,8.4629500000000011,58.199496829196534,1.5536132020920741,1.000014137421948,5.3173781874743887E-3,1,0,16003.121683186842,1.5707338389865522,8.3573583313736819,1.4508539134484557,1.0015776376733578,5.6134950692415399E-2,1,0,1,0,1.0005340225544661,6.4212860525768065E-2,3.7714962845802704,-102.47485170267325,77.525148297326751,null,1000000000,71621522.702500015,null,32.050818330697716,-10.084909551049568,null,7.8581859867933197,-92.389942151623686,null,0,0,null,0,0]
[8511.4,8.5114000000000001,58.53258818725125,1.553710995630637,1.0000142997563251,5.3478193545905403E-3,1,0,16094.738819354665,1.5707341946899978,8.4045207262777097,1.4515301951676474,1.0015957387560934,5.6455640222000086E-2,1,0,1,0,1.0005401664627425,6.4580589547135289E-2,3.7210114812480413,-102.47942647884528,77.520573521154716,null,1000000000,72443929.959999993,null,32.049955418062773,-10.064555999640204,null,7.8085640960960383,-92.414870479205078,null,0,0,null,0,0]
[8560.9500000000007,8.5609500000000001,58.873242563362624,1.5538098648971357,1.0000144667347877,5.3789516421839543E-3,1,0,16188.436014343657,1.5707345543049693,8.4527578185214605,1.4522140251265758,1.0016143573389937,5.6783598605121839E-2,1,0,1,0,1.0005464864195277,6.4956669419136678E-2,3.669682327531258,-102.48448597636254,77.515514023637465,null,1000000000,73289864.902500018,null,32.049084238628566,-10.044186664694665,null,7.7581061218134604,-92.440299311667872,null,0,0,null,0,0]
[8610.5,8.6105,59.213897508346129,1.5539075965835072,1.0000146346824832,5.4100839193505041E-3,1,0,16282.133209334714,1.5707349097810588,8.5009988186140184,1.4528900942774585,1.0016330836482181,5.711154476064139E-2,1,0,1,0,1.0005528433499247,6.533275132266371E-2,3.6186547640027551,-102.4899241361515,77.510075863848499,null,1000000000,74140710.25,null,32.048224232173553,-10.024261053565775,null,7.7079385647399681,-92.465663082585721,null,0,0,null,0,0]
[8660.0499999999993,8.66005,59.55455301243984,1.5540042102089417,1.0000148035994114,5.4412161860298456E-3,1,0,16375.830404327806,1.5707352611893102,8.5492436604026754,1.453558533383678,1.001651917677725,5.7439478618706206E-2,1,0,1,0,1.00055923725893,6.5708835269174468E-2,3.5679251840250181,-102.49573458511765,77.504265414882354,null,1000000000,74996466.002499983,null,32.047375125733765,-10.004771674131879,null,7.658058091202018,-92.490962910985772,null,0,0,null,0,0]
[8709.6,8.7096,59.895209066103909,1.5540997248486501,1.0000149734855717,5.4723484421616382E-3,1,0,16469.527599322897,1.5707356085991508,8.5974922792143857,1.4542194703008977,1.0016708594214376,5.776740010947954E-2,1,0,1,0,1.0005656681515702,6.6084921270121846E-2,3.517490045595796,-102.50191109123638,77.49808890876362,null,1000000000,75857132.160000011,null,32.046536653985953,-9.9857112007795994,null,7.6084614245206055,-92.516199890456775,null,0,{"$f":"IF(AH154>0,W154,0)","v":0},null,0,0]
[8760.3250000000007,8.7603249999999999,60.243943799651952,1.5541963855436423,1.0000151484042934,5.5042189395944404E-3,1,0,16565.446675331517,1.5707359601763438,8.6468888842501102,1.4548884396581152,1.0016903619082094,5.8103084856978203E-2,1,0,1,0,1.0005722898574965,6.6469927696704414E-2,3.4661602834272349,-102.5086068818224,77.491393118177598,null,1000000000,76743294.105625018,null,32.045689045912297,-9.9666355431335756,null,7.5579792704257027,-92.541971338688796,null,0,0,null,0,0]
[8811.0499999999993,8.8110499999999998,60.592679089597453,1.5542919335970014,1.0000153243387591,5.536089425845549E-3,1,0,16661.365751342153,1.5707363077054939,8.6962893149797651,1.4555498089692891,1.0017099772653053,5.8438756495628665E-2,1,0,1,0,1.0005789503326219,6.6854936300587128E-2,3.4151317817281459,-102.51567351567482,77.48432648432518,null,1000000000,77634602.102499992,null,32.044852043619414,-9.9479943530330068,null,7.507787771019502,-92.567679162641809,null,0,0,null,0,0]
[8861.7749999999996,8.8617749999999997,60.941414926388539,1.5543863881081657,1.0000155012889678,5.5679599008502259E-3,1,0,16757.284827354782,1.5707366512561147,8.7456935065745558,1.4562037064482607,1.001729705486095,5.8774414950559337E-2,1,0,1,0,1.0005856495824321,6.7239947094039992E-2,3.3644009410267657,-102.5231047413987,77.476895258601303,null,1000000000,78531056.15062499,null,32.044025385710384,-9.929780284058916,null,7.4578835882271477,-92.59332445733979,null,0,0,null,0,0]
[8912.5,8.9124999999999996,61.290151300690695,1.5544797677419548,1.0000156792549189,5.5998303645437338E-3,1,0,16853.203903369369,1.5707369908961368,{"$f":"SQRT(1+(A158/Zero2)^2)","v":8.7951013956574435},{"$f":"ATAN(A158/Zero2)","v":1.4568502574537132},1.0017495465639104,5.911006014691636E-2,1,0,1,0,1.0005923876124436,6.762496008932721E-2,3.3139642262721765,-102.53089444619565,77.469105553804354,null,1000000000,79432656.25,null,32.043208818113179,-9.9119861532911298,null,7.4082634410697645,-92.618908292904521,null,0,0,null,0,0]
[8964.4,8.9643999999999995,61.646966393122256,1.554574216943716,1.0000158623946025,5.6324390677161152E-3,1,0,16951.344860397614,1.5707373344253344,8.8456575373561961,1.4575043093756272,1.0017699640444984,5.9453466468095413E-2,1,0,1,0,1.000599321866849,6.8018893863653382E-2,3.2626599928811557,-102.53922938938057,77.460770610619434,null,1000000000,80360467.359999999,null,32.042383521492674,-9.8942071541975558,null,7.3577845042992465,-92.645022235183035,null,0,0,null,0,0]
[9016.2999999999993,9.0162999999999993,62.003782029155516,1.5546675790851294,1.0000160465976302,5.66504775891012E-3,1,0,17049.485817427838,1.5707376739996579,8.8962174200756543,1.4581509272234565,1.0017904996568923,5.9796858750858689E-2,1,0,1,0,1.0006062967306681,6.8412829968958908E-2,3.2116563823631425,-102.5479270929676,77.452072907032402,null,1000000000,81293665.689999983,null,32.04156827238446,-9.8768530652345383,null,7.3075961428894516,-92.671074027733042,null,0,0,null,0,0]
[9068.2000000000007,9.0682000000000009,62.360598199459332,1.5547598728244472,1.0000162318640011,5.6976564380564077E-3,1,0,17147.626774460008,1.5707380096870123,8.946780980392262,1.4587902364949157,1.0018111533938276,6.0140236915087568E-2,1,0,1,0,1.0006133122099119,6.8806768418361003E-2,3.160949807780896,-102.55698143556214,77.443018564437864,null,1000000000,82232251.24000001,null,32.040762820896489,-9.859916695212906,null,7.2576950197951762,-92.697064740349234,null,0,0,null,0,0]
[9120.1,9.1201000000000008,62.717414894914846,1.5548511163953869,1.000016418193715,5.7302651050856364E-3,1,0,17245.767731494088,1.5707383415537564,8.9973481563036071,1.4594223598906215,1.0018319252479986,6.0483600880683275E-2,1,0,1,0,1.000620368310627,6.920070922497025E-2,3.1105367462772104,-102.56638643161966,77.433613568380338,null,1000000000,83176224.010000005,null,32.039966924142924,-9.8433910131179019,null,7.2080778550450493,-92.722995418501768,null,0,0,null,0,0]
[9173.2000000000007,9.1732000000000014,63.082482221586716,1.5549434013569043,1.0000166099321357,5.7636277171211779E-3,1,0,17346.177843606041,1.5707386772072141,9.0490881942157966,1.4600617869534394,1.0018532996139515,6.0834889119124012E-2,1,0,1,0,1.0006276296056866,6.9603760942792414E-2,3.0592582275616254,-102.5763656889079,77.423634311092101,null,1000000000,84147598.24000001,null,32.039162267609726,-9.8269011060748923,null,7.157603992862672,-92.749464582833028,null,0,0,null,0,0]
[9226.2999999999993,9.2262999999999984,63.447550079318994,1.55503462433104,1.0000168027836382,5.7969903163260107E-3,1,0,17446.587955719922,1.5707390089971081,9.1008318899313387,1.4606939432184325,1.0018747976067506,6.1186162325191404E-2,1,0,1,0,1.0006349334352975,7.0006815155829738E-2,3.0082796900006805,-102.58669974587374,77.413300254126256,null,1000000000,85124611.689999983,null,32.038367119842903,-9.8108267024039737,null,7.1074206030685394,-92.775873043469801,null,0,0,null,0,0]
[9279.4,9.279399999999999,63.812618458997214,1.5551248035429719,1.0000169967482222,5.8303529026258738E-3,1,0,17546.99806783571,1.5707393369897644,9.1525791814125519,1.4613189514999778,1.0018964192184372,6.1537420413166691E-2,1,0,1,0,1.0006422798060461,7.0409871878101951E-2,2.9575975591250607,-102.59738260969392,77.402617390306077,null,1000000000,86107264.359999999,null,32.037581241993031,-9.7951607642485374,null,7.057524350042792,-92.802221845445374,null,0,0,null,0,0]
[9332.5,9.3324999999999996,64.177687351714269,1.5552139568032572,1.0000171918258869,5.8637154759465047E-3,1,0,17647.40817995336,1.5707396612499998,9.2043300080126134,1.4619369318730115,1.0019181644410087,6.1888663297353451E-2,1,0,1,0,1.0006496687245572,7.0812931123621484E-2,2.9072083242079301,-102.60840842066182,77.391591579338183,null,1000000000,87095556.25,null,32.036804401910516,-9.7798964106251933,null,7.0079119552081837,-92.828512010036619,null,0,0,null,0,0]
[9386.85,9.3868500000000008,64.551350667130819,1.5553041644781209,1.0000173926484672,5.897863407060183E-3,1,0,17750.181995277188,1.5707399893443401,9.2573026734577191,1.4625623043178635,1.0019405495582918,6.2248158776740156E-2,1,0,1,0,1.000657275650727,7.1225481208796695E-2,2.8559326226393589,-102.62004295654094,77.379957043459058,null,1000000000,88112952.922499999,null,32.036018398534026,-9.7646815810378857,null,6.9574222570161037,-92.855361375503065,null,0,0,null,0,0]
[9441.2000000000007,9.4412000000000003,64.925014501782798,1.5553933338067436,1.0000175946371488,5.9320113244189319E-3,1,0,17852.955810602904,1.5707403136612099,9.3102789181484749,1.4631805601620169,1.0019630641575699,6.2607638146505259E-2,1,0,1,0,1.0006649271655932,7.1638033967096074E-2,2.8049565247271433,-102.63202476524806,77.367975234751938,null,1000000000,89136257.440000013,null,32.035241391844103,-9.7498733631891099,null,6.9072231657938143,-92.88215140205898,null,0,0,null,0,0]
[9495.5499999999993,9.4955499999999997,65.298678846756417,1.5554814826131538,1.0000177977919305,5.9661592279431205E-3,1,0,17955.729625930471,1.5707406342654728,9.3632586813319865,1.4637918197315267,1.0019857082301147,6.2967101314830104E-2,1,0,1,0,1.0006726232763827,7.2050589413520896E-2,2.7542764636258892,-102.6443479731694,77.355652026830597,null,1000000000,90165469.80249998,null,32.034473153281887,-9.7354648613593202,null,6.8573113432547705,-92.908883111810056,null,0,0,null,0,0]
[9549.9,9.5498999999999992,65.672343693340764,1.555568628315781,1.0000180021128118,6.0003071175531216E-3,1,0,18058.503441259869,1.5707409512205162,9.4162419036186709,1.4643962006654323,1.002008481767148,6.3326548189921061E-2,1,0,1,0,1.0006803639903639,7.2463147563064323E-2,2.703888936011392,-102.65700683732292,77.342993162677075,null,1000000000,91200590.00999999,null,32.033713460705314,-9.7214493337004946,null,6.8076835082168436,-92.935557503622434,null,0,0,null,0,0]
[9605.5249999999996,9.6055250000000001,66.054774877109125,1.5556567974607423,1.0000182124343222,6.0352560701195388E-3,1,0,18163.688233859655,1.5707412718970351,9.4704715837730937,1.4650077572523836,1.0020319235965642,6.3694410384591255E-2,1,0,1,0,1.0006883324868479,7.2885386754285755E-2,2.6526186812577812,-102.67030436659162,77.329695633408377,null,1000000000,92266110.52562499,null,32.032944570202943,-9.7075050469269755,null,6.7571821439656068,-92.962799319664654,null,0,0,null,0,0]
[9661.15,9.6611499999999992,66.437206568462315,1.5557439515524019,1.0000184239772838,6.0702050079425047E-3,1,0,18268.873026461297,1.570741588880902,9.5247047655639481,1.4656123497194566,1.0020555010171848,6.4062255318136405E-2,1,0,1,0,1.000696347719306,7.3307628808689976E-2,2.6016476181120174,-102.68394171659764,77.316058283402356,null,1000000000,93337819.32249999,null,32.032184180190747,-9.6939585742679668,null,6.7069714708320358,-92.989983142329692,null,0,0,null,0,0]
[9716.7749999999996,9.7167750000000002,66.819638758685073,1.5558301080179409,1.0000186367416957,6.1051539309366562E-3,1,0,18374.057819064747,1.5707419022355347,9.5789413895154922,1.4662100959148339,1.0020792140194392,6.4430082892232315E-2,1,0,1,0,1.0007044096956643,7.3729873742323135E-2,2.5509721878361247,-102.6979131325657,77.302086867434298,null,1000000000,94415716.40062499,null,32.031432072030476,-9.680803161519993,null,6.657048148716413,-93.017109971045699,null,0,0,null,0,0]
[9772.4,9.7723999999999993,67.202071439260564,1.5559152838879022,1.0000188507275571,6.1401028390166259E-3,1,0,18479.242611669979,1.5707422120229062,9.6331813974876894,1.4668011110523254,1.0021030625937024,6.479789300858288E-2,1,0,1,0,1.0007125184238954,7.4152121571222085E-2,2.500588894981874,-102.7122129878515,77.287787012148499,null,1000000000,95499801.75999999,null,32.030688033226937,-9.6680322053368251,null,6.6074088946657046,-93.044180782514673,null,0,0,null,0,0]
[9829.2999999999993,9.8292999999999999,67.59327049117806,1.5560014148867369,1.0000190708820282,6.1758528076720351E-3,1,0,18586.838381545731,1.5707425252833134,9.6886681015817597,1.4673988262309146,1.0021275980682145,6.517411566371091E-2,1,0,1,0,1.0007208613950478,7.4584050901963239E-2,2.4493494281631651,-102.72717469767598,77.272825302324023,null,1000000000,96615138.48999998,null,32.029935073656127,-9.6553595670335373,null,6.5569223874178064,-93.07181513064242,null,0,0,null,0,0]
[9886.2000000000007,9.8862000000000005,67.984470038768691,1.5560865546478231,1.0000192923145834,6.211602760541027E-3,1,0,18694.434151423291,1.5707428349377814,9.7441582276609964,1.4679897339929904,1.0021522753804031,6.5550319843636504E-2,1,0,1,0,1.0007292533028873,7.5015983296133903E-2,2.3984084420634932,-102.74246856126678,77.257531438733224,null,1000000000,97736950.440000013,null,32.0291901266135,-9.6430756998100797,null,6.5067263483607576,-93.099392861456707,null,0,0,null,0,0]
[9943.1,9.9431000000000012,68.375670073524716,1.5561707201835218,1.000019515025222,6.2473526975322293E-3,1,0,18802.029921302616,1.5707431410482162,9.7996517175948412,1.4685739495695109,1.0021770945197908,6.5926505443240371E-2,1,0,1,0,1.0007376941560953,7.5447918770868747E-2,2.3477623912289443,-102.7580889496239,77.241911050376103,null,1000000000,98865237.610000014,null,32.028452983294372,-9.6311739989429253,null,6.4568174408453372,-93.12691495068097,null,0,0,null,0,0]
[10000,10,68.766870587132004,1.5562539281191308,1.0000197390139427,6.2831026185542743E-3,1,0,18909.625691183686,1.5707434436751142,9.8551485145585751,1.469151585614368,1.0022020554758406,6.6302672357434589E-2,1,0,1,0,1.0007461839634013,7.5879857343292223E-2,2.2974077931431176,-102.77403035914566,77.225969640854345,null,1000000000,100000000,null,32.02772344076233,-9.6196480072846242,null,6.40719238529155,-93.154382351861031,null,0,0,null,0,0]
[10058.25,10.058249999999999,69.167353147042789,1.5563381352459511,1.0000199696409096,6.3197007196591536E-3,1,0,19019.77426052768,1.5707437499353207,9.9119653870171422,1.4697362260022033,1.0022277555440022,6.6687744680347091E-2,1,0,1,0,1.0007549259177324,7.6322047245599184E-2,2.2461568259652167,-102.790676910122,77.209323089877998,null,1000000000,101168393.0625,null,32.026984256731495,-9.6082311468431811,null,6.3566806021444879,-93.182445763278821,null,0,0,null,0,0]
[10116.5,10.1165,69.567836191761415,1.5564213728584657,1.0000202016073234,6.356298803834334E-3,1,0,19129.922829873434,1.5707440526686836,9.9687856088091209,1.4703142019030186,1.0022536042155565,6.7072797197899117E-2,1,0,1,0,1.000763719195348,7.6764240430614569E-2,2.1952041151648145,-102.80764861121818,77.192351388781816,null,1000000000,102343572.25,null,32.026252626033077,-9.5971947965442013,null,6.306459522042501,-93.210453814673983,null,0,0,null,0,0]
[10174.75,10.17475,69.968319712963066,1.5565036576033815,1.0000204349131836,6.3928968709817905E-3,1,0,19240.071399220924,1.5707443519357758,10.025609122987396,1.4708856262470105,1.0022796014790063,6.745782979744748E-2,1,0,1,0,1.0007725638057765,7.7206436916676655E-2,2.1445461197909399,-102.82493994386954,77.175060056130462,null,1000000000,103525537.5625,null,32.025528348795568,-9.5865324829806635,null,6.256525803906138,-93.238407460888894,null,0,0,null,0,0]
[10233,10.233000000000001,70.368803702512466,1.5565850057484976,1.000020669558489,6.4294949210034922E-3,1,0,19350.219968570116,1.5707446477957911,10.082435873885363,1.4714506094357174,1.002305747322789,6.7842842366384229E-2,1,0,1,0,1.0007814597586011,7.7648636722112141E-2,2.0941793616865558,-102.84254551260537,77.157454487394631,null,1000000000,104714289,null,32.024811230770474,-9.576237877549918,null,6.2068761638268475,-93.266307635055441,null,0,0,null,0,0]
[10292.5,10.2925,70.777882244355325,1.5566671491289228,1.0000209106219691,6.466878319122603E-3,1,0,19462.732241125956,1.5707449465473522,10.140485368027123,1.472021178981693,1.0023326076212626,6.8236096210576885E-2,1,0,1,0,1.0007905996285924,7.8100329239787075E-2,2.0430288982630773,-102.86084782145393,77.13915217854607,null,1000000000,105935556.25,null,32.024085918954427,-9.5660955533883332,null,6.1564510122194163,-93.294752268065579,null,0,0,null,0,0]
[10352,10.352,71.186961258285592,1.5567483484287705,1.0000211530829963,6.5042616991663063E-3,1,0,19575.244513683512,1.5707452418646555,10.198538125818452,1.4725852530461183,1.0023596229207352,6.8629328917857599E-2,1,0,1,0,1.0007997930885451,7.8552025259442687E-2,1.9921751637382135,-102.87946699600899,77.120533003991014,null,1000000000,107163904,null,32.023367684351328,-9.5563239850816011,null,6.1063155122976509,-93.323143010927396,null,0,0,null,0,0]
[10411.5,10.4115,71.596040736211165,1.5568286198295869,1.0000213969415694,6.5416450610301276E-3,1,0,19687.756786242757,1.5707455338065797,10.25659409184216,1.4731429415671555,1.0023867932086743,6.902254036832757E-2,1,0,1,0,1.0008090401488494,7.9003724800572897E-2,1.9416146446345315,-102.89839766203893,77.101602337961069,null,1000000000,108399332.25,null,32.0226563369133,-9.5469168701407874,null,6.056466340632003,-93.351480791898112,null,0,0,null,0,0]
[10471,10.471,72.005120670223818,1.5569079791452403,1.0000216421976877,6.5790284046095939E-3,1,0,19800.26905880366,1.5707458224306652,10.314653211925695,1.4736943520237817,1.0024141184724773,6.941573044212733E-2,1,0,1,0,1.0008183408199538,7.9455427882658844E-2,1.8913438895857901,-102.91763456507134,77.082365434928661,null,1000000000,109641841,null,32.021951691933026,-9.5378680469035082,null,6.0069002305635344,-93.379766518167813,null,0,0,null,0,0]
[10532,10.532,72.424514009137809,1.5569884084288086,1.0000218950875697,6.6173541663311951E-3,1,0,19915.617775212329,1.5707461149454975,10.374179226202303,1.4742532561157449,1.0024422934807522,6.9818810553469918E-2,1,0,1,0,1.0008279316278954,7.9918522133765157E-2,1.8401030689721087,-102.93766896873267,77.062331031267334,null,1000000000,110923024,null,32.021236052910524,-9.5289567503221804,null,5.9563750489723519,-93.4087122184105,null,0,0,null,0,0]
[10593,10.593,72.843907811161785,1.5570679115807213,1.0000221494463468,6.6556799086125353E-3,1,0,20030.966491622683,1.5707464040914247,10.43370844412339,1.4748057827568128,1.0024706313502407,7.0221867941734573E-2,1,0,1,0,1.0008375788062089,8.0381620148038624E-2,1.7891596538804313,-102.95801443174655,77.041985568253452,null,1000000000,112211649,null,32.02052708182832,-9.520409359801107,null,5.9061406049628786,-93.437605071945427,null,0,0,null,0,0]
[10654,10.654,73.263302068342568,1.5571465045048287,1.0000224052740185,6.6940056313410396E-3,1,0,20146.315208034692,1.5707466899263138,10.493240811165158,1.4753520401522411,1.0024991320671324,7.062490247789624E-2,1,0,1,0,1.0008472823663481,8.0844721946428208E-2,1.7385101191033139,-102.97866566276161,77.021334337238386,null,1000000000,113507716,null,32.019824595986215,-9.5122196715587588,null,5.8561935560278675,-93.466445991202832,null,0,0,null,0,0]
[10715,10.715,73.682696772908031,1.5572242027429348,1.0000226625705833,6.7323313344041322E-3,1,0,20261.66392444833,1.5707469725067131,10.552776274031322,1.475892134080605,1.002527795617538,7.1027914032974176E-2,1,0,1,0,1.0008570423198322,8.1307827549868275E-2,1.6881510017852273,-102.99961748864757,77.000382511352427,null,1000000000,114811225,null,32.019128417830871,-9.5043816207791298,null,5.8065306168651185,-93.495235867868416,null,0,0,null,0,0]
[10777.5,10.7775,74.11240491809167,1.5573028995180491,1.0000229277176294,6.7715994522740105E-3,1,0,20379.849084709862,1.57074725871808,10.613778880163798,1.4764392244653417,1.002557332883641,7.1440811737737392E-2,1,0,1,0,1.0008671007747647,8.178232496444228E-2,1.636851205876269,-103.02139100806872,76.978608991931281,null,1000000000,116154506.25,null,32.018421482362164,-9.4967093452697053,null,5.7559377564248688,-93.524681662798997,null,0,0,null,0,0]
[10840,10.84,74.542113516975135,1.557380688976169,1.0000231944066951,6.8108675492601686E-3,1,0,20498.034244973045,1.5707475416290391,10.674784626775043,1.4769800618336923,1.0025870410601565,7.1853685043313659E-2,1,0,1,0,1.0008772184552794,8.225682641794721E-2,1.5858491203345846,-103.04346945904425,76.956530540955754,null,1000000000,117505600,null,32.017720807066461,-9.4893937541389555,null,5.7056363461788937,-93.554075704905301,null,0,0,null,0,0]
[10902.5,10.9025,74.971822561757122,1.5574575867174993,1.0000234626377791,6.8501356252415237E-3,1,0,20616.219405237851,1.5707478212963502,10.735793460328102,1.4775147524695256,1.0026169201318917,7.226653381111775E-2,1,0,1,0,1.000887395373981,8.2731331932851662E-2,1.5351412146751164,-103.06584764238909,76.934152357610913,null,1000000000,118864506.25,null,32.017026216671191,-9.4824287530815319,null,5.6556230309146898,-93.583418889307524,null,0,0,null,0,0]
[10965,10.965,75.401532044814161,1.5575336079866682,1.0000237324108803,6.8894036800969897E-3,1,0,20734.40456550425,1.5707480977754797,10.7968053284934,1.4780434002685463,1.0026469700835683,7.2679357902614414E-2,1,0,1,0,1.0008976315435463,8.3205841531607719E-2,1.4847240208546766,-103.08852047530439,76.911479524695608,null,1000000000,120231225,null,32.016337540850628,-9.4758083845525309,null,5.6058945129148157,-93.612712090751856,null,0,0,null,0,0]
[11028.75,11.02875,75.839836161317365,1.557610262189254,1.0000240091680284,6.9294570741601051E-3,1,0,20854.953428977591,1.5707483765559382,10.859040507233292,1.4785765010204883,1.0026777970588607,7.3100412910790946E-2,1,0,1,0,1.0009081334899641,8.368984555278984E-2,1.4335944414378143,-103.11194515958088,76.888054840419116,null,1000000000,121633326.5625,null,32.015641013051265,-9.4694046092587243,null,5.5554614612973197,-93.642540550322167,null,0,0,null,0,0]
[11092.5,11.092499999999999,76.27814071832411,1.5576860354613618,1.0000242875294882,6.9695104459893756E-3,1,0,20975.502292452533,1.570748652132024,10.921278736900581,1.4791035258471292,1.0027088017852641,7.3521441954750175E-2,1,0,1,0,1.0009186971078516,8.4173853869943763E-2,1.3827602222966191,-103.13566607131352,76.864333928686477,null,1000000000,123043556.25,null,32.014950295832477,-9.4633472876046056,null,5.5053179593749082,-93.672318783708903,null,0,0,null,0,0]
[11156.25,11.15625,76.716445708284198,1.5577609429012058,1.000024567495259,7.0095637954563066E-3,1,0,21096.051155929053,1.5707489245586685,10.983519965630936,1.4796245777460422,1.0027399842462901,7.3942444887639722E-2,1,0,1,0,1.0009293224108935,8.4657866506842192E-2,1.3322178745387236,-103.1596781703428,76.840321829657199,null,1000000000,124461914.0625,null,32.014265223301052,-9.4576305129972553,null,5.4554606841484379,-93.702047657345545,null,0,0,null,0,0]
[11220,11.22,77.154751123818983,1.5578349992639562,1.0000248490653389,7.0496171224324047E-3,1,0,21216.600019407117,1.5707491938895557,11.045764142726538,1.480139757406328,1.0027713444253581,7.4363421562662388E-2,1,0,1,0,1.0009400094128524,8.5141883487239459E-2,1.2819639707049868,-103.18397652905051,76.816023470949489,null,1000000000,125888400,null,32.013585634234033,-9.4522485110411107,null,5.4058863693817241,-93.731728018009392,null,0,0,null,0,0]
[11285.5,11.285500000000001,77.605088888400942,1.5579102172605415,1.0000251400357658,7.0907699289415073E-3,1,0,21340.458067374399,1.5707494674445861,11.109720002298769,1.4806630664620173,1.0028037505573653,7.4795926956932768E-2,1,0,1,0,1.0009510540607491,8.5639191757208813E-2,1.2306274385827525,-103.2092349926703,76.790765007329696,null,1000000000,127362510.25,null,32.012892936418424,-9.447061518020254,null,5.3552425350750967,-93.762173474650041,null,0,0,null,0,0]
[11351,11.351000000000001,78.055427086986469,1.5579845673220685,1.0000254326997877,7.1319227114330251E-3,1,0,21464.316115343263,1.5707497378425634,11.173678869465224,1.4811803847476437,1.0028363442626167,7.5228404317933137E-2,1,0,1,0,1.0009621638711588,8.6136504663198138E-2,1.1795882612135165,-103.23478545304194,76.765214546958063,null,1000000000,128845201,null,32.012205696666776,-9.4422159837665554,null,5.3048905974575078,-93.792569469275406,null,0,0,null,0,0]
[11416.5,11.416499999999999,78.505765712106751,1.5580580643841146,1.0000257270574033,7.1730754697675904E-3,1,0,21588.174163313673,1.5707500051378267,11.237640692872869,1.4816918142777959,1.0028691255228239,7.5660853486626489E-2,1,0,1,0,1.0009733388592665,8.6633822230911317E-2,1.1288429142701741,-103.26062291638756,76.739377083612439,null,1000000000,130336472.25,null,32.011523754500672,-9.4377060572758555,null,5.2548271926802625,-93.822916859111714,null,0,0,null,0,0]
[11482,11.481999999999999,78.956104756463347,1.5581307230415453,1.0000260231086109,7.2142282038058373E-3,1,0,21712.032211285612,1.570750269383475,11.301605422328862,1.4821974547700207,1.0029020943195952,7.6093274304038672E-2,1,0,1,0,1.0009845790403451,8.7131144486031264E-2,1.0783879356577046,-103.28674250095008,76.713257499049917,null,1000000000,131836324,null,32.010846953980639,-9.4335260190874006,null,5.2050490145878348,-93.853216481862688,null,0,0,null,0,0]
[11548.75,11.54875,79.415038481321105,1.5582039205236324,1.0000263265520304,7.2561662702233546E-3,1,0,21838.253962464667,1.5707505355882339,11.366793791700299,1.4827068900012998,1.0029358852118564,7.6533918094571815E-2,1,0,1,0,1.0009961008156527,8.7637962472893557E-2,1.0272652877726365,-103.31364585838507,76.686354141614927,null,1000000000,133373626.5625,null,32.010162370297145,-9.4295998122707143,null,5.1546109503862585,-93.884046046114364,null,0,0,null,0,0]
[11615.5,11.615500000000001,79.873972626784877,1.5582762768604141,1.0000266317542965,7.2981043111161291E-3,1,0,21964.475713645246,1.5707507987334313,11.431985077387012,1.4832105152184016,1.0029698708279757,7.6974532108238888E-2,1,0,1,0,1.0010076903282559,8.8144785381566171E-2,0.97643712813619921,-103.34083231310839,76.659167686891607,null,1000000000,134919840.25,null,32.009482813131662,-9.4260046133569642,null,5.1044623479153026,-93.914827699751427,null,0,0,null,0,0]
[11682.25,11.68225,{"$f":"SQRT(1+(A205/pole1)^2)","v":80.332907185645993},{"$f":"ATAN(A205/pole1)","v":1.5583478064672847},{"$f":"SQRT(1+(A205/Zero1)^2)","v":1.0000269387154077},{"$f":"ATAN(A205/Zero1)","v":7.3400423263366614E-3},{"$f":"IF(VIN_nom>Vout, 1, SQRT(1+(A205/z_RHP)^2))","v":1},{"$f":"IF(VIN_nom>Vout, 0, -ATAN(A205/z_RHP))","v":0},{"$f":"SQRT(1+(A205/Pole2)^2)","v":22090.697464827332},{"$f":"ATAN(A205/Pole2)","v":1.5707510588715123},11.497179229780732,1.4837084289997933,{"$f":"SQRT(1+(A205/pole4)^2)","v":1.0030040511481595},{"$f":"ATAN(A205/pole4)","v":7.7415116176993301E-2},{"$f":"IF(VOUT_setting=1,1,SQRT(1+(A205*zterm1)^2))","v":1},{"$f":"IF(VOUT_setting=1,0,ATAN(((A205*zterm1))))","v":0},1,{"$f":"IF(VOUT_setting=1,0,ATAN(A205*$Q$4/(1+Afbr-$Q$5*(A205)^2)))","v":0},{"$f":"SQRT((1-(Z205/pterm2))^2+(A205/pterm1)^2)","v":1.0010193475945974},{"$f":"IF((ATAN((A205/pterm1)/(1-A205^2/pterm2))>0),ATAN((A205/pterm1)/(1-A205^2/pterm2)),PI()+ATAN((A205/pterm1)/(1-A205^2/pterm2)))","v":8.8651613239163166E-2},{"$f":"20*LOG10(((E205*K205*G205*O205)/(C205*I205*S205*M205*Q205))*Adc)","v":0.92589998283591723},{"$f":"((F205+L205+H205+P205)-(D205+J205+T205+N205+R205))*radconv","v":-103.36829703786968},{"$f":"IF(V205>0,V205,V205+180)","v":76.631702962130319},null,{"$f":"IF(U205<0,A205,1000000000)","v":1000000000},{"$f":"A205^2","v":136474965.0625},null,{"$f":"20*LOG10((K205/(I205*M205))*AEA)","v":32.008808131034108},{"$f":"(L205-(J205+N205))*radconv","v":-9.4227347675925568},null,{"$f":"20*LOG10((E205*G205/(C205*S205))*Acs*Am)","v":5.0545998847125739},{"$f":"(F205+H205-(D205+T205))*radconv","v":-93.945562270277151},null,{"$f":"SUM((U206<0)*(U205>0))*A205","v":0},0,null,0,0]
[11749,{"$f":"A206/1000","v":11.749000000000001},80.791842150859623,1.5584185234321288,1.0000272474353622,7.3819803157374559E-3,1,0,22216.919216010894,1.5707513160537305,11.562376200389913,1.4842007277119929,1.0030384261525027,7.7855670132857727E-2,1,0,1,0,1.0010310726312135,8.9158446072775607E-2,0.87565043898038475,-103.39603531332338,76.603964686676619,null,1000000000,138039001,null,32.008138176823564,-9.4197847468949085,null,5.0050202950675837,-93.976250566428476,null,0,0,null,{"$f":"SUM((V207<-183)*(V206>-183))*A206","v":0},{"$f":"IF(AK206>0,U206,0)","v":0}]
[11817.5,11.817500000000001,81.262809534158521,1.558490263959482,1.0000275660777125,7.4250177759890264E-3,1,0,22346.450151683926,1.570751576957963,11.629285335175398,1.4847001941109319,1.0030739047603821,7.8307742708886782E-2,1,0,{"$f":"IF(VOUT_setting=1,1,SQRT((1+Afbr-$Q$5*(A207)^2)^2+(A207*$Q$4)^2))","v":1},0,1.0010431755419236,8.9678571860379253E-2,0.82437898542024268,-103.42478037308949,76.57521962691051,null,1000000000,139653306.25,null,32.007455423708578,-9.4170842295754671,null,4.9544315946224344,-94.007696143514011,null,0,0,null,0,0]
[11886,11.885999999999999,81.733777330873053,1.5585611777181614,1.0000278865723358,7.4680552087345326E-3,1,0,22475.981087358461,1.5707518348549701,11.696197337887488,1.4851939459032188,1.0031095883515628,7.8759783214161841E-2,1,0,1,0,1.0010553498585766,9.0198702946066758E-2,0.77340331974584475,-103.45380378065666,76.546196219343344,null,1000000000,141276996,null,32.006777348760508,-9.4147091252789679,null,4.9041340038961057,-94.039094655377681,null,0,0,null,0,0]
[11954.5,11.954499999999999,82.204745533897622,1.5586312789176409,1.0000282089192301,7.5110926138145699E-3,1,0,22605.512023034473,1.5707520897964466,11.763112159585386,1.4856820803691735,1.0031454769041699,7.9211791467374781E-2,1,0,1,0,1.001067595599352,9.0718839359039946E-2,0.72271994467597855,-103.483100770672,76.516899229328004,null,1000000000,142910070.25,null,32.006103806014437,-9.4126538528273702,null,4.8541241715723062,-94.070446917844635,null,0,0,null,0,0]
[12023,12.023,82.675714136288462,1.5587005814436441,1.0000285331183936,7.5541299910697373E-3,1,0,22735.042958711936,1.5707523418329092,11.830029752433552,1.4861646925988639,1.0031815703962061,7.9663767287296058E-2,1,0,1,0,1.0010799127825332,9.1238981128474547E-2,0.67232542446716859,-103.5126666846608,76.4873333153392,null,1000000000,144552529,null,32.005434653634602,-9.4109129564717566,null,4.8043988037433341,-94.101753728189038,null,0,0,null,0,0]
[12093,12.093,83.156996325272246,1.558770590565195,1.0000288663303611,7.5981097637329844E-3,1,0,22867.410338237827,1.5707525964386593,11.89841550821304,1.4866522647578455,1.003218665953814,8.0125606693040891E-2,1,0,1,0,1.001092573510372,9.1770518427684633E-2,0.62112227421267108,-103.54315311010808,76.456846889891921,null,1000000000,146240649,null,32.00475524048742,-9.4094531661492908,null,4.7538750666360183,-94.133699943958788,null,0,0,null,0,0]
[12163,12.163,83.638278917140852,1.5588397939753453,1.0000292014766041,7.6420895070028472E-3,1,0,22999.777717765188,1.570752848113816,11.966804060233709,1.4871342642217777,1.0032559754777355,8.0587411847107271E-2,1,0,1,0,1.001105308882674,9.2302061382032383E-2,0.57021370403603988,-103.57391085891216,76.426089141087843,null,1000000000,147938569,null,32.004080125215964,-9.4083105373467788,null,4.7036416117308422,-94.165600321565393,null,0,0,null,0,0]
[12233,12.233000000000001,84.119561904979079,1.5589082055028562,1.0000295385571196,7.6860692207092246E-3,1,0,23132.145097293982,1.5707530969086883,12.035195360827649,1.487610785767099,1.0032934989440998,8.1049182556354585E-2,1,0,1,0,1.001118118919287,9.2833610022567042E-2,0.51959623743897498,-103.6049352867178,76.395064713282196,null,1000000000,149646289,null,32.003409168942795,-9.4074796315906486,null,4.6536951014069485,-94.197455655127186,null,0,0,null,0,0]
[12303,12.303000000000001,84.60084528202907,1.5589758386618386,1.0000298775719065,7.7300489046820114E-3,1,0,23264.512476824195,1.5707533428724394,12.103589363402437,1.4880819220381072,1.0033312363289038,8.1510918627729731E-2,1,0,1,0,1.0011310036401713,9.336516438030884E-2,0.46926645894684282,-103.63622185324213,76.363778146757866,null,1000000000,151363809,null,32.002742236716827,-9.4069551325093439,null,4.6040322551407833,-94.229266720732795,null,0,0,null,0,0]
[12374.5,12.374499999999999,85.092442269246433,1.5590441312682564,1.0000302258481819,7.7749709795812139E-3,1,0,23399.716300202923,1.570753591234026,{"$f":"SQRT(1+(A215/Zero2)^2)","v":12.173451693845593},{"$f":"ATAN(A215/Zero2)","v":1.4885576886377867},1.0033700031903596,8.1982513083672354E-2,1,0,1,0,1.0011442415850733,9.3908115123083322E-2,0.41815169753828874,-103.6684448559875,76.331555144012498,null,1000000000,153128250.25,null,32.002065031052581,-9.4067303163521583,null,4.553594699396478,-94.261714539635335,null,0,0,null,0,0]
[12446,12.446,85.584039648765582,1.5591116393252848,1.0000305761425097,7.819893023100136E-3,1,0,23534.920123583073,1.5707538367420284,12.243316748349397,1.4890280255300496,1.0034089931853678,8.245407099449191E-2,1,0,1,0,1.0011575574917528,9.4451071896041031E-2,0.36733007121924188,-103.70093209660561,76.299067903394388,null,1000000000,154902916,null,32.001391751098019,-9.40681434213462,null,4.5034463530319906,-94.294117754470989,null,0,0,null,0,0]
[12517.5,12.5175,86.075637413864939,1.5591783762745299,1.0000309284548878,7.8648150350575045E-3,1,0,23670.123946964632,1.5707540794453458,12.313184480544859,1.4894930249330944,1.003448206287918,8.2925592154742989E-2,1,0,1,0,1.001170951381847,9.4994034732144267E-2,0.31679812827482617,-103.73367905445981,76.266320945540187,null,1000000000,156687806.25,null,32.000722264889895,-9.4072019171737544,null,4.4535838962956982,-94.326477137286076,null,0,0,null,0,0]
[12589,12.589,86.567235557975621,1.5592443552522957,1.0000312827853142,7.9097370152720493E-3,1,0,23805.327770347565,1.5707543193917666,12.383054845107726,1.4899527769931376,1.0034876424718551,8.3397076359077518E-2,1,0,1,0,1.0011844232771159,9.5537003664322856E-2,0.26655247740907784,-103.76668131007673,76.233318689923266,null,1000000000,158482921,null,32.000056444192339,-9.4078878674442912,null,4.4040040661275119,-94.358793442632461,null,0,{"$f":"IF(AH218>0,W218,0)","v":0},null,0,0]
[12662.25,12.66225,87.070866210822629,1.5593111764956384,1.000031647880903,7.9557584514055955E-3,1,0,23943.840778220292,1.5707545624008901,12.454638006970042,1.4904184322910854,1.0035282751878372,8.3880061848253196E-2,1,0,1,0,1.0011983058193323,9.6093268401991797E-2,0.21537044299442878,-103.80075154325652,76.199248456743476,null,1000000000,160332575.0625,null,31.999377998086906,-9.4088947376581125,null,4.3535004778182866,-94.391856805598394,null,0,0,null,0,0]
[12735.5,12.7355,87.574497247976268,1.5593772291764347,1.0000320150945299,8.0017798538383009E-3,1,0,24082.353786094423,1.5707548026146121,12.526223838565624,1.4908787653621673,1.0035691419828723,8.4363008114337432E-2,1,0,1,0,1.0012122702785209,9.6649539607661233E-2,0.16448186902851245,-103.83508064722113,76.164919352778867,null,1000000000,162192960.25,null,31.99870313810257,-9.4102041415269984,null,4.3032867638367103,-94.424876505694115,null,0,0,null,0,0]
[12808.75,12.80875,88.078128662844122,1.5594425264780432,1.0000323844261925,8.0478012223752574E-3,1,0,24220.866793969926,1.5707550400808912,12.597812294382985,1.4913338667420268,1.0036102428283651,8.4845914936853478E-2,1,0,1,0,1.0012263166784809,9.7205817316631665E-2,0.11388329723042104,-103.86966418216029,76.130335817839708,null,1000000000,164064076.5625,null,31.998031737723295,-9.4118108818561179,null,4.253359592417894,-94.457853300304194,null,0,0,null,0,0]
[12882,12.882,88.581760448983715,1.5595070812840317,1.0000327558758886,8.0938225568215564E-3,1,0,24359.379801846779,1.5707552748465952,12.669403329937627,1.491783824928729,1.0036515776955619,8.5328782095434305E-2,1,0,1,0,1.001240445043148,9.7762101564167064E-2,6.357132986478628E-2,-103.90449780777338,76.095502192226618,null,1000000000,165945924,null,31.997363674013904,-9.4137098781390645,null,4.2037156887616476,-94.490787929634308,null,0,0,null,0,0]
[12957.25,12.95725,89.099143653652831,1.5595726387267879,1.0000331396731215,8.1411004107702079E-3,1,0,24501.674734854758,1.5707555132582263,12.742951710199756,1.4922408038092601,1.0036942848228736,8.5824791805628464E-2,1,0,1,0,1.0012550445426824,9.8333581305909343E-2,1.2180598429427557E-2,-103.94053849017436,76.059461509825638,null,1000000000,167890327.5625,null,31.996680718705889,-9.4159598399324782,null,4.1530079126343047,-94.524578650241878,null,12957.25,76.059461509825638,null,0,0]
[13032.5,13.032500000000001,89.616527236828802,1.5596374392035397,1.0000335257056223,8.1883782283241804E-3,1,0,24643.969667864112,1.570755748916667,12.816502721026422,1.4926925377863154,1.0037372388636578,8.6320759185247439E-2,1,0,1,0,1.0012697305955665,9.8905068023474499E-2,-3.8914743423088462E-2,-103.97683413111245,76.023165868887546,null,13032.5,169846056.25,null,31.996001032835185,-9.4185077294498516,null,4.1025922566524962,-94.558326401662598,null,0,0,null,0,0]
[13107.75,13.107749999999999,90.133911191993519,1.5597014957490782,1.0000339139733885,8.2356560092721673E-3,1,0,24786.26460087482,1.5707559818693351,12.890056317387412,1.4931391164597745,1.0037804397862173,8.6816683995741523E-2,1,0,1,0,1.001284503228197,9.9476561754972867E-2,-8.9718189022823636E-2,-104.01338033497581,75.986619665024193,null,13107.75,171813110.0625,null,31.995324494144839,-9.421348402045183,null,4.0524653497431009,-94.592031932930638,null,0,0,null,0,0]
[13183,13.183,90.65129551277775,1.5597648211006401,1.0000343044764173,8.2829337534028637E-3,1,0,24928.559533886859,1.5707562121625647,12.963612455272916,1.4935806274042733,1.0038238875586765,8.7312565998685684E-2,1,0,1,0,1.0012993624671218,0.10004806253847322,-0.14023317036276545,-104.05017280508459,75.949827194915414,null,13183,173791489,null,31.994650983854854,-9.4244768290554379,null,4.0026238786931483,-94.625695976029178,null,0,0,null,0,0]
[13259.75,13.25975,91.178993512452251,1.5598286684559208,1.0000347050660985,8.3311538728932568E-3,1,0,25073.69091074766,1.5707564443538222,13.038637401884666,1.4940258077276551,1.00386845564629,8.7818288349601176E-2,1,0,1,0,1.0013146071442436,0.10063096266786134,-0.19146144446789071,-104.0879480033155,75.912051996684497,null,13259.75,175820970.0625,null,31.993967047995415,-9.42795893529936,null,3.9520795404474631,-94.659989068016188,null,0,0,null,0,0]
[13336.5,13.336499999999999,91.706691879539008,1.5598917810309421,1.0000351079810386,8.379373953639923E-3,1,0,25218.822287609797,1.5707566738726126,13.113664902997682,1.4944658940973605,1.0039132804555428,8.8323965668748824E-2,1,0,1,0,1.0013299419710779,0.10121387021305586,-0.24239666222159892,-104.12597065764862,75.874029342351378,null,13336.5,177862232.25,null,31.993286023434528,-9.4317301703389766,null,3.9018253472546376,-94.694240487309642,null,0,0,null,0,0]
[13413.25,13.41325,92.234390607731768,1.5599541714368459,1.0000355132212346,8.4275939954186647E-3,1,0,25363.953664473247,1.5707569007648112,13.18869491501602,1.494900973279409,1.0039583619520485,8.8829597703564689E-2,1,0,1,0,1.0013453669762771,0.10179678521431254,-0.29304227690094337,-104.16423650979928,75.835763490200719,null,13413.25,179915275.5625,null,31.992607794584359,-9.4357855510051714,null,3.8518579614254618,-94.728450958794141,null,0,0,null,0,0]
[13490,13.49,92.762089690867867,1.560015851997832,1.0000359207866838,8.4758139980052952E-3,1,0,25509.085041337985,1.570757125075249,13.263727395328756,1.4953311300841707,1.0040037001012296,8.9335184201622744E-2,1,0,1,0,1.0013608821886559,0.10237970771184106,-0.34340168140329691,-104.20274139703832,75.797258602961676,null,13490,181980100,null,31.991932249137033,-9.4401202061273555,null,3.8021741023704374,-94.762621190910977,null,0,0,null,0,0]
[13568.5,13.5685,93.301821361553237,1.5600782172020127,1.000036340050539,8.5251334387018343E-3,1,0,25657.525602692811,1.5707573518751894,13.340473223900384,1.4957660894202107,1.0040503374804599,8.9852251361575444E-2,1,0,1,0,1.0013768445141891,0.102975929398292,-0.39461674710343625,-104.24236727701417,75.757632722985832,null,13568.5,184104192.25,null,31.991243962512364,-9.4448376325873191,null,3.751647323294967,-94.797529644426845,null,0,0,null,0,0]
[13647,13.647,93.84155339095409,1.5601398650163831,1.0000367617468879,8.5744528379242107E-3,1,0,25805.966164048943,1.5707575760659414,13.417221547477929,1.4961960727842578,1.0040972432760515,9.0369270350787345E-2,1,0,1,0,1.0013929012689811,0.10357215901170072,-0.44553939424448319,-104.28223470285796,75.717765297142037,null,13647,186240609,null,31.99055825543563,-9.4498372517661497,null,3.7014103832306549,-94.832397451091794,null,0,0,null,0,0]
[13725.5,13.7255,94.381285772916385,1.5602008077479486,1.0000371858757273,8.6237721954325504E-3,1,0,25954.406725406356,1.5707577976922735,13.493972323489601,1.4966211649226795,1.0041444174503895,9.0886240899621107E-2,1,0,1,0,1.0014090524843933,0.10416839659493944,-0.49617306615012063,-104.32233951368605,75.677660486313954,null,13725.5,188389350.25,null,31.989875017685364,-9.4551141951706352,null,3.6514599490752842,-94.867225318515409,null,0,0,null,0,0]
[13804,13.804,94.921018501425991,1.560261057423818,1.000037612437054,8.673091510986974E-3,1,0,26102.847286765027,1.5707580167979351,13.570725510325337,1.4970414486717754,1.004191859965651,9.1403162738593474E-2,1,0,1,0,1.0014252981919645,0.1047646421908288,-0.54652114601875068,-104.3626776419643,75.637322358035703,null,13804,190550416,null,31.989194142169929,-9.4606637036967758,null,3.6017927447220872,-94.902013938267501,null,0,0,null,0,0]
[13884.25,13.88425,95.472783840315728,1.5603219460818702,1.0000380510221394,8.723510258111862E-3,1,0,26254.59703261387,1.5707582382270546,13.64919220515349,1.4974662157487522,1.0042406374577839,9.1931557681561984E-2,1,0,1,0,1.0014420037734313,0.10537418821310816,-0.59769988392253237,-104.40415206453056,75.595847935469436,null,13884.25,192772398.0625,null,31.988500421359713,-9.4666138300188614,null,3.5513077276285192,-94.937538234511706,null,0,0,null,0,0]
[13964.5,13.964499999999999,96.024549529096234,1.5603821349967444,1.0000384921493695,8.7739289608844643E-3,1,0,26406.34677846398,1.5707584571111941,13.727661334511959,1.4978861268510926,1.0042896953078422,9.2459901149637258E-2,1,0,1,0,1.0014588081742712,0.10598374269960614,-0.64858711841493821,-104.44586201401282,75.554137985987182,null,13964.5,195007260.25,null,31.987808952507983,-9.4728390880825906,null,3.5011119619878519,-94.973022925930223,null,0,0,null,0,0]
[14044.75,14.044750000000001,96.576315561770485,1.5604416361614537,1.0000389358187407,8.8243476190485066E-3,1,0,26558.096524315348,1.5707586734939787,13.806132856889739,1.4983012646308407,1.0043390334747422,9.2988192855413196E-2,1,0,1,0,1.001475711428758,0.10659330569590265,-0.69918627814479839,-104.48780343060535,75.512196569394646,null,14044.75,197255002.5625,null,31.987119630673849,-9.4793347283070659,null,3.4512021240921156,-95.008468702298302,null,0,0,null,0,0]
[14125,14.125,97.128081932477699,1.5605004612965119,1.0000393820302496,8.8747662323477167E-3,1,0,26709.846270167942,1.5707588874180423,13.88460673171301,1.4987117098781553,1.004388651917175,9.3516432511655603E-2,1,0,1,0,1.0014927135713607,0.10720287724751996,-0.74950073199820555,-104.52997234551742,75.470027654482578,null,14125,199515625,null,31.986432353897314,-9.486096107742565,null,3.4015749470152494,-95.043876237774853,null,0,0,null,0,0]
[14207.25,14.20725,97.693599834775654,1.5605600629514,1.0000398420002514,8.9264413374720315E-3,1,0,26865.37794115207,1.5707591041657409,13.965038741358244,1.4991275975057095,1.004439797753006,9.4057782707313867E-2,1,0,1,0,1.0015102420952211,0.10782764953888031,-0.80077715458257304,-104.57342421323389,75.426575786766108,null,14207.25,201845952.5625,null,31.985729967221349,-9.4932970021183891,null,3.3510009111068406,-95.080127211115496,null,0,0,null,0,0]
[14289.5,14.2895,98.259118080121439,1.5606189785465361,1.0000403046406738,8.9781163949222767E-3,1,0,27020.909612137446,1.5707593184182511,14.045473138767402,1.4995387218653042,1.0044912379199724,9.4599077616319527E-2,1,0,1,0,1.0015278745715652,0.10845243091395282,-0.85176148292766263,-104.61710690030738,75.382893099692623,null,14289.5,204189810.25,null,31.985029521101715,-9.500767500989646,null,3.3007170288813894,-95.11633939931771,null,0,0,null,0,0]
[14371.75,14.37175,98.824636662625878,1.5606772198593255,1.000040769951513,9.0297914044225411E-3,1,0,27176.441283124052,1.570759530218413,14.125909883151957,1.4999451641867607,1.0045429723728578,9.5140316929991336E-2,1,0,1,0,1.0015456110381391,0.10907722142155847,-0.90245715767417789,-104.66101641498902,75.338983585010979,null,14371.75,206547198.0625,null,31.984330914867982,-9.5085029349988606,null,3.2507199603686088,-95.152513479990162,null,0,0,null,0,0]
[14454,14.454000000000001,99.390155576533758,1.5607347983991442,1.000041237932765,9.081466365696917E-3,1,0,27331.972954111861,1.5707597396080915,14.206348934645987,1.5003470038664137,1.0045950010661975,9.5681500339841727E-2,1,0,1,0,1.0015634515329033,0.10970202111045324,-0.95286755944325296,-104.70514885517561,75.294851144824392,null,14454,208918116,null,31.98363405071785,-9.5164987397947627,null,3.2010064227496633,-95.188650115380838,null,0,0,null,0,0]
[14622.5,14.6225,100.54869685526074,1.5608507330948067,1.0000422049932871,9.1873292045103888E-3,1,0,27650.600146351961,1.5707601612145865,14.371146008480839,1.5011561777974798,1.0047025073739788,9.6790010236151053E-2,1,0,1,0,1.0016003251617918,0.11098203475956288,-1.0552630293869101,-104.79624015371978,75.203759846280221,null,14622.5,213817506.25,null,31.982211474953075,-9.5336735835520816,null,3.1000335285707825,-95.262566570167721,null,0,0,null,0,0]
[14706.75,14.70675,101.1279679927129,1.5609077043147757,1.0000426927263222,9.2402605468419729E-3,1,0,27809.913742473826,1.5707603683949722,14.453548013680818,1.5015538450779005,1.0047567234181378,9.7344175888115683E-2,1,0,1,0,1.0016189258629409,0.11162205624115726,-1.1060257279850658,-104.8421207181555,75.157879281844501,null,14706.75,216288495.5625,null,31.981502534077823,-9.5426521503141881,null,3.0499797708478757,-95.299468567841316,null,0,0,null,0,0]
[14791,14.791,101.70723945465922,1.5609640265781346,1.0000431832612011,9.2931918373947604E-3,1,0,27969.227338596869,1.5707605732151459,14.535952278639821,1.5019470036709375,1.0048112479893017,9.7898281568299259E-2,1,0,1,0,1.0016376358774599,0.11226208756361865,-1.156502937418338,-104.88821942432155,75.111780575678452,null,14791,218773681,null,31.980795032132335,-9.5518854744746644,null,3.0002100633600937,-95.336333949846889,null,0,0,null,0,0]
[14877.25,14.87725,102.30026249831268,1.5610210251305323,1.0000436883432229,9.3473796031533982E-3,1,0,28132.322859851629,1.5707607804944652,14.620315028897632,1.5023449043731387,1.0048673864599267,9.846547862331459E-2,1,0,1,0,1.0016569033270817,0.11291732275636715,-1.2078861573798358,-104.93563452445362,75.064365475546381,null,14877.25,221332567.5625,null,31.98007213050936,-9.561597317219146,null,2.949549745021574,-95.374037207234451,null,0,0,null,0,0]
[14963.5,14.9635,102.89328587049172,1.5610773666631035,1.000044196361684,9.4015673140168121E-3,1,0,28295.418381107585,1.5707609853842577,14.704680067355955,1.5027382393922522,1.0049238481727705,9.9032612124758751E-2,1,0,1,0,1.0016762854308996,0.11357256837304185,-1.2589771679817876,-104.98327039662531,75.016729603374685,null,14963.5,223906332.25,null,31.979350546826396,-9.5715669760742372,null,2.8991803181025859,-95.411703420551063,null,0,0,null,0,0]
[15049.75,15.04975,103.48630956554859,1.5611330624705559,1.0000447073165797,9.4557549696668575E-3,1,0,28458.513902364713,1.5707611879256065,14.789047354855247,1.5031270867432673,1.0049806330733522,9.9599681718548216E-2,1,0,1,0,1.0016957822344577,0.11422782446931401,-1.3097794155842781,-105.03112320332053,74.968876796679467,null,15049.75,226494975.0625,null,31.978630189010598,-9.5817899631767123,null,2.8490984283158931,-95.449333240143829,null,0,0,null,0,0]
[15136,15.135999999999999,104.07933357796419,1.5611881235901932,1.0000452212079058,9.5099425697854033E-3,1,0,28621.609423622998,1.5707613881586584,14.873416853123434,1.5035115226765119,1.0050377411068907,0.10016668705084363,1,0,1,0,1.0017153937835599,0.1148830911007727,-1.3602962864350543,-105.07918919333819,74.920810806661805,null,15136,229098496,null,31.977910967624624,-9.5922618917313169,null,2.7993007788510855,-95.486927301606869,null,0,0,null,0,0]
[15224,15.224,104.68439028313276,1.5612436589485468,1.0000457485524124,9.5652295708939551E-3,1,0,28788.01412937175,1.5707615901160932,14.9595004359801,1.5038992895025087,1.0050963408309521,0.10074513024175882,1,0,1,0,1.001735521557366,0.11555166391280235,-1.4115474687801219,-105.12844634591431,74.871553654085687,null,15224,231770176,null,31.977178234446182,-9.6031984140151909,null,2.7487823296844645,-95.525247931899088,null,0,0,null,0,0]
[15312,15.311999999999999,105.28944730745563,1.5612985560273633,1.0000462789537077,9.620516513525617E-3,1,0,28954.418835121662,1.5707617897521782,15.045586242454132,1.5042826190417262,1.0051552768174787,0.10132350579363295,1,0,1,0,1.0017557688774468,0.11622024780851678,-1.4625085127924988,-105.17791779553565,74.822082204464351,null,15312,234457344,null,31.976446504190417,-9.6143851656691695,null,2.6985530159278519,-95.563532629866501,null,0,0,null,0,0]
[15400,15.4,105.89450464546212,1.5613528257672653,1.0000468124117874,9.6758033973425011E-3,1,0,29120.823540872716,1.5707619871067078,15.131674234594293,1.5046615869151394,1.0052145490073252,0.10190181333144287,1,0,1,0,1.0017761357932837,0.11688884284669028,-1.513182830445106,-105.22759982047077,74.772400179529228,null,15400,237160000,null,31.975715689786867,-9.6258177947233303,null,2.6486095126787901,-95.601782025747454,null,0,0,null,0,0]
[15488,15.488,106.4995622918058,1.561406478860262,1.0000473489266464,9.7310902220067181E-3,1,0,29287.228246624891,1.5707621822185722,15.217764375307175,1.5050362670375852,1.0052741573410222,0.10248005248043565,1,0,1,0,1.0017966223546375,0.11755744908600607,-1.5635737744129048,-105.2774887824566,74.722511217543399,null,15488,239878144,null,31.974985706655104,-9.6374920469259706,null,2.5989485518427609,-95.63999673553063,null,0,0,null,0,0]
[15578.25,15.578250000000001,107.12009047685193,1.5614608742125795,1.0000479023342226,9.7877905684615064E-3,1,0,29457.887618150282,1.5707623800294952,15.306057878090522,1.5054161491321241,1.0053356388344026,0.10307300472680736,1,0,1,0,1.0018177570458409,0.11824316206698224,-1.614962239834397,-105.32886453001797,74.671135469982033,null,15578.25,242681873.0625,null,31.974237836542368,-9.6497114011111922,null,2.5483079565340008,-95.679153128906762,null,0,0,null,0,0]
[15668.5,15.6685,107.74061897519985,1.5615146429886229,1.0000484589568785,9.8444908519802459E-3,1,0,29628.546989676815,1.5707625755616506,15.394353564359928,1.5057916735851482,1.0053974737528166,0.10366588424497568,1,0,1,0,1.0018390176859322,0.11892888695393571,-1.6660596129211733,-105.38045044005628,74.619549559943721,null,15668.5,245501892.25,null,31.973490668234327,-9.6621761321812443,null,2.497957751755266,-95.718274307875049,null,0,0,null,0,0]
[15758.75,15.758749999999999,108.3611477814672,1.5615677959523229,1.0000490187946089,9.9011910721984696E-3,1,0,29799.206361204466,1.5707627688541894,15.482651396758925,1.5061629148449474,1.0054596620310583,0.10425869063159582,1,0,1,0,1.0018604043295052,0.11961462380986505,-1.7168693247030198,-105.43224284649025,74.567757153509746,null,15758.75,248338201.5625,null,31.972744118117301,-9.6748819536965822,null,2.4478945900904456,-95.757360892793685,null,0,0,null,0,0]
[15849,15.849,108.9816768903942,1.5616203436224705,1.0000495818474082,9.9578912287517085E-3,1,0,29969.865732733218,1.5707629599453716,15.570951338777485,1.5065299456758661,1.0055222036035651,0.10485142348362816,1,0,1,0,1.0018819170314637,0.12030037269766584,-1.7673947464886246,-105.48423816563654,74.51576183436346,null,15849,251190801,null,31.971998104979342,-9.687824675666997,null,2.3981151814428006,-95.796413489969552,null,0,0,null,0,0]
[15941.25,15.94125,109.61595764435847,1.5616734409231734,1.0000501607005567,1.0015847832293208E-2,1,0,30144.30702939392,1.5707631530351147,15.66121020932793,1.5069008327756896,1.005586496195136,0.10545721527342315,1,0,1,0,1.0019040368063292,0.12100133073687044,-1.8187494841968219,-105.53759179596621,74.462408204033792,null,15941.25,254123451.5625,null,31.971236032532886,-9.7012947862329284,null,2.3475225161810602,-95.836297009733286,null,0,0,null,0,0]
[16033.5,16.0335,110.25023870380967,1.5617259272754656,1.0000507429128376,1.0073804368546711E-2,1,0,30318.748326055731,1.5707633439029438,15.75147120950184,1.5072674693205368,1.0056511577732876,0.10606292938281552,1,0,1,0,1.0019262884055491,0.12170230147967626,-1.8698141300045688,-105.59115011404396,74.408849885956045,null,16033.5,257073122.25,null,31.970474356879848,-9.7150038575943469,null,2.2972195460263487,-95.876146256449601,null,0,0,null,0,0]
[16125.75,16.12575,110.88452006350546,1.561777813163292,1.0000513284842452,1.0131760837122991E-2,1,0,30493.189622718633,1.5707635325869915,15.841734302897526,1.5076299278674719,1.0057161882668493,0.1066685653823711,1,0,1,0,1.0019486718887605,0.12240328499291594,-1.9205920997567847,-105.64490954477358,74.355090455226417,null,16125.75,260039813.0625,null,31.969712998554485,-9.7289477101177777,null,2.2472029345994962,-95.915961834655832,null,0,0,null,0,0]
[16218,16.218,111.51880171832275,1.5618291088320944,1.0000519174147735,1.0189717237632821E-2,1,0,30667.630919382613,1.5707637191245225,15.931999453937408,1.5079882793336752,1.0057815876042624,0.10727412284299567,1,0,1,0,1.0019711873159372,0.12310428134330709,-1.9710867499449503,-105.69886659331534,74.301133406684656,null,16218,263023524,null,31.968951880376864,-9.7431222580978893,null,2.1974694025889532,-95.95574433521746,null,0,0,null,0,0]
[16312.5,16.3125,112.16855395817696,1.5618810540927963,1.0000525241924694,1.0249087137902999E-2,1,0,30846.326881819976,1.57076390802413,16.024468291215452,1.508351184972746,1.0058489644201063,0.10789436811393621,1,0,1,0,1.0019943887733502,0.12382238854589975,-2.0225226553928595,-105.75434100277143,74.245658997228574,null,16312.5,266097656.25,null,31.968172368991951,-9.7578775560725948,null,2.1468130085259545,-95.996463446698826,null,0,0,null,0,0]
[16407,16.407,112.81830649721044,1.5619324010187361,1.0000531344951311,1.0308456965919076E-2,1,0,31025.022844258427,1.5707640947477135,16.116939214707227,1.5087099263170911,1.0059167281383437,0.10851453005761361,1,0,1,0,1.0020177288180019,0.12454050936084129,-2.0736681975723972,-105.81001561177605,74.189984388223948,null,16407,269189649,null,31.96739295267961,-9.7728665515825135,null,2.0964468826587606,-96.037149060193556,null,0,0,null,0,0]
[16501.5,16.5015,113.46805933028362,1.5619831598883847,1.0000537483227525,1.0367826721262657E-2,1,0,31203.718806697951,1.5707642793326577,16.20941218870864,1.5090645745441509,1.005984878680789,0.10913460821388557,1,0,1,0,1.002041207515463,0.12525864385947133,-2.1245267997334678,-105.86588691096453,74.134113089035466,null,16501.5,272299502.25,null,31.966613555442052,-9.7880851422384829,null,2.0463676777352466,-96.077801768726061,null,0,0,null,0,0]
[16596,16.596,114.11781245237398,1.5620333407461344,1.0000543656753267,1.0427196403515342E-2,1,0,31382.414769138519,1.5707644618154957,16.301887178324954,1.5094151992204781,1.006053415968831,0.1097546021229919,1,0,1,0,1.0020648249316755,0.12597679211299975,-2.1751018256171899,-105.92195146982314,74.078048530176858,null,16596,275427216,null,31.965834103476052,-9.8035293179214982,null,1.9965721038175261,-96.118422151901626,null,0,0,null,0,0]
[16692.5,16.692499999999999,114.78131725644785,1.5620839973427219,1.0000549997312027,1.0487822511117304E-2,1,0,31564.892656711174,1.5707646460281965,16.396321355190025,1.5097691630028267,1.006123802809197,0.11038763017836077,1,0,1,0,1.0020890854098909,0.12671015353987611,-2.2264580152505333,-105.97939853326878,74.020601466731222,null,16692.5,278639556.25,null,31.965038024209353,-9.8195290776070276,null,1.9460119934508811,-96.159869455661749,null,0,0,null,0,0]
[16789,16.789000000000001,115.44482235167534,1.5621340716541634,1.0000556374628011,1.0548448541620029E-2,1,0,31747.370544284891,1.570764828123258,16.490757562828069,1.5101190728005018,1.0061945927715381,0.11102056941503646,1,0,1,0,1.0021134906808482,0.12744352945969736,-2.2775254040103396,-106.03704013497929,73.962959865020707,null,16789,281870521,null,31.964241739006379,-9.8357559032367394,null,1.8957408898940482,-96.201284231742548,null,0,0,null,0,0]
[16885.5,16.8855,116.10832773306502,1.562183573662677,1.0000562788701151,1.0609074494578005E-2,1,0,31929.848431859646,1.5707650081369864,16.585195766549379,1.5104649977787845,1.0062657857707764,0.11165341934469149,1,0,1,0,1.0021380408159621,0.1281769199478682,-2.3283073904288996,-106.09487286246194,73.905127137538059,null,16885.5,285120110.25,null,31.963445175894879,-9.8522058060330604,null,1.8457554665869866,-96.242667056428871,null,0,0,null,0,0]
[16982,16.981999999999999,{"$f":"SQRT(1+(A269/pole1)^2)","v":116.77183339573894},{"$f":"ATAN(A269/pole1)","v":1.5622325131236123},{"$f":"SQRT(1+(A269/Zero1)^2)","v":1.0000569239531372},{"$f":"ATAN(A269/Zero1)","v":1.0669700369545718E-2},{"$f":"IF(VIN_nom>Vout, 1, SQRT(1+(A269/z_RHP)^2))","v":1},{"$f":"IF(VIN_nom>Vout, 0, -ATAN(A269/z_RHP))","v":0},{"$f":"SQRT(1+(A269/Pole2)^2)","v":32112.326319435422},{"$f":"ATAN(A269/Pole2)","v":1.5707651861048633},16.67963593244917,1.5108070055403644,{"$f":"SQRT(1+(A269/pole4)^2)","v":1.0063373817213741},{"$f":"ATAN(A269/pole4)","v":0.11228617947942229},{"$f":"IF(VOUT_setting=1,1,SQRT(1+(A269*zterm1)^2))","v":1},{"$f":"IF(VOUT_setting=1,0,ATAN(((A269*zterm1))))","v":0},1,{"$f":"IF(VOUT_setting=1,0,ATAN(A269*$Q$4/(1+Afbr-$Q$5*(A269)^2)))","v":0},{"$f":"SQRT((1-(Z269/pterm2))^2+(A269/pterm1)^2)","v":1.0021627358870506},{"$f":"IF((ATAN((A269/pterm1)/(1-A269^2/pterm2))>0),ATAN((A269/pterm1)/(1-A269^2/pterm2)),PI()+ATAN((A269/pterm1)/(1-A269^2/pterm2)))","v":0.12891032507964903},{"$f":"20*LOG10(((E269*K269*G269*O269)/(C269*I269*S269*M269*Q269))*Adc)","v":-2.3788073141150115},{"$f":"((F269+L269+H269+P269)-(D269+J269+T269+N269+R269))*radconv","v":-106.15289337972398},{"$f":"IF(V269>0,V269,V269+180)","v":73.847106620276023},null,{"$f":"IF(U269<0,A269,1000000000)","v":16982},{"$f":"A269^2","v":288388324},null,{"$f":"20*LOG10((K269/(I269*M269))*AEA)","v":31.962648264983336},{"$f":"(L269-(J269+N269))*radconv","v":-9.8688748867253082},null,{"$f":"20*LOG10((E269*G269/(C269*S269))*Acs*Am)","v":1.7960524538124187},{"$f":"(F269+H269-(D269+T269))*radconv","v":-96.284018492998698},null,{"$f":"SUM((U270<0)*(U269>0))*A269","v":0},0,null,0,0]
[17081,{"$f":"A270/1000","v":17.081},117.45252861159793,1.5622821458419376,1.0000575895679276,1.0731896781521795E-2,1,0,32299.531613426127,1.5707653665936117,16.776524739125332,1.5111538721090541,1.0064112511445138,0.1129352385383037,1,0,1,0,1.0021882214193609,0.12966274564068681,-2.4303258473602645,-106.21260875126934,73.787391248730657,null,17081,291760561,null,31.961830276141981,-9.8861995822771753,null,1.7453519094085237,-96.326409168992186,null,0,0,null,{"$f":"SUM((V271<-183)*(V270>-183))*A270","v":0},{"$f":"IF(AK270>0,U270,0)","v":0}]
[17180,17.18,118.13322411345591,1.5623312065829671,1.0000582590513289,1.0794093110464392E-2,1,0,32486.736907417864,1.570765545002222,16.873415541111939,1.5114967551528655,1.0064855444838938,0.11358420205046091,1,0,{"$f":"IF(VOUT_setting=1,1,SQRT((1+Afbr-$Q$5*(A271)^2)^2+(A271*$Q$4)^2))","v":1},0,1.0022138596489902,0.13041518177390318,-2.4815544502441478,-106.27251489346338,73.727485106536619,null,17180,295152400,null,31.961011778643091,-9.9037469233852224,null,1.6949418040235256,-96.368767970078181,null,0,0,null,0,0]
[17279,17.279,118.81391989639738,1.5623797051771928,1.000058932403334,1.085628935589248E-2,1,0,32673.942201410631,1.5707657213664488,16.970308304232727,1.5118357228228363,1.006560261645647,0.11423306949048473,1,0,1,0,1.0022396506548037,0.13116763356008254,-2.5324965442039482,-106.33260844138607,73.667391558613929,null,17279,298563841,null,31.96019270339773,-9.9215129772274882,null,1.6448187853090879,-96.411095464158549,null,0,0,null,0,0]
[17378,17.378,119.49461595561877,1.5624276512311215,1.0000596096239347,1.0918485517325027E-2,1,0,32861.147495404402,1.5707658957212314,17.067202995086848,1.5121708417260094,1.0066354025353998,0.11488184033344505,1,0,1,0,1.0022655945161136,0.13192010107984628,-2.5831554912388999,-106.39288610571958,73.607113894280417,null,17378,301994884,null,31.959372983326674,-9.9394938994271183,null,1.594979558345194,-96.453392206292463,null,0,0,null,0,0]
[17479.25,17.47925,120.19078266070026,1.5624761252321704,1.0000603062373834,1.0982095140499012E-2,1,0,33052.607455171776,1.5707660719957401,17.166301797935059,1.5125096638434543,1.006712689356466,0.11554525550662843,1,0,1,0,1.0022922861997154,0.13268968649202023,-2.6346763481642239,-106.454720806553,73.545279193447001,null,17479.25,305524180.5625,null,31.958533898405395,-9.9581018113868396,null,1.5442977863411507,-96.496618995166173,null,0,0,null,0,0]
[17580.5,17.580500000000001,120.88694964494474,1.562524040926595,1.0000610068972544,1.1045704674798389E-2,1,0,33244.067414940168,1.5707662462398408,17.265402548859345,1.5128445964254644,1.0067904191834716,0.11620856853301983,1,0,1,0,1.002319137934971,0.13345928853111333,-2.6859079701839321,-106.51674136156866,73.483258638431337,null,17580.5,309073980.25,null,31.9576940032414,-9.9769266083975996,null,1.4939060594854356,-96.539814753171044,null,0,0,null,0,0]
[17681.75,17.681750000000001,121.58311690355686,1.5625714079045212,1.0000617116035397,1.1109314119708596E-2,1,0,33435.527374709556,1.5707664184884134,17.364505214506192,1.5131757059912874,1.0068685919138169,0.11687177885264977,1,0,1,0,1.0023461498081685,0.13422890728283385,-2.7368537696725888,-106.57894448382287,73.421055516177134,null,17681.75,312644283.0625,null,31.956853232169014,-9.9959644491018445,null,1.4438010310691647,-96.582980034721032,null,0,0,null,0,0]
[17783,17.783000000000001,122.27928443185048,1.5626182355376887,1.0000624203562303,1.1172923474715071E-2,1,0,33626.987334479927,1.5707665887755433,17.463609762278534,1.513503057553603,1.0069472074443497,0.11753488590608355,1,0,1,0,1.002373321906082,0.13499854283270751,-2.7875170997889933,-106.64132696015409,73.358673039845911,null,17783,316235089,null,31.956011521439571,-10.015211578447097,null,1.3939794116822066,-96.626115381706967,null,0,0,null,0,0]
[17886.5,17.886500000000002,122.99092262363091,1.5626655558648788,1.0000631490412566,1.1237946277485426E-2,1,0,33822.701960023973,1.570766760854206,17.564918545490826,1.5138338655575976,1.0070280275482155,0.11821262135597428,1,0,1,0,1.0024012635243575,0.13578529884590007,-2.8390177577887785,-106.70527781998017,73.294722180019832,null,17886.5,319926882.25,null,31.955150070378274,-10.035098916298033,null,1.3433402047437148,-96.670178903682114,null,0,0,null,0,0]
[17990,17.989999999999998,123.70256108764558,1.5627123317416023,1.0000638819545085,1.1302968985224631E-2,1,0,34018.416585569008,1.5707669309528642,{"$f":"SQRT(1+(A279/Zero2)^2)","v":17.666229228855077},{"$f":"ATAN(A279/Zero2)","v":1.5141608794217765},1.0071093101312092,0.11889024771864568,1,0,1,0,1.0024293727524891,0.1365720725922617,-2.890230154784847,-106.76940953108833,73.230590468911672,null,17990,323640100,null,31.954287508581331,-10.055197278664384,null,1.2929903695445908,-96.714212252423948,null,0,0,null,0,0]
[18093.5,18.093499999999999,124.414199819223,1.562758572510285,1.000064619095977,1.1367991597383074E-2,1,0,34214.131211115004,1.5707670991054963,17.767541779867241,1.5144841639794486,1.0071910550813612,0.11956776439828259,1,0,1,0,1.0024576496847415,0.13735886416254914,-2.9411576893767615,-106.83371888712578,73.166281112874216,null,18093.5,327374742.25,null,31.953423773756271,-10.075502918680259,null,1.2429265697777345,-96.758215968445555,null,0,0,null,0,0]
[18197,18.196999999999999,125.125838813798,1.5628042873008263,1.0000653604656522,1.1433014113411145E-2,1,0,34409.845836661967,1.5707672653453078,17.868856166759834,1.514803782596692,1.007273262286102,0.12024517079966561,1,0,1,0,1.0024860944159089,0.13814567364731534,-2.99180370127808,-106.89820275360719,73.101797246392806,null,18197,331130809,null,31.952558805435878,-10.096012173535819,null,1.193145526196806,-96.802190580071368,null,0,0,null,0,0]
[18303,18.303000000000001,125.85466742400975,1.5628505704470947,1.0000661241254343,1.1499607121398138E-2,1,0,34610.28786862408,1.5707674336517961,17.97261963155821,1.5151273863470818,1.0073579341916588,0.12093882474720126,1,0,1,0,1.0025154002450201,0.13895150685528054,-3.0433846709813177,-106.96442188388767,73.035578116112333,null,18303,334999809,null,31.951671604287597,-10.117224131315936,null,1.1424517576418518,-96.847197752571716,null,0,{"$f":"IF(AH282>0,W282,0)","v":0},null,0,0]
[18409,18.408999999999999,126.58349630071397,1.5628963206251902,1.0000668922201317,1.1566200027387815E-2,1,0,34810.729900587168,1.570767600020049,18.076384956830847,1.5154472749134209,1.0074430907117173,0.12163236176289449,1,0,1,0,1.0025448822801408,0.13975735904520478,-3.0946772607426625,-107.03081762438403,72.969182375615972,null,18409,338891281,null,31.950782986561794,-10.138642142708751,null,1.0920477856063111,-96.892175481675281,null,0,0,null,0,0]
[18515,18.515000000000001,127.31232543933392,1.5629415469882222,1.0000676647497337,1.1632792830789784E-2,1,0,35011.171932551202,1.5707677644833562,18.180152110721121,1.5157635118453263,1.0075287317233985,0.12232578120930589,1,0,1,0,1.002574540624831,0.14056323031369006,-3.1456848748712525,-107.09738682935944,72.902613170640564,null,18515,342805225,null,31.94989289286351,-10.160262531974169,null,1.041930265176007,-96.937124297385282,null,0,0,null,0,0]
[18621,18.620999999999999,128.04115483539698,1.5629862584809047,1.0000684417142305,1.169938553101366E-2,1,0,35211.613964516175,1.5707679270742492,18.28392106209505,1.5160761592526919,1.007614857103166,0.12301908244966432,1,0,1,0,1.0026043753832332,0.14136912075710906,-3.1964108586699491,-107.16412642360871,72.835873576391293,null,18621,346741641,null,31.949001265549036,-10.182081705857028,null,0.99209590869178366,-96.982044717751663,null,0,0,null,0,0]
[18729.5,18.729500000000002,128.78717386606888,1.5630315003855098,1.0000692415963739,1.1767548706316787E-2,1,0,35416.783402896363,1.5707680915938407,18.390139224211094,1.5163925262701223,1.0077035152507181,0.12372861204966919,1,0,1,0,1.0026350966047408,0.14219403800958547,-3.2480449693135327,-107.23261339155154,72.767386608448462,null,18729.5,350794170.25,null,31.948086962598875,-10.204617688804994,null,0.94137610099835778,-97.027995702746537,null,0,0,null,0,0]
[18838,18.838000000000001,129.53319315730988,1.563076221167661,1.00007004612505,1.1835711772265839E-2,1,0,35621.952841277503,1.5707682542182868,18.496359205820692,1.5167052596846704,1.0077926806193138,0.12443801645421285,1,0,1,0,1.002666002882159,0.14301897555572385,-3.2993909175456562,-107.30127257873825,72.698727421261751,null,18838,354870244,null,31.947170935994798,-10.227354580107411,null,0.89094617937031095,-97.073917998630847,null,0,0,null,0,0]
[18946.5,18.9465,130.27921270464367,1.5631204297795087,1.0000708553002478,1.190387472822768E-2,1,0,35827.122279659568,1.5707684149801457,18.602580975756148,1.5170144216788566,1.0078823530743346,0.12514729498259583,1,0,1,0,1.0026970943290683,0.14384393349812297,-3.3504521076695672,-107.37010090407234,72.629899095927655,null,18946.5,358969862.25,null,31.946253129242301,-10.250288779832513,null,0.84080279599890284,-97.119812124239814,null,0,0,null,0,0]
[19055,19.055,131.02523250369586,1.5631641349693275,1.0000716691219556,1.1972037573569181E-2,1,0,36032.291718042565,1.5707685739112345,18.708804503557065,1.5173200730257457,1.0079725324804443,0.1258564469548667,1,0,1,0,1.0027283710596879,0.14466891193912404,-3.4012318849928564,-107.43909535551745,72.560904644482548,null,19055,363093025,null,31.945333487523335,-10.273416768804822,null,0.79094266039457461,-97.16567858671263,null,0,0,null,0,0]
[19165.75,19.165749999999999,131.78672301457379,1.5632082361761341,1.0000725046121823,1.2041613819394113E-2,1,0,36241.715822199396,1.570768734282306,18.817232605418578,1.5176285038404347,1.0080651046544249,0.12658017361832535,1,0,1,0,1.0027604875923637,0.14551101947462494,-3.4527778860153542,-107.50968883902917,72.490311160970833,null,19165.75,367325973.0625,null,31.944392827219016,-10.297220656801386,null,0.7403373196764016,-97.212468182227781,null,0,0,null,0,0]
[19276.5,19.276499999999999,132.54821377882084,1.5632518306593093,1.0000733449436059,1.2111189948630217E-2,1,0,36451.139926357151,1.5707688928106056,18.92566247684395,1.5179334005287206,1.0081582047359043,0.12730376699319423,1,0,1,0,1.0027927974155153,0.14635314858236068,-3.5040375429243791,-107.5804492801641,72.419550719835897,null,19276.5,371583452.25,null,31.943450144739337,-10.321219292868621,null,0.6900203452470498,-97.259229987295498,null,0,0,null,0,0]
[19387.25,19.387250000000002,133.30970479209512,1.5632949271021983,1.0000741901162142,1.2180765960604176E-2,1,0,36660.564030515816,1.570769049527714,19.034094087591615,1.5182348234320475,1.0082518325786449,0.12802722635877284,1,0,1,0,1.0028253006526713,0.14719529937033324,-3.5550142319710232,-107.65137368587428,72.348626314125724,null,19387.25,375865462.5625,null,31.942505386833162,-10.345409180212799,null,0.63998841410658203,-97.30596450566145,null,0,0,null,0,0]
[19498,19.498000000000001,134.07119605015336,1.5633375339908768,1.0000750401299949,1.2250341854642676E-2,1,0,36869.988134675361,1.5707692044644941,19.142527408104733,1.518532831527196,1.0083459880356338,0.12875055099518889,1,0,1,0,1.0028579974280523,0.14803747194625905,-3.6057112710655472,-107.7224591299882,72.277540870011805,null,19498,380172004,null,31.941558501836905,-10.369786900235988,null,0.59023826000831459,-97.352672229752244,null,0,0,null,0,0]
[19611.75,19.611750000000001,134.85331486137713,1.5633807941021511,1.0000759182086219,1.2321802299533864E-2,1,0,37085.085126533144,1.570769361776569,19.253899723841432,1.5188354178114267,1.0084432430696735,0.12949332806729302,1,0,1,0,1.0028917814991631,0.14890248011741583,-3.6574939029386639,-107.79563477506997,72.204365224930029,null,19611.75,384620738.0625,null,31.94058370064225,-10.395016987908456,null,0.53943042932985086,-97.400617787161522,null,0,0,null,0,0]
[19725.5,19.7255,135.63543392205995,1.5634235553091014,1.0000768013942229,1.2393262618573991E-2,1,0,37300.182118391836,1.5707695172743172,19.365273782158571,1.5191345236388134,1.0085410543722959,0.13023596147560831,1,0,1,0,1.0029257700035219,0.14976751150230574,-3.7089884410176093,-107.86897425250535,72.131025747494647,null,19725.5,389095350.25,null,31.939606549999091,-10.420438155787062,null,0.48891304189406876,-97.4485360967183,null,0,0,null,0,0]
[19839.25,19.83925,136.41755322791107,1.5634658261926369,1.000077689686784,1.2464722811033557E-2,1,0,37515.279110251424,1.5707696709889467,19.476649553162162,1.5194302086635734,1.0086394217816714,0.13097845044291809,1,0,1,0,1.0029599630779955,0.15063256621668611,-3.760198296753841,-107.94247459994041,72.057525400059589,null,19839.25,393595840.5625,null,31.938626998816563,-10.446046943193751,null,0.43868273734035923,-97.496427656746675,null,0,0,null,0,0]
[19953,19.952999999999999,137.19967277473779,1.5635076151380083,1.0000785830862919,1.253618287618307E-2,1,0,37730.376102111884,1.5707698229509537,19.588027007637649,1.5197225311855733,1.0087383451351131,0.13172079419294491,1,0,1,0,1.0029943608602179,0.15149764437598923,-3.8111268224566559,-108.01613292140378,71.983867078596219,null,19953,398122209,null,31.937644997544972,-10.47183996706211,null,0.38873621290913923,-97.544292954341671,null,0,0,null,0,0]
[20069,20.068999999999999,137.99726306202015,1.5635497428407834,1.0000794994168949,1.2609056305258232E-2,1,0,37949.727759746296,1.57076997614473,19.701609236793963,1.5200172320500958,1.008839797592554,0.13247767130741397,1,0,1,0,1.0030296500031541,0.15237985823586134,-3.8627764083693084,-108.09140797780329,71.908592022196714,null,20069,402764761,null,31.936640998994569,-10.498329492962334,null,0.33809062554689173,-97.593078484840959,null,0,0,null,0,0]
[20185,20.184999999999999,138.7948535913975,1.56359138636636,1.0000804210584471,1.2681929600404832E-2,1,0,38169.079417381588,1.5707701275777455,19.815193157391533,1.5203085543927894,1.0089418278605362,0.13323439577537441,1,0,1,0,1.003065152323795,0.15326209671874344,-3.9141402840573978,-108.166841439518,71.833158560482005,null,20185,407434225,null,31.935634353067172,-10.525003747019673,null,0.28773339578619989,-97.641837692498328,null,0,0,null,0,0]
[20301,20.300999999999998,139.59244435872003,1.5636325540139371,1.0000813480109336,1.2754802760849251E-2,1,0,38388.431075017746,1.5707702772801833,19.928778740509294,1.5205965559322008,1.0090444357637822,0.1339909667766139,1,0,1,0,1.00310086797057,0.15414435994599807,-3.9652218233429455,-108.24243043676039,71.757569563239613,null,20301,412130601,null,31.934625011840033,-10.551859376939703,null,0.23766119772778521,-97.690571059820698,null,0,0,null,0,0]
[20417,20.417000000000002,140.3900353599322,1.5636732538941207,1.0000822802743399,1.2827675785817878E-2,1,0,38607.782732654749,1.5707704252815402,20.042365957881373,1.5208812930806632,1.0091476211260939,0.1347473834919557,1,0,1,0,1.0031367970927363,0.15502664803862837,-4.0160243417792305,-108.31817216377731,71.681827836222695,null,20417,416853889,null,31.933612928844521,-10.578893105288453,null,0.18787076228701502,-97.739279058488876,null,0,0,null,0,0]
[20536,20.536000000000001,141.20825395351147,1.5637145285947545,1.0000832421667138,1.2902433316396546E-2,1,0,38832.807277990134,1.5707705753730909,20.158892444947917,1.5211700597883984,1.0092540749433323,0.13552320152836303,1,0,1,0,1.0031738774018022,0.15593177989149445,-4.0678541951401384,-108.39602855924794,71.603971440752062,null,20536,421727296,null,31.93257177502111,-10.606807690471898,null,0.13708206274952203,-97.789220868776042,null,0,0,null,0,0]
[20655,20.655000000000001,142.02647278488143,1.5637553277258445,1.0000842096482305,1.2977190702752129E-2,1,0,39057.831823326393,1.570770723735192,20.275420593666329,1.5214555072840155,1.0093611360958177,0.13629885545225215,1,0,1,0,1.0032111826917653,0.15683693816931704,-4.1193972952266842,-108.47403990369371,71.525960096306292,null,20655,426629025,null,31.931527641196993,-10.634902950456407,null,8.65830964870902E-2,-97.839136953237301,null,0,0,null,0,0]
[20774,20.774000000000001,142.84469184995589,1.5637956594594875,1.0000851827188739,1.3051947944049463E-2,1,0,39282.856368663488,1.5707708703975634,20.391950375550493,1.521737692423498,1.0094688043903137,0.13707434438266081,1,0,1,0,1.0032487131264818,0.15774212300154017,-4.1706570390691713,-108.55220336642525,71.447796633574754,null,20774,431559076,null,31.93048048166132,-10.663175578861473,null,3.6370512180275927E-2,-97.889027787563748,null,0,0,null,0,0]
[20893,20.893000000000001,143.66291114474177,1.5638355317816126,1.0000861613786276,1.3126705039453386E-2,1,0,39507.880914001427,1.5707710153892487,20.508481762761317,1.5220166707726883,1.0095770796325709,0.1378496674397951,1,0,1,0,1.0032864688707228,0.15864733451720109,-4.2216367649025699,-108.63051618001106,71.369483819988943,null,20893,436517449,null,31.929430252108517,-10.691622343254457,null,-1.3558984100319579E-2,-97.938893836756591,null,0,0,null,0,0]
[21014.75,21.014749999999999,144.50003910227466,1.5638758582026051,1.0000871684387937,1.3203189562932538E-2,1,0,39738.105606396333,1.570771162032137,20.627707735225744,1.5222988339290531,1.0096884849791263,0.13864273504271829,1,0,1,0,1.0033253304742447,0.15957349253603326,-4.2735082155644939,-108.71079048961722,71.289209510382776,null,21014.75,441619717.5625,null,31.928352530507695,-10.720903413828781,null,-6.4352713161418107E-2,-97.989887075788459,null,0,0,null,0,0]
[21136.5,21.136500000000002,145.33716729208939,1.5639157200710021,1.0000881813493403,1.3279673931928816E-2,1,0,39968.330298792098,1.5707713069856468,20.746935331111139,1.5225777540612229,1.009800525235182,0.13943562715800692,1,0,1,0,1.0033644282729486,0.16049967875776899,-4.3250934433579964,-108.79121546718322,71.208784532816779,null,21136.5,446751632.25,null,31.927271505837062,-10.750360144507448,null,-0.11485691628428836,-98.040855322675782,null,0,0,null,0,0]
[21258.25,21.25825,146.17429571019522,1.5639551253680417,1.0000892001102495,1.3356158145547845E-2,1,0,40198.554991188685,1.5707714502788048,20.866164522589209,1.5228534867173105,1.0099132001894264,0.14022834284728614,1,0,1,0,1.0034037624462675,0.16142589331926271,-4.3763958409499493,-108.87178834311842,71.128211656881575,null,21258.25,451913193.0625,null,31.926187134915072,-10.779989300516247,null,-0.16507494295425529,-98.091799042602204,null,0,0,null,0,0]
[21380,21.38,147.01142435269225,1.5639940818931775,1.0000902247215036,1.3432642202895258E-2,1,0,40428.779683586086,1.5707715919399758,20.985395282463717,1.5231260861849825,1.0100265096294454,0.14102088117348563,1,0,1,0,1.003443333174636,0.16235213635691315,-4.4274187423182081,-108.95250640964588,71.047493590354122,null,21380,457104400,null,31.925099375903827,-10.809787719335993,null,-0.21501008531126656,-98.142718690309877,null,0,0,null,0,0]
[21504.5,21.5045,147.8674616731,1.5640334621900087,1.000091278525961,1.3510853663681769E-2,1,0,40664.204523040527,1.57077173514207,21.107320733826228,1.5234016580674374,1.0101430343423718,0.14183113638352068,1,0,1,0,1.0034840425168281,0.16329933028506396,-4.4793084882472192,-109.03519506531757,70.964804934682434,null,21504.5,462443520.25,null,31.923983501411016,-10.840431022292975,null,-0.26578395674747002,-98.194764043024591,null,0,0,null,0,0]
[21629,21.629000000000001,148.72349922018194,1.5640723891488211,1.0000923384479965,1.358906495916591E-2,1,0,40899.629362495791,1.5707718766955758,21.229247769664049,1.5236740645579134,1.0102602220746066,0.14264120415000048,1,0,1,0,1.0035249996058382,0.16424655427730919,-4.5309128384923714,-109.11803000807022,70.881969991929779,null,21629,467813641,null,31.92286399966779,-10.871244854669275,null,-0.31626880524939549,-98.24678515340095,null,0,0,null,0,0]
[21753.5,21.753499999999999,149.57953699004634,1.5641108705528022,1.0000934044875907,1.3667276088391366E-2,1,0,41135.054201951862,1.5707720166287986,21.35117636283249,1.5239433598447456,1.0103780725954505,0.14345108347518337,1,0,1,0,1.003566204637848,0.1651938084780058,-4.5822351763469911,-109.20100853186599,70.798991468134005,null,21753.5,473214762.25,null,31.921740830009853,-10.902226056157394,null,-0.36646797344607374,-98.298782475708606,null,0,0,null,0,0]
[21878,21.878,150.43557497889,1.5641489140079872,1.0000944766447237,1.3745487050401838E-2,1,0,41370.479041408733,1.5707721549694,21.473106486803047,1.5242095968873142,1.0104965856730079,0.14426077336278073,1,0,1,0,1.0036076578101309,0.16614109303100125,-4.6332788266358422,-109.28412799094799,70.715872009052006,null,21878,478646884,null,31.920613953055312,-10.933371536910105,null,-0.41638474678038562,-98.350756454037906,null,0,0,null,0,0]
[22005.25,22.00525,151.31052165978591,1.5641873529520767,1.0000955788057431,1.3825425389990511E-2,1,0,41611.104027922687,1.5707722947480798,21.597731401349481,1.5244786082300086,1.0106184009371784,0.14508815117083212,1,0,1,0,1.0036502832435561,0.16710933305454514,-4.6851653592376934,-109.36922636835052,70.630773631649475,null,22005.25,484231027.5625,null,31.919458314512767,-10.965371587561679,null,-0.46711564083969342,-98.403854780788848,null,0,0,null,0,0]
[22132.5,22.1325,152.1854685616803,1.5642253499087526,1.000096687357497,1.3905363552875558E-2,1,0,41851.729014437449,1.5707724329194548,21.722357860927087,1.5247445328245313,1.0107409078572214,0.14591532898025103,1,0,1,0,1.0036931683205483,0.16807760508828565,-4.7367675990332279,-109.45446657238666,70.545533427613336,null,22132.5,489847556.25,null,31.918298723815262,-10.997536944686772,null,-0.51755828993772524,-98.456929627699907,null,0,0,null,0,0]
[22259.75,22.25975,153.06041568078334,1.5642629124575707,1.0000978022999647,1.3985301538035944E-2,1,0,42092.35400095299,1.5707725695110899,21.846985839094906,1.5250074234587945,1.0108641061816706,0.1467423057320095,1,0,1,0,1.0037363132552755,0.16904590928414645,-4.788088915307811,-109.53984596247304,70.460154037526962,null,22259.75,495496470.0625,null,31.917135142794706,-11.029864524662313,null,-0.56771602519175135,-98.509981437810708,null,0,0,null,0,0]
[22387,22.387,153.93536301339122,1.5643000480057663,1.0000989236331244,1.4065239344450645E-2,1,0,42332.978987469316,1.5707727045499233,21.971615310011575,1.5252673317246954,1.0109879956577636,0.14756908036869421,1,0,1,0,1.003779718263093,0.17001424579348345,-4.8391326192038857,-109.62536195670366,70.374638043296343,null,22387,501177769,null,31.915967534504986,-11.062351312448474,null,-0.61759212079810411,-98.563010644255158,null,0,0,null,0,0]
[22517.5,22.517499999999998,154.83265695949004,1.5643376960900452,1.0001000802430255,1.4147218597706707E-2,1,0,42579.749602325748,1.5707728414524644,22.099429375864119,1.5255308333386457,1.0111157668943946,0.14841676002698945,1,0,1,0,1.003824502195003,0.17100734760350667,-4.8911950634392625,-109.71320129062487,70.286798709375134,null,22517.5,507037806.25,null,31.914765884854358,-11.095830092849711,null,-0.66845291538285201,-98.617371197775157,null,0,0,null,0,0]
[22648,22.648,155.72995112251633,1.5643749103284013,1.0001012435741814,1.4229197660794985E-2,1,0,42826.520217182973,1.5707729767773135,22.227244958501515,1.5257913044903588,1.0112442644952793,0.14926422486682758,1,0,1,0,1.0038695601169365,0.17200048371926474,-4.9429724055227444,-109.80117897758565,70.19882102241435,null,22648,512931904,null,31.913559924654649,-11.129470107361254,null,-0.71902429726662809,-98.671708870224393,null,0,0,null,0,0]
[22778.5,22.778500000000001,156.6272454987419,1.5644116981770479,1.0001024136265693,1.4311176532614257E-2,1,0,43073.29083204097,1.5707731105515872,22.355062031907007,1.5260487971250039,1.0113734881835581,0.15011147375302858,1,0,1,0,1.0039148922650643,0.17299365430212682,-4.9944680349401054,-109.88929241437809,70.11070758562191,null,22778.5,518860062.25,null,31.91234961779903,-11.163268316256763,null,-0.76930961982836832,-98.726024098121329,null,0,0,null,0,0]
[22909,22.908999999999999,157.52454008452341,1.5644480669223149,1.0001035904001647,1.4393155212063309E-2,1,0,43320.06144689973,1.5707732428017838,22.482880570655162,1.526303362008087,1.0115034376809491,0.15095850555223089,1,0,1,0,1.0039604988768662,0.1739868595128197,-5.0456852825733298,-109.97753905568239,70.022460944317615,null,22909,524822281,null,31.911134929361118,-11.197221747468427,null,-0.81931217902368259,-98.780317308213966,null,0,0,null,0,0]
[23042.25,23.042249999999999,158.44074338942875,1.5644847770134762,1.0001047989067988,1.447686121193955E-2,1,0,43572.032208815675,1.5707733762931781,22.613394089682323,1.5265603218918271,1.0116368741995774,0.15182316150764699,1,0,1,0,1.0040073499958571,0.17500103023164254,-5.0976979790921604,-110.06778015908328,69.932219840916716,null,23042.25,530945285.0625,null,31.909890087887675,-11.232047816135442,null,-0.87008003406907064,-98.83573234294785,null,0,0,null,0,0]
[23175.5,23.1755,159.35694690539853,1.5645210649842169,1.0001060144208449,1.4560567008932226E-2,1,0,43824.002970732385,1.5707735082495264,22.743909084698959,1.5268143326845458,1.0117710668483768,0.15268758874807145,1,0,1,0,1.004054487772416,0.1760152373896974,-5.1494272752665253,-110.15815495431785,69.841845045682149,null,23175.5,537103800.25,null,31.908640608222495,-11.267029662916153,null,-0.92055985057824963,-98.891125291401721,null,0,0,null,0,0]
[23308.75,23.30875,160.27315062881306,1.5645569380736126,1.000107236942277,1.464427260186908E-2,1,0,44075.973732649851,1.5707736386971554,22.874425530440334,1.527065444833777,1.0119060153265274,0.15355178607289496,1,0,1,0,1.0041019124635793,0.17702948115599199,-5.2008765364682503,-110.24866090819302,69.751339091806983,null,23308.75,543297826.5625,null,31.907386456745613,-11.302164330098364,null,-0.97075496030309627,-98.946496578094667,null,0,0,null,0,0]
[23442,23.442,161.18935455613499,1.5645924033561547,1.0001084664710695,1.4727977989577878E-2,1,0,44327.944494568059,1.5707737676617926,23.004943402214781,1.5273137076436856,1.0120417193316757,0.15441575228352056,1,0,1,0,1.0041496243278036,0.17804376169882039,-5.2520490700210498,-110.33929554363593,69.660704456364073,null,23442,549527364,null,31.906127600957976,-11.337448925561038,null,-1.0206686380682606,-99.001846618074893,null,0,0,null,0,0]
[23578.5,23.578499999999998,162.12790512852322,1.564628318024553,1.0001097332541538,1.4813724758086058E-2,1,0,44586.060884826482,1.5707738982605017,23.138646090119735,1.5275651215829429,1.0121815162659005,0.15530054995162521,1,0,1,0,1.0041987979325038,0.17908281909959517,-5.3041861775488606,-110.43227167568789,69.567728324312114,null,23578.5,555945662.25,null,31.904833130719723,-11.373746622832565,null,-1.071511275357814,-99.05852505285533,null,0,0,null,0,0]
[23715,23.715,163.06645590762699,1.5646638192696494,1.0001110073905346,1.4899471308742787E-2,1,0,44844.177275085669,1.5707740273557977,23.272350223789285,1.5278136466947658,1.0123221053843288,0.15618510255445964,1,0,1,0,1.0042482734431575,0.18012191544796191,-5.3560397387654852,-110.5253777546191,69.4746222453809,null,23715,562401225,null,31.903533658301527,-11.410195710379087,null,-1.122065364156249,-99.115182044239987,null,0,0,null,0,0]
[23851.5,23.851500000000001,164.00500688989743,1.5646989141890426,1.0001122888801839,1.4985217640288004E-2,1,0,45102.293665345591,1.5707741549734922,23.406055778447186,1.5280593324548983,1.0124634863569557,0.15706940881019479,1,0,1,0,1.0042980511422273,0.18116105092247733,-5.4076131280490936,-110.61861129067883,69.381388709321172,null,23851.5,568894052.25,null,31.902229152188891,-11.446793281484769,null,-1.1723342473272182,-99.171818009194055,null,0,0,null,0,0]
[23988,23.988,164.94355807186645,1.5647336097187905,1.0001135777230732,1.5070963751461665E-2,1,0,45360.41005560624,1.570774281138809,23.539762729879858,1.5283022272163753,1.0126056588521035,0.15795346743925659,1,0,1,0,1.0043481313137352,0.18220022570089522,-5.4589096615240944,-110.71196984923701,69.288030150762992,null,23988,575424144,null,31.900919581945963,-11.483536493855834,null,-1.222321210559288,-99.228433355381156,null,0,0,null,0,0]
[24127.75,24.127749999999999,165.90445591389715,1.5647687246437167,1.0001149048706082,1.5158751207090711E-2,1,0,45624.672074207163,1.5707744088291422,23.676654602501621,1.5285480630634478,1.0127520360740963,0.1588583172088463,1,0,1,0,1.0043997175292578,0.18326418363946195,-5.5111441220227286,-110.80767826761789,69.192321732382112,null,24127.75,582148320.0625,null,31.899573554345455,-11.521302526416756,null,-1.2732096434574176,-99.286375741201141,null,0,0,null,0,0]
[24267.5,24.267499999999998,166.86535395814164,1.5648034351484519,1.0001162397256458,1.5246538429056484E-2,1,0,45888.93409280882,1.5707745350488069,23.813547889577123,1.5287910725274756,1.012899242249909,0.15976290471252516,1,0,1,0,1.0044516213996444,0.18432818315030361,-5.5630952393757562,-110.90351273855953,69.096487261440473,null,24267.5,588911556.25,null,31.898222157342417,-11.559215387804702,null,-1.3238093638074053,-99.344297350754815,null,0,0,null,0,0]
[24407.25,24.407250000000001,167.82625220112652,1.5648377481795006,1.0001175822881547,1.5334325416006843E-2,1,0,46153.196111411205,1.5707746598230652,23.950442566852626,1.5290313040441827,1.0130472770181753,0.160667228584538,1,0,1,0,1.0045038432347635,0.18539222442153119,-5.6147663910861576,-110.99947081895554,69.000529181044456,null,24407.25,595713852.5625,null,31.896865361560785,-11.597272226052505,null,-1.3741237197361811,-99.402198592903019,null,0,0,null,0,0]
[24547,24.547000000000001,{"$f":"SQRT(1+(A333/pole1)^2)","v":168.78715063945754},{"$f":"ATAN(A333/pole1)","v":1.5648716705251862},{"$f":"SQRT(1+(A333/Zero1)^2)","v":1.0001189325581044},{"$f":"ATAN(A333/Zero1)","v":1.5422112166589666E-2},{"$f":"IF(VIN_nom>Vout, 1, SQRT(1+(A333/z_RHP)^2))","v":1},{"$f":"IF(VIN_nom>Vout, 0, -ATAN(A333/z_RHP))","v":0},{"$f":"SQRT(1+(A333/Pole2)^2)","v":46417.458130014304},{"$f":"ATAN(A333/Pole2)","v":1.5707747831766037},24.087338610625523,1.5292688049494891,{"$f":"SQRT(1+(A333/pole4)^2)","v":1.0131961400157061},{"$f":"ATAN(A333/pole4)","v":0.16157128746165036},{"$f":"IF(VOUT_setting=1,1,SQRT(1+(A333*zterm1)^2))","v":1},{"$f":"IF(VOUT_setting=1,0,ATAN(((A333*zterm1))))","v":0},1,{"$f":"IF(VOUT_setting=1,0,ATAN(A333*$Q$4/(1+Afbr-$Q$5*(A333)^2)))","v":0},{"$f":"SQRT((1-(Z333/pterm2))^2+(A333/pterm1)^2)","v":1.004556383346191},{"$f":"IF((ATAN((A333/pterm1)/(1-A333^2/pterm2))>0),ATAN((A333/pterm1)/(1-A333^2/pterm2)),PI()+ATAN((A333/pterm1)/(1-A333^2/pterm2)))","v":0.18645630764035434},{"$f":"20*LOG10(((E333*K333*G333*O333)/(C333*I333*S333*M333*Q333))*Adc)","v":-5.6661608963313057},{"$f":"((F333+L333+H333+P333)-(D333+J333+T333+N333+R333))*radconv","v":-111.0955501197104},{"$f":"IF(V333>0,V333,V333+180)","v":68.904449880289604},null,{"$f":"IF(U333<0,A333,1000000000)","v":24547},{"$f":"A333^2","v":602555209},null,{"$f":"20*LOG10((K333/(I333*M333))*AEA)","v":31.895503138660487},{"$f":"(L333-(J333+N333))*radconv","v":-11.635470252318576},null,{"$f":"20*LOG10((E333*G333/(C333*S333))*Acs*Am)","v":-1.4241560020810242},{"$f":"(F333+H333-(D333+T333))*radconv","v":-99.460079867391812},null,{"$f":"SUM((U334<0)*(U333>0))*A333","v":0},0,null,0,0]
[24690,{"$f":"A334/1000","v":24.69},169.77039575185179,1.5649059842632442,1.000120322208037,1.551194022342431E-2,1,0,46687.865776957733,1.5707749079533317,24.227419673694587,1.5295090507865277,1.0133493219075838,0.16249609523380337,1,0,1,0,1.0046104751125315,0.1875451805971147,-5.7184676535997747,-111.19398686738,68.806013132619995,null,24690,609596100,null,31.894103589740723,-11.674699911240676,null,-1.4750632104297343,-99.519286956139325,null,0,0,null,{"$f":"SUM((V335<-183)*(V334>-183))*A334","v":0},{"$f":"IF(AK334>0,U334,0)","v":0}]
[24833,24.832999999999998,170.75364106183719,1.5649399028259088,1.0001217199279979,1.5601768029905403E-2,1,0,46958.273423901868,1.5707750312930147,24.367502119045866,1.5297465344152144,1.0135033702237277,0.16342062266257176,1,0,{"$f":"IF(VOUT_setting=1,1,SQRT((1+Afbr-$Q$5*(A335)^2)^2+(A335*$Q$4)^2))","v":1},0,1.004664900796393,0.1886340978688921,-5.7704915977254068,-111.2925456446265,68.7074543553735,null,24833,616677889,null,31.892698301482021,-11.714071688214251,null,-1.5256818662966607,-99.578473956412253,null,0,0,null,0,0]
[24976,24.975999999999999,171.73688656601988,1.5649734330005964,1.0001231257179533,1.5691595584584352E-2,1,0,47228.681070846716,1.5707751532203356,24.507585922976478,1.5299813031743521,1.0136582845691193,0.16434486829564945,1,0,1,0,1.0047196607371416,0.18972305965330058,-5.8222361038306243,-111.39122405763524,68.608775942364758,null,24976,623800576,null,31.891287246671091,-11.75358278912892,null,-1.5760153175909482,-99.637641268506357,null,0,0,null,0,0]
[25119,25.119,172.72013226108336,1.5650065814201719,1.0001245395778688,1.5781422886012593E-2,1,0,47499.088717792263,1.5707752737594161,24.647671062322171,1.5302134033277548,1.0138140645467617,0.1652688306835414,1,0,1,0,1.0047747552760098,0.1908120661469444,-5.8737044887657106,-111.49001976539992,68.509980234600079,null,25119,630964161,null,31.889870399087776,-11.793230481595534,null,-1.6260668549427206,-99.696789283804378,null,0,0,null,0,0]
[25265.25,25.265250000000002,173.72572464327612,1.5650400951001262,1.0001259939180855,1.5873291453559424E-2,1,0,47775.641993078185,1.5707753956266621,24.79094131252738,1.5304480653351897,1.013974279928632,0.16621349773450531,1,0,1,0,1.0048314484123582,0.19192586923696575,-5.9260604011182387,-111.59117976791541,68.408820232084594,null,25265.25,638332857.5625,null,31.888415332354029,-11.833917756548095,null,-1.6769677005615007,-99.757262011367331,null,0,0,null,0,0]
[25411.5,25.4115,174.73131721834594,1.5650732230323503,1.0001274566991747,1.5965159753148647E-2,1,0,48052.195268364805,1.5707755160911507,24.934212912188869,1.5306800306267849,1.0141353998905518,0.16715786546153091,1,0,1,0,1.0048884922565775,0.19303971950425644,-5.9781343353465903,-111.69245766719114,68.307542332808865,null,25411.5,645744332.25,null,31.886954154114449,-11.874742311566523,null,-1.7275804565502708,-99.8177153556246,null,0,0,null,0,0]
[25557.75,25.557749999999999,175.73690998298179,1.5651059718386888,1.0001289279210992,1.6057027783230756E-2,1,0,48328.748543652109,1.5707756351769631,25.077485838177655,1.5309093453980667,1.0142974240014473,0.16810193232323145,1,0,1,0,1.0049458871797436,0.19415361715581989,-6.0299296590639369,-111.79385112083611,68.206148879163891,null,25557.75,653198585.0625,null,31.885486839335574,-11.915701412906918,null,-1.7779084654887432,-99.878149707929182,null,0,0,null,0,0]
[25704,25.704000000000001,176.74250293394803,1.5651383479902869,1.000130407583822,1.614889554225625E-2,1,0,48605.301818940105,1.5707757529076323,25.22076006789014,1.5311360547959805,1.0144603518281006,0.1690456967813472,1,0,1,0,1.0050036335549666,0.19526756239753074,-6.0814496817811969,-111.89535783798731,68.104642162012695,null,25704,660695616,null,31.884013363934546,-11.956792387052412,null,-1.8279550128049755,-99.938565450934902,null,0,0,null,0,0]
[25853.75,25.853750000000002,177.77216154701506,1.5651711194219113,1.0001319314034558,1.624296156345938E-2,1,0,48888.47346321003,1.57077587207563,25.367464410412552,1.5313655361554575,1.0146281147431357,0.17001173210652451,1,0,1,0,1.005063126455481,0.19640821568381991,-6.1339207968431015,-111.99940879745004,68.000591202549955,null,25853.75,668416389.0625,null,31.882498218150115,-11.999000648542211,null,-1.8789109820824488,-100.00040814890781,null,0,0,null,0,0]
[26003.5,26.003499999999999,178.8018203488046,1.5652035134145379,1.0001334640726465,1.6337027297189128E-2,1,0,49171.645107480639,1.5707759898710885,{"$f":"SQRT(1+(A343/Zero2)^2)","v":25.514170073466026},{"$f":"ATAN(A343/Zero2)","v":1.5315923785057903},1.0147968242201477,0.17097744712687823,1,0,1,0,1.0051229886292248,0.19754891929853816,-6.1861101181259546,-112.10357380465966,67.896426195340339,null,26003.5,676182012.25,null,31.880976565165877,-12.04134168336298,null,-1.9295786503810626,-100.06223212129669,null,0,0,null,0,0]
[26153.25,26.15325,179.83147933607489,1.5652355364513924,1.0001350055913529,1.6431092741782172E-2,1,0,49454.81675175194,1.5707761063175851,25.660877034401761,1.531816627086227,1.0149664797871192,0.17194284020132206,1,0,1,0,1.0051832204833573,0.19868967345897953,-6.2380210176922208,-112.20785055892861,67.792149441071388,null,26153.25,683992485.5625,null,31.879448382027032,-12.083812806820273,null,-1.9799613668084881,-100.12403775210835,null,0,0,null,0,0]
[26303,26.303000000000001,180.86113850565809,1.5652671948680645,1.0001365559595348,1.6525157895575213E-2,1,0,49737.988396023888,1.57077622143816,25.807585271085756,1.532038326108387,1.0151370809697016,0.17290790969226402,1,0,1,0,1.0052438224272662,0.1998304783811706,-6.2896568093964511,-112.31223681008593,67.687763189914065,null,26303,691847809,null,31.877913646693404,-12.126411393267894,null,-2.0300624231790816,-100.18582541681805,null,0,0,null,0,0]
[26456,26.456,181.91314438652984,1.5652991702268808,1.0001381491147103,1.6621264228102933E-2,1,0,50027.305668636305,1.5707763377112012,25.957478787950841,1.5322622484181254,1.0153123608083698,0.17389358803650562,1,0,1,0,1.0053061222584787,0.20099609465745699,-6.342132503534998,-112.41899933699133,67.581000663008666,null,26456,699919936,null,31.87633881420534,-12.170063461067951,null,-2.0809632848295685,-100.24893587592339,null,0,{"$f":"IF(AH346>0,W346,0)","v":0},null,0,0]
[26609,26.609000000000002,182.965150451255,1.5653307778843246,1.0001397515075598,1.6717370253561167E-2,1,0,50316.622941249392,1.5707764526471177,26.107373591409669,1.5324835994506734,1.0154886267446512,0.17487892515470058,1,0,1,0,1.005368809288856,0.20216176437458025,-6.3943278324198571,-112.52587157159535,67.474128428404654,null,26609,708038881,null,31.874757098313246,-12.213843224775202,null,-2.1315768978223346,-100.31202834682014,null,0,0,null,0,0]
[26762,26.762,184.01715669668044,1.5653620241466595,1.0001413631380387,1.6813475970176048E-2,1,0,50605.940213863134,1.5707765662688429,26.257269659427916,1.5327024232204527,1.015665878265142,0.17586391931169912,1,0,1,0,1.0054318839622118,0.20332748775879653,-6.446246150640345,-112.63285126834201,67.367148731657991,null,26762,716204644,null,31.873168478279169,-12.25774806444625,null,-2.1819065960087438,-100.37510320389575,null,0,0,null,0,0]
[26915,26.914999999999999,185.06916311972461,1.5653929151767627,1.0001429840061018,1.6909581376173755E-2,1,0,50895.257486477531,1.5707766785987887,26.407166970471369,1.5329187627434946,1.0158441148539277,0.17684856877622113,1,0,1,0,1.0054953467247769,0.20449326503495127,-6.4978907549736933,-112.73993623077449,67.260063769225511,null,26915,724417225,null,31.871572934237989,-12.30177541753312,null,-2.2319556563009204,-100.43816081324141,null,0,0,null,0,0]
[27071.75,27.071750000000002,186.14695419497545,1.5654242012379871,1.0001446541812531,1.7008041982843475E-2,1,0,51191.665868715478,1.570776792365159,26.560739502311254,1.5331378723346814,1.0160277410244352,0.17785699253149045,1,0,1,0,1.0055607678900642,0.20568767140660035,-6.550520686805875,-112.849752745719,67.150247254280998,null,27071.75,732879648.0625,null,31.869931083197901,-12.347006306229495,null,-2.2829437370930097,-100.50274643948948,null,0,0,null,0,0]
[27228.5,27.2285,187.22474545033245,1.5654551270921211,1.0001463340522652,1.7106502259713878E-2,1,0,51488.07425095408,1.5707769048216609,26.71431329464502,1.5333544627255489,1.0162124000383077,0.17886505082413165,1,0,1,0,1.0056265973576728,0.20688213481754145,-6.6028701481509868,-112.95967523435432,67.040324765645678,null,27228.5,741391212.25,null,31.868281925054099,-12.392360519955968,null,-2.3336440402943155,-100.56731471439835,null,0,0,null,0,0]
[27385.25,27.385249999999999,188.30253688270292,1.5654856989242811,1.0001480236190894,1.7204962204877602E-2,1,0,51784.482633193336,1.5707770159907868,26.867888325858164,1.5335685770943353,1.0163980913326056,0.17987274180515653,1,0,1,0,1.0056928356153334,0.20807665550490526,-6.6549425039353336,-113.06970148617611,66.930298513823885,null,27385.25,749951917.5625,null,31.866625441113371,-12.437835480131211,null,-2.3840599121379364,-100.6318660060449,null,0,0,null,0,0]
[27542,27.542000000000002,189.38032848906474,1.5655159227787849,1.0001497228816767,1.7303421816427311E-2,1,0,52080.891015433212,1.5707771258945171,27.021464574827363,1.5337802576385859,1.0165848143416536,0.18088006362990802,1,0,1,0,1.005759483153428,0.20927123370423517,-6.7067410610300087,-113.17982933893029,66.82017066106971,null,27542,758561764,null,31.864961613525256,-12.48342866458229,null,-2.4341946416444973,-100.69640067434798,null,0,0,null,0,0]
[27702.5,27.702500000000001,190.4839047608171,1.5655465152966992,1.0001514728428988,1.7404236573402988E-2,1,0,52384.390507296695,1.5707772371387916,27.17871613698188,1.5339945235228547,1.016777072847908,0.1819110996317046,1,0,1,0,1.005828149729842,0.21049445016596971,-6.7594985099137537,-113.29269489621554,66.707305103784464,null,27702.5,767428506.25,null,31.863250354385563,-12.530232519029946,null,-2.4852408313885501,-100.7624623771856,null,0,0,null,0,0]
[27863,27.863,191.58748120879002,1.5655767553784379,1.0001532329692402,1.7505050976564254E-2,1,0,52687.889999160834,1.570777347101459,27.335968932551928,1.5342063242464592,1.0169704118146714,0.18294174470273949,1,0,1,0,1.00589724645279,0.21171772741902345,-6.8119757390850646,-113.40566253494211,66.59433746505789,null,27863,776346769,null,31.86153136073855,-12.577155144666214,null,-2.5359990669128467,-100.8285073902759,null,0,0,null,0,0]
[28023.5,28.023499999999999,192.69105782995567,1.565606649079343,1.000155003260647,1.7605865023863722E-2,1,0,52991.389491025591,1.5707774558045402,27.493222940373233,1.534415702090445,1.0171648306258341,0.183971996876997,1,0,1,0,1.0059667738573221,0.21294106571102384,-6.8641761178325842,-113.51873008245266,66.481269917547337,null,28023.5,785316552.25,null,31.859804615993799,-12.62419400758294,null,-2.5864727009156163,-100.89453607486971,null,0,0,null,0,0]
[28184,28.184000000000001,193.79463462135536,1.5656362023168287,1.0001567837170653,1.7706678713254043E-2,1,0,53294.888982890967,1.570777563269554,27.650478139762825,1.5346226983748668,1.017360328662317,0.18500185419329634,1,0,1,0,1.0060367324813912,0.21416446528781641,-6.9161029572820842,-113.63189541339405,66.368104586605952,null,28184,794337856,null,31.858070104373134,-12.671346629180912,null,-2.6366650287444471,-100.96054878421312,null,0,0,null,0,0]
[28348,28.347999999999999,194.92227712309668,1.5656660543530359,1.0001586134995082,1.7809690460176331E-2,1,0,53605.006843738462,1.5707776718210622,27.811163790058217,1.5348317905845557,1.0175612040323267,0.18605375955409925,1,0,1,0,1.0061086626730602,0.21541460691797706,-6.9688829914646986,-113.74762736609397,66.252372633906035,null,28348,803609104,null,31.856289730137956,-12.719642485256333,null,-2.6876646886918865,-101.02798488083761,null,0,0,null,0,0]
[28512,28.512,196.04991979654361,1.5656955629825495,1.0001604538950155,1.7912701829087833E-2,1,0,53915.124704586589,1.5707777791238018,27.971850642275701,1.5350384805045818,1.0177632048936052,0.18710524852352384,1,0,1,0,1.0061810442412524,0.21666481304816643,-7.0213842357444403,-113.86345707231868,66.136542927681319,null,28512,812934144,null,31.854501215767158,-12.768052053372955,null,-2.7383774186008267,-101.09540501894574,null,0,0,null,0,0]
[28676,28.675999999999998,197.17756263875026,1.5657247340970648,1.0001623049035282,1.8015712817804456E-2,1,0,54225.242565435314,1.5707778851991978,28.132538675819944,1.53524280928148,1.0179663305761393,0.18815631902503244,1,0,1,0,1.0062538777692545,0.21791508393483991,-7.0736100429483155,-113.97938240918441,66.02061759081559,null,28676,822312976,null,31.852704546889651,-12.816572858258699,null,-2.7888065569271991,-101.1628095509257,null,0,0,null,0,0]
[28840,28.84,198.30520564683769,1.5657535734542689,1.0001641665249879,1.8118723424142173E-2,1,0,54535.360426284649,1.5707779900681886,28.293227870563332,1.5354448171278299,1.0181705804067214,0.18920696898743813,1,0,1,0,1.0063271638435025,0.21916541983246918,-7.1255637081089693,-114.09540129980591,65.904598700194086,null,28840,831745600,null,31.850899709911339,-12.865202478431893,null,-2.8389553851095384,-101.23019882137399,null,0,0,null,0,0]
[29008,29.007999999999999,199.4603523119853,1.5657827780986295,1.0001660845561688,1.8224246085527928E-2,1,0,54853.042137399214,1.5707780962654476,28.457837497424723,1.5356493865421637,1.0183809768432119,0.19028280634952768,1,0,1,0,1.0064027072367152,0.22044631940024925,-7.1785057413797109,-114.21434479976558,65.785655200234416,null,29008,841464064,null,31.849042369736477,-12.915128539375113,null,-2.8900400782054199,-101.29921626039045,null,0,0,null,0,0]
[29176,29.175999999999998,200.61549914529576,1.5658116464215182,1.0001680137241884,1.8329768341015185E-2,1,0,55170.723848514397,1.5707782012397054,28.622448301509891,1.5358516029631071,1.018592551492622,0.19135819802562209,1,0,1,0,1.0064787267767183,0.22172728772308511,-7.2311690150265004,-114.33338220314639,65.666617796853615,null,29176,851238976,null,31.847176431672516,-12.965163810909619,null,-2.9408374137882474,-101.36821839223677,null,0,0,null,0,0]
[29344,29.344000000000001,201.77064614388084,1.5658401841992575,1.0001699540289823,1.843529018825632E-2,1,0,55488.405559630177,1.5707783050119679,28.78706026262395,1.5360515067390788,1.0188053036209155,0.19243314180685486,1,0,1,0,1.0065552231041677,0.22300832506798243,-7.2835568909829638,-114.45251141919084,65.547488580809159,null,29344,861070336,null,31.845301883483252,-13.015305855886155,null,-2.9913507415554443,-101.43720556330466,null,0,0,null,0,0]
[29512,29.512,202.9257933049181,1.5658683970766469,1.0001719054704854,1.8540811624903779E-2,1,0,55806.087270746561,1.5707784076027627,28.951673361031165,1.5362491373015965,1.0190192324905858,0.19350763549033945,1,0,1,0,1.0066321968631684,0.22428943169971655,-7.335672673168995,-114.57173040232753,65.428269597672468,null,29512,870958144,null,31.843418713683903,-13.065552290005206,null,-3.0415833539421264,-101.50617811232233,null,0,0,null,0,0]
[29684,29.684000000000001,204.10844413520951,1.5658969508533691,1.0001739149124191,1.8648845048884085E-2,1,0,56131.332832128202,1.5707785114331441,29.120206977017588,1.5364491585490645,1.0192394732324184,0.19460724376252406,1,0,1,0,1.0067114986249299,0.22560111292543586,-7.3887508092595819,-114.69387884128592,65.306121158714078,null,29684,881139856,null,31.841481763311407,-13.117100778927739,null,-3.0927245396602228,-101.57677806235819,null,0,0,null,0,0]
[29856,29.856000000000002,205.29109512999685,1.5659251756421235,1.0001759360275564,1.8756878037506104E-2,1,0,56456.578393510455,1.5707786140671949,29.288741744651816,1.5366468778594931,1.0194609458424317,0.19570637559482809,1,0,1,0,1.006791302201155,0.2269128673311058,-7.4415505685488581,-114.81611717320685,65.183882826793152,null,29856,891380736,null,31.839535753836735,-13.16875379258841,null,-3.1435782894748248,-101.64736338061847,null,0,0,null,0,0]
[30028,30.027999999999999,206.47374628645358,1.5659530770960481,1.0001779688158265,1.8864910588250749E-2,1,0,56781.823954893283,1.5707787155254727,29.457277644166979,1.5368423347279698,1.0196836495179504,0.19680502864286284,1,0,1,0,1.0068716082942735,0.22822469519352562,-7.4940753161672511,-114.93844334194756,65.061556658052439,null,30028,901680784,null,31.837580675230164,-13.220508934939678,null,-3.1941479584866519,-101.71793440700789,null,0,0,null,0,0]
[30200,30.2,207.65639760181736,1.5659806607394999,1.0001800132771581,1.8972942698598991E-2,1,0,57107.069516276701,1.5707788158280667,29.625814656245879,1.5370355677515553,1.0199075834525402,0.19790320056890481,1,0,1,0,1.0069524176104871,0.22953659678699251,-7.5463283591459174,-115.06085533565138,64.939144664348618,null,30200,912040000,null,31.835616518187585,-13.272363861742198,null,-3.2444368444227352,-101.78849147390919,null,0,0,null,0,0]
[30375.75,30.37575,208.86483362754117,1.5660085231079237,1.0001821143700125,1.9083329702665876E-2,1,0,57439.406187283887,1.5707789171441633,29.798027296706032,1.5372307558489582,1.0201376696099407,0.19902481580083142,1,0,1,0,1.0070355092962771,0.23087717732872529,-7.599443366483567,-115.18602279942422,64.813977200575778,null,30375.75,922686188.0625,null,31.833600151518006,-13.3254500316222,null,-3.2955354850908076,-101.860572767802,null,0,0,null,0,0]
[30551.5,30.551500000000001,210.0732698135437,1.566036064922552,1.0001842276503254,1.9193716241606422E-2,1,0,57771.742858291655,1.5707790172946017,29.97024105937647,1.5374237007900573,1.0203690385419588,0.20014592378954069,1,0,1,0,1.0071191278899929,0.23221783542254484,-7.6522814934536196,-115.31127576058073,64.688724239419273,null,30551.5,933394152.25,null,31.831574288814576,-13.378635595208468,null,-3.3463477493574283,-101.93264016537223,null,0,0,null,0,0]
[30727.25,30.727250000000002,211.28170615707478,1.566063291683613,1.0001863531180195,1.9304102312733419E-2,1,0,58104.07952929999,1.5707791162993832,30.142455925022539,1.537614441008277,1.0206016893761853,0.20126652206276535,1,0,1,0,1.0072032741572112,0.23355857135290423,-7.7048460886609673,-115.43661220813523,64.56338779186477,null,30727.25,944163892.5625,null,31.829538922353269,-13.431918209923515,null,-3.3968769781034664,-102.00469399821172,null,0,0,null,0,0]
[30903,30.902999999999999,212.49014265544685,1.5660902087662176,1.0001884907730172,1.941448791335974E-2,1,0,58436.416200308893,1.5707792141780548,30.314671874846518,1.5378030140643399,1.0208356212361744,0.20238660815560636,1,0,1,0,1.0072879488675976,0.23489938540147223,-7.7571404429764046,-115.56203017417205,64.437969825827949,null,30903,954995409,null,31.827494045105922,-13.485295583588087,null,-3.4471264551715608,-102.07673459058398,null,0,0,null,0,0]
[31083,31.082999999999998,213.72780181580535,1.5661174612465503,1.0001906927538089,1.952754237654698E-2,1,0,58776.789462224704,1.5707793132763088,30.491053468623303,1.5379939391595732,1.0210765370014407,0.20353324678001355,1,0,1,0,1.0073752197628254,0.2362727043843755,-7.8104226403966397,-115.69056349403,64.309436505969998,null,31083,966152889,null,31.825389853291849,-13.540059613207601,null,-3.4983044607777214,-102.1505038808224,null,0,0,null,0,0]
[31263,31.263000000000002,214.9654611330711,1.5661443999156881,1.0001929075182934,1.9640596340497751E-2,1,0,59117.16272414109,1.5707794112334257,30.66743616108679,1.5381826680635307,1.0213187946234723,0.20467934294352244,1,0,1,0,1.0074630466152716,0.23764610589833482,-7.8634281763463605,-115.81917827750507,64.180821722494926,null,31263,977375169,null,31.823275672370318,-13.594918329215965,null,-3.5491958158059123,-102.22425994828912,null,0,0,null,0,0]
[31443,31.443000000000001,216.20312060454958,1.5661710301628491,1.0001951350663854,1.9753649802325461E-2,1,0,59457.535986058028,1.5707795080690032,30.843819933388218,1.5383692384401342,1.0215623931476288,0.20582489402225479,1,0,1,0,1.0075514302651003,0.23901959023677549,-7.9161604064386815,-115.94787254315612,64.052127456843877,null,31443,988662249,null,31.821151496920987,-13.649869424415119,null,-3.5998038704489033,-102.29800311874101,null,0,0,null,0,0]
[31623,31.623000000000001,217.44078022760741,1.5661973572545522,1.0001973753979996,1.9866702759143578E-2,1,0,59797.909247975513,1.5707796038021931,31.020204767107412,1.5385536870972674,1.0218073316148981,0.20696989740055002,1,0,1,0,1.0076403715569482,0.24039315768999631,-7.9686226283762576,-116.07664435182532,63.923355648174677,null,31623,1000014129,null,31.819017322197777,-13.704910641099708,null,-3.6501319176632672,-102.37173371072562,null,0,0,null,0,0]
[31807,31.806999999999999,218.70594355183422,1.5662239614161186,1.0001996787274674,1.998226747891757E-2,1,0,60145.846360158401,1.5707797005428683,31.200510342114821,1.5387400791009522,1.0220590970948356,0.2081397764911217,1,0,1,0,1.0077318665738679,0.24179733506917378,-8.0219749768163027,-116.20835592707864,63.791644072921358,null,31807,1011685249,null,31.816825382059761,-13.76126584328073,null,-3.7012923259652952,-102.44709008379792,null,0,0,null,0,0]
[31991,31.991,219.97110702907639,1.5662502595501167,1.000201995414745,2.0097831664888443E-2,1,0,60493.783472341842,1.5707797961707126,31.380816988633331,1.5389243291834975,1.0223122606922297,0.20930907776778881,1,0,1,0,1.0078239460913492,0.2432015999015307,-8.0750519722557303,-116.34014456250945,63.659855437490549,null,31991,1023424081,null,31.814622985335419,-13.817710598444615,null,-3.7521669246803775,-102.52243396406486,null,0,0,null,0,0]
[32175,32.174999999999997,221.23627065670885,1.5662762569066648,1.000204325459739,2.0213395313973179E-2,1,0,60841.720584525836,1.5707798907048183,31.561124688298506,1.5391064740424665,1.0225668213686576,0.21047779846341264,1,0,1,0,1.0079166110260498,0.24460595248691747,-8.1278569580043794,-116.47200831621733,63.527991683782673,null,32175,1035230625,null,31.812410129006356,-13.874242646524403,null,-3.8027590540999712,-102.59776566969292,null,0,0,null,0,0]
[32359,32.359000000000002,222.50143443216621,1.5663019586164733,1.0002066688623568,2.0328958423088853E-2,1,0,61189.657696710354,1.5707799841638428,31.741433423163116,1.5392865495421393,1.0228227780810015,0.21164593581994587,1,0,1,0,1.0080098622994813,0.24601039312170028,-8.1803932197262892,-116.6039452875,63.396054712500003,null,32359,1047104881,null,31.810186810703232,-13.930859775692713,null,-3.8530719975187533,-102.67308551180727,null,0,0,null,0,0]
[32547.5,32.547499999999999,223.79753986367265,1.5663279875616198,1.0002090834279929,2.044734724073273E-2,1,0,61546.104140443422,1.5707800788127699,31.926152937670402,1.5394689198122673,1.023086441175505,0.21284203396614854,1,0,1,0,1.0081060031669824,0.24744927310134926,-8.2339390489118198,-116.7391829586817,63.260817041318305,null,32547.5,1059339756.25,null,31.80789826705411,-13.98894752761699,null,-3.904329283055163,-102.75023543106472,null,0,0,null,0,0]
[32736,32.735999999999997,225.09364544505715,1.5663537167536654,1.000211512012404,2.0565735485123048E-2,1,0,61902.550584177035,1.5707801723716845,32.110873501790429,1.5396491918869768,1.0233515671939735,0.21403751406084337,1,0,1,0,1.0082027613770441,0.24888824610822316,-8.2872096504168535,-116.87449356173434,63.12550643826566,null,32736,1071645696,null,31.805598740414801,-14.047120023087404,null,-3.9553003579208923,-102.82737353864695,null,0,0,null,0,0]
[32924.5,32.924500000000002,226.38975117374548,1.5663791513409318,1.0002139546154876,2.0684123152945391E-2,1,0,62258.99702791118,1.5707802648593086,32.29559509751283,1.5398274017576876,1.0236181549996768,0.2152323731685106,1,0,1,0,1.0083001379362573,0.25032731244947737,-8.3402083772010762,-117.00987518014693,62.990124819853065,null,32924.5,1084022700.25,null,31.803288230228482,-14.105375032827276,null,-4.0059885745187902,-102.90450014731968,null,0,0,null,0,0]
[33113,33.113,227.68585704722207,1.5664042963545148,1.0002164112371414,2.0802510240885429E-2,1,0,62615.443471645849,1.5707803562939371,32.480317707236892,1.5400035845975866,1.0238862034508045,0.21642660836377195,1,0,1,0,1.0083981338565273,0.2517664724283511,-8.3929385243375751,-117.14532593790558,62.854674062094418,null,33113,1096470769,null,31.800966736569187,-14.163710374997871,null,-4.0563972279959932,-102.98161556290769,null,0,0,null,0,0]
[33305.75,33.305750000000003,229.01118561407822,1.5664297139798491,1.0002189377429449,2.0923565930631969E-2,1,0,62979.926506287542,1.5707804487198413,32.669206180968942,1.5401816794422454,1.0241618046549248,0.21764712107764214,1,0,1,0,1.0084989807587328,0.25323817745127214,-8.4465831899905055,-117.28390020712293,62.716099792877074,null,33305.75,1109272983.0625,null,31.798581544537111,-14.223441815075178,null,-4.1076567016168477,-103.06045839204775,null,0,0,null,0,0]
[33498.5,33.4985,230.33651432718565,1.5664548391052564,1.0002214789063626,2.1044621007044156E-2,1,0,63344.409540929766,1.5707805400821102,32.858095678982096,1.5403577266846771,1.0244389306807906,0.21886697527402924,1,0,1,0,1.0086004774225081,0.25470998101046749,-8.4999538171860127,-117.42254292593456,62.577457074065435,null,33498.5,1122149502.25,null,31.79618487026611,-14.283252782903995,null,-4.1586306545413549,-103.13929014303058,null,0,0,null,0,0]
[33691.25,33.691249999999997,231.66184318403438,1.5664796767508482,1.0002240347272828,2.1165675466578715E-2,1,0,63708.892575572507,1.5707806303989993,33.04698618371264,1.5405317614250298,1.0247175802912771,0.22008616785828894,1,0,1,0,1.0087026249469344,0.2561818834173234,-8.553053749647626,-117.56125221266134,62.438747787338656,null,33691.25,1135100326.5625,null,31.793776715758813,-14.343141091129842,null,-4.2093224324956706,-103.21811112153151,null,0,0,null,0,0]
[33884,33.884,232.98717218217141,1.5665042318225122,1.0002266052055933,2.1286729305692476E-2,1,0,64073.375610215764,1.5707807196883485,33.235877677996065,1.540703817965998,1.0249977522438074,0.22130469574700046,1,0,1,0,1.0088054244368636,0.25765388497885849,-8.6058862734026551,-117.7000262251394,62.299973774860604,null,33884,1148125456,null,31.79135708362719,-14.403104598708291,null,-4.2597353241190774,-103.29692162643113,null,0,0,null,0,0]
[34081.5,34.081499999999998,234.34516183144308,1.566529103921352,1.000229254232557,2.1410765666096395E-2,1,0,64446.840717049206,1.5707808101304812,33.429425094776768,1.54087809768535,1.0252864063359786,0.22255255952824277,1,0,1,0,1.0089114346724208,0.25916226471294562,-8.6597467684758147,-117.8422853419534,62.157714658046601,null,34081.5,1161548642.25,null,31.78886592169945,-14.464621616429902,null,-4.3111046572644938,-103.37766372552348,null,0,0,null,0,0]
[34279,34.279000000000003,235.70315162401519,1.5665536894219489,1.0002319186479849,2.1534801367593066E-2,1,0,64820.305823883158,1.5707808995304411,33.622973515233738,1.5410503709505579,1.0255766560670898,0.22379971893162676,1,0,1,0,1.0090181317696745,0.26067074918739297,-8.7133333176659367,-117.98460862059457,62.015391379405429,null,34279,1175049841,null,31.786362716918397,-14.526213177915283,null,-4.3621880016735641,-103.45839544267929,null,0,0,null,0,0]
[34476.5,34.476500000000001,237.06114155742506,1.5665779932495529,1.000234598451754,2.1658836406371229E-2,1,0,65193.770930717626,1.5707809879061383,33.816522922133373,1.541220672203224,1.0258685000827745,0.22504617067699614,1,0,1,0,1.009125516935971,0.26217933871806881,-8.7666492759842676,-118.1269942013039,61.873005798696099,null,34476.5,1188629052.25,null,31.783847473966269,-14.587877122893026,null,-4.4129887170397675,-103.53911707841087,null,0,0,null,0,0]
[34674,34.673999999999999,238.41913162926613,1.5666020202172031,1.0002372936437405,2.1782870778619748E-2,1,0,65567.236037552604,1.5707810752750755,34.010073298634317,1.5413890351013895,1.026161937022773,0.22629191149671149,1,0,1,0,1.0092335913849722,0.26368803361593074,-8.8196979404628735,-118.26944026320028,61.730559736799719,null,34674,1202286276,null,31.781320198119406,-14.64961133668031,null,-4.463510105671511,-103.61982892651994,null,0,0,null,0,0]
[34875.75,34.875749999999996,239.80634441275939,1.5666262832513647,1.0002400627218886,2.1909573552792952E-2,1,0,65948.737735294664,1.5707811635024003,34.207789667245045,1.5415590538337722,1.0264633317181868,0.2275637219745528,1,0,1,0,1.0093447044466646,0.26522930321108718,-8.8736155443218738,-118.41501221347431,61.584987786525687,null,34875.75,1216317938.0625,null,31.778726119860682,-14.712744408722926,null,-4.5148336312717881,-103.70226780475139,null,0,0,null,0,0]
[35077.5,35.077500000000001,241.19355733580153,1.5666502671902369,1.0002428478573944,2.2036275623402733E-2,1,0,66330.239433037219,1.5707812507148373,34.405507013313922,1.5417271184853876,1.0267663857436899,0.22883478374787736,1,0,1,0,1.0094565393558423,0.26677068339719134,-8.927261002358394,-118.56064355429513,61.439356445704874,null,35077.5,1230431006.25,null,31.776119498214076,-14.775946485588733,null,-4.565872467661702,-103.78469706870639,null,0,0,null,0,0]
[35279.25,35.279249999999998,242.58077039599843,1.5666739768218627,1.0002456490501239,2.216297698638698E-2,1,0,66711.741130780298,1.570781336929798,34.603225320085819,1.5418932625427451,1.0270710976304456,0.23010509337421262,1,0,1,0,1.0095690974265499,0.26831217448967976,-8.9806376501180356,-118.70633246342609,61.293667536573906,null,35279.25,1244625480.5625,null,31.773500340611065,-14.839215452400488,null,-4.6166299578183327,-103.86711701102558,null,0,0,null,0,0]
[35481,35.481000000000002,{"$f":"SQRT(1+(A397/pole1)^2)","v":243.96798359101058},{"$f":"ATAN(A397/pole1)","v":1.5666974168253858},{"$f":"SQRT(1+(A397/Zero1)^2)","v":1.0002484662999422},{"$f":"ATAN(A397/Zero1)","v":2.228967763768373E-2},{"$f":"IF(VIN_nom>Vout, 1, SQRT(1+(A397/z_RHP)^2))","v":1},{"$f":"IF(VIN_nom>Vout, 0, -ATAN(A397/z_RHP))","v":0},{"$f":"SQRT(1+(A397/Pole2)^2)","v":67093.242828523842},{"$f":"ATAN(A397/Pole2)","v":1.5707814221642977},34.800944571186321,1.5420575187317791,{"$f":"SQRT(1+(A397/pole4)^2)","v":1.0273774659033288},{"$f":"ATAN(A397/pole4)","v":0.23137464742486885},{"$f":"IF(VOUT_setting=1,1,SQRT(1+(A397*zterm1)^2))","v":1},{"$f":"IF(VOUT_setting=1,0,ATAN(((A397*zterm1))))","v":0},1,{"$f":"IF(VOUT_setting=1,0,ATAN(A397*$Q$4/(1+Afbr-$Q$5*(A397)^2)))","v":0},{"$f":"SQRT((1-(Z397/pterm2))^2+(A397/pterm1)^2)","v":1.0096823799796564},{"$f":"IF((ATAN((A397/pterm1)/(1-A397^2/pterm2))>0),ATAN((A397/pterm1)/(1-A397^2/pterm2)),PI()+ATAN((A397/pterm1)/(1-A397^2/pterm2)))","v":0.26985377679853584},{"$f":"20*LOG10(((E397*K397*G397*O397)/(C397*I397*S397*M397*Q397))*Adc)","v":-9.0337487655879727},{"$f":"((F397+L397+H397+P397)-(D397+J397+T397+N397+R397))*radconv","v":-118.85207715642341},{"$f":"IF(V397>0,V397,V397+180)","v":61.147922843576595},null,{"$f":"IF(U397<0,A397,1000000000)","v":35481},{"$f":"A397^2","v":1258901361},null,{"$f":"20*LOG10((K397/(I397*M397))*AEA)","v":31.770868655056081},{"$f":"(L397-(J397+N397))*radconv","v":-14.902549238625744},null,{"$f":"20*LOG10((E397*G397/(C397*S397))*Acs*Am)","v":-4.6671093877332863},{"$f":"(F397+H397-(D397+T397))*radconv","v":-103.94952791779761},null,{"$f":"SUM((U398<0)*(U397>0))*A397","v":0},0,null,0,0]
[35687.75,{"$f":"A398/1000","v":35.687750000000001},245.3895764326694,1.5667211627949837,1.000251370028874,2.2419517587293072E-2,1,0,67484.199339099214,1.5707815085113601,35.003564890627025,1.5422239205323123,1.0276931438671544,0.23267487755269403,1,0,1,0,1.0097992230571688,0.27143370056818694,-9.0879040264903761,-119.00148990842956,60.998510091570438,null,35687.75,1273615500.0625,null,31.768158759485555,-14.967517763868447,null,-4.718554753065165,-104.0339721445611,null,0,0,null,{"$f":"SUM((V399<-183)*(V398>-183))*A398","v":0},{"$f":"IF(AK398>0,U398,0)","v":0}]
[35894.5,35.894500000000001,246.81116941110238,1.5667446352185981,1.000254290620358,2.2549356780865192E-2,1,0,67875.155849675095,1.5707815938637155,35.20618616814464,1.5423884069611642,1.028010558178597,0.23397430694349672,1,0,{"$f":"IF(VOUT_setting=1,1,SQRT((1+Afbr-$Q$5*(A399)^2)^2+(A399*$Q$4)^2))","v":1},0,1.0099168298025676,0.27301374177656634,-9.1417872211035078,-119.15095756633578,60.849042433664223,null,35894.5,1288415130.25,null,31.765435726096904,-15.032550095980346,null,-4.7697149142896418,-104.11840747035546,null,0,0,null,0,0]
[36101.25,36.10125,248.23276252395959,1.5667678387958779,1.0002572280742463,2.2679195214029019E-2,1,0,68266.112360251427,1.5707816782384538,35.408808387291835,1.5425510108907396,1.0283297072297823,0.23527293195259011,1,0,1,0,1.0100352016596001,0.27459390073928008,-9.1954016975709401,-119.30047832644945,60.699521673550549,null,36101.25,1303300251.5625,null,31.762699565267948,-15.097644143665402,null,-4.8205932299281189,-104.20283418278406,null,0,0,null,0,0]
[36308,36.308,249.65435576894478,1.566790778119429,1.0002601823903905,2.2809032882413632E-2,1,0,68657.068870828269,1.5707817616522757,35.611431531995535,1.5427117644456925,1.0286505894060503,0.23657074895065044,1,0,1,0,1.0101543400794804,0.27617417776580133,-9.2487507461600487,-119.45005042229425,60.549949577705746,null,36308,1318270864,null,31.759950287936768,-15.162797859328462,null,-4.8711930011860458,-104.28725256296579,null,0,0,null,0,0]
[36519.5,36.519500000000001,251.10860969444272,1.5668139757141892,1.0002632220284429,2.2941852724310929E-2,1,0,69057.00745359539,1.5707818460052287,35.818710805140554,1.5428743293528973,1.0289806353428963,0.23789754294636989,1,0,1,0,1.0102770103610355,0.27779088351586062,-9.303054194389329,-119.60311019278681,60.396889807213185,null,36519.5,1333673880.25,null,31.757124287030557,-15.229508105631149,null,-4.9226704485091135,-104.3736020871557,null,0,0,null,0,0]
[36731,36.731000000000002,252.56286375351314,1.5668369061659952,1.000266279312142,2.3074671756631613E-2,1,0,69456.946036363006,1.5707819293867595,36.025991013986484,1.5430350235877788,1.0293124915155483,0.23922348374321459,1,0,1,0,1.0104004859290858,0.27940771345236337,-9.357086664127273,-119.75622006013606,60.243779939863941,null,36731,1349166361,null,31.754284584886697,-15.296276593209864,null,-4.973863216103207,-104.45994346692618,null,0,0,null,0,0]
[36942.5,36.942500000000003,254.01711794386202,1.5668595740630222,1.0002693542413255,2.3207489974697033E-2,1,0,69856.884619131088,1.5707820118135531,36.233272142474682,1.543193879246856,1.0296461561736829,0.24054856750608503,1,0,1,0,1.0105247683613376,0.281024667886492,-9.4108514981466236,-119.90937824754835,60.090621752451653,null,36942.5,1364748306.25,null,31.751431194929488,-15.36310126429051,null,-5.0247746601653445,-104.54627698325785,null,0,0,null,0,0]
[37154,37.154000000000003,255.47137226324742,1.5668819838889754,1.0002724468158313,2.3340307373828716E-2,1,0,70256.823201899635,1.5707820933019139,36.440554174911831,1.5433509276967345,1.0299816275597122,0.24187279041687615,1,0,1,0,1.0106498592436055,0.28264174712258222,-9.4643519814360992,-120.06258301462515,59.937416985374853,null,37154,1380419716,null,31.748564131127903,-15.429980103871824,null,-5.0754080796532399,-104.63260291075329,null,0,0,null,0,0]
[37370.25,37.370249999999999,256.95828727176712,1.5669046347431124,1.000275627089356,2.3476106818029443E-2,1,0,70665.743856858506,1.5707821756667055,36.652492396234507,1.5435096666244066,1.0303264993831671,0.24322585952960679,1,0,1,0,1.0107785970448777,0.28429527308861519,-9.5187840521552918,-120.21927493540854,59.780725064591465,null,37370.25,1396535585.0625,null,31.745618554173131,-15.498414902053911,null,-5.1268945734176565,-104.72086003335463,null,0,0,null,0,0]
[37586.5,37.586500000000001,258.44520241060513,1.5669270249625296,1.0002788258093354,2.3611905396207861E-2,1,0,71074.664511817842,1.5707822570837429,{"$f":"SQRT(1+(A407/Zero2)^2)","v":36.864431530508945},{"$f":"ATAN(A407/Zero2)","v":1.5436665803282883},1.0306732562599117,0.24457802067077944,1,0,1,0,1.0109081833960833,0.28594893014674122,-9.5729465311747184,-120.37601198394498,59.623988016055023,null,37586.5,1412744982.25,null,31.742658713495583,-15.566902200615386,null,-5.1780972117595354,-104.80910978332957,null,0,0,null,0,0]
[37802.75,37.802750000000003,259.93211767752513,1.5669491590200078,1.0002820429755923,2.3747703103363712E-2,1,0,71483.585166777644,1.5707823375692904,37.076371562079068,1.5438217001012202,1.0310218962879825,0.2459292698145947,1,0,1,0,1.011038620018476,0.28760271859985082,-9.6268427508947259,-120.53279241146959,59.467207588530414,null,37802.75,1429047907.5625,null,31.739684625691954,-15.635439976879141,null,-5.2290193436759091,-104.89735243459047,null,0,0,null,0,0]
[38019,38.018999999999998,261.41903307034147,1.5669710412865663,1.0002852785879488,2.3883499934496927E-2,1,0,71892.505821737912,1.5707824171392433,37.28831247564468,1.5439750565249388,1.0313724175576664,0.24727960295400325,1,0,1,0,1.0111699086420918,0.28925663874320806,-9.6804759861361411,-120.68961450474657,59.310385495253428,null,38019,1445444361,null,31.736696307888078,-15.704026249964446,null,-5.279664261113453,-104.98558825478213,null,0,0,null,0,0]
[38240.5,38.240499999999997,262.94204711543131,1.566993198228714,1.000288611875829,2.4022592653903271E-2,1,0,72311.354030171671,1.5707824977079787,37.505399674298836,1.5441303392037793,1.0317333968919908,0.24866176494791739,1,0,1,0,1.01130526971579,0.29095084868638127,-9.7351420244094626,-120.85028528074622,59.14971471925378,null,38240.5,1462335840.25,null,31.733620707370687,-15.77432587301891,null,-5.3312546988693823,-105.07595940772732,null,0,{"$f":"IF(AH410>0,W410,0)","v":0},null,0,0]
[38462,38.462000000000003,264.46506128812052,1.5670150999739345,1.0002919645159483,2.4161684443617132E-2,1,0,72730.202238605882,1.5707825773487347,37.722487766900933,1.5442838346223715,1.0320963458397585,0.25004295747149241,1,0,1,0,1.0114415283640572,0.2926451973940199,-9.7895389294055963,-121.01099624166571,58.989003758334292,null,38462,1479325444,null,31.730530215537179,-15.844672298814427,null,-5.3825611120320076,-105.16632394285129,null,0,0,null,0,0]
[38683.5,38.683500000000002,265.98807558621729,1.5670367509058831,1.0002953365081122,2.4300775298266009E-2,1,0,73149.050447040558,1.5707826560774516,37.939576738105636,1.5444355734533477,1.0324612623237899,0.25142317628015165,1,0,1,0,1.0115786864745389,0.29433968515829906,-9.8436700408873126,-121.17174565602285,58.82825434397715,null,38683.5,1496413172.25,null,31.727424852420025,-15.915063527655622,null,-5.4335868603965718,-105.25668212836725,null,0,0,null,0,0]
[38905,38.905000000000001,267.51109000757958,1.5670581553083869,1.0002987278521249,2.4439865212477603E-2,1,0,73567.898655475685,1.5707827339097076,38.156666572916734,1.5445855856716273,1.0328281442585887,0.25280241715014018,1,0,1,0,1.0117167459444574,0.29603431226284066,-9.8975386408319395,-121.33253182727387,58.667468172726132,null,38905,1513599025,null,31.724304638570008,-15.985497600995366,null,-5.4843352464911801,-105.3470342262785,null,0,0,null,0,0]
[39131.5,39.131500000000003,269.06848411227617,1.5670797923021718,1.0003022157620072,2.458209387575503E-2,1,0,73996.201676742756,1.5707828125877161,38.378657733265399,1.5447372291749033,1.0332053382728843,0.25421177644581977,1,0,1,0,1.0118588559768371,0.29776733718122506,-9.952355129506536,-121.49698376201934,58.50301623798066,null,39131.5,1531274292.25,null,31.721098655575073,-16.057563915727226,null,-5.5359457521708411,-105.43941984629213,null,0,0,null,0,0]
[39358,39.357999999999997,270.62587834148985,1.5671011802633945,1.0003057239068542,2.4724321544297056E-2,1,0,74424.504698010263,1.5707828903601619,38.600649766009155,1.5448871284804075,1.0335845830360932,0.25562010428771686,1,0,1,0,1.0120019125643864,0.2995005083739235,-10.006903883139342,-121.66147065148262,58.338529348517383,null,39358,1549052164,null,31.717877188876976,-16.12967101579666,null,-5.5872730391055487,-105.53179963568597,null,0,0,null,0,0]
[39584.5,39.584499999999998,272.18327269308332,1.5671223234668232,1.0003092522864532,2.4866548212360003E-2,1,0,74852.807719278251,1.5707829672425899,38.822642656182659,1.5450353135019905,1.0339658762916533,0.25702739622736748,1,0,1,0,1.0121459177666408,0.30123382611619504,-10.061188232017253,-121.82599078876518,58.174009211234818,null,39584.5,1566932640.25,null,31.714640262036831,-16.201816933278739,null,-5.638320461143314,-105.62417385548648,null,0,0,null,0,0]
[39811,39.811,273.74066716496765,1.5671432260899449,1.0003128009005902,2.5008773874200457E-2,1,0,75281.110740546646,1.5707830432501908,39.044636389160864,1.54518181347349,1.0343492157741512,0.25843364783926209,1,0,1,0,1.0122908736535001,0.30296729067377137,-10.11521144881992,-121.99054250110566,58.009457498894335,null,39811,1584915721,null,31.711387899120602,-16.273999740505289,null,-5.6890913150297528,-105.71654276060036,null,0,0,null,0,0]
[40042.75,40.042749999999998,275.33416030659009,1.5671643684595775,1.0003164527106398,2.5154295109874159E-2,1,0,75719.341315288606,1.570783120129563,39.271776529667548,1.5453299948495169,1.0347435561570315,0.25987141331781183,1,0,1,0,1.0124401756084356,0.30474108709978648,-10.170219932534001,-122.15893929740461,57.841060702595385,null,40042.75,1603421827.5625,null,31.708044199017763,-16.347891871854994,null,-5.7407560986409987,-105.81104742554962,null,0,0,null,0,0]
[40274.5,40.274500000000003,276.92765356987047,1.5671852675149591,1.0003201257036662,2.5299815279974578E-2,1,0,76157.571890031002,1.5707831961241674,39.498917522575312,1.5454764719762086,1.0351400338980143,0.26130808038286812,1,0,1,0,1.0125904772474903,0.30651503775809685,-10.224961791065358,-122.32736571187974,57.672634288120264,null,40274.5,1622035350.25,null,31.704684391496677,-16.421818664348113,null,-5.7921381496512652,-105.90554704753164,null,0,0,null,0,0]
[40506.25,40.506250000000001,278.5211469527207,1.5672059274322674,1.0003238198794357,2.5445334378350375E-2,1,0,76595.802464773835,1.5707832712491898,39.726059353262862,1.5456212740804023,1.0355386465421028,0.26274364436890479,1,0,1,0,1.0127417808213812,0.30828914290208809,-10.279440351155316,-122.49582005765944,57.504179942340556,null,40506.25,1640756289.0625,null,31.701308503885642,-16.495778176965313,null,-5.8432408221301912,-106.00004188069416,null,0,0,null,0,0]
[40738,40.738,280.11464045310009,1.5672263522926526,1.0003275352377134,2.5590852398850495E-2,1,0,77034.033039517104,1.5707833455194711,39.953202007441384,1.5457644297245763,1.0359393916248685,0.26417810063574354,1,0,1,0,1.0128940885920665,0.3100634027745115,-10.333658881976739,-122.66430068131568,57.33569931868432,null,40738,1659584644,null,31.697916564006409,-16.569768508184819,null,-5.8940674130723849,-106.09453217313086,null,0,0,null,0,0]
[40975.25,40.975250000000003,281.74595161036956,1.5672470225586483,1.0003313607129185,2.5739822798483171E-2,1,0,77482.663908375544,1.5707834206821021,40.185736156380599,1.5459093064137097,1.0363518537468033,0.26564544781083826,1,0,1,0,1.0130510536035262,0.31187993073909243,-10.388898147451593,-122.83680529496013,57.163194705039871,null,40975.25,1678971112.5625,null,31.69442752633751,-16.645544792149142,null,-5.9458176408783352,-106.19126050281101,null,0,0,null,0,0]
[41212.5,41.212499999999999,283.37726288663174,1.5672674548405767,1.0003352083874872,2.5888792055426692E-2,1,0,77931.29477723439,1.5707834949793482,40.418271139083195,1.5460525160924894,1.0367665454676862,0.26711162430509855,1,0,1,0,1.0132090758749264,0.31369662134393789,-10.443871649380245,-123.00933404519778,56.990665954802225,null,41212.5,1698470156.25,null,31.690921725972391,-16.721349464117296,null,-5.9972853424418693,-106.28798458108048,null,0,0,null,0,0]
[41449.75,41.449750000000002,285.00857427984346,1.5672876532248887,1.0003390782611632,2.6037760163082471E-2,1,0,78379.925646093674,1.5707835684260696,40.650806941241022,1.5461940873625097,1.0371834641131701,0.26857662522291892,1,0,1,0,1.0133681578695313,0.31551347481454745,-10.498582716216706,-123.18188526106645,56.818114738933545,null,41449.75,1718081775.0625,null,31.687399194279209,-16.797180605692521,null,-6.0484738775851463,-106.38470465537395,null,0,0,null,0,0]
[41687,41.686999999999998,286.63988578800797,1.567307621705009,1.0003429703336888,2.6186727114852239E-2,1,0,78828.556514953365,1.5707836410367877,40.88334354887143,1.5463340481749104,1.037602606998856,0.27004044569672586,1,0,1,0,1.0135283020628123,0.31733049136452895,-10.55303461876095,-123.35445730444776,56.645542695552237,null,41687,1737805969,null,31.683859963109782,-16.87303633733309,null,-6.0993865489599681,-106.48142096711469,null,0,0,null,0,0]
[41929.75,41.929749999999999,288.30901496125273,1.5673278192103244,1.0003469756098713,2.6339146259491502E-2,1,0,79287.58767792827,1.5707837144802921,41.121271708684652,1.5464756152000843,1.0380337659514414,0.27153697403480126,1,0,1,0,1.0136932607815659,0.31918979953640242,-10.608483947998341,-123.53104984645414,56.468950153545862,null,41929.75,1758103935.0625,null,31.680221433485741,-16.950674110057403,null,-6.151197348573314,-106.58037573639673,null,0,0,null,0,0]
[42172.5,42.172499999999999,289.97814425075609,1.5673477841998646,1.0003510041255239,2.6491564180056736E-2,1,0,79746.618840903582,1.5707837870782972,41.35920068313655,1.5466155534297725,1.0384672477479298,0.27303225634383643,1,0,1,0,1.0138593368004698,0.32104927885048645,-10.663668706196002,-123.70766082460692,56.292339175393082,null,42172.5,1778519756.25,null,31.676565490103886,-17.028333765240067,null,-6.2027261633891229,-106.67932705936683,null,0,0,null,0,0]
[42415.25,42.41525,291.64727365452194,1.5673675206657531,1.0003550558803656,2.6643980869481051E-2,1,0,80205.650003879302,1.5707838588453198,41.597130458248309,1.5467538908078953,1.0389030494807048,0.2745262875012352,1,0,1,0,1.0140265328106339,0.32290892949658845,-10.718592217971459,-123.88428858517786,56.115711414822144,null,42415.25,1799053432.5625,null,31.672892168568836,-17.106013409140974,null,-6.2539763536295343,-106.77827517603687,null,0,0,null,0,0]
[42658,42.658000000000001,293.31640317059959,1.5673870325092456,1.0003591308741142,2.6796396320697923E-2,1,0,80664.681166855444,1.5707839297955462,41.835061020359085,1.5468906546429131,1.0393411682314786,0.27601906241531216,1,0,1,0,1.0141948515163892,0.32476875165125035,-10.773257750326991,-124.06093150663366,55.939068493366335,null,42658,1819704964,null,31.669201504958586,-17.183711186181352,null,-6.3049512223748057,-106.87722032045231,null,0,0,null,0,0]
[42906.5,42.906500000000001,295.0250693395069,1.5674067778420511,1.0003633264627336,2.6952420734695455E-2,1,0,81134.585364588391,1.570784001594792,42.078628226071572,1.547029055960266,1.0397920616011191,0.27754589005669794,1,0,1,0,1.0143683229114644,0.32667280508656038,-10.828954274505882,-124.24177259878844,55.758227401211556,null,42906.5,1840967742.25,null,31.665405495929548,-17.263266268597977,null,-6.3568517375246625,-106.97850633019047,null,0,0,null,0,0]
[43155,43.155000000000001,296.73373562211339,1.5674262957778387,1.000367546403611,2.7108443836147338E-2,1,0,81604.48956232176,1.5707840725671527,42.32219622851968,1.5471658642564392,1.0402453768321396,0.27907139053836999,1,0,1,0,1.0145429765957692,0.32857703858323184,-10.88438720199874,-124.42262623937613,55.577373760623871,null,43155,1862354025,null,31.661591391508264,-17.342836536377501,null,-6.4084705605962364,-107.07978970299861,null,0,0,null,0,0]
[43403.5,43.403500000000001,298.44240201646613,1.5674455902223283,1.0003717906964378,2.7264465617474028E-2,1,0,82074.393760055507,1.570784142726831,42.565765014026269,1.5473011068729083,1.0407011107597501,0.2805955584991201,1,0,1,0,1.0147188155131812,0.33048145228707365,-10.93955985834652,-124.60349078805449,55.396509211945514,null,43403.5,1883863812.25,null,31.657759231854694,-17.42242011660796,null,-6.4598110572904455,-107.18107067144652,null,0,0,null,0,0]
[43652,43.652000000000001,300.15106852065679,1.5674646649923045,1.0003760593409043,2.7420486071096362E-2,1,0,82544.297957789677,1.5707842120877058,42.80933456922542,1.5474348105291289,1.0411592602078312,0.282118388611866,1,0,1,0,1.0148958426219141,0.33238604632907176,-10.994475511400383,-124.78436463611222,55.215635363887785,null,43652,1905497104,null,31.65390905759314,-17.502015173953151,null,-6.5108765360827583,-107.28234946215906,null,0,0,null,0,0]
[43906,43.905999999999999,301.89755270492043,1.567483938802033,1.0003804476281462,2.7579958313714063E-2,1,0,83024.602449639089,1.5707842821723328,43.05829578172775,1.5475699101758948,1.0416300427716674,0.28367353511277837,1,0,1,0,1.0150780188596722,0.33433298085414076,-11.050344345945025,-124.96924969610612,55.030750303893882,null,43906,1927736836,null,31.649955093881577,-17.58338188105289,null,-6.5627914069158297,-107.3858678150532,null,0,0,null,0,0]
[44160,44.16,303.64403700004272,1.5675029908955356,1.0003848613562356,2.773942915319464E-2,1,0,83504.906941488895,1.5707843514507325,43.307257771090612,1.5477034565206844,1.0421033422179202,0.28522727274476473,1,0,1,0,1.0152614427620397,0.33628010401755826,-11.10595139987586,-125.15414117048182,54.845858829518178,null,44160,1950105600,null,31.645982396563817,-17.664756817363411,null,-6.6144257635289065,-107.48938435311841,null,0,0,null,0,0]
[44414,44.414000000000001,305.39052140412184,1.5675218250766878,1.0003893005248361,2.789889858144573E-2,1,0,83985.211433339107,1.5707844199367371,43.556220523992693,1.5478354761942223,1.0425791551188244,0.28677959592994529,1,0,1,0,1.0154461175341603,0.33822741591077582,-11.161299984421042,-125.33903743826431,54.660962561735687,null,44414,1972603396,null,31.64199101044353,-17.746138138260161,null,-6.6657829619538056,-107.59289930000415,null,0,0,null,0,0]
[44668,44.667999999999999,307.13700591529897,1.5675404450628456,1.0003937651336092,2.8058366590375403E-2,1,0,84465.515925189698,1.5707844876438648,43.805184027415464,1.5479659952220346,1.0430574780346817,0.28833049912785819,1,0,1,0,1.0156320463966175,0.34017491660878818,-11.216393353391998,-125.52393690937951,54.476063090620485,null,44668,1995230224,null,31.637980980777186,-17.827524035919772,null,-6.716866301258416,-107.69641287345974,null,0,0,null,0,0]
[44928.25,44.928249999999998,308.92646505611231,1.5675593048511609,1.0003983659863824,2.8221757036248726E-2,1,0,84957.638933080321,1.5707845562229672,44.06027436644154,1.5480981959487745,1.0435501705160211,0.28991808573145389,1,0,1,0,1.0158238544220879,0.34217053398336217,-11.272580997124408,-125.71338776359367,54.286612236406327,null,44928.25,2018547648.0625,null,31.633852989596637,-17.910915433614974,null,-6.7689259538102782,-107.80247232997867,null,0,0,null,0,0]
[45188.5,45.188499999999998,310.71592430554256,1.5675779474068277,1.0004029935459822,2.8385145974895026E-2,1,0,85449.761940971352,1.5707846240121468,44.315365466645311,1.5482288747122699,1.0440454907075121,0.29150416995128037,1,0,1,0,1.0160169859089629,0.3441663496747544,-11.328507447605993,-125.90283869693032,54.097161303069683,null,45188.5,2042000532.25,null,31.629705523679373,-17.994307907872241,null,-6.8207049383746003,-107.9085307890581,null,0,0,null,0,0]
[45448.75,45.448749999999997,312.50538366172373,1.5675963764615668,1.0004076478120381,2.8548533397611639E-2,1,0,85941.884948862746,1.5707846910249734,44.570457314957395,1.5483580576401541,1.0445434348709919,0.29308874595020762,1,0,1,0,1.0162114443715424,0.34616236370942316,-11.384176025690971,-126.09228809454751,53.907711905452487,null,45448.75,2065588876.5625,null,31.625538633103616,-18.077699628023016,null,-6.8722066258838197,-108.01458846652447,null,0,0,null,0,0]
[45709,45.709000000000003,314.29484312283267,1.5676145956621124,1.0004123287841773,2.8711919295696376E-2,1,0,86434.007956754547,1.5707847572747082,44.82554989860585,1.5484857702655173,1.045043999255638,0.2946718079324967,1,0,1,0,1.0164072333409013,0.34815857609538564,-11.439589994533797,-126.28173437209567,53.71826562790433,null,45709,2089312681,null,31.621352368393261,-18.161088799817442,null,-6.9234343300162857,-108.12064557227821,null,0,0,null,0,0]
[45975.25,45.975250000000003,316.12555824020319,1.5676330214509098,1.0004171453113258,2.8879070428802767E-2,1,0,86937.476740044789,1.5707848242756435,45.086524327229505,1.5486149317547755,1.0455588116354027,0.29628979424372304,1,0,1,0,1.0166089167488597,0.35020101592127933,-11.496021380703461,-126.47554343731862,53.52445656268138,null,45975.25,2113723612.5625,null,31.617049594233755,-18.246396017518816,null,-6.9755629420264498,-108.2291474197998,null,0,0,null,0,0]
[46241.5,46.241500000000002,317.95627346366553,1.567651235057254,1.0004219897893607,2.9046219947742338E-2,1,0,87440.945523335438,1.5707848905050208,45.347499499360268,1.548742606595622,1.0460763584640815,0.29790618378382516,1,0,1,0,1.0168120002500309,0.35224366330733253,-11.55219301254399,-126.66934597641495,53.330654023585055,null,46241.5,2138276322.25,null,31.612726650665032,-18.331696881446511,null,-7.0274116302982517,-108.33764909496841,null,0,0,null,0,0]
[46507.75,46.507750000000001,319.78698879139745,1.5676692401252363,1.0004268622178762,2.921336784319864E-2,1,0,87944.414306626466,1.5707849559760914,45.60847540223493,1.5488688203040757,1.0465966356850818,0.29952097048159054,1,0,1,0,1.0170164876794825,0.35428651820171692,-11.60810820511408,-126.86314038668405,53.136859613315949,null,46507.75,2162970810.0625,null,31.608383593154858,-18.41698958254473,null,-7.0789837653581724,-108.44615080413935,null,0,0,null,0,0]
[46774,46.774000000000001,321.61770422161862,1.5676870402159777,1.0004317625964636,2.9380514105855772E-2,1,0,88447.883089917857,1.5707850207018044,45.869452023380717,1.5489935978156462,1.0471196392284932,0.30113414831127688,1,0,1,0,1.0172223828903775,0.35632958053207298,-11.663770215841341,-127.05692509534401,52.943074904655987,null,46774,2187807076,null,31.60402047760666,-18.502272347606333,null,-7.1302826605372358,-108.55465274773769,null,0,0,null,0,0]
[47046.25,47.046250000000001,323.48967531499738,1.567705033103032,1.0004368023076504,2.9551425346742526E-2,1,0,88962.697648607747,1.5707850861285673,46.136310537854222,1.5491197274932351,1.0476572436853619,0.30278200955319579,1,0,1,0,1.0174343777524371,0.35841889810725736,-11.720428112017933,-127.25506514327162,52.744934856728378,null,47046.25,2213349639.0625,null,31.59953835586353,-18.589464892571289,null,-7.1824584349706946,-108.66560025070035,null,0,0,null,0,0]
[47318.5,47.3185,325.36164651189887,1.5677228189456129,1.0004418712419536,2.9722334860711193E-2,1,0,89477.512207298016,1.5707851508024562,46.403169777854323,1.5492444064585351,1.0481976900769365,0.3044281760004855,1,0,1,0,1.0176478527661252,0.36050843235391472,-11.776827996490715,-127.45319181370637,52.546808186293632,null,47318.5,2239040442.25,null,31.595035381433568,-18.676643409511783,null,-7.234355345013519,-108.77654840419459,null,0,0,null,0,0]
[47590.75,47.59075,327.23361781054649,1.5677404012969625,1.0004469693989295,2.9893242637803547E-2,1,0,89992.326765988662,1.5707852147363917,46.670029730935333,1.5493676595932222,1.0487409740096247,0.30607264135842049,1,0,1,0,1.0178628121092457,0.36259818312755515,-11.832973173402701,-127.65130351698993,52.348696483010073,null,47590.75,2264879485.5625,null,31.590511615419665,-18.763806112891874,null,-7.285976755911598,-108.88749740409804,null,0,0,null,0,0]
[47863,47.863,329.10558920920397,1.5677577836294789,1.0004520967781307,3.0064148668061962E-2,1,0,90507.141324679658,1.5707852779430007,46.936890384934593,1.5494895112132869,1.0492870910758898,0.30771539938207948,1,0,1,0,1.0180792599790662,0.36468815026088597,-11.888866889448746,-127.84939869277365,52.150601307226353,null,47863,2290866769,null,31.585967119349093,-18.850951252423766,null,-7.3373259758870732,-108.99844744034988,null,0,0,null,0,0]
[48141.75,48.141750000000002,331.02225424172519,1.5677753772719862,1.0004573768507103,3.0239133279120985E-2,1,0,91034.24714005235,1.57078534191798,47.210123081486095,1.5496128447655306,1.0498491775354633,0.309395603007527,1,0,1,0,1.0183024222294412,0.36682823957043448,-11.945837868050077,-128.05220468993321,51.947795310066795,null,48141.75,2317628093.0625,null,31.581292709238188,-18.940157002466798,null,-7.389622544377497,-109.1120476874664,null,0,0,null,0,0]
[48420.5,48.420499999999997,332.93891937553008,1.5677927683480868,1.0004626875565847,3.0414116037813806E-2,1,0,91561.352955425435,1.5707854051563697,47.483356487894035,1.5497347589234649,1.0504142246308807,0.31107400371026045,1,0,1,0,1.0185271538998855,0.36896855526566585,-12.002551944616835,-128.25499014120712,51.745009858792884,null,48420.5,2344544820.25,null,31.576596699240863,-19.029340735747432,null,-7.4416406109469291,-109.22564940545966,null,0,0,null,0,0]
[48699.25,48.699249999999999,334.85558460887944,1.5678099603361528,1.0004680288952661,3.0589096933454425E-2,1,0,92088.458770798854,1.5707854676708177,47.756590591974323,1.5498552780461616,1.050982227586899,0.31275059494967899,1,0,1,0,1.01875345955842,0.37110909709213796,-12.059012425227341,-128.45775346222908,51.542246537770922,null,48699.25,2371616950.5625,null,31.571879156701996,-19.118500682569493,null,-7.4933835490185663,-109.33925277965956,null,0,0,null,0,0]
[48978,48.978000000000002,336.77224994007372,1.567826956635372,1.0004734008662641,3.0764075955357535E-2,1,0,92615.564586172637,1.5707855294736852,48.029825381820139,1.5499744259385557,1.0515531816136388,0.31442537023996725,1,0,1,0,1.0189813437940904,0.37324986476996297,-12.115222558393157,-128.66049309751006,51.339506902489944,null,48978,2398844484,null,31.567140149381263,-19.207635108109073,null,-7.544854674863652,-109.45285798940097,null,0,0,null,0,0]
[49263.25,49.263249999999999,338.73360891218414,1.5678441501397051,1.0004789298145276,3.0943133254641122E-2,1,0,93154.961658228145,1.570785591993634,48.30943226366729,1.5500949568726488,1.052140499448472,0.31613731191687822,1,0,1,0,1.0192161809530644,0.37544078518776702,-12.172487579198279,-128.8679341797941,51.132065820205895,null,49263.25,2426867800.5625,null,31.562268485772478,-19.298819809377708,null,-7.5972480320599924,-109.5691143704164,null,0,0,null,0,0]
[49548.5,49.548499999999997,340.69496798327697,1.5678611456802407,1.0004844908393073,3.1122188569145667E-2,1,0,93694.358730284031,1.5707856537937301,48.589039839262327,1.5502141006082817,1.0527308973921881,0.31784733840093576,1,0,1,0,1.0194526809574578,0.37763194143767159,-12.229497144903053,-129.07534725239668,50.924652747603318,null,49548.5,2455053852.25,null,31.557374489508522,-19.389974217551451,null,-7.6493636015008146,-109.68537303484523,null,0,0,null,0,0]
[49833.75,49.833750000000002,342.65632715165231,1.5678779466563935,1.0004900839400688,3.1301241887423059E-2,1,0,94233.755802340238,1.5707857148863347,48.868648096697179,1.5503318809531463,1.0533243702654991,0.31955544292013821,1,0,1,0,1.0196908487926442,0.37982333313636896,-12.286254557826634,-129.28273073740476,50.717269262595238,null,49833.75,2483402639.0625,null,31.552458234471565,-19.481096581251155,null,-7.7012047593874344,-109.80163415615358,null,0,0,null,0,0]
[50119,50.119,344.6176864156493,1.5678945563901883,1.0004957091162741,3.1480293198025935E-2,1,0,94773.152874396808,1.5707857752835277,49.148257024334711,1.5504483211733109,1.0539209128738387,0.32126161876255771,1,0,1,0,1.0199306894666298,0.38201495987223111,-12.342763062729901,-129.49008308530713,50.509916914692866,null,50119,2511914161,null,31.547519794947114,-19.572185183556307,null,-7.7527748247662451,-109.91789790175081,null,0,0,null,0,0]
[50410.75,50.41075,346.62373932714434,1.5679113501654129,1.0005014956530958,3.1663422467272134E-2,1,0,95324.841203135133,1.5707858363499361,49.434238090124367,1.5505660521398579,1.0545342189429723,0.32300467124964577,1,0,1,0,1.0201777310920817,0.38425676994296037,-12.400305071165121,-129.70212658160773,50.297873418392271,null,50410.75,2541243715.5625,null,31.542445952371061,-19.665312745988981,null,-7.8052429906254162,-110.03681383561876,null,0,0,null,0,0]
[50702.5,50.702500000000001,348.6297923352729,1.5679279506742947,1.000507315742676,3.184654961208306E-2,1,0,95876.529531873806,1.5707858967135733,49.720219833219133,1.550682428773402,1.0551507252014567,0.32474569215058002,1,0,1,0,1.0204265333320746,0.38649882492235349,-12.457593385860076,-129.91413431450349,50.085865685496515,null,50702.5,2570743506.25,null,31.53734906118089,-19.758401464408578,null,-7.8574344141301982,-110.15573285009491,null,0,0,null,0,0]
[50994.25,50.994250000000001,350.63584543837658,1.5679443612339627,1.0005131693844296,3.2029674620213347E-2,1,0,96428.217860612815,1.5707859563865016,50.006202241998629,1.5507974743068065,1.0557704260431395,0.32648467447900176,1,0,1,0,1.0206771016175902,0.38874112427739188,-12.514631300051697,-130.12610471347102,49.873895286528978,null,50994.25,2600413533.0625,null,31.532229202088384,-19.85144960807234,null,-7.9093524692293151,-110.27465510539867,null,0,0,null,0,0]
[51286,51.286000000000001,{"$f":"SQRT(1+(A461/pole1)^2)","v":352.64189863483432},{"$f":"ATAN(A461/pole1)","v":1.5679605850860667},{"$f":"SQRT(1+(A461/Zero1)^2)","v":1.0005190565777677},{"$f":"ATAN(A461/Zero1)","v":3.2212797479418506E-2},{"$f":"IF(VIN_nom>Vout, 1, SQRT(1+(A461/z_RHP)^2))","v":1},{"$f":"IF(VIN_nom>Vout, 0, -ATAN(A461/z_RHP))","v":0},{"$f":"SQRT(1+(A461/Pole2)^2)","v":96979.906189352172},{"$f":"ATAN(A461/Pole2)","v":1.5707860153805087},50.29218530510677,1.5509112114446284,{"$f":"SQRT(1+(A461/pole4)^2)","v":1.056393315846007},{"$f":"ATAN(A461/pole4)","v":0.32822161131422106},{"$f":"IF(VOUT_setting=1,1,SQRT(1+(A461*zterm1)^2))","v":1},{"$f":"IF(VOUT_setting=1,0,ATAN(((A461*zterm1))))","v":0},1,{"$f":"IF(VOUT_setting=1,0,ATAN(A461*$Q$4/(1+Afbr-$Q$5*(A461)^2)))","v":0},{"$f":"SQRT((1-(Z461/pterm2))^2+(A461/pterm1)^2)","v":1.0209294414038932},{"$f":"IF((ATAN((A461/pterm1)/(1-A461^2/pterm2))>0),ATAN((A461/pterm1)/(1-A461^2/pterm2)),PI()+ATAN((A461/pterm1)/(1-A461^2/pterm2)))","v":0.39098366744362012},{"$f":"20*LOG10(((E461*K461*G461*O461)/(C461*I461*S461*M461*Q461))*Adc)","v":-12.571422049545779},{"$f":"((F461+L461+H461+P461)-(D461+J461+T461+N461+R461))*radconv","v":-130.33803623587752},{"$f":"IF(V461>0,V461,V461+180)","v":49.661963764122476},null,{"$f":"IF(U461<0,A461,1000000000)","v":51286},{"$f":"A461^2","v":2630253796},null,{"$f":"20*LOG10((K461/(I461*M461))*AEA)","v":31.527086456195249},{"$f":"(L461-(J461+N461))*radconv","v":-19.944455480254017},null,{"$f":"20*LOG10((E461*G461/(C461*S461))*Acs*Am)","v":-7.9610004728302606},{"$f":"(F461+H461-(D461+T461))*radconv","v":-110.3935807556235},null,{"$f":"SUM((U462<0)*(U461>0))*A461","v":0},0,null,0,0]
[51584.75,{"$f":"A462/1000","v":51.58475},354.69608345122913,1.5679770080275992,1.000525119791523,3.2400311792231504E-2,1,0,97544.831256056466,1.5707860750984495,50.58503066773666,1.551026344810094,1.0570344494940114,0.32999809586763706,1,0,1,0,1.0211896771055002,0.39328026830609319,-12.629322577528665,-130.55501079223035,49.444989207769652,null,51584.75,2660986432.5625,null,31.521796687690337,-20.039647313307352,null,-8.0136112323082358,-110.51536347892299,null,0,0,null,{"$f":"SUM((V463<-183)*(V462>-183))*A462","v":0},{"$f":"IF(AK462>0,U462,0)","v":0}]
[51883.5,51.883499999999998,356.75026836218836,1.5679932418409885,1.0005312181849328,3.2587823825779856E-2,1,0,98109.756322761124,1.5707861341286675,50.877876693187076,1.5511401527935802,1.0576789149838781,0.33177242111790717,1,0,{"$f":"IF(VOUT_setting=1,1,SQRT((1+Afbr-$Q$5*(A463)^2)^2+(A463*$Q$4)^2))","v":1},0,1.0214517819905458,0.39557712352028945,-12.686970626370982,-130.77194139664434,49.228058603355663,null,51883.5,2691897572.25,null,31.516483094278335,-20.134791326793753,null,-8.065945687738548,-110.63715006985059,null,0,0,null,0,0]
[52182.25,52.182250000000003,358.8044533660879,1.5680092897745486,1.0005373517573539,3.2775333566919217E-2,1,0,98674.681389466132,1.5707861924829745,51.170723370078214,1.551252658147334,1.0583267062288562,0.33354457984800656,1,0,1,0,1.0217157619947959,0.39787423237694941,-12.744369491648737,-130.98882647891369,49.011173521086306,null,52182.25,2722987215.0625,null,31.511145764232261,-20.229885804277156,null,-8.1180072229702329,-110.75894067463652,null,0,0,null,0,0]
[52481,52.481000000000002,360.85863846134049,1.5680251550026294,1.0005435205081392,3.2962841002506231E-2,1,0,99239.606456171459,1.5707862501729135,51.463570687289248,1.5513638831058612,1.0589778171257156,0.33531456491295619,1,0,1,0,1.0219816230801566,0.40017159413177139,-12.801522411364058,-131.2056644963638,48.794335503636205,null,52481,2754255361,null,31.5057847862019,-20.324929063098473,null,-8.1697991646551902,-110.88073543326534,null,0,0,null,0,0]
[52786.5,52.786499999999997,362.95923619971882,1.5680411929798752,1.0005498650154601,3.3154582609795265E-2,1,0,99817.295520200161,1.5707863084910065,51.763035289306707,1.5514763196205492,1.0596470659448691,0.3371222860149713,1,0,1,0,1.0222554426212345,0.4025211235262886,-12.85971562338538,-131.4273515316263,48.5726484683737,null,52786.5,2786414582.25,null,31.500278318741159,-20.422065056517472,null,-8.2224859092157754,-111.00528647510883,null,0,0,null,0,0]
[53092,53.091999999999999,365.05983403038192,1.5680570463882568,1.0005562463073734,3.3346321778375598E-2,1,0,100394.98458422923,1.5707863661379557,52.062500538182796,1.5515874626594233,1.0603197731597644,0.33892771923653786,1,0,1,0,1.0225312418991559,0.40487091568924244,-12.917658320218468,-131.64898617347956,48.351013826520443,null,53092,2818760464,null,31.49474731126184,-20.51914403629403,null,-8.2748975985695417,-111.12984213718549,null,0,0,null,0,0]
[53397.5,53.397500000000001,367.16043195174581,1.5680727183956316,1.0005626643831753,3.353805849419586E-2,1,0,100972.67364825858,1.5707864231252811,52.361966422819108,1.5516973344124563,1.0609959321921834,0.34073085717072266,1,0,1,0,1.0228090273730046,0.40722096971029298,-12.975353785981822,-131.87056685695697,48.12943314304303,null,53397.5,2851293006.25,null,31.489191859702554,-20.616164307310346,null,-8.3270376127736085,-111.25440254964663,null,0,0,null,0,0]
[53703,53.703000000000003,369.26102996226274,1.5680882120977746,1.000569119242158,3.3729792743205762E-2,1,0,101550.3627122883,1.5707864794642392,52.661432932369635,1.5518059565650002,1.0616755364469534,0.34253169248911441,1,0,1,0,1.023088805529808,0.40957128464027781,-13.032805247392503,-132.09209204413435,47.907907955865653,null,53703,2884012209,null,31.483612060361562,-20.713124207845219,null,-8.378909274843295,-111.37896783628914,null,0,0,null,0,0]
[54015.75,54.015749999999997,371.41147858916975,1.5681038919460855,1.0005757653873719,3.3926074580349179E-2,1,0,102141.7612549246,1.5707865364800662,52.96800689388234,1.5519158841849514,1.0623748307196366,0.34437287168824737,1,0,1,0,1.0233772942469253,0.41197764551300131,-13.09137067423203,-132.31881531018283,47.681184689817172,null,54015.75,2917701248.0625,null,31.477874723075839,-20.812320883487281,null,-8.431737364397101,-111.50649442669555,null,0,0,null,0,0]
[54328.5,54.328499999999998,373.56192730633984,1.5681193912689924,1.0005824500808149,3.4122353802414213E-2,1,0,102733.15979756122,1.5707865928394533,{"$f":"SQRT(1+(A471/Zero2)^2)","v":53.274581488098065},{"$f":"ATAN(A471/Zero2)","v":1.5520245466244023},1.0630777216350353,0.34621162239409092,1,0,1,0,1.0236678851958239,0.41438427768688835,-13.149687042991381,-132.54547723660781,47.454522763392191,null,54328.5,2951585912.25,null,31.472112074015822,-20.911450868604991,null,-8.4842910840964354,-111.63402636800285,null,0,0,null,0,0]
[54641.25,54.641249999999999,375.71237611222307,1.5681347131662837,1.0005891733217143,3.4318630394329905E-2,1,0,103324.55834019819,1.5707866485536723,53.581156704156435,1.5521319655977077,1.0637842020637502,0.348047936999207,1,0,1,0,1.0239605854263525,0.4167911800163448,-13.207757637087674,-132.77207625687072,47.227923743129281,null,54641.25,2985666201.5625,null,31.466324217590696,-21.010512483829149,null,-8.5365738217676075,-111.76156377304159,null,0,0,null,0,0]
[54954,54.954000000000001,377.86282500530473,1.5681498606671846,1.0005959351092926,3.4514904341026519E-2,1,0,103915.95688283547,1.5707867036337382,53.887732531444172,1.5522381623251937,1.0644942648589486,0.34988180798201829,1,0,1,0,1.0242554020183174,0.41919835131260275,-13.265585682453747,-132.99861083112674,47.00138916887326,null,54954,3019942116,null,31.460511258551477,-21.109504083001113,null,-8.5885889080944526,-111.88910674812564,null,0,0,null,0,0]
[55274,55.274000000000001,380.06312452098899,1.5681651818894764,1.0006028935415179,3.4715725449727057E-2,1,0,104521.06490407935,1.5707867593454936,54.201415854255266,1.5523455774030079,1.0652244883660953,0.35175565375789214,1,0,1,0,1.0245592508241241,0.42166160144781989,-13.32450652403921,-133.23032852328276,46.769671476717235,null,55274,3055215076,null,31.454537674037859,-21.210716298966382,null,-8.6415361651663005,-112.01961222431636,null,0,{"$f":"IF(AH474>0,W474,0)","v":0},null,0,0]
[55594,55.594000000000001,382.26342412486213,1.5681803267345551,1.0006098923266127,3.4916543757232139E-2,1,0,105126.17292532355,1.5707868144158934,54.515099795245327,1.5524517563333335,1.0659584470616599,0.35362692564840681,1,0,1,0,1.0248653303400772,0.42412513050760753,-13.383180095353575,-133.46197556798509,46.538024432014907,null,55594,3090692836,null,31.448538032501794,-21.311851831450522,null,-8.694210094944598,-112.15012373653454,null,0,0,null,0,0]
[55914,55.914000000000001,384.46372381541011,1.5681952982306535,1.0006169314637305,3.5117359247403501E-2,1,0,105731.28094656808,1.5707868688559492,54.828784343804266,1.5525567203303683,1.0666961332354596,0.35549561587503548,1,0,1,0,1.0251736482459881,0.42658893707740803,-13.441609673477961,-133.69355039808528,46.306449601914721,null,55914,3126375396,null,31.442512447178714,-21.412909019923685,null,-8.7466140877459075,-112.28064137816162,null,0,0,null,0,0]
[56234,56.234000000000002,386.66402359115312,1.5682100993370758,1.0006240109520197,3.5318171904104266E-2,1,0,106336.38896781292,1.5707869226764219,55.142469489563403,1.5526604901257002,1.0674375391595228,0.35736171675282014,1,0,1,0,1.0254842122536587,0.42905301969478776,-13.499798478051773,-133.92505147274079,46.07494852725921,null,56234,3162262756,null,31.436461031624496,-21.513886236854276,null,-8.7987514767655046,-112.41116523588653,null,0,0,null,0,0]
[56561.5,56.561500000000002,388.91589297959501,1.5682250739354937,1.0006312981457719,3.5523688156745677E-2,1,0,106955.679208306,1.5707869771277503,55.463507238712062,1.5527654766539096,1.0682001652467057,0.35926886535674712,1,0,1,0,1.0258043888692134,0.43157513850023482,-13.559105079202032,-134.16190040415415,45.838099595845847,null,56561.5,3199203282.25,null,31.430241159419133,-21.617145637740713,null,-8.851838205710397,-112.54475476641342,null,0,0,null,0,0]
[56889,56.889000000000003,391.16776245424262,1.5682398761227689,1.0006386276025017,3.5729201407345E-2,1,0,107574.9694487994,1.570787030952145,55.784545592152639,1.5528692547947351,1.0689666710564747,0.3611732858257663,1,0,1,0,1.026126934552432,0.43409754319098448,-13.61816613329621,-134.39866889812251,45.601331101877491,null,56889,3236358321,null,31.423994473644292,-21.72031792758737,null,-8.9046525740297362,-112.67835097053511,null,0,0,null,0,0]
[57216.5,57.216500000000003,393.41963201361585,1.5682545088594546,1.0006459993212802,3.5934711638608403E-2,1,0,108194.2596892931,1.5707870841603715,56.105584539511803,1.5529718452892807,1.0697370482489394,0.36307497022522189,1,0,1,0,1.0264518576728126,0.43662023204270667,-13.676984913241292,-134.63535538408388,45.36464461591612,null,57216.5,3273727872.25,null,31.41772109698783,-21.823401464011024,null,-8.957197977318355,-112.81195392007284,null,0,0,null,0,0]
[57544,57.543999999999997,395.67150165626805,1.5682689750387067,1.0006534133011737,3.6140218833243587E-2,1,0,108813.5499297871,1.5707871367629507,56.426624070652259,1.5530732684067243,1.0705112884661543,0.36497391072239832,1,0,1,0,1.0267791666339778,0.43914320327796863,-13.735564634488838,-134.87195831743816,45.128041682561843,null,57544,3311311936,null,31.411421152433686,-21.926394637494596,null,-9.0094777540117583,-112.94556367994356,null,0,0,null,0,0]
[57879,57.878999999999998,397.9749409174093,1.5682836031294511,1.0006610407898013,3.6350429139749681E-2,1,0,109447.02238952937,1.5707871899542756,56.755016245784333,1.5531758270571205,1.0713072473806167,0.36691349146953528,1,0,1,0,1.0271164484393667,0.44172424272941946,-13.795241836028238,-135.11389161018249,44.886108389817508,null,57879,3349978641,null,31.404949575346652,-22.031651298268812,null,-9.0626833784641256,-113.08224031191369,null,0,0,null,0,0]
[58214,58.213999999999999,400.27838026272957,1.5682980628627681,1.0006687124953371,3.65606362323566E-2,1,0,110080.49484927194,1.570787242533408,57.083409011012876,1.5532772056977995,1.0721072305314061,0.36885018494729449,1,0,1,0,1.0274562445073956,0.44430557371327495,-13.854675531661959,-135.3557342906268,44.644265709373201,null,58214,3388869796,null,31.398450460779443,-22.136810105193785,null,-9.1156179595306348,-113.21892418543298,null,0,0,null,0,0]
[58549,58.548999999999999,402.58181969078373,1.5683123571285076,1.0006764284167637,3.6770840092561638E-2,1,0,110713.96730901481,1.5707872945108559,57.411802356211915,1.553377424575493,1.0729112289168798,0.37078398310214988,1,0,1,0,1.0277985639415477,0.44688719415382189,-13.913868984674336,-135.59748478559447,44.402515214405526,null,58549,3427985401,null,31.391923941236129,-22.241869437386246,null,-9.1682848929996972,-113.35561534820823,null,0,0,null,0,0]
[58884,58.884,404.88525920016002,1.5683264887507566,1.0006841885530586,3.6981040701863782E-2,1,0,111347.43976875798,1.5707873458968886,57.740196271485829,1.553476503476418,1.0737192335172439,0.37271487799125447,1,0,1,0,1.0281434158815557,0.44946910191662004,-13.972825401001757,-135.83914154748956,44.160858452510439,null,58884,3467325456,null,31.385370149488097,-22.346827706676272,null,-9.2206875175790799,-113.49231384081328,null,0,0,null,0,0]
[59227,59.226999999999997,407.24370630302502,1.5683407922108992,1.0006921798162591,3.719625763960907E-2,1,0,111996.03992903262,1.5707873979077622,58.076433010071156,1.5535767874975748,1.0745506751747906,0.37468886753278247,1,0,1,0,1.0284991366192728,0.45211296258359429,-14.032947425869782,-136.08647050966769,43.913529490332309,null,59227,3507837529,null,31.378631731311163,-22.454186105170116,null,-9.2740711242701792,-113.63228440449755,null,0,0,null,0,0]
[59570,59.57,409.60215348824806,1.568354930955332,1.0007002174291089,3.741147113008253E-2,1,0,112644.64008930756,1.5707874493196858,58.412670326000431,1.553675917002046,1.0753862974796731,0.37665979699153007,1,0,1,0,1.0288575317695468,0.45475711974165522,-14.092827581136902,-136.33369800432064,43.666301995679362,null,59570,3548584900,null,31.37186500532442,-22.561435288451722,null,-9.3271845535505555,-113.77226271586891,null,0,0,null,0,0]
[59913,59.912999999999997,411.96060075441483,1.5683689078130088,1.0007083013904909,3.7626681153431436E-2,1,0,113293.24024958281,1.5707875001429463,58.748908209360707,1.5537739118108176,1.0762260906938572,0.37862765820086741,1,0,1,0,1.0292186112588939,0.45740157090749789,-14.152469129510854,-136.58082244940726,43.419177550592735,null,59913,3589567569,null,31.365070114822768,-22.668573653538214,null,-9.3800312114228532,-113.91224879586902,null,0,0,null,0,0]
[60256,60.256,414.31904810014294,1.5683827255484708,1.0007164316992825,3.7841887689805009E-2,1,0,113941.84040985836,1.5707875503875961,59.085146650464701,1.5538707912937799,1.077070045061149,0.38059244311462481,1,0,1,0,1.0295823850523895,0.46004631353268016,-14.211875276240926,-136.82784228819784,43.172157711802157,null,60256,3630785536,null,31.358247203336155,-22.775599630181006,null,-9.4326144466663102,-114.05224265801685,null,0,0,null,0,0]
[60607,60.606999999999999,416.73250304509588,1.5683967036496125,1.0007247996165882,3.8062109989987436E-2,1,0,114605.56827066539,1.5707876012153712,59.429227955102668,1.5539687954559989,1.0779379811626597,0.3825998608892196,1,0,1,0,1.0299574431009488,0.46275304012518637,-14.272426572918137,-137.0805136299299,42.919486370070103,null,60607,3673208449,null,31.35123629793263,-22.885003883856978,null,-9.4861548379400027,-114.1955097460729,null,0,0,null,0,0]
[60958,60.957999999999998,419.14595807053536,1.5684105207781038,1.0007332160660936,3.8282328596586146E-2,1,0,115269.29613147271,1.5707876514578072,59.773309823975794,1.5540656713076777,1.0788102540593756,0.38460404053074843,1,0,1,0,1.030335343837476,0.46546006632220122,-14.332737971695142,-137.33307220884521,42.666927791154791,null,60958,3715877764,null,31.344196354005174,-22.994287220069104,null,-9.5394262927895443,-114.33878498877611,null,0,0,null,0,0]
[61309,61.308999999999997,421.55941317507904,1.5684241796986764,1.0007416810465743,3.8502543488335032E-2,1,0,115933.02399228033,1.5707877011249574,60.11739224739587,1.5541614382206681,1.0796868532402799,0.38660497380645859,1,0,1,0,1.0307160980639472,0.46816738918002587,-14.392812728932615,-137.58551643485691,42.414483565143087,null,61309,3758793481,null,31.337127526035729,-23.103448057766048,null,-9.5924322220575782,-114.48206837709087,null,0,0,null,0,0]
[61660,61.66,423.972868357376,1.5684376831131088,1.0007501945567985,3.8722754643970181E-2,1,0,116596.75185308824,1.5707877502266465,60.461475215895241,1.5542561151259273,1.0805677681764156,0.38860265261422633,1,0,1,0,1.0310997166231564,0.47087500568294061,-14.452654043550321,-137.83784474287728,42.16215525712272,null,61660,3801955600,null,31.330029968703293,-23.212484848629305,null,-9.6451759793428469,-114.62535989424796,null,0,0,null,0,0]
[62019,62.018999999999998,426.44133114425119,1.5684513361866594,1.0007589523073361,3.8947980970307834E-2,1,0,117275.60741442765,1.5707877998725293,60.813401085467419,1.5543518416361317,1.0814732143765491,0.39064248767741577,1,0,1,0,1.0314950529718396,0.47364463478446639,-14.513621053999703,-138.0958026065644,41.904197393435595,null,62019,3846356361,null,31.322741086070952,-23.323876908257464,null,-9.6988541071598871,-114.77192569830694,null,0,0,null,0,0]
[62378,62.378,428.90979400970269,1.5684648321077972,1.0007677608223811,3.9173203343295174E-2,1,0,117954.46297576735,1.5707878489469647,61.165327505894453,1.5544464665855928,1.0823831529683037,0.39267890150232682,1,0,1,0,1.031893408782069,0.47641456445653457,-14.574350450031179,-138.35363597354109,41.646364026458912,null,62378,3891014884,null,31.315422477427724,-23.435136027411371,null,-9.7522648945481389,-114.91849994612974,null,0,0,null,0,0]
[62737,62.737000000000002,431.37825695238183,1.568478173574323,1.0007766201005932,3.9398421740188039E-2,1,0,118633.31853710733,1.5707878974597627,61.517254467722388,1.5545400088779766,1.0832975726312426,0.39471188584157496,1,0,1,0,1.0322947957850914,0.47918479123780622,-14.634845476262765,-138.61134324628443,41.388656753715566,null,62737,3935931169,null,31.308074308817076,-23.546260651012467,null,-9.8054117521690767,-115.06508259527197,null,0,0,null,0,0]
[63096,63.095999999999997,433.84671997097018,1.5684913632226385,1.0007855301406239,3.9623636138244676E-2,1,0,119312.17409844761,1.5707879454205098,61.869181961712364,1.5546324869869108,1.084216462027465,0.39674143258892286,1,0,1,0,1.0326992257551442,0.48195531158755966,-14.695109320008513,-138.86892285191888,41.131077148081118,null,63096,3981105216,null,31.300696746435325,-23.657249256695941,null,-9.858298033533071,-115.21167359522298,null,0,0,null,0,0]
[63463.25,63.463250000000002,436.37190958459809,1.5685047015704174,1.000794697461449,3.9854021914645113E-2,1,0,120006.630100961,1.5707879939219613,62.229197467200869,1.5547260079650815,1.085161081111998,0.3988140540375944,1,0,1,0,1.0331161107137494,0.48478979987444204,-14.756522109107909,-139.13228804964379,40.86771195035621,null,63463.25,4027584100.5625,null,31.29311940264385,-23.770646139946038,null,-9.9121334788409889,-115.36164190969778,null,0,0,null,0,0]
[63830.5,63.830500000000001,438.89709927496818,1.5685178864341207,1.0008039179010857,4.0084403458169882E-2,1,0,120701.08610347468,1.5707880418653049,62.58921351069543,1.5548184530700913,1.0861103536674486,0.40088306137281304,1,0,1,0,1.0335362051664703,0.48762458762685762,-14.817699537868791,-139.39551639158259,40.604483608417411,null,63830.5,4074332730.25,null,31.285511650858375,-23.883897560762616,null,-9.965703155816394,-115.51161883081994,null,0,0,null,0,0]
[64197.75,64.197749999999999,441.42228904076347,1.5685309204477955,1.0008131914580662,4.031478074448102E-2,1,0,121395.54210598863,1.5707880892601185,62.949230082965222,1.5549098407596114,1.0870642675029676,0.402948446371869,1,0,1,0,1.0339595218549038,0.49045967079563957,-14.878644840686032,-139.65860626992469,40.34139373007531,null,64197.75,4121351105.0625,null,31.27787366939717,-23.997001991021232,null,-10.019010477172435,-115.66160427890347,null,0,0,null,0,0]
[64565,64.564999999999998,443.94747888069696,1.5685438061855594,1.0008225181309138,4.0545153749243272E-2,1,0,122089.99810850287,1.5707881361157623,63.309247174989409,1.5550001890715353,1.0880228104109582,0.40501020096443591,1,0,1,0,1.0343860735658086,0.49329504524415968,-14.93936119474437,-139.92155610118482,40.078443898815181,null,64565,4168639225,null,31.270205636680931,-24.109957935367373,null,-10.072058798514533,-115.81159816581744,null,0,0,null,0,0]
[64941,64.941000000000003,446.53283329197166,1.5685568479451426,1.0008321220462464,4.0781011098238763E-2,1,0,122801.00003347347,1.5707881835387363,63.677842466959568,1.5550916315872401,1.0890089743633418,0.40711730891840814,1,0,1,0,1.0348261531387173,0.4961982719244849,-15.001290223375785,-140.19062418402103,39.809375815978967,null,64941,4217333481,null,31.262323960106446,-24.225449775158715,null,-10.126106150571466,-115.96517440886231,null,0,0,null,0,0]
[65317,65.316999999999993,449.11818777832167,1.5685697395546225,1.0008417816354873,4.101686390761642E-2,1,0,123512.00195844432,1.5707882304157257,64.046438285258162,1.5551820215758776,1.0899999646494556,0.4092205947772371,1,0,1,0,1.0352696509929789,0.49910179487292738,-15.062985825510122,-140.45954218305906,39.540457816940943,null,65317,4266310489,null,31.254411161997055,-24.340782899105438,null,-10.179888954596411,-116.11875928395364,null,0,0,null,0,0]
[65693,65.692999999999998,451.70354233845779,1.5685824835921762,1.0008514968970252,4.1252712151268717E-2,1,0,124223.00388341545,1.5707882767561054,64.415034620849923,1.5552713771042996,1.0909957681175075,0.41132005037248948,1,0,1,0,1.0357165809951545,0.50200560936441541,-15.124451232915426,-140.72830847415281,39.271691525847189,null,65693,4315570249,null,31.246467434064463,-24.455955804573559,null,-10.233410634069122,-116.27235266957926,null,0,0,null,0,0]
[66069,66.069000000000003,454.28889697112032,1.5685950825772916,1.0008612678292383,4.1488555803091139E-2,1,0,124934.00580838685,1.5707883225690371,64.783631464905213,1.5553597158282482,1.0919963715999177,0.41341566770051608,1,0,1,0,1.0361669570592262,0.5049097105773156,-15.185689620056335,-140.99692145724484,39.003078542755162,null,66069,4365112761,null,31.238492968065152,-24.570967021913198,null,-10.286674555210718,-116.42595443533165,null,0,0,null,0,0]
[66453.75,66.453749999999999,456.93441618033108,1.5686078271703445,1.000871323770858,4.1729883057179444E-2,1,0,125661.55365581464,1.5707883689114317,65.160806545419348,1.55544907573326,1.0930252155181097,0.41555607125311778,1,0,1,0,1.0366313957999895,0.50788168560902713,-15.248121349206459,-141.27162506177456,38.728374938225443,null,66453.75,4416100889.0625,null,31.230301306772461,-24.68848582187513,null,-10.340914623068151,-116.58313923989938,null,0,0,null,0,0]
[66838.5,66.838499999999996,459.57993546290481,1.568620425037818,1.0008814380008928,4.1971205447942236E-2,1,0,126389.10150324269,1.5707884147202944,65.537982140266124,1.5555374070941714,1.0940590575112339,0.41769243938647477,1,0,1,0,1.0370994724842773,0.51085395033733871,-15.310321916105046,-141.54616482476368,38.453835175236321,null,66838.5,4467385082.25,null,31.222077866454924,-24.80583231001243,null,-10.394891749649206,-116.74033251475123,null,0,0,null,0,0]
[67223.25,67.223249999999993,462.22545481758186,1.5686328786990325,1.0008916105175756,4.2212522947419839E-2,1,0,127116.649350671,1.5707884600047859,65.915158240616279,1.555624727566028,1.0950978834237899,0.41982476405627545,1,0,1,0,1.0375712021707275,0.51382649928152124,-15.372294544121418,-141.82053910619828,38.179460893801718,null,67223.25,4518965340.5625,null,31.213822852609741,-24.923005014385303,null,-10.448609363820394,-116.89753409181297,null,0,0,null,0,0]
[67608,67.608000000000004,464.87097424313117,1.5686451906159609,1.0009018413191295,4.2453835527655984E-2,1,0,127844.19719809957,1.570788504773859,66.29233483784148,1.5557110544021375,1.0961416790858263,0.42195303739570761,1,0,1,0,1.0380465999674486,0.51679932685461072,-15.434042399354791,-142.09474628986732,37.905253710132683,null,67608,4570841664,null,31.205536470712666,-25.040002496229814,null,-10.50207083715669,-117.05474379363753,null,0,0,null,0,0]
[68001.75,68.001750000000001,467.57837723613818,1.5686576462848243,1.0009123717817141,4.2700787724251912E-2,1,0,128588.76370862614,1.5707885500656462,66.678334785093256,1.5557983894004686,1.0972150217071512,0.42412689229302841,1,0,1,0,1.0385369318154765,0.51984197679436195,-15.497005172707626,-142.37519300803214,37.624806991967858,null,68001.75,4624238003.0625,null,31.197023992413691,-25.159553875476846,null,-10.556521132210548,-117.2156391325553,null,0,0,null,0,0]
[68395.5,68.395499999999998,470.28578030085185,1.5686699585408228,1.0009229632840408,4.2947734709541933E-2,1,0,129333.33021915298,1.5707885948359475,67.064335235073017,1.5558847190558953,1.0982935392284954,0.42629648800199066,1,0,1,0,1.0390311375607937,0.52288490637002949,-15.559739065961795,-142.65546136829789,37.344538631702108,null,68395.5,4677944420.25,null,31.188479096682087,-25.278918793233007,null,-10.610710129733118,-117.37654257506485,null,0,0,null,0,0]
[68789.25,68.789249999999996,472.99318343604068,1.5686821298466291,1.0009336158241722,4.3194676453572944E-2,1,0,130077.89672968008,1.570788639093718,67.450336179149843,1.555970060627077,1.0993772164197257,0.42846181666262861,1,0,1,0,1.0395292335534072,0.52592810924734634,-15.622247294754324,-142.93554971187655,37.064450288123453,null,68789.25,4731960915.5625,null,31.179902003572721,-25.398095810820198,null,-10.664641265416279,-117.53745390105634,null,0,0,null,0,0]
[69183,69.183000000000007,475.70058664050157,1.568694162608852,1.0009443294001592,4.3441612926395617E-2,1,0,130822.46324020742,1.5707886828477087,67.836337608889224,1.5560544309799114,1.1004660380379825,0.43062287060591486,1,0,1,0,1.0400312361947062,0.52897157897528313,-15.684533017459701,-143.21545640350962,36.78454359649038,null,69183,4786287489,null,31.171292933043475,-25.517083522992124,null,-10.718317917592408,-117.6983728805175,null,0,0,null,0,0]
[69586,69.585999999999999,478.47159240344507,1.5687063370360759,1.0009553578615931,4.3694344956854425E-2,1,0,131584.52115447441,1.5707887271168248,68.231407503032358,1.5561397948572513,1.1015857495288697,0.43283025783166973,1,0,1,0,1.0405490944734925,0.53208681555982373,-15.748054789560422,-143.50174889524646,36.498251104753535,null,69586,4842211396,null,31.162448734048272,-25.638669041456982,null,-10.772995490697923,-117.86307985378949,null,0,0,null,0,0]
[69989,69.989000000000004,481.24259823648936,1.5687183712620434,1.0009664502561171,4.3947071402062124E-2,1,0,132346.57906874162,1.5707887708761337,68.626477888652587,1.5562241758859856,1.1027108176447902,0.43503315148959798,1,0,1,0,1.0410710800348242,0.53520231763112192,-15.811349995131696,-143.78784770672058,36.212152293279416,null,69989,4898460121,null,31.153571503407768,-25.760053381317352,null,-10.827413465628695,-118.02779432540322,null,0,0,null,0,0]
[70392,70.391999999999996,484.01360413843042,1.5687302676947319,1.0009776065816058,4.4199792229921354E-2,1,0,133108.63698300911,1.5707888141343911,69.021548757310455,1.556307590942017,1.1038412260068449,0.43723154397224456,1,0,1,0,1.0415972106257139,0.53831807789263153,-15.874421842490456,-144.07375115738537,35.926248842614626,null,70392,4955033664,null,31.14466147651806,-25.881235140281902,null,-10.88157528609775,-118.19251601710346,null,0,0,null,0,0]
[70795,70.795000000000002,486.78461010809173,1.56874202868729,1.0009888268359215,4.4452507408339011E-2,1,0,133870.69489727682,1.570788856900154,69.416620100758621,1.5563900565171176,1.1049769582255731,0.43942542787724043,1,0,1,0,1.0421275040462603,0.54143408891962896,-15.937273482677583,-144.35945758995652,35.64054241004348,null,70795,5011932025,null,31.135718888592336,-26.002212949807429,null,-10.935484338359151,-118.3572446401491,null,0,0,null,0,0]
[71207.25,71.207250000000002,489.61921864096468,1.5687539218868287,1.0010003707715407,4.4711017242356918E-2,1,0,134650.24421528418,1.5707889001466508,69.820759941772778,1.5564734492946284,1.1061442501972785,0.44166499518200802,1,0,1,0,1.04267429507682,0.54462187288129038,-16.001343127230133,-144.65151624312679,35.348483756873208,null,71207.25,5070472452.5625,null,31.126537597113114,-26.125755128095779,null,-10.99037269143248,-118.525761115031,null,0,0,null,0,0]
[71619.5,71.619500000000002,492.45382724229609,1.568765678169713,1.0010119815998009,4.4969521096691861E-2,1,0,135429.79353329178,1.5707889428952839,70.224900262756577,1.5565558822312906,1.1073170785010544,0.44389982954650548,1,0,1,0,1.0432254800749721,0.54780990312431155,-16.065188832312462,-144.94336529384535,35.056634706154654,null,71619.5,5129352780.25,null,31.117322729960076,-26.249081095185826,null,-11.04500352936177,-118.69428419865949,null,0,0,null,0,0]
[72031.75,72.031750000000002,495.28843591091066,1.5687772998867218,1.0010236593183743,4.5228018937003858E-2,1,0,136209.34285129971,1.5707889851546017,70.62904105547085,1.55663737180266,1.1084954255639814,0.44612992370540061,1,0,1,0,1.0437810782617429,0.55099817128474327,-16.128813793328828,-145.23500303978764,34.764996960212358,null,72031.75,5188573008.0625,null,31.108074538203695,-26.372189491314735,null,-11.099380298621755,-118.86281354847294,null,0,0,null,0,0]
[72444,72.444000000000003,498.12304464565966,1.5687887893351256,1.0010354039249201,4.5486510728957756E-2,1,0,136988.8921693078,1.5707890269329576,71.033182311863925,1.5567179341093942,1.1096792738052674,0.44835527061274333,1,0,1,0,1.0443411089125305,0.55418666885846801,-16.192221148514335,-145.52642780157052,34.47357219842948,null,72444,5248133136,null,31.098793272634666,-26.495078990758138,null,-11.153506388238235,-119.03134881081237,null,0,0,null,0,0]
[72865.75,72.865750000000006,501.02297493458963,1.5688004090147214,1.0010474883926952,4.5750952980532403E-2,1,0,137786.40563169715,1.5707890691848629,71.446637179810551,1.5567994097600106,1.1108960774189529,0.450626979287236,1,0,1,0,1.0449186520717162,0.55744887141814992,-16.256867708313095,-145.82434610343162,34.175653896568377,null,72865.75,5309417523.0625,null,31.089264162451794,-26.620572520175688,null,-11.20862383785412,-119.20377358325592,null,0,0,null,0,0]
[73287.5,73.287499999999994,503.92290529038769,1.5688118949585379,1.0010596428617324,4.6015388829092778E-2,1,0,138583.91909408677,1.5707891109504715,71.860092516582412,1.5568799478520359,1.1121186014274735,0.45289370517372973,1,0,1,0,1.0455008753175226,0.56071129563123956,-16.321292984732636,-146.12203800703219,33.877961992967812,null,73287.5,5371057656.25,null,31.079700966604058,-26.745834247157958,null,-11.263485918425928,-119.37620375987423,null,0,0,null,0,0]
[73709.25,73.709249999999997,506.82283571190595,1.5688232494621939,1.0010718673294818,4.6279818237890735E-2,1,0,139381.43255647662,1.5707891522381305,72.273548314133436,1.5569595644749108,1.1133468269867823,0.45515544143180325,1,0,1,0,1.0460877994591999,0.56397393193725931,-16.385500160643147,-146.41950178492596,33.580498215074044,null,73709.25,5433053535.5625,null,31.070103952589427,-26.87086285839894,null,-11.318096080321807,-119.54863892652705,null,0,0,null,0,0]
[74131,74.131,{"$f":"SQRT(1+(A525/pole1)^2)","v":509.72276619802273},{"$f":"ATAN(A525/pole1)","v":1.5688344747690661},{"$f":"SQRT(1+(A525/Zero1)^2)","v":1.0010841617933794},{"$f":"ATAN(A525/Zero1)","v":4.6544241170183527E-2},{"$f":"IF(VIN_nom>Vout, 1, SQRT(1+(A525/z_RHP)^2))","v":1},{"$f":"IF(VIN_nom>Vout, 0, -ATAN(A525/z_RHP))","v":0},{"$f":"SQRT(1+(A525/Pole2)^2)","v":140178.94601886673},{"$f":"ATAN(A525/Pole2)","v":1.5707891930559978},72.687004564600713,1.5570382753520446,{"$f":"SQRT(1+(A525/pole4)^2)","v":1.1145807352482033},{"$f":"ATAN(A525/pole4)","v":0.45741218145530843},{"$f":"IF(VOUT_setting=1,1,SQRT(1+(A525*zterm1)^2))","v":1},{"$f":"IF(VOUT_setting=1,0,ATAN(((A525*zterm1))))","v":0},1,{"$f":"IF(VOUT_setting=1,0,ATAN(A525*$Q$4/(1+Afbr-$Q$5*(A525)^2)))","v":0},{"$f":"SQRT((1-(Z525/pterm2))^2+(A525/pterm1)^2)","v":1.0466794453612751},{"$f":"IF((ATAN((A525/pterm1)/(1-A525^2/pterm2))>0),ATAN((A525/pterm1)/(1-A525^2/pterm2)),PI()+ATAN((A525/pterm1)/(1-A525^2/pterm2)))","v":0.56723677062268563},{"$f":"20*LOG10(((E525*K525*G525*O525)/(C525*I525*S525*M525*Q525))*Adc)","v":-16.449492361830018},{"$f":"((F525+L525+H525+P525)-(D525+J525+T525+N525+R525))*radconv","v":-146.71673573228833},{"$f":"IF(V525>0,V525,V525+180)","v":33.283264267711672},null,{"$f":"IF(U525<0,A525,1000000000)","v":74131},{"$f":"A525^2","v":5495405161},null,{"$f":"20*LOG10((K525/(I525*M525))*AEA)","v":31.060473387516929},{"$f":"(L525-(J525+N525))*radconv","v":-26.99565707497662},null,{"$f":"20*LOG10((E525*G525/(C525*S525))*Acs*Am)","v":-11.372457716436177},{"$f":"(F525+H525-(D525+T525))*radconv","v":-119.72107865731166},null,{"$f":"SUM((U526<0)*(U525>0))*A525","v":0},0,null,0,0]
[74562.75,{"$f":"A526/1000","v":74.562749999999994},512.69145621608868,1.5688458346968799,1.0010968202706005,4.6814927015968337E-2,1,0,140995.36910692131,1.5707892343633767,73.110264625349132,1.5571179303495613,1.1158497671027026,0.45971724844196787,1,0,1,0,1.0472900324814893,0.5705771729246355,-16.51478238864901,-147.02077748718929,32.979222512810708,null,74562.75,5559603687.5625,null,31.050579999397247,-27.123166156516497,null,-11.427854355135491,-119.8976113306728,null,0,0,null,{"$f":"SUM((V527<-183)*(V526>-183))*A526","v":0},{"$f":"IF(AK526>0,U526,0)","v":0}]
[74994.5,74.994500000000002,515.66014629955464,1.5688570638249608,1.0011095520971558,4.7085605996574416E-2,1,0,141811.79219497612,1.5707892751951351,73.533525144636073,1.5571966683558864,1.1171247143509584,0.46201706619143862,1,0,{"$f":"IF(VOUT_setting=1,1,SQRT((1+Afbr-$Q$5*(A527)^2)^2+(A527*$Q$4)^2))","v":1},0,1.0479056123519954,0.57391776622570312,-16.579853576988629,-147.32457483794397,32.67542516205603,null,74994.5,5624175030.25,null,31.040652015472343,-27.250426991393578,null,-11.482997559550201,-120.0741478465504,null,0,0,null,0,0]
[75426.25,75.426249999999996,518.62883644729754,1.5688681643994435,1.0011223572702466,4.7356278072600684E-2,1,0,142628.2152830312,1.5707893155594408,73.956786114588724,1.5572745051140906,1.118405556762881,0.46431162836906753,1,0,1,0,1.0485262075297319,0.57725853960770745,-16.644709102789513,-147.62812602544579,32.371873974554205,null,75426.25,5689119189.0625,null,31.030689720909809,-27.377438315115473,null,-11.537890790788559,-120.2506877103303,null,0,0,null,0,0]
[75858,75.858000000000004,521.59752665821975,1.5688791386153267,1.0011352357870582,4.7626943204652168E-2,1,0,143444.63837108645,1.5707893554642749,74.380047527513554,1.5573514560089439,1.1196922741076203,0.46660092889048366,1,0,1,0,1.0491518406274576,0.58059948198527411,-16.709352084842365,-147.93142931293696,32.068570687063044,null,75858,5754436164,null,31.020693400364465,-27.504198898048305,null,-11.592537452296064,-120.42723041488867,null,0,0,null,0,0]
[76299.75,76.299750000000003,524.63497640558444,1.5688902384658638,1.0011484884988775,4.7903870133016765E-2,1,0,144279.97108480628,1.5707893958259445,74.813112782228046,1.5574292880091594,1.1210148533398279,0.46893780120948858,1,0,1,0,1.0497972023013502,0.58401796894789226,-16.775275507975703,-148.24149920749986,31.758500792500143,null,76299.75,5821651850.0625,null,31.010430628607033,-27.633634686766037,null,-11.648198103671966,-120.60786452073378,null,0,0,null,0,0]
[76741.5,76.741500000000002,527.67242621684341,1.5689012105278834,1.0011618179852604,4.8180789708597259E-2,1,0,145115.30379852632,1.5707894357229433,75.246178484930255,1.5575062241139774,1.1223435399555135,0.47126915322139673,1,0,1,0,1.050447886036562,0.58743660881196391,-16.840982855522711,-148.55130597631435,31.448694023685647,null,76741.5,5889257822.25,null,31.000132837581322,-27.7628054895867,null,-11.703607660193265,-120.78850048672764,null,0,0,null,0,0]
[77183.25,77.183250000000001,530.70987609089957,1.5689120569955262,1.0011752242431402,4.8457701889217351E-2,1,0,145950.63651224656,1.5707894751632498,75.679244627929535,1.5575822797024672,1.1236783122897622,0.47359497921084504,1,0,1,0,1.0511039162269986,0.59085538916234015,-16.906477290667684,-148.86084782801163,31.139152171988371,null,77183.25,5957254080.5625,null,30.989800330382735,-27.891710098345484,null,-11.758769588139655,-120.96913772966612,null,0,0,null,0,0]
[77625,77.625,533.74732602668109,1.5689227800129877,1.0011887072694332,4.8734606632707511E-2,1,0,146785.96922596707,1.5707895141546608,76.112311203710192,1.5576574698037222,1.1250191486814791,0.47591527372867271,1,0,1,0,1.0517653173221779,0.59427429740203053,-16.971761919500956,-149.17012299323594,30.829877006764065,null,77625,6025640625,null,30.97943340945616,-28.020347340171575,null,-11.813687296046352,-121.14977565306432,null,0,0,null,0,0]
[78077,78.076999999999998,536.85525449009685,1.5689336262440272,1.0012025826024158,4.90179287018584E-2,1,0,147640.68430599369,1.5707895535941037,76.555426736829105,1.5577335240301329,1.1263973508857512,0.47828367554384321,1,0,1,0,1.052447649862102,0.59777265419302617,-17.038347374949314,-149.48629645913564,30.513703540864356,null,78077,6096017929,null,30.968790637125107,-28.15169144204819,null,-11.869629979163657,-121.33460501708745,null,0,0,null,0,0]
[78529,78.528999999999996,539.96318301594181,1.568944347617256,1.0012165383010949,4.9301242895444533E-2,1,0,148495.39938602055,1.5707895925795328,{"$f":"SQRT(1+(A535/Zero2)^2)","v":76.998542707666701},{"$f":"ATAN(A535/Zero2)","v":1.5578087028938521},1.1277818559580366,0.48064627551614547,1,0,1,0,1.0531356574031181,0.60127111761318697,-17.104719576575565,-149.80218703931214,30.197812960687855,null,78529,6166803841,null,30.958112473979945,-28.282753251389444,null,-11.925324017644737,-121.51943378792272,null,0,0,null,0,0]
[78981,78.980999999999995,543.07111160314389,1.5689549462763086,1.0012305743621099,4.9584549168314652E-2,1,0,149350.11446604761,1.5707896311187428,77.441659108709189,1.557883021420337,1.1291726407140519,0.4830030686599876,1,0,1,0,1.053829366307921,0.60476967357981448,-17.170881674509253,-150.11779290619242,29.88220709380758,null,78981,6237998361,null,30.947399241758703,-28.413531622093284,null,-11.98077288335719,-121.70426128409915,null,0,0,null,0,0]
[79433,79.433000000000007,546.17904025065559,1.5689654243160283,1.0012446907820813,4.9867847475325133E-2,1,0,150204.82954607491,1.570789669219351,77.884775932613792,1.5579564942931401,1.1305696819786979,0.48535405027228373,1,0,1,0,1.0545288029938404,0.60826830781290353,-17.236836761828663,-150.4331122538685,29.566887746131499,null,79433,6309601489,null,30.936651261395255,-28.544025443823543,null,-12.03597999031315,-121.88908681004494,null,0,0,null,0,0]
[79895.5,79.895499999999998,549.35916641704694,1.5689760230421199,1.0012592183049493,5.0157718534415037E-2,1,0,151079.39973304997,1.5707897077588018,78.338186829777243,1.5580308135668375,1.1320056286774614,0.48775362518026044,1,0,1,0,1.055250444180083,0.61184828154131887,-17.304112879877131,-150.75545805590826,29.244541944091736,null,79895.5,6383290920.25,null,30.925617970084364,-28.67725498625688,null,-12.092222817050729,-122.07820306965138,null,0,{"$f":"IF(AH538>0,W538,0)","v":0},null,0,0]
[80358,80.358000000000004,552.53929264443889,1.5689864997668015,1.001273829956409,5.0447581157647234E-2,1,0,151953.96992002524,1.5707897458546254,78.791598154650416,1.5581042774908451,1.1334480768819957,0.4901471063486717,1,0,1,0,1.0559781384807196,0.61542830633498713,-17.371178632624638,-151.07750011389501,28.922499886104987,null,80358,6457408164,null,30.914548974644415,-28.810184365640577,null,-12.148219574358288,-122.26731574825446,null,0,0,null,0,0]
[80820.5,80.820499999999996,555.7194189317845,1.5689968565845438,1.001288525732777,5.0737435296683384E-2,1,0,152828.54010700074,1.570789783514438,79.245009899891656,1.5581769007463828,1.1348970018021611,0.49253448964187624,1,0,1,0,1.0567119143642529,0.61900836625786271,-17.438037156632042,-151.39923655984416,28.600763440155845,null,80820.5,6531953220.25,null,30.90344461614313,-28.942812504284294,null,-12.203973739864404,-122.45642405555986,null,0,0,null,0,0]
[81283,81.283000000000001,558.89954527806037,1.5690070955421485,1.0013033056303497,5.1027280903193688E-2,1,0,153703.11029397644,1.5707898207456821,79.698422058326472,1.5582486976806145,1.1363523786632272,0.49491577122331964,1,0,1,0,1.0574518003519053,0.62258844516038025,-17.504691531440407,-151.72066554707212,28.279334452927884,null,81283,6606926089,null,30.892305234673195,-29.075138360764146,null,-12.259488733202835,-122.64552718630796,null,0,0,null,0,0]
[81756.25,81.756249999999994,562.15358813450428,1.5690174525717193,1.0013185161335931,5.132385457891659E-2,1,0,154598.00832854153,1.5707898584062621,80.162373406246473,1.558321322680132,1.1378482360061248,0.49734608172528944,1,0,1,0,1.0582152382775445,0.62625173928445099,-17.572687002096838,-152.04924542052296,27.950754579477035,null,81756.25,6684084414.0625,null,30.880871038072687,-29.210225947420493,null,-12.316050007258761,-122.83901947310248,null,0,0,null,0,0]
[82229.5,82.229500000000002,565.40763105055521,1.5690276903874114,1.0013338147060729,5.1620419218503022E-2,1,0,155492.90636310683,1.570789895633351,80.626325172108182,1.5583931118612844,1.1393507962761311,0.4997699963919045,1,0,1,0,1.0589851342257788,0.62991501838844799,-17.640475069476679,-152.37749953032224,27.62250046967776,null,82229.5,6761690670.25,null,30.869400888714669,-29.344994943731749,null,-12.372367925280578,-123.03250458659055,null,0,0,null,0,0]
[82702.75,82.702749999999995,568.66167402518988,1.5690378110357492,1.0013492013437522,5.1916974770202289E-2,1,0,156387.80439767236,1.570789932434391,81.090277348737928,1.5584640795695484,1.1408600329891425,0.50218751206748669,1,0,1,0,1.0597615189125973,0.63357826448137911,-17.708058855845422,-152.70542596356844,27.294574036431555,null,82702.75,6839744857.5625,null,30.857895147647337,-29.479444347381985,null,-12.42844597058199,-123.22598161618652,null,0,0,null,0,0]
[83176,83.176000000000002,571.91571705740853,1.5690478165166806,1.0013646760425716,5.2213521182273251E-2,1,0,157282.70243223809,1.570789968816654,81.554229929125285,1.5585342398239961,1.1423759196836432,0.50459862591218041,1,0,1,0,1.0605444231036536,0.63724145934188536,-17.77544142647065,-153.03302282827894,26.966977171721055,null,83176,6918246976,null,30.846354174754531,-29.613573192842455,null,-12.484287568314411,-123.41944963543655,null,0,0,null,0,0]
[83660.5,83.660499999999999,575.24711457850299,1.5690579425799733,1.0013806098245095,5.2517107511492842E-2,1,0,158198.87379567645,1.5707900056373814,82.029211904313954,1.5586052457443369,1.1439347030983535,0.50706042169986243,1,0,1,0,1.0613527243200271,0.64099166256388673,-17.844220496078901,-153.36806388968009,26.631936110319913,null,83660.5,6999079260.25,null,30.834502728728182,-29.750557471772538,null,-12.54121519189632,-123.61750641790751,null,0,0,null,0,0]
[84145,84.144999999999996,578.57851215790231,1.5690679520335347,1.0013966358954083,5.2820684151669794E-2,1,0,159115.04515911499,1.5707900420340872,82.504194288318871,1.5586754340929854,1.1455004003665124,0.50951550265020662,1,0,1,0,1.0621679240939772,0.64474177270358557,-17.912794994078904,-153.70275557902661,26.297244420973385,null,84145,7080381025,null,30.822615115444933,-29.887203837975459,null,-12.597902076613067,-123.81555174105118,null,0,0,null,0,0]
[84629.5,84.629499999999993,581.90990979460537,1.5690778468801128,1.0014127542508371,5.3124251047316134E-2,1,0,160031.21652255376,1.5707900780140542,82.979177074119676,1.5587448189088804,1.1470729831769269,0.51196386672449556,1,0,1,0,1.0629900555859506,0.6484917694656156,-17.981168032272009,-154.03709593064352,25.962904069356483,null,84629.5,7162152270.25,null,30.810691717129263,-30.023511370686617,null,-12.654351716490499,-124.01358455995691,null,0,0,null,0,0]
[85114,85.114000000000004,585.24130748763332,1.5690876290768545,1.0014289648863397,5.3427808142954621E-2,1,0,160947.38788599274,1.5707901135843989,83.454160254855836,1.5588134139113783,1.1486524232492794,0.51440551221726383,1,0,1,0,1.0638191520017364,0.65224163230640286,-18.049342665358466,-154.37108299941613,25.628917000583868,null,85114,7244392996,null,30.798732914629475,-30.15947918653654,null,-12.710567547077174,-124.21160381287957,null,0,0,null,0,0]
[85609.5,85.609499999999997,588.64834068606126,1.5690975188447611,1.0014456390070186,5.3738246949673441E-2,1,0,161884.35983766272,1.570790149545896,83.93992776895611,1.5588827633398112,1.1502747857623092,0.51689564183479864,1,0,1,0,1.0646743106365686,0.65607647116746459,-18.11886303480723,-154.71228543860337,25.287714561396626,null,85609.5,7328986490.25,null,30.786466378056836,-30.298181735101469,null,-12.767821379953304,-124.41410370350192,null,0,0,null,0,0]
[86105,86.105000000000004,592.05537394140083,1.5691072947896392,1.0014624096360503,5.4048675389005103E-2,1,0,162821.33178933294,1.5707901850935051,84.425695682106706,1.5589513147241634,1.1519042607195444,0.51937874177657128,1,0,1,0,1.0655368244311088,0.65991112570655974,-18.188182172999159,-155.05311431943898,24.946885680561024,null,86105,7414071025,null,30.774163612646227,-30.43652721375712,null,-12.824837752734616,-124.61658710568183,null,0,0,null,0,0]
[86600.5,86.600499999999997,595.46240725267523,1.5691169588652567,1.0014792767685867,5.4359093401642571E-2,1,0,163758.30374100333,1.5707902202343305,84.91146398745893,1.5590190817603287,1.1535408179801798,0.52185481127704436,1,0,1,0,1.0664067290363661,0.66374557315227722,-18.257303170461793,-155.39356762438589,24.606432375614105,null,86600.5,7499646600.25,null,30.761825021165325,-30.57451479433157,null,-12.881620158716348,-124.81905283005433,null,0,0,null,0,0]
[87096,87.096000000000004,598.8694406189295,1.5691265129809213,1.0014962403997518,5.4669500928290829E-2,1,0,164695.27569267392,1.5707902549753148,85.397232678319838,1.5590860778326021,1.1551844274435807,0.52432384991983227,1,0,1,0,1.0672840601425617,0.66757979046789984,-18.326229060745646,-155.73364335600718,24.266356643992822,null,87096,7585713216,null,30.749451004778766,-30.712143686501832,null,-12.938172032613643,-125.02149966950533,null,0,0,null,0,0]
[87603.25,87.603250000000003,602.35726645701061,1.5691361817032154,1.0015137062497508,5.4987258355414854E-2,1,0,165654.46645450039,1.5707902901330342,85.894520999053313,1.559153877662758,1.1568742861607464,0.52684415491971004,1,0,1,0,1.0681899258214471,0.67150466748348636,-18.396590426312127,-156.08139027185121,23.918609728148795,null,87603.25,7674329410.5625,null,30.736747280324209,-30.852663896510421,null,-12.995829673725567,-125.22872637534073,null,0,0,null,0,0]
[88110.5,88.110500000000002,605.84509235075427,1.5691457391006176,1.0015312732188377,5.5305004667620027E-2,1,0,166613.65721632706,1.5707903248859492,86.391809710082612,1.5592208969541781,1.1585714718073454,0.52935709187795399,1,0,1,0,1.0691036502002784,0.67542925362386619,-18.466753577902946,-156.42873732085729,23.571262679142706,null,88110.5,7763460210.25,null,30.724007276509084,-30.992806647211406,null,-13.05325282150126,-125.43593067364587,null,0,0,null,0,0]
[88617.75,88.617750000000001,609.33291829920472,1.5691551870847997,1.0015489413016923,5.5622739801331846E-2,1,0,167572.84797815394,1.5707903592410115,86.889098804706435,1.5592871491079385,1.1602759522311317,0.53186266145925132,1,0,1,0,1.0700252716793295,0.67935352332169263,-18.536721592793779,-156.77568242195471,23.224317578045287,null,88617.75,7853105615.0625,null,30.711231418350362,-31.132571209261769,null,-13.110444978233373,-125.64311121269299,null,0,0,null,0,0]
[89125,89.125,612.82074430142768,1.5691645275239126,1.0015667104929629,5.594046369298928E-2,1,0,168532.03873998098,1.5707903932050138,87.386388276376039,1.5593526472200974,1.1619876953307207,0.5343608646944068,1,0,1,0,1.0709548286902086,0.68327745072612689,-18.606497491168717,-157.12222351377963,22.87777648622037,null,89125,7943265625,null,30.69842012900682,-31.271956891762589,null,-13.167409587264769,-125.850266622017,null,0,0,null,0,0]
[89644,89.644000000000005,616.38936277930236,1.5691739749195137,1.0015849959349776,5.626553567711217E-2,1,0,169513.4483119639,1.5707904275579336,87.895197404742476,1.5594188954428181,1.1637465730009886,0.53690931378947893,1,0,1,0,1.0719141715758755,0.68729189092049314,-18.677693935008115,-157.47637163976302,22.523628360236984,null,89644,8036046736,null,30.685275845011148,-31.414178494091839,null,-13.225461747108495,-126.06219314567119,null,0,0,null,0,0]
[90163,90.162999999999997,619.95798131155857,1.5691833135524187,1.0016033872124057,5.6590595757746574E-2,1,0,170494.85788394706,1.5707904615153661,88.404006914425295,1.5594843810821601,1.165512985891012,0.53945005465391938,1,0,1,0,1.0728819033756136,0.69130591712891698,-18.748695478009523,-157.83009251754154,22.169907482458456,null,90163,8129366569,null,30.672095359541999,-31.556002117487289,null,-13.283282804640756,-126.27409040005423,null,0,0,null,0,0]
[90682,90.682000000000002,623.5265998972626,1.5691925452900646,1.0016218843194171,5.691564386685577E-2,1,0,171476.26745593039,1.5707904950841016,88.912816798878154,1.5595491172293692,1.1672868997924677,0.54198308955316687,1,0,1,0,1.073858065336412,0.69531950075496674,-18.819505177851042,-158.18338399967081,21.816616000329191,null,90682,8223225124,null,30.658879119663972,-31.697427142064992,null,-13.340876264604244,-126.48595685760581,null,0,0,null,0,0]
[91201,91.200999999999993,627.09521853550177,1.5692016719573807,1.001640487250149,5.7240679936418147E-2,1,0,172457.67702791392,1.5707905282707761,89.421627051703723,1.5596131166777587,1.1690682805598351,0.54450842113448483,1,0,1,0,1.0748426987264081,0.69933261290138726,-18.890126035111958,-158.53624395797252,21.463756042027484,null,91201,8317622401,null,30.645627570308772,-31.838452986879261,null,-13.398245572509964,-126.69779097109326,null,0,0,null,0,0]
[91732,91.731999999999999,630.74634864078314,1.5692109027633769,1.0016596298224913,5.7573218759578847E-2,1,0,173461.77815069494,1.570790561836122,89.942202078165565,1.5596778464750332,1.1708985416065008,0.54708417249745689,1,0,1,0,1.0758589087650183,0.70343799535995788,-18.962187372893275,-158.89681372281487,21.103186277185131,null,91732,8414759824,null,30.632033544997221,-31.982325848177108,null,-13.456712884979732,-126.91448787463774,null,0,0,null,0,0]
[92263,92.263000000000005,634.39747879919037,1.5692200273177723,1.0016788831561871,5.7905744836009937E-2,1,0,174465.87927347614,1.5707905950151115,90.462777477143177,1.5597418312868239,1.1727365466961206,0.54965186701055546,1,0,1,0,1.0768840739533629,0.70754282213423336,-19.034057211509527,-159.25692733075084,20.743072669249159,null,92263,8512461169,null,30.618403493849648,-32.125779748368011,null,-13.514952672448404,-127.13114758238284,null,0,0,null,0,0]
[92794,92.793999999999997,638.04860900981146,1.569229047444588,1.0016982472448497,5.8238258092911346E-2,1,0,175469.98039625757,1.5707906278143773,90.98335324224233,1.5598050839002617,1.1745822594746889,0.55221150871784064,1,0,1,0,1.0779182385356372,0.711647061315823,-19.105738587211341,-159.6165825616832,20.383417438316798,null,92794,8610726436,null,30.604737886303663,-32.268814186890879,null,-13.572968440604239,-127.3477683747923,null,0,0,null,0,0]
[93325,93.325000000000003,641.69973927175511,1.5692379649263324,1.0017177220820561,5.8570758457499955E-2,1,0,176474.08151903917,1.5707906602404009,91.503929367214312,1.5598676168115124,1.1764356436643697,0.55476310206012514,1,0,1,0,1.0789614467644169,0.71575068067890835,-19.177234479133208,-159.97577721434249,20.024222785657514,null,93325,8709555625,null,30.591037189365807,-32.411428702579379,null,-13.630763635588249,-127.56434851176306,null,0,0,null,0,0]
[93868.5,93.868499999999997,645.43681898005241,1.569246987850063,1.0017377700495662,5.8911072616408322E-2,1,0,177501.81967390148,1.570790693049835,92.036760475370613,1.5599308892089268,1.178340564063372,0.55736643141609055,1,0,1,0,1.0800386243076805,0.71995022541027232,-19.250224385366344,-160.3429482374701,19.657051762529903,null,93868.5,8811295292.25,null,30.576978118013148,-32.556965126035593,null,-13.689694470468726,-127.78598311143453,null,0,0,null,0,0]
[94412,94.412000000000006,649.17389874029175,1.5692559068898098,1.0017579340274094,5.925137311463638E-2,1,0,178529.55782876402,1.5707907254815221,92.569591947744868,1.5599934332135181,1.180253444647658,0.55996133968608963,1,0,1,0,1.0811253701160055,0.7241490514769674,-19.323026110026177,-160.70963213423678,19.290367865763216,null,94412,8913625744,null,30.562883267909218,-32.702060768997811,null,-13.748401345024631,-128.00757136523902,null,0,0,null,0,0]
[94955.5,94.955500000000001,652.91097855158125,1.5692647238293798,1.0017782140085805,5.9591659874194791E-2,1,0,179557.29598362671,1.5707907575419486,93.102423778083676,1.5600552613307259,1.1821742467760115,0.56254783288764787,1,0,1,0,1.0822217316440219,0.72834712331196805,-19.395642669977068,-161.07582660211665,18.924173397883351,null,94955.5,9016546980.25,null,30.54875313177277,-32.846715260107544,null,-13.806887768839065,-128.22911134200913,null,0,0,null,0,0]
[95499,95.498999999999995,656.64805841304917,1.5692734404119728,1.0017986099860343,5.9931932817113266E-2,1,0,180585.0341384896,1.5707907892374531,93.635255960276083,1.5601163857813618,1.1841029318984433,0.56512591744969465,1,0,1,0,1.0833277563389825,0.73254440501483664,-19.468077024834219,-161.44152935702425,18.558470642975749,null,95499,9120059001,null,30.534588199563967,-32.990928267877592,null,-13.865157191487418,-128.45060108914669,null,0,0,null,0,0]
[96611.5,96.611500000000007,664.29755506252866,1.5692909767148624,1.0018407205744198,6.0628400257188388E-2,1,0,182688.72999366026,1.5707908530034917,94.725920882911751,1.560239358165278,1.188075213056871,0.57037685318459153,1,0,1,0,1.0856220314397795,0.74113328029223591,-19.615788185217156,-162.18855008433022,17.811449915669783,null,96611.5,9333781932.25,null,30.50548728148874,-33.284742579247173,null,-13.983767433795132,-128.90380750508308,null,0,0,null,0,0]
[97724,97.724000000000004,671.9470519116428,1.5693081137485192,1.0018833170815844,6.1324808812418807E-2,1,0,184792.42584883166,1.5707909153176924,95.816587205401376,1.5603595309973375,1.192080033373502,0.57559265065095921,1,0,1,0,1.0879573993127349,0.74971837791299845,-19.762772229861021,-162.93348191009878,17.066518089901223,null,97724,9549980176,null,30.476246751902725,-33.576703935450233,null,-14.101510948852983,-129.35677797464854,null,0,0,null,0,0]
[98862,98.861999999999995,679.77188574199192,1.5693252445367813,1.0019273926468069,6.2037118369459382E-2,1,0,186944.34124944819,1.57079097760918,96.93225446965188,1.5604796603289592,1.196209975301971,0.58089171923357241,1,0,1,0,1.0903892368291237,0.75849601484200191,-19.912397302821955,-163.69330758211473,16.306692417885273,null,98862,9773695044,null,30.446195807195863,-33.873438866265097,null,-14.22108507710705,-129.81986871584968,null,0,0,null,0,0]
[100000,100,687.59671976728919,1.5693419854291371,1.0019719765299895,6.2749364897807955E-2,1,0,189096.25665006542,1.5707910384829136,98.047923100903105,1.560597055804702,1.2003732752773197,0.58615417681724225,1,0,1,0,1.0928649316209791,0.76726901466689301,-20.061309862289313,-164.45090774097071,15.549092259029294,null,100000,10000000000,null,30.416007383808967,-34.168232698526872,null,-14.339809213187513,-130.28267504244383,null,0,0,null,0,0]
[101165,101.16500000000001,695.60720470706383,1.5693587333690679,1.0020181446836049,6.3478444034436601E-2,1,0,191299.2280399774,1.5707910993822707,99.190063269664194,1.5607145009771484,1.2046695465177826,0.59150365999938059,1,0,1,0,1.0954452471909566,0.77624498750171744,-20.213041479959394,-165.22415671661099,14.775843283389008,null,101165,10234357225,null,30.384964761904879,-34.468009884352917,null,-14.460498208953505,-130.75614683225805,null,0,0,null,0,0]
[102330,102.33,703.61768983750903,1.5693750999680403,1.0020648454171206,6.4207455601805283E-2,1,0,193502.19942989011,1.5707911588949814,100.33220477544113,1.5608292722538402,1.2090000461660206,0.59681497180059262,1,0,1,0,1.0980724438025735,0.78521534239355928,-20.364074291258177,-165.99503189449942,14.004968105500581,null,102330,10471428900,null,30.353787053801085,-34.765753134644015,null,-14.580353312148496,-131.22927875985545,null,0,0,null,0,0]
[103520,103.52,711.80007398065459,1.5693914374650038,1.0021130980805295,6.4952040638591668E-2,1,0,195752.44488396472,1.5707912183018682,101.49885708901974,1.5609438397083693,1.2134584319950312,0.60220096646993004,1,0,1,0,1.1008048999295779,0.79437198606849013,-20.517650440251089,-166.7799773571852,13.220022642814797,null,103520,10716390400,null,30.321805464710614,-35.067787070171931,null,-14.701947872050937,-131.71219028701333,null,0,0,null,0,0]
[104710,104.71,719.9824583094711,1.5694074036204821,1.0021619062686511,6.5696553561211041E-2,1,0,198002.69033804,1.5707912763584693,102.66551070456381,1.5610558033583661,1.2179517606602324,0.60754737472115661,1,0,1,0,1.1035872449378452,0.80352193440045017,-20.670544702045788,-167.56240303547199,12.437596964528012,null,104710,10964184100,null,30.289692262255791,-35.36770198065836,null,-14.822728931390817,-132.19470105481363,null,0,0,null,0,0]
[105930,105.93,728.37112142101273,1.5694233998834015,1.002212521538806,6.6459760000140797E-2,1,0,200309.66466910948,1.5707913345245452,103.86157706147722,1.5611679783785803,1.222594238484314,0.61298760921652751,1,0,1,0,1.1064920370832794,0.81289515267359269,-20.826609076777647,-168.36191554798873,11.63808445201127,null,105930,11221164900,null,30.256637680659466,-35.672980634599014,null,-14.945738724526345,-132.68893491338974,null,0,0,null,0,0]
[107150,107.15,736.75978471468636,1.5694390318830564,1.0022637205226275,6.7222888909267073E-2,1,0,202616.6390001796,1.5707913913660743,105.0576446955472,1.5612775992040888,1.2272726260191742,0.61838652592581778,1,0,1,0,1.1094503055942007,0.8222604119217003,-20.982003632259296,-169.15873454726622,10.841265452733779,null,107150,11481122500,null,30.223454511402782,-35.976038222461654,null,-15.067950110751315,-133.18269632480457,null,0,0,null,0,0]
[108400,108.4,745.35472679641646,1.5694546833276319,1.002316783824879,6.8004701953470748E-2,1,0,204980.34220824388,1.570791448278307,106.28312510837871,1.5613873566134184,1.2321028732114863,0.62387551359745896,1,0,1,0,1.1125373305639552,0.83184721205681122,-21.140547981166197,-169.97233036077972,10.027669639220278,null,108400,11750560000,null,30.189327032372596,-36.284248674704067,null,-15.192366980628025,-133.68808168607569,null,0,0,null,0,0]
[109650,109.65,753.94966905657157,1.569469977922761,1.0023704597097753,6.8786431744915888E-2,1,0,207344.04541630886,1.5707915038929512,107.50860677238056,1.5614946117928614,1.2369699518484674,0.62932146947988388,1,0,1,0,1.1156816034632,0.84142463995612859,-21.298435648912381,-170.78305126175749,9.2169487382425075,null,109650,12023122500,null,30.155074723457478,-36.590136879902374,null,-15.316002339459089,-134.19291438185508,null,0,0,null,0,0]
[110925,110.925,762.7165103394874,1.5694852232945231,1.0024258400929524,6.9583709388302495E-2,1,0,209755.02268853574,1.5707915593286057,108.75859931475615,1.5616015219962058,1.2419718667361188,0.63483220482008074,1,0,1,0,1.1189483161210712,0.85118341821862353,-21.458827479278035,-171.60700047153421,8.3929995284657934,null,110925,12304355625,null,30.120013969516823,-36.899756430053571,null,-15.441333415884092,-134.70724404148064,null,0,0,null,0,0]
[112200,112.2,771.48335179564617,1.5695001221811522,1.0024818575991221,7.0380898436504219E-2,1,0,212165.99996076329,1.5707916135043591,110.00859307197021,1.5617060026253038,1.2470111948430935,0.64029856591066714,1,0,1,0,1.1222757562210086,0.86093133958859347,-21.618581591790793,-172.42790952612313,7.5720904738768695,null,112200,12588840000,null,30.084833791690198,-37.206972655143581,null,-15.565907350570223,-135.22093687097956,null,0,0,null,0,0]
[113510,113.51,780.49085181902433,1.5695150814461938,1.0025400763260144,7.1199877779734758E-2,1,0,214643.1609228173,1.5707916678996601,111.29290160559822,1.561810906862493,1.2522273505242407,0.64586898773283252,1,0,1,0,1.12575840191883,0.8709349470766159,-21.782079551614117,-173.26816126602327,6.7318387339767298,null,113510,12884520100,null,30.048568898466446,-37.520126862596229,null,-15.693140417169795,-135.74803440342703,null,0,0,null,0,0]
[114820,114.82,789.49835201307496,1.5695296993664276,1.0025989674054132,7.2018761461053779E-2,1,0,217120.32188487196,1.5707917210537512,112.57721133604844,1.5619134175518461,1.257482039260617,0.65139302510241759,1,0,1,0,1.129306399076623,0.88092587460374772,-21.944949463641159,-174.1051518567883,5.8948481432117035,null,114820,13183632400,null,30.012188833192866,-37.830760505751144,null,-15.819630263923255,-136.27439135103714,null,0,0,null,0,0]
[116155,116.155,798.6777512354015,1.5695442570336782,1.0026596739593798,7.2853173156290973E-2,1,0,219644.75691108854,1.5707917739887469,113.88603198355771,1.5620155058885252,1.2628761534167314,0.65697501501154743,1,0,1,0,1.1329899855990935,0.89109377575113924,-22.110303643009928,-174.9547337695908,5.0452662304091973,null,116155,13491984025,null,29.975001562568227,-38.144738771310287,null,-15.947797172667391,-136.80999499828047,null,0,0,null,0,0]
[117490,117.49,807.85715062314182,1.5695584838735279,1.0027210785231915,7.3687483237060647E-2,1,0,222169.19193730576,1.5707918257207769,115.19485379101928,1.5621152744100708,1.2683092816221757,0.66250935236605901,1,0,1,0,1.1367427432881334,0.90124719165393896,-22.275049572007291,-175.80087516250416,4.1991248374958445,null,117490,13803900100,null,29.937705835774135,-38.456119593295362,null,-16.07524737487066,-137.34475556920884,null,0,0,null,0,0]
[118860,118.86,817.27720858792691,1.569572751441253,1.0027848185095498,7.4543559771949375E-2,1,0,224759.81065334947,1.5707918776009011,116.53799044380608,1.562215328713912,1.2739248895771524,0.66813952805896482,1,0,1,0,1.1406664828946431,0.91165103784687418,-22.44350408857407,-176.66559512837657,3.334404871623434,null,118860,14127699600,null,29.899325291944123,-38.772975181957996,null,-16.205321347607423,-137.89261994641856,null,0,0,null,0,0]
[120230,120.23,{"$f":"SQRT(1+(A589/pole1)^2)","v":826.69726671528861},{"$f":"ATAN(A589/pole1)","v":1.5695866938565395},{"$f":"SQRT(1+(A589/Zero1)^2)","v":1.0028492933101096},{"$f":"ATAN(A589/Zero1)","v":7.5399526856995511E-2},{"$f":"IF(VIN_nom>Vout, 1, SQRT(1+(A589/z_RHP)^2))","v":1},{"$f":"IF(VIN_nom>Vout, 0, -ATAN(A589/z_RHP))","v":0},{"$f":"SQRT(1+(A589/Pole2)^2)","v":227350.42936939382},{"$f":"ATAN(A589/Pole2)","v":1.5707919282986951},117.88112823665332,1.5623131029808679,{"$f":"SQRT(1+(A589/pole4)^2)","v":1.2795805243359404},{"$f":"ATAN(A589/pole4)","v":0.67372010957842798},{"$f":"IF(VOUT_setting=1,1,SQRT(1+(A589*zterm1)^2))","v":1},{"$f":"IF(VOUT_setting=1,0,ATAN(((A589*zterm1))))","v":0},1,{"$f":"IF(VOUT_setting=1,0,ATAN(A589*$Q$4/(1+Afbr-$Q$5*(A589)^2)))","v":0},{"$f":"SQRT((1-(Z589/pterm2))^2+(A589/pterm1)^2)","v":1.1446644447037608},{"$f":"IF((ATAN((A589/pterm1)/(1-A589^2/pterm2))>0),ATAN((A589/pterm1)/(1-A589^2/pterm2)),PI()+ATAN((A589/pterm1)/(1-A589^2/pterm2)))","v":0.92203819213352289},{"$f":"20*LOG10(((E589*K589*G589*O589)/(C589*I589*S589*M589*Q589))*Adc)","v":-22.61136138509729},{"$f":"((F589+L589+H589+P589)-(D589+J589+T589+N589+R589))*radconv","v":-177.52663539153554},{"$f":"IF(V589>0,V589,V589+180)","v":2.4733646084644647},null,{"$f":"IF(U589<0,A589,1000000000)","v":120230},{"$f":"A589^2","v":14455252900},null,{"$f":"20*LOG10((K589/(I589*M589))*AEA)","v":29.86084207517316},{"$f":"(L589-(J589+N589))*radconv","v":-39.087119802538979},null,{"$f":"20*LOG10((E589*G589/(C589*S589))*Acs*Am)","v":-16.334695427359684},{"$f":"(F589+H589-(D589+T589))*radconv","v":-138.43951558899656},null,{"$f":"SUM((U590<0)*(U589>0))*A589","v":0},0,null,0,0]
[126030,{"$f":"A590/1000","v":126.03},866.57780645176888,1.5696423620677895,1.0031303895746624,7.9022088222292494E-2,1,0,238318.01225484302,1.5707921307209594,123.56741679813341,1.5627034901745074,1.3039554619144933,0.69680374804020628,1,0,1,0,1.1624280468773149,0.96581114627343123,-23.315836875959597,-181.13051212002475,-1.130512120024747,null,126030,15883560900,null,29.69691124142814,-40.387358923060404,null,-16.875240084476967,-140.7431531969643,null,0,0,null,{"$f":"SUM((V591<-183)*(V590>-183))*A590","v":126030},{"$f":"IF(AK590>0,U590,0)","v":-23.315836875959597}]
[131830,131.83000000000001,906.45834863742959,1.5696931319218581,1.00342464239381,8.2642572454555835E-2,1,0,249285.59514030119,1.5707923153316612,129.25372253459747,1.5630595285286553,1.3289995196919522,0.71902887474009292,1,0,{"$f":"IF(VOUT_setting=1,1,SQRT((1+Afbr-$Q$5*(A591)^2)^2+(A591*$Q$4)^2))","v":1},0,1.1815845730681764,1.0092156320999524,-24.011335639541002,-184.66589344734541,-4.665893447345411,null,131830,17379148900,null,29.531645441068314,-41.640375965915823,null,-17.405473047698543,-143.02551748142963,null,0,0,null,0,0]
[144540,144.54,993.85175079221881,1.5697901403410939,1.0041154100051024,9.0568709391718114E-2,1,0,273319.72936001205,1.5707926680762145,141.71462523427752,1.5637398335260386,1.3860417081456675,0.7648604262083295,1,0,1,0,1.2286629925211912,1.1027696637634226,-25.509265836710956,-192.16456467863031,-12.164564678630313,null,144540,20891811600,null,29.166572231480799,-44.227372042180882,null,-18.538330035280982,-147.93719263644942,null,0,0,null,0,0]
[158490,158.49,1089.7713474780971,1.569878702980825,1.0049460758257571,9.9254975818170832E-2,1,0,299698.65716216626,1.5707929901099429,155.3912885571699,1.5643609151850246,1.4517197367181311,0.81091117717781669,1,0,1,0,1.2888211483537511,1.2024292654882547,-27.11972243157107,-199.98497388121143,-19.984973881211431,null,158490,25119080100,null,28.764406194694089,-46.830318812495406,null,-19.746620593354393,-153.15465506871604,null,0,0,null,0,0]
[173780,173.78,1194.9047343776333,1.5699594398967534,1.0059434775958762,0.10875834394662852,1,0,328611.47480341018,1.5707932836875291,170.38175315317704,1.5649271200120038,1.526919566892978,0.85672838088488201,1,0,1,0,1.3655018246960198,1.3072614196719061,-28.851754418439995,-208.04424495735904,-28.044244957359041,null,173780,30199488400,null,28.325708353821351,-49.423026890794787,null,-21.039954739350581,-158.62121806656427,null,0,0,null,0,0]
[190550,190.55,1310.2145455095347,1.5700330929409336,1.0071416673127076,0.11915890139575827,1,0,360322.91704304883,1.5707935515065297,186.8232763743097,1.5654436491488553,1.6127190156701197,0.90196335998423072,1,0,1,0,1.4630417121612345,1.4161480453747846,-30.71576198404264,-216.25349482121297,-36.253494821212968,null,190550,36309302500,null,27.850832253577188,-51.985220687838996,null,-22.429086204709062,-164.26827413337395,null,0,0,null,0,0]
[208930,208.93,1436.5946553771514,1.5701002361634759,1.0085797033967259,0.13052820707101837,1,0,395078.80901472276,1.5707937956543312,204.84331187849742,1.5659145273217532,1.7101426759025224,0.94622875784971061,1,0,1,0,1.5865072788109889,1.5274749777454701,-32.716406278802623,-224.49374712652158,-44.493747126521583,null,208930,43651744900,null,27.341338564131075,-54.494475823532341,null,-23.920236810022931,-169.99927130298923,null,0,0,null,0,0]
[229090,229.09,1575.2139768564973,1.570161492364869,1.0103064649550844,0.14295955510421102,1,0,433200.61435473152,1.5707940183955849,224.60853028198716,1.566344121429228,1.820417656483742,0.98924070871220704,1,0,1,0,1.7420761552918773,1.6395538900985749,-34.856946977316198,-232.64644381785249,-52.646443817852486,null,229090,52482228100,null,26.798547262016214,-56.934277912237107,null,-25.517986206421647,-175.71216590561539,null,0,0,null,0,0]
[251190,251.19,1727.1726632935724,1.5702173458527349,1.0123781243114722,0.15653611059595224,1,0,474990.88707371004,1.5707942214913482,246.27579840423493,1.5667358273287391,1.9447096820046326,1.0307035426277076,1,0,1,0,1.9367993684582565,1.7504769909410924,-37.133117748372733,-240.58040412651027,-60.580404126510274,null,251190,63096416100,null,26.224858035231197,-59.287491846613847,null,-27.220467750693164,-181.29291227989643,null,0,0,null,0,0]
[275420,275.42,1893.7771468318563,1.5702682815345845,1.01486295529468,0.17135443245853282,1,0,520808.91005928762,1.5707944067048585,{"$f":"SQRT(1+(A599/Zero2)^2)","v":270.03139590955902},{"$f":"ATAN(A599/Zero2)","v":1.5670930452473899},2.0843388580088025,1.0704055522936013,1,0,1,0,2.1790163200894446,1.8585296302120033,-39.537487088551465,-248.17955655296123,-68.17955655296123,null,275420,75856176400,null,25.622575016850803,-61.541792974080366,null,-29.022554072491502,-186.63776357888085,null,0,0,null,0,0]
[302000,302,2076.5401384265142,1.5703147565039368,1.0178437482784835,0.18752276574285442,1,0,571070.69507608772,1.5707945756982133,296.09101540678893,1.5674189804755336,2.2407917972002664,1.1082024918324467,1,0,1,0,2.4786269223021544,1.9623035505839563,-42.059929230703403,-255.34858986636272,-75.348589866362715,null,302000,91204000000,null,24.993901375624198,-63.688733060259331,null,-30.916322573416828,-191.65985680610339,null,0,0,null,0,0]
[331130,331.13,2276.8368298876417,1.5703571209550122,1.0214141818139337,0.20512872903707269,1,0,626154.43463740451,1.5707947297448006,324.65074131488535,1.5677160886988346,2.4154286910795437,1.1439466703458052,1,0,1,0,2.8467814320374192,2.0605996016431645,-44.684067247495882,-262.00519500563428,-82.005195005634278,null,331130,109647076900,null,24.342038750288634,-65.719709412523244,null,-32.888597964873746,-196.28548559311108,null,0,0,null,0,0]
[363080,363.08,2496.5237301977895,1.5703957698065352,1.0256915947621452,0.22429151418149529,1,0,686570.68863618537,1.5707948702806345,355.97528787234745,1.5679871393335032,2.610019829147173,1.1776042525098545,1,0,1,0,3.2972869288991848,2.1527859851788511,-47.396895782944711,-268.10426882268064,-88.104268822680638,null,363080,131827086400,null,23.669040094135614,-67.632624816033172,null,-34.928427844169562,-200.47164400664749,null,0,{"$f":"IF(AH602>0,W602,0)","v":0},null,0,0]
[398110,398.11,2737.3885887816805,1.5704310151156049,1.0308103436415237,0.24511031994862817,1,0,752811.10733971291,1.5707949984404259,390.31956532587299,1.568234320729059,2.8262749366012074,1.2091413699852263,1,0,1,0,3.8461001839913904,2.2384690479790215,-50.182366246019861,-273.61552502730308,-93.615525027303079,null,398110,158491572100,null,22.977622320472829,-69.425413439704442,null,-37.02248053358192,-204.19011158759861,null,0,0,null,0,0]
[436520,436.52,3001.4941934658477,1.5704631593942475,1.0369310537560774,0.26769076165472888,1,0,825442.97951792891,1.5707951153241775,427.97770108498401,1.5684597543347103,3.066147503244395,1.2385766147890549,1,0,1,0,4.5125099916605,2.3175898682637097,-53.026494289051406,-278.53049742802108,-98.530497428021079,null,436520,190549710400,null,22.270044795946884,-71.09901904059204,null,-39.159031052087521,-207.43147838742905,null,0,0,null,0,0]
[478630,478.63,3291.0408512921458,1.5704924715525663,1.0442412531478737,0.29212830862429479,1,0,905071.41319210478,1.570795221909707,469.26343124170296,1.5686653259747068,3.3317172673938344,1.2659511263963199,1,0,1,0,5.3194942728319923,2.3902847984711424,-55.915939586054691,-282.85379298666618,-102.85379298666618,null,478630,229086676900,null,21.548538886762081,-72.655690743240569,null,-41.326970439906006,-210.19810224342558,null,0,0,null,0,0]
[524810,524.80999999999995,3608.5726673045183,1.5705192089133975,1.0529642173797293,0.31852015381146959,1,0,992396.06451183534,1.5707953191326982,514.53951334038652,1.5688528402334241,3.6253829751399449,1.2913401872389438,1,0,1,0,6.2950605504309252,2.4568625412038152,-58.840037561188694,-286.60175508110922,-106.60175508110922,null,524810,275425536100,null,20.814820542719762,-74.099638571817763,null,-43.517350070997693,-212.50211650929145,null,0,0,null,0,0]
[575440,575.44000000000005,3956.7025061650288,1.5705435910865415,1.063355704893217,0.34693557270361991,1,0,1088135.4992523803,1.5707954077917019,564.17850933997067,1.5690238372245477,3.9496128763901099,1.314820695494169,1,0,1,0,7.4723681620992117,2.517675699398187,-61.787879899561666,-289.7949475058893,-109.7949475058893,null,575440,331131193600,null,20.070805000679602,-75.435180271076263,null,-45.721176867330499,-214.35976723481303,null,0,0,null,0,0]
[630960,630.96,4338.4557901351191,1.5705658300335539,1.0757173113253096,0.3774369846816864,1,0,1193121.7409429883,1.570795488657458,618.6118069202588,1.5691798034367292,4.307265217412942,1.3364925156944931,1,0,1,0,8.8918669840851603,2.5731474244573995,-64.751161511419156,-292.45968751881566,-112.45968751881566,null,630960,398110521600,null,19.317861026384229,-76.667952531891714,null,-47.931514504892618,-215.79173498692393,null,0,0,null,0,0]
[691830,691.83,4756.9954606885776,1.5705861100697327,1.0903921569020147,0.41004912318325032,1,0,1308224.6323642365,1.5707955624001777,678.29040242267888,1.5693220314802554,4.7013349261142245,1.3564532914310024,1,0,1,0,10.601667915906082,2.6236875011003686,-67.721439743967608,-294.623568036677,-114.623568036677,null,691830,478628748900,null,18.557467563512855,-77.803475897222512,null,-50.141399274569693,-216.82009213945452,null,0,0,null,0,0]
[758580,758.58,5215.9657764978892,1.5706046077443936,1.1077797765985962,0.44477732419398341,1,0,1434446.3836763566,1.5707956296618344,743.73392219228344,1.5694517595088402,5.1352778765739089,1.3748126966280385,1,0,1,0,12.660403293676962,2.669718904455197,-70.692389005497219,-296.31674108404701,-116.31674108404701,null,758580,575443616400,null,17.790610833331126,-78.847963315863325,null,-52.345491805917568,-217.46877776818366,null,0,0,null,0,0]
[831760,831.76,5719.1485154460679,1.5706214755906667,1.1283268332289353,0.48157174085015059,1,0,1572827.0242909088,1.5707956909970724,815.4816012230217,1.5695700572516929,5.6126886772121027,1.3916722535377775,1,0,1,0,15.137648949181408,2.7116225042157538,-73.657051354287702,-297.56964917876815,-117.56964917876815,null,831760,691824697600,null,17.0184694170627,-79.807170325206926,null,-54.53801273843964,-217.76247885356125,null,0,0,null,0,0]
[912010,912.01,6270.9442918119485,1.5706368611773271,1.1525478601219166,0.52035460691554181,1,0,1724576.7702504364,1.5707957469424845,894.16091306732881,1.5696779596264783,6.1377572826817577,1.4071408096160538,1,0,1,0,18.118373951891716,2.7497753404177798,-76.610593695067408,-298.41453648998458,-118.41453648998458,null,912010,831762240100,null,16.241693184372402,-80.687274159420639,null,-56.714778846529043,-217.72726233056395,null,0,0,null,0,0]
[1000000,1000,6875.9599986819003,1.5706508925568097,1.1810098116194299,0.56098211559387845,1,0,1890962.5664744771,1.5707957979636984,980.42874419310078,1.5697763646820864,6.714879001143653,1.4213172776335172,1,0,1,0,21.703645920349544,2.784509101903367,-79.547550998322151,-298.88427010441882,-118.88427010441882,null,1000000,1000000000000,null,15.461122650141725,-81.493890675076287,null,-58.871165615553103,-217.39037942934252,null,0,0,null,0,0]
[]
[]
["Pole/Zero Locations for Chart"]
[{"$f":"U4*1000","v":12957.25},null,{"$f":"SQRT(1+(A617/pole1)^2)","v":89.099143653652831},{"$f":"ATAN(A617/pole1)","v":1.5595726387267879},{"$f":"SQRT(1+(A617/Zero1)^2)","v":1.0000331396731215},{"$f":"ATAN(A617/Zero1)","v":8.1411004107702079E-3},{"$f":"IF(VIN_nom>Vout, 1, SQRT(1+(A617/z_RHP)^2))","v":1},{"$f":"IF(VIN_nom>Vout, 0, -ATAN(A617/z_RHP))","v":0},{"$f":"SQRT(1+(A617/Pole2)^2)","v":24501.674734854758},{"$f":"ATAN(A617/Pole2)","v":1.5707555132582263},{"$f":"SQRT(1+(A617/Zero2)^2)","v":12.742951710199756},{"$f":"ATAN(A617/Zero2)","v":1.4922408038092601},{"$f":"SQRT(1+(A617/pole4)^2)","v":1.0036942848228736},{"$f":"ATAN(A617/pole4)","v":8.5824791805628464E-2},{"$f":"IF(VOUT_setting=1,1,SQRT(1+(A617*zterm1)^2))","v":1},{"$f":"IF(VOUT_setting=1,0,ATAN(((A617*zterm1))))","v":0},{"$f":"IF(VOUT_setting=1,1,SQRT((1+Afbr-$Q$5*(A617)^2)^2+(A617*$Q$4)^2))","v":1},{"$f":"IF(VOUT_setting=1,0,ATAN(A617*$Q$4/(1+Afbr-$Q$5*(A617)^2)))","v":0},{"$f":"SQRT((1-(A617^2/(pole3^2)))^2+(A617/(Q*pole3))^2)","v":1.0012550445426824},{"$f":"ATAN((A617/(Q*pole3))/(1-A617^2/pole3^2))","v":9.8333581305909343E-2},{"$f":"20*LOG10(((E617*K617*G617*O617)/(C617*I617*S617*M617*Q617))*Adc)","v":1.2180598429427557E-2},{"$f":"((F617+L617+H617+P617)-(D617+J617+T617+N617+R617))*radconv","v":-103.94053849017436},{"$f":"IF(V617>0,V617,V617+180)","v":76.059461509825638},"crossover",null,null,null,{"$f":"20*LOG10((K617/(I617*M617))*AEA)","v":31.996680718705889},{"$f":"(L617-(J617+N617))*radconv","v":-9.4159598399324782},null,{"$f":"20*LOG10((E617*G617/(C617*S617))*Acs*Am)","v":4.1530079126343047},{"$f":"(F617+H617-(D617+T617))*radconv","v":-94.524578650241878}]
[{"$f":"A617","v":12957.25},null,null,null,null,null,null,null,null,null,null,null,null,null,null,null,null,null,null,null,null,-180]
[{"$f":"A618","v":12957.25}]
[1000000,null,null,null,null,null,null,null,null,null,null,null,null,null,null,null,null,null,null,null,null,{"$f":"V617","v":-103.94053849017436}]
[]
[{"$f":"pole1","v":145.43423911239387},null,1.4142135623730951,0.78539816339744828,1.0000000041750632,9.1379027076425676E-5,{"$f":"IF(VIN_nom>Vout, 1, SQRT(1+(A622/z_RHP)^2))","v":1},{"$f":"IF(VIN_nom>Vout, 0, -ATAN(A622/z_RHP))","v":0},275.01252015025045,1.567160120693724,1.0101144937457487,0.1416331222211869,1.0000004662720552,{"$f":"ATAN(A622/pole4)","v":9.6568304752562022E-4},{"$f":"IF(VOUT_setting=1,1,SQRT(1+(A622*zterm1)^2))","v":1},{"$f":"IF(VOUT_setting=1,0,ATAN(((A622*zterm1))))","v":0},{"$f":"IF(VOUT_setting=1,1,SQRT((1+Afbr-$Q$5*(A622)^2)^2+(A622*$Q$4)^2))","v":1},{"$f":"IF(VOUT_setting=1,0,ATAN(A622*$Q$4/(1+Afbr-$Q$5*(A622)^2)))","v":0},{"$f":"SQRT((1-(A622^2/(pole3^2)))^2+(A622/(Q*pole3))^2)","v":1.0000001574038611},{"$f":"ATAN((A622/(Q*pole3))/(1-A622^2/pole3^2))","v":1.1033169527111476E-3},{"$f":"20*LOG10(((E622*K622*G622*O622)/(C622*I622*S622*M622*Q622))*Adc)","v":53.020858779376809},{"$f":"((F622+L622+H622+P622)-(D622+J622+T622+N622+R622))*radconv","v":-126.78999007454584},53.210009925454159,"p1",null,null,null,{"$f":"20*LOG10((K622/(I622*M622))*AEA)","v":49.007583086978677},{"$f":"(L622-(J622+N622))*radconv","v":-81.732010250791504},null,{"$f":"20*LOG10((E622*G622/(C622*S622))*Acs*Am)","v":40.150783725308898},{"$f":"(F622+H622-(D622+T622))*radconv","v":-45.057979823754337}]
[{"$f":"Zero1","v":1591549.4327375637},null,10943.430165384982,1.5707049477678201,1.4142135623730951,0.78539816339744828,1,0,3009560.4000001666,1.5707959945204555,1560.4003204306262,1.5701554655650203,10.615095935183863,1.4764509665690599,{"$f":"IF(VOUT_setting=1,1,SQRT(1+(A623*zterm1)^2))","v":1},{"$f":"IF(VOUT_setting=1,0,ATAN(((A623*zterm1))))","v":0},{"$f":"IF(VOUT_setting=1,1,SQRT((1+Afbr-$Q$5*(A623)^2)^2+(A623*$Q$4)^2))","v":1},{"$f":"IF(VOUT_setting=1,0,ATAN(A623*$Q$4/(1+Afbr-$Q$5*(A623)^2)))","v":0},54.398025867652585,-0.2238219967847247,-93.977449993010325,-116.80181737114313,63.19818262885687,"z1",null,null,null,{"$f":"20*LOG10((K623/(I623*M623))*AEA)","v":11.483405271584244},{"$f":"(L623-(J623+N623))*radconv","v":-84.631108744925626},null,-69.323347231683798,-32.170708626217483]
[{"$f":"Pole2","v":0.52883119831639314},null,1.0000066110338264,3.6362061011726279E-3,1.0000000000000551,3.3227444114428239E-7,1,0,1.4142135623730951,0.78539816339744828,1.0000001344112843,5.1848099150176034E-4,1.0000000000061651,3.5114391568064178E-6,1,0,1,0,1.0000000000020812,4.0119053343264674E-6,101.72044516884665,-45.179044560054727,134.82095543994527,"p2",null,null,{"$f":"Pole2","v":0.52883119831639314},{"$f":"20*LOG10((K624/(I624*M624))*AEA)","v":94.696925611418393},{"$f":"(L624-(J624+N624))*radconv","v":-44.970494469459169},null,43.161027590339032,-0.20855009059556009]
[{"$f":"Zero2","v":1019.9624665070261},null,7.0841562260946951,1.4291632045737097,1.0000002053515931,6.4086122987628647E-4,1,0,1928.7111026139955,1.5702778458033948,1.4142135623730951,0.78539816339744828,1.0000229334590458,6.7724472339249515E-3,1,0,1,0,1.0000077421632563,7.7378226293811983E-3,25.029730466919844,-127.6499718097938,52.350028190206203,"z2",null,null,{"$f":"Zero2","v":1019.9624665070261},{"$f":"20*LOG10((K625/(I625*M625))*AEA)","v":35.011981552020821},{"$f":"(L625-(J625+N625))*radconv","v":-45.358325922737585},null,26.155256947809782,-82.291645887056234]
[{"$f":"pole3","v":216500},null,1488.6456598471782,1.5701245752141268,1.0092098010588628,0.13520109799960534,1,0,409393.39564288832,1.5707938841565672,212.26506826534396,1.5660852186164678,1.7511649704125534,0.96301389700956475,1,0,1,0,1.6424475478118421,{"$error":"#DIV/0!"},-33.527013597876028,{"$error":"#DIV/0!"},{"$error":"#DIV/0!"},"p3",null,null,null,{"$f":"20*LOG10((K626/(I626*M626))*AEA)","v":27.135437124113558},{"$f":"(L626-(J626+N626))*radconv","v":-55.446418637037354},null,-24.52494268907882,{"$error":"#DIV/0!"}]
[{"$f":"Fp2_u","v":150602.40963855424},null,{"$f":"SQRT(1+(A627/pole1)^2)","v":1035.5366162699922},{"$f":"ATAN(A627/pole1)","v":1.569830643747371},{"$f":"SQRT(1+(A627/Zero1)^2)","v":1.0044670894282683},{"$f":"ATAN(A627/Zero1)","v":9.434536022583663E-2},1,0,{"$f":"SQRT(1+(A627/Pole2)^2)","v":284783.51904907689},{"$f":"ATAN(A627/Pole2)","v":1.5707928153557398},{"$f":"SQRT(1+(A627/Zero2)^2)","v":147.65824078655979},{"$f":"ATAN(A627/Zero2)","v":1.5640238795609718},{"$f":"SQRT(1+(A627/pole4)^2)","v":1.4142135623730951},0.78539816339744828,1,0,1,0,1.2536866463594536,1.1465076818047695,-26.213016783963376,-195.616962502549,{"$f":"IF(V627>0,V627,V627+180)","v":-15.616962502549001},"p4",null,null,null,null,null,null,-19.067289947642131,-150.22913099785058]
[{"$f":"z_RHP","v":0},null,{"$f":"SQRT(1+(A628/pole1)^2)","v":1},{"$f":"ATAN(A628/pole1)","v":0},{"$f":"SQRT(1+(A628/Zero1)^2)","v":1},{"$f":"ATAN(A628/Zero1)","v":0},1,0,{"$f":"SQRT(1+(A628/Pole2)^2)","v":1},{"$f":"ATAN(A628/Pole2)","v":0},{"$f":"SQRT(1+(A628/Zero2)^2)","v":1},{"$f":"ATAN(A628/Zero2)","v":0},{"$f":"SQRT(1+(A628/pole4)^2)","v":1},0,1,0,1,0,1,0,104.7308013805965,0,{"$f":"IF(V628>0,V628,V628+180)","v":180},"z_RHP",null,null,null,null,null,null,43.161085012877024,0]
[{"$f":"Fp2_u","v":150602.40963855424},null,null,null,null,null,null,null,null,null,null,null,null,null,null,null,null,null,null,null,-25]
[]
[null,null,null,"System","Plant"]
["p1","p-dom",{"$f":"pole1","v":145.43423911239387},{"$f":"U622","v":53.020858779376809},{"$f":"AE622","v":40.150783725308898}]
["z1","ESR zero",{"$f":"Zero1","v":1591549.4327375637},{"$f":"U623","v":-93.977449993010325},{"$f":"AE623","v":-69.323347231683798}]
["p2","EA pole",{"$f":"Pole2","v":0.52883119831639314},{"$f":"U624","v":101.72044516884665},{"$f":"AE624","v":43.161027590339032}]
["z2","EA zero",{"$f":"Zero2","v":1019.9624665070261},{"$f":"U625","v":25.029730466919844},{"$f":"AE625","v":26.155256947809782}]
["p3","p_sampling",{"$f":"pole3","v":216500},{"$f":"U626","v":-33.527013597876028},{"$f":"AE626","v":-24.52494268907882}]
[]
[]
[{"$f":"U4*1000","v":12957.25}]
[{"$f":"U4*1000","v":12957.25}]
[]
[]
[]
[]
["Gain Margin"]
[{"$f":"AL7*1000","v":126030},0]
[{"$f":"AL7*1000","v":126030},{"$f":"AL9","v":-23.315836875959597}]
[]
[]
[]
[]
[]
[]
[]
[]
[]
[]
[]
[]
[]
[]
[]
[]
[]
[]
[]
[]
[]
[]
[]
[]
[]
[]
[]
[]
[]
[]
[]
[]
[]
[]
[]
[]
[]
[]
[]
[null,null,null,null,null,null,null,null,null,null,null,null,null,null,null,null,null,null,null,null,null,null,null,null,null,null,null,null,null,null,null,null,null,"phase margin",{"$f":"SUM(AI689:AI1306)","v":0}]

{"sheet":"Variable Management","index":7,"n_rows":455,"n_cols":30,"rows_kept":455,"cut":false,"hidden":true,"merged":[[4,4,4,7],[0,0,0,8]]}
["EXCEL Variables Names/Calculations"]
[null,"Input from user ="]
[null,"Output ="]
[null,"Constant"]
["Variable Name","Value","STD Units",null,"Notes",null,null,null,"Iteration"]
["Step 1: Operational Specs"]
["VIN_min",{"$f":"'Design Regulator'!E6","v":33},"V","Minimum input voltage",null,null,null,null,1]
["VIN_nom",{"$f":"'Design Regulator'!E7","v":33},"V","Nominal input voltage",null,null,null,null,null,null,{"$f":"CHOOSE(SCH_MODE, \"Efficiency vs. IOUT (Ch1)\", \"Efficiency vs. IOUT - 2 Ph\", \"Efficiency vs. IOUT - 3 Ph\", \"Efficiency vs. IOUT - 4 Ph\")","v":"Efficiency vs. IOUT (Ch1)"},1,null,"DITHER Enabled",1,null,null,null,null,"Dual  Outputs",1,null,"FPWM",1,null,"Internal Compensation",1,null,{"$f":"CHOOSE(SCH_MODE, \"Bode Plot (Ch1)\", \"Bode Plot - 2 Ph\", \"Bode Plot - 3 Ph\", \"Bode Plot - 4 Ph\")","v":"Bode Plot (Ch1)"},1]
["VIN_max",{"$f":"'Design Regulator'!E8","v":51},"V","Maximum input voltage",null,{"$f":"CHOOSE(GPN_setting,80,80,80,65,65,45)","v":80},"IC max voltage",null,null,null,{"$f":"IF(MODE=1, \"Efficiency vs. IOUT (Ch2)\", \"N/A - Do Not Use\")","v":"Efficiency vs. IOUT (Ch2)"},2,null,"DITHER Disabled",2,null,null,null,null,"Single Output – 2  Phases",2,null,"PFM",2,null,"External Compensation",2,null,{"$f":"IF(MODE=1, \"Bode Plot (Ch2)\", \"N/A - Do Not Use\")","v":"Bode Plot (Ch2)"},2]
[null,null,null,null,null,null,null,null,null,null,"PLOT_TYPE",1,null,"DITHER Yes/No",2,"1 = Yes, 2 = No",null,null,null,"Single Output – 3  Phases",3,null,"FPWM/PFM",1,null,"COMP_TYPE",2,null,"BODE_PLOT_TYPE",1]
["Vout",{"$f":"'Design Regulator'!E9","v":20},"V","Output voltage - channel 1",null,null,null,null,null,null,null,null,null,null,null,null,null,null,null,"Single Output – 4  Phases",4]
["Iout",{"$f":"'Design Regulator'!E10","v":0.4},"A","Output current - channel 1",null,{"$f":"CHOOSE(GPN_setting,8,6,4,10,6,10)","v":8},"IC max current",null,1,null,null,null,null,null,null,null,null,null,null,"Single/Dual Yes/No",1]
[null,null,null,null,null,null,null,null,1,null,"Adjustable",1,null,"3.3V",1,null,null,null,null,"MODE (Single/Dual), DUAL = 1, SINGLE = 2",{"$f":"IF(U12=1, 1, 2)","v":1},null,"BIAS connected to ext. power supply",1,null,"UVLO Divider",1]
["Rout",{"$f":"Vout/Iout","v":50},"W","Load resistance - Channel 1",null,null,null,null,null,null,"5V",2,null,"5V",2,null,null,null,null,"SINGLE OUTPUT (1 = YES)",{"$f":"IF(U12=1, 2, 1)","v":2},null,"BIAS connected to VOUT",2,null,"No UVLO Divider",2]
[null,null,null,null,null,null,null,null,null,null,"3.3V",3,null,"Adjustable",3,null,null,null,null,"Number of Phases",{"$f":"SCH_MODE","v":1},null,"BIAS connected to GND",3,null,"UVLO_TYPE",1]
["Pout",{"$f":"Vout*Iout","v":8},"W","Output power",null,null,null,null,null,null,"12V",4,null,"Ch2 Output Setting",{"$f":"IF(Vout2=3.3, 1, IF(Vout2=5, 2, 3))","v":3},null,null,null,null,null,null,null,"Ext_VCC",2]
[null,null,null,null,null,null,null,null,null,null,"Output Voltage Setting",{"$f":"IF(Vout=3.3, 3, IF(Vout=5, 2,  IF(Vout=12,4,1)))","v":1},null,null,null,null,null,null,null,null,null,null,"BIAS pin connection",{"$f":"IF(AND(VOUT_setting=3,Ext_VCC=1),\"Connect the BIAS pin to an external bias supply from 5V to 30V.\", IF(AND(VOUT_setting=3,Ext_VCC=2), \"The BIAS pin cannot be connected to VOUT. Connect BIAS pin to an external bias supply from 5V to 30V.\", IF(AND(VOUT_setting=2,Ext_VCC=2),\"Connect the BIAS pin to VOUT\", IF(AND(VOUT_setting=2,Ext_VCC=1),\"Connect the BIAS pin to an external bias supply from 5V to 30V.\",IF(AND(VOUT_setting=4,Ext_VCC=2),\"Connect the BIAS pin to VOUT\",IF(AND(VOUT_setting=4,Ext_VCC=1),\"Connect the BIAS pin to an external bias supply from 10V to 30V.\",IF(AND(VOUT_setting=1,Ext_VCC=2),\"Connect the BIAS pin to VOUT. If VOUT < 5V, connect the BIAS pin to an external bias supply from 10V to 30V.\", IF(AND(VOUT_setting=1,Ext_VCC=1),\"Connect the BIAS pin to an external bias supply from 10V to 30V.\",\"\"))))))))","v":"Connect the BIAS pin to VOUT. If VOUT < 5V, connect the BIAS pin to an external bias supply from 10V to 30V."}]
["Efficiency",0.9,null,"Estimate of efficiency"]
["Pin",{"$f":"Pout/Efficiency","v":8.8888888888888893},"W","Calculate input power assuming finite efficiency"]
[]
["Iin_Vinmin",{"$f":"Pin/VIN_min","v":0.26936026936026936},"A",null,null,null,null,null,null,null,null,{"$f":"Vout","v":20}]
["Iin_Vinnom",{"$f":"Pin/VIN_nom","v":0.26936026936026936},"A","Input currents at min, nom, max Vin",null,null,null,{"$f":"AND(OSC=1, OR(Fsw/1000>2530, Fsw/1000<1800))","v":false}]
["Iin_Vinmax",{"$f":"Pin/VIN_max","v":0.17429193899782136},"A",null,null,null,null,{"$f":"AND(OSC=2, OR(Fsw/1000>500, Fsw/1000<300))","v":false}]
[null,null,null,null,null,null,null,{"$f":"OR(H22,H23)","v":false}]
["OSC setting",{"$f":"CHOOSE(OSC, 2200, 440)","v":{"$error":"#VALUE!"}},"kHz",null,null,null,null,null,null,null,null,"SetVout_IntComp_nEN",1]
["Fsw",{"$f":"'Design Regulator'!E11*1000","v":433000},"Hz","Nominal switching frequency - determines RT resistor (SYNCIN must be 80-120% of this)",null,null,null,null,null,null,null,"SetVout_IntComp_EN",2,null,"LM70880/-Q1",1]
["RT resistor to AGND",{"$f":"((1000000000/Fsw)-53)/45+0.1","v":50.243751603797797},"kΩ",null,null,null,null,null,null,null,null,"SetVout_ExtComp_nEN",3,null,"LM70860/-Q1",2]
[null,null,"kΩ",null,null,null,null,null,1,null,null,"SetVout_ExtComp_EN",4,null,"LM70840/-Q1",3]
["Tsw",{"$f":"1/Fsw","v":2.3094688221709006E-6},"sec","Switching period",null,null,null,null,null,null,null,"AdjVout_IntComp_nEN",5,null,"LM706A0/-Q1",4]
["Vref",0.8,"V","Reference voltage",null,null,null,null,null,null,null,"AdjVout_IntComp_EN",6,null,"LM70660",5]
["Rt",{"$f":"'Standard Value Calculator'!S12/1000","v":49.9},"kΩ","Frequency set resistor",null,{"$f":"IF(OR((Fsw=440000),(Fsw=2200000)),\"N/A\",Rfadj/1000)","v":4.99E-2},null,null,null,null,null,"AdjVout_ExtComp_nEN",7,null,"LM704A0-Q1",6]
[null,null,null,null,null,null,null,null,null,null,null,"AdjVout_ExtComp_EN",8,null,"GPN setting",1]
["Step 2: Buck Inductor","Channel 1",null,null,null,null,null,null,null,null,null,"SetVout_IntComp_nEN_BIAS_GND",9]
["Don1",{"$f":"Vout/VIN_nom","v":0.60606060606060608},null,null,null,"Ideal Duty Cycle at VIN(nom)",null,null,null,null,null,"SetVout_IntComp_EN_BIAS_GND",10]
["Doff1",{"$f":"1-34:34","v":0.39393939393939392},null,null,null,"Ideal 1- Duty Cycle at VIN(nom)",null,null,null,null,null,"SetVout_ExtComp_nEN_BIAS_GND",11]
[null,null,null,null,null,null,null,null,null,null,null,"SetVout_ExtComp_EN_BIAS_GND",12]
["D_Vinmin",{"$f":"Vout/VIN_min","v":0.60606060606060608},null,null,null,null,null,null,null,null,null,"AdjVout_IntComp_nEN_BIAS_GND",13]
["D_Vinnom",{"$f":"Vout/VIN_nom","v":0.60606060606060608},null,null,null,null,null,null,null,null,null,"AdjVout_IntComp_EN_BIAS_GND",14]
["D_Vinmax",{"$f":"Vout/VIN_max","v":0.39215686274509803},null,null,null,null,null,null,null,null,null,"AdjVout_ExtComp_nEN_BIAS_GND",15]
[null,null,null,null,null,null,null,null,null,null,null,"AdjVout_ExtComp_EN_BIAS_GND",16]
["L_Vinnom",{"$f":"(VIN_nom-Vout)*D1_Vinnom/(Fsw*(Iout/Number_of_Phases)*0.35)","v":1.2997010687541868E-4},"H",null,null,"Calculated inductance for 35% ripple at VIN(nom)",null,null,null,null,null,"PRE_schematic setting",{"$f":"IF(OR(Vout=3.3,Vout=5,Vout=12),CHOOSE(COMP_TYPE,IF(UVLO_TYPE=2,1,2),IF(UVLO_TYPE=2,3,4)),CHOOSE(COMP_TYPE,IF(UVLO_TYPE=2,5,6),IF(UVLO_TYPE=2,7,8)))","v":8}]
["L_slopecomp",{"$f":"1000*Vout*Rs/40/Fsw","v":4.5034642032332561E-5},"H",null,null,"Calculated inductance based on one times inductor downslope",null,null,null,null,null,"Schematic_setting",{"$f":"IF(Ext_VCC=3, PRE_schematic_setting+8, PRE_schematic_setting)","v":8}]
[]
["Lopt",{"$f":"MAX(B41,B42)","v":1.2997010687541868E-4},"H",null,null,"Slope comp"]
[]
["Lo",{"$f":"'Design Regulator'!E28/1000000","v":4.6999999999999997E-5},"H",null,null,"Chosen inductance"]
["Rdcr",{"$f":"'Design Regulator'!E29/1000","v":0.1},"W",null,null,"Chosen inductor DCR"]
[]
["Don2",{"$f":"(Vout+Iout*(Rdcr+Rs))/(Vin+Iout*Rs)","v":0.60745829244357208}]
["Doff2",{"$f":"1-_Don2","v":0.39254170755642792}]
[]
["D_Vinmin_2",{"$f":"CHOOSE(MODE, (Vout+Iout*(Rdcr+Rs))/(VIN_min+Iout*Rs), (Vout+Iout/Number_of_Phases*(Rdcr+Rs))/(VIN_min+Iout/Number_of_Phases*Rs))","v":0.60745829244357208},null,null,null,"Duty cycles adjusted for DCR/shunt voltage drops"]
["D_Vinnom_2",{"$f":"CHOOSE(MODE, (Vout+Iout*(Rdcr+Rs))/(VIN_nom+Iout*Rs), (Vout+Iout/Number_of_Phases*(Rdcr+Rs))/(VIN_nom+Iout/Number_of_Phases*Rs))","v":0.60745829244357208},null,null,null,"need to include RDS(on) later"]
["D_Vinmax_2",{"$f":"CHOOSE(MODE, (Vout+Iout*(Rdcr+Rs))/(VIN_max+Iout*Rs), (Vout+Iout/Number_of_Phases*(Rdcr+Rs))/(VIN_max+Iout/Number_of_Phases*Rs))","v":0.39312680827041135}]
[]
["Iripple_Vinmin",{"$f":"(VIN_min-Vout)*D1_Vinmin_2/(Fsw*Lf)","v":0.38803782623784761},"A"]
["Iripple_Vinnom",{"$f":"(VIN_nom-Vout)*D1_Vinnom_2/(Fsw*Lf)","v":0.38803782623784761},"A"]
["Iripple_Vinmax",{"$f":"(VIN_max-Vout)*D1_Vinmax_2/(Fsw*Lf)","v":0.59883696409919673},"A"]
[]
["Ishunt_rms_Vinmin",{"$f":"SQRT((Iout/Number_of_Phases)^2+(Iripple_Vinmin^2)/12)","v":0.41538870898145852},"A"]
["Ishunt_rms_Vinnom",{"$f":"SQRT((Iout/Number_of_Phases)^2+(Iripple_Vinnom^2)/12)","v":0.41538870898145852},"A"]
["Ishunt_rms_Vinmax",{"$f":"SQRT((Iout/Number_of_Phases)^2+(Iripple_Vinmax^2)/12)","v":0.43575659390416793},"A"]
["Max shunt power loss at full load",{"$f":"B61^2*Rs","v":6.7293634024220301E-3},"W",null,null,"Note this is power loss at full load - not loss near OCP!"]
[]
["Max inductor ripple current",{"$f":"MAX(B56:B58)","v":0.59883696409919673},"A",null,null,"Ripple current at Vin(max)"]
[]
[null,{"$f":"B56/(Iout/Number_of_Phases)","v":0.97009456559461893}]
["% ripple current",{"$f":"B57/(Iout/Number_of_Phases)","v":0.97009456559461893}]
[null,{"$f":"B58/(Iout/Number_of_Phases)","v":1.4970924102479917}]
[]
["Inductor copper temerature",100,"°C"]
["DCR at hot",{"$f":"Rdcr*(1+0.0039*(B71-25))","v":0.12925},"W"]
[]
[]
["Step 3: Sense Resistors, Slope Comp, Current Limit"]
[]
["Ilimit_DC",{"$f":"'Design Regulator'!E17","v":1.2},"A",null,null,"Chosen OCP level - based on output current"]
[]
["Ilimit_inductor_Vinmin",{"$f":"CHOOSE(MODE, Ilimit_DC+Iripple_Vinmin/2, Ilimit_DC/Number_of_Phases+Iripple_Vinmin/2)","v":1.3940189131189238},"A",null,null,"Peak inductor current at current limit inception"]
["Ilimit_inductor_Vinnom",{"$f":"CHOOSE(MODE, Ilimit_DC+Iripple_Vinnom/2, Ilimit_DC/Number_of_Phases+Iripple_Vinnom/2)","v":1.3940189131189238},"A"]
["Ilimit_inductor_Vinmax",{"$f":"CHOOSE(MODE, Ilimit_DC+Iripple_Vinmax/2, Ilimit_DC/Number_of_Phases+Iripple_Vinmax/2)","v":1.4994184820495984},"A"]
[]
[]
["CS threshold_min",0.05,"V"]
["CS threshold",5.6000000000000001E-2,"V"]
["CS threshold_max",6.2E-2,"V"]
[]
["Shunt required to get OCP at VIN(min)",{"$f":"Buck_CS_threshold/B79","v":4.0171621398383879E-2},"W"]
["Shunt required to get OCP at VIN(nom)",{"$f":"Buck_CS_threshold/B80","v":4.0171621398383879E-2},"W"]
["Shunt required to get OCP at VIN(max)",{"$f":"Buck_CS_threshold/B81","v":3.7347812282166874E-2},"W"]
[]
["Rs_ideal",{"$f":"B89","v":4.0171621398383879E-2},"W",null,null,"Ideal Rs for the required OCP -- based on 73mV CL threshold"]
["Rs",{"$f":"'Design Regulator'!E19/1000","v":3.9E-2},"W",null,null,"Selected (starndard value) current limit sense resistor"]
[]
["Current limit - peak",{"$f":"Buck_CS_threshold_max/Rs","v":1.5897435897435896},"A",null,null,"Peak inductor current limit = min sat current"]
[]
["Iout_OCP_Vinmin",{"$f":"Number_of_Phases*(Buck_CS_threshold/Rs-Iripple_Vinmin/2)","v":1.2418785227785121},"A",null,null,"Current limit setpoints (i.e. IOUT) after standard components are selected"]
["Iout_OCP_Vinnom",{"$f":"Number_of_Phases*(Buck_CS_threshold/Rs-Iripple_Vinnom/2)","v":1.2418785227785121},"A"]
["Iout_OCP_Vinmax",{"$f":"Number_of_Phases*(Buck_CS_threshold/Rs-Iripple_Vinmax/2)","v":1.1364789538478375},"A"]
[]
["Irms_OCP_Vinmin",{"$f":"SQRT((Iout_OCP_Vinmin/Number_of_Phases)^2+(Iripple_Vinmin^2)/12)","v":1.2469202239469139},"A"]
["Irms_OCP_Vinnom",{"$f":"SQRT((Iout_OCP_Vinnom/Number_of_Phases)^2+(Iripple_Vinnom^2)/12)","v":1.2469202239469139},"A"]
["Irms_OCP_Vinmax",{"$f":"SQRT((Iout_OCP_Vinmax/Number_of_Phases)^2+(Iripple_Vinmax^2)/12)","v":1.1495513131957342},"A"]
[]
["Pshunt_Vinmin",{"$f":"B101^2*Rs","v":6.0637591750625053E-2},"W",null,null,"Max power dissipations in shunt"]
["Pshunt_Vinnom",{"$f":"B102^2*Rs","v":6.0637591750625053E-2},"W"]
["Pshunt_Vinmax",{"$f":"B103^2*Rs","v":5.1537260645131443E-2},"W"]
[]
[]
["Step 4: Output Capacitor"]
["Icoutrms_VINmin",{"$f":"Iripple_Vinmin/SQRT(12)","v":0.11201687171708928},"A",null,null,"Output Cap RMS current"]
["Icoutrms_VINnom",{"$f":"Iripple_Vinnom/SQRT(12)","v":0.11201687171708928},"A"]
["Icoutrms_VINmax",{"$f":"Iripple_Vinmax/SQRT(12)","v":0.17286934121168476},"A"]
["Max Cout rms current",{"$f":"MAX(B111:B113)","v":0.17286934121168476},"A"]
[]
["Vripple1",{"$f":"'Design Regulator'!E34/1000","v":0.01},"V",null,null,"Output voltage ripple spec(pk-pk)"]
[]
["Output Ripple Spec (pk-pk)",{"$f":"Vo1_ripple*1000","v":10},"mV",null,null,"Vout ripple spec at Vin(nom)"]
[]
["Coutmin",{"$f":"Iripple_Vinnom/(Fsw*8*Vo1_ripple)","v":1.1202015768990982E-5},"F",null,null,"Minimum output capacitnace",null,{"$f":"Vo2_ripple","v":0},1]
["Reported Coutmin",{"$f":"IF(Cout_min*1000000<2, 2.2,Cout_min*1000000)","v":11.202015768990982},"uF"]
["Cout",{"$f":"'Design Regulator'!E37/1000000","v":5.0000000000000002E-5},"F",null,null,"Chosen output capacitance",null,null,1]
["Resrmax",{"$f":"SQRT((Vo1_ripple/Iripple_Vinnom)^2-(1/(Fsw*Cout*8))^2)","v":2.5115589546258383E-2},"W",null,null,"Max ESR before ripple exceeds Vripple1",null,null,1]
["Cout_min_loadoff",{"$f":"Lf*((Load_Step/100)*Iout)^2/((Vout+Vo1_ripple)^2-Vout^2)*1000000","v":18.79530117470323},"uF",{"$f":"IF(Load_Step=0, Cout_min*1000000, Cout_min_loadoff)","v":18.79530117470323}]
["Total COUT with stead-state+load step",{"$f":"Lf*((Load_Step/100)*Iout)^2/((Vout+Vo1_ripple)^2-Vout^2)*1000000 + (Cout_min*1000000)","v":29.997316943694212},"uF"]
[]
[]
["Reported Cout ESR max",{"$f":"IF(OR(CoutEsrMax>0.3, CoutEsrMax<0, (ISERROR(CoutEsrMax))), \"N/A\", CoutEsrMax*1000)","v":25.115589546258384},"mΩ"]
["CoutEsr",{"$f":"'Design Regulator'!E39/1000","v":2E-3},"W",null,null,"Chosen ESR",null,null,1,null,{"$f":"ISERROR(CoutEsrMax)","v":false},{"$f":"ISERROR(B128)","v":false}]
["Vripple",{"$f":"Iripple_Vinnom*SQRT(Cout_ESR^2+(1/(8*Fsw*Cout))^2)","v":2.3710123808016017E-3},"Vp-p",null,null,null,null,null,null,null,null,{"$f":"OR(CoutEsrMax>0.3,CoutEsrMax<0)","v":false}]
[null,null,null,null,null,null,null,null,null,null,{"$f":"OR(TRUE, FALSE, TRUE)","v":true}]
["Step 5: Input Capacitor"]
[null,null,null,null,null,null,null,null,null,null,"Two channels operating at full load"]
["Icinrms_VINmin",{"$f":"SQRT(D1_Vinmin_2*(Iout^2*(1-D1_Vinmin_2)+Iripple_Vinmin^2/12))","v":0.21395019794471706},"A",{"$f":"D1_Vinmax","v":0.39215686274509803},null,"Calculate input cap rms current with one output unloaded",null,null,null,null,{"$f":"SQRT(Iout^2*D1_Vinmin*(1-D1_Vinmin)+Iout2^2*D2_Vinmin*(1-D2_Vinmin)-2*Iout*Iout2*D1_Vinmin*D2_Vinmin)","v":{"$error":"#NAME?"}},"A",{"$f":"SQRT(Iout^2*D1_Vinmin*(1-D1_Vinmin)+Iout2^2*D2_Vinmin*(1-D2_Vinmin)-2*Iout*Iout2*(0.5-D2_Vinmin*(1-D1_Vinmin)))","v":{"$error":"#NAME?"}},"A"]
["Icinrms_VINnom",{"$f":"SQRT(D1_Vinnom_2*(Iout^2*(1-D1_Vinnom_2)+Iripple_Vinnom^2/12))","v":0.21395019794471706},"A",{"$f":"D1_Vinmin","v":0.60606060606060608},null,null,null,null,null,null,{"$f":"SQRT(Iout^2*D1_Vinnom*(1-D1_Vinnom)+Iout2^2*D2_Vinnom*(1-D2_Vinnom)-2*Iout*Iout2*D1_Vinnom*D2_Vinnom)","v":{"$error":"#NAME?"}},"A"]
["Icinrms_VINmax",{"$f":"SQRT(D1_Vinmax_2*(Iout^2*(1-D1_Vinmax_2)+Iripple_Vinmax^2/12))","v":0.22342924124863811},"A",null,null,null,null,null,null,null,{"$f":"SQRT(Iout^2*D1_Vinmax*(1-D1_Vinmax)+Iout2^2*D2_Vinmax*(1-D2_Vinmax)-2*Iout*Iout2*D1_Vinmax*D2_Vinmax)","v":{"$error":"#NAME?"}},"A"]
["Icinrms - multiphase",{"$f":"Iout*SQRT((D1_Vinmin-F139/Number_of_Phases)*((F139+1)/Number_of_Phases-D1_Vinmin))","v":0.19544867268602545},"A",null,null,null,null,null,null,null,{"$f":"MAX(K134:K136)","v":{"$error":"#NAME?"}},"A"]
["Max Cin rms current",{"$f":"MAX(B134:B136)","v":0.22342924124863811},"A",null,null,{"$f":"Number_of_Phases*D1_Vinnom","v":0.60606060606060608},"N*D"]
[null,null,null,null,null,{"$f":"FLOOR(Number_of_Phases*D1_Vinnom,1)","v":0},"floor(N*D)"]
["Icinrms - multiphase - max",{"$f":"Iout/2/Number_of_Phases","v":0.2},"A"]
["Final result",{"$f":"IF(D1_Vinmin<0.5, B138, B140)","v":0.2},"A","…report this"]
[]
["Vinripple1",{"$f":"'Design Regulator'!E44/1000","v":5.0000000000000001E-3},"Vp-p",null,null,"Input voltage ripple spec (pk-pk)"]
[]
["Cinmin_Vinmin",{"$f":"Iout/Number_of_Phases*D1_Vinmin*(1-D1_Vinmin)/(Vinripple1*Fsw)","v":4.4111066575899665E-5},"F"]
["Cinmin_Vinnom",{"$f":"Iout/Number_of_Phases*D1_Vinnom*(1-D1_Vinnom)/(Vinripple1*Fsw)","v":4.4111066575899665E-5},"F"]
["Cinmin_Vinmax",{"$f":"Iout/Number_of_Phases*D1_Vinmax*(1-D1_Vinmax)/(Vinripple1*Fsw)","v":4.404062036896451E-5},"F",null,null,"Calculate cap at Vinmax and 50% duty cycle (Vin = 2*Vout)"]
[]
["Cinmin_50%D",{"$f":"Iout*0.5*(1-0.5)/(Vinripple1*Fsw)","v":4.6189376443418017E-5},"F",null,null,"Buck 50% typically worst case"]
["Cinmin",{"$f":"IF(D1_Vinmin<0.5, B145,B149)","v":4.6189376443418017E-5},"F",{"$f":"(VIN_min+VIN_max)/2","v":42}]
["Reported Cinmin",{"$f":"IF(Cinmin*1000000<2.2, 2.2,Cinmin*1000000)","v":46.18937644341802},"uF",{"$f":"2*Vout","v":40},null,"…report this"]
[]
["Cin",{"$f":"'Design Regulator'!E46/1000000","v":5.0000000000000002E-5},"F",null,null,"Input capacitance"]
["CinEsrMax_Vinmax",{"$f":"-(Iout/Number_of_Phases*D1_Vinmax*(1-D1_Vinmax)/(Cin*Fsw)-Vinripple1)/(Iout/Number_of_Phases+Iripple_Vinmax/2)","v":8.5204777740101149E-4},"W"]
["CinEsrMax_50%D",{"$f":"-(Iout/Number_of_Phases*0.5*(1-0.5)/(Cin*Fsw)-Vinripple1)/(Iout/Number_of_Phases+Iripple_Vinmax/2)","v":5.4482740367615317E-4},"W",null,null,"Calculate ESR at Vinmax and 50% duty cycle (Vin = 2*Vout)"]
["CinEsrMax",{"$f":"IF(VIN_max<2*Vout, B154,B155)","v":5.4482740367615317E-4},"W"]
["Reported Cin ESR max",{"$f":"IF(OR(CinEsrMax>0.3, CinEsrMax<0), \"N/A\",CinEsrMax*1000)","v":0.54482740367615312},"mΩ",null,null,"…report this"]
["RCinEsr",{"$f":"'Design Regulator'!E48/1000","v":1E-3},"W",null,null,"Input capacitance series resistance (ESR)"]
[]
["Vinripple2_Vinmin",{"$f":"Iout/Number_of_Phases*D1_Vinmin_2*(1-D1_Vinmin_2)/(Cin*Fsw)+(Iout/Number_of_Phases +Iripple_Vinmin/2)*RCinEsr","v":4.9996118070701799E-3},"Vp-p"]
["Vinripple2_Vinnom",{"$f":"Iout/Number_of_Phases*D1_Vinnom_2*(1-D1_Vinnom_2)/(Cin*Fsw)+(Iout/Number_of_Phases +Iripple_Vinnom/2)*RCinEsr","v":4.9996118070701799E-3},"Vp-p"]
["Vinripple2_Vinmax",{"$f":"Iout/Number_of_Phases*D1_Vinmax_2*(1-D1_Vinmax_2)/(Cin*Fsw)+(Iout/Number_of_Phases +Iripple_Vinmax/2)*RCinEsr","v":5.1073283368215268E-3},"Vp-p"]
["Vinripple2_50%D",{"$f":"Iout/Number_of_Phases*0.5*(1-0.5)/(Cin*Fsw)+(Iout/Number_of_Phases +Iripple_Vinmax/2)*RCinEsr","v":5.3183561263913997E-3},"Vp-p",null,null,"Calculate ripple at Vinmax and 50% duty cycle (Vin = 2*Vout)"]
["Vinripple2",{"$f":"IF(D1_Vinmin<0.5, B160,B163)","v":5.3183561263913997E-3},"Vp-p",null,null,"…report highest of these"]
[]
[null,{"$f":"Iout*D1_Vinmax_2*(1-D1_Vinmax_2)/(Cin*Fsw)","v":4.4079098547719284E-3},"Vp-p"]
[]
["Step 6a: Soft Start"]
["Tss",{"$f":"'Design Regulator'!E53/1000","v":0},"s","Soft-start time"]
["Iss",{"$f":"Cout*Vout/Tss","v":{"$error":"#DIV/0!"}},"A","Load cap current during soft start"]
["Css",{"$f":"0.000022*Tss/1.2","v":0},"F"]
["Css_u",{"$f":"'Standard Value Calculator'!B4","v":0},"F"]
[]
["Step 6b: Other Components - Dither, Hiccup, DEMB, MODE"]
["Tres",{"$f":"'Design Regulator'!E56/1000","v":1.17E-2},"s","Hiccup time"]
["Cres",{"$f":"0.00002*Tres/1.2","v":1.9500000000000004E-7},"F"]
["Cres_u",{"$f":"'Standard Value Calculator'!G4","v":1.8E-7},"F"]
[]
["RPG1/2",100,"kΩ"]
["RFB1/2",null,"W",null,"Tie to VDDA or AGND for 3.3V/5V output, respectively. "]
["R_MODE",null,"W",null,"Tie to VDDA or AGND for Single/Dual operation, respectively. "]
["R_DEMB",null,"W",null,"Tie to VDDA or AGND for FPWM/DEM, respectively. "]
[]
["Enable Hysteresis Current",1.0000000000000001E-5,"A",null,"10 µA Hysteresis Current"]
["Turn ON Voltage",{"$f":"'Design Regulator'!E55","v":13}]
["Rising EN Voltage",1]
[]
["Upper FB resistor",{"$f":"'Design Regulator'!E57*1000","v":237000},"W",{"$f":"'Design Regulator'!E57*1000","v":237000}]
["Lower FB resister",{"$f":"(B186/(B185-B186))*B188","v":19750},"W",{"$f":"(B186/(B185-B186))*D188","v":19750}]
["Standard upper FB resistor",{"$f":"'Standard Value Calculator'!S40","v":237},"kΩ"]
["Standard lower FB resistor",{"$f":"'Standard Value Calculator'!S41","v":19.600000000000001},"kΩ"]
[]
["Dither Modulation Frequency",{"$f":"'Design Regulator'!E59*1000","v":29400},"Hz"]
["Cdither_calculated",{"$f":"10*10^-6/Fdither/0.12","v":2.8344671201814057E-9},"F"]
["Cdither_stdvalue",{"$f":"'Standard Value Calculator'!S21","v":2.7000000000000002E-9},"F"]
[]
[]
["Step 7: Compensation"]
["Pi",3.1415926500000002,null,"p"]
["CS Amp Gain",10]
["Ri",{"$f":"Rs*CSAmp_gain","v":0.39},"W",null,null,"Current Sense effective resistance = shunt resistor Rs * CS amp gain"]
["gm",{"$f":"IF(COMP_TYPE=1,0.00003,0.0012)","v":1.1999999999999999E-3},"S",null,null,"Error Amp Transconductance"]
[]
["Se_ext",{"$f":"B208/Ri*1000","v":444102.56410256412},"A/s",null,null,"Slope Comp Slope - referred to inductor current"]
["Sn",{"$f":"(Vin-Vout)/Lf","v":276595.74468085106},"A/s",null,null,"On-time Slope"]
["Sf",{"$f":"Vout/Lf","v":425531.91489361704},"A/s",null,null,"Off-time Slope"]
[]
["Se_int",{"$f":"Fsw*0.0004","v":173.20000000000002},"mV/μs",null,null,"Slope Comp Slope - referred to IC"]
["Sn_int",{"$f":"Sn*Ri/1000","v":107.87234042553192},"mV/μs",null,null,"etc"]
["Sf_int",{"$f":"Sf*Ri/1000","v":165.95744680851067},"mV/μs",null,null,"etc"]
[]
["mc_buck",{"$f":"1+Se_ext/Sn","v":2.6056015779092703},null,null,null,"mc = 1 + Se/Sn for peak current-mode buck"]
["k_buck",{"$f":"mc_buck*(1-D1_Vinnom_2)","v":1.022807292604228},null,null,null,"mc*(1-d)"]
[]
["mc",{"$f":"1+Se_ext/Sn","v":2.6056015779092703}]
["k",{"$f":"mc_buck*(1-D1_Vinnom_2)","v":1.022807292604228}]
["Q",{"$f":"1/Pi/(k-0.5)","v":0.60884744924259793},null,null,null,"1/(Pi*(k-0.5))",null,"Q = 2/Pi = 0.636 gives ideal one-cycle damping"]
[]
["Error Amp (EA)"]
["GBW",6,"MHz",null,null,"EA gain-bandwidth product"]
["Cbw",{"$f":"gm/(2*Pi*GBW*1000000)","v":3.1830988654751269E-11},"F",null,null,"EA effective bandwidth limiting capacitance = gm/(2*Pi*GBW)"]
["RoEA",64000000,"W",null,null,"EA output resistance"]
["AEA",{"$f":"gm*RoEA","v":76800},"V/V",null,null,"EA DC gain = gm*RoEA"]
["Afb",{"$f":"IF(VOUT_setting=1,Vref/Vout,SQRT((1+(Fcross*zterm1)^2)/((1+Afbr-pterm4*(Fcross)^2)^2+(Fcross*pterm3)^2)))","v":0.04},"V/V",null,null,"Feedback gain from Vout to FB"]
["Acs",{"$f":"1/Ri","v":2.5641025641025639},null,null,null,"Acs = 1/Ri"]
["Am_buck",{"$f":"(Ro/Number_of_Phases)/Ri/((1+Ro/Number_of_Phases*(k-0.5)/(Fsw*Lf)))","v":56.12015445997676}]
["Am",{"$f":"(Ro*Number_of_Phases)/Ri/((1+Ro*Number_of_Phases*(k-0.5)/(Fsw*Lf)))","v":56.12015445997676},null,null,null,"Buck modulator gain"]
[]
["Scaling factor to calculate Rcomp - buck",{"$f":"2*Pi*Ri/gm","v":2042.0352225000004},null,null,null,"2*Pi*Ri/gm -- scaling factor to calculate Rcomp given desired buck crossover frequency"]
["DC Gain is Adc = AEA*Afb*Am"]
[]
["Ro",{"$f":"Rout","v":50},"W",null,null,"Output Resistance"]
[]
["Fp_load_buck",{"$f":"1/(2*Pi*Ro*Cout)+(k-0.5)/(2*Pi*Fsw*Lf*Cout/Number_of_Phases)","v":145.43423911239387},"Hz",null,null,"Buck dominant pole frequency -- note slope comp influence"]
["Fp_dominant",{"$f":"Fload_u","v":145.43423911239387},"Hz"]
[null,{"$f":"Cbw","v":3.1830988654751269E-11}]
["Fp_EA",{"$f":"1/(2*Pi*(RoEA+Rcea1_u)*Cc1ea_u)","v":0.52883119831639314},"Hz",null,null,"Error Amp LF pole -- related to amplifier ouptut resistance and comp cap"]
["Fp_HF",{"$f":"1/(2*Pi*Rcea1_u*(Cc2ea_u+Cbw))","v":150602.40963855424},"Hz",null,null,"Error Amp HF pole cancels zero related to Output Cap ESR"]
["Fesr",{"$f":"1/(2*Pi*Cout*Cout_ESR)","v":1591549.4327375637},"Hz",null,null,"Cout ESR zero frequency"]
["F_mod",{"$f":"Fsw/2","v":216500},"Hz",null,null,"Zero-order sample-and-hold effects of current-mode control modeled as pole at Fsw/2"]
[null,null,null,"Internal Comp Crossover"]
["Desired Crossover Frequency",{"$f":"CHOOSE(COMP_TYPE,Fcross_Ch2,'Design Regulator'!E65*1000)","v":10000},"Hz",{"$f":"Fsw/50","v":8660}]
["Rcea1",{"$f":"Fcross*Cout/Number_of_Phases*2*Pi*Ri/(gm*Afb)","v":25525.440281250005},"W",null,null,"This component will largely determine the crossover frequency",null,null,null,null,{"$f":"Fcross/Fp_dominant/(gm*Afb*Am)","v":25525.440281250005}]
["Cc1ea, Cc3ea",{"$f":"10/(Rcea1*Fcross*2*Pi)","v":6.2351497768547956E-9},"F",null,null,"This along with Rcea1 will set a zero at Fcrossover/5 to optimize phase margin"]
["Cc2ea, Cc4ea",{"$f":"MAX(1/(Rcea1*2*Pi*Fesr)-Cbw, 1/(Rcea1*2*Pi*(Fsw/2))-Cbw)","v":-3.0312206323272669E-12},"F",null,null,"This along with Rcea1 places a pole at the output cap ESR zero"]
[]
[{"$f":"CHOOSE(COMP_TYPE,\"Internal Compensation\",\"External Compensation\")","v":"External Compensation"}]
["Chosen Compensation Components from the standard value sheet",null,null,"Internal Values"]
["Rcea1_u",{"$f":"CHOOSE(COMP_TYPE,D249,'Design Regulator'!D72*1000)","v":33200},"W",400000,null,null,{"$f":"1/(Rcea1*2*Pi*(Fsw/2))-Cbw","v":-3.0312206323272669E-12}]
["Cc1ea_u",{"$f":"CHOOSE(COMP_TYPE,Cc3ea_u,'Design Regulator'!D73*0.000000001)","v":4.7000000000000007E-9},"F",{"$f":"50*0.000000000001","v":5.0000000000000002E-11}]
["Cc2ea_u",{"$f":"CHOOSE(COMP_TYPE,Cc4ea_u,'Design Regulator'!D74*0.000000000001)","v":0},"F",{"$f":"0.000000000001","v":9.9999999999999998E-13}]
[]
["Resulting Pole/Zero Locations",null,null,null,null,{"$f":"Cout","v":5.0000000000000002E-5},{"$f":"Cout_ESR","v":2E-3}]
["Fz1",{"$f":"1/(2*Pi*Rcea1_u*Cc1ea_u)","v":1019.9624665070261},"Hz",null,null,"This zero is set at or close to the dominant load pole"]
["Fp2",{"$f":"1/(2*Pi*Rcea1_u*(Cc1ea_u*(Cc2ea_u+Cbw)/(Cc1ea_u+Cc2ea_u+Cbw)))","v":151622.37210506125},"Hz",null,null,"This pole cancels the zero from the Output Cap ESR"]
[null,null,null,"Internal Values"]
["Rfb1",{"$f":"IF(VOUT_setting=1,'Design Regulator'!E67*1000,2500000)","v":274000},"W",null,null,"Upper Feedback Resistance - chosen by user"]
["Rfb2",{"$f":"IF(Vout=Vref,100000000,Vref*B257/((Vout-Vref)))","v":11416.666666666668},"W",null,null,"Lower Feedback Resistance"]
["Rfb2_u",{"$f":"IF(Vout=Vref,\"N/A\",CHOOSE(VOUT_setting,'Standard Value Calculator'!S11,471000,792000,177000))","v":11500},"W",null,null,"Std Value Lower Feedback Resistance"]
[]
["Rff",20000,"W"]
["Cff",3.67E-13,"F"]
["Cfb",2.1999999999999999E-12,"F"]
[]
["wff",{"$f":"1/(2*Pi*Rff*Cff)","v":21683234.778440922},"Hz"]
["wfbt",{"$f":"1/(2*Pi*Rfb1_*Cfb)","v":264026.11691067746},"Hz"]
["wfbb",{"$f":"1/(2*Pi*Rfb2_u*Cfb)","v":6290709.2203065762},"Hz"]
["w1",{"$f":"1/(2*Pi*Rff*Cfb)","v":3617157.8016762817},"Hz"]
["wfft",{"$f":"1/(2*Pi*Cff*Rfb1_)","v":1582717.8670394835},"Hz"]
["Cfb*(Rff+RFBT)/(Rff*RFBT))",{"$f":"2*Pi*Cfb*(Rff+Rfb1_)/(Rff*Rfb1_)","v":7.4159931606569348E-16},"Hz"]
[]
[]
[]
[]
["Other Input Variables"]
["Rfets",0,"W","Series resistance due to FETs"]
["Diode loss eq res",{"$f":"0.00000002*Fsw*0.6*4/Iripple1","v":{"$error":"#NAME?"}}]
["Fet loss eq res",{"$f":"_Don2*RdsonTop+Doff2*RdsonBot","v":{"$error":"#NAME?"}}]
["cap loss eq res",{"$f":"B280*Vin^2*Fsw/2/(((Iripple1/SQRT(3))^2))","v":{"$error":"#NAME?"}}]
["Sw cap",5.0000000000000001E-9]
[]
["Step 8: AEF"]
[]
["VinRipple_dBuV",{"$f":"20*LOG10(Vinripple2*1000000)","v":74.515548301687019},"dBuV"]
["CISPR 25 limit",{"$f":"CHOOSE(OSC,35,50)","v":{"$error":"#VALUE!"}},"dBuV","Chooses CISPR conducted limit 35 at 2.1MHz and 50 at 440kHz"]
["Attenuation required",{"$f":"VinRipple_dBuV-B285+3","v":{"$error":"#VALUE!"}},"dBuV","Margin of attenuation req"]
["Filter Frequency Required",{"$f":"Fsw/(POWER(10,Attn_req/40))","v":{"$error":"#VALUE!"}},"Hz","assume 40db/decade drop and set frequency based on attenuation"]
[]
["Lfilter",{"$f":"'Design Regulator'!E51","v":0},"uH","user input"]
[]
["Gop_AEF",{"$f":"CHOOSE(OSC,20,100)","v":{"$error":"#VALUE!"}}]
["n",3,null,null,null,"n should be 2 or 3"]
[]
["Passive Cf",{"$f":"1000000/(LinfilterPssv*POWER(2*Pi*Fx_infilter,2))","v":{"$error":"#REF!"}},"uF",{"$f":"#REF!*0.000001","v":{"$error":"#REF!"}}]
["Cinj_AEF",{"$f":"1000000/(L_infilter*Gop_AEF*0.000001*POWER(2*Pi*Fx_infilter,2))","v":{"$error":"#VALUE!"}},"uF",{"$f":"'Design Regulator'!#REF!*0.000001","v":{"$error":"#REF!"}}]
[]
["Cdamp_AEF",{"$f":"CHOOSE(OSC,0,Cinj_AEF/nAEF)","v":{"$error":"#VALUE!"}},"uF",{"$f":"'Design Regulator'!#REF!*0.000001","v":{"$error":"#REF!"}}]
["Rdamp_AEF",{"$f":"CHOOSE(OSC,SQRT(L_infilter*Gop_AEF/(Cinj_AEF)),1.09*SQRT(L_infilter*Gop_AEF/Cinj_AEF))","v":{"$error":"#VALUE!"}},"Ω",{"$f":"'Design Regulator'!#REF!","v":{"$error":"#REF!"}}]
["Ccomp_AEF",{"$f":"CHOOSE(OSC,5,1)","v":{"$error":"#VALUE!"}},"nF",{"$f":"B299*0.000000001","v":{"$error":"#VALUE!"}},null,"AEF Comp network & sense is specifically defined at 2.2MHz at 440kHz"]
["Rcomp_AEF",{"$f":"CHOOSE(OSC,200,1000)","v":{"$error":"#VALUE!"}},"Ω"]
["Csen_AEF",{"$f":"Gop_AEF*B299","v":{"$error":"#VALUE!"}},"nF",{"$f":"B301*0.000000001","v":{"$error":"#VALUE!"}}]
[]
["Rd_AEF",{"$f":"SQRT(L_infilter*0.000001/Cin)","v":0},null,{"$f":"'Standard Value Calculator'!S14","v":{"$error":"#NUM!"}}]
[]
["Attenuation at Fsw",{"$f":"#REF!","v":{"$error":"#REF!"}},"dBuV"]
["Conducted EMC at Fsw",{"$f":"VinRipple_dBuV+B305","v":{"$error":"#REF!"}},"dBuV"]
[]
[]
["Step 8: Efficiency"]
["VAR",0]
["Design"]
["Ta",{"$f":"'Design Regulator'!E13","v":50},"°C","Ambient Temperature"]
["Components"]
["LTc",{"$f":"4000/1000000","v":4.0000000000000001E-3},"%/°C","Inductor DCR Temp Co"]
["θCA",20,"°C/W","Inductor Core to Ambient Thermal Resistance"]
["RCinEsr",{"$f":"RCinEsr","v":1E-3},"W","Input Capacitor ESR"]
[]
["Controller Characteristics"]
["BIAS",{"$f":"'Design Regulator'!G80","v":8},"V"]
["VCC",{"$f":"CHOOSE(VOUT_setting,8,5,5,8)","v":8},"V","with 170mA current limit"]
["Top Driver"]
["RdsonDRT",3,"W","Drain-Source Resistance of Pullup High-side FET Driver"]
["RdsonDRT2",1,"W","Drain-Source Resistance of Pulldown High-side FET Driver"]
["Bottom Driver"]
["RdsonDRB",3,"W","Drain-Source Resistance of Pullup Low-side FET Driver"]
["RdsonDRB2",1,"W","Drain-Source Resistance of Pulldown Low-side FET Driver"]
["Deadtime"]
["Deadtime",1.4E-8,"s","Total Deadtime",null,null,"14ns for LM513-Q1"]
["IQ"]
["IQ ",2.2000000000000001E-6,"A","Quiescent Current of LM5143-Q1 Controller (One channel disabled)"]
[]
["High- & low-side MOSFETs - Ch1","Q1: high-side",null,"Q2: low-side"]
["Rdson",{"$f":"CHOOSE(VOUT_setting,0.024,0.04,0.04,0.024)","v":2.4E-2},"W",{"$f":"CHOOSE(VOUT_setting,0.018,0.029,0.029,0.018)","v":1.7999999999999999E-2},"W","Drain-Source Resistances of Channel 1 FETs"]
["RdsonTopTc",{"$f":"7000/1000000","v":7.0000000000000001E-3},"%/°C",7.0000000000000001E-3,"%/°C","Drain-Source Resistance Temp Co"]
["Qg",{"$f":"'Design Regulator'!E89/1000000000","v":3E-9},"C",{"$f":"'Design Regulator'!F89/1000000000","v":4.0999999999999995E-9},"C","Gate Charge at VCC = 5V",null,"6.5nC --> HS Gate charge @ VCC = 8V\n8.5nC --> LS Gate charge @ VCC = 8V  "]
["Qgd",{"$f":"'Design Regulator'!E90/1000000000","v":6.9999999999999996E-10},"C",{"$f":"'Design Regulator'!F90/1000000000","v":1.0000000000000001E-9},"C","Gate to Drain Charge"]
["Qgs",{"$f":"'Design Regulator'!E91/1000000000","v":6.9999999999999996E-10},"C",{"$f":"'Design Regulator'!F91/1000000000","v":8.9999999999999999E-10},"C","Gate to Source Charge"]
["Qoss",{"$f":"0.00000000225","v":2.2499999999999999E-9},"C",{"$f":"'Design Regulator'!F92/1000000000","v":3E-9},"C","Output Charge"]
["Coss",{"$f":"'Design Regulator'!E97/1000000000000","v":2.5000000000000002E-10},"F",{"$f":"'Design Regulator'!F97/1000000000000","v":3.4999999999999998E-10},"F","Output Capacitance"]
["Rgate",{"$f":"'Design Regulator'!E99","v":3.5},"W",{"$f":"'Design Regulator'!F99","v":3},"W","Gate Resistance"]
["Gfs",{"$f":"'Design Regulator'!E100","v":71},"S",{"$f":"'Design Regulator'!F100","v":90},"S","Transconductance"]
["Vth",{"$f":"'Design Regulator'!E101","v":1.8},"V",{"$f":"'Design Regulator'!F101","v":1.8},"V","Threshold Voltage"]
["Vsp",{"$f":"Vth_Q1+(Iout/Number_of_Phases)/Gfs_Q1","v":1.8056338028169014},"V",{"$f":"Vth_Q2+(Iout/Number_of_Phases)/Gfs_Q2","v":1.8044444444444445},"V","Switch Point Voltage of FETs"]
[]
["Vsd - Buck",{"$f":"'Design Regulator'!E102","v":0.8},"V",{"$f":"'Design Regulator'!F102","v":0.8},"V","Diode Forward Voltage of MOSFET Body diode"]
["QrrTop",null,"C",{"$f":"0.00000003","v":2.9999999999999997E-8},"C","Reverse Recovery Charge of Body Diode"]
["TrrTop",4.0000000000000001E-8,"s",4.0000000000000001E-8,"s","Reverse Recovery Time of Body Diode"]
["θJA-MOSFET",{"$f":"'Design Regulator'!E104","v":15},"°C/W",{"$f":"'Design Regulator'!F104","v":15},"°C/W","Junction-to-Ambient Resistance"]
[]
[]
[]
["Anti-parallel Schottky Diode (optional)"]
["VfdSky",{"$f":"'Design Regulator'!F107","v":0},"V",{"$f":"'Design Regulator'!#REF!","v":{"$error":"#REF!"}},"V","Diode Forward Voltage"]
["QrrSky",{"$f":"'Design Regulator'!F108/1000000000","v":0},"C",{"$f":"'Design Regulator'!#REF!/1000000000","v":{"$error":"#REF!"}},"C","Diode Reverse Recovery Charge"]
["Ireverse",0,"A",0,"A","Reverse Leakage Current"]
[]
["Controller"]
["Outputs"]
["Top FET","Fixed",null,null,"Calculated"]
["Tr",{"$f":"CHOOSE(VOUT_setting, 0.000000003, 0.000000005,0.000000005,0.000000003)","v":3E-9},"s",null,{"$f":"(Qgd_Q1+Qgs_Q1/2)*(RdsonDRT+Rgate1)/(VCC-Vsp_Q1)","v":1.1018076398362889E-9},"s"]
["Tf",{"$f":"0.000000003","v":3E-9},"s",null,{"$f":"(Qgd_Q1+Qgs_Q1/2)*(RdsonDRT2+Rgate1)/(Vsp_Q1)","v":2.6168096723868952E-9},"s"]
[]
["IC Power Disipation","Value","Units"]
["Power Dis",{"$f":"'Efficiency Calculations'!AU109","v":0.53882249345873434},"W"]
["Temp rise",{"$f":"B364*ThetaJaCtrl","v":10.02209837833246},"°C"]
["Junction temperature",{"$f":"B365 + Ta","v":60.022098378332458},"°C"]
[]
["Current (switching)",{"$f":"(Qg_Q1+Qg_Q2)*Fsw+Iq","v":3.0764999999999994E-3},"A"]
["Qrr Current",{"$f":"Qrr_Q2*Fsw","v":1.2989999999999998E-2},"A"]
["Diode Current",{"$f":"C370/Vin","v":{"$error":"#NAME?"}},{"$f":"Deadtime*Fsw*(Ipp/2)*(Vsd_Q1+Vsd_Q2)","v":{"$error":"#NAME?"}}]
["Total Application Switching IQ",{"$f":"SUM(B368:B370)","v":{"$error":"#NAME?"}},"A"]
[]
["Low-side MOSFET/Diode"]
["Part Power"]
["Power Dis"]
[]
["SCHEMATIC LABELS"]
[{"$f":"\"RC1 = \"&'Design Regulator'!D72&\"kΩ\"","v":"RC1 = 33,2kΩ"},{"$f":"'Design Regulator'!D72&\"kΩ\"","v":"33,2kΩ"},null,{"$f":"'Design Regulator'!D75&\"kΩ\"","v":"kΩ"}]
[{"$f":"\"RC2 = \"&'Design Regulator'!D75&\"kΩ\"","v":"RC2 = kΩ"},{"$f":"'Design Regulator'!D75&\"kΩ\"","v":"kΩ"}]
[]
[{"$f":"\"Lo = \"&'Design Regulator'!E28&\"µH\"","v":"Lo = 47µH"},{"$f":"'Design Regulator'!E28&\"µH\"","v":"47µH"},null,{"$f":"IF(MODE = 1, 'Design Regulator'!I28&\"µH\", 'Design Regulator'!E28&\"µH\")","v":"µH"}]
[{"$f":"\"Rdcr = \"&Rdcr*1000&\"mΩ\"","v":"Rdcr = 100mΩ"},{"$f":"Rdcr*1000&\"mΩ\"","v":"100mΩ"},null,{"$f":"IF(MODE=1, Rdcr2*1000&\"mΩ\", Rdcr*1000&\"mΩ\")","v":"0mΩ"}]
[{"$f":"\"Rs = \"&'Design Regulator'!E19&\"mΩ\"","v":"Rs = 39mΩ"},{"$f":"'Design Regulator'!E19&\"mΩ\"","v":"39mΩ"},null,{"$f":"IF(MODE = 1, 'Design Regulator'!I19&\"mΩ\", 'Design Regulator'!E19&\"mΩ\")","v":"mΩ"}]
[]
["IC",{"$f":"CHOOSE(GPN_setting,\"LM70880/-Q1\",\"LM70860/-Q1\",\"LM70840/-Q1\",\"LM706A0/-Q1\",\"LM70660\",\"LM704A0-Q1\")","v":"LM70880/-Q1"},null,null,null,{"$f":"GPN_setting","v":1}]
[]
[{"$f":"IF((INFILTER_TYPE=1),\"AEF IS DISABLED!\",\"AEF\")","v":"AEF"},{"$f":"IF((INFILTER_TYPE=1),\"\",\"0.1µF\")","v":"0.1µF"},{"$f":"IF((INFILTER_TYPE=1),\"\",\"0.47Ω\")","v":"0.47Ω"},{"$f":"IF((INFILTER_TYPE=1),\"\",\"3Ω\")","v":"3Ω"},{"$f":"IF((INFILTER_TYPE=1),\"\",\"50kΩ\")","v":"50kΩ"}]
[{"$f":"\"LAEF =\"&L_infilter&\" uF\"","v":"LAEF =0 uF"},{"$f":"IF((INFILTER_TYPE=1),\"\",L_infilter&\"µH\")","v":"0µH"}]
[{"$f":"\"Cinj =\"&CinjSel*1000000&\" uF\"","v":{"$error":"#REF!"}},{"$f":"IF((INFILTER_TYPE=1),\"\",CinjSel*1000000&\"µF\")","v":{"$error":"#REF!"}}]
[{"$f":"\"Cdamp =\"&CdampSel*1000000&\" uF\"","v":{"$error":"#REF!"}},{"$f":"IF((INFILTER_TYPE=1),\"\",IF(OSC=1,\"DNP\",CdampSel*1000000&\"µF\"))","v":{"$error":"#REF!"}}]
[{"$f":"\"Rdamp =\"&RdampSel&\"Ω\"","v":{"$error":"#REF!"}},{"$f":"IF((INFILTER_TYPE=1),\"\",RdampSel&\"Ω\")","v":{"$error":"#REF!"}}]
[{"$f":"\"Rcomp =\"&Rcomp_AEF&\"Ω\"","v":{"$error":"#VALUE!"}},{"$f":"IF((INFILTER_TYPE=1),\"\",Rcomp_AEF&\"Ω\")","v":{"$error":"#VALUE!"}}]
[{"$f":"\"Ccomp =\"&Ccomp_AEF*1000000000000&\"pF\"","v":{"$error":"#VALUE!"}},{"$f":"IF((INFILTER_TYPE=1),\"\",Ccomp_AEF*1000000000000&\"pF\")","v":{"$error":"#VALUE!"}}]
[{"$f":"\"Csen =\"&Csen_AEF*1000000&\"µF\"","v":{"$error":"#VALUE!"}},{"$f":"IF((INFILTER_TYPE=1),\"\",Csen_AEF*1000000&\"µF\")","v":{"$error":"#VALUE!"}}]
[null,"CDAMP"]
[]
[{"$f":"\"VOUT = \"&'Design Regulator'!E9&\"V\"","v":"VOUT = 20V"},{"$f":"'Design Regulator'!E9&\"V\"","v":"20V"},null,{"$f":"IF(MODE=1, 'Design Regulator'!I10&\"V\", \"\")","v":"V"}]
[]
[{"$f":"\"COUT = \"&'Design Regulator'!$E$37&\"µF\"","v":"COUT = 50µF"},{"$f":"ROUND('Design Regulator'!$E$37/Number_of_Phases, 0)&\"µF\"","v":"50µF"},null,{"$f":"IF(MODE=1, 'Design Regulator'!$I$37&\"µF\", ROUND('Design Regulator'!$E$37/Number_of_Phases, 0)&\"µF\")","v":"µF"}]
["Capacitance per component (Cout)",{"$f":"\"22µF\"","v":"22µF"}]
["# of output caps",{"$f":"ROUNDUP(Cout*1000000/22,0)&\" x\"","v":"3 x"}]
[]
["CIN",{"$f":"Cin*1000000&\"µF\"","v":"50µF"}]
["Capacitance per component (Cin)",{"$f":"\"10µF\"","v":"10µF"}]
["# of input caps",{"$f":"ROUNDUP(Cin*1000000/10,0)&\" x\"","v":"5 x"}]
["Cd",{"$f":"CHOOSE(INFILTER_TYPE,\"\",4*Cin*1000000&\"µF\")","v":{"$error":"#VALUE!"}}]
["Rd",{"$f":"CHOOSE(INFILTER_TYPE,\"\",D303&\"Ω\")","v":{"$error":"#VALUE!"}}]
[]
[{"$f":"\"RC1 = \"&Rcea1_u/1000&\"kΩ\"","v":"RC1 = 33,2kΩ"},{"$f":"IF(COMP_TYPE=1,\"100kΩ\",ROUND(Rcea1_u/1000,2)&\"kΩ\")","v":"33,2kΩ"}]
[{"$f":"\"CC1 = \"&Cc1ea_u*10^9&\"nF\"","v":"CC1 = 4,7nF"},{"$f":"IF(COMP_TYPE=1,\"\",Cc1ea_u*10^9&\"nF\")","v":"4,7nF"}]
[{"$f":"\"CC2 = \"&IF(Cc2ea_u>0, Cc2ea_u*10^12&\"pF\", \"OPEN\")","v":"CC2 = OPEN"},{"$f":"IF(COMP_TYPE=1,\"\",IF(Cc2ea_u>0, ROUND(Cc2ea_u*10^12,1)&\"pF\", \"N/A\"))","v":"N/A"}]
[]
[{"$f":"\"gm = \"&$B$202*1000&\"mS\"","v":"gm = 1.2mS"},{"$f":"$B$202*1000&\"mS\"","v":"1.2mS"}]
[{"$f":"\"RoEA = \"&RoEA/1000000&\"MΩ\"","v":"RoEA = 64MΩ"},{"$f":"RoEA/1000000&\"MΩ\"","v":"64MΩ"}]
[{"$f":"\"GBW = \"&GBW&\"MHz\"","v":"GBW = 6MHz"},{"$f":"GBW&\"MHz\"","v":"6MHz"}]
[]
[{"$f":"\"Cslope = \"&Cslope&\"pF\"","v":{"$error":"#NAME?"}},{"$f":"ROUND(Cslope*1,0)&\"pF\"","v":{"$error":"#NAME?"}}]
["Cd",{"$f":"IF(DITHER=1, ROUND(Cdither*1000000000,1)&\"nF\", \"\")","v":""},{"$f":"IF(DITHER=1, \"Cd\", \"\")","v":""}]
[{"$f":"\"RFB1 = \"&'Design Regulator'!E67&\"kΩ\"","v":"RFB1 = 274kΩ"},{"$f":"IF(VOUT_setting=1, 'Design Regulator'!E67&\"kΩ\", \"\")","v":"274kΩ"},null,{"$f":"'Design Regulator'!I67&\"kΩ\"","v":"kΩ"}]
[{"$f":"\"RFB2 = \"&IF(Vout=Vref,\"OPEN\",'Design Regulator'!E68&\"kΩ\")","v":"RFB2 = 11,5kΩ"},{"$f":"IF(VOUT_setting=1, IF(Vout=Vref,\"OPEN\",Rfb2_u/1000&\"kΩ\"), \"\")","v":"11,5kΩ"},null,{"$f":"IF(Vout2=Vref,\"OPEN\",Rfb4_u/1000&\"kΩ\")","v":"0kΩ"}]
[{"$f":"\"RFBSET = \"&CHOOSE(VOUT_setting,\"\",\"24.9kΩ\",\"0Ω\",\"49.9kΩ\")","v":"RFBSET = "},null,null,{"$f":"CHOOSE(VOUT_setting,\"\",\"24.9kΩ\",\"0Ω\",\"49.9kΩ\")","v":""}]
["Rboot resistor",null,null,{"$f":"IF(OR(VOUT_setting=1,VOUT_setting=4),\"1Ω\",\"0Ω\")","v":"1Ω"}]
[null,null,null,{"$f":"CHOOSE(Ext_VCC,\"1µF\",\"1µF\",\"\")","v":"1µF"}]
["RENT",{"$f":"IF((UVLO_TYPE=1),B190&\"kΩ\",\"\")","v":"237kΩ"}]
["RENB",{"$f":"IF((UVLO_TYPE=1),B191&\"kΩ\",\"\")","v":"19.6kΩ"}]
[]
[{"$f":"\"Crossover Frequency = \"&ROUND('Stability Calculations'!U4,1)&\"kHz\"","v":"Crossover Frequency = 13kHz"},{"$f":" ROUND('Stability Calculations'!U4,1)&\"kHz\"","v":"13kHz"},null,{"$f":"'Stability Calculations'!U4","v":12.95725}]
[{"$f":"\"Phase Margin = \"&ROUND('Stability Calculations'!U5,0)&\"°\"","v":"Phase Margin = 76°"},{"$f":"ROUND('Stability Calculations'!U5,0)&\"°\"","v":"76°"}]
[{"$f":"IF(loopPM<45,CHOOSE(COMP_TYPE,\"Phase Margin too low, Increase COUT\",\"Phase Margin too low, Re-compensate\"),\"\")","v":""}]
[{"$f":"\"Gain Margin = \"&ROUND('Stability Calculations'!U7*-1,1)&\"dB\"","v":"Gain Margin = 23,3dB"},{"$f":"ROUND('Stability Calculations'!U7*-1,1)&\"dB\"","v":"23,3dB"}]
["Full-load/high line efficiency",{"$f":"IF(PLOT_TYPE=1, ROUND('Efficiency Calculations'!BA109,1)&\"%\", ROUND(#REF!,1)&\"%\")","v":"92,1%"}]
["Half-load/mid-line efficiency",{"$f":"IF(PLOT_TYPE=1, ROUND('Efficiency Calculations'!BA59,1)&\"%\", ROUND(#REF!,1)&\"%\")","v":"90,2%"}]
["OSC pin setting",{"$f":"IF(VOUT_setting=1, \"\", IF(OSC=1, \"Tie OSC to VDDA\", \"Tie OSC to AGND\"))","v":""}]
[]
[{"$f":"\"CDITH = \"&Cdither*1000000000&\"nF\"","v":"CDITH = 2.7nF"},{"$f":"Cdither*1000000000&\"nF\"","v":"2.7nF"}]
[{"$f":"\"Rs = \"&Rs&\"Ω\"","v":"Rs = 0,039Ω"},{"$f":"'Standard Value Calculator'!S6&\"Ω\"","v":"Ω"}]
["Rset",{"$f":"'Standard Value Calculator'!S16&\"mΩ\"","v":"40,2mΩ"}]
["Rs",{"$f":"'Standard Value Calculator'!S6&\"mΩ\"","v":"mΩ"}]
[{"$f":"\"Rshunt = \"&ROUND(Rshunt,1)&\"mΩ\"","v":{"$error":"#NAME?"}},{"$f":"IF(Rshunt=\"0\", \"N/A\",ROUND(Rshunt,1)&\"mΩ\")","v":{"$error":"#NAME?"}}]
[]
["Rpgood","20kΩ"]
["RFB1"]
["RFB2"]
["VCCX",{"$f":"IF((Ext_VCC=1),\"5V\",\"GND\")","v":"GND"}]
["RCNFG",{"$f":" 'Design Regulator'!E59&\"kΩ\"","v":"29.4kΩ"}]
["Rt",{"$f":" Rfadj&\"kΩ\"","v":"49.9kΩ"},{"$f":"Rfadj","v":49.9},{"$f":"Fsw","v":433000},null,{"$f":"OR((Fsw=440000),(Fsw=2200000))","v":false},null,{"$f":"OR(OR(AND(OSC=1, OR(Fsw/1000>2530, Fsw/1000<1800)), AND(OSC=2, OR(Fsw/1000>500, Fsw/1000<300))), OR((Fsw=440000),(Fsw=2200000)))","v":false}]
["Css",{"$f":"'Standard Value Calculator'!B4*1000000000&\"nF\"","v":"0nF"},{"$f":"IF(MODE=1,\"Css\",\"\")","v":"Css"}]
["Cres",{"$f":"IF(Cres_u = 0, \"N/A\", Cres_u*1000000000 &\"nF\")","v":"180nF"},{"$f":"IF(Cres_u = 0, \"N/A\", Cres_u*1000000 &\"µF\")","v":"0.18µF"},{"$f":"Cres_u","v":1.8E-7}]
[]
["Blank out",{"$f":"IF(B76=\"y\",\"\",\"|\")","v":"|"}]
["OUTPUT CURRENT",{"$f":"'Design Regulator'!$E$10&\"A\"","v":"0.4A"},null,{"$f":"IF(MODE=1,'Design Regulator'!#REF!&\"A\",\"\")","v":{"$error":"#REF!"}}]
["VIN",{"$f":"VIN_nom&\"V\"","v":"33V"}]
["VIN range",{"$f":"VIN_min&\"V\"&\"...\"&VIN_max&\"V\"","v":"33V...51V"}]
[null,{"$f":"IF(INFILTER_TYPE=1,B453,\"\")","v":""},{"$f":"IF(INFILTER_TYPE=1,\"\",B453)","v":"33V...51V"}]
["PFM/FPWM",{"$f":"IF((DEMB=1),\"GND\",\"VDDA\")","v":"GND"}]

{"sheet":"Schematic Management","index":8,"n_rows":17,"n_cols":14,"rows_kept":17,"cut":false,"hidden":true,"merged":[]}
[null,null,null,null,null,null,null,null,null,null,null,null,null,"3.3V or 5V fixed (FB1/2)"]
[{"$f":"IF(MODE=1, CHOOSE(SCH_SETTING, \"SCH_SetVout_IntComp_nEN\",\"SCH_SetVout_IntComp_EN\",\"SCH_SetVout_ExtComp_nEN\",\"SCH_SetVout_ExtComp_EN\",\"SCH_AdjVout_IntComp_nEN\",\"SCH_AdjVout_IntComp_EN\",\"SCH_AdjVout_ExtComp_nEN\",\"SCH_AdjVout_ExtComp_EN\",  \"SCH_SetVout_IntComp_nEN_BIAS_GND\",\"SCH_SetVout_IntComp_EN_BIAS_GND\",\"SCH_SetVout_ExtComp_nEN_BIAS_GND\",\"SCH_SetVout_ExtComp_EN_BIAS_GND\",\"SCH_AdjVout_IntComp_nEN_BIAS_GND\",\"SCH_AdjVout_IntComp_EN_BIAS_GND\",\"SCH_AdjVout_ExtComp_nEN_BIAS_GND\",\"SCH_AdjVout_ExtComp_EN_BIAS_GND\", \"\"))","v":"SCH_AdjVout_ExtComp_EN"},null,null,null,null,null,null,null,null,"With/without dither (DITH)",null,null,null,"With/without VOUT connected to VCCX"]
[null,null,null,null,null,null,null,null,null,"FPWM or DEM (DEMB)"]
[null,null,null,null,null,null,null,null,null,"Shunt or inductor DCR current sensing"]
[]
[]
[]
[]
[]
[]
[]
[]
[]
[]
[]
[]
[null," "]

{"sheet":"Efficiency Plot Management","index":9,"n_rows":2,"n_cols":1,"rows_kept":2,"cut":false,"hidden":true,"merged":[]}
[]
[{"$f":"IF(PLOT_TYPE=1, \"EFF_Ch1\", \"EFF_Ch2\")","v":"EFF_Ch1"}]

{"sheet":"Standard Value Calculator","index":10,"n_rows":159,"n_cols":20,"rows_kept":159,"cut":false,"hidden":true,"merged":[]}
[]
["Capacitors","Css","Cc1ea","Cc2ea","Cout","Cin","Cres","Cdither","Cc3ea","Cc4ea","Cin_Passive","Cdamp_Pssv","Cinj_AEF","Cdamp_AEF"]
["Inputs",{"$f":"Css","v":0},{"$f":"Cc1ea","v":6.2351497768547956E-9},{"$f":"Cc2ea","v":-3.0312206323272669E-12},{"$f":"Cout","v":5.0000000000000002E-5},{"$f":"Cin","v":5.0000000000000002E-5},{"$f":"Cres","v":1.9500000000000004E-7},{"$f":"Cdither_init","v":2.8344671201814057E-9},{"$f":"Cc3ea","v":0},{"$f":"Cc4ea","v":0},{"$f":"'Variable Management'!B294*0.000001","v":{"$error":"#REF!"}},{"$f":"K3*4","v":{"$error":"#REF!"}},{"$f":"Cinj_AEF*0.000001","v":{"$error":"#VALUE!"}},{"$f":"'Variable Management'!B297*0.000001","v":{"$error":"#VALUE!"}},null,null,"Resistors","inputs","Standard Result"]
["Standard Result",{"$f":"SUM(B6:B158)/1000000000000","v":0},{"$f":"IF(C3=\"OPEN\",\"OPEN\",SUM(C6:C158)/1000000000000)","v":6.7999999999999997E-9},{"$f":"SUM(D6:D158)/1000000000000","v":0},{"$f":"SUM(E6:E158)/1000000000000","v":4.6999999999999997E-5},{"$f":"SUM(F6:F158)/1000000000000","v":4.6999999999999997E-5},{"$f":"SUM(G6:G158)/1000000000000","v":1.8E-7},{"$f":"IF(H3=\"OPEN\",\"OPEN\",SUM(H6:H158)/1000000000000)","v":2.7000000000000002E-9},0,0,{"$error":"#REF!"},{"$error":"#REF!"},{"$error":"#VALUE!"},{"$error":"#VALUE!"},null,null,"Rt",{"$f":"Rfadj","v":49.9},{"$f":"IF(R4>(INT(0.5+100*POWER(10,IF(96*(LOG(R4)-INT(LOG(R4)))-ROUND(96*(LOG(R4)-INT(LOG(R4))),0)<0,ROUND(96*(LOG(R4)-INT(LOG(R4))),0)-1,ROUND(96*(LOG(R4)-INT(LOG(R4))),0))/96))*POWER(10,INT(LOG(R4))-2)+INT(0.5+100*POWER(10,(IF(96*(LOG(R4)-INT(LOG(R4)))-ROUND(96*(LOG(R4)-INT(LOG(R4))),0)<0,ROUND(96*(LOG(R4)-INT(LOG(R4))),0)-1,ROUND(96*(LOG(R4)-INT(LOG(R4))),0))+1)/96))*POWER(10,INT(LOG(R4))-2))/2,INT(0.5+100*POWER(10,(IF(96*(LOG(R4)-INT(LOG(R4)))-ROUND(96*(LOG(R4)-INT(LOG(R4))),0)<0,ROUND(96*(LOG(R4)-INT(LOG(R4))),0)-1,ROUND(96*(LOG(R4)-INT(LOG(R4))),0))+1)/96))*POWER(10,INT(LOG(R4))-2),INT(0.5+100*POWER(10,IF(96*(LOG(R4)-INT(LOG(R4)))-ROUND(96*(LOG(R4)-INT(LOG(R4))),0)<0,ROUND(96*(LOG(R4)-INT(LOG(R4))),0)-1,ROUND(96*(LOG(R4)-INT(LOG(R4))),0))/96))*POWER(10,INT(LOG(R4))-2))","v":49.900000000000006},"Ω"]
["(pF)"]
[0.47,{"$f":"IF(IF((B$3*10^12-$A7)*(B$3*10^12-$A6)*-1<0,0,1)*IF(ABS(B$3*10^12-$A7)>(B$3*10^12-$A6),$A6,$A7)=B7,0,IF((B$3*10^12-$A7)*(B$3*10^12-$A6)*-1<0,0,1)*IF(ABS(B$3*10^12-$A7)>(B$3*10^12-$A6),$A6,$A7))","v":0},0,0,0,0,0,0,0,0,{"$error":"#REF!"},{"$error":"#REF!"},{"$error":"#VALUE!"},{"$error":"#VALUE!"}]
[0.56000000000000005,{"$f":"IF(IF((B$3*10^12-$A8)*(B$3*10^12-$A7)*-1<0,0,1)*IF(ABS(B$3*10^12-$A8)>(B$3*10^12-$A7),$A7,$A8)=B8,0,IF((B$3*10^12-$A8)*(B$3*10^12-$A7)*-1<0,0,1)*IF(ABS(B$3*10^12-$A8)>(B$3*10^12-$A7),$A7,$A8))","v":0},{"$f":"IF(IF((C$3*10^12-$A8)*(C$3*10^12-$A7)*-1<0,0,1)*IF(ABS(C$3*10^12-$A8)>(C$3*10^12-$A7),$A7,$A8)=C8,0,IF((C$3*10^12-$A8)*(C$3*10^12-$A7)*-1<0,0,1)*IF(ABS(C$3*10^12-$A8)>(C$3*10^12-$A7),$A7,$A8))","v":0},{"$f":"IF(IF((D$3*10^12-$A8)*(D$3*10^12-$A7)*-1<0,0,1)*IF(ABS(D$3*10^12-$A8)>(D$3*10^12-$A7),$A7,$A8)=D8,0,IF((D$3*10^12-$A8)*(D$3*10^12-$A7)*-1<0,0,1)*IF(ABS(D$3*10^12-$A8)>(D$3*10^12-$A7),$A7,$A8))","v":0},{"$f":"IF(IF((E$3*10^12-$A8)*(E$3*10^12-$A7)*-1<0,0,1)*IF(ABS(E$3*10^12-$A8)>(E$3*10^12-$A7),$A7,$A8)=E8,0,IF((E$3*10^12-$A8)*(E$3*10^12-$A7)*-1<0,0,1)*IF(ABS(E$3*10^12-$A8)>(E$3*10^12-$A7),$A7,$A8))","v":0},{"$f":"IF(IF((F$3*10^12-$A8)*(F$3*10^12-$A7)*-1<0,0,1)*IF(ABS(F$3*10^12-$A8)>(F$3*10^12-$A7),$A7,$A8)=F8,0,IF((F$3*10^12-$A8)*(F$3*10^12-$A7)*-1<0,0,1)*IF(ABS(F$3*10^12-$A8)>(F$3*10^12-$A7),$A7,$A8))","v":0},{"$f":"IF(IF((G$3*10^12-$A8)*(G$3*10^12-$A7)*-1<0,0,1)*IF(ABS(G$3*10^12-$A8)>(G$3*10^12-$A7),$A7,$A8)=G8,0,IF((G$3*10^12-$A8)*(G$3*10^12-$A7)*-1<0,0,1)*IF(ABS(G$3*10^12-$A8)>(G$3*10^12-$A7),$A7,$A8))","v":0},0,0,0,{"$f":"IF(IF((K$3*10^12-$A8)*(K$3*10^12-$A7)*-1<0,0,1)*IF(ABS(K$3*10^12-$A8)>(K$3*10^12-$A7),$A7,$A8)=K8,0,IF((K$3*10^12-$A8)*(K$3*10^12-$A7)*-1<0,0,1)*IF(ABS(K$3*10^12-$A8)>(K$3*10^12-$A7),$A7,$A8))","v":{"$error":"#REF!"}},{"$error":"#REF!"},{"$error":"#VALUE!"},{"$error":"#VALUE!"},null,null,"Rc1ea",{"$f":"Rcea1","v":25525.440281250005},{"$f":"IF(R7>(INT(0.5+100*POWER(10,IF(96*(LOG(R7)-INT(LOG(R7)))-ROUND(96*(LOG(R7)-INT(LOG(R7))),0)<0,ROUND(96*(LOG(R7)-INT(LOG(R7))),0)-1,ROUND(96*(LOG(R7)-INT(LOG(R7))),0))/96))*POWER(10,INT(LOG(R7))-2)+INT(0.5+100*POWER(10,(IF(96*(LOG(R7)-INT(LOG(R7)))-ROUND(96*(LOG(R7)-INT(LOG(R7))),0)<0,ROUND(96*(LOG(R7)-INT(LOG(R7))),0)-1,ROUND(96*(LOG(R7)-INT(LOG(R7))),0))+1)/96))*POWER(10,INT(LOG(R7))-2))/2,INT(0.5+100*POWER(10,(IF(96*(LOG(R7)-INT(LOG(R7)))-ROUND(96*(LOG(R7)-INT(LOG(R7))),0)<0,ROUND(96*(LOG(R7)-INT(LOG(R7))),0)-1,ROUND(96*(LOG(R7)-INT(LOG(R7))),0))+1)/96))*POWER(10,INT(LOG(R7))-2),INT(0.5+100*POWER(10,IF(96*(LOG(R7)-INT(LOG(R7)))-ROUND(96*(LOG(R7)-INT(LOG(R7))),0)<0,ROUND(96*(LOG(R7)-INT(LOG(R7))),0)-1,ROUND(96*(LOG(R7)-INT(LOG(R7))),0))/96))*POWER(10,INT(LOG(R7))-2))","v":25500},"Ω"]
[0.68,0,0,0,0,0,0,0,0,0,{"$error":"#REF!"},{"$error":"#REF!"},{"$error":"#VALUE!"},{"$error":"#VALUE!"},null,null,"Rc1ea",{"$f":"Rcea2","v":0},{"$f":"IF(R8>(INT(0.5+100*POWER(10,IF(96*(LOG(R8)-INT(LOG(R8)))-ROUND(96*(LOG(R8)-INT(LOG(R8))),0)<0,ROUND(96*(LOG(R8)-INT(LOG(R8))),0)-1,ROUND(96*(LOG(R8)-INT(LOG(R8))),0))/96))*POWER(10,INT(LOG(R8))-2)+INT(0.5+100*POWER(10,(IF(96*(LOG(R8)-INT(LOG(R8)))-ROUND(96*(LOG(R8)-INT(LOG(R8))),0)<0,ROUND(96*(LOG(R8)-INT(LOG(R8))),0)-1,ROUND(96*(LOG(R8)-INT(LOG(R8))),0))+1)/96))*POWER(10,INT(LOG(R8))-2))/2,INT(0.5+100*POWER(10,(IF(96*(LOG(R8)-INT(LOG(R8)))-ROUND(96*(LOG(R8)-INT(LOG(R8))),0)<0,ROUND(96*(LOG(R8)-INT(LOG(R8))),0)-1,ROUND(96*(LOG(R8)-INT(LOG(R8))),0))+1)/96))*POWER(10,INT(LOG(R8))-2),INT(0.5+100*POWER(10,IF(96*(LOG(R8)-INT(LOG(R8)))-ROUND(96*(LOG(R8)-INT(LOG(R8))),0)<0,ROUND(96*(LOG(R8)-INT(LOG(R8))),0)-1,ROUND(96*(LOG(R8)-INT(LOG(R8))),0))/96))*POWER(10,INT(LOG(R8))-2))","v":{"$error":"#NUM!"}},"Ω"]
[0.82,0,0,0,0,0,0,0,0,0,{"$error":"#REF!"},{"$error":"#REF!"},{"$error":"#VALUE!"},{"$error":"#VALUE!"}]
[1,0,0,0,0,0,0,0,0,0,{"$error":"#REF!"},{"$error":"#REF!"},{"$error":"#VALUE!"},{"$error":"#VALUE!"},null,null,"Rfb1",{"$f":"Rfb1_","v":274000},{"$f":"IF(R10>(INT(0.5+100*POWER(10,IF(96*(LOG(R10)-INT(LOG(R10)))-ROUND(96*(LOG(R10)-INT(LOG(R10))),0)<0,ROUND(96*(LOG(R10)-INT(LOG(R10))),0)-1,ROUND(96*(LOG(R10)-INT(LOG(R10))),0))/96))*POWER(10,INT(LOG(R10))-2)+INT(0.5+100*POWER(10,(IF(96*(LOG(R10)-INT(LOG(R10)))-ROUND(96*(LOG(R10)-INT(LOG(R10))),0)<0,ROUND(96*(LOG(R10)-INT(LOG(R10))),0)-1,ROUND(96*(LOG(R10)-INT(LOG(R10))),0))+1)/96))*POWER(10,INT(LOG(R10))-2))/2,INT(0.5+100*POWER(10,(IF(96*(LOG(R10)-INT(LOG(R10)))-ROUND(96*(LOG(R10)-INT(LOG(R10))),0)<0,ROUND(96*(LOG(R10)-INT(LOG(R10))),0)-1,ROUND(96*(LOG(R10)-INT(LOG(R10))),0))+1)/96))*POWER(10,INT(LOG(R10))-2),INT(0.5+100*POWER(10,IF(96*(LOG(R10)-INT(LOG(R10)))-ROUND(96*(LOG(R10)-INT(LOG(R10))),0)<0,ROUND(96*(LOG(R10)-INT(LOG(R10))),0)-1,ROUND(96*(LOG(R10)-INT(LOG(R10))),0))/96))*POWER(10,INT(LOG(R10))-2))","v":274000},"Ω"]
[1.2,0,0,0,0,0,0,0,0,0,{"$error":"#REF!"},{"$error":"#REF!"},{"$f":"IF(IF((M$3*10^12-$A12)*(M$3*10^12-$A11)*-1<0,0,1)*IF(ABS(M$3*10^12-$A12)>(M$3*10^12-$A11),$A11,$A12)=M12,0,IF((M$3*10^12-$A12)*(M$3*10^12-$A11)*-1<0,0,1)*IF(ABS(M$3*10^12-$A12)>(M$3*10^12-$A11),$A11,$A12))","v":{"$error":"#VALUE!"}},{"$error":"#VALUE!"},null,null,"Rfb2",{"$f":"Rfb2_","v":11416.666666666668},{"$f":"IF(R11=\"OPEN\",\"OPEN\",IF(R11>(INT(0.5+100*POWER(10,IF(96*(LOG(R11)-INT(LOG(R11)))-ROUND(96*(LOG(R11)-INT(LOG(R11))),0)<0,ROUND(96*(LOG(R11)-INT(LOG(R11))),0)-1,ROUND(96*(LOG(R11)-INT(LOG(R11))),0))/96))*POWER(10,INT(LOG(R11))-2)+INT(0.5+100*POWER(10,(IF(96*(LOG(R11)-INT(LOG(R11)))-ROUND(96*(LOG(R11)-INT(LOG(R11))),0)<0,ROUND(96*(LOG(R11)-INT(LOG(R11))),0)-1,ROUND(96*(LOG(R11)-INT(LOG(R11))),0))+1)/96))*POWER(10,INT(LOG(R11))-2))/2,INT(0.5+100*POWER(10,(IF(96*(LOG(R11)-INT(LOG(R11)))-ROUND(96*(LOG(R11)-INT(LOG(R11))),0)<0,ROUND(96*(LOG(R11)-INT(LOG(R11))),0)-1,ROUND(96*(LOG(R11)-INT(LOG(R11))),0))+1)/96))*POWER(10,INT(LOG(R11))-2),INT(0.5+100*POWER(10,IF(96*(LOG(R11)-INT(LOG(R11)))-ROUND(96*(LOG(R11)-INT(LOG(R11))),0)<0,ROUND(96*(LOG(R11)-INT(LOG(R11))),0)-1,ROUND(96*(LOG(R11)-INT(LOG(R11))),0))/96))*POWER(10,INT(LOG(R11))-2)))","v":11500},"Ω"]
[1.5,0,0,0,0,0,0,0,0,0,{"$error":"#REF!"},{"$error":"#REF!"},{"$error":"#VALUE!"},{"$error":"#VALUE!"},null,null,"Rt1",{"$f":"'Variable Management'!B27*1000","v":50243.751603797798},{"$f":"IF(R12>(INT(0.5+100*POWER(10,IF(96*(LOG(R12)-INT(LOG(R12)))-ROUND(96*(LOG(R12)-INT(LOG(R12))),0)<0,ROUND(96*(LOG(R12)-INT(LOG(R12))),0)-1,ROUND(96*(LOG(R12)-INT(LOG(R12))),0))/96))*POWER(10,INT(LOG(R12))-2)+INT(0.5+100*POWER(10,(IF(96*(LOG(R12)-INT(LOG(R12)))-ROUND(96*(LOG(R12)-INT(LOG(R12))),0)<0,ROUND(96*(LOG(R12)-INT(LOG(R12))),0)-1,ROUND(96*(LOG(R12)-INT(LOG(R12))),0))+1)/96))*POWER(10,INT(LOG(R12))-2))/2,INT(0.5+100*POWER(10,(IF(96*(LOG(R12)-INT(LOG(R12)))-ROUND(96*(LOG(R12)-INT(LOG(R12))),0)<0,ROUND(96*(LOG(R12)-INT(LOG(R12))),0)-1,ROUND(96*(LOG(R12)-INT(LOG(R12))),0))+1)/96))*POWER(10,INT(LOG(R12))-2),INT(0.5+100*POWER(10,IF(96*(LOG(R12)-INT(LOG(R12)))-ROUND(96*(LOG(R12)-INT(LOG(R12))),0)<0,ROUND(96*(LOG(R12)-INT(LOG(R12))),0)-1,ROUND(96*(LOG(R12)-INT(LOG(R12))),0))/96))*POWER(10,INT(LOG(R12))-2))","v":49900},"Ω"]
[1.8,0,0,0,0,0,0,0,0,0,{"$error":"#REF!"},{"$error":"#REF!"},{"$error":"#VALUE!"},{"$error":"#VALUE!"},null,null,"Rd",{"$f":"'Variable Management'!B28*1000","v":0},{"$f":"IF(R13=\"OPEN\",\"OPEN\",IF(R13>(INT(0.5+100*POWER(10,IF(96*(LOG(R13)-INT(LOG(R13)))-ROUND(96*(LOG(R13)-INT(LOG(R13))),0)<0,ROUND(96*(LOG(R13)-INT(LOG(R13))),0)-1,ROUND(96*(LOG(R13)-INT(LOG(R13))),0))/96))*POWER(10,INT(LOG(R13))-2)+INT(0.5+100*POWER(10,(IF(96*(LOG(R13)-INT(LOG(R13)))-ROUND(96*(LOG(R13)-INT(LOG(R13))),0)<0,ROUND(96*(LOG(R13)-INT(LOG(R13))),0)-1,ROUND(96*(LOG(R13)-INT(LOG(R13))),0))+1)/96))*POWER(10,INT(LOG(R13))-2))/2,INT(0.5+100*POWER(10,(IF(96*(LOG(R13)-INT(LOG(R13)))-ROUND(96*(LOG(R13)-INT(LOG(R13))),0)<0,ROUND(96*(LOG(R13)-INT(LOG(R13))),0)-1,ROUND(96*(LOG(R13)-INT(LOG(R13))),0))+1)/96))*POWER(10,INT(LOG(R13))-2),INT(0.5+100*POWER(10,IF(96*(LOG(R13)-INT(LOG(R13)))-ROUND(96*(LOG(R13)-INT(LOG(R13))),0)<0,ROUND(96*(LOG(R13)-INT(LOG(R13))),0)-1,ROUND(96*(LOG(R13)-INT(LOG(R13))),0))/96))*POWER(10,INT(LOG(R13))-2)))","v":{"$error":"#NUM!"}},"Ω"]
[2.2000000000000002,{"$f":"IF(IF((B$3*10^12-$A15)*(B$3*10^12-$A14)*-1<0,0,1)*IF(ABS(B$3*10^12-$A15)>(B$3*10^12-$A14),$A14,$A15)=B15,0,IF((B$3*10^12-$A15)*(B$3*10^12-$A14)*-1<0,0,1)*IF(ABS(B$3*10^12-$A15)>(B$3*10^12-$A14),$A14,$A15))","v":0},0,0,0,0,0,0,0,0,{"$error":"#REF!"},{"$error":"#REF!"},{"$error":"#VALUE!"},{"$error":"#VALUE!"},null,null,"Rd_AEF",{"$f":"'Variable Management'!B303","v":0},{"$f":"IF(R14=\"OPEN\",\"OPEN\",IF(R14>(INT(0.5+100*POWER(10,IF(96*(LOG(R14)-INT(LOG(R14)))-ROUND(96*(LOG(R14)-INT(LOG(R14))),0)<0,ROUND(96*(LOG(R14)-INT(LOG(R14))),0)-1,ROUND(96*(LOG(R14)-INT(LOG(R14))),0))/96))*POWER(10,INT(LOG(R14))-2)+INT(0.5+100*POWER(10,(IF(96*(LOG(R14)-INT(LOG(R14)))-ROUND(96*(LOG(R14)-INT(LOG(R14))),0)<0,ROUND(96*(LOG(R14)-INT(LOG(R14))),0)-1,ROUND(96*(LOG(R14)-INT(LOG(R14))),0))+1)/96))*POWER(10,INT(LOG(R14))-2))/2,INT(0.5+100*POWER(10,(IF(96*(LOG(R14)-INT(LOG(R14)))-ROUND(96*(LOG(R14)-INT(LOG(R14))),0)<0,ROUND(96*(LOG(R14)-INT(LOG(R14))),0)-1,ROUND(96*(LOG(R14)-INT(LOG(R14))),0))+1)/96))*POWER(10,INT(LOG(R14))-2),INT(0.5+100*POWER(10,IF(96*(LOG(R14)-INT(LOG(R14)))-ROUND(96*(LOG(R14)-INT(LOG(R14))),0)<0,ROUND(96*(LOG(R14)-INT(LOG(R14))),0)-1,ROUND(96*(LOG(R14)-INT(LOG(R14))),0))/96))*POWER(10,INT(LOG(R14))-2)))","v":{"$error":"#NUM!"}},"Ω"]
[2.7,0,0,0,0,0,0,0,0,0,{"$f":"IF(IF((K$3*10^12-$A16)*(K$3*10^12-$A15)*-1<0,0,1)*IF(ABS(K$3*10^12-$A16)>(K$3*10^12-$A15),$A15,$A16)=K16,0,IF((K$3*10^12-$A16)*(K$3*10^12-$A15)*-1<0,0,1)*IF(ABS(K$3*10^12-$A16)>(K$3*10^12-$A15),$A15,$A16))","v":{"$error":"#REF!"}},{"$error":"#REF!"},{"$error":"#VALUE!"},{"$error":"#VALUE!"}]
[3.3,0,0,0,0,0,0,0,0,0,{"$error":"#REF!"},{"$error":"#REF!"},{"$error":"#VALUE!"},{"$error":"#VALUE!"},null,null,"Rs",{"$f":"Rs_ideal*1000","v":40.171621398383877},{"$f":"IF(R16=0,0,IF(R16>(INT(0.5+100*POWER(10,IF(96*(LOG(R16)-INT(LOG(R16)))-ROUND(96*(LOG(R16)-INT(LOG(R16))),0)<0,ROUND(96*(LOG(R16)-INT(LOG(R16))),0)-1,ROUND(96*(LOG(R16)-INT(LOG(R16))),0))/96))*POWER(10,INT(LOG(R16))-2)+INT(0.5+100*POWER(10,(IF(96*(LOG(R16)-INT(LOG(R16)))-ROUND(96*(LOG(R16)-INT(LOG(R16))),0)<0,ROUND(96*(LOG(R16)-INT(LOG(R16))),0)-1,ROUND(96*(LOG(R16)-INT(LOG(R16))),0))+1)/96))*POWER(10,INT(LOG(R16))-2))/2,INT(0.5+100*POWER(10,(IF(96*(LOG(R16)-INT(LOG(R16)))-ROUND(96*(LOG(R16)-INT(LOG(R16))),0)<0,ROUND(96*(LOG(R16)-INT(LOG(R16))),0)-1,ROUND(96*(LOG(R16)-INT(LOG(R16))),0))+1)/96))*POWER(10,INT(LOG(R16))-2),INT(0.5+100*POWER(10,IF(96*(LOG(R16)-INT(LOG(R16)))-ROUND(96*(LOG(R16)-INT(LOG(R16))),0)<0,ROUND(96*(LOG(R16)-INT(LOG(R16))),0)-1,ROUND(96*(LOG(R16)-INT(LOG(R16))),0))/96))*POWER(10,INT(LOG(R16))-2)))","v":40.200000000000003},"mΩ"]
[3.9,0,0,0,0,0,0,0,0,0,{"$error":"#REF!"},{"$error":"#REF!"},{"$error":"#VALUE!"},{"$error":"#VALUE!"},null,null,"Cres",{"$f":"Cres","v":1.9500000000000004E-7},{"$f":"G4*1000000000000","v":180000},"pF"]
[4.7,0,0,0,0,0,0,0,0,0,{"$error":"#REF!"},{"$error":"#REF!"},{"$error":"#VALUE!"},{"$error":"#VALUE!"}]
[5.6,0,0,0,0,0,0,0,0,0,{"$error":"#REF!"},{"$error":"#REF!"},{"$error":"#VALUE!"},{"$error":"#VALUE!"}]
[6.8,0,0,0,0,0,0,0,0,0,{"$error":"#REF!"},{"$error":"#REF!"},{"$error":"#VALUE!"},{"$error":"#VALUE!"}]
[8.1999999999999993,0,0,0,0,0,0,0,0,0,{"$error":"#REF!"},{"$error":"#REF!"},{"$error":"#VALUE!"},{"$error":"#VALUE!"},null,null,"Cdither",{"$f":"Cdither_init","v":2.8344671201814057E-9},{"$f":"H4","v":2.7000000000000002E-9}]
[10,0,0,0,0,0,0,0,0,0,{"$f":"IF(IF((K$3*10^12-$A23)*(K$3*10^12-$A22)*-1<0,0,1)*IF(ABS(K$3*10^12-$A23)>(K$3*10^12-$A22),$A22,$A23)=K23,0,IF((K$3*10^12-$A23)*(K$3*10^12-$A22)*-1<0,0,1)*IF(ABS(K$3*10^12-$A23)>(K$3*10^12-$A22),$A22,$A23))","v":{"$error":"#REF!"}},{"$error":"#REF!"},{"$error":"#VALUE!"},{"$error":"#VALUE!"}]
[12,0,0,0,0,0,0,0,0,0,{"$error":"#REF!"},{"$error":"#REF!"},{"$error":"#VALUE!"},{"$error":"#VALUE!"},null,null,"Cin_Passive",{"$f":"K4","v":{"$error":"#REF!"}},{"$f":"R23*1000000","v":{"$error":"#REF!"}},"uF"]
[15,0,0,0,0,0,0,0,0,0,{"$error":"#REF!"},{"$error":"#REF!"},{"$error":"#VALUE!"},{"$error":"#VALUE!"},null,null,"Cinj_AEF",{"$f":"Cinj_AEF","v":{"$error":"#VALUE!"}},{"$f":"M4*1000000","v":{"$error":"#VALUE!"}},"uF"]
[18,0,0,0,0,0,0,0,0,0,{"$error":"#REF!"},{"$error":"#REF!"},{"$error":"#VALUE!"},{"$error":"#VALUE!"},null,null,"Cdamp_AEF",{"$f":"'Variable Management'!B297","v":{"$error":"#VALUE!"}},{"$f":"N4*1000000","v":{"$error":"#VALUE!"}},"uF"]
[22,0,0,0,0,0,0,0,0,0,{"$error":"#REF!"},{"$error":"#REF!"},{"$error":"#VALUE!"},{"$error":"#VALUE!"},null,null,"Rdamp_AEF",{"$f":"'Variable Management'!B298","v":{"$error":"#VALUE!"}},{"$f":"IF(R26=\"OPEN\",\"OPEN\",IF(R26>(INT(0.5+100*POWER(10,IF(96*(LOG(R26)-INT(LOG(R26)))-ROUND(96*(LOG(R26)-INT(LOG(R26))),0)<0,ROUND(96*(LOG(R26)-INT(LOG(R26))),0)-1,ROUND(96*(LOG(R26)-INT(LOG(R26))),0))/96))*POWER(10,INT(LOG(R26))-2)+INT(0.5+100*POWER(10,(IF(96*(LOG(R26)-INT(LOG(R26)))-ROUND(96*(LOG(R26)-INT(LOG(R26))),0)<0,ROUND(96*(LOG(R26)-INT(LOG(R26))),0)-1,ROUND(96*(LOG(R26)-INT(LOG(R26))),0))+1)/96))*POWER(10,INT(LOG(R26))-2))/2,INT(0.5+100*POWER(10,(IF(96*(LOG(R26)-INT(LOG(R26)))-ROUND(96*(LOG(R26)-INT(LOG(R26))),0)<0,ROUND(96*(LOG(R26)-INT(LOG(R26))),0)-1,ROUND(96*(LOG(R26)-INT(LOG(R26))),0))+1)/96))*POWER(10,INT(LOG(R26))-2),INT(0.5+100*POWER(10,IF(96*(LOG(R26)-INT(LOG(R26)))-ROUND(96*(LOG(R26)-INT(LOG(R26))),0)<0,ROUND(96*(LOG(R26)-INT(LOG(R26))),0)-1,ROUND(96*(LOG(R26)-INT(LOG(R26))),0))/96))*POWER(10,INT(LOG(R26))-2)))","v":{"$error":"#VALUE!"}},"Ω"]
[27,0,0,0,0,0,0,0,0,0,{"$error":"#REF!"},{"$error":"#REF!"},{"$f":"IF(IF((M$3*10^12-$A28)*(M$3*10^12-$A27)*-1<0,0,1)*IF(ABS(M$3*10^12-$A28)>(M$3*10^12-$A27),$A27,$A28)=M28,0,IF((M$3*10^12-$A28)*(M$3*10^12-$A27)*-1<0,0,1)*IF(ABS(M$3*10^12-$A28)>(M$3*10^12-$A27),$A27,$A28))","v":{"$error":"#VALUE!"}},{"$error":"#VALUE!"},null,null,"Rdamp_Passive",{"$f":"SQRT(L_infilterStd/K4)","v":{"$error":"#REF!"}},{"$f":"IF(R27=\"OPEN\",\"OPEN\",IF(R27>(INT(0.5+100*POWER(10,IF(96*(LOG(R27)-INT(LOG(R27)))-ROUND(96*(LOG(R27)-INT(LOG(R27))),0)<0,ROUND(96*(LOG(R27)-INT(LOG(R27))),0)-1,ROUND(96*(LOG(R27)-INT(LOG(R27))),0))/96))*POWER(10,INT(LOG(R27))-2)+INT(0.5+100*POWER(10,(IF(96*(LOG(R27)-INT(LOG(R27)))-ROUND(96*(LOG(R27)-INT(LOG(R27))),0)<0,ROUND(96*(LOG(R27)-INT(LOG(R27))),0)-1,ROUND(96*(LOG(R27)-INT(LOG(R27))),0))+1)/96))*POWER(10,INT(LOG(R27))-2))/2,INT(0.5+100*POWER(10,(IF(96*(LOG(R27)-INT(LOG(R27)))-ROUND(96*(LOG(R27)-INT(LOG(R27))),0)<0,ROUND(96*(LOG(R27)-INT(LOG(R27))),0)-1,ROUND(96*(LOG(R27)-INT(LOG(R27))),0))+1)/96))*POWER(10,INT(LOG(R27))-2),INT(0.5+100*POWER(10,IF(96*(LOG(R27)-INT(LOG(R27)))-ROUND(96*(LOG(R27)-INT(LOG(R27))),0)<0,ROUND(96*(LOG(R27)-INT(LOG(R27))),0)-1,ROUND(96*(LOG(R27)-INT(LOG(R27))),0))/96))*POWER(10,INT(LOG(R27))-2)))","v":{"$error":"#REF!"}},"Ω"]
[33,0,0,0,0,0,0,0,0,0,{"$error":"#REF!"},{"$error":"#REF!"},{"$error":"#VALUE!"},{"$error":"#VALUE!"},null,null,"Cdamp_Passive",{"$f":"L4","v":{"$error":"#REF!"}},{"$f":"R28*1000000","v":{"$error":"#REF!"}},"uF"]
[39,0,0,0,0,0,0,0,0,0,{"$error":"#REF!"},{"$error":"#REF!"},{"$error":"#VALUE!"},{"$error":"#VALUE!"}]
[47,0,0,0,0,0,0,0,0,0,{"$error":"#REF!"},{"$error":"#REF!"},{"$error":"#VALUE!"},{"$error":"#VALUE!"}]
[56,0,0,0,0,0,0,0,0,0,{"$error":"#REF!"},{"$error":"#REF!"},{"$error":"#VALUE!"},{"$error":"#VALUE!"}]
[68,0,0,0,0,0,0,0,0,0,{"$error":"#REF!"},{"$error":"#REF!"},{"$error":"#VALUE!"},{"$error":"#VALUE!"},null,null,"Rc1",{"$f":"S7/1000&\" kΩ\"","v":"25,5 kΩ"},{"$f":"S7/1000","v":25.5},"kΩ"]
[82,0,0,0,0,0,0,0,0,0,{"$error":"#REF!"},{"$error":"#REF!"},{"$error":"#VALUE!"},{"$error":"#VALUE!"},null,null,"Cc1",{"$f":"C4*1000000000&\" nF\"","v":"6,8 nF"},{"$f":"C4*1000000000","v":6.8},"nF"]
[{"$f":"A22*10","v":100},0,0,0,0,0,0,0,0,0,{"$error":"#REF!"},{"$error":"#REF!"},{"$error":"#VALUE!"},{"$error":"#VALUE!"},null,null,"Cc2",{"$f":"D4*1000000000000&\" pF\"","v":"0 pF"},{"$f":"D4*1000000000000","v":0},"pF"]
[{"$f":"A23*10","v":120},0,0,0,0,0,0,0,0,0,{"$error":"#REF!"},{"$error":"#REF!"},{"$error":"#VALUE!"},{"$error":"#VALUE!"}]
[150,0,0,0,0,0,0,0,0,0,{"$error":"#REF!"},{"$error":"#REF!"},{"$error":"#VALUE!"},{"$error":"#VALUE!"},null,null,"Rc2",{"$f":"S8/1000&\" kΩ\"","v":{"$error":"#NUM!"}},{"$f":"S8/1000","v":{"$error":"#NUM!"}},"kΩ"]
[180,0,0,0,0,0,0,0,0,0,{"$error":"#REF!"},{"$error":"#REF!"},{"$error":"#VALUE!"},{"$error":"#VALUE!"},null,null,"Cc3",{"$f":"I4*1000000000&\" nF\"","v":"0 nF"},{"$f":"I4*1000000000","v":0},"nF"]
[220,0,0,0,0,0,0,0,0,0,{"$error":"#REF!"},{"$error":"#REF!"},{"$error":"#VALUE!"},{"$error":"#VALUE!"},null,null,"Cc4",{"$f":"J4*1000000000000&\" pF\"","v":"0 pF"},{"$f":"J4*1000000000000","v":0},"pF"]
[270,0,{"$f":"IF(IF((C$3*10^12-$A40)*(C$3*10^12-$A39)*-1<0,0,1)*IF(ABS(C$3*10^12-$A40)>(C$3*10^12-$A39),$A39,$A40)=C40,0,IF((C$3*10^12-$A40)*(C$3*10^12-$A39)*-1<0,0,1)*IF(ABS(C$3*10^12-$A40)>(C$3*10^12-$A39),$A39,$A40))","v":0},0,0,0,0,0,0,0,{"$error":"#REF!"},{"$error":"#REF!"},{"$error":"#VALUE!"},{"$error":"#VALUE!"}]
[330,0,0,0,0,0,0,0,0,0,{"$error":"#REF!"},{"$error":"#REF!"},{"$error":"#VALUE!"},{"$error":"#VALUE!"},null,null,"Rent",{"$f":"'Variable Management'!B188/1000","v":237},{"$f":"IF(R40>(INT(0.5+100*POWER(10,IF(96*(LOG(R40)-INT(LOG(R40)))-ROUND(96*(LOG(R40)-INT(LOG(R40))),0)<0,ROUND(96*(LOG(R40)-INT(LOG(R40))),0)-1,ROUND(96*(LOG(R40)-INT(LOG(R40))),0))/96))*POWER(10,INT(LOG(R40))-2)+INT(0.5+100*POWER(10,(IF(96*(LOG(R40)-INT(LOG(R40)))-ROUND(96*(LOG(R40)-INT(LOG(R40))),0)<0,ROUND(96*(LOG(R40)-INT(LOG(R40))),0)-1,ROUND(96*(LOG(R40)-INT(LOG(R40))),0))+1)/96))*POWER(10,INT(LOG(R40))-2))/2,INT(0.5+100*POWER(10,(IF(96*(LOG(R40)-INT(LOG(R40)))-ROUND(96*(LOG(R40)-INT(LOG(R40))),0)<0,ROUND(96*(LOG(R40)-INT(LOG(R40))),0)-1,ROUND(96*(LOG(R40)-INT(LOG(R40))),0))+1)/96))*POWER(10,INT(LOG(R40))-2),INT(0.5+100*POWER(10,IF(96*(LOG(R40)-INT(LOG(R40)))-ROUND(96*(LOG(R40)-INT(LOG(R40))),0)<0,ROUND(96*(LOG(R40)-INT(LOG(R40))),0)-1,ROUND(96*(LOG(R40)-INT(LOG(R40))),0))/96))*POWER(10,INT(LOG(R40))-2))","v":237},"kΩ"]
[390,0,0,0,0,0,0,0,0,0,{"$error":"#REF!"},{"$error":"#REF!"},{"$error":"#VALUE!"},{"$error":"#VALUE!"},null,null,"Renb",{"$f":"'Variable Management'!B189/1000","v":19.75},{"$f":"IF(R41>(INT(0.5+100*POWER(10,IF(96*(LOG(R41)-INT(LOG(R41)))-ROUND(96*(LOG(R41)-INT(LOG(R41))),0)<0,ROUND(96*(LOG(R41)-INT(LOG(R41))),0)-1,ROUND(96*(LOG(R41)-INT(LOG(R41))),0))/96))*POWER(10,INT(LOG(R41))-2)+INT(0.5+100*POWER(10,(IF(96*(LOG(R41)-INT(LOG(R41)))-ROUND(96*(LOG(R41)-INT(LOG(R41))),0)<0,ROUND(96*(LOG(R41)-INT(LOG(R41))),0)-1,ROUND(96*(LOG(R41)-INT(LOG(R41))),0))+1)/96))*POWER(10,INT(LOG(R41))-2))/2,INT(0.5+100*POWER(10,(IF(96*(LOG(R41)-INT(LOG(R41)))-ROUND(96*(LOG(R41)-INT(LOG(R41))),0)<0,ROUND(96*(LOG(R41)-INT(LOG(R41))),0)-1,ROUND(96*(LOG(R41)-INT(LOG(R41))),0))+1)/96))*POWER(10,INT(LOG(R41))-2),INT(0.5+100*POWER(10,IF(96*(LOG(R41)-INT(LOG(R41)))-ROUND(96*(LOG(R41)-INT(LOG(R41))),0)<0,ROUND(96*(LOG(R41)-INT(LOG(R41))),0)-1,ROUND(96*(LOG(R41)-INT(LOG(R41))),0))/96))*POWER(10,INT(LOG(R41))-2))","v":19.600000000000001},"kΩ"]
[470,0,0,0,0,0,0,0,0,0,{"$error":"#REF!"},{"$error":"#REF!"},{"$error":"#VALUE!"},{"$error":"#VALUE!"}]
[560,0,0,0,0,0,0,0,0,0,{"$error":"#REF!"},{"$error":"#REF!"},{"$f":"IF(IF((M$3*10^12-$A44)*(M$3*10^12-$A43)*-1<0,0,1)*IF(ABS(M$3*10^12-$A44)>(M$3*10^12-$A43),$A43,$A44)=M44,0,IF((M$3*10^12-$A44)*(M$3*10^12-$A43)*-1<0,0,1)*IF(ABS(M$3*10^12-$A44)>(M$3*10^12-$A43),$A43,$A44))","v":{"$error":"#VALUE!"}},{"$error":"#VALUE!"}]
[680,0,0,0,0,0,0,0,0,0,{"$error":"#REF!"},{"$error":"#REF!"},{"$error":"#VALUE!"},{"$error":"#VALUE!"}]
[{"$f":"A33*10","v":820},0,0,0,0,0,0,0,0,0,{"$error":"#REF!"},{"$error":"#REF!"},{"$error":"#VALUE!"},{"$error":"#VALUE!"}]
[1000,0,0,0,0,0,0,0,0,0,{"$error":"#REF!"},{"$error":"#REF!"},{"$error":"#VALUE!"},{"$error":"#VALUE!"}]
[1200,0,0,0,0,0,0,0,0,0,{"$error":"#REF!"},{"$error":"#REF!"},{"$error":"#VALUE!"},{"$error":"#VALUE!"}]
[1500,0,0,0,0,0,0,0,0,0,{"$error":"#REF!"},{"$error":"#REF!"},{"$error":"#VALUE!"},{"$error":"#VALUE!"}]
[1800,0,0,0,0,0,0,0,0,0,{"$error":"#REF!"},{"$error":"#REF!"},{"$error":"#VALUE!"},{"$error":"#VALUE!"}]
[2200,0,0,0,0,0,0,0,0,0,{"$error":"#REF!"},{"$error":"#REF!"},{"$error":"#VALUE!"},{"$error":"#VALUE!"}]
[2700,0,0,0,0,0,0,2700,0,0,{"$error":"#REF!"},{"$error":"#REF!"},{"$error":"#VALUE!"},{"$error":"#VALUE!"}]
[3300,0,0,0,0,0,0,0,0,0,{"$error":"#REF!"},{"$error":"#REF!"},{"$error":"#VALUE!"},{"$error":"#VALUE!"}]
[3900,0,0,0,0,0,0,0,0,0,{"$error":"#REF!"},{"$error":"#REF!"},{"$error":"#VALUE!"},{"$error":"#VALUE!"}]
[4700,0,0,0,0,0,0,0,0,0,{"$error":"#REF!"},{"$error":"#REF!"},{"$error":"#VALUE!"},{"$error":"#VALUE!"}]
[5600,0,6800,0,0,0,0,0,0,0,{"$error":"#REF!"},{"$error":"#REF!"},{"$error":"#VALUE!"},{"$error":"#VALUE!"}]
[6800,0,0,0,0,0,0,0,0,0,{"$error":"#REF!"},{"$error":"#REF!"},{"$error":"#VALUE!"},{"$error":"#VALUE!"}]
[8200,0,0,0,0,0,0,0,0,0,{"$error":"#REF!"},{"$error":"#REF!"},{"$error":"#VALUE!"},{"$error":"#VALUE!"}]
[10000,0,0,0,0,0,0,0,0,0,{"$error":"#REF!"},{"$error":"#REF!"},{"$error":"#VALUE!"},{"$error":"#VALUE!"}]
[12000,0,0,0,0,0,0,0,0,0,{"$error":"#REF!"},{"$error":"#REF!"},{"$f":"IF(IF((M$3*10^12-$A60)*(M$3*10^12-$A59)*-1<0,0,1)*IF(ABS(M$3*10^12-$A60)>(M$3*10^12-$A59),$A59,$A60)=M60,0,IF((M$3*10^12-$A60)*(M$3*10^12-$A59)*-1<0,0,1)*IF(ABS(M$3*10^12-$A60)>(M$3*10^12-$A59),$A59,$A60))","v":{"$error":"#VALUE!"}},{"$error":"#VALUE!"}]
[15000,0,0,0,0,0,0,0,0,0,{"$error":"#REF!"},{"$error":"#REF!"},{"$error":"#VALUE!"},{"$error":"#VALUE!"}]
[18000,0,0,0,0,0,0,0,0,0,{"$error":"#REF!"},{"$error":"#REF!"},{"$error":"#VALUE!"},{"$error":"#VALUE!"}]
[22000,0,0,0,0,0,0,0,0,0,{"$error":"#REF!"},{"$error":"#REF!"},{"$error":"#VALUE!"},{"$error":"#VALUE!"}]
[27000,0,0,0,0,0,0,0,0,0,{"$error":"#REF!"},{"$error":"#REF!"},{"$error":"#VALUE!"},{"$error":"#VALUE!"}]
[33000,0,0,0,0,0,0,0,0,0,{"$error":"#REF!"},{"$error":"#REF!"},{"$error":"#VALUE!"},{"$error":"#VALUE!"}]
[39000,0,0,0,0,0,0,0,0,0,{"$error":"#REF!"},{"$error":"#REF!"},{"$error":"#VALUE!"},{"$error":"#VALUE!"}]
[47000,0,0,0,0,0,0,0,0,0,{"$error":"#REF!"},{"$error":"#REF!"},{"$error":"#VALUE!"},{"$error":"#VALUE!"}]
[56000,0,0,0,0,0,0,0,0,0,{"$error":"#REF!"},{"$error":"#REF!"},{"$error":"#VALUE!"},{"$error":"#VALUE!"}]
[68000,0,0,0,0,0,0,0,0,0,{"$error":"#REF!"},{"$error":"#REF!"},{"$error":"#VALUE!"},{"$error":"#VALUE!"}]
[82000,0,0,0,0,0,0,0,0,{"$f":"IF(IF((J$3*10^12-$A70)*(J$3*10^12-$A69)*-1<0,0,1)*IF(ABS(J$3*10^12-$A70)>(J$3*10^12-$A69),$A69,$A70)=J70,0,IF((J$3*10^12-$A70)*(J$3*10^12-$A69)*-1<0,0,1)*IF(ABS(J$3*10^12-$A70)>(J$3*10^12-$A69),$A69,$A70))","v":0},{"$error":"#REF!"},{"$error":"#REF!"},{"$error":"#VALUE!"},{"$error":"#VALUE!"}]
[100000,0,0,{"$f":"IF(IF((D$3*10^12-$A71)*(D$3*10^12-$A70)*-1<0,0,1)*IF(ABS(D$3*10^12-$A71)>(D$3*10^12-$A70),$A70,$A71)=D71,0,IF((D$3*10^12-$A71)*(D$3*10^12-$A70)*-1<0,0,1)*IF(ABS(D$3*10^12-$A71)>(D$3*10^12-$A70),$A70,$A71))","v":0},0,0,0,0,0,0,{"$error":"#REF!"},{"$error":"#REF!"},{"$error":"#VALUE!"},{"$error":"#VALUE!"}]
[120000,{"$f":"IF(IF((B$3*10^12-$A72)*(B$3*10^12-$A71)*-1<0,0,1)*IF(ABS(B$3*10^12-$A72)>(B$3*10^12-$A71),$A71,$A72)=B72,0,IF((B$3*10^12-$A72)*(B$3*10^12-$A71)*-1<0,0,1)*IF(ABS(B$3*10^12-$A72)>(B$3*10^12-$A71),$A71,$A72))","v":0},{"$f":"IF(IF((C$3*10^12-$A72)*(C$3*10^12-$A71)*-1<0,0,1)*IF(ABS(C$3*10^12-$A72)>(C$3*10^12-$A71),$A71,$A72)=C72,0,IF((C$3*10^12-$A72)*(C$3*10^12-$A71)*-1<0,0,1)*IF(ABS(C$3*10^12-$A72)>(C$3*10^12-$A71),$A71,$A72))","v":0},0,0,{"$f":"IF(IF((F$3*10^12-$A72)*(F$3*10^12-$A71)*-1<0,0,1)*IF(ABS(F$3*10^12-$A72)>(F$3*10^12-$A71),$A71,$A72)=F72,0,IF((F$3*10^12-$A72)*(F$3*10^12-$A71)*-1<0,0,1)*IF(ABS(F$3*10^12-$A72)>(F$3*10^12-$A71),$A71,$A72))","v":0},{"$f":"IF(IF((G$3*10^12-$A72)*(G$3*10^12-$A71)*-1<0,0,1)*IF(ABS(G$3*10^12-$A72)>(G$3*10^12-$A71),$A71,$A72)=G72,0,IF((G$3*10^12-$A72)*(G$3*10^12-$A71)*-1<0,0,1)*IF(ABS(G$3*10^12-$A72)>(G$3*10^12-$A71),$A71,$A72))","v":0},{"$f":"IF(IF((H$3*10^12-$A72)*(H$3*10^12-$A71)*-1<0,0,1)*IF(ABS(H$3*10^12-$A72)>(H$3*10^12-$A71),$A71,$A72)=H72,0,IF((H$3*10^12-$A72)*(H$3*10^12-$A71)*-1<0,0,1)*IF(ABS(H$3*10^12-$A72)>(H$3*10^12-$A71),$A71,$A72))","v":0},{"$f":"IF(IF((I$3*10^12-$A72)*(I$3*10^12-$A71)*-1<0,0,1)*IF(ABS(I$3*10^12-$A72)>(I$3*10^12-$A71),$A71,$A72)=I72,0,IF((I$3*10^12-$A72)*(I$3*10^12-$A71)*-1<0,0,1)*IF(ABS(I$3*10^12-$A72)>(I$3*10^12-$A71),$A71,$A72))","v":0},0,{"$error":"#REF!"},{"$error":"#REF!"},{"$error":"#VALUE!"},{"$error":"#VALUE!"}]
[150000,0,0,0,0,0,0,0,0,0,{"$error":"#REF!"},{"$error":"#REF!"},{"$error":"#VALUE!"},{"$error":"#VALUE!"}]
[180000,0,0,0,0,0,180000,0,0,0,{"$error":"#REF!"},{"$error":"#REF!"},{"$error":"#VALUE!"},{"$error":"#VALUE!"}]
[220000,0,0,0,0,0,0,0,0,0,{"$error":"#REF!"},{"$error":"#REF!"},{"$error":"#VALUE!"},{"$error":"#VALUE!"}]
[270000,0,0,0,0,0,0,0,0,0,{"$error":"#REF!"},{"$error":"#REF!"},{"$error":"#VALUE!"},{"$error":"#VALUE!"}]
[330000,0,0,0,0,0,0,0,0,0,{"$error":"#REF!"},{"$error":"#REF!"},{"$error":"#VALUE!"},{"$error":"#VALUE!"}]
[390000,0,0,0,0,0,0,0,0,0,{"$error":"#REF!"},{"$error":"#REF!"},{"$error":"#VALUE!"},{"$error":"#VALUE!"}]
[470000,0,0,0,0,0,0,0,0,0,{"$error":"#REF!"},{"$error":"#REF!"},{"$error":"#VALUE!"},{"$error":"#VALUE!"}]
[560000,0,0,0,0,0,0,0,0,0,{"$error":"#REF!"},{"$error":"#REF!"},{"$error":"#VALUE!"},{"$error":"#VALUE!"}]
[680000,0,0,0,0,0,0,0,0,0,{"$error":"#REF!"},{"$error":"#REF!"},{"$error":"#VALUE!"},{"$error":"#VALUE!"}]
[820000,0,0,0,0,0,0,0,0,0,{"$error":"#REF!"},{"$error":"#REF!"},{"$error":"#VALUE!"},{"$error":"#VALUE!"}]
[1000000,0,0,0,0,0,0,0,0,0,{"$error":"#REF!"},{"$error":"#REF!"},{"$error":"#VALUE!"},{"$error":"#VALUE!"}]
[1200000,0,0,0,0,0,0,0,0,0,{"$error":"#REF!"},{"$error":"#REF!"},{"$error":"#VALUE!"},{"$error":"#VALUE!"}]
[1500000,0,0,0,0,0,0,0,0,0,{"$error":"#REF!"},{"$error":"#REF!"},{"$error":"#VALUE!"},{"$error":"#VALUE!"}]
[1800000,0,0,0,0,0,0,0,0,0,{"$error":"#REF!"},{"$f":"IF(IF((L$3*10^12-$A86)*(L$3*10^12-$A85)*-1<0,0,1)*IF(ABS(L$3*10^12-$A86)>(L$3*10^12-$A85),$A85,$A86)=L86,0,IF((L$3*10^12-$A86)*(L$3*10^12-$A85)*-1<0,0,1)*IF(ABS(L$3*10^12-$A86)>(L$3*10^12-$A85),$A85,$A86))","v":{"$error":"#REF!"}},{"$error":"#VALUE!"},{"$error":"#VALUE!"}]
[2200000,0,0,0,0,0,0,0,0,0,{"$error":"#REF!"},{"$error":"#REF!"},{"$error":"#VALUE!"},{"$error":"#VALUE!"}]
[2700000,0,0,0,0,0,0,0,0,0,{"$error":"#REF!"},{"$error":"#REF!"},{"$error":"#VALUE!"},{"$error":"#VALUE!"}]
[3300000,0,0,0,0,0,0,0,0,0,{"$error":"#REF!"},{"$error":"#REF!"},{"$error":"#VALUE!"},{"$error":"#VALUE!"}]
[3900000,0,0,0,0,0,0,0,0,0,{"$error":"#REF!"},{"$error":"#REF!"},{"$error":"#VALUE!"},{"$error":"#VALUE!"}]
[4700000,0,0,0,0,0,0,0,0,0,{"$error":"#REF!"},{"$error":"#REF!"},{"$error":"#VALUE!"},{"$error":"#VALUE!"}]
[5600000,0,0,0,0,0,0,0,0,0,{"$error":"#REF!"},{"$error":"#REF!"},{"$error":"#VALUE!"},{"$error":"#VALUE!"}]
[6800000,0,0,0,0,0,0,0,0,0,{"$error":"#REF!"},{"$error":"#REF!"},{"$error":"#VALUE!"},{"$error":"#VALUE!"}]
[8200000,0,0,0,0,0,0,0,0,0,{"$error":"#REF!"},{"$error":"#REF!"},{"$error":"#VALUE!"},{"$error":"#VALUE!"}]
[10000000,0,0,0,0,0,0,0,0,0,{"$error":"#REF!"},{"$error":"#REF!"},{"$error":"#VALUE!"},{"$error":"#VALUE!"}]
[12000000,0,0,0,0,0,0,0,0,0,{"$error":"#REF!"},{"$error":"#REF!"},{"$error":"#VALUE!"},{"$error":"#VALUE!"}]
[15000000,0,0,0,0,0,0,0,0,0,{"$error":"#REF!"},{"$error":"#REF!"},{"$error":"#VALUE!"},{"$error":"#VALUE!"}]
[18000000,0,0,0,0,0,0,0,0,0,{"$error":"#REF!"},{"$error":"#REF!"},{"$error":"#VALUE!"},{"$error":"#VALUE!"}]
[22000000,0,0,0,0,0,0,0,0,0,{"$error":"#REF!"},{"$error":"#REF!"},{"$error":"#VALUE!"},{"$error":"#VALUE!"}]
[{"$f":"A87*10","v":27000000},0,0,0,0,0,0,0,0,0,{"$error":"#REF!"},{"$error":"#REF!"},{"$error":"#VALUE!"},{"$error":"#VALUE!"}]
[33000000,0,0,0,0,0,0,0,0,0,{"$error":"#REF!"},{"$error":"#REF!"},{"$error":"#VALUE!"},{"$error":"#VALUE!"}]
[39000000,0,0,0,0,0,0,0,0,0,{"$error":"#REF!"},{"$error":"#REF!"},{"$error":"#VALUE!"},{"$error":"#VALUE!"}]
[47000000,0,0,0,47000000,47000000,0,0,0,0,{"$error":"#REF!"},{"$error":"#REF!"},{"$error":"#VALUE!"},{"$error":"#VALUE!"}]
[56000000,0,0,0,0,{"$f":"IF(IF((F$3*10^12-$A104)*(F$3*10^12-$A103)*-1<0,0,1)*IF(ABS(F$3*10^12-$A104)>(F$3*10^12-$A103),$A103,$A104)=F104,0,IF((F$3*10^12-$A104)*(F$3*10^12-$A103)*-1<0,0,1)*IF(ABS(F$3*10^12-$A104)>(F$3*10^12-$A103),$A103,$A104))","v":0},{"$f":"IF(IF((G$3*10^12-$A104)*(G$3*10^12-$A103)*-1<0,0,1)*IF(ABS(G$3*10^12-$A104)>(G$3*10^12-$A103),$A103,$A104)=G104,0,IF((G$3*10^12-$A104)*(G$3*10^12-$A103)*-1<0,0,1)*IF(ABS(G$3*10^12-$A104)>(G$3*10^12-$A103),$A103,$A104))","v":0},{"$f":"IF(IF((H$3*10^12-$A104)*(H$3*10^12-$A103)*-1<0,0,1)*IF(ABS(H$3*10^12-$A104)>(H$3*10^12-$A103),$A103,$A104)=H104,0,IF((H$3*10^12-$A104)*(H$3*10^12-$A103)*-1<0,0,1)*IF(ABS(H$3*10^12-$A104)>(H$3*10^12-$A103),$A103,$A104))","v":0},{"$f":"IF(IF((I$3*10^12-$A104)*(I$3*10^12-$A103)*-1<0,0,1)*IF(ABS(I$3*10^12-$A104)>(I$3*10^12-$A103),$A103,$A104)=I104,0,IF((I$3*10^12-$A104)*(I$3*10^12-$A103)*-1<0,0,1)*IF(ABS(I$3*10^12-$A104)>(I$3*10^12-$A103),$A103,$A104))","v":0},0,{"$error":"#REF!"},{"$error":"#REF!"},{"$error":"#VALUE!"},{"$error":"#VALUE!"}]
[68000000,0,0,0,0,0,0,0,0,0,{"$error":"#REF!"},{"$error":"#REF!"},{"$error":"#VALUE!"},{"$error":"#VALUE!"}]
[82000000,0,0,0,0,0,0,0,0,0,{"$error":"#REF!"},{"$error":"#REF!"},{"$error":"#VALUE!"},{"$error":"#VALUE!"}]
[100000000,0,0,0,0,0,0,0,0,0,{"$error":"#REF!"},{"$error":"#REF!"},{"$error":"#VALUE!"},{"$error":"#VALUE!"}]
[120000000,0,0,0,0,0,0,0,0,0,{"$error":"#REF!"},{"$error":"#REF!"},{"$error":"#VALUE!"},{"$error":"#VALUE!"}]
[150000000,0,0,0,0,0,0,0,0,0,{"$error":"#REF!"},{"$error":"#REF!"},{"$error":"#VALUE!"},{"$error":"#VALUE!"}]
[180000000,0,0,0,0,0,0,0,0,0,{"$error":"#REF!"},{"$error":"#REF!"},{"$error":"#VALUE!"},{"$error":"#VALUE!"}]
[220000000,0,0,0,0,0,0,0,0,0,{"$error":"#REF!"},{"$error":"#REF!"},{"$error":"#VALUE!"},{"$error":"#VALUE!"}]
[270000000,0,0,0,0,0,0,0,0,0,{"$error":"#REF!"},{"$error":"#REF!"},{"$error":"#VALUE!"},{"$error":"#VALUE!"}]
[330000000,0,0,0,0,0,0,0,0,0,{"$error":"#REF!"},{"$error":"#REF!"},{"$error":"#VALUE!"},{"$error":"#VALUE!"}]
[390000000,0,0,0,0,0,0,0,0,0,{"$error":"#REF!"},{"$error":"#REF!"},{"$error":"#VALUE!"},{"$error":"#VALUE!"}]
[470000000,0,0,0,0,0,0,0,0,0,{"$error":"#REF!"},{"$error":"#REF!"},{"$error":"#VALUE!"},{"$error":"#VALUE!"}]
[560000000,0,0,0,0,0,0,0,0,0,{"$error":"#REF!"},{"$error":"#REF!"},{"$error":"#VALUE!"},{"$error":"#VALUE!"}]
[680000000,0,0,0,0,0,0,0,0,0,{"$error":"#REF!"},{"$error":"#REF!"},{"$error":"#VALUE!"},{"$error":"#VALUE!"}]
[820000000,0,0,0,0,0,0,0,0,0,{"$error":"#REF!"},{"$error":"#REF!"},{"$error":"#VALUE!"},{"$error":"#VALUE!"}]
[1000000000,0,0,0,0,0,0,0,0,0,{"$error":"#REF!"},{"$error":"#REF!"},{"$error":"#VALUE!"},{"$error":"#VALUE!"}]
[1200000000,0,0,0,0,0,0,0,0,0,{"$error":"#REF!"},{"$error":"#REF!"},{"$error":"#VALUE!"},{"$error":"#VALUE!"}]
[1500000000,0,0,0,0,0,0,0,0,0,{"$error":"#REF!"},{"$error":"#REF!"},{"$error":"#VALUE!"},{"$error":"#VALUE!"}]
[1800000000,0,0,0,0,0,0,0,0,0,{"$error":"#REF!"},{"$error":"#REF!"},{"$error":"#VALUE!"},{"$error":"#VALUE!"}]
[2200000000,0,0,0,0,0,0,0,0,0,{"$error":"#REF!"},{"$error":"#REF!"},{"$error":"#VALUE!"},{"$error":"#VALUE!"}]
[2700000000,0,0,0,0,0,0,0,0,0,{"$error":"#REF!"},{"$error":"#REF!"},{"$error":"#VALUE!"},{"$error":"#VALUE!"}]
[3300000000,0,0,0,0,0,0,0,0,0,{"$error":"#REF!"},{"$error":"#REF!"},{"$error":"#VALUE!"},{"$error":"#VALUE!"}]
[3900000000,0,0,0,0,0,0,0,0,0,{"$error":"#REF!"},{"$error":"#REF!"},{"$error":"#VALUE!"},{"$error":"#VALUE!"}]
[4700000000,0,0,0,0,0,0,0,0,0,{"$error":"#REF!"},{"$error":"#REF!"},{"$error":"#VALUE!"},{"$error":"#VALUE!"}]
[5600000000,0,0,0,0,0,0,0,0,0,{"$error":"#REF!"},{"$error":"#REF!"},{"$error":"#VALUE!"},{"$error":"#VALUE!"}]
[6800000000,0,0,0,0,0,0,0,0,0,{"$error":"#REF!"},{"$error":"#REF!"},{"$error":"#VALUE!"},{"$error":"#VALUE!"}]
[8200000000,0,0,0,0,0,0,0,0,0,{"$error":"#REF!"},{"$error":"#REF!"},{"$error":"#VALUE!"},{"$error":"#VALUE!"}]
[10000000000,0,0,0,0,0,0,0,0,0,{"$error":"#REF!"},{"$error":"#REF!"},{"$error":"#VALUE!"},{"$error":"#VALUE!"}]
[12000000000,0,0,0,0,0,0,0,0,0,{"$error":"#REF!"},{"$error":"#REF!"},{"$error":"#VALUE!"},{"$error":"#VALUE!"}]
[15000000000,0,0,0,0,0,0,0,0,0,{"$f":"IF(IF((K$3*10^12-$A133)*(K$3*10^12-$A132)*-1<0,0,1)*IF(ABS(K$3*10^12-$A133)>(K$3*10^12-$A132),$A132,$A133)=K133,0,IF((K$3*10^12-$A133)*(K$3*10^12-$A132)*-1<0,0,1)*IF(ABS(K$3*10^12-$A133)>(K$3*10^12-$A132),$A132,$A133))","v":{"$error":"#REF!"}},{"$f":"IF(IF((L$3*10^12-$A133)*(L$3*10^12-$A132)*-1<0,0,1)*IF(ABS(L$3*10^12-$A133)>(L$3*10^12-$A132),$A132,$A133)=L133,0,IF((L$3*10^12-$A133)*(L$3*10^12-$A132)*-1<0,0,1)*IF(ABS(L$3*10^12-$A133)>(L$3*10^12-$A132),$A132,$A133))","v":{"$error":"#REF!"}},{"$error":"#VALUE!"},{"$error":"#VALUE!"}]
[18000000000,0,0,0,0,0,0,0,0,{"$f":"IF(IF((J$3*10^12-$A134)*(J$3*10^12-$A133)*-1<0,0,1)*IF(ABS(J$3*10^12-$A134)>(J$3*10^12-$A133),$A133,$A134)=J134,0,IF((J$3*10^12-$A134)*(J$3*10^12-$A133)*-1<0,0,1)*IF(ABS(J$3*10^12-$A134)>(J$3*10^12-$A133),$A133,$A134))","v":0},{"$error":"#REF!"},{"$error":"#REF!"},{"$f":"IF(IF((M$3*10^12-$A134)*(M$3*10^12-$A133)*-1<0,0,1)*IF(ABS(M$3*10^12-$A134)>(M$3*10^12-$A133),$A133,$A134)=M134,0,IF((M$3*10^12-$A134)*(M$3*10^12-$A133)*-1<0,0,1)*IF(ABS(M$3*10^12-$A134)>(M$3*10^12-$A133),$A133,$A134))","v":{"$error":"#VALUE!"}},{"$f":"IF(IF((N$3*10^12-$A134)*(N$3*10^12-$A133)*-1<0,0,1)*IF(ABS(N$3*10^12-$A134)>(N$3*10^12-$A133),$A133,$A134)=N134,0,IF((N$3*10^12-$A134)*(N$3*10^12-$A133)*-1<0,0,1)*IF(ABS(N$3*10^12-$A134)>(N$3*10^12-$A133),$A133,$A134))","v":{"$error":"#VALUE!"}}]
[22000000000,0,0,0,{"$f":"IF(IF((E$3*10^12-$A135)*(E$3*10^12-$A134)*-1<0,0,1)*IF(ABS(E$3*10^12-$A135)>(E$3*10^12-$A134),$A134,$A135)=E135,0,IF((E$3*10^12-$A135)*(E$3*10^12-$A134)*-1<0,0,1)*IF(ABS(E$3*10^12-$A135)>(E$3*10^12-$A134),$A134,$A135))","v":0},0,0,0,0,0,{"$error":"#REF!"},{"$error":"#REF!"},{"$f":"IF(IF((M$3*10^12-$A135)*(M$3*10^12-$A134)*-1<0,0,1)*IF(ABS(M$3*10^12-$A135)>(M$3*10^12-$A134),$A134,$A135)=M135,0,IF((M$3*10^12-$A135)*(M$3*10^12-$A134)*-1<0,0,1)*IF(ABS(M$3*10^12-$A135)>(M$3*10^12-$A134),$A134,$A135))","v":{"$error":"#VALUE!"}},{"$f":"IF(IF((N$3*10^12-$A135)*(N$3*10^12-$A134)*-1<0,0,1)*IF(ABS(N$3*10^12-$A135)>(N$3*10^12-$A134),$A134,$A135)=N135,0,IF((N$3*10^12-$A135)*(N$3*10^12-$A134)*-1<0,0,1)*IF(ABS(N$3*10^12-$A135)>(N$3*10^12-$A134),$A134,$A135))","v":{"$error":"#VALUE!"}}]
[27000000000,{"$f":"IF(IF((B$3*10^12-$A136)*(B$3*10^12-$A135)*-1<0,0,1)*IF(ABS(B$3*10^12-$A136)>(B$3*10^12-$A135),$A135,$A136)=B136,0,IF((B$3*10^12-$A136)*(B$3*10^12-$A135)*-1<0,0,1)*IF(ABS(B$3*10^12-$A136)>(B$3*10^12-$A135),$A135,$A136))","v":0},{"$f":"IF(IF((C$3*10^12-$A136)*(C$3*10^12-$A135)*-1<0,0,1)*IF(ABS(C$3*10^12-$A136)>(C$3*10^12-$A135),$A135,$A136)=C136,0,IF((C$3*10^12-$A136)*(C$3*10^12-$A135)*-1<0,0,1)*IF(ABS(C$3*10^12-$A136)>(C$3*10^12-$A135),$A135,$A136))","v":0},0,0,0,0,0,0,0,{"$error":"#REF!"},{"$error":"#REF!"},{"$error":"#VALUE!"},{"$error":"#VALUE!"}]
[33000000000,0,0,0,0,0,0,0,0,0,{"$error":"#REF!"},{"$error":"#REF!"},{"$error":"#VALUE!"},{"$error":"#VALUE!"}]
[39000000000,0,0,0,0,0,0,0,0,0,{"$error":"#REF!"},{"$error":"#REF!"},{"$error":"#VALUE!"},{"$error":"#VALUE!"}]
[47000000000,0,0,0,0,0,0,0,0,0,{"$error":"#REF!"},{"$error":"#REF!"},{"$error":"#VALUE!"},{"$error":"#VALUE!"}]
[56000000000,0,0,0,0,0,0,0,0,0,{"$error":"#REF!"},{"$error":"#REF!"},{"$error":"#VALUE!"},{"$error":"#VALUE!"}]
[68000000000,0,0,0,0,0,0,0,0,0,{"$error":"#REF!"},{"$error":"#REF!"},{"$error":"#VALUE!"},{"$error":"#VALUE!"}]
[82000000000,0,0,0,0,0,0,0,0,0,{"$error":"#REF!"},{"$error":"#REF!"},{"$error":"#VALUE!"},{"$error":"#VALUE!"}]
[100000000000,0,0,0,0,0,0,0,0,0,{"$error":"#REF!"},{"$error":"#REF!"},{"$error":"#VALUE!"},{"$error":"#VALUE!"}]
[120000000000,0,0,0,0,0,0,0,0,0,{"$error":"#REF!"},{"$error":"#REF!"},{"$error":"#VALUE!"},{"$error":"#VALUE!"}]
[150000000000,0,0,0,0,0,0,0,0,0,{"$error":"#REF!"},{"$error":"#REF!"},{"$error":"#VALUE!"},{"$error":"#VALUE!"}]
[180000000000,0,0,0,0,0,0,0,0,0,{"$error":"#REF!"},{"$error":"#REF!"},{"$error":"#VALUE!"},{"$error":"#VALUE!"}]
[220000000000,0,0,0,0,0,0,0,0,0,{"$error":"#REF!"},{"$error":"#REF!"},{"$error":"#VALUE!"},{"$error":"#VALUE!"}]
[270000000000,0,0,0,0,0,0,0,0,0,{"$error":"#REF!"},{"$error":"#REF!"},{"$error":"#VALUE!"},{"$error":"#VALUE!"}]
[330000000000,0,0,0,0,0,0,0,0,0,{"$error":"#REF!"},{"$error":"#REF!"},{"$error":"#VALUE!"},{"$error":"#VALUE!"}]
[390000000000,0,0,0,0,0,0,0,0,0,{"$error":"#REF!"},{"$error":"#REF!"},{"$error":"#VALUE!"},{"$error":"#VALUE!"}]
[470000000000,0,0,0,0,0,0,0,0,0,{"$error":"#REF!"},{"$error":"#REF!"},{"$error":"#VALUE!"},{"$error":"#VALUE!"}]
[560000000000,0,0,0,0,0,0,0,0,0,{"$error":"#REF!"},{"$error":"#REF!"},{"$error":"#VALUE!"},{"$error":"#VALUE!"}]
[680000000000,0,0,0,0,0,0,0,0,0,{"$error":"#REF!"},{"$error":"#REF!"},{"$error":"#VALUE!"},{"$error":"#VALUE!"}]
[820000000000,0,0,0,0,0,0,0,0,0,{"$error":"#REF!"},{"$error":"#REF!"},{"$error":"#VALUE!"},{"$error":"#VALUE!"}]
[1000000000000,0,0,0,0,0,0,0,0,0,{"$error":"#REF!"},{"$error":"#REF!"},{"$error":"#VALUE!"},{"$error":"#VALUE!"}]
[1200000000000,0,0,0,0,0,0,0,0,0,{"$error":"#REF!"},{"$error":"#REF!"},{"$error":"#VALUE!"},{"$error":"#VALUE!"}]
[1500000000000,0,0,0,0,0,0,0,0,0,{"$error":"#REF!"},{"$error":"#REF!"},{"$error":"#VALUE!"},{"$error":"#VALUE!"}]
[1800000000000,0,0,0,0,0,0,0,0,0,{"$error":"#REF!"},{"$error":"#REF!"},{"$error":"#VALUE!"},{"$error":"#VALUE!"}]
[2200000000000,0,0,0,0,0,0,0,0,0,{"$error":"#REF!"},{"$error":"#REF!"},{"$error":"#VALUE!"},{"$error":"#VALUE!"}]
[2700000000000,2700000000000,2700000000000,0,2700000000000,2700000000000,2700000000000,2700000000000,2700000000000,2700000000000,{"$error":"#REF!"},{"$error":"#REF!"},{"$error":"#VALUE!"},{"$error":"#VALUE!"}]

{"sheet":"Snubber","index":11,"n_rows":6,"n_cols":5,"rows_kept":6,"cut":false,"hidden":true,"merged":[]}
[null,null,"UNITS","STD UNITS"]
["Frequency of Ringing",85,"MHz",{"$f":"B2*1000000","v":85000000},"Hz"]
["SW capacitance",3000,"pF",{"$f":"B3*0.000000000001","v":3E-9},"F"]
["Lpar",{"$f":"1000000000*1/((D2*2*3.14159)^2*D3)","v":1.1686430773614742},"nH",{"$f":"B4/1000000000","v":1.1686430773614743E-9},"H"]
["Csnub",{"$f":"4*B3","v":12000},"pF",{"$f":"B5*0.000000000001","v":1.2E-8},"F"]
["Rsnub",{"$f":"SQRT(D4/D3)","v":0.62413755891936573},"Ω",{"$f":"B6","v":0.62413755891936573},"Ω"]

{"sheet":"Parallel Output Caps","index":12,"n_rows":17,"n_cols":5,"rows_kept":17,"cut":false,"hidden":true,"merged":[]}
[]
[]
[]
["Fsw",{"$f":"Fsw","v":433000}]
[]
["C1",20,"uF",{"$f":"B6/1000000","v":2.0000000000000002E-5},"F"]
["R1",0.5,"mOhms",{"$f":"B7/1000","v":5.0000000000000001E-4},"Ohms"]
[]
["C2",68,"uF",{"$f":"B9/1000000","v":6.7999999999999999E-5},"F"]
["R2",20,"mOhms",{"$f":"B10/1000","v":0.02},"Ohms"]
[]
[]
["I1 ",{"$f":"(D6/(D6+D9))*SQRT((D10*D9*B4)^2+1)/SQRT((((D7+D10)*D6*D9/(D9+D6))*B4)^2+1)","v":0.26130461758999562},"%"]
["I2 ",{"$f":"1-B13","v":0.73869538241000443},"%"]
[]
["I1 ",{"$f":"B13*(Iripple1/(2*SQRT(3)))","v":{"$error":"#NAME?"}},"A"]
["I2 ",{"$f":"B14*(Iripple1/(2*SQRT(3)))","v":{"$error":"#NAME?"}},"A"]