{"text_format":"1","workbook":"xlsx","n_sheets":13,"sheets":["Design the Converter","Schematic & BOM","EVMs","Variable Management","MOSFET Parameters","Schematic Management","Stability Calculations","Bode Plot Management","Efficiency Calculations","Efficiency Plot Management","Standard Value Calculator","Snubber","Parallel Output Caps"],"not_rendered":{"charts":10,"images":20,"macros":1,"external_links":0,"defined_names":240,"comments":2,"pivot_tables":0},"unopened":[],"bounds":{"document_bytes":16777216,"sheet_cells":100000,"rows_first":2000,"rows_last":500,"rows_between":2000,"halvings":0,"cell_chars":16384,"cell_head_chars":4096},"cells_cut":0,"cells_raw":0,"read":"whole","date_system":"1900"}

{"sheet":"Design the Converter","index":0,"n_rows":73,"n_cols":17,"rows_kept":73,"cut":false,"hidden":false,"merged":[[2,14,2,15],[0,0,0,16],[39,11,40,16],[41,11,42,16]]}
["                           LM76005/-Q1 60VIN, 5AOUT Converter Design Tool"]
[null,null,null,null,null,null,null,null,null,null,null,null,null,null,"http://www.ti.com/product/lm5175"]
["About",null,"xx",null,null,"= Input Box",null,null,null,null,null,null,null,null,"TERMS OF USE",null,"                "]
[]
["Step 1: Operating Specifications"]
[null,null,null,"Input Voltage – Min, VIN(min) ",18,"V"]
[null,null,null,"Input Voltage – Nom, VIN(nom)",24,"V"]
[null,null,null,"Input Voltage – Max, VIN(max)",60,"V"]
[null,null,null,"Output Voltage, VOUT ",5,"V"]
[null,null,null,"Full Load Output Current, IOUT ",3.5,"A"]
[null,null,null,"Switching Frequency, FSW",400,"kHz"]
[null,null,null,"Frequency Set Resistor, RT ",{"$f":"'Variable Management'!C344","v":100},{"$f":"'Variable Management'!E344","v":"kΩ"}]
[null,null,null,"Ambient Temperature, TA",25,"°C"]
[]
["Step 2: Buck Inductor"]
[null,null,null,"Inductance for 35% Ripple Current at VIN(nom)",{"$f":"Lopt*1000000","v":8.0782312925170068},"µH"]
[null,null,null,"Buck Inductance, LO ",6.8,"µH"]
[null,null,null,"Inductor DCR at 25°C",27,"mΩ"]
[null,null,null,"Inductor Pk-Pk Ripple Current at VIN(nom)",{"$f":"'Variable Management'!B60","v":1.4955569962004385},"APK-PK"]
[null,null,null,"DIL as a % of Full Load at VIN(nom)",{"$f":"'Variable Management'!D60*100","v":42.730199891441103},"%"]
[null,null,null,"Peak Inductor Current at VIN(max) and Full Load",{"$f":"'Variable Management'!B97","v":4.3732865092857924},"APK"]
[null,null,null,"Peak Inductor Current Limit at VIN(nom)",{"$f":"Ipk_OCP_Vinnom","v":6.8},"APK"]
[null,null,null,"Estimate Inductor Core Loss at VIN(nom)",0.1,"W"]
[]
["Step 3: Output Capacitors"]
[null,null,null,"Desired Output Voltage Ripple",24,"mVPK-PK"]
[null,null,null,"Effective COUT Value to Meet Ripple Spec",{"$f":"'Variable Management'!B111","v":19.473398388026542},"µF"]
[null,null,null,"Desired Crossover Frequency",40,{"$f":"\"     kHz \"","v":"     kHz "}]
[null,null,null,"Effective COUT Value to Meet Crossover Spec",{"$f":"'Variable Management'!B204","v":78.781696920509404},"µF"]
[null,null,null,"Output Capacitance (derated), COUT ",125,"µF"]
[null,null,null,"Output Cap ESR (Max) to Meet Ripple Spec",{"$f":"'Variable Management'!B115","v":15.851602758806663},"mΩ"]
[null,null,null,"Output Capacitor ESR",2,"mΩ"]
[null,null,null,"Resulting Output Voltage Ripple (max) ",{"$f":"'Variable Management'!B117*1000","v":4.7881186254166472},"mVPK-PK"]
[null,null,null,"Output Capacitor RMS Current (max) ",{"$f":"'Variable Management'!B104","v":0.50419220121582065},"ARMS"]
[]
["Step 4: Input Capacitors"]
[null,null,null,"Input Voltage Ripple Spec",120,"mVPK-PK"]
[null,null,null,"Minimum Input Capacitance",{"$f":"'Variable Management'!B134","v":18.229166666666668},"µF"]
[null,null,null,"Input Capacitance (derated), CIN ",47,"µF"]
[null,null,null,"Maximum Permitted ESR",{"$f":"'Variable Management'!B139","v":16.796852127693565},"mΩ",null,null,null,null,null,{"$f":"CHOOSE(SCH_MODE, \"\", \"** For Single-Output Operation in 2-Phase Mode, tie MODE to VDDA and use FB1 to set VOUT **\", \"** For Single-Output Operation in 3-Phase Mode, tie both MODE pins to VDDA. Use FB1 of master IC to set VOUT. Connect FB2 of master IC to AGND. Connect FB2 of slave IC to VDDA to configure it as a slave **\", \"** For Single-Output Operation in 4-Phase Mode, tie both MODE pins to VDDA. Use FB1 of master IC to set VOUT. Connect FB2 of master IC to AGND. Connect FB2 of slave IC to VDDA to configure it as a slave **\")","v":""}]
[null,null,null,"Input Capacitor ESR",2,"mΩ"]
[null,null,null,"Resulting Input Voltage Ripple (max)",{"$f":"'Variable Management'!B144*1000","v":55.28912621006095},"mVPK-PK",null,null,null,null,null,{"$f":"CHOOSE(SCH_MODE, \"\", \"** For Single-Output Operation in 2-Phase Mode, tie MODE to VDDA and use FB1 to set VOUT **\", \"** For Single-Output Operation in 3-Phase Mode, tie both MODE pins to VDDA. Use FB1 of master IC to set VOUT. Connect FB2 of master IC to AGND. Connect FB2 of slave IC to VDDA to configure it as a slave **\", \"** For Single-Output Operation in 4-Phase Mode, tie both MODE pins to VDDA. Use FB1 of master IC to set VOUT. Connect FB2 of master IC to AGND. Connect FB2 of slave IC to VDDA to configure it as a slave **\")","v":""}]
[null,null,null,"Input Capacitor RMS Current (max)",{"$f":"'Variable Management'!B127","v":1.6045390051353206},"ARMS"]
[]
["Step 5: Feedback Network"]
[null,null,null,{"$f":"CHOOSE(LM64k_Fixed_Vout, \"Upper Feedback Resistance\", \"* Tie FB to VOUT for a Fixed 5V Output\", \"* Tie FB to VOUT for a Fixed 3.3V Output\")","v":"Upper Feedback Resistance"},100,"kΩ"]
[null,null,null,"Lower Feedback Resistance (E96), RFBB",{"$f":"IF(Vout=Vref,\"OPEN\",Rfb2_u/1000)","v":24.9},{"$f":"IF(Vout=Vref,\"\",\"kΩ\")","v":"kΩ"}]
[null,null,null,"Feedforward Capacitance, CFF",10,"pF"]
[]
["Step 6: VIN UVLO, VOUT Soft Start",null,null,null,null,null,null,null,null,null,null,null,null,null,null,null," "]
[null,null,null,"Desired VIN UVLO Turn-On Threshold",12,"V"]
[null,null,null,"UVLO Divider Lower Resistance, RENB",100,"kΩ"]
[null,null,null,"UVLO Divider Upper Resistance (E96), RENT",{"$f":"Rent1_u/1000","v":887},{"$f":"IF(Vout=Vref,\"\",\"kΩ\")","v":"kΩ"}]
[null,null,null,"Actual VIN UVLO Turn-On Threshold",{"$f":"'Variable Management'!B232","v":12.021660000000001},"V"]
[null,null,null,"Actual VIN UVLO Turn-Off Threshold",{"$f":"'Variable Management'!B233","v":9.7713000000000001},"V"]
[null,null,null,"Soft-start Time, tSS",11,"ms"]
[null,null,null,"Soft-start Capacitance",{"$f":"IF(Css_u > 12, Css_u, \"N/A\")","v":22},"nF"]
[]
["Step 7: Power Loss & Thermals"]
[null,null,null,"IC Power Dissipation",{"$f":"'Efficiency Calculations'!BE109","v":0.91540319144740834},"W"]
[null,null,null,"Thermal Impedance, RqJA",30,"°C/W"]
[null,null,null,"Junction Temperature (estimate)",{"$f":"'Variable Management'!B286","v":52.462095743422253},"°C"]
[null,null,null,null,{"$f":"CHOOSE(Ext_VCC, \"* Connect a 1µF Capacitor From BIAS to GND\", \"* Tie BIAS to GND\")","v":"* Connect a 1µF Capacitor From BIAS to GND"}]
[]
[]
[]
[]
["Pole/Zero Frequencies"]
[null,null,null,"Load Pole Frequency, FP-LOAD",{"$f":"Fp_dominant/1000","v":1.2956423186192561},"kHz"]
[null,null,null,"Output Cap ESR Zero Frequency, FZ-ESR",{"$f":"Fesr/1000000","v":0.63661977309502549},"MHz"]
[null,null,null,"Error Amp Dominant Pole Frequency, FP-EA",{"$f":"Fp1_u","v":148.60405534431035},"Hz"]
[null,null,null,"Compensator Zero Frequency, FZ-COMP",{"$f":"Fz1_u/1000","v":7.5788068225598275},"kHz"]
[null,null,null,"Compensator Pole Frequency, FP-COMP",{"$f":"Fp2_u/1000","v":275.5627260504076},"kHz"]

{"sheet":"Schematic & BOM","index":1,"n_rows":54,"n_cols":10,"rows_kept":54,"cut":false,"hidden":false,"merged":[[38,3,38,5],[36,3,36,5],[46,3,46,6],[47,3,47,6],[35,3,35,6],[37,3,37,5],[41,3,41,5],[39,3,39,5],[40,3,40,5],[48,3,48,6],[44,3,44,6],[45,3,45,6],[43,3,43,6],[42,3,42,6],[49,0,50,0],[49,9,50,9],[49,3,50,6],[49,2,50,2],[49,1,50,1],[49,7,50,7],[49,8,50,8]]}
[]
[]
[]
[]
[]
[]
[]
[]
[]
[]
[]
[]
[]
[]
[]
[]
[]
[]
[]
[]
[]
[]
[]
[]
[]
[]
[]
[]
[]
[]
[]
[]
[]
[{"$f":"\"VIN = \"&VIN_min&\" V to \"&VIN_max&\" V, VOUT = \"&Vout&\" V, IOUT = \"&Iout&\" A,  Fsw = \"&Fsw/1000&\" kHz\"","v":"VIN = 18 V to 60 V, VOUT = 5 V, IOUT = 3.5 A,  Fsw = 400 kHz"}]
["High-Efficiency Synchronous Buck DC/DC Converter BOM"]
["Count","Ref Des","Value","Description",null,null,null,"Size","Part Number","MFR"]
[{"$f":"ROUNDUP('Design the Converter'!E39/10,0)","v":5},"CIN1",10,{"$f":"C37","v":10},null,null,null,1210,"Std","Std"]
[2,"COUT",22,{"$f":"C38","v":22},null,null,null,1210,"Std","Std"]
[1,"CVCC",2.2000000000000002,{"$f":"C39","v":2.2000000000000002},null,null,null,"0402","Std","Std"]
[1,"CSYNC",1,{"$f":"C40","v":1},null,null,null,"0402","Std","Std"]
[1,"CSS",{"$f":"'Design the Converter'!E57","v":22},22,null,null,null,"0402","Std","Std"]
[1,"CFF",{"$f":"'Variable Management'!D300","v":10},10,null,null,null,"0402","Std","Std"]
[1,"LO",{"$f":"'Design the Converter'!E17","v":6.8},{"$f":"\"Buck Inductor, \"&Lf*1000000&\" µH, \"&Rdcr*1000&\" mΩ, >\"&ROUNDUP(Ipk_OCP_Vinmin*1.05,0)&\" A\"","v":"Buck Inductor, 6.8 µH, 27 mΩ, >8 A"},null,null,null,"--","--","Various"]
[1,"RT",{"$f":"'Design the Converter'!E12","v":100},{"$f":"C44","v":100},null,null,null,"0402","Std","Std"]
[1,"RFBT",{"$f":"'Design the Converter'!E46","v":100},{"$f":"C45","v":100},null,null,null,"0402","Std","Std"]
[1,"RFBB",{"$f":"'Design the Converter'!E47","v":24.9},24.9,null,null,null,"0402","Std","Std"]
[1,"RENB",{"$f":"'Variable Management'!D305","v":100},{"$f":"C47","v":100},null,null,null,"0402","Std","Std"]
[1,"RENT",{"$f":"'Variable Management'!D306","v":887},887,null,null,null,"0402","Std","Std"]
[1,"RPG",100,100,null,null,null,"0402","Std","Std"]
[1,"U1",{"$f":"'Variable Management'!N19","v":"LM76005-Q1"},{"$f":"CHOOSE(GPN, \"IC, LM76005-Q1 Synchronous Buck DC/DC Converter, 3.5V–60V Input, 5A Output\", \"IC, LM76005 Synchronous Buck DC/DC Converter,60V Input, 5A Output\", \"IC, LM76005 Synchronous Buck DC/DC Converter, 3V–36V Input, 6A Output\")","v":"IC, LM76005-Q1 Synchronous Buck DC/DC Converter, 3.5V–60V Input, 5A Output"},null,null,null,"VQFN-22",{"$f":"CHOOSE(VARIANT, \"LM76005QRNPRQ1\", \"LM76005\", \"LM76005\", \"LM76005\", \"LM76005\")","v":"LM76005QRNPRQ1"},"TI"]
[]
[]
["NOTES:"]
["** Effective input and output capacitances should be appropriately derated for applied voltage and temperature, particularly with ceramics **"]

{"sheet":"EVMs","index":2,"n_rows":6,"n_cols":2,"rows_kept":6,"cut":false,"hidden":true,"merged":[[0,0,0,16]]}
["LM63460-Q1 & LM64460-Q1 Converter Design Tool"]
[]
[]
[]
[]
[null,"LM64460EVM-2MHZ (BSR173) PCB Layout"]

{"sheet":"Variable Management","index":3,"n_rows":349,"n_cols":27,"rows_kept":349,"cut":false,"hidden":true,"merged":[[4,4,4,7],[0,0,0,8]]}
["EXCEL Variables Names/Calculations"]
[null,"Input from user ="]
[null,"Output ="]
[null,"Constant"]
["Variable Name","Value","STD Units",null,"Notes",null,null,null,"Iteration"]
["Step 1: Operational Specs"]
["VIN_min",{"$f":"'Design the Converter'!E6","v":18},"V","Minimum input voltage",null,null,null,null,1]
["VIN_nom",{"$f":"'Design the Converter'!E7","v":24},"V","Nominal input voltage",null,null,null,null,null,null,"Use CFF",1,null,"LM64460-Q1 3.3Vout",{"$f":"IF(Vout = 3.3, 1, 0)","v":0},null,null,null,null,"Dual  Outputs",1,null,"FPWM",1,null,{"$f":"CHOOSE(SCH_MODE, \"Bode Plot (Ch1)\", \"Bode Plot - 2 Ph\", \"Bode Plot - 3 Ph\", \"Bode Plot - 4 Ph\")","v":"Bode Plot (Ch1)"},1]
["VIN_max",{"$f":"'Design the Converter'!E8","v":60},"V","Maximum input voltage",null,null,null,null,null,null,"No CFF",2,null,"LM64460-Q1 5Vout",{"$f":"IF(Vout = 5, 1, 0)","v":1},null,null,null,null,"Single Output – 2  Phases",2,null,"DEM",2,null,{"$f":"IF(MODE=1, \"Bode Plot (Ch2)\", \"N/A - Do Not Use\")","v":"Bode Plot (Ch2)"},2]
[null,null,null,null,null,null,null,null,null,null,null,2,null,"LM64460 Fixed Vout",{"$f":"IF(AND(GPN=3,Vout=3.3),3,IF(AND(GPN=3,Vout=5),2,1))","v":1},"1 = No, 2 = 5V, 3 = 3.3V",null,null,null,"Single Output – 3  Phases",3,null,"FPWM/DEM",2,null,"BODE_PLOT_TYPE",1]
["Vout",{"$f":"'Design the Converter'!E9","v":5},"V","Output voltage",null,null,null,null,null,null,"NO_FF_CAP",{"$f":"IF(L10=2, TRUE, FALSE)","v":true},null,null,{"$f":"AND(GPN=3, OR(O8,O9))","v":false},null,null,null,null,"Single Output – 4  Phases",4]
["Iout",{"$f":"'Design the Converter'!E10","v":3.5},"A","Output current",null,"Iout-max",{"$f":"CHOOSE(GPN, 6, 6)","v":6},"A",1,null,null,null,null,null,null,null,null,null,null,"Single/Dual Yes/No",1]
[null,null,null,null,null,null,null,null,1,null,null,null,null,null,null,null,null,null,null,"MODE (Single/Dual), DUAL = 1, SINGLE = 2",{"$f":"IF(U12=1, 1, 2)","v":1},null,"External BIAS",1]
["Rout",{"$f":"Vout/Iout","v":1.4285714285714286},"W","Load resistance",null,null,null,null,null,null,null,null,null,"LM63460-Q1 AUTO",1,null,null,null,null,"SINGLE OUTPUT (1 = YES)",{"$f":"IF(U12=1, 2, 1)","v":2},null,"No External BIAS",2]
["Pout",{"$f":"Vout*Iout","v":17.5},"W","Output power",null,null,null,null,null,null,null,null,null,"LM63460-Q1 FPWM",2,null,null,null,null,"Number of Phases",{"$f":"SCH_MODE","v":1},null,"Ext_VCC",1]
[null,null,null,null,null,null,null,null,null,null,null,null,null,"LM64460-Q1",3]
["Efficiency",0.9,null,"Estimate of efficiency",null,null,null,null,null,null,null,null,null,"LM64460-Q1 5V",4]
["Pin",{"$f":"Pout/Efficiency","v":19.444444444444443},"W","Calculate input power assuming finite efficiency",null,null,null,null,null,null,null,null,null,"LM64460-Q1 3.3V",5]
[null,null,null,null,null,null,null,null,null,null,null,"GPN",null,{"$f":"CHOOSE(GPN, \"LM76005-Q1\", \"LM76003-Q1\", \"LM76002-Q1\")","v":"LM76005-Q1"},1,null,null,null,null,null,null,null,"2.2 MHz Fsw Setting",1]
["Iin_Vinmin",{"$f":"Pin/VIN_min","v":1.0802469135802468},"A",null,null,null,null,null,null,null,null,null,null,null,null,null,null,null,null,null,null,null,"440 kHz Fsw Setting",2]
["Iin_Vinnom",{"$f":"Pin/VIN_nom","v":0.81018518518518512},"A","Input currents at min, nom, max Vin",null,null,null,{"$f":"AND(OSC=1, OR(Fsw/1000>2530, Fsw/1000<1800))","v":false},null,null,"Variant","VARIANT",null,{"$f":"CHOOSE(VARIANT, \"LM63460AAS\",\"LM63460AFS\", \"LM64460APP\", \"LM64460BPP\", \"LM63460CPP\")","v":"LM63460AAS"},{"$f":"IF(AND(GPN=3,Vout=5),4,IF(AND(GPN=3,Vout=3.3),5,GPN))","v":1},null,null,null,null,null,null,null,"OSC",2]
["Iin_Vinmax",{"$f":"Pin/VIN_max","v":0.32407407407407407},"A",null,null,null,null,{"$f":"AND(OSC=2, OR(Fsw/1000>500, Fsw/1000<300))","v":false}]
[null,null,null,null,null,null,null,{"$f":"OR(H21,H22)","v":false}]
["Fsw",{"$f":"'Design the Converter'!E11*1000","v":400000},"Hz","Nominal switching frequency - determines RT resistor"]
["RT resistor to AGND",{"$f":"38400/((Fsw/1000)-14.33)","v":99.566987320766458},"kΩ",null,null,null,null,null,1]
["Tsw",{"$f":"1/Fsw","v":2.5000000000000002E-6},"sec","Switching period"]
["Max crossover frequency = 20% Fsw",{"$f":"Fsw*0.2/1000","v":80},"kHz",null,null,"Min Crossover",10,null,null,null,"Adjustable",1]
["Vref",1,"V","Reference voltage",null,null,null,null,null,null,"5V",2]
["Rt",{"$f":"'Standard Value Calculator'!L12/1000","v":100},"kΩ","Frequency set resistor",null,{"$f":"IF(OR((Fsw=440000),(Fsw=2200000)),\"N/A\",Rfadj/1000)","v":0.1},null,null,null,null,"3.3V",3]
[null,null,null,null,null,null,null,null,null,null,"Adjustable_NoRT",4]
[null,null,null,null,null,null,null,null,null,null,"5V_NoRT",5]
[null,null,null,null,null,null,null,null,null,null,"3.3V_NoRT",6]
["Step 2: Buck Inductor","Channel 1",null,null,null,null,null,null,null,null,"Schematic setting",{"$f":"IF(No_RT, IF(Vout=3.3, 6, IF(Vout=5, 5, 4)),IF(Vout=3.3, 3, IF(Vout=5, 2, 1)))","v":2}]
["Don1",{"$f":"Vout/VIN_nom","v":0.20833333333333334},null,null,null,"Ideal Duty Cycle at VIN(nom)"]
["Doff1",{"$f":"1-34:34","v":0.79166666666666663},null,null,null,"Ideal 1- Duty Cycle at VIN(nom)"]
[]
["D_Vinmin",{"$f":"Vout/VIN_min","v":0.27777777777777779}]
["D_Vinnom",{"$f":"Vout/VIN_nom","v":0.20833333333333334}]
["D_Vinmax",{"$f":"Vout/VIN_max","v":8.3333333333333329E-2}]
[]
["L_Vinnom",{"$f":"(VIN_nom-Vout)*D1_Vinnom/(Fsw*Iout*0.35)","v":8.0782312925170073E-6},"H",null,null,"Calculated inductance for 35% ripple at VIN(nom)"]
["L_slopecomp",null,"H",null,null,"Calculated inductance based on one times inductor downslope"]
[]
["Lopt",{"$f":"B41","v":8.0782312925170073E-6},"H",null,null,"min of calculated inductances at VIN(min) and VIN(nom)"]
["L_actual_TPSM63602-03",{"$f":"-0.0238*Iout^2-0.0868*Iout+2.0073","v":1.4119499999999998},"uH",null,null,"Calculate TOKO chip inductance based on entered load current value"]
["L_actual_TPSM63604-06",{"$f":"-0.1304*Iout+2.32","v":1.8635999999999999},"uH",null,null,"Calculate MagLayers inductance based on entered load current value"]
[]
["Lo",{"$f":"'Design the Converter'!E17*0.000001","v":6.7999999999999993E-6},"H",null,null,"Chosen inductance"]
["Rdcr",{"$f":"'Design the Converter'!E18/1000","v":2.7E-2},"W",null,null,"Chosen inductor DCR"]
[]
["Don2",{"$f":"(Vout+Iout*(Rdcr+Rdson2))/(Vin+Iout*(Rdson2-Rdson1))","v":0.21815970984716662}]
["Doff2",{"$f":"1-_Don2","v":0.78184029015283341}]
[]
["D_Vinmin_2",{"$f":"(Vout+Iout*(Rdcr+Rdson2))/(VIN_min+Iout*(Rdson2-Rdson1))","v":0.29149275890080956},null,{"$f":"Vout/VIN_min","v":0.27777777777777779},null,"Duty cycles adjusted for DCR/Rdson voltage drops"]
["D_Vinnom_2",{"$f":"(Vout+Iout*(Rdcr+Rdson2))/(VIN_nom+Iout*(Rdson2-Rdson1))","v":0.21815970984716662},null,{"$f":"Vout/VIN_nom","v":0.20833333333333334}]
["D_Vinmax_2",{"$f":"(Vout+Iout*(Rdcr+Rdson2))/(VIN_max+Iout*(Rdson2-Rdson1))","v":8.6934727942589329E-2},null,{"$f":"Vout/VIN_max","v":8.3333333333333329E-2},null,{"$f":"(Ts-0.000000085)/Ts","v":0.96599999999999997},"Dmax = [Ts-toff(min)]/Ts"]
[]
[]
["Iripple_Vinmin",{"$f":"(VIN_min-Vout-Iout*(Rdcr+Rdson1))*D1_Vinmin_2/(Fsw*Lf)","v":1.3552805792055471},"A",{"$f":"B59/Iout","v":0.38722302263015634},null,"Ripple calculations include DCR and Rdson"]
["Iripple_Vinnom",{"$f":"(VIN_nom-Vout-Iout*(Rdcr+Rdson1))*D1_Vinnom_2/(Fsw*Lf)","v":1.4955569962004385},"A",{"$f":"B60/Iout","v":0.42730199891441101},null,"% ripple current at Vin-nom"]
["Iripple_Vinmax",{"$f":"(VIN_max-Vout-Iout*(Rdcr+Rdson1))*D1_Vinmax_2/(Fsw*Lf)","v":1.746573018571584},"A",{"$f":"B61/Iout","v":0.49902086244902399},null,"Max inductor ripple current - it's at Vin-max"]
[]
["Iinductor_rms_Vinmin",{"$f":"SQRT(Iout^2+(Iripple_Vinmin^2)/12)","v":3.5217986106577666},"A"]
["Iinductor_rms_Vinnom",{"$f":"SQRT(Iout^2+(Iripple_Vinnom^2)/12)","v":3.5265267465416552},"A"]
["Iinudctor_rms_Vinmax",{"$f":"SQRT(Iout^2+(Iripple_Vinmax^2)/12)","v":3.5361292080135951},"A"]
[]
[]
["Core loss estimate - Vin(nom)",{"$f":"'Design the Converter'!E23","v":0.1},"W"]
[]
[]
["Inductor copper temperature",125,"°C"]
["Inductor DCR at hot",{"$f":"Rdcr*(1+Ltc*(B71-25))*1000","v":37.610999999999997},"mW"]
[]
[]
["Step 2b: Sense Resistors, Slope Comp, Current Limit"]
[]
["Ilimit_inductor_Vinmin",{"$f":"Ipk_OCP_Vinmin","v":6.8},"A",null,null,"Peak inductor current at current limit inception"]
["Ilimit_inductor_Vinnom",{"$f":"Ipk_OCP_Vinmin","v":6.8},"A"]
["Ilimit_inductor_Vinmax",{"$f":"Ipk_OCP_Vinmin","v":6.8},"A"]
[]
["CS threshold_min",6.8000000000000005E-2,"V","not applicable here"]
["CS threshold",7.4999999999999997E-2,"V"]
["CS threshold_max",8.2000000000000003E-2,"V"]
[]
["Rs",0.01,"W",null,null,"Current sense resistance Rs = high-side MOSFET Rdson"]
[]
["Current limit setpoint - peak - Vin(min)",6.8,"A",null,null,"Peak current limit (10.3A trimmed at ATE minus slope comp contribution) = min inductor sat current at hot"]
["Current limit setpoint - peak - Vin(nom)",6.8,"A"]
["Current limit setpoint - peak - Vin(max)",6.8,"A"]
[]
["Iout_OCP_Vinmin",{"$f":"Ipk_OCP_Vinmin-Iripple_Vinmin/2","v":6.1223597103972267},"A",null,null,"Current limit setpoints (i.e. IOUT) assuming no CS delay"]
["Iout_OCP_Vinnom",{"$f":"Ipk_OCP_Vinnom-Iripple_Vinnom/2","v":6.0522215018997807},"A"]
["Iout_OCP_Vinmax",{"$f":"Ipk_OCP_Vinmax-Iripple_Vinmax/2","v":5.9267134907142083},"A"]
[]
["Ipk_full-load_Vinmin",{"$f":"Iout+Iripple_Vinmin/2","v":4.177640289602774},"A"]
["Ipk_full-load_Vinnom",{"$f":"Iout+Iripple_Vinnom/2","v":4.2477784981002191},"A"]
["Ipk_full-load_Vinmax",{"$f":"Iout+Iripple_Vinmax/2","v":4.3732865092857924},"A"]
[]
[]
["Step 3: Output Capacitor"]
["Icoutrms_VINmin",{"$f":"Iripple_Vinmin/SQRT(12)","v":0.39123580361589733},"A",null,null,"Output cap RMS current"]
["Icoutrms_VINnom",{"$f":"Iripple_Vinnom/SQRT(12)","v":0.43173011717237564},"A"]
["Icoutrms_VINmax",{"$f":"Iripple_Vinmax/SQRT(12)","v":0.50419220121582065},"A"]
["Max Cout rms current",{"$f":"MAX(B101:B103)","v":0.50419220121582065},"A"]
[]
["Vripple1",{"$f":"'Design the Converter'!E26/1000","v":2.4E-2},"V",null,null,"Output voltage ripple spec(pk-pk)"]
[]
["Output Ripple Spec (pk-pk)",{"$f":"Vo1_ripple*1000","v":24},"mV",null,null,"Vout ripple spec at Vin(nom)"]
[]
["Coutmin",{"$f":"Iripple_Vinnom/(Fsw*8*Vo1_ripple)","v":1.9473398388026542E-5},"F",null,null,"Minimum output capacitnace",null,{"$f":"Vo2_ripple","v":0},1]
["Reported Coutmin",{"$f":"IF(Cout_min*1000000<2, 2.2,Cout_min*1000000)","v":19.473398388026542},"uF"]
["Cout",{"$f":"'Design the Converter'!E30/1000000","v":1.25E-4},"F",null,null,"Chosen output capacitance",null,null,1]
["Resrmax",{"$f":"SQRT((Vo1_ripple/Iripple_Vinnom)^2-(1/(Fsw*Cout*8))^2)","v":1.5851602758806663E-2},"W",null,null,"Max ESR before ripple exceeds Vripple1",null,null,1]
[]
["Reported Cout ESR max",{"$f":"IF(OR(CoutEsrMax>0.3, CoutEsrMax<0, (ISERROR(CoutEsrMax))), \"N/A\", CoutEsrMax*1000)","v":15.851602758806663},"mΩ"]
["CoutEsr",{"$f":"'Design the Converter'!E32/1000","v":2E-3},"W",null,null,"Chosen ESR",null,null,1,null,{"$f":"ISERROR(CoutEsrMax)","v":false},{"$f":"ISERROR(B115)","v":false}]
["Vripple",{"$f":"Iripple_Vinnom*SQRT(Cout_ESR^2+(1/(8*Fsw*Cout))^2)","v":4.7881186254166474E-3},"Vp-p",null,null,null,null,null,null,null,null,{"$f":"OR(CoutEsrMax>0.3,CoutEsrMax<0)","v":false}]
[null,null,null,null,null,null,null,null,null,null,{"$f":"OR(TRUE, FALSE, TRUE)","v":true}]
["Step 4: Input Capacitor"]
[]
["Icinrms_VINmin",{"$f":"SQRT(D1_Vinmin_2*(Iout^2*(1-D1_Vinmin_2)+Iripple_Vinmin^2/12))","v":1.6045390051353206},"A",null,null,"Calculate input cap rms current",null,null,null,null,null,null,null,"A"]
["Icinrms_VINnom",{"$f":"SQRT(D1_Vinnom_2*(Iout^2*(1-D1_Vinnom_2)+Iripple_Vinnom^2/12))","v":1.4594852196030315},"A"]
["Icinrms_VINmax",{"$f":"SQRT(D1_Vinmax_2*(Iout^2*(1-D1_Vinmax_2)+Iripple_Vinmax^2/12))","v":0.997230615350993},"A"]
["Max Cin rms current",{"$f":"MAX(B121:B123)","v":1.6045390051353206},"A"]
[]
["Icinrms - max at D = 0.5",{"$f":"Iout/2","v":1.75},"A"]
["Final result",{"$f":"IF(VIN_min<2*Vout, Iout/2, B121)","v":1.6045390051353206},"A","…report this"]
[]
["Vinripple1",{"$f":"'Design the Converter'!E37/1000","v":0.12},"Vp-p",null,null,"Input voltage ripple spec (pk-pk)"]
[null,null,null,null,null,{"$f":"Number_of_Phases","v":1}]
["Cinmin_Vinmax",{"$f":"Iout*D1_Vinmax*(1-D1_Vinmax)/(Vinripple1*Fsw)","v":5.5700231481481466E-6},"F",null,null,"Calculate cap at Vinmax and 50% duty cycle (Vin = 2*Vout)"]
["Cinmin_50%D",{"$f":"Iout*0.5*(1-0.5)/(Vinripple1*Fsw)","v":1.8229166666666668E-5},"F",null,null,"Buck 50% typically worst case"]
["Cinmin",{"$f":"IF(VIN_max<2*Vout, B131,B132)","v":1.8229166666666668E-5},"F"]
["Reported Cinmin",{"$f":"IF(Cinmin*1000000<4.7, 4.7,Cinmin*1000000)","v":18.229166666666668},"uF",null,null,"…report this"]
["Cin",{"$f":"'Design the Converter'!E39/1000000","v":4.6999999999999997E-5},"F",null,null,"Input capacitance"]
["CinEsrMax_Vinmax",{"$f":"-(Iout*D1_Vinmax*(1-D1_Vinmax)/(Cin*Fsw)-Vinripple1)/(Iout+Iripple_Vinmax/2)","v":2.4187453549636136E-2},"W"]
["CinEsrMax_50%D",{"$f":"-(Iout*0.5*(1-0.5)/(Cin*Fsw)-Vinripple1)/(Iout+Iripple_Vinmax/2)","v":1.6796852127693565E-2},"W",null,null,"Calculate ESR at Vinmax and 50% duty cycle (Vin = 2*Vout)"]
["CinEsrMax",{"$f":"IF(VIN_max<2*Vout, B136,B137)","v":1.6796852127693565E-2},"W"]
["Reported Cin ESR max",{"$f":"IF(OR(CinEsrMax>0.3, CinEsrMax<0), \"N/A\",CinEsrMax*1000)","v":16.796852127693565},"mΩ",null,null,"…report this"]
["RCinEsr",{"$f":"'Design the Converter'!E41/1000","v":2E-3},"W",null,null,"Input capacitance series resistance (ESR)"]
[]
["Vinripple2_Vinmax",{"$f":"Iout*D1_Vinmax_2*(1-D1_Vinmax_2)/(Cin*Fsw)+(Iout +Iripple_Vinmax/2)*RCinEsr","v":2.352422108083119E-2},"Vp-p"]
["Vinripple2_50%D",{"$f":"Iout*0.5*(1-0.5)/(Cin*Fsw)+(Iout +Iripple_Vinmax/2)*RCinEsr","v":5.5289126210060949E-2},"Vp-p",null,null,"Calculate ripple at Vinmax and 50% duty cycle (Vin = 2*Vout)"]
["Vinripple2",{"$f":"IF(VIN_max<2*Vout, B142,B143)","v":5.5289126210060949E-2},"Vp-p",null,null,"…report highest of these"]
[]
[null,{"$f":"Iout*D1_Vinmax_2*(1-D1_Vinmax_2)/(Cin*Fsw)","v":1.4777648062259605E-2},"Vp-p"]
[]
["Step ?: Other Components - Soft start, SYNC, PG"]
[]
["RPG",100,"kΩ","PGOOd pull-up resistance"]
["RSYNC",100,"W","SYNC termination resistance"]
["Soft-start time",{"$f":"'Design the Converter'!E56","v":11},"ms"]
["Css",{"$f":"2*B152*0.000000001","v":2.2000000000000002E-8},"F","Soft-start capacitance based on 2uA charging current to 1V"]
["Css - std value",{"$f":"'Standard Value Calculator'!L22*1000000000","v":22},"nF","Standard value for Css"]
[]
["Step 5: Feedback Network and Internal Compensation"]
["Pi",3.1415926500000002,null,"p"]
["CS Amp Gain (effective value)",3.2759999999999998,null,null,null,"Effective CS gain - depending on control architecture = 1/(Imod*Rdson_HS*0.73) = 1/(6*1.7*41mΩ*0.73)"]
["Ri",0.2,"W","Use slightly higher value to match bench",null,"Current Sense effective resistance = shunt resistor Rs * CS amp gain = 0.1343Ω"]
[]
["Se_ext",{"$f":"B165/Ri*1000","v":2080000},"A/s",null,null,"Slope Comp Slope - referred to inductor current"]
["Sn",{"$f":"(Vin-Vout)/Lf","v":2794117.6470588236},"A/s",null,null,"On-time Slope"]
["Sf",{"$f":"Vout/Lf","v":735294.11764705891},"A/s",null,null,"Off-time Slope"]
[]
["Se_int",{"$f":"5.2*Ri*Fsw/1000","v":416},"mV/μs",null,null,"Slope Comp Slope - referred to IC"]
["Sn_int",{"$f":"Sn*Ri/1000","v":558.82352941176475},"mV/μs",null,null,"Upslope"]
["Sf_int",{"$f":"Sf*Ri/1000","v":147.05882352941177},"mV/μs",null,null,"Downslope"]
[]
["mc_buck",{"$f":"1+Se_ext/Sn","v":1.7444210526315789},null,null,null,"mc = 1 + Se/Sn for peak current-mode buck"]
["k_buck",{"$f":"mc_buck*(1-D1_Vinnom_2)","v":1.3638586619381847},null,null,null,"mc*(1-d)"]
[]
["mc",{"$f":"1+Se_ext/Sn","v":1.7444210526315789}]
["k",{"$f":"mc_buck*(1-D1_Vinnom_2)","v":1.3638586619381847}]
["Q",{"$f":"1/Pi/(k-0.5)","v":0.36847449770699886},null,null,null,"1/(Pi*(k-0.5))",null,"Q = 2/Pi = 0.636 gives ideal one-cycle damping"]
[]
["Error Amp (EA)"]
["gm",{"$f":"33/1000000","v":3.3000000000000003E-5},"S",null,null,"Error amp transconductance"]
["GBW",20,"MHz",null,null,"EA gain-bandwidth product"]
["Cbw",{"$f":"gm/(2*Pi*GBW*1000000)","v":2.6260565640169807E-13},"F",null,null,"EA effective bandwidth limiting capacitance = gm/(2*Pi*GBW)"]
[]
["RoEA",{"$f":"30000000","v":30000000},"W",null,null,"EA output resistance"]
["AEA",{"$f":"gm*RoEA","v":990.00000000000011},"V/V",null,null,"EA DC gain = gm*RoEA"]
["Afb",{"$f":"Vref/Vout","v":0.2},"V/V",null,null,"Feedback gain from Vout to FB"]
["Acs",{"$f":"1/Ri","v":5},null,null,null,"Acs = 1/Ri"]
["Am_buck",{"$f":"(Ro/Number_of_Phases)/Ri/((1+Ro/Number_of_Phases*(k-0.5)/(Fsw*Lf)))","v":4.9135456903990313}]
["Am",{"$f":"Ro/Ri/((1+Ro*(k-0.5)/(Fsw*Lf)))","v":4.9135456903990313},null,null,null,"Buck modulator gain"]
[]
["Scaling factor to calculate Rcomp - buck",{"$f":"2*Pi*Ri/gm","v":38079.910909090911},null,null,null,"2*Pi*Ri/gm -- scaling factor to calculate Rcomp given desired buck crossover frequency"]
["DC Gain is Adc = AEA*Afb*Am"]
[]
["Rout",{"$f":"Rout","v":1.4285714285714286},"W",null,null,"Output Resistance (Load)"]
[]
["Fp_load_buck",{"$f":"1/(2*Pi*Ro*Cout)+(k-0.5)/(2*Pi*Fsw*Lf*Cout)","v":1295.642318619256},"Hz",null,null,"Buck dominant pole frequency -- note slope comp influence"]
["Fp_dominant",{"$f":"Fload_u","v":1295.642318619256},"Hz"]
["Cbw",{"$f":"Cbw","v":2.6260565640169807E-13},"F",null,null,"Cbw"]
["Fp_EA",{"$f":"1/(2*Pi*(RoEA+Rcea1_u)*Cc1ea_u)","v":148.60405534431035},"Hz",null,null,"Error Amp LF pole -- related to amplifier ouptut resistance and comp cap"]
["Fp_HF",{"$f":"1/(2*Pi*Rcea1_u*(Cc2ea_u+Cbw))","v":275562.72605040763},"Hz",null,null,"Error Amp HF pole cancels zero related to Output Cap ESR"]
["Fesr",{"$f":"1/(2*Pi*Cout*Cout_ESR)","v":636619.77309502545},"Hz",null,null,"Cout ESR zero frequency"]
["F_mod",{"$f":"Fsw/2","v":200000},"Hz",null,null,"Zero-order sample-and-hold effects of current-mode control modeled as pole at Fsw/2"]
["Fz_ff",{"$f":"IF(NO_FF_CAP=TRUE, 1000000000, 1/(2*Pi*Rfb1_*Cff_u*0.000000000001))","v":1000000000},"Hz",{"$f":"Fz_ff/1000","v":1000000},"kHz"]
["Fp_ff",{"$f":"IF(NO_FF_CAP=TRUE, 1000000000, 1/(2*Pi*Rfb4_u*Cff_u*0.000000000001))","v":1000000000},"Hz",{"$f":"Fp_ff/1000","v":1000000},"kHz"]
[]
["Desired Crossover Frequency",{"$f":"'Design the Converter'!E28*1000","v":40000},"Hz"]
["Cout - for the Fc spec",{"$f":"Rcea1_u/Fcross/(2*Pi*Ri/(gm*Afb))*1000000","v":78.781696920509404},"uF",null,null,"Output cap to meet the crossover frequeny spec"]
["Rcea1",{"$f":"Fcross*Cout*2*Pi*Ri/(gm*Afb)","v":951997.77272727259},"W",null,null,"This component will largely determine the crossover frequency",null,null,null,null,{"$f":"Fcross/Fp_dominant/(gm*Afb*Am)","v":951997.77272727282}]
["Cc1ea, Cc3ea",{"$f":"10/(Rcea1*Fcross*2*Pi)","v":4.1794988347979809E-11},"F",null,null,"This along with Rcea1 will set a zero at Fcrossover/5 to optimize phase margin"]
["Cc2ea, Cc4ea",{"$f":"MAX(1/(Rcea1*2*Pi*Fesr)-Cbw, 1/(Rcea1*2*Pi*(Fsw/2))-Cbw)","v":5.7329411055789829E-13},"F",null,null,"This along with Rcea1 places a pole at the output cap ESR zero"]
[]
["Chosen Compensation Components from the standard value sheet"]
["Rcea1_u",600000,"W",null,null,{"$f":"1/(Rcea1*2*Pi*(Fsw/2))-Cbw","v":5.7329411055789829E-13}]
["Cc1ea_u",3.5000000000000002E-11,"F"]
["Cc2ea_u",7.0000000000000005E-13,"F"]
[]
["Resulting Pole/Zero Locations",null,null,null,null,{"$f":"Cout","v":1.25E-4},{"$f":"Cout_ESR","v":2E-3}]
["Fz1",{"$f":"1/(2*Pi*Rcea1_u*Cc1ea_u)","v":7578.8068225598272},"Hz",null,null,"This zero is set at or close to the dominant load pole"]
["Fp2",{"$f":"1/(2*Pi*Rcea1_u*(Cc1ea_u*(Cc2ea_u+Cbw)/(Cc1ea_u+Cc2ea_u+Cbw)))","v":283141.53287296748},"Hz",null,null,"This pole cancels the zero from the Output Cap ESR"]
[]
["Rfb1",{"$f":"'Design the Converter'!E46*1000","v":100000},"W",null,null,"Lower Feedback Resistance - chosen by user"]
["Rfb2",{"$f":"IF(Vout=Vref, \"N/A\", Vref/(Vout-Vref)*B218)","v":25000},"W",{"$f":"Rfb2_u","v":24900},null,"Upper Feedback Resistance"]
["Rfb2_u",{"$f":"IF(Vout=Vref,\"N/A\",'Standard Value Calculator'!L11)","v":24900},"W",null,null,"Std Value Upper Feedback Resistance"]
["Cff",{"$f":"1/(2*Pi*200000)/Rfb1_","v":7.9577471636878189E-12},"F",{"$f":"1/(1/Rfb1_+1/Rfb2_u)","v":19935.948759007206},"W","Based on a 200kHz zero frequency"]
["Cff_u",{"$f":"IF('Design the Converter'!E48<0.1, 0.1, 'Design the Converter'!E48)","v":10},"pF"]
[]
["Fcross based on datasheet equation",{"$f":"15.46/(Vout*Cout)","v":24736},"Hz"]
[]
[]
["Step 6: UVLO Divider"]
["VIN UVLO turn-on voltage",{"$f":"'Design the Converter'!E51","v":12},"V"]
["Renb",{"$f":"'Design the Converter'!E52*1000","v":100000},"W"]
["Rent",{"$f":"(B228/1.218 - 1)*Renb","v":885221.6748768473},"W"]
["Rent_u",{"$f":"'Standard Value Calculator'!L7","v":887000},"W"]
["Actual VIN UVLO turn-on voltage",{"$f":"1.218/Renb*(Renb+Rent1_u)","v":12.021660000000001},"V"]
["Actual VIN UVLO turn-off voltage",{"$f":"0.99/Renb*(Renb+Rent1_u)","v":9.7713000000000001},"V"]
[]
["Step 7: Efficiency"]
["VAR",0]
["Design"]
["Ta",{"$f":"'Design the Converter'!E13","v":25},"°C","Ambient Temperature"]
["Components"]
["LTc",{"$f":"3930/1000000","v":3.9300000000000003E-3},"%/°C","Inductor DCR Temp Co"]
["θCA",22,"°C/W","Inductor Core-to-Ambient Thermal Resistance"]
["RCinEsr",{"$f":"RCinEsr","v":2E-3},"W","Input Capacitor ESR"]
[]
["Controller Characteristics"]
["VCC",3.3,"V"]
["Top Driver"]
["RdsonDRT",0.5,"W","Drain-Source Resistance of Pullup High-side FET Driver"]
["RdsonDRT2",0.5,"W","Drain-Source Resistance of Pulldown High-side FET Driver"]
["Bottom Driver"]
["RdsonDRB",0.5,"W","Drain-Source Resistance of Pullup Low-side FET Driver"]
["RdsonDRB2",0.5,"W","Drain-Source Resistance of Pulldown Low-side FET Driver"]
["Deadtime"]
["Deadtime",8.0000000000000005E-9,"s","Total Deadtime",null,null,"8ns"]
["IQ"]
["IQ ",3.4999999999999997E-5,"A","Quiescent Current of LM5143-Q1 Controller (One channel disabled)"]
[]
["High- & low-side MOSFETs - Ch1","Q1: high-side",null,"Q2: low-side"]
["Rdson",{"$f":"'MOSFET Parameters'!E6/1000","v":7.3999999999999996E-2},"W",{"$f":"'MOSFET Parameters'!F6/1000","v":3.1E-2},"W","Drain-Source Resistances of Channel 1 FETs"]
["RdsonTopTc",{"$f":"4000/1000000","v":4.0000000000000001E-3},"%/°C",4.0000000000000001E-3,"%/°C","Drain-Source Resistance Temp Co"]
["Qg",{"$f":"'MOSFET Parameters'!E7/1000000000","v":4.0999999999999995E-9},"C",{"$f":"'MOSFET Parameters'!F7/1000000000","v":8.5999999999999993E-9},"C","Gate Charge at VCC = 5V"]
["Qgd",{"$f":"'MOSFET Parameters'!E8/1000000000","v":1.6999999999999999E-9},"C",{"$f":"'MOSFET Parameters'!F8/1000000000","v":8.5600000000000002E-9},"C","Gate to Drain Charge"]
["Qgs",{"$f":"'MOSFET Parameters'!E9/1000000000","v":2.3900000000000002E-9},"C",{"$f":"'MOSFET Parameters'!F9/1000000000","v":5.7999999999999998E-9},"C","Gate to Source Charge"]
["Qoss",{"$f":"'MOSFET Parameters'!E10/1000000000","v":0},"C",{"$f":"'MOSFET Parameters'!F10/1000000000","v":6.8800000000000002E-9},"C","Output Charge"]
["Coss",{"$f":"'MOSFET Parameters'!E11/1000000000000","v":5.3000000000000003E-10},"F",{"$f":"'MOSFET Parameters'!F11/1000000000000","v":5.09E-10},"F","Output Capacitance"]
["Rgate",{"$f":"'MOSFET Parameters'!E12","v":0.158},"W",{"$f":"'MOSFET Parameters'!F12","v":0.24},"W","Gate Resistance"]
["Gfs",{"$f":"'MOSFET Parameters'!E13","v":100},"S",{"$f":"'MOSFET Parameters'!F13","v":100},"S","Transconductance"]
["Vth",{"$f":"'MOSFET Parameters'!E14","v":1.5},"V",{"$f":"'MOSFET Parameters'!F14","v":1.5},"V","Threshold Voltage"]
["Vsp",{"$f":"Vth_Q1+Iout/Gfs_Q1","v":1.5349999999999999},"V",{"$f":"Vth_Q2+Iout/Gfs_Q2","v":1.5349999999999999},"V","Switch Point Voltage of FETs"]
[]
["Vsd - Buck",{"$f":"'MOSFET Parameters'!E15","v":0.7},"V",{"$f":"'MOSFET Parameters'!F15","v":0.7},"V","Diode Forward Voltage of MOSFET Body diode"]
["QrrTop",null,"C",{"$f":"'MOSFET Parameters'!F16/1000000000","v":2.3000000000000001E-8},"C","Reverse Recovery Charge of Body Diode"]
["TrrTop",4.0000000000000001E-8,"s",4.0000000000000001E-8,"s","Reverse Recovery Time of Body Diode"]
["θJA-MOSFET",23,"°C/W",23,"°C/W","Junction-to-Ambient Resistance"]
[]
[]
["Controller"]
["θJACtrl",{"$f":"'Design the Converter'!E61","v":30},"°C/W",null,null,"Junction-to-ambient thermal resistance of controller"]
["Outputs"]
["Top FET"]
["Tr",{"$f":"(Qgd_Q1+Qgs_Q1/2)*(RdsonDRT+Rgate1)/(VCC-Vsp_Q1)","v":1.0792691218130314E-9},"s"]
["Tf",{"$f":"(Qgd_Q1+Qgs_Q1/2)*(RdsonDRT2+Rgate1)/(Vsp_Q1)","v":1.2409837133550491E-9},"s"]
[]
["IC Power Disipation","Value","Units"]
["Power Dis",{"$f":"'Efficiency Calculations'!BE109","v":0.91540319144740834},"W"]
["Temp rise",{"$f":"B284*ThetaJaCtrl","v":27.46209574342225},"°C"]
["Junction temperature",{"$f":"B285 + Ta","v":52.462095743422253},"°C"]
[]
["Current (switching)",{"$f":"(Qg_Q1+Qg_Q2)*Fsw+Iq","v":5.1149999999999998E-3},"A"]
["Qrr Current",{"$f":"Qrr_Q2*Fsw","v":9.1999999999999998E-3},"A"]
["Diode Current",{"$f":"C290/Vin","v":{"$error":"#NAME?"}},{"$f":"Deadtime*Fsw*(Ipp/2)*(Vsd_Q1+Vsd_Q2)","v":{"$error":"#NAME?"}}]
["Total Application Switching IQ",{"$f":"SUM(B288:B290)","v":{"$error":"#NAME?"}},"A"]
[]
["Low-side MOSFET/Diode"]
["Part Power"]
["Power Dis"]
[]
["SCHEMATIC LABELS"]
[{"$f":"\"RFBT = \"&'Design the Converter'!E46&\"kΩ\"","v":"RFBT = 100kΩ"},{"$f":"IF(VARIANT<4, 'Design the Converter'!E46&\" kΩ\", \"\")","v":"100 kΩ"},null,{"$f":"'Design the Converter'!E46&\"kΩ\"","v":"100kΩ"}]
[{"$f":"\"RFBB = \"&'Design the Converter'!E47&\"kΩ\"","v":"RFBB = 24.9kΩ"},{"$f":"IF(VARIANT<4, 'Design the Converter'!E47&\" kΩ\", \"\")","v":"24.9 kΩ"},null,{"$f":"'Design the Converter'!E47&\"kΩ\"","v":"24.9kΩ"}]
[{"$f":"\"CFF = \"&'Design the Converter'!E48&\"pF\"","v":"CFF = 10pF"},{"$f":"IF(VARIANT< 4, IF(NO_FF_CAP=TRUE,\"N/A\",IF(Cff_u>0.1,ROUND(Cff_u,1)&\" pF\",\"N/A\")), \"\")","v":"N/A"},null,{"$f":"IF(Cff_u>0, ROUND(Cff_u,1), \"N/A\")","v":10}]
[{"$f":"\"CSS = \"&Css_u&\"nF\"","v":"CSS = 22nF"},{"$f":"IF(Css_u > 12, Css_u&\" nF\", \"N/A\")","v":"22 nF"}]
[]
[{"$f":"\"RRT = \"&'Design the Converter'!E12&\"kΩ\"","v":"RRT = 100kΩ"},{"$f":"CHOOSE(GPN, 'Design the Converter'!E12&\" kΩ\",  'Design the Converter'!E12&\" kΩ\", \"\")","v":"100 kΩ"},null,{"$f":"'Design the Converter'!E12&\"kΩ\"","v":"100kΩ"},{"$f":"GPN","v":1}]
[]
[{"$f":"\"RENB = \"&'Design the Converter'!E52&\"kΩ\"","v":"RENB = 100kΩ"},{"$f":"'Design the Converter'!E52&\" kΩ\"","v":"100 kΩ"},null,{"$f":"'Design the Converter'!E52","v":100}]
[{"$f":"\"RENT = \"&Rent1_u/1000&\"kΩ\"","v":"RENT = 887kΩ"},{"$f":"Rent1_u/1000&\" kΩ\"","v":"887 kΩ"},null,{"$f":"Rent1_u/1000","v":887}]
["Rsync",{"$f":"100&\" Ω\"","v":"100 Ω"}]
[{"$f":"\"Lo = \"&'Design the Converter'!E17&\"µH\"","v":"Lo = 6.8µH"},{"$f":"'Design the Converter'!E17&\" µH\"","v":"6.8 µH"},null,{"$f":"IF(MODE = 1, 'Design the Converter'!J31&\"µH\", 'Design the Converter'!E17&\"µH\")","v":"µH"}]
[{"$f":"\"Rdcr = \"&Rdcr*1000&\"mΩ\"","v":"Rdcr = 27mΩ"},{"$f":"Rdcr*1000&\"mΩ\"","v":"27mΩ"},null,{"$f":"Rdcr*1000&\"mΩ\"","v":"27mΩ"}]
[]
[{"$f":"\"VOUT = \"&'Design the Converter'!E9&\" V\"","v":"VOUT = 5 V"},{"$f":"'Design the Converter'!E9&\"V\"","v":"5V"},null,{"$f":"IF(MODE=1, 'Design the Converter'!J10&\"V\", \"\")","v":"V"}]
[]
[{"$f":"\"COUT = \"&'Design the Converter'!$E$30&\" µF\"","v":"COUT = 125 µF"},{"$f":"ROUND('Design the Converter'!$E$30, 0)&\" µF\"","v":"125 µF"},null,{"$f":"IF(MODE=1, 'Design the Converter'!$J$40&\"µF\", ROUND('Design the Converter'!$E$30/Number_of_Phases, 0)&\"µF\")","v":"µF"}]
["Capacitance per component (Cout)",{"$f":"\"22µF\"","v":"22µF"}]
["# of output caps",{"$f":"ROUNDUP(Cout*1000000/22,0)&\" x\"","v":"6 x"}]
[]
["CIN",{"$f":"Cin*1000000&\" µF\"","v":"47 µF"},{"$f":"Cin*1000000&\" µF\"","v":"47 µF"}]
["Capacitance per component (Cin)",{"$f":"\"10 µF\"","v":"10 µF"}]
["# of input caps",{"$f":"ROUNDUP(Cin*1000000/10,0)&\" x\"","v":"5 x"}]
[]
[{"$f":"\"CVCC = 2.2µF\"","v":"CVCC = 2.2µF"},{"$f":"CHOOSE(GPN, \"\", \"\", \"2.2 µF\", \"2.2 µF\")","v":""},null,{"$f":"IF(MODE=1, 'Design the Converter'!$J$40&\"µF\", ROUND('Design the Converter'!$E$30/Number_of_Phases, 0)&\"µF\")","v":"µF"}]
[]
[{"$f":"\"RC1 = \"&Rcea1_u/1000&\"kΩ\"","v":"RC1 = 600kΩ"},{"$f":"ROUND(Rcea1_u/1000,2)&\" kΩ\"","v":"600 kΩ"}]
[{"$f":"\"CC1 = \"&Cc1ea_u*10^9&\"nF\"","v":"CC1 = 0.035nF"},{"$f":"Cc1ea_u*10^9&\" nF\"","v":"0.035 nF"}]
[{"$f":"\"CC2 = \"&IF(Cc2ea_u>0, Cc2ea_u*10^12&\"pF\", \"OPEN\")","v":"CC2 = 0.7pF"},{"$f":"IF(Cc2ea_u>0, ROUND(Cc2ea_u*10^12,1)&\" pF\", \"N/A\")","v":"0.7 pF"}]
[]
[{"$f":"\"gm = \"&$B$177*1000&\"mS\"","v":"gm = 0.033mS"},{"$f":"$B$177*1000&\"mS\"","v":"0.033mS"}]
[{"$f":"\"RoEA = \"&RoEA/1000000&\"MΩ\"","v":"RoEA = 30MΩ"},{"$f":"RoEA/1000000&\"MΩ\"","v":"30MΩ"}]
[{"$f":"\"GBW = \"&GBW&\"MHz\"","v":"GBW = 20MHz"},{"$f":"GBW&\"MHz\"","v":"20MHz"}]
[]
[{"$f":"\"RPGOOD = 100 kΩ\"","v":"RPGOOD = 100 kΩ"},{"$f":"CHOOSE(GPN, \"100 kΩ\", \"100 kΩ\", \"\", \"\")","v":"100 kΩ"}]
[{"$f":"\"RFB1 = \"&'Design the Converter'!E46&\"kΩ\"","v":"RFB1 = 100kΩ"},{"$f":"IF(VOUT_setting=1, 'Design the Converter'!E46&\"kΩ\", \"\")","v":{"$error":"#NAME?"}},null,{"$f":"'Design the Converter'!#REF!&\"kΩ\"","v":{"$error":"#REF!"}}]
[{"$f":"\"RFB2 = \"&IF(Vout=Vref,\"OPEN\",'Design the Converter'!E47&\"kΩ\")","v":"RFB2 = 24.9kΩ"},{"$f":"IF(VOUT_setting=1, IF(Vout=Vref,\"OPEN\",Rfb2_u/1000&\"kΩ\"), \"\")","v":{"$error":"#NAME?"}},null,{"$f":"IF(Vout2=Vref,\"OPEN\",Rfb4_u/1000&\"kΩ\")","v":"19.9359487590072kΩ"}]
[{"$f":"CHOOSE(BODE_PLOT_TYPE, \"Crossover Frequency = \"&ROUND('Stability Calculations'!Q4,1)&\" kHz\",  \"Crossover Frequency = \"&ROUND(#REF!,1)&\" kHz\")","v":"Crossover Frequency = 24.7 kHz"},{"$f":"CHOOSE(BODE_PLOT_TYPE, ROUND('Stability Calculations'!Q4,1)&\" kHz\", ROUND(#REF!,1)&\" kHz\")","v":"24.7 kHz"},null,{"$f":"'Stability Calculations'!Q4","v":24.69}]
[{"$f":"CHOOSE(BODE_PLOT_TYPE, \"Phase Margin = \"&ROUND('Stability Calculations'!Q5,0)&\"°\", \"Phase Margin = \"&ROUND(#REF!,0)&\"°\")","v":"Phase Margin = 55°"},{"$f":"CHOOSE(BODE_PLOT_TYPE, ROUND('Stability Calculations'!Q5,0)&\"°\", ROUND(#REF!,0)&\"°\")","v":"55°"}]
[]
["Full-load/high line efficiency",{"$f":"ROUND('Efficiency Calculations'!AZ109,1)&\"%\"","v":"92.8%"}]
["Half-load/mid-line efficiency",{"$f":"ROUND('Efficiency Calculations'!AZ59,1)&\"%\"","v":"94%"}]
[]
[]
["Rpgood","100 kΩ"]
[]
[]
["Rt",{"$f":"IF(No_RT,\"\", Rfadj&\"kΩ\")","v":"100kΩ"},{"$f":"Rfadj","v":100},{"$f":"Fsw","v":400000},{"$f":"\"kΩ\"","v":"kΩ"},{"$f":"OR((Fsw=440000),(Fsw=2200000))","v":false},null,{"$f":"OR(OR(AND(OSC=1, OR(Fsw/1000>2530, Fsw/1000<1800)), AND(OSC=2, OR(Fsw/1000>500, Fsw/1000<300))), OR((Fsw=440000),(Fsw=2200000)))","v":false}]
[]
["Blank out",{"$f":"IF(B76=\"y\",\"\",\"|\")","v":"|"}]
["OUTPUT CURRENT",{"$f":"'Design the Converter'!$E$10&\"A\"","v":"3.5A"},null,{"$f":"IF(MODE=1,'Design the Converter'!$J$11&\"A\",\"\")","v":"A"}]
["VIN",{"$f":"VIN_nom&\" V\"","v":"24 V"}]
["VIN range",{"$f":"VIN_min&\"V\"&\"...\"&VIN_max&\"V\"","v":"18V...60V"}]

{"sheet":"MOSFET Parameters","index":4,"n_rows":17,"n_cols":7,"rows_kept":17,"cut":false,"hidden":true,"merged":[]}
[]
[]
["MOSFET Parameters"]
[null,null,null,null,"Internal Power MOSFETs"]
[null,null,null,null,"High-side","  Low-side"]
[null,null,null,"On-State Resistance, RDS(on) ",74,31,"mΩ"]
[null,null,null,"Total Gate Charge, QG ",4.0999999999999996,8.6,"nC"]
[null,null,null,"Gate-Drain Charge, QGD ",1.7,8.56,"nC"]
[null,null,null,"Gate-Source Charge, QGS ",2.39,5.8,"nC"]
[null,null,null,"Output Charge, QOSS ",null,6.88,"nC"]
[null,null,null,"Output Capacitance, COSS ",530,509,"pF"]
[null,null,null,"Gate Resistance, RGATE ",0.158,0.24,"Ω"]
[null,null,null,"Transconductance, gFS ",100,100,"S"]
[null,null,null,"Gate-Source Miller Plateau Voltage, VTH ",1.5,1.5,"V"]
[null,null,null,"Body Diode Forward Voltage, VBD ",0.7,0.7,"V"]
[null,null,null,"Body Diode Rev Recovery Charge, QRR ",null,23,"nC"]
[null,null,null,"Thermal Resistance, θJA ",23,23,"°C/W"]

{"sheet":"Schematic Management","index":5,"n_rows":15,"n_cols":14,"rows_kept":15,"cut":false,"hidden":true,"merged":[]}
[{"$f":"VARIANT","v":1},null,null,null,null,null,null,null,null,null,null,null,null,"3.3V or 5V fixed (FB1/2)"]
[{"$f":"CHOOSE(VARIANT, \"LM63460_sch\", \"LM63460_sch\", \"LM64460_sch\", \"LM64460_fixed_VOUT_sch\", \"LM64460_fixed_VOUT_sch\")","v":"LM63460_sch"},null,null,null,null,null,null,null,null,null,null,null,null,"With/without VOUT connected to VCCX"]
[]
[]
[]
[]
[]
[]
[]
[]
[]
[]
[]
[]
[null," "]

{"sheet":"Stability Calculations","index":6,"n_rows":687,"n_cols":36,"rows_kept":687,"cut":false,"hidden":true,"merged":[[9,1,10,1],[1,0,1,3],[1,9,1,11],[1,12,1,14],[9,0,11,0],[10,6,10,7],[1,4,1,6],[9,2,9,7],[9,8,9,13],[10,2,10,3],[10,4,10,5],[10,8,10,9],[10,10,10,11],[10,12,10,13],[9,20,9,22],[10,14,10,15],[10,16,10,17],[9,27,9,28],[9,30,9,31],[10,18,10,19],[9,18,9,19]]}
[]
["Divider Network & EA Poles/Zeros",null,null,null,"Modulator",null,null,null,null,"Power Stage Poles/Zeros",null,null,"Complex Pole Pair",null,null,"Total System"]
[null,"Afb1",{"$f":"Afb","v":0.2},"V/V","Acs",{"$f":"Acs","v":5},"A/V","gm",{"$f":"gm","v":3.3000000000000003E-5},"z_ESR",{"$f":"Fesr","v":636619.77309502545},"Hz","p3",{"$f":"Fsw/2","v":200000},"Hz","Adc",{"$f":"Am*Afb*AEA","v":972.88204669900836},"V/V"]
[null,"EA zero, z1",{"$f":"Fz1_u","v":7578.8068225598272},"Hz","Am",{"$f":"Am","v":4.9135456903990313},"V/V",null,null,"p_dom",{"$f":"Fp_dominant","v":1295.642318619256},"Hz","pterm1",{"$f":"Q*pole3","v":73694.899541399776},null,"Crossover",{"$f":"AJ7","v":24.69},"kHz"]
[null,"EA pole, p1",{"$f":"Fp1_u","v":148.60405534431035},"Hz","Q",{"$f":"Q","v":0.36847449770699886},null,null,null,null,null,null,"pterm2",{"$f":"pole3^2","v":40000000000},null,"Phase Margin",{"$f":"AJ9","v":54.597845587783311},"°"]
[null,"Aea",{"$f":"AEA","v":990.00000000000011},"V/V","mc",{"$f":"mc","v":1.7444210526315789},null,"FF zero, z5",{"$f":"Fz_ff","v":1000000000},null,null,null,null,null,null,"radconv",{"$f":"180/Pi","v":57.295779578552292},null,null,null,{"$f":"AB13+AE13","v":59.761004611464962},null,null,null,null,null,null,{"$f":"Adc","v":972.88204669900836},null,null,null,null,null,null,"XOVER SEARCH"]
[null,"EA pole, p2",{"$f":"Fp2_u","v":275562.72605040763},"Hz","k",{"$f":"k","v":1.3638586619381847},null,"FF pole, p5",{"$f":"Fp_ff","v":1000000000},null,null,null,null,null,null,null,null,null,null,null,null,null,null,null,null,null,null,null,null,null,null,null,null,null,"xover",{"$f":"SUM(AI12:AI613)/1000","v":24.69}]
[]
[null,null,null,null,null,null,null,null,null,null,null,null,null,null,null,null,null,null,null,null,null,null,null,null,null,null,null,null,null,null,null,null,null,null,"phase margin",{"$f":"SUM(AJ13:AJ613)","v":54.597845587783311}]
["Freq (Hz)",null,"Power Stage",null,null,null,null,null,"Error Amplifier",null,null,null,null,null,null,"FF Network",null,null,"Sampling Double Pole",null,"System Response",null,null,null,null,null,null,"Compensator Response",null,null,"PLANT Response",null,"total"]
[null,null,"p_dom",null,"z_ESR",null,"z_RHP",null,"p1",null,"z1",null,"p2",null,"z3",null,"p3",null,"p3"]
[null,null,"Gain(V/V)","Phase(rad)","Gain(V/V)","Phase(rad)","Gain(V/V)","Phase(rad)","Gain(V/V)","Phase(rad)","Gain(V/V)","Phase(rad)","Gain(V/V)","Phase(rad)","Gain(V/V)","Phase(rad)","Gain(V/V)","Phase(rad)","Gain(V/V)","Phase(rad)","Gain (dB)","Phase (°)","Phase Margin (°)",null,null,"Fsquare",null,"Gain(dB)","Phase(Deg)",null,"Gain(dB)","Phase(Deg)"]
[1,{"$f":"A13/1000","v":1E-3},{"$f":"SQRT(1+(A13/pole1)^2)","v":1.0000002978514306},{"$f":"ATAN(A13/pole1)","v":7.7181779806181677E-4},{"$f":"SQRT(1+(A13/Zero1)^2)","v":1.0000000000012337},{"$f":"ATAN(A13/Zero1)","v":1.5707963249987082E-6},{"$f":"IF(VIN_nom>Vout, 1, SQRT(1+(A13/z_RHP)^2))","v":1},{"$f":"IF(VIN_nom>Vout, 0, -ATAN(A13/z_RHP))","v":0},{"$f":"SQRT(1+(A13/Pole2)^2)","v":1.000022641425435},{"$f":"ATAN(A13/Pole2)","v":6.7291898840759912E-3},{"$f":"SQRT(1+(A13/Zero2)^2)","v":1.000000008704991},{"$f":"ATAN(A13/Zero2)","v":1.3194689053426899E-4},{"$f":"SQRT(1+(A13/pole4)^2)","v":1.0000000000065845},{"$f":"ATAN(A13/pole4)","v":3.6289378259840706E-6},{"$f":"SQRT(1+(A13/Zero3)^2)","v":1},{"$f":"ATAN(A13/Zero3)","v":1.0000000000000001E-9},{"$f":"SQRT(1+(A13/pole5)^2)","v":1},{"$f":"ATAN(A13/pole5)","v":1.0000000000000001E-9},{"$f":"SQRT((1-(Z13/pterm2))^2+(A13/pterm1)^2)","v":1.000000000067065},{"$f":"IF((ATAN((A13/pterm1)/(1-A13^2/pterm2))>0),ATAN((A13/pterm1)/(1-A13^2/pterm2)),PI()+ATAN((A13/pterm1)/(1-A13^2/pterm2)))","v":1.3569460114425567E-5},{"$f":"20*LOG10(((E13*K13*G13*O13)/(C13*I13*S13*M13*Q13))*Adc)","v":59.761004611464955},{"$f":"((F13+L13+H13+R13)-(D13+J13+T13+N13))*radconv","v":-0.42311142113838685},{"$f":"IF(V13>0,V13,V13+180)","v":179.5768885788616},null,{"$f":"IF(U13<0,A13,1000000000)","v":1000000000},{"$f":"A13^2","v":1},null,{"$f":"20*LOG10((K13/(I13*M13))*AEA*Afb)","v":45.933107222087756},{"$f":"(L13-(J13+N13))*radconv","v":-0.37820210320589687},null,{"$f":"20*LOG10((E13*G13/(C13*S13))*Am)","v":13.827897389377208},{"$f":"(F13+H13-(D13+T13))*radconv","v":-4.4909375228269599E-2},{"$f":"AB13+AE13","v":59.761004611464962},{"$f":"AC13+AF13","v":-0.42311147843416647},{"$f":"SUM((U14<0)*(U13>0))*A13","v":0},{"$f":"IF(AI13>0,W11,0)","v":0}]
[1.0965,{"$f":"A14/1000","v":1.0965E-3},1.0000003581104129,8.4629818157674474E-4,1.0000000000014833,1.7223781703607971E-6,1,0,1.0000272220008122,7.3785341763122261E-3,1.0000000104661173,1.4467976530095975E-4,1.0000000000079168,3.9791303261879996E-6,1,1.0965000000000001E-9,1,1.0965000000000001E-9,1.0000000000806333,1.4878913015358133E-5,{"$f":"20*LOG10(((E14*K14*G14*O14)/(C14*I14*S14*M14*Q14))*Adc)","v":59.760964317851666},-0.46394038037574847,179.53605961962424,null,1000000000,1.2023122500000001,null,45.933067451992848,-0.41469731521072328,null,13.827896865858825,-4.9243127989847299E-2,{"$f":"AB14+AE14","v":59.760964317851673},{"$f":"AC14+AF14","v":-0.4639404432005706},{"$f":"SUM((U15<0)*(U14>0))*A14","v":0},0]
[1.2022999999999999,1.2022999999999999E-3,1.0000004305517471,9.2795645651633024E-4,1.0000000000017835,1.8885684215452549E-6,1,0,1.0000327285880004,8.0904505920859557E-3,1.0000000125832846,1.5863974607918397E-4,1.0000000000095182,4.3630719481721146E-6,1,1.2022999999999999E-9,1,1.2022999999999999E-9,1.0000000000969442,1.6314561895309449E-5,59.760915878696046,-0.50870373974681504,179.49129626025319,null,1000000000,1.4455252899999997,null,45.933019642193486,-0.45470927150020224,null,13.827896236502573,{"$f":"(F15+H15-(D15+T15))*radconv","v":-5.3994537133328531E-2},59.760915878696061,-0.50870380863353082,0,0]
[1.3183,1.3183000000000001E-3,1.0000005176403794,1.0174872540966242E-3,1.0000000000021441,2.0707807952445406E-6,1,0,1.0000393485416974,8.8709922200739914E-3,1.0000000151285333,1.7394558504642895E-4,1.0000000000114435,4.7840287359793039E-6,1,1.3183000000000001E-9,1,1.3183000000000001E-9,1.0000000001165534,1.7888619268367043E-5,59.760857646062924,-0.55778211692912893,179.44221788307087,null,1000000000,1.7379148900000001,null,45.932962166169432,-0.49857817164088325,null,13.82789547989349,-5.9204020821271783E-2,59.760857646062924,-0.55778219246215499,0,0]
[1.4454,1.4454000000000001E-3,1.0000006222654965,1.1155852040442508E-3,1.0000000000025775,2.2704290081510989E-6,1,0,1.000047301456233,9.7262111621185306E-3,1.0000000181863031,1.9071603437274029E-4,1.0000000000137566,5.2452667336522974E-6,1,1.4454E-9,1,1.4454E-9,1.000000000140111,1.9613297648613622E-5,59.760787688494446,-0.61155607297386183,179.38844392702615,null,1000000000,2.0891811599999999,null,45.932893117563516,-0.5466441586582842,null,13.827894570930933,-6.4911997130897403E-2,59.760787688494446,-0.61155615578918154,0,0]
[1.5849,1.5849E-3,1.000000748175226,1.2232536609081048E-3,1.0000000000030989,2.489555095487357E-6,1,0,1.0000568722045287,1.0664849674181765E-2,1.0000000218661365,2.0912262497290078E-4,1.0000000000165399,5.7515035603639812E-6,1,1.5849E-9,1,1.5849E-9,1.0000000001684615,2.1506237334170272E-5,59.760703500420234,-0.67057532617504767,179.32942467382495,null,1000000000,2.51190801,null,45.932810023368297,-0.59939856922521795,null,13.827893477051949,-7.117684775791086E-2,59.760703500420249,-0.67057541698312884,0,0]
[1.7378,1.7378000000000001E-3,1.0000008994958118,1.3412644314958141E-3,1.0000000000037257,2.7297298535782203E-6,1,0,1.0000683743830143,1.169362966416394E-2,1.0000000262886273,2.2929730368253243E-4,1.000000000019885,6.3063681539391989E-6,1,1.7377999999999999E-9,1,1.7377999999999999E-9,1.0000000002025331,2.3581007785116034E-5,59.760602323764296,-0.73526257010032336,179.26473742989967,null,1000000000,3.0199488400000001,null,45.932710161355672,-0.65721918822109615,null,13.827892162408626,-7.8043481447832935E-2,{"$f":"AB19+AE19","v":59.760602323764296},-0.73526266966892906,0,0]
[1.9055,1.9055000000000001E-3,1.0000010814773457,1.4706980458889117E-3,1.0000000000044795,2.993152397278562E-6,1,0,1.0000822069881894,1.2821962168643392E-2,1.0000000316072148,2.5142479607425836E-4,1.0000000000239082,6.9149410273327852E-6,1,1.9055000000000001E-9,1,1.9055000000000001E-9,1.0000000002435088,2.5856606245563317E-5,59.760480649470118,-0.80620959671842218,179.19379040328158,null,1000000000,3.63093025,null,45.932590068080813,-0.72063493541957568,null,13.827890581389308,-8.5574770475954395E-2,59.760480649470125,-0.80620970589553009,0,0]
[2.0893000000000002,2.0893000000000001E-3,1.0000013001728152,1.612557847956682E-3,1.0000000000053855,3.2818647618107179E-6,1,0,1.000098830007909,1.4058582369494303E-2,1.0000000379988041,2.7567663300950178E-4,1.0000000000287428,7.5819397997165173E-6,1,2.0893000000000002E-9,1,2.0893000000000002E-9,1.0000000002927509,2.8350673013598815E-5,59.760334432316128,-0.8839657183991495,179.11603428160086,null,1000000000,4.3651744900000002,null,45.93244575090911,-0.79013674218113961,null,13.827888681407018,-9.3829095926082129E-2,59.760334432316128,-0.88396583810722174,0,0]
[2.2909000000000002,2.2909000000000002E-3,1.0000015631896833,1.7681559020366719E-3,1.0000000000064748,3.598537300926968E-6,1,0,1.000118821531349,1.541491271971695E-2,1.0000000456857316,3.0227712407266902E-4,1.0000000000345575,8.3135336653918727E-6,1,2.2909E-9,1,2.2909E-9,1.0000000003519727,3.1086276171333571E-5,59.76015858872487,-0.96924923932356888,179.03075076067643,null,1000000000,5.2482228100000006,null,45.932272192355008,-0.86636656833142922,null,13.827886396369866,-0.10288280225104109,59.760158588724877,-0.96924937058247029,0,0]
[2.5118999999999998,2.5118999999999996E-3,1.0000018793342942,1.9387270829095923E-3,1.0000000000077842,3.9456832887470243E-6,1,0,1.0001428506941419,1.6901697603920348E-2,1.0000000549253723,3.3143738412025553E-4,1.0000000000415463,9.1155289248769227E-6,1,2.5119E-9,1,2.5119E-9,1.0000000004231568,3.4085126854842125E-5,59.75994723496698,-1.0627358570482133,178.93726414295179,null,1000000000,6.309641609999999,null,45.932063585196516,-0.94992825844894113,null,13.827883649770467,-0.11280774252054088,59.759947234966987,-1.062736000969482,0,0]
[2.7542,2.7542000000000001E-3,1.0000022593848503,2.1257377996188207E-3,1.0000000000093583,4.3262872382880091E-6,1,0,1.0001717363938021,1.8531692830353878E-2,1.0000000660327315,3.6340811202057322E-4,1.0000000000499483,9.9948205600363848E-6,1,2.7541999999999999E-9,1,2.7541999999999999E-9,1.0000000005087304,3.7373007038197691E-5,59.759693171030371,-1.1652277817559105,178.8347722182441,null,1000000000,7.5856176399999997,null,45.931812823059872,-1.0415386975777401,null,13.827880347970503,-0.1236892419822065,59.759693171030378,-1.1652279395599465,0,0]
[3.02,3.0200000000000001E-3,1.0000027165209027,2.3308859917192831E-3,1.0000000000112519,4.7438049014644164E-6,1,0,1.0002064798772803,2.0319663149571909E-2,1.0000000793929973,3.9847959063500735E-4,1.0000000000600542,1.0959392234081231E-5,1,3.0199999999999999E-9,1,3.0199999999999999E-9,1.0000000006116607,4.0979769533460041E-5,59.759387594482092,-1.2776535938718874,178.72234640612811,null,1000000000,9.1204000000000001,null,45.931511218012616,-1.1420276690584874,null,13.827876376469488,-0.13562609784665436,59.759387594482106,-1.2776537669051418,0,0]
[3.3113000000000001,3.3113000000000001E-3,1.0000032658490254,2.5557152178192857E-3,1.0000000000135272,5.2013778709255938E-6,1,0,1.0002482286132977,2.2279015970253269E-2,1.0000000954476778,4.3691571335996329E-4,1.0000000000721982,1.2016501822655422E-5,1,3.3112999999999999E-9,1,3.3112999999999999E-9,1.0000000007353493,4.4932553260610065E-5,59.759020418893975,-1.4008565914210702,178.59914340857893,null,1000000000,10.964707690000001,null,45.931148814868251,-1.2521486566913353,null,13.827871604025724,-0.14870812445324971,59.759020418893975,-1.4008567811445851,0,0]
[3.6307999999999998,3.6308E-3,1.0000039264815042,2.8023092821759872E-3,1.0000000000162634,5.7032472967481634E-6,1,0,1.0002984341621806,2.4427851397626266E-2,1.0000001147553543,4.7907273628126576E-4,1.0000000000868028,1.3175947457878329E-5,1,3.6307999999999999E-9,1,3.6307999999999999E-9,1.0000000008840999,4.9267995761622383E-5,59.758578886347848,-1.5359752326756531,178.46402476732436,null,1000000000,13.182708639999998,null,45.930713021750556,-1.3729188695372447,null,13.827865864597296,-0.16305657116792496,59.758578886347848,-1.5359754407051698,0,0]
[3.9811000000000001,3.9811000000000004E-3,1.0000047206837099,3.0726747759170915E-3,1.0000000000195532,6.2534972493759844E-6,1,0,1.0003587872094541,2.6783575890304251E-2,1.0000001379667625,5.252937206390477E-4,1.0000000001043603,1.4447164378083462E-5,1,3.9810999999999998E-9,1,3.9810999999999998E-9,1.0000000010629255,5.4021377632359218E-5,59.758048140259064,-1.6841044753729624,178.31589552462702,null,1000000000,15.849157210000001,null,45.930189175509327,-1.5053165088503091,null,13.827858964749726,-0.17878819462288129,59.758048140259049,-1.6841047034731904,0,0]
[4.3651999999999997,4.3651999999999996E-3,1.0000056755351243,3.3691269733714547E-3,1.0000000000235081,6.8568401177825389E-6,1,0,1.0004313435614456,2.936625855538437E-2,1.0000001658733388,5.7597450621021745E-4,1.0000000001254694,1.5841039396730161E-5,1,4.3651999999999998E-9,1,4.3651999999999998E-9,1.000000001277924,5.9233407252587095E-5,59.757410119357289,-1.8465068561635081,178.1534931438365,null,1000000000,19.054971039999998,null,45.929559450131563,-1.6504693935869625,null,13.827850669225729,-0.1960377126840829,59.757410119357289,-1.8465071062710454,0,0]
[4.7862999999999998,4.7862999999999994E-3,1.0000068233571824,3.6941354561355012E-3,1.0000000000282623,7.5183024502058441E-6,1,0,1.0005185563128727,3.2197277155392293E-2,1.0000001994197276,6.3153732186852353E-4,1.0000000001508442,1.7369185114837107E-5,1,4.7862999999999995E-9,1,4.7862999999999995E-9,1.0000000015363726,6.4947506893914131E-5,59.756643277799114,-2.0245274003697471,177.97547259963025,null,1000000000,22.908667689999998,null,45.928802580570363,-1.8095788527373045,null,13.827840697228755,-0.21494882186723274,59.756643277799114,-2.0245276746045371,0,0]
[5.2481,5.2481000000000003E-3,1.0000082035565685,4.0505556376861651E-3,1.0000000000339793,8.2436961930457572E-6,1,0,1.0006234154100859,3.5301323203958665E-2,1.0000002397576544,6.9247036954814994E-4,1.0000000001813567,1.9045028602327976E-5,1,5.2480999999999997E-9,1,5.2480999999999997E-9,1.0000000018471447,7.1213883557757541E-5,59.755721362292903,-2.2197197714966226,177.78028022850339,null,1000000000,27.542553609999999,null,45.927892655883305,-1.9840324032278061,null,13.827828706409607,-0.23568766896279753,59.75572136229291,-2.2197200721906034,0,0]
[5.7544000000000004,5.7544000000000007E-3,1.000009862742806,4.441320016686452E-3,1.0000000000408518,9.0389903723338305E-6,1,0,1.0007494558683132,3.8703697430175203E-2,1.0000002882493664,7.5927504538968768E-4,1.0000000002180365,2.0882359822898996E-5,1,5.7544000000000007E-9,1,5.7544000000000007E-9,1.0000000022207354,7.8084101191234909E-5,59.754613346068737,-2.4336762887411507,177.56632371125886,null,1000000000,33.113119360000006,null,45.926799054222769,-2.1752517322796492,null,13.827814291845964,-0.25842488616433562,59.754613346068737,-2.4336766184439846,0,0]
[6.3095999999999997,6.3095999999999994E-3,1.0000118577103041,4.8698240490210008E-3,1.0000000000491149,9.9110964918954781E-6,1,0,1.0009009832877733,4.2433650131216014E-2,1.0000003465547933,8.3253191300119891E-4,1.0000000002621396,2.2897146102928104E-5,1,6.3095999999999998E-9,1,6.3095999999999998E-9,1.0000000026699332,8.5617865417102554E-5,59.753281455183249,-2.6682380916187562,177.33176190838125,null,1000000000,39.811052159999996,null,45.925484495046533,-2.3848804094882232,null,13.827796960136718,-0.28335804364398332,59.753281455183249,-2.6682384531322065,0,0]
[6.9183000000000003,6.9183000000000005E-3,1.0000142559262675,5.339617385178996E-3,1.0000000000590483,1.0867240214819706E-5,1,0,1.0010831094179855,4.6521666257339549E-2,1.0000004166458114,9.128479245246175E-4,1.0000000003151577,2.5106080556340891E-5,1,6.9183E-9,1,6.9183E-9,1.0000000032099297,9.3877595749595471E-5,59.75168086887254,-2.9253245618719244,177.07467543812808,null,1000000000,47.862874890000008,null,45.923904743707098,-2.6146312744928366,null,13.827776125165441,-0.31069368376847928,59.75168086887254,-2.9253249582613159,0,0]
[7.5857999999999999,7.5858000000000002E-3,1.0000171395261102,5.8547897162794455E-3,1.0000000000709925,1.1915746761621049E-5,1,0,1.0013020534512751,5.1002788810659914E-2,1.0000005009230282,1.000922393766828E-3,1.0000000003789062,2.7528396553517018E-5,1,7.5858E-9,1,7.5858E-9,1.0000000038592196,1.0293521032428201E-4,59.749757090109611,-3.2071425152296453,176.79285748477037,null,1000000000,57.544361639999998,null,45.922006016716907,-2.866473177679604,null,13.827751073392703,-0.34066977218436612,59.749757090109611,-3.2071429498639699,0,0]
[8.3176000000000005,8.3176000000000014E-3,1.0000206058883601,6.4195848044599308E-3,1.0000000000853504,1.3065255512076586E-5,1,0,1.0015651825648868,5.5913214731310272E-2,1.0000006022325996,1.0974810224509896E-3,1.0000000004555385,3.0184053252370942E-5,1,8.3176000000000003E-9,1,8.3176000000000003E-9,1.0000000046397308,1.1286534116781109E-4,59.747445616284608,-3.5159723779697907,176.4840276220302,null,1000000000,69.182469760000004,null,45.919724657418364,-3.1424396148813551,null,13.827720958866244,-0.37353323965181151,59.747445616284608,-3.5159728545331665,0,0]
[9.1201000000000008,9.1201000000000008E-3,1.0000247738541335,7.0389406434688924E-3,1.0000000001026146,1.4325819562652479E-5,1,0,1.0018814796105979,6.1294932381847793E-2,1.0000007240480244,1.2033682624808689E-3,1.0000000005476817,3.3096275854818456E-5,1,9.1201000000000004E-9,1,9.1201000000000004E-9,1.0000000055782237,1.2375483281963181E-4,59.744667869032149,-3.8544601788944757,176.14553982110553,null,1000000000,83.176224010000013,null,45.916983119836907,-3.4448892892399381,null,13.827684749195246,-0.4095714121977771,59.744667869032156,-3.854460701437715,0,0]
[10,0.01,1.0000297847039348,7.7180262605991163E-3,1.0000000001233702,1.5707963248708075E-5,1,0,1.0022616107336364,6.7191614669171479E-2,1.0000008704987273,1.3194681472697937E-3,1.0000000006584595,3.6289378244069954E-5,1,1E-8,1,1E-8,1.0000000067065125,1.3569460065557894E-4,59.741330656620882,-4.2253597020820983,175.7746402979179,null,1000000000,100,null,45.913689439546658,-3.7762752157018937,null,13.827641217074229,-0.44908505933800091,59.741330656620889,-4.2253602750398951,0,0]
[10.965,1.0964999999999999E-2,1.0000358104065135,8.4627817993588803E-3,1.0000000001483293,1.7223781701921808E-5,1,0,1.0027185418980673,7.3653206670749774E-2,1.0000010466111913,1.4467966536154892E-3,1.0000000007916738,3.9791303241088848E-5,1,1.0964999999999999E-8,1,1.0964999999999999E-8,1.000000008063322,1.4878912950934151E-4,59.737320841182253,-4.6318216177573177,175.36817838224269,null,1000000000,120.23122499999999,null,45.909731972547398,-4.1394024262399398,null,13.827588868634857,-0.49241981976560006,59.737320841182253,-4.63182224600554,0,0]
[12.023,1.2022999999999999E-2,1.0000430542571417,9.2793008868296643E-3,1.0000000001783347,1.888568421322969E-5,1,0,1.0032675738386572,8.0730428528742654E-2,1.0000012583276812,1.5863961432958356E-3,1.0000000009518197,4.3630719454312282E-5,1,1.2023E-8,1,1.2023E-8,1.0000000096944333,1.6314561810379637E-4,59.732505147852635,-5.077048465360984,174.92295153463903,null,1000000000,144.55252899999999,null,45.904979209930971,-4.5371188905990731,null,13.827525937921671,-0.53993026362906771,59.732505147852642,-5.0770491542281411,0,0]
[13.183,1.3183E-2,1.0000517627116501,1.0174524945521264E-2,1.0000000002144067,2.0707807949515075E-5,1,0,1.0039272200564437,8.848062424854429E-2,1.0000015128522139,1.739454113649984E-3,1.0000000011443464,4.7840287323660764E-5,1,1.3183E-8,1,1.3183E-8,1.0000000116553478,1.7888619156406651E-4,59.726722626502138,-5.5646635480585553,174.43533645194145,null,1000000000,173.79148899999998,null,45.899272342388372,-4.9726440109920782,null,13.827450284113763,-0.59202029239673915,59.726722626502138,-5.5646643033888177,0,0]
[14.454000000000001,1.4454E-2,1.0000622246330502,1.1155393909141723E-2,1.0000000002577423,2.2704290077648769E-5,1,0,1.0047191224363972,9.696018187574848E-2,1.0000018186286788,1.907158054575452E-3,1.0000000013756412,5.2452667288899984E-5,1,1.4453999999999998E-8,1,1.4453999999999998E-8,1.0000000140111194,1.9613297501047791E-4,59.719785625794735,-6.0982353116775228,173.90176468832249,null,1000000000,208.91811600000003,null,45.892426227682449,-5.4491424175961019,null,13.827359398112298,-0.64909372223461859,59.719785625794749,-6.0982361398307203,0,0]
[15.849,1.5848999999999999E-2,1.000074814751958,1.2231932625985899E-2,1.0000000003098943,2.4895550949781678E-5,1,0,1.0056713003514128,0.10625089541312564,1.0000021866112869,2.0912232317523744E-3,1.0000000016539896,5.7515035540854494E-5,1,1.5849000000000002E-8,1,1.5849000000000002E-8,1.000000016846142,2.1506237139622068E-4,59.71145167865398,-6.6829379507818629,173.31706204921812,null,1000000000,251.19080099999999,null,45.884201653604208,-5.9712049870770292,null,13.827250025049779,-0.71173387178564373,59.711451678653987,-6.6829388588626726,0,0]
[17.378,1.7378000000000001E-2,1.0000899455765353,1.3411848136171866E-2,1.0000000003725713,2.7297298529069879E-5,1,0,1.0068144536648596,0.1164128862905356,1.0000026288593105,2.2929690584163804E-3,1.000000001988514,6.3063681456626008E-5,1,1.7377999999999995E-8,1,1.7377999999999995E-8,1.0000000202533244,2.3581007528655223E-4,59.701456372420488,-7.3225911070077574,172.67740889299225,null,1000000000,301.99488400000001,null,45.874337790267241,-6.5422029060462856,null,13.827118582153254,-0.78038919664752915,59.701456372420495,-7.3225921026938146,0,0]
[19.055,1.9054999999999999E-2,1.0001081419457145,1.470593084757075E-2,1.0000000004479479,2.9931523963936493E-5,1,0,1.0081875189848271,0.12753073064960793,1.0000031607165423,2.5142427158496962E-3,1.0000000023908204,6.9149410164214128E-5,1.0000000000000002,1.9054999999999998E-8,1.0000000000000002,1.9054999999999998E-8,1.0000000243508784,2.585660590746073E-4,59.689465414892844,-8.0225655801966216,171.97743441980339,null,1000000000,363.09302500000001,null,45.862504903677809,-7.1668791057001116,null,13.826960511215034,-0.85568756626759224,59.689465414892844,-8.022566671967704,0,{"$f":"IF(AI45>0,W43,0)","v":0}]
[20.893000000000001,2.0893000000000002E-2,1.0001300089148846,1.6124194936923061E-2,1.0000000005385317,3.281864760644242E-5,1,0,1.0098351243241803,0.13967954064649543,1.0000037998732725,2.7567594163741683E-3,1.0000000028742906,7.5819397853333368E-5,1.0000000000000002,2.0892999999999997E-8,1.0000000000000002,2.0892999999999997E-8,1.0000000292750966,2.835067256791789E-4,59.675097896133799,-8.7876521149216043,171.2123478850784,null,1000000000,436.51744900000006,null,45.848327338370325,-7.8494416241505487,null,13.826770557763474,-0.93821168785177911,59.675097896133799,-8.7876533120023286,0,0]
[22.909000000000002,2.2909000000000002E-2,1.0001563068745838,1.7679735146954374E-2,1.0000000006474734,3.598537299389196E-5,1,0,1.0118130845790805,0.15295721043353566,1.0000045685628292,3.0227621263406411E-3,1.0000000034557421,8.3135336464304507E-5,1.0000000000000002,2.2909E-8,1.0000000000000002,2.2909E-8,1.0000000351972709,3.1086275583790064E-4,59.657879749456157,-9.6240966146907638,170.37590338530924,null,1000000000,524.82228100000009,null,45.831337630665828,-8.5953744053541374,null,13.826542118790325,-1.0287235219256414,59.657879749456157,-9.6240979272797791,0,0]
[25.119,2.5118999999999999E-2,1.0001879159498175,1.9384866650660054E-2,1.0000000007784209,3.9456832867198991E-5,1,0,1.014185475867434,0.16745023866552258,1.0000054925222981,3.3143618264294323E-3,1.0000000041546433,9.1155288998815551E-5,1.0000000000000004,2.5118999999999992E-8,1.0000000000000004,2.5118999999999992E-8,1.0000000423156887,3.4085126080329203E-4,59.637271294206485,-10.537454069923372,169.46254593007663,null,1000000000,630.96416099999999,null,45.811003741802061,-9.4095158336509819,null,13.826267552404429,-1.1279396754850779,59.637271294206492,-10.537455509136059,0,0]
[27.542000000000002,2.7542000000000001E-2,1.0002259132218863,2.1254208968134573E-2,1.0000000009358381,4.3262872356158644E-5,1,0,1.0170301018648957,0.18325870169406758,1.000006603251574,3.6340652824232576E-3,1.0000000049948219,9.9948205270876373E-5,1.0000000000000004,2.7541999999999996E-8,1.0000000000000004,2.7541999999999996E-8,1.0000000508730376,3.7373006017239291E-4,59.612622478798222,-11.534169454323072,168.46583054567694,null,1000000000,758.56176400000004,null,45.786684971190461,-10.297460185057641,null,13.825937507607765,-1.2367108473057908,59.61262247879823,-11.534171032363432,0,0]
[30.2,3.0199999999999998E-2,1.0002716155717402,2.3304682225000119E-2,1.0000000011251842,4.7438048979415645E-5,1,0,1.0204411981344321,0.20049420723343139,1.0000079392685322,3.9847750264662644E-3,1.0000000060054139,1.0959392190642878E-4,1.0000000000000004,3.0199999999999992E-8,1.0000000000000004,3.0199999999999992E-8,1.000000061166074,4.0979768187468133E-4,59.583153585330962,-12.62146026526324,167.37853973473676,null,1000000000,912.04,null,45.757613032323491,-11.265440382029439,null,13.825540553007471,-1.3560216135663448,59.583153585330962,-12.621461995595784,0,0]
[33.113,3.3112999999999997E-2,1.0003265321242159,2.5551645593838986E-2,1.0000000013527166,5.2013778662818412E-5,1,0,1.0245251994967979,0.21924521632565966,1.0000095447226929,4.3691296102053865E-3,1.0000000072198159,1.2016501765395849E-4,1.0000000000000004,3.3112999999999987E-8,1.0000000000000004,3.3112999999999987E-8,1.0000000735349457,4.4932551486350305E-4,59.547997339738011,-13.805141691755173,166.19485830824482,null,1000000000,1096.470769,null,45.722933748687787,-12.318377849515111,null,13.825063591050228,-1.4867657394752118,59.547997339738018,-13.805143588990322,0,0]
[36.308,3.6308E-2,1.0003925718649438,2.8015834120272871E-2,1.0000000016263515,5.7032472906263444E-5,1,0,1.0294152411592821,0.23963239117065238,1.0000114754702452,4.7906910790457991E-3,1.0000000086802796,1.3175947382393531E-4,1.0000000000000007,3.6307999999999983E-8,1.0000000000000007,3.6307999999999983E-8,1.0000000884099953,4.9267993422631197E-4,59.506081580968825,-15.0931352831578,164.90686471684219,null,1000000000,1318.2708640000001,null,45.681591524474868,-13.462987546070776,null,13.824490056493953,-1.630149817382188,59.506081580968825,-15.093137363452964,0,0]
[39.811,3.9810999999999999E-2,1.0004719581130042,3.0717179797176451E-2,1.0000000019553112,6.2534972413058111E-5,1,0,1.035263403543746,0.26175332414689151,1.0000137965820124,5.2528893749538104E-3,1.0000000104360278,1.4447164278574596E-4,1.0000000000000009,3.9810999999999978E-8,1.0000000000000009,3.9810999999999978E-8,1.0000001062925643,5.40213745489522E-4,59.456206970784663,-16.492001447519218,163.50799855248079,null,1000000000,1584.9157210000001,null,45.632406309013902,-14.704669987896175,null,13.823800661770759,-1.787333740625324,59.456206970784663,-16.4920037285215,0,0]
[43.652000000000001,4.3652000000000003E-2,1.0005673941549516,3.3678658069361087E-2,1.0000000023508127,6.8568401071439025E-5,1,0,1.0422510820411421,0.28571029877242371,1.0000165871976912,5.7596820077400815E-3,1.0000000125469264,1.5841039265550969E-4,1.0000000000000009,4.3651999999999973E-8,1.0000000000000009,4.3651999999999973E-8,1.0000001277923924,5.9233403187835361E-4,59.396972638253146,-18.00871710627133,161.99128289372868,null,1000000000,1905.497104,null,45.574000676160509,-16.049065077969622,null,13.822971962092634,-1.9596545293770788,59.396972638253146,-18.008719607346702,0,0]
[47.863,4.7863000000000003E-2,1.000682105412255,3.6924731945927519E-2,1.0000000028262435,7.5183024361817985E-5,1,0,1.050589431052624,0.31159229004302741,1.0000199417759108,6.31529009961439E-3,1.0000000150844295,1.7369184941914306E-4,1.0000000000000011,4.7862999999999957E-8,1.0000000000000011,4.7862999999999957E-8,1.0000001536372536,6.4947501535684497E-4,59.326792329468596,-19.649568576631292,160.35043142336872,null,1000000000,2290.8667689999997,null,45.504816334961404,-17.50103550907842,null,13.821975994507188,-2.1485358099007703,59.326792329468589,-19.649571318979191,0,0]
[52.481000000000002,5.2481E-2,1.0008200228030735,4.048364683208544E-2,1.0000000033979264,8.2436961745581877E-5,1,0,1.0605290880944951,0.3394871367306091,1.0000239754808877,6.9245941220877341E-3,1.0000000181356556,1.9045028374367888E-4,1.0000000000000013,5.2480999999999952E-8,1.0000000000000013,5.2480999999999952E-8,1.0000001847144624,7.1213876494128855E-4,59.243838890841104,-21.420960489062232,158.57903951093778,null,1000000000,2754.255361,null,45.423060197488297,-19.065342134858795,null,13.820778693352802,-2.3556213611432422,59.243838890841097,-21.420963496002038,0,0]
[57.544000000000004,5.7544000000000005E-2,1.0009857932501229,4.4384323970534469E-2,1.0000000040851673,9.0389903479628098E-5,1,0,1.0723559773099913,0.36944981897125945,1.0000288245253792,7.5926060109309454E-3,1.0000000218036473,2.0882359522393336E-4,1.0000000000000018,5.7543999999999936E-8,1.0000000000000018,5.7543999999999936E-8,1.000000222073524,7.8084091879691332E-4,59.14611425108852,-23.327446898480854,156.67255310151916,null,1000000000,3311.3119360000005,null,45.326774441182842,-20.74485582336699,null,13.819339809905678,-2.5825943721422044,59.14611425108852,-23.327450195509194,0,0]
[63.095999999999997,6.3095999999999999E-2,1.0011850758582801,4.8660182968345192E-2,1.0000000049114917,9.9110964597678227E-5,1,0,1.0864059253534704,0.40152448640419713,1.0000346548848411,8.3251287161023469E-3,1.0000000262139646,2.2897145706779625E-4,1.000000000000002,6.3095999999999919E-8,1.000000000000002,6.3095999999999919E-8,1.0000002669932839,8.5617853141947144E-4,59.031372425325202,-25.373179105565868,154.62682089443413,null,1000000000,3981.1052159999995,null,45.213762068364822,-22.541782826659354,null,13.81761035696038,-2.8313998940410228,59.031372425325202,-25.373182720700378,0,0]
[69.183000000000007,6.9183000000000008E-2,1.0014245880627495,5.3346019660863546E-2,1.0000000059048455,1.0867240172467919E-4,1,0,1.1030590175499366,0.43571190958994854,1.0000416637218783,9.1282282371849995E-3,1.0000000315157636,2.5106080034124288E-4,1.0000000000000024,6.9182999999999899E-8,1.0000000000000024,6.9182999999999899E-8,1.0000003209929191,9.3877579568062608E-4,58.897222654430045,-27.559888543948041,152.44011145605197,null,1000000000,4786.2874890000012,null,45.081690423456699,-24.455829302872495,null,13.815532230973348,-3.1040632049694628,58.897222654430045,-27.559892507841958,0,0]
[75.858000000000004,7.5858000000000009E-2,1.0017125009693968,5.8481803194417405E-2,1.000000007099251,1.1915746705789751E-4,1,0,1.122755638852021,0.47198895224237913,1.0000500910608165,1.0008893043413361E-2,1.0000000378906302,2.7528395865091963E-4,1.0000000000000029,7.5857999999999858E-8,1.0000000000000029,7.5857999999999858E-8,1.0000003859219102,1.029351889925745E-3,58.741068466490276,-29.888186708433487,150.11181329156651,null,1000000000,5754.4361640000006,null,44.928033652416786,-26.485280250566856,null,13.813034814073488,-3.4029108042098786,58.741068466490276,-29.888191054776733,0,0]
[83.176000000000002,8.3176E-2,1.0020584913727792,6.4108757729801999E-2,1.0000000085350451,1.3065255438478307E-4,1,0,1.1459849443267114,0.51027175041486028,1.0000602214647774,1.0974374036400211E-2,1.0000000455538525,3.0184052344871026E-4,1.0000000000000036,8.3175999999999818E-8,1.0000000000000036,8.3175999999999818E-8,1.000000463972998,1.1286531304779859E-3,58.560282800351082,-32.355264316563982,147.64473568343601,null,1000000000,6918.2469760000004,null,44.750248230544436,-28.624926609229103,null,13.810034569806646,-3.7303424729686498,58.560282800351082,-32.355269082197751,0,0]
[91.201000000000008,9.1201000000000004E-2,1.0024743548844985,7.0274655563315483E-2,1.0000000102614552,1.4325819465630001E-4,1,0,1.1733072567201228,0.55044533056538558,1.0000724022076168,1.2033107619148891E-2,1.0000000547681722,3.309627465848763E-4,1.000000000000004,9.1200999999999759E-8,1.000000000000004,9.1200999999999759E-8,1.0000005578222428,1.2375479574983804E-3,58.352126843037183,-34.956844951631851,145.04315504836813,null,1000000000,8317.6224010000005,null,44.545697049882349,-30.867710816902971,null,13.80642979315483,-4.0891393601612736,58.352126843037183,-34.956850177064247,0,0]
[100,0.1,1.0029740921378754,7.7029082512839589E-2,1.0000000123370054,1.5707963120807183E-4,1,0,1.2053354865091801,0.59232564369137453,1.000087046122105,1.3193923478971963E-2,1.0000000658459465,3.6289376666994442E-4,1.0000000000000049,9.9999999999999665E-8,1.0000000000000049,9.9999999999999665E-8,1.0000006706510454,1.3569455178794501E-3,58.114000376753935,-37.684778524085552,142.31522147591446,null,1000000000,10000,null,44.311900415500546,-33.202595669503189,null,13.80209996125339,-4.4821885841603208,58.114000376753935,-37.684784253663508,0,0]
[109.65,0.10965000000000001,1.0035747154752432,8.4428656655199122E-2,1.0000000148329327,1.7223781533305544E-4,1,0,1.2427579919753498,0.63569053569038725,1.0001046556974906,1.4466967267532615E-2,1.0000000791673875,3.979130116197444E-4,1.000000000000006,1.0964999999999957E-7,1.000000000000006,1.0964999999999957E-7,1.0000008063319201,1.4878906508542077E-3,57.843379686805143,-40.529068155776031,139.47093184422397,null,1000000000,12023.122500000001,null,44.046480803916012,-35.616287381562778,null,13.796898882889137,-4.9127870566954783,57.84337968680515,-40.529074438258256,0,0]
[120.23,0.12023,1.0042962893465406,9.2530684388558965E-2,1.0000000178334532,1.8885683990943695E-4,1,0,1.2863057457737348,0.68024260828570871,1.0001258249313347,1.5862644135839814E-2,1.0000000951819796,4.363071671342603E-4,1.0000000000000071,1.2022999999999943E-7,1.0000000000000071,1.2022999999999943E-7,1.0000009694429222,1.6314553317407429E-3,57.538166169552163,-43.475432155130228,136.52456784486978,null,1000000000,14455.252900000001,null,43.747511619531409,-38.091166541614029,null,13.79065455002076,-5.3842725021877831,57.53816616955217,-43.475439043801813,0,0]
[131.83000000000001,0.13183,1.0051630764546935,0.10139979708505359,1.0000000214406652,2.0707807656482222E-4,1,0,1.3367820753682798,0.72565472929543839,1.0001512738939418,1.7392804637400013E-2,1.0000001144346482,4.7840283710434006E-4,1.0000000000000087,1.3182999999999924E-7,1.0000000000000087,1.3182999999999924E-7,1.0000011655341894,1.7888607960382698E-3,57.196563890824955,-46.50823192642131,133.4917680735787,null,1000000000,17379.148900000004,null,43.413404389031797,-40.607829582592665,null,13.78315950179317,-5.9004098971312731,57.196563890824969,-46.50823947972394,0,0]
[144.54,0.14454,1.0062034157169897,0.11109919823657158,1.0000000257742392,2.2704289691426142E-4,1,0,1.3950094977943259,0.77153537161445995,1.0001818464991696,1.9069291893198139E-2,1.0000001375641061,5.2452662526601603E-4,1.0000000000000104,1.4453999999999899E-7,1.0000000000000104,1.4453999999999899E-7,1.0000014011110883,1.9613282744488907E-3,56.817510961477808,-49.608057930653139,130.39194206934687,null,1000000000,20891.811599999997,null,43.043338675913915,-43.143183805951097,null,13.774172285563893,-6.4648824062340209,56.817510961477808,-49.608066212185115,0,0]
[158.49,0.15849000000000002,1.0074539741925399,0.12172070786852729,1.0000000309894224,2.4895550440592521E-4,1,0,1.4620110926563372,0.81757896145451037,1.000218637466582,2.0909215132461439E-2,1.0000001653989523,5.7515029262323659E-4,1.0000000000000124,1.5848999999999869E-7,1.0000000000000124,1.5848999999999869E-7,1.0000016846129975,2.1506217684838778E-3,56.399569192913702,-52.761799085030937,127.23820091496907,null,1000000000,25119.080100000003,null,42.636187867148195,-45.678767866559966,null,13.763381325765502,-7.083040299279074,56.399569192913695,-52.761808165839042,0,0]
[173.78,0.17377999999999999,1.008954867339344,0.13333078656108793,1.0000000372571247,2.7297297857837454E-4,1,0,1.5386794373250599,0.86333301169285037,1.0002628517310788,2.2925713429665293E-2,1.0000001988513767,6.3063673180029252E-4,1.0000000000000151,1.7377999999999826E-7,1.0000000000000151,1.7377999999999826E-7,1.0000020253306654,2.3580981882633354E-3,55.943069793016988,-55.946674416059793,124.05332558394021,null,1000000000,30199.488400000002,null,42.192621879558018,-48.187924140673474,null,13.75044791345897,-7.758760232246888,55.943069793016988,-55.946684372920359,0,0]
[190.55,0.19055000000000002,1.0107569236027771,0.14602311009136298,1.0000000447948054,2.993152307902384E-4,1,0,1.6261018860077932,0.90845142877508978,1.0003160222187037,2.5137184253829485E-2,1.0000002390820184,6.9149399252844794E-4,1.0000000000000182,1.9054999999999772E-7,1.0000000000000182,1.9054999999999772E-7,1.0000024350853183,2.5856572097296333E-3,55.448035875906953,-59.147292697586479,120.85270730241352,null,1000000000,36309.302500000005,null,41.713091158583609,-50.649797940061376,null,13.734944717323339,-8.4975056752359119,55.448035875906946,-59.14730361529729,0,0]
[208.93,0.20893,1.0129182954259859,0.15987959712608432,1.0000000538531801,3.2818646439966023E-4,1,0,1.7253109377394129,0.95255162247967995,1.000379915881151,2.7560683593421762E-2,1.0000002874290144,7.5819383470157717E-4,1.0000000000000218,2.0892999999999696E-7,1.0000000000000218,2.0892999999999696E-7,1.0000029275059907,2.8350627999975116E-3,54.915639785424055,-62.345565872607807,117.65443412739219,null,1000000000,43651.744900000005,null,41.199253078007047,-53.041518253416058,null,13.716386707417005,-9.3040595899989729,54.915639785424048,-62.345577843415029,0,0]
[229.09,0.22909000000000002,1.0155116041191601,0.17500694036573136,1.0000000647473515,3.5985371456120018E-4,1,0,1.8375450504799429,0.99535589526945989,1.0004567530148591,3.0218511870362619E-2,1.0000003455741504,8.3135317502889769E-4,1.0000000000000262,2.29089999999996E-7,1.0000000000000262,2.29089999999996E-7,1.0000035197217969,3.1086216829677195E-3,54.346679456993527,-65.530570568175818,114.46942943182418,null,1000000000,52482.2281,null,40.652507297329166,-55.34593181052378,null,13.694172159664362,-10.184651883542195,54.346679456993527,-65.530583694065967,0,0]
[251.19,0.25119000000000002,1.018620008248369,0.19149728527446472,1.0000000778420801,3.945683084007382E-4,1,0,1.963980128729756,1.0365760406952551,1.0005491029811444,3.3131611403151948E-2,1.0000004154642517,9.1155264003458668E-4,1.0000000000000315,2.5118999999999472E-7,1.0000000000000315,2.5118999999999472E-7,1.0000042315612547,3.4085048629413708E-3,53.742946395872963,-68.690016658526915,111.30998334147309,null,1000000000,63096.416100000002,null,40.075326548595747,-57.545358959184213,null,13.667619847277212,-11.14467209146958,53.742946395872963,-68.690031050653801,0,0]
[275.42,0.27542,1.0223442414645125,0.20945629052121587,1.000000093583802,4.3262869684014131E-4,1,0,2.1059493844658319,1.0760081752722075,1.0006601094652963,3.6324827578403662E-2,1.0000004994820655,9.9948172322146208E-4,1.000000000000038,2.7541999999999303E-7,1.000000000000038,2.7541999999999303E-7,1.0000050872927273,3.7372903921995973E-3,53.105986135633671,-71.817022846182198,108.1829771538178,null,1000000000,75856.176400000011,null,39.470072635071112,-59.626734005462019,null,13.635913500562557,-12.190304621123797,53.105986135633671,-71.817038626585813,0,0]
[302,0.30199999999999999,1.0268059660178914,0.22900022335567563,1.0000001125184184,4.743804545656412E-4,1,0,2.2649556033184202,1.113515710537514,1.0007936150923491,3.9826890248896102E-2,1.0000006005412103,1.0959387846810728E-3,1.0000000000000457,3.0199999999999082E-7,1.0000000000000457,3.0199999999999082E-7,1.0000061165914538,4.0979633589223246E-3,52.43707539568635,-74.90897567512441,105.09102432487559,null,1000000000,91204,null,38.838995236668133,-61.580630650251173,null,13.598080159018217,-13.328362328198665,52.43707539568635,-74.908992978449845,0,0]
[331.13,0.33112999999999998,1.0321419898279329,0.25021605746078918,1.0000001352716497,5.2013774019065687E-4,1,0,2.4423735259774126,1.1489585882549935,1.0009540217456288,4.3663804186199182E-2,1.0000007219813196,1.2016496039443496E-3,1.0000000000000548,3.3112999999998785E-7,1.0000000000000548,3.3112999999998785E-7,1.0000073534715186,4.4932374061873968E-3,51.73838678691591,-77.961522713810282,102.03847728618972,null,1000000000,109647.0769,null,38.185338435601317,-63.397575768167442,null,13.553048351314596,-14.56396591799432,51.73838678691591,-77.961541686161766,0,0]
[363.08,0.36307999999999996,{"$f":"SQRT(1+(A77/pole1)^2)","v":1.0385228857640496},{"$f":"ATAN(A77/pole1)","v":0.2732235100489947},{"$f":"SQRT(1+(A77/Zero1)^2)","v":1.0000001626351354},{"$f":"ATAN(A77/Zero1)","v":5.7032466784444737E-4},{"$f":"IF(VIN_nom>Vout, 1, SQRT(1+(A77/z_RHP)^2))","v":1},{"$f":"IF(VIN_nom>Vout, 0, -ATAN(A77/z_RHP))","v":0},{"$f":"SQRT(1+(A77/Pole2)^2)","v":2.6399950517192812},{"$f":"ATAN(A77/Pole2)","v":1.1823093314649107},{"$f":"SQRT(1+(A77/Zero2)^2)","v":1.0011468959236942},{"$f":"ATAN(A77/Zero2)","v":4.7870676901795042E-2},{"$f":"SQRT(1+(A77/pole4)^2)","v":1.0000008680275805},{"$f":"ATAN(A77/pole4)","v":1.3175939833921574E-3},{"$f":"SQRT(1+(A77/Zero3)^2)","v":1.0000000000000659},{"$f":"ATAN(A77/Zero3)","v":3.6307999999998406E-7},{"$f":"SQRT(1+(A77/pole5)^2)","v":1.0000000000000659},{"$f":"ATAN(A77/pole5)","v":3.6307999999998406E-7},{"$f":"SQRT((1-(Z77/pterm2))^2+(A77/pterm1)^2)","v":1.0000088409662329},{"$f":"IF((ATAN((A77/pterm1)/(1-A77^2/pterm2))>0),ATAN((A77/pterm1)/(1-A77^2/pterm2)),PI()+ATAN((A77/pterm1)/(1-A77^2/pterm2)))","v":4.9267759525887531E-3},{"$f":"20*LOG10(((E77*K77*G77*O77)/(C77*I77*S77*M77*Q77))*Adc)","v":51.010693281113682},{"$f":"((F77+L77+H77+R77)-(D77+J77+T77+N77))*radconv","v":-80.978179148733503},{"$f":"IF(V77>0,V77,V77+180)","v":99.021820851266497},null,{"$f":"IF(U77<0,A77,1000000000)","v":1000000000},{"$f":"A77^2","v":131827.0864},null,{"$f":"20*LOG10((K77/(I77*M77))*AEA*Afb)","v":37.511190111850382},{"$f":"(L77-(J77+N77))*radconv","v":-65.074039671684162},null,{"$f":"20*LOG10((E77*G77/(C77*S77))*Am)","v":13.499503169263294},{"$f":"(F77+H77-(D77+T77))*radconv","v":-15.90416028000098},51.010693281113674,-80.978199951685141,0,{"$f":"IF(AI77>0,W75,0)","v":0}]
[398.11,{"$f":"A78/1000","v":0.39811000000000002},1.0461423885145211,0.29811168080576039,1.0000001955311202,6.2534964342887309E-4,1,0,2.8595509213332999,1.213539845222394,1.0013787172878319,5.2481141338759175E-2,1.0000010436022484,1.444715432770046E-3,1.0000000000000793,3.9810999999997899E-7,1.0000000000000793,3.9810999999997899E-7,1.0000106292082807,5.4021066212015054E-3,50.25529854666302,-83.960746030580651,96.039253969419349,null,1000000000,158491.57210000002,null,36.819305186422561,-66.606539672466084,null,13.435993360240456,-17.354229168137358,{"$f":"AB78+AE78","v":50.255298546663013},-83.960768840603436,{"$f":"SUM((U79<0)*(U78>0))*A78","v":0},0]
[436.52,0.43651999999999996,1.0552303182732334,0.32496966022774354,1.0000002350812545,6.8568390432804602E-4,1,0,3.1030197874962298,1.2426733479646555,1.001657360104615,5.7533890914127229E-2,1.0000012546918589,1.5841026147651394E-3,1.0000000000000953,4.3651999999997225E-7,1.0000000000000953,4.3651999999997225E-7,1.0000127791696312,5.923299671862817E-3,49.47283154620937,-86.913709785163547,93.086290214836453,null,1000000000,190549.71039999998,null,36.111985737372841,-67.9942514952576,null,13.360845808836537,-18.91948330065965,49.472831546209378,-86.91373479591725,0,0]
[478.63,0.47863,1.066052348259851,0.35386546295384746,1.0000002826243188,7.5183010337777085E-4,1,0,3.3725087492766646,1.2697546809079612,1.001992213018452,6.3069980246658067E-2,1.0000015084418203,1.7369167649665435E-3,1.0000000000001146,4.7862999999996352E-7,1.0000000000001146,4.7862999999996352E-7,1.0000153636247511,6.4946965722177544E-3,48.663714294171825,-89.841470783747923,90.158529216252077,null,1000000000,229086.67689999999,null,35.391515930932073,-69.237458630013194,null,13.272198363239751,-20.604039577213722,48.663714294171825,-89.84149820722692,0,0]
[524.80999999999995,0.52481,1.0789215932376504,0.3848589128256687,1.000000339792577,8.2436943258017625E-4,1,0,3.6704488376020374,1.2948617857351066,1.0023947095131343,6.9136681970949534E-2,1.0000018135639281,1.9045005578408574E-3,1.0000000000001377,5.2480999999995172E-7,1.0000000000001377,5.2480999999995172E-7,1.0000184713008167,7.1213170146245952E-3,47.827624663097588,-92.749545102719793,87.250454897280207,null,1000000000,275425.53609999997,null,34.659679873516708,-70.337995213338559,null,13.167944789580874,-22.411579958779299,47.827624663097581,-92.749575172117858,0,0]
[575.44000000000005,0.57544000000000006,1.0941918610818537,0.41796583261718873,1.0000004085166514,9.038987910861987E-4,1,0,3.9993417217395453,1.3180735727466446,1.0028783516265503,7.5782114669303305E-2,1.0000021803623824,2.0882329471906187E-3,1.0000000000001656,5.7543999999993655E-7,1.0000000000001656,5.7543999999993655E-7,1.000022207142214,7.8083160749085152E-3,46.964320761432205,-95.640943706497922,84.359056293502078,null,1000000000,331131.19360000006,null,33.918479723583047,-71.297704488968577,null,13.045841037849154,-24.343272187812754,46.964320761432205,-95.640976676781335,0,0]
[630.96,0.63096000000000008,1.1122749714594042,0.45318251670091164,1.0000004911490477,9.911093247004048E-4,1,0,4.3620847612481155,1.3394911028097143,1.0034595642397985,8.306166113332733E-2,1.0000026213930633,2.2897106092056381E-3,1.000000000000199,6.3095999999991628E-7,1.000000000000199,6.3095999999991628E-7,1.0000266990245688,8.5616625664050976E-3,46.07282561052191,-98.518465284885863,81.481534715114137,null,1000000000,398110.52160000004,null,33.169396564822577,-72.11929510065751,null,12.903429045699326,-26.399206335573432,46.072825610521903,-98.518501436230935,0,0]
[691.83,0.69183000000000006,1.1336315793346412,0.49045039023564568,1.0000005904843752,1.0867235937292237E-3,1,0,4.7617139372103319,1.3592127593840253,1.0041578152672288,9.1032521730059102E-2,1.0000031515714396,2.5106027812661202E-3,1.0000000000002394,6.9182999999988975E-7,1.0000000000002394,6.9182999999988975E-7,1.0000320988527707,9.387596147443512E-3,45.152237451827901,-101.38152508442701,78.618474915572989,null,1000000000,478628.74890000006,null,32.414049857657105,-72.805222306062419,null,12.738187594170796,-28.576342417303778,45.152237451827901,-101.3815647233662,0,0]
[758.58,0.75858000000000003,1.1587896529726103,0.52967882628866292,1.0000007099248525,1.191574112266463E-3,1,0,5.2017326399384434,1.3773484078031735,1.0049967477931163,9.9760010866516452E-2,1.0000037890559075,2.7528327022899503E-3,1.0000000000002878,7.5857999999985453E-7,1.0000000000002878,7.5857999999985453E-7,1.00003859155626,1.0293305591637757E-2,44.201082266956291,-104.22795749437998,75.772042505620021,null,1000000000,575443.61640000006,null,31.653603492320777,-73.3581488787257,null,12.547478774635522,-30.869852079086751,44.201082266956298,-104.22800095781245,0,0]
[831.76,0.83175999999999994,1.1883274015308374,0.57070758828356982,1.0000008535041438,1.3065248078657963E-3,1,0,5.685784841369709,1.3939995245186749,1.0060043019878064,0.10931067727170496,1.0000045553749808,3.018396159537588E-3,1.0000000000003459,8.3175999999980813E-7,1.0000000000003459,8.3175999999980813E-7,1.0000463963823223,1.1286250119640358E-2,43.218234743751076,-107.05107504740734,72.948924952592662,null,1000000000,691824.69759999996,null,30.889452569674425,-73.780190379924434,null,12.328782174076643,-33.270932323820524,43.218234743751069,-107.05112270374497,0,0]
[912.01,0.91200999999999999,1.2228995134961709,0.61334242580528398,1.0000010261450043,1.4325809763394088E-3,1,0,6.2181180325891239,1.4092745479720197,1.0072144586587992,0.11976101483642436,1.0000054768023836,3.3096155026190841E-3,1.0000000000004159,9.1200999999974713E-7,1.0000000000004159,9.1200999999974713E-7,1.0000557808981341,1.237510890079643E-2,42.202124984837035,-109.84215100720706,70.157848992792935,null,1000000000,831762.24009999994,null,30.122516032471754,-74.073310158425087,null,12.07960895236528,-35.76889310310596,42.202124984837035,-109.84220326153104,0,0]
[1000,1,1.2632113639369908,0.65731899945303618,1.0000012336997863,1.5707950330737222E-3,1,0,6.803187745743327,1.4232718850178159,1.0086674288999988,0.13118906096873223,1.0000065845731942,3.6289218960689367E-3,1.0000000000005,9.9999999999966665E-7,1.0000000000005,9.9999999999966665E-7,1.0000670631876696,1.3568966540096204E-2,41.151765160688569,-112.58780639270275,67.412193607297255,null,1000000000,1000000,null,29.353957430998673,-74.238814593014609,null,11.797807729689897,-38.349049095467727,41.151765160688569,-112.58786368848234,0,0]
[1096.5,1.0965,1.3100461648818158,0.70234115596166691,1.0000014832921809,1.7223764671708871E-3,1,0,7.4461226596034757,1.4360912320605708,1.0104119134192977,0.14368276803419527,1.0000079167077394,3.9791093252508156E-3,1.0000000000006013,1.0964999999995606E-6,1.0000000000006013,1.0964999999995606E-6,1.0000806304211225,1.4878262328996845E-2,40.066081025072961,-115.27243462373181,64.727565376268188,null,1000000000,1202312.25,null,28.58460048469075,-74.277536651129068,null,11.481480540382204,-40.994960797425058,40.066081025072954,-115.27249744855413,0,0]
[1202.3,1.2022999999999999,1.36422273823707,0.74804785778874683,1.0000017833437513,1.8885661762391742E-3,1,0,8.1521927823777833,1.4478202145168269,1.0125050960159685,0.15732868212642376,1.000009518153115,4.3630442627930234E-3,1.0000000000007228,1.2022999999994205E-6,1.0000000000007228,1.2022999999994205E-6,1.0000969402869546,1.6313704114747356E-2,38.945044478618215,-117.87611822127265,62.123881778727352,null,1000000000,1445525.2899999998,null,27.815676660998019,-74.189702410201178,null,11.129367817620196,-43.686484697787243,38.945044478618215,-117.87618710798841,0,{"$f":"IF(AI90>0,W90,0)","v":0}]
[1318.3,1.3183,1.4266327582059759,0.79406595755177833,1.0000021440642524,2.0707778353272238E-3,1,0,8.9274090139632616,1.4585461648426277,1.0150157965113011,0.1722224022716343,1.0000114433999978,4.7839922392718679E-3,1.0000000000008691,1.3182999999992363E-6,1.0000000000008691,1.3182999999992363E-6,1.0001165476296185,1.7887488507854155E-2,37.788814278192405,-120.37780864181184,59.622191358188161,null,1000000000,1737914.89,null,27.048151779471429,-73.975025331768492,null,10.740662498720972,-46.402858843069588,37.788814278192405,-120.37788417483807,0,0]
[1445.4,1.4454,1.4981760177141086,0.83997920250027691,1.0000025774206189,2.2704251069283459E-3,1,0,9.7777885993530127,1.4683445783326177,1.0180238733196987,0.18845294406492336,1.0000137563169358,5.2452186304625401E-3,1.0000000000010445,1.4453999999989937E-6,1.0000000000010445,1.4453999999989937E-6,1.0001401027429284,1.9611807326044031E-2,36.598979422418971,-122.75368628684525,57.246313713154748,null,1000000000,2089181.1600000001,null,26.283530705009586,-73.632917851927175,null,10.315448717409378,-49.120851250237891,36.598979422418964,-122.75376910216507,0,0]
[1584.9,1.5849000000000002,1.5799844972765615,0.88548044800771242,1.0000030989374851,2.4895499521865867E-3,1,0,10.712032650483181,1.4773072364325501,1.0216321615682253,0.20615173197901179,1.0000165397598209,5.7514401421699807E-3,1.0000000000012559,1.584899999998673E-6,1.0000000000012559,1.584899999998673E-6,1.0001684492061371,2.1504272582877976E-2,35.375020887247729,-124.98504395856034,55.01495604143966,null,1000000000,2511908.0100000002,null,25.52161351522517,-73.161378839878381,null,9.8534073720225592,-51.823755926763035,35.375020887247729,-124.98513476664141,0,0]
[1737.8,1.7378,1.6730189576855754,0.93013986472771193,1.0000037257055965,2.7297230734894878E-3,1,0,11.736841188526677,1.4854911033049691,1.0259518776818879,0.2254008981337865,1.0000198849419415,6.3062845540100641E-3,1.0000000000015099,1.7377999999982506E-6,1.0000000000015099,1.7377999999982506E-6,1.0002025155868888,2.3578417876907433E-2,34.120802582916212,-127.04670545436181,52.953294545638187,null,1000000000,3019948.84,null,24.764646338097592,-72.559174134347003,null,9.3561562448186191,-54.487630888620565,34.120802582916212,-127.04680502296756,0,0]
[1905.5,1.9055,1.778470090019789,0.97365472346321202,1.0000044794706038,2.9931434588234104E-3,1,0,12.861599215020279,1.4929669475790706,1.03112289798308,0.24631920243802624,1.0000239079189122,6.9148308147212248E-3,1.0000000000018154,1.9054999999976938E-6,1.0000000000018154,1.9054999999976938E-6,1.0002434832649492,2.5853192026229387E-2,32.838298286472693,-128.91982658781333,51.080173412186667,null,1000000000,3630930.25,null,24.013405326644449,-71.823845039883764,null,8.8248929598282455,-57.096090725037577,32.838298286472693,-128.91993576492135,0,0]
[2089.3000000000002,2.0893000000000002,1.8974581209788244,1.0157050733597961,1.0000053853036566,3.2818529793080492E-3,1,0,14.095026895622627,1.4997896642087805,1.0373030462877664,0.26899516883259367,1.000028742492499,7.5817945202195716E-3,1.0000000000021827,2.0892999999969601E-6,1.0000000000021827,2.0892999999969601E-6,1.0002927140818816,2.8346172703769348E-2,31.531809699297895,-130.58530897139684,49.414691028603158,null,1000000000,4365174.4900000012,null,23.269849042565461,-70.953734941209888,null,8.2619606567324357,-59.631693738259258,31.531809699297895,-130.58542867946915,0,0]
[2290.9,2.2909000000000002,2.031349750797971,1.0560850931962344,1.0000064747143922,3.5985217680120653E-3,1,0,15.448533304308651,1.5060199721639542,1.0446872571748318,0.2935445960465175,1.0000345568239175,8.3133421440035864E-3,1.0000000000026241,2.2908999999959922E-6,1.0000000000026241,2.2908999999959922E-6,1.0003519193968544,3.108034379262288E-2,30.204190447718794,-132.02972118769486,47.970278812305139,null,1000000000,5248222.8100000005,null,22.534984530893695,-69.946041313490852,null,7.6692059168250992,-62.083811133105399,30.204190447718794,-132.02985244659624,0,0]
[2511.9,2.5119000000000002,2.1814380853901714,1.0945874097041259,1.0000077841780108,3.945662812945009E-3,1,0,16.932861382664623,1.5117051799913517,1.0534945408673309,0.32004324159812436,1.0000415455707752,9.1152764592368363E-3,1.0000000000031548,2.5118999999947171E-6,1.0000000000031548,2.5118999999947171E-6,1.0004230798392146,3.4077307300233013E-2,28.860417397983031,-133.24097772061506,46.759022279384936,null,1000000000,6309641.6100000003,null,21.810981679238406,-68.799466625134713,null,7.0494357187446273,-64.441655016749053,28.860417397983035,-133.24112164188375,0,0]
[2754.2,2.7542,2.3492072717333681,1.1310880515211337,1.000009358336845,4.326260247256305E-3,1,0,18.560772639984616,1.5168931600369633,1.0639856519285782,0.34856940844606304,1.000049946971667,9.9944877646584458E-3,1.000000000003793,2.7541999999930355E-6,1.000000000003793,2.7541999999930355E-6,1.0005086190220176,3.7362700359436007E-2,27.504802240193094,-134.21192458608436,45.788075413915635,null,1000000000,7585617.6399999987,null,21.099664393374589,-67.512662115503915,null,6.4051378468185058,-66.699420274616571,27.504802240193094,-134.21208239012049,0,0]
[3020,3.02,2.5363456359482073,1.1655251000017635,1.0000112517791704,4.7437693176168149E-3,1,0,20.347048643485152,1.5216293429288836,1.0764692289895257,0.37919501080473145,1.0000600523359335,1.0958953494893705E-2,1.0000000000045604,3.0199999999908185E-6,1.0000000000045604,3.0199999999908185E-6,1.000611499784352,4.0966183213403194E-2,26.141305338418753,-134.93945509230397,45.060544907696027,null,1000000000,9120400,null,20.402786145408143,-66.084567460211062,null,5.7385191930106068,-68.855060665347224,26.14130533841875,-134.93962812555827,0,0]
[3311.3,3.3113000000000001,2.7443958746136627,1.1978305436969474,1.0000135270743875,5.2013309651330643E-3,1,0,22.305130442109817,1.525948559522458,1.0912815241150511,0.41191994209763938,1.0000721955519352,1.2015923493806395E-2,1.0000000000054823,3.311299999987898E-6,1.0000000000054823,3.311299999987898E-6,1.0007351168516758,4.4914646585346954E-2,24.77601696354407,-135.42345027081774,44.576549729182261,null,1000000000,10964707.690000001,null,19.723317447125936,-64.517599812105644,null,5.0526995164181363,-70.906040182227002,24.776016963544073,-135.42363999433263,0,0]
[3630.8,3.6308000000000002,2.9753955074189622,1.2280342550371264,1.0000162633826155,5.7031854614519976E-3,1,0,24.453167224517749,1.5298904217460263,1.1088330450364445,0.44676610453237692,1.0000867990286806,1.317518506533559E-2,1.0000000000065914,3.6307999999840453E-6,1.0000000000065914,3.6307999999840453E-6,1.0008837637765811,4.9244393575263758E-2,23.412645052373811,-135.66903405932851,44.33096594067149,null,1000000000,13182708.640000001,null,19.063170757731271,-62.813334634653309,null,4.3494742946425404,-72.855907454191694,23.412645052373811,-135.66924208884501,0,0]
[3981.1,3.9811000000000001,3.2313139285260881,1.2561589883601405,1.000019552922766,6.2534157344740415E-3,1,0,26.808639412879806,1.5334862630841284,1.1295722835225508,0.48367726785671761,1.0001043548343325,1.4446159364872766E-2,1.0000000000079245,3.9810999999789672E-6,1.0000000000079245,3.9810999999789672E-6,1.0010624398015981,5.3990270108892423E-2,22.056445942761044,-135.68482945133945,44.315170548660547,null,1000000000,15849157.209999999,null,18.425182521618979,-60.977328752857574,null,3.6312634211420667,-74.707728798709965,22.056445942761044,-135.68505755156752,0,0]
[4365.2,4.3651999999999997,3.5144135300648598,1.2822671628945417,1.0000235078518915,6.8567326599369835E-3,1,0,29.391719584932677,1.5367665713315881,1.1540133037251648,0.52256638651042264,1.0001254613943247,1.5839714555146055E-2,1.0000000000095275,4.3651999999722742E-6,1.0000000000095275,4.3651999999722742E-6,1.0012772218122541,5.9192409357932449E-2,20.711890716044998,-135.48379904644628,44.516200953553721,null,1000000000,19054971.039999999,null,17.811930528717998,-59.01693903177933,null,2.8999601873269998,-76.467110122203991,20.711890716044998,-135.48404915398334,0,0]
[4786.3,4.7862999999999998,3.8271086897335795,1.3064339397912033,1.000028262036496,7.5181607981243716E-3,1,0,32.22392785485291,1.5397585035879635,1.1827254520646213,0.5632865649039912,1.000150832920522,1.7367438737692024E-2,1.0000000000114544,4.7862999999634508E-6,1.0000000000114544,4.7862999999634508E-6,1.0015353579772783,6.489347872931836E-2,19.383506917120346,-135.08304228809902,44.916957711900977,null,1000000000,22908667.690000001,null,17.226103112200832,-56.942801905237324,null,2.1574038049195154,-78.14051461765149,19.383506917120346,-135.08331652288882,0,0]
[5248.1,5.2481,4.172191322967703,1.3287578293298554,1.0000339786861876,8.2435094576966978E-3,1,0,35.330149546038086,1.5424881088977567,1.2163533064007701,0.60565469985795606,1.0001813401151569,1.9042726478402699E-2,1.0000000000137712,5.2480999999518189E-6,1.0000000000137712,5.2480999999518189E-6,1.0018456785659169,7.1142684844371501E-2,18.07490834599982,-134.50344066225517,45.496559337744827,null,1000000000,27542553.610000003,null,16.670014133527907,-54.76766836504936,null,1.4048942124719157,-79.736072991186617,18.074908345999823,-134.50374135623599,0,0]
[5370.3,5.3703000000000003,4.2638182192470957,1.3340596522634991,1.0000355794414588,8.4354474187130508E-3,1,0,36.152146991518634,1.5431319237699934,1.2256043448165508,0.61647075280168995,1.0001898824923554,1.9486018120120515E-2,1.00000000001442,5.3702999999483734E-6,1.00000000001442,5.3702999999483734E-6,1.0019325588921717,7.2795790258905771E-2,17.751444215058701,-134.33349689705341,45.666503102946592,null,1000000000,28840122.090000004,null,16.535978618462167,-54.210240794877173,null,1.2154655965965342,-80.123563797701294,17.751444215058701,-134.33380459257847,0,0]
[5432.85,5.4328500000000002,4.310763778085521,1.3366862271215079,1.0000364130685981,8.5336936558793614E-3,1,0,36.572904967640568,1.5434502724902945,1.2303944813308358,0.62194386030178561,1.0001943310923485,1.9712920995544697E-2,1.000000000014758,5.432849999946548E-6,1.000000000014758,5.432849999946548E-6,1.001977801146138,7.3641867483344198E-2,17.589284126555555,-134.24448718103051,45.755512818969493,null,1000000000,29515859.122500002,null,16.469314371293237,-53.927895449185506,null,1.1199697552623196,-80.316903011221086,17.589284126555555,-134.2447984604066,0,0]
[5495.4,5.4954000000000001,4.3577384355519699,1.3392561925635225,1.0000372563483959,8.6319397283020141E-3,1,0,36.993666565962357,1.5437613795199701,1.2352211876998851,0.62737435637740946,1.0001988311868018,1.9939821840887981E-2,1.0000000000150997,5.4953999999446802E-6,1.0000000000150997,5.4953999999446802E-6,1.0020235655148386,7.4487882228751023E-2,17.429365732015661,-134.15425683420017,45.845743165799831,null,1000000000,30199421.159999996,null,16.4039240444542,-53.647576523652965,null,1.0254416875614629,-80.5069951737743,17.429365732015665,-134.15457169742726,0,0]
[5559.4,5.5593999999999992,4.40583118138436,1.3418289942823749,1.0000381291675169,8.7324631151211481E-3,1,0,37.424185651965487,1.5440724577240088,1.2401971900658089,0.63288682157451037,1.0002034888981377,2.0171980452372871E-2,1.0000000000154534,5.559399999942725E-6,1.0000000000154534,5.559399999942725E-6,1.0020709311140965,7.5353443419646601E-2,17.268009018335164,-134.06078147081828,45.939218529181716,null,1000000000,30906928.359999996,null,16.338304185489992,-53.362860709626631,null,0.92970483284517025,-80.698239291348614,17.268009018335164,-134.06110000097524,0,0]
[5623.4,5.6233999999999993,4.4539524608595356,1.344346218367547,1.0000390120919567,8.8329863254538784E-3,1,0,37.854708277118995,1.5443764601551877,1.2452105767801278,0.63835506396162645,1.0002082005175583,2.0404136889139682E-2,1.0000000000158114,5.623399999940724E-6,1.0000000000158114,5.623399999940724E-6,1.0021188431843535,7.6218937701429013E-2,17.108896242470454,-133.96624616393854,46.033753836061464,null,1000000000,31622627.559999995,null,16.273953531072031,-53.08027313944924,null,0.83494271139842957,-80.886295221576205,17.108896242470461,-133.96656836102545,0,0]
[5688.9,5.6888999999999994,4.5032301728987525,1.3468667195897754,1.0000399261732695,8.9358653636698229E-3,1,0,38.295324816287291,1.5446805101386836,1.2503797043882623,0.64390589459179148,1.0002130783828613,2.0641732214541183E-2,1.0000000000161817,5.6888999999386289E-6,1.0000000000161817,5.6888999999386289E-6,1.0021684439563729,7.7104646934824037E-2,16.948325772884949,-133.86850418179625,46.131495818203746,null,1000000000,32363583.209999997,null,16.209376392732512,-52.793267961413761,null,0.7389493801524406,-81.075562170342906,16.948325772884953,-133.86883013175668,0,0]
[5754.4,5.7543999999999995,4.5525358741889166,1.3493326402156332,1.0000408508390823,9.0387442127249588E-3,1,0,38.735944815179899,1.5449776430335658,1.2555870404391209,0.64941085139982035,1.0002180127111788,2.0879325209119455E-2,1.0000000000165565,5.7543999999364839E-6,1.0000000000165565,5.7543999999364839E-6,1.0022186169717178,7.7990284480212738E-2,16.790001743314168,-133.76986278812356,46.230137211876439,null,1000000000,33113119.359999996,null,16.14606379906321,-52.508494706248968,null,0.64393794425095563,-81.261697784708574,16.790001743314164,-133.77019249095753,0,0]
[5821.4,5.8213999999999997,4.602998734057838,1.3518003602484256,1.000041807631282,9.1439788679788473E-3,1,0,39.18665880620923,1.5452746671815853,1.260952665915823,0.65499466115938199,1.0002231184559001,2.1122356825212778E-2,1.0000000000169442,5.8213999999342396E-6,1.0000000000169442,5.8213999999342396E-6,1.0022705309609536,7.8896128786091951E-2,16.630323782350626,-133.66813462926578,46.331865370734221,null,1000000000,33888697.959999993,null,16.082577011403963,-52.219508889077289,null,0.54774677094666335,-81.44895928183972,16.630323782350626,-133.66846817091701,0,0]
[5888.4,5.8883999999999999,4.6534890165105143,1.3542145452712173,1.0000427754982562,9.2492133207005556E-3,1,0,39.637376175793804,1.5455649364200899,1.2663572726767431,0.66053098073093908,1.0002282832775609,2.1365385945803388E-2,1.0000000000173366,5.8883999999319428E-6,1.0000000000173366,5.8883999999319428E-6,1.0023230435459114,7.9801896365843783E-2,16.472891547809212,-133.56566857235183,46.434331427648175,null,1000000000,34673254.559999995,null,16.020348198663935,-51.932856888461252,null,0.45254334914527788,-81.633149064359088,16.472891547809212,-133.56600595282035,0,0]
[5957,5.9569999999999999,4.705212527806685,1.3566326854684205,1.0000437779530786,9.3569606227014261E-3,1,0,40.098860326811035,1.5458553764900622,1.2719308144453159,0.66615058619871736,1.0002336326472643,2.1614216131339466E-2,1.0000000000177429,5.9569999999295369E-6,1.0000000000177429,5.9569999999295369E-6,1.0023774302868937,8.0729213813784048E-2,16.313973660349205,-133.46009001351391,46.539909986486094,null,1000000000,35485849,null,15.957903923495502,-51.641775121953884,null,0.35606973685370391,-81.81865620251898,16.313973660349205,-133.46043132447286,0,0]
[6025.6,6.0256000000000007,4.7569629539636873,1.3589982259372162,1.0000447920178672,9.4647077074374794E-3,1,0,40.560347783413313,1.5461392074464488,1.2775441725313144,0.67172098270914504,1.00023904394723,2.1863043639935964E-2,1.0000000000181539,6.0255999999270751E-6,1.0000000000181539,6.0255999999270751E-6,1.0024324443819772,8.1656448987323646E-2,16.157304199027354,-133.35393364858473,46.646066351415271,null,1000000000,36307855.360000007,null,15.896712846064109,-51.353133993327603,null,0.26059135296324354,-82.001144896706577,16.157304199027351,-133.35427889003418,0,0]
[6095.8,6.0958000000000006,4.8099473445955994,1.3613662292305049,1.0000458417535789,9.5749676161781382E-3,1,0,41.032602101623908,1.5464230488382142,1.2833291294333684,0.67737067256677075,1.0002446455709886,2.211767190216158E-2,1.0000000000185794,6.0957999999244956E-6,1.0000000000185794,6.0957999999244956E-6,1.0024893909849653,8.2605224491783286E-2,15.9992549629237,-133.24479827973519,46.755201720264807,null,1000000000,37158777.640000001,null,15.83535896692435,-51.060282647162708,null,0.16389599599934992,-82.18486489618563,15.9992549629237,-133.24514754334834,0,0]
[6166,6.1660000000000004,4.8629581188935624,1.3636826183935842,1.0000469036470698,9.6852272921016738E-3,1,0,41.504859650434952,1.5467004309485344,1.2891546805222034,0.68296947911399586,1.0002503120454318,2.2372297295928881E-2,1.0000000000190097,6.1659999999218569E-6,1.0000000000190097,6.1659999999218569E-6,1.002546994358404,8.3553911869418657E-2,15.84345349159525,-133.1352457481228,46.864754251877201,null,1000000000,38019556,null,15.775251496843348,-50.769976446018262,null,6.8201994751902181E-2,-82.36562258788139,15.84345349159525,-133.13559903389967,0,0]
[6237.8,6.2378,4.9172035190880079,1.3660001250771445,1.0000480023198088,9.7979997654412052E-3,1,0,41.987884132329576,1.5469776804978177,1.295154429300317,0.68864361003745123,1.0002561747537873,2.2632723115841514E-2,1.0000000000194551,6.2377999999190955E-6,1.0000000000194551,6.2377999999190955E-6,1.0026065899225127,8.4524129551414362E-2,15.686372424107757,-133.02285575282289,46.977144247177108,null,1000000000,38910148.840000004,null,15.715030285675704,-50.475679220766381,null,-2.8657861567945989E-2,-82.547533931670344,15.686372424107757,-133.02321315243671,0,0]
[6309.6,6.3096000000000005,4.9714747523749798,1.3682670454716261,1.0000491137107608,9.9107719895586265E-3,1,0,42.470911768306827,1.5472486236715199,1.3011954912435881,0.69426523397022188,1.0002621053003269,2.2893145865290784E-2,1.0000000000199054,6.3095999999162696E-6,1.0000000000199054,6.3095999999162696E-6,1.0026668723293566,8.5494252938305287E-2,15.531535263026752,-132.91020891255684,47.08979108744316,null,1000000000,39811052.160000004,null,15.656046789641696,-50.18402891984929,null,-0.12451152661494633,-82.726541506158384,15.53153526302675,-132.91057042600767,0,0]
[6383.05,6.3830499999999999,5.027019023843228,1.370535401818793,1.0000502638019677,1.0026135515060777E-2,1,0,42.965042774268447,1.5475194895572062,1.3074175308592006,0.69996210592362906,1.000268242327071,2.3159550046207775E-2,1.0000000000203717,6.3830499999133111E-6,1.0000000000203717,6.3830499999133111E-6,1.0027292506451597,8.6486571567820955E-2,15.37540760323051,-132.79479436337516,47.205205636624839,null,1000000000,40743327.302500002,null,15.596955304984505,-49.888405507429894,null,-0.22154770175398783,-82.906754577771096,15.375407603230517,-132.79516008520099,0,0]
[6456.5,6.4565000000000001,5.0825885961121999,1.3727541680395594,1.0000514272025558,1.0141498773684081E-2,1,0,43.459176860820577,1.5477841959312486,1.3136815991234192,0.7056048304211987,1.0002744503431664,2.3425950939256014E-2,1.0000000000208433,6.4564999999102839E-6,1.0000000000208433,6.4564999999102839E-6,1.0027923475076359,8.7478789268038246E-2,15.221519976161066,-132.67928206000209,47.320717939997905,null,1000000000,41686392.25,null,15.539092695791473,-49.595531413302439,null,-0.31757271963040684,-83.084120576900517,15.221519976161066,-132.67965199020296,0,0]
[6531.7,6.5316999999999998,5.1395075093106044,1.3749760787922729,1.0000526321107834,1.0259610366667768E-2,1,0,43.965087136681419,1.548049044572861,1.32013783124259,0.71132633143322821,1.0002808798149678,2.3698695582803402E-2,1.0000000000213316,6.5316999999071123E-6,1.0000000000213316,6.5316999999071123E-6,1.0028576920077346,8.8494541528934337E-2,15.066232052713451,-132.56099884746536,47.439001152534644,null,1000000000,42663104.890000001,null,15.481091228397091,-49.298515378828149,null,-0.41485917568363928,-83.262857707480663,15.066232052713451,-132.56137308630881,0,0]
[6606.9,6.6068999999999996,5.1964512397607381,1.3771493038124871,1.0000538509700598,1.0377721673391828E-2,1,0,44.471000426297969,1.5483078672627217,1.3266368573844662,0.71699195858658615,1.0002873836963446,2.3971436699861359E-2,1.0000000000218257,6.6068999999038662E-6,1.0000000000218257,6.6068999999038662E-6,1.0029237894534262,8.9510185583079827E-2,14.913183088765109,-132.44277583717641,47.557224162823587,null,1000000000,43651127.609999992,null,15.4243111694764,-49.004355216988245,null,-0.51112808071129079,-83.438799167674233,14.913183088765109,-132.44315438466248,0,0]
[6683.85,6.6838500000000005,5.2547449721094681,1.3793243342664807,1.0000551126355091,1.0498581281237511E-2,1,0,44.988689977718174,1.5485666871960737,1.333330770745986,0.72273206853083805,1.000294115956962,2.4250521158091988E-2,1.0000000000223368,6.6838499999004689E-6,1.0000000000223368,6.6838499999004689E-6,1.002992204370033,9.0549351686907462E-2,14.758835266394483,-132.32194215764605,47.678057842353951,null,1000000000,44673850.822500005,null,15.367440617257538,-48.706290794320182,null,-0.60860535086305367,-83.616034319722218,14.758835266394485,-132.3223251140424,0,0]
[6760.8,6.7608000000000006,5.3130630178214986,1.3814516268045838,1.0000563889087712,1.0619440582366208E-2,1,0,45.506382474261031,1.548819618339681,1.3400681761039572,0.72841464552146906,1.0003009261275702,2.4529601837977436E-2,1.0000000000228542,6.760799999896992E-6,1.0000000000228542,6.760799999896992E-6,1.00306140741135,9.1588401909426312E-2,14.60672199063227,-132.20132545121976,47.798674548780241,null,1000000000,45708416.640000001,null,15.311782007787333,-48.411185147798861,null,-0.70506001715506339,-83.790527668727478,14.60672199063227,-132.20171281652634,0,0]
[6839.55,6.83955,5.3727695753524696,1.3835808568398151,1.0000577101606845,1.0743126680404166E-2,1,0,46.036187682398747,1.5490725762361717,1.3470075305371303,0.73417110174354705,1.0003079762637439,2.4815206763668562E-2,1.0000000000233897,6.8395499998933505E-6,1.0000000000233897,6.8395499998933505E-6,1.00313304508478,9.2651636061522491E-2,14.453308784906794,-132.07818570205174,47.921814297948259,null,1000000000,46779444.202500001,null,15.256042603960347,-48.112221877694033,null,-0.80273381905355368,-83.966355701706902,14.453308784906794,-132.07857757940093,0,0]
[6918.3,6.9183000000000003,5.4324999554970343,1.3856632743414377,1.000059046711691,1.086681244972826E-2,1,0,46.565995769255395,1.5493197780535475,1.3539910620921463,0.73986836455025551,1.0003151079940593,2.5100807640224564E-2,1.0000000000239315,6.9182999998896235E-6,1.0000000000239315,6.9182999998896235E-6,1.0032055078866735,9.3714746087078762E-2,14.302125354652082,-131.95541820102449,48.044581798975514,null,1000000000,47862874.890000001,null,15.201505306110422,-47.816320109430151,null,-0.89937995145833538,-84.139494480986215,14.302125354652086,-131.95581459041637,0,0]
[6998.9,6.9988999999999999,5.4936573832346864,1.3877477120898294,1.0000604305034,1.0993403508662526E-2,1,0,47.108253020916486,1.5495670293010806,1.3611836876058792,0.74563874012861497,1.0003224917534925,2.5393113629236533E-2,1.0000000000244924,6.9988999998857209E-6,1.0000000000244924,6.9988999998857209E-6,1.0032805272610259,9.4802700770787993E-2,14.149643643358305,-131.83022133237367,48.169778667626332,null,1000000000,48984601.209999993,null,15.146897866480749,-47.516616294702104,null,-0.99725422312244416,-84.314006045103213,14.149643643358305,-131.8306223398053,0,0]
[7079.5,7.0795000000000003,5.5548381546085528,1.3897862427009806,1.0000618303213291,1.1119994215238488E-2,1,0,47.650513086909427,1.5498086531534887,1.3684211594411277,0.75134826602601634,1.0003299609820058,2.5685415278063142E-2,1.0000000000250595,7.0794999998817268E-6,1.0000000000250595,7.0794999998817268E-6,1.0033564106595594,9.5890522472930714E-2,13.999386482189331,-131.7055503346551,48.294449665344899,null,1000000000,50119320.25,null,15.093482264475835,-47.220076235216681,null,-1.0940957822865038,-84.485879724909935,13.999386482189331,-131.70595596012663,0,0]
[7161.95,7.16195,5.617446557539064,1.3918256101219493,1.0000632788512172,1.1249490170958179E-2,1,0,48.205222381755782,1.5500501983085802,1.3758704161747133,0.75712649736987814,1.000337690082864,2.5984421541108683E-2,1.0000000000256468,7.1619499998775462E-6,1.0000000000256468,7.1619499998775462E-6,1.0034349296224765,9.7003173636212581E-2,13.847926309274188,-131.57862644638618,48.421373553613819,null,1000000000,51293527.802499995,null,15.040039999502694,-46.91997928068934,null,-1.1921136902285077,-84.659057515205419,13.847926309274186,-131.57903679589475,0,0]
[7244.4,7.2443999999999997,5.6800778084465033,1.3938200116074284,1.0000647441513202,1.1378985749373096E-2,1,0,48.759934425098919,1.5502862476532817,1.383365114786173,0.76284230804419861,1.0003455086172721,2.6283423156919422E-2,1.0000000000262408,7.2443999998732674E-6,1.0000000000262408,7.2443999998732674E-6,1.0035143523697476,9.8115682485264241E-2,13.698682265028532,-131.45237935531773,48.547620644682269,null,1000000000,52481331.359999992,null,14.987777408051112,-46.623143614077534,null,-1.2890951430225785,-84.829650814785765,13.698682265028534,-131.45279442886329,0,0]
[7328.75,7.3287500000000003,5.7441752152405563,1.3958153579384911,1.0000662605724702,1.1511465063790092E-2,1,0,49.327432149667956,1.5505222426571788,1.3910787820280246,0.76862590638819051,1.0003535998705975,2.6589310181729865E-2,1.0000000000268554,7.3287499998687894E-6,1.0000000000268554,7.3287499998687894E-6,1.0035965404287912,9.9253679353510343E-2,13.54823619300169,-131.32398313549891,48.676016864501094,null,1000000000,53710576.5625,null,14.93549738955284,-46.322815391463699,null,-1.3872611965511497,-85.001587650479763,13.54823619300169,-131.32440304194347,0,0]
[7413.1,7.4131,5.8082949871201972,1.3977666572633349,1.0000677945454983,1.1643943974120347E-2,1,0,49.894932558968186,1.5507528693024051,1.3988384667848024,0.77434552834286352,1.0003617847223609,2.6895192229691337E-2,1.0000000000274771,7.4130999998642073E-6,1.0000000000274771,7.4130999998642073E-6,1.0036796740135776,0.10039152389785443,13.399997415674047,-131.19641221140952,48.803587788590477,null,1000000000,54954051.610000007,null,14.884384482582957,-46.02584487650298,null,-1.4843870669089074,-85.170992074250108,13.399997415674051,-131.1968369507531,0,0]
[7499.45,7.4994499999999995,5.8739574876919791,1.3997200880570104,1.0000693830711249,1.1779563632580446E-2,1,0,50.475891503170807,1.5509835924916908,1.4068290114203779,0.78013521484837889,1.0003702605942077,2.7208321749143904E-2,1.0000000000281208,7.4994499998594059E-6,1.0000000000281208,7.4994499998594059E-6,1.003765757965678,0.10155618800230805,13.250473812256235,-131.06672637092365,48.933273629076353,null,1000000000,56241750.302499995,null,14.833234708189396,-45.725280739577116,null,-1.5827608959331605,-85.341875318180684,13.250473812256235,-131.06715605775781,0,0]
[7585.8,7.5857999999999999,5.9396419070208459,1.4016303213923853,1.0000709899906608,1.1915182857706125E-2,1,0,51.056853073217276,1.5512090650242047,1.4148661800587665,0.78585931461793668,1.0003788345507869,2.7521445931813476E-2,1.0000000000287721,7.5857999998544936E-6,1.0000000000287721,7.5857999998544936E-6,1.0038528323827334,0.10272068886105333,13.103150699157325,-130.93801286684527,49.06198713315473,null,1000000000,57544361.640000001,null,14.783240361564385,-45.428173299569771,null,-1.6800896624070614,-85.510274201600197,13.103150699157323,-130.93844750116997,0,0]
[7674.15,7.67415,6.0068696156188395,1.4035415525884873,1.0000726531667448,1.2053942780836071E-2,1,0,51.651273240137442,1.5514345101350446,1.4231369344073439,0.79164888165575642,1.0003877086096085,2.7841816968942557E-2,1.0000000000294462,7.6741499998493501E-6,1.0000000000294462,7.6741499998493501E-6,1.0039429484891222,0.10391199050247707,12.954636261991133,-130.80737468923752,49.19262531076248,null,1000000000,58892578.222499996,null,14.733250029906447,-45.127728504420048,null,-1.7786137679153105,-85.680085881224301,12.954636261991137,-130.80781438564435,0,0]
[7762.5,7.7625000000000002,6.0741187803904015,1.4054104703713259,1.0000743355984794,1.2192702239764239E-2,1,0,52.245695972523272,1.5516548252764468,1.4314548388450665,0.79737135457086461,1.0003966853439972,2.8162182289462007E-2,1.0000000000301283,7.7624999998440873E-6,1.0000000000301283,7.7624999998440873E-6,1.0040341010015719,0.10510311738567986,12.808312313417138,-130.67785210224869,49.322147897751307,null,1000000000,60256406.25,null,14.684401565496772,-44.830833666200469,null,-1.8760892520796344,-85.847463194537141,12.808312313417138,-130.67829686073762,0,0]
[7852.9,7.8529,6.142949812613594,1.4072803915971839,1.0000760769988835,1.2334680871843567E-2,1,0,52.853913761313024,1.5518751230470129,1.4400136965750856,0.80315798495362478,1.0004059766409943,2.8489975115177694E-2,1.000000000030834,7.8528999998385748E-6,1.000000000030834,7.8528999998385748E-6,1.0041284410451505,0.10632169926529877,12.660803714341709,-130.54652411854121,49.453475881458786,null,1000000000,61668038.409999996,null,14.635567674828419,-44.530687445280925,null,-1.9747639604867104,-86.01628661128774,12.660803714341709,-130.54697405656867,0,0]
[7943.3,7.9432999999999998,{"$f":"SQRT(1+(A141/pole1)^2)","v":6.2118018482503778},{"$f":"ATAN(A141/pole1)","v":1.4091088664299509},{"$f":"SQRT(1+(A141/Zero1)^2)","v":1.0000778385586826},{"$f":"ATAN(A141/Zero1)","v":1.2476659006616105E-2},{"$f":"IF(VIN_nom>Vout, 1, SQRT(1+(A141/z_RHP)^2))","v":1},{"$f":"IF(VIN_nom>Vout, 0, -ATAN(A141/z_RHP))","v":0},{"$f":"SQRT(1+(A141/Pole2)^2)","v":53.462134056798348},{"$f":"ATAN(A141/Pole2)","v":1.5520904083240277},{"$f":"SQRT(1+(A141/Zero2)^2)","v":1.4486202025768367},{"$f":"ATAN(A141/Zero2)","v":0.80887604615296627},{"$f":"SQRT(1+(A141/pole4)^2)","v":1.0004153754277461},{"$f":"ATAN(A141/pole4)","v":2.881776181696153E-2},{"$f":"SQRT(1+(A141/Zero3)^2)","v":1.0000000000315481},{"$f":"ATAN(A141/Zero3)","v":7.943299999832937E-6},{"$f":"SQRT(1+(A141/pole5)^2)","v":1.0000000000315481},{"$f":"ATAN(A141/pole5)","v":7.943299999832937E-6},{"$f":"SQRT((1-(Z141/pterm2))^2+(A141/pterm1)^2)","v":1.0042238656320501},{"$f":"IF((ATAN((A141/pterm1)/(1-A141^2/pterm2))>0),ATAN((A141/pterm1)/(1-A141^2/pterm2)),PI()+ATAN((A141/pterm1)/(1-A141^2/pterm2)))","v":0.10754009405343726},{"$f":"20*LOG10(((E141*K141*G141*O141)/(C141*I141*S141*M141*Q141))*Adc)","v":12.515475000096519},{"$f":"((F141+L141+H141+R141)-(D141+J141+T141+N141))*radconv","v":-130.41645191959023},{"$f":"IF(V141>0,V141,V141+180)","v":49.58354808040977},null,{"$f":"IF(U141<0,A141,1000000000)","v":1000000000},{"$f":"A141^2","v":63096014.890000001},null,{"$f":"20*LOG10((K141/(I141*M141))*AEA*Afb)","v":14.58786159007316},{"$f":"(L141-(J141+N141))*radconv","v":-44.234182403579318},null,{"$f":"20*LOG10((E141*G141/(C141*S141))*Am)","v":-2.0723865899766398},{"$f":"(F141+H141-(D141+T141))*radconv","v":-86.182724633576839},12.51547500009652,-130.41690703715616,0,0]
[8035.8,{"$f":"A142/1000","v":8.0358000000000001},6.2822743433543629,1.4109383240732776,1.0000796619068522,1.2621934785286101E-2,1,0,54.084485870074197,1.5523056825709167,1.4574750793783546,0.81465684208827394,1.0004251038102374,2.9153156620567701E-2,1.0000000000322871,8.0357999998270327E-6,1.0000000000322871,8.0357999998270327E-6,1.004322629290515,0.10878659642431751,12.36896978763712,-130.28469826054419,49.715301739455811,null,1000000000,64574081.640000001,null,14.540180826608966,-43.934518206419234,null,-2.171211038971848,-86.350640471550506,{"$f":"AB142+AE142","v":12.368969787637118},-130.28515867796975,{"$f":"SUM((U143<0)*(U142>0))*A142","v":0},0]
[8128.3,8.1282999999999994,6.3527673981613493,1.4127271866869464,1.0000815063616773,1.2767210031156584E-2,1,0,54.706840132760291,1.5525160588349127,1.4663780723344233,0.82036763169569893,1.000434944728027,2.948854486358549E-2,1.0000000000330345,8.1282999998209895E-6,1.0000000000330345,8.1282999998209895E-6,1.0044225278999104,0.11003289849646754,12.224633208193827,-130.1543372893714,49.845662710628602,null,1000000000,66069260.890000001,null,14.493613286174199,-43.638584066748393,null,-2.2689800779803724,-86.516218939908171,12.224633208193826,-130.15480300665655,0,0]
[8222.9500000000007,8.2229500000000009,6.4249195163185879,1.4145169890600591,1.000083415535731,1.2915861386991067E-2,1,0,55.343662376228899,1.5527264272012153,1.4755368978621701,0.82613962954433073,1.0004451308664226,2.9831721747516648E-2,1.0000000000338085,8.222949999814663E-6,1.0000000000338085,8.222949999814663E-6,1.0045259230009811,0.11130795900993851,12.0791295610302,-130.02242316957717,49.977576830422834,null,1000000000,67616906.702500015,null,14.447081884821312,-43.339588756929452,null,-2.3679523237911098,-86.68330555297841,12.079129561030202,-130.02289430990785,0,0]
[8270.2750000000015,8.2702750000000016,6.4610031641823715,1.4153968983615102,1.0000843784098847,1.2990186851254092E-2,1,0,55.662074400660778,1.5528298062851233,1.4801345739528715,0.82899879375895291,1.000450268118493,3.0003307558822908E-2,1.0000000000341989,8.2702749998114464E-6,1.0000000000341989,8.2702749998114464E-6,1.0045780659604826,0.1119454090020468,12.007189965217302,-129.95703649167035,50.042963508329649,null,1000000000,68397448.575625017,null,14.424230022236724,-43.191525042337609,null,-2.4170400570194226,-86.765985301186163,12.007189965217302,-129.95751034352378,0,0]
[8317.6,8.3176000000000005,6.4970917588489714,1.4162670332829796,1.0000853468087687,1.3064512171986597E-2,1,0,55.980487013199138,1.5529320093458969,1.4847442748828397,0.83184022732837037,1.0004554348252077,3.0174891602920861E-2,1.0000000000345912,8.3175999998081892E-6,1.0000000000345912,8.3175999998081892E-6,1.0046305058064231,0.11258280508724798,11.935782609777785,-129.89203511135153,50.107964888648468,null,1000000000,69182469.760000005,null,14.401648588205109,-43.044409736469333,null,-2.4658659784273245,-86.848101938258395,11.935782609777785,-129.89251167472773,0,0]
[8366.0499999999993,8.3660499999999995,6.5340432830458299,1.4171478949390337,1.0000863439515018,1.3140604189149275E-2,1,0,56.306469462578946,1.5530354444965861,1.4894758970978683,0.83473096318662066,1.0004607548665683,3.0350552665778352E-2,1.0000000000349956,8.3660499998048175E-6,1.0000000000349956,8.3660499998048175E-6,1.0046844997563285,0.1132352970637347,11.863222054872519,-129.82589134625246,50.174108653747538,null,1000000000,69990792.602499992,null,14.378806317092661,-42.894773807047798,null,-2.5155842622201421,-86.931596878561393,11.863222054872519,-129.82637068560919,0,0]
[8414.5,8.4145000000000003,6.5709998200972066,1.4180188490017891,1.0000873468847185,1.3216696054135431E-2,1,0,56.632452507437009,1.553137688878619,{"$f":"SQRT(1+(A148/Zero2)^2)","v":1.4942198870128705},{"$f":"ATAN(A148/Zero2)","v":0.83760336736050844},1.0004661057786262,3.0526211855038104E-2,1.0000000000354019,8.4144999998014068E-6,1.0000000000354019,8.4144999998014068E-6,1.0047388047905625,0.11388773190878773,11.791205068505711,-129.76015864797947,50.239841352020534,null,1000000000,70803810.25,null,14.356239061286127,-42.746119872405075,null,-2.5650339927804158,-87.014520890911626,11.791205068505711,-129.7606407633167,0,0]
[8462.9500000000007,8.4629500000000011,6.60796128589649,1.4188800603923173,1.000088355608401,1.3292787766064388E-2,1,0,56.958436137549249,1.553238762934805,1.4989761272032105,0.84045756672482652,1.0004714875608864,3.0701869159889931E-2,1.0000000000358109,8.4629499997979572E-6,1.0000000000358109,8.4629499997979572E-6,1.0047934208658089,0.11454010930343042,11.719724610010635,-129.69484034886551,50.305159651134488,null,1000000000,71621522.702500015,null,14.333942673147861,-42.598441833818363,null,-2.6142180631372258,-87.09688340636491,11.719724610010635,-129.69532524018328,0,0]
[8511.4,8.5114000000000001,6.6449275981972988,1.4197316904203527,1.000089370122532,1.3368879324055468E-2,1,0,57.284420342924285,1.5533386866427208,1.5037445014285635,0.8432936877377315,1.0004769002128509,3.0877524569524337E-2,1.0000000000362219,8.511399999794467E-6,1.0000000000362219,8.511399999794467E-6,1.0048483479385137,0.1151924289288883,11.648773757689694,-129.62993957155643,50.370060428443566,null,1000000000,72443929.959999993,null,14.311913079233715,-42.451733589780467,null,-2.6631393215440218,-87.178693649074262,11.648773757689693,-129.63042723885474,0,0]
[8560.9500000000007,8.5609500000000001,6.6827381159239039,1.420592909994949,1.0000904136591282,1.3446698290820847E-2,1,0,57.617806219316087,1.553439709525368,1.5086335664446178,0.84617563217761449,1.0004824676811106,3.1057166056161548E-2,1.0000000000366449,8.5609499997908571E-6,1.0000000000366449,8.5609499997908571E-6,1.0049048436887185,0.1158594986172011,11.576752737630418,-129.56400018937654,50.435999810623457,null,1000000000,73289864.902500018,null,14.289655109298691,-42.302691220233378,null,-2.7129023716682719,-87.261799475447347,11.576752737630418,-129.56449069568072,0,0]
[8610.5,8.6105,6.7205535344571343,1.4214444383213243,1.0000914632520508,1.3524517094715945E-2,1,0,57.9511926769678,1.5535395700632839,1.5135350805625365,0.84903893418044929,1.0004880674356438,3.1236805537680861E-2,1.0000000000370703,8.6104999997872033E-6,1.0000000000370703,8.6104999997872033E-6,1.0049616646254438,0.1165265072096438,11.505271371852325,-129.49850346900263,50.501496530997372,null,1000000000,74140710.25,null,14.267667798748931,-42.154650271317884,null,-2.7623964268966059,-87.344346542994785,11.505271371852325,-129.49899681431268,0,0]
[8660.0499999999993,8.66005,6.7583737715319137,1.4222864368524086,1.0000925189012806,1.3602335734798771E-2,1,0,58.284579705905045,1.5536382882002493,1.518448923226182,0.85188372755493136,1.0004936994759084,3.1416443002521992E-2,1.0000000000374982,8.6600499997835071E-6,1.0000000000374982,8.6600499997835071E-6,1.0050188107013289,0.11719345436589612,11.43432262680626,-129.43345211691982,50.566547883080176,null,1000000000,74996466.002499983,null,14.245947021134157,-42.007604218392586,null,-2.811624394327898,-87.426344082843158,11.434322626806258,-129.43394830123574,0,0]
[8709.6,8.7096,6.7961987467039853,1.4231190635015381,1.0000935806067988,1.3680154210127348E-2,1,0,58.617967296380364,1.5537358834264172,1.5233749751336108,0.85471014558380165,1.0004993638013593,3.159607843912543E-2,1.0000000000379285,8.7095999997797719E-6,1.0000000000379285,8.7095999997797719E-6,1.0050762818687535,0.11786033974586356,11.363899588683568,-129.36884864096646,50.631151359033538,null,1000000000,75857132.160000011,null,14.224488724552804,-41.861546540960155,null,-2.8605891358692359,-87.507801123328107,11.363899588683569,-129.36934766428826,0,{"$f":"IF(AI154>0,W154,0)","v":0}]
[8760.3250000000007,8.7603249999999999,6.8349255072655524,1.4239618879520242,1.0000946737623804,1.3759817856062048E-2,1,0,58.95926121879851,1.5538346496862456,1.5284303642938379,0.85758469211042632,1.0005051958894222,3.1779971533404928E-2,1.0000000000383715,8.760324999775902E-6,1.0000000000383715,8.760324999775902E-6,1.0051354525706555,0.11854297491358458,11.292344038481561,-129.30317954585192,50.696820454148082,null,1000000000,76743294.105625018,null,14.202789315966342,-41.713042344831159,null,-2.9104452774847793,-87.590639130670993,11.292344038481563,-129.30368147550215,0,0]
[8811.0499999999993,8.8110499999999998,6.873657068326005,1.4247952147243594,1.0000957732648454,1.3839481327338341E-2,1,0,59.300555709730752,1.5539322790814363,1.533498299571189,0.86044026238747329,1.0005110618108444,3.1963862477600066E-2,1.0000000000388174,8.8110499997719848E-6,1.0000000000388174,8.8110499997719848E-6,1.0051949638631408,0.11922554461987558,11.221325134271478,-129.23798453148365,50.762015468516353,null,1000000000,77634602.102499992,null,14.181356623882991,-41.565560146978733,null,-2.9600314896115125,-87.672929220483553,11.221325134271478,-129.23848936746228,0,0]
[8861.7749999999996,8.8617749999999997,6.9123933491908023,1.4256192023231113,1.0000968791141731,1.3919144622945674E-2,1,0,59.641850759417309,1.5540287911269239,1.5385786569884341,0.8632769975917467,1.0005169615650304,3.2147751259311894E-2,1.0000000000392655,8.8617749997680252E-6,1.0000000000392655,8.8617749997680252E-6,1.0052548156942755,0.11990804850061253,11.150835832604312,-129.17326568727745,50.82673431272255,null,1000000000,78531056.15062499,null,14.160186533886311,-41.419092975980831,null,-3.009350701282,-87.754680453603697,11.150835832604312,-129.17377342958451,0,0]
[8912.5,8.9124999999999996,6.9511342709544008,1.4264340057706342,1.000097991310342,1.3998807741873506E-2,1,0,59.983146358320489,1.5541242048935795,{"$f":"SQRT(1+(A158/Zero2)^2)","v":1.5436713138985285},{"$f":"ATAN(A158/Zero2)","v":0.86609503825641143},1.000522895151382,3.233163786614237E-2,1.0000000000397162,8.9124999997640181E-6,1.0000000000397162,8.9124999997640181E-6,1.0053150080118416,0.12059048619192449,11.08086921095323,-129.10902491458248,50.890975085417523,null,1000000000,79432656.25,null,14.139275006715334,-41.273633871850279,null,-3.0584057957621007,-87.835901691367681,11.080869210953233,-129.10953556321795,0,0]
[8964.4,8.9643999999999995,6.9907773150120853,1.4272583358295521,1.0000991358386073,1.4080316002948344E-2,1,0,60.332348328245274,1.5542207115401441,1.5488945413398907,0.86895915312110983,1.0005290012001944,3.2519781780482961E-2,1.0000000000401803,8.964399999759873E-6,1.0000000000401803,8.964399999759873E-6,1.0053769469851104,0.12128866306572031,11.009815759407221,-129.04379266501383,50.956207334986175,null,1000000000,80360467.359999999,null,14.118142562865978,-41.125841453669395,null,-3.1083268034587546,-87.918464833630907,11.009815759407225,-129.04430628730029,0,0]
[9016.2999999999993,9.0162999999999993,7.0304250558685695,1.4280733688983969,1.0001002870111129,1.4161824076923367E-2,1,0,60.681550853610183,1.5543161074590648,1.5541303891359017,0.87180399285023791,1.0005351426654319,3.2707923391760763E-2,1.0000000000406468,9.0162999997556754E-6,1.0000000000406468,9.0162999997556754E-6,1.005439242290137,0.12198676987828215,10.939295198276495,-128.97906434561517,51.020935654384829,null,1000000000,81293665.689999983,null,14.097272478362724,-40.979089647445456,null,-3.1579772800862282,-88.000491294107135,10.939295198276495,-128.9795809415526,0,0]
[9068.2000000000007,9.0682000000000009,7.0700774145074083,1.4288792603109719,1.0001014448278354,1.4243331962716221E-2,1,0,61.030753924880983,1.5544104117145279,1.5593787301623698,0.87462970578485166,1.0005413195464423,3.289606268669891E-2,1.000000000041116,9.0681999997514338E-6,1.000000000041116,9.0681999997514338E-6,1.0055018938700671,0.12268480624069433,10.869300489570264,-128.91484142635693,51.085158573643071,null,1000000000,82232251.24000001,null,14.076660660695705,-40.833371045398749,null,-3.2073601711254396,-88.081989950546571,10.869300489570264,-128.91536099594532,0,0]
[9120.1,9.1201000000000008,7.1097343136658164,1.4296761619834832,1.0001026092887519,1.432483965924455E-2,1,0,61.379957532740306,1.5545036429369565,1.5646394386994713,0.87743643949985106,1.0005475318425696,3.3084199652021515E-2,1.0000000000415881,9.120099999747143E-6,1.0000000000415881,9.120099999747143E-6,1.0055649016677359,0.12338277176432438,10.79982471707488,-128.85112520045661,51.148874799543393,null,1000000000,83176224.010000005,null,14.05630309290785,-40.688678258794255,null,-3.2564783758329678,-88.162969484901652,10.799824717074882,-128.85164774369591,0,0]
[9173.2000000000007,9.1732000000000014,7.1503127557654604,1.4304823401525255,1.0001038075500004,1.4408231729782887E-2,1,0,61.737235758303513,1.5545979382477901,1.5700344522059229,0.88028857935237581,1.0005539244277672,3.3276684180102753E-2,1.0000000000420739,9.173199999742699E-6,1.0000000000420739,9.173199999742699E-6,1.0056297349004806,0.12409680149956691,10.729272552998594,-128.78646133947657,51.213538660523426,null,1000000000,84147598.24000001,null,14.03573385382543,-40.541693956914827,null,-3.3064613008268373,-88.245292968206968,10.729272552998593,-128.78698692512179,0,0]
[9226.2999999999993,9.2262999999999984,7.190895792569723,1.4312794192290093,1.0001050127661915,1.4491623599911307E-2,1,0,62.094514526492851,1.554691148448698,1.575442149941628,0.88312116220248138,1.000560354083307,3.3469166241483224E-2,1.0000000000425624,9.2262999997382042E-6,1.0000000000425624,9.2262999997382042E-6,1.005694940891839,0.12481075626026016,10.659249332146556,-128.72233007480156,51.277669925198438,null,1000000000,85124611.689999983,null,14.015422486068601,-40.395767875184568,null,-3.3561731539220432,-88.327090827668059,10.659249332146558,-128.72285870285262,0,0]
[9279.4,9.279399999999999,7.231483346722249,1.4320675514006815,1.0001062249373003,1.4575015268470692E-2,1,0,62.451793827995466,1.5547832921614024,1.5808624017387596,0.8859343435251017,1.0005668208084741,3.3661645821947958E-2,1.0000000000430536,9.2793999997336586E-6,1.0000000000430536,9.2793999997336586E-6,1.005760519579582,0.12552463563111682,10.589748026710241,-128.65873226049334,51.341267739506662,null,1000000000,86107264.359999999,null,13.995364922677304,-40.250892171677549,null,-3.4056168959670599,-88.408371759272782,10.589748026710243,-128.65926393095032,0,0]
[9332.5,9.3324999999999996,7.2720753425851612,1.4328468855023309,1.0001074440633011,1.4658406734301936E-2,1,0,62.80907365371035,1.5548743875839905,1.5862950789084516,0.88872827790105469,1.0005733246025503,3.3854122907283082E-2,1.0000000000435478,9.3324999997290587E-6,1.0000000000435478,9.3324999997290587E-6,1.0058264709011415,0.1262384391971664,10.520761731422555,-128.59566858547834,51.404331414521664,null,1000000000,87095556.25,null,13.975557172577158,-40.107059031424519,null,-3.4547954411546029,-88.489144266916711,10.520761731422555,-128.59620329834124,0,0]
[9386.85,9.3868500000000008,7.3136274164974209,1.4336356062532654,1.0001086990905002,1.4743761064918278E-2,1,0,63.17476455504697,1.5549665604024379,1.5918683787455989,0.89156821134384134,1.0005800198864789,3.4051128398692031E-2,1.0000000000440563,9.386849999724299E-6,1.0000000000440563,9.386849999724299E-6,1.0058943605784829,0.12696896711335875,10.45067772199792,-128.53167406144109,51.468325938558905,null,1000000000,88112952.922499999,null,13.955537754342869,-39.960911527569273,null,-3.5048600323449461,-88.571300360760333,10.450677721997923,-128.53221188832961,0,0]
[9441.2000000000007,9.4412000000000003,7.3551839886671013,1.4344154149868784,1.0001099614038342,1.482911518069233E-2,1,0,63.540455986927611,1.5550576722657794,1.5974544277089577,0.89438830579052364,1.0005867540035618,3.4248131245986635E-2,1.0000000000445681,9.4411999997194834E-6,1.0000000000445681,9.4411999997194834E-6,1.0059626405063766,0.12769941473508636,10.381118998760304,-128.46824007920083,51.531759920799175,null,1000000000,89136257.440000013,null,13.935771824987533,-39.815839774715414,null,-3.5546528262272274,-88.652941245399532,10.381118998760305,-128.46878102011493,0,0]
[9495.5499999999993,9.4955499999999997,7.3967449832775465,1.4351864609718017,1.0001112310032763,1.4914469080381236E-2,1,0,63.906147940244452,1.5551477413858892,1.6030530925205204,0.89718872401307082,1.0005935269530151,3.4445131433929028E-2,1.0000000000450826,9.4955499997146084E-6,1.0000000000450826,9.4955499997146084E-6,1.0060313106166301,0.12842978161841967,10.312078539338682,-128.40536688229957,51.594633117700425,null,1000000000,90165469.80249998,null,13.916255341302131,-39.671835489306524,null,-3.6041768019634466,-88.73407544793281,10.312078539338685,-128.40591093723933,0,0]
[9549.9,9.5498999999999992,7.4383103261986019,1.4359488901824209,1.0001125078887985,1.4999822762742174E-2,1,0,64.271840406096942,1.5552367855602243,1.6086642414587624,0.89996962775453848,1.0006003387340499,3.4642128947282594E-2,1.0000000000456004,9.549899999709681E-6,1.0000000000456004,9.549899999709681E-6,1.006100370840681,0.12916006731978405,10.243549444793976,-128.3430545607616,51.656945439238399,null,1000000000,91200590.00999999,null,13.896984336363904,-39.528890422994309,null,-3.6534348915699271,-88.814711306732676,10.243549444793977,-128.34360172972697,0,0]
[9605.5249999999996,9.6055250000000001,7.4808551799412815,1.4367204318793274,1.0001138222732993,1.508717853606642E-2,1,0,64.64611219568144,1.555326875483211,1.6144198137032382,0.90279573004849434,1.0006073505209436,3.4843745052105517E-2,1.0000000000461331,9.6055249997045784E-6,1.0000000000461331,9.6055249997045784E-6,1.0061714550295451,0.12990740031492062,10.173935149125882,-128.27986115628346,51.720138843716541,null,1000000000,92266110.52562499,null,13.877511374678271,-39.383680213164489,null,-3.7035762255523879,-88.896731299162113,10.173935149125883,-128.28041151232659,0,0]
[9661.15,9.6611499999999992,7.5234044364949417,1.4374832469860821,1.0001151442896798,1.5174534079112343E-2,1,0,65.020384503905987,1.5554159282502227,1.6201881884130129,0.90560173101166785,1.0006144029810085,3.5045358323090837E-2,1.0000000000466689,9.6611499996994166E-6,1.0000000000466689,9.6611499996994166E-6,1.0062429477037989,0.1306546473354919,10.104842254425625,-128.21725497662445,51.782745023375554,null,1000000000,93337819.32249999,null,13.858287373939078,-39.239562137725329,null,-3.7534451195134499,-88.978246382019989,10.104842254425627,-128.21780851974532,0,0]
[9716.7749999999996,9.7167750000000002,7.56595802157831,1.4382374818515213,1.0001164739379096,1.5261889390547642E-2,1,0,65.394657321865594,1.5555039616676785,1.6259692293319767,0.90838780062869695,1.0006214961133841,3.5246968743908313E-2,1.000000000047208,9.7167749996941938E-6,1.000000000047208,9.7167749996941938E-6,1.0063148487887377,0.1314018079071344,10.036263749412251,-128.15523565974718,51.844764340252823,null,1000000000,94415716.40062499,null,13.839308318935068,-39.096527476571524,null,-3.8030445695228177,-89.05926491337425,10.03626374941225,-128.15579238994576,0,0]
[9772.4,9.7723999999999993,7.6085158625644267,1.4389832795896524,1.0001178112179585,1.5349244469040031E-2,1,0,65.768930640858002,1.5555909931367355,1.6317628018378598,0.91115410771571403,1.000628629917206,3.5448576298229124E-2,1.0000000000477498,9.7723999996889117E-6,1.0000000000477498,9.7723999996889117E-6,1.0063871582092532,0.13214888155588228,9.9681927470092404,-128.09380270202576,51.906197297974245,null,1000000000,95499801.75999999,null,13.820570271056241,-38.954567553328431,null,-3.8523775240469997,-89.13979506597363,9.9681927470092404,-128.09436261930205,0,0]
[9829.2999999999993,9.8292999999999999,7.6520535159639369,1.4397375884930601,1.0001191870464583,1.5438601601311497E-2,1,0,66.151783318484746,1.555679000552513,1.6377019979205578,0.91396354985934614,1.0006359693170197,3.5654801986697592E-2,1.0000000000483076,9.8292999996834461E-6,1.0000000000483076,9.8292999996834461E-6,1.0064615474627006,0.13291298871192181,9.8990794976504333,-128.03156762447745,51.968432375522553,null,1000000000,96615138.48999998,null,13.801648050951481,-38.810456690613783,null,-3.9025685533010455,-89.221674111269849,9.8990794976504368,-128.03213080188362,0,0]
[9886.2000000000007,9.8862000000000005,7.6955954739781758,1.440483362002597,1.0001205708605847,1.5527958487018942E-2,1,0,66.534636502580753,1.555765995145528,1.6436540268525728,0.91675266668202038,1.0006433512722901,3.5861024641196344E-2,1.0000000000488685,9.8861999996779177E-6,1.0000000000488685,9.8861999996779177E-6,1.0065363638251845,0.13367700391264711,9.8304830913023551,-127.96994460116503,52.030055398834975,null,1000000000,97736950.440000013,null,13.78296991426059,-38.66745217870519,null,-3.9524868229582379,-89.3030588599959,9.8304830913023515,-127.97051103870109,0,0]
[9943.1,9.9431000000000012,7.7391416639512727,1.4412207433611146,1.0001219626603048,1.5617315124736422E-2,1,0,66.917490184453044,1.5558519942983804,1.6496187497263772,0.91952163503208917,1.0006507757820746,3.6067244244252318E-2,1.0000000000494325,9.9430999996723233E-6,1.0000000000494325,9.9430999996723233E-6,1.0066116072150004,0.13444092665205176,9.7623965425982746,-127.90893267267329,52.091067327326712,null,1000000000,98865237.610000014,null,13.764531883219476,-38.525544879886894,null,-4.0021353406211997,-89.383957490452289,9.7623965425982764,-127.90950237033918,0,0]
[10000,10,7.7826920148464893,1.4419498726422084,1.0001233624455852,1.5706671513038017E-2,1,0,67.300344355606512,1.5559370149981879,1.6555960293421224,0.92227063044797464,1.0006582428454269,3.6273460778394037E-2,1.00000000005,9.9999999996666679E-6,1.00000000005,9.9999999996666679E-6,1.0066872775500038,0.13520475642457341,9.6948129908072875,-127.84853075042152,52.151469249578483,null,1000000000,100000000,null,13.746330056755882,-38.384725708837301,null,-4.0515170659485946,-89.464377999379991,9.6948129908072875,-127.84910370821729,0,0]
[10058.25,10.058249999999999,7.8272798718342882,1.4426878960514995,1.0001248037139088,1.5798147696395391E-2,1,0,67.69228255974059,1.556023056666769,1.6617279905884181,0.92506434059869536,1.0006659311500687,3.6484566774720867E-2,1.0000000000505842,1.0058249999660807E-5,1.0000000000505842,1.0058249999660807E-5,1.0067651854004478,0.13598661186709712,9.6261399673764032,-127.78732636349247,52.212673636507532,null,1000000000,101168393.0625,null,13.727937059837444,-38.241683214946086,null,-4.1017970924610436,-89.546219443821343,9.6261399673763997,-127.78790265876742,0,0]
[10116.5,10.1165,7.8718719438752638,1.4434175584397424,1.0001262533511448,1.5889623615337144E-2,1,0,68.084221259242298,1.5561081077082168,1.667872825892784,0.92783748689175471,1.0006736640494436,3.6695669517730657E-2,1.0000000000511717,1.011649999965488E-5,1.0000000000511717,1.011649999965488E-5,1.0068435405200404,0.13676836880816257,9.5579799297934347,-127.72675857387715,52.273241426122851,null,1000000000,102343572.25,null,13.709783573943133,-38.099761998155522,null,-4.1518036441496946,-89.627576208475702,9.5579799297934382,-127.72733820663123,0,0]
[10174.75,10.17475,7.9164681597414557,1.4441390003249532,1.0001277113572566,1.5981099268333507E-2,1,0,68.476160445605586,1.5561921851315432,1.6740303934854588,0.93059025335801027,1.0006814415425176,3.6906768988683718E-2,1.0000000000517628,1.0174749999648884E-5,1.0000000000517628,1.0174749999648884E-5,1.0069223428192171,0.13755002670682326,9.4903259058299394,-127.66682583103787,52.333174168962131,null,1000000000,103525537.5625,null,13.691865652463493,-37.958952487745023,null,-4.2015397466335545,-89.708456313526099,9.4903259058299376,-127.66740880127112,0,0]
[10233,10.233000000000001,7.9610684497943778,1.4448523591109206,1.0001291777322079,1.6072574653854758E-2,1,0,68.868100110518043,1.5562753055586105,1.6802005533832911,0.93332282256891463,1.0006892636282509,3.7117865168842121E-2,1.0000000000523572,1.023299999964282E-5,1.0000000000523572,1.023299999964282E-5,1.0070015922079312,0.13833158502263004,9.4231710486332538,-127.60752646746933,52.392473532530673,null,1000000000,104714289,null,13.674179425745489,-37.819245174429867,null,-4.2510083771122344,-89.788867600751871,9.4231710486332538,-127.60811277518174,0,0]
[10292.5,10.2925,8.0066299630899564,1.4455728205864053,1.0001306842145439,1.6166012752744607E-2,1,0,69.268450983470174,1.556359238554881,1.6865159769715552,0.93609336688154965,1.0006972996071268,3.7333487892986961E-2,1.0000000000529679,1.0292499999636554E-5,1.0000000000529679,1.0292499999636554E-5,1.0070830037169438,0.13912981160343738,9.3550834581938354,-127.54760664805318,52.452393351946824,null,1000000000,105935556.25,null,13.656348927317556,-37.67766795670893,null,-4.301265469123722,-89.870528408155536,9.3550834581938336,-127.54819636486447,0,0]
[10352,10.352,8.0521955853124698,1.4462851285587883,1.0001321994286729,1.6259450569330196E-2,1,0,69.668802338792759,1.5564422069108099,1.6928442494658356,0.93884321820431815,1.0007053821108329,3.7549107144070462E-2,1.000000000053582,1.0351999999630213E-5,1.000000000053582,1.0351999999630213E-5,1.0071648815183134,0.13992793314330196,9.2875026351744943,-127.48834381726668,52.511656182733319,null,1000000000,107163904,null,13.638752250818433,-37.537220891162072,null,-4.3512496156439386,-89.951716052014817,9.2875026351744943,-127.4889369431769,0,0]
[10411.5,10.4115,8.097765247099888,1.446989419949043,1.0001337233745551,1.6352888101981281E-2,1,0,70.069154168217466,1.5565242271601467,1.6991852273066654,0.94157256638177578,1.0007135111382421,3.7764722902128019E-2,1.0000000000541998,1.0411499999623801E-5,1.0000000000541998,1.0411499999623801E-5,1.0072472255145171,0.14072594906785424,9.2204216700770303,-127.42973585616669,52.570264143833313,null,1000000000,108399332.25,null,13.621385509730541,-37.397894046667638,null,-4.4009638396535085,-90.032438344508108,9.2204216700770321,-127.43033239117574,0,0]
[10471,10.471,8.1433388806366835,1.4476858286452881,1.0001352560521508,1.6446325349067634E-2,1,0,70.469506463663905,1.5566053154609656,1.7055387687834269,0.94428159965999225,1.0007216866882207,3.7980335147196988E-2,1.000000000054821,1.0470999999617314E-5,1.000000000054821,1.0470999999617314E-5,1.0073300356075101,0.14152385880327717,9.153833778330478,-127.37178054213368,52.628219457866322,null,1000000000,109641841,null,13.604244894011625,-37.259677562166004,null,-4.4504111156811499,-90.112702924075634,9.1538337783304762,-127.37238048624164,0,0]
[10532,10.532,8.1900654830991879,1.4483917476339374,1.0001368364333141,1.6542117858844178E-2,1,0,70.87995214964738,1.5566874970489066,1.7120653798703247,0.9470380337116483,1.0007301166399172,3.8201379327237814E-2,1.0000000000554614,1.0531999999610587E-5,1.0000000000554614,1.0531999999610587E-5,1.0074154171171297,0.14234177307163351,9.08607210213885,-127.3130392738919,52.686960726108097,null,1000000000,110923024,null,13.586903000280433,-37.119119081084328,null,-4.5008308981415821,-90.194523631958077,9.08607210213885,-127.31364271304241,0,0]
[10593,10.593,8.236796120541662,1.449089657045795,1.0001384259919091,1.6637910065006263E-2,1,0,71.290398308828557,1.5567687323355628,1.7186049002504085,0.94977351121891662,1.0007385954869921,3.8422419772445551E-2,1.0000000000561058,1.059299999960378E-5,1.0000000000561058,1.059299999960378E-5,1.007501288310064,0.14315957450966044,9.0188146228232622,-127.25497893188582,52.745021068114184,null,1000000000,112211649,null,13.569790905954743,-36.979706888490625,null,-4.5509762831314795,-90.275878977588278,9.018814622823264,-127.2555858660789,0,0]
[10654,10.654,8.2835307246753977,1.4497796917621439,1.0001400247278918,1.6733701965797338E-2,1,0,71.700844933081143,1.5568490375709654,1.7251571831186507,0.95248822979362047,1.0007471232282024,3.8643456461315825E-2,1.0000000000567537,1.0653999999596897E-5,1.0000000000567537,1.0653999999596897E-5,1.0075876490789597,0.14397726250086676,8.9520544207908959,-127.19759681652471,52.802403183475292,null,1000000000,113507716,null,13.552904744611515,-36.841430591887502,null,-4.6008503238206204,-90.356776653872799,8.9520544207908941,-127.1982072457603,0,0]
[10715,10.715,8.3302692287384215,1.4504619836675474,1.000141632641218,1.6829493559460874E-2,1,0,72.111292014463743,1.5569284286352227,1.7317220836075298,0.95518238528367572,1.000755699862298,3.8864489372346468E-2,1.0000000000574056,1.0714999999589933E-5,1.0000000000574056,1.0714999999589933E-5,1.0076744993158901,0.14479483642938412,8.8857847026780341,-127.14089013642348,52.859109863576521,null,1000000000,114811225,null,13.536240726874659,-36.704279878647156,null,-4.6504560241966262,-90.437224182054507,8.8857847026780341,-127.14150406070166,0,0]
[10777.5,10.7775,8.3781610169859739,1.4511531573397836,1.0001432896119775,1.6927640363730536E-2,1,0,72.531832522878503,1.557008839999322,1.7384613534397741,0.95792166566545278,1.0007645381070114,3.9090953578083641E-2,1.0000000000580771,1.0777499999582714E-5,1.0000000000580771,1.0777499999582714E-5,1.0077639927710911,0.14563239568707886,8.8183871512732139,-127.08348657281054,52.916513427189457,null,1000000000,116154506.25,null,13.519393459490093,-36.564913348696408,null,-4.7010063082168809,-90.519190729378522,8.8183871512732122,-127.08410407807493,0,0]
[10840,10.84,8.4260567621585221,1.4518364737386285,1.0001449562168803,1.702578684184914E-2,1,0,72.952373494876113,1.5570883242858491,1.7452135672858609,0.96063976981492083,1.0007734276760636,3.9317413772208168E-2,1.0000000000587528,1.0839999999575412E-5,1.0000000000587528,1.0839999999575412E-5,1.0078539998312639,0.14646983389653348,8.7514904583002675,-127.02678586498503,52.97321413501497,null,1000000000,117505600,null,13.502771581660104,-36.42670678000362,null,-4.7512811233598402,-90.600700171232035,8.751490458300264,-127.02740695123566,0,0]
[10902.5,10.9025,8.4739563971611283,1.4525120654618726,1.0001466324558785,1.7123932991927493E-2,1,0,73.372914922485407,1.5571668974345996,1.7519785754851487,0.96333690264243133,1.0007823685680863,3.9543869931599605E-2,1.0000000000594322,1.0902499999568026E-5,1.0000000000594322,1.0902499999568026E-5,1.0079445203784532,0.14730715039737449,8.6850877110341358,-126.9707847439724,53.029215256027598,null,1000000000,118864506.25,null,13.486371257777542,-36.289649344028795,null,-4.8012835467434085,-90.681760067180406,8.6850877110341322,-126.97140941120921,0,0]
[10965,10.965,8.5218598564019707,1.4531800621544186,1.0001483183289237,1.7222078812076429E-2,1,0,73.793456797916946,1.5572445750220565,1.7587562303982445,0.96601326712912727,1.0007913607817043,3.9770322033139967E-2,1.0000000000601155,1.0964999999560553E-5,1.0000000000601155,1.0964999999560553E-5,1.0080355542940742,0.1481443445299282,8.6191721238780481,-126.91547986136939,53.084520138630609,null,1000000000,120231225,null,13.470188729584731,-36.153730301951285,null,-4.8510166057066852,-90.762377807641172,8.6191721238780445,-126.91610810959246,0,0]
[11028.75,11.02875,8.5707252580576618,1.4538537258382349,1.0001500478443743,1.7322187206775898E-2,1,0,74.222409964309392,1.5573228993399959,1.7656823160193418,0.96872197186107611,1.0008005857096678,4.0001298972340636E-2,1.0000000000608167,1.1028749999552846E-5,1.0000000000608167,1.1028749999552846E-5,1.0081289376365312,0.14899815579792999,8.5524331897291308,-126.85978259578526,53.140217404214738,null,1000000000,121633326.5625,null,13.45390310512375,-36.016254609338631,null,-4.9014699153946211,-90.844159887275651,8.552433189729129,-126.86041449661428,0,0]
[11092.5,11.092499999999999,8.6195945052015102,1.454519751077656,1.0001517873829846,1.7422295254246642E-2,1,0,74.651363580801188,1.5574003235409042,1.7726212553033323,0.97140948969298457,1.000809864029703,4.0232271641176064E-2,1.0000000000615219,1.1092499999545046E-5,1.0000000000615219,1.1092499999545046E-5,1.0082228548362919,0.14985183836982829,8.4861872281535398,-126.80480242809965,53.195197571900351,null,1000000000,123043556.25,null,13.437836415068645,-35.879941019099725,null,-4.9516491869151045,-90.925496962434863,8.4861872281535398,-126.8054379815346,0,0]
[11156.25,11.15625,8.6684675327956828,1.4551782664739414,1.0001535369447023,1.752240295248398E-2,1,0,75.080317639677759,1.5574768630516775,1.779572897892594,0.97407602986483044,1.0008191957403254,4.0463240015121318E-2,1.0000000000622311,1.1156249999537158E-5,1.0000000000622311,1.1156249999537158E-5,1.0083173057654966,0.15070539154784457,8.42042742891514,-126.75053558068032,53.249464419319679,null,1000000000,124461914.0625,null,13.421984908437787,-35.74477842515779,null,-5.0015574795226492,-91.00639636156339,8.4204274289151382,-126.75117478672118,0,0]
[11220,11.22,8.7173442772558882,1.4558293977705536,1.0001552965294749,1.7622510299483286E-2,1,0,75.50927213339979,1.5575525329487043,1.786537095496614,0.97672179955622085,1.0008285808400414,4.0694204069654231E-2,1.0000000000629443,1.1219999999529176E-5,1.0000000000629443,1.1219999999529176E-5,1.0084122902956096,0.15155881463497287,8.3551471074546129,-126.69697821016757,53.303021789832428,null,1000000000,125888400,null,13.406344910452736,-35.61075581940414,null,-5.0511978029981233,-91.08686524941028,8.3551471074546129,-126.69762106881441,0,0]
[11285.5,11.285500000000001,8.7675665422468327,1.4564908415527467,1.000157114856064,1.7725365323362077E-2,1,0,75.950002293688584,1.5576293897957052,1.7937053901592621,0.97941878024994911,1.0008382791759507,4.0931503789249514E-2,1.0000000000636813,1.1285499999520885E-5,1.0000000000636813,1.1285499999520885E-5,1.0085104378821375,0.1524355287941549,8.2885672827793559,-126.6426854909207,53.357314509079302,null,1000000000,127362510.25,null,13.390492092962409,-35.474230053441524,null,-5.1019248101830552,-91.169102048999591,8.2885672827793542,-126.64333210244112,0,0]
[11351,11.351000000000001,8.8177925994212654,1.4571447504641766,1.0001589437634328,1.7828219972164144E-2,1,0,76.390732897435413,1.5577053598035226,1.8008866277861348,0.98209427124873194,1.0008480338691275,4.1168798896557751E-2,1.0000000000644227,1.1350999999512492E-5,1.0000000000644227,1.1350999999512492E-5,1.008609148490111,0.15331210413290111,8.2224797101379181,-126.5891333154625,53.410866684537496,null,1000000000,128845201,null,13.374854930207814,-35.338884479896748,null,-5.152375220069894,-91.250899199959733,8.2224797101379199,-126.58978367985648,0,0]
[11416.5,11.416499999999999,8.868022384345517,1.4577912519766723,1.0001607832515231,1.7931074243715341E-2,1,0,76.831463937008806,1.5577804582328922,1.8080806541587282,0.98474849053044455,1.0008578449179237,4.1406089364990489E-2,1.0000000000651683,1.1416499999504004E-5,1.0000000000651683,1.1416499999504004E-5,1.0087084219778888,0.15418853989778772,8.1568775353058065,-126.53631732798742,53.463682672012581,null,1000000000,130336472.25,null,13.359429676118072,-35.20470748240988,null,-5.202552140812271,-91.33226396284509,8.1568775353058012,-126.53697144525498,0,0]
[11482,11.481999999999999,8.918255834032804,1.4584304707151332,1.0001626333202767,1.8033928135841561E-2,1,0,77.272195404951418,1.5578546999964247,1.815287317230748,0.98738165381957477,1.0008677123206822,4.1643375167962425E-2,1.0000000000659182,1.1481999999495419E-5,1.0000000000659182,1.1481999999495419E-5,1.0088082582030806,0.15506483533626864,8.091754031874661,-126.48423311878678,53.515766881213224,null,1000000000,131836324,null,13.344212661833382,-35.071687553784606,null,-5.2524586299587197,-91.413203435143274,8.091754031874661,-126.48489098892787,0,0]
[11548.75,11.54875,8.9694516439274334,1.459074521859153,1.0001645295810964,1.8138744495898158E-2,1,0,77.721338211935418,1.5579294923307558,1.8226443575834266,0.99004362676134727,1.000877826008338,4.1885184498567388E-2,1.0000000000666867,1.1548749999486568E-5,1.0000000000666867,1.1548749999486568E-5,1.0089105785003256,0.1559577088229708,8.0258733402178422,-126.43190317839466,53.568096821605337,null,1000000000,133373626.5625,null,13.328915765152875,-34.937307678077133,null,-5.3030424249350352,-91.495257194951918,8.0258733402178386,-126.43256487302905,0,0]
[11615.5,11.615500000000001,9.0206511321353648,1.4597112622429091,1.0001664368301511,1.8243560457351038E-2,1,0,78.170481448688264,1.5580034251985853,1.8300142094774974,0.9926841776398605,1.0008879982178893,4.2126988928205072E-2,1.0000000000674598,1.1615499999477612E-5,1.0000000000674598,1.1615499999477612E-5,1.0090134829175119,0.15685043500098808,7.9604760524610416,-126.380323814173,53.619676185827004,null,1000000000,134919840.25,null,13.313827675977752,-34.804105671576274,null,-5.3533516235167076,-91.576883661724338,7.9604760524610443,-126.38098933330062,0,0]
[11682.25,11.68225,{"$f":"SQRT(1+(A205/pole1)^2)","v":9.0718542363779022},{"$f":"ATAN(A205/pole1)","v":1.4603408151352244},{"$f":"SQRT(1+(A205/Zero1)^2)","v":1.0001683550673783},{"$f":"ATAN(A205/Zero1)","v":1.8348376017899386E-2},{"$f":"IF(VIN_nom>Vout, 1, SQRT(1+(A205/z_RHP)^2))","v":1},{"$f":"IF(VIN_nom>Vout, 0, -ATAN(A205/z_RHP))","v":0},{"$f":"SQRT(1+(A205/Pole2)^2)","v":78.619625107844314},{"$f":"ATAN(A205/Pole2)","v":1.5580765133291576},1.8373967187505669,0.99530352762621377,{"$f":"SQRT(1+(A205/pole4)^2)","v":1.0008982289475523},{"$f":"ATAN(A205/pole4)","v":4.2368788428749041E-2},{"$f":"SQRT(1+(A205/Zero3)^2)","v":1.0000000000682374},{"$f":"ATAN(A205/Zero3)","v":1.1682249999468554E-5},{"$f":"SQRT(1+(A205/pole5)^2)","v":1.0000000000682374},{"$f":"ATAN(A205/pole5)","v":1.1682249999468554E-5},{"$f":"SQRT((1-(Z205/pterm2))^2+(A205/pterm1)^2)","v":1.0091169713015442},{"$f":"IF((ATAN((A205/pterm1)/(1-A205^2/pterm2))>0),ATAN((A205/pterm1)/(1-A205^2/pterm2)),PI()+ATAN((A205/pterm1)/(1-A205^2/pterm2)))","v":0.15774301307670244},{"$f":"20*LOG10(((E205*K205*G205*O205)/(C205*I205*S205*M205*Q205))*Adc)","v":7.8955554409878346},{"$f":"((F205+L205+H205+R205)-(D205+J205+T205+N205))*radconv","v":-126.3294902137073},{"$f":"IF(V205>0,V205,V205+180)","v":53.670509786292698},null,{"$f":"IF(U205<0,A205,1000000000)","v":1000000000},{"$f":"A205^2","v":136474965.0625},null,{"$f":"20*LOG10((K205/(I205*M205))*AEA*Afb)","v":13.298944747265843},{"$f":"(L205-(J205+N205))*radconv","v":-34.672069704423564},null,{"$f":"20*LOG10((E205*G205/(C205*S205))*Am)","v":-5.403389306278009},{"$f":"(F205+H205-(D205+T205))*radconv","v":-91.658089852904681},7.8955554409878337,-126.33015955732824,0,0]
[11749,{"$f":"A206/1000","v":11.749000000000001},9.1230608957701502,1.4609633010604319,1.0001702842927145,1.8453191175242446E-2,1,0,79.068769182205273,1.5581487711170807,1.8447917334452966,0.99790189551796804,1.0009085181955319,4.2610582972076289E-2,1.0000000000690195,1.1748999999459394E-5,1.0000000000690195,1.1748999999459394E-5,1.0092210434985245,0.15863544225746068,7.8311049039024514,-126.27939752421149,53.72060247578851,null,1000000000,138039001,null,13.284263407613606,-34.54118806358106,null,-5.453158503711153,-91.73888262874469,{"$f":"AB206+AE206","v":7.8311049039024532},-126.28007069232575,{"$f":"SUM((U207<0)*(U206>0))*A206","v":0},0]
[11817.5,11.817500000000001,9.175613685608333,1.461594883114721,1.0001722755209277,1.856075387389898E-2,1,0,79.529688993675492,1.5582220747751936,1.8523934693614239,1.0005467979463736,1.000919138036894,4.2858711514829818E-2,1.0000000000698268,1.1817499999449883E-5,1.0000000000698268,1.1817499999449883E-5,1.0093284509903446,0.15955111282611667,7.7654465802761337,-126.22875671799972,53.771243282000285,null,1000000000,139653306.25,null,13.269403082333124,-34.408063025566648,null,-5.5039565020569903,-91.82137078530819,7.7654465802761337,-126.22943381087484,0,0]
[11886,11.885999999999999,9.2281700938728655,1.4622192714251514,1.0001742783208218,1.8668316143021935E-2,1,0,79.990609227567731,1.558294533656047,1.8600080577392246,1.0031700629492812,1.0009298195013094,4.3106834777031242E-2,1.0000000000706386,1.188599999944026E-5,1.0000000000706386,1.188599999944026E-5,1.0094364729773171,0.16046662490198232,7.7002696089038718,-126.17888571270487,53.821114287295131,null,1000000000,141276996,null,13.254747670832568,-34.276129015989206,null,-5.5544780619286982,-91.903437714351696,7.70026960890387,-126.17956673034089,0,0]
[11954.5,11.954499999999999,9.2807300590907271,1.4628365877226257,1.0001762926923279,1.8775877980124978E-2,1,0,80.45152987662162,1.5583661622784961,1.8676353413753106,1.0057719192975423,1.0009405625868051,4.3354952728298597E-2,1.0000000000714551,1.1954499999430528E-5,1.0000000000714551,1.1954499999430528E-5,1.0095451092904879,0.16138197763161186,7.6355672491906477,-126.1297791567617,53.8702208432383,null,1000000000,142910070.25,null,13.240293550093135,-34.145373757372845,null,-5.6047263009024864,-91.985090341785792,7.6355672491906486,-126.13046409915864,0,0]
[12023,12.023,9.3332935211695176,1.4634469510176176,1.0001783186353754,1.8883439382721839E-2,1,0,80.912450933742221,1.5584369748306015,1.8752751653638842,1.0083525932027297,1.0009513672913968,4.3603065338253873E-2,1.0000000000722764,1.2022999999420682E-5,1.0000000000722764,1.2022999999420682E-5,1.0096543597600185,0.16229717016264991,7.5713328876175776,-126.08143167048119,53.918568329518806,null,1000000000,144552529,null,13.22603717321716,-34.015785099924592,null,-5.6547042855995775,-92.066335437714429,7.5713328876175821,-126.08212053763901,0,0]
[12093,12.093,9.3870115593954804,1.4640636179575905,1.0001804008964696,1.8993355693029991E-2,1,0,81.38346556705072,1.5585085093795086,1.8830950812036182,1.0109681276646576,1.0009624722511374,4.385660552140952E-2,1.0000000000731202,1.2092999999410503E-5,1.0000000000731202,1.2092999999410503E-5,1.0097666368745595,0.16323223702121106,7.5061686644159051,-126.0328040409586,53.967195959041405,null,1000000000,146240649,null,13.211669286136017,-33.884551424108686,null,-5.7055006217201099,-92.148945494712336,7.5061686644159069,-126.03349691882102,0,0]
[12163,12.163,9.4407331266726136,1.464673266961549,1.0001824952412881,1.910327154434479E-2,1,0,81.85448061202122,1.5585792206666014,1.8909277727350646,1.0135620113650967,1.0009736415539425,4.4110140062637665E-2,1.0000000000739693,1.2162999999400208E-5,1.0000000000739693,1.2162999999400208E-5,1.0098795549758925,0.16416713479219394,7.4414795895773835,-125.98495765618669,54.015042343813306,null,1000000000,147938569,null,13.197500644391635,-33.754510752864661,null,-5.7560210548142514,-92.231143791889011,7.4414795895773835,-125.98565454475367,0,0]
[12233,12.233000000000001,9.494458163096656,1.4652760167068266,1.0001846016697549,1.9213186934013238E-2,1,0,82.325496061587884,1.5586491228217481,1.8987730818539468,1.0161344775508205,1.0009848751976587,4.4363668929533424E-2,1.0000000000748233,1.2232999999389792E-5,1.0000000000748233,1.2232999999389792E-5,1.0099931138799196,0.16510186256957712,7.3772589980631658,-125.93788670778602,54.062113292213979,null,1000000000,149646289,null,13.183527697529701,-33.625650529861971,null,-5.8062686994665347,-92.312937077195613,7.3772589980631667,-125.93858760705758,0,0]
[12303,12.303000000000001,9.5481866101077859,1.4658719832198395,1.000186720181794,1.9323101859382397E-2,1,0,82.796511908845673,1.5587182296533182,1.9066308528056211,1.0186857567666372,1.0009961731801191,4.4617192089696306E-2,1.0000000000756819,1.2302999999379258E-5,1.0000000000756819,1.2302999999379258E-5,1.0101073134015837,0.16603641944855094,7.3135003510352012,-125.89158537195119,54.108414628048806,null,1000000000,151363809,null,13.169746970337888,-33.497958335160959,null,-5.8562466193026861,-92.394331946766357,7.3135003510352021,-125.89229028192732,0,0]
[12374.5,12.374499999999999,9.6030698424583072,1.4664738355657303,1.0001888965651868,1.943537162249279E-2,1,0,83.277621356379584,1.5587880103060971,{"$f":"SQRT(1+(A215/Zero2)^2)","v":1.9146697102871737},{"$f":"ATAN(A215/Zero2)","v":1.0212700703156499},1.0010077796814858,4.487614196384801E-2,1.0000000000765641,1.2374499999368371E-5,1.0000000000765641,1.2374499999368371E-5,1.0102246212184411,0.16699082517605041,7.2488456761655993,-125.84508032358843,54.154919676411566,null,1000000000,153128250.25,null,13.155865847530047,-33.368722947506619,null,-5.9070201713644463,-92.477066382706155,7.2488456761656002,-125.84578933021277,0,0]
[12446,12.446,9.657956513757707,1.4670688474084808,1.0001910855554055,1.9547640895597351E-2,1,0,83.758731204762057,1.5588569893195758,1.9227212482505809,1.0238327568511736,1.0010194533039074,4.5135085815753859E-2,1.0000000000774514,1.244599999935736E-5,1.0000000000774514,1.244599999935736E-5,1.0103425970088051,0.16794505069810489,7.1846595553211987,-125.79936590732922,54.200634092670782,null,1000000000,154902916,null,13.142178173679522,-33.240680420852165,null,-5.957518618358324,-92.559398589749634,7.1846595553211978,-125.80007901060179,0,0]
[12517.5,12.5175,9.7128465657061458,1.4676571342960363,1.0001932871523669,1.9659909675869135E-2,1,0,84.239841447125102,1.5589251804280493,1.9307853080598059,1.0263740534814956,1.0010311940450356,4.5394023610899774E-2,1.000000000078344,1.2517499999346219E-5,1.000000000078344,1.2517499999346219E-5,1.0104612405723783,0.16889909505443537,7.1209354093299542,-125.75443588836067,54.245564111639325,null,1000000000,156687806.25,null,13.128680476752685,-33.113817954833074,null,-6.0077450674227331,-92.64133513344845,7.1209354093299515,-125.75515308828153,0,0]
[12589,12.589,9.7677399413107047,1.4682388091977474,1.000195501355988,1.9772177960481276E-2,1,0,84.720952076756774,1.5589925970538669,1.9388617334733158,1.0288941944784886,1.0010430019025089,4.5652955314776561E-2,1.0000000000792415,1.2588999999334951E-5,1.0000000000792415,1.2588999999334951E-5,1.0105805517078283,0.16985295728610675,7.0576667840539304,-125.71028402884602,54.289715971153981,null,1000000000,158482921,null,13.115369358887017,-32.988122893726491,null,-6.0577025748330859,-92.722882431688603,7.0576667840539313,-125.7110053254151,0,{"$f":"IF(AI218>0,W218,0)","v":0}]
[12662.25,12.66225,9.8239802494991491,1.4688279796531354,1.000197782826584,1.9887193553280523E-2,1,0,85.213838536124186,1.5590608743024112,1.9471484960552874,1.0314543205554245,1.0010551683615136,4.5918218155111636E-2,1.0000000000801663,1.2662249999323277E-5,1.0000000000801663,1.2662249999323277E-5,1.010703475114908,0.17082997592944971,6.9933153876256693,-125.66585196927188,54.334148030728116,null,1000000000,160332575.0625,null,13.101922453026729,-32.860548913742107,null,-6.1086070654010607,-92.806028549014727,6.9933153876256684,-125.66657746275683,0,0]
[12735.5,12.7355,9.8802239289826517,1.4694104425429606,1.0002000775283226,2.0002208619853884E-2,1,0,85.70672538817098,1.5591283662463111,1.9554479125121187,1.0339927315046926,1.0010674052574238,4.6183474529045587E-2,1.0000000000810965,1.2735499999311464E-5,1.0000000000810965,1.2735499999311464E-5,1.0108270987410031,0.17180680139065438,6.9294287591416719,-125.62222337615816,54.377776623841839,null,1000000000,162192960.25,null,13.088664382330489,-32.734173753786806,null,-6.1592356231888168,-92.88877931277213,6.9294287591416719,-125.62295306655894,0,0]
[12808.75,12.80875,9.9364709225133101,1.4699863113763771,1.0002023854611126,2.011722315716204E-2,1,0,86.199612626161155,1.5591950863560038,1.963759822407021,1.0365096701427174,1.0010797125876567,4.6448724399488862E-2,1.0000000000820322,1.2808749999299514E-5,1.0000000000820322,1.2808749999299514E-5,1.0109514223662635,0.17278343264306514,6.8660003482850973,-125.57939155176913,54.420608448230865,null,1000000000,164064076.5625,null,13.075591723681146,-32.608984271178358,null,-6.2095913753960481,-92.971141167907433,6.8660003482850982,-125.58012543908579,0,0]
[12882,12.882,9.9927211741288318,1.4705556971244322,1.0002047066248627,2.023223716216576E-2,1,0,86.692500243511873,1.559261047795611,1.9720840677685432,1.0390053762836384,1.0010920903496145,4.6713967729357375E-2,1.000000000082973,1.2881999999287428E-5,1.000000000082973,1.2881999999287428E-5,1.0110764457697057,0.17375986866153412,6.8030237300210841,-125.53734980750086,54.46265019249914,null,1000000000,165945924,null,13.062701127878867,-32.484967477702554,null,-6.2596773978577822,-93.053120414030786,6.803023730021085,-125.53808789173334,0,0]
[12957.25,12.95725,10.050510604044687,1.471133992218796,1.0002071049427743,2.0350390923802014E-2,1,0,87.198845931526762,1.559328033723534,1.9806482781177919,1.0415473634250259,1.001104879410752,4.6986446348076923E-2,1.0000000000839453,1.2957249999274867E-5,1.0000000000839453,1.2957249999274867E-5,1.0112056112469066,0.17476276067083493,6.7387914560517492,-125.4949758827691,54.505024117230903,null,1000000000,167890327.5625,null,13.049644714518173,-32.358772228597267,null,-6.3108532584664232,-93.1369460499117,6.7387914560517501,-125.49571827850897,0,0]
[13032.5,13.032500000000001,10.108303356672577,1.471705674866528,1.0002095172238217,2.0468544117166965E-2,1,0,87.705192006295022,1.5593942461955648,1.9892251765698177,1.0440674462735677,1.0011177427966163,4.7258917984856978E-2,1.0000000000849232,1.3032499999262159E-5,1.0000000000849232,1.3032499999262159E-5,1.0113355147606522,0.17576544445100284,6.6750226298602753,-125.45342150240236,54.546578497597636,null,1000000000,169846056.25,null,13.036773507838378,-32.233787287232708,null,-6.3617508779780998,-93.220380922416993,6.6750226298602779,-125.45416820964971,0,0]
[13107.75,13.107749999999999,10.166099375345141,1.472270857469409,1.0002119434679035,2.0586696738965859E-2,1,0,88.211538461156621,1.5594596985303497,1.99781459970921,1.0465658751392906,1.0011306805043421,4.7531382599510445E-2,1.0000000000859064,1.3107749999249305E-5,1.0000000000859064,1.3107749999249305E-5,1.0114661560676408,0.17676791889562132,6.6117106794370075,-125.41267946243579,54.58732053756421,null,1000000000,171813110.0625,null,13.024084108434096,-32.10999907270044,null,-6.4123734289970855,-93.30343140849007,6.6117106794370102,-125.41343048119052,0,0]
[13183,13.183,10.22389860467322,1.4728296499042617,1.0002143836749182,2.0704848785904034E-2,1,0,88.717885289603529,1.5595244037425036,2.0064163866822655,1.0490428971305026,1.0011436925310484,4.7803840151856458E-2,1.0000000000868958,1.3182999999236302E-5,1.0000000000868958,1.3182999999236302E-5,1.0115975349233191,0.17777018289998378,6.548849159579575,-125.37274258035838,54.627257419641623,null,1000000000,173791489,null,13.011573191284638,-31.987394170117614,null,-6.4627240317050632,-93.386103740502904,6.548849159579575,-125.37349791062051,0,0]
[13259.75,13.25975,10.282853229259763,1.4733931099313062,1.0002168869070307,2.0825355427566899E-2,1,0,89.23432578854721,1.5595896423368798,2.0152022096468878,1.0515474967138774,1.0011570404866053,4.80817214352229E-2,1.0000000000879106,1.3259749999222886E-5,1.0000000000879106,1.3259749999222886E-5,1.0117322921199021,0.17879220767079171,6.4851920199396593,-125.33283158365431,54.667168416345689,null,1000000000,175820970.0625,null,12.998993369174766,-31.8635505053402,null,-6.513801349235103,-93.470040806027342,6.4851920199396629,-125.33359131136754,0,0]
[13336.5,13.336499999999999,10.34181108129874,1.473950145650881,1.0002194046640704,2.0945861464299938E-2,1,0,89.750766662908077,1.5596541301440312,2.0240005642192713,1.0540303367111103,1.0011704657474494,4.8359595287511235E-2,1.0000000000889311,1.3336499999209314E-5,1.0000000000889311,1.3336499999209314E-5,1.0118678160443382,0.17981401121226376,6.4219902941892002,-125.29374315014076,54.706256849859244,null,1000000000,177862232.25,null,12.986592457406999,-31.740910130305334,null,-6.5646021632178018,-93.553597144999699,6.4219902941891975,-125.29450727530504,0,0]
[13413.25,13.41325,10.400772105904707,1.474500865970761,1.000221936945928,2.1066366892607838E-2,1,0,90.267207906242575,1.5597178800497402,2.0328112876826037,1.0564916692461404,1.0011839683104706,4.8637461666109841E-2,1.0000000000899576,1.3413249999195584E-5,1.0000000000899576,1.3413249999195584E-5,1.0120041064331504,0.18083559235785243,6.3592375324892556,-125.25546974335739,54.744530256642605,null,1000000000,179915275.5625,null,12.974367155348414,-31.619459335234861,null,-6.6151296228591585,-93.636778930737876,6.3592375324892556,-125.25623826597274,0,0]
[13490,13.49,10.45973624942685,1.4750453773584826,1.0002244837524932,2.1186871708995372E-2,1,0,90.783649512253746,1.5597809046466,2.0416342199021176,1.0589317431362406,1.0011975481725419,4.8915320528413991E-2,1.0000000000909901,1.3489999999181696E-5,1.0000000000909901,1.3489999999181696E-5,1.0121411630215205,0.18185694994289403,6.2969274096240646,-125.21800385979637,54.781996140203631,null,1000000000,181980100,null,12.962314235018562,-31.499184583010535,null,-6.6653868253944974,-93.719592196852318,6.2969274096240646,-125.21877677986285,0,0]
[13568.5,13.5685,10.520048023983911,1.4755959898985387,1.0002271036547072,2.1310123555554738E-2,1,0,91.31186702853114,1.5598446288089669,2.0506707917110907,1.0614057185558843,1.0012115176328054,4.9199507115088852E-2,1.0000000000920521,1.3568499999167328E-5,1.0000000000920521,1.3568499999167328E-5,1.0122821370055017,0.18290136333479085,6.2336479623749588,-125.18051127292726,54.819488727072738,null,1000000000,184104192.25,null,12.950161524350195,-31.377370050273974,null,-6.7165135619752405,-93.803918640438454,6.2336479623749543,-125.18128869071242,0,0]
[13647,13.647,10.580362951585759,1.4761403249052272,1.000229738751309,2.143337475457455E-2,1,0,91.840084911339659,1.5599076199530546,2.0597198045858898,1.06385797093245,1.0012255679506694,4.9483685748665449E-2,1.0000000000931202,1.3646999999152791E-5,1.0000000000931202,1.3646999999152791E-5,1.0124239119634137,0.18394554039649444,6.1708185712194519,-125.14384769042388,54.856152309576117,null,1000000000,186240609,null,12.938182540157467,-31.256757701692667,null,-6.767363968938013,-93.887871904235084,6.1708185712194537,-125.14462960592775,0,0]
[13725.5,13.7255,10.640680978614867,1.4766784888081417,1.0002323890421787,2.155662530231537E-2,1,0,92.368303154391157,1.5599698906538946,2.0687810952718917,1.0662887560194578,1.0012396991227299,4.9767856383580465E-2,1.0000000000941947,1.3725499999138087E-5,1.0000000000941947,1.3725499999138087E-5,1.0125664876075666,0.18498947988801404,6.1084328538586652,-125.10800520370917,54.891994796290831,null,1000000000,188389350.25,null,12.926374052609473,-31.137333601554953,null,-6.8179411987508054,-93.971458015376768,6.1084328538586679,-125.10879161693173,0,0]
[13804,13.804,10.701002052659883,1.4772105856516053,1.0002350545271952,2.1679875195037862E-2,1,0,92.89652175154049,1.5600314532005295,2.0778545031426239,1.0686983261270571,1.0012539111455634,5.0052018974278314E-2,1.0000000000952753,1.3803999999123214E-5,1.0000000000952753,1.3803999999123214E-5,1.0127098636488143,0.1860331805714574,6.046484551797894,-125.07297594856536,54.927024051434643,null,1000000000,190550416,null,12.914732903577249,-31.01908399505427,null,-6.8682483517793571,-94.05468286445236,6.0464845517978922,-125.07376685950663,0,0]
[13884.25,13.88425,10.762670960336191,1.4777483790006385,1.000237795139733,2.1805872015855314E-2,1,0,93.436516282284529,1.5600936686565894,2.0871425452559449,1.0711399422849561,1.0012685235678183,5.0342508037157986E-2,1.0000000000963862,1.3884249999107834E-5,1.0000000000963862,1.3884249999107834E-5,1.0128572630294626,0.18709990032765525,5.983600996696361,-125.03799827288921,54.962001727110788,null,1000000000,192772398.0625,null,12.903001998672394,-30.899398174229372,null,-6.9194010019760324,-94.139395607587403,5.9836009966963619,-125.03879378181678,0,0]
[13964.5,13.964499999999999,10.82434294534109,1.4782800443178485,1.0002405516311574,2.1931868144221708E-2,1,0,93.976511170542778,1.5601551691251114,2.0964429195546557,1.0735599094552144,1.0012832204785416,5.0632988596908138E-2,1.0000000000975038,1.3964499999092274E-5,1.0000000000975038,1.3964499999092274E-5,1.0130054982757375,0.18816636790010965,5.9211617330298063,-125.00385402012498,54.996145979875024,null,1000000000,195007260.25,null,12.891439523269018,-30.780911296066634,null,-6.9702777902392103,-94.223742830972213,5.9211617330298072,-125.00465412703885,0,0]
[14044.75,14.044750000000001,10.8860179553731,1.47880568545564,1.0002433240013375,2.2057863576142405E-2,1,0,94.516506410187603,1.5602159668603071,2.1057554626381085,1.0759584863279898,1.001298001874013,5.0923460604883383E-2,1.0000000000986276,1.4044749999076534E-5,1.0000000000986276,1.4044749999076534E-5,1.0131545690740225,0.18923258197314077,5.8591604565628455,-124.97053494289628,55.029465057103721,null,1000000000,197255002.5625,null,12.880042323890287,-30.663609238039214,null,-7.0208818673274411,-94.307730409757255,5.8591604565628455,-124.97133964779647,0,0]
[14125,14.125,10.947695939306785,1.4793254039395387,1.0002461122501409,2.2183858307622893E-2,1,0,95.056501995230533,1.5602760738379546,2.1150800137714931,1.0783359280250411,1.0013128677504908,5.1213924012446989E-2,1.0000000000997578,1.4124999999060613E-5,1.0000000000997578,1.4124999999060613E-5,1.0133044751091254,0.19029854123340081,5.7975909857396228,-124.93803284914169,55.061967150858308,null,1000000000,199515625,null,12.868807317615641,-30.547478066121933,null,-7.0712163318760197,-94.391364085906233,5.7975909857396211,-124.93884215202817,0,0]
[14207.25,14.20725,11.010914102966845,1.4798520328543423,1.0002489864650201,2.2312992363694818E-2,1,0,95.609955766462704,1.5603369742596376,2.1246492477256544,1.0807509519974017,1.0013281917775763,5.1511617407965504E-2,1.0000000001009228,1.4207249999044108E-5,1.0000000001009228,1.4207249999044108E-5,1.0134589835087477,0.1913908006672094,5.7349288134765475,-124.90556000124668,55.094439998753316,null,1000000000,201845952.5625,null,12.857457464606242,-30.429653297233248,null,-7.122528651129695,-94.476720719477811,5.7349288134765466,-124.90637401671106,0,0]
[14289.5,14.2895,11.074135285506051,1.4803726489636302,1.0002518773595599,2.2442125675482243E-2,1,0,96.163409888217188,1.5603971736750064,2.1342307621953962,1.0831443055833829,1.0013436045410049,5.1809301665621886E-2,1.0000000001020948,1.4289499999027409E-5,1.0000000001020948,1.4289499999027409E-5,1.0136143686201959,0.19248278964295282,5.6727074717696375,-124.8739281249281,55.126071875071901,null,1000000000,204189810.25,null,12.846271651598332,-30.31302946176174,null,-7.1735641798286931,-94.561717391208589,5.6727074717696393,-124.87474685297033,0,0]
[14371.75,14.37175,11.137359435514428,1.4808873543825702,1.0002547849336152,2.2571258238684937E-2,1,0,96.716864354476499,1.5604566841179774,2.1438243925227352,1.0855162521044117,1.0013591060366793,5.2106976733080179E-2,1.0000000001032736,1.4371749999010518E-5,1.0000000001032736,1.4371749999010518E-5,1.013770630098991,0.19357450675431453,5.610920687335855,-124.84312858991198,55.156871410088016,null,1000000000,206547198.0625,null,12.835246778315234,-30.197592158994976,null,-7.2243260909793792,-94.646359871537115,5.610920687335855,-124.84395203053209,0,0]
[14454,14.454000000000001,11.200586502740402,1.4813962489332688,1.000257709187041,2.2700390049002827E-2,1,0,97.270319159360099,1.5605155173486014,2.1534299767775571,1.0878670511560586,1.001374696260479,5.2404642558014171E-2,1.0000000001044591,1.4453999998993431E-5,1.0000000001044591,1.4453999998993431E-5,1.013927767598932,0.19466595059759612,5.5495623096357019,-124.81315283247675,55.186847167523254,null,1000000000,208918116,null,12.824379814552627,-30.083327186005558,null,-7.2748175049169239,-94.730653799669142,5.5495623096357027,-124.8139809856747,0,0]
[14622.5,14.6225,11.330124413720995,1.4824210496331798,1.00026375199193,2.2964931266895878E-2,1,0,98.404145537683817,1.5606339783799581,2.17314494720299,1.0926180098309894,1.0014069119546776,5.3014421274742742E-2,1.0000000001069087,1.4622499998957817E-5,1.0000000001069087,1.4622499998957817E-5,1.0142524186824735,0.19690105836690902,5.4251740865089593,-124.75428026298793,55.245719737012067,null,1000000000,213817506.25,null,12.802598107299016,-29.852842369066543,null,-7.3774240207900572,-94.902275701458208,5.4251740865089584,-124.75511807052476,0,0]
[14706.75,14.70675,11.394897755277171,1.4829247122201599,1.0002667996443286,2.3097200672605726E-2,1,0,98.971059235787095,1.5606921910655478,2.1830205773909803,1.0949612831400006,1.0014231594274807,5.3319295864031065E-2,1.0000000001081442,1.4706749998939699E-5,1.0000000001081442,1.4706749998939699E-5,1.014416121448271,0.19801817621324502,5.36362896542368,-124.72610453302023,55.273895466979766,null,1000000000,216288495.5625,null,12.791943409652317,-29.739386066530329,null,-7.42831444422864,-94.987561101196178,5.3636289654236773,-124.72694716772651,0,0]
[14791,14.791,11.459673954767897,1.4834226809922313,1.0002698647964841,2.3229469269996684E-2,1,0,99.537973265454937,1.5607497406558892,2.1929080863897346,1.0972834381356333,1.0014394999780543,5.3624160532340093E-2,1.0000000001093867,1.4790999998921372E-5,1.0000000001093867,1.4790999998921372E-5,1.0145807418579884,0.19913500137031312,5.3025083219186575,-124.69875727718106,55.301242722818941,null,1000000000,218773681,null,12.781442165590738,-29.627101193233084,null,-7.4789338436720811,-95.072503545823665,5.3025083219186566,-124.69960473905675,0,0]
[14877.25,14.87725,11.525990778389941,1.4839266727896632,1.0002730208395514,2.3364876932590251E-2,1,0,100.11834553252056,1.560807981275246,2.2030424518522738,1.0996391131362071,1.0014563248484543,5.3936252008406876E-2,1.0000000001106661,1.4877249998902393E-5,1.0000000001106661,1.4877249998902393E-5,1.0147502203505949,0.20027803394340704,5.2403702051452816,-124.67160982364369,55.328390176356308,null,1000000000,221332567.5625,null,12.770847564365331,-29.513349423751745,null,-7.5304773592200513,-95.1591128035286,5.2403702051452798,-124.67246222728035,0,0]
[14963.5,14.9635,11.5923104962051,1.4844248980287797,1.0002761952227439,2.3500283738232281E-2,1,0,100.69871813527008,1.560865550560335,2.2131889304493075,1.1019732015637391,1.0014732472585084,5.4248332967728519E-2,1.0000000001119531,1.4963499998883192E-5,1.0000000001119531,1.4963499998883192E-5,1.0149206597609095,0.20142075660032849,5.1786643871791753,-124.64531201520866,55.35468798479134,null,1000000000,223906332.25,null,12.760407703428797,-29.400795406615941,null,-7.5817433162496215,-95.245373953990381,5.1786643871791753,-124.64616936060632,0,0]
[15049.75,15.04975,11.658633058822829,1.4849174548729029,1.0002793879458869,2.3635689681965579E-2,1,0,101.27909106793263,1.5609224600518772,2.2233473563421682,1.1042859736965647,1.0014902672032719,5.4560403350049719E-2,1.0000000001132476,1.5049749998863769E-5,1.0000000001132476,1.5049749998863769E-5,1.0150920596756337,0.20256316774448066,5.1173846957812827,-124.61985455700014,55.380145442999861,null,1000000000,226494975.0625,null,12.750119609788262,-29.289424313799945,null,-7.6327349140069796,-95.331292530358823,5.1173846957812827,-124.62071684415876,0,0]
[15136,15.135999999999999,11.724958417968008,1.4854044392753516,1.0002825990088047,2.3771094758833156E-2,1,0,101.85946432486891,1.5609787210275847,2.2335175665157303,1.1065776958110767,1.0015073846777727,5.4872463095127513E-2,1.0000000001145493,1.5135999998844122E-5,1.0000000001145493,1.5135999998844122E-5,1.0152644196794298,0.20370526578254075,5.0565250804821105,-124.59522824193175,55.40477175806825,null,1000000000,229098496,null,12.73998037885449,-29.179221531503902,null,-7.6834552983723796,-95.416873939347482,5.0565250804821105,-124.59609547085138,0,0]
[15224,15.224,11.792632342292377,1.4858956586580667,1.0002858941252575,2.3909246286516181E-2,1,0,102.45161359956786,1.5610354665789665,2.2439061078785558,1.1088944938132934,1.00152494997627,5.5190843461535868E-2,1.0000000001158851,1.5223999998823844E-5,1.0000000001158851,1.5223999998823844E-5,1.0154412659164427,0.20487021247459264,4.9948574257289637,-124.57094941102675,55.429050588973254,null,1000000000,231770176,null,12.729785903943618,-29.06797191574076,null,-7.7349284782146519,-95.503849766234254,4.9948574257289664,-124.57182168197501,0,0]
[15312,15.311999999999999,11.860309079664443,1.4863812722110095,1.0002892083328854,2.4047396901374977E-2,1,0,103.04376320037532,1.5610915599444162,2.2543065824812198,1.1111899264714982,1.0015426167918362,5.5509212628007676E-2,1.0000000001172287,1.5311999998803327E-5,1.0000000001172287,1.5311999998803327E-5,1.0156191107179557,0.20603482988544083,4.9336147163304993,-124.54751671044312,55.452483289556881,null,1000000000,234457344,null,12.719740494959822,-28.957908434808253,null,-7.7861257786293239,-95.590485588611728,4.9336147163304984,-124.54839402341997,0,0]
[15400,15.4,11.927988582202399,1.486861375125742,1.0002925416314985,2.4185546598145275E-2,1,0,103.63591312170139,1.5611470123028639,2.2647188259174165,1.1134642641156554,1.0015603851190991,5.5827570530598204E-2,1.00000000011858,1.5399999998782582E-5,1.00000000011858,1.5399999998782582E-5,1.0157979536363078,0.20719911633342047,4.8727908989259969,-124.52492064628062,55.47507935371938,null,1000000000,237160000,null,12.709841275490955,-28.849016236782067,null,-7.8370503765649602,-95.676786764504016,4.8727908989259952,-124.52580300128608,0,0]
[15488,15.488,11.995670803103096,1.4873360604557522,1.0002958940209064,2.4323695371563009E-2,1,0,104.22806335808316,1.5612018345792129,2.2751426766061278,1.1157177730028729,1.0015782549526562,5.6145917105376399E-2,1.0000000001199392,1.5487999998761592E-5,1.0000000001199392,1.5487999998761592E-5,1.0159777942216528,0.20836307014047267,4.8123800395940028,-124.50315182114659,55.496848178853412,null,1000000000,239878144,null,12.700085435636232,-28.741280688541512,null,-7.8877053960422323,-95.762758529639115,4.8123800395940002,-124.50403921818062,0,0]
[15578.25,15.578250000000001,12.06508631091774,1.4878173507798944,1.000299351953825,2.4465375393356352E-2,1,0,104.83535412102181,1.5612574152923386,2.2858449360734014,1.118007540307147,1.0015966871121458,5.6472391390342033E-2,1.0000000001213409,1.5578249998739814E-5,1.0000000001213409,1.5578249998739814E-5,1.0161632687861517,0.20955643686889683,4.7508474221975252,-124.48167590046233,55.518324099537665,null,1000000000,242681873.0625,null,12.690226206880567,-28.63197682474717,null,-7.9393787846830417,-95.850591643693292,4.7508474221975252,-124.48256846844046,0,0]
[15668.5,15.6685,12.13450458151825,1.4882931345455417,1.0003028299658421,2.4607054432762353E-2,1,0,105.44264520408899,1.5613123557775461,2.2965590685665753,1.1202759545187591,1.001615226023342,5.6798853624667869E-2,1.0000000001227509,1.5668499998717786E-5,1.0000000001227509,1.5668499998717786E-5,1.016349791721505,0.21074945016553084,4.6897368808002105,-124.46105035263496,55.538949647365044,null,1000000000,245501892.25,null,12.680512003966726,-28.523859030234838,null,-7.9907751231665145,-95.938089061322387,4.6897368808002113,-124.46194809155722,0,0]
[15758.75,15.758749999999999,12.203925567758846,1.4887635055061885,1.0003063280567481,2.4748732484103461E-2,1,0,106.04993660178505,1.561366667033232,2.3072849086845304,1.122523289920101,1.001633871680317,5.7125303739437867E-2,1.0000000001241691,1.57587499986955E-5,1.0000000001241691,1.57587499986955E-5,1.0165373625353544,0.21194210823219597,4.629042386966665,-124.441265357631,55.558734642369004,null,1000000000,248338201.5625,null,12.670940002335149,-28.416912215994138,null,-8.0418976153684838,-96.025256051503234,4.629042386966665,-124.44216826749738,0,0]
[15849,15.849,12.273349223558615,1.4892285553037847,1.0003098462263327,2.4890409541702355E-2,1,0,106.65722830873568,1.5614203598073142,2.3180222939084145,1.1247498165715255,1.0016526240771102,5.7451741665751427E-2,1.0000000001255955,1.584899999867296E-5,1.0000000001255955,1.584899999867296E-5,1.0167259807329532,0.21313440927476712,4.5687580318019396,-124.42231120222104,55.577688797778961,null,1000000000,251190801,null,12.661507443385268,-28.311121520569259,null,-8.0927494115833287,-96.112097762462255,4.5687580318019396,-124.42321928303151,0,0]
[15941.25,15.94125,12.344314065786213,1.4896985048254556,1.0003134631117174,2.5035225224157642E-2,1,0,107.27797831779445,1.5614746141916624,2.3290093921933233,1.1270044557890972,1.0016719023474074,5.778540100521122E-2,1.0000000001270617,1.5941249998649649E-5,1.0000000001270617,1.5941249998649649E-5,1.0169198607746355,0.21435276165786929,4.5075555782050323,-124.40378567063749,55.59621432936251,null,1000000000,254123451.5625,null,12.652007159932236,-28.204166028144911,null,-8.1444515817272016,-96.200533008838704,4.5075555782050341,-124.40469903698362,0,0]
[16033.5,16.0335,12.415281603120377,1.4901630818504854,1.000317100975106,2.5180039856344569E-2,1,0,107.89872863899666,1.561528244316235,2.3400082185464628,1.1292379111448578,1.0016912921280903,5.8119047464498322E-2,1.0000000001285365,1.6033499998626073E-5,1.0000000001285365,1.6033499998626073E-5,1.017114834082979,0.21557073724019862,4.4467695279008925,-124.38610802919941,55.613891970800594,null,1000000000,257073122.25,null,12.642646942849661,-28.098387776167478,null,-8.1958774149487699,-96.288638904913739,4.4467695279008908,-124.38702668108121,0,0]
[16125.75,16.12575,12.48625178960695,1.4906223777862622,1.0003207598162696,2.5324853432200731E-2,1,0,108.51947926698577,1.5615812608933499,2.3510186083647362,1.1314504578263307,1.0017107934126832,5.8452680970079822E-2,1.00000000013002,1.612574999860222E-5,1.00000000013002,1.612574999860222E-5,1.0173109001219218,0.21678833411892534,4.3863939386594168,-124.36926824896143,55.630731751038567,null,1000000000,260039813.0625,null,12.633424048282905,-27.993771607110752,null,-8.2470301096234895,-96.376420579268157,4.3863939386594151,-124.37019218637892,0,0]
[16218,16.218,12.557224580328958,1.4910764819826832,1.0003244396349775,2.5469665945663994E-2,1,0,109.1402301965271,1.5616336743916275,2.3620403999427118,1.1336423667116549,1.0017304061946746,5.8786301448440076E-2,1.0000000001315117,1.6217999998578096E-5,1.0000000001315117,1.6217999998578096E-5,1.0175080583528275,0.21800555039571479,4.3264229862470067,-124.35325641629785,55.646743583702147,null,1000000000,263023524,null,12.624335796858599,-27.890302596396214,null,-8.2979128106115922,-96.463883042854746,4.3264229862470067,-124.35418563925096,0,0]
[16312.5,16.3125,12.629931069121875,1.4915363699613815,1.000328230956375,2.561800936373726E-2,1,0,109.77612169996956,1.5616867516398039,2.3733426719460509,1.1358666165105882,1.0017506129400915,5.912804542710802E-2,1.0000000001330487,1.6312499998553095E-5,1.0000000001330487,1.6312499998553095E-5,1.0177111572303992,0.21925205825516375,4.2654029215021092,-124.33770229365793,55.662297706342073,null,1000000000,266097656.25,null,12.615162755098828,-27.785484060175097,null,-8.3497598335967176,-96.553152870887132,4.2654029215021101,-124.33863693106223,0,0]
[16407,16.407,12.702640198528037,1.4919909932944382,1.0003320442905979,2.5766351654084366E-2,1,0,110.41201350911048,1.5617392175164779,2.3846565742228449,1.1380697714049475,1.0017709366741798,5.9469775579214061E-2,1.0000000001345948,1.6406999998527803E-5,1.0000000001345948,1.6406999998527803E-5,1.0179154010748217,0.22049816270212871,4.2047954669876928,-124.32299630761523,55.677003692384773,null,1000000000,269189649,null,12.606125512505823,-27.681838351746201,null,-8.4013300455181312,-96.642098007724456,4.2047954669876919,-124.32393635947065,0,0]
[16501.5,16.5015,12.775351923461402,1.4924404416844974,1.0003358796373945,2.5914692810189575E-2,1,0,111.04790561869827,1.5617910825240233,2.3959819420175461,1.1402521089895647,1.0017913773898197,5.9811491825788016E-2,1.0000000001361498,1.6501499998502217E-5,1.0000000001361498,1.6501499998502217E-5,1.0181207892987278,0.22174386171074345,4.1445947280485376,-124.30912817425705,55.690871825742946,null,1000000000,272299502.25,null,12.597221387966155,-27.579350163314253,null,-8.4526266599176161,-96.730723477249413,4.1445947280485385,-124.31007364056367,0,0]
[16596,16.596,12.848066199854964,1.4928848028119697,1.0003397369965117,2.606303282553744E-2,1,0,111.68379802360099,1.5618423569256377,2.4073186135096094,1.1424139024313293,1.00181193507985,6.0153194087879093E-2,1.0000000001377136,1.6595999998476335E-5,1.0000000001377136,1.6595999998476335E-5,1.0183273213119515,0.22298915326016802,4.0847949274683062,-124.29608773409312,55.703912265906879,null,1000000000,275427216,null,12.588447763895832,-27.478004427083729,null,-8.503652836427527,-96.819034187767159,4.0847949274683053,-124.29703861485089,0,0]
[16692.5,16.692499999999999,12.922321991001409,1.4933334075739102,1.0003436987086485,2.6214511128111403E-2,1,0,112.3331487683633,1.5618941174354304,2.4189067144637222,1.1446005265199739,1.0018330485598443,6.0502113630281011E-2,1.0000000001393197,1.6692499998449604E-5,1.0000000001393197,1.6692499998449604E-5,1.0185394041130806,0.22426037760575659,4.0241373946412242,-124.28361503122082,55.716384968779181,null,1000000000,278639556.25,null,12.579620471442322,-27.375677371231671,null,-8.5554830768010977,-96.90889406978971,4.0241373946412242,-124.28457144102138,0,0]
[16789,16.789000000000001,12.996580352999537,1.4937768860519438,1.0003476833741658,2.6365988227399922E-2,1,0,112.98249981062359,1.5619452829728449,2.4305062706805747,1.1467662896176403,1.0018542840027005,6.0851018423664409E-2,1.0000000001409353,1.6788999998422558E-5,1.0000000001409353,1.6788999998422558E-5,1.0187526783774863,0.22553117281963495,3.9638861363887385,-124.27198440770123,55.728015592298775,null,1000000000,281870521,null,12.570923939944613,-27.274510627657726,null,-8.6070378035558743,-96.998435718886782,3.963886136388739,-124.2729463465445,0,0]
[16885.5,16.8855,13.070841242032602,1.4942153254437829,1.0003516909927892,2.6517464116466036E-2,1,0,113.6318511452817,1.5619958637375528,2.4421171189297155,1.1489114688069579,1.0018756414006631,6.1199908384022318E-2,1.0000000001425602,1.6885499998395201E-5,1.0000000001425602,1.6885499998395201E-5,1.0189671434677612,0.22680153676627099,3.9040353612776109,-124.2611854415553,55.738814558444702,null,1000000000,285120110.25,null,12.562355576030411,-27.174488900281542,null,-8.658320214752802,-97.087664009159738,3.9040353612776091,-124.26215290944128,0,0]
[16982,16.981999999999999,{"$f":"SQRT(1+(A269/pole1)^2)","v":13.14510461527253},{"$f":"ATAN(A269/pole1)","v":1.494648810984494},{"$f":"SQRT(1+(A269/Zero1)^2)","v":1.0003557215642429},{"$f":"ATAN(A269/Zero1)","v":2.6668938788373123E-2},{"$f":"IF(VIN_nom>Vout, 1, SQRT(1+(A269/z_RHP)^2))","v":1},{"$f":"IF(VIN_nom>Vout, 0, -ATAN(A269/z_RHP))","v":0},{"$f":"SQRT(1+(A269/Pole2)^2)","v":114.28120276735335},{"$f":"ATAN(A269/Pole2)","v":1.5620458696974187},2.4537390989128438,1.1510363366864784,{"$f":"SQRT(1+(A269/pole4)^2)","v":1.0018971207459331},{"$f":"ATAN(A269/pole4)","v":6.1548783427369337E-2},{"$f":"SQRT(1+(A269/Zero3)^2)","v":1.0000000001441942},{"$f":"ATAN(A269/Zero3)","v":1.6981999998367531E-5},{"$f":"SQRT(1+(A269/pole5)^2)","v":1.0000000001441942},{"$f":"ATAN(A269/pole5)","v":1.6981999998367531E-5},{"$f":"SQRT((1-(Z269/pterm2))^2+(A269/pterm1)^2)","v":1.0191827987434974},{"$f":"IF((ATAN((A269/pterm1)/(1-A269^2/pterm2))>0),ATAN((A269/pterm1)/(1-A269^2/pterm2)),PI()+ATAN((A269/pterm1)/(1-A269^2/pterm2)))","v":0.22807146731568062},{"$f":"20*LOG10(((E269*K269*G269*O269)/(C269*I269*S269*M269*Q269))*Adc)","v":3.8445793932495986},{"$f":"((F269+L269+H269+R269)-(D269+J269+T269+N269))*radconv","v":-124.25120784230899},{"$f":"IF(V269>0,V269,V269+180)","v":55.748792157691014},null,{"$f":"IF(U269<0,A269,1000000000)","v":1000000000},{"$f":"A269^2","v":288388324},null,{"$f":"20*LOG10((K269/(I269*M269))*AEA*Afb)","v":12.553912848081518},{"$f":"(L269-(J269+N269))*radconv","v":-27.075597136661152},null,{"$f":"20*LOG10((E269*G269/(C269*S269))*Am)","v":-8.7093334548319206},{"$f":"(F269+H269-(D269+T269))*radconv","v":-97.176583702576536},3.8445793932495977,-124.2521808392377,0,0]
[17081,{"$f":"A270/1000","v":17.081},13.221294447798572,1.4950884660282666,1.0003598804068374,2.6824336402441504E-2,1,0,114.94737726388107,1.5620965840241701,2.4656735695181977,1.1531954266151438,1.0019192832698196,6.1906681094573215E-2,1.0000000001458802,1.7080999998338814E-5,1.0000000001458802,1.7080999998338814E-5,1.0194052771046573,0.22937384500901947,3.7839875661678453,-124.24181466840398,55.758185331596025,null,1000000000,291760561,null,12.545379366734144,-26.975302138756877,null,-8.7613918005662992,-97.267491198858011,{"$f":"AB270+AE270","v":3.7839875661678448},-124.24279333761488,{"$f":"SUM((U271<0)*(U270>0))*A270","v":0},0]
[17180,17.18,13.297486806669335,1.4955230828566044,1.00036406340634,2.6979732720679286E-2,1,0,115.6135520526399,1.5621467139108116,2.4776194235146756,1.1553337063068472,1.0019415741246016,6.2264562882846014E-2,1.0000000001475762,1.7179999998309761E-5,1.0000000001475762,1.7179999998309761E-5,1.0196290067425726,0.2306757620348226,3.7237995250645382,-124.23326444896055,55.766735551039446,null,1000000000,295152400,null,12.536972909442882,-26.876165083855117,null,-8.8131733843783433,-97.358083706598478,3.723799525064539,-124.23424879045359,0,0]
[17279,17.279,13.373681648705649,1.4959527474176626,1.000368270562447,2.7135127735597734E-2,1,0,116.27972712860721,1.5621962694019897,2.4895764970378731,1.157451455911876,1.0019639933017139,6.2622428701576027E-2,1.0000000001492819,1.7278999998280369E-5,1.0000000001492819,1.7278999998280369E-5,1.0198539869559859,0.23197721611157657,3.6640095010127882,-124.22554649704823,55.774453502951772,null,1000000000,298563841,null,12.528690934223787,-26.778170490850918,null,-8.8646814332110004,-97.448366019972511,3.6640095010127869,-124.22653651082342,0,0]
[17378,17.378,13.449878931705404,1.4963775437193259,1.0003725018748542,2.7290521439708511E-2,1,0,116.9459024868748,1.5622452603134878,2.5015446292039503,1.1595489509633903,1.0019865407925435,6.2980278460176023E-2,1.0000000001509974,1.7377999998250642E-5,1.0000000001509974,1.7377999998250642E-5,1.0200802170403629,0.23327820496400412,3.6046118405042704,-124.21865026635496,55.781349733645044,null,1000000000,301994884,null,12.52053096018799,-26.681303130069786,null,-8.9159191196837213,-97.538342822342614,3.6046118405042691,-124.21964595241241,0,0]
[17479.25,17.47925,13.527810452958263,1.4968070445776767,1.000376854339182,2.7449445455276038E-2,1,0,117.62721848119227,1.5622947906790796,2.5137960382579987,1.1616734484828175,1.0020097334385056,6.3346244461669962E-2,1.0000000001527622,1.747924999821989E-5,1.0000000001527622,1.747924999821989E-5,1.0203128807828898,0.23460827817579794,3.5442642999818257,-124.2124364045427,55.7875635954573,null,1000000000,305524180.5625,null,12.5123092007107,-26.583384576745733,null,-8.9680449007288736,-97.630053315052066,3.5442642999818261,-124.2134378917978,0,0]
[17580.5,17.580500000000001,13.60574444111189,1.4972316251338409,1.0003812320696504,2.7608368083934673E-2,1,0,118.30853476075593,1.5623437505729392,2.5260586832185474,1.1637773288548647,1.0020330602785252,6.3712193473154613E-2,1.0000000001545368,1.7580499998188775E-5,1.0000000001545368,1.7580499998188775E-5,1.0205468503532633,0.23593785998262889,3.484315556295039,-124.20706017066784,55.792939829332155,null,1000000000,309073980.25,null,12.504209990410192,-26.486613639875053,null,-9.0198944341151552,-97.721453819245554,3.4843155562950372,-124.2080674591206,0,0]
[17681.75,17.681750000000001,13.68368085401635,1.49765136930525,1.0003856350659277,2.7767289317675053E-2,1,0,118.98985132066595,1.5623921497941153,2.5383324012441246,1.1658608723917809,1.0020565213032304,6.4078125397805066E-2,1.0000000001563221,1.7681749998157301E-5,1.0000000001563221,1.7681749998157301E-5,1.0207821249872593,0.2372669479709216,3.424759917595499,-124.20251073020391,55.797489269796088,null,1000000000,312644283.0625,null,12.496230862716317,-26.3909748146454,null,-9.0714709451208169,-97.812549005208979,3.4247599175954999,-124.20352381985438,0,0]
[17783,17.783000000000001,13.76161965047525,1.4980663591151784,1.0003900633276803,2.7926209148488226E-2,1,0,119.67116815613409,1.5624399979185142,2.5506170324820299,1.1679243547191109,1.0020801165031963,6.4444040138823849E-2,1.0000000001581175,1.7782999998125464E-5,1.0000000001581175,1.7782999998125464E-5,1.0210187039171246,0.23859553973402123,3.3655918060181342,-124.19877739623855,55.801222603761445,null,1000000000,316235089,null,12.488369410697402,-26.296452851989212,null,-9.1227776046792659,-97.903343435097483,3.365591806018136,-124.1997962870867,0,0]
[17886.5,17.886500000000002,13.841292841858598,1.4984857403849512,1.0003946161087964,2.8088659072720644E-2,1,0,120.36762564566298,1.5624883494756105,2.5631857718227251,1.1700132395160763,1.0021043747119698,6.4818068457109385E-2,1.0000000001599636,1.7886499998092542E-5,1.0000000001599636,1.7886499998092542E-5,1.0212618874478951,0.23995314037134052,3.3055036963356428,-124.19579363608422,55.804206363915782,null,1000000000,319926882.25,null,12.480452441490687,-26.200969153335599,null,-9.1749487451550475,-97.995849303709932,3.3055036963356397,-124.19681845704554,0,0]
[17990,17.989999999999998,13.920968439791734,1.4989003211337155,1.0003991952900639,2.8251107514058418E-2,1,0,121.06408341335838,1.5625361447188957,{"$f":"SQRT(1+(A279/Zero2)^2)","v":2.5757655862914799},{"$f":"ATAN(A279/Zero2)","v":1.1720817294031594},1.0021287731055237,6.5192078615106064E-2,1.0000000001618199,1.7989999998059236E-5,1.0000000001618199,1.7989999998059236E-5,1.0215064322537728,0.24131021742069755,3.2458090941503688,-124.19364053923914,55.806359460760859,null,1000000000,323640100,null,12.472653533538821,-26.106621082001713,null,-9.2268444393884543,-98.088050208311955,3.245809094150367,-124.19467129031366,0,0]
[18093.5,18.093499999999999,14.000646403188705,1.499310183177315,1.0004038008711198,2.8413554463948099E-2,1,0,121.76054145444704,1.5625833931943263,2.5883563144077617,1.1741301041748404,1.0021533116736192,6.5566070509508328E-2,1.0000000001636873,1.8093499998025548E-5,1.0000000001636873,1.8093499998025548E-5,1.0217523375033291,0.24266676833398262,3.1865023922860241,-124.19230715788127,55.807692842118726,null,1000000000,327374742.25,null,12.464970298346783,-26.013393147968731,null,-9.278467906060758,-98.179950691100231,3.1865023922860249,-124.19334383906896,0,0]
[18197,18.196999999999999,14.080326691892342,1.4997154064860401,1.0004084328515996,2.8575999913836723E-2,1,0,122.45699976426428,1.5626301042307038,2.600957797679075,1.1761586388855165,1.0021779904059596,6.5940044037041193E-2,1.0000000001655653,1.819699999799147E-5,1.0000000001655653,1.819699999799147E-5,1.0219996023613416,0.24402279057074786,3.1275780958804651,-124.19178269803142,55.808217301968583,null,1000000000,331130809,null,12.457400405477079,-25.921270120364309,null,-9.3298223095966115,-98.271555188967994,3.1275780958804678,-124.19282530933231,0,0]
[18303,18.303000000000001,14.161933994475714,1.5001256913122383,1.0004132040789089,2.8742367603140011E-2,1,0,123.17028101235033,1.5626773960103102,2.6138746500443188,1.1782158898366701,1.0022034105156752,6.6323031595997256E-2,1.0000000001674998,1.8302999997956168E-5,1.0000000001674998,1.8302999997956168E-5,1.0222542481900574,0.2454110163357742,3.0676212532246021,-124.19207291773236,55.807927082267639,null,1000000000,334999809,null,12.449762771236148,-25.828051513468722,null,-9.3821415180115491,-98.365070088917165,3.0676212532245994,-124.19312160238589,0,{"$f":"IF(AI282>0,W282,0)","v":0}]
[18409,18.408999999999999,14.24354365367164,1.5005312746787351,1.0004180029955985,2.8908733700945786E-2,1,0,123.88356253273609,1.5627241432084507,2.6268024562382535,1.1802528998206425,1.0022289776205866,6.6705999670912966E-2,1.0000000001694458,1.8408999997920449E-5,1.0000000001694458,1.8408999997920449E-5,1.0225103183166508,0.24679868220696283,3.0080541954411046,-124.19318917868794,55.806810821312055,null,1000000000,338891281,null,12.442239252709212,-25.73596030999429,null,-9.4341850572681079,-98.458283626699782,3.0080541954411046,-124.19424393669408,0,0]
[18515,18.515000000000001,14.325155629203628,1.5009322368051299,1.0004228296012696,2.9075098198067775E-2,1,0,124.59684432074505,1.5627703551776451,2.6397410553258096,1.1822699494386117,1.0022546917094444,6.7088948150948083E-2,1.0000000001714024,1.8514999997884323E-5,1.0000000001714024,1.8514999997884323E-5,1.0227678118316363,0.24818578548045253,2.9488713677718623,-124.19512037499504,55.804879625004958,null,1000000000,342805225,null,12.434827525236344,-25.644980962187006,null,-9.4859561574644804,-98.551200244166793,2.9488713677718632,-124.1961812063538,0,0]
[18621,18.620999999999999,14.406769881706694,1.5013286560992682,1.0004276838955219,2.9241461085320213E-2,1,0,125.31012637180714,1.562816041057479,2.6526902893787279,1.1842673144692257,1.0022805527709358,6.7471876925296673E-2,1.0000000001733709,1.8620999997847774E-5,1.0000000001733709,1.8620999997847774E-5,1.0230267278214245,0.24957232346092545,2.8900673269327908,-124.19785556154662,55.802144438453382,null,1000000000,346741641,null,12.427525321057901,-25.555098186405221,null,-9.537457994125111,-98.643824279852836,2.8900673269327903,-124.19892246625805,0,0]
[18729.5,18.729500000000002,14.490311316654124,1.5017298000891444,1.0004326813532562,2.9411745948716161E-2,1,0,126.04023138052365,1.5628622689098099,2.6659557822969626,1.1862916836079729,1.0023071759642614,6.7863816514737885E-2,1.000000000175397,1.8729499997809933E-5,1.000000000175397,1.8729499997809933E-5,1.0232932225563431,0.25099097455568364,2.8302631233652358,-124.2014766562062,55.798523343793804,null,1000000000,350794170.25,null,12.420162014430973,-25.464215523608214,null,-9.5898988910657366,-98.738334253901456,2.8302631233652367,-124.20254977750967,0,0]
[18838,18.838000000000001,14.573855056599259,1.5021263450750519,1.0004377078201814,2.9582029105936259E-2,1,0,126.77033665548743,1.5629079642843766,2.6792320922766528,1.1882959983142809,1.0023339531204563,6.8255735223202205E-2,1.000000000177435,1.8837999997771654E-5,1.000000000177435,1.8837999997771654E-5,1.0235612057051346,0.25240902769124335,2.7708445896364893,-124.20591741378645,55.794082586213548,null,1000000000,354870244,null,12.412908825867232,-25.374450190031361,null,-9.6420642362307412,-98.832546561650688,2.7708445896364911,-124.20699675168206,0,0]
[18946.5,18.9465,14.657401062128264,1.5025183695730575,1.0004427632958599,2.9752310547131112E-2,1,0,127.50044219212462,1.5629531363283662,2.6925190593070578,1.1902805392563813,1.0023608842271816,6.8647632931970237E-2,1.0000000001794849,1.8946499997732925E-5,1.0000000001794849,1.8946499997732925E-5,1.0238306762747948,0.25382648000503982,2.7118062328095753,-124.21116660566612,55.788833394333878,null,1000000000,358969862.25,null,12.405763498118459,-25.285786621862613,null,-9.6939572653088817,-98.926465538291183,2.7118062328095771,-124.2122521601538,0,0]
[19055,19.055,14.74094929471978,1.5029059503248152,1.0004478477798524,2.9922590262451934E-2,1,0,128.23054798596559,1.5629977939806483,2.7058165263931899,1.1922455822149138,1.0023879692720288,6.9039509522361195E-2,1.0000000001815466,1.9054999997693753E-5,1.0000000001815466,1.9054999997693753E-5,1.0241016332678967,0.2552433286440085,2.653142670303108,-124.21721317020669,55.782786829793309,null,1000000000,363093025,null,12.398723829529818,-25.198209523394837,null,-9.7455811592267114,-99.020095417891582,2.6531426703031062,-124.21830494128642,0,0]
[19165.75,19.165749999999999,14.82623235206575,1.5032970634289045,1.0004530676188772,3.0096399333786002E-2,1,0,128.97579448325976,1.5630428562816041,2.7194004163788255,1.1942315476168417,1.0024157747349736,6.943949068279516E-2,1.0000000001836629,1.9165749997653307E-5,1.0000000001836629,1.9165749997653307E-5,1.0243797411241677,0.2566889334014319,2.5936436382688277,-124.22419615634757,55.775803843652426,null,1000000000,367325973.0625,null,12.391644915589151,-25.109921199542004,null,-9.7980012773203242,-99.115373073392902,2.5936436382688264,-124.2252942729349,0,0]
[19276.5,19.276499999999999,14.911517651430099,1.5036837027078367,1.0004583176808663,3.0270206586189924E-2,1,0,129.72104123944433,1.5630874008172462,2.7329949251961434,1.1961977634652265,1.002443740560423,6.9839449590144043E-2,1.0000000001857918,1.9276499997612391E-5,1.0000000001857918,1.9276499997612391E-5,1.0246593955779995,0.25813390321070723,2.5345241130327771,-124.23198716084772,55.768012839152277,null,1000000000,371583452.25,null,12.38467162324036,-25.022733500980607,null,-9.8501475102075844,-99.210358121962017,2.5345241130327754,-124.23309162294262,0,0]
[19387.25,19.387250000000002,14.996805154562438,1.50406594437355,1.000463597965344,3.0444012009191345E-2,1,0,130.46628825008287,1.5631314364601032,2.7465998951689601,1.1981445079249109,1.0024718667349564,7.0239386118315025E-2,1.0000000001879328,1.9387249997571001E-5,1.0000000001879328,1.9387249997571001E-5,1.0249405955544884,0.25957823506838895,2.4757787079967959,-124.24057494230713,55.759425057692866,null,1000000000,375865462.5625,null,12.377801780047427,-24.936630991173001,null,-9.9020230720506337,-99.305054758736631,2.4757787079967937,-124.24168574990964,0,0]
[19498,19.498000000000001,15.082094824076609,1.5044438629192665,1.0004689084718319,3.0617815592318583E-2,1,0,131.21153551083967,1.5631749718811376,2.760215171609659,1.2000720542690295,1.002500153245077,7.0639300141258105E-2,1.0000000001900859,1.9497999997529132E-5,1.0000000001900859,1.9497999997529132E-5,1.0252233399740178,0.26102192598147428,2.4174021445842895,-124.24994843017676,55.750051569823242,null,1000000000,380172004,null,12.371033267253486,-24.851598502309304,null,-9.9536311226691971,-99.39946708097753,2.4174021445842886,-124.25106558328683,0,0]
[19611.75,19.611750000000001,15.169697040057992,1.5048275946540339,1.0004743942900858,3.0796325246877081E-2,1,0,131.97697031223444,1.5632191747617017,2.7742098287774684,1.2020321108182324,1.0025293728761253,7.1050023489422881E-2,1.0000000001923104,1.9611749997485638E-5,1.0000000001923104,1.9611749997485638E-5,1.0255153500091687,0.26250405329074511,2.3578228051510015,-124.26038229639458,55.739617703605418,null,1000000000,384620738.0625,null,12.364184723158278,-24.765360887230429,null,-10.006361918007279,-99.496145079669176,2.3578228051509988,-124.26150596689961,0,0]
[19725.5,19.7255,15.257301464127018,1.505206919819833,1.0004799119888033,3.0974832938143758E-2,1,0,132.74240536852437,1.5632628678665288,2.7882150369511547,1.2039724840259647,1.0025587616176566,7.1460722827196149E-2,1.0000000001945477,1.9725499997441631E-5,1.0000000001945477,1.9725499997441631E-5,1.0258089869686466,0.26398549809502331,2.2986216109302426,-124.27162188134271,55.72837811865729,null,1000000000,389095350.25,null,12.357438710056456,-24.680220460853459,null,-10.058817099126214,-99.592531608389208,2.2986216109302422,-124.27275206924267,0,0]
[19839.25,19.83925,15.344908058465618,1.5055819137800301,1.0004854615674568,3.1153338654774886E-2,1,0,133.50784067532535,1.5633060599634827,2.8022306379327864,1.2058934545143689,1.0025883194548,7.1871398018146904E-2,1.0000000001967979,1.983924999739712E-5,1.0000000001967979,1.983924999739712E-5,1.0261042496673287,0.26546625718604822,2.2397931805799138,-124.28365573593443,55.716344264065569,null,1000000000,393595840.5625,null,12.350793099056602,-24.596161639258646,null,-10.110999918476688,-99.688630801970646,2.2397931805799143,-124.28479244122929,0,0]
[19953,19.952999999999999,15.43251678611354,1.5059526501916101,1.0004910430255158,3.1331842385427508E-2,1,0,134.27327622835321,1.5633487596205076,2.8162564765573999,1.207795297894267,1.0026180463726,7.2282048925892808E-2,1.0000000001990612,1.9952999997352091E-5,1.0000000001990612,1.9952999997352091E-5,1.0264011369149484,0.26694632736732099,2.181332241118056,-124.29647258966409,55.703527410335909,null,1000000000,398122209,null,12.344245814355336,-24.513169114201997,null,-10.162913573237283,-99.784446698151839,2.1813322411180529,-124.29761581235384,0,0]
[20069,20.068999999999999,15.52186059322495,1.5063264097759526,1.0004967677170034,3.1513874902054415E-2,1,0,135.05385251408822,1.5633918054186779,2.8305701349869437,1.2097153423975817,1.0026485354101895,7.2700797449070098E-2,1.0000000002013825,2.0068999997305639E-5,1.0000000002013825,2.0068999997305639E-5,1.0267055684859994,0.26845496087598619,2.1220880414956529,-124.31033784714562,55.689662152854382,null,1000000000,402764761,null,12.337668187624605,-24.429617533205626,null,-10.215580146128948,-99.881870182940219,2.1220880414956564,-124.31148771614585,0,0]
[20185,20.184999999999999,15.611206543862425,1.5066958912148198,1.0005025255604088,3.1695905329536415E-2,1,0,135.83442904719388,1.5634343564890414,2.8448941234863949,1.2116160590733078,1.0026792002518159,7.3119520432575191E-2,1.000000000203717,2.0184999997258646E-5,1.000000000203717,2.0184999997258646E-5,1.0270116869931396,0.26996287127511265,2.0632152711899772,-124.32499426733995,55.675005732660054,null,1000000000,407434225,null,12.331188617339437,-24.347143546027702,null,-10.267973346149459,-99.979007236622877,2.0632152711899785,-124.32615078265059,0,0]
[20301,20.300999999999998,15.700554601431955,1.5070611674441325,1.0005083165551596,3.1877933655846513E-2,1,0,136.61500582343004,1.563476421311617,2.8592282868028844,1.2134977247722663,1.0027100408813503,7.3538217731929492E-2,1.0000000002060654,2.0300999997211114E-5,1.0000000002060654,2.0300999997211114E-5,1.0273194911577153,0.2714700552127543,2.0047086686356845,-124.34043045301183,55.659569546988166,null,1000000000,412130601,null,12.324805062834681,-24.265731767875899,null,-10.320096394198996,-100.07586184675699,2.0047086686356845,-124.3415936146329,0,0]
[20417,20.417000000000002,15.789904730166967,1.5074223097534722,1.0005141407006803,3.2059959868958522E-2,1,0,137.39558283865281,1.563518008173723,2.8735724726721279,1.2153606113629138,1.0027410572825726,7.395688920270814E-2,1.0000000002084271,2.0416999997163034E-5,1.0000000002084271,2.0416999997163034E-5,1.0276289796956271,0.27297650934983275,1.9465630778828924,-124.35663518776563,55.643364812234367,null,1000000000,416853889,null,12.318515534431418,-24.18536708838846,null,-10.371952456548527,-100.17243790730868,1.9465630778828906,-124.35780499569714,0,0]
[20536,20.536000000000001,15.881567753660221,1.5077885693099091,1.000520149917925,3.2246691448061686E-2,1,0,138.19634743456945,1.5635601823845597,2.8882978870695948,1.2172524419628947,1.0027730584642065,7.4386361393441486E-2,1.0000000002108638,2.0535999997113137E-5,1.0000000002108638,2.0535999997113137E-5,1.0279482211745892,0.27452116166581508,1.8872835638215339,-124.3740460628143,55.625953937185699,null,1000000000,421727296,null,12.31215901777092,-24.103996527595378,null,-10.424875453949387,-100.2712261613482,1.8872835638215335,-124.37522268894358,0,0]
[20655,20.655000000000001,15.973232883151754,1.5081506252282071,1.0005261940215695,3.2433420777612888E-2,1,0,138.99711227345878,1.5636018706627106,2.9030335338600679,1.2191250735416115,1.0028052445918589,7.481580609462371E-2,1.0000000002133145,2.065499999706266E-5,1.0000000002133145,2.065499999706266E-5,1.0282692325210647,0.27606503886759892,1.8283733130636919,-124.39224241121946,55.607757588780544,null,1000000000,426629025,null,12.305897369796719,-24.023696572765445,null,-10.477524056733024,-100.36972928278105,1.828373313063695,-124.3934258555465,0,0]
[20774,20.774000000000001,16.064900082591553,1.5085085493711929,1.0005322730109816,3.2620147844631311E-2,1,0,139.79787735114556,1.5636430813583264,2.9177792580137329,1.2209787839460755,1.0028376156477226,7.5245223150510562E-2,1.0000000002157794,2.0773999997011598E-5,1.0000000002157794,2.0773999997011598E-5,1.0285920123310546,0.27760813739273188,1.7698270881416613,-124.4112126970918,55.588787302908202,null,1000000000,431559076,null,12.299728600040748,-23.944451773942447,null,-10.529901511899087,-100.46795118567418,1.7698270881416605,-124.41240295961663,0,0]
[20893,20.893000000000001,16.156569316746953,1.50886241197504,1.0005383868855253,3.2806872636137081E-2,1,0,140.59864266354964,1.5636838226313345,2.9325349075139715,1.2228138459570128,1.0028701716138899,7.5674612405418645E-2,1.0000000002182587,2.0892999996959949E-5,1.0000000002182587,2.0892999996959949E-5,1.0289165591946594,0.27915045369317026,1.7116397569911093,-124.43094557154853,55.569054428451466,null,1000000000,436517449,null,12.293650768147453,-23.866246960551443,null,-10.582011011156345,-100.56589569171965,1.7116397569911079,-124.4321426522711,0,0]
[21014.75,21.014749999999999,16.250359027452848,1.5092203202551793,1.000544678150119,3.2997910127820065E-2,1,0,141.41791329546049,1.5637250279005526,2.947641665510174,1.2246722943481065,1.0029036712744162,7.611389558686936E-2,1.0000000002208098,2.1014749996906491E-5,1.0000000002208098,2.1014749996906491E-5,1.0292504333926447,0.28072759852324763,1.6524739463357594,-124.45191204123375,55.548087958766246,null,1000000000,441619717.5625,null,12.28752462396386,-23.787295671536782,null,-10.635050677628097,-100.6658204261807,1.6524739463357623,-124.45311609771748,0,0]
[21136.5,21.136500000000002,16.344150795911833,1.5095741208292501,1.0005510059294542,3.3188945210120106E-2,1,0,142.23718416471516,1.563765758494009,2.9627585003205197,1.2265117843762092,1.0029373644520265,7.6553149338081827E-2,1.0000000002233758,2.1136499996852412E-5,1.0000000002233758,2.1136499996852412E-5,1.0295861542539599,0.28230391709032288,1.59367326676165,-124.47365330440303,55.52634669559697,null,1000000000,446751632.25,null,12.281489714448334,-23.709401733562967,null,-10.687816447686686,-100.76546260308491,1.5936732667616482,-124.47486433664788,0,0]
[21258.25,21.25825,16.437944586900471,1.5099238839227835,1.0005573702228383,3.337997786913962E-2,1,0,143.05645526723592,1.5638060225668404,2.9778852584842292,1.2283325924052899,1.002971251127218,7.6992373492527938E-2,1.0000000002259566,2.1258249996797703E-5,1.0000000002259566,2.1258249996797703E-5,1.02992372024973,0.28387940564172209,1.5352325472835271,-124.49615779369121,55.503842206308789,null,1000000000,451913193.0625,null,12.275544114981539,-23.63254976985451,null,-10.740311567698008,-100.86482603184275,1.5352325472835311,-124.49737580169726,0,0]
[21380,21.38,16.531740365993947,1.5102696781715661,1.0005637710295741,3.3571008090982103E-2,1,0,143.8757265990379,1.563845828088438,2.9930217895431643,1.2301349897097409,1.0030053312803786,7.743156788374779E-2,1.0000000002285523,2.1379999996742367E-5,1.0000000002285523,2.1379999996742367E-5,1.0302631298447635,0.28545406044072447,1.4771467209542282,-124.51941413253438,55.480585867465621,null,1000000000,457104400,null,12.269685949630231,-23.556724684608643,null,-10.792539228676008,-100.96391443169294,1.4771467209542237,-124.52063911630158,0,0]
[21504.5,21.5045,16.627656756496215,1.5106192485372607,1.0005703541720947,3.3766350628980826E-2,1,0,144.71350326584084,1.5638860666181165,3.0085101663097515,1.2319593364834358,1.0030403812731099,7.7880651524232528E-2,1.0000000002312217,2.1504499996685127E-5,1.0000000002312217,2.1504499996685127E-5,1.030612110701852,0.28706341630126503,1.4181107290527537,-124.54396162606344,55.456038373936565,null,1000000000,462443520.25,null,12.263783978007234,-23.480233409192742,null,-10.84567324895448,-101.06496033396247,1.4181107290527546,-124.54519374315521,0,0]
[21629,21.629000000000001,16.723575155581287,1.510964809009161,1.0005769754945832,3.3961690589073182E-2,1,0,145.55128016425775,1.563925841930901,3.0240084535346332,1.2337649893668508,1.0030756335409687,7.8329703689924937E-2,1.0000000002339067,2.1628999996627219E-5,1.0000000002339067,2.1628999996627219E-5,1.030963016115563,0.28867189246776664,1.3594354485114684,-124.56927185182009,55.430728148179909,null,1000000000,467813641,null,12.257969616990829,-23.404784871047973,null,-10.898534168479362,-101.16572623118843,1.3594354485114675,-124.5705111022364,0,0]
[21753.5,21.753499999999999,16.819495528885454,1.5113064281084325,1.0005836349962818,3.4157027956403074E-2,1,0,146.38905729031208,1.5639651619795651,3.0395164996195598,1.2355522226315303,1.0031110880626297,7.8778724203052181E-2,1.0000000002366074,2.1753499996568643E-5,1.0000000002366074,2.1753499996568643E-5,1.0313158444240691,0.29027948499655298,1.3011157815820762,-124.59533324154583,55.404666758454169,null,1000000000,473214762.25,null,12.252241009347927,-23.33036380104711,null,-10.95112522776585,-101.26621582423961,1.3011157815820766,-124.59657962528672,0,0]
[21878,21.878,16.915417842823775,1.5116441728057155,1.0005903326764278,3.435236271611556E-2,1,0,147.2268346401178,1.5640040345358699,3.0550341559499774,1.2373213054524734,1.0031467448166476,7.9227712885917498E-2,1.0000000002393234,2.1877999996509387E-5,1.0000000002393234,2.1877999996509387E-5,1.0316705939588053,0.29188618996156435,1.2431467329883756,-124.62213442079658,55.377865579203416,null,1000000000,478646884,null,12.246596345019572,-23.256955211706558,null,-11.003449612031197,-101.36643272615548,1.2431467329883752,-124.62338793786203,0,0]
[22005.25,22.00525,17.013460893968972,1.5119854421495933,1.0005972177492117,3.4552009388921529E-2,1,0,148.08311733937418,1.5640433112010579,3.0709043511025347,1.2391109831479228,1.0031833981293621,7.9686585911945176E-2,1.0000000002421157,2.2005249996448127E-5,1.0000000002421157,2.2005249996448127E-5,1.0320351629326727,0.29352746313766132,1.1842544687851864,-124.65028043352949,55.349719566470512,null,1000000000,484231027.5625,null,12.240911908055095,-23.182956107856448,null,-11.056657439269909,-101.46858513362639,1.1842544687851859,-124.65154124148285,0,0]
[22132.5,22.1325,17.111505903876495,1.5123228007420231,1.000604142704044,3.4751653306266096E-2,1,0,148.93940026444523,1.5640821362472213,3.0867842810386499,1.240882252511186,1.0032202626613798,8.0145425310902574E-2,1.0000000002449236,2.2132499996386149E-5,1.0000000002449236,2.2132499996386149E-5,1.0324017353975392,0.29516780087035382,1.1257182473649749,-124.67917585481662,55.32082414518338,null,1000000000,489847556.25,null,12.235311484908653,-23.109983921196406,null,-11.109593237543677,-101.57046003246153,1.1257182473649756,-124.68044395365793,0,0]
[22259.75,22.25975,17.20955283906838,1.5126563153470076,1.000611107540097,3.4951294452291934E-2,1,0,149.79568341145844,1.5641205174190664,3.1026737962862669,1.2426353851618634,1.0032573383894172,8.0604230893305095E-2,1.0000000002477483,2.2259749996323457E-5,1.0000000002477483,2.2259749996323457E-5,1.0327703095502676,0.29680719902495545,1.0675330500671407,-124.7088091441877,55.291190855812303,null,1000000000,495496470.0625,null,12.229793286713786,-23.038023521951974,null,-11.162260236646643,-101.672061011965,1.0675330500671425,-124.71008453391697,0,0]
[22387,22.387,17.307601666824638,1.5129860512191231,1.0006181122565374,3.5150932811143051E-2,1,0,150.65196677662934,1.5641584622852263,3.1185727503303329,1.2443706476314946,1.0032946252900607,8.106300246975294E-2,1.0000000002505889,2.2386999996260046E-5,1.0000000002505889,2.2386999996260046E-5,1.033140883580556,0.29844565348618374,1.0096939589626295,-124.73916895724126,55.260831042758738,null,1000000000,501177769,null,12.22435557019887,-22.967060061789748,null,-11.214661611236242,-101.77339157606873,1.0096939589626288,-124.74045163785848,0,0]
[22517.5,22.517499999999998,17.408156620799517,1.5133203507124695,1.0006253372957143,3.5355667077120588E-2,1,0,151.5301200771793,1.5641969308583088,3.1348874210838598,1.2461319425001307,1.0033330838153307,8.1533455680317696E-2,1.000000000253519,2.2517499996194256E-5,1.000000000253519,2.2517499996194256E-5,1.0335229974157079,0.30012497008039263,0.95073207212689526,-124.77104708204719,55.22895291795281,null,1000000000,507037806.25,null,12.218860784704145,-22.895304369562123,null,-11.268128712577248,-101.8770328702015,0.95073207212689681,-124.77233723976363,0,0]
[22648,22.648,17.508713497896668,1.5136508103128561,1.0006326042766156,3.5560398377960753E-2,1,0,152.40827359938419,1.5642349561311963,3.1512117160439814,1.2478749945763006,1.0033717643874711,8.2003872722495014E-2,1.000000000256466,2.2647999996127708E-5,1.000000000256466,2.2647999996127708E-5,1.0339072107083447,0.30180328545718405,0.89212403368327031,-124.8036657650397,55.196334234960304,null,1000000000,512931904,null,12.213447071980333,-22.824566440824313,null,-11.321323038297066,-101.98039695903104,0.89212403368326676,-124.80496339985535,0,0]
[22778.5,22.778500000000001,17.609272265170404,1.513977495731275,1.0006399131983279,3.5765126696565737E-2,1,0,153.28642733943454,1.5642725457225686,3.1675454864124712,1.2496000753982042,1.0034106669808025,8.2474253392280525E-2,1.00000000025943,2.2778499996060381E-5,1.00000000025943,2.2778499996060381E-5,1.0342935214827205,0.30348059524170723,0.8338648524876624,-124.83701338833718,55.162986611662816,null,1000000000,518860062.25,null,12.208112692340718,-22.754831142413089,null,-11.374247839853053,-102.083487357839,0.83386485248766462,-124.83831850025209,0,0]
[22909,22.908999999999999,17.709832890422707,1.5143004711894925,1.000647264059932,3.596985201583925E-2,1,0,154.1645812936076,1.5643097070775194,3.1838885863590312,1.2513074513614635,1.0034497915695029,8.2944597485765811E-2,1.000000000262411,2.2908999995992281E-5,1.000000000262411,2.2908999995992281E-5,1.0346819277553785,0.30515689508076127,0.77594963774692904,-124.87107853467991,55.12892146532009,null,1000000000,524822281,null,12.20285595073385,-22.686083625872982,null,-11.426906312986919,-102.18630749782106,0.77594963774693149,-124.87239112369404,0,0]
[23042.25,23.042249999999999,17.812514493733499,1.5146264898110413,1.0006548130986799,3.6178888357626546E-2,1,0,155.06124062489306,1.5643472172183233,3.200585559178037,1.2530328096410712,1.0034899696574886,8.3424815092477622E-2,1.0000000002654725,2.3042249995921944E-5,1.0000000002654725,2.3042249995921944E-5,1.0350806789661464,0.30686747265199393,0.71716392296195197,-124.90659023362736,55.093409766372645,null,1000000000,530945285.0625,null,12.197566828146549,-22.616891493093906,null,-11.480402905184599,-102.29101896421025,0.71716392296194975,-124.90791045730415,0,0]
[23175.5,23.1755,17.915197968600669,1.5149487712234253,1.0006624058615716,3.6387921536322212E-2,1,0,155.9579001718426,1.5643842960398826,3.2172919607866031,1.2547402544563,1.0035303791406809,8.3904994135759414E-2,1.0000000002685518,2.3175499995850781E-5,1.0000000002685518,2.3175499995850781E-5,1.0354816107179703,0.30857698816085982,0.65872682721069886,-124.94282657941524,55.05717342058476,null,1000000000,537103800.25,null,12.192355214978608,-22.548698803927227,null,-11.533628387767909,-102.3954556338274,0.65872682721069964,-124.94415443775462,0,0]
[23308.75,23.30875,18.017883283026361,1.5152673792550531,1.0006700423476123,3.6596951533731117E-2,1,0,156.85455993075769,1.5644209509390097,3.2340076450615682,1.2564300535427244,1.0035710199911281,8.4385134398851397E-2,1.0000000002716489,2.3308749995778801E-5,1.0000000002716489,2.3308749995778801E-5,1.0358847208748121,0.31028543704327116,0.60063345131649282,-124.97977603994968,55.020223960050316,null,1000000000,543297826.5625,null,12.187219442247859,-22.481490629641172,null,-11.586585990931365,-102.49962090331051,0.60063345131649371,-124.98111153295169,0,0]
[23442,23.442,18.120570405737443,1.5155823762905221,1.000677722555801,3.6805978331659779E-2,1,0,157.75121989802392,1.5644571891443466,3.2507324688049426,1.2581024695336778,1.0036118921807231,8.4865235665100264E-2,1.0000000002747638,2.3441999995705994E-5,1.0000000002747638,2.3441999995705994E-5,1.0362900072924912,0.31199281475886198,0.54287899433753106,-125.0174272844793,54.982572715520703,null,1000000000,549527364,null,12.182157883884887,-22.415252324211554,null,-11.639278889547356,-102.60351808793234,0.5428789943375314,-125.01877041214389,0,0]
[23578.5,23.578499999999998,18.225763935447567,1.515901375736511,1.0006856354198317,3.7020100007669907E-2,1,0,158.66974983293275,1.564493886530075,3.2678745449511934,1.2597979212157591,1.0036540010950314,8.5357006056816842E-2,1.0000000002779728,2.3578499995630548E-5,1.0000000002779728,2.3578499995630548E-5,1.0367074330223589,0.31374072043780121,0.48406239341667157,-125.05671288312961,54.943287116870394,null,1000000000,555945662.25,null,12.177048168491213,-22.348389071639787,null,-11.69298577507454,-102.70967476002835,0.48406239341667323,-125.05806383166814,0,0]
[23715,23.715,18.330959298536843,1.516216713947897,1.0006935941626629,3.7234218287580424E-2,1,0,159.58827997906207,1.5645301614831386,3.285025916734313,1.2614756735127239,1.0036963527107343,8.5848735066305457E-2,1.0000000002812006,2.3714999995554218E-5,1.0000000002812006,2.3714999995554218E-5,1.0371271378858469,0.31548749249185198,0.42559155195140219,-125.09671147658203,54.90328852341797,null,1000000000,562401225,null,12.172013009981788,-22.282513344500479,null,-11.746421458030383,-102.81555690149399,0.42559155195140441,-125.09807024599448,0,0]
[23851.5,23.851500000000001,18.436156463621884,1.5165284535347099,1.0007015987831998,3.7448333151839402E-2,1,0,160.5068103327857,1.5645660212557913,3.3021864393112494,1.2631359928410151,1.0037389469971101,8.6340422461021818E-2,1.0000000002844471,2.3851499995477007E-5,1.0000000002844471,2.3851499995477007E-5,1.037549119551852,0.31723312611797883,0.36746161340514344,-125.13741151571558,54.862588484284416,null,1000000000,568894052.25,null,12.167050792110301,-22.21761028045556,null,-11.799589178705155,-102.92116782554633,0.36746161340514583,-125.13877810600189,0,0]
[23988,23.988,18.541355400031012,1.5168366556888799,1.0007096492803416,3.7662444580896771E-2,1,0,161.42534089055991,1.5646014729352271,3.3193559707577234,1.264779140493745,1.0037817839232663,8.6832068008541555E-2,1.0000000002877121,2.3987999995398908E-5,1.0000000002877121,2.3987999995398908E-5,1.0379733756805776,0.31897761653945905,0.30966781866200321,-125.17880165576038,54.821198344239619,null,1000000000,575424144,null,12.162159940403587,-22.153665301261846,null,-11.852492121741582,-103.0265107656588,0.30966781866200499,-125.18017606692064,0,0]
[24127.75,24.127749999999999,18.649060876807503,1.5171485936676832,1.0007179389828891,3.7881650321848523E-2,1,0,162.36574143129894,1.564637353150752,3.3369434885310709,1.2664438884822611,1.0038258921180607,8.7335375806254334E-2,1.0000000002910743,2.4127749995318022E-5,1.0000000002910743,2.4127749995318022E-5,1.0384100870316002,0.32076245312948148,0.25084135552441267,-125.22188058213465,54.778119417865355,null,1000000000,582148320.0625,null,12.1572249734763,-22.089175465015852,null,-11.906383617951885,-103.13408753536423,0.25084135552441467,-125.22326300038009,0,0]
[24267.5,24.267499999999998,18.756768147396144,1.5174569491839518,1.0007262767702934,3.8100852420604195E-2,1,0,163.30614217865858,1.5646728201328572,3.3545401572753426,1.2680911756999271,1.0038702545783813,8.7838639247662942E-2,1.0000000002944558,2.4267499995236196E-5,1.0000000002944558,2.4267499995236196E-5,1.0388491774513702,0.32254608138016111,0.19235744005862782,-125.26565943498092,54.734340565019082,null,1000000000,588911556.25,null,12.152361600311576,-22.025659839287798,null,-11.960004160252948,-103.24139002102375,0.1923574400586272,-125.26704986031154,0,0]
[24407.25,24.407250000000001,18.864477181071457,1.5177617835420589,1.0007346626413522,3.8320050856189974E-2,1,0,164.24654312908984,1.5647078809794119,3.3721458337346339,1.2697212666195152,1.0039148712705201,8.8341858083737429E-2,1.0000000002978569,2.4407249995153419E-5,1.0000000002978569,2.4407249995153419E-5,1.0392906444010837,0.32432849625140237,0.13421126624663682,-125.3101266784425,54.689873321557499,null,1000000000,595713852.5625,null,12.147568259207592,-21.963103663313618,null,-12.013356992960958,-103.34842144754469,0.13421126624663415,-125.31152511085831,0,0]
[24547,24.547000000000001,{"$f":"SQRT(1+(A333/pole1)^2)","v":18.972187947805232},{"$f":"ATAN(A333/pole1)","v":1.5180631566568576},{"$f":"SQRT(1+(A333/Zero1)^2)","v":1.0007430965948572},{"$f":"ATAN(A333/Zero1)","v":3.8539245607634137E-2},{"$f":"IF(VIN_nom>Vout, 1, SQRT(1+(A333/z_RHP)^2))","v":1},{"$f":"IF(VIN_nom>Vout, 0, -ATAN(A333/z_RHP))","v":0},{"$f":"SQRT(1+(A333/Pole2)^2)","v":165.18694427912445},{"$f":"ATAN(A333/Pole2)","v":1.5647425426266586},3.3897603775566223,1.2713344205863593,{"$f":"SQRT(1+(A333/pole4)^2)","v":1.0039597421605824},{"$f":"ATAN(A333/pole4)","v":8.8845032065582349E-2},{"$f":"SQRT(1+(A333/Zero3)^2)","v":1.0000000003012777},{"$f":"ATAN(A333/Zero3)","v":2.4546999995069693E-5},{"$f":"SQRT(1+(A333/pole5)^2)","v":1.0000000003012777},{"$f":"ATAN(A333/pole5)","v":2.4546999995069693E-5},{"$f":"SQRT((1-(Z333/pterm2))^2+(A333/pterm1)^2)","v":1.0397344853326929},{"$f":"IF((ATAN((A333/pterm1)/(1-A333^2/pterm2))>0),ATAN((A333/pterm1)/(1-A333^2/pterm2)),PI()+ATAN((A333/pterm1)/(1-A333^2/pterm2)))","v":0.32610969273220997},{"$f":"20*LOG10(((E333*K333*G333*O333)/(C333*I333*S333*M333*Q333))*Adc)","v":7.6398124454853944E-2},{"$f":"((F333+L333+H333+R333)-(D333+J333+T333+N333))*radconv","v":-125.35527098324398},{"$f":"IF(V333>0,V333,V333+180)","v":54.644729016756017},null,{"$f":"IF(U333<0,A333,1000000000)","v":1000000000},{"$f":"A333^2","v":602555209},null,{"$f":"20*LOG10((K333/(I333*M333))*AEA*Afb)","v":12.142843429006668},{"$f":"(L333-(J333+N333))*radconv","v":-21.901492460856971},null,{"$f":"20*LOG10((E333*G333/(C333*S333))*Am)","v":-12.066445304551809},{"$f":"(F333+H333-(D333+T333))*radconv","v":-103.45518496188804},7.6398124454858163E-2,-125.35667742274501,0,0]
[24690,{"$f":"A334/1000","v":24.69},19.082405379459651,1.5183680166135811,1.0007517764582905,3.8763534075907997E-2,1,0,166.14921542643054,1.5647776041968839,3.4077935975786406,1.2729678226936805,1.0040059196581939,8.9359861077393438E-2,1.000000000304798,2.4689999994983023E-5,1.000000000304798,2.4689999994983023E-5,1.0401911029159268,0.32793104596830835,1.7580415988156753E-2,-125.40215441221669,54.597845587783311,null,1000000000,609596100,null,12.138078092775368,-21.839411823333435,null,-12.120497676787208,-103.56415722168074,{"$f":"AB334+AE334","v":1.758041598816007E-2},-125.40356904501418,{"$f":"SUM((U335<0)*(U334>0))*A334","v":24690},54.597845587783311]
[24833,24.832999999999998,19.192624564255492,1.5186693751055012,1.0007605066639844,3.8987818642271486E-2,1,0,167.11148677563392,1.5648122619798939,3.4258358138696652,1.2745840244013102,1.0040523632419629,8.98746425976336E-2,1.0000000003083389,2.4832999994895347E-5,1.0000000003083389,2.4832999994895347E-5,1.0406502007555141,0.32975111296363407,-4.0898269202842251E-2,-125.44972340336849,54.550276596631505,null,24833,616677889,null,12.133381393268266,-21.778290839749413,null,-12.174279662471111,-103.67285538971306,-4.0898269202845228E-2,-125.45114622946248,0,0]
[24976,24.975999999999999,19.302845472161462,1.5189672920584021,1.0007692872106215,3.9212099284262392E-2,1,0,168.07375832326679,1.5648465229110047,3.4438868850377453,1.2761832876656147,1.0040990728749668,9.038937636007767E-2,1.0000000003119003,2.4975999994806651E-5,1.0000000003119003,2.4975999994806651E-5,1.0411117760919215,0.33156988844430024,-9.904267961198146E-2,-125.49796646242608,54.502033537573922,null,24976,623800576,null,12.12875182460972,-21.71811488322146,null,-12.2277945042217,-103.78128259859506,-9.9042679611979878E-2,-125.49939748181652,0,0]
[25119,25.119,19.413068073827837,1.5192618260395687,1.0007781180968767,3.9436375979420853E-2,1,0,169.03603006594034,1.5648803937676146,3.4619466725712043,1.2777658693274296,1.0041460485200782,9.0904062098651095E-2,1.0000000003154821,2.5118999994716938E-5,1.0000000003154821,2.5118999994716938E-5,1.0415758261558261,0.33338736716850964,-0.15685746858226751,-125.54687230317708,54.453127696822918,null,25119,630964161,null,12.124187920167152,-21.658869610925048,null,-12.281045388749419,-103.88944190493898,-0.15685746858226679,-125.54831151586403,0,0]
[25265.25,25.265250000000002,19.525797456668936,1.5195596144551997,1.0007872017524455,3.966574576638885E-2,1,0,170.02017181923623,1.5649146378456742,3.4804257841757202,1.2793674265924662,1.0041943669039832,9.1430395289782751E-2,1.0000000003191665,2.5265249994624119E-5,1.0000000003191665,2.5265249994624119E-5,1.0420529796481177,0.3352448054991457,-0.21565003886684797,-125.59756363912152,54.402436360878482,null,25265.25,638332857.5625,null,12.119586721712718,-21.599225850537415,null,-12.335236760579569,-103.9997853807788,-0.21565003886685119,-125.59901123131621,0,0]
[25411.5,25.4115,19.638528551139,1.5198539841055145,1.0007963380589715,3.9895111377573289E-2,1,0,171.00431376961262,1.564948487769579,3.4989137287128216,1.2809520629181079,1.0042429634496532,9.1956677686882773E-2,1.0000000003228722,2.5411499994530223E-5,1.0000000003228722,2.5411499994530223E-5,1.0425327157437256,0.33710087647281267,-0.2741073856359531,-125.64892499447384,54.351075005526155,null,25411.5,645744332.25,null,12.115051223668088,-21.540526094910387,null,-12.389158609304038,-104.1098548712659,-0.27410738563595061,-125.65038096617629,0,0]
[25557.75,25.557749999999999,19.751261327930457,1.5201449934781373,1.0008055270150122,4.0124472788955652E-2,1,0,171.98845591368635,1.5649819503054667,3.5174103669015477,1.282520037223841,1.0042918381167081,9.248290900581381E-2,1.0000000003265992,2.5557749994435239E-5,1.0000000003265992,2.5557749994435239E-5,1.0430150314489859,0.33895557458655945,-0.33223419368377027,-125.70094494280583,54.299055057194167,null,25557.75,653198585.0625,null,12.11057997678618,-21.482755880441445,null,-12.442814170469951,-104.2196534135746,-0.33223419368377094,-125.70240929401605,0,0]
[25704,25.704000000000001,19.863995758400623,1.5204326997352566,1.0008147686191176,4.0353829976520088E-2,1,0,172.9725982481512,1.5650150320654936,3.5359155623104797,1.2840716033404851,1.0043409908645451,9.3009088962606817E-2,1.0000000003303477,2.570399999433916E-5,1.0000000003303477,2.570399999433916E-5,1.0434999237599105,0.34080889437271994,-0.39003505406069888,-125.75361226651518,54.246387733484823,null,25704,660695616,null,12.106171569706108,-21.425901026274282,null,-12.496206623766808,-104.32918397095885,-0.39003505406070005,-125.75508499723313,0,0]
[25853.75,25.853750000000002,19.979429791142987,1.520723926985329,1.0008242859413652,4.058867165231108E-2,1,0,173.98029290076533,1.5650485177208551,3.5548723443731376,1.2856435589477211,1.004391608017617,9.3547807743217359E-2,1.0000000003342082,2.5853749994239644E-5,1.0000000003342082,2.5853749994239644E-5,1.0439990870200528,0.34270513323673008,-0.44888614037063729,-125.80819930314611,54.191800696853889,null,25853.75,668416389.0625,null,12.101721340351094,-21.368619503532138,null,-12.550607480721734,-104.44106111037489,-0.44888614037063945,-125.80968061390703,0,0]
[26003.5,26.003499999999999,20.09486549893866,1.5210118083278841,1.000833858458634,4.0823508848747234E-2,1,0,174.98798774621488,1.5650816177118116,{"$f":"SQRT(1+(A343/Zero2)^2)","v":3.5738378174817891},{"$f":"ATAN(A343/Zero2)","v":1.2871988344052068},1.0044425166337088,9.4086472071887722E-2,1.0000000003380909,2.6003499994138965E-5,1.0000000003380909,2.6003499994138965E-5,1.0445009452791663,0.34459991552386271,-0.50740494264104152,-125.86344191971216,54.136558080287841,null,26003.5,676182012.25,null,12.097334116375327,-21.312268466164337,null,-12.604739059016371,-104.55266334435176,-0.50740494264104363,-125.8649318105161,0,0]
[26153.25,26.15325,20.210302853085306,1.5212964010483281,1.00084348616934,4.105834154005561E-2,1,0,175.99568278118747,1.5651143386628634,3.5928118440034575,1.2887376863977209,1.004493716668506,9.4625081644323872E-2,1.0000000003419962,2.6153249994037124E-5,1.0000000003419962,2.6153249994037124E-5,1.0450054952793926,0.34649323547968497,-0.56559609953416423,-125.91932872536397,54.080671274636032,null,26153.25,683992485.5625,null,12.09300849862813,-21.256833569337498,null,-12.658604598162295,-104.66399362687339,-0.56559609953416512,-125.92082719621089,0,0]
[26303,26.303000000000001,20.32574182553223,1.5215777611328281,1.0008531690718905,4.1293169700466238E-2,1,0,177.0033780024462,1.5651466870476585,3.611794289135879,1.2902603665286227,1.0045452080774488,9.5163636156420761E-2,1.000000000345924,2.6302999993934108E-5,1.000000000345924,2.6302999993934108E-5,1.0455127337519621,0.34838508738871482,-0.6234641569158289,-125.97584853955432,54.02415146044568,null,26303,691847809,null,12.088743124688232,-21.20230075072978,null,-12.712207281604062,-104.77505483971443,-0.6234641569158299,-125.9773555904442,0,0]
[26456,26.456,20.443687794150545,1.5218619458161637,1.0008631191208128,4.1533089592145821E-2,1,0,178.03294325901302,1.5651793592825873,3.631197264512775,1.291799647552198,1.0045981178777281,9.5713821647977204E-2,1.0000000003499598,2.6455999993827639E-5,1.0000000003499598,2.6455999993827639E-5,1.0460337539540077,0.35031647576484848,-0.68225905585199231,-126.03423734331149,53.965762656688511,null,26456,699919936,null,12.084446019164801,-21.14750173231592,null,-12.766705075016793,-104.88825142813978,-0.68225905585199165,-126.0357531604557,0,{"$f":"IF(AI346>0,W346,0)","v":0}]
[26609,26.609000000000002,20.561635394878532,1.5221428701877691,1.0008731267798245,4.1773004699751287E-2,1,0,179.06250870344013,1.5652116558028981,3.6506087521286967,1.2933225624251339,1.0046513317418675,9.6263949022150519E-2,1.0000000003540195,2.6608999993719931E-5,1.0000000003540195,2.6608999993719931E-5,1.0465575736568657,0.35224631974364989,-0.74072598630585451,-126.0932639862415,53.906736013758504,null,26609,708038881,null,12.080209037912402,-21.093615568518924,null,-12.820935024218256,-105.00117300112099,-0.74072598630585418,-126.09478856963992,0,0]
[26762,26.762,20.67958459978961,1.5224205899899941,1.0008831920471974,4.2012914995807893E-2,1,0,180.09207433250558,1.5652435830522744,3.6700286169150353,1.2948293638299535,1.0047048496215529,9.681401795522053E-2,1.0000000003581022,2.6761999993610975E-5,1.0000000003581022,2.6761999993610975E-5,1.0470841893397214,0.3541746133555797,-0.79886951173773224,-126.15291719469629,53.847082805303714,null,26762,716204644,null,12.076030839425353,-21.040628132344739,null,-12.874900351163085,-105.11382241200424,-0.79886951173773113,-126.15445054434898,0,0]
[26915,26.914999999999999,20.797535381590329,1.5226951597026481,1.0008933149211938,4.2252820452844203E-2,1,0,181.12164014306072,1.5652751473278894,3.6894567265892961,1.2963202994229657,1.0047586714682049,9.7364028123677351E-2,1.0000000003622085,2.6914999993500769E-5,1.0000000003622085,2.6914999993500769E-5,1.0476135974703567,0.3561013506736857,-0.85669410453718386,-126.21318590472811,53.786814095271893,null,26915,724417225,null,12.071910117481163,-20.988525576397755,null,-12.92860422201835,-105.22620244423734,-0.85669410453718697,-126.21472802063511,0,0]
[27071.75,27.071750000000002,20.918378721373411,1.5229732478873739,1.0009037456448366,4.2498600898494346E-2,1,0,182.17644059475634,1.5653071152444888,3.70936943045804,1.2978315774497349,1.0048141276602178,9.7927457652770583E-2,1.0000000003664398,2.7071749993386557E-5,1.0000000003664398,2.7071749993386557E-5,1.0481588735355911,0.35807369181568022,-0.91560979560193245,-126.27555875214323,53.724441247856774,null,27071.75,732879648.0625,null,12.067746674620546,-20.936049484504117,null,-12.98335647022248,-105.34106036465953,-0.91560979560193445,-126.27710984916365,0,0]
[27228.5,27.2285,21.039223660255193,1.5232481415313945,1.000914236829838,4.2744376206645236E-2,1,0,183.23124123048325,1.5653387151040301,3.7292905158978957,1.2993267130023931,1.004869902798057,9.8490824814564087E-2,1.0000000003706955,2.722849999327101E-5,1.0000000003706955,2.722849999327101E-5,1.048707073068802,0.36004438698261482,-0.97419994916467623,-126.33855478693042,53.661445213069584,null,27228.5,741391212.25,null,12.06364089348048,-20.884473626749859,null,-13.037840842645158,-105.45564123831443,-0.974199949164678,-126.34011486506429,0,0]
[27385.25,27.385249999999999,21.16007017083837,1.5235198953254816,1.0009247884742971,4.2990146347766545E-2,1,0,184.28604204708145,1.5653699532264105,3.7492198493050757,1.3008059567631338,1.0049259968286159,9.9054129261866408E-2,1.0000000003749758,2.7385249993154127E-5,1.0000000003749758,2.7385249993154127E-5,1.0492581922352047,0.36201342994022262,-1.0324690923234048,-126.40216276631398,53.597837233686022,null,27385.25,749951917.5625,null,12.059591477598834,-20.83378398231412,null,-13.092060569922239,-105.56994784324721,-1.0324690923234048,-126.40373182556132,0,0]
[27542,27.542000000000002,21.280918226347602,1.5237885627199954,1.0009354005763014,4.3235911292331661E-2,1,0,185.34084304146282,1.565400835787661,3.7691572998467637,1.3022695543915803,1.0049824096984972,9.9617370647722636E-2,1.0000000003792808,2.75419999930359E-5,1.0000000003792808,2.75419999930359E-5,1.0498122271879995,0.36398081450127201,-1.090421661804915,-126.46637165868535,53.533628341314653,null,27542,758561764,null,12.0555971647655,-20.783966809918713,null,-13.146018826570415,-105.68398288912739,-1.0904216618049158,-126.4679496990461,0,0]
[27702.5,27.702500000000001,21.404658957141244,1.524060514084373,1.0009463291987108,4.3487550365667905E-2,1,0,186.42087869045594,1.5654320950475131,3.7895799998227244,1.303752205669918,1.0050405024746556,0.10019402100329709,1.0000000003837142,2.7702499992913439E-5,1.0000000003837142,2.7702499992913439E-5,1.0503825337895676,0.36599354088292874,-1.1494371731975055,-126.53272799287198,53.467272007128017,null,27702.5,767428506.25,null,12.051563106974626,-20.733847804412381,null,-13.201000280172131,-105.80046742479297,-1.149437173197505,-126.53431522920535,0,0]
[27863,27.863,21.52840125277292,1.524329339190208,1.0009573212018812,4.3739183928193752E-2,1,0,187.50091451951008,1.5654629941905316,3.8100109409434331,1.305218958897618,1.0050989294138455,0.10077060450859368,1.0000000003881733,2.7862999992789551E-5,1.0000000003881733,2.7862999992789551E-5,1.0509558891570308,0.36800451559214187,-1.208129916681568,-126.59969158573779,53.400308414262213,null,27863,776346769,null,12.047584247443288,-20.684615226697613,null,-13.255714164124857,-105.91667279134614,-1.2081299166815693,-126.60128801804376,0,0]
[28023.5,28.023499999999999,21.65214508641342,1.5245950915988018,1.0009683765837238,4.3990811948224656E-2,1,0,188.58095052553151,1.5654935394040126,3.830449991338476,1.3066700622057497,1.0051576904577952,0.10134712079193471,1.0000000003926581,2.8023499992664227E-5,1.0000000003926581,2.8023499992664227E-5,1.051532289122598,0.37001373214033856,-1.2665043755508241,-126.66725125251412,53.33274874748588,null,28023.5,785316552.25,null,12.043659335964033,-20.636255193121734,null,-13.310163711514861,-106.03260168767099,-1.2665043755508272,-126.66885688079273,0,0]
[28184,28.184000000000001,21.775890431843045,1.5248578236557289,1.0009794953421389,4.4242434394080321E-2,1,0,189.66098670549695,1.5655237367343193,3.8508970218853174,1.308105758722176,1.0052167855479133,0.10192356948190795,1.000000000397169,2.818399999253746E-5,1.000000000397169,2.818399999253746E-5,1.0521117295058873,0.3720211840907281,-1.3245649436281344,-126.73539602034602,53.264603979653984,null,28184,794337856,null,12.039787155485019,-20.588754098635032,null,-13.364352099113155,-106.1482567459622,-1.3245649436281361,-126.73701084459724,0,0]
[28348,28.347999999999999,21.902335808840697,1.5251232184332817,1.0009909220282005,4.4499538142979821E-2,1,0,190.76457525290402,1.5655542393758757,3.8717980493705908,1.3095570967048773,1.0052775143070516,0.10251251849746461,1.0000000004018046,2.8347999992406431E-5,1.0000000004018046,2.8347999992406431E-5,1.052706941891816,0.3740705828709931,-1.3835718775328021,-126.80561999002565,53.194380009974353,null,28348,803609104,null,12.035883770623563,-20.541090523089728,null,-13.419455648156365,-106.26615368769502,-1.3835718775328019,-126.80724421078475,0,0]
[28512,28.512,22.028782710805942,1.5253855664563885,1.0010024148805889,4.4756636005080938E-2,1,0,191.86816397575876,1.5655843911268219,3.8927071447532522,1.3109928463941249,1.0053385917154996,0.10310139615633472,1.0000000004064671,2.8511999992273874E-5,1.0000000004064671,2.8511999992273874E-5,1.0533053198810836,0.37611812583134574,-1.4422600806475416,-126.87643235061189,53.123567649388107,null,28512,812934144,null,12.032032973972107,-20.494295897982095,null,-13.474293054619649,-106.38377006989673,-1.4422600806475412,-126.87806596787883,0,0]
[28676,28.675999999999998,22.155231111628368,1.5256449198556117,1.001013973897025,4.5013727946599059E-2,1,0,192.97175287105111,1.5656141980072424,3.9136241787216259,1.3124132517656557,1.0054000177097162,0.10369020206314192,1.0000000004111564,2.8675999992139786E-5,1.0000000004111564,2.8675999992139786E-5,1.053906858974091,0.37816380627225421,-1.5006339657874244,-126.94782205053878,53.052177949461225,null,28676,822312976,null,12.028233567777937,-20.448356566804144,null,-13.528867533565364,-106.50110849750938,-1.5006339657874275,-126.94946506431353,0,0]
[28840,28.84,22.281680985789947,1.5259013295797699,1.0010255990752168,4.5270813933754227E-2,1,0,194.07534193583942,1.5656436659002941,3.9345490246652699,1.313818551855757,1.0054617922258144,0.10427893582280526,1.0000000004158727,2.883999999200415E-5,1.0000000004158727,2.883999999200415E-5,1.0545115546581958,0.38020761755066973,-1.5586978579059054,-127.01977824894847,52.980221751051531,null,28840,831745600,null,12.02448438610543,-20.403259148229047,null,-13.583182244011336,-106.618171511002,-1.5586978579059068,-127.02143065923104,0,0]
[29008,29.007999999999999,22.411216504834883,1.5261609930033593,1.0010375763939177,4.5534164101557778E-2,1,0,195.20584797982846,1.5656735070420935,3.9559922032284871,1.3152427099519655,1.0055254347466267,0.10488195372165632,1.0000000004207319,2.9007999991863606E-5,1.0000000004207319,2.9007999991863606E-5,1.0551342673019053,0.38229933289754042,-1.6178609469895855,-127.09406575356103,52.905934246438974,null,29008,841464064,null,12.020694651561527,-20.357921051961075,null,-13.638555598551115,-106.73780673757354,-1.6178609469895875,-127.09572778953461,0,0]
[29176,29.175999999999998,22.54075351759062,1.5264176719809321,1.0010496231362245,4.5797507949254419E-2,1,0,196.33635419564527,1.5657030045328775,3.9774433189155127,1.3166515093636688,1.0055894428608829,0.10548489507273967,1.0000000004256195,2.9175999991721418E-5,1.0000000004256195,2.9175999991721418E-5,1.0557602827669497,0.3843890728608812,-1.6767076517655171,-127.16892535517385,52.831074644826145,null,29176,851238976,null,12.016955242622858,-20.313438867878265,null,-13.693662894388375,-106.85715814896007,-1.6767076517655166,-127.17059701683833,0,0]
[29344,29.344000000000001,22.670291998452178,1.526671417637917,1.0010617392996313,4.6060845440547192E-2,1,0,197.46686058033868,1.5657321642748454,3.9989022439961754,1.3180451917067735,1.0056538164987752,0.10608775945232926,1.0000000004305352,2.9343999991577584E-5,1.0000000004305352,2.9343999991577584E-5,1.0563895961609342,0.38647683048397008,-1.7352423491836901,-127.24434605686858,52.755653943131421,null,29344,861070336,null,12.013265003388149,-20.269799066302312,null,-13.748507352571838,-106.97622827792176,-1.7352423491836895,-127.24602734422407,0,0]
[29512,29.512,22.799831922396191,1.5269222799393734,1.0010739248816169,4.6324176539144425E-2,1,0,198.5973671310247,1.5657609920358071,4.0203688534213571,1.3194239936745182,1.0057185555901145,0.10669054643703098,1.000000000435479,2.9511999991432097E-5,1.000000000435479,2.9511999991432097E-5,1.0570222025778673,0.38856259887225825,-1.793469329026022,-127.32031707317203,52.679682926827965,null,29512,870958144,null,12.009622808786011,-20.226988391922024,null,-13.803092137812031,-107.09501959429643,-1.7934693290260206,-127.32200798621845,0,0]
[29684,29.684000000000001,22.932457599737507,1.5271761789931197,1.0010864725113509,4.6593770765094501E-2,1,0,199.75479067337119,1.5657901681261677,4.0423544057231755,1.3208204503425065,1.0057852146236406,0.10730760487010266,1.0000000004405698,2.9683999991281414E-5,1.0000000004405698,2.9683999991281414E-5,1.0576732774796427,0.39069596043577187,-1.8527682610927259,-127.3986560024459,52.601343997554096,null,29684,881139856,null,12.005942525934374,-20.1840038292926,null,-13.858710787027102,-107.21635294107384,-1.8527682610927272,-127.40035677036644,0,0]
[29856,29.856000000000002,23.065084738412413,1.527427158159895,1.0010990928992702,4.6863358213341505E-2,1,0,200.91221438379861,1.5658190080588046,4.06434775569228,1.3222017964258956,1.0058522565702173,0.10792458128185638,1.0000000004456904,2.985599999112898E-5,1.0000000004456904,2.985599999112898E-5,1.0583277936317277,0.3928272224853207,-1.9117534775977818,-127.47754954239429,52.522450457605714,null,29856,891380736,null,12.002310311007642,-20.141861079493466,null,-13.914063788605425,-107.33739908569538,-1.9117534775977827,-127.47926016518885,0,0]
[30028,30.027999999999999,23.197713313356473,1.5276752674895249,1.0011117860426235,4.713293884495668E-2,1,0,202.06963825941884,1.565847517610049,4.0863487774239822,1.3235682706776373,1.005919681353284,0.10854147521902251,1.0000000004508403,3.0027999990974777E-5,1.0000000004508403,3.0027999990974777E-5,1.0589857457262712,0.39495637782448895,-1.9704293125264958,-127.55698677601951,52.443013223980486,null,30028,901680784,null,11.998725050852379,-20.100546767977118,null,-13.969154363378875,-107.45816048571105,-1.9704293125264964,-127.55870725368817,0,0]
[30200,30.2,23.330343300074937,1.5279205558951592,1.0011245519386434,4.7402512621017197E-2,1,0,203.22706229740933,1.5658757024246441,4.1083573476671154,1.3249201069595027,1.0059874888958638,0.10915828622870363,1.0000000004560199,3.0199999990818795E-5,1.0000000004560199,3.0199999990818795E-5,1.0596471284413418,0.39708341932507019,-2.0288000135770954,-127.63695699783099,52.363043002169007,null,30200,912040000,null,11.995185662105353,-20.060047792921885,null,-14.023985675682447,-107.57863953745185,-2.0288000135770936,-127.63868733037373,0,0]
[30375.75,30.37575,23.465866362319119,1.528168328046152,1.0011376713072127,4.7677956610436091E-2,1,0,204.40972103596113,1.5659041720392124,4.1308534275600248,1.3262865345865251,1.0060571700880927,0.10978845902280281,1.000000000461343,3.0375749990657574E-5,1.000000000461343,3.0375749990657574E-5,1.0603264689151479,0.3992546444608816,-2.0881324778822776,-127.71921037947976,52.280789620520238,null,30375.75,922686188.0625,null,11.991615391910839,-20.01949468706206,null,-14.079747869793115,-107.70145609469371,-2.0881324778822759,-127.72095078175577,0,0]
[30551.5,30.551500000000001,23.601390848612905,1.5284132546853739,1.0011508666294937,4.7953393359963521E-2,1,0,205.59237993828472,1.5659323141140069,4.1533571367112616,1.327638157565022,1.0061272507480497,0.11041854427913926,1.0000000004666971,3.0551499990494468E-5,1.0000000004666971,3.0551499990494468E-5,1.0610093799529829,0.40142364775066824,-2.1471550584526207,-127.80199829941607,52.19800170058393,null,30551.5,933394152.25,null,11.988090819370786,-19.97976604288985,null,-14.135245877823408,-107.82398272853551,-2.147155058452622,-127.80374877142536,0,0]
[30727.25,30.727250000000002,23.73691673456473,1.5286553845225181,1.0011641379024832,4.8228822828094348E-2,1,0,206.77503900157009,1.5659601342691178,4.1758683517788553,1.3289752103422392,1.0061977307922674,0.11104854151575919,1.0000000004720819,3.0727249990329482E-5,1.0000000004720819,3.0727249990329482E-5,1.0616958558330323,0.40359042181018062,-2.2058720218870547,-127.88530998934735,52.114690010652652,null,30727.25,944163892.5625,null,11.98461087909763,-19.940848721961071,null,-14.190482900984684,-107.94622180912882,-2.2058720218870533,-127.88707053108989,0,0]
[30903,30.902999999999999,23.872443996336649,1.5288947651624798,1.0011774851231607,4.850424497333003E-2,1,0,207.95769822307102,1.5659876379967912,4.1983869520255102,1.3302979225463709,1.0062686101368261,0.11167845025112288,1.0000000004774976,3.0902999990162592E-5,1.0000000004774976,3.0902999990162592E-5,1.062385890819082,0.4057549593293347,-2.2642875500225559,-127.96913489073982,52.030865109260176,null,30903,954995409,null,11.981174534254626,-19.902729854641652,null,-14.245462084277181,-108.0681756475739,-2.264287550022555,-127.97090550221554,0,0]
[31083,31.082999999999998,24.011249990547508,1.5291371334153301,1.0011912338289333,4.8786319764021827E-2,1,0,209.16895676190722,1.56601548443234,4.2214576305209999,1.3316379907397287,1.006341617303933,0.11232349924782838,1.0000000004830765,3.108299998998969E-5,1.0000000004830765,3.108299998998969E-5,1.0630962955218892,0.40796951397990711,-2.3238075123887874,-128.05550801212235,51.944491987877655,null,31083,966152889,null,11.977699226623212,-19.864503671180646,null,-14.301506739011998,-108.19278526565776,-2.323807512388786,-128.0572889368384,0,0]
[31263,31.263000000000002,24.150057379022194,1.5293767155600246,1.001205062193484,4.9068386785279722E-2,1,0,210.38021546107041,1.5660430102176317,4.2445358074201129,1.3329634889889284,1.0064150431370682,0.11296845439014085,1.0000000004886875,3.1262999989814776E-5,1.0000000004886875,3.1262999989814776E-5,1.063810421320357,0.41018170733080239,-2.3830199004575063,-128.14239770085797,51.85760229914203,null,31263,977375169,null,11.974267534816425,-19.827088534661531,null,-14.357287435273934,-108.31710040415281,-2.3830199004575086,-128.14418893881435,0,0]
[31443,31.443000000000001,24.288866137856651,1.529613559335919,1.0012189702135121,4.9350445992543061E-2,1,0,211.59147431780713,1.5660702208593273,4.267621361074653,1.3342746490449977,1.0064888875446034,0.11361331516209974,1.000000000494331,3.144299998963783E-5,1.000000000494331,3.144299998963783E-5,1.0645282620065863,0.41239153177019328,-2.4419289443370138,-128.22979326622806,51.770206733771943,null,31443,988662249,null,11.970878432271281,-19.790471452674577,null,-14.412807376608296,-108.44112336475018,-2.4419289443370147,-128.23159481742476,0,0]
[31623,31.623000000000001,24.42767624368993,1.5298477113984994,1.0012329578856978,4.9632497341258609E-2,1,0,212.80273332942676,1.5660971217387154,4.2907141724159912,1.3355716978693835,1.0065631504344155,0.11425808104820939,1.0000000005000069,3.162299998945885E-5,1.0000000005000069,3.162299998945885E-5,1.0652498113578939,0.41459897976755544,-2.5005387900799985,-128.31768422733691,51.682315772663088,null,31623,1000014129,null,11.967530920033946,-19.754639700076151,null,-14.468069710113944,-108.56485639169779,-2.5005387900799985,-128.31949609177394,0,0]
[31807,31.806999999999999,24.56957238700134,1.530084332215238,1.0012473387184644,4.9920808328901042E-2,1,0,214.0409093653173,1.5661243057268774,4.3143275373962275,1.3368832163429798,1.006639496049242,0.11491707645671842,1.0000000005058425,3.180699998927378E-5,1.0000000005058425,3.180699998927378E-5,1.0659912218477134,0.41685301816529491,-2.5601460628286752,-128.40802965356011,51.591970346439894,null,31807,1011685249,null,11.964150993395119,-19.718810410162785,null,-14.524297056223798,-108.69104165025777,-2.5601460628286787,-128.40985206042055,0,0]
[31991,31.991,24.711469890150465,1.5303182356102309,1.0012618027757443,5.0209111010724811E-2,1,0,215.27908555755803,1.5661511770180143,4.3379482425691664,1.3381804542426585,1.0067162787559683,0.11557597162757603,1.000000000511712,3.1990999989086549E-5,1.000000000511712,3.1990999989086549E-5,1.0667364944683502,0.41910455767461274,-2.6194491934300963,-128.49887124031534,51.501128759684661,null,31991,1023424081,null,11.960812499714395,-19.68377567745064,null,-14.580261693144491,-108.81692851214856,-2.6194491934300963,-128.50070418959922,0,0]
[32175,32.174999999999997,24.853368729845787,1.5305494681025393,1.0012763500539315,5.0497405339164372E-2,1,0,216.51726190346665,1.5661777409766573,4.3615761686793917,1.3394636392525874,1.0067934984545901,0.11623476601167249,1.0000000005176153,3.2174999988897156E-5,1.0000000005176153,3.2174999988897156E-5,1.067485622526825,0.4213535905145257,-2.6784523519408392,-128.59019844041768,51.40980155958232,null,32175,1035230625,null,11.957514455814904,-19.649522732501179,null,-14.635966807755745,-108.94251919962382,-2.678452351940841,-128.592041932125,0,0]
[32359,32.359000000000002,24.995268883324478,1.5307780751560109,1.0012909805493984,5.0785691266662492E-2,1,0,217.75543840042187,1.5662040028453275,4.3852111990056573,1.3407329943356958,1.0068711550445653,0.11689345906041594,1.0000000005235523,3.2358999988705574E-5,1.0000000005235523,3.2358999988705574E-5,1.0682385993151879,0.42360010899239164,-2.7371596256865534,-128.68200091483018,51.317999085169816,null,32359,1047104881,null,11.954255905005095,-19.616039069421866,null,-14.69141553069165,-109.06781587953905,-2.7371596256865551,-128.68385494896091,0,0]
[32547.5,32.547499999999999,25.140640760106848,1.5310095970563349,1.0013060551470565,5.1081018903863684E-2,1,0,219.02389654174658,1.5662305990815764,4.4094315074931432,1.3420192802721806,1.0069511637882198,0.11756815579393061,1.0000000005296699,3.2547499988507043E-5,1.0000000005296699,3.2547499988507043E-5,1.0690139753392773,0.42589895419604074,-2.7970000356832041,-128.77653081513699,51.223469184863006,null,32547.5,1059339756.25,null,11.950957641879249,-19.582521441345591,null,-14.74795767756245,-109.19587420817658,-2.797000035683201,-128.77839564952217,0,0]
[32736,32.735999999999997,25.286013968992648,1.5312384568583142,1.0013212170744059,5.137633762316561E-2,1,0,220.29235483621582,1.5662568890319855,4.4336590318084337,1.3432915105947025,1.0070316308388771,0.1182427450109509,1.0000000005358227,3.2735999988306202E-5,1.0000000005358227,3.2735999988306202E-5,1.0697933763491467,0.42819514448784834,-2.8565383384906315,-128.87153820239035,51.128461797609646,null,32736,1071645696,null,11.947698876124996,-19.549785431501466,null,-14.804237214615627,-109.32362840552845,-2.8565383384906315,-128.87341383702991,0,0]
[32924.5,32.924500000000002,25.431388487137813,1.5314647001901622,1.00133646632748,5.1671647373463192E-2,1,0,221.56081328119927,1.5662828779570721,4.4578936543029348,1.3445499103842034,1.0071125560866825,0.11891722612335061,1.0000000005420113,3.2924499988103029E-5,1.0000000005420113,3.2924499988103029E-5,1.0705767950856087,0.43048867188443252,-2.9157786722267112,-128.96701260792841,51.03298739207159,null,32924.5,1084022700.25,null,11.944478660183492,-19.517818411409731,null,-14.860257332410205,-109.45108063141274,-2.9157786722267129,-128.96889904282247,0,0]
[33113,33.113,25.57676429221744,1.5316883716437923,1.0013518029022888,5.1966948103660711E-2,1,0,222.82927187412653,1.5663085709975728,4.4821352598384276,1.3457947000295893,1.0071939394211911,0.11959159854358542,1.0000000005482352,3.3112999987897518E-5,1.0000000005482352,3.3112999987897518E-5,1.071364224274292,0.43277952849912077,-2.9747250928570423,-129.06294377125883,50.93705622874117,null,33113,1096470769,null,11.941296072116682,-19.486608014594886,null,-14.916021164973722,-109.57823299181241,-2.9747250928570406,-129.06484100640731,0,0]
[33305.75,33.305750000000003,25.725419109179736,1.5319144719787738,1.0013675755548788,5.2268897427208146E-2,1,0,224.12632981646638,1.5663345425915578,4.5069305303564686,1.3470537061512711,1.0072776312382417,0.12028106263979758,1.0000000005546363,3.3305749987684939E-5,1.0000000005546363,3.3305749987684939E-5,1.0721735466807043,0.43511926582601013,-3.0347007581707794,-129.16149968309261,50.838500316907385,null,33305.75,1109272983.0625,null,11.93807970355077,-19.455463722967131,null,-14.972780461721552,-109.70794423903546,-3.0347007581707821,-129.16340796200259,0,0]
[33498.5,33.4985,25.874075226148896,1.5321379742652341,1.0013834395026682,5.2570837211302464E-2,1,0,225.42338790824499,1.5663602153109273,4.531732866611792,1.3482989330576196,1.0073618017958383,0.12097041184670329,1.0000000005610747,3.3498499987469887E-5,1.0000000005610747,3.3498499987469887E-5,1.0729870469898342,0.43745619421038734,-3.094377431103092,-129.26051212768832,50.739487872311685,null,33498.5,1122149502.25,null,11.934900807546667,-19.42508521529739,null,-15.029278238649759,-109.83734623506245,-3.0943774311030925,-129.26243145035986,0,0]
[33691.25,33.691249999999997,26.022732620845861,1.5323589230054659,1.0013993947413187,5.287276740134407E-2,1,0,226.72044614689759,1.5663855942851947,4.5565421532229653,1.3495306019287312,1.0074464509739876,0.12165964553802079,1.00000000056755,3.3691249987252348E-5,1.00000000056755,3.3691249987252348E-5,1.0738047173769891,0.43979030553258242,-3.1537591951490676,-129.35997077807534,50.640029221924664,null,33691.25,1135100326.5625,null,11.93175847627373,-19.395460076915818,null,-15.085517671422796,-109.9664410675925,-3.1537591951490658,-129.36190114450832,0,0]
[33884,33.884,26.171391271497576,1.5325773616916452,1.001415441266466,5.3174687942743847E-2,1,0,228.01750452991777,1.5664106845271601,4.5813582772758528,1.3507489293189459,1.0075315786520531,0.12234876308811719,1.0000000005740626,3.3883999987032308E-5,1.0000000005740626,3.3883999987032308E-5,1.0746265500023184,0.44212159177787164,-3.212850052823228,-129.45986551380591,50.540134486194091,null,33884,1148125456,null,11.928651826492448,-19.36657615153883,null,-15.141501879315676,-110.09523077246156,-3.212850052823228,-129.4618069240004,0,0]
[34081.5,34.081499999999998,26.323714645411833,1.5327986242829128,1.0014319779153038,5.3484038743458445E-2,1,0,229.34652688538685,1.5664360987060495,4.6067929297310535,1.3519836633694011,1.0076193003648783,0.12305474165952955,1.0000000005807743,3.4081499986804232E-5,1.0000000005807743,3.4081499986804232E-5,1.0754729444569964,0.44450739002180562,-3.2730994601360326,-129.56266395337445,50.437336046625546,null,34081.5,1161548642.25,null,11.92550473119911,-19.337736819352447,null,-15.198604191335141,-110.22687986013295,-3.2730994601360308,-129.5646166794854,0,0]
[34279,34.279000000000003,26.476039293230865,1.5330173409038015,1.0014486103959266,5.3793379298118497E-2,1,0,230.67554938727946,1.5664612200406054,4.6322345284221633,1.3532048362172304,1.0077075241933693,0.12376059696719768,1.0000000005875249,3.4278999986573493E-5,1.0000000005875249,3.4278999986573493E-5,1.076323692108188,0.44689020553493297,-3.3330517027657205,-129.66589936719402,50.334100632805985,null,34279,1175049841,null,11.92239329601078,-19.309650645605849,null,-15.255444998776497,-110.35821276361557,-3.3330517027657169,-129.66786340922141,0,0]
[34476.5,34.476500000000001,26.628365193092971,1.5332335552253977,1.0014653387035592,5.4102709548033423E-2,1,0,232.00457203307928,1.5664860535634133,4.6576829595221927,1.3544126664752929,1.0077962500056588,0.12446632834022735,1.0000000005943144,3.4476499986340077E-5,1.0000000005943144,3.4476499986340077E-5,1.0771787844748988,0.44927003003668575,-3.392710835235019,-129.7695615106669,50.230438489333096,null,34476.5,1188629052.25,null,11.919316646046759,-19.282305354611331,null,-15.312027481281778,-110.48923151399943,-3.3927108352350182,-129.77153686861075,0,0]
[34674,34.673999999999999,26.780692323633662,1.5334473099261408,1.0014821628334003,5.4412029434524431E-2,1,0,233.33359482032733,1.5665106041924015,4.6831381116480806,1.3556073681610155,1.0078854776691752,0.12517193510845376,1.0000000006011431,3.4673999986103978E-5,1.0000000006011431,3.4673999986103978E-5,1.0780382130610273,0.45164685536116195,-3.4520808315755183,-129.87364034566153,50.126359654338472,null,34674,1202286276,null,11.916273930214727,-19.255688927452496,null,-15.368354761790243,-110.61993809206933,-3.4520808315755165,-129.87562701952183,0,0]
[34875.75,34.875749999999996,26.936298628744048,1.5336631682020283,1.0014994479338457,5.4727994810389799E-2,1,0,234.69121697565893,1.5665353960331292,4.7091478590553031,1.3568144411142604,1.0079771434494733,0.12589259646793771,1.0000000006081589,3.4875749985859997E-5,1.0000000006081589,3.4875749985859997E-5,1.0789206040193919,0.454071722506876,-3.5124339248236454,-129.98037886177264,50.019621138227365,null,34875.75,1216317938.0625,null,11.913199914555083,-19.229240063833604,null,-15.42563383937873,-110.75313703122286,-3.5124339248236467,-129.98237709505648,0,0]
[35077.5,35.077500000000001,27.09190617452812,1.5338765468411608,1.0015168330146489,5.504394924826906E-2,1,0,236.04883927358071,1.5665599026959749,4.7351643924261548,1.3580082516881709,1.0080693326301544,0.12661312639083816,1.0000000006152154,3.5077499985613184E-5,1.0000000006152154,3.5077499985613184E-5,1.0798075018585971,0.45649344314702395,-3.5724934391542842,-130.08753165848634,49.912468341513659,null,35077.5,1230431006.25,null,11.910159586516304,-19.203527208327145,null,-15.482653025670585,-110.88601424286652,-3.5724934391542806,-130.08954145119367,0,0]
[35279.25,35.279249999999998,27.247514939729825,1.5340874883070665,1.0015343180706036,5.5359892685651745E-2,1,0,237.40646171164653,1.5665841290733269,4.7611876005191167,1.3591890139161922,1.0081620450676352,0.12733352416516944,1.0000000006223126,3.5279249985363517E-5,1.0000000006223126,3.5279249985363517E-5,1.0806988974759599,0.458912008945905,-3.6322633636226125,-130.19508867107101,49.804911328928995,null,35279.25,1244625480.5625,null,11.907152110906017,-19.17853833723947,null,-15.539415474528626,-111.01857168596237,-3.6322633636226094,-130.19711002320184,0,0]
[35481,35.481000000000002,{"$f":"SQRT(1+(A397/pole1)^2)","v":27.403124903575765},{"$f":"ATAN(A397/pole1)","v":1.5342960340996283},{"$f":"SQRT(1+(A397/Zero1)^2)","v":1.0015519030964732},{"$f":"ATAN(A397/Zero1)","v":5.5675825060040561E-2},{"$f":"IF(VIN_nom>Vout, 1, SQRT(1+(A397/z_RHP)^2))","v":1},{"$f":"IF(VIN_nom>Vout, 0, -ATAN(A397/z_RHP))","v":0},{"$f":"SQRT(1+(A397/Pole2)^2)","v":238.76408428746578},{"$f":"ATAN(A397/Pole2)","v":1.5666080799463018},4.7872173744832631,1.3603569373240052,{"$f":"SQRT(1+(A397/pole4)^2)","v":1.0082552806175697},{"$f":"ATAN(A397/pole4)","v":0.12805378907975576},{"$f":"SQRT(1+(A397/Zero3)^2)","v":1.0000000006294507},{"$f":"ATAN(A397/Zero3)","v":3.5480999985110978E-5},{"$f":"SQRT(1+(A397/pole5)^2)","v":1.0000000006294507},{"$f":"ATAN(A397/pole5)","v":3.5480999985110978E-5},{"$f":"SQRT((1-(Z397/pterm2))^2+(A397/pterm1)^2)","v":1.0815947817541063},{"$f":"IF((ATAN((A397/pterm1)/(1-A397^2/pterm2))>0),ATAN((A397/pterm1)/(1-A397^2/pterm2)),PI()+ATAN((A397/pterm1)/(1-A397^2/pterm2)))","v":0.46132741169140729},{"$f":"20*LOG10(((E397*K397*G397*O397)/(C397*I397*S397*M397*Q397))*Adc)","v":-3.6917476082378804},{"$f":"((F397+L397+H397+R397)-(D397+J397+T397+N397))*radconv","v":-130.30304003860945},{"$f":"IF(V397>0,V397,V397+180)","v":49.696959961390547},null,{"$f":"IF(U397<0,A397,1000000000)","v":35481},{"$f":"A397^2","v":1258901361},null,{"$f":"20*LOG10((K397/(I397*M397))*AEA*Afb)","v":11.904176675257808},{"$f":"(L397-(J397+N397))*radconv","v":-19.154261678823769},null,{"$f":"20*LOG10((E397*G397/(C397*S397))*Am)","v":-15.595924283495687},{"$f":"(F397+H397-(D397+T397))*radconv","v":-111.15081127134005},-3.6917476082378791,-130.3050729501638,0,0]
[35687.75,{"$f":"A398/1000","v":35.687750000000001},27.562592594437028,1.5345073052712908,1.0015700276460935,5.5999575690034525E-2,1,0,240.15535316424905,1.5666323434540181,4.8138989487315467,1.3615407000602908,1.0083513694057555,0.12879176584328908,1.0000000006368077,3.5687749984849173E-5,1.0000000006368077,3.5687749984849173E-5,1.0825175162161473,0.46379938564835826,-3.7524136810020154,-130.41406581117263,49.585934188827366,null,35687.75,1273615500.0625,null,11.901159913092979,-19.130110220579663,null,-15.65357359409499,-111.28600034804975,{"$f":"AB398+AE398","v":-3.752413681002011},-130.41611056862942,{"$f":"SUM((U399<0)*(U398>0))*A398","v":0},0]
[35894.5,35.894500000000001,27.722061501414629,1.534716145811678,1.00158825717094,5.6323314569037171E-2,1,0,241.54662218078735,1.5666563274540806,4.8405871942979131,1.3627114112327006,1.0084480072470554,0.12952960157049823,1.0000000006442076,3.5894499984584326E-5,1.0000000006442076,3.5894499984584326E-5,1.0834449451497246,0.46626802076270357,-3.8127878066088527,-130.52548539464618,49.474514605353818,null,35894.5,1288415130.25,null,11.898175141109736,-19.106682466467475,null,-15.710962947718588,-111.42085953153791,-3.8127878066088527,-130.5275419980054,0,0]
[36101.25,36.10125,27.881531603641768,1.5349225974088421,1.0016065916652812,5.6647041629831855E-2,1,0,242.93789133467962,1.5666800367485576,4.8672820014419935,1.3638692823509919,1.0085451939836401,0.13026729549868318,1.0000000006516501,3.6101249984316415E-5,1.0000000006516501,3.6101249984316415E-5,1.0843770586975219,0.46873330859817675,-3.8728739476365033,-130.63728881089062,49.362711189109376,null,36101.25,1303300251.5625,null,11.895221554508826,-19.083966529309517,null,-15.768095502145329,-111.55539073084272,-3.8728739476365028,-130.63935726015222,0,0]
[36308,36.308,28.041002880726186,1.5351267008033271,1.0016250311233525,5.6970756805216759E-2,1,0,244.32916062357947,1.5667034760301422,4.8939832627910977,1.3650145204484088,1.0086429294568451,0.13100484686605451,1.0000000006591354,3.6307999984045408E-5,1.0000000006591354,3.6307999984045408E-5,1.0853138469879677,0.47119524085322945,-3.9326759880279156,-130.74946628546698,49.25053371453302,null,36308,1318270864,null,11.892298370474661,-19.061950772198877,null,-15.824974358502574,-111.68959580843212,-3.9326759880279134,-130.75154658063099,0,0]
[36519.5,36.519500000000001,28.204139142608167,1.53533310515985,1.0016440028233649,5.7301896841347545E-2,1,0,245.75239391494659,1.5667271792120991,4.9213045439236422,1.3661732095191403,1.0087434779897848,0.13175919488156709,1.0000000006668368,3.6519499983764969E-5,1.0000000006668368,3.6519499983764969E-5,1.0862769843911613,0.47371025441382414,-3.9935619597655316,-130.86459805832445,49.135401941675553,null,36519.5,1333673880.25,null,11.889338691861099,-19.040141828513207,null,-15.882900651626633,-111.82654864303262,-3.9935619597655343,-130.86669047154584,0,0]
[36731,36.731000000000002,28.367276592244071,1.5355371355022092,1.0016630843532042,5.763302429745161E-2,1,0,247.17562734279741,1.5667506094289614,4.9486323592436401,1.3673191028649001,1.0088446004244382,0.13251339210069041,1.0000000006745831,3.6730999983481256E-5,1.0000000006745831,3.6730999983481256E-5,1.0872449928635661,0.47622173929196299,-4.05415860558477,-130.98010121365286,49.019898786347142,null,36731,1349166361,null,11.886409239031071,-19.019041746120493,null,-15.94056784461584,-111.96316399881113,-4.0541586055847691,-130.9822057449316,0,0]
[36942.5,36.942500000000003,28.530415209259111,1.5357388325375345,1.0016822757065937,5.7964139101636773E-2,1,0,248.59886090478776,1.5667737713688947,4.9759666010945836,1.3684524083218006,1.0089462965882463,0.13326743771090011,1.0000000006823742,3.6942499983194264E-5,1.0000000006823742,3.6942499983194264E-5,1.0882178617943399,0.47872968703547614,-4.1144698406954978,-131.09596591757025,48.904034082429746,null,36942.5,1364748306.25,null,11.883509240847243,-18.998638838946537,null,-15.997979081542741,-112.09944372795985,-4.1144698406954987,-131.09808256690638,0,0]
[37154,37.154000000000003,28.693554973741698,1.5359382360479488,1.0017015768772215,5.8295241182027425E-2,1,0,250.02209459862695,1.5667966696133186,5.0033071641475289,1.3695733293140229,1.0090485663077404,0.13402133090068802,1.0000000006902099,3.7153999982903958E-5,1.0000000006902099,3.7153999982903958E-5,1.089195580559166,0.48123408933778256,-4.1744995026264133,-131.21218253826345,48.787817461736552,null,37154,1380419716,null,11.880637947280558,-18.978921667644293,null,-16.055137449906972,-112.23538963801263,-4.1744995026264142,-131.21431130565693,0,0]
[37370.25,37.370249999999999,28.860359799786838,1.5361397870190929,1.0017214250635142,5.8633766130654491E-2,1,0,251.47729230374284,1.5668198141392762,5.0312681871568472,1.3707068272616649,1.0091537257055021,0.13479199705995709,1.0000000006982677,3.7370249982603705E-5,1.0000000006982677,3.7370249982603705E-5,1.0902002609042372,0.48379106280705825,-4.2355901368181748,-131.33136325900011,48.668636740999887,null,37370.25,1396535585.0625,null,11.877731087357169,-18.959459021131305,null,-16.113321224175344,-112.37404539547461,-4.2355901368181748,-131.3335044166059,0,0]
[37586.5,37.586500000000001,29.027165784746128,1.5363390215538228,1.001741388041665,5.897227762563665E-2,1,0,252.93249014201731,1.5668426923501977,{"$f":"SQRT(1+(A407/Zero2)^2)","v":5.0592356029708112},{"$f":"ATAN(A407/Zero2)","v":1.3718277947002939},1.0092594843411231,0.13556250216309995,1.0000000007063725,3.7586499982299949E-5,1.0000000007063725,3.7586499982299949E-5,1.0912099888667681,0.48634431269609651,-4.2963942819575855,-131.4508921418296,48.549107858170402,null,37586.5,1412744982.25,null,11.874852714688572,-18.940689833336815,null,-16.171246996646161,-112.51235585631093,-4.2963942819575891,-131.45304568964775,0,0]
[37802.75,37.802750000000003,29.193972908754453,1.5365359793428139,1.0017614658048108,5.9310775590200468E-2,1,0,254.38768811116518,1.5668653088163402,5.0872093061542714,1.3729364354987286,1.0093658420262437,0.13633284534602211,1.000000000714524,3.7802749981992689E-5,1.000000000714524,3.7802749981992689E-5,1.0922247530502065,0.48889383059467068,-4.3569158007001745,-131.57075951491305,48.42924048508695,null,37802.75,1429047907.5625,null,11.8720020916672,-18.922602635785413,null,-16.228917892367374,-112.65032281715807,-4.3569158007001736,-131.57292545294348,0,0]
[38019,38.018999999999998,29.360781152398008,1.5367306991754757,1.0017816583460506,5.9649259947591037E-2,1,0,255.84288620895327,1.5668876680039825,5.115189193555028,1.3740329491878829,1.0094727985715173,0.13710302574576086,1.0000000007227221,3.8018999981681886E-5,1.0000000007227221,3.8018999981681886E-5,1.0932445420456105,0.49143960824932198,-4.4171584791037946,-131.69095590640478,48.309044093595219,null,38019,1445444361,null,11.869178500908383,-18.905186202652619,null,-16.28633698001218,-112.78794803199492,-4.4171584791037972,-131.69313423464754,0,0]
[38240.5,38.240499999999997,29.531640216854758,1.5369278658148107,1.0018024600952797,5.9995947657392398E-2,1,0,257.33341294655582,1.5669103078539,5.1438546672362415,1.3751437152226966,1.0095829723955965,0.13789173450698025,1.0000000007311678,3.8240499981359848E-5,1.0000000007311678,3.8240499981359848E-5,1.0942942862654845,0.49404330489752468,-4.4785784980263283,-131.81440176362969,48.185598236370311,null,38240.5,1462335840.25,null,11.866313656021802,-18.888030847943654,null,-16.344892154048132,-112.92856193494396,-4.4785784980263301,-131.8165927828876,0,{"$f":"IF(AI410>0,W410,0)","v":0}]
[38462,38.462000000000003,29.702500416136889,1.5371227641050593,1.0018233822485103,6.0342620928356509E-2,1,0,258.82393981453868,1.5669326869450704,5.1725264170639953,1.376242168460817,1.0096937741051013,0.13868027065608698,1.0000000007396628,3.8461999981034064E-5,1.0000000007396628,3.8461999981034064E-5,1.0953492779710565,0.49664306046317702,-4.5397137758580293,-131.93817331487674,48.061826685123265,null,38462,1479325444,null,11.863475710561303,-18.871556134198766,null,-16.403189486419333,-113.06882089095106,-4.5397137758580293,-131.94037702514981,0,0]
[38683.5,38.683500000000002,29.873361730772555,1.5373154329528957,1.0018444247981988,6.0689279678062584E-2,1,0,260.31446681066222,1.5669548097566839,5.2012043392461154,1.3773285098967982,1.009805203493346,0.13946863326945658,1.0000000007482066,3.8683499980704505E-5,1.0000000007482066,3.8683499980704505E-5,1.096409504865502,0.49923886658438732,-4.6005681437213788,-132.06226100253477,47.937738997465232,null,38683.5,1496413172.25,null,11.860663955400925,-18.855750748997199,null,-16.461232099122306,-113.20872665482575,-4.6005681437213806,-132.06447740382296,0,0]
[38905,38.905000000000001,30.044224141732723,1.5375059103806117,1.0018655877367588,6.1035923824110681E-2,1,0,261.80499393273794,1.5669766806659264,5.2298883322448901,1.37840293623145,1.0099172603525657,0.14025682142473389,1.0000000007567995,3.8904999980371144E-5,1.0000000007567995,3.8904999980371144E-5,1.0974749546409266,0.50183071506898747,-4.6611453566630328,-132.18665546828589,47.813344531714108,null,38905,1513599025,null,11.857877700922337,-18.840603620159939,null,-16.519023057585368,-113.34828094042933,-4.661145356663031,-132.18888456058926,0,0]
[39131.5,39.131500000000003,30.21894460634218,1.5376984600594206,1.0018873528819903,6.1390377706759459E-2,1,0,263.32916739326487,1.5669987892359099,5.2592259938707668,1.3794894949605956,1.0100324953714312,0.14106262026833119,1.0000000007656371,3.9131499980026316E-5,1.0000000007656371,3.9131499980026316E-5,1.0985698434255222,0.50447696928236474,-4.7228072257177747,-132.31416563256994,47.685834367430061,null,39131.5,1531274292.25,null,11.855054223205483,-18.825783991395628,null,-16.577861448923258,-113.49062371097178,-4.7228072257177747,-132.3164077023674,0,0]
[39358,39.357999999999997,30.393666178449259,1.5378887959561753,1.001909243896421,6.1744816144799819E-2,1,0,264.85334098102265,1.5670206433458445,5.2885697956982183,1.3805639973335817,1.0101483860664124,0.14186823474211133,1.000000000774526,3.9357999979677469E-5,1.000000000774526,3.9357999979677469E-5,1.0996701674855851,0.50711906838233844,-4.7841869923417315,-132.44197740616033,47.558022593839667,null,39358,1549052164,null,11.852256011689004,-18.811629997857086,null,-16.636443004030738,-113.63260245559476,-4.7841869923417342,-132.44423245345186,0,0]
[39584.5,39.584499999999998,30.568388839063381,1.538076956017542,1.0019312607718005,6.2099239050193239E-2,1,0,266.37751469382744,1.5670422473636605,5.3179196360840058,1.3816266404672368,1.0102649322118653,0.14267366386399277,1.0000000007834662,3.9584499979324583E-5,1.0000000007834662,3.9584499979324583E-5,1.1007759136290343,0.50975700415500103,-4.8452884372070386,-132.57008139769542,47.429918602304582,null,39584.5,1566932640.25,null,11.84948238823705,-18.798130539576778,null,-16.694770825444088,-113.77421888290415,-4.8452884372070386,-132.57234942248093,0,0]
[39811,39.811,30.743112569625577,1.5382629773281553,1.0019534034998321,6.245364633492452E-2,1,0,267.90168852954486,1.5670636055578866,5.3472754155957789,1.3826776172582895,1.0103821335809737,0.1434789066533077,1.0000000007924579,3.9810999978967646E-5,1.0000000007924579,3.9810999978967646E-5,1.1018870686544839,0.51239076856865229,-4.9061152659234395,-132.69846841304059,47.301531586959413,null,39811,1584915721,null,11.846732693401592,-18.785274752766838,null,-16.752847959325031,-113.91547466255336,-4.9061152659234395,-132.70074941532022,0,0]
[40042.75,40.042749999999998,30.921887276500243,1.5384511345070091,1.0019761897233321,6.2816252098304604E-2,1,0,269.46119102292192,1.5670852087240268,5.3773176728428513,1.3837410762315792,1.0105027294809268,0.1443026201281363,1.0000000008017109,4.0042749978598193E-5,1.0000000008017109,4.0042749978598193E-5,1.1030295635424847,0.51508125480446032,-4.9680715385172851,-132.83011483843345,47.169885161566555,null,40042.75,1603421827.5625,null,11.84394336205659,-18.772776117777429,null,-16.812014900573878,-114.05963300123254,-4.9680715385172878,-132.83240911900998,0,0]
[40274.5,40.274500000000003,31.100663065520688,1.5386371285264071,1.0019991076836052,6.3178841322147808E-2,1,0,271.02069364060833,1.5671065632730423,5.4073659439617314,1.3847927172816963,1.0106240108470099,0.14512613645980763,1.0000000008110177,4.0274499978224445E-5,1.0000000008110177,4.0274499978224445E-5,1.1041776929732126,0.51776735763461901,-5.0297479330285908,-132.96203869785907,47.037961302140928,null,40274.5,1622035350.25,null,11.841177742031949,-18.760929059726326,null,-16.870925675060541,-114.20341719700613,-5.0297479330285917,-132.96434625673245,0,0]
[40506.25,40.506250000000001,31.279439918132095,1.5388209964638202,1.0020221573716122,6.3541413912252417E-2,1,0,272.58019638047062,1.5671276734721247,5.4374201292508468,1.3858327340262082,1.0107459774324719,0.14594945460250716,1.000000000820378,4.0506249977846374E-5,1.000000000820378,4.0506249977846374E-5,1.1053314427801544,0.52044906904235966,-5.091148186937982,-133.09423075287216,46.905769247127836,null,40506.25,1640756289.0625,null,11.83843518382157,-18.749722669715386,null,-16.929583370759552,-114.34682892032706,-5.091148186937982,-133.09655159004245,0,0]
[40738,40.738,31.458217816201323,1.5390027745544519,1.0020453387782624,6.390396977444282E-2,1,0,274.13969924042362,1.5671485434913666,5.4674801311814099,1.3868613159265208,1.010868628989287,0.14677257351199843,1.0000000008297922,4.0737999977463952E-5,1.0000000008297922,4.0737999977463952E-5,1.1064907987896468,0.52312638120662769,-5.1522759634787985,-133.22668196063884,46.773318039361158,null,40738,1659584644,null,11.835715055860977,-18.739146271504023,null,-16.987991019339773,-114.48986980460201,-5.1522759634787967,-133.22901607610603,0,0]
[40975.25,40.975250000000003,31.641239619900063,1.5391867388298202,1.0020692067721644,6.4275112556461275E-2,1,0,275.73621307800903,1.5671696642649591,5.498259456953531,1.3879026570486013,1.0109949006585863,0.1476150195962351,1.0000000008394856,4.0975249977067908E-5,1.0000000008394856,4.0975249977067908E-5,1.1076834617310549,0.52586266755136135,-5.2145759479065168,-133.36253577296867,46.63746422703133,null,40975.25,1678971112.5625,null,11.832952966426213,-18.728960556444743,null,-17.047528914332734,-114.63592292541477,-5.2145759479065212,-133.36488348185952,0,0]
[41212.5,41.212499999999999,31.824262482111937,1.5393685871365153,1.0020932127914717,6.4646237607499185E-2,1,0,277.33272703718075,1.5671905418677656,5.5290446786048157,1.3889324030902641,1.0111218896670329,0.1484572546688035,1.0000000008492351,4.1212499976667263E-5,1.0000000008492351,4.1212499976667263E-5,1.1088819700496291,0.52859432740100709,-5.2765979074598572,-133.49864261292541,46.501357387074592,null,41212.5,1698470156.25,null,11.830213100137179,-18.719413167819479,null,-17.106811007597035,-114.78159074742045,-5.2765979074598555,-133.50100391523992,0,0]
[41449.75,41.449750000000002,32.007286384678693,1.5395483557609695,1.0021173568262647,6.5017344826601556E-2,1,0,278.92924111585074,1.5672111804752957,5.5598356981975048,1.3899507444940626,1.0112495957443834,0.14929927761452838,1.0000000008590408,4.1449749976261984E-5,1.0000000008590408,4.1449749976261984E-5,1.1100863085200903,0.53132135299489214,-5.3383455426760182,-133.63499338448864,46.365006615511362,null,41449.75,1718081775.0625,null,11.827494834083121,-18.710493369417911,null,-17.165840376759139,-114.92687491080893,-5.3383455426760182,-133.63736828022684,0,0]
[41687,41.686999999999998,32.190311309854955,1.5397260801649033,1.0021416388665683,6.5388434112842758E-2,1,0,280.52575531197903,1.5672315841680053,5.590632419933212,1.3909578676020455,1.0113780186190071,0.15014108731999928,1.0000000008689029,4.1686999975852028E-5,1.0000000008689029,4.1686999975852028E-5,1.1112964619126231,0.53404373678261574,-5.3998224804882611,-133.77157918602805,46.228420813971951,null,41687,1737805969,null,11.8247975626116,-18.702190654626289,null,-17.224620043099858,-115.07177702056366,-5.3998224804882575,-133.77396767518994,0,0]
[41929.75,41.929749999999999,32.377580213589027,1.5399058449217227,1.0021666266514031,6.5768107434682768E-2,1,0,282.15928049410843,1.5672522218776368,5.6221488846440701,1.3919769169029195,1.0115101602614889,0.15100219023608596,1.0000000008790519,4.1929749975427719E-5,1.0000000008790519,4.1929749975427719E-5,1.1125406722409716,0.53682441955915861,-5.4624481194946757,-133.91156554025702,46.088434459742984,null,41929.75,1758103935.0625,null,11.822058878262514,-18.694323447040329,null,-17.284506997757191,-115.21964449092904,-5.4624481194946775,-133.91396793796937,0,0]
[42172.5,42.172499999999999,32.564850151582775,1.5400835421460892,1.0021917588931764,6.6147761768901164E-2,1,0,283.79280579503023,1.5672726220039401,5.653671122644143,1.39298460375161,1.011643051740702,0.15186306755792778,1.0000000008892598,4.2172499974998464E-5,1.0000000008892598,4.2172499974998464E-5,1.1137909379540583,0.53960022749600001,-5.5247978189324947,-134.05177969620749,45.94822030379251,null,42172.5,1778519756.25,null,11.819340943296947,-18.68708072189003,null,-17.344138762229441,-115.36711528058032,-5.5247978189324947,-134.05419600247035,0,0]
[42415.25,42.41525,32.752121106095132,1.5402592072920605,1.0022170355810207,6.6527397007485736E-2,1,0,285.42633121270489,1.567292788626043,5.6851990379014401,1.3939811151197292,1.0117766927611851,0.15272371809865984,1.0000000008995267,4.2415249974564228E-5,1.0000000008995267,4.2415249974564228E-5,1.1150472427287494,0.54237115318085471,-5.5868752365377645,-134.19221271977358,45.807787280226421,null,42415.25,1799053432.5625,null,11.816643161463903,-18.680451932205546,null,-17.403518398001665,-115.5141910023813,-5.5868752365377627,-134.19464293458685,0,0]
[42658,42.658000000000001,32.939393059788401,1.5404328750079275,1.0022424567040071,6.6907013042457122E-2,1,0,287.0598567451392,1.5673127257302235,5.7167325364853356,1.3949666339434463,1.0119110830259674,0.15358414067338641,1.0000000009098524,4.2657999974125004E-5,1.0000000009098524,4.2657999974125004E-5,1.1163095702405346,0.54513718942641054,-5.648683957234546,-134.33285586957706,45.66714413042294,null,42658,1819704964,null,11.813964953073906,-18.674426757023845,null,-17.462648910308452,-115.66087323591699,-5.648683957234546,-134.33529999294083,0,0]
[42906.5,42.906500000000001,33.131101926671896,1.5406086227675613,1.0022686295711407,6.7295601008338757E-2,1,0,288.73207558415805,1.5673329014127362,5.7490186539046366,1.3959642973343582,1.0120494323461013,0.15446470664479076,1.0000000009204839,4.290649997367017E-5,1.0000000009204839,4.290649997367017E-5,1.1176080197776928,0.54796367274985491,-5.7116820851006134,-134.47703914503654,45.522960854963458,null,42906.5,1840967742.25,null,11.811242992193183,-18.668873550544618,null,-17.522925077293795,-115.81062395585687,-5.7116820851006125,-134.47949750640149,0,0]
[43155,43.155000000000001,33.322811805110241,1.5407823483393146,1.0022949537735288,6.7684168621199151E-2,1,0,290.40429453935417,1.567352844742228,5.7813104295924198,1.3969508167084217,1.0121885661908756,0.15534503121621893,1.0000000009311769,4.3154999973210038E-5,1.0000000009311769,4.3154999973210038E-5,1.1189127461314552,0.55078501773318722,-5.7744060127210766,-134.62142467969034,45.378575320309665,null,43155,1862354025,null,11.808540364525273,-18.663931705151064,null,-17.582946377246351,-115.95996557390545,-5.7744060127210783,-134.62389727905651,0,0]
[43403.5,43.403500000000001,33.514522677744523,1.5409540864147664,1.0023214292992473,6.8072715765310959E-2,1,0,292.076513608732,1.5673725597095391,5.8136077692618651,1.3979263758601053,1.0123284842368161,0.15622511312303439,1.0000000009419319,4.3403499972744572E-5,1.0000000009419319,4.3403499972744572E-5,1.1202237317909065,0.55360121738937507,-5.8368593605713706,-134.76600369307545,45.233996306924553,null,43403.5,1883863812.25,null,11.8058564986727,-18.659590846395783,null,-17.642715859244067,-116.10889968404703,-5.836859360571367,-134.76849053044282,0,0]
[43652,43.652000000000001,33.70623452761069,1.5411238708967065,1.0023480561363056,6.846124232498374E-2,1,0,293.74873279034159,1.567392050214637,5.845910580693733,1.3988911546059994,1.0124691861588053,0.15710495110280145,1.0000000009527485,4.3651999972273747E-5,1.0000000009527485,4.3651999972273747E-5,1.1215409592475127,0.55641226497205343,-5.8990456769548638,-134.91076759615655,45.089232403843454,null,43652,1905497104,null,11.803190839158763,-18.655840822666502,null,-17.702236516113629,-116.25742784885867,-5.8990456769548665,-134.91326867152517,0,0]
[43906,43.905999999999999,33.902190489545809,1.5412954287471696,1.0023754286589988,6.8858346670775256E-2,1,0,295.45796297327189,1.5674117440976743,5.8789339045462636,1.3998663288053301,1.0126138119597514,0.15800400896083119,1.0000000009638683,4.3905999971786935E-5,1.0000000009638683,4.3905999971786935E-5,1.122893772956252,0.55928019774629456,-5.9623360087295199,-135.05891785609461,44.94108214390539,null,43906,1927736836,null,11.800484434208482,-18.652608053934539,null,-17.762820442938001,-116.40882543065663,-5.962336008729519,-135.06143348459116,0,0]
[44160,44.16,34.09814743782492,1.5414650147680131,1.0024029592394921,6.9255429266569135E-2,1,0,297.16719326947708,1.5674312114322824,5.9119627565973047,1.4008306077401813,1.0127592560273817,0.15890280931475675,1.0000000009750527,4.4159999971294444E-5,1.0000000009750527,4.4159999971294444E-5,1.1242530708392058,0.56214273437317475,-6.0253546312626982,-135.20724372673553,44.792756273264473,null,44160,1950105600,null,11.797795925586545,-18.649971803707402,null,-17.823150556849242,-116.55980210465268,-6.0253546312626973,-135.20977390836009,0,0]
[44414,44.414000000000001,34.294105355540104,1.5416326627507426,1.0024306478647629,6.965248998894287E-2,1,0,298.87642367701369,1.567450456105238,5.9449970447071729,1.4017841712258294,1.0129055180092086,0.15980135082364064,1.0000000009863017,4.4413999970796261E-5,1.0000000009863017,4.4413999970796261E-5,1.12561883421333,0.5649998684171067,-6.0881051115960219,-135.35573662573896,44.644263374261044,null,44414,1972603396,null,11.795124768365744,-18.647921915194466,null,-17.883229879961767,-116.71035944529702,-6.0881051115960236,-135.35828136049147,0,0]
[44668,44.667999999999999,34.490064226167576,1.5417984057193459,1.0024584945217152,7.0049528714515183E-2,1,0,300.58565419398258,1.5674694819149126,5.9780366787578192,1.4027271951812452,1.0130525975509672,0.16069963214898933,1.0000000009976151,4.4667999970292352E-5,1.0000000009976151,4.4667999970292352E-5,1.1269910444023554,0.56785159369783866,-6.1505909456632306,-135.50438815973291,44.495611840267088,null,44668,1995230224,null,11.792470432828894,-18.646448449921795,null,-17.943061378492125,-116.86049899769165,-6.1505909456632306,-135.50694744761344,0,0]
[44928.25,44.928249999999998,34.690845890884816,1.5419662848543474,1.0024871902804542,7.0456314149438842E-2,1,0,302.33694266003891,1.5674887527533485,6.0118947486356973,1.4036826717093291,1.0132041437867323,0.16161974559076797,1.0000000010092738,4.4928249969770063E-5,1.0000000010092738,4.4928249969770063E-5,1.1284036867989109,0.57076787315285327,-6.2143434133722835,-135.65685341276318,44.343146587236816,null,44928.25,2018547648.0625,null,11.789767693115383,-18.645526432034949,null,-18.004111106487667,-117.01390117983536,-6.2143434133722835,-135.65942761187031,0,0]
[45188.5,45.188499999999998,34.891628522055868,1.5421322318849984,1.0025160519156369,7.0863076229613436E-2,1,0,304.08823123707953,1.5675078016246402,6.0457582455079901,1.4046274454629706,1.0133565475530009,0.16253958305015712,1.0000000010210002,4.5188499969241689E-5,1.0000000010210002,4.5188499969241689E-5,1.1298230575086496,0.57367846206826389,-6.2778252599580195,-135.80946795199276,44.190532048007242,null,45188.5,2042000532.25,null,11.787081534040373,-18.645189107546706,null,-18.064906793998389,-117.16686795477979,-6.277825259958016,-135.81205706232649,0,0]
[45448.75,45.448749999999997,35.092412103091917,1.542296279966072,1.0025450794129374,7.126981482245992E-2,1,0,305.83951992319766,1.5675266323418373,6.0796270786896915,1.4055616936127218,1.0135098084629268,0.163459143095459,1.0000000010327943,4.5448749968707189E-5,1.0000000010327943,4.5448749968707189E-5,1.1312491364712989,0.57658335461784282,-6.341040025118204,-135.96222333614477,44.037776663855226,null,45448.75,2065588876.5625,null,11.784411432302306,-18.645426461773592,null,-18.125451457420514,-117.31940089593152,-6.3410400251182075,-135.9648273577051,0,0]
[45709,45.709000000000003,35.293196617781575,1.5424584614982804,1.0025742727579494,7.1676529795445559E-2,1,0,307.59080871653038,1.5675452486311514,6.1135011594912445,1.4064855894768504,1.0136639261277223,0.16437842429771593,1.0000000010446564,4.5708999968166536E-5,1.0000000010446564,4.5708999968166536E-5,1.1326819036385598,0.57948254524825782,-6.4039911778120198,-136.11511131227192,43.884888687728079,null,45709,2089312681,null,11.781756879269054,-18.646228695933271,null,-18.185748057081071,-117.47150154912562,-6.4039911778120171,-136.11773024505888,0,0]
[45975.25,45.975250000000003,35.498611119942694,1.5426224835108899,1.0026043107604263,7.2092596901386363E-2,1,0,309.38247315305534,1.5675640760114198,6.1481615389665567,1.4074202492975652,1.0138224831410412,0.1653186092555371,1.0000000010568617,4.597524996760701E-5,1.0000000010568617,4.597524996760701E-5,1.1341546032836991,0.58244266988234061,-6.4681244002272873,-136.27165288218646,43.728347117813541,null,45975.25,2113723612.5625,null,11.779056701187541,-18.647623992400963,null,-18.247181101414828,-117.6266630775737,-6.4681244002272873,-136.27428706997466,0,0]
[46241.5,46.241500000000002,35.704026566141728,1.5427846181969977,1.0026345223151598,7.2508639005335121E-2,1,0,311.17413769798435,1.567582686584797,6.1828272291870023,1.4083444290728211,1.0139819360397375,0.16625849934792408,1.0000000010691381,4.6241499967040966E-5,1.0000000010691381,4.6241499967040966E-5,1.1356342606708376,0.58539681576027669,-6.5319888411690021,-136.42831633698177,43.571683663018234,null,46241.5,2138276322.25,null,11.776371764995844,-18.649590434578464,null,-18.308360606164843,-117.78137534519281,-6.5319888411689995,-136.43096577977127,0,0]
[46507.75,46.507750000000001,35.909442940177932,1.5429448979367923,1.0026649074064617,7.292465596553209E-2,1,0,312.96580234945566,1.5676010840747945,6.2174981413223289,1.409258302531603,1.0141422844012336,0.16719809305376943,1.0000000010814853,4.6507749966468363E-5,1.0000000010814853,4.6507749966468363E-5,1.1371208543789644,0.58834497780806772,-6.5955879967143671,-136.58509342156054,43.414906578439457,null,46507.75,2162970810.0625,null,11.773701570658663,-18.652118194716611,null,-18.369289567373034,-117.93563992463471,-6.5955879967143716,-136.58775811935132,0,0]
[46774,46.774000000000001,36.114860226219072,1.5431033543741492,1.0026954660185561,7.3340647640269457E-2,1,0,314.75746710564977,1.5676192721201436,6.2521741884994526,1.41016203961846,1.0143035278008452,0.168137388855018,1.0000000010939034,4.6773999965889173E-5,1.0000000010939034,4.6773999965889173E-5,1.1386143630050125,0.59128715124090603,-6.6589252930008165,-136.74197606735356,43.258023932646438,null,46774,2187807076,null,11.771045632199947,-18.655197657215769,null,-18.429970925200763,-118.08945836292985,-6.6589252930008165,-136.74465602014561,0,0]
[47046.25,47.046250000000001,36.324907561144741,1.5432635284804541,1.0027268926892454,7.3765987481102899E-2,1,0,316.58950751208249,1.5676376571639095,6.2876368891381809,1.4110758342221283,1.0144693299300787,0.16909754225700052,1.0000000011066748,4.7046249965290067E-5,1.0000000011066748,4.7046249965290067E-5,1.1401486563027363,0.59428942992144651,-6.7234226293253858,-136.90249503751875,43.097504962481253,null,47046.25,2213349639.0625,null,11.768344090937063,-18.658907206120652,null,-18.491766720262451,-118.24628338296611,-6.7234226293253876,-136.90519058908677,0,0]
[47318.5,47.3185,36.53495581729706,1.54342186083179,1.0027585007558582,7.4191300584504821E-2,1,0,318.42154802429422,1.5676558306507362,6.3231047811885901,1.4119793781636907,1.0146360669869072,0.17005738097597575,1.0000000011195203,4.7318499964683989E-5,1.0000000011195203,4.7318499964683989E-5,1.1416901344893151,0.59728543783252241,-6.7876532003470782,-137.06310789456282,42.936892105437181,null,47318.5,2239040442.25,null,11.765656470634131,-18.663173923374131,null,-18.553309670981207,-118.40264512153264,-6.7876532003470764,-137.06581904490679,0,0]
[47590.75,47.59075,36.745004978877795,1.5435783830047756,1.0027902902012413,7.4616586799140003E-2,1,0,320.25358864046956,1.5676737962113054,6.3585777777782218,1.412872841513408,1.014803738510492,0.17101690339891287,1.0000000011324397,4.7590749964070897E-5,1.0000000011324397,4.7590749964070897E-5,1.1432387747477453,0.60027517078013948,-6.851620453555805,-137.22380658736,42.776193412639998,null,47590.75,2264879485.5625,null,11.762982294374755,-18.667988180270871,null,-18.614602747930562,-118.55854515620904,-6.8516204535558067,-137.22653333647992,0,0]
[47863,47.863,36.955055030447824,1.5437331258584723,1.0028222610081461,7.5041845973731272E-2,1,0,322.08562935883452,1.5676915573936931,6.3940557939500584,1.4137563906321333,1.0149723440377159,0.17197610791617363,1.0000000011454333,4.7862999963450744E-5,1.0000000011454333,4.7862999963450744E-5,1.1447945542857714,0.60325862487536619,-6.9153277674326148,-137.38458324914205,42.615416750857946,null,47863,2290866769,null,11.760321098688438,-18.673340556100431,null,-18.675648866121051,-118.71398504093753,-6.915327767432613,-137.38732559703797,0,0]
[48141.75,48.141750000000002,37.170120957468207,1.5438897511619618,1.0028551830118722,7.5477230085878103E-2,1,0,323.96141036370767,1.5677095344916812,6.4303859658407667,1.4146509324217866,1.0151459422742235,0.17295788249261462,1.0000000011588139,4.814174996280844E-5,1.0000000011588139,4.814174996280844E-5,1.1463948514542766,0.60630680003128534,-6.9802902358349037,-137.5492712289051,42.450728771094902,null,48141.75,2317628093.0625,null,11.757609345429444,-18.679368638468016,null,-18.737899581264351,-118.87266090953148,-6.9802902358349073,-137.5520295479995,0,0]
[48420.5,48.420499999999997,37.385187785835797,1.5440445744235765,1.0028882951036482,7.5912585530626991E-2,1,0,325.83719147207188,1.5677273046083866,6.4667212255397013,1.415535422396927,1.0153205186557925,0.17393932039793386,1.0000000011722723,4.8420499962158656E-5,1.0000000011722723,4.8420499962158656E-5,1.1480025846014161,0.60934838565573368,-7.044987158388528,-137.71402482701265,42.285975172987349,null,48420.5,2344544820.25,null,11.75491025794123,-18.685941498395984,null,-18.799897416329756,-119.03085761890961,-7.0449871583885262,-137.71679911730558,0,0]
[48699.25,48.699249999999999,37.600255500083939,1.5441976265580415,1.0029215972646464,7.6347912145795907E-2,1,0,327.71297268215011,1.5677448712979902,6.5030614877638753,1.4164100276758846,1.0154960726779565,0.17492041991557286,1.0000000011858083,4.8699249961501343E-5,1.0000000011858083,4.8699249961501343E-5,1.1496177293519676,0.61238337854992897,-7.1094219477469389,-137.87883617087672,42.121163829123276,null,48699.25,2371616950.5625,null,11.75222337974281,-18.693049665997318,null,-18.86164532748975,-119.18857676637083,-7.1094219477469398,-137.88162643236814,0,0]
[48978,48.978000000000002,37.815324085097814,1.5443489377771289,1.0029550894759331,7.6783209769268071E-2,1,0,329.58875399220574,1.5677622380337621,6.5394066691144044,1.4172749117229615,1.0156726038337744,0.17590117933276242,1.0000000011994221,4.897799996083646E-5,1.0000000011994221,4.897799996083646E-5,1.1512402613633697,0.615411775837717,-7.1735979481210794,-138.04369757105599,41.956302428944014,null,48978,2398844484,null,11.74954826727838,-18.700683876326664,null,-18.923146215399459,-119.34581992741929,-7.1735979481210794,-138.04650380374596,0,0]
[49263.25,49.263249999999999,38.035408608367426,1.544502005850986,1.0029895594011129,7.7228627647891665E-2,1,0,331.50827559597565,1.5677798062728376,6.5766043688562279,1.4181500663808704,1.0158542624567632,0.1769044546045348,1.0000000012134338,4.9263249960148207E-5,1.0000000012134338,4.9263249960148207E-5,1.1529082504988701,0.61850395969793581,-7.2390059370718216,-138.21244725873765,41.787552741262346,null,49263.25,2426867800.5625,null,11.746822506335175,-18.709031232731707,null,-18.985828443406994,-119.506238602317,-7.2390059370718198,-138.2152698350487,0,0]
[49548.5,49.548499999999997,38.255494012546627,1.5446533127147155,1.0030242283027992,7.7674014823695972E-2,1,0,333.42779730088529,1.5677971722335453,6.6138070489300516,1.419015376201334,1.0160369432330738,0.17790737011297877,1.000000001227527,4.9548499959451925E-5,1.000000001227527,4.9548499959451925E-5,1.154583923963967,0.6215892316944992,-7.3041498007864236,-138.38123364005671,41.618766359943294,null,49548.5,2455053852.25,null,11.744108166081977,-18.717910454155856,null,-19.048257966868402,-119.66616210583294,-7.3041498007864245,-138.38407255998879,0,0]
[49833.75,49.833750000000002,38.475580282518656,1.5448028885845129,1.0030590961603603,7.8119371123171091E-2,1,0,335.34731910519776,1.5678143393893873,6.6510146257629001,1.419871005101597,1.0162206456114649,0.1789099240351151,1.0000000012417012,4.9833749958747578E-5,1.0000000012417012,4.9833749958747578E-5,1.156267255788092,0.62466758977347236,-7.3690329114544708,-138.55004904133477,41.449950958665227,null,49833.75,2483402639.0625,null,11.741404810523628,-18.727312243400796,null,-19.110437721978098,-119.8255920614872,-7.3690329114544699,-138.55290430488799,0,0]
[50119,50.119,38.695667403510612,1.5449507629894508,1.0030941629530483,7.8564696372880133E-2,1,0,337.26684100721582,1.5678313111347899,6.6882270176306315,1.4207171134082721,1.016405369038011,0.17991211455218617,1.0000000012559571,5.011899995803512E-5,1.0000000012559571,5.011899995803512E-5,1.1579582200422796,0.62773903222041749,-7.4336585735421128,-138.71888597041126,41.281114029588736,null,50119,2511914161,null,11.738712016060459,-18.737227504707437,null,-19.172370589602572,-119.98453007287809,-7.4336585735421128,-138.72175757758552,0,0]
[50410.75,50.41075,38.920770521375616,1.5451002770273918,1.0031302345784965,7.9020136962112977E-2,1,0,339.23010320967353,1.5678484709329055,6.7262922669175289,1.4215728169712976,1.016595357395687,0.18093676420151492,1.0000000012706218,5.0410749957297998E-5,1.0000000012706218,5.0410749957297998E-5,1.1596955846594632,0.63087330847277723,-7.4994939223596333,-138.891584837143,41.108415162857,null,50410.75,2541243715.5625,null,11.735968356680456,-18.747890586439368,null,-19.235462279040089,-120.14658257392156,-7.4994939223596333,-138.89447316036092,0,0]
[50702.5,50.702500000000001,39.145874499286698,1.5452480715410626,1.0031665142643784,7.9475544703632425E-2,1,0,341.19336551087099,1.5678654332524808,6.7643623859546294,1.4224188892759926,1.0167864126843282,0.18196102986029236,1.0000000012853716,5.070249995655229E-5,1.0000000012853716,5.070249995655229E-5,1.1614408787835795,0.63400034777249403,-7.5650667387232531,-139.06429093231247,40.935709067687526,null,50702.5,2570743506.25,null,11.733234886801053,-18.759072182900763,null,-19.298301625524307,-120.30812378867334,-7.5650667387232531,-139.06719597157411,0,0]
[50994.25,50.994250000000001,39.370979322491877,1.5453941760182537,1.0032030019881213,7.9930919412112805E-2,1,0,343.15662790911335,1.5678822014829394,6.8024372929806676,1.4232554908263044,1.0169785343026161,0.18298490959638714,1.0000000013002066,5.0994249955797949E-5,1.0000000013002066,5.0994249955797949E-5,1.1631940748166143,0.63712014936358619,-7.6303803493333913,-139.23699680004751,40.763003199952493,null,50994.25,2600413533.0625,null,11.73051119083719,-18.770763181389533,null,-19.360891540170581,-120.46915537396322,-7.6303803493333913,-139.23991855535274,0,0]
[51286,51.286000000000001,{"$f":"SQRT(1+(A461/pole1)^2)","v":39.596084976574609},{"$f":"ATAN(A461/pole1)","v":1.5455386192764908},{"$f":"SQRT(1+(A461/Zero1)^2)","v":1.0032396977270259},{"$f":"ATAN(A461/Zero1)","v":8.0386260902310103E-2},{"$f":"IF(VIN_nom>Vout, 1, SQRT(1+(A461/z_RHP)^2))","v":1},{"$f":"IF(VIN_nom>Vout, 0, -ATAN(A461/z_RHP))","v":0},{"$f":"SQRT(1+(A461/Pole2)^2)","v":345.1198904027446},{"$f":"ATAN(A461/Pole2)","v":1.5678987789365808},6.8405169080445631,1.4240827786059296,{"$f":"SQRT(1+(A461/pole4)^2)","v":1.017171721646331},{"$f":"ATAN(A461/pole4)","v":0.18400840148236014},{"$f":"SQRT(1+(A461/Zero3)^2)","v":1.0000000013151269},{"$f":"ATAN(A461/Zero3)","v":5.1285999955034941E-5},{"$f":"SQRT(1+(A461/pole5)^2)","v":1.0000000013151269},{"$f":"ATAN(A461/pole5)","v":5.1285999955034941E-5},{"$f":"SQRT((1-(Z461/pterm2))^2+(A461/pterm1)^2)","v":1.1649551452121609},{"$f":"IF((ATAN((A461/pterm1)/(1-A461^2/pterm2))>0),ATAN((A461/pterm1)/(1-A461^2/pterm2)),PI()+ATAN((A461/pterm1)/(1-A461^2/pterm2)))","v":0.64023271284551653},{"$f":"20*LOG10(((E461*K461*G461*O461)/(C461*I461*S461*M461*Q461))*Adc)","v":-7.6954380140256209},{"$f":"((F461+L461+H461+R461)-(D461+J461+T461+N461))*radconv","v":-139.40969516397854},{"$f":"IF(V461>0,V461,V461+180)","v":40.59030483602146},null,{"$f":"IF(U461<0,A461,1000000000)","v":51286},{"$f":"A461^2","v":2630253796},null,{"$f":"20*LOG10((K461/(I461*M461))*AEA*Afb)","v":11.727796865065612},{"$f":"(L461-(J461+N461))*radconv","v":-18.78295466674906},null,{"$f":"20*LOG10((E461*G461/(C461*S461))*Am)","v":-19.423234879091233},{"$f":"(F461+H461-(D461+T461))*radconv","v":-120.62967896857838},-7.6954380140256209,-139.41263363532744,0,0]
[51584.75,{"$f":"A462/1000","v":51.58475},39.826592469517756,1.5456848361162701,1.0032774894497083,8.0852492850048072E-2,1,0,347.13025783485551,1.5679155598189061,6.879514969996932,1.4249204243506735,1.0173706479151126,0.18505604622860958,1.0000000013304933,5.1584749954244559E-5,1.0000000013304933,5.1584749954244559E-5,1.1667666005316144,0.64341245577460082,-7.7617947223153543,-139.58652191199516,40.413478088004837,null,51584.75,2660986432.5625,null,11.725026714540178,-18.795948196985872,null,-19.486821436855532,-120.79352930347225,{"$f":"AB462+AE462","v":-7.7617947223153543},-139.58947750045812,{"$f":"SUM((U463<0)*(U462>0))*A462","v":0},0]
[51883.5,51.883499999999998,40.057100804128623,1.5458293701513404,1.0033154992405982,8.1318689573482303E-2,1,0,349.14062536359194,1.5679321474510755,6.918517804544229,1.425748626290269,1.0175706903714326,0.18610328021455946,1.0000000013459487,5.1883499953444974E-5,1.0000000013459487,5.1883499953444974E-5,1.1685862543189689,0.64658460937223572,-7.8278897661545859,-139.76332590687434,40.236674093125657,null,51883.5,2691897572.25,null,11.722265568873011,-18.809448210150943,null,-19.550155335027593,-120.95685040230052,-7.8278897661545823,-139.76629861245146,0,0]
[52182.25,52.182250000000003,40.287609965960236,1.5459722502605631,1.0033537270749127,8.1784850873981754E-2,1,0,351.15099298729433,1.5679485451521979,6.9575253314231205,1.4265675421196329,1.0177718483571332,0.18715010138609298,1.0000000013614936,5.2182249952636133E-5,1.0000000013614936,5.2182249952636133E-5,1.1704140771749147,0.64974917434026802,-7.8937264386567199,-139.94009989207217,40.059900107927831,null,52182.25,2722987215.0625,null,11.719513030742227,-18.82344574346978,null,-19.613239469398948,-121.11964397129361,-7.8937264386567207,-139.9430897147634,0,0]
[52481,52.481000000000002,40.51811994089433,1.5461135046658994,1.00339217292773,8.2250976553007102E-2,1,0,353.16136070434078,1.5679647561658063,6.9965374721506768,1.4273773260669618,1.0179741212109077,0.18819650769433147,1.0000000013771275,5.2480999951817975E-5,1.0000000013771275,5.2480999951817975E-5,1.1722500397632762,0.65290615175326239,-7.959307966618149,-140.11683678935529,39.88316321064471,null,52481,2754255361,null,11.71676871422938,-18.837932028766264,null,-19.676076680847526,-121.2819117003943,-7.9593079666181463,-140.11984372916058,0,0]
[52786.5,52.786499999999997,40.753838917485666,1.5462562981141215,1.003431712868567,8.2727596897345365E-2,1,0,355.21715105046013,1.567981143693743,7.036435750170984,1.4281961198467525,1.0181821164908622,0.18926612549686189,1.0000000013932073,5.2786499950971639E-5,1.0000000013932073,5.2786499950971639E-5,1.1741358715284043,0.65612661322520693,-8.0261106905249839,-140.29752135798356,39.702478642016445,null,52786.5,2786414582.25,null,11.713970504047362,-18.853242122874658,null,-19.740081194572344,-121.4473036787748,-8.0261106905249822,-140.30054580164946,0,0]
[53092,53.091999999999999,40.989558715489167,1.5463974492326673,1.0034714807379346,8.3204179572732004E-2,1,0,357.27294149087561,1.5679973426301654,7.0763386923838096,1.4290056799309923,1.0183912761782898,0.19033530516077113,1.0000000014093802,5.3091999950115457E-5,1.0000000014093802,5.3091999950115457E-5,1.1760301531637314,0.65933914384606551,-8.0926532297919387,-140.47815272482222,39.521847275177777,null,53092,2818760464,null,11.711180109871314,-18.869045359776351,null,-19.803833339663253,-121.61214931257243,-8.0926532297919387,-140.48119467234878,0,0]
[53397.5,53.397500000000001,41.225279320814714,1.5465369861877243,1.0035114765087354,8.3680724367164824E-2,1,0,359.32873202396877,1.5680133562119727,7.1162462203285468,1.4298061605957149,1.0186015995558924,0.19140404451226237,1.0000000014256465,5.3397499949249362E-5,1.0000000014256465,5.3397499949249362E-5,1.1779328535141569,0.66254374594418775,-8.1589388305757069,-140.65872387077209,39.341276129227907,null,53397.5,2851293006.25,null,11.708397153626963,-18.885332961016967,null,-19.867335984202668,-121.7764503611423,-8.1589388305757051,-140.66178332215927,0,0]
[53703,53.703000000000003,41.461000719692564,1.5466749365051935,1.0035517001537206,8.4157231068744121E-2,1,0,361.384522648158,1.5680291876024102,7.1561582572858642,1.4305977127223177,1.0188130859029745,0.19247234138335226,1.0000000014420061,5.3702999948373292E-5,1.0000000014420061,5.3702999948373292E-5,1.1798439415002633,0.66574042223532248,-8.2249706736312707,-140.83922795285005,39.160772047149948,null,53703,2884012209,null,11.705621268141908,-18.902096338753541,null,-19.93059194177318,-121.94020856934425,-8.2249706736312724,-140.84230490809779,0,0]
[54015.75,54.015749999999997,41.702316969562432,1.5468145451238529,1.0035931143911276,8.4645006350118915E-2,1,0,363.4891005403037,1.5680452091961681,7.1970220627120884,1.4313989548158674,1.0190307950964395,0.19356553002162963,1.0000000014588506,5.4015749947466063E-5,1.0000000014588506,5.4015749947466063E-5,1.1818090388456912,0.66900475378990132,-8.2923099488643022,-141.02393924903382,38.976060750966184,null,54015.75,2917701248.0625,null,11.702786458654408,-18.919741613333432,null,-19.995096407518712,-122.10729251020315,-8.2923099488643039,-141.02703412353659,0,0]
[54328.5,54.328499999999998,41.943634022881412,1.5469525473063801,1.0036347673884114,8.5132741260087408E-2,1,0,365.59367852467972,1.5680610463299927,{"$f":"SQRT(1+(A471/Zero2)^2)","v":7.2378904363728571},{"$f":"ATAN(A471/Zero2)","v":1.4321911490692165},1.0192497215731831,0.19465825034940992,1.0000000014757928,5.4328499946548257E-5,1.0000000014757928,5.4328499946548257E-5,1.1837828609872239,0.67226078587166271,-8.359389822580269,-141.20856629362024,38.791433706379763,null,54328.5,2951585912.25,null,11.69995831423379,-18.937867889980414,null,-20.059348136814059,-122.27381119739758,-8.359389822580269,-141.211679087378,0,0]
[54641.25,54.641249999999999,42.184951865861223,1.5470889706161928,1.0036766591158457,8.562043557164041E-2,1,0,367.69825659970235,1.5680767021712312,7.2787633013198034,1.4329744469001755,1.0194698645489877,0.19575050005974129,1.000000001492833,5.4641249945619819E-5,1.000000001492833,5.4641249945619819E-5,1.185765374836705,0.67550852262270233,-8.4262135051187226,-141.39310228990354,38.606897710096462,null,54641.25,2985666201.5625,null,11.697136474146371,-18.956466542390032,null,-20.123349979265093,-122.43976646052624,-8.4262135051187226,-141.39623300291629,0,0]
[54954,54.954000000000001,42.426270485027246,1.5472238419898288,1.0037187895435395,8.6108089057883808E-2,1,0,369.80283476382397,1.5680921798151288,7.3196405823149195,1.4337489963883496,1.0196912232359563,0.19684227685215008,1.000000001509971,5.4953999944680701E-5,1.000000001509971,5.4953999944680701E-5,1.1877565473960079,0.67874796858813302,-8.4927841420468351,-141.57754061585013,38.422459384149874,null,54954,3019942116,null,11.694320588126629,-18.975529131762915,null,-20.187104730173466,-122.60516011635497,-8.4927841420468368,-141.58068924811789,0,0]
[55274,55.274000000000001,42.673184010514198,1.5473602610176236,1.0037621436490136,8.6607004568992119E-2,1,0,371.95620020224993,1.5681078349667674,7.3614699522121718,1.4345325972146514,1.0199189708244218,0.19795887073692159,1.0000000015276074,5.5273999943708684E-5,1.0000000015276074,5.5273999943708684E-5,1.1898028060284958,0.68205393347951082,-8.5606392853774214,-141.7661466693024,38.233853330697599,null,55274,3055215076,null,11.691445233753416,-18.995505202759738,null,-20.252084519130836,-122.77380843345986,-8.5606392853774196,-141.76931363621961,0,{"$f":"IF(AI474>0,W474,0)","v":0}]
[55594,55.594000000000001,42.920098321018216,1.5474951104424508,1.0038057475860169,8.7105876859865913E-2,1,0,374.10956573078693,1.5681233098970684,7.4033037911943609,1.4353073427278862,1.0201479894607031,0.19907496467208738,1.0000000015453463,5.5593999942725343E-5,1.0000000015453463,5.5593999942725343E-5,1.1918580598701831,0.68535122963955819,-8.6282359771303323,-141.95463698688769,38.045363013112308,null,55594,3090692836,null,11.688575402895427,-19.015949674897701,null,-20.316811380025758,-122.94187261355661,-8.6282359771303305,-141.95782228845431,0,0]
[55914,55.914000000000001,43.167013403068474,1.5476284171937249,1.0038496013219937,8.7604705687841261E-2,1,0,376.26293134788773,1.568138607700263,7.4451420239268682,1.4360733812782871,1.0203782782889594,0.20019055621466092,1.0000000015631876,5.5913999941730618E-5,1.0000000015631876,5.5913999941730618E-5,1.1939222738778721,0.68863986320995807,-8.6955773868054607,-142.14300501481523,37.85699498518477,null,55914,3126375396,null,11.685710752181178,-19.036854085648123,null,-20.38128813898664,-123.10935456538309,-8.6955773868054624,-142.1462086510312,0,0]
[56234,56.234000000000002,43.41392924350054,1.5477602075884405,1.0038937048242076,8.8103490810382976E-2,1,0,378.41629705204048,1.5681537314001521,7.4869845767511682,1.4368308579411435,1.0206098364493785,0.20130564292885664,1.0000000015811312,5.6233999940724435E-5,1.0000000015811312,5.6233999940724435E-5,1.1959954131141404,0.69191984074916701,-8.7626666199090799,-142.33124437209477,37.668755627905227,null,56234,3162262756,null,11.682850948268339,-19.058210156499999,null,-20.445517568177422,-123.2762561864602,-8.7626666199090835,-142.33446634296021,0,0]
[56561.5,56.561500000000002,43.666632945769855,1.5478935435758321,1.0039391005835856,8.8613920702323032E-2,1,0,380.62013235347888,1.5681690323733861,7.5298122124103264,1.4375973707659644,1.0208481351585517,0.20244633923880351,1.0000000015996016,5.6561499939682754E-5,1.0000000015996016,5.6561499939682754E-5,1.1981263466637004,0.69526773731446556,-8.8310703207115928,-142.52375587782419,37.476244122175814,null,56561.5,3199203282.25,null,11.679928798557981,-19.080525972175469,null,-20.510999119269574,-123.4464706408819,-8.8310703207115928,-142.52699661305738,0,0]
[56889,56.889000000000003,43.919337415432089,1.5480253451799202,1.0039847578842329,8.9124304302516832E-2,1,0,382.8239677430019,1.5681841571777879,7.5726442221068231,1.4383552130092223,1.0210877615621359,0.20358650164004108,1.0000000016181791,5.6888999938628936E-5,1.0000000016181791,5.6888999938628936E-5,1.200266555015016,0.69860658255232833,-8.8992162691457679,-142.7161196226098,37.283880377390204,null,56889,3236358321,null,11.677011049783147,-19.103297891134677,null,-20.576227318928911,-123.61608123107611,-8.8992162691457644,-142.7193791222108,0,0]
[57216.5,57.216500000000003,44.172042639316679,1.5481556387303905,1.0040306766904694,8.9634641351396774E-2,1,0,385.02780321909717,1.5681991088384346,7.615480532037509,1.4391045301064345,1.0213287147256112,0.20472612754506295,1.000000001636864,5.7216499937562915E-5,1.000000001636864,5.7216499937562915E-5,1.2024160010712246,0.70193638480832132,-8.9671075965556479,-142.90832930029907,37.091670699700927,null,57216.5,3273727872.25,null,11.674097375123138,-19.126517605607251,null,-20.641204971678789,-123.78508995866052,-8.9671075965556515,-142.91160756426777,0,0]
[57544,57.543999999999997,44.424748604552676,1.5482844499580406,1.0040768569664174,9.0144931589539498E-2,1,0,387.23163878028646,1.5682138903115372,7.6583210700431641,1.4398454642776475,1.021570993710168,0.20586521437437139,1.0000000016556558,5.7543999936484628E-5,1.0000000016556558,5.7543999936484628E-5,1.2045746478587751,0.70525715285768942,-9.0347473710161008,-143.10037877578202,36.899621224217981,null,57544,3311311936,null,11.671187457374872,-19.150176988568838,null,-20.705934828390973,-123.95349881554958,-9.0347473710161008,-143.10367580411841,0,0]
[57879,57.878999999999998,44.683242483197141,1.5484147036446783,1.0041243652883851,9.06668591623562E-2,1,0,389.48594394467784,1.5682288372250806,7.7021469899438282,1.4405948383068314,1.0218201917974306,0.20702982674593354,1.0000000016749893,5.7878999935368865E-5,1.0000000016749893,5.7878999935368865E-5,1.2067922100909878,0.70864463171092817,-9.1036790217762906,-143.2966543623501,36.703345637649903,null,57879,3349978641,null,11.668214466301814,-19.174824788170067,null,-20.771893488078103,-124.12514579660257,-9.1036790217762888,-143.29997058477264,0,0]
[58214,58.213999999999999,44.941737111217748,1.5485434589544473,1.0041721471163303,9.1188737207249515E-2,1,0,391.74024919508281,1.5682436121118528,7.7459771861284326,1.4413357321627069,1.0220707751249587,0.20819386963454414,1.0000000016944348,5.8213999934240111E-5,1.0000000016944348,5.8213999934240111E-5,1.2090193214310105,0.71202267775968098,-9.1723537643458766,-143.49274986886476,36.507250131135237,null,58214,3388869796,null,11.665244764241811,-19.199915980534335,null,-20.837598528587687,-124.29616930483911,-9.1723537643458766,-143.49608528537345,0,0]
[58549,58.548999999999999,45.200232475757701,1.5486707415902201,1.0042202024112117,9.1710565447035625E-2,1,0,393.99455453002508,1.5682582179246871,7.78981158641409,1.44206828818244,1.0223227426741364,0.20935734030558215,1.0000000017139927,5.8548999933098293E-5,1.0000000017139927,5.8548999933098293E-5,1.2112559427181033,0.71539130174639098,-9.2407746873976588,-143.68865925655405,36.311340743445953,null,58549,3427985401,null,11.662278040903205,-19.225442422845386,null,-20.903052728300864,-124.46657144430343,-9.2407746873976588,-143.6920138671488,0,0]
[58884,58.884,45.458728564252645,1.5487965766704355,1.0042685311337725,9.2232343604692152E-2,1,0,396.24885994806175,1.5682726575492203,7.8336501202267073,1.4427926455532738,1.0225760934217274,0.2105202360333111,1.0000000017336628,5.8883999931943336E-5,1.0000000017336628,5.8883999931943336E-5,1.2135020349338801,0.71875051485363128,-9.3089448172014482,-143.88437665550498,36.11562334449502,null,58884,3467325456,null,11.659313995197644,-19.251396149423247,null,-20.968258812399093,-124.63635431076253,-9.3089448172014482,-143.88775046018577,0,0]
[59227,59.226999999999997,45.723398430937806,1.5489239425824055,1.0043182972339253,9.2766529956727128E-2,1,0,398.55699960995724,1.5682872727569428,7.8785397551102907,1.4435259484833276,1.0228369264031976,0.21171030386578246,1.0000000017539188,5.9226999930747102E-5,1.0000000017539188,5.9226999930747102E-5,1.2158115374614984,0.72218020943932792,-9.3784861386356813,-144.08456302468275,35.915436975317249,null,59227,3507837529,null,11.65628163552846,-19.278404240311534,null,-21.034767774164141,-124.80955224150433,-9.3784861386356813,-144.08795648181587,0,0]
[59570,59.57,45.988069030813826,1.5490498424634451,1.0043683498929363,9.3300663218853511E-2,1,0,400.86513935600578,1.5683017196589788,7.9234335785410908,1.444250942075769,1.0230992072493499,0.21289976321255832,1.0000000017742925,5.9569999929536936E-5,1.0000000017742925,5.9569999929536936E-5,1.2181308863412417,0.72560006341110184,-9.4477707728721452,-144.28453619576544,35.71546380423456,null,59570,3548584900,null,11.653251472352151,-19.30584391430833,null,-21.101022245224293,-124.98210539104261,-9.4477707728721416,-144.28794930535093,0,0]
[59913,59.912999999999997,46.252740351294136,1.549174301476665,1.0044186890679661,9.3834743094256309E-2,1,0,403.17327918476218,1.5683160011459383,7.9683315197238995,1.4449677660200162,1.0233629348469508,0.21408861117706363,1.0000000017947837,5.9912999928312749E-5,1.0000000017947837,5.9912999928312749E-5,1.2204600401671668,0.7290100901566452,-9.5168017752127945,-144.48429039060176,35.515709609398243,null,59913,3589567569,null,11.650223210532772,-19.3337071674577,null,-21.16702498574557,-125.15401598518181,-9.516801775212798,-144.48772315263952,0,0]
[60256,60.256,46.517412380078639,1.5492973442126703,1.004469314715938,9.4368769286301724E-2,1,0,405.48141909481393,1.5683301200426143,8.0132335094437401,1.4456765569085153,1.0236281080777774,0.21527684487261287,1.0000000018153927,6.0255999927074462E-5,1.0000000018153927,6.0255999927074462E-5,1.2227989576971756,0.73241030351408054,-9.5855821391964362,-144.68381999827446,35.316180001725542,null,60256,3630785536,null,11.647196563774585,-19.361986170042801,null,-21.232778702971022,-125.32528624272177,-9.5855821391964362,-144.68727241276457,0,0]
[60607,60.606999999999999,46.788258238142596,1.5494218156104156,1.0045214176650887,9.4915195014353221E-2,1,0,407.84339325458564,1.5683444028002249,8.0591868965695763,1.4463937024296578,1.0239009615376486,0.21649215354581841,1.0000000018366042,6.0606999925792613E-5,1.0000000018366042,6.0606999925792613E-5,1.2252024923322629,0.73587967765783735,-9.6557102947468252,-144.88776516925725,35.11223483074275,null,60607,3673208449,null,11.644100706951246,-19.391347157929399,null,-21.299811001698075,-125.49989053663653,-9.6557102947468287,-144.89123769456592,0,0]
[60958,60.957999999999998,47.059104812758875,1.5495448542309151,1.004573820514161,9.5461563897739438E-2,1,0,410.20536749659811,1.5683585210767845,8.1051443815160233,1.4471027156488627,1.0241753264667355,0.21770681287748622,1.0000000018579389,6.0957999924495844E-5,1.0000000018579389,6.0957999924495844E-5,1.2276161645813923,0.73933880603697033,-9.7255821354807033,-145.09146378401837,34.908536215981627,null,60958,3715877764,null,11.641005961906137,-19.42112746379561,null,-21.366588097386838,-125.67382895634998,-9.7255821354807015,-145.09495642014559,0,0]
[61309,61.308999999999997,47.329952091626005,1.5496664846677626,1.0046265232162253,9.6007875619178409E-2,1,0,412.56734181943887,1.5683724776972809,8.1511058949702022,1.4478037334136424,1.0244512016506491,0.21892081980656494,1.0000000018793966,6.1308999923184051E-5,1.0000000018793966,6.1308999923184051E-5,1.2300399307929337,0.74278770489146384,-9.7952006787068537,-145.29491034601793,34.705089653982071,null,61309,3758793481,null,11.637912048723742,-19.451319233331095,null,-21.433112727430593,-125.84710385963267,-9.795200678706852,-145.29842309296376,0,0]
[61660,61.66,47.600800062722492,1.5497867309549713,1.0046795257240928,9.6554129861591023E-2,1,0,414.9293162217275,1.5683862754223774,8.1970713691677979,1.4484968895338319,1.0247285858696267,0.22013417128298268,1.0000000019009778,6.1659999921857147E-5,1.0000000019009778,6.1659999921857147E-5,1.2324737475022758,0.74622639091890908,-9.8645688807610448,-145.49809952385172,34.501900476148279,null,61660,3801955600,null,11.634818695960988,-19.481914783215153,null,-21.499387576722029,-126.01971759840092,-9.8645688807610412,-145.50163238161608,0,0]
[62019,62.018999999999998,47.87782191077951,1.5499083105486866,1.0047340463503176,9.71127745538162E-2,1,0,417.34512487920608,1.5684002260684937,8.2440885176301091,1.4491978479978471,1.0250138519770331,0.22137449629479372,1.0000000019231781,6.2018999920484278E-5,1.0000000019231781,6.2018999920484278E-5,1.2349733874269717,0.74973290479467869,-9.9352621787479407,-145.70564815521587,34.294351844784131,null,62019,3846356361,null,11.63165514481596,-19.513617523194561,null,-21.566917323563906,-126.19558405897045,-9.935262178747946,-145.70920158216501,0,0]
[62378,62.378,48.154844458404682,1.5500284913113267,1.0047888805037688,9.7671358446728432E-2,1,0,419.76093361697366,1.568414016137055,8.2911096708235021,1.4498908561443875,1.0253006940931584,0.22261412921646301,1.0000000019455073,6.2377999919095429E-5,1.0000000019455073,6.2377999919095429E-5,1.2374834498456937,0.7532287717556897,-10.005699661201557,-145.9129167651032,34.087083234896795,null,62378,3891014884,null,11.628491631479651,-19.545726928551183,null,-21.634191292681209,-126.37076383268588,-10.005699661201557,-145.91649076123707,0,0]
[62737,62.737000000000002,48.431867693593759,1.5501472972427204,1.004844028133119,9.8229881201735633E-2,1,0,422.1767424336519,1.5684276483846595,8.3381347609964624,1.4505760478157894,1.0255891108956436,0.22385306682043504,1.0000000019679656,6.2736999917690508E-5,1.0000000019679656,6.2736999917690508E-5,1.2400038888717322,0.75671401109426961,-10.075884303443308,-146.11990015778636,33.880099842213639,null,62737,3935931169,null,11.625327891240747,-19.578235303700154,null,-21.701212194684054,-126.54525941940493,-10.075884303443306,-146.12349472310507,0,0]
[63096,63.095999999999997,48.70889160461553,1.5502647517968731,1.0048994891867593,9.8788342480472385E-2,1,0,424.592551327894,1.5684411255051691,8.3851637219117112,1.451253553881457,1.0258791010563613,0.22509130589131213,1.0000000019905526,6.3095999916269391E-5,1.0000000019905526,6.3095999916269391E-5,1.2425346588302175,0.76018864256409124,-10.145819020748148,-146.32659330012373,33.673406699876267,null,63096,3981105216,null,11.622163667491151,-19.611135120495131,null,-21.767982688239297,-126.71907331413209,-10.145819020748146,-146.33020843462722,0,0]
[63463.25,63.463250000000002,48.992282351364544,1.5503835310969565,1.0049565490201338,9.9359573515204816E-2,1,0,427.0638768006803,1.5684547545661267,8.4332773696012442,1.4519388102333708,1.026177381954088,0.22635727418059357,1.000000002013792,6.3463249914798815E-5,1.000000002013792,6.3463249914798815E-5,1.2451342295270997,0.76373216754614348,-10.217105245211229,-146.53773094052769,33.462269059472305,null,63463.25,4027584100.5625,null,11.618925968648311,-19.645188351329661,null,-21.836031213859542,-126.89617876557645,-10.217105245211231,-146.54136711690612,0,0]
[63830.5,63.830500000000001,49.275673781371793,1.5505009441652786,1.0050139367384514,9.9930739500092569E-2,1,0,429.53520235188148,1.5684682267978143,8.4813949324269124,1.4526162915601937,1.0264773065240256,0.22762250469461984,1.0000000020371662,6.3830499913311096E-5,1.0000000020371662,6.3830499913311096E-5,1.2477445154230797,0.767264634764386,-10.288135911947847,-146.74855468456161,33.251445315438389,null,63830.5,4074332730.25,null,11.615687245392728,-19.67963580122435,null,-21.903823157340575,-127.07257610159067,-10.288135911947847,-146.75221190281502,0,0]
[64197.75,64.197749999999999,49.559065882916137,1.5506170144360194,1.0050716522855474,0.10050184007364676,1,0,432.0065279801517,1.568481544891688,8.5295163441293411,1.4532861288289796,1.0267788733258125,0.22888699403090768,1.0000000020606754,6.4197749911806178E-5,1.0000000020606754,6.4197749911806178E-5,1.2503654683202134,0.77078606680096162,-10.35891395683803,-146.95905964488009,33.040940355119915,null,64197.75,4121351105.0625,null,11.612447247629696,-19.714469925580868,null,-21.97136120446773,-127.24826797942761,-10.358913956838034,-146.96273790500848,0,0]
[64565,64.564999999999998,49.842458644542987,1.550731764810539,1.0051296956049489,0.10107287487463198,1,0,434.47785368417595,1.5684947114779673,8.5776415399308021,1.453948450095391,1.027082080912896,0.23015073880043985,1.0000000020843196,6.456499991028394E-5,1.0000000020843196,6.456499991028394E-5,1.2529970402594575,0.77429648670062123,-10.429442256605405,-147.16924109417369,32.830758905826315,null,64565,4168639225,null,11.609205733020719,-19.749683343874288,null,-22.038647989626128,-127.42325705230274,-10.429442256605409,-147.17294039617704,0,0]
[64941,64.941000000000003,50.13260411827055,1.5508479051255479,1.0051894613690764,0.10165744647881905,1,0,437.00806060873168,1.5685080374866425,8.6269172080201955,1.4546188956519643,1.027394211015966,0.23144381830124414,1.0000000021086666,6.4940999908707386E-5,1.0000000021086666,6.4940999908707386E-5,1.2557022630630956,0.77787916064176998,-10.501395146684317,-147.38409033278461,32.615909667215391,null,64941,4217333481,null,11.605885170283067,-19.786121165156789,null,-22.107280316967383,-127.6016900128442,-10.501395146684317,-147.38781117800099,0,0]
[65317,65.316999999999993,50.422750260433133,1.5509627088365237,1.0052495705896147,0.1022419483734314,1,0,439.53826760999885,1.5685212100726811,8.6761967098371482,1.4552817254423576,1.0277080579330942,0.23273611018683293,1.0000000021331552,6.5316999907112468E-5,1.0000000021331552,6.5316999907112468E-5,1.258418515982838,0.78145034177821004,-10.573092168486779,-147.59859092824755,32.401409071752454,null,65317,4266310489,null,11.602562527274722,-19.822941420202323,null,-22.175654695761505,-127.77939189647465,-10.573092168486783,-147.60233331667698,0,0]
[65693,65.692999999999998,50.712897059557683,1.551076198881997,1.0053100232049565,0.1028263801716278,1,0,442.06847468666041,1.5685342318704512,8.7254799804256251,1.4559370679253103,1.0280236200918946,0.2340276108642452,1.0000000021577851,6.5692999905499078E-5,1.0000000021577851,6.5692999905499078E-5,1.261145748337704,0.78501005627979992,-10.644536226513875,-147.81273830136345,32.187261698636547,null,65693,4315570249,null,11.599237567547753,-19.860136693943907,null,-22.243773794061632,-127.95636553906198,-10.644536226513878,-147.81650223300588,0,0]
[66069,66.069000000000003,51.003044504432197,1.5511883976786622,1.005370819153157,0.10341074148685145,1,0,444.59868183742913,1.5685471054543523,8.7747669562839814,1.4565850486994603,1.0283408959133225,0.23531831675547571,1.0000000021825564,6.6068999903867121E-5,1.0000000021825564,6.6068999903867121E-5,1.2638839097157404,0.78855833077861948,-10.715730166819096,-148.02652803079386,31.973471969206145,null,66069,4365112761,null,11.595910062102778,-19.897699732607343,null,-22.311640228921874,-128.13261377304198,-10.715730166819096,-148.03031350564933,0,0]
[66453.75,66.453749999999999,51.299944707785578,1.5513018936658662,1.0054333852462254,0.10400862827051326,1,0,447.18777021404958,1.5685601278197931,8.8252046738409433,1.4572406162441975,1.0286673274392508,0.23663823255871186,1.0000000022080504,6.6453749902177839E-5,1.0000000022080504,6.6453749902177839E-5,1.2666970527792309,0.7921773639749109,-10.788324874026872,-148.24491824420343,31.755081755796567,null,66453.75,4416100889.0625,null,11.592502254750183,-19.936510210569583,null,-22.380827128777053,-128.3122155530404,-10.78832487402687,-148.24872576361,0,0]
[66838.5,66.838499999999996,51.596845564346012,1.5514140834872177,1.0054963107053616,0.1046064404345582,1,0,449.77685866563201,1.5685730002617559,8.8756461410878984,1.4578887327112602,1.0289955499476249,0.23795730862196382,1.0000000022336926,6.6838499900468893E-5,1.0000000022336926,6.6838499900468893E-5,1.2695215335185503,0.79578447638053573,-10.860663535537443,-148.46292509598143,31.537074904018567,null,66838.5,4467385082.25,null,11.589091319508873,-19.975690900296289,null,-22.449754855046319,-128.49106375964277,-10.860663535537446,-148.46675465993906,0,0]
[67223.25,67.223249999999993,51.893747062901873,1.5515249895589041,1.0055595954631007,0.10520417756574364,1,0,452.36594719088924,1.5685857253544697,8.9260912944561994,1.4585295238791556,1.0293255617251653,0.2392755411604594,1.0000000022594826,6.7223249898740146E-5,1.0000000022594826,6.7223249898740146E-5,1.2723572988038503,0.79937969795954256,-10.932749020550418,-148.68054433503463,31.319455664965375,null,67223.25,4518965340.5625,null,11.585677033664876,-20.015234525850843,null,-22.518426054215297,-128.66916141769255,-10.932749020550421,-148.68439594354339,0,0]
[67608,67.608000000000004,52.190649192496629,1.551634633787156,1.00562323945161,0.1058018392511451,1,0,454.95503578856352,1.5685983056135653,8.9765400718015318,1.459163112723229,1.0296573610514552,0.24059292640599206,1.0000000022854207,6.7607999896991504E-5,1.0000000022854207,6.7607999896991504E-5,1.2752042958062406,0.80296305913326382,-11.004584140668925,-148.89777186543492,31.102228134565081,null,67608,4570841664,null,11.582259181641692,-20.055133969497636,null,-22.586843322310621,-128.84651154899709,-11.004584140668928,-148.90164551849472,0,0]
[68001.75,68.001750000000001,52.494497043327208,1.5517455586665039,1.0056887440508631,0.10641340278267891,1,0,457.60468793590189,1.5686110327577454,9.0281726262411279,1.4598041908077659,1.0299987707217169,0.24194024651186286,1.0000000023121189,6.8001749895181245E-5,1.0000000023121189,6.8001749895181245E-5,1.2781294633088096,0.80661799402604772,-11.077843271221035,-149.11967106617959,30.880328933820408,null,68001.75,4624238003.0625,null,11.578757469882353,-20.096327868328693,null,-22.656600741103382,-129.02723941112384,-11.077843271221029,-149.12356727945254,0,0]
[68395.5,68.395499999999998,52.798345532633078,1.5518552068269926,1.0057546247386386,0.1070248864234937,1,0,460.25434015650978,1.56862361336336,9.0798088488895949,1.4604379776200054,1.0303420488782902,0.24328667128959094,1.0000000023389721,6.8395499893349884E-5,1.0000000023389721,6.8395499893349884E-5,1.2810662831526989,0.8102605730333452,-11.150845966873288,-149.34115181819678,30.658848181803222,null,68395.5,4677944420.25,null,11.575251588201876,-20.137879831724902,null,-22.726097555075164,-129.20719075995797,-11.150845966873288,-149.34507059168288,0,0]
[68789.25,68.789249999999996,53.102194649454255,1.5519636001820001,1.0058208814410357,0.10763628973205056,1,0,462.90399244912891,1.568636049946756,9.1314486775183266,1.4610645963464082,1.0306871936542346,0.24463219675445363,1.0000000023659803,6.8789249891497314E-5,1.0000000023659803,6.8789249891497314E-5,1.2840146997016622,0.81389083017006281,-11.223595063566588,-149.56221020904349,30.437789790956515,null,68789.25,4731960915.5625,null,11.571741327249999,-20.179782717490202,null,-22.795336390816587,-129.38636882525242,-11.223595063566588,-149.56615154274263,0,0]
[69183,69.183000000000007,53.406044383080157,1.5520707601463257,1.0058875140837515,0.10824761226716677,1,0,465.5536448125298,1.5686483449669935,9.1830920512941496,1.461684167425165,1.0310342031749646,0.24597681894007459,1.0000000023931437,6.9182999889623426E-5,1.0000000023931437,6.9182999889623426E-5,1.2869746576548824,0.81750879989976488,-11.296093340481605,-149.78284247862896,30.217157521371036,null,69183,4786287489,null,11.56822648451919,-20.222029538661715,null,-22.864319825000798,-129.56477683387956,-11.296093340481608,-149.78680637254126,0,0]
[69586,69.585999999999999,53.717032801726958,1.5521791821664337,1.0059561012782503,0.10887321192800829,1,0,468.26554304952509,1.568660784739895,9.2359522434723065,1.4623111184560893,1.0313912936704468,0.24735208959702459,1.0000000024211055,6.958599988768329E-5,1.0000000024211055,6.958599988768329E-5,1.2900160450544629,0.82119907584593599,-11.370037866533924,-150.00821283235257,29.991787167647431,null,69586,4842211396,null,11.564624121986959,-20.265617841494958,null,-22.934661988520887,-129.74658197496893,-11.370037866533927,-150.01219981646389,0,0]
[69989,69.989000000000004,54.028021844565977,1.5522863560184468,1.0060250821249808,0.10949872604174699,1,0,470.97744135814906,1.5686730812558349,9.2888160246844151,1.4629309336192697,1.0317503335553788,0.24872640568804236,1.0000000024492299,6.9988999885720561E-5,1.0000000024492299,6.9988999885720561E-5,1.2930694063514718,0.82487655472648103,-11.44372536510539,-150.23312930943558,29.766870690564417,null,69989,4898460121,null,11.561016551616634,-20.309552098815018,null,-23.004741916722026,-129.92758728493092,-11.443725365105392,-150.23713938374596,0,0]
[70392,70.391999999999996,54.339011500880225,1.5523923031301958,1.0060944565429726,0.11012415413654232,1,0,473.68933973717139,1.5686852369752722,9.3416833340003702,1.4635437335862553,1.0321113207953625,0.25009976302057529,1.0000000024775169,7.0391999883735092E-5,1.0000000024775169,7.0391999883735092E-5,1.2961346833540162,0.82854127486692908,-11.517158640817879,-150.45758834731561,29.542411652684393,null,70392,4955033664,null,11.557403577112627,-20.35382529740976,null,-23.074562217930502,-130.10779621441526,-11.517158640817875,-150.46162151182503,0,0]
[70795,70.795000000000002,54.650001760196631,1.5524970444418764,1.0061642244508169,0.11074949574095269,1,0,476.40123818539001,1.5686972543026414,9.3945541118575733,1.4641496363334761,1.0324742533478182,0.25147215742238499,1.0000000025059659,7.0794999881726759E-5,1.0000000025059659,7.0794999881726759E-5,1.2992118182427201,0.83219327502873086,-11.590340442359645,-150.68158653281739,29.318413467182609,null,70795,5011932025,null,11.553785008742194,-20.398430576439967,null,-23.144125451101843,-130.28721221108594,-11.590340442359649,-150.68564278752592,0,0]
[71207.25,71.207250000000002,54.968130746656655,1.5526029635686576,1.0062360007869733,0.11138910073757934,1,0,479.17538251203507,1.5687094067185134,9.44864195310622,1.4647624300305486,1.0328475269004895,0.25287505152592449,1.0000000025352362,7.1207249879648533E-5,1.0000000025352362,7.1207249879648533E-5,1.3023717915347934,0.83591597860220845,-11.664944585308554,-150.91024586892684,29.089754131073164,null,71207.25,5070472452.5625,null,11.550077404805519,-20.444396277314976,null,-23.215021990114074,-130.46992946650533,-11.664944585308556,-150.91432574382031,0,0]
[71619.5,71.619500000000002,55.286260342699499,1.5527076637315715,1.0063081887099747,0.11202861423115246,1,0,481.94952690863067,1.5687214192336114,9.5027333020809284,1.4653682476785233,1.0332228317415466,0.25427692922054368,1.0000000025646762,7.1619499877546101E-5,1.0000000025646762,7.1619499877546101E-5,1.3055440521050863,0.83962545496709651,-11.739291223294456,-151.13841618956826,28.861583810431739,null,71619.5,5129352780.25,null,11.546363565725208,-20.490695424696039,null,-23.285654789019667,-130.65182425995067,-11.739291223294458,-151.14251968464671,0,0]
[72031.75,72.031750000000002,55.604390537862329,1.5528111658505293,1.0063807881312516,0.11266803571832594,1,0,484.72367137397589,1.5687332942499492,9.5568280992208372,1.4659672072891048,1.0336001656582798,0.25567778610633168,1.0000000025942863,7.203174987541933E-5,1.0000000025942863,7.203174987541933E-5,1.3087285392762631,0.84332174694214423,-11.813383126494861,-151.3660942994938,28.633905700506205,null,72031.75,5188573008.0625,null,11.542643308335194,-20.537321142539504,null,-23.356026434830053,-130.83290027221784,-11.813383126494859,-151.37022141475734,0,0]
[72444,72.444000000000003,55.922521321920414,1.5529134903695103,1.006453798961755,0.11330736469619943,1,0,487.49781590689685,1.5687450341148663,9.6109262863022806,1.4665594242368685,1.0339795264292555,0.25707761780580862,1.0000000026240665,7.2443999873268082E-5,1.0000000026240665,7.2443999873268082E-5,1.3119251927822706,0.84700489776375887,-11.887223010106593,-151.59327714934034,28.406722850659662,null,72444,5248133136,null,11.538916455750812,-20.584266704050616,null,-23.4261394658574,-131.01316118073822,-11.887223010106588,-151.59742788478883,0,0]
[72865.75,72.865750000000006,56.247983796412321,1.5530169750978273,1.0065289179195354,0.11396133028765913,1,0,490.33588864211788,1.5687569070494338,9.666274575241399,1.4671584284902017,1.0343697244198991,0.25850864216717728,1.0000000026547087,7.2865749871041768E-5,1.0000000026547087,7.2865749871041768E-5,1.3152080385317515,0.85075937072835794,-11.962506457195934,-151.82517971981872,28.174820280181279,null,72865.75,5309417523.0625,null,11.535096717571957,-20.632618213807465,null,-23.497603174767892,-131.19673640595468,-11.962506457195936,-151.82935461976214,0,0]
[73287.5,73.287499999999994,56.573446866338173,1.5531192691464688,1.0066044672761845,0.11461519799369252,1,0,493.17396144566436,1.568768643333428,9.7216262930055706,1.4677506118906596,1.0347620390246008,0.25993858435186346,1.0000000026855287,7.3287499868789541E-5,1.0000000026855287,7.3287499868789541E-5,1.3185034915211222,0.85450018272754991,-12.037531714753777,-152.05655793456103,27.943442065438973,null,73287.5,5371057656.25,null,11.531269721451181,-20.681290695989421,null,-23.568801436204954,-131.37946630300991,-12.037531714753772,-152.06075699899932,0,0]
[73709.25,73.709249999999997,56.898910521480303,1.5532203929454573,1.0066804469348003,0.11526896727728807,1,0,496.01203431636338,1.5687802453124999,9.7769813813586151,1.4683360898737827,1.0351564678368301,0.26136743974590371,1.0000000027165268,7.3709249866511239E-5,1.0000000027165268,7.3709249866511239E-5,1.3218114885611534,0.85822738131895238,-12.112301520796862,-152.2874089758065,27.7125910241935,null,73709.25,5433053535.5625,null,11.527435297076714,-20.730277406662424,null,-23.639736817873576,-131.5613547980773,-12.112301520796862,-152.29163220473973,0,0]
[74131,74.131,{"$f":"SQRT(1+(A525/pole1)^2)","v":57.224374751853432},{"$f":"ATAN(A525/pole1)","v":1.5533203664601278},{"$f":"SQRT(1+(A525/Zero1)^2)","v":1.006756856797959},{"$f":"ATAN(A525/Zero1)","v":0.1159226376019324},{"$f":"IF(VIN_nom>Vout, 1, SQRT(1+(A525/z_RHP)^2))","v":1},{"$f":"IF(VIN_nom>Vout, 0, -ATAN(A525/z_RHP))","v":0},{"$f":"SQRT(1+(A525/Pole2)^2)","v":498.85010725306893},{"$f":"ATAN(A525/Pole2)","v":1.5687917152789217},9.8323397833723014,1.4689149752940214,{"$f":"SQRT(1+(A525/pole4)^2)","v":1.0355530084407636},{"$f":"ATAN(A525/pole4)","v":0.26279520376009585},{"$f":"SQRT(1+(A525/Zero3)^2)","v":1.0000000027477025},{"$f":"ATAN(A525/Zero3)","v":7.4130999864206713E-5},{"$f":"SQRT(1+(A525/pole5)^2)","v":1.0000000027477025},{"$f":"ATAN(A525/pole5)","v":7.4130999864206713E-5},{"$f":"SQRT((1-(Z525/pterm2))^2+(A525/pterm1)^2)","v":1.3251319669152202},{"$f":"IF((ATAN((A525/pterm1)/(1-A525^2/pterm2))>0),ATAN((A525/pterm1)/(1-A525^2/pterm2)),PI()+ATAN((A525/pterm1)/(1-A525^2/pterm2)))","v":0.86194101445481885},{"$f":"20*LOG10(((E525*K525*G525*O525)/(C525*I525*S525*M525*Q525))*Adc)","v":-12.186818559298317},{"$f":"((F525+L525+H525+R525)-(D525+J525+T525+N525))*radconv","v":-152.5177301679982},{"$f":"IF(V525>0,V525,V525+180)","v":27.482269832001805},null,{"$f":"IF(U525<0,A525,1000000000)","v":74131},{"$f":"A525^2","v":5495405161},null,{"$f":"20*LOG10((K525/(I525*M525))*AEA*Afb)","v":11.523593280151408},{"$f":"(L525-(J525+N525))*radconv","v":-20.779571748138416},null,{"$f":"20*LOG10((E525*G525/(C525*S525))*Am)","v":-23.710411839449719},{"$f":"(F525+H525-(D525+T525))*radconv","v":-131.74240581328789},-12.186818559298311,-152.5219775614263,0,0]
[74562.75,{"$f":"A526/1000","v":74.562749999999994},57.557556562089935,1.5534215392712658,1.0068355239185893,0.11659170386060408,1,0,501.75547303555993,1.5688033228004186,9.8890141478060816,1.4695008728104768,1.0359611362731547,0.26425568583207076,1.0000000027798017,7.4562749861820216E-5,1.0000000027798017,7.4562749861820216E-5,1.3285440399425976,0.86572869926306795,-12.26284336948873,-152.75296095254689,27.247039047453114,null,74562.75,5559603687.5625,null,11.51965213605671,-20.83034681404741,null,-23.782495505545441,-131.92688626938036,{"$f":"AB526+AE526","v":-12.262843369488731},-152.75723308342776,{"$f":"SUM((U527<0)*(U526>0))*A526","v":0},0]
[74994.5,74.994500000000002,57.89073895470041,1.5535215475102961,1.0069146416782553,0.11726066527567638,1,0,504.66083888487628,1.5688147966713779,9.9456918682112683,1.4700800927912374,1.0363714720756767,0.26571501450263846,1.0000000028120875,7.4994499859405936E-5,1.0000000028120875,7.4994499859405936E-5,1.3319690615844657,0.86950227059498075,-12.338608808301439,-152.98763122846418,27.012368771535819,null,74994.5,5624175030.25,null,11.515702705112203,-20.881430731925153,null,-23.854311513413641,-132.1104973648726,-12.338608808301439,-152.99192809679775,0,0]
[75426.25,75.426249999999996,58.223921919687044,1.5536204111677872,1.0069942099707392,0.11792952127319933,1,0,507.56620479987055,1.568826139186889,10.002372887538751,1.4706527483642315,1.036784013226735,0.26717318492928371,1.0000000028445595,7.5426249856963684E-5,1.0000000028445595,7.5426249856963684E-5,1.3354069660103074,0.87326178108123831,-12.414117588476874,-153.22173856181632,26.778261438183677,null,75426.25,5689119189.0625,null,11.511744829371413,-20.93281687406208,null,-23.925862417848293,-132.29324329354051,-12.414117588476881,-153.22606016760258,0,0]
[75858,75.858000000000004,58.557105447279611,1.553718149779421,1.0070742286892522,0.11859827127978111,1,0,510.4715707794212,1.5688373525897903,10.059057150021991,1.4712189501248629,1.0371987570948271,0.2686301922968769,1.000000002877218,7.5857999854493337E-5,1.000000002877218,7.5857999854493337E-5,1.3388576878872587,0.8770072837198355,-12.489372369514694,-153.4552806572986,26.544719342701399,null,75858,5754436164,null,11.507778356662186,-20.984498756426852,null,-23.99715072617688,-132.47512824411069,-12.489372369514694,-153.45962700053755,0,0]
[76299.75,76.299750000000003,58.898006594757973,1.5538170076467399,1.0071565668491762,0.11928240027509456,1,0,513.44422960934833,1.5688486943656197,10.117057607831994,1.4717916990014399,1.0376253841549221,0.2701197374443145,1.0000000029108258,7.6299749851936466E-5,1.0000000029108258,7.6299749851936466E-5,1.3424015324146645,0.88082509538715059,-12.566109995787961,-153.69364467004939,26.306355329950605,null,76299.75,5821651850.0625,null,11.503710963477687,-21.037677149368477,null,-24.069820959265652,-132.66033917433032,-12.566109995787965,-153.69801632369879,0,0]
[76741.5,76.741500000000002,59.238908311214537,1.5539147277216989,1.0072393763138923,0.11996641710015454,1,0,516.41688850456251,1.5688599055677548,10.175061346617683,1.4723579180618163,1.0380543115455378,0.27160805492195905,1.0000000029446288,7.6741499849349834E-5,1.0000000029446288,7.6741499849349834E-5,1.3459586582351659,0.88462835616204727,-12.64258718879066,-153.93141252354764,26.068587476452365,null,76741.5,5889257822.25,null,11.499634265877148,-21.091151851600351,null,-24.142221454667808,-132.84465763600716,-12.64258718879066,-153.93580948760751,0,0]
[77183.25,77.183250000000001,59.57981058688263,1.5540113295329918,1.0073226569671656,0.12065032114262982,1,0,519.38954746394268,1.5688709884381578,10.233068310586745,1.4729177179841577,1.0384855364163459,0.27309513966159876,1.0000000029786269,7.7183249846733251E-5,1.0000000029786269,7.7183249846733251E-5,1.3495289969867252,0.8884171239012596,-12.718806633233072,-154.1685821834117,25.831417816588299,null,77183.25,5957254080.5625,null,11.495548118419876,-21.144916359798518,null,-24.214354751652948,-133.02808809808357,-12.718806633233072,-154.17300445788209,0,0]
[77625,77.625,59.920713412217793,1.5541068321649831,1.007406408692139,0.12133411179081302,1,0,522.36220648639346,1.5688819451677569,10.291078445201721,1.4734712069673888,1.0389190559064967,0.27458098662522284,1.0000000030128202,7.7624999844086554E-5,1.0000000030128202,7.7624999844086554E-5,1.3531124808514956,0.89219145679506195,-12.794770961506668,-154.40515174973305,25.594848250266949,null,77625,6025640625,null,11.491452381196879,-21.198964311495441,null,-24.286223342703543,-133.2106350231185,-12.794770961506664,-154.40959933461394,0,0]
[78077,78.076999999999998,60.269526822711533,1.5542034324824414,1.0074925911940595,0.12203365054023345,1,0,525.40384068332162,1.5688930277964395,10.350437825031948,1.4740311166920632,1.0393650065283908,0.27610002353434704,1.000000003048009,7.8076999841347075E-5,1.000000003048009,7.8076999841347075E-5,1.3567926488938851,0.89603848607072634,-12.87223653122938,-154.64658749355269,25.353412506447313,null,78077,6096017929,null,11.48725154344846,-21.254553239093607,null,-24.359488074677845,-133.3965077370321,-12.872236531229385,-154.65106097612571,0,0]
[78529,78.528999999999996,60.618340789145151,1.5542989210732272,1.0075792666324936,0.12273306927840399,1,0,528.44547494403946,1.5689039828460081,{"$f":"SQRT(1+(A535/Zero2)^2)","v":10.409800412706494},{"$f":"ATAN(A535/Zero2)","v":1.4745846407428214},1.039813353396734,0.27761775398598576,1.0000000030834018,7.8528999838575693E-5,1.0000000030834018,7.8528999838575693E-5,1.3604864372347509,0.899870527116716,-12.949440422580853,-154.88739136188047,25.112608638119525,null,78529,6166803841,null,11.483040386349451,-21.310425874612044,null,-24.4324808089303,-133.58146486753367,-12.949440422580849,-154.8918907421457,0,0]
[78981,78.980999999999995,60.967155301976462,1.5543933170173208,1.0076664348802402,0.1234323673520895,1,0,531.48710926745184,1.5689148125068182,10.469166153657707,1.4751318874080619,1.040264093413227,0.27913417268169749,1.0000000031189991,7.8980999835772219E-5,1.0000000031189991,7.8980999835772219E-5,1.3641937749900446,0.90368764324513562,-13.026385294418464,-155.12756173031448,24.872438269685517,null,78981,6237998361,null,11.478818776841322,-21.366575835502307,null,-24.505204071259787,-133.76551117276966,-13.026385294418464,-155.13208700827198,0,0]
[79433,79.433000000000007,61.315970351880438,1.5544866389606116,1.0077540958094191,0.12413154410875225,1,0,534.52874365248852,1.5689255189193696,10.528534994545801,1.4756729625489284,1.0407172234684161,0.28064927435632647,1.0000000031548006,7.9432999832936476E-5,1.0000000031548006,7.9432999832936476E-5,1.3679145918689779,0.90748989806203306,-13.103073754193113,-155.36709710450486,24.632902895495135,null,79433,6309601489,null,11.474586587165867,-21.422996877338051,null,-24.577660341358975,-133.94865140281652,-13.103073754193108,-155.37164828015457,0,0]
[79895.5,79.895499999999998,61.67288895268829,1.5545810360741983,1.0078443029575495,0.12484683654633574,1,0,537.6410355361578,1.5689363486487169,10.589286133264421,1.4762203266274194,1.0411833504845049,0.28219820325144729,1.0000000031916454,7.9895499830001261E-5,1.0000000031916454,7.9895499830001261E-5,1.3717357233945386,0.91136516306869886,-13.181280945149528,-155.61153818796515,24.388461812034848,null,79895.5,6383290920.25,null,11.470245003768767,-21.481002812090889,null,-24.651525948918291,-134.13511305082184,-13.181280945149524,-155.61611586291272,0,{"$f":"IF(AI538>0,W538,0)","v":0}]
[80358,80.358000000000004,62.029808096727578,1.5546743468677566,1.0079350256699828,0.12556200058498504,1,0,540.75332748215749,1.5689470537176049,10.650040408416022,1.476761445874635,1.0416519732484826,0.28374574217934523,1.000000003228704,8.0357999827031866E-5,1.000000003228704,8.0357999827031866E-5,1.3755708205588382,0.91522500389169048,-13.259225037236781,-155.85531166666402,24.144688333335978,null,80358,6457408164,null,11.465892088554206,-21.539279767546159,null,-24.725117125790984,-134.32063607336335,-13.259225037236778,-155.85991584090951,0,0]
[80820.5,80.820499999999996,62.386727774674689,1.5547665899844307,1.0080262638075159,0.12627703552791208,1,0,543.86561948941755,1.5689576362661539,10.710797766628747,1.4772964262430002,1.0421230883934793,0.2852918856078327,1.0000000032659766,8.0820499824028088E-5,1.0000000032659766,8.0820499824028088E-5,1.3794198099790604,0.91906948951776368,-13.33690866562905,-156.09841633637001,23.901583663629992,null,80820.5,6531953220.25,null,11.46152772076729,-21.597821478725937,null,-24.798436386396343,-134.50522553118742,-13.336908665629053,-156.10304700991335,0,0]
[81283,81.283000000000001,62.743647977418163,1.554857783643228,1.0081180172302056,0.12699194067910854,1,0,546.97791155689208,1.5689680983857754,10.771558155732247,1.4778253713085447,1.0425966925408201,0.28683662804138277,1.0000000033034631,8.1282999820989738E-5,1.0000000033034631,8.1282999820989738E-5,1.3832826189171881,0.92289868918189955,-13.414334414997191,-156.34085111819516,23.659148881804839,null,81283,6606926089,null,11.457151784732282,-21.656621816119419,null,-24.871486199729471,-134.68888647491693,-13.414334414997189,-156.34550829103634,0,0]
[81756.25,81.756249999999994,63.10886469719911,1.5549500291807283,1.0082124365429543,0.12772332746744577,1,0,550.16254344719914,1.5689786811508044,10.83373389752385,1.4783604690419112,1.0430838777012181,0.28841581938600441,1.0000000033420422,8.1756249817844777E-5,1.0000000033420422,8.1756249817844777E-5,1.3872494419273211,0.92680114129579139,-13.493295494949617,-156.58822644805571,23.411773551944293,null,81756.25,6684084414.0625,null,11.452662047538137,-21.717050321301706,null,-24.945957542487758,-134.8758604148228,-13.493295494949621,-156.59291073612451,0,0]
[82229.5,82.229500000000002,63.474081947808791,1.5550412131940234,1.0083073950742145,0.12845457688846973,1,0,553.34717539841245,1.568989142103659,10.895912705931137,1.4788894597289031,1.0435736617188744,0.28999353232751263,1.0000000033808454,8.2229499814663183E-5,1.0000000033808454,8.2229499814663183E-5,1.391230582314763,0.93068773598554333,-13.571991887899909,-156.83489848654921,23.165101513450793,null,82229.5,6761690670.25,null,11.448159968603822,-21.777737048884536,null,-25.02015185650373,-135.06187284096092,-13.571991887899909,-156.83960988984546,0,0]
[82702.75,82.702749999999995,63.839299720136808,1.5551313539001814,1.0084028926716562,0.12918568819906215,1,0,556.53180740948631,1.5689994833354677,10.958094528752014,1.4794124470344121,1.0440660409363232,0.29156976109764676,1.0000000034198724,8.2702749811444754E-5,1.0000000034198724,8.2702749811444754E-5,1.3952259642357192,0.93455854811943517,-13.650426207512522,-157.0808664594056,22.919133540594402,null,82702.75,6839744857.5625,null,11.443645439441921,-21.83867584862297,null,-25.094071646954443,-135.24692912930635,-13.650426207512522,-157.08560497792934,0,0]
[83176,83.176000000000002,64.204518005279994,1.5552204691018383,1.008498929182142,0.12991666065697605,1,0,559.71643947939901,1.5690097068897673,11.020279314960076,1.4799295322968131,1.0445610116836326,0.29314449996849273,1.0000000034591234,8.3175999808189299E-5,1.0000000034591234,8.3175999808189299E-5,1.3992355125451155,0.93841365276188415,-13.728601017842321,-157.3261297126823,22.673870287317698,null,83176,6918246976,null,11.439118356432335,-21.899860703156541,null,-25.167719374274657,-135.43103464327697,-13.728601017842323,-157.33089534643352,0,0]
[83660.5,83.660499999999999,64.578418705258116,1.5553106585357206,1.0085978067734271,0.13066486502207272,1,0,562.97677601658972,1.5690200536545842,11.083945362710429,1.4804528988749608,1.0450704295971358,0.29475512381735347,1.0000000034995395,8.3660499804817849E-5,1.0000000034995395,8.3660499804817849E-5,1.4033549727987138,0.9423442066883736,-13.808367973863804,-157.57649270469696,22.42350729530304,null,83660.5,6999079260.25,null,11.434470548264706,-21.962748782040794,null,-25.242838522128505,-135.61853731621247,-13.808367973863799,-157.58128609825326,0,0]
[84145,84.144999999999996,64.952319924478076,1.5553998096105113,1.0086972488767416,0.13141292228288309,1,0,566.23711261335632,1.5690302812681307,11.147614411813658,1.4809702872287605,1.0455825558916598,0.29636417406987259,1.0000000035401904,8.414499980140711E-5,1.0000000035401904,8.414499980140711E-5,1.4074891238077711,0.94625845723043311,-13.887868221085032,-157.82611605618268,22.173883943817316,null,84145,7080381025,null,11.429809377452036,-22.025882400655508,null,-25.317677598537067,-135.8050548088884,-13.88786822108503,-157.83093720954392,0,0]
[84629.5,84.629499999999993,65.326221654024025,1.5554879401542638,1.0087972553251454,0.13216083164582371,1,0,569.49744926867538,1.5690403917768048,11.211286411135591,1.4814817989347981,1.0460973865894685,0.29797164471149418,1.0000000035810761,8.4629499797956879E-5,1.0000000035810761,8.4629499797956879E-5,1.4116378871999116,0.95015648545551867,-13.967104357828005,-158.07499943163509,21.925000568364908,null,84629.5,7162152270.25,null,11.425134747632795,-22.089255511732286,null,-25.392239105460803,-135.99059283306909,-13.967104357828008,-158.07984834480138,0,0]
[85114,85.114000000000004,65.700123885183146,1.5555750675892559,1.0088978259508172,0.13290859231828667,1,0,572.75778598154727,1.5690503871804096,11.274961310694771,1.4819875332875223,1.0466149176996675,0.29957752977211832,1.0000000036221965,8.5113999794466912E-5,1.0000000036221965,8.5113999794466912E-5,1.4158011853592252,0.95403837256882329,-14.046078933589051,-158.32314261077121,21.676857389228786,null,85114,7244392996,null,11.420446567118903,-22.152862198637052,null,-25.466525500707956,-136.17515708510541,-14.046078933589053,-158.32801928374246,0,0]
[85609.5,85.609499999999997,66.082515634638312,1.5556631533640919,1.0090012632740344,0.13367317539569684,1,0,576.09214484548033,1.5690604924997507,11.340084822449109,1.4824988753007693,1.0471469876423511,0.30121822839264978,1.0000000036644932,8.5609499790856379E-5,1.0000000036644932,8.5609499790856379E-5,1.4200739596919218,0.95799178312509414,-14.126578604882534,-158.5761538795806,21.423846120419398,null,85609.5,7328986490.25,null,11.415637840523939,-22.218148558023135,null,-25.542216445406471,-136.36291038458725,-14.126578604882532,-158.58105894261038,0,0]
[86105,86.105000000000004,66.464907890934668,1.555750225572611,1.0091052903254325,0.13443760128060944,1,0,579.42650376756546,1.5690704815152596,11.405211265441091,1.4830043776782356,1.0476818735240847,0.30285725612952669,1.0000000037070356,8.6104999787203805E-5,1.0000000037070356,8.6104999787203805E-5,1.4243617744780876,0.96192848347884585,-14.206809946516561,-158.82839084588829,21.171609154111707,null,86105,7414071025,null,11.410814761274331,-22.283667105593437,null,-25.617624707790895,-136.54965719338327,-14.206809946516564,-158.83332429897672,0,0]
[86600.5,86.600499999999997,66.847300645374247,1.555836301607471,1.0092099069226488,0.13520186912839255,1,0,582.76086274680449,1.5690803562232871,11.470340589741662,1.4835041396328223,1.0482195710341125,0.30449460674116224,1.0000000037498233,8.6600499783508948E-5,1.0000000037498233,8.6600499783508948E-5,1.42866454912874,0.96584856082084836,-14.286775535610278,-159.07985362256264,20.920146377437362,null,86600.5,7499646600.25,null,11.405977245476187,-22.349411913633315,null,-25.692752781086465,-136.73540355207629,-14.286775535610278,-159.0848154657096,0,0]
[87096,87.096000000000004,67.229693889456925,1.555921398465681,1.0093151128823616,0.13596597809550182,1,0,586.09522178222176,1.5690901185747539,11.535472746547187,1.4839982581483266,1.0487600758478834,0.30613027403470611,1.0000000037928565,8.7095999779771563E-5,1.0000000037928565,8.7095999779771563E-5,1.4329822038681066,0.96975210241391341,-14.366477901430221,-159.33054243177591,20.66945756822409,null,87096,7585713216,null,11.401125213703708,-22.415377182335838,null,-25.767603115133927,-136.92015548264561,-14.366477901430219,-159.33553266498146,0,0]
[87603.25,87.603250000000003,67.621155483967627,1.5560075163219214,1.0094234239347728,0.13674804124377821,1,0,589.50864993369839,1.5690999980307621,11.60215229384356,1.4844983471197579,1.0493163012996267,0.30780297851345112,1.0000000038371646,8.7603249775901264E-5,1.0000000038371646,8.7603249775901264E-5,1.4374175760911978,0.97373117291622346,-14.447800214581024,-159.58637455763983,20.413625442360171,null,87603.25,7674329410.5625,null,11.396143008882396,-22.483129153107079,null,-25.84394322346342,-137.10826470102225,-14.447800214581024,-159.59139385412934,0,0]
[88110.5,88.110500000000002,68.012617574203148,1.5560926428369681,1.0095323522408355,0.13752993610132982,1,0,592.92207814205074,1.5691097637355209,11.668834709548886,1.4849927206231044,1.0498754595600066,0.30947390591563806,1.00000000388173,8.8110499771985889E-5,1.00000000388173,8.8110499771985889E-5,1.4418683758892352,0.97769309935396453,-14.528851888630978,-159.84139637938716,20.158603620612837,null,88110.5,7763460210.25,null,11.391145436743127,-22.551100259624619,null,-25.919997325374101,-137.29534447953603,-14.528851888630975,-159.84644473916063,0,0]
[88617.75,88.617750000000001,68.404080151652678,1.5561767950293059,1.0096418976007671,0.13831166176674395,1,0,596.3355064063021,1.5691194176423675,11.735519944767397,1.4854814758463566,1.050437545945534,0.31114304975615453,1.0000000039265529,8.861774976802514E-5,1.0000000039265529,8.861774976802514E-5,1.4463345202978692,0.9816379754607405,-14.609635489556457,-160.09560846617907,19.904391533820927,null,88617.75,7853105615.0625,null,11.38613242567946,-22.619284673775184,null,-25.995767915235916,-137.48140121546135,-14.609635489556457,-160.10068588923653,0,0]
[89125,89.125,68.79554320799916,1.556259989530119,1.0097520598137395,0.13909321733982508,1,0,599.74893472549797,1.5691289616601691,11.802207951706364,1.4859647077917515,1.0510025557582396,0.31281040360347739,1.0000000039716328,8.9124999764018814E-5,1.0000000039716328,8.9124999764018814E-5,1.4508159272279373,0.98556589496996849,-14.690153536246392,-160.34901149066246,19.650988509337537,null,89125,7943265625,null,11.381103908372809,-22.687676693202437,null,-26.071257444619199,-137.66644128380145,-14.69015353624639,-160.35411797700388,0,0]
[89644,89.644000000000005,69.196074648846661,1.5563441368854438,1.0098654120787247,0.13989269997453577,1,0,603.24143216466155,1.5691386149656326,11.870443547704994,1.4864535135667418,1.0515836744005966,0.3145145209150827,1.0000000040180232,8.9643999759872201E-5,1.0000000040180232,8.9643999759872201E-5,1.4554168542311099,0.98956734869992136,-14.772264439336301,-160.60744778814899,19.392552211851012,null,89644,8036046736,null,11.375942794835517,-22.757862008785647,null,-26.148207234171821,-137.85472200221415,-14.772264439336304,-160.6125840109998,0,0]
[90163,90.162999999999997,69.596606574016661,1.5564273156969388,1.0099794096767654,0.14069200264289816,1,0,606.73392965939195,1.5691481571378851,11.938681947500358,1.4869367316828268,1.0521678434801198,0.31621675089577284,1.0000000040646833,9.0162999755677301E-5,1.0000000040646833,9.0162999755677301E-5,1.4600335879525659,0.99355124960950503,-14.854102532479832,-160.8650388466601,19.134961153339901,null,90163,8129366569,null,11.370765318918242,-22.828252970081788,null,-26.224867851398074,-138.04195183593842,-14.854102532479832,-160.87020480602021,0,0]
[90682,90.682000000000002,69.997138975195099,1.556509542589831,1.010094052389368,0.1414911243846935,1,0,610.22642720873489,1.5691575900850647,12.006923103288388,1.487414457184508,1.0527550579187879,0.31791708683088116,1.0000000041116126,9.0681999751433828E-5,1.0000000041116126,9.0681999751433828E-5,1.4646660432783554,0.99751769797713719,-14.935670368795531,-161.12178569825497,18.878214301745032,null,90682,8223225124,null,11.36557142154469,-22.898843856048238,null,-26.301241790340221,-138.22813753807623,-14.935670368795531,-161.12698139412447,0,0]
[91201,91.200999999999993,70.397671844257133,1.556590833811037,1.0102093399969017,0.142290064241062,1,0,613.71892481175803,1.5691669156718755,12.075166968343735,1.4878867829778375,1.0533453126234587,0.3196155220644824,1.0000000041588111,9.1200999747141498E-5,1.0000000041588111,9.1200999747141498E-5,1.4693141360317843,1.00146679400181,-15.016970455160198,-161.37768947208997,18.622310527910031,null,91201,8317622401,null,11.360361047743428,-22.969629069043577,null,-26.377331502903626,-138.41328583542531,-15.016970455160198,-161.38291490446889,0,0]
[91732,91.731999999999999,70.807466064859454,1.5566730527839927,1.010327960417218,0.14310728745446821,1,0,617.29217385905258,1.5691763476671243,12.144991482555895,1.4883645358878039,1.0539523560297386,0.32135125346702259,1.0000000042073798,9.1731999742699087E-5,1.0000000042073798,9.1731999742699087E-5,1.4740857962709373,1.0054893442057529,-15.099875771955961,-161.63863882885576,18.361361171144239,null,91732,8414759824,null,11.355013097434057,-23.042246340989415,null,-26.454888869390018,-138.60164834430392,-15.099875771955961,-161.64389468529333,0,0]
[92263,92.263000000000005,71.217260758608901,1.5567543255571339,1.010447255430196,0.143924318248075,1,0,620.86542296063089,1.5691856710949863,12.214818737143421,1.4888368266582697,1.0545625710839925,0.32308498135084224,1.0000000042562305,9.2262999738204932E-5,1.0000000042562305,9.2262999738204932E-5,1.4788736501288102,1.0094939422330798,-15.1825059802231,-161.89870835717434,18.101291642825657,null,92263,8512461169,null,11.349647796132714,-23.115055556856042,null,-26.53215377635582,-138.7889390808146,-15.182505980223105,-161.90399463767065,0,0]
[92794,92.793999999999997,71.627055917384482,1.5568346683696694,1.0105672247969335,0.14474115559942016,1,0,624.43867211556119,1.5691948878192377,12.284648685376556,1.4893037482224658,1.0551759522836675,0.32481669877843306,1.0000000043053632,9.2793999733658763E-5,1.0000000043053632,9.2793999733658763E-5,1.4836776104617064,1.013480695017577,-15.264863622482341,-162.15789955753601,17.842100442463988,null,92794,8610726436,null,11.344265097435674,-23.188051101258111,null,-26.609128719918012,-138.97516516083289,-15.264863622482338,-162.163216262091,0,0]
[93325,93.325000000000003,72.036851533250044,1.5569140970913375,1.0106878682772917,0.14555779848755804,1,0,628.01192132293249,1.5692039996612368,12.354481281580261,1.4897653914219229,1.0557924941104797,0.32654639887659909,1.0000000043547776,9.332499972906024E-5,1.0000000043547776,9.332499972906024E-5,1.4884975911267597,1.0174497093275672,-15.346951195837839,-162.41621402079465,17.583785979205345,null,93325,8709555625,null,11.338864958866782,-23.261227479910335,null,-26.685816154704622,-139.16033366949799,-15.346951195837839,-162.42156114940832,0,0]
[93868.5,93.868499999999997,72.456294403828522,1.5569944651692376,1.0108120496161672,0.14639346310144263,1,0,631.66928661963766,1.5692132192433856,12.425960466902115,1.4902325283963098,1.0564268169649202,0.32831472073408852,1.0000000044056476,9.3868499724298972E-5,1.0000000044056476,9.3868499724298972E-5,1.4934475380924721,1.0214938976724162,-15.430694030666503,-162.67970314607692,17.320296853923082,null,93868.5,8811295292.25,null,11.333319597525612,-23.336308125310133,null,-26.764013628192114,-139.34877328963637,-15.430694030666501,-162.6850814149465,0,0]
[94412,94.412000000000006,72.875737737017033,1.5570739081152076,1.0109369366671193,0.14722892182940031,1,0,635.32665196941684,1.5692223326773669,12.497442332761347,1.4906943216854929,1.0570644392554398,0.330080914801958,1.0000000044568129,9.4411999719482261E-5,1.0000000044568129,9.4411999719482261E-5,1.4984140890861199,1.0255197283007067,-15.514159084985355,-162.94227741731976,17.057722582680242,null,94412,8913625744,null,11.327755887560656,-23.411566946112423,null,-26.841914972546007,-139.53611988033282,-15.514159084985351,-162.94768682644525,0,0]
[94955.5,94.955500000000001,73.295181524873485,1.5571524418108971,1.0110625291686381,0.14806417358165577,1,0,638.98401737135885,1.5692313417858659,12.568926833423786,1.4911508622658229,1.0577053550149877,0.33184497391924539,1.0000000045082735,9.4955499714609754E-5,1.0000000045082735,9.4955499714609754E-5,1.5033971549491829,1.0295273150438862,-15.59734889645021,-163.20393881055398,16.796061189446021,null,94955.5,9016546980.25,null,11.322173795370201,-23.486998423895557,null,-26.919522691820408,-139.72238093603985,-15.597348896450207,-163.20937935993541,0,0]
[95499,95.498999999999995,73.714625759636576,1.5572300817765274,1.011188826857867,0.14889921727012878,1,0,642.64138282457304,1.5692402483500754,12.640413924188145,1.4916022390644785,1.0583495582601825,0.33360689099543983,1.0000000045600295,9.5498999709681167E-5,1.0000000045600295,9.5498999709681167E-5,1.5083966475907504,1.0335167714747286,-15.680265958020643,-163.46468938525229,16.535310614747715,null,95499,9120059001,null,11.316573291114702,-23.562597159305987,null,-26.996839249135345,-139.90756391558367,-15.680265958020643,-163.47016107488966,0,0]
[96611.5,96.611500000000007,74.573195127385944,1.5573862808598138,1.0114495458285124,0.15060782993642469,1,0,650.12771061044452,1.5692581668641596,12.78675004007289,1.4925104312710851,1.0596784159847772,0.33720668180458246,1.0000000046668909,9.6611499699416435E-5,1.0000000046668909,9.6611499699416435E-5,1.5186810599349065,1.0416268009242851,-15.849150109268431,-163.9955932524268,16.004406747573199,null,96611.5,9333781932.25,null,11.305051994986799,-23.717841054784191,null,-27.154202104255234,-140.28328762883413,-15.849150109268434,-164.00112868361833,0,0]
[97724,97.724000000000004,75.431766273165394,1.5575389242027342,1.0117132160548219,0.15231555699711519,1,0,657.6140386003018,1.5692756774068082,12.933096463963077,1.4933980706214602,1.0610209710455683,0.34079740910900957,1.00000000477499,9.7723999688912583E-5,1.00000000477499,9.7723999688912583E-5,1.529033202204048,1.0496623087391264,-16.016922150337042,-164.52270927330267,15.477290726697333,null,97724,9549980176,null,11.29345326916437,-23.87371986657288,null,-27.310375419501408,-140.65458857947547,-16.016922150337038,-164.52830844604836,0,0]
[98862,98.861999999999995,76.310018804291602,1.5576915125262611,1.0119859810541745,0.15406150151897169,1,0,665.2719635254856,1.5692931815679807,13.082807649693079,1.4942855085956503,1.062408417014824,0.34446100269969254,1.0000000048868474,9.8861999677917663E-5,1.0000000048868474,9.8861999677917663E-5,1.5396919610860544,1.0578059006889839,-16.187409707975633,-165.05800984935181,14.941990150648195,null,98862,9773695044,null,11.281508445865887,-24.033784781411466,null,-27.468918153841521,-141.02988944328257,-16.187409707975633,-165.06367422469404,0,0]
[100000,100,77.188273071727224,1.557840628529201,1.0122618292449514,0.15580649979437419,1,0,672.92988864986648,1.5693102873353346,13.232528905592467,1.4951528651637307,1.063810085235958,0.3481149909796627,1.000000005,9.9999999666666668E-5,1.000000005,9.9999999666666668E-5,1.5504200972974467,1.0658735450007162,-16.356774685226391,-165.589391622649,14.410608377350997,null,100000,10000000000,null,11.269482402915465,-24.194427106018345,null,-27.626257088141848,-141.40069409456942,-16.356774685226384,-165.59512120058776,0,0]
[101165,101.16500000000001,78.087366392247162,1.5579898078762342,1.0125474133194137,0.15759190913892929,1,0,680.76950463996695,1.5693274003039059,13.385812501867719,1.4960207009476927,1.0652596829946521,0.35184566125242939,1.0000000051171785,1.0116499965488042E-4,1.0000000051171785,1.0116499965488042E-4,1.561473875269707,1.074054989140125,-16.52901573890431,-166.12934685455008,13.870653145449921,null,101165,10234357225,null,11.257086881289775,-24.35943594073397,null,-27.786102620194086,-141.77570724133739,-16.529015738904313,-166.13514318207135,0,0]
[102330,102.33,78.986461410998444,1.5581355910391694,1.0128362232514381,0.15937630595106123,1,0,688.60912082489403,1.5693441236200614,13.539105951241824,1.4968688856116874,1.0667240665163134,0.35556614036713802,1.0000000052357143,1.0232999964281957E-4,1.0000000052357143,1.0232999964281957E-4,1.5725988419780321,1.0821589840159198,-16.700121449184806,-166.66524768778709,13.334752312212913,null,102330,10471428900,null,11.244606259472999,-24.524964465903032,null,-27.944727708657808,-142.14614629898787,-16.70012144918481,-166.6711107648909,0,0]
[103520,103.52,79.904852007951078,1.558281115510066,1.0131345583896938,0.16119793827256887,1,0,696.61696931109668,1.5693608171999509,13.695698788121577,1.4977156683437138,1.0682350764503166,0.35935587325677515,1.0000000053581952,1.0351999963021309E-4,1.0000000053581952,1.0351999963021309E-4,1.5840352709103611,1.0903580384293035,-16.873747365484672,-167.20849190948829,12.791508090511712,null,103520,10716390400,null,11.231770047623842,-24.694539561117892,null,-28.105517413108515,-142.51988360745116,-16.873747365484675,-167.21442316856906,0,0]
[104710,104.71,80.823244258622225,1.5584233328029804,1.0134362534713781,0.16301849205001742,1,0,704.62481798701708,1.5693771313448373,13.852301223346567,1.4985433056351991,1.0697613849881302,0.36313484610146968,1.0000000054820919,1.0470999961731343E-4,1.0000000054820919,1.0470999961731343E-4,1.5955444410869095,1.0984785334880522,-17.046229699737843,-167.74756602815799,12.252433971842009,null,104710,10964184100,null,11.21884528615827,-24.864573364086329,null,-28.265074985896113,-142.88899210512946,-17.046229699737843,-167.7535654692158,0,0]
[105930,105.93,81.764790913552858,1.5585658187712153,1.0137490392386683,0.16488381084952097,1,0,712.83454539124466,1.5693934762534019,14.012861246600268,1.4993726030174055,1.0713419854218995,0.36699785222125214,1.0000000056105824,1.0592999960378067E-4,1.0000000056105824,1.0592999960378067E-4,1.6074184947700414,1.1067233647798291,-17.221893768279564,-168.29593431492466,11.704065685075335,null,105930,11221164900,null,11.205502971814225,-25.039328565498376,null,-28.427396740093791,-143.26267509133436,-17.221893768279564,-168.30200365683274,0,0]
[107150,107.15,82.706339190696994,1.5587050605551582,1.0140653500756849,0.16674797245823564,1,0,721.04427298157384,1.569409448959453,14.173430688630061,1.5001831108849382,1.0729385260525348,0.37084941931087817,1.0000000057405611,1.0714999958993258E-4,1.0000000057405611,1.0714999958993258E-4,1.6193674427778464,1.1148879982960715,-17.396397130465797,-168.83998785780949,11.16001214219051,null,107150,11481122500,null,11.192068059376048,-25.214483593017938,null,-28.588465189841841,-143.63164350754988,-17.396397130465793,-168.84612710056783,0,0]
[108400,108.4,83.671041919601649,1.5588444760082503,1.0143930917580999,0.16865676147301731,1,0,729.45587930565762,1.569425441534265,14.337957997701906,1.5009947200361404,1.0745907845546123,0.37478376674881186,1.00000000587528,1.0839999957541311E-4,1.00000000587528,1.0839999957541311E-4,1.6316871061593787,1.1231714569403417,-17.574008475706329,-169.39298185273267,10.607018147267326,null,108400,11750560000,null,11.178207064908555,-25.394319624617324,null,-28.752215540614891,-144.00487309059733,-17.574008475706336,-169.39919271521467,0,0]
[109650,109.65,84.635746237718848,1.5589807132633433,1.0147245269615852,0.1705643105146912,1,0,737.86748581205518,1.569441069481966,14.502494537025838,1.5017879136460253,1.0762596255223744,0.37870597359725616,1.0000000060115612,1.0964999956055487E-4,1.0000000060115612,1.0964999956055487E-4,1.6440838093101697,1.1313732218910106,-17.750442897389551,-169.94152272835049,10.058477271649508,null,109650,12023122500,null,11.164249573396432,-25.574494292878949,null,-28.91469247078598,-144.37331091767714,-17.750442897389547,-169.94780521055608,0,0]
[110925,110.925,85.619746223695429,1.5591165124902286,1.0150663921822478,0.17250871998718681,1,0,746.44732463000832,1.5694566471334828,14.670330994061317,1.5025786410122295,1.0779788466919276,0.38269405097714049,1.0000000061521777,1.1092499954504645E-4,1.0000000061521777,1.1092499954504645E-4,1.6568070191545743,1.1396561481793654,-17.929214318777269,-170.49648785644635,9.5035121435536496,null,110925,12304355625,null,11.149913966019064,-25.758581488185889,null,-29.079128284796329,-144.7442619025841,-17.929214318777266,-170.50284339076998,0,0]
[112200,112.2,86.60374775274218,1.5592492257873156,1.0154120925004617,0.17445181284090294,1,0,755.02716362498018,1.569471870748093,14.83817641620923,1.5033514798661107,1.0797151580991691,0.38666936480182923,1.0000000062944199,1.1219999952917739E-4,1.0000000062944199,1.1219999952917739E-4,1.6696087974990592,1.1478566715357876,-18.106802707552639,-171.04690362385679,8.9530963761432076,null,112200,12588840000,null,11.135478910349562,-25.942942037086215,null,-29.242281617902201,-145.11039017321229,-18.106802707552639,-171.05333221029852,0,0]
[113510,113.51,87.614762641011851,1.5593824773151299,1.0157712729736785,0.1764468601689303,1,0,763.84252779007534,1.5694871560571166,15.010638381291173,1.5041275318420455,1.0815168468266347,0.39074044385367379,1.0000000064422601,1.1350999951249271E-4,1.0000000064422601,1.1350999951249271E-4,1.6828430290167942,1.1561978285501615,-18.288054842643731,-171.60773554706614,8.3922644529338584,null,113510,12884520100,null,11.120544588760467,-26.132608965829512,null,-29.408599431404191,-145.48163022514868,-18.288054842643724,-171.6142391909782,0,0]
[114820,114.82,88.625779049473039,1.5595126886579773,1.0161344935661842,0.17844048915496141,1,0,772.65789212956292,1.5695020925815921,15.183109181254036,1.5048859533180212,1.0833364004793626,0.39479791453324642,1.0000000065918162,1.1481999949541845E-4,1.0000000065918162,1.1481999949541845E-4,1.6961585960308789,1.1644547228353996,-18.468100120154709,-172.16385711382179,7.8361428861782088,null,114820,13183632400,null,11.105506490113473,-26.322486361631615,null,-29.573606610268186,-145.84794945357245,-18.468100120154713,-172.17043581520406,0,0]
[116155,116.155,89.656091174941949,1.5596423636637291,1.016508797872435,0.18047069046955375,1,0,781.64148878624133,1.5695169675398675,15.358880189940768,1.5056413241344526,1.0852089649746623,0.39891875037020141,1.000000006745992,1.1615499947761287E-4,1.000000006745992,1.1615499947761287E-4,1.7098111536976111,1.1727839013640307,-18.650360779192706,-172.72579447885516,7.274205521144836,null,116155,13491984025,null,11.090075335411754,-26.516165575957441,null,-29.740436114604456,-146.21628409414475,-18.650360779192702,-172.7324496701022,0,0]
[117490,117.49,90.686404773775479,1.5597690921235818,1.0168872888461884,0.18249938883678768,1,0,790.62508561193863,1.5695315044602305,15.534659763857405,1.5063796008462536,1.0870998940472583,0.40302531996853103,1.0000000069019499,1.1748999945939327E-4,1.0000000069019499,1.1748999945939327E-4,1.7235465840511826,1.1810283846999492,-18.831410009300839,-173.28293911133343,6.7170608886665661,null,117490,13803900100,null,11.074537857044033,-26.709987446924863,null,-29.905947866344874,-146.57968334552024,-18.831410009300839,-173.28967079244509,0,0]
[118860,118.86,91.743731819372542,1.5598961837264869,1.017280050653552,0.18457969574093905,1,0,799.8442076177987,1.569546082996174,15.715056394600824,1.5071200616595244,1.0890593908012491,0.40722465334252334,1.0000000070638497,1.1885999944026054E-4,1.0000000070638497,1.1885999944026054E-4,1.7377274767152187,1.1894024162387009,-19.015967547674947,-173.84976037638634,6.1502396236136576,null,118860,14127699600,null,11.05848331684679,-26.909001535336259,null,-30.074450864521737,-146.94756901737873,-19.015967547674947,-173.85657055271497,0,0]
[120230,120.23,{"$f":"SQRT(1+(A589/pole1)^2)","v":92.801060313072341},{"$f":"ATAN(A589/pole1)","v":1.5600203792960645},{"$f":"SQRT(1+(A589/Zero1)^2)","v":1.0176772115109309},{"$f":"ATAN(A589/Zero1)","v":0.18665838790524714},{"$f":"IF(VIN_nom>Vout, 1, SQRT(1+(A589/z_RHP)^2))","v":1},{"$f":"IF(VIN_nom>Vout, 0, -ATAN(A589/z_RHP))","v":0},{"$f":"SQRT(1+(A589/Pole2)^2)","v":809.06332978977866},{"$f":"ATAN(A589/Pole2)","v":1.5695603292928533},15.895461446056052,1.5078437151875768,{"$f":"SQRT(1+(A589/pole4)^2)","v":1.0910380232841017},{"$f":"ATAN(A589/pole4)","v":0.41140882902827086},{"$f":"SQRT(1+(A589/Zero3)^2)","v":1.0000000072276265},{"$f":"ATAN(A589/Zero3)","v":1.2022999942068166E-4},{"$f":"SQRT(1+(A589/pole5)^2)","v":1.0000000072276265},{"$f":"ATAN(A589/pole5)","v":1.2022999942068166E-4},{"$f":"SQRT((1-(Z589/pterm2))^2+(A589/pterm1)^2)","v":1.7519940393422},{"$f":"IF((ATAN((A589/pterm1)/(1-A589^2/pterm2))>0),ATAN((A589/pterm1)/(1-A589^2/pterm2)),PI()+ATAN((A589/pterm1)/(1-A589^2/pterm2)))","v":1.197690191536253},{"$f":"20*LOG10(((E589*K589*G589*O589)/(C589*I589*S589*M589*Q589))*Adc)","v":-19.199291753007767},{"$f":"((F589+L589+H589+R589)-(D589+J589+T589+N589))*radconv","v":-174.4116415891842},{"$f":"IF(V589>0,V589,V589+180)","v":5.5883584108158004},null,{"$f":"IF(U589<0,A589,1000000000)","v":120230},{"$f":"A589^2","v":14455252900},null,{"$f":"20*LOG10((K589/(I589*M589))*AEA*Afb)","v":11.042318529874414},{"$f":"(L589-(J589+N589))*radconv","v":-27.108091102784609},null,{"$f":"20*LOG10((E589*G589/(C589*S589))*Am)","v":-30.241610282882185},{"$f":"(F589+H589-(D589+T589))*radconv","v":-147.31043915794515},-19.19929175300777,-174.41853026072977,0,0]
[126030,{"$f":"A590/1000","v":126.03},97.277356482944597,1.5605162611181098,1.0194072373449867,0.19544043355700227,1,0,848.09319179554541,1.5696172108187361,16.659307048321086,1.5107337141571868,1.0996243118983611,0.42895351431592549,1.0000000079417803,1.2602999933273163E-4,1.0000000079417803,1.2602999933273163E-4,1.8133244749405184,1.2318545129570542,-19.962207182472476,-176.73692923534648,3.26307076465352,null,126030,15883560900,null,10.972684259134102,-27.95100185122519,null,-30.934891441606574,-148.79314837118332,{"$f":"AB590+AE590","v":-19.962207182472472},-176.74415022240851,{"$f":"SUM((U591<0)*(U590>0))*A590","v":0},0]
[131830,131.83000000000001,101.75367446861024,1.5609685136662248,1.0212156143634208,0.20419204958186041,1,0,887.12305630387323,1.5696690872257386,17.423279590097604,1.5133702933522817,1.1085437787792818,0.44622111199427328,1.0000000086895744,1.3182999923630226E-4,1.0000000086895744,1.3182999923630226E-4,1.876124012157983,1.2646035913376776,-20.704816347867009,-178.97873030492869,1.0212696950713109,null,131830,17379148900,null,10.901167606504929,-28.792269760432312,null,-31.60598395437194,-150.19401384707453,-20.704816347867009,-178.98628360750683,0,0]
[144540,144.54,111.56304854447572,1.5618326654000474,1.0254503785219045,0.22325805196843462,1,0,972.65230115204974,1.5697682099899641,19.097802661259724,1.5184103247805423,1.1292157593111427,0.48307587460435897,1.0000000104459057,1.4453999899343253E-4,1.0000000104459057,1.4453999899343253E-4,2.0186669455539232,1.3318864081897819,-22.267227075961479,-183.61866343763973,-3.6186634376397251,null,144540,20891811600,null,10.738280851421456,-30.620798901627339,null,-33.005507927382936,-153.00614606793502,-22.267227075961479,-183.62694496956237,0,0]
[158490,158.49,122.32951449402015,1.5626215936413037,1.0305235784468625,0.24399537195163143,1,0,1066.5258717209708,1.5698587028956192,20.936158566118163,1.5230138921582417,1.1536021550153635,0.52194726902898914,1.0000000125595401,1.5848999867295902E-4,1.0000000125595401,1.5848999867295902E-4,2.1825635281133815,1.3995076473102825,-23.890209569105856,-188.31790384350967,-8.3179038435096686,null,158490,25119080100,null,10.550694709768063,-32.589385628320073,null,-34.440904278873916,-155.73759902321896,-23.890209569105853,-188.32698465153902,0,0]
[173780,173.78,134.13025135200968,1.5633408180332118,1.0365877921023052,0.26648073663972427,1,0,1169.4166968394811,1.5699411995125716,22.95152616254337,1.5272124424123217,1.1822448109172354,0.5626424905644275,1.0000000150997441,1.7377999825064433E-4,1.0000000150997441,1.7377999825064433E-4,2.3707953412520353,1.4672652305820022,-25.572393244553737,-193.04797531135839,-13.047975311358385,null,173780,30199488400,null,10.336001053161221,-34.685217569388541,null,-35.908394297714963,-158.37271460244472,-25.572393244553744,-193.05793217183327,0,0]
[190550,190.55,147.07331032838675,1.5639969442075599,1.0438340925328504,0.29082845570762739,1,0,1282.2668769324512,1.5700164578617162,25.162358940493853,1.5310439559581774,1.2157977192486193,0.60499446762303777,1.0000000181546511,1.9054999769375417E-4,1.0000000181546511,1.9054999769375417E-4,2.5873063496945923,1.5351271817245384,-27.315569012685764,-197.78916154378052,-17.789161543780523,null,190550,36309302500,null,10.091535906177004,-36.896589541863037,null,-37.407104918862771,-160.90348971258405,-27.315569012685767,-197.8000792544471,0,0]
[208930,208.93,161.25902520071523,1.5645950837449651,1.0524763005165116,0.31711125284693326,1,0,1405.9512195959192,1.5700850645047277,27.58579522831991,1.5345378416473414,1.2549335087116307,0.64872466347072699,1.0000000218258722,2.0892999695994706E-4,1.0000000218258722,2.0892999695994706E-4,2.8365368200151693,1.602986774861775,-29.118908034358036,-202.51385588655893,-22.513855886558929,null,208930,43651744900,null,9.8151945944760453,-39.205891170855779,null,-38.934102628834083,-163.31993552275631,-29.118908034358036,-202.52582669361209,0,0]
[229090,229.09,176.81860224724602,1.5651407831011173,1.062776884892942,0.34542608631495092,1,0,1541.6137040592678,1.5701476558162357,30.244249916880584,1.5377261630900927,1.3004416250212409,0.69356863280249281,1.0000000262411137,2.2908999599228225E-4,1.0000000262411137,2.2908999599228225E-4,3.1242510185893808,1.6708449168809865,-30.983903807151524,-207.19991080191863,-27.199910801918634,null,229090,52482228100,null,9.5048316793333179,-41.596170208494229,null,-40.488735486484842,-165.61686648333844,-30.983903807151524,-207.21303669183266,0,0]
[251190,251.19,193.87553018343334,1.5656383554244042,1.075027518788515,0.37581514973403402,1,0,1690.3310167080731,1.5702047266595105,33.158821999170648,1.5406338667074948,1.3531181307811626,0.73916137327885478,1.0000000315482076,2.5118999471693726E-4,1.0000000315482076,2.5118999471693726E-4,3.4570741249436954,1.7386056615352603,-32.909205998080544,-211.81733535158392,-31.817335351583921,null,251190,63096416100,null,9.1591361946748382,-44.045112590124212,null,-42.068342192755381,-167.78661488802931,-32.909205998080544,-211.83172747815351,0,0]
[275420,275.42,212.57645226047347,1.5660921195431678,1.0895722154515837,0.40831445988293352,1,0,1853.3817226712945,1.5702567725108074,{"$f":"SQRT(1+(A599/Zero2)^2)","v":36.354568833900572},{"$f":"ATAN(A599/Zero2)","v":1.5432859978435587},1.4138473681199784,0.78513912433784228,1.0000000379280876,2.7541999303589765E-4,1.0000000379280876,2.7541999303589765E-4,3.8433003297618482,1.8062027198406203,-34.894233482089277,-216.33825586277825,-36.338255862778254,null,275420,75856176400,null,8.7771356986169504,-46.53046976695606,null,-43.671369180706222,-169.82356649903477,-34.89423348208927,-216.35403626599083,0,0]
[302000,302,233.0911663918973,1.5665061467632229,1.1068138278115947,0.44294275063736921,1,0,2032.2462658357892,1.5703042604261863,39.860506891069981,1.5457062061533098,1.4836046580880544,0.83114009191486782,1.0000000456019988,3.0199999081879784E-4,1.0000000456019988,3.0199999081879784E-4,4.2932588008758703,1.8735660779180434,-36.938596476706536,-220.73575058922677,-40.735750589226768,null,302000,91204000000,null,8.3582696994945387,-49.030184200931963,null,-45.296866176201071,-171.7228697132015,-36.938596476706536,-220.75305391413346,0,0]
[331130,331.13,255.57403460830076,1.5668835562618255,1.127183799371879,0.47962774549235498,1,0,2228.270504313904,1.5703475482324953,43.703016471963224,1.5479126138740691,1.5633179972986344,0.87673380630640974,1.000000054823537,3.3112998789752197E-4,1.000000054823537,3.3112998789752197E-4,4.8188214862897363,1.9404884490382193,-39.038129301531399,-224.97656934842684,-44.976569348426835,null,331130,109647076900,null,7.9032272999566047,-51.518573969056895,null,-46.941356601487996,-173.47696773016838,-39.038129301531391,-224.99554169922527,0,0]
[363080,363.08,280.23344599759935,1.5672278657970944,1.1512038469731178,0.51831359171756342,1,0,2443.2713465970764,1.5703870394558901,47.917712984322826,1.5499257021643205,1.6541027520467493,0.92158625961581042,1.0000000659135411,3.630799840454084E-4,1.0000000659135411,3.630799840454084E-4,5.4353921394779201,2.0068406408465265,-41.191530642607745,-229.03640856585608,-49.036408565856078,null,363080,131827086400,null,7.4125417216528087,-53.975351464910126,null,-48.60407236426056,-175.08186005168119,-41.191530642607752,-229.05721151659131,0,{"$f":"IF(AI602>0,W602,0)","v":0}]
[398110,398.11,307.27007183724714,1.5675418550551423,1.1794330326431108,0.55885076341715501,1,0,2678.9984083045151,1.5704230529548964,52.538894516572213,1.5517616592751005,1.7570445600394047,0.96533977785579417,1.0000000792457828,3.9810997896764209E-4,1.0000000792457828,3.9810997896764209E-4,6.1610267292340186,2.072375711429113,-43.394283592249316,-232.88842862306478,-52.888428623064783,null,398110,158491572100,null,6.8878177890010708,-56.379114229340395,null,-50.282101381250385,-176.53212441532739,-43.394283592249316,-232.91123864466778,0,0]
[436520,436.52,336.91545616523672,1.567828218772602,1.2125026037180529,0.60105316255875729,1,0,2937.4704767185576,1.5704558978349323,57.606137275004777,1.5534361933419119,1.8733353389362439,1.0076997261666416,1.0000000952748507,4.3651997227374997E-4,1.0000000952748507,4.3651997227374997E-4,7.0179573210159258,2.1368456237500384,-45.642181397917341,-236.51145425146981,-56.511454251469814,null,436520,190549710400,null,6.3308981812202898,-58.712098628935586,null,-51.973079579137632,-177.82436637464724,-45.642181397917341,-236.53646500358283,0,0]
[478630,478.63,369.41657952823766,1.568089352401481,1.25109900381585,0.6446714369268518,1,0,3220.8409249678339,1.5704858488671249,63.16165727412978,1.554963275141384,2.0042170331931528,1.0484119170076036,1.0000001145433319,4.7862996345075299E-4,1.0000001145433319,4.7862996345075299E-4,8.0329256003545897,2.1999663157479237,-47.929975357037051,-239.88826704144478,-59.888267041444777,null,478630,229086676900,null,5.7440936487300052,-60.958956067076997,null,-53.674069005767052,-178.9567344512534,-47.929975357037044,-239.91569051833039,0,0]
[524810,524.80999999999995,405.05901342208136,1.5683275482152925,1.2959881439516183,0.68942484159380202,1,0,3531.5995907597098,1.570513168982788,69.254268171144943,1.5563562817299821,2.1510767409629947,1.0872933474147202,1.0000001377127585,5.2480995181798282E-4,1.0000001377127585,5.2480995181798282E-4,9.2387721922549417,2.261472464484247,-50.253043186862676,-243.00862406456804,-63.008624064568039,null,524810,275425536100,null,5.1296874476052743,-63.10844986225527,null,-55.382730634467947,-179.9302435976328,-50.253043186862669,-243.03869345988807,0,0]
[575440,575.44000000000005,444.13604769008617,1.5685447625498303,1.347973838602196,0.73496509440478408,1,0,3872.3036047353812,1.5705380825782262,75.934104071798387,1.5576266328923305,2.3153249273045868,1.124192650218619,1.000000165565583,5.7543993648463459E-4,1.000000165565583,5.7543993648463459E-4,10.674484819637252,2.3210700023678488,-52.605315392472534,-245.86640775549509,-65.866407755495089,null,575440,331131193600,null,4.4904143092718476,-65.151265865997189,null,-57.095729701744375,-180.74811216925946,-52.605315392472527,-245.89937803525663,0,0]
[630960,630.96,486.98728128670729,1.5687428836328297,1.4079411695028157,0.78093316986906314,1,0,4245.9138550273283,1.5705608062348031,83.259216092432823,1.5587853556226576,2.4985581839174396,1.159027617583021,1.000000199055241,6.3095991626941511E-4,1.000000199055241,6.3095991626941511E-4,12.387742128754484,2.3785137374070908,-54.981868118985197,-248.46289371760392,-68.462893717603919,null,630960,398110521600,null,3.8287372393282109,-67.082074525202984,null,-58.810605358313396,-181.41697053268643,-54.981868118985183,-248.49904505788942,0,0]
[691830,691.83,533.96774964856513,1.5689235534200905,1.476810447877088,0.82693415076038934,1,0,4655.5258156112841,1.5705815282850621,91.29029500584484,1.5598420408041143,2.7024346082122745,1.1917477960763758,1.0000002393143459,6.9182988962345599E-4,1.0000002393143459,6.9182988962345599E-4,14.435269905516744,2.4335674577018303,-57.377086269501795,-250.80381332228464,-70.80381332228464,null,691830,478628748900,null,3.1473173515453983,-68.89744634471252,null,-60.524403621047192,-181.94600591043383,-57.377086269501795,-250.84345225514636,0,0]
[758580,758.58,585.48651550345915,1.5690883446984332,1.555586773216211,0.87259069554753566,1,0,5104.7060108688893,1.5706004291263009,100.09726806831871,1.56080587796111,2.9288438285278047,1.2223566596803315,1.0000002877217669,7.5857985449337743E-4,1.0000002877217669,7.5857985449337743E-4,16.886207157124677,2.4860599798062175,-59.786786095900062,-252.90072116468238,-72.900721164682381,null,758580,575443616400,null,2.4484092911167696,-70.597064184051376,null,-62.235195387016837,-182.34712040476686,-59.786786095900069,-252.94418458881825,0,0]
[831760,831.76,641.96807804518778,1.5692386163126941,1.6452990658700122,0.91751892517733791,1,0,5597.1555510231774,1.5706176646161873,109.7527020987351,1.5616848077375862,3.1797438124719086,1.2508761960945529,1.000000345912289,8.3175980818937605E-4,1.000000345912289,8.3175980818937605E-4,19.822537697309674,2.5358425578179751,-62.206238631994886,-254.7679494925267,-74.767949492526697,null,831760,691824697600,null,1.7344180821007571,-72.181741810214547,null,-63.940656714095645,-182.6338640089445,-62.206238631994886,-254.81560581915903,0,0]
[912010,912.01,703.90640010527773,1.5693756828907894,1.7470807255812646,0.96138677972986963,1,0,6137.1811825307914,1.5706333855398344,120.34103926482422,1.5624865139909407,3.4574028927189264,1.2773693249700881,1.0000004158810336,9.1200974714163261E-4,1.0000004158810336,9.1200974714163261E-4,23.344319232289429,2.582840831488995,-64.632562879399899,-256.42347548015681,-76.42347548015681,null,912010,831762240100,null,1.0072002442736356,-73.65465264041049,null,-65.639763123673532,-182.82107714919201,-64.632562879399899,-256.4757297896025,0,0]
[1000000,1000,771.81859914072629,1.5695006852012701,1.8620958876044773,1.0038848213362384,1,0,6729.2915306020268,1.5706477227406461,131.95068064899863,1.563217665071962,3.7641984199791607,1.3019070292634429,1.0000004999998751,9.9999966666686679E-4,1.0000004999998751,9.9999966666686679E-4,27.570459695304002,2.6270073725967555,-67.062544678597106,-257.88603060008575,-77.886030600085746,null,1000000,1000000000000,null,0.26869947025733404,-75.019489126886924,null,-67.331244148854452,-182.9238372336788,-67.062544678597121,-257.94332636056572,0,0]
[]
[]
["Pole/Zero Locations for Chart"]
[{"$f":"Q4*1000","v":24690},null,{"$f":"SQRT(1+(A617/pole1)^2)","v":19.082405379459651},{"$f":"ATAN(A617/pole1)","v":1.5183680166135811},{"$f":"SQRT(1+(A617/Zero1)^2)","v":1.0007517764582905},{"$f":"ATAN(A617/Zero1)","v":3.8763534075907997E-2},{"$f":"IF(VIN_nom>Vout, 1, SQRT(1+(A617/z_RHP)^2))","v":1},{"$f":"IF(VIN_nom>Vout, 0, -ATAN(A617/z_RHP))","v":0},{"$f":"SQRT(1+(A617/Pole2)^2)","v":166.14921542643054},{"$f":"ATAN(A617/Pole2)","v":1.5647776041968839},{"$f":"SQRT(1+(A617/Zero2)^2)","v":3.4077935975786406},{"$f":"ATAN(A617/Zero2)","v":1.2729678226936805},{"$f":"SQRT(1+(A617/pole4)^2)","v":1.0040059196581939},{"$f":"ATAN(A617/pole4)","v":8.9359861077393438E-2},{"$f":"SQRT(1+(A617/Zero3)^2)","v":1.000000000304798},{"$f":"ATAN(A617/Zero3)","v":2.4689999994983023E-5},{"$f":"SQRT(1+(A617/pole5)^2)","v":1.000000000304798},{"$f":"ATAN(A617/pole5)","v":2.4689999994983023E-5},{"$f":"SQRT((1-(A617^2/(pole3^2)))^2+(A617/(Q*pole3))^2)","v":1.0401911029159268},{"$f":"ATAN((A617/(Q*pole3))/(1-A617^2/pole3^2))","v":0.32793104596830835},{"$f":"20*LOG10(((E617*K617*G617*O617)/(C617*I617*S617*M617*Q617))*Adc)","v":1.7580415988156753E-2},{"$f":"((F617+L617+H617+R617)-(D617+J617+T617+N617))*radconv","v":-125.40215441221669},{"$f":"IF(V617>0,V617,V617+180)","v":54.597845587783311},"crossover",null,null,null,12.138078092775368,{"$f":"(L617-(J617+N617))*radconv","v":-21.839411823333435},null,{"$f":"20*LOG10((E617*G617/(C617*S617))*Am)","v":-12.120497676787208},{"$f":"(F617+H617-(D617+T617))*radconv","v":-103.56415722168074}]
[{"$f":"A617","v":24690},null,null,null,null,null,null,null,null,null,null,null,null,null,null,null,null,null,null,null,null,-180]
[{"$f":"A618","v":24690}]
[1000000]
[]
[{"$f":"pole1","v":1295.642318619256},null,1.4142135623730951,0.78539816339744828,1.0000020709974156,2.0351873826899274E-3,{"$f":"IF(VIN_nom>Vout, 1, SQRT(1+(A622/z_RHP)^2))","v":1},{"$f":"IF(VIN_nom>Vout, 0, -ATAN(A622/z_RHP))","v":0},8.775915052163862,1.4566000555126997,1.0145077356980359,0.16931913462821274,1.00001105342601,4.7017707718996328E-3,{"$f":"SQRT(1+(A622/Zero3)^2)","v":1.0000000000008393},{"$f":"ATAN(A622/Zero3)","v":1.2956423186185309E-6},{"$f":"SQRT(1+(A622/pole5)^2)","v":1.0000000000008393},{"$f":"ATAN(A622/pole5)","v":1.2956423186185309E-6},{"$f":"SQRT((1-(A622^2/(pole3^2)))^2+(A622/(Q*pole3))^2)","v":1.0001125760309195},{"$f":"ATAN((A622/(Q*pole3))/(1-A622^2/pole3^2))","v":1.758009330619658E-2},{"$f":"20*LOG10(((E622*K622*G622*O622)/(C622*I622*S622*M622*Q622))*Adc)","v":38.009107080712567},{"$f":"((F622+L622+H622+R622)-(D622+J622+T622+N622))*radconv","v":-119.91573884039488},60.08426115960512,"p1",null,null,null,27.192466839807604,{"$f":"(L622-(J622+N622))*radconv","v":-74.025155520449019},null,{"$f":"20*LOG10((E622*G622/(C622*S622))*Am)","v":10.816640240904963},{"$f":"(F622+H622-(D622+T622))*radconv","v":-45.890657554782564}]
[{"$f":"Zero1","v":636619.77309502545},null,491.35558663394579,1.5687611394122067,1.4142135623730951,0.78539816339744828,1,0,4284.0001167133496,1.5705629000951213,84.005952170069477,1.5588921272365868,2.5173938075880171,1.1622930349095562,1.0000002026423473,6.3661968709095428E-4,1.0000002026423473,6.3661968709095428E-4,12.570631051059136,-0.75763308935020335,-55.213367323356898,-68.700909856725019,111.29909014327498,"z1",null,null,null,3.7634923084812515,{"$f":"(L623-(J623+N623))*radconv","v":-67.263171563078458},null,-58.976859631838146,-1.4742139149134819]
[{"$f":"Pole2","v":148.60405534431035},null,1.0065560126953255,0.11419627128219702,1.0000000272440126,2.3342669977528604E-4,1,0,1.4142135623730951,0.78539816339744828,1.0001922152828902,1.960533085720469E-2,1.0000001454086862,5.3927482525913638E-4,1.0000000000000111,1.4860405534430927E-7,1.0000000000000111,1.4860405534430927E-7,1.0000014810092703,2.016475182049044E-3,56.695800386526464,-50.552712534091668,129.44728746590835,"p2",null,null,{"$f":"Pole2","v":148.60405534431035},42.924671985884046,{"$f":"(L624-(J624+N624))*radconv","v":-43.907595507581313},null,13.771128400642411,-6.6451255408955507]
[{"$f":"Zero2","v":7578.8068225598272},null,5.9343215626375772,1.4014771921666838,1.0000708591674936,1.190419955830983E-2,1,0,51.009802979427384,1.5511909959376919,1.4142135623730951,0.78539816339744828,1.0003781365266842,2.7496087325038724E-2,1.0000000000287192,7.5788068224147232E-6,1.0000000000287192,7.5788068224147232E-6,1.0038457436836294,0.10262638622287565,13.115001286070637,-130.94839955783183,49.051600442168166,"z2",null,null,{"$f":"Zero2","v":7578.8068225598272},14.787247008305025,{"$f":"(L625-(J625+N625))*radconv","v":-45.452107094709049},null,-1.6722457222343881,-85.496726696767922]
[{"$f":"pole3","v":200000},null,154.36682933578095,1.5643182058237073,1.0481870271021962,0.30439579703788294,1,0,1345.858662770087,1.5700533066549103,26.408318480156222,1.5329204151490212,1.2356243724526255,0.62782422372778623,1.0000000199999999,1.999999973333334E-4,1.0000000199999999,1.999999973333334E-4,2.7138920229838357,{"$error":"#DIV/0!"},-28.255855008095377,{"$error":"#DIV/0!"},{"$error":"#DIV/0!"},"p3",null,null,null,9.9504003761869075,{"$f":"(L626-(J626+N626))*radconv","v":-38.099236303618653},null,-38.206255384282287,{"$error":"#DIV/0!"}]
[{"$f":"Fp2_u","v":275562.72605040763},null,{"$f":"SQRT(1+(A627/pole1)^2)","v":212.68660957005238},{"$f":"ATAN(A627/pole1)","v":1.5660945560229971},{"$f":"SQRT(1+(A627/Zero1)^2)","v":1.0896612538263459},{"$f":"ATAN(A627/Zero1)","v":0.40850329188534046},1,0,{"$f":"SQRT(1+(A627/Pole2)^2)","v":1854.3421677231647},{"$f":"ATAN(A627/Pole2)","v":1.5702570519696375},{"$f":"SQRT(1+(A627/Zero2)^2)","v":36.373393970399469},{"$f":"ATAN(A627/Zero2)","v":1.5433002394698578},{"$f":"SQRT(1+(A627/pole4)^2)","v":1.4142135623730951},{"$f":"ATAN(A627/pole4)","v":0.78539816339744828},1.0000000379674072,2.7556271907547302E-4,1.0000000379674072,2.7556271907547302E-4,3.8456424509357876,-1.3350102700013526,-34.905567986080726,-36.363362804723309,{"$f":"IF(V627>0,V627,V627+180)","v":143.63663719527671},"p4",null,null,null,null,null,null,-43.680450881018842,10.165360253012205]
[{"$f":"z_RHP","v":0},null,{"$f":"SQRT(1+(A628/pole1)^2)","v":1},{"$f":"ATAN(A628/pole1)","v":0},{"$f":"SQRT(1+(A628/Zero1)^2)","v":1},{"$f":"ATAN(A628/Zero1)","v":0},1,0,{"$f":"SQRT(1+(A628/Pole2)^2)","v":1},{"$f":"ATAN(A628/Pole2)","v":0},{"$f":"SQRT(1+(A628/Zero2)^2)","v":1},{"$f":"ATAN(A628/Zero2)","v":0},{"$f":"SQRT(1+(A628/pole4)^2)","v":1},{"$f":"ATAN(A628/pole4)","v":0},1,0,1,0,1,0,59.761203782283907,0,{"$f":"IF(V628>0,V628,V628+180)","v":180},"z_RHP",null,null,null,null,null,null,13.827899977053281,0]
[{"$f":"Fp2_u","v":275562.72605040763},null,null,null,null,null,null,null,null,null,null,null,null,null,null,null,null,null,null,null,-25]
[]
[null,null,null,"System","Plant"]
["p1","p-dom",{"$f":"pole1","v":1295.642318619256},{"$f":"U622","v":38.009107080712567},{"$f":"AE622","v":10.816640240904963}]
["z1","ESR zero",{"$f":"Zero1","v":636619.77309502545},{"$f":"U623","v":-55.213367323356898},{"$f":"AE623","v":-58.976859631838146}]
["p2","EA pole",{"$f":"Pole2","v":148.60405534431035},{"$f":"U624","v":56.695800386526464},{"$f":"AE624","v":13.771128400642411}]
["z2","EA zero",{"$f":"Zero2","v":7578.8068225598272},{"$f":"U625","v":13.115001286070637},{"$f":"AE625","v":-1.6722457222343881}]
["p3","p_sampling",{"$f":"pole3","v":200000},{"$f":"U626","v":-28.255855008095377},{"$f":"AE626","v":-38.206255384282287}]
[]
[]
[{"$f":"Q4*1000","v":24690}]
[{"$f":"Q4*1000","v":24690}]
[]
[]
[]
[]
[]
[]
[]
[]
[]
[]
[]
[]
[]
[]
[]
[]
[]
[]
[]
[]
[]
[]
[]
[]
[]
[]
[]
[]
[]
[]
[]
[]
[]
[]
[]
[]
[]
[]
[]
[]
[]
[]
[]
[]
[]
[]
[null,null,null,null,null,null,null,null,null,null,null,null,null,null,null,null,null,null,null,null,null,null,null,null,null,null,null,null,null,null,null,null,null,null,"phase margin",{"$f":"SUM(AJ689:AJ1306)","v":0}]

{"sheet":"Bode Plot Management","index":7,"n_rows":6,"n_cols":6,"rows_kept":6,"cut":false,"hidden":true,"merged":[]}
[]
[{"$f":"CHOOSE(BODE_PLOT_TYPE, \"BODE_PLOT_Ch1\", \"BODE_PLOT_Ch2\")","v":"BODE_PLOT_Ch1"}]
[]
[]
[]
[null,null,null,null,null,{"$f":"INDIRECT(A2)","v":0}]

{"sheet":"Efficiency Calculations","index":8,"n_rows":109,"n_cols":57,"rows_kept":109,"cut":false,"hidden":true,"merged":[[6,24,6,26],[0,0,3,3],[5,0,6,3],[6,6,6,13],[6,17,6,20],[6,21,6,23],[6,51,6,56],[6,27,6,32],[6,33,6,36],[6,38,6,42],[6,45,6,49]]}
["BUCK CONTROLLER POWER DESIGN TOOL",null,null,null,null,null,null,null,null,null,null,null,null,null,null,null,null,null,null,null,null,null,null,null,null,null,null,null,null,null,null,null,null,null,null,null,null,null,null,null,{"$f":"Ext_VCC","v":1}]
[null,null,null,null,null,null,null,{"$f":"AV19","v":0.88702496694648336},"10% load"]
[null,null,null,null,null,null,null,{"$f":"AV59","v":0.94022173085789817},"50% load",null,null,null,null,null,null,null,null,null,null,null,null,null,null,null,null,null,null,null,null,null,null,null,null,null,null,null,null,null,null,{"$f":"IF(MODE=1, (Qg_Q1+Qg_Q2)*Fsw*Vin, (Qg_Q1+Qg_Q2+Qg_Q3+Qg_Q4)*Fsw*Vin)","v":0.12191999999999999}]
[null,null,null,null,null,null,null,{"$f":"AV109","v":0.92767957121736921},"100% load",null,null,null,null,null,null,null,null,null,null,null,3,null,null,null,null,null,null,null,null,null,null,null,1,null,null,null,2,null,"I_VCC",{"$f":"(Qg_Q1+Qg_Q2)*Fsw*1000","v":5.0799999999999992},"mA",{"$f":"AN4*5/1000","v":2.5399999999999995E-2}]
[null,null,null,null,null,null,null,null,null,null,null,null,null,null,null,null,null,null,null,null,null,null,null,null,null,null,null,null,null,null,null,null,null,null,null,null,null,null,null,null,null,{"$f":"VCC","v":3.3}]
["Enter the values of your design and MOSFET datasheet specifications below. Note that thermal resistance (θJA) will change when components are placed on the PCB"]
[null,null,null,null,null,null,"Operating Point Condtions",null,null,null,null,null,null,null,null,null,null,"Filter Inductor",null,null,null,"Cout",null,null,"Cin",null,null,"High-side BUCK \"Control\" MOSFET Losses ",null,null,null,null,null,"Low-side BUCK \"Sync\" MOSFET Losses ",null,null,null,"Diode/FET","\"Controller\" Losses",null,null,null,null,null,null,"RESULTS",null,null,null,null,null,"Consolidated Buck Efficiency & Losses"]
["Input Parameters",null,null,null,null,null,"Step","Vin","Mode","Iout","Iout/ phase","Iin","Duty Cycle BUCK Leg","Ripple Current pk-pk","Peak Inductor Current","Valley Inductor Current","SW node voltage at Q1 turn-on","Irms Lf","DCR    Loss","Core Loss","Total Inductor Loss","Irms Cout","Cout ESR Loss","Total Cout Loss","Irms Cin","Cin ESR Loss","Total Cin Loss","Irms","RDS(on) Loss","Transition Loss (not including capacitive loss)","MOSFET Output Capacitance Loss","Dead Time Loss ","Total Control MOSFET Loss","Irms","RDS(on) Loss","Deadtime Loss","Total Sync MOSFET Loss","Reverse Recovery Loss","IQ Loss","Switching Current Loss","Switching Current Diss from VCC","LDO Loss Saved from Gate Drive Current (ext VCC = Vout)","Total \"Control\" Loss","Total Loss (not considering total loss)","Total Loss (considering total loss)","Total Loss","Pout","EFF, h",{"$f":"IF(Vin>Vout, \"Buck ''CONTROL'' MOSFET Temp Rise\", \"Boost ''CONTROL'' MOSFET Temp Rise\")","v":"Buck ''CONTROL'' MOSFET Temp Rise"},{"$f":"IF(Vin>Vout, \"Buck ''SYNC'' MOSFET Temp Rise\", \"Boost ''SYNC'' MOSFET Temp Rise\")","v":"Buck ''SYNC'' MOSFET Temp Rise"},null,"h","Inductor Cu & Core Loss","Total MOSFET Loss","Control MOSFET Loss","SYNC MOSFET Loss","IC Power Loss"]
["Design","Input Value","Units","Description",null,null,0,{"$f":"Vin","v":24},{"$f":"MODE","v":1},0,{"$f":"Iout*G9/100/Number_of_Phases","v":0},{"$f":"Vout*K9/(Vin*Efficiency)","v":0},{"$f":"(Vout+(Rdson2+Rs+Rdcr)*K9)/(Vin+(Rs+Rdson2-Rdson1)*K9)","v":0.20833333333333334},{"$f":"(Vin-(Rdson1+Rdcr)*K9-Vout)*M9/(Fsw*Lf)","v":1.4552696078431375},{"$f":"K9+N9/2","v":0.72763480392156876},{"$f":"K9-N9/2","v":-0.72763480392156876},{"$f":"IF(MIN(Vin, -P9/(Coss_Q1+Coss_Q2)*0.00000002)<0, 0, MIN(Vin, -P9/(Coss_Q1+Coss_Q2)*0.00000002))","v":14.00644473381268},{"$f":"SQRT(K9^2+(N9^2)/12)","v":0.42010014991585831},{"$f":"R9^2*Rdcr","v":4.7650716709018194E-3},{"$f":"Core_Loss","v":0.1},{"$f":"(T9+S9*(1+Ltc*(Ta-25)))/(1-S9*Ltc*ThetaCa)","v":0.10480825142292047},{"$f":"N9/SQRT(12)","v":0.42010014991585831},{"$f":"RCoutEsr*V9^2","v":3.5296827191865328E-4},{"$f":"W9","v":3.5296827191865328E-4},{"$f":"SQRT(M9*(1-M9))*SQRT(K9^2+(N9^2)/12)","v":0.17060957356055356},{"$f":"RCinEsr*Y9^2","v":5.8215253181027878E-5},{"$f":"Z9","v":5.8215253181027878E-5},{"$f":"SQRT(M9)*SQRT(K9^2+(N9^2)/12)","v":0.19174860710018135},{"$f":"Rdson1*AB9^2","v":2.720797096039619E-3},{"$f":"(Vin*K9/2)*Fsw*(Tr_buck+Tf_buck)","v":0},{"$f":"(0.5*Coss_Q1*(Vin-Q9)^2-0.5*Coss_Q2*(Vin-Q9)^2+(Qoss_Q2*(Vin-Q9)/Vin)*Vin)*Fsw","v":2.7921722909352534E-2},{"$f":"IF(K9>N9/2,0,ABS(K9-N9/2)*Vsd_Q1*Deadtime*Fsw)","v":1.6299019607843141E-3},{"$f":"(AF9+AE9+AD9+AC9*(1+RdsonTC*(Ta-25))/(1-AC9*RdsonTC*ThetaJA_Q1))","v":3.2273103188484573E-2},{"$f":"SQRT((1-M9))*SQRT(K9^2+(N9^2)/12)","v":0.37378684786180871},{"$f":"Rdson2*AH9^2","v":4.3312148366684749E-3},{"$f":"IF(K9<N9/2,Deadtime*Fsw*Vsd_Q2*(K9+N9/2),2*Deadtime*Fsw*Vsd_Q2*K9)","v":1.6299019607843139E-3},{"$f":"(AJ9+AI9*(1+RdsonTC*(Ta-25)))/(1-AI9*RdsonTC*ThetaJA_Q2)","v":5.9634930810662087E-3},{"$f":"Qrr_Q2*K9/Iout*Fsw*Vin","v":0},{"$f":"Iq*Vin","v":8.3999999999999993E-4},{"$f":"IF(Ext_VCC=1,  (Qg_Q1+Qg_Q2)*Fsw*Vout, (Qg_Q1+Qg_Q2)*Fsw*Vin)","v":2.5399999999999999E-2},{"$f":"(Vin-VCC)*Fsw*(Qg_Q1+Qg_Q2)","v":0.10515599999999999},{"$f":"(Qg_Q1+Qg_Q2)*Fsw*(Vin-Vout)","v":9.6519999999999995E-2},{"$f":"SUM(AM9:AN9)","v":2.6239999999999999E-2},{"$f":"SUM(S9,T9,AC9,AD9,AE9,AF9,AI9,AJ9,AQ9, AL9)","v":0.16923861043453103},{"$f":"U9 + ((AF9+AE9+AD9+AC9*(1+RdsonTC*(Ta-25))) + (AJ9+AI9*(1+RdsonTC*(Ta-25))) + AQ9 + AL9) / (1-AC9*RdsonTC*ThetaJA_Q1 -AI9*RdsonTC*ThetaJA_Q2)","v":0.1693236468136585},{"$f":"AS9","v":0.1693236468136585},{"$f":"Vout*K9","v":0},{"$f":"AU9/(AU9+AT9)","v":0},{"$f":"ThetaJA_Q1*BC9","v":0.74228137333514521},{"$f":"ThetaJA_Q2*BD9","v":0.13716034086452281},null,{"$f":"AV9*100","v":0},{"$f":"U9","v":0.10480825142292047},{"$f":"AG9+AK9+AL9","v":3.8236596269550782E-2},{"$f":"AG9+AL9*0.66","v":3.2273103188484573E-2},{"$f":"AK9+AL9*0.33","v":5.9634930810662087E-3},{"$f":"AS9-BA9","v":6.4515395390738028E-2}]
[null,null,null,null,null,null,1,24,1,{"$f":"Iout*G10/100","v":3.5000000000000003E-2},3.5000000000000003E-2,8.1018518518518514E-3,0.20844253129681864,1.4557614890777282,{"$f":"K10+N10/2","v":0.76288074453886412},{"$f":"K10-N10/2","v":-0.69288074453886406},13.337454177841463,{"$f":"SQRT(K10^2+(N10^2)/12)","v":0.42169711811142802},4.8013684044340586E-3,0.1,0.10484489227792337,{"$f":"N10/SQRT(12)","v":0.42024214379745845},3.5320691884696749E-4,{"$f":"W10","v":3.5320691884696749E-4},{"$f":"SQRT(M10*(1-M10))*SQRT(K10^2+(N10^2)/12)","v":0.17129119051327016},5.868134389490683E-5,{"$f":"Z10","v":5.868134389490683E-5},{"$f":"SQRT(M10)*SQRT(K10^2+(N10^2)/12)","v":0.19252795697987482},2.7429590521944949E-3,3.8980247630823761E-4,2.9820823612900744E-2,1.5520528677670554E-3,{"$f":"(AF10+AE10+AD10+AC10*(1+RdsonTopTc*Ta-RdsonTopTc*25))/(1-AC10*RdsonTopTc*ThetaJA_Q1)","v":3.4514347781896992E-2},0.37518188283103321,4.3636048013438126E-3,1.7088528677670555E-3,{"$f":"(AJ10+AI10*(1+RdsonBotTc*Ta-RdsonBotTc*25))/(1-AI10*RdsonBotTc*ThetaJA_Q2)","v":6.0748964462625215E-3},2.2080000000000003E-3,8.3999999999999993E-4,2.5399999999999999E-2,0.10515599999999999,9.6519999999999995E-2,2.6239999999999999E-2,{"$f":"SUM(S10,T10,AC10,AD10,AE10,AF10,AI10,AJ10,AQ10, AL10)","v":0.17382746408271549},0.17391614701016705,{"$f":"AS10","v":0.17391614701016705},0.17500000000000002,{"$f":"AU10/(AU10+AT10)","v":0.50155317115461762},0.82734743898363083,0.15648133826403798,null,{"$f":"AV10*100","v":50.155317115461763},0.10484489227792337,4.2797244228159517E-2,3.5971627781896991E-2,6.8035364462625215E-3,{"$f":"AS10-BA10","v":6.9071254732243681E-2}]
["Vin",{"$f":"Vin","v":24},"V","Vin",null,null,2,24,1,7.0000000000000007E-2,7.0000000000000007E-2,1.6203703703703703E-2,0.2085517397716197,1.4562531598752169,0.79812657993760849,-0.65812657993760837,12.668461596489093,0.42617223294955858,4.9038148477047461E-3,0.1,0.10494831123483596,0.4203840769310998,3.5344554427442563E-4,3.5344554427442563E-4,0.1731423560823869,5.995655093952012E-5,5.995655093952012E-5,0.19462205710391664,2.8029531382406537E-3,7.7960495261647522E-4,3.1723689489341032E-2,1.4742035390602427E-3,3.6789938202750581E-2,0.37913721398176231,4.4560958378014309E-3,1.787803539060243E-3,6.2464601807812308E-3,4.4160000000000007E-3,8.3999999999999993E-4,2.5399999999999999E-2,0.10515599999999999,9.6519999999999995E-2,2.6239999999999999E-2,0.17858416534382485,0.17867790074747156,0.17867790074747156,0.35000000000000003,0.66202880715299872,0.91320345866326347,0.1771860241579683,null,66.20288071529987,0.10494831123483596,4.7452398383531817E-2,3.9704498202750585E-2,7.7037401807812309E-3,7.3729589512635599E-2]
["Vout",{"$f":"Vout","v":5},"V","Vout",null,null,3,24,1,0.105,0.105,2.4305555555555556E-2,0.20866095875925417,1.4567446202052159,0.83337231010260793,-0.62337231010260796,11.999466989463098,0.43343635523730956,5.0724109991178868E-3,0.1,0.10511851184252247,0.42052594930801029,3.5368414808280649E-4,3.5368414808280649E-4,0.17612752456996678,6.2041809822288503E-5,6.2041809822288503E-5,0.1979912214942243,2.9008387603693488E-3,1.1694074289247127E-3,3.3630320573652894E-2,1.3963539746298418E-3,3.9107357598340595E-2,0.38557301546221856,4.6086630578314755E-3,1.8667539746298415E-3,6.4781637544672746E-3,6.6239999999999997E-3,8.3999999999999993E-4,2.5399999999999999E-2,0.10515599999999999,9.6519999999999995E-2,2.6239999999999999E-2,0.18350874876915599,0.1836090767162066,0.1836090767162066,0.52500000000000002,0.74088805414816772,1.0000215447618337,0.19927392635274732,null,74.088805414816775,0.10511851184252247,5.2209521352807868E-2,4.3479197598340596E-2,8.6640837544672746E-3,7.8490564873684138E-2]
["Fsw",{"$f":"Fsw/1000","v":400},"kHz","Switching Frequency",null,null,4,24,1,0.14000000000000001,0.14000000000000001,3.2407407407407406E-2,0.2087701882612403,1.4572358700373353,0.86861793501866769,-0.58861793501866766,11.330470356470986,0.44335241634275074,5.3071568570778067E-3,0.1,0.10535549994273309,0.42066776091941704,3.5392273015391162E-4,3.5392273015391162E-4,0.18019164177228367,6.4938055529182009E-5,6.4938055529182009E-5,0.20257382158611326,3.0366753362081811E-3,1.5592099052329504E-3,3.5540716900822542E-2,1.3185041744418157E-3,4.1466691037476675E-2,0.39436684937371874,4.8212815684335539E-3,1.9457041744418155E-3,6.7699886248419111E-3,8.8320000000000013E-3,8.3999999999999993E-4,2.5399999999999999E-2,0.10515599999999999,9.6519999999999995E-2,2.6239999999999999E-2,0.18860124891665869,0.1887098515333544,0.1887098515333544,0.70000000000000007,0.78765864786154915,1.0878036538619635,0.22274461837136397,null,78.765864786154921,0.10535549994273309,5.7068679662318586E-2,4.7295811037476675E-2,9.684548624841912E-3,8.3354351590621309E-2]
["Iout",{"$f":"Iout","v":3.5},"A","Max Output Current",null,null,5,24,1,0.17499999999999999,0.17499999999999999,4.0509259259259259E-2,0.20887942827909631,1.4577269093411753,0.90386345467058771,-0.55386345467058762,10.661471697220167,0.45574734797339334,5.6080524199890944E-3,0.1,0.10565928367060536,0.42080951175654441,3.5416129036956257E-4,3.5416129036956257E-4,0.18526497581089743,6.8646222524424824E-5,6.8646222524424824E-5,0.20829170990833493,3.2105222948238081E-3,1.9490123815411875E-3,3.7454878505843149E-2,1.2406541384621162E-3,4.3868024533583405E-2,0.40536429143209357,5.0939264718155419E-3,2.0246541384621162E-3,7.1219182348377002E-3,1.1039999999999999E-2,8.3999999999999993E-4,2.5399999999999999E-2,0.10515599999999999,9.6519999999999995E-2,2.6239999999999999E-2,0.19386170035093703,0.19398040976208403,0.19398040976208403,0.875,0.81853698347450821,1.1765517642724184,0.2475977194012671,null,81.853698347450816,0.10565928367060536,6.2029942768421109E-2,5.1154424533583404E-2,1.07651182348377E-2,8.8321126091478672E-2]
["Ta",{"$f":"Ta","v":25},"°C","Ambient Temperature",null,null,6,24,1,0.21,0.21,4.8611111111111112E-2,0.20898867881434099,1.4582177380863335,0.93910886904316671,-0.51910886904316678,9.9924710114180311,0.47042524837194044,5.97509768625665E-3,0.1,0.1060298734553623,0.42095120181061596,3.5439982861160384E-4,3.5439982861160384E-4,0.19126845629925704,7.3167244750201604E-5,7.3167244750201604E-5,0.21505621756298143,3.422439076724734E-3,2.3388148578494254E-3,3.937280542371463E-2,1.1628038666566935E-3,4.6311445050075471E-2,0.4183906518952179,5.4265728653924679E-3,2.1036038666566934E-3,7.5339380106983741E-3,1.3247999999999999E-2,8.3999999999999993E-4,2.5399999999999999E-2,0.10515599999999999,9.6519999999999995E-2,2.6239999999999999E-2,0.19929013764325129,0.19942094393256743,0.19942094393256743,1.05,0.84038930602132567,1.2662678761517359,0.27383289424606261,null,84.038930602132567,0.1060298734553623,6.7093383060773851E-2,5.5055125050075468E-2,1.1905778010698375E-2,9.3391070477205129E-2]
["Vcc",{"$f":"VCC","v":3.3},"V","Subregulated VCC Voltage",null,null,7,24,1,0.245,0.245,5.6712962962962965E-2,0.2090979398684932,1.458708356242399,0.97435417812119951,-0.48435417812119952,9.3234682987718873,0.48717981524376619,6.4082926542856538E-3,0.1,0.10646728202120791,0.42109283107285284,3.546383447619004E-4,3.546383447619004E-4,0.19811872151107052,7.8502055626362228E-5,7.8502055626362228E-5,0.22277382585180244,3.672485133864041E-3,2.7286173341576629E-3,4.1294497689443807E-2,1.0849533589914868E-3,4.8797040505793733E-2,0.43326203952839087,5.819195841785329E-3,2.1825533589914865E-3,8.0060353600430404E-3,1.5456000000000001E-2,8.3999999999999993E-4,2.5399999999999999E-2,0.10515599999999999,9.6519999999999995E-2,2.6239999999999999E-2,0.20488659537151946,0.20503165456377773,0.20503165456377773,1.2250000000000001,0.85662439435557713,1.3569540116332559,0.30144985328098994,null,85.662439435557715,0.10646728202120791,7.2259075865836769E-2,5.8998000505793735E-2,1.3106515360043041E-2,9.856437254256982E-2]
["Components","Input Value","Units","Description",null,null,8,24,1,0.28000000000000003,0.28000000000000003,6.4814814814814811E-2,0.20920721144307225,1.4591987637789572,1.0095993818894786,-0.44959938188947857,8.6544635589890007,0.50580472452436598,6.9076373224815834E-3,0.1,0.10697152438841946,0.42123439953447506,3.5487683870233957E-4,3.5487683870233957E-4,0.20573233587616643,8.4651588050127513E-5,8.4651588050127513E-5,0.23135090726526567,3.9607199296421546E-3,3.1184198104659009E-3,4.3219955338044333E-2,1.007102615432432E-3,5.132489978050199E-2,0.44979459429689478,6.2717704888199527E-3,2.2615026154324319E-3,8.5381996700944918E-3,1.7664000000000003E-2,8.3999999999999993E-4,2.5399999999999999E-2,0.10515599999999999,9.6519999999999995E-2,2.6239999999999999E-2,0.21065110812031884,0.21081275018627432,0.21081275018627432,1.4000000000000001,0.86912647037224156,1.4486122149515457,0.33044835241217335,null,86.912647037224161,0.10697152438841946,7.7527099450596479E-2,6.298313978050199E-2,1.4367319670094494E-2,0.10384122579785486]
["L",{"$f":"Lf*1000000","v":6.7999999999999989},"uH","Filter Inductance",null,null,9,24,1,0.315,0.315,7.2916666666666657E-2,0.20931649353959766,1.4596889606655858,1.044844480332793,-0.41484448033279292,7.9854567917765715,0.52610137346087094,7.4731316892501995E-3,0.1,0.10754261787463738,0.42137590718670054,3.5511531031482974E-4,3.5511531031482974E-4,0.21402894009431778,9.1616774395794138E-5,9.1616774395794138E-5,0.24069726805705483,4.287202938909598E-3,3.5082222867741379E-3,4.5149178404536708E-2,9.292516359454562E-4,5.3895112720445511E-2,0.46781137257155803,6.7842718895258372E-3,2.3404516359454559E-3,9.1304223060712248E-3,1.9872000000000001E-2,8.3999999999999993E-4,2.5399999999999999E-2,0.10515599999999999,9.6519999999999995E-2,2.6239999999999999E-2,0.21658371048088743,0.21676444736598005,0.21676444736598005,1.575,0.87902179458653784,1.5412445525702467,0.3608281930396382,null,87.902179458653791,0.10754261787463738,8.2897535026516742E-2,6.7010632720445509E-2,1.5688182306071226E-2,0.10922182949134267]
["Rdcr",{"$f":"Rdcr*1000","v":27},"mW","Inductor DCR at 25°C",null,null,10,24,1,0.35,0.35,8.1018518518518517E-2,0.20942578615958929,1.4601789468718585,1.0800894734359292,-0.38008947343592925,7.316447996841756,0.54788400208497667,8.1047757529975686E-3,0.1,0.10818058209635247,0.42151735402074592,3.5535375948130173E-4,3.5535375948130173E-4,0.22293333814667532,9.9398546514439755E-5,9.9398546514439755E-5,0.25072849663853186,4.6519936479697526E-3,3.898024763082375E-3,4.708216692394826E-2,8.5140042049648148E-4,5.6507770143971771E-2,0.48714689849575399,7.3566751221350053E-3,2.4194004204964813E-3,9.7826966097429059E-3,2.2079999999999999E-2,8.3999999999999993E-4,2.5399999999999999E-2,0.10515599999999999,9.6519999999999995E-2,2.6239999999999999E-2,0.22268443705112589,0.22288697072895597,0.22288697072895597,1.75,0.88702496694648336,1.6348531133113509,0.39258922202408686,null,88.702496694648332,0.10818058209635247,8.8370466753714683E-2,7.1080570143971775E-2,1.7069096609742908E-2,0.1147063886326035]
["LTc",3930,"ppm","Inductor Series Resistance Temp Co",null,null,11,24,1,0.38500000000000001,0.38500000000000001,8.9120370370370364E-2,0.20953508930456727,1.460668722367342,1.115334361183671,-0.345334361183671,6.647437173891646,0.5709825680717876,8.8025695121300464E-3,0.1,0.10888543897059111,0.42165874002782583,3.5559218608370726E-4,3.5559218608370726E-4,0.23237667238088661,1.0799783573362781E-4,1.0799783573362781E-4,0.26136728725243608,5.0551515545816097E-3,4.2878272393906134E-3,4.9018920931313145E-2,7.7354896905142308E-4,5.9162963847214055E-2,0.50764971604065356,7.9889552600808413E-3,2.4983489690514229E-3,1.0495017898148934E-2,2.4288000000000004E-2,8.3999999999999993E-4,2.5399999999999999E-2,0.10515599999999999,9.6519999999999995E-2,2.6239999999999999E-2,0.2289533224355991,0.22918055298717949,0.22918055298717949,1.925,0.89361126082520004,1.7294400084859234,0.42573133165742549,null,89.361126082520002,0.10888543897059111,9.3945981745362991E-2,7.5193043847214064E-2,1.8510057898148934E-2,0.12029511401658838]
["ThetaCa",{"$f":"ThetaCa","v":22},"°C/W","Core to Ambient Thermal Resistance",null,null,12,24,1,0.42,0.42,9.7222222222222224E-2,0.209644402976052,1.4611582871215971,1.1505791435607986,-0.31057914356079858,5.9784243226332734,0.59524389539247691,9.5665129650542701E-3,0.1,0.10965721271679833,0.42180006519915331,3.5583059000401994E-4,3.5583059000401994E-4,0.24229689727389436,1.1741557285711224E-4,1.1741557285711224E-4,0.27254397532504754,5.4967361679625288E-3,4.6776297156988509E-3,5.0959440461672466E-2,6.956972815761888E-4,6.1860786609838625E-2,0.52918340536720332,8.6810873719969251E-3,2.5772972815761887E-3,1.1267383462479939E-2,2.6495999999999999E-2,8.3999999999999993E-4,2.5399999999999999E-2,0.10515599999999999,9.6519999999999995E-2,2.6239999999999999E-2,0.23539040124553742,0.23564543496533152,0.23564543496533152,2.1,0.89910907219150349,1.8250073720262885,0.46025445963703859,null,89.910907219150346,0.10965721271679833,9.9624170072318552E-2,7.9348146609838632E-2,2.0011063462479939E-2,0.12598822224853318]
["Cin",{"$f":"Cin*1000000","v":47},"μF","Input Capacitance",null,null,13,24,1,0.45500000000000002,0.45500000000000002,0.10532407407407407,0.2097537271755642,1.461647641104179,1.1858238205520895,-0.27582382055208948,5.3094094427736183,0.62053161528008993,1.0396606110177174E-2,0.1,0.11049592985891936,0.42194132952593966,3.5606897112423519E-4,3.5606897112423519E-4,0.25263876203439373,1.2765268816454202E-4,1.2765268816454202E-4,0.28419652052929767,5.9768070087910033E-3,5.0674321920070884E-3,5.2903725550074096E-2,6.1784535803668039E-4,6.4601332200855802E-2,0.55162652517909072,9.4330465217158984E-3,2.65624535803668E-3,1.2099792567121945E-2,2.8704E-2,8.3999999999999993E-4,2.5399999999999999E-2,0.10515599999999999,9.6519999999999995E-2,2.6239999999999999E-2,0.24199570809883864,0.24228186562859921,0.24228186562859921,2.2749999999999999,0.9037525876872361,1.9215573606196834,0.49615858904380472,null,90.375258768723612,0.11049592985891936,0.10540512476797775,8.35459722008558E-2,2.1572112567121944E-2,0.13178593576967984]
["RCinEsr",{"$f":"RCinEsr*1000","v":2},"mW","Input Capacitor ESR",null,null,14,24,1,0.49,0.49,0.11342592592592593,0.20986306190462489,1.4621367842846373,1.2210683921423187,-0.24106839214231868,4.6403925340196084,0.64672533943180632,1.1292848945905997E-2,0.1,0.11140161922767983,0.42208253299939458,3.5630732932637004E-4,3.5630732932637004E-4,0.2633534805268064,1.38710111411166E-4,1.38710111411166E-4,0.29627013808186309,6.4954236092094201E-3,5.4572346683153259E-3,5.4851776231572794E-2,5.3999319839879382E-4,6.738469538449593E-2,0.57487187263262307,1.0244807768268303E-2,2.7351931983987934E-3,1.299224644886298E-2,3.0912000000000002E-2,8.3999999999999993E-4,2.5399999999999999E-2,0.10515599999999999,9.6519999999999995E-2,2.6239999999999999E-2,0.2487692776200694,0.24909010211150026,0.24909010211150026,2.4500000000000002,0.90771330608169143,2.0190921538434066,0.53344374832384855,null,90.771330608169137,0.11140161922767983,0.11128894183335891,8.7786615384495933E-2,2.3193206448862982E-2,0.13768848288382043]
["Cout",{"$f":"Cout*1000000","v":125},"μF","Output Capcitance",null,null,15,24,1,0.52500000000000002,0.52500000000000002,0.12152777777777778,0.2099724071647554,1.4626257166325154,1.2563128583162577,-0.20631285831625767,3.9713735960781076,0.67371940171426825,1.2255241470648251E-2,0.1,0.1123743119630649,0.42222367561072605,3.5654566449246322E-4,3.5654566449246322E-4,0.27439822505579059,1.5058877182753662E-4,1.5058877182753662E-4,0.30871673171955805,7.052645512826812E-3,5.8470371446235642E-3,5.680359254123013E-2,4.6214080262841728E-4,7.0210971926150709E-2,0.59882536001961872,1.1116346165881407E-2,2.814140802628417E-3,1.3944748316261952E-2,3.3120000000000004E-2,8.3999999999999993E-4,2.5399999999999999E-2,0.10515599999999999,9.6519999999999995E-2,2.6239999999999999E-2,0.255711144440467,0.25607040974773559,0.25607040974773559,2.625,0.91111969742865229,2.1176139543014667,0.57211001127402494,null,91.111969742865227,0.1123743119630649,0.11727572024241267,9.2070171926150718E-2,2.4874348316261952E-2,0.14369609778467068]
["RCoutEsr",{"$f":"Cout_ESR*1000","v":2},"mW","Output Capacitor ESR",null,null,16,24,1,0.56000000000000005,0.56000000000000005,0.12962962962962962,0.21008176295747724,1.4631144381173504,1.2915572190586753,-0.17155721905867516,3.3023526286559219,0.70142140561312183,1.3283783682811764E-2,0.1,0.1134140415169981,0.42236475735114021,3.5678397650457512E-4,3.5678397650457512E-4,0.28573554042087129,1.6328959811921475E-4,1.6328959811921475E-4,0.32149423673371658,7.6485322747216295E-3,6.2368396209318017E-3,5.875917451411463E-2,3.8428817069143239E-4,7.3080258598380701E-2,0.62340471926292995,1.2047636763978067E-2,2.8930881706914322E-3,1.4957303349179697E-2,3.5328000000000005E-2,8.3999999999999993E-4,2.5399999999999999E-2,0.10515599999999999,9.6519999999999995E-2,2.6239999999999999E-2,0.26282134319794082,0.26322306210107815,0.26322306210107815,2.8000000000000003,0.91406990063579241,2.2171249877627561,0.61215749703113309,null,91.406990063579244,0.1134140415169981,0.1233655619475604,9.6396738598380702E-2,2.6615543349179697E-2,0.14980902058408005]
["Top Driver","Input Value","Units","Description",null,null,17,24,1,0.59499999999999997,0.59499999999999997,0.13773148148148145,0.21019112928431241,1.4636029487086748,1.3268014743543373,-0.13680147435433743,2.6333296314598154,0.72975073321127537,1.4378475580804637E-2,0.1,0.11452084365621985,0.42250577821184176,3.5702226524478802E-4,3.5702226524478802E-4,0.29733274160986151,1.7681351846647334E-4,1.7681351846647334E-4,0.33456594432279169,8.2831434614445004E-3,6.6266420972400384E-3,6.0718522185301591E-2,3.0643530255371583E-4,7.5992653186989306E-2,0.64853817275607817,1.3038654607175574E-2,2.9720353025537152E-3,1.6029918698472014E-2,3.7536E-2,8.3999999999999993E-4,2.5399999999999999E-2,0.10515599999999999,9.6519999999999995E-2,2.6239999999999999E-2,0.27009990853707377,0.27054834099730318,0.27054834099730318,2.9749999999999996,0.91664017522716423,2.3176275033007543,0.65358637006485643,null,91.664017522716421,0.11452084365621985,0.12955857188546133,0.10076641318698931,2.8416798698472016E-2,0.15602749734108334]
["RdsonDRT",1,"W","Drain to Source Resistance of pullup Top FET Driver",null,null,18,24,1,0.63,0.63,0.14583333333333331,0.210300506146783,1.4640912483760138,1.3620456241880068,-0.10204562418800689,1.9643046041964751,0.75863711041419724,1.5539317163035277E-2,0.1,0.11569475646536623,0.42264673818403342,3.5726053059520582E-4,3.5726053059520582E-4,0.30916133371105875,1.9116146052400128E-4,1.9116146052400128E-4,0.34789985066808837,8.9565386510209854E-3,7.0164445735482759E-3,6.2681635589873178E-2,2.2858219818113544E-4,7.8948254497164347E-2,0.67416315473535393,1.4089374735284469E-2,3.050982198181135E-3,1.7162603485844558E-2,3.9744000000000002E-2,8.3999999999999993E-4,2.5399999999999999E-2,0.10515599999999999,9.6519999999999995E-2,2.6239999999999999E-2,0.27754687510912451,0.27804653655716938,0.27804653655716938,3.15,0.91889067619355735,2.4191237734347801,0.69639684017442482,null,91.889067619355728,0.11569475646536623,0.13585485798300889,0.10517929449716434,3.0278123485844556E-2,0.16235178009180315]
["RdsonDRT2",1,"W","Drain to Source Resistance of pulldown Top FET Driver",null,null,19,24,1,0.66500000000000004,0.66500000000000004,0.15393518518518517,0.21040989354641149,1.4645793370888875,1.3972896685444438,-6.7289668544443737E-2,1.2952775465725455,0.78801928035992697,1.6766308427912383E-2,0.1,0.11693582035024894,0.42278763725891644,3.5749877243795419E-4,3.5749877243795419E-4,0.32119647524576583,2.0633435142060772E-4,2.0633435142060772E-4,0.36146805460425296,9.6687774329543563E-3,7.4062470498565134E-3,6.4648514762918483E-2,1.5072885753955397E-4,8.1947162359687756E-2,0.700225129311705,1.5199772183307413E-2,3.1299288575395538E-3,1.8355368803869634E-2,4.1952000000000003E-2,8.3999999999999993E-4,2.5399999999999999E-2,0.10515599999999999,9.6519999999999995E-2,2.6239999999999999E-2,0.28516227757202828,0.2857179472304574,0.2857179472304574,3.3250000000000002,0.92086949149555897,2.5216160942728183,0.74058916248900164,null,92.086949149555892,0.11693582035024894,0.14225453116355741,0.10963548235968776,3.2199528803869636E-2,0.16878212688020847]
["Bottom Driver","Input Value","Units","Description",null,null,20,24,1,0.7,0.7,0.16203703703703703,0.21051929148472071,1.4650672148168105,1.4325336074084052,-3.2533607408405274E-2,0.62624845829461551,0.81784380863804951,1.8059449373844943E-2,0.1,0.1182440780413363,0.42292847542769041,3.5773699065518103E-4,3.5773699065518103E-4,0.33341649461216311,2.2233311775892518E-4,2.2233311775892518E-4,0.3752462148147741,1.0419919408228354E-2,7.79604952616475E-3,6.6619159739533404E-2,7.2875280594827805E-5,8.4989477637213845E-2,0.72667652610688815,1.6369821981438024E-2,3.2088752805948272E-3,1.9608227716164685E-2,4.4159999999999998E-2,8.3999999999999993E-4,2.5399999999999999E-2,0.10515599999999999,9.6519999999999995E-2,2.6239999999999999E-2,0.29294615059039908,0.29356287983107426,0.29356287983107426,3.5,0.92261552289225623,2.6251067856559183,0.78616363747178775,null,92.261552289225619,0.1182440780413363,0.14875770535337854,0.11413507763721384,3.4181027716164686E-2,0.17531880178973797]
["RdsonDRB",1,"W","Drain to Source Resistance of pullup Bottom FET Driver",null,null,21,24,1,0.73499999999999999,0.73499999999999999,0.17013888888888887,0.21062869996323366,1.46555488152929,1.4677774407646451,2.2225592353549706E-3,0,0.84806402621767152,1.9418739999242238E-2,0.1,0.11961957459743626,0.42306925268155288,3.5797518512905533E-4,3.5797518512905533E-4,0.34580246211899152,2.3915868561511313E-4,2.3915868561511313E-4,0.38921306937081812,1.1210024189309943E-2,8.1858520024729892E-3,6.846720000000002E-2,0,8.7953784884944292E-2,0.75347579867934322,1.7599499155059699E-2,3.2927999999999998E-3,2.0926181864503651E-2,4.6368000000000006E-2,8.3999999999999993E-4,2.5399999999999999E-2,0.10515599999999999,9.6519999999999995E-2,2.6239999999999999E-2,0.30078211534608496,0.30146492671262709,0.30146492671262709,3.6749999999999998,0.92418770635005942,2.7268032923537189,0.83323530288358394,null,92.418770635005941,0.11961957459743626,0.15524796674944796,0.11855666488494429,3.6227621864503651E-2,0.18184535211519082]
["RdsonDRB2",1,"W","Drain to Source Resistance of pulldown Bottom FET Driver",null,null,22,24,1,0.77,0.77,0.17824074074074073,0.21073811898347378,1.4660423371958298,1.5030211685979149,3.6978831402085133E-2,0,0.87863910558936786,2.0844180302513875E-2,0.1,0.12106235740958207,0.42320996901170022,3.5821335574176847E-4,3.5821335574176847E-4,0.35833781585158037,2.5681198053856226E-4,2.5681198053856226E-4,0.40335001566529133,1.2039151400152114E-2,8.5756544787812267E-3,6.846720000000002E-2,0,8.918078268584935E-2,0.78058660168727823,1.8888778724744499E-2,3.4495999999999997E-3,2.2377265212161785E-2,4.8576000000000008E-2,8.3999999999999993E-4,2.5399999999999999E-2,0.10515599999999999,9.6519999999999995E-2,2.6239999999999999E-2,0.30708056490619179,0.30783016545119551,0.30783016545119551,3.85,0.92596374714651419,2.788541681774535,0.88336893987972098,null,92.596374714651418,0.12106235740958207,0.16013404789801114,0.12124094268584935,3.8407345212161784E-2,0.18676780804161344]
["Deadtime","Input Value","Units","Description",null,null,23,24,1,0.80500000000000005,0.80500000000000005,0.18634259259259259,0.21084754854696458,1.4665295817859252,1.5382647908929625,7.1735209107037456E-2,0,0.90953326007780866,2.2335770282069702E-2,0.1,0.12257247620512086,0.42335062440932664,3.5845150237553351E-4,3.5845150237553351E-4,0.3710080373466294,2.7529392755159594E-4,2.7529392755159594E-4,0.41764074624200109,1.2907360676196591E-2,8.9654569550894642E-3,6.846720000000002E-2,0,9.0447421880959444E-2,0.80797707780987904,2.0237635706251929E-2,3.6064000000000001E-3,2.3888512832115894E-2,5.078400000000001E-2,8.3999999999999993E-4,2.5399999999999999E-2,0.10515599999999999,9.6519999999999995E-2,2.6239999999999999E-2,0.3135438236196077,0.31436537122532826,0.31436537122532826,4.0250000000000004,0.92755498919037571,2.8511918232620674,0.93488635513866558,null,92.755498919037578,0.12257247620512086,0.16511993471307534,0.12396486188095945,4.0647232832115895E-2,0.19179289502020741]
["Deadtime",15,"ns","Total Deadtime",null,null,24,24,1,0.84,0.84,0.19444444444444445,0.21095698865523013,1.4670166152690673,1.5735083076345338,0.1064916923654663,0,0.94071505380550402,2.3893509936319893E-2,0.1,0.12414998305200622,0.42349121886562485,3.5868962491258515E-4,3.5868962491258515E-4,0.38380037203549916,2.9460545114917512E-4,2.9460545114917512E-4,0.43207093487279008,1.3814711664376663E-2,9.3552594313977017E-3,6.846720000000002E-2,0,9.1753785888621681E-2,0.83561924325283787,2.1646045110527808E-2,3.7631999999999995E-3,2.5459946969303853E-2,5.2991999999999997E-2,8.3999999999999993E-4,2.5399999999999999E-2,0.10515599999999999,9.6519999999999995E-2,2.6239999999999999E-2,0.32017192614262208,0.32107083179184692,0.32107083179184692,4.2,0.92898345464218357,2.9147556354382984,0.98778806029398858,null,92.898345464218352,0.12414998305200622,0.17020573285792553,0.12672850588862167,4.294730696930385E-2,0.1969208487398407]
["IQ","Input Value","Units","Description",null,null,25,24,1,0.875,0.875,0.20254629629629628,0.21106643930979457,1.4675034376147407,1.6087517188073703,0.14124828119262967,0,0.97215680917102576,2.5517399263674936E-2,0.1,0.12579493236329525,0.42363175237178585,3.5892772323518017E-4,3.5892772323518017E-4,0.39670358915606047,3.1474747529860081E-4,3.1474747529860081E-4,0.44662796694001594,1.4761264023119926E-2,9.7450619077059392E-3,6.846720000000002E-2,0,9.3099959053830325E-2,0.86348846012243741,2.3113981943703163E-2,3.9199999999999999E-3,2.7091591843655602E-2,5.5199999999999999E-2,8.3999999999999993E-4,2.5399999999999999E-2,0.10515599999999999,9.6519999999999995E-2,2.6239999999999999E-2,0.32696490713820403,0.32794684314542966,0.32794684314542966,4.375,0.93026779717414543,2.9792350582380975,1.0420746124040787,null,93.026779717414541,0.12579493236329525,0.17539155089748593,0.12953195905383033,4.5307591843655598E-2,0.2021519107821344]
["IQ ",{"$f":"Iq*1000","v":3.4999999999999996E-2},"mA","Quiescent Current Of Controller (Not Switching!)",null,null,26,24,1,0.91,0.91,0.21064814814814814,0.21117590051218255,1.4679900487924245,1.6439950243962123,0.17600497560378781,0,1.0038340991482602,2.7207438262545573E-2,0.1,0.12750738090185068,0.42377222491899907,3.5916579722559749E-4,3.5916579722559749E-4,0.40970777600578689,3.3572092343921612E-4,3.3572092343921612E-4,0.46130070837284021,1.5747077422351027E-2,1.0134864384014177E-2,6.846720000000002E-2,0,9.448602665385368E-2,0.89156298435248804,2.4641421207092961E-2,4.0768000000000002E-3,2.8783473651313125E-2,5.7408000000000001E-2,8.3999999999999993E-4,2.5399999999999999E-2,0.10515599999999999,9.6519999999999995E-2,2.6239999999999999E-2,0.33392280127600371,0.33499370955494878,0.33499370955494878,4.55,0.9314239220206757,3.0446320530386348,1.0977466139802021,null,93.142392202067569,0.12750738090185068,0.18067750030516683,0.13237530665385369,4.7728113651313131E-2,0.2074863286530981]
["High-side FET","Input Value","Units","Description",null,null,27,24,1,0.94499999999999995,0.94499999999999995,0.21874999999999997,0.21128537226391877,1.4684764487715909,1.6792382243857955,0.21076177561420451,0,1.0357253127075097,2.8963626931342856E-2,0.1,0.12928738778524917,0.42391263649845184,3.5940384676613714E-4,3.5940384676613714E-4,0.42280416180668651,3.5752671848210947E-4,3.5752671848210947E-4,0.4760793078306596,1.6772211543494474E-2,1.0524666860322414E-2,6.846720000000002E-2,0,9.5912074903924394E-2,0.91982357875765974,2.6228337897195007E-2,4.2335999999999997E-3,3.053562056601275E-2,5.9616000000000002E-2,8.3999999999999993E-4,2.5399999999999999E-2,0.10515599999999999,9.6519999999999995E-2,2.6239999999999999E-2,0.34104564323235481,0.3422117436008838,0.3422117436008838,4.7249999999999996,0.93246547392990931,3.1109486027902613,1.1548047130182932,null,93.246547392990934,0.12928738778524917,0.18606369546993715,0.1352586349039244,5.0208900566012751E-2,0.21292435581563462]
["RdsonTop",{"$f":"Rdson1*1000","v":74},"mW","Drain-Source Resistance of Top FET ",null,null,28,24,1,0.98,0.98,0.22685185185185186,0.2113948545665284,1.4689626375217075,1.7144813187608539,0.24551868123914622,0,1.0678112828911113,3.0785965268478141E-2,0.1,0.13113501449089629,0.42405298710133027,3.5964187173912192E-4,3.5964187173912192E-4,0.43598496694829864,3.8016578280981812E-4,3.8016578280981812E-4,0.49095502738219998,1.7836726079477398E-2,1.0914469336630652E-2,6.846720000000002E-2,0,9.7378190962993688E-2,0.94825318188641161,2.7874707005688826E-2,4.3903999999999992E-3,3.2348062740629721E-2,6.1824000000000004E-2,8.3999999999999993E-4,2.5399999999999999E-2,0.10515599999999999,9.6519999999999995E-2,2.6239999999999999E-2,0.34833346769027501,0.3496012662138171,0.3496012662138171,4.9000000000000004,0.93340422472391682,3.1781867121488552,1.2132496030344837,null,93.34042247239168,0.13113501449089629,0.19155025370362339,0.1381820309629937,5.2749982740629725E-2,0.21846625172292081]
["RdsonTopTc",{"$f":"RdsonTopTc*1000000","v":4000},"ppm","Drain to Source Resistance Temp Co",null,null,29,24,1,1.0149999999999999,1.0149999999999999,0.23495370370370366,0.21150434742153684,1.4694486150122359,1.749724307506118,0.28027569249388196,0,1.1000749683605422,3.267445327236309E-2,0.1,0.13305032486134921,0.42419327671881862,3.5987987202689651E-4,3.5987987202689651E-4,0.44924327389290386,4.0363903827602928E-4,4.0363903827602928E-4,0.50592009750942901,1.8940680734732311E-2,1.1304271812938889E-2,6.846720000000002E-2,0,9.8884462939550249E-2,0.97683662449229336,2.9580503519434431E-2,4.5471999999999995E-3,3.4220832308885112E-2,6.4031999999999992E-2,8.3999999999999993E-4,2.5399999999999999E-2,0.10515599999999999,9.6519999999999995E-2,2.6239999999999999E-2,0.3557863093394687,0.35716260671402317,0.35716260671402317,5.0749999999999993,0.93425038376565195,3.246348407609656,1.2730820231043576,null,93.425038376565197,0.13305032486134921,0.19713729524843537,0.14114558293955026,5.5351392308885111E-2,0.22411228185267396]
["QgTop",{"$f":"Qg_Q1*1000000000","v":4.0999999999999996},"nC","Gate Charge Of Top FET",null,null,30,24,1,1.05,1.05,0.24305555555555555,0.2116138508304698,1.4699343812126306,1.7849671906063154,0.31503280939368472,0,1.1325011804655718,3.4629090941409667E-2,0.1,0.1350333851098475,0.42433350534209918,3.6011784751182664E-4,3.6011784751182664E-4,0.46257291652521282,4.2794740620528298E-4,4.2794740620528298E-4,0.52096759282413319,2.0084135225199917E-2,1.1694074289247128E-2,6.846720000000002E-2,0,0.10043097989750466,1.0055603865422216,3.1345702420471203E-2,4.7039999999999998E-3,3.6153963387215576E-2,6.6240000000000007E-2,8.3999999999999993E-4,2.5399999999999999E-2,0.10515599999999999,9.6519999999999995E-2,2.6239999999999999E-2,0.36340420287632791,0.36489610285215951,0.36489610285215951,5.25,0.93501284864971845,3.3154357376426069,1.3343027579059583,null,93.501284864971851,0.1350333851098475,0.20282494328472023,0.14414937989750465,5.8013163387215579E-2,0.22986271774231201]
["QgdTop",{"$f":"Qgd_Q1*1000000000","v":1.7},"nC","Gate to Drain Charge",null,null,31,24,1,1.085,1.085,0.25115740740740738,0.21172336479485332,1.4704199360923418,1.820209968046171,0.34979003195382907,0,1.1650763490167289,3.6649878274030066E-2,0.1,0.1370842638260539,0.42447367296235294,3.6035579807630115E-4,3.6035579807630115E-4,0.47596838518575696,4.5309180739267418E-4,4.5309180739267418E-4,0.53609132539768423,2.1267149278331784E-2,1.2083876765555364E-2,6.846720000000002E-2,0,0.10201783186213945,1.0344123886881407,3.3170278686016658E-2,4.8607999999999993E-3,3.8147492076805803E-2,6.8447999999999995E-2,8.3999999999999993E-4,2.5399999999999999E-2,0.10515599999999999,9.6519999999999995E-2,2.6239999999999999E-2,0.37118718300393394,0.37280210085107013,0.37280210085107013,5.4249999999999998,0.93569940912671967,3.3854507728292074,1.3969126377665335,null,93.569940912671967,0.1370842638260539,0.20861332393894527,0.14719351186213944,6.0735332076805801E-2,0.23571783702501622]
["QgsTop",{"$f":"Qgs_Q1*1000000000","v":2.39},"nC",null,null,null,32,{"$f":"Vin","v":24},{"$f":"MODE","v":1},1.1200000000000001,{"$f":"Iout*G41/100/Number_of_Phases","v":1.1200000000000001},{"$f":"Vout*K41/(Vin*Efficiency)","v":0.25925925925925924},{"$f":"(Vout+(Rdson2+Rs+Rdcr)*K41)/(Vin+(Rs+Rdson2-Rdson1)*K41)","v":0.21183288931621364},{"$f":"(Vin-(Rdson1+Rdcr)*K41-Vout)*M41/(Fsw*Lf)","v":1.4709052796208124},1.8554526398104063,0.3845473601895939,{"$f":"IF(MIN(Vin, -P41/(Coss_Q1+Coss_Q2)*0.00000002)<0, 0, MIN(Vin, -P41/(Coss_Q1+Coss_Q2)*0.00000002))","v":0},1.1977883209488083,{"$f":"R41^2*Rdcr","v":3.8736815268636864E-2},{"$f":"Core_Loss","v":0.1},{"$f":"(T41+S41*(1+Ltc*(Ta-25)))/(1-S41*Ltc*ThetaCa)","v":0.13920303198200484},0.42461377957075891,3.6059372360273007E-4,3.6059372360273007E-4,0.48942474503418548,4.7907316210355497E-4,4.7907316210355497E-4,0.55128575306123018,{"$f":"Rdson1*AB41^2","v":2.2489782633093282E-2},{"$f":"(Vin*K41/2)*Fsw*(Tr_buck+Tf_buck)","v":1.2473679241863603E-2},{"$f":"(0.5*Coss_Q1*(Vin-Q41)^2-0.5*Coss_Q2*(Vin-Q41)^2+(Qoss_Q2*(Vin-Q41)/Vin)*Vin)*Fsw","v":6.846720000000002E-2},{"$f":"IF(K41>N41/2,0,ABS(K41-N41/2)*Vsd_Q1*Deadtime*Fsw)","v":0},{"$f":"(AF41+AE41+AD41+AC41*(1+RdsonTopTc*Ta-RdsonTopTc*25))/(1-AC41*RdsonTopTc*ThetaJA_Q1)","v":0.10364510982612639},{"$f":"SQRT((1-M41))*SQRT(K41^2+(N41^2)/12)","v":1.0633818130253487},{"$f":"Rdson2*AH41^2","v":3.5054207288465408E-2},{"$f":"IF(K41<N41/2,Deadtime*Fsw*Vsd_Q2*(K41+N41/2),2*Deadtime*Fsw*Vsd_Q2*K41)","v":5.0175999999999997E-3},{"$f":"(AJ41+AI41*(1+RdsonBotTc*Ta-RdsonBotTc*25))/(1-AI41*RdsonBotTc*ThetaJA_Q2)","v":4.0201456465784394E-2},{"$f":"Qrr_Q2*K41/Iout*Fsw*Vin","v":7.065600000000001E-2},{"$f":"Iq*Vin","v":8.3999999999999993E-4},{"$f":"IF(Ext_VCC=1,  (Qg_Q1+Qg_Q2)*Fsw*Vout, (Qg_Q1+Qg_Q2)*Fsw*Vin)","v":2.5399999999999999E-2},{"$f":"(Vin-VCC)*Fsw*(Qg_Q1+Qg_Q2)","v":0.10515599999999999},{"$f":"(Qg_Q1+Qg_Q2)*Fsw*(Vin-Vout)","v":9.6519999999999995E-2},{"$f":"SUM(AM41:AN41)","v":2.6239999999999999E-2},0.37913528443205918,{"$f":"U41 + ((AF41+AE41+AD41+AC41*(1+RdsonTC*(Ta-25))) + (AJ41+AI41*(1+RdsonTC*(Ta-25))) + AQ41 + AL41) / (1-AC41*RdsonTC*ThetaJA_Q1 -AI41*RdsonTC*ThetaJA_Q2)","v":0.38088095544871242},0.38088095544871242,{"$f":"Vout*K41","v":5.6000000000000005},0.93631691413257079,{"$f":"ThetaJA_Q1*BC41","v":3.4563956060009073},{"$f":"ThetaJA_Q2*BD41","v":1.4609125387130411},null,93.631691413257073,{"$f":"U41","v":0.13920303198200484},{"$f":"AG41+AK41+AL41","v":0.21450256629191078},{"$f":"AG41+AL41*0.66","v":0.1502780698261264},{"$f":"AK41+AL41*0.33","v":6.3517936465784394E-2},0.24167792346670758]
["RGateTop",{"$f":"Rgate1","v":0.158},"W","Gate Resistance",null,null,33,24,1,{"$f":"Iout*G42/100","v":1.155},1.155,0.2673611111111111,0.21194242439607738,1.4713904117674803,1.8906952058837403,0.41930479411625987,0,1.2306261869417428,4.0889901923642877E-2,0.1,0.14138976293827263,0.42475382515849452,3.6083162397354583E-4,3.6083162397354583E-4,0.50293756574411697,5.0589239007323595E-4,5.0589239007323595E-4,0.56654590043247222,2.3752095039966212E-2,1.2863481718171839E-2,6.846720000000002E-2,0,0.10531290575561075,1.0924589487435821,3.6997463195387909E-2,5.1744E-3,4.2315896631582937E-2,7.2863999999999998E-2,8.3999999999999993E-4,2.5399999999999999E-2,0.10515599999999999,9.6519999999999995E-2,2.6239999999999999E-2,0.38724854187716884,0.38913302994221571,0.38913302994221571,5.7750000000000004,0.93687140948256531,3.5282723523790476,1.5263033825264074,null,93.687140948256527,0.14138976293827263,0.22049280238719371,0.15340314575561076,6.6361016631582934E-2,0.24774326700394309]
["GfsTop",{"$f":"Gfs_Q1","v":100},"S","Transconductance of Top FET",null,null,34,24,1,1.19,1.19,0.27546296296296291,0.21205197003597134,1.4718753325017766,1.9259376662508882,0.45406233374911165,0,1.263580131822118,4.3109138237461236E-2,0.1,0.14364453245033953,0.42489380971673535,3.610694990712026E-4,3.610694990712026E-4,0.51650286083752162,5.3355041050668836E-4,5.3355041050668836E-4,0.58186729076904975,2.5054146260951624E-2,1.3253284194480077E-2,6.846720000000002E-2,0,0.10702131259636392,1.1216350589513004,3.9000021369529299E-2,5.3311999999999995E-3,4.4490854643458908E-2,7.5072E-2,8.3999999999999993E-4,2.5399999999999999E-2,0.10515599999999999,9.6519999999999995E-2,2.6239999999999999E-2,0.3955269900624222,0.39755869623308432,0.39755869623308432,5.9499999999999993,0.93736825207004182,3.60108314971637,1.593086136799555,null,93.736825207004188,0.14364453245033953,0.22658416723982283,0.15656883259636392,6.9264614643458913E-2,0.25391416378274478]
["VthTop",{"$f":"Vth_Q1","v":1.5},"V","Threshold Voltage of Top FET",null,null,35,24,1,1.2250000000000001,1.2250000000000001,0.28356481481481477,0.21216152623742282,1.4723600417931282,1.9611800208965642,0.488819979103436,0,1.2966413052147803,4.5394524208505406E-2,0.1,0.14596741867518545,0.42503373323665561,3.6130734877817708E-4,3.6130734877817708E-4,0.53011703522818754,5.6204814207824684E-4,5.6204814207824684E-4,0.5972458870421965,2.6395996069572689E-2,1.3643086670788314E-2,6.846720000000002E-2,0,0.10877042428000484,1.1509022655292103,4.1061856768808337E-2,5.4879999999999998E-3,4.6726374565182693E-2,7.7280000000000001E-2,8.3999999999999993E-4,2.5399999999999999E-2,0.10515599999999999,9.6519999999999995E-2,2.6239999999999999E-2,0.40397066371767476,0.40615833487355579,0.40615833487355579,6.125,0.93781220511760577,3.6748301584401113,1.6612618149992022,null,93.78122051176058,0.14596741867518545,0.23277679884518754,0.15977522428000485,7.2228774565182702E-2,0.26019091619837031]
["VspTop",{"$f":"Vsp_Q1","v":1.5349999999999999},"V",null,null,null,36,24,1,1.26,1.26,0.29166666666666663,0.21227109300195923,1.4728445396109546,1.9964222698054774,0.52357773019452269,0,1.3298017094621604,4.7746059835189071E-2,0.1,0.14835850217808985,0.42517359570942759,3.6154517297696761E-4,3.6154517297696761E-4,0.54377683976577573,5.913865029313082E-4,5.913865029313082E-4,0.61267804087351796,2.7777704250877298E-2,1.4032889147096552E-2,6.846720000000002E-2,0,0.11056033573029088,1.1802534493573285,4.3182944346316025E-2,5.6447999999999993E-3,4.9022502457888792E-2,7.9488000000000003E-2,8.3999999999999993E-4,2.5399999999999999E-2,0.10515599999999999,9.6519999999999995E-2,2.6239999999999999E-2,0.41257959757947898,0.41493233511412431,0.41493233511412431,6.3,0.93820751804983415,3.7495155617966902,1.7308314765314421,null,93.820751804983416,0.14835850217808985,0.23907083818817967,0.16302241573029089,7.5253542457888789E-2,0.26657383293603443]
["VsdTop",{"$f":"Vsd_Q1","v":0.7},"V",null,null,null,37,24,1,1.2949999999999999,1.2949999999999999,0.29976851851851849,0.21238067033110833,1.4733288259246695,2.0316644129623347,0.55833558703766517,0,1.3630541022919989,5.0163745115926271E-2,0.1,0.15081786593964933,0.42531339712622163,3.6178297155009423E-4,3.6178297155009423E-4,0.55747933175949915,6.2156641067803546E-4,6.2156641067803546E-4,0.62816044818829653,2.9199330601440993E-2,1.4422691623404789E-2,6.846720000000002E-2,0,0.11239114286947921,1.2096821636723116,4.5363259050314686E-2,5.8015999999999988E-3,5.1379286383092207E-2,8.1695999999999991E-2,8.3999999999999993E-4,2.5399999999999999E-2,0.10515599999999999,9.6519999999999995E-2,2.6239999999999999E-2,0.42135382639108676,0.42388109495224402,0.42388109495224402,6.4749999999999996,0.93855799380824401,3.8251415659980217,1.8017962268111207,null,93.855799380824408,0.15081786593964933,0.24546642925257139,0.16631050286947921,7.8338966383092207E-2,0.27306322901259472]
["θJATop",{"$f":"ThetaJA_Q1","v":23},"°C/W","Junction to Ambient Resistance",null,null,38,24,1,1.33,1.33,0.30787037037037035,0.21249025822639819,1.4738129007036818,2.0669064503518411,0.59309354964815919,0,1.3963919121042094,5.2647580049131351E-2,0.1,0.15334559536301143,0.42545313747820696,3.6202074438010016E-4,3.6202074438010016E-4,0.57122184061844916,6.5258878239905782E-4,6.5258878239905782E-4,0.64369011061612247,3.06609349293697E-2,1.4812494099713027E-2,6.846720000000002E-2,0,0.1142629426247591,1.2391825586591565,4.7602775824236672E-2,5.9584E-3,5.3796776405869669E-2,8.3904000000000006E-2,8.3999999999999993E-4,2.5399999999999999E-2,0.10515599999999999,9.6519999999999995E-2,2.6239999999999999E-2,0.43029338490245073,0.43300502118221962,0.43300502118221962,6.65,0.93886704585309644,3.9017104003694589,1.8741572173350025,null,93.886704585309644,0.15334559536301143,0.25196371903062875,0.16963958262475909,8.1485096405869678E-2,0.27965942581920822]
["Low-side FET","Input Value","Units","Description",null,null,39,24,1,1.365,1.365,0.31597222222222221,0.21259985668935713,1.4742967639173923,2.1021483819586964,0.62785161804130385,0,1.4298091640756729,5.5197564633218912E-2,0.1,0.1559417782813268,0.42559281675655031,3.6225849134954922E-4,3.6225849134954922E-4,0.58500193787848753,6.8445453464317156E-4,6.8445453464317156E-4,0.65926430181888052,3.2162577054302463E-2,1.5202296576021264E-2,6.846720000000002E-2,0,0.11617583293475604,1.2687493156735252,4.9901469606683194E-2,6.1151999999999995E-3,5.6275024598206644E-2,8.6112000000000022E-2,8.3999999999999993E-4,2.5399999999999999E-2,0.10515599999999999,9.6519999999999995E-2,2.6239999999999999E-2,0.43939830787022588,0.44230452944630227,0.44230452944630227,6.8250000000000002,0.93913774664951311,3.9792243174993898,1.947915645758753,null,93.913774664951305,0.1559417782813268,0.25856285753296271,0.17300975293475607,8.4691984598206649E-2,0.28636275116497545]
["RdsonBot",{"$f":"Rdson2*1000","v":31},"mW","Drain-Source Resistance of Low-side FET",null,null,40,24,1,1.4,1.4,0.32407407407407407,0.21270946572151392,1.4747804155351996,2.1373902077675995,0.66260979223240013,0,1.4633004155574187,5.7813698866603883E-2,0.1,0.15860650496541998,0.4257324349524178,3.6249621234102933E-4,3.6249621234102933E-4,0.59881741099730978,7.1716458342704209E-4,7.1716458342704209E-4,0.67488053805153814,3.3704316807414286E-2,1.55920990523295E-2,6.846720000000002E-2,0,0.1181299127561085,1.2983775897364298,5.2259315331423209E-2,6.2719999999999989E-3,5.8814085042510449E-2,8.8319999999999996E-2,8.3999999999999993E-4,2.5399999999999999E-2,0.10515599999999999,9.6519999999999995E-2,2.6239999999999999E-2,0.44866863005777091,0.45178004428699847,0.45178004428699847,7,0.93937286908604323,4.0576855933904952,2.0230727559777404,null,93.937286908604321,0.15860650496541998,0.26526399779861892,0.1764211127561085,8.7959685042510449E-2,0.29317353932157852]
["RdsonBotTc",{"$f":"RdsonBotTc*1000000","v":4000},"ppm","Drain To Source Resitance Temp Co",null,null,41,24,1,1.4350000000000001,1.4350000000000001,0.33217592592592593,0.21281908532439736,1.4752638555264921,2.1726319277632462,0.69736807223675401,0,1.4968606994702527,6.0495982747701502E-2,0.1,0.16133986813168075,0.42587199205697274,3.6273390723714848E-4,3.6273390723714848E-4,0.61266624039312922,7.5071984423490329E-4,7.5071984423490329E-4,0.69053655236657063,3.5286214031418905E-2,1.5981901528637741E-2,6.846720000000002E-2,0,0.12012528207011805,1.3280629591492508,5.4676287927392202E-2,6.4287999999999993E-3,6.1414013835289834E-2,9.0527999999999997E-2,8.3999999999999993E-4,2.5399999999999999E-2,0.10515599999999999,9.6519999999999995E-2,2.6239999999999999E-2,0.45810438623515037,0.46143199920060796,0.46143199920060796,7.1750000000000007,0.93957492199905523,4.137096527612715,2.099629838211666,null,93.957492199905516,0.16133986813168075,0.2720672959054079,0.17987376207011804,9.1288253835289837E-2,0.30009213106892718]
["QgBot",{"$f":"Qg_Q2*1000000000","v":8.6},"nC","Gate Charge Of Top FET",null,null,42,24,1,1.47,1.47,0.34027777777777773,0.21292871549953679,1.4757470838606557,2.2078735419303279,0.73212645806967214,0,1.5304854745995693,6.3244416274927259E-2,0.1,0.16414196295017683,0.4260114880613774,3.6297157592053822E-4,3.6297157592053822E-4,0.62654657928132496,7.8512123201825927E-4,7.8512123201825927E-4,0.70623027196145483,3.6908328580571532E-2,1.6371704004945978E-2,6.846720000000002E-2,0,0.12216204188947352,1.3578013812504091,5.7152362318691079E-2,6.5855999999999996E-3,6.4074869091001754E-2,9.2736000000000013E-2,8.3999999999999993E-4,2.5399999999999999E-2,0.10515599999999999,9.6519999999999995E-2,2.6239999999999999E-2,0.46770561117913589,0.47126083669200258,0.47126083669200258,7.35,0.93974618075884009,4.2174594434578916,2.1775882290930406,null,93.97461807588401,0.16414196295017683,0.27897291098047527,0.18336780188947355,9.4677749091001767E-2,0.30711887374182578]
["RGateBot",{"$f":"Rgate2","v":0.24},"W","Gate Resistance",null,null,43,24,1,1.5049999999999999,1.5049999999999999,0.34837962962962959,0.21303835624846165,1.4762301005070677,2.2431150502535337,0.76688494974646604,0,1.5641705818538223,6.6058999446696978E-2,0.1,0.16701288705298969,0.42615092295679197,3.6320921827385128E-4,3.6320921827385128E-4,0.64045673592975216,8.2036966119558466E-4,8.2036966119558466E-4,0.72195979824318934,3.8570720320671652E-2,1.6761506481254212E-2,6.846720000000002E-2,0,0.12424029426505015,1.3875891534808054,5.968751342458492E-2,6.7423999999999991E-3,6.6796710946065568E-2,9.4943999999999987E-2,8.3999999999999993E-4,2.5399999999999999E-2,0.10515599999999999,9.6519999999999995E-2,2.6239999999999999E-2,0.47747233967320774,0.48126700833066027,0.48126700833066027,7.5249999999999995,0.93988871370016835,4.2987766880961527,2.2569493117595081,null,93.988871370016838,0.16701288705298969,0.28598100521111569,0.18690333426505013,9.812823094606557E-2,0.31425412127767061]
["VsdBot",{"$f":"Vsd_Q2","v":0.7},"V","Diode Forward Voltage of Bottom FET Body Diode",null,null,44,24,1,1.54,1.54,0.35648148148148145,0.21314800757270189,1.4767129054351025,2.2783564527175511,0.8016435472824488,0,1.5979122056889989,6.89397322614268E-2,0.1,0.16995274054277451,0.42629029673437541,3.6344683417976364E-4,3.6344683417976364E-4,0.65439515800929693,8.5646604565202541E-4,8.5646604565202541E-4,0.73772338924655978,4.0273449129065907E-2,1.7151308957562453E-2,6.846720000000002E-2,0,0.12636014229278481,1.4174228790479044,6.2281716159501961E-2,6.8991999999999994E-3,6.9579601563045726E-2,9.7152000000000016E-2,8.3999999999999993E-4,2.5399999999999999E-2,0.10515599999999999,9.6519999999999995E-2,2.6239999999999999E-2,0.48740460650755713,0.4914509748079694,0.4914509748079694,7.7,0.94000440504138039,4.381050632734051,2.3377145159500516,null,94.000440504138041,0.16995274054277451,0.29309174385583053,0.19048046229278481,0.10163976156304573,0.32149823426519486]
["QrrBot",{"$f":"Qrr_Q2*1000000000","v":23},"nC","Reverse Recovery Charge of Body Diode",null,null,45,24,1,1.575,1.575,0.36458333333333331,0.21325766947378749,1.4771954986141247,2.3135977493070623,0.83640225069293761,0,1.6317068400176811,7.1886614717533132E-2,0.1,0.17296162600154608,0.42642960938528418,3.6368442352097206E-4,3.6368442352097206E-4,0.66836041876337104,8.9341129873909747E-4,8.9341129873909747E-4,0.75351944409578064,4.2016574894650653E-2,1.7541111433870687E-2,6.846720000000002E-2,0,0.12852169012062709,1.4472994365818261,6.4934945433032215E-2,7.0559999999999989E-3,7.242360513500265E-2,9.935999999999999E-2,8.3999999999999993E-4,2.5399999999999999E-2,0.10515599999999999,9.6519999999999995E-2,2.6239999999999999E-2,0.4975024464790867,0.50181320599581403,0.50181320599581403,7.875,0.94009497482447923,4.4642836727744228,2.4198853181050612,null,94.009497482447927,0.17296162600154608,0.30030529525562971,0.1940992901206271,0.10521240513500266,0.32885157999426795]
["TrrBot",{"$f":"Trr_Q2*1000000000","v":40},"ns","Reverse Recovery Time of Body Diode",null,null,46,24,1,1.61,1.61,0.37268518518518517,0.213367341953249,1.4776778800134975,2.3488389400067486,0.87116105999325133,0,1.6655512580194278,7.4899646813432655E-2,0.1,0.17603964849969139,0.4265688609006742,3.6392198618019747E-4,3.6392198618019747E-4,0.68235120475983235,9.3120633327438928E-4,9.3120633327438928E-4,0.76934648924384164,4.3800157517875013E-2,1.7930913910178928E-2,6.846720000000002E-2,0,0.13072504295556858,1.4772159532642051,6.7647176149926491E-2,7.2128000000000001E-3,7.5328787890013668E-2,0.10156800000000002,8.3999999999999993E-4,2.5399999999999999E-2,0.10515599999999999,9.6519999999999995E-2,2.6239999999999999E-2,0.50776589439141318,0.51235418100646024,0.51235418100646024,8.0500000000000007,0.94016199631837294,4.5484782279780775,2.5034632414703144,null,94.016199631837296,0.17603964849969139,0.30762183084558226,0.1977599229555686,0.10884622789001368,0.33631453250676885]
["θJABot",{"$f":"ThetaJA_Q2","v":23},"°C/W","Junction to Ambient Resistance",null,null,47,24,1,1.645,1.645,0.38078703703703698,0.21347702501261709,1.4781600496025751,2.3840800248012877,0.90591997519871248,0,1.6994424853522083,7.7978828547542442E-2,0.1,0.17918691560521158,0.4267080512716987,3.6415952204018129E-4,3.6415952204018129E-4,0.69636630502245733,9.6985206154126015E-4,9.6985206154126015E-4,0.78520316626166531,4.5624256910743489E-2,1.8320716386487166E-2,6.846720000000002E-2,0,0.13297030707074994,1.5071697809844604,7.0418383210095137E-2,7.3695999999999996E-3,7.8295218095863248E-2,0.10377600000000001,8.3999999999999993E-4,2.5399999999999999E-2,0.10515599999999999,9.6519999999999995E-2,2.6239999999999999E-2,0.51819498505486816,0.52307438825375441,0.52307438825375441,8.2249999999999996,0.94020691125396716,4.6336367426272487,2.5884498562048548,null,94.020691125396709,0.17918691560521158,0.31504152516661321,0.20146246707074994,0.11254129809586325,0.3438874726485428]
[null,null,null,null,null,null,48,24,1,1.68,1.68,0.3888888888888889,0.21358671865342274,1.4786420073507058,2.419321003675353,0.94067899632464702,0,1.7333777763349349,8.1124159918279787E-2,0.1,0.18240353739319337,0.42684718048950931,3.6439703098368749E-4,3.6439703098368749E-4,0.71040460136760808,1.0093493952885405E-3,1.0093493952885405E-3,0.80108822098121502,4.748893299681875E-2,1.8710518862795403E-2,6.846720000000002E-2,0,0.13525758981264718,1.537158475140737,7.3248541508606865E-2,7.5263999999999991E-3,8.1322966064904412E-2,0.10598399999999999,8.3999999999999993E-4,2.5399999999999999E-2,0.10515599999999999,9.6519999999999995E-2,2.6239999999999999E-2,0.5287897532865008,0.53397432551565083,0.53397432551565083,8.4,0.94023104319982131,4.7197616856908855,2.6748467794928015,null,94.023104319982139,0.18240353739319337,0.32256455587755162,0.20520702981264718,0.11629768606490441,0.35157078812245746]
[null,null,null,null,null,null,49,24,1,1.7150000000000001,1.7150000000000001,0.39699074074074076,0.21369642287719731,1.4791237532272339,2.4545618766136172,0.97543812338638314,0,1.7673545927308283,8.4335640924062302E-2,0.1,0.1856896264555124,0.42698624854525657,3.6463451289350324E-4,3.6463451289350324E-4,0.72446505979592646,1.0496992457302305E-3,1.0496992457302305E-3,0.81700049382386564,4.9394245711224576E-2,1.9100321339103641E-2,6.846720000000002E-2,0,0.13758699960833806,1.5671797757558994,7.6137625935687639E-2,7.6831999999999994E-3,8.4412104159091284E-2,0.108192,8.3999999999999993E-4,2.5399999999999999E-2,0.10515599999999999,9.6519999999999995E-2,2.6239999999999999E-2,0.53955023391007817,0.5450544999980842,0.5450544999980842,8.5750000000000011,0.94023560933783912,4.8068555509917754,2.7626556756590994,null,94.023560933783912,0.1856896264555124,0.33019110376742933,0.20899371960833807,0.12011546415909129,0.35936487354257179]
[null,null,null,null,null,null,50,24,1,1.75,1.75,0.40509259259259256,0.21380613768547233,1.4796052872014955,2.4898026436007479,1.0101973563992521,0,1.8013705848120809,8.7613271563307893E-2,0.1,0.18904529791077032,0.4271252554300885,3.648719676524367E-4,3.648719676524367E-4,0.73854672280946565,1.0909025235452034E-3,1.0909025235452034E-3,0.83293891116845542,5.1340255000648406E-2,1.9490123815411878E-2,6.846720000000002E-2,0,0.13995864597284913,1.5972315906241419,7.9085611376719517E-2,7.8399999999999997E-3,8.7562706795183687E-2,0.1104,8.3999999999999993E-4,2.5399999999999999E-2,0.10515599999999999,9.6519999999999995E-2,2.6239999999999999E-2,0.55047646175608778,0.55631542840020254,0.55631542840020254,8.75,0.94022173085789817,4.8949208573755296,2.8518782562892246,null,94.022173085789817,0.18904529791077032,0.33792135276803281,0.21282264597284911,0.12399470679518368,0.36727013048943224]
[null,null,null,null,null,null,51,24,1,1.7849999999999999,1.7849999999999999,0.41319444444444436,0.21391586307977978,1.4800866092428226,2.5250433046214114,1.0449566953785885,0,1.8354235744295264,9.095705183443481E-2,0.1,0.19247066941446633,0.42726420113515207,3.6510939514331934E-4,3.6510939514331934E-4,0.75264870254219518,1.1329601388768995E-3,1.1329601388768995E-3,0.84890247763313831,5.3327020823344382E-2,1.9879926291720116E-2,6.846720000000002E-2,0,0.14237263951658466,1.6273119802422578,8.2092472712239323E-2,7.9967999999999984E-3,9.0774850450124497E-2,0.112608,8.3999999999999993E-4,2.5399999999999999E-2,0.10515599999999999,9.6519999999999995E-2,2.6239999999999999E-2,0.56156847166173862,0.56775763698097959,0.56775763698097959,8.9249999999999989,0.94019044215674863,4.9839601488814473,2.9425162803528635,null,94.019044215674867,0.19247066941446633,0.34575548996670913,0.21669391951658468,0.12793549045012451,0.37528696756651325]
["Controller","Input Value","Units","Std Units",null,null,52,24,1,1.82,1.82,0.42129629629629628,0.21402559906165178,1.4805677193205409,2.5602838596602706,1.0797161403397295,0,1.8695115398479099,9.4366981735861583E-2,0.1,0.19596586116940584,0.4274030856515923,3.6534679524900473E-4,3.6534679524900473E-4,0.76677017460678254,1.1758730013330316E-3,1.1758730013330316E-3,0.864890269161948,5.5354603149135991E-2,2.0269728768028353E-2,6.846720000000002E-2,0,0.14482909195283827,1.6574191443124688,8.5158184817937757E-2,8.1536000000000004E-3,9.4048613666590869E-2,0.114816,8.3999999999999993E-4,2.5399999999999999E-2,0.10515599999999999,9.6519999999999995E-2,2.6239999999999999E-2,0.57282629847096367,0.57938166162721982,0.57938166162721982,9.1,0.9401426989986239,5.0739759949152798,3.0345715543315901,null,94.014269899862384,0.19596586116940584,0.35369370561942914,0.22060765195283827,0.13193789366659087,0.38341580045781398]
["θJA",23,"°C/W","Junction to Ambient Resistance",null,null,53,24,1,1.855,1.855,0.42939814814814814,0.2141353456326209,1.4810486174039696,2.595524308701985,1.1144756912980152,0,1.9036326021389169,9.7843061266006975E-2,0.1,0.19953099593634713,0.4275419089705525,3.6558416785236841E-4,3.6558416785236841E-4,0.78091037257334373,1.2196420199852771E-3,1.2196420199852771E-3,0.8809014268213724,5.7423061959418799E-2,2.0659531244336591E-2,6.846720000000002E-2,0,0.14732811610538796,1.6875514096317938,8.8282722564657884E-2,8.310399999999999E-3,9.7384077058719376E-2,0.117024,8.3999999999999993E-4,2.5399999999999999E-2,0.10515599999999999,9.6519999999999995E-2,2.6239999999999999E-2,0.58424997703442028,0.59118804792297752,0.59118804792297752,9.2750000000000004,0.94007938577174854,5.1649709904239227,3.1280459323505458,null,94.007938577174855,0.19953099593634713,0.36173619316410732,0.22456395610538796,0.13600199705871938,0.39165705198663037]
["Theta JC",2,"°C/W","Junction to Ambient Resistance",null,null,54,24,1,1.89,1.89,0.43749999999999994,0.21424510279421982,1.4815293034624224,2.6307646517312113,1.1492353482687887,0,1.9377850129511669,0.10138529042329016,0.1,0.2031661990448887,0.4276806710831742,3.6582151283630847E-4,3.6582151283630847E-4,0.79506858300683214,1.2642681033689838E-3,1.2642681033689838E-3,0.89693515122455114,5.9532457247163419E-2,2.1049333720644828E-2,6.846720000000002E-2,0,0.14986982591617579,1.7177072192070293,9.1466060818394299E-2,8.4671999999999994E-3,0.10078132331800689,0.119232,8.3999999999999993E-4,2.5399999999999999E-2,0.10515599999999999,9.6519999999999995E-2,2.6239999999999999E-2,0.59583954220949276,0.60317735122040561,0.60317735122040561,9.4499999999999993,0.94000132195547281,5.2569477560720435,3.2229413163141589,null,94.00013219554728,0.2031661990448887,0.3698831492341827,0.22856294591617579,0.14012788331800691,0.40001115217551692]
[null,null,null,null,null,null,55,24,1,1.925,1.925,0.4456018518518518,0.21435487054798169,1.4820097774652066,2.6660048887326031,1.1839951112673968,0,1.9719671434995749,0.10499366920613057,0.1,0.20687159840459832,0.42781937198059722,3.6605883008374523E-4,3.6605883008374523E-4,0.80924414099913811,1.3097521594828659E-3,1.3097521594828659E-3,0.91299069751128248,6.1682849016918215E-2,2.1439136196953066E-2,6.846720000000002E-2,0,0.15245433645307296,1.7478851224550587,9.4708174440291795E-2,8.6239999999999997E-3,0.10424043721938715,0.12144000000000001,8.3999999999999993E-4,2.5399999999999999E-2,0.10515599999999999,9.6519999999999995E-2,2.6239999999999999E-2,0.60759502886029371,0.61535013671205252,0.61535013671205252,9.625,0.93990926789641704,5.3499089384206782,3.3192596560459049,null,93.990926789641705,0.20687159840459832,0.37813477367246012,0.23260473645307297,0.14431563721938717,0.40847853830745418]
[null,null,null,null,null,null,56,24,1,1.96,1.96,0.45370370370370372,0.21446464889543987,1.482490039381624,2.7012450196908118,1.2187549803091879,0,2.0061774746364813,0.10866819761294787,0.1,0.2106473245163859,0.4279580116539598,3.6629611947762159E-4,3.6629611947762159E-4,0.82343642614008128,1.3560950957886991E-3,1.3560950957886991E-3,0.92906737082112978,6.3874297284812018E-2,2.1828938673261303E-2,6.846720000000002E-2,0,0.15508176391773126,1.7780837663660065,9.8009038286644021E-2,8.7807999999999983E-3,0.10776150562748409,0.12364800000000001,8.3999999999999993E-4,2.5399999999999999E-2,0.10515599999999999,9.6519999999999995E-2,2.6239999999999999E-2,0.61951647185766523,0.62770697950462673,0.62770697950462673,9.8000000000000007,0.9398039299782428,5.4438572101078195,3.4170029494321339,null,93.980392997824282,0.2106473245163859,0.3864912695452154,0.23668944391773128,0.14856534562748408,0.41705965498824082]
["Outputs",null,null,null,null,null,57,24,1,1.9950000000000001,1.9950000000000001,0.46180555555555558,0.21457443783812805,1.4829700891809703,2.7364850445904851,1.2535149554095151,0,2.0404145878841513,0.11240887564216216,0.1,0.21449351048412255,0.42809659009439827,3.665333809009025E-4,3.665333809009025E-4,0.83764485887845941,1.4032978192110284E-3,1.4032978192110284E-3,0.94516452220476155,6.610686207855708E-2,2.2218741149569541E-2,6.846720000000002E-2,0,0.15775222565352201,1.808301887522074,0.10136862720889275,8.9376000000000004E-3,0.11134461750304397,0.12585600000000002,8.3999999999999993E-4,2.5399999999999999E-2,0.10515599999999999,9.6519999999999995E-2,2.6239999999999999E-2,0.6316039060791816,0.64024846469424845,0.64024846469424845,9.9750000000000014,0.93968596525802661,5.5387952700310068,3.5161732425700118,null,93.968596525802667,0.21449351048412255,0.39495284315656604,0.24081718565352203,0.15287709750304398,0.42575495421012588]
["Design","Value","Units",null,null,null,58,24,1,2.0299999999999998,2.0299999999999998,0.46990740740740733,0.21468423737758019,1.4834499268325361,2.771724963416268,1.2882750365837317,0,2.0746771573231064,0.1162157032921937,0.1,0.2184102920265068,0.4282351072930477,3.6677061423657614E-4,3.6677061423657614E-4,0.85186889723033554,1.4513612361368559E-3,1.4513612361368559E-3,0.96128154492542539,6.8380603437451726E-2,2.2608543625877778E-2,6.846720000000002E-2,0,0.16046584015356294,1.8385383048781099,0.10478691605362629,9.094399999999999E-3,0.11498986390954496,0.12806399999999998,8.3999999999999993E-4,2.5399999999999999E-2,0.10515599999999999,9.6519999999999995E-2,2.6239999999999999E-2,0.64385736640914948,0.65297518744320571,0.65297518744320571,10.149999999999999,0.93955598563234799,5.6347258435319478,3.616772629919534,null,93.955598563234801,0.2184102920265068,0.40351970406310789,0.24498808015356294,0.15725098390954495,0.4345648954166989]
["Dmax",{"$f":"D1_Vinmin","v":0.27777777777777779},"index",null,null,null,59,24,1,2.0649999999999999,2.0649999999999999,0.47800925925925919,0.21479404751533052,1.4839295523056049,2.8069647761528023,1.3230352238471976,0,2.1089639422436379,0.12008868056146332,0.1,0.22239780748918131,0.42837356324104092,3.6700781936765221E-4,3.6700781936765221E-4,0.86610803379698253,1.5002862524153503E-3,1.5002862524153503E-3,0.97741787110832856,7.0695581412383343E-2,2.2998346102186016E-2,6.846720000000002E-2,0,0.1632227270688352,1.8687919132214506,0.10826387966257857,9.2511999999999994E-3,0.11869733801998769,0.130272,8.3999999999999993E-4,2.5399999999999999E-2,0.10515599999999999,9.6519999999999995E-2,2.6239999999999999E-2,0.65627688773861137,0.66588775305823988,0.66588775305823988,10.324999999999999,0.93941456158780667,5.7316516825832098,3.7188032544597172,null,93.941456158780667,0.22239780748918131,0.41219206508882289,0.2492022470688352,0.16168709801998771,0.44348994556905857]
["Dprime",{"$f":"1-B68","v":0.72222222222222221},"index",null,null,null,60,24,1,2.1,2.1,0.4861111111111111,0.2149038682529136,1.4844089655694543,2.8422044827847275,1.3577955172152729,0,2.1432737804789621,0.12402780744839173,0.1,0.22645619785710036,0.42851195792950925,3.6724499617716303E-4,3.6724499617716303E-4,0.88036179305940243,1.5500737733575322E-3,1.5500737733575322E-3,0.99357296870076361,7.3051856065830797E-2,2.3388148578494257E-2,6.846720000000002E-2,0,0.16602300721638957,1.899061677238455,0.11179949287262773,9.4079999999999997E-3,0.12246713512386562,0.13248000000000001,8.3999999999999993E-4,2.5399999999999999E-2,0.10515599999999999,9.6519999999999995E-2,2.6239999999999999E-2,0.66886250496534461,0.67898677707037292,0.67898677707037292,10.5,0.93926222558353256,5.8295755659769615,3.8222673078489096,null,93.92622255835326,0.22645619785710036,0.4209701423402552,0.25345980721638961,0.16618553512386564,0.45253057921327255]
["Ipp",{"$f":"Iripple_Vinnom","v":1.4955569962004385},"A",null,null,null,61,24,1,2.1349999999999998,2.1349999999999998,0.49421296296296285,0.21501369959186437,1.4848881665933575,2.8774440832966786,1.392555916703321,0,2.177605582348209,0.12803308395140023,0.1,0.23058560676715237,0.42865029134958244,3.6748214454816383E-4,3.6748214454816383E-4,0.89462972892029025,1.600724703735984E-3,1.600724703735984E-3,1.0097463387102488,7.5449487471867666E-2,2.3777951054802487E-2,6.846720000000002E-2,0,0.16886680258764525,1.9293466261238101,0.1153937305157952,9.5647999999999983E-3,0.12629935263431796,0.134688,8.3999999999999993E-4,2.5399999999999999E-2,0.10515599999999999,9.6519999999999995E-2,2.6239999999999999E-2,0.68161425299386569,0.69227288531630815,0.69227288531630815,10.674999999999999,0.93909947510712499,5.9285002995158402,3.9271670305893132,null,93.909947510712499,0.23058560676715237,0.42985415522196324,0.25776088258764523,0.17074639263431796,0.46168727854915581]
["Top FET","Value","Units",null,null,null,62,24,1,2.17,2.17,0.50231481481481477,0.2151235415337179,1.4853671553465795,2.9126835776732896,1.4273164223267103,0,2.2119583251458121,0.13210451006891041,0.1,0.2347861805210375,0.4287885634923882,3.6771926436373166E-4,3.6771926436373166E-4,0.90891142246770695,1.652239947784541E-3,1.652239947784541E-3,1.0259375126917691,7.7888535716164872E-2,2.4167753531110728E-2,6.846720000000002E-2,0,0.17175423635678036,1.9596458486761561,0.11904656741924445,9.7215999999999986E-3,0.13019409009546506,0.13689599999999999,8.3999999999999993E-4,2.5399999999999999E-2,0.10515599999999999,9.6519999999999995E-2,2.6239999999999999E-2,0.6945321667354305,0.7057467140214172,0.7057467140214172,10.85,0.93892677544021586,6.0284287162059478,4.0335047121956968,null,93.892677544021581,0.2347861805210375,0.43884432645224547,0.26210559635678032,0.17536977009546506,0.4709605335003797]
["Tr",{"$f":"(Qgd_Q1+Qgs_Q1/2)*(RdsonDRT+Rgate1)/(VCC-Vsp_Q1)*1000000000","v":1.0792691218130315},"ns","Turn on of MOSFET -> Rise time of current",null,null,63,24,1,2.2050000000000001,2.2050000000000001,0.51041666666666663,0.21523339408000966,1.4858459317983805,2.9479229658991901,1.4620770341008098,0,2.2463310481212431,0.13624208579934405,0.1,0.23905806809840388,0.42892677434905269,3.6795635550696633E-4,3.6795635550696633E-4,0.92320647993772009,1.7046204091979919E-3,1.7046204091979919E-3,1.04214605045857,8.0369060895993327E-2,2.4557556007418966E-2,6.846720000000002E-2,0,0.17468543288921581,1.989958488830128,0.12275797840527969,9.878399999999999E-3,0.13415144918992755,0.13910400000000001,8.3999999999999993E-4,2.5399999999999999E-2,0.10515599999999999,9.6519999999999995E-2,2.6239999999999999E-2,0.70761628110803609,0.71940890988433814,0.71940890988433814,11.025,0.9387445621653322,6.1293636764519643,4.1412826913683336,null,93.874456216533218,0.23905806809840388,0.4479408820791434,0.26649407288921584,0.18005576918992755,0.48035084178593423]
["Tf",{"$f":"(Qgd_Q1+Qgs_Q1/2)*(RdsonDRT2+Rgate1)/(Vsp_Q1)*1000000000","v":1.240983713355049},"ns","Turn off of MOSFET -> Fall time of current",null,null,64,{"$f":"Vin","v":24},{"$f":"MODE","v":1},2.2400000000000002,{"$f":"Iout*G73/100/Number_of_Phases","v":2.2400000000000002},{"$f":"Vout*K73/(Vin*Efficiency)","v":0.51851851851851849},{"$f":"(Vout+(Rdson2+Rs+Rdcr)*K73)/(Vin+(Rs+Rdson2-Rdson1)*K73)","v":0.21534325723227543},{"$f":"(Vin-(Rdson1+Rdcr)*K73-Vout)*M73/(Fsw*Lf)","v":1.486324495918016},2.9831622479590081,1.4968377520409923,{"$f":"IF(MIN(Vin, -P73/(Coss_Q1+Coss_Q2)*0.00000002)<0, 0, MIN(Vin, -P73/(Coss_Q1+Coss_Q2)*0.00000002))","v":0},2.2807228478994319,{"$f":"R73^2*Rdcr","v":0.14044581114112337},{"$f":"Core_Loss","v":0.1},{"$f":"(T73+S73*(1+Ltc*(Ta-25)))/(1-S73*Ltc*ThetaCa)","v":0.2434014211702443},0.42906492391070067,3.6819341786099071E-4,3.6819341786099071E-4,0.93751453085586278,1.757866991131777E-3,1.757866991131777E-3,1.0583715379938654,{"$f":"Rdson1*AB73^2","v":8.2891123120227006E-2},{"$f":"(Vin*K73/2)*Fsw*(Tr_buck+Tf_buck)","v":2.4947358483727207E-2},{"$f":"(0.5*Coss_Q1*(Vin-Q73)^2-0.5*Coss_Q2*(Vin-Q73)^2+(Qoss_Q2*(Vin-Q73)/Vin)*Vin)*Fsw","v":6.846720000000002E-2},{"$f":"IF(K73>N73/2,0,ABS(K73-N73/2)*Vsd_Q1*Deadtime*Fsw)","v":0},{"$f":"(AF73+AE73+AD73+AC73*(1+RdsonTopTc*Ta-RdsonTopTc*25))/(1-AC73*RdsonTopTc*ThetaJA_Q1)","v":0.17766051775019423},{"$f":"SQRT((1-M73))*SQRT(K73^2+(N73^2)/12)","v":2.0202837415806214},{"$f":"Rdson2*AH73^2","v":0.12652793829134484},{"$f":"IF(K73<N73/2,Deadtime*Fsw*Vsd_Q2*(K73+N73/2),2*Deadtime*Fsw*Vsd_Q2*K73)","v":1.0035199999999999E-2},{"$f":"(AJ73+AI73*(1+RdsonBotTc*Ta-RdsonBotTc*25))/(1-AI73*RdsonBotTc*ThetaJA_Q2)","v":0.13817153374653099},{"$f":"Qrr_Q2*K73/Iout*Fsw*Vin","v":0.14131200000000002},{"$f":"Iq*Vin","v":8.3999999999999993E-4},{"$f":"IF(Ext_VCC=1,  (Qg_Q1+Qg_Q2)*Fsw*Vout, (Qg_Q1+Qg_Q2)*Fsw*Vin)","v":2.5399999999999999E-2},{"$f":"(Vin-VCC)*Fsw*(Qg_Q1+Qg_Q2)","v":0.10515599999999999},{"$f":"(Qg_Q1+Qg_Q2)*Fsw*(Vin-Vout)","v":9.6519999999999995E-2},2.6239999999999999E-2,0.72086663103642246,{"$f":"U73 + ((AF73+AE73+AD73+AC73*(1+RdsonTC*(Ta-25))) + (AJ73+AI73*(1+RdsonTC*(Ta-25))) + AQ73 + AL73) / (1-AC73*RdsonTC*ThetaJA_Q1 -AI73*RdsonTC*ThetaJA_Q2)","v":0.73326013016320979},0.73326013016320979,{"$f":"Vout*K73","v":11.200000000000001},0.93855324344185054,{"$f":"ThetaJA_Q1*BC73","v":6.2313080682544681},{"$f":"ThetaJA_Q2*BD73","v":4.2505033561702126},null,93.85532434418505,{"$f":"U73","v":0.2434014211702443},{"$f":"AG73+AK73+AL73","v":0.45714405149672521},{"$f":"AG73+AL73*0.66","v":0.27092643775019426},{"$f":"AK73+AL73*0.33","v":0.18480449374653099},0.48985870899296546]
["Part Power","Value","Units",null,null,null,65,24,1,{"$f":"Iout*G74/100","v":2.2749999999999999},2.2749999999999999,0.52662037037037035,0.21545313099205116,1.486802847674733,{"$f":"K74+N74/2","v":3.0184014238373664},{"$f":"K74-N74/2","v":1.5315985761626334},0,{"$f":"SQRT(K74^2+(N74^2)/12)","v":2.3151328742978174},0.1447156860926708,0.1,0.24781639411255521,{"$f":"N74/SQRT(12)","v":0.42920301216845463},{"$f":"RCoutEsr*V74^2","v":3.6843045130894925E-4},{"$f":"W74","v":3.6843045130894925E-4},{"$f":"SQRT(M74*(1-M74))*SQRT(K74^2+(N74^2)/12)","v":0.95183522633953876},{"$f":"RCinEsr*Y74^2","v":1.8119805962016819E-3},{"$f":"Z74","v":1.8119805962016819E-3},{"$f":"SQRT(M74)*SQRT(K74^2+(N74^2)/12)","v":1.0746135855433796},8.5454782509345475E-2,2.5337160960035437E-2,6.846720000000002E-2,0,0.18067961771345381,2.0506208492600662,0.13035642189002231,1.0191999999999998E-2,0.14225444974819632,0.14352000000000004,8.3999999999999993E-4,2.5399999999999999E-2,0.10515599999999999,9.6519999999999995E-2,2.6239999999999999E-2,{"$f":"SUM(S74,T74,AC74,AD74,AE74,AF74,AI74,AJ74,AQ74, AL74)","v":0.73428325145207407},0.74730104276356035,{"$f":"AS74","v":0.74730104276356035},11.375,{"$f":"AU74/(AU74+AT74)","v":0.93835320207547035},6.334264807409439,4.3611691442085156,null,{"$f":"AV74*100","v":93.835320207547028},0.24781639411255521,0.46645406746165013,0.27540281771345387,0.18961604974819635,{"$f":"AS74-BA74","v":0.49948464865100517}]
["Power Dis",{"$f":"AQ9","v":2.6239999999999999E-2},"W",null,null,null,66,24,1,2.31,2.31,0.53472222222222221,0.21556301536087327,1.4872809870377748,3.0536404935188877,1.5663595064811127,0,2.3495603265008977,0.14905171065240916,0.1,0.25230314402026127,0.4293410391134358,3.686674557340096E-4,3.686674557340096E-4,0.96616823754549608,1.8669621264835404E-3,1.8669621264835404E-3,1.0908718258708849,8.8060099195436989E-2,2.5726963436343678E-2,6.846720000000002E-2,0,0.18374286076999977,2.0809690981338784,0.13424340400903192,1.03488E-2,0.14640030534001802,0.145728,8.3999999999999993E-4,2.5399999999999999E-2,0.10515599999999999,9.6519999999999995E-2,{"$f":"SUM(AM75:AN75)","v":2.6239999999999999E-2},0.7478661772932218,0.76153232632787948,0.76153232632787948,11.55,0.9381447974027276,6.4382368377099946,4.4732825428204146,null,93.814479740272759,0.25230314402026127,0.47587116611001778,0.27992334076999975,0.19449054534001803,0.50922918230761827]
["Temp rise",{"$f":"B75*B62","v":0.60351999999999995},"°C",null,null,null,67,24,1,2.3450000000000002,2.3450000000000002,0.54282407407407407,0.21567291034027844,1.4877589139763778,3.088879456988189,1.6011205430118114,0,2.384004449557442,0.1534538848187614,0.1,0.25686183072140678,0.42947900473676354,3.6890443101936194E-4,3.6890443101936194E-4,0.98051325424823443,1.9228124835129257E-3,1.9228124835129257E-3,1.1071459126608538,9.0707133322200983E-2,2.6116765912651916E-2,6.846720000000002E-2,0,0.18685037613697245,2.1113278152830857,0.1381888594512295,1.05056E-2,0.1506092108375304,0.14793600000000001,8.3999999999999993E-4,2.5399999999999999E-2,0.10515599999999999,9.6519999999999995E-2,2.6239999999999999E-2,0.76161544350484389,0.77595467032689225,0.77595467032689225,11.725000000000001,0.93792836700954119,6.543227131150366,4.586846089263199,null,93.792836700954112,0.25686183072140678,0.48539558697450286,0.28448813613697244,0.19942809083753041,0.51909283960548547]
["Current (switching)",{"$f":"(Qg_Q1+Qg_Q2)*Fsw+Iq","v":5.1149999999999998E-3},"A",null,null,null,68,24,1,2.38,2.38,0.55092592592592582,0.21578281593180348,1.4882366284597719,3.1241183142298858,1.6358816857701139,0,2.4184645311693345,0.15792220859015094,0.1,0.26149261679161739,0.42961690902955518,3.6914137704821819E-4,3.6914137704821819E-4,0.9948699835367566,1.9795325682848528E-3,1.9795325682848528E-3,1.1234355190540806,9.3395945044951037E-2,2.6506568388960153E-2,6.846720000000002E-2,0,0.19000229426661525,2.1416963657465073,0.14219276301460571,1.0662399999999999E-2,0.1548812787351638,0.150144,8.3999999999999993E-4,2.5399999999999999E-2,0.10515599999999999,9.6519999999999995E-2,2.6239999999999999E-2,0.77553108503866786,0.7905687751525643,0.7905687751525643,11.899999999999999,0.93770422830059008,6.6492386881321508,4.7018623709087679,null,93.770422830059005,0.26149261679161739,0.49502757300177908,0.28909733426661527,0.20442879873516381,0.5290761583609469]
["Qrr Current",{"$f":"Qrr_Q2*Fsw","v":9.1999999999999998E-3},"A",null,null,null,69,24,1,2.415,2.415,0.55902777777777768,0.21589273213698573,1.4887141304571823,3.1593570652285914,1.6706429347714089,0,2.4529398987443432,0.16245668196500151,0.1,0.266195667568834,0.42975475198292695,3.6937829370381416E-4,3.6937829370381416E-4,1.0092381486184208,2.037123281253475E-3,2.037123281253475E-3,1.139740336303642,9.6126594530617879E-2,2.6896370865268391E-2,6.846720000000002E-2,0,0.19319874685534269,2.1720741498978273,0.14625508949228547,1.0819199999999999E-2,0.15921662371489292,0.15235200000000004,8.3999999999999993E-4,2.5399999999999999E-2,0.10515599999999999,9.6519999999999995E-2,2.6239999999999999E-2,0.78961313685317336,0.80537535221286172,0.80537535221286172,12.074999999999999,0.93747267993440142,6.7562745376728817,4.818334025442538,null,93.747267993440147,0.266195667568834,0.50476737057023569,0.29375106685534269,0.20949278371489294,0.53917968464402777]
["Diode Current",{"$f":"Deadtime*Fsw*(Iripple_Vinnom/2)*(Vsd_Q2)/Vin","v":6.9792659822687141E-5},null,null,null,null,70,24,1,2.4500000000000002,2.4500000000000002,0.56712962962962954,0.21600265895736262,1.4891914199378273,3.194595709968914,1.7054042900310864,0,2.4874299166880469,0.16705730494173701,0.1,0.27097115116832138,0.42989253358799284,3.6961518086940708E-4,3.6961518086940708E-4,1.023617487719845,2.0955855223317743E-3,2.0955855223317743E-3,1.1560600725399042,9.8899141957751666E-2,2.7286173341576628E-2,6.846720000000002E-2,0,0.19643986685290868,2.2024606010355181,0.15037581367252578,1.0976E-2,0.16361536265507534,0.15456,8.3999999999999993E-4,2.5399999999999999E-2,0.10515599999999999,9.6519999999999995E-2,2.6239999999999999E-2,0.80386163391359122,0.82037512402828994,0.82037512402828994,12.25,0.93723400313735983,6.8643377376168999,4.9362637410667327,null,93.723400313735979,0.27097115116832138,0.514615229507984,0.29844946685290868,0.21462016265507533,0.54940397285996856]
["Total",{"$f":"SUM(B77:B79)","v":1.4384792659822686E-2},"A",null,null,null,71,24,1,2.4849999999999999,2.4849999999999999,0.5752314814814814,0.21611259639447203,1.48966849687092,3.2298342484354601,1.7401657515645399,0,2.5219339839127706,0.17172407751878174,0.1,0.27581923849795398,0.43003025383586546,3.6985203842827775E-4,3.6985203842827775E-4,1.0380077530758784,2.1549201908912679E-3,2.1549201908912679E-3,1.1723944516344809,0.10171364751652531,2.7675975817884866E-2,6.846720000000002E-2,0,0.19972578847167849,2.2328551831658996,0.15455491033871552,1.1132799999999998E-2,0.1680776146394862,0.15676799999999999,8.3999999999999993E-4,2.5399999999999999E-2,0.10515599999999999,9.6519999999999995E-2,2.6239999999999999E-2,0.81827661119190753,0.83556882433023993,0.83556882433023993,12.424999999999999,0.93698846290838189,6.9734313748486052,5.0556542567081824,null,93.69884629083819,0.27581923849795398,0.52457140311116468,0.30319266847167847,0.21981105463948619,0.55974958583228596]
[null,null,null,null,null,null,72,24,1,2.52,2.52,0.58333333333333326,0.21622254444985206,1.4901453612256668,3.2650726806128336,1.7749273193871666,0,2.5564515315436482,0.17645699969456033,0.1,0.28074010327378285,0.43016791271765542,3.7008886626372885E-4,3.7008886626372885E-4,1.0524087099985673,2.2151281857616971E-3,2.2151281857616971E-3,1.1887432121540771,0.10457017140873709,2.8065778294193103E-2,6.846720000000002E-2,0,0.20305664719600339,2.2632573889616427,0.15879235426937366,1.1289599999999999E-2,0.17260350096654617,0.15897600000000001,8.3999999999999993E-4,2.5399999999999999E-2,0.10515599999999999,9.6519999999999995E-2,2.6239999999999999E-2,0.8328581036668643,0.85095719816116933,0.85095719816116933,12.6,0.93673630912471417,7.0835585655080786,5.1765083622305621,null,93.673630912471424,0.28074010327378285,0.53463614816254956,0.3079808071960034,0.22506558096654616,0.57021709488738648]
[null,null,null,null,null,null,73,24,1,2.5550000000000002,2.5550000000000002,0.59143518518518512,0.21633250312504118,1.4906220129712686,3.3003110064856345,1.8096889935143659,0,2.5909820208039931,0.18125607146749767,0.1,0.28573392203588382,0.43030551022447189,3.7032566425908617E-4,3.7032566425908617E-4,1.0668201360188903,2.2762104052307269E-3,2.2762104052307269E-3,1.2051061063960935,0.1074687738478133,2.8455580770501344E-2,6.846720000000002E-2,0,0.20643257979170052,2.2936667378798496,0.16308812023814812,1.1446399999999999E-2,0.17719314515874643,0.16118399999999999,8.3999999999999993E-4,2.5399999999999999E-2,0.10515599999999999,9.6519999999999995E-2,2.6239999999999999E-2,0.84760614632396047,0.86654100197664219,0.86654100197664219,12.775,0.93647777755818917,7.1947224552091127,5.298828898651168,null,93.647777755818922,0.28573392203588382,0.54480972495044688,0.31281401979170054,0.23038386515874643,0.58080707994075831]
[null,null,null,null,null,null,74,24,1,2.59,2.59,0.59953703703703698,0.21644247242157802,1.4910984520769199,3.3355492260384598,1.8444507739615399,0,2.6255249410639481,0.18612129283601889,0.1,0.29080087416449252,0.43044304634742203,3.7056243229769781E-4,3.7056243229769781E-4,1.0812418200947562,2.3381677470436426E-3,2.3381677470436426E-3,1.2214828994986875,0.11040951505881133,2.8845383246809578E-2,6.846720000000002E-2,0,0.20985372431563867,2.3240827744254564,0.16744218301381492,1.1603199999999998E-2,0.18184667297227236,0.16339199999999998,8.3999999999999993E-4,2.5399999999999999E-2,0.10515599999999999,9.6519999999999995E-2,2.6239999999999999E-2,0.86252077415545469,0.88232100374926092,0.88232100374926092,12.95,0.93621309081027637,7.3069262192596902,5.4226187583622645,null,93.621309081027633,0.29080087416449252,0.55509239728791104,0.3176924443156387,0.23576603297227236,0.59152012958476841]
[null,null,null,null,null,null,75,24,1,2.625,2.625,0.60763888888888884,0.21655245234100162,1.49157467851181,3.3707873392559051,1.8792126607440949,0,2.660079808037997,0.1910526637985496,0.1,0.29594114189642673,0.43058052107761152,3.7079917026293493E-4,3.7079917026293493E-4,1.0956735618794142,2.4010011084030451E-3,2.4010011084030451E-3,1.237873368618712,0.11339245527842237,2.9235185723117816E-2,6.846720000000002E-2,0,0.21332022012543136,2.3545050665471137,0.17185451736027688,1.176E-2,0.18656421240682539,0.1656,8.3999999999999993E-4,2.5399999999999999E-2,0.10515599999999999,9.6519999999999995E-2,2.6239999999999999E-2,0.87760202216036676,0.89829798307451569,0.89829798307451569,13.125,0.93594245917338981,7.4201730628849205,5.5478808853569843,null,93.594245917338981,0.29594114189642673,0.56548443253225678,0.32261622012543134,0.24121221240682539,0.60235684117808896]
[null,null,null,null,null,null,76,24,1,2.66,2.66,0.6157407407407407,0.21666244288485134,1.4920506922451218,3.4060253461225609,1.9139746538774394,0,2.6946461621183393,0.19605018435351557,0.1,0.30115491034180064,0.43071793440614431,3.7103587803819128E-4,3.7103587803819128E-4,1.1101151710450017,2.4647113859685467E-3,2.4647113859685467E-3,1.2542773021716107,0.11641765475497416,2.9624988199426053E-2,6.846720000000002E-2,0,0.21683220788923857,2.3849332041539864,0.17632509803656218,1.19168E-2,0.19134589371564625,0.16780800000000001,8.3999999999999993E-4,2.5399999999999999E-2,0.10515599999999999,9.6519999999999995E-2,2.6239999999999999E-2,0.89284992534447793,0.91447273127857986,0.91447273127857986,13.3,0.93566608142514462,7.5344662214524876,5.6746182754598635,null,93.566608142514468,0.30115491034180064,0.57598610160488484,0.32758548788923858,0.24672253371564626,0.61331782093677922]
[null,null,null,null,null,null,77,24,1,2.6949999999999998,2.6949999999999998,0.62384259259259256,0.21677244405466672,1.4925264932460323,3.441263246623016,1.9487367533769837,0,2.7292235668324132,0.20111385449934285,0.1,0.30644236750103265,0.43085528632412246,3.7127255550688308E-4,3.7127255550688308E-4,1.1245664666564772,2.5292994758564671E-3,2.5292994758564671E-3,1.2706944991279256,0.11948517374843376,3.0014790675734287E-2,6.846720000000002E-2,0,0.22038982959567779,2.4153667977430406,0.18085389979682356,1.2073599999999999E-2,0.19619184941574086,0.17001599999999997,8.3999999999999993E-4,2.5399999999999999E-2,0.10515599999999999,9.6519999999999995E-2,2.6239999999999999E-2,0.90826451872033453,0.93084605152808586,0.93084605152808586,13.475,0.93538414556156202,7.6498089607005886,5.8028339765620389,null,93.538414556156198,0.30644236750103265,0.58659767901141857,0.33260038959567778,0.25229712941574084,0.62440368402705326]
[null,null,null,null,null,null,78,24,1,2.73,2.73,0.63194444444444442,0.21688245585198773,1.4930020814837128,3.4765010407418564,1.9834989592581436,0,2.7638116074139756,0.20624367423445802,0.1,0.31180370428215076,0.43099257682264663,3.7150920255244992E-4,3.7150920255244992E-4,1.1390272765916385,2.59476627363953E-3,2.59476627363953E-3,1.2871247683615887,0.12259507253041063,3.0404593152042528E-2,6.846720000000002E-2,0,0.2239932285638469,2.4458054771273918,0.18544089739033681,1.2230399999999999E-2,0.20110221429830974,0.17222400000000004,8.3999999999999993E-4,2.5399999999999999E-2,0.10515599999999999,9.6519999999999995E-2,2.6239999999999999E-2,0.92384583730724812,0.94741875894190863,0.94741875894190863,13.65,0.93509682947462536,7.7662045769684793,5.9325310888611238,null,93.509682947462537,0.31180370428215076,0.59731944286215666,0.33766106856384692,0.25793613429830975,0.63561505465975787]
[null,null,null,null,null,null,79,24,1,2.7650000000000001,2.7650000000000001,0.64004629629629628,0.21699247827835452,1.4934774569273281,3.5117387284636643,2.0182612715363359,0,2.7984098894781617,0.21143964355728778,0.1,0.31723911451839726,0.43112980589281535,3.717458190583533E-4,3.717458190583533E-4,1.1534974370033422,2.6611126743465588E-3,2.6611126743465588E-3,1.3035679280456303,0.12574741138415912,3.0794395628350766E-2,6.846720000000002E-2,0,0.22764254945345891,2.4762488902571969,0.19008606556149998,1.2387199999999999E-2,0.20607712543938361,0.17443200000000003,8.3999999999999993E-4,2.5399999999999999E-2,0.10515599999999999,9.6519999999999995E-2,2.6239999999999999E-2,0.93959391613129783,0.96419168070498895,0.96419168070498895,13.825000000000001,0.9348043015790416,7.8836563974295553,6.0637127651058238,null,93.480430157904166,0.31723911451839726,0.60815167489284261,0.34276766945345893,0.26363968543938365,0.64695256618659169]
[null,null,null,null,null,null,80,24,1,2.8,2.8,0.64814814814814814,0.21710251133530764,1.4939526195460369,3.5469763097730183,2.0530236902269814,0,2.8330180377918595,0.216701762466259,0.1,0.32274879498613712,0.43126697352572552,3.7198240490807764E-4,3.7198240490807764E-4,1.1679767918204043,2.7283395724621681E-3,2.7283395724621681E-3,1.320023805091354,0.12894225060458139,3.1184198104659E-2,6.846720000000002E-2,0,0.2313379382750905,2.5066967021253648,0.19478937904983157,1.2543999999999998E-2,0.2111167222106651,0.17663999999999999,8.3999999999999993E-4,2.5399999999999999E-2,0.10515599999999999,9.6519999999999995E-2,2.6239999999999999E-2,0.95550879022533119,0.98116565618422835,0.98116565618422835,14,0.9345067213925905,8.0021677803270812,6.1963822108452975,null,93.450672139259055,0.32274879498613712,0.61909466048575557,0.3479203382750905,0.26940792221066512,0.65841686119809117]
[null,null,null,null,null,null,81,24,1,2.835,2.835,0.65625,0.21721255502438777,1.4944275693089928,3.5822137846544964,2.0877862153455036,0,2.8676356951315425,0.22203003095979923,0.1,0.3283329454230734,0.43140407971247258,3.7221895998513078E-4,3.7221895998513078E-4,1.1824651922839982,2.7964478619264656E-3,2.7964478619264656E-3,1.3364922346273957,0.13217965049823041,3.1574000580967237E-2,6.846720000000002E-2,0,0.23507954240054615,2.5371485937511102,0.19955081258997032,1.2700799999999998E-2,0.21622114629058098,0.17884800000000003,8.3999999999999993E-4,2.5399999999999999E-2,0.10515599999999999,9.6519999999999995E-2,2.6239999999999999E-2,0.97159049462896729,0.99834153704649387,0.99834153704649387,14.175000000000001,0.93420424007401459,8.1217421152125624,6.3305426846833619,null,93.420424007401465,0.3283329454230734,0.63014868869112717,0.35311922240054616,0.27524098629058097,0.67000859162342041]
[null,null,null,null,null,null,82,24,1,2.87,2.87,0.66435185185185186,0.21732260934713615,1.4949023061853428,3.6174511530926714,2.1225488469073288,0,2.9022625212214215,0.22742444903633607,0.1,0.33399176854677065,0.43154112444415005,3.724554841730428E-4,3.724554841730428E-4,1.1969624965166501,2.865438436134743E-3,2.865438436134743E-3,1.3529730595154119,0.13545967138331258,3.1963803057275482E-2,6.846720000000002E-2,0,0.23886751057333819,2.5676042612349801,0.20437034091167286,1.2857599999999999E-2,0.22139054167554312,0.18105599999999999,8.3999999999999993E-4,2.5399999999999999E-2,0.10515599999999999,9.6519999999999995E-2,2.6239999999999999E-2,0.98783906438859703,1.0157201873787549,1.0157201873787549,14.350000000000001,0.93389700092202277,8.2423828231867784,6.4661974985374915,null,93.389700092202276,0.33399176854677065,0.64131405224888127,0.3583644705733382,0.28113902167554311,0.68172841883198432]
[null,null,null,null,null,null,83,24,1,2.9049999999999998,2.9049999999999998,0.67245370370370361,0.21743267430509408,1.4953768301442285,3.6526884150721139,2.1573115849278857,0,2.9368981917454482,0.23288501669429745,0.1,0.33972547007349219,0.43167810771184983,3.7269197735536686E-4,3.7269197735536686E-4,1.2114685691212075,2.9353121879371717E-3,2.9353121879371717E-3,1.3694661298994444,0.13878237358969037,3.2353605533583719E-2,6.846720000000002E-2,0,0.24270199291928449,2.598063414879614,0.20924793873981357,1.3014399999999997E-2,0.22662505469142355,0.18326399999999998,8.3999999999999993E-4,2.5399999999999999E-2,0.10515599999999999,9.6519999999999995E-2,2.6239999999999999E-2,1.0042545345573852,1.0333024838103984,1.0333024838103984,14.524999999999999,0.93358513983864055,8.3640933571435436,6.6033500179027413,null,93.358513983864057,0.33972547007349219,0.65259104761070796,0.36365623291928451,0.28710217469142352,0.69357701373690617]
[null,null,null,null,null,null,84,24,1,2.94,2.94,0.68055555555555547,0.21754274989980327,1.495851141154785,3.6879255705773923,2.1920744294226076,0,2.971542397427275,0.23841173393211162,0.1,0.34553425873735322,0.43181502950666201,3.7292843941567877E-4,3.7292843941567877E-4,1.2259832808073887,3.006070009638497E-3,3.006070009638497E-3,1.3859713027862819,0.14214781745888563,3.2743408009891957E-2,6.846720000000002E-2,0,0.24658314095722644,2.6285257783709737,0.21418358079438274,1.3171199999999999E-2,0.23192483400524222,0.18547200000000003,8.3999999999999993E-4,2.5399999999999999E-2,0.10515599999999999,9.6519999999999995E-2,2.6239999999999999E-2,1.0208369401952722,1.0510893156377521,1.0510893156377521,14.7,0.93326878575983785,8.486877202016208,6.7420036621205712,null,93.326878575983784,0.34553425873735322,0.66397997496246863,0.36899466095722644,0.29313059400524222,0.70555505690039888]
[null,null,null,null,null,null,85,24,1,2.9750000000000001,2.9750000000000001,0.68865740740740733,0.21765283613280578,1.4963252391861419,3.7231626195930709,2.2268373804069292,0,3.0061948431728092,0.24400460074820737,0.1,0.35141834630979418,0.43195188981967514,3.7316487023757758E-4,3.7316487023757758E-4,1.2405065080437385,3.0777127929977402E-3,3.0777127929977402E-3,1.4024884416543633,0.14555606334408225,3.3133210486200194E-2,6.846720000000002E-2,0,0.250511107609867,2.6589910880152847,0.21917724179048595,1.3328E-2,0.23729003063707199,0.18768000000000001,8.3999999999999993E-4,2.5399999999999999E-2,0.10515599999999999,9.6519999999999995E-2,2.6239999999999999E-2,1.0375863163689758,1.0690815849508506,1.0690815849508506,14.875,0.93294806105608963,8.6107378750269419,6.8821619046526559,null,93.294806105608956,0.35141834630979418,0.67548113824693901,0.374379907609867,0.29922443063707199,0.71766323864105641]
[null,null,null,null,null,null,86,24,1,3.01,3.01,0.69675925925925919,0.21776293300564376,1.4967991242074212,3.7583995621037105,2.2616004378962891,0,3.0408552472704682,0.24966361714101318,0.1,0.35737794761937547,0.43208868864197542,3.7340126970468397E-4,3.7340126970468397E-4,1.2550381327330009,3.1502414292278753E-3,3.1502414292278753E-3,1.4190174160889972,0.14900717161012816,3.3523012962508425E-2,6.846720000000002E-2,0,0.25448604721472978,2.6894590920273256,0.22422889643834185,1.3484799999999998E-2,0.24272079797215948,0.18988799999999997,8.3999999999999993E-4,2.5399999999999999E-2,0.10515599999999999,9.6519999999999995E-2,2.6239999999999999E-2,1.0545026981519918,1.0872802067624825,1.0872802067624825,15.049999999999999,0.93262308190528609,8.7356789259387853,7.0238282733596673,null,93.262308190528614,0.35737794761937547,0.68709484518688924,0.37981212721472979,0.30538383797215946,0.72990225914310702]
[null,null,null,null,null,null,87,24,1,3.0449999999999999,3.0449999999999999,0.70486111111111105,0.21787304051985992,1.4972727961877421,3.793636398093871,2.2963636019061289,0,3.0755233406446978,0.25538878310895868,0.1,0.36341328057190131,0.4322254259646483,3.7363763770064334E-4,3.7363763770064334E-4,1.2695780419091114,3.2236568089955469E-3,3.2236568089955469E-3,1.4355581014418757,0.15250120263353981,3.3912815438816669E-2,6.846720000000002E-2,0,0.25850811553524478,2.7199295498661211,0.22933851944328251,1.3641599999999999E-2,0.24821729177326876,0.19209600000000002,8.3999999999999993E-4,2.5399999999999999E-2,0.10515599999999999,9.6519999999999995E-2,2.6239999999999999E-2,1.0715861206245978,1.105686109139562,1.105686109139562,15.225,0.93229395864018472,8.8617039373106294,7.1670063507851811,null,93.229395864018471,0.36341328057190131,0.69882140730851361,0.38529147553524479,0.31160897177326874,0.74227282856766075]
[null,null,null,null,null,null,88,24,1,3.08,3.08,0.71296296296296291,0.21798315867699708,1.4977462550962151,3.8288731275481078,2.3311268724518923,0,3.1101988661586515,0.26118009865047315,0.1,0.36952456617087065,0.43236210177877687,3.7387397410912284E-4,3.7387397410912284E-4,1.2841261274541422,3.297959822420744E-3,3.297959822420744E-3,1.4521103785130038,0.15603821680250324,3.4302617915124907E-2,6.846720000000002E-2,0,0.26257746977195523,2.7504022316143835,0.23450608550575081,1.3798399999999999E-2,0.25377967019324293,0.19430400000000003,8.3999999999999993E-4,2.5399999999999999E-2,0.10515599999999999,9.6519999999999995E-2,2.6239999999999999E-2,1.0888366188738523,1.1243002333368473,1.1243002333368473,15.4,0.93196079607240279,8.9888165247549701,7.3116997744445875,null,93.196079607240279,0.36952456617087065,0.7106611399651982,0.39081810977195525,0.31789999019324294,0.75477566716597666]
[null,null,null,null,null,null,89,24,1,3.1150000000000002,3.1150000000000002,0.72106481481481477,0.21809328747859846,1.4982195009019454,3.8641097504509729,2.3658902495490275,0,3.1448815779623418,0.26703756376398657,0.1,0.37571202853826507,0.43249871607544249,3.7411027881381246E-4,3.7411027881381246E-4,1.2986822858337044,3.3731513590765107E-3,3.3731513590765107E-3,1.4686741332533721,0.15961827451687824,3.4692420391433144E-2,6.846720000000002E-2,0,0.26669426857385492,2.7808769173984245,0.23973156932130027,1.3955199999999999E-2,0.25940809378779256,0.19651200000000002,8.3999999999999993E-4,2.5399999999999999E-2,0.10515599999999999,9.6519999999999995E-2,2.6239999999999999E-2,1.1062542279935983,1.1431235339330681,1.1431235339330681,15.575000000000001,0.93162369379477006,9.1170203371986638,7.4579122371192295,null,93.162369379476999,0.37571202853826507,0.72261436236164744,0.39639218857385494,0.32425705378779257,0.76741150539480296]
[null,null,null,null,null,null,90,24,1,3.15,3.15,0.72916666666666663,0.21820342692620748,1.4986925335740329,3.8993462667870165,2.4006537332129834,0,3.1795712408828352,0.27296117844792872,0.1,0.38197589493567163,0.43263526884572506,3.7434655169842562E-4,3.7434655169842562E-4,1.3132464178494117,3.4492323079886229E-3,3.4492323079886229E-3,1.4852492564868014,0.16324143618820011,3.5082222867741375E-2,6.846720000000002E-2,0,0.27085867204985059,2.8113533968454796,0.24501494558059311,1.4111999999999998E-2,0.2651027255285075,0.19871999999999998,8.3999999999999993E-4,2.5399999999999999E-2,0.10515599999999999,9.6519999999999995E-2,2.6239999999999999E-2,1.1238389830844633,1.1621569789694792,1.1621569789694792,15.75,0.93128274646370435,9.2463190571465645,7.6056474871556725,null,93.128274646370429,0.38197589493567163,0.73468139757835815,0.40201387204985062,0.33068032552850751,0.78018108403380759]
[null,null,null,null,null,null,91,24,1,3.1850000000000001,3.1850000000000001,0.73726851851851849,0.21831357702136794,1.499165353081571,3.9345826765407854,2.4354173234592147,0,3.214267629853393,0.2789509427007304,0.1,0.38831639578574911,0.43277176008070267,3.7458279264669853E-4,3.7458279264669853E-4,1.3278184284071564,3.5262035576353011E-3,3.5262035576353011E-3,1.5018356436495517,0.16690776223968345,3.5472025344049619E-2,6.846720000000002E-2,0,0.27507084178035607,2.8418314685756938,0.2503561889693996,1.4268799999999998E-2,0.27086373081609749,0.200928,8.3999999999999993E-4,2.5399999999999999E-2,0.10515599999999999,9.6519999999999995E-2,2.6239999999999999E-2,1.1415909192538631,1.1814015500908999,1.1814015500908999,15.925000000000001,0.93093804406312308,9.3767164009481885,7.7549093287702426,null,93.093804406312302,0.38831639578574911,0.7468625725964535,0.40768332178035604,0.33716997081609751,0.7930851543051507]
[null,null,null,null,null,null,92,24,1,3.22,3.22,0.74537037037037035,0.21842373776562396,1.4996379593936469,3.9698189796968237,2.4701810203031767,0,3.2489705293786826,0.2850068565208223,0.1,0.39473376469403859,0.43290818977145157,3.7481900154239022E-4,3.7481900154239022E-4,1.3423982263000229,3.6040659959468953E-3,3.6040659959468953E-3,1.5184331945463818,0.17061731310622444,3.5861827820357857E-2,6.846720000000002E-2,0,0.27933094082901694,2.8723109397262108,0.25575527416859689,1.44256E-2,0.27669127749386307,0.20313600000000004,8.3999999999999993E-4,2.5399999999999999E-2,0.10515599999999999,9.6519999999999995E-2,2.6239999999999999E-2,1.1595100716160016,1.2008582426892698,1.2008582426892698,16.100000000000001,0.93058967215128119,9.5082161190673897,7.9057016223588512,null,93.058967215128121,0.39473376469403859,0.75915821832288,0.41340070082901698,0.34372615749386309,0.80612447799523124]
[null,null,null,null,null,null,93,24,1,3.2549999999999999,3.2549999999999999,0.7534722222222221,0.21853390916051987,1.5001103524793422,4.0050551762396713,2.5049448237603289,0,3.2836797330334515,0.29112891990663525,0.1,0.40122823847112221,0.43304455790904633,3.7505517826928275E-4,3.7505517826928275E-4,1.3569857240047825,3.6828205103055672E-3,3.6828205103055672E-3,1.5350418131218699,0.17437014923440333,3.6251630296666094E-2,6.846720000000002E-2,0,0.28363913375456756,2.902791625505035,0.26121217585416706,1.4582399999999999E-2,0.28258553586139601,0.20534400000000003,8.3999999999999993E-4,2.5399999999999999E-2,0.10515599999999999,9.6519999999999995E-2,2.6239999999999999E-2,1.1775964752918719,1.2205280660497646,1.2205280660497646,16.274999999999999,0.93023771209179951,9.6408219963550543,8.0580282848121083,null,93.023771209179955,0.40122823847112221,0.7715686696159636,0.41916617375456755,0.35034905586139603,0.81929982757864239]
[null,null,null,null,null,null,94,24,1,3.29,3.29,0.76157407407407396,0.21864409120760039,1.5005825323077333,4.0402912661538668,2.5397087338461333,0,3.318395042992258,0.29731713285660094,0.1,0.40780005715513878,0.43318086448456011,3.7529132271118165E-4,3.7529132271118165E-4,1.3715808374909966,3.7624679875450074E-3,3.7624679875450074E-3,1.551661407245901,0.17816633108248839,3.6641432772974332E-2,6.846720000000002E-2,0,0.28799558662282421,2.9332733487725382,0.26672686869719708,1.4739199999999999E-2,0.28854667868851702,0.20755200000000001,8.3999999999999993E-4,2.5399999999999999E-2,0.10515599999999999,9.6519999999999995E-2,2.6239999999999999E-2,1.1958501654092608,1.2404120434995289,1.2404120434995289,16.45,0.92988224127004848,9.7745378523249578,8.2118932898358921,null,92.988224127004855,0.40780005715513878,0.78409426531134119,0.42497990662282426,0.35703883868851705,0.83261198634439015]
[null,null,null,null,null,null,95,24,1,3.3250000000000002,3.3250000000000002,0.76967592592592593,0.21875428390841042,1.5010544988478884,4.0755272494239447,2.5744727505760561,0,3.3531162695880314,0.30357149536915079,0.1,0.41444946403465172,0.4333171094890636,3.7552743475191428E-4,3.7552743475191428E-4,1.3861834860418207,3.8430093139501095E-3,3.8430093139501095E-3,1.5682918885123007,0.1820059191204374,3.7031235249282569E-2,6.846720000000002E-2,0,0.29240046701881239,2.9637559396486206,0.2722993273638768,1.4896E-2,0.29457488122944747,0.20976,8.3999999999999993E-4,2.5399999999999999E-2,0.10515599999999999,9.6519999999999995E-2,2.6239999999999999E-2,1.2142711771027477,1.2605112125590463,1.2605112125590463,16.625,0.9295233332959516,9.9093675414326849,8.3673006682772932,null,92.952333329595163,0.41444946403465172,0.79673534824825976,0.43084206701881239,0.3637956812294475,0.84606174852439464]
[null,null,null,null,null,null,96,24,1,3.36,3.36,{"$f":"Vout*K105/(Vin*Efficiency)","v":0.77777777777777779},0.21886448726449534,{"$f":"(Vin-(Rdson1+Rdcr)*K105-Vout)*M105/(Fsw*Lf)","v":1.5015262520688721},4.1107631260344357,2.609236873965564,{"$f":"IF(MIN(Vin, -P105/(Coss_Q1+Coss_Q2)*0.00000002)<0, 0, MIN(Vin, -P105/(Coss_Q1+Coss_Q2)*0.00000002))","v":0},3.3878432308974489,{"$f":"R105^2*Rdcr","v":0.30989200744271694},0.1,{"$f":"(T105+S105*(1+Ltc*(Ta-25)))/(1-S105*Ltc*ThetaCa)","v":0.4211767056718832},0.43345329291362661,3.7576351427533238E-4,3.7576351427533238E-4,1.4007935920856924,3.9244453752566751E-3,3.9244453752566751E-3,1.5849331720497033,{"$f":"Rdson1*AB105^2","v":0.18588897382990155},3.7421037725590807E-2,6.846720000000002E-2,0,{"$f":"(AF105+AE105+AD105+AC105*(1+RdsonTopTc*Ta-RdsonTopTc*25))/(1-AC105*RdsonTopTc*ThetaJA_Q1)","v":0.29685394405903376},2.9942392351437337,{"$f":"Rdson2*AH105^2","v":0.27792952651549807},1.5052799999999998E-2,{"$f":"(AJ105+AI105*(1+RdsonBotTc*Ta-RdsonBotTc*25))/(1-AI105*RdsonBotTc*ThetaJA_Q2)","v":0.30067032123722059},0.21196799999999999,8.3999999999999993E-4,2.5399999999999999E-2,0.10515599999999999,9.6519999999999995E-2,2.6239999999999999E-2,1.2328595455137072,1.2808266250962221,1.2808266250962221,16.8,0.92916105819418504,10.045314953357776,8.5242545084560746,null,92.916105819418505,0.4211767056718832,0.8094922652962544,0.43675282405903376,0.37061976123722062,0.85964991942433899]
[null,null,null,null,null,null,97,24,1,3.395,3.395,0.78587962962962965,0.21897470127740054,1.5019977919397414,4.1459988959698704,2.6440011040301292,0,3.4225757523512397,0.31627866907573166,0.1,0.42798203192631118,0.43358941474931662,3.7599956116530982E-4,3.7599956116530982E-4,1.4154110810381366,4.0067770566510931E-3,4.0067770566510931E-3,1.6015851763437854,0.1898155557042274,3.7810840201899044E-2,6.846720000000002E-2,0,0.30135618840387107,3.0247230788120918,0.28361744080845352,1.5209599999999998E-2,0.30683317897833357,0.21417599999999998,8.3999999999999993E-4,2.5399999999999999E-2,0.10515599999999999,9.6519999999999995E-2,2.6239999999999999E-2,1.2516153057903117,1.3013593474831986,1.3013593474831986,16.975000000000001,0.92879548258267275,10.182384013289035,8.6827589565016723,null,92.879548258267278,0.42798203192631118,0.82236536738220467,0.44271234840387108,0.37751125897833354,0.87337731555688736]
[null,null,null,null,null,null,98,24,1,3.43,3.43,0.79398148148148151,0.2190849259486721,1.5024691184295484,4.1812345592147739,2.6787654407852259,0,3.4573136663677007,0.32273148026662751,0.1,0.43486569597863772,0.43372547498719977,3.7623557530574412E-4,3.7623557530574412E-4,1.4300358811529961,4.0900052427700522E-3,4.0900052427700522E-3,1.6182478230700914,0.19378572524846066,3.8200642678207282E-2,6.846720000000002E-2,0,0.30590737227013615,3.0552073204255357,0.28936304489423526,1.5366399999999999E-2,0.3130636372476423,0.21638399999999999,8.3999999999999993E-4,2.5399999999999999E-2,0.10515599999999999,9.6519999999999995E-2,2.6239999999999999E-2,1.2705384930875308,1.3221104607559706,1.3221104607559706,17.150000000000002,0.92842666984020072,10.320578682213132,8.8428182166957736,null,92.84266698402007,0.43486569597863772,0.83535500951777852,0.44872081227013616,0.38447035724764234,0.88724476477733294]
[null,null,null,null,null,null,99,24,1,3.4649999999999999,3.4649999999999999,0.80208333333333326,0.21919516127985605,1.5029402315073384,4.216470115753669,2.7135298842463307,0,3.4920568120078284,0.32925044101383749,0.1,0.44182795435513189,0.43386147361834015,3.7647155658055537E-4,3.7647155658055537E-4,1.4446679233824318,4.1741308177002156E-3,4.1741308177002156E-3,1.6349210369367129,0.19779954297934801,3.8590445154515519E-2,6.846720000000002E-2,0,0.31050766944375885,3.0856918156666362,0.29516631341943395,1.5523199999999997E-2,0.31936188138350297,0.21859200000000001,8.3999999999999993E-4,2.5399999999999999E-2,0.10515599999999999,9.6519999999999995E-2,2.6239999999999999E-2,1.2896291425671351,1.3430810607768395,1.3430810607768395,17.324999999999999,0.9280546802639098,10.459902957206454,9.004436551820568,null,92.805468026390983,0.44182795435513189,0.84846155082726182,0.45477838944375887,0.39149724138350295,0.90125310642170764]
[null,null,null,null,null,null,100,24,1,3.5,3.5,0.81018518518518512,0.21930540727249892,1.5034111311421512,4.2517055655710756,2.7482944344289244,0,3.5268050346506032,0.33583555131579473,0.1,0.44886906695235157,0.43399741063380043,3.7670750487368723E-4,3.7670750487368723E-4,1.4593071412451057,4.2591546649779254E-3,4.2591546649779254E-3,1.651604745536164,0.20185706942534068,3.8980247630823757E-2,6.846720000000002E-2,0,0.31515725529262273,3.1161764258397286,0.30102722102573726,1.5679999999999999E-2,0.3257280992831601,0.2208,8.3999999999999993E-4,2.5399999999999999E-2,0.10515599999999999,9.6519999999999995E-2,2.6239999999999999E-2,1.3088872893976964,1.36427225839976,1.36427225839976,17.5,0.92767957121736921,10.600360871730322,9.1676182835126827,null,92.767957121736927,0.44886906695235157,0.86168535457578288,0.4608852552926227,0.39859209928316008,0.91540319144740834]

{"sheet":"Efficiency Plot Management","index":9,"n_rows":3,"n_cols":1,"rows_kept":3,"cut":false,"hidden":true,"merged":[]}
[]
[{"$f":"\"EFF_Ch1\"","v":"EFF_Ch1"}]
[{"$f":"\"EFF_Ch2\"","v":"EFF_Ch2"}]

{"sheet":"Standard Value Calculator","index":10,"n_rows":159,"n_cols":13,"rows_kept":159,"cut":false,"hidden":true,"merged":[]}
[]
["Capacitors","Css","Cc1ea","Cc2ea","Cout","Cin","Css"]
["Inputs",{"$f":"Css","v":2.2000000000000002E-8},{"$f":"Cc1ea","v":4.1794988347979809E-11},{"$f":"Cc2ea","v":5.7329411055789829E-13},{"$f":"Cout","v":1.25E-4},{"$f":"Cin","v":4.6999999999999997E-5},{"$f":"Css","v":2.2000000000000002E-8},null,null,"Resistors","inputs","Standard Result"]
["Standard Result",{"$f":"SUM(B6:B158)/1000000000000","v":2.1999999999999998E-8},{"$f":"IF(C3=\"OPEN\",\"OPEN\",SUM(C6:C158)/1000000000000)","v":3.9000000000000001E-11},{"$f":"SUM(D6:D158)/1000000000000","v":5.6000000000000004E-13},{"$f":"SUM(E6:E158)/1000000000000","v":1.2E-4},{"$f":"SUM(F6:F158)/1000000000000","v":4.6999999999999997E-5},{"$f":"SUM(G6:G158)/1000000000000","v":2.1999999999999998E-8},null,null,"Rt",{"$f":"Rfadj","v":100},{"$f":"IF(K4>(INT(0.5+100*POWER(10,IF(96*(LOG(K4)-INT(LOG(K4)))-ROUND(96*(LOG(K4)-INT(LOG(K4))),0)<0,ROUND(96*(LOG(K4)-INT(LOG(K4))),0)-1,ROUND(96*(LOG(K4)-INT(LOG(K4))),0))/96))*POWER(10,INT(LOG(K4))-2)+INT(0.5+100*POWER(10,(IF(96*(LOG(K4)-INT(LOG(K4)))-ROUND(96*(LOG(K4)-INT(LOG(K4))),0)<0,ROUND(96*(LOG(K4)-INT(LOG(K4))),0)-1,ROUND(96*(LOG(K4)-INT(LOG(K4))),0))+1)/96))*POWER(10,INT(LOG(K4))-2))/2,INT(0.5+100*POWER(10,(IF(96*(LOG(K4)-INT(LOG(K4)))-ROUND(96*(LOG(K4)-INT(LOG(K4))),0)<0,ROUND(96*(LOG(K4)-INT(LOG(K4))),0)-1,ROUND(96*(LOG(K4)-INT(LOG(K4))),0))+1)/96))*POWER(10,INT(LOG(K4))-2),INT(0.5+100*POWER(10,IF(96*(LOG(K4)-INT(LOG(K4)))-ROUND(96*(LOG(K4)-INT(LOG(K4))),0)<0,ROUND(96*(LOG(K4)-INT(LOG(K4))),0)-1,ROUND(96*(LOG(K4)-INT(LOG(K4))),0))/96))*POWER(10,INT(LOG(K4))-2))","v":100},"Ω"]
["(pF)"]
[0.47,{"$f":"IF(IF((B$3*10^12-$A7)*(B$3*10^12-$A6)*-1<0,0,1)*IF(ABS(B$3*10^12-$A7)>(B$3*10^12-$A6),$A6,$A7)=B7,0,IF((B$3*10^12-$A7)*(B$3*10^12-$A6)*-1<0,0,1)*IF(ABS(B$3*10^12-$A7)>(B$3*10^12-$A6),$A6,$A7))","v":0},0,0,0,0,0]
[0.56000000000000005,{"$f":"IF(IF((B$3*10^12-$A8)*(B$3*10^12-$A7)*-1<0,0,1)*IF(ABS(B$3*10^12-$A8)>(B$3*10^12-$A7),$A7,$A8)=B8,0,IF((B$3*10^12-$A8)*(B$3*10^12-$A7)*-1<0,0,1)*IF(ABS(B$3*10^12-$A8)>(B$3*10^12-$A7),$A7,$A8))","v":0},{"$f":"IF(IF((C$3*10^12-$A8)*(C$3*10^12-$A7)*-1<0,0,1)*IF(ABS(C$3*10^12-$A8)>(C$3*10^12-$A7),$A7,$A8)=C8,0,IF((C$3*10^12-$A8)*(C$3*10^12-$A7)*-1<0,0,1)*IF(ABS(C$3*10^12-$A8)>(C$3*10^12-$A7),$A7,$A8))","v":0},{"$f":"IF(IF((D$3*10^12-$A8)*(D$3*10^12-$A7)*-1<0,0,1)*IF(ABS(D$3*10^12-$A8)>(D$3*10^12-$A7),$A7,$A8)=D8,0,IF((D$3*10^12-$A8)*(D$3*10^12-$A7)*-1<0,0,1)*IF(ABS(D$3*10^12-$A8)>(D$3*10^12-$A7),$A7,$A8))","v":0.56000000000000005},{"$f":"IF(IF((E$3*10^12-$A8)*(E$3*10^12-$A7)*-1<0,0,1)*IF(ABS(E$3*10^12-$A8)>(E$3*10^12-$A7),$A7,$A8)=E8,0,IF((E$3*10^12-$A8)*(E$3*10^12-$A7)*-1<0,0,1)*IF(ABS(E$3*10^12-$A8)>(E$3*10^12-$A7),$A7,$A8))","v":0},{"$f":"IF(IF((F$3*10^12-$A8)*(F$3*10^12-$A7)*-1<0,0,1)*IF(ABS(F$3*10^12-$A8)>(F$3*10^12-$A7),$A7,$A8)=F8,0,IF((F$3*10^12-$A8)*(F$3*10^12-$A7)*-1<0,0,1)*IF(ABS(F$3*10^12-$A8)>(F$3*10^12-$A7),$A7,$A8))","v":0},{"$f":"IF(IF((G$3*10^12-$A8)*(G$3*10^12-$A7)*-1<0,0,1)*IF(ABS(G$3*10^12-$A8)>(G$3*10^12-$A7),$A7,$A8)=G8,0,IF((G$3*10^12-$A8)*(G$3*10^12-$A7)*-1<0,0,1)*IF(ABS(G$3*10^12-$A8)>(G$3*10^12-$A7),$A7,$A8))","v":0},null,null,"Rent",{"$f":"Rent","v":885221.6748768473},887000,"Ω"]
[0.68,0,0,0,0,0,0,null,null,"Rc1ea",{"$f":"Rcea2","v":0},{"$f":"IF(K8>(INT(0.5+100*POWER(10,IF(96*(LOG(K8)-INT(LOG(K8)))-ROUND(96*(LOG(K8)-INT(LOG(K8))),0)<0,ROUND(96*(LOG(K8)-INT(LOG(K8))),0)-1,ROUND(96*(LOG(K8)-INT(LOG(K8))),0))/96))*POWER(10,INT(LOG(K8))-2)+INT(0.5+100*POWER(10,(IF(96*(LOG(K8)-INT(LOG(K8)))-ROUND(96*(LOG(K8)-INT(LOG(K8))),0)<0,ROUND(96*(LOG(K8)-INT(LOG(K8))),0)-1,ROUND(96*(LOG(K8)-INT(LOG(K8))),0))+1)/96))*POWER(10,INT(LOG(K8))-2))/2,INT(0.5+100*POWER(10,(IF(96*(LOG(K8)-INT(LOG(K8)))-ROUND(96*(LOG(K8)-INT(LOG(K8))),0)<0,ROUND(96*(LOG(K8)-INT(LOG(K8))),0)-1,ROUND(96*(LOG(K8)-INT(LOG(K8))),0))+1)/96))*POWER(10,INT(LOG(K8))-2),INT(0.5+100*POWER(10,IF(96*(LOG(K8)-INT(LOG(K8)))-ROUND(96*(LOG(K8)-INT(LOG(K8))),0)<0,ROUND(96*(LOG(K8)-INT(LOG(K8))),0)-1,ROUND(96*(LOG(K8)-INT(LOG(K8))),0))/96))*POWER(10,INT(LOG(K8))-2))","v":{"$error":"#NUM!"}},"Ω"]
[0.82,0,0,0,0,0,0]
[1,0,0,0,0,0,0,null,null,"Rfb1",{"$f":"Rfb1_","v":100000},{"$f":"IF(K10>(INT(0.5+100*POWER(10,IF(96*(LOG(K10)-INT(LOG(K10)))-ROUND(96*(LOG(K10)-INT(LOG(K10))),0)<0,ROUND(96*(LOG(K10)-INT(LOG(K10))),0)-1,ROUND(96*(LOG(K10)-INT(LOG(K10))),0))/96))*POWER(10,INT(LOG(K10))-2)+INT(0.5+100*POWER(10,(IF(96*(LOG(K10)-INT(LOG(K10)))-ROUND(96*(LOG(K10)-INT(LOG(K10))),0)<0,ROUND(96*(LOG(K10)-INT(LOG(K10))),0)-1,ROUND(96*(LOG(K10)-INT(LOG(K10))),0))+1)/96))*POWER(10,INT(LOG(K10))-2))/2,INT(0.5+100*POWER(10,(IF(96*(LOG(K10)-INT(LOG(K10)))-ROUND(96*(LOG(K10)-INT(LOG(K10))),0)<0,ROUND(96*(LOG(K10)-INT(LOG(K10))),0)-1,ROUND(96*(LOG(K10)-INT(LOG(K10))),0))+1)/96))*POWER(10,INT(LOG(K10))-2),INT(0.5+100*POWER(10,IF(96*(LOG(K10)-INT(LOG(K10)))-ROUND(96*(LOG(K10)-INT(LOG(K10))),0)<0,ROUND(96*(LOG(K10)-INT(LOG(K10))),0)-1,ROUND(96*(LOG(K10)-INT(LOG(K10))),0))/96))*POWER(10,INT(LOG(K10))-2))","v":100000},"Ω"]
[1.2,0,0,0,0,0,0,null,null,"Rfb2",{"$f":"Rfb2_","v":25000},{"$f":"IF(K11=\"OPEN\",\"OPEN\",IF(K11>(INT(0.5+100*POWER(10,IF(96*(LOG(K11)-INT(LOG(K11)))-ROUND(96*(LOG(K11)-INT(LOG(K11))),0)<0,ROUND(96*(LOG(K11)-INT(LOG(K11))),0)-1,ROUND(96*(LOG(K11)-INT(LOG(K11))),0))/96))*POWER(10,INT(LOG(K11))-2)+INT(0.5+100*POWER(10,(IF(96*(LOG(K11)-INT(LOG(K11)))-ROUND(96*(LOG(K11)-INT(LOG(K11))),0)<0,ROUND(96*(LOG(K11)-INT(LOG(K11))),0)-1,ROUND(96*(LOG(K11)-INT(LOG(K11))),0))+1)/96))*POWER(10,INT(LOG(K11))-2))/2,INT(0.5+100*POWER(10,(IF(96*(LOG(K11)-INT(LOG(K11)))-ROUND(96*(LOG(K11)-INT(LOG(K11))),0)<0,ROUND(96*(LOG(K11)-INT(LOG(K11))),0)-1,ROUND(96*(LOG(K11)-INT(LOG(K11))),0))+1)/96))*POWER(10,INT(LOG(K11))-2),INT(0.5+100*POWER(10,IF(96*(LOG(K11)-INT(LOG(K11)))-ROUND(96*(LOG(K11)-INT(LOG(K11))),0)<0,ROUND(96*(LOG(K11)-INT(LOG(K11))),0)-1,ROUND(96*(LOG(K11)-INT(LOG(K11))),0))/96))*POWER(10,INT(LOG(K11))-2)))","v":24900},"Ω"]
[1.5,0,0,0,0,0,0,null,null,"Rt1",{"$f":"'Variable Management'!B25*1000","v":99566.987320766464},{"$f":"IF(K12>(INT(0.5+100*POWER(10,IF(96*(LOG(K12)-INT(LOG(K12)))-ROUND(96*(LOG(K12)-INT(LOG(K12))),0)<0,ROUND(96*(LOG(K12)-INT(LOG(K12))),0)-1,ROUND(96*(LOG(K12)-INT(LOG(K12))),0))/96))*POWER(10,INT(LOG(K12))-2)+INT(0.5+100*POWER(10,(IF(96*(LOG(K12)-INT(LOG(K12)))-ROUND(96*(LOG(K12)-INT(LOG(K12))),0)<0,ROUND(96*(LOG(K12)-INT(LOG(K12))),0)-1,ROUND(96*(LOG(K12)-INT(LOG(K12))),0))+1)/96))*POWER(10,INT(LOG(K12))-2))/2,INT(0.5+100*POWER(10,(IF(96*(LOG(K12)-INT(LOG(K12)))-ROUND(96*(LOG(K12)-INT(LOG(K12))),0)<0,ROUND(96*(LOG(K12)-INT(LOG(K12))),0)-1,ROUND(96*(LOG(K12)-INT(LOG(K12))),0))+1)/96))*POWER(10,INT(LOG(K12))-2),INT(0.5+100*POWER(10,IF(96*(LOG(K12)-INT(LOG(K12)))-ROUND(96*(LOG(K12)-INT(LOG(K12))),0)<0,ROUND(96*(LOG(K12)-INT(LOG(K12))),0)-1,ROUND(96*(LOG(K12)-INT(LOG(K12))),0))/96))*POWER(10,INT(LOG(K12))-2))","v":100000},"Ω"]
[1.8,0,0,0,0,0,0]
[2.2000000000000002,{"$f":"IF(IF((B$3*10^12-$A15)*(B$3*10^12-$A14)*-1<0,0,1)*IF(ABS(B$3*10^12-$A15)>(B$3*10^12-$A14),$A14,$A15)=B15,0,IF((B$3*10^12-$A15)*(B$3*10^12-$A14)*-1<0,0,1)*IF(ABS(B$3*10^12-$A15)>(B$3*10^12-$A14),$A14,$A15))","v":0},0,0,0,0,0]
[2.7,0,0,0,0,0,0]
[3.3,0,0,0,0,0,0,null,null,"Rs",{"$f":"Rs_ideal*1000","v":{"$error":"#NAME?"}},{"$f":"IF(K16=0,0,IF(K16>(INT(0.5+100*POWER(10,IF(96*(LOG(K16)-INT(LOG(K16)))-ROUND(96*(LOG(K16)-INT(LOG(K16))),0)<0,ROUND(96*(LOG(K16)-INT(LOG(K16))),0)-1,ROUND(96*(LOG(K16)-INT(LOG(K16))),0))/96))*POWER(10,INT(LOG(K16))-2)+INT(0.5+100*POWER(10,(IF(96*(LOG(K16)-INT(LOG(K16)))-ROUND(96*(LOG(K16)-INT(LOG(K16))),0)<0,ROUND(96*(LOG(K16)-INT(LOG(K16))),0)-1,ROUND(96*(LOG(K16)-INT(LOG(K16))),0))+1)/96))*POWER(10,INT(LOG(K16))-2))/2,INT(0.5+100*POWER(10,(IF(96*(LOG(K16)-INT(LOG(K16)))-ROUND(96*(LOG(K16)-INT(LOG(K16))),0)<0,ROUND(96*(LOG(K16)-INT(LOG(K16))),0)-1,ROUND(96*(LOG(K16)-INT(LOG(K16))),0))+1)/96))*POWER(10,INT(LOG(K16))-2),INT(0.5+100*POWER(10,IF(96*(LOG(K16)-INT(LOG(K16)))-ROUND(96*(LOG(K16)-INT(LOG(K16))),0)<0,ROUND(96*(LOG(K16)-INT(LOG(K16))),0)-1,ROUND(96*(LOG(K16)-INT(LOG(K16))),0))/96))*POWER(10,INT(LOG(K16))-2)))","v":{"$error":"#NAME?"}},"mΩ"]
[3.9,0,0,0,0,0,0,null,null,"Cres",{"$f":"Cres","v":{"$error":"#NAME?"}},{"$f":"G4*1000000000000","v":22000},"pF"]
[4.7,0,0,0,0,0,0]
[5.6,0,0,0,0,0,0]
[6.8,0,0,0,0,0,0]
[8.1999999999999993,0,0,0,0,0,0]
[10,0,0,0,0,0,0,null,null,"Css",{"$f":"Css","v":2.2000000000000002E-8},{"$f":"G4","v":2.1999999999999998E-8}]
[12,0,0,0,0,0,0]
[15,0,0,0,0,0,0]
[18,0,0,0,0,0,0]
[22,0,0,0,0,0,0]
[27,0,0,0,0,0,0]
[33,0,0,0,0,0,0]
[39,0,39,0,0,0,0]
[47,0,0,0,0,0,0,null,null,"Rc1",{"$f":"L7/1000&\" kΩ\"","v":"887 kΩ"},{"$f":"L7/1000","v":887},"kΩ"]
[56,0,0,0,0,0,0,null,null,"Cc1",{"$f":"C4*1000000000&\" nF\"","v":"0.039 nF"},{"$f":"C4*1000000000","v":3.9E-2},"nF"]
[68,0,0,0,0,0,0,null,null,"Cc2",{"$f":"D4*1000000000000&\" pF\"","v":"0.56 pF"},{"$f":"D4*1000000000000","v":0.56000000000000005},"pF"]
[82,0,0,0,0,0,0]
[{"$f":"A22*10","v":100},0,0,0,0,0,0]
[{"$f":"A23*10","v":120},0,0,0,0,0,0]
[150,0,0,0,0,0,0]
[180,0,0,0,0,0,0]
[220,0,0,0,0,0,0]
[270,0,{"$f":"IF(IF((C$3*10^12-$A40)*(C$3*10^12-$A39)*-1<0,0,1)*IF(ABS(C$3*10^12-$A40)>(C$3*10^12-$A39),$A39,$A40)=C40,0,IF((C$3*10^12-$A40)*(C$3*10^12-$A39)*-1<0,0,1)*IF(ABS(C$3*10^12-$A40)>(C$3*10^12-$A39),$A39,$A40))","v":0},0,0,0,0]
[330,0,0,0,0,0,0]
[390,0,0,0,0,0,0]
[470,0,0,0,0,0,0]
[560,0,0,0,0,0,0]
[680,0,0,0,0,0,0]
[{"$f":"A33*10","v":820},0,0,0,0,0,0]
[1000,0,0,0,0,0,0]
[1200,0,0,0,0,0,0]
[1500,0,0,0,0,0,0]
[1800,0,0,0,0,0,0]
[2200,0,0,0,0,0,0]
[2700,0,0,0,0,0,0]
[3300,0,0,0,0,0,0]
[3900,0,0,0,0,0,0]
[4700,0,0,0,0,0,0]
[5600,0,0,0,0,0,0]
[6800,0,0,0,0,0,0]
[8200,0,0,0,0,0,0]
[10000,0,0,0,0,0,0]
[12000,0,0,0,0,0,0]
[15000,0,0,0,0,0,0]
[18000,0,0,0,0,0,0]
[22000,22000,0,0,0,0,22000]
[27000,0,0,0,0,0,0]
[33000,0,0,0,0,0,0]
[39000,0,0,0,0,0,0]
[47000,0,0,0,0,0,0]
[56000,0,0,0,0,0,0]
[68000,0,0,0,0,0,0]
[82000,0,0,0,0,0,0]
[100000,0,0,{"$f":"IF(IF((D$3*10^12-$A71)*(D$3*10^12-$A70)*-1<0,0,1)*IF(ABS(D$3*10^12-$A71)>(D$3*10^12-$A70),$A70,$A71)=D71,0,IF((D$3*10^12-$A71)*(D$3*10^12-$A70)*-1<0,0,1)*IF(ABS(D$3*10^12-$A71)>(D$3*10^12-$A70),$A70,$A71))","v":0},0,0,0]
[120000,{"$f":"IF(IF((B$3*10^12-$A72)*(B$3*10^12-$A71)*-1<0,0,1)*IF(ABS(B$3*10^12-$A72)>(B$3*10^12-$A71),$A71,$A72)=B72,0,IF((B$3*10^12-$A72)*(B$3*10^12-$A71)*-1<0,0,1)*IF(ABS(B$3*10^12-$A72)>(B$3*10^12-$A71),$A71,$A72))","v":0},{"$f":"IF(IF((C$3*10^12-$A72)*(C$3*10^12-$A71)*-1<0,0,1)*IF(ABS(C$3*10^12-$A72)>(C$3*10^12-$A71),$A71,$A72)=C72,0,IF((C$3*10^12-$A72)*(C$3*10^12-$A71)*-1<0,0,1)*IF(ABS(C$3*10^12-$A72)>(C$3*10^12-$A71),$A71,$A72))","v":0},0,0,{"$f":"IF(IF((F$3*10^12-$A72)*(F$3*10^12-$A71)*-1<0,0,1)*IF(ABS(F$3*10^12-$A72)>(F$3*10^12-$A71),$A71,$A72)=F72,0,IF((F$3*10^12-$A72)*(F$3*10^12-$A71)*-1<0,0,1)*IF(ABS(F$3*10^12-$A72)>(F$3*10^12-$A71),$A71,$A72))","v":0},{"$f":"IF(IF((G$3*10^12-$A72)*(G$3*10^12-$A71)*-1<0,0,1)*IF(ABS(G$3*10^12-$A72)>(G$3*10^12-$A71),$A71,$A72)=G72,0,IF((G$3*10^12-$A72)*(G$3*10^12-$A71)*-1<0,0,1)*IF(ABS(G$3*10^12-$A72)>(G$3*10^12-$A71),$A71,$A72))","v":0}]
[150000,0,0,0,0,0,0]
[180000,0,0,0,0,0,0]
[220000,0,0,0,0,0,0]
[270000,0,0,0,0,0,0]
[330000,0,0,0,0,0,0]
[390000,0,0,0,0,0,0]
[470000,0,0,0,0,0,0]
[560000,0,0,0,0,0,0]
[680000,0,0,0,0,0,0]
[820000,0,0,0,0,0,0]
[1000000,0,0,0,0,0,0]
[1200000,0,0,0,0,0,0]
[1500000,0,0,0,0,0,0]
[1800000,0,0,0,0,0,0]
[2200000,0,0,0,0,0,0]
[2700000,0,0,0,0,0,0]
[3300000,0,0,0,0,0,0]
[3900000,0,0,0,0,0,0]
[4700000,0,0,0,0,0,0]
[5600000,0,0,0,0,0,0]
[6800000,0,0,0,0,0,0]
[8200000,0,0,0,0,0,0]
[10000000,0,0,0,0,0,0]
[12000000,0,0,0,0,0,0]
[15000000,0,0,0,0,0,0]
[18000000,0,0,0,0,0,0]
[22000000,0,0,0,0,0,0]
[{"$f":"A87*10","v":27000000},0,0,0,0,0,0]
[33000000,0,0,0,0,0,0]
[39000000,0,0,0,0,0,0]
[47000000,0,0,0,0,47000000,0]
[56000000,0,0,0,0,{"$f":"IF(IF((F$3*10^12-$A104)*(F$3*10^12-$A103)*-1<0,0,1)*IF(ABS(F$3*10^12-$A104)>(F$3*10^12-$A103),$A103,$A104)=F104,0,IF((F$3*10^12-$A104)*(F$3*10^12-$A103)*-1<0,0,1)*IF(ABS(F$3*10^12-$A104)>(F$3*10^12-$A103),$A103,$A104))","v":0},{"$f":"IF(IF((G$3*10^12-$A104)*(G$3*10^12-$A103)*-1<0,0,1)*IF(ABS(G$3*10^12-$A104)>(G$3*10^12-$A103),$A103,$A104)=G104,0,IF((G$3*10^12-$A104)*(G$3*10^12-$A103)*-1<0,0,1)*IF(ABS(G$3*10^12-$A104)>(G$3*10^12-$A103),$A103,$A104))","v":0}]
[68000000,0,0,0,0,0,0]
[82000000,0,0,0,0,0,0]
[100000000,0,0,0,0,0,0]
[120000000,0,0,0,120000000,0,0]
[150000000,0,0,0,0,0,0]
[180000000,0,0,0,0,0,0]
[220000000,0,0,0,0,0,0]
[270000000,0,0,0,0,0,0]
[330000000,0,0,0,0,0,0]
[390000000,0,0,0,0,0,0]
[470000000,0,0,0,0,0,0]
[560000000,0,0,0,0,0,0]
[680000000,0,0,0,0,0,0]
[820000000,0,0,0,0,0,0]
[1000000000,0,0,0,0,0,0]
[1200000000,0,0,0,0,0,0]
[1500000000,0,0,0,0,0,0]
[1800000000,0,0,0,0,0,0]
[2200000000,0,0,0,0,0,0]
[2700000000,0,0,0,0,0,0]
[3300000000,0,0,0,0,0,0]
[3900000000,0,0,0,0,0,0]
[4700000000,0,0,0,0,0,0]
[5600000000,0,0,0,0,0,0]
[6800000000,0,0,0,0,0,0]
[8200000000,0,0,0,0,0,0]
[10000000000,0,0,0,0,0,0]
[12000000000,0,0,0,0,0,0]
[15000000000,0,0,0,0,0,0]
[18000000000,0,0,0,0,0,0]
[22000000000,0,0,0,{"$f":"IF(IF((E$3*10^12-$A135)*(E$3*10^12-$A134)*-1<0,0,1)*IF(ABS(E$3*10^12-$A135)>(E$3*10^12-$A134),$A134,$A135)=E135,0,IF((E$3*10^12-$A135)*(E$3*10^12-$A134)*-1<0,0,1)*IF(ABS(E$3*10^12-$A135)>(E$3*10^12-$A134),$A134,$A135))","v":0},0,0]
[27000000000,{"$f":"IF(IF((B$3*10^12-$A136)*(B$3*10^12-$A135)*-1<0,0,1)*IF(ABS(B$3*10^12-$A136)>(B$3*10^12-$A135),$A135,$A136)=B136,0,IF((B$3*10^12-$A136)*(B$3*10^12-$A135)*-1<0,0,1)*IF(ABS(B$3*10^12-$A136)>(B$3*10^12-$A135),$A135,$A136))","v":0},{"$f":"IF(IF((C$3*10^12-$A136)*(C$3*10^12-$A135)*-1<0,0,1)*IF(ABS(C$3*10^12-$A136)>(C$3*10^12-$A135),$A135,$A136)=C136,0,IF((C$3*10^12-$A136)*(C$3*10^12-$A135)*-1<0,0,1)*IF(ABS(C$3*10^12-$A136)>(C$3*10^12-$A135),$A135,$A136))","v":0},0,0,0,0]
[33000000000,0,0,0,0,0,0]
[39000000000,0,0,0,0,0,0]
[47000000000,0,0,0,0,0,0]
[56000000000,0,0,0,0,0,0]
[68000000000,0,0,0,0,0,0]
[82000000000,0,0,0,0,0,0]
[100000000000,0,0,0,0,0,0]
[120000000000,0,0,0,0,0,0]
[150000000000,0,0,0,0,0,0]
[180000000000,0,0,0,0,0,0]
[220000000000,0,0,0,0,0,0]
[270000000000,0,0,0,0,0,0]
[330000000000,0,0,0,0,0,0]
[390000000000,0,0,0,0,0,0]
[470000000000,0,0,0,0,0,0]
[560000000000,0,0,0,0,0,0]
[680000000000,0,0,0,0,0,0]
[820000000000,0,0,0,0,0,0]
[1000000000000,0,0,0,0,0,0]
[1200000000000,0,0,0,0,0,0]
[1500000000000,0,0,0,0,0,0]
[1800000000000,0,0,0,0,0,0]
[2200000000000,0,0,0,0,0,0]
[2700000000000,2700000000000,2700000000000,2700000000000,2700000000000,2700000000000,2700000000000]

{"sheet":"Snubber","index":11,"n_rows":6,"n_cols":5,"rows_kept":6,"cut":false,"hidden":true,"merged":[]}
[null,null,"UNITS","STD UNITS"]
["Frequency of Ringing",85,"MHz",{"$f":"B2*1000000","v":85000000},"Hz"]
["SW capacitance",3000,"pF",{"$f":"B3*0.000000000001","v":3E-9},"F"]
["Lpar",{"$f":"1000000000*1/((D2*2*3.14159)^2*D3)","v":1.1686430773614742},"nH",{"$f":"B4/1000000000","v":1.1686430773614743E-9},"H"]
["Csnub",{"$f":"4*B3","v":12000},"pF",{"$f":"B5*0.000000000001","v":1.2E-8},"F"]
["Rsnub",{"$f":"SQRT(D4/D3)","v":0.62413755891936573},"Ω",{"$f":"B6","v":0.62413755891936573},"Ω"]

{"sheet":"Parallel Output Caps","index":12,"n_rows":17,"n_cols":5,"rows_kept":17,"cut":false,"hidden":true,"merged":[]}
[]
[]
[]
["Fsw",{"$f":"Fsw","v":400000}]
[]
["C1",20,"uF",{"$f":"B6/1000000","v":2.0000000000000002E-5},"F"]
["R1",0.5,"mOhms",{"$f":"B7/1000","v":5.0000000000000001E-4},"Ohms"]
[]
["C2",68,"uF",{"$f":"B9/1000000","v":6.7999999999999999E-5},"F"]
["R2",20,"mOhms",{"$f":"B10/1000","v":0.02},"Ohms"]
[]
[]
["I1 ",{"$f":"(D6/(D6+D9))*SQRT((D10*D9*B4)^2+1)/SQRT((((D7+D10)*D6*D9/(D9+D6))*B4)^2+1)","v":0.25667257397349275},"%"]
["I2 ",{"$f":"1-B13","v":0.74332742602650725},"%"]
[]
["I1 ",{"$f":"B13*(Iripple1/(2*SQRT(3)))","v":{"$error":"#NAME?"}},"A"]
["I2 ",{"$f":"B14*(Iripple1/(2*SQRT(3)))","v":{"$error":"#NAME?"}},"A"]