{"text_format":"1","workbook":"xlsx","n_sheets":5,"sheets":["Design","Important Notice and Disclaimer","Calculation","STD_VAL","SCH"],"not_rendered":{"charts":10,"images":24,"macros":1,"external_links":0,"defined_names":196,"comments":2,"pivot_tables":0},"unopened":[],"bounds":{"document_bytes":16777216,"sheet_cells":100000,"rows_first":2000,"rows_last":500,"rows_between":2000,"halvings":0,"cell_chars":16384,"cell_head_chars":4096},"cells_cut":0,"cells_raw":0,"read":"whole","date_system":"1900"}

{"sheet":"Design","index":0,"n_rows":95,"n_cols":11,"rows_kept":95,"cut":false,"hidden":false,"merged":[[2,10,2,11]]}
[]
[]
["About",null,"xx",null,null,null,null,"= Input Box",null,null,"TERMS OF USE"]
[]
[]
[null,"Step 1: Operating Specifications"]
[null,null,null,null,null,"Input Voltage – Min, VSUPPLY(min) ",24,"V"]
[null,null,null,null,null,"Input Voltage – Typ, VSUPPLY(typ)",24,"V"]
[null,null,null,null,null,"Input Voltage – Max, VSUPPLY(max)",24,"V"]
[null,null,null,null,null,"Output Voltage, VLOAD ",15,"V"]
[null,null,null,null,null,"Full Load Output Current, ILOAD",12,"A"]
[null,null,null,null,null,"Switching Frequency, fSW",2200,"kHz"]
[null,null,null,null,null,"Frequency Set Resistor, RRT ",{"$f":"Calculation!C40","v":6.81},"kΩ"]
[]
[null,"Step 2: User's  Selections"]
[null,null,null,null,null,"Device Selection","LM(Q)644A2(-Q1)"]
[null,null,null,null,null,"Number of Phase","4-Phase (2 devices)"]
[null,null,null,null,null,"Switching Mode","AUTO"]
[null,null,null,null,null,"Output Voltage Feedback","External"]
[null,null,null,null,null,"Spread Spectrum","Enable"]
[null,null,null,null,null,"External Clock Synchronization","No"]
[null,null,null,null,null,"CFG Resistor (Primary Device)",{"$f":"Calculation!C34","v":73.2},"kΩ"]
[null,null,null,null,null,{"$f":"IF(OR(PH=1,PH=2),\"\",\"CFG Resistor (Secondary Device)\")","v":"CFG Resistor (Secondary Device)"},{"$f":"IF(OR(PH=1,PH=2),\"\",Calculation!C35)","v":41.2},{"$f":"IF(OR(PH=1,PH=2),\"\",\"kΩ\")","v":"kΩ"}]
[]
[null,"Step 3: Buck Inductor"]
[null,null,null,null,null,"Inductance for 35% Ripple Current at VIN(nom)",{"$f":"L.out_typical_calc*10^6","v":2.4350649350649349},"µH"]
[null,null,null,null,null,"Minimum Inductance",{"$f":"L.out_min*10^6","v":1.1621900826446281},"µH"]
[null,null,null,null,null," Buck Inductance, LOUT",1.5,"µH"]
[null,null,null,null,null,"Inductor DCR at 25°C",5,"mΩ"]
[null,null,null,null,null,"Peak Inductor Current at VSUPPLY(max) and Full Load",{"$f":"I.sat_softsaturation","v":3.8522727272727275},"Apk"]
[null,null,null,null,null,"Peak Inductor Current Limit at VSUPPLY(max)",{"$f":"I.sat_hardsaturation","v":9.9700000000000006},"Apk"]
[null,null,null,null,null,"Estimate Inductor Core Loss at VSUPPLY(typ)",0.2,"W"]
[null,null,null,null,null,"Frequency Stretch at VSUPPLY(max)",{"$f":"IF(t.on_ideal<0.00000006,\"can happen\", \"No\")","v":"No"}]
[null,null,null,null,null,"Dropout Mode Operation at VSUPPLY(min)",{"$f":"IF(t.off_150<0.0000001,\"can happen below \"&ROUND(V.supply_dropout,1)&\"V\",\"No\")","v":"No"}]
[]
[null,"Step 4: Default Componenet Values"]
[null,null,null,null,null,"VCC Capacitor, CVCC",{"$f":"C.vcc*1000000","v":1},"µF"]
[null,null,null,null,null,"Boot Capacitor, CBOOT1, CBOOT2",{"$f":"C.cb1*1000000000","v":100},"nF"]
[null,null,null,null,null,"VIN pin Capacitor, CVIN1_HF1, CVIN2_HF1",{"$f":"C.vin1_hf1*1000000000","v":100},"nF"]
[null,null,null,null,null,"VIN pin Capacitor, CVIN1_HF2, CVIN2_HF2",{"$f":"C.vin1_hf2*1000000","v":10},"µF"]
[null,null,null,null,null,"Power Good Pull-up Resistor, RPG1, RPG2",{"$f":"R.pg1/1000","v":100},"kΩ"]
[null,null,null,null,null,"VOSNS Capacitor, CVOSNS",150,"nF"]
[null,"Step 5: Enable, Line UVLO"]
[null,null,null,null,null,"Desired Start-up Threshold",2,"V"]
[null,null,null,null,null,"UVLO Divider Upper Resistance, RENT",100,"kΩ"]
[null,null,null,null,null,"UVLO Divider Lower Resistance, RENB",{"$f":"Calculation!C90","v":215},"kΩ"]
[null,null,null,null,null,"Estimated Shutdown Threshold",{"$f":"V.shutdown","v":1.4651162790697674},"V"]
[]
[null,"Step 6: Output Capacitors"]
[null,null,null,null,null,"Desired Undershoot during 50% Load Transient in FPWM",5,"%"]
[null,null,null,null,null,"Desired Crossover Frequency",{"$f":"G12/25","v":88},"kHz"]
[null,null,null,null,null,"Minimum Derated Output Capacitance ",{"$f":"C.out_min_calc*1000000","v":14.468634200286177},"µF"]
[null,null,null,null,null," Rated Output Capacitance",70,"µF"]
[null,null,null,null,null,"Derating Factor",0.3]
[null,null,null,null,null,"Derated Output Capacitance",{"$f":"C.out*1000000","v":21},"µF"]
[null,null,null,null,null,"Effective Output Capacitor ESR",1.3,"mΩ"]
[null,null,null,null,null,"Estimated Output Voltage Ripple at VSUPPLUY(MAX)",{"$f":"ΔV.load_pkpk_nph_calc_simple*1000","v":1.369693678857397},"mVpk-pk"]
[null,null,null,null,null,"Estimated Min Overshoot (Full-load to no-load if switching stops)",{"$f":"ΔV.overshoot_typical_calc/V.load*100","v":0.57142857142857151},"%"]
[null,null,null,null,null,"Estimated Max Undershoot (No-load to full-load in FPWM)",{"$f":"ΔV.undershoot_typical_calc1/V.load*100","v":6.5010901680222108},"%"]
[]
[null,{"$f":"IF(PH=1,\"Step 7: Internal Soft-start time is typically 4.5ms\", \"Step 7: Soft-start for Multi-phase Config\")","v":"Step 7: Soft-start for Multi-phase Config"}]
[null,null,null,null,null,{"$f":"IF(PH=1,\"\",\"Minimum Soft-start Capacitance\")","v":"Minimum Soft-start Capacitance"},{"$f":"IF(PH=1,\"\",C.ss_min*1000000000)","v":0.77835783344714782},{"$f":"IF(PH=1,\"\",\"nF\")","v":"nF"}]
[null,null,null,null,null,{"$f":"IF(PH=1,\"\",\"Soft-start Capacitance\")","v":"Soft-start Capacitance"},1000,{"$f":"IF(PH=1,\"\",\"nF\")","v":"nF"}]
[null,null,null,null,null,{"$f":"IF(PH=1,\"\",\"Soft-start Time\")","v":"Soft-start Time"},{"$f":"G63*0.8/(0.00002)/10000","v":4000},{"$f":"IF(PH=1,\"\",\"us\")","v":"us"}]
[null,{"$f":"IF(IntFB=1,\"Step 8: Using Internal Feedback\",\"Step 8: Feedback Network\")","v":"Step 8: Feedback Network"}]
[null,null,null,null,null,"Upper Feedback Resistance1, RLP",0.05,{"$f":"IF(IntFB=1,\"\",\"kΩ\")","v":"kΩ"}]
[null,null,null,null,null,"Upper Feedback Resistance2, RFBT",100,{"$f":"IF(IntFB=1,\"\",\"kΩ\")","v":"kΩ"}]
[null,null,null,null,null,"Feedforward Capacitance, CFF",10,{"$f":"IF(IntFB=1,\"\",\"pF\")","v":"pF"}]
[null,null,null,null,null,"Lower Standard Feedback Resistance, RFBB",{"$f":"R.fb_bot/1000","v":5.6366197183098592},{"$f":"IF(IntFB=1,\"\",\"kΩ\")","v":"kΩ"}]
[null,null,null,null,null,"Selected CFF Zero Frequency ",{"$f":"1/(2*3.141592*G67*10^3*G68*10^-12)/1000","v":159.15497620314795},{"$f":"IF(IntFB=1,\"\",\"kHz\")","v":"kHz"}]
[]
[]
[null,{"$f":"IF(PH=1,\"Step 9: Using Internal Loop Compensation\",\"Step 9: External Loop Compensation Design\")","v":"Step 9: External Loop Compensation Design"}]
[null,null,null,null,null,"Desired Maximum RCOMP Value",{"$f":"R.comp_desired_max/1000","v":4.9480073999999998},"kΩ"]
[null,null,null,null,null,"Desired Minimum CCOMP Value",{"$f":"C.comp_desired_min*1000000000","v":3.6551668759342855},"nF"]
[null,null,null,null,null,"Desired CHF Value",{"$f":"C.hf_desired_min*1000000000000","v":5.5173725083757956},"pF"]
[null,null,null,null,null,"Desired Compensation Zero Frequency",{"$f":"f.ea_zero_desired/1000","v":8.7999999999999989},"kHz"]
[null,null,null,null,null,"Desired Compensation Pole Frequency",{"$f":"f.ea_pole_desired/1000","v":5829.8526081739192},"kHz"]
[null,null,null,null,null,"Selected RCOMP Value",5.6,"kΩ"]
[null,null,null,null,null,"Selected CCOMP Value",3.3,"nF"]
[null,null,null,null,null,"Selected CHF Value",200,"pF"]
[null,null,null,null,null," Selected Compensation Zero Frequency",{"$f":"f.ea_zero_estimated/1000","v":8.6122822620751069},"kHz"]
[null,null,null,null,null,"Selected Compensation Pole Frequency",{"$f":"f.ea_pole_estimated/1000","v":132.17981037010921},"kHz"]
[]
[]
[null,"Step 9: Power Loss & Thermals"]
[null,null,null,null,null,"Maximum Ambient Temperature, TAMB_MAX",35,"°C"]
[null,null,null,null,null,"Air Flow",10,"LFM"]
[null,null,null,null,null,"Estimated Max Junction Temperature, TJ at VSUPPLY(typ)",{"$f":"Calculation!AO327","v":97.603729756721378},"°C"]
[]
[null,"Step 10: Input Capacitors"]
[null,null,null,null,null,"Input Voltage Ripple Spec",35,"mVpk-pk"]
[null,null,null,null,null,"Minimum Derated Input Capacitance, CVIN1_HF2, CVIN2_HF2",{"$f":"Calculation!F191 *1000000","v":10},"µF"]
[null,null,null,null,null,"Maximum Input Capacitor RMS Current",{"$f":"Calculation!C194","v":1.5},"A(rms)"]
[null,null,null,null,null,"Maximum Input Capacitor ESR ",{"$f":"Calculation!F201","v":0.72916666666666674},"mΩ"]

{"sheet":"Important Notice and Disclaimer","index":1,"n_rows":0,"n_cols":0,"rows_kept":0,"cut":false,"hidden":false,"merged":[]}

{"sheet":"Calculation","index":2,"n_rows":486,"n_cols":91,"rows_kept":486,"cut":false,"hidden":true,"merged":[]}
["Macro should be enabled "]
[null,null,null,"User Input"]
[null,null,null,"Calc suggestion / User Input /Output"]
[null,null,null,"FixedParameters"]
[]
["Definitions"]
[null,"Name","Number ","Displayed Unit","multiple ","Value","Arial 8pt"]
[null,"π",null,null,null,3.1415920000000002]
[null,null,null,null,null,null,{"$f":"Design!G16","v":"LM(Q)644A2(-Q1)"}]
["Electrical Specifications Mode/Config Selection"]
[null,"Name","Number ","Displayed Unit","multiple ","Value","Arial 8pt"]
["Min 3.9V","V.supply_min",{"$f":"Design!G7","v":24},null,1,{"$f":"C12*E12","v":24}]
[null,"V.supply_typ",{"$f":"Design!G8","v":24},null,1,24,{"$f":"\" = \"&V.supply_typ&\" Vtyp\"","v":" = 24 Vtyp"}]
["Max 36V","V.supply_max",{"$f":"Design!G9","v":24},null,1,24]
["Min 0.8V,  Max 20V","V.load",{"$f":"Design!G10","v":15},null,1,15,{"$f":"\" = \"&V.load&\" V\"","v":" = 15 V"}]
["Max 36A","I.load_nph",{"$f":"Design!G11","v":12},null,1,12]
["Min 100k, Max 2.2M","f.sw",{"$f":"Design!G12","v":2200},"kHz",{"$f":"1000","v":1000},{"$f":"C17*E17","v":2200000}]
[null,"P.out",{"$f":"V.load*I.load_nph","v":180},null,1,{"$f":"C18*E18","v":180}]
[null,"R.load_nph",{"$f":"V.load/I.load_nph","v":1.25},null,1,{"$f":"C19*E19","v":1.25}]
["Use dropdown menu","I.rated",{"$f":"IF(Design!G16=STD_VAL!C3,STD_VAL!D3,IF(Design!G16=STD_VAL!C4,STD_VAL!D4,IF(Design!G16=STD_VAL!C5,STD_VAL!D5,444)))","v":6},null,1,{"$f":"C20*E20","v":6},null,"PH_NEW"]
["Use dropdown menu","PH",{"$f":"IF(Design!G17=STD_VAL!C8,STD_VAL!D8,IF(Design!G17=STD_VAL!C9,STD_VAL!D9,IF(Design!G17=STD_VAL!C10,STD_VAL!D10,IF(Design!G17=STD_VAL!C11,STD_VAL!D11,444))))","v":4},null,1,4,null,{"$f":"MIN(2,C21)","v":2}]
["Use dropdown menu","FPWM",{"$f":"IF(Design!G18=STD_VAL!C14,STD_VAL!D14,IF(Design!G18=STD_VAL!C15,STD_VAL!D15,444))","v":0},null,1,0]
["Use dropdown menu","IntFB",{"$f":"IF(Design!G19=STD_VAL!C18,STD_VAL!D18,IF(Design!G19=STD_VAL!C19,STD_VAL!D19,444))","v":0},null,1,0]
["??????? Should be 1 always","ExtBIAS",1,null,1,1]
["Use dropdown menu","SPSP",{"$f":"IF(Design!G20=STD_VAL!C22,STD_VAL!D22,IF(Design!G20=STD_VAL!C23,STD_VAL!D23,444))","v":1},null,1,1]
["Use dropdown menu","SYNC",{"$f":"IF(Design!G21=STD_VAL!C26,STD_VAL!D26,IF(Design!G21=STD_VAL!C27,STD_VAL!D27,444))","v":0},null,1,0,{"$f":"IF(SYNC=1,\"External SYNC Pulse\",IF(FPWM=1,\"Connect to VCC\", \"Connect to AGND\"))","v":"Connect to AGND"}]
[null,"I.load_1ph",{"$f":"I.load_nph/PH","v":3},null,1,3]
[null,"R.load_1ph",{"$f":"V.load/I.load_1ph","v":5},null,1,5]
["Multi-phase effective frequecy","f.sw_nph",{"$f":"f.sw*PH","v":8800000},null,1,8800000]
[null,"IntEA",{"$f":"IF(PH=1,1, 0)","v":0},null,1,{"$f":"C30*E30","v":0}]
[null,"RatedIout",{"$f":"I.rated*PH","v":24},null,1,24]
["Rcfg selection (Recommend both Primary and Secondary if N-phase)"]
[null,"Name","Number ","Final Unit","multiple ","Value","Arial 8pt"]
[null,"R.cfg_master",{"$f":"IF(SPSP=0,IF(PH=1,0,IF(PH=2,9.53,IF(PH=4,19.1,IF(PH=6,29.4,4444)))),IF(PH=1,121,IF(PH=2,56.2,IF(PH=4,73.2,IF(PH=6,93.1,4444)))))","v":73.2},"kOhm",1000,{"$f":"C34*E34","v":73200},{"$f":"C34&\"kΩ\"","v":"73,2kΩ"}]
[null,"R.cfg_slave",{"$f":"IF(PH<>1, 41.2, \"N/A\")","v":41.2},"kOhm",1000,{"$f":"C35*E35","v":41200},{"$f":"C35&\"kΩ\"","v":"41,2kΩ"}]
[]
["Rt selection"]
[null,"Name","Number ","Final Unit","multiple ","Value","Arial 8pt"]
[null,"R.t_calc",{"$f":"14.925*10^9/(f.sw-20298)","v":6847.2662776838306},null,1,{"$f":"C39*E39","v":6847.2662776838306}]
[null,"R.t_std",{"$f":"IF(ISNUMBER(R.t_calc/1000),INDEX(STD_VAL!$A$1:$A$769,MATCH(R.t_calc/1000,STD_VAL!$A$1:$A$769)),R.t_calc/1000)","v":6.81},"kOhm",1000,{"$f":"C40*E40","v":6810},{"$f":"C40&\"kΩ\"","v":"6,81kΩ"}]
[]
["Lout Inductor selection"]
[null,"Name","Number ","Final Unit","multiple ","Value","Arial 8pt"]
[null,"RR.desired",0.35,null,1,{"$f":"C44*E44","v":0.35}]
["B0 =B1 = 0.32","V.slope_min",0.32,null,1,0.32]
["B0 = B1 = 0.35","V.slope_max",0.35,null,1,0.35]
[null,"I.ncl_th_min",{"$f":"IF(I.rated=4,2,IF(I.rated=5,2.4,IF(I.rated=6,2.9,4444)))","v":2.9},null,1,2.9]
[null,"I.pcl_th_min",{"$f":"IF(I.rated=4,6.53,IF(I.rated=5,8.17,IF(I.rated=6,9.8,4444)))","v":9.8000000000000007},null,1,9.8000000000000007]
[null,"I.pcl_th_max",{"$f":"IF(I.rated=4,8.13,IF(I.rated=5,10.17,IF(I.rated=6,12.2,4444)))","v":12.2},null,1,12.2]
[null,"L.out_typical_calc",{"$f":"(V.supply_typ-V.load)/RR.desired/I.load_1ph*(V.load/V.supply_typ*1/f.sw)","v":2.435064935064935E-6},null,1,{"$f":"C50*E50","v":2.435064935064935E-6}]
[null,"Margin",1.2,null,1,{"$f":"C51*E51","v":1.2}]
["No sub-harmonic OSC","L.out_min1",{"$f":"V.load/f.sw*1/11*6/I.rated*1/V.slope_min*1/2*Margin","v":1.1621900826446282E-6},null,1,{"$f":"C52*E52","v":1.1621900826446282E-6}]
["No DCM  at VSUPPLY_MAX and full load ","L.out_min2",{"$f":"(V.supply_max-V.load)/(2*I.load_1ph)*(V.load/V.supply_max*1/f.sw)","v":4.2613636363636364E-7},null,1,4.2613636363636364E-7]
["No negative current limit at VSUPPLY_MAX in FPWM (0 if AUTO)","L.out_min3",{"$f":"(V.supply_max-V.load)/(I.ncl_th_min*2)*V.load/(V.supply_max*f.sw)","v":4.408307210031348E-7},null,1,4.408307210031348E-7]
["No peak current limit at VSUPPLY_MIN","L.out_min4",{"$f":"(V.supply_min-V.load)/(I.pcl_th_min*(1-V.slope_max*V.load/V.supply_min)-I.load_1ph)*(V.load/V.supply_min/f.sw)*Margin","v":6.5893837705918234E-7},null,1,6.5893837705918234E-7]
[null,"L.out_min",{"$f":"MAX(C52:C55)","v":1.1621900826446282E-6},null,1,{"$f":"C56*E56","v":1.1621900826446282E-6}]
[null,"L.out",{"$f":"Design!G28","v":1.5},"uH",{"$f":"0.000001","v":9.9999999999999995E-7},{"$f":"C57*E57","v":1.5E-6},{"$f":"C57&\"µH\"","v":"1,5µH"}]
[null,"t.blank_max",3.5000000000000002E-8,null,1,{"$f":"C58*E58","v":3.5000000000000002E-8}]
["Peak inductor current at VSUPPLY_MAX, Minimum Isat for soft saturation core ","I.sat_softsaturation",{"$f":"I.load_1ph+(V.supply_max-V.load)/L.out*V.load/V.supply_max/f.sw/2","v":3.8522727272727275},null,1,{"$f":"C59*E59","v":3.8522727272727275}]
["Peak current limit at VSUPPLY_MAX, Minimum Isat for ferrite core, use dropdown","I.sat_hardsaturation",{"$f":"I.pcl_th_max*(1-V.slope_min*V.load/V.supply_max)+t.blank_max*(V.supply_max-V.load)/L.out","v":9.9700000000000006},null,1,9.9700000000000006]
[]
["Duty cycle, ton, Toff, Vdropout"]
[null,"Name","Number ","Final Unit","multiple ","Value","Arial 8pt"]
["1st 38, 2nd 34","R.hs_25",{"$f":"0.0357","v":3.5700000000000003E-2},null,1,{"$f":"C64*E64","v":3.5700000000000003E-2}]
["1st 35, 2nd 28","R.ls_25",{"$f":"0.0294","v":2.9399999999999999E-2},null,1,2.9399999999999999E-2]
[null,"R.dcr_25",{"$f":"Design!G29/1000","v":5.0000000000000001E-3},null,1,5.0000000000000001E-3]
["Min 60ns, give a warning.Enters PFM if less than 60ns","t.on_ideal",{"$f":"V.load/V.supply_max/f.sw","v":2.8409090909090909E-7},null,1,{"$f":"C67*E67","v":2.8409090909090909E-7}]
["Min 100ns, give a warning","t.off_150",{"$f":"(1-(V.load+(R.ls_25*2+R.dcr_25*2)*I.load_1ph)/(V.supply_min+(R.ls_25*2-R.hs_25*2)*I.load_1ph))/f.sw","v":1.6609113899846801E-7},null,1,{"$f":"C68*E68","v":1.6609113899846801E-7},null,"TOFF_SPEC"]
["Give a warning if <Vin_min. Enters dropout if less than  TOFF","V.supply_dropout",{"$f":"(V.load+(R.ls_fullload+R.dcr_fullload)*I.load_1ph)/(1-f.sw*TOFF_SPEC)-(R.ls_fullload-R.hs_fullload)*I.load_1ph","v":18.590296947397018},null,1,{"$f":"C69*E69","v":18.590296947397018},null,8.0000000000000002E-8]
[]
["Default values"]
[null,"Name","Number ","Final Unit","multiple ","Value","Arial 8pt"]
[null,"C.vcc",9.9999999999999995E-7,null,1,{"$f":"C73*E73","v":9.9999999999999995E-7}]
[null,"C.cb1",9.9999999999999995E-8,null,1,9.9999999999999995E-8]
[null,"C.cb2",9.9999999999999995E-8,null,1,9.9999999999999995E-8]
[null,"C.vin1_hf2",{"$f":"F191","v":1.0000000000000001E-5},null,1,1.0000000000000001E-5,{"$f":"H76&\"µF\"","v":"10µF"},{"$f":"INT(C.vin1_hf2*1000000)","v":10}]
[null,"C.vin2_hf2",{"$f":"F191","v":1.0000000000000001E-5},null,1,1.0000000000000001E-5,{"$f":"H77&\"µF\"","v":"10µF"},{"$f":"INT(C.vin1_hf2*1000000)","v":10}]
[null,"C.vin1_hf1",9.9999999999999995E-8,null,1,9.9999999999999995E-8]
[null,"C.vin2_hf1",9.9999999999999995E-8,null,1,9.9999999999999995E-8]
[null,"R.pg1",100000,null,1,100000]
[null,"R.pg2",100000,null,1,100000]
[]
["EN UVLO "]
[null,"Name","Number ","Final Unit","multiple ","Value","Arial 8pt"]
[null,"V.en_rising_max",1.375,null,1,{"$f":"C85*E85","v":1.375}]
[null,"V.en_falling_max",1,null,1,1]
[null,"V.startup",{"$f":"Design!G44","v":2},null,1,2]
[null,"R.en_top",{"$f":"Design!G45","v":100},"kOhm",{"$f":"1000","v":1000},100000,{"$f":"C88&\"kΩ\"","v":"100kΩ"}]
[null,"R.en_bot_calc",{"$f":"(V.en_rising_max*R.en_top)/(V.startup-V.en_rising_max)","v":220000},null,1,{"$f":"C89*E89","v":220000}]
[null,"R.en_bot",{"$f":"IF(ISNUMBER(R.en_bot_calc/1000),INDEX(STD_VAL!$A$1:$A$769,MATCH(R.en_bot_calc/1000,STD_VAL!$A$1:$A$769)),R.en_bot_calc/1000)","v":215},"kOhm",1000,{"$f":"C90*E90","v":215000},{"$f":"C90&\"kΩ\"","v":"215kΩ"}]
[null,"V.shutdown",{"$f":"V.en_falling_max*(R.en_top+R.en_bot)/R.en_bot","v":1.4651162790697674},null,1,{"$f":"C91*E91","v":1.4651162790697674}]
[]
["COUT"]
[null,"Name","Number ","Final Unit","multiple ","Value","Arial 8pt"]
["Min 4% of Vload not to trigger UV, 50% load transient ","ΔV.undershoot_desired",{"$f":"V.load*Design!G50/100","v":0.75},null,1,{"$f":"C95*E95","v":0.75}]
["was f.sw/20/1000","f.cross_desired",{"$f":"Design!G51","v":88},"kHZ",1000,{"$f":"C96*E96","v":88000}]
["Assuming Bulk Cap is aluminum, AL-cap doesn't need a derating by bias voltage , this is for 50% transition","C.out_min_calc",{"$f":"1/(2*π*f.cross_desired*ΔV.undershoot_desired)*(I.load_nph/2)","v":1.4468634200286177E-5},null,1,{"$f":"C97*E97","v":1.4468634200286177E-5}]
["Rated value ","C.out_rated",{"$f":"Design!G53","v":70},"uF",9.9999999999999995E-7,{"$f":"C98*E98","v":6.9999999999999994E-5},{"$f":"H98&\"µF\"","v":"70µF"},{"$f":"INT(C.out_rated*1000000)","v":70}]
["Deating at Vload","Derating.cout",{"$f":"Design!G54","v":0.3},null,1,{"$f":"C99*E99","v":0.3}]
["Derated","C.out",{"$f":"C.out_rated*Derating.cout","v":2.0999999999999999E-5},null,1,2.0999999999999999E-5]
[null,"R.esr_cout",{"$f":"IF(Design!G56<>0, Design!G56/1000,0.0001)","v":1.2999999999999999E-3},null,1,{"$f":"C101*E101","v":1.2999999999999999E-3}]
[null,"DCatVsupplymax",{"$f":"V.load/V.supply_max","v":0.625},null,1,{"$f":"C102*E102","v":0.625}]
[null,"DCatPeakRipple",{"$f":"IF(PH=1,V.load/V.supply_max,IF(PH=2,V.load/V.supply_max,IF(PH=4,0.37,IF(PH=6,0.25,4444))))","v":0.37},null,1,0.37]
[null,"NPH_Factor.Iout_temp1",{"$f":"PH / DCatVsupplymax / (1 - DCatVsupplymax) * (DCatVsupplymax - FLOOR(PH *DCatVsupplymax, 1) / PH) * ((1 + FLOOR(PH * DCatVsupplymax, 1)) / PH - DCatVsupplymax)","v":0.26666666666666666},null,1,{"$f":"C104*E104","v":0.26666666666666666}]
[null,"NPH_Factor.Iout_temp2",{"$f":"PH / DCatPeakRipple / (1 - DCatPeakRipple) * (DCatPeakRipple - FLOOR(PH *DCatPeakRipple, 1) / PH) * ((1 + FLOOR(PH * DCatPeakRipple, 1)) / PH - DCatPeakRipple)","v":0.26769626769626764},null,1,0.26769626769626764]
[null,"NPH_Factor.Iout_rms2",{"$f":"MAX(NPH_Factor.Iout_temp1:NPH_Factor.Iout_temp2)","v":0.26769626769626764},null,1,0.26769626769626764]
[null,"ΔV.load_pkpk_nph_calc_simple",{"$f":"(V.supply_max-V.load)/L.out*V.load/V.supply_max/f.sw*SQRT((1/8/f.sw/C.out)^2+(R.esr_cout)^2)*NPH_Factor.Iout_rms2","v":1.3696936788573971E-3},null,1,{"$f":"C107*E107","v":1.3696936788573971E-3}]
[null,"ΔV.overshoot_typical_calc1",{"$f":"(-2*V.load+SQRT((2*V.load)^2+4*(L.out*I.load_1ph^2/(C.out/PH))))/2","v":8.547077725546437E-2},null,1,{"$f":"C108*E108","v":8.547077725546437E-2}]
[null,"ΔV.overshoot_typical_calc2",{"$f":"L.out*I.load_1ph^2/(2*V.load*C.out/PH)","v":8.5714285714285729E-2},null,1,8.5714285714285729E-2]
[null,"ΔV.overshoot_typical_calc",{"$f":"MAX(ΔV.overshoot_typical_calc1,ΔV.overshoot_typical_calc2)","v":8.5714285714285729E-2},null,1,{"$f":"C110*E110","v":8.5714285714285729E-2}]
["Max 4% of V.load","ΔV.undershoot_typical_calc1",{"$f":"I.load_nph/(2*π*FCROSSOVER_FOUND*C.out)","v":0.9751635252033316},null,1,{"$f":"C111*E111","v":0.9751635252033316},{"$f":"ΔV.undershoot_typical_calc1/V.load*100","v":6.5010901680222108}]
[]
["Soft-start (Single output)"]
[null,"Name","Number ","Final Unit","multiple ","Value","Arial 8pt"]
[null,"I.ss_max",2.5000000000000001E-5,null,1,{"$f":"C115*E115","v":2.5000000000000001E-5}]
[null,"V.ref",0.8,null,1,0.8]
[null,"t.ss_min",{"$f":"C.out*V.load/(I.pcl_th_min*(1-V.slope_max*V.load/V.supply_min)+t.blank_max*(V.supply_min-V.load)/L.out-(V.supply_min-V.load)/L.out*V.load/V.supply_min/f.sw-I.load_1ph)/PH","v":2.490745067030873E-5},null,1,2.490745067030873E-5]
[null,"C.ss_min",{"$f":"IF(IntEA=1,\"N/A\",I.ss_max*t.ss_min/V.ref)","v":7.7835783344714786E-10},null,1,7.7835783344714786E-10]
[null,"C.ss",{"$f":"Design!G63","v":1000},"nF",1.0000000000000001E-9,1.0000000000000002E-6,{"$f":"C119&\"nF\"","v":"1000nF"}]
[]
["Feedback network"]
[null,"Name","Number ","Final Unit","multiple ","Value","Arial 8pt"]
[null,"R.fb_top1_int",41000,null,1,{"$f":"C123*E123","v":41000}]
[null,"R.fb_top2_int",1563000,null,1,1563000]
["Ideally 6.25E-13 adjusted to 1.25E-13 to match with B0 si","C.fb_top_int",1.25E-13,null,1,1.25E-13]
[null,"C.fb_bot_int",8.0000000000000002E-13,null,1,8.0000000000000002E-13]
["Change to 1ohm","R.fb_top1_ext",{"$f":"Design!G66*1000","v":50},"Ohm",1,{"$f":"C127*E127","v":50}]
[null,"R.fb_top2_ext",{"$f":"Design!G67","v":100},"kOhm",1000,100000]
["Min1fF","C.fb_top_ext",{"$f":"Design!G68","v":10},"pF",{"$f":"0.000000000001","v":9.9999999999999998E-13},{"$f":"C129*E129","v":9.9999999999999994E-12}]
["Min 1fF","C.fb_bot_ext",0,"pF",{"$f":"0.000000000001","v":9.9999999999999998E-13},0]
[null,"R.fb_top_min",{"$f":"4000*V.load/V.ref","v":75000},null,1,75000]
[null,"R.fb_top1",{"$f":"IF(IntFB=1,R.fb_top1_int,R.fb_top1_ext)","v":50},null,1,{"$f":"C132*E132","v":50},{"$f":"C132&\"Ω\"","v":"50Ω"}]
[null,"R.fb_top2",{"$f":"IF(IntFB=1,R.fb_top2_int,R.fb_top2_ext)","v":100000},null,1,100000,{"$f":"C133/1000&\"kΩ\"","v":"100kΩ"}]
[null,"C.fb_top",{"$f":"IF(IntFB=1,C.fb_top_int,MAX(C.fb_top_ext,0.0000000000001))","v":9.9999999999999994E-12},null,1,9.9999999999999994E-12,{"$f":"C134*1000000000000&\"pF\"","v":"10pF"}]
[null,"C.fb_bot",{"$f":"IF(IntFB=1,C.fb_bot_int,MAX(C.fb_bot_ext+0.000000000006,0.0000000000001))","v":6.0000000000000003E-12},null,1,6.0000000000000003E-12]
[null,"R.fb_top",{"$f":"R.fb_top1+R.fb_top2","v":100050},null,1,100050]
[null,"R.fb_bot",{"$f":"V.ref*R.fb_top/(V.load-V.ref)","v":5636.6197183098593},null,1,5636.6197183098593]
["Min 4k if external FB","R.fb",{"$f":"R.fb_top2*R.fb_bot/(R.fb_top2+R.fb_bot)","v":5335.857710461054},null,1,5335.857710461054]
[null,"R.fb_bot_std",{"$f":"IF(ISNUMBER(R.fb_bot/1000),INDEX(STD_VAL!$A$1:$A$769,MATCH(R.fb_bot/1000,STD_VAL!$A$1:$A$769)),R.fb_bot/1000)","v":5.62},"kOhm",1000,5620,{"$f":"C139&\"kΩ\"","v":"5,62kΩ"}]
[]
["IC parasitic (Feedback)"]
[null,"Name","Number ","Final Unit","multiple ","Value","Arial 8pt"]
[null,"R.fb_buf_int",1000,null,1,{"$f":"C143*E143","v":1000}]
[null,"C.fb_buf_int",3.1999999999999998E-10,null,1,3.1999999999999998E-10]
[null,"A.fb_buf_int",1,null,1,1]
[null,"R.fb_buf_ext",1000,null,1,1000]
[null,"C.fb_buf_ext",{"$f":"0.00000000032+0.00000000000000265","v":3.2000265E-10},null,1,3.2000265E-10]
[null,"A.fb_buf_ext",1,null,1,1]
[null,"R.fb_buf",{"$f":"IF(IntEA=1,R.fb_buf_int,R.fb_buf_ext)","v":1000},null,1,{"$f":"C149*E149","v":1000}]
[null,"C.fb_buf",{"$f":"IF(IntEA=1,C.fb_buf_int,C.fb_buf_ext)","v":3.2000265E-10},null,1,3.2000265E-10]
[null,"A.fb_buf",{"$f":"IF(IntEA=1,A.fb_buf_int,A.fb_buf_ext)","v":1},null,1,1]
[]
["Compensation componeent, Second Feedabck parasitic, COMP filter "]
[null,"Name","Number ","Final Unit","multiple ","Value","Arial 8pt"]
[null,"R.eaout_int1",309000000,null,1,{"$f":"C155*E155","v":309000000}]
[null,"GM.int",1.45E-5,null,1,1.45E-5]
[null,"R.eaout_ext1",473000000,null,1,473000000]
[null,"GM.ext",1E-3,null,1,1E-3]
[null,"R.eaout",{"$f":"IF(IntEA=1,R.eaout_int1,R.eaout_ext1)","v":473000000},null,1,473000000]
[null,"GM",{"$f":"IF(IntEA=1,GM.int,GM.ext)","v":1E-3},null,1,1E-3]
[null,"R.comp_desired_max",{"$f":"1/(V.ref/V.load*GM*11*I.rated/6*PH/(2*π*f.cross_desired*C.out))","v":4948.0073999999995},null,1,{"$f":"C161*E161","v":4948.0073999999995}]
[null,"C.comp_desired_min",{"$f":"1/(2*π*f.cross_desired/10*R.comp_desired_max)","v":3.6551668759342853E-9},null,1,3.6551668759342853E-9]
[null,"C.hf_desired_min",{"$f":"C.out*R.esr_cout/R.comp_desired_max","v":5.517372508375796E-12},null,1,5.517372508375796E-12]
[null,"f.ea_zero_desired",{"$f":"1/(2*π*R.comp_desired_max*C.comp_desired_min)","v":8799.9999999999982},null,1,8799.9999999999982]
[null,"f.ea_pole_desired",{"$f":"1/(2*π*R.comp_desired_max*C.hf_desired_min)","v":5829852.6081739189},null,1,5829852.6081739189]
[null,"R.comp_int",960000,null,1,960000]
[null,"C.comp_int",1.7999999999999999E-11,null,1,1.7999999999999999E-11]
[null,"C.hf_int",1.2300000000000001E-13,null,1,1.2300000000000001E-13]
[null,"R.comp_ext",{"$f":"Design!G79","v":5.6},"kOhm",1000,5600]
[null,"C.comp_ext",{"$f":"Design!G80","v":3.3},"nF",1.0000000000000001E-9,3.3000000000000002E-9]
[null,"C.hf_ext",{"$f":"Design!G81","v":200},"pF",9.9999999999999998E-13,2.0000000000000001E-10]
[null,"R.comp",{"$f":"IF(IntEA=1,R.comp_int,R.comp_ext)","v":5600},null,1,5600,{"$f":"C172/1000","v":5.6}]
[null,"C.comp",{"$f":"IF(IntEA=1,C.comp_int,C.comp_ext)","v":3.3000000000000002E-9},null,1,3.3000000000000002E-9,{"$f":"C173*1000000000","v":3.3000000000000003}]
[{"$f":"IntEA","v":0},"C.hf",{"$f":"IF(IntEA=1,C.hf_int,C.hf_ext+0.00000000003)","v":2.3000000000000001E-10},null,1,2.3000000000000001E-10,{"$f":"Design!G81","v":200}]
[null,"f.ea_zero_estimated",{"$f":"1/(2*π*R.comp*C.comp)","v":8612.2822620751067},null,1,8612.2822620751067]
[null,"f.ea_pole_estimated",{"$f":"1/(2*π*R.comp*(C.comp*C.hf/(C.comp+C.hf)))","v":132179.81037010922},null,1,132179.81037010922,{"$f":"0.00000000001","v":9.9999999999999994E-12}]
["Do not show just show graph (actual is greater than this)","f.cross_estimated",{"$f":"V.ref/V.load*GM*R.comp*11*I.rated/6*PH/(2*π*C.out)","v":99595.647330681051},null,1,99595.647330681051]
[null,"COMP.rc_filter_R",21700,null,1,{"$f":"C178*E178","v":21700}]
[null,"COMP.rc_filter_C",{"$f":"0.00000000000226","v":2.2600000000000001E-12},null,1,2.2600000000000001E-12]
[null,"A.comp_buffer_int",0.77,null,1,0.77]
[null,"A.comp_buffer_ext",1,null,1,1]
[null,"A.comp_buffer",{"$f":"IF(IntEA=1,A.comp_buffer_int,A.comp_buffer_ext)","v":1},null,1,1]
[]
["Input capacitors"]
[null,"Name","Number ","Final Unit","multiple ","Value","Arial 8pt"]
[null,"V.in_ripple_required",{"$f":"Design!G92","v":35},null,1E-3,{"$f":"C186*E186","v":3.5000000000000003E-2}]
[null,"EffectiveDC",{"$f":"1-((1-V.load/V.supply_max)*PH-FLOOR((1-V.load/V.supply_max)*PH,1))","v":0.5}]
[]
["Iout/Number_of_Phases*D1_Vinmax*(1-D1_Vinmax)/(Vinripple1*Fsw)","Cinmin at Vinmax",{"$f":"I.load_nph/PH*eDC*(1-eDC)/(V.in_ripple_required*f.sw*PH)","v":2.4350649350649346E-6},null,1000000,{"$f":"C189*E189","v":2.4350649350649345}]
[null,"Cinmin at 50%DC",{"$f":"I.load_nph/PH*0.5*(1-0.5)/(V.in_ripple_required*f.sw*PH)","v":2.4350649350649346E-6},null,1000000,{"$f":"C190*E190","v":2.4350649350649345}]
[null,"Cinmin_required",{"$f":"MAX(C189,C190,0.00001)","v":1.0000000000000001E-5},null,1,{"$f":"C191*E191","v":1.0000000000000001E-5}]
[null,"I.ripple_rms at VinMax",{"$f":"I.load_nph/PH*SQRT(eDC*(1-eDC))","v":1.5}]
[null,"I.ripple_rms at 50%",{"$f":"I.load_nph/PH*SQRT(0.5*(1-0.5))","v":1.5}]
[null,"I.ripple_in",{"$f":"MAX(C193,C192)","v":1.5}]
[null,"I.ripple_rms at VinMax",{"$f":"I.load_nph/PH*SQRT(eDC*(1-eDC))","v":1.5}]
[null,"I.ripple_rms at 50%",{"$f":"I.load_nph/PH*SQRT(0.5*(1-0.5))","v":1.5}]
[null,"I.ripple_in",{"$f":"MAX(C196,C195)","v":1.5}]
["-(Iout/Number_of_Phases*0.5*(1-0.5)/(Cin*Fsw)-Vinripple1)/(Iout/Number_of_Phases+Iripple_Vinmax/2)","Max ESR1 at 50%"]
[]
["Converter input impedance at min VIN  -10dB","Max ESR2 for stability",{"$f":"V.supply_min^2/(V.load*I.load_nph)","v":3.2}]
[null,"Max ESR",{"$f":"V.in_ripple_required/I.load_nph/PH","v":7.291666666666667E-4},null,1000,{"$f":"C201*E201","v":0.72916666666666674}]
[]
[null,{"$f":"FLOOR(0.9*4,1)","v":3}]
[]
[]
[]
[]
[]
[]
[]
[null,null,null,null,null,null,null,null,null,null,null,null,null,null,null,null,null,null,"Global definitions ","for efficiecy plot"]
[null,null,null,null,null,null,null,null,null,null,null,null,null,null,null,null,null,null,"DC_EFF",{"$f":"V.load/V.supply_typ","v":0.625},null,null,"estimated theta JA at full power"]
[null,null,null,null,null,null,null,null,null,null,null,null,null,null,null,null,null,null,"IPKPK_EFF",{"$f":"(V.supply_typ-V.load)/L.out*V.load/V.supply_typ/f.sw","v":1.7045454545454546},null,null,{"$f":"AO327/AL327","v":33.695720707373631}]
[null,null,null,null,null,null,null,null,null,null,null,null,null,null,null,null,null,null,"LFM",{"$f":"Design!G88","v":10},null,null,null,null,null,null,null,null,null,null,null,null,null,null,null,null,null,null,null,null,"°"]
[null,null,null,null,null,null,null,null,null,null,null,null,null,null,null,null,null,null,"THETA_JA_EFF",{"$f":"12276/(558+LFM)","v":21.612676056338028},null,"1st 8600_344, 2nd 12143_714, 3rd 11701_509, 4th 12957_617"]
[null,null,null,null,null,null,null,null,null,null,null,null,null,null,null,null,"Use nly for LDO voltage calculation",null,"T_AMB",{"$f":"Design!G87","v":35}]
[null,null,null,null,null,null,null,null,null,null,null,null,null,null,null,null,"R.hs_fullload",{"$f":"R.hs_25*(1+0.006*(AO327-25))*2","v":0.10250343782777946},"R_HSLS",{"$f":"R.hs_25*DC_EFF+R.ls_25*(1-DC_EFF)","v":3.3337500000000006E-2}]
[null,null,null,null,null,null,null,null,null,null,null,null,null,null,null,null,"R.ls_fullload",{"$f":"R.ls_25*(1+0.006*(AO327-25))*2","v":8.4414595858171307E-2},"TR",{"$f":"V.supply_typ*10^-9/6","v":4.0000000000000002E-9}]
[null,null,null,null,null,null,null,null,null,null,null,null,null,null,null,null,"R.dcr_fullload",{"$f":"R.dcr_25*(1+0.005*(AO327-25))","v":6.8150932439180346E-3},"TF",{"$f":"V.supply_typ*10^-9/6","v":4.0000000000000002E-9}]
[null,null,null,null,null,null,null,null,null,null,null,null,null,null,null,null,null,null,"TRF",{"$f":"TR+TF","v":8.0000000000000005E-9},null,null,null,null,null,null,null,null,null,null,null,null,null,null,null,null,null,null,null,null,{"$f":"\"Peak Efficiency = \"&ROUND(MAX(AN228:AN327),1)&\" %\"","v":"Peak Efficiency = 96,4 %"}]
[null,null,null,null,null,null,null,null,null,null,null,null,null,null,null,null,null,null,"PCORE",{"$f":"Design!G32","v":0.2},"This dominates efficiency at light load. ",null,null,null,null,null,null,null,null,null,null,null,null,null,null,null,null,null,null,null,{"$f":"\"Full Load Efficiency = \"&ROUND(AN327,1)&\" %\"","v":"Full Load Efficiency = 96,3 %"}]
[null,null,null,null,null,null,null,null,null,null,null,null,null,null,null,null,null,null,"CIN_ESR",{"$f":"0.5","v":0.5}]
[null,null,null,null,null,null,null,null,null,null,null,null,null,null,null,null,null,null,"TDLH",{"$f":"0.000000002","v":2.0000000000000001E-9},null,null,null,null,null,null,null,null,null,null,null,null,null,null,null,null,null,null,null,null,"Estimated Maximum TJ"]
[null,null,null,null,null,null,null,null,null,null,null,null,null,null,null,null,null,null,"TDHL",{"$f":"0.000000003","v":3E-9},null,null,null,null,null,null,null,null,null,null,null,null,null,null,null,null,null,null,null,null,{"$f":"ROUND(AO327,1)&\" °C\"","v":"97,6 °C"}]
[null,null,null,null,null,null,null,null,null,null,null,null,null,null,null,null,null,null,null,"Total Iout","1PH IOUT","Based on Total IOUT (Limited to Max 2PH)","1PH","1PH","1PH RMS Current","NPH inductor loss (limited to 2PH)",null,null,null,null,"NPH deadtime loss (limited to 2PH)","NPH transition loss (limited to 2PH)","NPH QRR loss  (limited to 2PH)","NPH Coss loss  (limited to 2PH)","NPH switching loss  (naturally limited to 2PH)","One-IC IQ loss","NPH MOSFET conduction loss  (limited to 2PH)",null,"Total loss ( limited to 2PH loss)","Efficiency ( limited to 2PH efficiency)"]
[null,null,null,null,null,null,null,null,null,null,null,null,null,null,null,null,null,null,null,null,null,null,null,null,null,null,"Need to revisit","Need to revisit","Need to revisit","Need to revisit",null,null,null,null,null,null,null,"1PH result is not valid",null,"Chart","Chart","Chart","Chart","Chart"]
[null,null,null,null,null,null,null,null,null,null,null,null,null,null,null,null,null,null,"STEP","IOUT","IOUT_1PH","TJ_ESTIMATED","RDCR_TJ","RHSLS_TJ","ILOAD_RMS_1PH","Inductor","VCIN_RMS","PCIN_NPH","VCOUT_RMS","PCOUT_NPH","PDT_NPH","PTRAN_NPH","PQRR_NPH","POSS_NPH","PSWITCHING_NPH","PIC_2PH","PCONDUCTION_NPH","IC loss","Total","Converter Effciency","TJ_CALC","Single Inductor","Single IC","Total Loss"]
[null,null,null,null,null,null,null,null,null,null,null,null,null,null,null,null,null,null,1,{"$f":"I.load_nph*S228/100","v":0.12},{"$f":"T228/PH","v":0.03},{"$f":"-(T_AMB+THETA_JA_EFF*PH_NEW*(V.supply_typ*U228*TRF/2*f.sw+0.25+U228^2*R_HSLS*0.85))/(THETA_JA_EFF*PH_NEW*U228^2*R_HSLS*0.006-1)","v":46.081674829623971},{"$f":"R.dcr_25*(1+0.005*(V228-25))","v":5.5270418707405993E-3},{"$f":"R_HSLS*(1+0.006*(V228-25))","v":3.7554362007795543E-2},{"$f":"SQRT((T228/PH)^2+(IPKPK_EFF^2)/12)","v":0.492973563068343},{"$f":"PH_NEW*(PCORE+Y228^2*W228)","v":0.40268639586225752},0,{"$f":"AA228^2/CIN_ESR","v":0},0,0,{"$f":"PH_NEW*IF(AND(FPWM=0,(U228-IPKPK_EFF/2)<0),(U228+IPKPK_EFF/2)*TDHL*0.7*f.sw,(U228-IPKPK_EFF/2)*TDLH*0.7*f.sw+(U228+IPKPK_EFF/2)*TDHL*0.7*f.sw )","v":8.1522000000000001E-3},{"$f":"PH_NEW*IF(AND(FPWM=0,(U228-IPKPK_EFF/2)<0),f.sw*V.supply_typ*(U228+IPKPK_EFF/2)*TF/2,f.sw*V.supply_typ*(U228+IPKPK_EFF/2)*TF/2+f.sw*V.supply_typ*(U228-IPKPK_EFF/2)*TR/2)","v":0.186336},{"$f":"IF(AND(FPWM=0,(U228-IPKPK_EFF/2)<0),0,PH_NEW*V.supply_typ*(0.000000004*(V228+275)/300*U228/6)*f.sw/2)","v":0},{"$f":"PH_NEW*(0.000000000125+0.00000000025)/2*V.supply_typ^2*f.sw","v":0.47520000000000007},{"$f":"AE228+AF228+AG228+AH228","v":0.66968820000000007},{"$f":"V.supply_typ*(0.0045+1/R.t_calc*2)","v":0.1150100968844221},{"$f":"PH_NEW*(Y228^2*X228)","v":1.8253142470574944E-2},{"$f":"AI228+AJ228+AK228","v":0.80295143935499713},{"$f":"AL228+Z228+AB228+AD228","v":1.2056378352172548},{"$f":"100*V.load*U228*PH_NEW/(V.load*U228*PH_NEW+AM228)","v":42.742393062439447},{"$f":"T_AMB+THETA_JA_EFF*AL228","v":52.353929347749904},{"$f":"Z228/PH_NEW","v":0.20134319793112876},{"$f":"AL228","v":0.80295143935499713},{"$f":"(Z228+AI228+AJ228+AK228)*PH/PH_NEW","v":2.4112756704345095}]
[null,null,null,null,null,null,null,null,null,null,null,null,null,null,null,null,null,null,2,0.24,0.06,46.359942233408226,5.533998555835206E-3,3.7610022445237493E-2,0.49570448241295695,0.40271966072250259,0,0,0,0,8.4294000000000001E-3,0.19267200000000004,0,0.47520000000000007,{"$f":"AE229+AF229+AG229+AH229","v":0.67630140000000005},{"$f":"V.supply_typ*(0.0045+1/R.t_calc*PH_NEW)","v":0.1150100968844221},1.8483290117396078E-2,{"$f":"AI229+AJ229+AK229","v":0.80979478700181828},{"$f":"AL229+Z229+AB229+AD229","v":1.2125144477243208},59.750750784273762,52.501832403581552,0.2013598303612513,{"$f":"AL229","v":0.80979478700181828},2.4250288954486416]
[null,null,null,null,null,null,null,null,null,null,null,null,null,null,null,null,null,null,3,0.36,0.09,46.641153437774229,5.5410288359443562E-3,3.7666271716390795E-2,0.50022288420692784,0.402772984984135,0,0,0,0,8.7065999999999984E-3,0.19900800000000002,0,0.47520000000000007,0.68291460000000015,0.1150100968844221,1.8849930034716883E-2,{"$f":"AI230+AJ230+AK230","v":0.81677462691913916},1.2195476119032742,68.885500760352301,52.652685422639706,0.2013864924920675,0.81677462691913916,2.4390952238065484]
[null,null,null,null,null,null,null,null,null,null,null,null,null,null,null,null,null,null,4,0.48,0.12,46.925321917539605,5.5481330479384902E-3,3.7723112516555864E-2,0.50648093141232631,0.40284644673407527,0,0,0,0,8.9838000000000001E-3,0.20534400000000003,0,0.47520000000000007,0.68952780000000002,0.1150100968844221,1.9353686995988759E-2,0.82389158388041084,1.2267380306144862,74.584532600823351,52.806501907950569,0.20142322336703763,0.82389158388041084,2.4534760612289723]
[null,null,null,null,null,null,null,null,null,null,null,null,null,null,null,null,null,null,5,0.6,0.15,47.212461426238406,5.55531153565596E-3,3.7780547596783343E-2,0.51441513768968494,0.40294012567441317,0,0,0,0,9.2610000000000001E-3,0.21168000000000001,0,0.47520000000000007,0.69614100000000012,0.1150100968844221,1.9995198697632308E-2,0.83114629558205455,1.2340864212564677,78.478063799637482,52.963295641840318,0.20147006283720659,0.83114629558205455,2.4681728425129354]
[null,null,null,null,null,null,null,null,null,null,null,null,null,null,null,null,null,null,6,0.72,0.18,47.502585998338205,5.562564649958455E-3,3.7838579764317606E-2,0.5239493619466461,0.40305410313525536,0,0,0,0,9.5381999999999984E-3,0.21801600000000002,0,0.47520000000000007,0.70275420000000011,0.1150100968844221,2.0775115861830964E-2,0.83853941274625321,1.2415935158815086,81.305788845514471,53.123080688156698,0.20152705156762768,0.83853941274625321,2.4831870317630171]
[null,null,null,null,null,null,null,null,null,null,null,null,null,null,null,null,null,null,7,0.84,0.21,47.795709951523477,5.569892748788087E-3,3.7897211883053492E-2,0.53499806904726066,0.403188462087958,0,0,0,0,9.8153999999999984E-3,0.22435200000000002,0,0.47520000000000007,0.70936740000000009,0.1150100968844221,2.1694102342404865E-2,0.84607159922682706,1.2492600613147851,83.451887321825652,53.285871394557269,0.201594231043979,0.84607159922682706,2.4985201226295701]
[null,null,null,null,null,null,null,null,null,null,null,null,null,null,null,null,null,null,8,0.96,0.24,48.091847889046257,5.5772961972261562E-3,3.7956446874006483E-2,0.54746957347810443,0.40334328715874873,0,0,0,0,1.00926E-2,0.230688,0,0.47520000000000007,0.71598060000000008,0.1150100968844221,2.2752835233801401E-2,0.85374353211822362,1.2570868192769724,85.135699252707383,53.451682394864989,0.20167164357937437,0.85374353211822362,2.5141736385539444]
[null,null,null,null,null,null,null,null,null,null,null,null,null,null,null,null,null,null,9,1.08,0.27,48.391014702144844,5.5847753675536214E-3,3.8016287715796529E-2,0.56126903877222512,0.403518664642743,0,0,0,0,1.0369799999999998E-2,0.23702400000000001,0,0.47520000000000007,0.72259380000000006,0.1150100968844221,2.3952004983239603E-2,0.86155590186766173,1.2650745665104046,86.491569741106758,53.620528611491928,0.2017593323213715,0.86155590186766173,2.5301491330208092]
[null,null,null,null,null,null,null,null,null,null,null,null,null,null,null,null,null,null,10,1.2,0.3,48.693225572531318,5.5923306393132833E-3,3.8076737445145586E-2,0.57630107919758189,0.40371468251835957,0,0,0,0,1.0647E-2,0.24336000000000002,0,0.47520000000000007,0.72920700000000016,0.1150100968844221,2.5292315506047689E-2,0.86950941239046997,1.2732240949088296,87.60638254216795,53.792425257932059,0.20185734125917978,0.86950941239046997,2.5464481898176587]
[null,null,null,null,null,null,null,null,null,null,null,null,null,null,null,null,null,null,11,1.32,0.33,48.998495974948838,5.5999623993737216E-3,3.813779915738915E-2,0.59247188446735388,0.40393143046213986,0,0,0,0,1.09242E-2,0.24969600000000006,0,0.47520000000000007,0.73582020000000015,0.1150100968844221,2.6774484304233657E-2,0.87760478118865592,1.2815362116507958,88.53881803543706,53.967387841323841,0.20196571523106993,0.87760478118865592,2.5630724233015916]
[null,null,null,null,null,null,null,null,null,null,null,null,null,null,null,null,null,null,12,1.44,0.36,49.30684167979954,5.6076710419949881E-3,3.8199476007001909E-2,0.6096908510747866,0.40416899986397681,0,0,0,0,1.1201400000000002E-2,0.25603200000000004,0,0.47520000000000007,0.74243340000000013,0.1150100968844221,2.8399242588331167E-2,0.88584273947275338,1.2900117393367303,89.329938074919511,54.145432165083662,0.2020844999319884,0.88584273947275338,2.5800234786734606]
[null,null,null,null,null,null,null,null,null,null,null,null,null,null,null,null,null,null,13,1.56,0.39,49.618278755844017,5.6154569688961009E-3,3.8261771208137708E-2,0.62787174955105085,0.40442748384275851,0,0,0,0,1.1478599999999997E-2,0.26236799999999999,0,0.47520000000000007,0.74904660000000001,0.1150100968844221,3.016733540256358E-2,0.89422403228698566,1.2986515161297443,90.009336626047116,54.326574331610978,0.20221374192137925,0.89422403228698566,2.5973030322594886]
[null,null,null,null,null,null,null,null,null,null,null,null,null,null,null,null,null,null,14,1.68,0.42,49.932823572973355,5.6233205893243344E-3,3.8324688035184004E-2,0.64693348489956637,0.40470697726243199,0,0,0,0,1.1755799999999999E-2,0.268704,0,0.47520000000000007,0.7556598000000001,0.1150100968844221,3.2079521753371282E-2,0.90274941863779345,1.3074563959002254,90.598881932963323,54.510830745066116,0.20235348863121599,0.90274941863779345,2.6149127918004509]
[null,null,null,null,null,null,null,null,null,null,null,null,null,null,null,null,null,null,15,1.8,0.45,50.250492805054648,5.631262320126367E-3,3.8388229823331066E-2,0.66680052030895831,0.40500757674849336,0,0,0,0,1.2033E-2,0.27504000000000001,0,0.47520000000000007,0.76227300000000009,0.1150100968844221,3.4136574741348291E-2,0.91141967162577053,1.3164272483742638,91.115083101300897,54.69821811422176,0.20250378837424668,0.91141967162577053,2.6328544967485277]
[null,null,null,null,null,null,null,null,null,null,null,null,null,null,null,null,null,null,16,1.92,0.48,50.571303432851131,5.6392825858212784E-3,3.8452399969156059E-2,0.68740303598711106,0.40532938070490981,0,0,0,0,1.2310199999999997E-2,0.28137600000000001,0,0.47520000000000007,0.76888620000000008,0.1150100968844221,3.633928169663618E-2,0.92023557858105831,1.3255649592859682,91.570636967778896,54.888753455389207,0.20266469035245491,0.92023557858105831,2.6511299185719364]
[null,null,null,null,null,null,null,null,null,null,null,null,null,null,null,null,null,null,17,2.04,0.51,50.89527274701792,5.6473818186754477E-3,3.8517201931222267E-2,0.70867688962198949,0.40567248933148009,0,0,0,0,1.2587399999999999E-2,0.28771200000000002,0,0.47520000000000007,0.77549940000000006,0.1150100968844221,3.8688444317824755E-2,0.92919794120224686,1.3348704305337269,91.975468422744441,55.082454095420388,0.20283624466574005,0.92919794120224686,2.6697408610674542]
[null,null,null,null,null,null,null,null,null,null,null,null,null,null,null,null,null,null,18,2.16,0.54,51.222418351174483,5.6555604587793622E-3,3.8582639230693681E-2,0.73056343590703854,0.4060370046416395,0,0,0,0,1.28646E-2,0.29404800000000003,0,0.47520000000000007,0.78211260000000005,0.1150100968844221,4.1184878814410457E-2,0.93830757569883261,1.3443445803404721,92.337447693276062,55.279337674786746,0.20301850232081975,0.93830757569883261,2.6886891606809442]
[null,null,null,null,null,null,null,null,null,null,null,null,null,null,null,null,null,null,19,2.2799999999999998,0.56999999999999995,51.552758165054982,5.6638189541263753E-3,3.8648715451965132E-2,0.75300925219036818,0.40642303048071649,0,0,0,0,1.3141800000000002E-2,0.30038400000000004,0,0.47520000000000007,0.78872580000000014,0.1150100968844221,4.3829416052865305E-2,0.94756531293728752,1.353988343418004,92.662895856326202,55.47942215073617,0.20321151524035824,0.94756531293728752,2.7079766868360085]
[null,null,null,null,null,null,null,null,null,null,null,null,null,null,null,null,null,null,20,2.4,0.6,51.886310427737698,5.6721577606934429E-3,3.8715434243308242E-2,0.77596580716182173,0.40683067254464667,0,0,0,0,1.3418999999999997E-2,0.30671999999999999,0,0.47520000000000007,0.79533900000000002,0.1150100968844221,4.6622901706370713E-2,0.95697199859079285,1.3638026711354394,92.95694810416353,55.682725800529177,0.20341533627232333,0.95697199859079285,2.7276053422708788]
[null,null,null,null,null,null,null,null,null,null,null,null,null,null,null,null,null,null,21,2.52,0.63,52.223093700954607,5.6805773425238652E-3,3.8782799317533458E-2,0.7993891004287571,0.40726003839915254,0,0,0,0,1.36962E-2,0.313056,0,0.47520000000000007,0.80195220000000011,0.1150100968844221,4.9566196408272326E-2,0.96652849329269452,1.373788531691847,93.223819368815313,55.889267224755486,0.20363001919957627,0.96652849329269452,2.747577063383694]
[null,null,null,null,null,null,null,null,null,null,null,null,null,null,null,null,null,null,22,2.64,0.66,52.56312687248257,5.6890781718120639E-3,3.8850814452668331E-2,0.82323929320963396,0.4077112374993952,0,0,0,0,1.3973399999999999E-2,0.31939200000000001,0,0.47520000000000007,0.8085654000000001,0.1150100968844221,5.2660175909313718E-2,0.97623567279373591,1.383946910293131,93.467001611391495,56.099065350732218,0.2038556187496976,0.97623567279373591,2.767893820586262]
[null,null,null,null,null,null,null,null,null,null,null,null,null,null,null,null,null,null,23,2.76,0.69,52.906429159617232,5.6976607289904316E-3,3.8919483492652444E-2,0.84748034424657748,0.40818438121010575,0,0,0,0,1.4250599999999999E-2,0.32572800000000002,0,0.47520000000000007,0.81517860000000009,0.1150100968844221,5.590573123870865E-2,0.98609442812313086,1.3942788093332366,93.689412443078908,56.312139435985131,0.20409219060505288,0.98609442812313086,2.7885576186664731]
[null,null,null,null,null,null,null,null,null,null,null,null,null,null,null,null,null,null,24,2.88,0.72,53.253020112731143,5.7063255028182791E-3,3.8988810348049054E-2,0.87207966028585804,0.40867958282620431,0,0,0,0,1.4527799999999997E-2,0.33206400000000003,0,0.47520000000000007,0.82179180000000007,0.1150100968844221,5.9303768869113455E-2,0.99610566575353565,1.4047852485797399,93.893508531376256,56.528509071814092,0.20433979141310216,0.99610566575353565,2.8095704971594797]
[null,null,null,null,null,null,null,null,null,null,null,null,null,null,null,null,null,null,25,3,0.75,53.602919618917156,5.7150729904729292E-3,3.9058798996773912E-2,0.89700776690299489,0.4091969575939145,0,0,0,0,1.4804999999999999E-2,0.33840000000000003,0,0.47520000000000007,0.82840500000000006,0.1150100968844221,6.2855210885562576E-2,1.0062703077699848,1.4154672653638993,94.081373156300884,56.748194186944247,0.20459847879695725,1.0062703077699848,2.8309345307277987]
[null,null,null,null,null,null,null,null,null,null,null,null,null,null,null,null,null,null,26,3.12,0.78,53.956147905718943,5.7239036976429736E-3,3.9129453484841439E-2,0.9222380028410766,0.40973662273238098,0,0,0,0,1.50822E-2,0.34473600000000004,0,0.47520000000000007,0.83501820000000015,0.1150100968844221,6.6560995158432987E-2,1.0165892920428552,1.4263259147752363,94.254784539316915,56.971215051264245,0.20486831136619049,1.0165892920428552,2.8526518295504726]
[null,null,null,null,null,null,null,null,null,null,null,null,null,null,null,null,null,null,27,3.24,0.81,54.312725544949693,5.7328181386237425E-3,3.9200777927128568E-2,0.94774623918235501,0.4102986974557995,0,0,0,0,1.53594E-2,0.351072,0,0.47520000000000007,0.84163140000000003,0.1150100968844221,7.0422075520504474E-2,1.0270635724049266,1.437362269860726,94.41526969706635,57.197592279652952,0.20514934872789975,1.0270635724049266,2.8747245397214525]
[null,null,null,null,null,null,null,null,null,null,null,null,null,null,null,null,null,null,28,3.36,0.84,54.672673456600741,5.7418168364150191E-3,3.9272776508156568E-2,0.97351062340597871,0.41088330299606701,0,0,0,0,1.5636599999999997E-2,0.357408,0,0.47520000000000007,0.84824460000000013,0.1150100968844221,7.4439421948184897E-2,1.0376941188326072,1.4485774218286742,94.564147275486093,57.427346835896273,0.20544165149803351,1.0376941188326072,2.8971548436573484]
[null,null,null,null,null,null,null,null,null,null,null,null,null,null,null,null,null,null,29,3.48,0.87,55.036012912841464,5.7509003228210362E-3,3.9345453482891118E-2,0.99951134755154103,0.41149056262596168,0,0,0,0,1.6022999999999999E-2,0.36748799999999998,3.3690076198142856E-2,0.47520000000000007,0.89240107619814291,0.1150100968844221,7.861402074697206E-2,1.0860251938295371,1.4975157564554988,94.573729861517677,58.471910703259503,0.20574528131298084,1.0860251938295371,2.9950315129109977]
[null,null,null,null,null,null,null,null,null,null,null,null,null,null,null,null,null,null,30,3.6,0.9,55.402765542112213,5.760069138552806E-3,3.9418813177561005E-2,1.0257304391916513,0.41212060168286119,0,0,0,0,1.6485E-2,0.38016000000000005,3.4890532041247056E-2,0.47520000000000007,0.90673553204124713,0.1150100968844221,8.2946874741225016E-2,1.1046925036668942,1.5168131053497553,94.680986617452007,58.875361223617588,0.20606030084143059,1.1046925036668942,3.0336262106995107]
[null,null,null,null,null,null,null,null,null,null,null,null,null,null,null,null,null,null,31,3.72,0.93,55.772953333311797,5.7693238333327949E-3,3.9492859990495698E-2,1.0521515736262992,0.41277354759300938,0,0,0,0,1.6947000000000004E-2,0.39283200000000001,3.6093944667730984E-2,0.47520000000000007,0.92107294466773104,0.1150100968844221,8.7439003468320689E-2,1.1235220450204739,1.5362955926134834,94.780947936264809,59.282318001181935,0.20638677379650469,1.1235220450204739,3.0725911852269667]
[null,null,null,null,null,null,null,null,null,null,null,null,null,null,null,null,null,null,32,3.84,0.96,56.146598640081223,5.7786649660020303E-3,3.9567598392982253E-2,1.0787599055787611,0.4134495298963406,0,0,0,0,1.7408999999999997E-2,0.40550400000000003,3.7300352870818752E-2,0.47520000000000007,0.93541335287081884,0.1150100968844221,9.209144337727386E-2,1.1425148931325149,1.5559644230288554,94.874271160205822,59.692804274814705,0.2067247649481703,1.1425148931325149,3.1119288460577108]
[null,null,null,null,null,null,null,null,null,null,null,null,null,null,null,null,null,null,33,{"$f":"I.load_nph*S260/100","v":3.96},{"$f":"T260/PH","v":0.99},{"$f":"-(T_AMB+THETA_JA_EFF*PH_NEW*(V.supply_typ*U260*TRF/2*f.sw+0.25+U260^2*R_HSLS*0.85))/(THETA_JA_EFF*PH_NEW*U260^2*R_HSLS*0.006-1)","v":56.523724185185344},{"$f":"R.dcr_25*(1+0.005*(V260-25))","v":5.7880931046296333E-3},{"$f":"R_HSLS*(1+0.006*(V260-25))","v":3.9643032930141708E-2},{"$f":"SQRT((T260/PH)^2+(IPKPK_EFF^2)/12)","v":1.1055419186463702},{"$f":"PH_NEW*(PCORE+Y260^2*W260)","v":0.41414868027187185},0,{"$f":"AA260^2/CIN_ESR","v":0},0,0,{"$f":"PH_NEW*IF(AND(FPWM=0,(U260-IPKPK_EFF/2)<0),(U260+IPKPK_EFF/2)*TDHL*0.7*f.sw,(U260-IPKPK_EFF/2)*TDLH*0.7*f.sw+(U260+IPKPK_EFF/2)*TDHL*0.7*f.sw )","v":1.7870999999999998E-2},{"$f":"PH_NEW*IF(AND(FPWM=0,(U260-IPKPK_EFF/2)<0),f.sw*V.supply_typ*(U260+IPKPK_EFF/2)*TF/2,f.sw*V.supply_typ*(U260+IPKPK_EFF/2)*TF/2+f.sw*V.supply_typ*(U260-IPKPK_EFF/2)*TR/2)","v":0.41817600000000005},{"$f":"IF(AND(FPWM=0,(U260-IPKPK_EFF/2)<0),0,PH_NEW*V.supply_typ*(0.000000004*(V260+275)/300*U260/6)*f.sw/2)","v":3.8509795801351138E-2},{"$f":"PH_NEW*(0.000000000125+0.00000000025)/2*V.supply_typ^2*f.sw","v":0.47520000000000007},0.94975679580135131,{"$f":"V.supply_typ*(0.0045+1/R.t_calc*2)","v":0.1150100968844221},{"$f":"PH_NEW*(Y260^2*X260)","v":9.6905248031899219E-2},1.1616721407176727,1.5758208209895446,{"$f":"100*V.load*U260*PH_NEW/(V.load*U260*PH_NEW+AM260)","v":94.961536485296676},{"$f":"T_AMB+THETA_JA_EFF*AL260","v":60.106843661003779},{"$f":"Z260/PH_NEW","v":0.20707434013593592},1.1616721407176727,{"$f":"(Z260+AI260+AJ260+AK260)*PH/PH_NEW","v":3.1516416419790891}]
[null,null,null,null,null,null,null,null,null,null,null,null,null,null,null,null,null,null,34,4.08,1.02,56.904353064994403,5.7976088266248607E-3,3.9719168221825508E-2,1.1324852908026213,0.41487113256367286,0,0,0,0,1.8333000000000002E-2,0.43084800000000001,3.9722312974818527E-2,0.47520000000000007,0.96410331297481866,0.1150100968844221,0.10188148831859922,1.18099489817784,1.5958660307415129,95.043257947409344,60.524460158505569,0.20743556628183643,1.18099489817784,3.1917320614830258]
[null,null,null,null,null,null,null,null,null,null,null,null,null,null,null,null,null,null,35,4.2,1.05,57.288508754067067,5.8072127188516769E-3,3.9796008963532276E-2,1.159578774333291,0.41561702280742513,0,0,0,0,1.8794999999999999E-2,0.44352000000000003,4.0937944278501059E-2,0.47520000000000007,0.97845294427850116,0.1150100968844221,0.10702125265886113,1.2004842938217843,1.6161013166292095,95.119892582833444,60.945678153091947,0.20780851140371256,1.2004842938217843,3.2322026332584191]
[null,null,null,null,null,null,null,null,null,null,null,null,null,null,null,null,null,null,36,4.32,1.08,57.676215109836825,5.8169053777459203E-3,3.987355992734512E-2,1.1868120886999329,0.41638648925758009,0,0,0,0,1.9257E-2,0.45619200000000004,4.2156729978718527E-2,0.47520000000000007,0.99280572997871863,0.1150100968844221,0.11232564722655101,1.2201414740896916,1.6365279633472718,95.19184810768715,61.370522422403269,0.20819324462879005,1.2201414740896916,3.2730559266945436]
[null,null,null,null,null,null,null,null,null,null,null,null,null,null,null,null,null,null,37,4.4400000000000004,1.1100000000000001,58.067496377403991,5.8266874094351001E-3,3.9951825962890243E-2,1.214175824946411,0.41717967241512827,0,0,0,0,1.9719000000000004E-2,0.46886400000000006,4.3378710728193104E-2,0.47520000000000007,1.0071617107281932,0.1150100968844221,0.11779579617009381,1.239967603782709,1.6571472761978372,95.25948938823683,61.799018140909396,0.20858983620756413,1.239967603782709,3.3142945523956744]
[null,null,null,null,null,null,null,null,null,null,null,null,null,null,null,null,null,null,38,4.5599999999999996,1.1399999999999999,58.462377194434865,5.8365594298608716E-3,4.0030811998316838E-2,1.2416613603894975,0.41799671505599034,0,0,0,0,2.0181000000000001E-2,0.48153600000000002,4.4603927573527609E-2,0.47520000000000007,1.0215209275735275,0.1150100968844221,0.12343284183963155,1.2599638662975812,1.6779605813535716,95.323143918537994,62.231190884980819,0.20899835752799517,1.2599638662975812,3.3559211627071432]
[null,null,null,null,null,null,null,null,null,null,null,null,null,null,null,null,null,null,39,4.68,1.17,58.860882596170391,5.8465220649042606E-3,4.0110523041298987E-2,1.269260782457371,0.41883776226004271,0,0,0,0,2.0642999999999998E-2,0.49420800000000009,4.5832421962802274E-2,0.47520000000000007,1.0358834219628024,0.1150100968844221,0.12923794501925442,1.2801314638664789,1.6989692261265217,95.383106478644834,62.667066638072001,0.20941888113002136,1.2801314638664789,3.3979384522530434]
[null,null,null,null,null,null,null,null,null,null,null,null,null,null,null,null,null,null,40,4.8,1.2,59.263038020546318,5.8565759505136584E-3,4.0190964180059782E-2,1.2969668206566802,0.4197029614407885,0,0,0,0,2.1104999999999995E-2,0.50688,4.7064235753292924E-2,0.47520000000000007,1.0502492357532929,0.1150100968844221,0.13521228516440173,1.3004716178021167,1.7201745792429053,95.439643112920521,63.106671796018986,0.20985148072039425,1.3004716178021167,3.4403491584858106]
[null,null,null,null,null,null,null,null,null,null,null,null,null,null,null,null,null,null,41,4.92,1.23,59.668869313427045,5.8667217328356759E-3,4.0272140584418255E-2,1.3247727857577305,0.42059246237568809,0,0,0,0,2.1566999999999996E-2,0.5195519999999999,4.8299411219313797E-2,0.47520000000000007,1.0646184112193138,0.1150100968844221,0.14135706064453324,1.3209855687482692,1.7415780311239573,95.492994541472413,63.550033172453794,0.21029623118784405,1.3209855687482692,3.4831560622479145]
[null,null,null,null,null,null,null,null,null,null,null,null,null,null,null,null,null,null,42,5.04,1.26,60.078402733955272,5.8769600683488826E-3,4.0354057506859414E-2,1.3526725153873342,0.42150641723716037,0,0,0,0,2.2029E-2,0.53222400000000003,4.9537991060187948E-2,0.47520000000000007,1.078990991060188,0.1150100968844221,0.14767348899117297,1.3416745769357832,1.7631809941729435,95.54337909676012,63.997178004337457,0.21075320861858018,1.3416745769357832,3.526361988345887]
[null,null,null,null,null,null,null,null,null,null,null,null,null,null,null,null,null,null,43,5.16,1.29,60.491664960019868,5.8872916240004973E-3,4.0436720283627985E-2,1.3806603253097041,0.42244498062426938,0,0,0,0,2.2491000000000004E-2,0.54489600000000005,5.0780018408348608E-2,0.47520000000000007,1.0933670184083488,0.1150100968844221,0.15416280715143205,1.362539922444203,1.7849849030684724,95.59099526073139,64.448133957614502,0.21122249031213469,1.362539922444203,3.5699698061369447]
[null,null,null,null,null,null,null,null,null,null,null,null,null,null,null,null,null,null,44,5.28,1.32,60.908683093844274,5.8977170773461072E-3,4.0520134335846211E-2,1.4087309657575848,0.42340830959510889,0,0,0,0,2.2953000000000001E-2,0.55756800000000006,5.2025536837574611E-2,0.47520000000000007,1.1077465368375747,0.1150100968844221,0.16082627174711878,1.3835829054691156,1.8069912150642244,95.636023864475277,64.902929132990948,0.21170415479755444,1.3835829054691156,3.6139824301284489]
[null,null,null,null,null,null,null,null,null,null,null,null,null,null,null,null,null,null,45,5.4,1.35,61.329484667697692,5.9082371166924424E-3,4.0604305170656239E-2,1.4368795822490825,0.42439656369989931,0,0,0,0,2.3414999999999998E-2,0.57024000000000008,5.3274590371363305E-2,0.47520000000000007,1.1221295903713635,0.1150100968844221,0.16766515933954729,1.4048048465953329,1.8292014102952323,95.678630001627354,65.361592071838572,0.21219828184994965,1.4048048465953329,3.6584028205904646]
[null,null,null,null,null,null,null,null,null,null,null,null,null,null,null,null,null,null,46,5.52,1.38,61.75409764973184,5.9188524412432967E-3,4.0689238382387617E-2,1.4651016803909198,0.42540990501481163,0,0,0,0,2.3876999999999999E-2,0.58291199999999999,5.4527223491444586E-2,0.47520000000000007,1.1365162234914448,0.1150100968844221,0.17468076670016044,1.4262070870760273,1.851616992090839,95.718964698061043,65.824151762227658,0.21270495250740581,1.4262070870760273,3.7032339841816779]
[null,null,null,null,null,null,null,null,null,null,null,null,null,null,null,null,null,null,47,5.64,1.41,62.182550449945516,5.9295637612486376E-3,4.0774939653750363E-2,1.4933930942268006,0.42644849817653191,0,0,0,0,2.4339E-2,0.595584,5.5783481146438982E-2,0.47520000000000007,1.1509064811464391,0.1150100968844221,0.18187441108708466,1.4477909891179459,1.8742394872944779,95.757166373325916,66.29063764509138,0.21322424908826595,1.4477909891179459,3.7484789745889557]
[null,null,null,null,null,null,null,null,null,null,null,null,null,null,null,null,null,null,48,5.76,1.44,62.614871926279697,5.9403717981569926E-3,4.0861414757054106E-2,1.5217499577408562,0.42751251041758331,0,0,0,0,2.4800999999999993E-2,0.60825599999999991,5.7043408760664223E-2,0.47520000000000007,1.1653004087606642,0.1150100968844221,0.18924743052773693,1.4695579361728233,1.8970704465904067,95.793362123517198,66.761079620523901,0.21375625520879166,1.4695579361728233,3.7941408931808134]
[null,null,null,null,null,null,null,null,null,null,null,null,null,null,null,null,null,null,49,5.88,1.47,63.051091390845997,5.9512772847711507E-3,4.0948669555453975E-2,1.550168679171495,0.42860211160241951,0,0,0,0,2.5262999999999997E-2,0.62092800000000004,5.8307052243093113E-2,0.47520000000000007,1.1796980522430931,0.1150100968844221,0.19680118410761124,1.4915093332351264,1.9201114448375458,95.827668850521789,67.235508054215515,0.21430105580120976,1.4915093332351264,3.8402228896750916]
[null,null,null,null,null,null,null,null,null,null,null,null,null,null,null,null,null,null,50,6,1.5,63.491238616291064,5.9622809654072762E-3,4.1036710004223632E-2,1.5786459178309422,0.42971747426430662,0,0,0,0,2.5725000000000001E-2,0.63360000000000005,5.9574457996467246E-2,0.47520000000000007,1.1940994579964674,0.1150100968844221,0.20453705226536986,1.5136466071462593,1.9433640814105659,95.860194258680892,67.713953784027254,0.21485873713215331,1.5136466071462593,3.8867281628211319]
[null,null,null,null,null,null,null,null,null,null,null,null,null,null,null,null,null,null,51,6.12,1.53,63.935343842299751,5.9733835960574938E-3,4.1125542152056015E-2,1.6071785631610127,0.43085877364300956,0,0,0,0,2.6186999999999998E-2,0.64627200000000007,6.0845672926569658E-2,0.47520000000000007,1.2085046729265696,0.1150100968844221,0.21245643709437212,1.5359712069053639,1.9668299805483735,95.891037736679792,68.196448126708191,0.21542938682150478,1.5359712069053639,3.9336599610967466]
[null,null,null,null,null,null,null,null,null,null,null,null,null,null,null,null,null,null,52,6.24,1.56,64.383437782240222,5.9845859445560061E-3,4.1215172142392606E-2,1.6357637157866958,0.43202618772330026,0,0,0,0,2.6648999999999999E-2,0.65894399999999997,6.2120744451661256E-2,0.47520000000000007,1.2229137444516613,0.1150100968844221,0.22056076265077826,1.5584846039868616,1.9905107917101619,95.920291139791942,68.683022884758287,0.21601309386165013,1.5584846039868616,3.9810215834203238]
[null,null,null,null,null,null,null,null,null,null,null,null,null,null,null,null,null,null,53,6.36,1.59,64.835551629953628,5.995888790748841E-3,4.1305606214781486E-2,1.6643986703564437,0.43321989727430449,0,0,0,0,2.7111E-2,0.67161599999999999,6.3399720512084146E-2,0.47520000000000007,1.2373267205120841,0.1150100968844221,0.22885147526836291,1.5811882926648693,2.0144081899391737,95.94803948536827,69.173710353440029,0.21660994863715224,1.5811882926648693,4.0288163798783474]
[null,null,null,null,null,null,null,null,null,null,null,null,null,null,null,null,null,null,54,6.48,1.62,65.291717066691817,6.0072929266672959E-3,4.1396850706265038E-2,1.6930808999821296,0.43444008588970551,0,0,0,0,2.7573E-2,0.68428800000000012,6.4682649580036791E-2,0.47520000000000007,1.2517436495800369,0.1150100968844221,0.23733004388018628,1.6040837903446452,2.0385238762343505,95.974361572591036,69.668543327941663,0.21722004294485275,1.6040837903446452,4.0770477524687019]
[null,null,null,null,null,null,null,null,null,null,null,null,null,null,null,null,null,null,55,6.6,1.65,65.751966268205976,6.0187991567051489E-3,4.1488912052797908E-2,1.7218080421127953,0.43568694002882313,0,0,0,0,2.803499999999999E-2,0.69695999999999991,6.5969580669524686E-2,0.47520000000000007,1.2661645806695248,0.1150100968844221,0.24599796034726665,1.6271726379012135,2.0628595779300367,95.999330535940672,70.167555110695943,0.21784347001441157,1.6271726379012135,4.1257191558600734]
[null,null,null,null,null,null,null,null,null,null,null,null,null,null,null,null,null,null,56,6.72,1.68,66.216331911989585,6.0304082977997399E-3,4.1581796790695728E-2,1.7505778856949774,0.43696064905858695,0,0,0,0,2.8496999999999998E-2,0.70963200000000004,6.7260563346491373E-2,0.47520000000000007,1.2805895633464914,0.1150100968844221,0.25485673979440704,1.6504564000253206,2.0874170490839075,96.023014340500225,70.670779518857103,0.21848032452929347,1.6504564000253206,4.1748340981678149]
[null,null,null,null,null,null,null,null,null,null,null,null,null,null,null,null,null,null,57,6.84,1.71,66.684847184678929,6.0421211796169725E-3,4.1675511558115406E-2,1.7793883594888154,0.43826140529642266,0,0,0,0,2.8959000000000002E-2,0.72230400000000006,6.8555647739133974E-2,0.47520000000000007,1.2950186477391341,0.1150100968844221,0.26390792095333027,1.6739366655768864,2.1121980708733092,96.045476226103617,71.178250891939882,0.21913070264821133,1.6739366655768864,4.2243961417466185]
[null,null,null,null,null,null,null,null,null,null,null,null,null,null,null,null,null,null,58,6.96,1.74,67.157545789614872,6.0539386447403722E-3,4.1770063096567722E-2,1.8082375214236368,0.43958940405407204,0,0,0,0,2.9420999999999999E-2,0.73497600000000007,6.9854884548407783E-2,0.47520000000000007,1.309451884548408,0.1150100968844221,0.27315306651328325,1.6976150479461134,2.1372044520001854,96.066775106385663,71.690004099624105,0.21979470202703602,1.6976150479461134,4.2744089040003708]
[null,null,null,null,null,null,null,null,null,null,null,null,null,null,null,null,null,null,59,7.08,1.77,67.634461954569034,6.0658615488642263E-3,4.1865458252462677E-2,1.8371235488894855,0.44094484368236742,0,0,0,0,2.9883E-2,0.74764799999999998,7.1158325058724908E-2,0.47520000000000007,1.3238893250587249,0.1150100968844221,0.28259376347927434,1.7214931854224214,2.1624380291047887,96.08696592798546,72.206074549728243,0.22047242184118371,1.7214931854224214,4.3248760582095773]
[null,null,null,null,null,null,null,null,null,null,null,null,null,null,null,null,null,null,60,7.2,1.8,68.115630439638451,6.0778907609909619E-3,4.1961703978688689E-2,1.8660447298723302,0.44232792561698026,0,0,0,0,3.0345E-2,0.76032,7.2466021148851645E-2,0.47520000000000007,1.3383310211488517,0.1150100968844221,0.29223162353811172,1.7455727415713855,2.1879006671883658,96.106099994467286,72.726498196356204,0.22116396280849013,1.7455727415713855,4.3758013343767317]
[null,null,null,null,null,null,null,null,null,null,null,null,null,null,null,null,null,null,61,7.32,1.83,68.601086545312029,6.0900271636328005E-3,4.2058807336226044E-2,1.8949994548506599,0.44373885442516747,0,0,0,0,3.0807000000000001E-2,0.77299200000000012,7.3778025303009406E-2,0.47520000000000007,1.3527770253030096,0.1150100968844221,0.30206828343241776,1.7698554056198494,2.2135942600450171,96.124225258935269,73.251311548220542,0.22186942721258374,1.7698554056198494,4.4271885200900343]
[null,null,null,null,null,null,null,null,null,null,null,null,null,null,null,null,null,null,62,7.44,1.86,69.090866120713045,6.1022716530178258E-3,4.2156775495795634E-2,1.923986209379968,0.44517783785353626,0,0,0,0,3.1268999999999998E-2,0.78566400000000003,7.5094390622184426E-2,0.47520000000000007,1.3672273906221846,0.1150100968844221,0.31210540534279663,1.7943428928494032,2.2395207307029397,96.141386588814058,73.780551677146605,0.22258891892676813,1.7943428928494032,4.4790414614058793]
[null,null,null,null,null,null,null,null,null,null,null,null,null,null,null,null,null,null,63,7.56,1.89,69.585005572021316,6.114625139300534E-3,4.2255615739543569E-2,1.9530035672994295,0.44664508687685112,0,0,0,0,3.1730999999999995E-2,0.79833599999999993,7.6415170835651455E-2,0.47520000000000007,1.3816821708356515,0.1150100968844221,0.32234467727833871,1.8190369449984123,2.2656820318752633,96.157626005834217,74.314256226761458,0.22332254343842556,1.8190369449984123,4.5313640637505266]
[null,null,null,null,null,null,null,null,null,null,null,null,null,null,null,null,null,null,64,7.68,1.92,70.083541871079291,6.1270885467769824E-3,4.2355335462762642E-2,1.9820501845019711,0.44814081574790643,0,0,0,0,3.2192999999999999E-2,0.81100799999999995,7.7740420312716746E-2,0.47520000000000007,1.3961414203127167,0.1150100968844221,0.33278781347565189,1.8439393306727907,2.2920801464206972,96.172982903887885,74.852463421371795,0.22407040787395321,1.8439393306727907,4.5841602928413945]
[null,null,null,null,null,null,null,null,null,null,null,null,null,null,null,null,null,null,65,{"$f":"I.load_nph*S292/100","v":7.8},{"$f":"T292/PH","v":1.95},{"$f":"-(T_AMB+THETA_JA_EFF*PH_NEW*(V.supply_typ*U292*TRF/2*f.sw+0.25+U292^2*R_HSLS*0.85))/(THETA_JA_EFF*PH_NEW*U292^2*R_HSLS*0.006-1)","v":70.586512564186251},{"$f":"R.dcr_25*(1+0.005*(V292-25))","v":6.1396628141046558E-3},{"$f":"R_HSLS*(1+0.006*(V292-25))","v":4.2455942175651365E-2},{"$f":"SQRT((T292/PH)^2+(IPKPK_EFF^2)/12)","v":2.0111247932150551},{"$f":"PH_NEW*(PCORE+Y292^2*W292)","v":0.44966524204848862},0,{"$f":"AA292^2/CIN_ESR","v":0},0,0,{"$f":"PH_NEW*IF(AND(FPWM=0,(U292-IPKPK_EFF/2)<0),(U292+IPKPK_EFF/2)*TDHL*0.7*f.sw,(U292-IPKPK_EFF/2)*TDLH*0.7*f.sw+(U292+IPKPK_EFF/2)*TDHL*0.7*f.sw )","v":3.2654999999999997E-2},{"$f":"PH_NEW*IF(AND(FPWM=0,(U292-IPKPK_EFF/2)<0),f.sw*V.supply_typ*(U292+IPKPK_EFF/2)*TF/2,f.sw*V.supply_typ*(U292+IPKPK_EFF/2)*TF/2+f.sw*V.supply_typ*(U292-IPKPK_EFF/2)*TR/2)","v":0.82368000000000008},{"$f":"IF(AND(FPWM=0,(U292-IPKPK_EFF/2)<0),0,PH_NEW*V.supply_typ*(0.000000004*(V292+275)/300*U292/6)*f.sw/2)","v":7.907019407468581E-2},{"$f":"PH_NEW*(0.000000000125+0.00000000025)/2*V.supply_typ^2*f.sw","v":0.47520000000000007},1.410605194074686,{"$f":"V.supply_typ*(0.0045+1/R.t_calc*2)","v":0.1150100968844221},{"$f":"PH_NEW*(Y292^2*X292)","v":0.34343655480661028},1.8690518457657184,2.3187170878142069,{"$f":"100*V.load*U292*PH_NEW/(V.load*U292*PH_NEW+AM292)","v":96.187494247097831},{"$f":"T_AMB+THETA_JA_EFF*AL292","v":75.395212075035147},{"$f":"Z292/PH_NEW","v":0.22483262102424431},1.8690518457657184,{"$f":"(Z292+AI292+AJ292+AK292)*PH/PH_NEW","v":4.6374341756284139}]
[null,null,null,null,null,null,null,null,null,null,null,null,null,null,null,null,null,null,66,7.92,1.98,71.093955781084787,6.1523488945271201E-3,4.2557443505111495E-2,2.0402261967449338,0.45121858674145371,0,0,0,0,3.3117000000000001E-2,0.8363520000000001,8.0404547807061605E-2,0.47520000000000007,{"$f":"AE293+AF293+AG293+AH293","v":1.4250735478070617},0.1150100968844221,0.35429266919502383,1.8943763138865077,{"$f":"AL293+Z293+AB293+AD293","v":2.3455949006279613},96.201194750163296,75.942541600828818,0.22560929337072685,{"$f":"AL293","v":1.8943763138865077},4.6911898012559226]
[null,null,null,null,null,null,null,null,null,null,null,null,null,null,null,null,null,null,67,8.0399999999999991,2.0099999999999998,71.605910244144141,6.1651477561036044E-3,4.2659847196584937E-2,2.0693532646419501,0.45280107422394433,0,0,0,0,3.3578999999999998E-2,0.849024,8.1743537871978939E-2,0.47520000000000007,1.4395465378719789,0.1150100968844221,0.36535795204243149,{"$f":"AI294+AJ294+AK294","v":1.9199145867988325},2.3727156610227769,96.214117042803665,76.494492020321246,0.22640053711197217,1.9199145867988325,4.7454313220455537]
[null,null,null,null,null,null,null,null,null,null,null,null,null,null,null,null,null,null,68,8.16,2.04,72.122415277744764,6.1780603819436199E-3,4.2763161115930898E-2,2.0985049282487513,0.45441293238177421,0,0,0,0,3.4041000000000002E-2,0.86169600000000002,8.3087221320880991E-2,0.47520000000000007,1.4540242213208812,0.1150100968844221,0.37663422666322821,1.9456685448685316,2.4000814772503056,96.226291819910927,77.051103973250164,0.22720646619088711,1.9456685448685316,4.8001629545006113]
[null,null,null,null,null,null,null,null,null,null,null,null,null,null,null,null,null,null,69,8.2799999999999994,2.0699999999999998,72.643510817869029,6.191087770446726E-3,4.2867393251344262E-2,2.127680176597107,0.45605439264500586,0,0,0,0,3.4502999999999992E-2,0.87436799999999992,8.4435655907444021E-2,0.47520000000000007,1.468506655907444,0.1150100968844221,0.38812334472934479,1.9716400975212109,2.4276944901662167,96.237747978836907,77.61241872741266,0.22802719632250293,1.9716400975212109,4.8553889803324335]
[null,null,null,null,null,null,null,null,null,null,null,null,null,null,null,null,null,null,70,8.4,2.1,73.169237421902608,6.2042309355475654E-3,4.2972551715316075E-2,2.1568780526224232,0.4577256900447505,0,0,0,0,3.4964999999999996E-2,0.88704000000000005,8.5788900100756807E-2,0.47520000000000007,1.482993900100757,0.1150100968844221,0.39982718672470174,1.9978311837098808,2.4555568737546314,96.248512745081811,78.178478188772004,0.22886284502237525,1.9978311837098808,4.9111137475092628]
[null,null,null,null,null,null,null,null,null,null,null,null,null,null,null,null,null,null,71,8.52,2.13,73.699636278651795,6.2174909069662955E-3,4.3078644746637335E-2,2.1860976496680782,0.45942706327121802,0,0,0,0,3.5427E-2,0.89971200000000007,8.7147013098760662E-2,0.47520000000000007,1.4974860130987608,0.1150100968844221,0.41174766240966809,2.0242437723928512,2.4836708356640691,96.258611787509452,78.749324911786346,0.22971353163560901,2.0242437723928512,4.9673416713281382]
[null,null,null,null,null,null,null,null,null,null,null,null,null,null,null,null,null,null,72,8.64,2.16,74.234749218581442,6.2308687304645366E-3,4.3185680712446758E-2,2.2153381082544259,0.46115875473304674,0,0,0,0,3.5889000000000004E-2,0.91238400000000019,8.8510054841957286E-2,0.47520000000000007,1.5119830548419575,0.1150100968844221,0.42388671129575956,2.0508798630221392,2.5120386177551861,96.268069324091783,79.325002109964402,0.23057937736652337,2.0508798630221392,5.0240772355103722]
[null,null,null,null,null,null,null,null,null,null,null,null,null,null,null,null,null,null,73,8.76,2.19,74.774618724279236,6.2443654681069802E-3,4.3293668110323966E-2,2.2445986130897206,0.4629210106179435,0,0,0,0,3.6350999999999994E-2,0.92505599999999999,8.9878086027390794E-2,0.47520000000000007,1.5264850860273909,0.1150100968844221,0.43624630313081891,2.077741486042632,2.5406624966605755,96.276908219077001,79.905553666653788,0.23146050530897175,2.077741486042632,5.0813249933211502]
[null,null,null,null,null,null,null,null,null,null,null,null,null,null,null,null,null,null,74,8.8800000000000008,2.2200000000000002,75.319287941151231,6.2579821985287807E-3,4.3402615570428779E-2,2.2738783903024142,0.46471408095466549,0,0,0,0,3.6812999999999999E-2,0.93772800000000012,9.1251168122911105E-2,0.47520000000000007,1.5409921681229113,0.1150100968844221,0.44882843839493153,2.1048307034022651,2.5695447843569306,96.285150072379764,80.491024146067261,0.23235704047733274,2.1048307034022651,5.1390895687138611]
[null,null,null,null,null,null,null,null,null,null,null,null,null,null,null,null,null,null,75,9,2.25,75.868800688354611,6.2717200172088651E-3,4.3512531857688136E-2,2.3031767048761798,0.46653821967637477,0,0,0,0,3.7275000000000003E-2,0.95040000000000002,9.2629363381725616E-2,0.47520000000000007,1.5555043633817258,0.1150100968844221,0.4616351488073272,2.1321496090734753,2.59868782874985,96.292815301909215,81.081458804552796,0.23326910983818738,2.1321496090734753,5.1973756574996992]
[null,null,null,null,null,null,null,null,null,null,null,null,null,null,null,null,null,null,76,9.1199999999999992,2.2799999999999998,76.423201469972938,6.285580036749323E-3,4.3623425874031341E-2,2.3324928582708022,0.46839368468539999,0,0,0,0,3.7736999999999993E-2,0.96307199999999993,9.4012734857247135E-2,0.47520000000000007,1.5700217348572469,0.1150100968844221,0.47466849784453824,2.1597003295862072,2.6280940142716069,96.299923219474891,81.676903602113157,0.2341968423427,2.1597003295862072,5.2561880285432148]
[null,null,null,null,null,null,null,null,null,null,null,null,null,null,null,null,null,null,77,9.24,2.31,76.982535486440241,6.2995633871610057E-3,4.3735306660675217E-2,2.3618261862136039,0.47028073791943875,0,0,0,0,3.8198999999999997E-2,0.97574400000000006,9.540134641824477E-2,0.47520000000000007,1.5845443464182449,0.1150100968844221,0.48793058127008232,2.1874850245727493,2.657765762492188,96.30649210084627,82.277405214181471,0.23514036895971938,2.1874850245727493,5.315531524984376]
[null,null,null,null,null,null,null,null,null,null,null,null,null,null,null,null,null,null,78,9.36,2.34,77.546848646219416,6.3136712161554857E-3,4.3848183400460046E-2,2.3911760566475015,0.47219964541923476,0,0,0,0,3.8661000000000001E-2,0.98841599999999996,9.6795262764306014E-2,0.47520000000000007,1.5990722627643061,0.1150100968844221,0.50142352767595011,2.2155058873246785,2.6877055327439132,96.312539250482388,82.883011043658016,0.23609982270961738,2.2155058873246785,5.3754110654878264]
[null,null,null,null,null,null,null,null,null,null,null,null,null,null,null,null,null,null,79,9.48,2.37,78.116187577741798,6.3279046894435453E-3,4.3962065420237811E-2,2.4205418678230495,0.47415067739776751,0,0,0,0,3.9123000000000005E-2,1.0010880000000002,9.8194549441618428E-2,0.47520000000000007,1.6136055494416186,0.1150100968844221,0.51514949903619034,2.2437651453622309,2.7179158227599984,96.318081061397294,83.493769233216113,0.23707533869888375,2.2437651453622309,5.4358316455199969]
[null,null,null,null,null,null,null,null,null,null,null,null,null,null,null,null,null,null,80,9.6,2.4,78.690599641613701,6.3422649910403429E-3,4.4076962193313793E-2,2.4499230465229509,0.47613410831098946,0,0,0,0,3.9584999999999988E-2,1.01376,9.9599272859078422E-2,0.47520000000000007,1.6281442728590785,0.1150100968844221,0.52911069127287969,2.2722650610163804,2.7483991693273699,96.323133070580639,84.109728677882202,0.23806705415549473,2.2722650610163804,5.496798338654739]
[null,null,null,null,null,null,null,null,null,null,null,null,null,null,null,null,null,null,81,9.7200000000000006,2.4300000000000002,79.270132943096897,6.3567533235774224E-3,4.4192883341942969E-2,2.4793190464085693,0.47815021693015131,0,0,0,0,4.0046999999999999E-2,1.026432,0.10100950030473581,0.47520000000000007,1.6426885003047358,0.1150100968844221,0.5433093348347936,2.3010079320239516,2.7791581489541031,96.327710010351751,84.73093903789794,0.23907510846507565,2.3010079320239516,5.5583162979082053]
[null,null,null,null,null,null,null,null,null,null,null,null,null,null,null,null,null,null,82,9.84,2.46,79.854836344869639,6.3713709086217407E-3,4.4309838639882561E-2,2.5087293464788698,0.48019928641575177,0,0,0,0,4.0509000000000003E-2,1.039104,0.10242529996258316,0.47520000000000007,1.6572382999625832,0.1150100968844221,0.55774769528908286,2.329996092136088,2.8101953785518399,96.331825855989663,85.3574507518708,0.24009964320787588,2.329996092136088,5.6203907571036797]
[null,null,null,null,null,null,null,null,null,null,null,null,null,null,null,null,null,null,83,9.9600000000000009,2.4900000000000002,80.444759480075263,6.3861189870018818E-3,4.4427838015002059E-2,2.5381534496330787,0.48228160439315498,0,0,0,0,4.0971E-2,1.0517760000000003,0.10384674092969881,0.47520000000000007,1.6717937409296992,0.1150100968844221,0.5724280739262857,2.359231911740407,2.8415135161335621,96.335493869948337,85.989315050220483,0.24114080219657749,2.359231911740407,5.6830270322671232]
[null,null,null,null,null,null,null,null,null,null,null,null,null,null,null,null,null,null,84,10.08,2.52,81.039952765665461,6.4009988191416371E-3,4.4546891551952239E-2,2.5675908813290911,0.48439746302991515,0,0,0,0,4.1432999999999998E-2,1.0644480000000001,0.10527389323375198,0.47520000000000007,1.6863548932337522,0.1150100968844221,0.58735280837900372,2.3887177984971779,2.8731152615270932,96.338726642937701,86.626583968928443,0.24219873151495758,2.3887177984971779,5.7462305230541864]
[null,null,null,null,null,null,null,null,null,null,null,null,null,null,null,null,null,null,85,10.199999999999999,2.5499999999999998,81.640467416045823,6.4160116854011465E-3,4.466700949489457E-2,2.5970411883303464,0.48654715911485247,0,0,0,0,4.1894999999999988E-2,1.0771200000000001,0.10670682785088088,0.47520000000000007,1.7009218278508811,0.1150100968844221,0.60252427325458724,2.4184561979898902,2.9050033571047429,96.341536132124816,87.269310363598407,0.24327357955742623,2.4184561979898902,5.8100067142094858]
[null,null,null,null,null,null,null,null,null,null,null,null,null,null,null,null,null,null,86,10.32,2.58,82.246355457031058,6.4311588864257767E-3,4.4788202250292647E-2,2.6265039375345123,0.48873099413892407,0,0,0,0,4.2356999999999999E-2,1.0897920000000001,0.10814561672395248,0.47520000000000007,1.7154946167239526,0.1150100968844221,0.61794488078218424,2.4484495943905591,2.937180588529483,96.343933696686307,87.9175479238354,0.24436549706946203,2.4484495943905591,5.8743611770589661]
[null,null,null,null,null,null,null,null,null,null,null,null,null,null,null,null,null,null,87,10.44,2.61,82.857669740117629,6.4464417435029413E-3,4.4910480389767041E-2,2.6559787148778691,0.49094927437793506,0,0,0,0,4.2818999999999996E-2,1.1024639999999999,0.10959033278121362,0.47520000000000007,1.7300733327812134,0.1150100968844221,0.63361708147451135,2.478700511140147,2.9696497855180821,96.345930130921687,88.571351187951478,0.24547463718896753,2.478700511140147,5.9392995710361633]
[null,null,null,null,null,null,null,null,null,null,null,null,null,null,null,null,null,null,88,10.56,2.64,83.474463957082477,6.4618615989270626E-3,4.5033854653015432E-2,2.6854651243098089,0.49320231097713713,0,0,0,0,4.3281E-2,1.1151360000000001,0.1110410499553459,0.47520000000000007,1.7446580499553459,0.1150100968844221,0.64954336480472685,2.5092115116444949,3.0024138226216319,96.34753569511922,89.230775558006712,0.24660115548856856,2.5092115116444949,6.0048276452432638]
[null,null,null,null,null,null,null,null,null,null,null,null,null,null,null,null,null,null,89,10.68,2.67,84.096792654915177,6.4774198163728789E-3,4.5158335950799419E-2,2.7149627868323161,0.49549042003776222,0,0,0,0,4.3742999999999997E-2,1.1278079999999999,0.11249784320293182,0.47520000000000007,1.7592488432029318,0.1150100968844221,0.66572625989878842,2.5399851999861425,3.0354756200239046,96.348760144348319,89.895877315193459,0.24774521001888111,2.5399851999861425,6.0709512400478092]
[null,null,null,null,null,null,null,null,null,null,null,null,null,null,null,null,null,null,90,10.8,2.7,84.724711251093169,6.4931177812773289E-3,4.528393536799992E-2,2.7444713395997229,0.49781392270554181,0,0,0,0,4.4205000000000008E-2,1.1404800000000002,0.11396078852434632,0.47520000000000007,1.7738457885243466,0.1150100968844221,0.68216833624369289,2.5710242216524617,3.0688381443580033,96.349612755337048,90.566713635573279,0.24890696135277091,2.5710242216524617,6.1376762887160066]
[null,null,null,null,null,null,null,null,null,null,null,null,null,null,null,null,null,null,91,10.92,2.73,85.358276049207987,6.5089569012301996E-3,4.5410664166742838E-2,2.7739904350744067,0.50017314526126166,0,0,0,0,4.4666999999999998E-2,1.153152,0.1154299629840823,0.47520000000000007,1.7884489629840823,0.1150100968844221,0.69887220441200792,2.6023312642805125,3.1025044095417744,96.350102351580219,91.243342606175304,0.25008657263063083,2.6023312642805125,6.205008819083548]
[null,null,null,null,null,null,null,null,null,null,null,null,null,null,null,null,null,null,92,11.04,2.76,85.997544254952047,6.5249386063738011E-3,4.553853378959679E-2,2.8035197402344605,0.50256841921340645,0,0,0,0,4.5128999999999989E-2,1.165824,0.11690544473152369,0.47520000000000007,1.8030584447315237,0.1150100968844221,0.71584051680311767,2.6339090584190634,3.1364774776324698,96.350237326810571,91.925823241465537,0.25128420960670322,2.6339090584190634,6.2729549552649395]
[null,null,null,null,null,null,null,null,null,null,null,null,null,null,null,null,null,null,93,11.16,2.79,86.642573992475477,6.541064349811887E-3,4.5667555862844919E-2,2.8330589358296625,0.50500008139294639,0,0,0,0,4.5591E-2,1.178496,0.11838731302217678,0.47520000000000007,1.8176743130221769,0.1150100968844221,0.73307596840161671,2.6657603783082156,3.170760459701162,96.350025666953783,92.614215500196565,0.25250004069647319,2.6657603783082156,6.3415209194023241]
[null,null,null,null,null,null,null,null,null,null,null,null,null,null,null,null,null,null,94,11.28,2.82,87.293424321122117,6.5573356080280533E-3,4.5797742199832459E-2,2.8626077156823806,0.50746847405032403,0,0,0,0,4.605299999999999E-2,1.1911679999999998,0.11987564823937288,0.47520000000000007,1.8322966482393725,0.1150100968844221,0.7505812975532955,2.6978880426770901,3.2053565167274143,96.349474970679296,93.308580302647812,0.25373423702516201,2.6978880426770901,6.4107130334548277]
[null,null,null,null,null,null,null,null,null,null,null,null,null,null,null,null,null,null,95,11.4,2.85,87.95015525255512,6.5737538813138777E-3,4.592910480439235E-2,2.8921657860303061,0.50997394495469794,0,0,0,0,4.6514999999999994E-2,1.20384,0.12137053191645443,0.47520000000000007,1.8469255319164546,0.1150100968844221,0.76835928675919152,2.7302949155600684,3.2402688605147665,96.348592468648107,94.008979548266552,0.25498697247734897,2.7302949155600684,6.480537721029533]
[null,null,null,null,null,null,null,null,null,null,null,null,null,null,null,null,null,null,96,11.52,2.88,88.612827768282457,6.5903206942070618E-3,4.6061655874350703E-2,2.9217328649081349,0.51251684749550175,0,0,0,0,4.6976999999999991E-2,1.216512,0.12287204675945802,0.47520000000000007,1.8615610467594581,0.1150100968844221,0.78641276348816236,2.7629839071320426,3.2755007546275445,96.347385041551036,94.715476133719989,0.25625842374775087,2.7629839071320426,6.5510015092550882]
[null,null,null,null,null,null,null,null,null,null,null,null,null,null,null,null,null,null,97,{"$f":"I.load_nph*S324/100","v":11.64},{"$f":"T324/PH","v":2.91},{"$f":"-(T_AMB+THETA_JA_EFF*PH_NEW*(V.supply_typ*U324*TRF/2*f.sw+0.25+U324^2*R_HSLS*0.85))/(THETA_JA_EFF*PH_NEW*U324^2*R_HSLS*0.006-1)","v":89.281503837592211},{"$f":"R.dcr_25*(1+0.005*(V324-25))","v":6.6070375959398058E-3},4.6195407805114386E-2,2.9513086815655694,{"$f":"PH_NEW*(PCORE+Y324^2*W324)","v":0.51509754078638137},0,{"$f":"AA324^2/CIN_ESR","v":0},0,0,4.7439000000000009E-2,1.2291840000000003,0.12438027667030749,0.47520000000000007,1.8762032766703078,0.1150100968844221,0.80474460100849021,2.7959579745632199,3.3110555153496013,{"$f":"100*V.load*U324*PH_NEW/(V.load*U324*PH_NEW+AM324)","v":96.345859237023546},95.428133971369874,0.25754877039319068,2.7959579745632199,6.6221110306992035]
[null,null,null,null,null,null,null,null,null,null,null,null,null,null,null,null,null,null,98,11.76,2.94,89.956246435909549,6.6239061608977393E-3,4.6330373193342815E-2,2.9808929759191787,0.51771638977157308,0,0,0,0,4.7900999999999999E-2,1.2418560000000003,0.12589530677053137,0.47520000000000007,1.8908523067705316,0.1150100968844221,0.82335771923900902,2.8292201228939624,3.3469365126655353,96.344021285515666,96.147018008180083,0.25885819488578654,2.8292201228939624,6.6938730253310714]
[null,null,null,null,null,null,null,null,null,null,null,null,null,null,null,null,null,null,99,11.88,2.97,90.637119563585799,6.6409279890896449E-3,4.6466564840706256E-2,3.0104854980358731,0.52037376533478719,0,0,0,0,4.8362999999999996E-2,1.2545280000000001,0.12741722342551837,0.47520000000000007,1.9055082234255185,0.1150100968844221,0.84225508562028517,2.8627734059302257,3.383147171265013,96.341877115189504,96.872194245069451,0.26018688266739359,2.8627734059302257,6.7662943425300259]
[null,null,null,null,null,null,null,null,null,null,null,null,null,null,null,null,null,null,100,12,3,91.324188265131596,6.6581047066282895E-3,4.6603995757732955E-2,3.0400860076458853,0.52307004441066463,0,0,0,0,4.8825E-2,1.2672000000000001,0.12894611426932634,0.47520000000000007,1.9201711142693263,0.1150100968844221,0.86143971600638058,2.8966209271601291,3.4196909715707937,96.339432365911534,97.603729756721378,0.26153502220533231,2.8966209271601291,6.8393819431415874]
[]
[]
[]
[]
[]
[]
[]
[]
[]
[]
[]
[]
[]
[]
[]
[]
[null,null,null,null,null,null,null,null,null,null,null,null,null,null,null,null,null,null,null,null,null,null,null,null,null,null,null,null,null,null,null,null,null,null,null,null,null,null,null,null,null,null,null,null,null,null,null,null,null,null,null,null,null,null,null,null,null,null,null,null,"R.fb_top1",{"$f":"R.fb_top1","v":50},"R.fb_buf",{"$f":"R.fb_buf","v":1000},null,null,null,null,null,"R.comp",{"$f":"R.comp","v":5600}]
[null,null,null,null,null,null,null,null,null,null,null,null,null,null,null,null,null,null,null,null,null,null,null,null,null,null,null,null,null,null,null,null,null,null,null,null,null,null,null,null,null,null,null,null,null,null,null,null,null,null,null,null,null,null,"pi",3.1415920000000002,"A_INTCOMP2VOUT",{"$f":"11*I.rated/6*PH*R.load_nph/(1+R.load_nph/Wsh/L.out)","v":44.800987349583465},null,null,"R.fb_top2",{"$f":"R.fb_top2","v":100000},"C.fb_buf",{"$f":"C.fb_buf","v":3.2000265E-10},null,null,null,null,null,"C.comp",{"$f":"C.comp","v":3.3000000000000002E-9}]
[null,null,null,null,null,null,null,null,null,null,null,null,null,null,null,null,null,null,null,null,null,null,null,null,null,null,null,null,null,null,null,null,null,null,null,null,null,null,null,null,null,null,null,null,null,null,null,null,null,null,null,null,null,null,"π",{"$f":"π","v":3.1415920000000002},"Wesr_zero",{"$f":"1/R.esr_cout/C.out","v":36630036.630036637},null,null,"R.fb_bot",{"$f":"R.fb_bot","v":5636.6197183098593},"A.fb_buf",{"$f":"A.fb_buf","v":1},null,null,null,null,null,"C.hf",{"$f":"C.hf","v":2.3000000000000001E-10}]
[null,null,null,null,null,null,null,null,null,null,null,null,null,null,null,null,null,null,null,null,null,null,null,null,null,null,null,null,null,null,null,null,null,null,null,null,null,null,null,null,null,null,null,null,null,null,null,null,null,null,null,null,null,"PM 맞추기위해 x1.5 임의로 넣음","S.slope",{"$f":"V.slope_min*f.sw*1.5","v":1056000},"Wload_pole",{"$f":"1/R.load_nph/C.out+1/Wsh/C.out/L.out","v":46767.67676767677},null,null,"C.fb_top",{"$f":"C.fb_top","v":9.9999999999999994E-12},null,null,null,null,null,null,null,"R.eaout",{"$f":"R.eaout","v":473000000}]
[null,null,null,null,null,null,null,null,null,null,null,null,null,null,null,null,null,null,null,null,null,null,null,null,null,null,null,null,null,null,null,null,null,null,null,null,null,null,null,null,null,null,null,null,null,null,null,null,null,null,null,null,null,null,"S.rise",{"$f":"(V.supply_typ-V.load)/L.out*6/11/I.rated","v":545454.54545454553},null,null,null,null,"C.fb_bot",{"$f":"C.fb_bot","v":6.0000000000000003E-12},null,null,null,null,null,null,null,"GM",{"$f":"GM","v":1E-3}]
[null,null,null,null,null,null,null,null,null,null,null,null,null,null,null,null,null,null,null,null,null,null,null,null,null,null,null,null,null,null,null,null,null,null,null,null,null,null,null,null,null,null,null,null,null,null,null,null,null,null,null,null,null,null,"S.fall",{"$f":"V.load/L.out*6/11/I.rated","v":909090.90909090906}]
[null,null,null,null,null,null,null,null,null,null,null,null,null,null,null,null,null,null,null,null,null,null,null,null,null,null,null,null,null,null,null,null,null,null,null,null,null,null,null,null,null,null,null,null,null,null,null,null,null,null,null,null,null,null,"mc",{"$f":"1+S.slope/S.rise","v":2.9359999999999999}]
[null,null,null,null,null,null,null,null,null,null,null,null,null,null,null,null,null,null,null,null,null,null,null,null,null,null,null,null,null,null,null,null,null,null,null,null,null,null,null,null,null,null,null,null,null,null,null,null,null,null,null,null,null,null,"kfactor",{"$f":"mc*(1-V.load/V.supply_typ)","v":1.101},null,null,null,null,null,null,null,null,null,null,null,null,null,null,null,null,null,null,null,null,null,null,null,null,null,{"$f":"\"Phase Margin = \"&ROUND(CD356,0)&\" °\"","v":"Phase Margin = 60 °"},null,{"$f":"\"Gain Margin = \"&-1*ROUND(CF356,1)&\" dB\"","v":"Gain Margin = 13,3 dB"}]
[null,null,null,null,null,null,null,null,null,null,null,null,null,null,null,null,null,null,null,null,null,null,null,null,null,null,null,null,null,null,null,null,null,null,null,null,null,null,null,null,null,null,null,null,null,null,null,null,null,null,null,null,null,null,"Qfactor",{"$f":"1/π/(kfactor-0.5)","v":0.52963386423676528},null,null,null,null,null,null,null,null,null,null,null,null,null,null,null,null,null,null,null,null,null,null,null,null,{"$f":"\"Crossover Frequency = \"&ROUND(CC356/1000,0)&\" kHz\"","v":"Crossover Frequency = 93 kHz"},null,{"$f":"ROUND(CC356,0)","v":93262},null,{"$f":"\"Load Pole = \"&ROUND(CG356/1000,1)&\" kHz\"","v":"Load Pole = 7,5 kHz"}]
[null,null,null,null,null,null,null,null,null,null,null,null,null,null,null,null,null,null,null,null,null,null,null,null,null,null,null,null,null,null,null,null,null,null,null,null,null,null,null,null,null,null,null,null,null,null,null,null,null,null,null,null,null,null,"Wsh",{"$f":"Qfactor*2*π*f.sw*0.5*1","v":3660565.7237936775}]
[null,null,null,null,null,null,null,null,null,null,null,null,null,null,null,null,null,null,null,null,null,null,null,null,null,null,null,null,null,null,null,null,null,null,null,null,null,null,null,null,null,null,null,null,null,null,null,null,null,null,null,null,null,null,"fsw_sh",{"$f":"f.sw*0.5*1","v":1100000},null,null,null,null,null,null,null,null,null,null,null,null,null,null,null,null,null,null,null,null,null,null,null,null,"fCROSS","PM","Find Phase Inversion","GM","fP_LOAD",null,"fZ_ESR","fZ_COMP",null,"fP_COMP"]
[null,null,null,null,null,null,null,null,null,null,null,null,null,null,null,null,null,null,null,null,null,null,null,null,null,null,null,null,null,null,null,null,null,null,null,null,null,null,null,null,null,null,null,null,null,null,null,null,null,null,null,null,null,null,null,null,null,null,null,null,null,null,null,null,null,null,null,null,null,null,null,null,null,null,null,null,null,null,null,"To find ",0,{"$f":"CC356","v":93261.97641841654},-180,{"$f":"CE356","v":333221.54933385365},-45,null,-45,-45,null,-45]
[null,null,null,null,null,null,null,null,null,null,null,null,null,null,null,null,null,null,null,null,null,null,null,null,null,null,null,null,null,null,null,null,null,null,null,null,null,null,null,null,null,null,null,null,null,null,null,null,null,null,null,null,null,null,null,null,null,null,null,null,null,null,null,null,null,null,null,null,null,null,null,null,null,null,null,null,null,null,null,"Found at",{"$f":"SUM(CC360:CC486)","v":93261.97641841654},{"$f":"180+SUM(CD360:CD486)","v":60.302088646937733},{"$f":"SUM(CE360:CE486)","v":333221.54933385365},-13.298593541528078,7463.5455396398138,22.652970800998794,5819913.9165937947,{"$f":"SUM(CJ360:CJ486)","v":9305.1052928990812},{"$f":"SUM(CK360:CK486)","v":20.611883673156168},{"$f":"MAX(CL360:CL486)","v":247137.08290965063},{"$f":"MIN(CM360:CM486)","v":-9.647384284186673}]
[null,null,null,null,null,null,null,null,null,null,null,null,null,null,null,null,null,null,null,null,null,null,null,null,null,null,null,null,null,null,null,null,null,null,null,null,null,null,null,null,null,null,null,null,null,null,null,null,null,null,null,null,null,null,null,null,null,null,null,null,null,null,null,null,null,null,null,null,{"$f":"A.comp_buffer","v":1}]
[]
[null,null,null,null,null,null,null,null,null,null,null,null,null,null,null,null,null,null,null,null,null,null,null,null,null,null,null,null,null,null,null,null,null,null,null,null,null,null,null,null,null,null,null,null,null,null,null,null,null,null,null,"Step","Freq",null,"SH_GAIN","SH_PHASE","INTCOMP2VOUT_GAIN","INTCOMP2VOUT_PHASE","ZFB_BOT","ZFB_TOP","VOUT2FB_GAIN","VOUT2FB_PHASE","FB2INTFB_GAIN","FB2INTFB_PHASE","ZCOMP1","ZCOMP2","ZCOMP_TOTAL","ZRC_FILTER","GAIN","INTFB2INTCOMP_GAIN","INTFB2INTCOMP_PHASE",null,"POWER_STAGE_GAIN","POWER_STAGE_PHASE","COMPENSATION_GAIN","COMPENSATION_PHASE","OPENLOOP_GAIN","OPENLOOP_PHASE"]
[null,null,null,null,null,null,null,null,null,null,null,null,null,null,null,null,null,null,null,null,null,null,null,null,null,null,null,null,null,null,null,null,null,null,null,null,null,null,null,null,null,null,null,null,null,null,null,null,null,null,null,1,1,null,{"$f":"20*LOG(IMABS(IMDIV(1,IMSUM(1,IMSUM(COMPLEX(0,2*pi*BA360/Wsh),COMPLEX(-BA360/(fsw_sh),0))))))","v":7.8962541068464013E-6},{"$f":"180/pi*IMARGUMENT(IMDIV(1,IMSUM(1,IMSUM(COMPLEX(0,2*pi*BA360/Wsh),COMPLEX(-BA360/(fsw_sh),0)))))","v":-9.8345543950397753E-5},{"$f":"20*LOG(IMABS(IMPRODUCT(A_INTCOMP2VOUT,IMDIV(COMPLEX(1, 2*pi*BA360/Wesr_zero),COMPLEX(1, 2*pi*BA360/Wload_pole)))))","v":33.025751628248941},{"$f":"180/pi*IMARGUMENT(IMPRODUCT(A_INTCOMP2VOUT,IMDIV(COMPLEX(1, 2*pi*BA360/Wesr_zero),COMPLEX(1, 2*pi*BA360/Wload_pole))))","v":-7.6877961437517408E-3},{"$f":"IMDIV(IMPRODUCT(COMPLEX(R.fb_bot,0),IMDIV(COMPLEX(1,0),COMPLEX(0,2*pi*BA360*C.fb_bot))),IMSUM(COMPLEX(R.fb_bot,0),IMDIV(COMPLEX(1,0),COMPLEX(0,2*pi*BA360*C.fb_bot))) )","v":"5636,6197183096-0,00119775639845346i"},{"$f":"IMSUM(COMPLEX(R.fb_top1,0),IMDIV(IMPRODUCT(COMPLEX(R.fb_top2,0),IMDIV(COMPLEX(1,0),COMPLEX(0,2*pi*BA360*C.fb_top))),IMSUM(COMPLEX(R.fb_top2,0),IMDIV(COMPLEX(1,0),COMPLEX(0,2*pi*BA360*C.fb_top))) ))","v":"100049,999996052-0,628318399975195i"},{"$f":"20*LOG(IMABS(IMDIV(BG360,IMSUM(BG360,BH360))))","v":-25.46002544110458},{"$f":"180/pi*IMARGUMENT(IMDIV(BG360,IMSUM(BG360,BH360)))","v":3.2910392515268566E-4},{"$f":"20*LOG(IMABS(IMDIV(A.fb_buf,IMSUM(COMPLEX(1,0),COMPLEX(0,2*pi*BA360*R.fb_buf*C.fb_buf)))))","v":-1.7558474511019998E-11},{"$f":"180/pi*IMARGUMENT(IMDIV(A.fb_buf,IMSUM(COMPLEX(1,0),COMPLEX(0,2*pi*BA360*R.fb_buf*C.fb_buf))))","v":-1.1520095399984471E-4},{"$f":"IMSUM(COMPLEX(R.comp,0),IMDIV(COMPLEX(1,0),COMPLEX(0,2*pi*BA360*C.comp)))","v":"5600-48228780,6676206i"},{"$f":"IMDIV(COMPLEX(1,0),COMPLEX(0,2*pi*BA360*C.hf))","v":"-691978157,404991i"},{"$f":"IMDIV(COMPLEX(1,0),IMSUM(IMDIV(COMPLEX(1,0),BM360),IMSUM(IMDIV(COMPLEX(1,0),BN360),IMDIV(COMPLEX(1,0),COMPLEX(R.eaout,0)))))","v":"4263704,79543838-44679516,6110551i"},{"$f":"IMDIV(IMDIV(COMPLEX(1,0),COMPLEX(0,2*pi*BA360*0.00000000000226)),IMSUM(COMPLEX(21700,0),IMDIV(COMPLEX(1,0),COMPLEX(0,2*pi*BA360*0.00000000000226))) )","v":"0,999999999999905-3,08139909727971E-07i"},{"$f":"GM*A.comp_buffer","v":1E-3},{"$f":"20*LOG(IMABS(IMPRODUCT(BQ360,IMPRODUCT(BO360,BP360)) ))","v":93.041539879050021},{"$f":"180/pi*IMARGUMENT(IMPRODUCT(BQ360,IMPRODUCT(BO360,BP360)) )","v":-84.548885035114395},null,{"$f":"BC360+BE360","v":33.025759524503044},{"$f":"BD360+BF360","v":-7.7861416877021382E-3},{"$f":"BI360+BK360+BR360","v":67.581514437927879},{"$f":"BJ360+BL360+BS360","v":-84.548671132143241},{"$f":"BU360+BW360","v":100.60727396243092},{"$f":"BV360+BX360","v":-84.556457273830944},{"$f":"BZ360+360","v":275.44354272616908},null,{"$f":"IF(AND(BY361<$CC$355,BY360>=$CC$355),(($CC$355-BY360)/(BY361-BY360)*(BA361-BA360)+BA360),0)","v":0},{"$f":"IF(AND(BA361>$CD$355,BA360<=$CD$355),(($CD$355-BA360)/(BA361-BA360)*(BZ361-BZ360)+BZ360),0)","v":0},{"$f":"IF(AND(BZ361<$CE$355,BZ360>=$CE$355),(($CE$355-BZ360)/(BZ361-BZ360)*(BA361-BA360)+BA360),0)","v":0},{"$f":"IF(AND(BA361>$CF$355,BA360<=$CF$355),(($CF$355-BA360)/(BA361-BA360)*(BY361-BY360)+BY360),0)","v":0},{"$f":"IF(AND(BF361<$CG$355,BF360>=$CG$355),(($CG$355-BF360)/(BF361-BF360)*(BA361-BA360)+BA360),0)","v":0},{"$f":"IF(AND(BF361<$CG$355,BF360>=$CG$355),(($CG$355-BF360)/(BF361-BF360)*(BY361-BY360)+BY360),0)","v":0},{"$f":"IF(AND(BF361>$CI$355,BF360<=$CI$355),(($CI$355-BF360)/(BF361-BF360)*(BA361-BA360)+BA360),0)","v":0},{"$f":"IF(AND(BX361>$CJ$355,BX360<=$CJ$355),(($CJ$355-BX360)/(BX361-BX360)*(BA361-BA360)+BA360),0)","v":0},{"$f":"IF(AND(BX361>$CJ$355,BX360<=$CJ$355),(($CJ$355-BX360)/(BX361-BX360)*(BY361-BY360)+BY360),0)","v":0},{"$f":"IF(AND(BX361<$CL$355,BX360>=$CL$355),(($CL$355-BX360)/(BX361-BX360)*(BA361-BA360)+BA360),0)","v":0},{"$f":"IF(AND(BX361<$CL$355,BX360>=$CL$355),(($CL$355-BX360)/(BX361-BX360)*(BY361-BY360)+BY360),0)","v":0}]
[null,null,null,null,null,null,null,null,null,null,null,null,null,null,null,null,null,null,null,null,null,null,null,null,null,null,null,null,null,null,null,null,null,null,null,null,null,null,null,null,null,null,null,null,null,null,null,null,null,null,null,2,1.5,null,1.184437421183393E-5,-1.4751838297928763E-4,33.025751530263491,-1.1531694128790624E-2,"5636,61971830929-0,00179663459768009i","100049,999991117-0,942477599916286i",{"$f":"20*LOG(IMABS(IMDIV(BG361,IMSUM(BG361,BH361))))","v":-25.460025440891766},4.9365588772015863E-4,-3.9503674667445238E-11,-1.7280143099947622E-4,"5600-32152520,4450804i","-461318771,603327i","1907214,5367964-29936090,1077967i","0,999999999999786-4,62209864591901E-07i",1E-3,{"$f":"20*LOG(IMABS(IMPRODUCT(BQ361,IMPRODUCT(BO361,BP361)) ))","v":89.541493472533901},-86.354683410504407,null,{"$f":"BC361+BE361","v":33.025763374637705},{"$f":"BD361+BF361","v":-1.1679212511769912E-2},{"$f":"BI361+BK361+BR361","v":64.08146803160264},{"$f":"BJ361+BL361+BS361","v":-86.35436255604769},{"$f":"BU361+BW361","v":97.107231406240345},{"$f":"BV361+BX361","v":-86.366041768559455},{"$f":"BZ361+360","v":273.63395823144054},null,0,0,0,0,0,{"$f":"IF(AND(BF362<$CG$355,BF361>=$CG$355),(($CG$355-BF361)/(BF362-BF361)*(BY362-BY361)+BY361),0)","v":0},0,0,{"$f":"IF(AND(BX362>$CJ$355,BX361<=$CJ$355),(($CJ$355-BX361)/(BX362-BX361)*(BY362-BY361)+BY361),0)","v":0},0,{"$f":"IF(AND(BX362<$CL$355,BX361>=$CL$355),(($CL$355-BX361)/(BX362-BX361)*(BY362-BY361)+BY361),0)","v":0}]
[null,null,null,null,null,null,null,null,null,null,null,null,null,null,null,null,null,null,null,null,null,null,null,null,null,null,null,null,null,null,null,null,null,null,null,null,null,null,null,null,null,null,null,null,null,null,null,null,null,null,null,3,2,null,1.5792489798971659E-5,-1.9669126671062101E-4,33.02575139308388,-1.5375592009625147E-2,"5636,61971830884-0,00239551279690659i","100049,999984209-1,25663679980156i",-25.460025440594013,6.5820785027696511E-4,-7.0231005061893277E-11,-2.3040190799875789E-4,"5600-24114390,3338103i","-345989078,702496i","1076835,44514601-22491643,102456i","0,99999999999962-6,16279819455767E-07i",1E-3,87.050367263417115,-87.258988758683785,null,33.025767185573677,-1.5572283276335768E-2,61.590341822752876,-87.258560952741504,94.616109008326561,-87.274133236017846,272.72586676398214,null,0,0,0,0,0,0,0,0,0,0,0]
[null,null,null,null,null,null,null,null,null,null,null,null,null,null,null,null,null,null,null,null,null,null,null,null,null,null,null,null,null,null,null,null,null,null,null,null,null,null,null,null,null,null,null,null,null,null,null,null,null,null,null,4,2.5,null,1.9740600694686386E-5,-2.4586419514438995E-4,33.025751216710098,-1.9219489751520505E-2,"5636,61971830827-0,00299439099613295i","100049,999975326-1,57079599961242i",-25.460025440211016,8.2275981281957808E-4,-1.0973371540219137E-10,-2.8800238499757417E-4,"5600-19291512,2670482i","-276791262,961996i","691496,692809627-18008006,570797i","0,999999999999407-7,70349774319544E-07i",1E-3,85.115711826039956,-87.801019119782538,null,33.02577095731079,-1.9465353946664894E-2,59.655686385719207,-87.800484362354709,92.68145734302999,-87.81994971630138,272.18005028369862,null,0,0,0,0,0,0,0,0,0,0,0]
[null,null,null,null,null,null,null,null,null,null,null,null,null,null,null,null,null,null,null,null,null,null,null,null,null,null,null,null,null,null,null,null,null,null,null,null,null,null,null,null,null,null,null,null,null,null,null,null,null,null,null,5,3,null,2.3688707072562163E-5,-2.95037168280578E-4,33.02575100114214,-2.3063387319742099E-2,"5636,61971830757-0,00359326919535908i","100049,999964469-1,88495519933026i",-25.460025439742992,9.8731177534443215E-4,-1.5801277001592577E-10,-3.456028619958088E-4,"5600-16076260,2225402i","-230659385,801664i","481913,001022706-15013331,2851172i","0,999999999999145-9,2441972918321E-07i",1E-3,83.534013790247769,-88.161565033774849,null,33.025774689849214,-2.3358424488022677E-2,58.073988350346767,-88.1609233248615,91.099763040195981,-88.184281749349523,271.81571825065049,null,0,0,0,0,0,0,0,0,0,0,0]
[null,null,null,null,null,null,null,null,null,null,null,null,null,null,null,null,null,null,null,null,null,null,null,null,null,null,null,null,null,null,null,null,null,null,null,null,null,null,null,null,null,null,null,null,null,null,null,null,null,null,null,6,3.5,null,2.7636808760954597E-5,-3.4421018611917981E-4,33.025750746380012,-2.6907284679554892E-2,"5636,61971830674-0,00419214739458498i","100049,999951639-2,19911439893648i",-25.460025439189891,1.1518637378479851E-3,-2.1507781217790869E-10,-4.0320333899334434E-4,"5600-13779651,6193202i","-197708044,972855i","355450,731601586-12872013,7839939i","0,999999999998837-1,07848968404674E-06i",1E-3,82.196240354648467,-88.41830340988011,null,33.025778383188772,-2.7251494865674072E-2,56.736214915243494,-88.417554749481255,89.761993298432259,-88.444806244346935,271.55519375565308,null,0,0,0,0,0,0,0,0,0,0,0]
[null,null,null,null,null,null,null,null,null,null,null,null,null,null,null,null,null,null,null,null,null,null,null,null,null,null,null,null,null,null,null,null,null,null,null,null,null,null,null,null,null,null,null,null,null,null,null,null,null,null,null,7,4,null,3.1584905933447577E-5,-3.9338324866017695E-4,33.02575045242375,-3.0751181796224328E-2,"5636,61971830578-0,00479102559381059i","100049,999936835-2,51327359841248i",-25.460025438551686,1.3164157003266665E-3,-2.8090859101151496E-10,-4.6080381599006461E-4,"5600-12057195,1669051i","-172994539,351248i","273335,623826003-11264968,880019i","0,999999999998481-1,23255963891013E-06i",1E-3,81.037156091618073,-88.610124696750646,null,33.025782037329684,-3.1144565044884505E-2,55.577130652785478,-88.609269084866312,88.602912690115161,-88.640413649911196,271.35958635008882,null,0,0,0,0,0,0,0,0,0,0,0]
[null,null,null,null,null,null,null,null,null,null,null,null,null,null,null,null,null,null,null,null,null,null,null,null,null,null,null,null,null,null,null,null,null,null,null,null,null,null,null,null,null,null,null,null,null,null,null,null,null,null,null,8,4.5,null,3.5532998503257322E-5,-4.4255635590356149E-4,33.02575011927334,-3.4595078635015604E-2,"5636,61971830471-0,00538990379303588i","100049,999920056-2,82743279773965i",-25.460025437828296,1.4809676627769728E-3,-3.555311433585418E-10,-5.1840429298585398E-4,"5600-10717506,8150268i","-153772923,867776i","217021,287602961-10014498,5574778i","0,999999999998077-1,38662959377333E-06i",1E-3,80.014623220045479,-88.758652039940259,null,33.025785652271843,-3.5037634990919164E-2,54.554597781861652,-88.757689476570462,87.580383434133495,-88.792727111561376,271.20727288843864,null,0,0,0,0,0,0,0,0,0,0,0]
[null,null,null,null,null,null,null,null,null,null,null,null,null,null,null,null,null,null,null,null,null,null,null,null,null,null,null,null,null,null,null,null,null,null,null,null,null,null,null,null,null,null,null,null,null,null,null,null,null,null,null,9,5,null,3.9481086379742928E-5,-4.9172950784932661E-4,33.025749746928803,-3.843897516119385E-2,"5636,6197183035-0,0059887819922608i","100049,999901304-3,14159199689937i",-25.460025437019908,1.6455196251952953E-3,-4.3892136103255098E-10,-5.7600476998059705E-4,"5600-9645756,13352412i","-138395631,480998i","176731,742490144-9013816,8094497i","0,999999999997626-1,54069954863634E-06i",1E-3,79.099843766391359,-88.876866089550802,null,33.025789228015185,-3.8930704669043179E-2,53.639818328932535,-88.875796574695585,86.66560755694772,-88.914727279364627,271.08527272063537,null,0,0,0,0,0,0,0,0,0,0,0]
[null,null,null,null,null,null,null,null,null,null,null,null,null,null,null,null,null,null,null,null,null,null,null,null,null,null,null,null,null,null,null,null,null,null,null,null,null,null,null,null,null,null,null,null,null,null,null,null,null,null,null,10,5.5,null,4.3429169738416702E-5,-5.4090270449745181E-4,33.025749335390131,-4.228287134002464E-2,"5636,61971830217-0,00658766019148533i","100049,999880578-3,45575119587306i",-25.460025436126337,1.8100715875781232E-3,-5.3109563760072724E-10,-6.3360524697417449E-4,"5600-8768869,21229465i","-125814210,437271i","146917,615411281-8194895,65401035i","0,999999999997128-1,69476950349913E-06i",1E-3,78.272264207424485,-88.973030220954598,null,33.025792764559867,-4.2823774044522089E-2,52.812238770767053,-88.971853754613988,85.83803153532692,-89.01467752865851,270.98532247134148,null,0,0,0,0,0,0,0,0,0,0,0]
[null,null,null,null,null,null,null,null,null,null,null,null,null,null,null,null,null,null,null,null,null,null,null,null,null,null,null,null,null,null,null,null,null,null,null,null,null,null,null,null,null,null,null,null,null,null,null,null,null,null,null,11,6,null,4.7377248407634635E-5,-5.9007594584793905E-4,33.025748884657332,-4.6126767136773182E-2,"5636,6197183007-0,00718653839070941i","100049,999857878-3,76991039464212i",-25.460025435147774,1.9746235499218849E-3,-6.3205686604575025E-10,-6.9120572396646931E-4,"5600-8038130,1112701i","-115329692,900832i","124239,00919911-7512348,00233836i","0,999999999996582-1,84883945836169E-06i",1E-3,77.51670161277913,-89.052654769896407,null,33.025796261905739,-4.6716843082621119E-2,52.056676176999304,-89.051371352070447,85.082472438905043,-89.098088195153068,270.90191180484692,null,0,0,0,0,0,0,0,0,0,0,0]
[null,null,null,null,null,null,null,null,null,null,null,null,null,null,null,null,null,null,null,null,null,null,null,null,null,null,null,null,null,null,null,null,null,null,null,null,null,null,null,null,null,null,null,null,null,null,null,null,null,null,null,12,6.5,null,5.1325322562908866E-5,-6.3924923190075136E-4,33.025748394730449,-4.9970662516704671E-2,"5636,61971829911-0,007785416589933i","100049,999833204-4,08406959318792i",-25.46002543408401,2.1391755122230362E-3,-7.4178383116366021E-10,-7.4880620095736932E-4,"5600-7419812,41040317i","-106458178,062306i","106588,21555609-6934733,95430813i","0,999999999995988-2,00290941322397E-06i",1E-3,76.821621955866405,-89.119555314453265,null,33.025799720053016,-5.0609911748605421E-2,51.36159652104061,-89.118164945141999,84.387396241093626,-89.168774856890607,270.83122514310941,null,0,0,0,0,0,0,0,0,0,0,0]
[null,null,null,null,null,null,null,null,null,null,null,null,null,null,null,null,null,null,null,null,null,null,null,null,null,null,null,null,null,null,null,null,null,null,null,null,null,null,null,null,null,null,null,null,null,null,null,null,null,null,null,13,7,null,5.5273392024880979E-5,-6.88422562655914E-4,33.025747865609468,-5.3814557445084718E-2,"5636,61971829738-0,00838429478915602i","100049,999806556-4,39822879149188i",-25.460025432935176,2.3037274744780382E-3,-8.6029196219425599E-10,-8.0640667794675339E-4,"5600-6889825,80966008i","-98854022,4864273i","92581,9135284761-6439586,57440969i","0,999999999995347-2,15697936808597E-06i",1E-3,76.178057310755051,-89.176457666123767,null,33.025803139001489,-5.4502980007740634E-2,50.718031876959586,-89.174960345327236,83.743835015961082,-89.229463325334976,270.77053667466504,null,0,0,0,0,0,0,0,0,0,0,0]
[null,null,null,null,null,null,null,null,null,null,null,null,null,null,null,null,null,null,null,null,null,null,null,null,null,null,null,null,null,null,null,null,null,null,null,null,null,null,null,null,null,null,null,null,null,null,null,null,null,null,null,14,7.5,null,5.9221456970991572E-5,-7.3759593811337373E-4,33.025747297294423,-5.765845188717867E-2,"5636,61971829554-0,00898317298837855i","100049,999777934-4,71238798953538i",-25.460025431701322,2.4682794366833009E-3,-9.875793304829636E-10,-8.6400715493450964E-4,"5600-6430504,08901608i","-92263754,3206655i","81281,7390903971-6010424,45488387i","0,999999999994659-2,31104932294766E-06i",1E-3,75.578897039809959,-89.22536098182762,null,33.025806518751395,-5.8396047825292043E-2,50.118871607121058,-89.223756709545867,83.144678125872446,-89.282152757371165,270.71784724262886,null,0,0,0,0,0,0,0,0,0,0,0]
[null,null,null,null,null,null,null,null,null,null,null,null,null,null,null,null,null,null,null,null,null,null,null,null,null,null,null,null,null,null,null,null,null,null,null,null,null,null,null,null,null,null,null,null,null,null,null,null,null,null,null,15,8,null,6.31695172257397E-5,-7.8676935827316232E-4,33.025746689785301,-6.1502345808251507E-2,"5636,61971829357-0,00958205118760041i","100049,999747338-5,02654718729984i",-25.460025430382277,2.6328313988353402E-3,-1.1236507576675021E-9,-9.2160763192051707E-4,"5600-6028597,58345257i","-86497269,6756239i","72032,9724791157-5634883,16032221i","0,999999999993923-2,46511927780902E-06i",1E-3,75.018407952838686,-89.267764765793999,null,33.025809859302527,-6.2289115166524668E-2,49.55838252133276,-89.26605354202708,82.584192380635287,-89.328342657193602,270.67165734280638,null,0,0,0,0,0,0,0,0,0,0,0]
[null,null,null,null,null,null,null,null,null,null,null,null,null,null,null,null,null,null,null,null,null,null,null,null,null,null,null,null,null,null,null,null,null,null,null,null,null,null,null,null,null,null,null,null,null,null,null,null,null,null,null,16,8.5,null,6.7117572964637163E-5,-8.3594282313522448E-4,33.025746043082151,-6.5346239173569284E-2,"5636,61971829148-0,0101809293868217i","100049,999714769-5,34070638476662i",-25.460025428978135,2.7973833609305403E-3,-1.2684966004736176E-9,-9.7920810890466357E-4,"5600-5673974,19619066i","-81409194,9888225i","64367,5468526344-5303505,4411081i","0,99999999999314-2,61918923267003E-06i",1E-3,74.491900051197618,-89.304815782288259,null,33.025813160655119,-6.6182181996704503E-2,49.031874620950987,-89.302997607036232,82.057687781606106,-89.369179789032941,270.63082021096704,null,0,0,0,0,0,0,0,0,0,0,0]
[null,null,null,null,null,null,null,null,null,null,null,null,null,null,null,null,null,null,null,null,null,null,null,null,null,null,null,null,null,null,null,null,null,null,null,null,null,null,null,null,null,null,null,null,null,null,null,null,null,null,null,17,9,null,7.1065624098971922E-5,-8.8511633269958427E-4,33.02574535718496,-6.9190131948397071E-2,"5636,61971828924-0,0107798075860422i","100049,999680225-5,65486558191716i",-25.460025427488937,2.9619353229654011E-3,-1.4221168589017495E-9,-1.0368085858868325E-3,"5600-5358753,4075134i","-76886461,9338879i","57943,6542434645-5008934,32144179i","0,999999999992309-2,77325918753067E-06i",1E-3,73.995487876746495,-89.337406013093073,null,33.025816422809058,-7.0075248281096653E-2,48.535462447835442,-89.335480886355995,81.5612788706445,-89.405556134637095,270.5944438653629,null,0,0,0,0,0,0,0,0,0,0,0]
[null,null,null,null,null,null,null,null,null,null,null,null,null,null,null,null,null,null,null,null,null,null,null,null,null,null,null,null,null,null,null,null,null,null,null,null,null,null,null,null,null,null,null,null,null,null,null,null,null,null,null,18,9.5,null,7.5013670543889343E-5,-9.3428988696621167E-4,33.025744632093776,-7.3034024098000583E-2,"5636,61971828691-0,011378685785262i","100049,999643707-5,96902477873282i",-25.460025425914587,3.1264872849363309E-3,-1.5845259978643635E-9,-1.0944090628669024E-3,"5600-5076713,75448638i","-72839806,0426306i","52506,9778411417-4745360,78468385i","0,999999999991431-2,92732914239091E-06i",1E-3,73.52591642283474,-89.36623968981587,null,33.025819645764322,-7.3968313984966796E-2,48.065890995335629,-89.364207611593798,81.091710641099951,-89.438175925578761,270.56182407442122,null,0,0,0,0,0,0,0,0,0,0,0]
[null,null,null,null,null,null,null,null,null,null,null,null,null,null,null,null,null,null,null,null,null,null,null,null,null,null,null,null,null,null,null,null,null,null,null,null,null,null,null,null,null,null,null,null,null,null,null,null,null,null,null,19,10,null,7.8961712471043729E-5,-9.8346348593510505E-4,33.025743867808586,-7.6877915587645007E-2,"5636,6197182844-0,011977563984481i","100049,999605216-6,28318397519499i",-25.460025424255207,3.2910392468397838E-3,-1.7557066594675516E-9,-1.1520095398447616E-3,"5600-4822878,06676206i","-69197815,7404991i","47865,1327737903-4508137,02719309i","0,999999999990505-3,08139909725074E-06i",1E-3,73.080431721631825,-89.391880221591066,null,33.025822829521054,-7.7861379073580109E-2,47.62040629562091,-89.38974119188407,80.646229125141957,-89.467602570957652,270.53239742904236,null,0,0,0,0,0,0,0,0,0,0,0]
[null,null,null,null,null,null,null,null,null,null,null,null,null,null,null,null,null,null,null,null,null,null,null,null,null,null,null,null,null,null,null,null,null,null,null,null,null,null,null,null,null,null,null,null,null,null,null,null,null,null,null,20,{"$f":"BA361*10","v":15},null,1.1844187822343297E-4,-1.4752019342458484E-3,33.025734069292611,-0.11531678654479838,"5636,61971825259-0,0179663459766202i","100049,999111736-9,42477591628313i",-25.460025402980886,4.936558861382603E-3,-3.9503366091549161E-9,-1.7280143094760704E-3,"5600-3215252,04450804i","-46131877,1603327i","23993,2367884372-3005576,68982701i","0,999999999978636-4,62209864582125E-06i",1E-3,69.558833029755831,-89.542906337733086,null,33.025852511170832,-0.11679198847904422,44.098807622824609,-89.539697793181176,77.124660133995434,-89.656489781660227,270.34351021833976,null,0,0,0,0,0,0,0,0,0,0,0]
[null,null,null,null,null,null,null,null,null,null,null,null,null,null,null,null,null,null,null,null,null,null,null,null,null,null,null,null,null,null,null,null,null,null,null,null,null,null,null,null,null,null,null,null,null,null,null,null,null,null,null,21,{"$f":"BA362*10","v":20},null,1.5792158358065631E-4,-1.9669448527700954E-3,33.025720351407351,-0.15375555329847568,"5636,61971820805-0,0239551279686375i","100049,998420864-12,56636780156i",-25.460025373196689,6.5820784652729667E-3,-7.0228112107600494E-9,-2.304019078758083E-3,"5600-2411439,03338103i","-34598907,8702496i","15637,50382411-2254222,66437988i","0,99999999996202-6,16279819432594E-06i",1E-3,67.060145223778051,-89.602918282652908,null,33.02587827299093,-0.15572249815124578,41.600119843558545,-89.598640223266386,74.625998116549482,-89.754362721417635,270.24563727858236,null,0,0,0,0,0,0,0,0,0,0,0]
[null,null,null,null,null,null,null,null,null,null,null,null,null,null,null,null,null,null,null,null,null,null,null,null,null,null,null,null,null,null,null,null,null,null,null,null,null,null,null,null,null,null,null,null,null,null,null,null,null,null,null,22,25,null,1.9740082857324786E-4,-2.4586922414963313E-3,33.02570271418999,-0.19219418111506328,"5636,61971815079-0,0299439099604929i","100049,9975326-15,7079596124218i",-25.460025334902777,8.2275980549600027E-3,-1.0973147823108934E-8,-2.8800238475743868E-3,"5600-1929151,22670482i","-27679126,2961996i","11769,8931475144-1803393,21101209i","0,999999999940656-7,70349774274286E-06i",1E-3,65.121993594164408,-89.626522923928803,null,33.025900115018565,-0.19465287335655962,39.661968248288481,-89.621175349721412,72.687868363307047,-89.815828223077972,270.18417177692203,null,0,0,0,0,0,0,0,0,0,0,0]
[null,null,null,null,null,null,null,null,null,null,null,null,null,null,null,null,null,null,null,null,null,null,null,null,null,null,null,null,null,null,null,null,null,null,null,null,null,null,null,null,null,null,null,null,null,null,null,null,null,null,null,23,30,null,2.3687961323174119E-4,-2.9504441004130706E-3,33.025681157688261,-0.23063263526169814,"5636,61971808079-0,0359326919521451i","100049,996446944-18,8495513302649i",-25.460025288099111,9.8731176268929133E-3,-1.5801329089504899E-8,-3.456028615808539E-3,"5600-1607626,02225402i","-23065938,5801664i","9668,94227513158-1502834,69059479i","0,999999999914545-9,24419729105003E-06i",1E-3,63.538403997342094,-89.631923631474024,null,33.025918037301494,-0.2335830793621112,38.07837869344165,-89.625506542462944,71.104296730743144,-89.859089621825049,270.14091037817496,null,0,0,0,0,0,0,0,0,0,0,0]
[null,null,null,null,null,null,null,null,null,null,null,null,null,null,null,null,null,null,null,null,null,null,null,null,null,null,null,null,null,null,null,null,null,null,null,null,null,null,null,null,null,null,null,null,null,null,null,null,null,null,null,24,35,null,2.7635793750181123E-4,-3.4422004295088121E-3,33.025655681960515,-0.26907088100645943,"5636,61971799807-0,0419214739435541i","100049,995163896-21,9911429364854i",-25.460025232785672,1.1518637177520986E-2,-2.1507364654686514E-8,-4.0320333833441203E-3,"5600-1377965,16193202i","-19770804,4972855i","8402,12609834383-1288147,81436187i","0,999999999883686-0,0000107848968392256i",1E-3,62.199498784953832,-89.626922059077643,null,33.025932039898017,-0.27251308143596825,36.739473530660796,-89.619435455283465,69.765405570558812,-89.89194853671944,270.10805146328056,null,0,0,0,0,0,0,0,0,0,0,0]
[null,null,null,null,null,null,null,null,null,null,null,null,null,null,null,null,null,null,null,null,null,null,null,null,null,null,null,null,null,null,null,null,null,null,null,null,null,null,null,null,null,null,null,null,null,null,null,null,null,null,null,25,40,null,3.1583580132913373E-4,-3.9339612287720852E-3,33.025626287075774,-0.3075088836185515,"5636,61971790263-0,0479102559346791i","100049,993683456-25,1327344124797i",-25.46002516896251,1.3164156703293125E-2,-2.8091243912781694E-8,-4.6080381500646864E-3,"5600-1205719,51669051i","-17299453,9351248i","7579,90999853139-1127131,64399629i","0,99999999984808-0,0000123255963872475i",1E-3,61.039689258390467,-89.615419097089884,null,33.025942122877105,-0.3114428448473236,35.579664061336715,-89.606862978536654,68.605606184213826,-89.918305823383974,270.081694176616,null,0,0,0,0,0,0,0,0,0,0,0]
[null,null,null,null,null,null,null,null,null,null,null,null,null,null,null,null,null,null,null,null,null,null,null,null,null,null,null,null,null,null,null,null,null,null,null,null,null,null,null,null,null,null,null,null,null,null,null,null,null,null,null,26,45,null,3.5531320474424283E-4,-4.4257264981913576E-3,33.025592973113554,-0.3459466083685025,"5636,61971779446-0,0538990379254797i","100049,992005624-28,2743257396441i",-25.460025096629465,1.4809676200658935E-2,-3.5552984223681108E-8,-5.1840429158538249E-3,"5600-1071750,68150268i","-15377292,3867776i","7016,19964861541-1001896,33839433i","0,999999999807726-0,0000138662959350939i",1E-3,60.016668763864757,-89.59958193417873,null,33.025948286318297,-0.35037233486669384,34.556643631682306,-89.589956300893931,67.582591918000603,-89.940328635760622,270.05967136423936,null,0,0,0,0,0,0,0,0,0,0,0]
[null,null,null,null,null,null,null,null,null,null,null,null,null,null,null,null,null,null,null,null,null,null,null,null,null,null,null,null,null,null,null,null,null,null,null,null,null,null,null,null,null,null,null,null,null,null,null,null,null,null,null,27,50,null,3.9479014769281529E-4,-4.9174962377551649E-3,33.025555740164052,-0.38438402052833642,"5636,61971767357-0,0598878199159154i","100049,990130401-31,4159168993746i",-25.460025015786904,1.645519566606685E-2,-4.3892570160407629E-8,-5.7600476805951097E-3,"5600-964575,613352412i","-13839563,1480998i","6612,98007907311-901707,824980821i","0,999999999762625-0,0000154069954827427i",1E-3,59.101550348419629,-89.580710899290295,null,33.025950530311746,-0.38930151676609159,33.641525288740155,-89.570015751304823,66.667475819051901,-89.959317268070919,270.04068273192911,null,0,0,0,0,0,0,0,0,0,0,0]
[null,null,null,null,null,null,null,null,null,null,null,null,null,null,null,null,null,null,null,null,null,null,null,null,null,null,null,null,null,null,null,null,null,null,null,null,null,null,null,null,null,null,null,null,null,null,null,null,null,null,null,28,55,null,4.3426663020345652E-4,-5.4092704474519573E-3,33.025514588328107,-0.42282108537177243,"5636,61971753995-0,0658766019059451i","100049,988057785-34,5575078730676i",-25.460024926434368,1.8100715095966856E-2,-5.3110012333092008E-8,-6.3360524441720672E-3,"5600-876886,921229465i","-12581421,0437271i","6314,64270766594-819735,256805459i","0,999999999712776-0,0000169476950301722i",1E-3,58.273729992905828,-89.559633485598624,null,33.025948854958308,-0.42823035581922436,32.813705013361449,-89.547868822946825,65.839653868319758,-89.976099178766049,270.02390082123395,null,0,0,0,0,0,0,0,0,0,0,0]
[null,null,null,null,null,null,null,null,null,null,null,null,null,null,null,null,null,null,null,null,null,null,null,null,null,null,null,null,null,null,null,null,null,null,null,null,null,null,null,null,null,null,null,null,null,null,null,null,null,null,null,29,60,null,4.7374265231441449E-4,-5.901049127270205E-3,33.025469517717084,-0.46125776817441488,"5636,6197173936-0,0718653838955289i","100049,985787778-37,6990986421195i",-25.460024828572241,1.9746234486807644E-2,-6.3205305922891601E-8,-6.9120572064683321E-3,"5600-803813,01112701i","-11532969,2900832i","6087,73236869839-751424,700707298i","0,999999999658179-0,0000184883945773604i",1E-3,57.517994381769839,-89.536901364111003,null,33.025943260369402,-0.46715881730168507,32.057969489992288,-89.524067186830663,65.083912750361691,-89.991226004132344,270.00877399586767,null,0,0,0,0,0,0,0,0,0,0,0]
[null,null,null,null,null,null,null,null,null,null,null,null,null,null,null,null,null,null,null,null,null,null,null,null,null,null,null,null,null,null,null,null,null,null,null,null,null,null,null,null,null,null,null,null,null,null,null,null,null,null,null,30,65,null,5.1321821387686779E-4,-6.3928322771984562E-3,33.025420528453033,-0.49969403421392877,"5636,61971723453-0,0778541658846257i","100049,983320378-40,8406891879263i",-25.46002472220021,2.139175383503867E-2,-7.4178445146902437E-8,-7.4880619673674265E-3,"5600-741981,241040317i","-10645817,8062306i","5911,14256828548-693623,41562008i","0,999999999598835-0,0000200290941242851i",1E-3,56.822790315967694,-89.5128964685358,null,33.025933746666908,-0.50608686649112722,31.36276551958904,-89.498992776668132,64.388699266255941,-90.005079643159263,269.99492035684074,null,0,0,0,0,0,0,0,0,0,0,0]
[null,null,null,null,null,null,null,null,null,null,null,null,null,null,null,null,null,null,null,null,null,null,null,null,null,null,null,null,null,null,null,null,null,null,null,null,null,null,null,null,null,null,null,null,null,null,null,null,null,null,null,31,70,null,5.526933148422812E-4,-6.8846198972252999E-3,33.025367620668518,-0.53812984877024328,"5636,61971706271-0,0838429478731949i","100049,980655587-43,9822794918846i",-25.460024607318523,2.3037273137109123E-2,-8.6029437723071362E-8,-8.0640667267529356E-3,"5600-688982,580966008i","-9885402,24864273i","5771,02382348533-644079,433757455i","0,999999999534744-0,0000215697936709246i",1E-3,56.179137287741753,-89.487891615465912,null,33.025920313983363,-0.54501446866746861,30.719112594393792,-89.472918409055552,63.745032908377155,-90.017932877723027,269.98206712227699,null,0,0,0,0,0,0,0,0,0,0,0]
[null,null,null,null,null,null,null,null,null,null,null,null,null,null,null,null,null,null,null,null,null,null,null,null,null,null,null,null,null,null,null,null,null,null,null,null,null,null,null,null,null,null,null,null,null,null,null,null,null,null,null,32,75,null,5.9216795540511483E-4,-7.3764119873389739E-3,33.02531079450678,-0.57656517712572675,"5636,6197168782-0,089831729861197i","100049,977793404-47,1238695353904i",-25.460024483926965,2.4682792389468033E-2,-9.8758282690664108E-8,-8.6400714845084499E-3,"5600-643050,408901608i","-9226375,43206655i","5657,98305922699-601141,306412359i","0,999999999465905-0,0000231104932172568i",1E-3,55.579916125380812,-89.462086876606449,null,33.025902962462183,-0.58394158911306571,30.119891542695566,-89.446044155701486,63.145794505157752,-90.029985744814553,269.97001425518545,null,0,0,0,0,0,0,0,0,0,0,0]
[null,null,null,null,null,null,null,null,null,null,null,null,null,null,null,null,null,null,null,null,null,null,null,null,null,null,null,null,null,null,null,null,null,null,null,null,null,null,null,null,null,null,null,null,null,null,null,null,null,null,null,33,80,null,{"$f":"20*LOG(IMABS(IMDIV(1,IMSUM(1,IMSUM(COMPLEX(0,2*pi*BA392/Wsh),COMPLEX(-BA392/(fsw_sh),0))))))","v":6.3164213534905094E-4},{"$f":"180/pi*IMARGUMENT(IMDIV(1,IMSUM(1,IMSUM(COMPLEX(0,2*pi*BA392/Wsh),COMPLEX(-BA392/(fsw_sh),0)))))","v":-7.8682085475281216E-3},{"$f":"20*LOG(IMABS(IMPRODUCT(A_INTCOMP2VOUT,IMDIV(COMPLEX(1, 2*pi*BA392/Wesr_zero),COMPLEX(1, 2*pi*BA392/Wload_pole)))))","v":33.025250050121635},{"$f":"180/pi*IMARGUMENT(IMPRODUCT(A_INTCOMP2VOUT,IMDIV(COMPLEX(1, 2*pi*BA392/Wesr_zero),COMPLEX(1, 2*pi*BA392/Wload_pole))))","v":-0.61499998456537441},{"$f":"IMDIV(IMPRODUCT(COMPLEX(R.fb_bot,0),IMDIV(COMPLEX(1,0),COMPLEX(0,2*pi*BA392*C.fb_bot))),IMSUM(COMPLEX(R.fb_bot,0),IMDIV(COMPLEX(1,0),COMPLEX(0,2*pi*BA392*C.fb_bot))) )","v":"5636,61971668095-0,09582051184859i"},{"$f":"IMSUM(COMPLEX(R.fb_top1,0),IMDIV(IMPRODUCT(COMPLEX(R.fb_top2,0),IMDIV(COMPLEX(1,0),COMPLEX(0,2*pi*BA392*C.fb_top))),IMSUM(COMPLEX(R.fb_top2,0),IMDIV(COMPLEX(1,0),COMPLEX(0,2*pi*BA392*C.fb_top))) ))","v":"100049,97473383-50,2654592998402i"},-25.460024352025819,{"$f":"180/pi*IMARGUMENT(IMDIV(BG392,IMSUM(BG392,BH392)))","v":2.6328311588564256E-2},{"$f":"20*LOG(IMABS(IMDIV(A.fb_buf,IMSUM(COMPLEX(1,0),COMPLEX(0,2*pi*BA392*R.fb_buf*C.fb_buf)))))","v":-1.1236498198219504E-7},{"$f":"180/pi*IMARGUMENT(IMDIV(A.fb_buf,IMSUM(COMPLEX(1,0),COMPLEX(0,2*pi*BA392*R.fb_buf*C.fb_buf))))","v":-9.2160762405174897E-3},{"$f":"IMSUM(COMPLEX(R.comp,0),IMDIV(COMPLEX(1,0),COMPLEX(0,2*pi*BA392*C.comp)))","v":"5600-602859,758345257i"},{"$f":"IMDIV(COMPLEX(1,0),COMPLEX(0,2*pi*BA392*C.hf))","v":"-8649726,96756239i"},{"$f":"IMDIV(COMPLEX(1,0),IMSUM(IMDIV(COMPLEX(1,0),BM392),IMSUM(IMDIV(COMPLEX(1,0),BN392),IMDIV(COMPLEX(1,0),COMPLEX(R.eaout,0)))))","v":"5565,46738575644-563570,443670439i"},{"$f":"IMDIV(IMDIV(COMPLEX(1,0),COMPLEX(0,2*pi*BA392*0.00000000000226)),IMSUM(COMPLEX(21700,0),IMDIV(COMPLEX(1,0),COMPLEX(0,2*pi*BA392*0.00000000000226))) )","v":"0,999999999392319-0,0000246511927632599i"},{"$f":"GM*A.comp_buffer","v":1E-3},55.019387684631354,{"$f":"180/pi*IMARGUMENT(IMPRODUCT(BQ392,IMPRODUCT(BO392,BP392)) )","v":-89.435632311473881},null,33.025881692256981,-0.62286819311290254,29.559363220240552,-89.41852007612583,62.585244912497529,-90.041388269238738,269.95861173076128,null,{"$f":"IF(AND(BY393<$CC$355,BY392>=$CC$355),(($CC$355-BY392)/(BY393-BY392)*(BA393-BA392)+BA392),0)","v":0},{"$f":"IF(AND(BA393>$CD$355,BA392<=$CD$355),(($CD$355-BA392)/(BA393-BA392)*(BZ393-BZ392)+BZ392),0)","v":0},{"$f":"IF(AND(BZ393<$CE$355,BZ392>=$CE$355),(($CE$355-BZ392)/(BZ393-BZ392)*(BA393-BA392)+BA392),0)","v":0},{"$f":"IF(AND(BA393>$CF$355,BA392<=$CF$355),(($CF$355-BA392)/(BA393-BA392)*(BY393-BY392)+BY392),0)","v":0},{"$f":"IF(AND(BF393<$CG$355,BF392>=$CG$355),(($CG$355-BF392)/(BF393-BF392)*(BA393-BA392)+BA392),0)","v":0},0,{"$f":"IF(AND(BF393>$CI$355,BF392<=$CI$355),(($CI$355-BF392)/(BF393-BF392)*(BA393-BA392)+BA392),0)","v":0},{"$f":"IF(AND(BX393>$CJ$355,BX392<=$CJ$355),(($CJ$355-BX392)/(BX393-BX392)*(BA393-BA392)+BA392),0)","v":0},0,{"$f":"IF(AND(BX393<$CL$355,BX392>=$CL$355),(($CL$355-BX392)/(BX393-BX392)*(BA393-BA392)+BA392),0)","v":0},0]
[null,null,null,null,null,null,null,null,null,null,null,null,null,null,null,null,null,null,null,null,null,null,null,null,null,null,null,null,null,null,null,null,null,null,null,null,null,null,null,null,null,null,null,null,null,null,null,null,null,null,null,34,85,null,6.7111585478562251E-4,-8.3600095777811717E-3,33.025185387677524,-0.65343423637701648,"5636,61971647098-0,101809293835335i","100049,971476863-53,40704876663i",-25.460024211614773,2.7973830730847648E-2,-1.2684952788716982E-7,-9.7920809946636933E-3,"5600-567397,419619066i","-8140919,49888225i","5488,79258056497-530419,68644285i","0,999999999313985-0,000026191892308912i",1E-3,54.492857710425412,-89.408642676818957,null,33.02585650353231,-0.66179424595479763,29.032833371961111,-89.390460927082771,62.058689875493421,-90.052255173037565,269.94774482696243,null,0,0,0,0,0,0,0,0,0,0,0]
[null,null,null,null,null,null,null,null,null,null,null,null,null,null,null,null,null,null,null,null,null,null,null,null,null,null,null,null,null,null,null,null,null,null,null,null,null,null,null,null,null,null,null,null,null,null,null,null,null,null,null,35,90,null,7.1058911366050892E-4,-8.8518150780866455E-3,33.025116807349441,-0.69186789785147951,"5636,61971624826-0,107798075821389i","100049,968022505-56,5486379171566i",-25.460024062694039,2.9619349812767148E-2,-1.4221192619594506E-7,-1.036808574683059E-2,"5600-535875,34075134i","-7688646,19338879i","5424,53827742275-500952,35409971i","0,999999999230903-0,0000277325918541909i",1E-3,53.99643763645895,-89.381207232923998,null,33.0258273964631,-0.70071971292956614,28.536413431552983,-89.361955968858055,61.562240828016087,-90.062675681787624,269.9373243182124,null,0,0,0,0,0,0,0,0,0,0,0]
[null,null,null,null,null,null,null,null,null,null,null,null,null,null,null,null,null,null,null,null,null,null,null,null,null,null,null,null,null,null,null,null,null,null,null,null,null,null,null,null,null,null,null,null,null,null,null,null,null,null,null,36,95,null,7.5006191200617284E-4,-9.343625048432818E-3,33.025044309322993,-0.73030093428278076,"5636,61971601285-0,113786857806714i","100049,964370756-59,6902267328158i",-25.460023905263625,3.1264868830771314E-2,-1.5845217980616105E-7,-1.094409049690177E-2,"5600-507671,375448638i","-7283980,60426307i","5370,15979790136-474586,855791425i","0,999999999143074-0,000029273291399075i",1E-3,53.526870143556934,-89.353396453183862,null,33.025794371235001,-0.73964455933121354,28.066846079841127,-89.333075674849994,61.092640451076129,-90.072720234181205,269.92727976581881,null,0,0,0,0,0,0,0,0,0,0,0]
[null,null,null,null,null,null,null,null,null,null,null,null,null,null,null,null,null,null,null,null,null,null,null,null,null,null,null,null,null,null,null,null,null,null,null,null,null,null,null,null,null,null,null,null,null,null,null,null,null,null,null,37,100,null,7.8953424967765653E-4,-9.83543948880845E-3,33.024967893794447,-0.76873331096833508,"5636,61971576467-0,119775639791267i","100049,960521614-62,8318151950039i",-25.460023739323372,3.2910387781310287E-2,-1.7557028486543191E-7,-1.1520095244760754E-2,"5600-482287,806676206i","-6919781,57404991i","5323,73227211492-450857,918247537i","0,999999999050498-0,000030813990943542i",1E-3,53.081399514541019,-89.325266720817325,null,33.025757428044123,-0.77856875045714358,27.621375599647362,-89.303876428280773,60.647133027691481,-90.082445178737913,269.91755482126212,null,0,0,0,0,0,0,0,0,0,0,0]
[null,null,null,null,null,null,null,null,null,null,null,null,null,null,null,null,null,null,null,null,null,null,null,null,null,null,null,null,null,null,null,null,null,null,null,null,null,null,null,null,null,null,null,null,null,null,null,null,null,null,null,38,150,null,1.1842322899132123E-3,-1.4753829741638882E-2,33.023988326630871,-1.1530131600316802,"5636,61971258321-0,179663459585494i","100049,911173676-94,2476762831798i",-25.460021611885047,4.9365572794910585E-2,-3.9503312978530736E-7,-1.7280142576067588E-2,"5600-321525,204450804i","-4613187,71603327i","5084,97879466955-300575,182610877i","0,99999999786362-0,0000462209863604544i",1E-3,49.560305163241097,-89.033458250385351,null,33.025172558920787,-1.1677669897733192,24.10028315632292,-89.001372820166509,57.125455715243703,-90.169139809939821,269.83086019006021,null,0,0,0,0,0,0,0,0,0,0,0]
[null,null,null,null,null,null,null,null,null,null,null,null,null,null,null,null,null,null,null,null,null,null,null,null,null,null,null,null,null,null,null,null,null,null,null,null,null,null,null,null,null,null,null,null,null,null,null,null,null,null,null,39,200,null,1.578884252698341E-3,-1.9672666984696677E-2,33.022617303684626,-1.5371888940046008,"5636,61970812914-0,239551279258031i","100049,842086645-125,663481560266i",-25.460018633473286,6.5820747156055556E-2,-7.0228108457295651E-7,-2.3040189558086111E-2,"5600-241143,903338103i","-3459890,78702496i","5001,41134423739-225434,666444259i","0,999999996201992-0,0000616279817115365i",1E-3,47.062551083966056,-88.73261469390809,null,33.024196187937328,-1.5568615609892975,21.602531748211685,-88.689834136310125,54.62672793614901,-90.24669569729943,269.7533043027006,null,0,0,0,0,0,0,0,0,0,0,0]
[null,null,null,null,null,null,null,null,null,null,null,null,null,null,null,null,null,null,null,null,null,null,null,null,null,null,null,null,null,null,null,null,null,null,null,null,null,null,null,null,null,null,null,null,null,null,null,null,null,null,null,40,250,null,1.9734901222709239E-3,-2.459195120640352E-2,33.020855195636955,-1.9212258954717099,"5636,6197024025-0,299439098768318i","100049,753260601-157,07921242274i",-25.460014804089685,8.2275907313948834E-2,-1.0973141469721765E-6,-2.8800236074387132E-2,"5600-192915,122670482i","-2767912,62961996i","4962,72750939212-180351,080116908i","0,999999994065612-0,0000770349769748447i",1E-3,45.125662105630305,-88.428219787950368,null,33.022828685759222,-1.9458178466781133,19.665646204226473,-88.374744116710801,52.688474889985699,-90.320561963388911,269.67943803661109,null,0,0,0,0,0,0,0,0,0,0,0]
[null,null,null,null,null,null,null,null,null,null,null,null,null,null,null,null,null,null,null,null,null,null,null,null,null,null,null,null,null,null,null,null,null,null,null,null,null,null,null,null,null,null,null,null,null,null,null,null,null,null,null,41,300,null,2.3680498826786941E-3,-2.951168239515313E-2,33.01870247850534,-2.3050896219636097,"5636,61969540325-0,359326918075789i","100049,644695652-188,494850267221i",-25.46001012373662,9.8731049717807315E-2,-1.5801322884585702E-6,-3.4560282008541263E-2,"5600-160762,602225402i","-2306593,85801664i","4941,70978623058-150295,96735225i","0,999999991454482-0,0000924419721284354i",1E-3,43.54363907954464,-88.12211631686597,null,33.021070528388016,-2.3346013043587628,18.083627375675732,-88.057945549156699,51.104697904063748,-90.392546853515455,269.60745314648454,null,0,0,0,0,0,0,0,0,0,0,0]
[null,null,null,null,null,null,null,null,null,null,null,null,null,null,null,null,null,null,null,null,null,null,null,null,null,null,null,null,null,null,null,null,null,null,null,null,null,null,null,null,null,null,null,null,null,null,null,null,null,null,null,42,350,null,2.7625635181668141E-3,-3.4431860539310341E-2,33.016159733215488,-2.688745624503631,"5636,61968713142-0,419214737139882i","100049,516391924-219,910376490517i",-25.46000459241683,0.11518617081687223,-2.1507354715974357E-6,-4.0320327244119269E-2,"5600-137796,516193202i","-1977080,44972855i","4929,03230238872-128828,556301089i","0,9999999883686-0,000107848967150366i",1E-3,42.206595555968313,-87.81510675741697,null,33.018922296733656,-2.7231774850429411,16.746588812816011,-87.740240913844218,49.765511109549664,-90.463418398887157,269.53658160111286,null,0,0,0,0,0,0,0,0,0,0,0]
[null,null,null,null,null,null,null,null,null,null,null,null,null,null,null,null,null,null,null,null,null,null,null,null,null,null,null,null,null,null,null,null,null,null,null,null,null,null,null,null,null,null,null,null,null,null,null,null,null,null,null,43,400,null,3.1570310128809266E-3,-3.9352485627211588E-2,33.013227645079709,-3.0721595660285019,"5636,619677587-0,479102555920035i","100049,368349571-251,325772489652i",-25.459998210133765,0.13164126706040397,-2.8091236674016583E-6,-4.6080371664692039E-2,"5600-120571,951669051i","-1729945,39351248i","4920,7995320152-112728,459743991i","0,999999984807968-0,000123255962018692i",1E-3,41.048938912402768,-87.507603433749878,null,33.016384676092592,-3.1115120516557133,15.588937893145335,-87.422042538354162,48.605322569237927,-90.533554590009871,269.46644540999011,null,0,0,0,0,0,0,0,0,0,0,0]
[null,null,null,null,null,null,null,null,null,null,null,null,null,null,null,null,null,null,null,null,null,null,null,null,null,null,null,null,null,null,null,null,null,null,null,null,null,null,null,null,null,null,null,null,null,null,null,null,null,null,null,44,450,null,3.5514523510696032E-3,-4.4273557647164535E-2,33.009907003183052,-3.4552972396586781,"5636,61966676999-0,538990374375685i","100049,200568767-282,741019661911i",-25.459990976891063,0.14809633489770138,-3.5552968370094808E-6,-5.1840415153830595E-2,"5600-107175,068150268i","-1537729,23867776i","4915,15046869129-100206,573238506i","0,999999980772584-0,00013866295671147i",1E-3,40.028360362271258,-87.199845229899992,null,33.013458455534121,-3.4995707973058425,14.568365830083359,-87.103589310156124,47.581824285617479,-90.60316010746196,269.39683989253803,null,0,0,0,0,0,0,0,0,0,0,0]
[null,null,null,null,null,null,null,null,null,null,null,null,null,null,null,null,null,null,null,null,null,null,null,null,null,null,null,null,null,null,null,null,null,null,null,null,null,null,null,null,null,null,null,null,null,null,null,null,null,null,null,45,500,null,3.9458275168163569E-3,-4.9195076587449017E-2,33.006198699677867,-3.838124586794244,"5636,6196546804-0,598878192466268i","100049,013049711-314,156099404869i",-25.459982892693031,0.16455137077808965,-4.3892549384347908E-6,-5.760045759510566E-2,"5600-96457,5613352412i","-1383956,31480998i","4911,10493718753-90189,4339506032i","0,99999997626245-0,000154069951206756i",1E-3,39.115971562557668,-86.891984269548075,null,33.010144527194683,-3.8873196633816929,13.655984280609697,-86.785033356365091,46.666128807804384,-90.67235301974678,269.32764698025323,null,0,0,0,0,0,0,0,0,0,0,0]
[null,null,null,null,null,null,null,null,null,null,null,null,null,null,null,null,null,null,null,null,null,null,null,null,null,null,null,null,null,null,null,null,null,null,null,null,null,null,null,null,null,null,null,null,null,null,null,null,null,null,null,46,550,null,4.3401564942864247E-3,-5.4117042436316057E-2,33.002103728988516,-4.2206077150126173,"5636,61964131822-0,658766010151224i","100048,805792626-345,570993116433i",-25.459973957544687,0.18100637115093363,-5.310997904387568E-6,-6.3360498872089221E-2,"5600-87688,6921229465i","-1258142,10437271i","4908,10684020573-81993,9290936474i","0,999999971277564-0,000169476945482609i",1E-3,38.291167431940679,-86.584125311180031,null,33.006443885482803,-4.2747247574489338,12.831188163398089,-86.466479438901189,45.837632048880891,-90.741204196350125,269.25879580364989,null,0,0,0,0,0,0,0,0,0,0,0]
[null,null,null,null,null,null,null,null,null,null,null,null,null,null,null,null,null,null,null,null,null,null,null,null,null,null,null,null,null,null,null,null,null,null,null,null,null,null,null,null,null,null,null,null,null,null,null,null,null,null,null,47,600,null,4.7344392676554273E-3,-5.9039455181988637E-2,32.99762318692742,-4.6027129157449531,"5636,61962668344-0,718653827389987i","100048,578797756-376,98568219488i",-25.459964171451137,0.19746133246564532,-6.320525701097883E-6,-6.9120538868351775E-2,"5600-80381,301112701i","-1153296,92900832i","4905,82162048923-75164,6501074881i","0,999999965817928-0,000184883939517084i",1E-3,37.538733736849849,-86.276345441378638,null,33.002357626195078,-4.6617523709269415,12.078763244873009,-86.148004647781349,45.081120871068087,-90.809757018708297,269.1902429812917,null,0,0,0,0,0,0,0,0,0,0,0]
[null,null,null,null,null,null,null,null,null,null,null,null,null,null,null,null,null,null,null,null,null,null,null,null,null,null,null,null,null,null,null,null,null,null,null,null,null,null,null,null,null,null,null,null,null,null,null,null,null,null,null,48,650,null,5.1286758211035828E-3,-6.3962314812658863E-2,32.992758269724327,-4.984406681708597,"5636,61961077607-0,778541644141993i","100048,332065371-408,400148038885i",-25.459953534418407,0.21391625117167282,-7.4178382530983051E-6,-7.4880577467465737E-2,"5600-74198,1241040317i","-1064581,78062306i","4904,03821018348-69386,3141241937i","0,99999995988354-0,000200290933288237i",1E-3,36.847116415661546,-85.968704674996104,null,32.997886945545432,-5.0483689965212557,11.387155463404884,-85.82966900129189,44.385042408950312,-90.878037997813152,269.12196200218682,null,0,0,0,0,0,0,0,0,0,0,0]
[null,null,null,null,null,null,null,null,null,null,null,null,null,null,null,null,null,null,null,null,null,null,null,null,null,null,null,null,null,null,null,null,null,null,null,null,null,null,null,null,null,null,null,null,null,null,null,null,null,null,null,49,700,null,5.5228661388157059E-3,-6.8885621316494158E-2,32.987510272970404,-5.365655724073477,"5636,6195935961-0,838429460366679i","100048,065595762-439,81437204757i",-25.459942046452696,0.23037112371852689,-8.6029355010835676E-6,-8.0640614553001866E-2,"5600-68898,2580966009i","-988540,224864273i","4902,61811286064-64433,7190849051i","0,999999953474402-0,000215697926774125i",1E-3,36.207334107636527,-85.661252008819702,null,32.993033139109222,-5.4345413453899711,10.747383458248329,-85.511521499654179,43.740416597357552,-90.946062845044153,269.05393715495586,null,0,0,0,0,0,0,0,0,0,0,0]
[null,null,null,null,null,null,null,null,null,null,null,null,null,null,null,null,null,null,null,null,null,null,null,null,null,null,null,null,null,null,null,null,null,null,null,null,null,null,null,null,null,null,null,null,null,null,null,null,null,null,null,50,750,null,5.9170102048925486E-3,-7.3809374681629583E-2,32.981880590479136,-5.7464269893413071,"5636,61957514357-0,89831727602349i","100047,779389246-471,228335620529i",-25.459929707560942,0.24682594655575937,-9.8758173633374367E-6,-8.6400650008532351E-2,"5600-64305,0408901608i","-922637,543206655i","4901,46739685853-60141,7168070383i","0,999999946590513-0,000231104919952804i",1E-3,35.61226677270313,-85.354029050486616,null,32.987797600684026,-5.8202363640229366,10.152327189324826,-85.193603753939385,43.140124790008855,-91.013840117962317,268.98615988203767,null,0,0,0,0,0,0,0,0,0,0,0]
[null,null,null,null,null,null,null,null,null,null,null,null,null,null,null,null,null,null,null,null,null,null,null,null,null,null,null,null,null,null,null,null,null,null,null,null,null,null,null,null,null,null,null,null,null,null,null,null,null,null,null,51,800,null,6.3111080035358324E-3,-7.873357489617519E-2,32.975870713066278,-6.1266876759165161,"5636,61955541844-0,958205091071852i","100047,473446161-502,642020157875i",-25.459916517750358,0.26328071613299858,-1.1236483775270156E-5,-9.2160683717628825E-2,"5600-60285,9758345257i","-864972,696756239i","4900,52053274494-56386,4461498742i","0,999999939231873-0,000246511912802332i",1E-3,35.056174368693071,-85.047072283530724,null,32.982181821069815,-6.2054212508126909,9.5962466144589378,-84.875952251115351,42.57842843552875,-91.081373501928041,268.91862649807194,null,0,0,0,0,0,0,0,0,0,0,0]
[null,null,null,null,null,null,null,null,null,null,null,null,null,null,null,null,null,null,null,null,null,null,null,null,null,null,null,null,null,null,null,null,null,null,null,null,null,null,null,null,null,null,null,null,null,null,null,null,null,null,null,52,850,null,6.7051595189364542E-3,-8.3658221948208766E-2,32.96948222725073,-6.5064052503494336,"5636,61953442072-1,01809290547121i","100047,14776687-534,055407060265i",-25.459902477029097,0.27973542889991265,-1.2684934646987988E-5,-9.7920715563864655E-2,"5600-56739,7419619066i","-814091,949888225i","4899,73067797652-53073,1897680406i","0,999999931398482-0,000261918905300764i",1E-3,34.534361704788466,-84.740414530207616,null,32.976187386769666,-6.5900634722976426,9.0744465428247238,-84.558599816871563,42.05063392959439,-91.148663289169207,268.85133671083076,null,0,0,0,0,0,0,0,0,0,0,0]
[null,null,null,null,null,null,null,null,null,null,null,null,null,null,null,null,null,null,null,null,null,null,null,null,null,null,null,null,null,null,null,null,null,null,null,null,null,null,null,null,null,null,null,null,null,null,null,null,null,null,null,53,900,null,7.0991647352224496E-3,-8.8583315825782827E-2,32.96271681387924,-6.8855474632320153,"5636,6195121504-1,077980719181i","100046,802351757-565,468477728953i",-25.45988758540517,0.29619008130626562,-1.4221169895116033E-5,-0.10368074543081139,"5600-53587,534075134i","-768864,619338879i","4899,06362870183-50128,2786134447i","0,999999923090341-0,000277325897426158i",1E-3,34.042939236187017,-84.4340859241278,null,32.969815978614463,-6.9741307790577984,8.5830374296119523,-84.241576588252343,41.552853408226412,-91.215707367310145,268.78429263268987,null,0,0,0,0,0,0,0,0,0,0,0]
[null,null,null,null,null,null,null,null,null,null,null,null,null,null,null,null,null,null,null,null,null,null,null,null,null,null,null,null,null,null,null,null,null,null,null,null,null,null,null,null,null,null,null,null,null,null,null,null,null,null,null,54,950,null,7.4931236364243307E-3,-9.350885651691998E-2,32.955576246676543,-7.2640823647286625,"5636,61948860752-1,13786853216066i","100046,437201234-596,881213565807i",-25.459871842887864,0.31264466980185951,-1.5845189416761337E-5,-0.10944077320204222,"5600-50767,1375448638i","-728398,060426306i","4898,4939380276-47493,5529100642i","0,999999914307448-0,000292732889156569i",1E-3,33.57864861955629,-84.128114573349308,null,32.963069370312965,-7.357591221245583,8.1187609314790095,-83.924910676749491,41.081830301791975,-91.282501897995076,268.71749810200492,null,0,0,0,0,0,0,0,0,0,0,0]
[null,null,null,null,null,null,null,null,null,null,null,null,null,null,null,null,null,null,null,null,null,null,null,null,null,null,null,null,null,null,null,null,null,null,null,null,null,null,null,null,null,null,null,null,null,null,null,null,null,null,null,55,1000,null,7.8870362069317721E-3,-9.843484400961322E-2,32.948062390724637,-7.6419783197235986,"5636,619463792-1,19775634436961i","100046,05231573-628,293595973361i",-25.459855249486168,0.32909919083660832,-1.7556993121335741E-5,-0.11520079876112961,"5600-48228,7806676206i","-691978,157404991i","4898,00235719731-45122,4848361722i","0,999999905049805-0,000308139880470055i",1E-3,33.138733066224631,-83.822527022323229,null,32.955949426931568,-7.7404131637332121,7.6788602597453419,-83.60862863024775,40.63480968667691,-91.349041793980959,268.65095820601903,null,0,0,0,0,0,0,0,0,0,0,0]
[null,null,null,null,null,null,null,null,null,null,null,null,null,null,null,null,null,null,null,null,null,null,null,null,null,null,null,null,null,null,null,null,null,null,null,null,null,null,null,null,null,null,null,null,null,null,null,null,null,null,null,56,1500,null,1.1823610228337229E-2,-0.14771929036037967,32.852865217403256,-11.379089343060778,"5636,61914564473-1,79663441514712i","100041,118148678-942,393890540826i",-25.459642519267653,0.49363990987674244,-3.9503134724310813E-5,-0.17280090707040227,"5600-32152,5204450804i","-461318,771603327i","4895,26478616313-30112,5049913173i","0,999999786362087-0,000462209765846449i",1E-3,29.688220213185026,-80.792937754267228,null,32.864688827631596,-11.526808633421158,4.2285381907826469,-80.472098751460891,37.09322701841424,-91.998907384882045,268.00109261511795,null,0,0,0,0,0,0,0,0,0,0,0]
[null,null,null,null,null,null,null,null,null,null,null,null,null,null,null,null,null,null,null,null,null,null,null,null,null,null,null,null,null,null,null,null,null,null,null,null,null,null,null,null,null,null,null,null,null,null,null,null,null,null,null,57,2000,null,1.5755533722117073E-2,-0.19704840344755661,32.72300041292614,-15.020354057544589,"5636,6187002386-2,39551236423587i","100034,211132806-1256,43839128453i",-25.459344714725095,0.65816997844108915,-7.0227546641813145E-5,-0.2304006660980763,"5600-24114,3903338103i","-345989,078702496i","4893,93914884827-22616,7639192141i","0,999999620199328-0,000616279585392511i",1E-3,27.287338848575079,-77.8255934539322,null,32.738755946648254,-15.217402460992146,1.8279239063033437,-77.397824141589183,34.566679852951594,-92.61522660258133,267.38477339741866,null,0,0,0,0,0,0,0,0,0,0,0]
[null,null,null,null,null,null,null,null,null,null,null,null,null,null,null,null,null,null,null,null,null,null,null,null,null,null,null,null,null,null,null,null,null,null,null,null,null,null,null,null,null,null,null,null,null,null,null,null,null,null,null,58,2500,null,1.9682790812755348E-2,-0.24642217079196652,32.561541921898083,-18.541199793835538,"5636,61812757368-2,99439015107304i","100025,332085825-1570,40851739086i",-25.458961853617673,0.82268584833404279,-1.097300425898995E-4,-0.28799995942354301,"5600-19291,5122670482i","-276791,262961996i","4892,92250302683-18126,7139522703i","0,999999406561577-0,000770349317164844i",1E-3,25.471815933356208,-74.938379537523915,null,32.581224712710842,-18.787621964627505,1.2744349695946511E-2,-74.403693648613412,32.593969062406785,-93.191315613240917,266.80868438675907,null,0,0,0,0,0,0,0,0,0,0,0]
[null,null,null,null,null,null,null,null,null,null,null,null,null,null,null,null,null,null,null,null,null,null,null,null,null,null,null,null,null,null,null,null,null,null,null,null,null,null,null,null,null,null,null,null,null,null,null,null,null,null,null,59,3000,null,2.3605365607894474E-2,-0.29584057962655913,32.372022955280315,-21.922251068254614,"5636,61742765005-3,59326773509574i","100014,482058664-1884,28570271785i",-25.458493958772742,0.98718397304179084,-1.5801038301807408E-4,-0.34559867063183919,"5600-16076,2602225402i","-230659,385801664i","4891,9427814244-15139,5047857107i","0,999999145448895-0,000924418939220098i",1E-3,24.033530433812519,-72.146071862626982,null,32.395628320888207,-22.218091647881174,-1.4251215353432407,-71.504486560217032,30.970506785544966,-93.722578208098213,266.27742179190182,null,0,0,0,0,0,0,0,0,0,0,0]
[null,null,null,null,null,null,null,null,null,null,null,null,null,null,null,null,null,null,null,null,null,null,null,null,null,null,null,null,null,null,null,null,null,null,null,null,null,null,null,null,null,null,null,null,null,null,null,null,null,null,null,60,3500,null,2.752324219883228E-2,-0.34530361689549954,32.158213239181968,-25.149502487696601,"5636,61660046779-4,19214507574123i","100001,662335155-2198,05139945177i",-25.457941058081065,1.1516608081518516,-2.1506827519666446E-4,-0.40319668331506286,"5600-13779,6516193202i","-197708,044972855i","4890,906857225-13011,056809355i","0,999998836861354-0,00107848842961497i",1E-3,22.860258791811855,-69.460371526026719,null,32.1857364813808,-25.494806104592101,-2.5978973345444061,-68.711907401189933,29.587839146836394,-94.206713505782034,265.79328649421797,null,0,0,0,0,0,0,0,0,0,0,0]
[null,null,null,null,null,null,null,null,null,null,null,null,null,null,null,null,null,null,null,null,null,null,null,null,null,null,null,null,null,null,null,null,null,null,null,null,null,null,null,null,null,null,null,null,null,null,null,null,null,null,null,61,4000,null,3.1436404660444436E-2,-0.39481126925328469,31.92391918914592,-28.214075065280614,"5636,61564602703-4,79102213244674i","99986,8744316596-2511,68708175605i",-25.457303184491579,1.3161128117719769,-2.8090337314896262E-4,-0.46079388107378166,"5600-12057,1951669051i","-172994,539351248i","4889,77593098274-11419,3294283336i","0,999998480799045-0,00123255776640622i",1E-3,21.88396206897011,-66.889944414056103,null,31.955355593806363,-28.608886334533899,-3.5736220188946177,-66.034625483357914,28.381733574911745,-94.643511817891806,265.35648818210819,null,0,0,0,0,0,0,0,0,0,0,0]
[null,null,null,null,null,null,null,null,null,null,null,null,null,null,null,null,null,null,null,null,null,null,null,null,null,null,null,null,null,null,null,null,null,null,null,null,null,null,null,null,null,null,null,null,null,null,null,null,null,null,null,62,4500,null,3.5344837051469569E-2,-0.44436352306383098,31.672822234775108,-31.111673887226498,"5636,6145643279-5,38989886464963i","99970,120096615-2825,17424941109i",-25.45658037600456,1.4805364449482949,-3.5551527770875425E-4,-0.51839014751844492,"5600-10717,5068150268i","-153772,923867776i","4888,53157225165-10185,4105017052i","0,999998077262067-0,00138662692765068i",1E-3,21.059870765751274,-64.440583673556318,null,31.708167071826576,-31.55603741029033,-4.3970651255309932,-63.478437376126472,27.311101946295583,-95.034474786416808,264.96552521358319,null,0,0,0,0,0,0,0,0,0,0,0]
[null,null,null,null,null,null,null,null,null,null,null,null,null,null,null,null,null,null,null,null,null,null,null,null,null,null,null,null,null,null,null,null,null,null,null,null,null,null,null,null,null,null,null,null,null,null,null,null,null,null,null,63,5000,null,3.9248523414378261E-2,-0.49396036439960406,31.40836131380378,-33.841873582322101,"5636,61335537053-5,98877523178728i","99951,4013100213-3138,49443144352i",-25.455772675664633,1.6449281720825724,-4.3890353651036774E-4,-0.57598536627079422,"5600-9645,75613352412i","-138395,631480998i","4887,1641826186-9201,95211774333i","0,999997626250536-0,00154069589140527i",1E-3,20.356699899918024,-62.11548115107022,null,31.44760983721816,-34.335833946721706,-5.0995116792831183,-61.04653834525844,26.348098157935041,-95.382372291980147,264.61762770801988,null,0,0,0,0,0,0,0,0,0,0,0]
[null,null,null,null,null,null,null,null,null,null,null,null,null,null,null,null,null,null,null,null,null,null,null,null,null,null,null,null,null,null,null,null,null,null,null,null,null,null,null,null,null,null,null,null,null,null,null,null,null,null,null,64,5500,null,4.3147447775623862E-2,-0.5436017790407125,31.133658205952877,-36.407342615846524,"5636,61201915511-6,58765119329721i","99930,7202828559-3451,62918974343i",-25.454880131551771,1.8092844613485699,-5.310676440028572E-4,-0.63357942096527942,"5600-8768,86921229465i","-125814,210437271i","4885,6684280815-8400,64140100613i","0,99999712776458-0,001694764635727i",1E-3,19.751571771847718,-59.915569843695941,null,31.176805653728501,-36.950944394887237,-5.7038394273480542,-58.739864803312649,25.472966226380446,-95.690809198199887,264.30919080180013,null,0,0,0,0,0,0,0,0,0,0,0]
[null,null,null,null,null,null,null,null,null,null,null,null,null,null,null,null,null,null,null,null,null,null,null,null,null,null,null,null,null,null,null,null,null,null,null,null,null,null,null,null,null,null,null,null,null,null,null,null,null,null,null,65,6000,null,{"$f":"20*LOG(IMABS(IMDIV(1,IMSUM(1,IMSUM(COMPLEX(0,2*pi*BA424/Wsh),COMPLEX(-BA424/(fsw_sh),0))))))","v":4.7041594145935978E-2},{"$f":"180/pi*IMARGUMENT(IMDIV(1,IMSUM(1,IMSUM(COMPLEX(0,2*pi*BA424/Wsh),COMPLEX(-BA424/(fsw_sh),0)))))","v":-0.59328775247401477},{"$f":"20*LOG(IMABS(IMPRODUCT(A_INTCOMP2VOUT,IMDIV(COMPLEX(1, 2*pi*BA424/Wesr_zero),COMPLEX(1, 2*pi*BA424/Wload_pole)))))","v":30.851479719175185},{"$f":"180/pi*IMARGUMENT(IMPRODUCT(A_INTCOMP2VOUT,IMDIV(COMPLEX(1, 2*pi*BA424/Wesr_zero),COMPLEX(1, 2*pi*BA424/Wload_pole))))","v":-38.813089672674913},{"$f":"IMDIV(IMPRODUCT(COMPLEX(R.fb_bot,0),IMDIV(COMPLEX(1,0),COMPLEX(0,2*pi*BA424*C.fb_bot))),IMSUM(COMPLEX(R.fb_bot,0),IMDIV(COMPLEX(1,0),COMPLEX(0,2*pi*BA424*C.fb_bot))) )","v":"5636,61055568179-7,18652670861698i"},{"$f":"IMSUM(COMPLEX(R.fb_top1,0),IMDIV(IMPRODUCT(COMPLEX(R.fb_top2,0),IMDIV(COMPLEX(1,0),COMPLEX(0,2*pi*BA424*C.fb_top))),IMSUM(COMPLEX(R.fb_top2,0),IMDIV(COMPLEX(1,0),COMPLEX(0,2*pi*BA424*C.fb_top))) ))","v":"99908,0794564213-3764,56012266789i"},-25.45390279677229,{"$f":"180/pi*IMARGUMENT(IMDIV(BG424,IMSUM(BG424,BH424)))","v":1.9736017851071694},{"$f":"20*LOG(IMABS(IMDIV(A.fb_buf,IMSUM(COMPLEX(1,0),COMPLEX(0,2*pi*BA424*R.fb_buf*C.fb_buf)))))","v":-6.3200704144106452E-4},{"$f":"180/pi*IMARGUMENT(IMDIV(A.fb_buf,IMSUM(COMPLEX(1,0),COMPLEX(0,2*pi*BA424*R.fb_buf*C.fb_buf))))","v":-0.69117219525045592},{"$f":"IMSUM(COMPLEX(R.comp,0),IMDIV(COMPLEX(1,0),COMPLEX(0,2*pi*BA424*C.comp)))","v":"5600-8038,1301112701i"},{"$f":"IMDIV(COMPLEX(1,0),COMPLEX(0,2*pi*BA424*C.hf))","v":"-115329,692900832i"},{"$f":"IMDIV(COMPLEX(1,0),IMSUM(IMDIV(COMPLEX(1,0),BM424),IMSUM(IMDIV(COMPLEX(1,0),BN424),IMDIV(COMPLEX(1,0),COMPLEX(R.eaout,0)))))","v":"4884,04121357267-7735,93591605084i"},{"$f":"IMDIV(IMDIV(COMPLEX(1,0),COMPLEX(0,2*pi*BA424*0.00000000000226)),IMSUM(COMPLEX(21700,0),IMDIV(COMPLEX(1,0),COMPLEX(0,2*pi*BA424*0.00000000000226))) )","v":"0,999996581804341-0,001848833138673i"},{"$f":"GM*A.comp_buffer","v":1E-3},19.227165176357058,{"$f":"180/pi*IMARGUMENT(IMPRODUCT(BQ424,IMPRODUCT(BO424,BP424)) )","v":-57.839898514795202},null,30.898521313321119,-39.406377425148925,-6.2273696274566746,-56.55746892493849,24.671151685864444,-95.963846350087408,264.03615364991259,null,{"$f":"IF(AND(BY425<$CC$355,BY424>=$CC$355),(($CC$355-BY424)/(BY425-BY424)*(BA425-BA424)+BA424),0)","v":0},{"$f":"IF(AND(BA425>$CD$355,BA424<=$CD$355),(($CD$355-BA424)/(BA425-BA424)*(BZ425-BZ424)+BZ424),0)","v":0},{"$f":"IF(AND(BZ425<$CE$355,BZ424>=$CE$355),(($CE$355-BZ424)/(BZ425-BZ424)*(BA425-BA424)+BA424),0)","v":0},{"$f":"IF(AND(BA425>$CF$355,BA424<=$CF$355),(($CF$355-BA424)/(BA425-BA424)*(BY425-BY424)+BY424),0)","v":0},{"$f":"IF(AND(BF425<$CG$355,BF424>=$CG$355),(($CG$355-BF424)/(BF425-BF424)*(BA425-BA424)+BA424),0)","v":0},0,{"$f":"IF(AND(BF425>$CI$355,BF424<=$CI$355),(($CI$355-BF424)/(BF425-BF424)*(BA425-BA424)+BA424),0)","v":0},{"$f":"IF(AND(BX425>$CJ$355,BX424<=$CJ$355),(($CJ$355-BX424)/(BX425-BX424)*(BA425-BA424)+BA424),0)","v":0},0,{"$f":"IF(AND(BX425<$CL$355,BX424>=$CL$355),(($CL$355-BX424)/(BX425-BX424)*(BA425-BA424)+BA424),0)","v":0},0]
[null,null,null,null,null,null,null,null,null,null,null,null,null,null,null,null,null,null,null,null,null,null,null,null,null,null,null,null,null,null,null,null,null,null,null,null,null,null,null,null,null,null,null,null,null,null,null,null,null,null,null,66,6500,null,5.0930946520229239E-2,-0.64301826989222632,30.564228639245648,-41.065785266301525,"5636,60896495078-7,78540173718425i","99883,481501626-4077,26886862953i",{"$f":"20*LOG(IMABS(IMDIV(BG425,IMSUM(BG425,BH425))))","v":-25.452840729448081},2.1378766203202813,-7.4172111692685555E-4,-0.74876357279040073,"5600-7419,81241040317i","-106458,178062306i","4882,28070234536-7176,30580808158i","0,999995988369976-0,00200290137830046i",1E-3,{"$f":"20*LOG(IMABS(IMPRODUCT(BQ425,IMPRODUCT(BO425,BP425)) ))","v":18.770009875896768},-55.886006308428001,null,{"$f":"BC425+BE425","v":30.615159585765877},{"$f":"BD425+BF425","v":-41.708803536193749},{"$f":"BI425+BK425+BR425","v":-6.68357257466824},{"$f":"BJ425+BL425+BS425","v":-54.496893260898119},{"$f":"BU425+BW425","v":23.931587011097637},{"$f":"BV425+BX425","v":-96.205696797091861},{"$f":"BZ425+360","v":263.79430320290817},null,0,0,0,0,0,{"$f":"IF(AND(BF426<$CG$355,BF425>=$CG$355),(($CG$355-BF425)/(BF426-BF425)*(BY426-BY425)+BY425),0)","v":0},0,0,{"$f":"IF(AND(BX426>$CJ$355,BX425<=$CJ$355),(($CJ$355-BX425)/(BX426-BX425)*(BY426-BY425)+BY425),0)","v":0},0,{"$f":"IF(AND(BX426<$CL$355,BX425>=$CL$355),(($CL$355-BX425)/(BX426-BX425)*(BY426-BY425)+BY425),0)","v":0}]
[null,null,null,null,null,null,null,null,null,null,null,null,null,null,null,null,null,null,null,null,null,null,null,null,null,null,null,null,null,null,null,null,null,null,null,null,null,null,null,null,null,null,null,null,null,null,null,null,null,null,null,67,7000,null,5.4815488877709116E-2,-0.69279331619307361,30.27395516095002,-43.173185523526996,"5636,60724696229-8,38427623843679i","99856,9293181983-4389,73710966864i",-25.451693992705344,2.302105448963593,-8.6020920540602001E-4,-0.80635343726614084,"5600-6889,82580966009i","-98854,0224864273i","4880,3858066772-6699,22931207014i","0,999995347461652-0,00215696933266678i",1E-3,18.369410552585428,-54.050274197890246,null,30.328770649827728,-43.865978839720071,-7.0831436493253221,-52.554522186192791,23.245627000502406,-96.42050102591287,263.57949897408713,null,0,0,0,0,7463.5455396398138,22.652970800998794,0,0,0,0,0]
[null,null,null,null,null,null,null,null,null,null,null,null,null,null,null,null,null,null,null,null,null,null,null,null,null,null,null,null,null,null,null,null,null,null,null,null,null,null,null,null,null,null,null,null,null,null,null,null,null,null,null,68,7500,null,5.8695205182199069E-2,-0.74261287597833603,29.982381474443226,-45.143665573763791,"5636,60540171658-8,98315017181261i","99828,426033833-4701,94657500721i",-25.450462654662097,2.466284758437479,-9.8747058867002034E-4,-0.86394167237701514,"5600-6430,50408901608i","-92263,7543206655i","4878,35590767726-6288,19005839712i","0,999994659079552-0,00231103697982941i",1E-3,18.016736178841168,-52.328238900331151,null,30.041076679625426,-45.886278449742129,-7.4347139464095982,-50.725895814270686,22.606362733215828,-96.612174264012822,263.38782573598718,null,0,0,0,0,0,0,0,0,0,0,0]
[null,null,null,null,null,null,null,null,null,null,null,null,null,null,null,null,null,null,null,null,null,null,null,null,null,null,null,null,null,null,null,null,null,null,null,null,null,null,null,null,null,null,null,null,null,null,null,null,null,null,null,69,8000,null,6.2570079382064048E-2,-0.79247693355303506,29.690933644044012,-46.985857309255159,"5636,60342921388-9,58202349674964i","99797,9750032731-5013,87904458372i",-25.449146788414954,2.6304110419767279,-1.1235044954021299E-3,-0.92152816184214414,"5600-6028,59758345257i","-86497,2696756239i","4876,19069352459-5930,8003890354i","0,999993923223873-0,00246510429784602i",1E-3,17.704931707768672,-50.714862251825593,null,29.753503723426075,-47.778334242808192,-7.7453385851416847,-49.005979371691012,22.00816513828439,-96.784313614499212,263.21568638550082,null,0,0,0,0,0,0,0,0,0,0,0]
[null,null,null,null,null,null,null,null,null,null,null,null,null,null,null,null,null,null,null,null,null,null,null,null,null,null,null,null,null,null,null,null,null,null,null,null,null,null,null,null,null,null,null,null,null,null,null,null,null,null,null,70,8500,null,6.6440095410549127E-2,-0.84238547292449761,29.40077645361065,-48.708379331302623,"5636,60132945445-10,1808961726861i","99765,5798073254-5325,51635256693i",-25.447746472024818,2.7944807990581073,-1.2683101011657361E-3,-0.97911278940177615,"5600-5673,97419619066i","-81409,1949888225i","4873,89006216941-5617,58703287511i","0,999993139894825-0,00261917126477439i",1E-3,17.428170770528492,-49.204754535461014,null,29.467216549021199,-49.550764804227121,-8.0208440115974931,-47.389386525804682,21.446372537423706,-96.940151330031796,263.05984866996823,null,0,0,0,0,0,0,0,0,0,0,0]
[null,null,null,null,null,null,null,null,null,null,null,null,null,null,null,null,null,null,null,null,null,null,null,null,null,null,null,null,null,null,null,null,null,null,null,null,null,null,null,null,null,null,null,null,null,null,null,null,null,null,null,71,9000,null,7.0305237185668779E-2,-0.89233847780150366,29.112848260666997,-50.319644079203556,"5636,59910243858-10,7797681590603i","99731,244251811-5636,84039084765i",-25.446261788501417,2.9584905358066025,-1.4218865284129222E-3,-1.0366954388187424,"5600-5358,7534075134i","-76886,4619338879i","4871,45406069599-5341,1815560781i","0,999992309092629-0,00277323785867247i",1E-3,17.181601240479129,-47.792353939227667,null,29.183153497852665,-51.211982557005058,-8.2660824345507002,-45.870558842239809,20.917071063301965,-97.08254139924486,262.91745860075514,null,0,0,0,0,0,0,0,9305.1052928990812,20.611883673156168,0,0]
[null,null,null,null,null,null,null,null,null,null,null,null,null,null,null,null,null,null,null,null,null,null,null,null,null,null,null,null,null,null,null,null,null,null,null,null,null,null,null,null,null,null,null,null,null,null,null,null,null,null,null,72,9500,null,7.4165488610453523E-2,-0.94233593159341356,28.827894001216055,-51.827726968910639,"5636,59674816659-11,3786394153108i","99694,9723664519-5947,83311250667i",-25.444692825787108,3.1224367653993079,-1.5842328465422674E-3,-1.0942759938798319,"5600-5076,71375448638i","-72839,8060426306i","4868,88284634137-5095,76645981805i","0,999991430817524-0,00292730405759841i",1E-3,16.961154092904728,-46.472066483674517,null,28.90205948982651,-52.770062900504051,-8.4851229657289231,-44.443905712155043,20.416936524097586,-97.213968612659102,262.78603138734093,null,0,0,0,0,0,0,0,0,0,0,0]
[null,null,null,null,null,null,null,null,null,null,null,null,null,null,null,null,null,null,null,null,null,null,null,null,null,null,null,null,null,null,null,null,null,null,null,null,null,null,null,null,null,null,null,null,null,null,null,null,null,null,null,73,10000,null,7.8020833573279519E-2,-0.99237781740925524,28.546495307241457,-53.240283681133668,"5636,59426663875-11,9775099008761i","99656,7684036929-6258,47653525789i",-25.443039676740188,3.286316008467316,-1.7553480718920603E-3,-1.15185433839722,"5600-4822,87806676206i","-69197,8157404991i","4866,17666073353-4876,68744881938i","0,999990505069758-0,00308136983961052i",1E-3,16.763396765488952,-45.23837177452257,null,28.624516140814737,-54.232661498542925,-8.681398259323128,-43.103910104452474,19.943117881491609,-97.336571602995406,262.66342839700462,null,0,0,0,0,0,0,0,0,0,0,0]
[null,null,null,null,null,null,null,null,null,null,null,null,null,null,null,null,null,null,null,null,null,null,null,null,null,null,null,null,null,null,null,null,null,null,null,null,null,null,null,null,null,null,null,null,null,null,null,null,null,null,null,74,15000,null,0.11630087285839216,-1.4952365044069167,25.983276727820417,-63.461040657245583,"5636,5624523731-17,9661634454836i","99169,5566351816-9341,79618505903i",-25.421901842338404,4.9206648419571746,-3.9485359210793408E-3,-1.727490663297522,"5600-3215,25204450804i","-46131,8771603327i","4831,78134470121-3554,0088034729i","0,999978636660509-0,00462199990245747i",1E-3,15.560167489499719,-36.601112030341064,null,26.09957760067881,-64.956277161652494,-9.8656828887597641,-33.40793785168141,16.233894711919046,-98.364215013333904,261.63578498666607,null,0,0,0,0,0,0,0,0,0,0,0]
[null,null,null,null,null,null,null,null,null,null,null,null,null,null,null,null,null,null,null,null,null,null,null,null,null,null,null,null,null,null,null,null,null,null,null,null,null,null,null,null,null,null,null,null,null,null,null,null,null,null,null,75,20000,null,0.15407243801749848,-2.0025175505247845,23.877165829668463,-69.389928726996416,"5636,51791300452-23,9546953056586i","98495,4129966396-12371,0128762776i",-25.392483202869943,6.5445581246141176,-7.0171393981603497E-3,-2.302778369588089,"5600-2411,43903338103i","-34598,9078702496i","4784,4607214404-2978,1961619609i","0,999962021360845-0,00616256413987119i",1E-3,15.018738007732155,-32.254240846652309,null,24.031238267685961,-71.392446277521202,-10.38076233453595,-28.012461091626278,13.650475933150011,-99.40490736914748,260.59509263085249,null,0,0,0,0,0,0,0,0,0,0,0]
[null,null,null,null,null,null,null,null,null,null,null,null,null,null,null,null,null,null,null,null,null,null,null,null,null,null,null,null,null,null,null,null,null,null,null,null,null,null,null,null,null,null,null,null,null,null,null,null,null,null,null,76,25000,null,0.19131919402219583,-2.5141989745308777,22.133490753474621,-73.174346253334775,"5636,46064913634-29,9430649241973i","97642,0145608815-15329,7146104174i",-25.35495404192983,8.1546995089281271,-1.0959303492144129E-2,-2.877601907367092,"5600-1929,15122670482i","-27679,1262961996i","4724,97133974661-2697,07154185627i","0,999940659644007-0,00770304061490151i",1E-3,14.712593228617148,-30.159629586253679,null,22.324809947496817,-75.68854522786566,-10.653320116804824,-24.882531984692644,11.671489830691993,-100.57107721255831,259.42892278744171,null,0,0,0,0,0,0,0,0,0,0,0]
[null,null,null,null,null,null,null,null,null,null,null,null,null,null,null,null,null,null,null,null,null,null,null,null,null,null,null,null,null,null,null,null,null,null,null,null,null,null,null,null,null,null,null,null,null,null,null,null,null,null,null,77,30000,null,0.2280246888067044,-3.0302556050078144,20.659321792544205,-75.770884014935362,"5636,39066154421-35,9312317475579i","96618,8544214767-18202,7964299805i",-25.309527699395417,9.7479475336691888,-1.5772649597198124E-2,-3.451846286726393,"5600-1607,62602225402i","-23065,9385801664i","4654,24341362868-2559,18038086244i","0,999914552118394-0,00924340739476426i",1E-3,14.503873116640861,-29.334261429664416,null,20.88734648135091,-78.801139619943172,-10.821427232351756,-23.038160182721619,10.065919248999155,-101.83929980266478,258.16070019733525,null,0,0,0,0,0,0,0,0,0,0,0]
[null,null,null,null,null,null,null,null,null,null,null,null,null,null,null,null,null,null,null,null,null,null,null,null,null,null,null,null,null,null,null,null,null,null,null,null,null,null,null,null,null,null,null,null,null,null,null,null,null,null,null,78,35000,null,0.26417236888985118,-3.5506589992027493,19.387762313283396,-77.650043564075176,"5636,3079511761-41,9191552267774i","95436,9860161616-20976,6894520739i",-25.256456680271032,11.32134606439042,-2.1454280281731991E-2,-4.0253972145789936,"5600-1377,96516193202i","-19770,8044972855i","4573,33940437483-2499,1208920708i","0,999883699527513-0,0107836425518818i",1E-3,14.338958602000393,-29.272498495043724,null,19.651934682173248,-81.200702563277929,-10.93895235855237,-21.976549645232296,8.7129823236208779,-103.17725220851023,256.82274779148975,null,0,0,0,0,0,0,0,0,0,0,0]
[null,null,null,null,null,null,null,null,null,null,null,null,null,null,null,null,null,null,null,null,null,null,null,null,null,null,null,null,null,null,null,null,null,null,null,null,null,null,null,null,null,null,null,null,null,null,null,null,null,null,null,79,40000,null,0.2997455958807308,-4.0753773649343081,18.272239558628321,-79.065714241965566,"5636,21251915227-47,9067948183856i","94108,7382362051-23639,5343658365i",-25.196028213328962,12.872149849527341,-2.8000785076029377E-2,-4.5981412293985429,"5600-1205,71951669051i","-17299,4539351248i","4483,41549034507-2483,88428567758i","0,999848102749932-0,0123237241649231i",1E-3,14.194055991753437,-29.693332947501929,null,18.571985154509051,-83.141091606899877,-11.029973006651552,-21.419324327373133,7.5420121478574984,-104.56041593427301,255.43958406572699,null,0,0,0,0,0,0,0,0,0,0,0]
[null,null,null,null,null,null,null,null,null,null,null,null,null,null,null,null,null,null,null,null,null,null,null,null,null,null,null,null,null,null,null,null,null,null,null,null,null,null,null,null,null,null,null,null,null,null,null,null,null,null,null,80,45000,null,0.33472766386255459,-4.604375485953442,17.279856443339412,-80.165688680228484,"5636,10436676523-53,8941099853205i","92647,414312705-26181,2966422932i",-25.128559415590871,14.397844782965265,-3.5408247254628496E-2,-5.1699658334793881,"5600-1071,75068150268i","-15377,2923867776i","4385,68380127832-2494,96859342154i","0,999807762799213-0,0138636303198436i",1E-3,14.057593924759688,-30.429520312219701,null,17.614584107201967,-84.770064166181925,-11.106373738085813,-21.201641362733824,6.5082103691161546,-105.97170552891575,254.02829447108425,null,0,0,0,0,0,0,0,0,0,0,0]
[null,null,null,null,null,null,null,null,null,null,null,null,null,null,null,null,null,null,null,null,null,null,null,null,null,null,null,null,null,null,null,null,null,null,null,null,null,null,null,null,null,null,null,null,null,null,null,null,null,null,null,81,50000,null,0.36910181764808814,-5.1376146511631298,16.386797784607257,-81.041408118277275,"5635,98349547967-59,8810601978424i","91066,9871665936-28593,8238746673i",-25.054392221820351,15.89616269632193,-4.3672251585033808E-2,-5.7407596223390893,"5600-964,575613352412i","-13839,5631480998i","4281,37671859905-2521,21932937139i","0,999762680823843-0,0154033391109241i",1E-3,13.923605503367387,-31.37569468485081,null,16.755899602255344,-86.179022769440408,-11.174458970037996,-21.220291610867967,5.5814406322173475,-107.39931438030837,252.60068561969163,null,0,0,0,0,0,0,0,0,0,0,0]
[null,null,null,null,null,null,null,null,null,null,null,null,null,null,null,null,null,null,null,null,null,null,null,null,null,null,null,null,null,null,null,null,null,null,null,null,null,null,null,null,null,null,null,null,null,null,null,null,null,null,null,82,55000,null,0.40285127189143621,-5.6750525881113472,15.575383444960686,-81.752314886728612,"5635,84990693245-65,8676049344489i","89381,8028309441-30870,8484831198i",-24.973888233111879,17.365090723888553,-5.2787893010941209E-2,-6.3104124109010726,"5600-876,886921229465i","-12581,4210437271i","4171,71467421891-2555,56700441069i","0,999712858107148-0,0169428286418081i",1E-3,13.788928516476711,-32.462327160380724,null,15.978234716852121,-87.427367474839954,-11.237747609646108,-21.407648847393244,4.7404871072060129,-108.8350163222332,251.1649836777668,null,0,0,0,0,0,0,0,0,0,0,0]
[null,null,null,null,null,null,null,null,null,null,null,null,null,null,null,null,null,null,null,null,null,null,null,null,null,null,null,null,null,null,null,null,null,null,null,null,null,null,null,null,null,null,null,null,null,null,null,null,null,null,null,83,60000,null,0.4359592310420532,-6.2166434011744167,14.832179614638413,-82.33865144970359,"5635,7036029325-71,8537036827878i","87606,3018795051-33007,9413041086i",-24.887423626582695,18.802875477796569,-6.2749786234495536E-2,-6.878815356112927,"5600-803,81301112701i","-11532,9692900832i","4057,87852176411-2593,38586634077i","0,999658296067207-0,0184820770265398i",1E-3,13.651903077210793,-33.641796198747166,null,15.268138845680467,-88.555294850878013,-11.298270335606396,-21.717736077063524,3.96986851007407,-110.27303092794153,249.72696907205847,null,0,0,0,0,0,0,0,0,0,0,0]
[null,null,null,null,null,null,null,null,null,null,null,null,null,null,null,null,null,null,null,null,null,null,null,null,null,null,null,null,null,null,null,null,null,null,null,null,null,null,null,null,null,null,null,null,null,null,null,null,null,null,null,84,65000,null,0.46840891011681896,-6.7623375148539129,14.146765483133819,-82.828599568927231,"5635,54458546082-77,8393159405711i","85754,7667324462-35002,4232387074i",-24.795384250702959,20.208022431647102,-7.355207615875288E-2,-7.4458610756743138,"5600-741,981241040317i","-10645,8178062306i","3940,98710452572-2631,59959796925i","0,99959899625675-0,020021062390599i",1E-3,13.51171667448309,-34.880509165209553,null,14.615174393250639,-89.590937083781142,-11.357219652378621,-22.118347809236766,3.2579547408720178,-111.70928489301791,248.29071510698208,null,0,0,0,0,0,0,0,0,0,0,0]
[null,null,null,null,null,null,null,null,null,null,null,null,null,null,null,null,null,null,null,null,null,null,null,null,null,null,null,null,null,null,null,null,null,null,null,null,null,null,null,null,null,null,null,null,null,null,null,null,null,null,null,85,{"$f":"BA426*10","v":70000},null,0.50018355626445954,-7.3120816226101022,13.510908505862067,-83.242466879927974,"5635,37285667034-83,8244012164875i","83841,1004704235-36853,243127271i",-24.698161009719797,21.579291032469687,-8.5188449148575915E-2,-8.01144376257011,"5600-688,982580966008i","-9885,40224864273i","3822,08021481896-2668,16011573552i","0,999534960363042-0,0215597628719374i",1E-3,13.368052603624507,-36.15422377458637,null,14.011092062126528,-90.554548502538083,-11.415296855243865,-22.586376504686793,2.5957952068826629,-113.14092500722488,246.85907499277511,null,0,0,0,0,0,0,0,0,0,0,0]
[null,null,null,null,null,null,null,null,null,null,null,null,null,null,null,null,null,null,null,null,null,null,null,null,null,null,null,null,null,null,null,null,null,null,null,null,null,null,null,null,null,null,null,null,null,null,null,null,null,null,null,86,75000,null,0.53126647109053105,-7.8658186416533935,12.917999428605345,-83.595248594432547,"5635,18841888596-89,8089190311165i","81878,6405626614-38560,8303843798i",-24.596145617708917,22.915686142056778,-9.7652145065214135E-2,-8.5754592951263984,"5600-643,050408901608i","-9226,37543206655i","3702,10677805897-2701,72564480121i","0,999466190207771-0,0230981566220108i",1E-3,13.22089057716542,-37.445147927160001,null,13.449265899695876,-91.461067236085938,-11.472907185608712,-23.104921080229623,1.9763587140871639,-114.56598831631555,245.43401168368445,null,0,0,0,0,0,0,0,0,0,0,0]
[null,null,null,null,null,null,null,null,null,null,null,null,null,null,null,null,null,null,null,null,null,null,null,null,null,null,null,null,null,null,null,null,null,null,null,null,null,null,null,null,null,null,null,null,null,null,null,null,null,null,null,87,80000,null,0.56164103370722263,-8.4234876741120139,12.362656311354796,-83.898253126248377,"5634,99127460429-95,7928289178365i","79880,0088590708-40126,9307506537i",-24.489726779630775,24.216446451178129,-0.11093597002769945,-9.1378053423282868,"5600-602,859758345257i","-8649,72696756239i","3581,91782293023-2731,45161004504i","0,999392687746913-0,0246362218068126i",1E-3,13.070388304899796,-38.740071980696897,null,12.924297345062019,-92.321740800360388,-11.53027444475868,-23.661430871847053,1.3940229003033391,-115.98317167220745,244.01682832779255,null,0,0,0,0,0,0,0,0,0,0,0]
[null,null,null,null,null,null,null,null,null,null,null,null,null,null,null,null,null,null,null,null,null,null,null,null,null,null,null,null,null,null,null,null,null,null,null,null,null,null,null,null,null,null,null,null,null,null,null,null,null,null,null,88,85000,null,0.59129072446322439,-8.9850239749876,11.840441095911347,-84.160166732168307,"5634,78142649375-101,77609042374i","77856,9974213063-41554,4329092753i",-24.3792868347115,25.481030518012197,-0.12503230985166236,-9.6983814641667827,"5600-567,397419619066i","-8140,91949888225i","3462,26362046997-2756,84884827444i","0,999314455070595-0,0261739366079038i",1E-3,12.916808453048322,-40.029124030542391,null,12.431731820374571,-93.145190707155905,-11.58751069151484,-24.246474976696977,0.844221128859731,-117.39166568385288,242.60833431614714,null,0,0,0,0,0,0,0,0,0,0,0]
[null,null,null,null,null,null,null,null,null,null,null,null,null,null,null,null,null,null,null,null,null,null,null,null,null,null,null,null,null,null,null,null,null,null,null,null,null,null,null,null,null,null,null,null,null,null,null,null,null,null,null,89,90000,null,0.62019914930961395,-9.5503589273000902,11.347652803064584,-84.387770208852828,"5634,55887739435-107,758663110542i","75820,4883379985-42847,1927997749i",-24.265198877520554,26.709101061075934,-0.13993314411453631,-10.25708920680168,"5600-535,87534075134i","-7688,64619338879i","3343,794281983-2777,6840036561i","0,999231494402948-0,0277112792234429i",1E-3,12.760472243248493,-41.304914432281606,null,11.967851952374197,-93.938129136152924,-11.644659778386597,-24.852902578007352,0.32319217398760003,-118.79103171416028,241.20896828583972,null,93261.97641841654,-119.69791135306227,0,0,0,0,0,0,0,0,0]
[null,null,null,null,null,null,null,null,null,null,null,null,null,null,null,null,null,null,null,null,null,null,null,null,null,null,null,null,null,null,null,null,null,null,null,null,null,null,null,null,null,null,null,null,null,null,null,null,null,null,null,90,95000,null,0.64835006474716583,-10.119420024810863,10.881173993993436,-84.586433182570289,"5634,32363031772-113,740506555491i","73780,404608453-44009,8613621892i",-24.147824354943634,27.900508093439718,-0.15563006079464331,-10.813832192358008,"5600-507,671375448638i","-7283,98060426306i","3227,06308382997-2793,90758340306i","0,999143808101944-0,0292482278692132i",1E-3,12.601729351312187,-42.561931346771104,null,11.529524058740602,-94.705853207381153,-11.701725064426089,-25.475255445689392,-0.17220100568548702,-120.18110865307054,239.81889134692946,null,0,0,0,0,0,0,0,0,0,0,0]
[null,null,null,null,null,null,null,null,null,null,null,null,null,null,null,null,null,null,null,null,null,null,null,null,null,null,null,null,null,null,null,null,null,null,null,null,null,null,null,null,null,null,null,null,null,null,null,null,null,null,null,91,100000,null,0.67572740329722736,-10.692130862698896,10.4383549648831,-84.760462402293868,"5634,07568844681-119,721580352276i","71745,6884761569-45047,7202702373i",-24.02751112320243,29.05527142569462,-0.17211427143023184,-11.36851620319597,"5600-482,287806676206i","-6919,78157404991i","3112,53181872902-2805,60091826147i","0,999051398659236-0,0307847607796489i",1E-3,12.440938149555659,-43.796102975221942,null,11.114082368180327,-95.452593264992771,-11.758687245077002,-26.109347752723291,-0.64460487689667545,-121.56194101771607,238.43805898228393,null,0,0,0,0,0,0,0,0,0,0,0]
[null,null,null,null,null,null,null,null,null,null,null,null,null,null,null,null,null,null,null,null,null,null,null,null,null,null,null,null,null,null,null,null,null,null,null,null,null,null,null,null,null,null,null,null,null,null,null,null,null,null,null,92,150000,null,0.90359789979066074,-16.600403282858476,6.9314403348858491,-85.685339060639947,"5630,89887867008-179,481111854947i","53008,6957101873-49912,3844320677i",-22.727596771517575,38.679401089646852,-0.37808725111234098,-16.783069256752384,"5600-321,525204450804i","-4613,18771603327i","2139,18086163071-2728,12490927551i","0,997868174798587-0,0461224513954321i",1E-3,10.789328448344746,-54.545645027812618,null,7.8350382346765102,-102.28574234349843,-12.31635557428517,-32.64931319491815,-4.4813173396086601,-134.93505553841658,225.06494446158342,null,0,0,0,0,0,0,0,0,0,0,0]
[null,null,null,null,null,null,null,null,null,null,null,null,null,null,null,null,null,null,null,null,null,null,null,null,null,null,null,null,null,null,null,null,null,null,null,null,null,null,null,null,null,null,null,null,null,null,null,null,null,null,null,93,200000,null,1.038764435914171,-22.761808582739082,4.4395693050316609,-85.903821710718077,"5626,45735888435-239,119388534882i","38822,6735516293-48723,1684193641i",-21.395287753070331,45.332539578857485,-0.65096310716198924,-21.906400886719972,"5600-241,143903338103i","-3459,89078702496i","1487,80705798601-2476,5904101728i","0,996216362128817-0,0613948039791861i",1E-3,9.1988772089018891,-62.531311858813169,null,5.4783337409458319,-108.66563029345716,-12.847373651330431,-39.105173166675655,-7.3690399103845987,-147.77080346013281,212.22919653986719,null,0,0,0,0,0,0,0,0,0,247137.08290965063,-9.647384284186673]
[null,null,null,null,null,null,null,null,null,null,null,null,null,null,null,null,null,null,null,null,null,null,null,null,null,null,null,null,null,null,null,null,null,null,null,null,null,null,null,null,null,null,null,null,null,null,null,null,null,null,null,94,250000,null,1.07212568360097,-29.04440910920021,2.5064028543337336,-85.839145934163682,"5620,75711862027-298,596416798864i","28890,0524533976-45301,8390335871i",-20.137867470857394,49.840339177110039,-0.97835273364989117,-26.686801265309754,"5600-192,915122670482i","-2767,91262961996i","1069,21409438957-2202,59275182287i","0,994100621451828-0,0765805189386789i",1E-3,7.7519298960666649,-68.511566017148297,null,3.5785285379347034,-114.88355504336388,-13.364290308440621,-45.358028105348012,-9.7857617705059177,-160.2415831487119,199.7584168512881,null,0,0,0,0,0,0,0,0,0,0,0]
[null,null,null,null,null,null,null,null,null,null,null,null,null,null,null,null,null,null,null,null,null,null,null,null,null,null,null,null,null,null,null,null,null,null,null,null,null,null,null,null,null,null,null,null,null,null,null,null,null,null,null,95,300000,null,1.0013345747681648,-35.299886360237537,0.92745950841018687,-85.632941197889906,"5613,80582405936-357,87256448758i","22013,2698723097-41399,7797548135i",-18.988707346260057,52.863593457720654,-1.3476309611210282,-31.097993881709566,"5600-160,762602225402i","-2306,59385801664i","795,6225987379-1956,03943788839i","0,991526888770507-0,0916587017995886i",1E-3,6.4555225373203058,-73.147416687790013,null,1.9287940831783517,-120.93282755812744,-13.880815770060778,-51.381817111778929,-11.952021686882427,-172.31464466990639,187.68535533009361,null,0,0,333221.54933385365,-13.298593541528078,0,0,0,0,0,0,0]
[null,null,null,null,null,null,null,null,null,null,null,null,null,null,null,null,null,null,null,null,null,null,null,null,null,null,null,null,null,null,null,null,null,null,null,null,null,null,null,null,null,null,null,null,null,null,null,null,null,null,null,96,350000,null,0.83132330690469047,-41.383667485136385,-0.40662740909411155,-85.346039714673736,"5605,61279235091-416,908648035696i","17184,7182174404-37681,2055719155i",-17.950151549092212,54.858651837135355,-1.7470662717726202,-35.134918165465521,"5600-137,796516193202i","-1977,08044972855i","610,887367136622-1746,37242921268i","0,988502333966561-0,106608956984031i",1E-3,5.293846028817538,-76.87549370753672,null,0.42469589781057893,-126.72970719981012,-14.403371792047295,-57.151760035866886,-13.978675894236716,-183.88146723567701,176.11853276432299,null,0,0,0,0,0,0,0,0,0,0,0]
[null,null,null,null,null,null,null,null,null,null,null,null,null,null,null,null,null,null,null,null,null,null,null,null,null,null,null,null,null,null,null,null,null,null,null,null,null,null,null,null,null,null,null,null,null,null,null,null,null,null,null,97,400000,null,{"$f":"20*LOG(IMABS(IMDIV(1,IMSUM(1,IMSUM(COMPLEX(0,2*pi*BA456/Wsh),COMPLEX(-BA456/(fsw_sh),0))))))","v":0.5732158194920608},{"$f":"180/pi*IMARGUMENT(IMDIV(1,IMSUM(1,IMSUM(COMPLEX(0,2*pi*BA456/Wsh),COMPLEX(-BA456/(fsw_sh),0)))))","v":-47.173829507472711},{"$f":"20*LOG(IMABS(IMPRODUCT(A_INTCOMP2VOUT,IMDIV(COMPLEX(1, 2*pi*BA456/Wesr_zero),COMPLEX(1, 2*pi*BA456/Wload_pole)))))","v":-1.5612341913097056},{"$f":"180/pi*IMARGUMENT(IMPRODUCT(A_INTCOMP2VOUT,IMDIV(COMPLEX(1, 2*pi*BA456/Wesr_zero),COMPLEX(1, 2*pi*BA456/Wload_pole))))","v":-85.00891768083568},{"$f":"IMDIV(IMPRODUCT(COMPLEX(R.fb_bot,0),IMDIV(COMPLEX(1,0),COMPLEX(0,2*pi*BA456*C.fb_bot))),IMSUM(COMPLEX(R.fb_bot,0),IMDIV(COMPLEX(1,0),COMPLEX(0,2*pi*BA456*C.fb_bot))) )","v":"5596,18896055043-475,666017537479i"},{"$f":"IMSUM(COMPLEX(R.fb_top1,0),IMDIV(IMPRODUCT(COMPLEX(R.fb_top2,0),IMDIV(COMPLEX(1,0),COMPLEX(0,2*pi*BA456*C.fb_top))),IMSUM(COMPLEX(R.fb_top2,0),IMDIV(COMPLEX(1,0),COMPLEX(0,2*pi*BA456*C.fb_top))) ))","v":"13717,6547594377-34350,5558808091i"},-17.013620342995452,{"$f":"180/pi*IMARGUMENT(IMDIV(BG456,IMSUM(BG456,BH456)))","v":56.129880530457136},{"$f":"20*LOG(IMABS(IMDIV(A.fb_buf,IMSUM(COMPLEX(1,0),COMPLEX(0,2*pi*BA456*R.fb_buf*C.fb_buf)))))","v":-2.1664740850682986},{"$f":"180/pi*IMARGUMENT(IMDIV(A.fb_buf,IMSUM(COMPLEX(1,0),COMPLEX(0,2*pi*BA456*R.fb_buf*C.fb_buf))))","v":-38.808135275516157},{"$f":"IMSUM(COMPLEX(R.comp,0),IMDIV(COMPLEX(1,0),COMPLEX(0,2*pi*BA456*C.comp)))","v":"5600-120,571951669051i"},{"$f":"IMDIV(COMPLEX(1,0),COMPLEX(0,2*pi*BA456*C.hf))","v":"-1729,94539351248i"},{"$f":"IMDIV(COMPLEX(1,0),IMSUM(IMDIV(COMPLEX(1,0),BM456),IMSUM(IMDIV(COMPLEX(1,0),BN456),IMDIV(COMPLEX(1,0),COMPLEX(R.eaout,0)))))","v":"481,806193826775-1570,73112671057i"},{"$f":"IMDIV(IMDIV(COMPLEX(1,0),COMPLEX(0,2*pi*BA456*0.00000000000226)),IMSUM(COMPLEX(21700,0),IMDIV(COMPLEX(1,0),COMPLEX(0,2*pi*BA456*0.00000000000226))) )","v":"0,985035311402789-0,121411476773819i"},{"$f":"GM*A.comp_buffer","v":1E-3},4.2470834074514947,{"$f":"180/pi*IMARGUMENT(IMPRODUCT(BQ456,IMPRODUCT(BO456,BP456)) )","v":-79.973747700285358},null,-0.98801837181764485,-132.18274718830838,-14.933011020612255,-62.65200244534438,-15.921029392429901,-194.83474963365276,165.16525036634724,null,{"$f":"IF(AND(BY457<$CC$355,BY456>=$CC$355),(($CC$355-BY456)/(BY457-BY456)*(BA457-BA456)+BA456),0)","v":0},{"$f":"IF(AND(BA457>$CD$355,BA456<=$CD$355),(($CD$355-BA456)/(BA457-BA456)*(BZ457-BZ456)+BZ456),0)","v":0},{"$f":"IF(AND(BZ457<$CE$355,BZ456>=$CE$355),(($CE$355-BZ456)/(BZ457-BZ456)*(BA457-BA456)+BA456),0)","v":0},{"$f":"IF(AND(BA457>$CF$355,BA456<=$CF$355),(($CF$355-BA456)/(BA457-BA456)*(BY457-BY456)+BY456),0)","v":0},{"$f":"IF(AND(BF457<$CG$355,BF456>=$CG$355),(($CG$355-BF456)/(BF457-BF456)*(BA457-BA456)+BA456),0)","v":0},0,{"$f":"IF(AND(BF457>$CI$355,BF456<=$CI$355),(($CI$355-BF456)/(BF457-BF456)*(BA457-BA456)+BA456),0)","v":0},{"$f":"IF(AND(BX457>$CJ$355,BX456<=$CJ$355),(($CJ$355-BX456)/(BX457-BX456)*(BA457-BA456)+BA456),0)","v":0},0,{"$f":"IF(AND(BX457<$CL$355,BX456>=$CL$355),(($CL$355-BX456)/(BX457-BX456)*(BA457-BA456)+BA456),0)","v":0},0]
[null,null,null,null,null,null,null,null,null,null,null,null,null,null,null,null,null,null,null,null,null,null,null,null,null,null,null,null,null,null,null,null,null,null,null,null,null,null,null,null,null,null,null,null,null,null,null,null,null,null,null,98,450000,null,0.24209732534066813,-52.583057559354494,-2.5785671998021487,-84.638545678148702,"5585,54684937218-534,106639336411i","11168,0583676029-31435,562900875i",-16.167743332515553,56.881181184299201,-2.5974618618303817,-42.13836230868251,"5600-107,175068150268i","-1537,72923867776i","388,718091645896-1423,54876654178i","0,981135303077806-0,136047124674607i",1E-3,3.2970558370200278,-82.62147362523082,null,-2.3364698744614807,-137.22160323750319,-15.468149357325906,-67.878654749614128,-17.804619231787388,-205.10025798711732,154.89974201288268,null,0,0,0,0,0,0,0,0,0,0,0]
[null,null,null,null,null,null,null,null,null,null,null,null,null,null,null,null,null,null,null,null,null,null,null,null,null,null,null,null,null,null,null,null,null,null,null,null,null,null,null,null,null,null,null,null,null,null,null,null,null,null,null,99,500000,null,-0.14550866872175006,-57.561578800676465,-3.4874618071835113,-84.245136983958034,"5573,70052197815-592,193175776704i","9249,97031086148-28902,5531288399i",-15.401371229875531,57.251716908023106,-3.0333946091308079,-45.151947801843285,"5600-96,4575613352412i","-1383,95631480998i","319,686122600717-1299,44334279869i","0,976812855043953-0,150497512487197i",1E-3,2.4284686414564045,-84.937407594614356,null,-3.6329704759052612,-141.80671578463449,-16.006297197549934,-72.837638488434536,-19.639267673455194,-214.64435427306904,145.35564572693096,null,0,0,0,0,0,0,0,0,0,0,0]
[null,null,null,null,null,null,null,null,null,null,null,null,null,null,null,null,null,null,null,null,null,null,null,null,null,null,null,null,null,null,null,null,null,null,null,null,null,null,null,null,null,null,null,null,null,null,null,null,null,null,null,100,550000,null,-0.57372180291644603,-62.092803257529951,-4.30849404767672,-83.835217268743207,"5560,66553805449-649,889061776904i","7776,65185366888-26701,3864152984i",-14.704543641998288,57.338673591542296,-3.4692055279065666,-47.877533758851733,"5600-87,6886921229465i","-1258,14210437271i","267,233005978748-1193,9181559095i","0,972079507867829-0,164745070491557i",1E-3,1.6288124255326979,-87.002449945444425,null,-4.8822158505931661,-145.92802052627314,-16.544936744372158,-77.541310112753862,-21.427152594965325,-223.46933063902702,136.53066936097298,null,0,0,0,0,0,0,0,0,0,0,0]
[null,null,null,null,null,null,null,null,null,null,null,null,null,null,null,null,null,null,null,null,null,null,null,null,null,null,null,null,null,null,null,null,null,null,null,null,null,null,null,null,null,null,null,null,null,null,null,null,null,null,null,101,600000,null,-1.0286086068145253,-66.185194124209744,-5.0568617038012658,-83.413160191438251,"5546,45890345177-707,158577910325i","6623,66057800507-24782,1113790914i",-14.068674942325458,57.211523063929548,-3.9011444868426883,-50.343815576282452,"5600-80,381301112701i","-1153,29692900832i","226,525606682945-1103,39289573802i","0,966947721966524-0,178773110255077i",1E-3,0.88792650225110115,-88.87323394592886,null,-6.0854703106157908,-149.59835431564801,-17.081892926917046,-82.005526458281764,-23.167363237532836,-231.60388077392977,128.39611922607023,null,0,0,0,0,0,0,0,0,0,0,0]
[null,null,null,null,null,null,null,null,null,null,null,null,null,null,null,null,null,null,null,null,null,null,null,null,null,null,null,null,null,null,null,null,null,null,null,null,null,null,null,null,null,null,null,null,null,null,null,null,null,null,null,102,650000,null,-1.4987390733661567,-69.863563041842255,-5.7441094951501483,-82.982014527247898,"5531,09901568889-763,966919703793i","5706,22872891477-23100,4318024074i",-13.486461796871925,56.921031445543626,-4.3265216215081796,-52.578174075640995,"5600-74,1981241040317i","-1064,58178062306i","194,346616131965-1025,06029859615i","0,961430798690782-0,192565879686893i",1E-3,0.19754133272611185,-90.590393187096538,null,-7.2428485685163047,-152.84557756909015,-17.615442085653996,-86.247535817193906,-24.8582906541703,-239.09311338628407,120.90688661371593,null,0,0,0,0,0,0,0,0,0,0,0]
[null,null,null,null,null,null,null,null,null,null,null,null,null,null,null,null,null,null,null,null,null,null,null,null,null,null,null,null,null,null,null,null,null,null,null,null,null,null,null,null,null,null,null,null,null,null,null,null,null,null,null,103,700000,null,-1.9752106047373317,-73.161684753536264,-6.3792136974360911,-82.543976912625453,"5514,60560564034-820,280262894641i","4965,35353794902-21618,8494927892i",-12.951709898392716,56.505047859567227,-4.7434756231082398,-54.605935620287418,"5600-68,8982580966008i","-988,540224864273i","168,496125595094-956,723060276437i","0,955542798048694-0,206108610072376i",1E-3,-0.44911318525709698,-92.1837304881536,null,-8.3544243021734221,-155.70566166616172,-18.144298706758054,-90.284618248873784,-26.498723008931478,-245.9902799150355,114.0097200849645,null,0,0,0,0,0,0,0,0,0,0,0]
[null,null,null,null,null,null,null,null,null,null,null,null,null,null,null,null,null,null,null,null,null,null,null,null,null,null,null,null,null,null,null,null,null,null,null,null,null,null,null,null,null,null,null,null,null,null,null,null,null,null,null,104,750000,null,-2.4513759479810022,-76.116889286317033,-6.9692919516959781,-82.100675527751093,"5496,99967574446-876,065824415868i","4359,11883451344-20306,2398863351i",-12.459154590066806,55.992301826513128,-5.1507782219118265,-56.450052204628456,"5600-64,3050408901608i","-922,637543206655i","147,433088079881-896,653705540339i","0,949298453970497-0,219387554933549i",1E-3,-1.0576211719164628,-93.675536543223529,null,-9.4206678996769799,-158.21756481406811,-18.667553983895093,-94.133286921338851,-28.088221883572075,-252.35085173540696,107.64914826459304,null,0,0,0,0,0,0,0,0,0,0,0]
[null,null,null,null,null,null,null,null,null,null,null,null,null,null,null,null,null,null,null,null,null,null,null,null,null,null,null,null,null,null,null,null,null,null,null,null,null,null,null,null,null,null,null,null,null,null,null,null,null,null,null,105,800000,null,-2.9224546426999281,-78.766533577982074,-7.5200836782384828,-81.653347406805509,"5478,30343508365-931,291918910408i","3857,17760857323-19136,9579482765i",-12.004300842846312,55.404948157230834,-5.5476761898208498,-58.131044277967277,"5600-60,2859758345257i","-864,972696756239i","130,054299767968-843,484284680459i","0,942713088007162-0,232390020670345i",1E-3,-1.6326253491200735,-95.082775577719815,null,-10.442538320938411,-160.4198809847876,-19.184602381787233,-97.808871698456258,-29.627140702725644,-258.22875268324384,101.77124731675616,null,0,0,0,0,0,0,0,0,0,0,0]
[null,null,null,null,null,null,null,null,null,null,null,null,null,null,null,null,null,null,null,null,null,null,null,null,null,null,null,null,null,null,null,null,null,null,null,null,null,null,null,null,null,null,null,null,null,null,null,null,null,null,null,106,850000,null,-3.3851363910505001,-81.145945230093474,-8.0362846747697763,-81.202953165497732,"5458,54023169999-985,928010607527i","3437,17302999683-18089,8966792114i",-11.583288678238752,54.760308516762763,-5.9337672851686216,-59.667096323137848,"5600-56,7397419619066i","-814,091949888225i","115,554451504988-796,122393726282i","0,935802522333697-0,245104389041869i",1E-3,-2.1780164121910914,-96.418559344599586,null,-11.421421065820276,-162.34889839559122,-19.695072375598464,-101.32534715097466,-31.11649344141874,-263.67424554656588,96.325754453434115,null,0,0,0,0,0,0,0,0,0,0,0]
[null,null,null,null,null,null,null,null,null,null,null,null,null,null,null,null,null,null,null,null,null,null,null,null,null,null,null,null,null,null,null,null,null,null,null,null,null,null,null,null,null,null,null,null,null,null,null,null,null,null,null,107,900000,null,-3.8372291049305312,-83.2873912821982,-8.5217859782080971,-80.750253478683049,"5437,73448251623-1039,94476042643i","3082,37010014241-17147,6453657639i",-11.192782922813528,54.072087299562263,-6.3089047677246199,-61.074232522810107,"5600-53,587534075134i","-768,864619338879i","103,335287373843-753,687975657248i","0,928582992893676-0,257520131644692i",1E-3,-2.6970797199531482,-97.693163058488025,null,-12.359015083138628,-164.03764476088125,-20.198767410491296,-104.69530828173586,-32.557782493629922,-268.73295304261711,91.267046957382888,null,0,0,0,0,0,0,0,0,0,0,0]
[null,null,null,null,null,null,null,null,null,null,null,null,null,null,null,null,null,null,null,null,null,null,null,null,null,null,null,null,null,null,null,null,null,null,null,null,null,null,null,null,null,null,null,null,null,null,null,null,null,null,null,108,950000,null,-4.2773696216998172,-85.219700785684452,-8.9798480866872623,-80.295861397995623,"5415,91160123839-1093,31406820499i","2780,05810158706-16295,7845138142i",-10.829883906799818,53.351236673398532,-6.6731249435454956,-62.366526788503101,"5600-50,7671375448638i","-728,398060426306i","92,9452803883047-715,465833034207i","0,921071063475866-0,2696278166349i",1E-3,-3.1926094383861789,-98.91473967521641,null,-13.257217708387079,-165.51556218368006,-20.695618288731492,-107.93002979032099,-33.952835997118569,-273.44559197400105,86.554408025998953,null,0,0,0,0,0,0,0,0,0,0,0]
[null,null,null,null,null,null,null,null,null,null,null,null,null,null,null,null,null,null,null,null,null,null,null,null,null,null,null,null,null,null,null,null,null,null,null,null,null,null,null,null,null,null,null,null,null,null,null,null,null,null,null,109,1000000,null,-4.704796811626367,-86.968272268944204,-9.413230457624401,-79.840278964679214,"5393,09792461673-1146,00910998356i","2520,45330571766-15522,3126832323i",-10.492055382236831,52.606583044181299,-7.0265927668401895,-63.556319783010252,"5600-48,2287806676206i","-691,978157404991i","84,0387295850675-680,86981969828i","0,913283541458634-0,281419108021132i",1E-3,-3.6669979433900441,-100.08983126494164,null,-14.118027269250767,-166.8085512336234,-21.185646092467064,-111.0395680037706,-35.303673361717827,-277.84811923739403,82.15188076260597,null,0,0,0,0,0,0,0,0,0,0,0]
[null,null,null,null,null,null,null,null,null,null,null,null,null,null,null,null,null,null,null,null,null,null,null,null,null,null,null,null,null,null,null,null,null,null,null,null,null,null,null,null,null,null,null,null,null,null,null,null,null,null,null,110,1500000,null,-8.3002348370683539,-98.039058198445019,-12.782467438110368,-75.286680817429783,"5116,76985999386-1630,93595421568i","1163,25843014602-10492,2113342379i",-8.1045331842051365,44.935634971585543,-10.041482355825266,-71.656036276618622,"5600-32,1525204450804i","-461,318771603327i","37,7102993631786-457,995710576424i","0,823968954369897-0,380846578827322i",1E-3,-7.5943196991783815,-110.09988535428666,null,-21.082702275178722,-173.3257390158748,-25.740335239208786,-136.82028665931972,-46.823037514387508,-310.14602567519455,49.853974324805449,null,0,0,0,0,0,0,0,0,0,0,0]
[null,null,null,null,null,null,null,null,null,null,null,null,null,null,null,null,null,null,null,null,null,null,null,null,null,null,null,null,null,null,null,null,null,null,null,null,null,null,null,null,null,null,null,null,null,null,null,null,null,null,null,111,2000000,null,-10.953174491177652,-103.4055318799231,-15.076368779514661,-70.851641930781,"4774,29847415411-2029,03400666511i","679,272743397855-7907,67286590701i",-6.7890581483732868,38.215613209218823,-12.347860009340639,-76.035105998654274,"5600-24,1143903338103i","-345,989078702496i","21,2837938051721-344,582420304689i","0,724742287799273-0,446644046277065i",1E-3,-10.63576416354282,-118.11022138644095,null,-26.029543270692315,-174.2571738107041,-29.772682321256745,-155.9297141758764,-55.80222559194906,-330.18688798658047,29.813112013419527,null,0,0,0,0,0,0,0,0,0,0,0]
[null,null,null,null,null,null,null,null,null,null,null,null,null,null,null,null,null,null,null,null,null,null,null,null,null,null,null,null,null,null,null,null,null,null,null,null,null,null,null,null,null,null,null,null,null,null,null,null,null,null,null,112,2500000,null,-13.017595061153671,-106.52011358369371,-16.764642582261338,-66.618451075050643,"4396,0032315234-2335,32740424003i","453,648974846604-6340,50195093147i",-6.0063247284619834,32.816529673802052,-14.194037815745901,-78.748379177497469,"5600-19,2915122670482i","-276,791262961996i","13,6429878934863-276,069924513832i","0,627573532047838-0,483451128782258i",1E-3,-13.192378481980638,-124.77970087192365,null,-29.782237643415009,-173.13856465874437,-33.392741026188524,-170.71155037561908,-63.174978669603533,-343.85011503436345,16.149884965636545,null,0,0,0,0,0,0,0,0,0,0,0]
[null,null,null,null,null,null,null,null,null,null,null,null,null,null,null,null,null,null,null,null,null,null,null,null,null,null,null,null,null,null,null,null,null,null,null,null,null,null,null,null,null,null,null,null,null,null,null,null,null,null,null,113,3000000,null,-14.69812105551496,-108.54326666024973,-18.061141549088951,-62.627833680274463,"4007,86650668662-2554,96094774911i","330,657943700093-5290,27650398799i",-5.5116493048775759,28.53984511603247,-15.726845729185754,-80.586848680008558,"5600-16,0762602225402i","-230,659385801664i","9,48237422289741-230,241588691008i","0,539213830936173-0,498459903566284i",1E-3,-15.431354214325276,-130.39256778636874,null,-32.759262604603911,-171.17110034052419,-36.669849248388608,-182.43957135034483,-69.42911185299252,-353.61067169086903,6.389328309130974,null,0,0,0,0,0,0,0,0,0,0,0]
[null,null,null,null,null,null,null,null,null,null,null,null,null,null,null,null,null,null,null,null,null,null,null,null,null,null,null,null,null,null,null,null,null,null,null,null,null,null,null,null,null,null,null,null,null,null,null,null,null,null,null,114,3500000,null,-16.112064818357087,-109.95990585280462,-19.083546431729044,-58.899317661155941,"3629,17519999169-2699,14206021831i","256,351322676136-4537,90165156137i",-5.1829767344271049,25.12946692523942,-17.034850616017863,-81.912349504683718,"5600-13,7796516193202i","-197,708044972855i","6,97022530022318-197,444807102916i","0,462290929227027-0,498575998200313i",1E-3,-17.436522969814408,-135.14082783601555,null,-35.195611250086131,-168.85922351396056,-39.654350320259375,-191.92371041545985,-74.849961570345499,-360.78293392942044,-0.78293392942043738,null,0,0,0,0,0,0,0,0,0,0,0]
[null,null,null,null,null,null,null,null,null,null,null,null,null,null,null,null,null,null,null,null,null,null,null,null,null,null,null,null,null,null,null,null,null,null,null,null,null,null,null,null,null,null,null,null,null,null,null,null,null,null,null,115,4000000,null,-17.331146718089073,-111.00604113645996,-19.904707794857345,-55.438452723359461,"3272,40613311592-2781,48647959766i","208,064176936366-3972,58522999898i",-4.9552433714328954,22.373362547128895,-18.174495672479384,-82.912305325257677,"5600-12,0571951669051i","-172,994539351248i","5,33836072761758-172,818131657723i","0,396950898920575-0,489265656639338i",1E-3,-19.256703948036058,-139.17761922802947,null,-37.235854512946418,-166.44449385981943,-42.386442991948343,-199.71656200615826,-79.62229750489476,-366.16105586597769,-6.1610558659776871,null,0,0,0,0,0,0,0,0,0,0,0]
[null,null,null,null,null,null,null,null,null,null,null,null,null,null,null,null,null,null,null,null,null,null,null,null,null,null,null,null,null,null,null,null,null,null,null,null,null,null,null,null,null,null,null,null,null,null,null,null,null,null,null,116,4500000,null,-18.401964236942042,-111.80972082046158,-20.573370458908396,-52.241078794721247,"2944,36482087021-2815,48940840431i","174,931658657941-3532,35869447868i",-4.7917835689099064,20.112530710259822,-19.183646805481082,-83.693092008778891,"5600-10,7175068150268i","-153,772923867776i","4,21892988563568-153,648998735741i","0,342144508984616-0,474427701506027i",1E-3,-20.924036416307267,-142.62905428878298,null,-38.975334695850435,-164.05079961518283,-44.899466790698256,-206.20961558730204,-83.874801486548691,-370.26041520248486,-10.260415202484864,null,0,0,0,0,0,0,0,0,0,0,0]
[null,null,null,null,null,null,null,null,null,null,null,null,null,null,null,null,null,null,null,null,null,null,null,null,null,null,null,null,null,null,null,null,null,null,null,null,null,null,null,null,null,null,null,null,null,null,null,null,null,null,null,117,5000000,null,-19.35635231886781,-112.44624865867235,-21.123912686301477,-49.29652286213058,"2647,71919675032-2813,14224455683i","151,218669803914-3179,87763306617i",-4.670907769563259,18.23077763133093,-20.088827157288826,-84.319433283265241,"5600-9,64575613352412i","-138,395631480998i","3,41789303160982-138,305275260098i","0,296405628328862-0,456672017780633i",1E-3,-22.461709135510016,-145.59856555417693,null,-40.480265005169286,-161.74277152080293,-47.221444062362096,-211.68722120611125,-87.701709067531382,-373.42999272691418,-13.429992726914179,null,0,0,0,0,0,0,0,0,0,0,0]
[null,null,null,null,null,null,null,null,null,null,null,null,null,null,null,null,null,null,null,null,null,null,null,null,null,null,null,null,null,null,null,null,null,null,null,null,null,null,null,null,null,null,null,null,null,null,null,null,null,null,null,118,5500000,null,-20.216966614033872,-112.96274141083616,-21.581476398792923,-46.590084112180158,"2382,42307197428-2784,39817033614i","133,666490815554-2891,30576035638i",-4.5792278666015394,16.643260855758633,-20.909289829533432,-84.832916252793154,"5600-8,76886921229465i","-125,814210437271i","2,8250474019118-125,746316241865i","0,258248210913376-0,437671192190458i",1E-3,-23.887529890456424,-148.17026505685232,null,-41.798443012826795,-159.55282552301631,-49.376047586591397,-216.35992045388684,-91.174490599418192,-375.91274597690312,-15.912745976903125,null,0,0,0,0,0,0,5819913.9165937947,0,0,0,0]
[null,null,null,null,null,null,null,null,null,null,null,null,null,null,null,null,null,null,null,null,null,null,null,null,null,null,null,null,null,null,null,null,null,null,null,null,null,null,null,null,null,null,null,null,null,null,null,null,null,null,null,119,6000000,null,-21.000478003544494,-113.39016264452695,-21.964926078557877,-44.104909148380223,"2146,82869789983-2737,14879250095i","120,312489114608-2650,71783963049i",-4.5081659875635447,15.287469836983416,-21.659431128434413,-85.261458932818115,"5600-8,0381301112701i","-115,329692900832i","2,37404343853518-115,277392260404i","0,226336140974785-0,418459188288927i",1E-3,-25.215736519396359,-150.41217629017709,null,-42.965404082102367,-157.49507179290717,-51.383333635394315,-220.38616538601178,-94.348737717496675,-377.88123717891892,-17.881237178918923,null,0,0,0,0,0,0,0,0,0,0,0]
[null,null,null,null,null,null,null,null,null,null,null,null,null,null,null,null,null,null,null,null,null,null,null,null,null,null,null,null,null,null,null,null,null,null,null,null,null,null,null,null,null,null,null,null,null,null,null,null,null,null,null,120,6500000,null,-21.71949788213319,-113.74968702948293,-22.288683935802883,-41.823340879803773,"1938,46755184102-2677,45176921461i","109,917465497271-2447,07099346453i",-4.4520435822966782,14.116753593133918,-22.35028679732061,-85.62448941247942,"5600-7,41981241040317i","-106,458178062306i","2,02299875010526-106,417039240083i","0,199535237830443-0,399651006122081i",1E-3,-26.458011348610675,-152.37921376254562,null,-44.008181817936077,-155.57302790928671,-53.260341728227964,-223.88694958189112,-97.268523546164033,-379.45997749117782,-19.459977491177824,null,0,0,0,0,0,0,0,0,0,0,0]
[null,null,null,null,null,null,null,null,null,null,null,null,null,null,null,null,null,null,null,null,null,null,null,null,null,null,null,null,null,null,null,null,null,null,null,null,null,null,null,null,null,null,null,null,null,null,null,null,null,null,null,121,7000000,null,-22.383790983724378,-114.05627981103717,-22.563934989754024,-39.727837116145075,"1754,55549173385-2609,8461847401i","101,667793550576-2272,46777626597i",-4.4069918752516122,13.095805896008939,-22.990496790835362,-85.935939917397818,"5600-6,88982580966008i","-98,8540224864273i","1,74441968341263-98,8210825668412i","0,176910992716954-0,381593361279852i",1E-3,-27.624106593772098,-154.11576289878403,null,-44.947725973478398,-153.78411692718225,-55.021595259859069,-226.9558969201729,-99.969321233337467,-380.74001384735516,-20.740013847355158,null,0,0,0,0,0,0,0,0,0,0,0]
[null,null,null,null,null,null,null,null,null,null,null,null,null,null,null,null,null,null,null,null,null,null,null,null,null,null,null,null,null,null,null,null,null,null,null,null,null,null,null,null,null,null,null,null,null,null,null,null,null,null,null,122,7500000,null,-23.001068737648769,-114.32081463593119,-22.799453753293257,-37.801557016928747,"1592,29613559186-2537,66838098379i","95,0113865388034-2121,11117788818i",-4.3703074279249403,12.197530023637333,-23.586948770055848,-86.206059089927336,"5600-6,43050408901608i","-92,2637543206655i","1,51965318358574-92,2369717156161i","0,157705101276445-0,364464267532266i",1E-3,-28.722263161769757,-155.65781711931783,null,-45.800522490942029,-152.12237165285993,-56.679519359750543,-229.66634618560784,-102.48004185069257,-381.78871783846773,-21.788717838467733,null,0,0,0,0,0,0,0,0,0,0,0]
[null,null,null,null,null,null,null,null,null,null,null,null,null,null,null,null,null,null,null,null,null,null,null,null,null,null,null,null,null,null,null,null,null,null,null,null,null,null,null,null,null,null,null,null,null,null,null,null,null,null,null,123,8000000,null,-23.57752526805832,-114.55138090292598,-23.002190268342993,-36.028703879402428,"1449,04796111853-2463,32951851668i","89,5629453670662-1988,6501225858i",-4.3400582250520152,11.40084891789542,-24.145220070356679,-86.442552406071442,"5600-6,02859758345257i","-86,4972696756239i","1,33568290437814-86,475200659265i","0,141306544681009-0,348337487375854i",1E-3,-29.759509671300268,-157.03470018210805,null,-46.579715536401309,-150.58008478232841,-58.244787966708962,-232.07640367028409,-104.82450350311026,-382.65648845261251,-22.656488452612507,null,0,0,0,0,0,0,0,0,0,0,0]
[null,null,null,null,null,null,null,null,null,null,null,null,null,null,null,null,null,null,null,null,null,null,null,null,null,null,null,null,null,null,null,null,null,null,null,null,null,null,null,null,null,null,null,null,null,null,null,null,null,null,null,124,8500000,null,-24.118209765858388,-114.75412044016853,-23.17769586910995,-34.394697133267648,"1322,40475325253-2388,543149358i","85,0469604812917-1871,75526142982i",-4.3148356810334629,10.689159714939992,-24.669889106385806,-86.651324084178853,"5600-5,67397419619066i","-81,4091949888225i","1,18320235293422-81,3907953331789i","0,127223998962761-0,333223728222773i",1E-3,-30.741886018460697,-158.27043252675927,null,-47.295905634968335,-149.14881757343619,-59.726610805879965,-234.23259689599814,-107.02251644084831,-383.38141446943433,-23.381414469434333,null,0,0,0,0,0,0,0,0,0,0,0]
[null,null,null,null,null,null,null,null,null,null,null,null,null,null,null,null,null,null,null,null,null,null,null,null,null,null,null,null,null,null,null,null,null,null,null,null,null,null,null,null,null,null,null,null,null,null,null,null,null,null,null,125,9000000,null,-24.627291547246209,-114.9337798390758,-23.330438296700141,-32.886229777655956,"1210,22384484108-2314,50423045154i","81,2622069597513-1767,83578716778i",-4.2935943144208029,10.049229504149382,-25.164759754521754,-86.836973846176861,"5600-5,3587534075134i","-76,8864619338879i","1,0554148479663-76,8709612704573i","0,115062001164588-0,319096751867813i",1E-3,-31.674615943113601,-159.38480643790416,null,-47.957729843946353,-147.82000961673174,-61.132970012056155,-236.17255077993164,-109.09069985600252,-383.99256039666341,-23.992560396663407,null,0,0,0,0,0,0,0,0,0,0,0]
[null,null,null,null,null,null,null,null,null,null,null,null,null,null,null,null,null,null,null,null,null,null,null,null,null,null,null,null,null,null,null,null,null,null,null,null,null,null,null,null,null,null,null,null,null,null,null,null,null,null,null,126,9500000,null,-25.108252792069734,-115.0940850522332,-23.4640382959685,-31.491252595709589,"1110,62471076168-2242,02629247898i","78,0589462971088-1674,84546309311i",-4.2755455906917756,9.4703960472783315,-25.633026261695523,-87.003138018208446,"5600-5,07671375448638i","-72,8398060426306i","0,947263072556968-72,8266260065759i","0,104501333187256-0,30590979806038i",1E-3,-32.562243193543324,-160.394229456462,null,-48.572291088038234,-146.58533764794279,-62.470815045930621,-237.92697142739212,-111.04310613396885,-384.51230907533488,-24.512309075334883,null,0,0,0,0,0,0,0,0,0,0,0]
[null,null,null,null,null,null,null,null,null,null,null,null,null,null,null,null,null,null,null,null,null,null,null,null,null,null,null,null,null,null,null,null,null,null,null,null,null,null,null,null,null,null,null,null,null,null,null,null,null,null,null,127,10000000,null,-25.56403136151053,-115.23800153788724,-23.581449316694432,-30.198914368194707,"1021,97205305177-2171,64475653233i","75,3238918308187-1591,14671969131i",-4.2600860959425617,8.9439817097644791,-26.077396594142076,-87.152729006192914,"5600-4,82287806676206i","-69,1978157404991i","0,854921056853089-69,1865152938274i","0,0952832831380414-0,293605822647435i",1E-3,-33.408740655927602,-161.31238610440306,null,-49.145480678204962,-145.43691590608194,-63.746223346012243,-239.5211334008315,-112.8917040242172,-384.95804930691344,-24.958049306913438]

{"sheet":"STD_VAL","index":3,"n_rows":769,"n_cols":4,"rows_kept":769,"cut":false,"hidden":true,"merged":[]}
[1]
[1.02,null,"Device Rating","Value"]
[1.05,null,"LM(Q)64480(-Q1)",4]
[1.0699999999999998,null,"LM(Q)644A0(-Q1)",5]
[1.1000000000000001,null,"LM(Q)644A2(-Q1)",6]
[1.1300000000000001]
[1.1499999999999999,null,"Number of Phase","Value"]
[1.1800000000000002,null,"1-Phase",1]
[1.21,null,"2-Phase (1 device)",2]
[1.24,null,"4-Phase (2 devices)",4]
[1.27,null,"6-Phase (3 devices)",6]
[1.3]
[1.33,null,"Switching Mode","Value"]
[1.3699999999999999,null,"FPWM",1]
[1.4,null,"AUTO",0]
[1.4300000000000002]
[1.47,null,"Feedback","Value"]
[1.5,null,"Internal",1]
[1.54,null,"External",0]
[1.58]
[1.6199999999999999,null,"Spread Spectrum","Value"]
[1.65,null,"Enable",1]
[1.69,null,"Disable",0]
[1.7399999999999998]
[1.78,null,"External clock synchronization","Value"]
[1.8199999999999998,null,"Yes",1]
[1.8699999999999999,null,"No",0]
[1.9100000000000001]
[1.9600000000000002]
[2]
[2.0499999999999998]
[2.1]
[2.15]
[2.21]
[2.2600000000000002]
[2.3199999999999998]
[2.37]
[2.4300000000000002]
[2.4899999999999998]
[2.5499999999999998]
[2.6100000000000003]
[2.67]
[2.7399999999999998]
[2.8]
[2.87]
[2.94]
[3.0100000000000002]
[3.09]
[3.16]
[3.2399999999999998]
[3.3200000000000003]
[3.4]
[3.4799999999999995]
[3.5700000000000003]
[3.65]
[3.7399999999999998]
[3.8299999999999996]
[3.9200000000000004]
[4.0200000000000005]
[4.12]
[4.2200000000000006]
[4.32]
[4.42]
[4.5299999999999994]
[4.6399999999999997]
[4.75]
[4.87]
[4.99]
[5.1100000000000003]
[5.2299999999999995]
[5.36]
[5.49]
[5.62]
[5.76]
[5.9]
[6.04]
[6.1899999999999995]
[6.34]
[6.49]
[6.65]
[6.81]
[6.9799999999999995]
[7.15]
[7.32]
[7.5]
[7.68]
[7.87]
[8.0599999999999987]
[8.25]
[8.4499999999999993]
[8.66]
[8.870000000000001]
[9.09]
[9.3099999999999987]
[9.5299999999999994]
[9.76]
[{"$f":"A1*10","v":10}]
[{"$f":"A2*10","v":10.199999999999999}]
[10.5]
[10.7]
[11]
[11.3]
[11.5]
[11.8]
[12.1]
[12.4]
[12.7]
[13]
[13.3]
[13.7]
[14]
[14.3]
[14.7]
[15]
[15.4]
[15.8]
[16.2]
[16.5]
[16.899999999999999]
[17.399999999999999]
[17.8]
[18.2]
[18.7]
[19.100000000000001]
[19.600000000000001]
[20]
[20.5]
[21]
[21.5]
[22.1]
[22.6]
[23.2]
[23.700000000000003]
[24.3]
[24.9]
[25.5]
[26.1]
[26.7]
[27.4]
[28]
[28.700000000000003]
[29.4]
[30.1]
[30.9]
[31.6]
[32.4]
[33.200000000000003]
[34]
[34.799999999999997]
[35.700000000000003]
[36.5]
[37.4]
[38.299999999999997]
[39.200000000000003]
[40.200000000000003]
[41.2]
[42.2]
[43.2]
[44.2]
[45.3]
[46.4]
[{"$f":"A66*10","v":47.5}]
[48.7]
[49.900000000000006]
[51.1]
[52.3]
[53.6]
[54.900000000000006]
[56.2]
[57.599999999999994]
[59]
[60.4]
[61.899999999999991]
[63.4]
[64.900000000000006]
[66.5]
[68.099999999999994]
[69.8]
[71.5]
[73.2]
[75]
[76.8]
[78.7]
[80.599999999999994]
[82.5]
[84.5]
[86.6]
[88.700000000000017]
[90.9]
[93.1]
[95.3]
[97.6]
[100]
[102]
[105]
[107]
[110]
[113]
[115]
[118]
[121]
[124]
[127]
[130]
[133]
[137]
[140]
[143]
[147]
[150]
[154]
[158]
[162]
[165]
[169]
[174]
[178]
[182]
[187]
[191]
[196]
[200]
[205]
[210]
[215]
[{"$f":"A130*10","v":221}]
[226]
[232]
[237.00000000000003]
[243]
[249]
[255]
[261]
[267]
[274]
[280]
[287]
[294]
[301]
[309]
[316]
[324]
[332]
[340]
[348]
[357]
[365]
[374]
[383]
[392]
[402]
[412]
[422]
[432]
[442]
[453]
[464]
[475]
[487]
[499.00000000000006]
[511]
[523]
[536]
[549]
[562]
[576]
[590]
[604]
[618.99999999999989]
[634]
[649]
[665]
[681]
[698]
[715]
[732]
[750]
[768]
[787]
[806]
[825]
[845]
[866]
[887.00000000000023]
[909]
[931]
[953]
[976]
[1000]
[{"$f":"A194*10","v":1020}]
[1050]
[1070]
[1100]
[1130]
[1150]
[1180]
[1210]
[1240]
[1270]
[1300]
[1330]
[1370]
[1400]
[1430]
[1470]
[1500]
[1540]
[1580]
[1620]
[1650]
[1690]
[1740]
[1780]
[1820]
[1870]
[1910]
[1960]
[2000]
[2050]
[2100]
[2150]
[2210]
[2260]
[2320]
[2370.0000000000005]
[2430]
[2490]
[2550]
[2610]
[2670]
[2740]
[2800]
[2870]
[2940]
[3010]
[3090]
[3160]
[3240]
[3320]
[3400]
[3480]
[3570]
[3650]
[3740]
[3830]
[3920]
[4020]
[4120]
[4220]
[4320]
[4420]
[4530]
[4640]
[{"$f":"A258*10","v":4750}]
[4870]
[4990.0000000000009]
[5110]
[5230]
[5360]
[5490]
[5620]
[5760]
[5900]
[6040]
[6189.9999999999991]
[6340]
[6490]
[6650]
[6810]
[6980]
[7150]
[7320]
[7500]
[7680]
[7870]
[8060]
[8250]
[8450]
[8660]
[8870.0000000000018]
[9090]
[9310]
[9530]
[9760]
[10000]
[10200]
[10500]
[10700]
[11000]
[11300]
[11500]
[11800]
[12100]
[12400]
[12700]
[13000]
[13300]
[13700]
[14000]
[14300]
[14700]
[15000]
[15400]
[15800]
[16200]
[16500]
[16900]
[17400]
[17800]
[18200]
[18700]
[19100]
[19600]
[20000]
[20500]
[21000]
[21500]
[{"$f":"A322*10","v":22100}]
[22600]
[23200]
[23700.000000000004]
[24300]
[24900]
[25500]
[26100]
[26700]
[27400]
[28000]
[28700]
[29400]
[30100]
[30900]
[31600]
[32400]
[33200]
[34000]
[34800]
[35700]
[36500]
[37400]
[38300]
[39200]
[40200]
[41200]
[42200]
[43200]
[44200]
[45300]
[46400]
[47500]
[48700]
[49900.000000000007]
[51100]
[52300]
[53600]
[54900]
[56200]
[57600]
[59000]
[60400]
[61899.999999999993]
[63400]
[64900]
[66500]
[68100]
[69800]
[71500]
[73200]
[75000]
[76800]
[78700]
[80600]
[82500]
[84500]
[86600]
[88700.000000000015]
[90900]
[93100]
[95300]
[97600]
[100000]
[{"$f":"A386*10","v":102000}]
[105000]
[107000]
[110000]
[113000]
[115000]
[118000]
[121000]
[124000]
[127000]
[130000]
[133000]
[137000]
[140000]
[143000]
[147000]
[150000]
[154000]
[158000]
[162000]
[165000]
[169000]
[174000]
[178000]
[182000]
[187000]
[191000]
[196000]
[200000]
[205000]
[210000]
[215000]
[221000]
[226000]
[232000]
[237000.00000000003]
[243000]
[249000]
[255000]
[261000]
[267000]
[274000]
[280000]
[287000]
[294000]
[301000]
[309000]
[316000]
[324000]
[332000]
[340000]
[348000]
[357000]
[365000]
[374000]
[383000]
[392000]
[402000]
[412000]
[422000]
[432000]
[442000]
[453000]
[464000]
[{"$f":"A450*10","v":475000}]
[487000]
[499000.00000000006]
[511000]
[523000]
[536000]
[549000]
[562000]
[576000]
[590000]
[604000]
[618999.99999999988]
[634000]
[649000]
[665000]
[681000]
[698000]
[715000]
[732000]
[750000]
[768000]
[787000]
[806000]
[825000]
[845000]
[866000]
[887000.00000000012]
[909000]
[931000]
[953000]
[976000]
[1000000]
[1020000]
[1050000]
[1070000]
[1100000]
[1130000]
[1150000]
[1180000]
[1210000]
[1240000]
[1270000]
[1300000]
[1330000]
[1370000]
[1400000]
[1430000]
[1470000]
[1500000]
[1540000]
[1580000]
[1620000]
[1650000]
[1690000]
[1740000]
[1780000]
[1820000]
[1870000]
[1910000]
[1960000]
[2000000]
[2050000]
[2100000]
[2150000]
[{"$f":"A514*10","v":2210000}]
[2260000]
[2320000]
[2370000.0000000005]
[2430000]
[2490000]
[2550000]
[2610000]
[2670000]
[2740000]
[2800000]
[2870000]
[2940000]
[3010000]
[3090000]
[3160000]
[3240000]
[3320000]
[3400000]
[3480000]
[3570000]
[3650000]
[3740000]
[3830000]
[3920000]
[4020000]
[4120000]
[4220000]
[4320000]
[4420000]
[4530000]
[4640000]
[4750000]
[4870000]
[4990000.0000000009]
[5110000]
[5230000]
[5360000]
[5490000]
[5620000]
[5760000]
[5900000]
[6040000]
[6189999.9999999991]
[6340000]
[6490000]
[6650000]
[6810000]
[6980000]
[7150000]
[7320000]
[7500000]
[7680000]
[7870000]
[8060000]
[8250000]
[8450000]
[8660000]
[8870000.0000000019]
[9090000]
[9310000]
[9530000]
[9760000]
[10000000]
[{"$f":"A578*10","v":10200000}]
[10500000]
[10700000]
[11000000]
[11300000]
[11500000]
[11800000]
[12100000]
[12400000]
[12700000]
[13000000]
[13300000]
[13700000]
[14000000]
[14300000]
[14700000]
[15000000]
[15400000]
[15800000]
[16200000]
[16500000]
[16900000]
[17400000]
[17800000]
[18200000]
[18700000]
[19100000]
[19600000]
[20000000]
[20500000]
[21000000]
[21500000]
[22100000]
[22600000]
[23200000]
[23700000.000000004]
[24300000]
[24900000]
[25500000]
[26100000]
[26700000]
[27400000]
[28000000]
[28700000]
[29400000]
[30100000]
[30900000]
[31600000]
[32400000]
[33200000]
[34000000]
[34800000]
[35700000]
[36500000]
[37400000]
[38300000]
[39200000]
[40200000]
[41200000]
[42200000]
[43200000]
[44200000]
[45300000]
[46400000]
[{"$f":"A642*10","v":47500000}]
[48700000]
[49900000.000000007]
[51100000]
[52300000]
[53600000]
[54900000]
[56200000]
[57600000]
[59000000]
[60400000]
[61899999.999999993]
[63400000]
[64900000]
[66500000]
[68100000]
[69800000]
[71500000]
[73200000]
[75000000]
[76800000]
[78700000]
[80600000]
[82500000]
[84500000]
[86600000]
[88700000.000000015]
[90900000]
[93100000]
[95300000]
[97600000]
[100000000]

{"sheet":"SCH","index":4,"n_rows":1,"n_cols":4,"rows_kept":1,"cut":false,"hidden":true,"merged":[]}
[null,{"$f":"IF(PH=1,IF(AND(IntFB=1,V.load=5),\"SCH_1PH_5V\",IF(AND(IntFB=1,V.load=3.3),\"SCH_1PH_3P3V\",IF(IntFB=0,\"SCH_1PH_ADJ\",444))),IF(PH=2,IF(AND(IntFB=1,V.load=5),\"SCH_2PH_5V\",IF(AND(IntFB=1,V.load=3.3),\"SCH_2PH_3P3V\",IF(IntFB=0,\"SCH_2PH_ADJ\",444))),IF(PH=4,IF(AND(IntFB=1,V.load=5),\"SCH_4PH_5V\",IF(AND(IntFB=1,V.load=3.3),\"SCH_4PH_3P3V\",IF(IntFB=0,\"SCH_4PH_ADJ\",444))),IF(PH=6,IF(AND(IntFB=1,V.load=5),\"SCH_6PH_5V\",IF(AND(IntFB=1,V.load=3.3),\"SCH_6PH_3P3V\",IF(IntFB=0,\"SCH_6PH_ADJ\",444))),444)) ) )","v":"SCH_4PH_ADJ"},{"$f":"IF(PH=4,\"SCH_4PH_SLAVE\",IF(PH=6,\"SCH_6PH_SLAVE\",\"SCH_BLANK\"))","v":"SCH_4PH_SLAVE"},{"$f":"IF(PH=6,\"SCH_6PH_SLAVE2\",\"SCH_BLANK\")","v":"SCH_BLANK"}]