{"text_format":"1","workbook":"xlsx","n_sheets":13,"sheets":["Design the Converter","Schematic Management","Variable Management","Schematic & BOM","EVMs","MOSFET Parameters","Stability Calculations","Bode Plot Management","Efficiency Calculations","Efficiency Plot Management","Standard Value Calculator","Snubber","Parallel Output Caps"],"not_rendered":{"charts":7,"images":20,"macros":1,"external_links":0,"defined_names":239,"comments":2,"pivot_tables":0},"unopened":[],"bounds":{"document_bytes":16777216,"sheet_cells":100000,"rows_first":2000,"rows_last":500,"rows_between":2000,"halvings":0,"cell_chars":16384,"cell_head_chars":4096},"cells_cut":0,"cells_raw":0,"read":"whole","date_system":"1900"}

{"sheet":"Design the Converter","index":0,"n_rows":72,"n_cols":17,"rows_kept":72,"cut":false,"hidden":false,"merged":[[2,14,2,15],[0,0,0,16],[39,11,40,16],[41,11,42,16]]}
["                    LMR36503E-Q1 65VIN, 300mAOUT Converter Design Tool"]
[null,null,null,null,null,null,null,null,null,null,null,null,null,null,"http://www.ti.com/product/lm5175"]
["About",null,"xx",null,null,"= Input Box",null,null,null,null,null,null,null,null,"TERMS OF USE",null,"                "]
[]
["Step 1: Operating Specifications"]
[null,null,null,"Input Voltage – Min, VIN(min) ",6,"V"]
[null,null,null,"Input Voltage – Nom, VIN(nom)",28,"V"]
[null,null,null,"Input Voltage – Max, VIN(max)",36,"V"]
[null,null,null,"Output Voltage, VOUT ",3.3,"V"]
[null,null,null,"Full Load Output Current, IOUT ",0.3,"A"]
[null,null,null,"Switching Frequency, FSW",2200,"kHz"]
[null,null,null,"Frequency Set Resistor, RT ",{"$f":"'Variable Management'!C339","v":7.15},{"$f":"'Variable Management'!E339","v":"kΩ"}]
[null,null,null,"Ambient Temperature, TA",25,"°C"]
[]
["Step 2: Buck Inductor"]
[null,null,null,"Inductance for 35% Ripple Current at VIN(nom)",{"$f":"Lopt*1000000","v":12.602040816326531},"µH"]
[null,null,null,"Buck Inductance, LO ",12,"µH"]
[null,null,null,"Inductor DCR at 25°C",25,"mΩ"]
[null,null,null,"Inductor Pk-Pk Ripple Current at VIN(nom)",{"$f":"'Variable Management'!B60","v":0.11285865408726177},"Apk-pk"]
[null,null,null,"DIL as a % of Full Load at VIN(nom)",{"$f":"'Variable Management'!D60*100","v":37.619551362420587},"%"]
[null,null,null,"Peak Inductor Current at VIN(max) and Full Load",{"$f":"'Variable Management'!B97","v":0.35816752227735926},"Apk"]
[null,null,null,"Peak Inductor Current Limit at VIN(nom)",{"$f":"Ipk_OCP_Vinnom","v":0.48663615847542629},"Apk"]
[null,null,null,"Estimate Inductor Core Loss at VIN(nom)",0.1,"W"]
[]
["Step 3: Output Capacitors"]
[null,null,null,"Desired Output Voltage Ripple",10,"mVpk-pk"]
[null,null,null,"Effective COUT Value to Meet Ripple Spec",{"$f":"'Variable Management'!B111","v":10},"µF"]
[null,null,null,"Desired Crossover Frequency",62,{"$f":"\"     kHz \"","v":"     kHz "}]
[null,null,null,"Effective COUT Value to Meet Crossover Spec",{"$f":"'Variable Management'!B204","v":28.640252388639176},"µF"]
[null,null,null,"Output Capacitance (derated), COUT ",22,"µF"]
[null,null,null,"Output Cap ESR (Max) to Meet Ripple Spec",{"$f":"'Variable Management'!B115","v":88.568761780274627},"mΩ"]
[null,null,null,"Output Capacitor ESR",1,"mΩ"]
[null,null,null,"Resulting Output Voltage Ripple (max) ",{"$f":"'Variable Management'!B117*1000","v":0.31256047410487087},"mVpk-pk"]
[null,null,null,"Output Capacitor RMS Current (max) ",{"$f":"'Variable Management'!B104","v":3.3583034644926943E-2},"A (rms)"]
[]
["Step 4: Input Capacitors"]
[null,null,null,"Input Voltage Ripple Spec",120,"mVpk-pk"]
[null,null,null,"Minimum Input Capacitance",{"$f":"'Variable Management'!B134","v":4.7},"µF"]
[null,null,null,"Input Capacitance (derated), CIN ",20,"µF"]
[null,null,null,"Maximum Permitted ESR",{"$f":"'Variable Management'!B139","v":"N/A"},"mΩ",null,null,null,null,null,{"$f":"CHOOSE(SCH_MODE, \"\", \"** For Single-Output Operation in 2-Phase Mode, tie MODE to VDDA and use FB1 to set VOUT **\", \"** For Single-Output Operation in 3-Phase Mode, tie both MODE pins to VDDA. Use FB1 of master IC to set VOUT. Connect FB2 of master IC to AGND. Connect FB2 of slave IC to VDDA to configure it as a slave **\", \"** For Single-Output Operation in 4-Phase Mode, tie both MODE pins to VDDA. Use FB1 of master IC to set VOUT. Connect FB2 of master IC to AGND. Connect FB2 of slave IC to VDDA to configure it as a slave **\")","v":""}]
[null,null,null,"Input Capacitor ESR",2,"mΩ"]
[null,null,null,"Resulting Input Voltage Ripple (max)",{"$f":"'Variable Management'!B144*1000","v":2.4208804991001731},"mVpk-pk",null,null,null,null,null,{"$f":"CHOOSE(SCH_MODE, \"\", \"** For Single-Output Operation in 2-Phase Mode, tie MODE to VDDA and use FB1 to set VOUT **\", \"** For Single-Output Operation in 3-Phase Mode, tie both MODE pins to VDDA. Use FB1 of master IC to set VOUT. Connect FB2 of master IC to AGND. Connect FB2 of slave IC to VDDA to configure it as a slave **\", \"** For Single-Output Operation in 4-Phase Mode, tie both MODE pins to VDDA. Use FB1 of master IC to set VOUT. Connect FB2 of master IC to AGND. Connect FB2 of slave IC to VDDA to configure it as a slave **\")","v":""}]
[null,null,null,"Input Capacitor RMS Current (max)",{"$f":"'Variable Management'!B127","v":0.15},"A (rms)"]
[]
["Step 5: Feedback Network"]
[null,null,null,{"$f":"CHOOSE(LM64k_Fixed_Vout, \"Upper Feedback Resistance\", \"* Tie FB to VOUT for a Fixed 5V Output\", \"* Tie FB to VOUT for a Fixed 3.3V Output\")","v":"Upper Feedback Resistance"},100,"kΩ"]
[null,null,null,"Lower Feedback Resistance (E96), RFBB",{"$f":"IF(Vout=Vref,\"OPEN\",Rfb2_u/1000)","v":43.2},{"$f":"IF(Vout=Vref,\"\",\"kΩ\")","v":"kΩ"}]
[null,null,null,"Feedforward Capacitance, CFF",10,"pF"]
[]
["Step 6: VIN UVLO",null,null,null,null,null,null,null,null,null,null,null,null,null,null,null," "]
[null,null,null,"Desired VIN UVLO Turn-On Threshold",3.5,"V"]
[null,null,null,"UVLO Divider Upper Resistance, RENT",175,"kΩ"]
[null,null,null,"UVLO Divider Lower Resistance (E96), RENB",{"$f":"Renb_u/1000","v":100},{"$f":"IF(Vout=Vref,\"\",\"kΩ\")","v":"kΩ"}]
[null,null,null,"Actual VIN UVLO Turn-On Threshold",{"$f":"1.263/E53*(E52+E53)","v":3.4732499999999997},"V"]
[null,null,null,"Actual VIN UVLO Turn-Off Threshold",{"$f":"E54*0.72","v":2.5007399999999995},"V"]
[]
[]
["Step 7: Power Loss & Thermals"]
[null,null,null,"IC Power Dissipation",{"$f":"'Efficiency Calculations'!BE109","v":1.1073925690870852},"W"]
[null,null,null,"Junction Temperature (estimate)",{"$f":"'Variable Management'!B283","v":118.46393283095},"°C"]
[null,null,null,null,{"$f":"CHOOSE(Ext_VCC, \"* Tie FB pin to VOUT\", \"* Tie FB pin to VOUT Resistor Divider\")","v":"* Tie FB pin to VOUT Resistor Divider"}]
[]
[]
[]
[]
[]
["Pole/Zero Frequencies"]
[null,null,null,"Load Pole Frequency, FP-LOAD",{"$f":"Fp_dominant/1000","v":0.81284811098205478},"kHz"]
[null,null,null,"Output Cap ESR Zero Frequency, FZ-ESR",{"$f":"Fesr/1000000","v":7.2343156033525613},"MHz"]
[null,null,null,"Error Amp Dominant Pole Frequency, FP-EA",{"$f":"Fp1_u","v":7.5190127686378041},"Hz"]
[null,null,null,"Compensator Zero Frequency, FZ-COMP",{"$f":"Fz1_u/1000","v":5.8946275286576437},"kHz"]
[null,null,null,"Compensator Pole Frequency, FP-COMP",{"$f":"Fp2_u/1000","v":120.61052937803368},"kHz"]

{"sheet":"Schematic Management","index":1,"n_rows":15,"n_cols":14,"rows_kept":15,"cut":false,"hidden":true,"merged":[]}
[{"$f":"VARIANT","v":1},null,null,null,null,null,null,null,null,null,null,null,null,"3.3V or 5V fixed (FB1/2)"]
[{"$f":"CHOOSE(VARIANT, \"LM63460_sch\", \"LM63460_sch\", \"LM64460_sch\", \"LM64460_fixed_VOUT_sch\", \"LM64460_fixed_VOUT_sch\")","v":"LM63460_sch"},null,null,null,null,null,null,null,null,"With/without dither (DITH)",null,null,null,"With/without VOUT connected to VCCX"]
[null,null,null,null,null,null,null,null,null,"FPWM or DEM (DEMB)"]
[null,null,null,null,null,null,null,null,null,"Shunt or inductor DCR current sensing"]
[]
[]
[]
[]
[]
[]
[]
[]
[]
[]
[null," "]

{"sheet":"Variable Management","index":2,"n_rows":344,"n_cols":27,"rows_kept":344,"cut":false,"hidden":true,"merged":[[4,4,4,7],[0,0,0,8]]}
["EXCEL Variables Names/Calculations"]
[null,"Input from user =",null,null,"Good"]
[null,"Output ="]
[null,"Constant"]
["Variable Name","Value","STD Units",null,"Notes",null,null,null,"Iteration"]
["Step 1: Operational Specs"]
["VIN_min",{"$f":"'Design the Converter'!E6","v":6},"V","Minimum input voltage",null,null,null,null,1]
["VIN_nom",{"$f":"'Design the Converter'!E7","v":28},"V","Nominal input voltage",null,null,null,null,null,null,"Use CFF",1,null,"LM64460-Q1 3.3Vout",{"$f":"IF(Vout = 3.3, 1, 0)","v":1},null,null,null,null,"Dual  Outputs",1,null,"FPWM",1,null,{"$f":"CHOOSE(SCH_MODE, \"Bode Plot (Ch1)\", \"Bode Plot - 2 Ph\", \"Bode Plot - 3 Ph\", \"Bode Plot - 4 Ph\")","v":"Bode Plot (Ch1)"},1]
["VIN_max",{"$f":"'Design the Converter'!E8","v":36},"V","Maximum input voltage",null,null,null,null,null,null,"No CFF",2,null,"LM64460-Q1 5Vout",{"$f":"IF(Vout = 5, 1, 0)","v":0},null,null,null,null,"Single Output – 2  Phases",2,null,"DEM",2,null,{"$f":"IF(MODE=1, \"Bode Plot (Ch2)\", \"N/A - Do Not Use\")","v":"Bode Plot (Ch2)"},2]
[null,null,null,null,null,null,null,null,null,null,null,1,null,"LM64460 Fixed Vout",{"$f":"IF(AND(GPN=3,Vout=3.3),3,IF(AND(GPN=3,Vout=5),2,1))","v":1},"1 = No, 2 = 5V, 3 = 3.3V",null,null,null,"Single Output – 3  Phases",3,null,"FPWM/DEM",2,null,"BODE_PLOT_TYPE",1]
["Vout",{"$f":"'Design the Converter'!E9","v":3.3},"V","Output voltage",null,null,null,null,null,null,"NO_FF_CAP",{"$f":"IF(L10=2, TRUE, FALSE)","v":false},null,null,{"$f":"AND(GPN=3, OR(O8,O9))","v":false},null,null,null,null,"Single Output – 4  Phases",4]
["Iout",{"$f":"'Design the Converter'!E10","v":0.3},"A","Output current",null,"Iout-max",{"$f":"CHOOSE(GPN, 6, 6)","v":6},"A",1,null,null,null,null,null,null,null,null,null,null,"Single/Dual Yes/No",1]
[null,null,null,null,null,null,null,null,1,null,null,null,null,null,null,null,null,null,null,"MODE (Single/Dual), DUAL = 1, SINGLE = 2",{"$f":"IF(U12=1, 1, 2)","v":1},null,"Fixed Output",1]
["Rout",{"$f":"Vout/Iout","v":11},"W","Load resistance",null,null,null,null,null,null,null,null,null,"LMR36503E-Q1 Adjust",1,null,null,null,null,"SINGLE OUTPUT (1 = YES)",{"$f":"IF(U12=1, 2, 1)","v":2},null,"Adjustable Output",2]
["Pout",{"$f":"Vout*Iout","v":0.98999999999999988},"W","Output power",null,null,null,null,null,null,null,null,null,"LMR36503E-Q1 Fixed",2,null,null,null,null,"Number of Phases",{"$f":"SCH_MODE","v":1},null,"Ext_VCC",2]
[null,null,null,null,null,null,null,null,null,null,null,null,null,"LM64460-Q1",3]
["Efficiency",0.9,null,"Estimate of efficiency",null,null,null,null,null,null,null,null,null,"LM64460-Q1 5V",4]
["Pin",{"$f":"Pout/Efficiency","v":1.0999999999999999},"W","Calculate input power assuming finite efficiency",null,null,null,null,null,null,null,null,null,"LM64460-Q1 3.3V",5]
[null,null,null,null,null,null,null,null,null,null,null,"GPN",null,null,1,null,null,null,null,null,null,null,"2.2 MHz Fsw Setting",1]
["Iin_Vinmin",{"$f":"Pin/VIN_min","v":0.18333333333333332},"A",null,null,null,null,null,null,null,null,null,null,{"$f":"CHOOSE(GPN, \"LM63460-Q1\", \"LM63460-Q1\", \"LM64460-Q1\")","v":"LM63460-Q1"},null,null,null,null,null,null,null,null,"440 kHz Fsw Setting",2]
["Iin_Vinnom",{"$f":"Pin/VIN_nom","v":3.9285714285714278E-2},"A","Input currents at min, nom, max Vin",null,null,null,{"$f":"AND(OSC=1, OR(Fsw/1000>2530, Fsw/1000<1800))","v":false},null,null,"Variant","VARIANT",null,{"$f":"CHOOSE(VARIANT, \"LM63460AAS\",\"LM63460AFS\", \"LM64460APP\", \"LM64460BPP\", \"LM63460CPP\")","v":"LM63460AAS"},{"$f":"IF(AND(GPN=3,Vout=5),4,IF(AND(GPN=3,Vout=3.3),5,GPN))","v":1},null,null,null,null,null,null,null,"OSC",2]
["Iin_Vinmax",{"$f":"Pin/VIN_max","v":3.0555555555555551E-2},"A",null,null,null,null,{"$f":"AND(OSC=2, OR(Fsw/1000>500, Fsw/1000<300))","v":true}]
[null,null,null,null,null,null,null,{"$f":"OR(H21,H22)","v":true}]
["Fsw",{"$f":"'Design the Converter'!E11*1000","v":2200000},"Hz","Nominal switching frequency - determines RT resistor"]
["RT resistor to AGND",{"$f":"18286/((Fsw/1000)^1.021)","v":7.0713959964895752},"kΩ",null,null,null,null,null,1]
["Tsw",{"$f":"1/Fsw","v":4.5454545454545452E-7},"sec","Switching period"]
["Max crossover frequency = 20% Fsw",{"$f":"Fsw*0.2/1000","v":440},"kHz",null,null,"Min Crossover",10,null,null,null,"Adjustable",1]
["Vref",1,"V","Reference voltage",null,null,null,null,null,null,"5V",2]
["Rt",{"$f":"'Standard Value Calculator'!O12/1000","v":7.15},"kΩ","Frequency set resistor",null,{"$f":"IF(OR((Fsw=440000),(Fsw=2200000)),\"N/A\",Rfadj/1000)","v":"N/A"},null,null,null,null,"3.3V",3]
[null,null,null,null,null,null,null,null,null,null,"Adjustable_NoRT",4]
[null,null,null,null,null,null,null,null,null,null,"5V_NoRT",5]
[null,null,null,null,null,null,null,null,null,null,"3.3V_NoRT",6]
["Step 2: Buck Inductor","Channel 1",null,null,null,null,null,null,null,null,"Schematic setting",{"$f":"IF(No_RT, IF(Vout=3.3, 6, IF(Vout=5, 5, 4)),IF(Vout=3.3, 3, IF(Vout=5, 2, 1)))","v":6}]
["Don1",{"$f":"Vout/VIN_nom","v":0.11785714285714285},null,null,null,"Ideal Duty Cycle at VIN(nom)"]
["Doff1",{"$f":"1-34:34","v":0.88214285714285712},null,null,null,"Ideal 1- Duty Cycle at VIN(nom)"]
[]
["D_Vinmin",{"$f":"Vout/VIN_min","v":0.54999999999999993}]
["D_Vinnom",{"$f":"Vout/VIN_nom","v":0.11785714285714285}]
["D_Vinmax",{"$f":"Vout/VIN_max","v":9.166666666666666E-2}]
[]
["L_Vinnom",{"$f":"(VIN_nom-Vout)*D1_Vinnom/(Fsw*Iout*0.35)","v":1.2602040816326531E-5},"H",null,null,"Calculated inductance for 35% ripple at VIN(nom)"]
["L_slopecomp",{"$f":"2.5*Vout/Fsw","v":3.7500000000000001E-6},"H",null,null,"Calculated inductance based on one times inductor downslope"]
[]
["Lopt",{"$f":"B41","v":1.2602040816326531E-5},"H",null,null,"min of calculated inductances at VIN(min) and VIN(nom)"]
["L_actual_TPSM63602-03",{"$f":"-0.0238*Iout^2-0.0868*Iout+2.0073","v":1.9791179999999999},"uH",null,null,"Calculate TOKO chip inductance based on entered load current value"]
["L_actual_TPSM63604-06",{"$f":"-0.1304*Iout+2.32","v":2.2808799999999998},"uH",null,null,"Calculate MagLayers inductance based on entered load current value"]
[]
["Lo",{"$f":"'Design the Converter'!E17*0.000001","v":1.2E-5},"H",null,null,"Chosen inductance"]
["Rdcr",{"$f":"'Design the Converter'!E18/1000","v":2.5000000000000001E-2},"W",null,null,"Chosen inductor DCR"]
[]
["Don2",{"$f":"(Vout+Iout*(Rdcr+Rdson2))/(Vin+Iout*(Rdson2-Rdson1))","v":0.12148946840521564}]
["Doff2",{"$f":"1-_Don2","v":0.87851053159478432}]
[]
["D_Vinmin_2",{"$f":"(Vout+Iout*(Rdcr+Rdson2))/(VIN_min+Iout*(Rdson2-Rdson1))","v":0.57327586206896541},null,{"$f":"Vout/VIN_min","v":0.54999999999999993},null,"Duty cycles adjusted for DCR/Rdson voltage drops"]
["D_Vinnom_2",{"$f":"(Vout+Iout*(Rdcr+Rdson2))/(VIN_nom+Iout*(Rdson2-Rdson1))","v":0.12148946840521564},null,{"$f":"Vout/VIN_nom","v":0.11785714285714285}]
["D_Vinmax_2",{"$f":"(Vout+Iout*(Rdcr+Rdson2))/(VIN_max+Iout*(Rdson2-Rdson1))","v":9.4428666889408625E-2},null,{"$f":"Vout/VIN_max","v":9.166666666666666E-2},null,{"$f":"(Ts-0.000000085)/Ts","v":0.81300000000000006},"Dmax = [Ts-toff(min)]/Ts"]
[]
[]
["Iripple_Vinmin",{"$f":"(VIN_min-Vout-Iout*(Rdcr+Rdson1))*D1_Vinmin_2/(Fsw*Lf)","v":5.4819504310344817E-2},"A",{"$f":"B59/Iout","v":0.18273168103448273},null,"Ripple calculations include DCR and Rdson"]
["Iripple_Vinnom",{"$f":"(VIN_nom-Vout-Iout*(Rdcr+Rdson1))*D1_Vinnom_2/(Fsw*Lf)","v":0.11285865408726177},"A",{"$f":"B60/Iout","v":0.37619551362420589},null,"% ripple current at Vin-nom"]
["Iripple_Vinmax",{"$f":"(VIN_max-Vout-Iout*(Rdcr+Rdson1))*D1_Vinmax_2/(Fsw*Lf)","v":0.11633504455471859},"A",{"$f":"B61/Iout","v":0.38778348184906197},null,"Max inductor ripple current - it's at Vin-max"]
[]
["Iinductor_rms_Vinmin",{"$f":"SQRT(Iout^2+(Iripple_Vinmin^2)/12)","v":0.30041709589236537},"A"]
["Iinductor_rms_Vinnom",{"$f":"SQRT(Iout^2+(Iripple_Vinnom^2)/12)","v":0.30176385301015152},"A"]
["Iinudctor_rms_Vinmax",{"$f":"SQRT(Iout^2+(Iripple_Vinmax^2)/12)","v":0.30187384818159119},"A"]
[]
[]
["Core loss estimate - Vin(nom)",{"$f":"'Design the Converter'!E23","v":0.1},"W"]
[]
[]
["Inductor copper temperature",125,"°C"]
["Inductor DCR at hot",{"$f":"Rdcr*(1+Ltc*(B71-25))*1000","v":34.825000000000003},"mW"]
[]
[]
["Step 2b: Sense Resistors, Slope Comp, Current Limit"]
[]
["Ilimit_inductor_Vinmin",{"$f":"Ipk_OCP_Vinmin","v":0.43693965517241379},"A",null,null,"Peak inductor current at current limit inception"]
["Ilimit_inductor_Vinnom",{"$f":"Ipk_OCP_Vinnom","v":0.48663615847542629},"A"]
["Ilimit_inductor_Vinmax",{"$f":"Ipk_OCP_Vinmax","v":0.48961284664216503},"A"]
[]
["CS threshold_min",6.8000000000000005E-2,"V","not applicable here"]
["CS threshold",7.4999999999999997E-2,"V"]
["CS threshold_max",8.2000000000000003E-2,"V"]
[]
["Rs",0.55000000000000004,"W",null,null,"Current sense resistance Rs = high-side MOSFET Rdson"]
[]
["Current limit setpoint - peak - Vin(min)",{"$f":"0.5-(1.1/10)*MAX(0, (D1_Vinmin_2))","v":0.43693965517241379},"A",null,"10.3-3.6*MAX(0, (D1_Vinmin_2-0.35)) (original)","Peak current limit (0.42A trimmed at ATE minus slope comp contribution) = min inductor sat current at hot"]
["Current limit setpoint - peak - Vin(nom)",{"$f":"0.5-(1.1/10)*MAX(0, (D1_Vinnom_2))","v":0.48663615847542629},"A"]
["Current limit setpoint - peak - Vin(max)",{"$f":"0.5-(1.1/10)*MAX(0, (D1_Vinmax_2))","v":0.48961284664216503},"A"]
[]
["Iout_OCP_Vinmin",{"$f":"Ipk_OCP_Vinmin-Iripple_Vinmin/2","v":0.4095299030172414},"A",null,null,"Current limit setpoints (i.e. IOUT) assuming no CS delay"]
["Iout_OCP_Vinnom",{"$f":"Ipk_OCP_Vinnom-Iripple_Vinnom/2","v":0.43020683143179539},"A"]
["Iout_OCP_Vinmax",{"$f":"Ipk_OCP_Vinmax-Iripple_Vinmax/2","v":0.43144532436480576},"A"]
[]
["Ipk_full-load_Vinmin",{"$f":"Iout+Iripple_Vinmin/2","v":0.32740975215517237},"A"]
["Ipk_full-load_Vinnom",{"$f":"Iout+Iripple_Vinnom/2","v":0.35642932704363089},"A"]
["Ipk_full-load_Vinmax",{"$f":"Iout+Iripple_Vinmax/2","v":0.35816752227735926},"A"]
[]
[]
["Step 3: Output Capacitor"]
["Icoutrms_VINmin",{"$f":"Iripple_Vinmin/SQRT(12)","v":1.5825027785209715E-2},"A",null,null,"Output cap RMS current"]
["Icoutrms_VINnom",{"$f":"Iripple_Vinnom/SQRT(12)","v":3.2579487158829724E-2},"A"]
["Icoutrms_VINmax",{"$f":"Iripple_Vinmax/SQRT(12)","v":3.3583034644926943E-2},"A"]
["Max Cout rms current",{"$f":"MAX(B101:B103)","v":3.3583034644926943E-2},"A"]
[]
["Vripple1",{"$f":"'Design the Converter'!E26/1000","v":0.01},"V",null,null,"Output voltage ripple spec(pk-pk)"]
[]
["Output Ripple Spec (pk-pk)",{"$f":"Vo1_ripple*1000","v":10},"mV",null,null,"Vout ripple spec at Vin(nom)"]
[]
["Coutmin",{"$f":"Iripple_Vinnom/(Fsw*8*Vo1_ripple)","v":6.4124235276853279E-7},"F",null,null,"Minimum output capacitnace",null,{"$f":"Vo2_ripple","v":0},1]
["Reported Coutmin",{"$f":"IF(Cout_min*1000000<10, 10,Cout_min*1000000)","v":10},"uF"]
["Cout",{"$f":"'Design the Converter'!E30/1000000","v":2.1999999999999999E-5},"F",null,null,"Chosen output capacitance",null,null,1]
["Resrmax",{"$f":"SQRT((Vo1_ripple/Iripple_Vinnom)^2-(1/(Fsw*Cout*8))^2)","v":8.8568761780274632E-2},"W",null,null,"Max ESR before ripple exceeds Vripple1. Terms are squared because the voltage ripple from ESR and output capacitor are out of phase, so you need to treat the ripples like you're summing two orthogonal vectors.",null,null,1]
[]
["Reported Cout ESR max",{"$f":"IF(OR(CoutEsrMax>0.3, CoutEsrMax<0, (ISERROR(CoutEsrMax))), \"N/A\", CoutEsrMax*1000)","v":88.568761780274627},"mΩ"]
["CoutEsr",{"$f":"'Design the Converter'!E32/1000","v":1E-3},"W",null,null,"Chosen ESR",null,null,1,null,{"$f":"ISERROR(CoutEsrMax)","v":false},{"$f":"ISERROR(B115)","v":false}]
["Vripple",{"$f":"Iripple_Vinnom*SQRT(Cout_ESR^2+(1/(8*Fsw*Cout))^2)","v":3.1256047410487084E-4},"Vp-p",null,null,null,null,null,null,null,null,{"$f":"OR(CoutEsrMax>0.3,CoutEsrMax<0)","v":false}]
[null,null,null,null,null,null,null,null,null,null,{"$f":"OR(TRUE, FALSE, TRUE)","v":true}]
["Step 4: Input Capacitor"]
[]
["Icinrms_VINmin",{"$f":"SQRT(D1_Vinmin_2*(Iout^2*(1-D1_Vinmin_2)+Iripple_Vinmin^2/12))","v":0.14886344299390686},"A",null,null,"Calculate input cap rms current",null,null,null,null,null,null,null,"A"]
["Icinrms_VINnom",{"$f":"SQRT(D1_Vinnom_2*(Iout^2*(1-D1_Vinnom_2)+Iripple_Vinnom^2/12))","v":9.8664237120080447E-2},"A"]
["Icinrms_VINmax",{"$f":"SQRT(D1_Vinmax_2*(Iout^2*(1-D1_Vinmax_2)+Iripple_Vinmax^2/12))","v":8.8332151551884244E-2},"A"]
["Max Cin rms current",{"$f":"MAX(B121:B123)","v":0.14886344299390686},"A"]
[]
["Icinrms - max at D = 0.5",{"$f":"Iout/2","v":0.15},"A"]
["Final result",{"$f":"IF(VIN_min<2*Vout, Iout/2, B121)","v":0.15},"A","…report this"]
[]
["Vinripple1",{"$f":"'Design the Converter'!E37/1000","v":0.12},"Vp-p",null,null,"Input voltage ripple spec (pk-pk)"]
[null,null,null,null,null,{"$f":"Number_of_Phases","v":1}]
["Cinmin_Vinmax",{"$f":"Iout*D1_Vinmax*(1-D1_Vinmax)/(Vinripple1*Fsw)","v":9.4618055555555538E-8},"F",null,null,"Calculate cap at Vinmax and 50% duty cycle (Vin = 2*Vout)"]
["Cinmin_50%D",{"$f":"Iout*0.5*(1-0.5)/(Vinripple1*Fsw)","v":2.8409090909090909E-7},"F",null,null,"Buck 50% typically worst case"]
["Cinmin",{"$f":"IF(VIN_max<2*Vout, B131,B132)","v":2.8409090909090909E-7},"F"]
["Reported Cinmin",{"$f":"IF(Cinmin*1000000<4.7, 4.7,Cinmin*1000000)","v":4.7},"uF",null,null,"…report this"]
["Cin",{"$f":"'Design the Converter'!E39/1000000","v":2.0000000000000002E-5},"F",null,null,"Input capacitance"]
["CinEsrMax_Vinmax",{"$f":"-(Iout*D1_Vinmax*(1-D1_Vinmax)/(Cin*Fsw)-Vinripple1)/(Iout+Iripple_Vinmax/2)","v":0.33345371715244515},"W"]
["CinEsrMax_50%D",{"$f":"-(Iout*0.5*(1-0.5)/(Cin*Fsw)-Vinripple1)/(Iout+Iripple_Vinmax/2)","v":0.33027967972441791},"W",null,null,"Calculate ESR at Vinmax and 50% duty cycle (Vin = 2*Vout)"]
["CinEsrMax",{"$f":"IF(VIN_max<2*Vout, B136,B137)","v":0.33027967972441791},"W"]
["Reported Cin ESR max",{"$f":"IF(OR(CinEsrMax>0.3, CinEsrMax<0), \"N/A\",CinEsrMax*1000)","v":"N/A"},"mΩ",null,null,"…report this"]
["RCinEsr",{"$f":"'Design the Converter'!E41/1000","v":2E-3},"W",null,null,"Input capacitance series resistance (ESR)"]
[]
["Vinripple2_Vinmax",{"$f":"Iout*D1_Vinmax_2*(1-D1_Vinmax_2)/(Cin*Fsw)+(Iout +Iripple_Vinmax/2)*RCinEsr","v":1.2993706838199301E-3},"Vp-p"]
["Vinripple2_50%D",{"$f":"Iout*0.5*(1-0.5)/(Cin*Fsw)+(Iout +Iripple_Vinmax/2)*RCinEsr","v":2.4208804991001729E-3},"Vp-p",null,null,"Calculate ripple at Vinmax and 50% duty cycle (Vin = 2*Vout)"]
["Vinripple2",{"$f":"IF(VIN_max<2*Vout, B142,B143)","v":2.4208804991001729E-3},"Vp-p",null,null,"…report highest of these"]
[]
[null,{"$f":"Iout*D1_Vinmax_2*(1-D1_Vinmax_2)/(Cin*Fsw)","v":5.830356392652116E-4},"Vp-p"]
[]
["Step ?: Other Components - MODE"]
[]
["RPG1/2",100,"kΩ"]
["RFB1/2",null,"W",null,"Tie to VDDA or AGND for 3.3V/5V output, respectively. "]
["R_MODE",null,"W",null,"Tie to VDDA or AGND for Single/Dual operation, respectively. "]
["R_DEMB",null,"W",null,"Tie to VDDA or AGND for FPWM/DEM, respectively. "]
[]
[]
["Step 5: Feedback Network and Internal Compensation"]
["Pi",3.1415926500000002,null,"p"]
["CS Amp Gain (effective value)",1,null,"*per Simplis",null,"Effective CS gain - depending on control architecture = 1/(Imod*Rdson_HS*0.73) = 1/(6*1.7*41mΩ*0.73)"]
["Ri",0.55000000000000004,"W","Grabbed value from SIMPLIS model.Use slightly higher value to match bench",null,"Current Sense effective resistance = shunt resistor Rs * CS amp gain = 0.1343Ω"]
[]
["Se_ext",{"$f":"B165/Ri*1000","v":439999.99999999994},"A/s",null,null,"Slope Comp Slope - referred to inductor current"]
["Sn",{"$f":"(Vin-Vout)/Lf","v":2058333.3333333333},"A/s",null,null,"On-time Slope"]
["Sf",{"$f":"Vout/Lf","v":275000},"A/s",null,null,"Off-time Slope"]
[]
["Se_int",{"$f":"0.11*Fsw/1000","v":242},"mV/μs","From SIMPLIS (1.1V amplitude, period of 1/fsw, *gain (6000/60000","originally 3.6*Ri*Fsw/1000","Slope Comp Slope - referred to IC"]
["Sn_int",{"$f":"Sn*Ri/1000","v":1132.0833333333335},"mV/μs",null,null,"Upslope"]
["Sf_int",{"$f":"Sf*Ri/1000","v":151.25},"mV/μs",null,null,"Downslope"]
[]
["mc_buck",{"$f":"1+Se_ext/Sn","v":1.2137651821862347},null,null,null,"mc = 1 + Se/Sn for peak current-mode buck"]
["k_buck",{"$f":"mc_buck*(1-D1_Vinnom_2)","v":1.0663054954336693},null,"PCM2 Bob Sheehan, equivalent variable for mc*D'",null,"mc*(1-d)"]
[]
["mc",{"$f":"1+Se_ext/Sn","v":1.2137651821862347}]
["k",{"$f":"mc_buck*(1-D1_Vinnom_2)","v":1.0663054954336693},null,"PCM2 Bob Sheehan, equivalent variable for mc*D'"]
["Q",{"$f":"1/Pi/(k-0.5)","v":0.56208157807784509},null,"Q equation in PCM2 Bob Sheehan",null,"1/(Pi*(k-0.5))",null,"Q = 2/Pi = 0.636 gives ideal one-cycle damping"]
[]
["Error Amp (EA)"]
["gm",{"$f":"15/1000000*1","v":1.5E-5},"S",null,null,"Error Amp Transconductance"]
["GBW",5,"MHz","Simplis (plotting TF across error amp_",null,"EA gain-bandwidth product"]
["Cbw",{"$f":"gm/(2*Pi*GBW*1000000)","v":4.7746482982126918E-13},"F",null,null,"EA effective bandwidth limiting capacitance = gm/(2*Pi*GBW)"]
[]
["RoEA",{"$f":"1057000000","v":1057000000},"W","Simplis model (DCGain/GM)",null,"EA output resistance"]
["AEA",{"$f":"gm*RoEA*0.305","v":4835.7749999999996},"V/V","Had to multiply by 0.77*6k/15.13k per simplis",null,"EA DC gain = gm*RoEA"]
["Afb",{"$f":"Vref/Vout","v":0.30303030303030304},"V/V",null,null,"Feedback gain from Vout to FB"]
["Acs",{"$f":"1/Ri","v":1.8181818181818181},null,null,null,"Acs = 1/Ri"]
["Am_buck",{"$f":"(Ro/Number_of_Phases)/Ri/((1+Ro/Number_of_Phases*(k-0.5)/(Fsw*Lf)))","v":16.181745296932903},null,"Not used"]
["Am",{"$f":"Ro/Ri/((1+Ro*(k-0.5)/(Fsw*Lf)))","v":16.181745296932903},null,"Vo/Vc (from modulator gain)",null,"Buck modulator gain"]
[]
["Scaling factor to calculate Rcomp - buck",{"$f":"2*Pi*Ri/gm","v":230383.46100000001},null,null,null,"2*Pi*Ri/gm -- scaling factor to calculate Rcomp given desired buck crossover frequency"]
["DC Gain is Adc = AEA*Afb*Am"]
[]
["Rout",{"$f":"Rout","v":11},"W",null,null,"Output Resistance (Load)"]
[]
["Fp_load_buck",{"$f":"1/(2*Pi*Ro*Cout)+(k-0.5)/(2*Pi*Fsw*Lf*Cout)","v":812.84811098205478},"Hz",null,null,"Buck dominant pole frequency -- note slope comp influence"]
["Fp_dominant",{"$f":"Fload_u","v":812.84811098205478},"Hz"]
["Cbw",{"$f":"Cbw","v":4.7746482982126918E-13},"F",null,null,"Cbw"]
["Fp_EA",{"$f":"1/(2*Pi*(RoEA+Rcea1_u)*Cc1ea_u)","v":7.5190127686378041},"Hz",null,null,"Error Amp LF pole -- related to amplifier ouptut resistance and comp cap"]
["Fp_HF",{"$f":"1/(2*Pi*Rcea1_u*(Cc2ea_u+Cbw))","v":120610.52937803368},"Hz",null,null,"Error Amp HF pole cancels zero related to Output Cap ESR"]
["Fesr",{"$f":"1/(2*Pi*Cout*Cout_ESR)","v":7234315.6033525616},"Hz",null,null,"Cout ESR zero frequency"]
["F_mod",{"$f":"Fsw/2","v":1100000},"Hz",null,null,"Zero-order sample-and-hold effects of current-mode control modeled as pole at Fsw/2"]
["Fz_ff",{"$f":"IF(NO_FF_CAP=TRUE, 1000000000, 1/(2*Pi*Rfb1_*Cff_u*0.000000000001))","v":159154.94327375636},"Hz",{"$f":"Fz_ff/1000","v":159.15494327375637},"kHz"]
["Fp_ff",{"$f":"IF(NO_FF_CAP=TRUE, 1000000000, 1/(2*Pi*Rfb4_u*Cff_u*0.000000000001))","v":527569.16381485912},"Hz",{"$f":"Fp_ff/1000","v":527.56916381485917},"kHz"]
[]
["Desired Crossover Frequency",{"$f":"'Design the Converter'!E28*1000","v":62000},"Hz"]
["Cout - for the Fc spec",{"$f":"Rcea1_u/Fcross/(2*Pi*Ri/(gm*Afb))*1000000","v":28.640252388639176},"uF",null,null,"Output cap to meet the crossover frequeny spec"]
["Rcea1",{"$f":"Fcross*Cout*2*Pi*Ri/(gm*Afb)","v":1037002.0346532001},"W",null,null,"This component will largely determine the crossover frequency",null,null,null,null,{"$f":"Fcross/Fp_dominant/(gm*Afb*Am)","v":1037002.0346532002}]
["Cc1ea, Cc3ea",{"$f":"10/(Rcea1*Fcross*2*Pi)","v":2.4754196504072628E-11},"F",null,null,"This along with Rcea1 will set a zero at Fcrossover/5 to optimize phase margin"]
["Cc2ea, Cc4ea",{"$f":"MAX(1/(Rcea1*2*Pi*Fesr)-Cbw, 1/(Rcea1*2*Pi*(Fsw/2))-Cbw)","v":-3.3794117679831437E-13},"F",null,null,"This along with Rcea1 places a pole at the output cap ESR zero"]
[]
["Chosen Compensation Components from the standard value sheet"]
["Rcea1_u",1350000,"W","Rzero1_simplis",null,{"$f":"1/(Rcea1*2*Pi*(Fsw/2))-Cbw","v":-3.3794117679831437E-13}]
["Cc1ea_u",1.9999999999999999E-11,"F","Cpole1_simplis"]
["Cc2ea_u",4.9999999999999999E-13,"F","Cpole2_simplis"]
[]
["Resulting Pole/Zero Locations",null,null,null,null,{"$f":"Cout","v":2.1999999999999999E-5},{"$f":"Cout_ESR","v":1E-3}]
["Fz1",{"$f":"1/(2*Pi*Rcea1_u*Cc1ea_u)","v":5894.6275286576438},"Hz",null,null,"This zero is set at or close to the dominant load pole"]
["Fp2",{"$f":"1/(2*Pi*Rcea1_u*(Cc1ea_u*(Cc2ea_u+Cbw)/(Cc1ea_u+Cc2ea_u+Cbw)))","v":126505.15690669132},"Hz",null,null,"This pole cancels the zero from the Output Cap ESR"]
[]
["Rfb1",{"$f":"'Design the Converter'!E46*1000","v":100000},"W",null,null,"Lower Feedback Resistance - chosen by user"]
["Rfb2",{"$f":"IF(Vout=Vref, \"N/A\", Vref/(Vout-Vref)*B218)","v":43478.260869565223},"W",{"$f":"Rfb2_u","v":43200},null,"Upper Feedback Resistance"]
["Rfb2_u",{"$f":"IF(Vout=Vref,\"N/A\",'Standard Value Calculator'!O11)","v":43200},"W",null,null,"Std Value Upper Feedback Resistance"]
["Cff",{"$f":"1/(2*Pi*200000)/Rfb1_","v":7.9577471636878189E-12},"F",{"$f":"1/(1/Rfb1_+1/Rfb2_u)","v":30167.597765363127},"W","Based on a 200kHz zero frequency"]
["Cff_u",{"$f":"IF('Design the Converter'!E48<0.1, 0.1, 'Design the Converter'!E48)","v":10},"pF"]
[]
[]
["Step 6: UVLO Divider"]
["VIN UVLO turn-on voltage",{"$f":"'Design the Converter'!E51","v":3.5},"V"]
["VIN UVLO turn-off voltage",{"$f":"'Design the Converter'!E55","v":2.5007399999999995},"V"]
["Rent",{"$f":"'Design the Converter'!E52*1000","v":175000},"W"]
["Renb",{"$f":"B228*(1.263/(B226-1.263))","v":98804.202056325434},"W"]
["Renb_u",{"$f":"'Standard Value Calculator'!O7","v":100000},"W"]
[]
["Step 7: Efficiency"]
["VAR",0]
["Design"]
["Ta",{"$f":"'Design the Converter'!E13","v":25},"°C","Ambient Temperature"]
["Components"]
["LTc",{"$f":"3930/1000000","v":3.9300000000000003E-3},"%/°C","Inductor DCR Temp Co"]
["θCA",22,"°C/W","Inductor Core-to-Ambient Thermal Resistance"]
["RCinEsr",{"$f":"RCinEsr","v":2E-3},"W","Input Capacitor ESR"]
[]
["Controller Characteristics"]
["VCC",3.15,"V"]
["Top Driver"]
["RdsonDRT",0.5,"W","Drain-Source Resistance of Pullup High-side FET Driver"]
["RdsonDRT2",0.5,"W","Drain-Source Resistance of Pulldown High-side FET Driver"]
["Bottom Driver"]
["RdsonDRB",0.5,"W","Drain-Source Resistance of Pullup Low-side FET Driver"]
["RdsonDRB2",0.5,"W","Drain-Source Resistance of Pulldown Low-side FET Driver"]
["Deadtime"]
["Deadtime",5.5500000000000001E-9,"s","Total Deadtime",null,null,"5.55ns"]
["IQ"]
["IQ ",3.4999999999999997E-5,"A","Quiescent Current of MC-Q0 converter (current into VOUT/BIAS pin + VIN pin, non switching)"]
[]
["High- & low-side MOSFETs - Ch1","Q1: high-side",null,"Q2: low-side"]
["Rdson",{"$f":"'MOSFET Parameters'!E6/1000","v":0.56000000000000005},"W",{"$f":"'MOSFET Parameters'!F6/1000","v":0.28000000000000003},"W","Drain-Source Resistances of Channel 1 FETs"]
["RdsonTopTc",{"$f":"4000/1000000","v":4.0000000000000001E-3},"%/°C",4.0000000000000001E-3,"%/°C","Drain-Source Resistance Temp Co"]
["Qg",{"$f":"'MOSFET Parameters'!E7/1000000000","v":3E-9},"C",{"$f":"'MOSFET Parameters'!F7/1000000000","v":6E-9},"C","Gate Charge at VCC = 5V"]
["Qgd",{"$f":"'MOSFET Parameters'!E8/1000000000","v":2.6000000000000003E-10},"C",{"$f":"'MOSFET Parameters'!F8/1000000000","v":4.4600000000000001E-10},"C","Gate to Drain Charge"]
["Qgs",{"$f":"'MOSFET Parameters'!E9/1000000000","v":6.2200000000000002E-11},"C",{"$f":"'MOSFET Parameters'!F9/1000000000","v":1.2199999999999999E-10},"C","Gate to Source Charge"]
["Qoss",{"$f":"'MOSFET Parameters'!E10/1000000000","v":4.0000000000000002E-9},"C",{"$f":"'MOSFET Parameters'!F10/1000000000","v":2.0000000000000001E-9},"C","Output Charge"]
["Coss",{"$f":"'MOSFET Parameters'!E11/1000000000000","v":5.2990000000000003E-11},"F",{"$f":"'MOSFET Parameters'!F11/1000000000000","v":1.0184000000000001E-10},"F","Output Capacitance"]
["Rgate",{"$f":"'MOSFET Parameters'!E12","v":0},"W",{"$f":"'MOSFET Parameters'!F12","v":0},"W","Gate Resistance"]
["Gfs",{"$f":"'MOSFET Parameters'!E13","v":100},"S",{"$f":"'MOSFET Parameters'!F13","v":100},"S","Transconductance"]
["Vth",{"$f":"'MOSFET Parameters'!E14","v":1.5},"V",{"$f":"'MOSFET Parameters'!F14","v":1.5},"V","Threshold Voltage"]
["Vsp",{"$f":"Vth_Q1+Iout/Gfs_Q1","v":1.5029999999999999},"V",{"$f":"Vth_Q2+Iout/Gfs_Q2","v":1.5029999999999999},"V","Switch Point Voltage of FETs"]
[]
["Vsd - Buck",{"$f":"'MOSFET Parameters'!E15","v":0.86599999999999999},"V",{"$f":"'MOSFET Parameters'!F15","v":0.86599999999999999},"V","Diode Forward Voltage of MOSFET Body diode"]
["QrrTop",null,"C",{"$f":"'MOSFET Parameters'!F16/1000000000","v":6.9999999999999998E-9},"C","Reverse Recovery Charge of Body Diode"]
["TrrTop",4.0000000000000001E-8,"s",4.0000000000000001E-8,"s","Reverse Recovery Time of Body Diode"]
["θJA-MOSFET",23,"°C/W",23,"°C/W","Junction-to-Ambient Resistance"]
[]
[]
["Controller"]
["θJACtrl",84.4,"°C/W",null,null,"Junction-to-ambient thermal resistance of controller"]
["Outputs"]
["Top FET"]
["Tr",{"$f":"(Qgd_Q1+Qgs_Q1/2)*(RdsonDRT+Rgate1)/(VCC-Vsp_Q1)","v":8.8372799028536756E-11},"s"]
["Tf",{"$f":"(Qgd_Q1+Qgs_Q1/2)*(RdsonDRT2+Rgate1)/(Vsp_Q1)","v":9.6839654025282794E-11},"s"]
[]
["IC Power Disipation","Value","Units"]
["Power Dis",{"$f":"'Efficiency Calculations'!BE109","v":1.1073925690870852},"W"]
["Temp rise",{"$f":"B281*ThetaJaCtrl","v":93.46393283095},"°C"]
["Junction temperature",{"$f":"B282 + Ta","v":118.46393283095},"°C"]
[]
["Current (switching)",{"$f":"(Qg_Q1+Qg_Q2)*Fsw+Iq","v":1.9834999999999998E-2},"A"]
["Qrr Current",{"$f":"Qrr_Q2*Fsw","v":1.5399999999999999E-2},"A"]
["Diode Current",{"$f":"C287/Vin","v":{"$error":"#NAME?"}},{"$f":"Deadtime*Fsw*(Ipp/2)*(Vsd_Q1+Vsd_Q2)","v":{"$error":"#NAME?"}}]
["Total Application Switching IQ",{"$f":"SUM(B285:B287)","v":{"$error":"#NAME?"}},"A"]
[]
["Low-side MOSFET/Diode"]
["Part Power"]
["Power Dis"]
[]
["SCHEMATIC LABELS"]
[{"$f":"\"RFBT = \"&'Design the Converter'!E46&\"kΩ\"","v":"RFBT = 100kΩ"},{"$f":"IF(VARIANT<4, 'Design the Converter'!E46&\" kΩ\", \"\")","v":"100 kΩ"},null,{"$f":"'Design the Converter'!E46&\"kΩ\"","v":"100kΩ"}]
[{"$f":"\"RFBB = \"&'Design the Converter'!E47&\"kΩ\"","v":"RFBB = 43.2kΩ"},{"$f":"IF(VARIANT<4, 'Design the Converter'!E47&\" kΩ\", \"\")","v":"43.2 kΩ"},null,{"$f":"'Design the Converter'!E47&\"kΩ\"","v":"43.2kΩ"}]
[{"$f":"\"CFF = \"&'Design the Converter'!E48&\"pF\"","v":"CFF = 10pF"},{"$f":"IF(VARIANT< 4, IF(NO_FF_CAP=TRUE,\"N/A\",IF(Cff_u>0.1,ROUND(Cff_u,1)&\" pF\",\"N/A\")), \"\")","v":"10 pF"},null,{"$f":"IF(Cff_u>0, ROUND(Cff_u,1), \"N/A\")","v":10}]
[]
[{"$f":"\"RRT = \"&'Design the Converter'!E12&\"kΩ\"","v":"RRT = 7.15kΩ"},{"$f":"CHOOSE(GPN, 'Design the Converter'!E12&\" kΩ\",  'Design the Converter'!E12&\" kΩ\", \"\")","v":"7.15 kΩ"},null,{"$f":"'Design the Converter'!E12&\"kΩ\"","v":"7.15kΩ"},{"$f":"GPN","v":1}]
[{"$f":"\"RENT = \"&'Design the Converter'!E52&\"kΩ\"","v":"RENT = 175kΩ"},{"$f":"'Design the Converter'!E52&\" kΩ\"","v":"175 kΩ"},null,{"$f":"'Design the Converter'!E52","v":175}]
[{"$f":"\"RENB = \"&Renb_u/1000&\"kΩ\"","v":"RENB = 100kΩ"},{"$f":"Renb_u/1000&\" kΩ\"","v":"100 kΩ"},null,{"$f":"Renb_u/1000","v":100}]
["RPG",{"$f":"100&\" kΩ\"","v":"100 kΩ"}]
[{"$f":"\"Lo = \"&'Design the Converter'!E17&\"µH\"","v":"Lo = 12µH"},{"$f":"'Design the Converter'!E17&\" µH\"","v":"12 µH"},null,{"$f":"IF(MODE = 1, 'Design the Converter'!J31&\"µH\", 'Design the Converter'!E17&\"µH\")","v":"µH"}]
[{"$f":"\"Rdcr = \"&Rdcr*1000&\"mΩ\"","v":"Rdcr = 25mΩ"},{"$f":"Rdcr*1000&\"mΩ\"","v":"25mΩ"},null,{"$f":"Rdcr*1000&\"mΩ\"","v":"25mΩ"}]
[]
[{"$f":"\"VOUT = \"&'Design the Converter'!E9&\" V\"","v":"VOUT = 3.3 V"},{"$f":"'Design the Converter'!E9&\" V\"","v":"3.3 V"},null,{"$f":"IF(MODE=1, 'Design the Converter'!J10&\"V\", \"\")","v":"V"}]
[]
[{"$f":"\"COUT = \"&'Design the Converter'!$E$30&\" µF\"","v":"COUT = 22 µF"},{"$f":"ROUND('Design the Converter'!$E$30, 0)&\" µF\"","v":"22 µF"},null,{"$f":"IF(MODE=1, 'Design the Converter'!$J$40&\"µF\", ROUND('Design the Converter'!$E$30/Number_of_Phases, 0)&\"µF\")","v":"µF"}]
["Capacitance per component (Cout)",{"$f":"\"22µF\"","v":"22µF"}]
["# of output caps",{"$f":"ROUNDUP(Cout*1000000/22,0)&\" x\"","v":"1 x"}]
[]
["CIN",{"$f":"Cin/2*1000000&\" µF\"","v":"10 µF"},{"$f":"Cin*1000000&\" µF\"","v":"20 µF"}]
["Capacitance per component (Cin)",{"$f":"\"10 µF\"","v":"10 µF"}]
["# of input caps",{"$f":"ROUNDUP(Cin*1000000/10,0)&\" x\"","v":"2 x"}]
[]
[{"$f":"\"CVCC = 1µF\"","v":"CVCC = 1µF"},{"$f":"CHOOSE(GPN, \"\", \"\", \"1 µF\", \"1 µF\")","v":""},null,{"$f":"IF(MODE=1, 'Design the Converter'!$J$40&\"µF\", ROUND('Design the Converter'!$E$30/Number_of_Phases, 0)&\"µF\")","v":"µF"}]
[]
[{"$f":"\"RC1 = \"&Rcea1_u/1000&\"kΩ\"","v":"RC1 = 1350kΩ"},{"$f":"ROUND(Rcea1_u/1000,2)&\" kΩ\"","v":"1350 kΩ"}]
[{"$f":"\"CC1 = \"&Cc1ea_u*10^9&\"nF\"","v":"CC1 = 0.02nF"},{"$f":"Cc1ea_u*10^9&\" nF\"","v":"0.02 nF"}]
[{"$f":"\"CC2 = \"&IF(Cc2ea_u>0, Cc2ea_u*10^12&\"pF\", \"OPEN\")","v":"CC2 = 0.5pF"},{"$f":"IF(Cc2ea_u>0, ROUND(Cc2ea_u*10^12,1)&\" pF\", \"N/A\")","v":"0.5 pF"}]
[]
[{"$f":"\"gm = \"&$B$177*1000&\"mS\"","v":"gm = 0.015mS"},{"$f":"$B$177*1000&\"mS\"","v":"0.015mS"}]
[{"$f":"\"RoEA = \"&RoEA/1000000&\"MΩ\"","v":"RoEA = 1057MΩ"},{"$f":"RoEA/1000000&\"MΩ\"","v":"1057MΩ"}]
[{"$f":"\"GBW = \"&GBW&\"MHz\"","v":"GBW = 5MHz"},{"$f":"GBW&\"MHz\"","v":"5MHz"}]
[]
[{"$f":"\"RPGOOD = 100 kΩ\"","v":"RPGOOD = 100 kΩ"},{"$f":"CHOOSE(GPN, \"100 kΩ\", \"100 kΩ\", \"\", \"\")","v":"100 kΩ"}]
[{"$f":"\"RFB1 = \"&'Design the Converter'!E46&\"kΩ\"","v":"RFB1 = 100kΩ"},{"$f":"IF(VOUT_setting=1, 'Design the Converter'!E46&\"kΩ\", \"\")","v":{"$error":"#NAME?"}},null,{"$f":"'Design the Converter'!#REF!&\"kΩ\"","v":{"$error":"#REF!"}}]
[{"$f":"\"RFB2 = \"&IF(Vout=Vref,\"OPEN\",'Design the Converter'!E47&\"kΩ\")","v":"RFB2 = 43.2kΩ"},{"$f":"IF(VOUT_setting=1, IF(Vout=Vref,\"OPEN\",Rfb2_u/1000&\"kΩ\"), \"\")","v":{"$error":"#NAME?"}},null,{"$f":"IF(Vout2=Vref,\"OPEN\",Rfb4_u/1000&\"kΩ\")","v":"30.1675977653631kΩ"}]
[{"$f":"CHOOSE(BODE_PLOT_TYPE, \"Crossover Frequency = \"&ROUND('Stability Calculations'!Q4,1)&\" kHz\",  \"Crossover Frequency = \"&ROUND(#REF!,1)&\" kHz\")","v":"Crossover Frequency = 25 kHz"},{"$f":"CHOOSE(BODE_PLOT_TYPE, ROUND('Stability Calculations'!Q4,1)&\" kHz\", ROUND(#REF!,1)&\" kHz\")","v":"25 kHz"},null,{"$f":"'Stability Calculations'!Q4","v":24.975999999999999}]
[{"$f":"CHOOSE(BODE_PLOT_TYPE, \"Phase Margin = \"&ROUND('Stability Calculations'!Q5,0)&\"°\", \"Phase Margin = \"&ROUND(#REF!,0)&\"°\")","v":"Phase Margin = 65°"},{"$f":"CHOOSE(BODE_PLOT_TYPE, ROUND('Stability Calculations'!Q5,0)&\"°\", ROUND(#REF!,0)&\"°\")","v":"65°"}]
[]
["Full-load/high line efficiency",{"$f":"ROUND('Efficiency Calculations'!AZ109,1)&\"%\"","v":"45%"}]
["Half-load/mid-line efficiency",{"$f":"ROUND('Efficiency Calculations'!AZ59,1)&\"%\"","v":"33.9%"}]
[]
[]
["Rpgood","100 kΩ"]
[]
[]
["Rt",{"$f":"IF(No_RT,\"\", Rfadj&\"kΩ\")","v":""},{"$f":"Rfadj","v":7.15},{"$f":"Fsw","v":2200000},{"$f":"\"kΩ\"","v":"kΩ"},{"$f":"OR((Fsw=440000),(Fsw=2200000))","v":true},null,{"$f":"OR(OR(AND(OSC=1, OR(Fsw/1000>2530, Fsw/1000<1800)), AND(OSC=2, OR(Fsw/1000>500, Fsw/1000<300))), OR((Fsw=440000),(Fsw=2200000)))","v":true}]
[]
["Blank out",{"$f":"IF(B76=\"y\",\"\",\"|\")","v":"|"}]
["OUTPUT CURRENT",{"$f":"'Design the Converter'!$E$10&\" A\"","v":"0.3 A"},null,{"$f":"IF(MODE=1,'Design the Converter'!$J$11&\"A\",\"\")","v":"A"}]
["VIN",{"$f":"VIN_nom&\" V\"","v":"28 V"}]
["VIN range",{"$f":"VIN_min&\" V\"&\"...\"&VIN_max&\" V\"","v":"6 V...36 V"}]

{"sheet":"Schematic & BOM","index":3,"n_rows":51,"n_cols":10,"rows_kept":51,"cut":false,"hidden":false,"merged":[[36,3,36,5],[34,3,34,5],[43,3,43,6],[44,3,44,6],[33,3,33,6],[35,3,35,5],[38,3,38,5],[37,3,37,5],[45,3,45,6],[41,3,41,6],[42,3,42,6],[40,3,40,6],[39,3,39,6],[46,0,47,0],[46,9,47,9],[46,3,47,6],[46,2,47,2],[46,1,47,1],[46,7,47,7],[46,8,47,8]]}
[]
[]
[]
[]
[]
[]
[]
[]
[]
[]
[]
[]
[]
[]
[]
[]
[]
[]
[]
[]
[]
[]
[]
[]
[]
[]
[]
[]
[]
[]
[]
[{"$f":"\"VIN = \"&VIN_min&\" V to \"&VIN_max&\" V, VOUT = \"&Vout&\" V, IOUT = \"&Iout&\" A,  Fsw = \"&Fsw/1000&\" kHz\"","v":"VIN = 6 V to 36 V, VOUT = 3.3 V, IOUT = 0.3 A,  Fsw = 2200 kHz"}]
["High-Efficiency Synchronous Buck DC/DC Converter BOM"]
["Count","Ref Des","Value","Description",null,null,null,"Size","Part Number","MFR"]
[{"$f":"ROUNDUP('Design the Converter'!E39/10,0)","v":2},"CIN1, CIN2",10,{"$f":"C35","v":10},null,null,null,1210,"Std","Std"]
[2,"COUT",47,{"$f":"C36","v":47},null,null,null,1210,"Std","Std"]
[1,"CVCC",1,{"$f":"C37","v":1},null,null,null,"0402","Std","Std"]
[1,"CSYNC",1,{"$f":"C38","v":1},null,null,null,"0402","Std","Std"]
[1,"CFF",{"$f":"'Variable Management'!D297","v":10},10,null,null,null,"0402","Std","Std"]
[1,"LO",{"$f":"'Design the Converter'!E17","v":12},{"$f":"\"Buck Inductor, \"&Lf*1000000&\" µH, \"&Rdcr*1000&\" mΩ, >\"&ROUNDUP(Ipk_OCP_Vinmin*1.05,0)&\" A\"","v":"Buck Inductor, 12 µH, 25 mΩ, >1 A"},null,null,null,"--","--","Various"]
[1,"RRT",{"$f":"'Design the Converter'!E12","v":7.15},{"$f":"C41","v":7.15},null,null,null,"0402","Std","Std"]
[1,"RFBT",{"$f":"'Design the Converter'!E46","v":100},{"$f":"C42","v":100},null,null,null,"0402","Std","Std"]
[1,"RFBB",{"$f":"'Design the Converter'!E47","v":43.2},43.2,null,null,null,"0402","Std","Std"]
[1,"RENT",{"$f":"'Variable Management'!D300","v":175},{"$f":"C44","v":175},null,null,null,"0402","Std","Std"]
[1,"RENB",{"$f":"'Variable Management'!D301","v":100},100,null,null,null,"0402","Std","Std"]
[1,"RPGOOD",100,100,null,null,null,"0402","Std","Std"]
[1,"U1",{"$f":"'Variable Management'!N19","v":0},{"$f":"CHOOSE(GPN, \"IC, LMR36503E-Q1 Synchronous Buck DC/DC Converter, 3V–65V Input, 0.3A Output\", \"IC, LMR36503E-Q1 Synchronous Buck DC/DC Converter, 3V–65V Input, 0.3A Output\", \"IC, LMR36503E-Q1 Synchronous Buck DC/DC Converter, 3V–65V Input, 0.3A Output\")","v":"IC, LMR36503E-Q1 Synchronous Buck DC/DC Converter, 3V–65V Input, 0.3A Output"},null,null,null,"VQFN-22",{"$f":"CHOOSE(VARIANT, \"LM63460AASQRYFTQ1\", \"LM63460AFSQRYFTQ1\", \"LM64460APPQRYFRQ1\", \"LM64460BPPQRYFRQ1\", \"LM64460CPPQRYFRQ1\")","v":"LM63460AASQRYFTQ1"},"TI"]
[]
[]
["NOTES:"]
["** Effective input and output capacitances should be appropriately derated for applied voltage and temperature, particularly with ceramics **"]

{"sheet":"EVMs","index":4,"n_rows":6,"n_cols":2,"rows_kept":6,"cut":false,"hidden":true,"merged":[[0,0,0,16]]}
["LM63460-Q1 & LM64460-Q1 Converter Design Tool"]
[]
[]
[]
[]
[null,"LM64460EVM-2MHZ (BSR173) PCB Layout"]

{"sheet":"MOSFET Parameters","index":5,"n_rows":17,"n_cols":7,"rows_kept":17,"cut":false,"hidden":true,"merged":[]}
[]
[]
["MOSFET Parameters"]
[null,null,null,null,"Internal Power MOSFETs"]
[null,null,null,null,"High-side","  Low-side"]
[null,null,null,"On-State Resistance, RDS(on) ",560,280,"mΩ"]
[null,null,null,"Total Gate Charge, QG ",3,6,"nC"]
[null,null,null,"Gate-Drain Charge, QGD ",0.26,0.44600000000000001,"nC"]
[null,null,null,"Gate-Source Charge, QGS ",6.2199999999999998E-2,0.122,"nC"]
[null,null,null,"Output Charge, QOSS ",4,2,"nC"]
[null,null,null,"Output Capacitance, COSS ",52.99,101.84,"pF"]
[null,null,null,"Gate Resistance, RGATE ",0,0,"Ω"]
[null,null,null,"Transconductance, gFS ",100,100,"S"]
[null,null,null,"Gate-Source Miller Plateau Voltage, VTH ",1.5,1.5,"V"]
[null,null,null,"Body Diode Forward Voltage, VBD ",0.86599999999999999,0.86599999999999999,"V"]
[null,null,null,"Body Diode Rev Recovery Charge, QRR ",4.5,7,"nC"]
[null,null,null,"Thermal Resistance, θJA ",23,23,"°C/W"]

{"sheet":"Stability Calculations","index":6,"n_rows":687,"n_cols":35,"rows_kept":687,"cut":false,"hidden":true,"merged":[[9,1,10,1],[1,0,1,3],[1,9,1,11],[1,12,1,14],[9,0,11,0],[10,6,10,7],[1,4,1,6],[9,2,9,7],[9,8,9,13],[10,2,10,3],[10,4,10,5],[10,8,10,9],[10,10,10,11],[10,12,10,13],[9,20,9,22],[10,14,10,15],[10,16,10,17],[9,27,9,28],[9,30,9,31],[10,18,10,19],[9,18,9,19]]}
[]
["Divider Network & EA Poles/Zeros",null,null,null,"Modulator",null,null,null,null,"Power Stage Poles/Zeros",null,null,"Complex Pole Pair",null,null,"Total System"]
[null,"Afb1",{"$f":"Afb","v":0.30303030303030304},"V/V","Acs",{"$f":"Acs","v":1.8181818181818181},"A/V","gm",{"$f":"gm","v":1.5E-5},"z_ESR",{"$f":"Fesr","v":7234315.6033525616},"Hz","p3",{"$f":"Fsw/2","v":1100000},"Hz","Adc",{"$f":"Am*Afb*AEA","v":23712.508897962336},"V/V"]
[null,"EA zero, z1",{"$f":"Fz1_u","v":5894.6275286576438},"Hz","Am",{"$f":"Am","v":16.181745296932903},"V/V",null,null,"p_dom",{"$f":"Fp_dominant","v":812.84811098205478},"Hz","pterm1",{"$f":"Q*pole3","v":618289.73588562955},null,"Crossover",{"$f":"AI7","v":24.975999999999999},"kHz"]
[null,"EA pole, p1",{"$f":"Fp1_u","v":7.5190127686378041},"Hz","Q",{"$f":"Q","v":0.56208157807784509},null,null,null,null,null,null,"pterm2",{"$f":"pole3^2","v":1210000000000},null,"Phase Margin",{"$f":"AI9","v":65.181820374955734},"°"]
[null,"Aea",{"$f":"AEA","v":4835.7749999999996},"V/V","mc",{"$f":"mc","v":1.2137651821862347},null,"FF zero, z5",{"$f":"Fz_ff","v":159154.94327375636},null,null,null,null,null,null,"radconv",{"$f":"180/Pi","v":57.295779578552292},null,null,null,null,null,null,null,null,null,null,null,null,null,null,null,null,"XOVER SEARCH"]
[null,"EA pole, p2",{"$f":"Fp2_u","v":120610.52937803368},"Hz","k",{"$f":"k","v":1.0663054954336693},null,"FF pole, p5",{"$f":"Fp_ff","v":527569.16381485912},null,null,null,null,null,null,null,null,null,null,null,null,null,null,null,null,null,null,null,null,null,null,null,null,"xover",{"$f":"SUM(AH12:AH613)/1000","v":24.975999999999999}]
[]
[null,null,null,null,null,null,null,null,null,null,null,null,null,null,null,null,null,null,null,null,null,null,null,null,null,null,null,null,null,null,null,null,null,"phase margin",{"$f":"SUM(AI13:AI613)","v":65.181820374955734}]
["Freq (Hz)",null,"Power Stage",null,null,null,null,null,"Error Amplifier",null,null,null,null,null,null,"FF Network",null,null,"Sampling Double Pole",null,"System Response",null,null,null,null,null,null,"ERROR AMP Response",null,null,"PLANT Response"]
[null,null,"p_dom",null,"z_ESR",null,"z_RHP",null,"p1",null,"z1",null,"p2",null,"z3",null,"p3",null,"p3"]
[null,null,"Gain(V/V)","Phase(rad)","Gain(V/V)","Phase(rad)","Gain(V/V)","Phase(rad)","Gain(V/V)","Phase(rad)","Gain(V/V)","Phase(rad)","Gain(V/V)","Phase(rad)","Gain(V/V)","Phase(rad)","Gain(V/V)","Phase(rad)","Gain(V/V)","Phase(rad)","Gain (dB)","Phase (°)","Phase Margin (°)",null,null,"Fsquare",null,"Gain(dB)","Phase(Deg)",null,"Gain(dB)","Phase(Deg)"]
[1,{"$f":"A13/1000","v":1E-3},{"$f":"SQRT(1+(A13/pole1)^2)","v":1.0000007567475757},{"$f":"ATAN(A13/pole1)","v":1.2302415198993557E-3},{"$f":"SQRT(1+(A13/Zero1)^2)","v":1.0000000000000095},{"$f":"ATAN(A13/Zero1)","v":1.3823007659999915E-7},{"$f":"IF(VIN_nom>Vout, 1, SQRT(1+(A13/z_RHP)^2))","v":1},{"$f":"IF(VIN_nom>Vout, 0, -ATAN(A13/z_RHP))","v":0},{"$f":"SQRT(1+(A13/Pole2)^2)","v":1.0088052263731411},{"$f":"ATAN(A13/Pole2)","v":0.13222025667324314},{"$f":"SQRT(1+(A13/Zero2)^2)","v":1.0000000143898831},{"$f":"ATAN(A13/Zero2)","v":1.696460014725426E-4},{"$f":"SQRT(1+(A13/pole4)^2)","v":1.0000000000343716},{"$f":"ATAN(A13/pole4)","v":8.2911500773100145E-6},{"$f":"SQRT(1+(A13/Zero3)^2)","v":1.0000000000197393},{"$f":"ATAN(A13/Zero3)","v":6.2831852999173176E-6},{"$f":"SQRT(1+(A13/pole5)^2)","v":1.0000000000017963},{"$f":"ATAN(A13/pole5)","v":1.8954860681541547E-6},{"$f":"SQRT((1-(Z13/pterm2))^2+(A13/pterm1)^2)","v":1.0000000000004814},{"$f":"IF((ATAN((A13/pterm1)/(1-A13^2/pterm2))>0),ATAN((A13/pterm1)/(1-A13^2/pterm2)),PI()+ATAN((A13/pterm1)/(1-A13^2/pterm2)))","v":1.6173647110081302E-6},{"$f":"20*LOG10(((E13*K13*G13*O13)/(C13*I13*S13*M13*Q13))*Adc)","v":87.423397218189535},{"$f":"((F13+L13+H13+R13)-(D13+J13+T13+N13+T13))*radconv","v":-7.6369741901148176},{"$f":"IF(V13>0,V13,V13+180)","v":172.36302580988519},null,{"$f":"IF(U13<0,A13,1000000000)","v":1000000000},{"$f":"A13^2","v":1},null,{"$f":"20*LOG10((K13/(I13*M13))*AEA)","v":73.613175368001393},{"$f":"(L13-(J13+N13))*radconv","v":-7.5664177301702749},null,{"$f":"20*LOG10((E13*G13/(C13*S13))*Acs*Am)","v":29.373246857705169},{"$f":"(F13+H13-(D13+T13))*radconv","v":-7.0572395124516699E-2},null,{"$f":"SUM((U14<0)*(U13>0))*A13","v":0},{"$f":"IF(AH13>0,W11,0)","v":0}]
[1.0965,{"$f":"A14/1000","v":1.0965E-3},1.000000909846811,1.3489596888865898E-3,1.0000000000000115,1.5156927899189888E-7,1,0,{"$f":"SQRT(1+(A14/Pole2)^2)","v":1.0105773007306631},0.14480954268929835,{"$f":"SQRT(1+(A14/Zero2)^2)","v":1.0000000173011327},1.8601684025361531E-4,1.0000000000413254,9.0912460597282838E-6,1.0000000000237326,6.8895126813409964E-6,1.0000000000021598,2.0784004737305272E-6,1.0000000000005789,1.7734404056203987E-6,87.408151604016112,-8.3642036993907904,171.6357963006092,null,1000000000,1.2023122500000001,null,{"$f":"20*LOG10((K14/(I14*M14))*AEA)","v":73.597931083599221},-8.286838548950259,null,{"$f":"20*LOG10((E14*G14/(C14*S14))*Acs*Am)","v":29.373245527902387},-7.7382623365374645E-2,null,0,0]
[1.2022999999999999,1.2022999999999999E-3,1.0000010938975745,1.4791190469185271E-3,1.0000000000000138,1.6619402109617848E-7,1,0,1.0127035248761025,0.15855903519385342,1.0000000208009399,2.0396538669868218E-4,1.0000000000496851,9.9684497378480609E-6,1.0000000000285336,7.5542736860463008E-6,1.0000000000025968,2.2789428997405238E-6,1.0000000000006959,1.9445575920450358E-6,87.389894383987198,-9.1584783376588863,170.84152166234111,null,1000000000,1.4455252899999997,null,73.579675462176411,-9.0736483249159203,null,29.373243929258376,-8.4849171609853891E-2,null,0,0]
[1.3183,1.3183000000000001E-3,1.0000013151625129,1.6218267919154634E-3,1.0000000000000167,1.8222870998177804E-7,1,0,1.0152537673333752,0.17356474467895128,1.000000025008392,2.2364432215807344E-4,1.0000000000597349,1.0930223146732973E-5,1.000000000034305,8.2831231808005666E-6,1.0000000000031219,2.498819283645414E-6,1.0000000000008367,2.1321718985219468E-6,87.368046736574712,-10.025354280154232,169.97464571984577,null,1000000000,1.7379148900000001,null,73.55782973660007,-9.9323397336026957,null,29.373242007376653,-9.303555389930028E-2,null,0,0]
[1.4454,1.4454000000000001E-3,1.0000015809821268,1.7781901157659437E-3,1.00000000000002,1.9979775271763739E-7,1,0,1.0183090908532084,0.18991595294034966,1.0000000300630723,2.4520632796630292E-4,1.0000000000718083,1.1984028321444796E-5,1.0000000000412388,9.0817160323703215E-6,1.000000000003753,2.7397355629064411E-6,1.0000000000010059,2.3377389532910361E-6,87.341944247735753,-10.970002175868057,169.02999782413195,null,1000000000,2.0891811599999999,null,73.53172955658431,-10.868019924647729,null,{"$f":"20*LOG10((E17*G17/(C17*S17))*Acs*Am)","v":29.373239698498729},-0.10200528392946585,null,0,0]
[1.5849,1.5849E-3,1.0000019008792098,1.9498082976644687E-3,1.000000000000024,2.1908084840333655E-7,1,0,1.0219738698194714,0.20774454222243718,1.0000000361460621,2.6887194383408202E-4,1.0000000000863383,1.314064375707339E-5,1.000000000049583,9.9582203816408286E-6,1.0000000000045124,3.0041558694120801E-6,1.0000000000012093,2.5633613304766094E-6,87.310738105048614,-12.000058023777907,167.99994197622209,null,1000000000,2.51190801,null,73.500526192418931,-11.888233175623462,null,29.373236919911076,-0.11185010382118685,null,0,0]
[1.7378,1.7378000000000001E-3,1.0000022853372172,2.1379115346228032E-3,1.0000000000000289,2.4021622711547546E-7,1,0,1.0263609545628418,0.22713258449443172,1.00000004345671,2.9481081564617458E-4,1.0000000001038005,1.4408360603682438E-5,1.0000000000596114,1.0918919413906073E-5,1.000000000005425,3.2939756892303213E-6,1.0000000000014539,2.8106563947896702E-6,87.273528224295262,-13.120285510306164,166.87971448969384,null,1000000000,3.0199488400000001,null,73.46331965094133,-12.997672619042465,null,29.37323358055616,-0.12264058341945952,null,0,0]
[1.9055,1.9055000000000001E-3,1.0000027476949296,2.3442221046882919E-3,1.0000000000000346,2.6339741096129395E-7,1,0,1.0316122522142246,0.24819885951886708,1.0000000522486607,3.2326044764709975E-4,1.0000000001248008,1.5798786471361784E-5,1.0000000000716716,1.1972609588577937E-5,1.0000000000065228,3.611848702856361E-6,1.0000000000017482,3.0818884568256235E-6,87.229196894225396,-14.337576047223148,165.66242395277686,null,1000000000,3.63093025,null,73.418992336756688,-14.203130891073494,null,29.373229564575695,-0.13447552063509827,null,0,0]
[2.0893000000000002,2.0893000000000001E-3,1.0000033033310074,2.5703392438062955E-3,1.0000000000000417,2.8880409904037201E-7,1,0,1.0378878262336932,0.2710314670080044,1.0000000628143491,3.5444137943416041E-4,1.000000000150038,1.7322699855188045E-5,1.0000000000861651,1.3127459046535916E-5,1.0000000000078417,3.9602390421785153E-6,1.0000000000021019,3.3791600907087697E-6,87.176513630247285,-15.657057076724744,164.34294292327525,null,1000000000,4.3651744900000002,null,73.366313898846215,-15.509643714985321,null,29.373224738393638,-0.14744665511094618,null,0,0]
[2.2909000000000002,2.2909000000000002E-3,1.000003971573505,2.8183542575958703E-3,1.0000000000000502,3.1667128248292952E-7,1,0,1.0453853285122336,0.29574569782096655,1.0000000755213103,3.8864200893462092E-4,1.0000000001803897,1.8994195710260513E-5,1.0000000001035958,1.4394149202775888E-5,1.000000000009428,4.34236903351226E-6,1.0000000000025269,3.70522081644781E-6,87.113988282131885,-17.085438502027909,162.9145614979721,null,1000000000,5.2482228100000006,null,73.303794354856279,-16.923801054027034,null,29.373218934130549,-0.16167395390467643,null,0,0]
[2.5118999999999998,2.5118999999999996E-3,1.0000047747964003,3.0902353960297604E-3,1.0000000000000604,3.4722012941152609E-7,1,0,1.0543267257471163,0.32241620799129739,1.0000000907950015,4.2613376939301255E-4,1.0000000002168723,2.0826539876661114E-5,1.0000000001245475,1.5782733153759537E-5,1.0000000000113349,4.7612714545661437E-6,1.000000000003038,4.0626584175803407E-6,87.040005143083562,-18.627095889389462,161.37290411061053,null,1000000000,6.309641609999999,null,73.229818192321801,-18.449865591938085,null,29.373211957451282,-0.17727032502995804,null,0,0]
[2.7542,2.7542000000000001E-3,1.0000057403834566,3.3883199366797154E-3,1.0000000000000724,3.8071327697170169E-7,1,0,1.0649761918439995,0.35111985726857159,1.0000001091561457,4.6723898773668208E-4,1.0000000002607297,2.2835485539481241E-5,1.000000000149734,1.7305148951532557E-5,1.0000000000136271,5.2205477288689979E-6,1.0000000000036524,4.4545458870572573E-6,86.952703244467017,-20.286549459583188,159.7134505404168,null,1000000000,7.5856176399999997,null,73.142524680450151,-20.092223502606991,null,29.373203570507542,-0.19436984564888263,null,0,0]
[3.02,3.0200000000000001E-3,1.0000069018193849,3.7153141695260429E-3,1.000000000000087,4.1745483133197585E-7,1,0,1.0776462760037324,0.38192666656753832,1.0000001312414819,5.1233088453595714E-4,1.0000000003134826,2.5039273228817083E-5,1.0000000001800293,1.8975219603722604E-5,1.0000000000163842,5.7243679257698761E-6,1.0000000000043914,4.8844414272427484E-6,86.849966678131381,-22.067945987031077,157.93205401296893,null,1000000000,9.1204000000000001,null,73.039798201922125,-21.854866350072982,null,29.373193482460721,-0.21312776120161586,null,0,0]
[3.3113000000000001,3.3113000000000001E-3,1.00000829748468,4.073678265834684E-3,1.0000000000001048,4.5772125264554815E-7,1,0,1.0926772544965233,0.41483378932121501,1.0000001577808504,5.6174875097623328E-4,1.0000000003768743,2.7454485244727824E-5,1.0000000002164346,2.080551148088798E-5,1.0000000000196974,6.2765230174039482E-6,1.0000000000052793,5.3555797675587936E-6,86.729641380094222,-23.971244980658131,156.02875501934187,null,1000000000,10.964707690000001,null,72.919485026107708,-23.737612548204496,null,29.373181359950564,-0.23368519861508058,null,0,0]
[3.6307999999999998,3.6308E-3,1.0000099759368215,4.4667334573668827E-3,1.0000000000001259,5.0188576211923792E-7,1,0,1.1104843760676539,0.44986010764243473,1.0000001896976194,6.15950630159235E-4,1.0000000004531104,3.0103507692293523E-5,1.0000000002602163,2.2812989183282459E-5,1.0000000000236819,6.8821308161536913E-6,1.0000000000063474,5.8723277927250641E-6,86.589216080919854,-25.997693822889961,154.00230617711003,null,1000000000,13.182708639999998,null,72.7790743053136,-25.74151900106915,null,29.373166781224608,-0.25623267927226268,null,0,0]
[3.9811000000000001,3.9811000000000004E-3,1.0000119937439114,4.8976778247802498E-3,1.0000000000001514,5.503077579522045E-7,1,0,1.1315209459633917,0.48694558034645302,1.0000002280674949,6.7537760025362589E-4,1.0000000005447607,3.3007897561547646E-5,1.0000000003128497,2.5013988992612922E-5,1.0000000000284719,7.5461195857943075E-6,1.0000000000076312,6.4388906509901163E-6,86.426195985471907,-28.144011785885063,151.85598821411494,null,1000000000,15.849157210000001,null,72.616071735718194,-27.863121565387214,null,29.373149254956509,-0.28095366004284217,null,0,0]
[4.3651999999999997,4.3651999999999996E-3,1.0000144197046348,5.370201367493636E-3,1.0000000000001821,6.0340193037424682E-7,1,0,1.1563062039594696,0.52599894279416615,1.0000002741987697,7.4053859736227304E-4,1.0000000006549494,3.6192528302500144E-5,1.00000000037613,2.7427360464682497E-5,1.0000000000342308,8.2741757845276022E-6,1.0000000000091747,7.0601204364868893E-6,86.237970153448643,-30.405153684083277,149.59484631591673,null,1000000000,19.054971039999998,null,72.427866974557276,-30.097163427766212,null,29.373128183594538,-0.30805981656468245,null,0,0]
[4.7862999999999998,4.7862999999999994E-3,1.0000173359350328,5.888239905277582E-3,1.0000000000002189,6.6161061563048359E-7,1,0,1.1854147649331037,0.56686870782053933,1.0000003296529976,8.1197648619054351E-4,1.0000000007874073,3.9683931595106639E-5,1.0000000004521989,3.0073209792323953E-5,1.0000000000411537,9.0723649677681863E-6,1.0000000000110303,7.7411927162904958E-6,86.021995774682097,-32.772636084628189,147.22736391537182,null,1000000000,22.908667689999998,null,72.211917924859137,-32.434935429286128,null,29.373102853925523,-0.33777692589396763,null,0,0]
[5.2481,5.2481000000000003E-3,1.0000208425513579,6.4563440667829526E-3,1.0000000000002631,7.2544526500433284E-7,1,0,1.2194967275247539,0.60936713657284125,1.0000003963340505,8.9031895362663498E-4,1.0000000009466812,4.3512784694265924E-5,1.0000000005436682,3.2974784760978443E-5,1.0000000000494784,9.9477004339636015E-6,1.0000000000132614,8.4880917398315169E-6,85.775759756756997,-35.235929123887225,144.76407087611278,null,1000000000,27.542553609999999,null,71.965712363731853,-34.865646719890172,null,29.373072396405536,-0.37036603341505786,null,0,0]
[5.7544000000000004,5.7544000000000007E-3,1.0000250579683354,7.0791871136728348E-3,1.0000000000003162,7.954311527868725E-7,1,0,1.2592475334586553,0.65322976214809536,1.000000476493806,9.762106501330929E-4,1.0000000011381502,4.7710593969764787E-5,1.0000000006536267,3.6155961474565005E-5,1.0000000000594855,1.0907385030166776E-5,1.0000000000159437,9.3069634930115845E-6,85.497114445955134,-37.780112853572348,142.21988714642765,null,1000000000,33.113119360000006,null,71.687103665891001,-37.374109331630805,null,29.373035782576352,-0.40609521934116782,null,0,0]
[6.3095999999999997,6.3095999999999994E-3,1.0000301264748117,7.7621799121189196E-3,1.0000000000003804,8.7217649131513897E-7,1,0,1.3054414133911318,0.69816285249434784,1.0000005728762258,1.0703980123560521E-3,1.000000001368369,5.231384048127091E-5,1.0000000007858385,3.9644385948110604E-5,1.0000000000715179,1.1959758895069551E-5,1.0000000000191687,1.0204924380558874E-5,85.184145716201272,-40.388627311893536,139.61137268810646,null,1000000000,39.811052159999996,null,71.374178958393912,-39.943452980145324,null,29.372991759275713,-0.44527487635975632,null,0,0]
[6.9183000000000003,6.9183000000000005E-3,1.0000362194723267,8.5109786924727378E-3,1.0000000000004574,9.5631713894148874E-7,1,0,1.3588958023031403,0.74381379962990934,1.0000006887409414,1.1736614043476356E-3,1.0000000016451227,5.7360663518258024E-5,1.0000000009447751,4.3468960833611077E-5,1.0000000000859823,1.3113541264574905E-5,1.0000000000230453,1.1189414280143686E-5,84.835518378196269,-43.041551417975107,136.95844858202489,null,1000000000,47.862874890000008,null,71.025604540515474,-42.553432189890813,null,29.372938837894292,-0.48822947243988135,null,0,0]
[7.5857999999999999,7.5858000000000002E-3,1.0000435456245418,9.3320999154631948E-3,1.0000000000005498,1.0485857150718959E-6,1,0,1.4205082863480916,0.78981972076136342,1.0000008280562991,1.2868999398989319E-3,1.0000000019778907,6.289500617496653E-5,1.0000000011358801,4.7662987012647048E-5,1.0000000001033746,1.4378778214830071E-5,1.0000000000277069,1.2269005224733902E-5,84.450303667638252,-45.718418252007304,134.2815817479927,null,1000000000,57.544361639999998,null,70.640453460100105,-45.183206310651087,null,29.372875206242782,-0.53533282244441016,null,0,0]
[8.3176000000000005,8.3176000000000014E-3,1.0000523523157099,1.0232304905658879E-2,1.0000000000006608,1.1497424851276538E-6,1,0,1.4912070515590261,0.83578212990596401,1.0000009955271627,1.4110466588944067E-3,1.000000002377911,6.8962469775289586E-5,1.0000000013656072,5.2261022003701324E-5,1.0000000001242817,1.5765894919191604E-5,1.0000000000333107,1.3452592720239483E-5,84.028345085827084,-48.396733176306981,131.60326682369302,null,1000000000,69.182469760000004,null,70.218571366802806,-47.809892930909442,null,29.372798715915138,-0.58697278785042939,null,0,0]
[9.1201000000000008,9.1201000000000008E-3,1.0000629414488922,1.1219460567653409E-2,1.0000000000007947,1.2606721215989925E-6,1,0,1.5720113811602199,0.88132713350733949,1.000001196895431,1.5471872783247699E-3,1.0000000028588987,7.5616117677688546E-5,1.0000000016418329,5.7303278191808413E-5,1.0000000001494205,1.7287022488471384E-5,1.0000000000400484,1.4750527900810086E-5,83.569900116849368,-51.055465682222263,128.94453431777774,null,1000000000,83.176224010000013,null,69.760218366441904,-50.412010361179263,null,29.372706745117423,-0.6436006514778011,null,0,0]
[10,0.01,1.0000756719230997,1.2301800806490888E-2,1.0000000000009552,1.3823007659991198E-6,1,0,1.663970695588243,0.92607951087825213,1.0000014389872831,1.6964584035453654E-3,1.0000000034371583,8.2911500585013362E-5,1.0000000019739208,6.2831852917316617E-5,1.0000000001796434,1.895486067929417E-5,1.0000000000481486,1.6173647110008434E-5,83.075991896278168,-53.67352749715031,126.3264725028497,null,1000000000,100,null,69.266420711148612,-52.96799809980218,null,29.372596177217538,-0.70568874914775515,null,0,0]
[10.965,1.0964999999999999E-2,1.0000909805837548,1.3488786928518529E-2,1.0000000000011486,1.5156927899178395E-6,1,0,1.768233037585069,0.96971291862805675,1.0000017301117863,1.8601662784612221E-3,1.0000000041325376,9.0912460349321393E-5,1.0000000023732691,6.8895126705495553E-5,1.0000000002159875,2.0784004734342472E-5,1.0000000000578899,1.7734404056107922E-5,82.547984922840172,-56.232691960502642,123.76730803949735,null,1000000000,120.23122499999999,null,68.738546692898581,-55.459086863406704,null,29.372463218876561,-0.77377982634421083,null,0,0]
[12.023,1.2022999999999999E-2,1.0001093838348845,1.4790122726253803E-2,1.0000000000013811,1.6619402109602701E-6,1,0,1.8859594188763102,1.0119196724785136,1.0000020800918428,2.0396510668304652E-3,1.0000000049684994,9.9684497051594263E-5,1.0000000028533524,7.5542736718199971E-5,1.0000000002596789,2.2789428993499403E-5,1.0000000000696003,1.944557592032371E-5,81.987971268063859,-58.715813558824202,121.28418644117579,null,1000000000,144.55252899999999,null,68.178692867027422,-57.867574608557923,null,29.372303386180949,-0.84843053893488374,null,0,0]
[13.183,1.3183E-2,1.0001315076906325,1.6216860383918865E-2,1.0000000000016604,1.8222870998157832E-6,1,0,2.0184204736528875,1.0524585893204648,1.000002500836098,2.2364395302218051E-3,1.0000000059734888,1.0930223103640538E-4,1.0000000034305063,8.2831231620464636E-5,1.0000000003122049,2.4988192831305186E-5,1.0000000000836784,2.1321718985052516E-5,81.398196792399943,-61.109624179119038,118.89037582088096,null,1000000000,173.79148899999998,null,67.589110529153189,-60.179559359431984,null,29.372111243834411,-0.93027489316437584,null,0,0]
[14.454000000000001,1.4454E-2,1.0001580858420906,1.7780046060407589E-2,1.000000000001996,1.9979775271737422E-6,1,0,2.166873427643806,1.0911173317573835,1.0000030063027654,2.4520584143878981E-3,1.0000000071808466,1.1984028264648188E-4,1.0000000041238783,9.0817160076520745E-5,1.0000000003753076,2.7397355622278006E-5,1.0000000001005915,2.337738953269031E-5,80.781532334071429,-63.402508101664225,116.59749189833578,null,1000000000,208.91811600000003,null,66.972676886962375,-62.382791878703806,null,29.371880422222254,-1.0199465500514073,null,0,0]
[15.849,1.5848999999999999E-2,1.0001900700383506,1.9495637343600884E-2,1.0000000000023999,2.1908084840298953E-6,1,0,2.3330364462173718,1.1278249202093054,1.0000036145997506,2.6887130240517304E-3,1.0000000086338259,1.314064368219373E-4,1.0000000049583075,9.9582203490527213E-5,1.0000000004512475,3.0041558685173718E-5,1.0000000001209455,2.5633613304475988E-5,80.139500259717309,-65.591193514067086,114.40880648593291,null,1000000000,251.19080099999999,null,66.330922569039899,-64.47308515697398,null,29.371602659202459,-1.1183609137600443,null,0,0]
[17.378,1.7378000000000001E-2,1.0002285078749371,2.1375891570311698E-2,1.0000000000028852,2.4021622711501799E-6,1,0,2.5182694266330543,1.1624435358490466,1.0000043456616605,2.948099700910476E-3,1.0000000103800426,1.4408360504973236E-4,1.00000000596114,1.0918919370947197E-4,1.0000000005425138,3.2939756880508833E-5,1.0000000001454068,2.8106563947514282E-5,79.475559413241101,-67.668394518240092,112.33160548175991,null,1000000000,301.99488400000001,null,65.667315511800709,-66.442450314356776,null,29.371268862047661,-1.2262211254402606,null,0,0]
[19.055,1.9054999999999999E-2,1.0002747321315755,2.3437971251696287E-2,1.0000000000034688,2.633974109606909E-6,1,0,2.7244052363498534,1.1949578700322259,1.000005224852565,3.2325933291900955E-3,1.0000000124800827,1.5798786341229479E-4,1.0000000071671689,1.1972609531943525E-4,1.0000000006522725,3.6118487013014608E-5,1.000000000174825,3.0818884567752063E-5,78.791775374446914,-69.63408887613366,110.36591112386634,null,1000000000,363.09302500000001,null,64.983932861527038,-68.289880809964529,null,29.370867464005087,-1.344511711022687,null,0,{"$f":"IF(AH45>0,W43,0)","v":0}]
[20.893000000000001,2.0893000000000002E-2,1.0003302791041995,2.5697790809324824E-2,1.0000000000041704,2.888040990395771E-6,1,0,2.9531532273842682,1.2253452906030045,1.0000062814153707,3.544399100209416E-3,1.0000000150037964,1.732269968364991E-4,1.0000000086165091,1.3127458971881424E-4,1.0000000007841745,3.9602390401288714E-5,1.0000000002101781,3.3791600906423106E-5,78.091016711194158,-71.487772411960492,108.51222758803951,null,1000000000,436.51744900000006,null,64.283656516098958,-70.013959744250627,null,29.370385134737266,-1.4741456014239633,null,0,0]
[22.909000000000002,2.2909000000000002E-2,1.000397079303194,2.8176158517056762E-2,1.000000000005014,3.1667128248188158E-6,1,0,3.2067192747203568,1.253661872065529,1.0000075521027987,3.8864007180243331E-3,1.0000000180389734,1.8994195484120895E-4,1.0000000103595765,1.4394149104358478E-4,1.0000000009428083,4.3423690308102056E-5,1.0000000002526956,3.7052208163601967E-5,77.374948509780992,-73.233694205984165,106.76630579401584,null,1000000000,524.82228100000009,null,63.568168309505126,-71.617742801385219,null,29.369805126155736,-1.6163164636354741,null,0,0]
[25.119,2.5118999999999999E-2,1.0004773668404099,3.0892621076353523E-2,1.0000000000060281,3.4722012941014468E-6,1,0,3.48718861871042,1.2799491180644591,1.0000090794593517,4.2613121582696888E-3,1.0000000216872378,2.0826539578558837E-4,1.0000000124547332,1.5782733024023515E-4,1.0000000011334853,4.7612714510042357E-5,1.0000000003038017,4.0626584174648481E-5,76.645974769394172,-74.875205387801373,105.12479461219863,null,1000000000,630.96416099999999,null,62.839891616926813,-73.103460066458794,null,29.369108061805129,-1.7721455971263913,null,0,0]
[27.542000000000002,2.7542000000000001E-2,1.0005738753268065,3.3870371036084423E-2,1.0000000000072471,3.8071327696988074E-6,1,0,3.797028959522792,1.304288868763309,1.0000109155555972,4.6723562164832045E-3,1.0000000260729696,2.2835485146524562E-4,1.000000014973409,1.730514878051529E-4,1.0000000013627059,5.2205477241737108E-5,1.0000000003652383,4.454545886905016E-5,75.905783459294383,-76.418149569320619,103.58185043067938,null,1000000000,758.56176400000004,null,62.100538109149987,-74.475625008765007,null,29.368270239596196,-1.9429634472798623,null,0,0]
[30.2,3.0199999999999998E-2,1.0006899463072854,3.713623170008528E-2,1.0000000000087135,4.1745483132957507E-6,1,0,4.1391000976626877,1.3267836069388261,1.0000131240629386,5.1232644682760549E-3,1.0000000313482598,2.5039272710758247E-4,1.0000000180029478,1.8975219378260081E-4,1.0000000016384194,5.7243679195797918E-5,1.0000000004391363,4.8844414270420386E-5,75.155554680496763,-77.869733604635016,102.13026639536498,null,1000000000,912.04,null,61.351316850112489,-75.739906106406991,null,29.367262695916661,-2.1303087406598156,null,0,0]
[33.113,3.3112999999999997E-2,1.000829407951628,4.0714496004361236E-2,1.0000000000104754,4.5772125264238357E-6,1,0,4.5160113207792127,1.3475112446658919,1.0000157779618084,5.6174290129610907E-3,1.0000000376874374,2.7454484561832975E-4,1.000000021643465,2.0805511183687766E-4,1.000000001969737,6.2765230092443023E-5,1.0000000005279375,5.355579767294221E-5,74.39738542190122,-79.235629933758176,100.76437006624182,null,1000000000,1096.470769,null,60.594357992447911,-76.90058254043177,null,29.366052266242349,-2.3355750549363536,null,0,0]
[36.308,3.6308E-2,1.0009971015523766,4.4637960238406861E-2,1.0000000000125944,5.0188576211506607E-6,1,0,4.9312832963678597,1.3665931361328831,1.0000189695838151,6.1594291860652553E-3,1.0000000453110578,3.0103506792039181E-4,1.0000000260216233,2.2812988791486E-4,1.0000000023681861,6.8821308053969022E-5,1.0000000006347316,5.87232779237628E-5,73.631859251783723,-80.524423036130131,99.475576963869869,null,1000000000,1318.2708640000001,null,59.830287027780784,-77.964357843354676,null,29.364597026224665,-2.5606437672839935,null,0,0]
[39.811,3.9810999999999999E-2,1.0011986631869125,4.8938064581073706E-2,1.0000000000151419,5.5030775794670489E-6,1,0,5.3883174660917001,1.384127436465832,1.0000228064920136,6.7536743444121632E-3,1.0000000544760637,3.300789637477508E-4,1.0000000312849817,2.5013988476121885E-4,1.000000002847196,7.5461195716140209E-5,1.000000000763118,6.438890650530327E-5,72.860279268954585,-81.743299678611123,98.256700321388877,null,1000000000,1584.9157210000001,null,59.060455826606145,-78.936615603340599,null,29.362848203013851,-2.8073184707125911,null,0,0]
[43.652000000000001,4.3652000000000003E-2,1.0014409427019408,5.3650993720330872E-2,1.0000000000182045,6.0340193036699696E-6,1,0,5.8910443667923476,1.4002211684207604,1.0000274195048193,7.4052519618836828E-3,1.0000000654949532,3.6192526738017776E-4,1.0000000376130045,2.7427359783809734E-4,1.0000000034230991,8.2741757658342084E-5,1.0000000009174741,7.0601204358807665E-5,72.083435286078043,-82.900189868378291,97.099810131621709,null,1000000000,1905.497104,null,58.285713434470956,-79.823210533270824,null,29.360746562310219,-3.0776749375732977,null,0,0]
[47.863,4.7863000000000003E-2,1.0017321084302135,5.8815167324684774E-2,1.0000000000218865,6.6161061562092654E-6,1,0,6.443664833938878,1.4149753437390205,1.000032964761858,8.1195882063769646E-3,1.0000000787407184,3.9683929532777511E-4,1.0000000452198963,3.0073208894785083E-4,1.0000000041153903,9.0723649431262137E-5,1.0000000011030248,7.7411927154914917E-5,71.302145384821884,-84.002788943769687,95.997211056230313,null,1000000000,2290.8667689999997,null,57.506948502114511,-80.629634484609198,null,29.358221533351049,-3.3739171646658344,null,0,0]
[52.481000000000002,5.2481E-2,1.0020821092668837,6.4474848193983914E-2,1.0000000000263136,7.254452649917342E-6,1,0,7.0510443796900315,1.4284935772142855,1.0000396326275309,8.9029566572917732E-3,1.0000000946681171,4.351278197554566E-4,1.0000000543668199,3.2974783577773925E-4,1.0000000049478373,9.9477004014786641E-5,1.000000001326141,8.4880917387782074E-5,70.516758837573818,-85.059230339997072,94.940769660002928,null,1000000000,2754.255361,null,56.724596166512811,-81.361482274862979,null,29.355187249486061,-3.698584359296206,null,0,0]
[57.544000000000004,5.7544000000000005E-2,1.0025026964837926,7.0675144597258419E-2,1.0000000000316356,7.954311527702642E-6,1,0,7.7181885862014745,1.4408669857643341,1.0000476482567662,9.7617995143923809E-3,1.0000001138150325,4.7710590385844422E-4,1.0000000653626755,3.615595991481983E-4,1.0000000059485523,1.0907384987343896E-4,1.0000000015943569,9.3069634916230742E-5,69.727944801730501,-86.076970741164715,93.923029258835285,null,1000000000,3311.3119360000005,null,55.939426864946014,-82.023623459802778,null,29.351542428392857,-4.0542642553344557,null,0,0]
[63.095999999999997,6.3095999999999999E-2,1.0030081683230621,7.7468015755512695E-2,1.0000000000380345,8.7217649129324493E-6,1,0,8.4509010395142834,1.4521878481123867,1.0000572859981582,1.0703575435709675E-2,1.0000001368368863,5.2313835756685756E-4,1.0000000785838639,3.9644383891940764E-4,1.0000000071517916,1.1959758838617308E-4,1.0000000019168545,1.0204924378728437E-4,68.935897398893616,-87.063870952946672,92.936129047053328,null,1000000000,3981.1052159999995,null,55.151757768764078,-82.620938773256881,null,29.347164017351339,-4.443937625773879,null,0,0]
[69.183000000000007,6.9183000000000008E-2,1.0036154769882379,8.4907213222504746E-2,1.000000000045727,9.5631713891262728E-6,1,0,9.2552568927993342,1.4625382863936647,1.0000688717461925,1.1736080577462418E-2,1.0000001645122729,5.7360657290146894E-4,1.0000000944775234,4.3468958123097013E-4,1.0000000085982481,1.3113541190157605E-4,1.0000000023045401,1.118941427773074E-4,68.141031071087767,-88.027294294980294,91.972705705019706,null,1000000000,4786.2874890000012,null,54.362148922723151,-83.157708632288347,null,29.341906410099625,-4.8706881062064884,null,0,0]
[75.858000000000004,7.5858000000000009E-2,1.0043452168106941,9.3054186801424882E-2,1.0000000000549765,1.0485857150338485E-5,1,0,10.138263123353978,1.4719994573674051,1.0000828022360839,1.2868296155989422E-2,1.0000001977890711,6.2894997964604079E-4,1.0000001135880103,4.766298343944439E-4,1.0000000103374631,1.4378778116727614E-4,1.0000000027706921,1.2269005221552976E-4,67.34333699227993,-88.974925760202566,91.025074239797434,null,1000000000,5754.4361640000006,null,53.57076800767382,-83.63809356836606,null,29.335593095456179,-5.3380410026641139,null,0,0]
[83.176000000000002,8.3176E-2,1.005221735349215,0.10197170232976931,1.0000000000660954,1.1497424850774985E-5,1,0,11.107197984277418,1.4806425450395782,1.0000995478109387,1.4109539574433868E-2,1.0000002377910844,6.8962458952175499E-4,1.0000001365607121,5.2261017293412217E-4,1.000000012428172,1.5765894789870376E-4,1.000000003331053,1.3452592716046305E-4,66.543086065826756,-89.913936173705153,90.086063826294847,null,1000000000,6918.2469760000004,null,52.778094003515399,-84.065664404275921,null,29.328015991782767,-5.8495971938864253,null,0,0]
[91.201000000000008,9.1201000000000004E-2,1.0062746573083556,0.11173202397813259,1.0000000000794647,1.2606721215328743E-5,1,0,12.170537303246977,1.4885379510129779,1.0001196824527734,1.547065075669472E-2,1.0000002858898227,7.5616103409891617E-4,1.0000001641832714,5.7303271982370944E-4,1.0000000149420571,1.7287022317990957E-4,1.0000000040048356,1.4750527895282341E-4,65.740062660748208,-90.851913407285465,89.148086592714535,null,1000000000,8317.6224010000005,null,51.984163680808507,-84.44386417579274,null,29.318922691319962,-6.4095025357461965,null,0,0]
[100,0.1,1.0075390599098151,0.12240913458246434,1.0000000000955378,1.382300765911959E-5,1,0,13.337160401586319,1.495747417566988,1.0001438884798917,1.6962973133524496E-2,1.0000003437157889,8.2911481776343308E-4,1.000000197392068,6.2831844731661539E-4,1.0000000179643369,1.8954860454556578E-4,1.0000000048148803,1.6173647102721425E-4,64.934293058238381,-91.796020445055902,88.203979554944098,null,1000000000,10000,null,51.189300951898701,-84.775612352295525,null,29.308015555523252,-7.0220016106320582,null,0,0]
[109.65,0.10965000000000001,1.0090574535167123,0.13408663782448474,1.0000000001148663,1.5156927898029324E-5,1,0,14.61727770553505,1.5023306585917906,1.0001729963644097,1.8599539150514707E-2,1.0000004132536893,9.0912435553188267E-4,1.0000002373268968,6.8895115914057391E-4,1.0000000215987424,2.0784004438062959E-4,1.0000000057889895,1.77344040465012E-4,64.125403016139202,-92.753763951984638,87.246236048015362,null,1000000000,12023.122500000001,null,50.393490662883771,-85.063620162030034,null,29.294935487137607,-7.6918910822729698,null,0,0]
[120.23,0.12023,1.0108797967410388,0.14684728326155921,1.0000000001381024,1.6619402108087887E-5,1,0,16.021369884152445,1.5083390928469396,1.0002079877711683,2.0393711210620859E-2,1.0000004968498275,9.9684464362977099E-4,1.0000002853352139,7.5542722491900901E-4,1.0000000259679034,2.2789428602915573E-4,1.0000000069600312,1.944557590765922E-4,63.313371107022689,-93.732108561838601,86.267891438161399,null,1000000000,14455.252900000001,null,49.597130828399649,-85.310105602134854,null,29.279263033460438,-8.4239188461734482,null,0,0]
[131.83000000000001,0.13183,1.0130662700701176,0.16078287044047587,1.0000000001660365,1.8222870996160896E-5,1,0,17.561381518722118,1.5138223803556878,1.0002500526593405,2.2360705050561626E-2,1.0000005973487118,1.093021879440026E-3,1.0000003430505893,8.2831212866369308E-4,1.0000000312204886,2.4988192316410438E-4,1.0000000083678522,2.1321718968357302E-4,62.497788568331472,-94.738336460598987,85.261663539401013,null,1000000000,17379.148900000004,null,48.800314624167285,-85.517084938819764,null,29.260496243315735,-9.2233522562670203,null,0,0]
[144.54,0.14454,1.0156867959816518,0.17597977737570847,1.0000000001995957,1.9979775269105416E-5,1,0,19.249260898613262,1.5188228846124332,1.0003005855525868,2.4515720622998741E-2,1.0000007180844164,1.1984022584992063E-3,1.0000004123877455,9.0817135358284555E-4,1.0000000375307541,2.7397354943637368E-4,1.0000000100591573,2.3377389510685712E-4,61.678680221746909,-95.779002047272755,84.220997952727245,null,1000000000,20891.811599999997,null,48.003644760799276,-85.686157282239648,null,29.238057212654788,-10.09514803556671,null,0,0]
[158.49,0.15849000000000002,1.018831497516687,0.1925650474453891,1.0000000002399823,2.1908084836828972E-5,1,0,21.102272530176897,1.523390311549683,1.0003613953250357,2.6880718731926399E-2,1.0000008633822191,1.3140636194235542E-3,1.000000495830643,9.9582170902439348E-4,1.0000000451247615,3.0041557790465762E-4,1.0000000120945365,2.5633613275465516E-4,60.854053114826812,-96.863044751317645,83.136955248682355,null,1000000000,25119.080100000003,null,47.205868137121072,-85.818974066765904,null,29.21120607059812,-11.04659625072501,null,0,0]
[173.78,0.17377999999999999,1.0225980620812498,0.21062074843111522,1.0000000002885192,2.4021622706927539E-5,1,0,23.133700320343852,1.5275558733897123,1.0004344727270145,2.9472545864059809E-2,1.0000010380037379,1.4408350634065304E-3,1.0000005961138283,1.0918915075062577E-3,1.0000000542513776,3.293975570107093E-4,1.0000000145406922,2.8106563909271575E-4,60.024317252884309,-97.996044191584019,82.003955808415981,null,1000000000,30199.488400000002,null,46.40818355431594,-85.916405892415938,null,29.179153999685326,-12.082407514083718,null,0,0]
[190.55,0.19055000000000002,1.0271095239016763,0.23026474601179051,1.000000000346891,2.633974109003866E-5,1,0,25.362144806483741,1.5313572614215554,1.0005223501966001,3.2314792994246465E-2,1.0000012480074914,1.5798773328018487E-3,1.0000007167166449,1.1972603868507154E-3,1.0000000652272532,3.6118485458114279E-4,1.0000000174824946,3.0818884517335164E-4,59.188026016886546,-99.185637601992653,80.814362398007347,null,1000000000,36309.302500000005,null,45.610127208817474,-85.979327153321378,null,29.140918156979204,-13.209346896344847,null,0,0]
[208.93,0.20893,1.0325050746938476,0.2515883234446154,1.0000000004170391,2.8880409896008501E-5,1,0,27.804880838460932,1.534823660323217,1.0006279463515744,3.5429307934882755E-2,1.0000015003785261,1.7322682529867697E-3,1.000000861650534,1.3127451506439818E-3,1.0000000784174634,3.9602388351646297E-4,1.0000000210177928,3.3791600839964427E-4,58.344731629172244,-100.43754619991174,79.562453800088264,null,1000000000,43651.744900000005,null,44.812340479219664,-86.008219975762216,null,29.095409354552633,-14.432655560153995,null,0,0]
[229.09,0.22909000000000002,1.038956990368751,0.2747105718072228,1.0000000005014034,3.1667128237708667E-5,1,0,30.484501811351695,1.5379868868173145,1.0007549281733163,3.8844653393037033E-2,1.0000018038957268,1.8994172870207941E-3,1.0000010359571199,1.4394139262629644E-3,1.0000000942808396,4.3423687606047721E-4,1.0000000252695649,3.7052208075989137E-4,57.492563752110399,-101.75887229734693,78.241127702653074,null,1000000000,52482.2281,null,44.014278754300911,-86.003351557380824,null,29.041301826190743,-15.75917132883351,null,0,0]
[251.19,0.25119000000000002,1.0466595224771147,0.29971547238678548,1.0000000006028091,3.4722012927200174E-5,1,0,33.422274701856374,1.5408716950401788,1.0009075382441697,4.2587613705512221E-2,1.0000021687214651,2.0826509768408579E-3,1.0000012454725538,1.5782720050440781E-3,1.000000113348523,4.7612710948134274E-4,1.0000000303801695,4.0626584059155296E-4,56.630591408946522,-103.15439836105806,76.845601638941943,null,1000000000,63096.416100000002,null,43.216461990981436,-85.964681581512906,null,28.977144592140249,-17.193719535408565,null,0,0]
[275.42,0.27542,1.0558446849089034,0.32669232156632361,1.000000000724713,3.8071327678778156E-5,1,0,36.643456331867412,1.5435029362207471,1.0010909664133161,4.6689945299573994E-2,1.000002607293601,2.283544585097939E-3,1.0000014973397804,1.7305131678819487E-3,1.0000001362705837,5.220547254645079E-4,1.0000000365238417,4.4545458716807715E-4,55.757080469236598,-104.62894838860848,75.371051611391522,null,1000000000,75856.176400000011,null,42.418841295812477,-85.8919046653387,null,28.90125235900982,-18.741432587909294,null,0,0]
[302,0.30199999999999999,1.0667881064427724,0.35572776057542144,1.0000000008713426,4.1745483108950259E-5,1,0,40.177294108079593,1.5459040760757092,1.0013115548178844,5.1188337350664428E-2,1.0000031348211069,2.5039220905070008E-3,1.000001800293175,1.8975196832056469E-3,1.0000001638419274,5.7243673005714913E-4,1.0000000439136356,4.8844414069709849E-4,54.869744318786296,-106.18684855360105,73.813151446398948,null,1000000000,91204,null,41.621065357995079,-85.784367666762677,null,28.811689754443123,-20.407293307724579,null,0,0]
[331.13,0.33112999999999998,1.0797918234921957,0.38684370357378173,1.0000000010475436,4.5772125232592473E-5,1,0,44.050378261038816,1.5480930958406534,1.0015765658481106,5.6115903823991016E-2,1.0000037687367005,2.7454416272656951E-3,1.0000021643441983,2.0805481463743434E-3,1.0000001969736865,6.2765221932798972E-4,1.0000000527937571,5.3555797408369552E-4,53.967423603123386,-107.82859617011039,72.171403829889613,null,1000000000,109647.0769,null,40.823979231972416,-85.641298548335655,null,28.706452290480872,-22.192574233350687,null,0,0]
[363.08,0.36307999999999996,{"$f":"SQRT(1+(A77/pole1)^2)","v":1.0952258815540745},{"$f":"ATAN(A77/pole1)","v":0.42008651305589334},{"$f":"SQRT(1+(A77/Zero1)^2)","v":1.0000000012594465},{"$f":"ATAN(A77/Zero1)","v":5.0188576169788117E-5},{"$f":"IF(VIN_nom>Vout, 1, SQRT(1+(A77/z_RHP)^2))","v":1},{"$f":"IF(VIN_nom>Vout, 0, -ATAN(A77/z_RHP))","v":0},{"$f":"SQRT(1+(A77/Pole2)^2)","v":48.298607587627885},{"$f":"ATAN(A77/Pole2)","v":1.5500903166219082},{"$f":"SQRT(1+(A77/Zero2)^2)","v":1.0018951805191703},{"$f":"ATAN(A77/Zero2)","v":6.1517351384566155E-2},{"$f":"SQRT(1+(A77/pole4)^2)","v":1.0000045310956143},{"$f":"ATAN(A77/pole4)","v":3.0103416767094278E-3},{"$f":"SQRT(1+(A77/Zero3)^2)","v":1.0000026021589927},{"$f":"ATAN(A77/Zero3)","v":2.2812949611962113E-3},{"$f":"SQRT(1+(A77/pole5)^2)","v":1.0000002368185947},{"$f":"ATAN(A77/pole5)","v":6.8821297297181607E-4},{"$f":"SQRT((1-(Z77/pterm2))^2+(A77/pterm1)^2)","v":1.0000000634731672},{"$f":"IF((ATAN((A77/pterm1)/(1-A77^2/pterm2))>0),ATAN((A77/pterm1)/(1-A77^2/pterm2)),PI()+ATAN((A77/pterm1)/(1-A77^2/pterm2)))","v":5.8723277574978952E-4},{"$f":"20*LOG10(((E77*K77*G77*O77)/(C77*I77*S77*M77*Q77))*Adc)","v":53.047210360988338},{"$f":"((F77+L77+H77+R77)-(D77+J77+T77+N77+T77))*radconv","v":-109.55559725892992},{"$f":"IF(V77>0,V77,V77+180)","v":70.444402741070078},null,{"$f":"IF(U77<0,A77,1000000000)","v":1000000000},{"$f":"A77^2","v":131827.0864},null,{"$f":"20*LOG10((K77/(I77*M77))*AEA)","v":40.02703589660684},{"$f":"(L77-(J77+N77))*radconv","v":-85.461428375995595},null,{"$f":"20*LOG10((E77*G77/(C77*S77))*Acs*Am)","v":28.583178926997874},{"$f":"(F77+H77-(D77+T77))*radconv","v":-24.09995462205617},null,{"$f":"SUM((U78<0)*(U77>0))*A77","v":0},{"$f":"IF(AH77>0,W75,0)","v":0}]
[398.11,{"$f":"A78/1000","v":0.39811000000000002},1.1134973357516629,0.45543153739959624,1.000000001514193,5.503077573967453E-5,1,0,52.956553055678469,1.5519118000965726,1.0022780803830362,6.7435362606569654E-2,1.0000054475916731,3.300777769829373E-3,1.0000031284933342,2.5013936827212361E-3,1.0000002847195635,7.5461181535859117E-4,1.0000000763117993,6.4388906045514179E-4,52.107113694856665,-111.36505551541295,68.634944484587052,null,1000000000,158491.57210000002,null,39.23064486564602,-85.243355387519699,null,28.439469136220549,-26.128044074452525,null,0,0]
[436.52,0.43651999999999996,1.1350754036517474,0.49282728660880942,1.0000000018204693,6.0340192964200359E-5,1,0,58.064105720759919,1.5535731313449563,1.002738239096707,7.3918947063476279E-2,1.0000065494740826,3.6192370291010028E-3,1.0000037612934385,2.742729169684043E-3,1.000000342309866,8.2741738964955405E-4,1.0000000917474117,7.0601203752683082E-4,51.144624613922112,-113.25226884336175,66.747731156638253,null,1000000000,190549.71039999998,null,38.434861533037854,-84.985307002136182,null,28.272758391704077,-28.273917855520498,null,0,0]
[478.63,0.47863,1.160483393247872,0.5321663684908351,1.000000002188643,6.6161061466522714E-5,1,0,63.663817425709361,1.5550881715824394,1.003291114801262,8.1019922006684328E-2,1.0000078740411422,3.968372330181295E-3,1.0000045219795146,3.0073119141384537E-3,1.0000004115389458,9.0723624789301358E-4,1.0000001103025031,7.7411926355910399E-4,50.157423704041349,-115.20908342162548,64.790916578374521,null,1000000000,229086.67689999999,null,37.639939117191609,-84.685260497750562,null,28.080473891777537,-30.531449965267448,null,0,0]
[524.80999999999995,0.52481,1.1903173405763081,0.5733064693480473,1.000000002631354,7.254452637318579E-5,1,0,69.804890118356582,1.5564701928309885,1.0039555182281161,8.8797788820205406E-2,1.0000094667673614,4.3512510106607418E-3,1.0000054366673754,3.2974665258093776E-3,1.0000004947835972,9.9476971529868633E-4,1.0000001326141141,8.4880916334472941E-4,49.142826963982642,-117.22489773516995,62.775102264830053,null,1000000000,275425.53609999997,null,36.845811954572397,-84.340742872523549,null,27.859997092553321,-32.89251778625831,null,0,0]
[575.44000000000005,0.57544000000000006,1.2252206518531827,0.61602866622535613,1.0000000031635536,7.9543115110944764E-5,1,0,76.537856680319138,1.5577305251580371,1.0047536406447604,9.7312751480096188E-2,1.0000113814391334,4.7710231998702316E-3,1.0000065362463952,3.615580394152555E-3,1.0000005948550641,1.0907380705058984E-3,1.0000001594357286,9.3069633527718401E-4,48.098881201816262,-119.28457479229806,60.715425207701941,null,1000000000,331131.19360000006,null,36.052888700009646,-83.949134346875297,null,27.608965903394093,-35.344610161407786,null,0,0]
[630.96,0.63096000000000008,1.2659141251595283,0.66008029521533651,1.0000000038034591,8.7217648910383518E-5,1,0,83.92122995980435,1.5588801088496553,1.0057124478697741,0.10663382566035347,1.0000136835959341,5.2313363305928054E-3,1.0000078583558174,3.9644178276895085E-3,1.0000007151789085,1.1959753193397757E-3,1.0000001916854837,1.0204924195684583E-3,47.023446484737633,-121.37054980348935,58.629450196510646,null,1000000000,398110.52160000004,null,35.261242564632397,-83.507316428684987,null,27.325166883197795,-37.873287804349495,null,0,0]
[691.83,0.69183000000000006,1.3131650943551838,0.70514300648957196,1.0000000045727122,9.563171360264714E-5,1,0,92.016183441669412,1.559928459339867,1.0068638555287686,0.11683170537352296,1.0000164510933132,5.736003449132665E-3,1.000009447708162,4.3468687074763113E-3,1.000000859824453,1.3113533748435489E-3,1.0000002304540618,1.118941403643596E-3,45.915223970113658,-123.46132751879847,56.53867248120153,null,1000000000,478628.74890000006,null,34.47130951792191,-83.01200231506327,null,27.006864866838924,-40.460349597625367,null,0,0]
[758.58,0.75858000000000003,1.3678199636838224,0.75087761971644629,1.0000000054976599,1.0485857112291017E-4,1,0,100.89320054312836,1.5608846938184844,1.0082465635140232,0.12798662402667549,1.0000197787134621,6.2894176947843388E-3,1.0000113587371615,4.7662626124048276E-3,1.0000010337457805,1.437876830649397E-3,1.000000277069284,1.2269004903460044E-3,44.77298393313653,-125.53368785757523,54.466312142424769,null,1000000000,575443.61640000006,null,33.683246949393968,-82.459369055242334,null,26.652672310235467,-43.086406856223221,null,0,0]
[831.76,0.83175999999999994,1.4307598407310449,0.79689698512649099,1.0000000066095389,1.1497424800619818E-4,1,0,110.6254252249167,1.5617566904068991,1.0099062100830976,0.14017929921773195,1.0000237788285467,6.8961376671645694E-3,1.0000136559788864,5.2260546272218924E-3,1.0000012428164409,1.5765881857766966E-3,1.0000003331054139,1.3452592296727755E-3,43.596635542863154,-127.56157441401875,52.43842558598125,null,1000000000,691824.69759999996,null,32.89763697030368,-81.845504443149139,null,26.261915761676462,-45.729324143748663,null,0,0]
[912.01,0.91200999999999999,1.5029532907262524,0.84282483421206744,1.000000007946471,1.260672114921064E-4,1,0,121.29797123189086,1.5625520724360744,1.0118981781501735,0.15350173585527671,1.0000285885777189,7.5614676679140449E-3,1.000016418193715,5.7302651050856364E-3,1.0000014942046167,1.7287005269978879E-3,1.0000004004837129,1.4750527342506654E-3,42.386183905081936,-129.51894183809679,50.481058161903206,null,1000000000,831762.24009999994,null,32.11473893761007,-81.165877684609455,null,25.834340348183439,-48.367597101511123,null,0,0]
[1000,1,1.5854008087532241,0.88827012196730482,1.0000000095537769,1.3823007571958716E-4,1,0,132.99994269834937,1.5632774557186342,1.0142878123924219,0.16804608328980425,1.0000343709941211,8.2909600986904464E-3,1.0000197390139427,6.2831026185542743E-3,1.0000017964321037,1.8954837980845959E-3,1.0000004814882488,1.6173646374018841E-3,41.142816902332044,-131.37884842621096,48.621151573789035,null,1000000000,1000000,null,31.335218240876038,-80.415906198072378,null,25.370467823521299,-50.978877282265628,null,0,0]
[1096.5,1.0965,1.6791945836510984,0.93287905747230293,1.0000000114866232,1.5156927783122059E-4,1,0,145.83374353034074,1.5639391494870374,1.0171540029199857,0.18391477974855097,1.0000413245236033,9.090995606282062E-3,1.0000237324108803,6.8894036800969905E-3,1.0000021598719322,2.0783974810188129E-3,1.0000005788992745,1.7734403085826321E-3,39.867926922607964,-133.11593423850465,46.88406576149535,null,1000000000,1202312.25,null,30.559536548406328,-79.590447781973992,null,24.871228007607755,-53.542959215463455,null,0,0]
[1202.3,1.2022999999999999,1.7854400986648606,0.97630672227004489,1.0000000138102263,1.6619401956606203E-4,1,0,159.90443801371711,1.5645425509101434,1.0205889868722637,0.2012055105734748,1.0000496837608532,9.9681195696124623E-3,1.0000285331183936,7.5541299910697373E-3,1.0000025967869985,2.2789389544654462E-3,1.0000006960035859,1.9445574641205493E-3,38.564239470265527,-134.70557856808597,45.294421431914031,null,1000000000,1445525.2899999998,null,29.788697380797565,-78.684589736078777,null,24.338341820535128,-56.040147480173111,null,0,{"$f":"IF(AH90>0,W90,0)","v":0}]
[1318.3,1.3183,1.905341637444073,1.018268889105624,1.0000000166036511,1.8222870796467209E-4,1,0,175.33172013247196,1.565092821342903,1.0247032665612665,0.22002371819242564,1.0000597331050016,1.0929787901255931E-2,1.0000343044764173,8.2829337534028637E-3,1.0000031220440326,2.4988140827127588E-3,1.0000008367858861,2.1321717298828742E-3,37.234590413303977,-136.12623983849721,43.873760161502787,null,1000000000,1737914.89,null,29.023555436210966,-77.69301357046146,null,23.773789142667859,-58.454233327467691,null,0,0]
[1445.4,1.4454,2.0400898884969201,1.058506407282805,1.0000000199595709,1.9979775005905516E-4,1,0,192.2352842593892,1.5655943446823524,1.0296242740363206,0.24046191256659488,1.0000718058893687,1.1983454668311376E-2,1.000041237932765,9.0814663656969188E-3,1.0000037530684347,2.7397287079879316E-3,1.0000010059166915,2.3377387310214866E-3,35.883170784847856,-137.3585095804055,42.641490419594504,null,1000000000,2089181.1600000001,null,28.265611409970838,-76.61109712016048,null,23.180258800479322,-60.770444789358073,null,0,0]
[1584.9,1.5849000000000002,2.1912923203464891,1.0969055845788838,1.0000000239982088,2.1908084489830816E-4,1,0,210.78802288978812,1.5660522064344826,1.0355153913222239,0.2626601338462195,1.0000863345323594,1.3139887475979059E-2,1.0000495818474082,9.9578912287517102E-3,1.0000045124660628,3.0041468320153924E-3,1.0000012094550457,2.5633610374400152E-3,34.511387664562548,-138.38884777992988,41.611152220070124,null,1000000000,2511908.0100000002,null,27.514784415077031,-75.431724991960238,null,22.559236800073705,-62.982377953697011,null,0,0]
[1737.8,1.7378,2.3602287298549642,1.1332836389602563,1.0000000288519175,2.4021622249501429E-4,1,0,231.12293060435982,1.5664696114946473,1.0425514001994935,0.2866893098055413,1.0001037950409519,1.4407363666193987E-2,1.0000596096239347,1.0918485517325027E-2,1.0000054251232047,3.2939637758048453E-3,1.0000014540712545,2.8106560084972601E-3,33.125113832437393,-139.20344464141937,40.796555358580633,null,1000000000,3019948.84,null,26.773509013459417,-74.151491207478443,null,21.914159201360796,-65.079644929245205,null,0,0]
[1905.5,1.9055,2.5486069545837853,1.1675882017498604,1.0000000346890974,2.6339740486995458E-4,1,0,253.42620014218147,1.5668503946280286,1.0509506764319609,0.31265774002654578,1.0001247930403532,1.5797472201752181E-2,1.0000716691219556,1.1972037573569181E-2,1.0000065227042534,3.6118329969298474E-3,1.0000017482524026,3.0818879475600727E-3,31.727576381802617,-139.79407461637487,40.205925383625129,null,1000000000,3630930.25,null,26.042854287394803,-72.765074372255825,null,21.247181269607751,-67.059363858856443,null,0,0]
[2089.3000000000002,2.0893000000000002,2.7580197473649046,1.1997626274301239,1.000000041703903,2.8880409101087492E-4,1,0,277.8707250577167,1.5671975232204645,1.0609565033388049,0.34062602567714351,1.0001500267111594,1.7320967460395211E-2,1.0000861613786276,1.3126705039453387E-2,1.0000078417158895,3.9602183389332466E-3,1.0000021017835348,3.3791594194026199E-3,30.324057741027922,-140.15489563603549,39.845104363964509,null,1000000000,4365174.4900000012,null,25.32511439540955,-71.269788494274991,null,20.561288109316386,-68.918399365536061,null,0,0]
[2290.9,2.2909000000000002,2.9905121273135298,1.2298374905454461,1.0000000501403492,3.1667127189760131E-4,1,0,304.68259725266637,1.5675142168076717,1.0728665463691121,0.37067683992660405,1.0001803734680892,1.8991911968255604E-2,1.0001035904001647,1.4393155212063311E-2,1.0000094280399678,4.342341740367143E-3,1.0000025269626398,3.7052199314594886E-3,28.917829629600554,-140.28402986115216,39.715970138847837,null,1000000000,5248222.8100000005,null,24.621716240865918,-69.661886939058803,null,19.85832055875354,-70.65864731282123,null,0,0]
[2511.9,2.5119000000000002,3.2480171796347017,1.2578321839225135,1.0000000602809074,3.4722011545771107E-4,1,0,334.07460936837879,1.5678029790057684,1.0870096648146153,0.40283059007917227,1.0002168488699636,2.0823529528863859E-2,1.0001245395778688,1.5781422886012593E-2,1.0000113347886936,4.7612354762170215E-3,1.0000030380258471,4.0626572509660352E-3,27.514056540538903,-140.18243040894606,39.817569591053939,null,1000000000,6309641.6100000003,null,23.935237117799648,-67.941101568971007,null,19.140861212902827,-72.281354423987437,null,0,0]
[2754.2,2.7542,3.5328175533189015,1.28381303333212,1.000000072471297,3.8071325857786433E-4,1,0,366.29945289960142,1.5680663165962889,1.1037718529817209,0.43709705631745827,1.0002606957188735,2.2831517525342633E-2,1.0001497228816767,1.7303421816427311E-2,1.0000136269664479,5.2205003025496575E-3,1.000003652397023,4.4545443492283333E-3,26.11687368990324,-139.85451090524165,40.145489094758346,null,1000000000,7585617.6399999987,null,23.267918535542286,-66.107915042630097,null,18.410798144473329,-73.790481906079918,null,0,0]
[3020,3.02,3.8475559001495476,1.3078722413427284,1.0000000871342642,4.1745480708225513E-4,1,0,401.64971826793646,1.568306592611981,1.1236026794116016,0.47346361943980309,1.0003134334817709,2.5034042283998772E-2,1.0001800132771581,1.8972942698598991E-2,1.0000163840598564,5.7243054009583315E-3,1.0000043913821319,4.8844393998212499E-3,24.7298190789176,-139.30760487687388,40.692395123126119,null,1000000000,9120400,null,22.621905682264835,-64.164226632664096,null,17.669517278552075,-75.191499021486479,null,0,0]
[3311.3,3.3113000000000001,4.1946439906218638,1.3300790798308333,1.000000104754367,4.5772122068004901E-4,1,0,440.3913969346587,1.5685256174524469,1.146979391972444,0.51181864028450941,1.0003768033898186,2.744759044145445E-2,1.0002164112371414,2.0802510240885429E-2,1.0000196971766051,6.2764405987678655E-3,1.0000052794025525,5.3555770950401262E-3,23.358374996908758,-138.55326379311279,41.446736206887209,null,1000000000,10964707.690000001,null,22.000385227747628,-62.117481134828381,null,16.919306341896352,-76.488544250615945,null,0,0]
[3630.8,3.6308000000000002,4.577332537907858,1.3505522091395235,1.0000001259446512,5.01885719979399E-4,1,0,482.88357757369084,1.5687254327715545,1.1744765960861234,0.55206547818790186,1.0004530079798488,3.0094419163894281E-2,1.0002601823903905,2.2809032882413635E-2,1.0000236815818775,6.8820221649005262E-3,1.0000063473555276,5.8723242695479612E-3,22.005405475205038,-137.60540159063316,42.394598409366836,null,1000000000,13182708.640000001,null,21.405426453336656,-59.974607871125002,null,16.160950101127764,-77.688645147561232,null,0,0]
[3981.1,3.9811000000000001,4.9987630142471406,1.3693878935156572,1.0000001514193027,5.5030770240078791E-4,1,0,529.47204945482133,1.5689076518487017,1.2067042063531623,0.59400909945663016,1.0005446123498067,3.2995917801374827E-2,1.0003128009005902,2.5008773874200457E-2,1.000028471555088,7.5459763556191377E-3,1.000007631236042,6.4388860064837645E-3,20.675130043650213,-136.48220538698078,43.51779461301922,null,1000000000,15849157.209999999,null,20.839748313726606,-57.748099402645437,null,15.395937505604385,-78.797537588952906,null,0,0]
[4365.2,4.3651999999999997,5.4625650749000441,1.3866939219719263,1.0000001820469282,6.0340185714268413E-4,1,0,580.55580034580521,1.5690738386311425,1.2443462599600219,0.63741834812319143,1.0006547352139354,3.6176737873283397E-2,1.0003760593409043,2.7420486071096366E-2,1.0000342304065977,8.2739869703064052E-3,1.0000091748222482,7.0601143137426943E-3,19.370768502611416,-135.20480391612048,44.795196083879517,null,1000000000,19054971.039999999,null,20.305582184156258,-55.452702026350288,null,14.625242846668986,-79.82165166993714,null,0,0]
[4786.3,4.7862999999999998,5.9726184040510679,1.402573271211794,1.0000002188642794,6.6161051909530784E-4,1,0,636.56041733790323,1.5692253833556349,1.2881405606205745,0.68200124153029162,1.0007870974530488,3.9663119668012572E-2,1.0004520967781307,3.0064148668061966E-2,1.0000411530562694,9.0721160714897307E-3,1.0000110303675112,7.7411846451021765E-3,18.095367958383569,-133.7976301838045,46.2023698161955,null,1000000000,22908667.690000001,null,19.804960273928693,-53.106728228691274,null,13.849864160350849,-80.767158708753698,null,0,0]
[5248.1,5.2481,6.5334169565140616,1.4171330483870948,1.0000002631353817,7.254451377442726E-4,1,0,697.97798564394839,1.5693636163617912,1.3389056195522335,0.72744076861548013,1.0009462335381654,4.3485354052709903E-2,1.0005435205081392,3.2962841002506231E-2,1.0000494771479711,9.9473723230912789E-3,1.0000132615808217,8.4880810996530009E-3,16.850869453195109,-132.28705099193095,47.712949008069046,null,1000000000,27542553.610000003,null,19.339271504982442,-50.730153167319052,null,13.070333021655941,-81.64050905289092,null,0,0]
[5370.3,5.3703000000000003,6.6820207627824439,1.4205766624075511,1.0000002755320583,7.4233684400658241E-4,1,0,714.23010293600692,1.5693962173307239,1.352779352211283,0.7388866012270956,1.0009907898698858,4.4496573061925566E-2,1.000569119242158,3.3729792743205762E-2,1.0000518080256975,1.0178977263950449E-2,1.0000138863610082,8.6857223066033468E-3,16.544942088811503,-131.8967743237188,48.103225676281198,null,1000000000,28840122.090000004,null,19.228496388823885,-50.134161744298602,null,12.874978794001477,-81.848169786310962,null,0,0]
[5432.85,5.4328500000000002,6.7581156089371577,1.4222807216368993,1.0000002819878973,7.5098313047754217E-4,1,0,722.5490061380583,1.5694123371820912,1.3599483555233274,0.74465458423189446,1.0010139927642234,4.5014146380444826E-2,1.0005824500808149,3.4122353802414213E-2,1.0000530218788626,1.0297527489856831E-2,1.0000142117291917,8.7868880662263921E-3,16.391813100780062,-131.69881192787315,48.301188072126848,null,1000000000,29515859.122500002,null,19.173620911464131,-49.834259027667208,null,12.776620102610307,-81.951106163644937,null,0,0]
[5495.4,5.4954000000000001,6.8342296423865703,1.4239468287922927,1.0000002885184949,7.5962941683621751E-4,1,0,730.86790952358967,1.5694280900738948,1.3671621284353048,0.75036188642009294,1.0010374637998589,4.5531695566817319E-2,1.0005959351092926,3.4514904341026519E-2,1.0000542497868947,1.041607742630757E-2,1.000014540865334,8.8880538164597504E-3,16.240954372710206,-131.50212940066683,48.497870599333169,null,1000000000,30199421.159999996,null,19.119937608714931,-49.537810657823961,null,12.679338281693337,-82.051868046783497,null,0,0]
[5559.4,5.5593999999999992,6.9121273083656538,1.4256135750092054,1.0000002952778588,7.6847613657404941E-4,1,0,739.37965737568845,1.569443841241779,1.3745887302561783,0.75613929688174553,1.0010617564457762,4.6061217031110803E-2,1.0006098923266127,3.4916543757232139E-2,1.0000555207069293,1.0537375219683036E-2,1.0000148815313299,8.9915647261315807E-3,16.088890704527053,-131.30225225391459,48.697747746085412,null,1000000000,30906928.359999996,null,19.066209934399389,-49.238031242021769,null,12.58089216848944,-82.152789429201547,null,0,0]
[5623.4,5.6233999999999993,6.9900437485188469,1.4272431679816195,1.0000003021154873,7.7732285619159255E-4,1,0,747.89140540705148,1.5694592338817546,1.3820607197633967,0.76185442627394795,1.0010863297687147,4.6590712647901399E-2,1.0006240109520197,3.5318171904104266E-2,1.0000568063408979,1.0658672702971753E-2,1.0000152261420185,9.0950756257442509E-3,15.9390886418104,-131.10379281901407,48.896207180985925,null,1000000000,31622627.559999995,null,19.013662723294576,-48.941798245557848,null,12.483525925914972,-82.251582086942733,null,0,0]
[5688.9,5.6888999999999994,7.0698051468515732,1.4288737579026753,1.0000003091944103,7.863769206741762E-4,1,0,756.60264771220159,1.5694746286827217,1.3897540658723841,0.76763967822478085,1.0011117696290037,4.7132591247079303E-2,1.0006386276025017,3.5729201407345E-2,1.0000581373421153,1.0782812771228247E-2,1.000015582913985,9.2010125515301303E-3,15.788059492555778,-130.90218564885981,49.097814351140187,null,1000000000,32363583.209999997,null,18.961072300433631,-48.642257138876232,null,12.384971881274476,-82.350558986708734,null,0,0]
[5754.4,5.7543999999999995,7.1495849231094368,1.4304679615919456,1.0000003163553095,7.9543098502783162E-4,1,0,765.31389019258438,1.5694896730187502,1.3974934128252796,0.77336104221989133,1.0011375034331709,4.7674442147847919E-2,1.0006534133011737,3.6140218833243587E-2,1.0000594837549444,1.0906952507130146E-2,1.0000159438177354,9.3069494665342471E-3,15.639283648057642,-130.7021325620689,49.297867437931103,null,1000000000,33113119.359999996,null,18.909650575794622,-48.346354875259593,null,12.287501111486831,-82.447451108348289,null,0,0]
[5821.4,5.8213999999999997,7.2312100970574997,1.4320622752881886,1.0000003237650119,8.0469239423174694E-4,1,0,774.22462695070305,1.5695047116185834,1.4054567975565513,0.77914804364004242,1.0011641306557313,4.8228672861262888E-2,1.0006687124953371,3.65606362323566E-2,1.000060876946649,1.1033934789901452E-2,1.0000163172612651,9.4153124064753953E-3,15.489374039976775,-130.49913726918919,49.500862730810809,null,1000000000,33888697.959999993,null,18.858226462071421,-48.047400846562546,null,12.188894918187003,-82.544476653928314,null,0,0]
[5888.4,5.8883999999999999,7.312853241207053,1.4336209939683227,1.0000003312604884,8.1395380329761914E-4,1,0,783.13536387993508,1.5695194079914865,1.4134667189036452,0.78486964659116465,1.0011910653911502,4.8782873924308162E-2,1.0006841885530586,3.6981040701863782E-2,1.0000622862637905,1.1160916716825947E-2,1.0000166950280056,9.5236753348724116E-3,15.341706329400333,-130.29782830045238,49.70217169954762,null,1000000000,34673254.559999995,null,18.807957436087619,-47.75217256713195,null,12.091374141553588,-82.639462754657742,null,0,0]
[5957,5.9569999999999999,7.3964640699485562,1.4351812787816132,1.0000003390238319,8.2343638019649764E-4,1,0,792.25889469814251,1.5695341127986602,1.4217153173484536,0.79066089169036791,1.0012189619341405,4.9350278565659711E-2,1.0007002174291089,3.741147113008253E-2,1.0000637459438575,1.1290930675005416E-2,1.0000170862953572,9.6346260225940571E-3,15.192776899799807,-130.09348599672816,49.906514003271838,null,1000000000,35485849,null,18.757650768172422,-47.453711079095925,null,11.99262492894626,-82.73467418391175,null,0,0]
[6025.6,6.0256000000000007,7.4800925027252019,1.4367066788545688,1.0000003468770948,8.3291895694729049E-4,1,0,801.3824256837604,1.5695484827850084,1.4300110470121776,0.79638513499129204,1.0012471807995775,4.9917651406525612E-2,1.0007164316992825,3.7841887689805009E-2,1.000065222528582,1.1420944251454372E-2,1.0000174820948873,9.745576697931569E-3,15.046081494729812,-129.89096287948377,50.109037120516234,null,1000000000,36307855.360000007,null,18.708487155744969,-47.159067505471633,null,11.894965225253934,-82.8278868640718,null,0,0]
[6095.8,6.0958000000000006,7.5656890685448168,1.4382327417125598,1.0000003550066137,8.4262270151386133E-4,1,0,810.71875056240674,1.5695628530990156,1.4385482053071508,0.80217434571686141,1.0012763914892424,5.0498224133210375E-2,1.0007332160660936,3.8282328596586153E-2,1.0000667510531942,1.1553989814752749E-2,1.0000178918178764,9.8591151311527864E-3,14.898219077579355,-129.6856218374821,50.314378162517897,null,1000000000,37158777.640000001,null,18.659326226179303,-46.861457889126903,null,11.79613133182491,-82.92127311464003,null,0,0]
[6166,6.1660000000000004,7.6513028596057158,1.4397246564042314,1.0000003632302952,8.5232644592174499E-4,1,0,820.05507560465912,1.5695768962010455,1.4471330067024546,0.80789505982185406,1.0013059396540673,5.1078762790595394E-2,1.0007501945567985,3.8722754643970181E-2,1.0000682972800554,1.1687034968997019E-2,1.0000183062869454,9.9726535511030986E-3,14.752579608612624,-129.48222813897752,50.517771861022482,null,1000000000,38019556,null,18.611294431192071,-46.567752140164188,null,11.698389723298646,-83.012702818646545,null,0,0]
[6237.8,6.2378,7.7388851848911511,1.4412164248210841,1.0000003717388175,8.6225135812728279E-4,1,0,829.60419454355281,1.5695909324047286,1.455961878948665,0.81367618059237756,1.0013365103506244,5.1672497450675217E-2,1.0007677608223811,3.9173203343295174E-2,1.0000698970605213,1.1823112063376736E-2,1.0000187351121868,1.0088779727421239E-2,14.605861864851512,-129.27623083824722,50.723769161752784,null,1000000000,38910148.840000004,null,18.563301981495442,-46.271341024223723,null,11.599525860862412,-83.104259737260335,null,0,0]
[6309.6,6.3096000000000005,7.8264843466170273,1.4426748027160421,1.0000003803458437,8.7217627016295018E-4,1,0,839.15331364217116,1.5696046491593256,1.4648388239056565,0.81938742296694678,1.0013674340175502,5.2266195649274413E-2,1.0007855301406239,3.9623636138244683E-2,1.0000715153591977,1.1959188719880907E-2,1.0000191689023441,1.0204905889533038E-2,14.461353015573996,-129.07230377000312,50.927696229996883,null,1000000000,39811052.160000004,null,18.516423008238544,-45.978913253281767,null,11.501755817650752,-83.193903519087414,null,0,0]
[6383.05,6.3830499999999999,7.9161134194739269,1.4441332939537883,1.0000003892525891,8.823292614756668E-4,1,0,848.92187644518776,1.5696183618266073,1.4739686023837038,0.82515853849754606,1.0013994335224756,5.2873499169348151E-2,1.0008039179010857,4.0084403458169889E-2,1.000073190008532,1.2098392027842145E-2,1.0000196177986007,1.0323700674204584E-2,14.31575051736845,-128.86584559969347,51.134154400306528,null,1000000000,40743327.302500002,null,18.469585029999095,-45.683834296503619,null,11.402846255221338,-83.283693627807878,null,0,0]
[6456.5,6.4565000000000001,8.0057589543929932,1.4455591248747175,1.0000003982624177,8.9248225260647686E-4,1,0,858.69043940420136,1.5696317625000749,1.4831468671954529,0.83085841429680674,1.0014318023374191,5.3480763654200569E-2,1.0008225181309138,4.0545153749243272E-2,1.0000748840367806,1.2237594866907429E-2,1.0000200718906143,1.044249544366295E-2,14.172343057735235,-128.66157777966521,51.338422220334792,null,1000000000,41686392.25,null,18.423844756493867,-45.392816963187236,null,11.305032353879289,-83.371612437353804,null,0,0]
[6531.7,6.5316999999999998,8.0975568439157311,1.4469862172048495,1.0000004075937088,9.0287714599019374E-4,1,0,868.6917456803742,1.5696451702127916,1.4925931097453746,0.83662127716420565,1.0014653249391321,5.4102455754705486E-2,1.0008417816354873,4.1016863907616427E-2,1.0000766385033784,1.2380113824063005E-2,1.0000205421846371,1.0564120569492397E-2,14.027734460263503,-128.454720860094,51.545279139906,null,1000000000,42663104.890000001,null,18.378118131368108,-45.099017781504052,null,11.205998437927454,-83.459751827819971,null,0,0]
[6606.9,6.6068999999999996,8.1893708551250732,1.4483813130224488,1.0000004170330536,9.1327203917879207E-4,1,0,878.693052109154,1.5696582727116637,1.502088297773154,0.84231146916882227,1.0014992345822629,5.4724105995868043E-2,1.0008612678292383,4.1488555803091139E-2,1.0000784132831146,1.2522632278273509E-2,1.0000210179249815,1.0685745679003471E-2,13.885309997669715,-128.25017455025824,51.749825449741763,null,1000000000,43651127.609999992,null,18.333474685668165,-44.809362447727807,null,11.108063724453261,-83.546057952232971,null,0,0]
[6683.85,6.6838500000000005,8.2833376251442647,1.4497768567928266,1.0000004268039191,9.2390883459763957E-4,1,0,888.92710185875899,1.5696713749188334,1.511854156134689,0.84805989969770668,1.0015343339617055,5.5360179003111173E-2,1.0008814380008928,4.1971205447942243E-2,1.0000802503918358,1.2668466792177552E-2,1.0000215103743368,1.0810201142990418E-2,13.741773600521551,-128.04326391001987,51.956736089980126,null,1000000000,44673850.822500005,null,18.288879889473563,-44.517196639215072,null,11.008963035797079,-83.632538049838985,null,0,0]
[6760.8,6.7608000000000006,8.3773201653943303,1.4511410908306765,1.000000436687926,9.345456298074222E-4,1,0,899.16115175749019,1.5696841788732576,1.5216693306830824,0.85373435789823182,1.0015698385222969,5.5996207171477574E-2,1.0009018413191295,4.2453835527655991E-2,1.0000821087698908,1.2814300767196323E-2,1.0000220085264808,1.0934656589492353E-2,13.600407398957923,-127.83877802765068,52.161221972349324,null,1000000000,45708416.640000001,null,18.245352012272772,-44.229249475220989,null,10.910963788696682,-83.717224230921545,null,0,0]
[6839.55,6.83955,8.4735169079949237,1.4525059017310862,1.0000004469202801,9.4543123872127175E-4,1,0,909.63459478545656,1.5696969840399504,1.5317641708055878,0.85946607013264187,1.0016065930628468,5.6647066235365091E-2,1.0009229632840408,4.294773470954194E-2,1.000084032640099,1.2963545498857865E-2,1.0000225242357703,1.1062023256195444E-2,13.45792282952676,-127.63201852307074,52.367981476929259,null,1000000000,46779444.202500001,null,18.201876980668015,-43.938871713900028,null,10.811787664189902,-83.802096008449993,null,0,0]
[6918.3,6.9183000000000003,8.569729079923464,1.4538400696626184,1.0000004572711305,9.5631684741106062E-4,1,0,920.10803795918207,1.5697094976883015,1.5419086733739098,0.86512254617725814,1.0016437718702551,5.7297877258024987E-2,1.0009443294001592,4.3441612926395624E-2,1.0000859787860827,1.3112789652989534E-2,1.0000230459178012,1.1189389904159033E-2,13.317594422154176,-127.42779459747233,52.572205402527672,null,1000000000,47862874.890000001,null,18.15945234936591,-43.652785213395596,null,10.713715380073179,-83.885212072127146,null,0,0]
[6998.9,6.9988999999999999,8.6682169154069744,1.4551749087236041,1.0000004679878487,9.6745818127662948E-4,1,0,930.82752407072633,1.5697220137062753,1.5523419012717232,0.87083516181412512,1.0016822633695484,5.7963926857443553E-2,1.0009664502561171,4.3947071402062124E-2,1.0000879937177942,1.3265539255290625E-2,1.0000235860400963,1.1319748637872986E-2,13.176143676472433,-127.22139317337263,52.778606826627367,null,1000000000,48984601.209999993,null,18.117085308819924,-43.364355393092367,null,10.614457218968825,-83.968523370601858,null,0,0]
[7079.5,7.0795000000000003,8.7667198488361446,1.4564797535417622,1.0000004788286962,9.7859951490201851E-4,1,0,941.5470103247651,1.5697342447352254,1.5628251109155524,0.87647132050059062,1.0017211992029345,5.8629924975021085E-2,1.0009888268359215,4.4452507408339011E-2,1.0000900319839054,1.3418288238523096E-2,1.0000241324190917,1.1450107351498925E-2,13.036834889306842,-127.01763462114616,52.982365378853842,null,1000000000,50119320.25,null,18.075751859128005,-43.080286955006095,null,10.516305413399955,-84.050116124413705,null,0,0]
[7161.95,7.16195,8.8674988028326887,1.4577845510406133,1.000000490046808,9.8999657367560153E-4,1,0,952.51253951986109,1.5697464716568179,1.5735996143671589,0.88215895935442701,1.0017614884200234,5.931115577231403E-2,1.0010119815998009,4.4969521096691861E-2,1.0000921411778247,1.3574542598831464E-2,1.0000246978128275,1.1583458148567637E-2,12.896486468948821,-126.81192366654862,53.188076333451377,null,1000000000,51293527.802499995,null,18.034505854837274,-42.794141453522585,null,10.417020397165972,-84.131862948810664,null,0,0]
[7244.4,7.2443999999999997,8.9682925144052366,1.4590600217023089,1.0000005013948128,1.0013936321919973E-3,1,0,963.4780688541141,1.5697584202645165,1.584424329279303,0.88776906225463936,1.0018022424924564,5.9992331459735038E-2,1.0010354039249201,4.5486510728957756E-2,1.0000942747893153,1.3730796296245471E-2,1.0000252697538206,1.1716808924125485E-2,12.758263024855669,-126.60895582261821,53.391044177381787,null,1000000000,52481331.359999992,null,17.994275104312255,-42.512419331172737,null,10.318842998504419,-84.211929467992491,null,0,0]
[7328.75,7.3287500000000003,9.0714237020521917,1.4603355514357466,1.0000005131387415,1.0130533273243166E-3,1,0,974.69629093796584,1.5697703660061566,1.5955493865590196,0.89342949043324349,1.0018444167006968,6.0689146661532599E-2,1.0010596428617324,4.6015388829092785E-2,1.0000964828362429,1.3890650051998495E-2,1.0000258616501099,1.1853232648341951E-2,12.618995105848054,-126.40413466900603,53.595865330993973,null,1000000000,53710576.5625,null,17.954134828276182,-42.228709696720301,null,10.219524216136982,-84.292160390755157,null,0,0]
[7413.1,7.4131,9.1745693168637565,1.4615824027295015,1.0000005250186186,1.0247130221811896E-3,1,0,985.91451315774225,1.569782039898703,1.6067248570617527,0.89901135391202236,1.0018870773148303,6.1385902860469681E-2,1.0010841617933794,4.6544241170183534E-2,1.0000987164387463,1.4050503097807254E-2,1.0000264603989335,1.198965634951994E-2,12.481835112125868,-126.20215286919085,53.797847130809146,null,1000000000,54954051.610000007,null,17.914991272081654,-41.949482531571064,null,10.121314436843743,-84.370748158654877,null,0,0]
[7499.45,7.4994499999999995,9.2801750315037772,1.4628301056743211,1.0000005373209984,1.0366491766156298E-3,1,0,997.39872774161927,1.569793718570399,1.6182164360252891,0.90464552656260466,1.0019312532205364,6.2099117840564079E-2,1.0011095520971558,4.7085605996574416E-2,1.0001010294730854,1.4214145631963816E-2,1.0000270804427318,1.2129314731978626E-2,12.343548344391333,-125.99830376864749,54.001696231352511,null,1000000000,56241750.302499995,null,17.875919199641071,-41.668201564166665,null,10.021899534560896,-84.449554216184936,null,0,0]
[7585.8,7.5857999999999999,9.385794868054667,1.4640497292845585,1.0000005497658497,1.0485853307546835E-3,1,0,1008.8829424584359,1.5698051313631372,1.6297586581404293,0.91020006916755214,1.0019759387391403,6.2812269568331483E-2,1.0011352357870582,4.7626943204652175E-2,1.000103369288885,1.4377787404794883E-2,1.0000277076679254,1.22689730897305E-2,12.207354717784888,-125.79738948925457,54.20261051074543,null,1000000000,57544361.640000001,null,17.837826214278568,-41.391464204471248,null,9.9235963790352457,-84.526751444951387,null,0,0]
[7674.15,7.67415,9.4938751486615853,1.4652695125936444,1.0000005626464032,1.0607979444371323E-3,1,0,1020.6331495424871,1.5698165426673241,1.6416195180495519,0.91580224394152843,1.002022186627312,6.3541872782263212E-2,1.0011618179852604,4.8180789708597259E-2,1.0001057910173472,1.4545218577912543E-2,1.0000283568534749,1.2411866125904298E-2,12.070115114180044,-125.59483546334666,54.405164536653345,null,1000000000,58892578.222499996,null,17.799831703061002,-41.112940237955605,null,9.8241416941537878,-84.604127317244661,null,0,0]
[7762.5,7.7625000000000002,9.6019692369224909,1.466461834242847,1.0000005756761048,1.0730105578031493E-3,1,0,1032.3833567564175,1.5698276942129876,1.6535311590770092,0.92132387649670378,1.0020689678633852,6.4271408261974791E-2,1.0011887072694332,4.8734606632707518E-2,1.0001082407818367,1.4712648935478696E-2,1.0000290135569925,1.2554759135610454E-2,11.934951169519913,-125.3953040092031,54.604695990796898,null,1000000000,60256406.25,null,17.762797223977241,-40.839012236703113,null,9.7258002214987531,-84.679929750828066,null,0,0]
[7852.9,7.8529,9.7125852616790382,1.4676543495932728,1.0000005891625159,1.0855065421723049E-3,1,0,1044.406206146487,1.5698388447855882,1.6657706138003028,0.92689171624316091,1.0021173865489952,6.5017800366894002E-2,1.0012165383010949,4.9301242895444533E-2,1.0001107764077726,1.4883963354021555E-2,1.0000296932797961,1.2700967688286111E-2,11.798741724610789,-125.19424309097967,54.805756909020332,null,1000000000,61668038.409999996,null,17.725864821384882,-40.563402516133912,null,9.6263037540374565,-84.755917013330659,null,0,0]
[7943.3,7.9432999999999998,{"$f":"SQRT(1+(A141/pole1)^2)","v":9.8232147875531073},{"$f":"ATAN(A141/pole1)","v":1.4688200062378758},{"$f":"SQRT(1+(A141/Zero1)^2)","v":1.0000006028050765},{"$f":"ATAN(A141/Zero1)","v":1.098002526202458E-3},{"$f":"IF(VIN_nom>Vout, 1, SQRT(1+(A141/z_RHP)^2))","v":1},{"$f":"IF(VIN_nom>Vout, 0, -ATAN(A141/z_RHP))","v":0},{"$f":"SQRT(1+(A141/Pole2)^2)","v":1056.4290556634573},{"$f":"ATAN(A141/Pole2)","v":1.5698497415566581},{"$f":"SQRT(1+(A141/Zero2)^2)","v":1.6780609545763703},{"$f":"ATAN(A141/Zero2)","v":0.93237816481574787},{"$f":"SQRT(1+(A141/pole4)^2)","v":1.0021663634612512},{"$f":"ATAN(A141/pole4)","v":6.5764119933638496E-2},{"$f":"SQRT(1+(A141/Zero3)^2)","v":1.0012446907820813},{"$f":"ATAN(A141/Zero3)","v":4.986784747532514E-2},{"$f":"SQRT(1+(A141/pole5)^2)","v":1.0001133413854399},{"$f":"ATAN(A141/pole5)","v":1.5055276898856494E-2},{"$f":"SQRT((1-(Z141/pterm2))^2+(A141/pterm1)^2)","v":1.0000303808735582},{"$f":"IF((ATAN((A141/pterm1)/(1-A141^2/pterm2))>0),ATAN((A141/pterm1)/(1-A141^2/pterm2)),PI()+ATAN((A141/pterm1)/(1-A141^2/pterm2)))","v":1.2847176212605534E-2},{"$f":"20*LOG10(((E141*K141*G141*O141)/(C141*I141*S141*M141*Q141))*Adc)","v":11.664590255045919},{"$f":"((F141+L141+H141+R141)-(D141+J141+T141+N141+T141))*radconv","v":-124.99628800196733},{"$f":"IF(V141>0,V141,V141+180)","v":55.003711998032671},null,{"$f":"IF(U141<0,A141,1000000000)","v":1000000000},{"$f":"A141^2","v":63096014.890000001},null,{"$f":"20*LOG10((K141/(I141*M141))*AEA)","v":17.689873170567196},{"$f":"(L141-(J141+N141))*radconv","v":-40.292437468434606},null,{"$f":"20*LOG10((E141*G141/(C141*S141))*Acs*Am)","v":9.5279219831155242},{"$f":"(F141+H141-(D141+T141))*radconv","v":-84.830365383739405},null,{"$f":"SUM((U142<0)*(U141>0))*A141","v":0},0]
[8035.8,{"$f":"A142/1000","v":8.0358000000000001},9.9364277519085302,1.4699858718992886,1.0000006169261881,1.1107887926924925E-3,1,0,1068.7311971655649,1.5698606376818893,1.6906883163418325,0.93790932575829022,1.002217055854886,6.6527700628528127E-2,1.001273829956409,5.0447581157647241E-2,1.0001159963299466,1.523056915762813E-2,1.0000310925875642,1.2996781144190893E-2,11.529395185142196,-124.79691661555991,55.203083384440092,null,1000000000,64574081.640000001,null,17.653987216021306,-40.019899543431542,null,9.4283831443337949,-84.905003697771463,null,0,0]
[8128.3,8.1282999999999994,10.049653917970396,1.4711254682260253,1.0000006312107883,1.1235750588193245E-3,1,0,1081.0333387916708,1.5698712858116699,1.7033666347876404,0.94335831344293519,1.002268332537356,6.7291203638000993E-2,1.0013033056303497,5.1027280903193695E-2,1.0001186820052299,1.5405860480341543E-2,1.0000318125425294,1.3146386045395085E-2,11.396240176866314,-124.60072967804729,55.399270321952713,null,1000000000,66069260.890000001,null,17.619022508814428,-39.752051139161019,null,9.3299604750338574,-84.978136888074332,null,0,0]
[8222.9500000000007,8.2229500000000009,10.165525032730718,1.4722652727890462,1.000000645996642,1.1366585188595901E-3,1,0,1093.6214222119943,1.5698819334600167,1.7163912075665131,0.9488504587175236,1.0023214057804977,6.8072371602697024E-2,1.0013338147060729,5.1620419218503029E-2,1.0001214619145606,1.558522516173126E-2,1.0000325577621247,1.3299468217894548E-2,11.26204472493357,-124.40324207535254,55.596757924647463,null,1000000000,67616906.702500015,null,17.584167055283444,-39.482742086926578,null,9.2303799702104268,-85.051464214450135,null,0,0]
[8270.2750000000015,8.2702750000000016,10.223465458383529,1.4728254859358523,1.0000006534537602,1.1432002487340755E-3,1,0,1099.9154639678529,1.5698871658906988,1.7229226883875144,0.95156535171260281,1.0023481717488008,6.8462924444389409E-2,1.0013492013437522,5.1916974770202302E-2,1.0001228639350244,1.5674907127066286E-2,1.000032933607637,1.3376009291960903E-2,11.195708669743411,-124.30572258881577,55.694277411184231,null,1000000000,68397448.575625017,null,17.567079305291095,-39.349867002027572,null,9.1810103737311994,-85.087572730421996,null,0,0]
[8317.6,8.3176000000000005,10.281409056392633,1.4733793847963692,1.0000006609536727,1.1497419785107159E-3,1,0,1106.2095057534825,1.569892338779066,1.7294667722857671,0.9542597188173545,1.0023750905986173,6.8853456369002378E-2,1.0013646760425716,5.2213521182273258E-2,1.0001242739993086,1.576458884023936E-2,1.0000333116102986,1.3452550357842484E-2,11.129871169769391,-124.20901277074326,55.790987229256743,null,1000000000,69182469.760000005,null,17.550213127146151,-39.218163354032704,null,9.1319170686665512,-85.123319463975108,null,0,0]
[8366.0499999999993,8.3660499999999995,10.340733308181163,1.4739400200809298,1.0000006686762037,1.1564392168171849E-3,1,0,1112.6531682140919,1.5698975740090386,1.7361793280066029,0.95699707399923051,1.002402807720951,6.9253250145368581E-2,1.0013806098245095,5.2517107511492842E-2,1.0001257259162277,1.5856402185607441E-2,1.0000337008334432,1.3530910933402552E-2,11.0629780093159,-124.11083757981407,55.889162420185926,null,1000000000,69990792.602499992,null,17.53317166635243,-39.084530907573836,null,9.0819397692613677,-85.159547506438386,null,0,0]
[8414.5,8.4145000000000003,10.400060773104961,1.4744942592157695,1.0000006764435878,1.1631364550199143E-3,1,0,1119.0968307048456,1.5699027489510111,{"$f":"SQRT(1+(A148/Zero2)^2)","v":1.7429047928516956},{"$f":"ATAN(A148/Zero2)","v":0.95971332376777663},1.0024306850535263,6.9653021749310706E-2,1.0013966358954083,5.2820684151669794E-2,1.0001271862638728,1.5948215263624776E-2,1.0000340923175248,1.3609271500284643E-2,10.996593182294177,-124.01350045730564,55.986499542694361,null,1000000000,70803810.25,null,17.516354636979781,-38.952102987590749,null,9.0322456467729992,-85.195409076025854,null,0,0]
[8462.9500000000007,8.4629500000000011,10.459391396487666,1.4750422107034284,1.0000006842558249,1.1698336931183033E-3,1,0,1125.5404932252254,1.5699078646404205,1.7496430179566365,0.96240867165334443,1.0024587225829773,7.005277105490304E-2,1.0014127542508371,5.3124251047316141E-2,1.0001286550422064,1.6040028072744631E-2,1.0000344860625487,1.3687632058438435E-2,10.930709699870443,-123.91699601071954,56.083003989280456,null,1000000000,71621522.702500015,null,17.499758211394994,-38.820867984764426,null,8.9828315400770151,-85.230910389472271,null,0,0]
[8511.4,8.5114000000000001,10.51872512488363,1.4755839806135942,1.0000006921129152,1.1765309311117511E-3,1,0,1131.9841557747254,1.5699129220891277,1.7563938564611423,0.96508331928083635,1.0024869202958626,7.0452497936262362E-2,1.0014289648863397,5.3427808142954621E-2,1.0001301322511915,1.6131840611420305E-2,1.0000348820685203,1.3765992607813608E-2,10.865320702376366,-123.82131881599088,56.178681184009122,null,1000000000,72443929.959999993,null,17.483378639017133,-38.690814397601692,null,8.9336943401626172,-85.2660575241202,null,0,0]
[8560.9500000000007,8.5609500000000001,10.579409112585095,1.4761317651415702,1.0000007001947833,1.1833802218710113E-3,1,0,1138.5741140979883,1.5699180351525837,1.7633108600079446,0.96779748919671515,1.0025159238702959,7.0861276819304292E-2,1.0014456390070186,5.3738246949673447E-2,1.0001316517183589,1.6225737363962212E-2,1.0000352894038733,1.3846132231736863E-2,10.798951560947547,-123.7243193394245,56.275680660575503,null,1000000000,73289864.902500018,null,17.46684765224013,-38.55901817809864,null,8.8837247600006783,-85.301642492465874,null,0,0]
[8610.5,8.6105,10.640096238616055,1.4766733011147122,1.0000007083235642,1.1902295125192398E-3,1,0,1145.1640724506744,1.5699230893687952,1.7702407518013308,0.9704904287133217,1.0025450949556063,7.1270031982142601E-2,1.0014624096360503,5.4048675389005103E-2,1.0001331800032602,1.6319633830368194E-2,1.0000356991040145,1.3926271846371911E-2,10.733085501560101,-123.62817354388486,56.371826456115144,null,1000000000,74140710.25,null,17.45053578161302,-38.428433640106363,null,8.8340383876609216,-85.336869444465265,null,0,0]
[8660.0499999999993,8.66005,10.700786449581498,1.4772086945299281,1.0000007164992581,1.1970788030557942E-3,1,0,1151.7540308322789,1.5699280857478757,1.7771833810732633,0.97316234735508755,1.0025744335371727,7.167876329026357E-2,1.0014792767685867,5.4359093401642571E-2,1.000134717105855,1.6413530008983896E-2,1.0000361111689497,1.4006411451664934E-2,10.667715587120723,-123.53287554793857,56.467124452061427,null,1000000000,74996466.002499983,null,17.434439253862632,-38.299048828927354,null,8.7846320594065332,-85.371744453290816,null,0,0]
[8709.6,8.7096,10.761479693288235,1.4777380490071628,1.0000007247218647,1.2039280934800325E-3,1,0,1158.3439892423087,1.5699330252769519,1.7841385991274676,0.9758134525887987,1.0026039396002906,7.2087470609200996E-2,1.0014962403997518,5.4669500928290829E-2,1.0001362630261028,1.650742589815498E-2,1.0000365255986845,1.408655104756211E-2,10.602835009475086,-123.4384194505424,56.561580549457602,null,1000000000,75857132.160000011,null,17.418554372436329,-38.170851906444248,null,8.7355026637196147,-85.406273455924975,null,0,{"$f":"IF(AH154>0,W154,0)","v":0}]
[8760.3250000000007,8.7603249999999999,10.823615269625966,1.4782738066047649,1.0000007331880523,1.2109398038931789E-3,1,0,1165.0902181380254,1.5699380240581533,1.7912716362002861,0.97850607945209345,1.0026343188236433,7.2505844787206591E-2,1.0015137062497508,5.4987258355414861E-2,1.0001378547391424,1.6603548078507398E-2,1.0000369523055528,1.4168591017629602E-2,10.536915795895132,-123.34258937967664,56.657410620323361,null,1000000000,76743294.105625018,null,17.402508259591094,-38.040833234947875,null,8.685491908059582,-85.44126890777207,null,0,0]
[8811.0499999999993,8.8110499999999998,10.885753917265909,1.4788034478721201,1.0000007417034038,1.2179515141872558E-3,1,0,1171.8364470625195,1.5699429652836741,1.7984175573451981,0.98117732752149489,1.0026648735343993,7.292419353978162E-2,1.0015312732188377,5.5305004667620027E-2,1.0001394556929,1.6699669952016508E-2,1.0000373814907175,1.4250630977736186E-2,10.471495364491854,-123.24762904554254,56.752370954457461,null,1000000000,77634602.102499992,null,17.386676348691253,-37.912034723646592,null,8.6357649385367719,-85.475913919145569,null,0,0]
[8861.7749999999996,8.8617749999999997,10.947895583911285,1.4793270766607567,1.0000007502679196,1.2249632243615739E-3,1,0,1178.5826760152977,1.5699478499418629,1.8055762095885013,0.98382741273238472,1.002695603716516,7.3342516722822035E-2,1.0015489413016923,5.5622739801331846E-2,1.0001410658873309,1.679579151690758E-2,1.0000378131541849,1.433267092782412E-2,10.406566812240097,-123.15353207467504,56.846467925324959,null,1000000000,78531056.15062499,null,17.371054912214436,-37.784444048726058,null,8.5863185797398121,-85.510214440296537,null,0,0]
[8912.5,8.9124999999999996,11.01004021844347,1.4798447944908599,1.0000007588815993,1.2319749344154437E-3,1,0,1185.3289049958769,1.5699526789985687,{"$f":"SQRT(1+(A158/Zero2)^2)","v":1.8127474421025072},{"$f":"ATAN(A158/Zero2)","v":0.98645654880130584},1.0027265093538609,7.3760814192277091E-2,1.0015667104929629,5.5940463692989287E-2,1.0001426853223907,1.6891912771405896E-2,1.0000382472959615,1.4414710867835648E-2,10.342123365252025,-123.06029208587721,56.939707914122792,null,1000000000,79432656.25,null,17.355640299254937,-37.658049012215891,null,8.537149708778534,-85.54417628789983,null,0,0]
[8964.4,8.9643999999999995,11.073627398453239,1.4803684903802927,1.0000007677456932,1.2391490644388181E-3,1,0,1192.23140446412,1.569957563352238,1.8200976555746771,0.98912512442175382,1.0027583124748838,7.4188774390495163E-2,1.0015849959349776,5.626553567711217E-2,1.0001443518343764,1.699026026709061E-2,1.0000386940593424,1.4498651180393963E-2,10.276682300632167,-122.96577260310802,57.034227396891978,null,1000000000,80360467.359999999,null,17.340078956232791,-37.529951057714719,null,8.4871258848031488,-85.57858023042057,null,0,0]
[9016.2999999999993,9.0162999999999993,11.137217580807251,1.480886206116478,1.0000007766612551,1.2463231943346394E-3,1,0,1199.1339039604791,1.5699623914749083,1.827460726182826,0.99177221470863974,1.0027902992393543,7.4616707365141449E-2,1.0016033872124057,5.6590595757746574E-2,1.0001460280199561,1.7088607434077391E-2,1.0000391434171914,1.4582591482281328E-2,10.211735130045092,-122.87213673775526,57.127863262244745,null,1000000000,81293665.689999983,null,17.324726634805117,-37.40307934055479,null,8.4373861023452861,-85.612641534794903,null,0,0]
[9068.2000000000007,9.0682000000000009,11.20081071437003,1.4813980432773091,1.0000007856282851,1.2534973241021688E-3,1,0,1206.0364034844711,1.569967164332059,1.8348364991425969,0.99439804144441424,1.002822469629699,7.5044612962096649E-2,1.0016218843194171,5.6915643866855777E-2,1.0001477138790809,1.7186954270465432E-2,1.0000395953695149,1.4666531773435885E-2,10.147274998646441,-122.77937764919456,57.220622350805442,null,1000000000,82232251.24000001,null,17.309579661832014,-37.277421200025231,null,8.3879271798006592,-85.646366021003928,null,0,0]
[9120.1,9.1201000000000008,11.264406749158479,1.4819041011592258,1.0000007946467835,1.2606714537406675E-3,1,0,1212.9389030356238,1.5699718828671918,1.8422248218835917,0.99700282403574247,1.0028548236282466,7.5472491027301303E-2,1.001640487250149,5.7240679936418154E-2,1.0001494094117021,1.7285300774353966E-2,1.0000400499163198,1.4750472053795765E-2,10.083295180563281,-122.68748850095038,57.31251149904962,null,1000000000,83176224.010000005,null,17.294634440444309,-37.1529641102818,null,8.3387459882662327,-85.679759378311047,null,0,0]
[9173.2000000000007,9.1732000000000014,11.329476164164872,1.4824159797729075,1.0000008039270687,1.2680114590746482E-3,1,0,1220.0009979797505,1.5699766552424692,1.8497968044515423,0.99964627953896745,1.0028881157027871,7.5910233572383898E-2,1.0016596298224913,5.7573218759578854E-2,1.0001511541589172,1.7385920839744395E-2,1.0000405176580416,1.483635313865005E-2,10.018326277870289,-122.59436796966958,57.405632030330423,null,1000000000,84147598.24000001,null,17.279548794304528,-37.026859503780472,null,8.2887118877506119,-85.713587934911573,null,0,0]
[9226.2999999999993,9.2262999999999984,11.394548513812722,1.4829220120126225,1.0000008132612299,1.2753514642719988E-3,1,0,1227.0630929513434,1.5699813726850094,1.8573816076908751,1.0022681636101967,1.0029215999365002,7.6347946971785513E-2,1.0016788831561871,5.7905744836009937E-2,1.0001529090320249,1.7486540553056623E-2,1.0000409881156227,1.4922234212073698E-2,9.9538463132221224,-122.50214361937948,57.497856380620519,null,1000000000,85124611.689999983,null,17.264666956553885,-36.90198603195347,null,8.2389620475270231,-85.747081518310878,null,0,0]
[9279.4,9.279399999999999,11.459623748109815,1.4834222972155788,1.0000008226492667,1.2826914693319284E-3,1,0,1234.1251879499314,1.5699860361378446,1.8649790751779602,1.0048687036114496,1.0029552763101395,7.6785631060708084E-2,1.0016982472448497,5.8238258092911346E-2,1.0001546740309717,1.7587159912255113E-2,1.0000414612890702,1.5008115274000457E-2,9.8898484834039451,-122.41080815949744,57.589191840502565,null,1000000000,86107264.359999999,null,17.249985311190002,-36.778330712506133,null,8.1894932804927159,-85.780245820107993,null,0,0]
[9332.5,9.3324999999999996,11.524701818190874,1.4839169324868784,1.0000008320911793,1.2900314742536464E-3,1,0,1241.1872829750534,1.5699906465225448,1.8725890527686624,1.0074481243728719,1.0029891448043515,7.722328567442048E-2,1.0017177220820561,5.8570758457499955E-2,1.0001564491557042,1.768777891530434E-2,1.000041937178392,1.5093996324364062E-2,9.8263261139017661,-122.32035431539018,57.679645684609824,null,1000000000,87095556.25,null,17.235500318047819,-36.655880706983694,null,8.1403024524091077,-85.813086404011656,null,0,0]
[9386.85,9.3868500000000008,11.59131474475846,1.4844174597864357,1.0000008418111521,1.2975442663412417E-3,1,0,1248.4156232019752,1.5699953114212082,1.8803909697419232,1.0100666271551078,1.003024009516911,7.7671212196004008E-2,1.0017377700495662,5.8911072616408329E-2,1.0001582765538259,1.7790766168004384E-2,1.0000424270829151,1.5181899044660396E-2,9.7617939433193062,-122.22867656079879,57.771323439201211,null,1000000000,88112952.922499999,null,17.220874374491604,-36.531783127000494,null,8.0902382613718125,-85.846370509447127,null,0,0]
[9441.2000000000007,9.4412000000000003,11.657930542083601,1.4849122669782411,1.0000008515875669,1.3050570582823645E-3,1,0,1255.643963455751,1.5699999226112156,1.8882056731256103,1.0126634732625757,1.0030590754603574,7.8119107489319578E-2,1.0017579340274094,5.9251373114636387E-2,1.0001601145599619,1.7893753043274938E-2,1.0000429198326994,1.5269801752702296E-2,9.6977461324028056,-122.13790705794038,57.862092942059618,null,1000000000,89136257.440000013,null,17.206447181348718,-36.408921516553931,null,8.0404587692776506,-85.879326876155929,null,0,0]
[9495.5499999999993,9.4955499999999997,11.724549161233629,1.4854014513224767,1.0000008614204241,1.3125698500761672E-3,1,0,1262.8723037359198,1.5700044810148086,1.8960330048180454,1.0152388956669862,1.0030943426135872,7.8566971377946923E-2,1.0017782140085805,5.9591659874194791E-2,1.0001619631740535,1.7996739538933479E-2,1.0000434154277531,1.5357704448418701E-2,9.6341759237572493,-122.04803807396645,57.951961926033547,null,1000000000,90165469.80249998,null,17.192215177559703,-36.287282570080642,null,7.9909607799113926,-85.911961076732027,null,0,0]
[9549.9,9.5498999999999992,11.791170554379693,1.4858851078921076,1.000000871309723,1.3200826417218018E-3,1,0,1270.1006440420315,1.5700089875332341,1.9038728090641428,1.0177931246487959,1.0031298109553783,7.9014803685540952E-2,1.0017986099860343,5.9931932817113273E-2,1.0001638223960418,1.8099725652797518E-2,1.0000439138680846,1.5445607131738563E-2,9.5710766885441014,-121.95906190370923,58.040938096290773,null,1000000000,91200590.00999999,null,17.178174877517115,-36.166853135016162,null,7.9417411501629465,-85.944278558451032,null,0,0]
[9605.5249999999996,9.6055250000000001,11.859357646480046,1.4863744837636084,1.0000008814894596,1.3277716762554132E-3,1,0,1277.4985544553244,1.5700135469642373,1.9119092825219455,1.0203855659357643,1.003166319652379,7.9473108833879189E-2,1.0018196045365333,6.0280173855996703E-2,1.0001657362176644,1.8205127326642638E-2,1.0000444269475488,1.5535571916614199E-2,9.506978094589936,-121.86891490280651,58.131085097193491,null,1000000000,92266110.52562499,null,17.164000147313132,-36.044837377380347,null,7.8916518798752531,-85.977031783771849,null,0,0]
[9661.15,9.6611499999999992,11.927547546289301,1.4868582642170867,1.0000008917283174,1.3354607106320253E-3,1,0,1284.8964648948686,1.5700180538925479,1.9199584978280038,1.0229562873282776,1.0032030390426918,7.9931380528559026E-2,1.0018407205744198,6.0628400257188395E-2,1.0001676611505983,1.8310528595944422E-2,1.0000449430073688,1.5625536688354234E-2,9.4433591801808863,-121.77968686309747,58.220313136902533,null,1000000000,93337819.32249999,null,17.150019067170611,-35.924061153093568,null,7.8418476860621533,-86.009464414511399,null,0,0]
[9716.7749999999996,9.7167750000000002,11.995740205926117,1.4873365444496214,1.0000009020262965,1.3431497448507296E-3,1,0,1292.2943753602133,1.5700225092198412,1.9280202953960164,1.0255055270923841,1.0032399691031821,8.0389618580778421E-2,1.0018619580920118,6.0976611937163576E-2,1.0001695971947797,1.8415929458363327E-2,1.0000454620475543,1.5715501446882475E-2,9.3802132379029288,-121.69136962830407,58.308630371695926,null,1000000000,94415716.40062499,null,17.136228134042149,-35.804510851361457,null,7.7923253644889563,-86.041581905056177,null,0,0]
[9772.4,9.7723999999999993,12.063935578589852,1.4878094175159566,1.0000009123833971,1.3508387789106159E-3,1,0,1299.6922858509179,1.5700269138272638,1.9360945180503231,1.0280335206456279,1.0032771098105859,8.0847822801819486E-2,1.0018833170815844,6.1324808812418814E-2,1.0001715443501438,1.8521329911559848E-2,1.0000459840681135,1.5805466192122756E-2,9.3175336886275986,-121.60395508143736,58.396044918562637,null,1000000000,95499801.75999999,null,17.122623919846088,-35.686173023425539,null,7.7430817642415146,-86.073389587046037,null,0,0]
[9829.2999999999993,9.8292999999999999,12.133696840472082,1.4882876298055043,1.0000009230390656,1.3587040558331244E-3,1,0,1307.2597664505699,1.5700313678149058,1.9443665069465026,1.0305977194161449,1.0033153197534077,8.1316494481501453E-2,1.0019052913202398,6.1680971424874581E-2,1.0001735476329934,1.8629145859417839E-2,1.0000465211377256,1.5897493036796967E-2,9.2538932628969341,-121.51546241742692,58.484537582573083,null,1000000000,96615138.48999998,null,17.108897569190606,-35.566363359822354,null,7.6929945815207006,-86.105611235614603,null,0,0]
[9886.2000000000007,9.8862000000000005,12.203460845448021,1.4887603745720961,1.0000009337565969,1.3665693325875272E-3,1,0,1314.827247075857,1.5700357705327477,1.9526511719108861,1.0331401761346497,1.0033537500607796,8.178513036212709E-2,1.0019273926468069,6.2037118369459389E-2,1.0001755625420921,1.8736961374126702E-2,1.0000470613259251,1.5989519867405808E-2,9.1907273278289896,-121.42789724978357,58.57210275021643,null,1000000000,97736950.440000013,null,17.095359571246,-35.447794435360834,null,7.6431925401135237,-86.137519617396791,null,0,0]
[9943.1,9.9431000000000012,12.273227546740427,1.4892277448423914,1.000000944535991,1.3744346091728505E-3,1,0,1322.3947277263387,1.5700401228609724,1.9609483522809439,1.035661133707745,1.0033924007073816,8.2253730241978379E-2,1.001949621052876,6.2393249556865212E-2,1.0001775890773701,1.8844776453182523E-2,1.0000476046327222,1.6081546683867722E-2,9.1280292387119815,-121.34125103002638,58.658748969973615,null,1000000000,98865237.610000014,null,17.082006488372233,-35.33045237139099,null,7.5936724330926539,-86.169120062422962,null,0,0]
[10000,10,12.34299689862789,1.4896898315492137,1.0000009553772475,1.3822998855881217E-3,1,0,1329.9622084015853,1.5700444256597299,1.9692578898611834,1.0381608320444728,1.0034312716677525,8.2722293919431561E-2,1.0019719765299895,6.2749364897807955E-2,1.0001796272387562,1.8952591094081456E-2,1.0000481510581267,1.6173573486101163E-2,9.0657924784997093,-121.25551526031174,58.744484739688261,null,1000000000,100000000,null,17.068834957179188,-35.214323459868027,null,7.5444311069472256,-86.200417780755501,null,0,0]
[10058.25,10.058249999999999,12.414424285646302,1.4901575013650625,1.0000009665398035,1.3903517720750935E-3,1,0,1337.7092338983832,1.5700487801174894,1.9777772160041271,1.0406980633659888,1.0034712930638459,8.3201936949894237E-2,1.0019949940296886,6.3113912864426927E-2,1.0001817258002881,1.9062963270851371E-2,1.0000487136784126,1.6267783686217369E-2,9.0025503027622698,-121.1686796285552,58.831320371444804,null,1000000000,101168393.0625,null,17.055535548837003,-35.096681826732386,null,7.4943070324391226,-86.232149795186473,null,0,0]
[10116.5,10.1165,12.485854356820136,1.4906198203155203,1.0000009777671925,1.3984036583817839E-3,1,0,1345.4562594202534,1.5700530844300358,1.9863091649090263,1.0432135140294223,1.0035115452975278,8.3681541612397742E-2,1.0020181446836049,6.3478444034436615E-2,1.0001838365459998,1.9173334983116273E-2,1.0000492795670657,1.6361993871248953E-2,8.9397781814626995,-121.08278030804398,58.917219691956021,null,1000000000,102343572.25,null,17.04241950640737,-34.980283061950125,null,7.4444686025791036,-86.263575226759485,null,0,0]
[10174.75,10.17475,12.557287066344257,1.4910768795171878,1.0000009890594146,1.4064555445071493E-3,1,0,1353.203284966766,1.5700573394586061,1.9948535746139846,1.0457074318708082,1.0035520283410222,8.4161107690934267E-2,1.0020414284825092,6.3842958312124581E-2,1.0001859594758142,1.9283706228190037E-2,1.0000498487240967,1.6456204041108421E-2,8.8774695189151078,-120.99780835652868,59.002191643471321,null,1000000000,103525537.5625,null,17.029483451295807,-34.865113002531309,null,7.3949126004342238,-86.294699296066284,null,0,0]
[10233,10.233000000000001,12.628722369448219,1.4915287680339393,1.0000010004164694,1.4145074304501453E-3,1,0,1360.9503105374997,1.5700615460448273,2.0034102856855944,1.048180061572761,1.0035927421663975,8.4640634969601738E-2,1.0020648454171206,6.4207455601805283E-2,1.000188094589654,1.9394077003386599E-2,1.0000504211495163,1.6550414195708258E-2,8.8156178468015547,-120.9137548937077,59.086245106292296,null,1000000000,104714289,null,17.016724078603705,-34.751157665046179,null,7.3456358627444835,-86.325527106085985,null,0,0]
[10292.5,10.2925,12.70169325113077,1.4919851059386524,1.0000010120841727,1.4227321034557701E-3,1,0,1368.8635813167334,1.5700657937435427,2.0121631541499032,1.0506840248789033,1.0036345679134275,8.5130412251108914E-2,1.0020889023031987,6.4579757083527548E-2,1.0001902881003266,1.9506815762250808E-2,1.0000510092331014,1.6646646011600107E-2,8.7529040954206643,-120.82883680611513,59.171163193884865,null,1000000000,105935556.25,null,17.003869948585361,-34.635996681757796,null,7.2955867679868192,-86.356715779947919,null,0,0]
[10352,10.352,12.774666747650079,1.4924362304035466,1.0000010238195214,1.4309567762689126E-3,1,0,1376.7768521203818,1.5700699926134447,2.0209285292117349,1.0531662827517112,1.0036766343940102,8.5620148594619694E-2,1.0021130980805295,6.4952040638591668E-2,1.0001924943233895,1.9619554025189955E-2,1.0000516007268776,1.6742877811385812E-2,8.6906539090421973,-120.74485852346839,59.255141476531605,null,1000000000,107163904,null,16.991193422000528,-34.522074184934056,null,7.2458225463090242,-86.387605744799345,null,0,0]
[10411.5,10.4115,12.847642814450007,1.4928822300822058,1.0000010356225151,1.4391814488884601E-3,1,0,1384.6901229480259,1.5700741434916781,2.0297062488402338,1.055627086006041,1.0037189415778778,8.6109843770377711E-2,1.0021374327390526,6.532430616510658E-2,1.0001947132587587,1.9732291789341546E-2,1.0000521956308568,1.6839109594972104E-2,8.6288607861567748,-120.66181078956502,59.338189210434976,null,1000000000,108399332.25,null,16.978691202916018,-34.409375838743017,null,7.1963399923076015,-86.418202080111186,null,0,0]
[10471,10.471,12.920621407979484,1.4933231916335341,1.0000010474931544,1.4474061213132997E-3,1,0,1392.6033937992565,1.5700782471963604,2.0384961535691075,1.0580666821792337,1.0037614894345945,8.6599497548744256E-2,1.0021619062686511,6.5696553561211055E-2,1.0001969449063497,1.9845029051843162E-2,1.0000527939450508,1.693534136226571E-2,8.5675183511347477,-120.57968442062032,59.420315579379675,null,1000000000,109641841,null,16.966360067829072,-34.297887494057115,null,7.1471359540293058,-86.448509751067675,null,0,0]
[10532,10.532,12.99544237650284,1.4937701282939753,1.0000010597332782,1.4558381382178214E-3,1,0,1400.7161588976955,1.5700824062203427,2.0475201380036414,1.0605460207331991,1.0038053597447181,8.710145232374239E-2,1.0021871409339689,6.6078166417074563E-2,1.0001992460108506,1.9960607906430353E-2,1.0000534108830641,1.7033999123487874E-2,8.5050907971246499,-120.49643460150507,59.503565398494928,null,1000000000,110923024,null,16.953892371533584,-34.184830043436548,null,7.0969773695677487,-86.479286889808606,null,0,0]
[10593,10.593,13.070265911176206,1.4942119478726874,1.0000010720445012,1.4642701549153259E-3,1,0,1408.8289240200841,1.5700865173447058,2.0565565982890339,1.0630035859756592,1.0038494829500877,8.7603363099346493E-2,1.002212521538806,6.6459760000140811E-2,1.0002015604764232,2.0076186227662746E-2,1.0000540314054287,1.7132656867386971E-2,8.4431237628772742,-120.41413387721981,59.585866122780189,null,1000000000,112211649,null,16.941597858123963,-34.073014846247091,null,7.0471049786572131,-86.509770840382075,null,0,0]
[10654,10.654,13.145091968179026,1.4946487375798749,1.0000010844268228,1.4727021714046145E-3,1,0,1416.9416891660112,1.5700905813922037,2.0656053706899549,1.065439634171258,1.0038938590173578,8.8105229628497733E-2,1.0022380480720756,6.6841334200747768E-2,1.0002038883029747,2.0191764012456176E-2,1.0000546555121572,1.7231314593862488E-2,8.3816107708544436,-120.33277259480877,59.667227405191227,null,1000000000,113507716,null,16.929473279308922,-33.96242725259107,null,6.9975155522411034,-86.539966599558937,null,0,0]
[10715,10.715,13.219920504681397,1.495080582658981,1.0000010968802435,1.4811341876844876E-3,1,0,1425.0544543350748,1.5700945991668553,2.0746662941064802,1.0678544181384495,1.0039384879129969,8.8607051664270048E-2,1.0022637205226275,6.7222888909267073E-2,1.0002062294904117,2.0307341257726576E-2,1.000055283203263,1.7329972302813898E-2,8.3205454696872962,-120.25234118501555,59.747658814984447,null,1000000000,114811225,null,16.917515458960576,-33.853052808957152,null,6.9482059152698019,-86.569879051423115,null,0,0]
[10777.5,10.7775,13.296591615095618,1.49551800549957,1.000001109713639,1.4897735484085239E-3,1,0,1433.3667137531932,1.5700986685672245,2.083962464259558,1.0703067878355774,1.0039844764356838,8.9121167180120184E-2,1.0022901755948155,6.7613805779066075E-2,1.0002086421056782,2.0425760003593786E-2,1.000055930047081,1.7431056002720935E-2,8.2584363901272777,-120.17088648831024,59.829113511689755,null,1000000000,116154506.25,null,16.905433306389938,-33.742232184086021,null,6.8979706758286996,-86.600238204561236,null,0,0]
[10840,10.84,13.373265240490575,1.4959504126246306,1.000001122621673,1.498412908910171E-3,1,0,1441.6789731947742,1.5701026910418743,2.0932710562439762,1.0727373610983626,1.0040307303019396,8.96352354631057E-2,1.002316783824879,6.8004701953470748E-2,1.0002110687468022,2.0544178176523251E-2,1.0000565806537522,1.7532139684017789E-2,8.1967841836560016,-120.09038789178889,59.909612108211107,null,1000000000,117505600,null,16.893519688196704,-33.632655008023121,null,6.8480225756634105,-86.630309977314482,null,0,0]
[10902.5,10.9025,13.449941337855067,1.4963778896525894,1.0000011356043457,1.5070522691881395E-3,1,0,1449.9912326594149,1.5701066673978272,2.1025919050779973,1.0751463988893188,1.0040772494750942,9.0149256248071213E-2,1.0023435452006209,6.8395577314676298E-2,1.0002135094136813,2.0662595773198025E-2,1.0000572350232912,1.7633223346596328E-2,8.1355824112082402,-120.01083538019975,59.989164619800249,null,1000000000,118864506.25,null,16.881771411904886,-33.524306359764473,null,6.7983583683939894,-86.660099275251213,null,0,0]
[10965,10.965,13.526619865151773,1.4968005202677894,1.0000011486616569,1.5156916292411392E-3,1,0,1458.3034921467204,1.5701105984237065,2.1119248484770998,1.0775341585669702,1.0041240339182744,9.0663229270010748E-2,1.0023704597097753,6.8786431744915888E-2,1.0002159641062132,2.078101279030127E-2,1.0000578931557118,1.7734306990348427E-2,8.0748247597792151,-119.93221903292407,60.067780967075933,null,1000000000,120231225,null,16.87018535667714,-33.417171523753865,null,6.7489748620634868,-86.689610893124978,null,0,0]
[11028.75,11.02875,13.604834423701393,1.4972266955481344,1.0000011620570073,1.5245037762620988E-3,1,0,1466.781996846722,1.570114562170285,2.1214567450239721,1.0799480159184591,1.0041720272930461,9.1187432272246988E-2,1.0023980702543613,6.9185081578586757E-2,1.000218482341716,2.0901797547232297E-2,1.0000585683273173,1.7837412287468431E-2,8.0133030699689218,-119.8529846058358,60.1470153941642,null,1000000000,121633326.5625,null,16.858531536690464,-33.309129410629701,null,6.6988896089015331,-86.719431537593294,null,0,0]
[11092.5,11.092499999999999,13.683051424984747,1.4976479985769791,1.0000011755300116,1.533315923046291E-3,1,0,1475.260501569504,1.5701184803565791,2.1310008920549279,1.0823402651437215,1.0042202965766125,9.171158502537026E-2,1.0024258400929524,6.9583709388302509E-2,1.0002210151692899,2.1022581694206701E-2,1.0000592474138554,1.7940517564774137E-2,7.9522305637565367,-119.77470361695376,60.225296383046242,null,1000000000,123043556.25,null,16.847040152469511,-33.202319862468798,null,6.6490898565618366,-86.748973021491892,null,0,0]
[11156.25,11.15625,13.761270827349435,1.4980645122854668,1.0000011890806697,1.5421280695923467E-3,1,0,1483.739006314675,1.5701223537636217,2.1405571257055018,1.0847111680772452,1.0042688417291898,9.2235687248639592E-2,1.0024537692123103,6.9982315049211513E-2,1.0002235625888245,2.1143365227704942E-2,1.0000599304153417,1.8043622822150805E-2,7.8916009276331787,-119.6973658447245,60.302634155275499,null,1000000000,124461914.0625,null,16.835708110722344,-33.096727905924688,null,6.5995723850545751,-86.77824009641877,null,0,0]
[11220,11.22,13.839492590083459,1.4984763177365445,1.000001202708982,1.5509402158988979E-3,1,0,1492.2175110818546,1.5701261831546951,2.1501252848187264,1.0870609828616016,1.0043176627107744,9.2759738661479157E-2,1.0024818575991221,7.0380898436504233E-2,1.000226124600208,2.1264148144207577E-2,1.0000606173317921,1.8146728059483652E-2,7.8314079717411733,-119.62096117107863,60.379038828921367,null,1000000000,125888400,null,16.824532387945307,-32.992338778174521,null,6.5503340282541238,-86.807237406932188,null,0,0]
[11285.5,11.285500000000001,13.919864033518337,1.4988946070325861,1.0000012167922858,1.5599942640100275E-3,1,0,1500.9287591396831,1.5701300726053535,2.1599683537061827,1.0894536054126935,1.0043681111244867,9.3298122582875911E-2,1.0025108829111522,7.0790399998248127E-2,1.0002287721393857,2.1388246023849943E-2,1.0000613271824323,1.8252663615667526E-2,7.7700111075140645,-119.54342046072949,60.456579539270507,null,1000000000,127362510.25,null,16.81320958912022,-32.886321579469083,null,6.5000314709932621,-86.836754519770025,null,0,0]
[11351,11.351000000000001,14.000237884491925,1.4993080936930976,1.0000012309575652,1.5690483118653933E-3,1,0,1509.6400072199551,1.5701339171685298,2.1698236754153326,1.0918245068890222,1.0044188506322806,9.3836452265988302E-2,1.0025400763260144,7.1199877779734758E-2,1.0002314350822885,2.1512343244625223E-2,1.0000620411659598,1.8358599150446398E-2,7.7090623672867249,-119.46684346136958,60.533156538630422,null,1000000000,128845201,null,16.802045556676404,-32.781543227187406,null,6.4500169559117806,-86.865996460649384,null,0,0]
[11416.5,11.416499999999999,14.080614101776659,1.4997168598199631,1.0000012452048206,1.5781023594635111E-3,1,0,1518.3512553222852,1.5701377176168234,2.1796910837453383,1.0941739554463814,1.0044698811900443,9.4374727407044751E-2,1.002569437829024,7.160933164573155E-2,1.0002341134287933,2.1636439802716474E-2,1.0000627592823912,1.8464534663695777E-2,7.6485554255331945,-119.39121953996138,60.608780460038616,null,1000000000,130336472.25,null,16.791037229534187,-32.677988383996123,null,6.4002872188152837,-86.894967933654655,null,0,0]
[11482,11.481999999999999,14.16099264507978,1.5001209856574007,1.0000012595340519,1.5871564068028962E-3,1,0,1527.0625034462946,1.5701414747052047,2.1895704152893258,1.0965022153571469,1.0045212027534203,9.4912947702461711E-2,1.0025989674054132,7.2018761461053779E-2,1.0002368071787768,2.176053569430687E-2,1.000063481531744,1.8570470155291171E-2,7.5884840815242303,-119.31653817853521,60.683461821464789,null,1000000000,131836324,null,16.780181616534623,-32.575641934065992,null,6.3508390503867806,-86.92367353643381,null,0,0]
[11548.75,11.54875,14.242907482303233,1.5005281310558554,1.0000012742210791,1.5963832410375238E-3,1,0,1535.9399967854331,1.5701452596485621,2.1996503840600781,1.0988533782935699,1.0045738030786839,9.546138263780711E-2,1.0026292334232076,7.2435979939028505E-2,1.0002395681832965,2.188699913845011E-2,1.0000642218164824,1.8678427294166799E-2,7.5277081909748622,-119.24139054321698,60.75860945678302,null,1000000000,133373626.5625,null,16.769272922795111,-32.472570089156484,null,6.3007336277783157,-86.95265807921254,null,0,0]
[11615.5,11.615500000000001,14.32482465353354,1.500930619960873,1.000001288993241,1.6056100750003366E-3,1,0,1544.8174901463224,1.5701490010905872,2.2097424014523961,1.1011830782248979,1.0046267055288447,9.6009759978213705E-2,1.0026596739593798,7.2853173156290973E-2,1.0002423451845619,2.2013461882407749E-2,1.0000649663934293,1.8786384410293004E-2,7.4673720629963061,-119.16720009522291,60.83279990477709,null,1000000000,134919840.25,null,16.75851676926159,-32.370722191466335,null,6.2509140624691293,-86.98137582328178,null,0,0]
[11682.25,11.68225,{"$f":"SQRT(1+(A205/pole1)^2)","v":14.406744118957004},{"$f":"ATAN(A205/pole1)","v":1.5013285316740252},{"$f":"SQRT(1+(A205/Zero1)^2)","v":1.0000013038505375},{"$f":"ATAN(A205/Zero1)","v":1.6148369086897635E-3},{"$f":"IF(VIN_nom>Vout, 1, SQRT(1+(A205/z_RHP)^2))","v":1},{"$f":"IF(VIN_nom>Vout, 0, -ATAN(A205/z_RHP))","v":0},{"$f":"SQRT(1+(A205/Pole2)^2)","v":1553.6949835285893},{"$f":"ATAN(A205/Pole2)","v":1.5701526997769528},2.2198463031374782,1.1034915827630201,{"$f":"SQRT(1+(A205/pole4)^2)","v":1.0046799100561763},{"$f":"ATAN(A205/pole4)","v":9.6558079402992283E-2},{"$f":"SQRT(1+(A205/Zero3)^2)","v":1.0026902889980358},{"$f":"ATAN(A205/Zero3)","v":7.3270340969923367E-2},{"$f":"SQRT(1+(A205/pole5)^2)","v":1.0002451381824398},{"$f":"ATAN(A205/pole5)","v":2.213992392214064E-2},{"$f":"SQRT((1-(Z205/pterm2))^2+(A205/pterm1)^2)","v":1.0000657152626033},{"$f":"IF((ATAN((A205/pterm1)/(1-A205^2/pterm2))>0),ATAN((A205/pterm1)/(1-A205^2/pterm2)),PI()+ATAN((A205/pterm1)/(1-A205^2/pterm2)))","v":1.8894341503538005E-2},{"$f":"20*LOG10(((E205*K205*G205*O205)/(C205*I205*S205*M205*Q205))*Adc)","v":7.4074695156548609},{"$f":"((F205+L205+H205+R205)-(D205+J205+T205+N205+T205))*radconv","v":-119.0939560697327},{"$f":"IF(V205>0,V205,V205+180)","v":60.906043930267302},null,{"$f":"IF(U205<0,A205,1000000000)","v":1000000000},{"$f":"A205^2","v":136474965.0625},null,{"$f":"20*LOG10((K205/(I205*M205))*AEA)","v":16.747910202673854},{"$f":"(L205-(J205+N205))*radconv","v":-32.270082932313485},null,{"$f":"20*LOG10((E205*G205/(C205*S205))*Acs*Am)","v":6.2013771260583219},{"$f":"(F205+H205-(D205+T205))*radconv","v":-87.00983131227953},null,{"$f":"SUM((U206<0)*(U205>0))*A205","v":0},0]
[11749,{"$f":"A206/1000","v":11.749000000000001},14.488665839659259,1.5017219437092113,1.0000013187929686,1.624063742104234E-3,1,0,1562.5724769318699,1.5701563564363863,2.2299619275730316,1.1057791555762444,1.0047334166126907,9.7106340591660664E-2,1.0027210785231915,7.3687483237060661E-2,1.0002479471767958,2.2266385253609775E-2,1.0000664684240232,1.9002298573770029E-2,7.3479944888526418,-119.02164782449155,60.978352175508448,null,1000000000,138039001,null,16.737450337504132,-32.170637228007401,null,6.152119644249872,-87.038028987417519,null,0,0]
[11817.5,11.817500000000001,14.572737625684928,1.5021210711986528,1.0000013342156606,1.633532477230823E-3,1,0,1571.6827136293691,1.5701600660160515,2.2403547768973002,1.1081052125566371,1.0047886399227499,9.766891478697444E-2,1.0027528566557997,7.4115535108631059E-2,1.0002508464461084,2.2396161310101928E-2,1.0000672457937847,1.9113085955112574E-2,7.2873984416352773,-118.94840572733963,61.051594272660367,null,1000000000,139653306.25,null,16.72686580803385,-32.069809650321787,null,6.1018580350038532,-87.066702438897096,null,0,0]
[11886,11.885999999999999,14.656811706555514,1.5025156198176985,1.0000013497280096,1.6430012120644964E-3,1,0,1580.7929503482474,1.5701637328385056,2.2507596357730764,1.1104097760200817,1.0048441812030779,9.8231426969383098E-2,1.0027848185095498,7.4543559771949389E-2,1.0002537625613728,2.2525936612087863E-2,1.0000680276838445,1.9223873311938439E-2,7.2272400752913839,-118.87612680560017,61.123873194399835,null,1000000000,141276996,null,16.716429826990844,-31.970207557560098,null,6.0518841217892652,-87.095113539039829,null,0,0]
[11954.5,11.954499999999999,14.740888043005345,1.5029056677907768,1.0000013653300157,1.6524699466035568E-3,1,0,1589.9031870881363,1.5701673576387525,2.2611763384136205,1.1126931183638433,1.0049000404009514,9.8793876793218549E-2,1.0028169640668749,7.4971557072792114E-2,1.0002566955224415,2.265571115520295E-2,1.0000688140942229,1.9334660644105182E-2,7.1675132211909744,-118.8047999565302,61.195200043469796,null,1000000000,142910070.25,null,16.706139486687391,-31.871815364815991,null,6.0021946439650602,-87.123266769767255,null,0,0]
[12023,12.023,14.824966596658447,1.5032912915732917,1.0000013810216788,1.6619386808463059E-3,1,0,1599.0134238486771,1.5701709411350455,2.2716047218861357,1.1149555078768134,1.0049562174633573,9.9356263913047194E-2,1.0028492933101096,7.5399526856995511E-2,1.0002596453291663,2.2785484935082694E-2,1.0000696050249405,1.9445447951470379E-2,7.1082118329597304,-118.73441421047534,61.265585789524664,null,1000000000,144552529,null,16.695991946843442,-31.774617721629269,null,5.9527863957398344,-87.151166511643311,null,0,0]
[12093,12.093,14.91088853805517,1.5036808668635668,1.0000013971495785,1.6716147593266353E-3,1,0,1608.3231548658207,1.57017456116191,2.2822733648045337,1.1172460676384073,1.0050139530064925,9.9930900941413214E-2,1.002882520237919,7.5836839654880986E-2,1.0002626771330636,2.2918099683535906E-2,1.000070417945232,1.9558661232496541E-2,7.0480452499349671,-118.66344813453472,61.336551865465282,null,1000000000,146240649,null,16.685766836278095,-31.676510003193709,null,5.9025834696434645,-87.179419776339429,null,0,0]
[12163,12.163,14.996812716529819,1.5040659780715979,1.0000014133711048,1.6812908374939492E-3,1,0,1617.6328859037981,1.5701781395211296,2.2929538705799191,1.1195153005055083,1.0050720203747971,0.10050547176094357,1.0029159389467424,7.6274123392512688E-2,1.0002657265281449,2.3050713625746681E-2,1.0000712355860457,1.9671874487322289E-2,6.9883105815345221,-118.59344208891055,61.40655791108945,null,1000000000,147938569,null,16.675685059276486,-31.579618044937064,null,5.8526676258711339,-87.207417266480022,null,0,0]
[12233,12.233000000000001,15.082739093849463,1.5044467013778067,1.0000014296862578,1.6909669153464364E-3,1,0,1626.9426169622513,1.570181676927999,2.3036460742112834,1.1217634799055505,1.0051304195107613,0.10107997600377813,1.0029495494174085,7.6711377905571712E-2,1.00026879351425,2.3183326757057997E-2,1.0000720579474038,1.9785087715795607E-2,6.9290017517173208,-118.52438479233761,61.475615207662386,null,1000000000,149646289,null,16.665743791447451,-31.483926200527875,null,5.8030356131015735,-87.235163346873136,null,0,0]
[12303,12.303000000000001,15.168667632646532,1.50482311124156,1.0000014460950373,1.7006429928822847E-3,1,0,1636.2523480408313,1.5701851740815338,2.3143498135677527,1.1239908750672256,1.0051891503565604,0.10165441330231782,1.0029833516306399,7.7148603029805793E-2,1.0002718780912163,2.3315939072812996E-2,1.0000728850293297,1.9898300917764459E-2,6.8701128049992164,-118.45626510459381,61.543734895406189,null,1000000000,151363809,null,16.655940274293304,-31.389419063287111,null,5.7536842346787598,-87.262662283717646,null,0,0]
[12374.5,12.374499999999999,15.256439690750929,1.5052032096222925,1.000001462952091,1.7105264146079851E-3,1,0,1645.7615733772327,1.5701887053279049,{"$f":"SQRT(1+(A215/Zero2)^2)","v":2.3252946622967614},{"$f":"ATAN(A215/Zero2)","v":1.1262448186628908},1.0052494821081259,0.10224109047815927,1.0030180761065968,7.7595166752921038E-2,1.0002750469264126,2.345139223424882E-2,1.0000737347078468,2.0013940089397806E-2,6.8103893587071882,-118.38764223400283,61.612357765997174,null,1000000000,153128250.25,null,16.646066090645284,-31.294094059511878,null,5.7035617780433761,-87.290499674894122,null,0,0]
[12446,12.446,15.344213927809276,1.5055789594670876,1.0000014799068271,1.7204098359995096E-3,1,0,1655.2707987339202,1.5701921960015581,2.3362512134125808,1.1284776324236923,1.0053101598150216,0.10282769703550075,1.0030530005897023,7.8041699468003281E-2,1.0002782341140974,2.3586844534980722E-2,1.0000745893114569,2.0129579233057967E-2,6.7510917950901463,-118.31997453635694,61.680025463643062,null,1000000000,154902916,null,16.6363300095081,-31.199973335310027,null,5.6537255393061994,-87.318087911730458,null,0,0]
[12517.5,12.5175,15.431990306641143,1.5059504348716832,1.000001496959245,1.7302932570549278E-3,1,0,1664.7800241105467,1.5701956467977478,2.3472193030390085,1.1306895901359335,1.0053711834146088,0.10341423258345407,1.0030881250590655,7.8488201000231073E-2,1.0002814396540958,2.3722295970046586E-2,1.0000754488401846,2.0245218348582918E-2,6.6922141379672446,-118.25325058793436,61.74674941206564,null,1000000000,156687806.25,null,16.626729292773557,-31.107041221320756,null,5.6041722807526186,-87.345431239590525,null,0,0]
[12589,12.589,15.519768790906335,1.5063177082602808,1.0000015141093455,1.7401766777723087E-3,1,0,1674.289249506772,1.5701990583959331,2.3581987701776392,1.1328809613114754,1.0054325528439068,0.10400069673142109,1.0031234494936792,7.8934671174857085E-2,1.0002846635462312,2.3857746534484466E-2,1.0000763132940549,2.0360857435810609E-2,6.6337505297851296,-118.18745911326036,61.81254088673964,null,1000000000,158482921,null,16.61726126657895,-31.015282292202386,null,5.5548988190519966,-87.372533808066237,null,0,{"$f":"IF(AH218>0,W218,0)","v":0}]
[12662.25,12.66225,15.609697845839124,1.506689687322059,1.0000015317805009,1.750302000042792E-3,1,0,1684.0312182019034,1.5702025135401538,2.3694585988042376,1.1351048962909687,1.0054957828858107,0.10460144044624188,1.0031598458567976,7.9392036240319708E-2,1.0002879853760334,2.3996511414487737E-2,1.0000772040133488,2.0479326820834046E-2,6.5742793659303516,-118.12101271119035,61.878987288809654,null,1000000000,160332575.0625,null,16.607696377546478,-30.922478248469563,null,5.5047062442981431,-87.40005429593586,null,0,0]
[12735.5,12.7355,15.69962903591688,1.5070574048660608,1.000001549554179,1.7604273219543852E-3,1,0,1693.7731869169074,1.5702059289389032,2.3807300356188472,1.1373077838816199,1.0055593757584029,0.10520210839420116,1.0031964520484526,7.9849368023347481E-2,1.0002913264669446,2.4135275370180884E-2,1.0000780999018788,2.0597796175813775E-2,6.5152306901350556,-118.05552149985665,61.944478500143347,null,1000000000,162192960.25,null,16.598265271706492,-30.830873512919378,null,5.4548007362598572,-87.427330615121463,null,0,0]
[12808.75,12.80875,15.789562324656739,1.5074209336095135,1.000001567430379,1.7705526435050128E-3,1,0,1703.5151556514434,1.5702093052740638,2.3920129165241684,1.1394899003863321,1.0056233313928504,0.10580270015626976,1.0032332680456753,8.0306666336290106E-2,1.0002946868187719,2.4274038396229273E-2,1.0000790009596727,2.0716265500575537E-2,6.4565985723777626,-117.9909738300055,62.009026169994499,null,1000000000,164064076.5625,null,16.588965272503899,-30.740452269621986,null,5.4051790418642875,-87.454366932003452,null,0,0]
[12882,12.882,15.879497676401485,1.5077803446267617,1.0000015854091016,1.7806779646925982E-3,1,0,1713.2571244051778,1.5702126432120087,2.4033070803394141,1.141651517713302,1.005687649719945,0.1064032153137446,1.0032702938253684,8.0763930991580773E-2,1.0002980664313212,2.4412800487298492E-2,1.0000799071867574,2.0834734794945079E-2,6.3983772007165962,-117.92735820918098,62.07264179081902,null,1000000000,165945924,null,16.579793766716424,-30.65119895357574,null,5.3558379627875592,-87.481167318831908,null,0,0]
[12957.25,12.95725,15.971890712535666,1.5081453540051541,1.00000160398547,1.7910797447815284E-3,1,0,1723.2650854994831,1.5702160329883674,2.4149212000939158,1.1438510900874117,1.0057541017878622,0.10702004657934608,1.0033085489758857,8.1233645442978467E-2,1.0003015583765125,2.4555350325178176E-2,1.0000808435402015,2.0956438713984775E-2,6.338987903157359,-117.86296429991451,62.137035700085491,null,1000000000,167890327.5625,null,16.570502967394777,-30.560708787771805,null,5.3054385955196395,-87.508457958540319,null,0,0]
[13032.5,13.032500000000001,16.064285852156381,1.5085061646646782,1.0000016226700357,1.8014815244828792E-3,1,0,1733.2730466133612,1.5702193836194223,2.4265468916483157,1.1460295964238665,1.0058209364752657,0.10763679610530043,1.0033470254711312,8.1703323972641587E-2,1.0003050706481456,2.4697899164912385E-2,1.0000817853491308,2.1078142600577086E-2,6.280020023133881,-117.79952994412335,62.20047005587665,null,1000000000,169846056.25,null,16.561342380827917,-30.471418690820435,null,5.2553287058913014,-87.535508027541056,null,0,0]
[13107.75,13.107749999999999,16.156683059176039,1.5088628485457627,1.0000016414627986,1.8118833037943998E-3,1,0,1743.2810077464751,1.5702226957793584,2.4381839894734672,1.1481873175311039,1.0058881537058881,0.10825346343874952,1.0033857232856414,8.2172966377494314E-2,1.0003086032460067,2.484044700071843E-2,1.0000827326135753,2.1199846454533062E-2,6.2214676295079041,-117.73704318754295,62.262956812457048,null,1000000000,171813110.0625,null,16.552309371294236,-30.383312586264392,null,5.2055049989220894,-87.562321647706369,null,0,0]
[13183,13.183,16.249082298327071,1.509215475956754,1.0000016603637587,1.8222850827138391E-3,1,0,1753.2889688984949,1.5702259701269676,2.4498323310245107,1.1503245296589053,1.0059557534030457,0.1088700481272059,1.00342464239381,8.2642572454555835E-2,1.00031215616988,2.4982993826813866E-2,1.0000836853335648,2.1321550275663733E-2,6.1633249098986518,-117.6754922427285,62.324507757271505,null,1000000000,173791489,null,16.543401366122165,-30.296374657977459,null,5.1559642353413793,-87.588902847397051,null,0,0]
[13259.75,13.25975,16.343325440333167,1.509571025172824,1.0000016797529359,1.8328942056573497E-3,1,0,1763.4964243118891,1.5702292714610691,2.4617242820753962,1.1524834995326494,1.0060250945009197,0.10949883793900878,1.0034645652258318,8.3121501818495258E-2,1.0003158008537369,2.5128381071783602E-2,1.000084662664434,2.1445680052575113E-2,6.1044392975124744,-117.61366629637138,62.386333703628623,null,1000000000,175820970.0625,null,16.5344419557671,-30.208890950943974,null,5.1057241057511611,-87.615778571277687,null,0,0]
[13336.5,13.336499999999999,16.437570624693677,1.5099224973338972,1.0000016992546668,1.8435033281882628E-3,1,0,1773.7038797442822,1.5702325347975983,2.4736275972367605,1.1546217009844937,1.0060948333026829,0.11012754082855288,1.0035047182075238,8.3600392965712048E-2,1.0003194666815656,2.5273767254237613E-2,1.0000856456705767,2.1569809794942406E-2,6.0459680056367393,-117.55278959445695,62.447210405543046,null,1000000000,177862232.25,null,16.525607370004835,-30.122590029454756,null,5.0557716772340431,-87.642420695158293,null,0,0]
[13413.25,13.41325,16.531817816479222,1.5102699620817379,1.0000017188689514,1.8541124503041902E-3,1,0,1783.9113351953479,1.570235760788816,2.4855421132396942,1.1567394129835931,1.0061649697256392,0.11075615631695285,1.0035451013112602,8.4079245681152104E-2,1.0003231536531338,2.5419152368041521E-2,1.0000866343520256,2.1693939502565096E-2,5.9879052300766666,-117.49285015367148,62.507149846328517,null,1000000000,179915275.5625,null,16.516895070803663,-30.037455919688256,null,5.0061036841000472,-87.668833209206724,null,0,0]
[13490,13.49,16.626066981551688,1.5106134874829029,1.0000017385957893,1.8647215720027431E-3,1,0,1794.1187906647674,1.5702389500721392,2.4974676697786955,1.1588369099133693,1.0062355036866435,0.11138468392573274,1.003585714509261,8.4558059749866285E-2,1.0003268617682075,2.5564536407061213E-2,1.0000876287088136,2.1818069175242649E-2,5.930245282637399,-117.43383616236459,62.566163837635415,null,1000000000,181980100,null,16.508302581062125,-29.953472909739094,null,4.9567169157314748,-87.695020013338052,null,0,0]
[13568.5,13.5685,16.722467156901207,1.5109608399495009,1.0000017588888577,1.8755725950647365E-3,1,0,1804.5589894371678,1.5702421747516362,2.5096764015084685,1.1609616020646789,1.0063080570646927,0.11202745137650651,1.0036274917357277,8.5047751200707511E-2,1.0003306763050426,2.5713234273379241E-2,1.000088651609188,2.1945029129831282E-2,5.8716815131881024,-117.3744217834075,62.625578216592501,null,1000000000,184104192.25,null,16.499635589818983,-29.868749639270856,null,4.9064916909368801,-87.721574395448158,null,0,0]
[13647,13.647,16.818869326749972,1.5113042105567052,1.0000017792996709,1.8864236176850517E-3,1,0,1814.9991882281174,1.5702453623332706,2.5218963529887111,1.1630657130733919,1.006381026138865,0.11267012588325002,1.0036695096097066,8.5537401767824359E-2,1.0003345129600756,2.586193100236181E-2,1.0000896804467323,2.2071989047438654E-2,5.8135274734997333,-117.31595108342248,62.684048916577524,null,1000000000,186240609,null,16.49108888002316,-29.78519813056068,null,4.8565540388361077,-87.747900631726566,null,0,0]
[13725.5,13.7255,16.915273456997323,1.5116436673035121,1.0000017998282291,1.8972746398611337E-3,1,0,1825.4393870372974,1.570248513453562,2.5341273619093467,1.1651495221783583,1.0064544108187448,0.11331270693534859,1.0037117681009755,8.6027011221571151E-2,1.0003383717330521,2.6010626587446458E-2,1.0000907152214817,2.2198948927850157E-2,5.7557774351427646,-117.25841196682266,62.741588033177337,null,1000000000,188389350.25,null,16.482659988142416,-29.702802391614771,null,4.8069006950492872,-87.774002618216656,null,0,0]
[13804,13.804,17.011679514314874,1.5119792766511577,1.000001820474532,1.9081256615904271E-3,1,0,1835.8795858643973,1.5702516287345505,2.5463692689333359,1.1672133039611114,1.0065282110134282,0.11395519402264463,1.003754267179144,8.6516579332419671E-2,1.0003422526237162,2.6159321022071032E-2,1.0000917559334723,2.2325908770851197E-2,5.6984257842541828,-117.2017925159555,62.798207484044497,null,1000000000,190550416,null,16.474346510152028,-29.621546696480543,null,4.7575284502583894,-87.799884162854553,null,0,0]
[13884.25,13.88425,17.110236709322212,1.5123184583713876,1.0000018417028143,1.9192185846135161E-3,1,0,1846.552527995658,1.5702547770508637,2.5588951870681016,1.1693026727711791,1.006604085852864,0.11461190640941744,1.0037979623489541,8.7017018407487962E-2,1.0003462428935712,2.6311329104729539E-2,1.000092825983341,2.2455698889929359E-2,5.6402016725323358,-117.14484926846926,62.855150731530742,null,1000000000,192772398.0625,null,16.46596455887958,-29.539641915077176,null,4.7073428332654457,-87.826118692315688,null,0,0]
[13964.5,13.964499999999999,17.208795850216585,1.5126537549702528,1.0000018630541498,1.9303115071642733E-3,1,0,1857.2254701450117,1.570257889182235,2.5714321671047027,1.1713716771658487,1.0066803947460607,0.11526851951844812,1.0038419088872697,8.7517413791075915E-2,1.0003502562776989,2.6463335971193918E-2,1.0000939022381956,2.258548896945688E-2,5.582382398065886,-117.08884251871919,62.91115748128081,null,1000000000,195007260.25,null,16.457698327044021,-29.458896167289605,null,4.657444376105774,-87.852130618480444,null,0,0]
[14044.75,14.044750000000001,17.307356903754627,1.5129852327460844,1.0000018845285386,1.9414044292399692E-3,1,0,1867.8984123121477,1.5702609657489333,2.5839800480324087,1.1734205959717778,1.0067571375943192,0.11592503280619072,1.003886106761078,8.8017765238344522E-2,1.0003542927758216,2.6615341614454283E-2,1.0000949846980751,2.2715279009204448E-2,5.5249623158251229,-117.03376009450051,62.966239905499492,null,1000000000,197255002.5625,null,16.449545428384045,-29.379293481923028,null,4.6078298205759696,-87.877923739950418,null,0,0]
[14125,14.125,17.405919837445289,1.5133129564989278,1.0000019061259802,1.9524973508378734E-3,1,0,1878.5713544967625,1.5702640073571315,2.5965386718141974,1.1754497033028566,1.0068343142984089,0.1165814457296088,1.0039305559371843,8.8518072504585696E-2,1.0003583523876587,2.6767346027501086E-2,1.0000960733630186,2.2845069008942731E-2,5.4679358936765716,-116.97959000700631,63.020409992993692,null,1000000000,199515625,null,16.441503534596301,-29.30081815702588,null,4.5584959634140114,-87.90350176948175,null,0,0]
[14207.25,14.20725,17.506941086033731,1.5136450185640464,1.0000019283893675,1.9638667310423641E-3,1,0,1889.5102890277942,1.5702670891122605,2.6094212686026461,1.1775091039864822,1.0069138645145459,0.11725411313853211,1.0039763736208143,8.9030802385464375E-2,1.0003625371582858,2.6923137428605401E-2,1.0000971955987961,2.2978093608661699E-2,5.4098910783775844,-116.92500425842474,63.074995741575265,null,1000000000,201845952.5625,null,16.433374031989466,-29.22154076454688,null,4.5082205858914275,-87.929497855013054,null,0,0]
[14289.5,14.2895,17.607964242878232,1.5139732703485438,1.0000019507820179,1.9752361107391436E-3,1,0,1900.4492235765647,1.5702701353903905,2.6223148235254818,1.1795482616779545,1.0069938702684169,0.11792667396476382,1.004022455217602,8.9543485335608589E-2,1.0003667462084689,2.7078927522504011E-2,1.0000983243528623,2.3111118165864454E-2,5.3522483733127215,-116.87135196549468,63.128648034505318,null,1000000000,204189810.25,null,16.425356363276823,-29.143415070663586,null,4.4582334303217657,-87.955275625138867,null,0,0]
[14371.75,14.37175,17.708989275321134,1.5142977769909554,1.0000019733039311,1.9866054899252733E-3,1,0,1911.388158142769,1.5702731468006295,2.6352191757353958,1.1815674566759677,1.007074331451453,0.11859912762532905,1.0040688006912108,9.0056121091987545E-2,1.0003709795379019,2.7234716301651241E-2,1.0000994596252601,2.3244142680304045E-2,5.2950021729962256,-116.81862080234876,63.181379197651239,null,1000000000,206547198.0625,null,16.417448200640905,-29.066425016941114,null,4.4085312196584345,-87.980838812008329,null,0,0]
[14454,14.454000000000001,17.810016151445158,1.5146186021550267,1.0000019959551076,1.9979748685978148E-3,1,0,1922.3270927261094,1.5702761239382206,2.6481341673869219,1.1835669644691411,1.0071552479545018,0.11927147353782631,1.0041154100051024,9.0568709391718127E-2,1.0003752371462766,2.7390503758501807E-2,1.000100601416033,2.3377167151733519E-2,5.2381469843026309,-116.76679863345549,63.233201366544506,null,1000000000,208918116,null,16.40964727324641,-28.990554819780041,null,4.3591107322364051,-88.00619106327143,null,0,0]
[14622.5,14.6225,18.016988691517149,1.5152646192572268,1.0000020427626952,2.0212665424384278E-3,1,0,1944.7369466056725,1.5702821184101514,2.6746248101783792,1.1876028780895385,1.0073224375031185,0.12064852411333721,1.0042117191028836,9.16186649945991E-2,1.0003840352360425,2.7709650800882422E-2,1.0001029608809211,2.3649685234447496E-2,5.1228700792291413,-116.66342249273319,63.33657750726681,null,1000000000,213817506.25,null,16.393991635006131,-28.838556646773103,null,4.2587327939504327,-88.057484738151018,null,0,0]
[14706.75,14.70675,18.120477732933871,1.5155820936248141,1.0000020663699276,2.0329123785379072E-3,1,0,1955.9418735712095,1.5702850641356749,2.687886227192815,1.1895909865654195,1.0074067484063385,0.12133687734663705,1.0042602887356049,9.2143566988238196E-2,1.000388472490652,2.7869222208850703E-2,1.0001041508723989,2.3785944207061309E-2,5.0658244819619611,-116.61311482452035,63.386885175479648,null,1000000000,216288495.5625,null,16.386323351113351,-28.764254934528392,null,4.2089739162361148,-88.082814486340467,null,0,0]
[14791,14.791,18.223968579970119,1.515895962256852,1.0000020901127857,2.0445582140859557E-3,1,0,1967.1468005535253,1.5702879763033173,2.70115816393723,1.1915595659168363,1.0074915365692498,0.12202511504555957,1.0043091350374258,9.2668418067451491E-2,1.0003929352179608,2.8028792197194147E-2,1.000105347703296,2.3922203133492363E-2,5.0091668257694923,-116.56371103300978,63.436288966990219,null,1000000000,218773681,null,16.378758459779064,-28.691063616337175,null,4.1594974355432281,-88.107937638486163,null,0,0]
[14877.25,14.87725,18.32991802151048,1.5162136103332235,1.0000021145597662,2.0564805080635932E-3,1,0,1978.6177198848488,1.5702909234355098,2.7147558976886321,1.1935549303373065,1.0075788317703189,0.12272957040028715,1.0043594274519994,9.3205675483587672E-2,1.0003975302719446,2.8192148718090549E-2,1.0001065800305449,2.4061696645074359E-2,4.9515604751737303,-116.51405818676952,63.485941813230482,null,1000000000,221332567.5625,null,16.37111884009699,-28.617268833286918,null,4.1091356518222986,-88.133446825017927,null,0,0]
[14963.5,14.9635,18.43586929128718,1.516527607382649,1.0000021391488878,2.068402801456609E-3,1,0,1990.0886392331599,1.570293836593019,2.7283643324210147,1.1955303977480785,1.007666626903007,0.12343390335010393,1.0044100097413526,9.3742878941989988E-2,1.0004021520216437,2.8355503733967197E-2,1.0001078195258892,2.4201190107691794E-2,4.8943495022868131,-116.46532728753922,63.534672712460775,null,1000000000,223906332.25,null,16.363583066797862,-28.544605105027859,null,4.0590631460401498,-88.158746820342571,null,0,0]
[15049.75,15.04975,18.541822357959621,1.5168380159315877,1.0000021638801508,2.0803250942616146E-3,1,0,2001.5595585981662,1.5702967163599706,2.7419833088078085,1.1974862490904006,1.0077549218366522,0.12413811322827534,1.0044608818616936,9.4280028140773062E-2,1.0004068004666886,2.8518857236126807E-2,1.0001090661893803,2.4340683521059787E-2,4.8375284110220527,-116.41750581680587,63.582494183194129,null,1000000000,226494975.0625,null,16.356148941082552,-28.473056330078993,null,4.0092766216580031,-88.183841206946241,null,0,0]
[15136,15.135999999999999,18.647777190898957,1.5171448970882251,1.0000021887535553,2.0922473864752192E-3,1,0,2013.0304779795824,1.5702995633071761,2.7556126705499735,1.1994227603541163,1.0078437164398955,0.12484219936878804,1.0045120437689876,9.4817122778237742E-2,1.0004114756067068,2.8682209215872563E-2,1.0001103200210706,2.4480176884893418E-2,4.7810918156846629,-116.37058145776859,63.629418542231406,null,1000000000,229098496,null,16.34881431869541,-28.402606689932448,null,3.9597728379895925,-88.208733486053887,null,0,0]
[15224,15.224,18.755883621369694,1.5174544313145368,1.0000022142781342,2.1044115796569323E-3,1,0,2024.7341406694186,1.5703024347719547,2.7695291145436789,1.2013789117916887,1.0079348275155284,0.12556044309568581,1.0045645423642289,9.5365058442094461E-2,1.000416273117174,2.884887400552821E-2,1.0001116066807154,2.4622500497515052E-2,4.7239009310346374,-116.32361703674724,63.676382963252763,null,1000000000,231770176,null,16.341431260381039,-28.331844325416071,null,3.9095527281553037,-88.233926076262961,null,0,0]
[15312,15.311999999999999,18.863991828271558,1.5177604177322404,1.0000022399506809,2.1165757722158749E-3,1,0,2036.4378033757578,1.5703052732313989,2.7834560502253556,1.2033154954923793,1.0080264584644323,0.12627855661435913,1.0046173425318157,9.5912936674180049E-2,1.0004210984160893,2.9015537192075405E-2,1.0001129008025043,2.4764824057972597E-2,4.6670993156754879,-116.27756122446657,63.722438775533433,null,1000000000,234457344,null,16.334147441327211,-28.262193758190826,null,3.8596203057542384,-88.258915389058927,null,0,0]
[15400,15.4,18.972101781236777,1.518062916933663,1.0000022657711956,2.1287399641484479E-3,1,0,2048.1414660983164,1.5703080792513147,2.79739332089513,1.2052327892941832,1.0081186091448491,0.12699653921977089,1.0046704442242005,9.6460757154661667E-2,1.0004259515030505,2.9182198766278734E-2,1.0001142023864933,2.4907147565963392E-2,4.6106815867174635,-116.2324015661838,63.767598433816204,null,1000000000,237160000,null,16.326960749630015,-28.193639061334835,null,3.8099723006132495,-88.283704896109299,null,0,0]
[15488,15.488,19.080213450585362,1.5183619881404142,1.000002291739678,2.1409041554510504E-3,1,0,2059.8451288368187,1.5703108533846479,2.8113407728453579,1.2071310660949535,1.0082112794142679,0.12771439020768083,1.0047238473935751,9.7008519563912543E-2,1.0004308323776532,2.9348858718903324E-2,1.0001155114327391,2.5049471021184759E-2,4.5546424690740439,-116.18812581097832,63.81187418902168,null,1000000000,239878144,null,16.31986912591881,-28.126164590284347,null,3.7606054978335539,-88.308297990545213,null,0,0]
[15578.25,15.578250000000001,19.191091091137977,1.5186652060998531,1.0000023185258187,2.1533793623504417E-3,1,0,2071.8480329684339,1.5703136658936556,2.8256552529351686,1.2090584065885905,1.0083068586301653,0.12845045789494497,1.0047789290723974,9.7570226610059652E-2,1.0004358669093625,2.9519778169525154E-2,1.0001168616998679,2.5195433373258622E-2,4.4975583736609712,-116.14362347474005,63.856376525259947,null,1000000000,242681873.0625,null,16.312692823927325,-28.058070831048642,null,3.7102652439462775,-88.333319349959964,null,0,0]
[15668.5,15.6685,19.301970475869805,1.5189649404401038,1.0000023454675904,2.1658545685795676E-3,1,0,2083.85093711625,1.5703164460027681,2.8399801234883828,1.210966311084396,1.0084029840385913,0.12918638565044852,1.0048343277390337,9.8131871897175121E-2,1.0004409306669693,2.9690695894913612E-2,1.000118219815846,2.5341395669185196E-2,4.440861595503411,-116.10002536104871,63.899974638951292,null,1000000000,245501892.25,null,16.305612289058576,-27.991080798584022,null,3.6602140797405043,-88.358141109518968,null,0,0]
[15758.75,15.758749999999999,19.412851574894429,1.5192612507993903,1.0000023725649934,2.1783297741345456E-3,1,0,2095.8538412799867,1.5703191942686456,2.8543152280660364,1.212855058424672,1.0084996554833643,0.12992217271717715,1.0048900433410584,9.8693455081165685E-2,1.0004460236500292,2.9861611885108982E-2,1.0001195857807357,2.5487357908637927E-2,4.384546779865409,-116.05731889948979,63.942681100510214,null,1000000000,248338201.5625,null,16.298625462199656,-27.925178504923966,null,3.6104487104889369,-88.382766686222297,null,0,0]
[15849,15.849,19.523734359003914,1.5195541954635405,1.0000023998180274,2.1908049790114923E-3,1,0,2107.856745459374,1.5703219112352691,2.8686604132455016,1.2147249224268581,1.0085968728074755,0.13065781833901521,1.0049460758257571,9.9254975818170832E-2,1.0004511458580962,3.0032526130152146E-2,1.0001209595945997,2.5633320091290226E-2,4.3286086794632652,-116.01549172939049,63.98450827060951,null,1000000000,251190801,null,16.291730335853497,-27.860348249330386,null,3.5609658973055431,-88.407199419583378,null,0,0]
[15941.25,15.94125,19.637076091120072,1.5198502128823872,1.0000024278358493,2.2035566420174984E-3,1,0,2120.1256419910433,1.5703246566177747,2.8833337587849619,1.2166169881098379,1.0086968085267431,0.13140961938925166,1.0050036774663651,9.9828875332143643E-2,1.0004564117808834,3.0207226134533343E-2,1.000122371964967,2.5782516833906147E-2,4.2718149302248047,-115.97363372388544,64.026366276114558,null,1000000000,254123451.5625,null,16.284775142569902,-27.795173197102397,null,3.5106752150517,-88.431977695570936,null,0,0]
[16033.5,16.0335,19.750419524211253,1.5201428327653312,1.0000024560162766,2.2163083043068845E-3,1,0,2132.3945385385082,1.5703273704087399,2.8980173218594172,1.2184898871494003,1.0087973142531628,0.1321612710614955,1.0050616100776351,0.10040270887497836,1.0004617082373701,3.038192429451839E-2,1.0001237925361732,2.5931713516486196E-2,4.2154040231027219,-115.93266895173579,64.067331048264208,null,1000000000,257073122.25,null,16.277911676283306,-27.73108594386045,null,3.4606730810022226,-88.456561303691572,null,0,0]
[16125.75,16.12575,19.863764629159974,1.520432113222111,1.0000024843593092,2.2290599658755048E-3,1,0,2144.6634351014977,1.5703300531503386,2.912710947942911,1.2203438963733559,1.0088983898163835,0.13291277255118028,1.0051198736023377,0.10097647608020555,1.000467035227071,3.055662059947328E-2,1.0001252213082863,2.608091013868152E-2,4.1593706845681302,-115.89258486685468,64.107415133145324,null,1000000000,260039813.0625,null,16.271137950600089,-27.668070613505325,null,3.4109562089993011,-88.480953573368282,null,0,0]
[16218,16.218,19.977111377509132,1.5207181110459098,1.000002512864947,2.2418116267192124E-3,1,0,2156.9323316797472,1.5703327053724083,2.9274144855071014,1.2221792875729967,1.0090000350451571,0.13366412305473965,1.0051784679829305,0.10155017658161523,1.0004723927494985,3.0731315038764681E-2,1.0001266582813746,2.6230106700143238E-2,4.1037097467531556,-115.85336913564383,64.146630864356169,null,1000000000,263023524,null,16.264452029130897,-27.606111617859572,null,3.3615213685471068,-88.505157758591025,null,0,0]
[16312.5,16.3125,20.093224355638039,1.5210077387418648,1.0000025422344467,2.2548743029250739E-3,1,0,2169.5004696535057,1.5703353911788882,2.9424867676670257,1.2240404186254192,1.0091047499223191,0.13443364178649789,1.0052388344930625,0.10213780023160998,1.0004779126015513,3.0910268372449982E-2,1.000128138806109,2.6382942138790066E-2,4.0470720672051321,-115.81408463096784,64.185915369032159,null,1000000000,266097656.25,null,16.257692105988404,-27.543720724325617,null,3.3111699142882172,-88.529760592606209,null,0,0]
[16407,16.407,20.209338999902801,1.5212940382956643,1.0000025717745806,2.2679369783614196E-3,1,0,2182.0686076427342,1.5703380460462983,2.9575691381354874,1.2258825740185855,1.0092100622258109,0.13520300037331937,1.0052995480719693,0.10272535310714531,1.0004834644928504,3.1089219725767319E-2,1.000129627936891,2.6535777512963325E-2,3.9908145256957503,-115.77568582079824,64.224314179201755,null,1000000000,269189649,null,16.251020363413971,-27.482406107674649,null,3.2611077280039389,-88.55417273447209,null,0,0]
[16501.5,16.5015,20.325455281748656,1.5215770666995001,1.0000026014853483,2.2809996530237923E-3,1,0,2194.6367456471658,1.5703406705061795,2.9726614433575596,1.2277060301738656,1.0093159717686253,0.13597219795468984,1.005360608656773,0.10331283481541223,1.0004890484228626,3.1268169087288418E-2,1.0001311256737955,2.6688612822287891E-2,3.9349318942756777,-115.73816011453241,64.261839885467595,null,1000000000,272299502.25,null,16.244434873591771,-27.422151911279997,null,3.2113315106342633,-88.578397449579441,null,0,0]
[16596,16.596,20.441573173269273,1.5218568796527159,1.0000026313667498,2.2940623269077339E-3,1,0,2207.2048836665417,1.5703432650779663,2.9877635327808356,1.2295110584267137,1.0094224783627739,0.13674123367121729,1.0054220161842509,0.10390024496389338,1.0004946643910511,3.1447116445585795E-2,1.0001326320168977,2.6841448066388624E-2,3.8794190497884964,-115.70149513826513,64.29850486173487,null,1000000000,275427216,null,16.237933757538762,-27.362942569287128,null,3.161838019085073,-88.602437929244388,null,0,0]
[16692.5,16.692499999999999,20.560150219096165,1.5221393528977167,1.0000026620566513,2.3074014586902634E-3,1,0,2220.03901404011,1.5703458842452422,3.0031951867475941,1.2313355480803969,1.0095318550074028,0.13752637734431944,1.0054850813103051,0.10450001281802011,1.0005004322775852,3.1629848970419421E-2,1.0001341791216933,2.6997517851131182E-2,3.8231077217096288,-115.66492979362111,64.335070206378887,null,1000000000,278639556.25,null,16.231380219693147,-27.303542498308822,null,3.1115854975621202,-88.626800318057889,null,0,0]
[16789,16.789000000000001,20.678728886626406,1.5224185865748485,1.0000026929244854,2.3207405896516686E-3,1,0,2232.8731444287332,1.5703484733035669,3.018636735407481,1.2331413776880891,1.0096418538434773,0.13831135042098147,1.0055485080854951,0.10509970522498077,1.0005062335716193,3.1812579382257122E-2,1.0001357352009843,2.7153587567069135E-2,3.7671715234350502,-115.62923659094906,64.370763409050937,null,1000000000,281870521,null,16.22491085411918,-27.245200069640678,null,3.0616211335679022,-88.650977089409679,null,0,0]
[16885.5,16.8855,20.797309148120906,1.5226946360534364,1.0000027239702525,2.3340797197872031E-3,1,0,2245.7072748321525,1.5703510327691548,3.0340880276877042,1.2349288204638751,1.0097524746676592,0.13909615198974093,1.0056122964413901,0.10569932176775643,1.0005120682725719,3.1995307668932861E-2,1.0001373002548528,2.7309657213802924E-2,3.7116053206715147,-115.59440302666916,64.405596973330844,null,1000000000,285120110.25,null,16.218523808433609,-27.187899606622679,null,3.0119416463602322,-88.67497141570577,null,0,0]
[16982,16.981999999999999,{"$f":"SQRT(1+(A269/pole1)^2)","v":20.915890976469271},{"$f":"ATAN(A269/pole1)","v":1.5229675554491149},{"$f":"SQRT(1+(A269/Zero1)^2)","v":1.0000027551939523},{"$f":"ATAN(A269/Zero1)","v":2.3474188490921187E-3},{"$f":"IF(VIN_nom>Vout, 1, SQRT(1+(A269/z_RHP)^2))","v":1},{"$f":"IF(VIN_nom>Vout, 0, -ATAN(A269/z_RHP))","v":0},{"$f":"SQRT(1+(A269/Pole2)^2)","v":2258.541405250116},{"$f":"ATAN(A269/Pole2)","v":1.5703535631464867},3.0495489154828972,1.236698144556392,{"$f":"SQRT(1+(A269/pole4)^2)","v":1.0098637172755498},{"$f":"ATAN(A269/pole4)","v":0.13988078114037872},{"$f":"SQRT(1+(A269/Zero3)^2)","v":1.0056764463091865},{"$f":"ATAN(A269/Zero3)","v":0.10629886202965183},{"$f":"SQRT(1+(A269/pole5)^2)","v":1.0005179363798589},{"$f":"ATAN(A269/pole5)","v":3.2178033818281479E-2},{"$f":"SQRT((1-(Z269/pterm2))^2+(A269/pterm1)^2)","v":1.0001388742833797},{"$f":"IF((ATAN((A269/pterm1)/(1-A269^2/pterm2))>0),ATAN((A269/pterm1)/(1-A269^2/pterm2)),PI()+ATAN((A269/pterm1)/(1-A269^2/pterm2)))","v":2.7465726790932961E-2},{"$f":"20*LOG10(((E269*K269*G269*O269)/(C269*I269*S269*M269*Q269))*Adc)","v":3.6564040817467309},{"$f":"((F269+L269+H269+R269)-(D269+J269+T269+N269+T269))*radconv","v":-115.56041681499812},{"$f":"IF(V269>0,V269,V269+180)","v":64.439583185001879},null,{"$f":"IF(U269<0,A269,1000000000)","v":1000000000},{"$f":"A269^2","v":288388324},null,{"$f":"20*LOG10((K269/(I269*M269))*AEA)","v":16.212217277314785},{"$f":"(L269-(J269+N269))*radconv","v":-27.13162572222252},null,{"$f":"20*LOG10((E269*G269/(C269*S269))*Acs*Am)","v":2.9625438107624817},{"$f":"(F269+H269-(D269+T269))*radconv","v":-88.698786397521019},null,{"$f":"SUM((U270<0)*(U269>0))*A269","v":0},0]
[17081,{"$f":"A270/1000","v":17.081},21.037546473405509,1.5232443479639728,1.0000027874114636,2.3611035508269386E-3,1,0,2271.7080261082706,1.5703561293660004,3.0654201638470018,1.2384947530417783,1.0099784877558728,0.14068555734217073,1.0057426336997535,0.10691385471549887,1.0005239912257529,3.2365491571844748E-2,1.0001404984163611,2.7625839548605723E-2,3.6001468591692589,-115.52641804432631,64.473581955673694,null,1000000000,291760561,null,16.205829190832723,-27.074944951870425,null,2.9121556063953209,-88.72303515005845,null,0,0]
[17180,17.18,21.159203563580416,1.5235179576036166,1.0000028198162463,2.3747882516774242E-3,1,0,2284.874646981214,1.5703586660097653,3.0813012048316519,1.2402728477600526,1.0100939122147496,0.14149015013977967,1.0058092014281332,0.10752876622945236,1.0005300812300431,3.255294704996782E-2,1.0001421319952091,2.7785952232169467E-2,3.5442633468483558,-115.49328558813774,64.506714411862262,null,1000000000,295152400,null,16.199522141339152,-27.019312739386692,null,2.8620571333232885,-88.747101533083722,null,0,0]
[17279,17.279,21.280862219669608,1.5237884389144079,1.0000028524083004,2.3884729516384503E-3,1,0,2298.0412678686903,1.5703611735861436,3.0971918878000673,1.2420327023449347,1.010209990428014,0.14229455855451317,1.0058761494188149,0.10814359612265825,1.0005362063920877,3.2740400239518172E-2,1.0001437750200137,2.7946064841192636E-2,3.4887484313854609,-115.4610068674067,64.538993132593305,null,1000000000,298563841,null,16.193294324891166,-26.964713379766142,null,2.8122450833787793,-88.770988671848698,null,0,0]
[17378,17.378,21.402522414969642,1.5240558452043131,1.0000028851876264,2.4021576507048917E-3,1,0,2311.207888770452,1.5703636525919138,3.1130920651006186,1.2437745852968205,1.0103267221703325,0.14309878160908193,1.0059434775958762,0.10875834394662853,1.0005423667112412,3.2927851127364224E-2,1.0001454274908652,2.8106177375243624E-2,3.4335971017423939,-115.42956952568727,64.57043047431273,null,1000000000,301994884,null,16.187143983717093,-26.911131461537991,null,2.7627162045902045,-88.794699620650462,null,0,0]
[17479.25,17.47925,21.52694917959219,1.5243262025601494,1.000002918905641,2.4161533647285511E-3,1,0,2324.6737510708685,1.5703661588926781,3.1293632796950694,1.245537742120387,1.0104467826479728,0.14392108971617301,1.0060127291246919,0.10938697795678463,1.0005487034016978,3.3119559868210878E-2,1.0001471272884781,2.8269928752525791E-2,3.3775632895515297,-115.39827532946724,64.601724670532761,null,1000000000,305524180.5625,null,16.180932213560567,-26.857368401318197,null,2.7123512357301314,-88.818770323590613,null,0,0]
[17580.5,17.580500000000001,21.651377499601178,1.5245934525014906,1.0000029528195362,2.430149077805656E-3,1,0,2338.1396133857188,1.5703686363247631,3.1456441219506446,1.2472826532564298,1.010567526217635,0.14474320187874798,1.0060823781555193,0.11001552517720144,1.0005550768640947,3.3311266173761879E-2,1.0001488369665759,2.8433680050475967E-2,3.3218994921219709,-115.36783574205019,64.63216425794981,null,1000000000,309073980.25,null,16.174797903286851,-26.804637861141742,null,2.6622757499932552,-88.842662980303615,null,0,0]
[17681.75,17.681750000000001,21.775807348333878,1.5248576482583649,1.0000029869293119,2.4441447899307251E-3,1,0,2351.6054757147554,1.5703710853840964,3.1619344431484833,1.2490095900025417,1.0106889526344991,0.14556511705595404,1.0061524246058096,0.11064398512931199,1.0005614870977302,3.3502970029972989E-2,1.0001505565252573,2.8597431268632335E-2,3.266600664189514,-115.33823823861511,64.661761761384895,null,1000000000,312644283.0625,null,16.168739313537607,-26.752924265579608,null,2.6124864428811478,-88.866380640619312,null,0,0]
[17783,17.783000000000001,21.900238699733194,1.525118841852773,1.000003021234968,2.4581405010982737E-3,1,0,2365.0713380577363,1.5703735065553104,3.1782340975331076,1.2507188185246045,1.0108110616524784,0.14638683420850176,1.0062228683925654,0.11127235733495798,1.0005679341018969,3.3694671422801033E-2,1.000152285964621,2.876118240653305E-2,3.2116618613119612,-115.30947051859398,64.690529481406017,null,1000000000,316235089,null,16.162754749659353,-26.702212332670612,null,2.5629800660200153,-88.88992628515264,null,0,0]
[17886.5,17.886500000000002,22.027436718885795,1.5253827897116332,1.0000030565054305,2.4724472270741629E-3,1,0,2378.836441800282,1.5703759531988475,3.194905464318988,1.2524479989215735,1.0109365894696618,0.14722660598734019,1.0062952881890392,0.11191460217693774,1.0005745623773779,3.3890630285855629E-2,1.0001540640485524,2.8928572375177718E-2,3.1558692654226945,-115.28090858579678,64.71909141420322,null,1000000000,319926882.25,null,16.156711988008581,-26.651393154879749,null,2.5126626536820105,-88.91382040722327,null,0,0]
[17990,17.989999999999998,22.154636255034571,1.5256437067063986,1.000003091980576,2.4867539520379177E-3,1,0,2392.6015455569041,1.5703783716903488,{"$f":"SQRT(1+(A279/Zero2)^2)","v":3.2115862848837047},{"$f":"ATAN(A279/Zero2)","v":1.2541592218358422},1.0110628300388309,0.14806616865154298,1.0063681230007819,0.11255675432019864,1.0005812290742879,3.4086586545155895E-2,1.0001558524573979,2.9095962258984101E-2,3.1004427366386613,-115.25318843039054,64.746811569609463,null,1000000000,323640100,null,16.150743135056523,-26.601589270680563,null,2.4626341959187048,-88.937540868769872,null,0,0]
[18093.5,18.093499999999999,22.281837282199454,1.5259016447084048,1.0000031276604042,2.5010606759836808E-3,1,0,2406.3666493273608,1.5703807625129274,3.2282764126814558,1.2558527556866332,1.0111897830930381,0.14890552109609509,1.0064413727376911,0.11319881325532893,1.0005879341918593,3.4282540185705035E-2,1.0001576511912653,2.9263352057458728E-2,3.0453773034956546,-115.22629761026593,64.773702389734069,null,1000000000,327374742.25,null,16.144846516899122,-26.552785265152067,null,2.4128913967054348,-88.961090641773168,null,0,0]
[18197,18.196999999999999,22.409039774989964,1.5261566544128256,1.0000031635449156,2.5153673989055962E-3,1,0,2420.1317531114159,1.5703831261387049,3.2449757041004688,1.2575288637783166,1.0113174483639635,0.14974466221771976,1.0065150373091778,0.11384077847337218,1.0005946777293195,3.4478491192507468E-2,1.0001594602502628,2.9430741770108085E-2,2.9906680936427699,-115.20022390845376,64.799776091546235,null,1000000000,331130809,null,16.139020502809448,-26.504966015902621,null,2.3634310159617877,-88.984472630824698,null,0,0]
[18303,18.303000000000001,22.539316284988946,1.5264148402908235,1.0000032005083614,2.5300196937775867E-3,1,0,2434.2293473388909,1.5703855191488463,3.2620877113099471,1.2592276652262604,1.0114489352847282,0.15060385225641484,1.0065909111088067,0.11449815242636339,1.0006016239764679,3.4679172569808424E-2,1.0001613237086924,2.9602174623055966E-2,2.9350016496527473,-115.17435483604889,64.825645163951108,null,1000000000,334999809,null,16.133125286638197,-26.456996935048252,null,2.313065345461931,-89.008248456278466,null,0,{"$f":"IF(AH282>0,W282,0)","v":0}]
[18409,18.408999999999999,22.669594280188878,1.5266700586920186,1.0000032376864976,2.5446719875632366E-3,1,0,2448.3269415801456,1.570387884600833,3.2792090343962861,1.2609087320054058,1.01158116867028,0.15146281830328118,1.0066672198314686,0.11515542700109067,1.0006086105203005,3.4879851152758337E-2,1.0001631979973062,2.9773607384934446E-2,2.8796988086945712,-115.14931759840003,64.850682401599968,null,1000000000,338891281,null,16.12730079753819,-26.410029563115859,null,2.262989196979925,-89.031854252679807,null,0,0]
[18515,18.515000000000001,22.799873735130532,1.5269223604517428,1.0000032750793242,2.5593242802562544E-3,1,0,2462.4245358349426,1.5703902229679838,3.2963395281983465,1.2625723310314871,1.0117141482279253,0.15232155917886786,1.0067439633782649,0.11581260165231858,1.0006156373599728,3.5080526925252487E-2,1.000165083116223,2.9945040055213212E-2,2.8247546435068309,-115.12509977541625,64.874900224583754,null,1000000000,342805225,null,16.121545416172555,-26.36404856650196,null,2.213199264275731,-89.055292932648655,null,0,0]
[18621,18.620999999999999,22.93015462493301,1.5271717952515211,1.0000033126868411,2.5739765718503491E-3,1,0,2476.5221301030506,1.5703925347128396,3.3134790504799314,1.2642187240887683,1.0118478736634724,0.15318007370567066,1.0068211416497643,0.11646967583532264,1.0006227044946361,3.5281199871187524E-2,1.0001669790655612,3.0116472633361948E-2,2.770164324997852,-115.10168917440355,64.898310825596454,null,1000000000,346741641,null,16.1158575651977,-26.319038905108691,null,2.1636922972946349,-89.078567342696658,null,0,0]
[18729.5,18.729500000000002,23.063509637871661,1.5274241944450515,1.000003351403673,2.5889744352147258E-3,1,0,2490.9522148155606,1.5703948738802589,3.3310320117019416,1.2658863957009052,1.0119855251646948,0.15405860057021439,1.0069005902841921,0.11714214243243518,1.0006299800378411,3.5486602725472383E-2,1.0001689309473962,3.0291948336724835E-2,2.7146480220321498,-115.0785499473742,64.921450052625801,null,1000000000,350794170.25,null,16.110103901332472,-26.273958266015889,null,2.1133074334307103,-89.102223454202772,null,0,0]
[18838,18.838000000000001,23.196866103186096,1.527673691618838,1.0000033903454415,2.603972297414393E-3,1,0,2505.3822995415426,1.5703971861021826,3.3485941398153987,1.2675365792303916,1.0121239575131065,0.15493688779302317,1.0069804941784997,0.11781450261311809,1.0006372977973423,3.5692002584160255E-2,1.0001708941768011,3.0467423942436116E-2,2.6594925192041217,-115.05623132637865,64.943768673621349,null,1000000000,354870244,null,16.104417775918122,-26.229864345928654,null,2.0632123243980338,-89.125713286697021,null,0,0]
[18946.5,18.9465,23.330223995970819,1.5279203365062548,1.0000034295121467,2.6189701584426049E-3,1,0,2519.8123842807659,1.5703994718415328,3.366165291342393,1.2691695394787299,1.0122631703883525,0.15581493411769184,1.007060853224321,0.11848675579486911,1.0006446577722143,3.5897399429985787E-2,1.0001728687539047,3.0642899449926868E-2,2.6046929408496471,-115.03472094438196,64.965279055618041,null,1000000000,358969862.25,null,16.09879762586559,-26.186741927375287,null,2.0134036594663347,-89.149039689659631,null,0,0]
[19055,19.055,23.463583291886255,1.528164177711409,1.0000034689037884,2.6339680182926131E-3,1,0,2534.2424690330049,1.5704017315506884,3.3837453257122734,1.2707855361160532,1.0124031634684483,0.15669273828999003,1.0071416673127076,0.11915890139575828,1.0006520599615252,3.6102793245685126E-2,1.0001748546788383,3.0818374858628136E-2,2.5502445083165131,-115.01400666317332,64.985993336826681,null,1000000000,363093025,null,16.093241928810599,-26.14457608641036,null,1.9638781842021136,-89.17220544786862,null,0,0]
[19165.75,19.165749999999999,23.599709525531562,1.5284102333625456,1.0000035093442892,2.6492768924473533E-3,1,0,2548.9717951873081,1.570404011733765,3.4016989410536405,1.2724178136984829,1.0125468639364414,0.15758849473761469,1.0072246264504991,0.11984487394578375,1.0006596591881227,3.6312443237184397E-2,1.0001768934899384,3.0997489055818655E-2,2.495024241129125,-114.99367148733955,65.006328512660446,null,1000000000,367325973.0625,null,16.087635953487155,-26.102507178682572,null,1.9136144202772294,-89.195688751902637,null,0,0]
[19276.5,19.276499999999999,23.735837171594532,1.5286534667156317,1.0000035500191526,2.6645857653603126E-3,1,0,2563.7011213547116,1.5704062657160025,3.4196615244637156,1.2740329476961176,1.012691376620444,0.15848399625183698,1.0073080594680406,0.12053073318343378,1.0006673023961641,3.6522090035238326E-2,1.0001789441246729,3.1176603148881828E-2,2.4401600715818916,-114.97414092409889,65.02585907590111,null,1000000000,371583452.25,null,16.082094051224502,-26.061404418204862,null,1.8636390349117695,-89.219010344274764,null,0,0]
[19387.25,19.387250000000002,23.871966205912624,1.528893926023799,1.0000035909283784,2.6798946370243165E-3,1,0,2578.4304475349913,1.5704084939464189,3.4376329353605781,1.2756311984875908,1.0128367011727921,0.15937924150584173,1.0073919662475905,0.12121647849168245,1.0006749895846414,3.673173362149159E-2,1.0001810065831829,3.1355717137212372E-2,2.3856472142815197,-114.95540277024392,65.044597229756079,null,1000000000,375865462.5625,null,16.076614726362642,-26.021252836086358,null,1.8139487403756993,-89.242172989651479,null,0,0]
[19498,19.498000000000001,24.008096604871074,1.5291316584470622,1.0000036320719665,2.6952035074321885E-3,1,0,2593.1597737279276,1.5704106968638309,3.4556130360184008,1.2772128213813907,1.012982837244069,0.16027422917521611,1.0074763466707781,0.12190210925413739,1.0006827207525415,3.6941373977590578E-2,1.0001830808656107,3.1534831020204927E-2,2.3314809786517374,-114.93744504998729,65.062554950012711,null,1000000000,380172004,null,16.071196522282211,-25.98203775348728,null,1.7645403047257944,-89.265179390068369,null,0,0]
[19611.75,19.611750000000001,24.147915905340319,1.5293730403040378,1.0000036745740246,2.7109270637594167E-3,1,0,2608.2880884537126,1.5704129335535881,3.4740890866026386,1.2788202406489695,1.0131337762759869,0.16119319076896743,1.0075635057314385,0.12260619251861529,1.0006907071240578,3.715668969736325E-2,1.0001852236451112,3.1718796636236453E-2,2.2762034895604164,-114.91980097674832,65.08019902325168,null,1000000000,384620738.0625,null,16.065693686348968,-25.942720187241807,null,1.7140835692219412,-89.288649111708551,null,0,0]
[19725.5,19.7255,24.287736596593284,1.5296116429797788,1.0000037173233138,2.7266506187461955E-3,1,0,2623.416403192396,1.5704151444469476,3.4925740185419603,1.2804106490112672,1.0132855706343475,0.16211187780987291,1.0076511641882713,0.12331015363158572,1.0006987398877136,3.7372001970372652E-2,1.0001873788980848,3.1902762139851208E-2,2.2212819215346182,-114.90295529716904,65.097044702830956,null,1000000000,389095350.25,null,16.06025233389245,-25.904360065331698,null,1.6639174336618276,-89.311959591629119,null,0,0]
[19839.25,19.83925,24.427558654747884,1.5298475141705421,1.000003760319834,2.7423741723847507E-3,1,0,2638.544717943756,1.5704173299876267,3.511067691561736,1.2819843071606598,1.0134382199348142,0.16303028887093349,1.0077393219109561,0.12401399192730453,1.0007068190423913,3.7587310776738526E-2,1.0001895466246888,3.20867275303931E-2,2.1667114888235317,-114.88689575219719,65.113104247802809,null,1000000000,393595840.5625,null,16.054871007542609,-25.866942394846145,null,1.6140385718806602,-89.335113562587139,null,0,0]
[19953,19.952999999999999,24.567382056465494,1.530080700487978,1.0000038035635852,2.7580977246673072E-3,1,0,2653.6730327075752,1.5704194906092241,3.5295699682616459,1.2835414706589763,1.0135917237911183,0.16394842252786976,1.0078279787684763,0.12471770674074664,1.0007149445869674,3.7802616096582559E-2,1.00019172682508,3.2270692807205965E-2,2.1124875006722803,-114.87161031417179,65.128389685828211,null,1000000000,398122209,null,16.049548288272128,-25.830452476409114,null,1.5644437143783654,-89.35811369519628,null,0,0]
[20069,20.068999999999999,24.709972555845258,1.5303157814447566,1.0000038479173223,2.7741322908651821E-3,1,0,2669.1005888749391,1.5704216687443298,3.548446945181075,1.2851127076253557,1.0137491436629671,0.16488442990762042,1.0079189031835543,0.12543521332901833,1.0007232786308067,3.8022176591717839E-2,1.0001939629968073,3.2458296839820162E-2,2.0575429752698589,-114.85680752032367,65.14319247967633,null,1000000000,402764761,null,16.044179209546659,-25.79418129998076,null,1.5141570143817884,-89.381413048209168,null,0,0]
[20185,20.184999999999999,24.852564405104033,1.5305481648553387,1.0000038925281676,2.7901668556365548E-3,1,0,2684.5281450548205,1.5704238218446436,3.5673325897297241,1.2866673119752463,1.0139074514141453,0.16582014581750265,1.0080103463973464,0.1261525901071168,1.0007316609155192,3.8241733419291109E-2,1.0001962121410044,3.2645900752783182E-2,2.0029491738846845,-114.84278520931665,65.157214790683355,null,1000000000,407434225,null,16.038868215473418,-25.758844967899311,null,1.4641589721209405,-89.404557836436041,null,0,0]
[20301,20.300999999999998,24.995157581139534,1.5307778968615526,1.0000039373961211,2.8062014189731794E-3,1,0,2699.9557012470045,1.5704259503393121,3.5862267649722246,1.2882055390231413,1.0140666466288282,0.16675556875584874,1.0081023082686746,0.12686983637210117,1.0007400914398927,3.8461286558227212E-2,1.0001984742578418,3.2833504545398885E-2,1.9487014114992234,-114.82953133611723,65.170468663882772,null,1000000000,412130601,null,16.033613916868198,-25.724428790270913,null,1.4144462941616296,-89.427550703569437,null,0,0]
[20417,20.417000000000002,25.137752061373448,1.5310050225593983,1.0000039825211828,2.8222359808668107E-3,1,0,2715.3832574512817,1.5704280546477292,3.6051293367826638,1.2897276390424763,1.0142267288891209,0.16769069722398186,1.0081947886556117,0.12758695142182336,1.0007485702027079,3.8680835987453158E-2,1.0002007493474898,3.3021108216971115E-2,1.8947950955943251,-114.81703408421393,65.18296591578607,null,1000000000,416853889,null,16.028414961124358,-25.690918365645597,null,1.3650157430028265,-89.450394233380464,null,0,0]
[20536,20.536000000000001,25.284035661990821,1.5312353601034168,1.0000040290804402,2.8386852281978721E-3,1,0,2731.2098021904353,1.5704301886748808,3.6245293556276015,1.2912726027953074,1.0143918725212138,0.16864970248937219,1.008290199430995,0.12832247546595599,1.0007573183684793,3.8906059542213094E-2,1.0002030967562485,3.3213563581126364E-2,1.8398447389586465,-114.80498770442331,65.195012295576689,null,1000000000,421727296,null,16.023137677660884,-25.657467688056315,null,1.3145966457361002,-89.473676010205239,null,0,0]
[20655,20.655000000000001,25.430320588629403,1.5314630476801665,1.0000040759102764,2.8551344739927592E-3,1,0,2747.0363469418835,1.5704322981124224,3.6439379337777598,1.2928011123923075,1.0145579487762697,0.16960839467090807,1.0083861555835636,0.12905785992566321,1.0007661172974267,3.9131279147979307E-2,1.0002054578178698,3.340601881641176E-2,1.7852442154529089,-114.79371311069481,65.20628688930519,null,1000000000,426629025,null,16.017915866176061,-25.624940416888268,null,1.2644677296256455,-89.496805947793831,null,0,0]
[20774,20.774000000000001,25.576606818536728,1.5316881307355557,1.0000041230106915,2.8715837182425709E-3,1,0,2762.8628917054152,1.5704343833829248,3.6633549351906773,1.2943134222714245,1.0147249571963721,0.17056677216049781,1.0084826569576408,0.12979310404552546,1.0007749669882116,3.9356494782008228E-2,1.0002078325325414,3.3598473922075447E-2,1.7309888549277419,-114.78319826195853,65.216801738041468,null,1000000000,431559076,null,16.01274817908438,-25.593321905995559,null,1.2146256747514237,-89.51978664996237,null,0,0]
[20893,20.893000000000001,25.722894329477722,1.5319106536827483,1.0000041703816851,2.8880329609384061E-3,1,0,2778.6894364808236,1.5704364448993322,3.6827802266345362,1.2958097818022511,1.0148928973213363,0.17152483335341737,1.0085797033967259,0.13052820707101837,1.0007838674394867,3.9581706421558741E-2,1.000210220900452,3.3790928897365458E-2,1.6770740794783148,-114.77343134800954,65.226568651990462,null,1000000000,436517449,null,16.00763330451813,-25.562597799269014,null,1.1650672177336847,-89.542620661355159,null,0,0]
[21014.75,21.014749999999999,25.872563737278487,1.5321357146979857,1.0000042191274168,2.9048623315747961E-3,1,0,2794.8817207484176,1.5704385298928265,3.7026628654071212,1.2973244684420902,1.0150656821834101,0.17250470560070436,1.0086795564461526,0.13128015096259754,1.0007930261056461,3.9812118374047779E-2,1.0002126785920962,3.3987831225868181E-2,1.6222611762945351,-114.76420070857922,65.235799291420776,null,1000000000,441619717.5625,null,16.002453554530149,-25.532074653045584,null,1.1146536610107753,-89.5658331281779,null,0,0]
[21136.5,21.136500000000002,26.022234440513191,1.5323581867814171,1.0000042681563774,2.9216917005657071E-3,1,0,2811.0740050280219,1.5704405908664569,3.7225539083525212,1.2988229713781776,1.0152394413281265,0.17348424337619139,1.0087799797096924,0.13203194556832495,1.0008022379026009,4.0042526097155438E-2,1.0002151505757058,3.4184733416309225E-2,1.5677953722729621,-114.75572867874556,65.244271321254445,null,1000000000,446751632.25,null,15.997326417804906,-25.502458224685725,null,1.0645302259869027,-89.588897252318461,null,0,0]
[21258.25,21.25825,26.171906416957025,1.532578114327602,1.0000043174685669,2.9385210679016048E-3,1,0,2827.2662893194297,1.5704426282329225,3.74245322146685,1.3003055419817078,1.0154141742553235,0.17446344497234714,1.0088809730170689,0.13278359008308613,1.0008115028288838,4.0272929566535207E-2,1.000217636851487,3.4381635467882997E-2,1.513672049229998,-114.7480033267358,65.251996673264202,null,1000000000,451913193.0625,null,15.992250598393715,-25.473734037492459,null,1.0146935933169834,-89.611815577352132,null,0,0]
[21380,21.38,26.321579644890505,1.5327955407223293,1.0000043670639853,2.9553504335729582E-3,1,0,2843.458573622439,1.5704446423955212,3.7623606735261017,1.3017724265871253,1.0155898804623809,0.17544230868539104,1.0089825361971081,0.13353508370276648,1.0008208208830196,4.0503328757843259E-2,1.0002201374196467,3.4578537379783794E-2,1.4598866799864445,-114.74101295123927,65.25898704876073,null,1000000000,457104400,null,15.987224834831775,-25.445887903029583,null,0.96514050019115105,-89.634590589055904,null,0,0]
[21504.5,21.5045,26.474634854379424,1.5330153358323517,1.0000044180725256,2.9725599269224273E-3,1,0,2860.0165974184183,1.5704466784672337,3.7827260634495325,1.3032564741662711,1.0157705613702803,0.17644293106808029,1.0090869825585584,0.13430339462817484,1.0008304043464289,4.0738927588191913E-2,1.0002227092492921,3.4779886622853674E-2,1.4052313122446847,-114.73461279194096,65.265387208059039,null,1000000000,462443520.25,null,15.982136038206905,-25.41830633784674,null,0.91475801477280905,-89.657734351743827,null,0,0]
[21629,21.629000000000001,26.627691328151862,1.5332326041798647,1.0000044693772341,2.9897694185111452E-3,1,0,2876.5746212261174,1.5704486910990372,3.8030996952028882,1.304724624531298,1.0159522589511896,0.17744319654015225,1.0091920244622459,0.13507154606742927,1.0008400433616746,4.0974521893548187E-2,1.0002252960247007,3.4981235718165311E-2,1.350920043932369,-114.72895715304301,65.271042846956988,null,1000000000,467813641,null,15.97709702202598,-25.39161382346003,null,0.86466529701144479,-89.680733333238919,null,0,0]
[21753.5,21.753499999999999,26.780749044531031,1.5334473890671441,1.0000045209781101,3.0069789083289182E-3,1,0,2893.1326450453348,1.5704506806933864,3.8234814370350341,1.3061771255307146,1.0161349726597275,0.17844310329201307,1.0092976617222287,0.13583953716396152,1.0008497379271517,4.121011164789002E-2,1.0002278977460974,3.5182584664856846E-2,1.2969483142997187,-114.72403423567921,65.275965764320787,null,1000000000,473214762.25,null,15.972106542411066,-25.365796078572846,null,0.81485903318865793,-89.703590014530022,null,0,0]
[21878,21.878,26.933807982332723,1.5336597328130857,1.0000045728751543,3.0241883963655529E-3,1,0,2909.690668875875,1.5704526476435756,3.843871159937331,1.3076142200214849,1.0163187019478559,0.17944264951823574,1.009403894151589,0.13660736706231735,1.0008594880412456,4.1445696825198393E-2,1.0002305144137089,3.5383933462066308E-2,1.2433116522077723,-114.71983247034797,65.280167529652033,null,1000000000,478646884,null,15.967163388695644,-25.340839107596828,null,0.76533596600142961,-89.726306820262494,null,0,0]
[22005.25,22.00525,27.090248980683505,1.5338742873178592,1.0000046262245714,3.0417780118048112E-3,1,0,2926.6144322001155,1.5704546350406101,3.8647193741966568,1.3090673845529004,1.016507538416221,0.18046389964099877,1.0095130879188301,0.13739198959108251,1.0008695109202499,4.168648093428122E-2,1.0002332043245032,3.5589729567299271E-2,1.1888319324664058,-114.71627130726652,65.283728692733476,null,1000000000,484231027.5625,null,15.962158727713579,-25.316206104304303,null,0.71500833145730869,-89.74938332543006,null,0,0]
[22132.5,22.1325,27.246691211776501,1.534086378018612,1.0000046798833846,3.0593676253618447E-3,1,0,2943.5381955357821,1.570456599584714,3.8855756619470583,1.3105049520273111,1.0166974346585005,0.18148476933498484,1.0096229030404951,0.13817644191833683,1.0008795918254887,4.1927260206946253E-2,1.0002359098495612,3.5795525514552423E-2,1.1346930776284982,-114.71343977692439,65.286560223075611,null,1000000000,489847556.25,null,15.957201050737897,-25.292443640212159,null,0.66496983654974262,-89.772318656081779,null,0,0]
[22259.75,22.25975,27.403134654498849,1.5342960470933857,1.0000047338515936,3.0769572370257696E-3,1,0,2960.4619588826795,1.5704585416678098,3.9064398938766405,1.3119271663657741,1.0168883900809802,0.18250525668606954,1.0097333393138548,0.13896072313432037,1.0008897307552089,4.2168034615421852E-2,1.0002386309891287,3.600132130290503E-2,1.0808905891286222,-114.71132623456883,65.28867376543117,null,1000000000,495496470.0625,null,15.952289166038877,-25.269537652457558,null,0.61521717787864127,-89.795115228789356,null,0,0]
[22387,22.387,27.559579288216899,1.5345033357633733,1.0000047881291985,3.0945468467857016E-3,1,0,2977.3857222406159,1.5704604616729103,3.9273119433726995,1.3133342665553944,1.0170804040870809,0.18352535978474729,1.0098443965351223,0.13974483233051208,1.0008999277076471,4.2408804131939773E-2,1.0002413677434534,3.6207116931436266E-2,1.0274200564863905,-114.70991926307217,65.290080736927834,null,1000000000,501177769,null,15.947421913800014,-25.247474360626402,null,0.565747108233014,-89.817775405300949,null,0,0]
[22517.5,22.517499999999998,27.720020776799331,1.5347134884657796,1.0000048441144183,3.1125856980279516E-3,1,0,2994.7417231808499,1.5704624081765253,3.9487250605125048,1.3147618516238904,1.0172784210394534,0.1845711155032646,1.009958934912994,0.14054878827485259,1.0009104453557141,4.2655717858083787E-2,1.0002441906135542,3.6418168469963055E-2,0.97292412379847337,-114.70919850254579,65.290801497454211,null,1000000000,507037806.25,null,15.942475525206511,-25.225708676795477,null,0.51530372320377427,-89.840875080602402,null,0,0]
[22648,22.648,27.880463475523143,1.5349212224609015,1.0000049004250395,3.1306245472445243E-3,1,0,3012.0977241322994,1.5704643322482528,3.9701461383321259,1.3161740343631303,1.0174775500588875,0.18561646303801177,1.0100741259246437,0.1413525613689019,1.0009210240243913,4.2902626380050699E-2,1.0002470299067394,3.6629219838438344E-2,0.91876819875751137,-114.70919725510912,65.290802744890883,null,1000000000,512931904,null,15.937573705950847,-25.204800808966798,null,0.46515080460039671,-89.863836164557213,null,0,0]
[22778.5,22.778500000000001,28.040907363616,1.5351265792485838,1.0000049570610627,3.1486633944236785E-3,1,0,3029.4537250947724,1.5704662342736355,3.9915750486668626,1.3175710571586163,1.0176777904925882,0.18666140034466003,1.0101899693468135,0.14215615063683201,1.000931663711744,4.3149529667901018E-2,1.0002498856232804,3.6840271035868503E-2,0.86494779823347412,-114.70990391742275,65.29009608257725,null,1000000000,518860062.25,null,15.932715303193499,-25.184736774432629,null,0.41528502591295569,-89.886661034875118,null,0,0]
[22909,22.908999999999999,28.201352420778139,1.5353295993850682,1.0000050140224872,3.1667022395536763E-3,1,0,3046.8097260680797,1.5704681146294313,4.0130116660431749,1.3189531574563194,1.0178791416846331,0.1877059253840683,1.0103064649550844,0.14295955510421102,1.000942364415826,4.3396427691699067E-2,1.0002527577634506,3.7051322061259759E-2,0.81145852686359754,-114.71130711489049,65.288692885109512,null,1000000000,524822281,null,15.92789919516192,-25.165502873293399,null,0.36570311735073602,-89.909352015201378,null,0,0]
[23042.25,23.042249999999999,28.365179689717785,1.5355345278774484,1.0000050725200078,3.185121211477457E-3,1,0,3064.5314665364872,1.5704700126327917,4.0349078376322911,1.3203492266671928,1.0180858813397924,0.18877203398392359,1.0104260881632359,0.14377969785676123,1.0009533535706059,4.3648523084701227E-2,1.0002557073743452,3.7266820343504106E-2,0.75717927852187361,-114.71344700249534,65.286552997504657,null,1000000000,530945285.0625,null,15.923024105098778,-25.146706270437083,null,0.31536594568933957,-89.932385365653772,null,0,0]
[23175.5,23.1755,28.529008136191546,1.5357371027656521,1.0000051313567886,3.2035401812400706E-3,1,0,3082.2532070158081,1.5704718888106106,4.0568117883943442,1.321730222947765,1.0182937776680596,0.18983770847805731,1.010546390857292,0.14459964588937008,1.0009644063366614,4.3900612926390296E-2,1.0002586741089254,3.7482318444287996E-2,0.70323627042888692,-114.71628982826594,65.283710171734057,null,1000000000,537103800.25,null,15.918190842196179,-25.128747159935752,null,0.26531801945121353,-89.955283854246986,null,0,0]
[23308.75,23.30875,28.692837740029212,1.5359373643485492,1.0000051905328295,3.2219591488290211E-3,1,0,3099.9749475058547,1.5704737435372003,4.0787233929999598,1.3230963839107601,1.0185028299611356,0.19090294671254979,1.0106673727946089,0.14541939816924324,1.0009755227118853,4.4152697184910439E-2,1.0002616579674872,3.7697816362553052E-2,0.64962509232546006,-114.71982418669177,65.280175813308233,null,1000000000,543297826.5625,null,15.913398306317729,-25.111611825619143,null,0.21555603261912429,-89.978049789876209,null,0,0]
[23442,23.442,28.856668481518476,1.5361353520105911,1.0000052500481307,3.240378114231811E-3,1,0,3117.6966880064438,1.5704755771783627,4.1006425287552011,1.324447942312645,1.0187130375073665,0.1919677465392047,1.0107890337312899,0.14623895366513173,1.0009867026941583,4.440477582841007E-2,1.0002646589503275,3.7913314097240719E-2,0.5963414199013507,-114.72403889795311,65.275961102046892,null,1000000000,549527364,null,15.908645427034623,-25.095286829400379,null,0.16607673543752863,-90.000685429044395,null,0,0]
[23578.5,23.578499999999998,29.024496254225177,1.5363358510851868,1.0000053113667973,3.2592463204133503E-3,1,0,3135.8506660909625,1.5704774340530445,4.1231039609437143,1.3258175627323063,1.0189295691816374,0.19305806027629391,1.0109143657943924,0.14707829320118107,1.0009982213097539,4.4662996876098655E-2,1.0002677508840538,3.8134067682782942E-2,0.54209329852632093,-114.72905039844328,65.270949601556723,null,1000000000,555945662.25,null,15.903816654430873,-25.079390126363382,null,0.11568040298709806,-90.023740360024121,null,0,0]
[23715,23.715,29.192325180297345,1.5365340447984261,1.0000053730414749,3.2781145242742377E-3,1,0,3154.0046441861691,1.5704792695519412,4.1455730436777314,1.3271723389343142,1.0191473116275747,0.1941479094139861,1.0110404098605612,0.14791742405123606,1.0010098066684801,4.4921211963872998E-2,1.0002708607882134,3.8354821073434367E-2,0.48817993424932526,-114.73475279743124,65.265247202568759,null,1000000000,562401225,null,15.899027314079843,-25.06431609002216,null,6.5573990029622622E-2,-90.046663192494265,null,0,0]
[23851.5,23.851500000000001,29.360155239956331,1.5367299726686863,1.0000054350721637,3.2969827258010403E-3,1,0,3172.15862229188,1.5704810840420482,4.1680496532297902,1.3285125060514955,1.0193662640692955,0.19523729166185483,1.0111671656635386,0.14875634511182592,1.0010214587680188,4.5179421057507663E-2,1.0002739886631316,3.8575574268056585E-2,0.43459694490689876,-114.74113477866125,65.258865221338752,null,1000000000,568894052.25,null,15.894276346260636,-25.050051138053604,null,1.5754178623829586E-2,-90.069456190626596,null,0,0]
[23988,23.988,29.527986413873023,1.536923673316591,1.0000054974588632,3.3158509249803228E-3,1,0,3190.3126004079163,1.5704828778820072,4.1905336684859487,1.3298382943827756,1.0195864257272731,0.19632620473586834,1.0112946329356971,0.14959505528121264,1.0010331776060402,4.5437624122781947E-2,1.0002771345091355,3.8796327265510994E-2,0.38134003362087271,-114.74818525129002,65.251814748709975,null,1000000000,575424144,null,15.889562720021914,-25.036581964984538,null,-3.3782292633648334E-2,-90.092121567155402,null,0,0]
[24127.75,24.127749999999999,29.699814702764481,1.5371197178995084,1.0000055616997869,3.3351683645511548E-3,1,0,3208.8988161086577,1.5704846934049106,4.2135605659357784,1.3311809882457237,1.0198130812569783,0.1974405558703036,1.0114258719424674,0.1504535151089102,1.0010452446024831,4.5701968598990041E-2,1.000280373874582,3.9022336081259788E-2,0.32714851715997173,-114.75608479763787,65.243915202362132,null,1000000000,582148320.0625,null,15.884774503101225,-25.023602912143392,null,-8.4208011511189687E-2,-90.115196637896091,null,0,0]
[24267.5,24.267499999999998,29.87164411999116,1.5373135070915862,1.0000056263138761,3.3544858016328516E-3,1,0,3227.4850318198537,1.5704864880176006,4.2365949771220262,1.3325090840002098,1.0200410026048885,0.19855441039875193,1.0115578561291179,0.15131175155186374,1.0010573815482786,4.5966306683777713E-2,1.0002836320777675,3.924834468792418E-2,0.27328994058336836,-114.76466222050463,65.235337779495367,null,1000000000,588911556.25,null,15.88002332862105,-25.01143061781281,null,-0.13434347963298265,-90.138142472423326,null,0,0]
[24407.25,24.407250000000001,30.043474646193005,1.5375050795765626,1.0000056913011306,3.3738032362109972E-3,1,0,3246.0712475413261,1.5704882620792577,4.259636780150851,1.3338228138209234,1.0202701889226784,0.19966776589110241,1.0116905852040023,0.15216976343344737,1.001069588440882,4.6230638340437079E-2,1.0002869091190492,3.947435308428171E-2,0.21975995649582936,-114.7739063169837,65.226093683016302,null,1000000000,595713852.5625,null,15.875308178113318,-25.000051660707381,null,-0.18419202100006454,-90.160961287082827,null,0,0]
[24547,24.547000000000001,{"$f":"SQRT(1+(A333/pole1)^2)","v":30.215306262450209},{"$f":"ATAN(A333/pole1)","v":1.5376944731588713},{"$f":"SQRT(1+(A333/Zero1)^2)","v":1.0000057566615506},{"$f":"ATAN(A333/Zero1)","v":3.3931206682711744E-3},{"$f":"IF(VIN_nom>Vout, 1, SQRT(1+(A333/z_RHP)^2))","v":1},{"$f":"IF(VIN_nom>Vout, 0, -ATAN(A333/z_RHP))","v":0},{"$f":"SQRT(1+(A333/Pole2)^2)","v":3264.657463272898},{"$f":"ATAN(A333/Pole2)","v":1.5704900159408828},4.2826858557129821,1.3351224050851369,{"$f":"SQRT(1+(A333/pole4)^2)","v":1.0205006393580784},{"$f":"ATAN(A333/pole4)","v":0.20078061992436977},{"$f":"SQRT(1+(A333/Zero3)^2)","v":1.011824058873982},{"$f":"ATAN(A333/Zero3)","v":0.15302754957897341},{"$f":"SQRT(1+(A333/pole5)^2)","v":1.0010818652777351},{"$f":"ATAN(A333/pole5)","v":4.64949635322656E-2},{"$f":"SQRT((1-(Z333/pterm2))^2+(A333/pterm1)^2)","v":1.0002902049987861},{"$f":"IF((ATAN((A333/pterm1)/(1-A333^2/pterm2))>0),ATAN((A333/pterm1)/(1-A333^2/pterm2)),PI()+ATAN((A333/pterm1)/(1-A333^2/pterm2)))","v":3.9700361269109738E-2},{"$f":"20*LOG10(((E333*K333*G333*O333)/(C333*I333*S333*M333*Q333))*Adc)","v":0.16655430194423396},{"$f":"((F333+L333+H333+R333)-(D333+J333+T333+N333+T333))*radconv","v":-114.78380610859922},{"$f":"IF(V333>0,V333,V333+180)","v":65.216193891400778},null,{"$f":"IF(U333<0,A333,1000000000)","v":1000000000},{"$f":"A333^2","v":602555209},null,{"$f":"20*LOG10((K333/(I333*M333))*AEA)","v":15.870628060894941},{"$f":"(L333-(J333+N333))*radconv","v":-24.989452894353064},null,{"$f":"20*LOG10((E333*G333/(C333*S333))*Acs*Am)","v":-0.23375690293222118},{"$f":"(F333+H333-(D333+T333))*radconv","v":-90.183655247839894},null,{"$f":"SUM((U334<0)*(U333>0))*A333","v":0},0]
[24690,{"$f":"A334/1000","v":24.69},30.391135071893853,1.5378860542833297,1.0000058239282639,3.4128873403158778E-3,1,0,3283.6759165898984,1.5704917900376592,4.3062783626613381,1.3364378161052606,1.0207377567693128,0.20191883267644375,1.0119614070461329,0.15390504934453134,1.0010945000228171,4.6765429091200496E-2,1.0002935970279705,3.9931625237994775E-2,0.11244267695176752,-114.79460365066623,65.205396349333768,null,1000000000,609596100,null,15.865874363361257,-24.97940182970304,null,-0.28418417557433823,-90.20674994021951,null,0,0]
[24833,24.832999999999998,30.566964983960492,1.538075431355991,1.0000058915857006,3.4326540096935956E-3,1,0,3302.6943699171152,1.5704935437022836,4.3298782395826461,1.3377388901363065,1.0209761959599259,0.20305651526451957,1.0120995342226367,0.1547823102703233,1.0011072079977301,4.7035887803383074E-2,1.0002970087827732,4.0162888982806573E-2,5.8661872650588157E-2,-114.80606517876348,65.193934821236525,null,1000000000,616677889,null,15.861155334134835,-24.970140667183376,null,-0.33432118730624294,-90.229718337047501,null,0,0]
[24976,24.975999999999999,30.742795979731145,1.538262642180855,1.0000059596338609,3.4524206763888823E-3,1,0,3321.7128232543728,1.5704952772857084,4.3534853666209008,1.3390258559676325,1.0212159560040688,0.20419366511593531,1.0122384400845912,0.15565933110414437,1.001119989199686,4.7306339629507844E-2,1.0003004402635858,4.0394152502234507E-2,5.2075823866286394E-3,-114.81817962504427,65.181820374955734,null,1000000000,623800576,null,15.856469996499934,-24.961656170834882,null,-0.38417126268473156,-90.252562604259353,null,24976,65.181820374955734]
[25119,25.119,30.918628040717074,1.5384477237025815,1.0000060280727445,3.4721873403862906E-3,1,0,3340.7312766014998,1.5704969911308946,4.3770996264693629,1.3402989376405823,1.0214570359716348,0.20533027966594913,1.0123781243114722,0.15653611059595227,1.0011328436258802,4.7576784530275341E-2,1.0003038914708016,4.0625415794967791E-2,-4.7924417054883019E-2,-114.83093614446194,65.169063855538056,null,25119,630964161,null,15.851817400506622,-24.953935376735441,null,-0.43373766956704385,-90.275284858553931,null,0,0]
[25265.25,25.265250000000002,31.098457367881238,1.5386348468076372,1.0000060984712018,3.4924032439406314E-3,1,0,3360.181967534731,1.5704987238601678,4.4012578322045881,1.3415868205626125,1.021704959317288,0.20649217001165709,1.0125217879452491,0.15743256596198144,1.0011460659346145,4.7853368701871762E-2,1.0003074415189468,4.0861934835779025E-2,-0.10193491685442006,-114.84463563780844,65.155364362191563,null,25265.25,638332857.5625,null,15.847091967119537,-24.946815811928456,null,-0.48414052105547306,-90.298399479609671,null,0,0]
[25411.5,25.4115,31.278287771438556,1.5388198182397228,1.0000061692783442,3.5126191446403915E-3,1,0,3379.6326584779345,1.570500436644799,4.4254232583437014,1.342860640374645,1.0219542612832662,0.20765349504679206,1.0126662650429077,0.15832876625347822,1.0011593648277992,4.8129945546617821E-2,1.0003110122011796,4.1098453636700165E-2,-0.1556169868399723,-114.85898446604332,65.141015533956676,null,25411.5,645744332.25,null,15.842398852791268,-24.94046847131829,null,-0.53425340129069676,-90.321390805304063,null,0,0]
[25557.75,25.557749999999999,31.458119232929416,1.5390026748864172,1.0000062404941716,3.5328350424690472E-3,1,0,3399.0833494309391,1.570502129827178,4.4495957872462633,1.3441206221032849,1.0222049408608893,0.20881425205361753,1.0128115552563273,0.15922471014029949,1.0011727403023825,4.8406515022492991E-2,1.0003146035179284,4.1334972196328236E-2,-0.20897488761692171,-114.87397171574486,65.126028284255142,null,25557.75,653198585.0625,null,15.83773712275705,-24.934880325732845,null,-0.58407963024444154,-90.344260949060256,null,0,0]
[25704,25.704000000000001,31.637951734313802,1.539183452797185,1.0000063121186842,3.5530509374100748E-3,1,0,3418.5340403935779,1.5705038037419021,4.4737753037801467,1.3453669860882129,1.0224569970368946,0.20997443832317761,1.0129576582356279,0.16012039629470978,1.0011861923552947,4.8683077087483491E-2,1.0003182154696242,4.157149051326002E-2,-0.26201279749458112,-114.88958669406806,65.110413305931942,null,25704,660695616,null,15.833105867975288,-24.930038614597606,null,-0.63362247128735816,-90.367011976280978,null,0,0]
[25853.75,25.853750000000002,31.82208897859929,1.5393664398606648,1.0000063858807602,3.5737506285369023E-3,1,0,3438.4502179873562,1.570505498092807,4.498540598197458,1.3466292924366829,1.0227165106723572,0.21116179552541234,1.0131080995040462,0.16103724923096749,1.001200045683678,4.8966250008894326E-2,1.0003219352432402,4.1813668844661776E-2,-0.31599270107933891,-114.90621486427807,65.09378513572193,null,25853.75,668416389.0625,null,15.82839443442321,-24.925841423991283,null,-0.68406066131392085,-90.390186154090372,null,0,0]
[26003.5,26.003499999999999,32.006227276163578,1.5395473214069868,1.0000064600713161,3.5944503166011757E-3,1,0,3458.3663955908914,1.5705071729287217,{"$f":"SQRT(1+(A343/Zero2)^2)","v":4.5233129821699718},{"$f":"ATAN(A343/Zero2)","v":1.3478777744579757},1.022977465418339,0.21234854862619582,1.0132593921573854,0.16195382914166856,1.0012139792929673,4.924941507133726E-2,1.0003256766521993,4.2055846918633642E-2,-0.36964572550744396,-114.92347916321562,65.076520836784383,null,26003.5,676182012.25,null,15.823713102405712,-24.922400578397554,null,-0.7342084856537594,-90.413239680078647,null,0,0]
[26153.25,26.15325,32.190366608931477,1.5397261335569337,1.0000065346903519,3.6151500015851571E-3,1,0,3478.2825732040174,1.5705088285848663,4.5480923398522952,1.3491126541850369,1.0232398601722696,0.21353469474619469,1.0134115358143345,0.16287013460936772,1.0012279931798109,4.9532572229731606E-2,1.0003294396969717,4.2298024733668421E-2,-0.42297610160539451,-114.94136879554262,65.058631204457384,null,26153.25,683992485.5625,null,15.819060974618957,-24.919703210498767,null,-0.7840692714076325,-90.436174623728832,null,0,0]
[26303,26.303000000000001,32.374506959238921,1.5399029116100316,1.0000066097378673,3.6358496834711087E-3,1,0,3498.1987508265688,1.5705104653888278,4.5728785578777318,1.3503341490048817,1.0235036938266286,0.21472023101585205,1.0135645300916671,0.16378616421931189,1.0012420873408381,4.9815721439004278E-2,1.0003332243780316,4.2540202288258631E-2,-0.4759879786325879,-114.95987318518102,65.040126814818976,null,26303,691847809,null,15.81443717858885,-24.91773671929225,null,-0.83364628890835968,-90.458993007469445,null,0,0]
[26456,26.456,32.562644710697043,1.5400814613403242,1.0000066868566562,3.6569986039829295E-3,1,0,3518.5471660364747,1.5705121185787569,4.5982096770644523,1.3515685513385001,1.0237747383444311,0.21593086396516656,1.0137217228903974,0.16472178789959122,1.0012565702879879,5.0105007533062282E-2,1.0003371135436425,4.278763551254576E-2,-0.52982565444474361,-114.97940330936378,65.020596690636225,null,26456,699919936,null,15.809741411346304,-24.916469554694238,null,-0.88400953941857674,-90.482188289051294,null,0,{"$f":"IF(AH346>0,W346,0)","v":0}]
[26609,26.609000000000002,32.750783488325695,1.5402579596976014,1.0000067644227248,3.6781475212233554E-3,1,0,3538.8955812558852,1.570513752757221,4.623547725989452,1.3527894259279891,1.024047282543818,0.2171408542813289,1.0138798028170597,0.16565712064132657,1.0012711370243117,5.0394285234119249E-2,1.0003410252958769,4.3035068461778563E-2,-0.58333936156871657,-114.99955352128411,65.000446478715887,null,26609,708038881,null,15.805073453586076,-24.915939563297915,null,-0.93408329683901015,-90.505266020045013,null,0,0]
[26762,26.762,32.938923274541217,1.540432441821727,1.0000068424360733,3.6992964351734671E-3,1,0,3559.2439964846394,1.5705153682502888,4.6488925913444268,1.3539969903557152,1.0243213252277155,0.2183501989356838,1.0140387694567674,0.16659216094441992,1.0012857875461527,5.0683554494128084E-2,1.0003449596352483,4.3282501134348353E-2,-0.63653327476952526,-115.02031321547952,64.979686784520482,null,26762,716204644,null,15.800432450046975,-24.916134123705159,null,-0.98387087369353809,-90.528228213725384,null,0,0]
[26915,26.914999999999999,33.127064052159277,1.5406049420547745,1.0000069208967011,3.720445345814347E-3,1,0,3579.5924117225763,1.5705169653766156,4.6742441622484572,1.3551914576408473,1.0245968651937514,0.21955889491036173,1.0141986223925676,0.16752690731175679,1.001300521849833,5.0972815265050209E-2,1.0003489165622732,4.3529933528646134E-2,-0.68941148864901591,-115.04167200242203,64.958327997577967,null,26915,724417225,null,15.79581756922137,-24.91704087616305,null,-1.0333755260635802,-90.551076837657192,null,0,0]
[27071.75,27.071750000000002,33.319817133936709,1.54077964997519,1.0000070017442413,3.7421126086565216E-3,1,0,3600.4395626374708,1.5705185829262773,4.7002239358309366,1.356401836538714,1.0248807101066637,0.2207965399194278,1.014363312001092,0.16848425773662865,1.0013157041717595,5.1269156906797252E-2,1.0003529938982136,4.3783430152143192E-2,-0.7432625353258735,-115.06416494601309,64.935835053986906,null,27071.75,732879648.0625,null,15.791115824337794,-24.918695788029169,null,-1.0838034629842321,-90.574369708103873,null,0,0]
[27228.5,27.2285,33.512571221031081,1.5409523481674947,1.0000070830612553,3.7637798679850593E-3,1,0,3621.2867135616775,1.5705201818520054,4.7262105196128203,1.3575989068858287,1.025166124025422,0.2220334976830857,1.0145289309913823,0.16944129646888698,1.0013309744249268,5.1565489536173167E-2,1.0003570949437217,4.4036926480140209E-2,-0.79679066923406561,-115.08726530383188,64.912734696168116,null,27228.5,741391212.25,null,15.786439804643624,-24.921072780351466,null,-1.1339411795223973,-90.597547412882108,null,0,0]
[27385.25,27.385249999999999,33.705326296194762,1.5411230711011858,1.0000071648477424,3.7854471237796163E-3,1,0,3642.1338644950361,1.5705217624736034,4.7522038018730068,1.3587828836056255,1.0254531056399239,0.22326976499151399,1.0146954789083567,0.17039802190843886,1.0013463326053116,5.1861813101547735E-2,1.0003612196993628,4.4290422510905911E-2,-0.85000004483863456,-115.11096257380443,64.889037426195571,null,27385.25,749951917.5625,null,15.78178868866555,-24.924159373338409,null,-1.1837920010221352,-90.620611926850586,null,0,0]
[27542,27.542000000000002,33.898082342572351,1.5412918524622061,1.0000072471037029,3.8071143760198493E-3,1,0,3662.9810154373904,1.5705233251035946,4.7782036732929454,1.359953977092297,1.0257416536343418,0.22450533864691549,1.01486295529468,0.17135443245853282,1.0013617787088687,5.2158127551300247E-2,1.0003653681657052,4.4543918242708667E-2,-0.90289473693385369,-115.13524646874026,64.864753531259737,null,27542,758561764,null,15.777161677898873,-24.927943346976686,null,-1.2333591960896642,-90.643565179973621,null,0,0]
[27702.5,27.702500000000001,34.095450766759278,1.5414626942357363,1.000007331813964,3.8292999798726986E-3,1,0,3684.3269020573839,1.5705249067936693,4.8048322669858869,1.3611399530399897,1.02603872634851,0.22576974941007605,1.0150353998664221,0.17233339570019052,1.0013776854356553,5.2461521364236409E-2,1.0003696404465998,4.480347815411715E-2,-0.95673296053048862,-115.16070863784682,64.839291362153176,null,27702.5,767428506.25,null,15.772448139593489,-24.9325279550409,null,-1.283821679227267,-90.666954238575926,null,0,0]
[27863,27.863,34.292820174632261,1.5416315694835736,1.0000074170164295,3.8514855799559595E-3,1,0,3705.6727886864883,1.5705264702616404,4.831467544361697,1.3623128543476239,1.0263374384751349,0.22703342618737771,1.0152088168856359,0.17331202542830232,1.0013936843341271,5.2764905510675017E-2,1.0003739375874663,4.5063037748411659E-2,-1.0102496629758391,-115.18676467441091,64.813235325589091,null,27863,776346769,null,15.767758249930431,-24.937818586458345,null,-1.3339935619081702,-90.690230605602309,null,0,0]
[28023.5,28.023499999999999,34.490190549303925,1.5417985119563764,1.0000075027110995,3.8736711762477932E-3,1,0,3727.0186753245475,1.5705280158205999,4.8581093954876406,1.3634728928650683,1.0266377885831981,0.22829636558539607,1.0153832058540693,0.17429031993973357,1.001409775399867,5.3068279935232596E-2,1.000378259588925,4.5322597023732175E-2,-1.063448971924188,-115.21340420057064,64.786595799429364,null,28023.5,785316552.25,null,15.763091221842672,-24.94380292663562,null,-1.3838781763562187,-90.71339621471769,null,0,0]
[28184,28.184000000000001,34.687561874271168,1.541963554637078,1.0000075888979738,3.8958567687263613E-3,1,0,3748.3645619714084,1.5705295437765083,4.8847577128024788,1.3646202759594799,1.0269397752355138,0.22955856422407486,1.0155585662710209,0.17526827753508281,1.0014259586284313,5.3371644582536376E-2,1.0003826064516004,4.5582155978218235E-2,-1.1163349360197519,-115.24061705167408,64.759382948325921,null,28184,794337856,null,15.758446290413335,-24.950468918177091,null,-1.4334787978967614,-90.736452955599617,null,0,0]
[28348,28.347999999999999,34.889238211649165,1.5421302675297719,1.0000076774727338,3.9185261552101246E-3,1,0,3770.1759352519025,1.5705310871803801,4.9119937158104428,1.3657798186634145,1.0272500362299855,0.23084751877496626,1.0157387536792484,0.1762672115274817,1.0014425899570527,5.3681614501289075E-2,1.0003870737866722,4.5847374763479387E-2,-1.1700546395197811,-115.26900518582174,64.73099481417826,null,28348,803609104,null,15.753722118905822,-24.957972101363222,null,-1.4838710526713719,-90.75990195764156,null,0,0]
[28512,28.512,35.09091550756429,1.5422950641358537,1.0000077665613989,3.9411955376663982E-3,1,0,3791.9873085412742,1.570532612829046,4.9392362503459699,1.3669265718963919,1.0275620028693275,0.23213569281472368,1.0159199543016806,0.17726579017406152,1.0014593175024296,5.3991574094861709E-2,1.0003915670804024,4.6112593209832187E-2,-1.2234554857013054,-115.29797112323465,64.702028876765354,null,28512,812934144,null,15.749019471290975,-24.966162329965972,null,-1.5339735313283636,-90.783241145360932,null,0,0]
[28676,28.675999999999998,35.292593745584043,1.5424579772979441,1.0000078561639687,3.9638649160718834E-3,1,0,3813.798681839372,1.5705341210271353,4.9664852089273968,1.3680607431281722,1.0278756736005195,0.23342308278079879,1.0161021675962609,0.17826401167397879,1.0014761412597402,5.4301523304214436E-2,1.0003960863334684,4.6377811315290535E-2,-1.2765415510331377,-115.32750467500621,64.67249532499379,null,28676,822312976,null,15.744337598644506,-24.975027530178728,null,-1.5837895523246512,-90.806472400388799,null,0,0]
[28840,28.84,35.494272909649347,1.5426190391126196,1.0000079462804434,3.9865342904032821E-3,1,0,3835.6100551460459,1.5705356120723488,4.9937404863939383,1.3691825354302147,1.0281910468639563,0.23470968512537457,1.0162853930182927,0.179261874230525,1.0014930612241359,5.4611462070319375E-2,1.0004006315465521,4.6643029077867861E-2,-1.3293168342545636,-115.35759586193498,64.642404138065018,null,28840,831745600,null,15.739675773222556,-24.984555880645932,null,-1.6333223775266639,-90.829597561611024,null,0,0]
[29008,29.007999999999999,35.700872021511714,1.5427821424225396,1.0000080391277395,4.0097565720550342E-3,1,0,3857.9534131762571,1.5705371220031066,5.0216669711186439,1.3703190607888738,1.0285158758474642,0.23602684765070364,1.0164741362384651,0.18028370084223955,1.001510493620966,5.4928949428410354E-2,1.0004053145367038,4.6914715208757257E-2,-1.3830611751350714,-115.38898896609481,64.611011033905186,null,29008,841464064,null,15.734920292199451,-24.994992140591034,null,-1.683773031072209,-90.853178622843899,null,0,0]
[29176,29.175999999999998,35.907472072184341,1.5429433688486871,1.0000081325143142,4.0329788493820478E-3,1,0,3880.2967712151631,1.5705386145450275,5.0495998705293221,1.3714430137388076,1.0288424880922209,0.23734317617619402,1.016663940394678,0.18130514698416247,1.0015280269647533,5.5246425702257386E-2,1.0004100247701191,4.7186400975614218E-2,-1.4364876419910759,-115.42094669132999,64.579053308670012,null,29176,851238976,null,15.730184367476795,-25.006099965517326,null,-1.7339332587052281,-90.876652125948098,null,0,0]
[29344,29.344000000000001,36.114073045555116,1.5431027505943724,1.0000082264401673,4.0562011223592744E-3,1,0,3902.6401292626138,1.5705400899967752,5.0775390787592691,1.3725545989560195,1.0291708819004477,0.23865866693638754,1.016854804892835,0.18232621073849023,1.0015456612501963,5.5563890828446649E-2,1.0004147622475428,4.7458086376301813E-2,-1.4896002922690501,-115.45345896044044,64.546541039559557,null,29344,861070336,null,15.725467281510237,-25.017867429720962,null,-1.7838063903804762,-90.900019915916431,null,0,0]
[29512,29.512,36.320674925878414,1.5432603191305614,1.0000083209052988,4.0794233909616706E-3,1,0,3924.9834873184636,1.5705415486502114,5.1054844922355072,1.3736540167590281,1.0295010555672768,0.23997331618221543,1.0170467291359671,0.18334689019204412,1.0015633964719635,5.5881344743577789E-2,1.0004195269697245,4.7729771408682613E-2,-1.5424031061506533,-115.48651590447969,64.513484095520312,null,29512,870958144,null,15.720768337209565,-25.030282857712884,null,-1.8333956991972324,-90.923283795781359,null,0,0]
[29684,29.684000000000001,36.532196822123339,1.5434197929328057,1.0000084181782911,4.1031985661627995E-3,1,0,3947.858830098482,1.5705430249283077,5.1341015955122593,1.3747672104821598,1.029840932653703,0.24131839089599513,1.0172443202709534,0.18439147140971671,1.0015816585251192,5.6206345404439174E-2,1.0004244333639678,4.8007924748513085E-2,-1.596146217158928,-115.52091410840521,64.479085891594792,null,29684,881139856,null,15.715975600881569,-25.043653244345894,null,-1.8838750254748529,-90.94699576685349,null,0,0]
[29856,29.856000000000002,36.743719636754307,1.5435774306512298,1.0000085160165468,4.1269737367251652E-3,1,0,3970.7341728870047,1.5705444841967697,5.1627249904330803,1.375868061926881,1.0301826717237195,0.2426625756460489,1.0174430209401732,0.18543564576516963,1.0016000263669036,5.6531334179577543E-2,1.0004293683173877,4.8286077697753754E-2,-1.6495727654796912,-115.55586294370372,64.444137056296285,null,29856,891380736,null,15.711200464504159,-25.057678825696506,null,-1.9340636188614031,-90.970602515958419,null,0,0]
[30028,30.027999999999999,36.955243354001496,1.5437332638059555,1.0000086144200659,4.1507489026218888E-3,1,0,3993.6095156838869,1.5705459267478907,5.191354572927902,1.3769567726004301,1.0305262709249343,0.24400586646274736,1.017642830493698,0.18647941122047249,1.0016184999914965,5.6856311000999547E-2,1.0004343318308024,4.856423025410924E-2,-1.7026867832383328,-115.59135246376927,64.408647536230731,null,30028,901680784,null,15.706442242403014,-25.072347845554521,null,-1.9839648149402767,-90.994105848936115,null,0,0]
[30200,30.2,37.166767958453953,1.5438873231999075,1.0000087133888484,4.1745240638260935E-3,1,0,4016.4848584889842,1.5705473528673046,5.2199902411875314,1.3780335397049175,1.0308717283973508,0.24534825939464355,1.0178437482784835,0.18752276574285442,1.0016370793930454,5.7181275800726933E-2,1.0004393239050353,4.8842382415283547E-2,-1.7554922259199655,-115.6273729282284,64.372627071771603,null,30200,912040000,null,15.701700268605176,-25.087648795035694,null,-2.0335818923076161,-91.017507530534132,null,0,0]
[30375.75,30.37575,37.382905191962571,1.5440429405762859,1.0000088150992641,4.1988175739605636E-3,1,0,4039.8589369740457,1.5705487933968714,5.2492564162212094,1.3791216466256677,1.0312266351877246,0.24671898805992093,1.0180501905932036,0.18858844124112809,1.0016561731240028,5.7513313100405347E-2,1.0004444543206019,4.9126598529848672E-2,-1.8091342474831782,-115.66471723273654,64.335282767263465,null,30375.75,922686188.0625,null,15.69687101932281,-25.103924364478768,null,-2.0839906123873662,-91.041316217680631,null,0,0]
[30551.5,30.551500000000001,37.599043320356202,1.5441967688231468,1.0000089173998596,4.223111079138934E-3,1,0,4063.2330154673937,1.5705502173529109,5.2785287373311327,1.3801976865158732,1.0315834782114777,0.24808877097867971,1.0182577886015793,0.18965368341809594,1.0016753772821023,5.7845337705024653E-2,1.0004496145576998,4.9410814226964667E-2,-1.8624622051706909,-115.70259596054035,64.29740403945965,null,30551.5,933394152.25,null,15.692057388958393,-25.120836186966862,null,-2.1341094341865978,-91.065022371622575,null,0,0]
[30727.25,30.727250000000002,37.815182328290305,1.5443488386113553,1.0000090202906344,4.2474045793325322E-3,1,0,4086.6070939688871,1.570551625019809,5.3078071028312896,1.3812618565515253,1.031942255459976,0.24945760399444492,1.0184665415969021,0.19071849012192937,1.0016946918609928,5.8177349542112095E-2,1.0004548046172221,4.9695029504180324E-2,-1.915480083216671,-115.74099935361761,64.25900064638239,null,30727.25,944163892.5625,null,15.687258726712024,-25.138372743293484,null,-2.1839416793389748,-91.088627749532236,null,0,0]
[30903,30.902999999999999,38.031322200769125,1.5444991799148706,1.0000091237715887,4.2716980745126851E-3,1,0,4109.9811724783849,1.5705530166754822,5.3370914132462248,1.3823143496899257,1.0323029649164985,0.25082548297074286,1.0186764488691122,0.19178285920650853,1.0017141168542874,5.8509348539211775E-2,1.0004600245000679,4.9979244359043717E-2,-1.9681917904076669,-115.7799178565037,64.220082143496299,null,30903,954995409,null,15.682474400608758,-25.156522756740554,null,-2.2334906128037986,-91.112134068652168,null,0,0]
[31083,31.082999999999998,38.252689665090763,1.5446513957043191,1.0000092303666868,4.2965790316326288E-3,1,0,4133.9204847580058,1.5705544256713893,5.3670899397159388,1.3833803877366371,1.0326743978212238,0.25222544687590248,1.0188926278732371,0.19287251108852529,1.0017341260293116,5.884936257638012E-2,1.0004654015252934,5.0270331679000614E-2,-2.0218648170601075,-115.82030165740717,64.179698342592829,null,31083,966152889,null,15.677588598698486,-25.175736028640703,null,-2.2839474246614064,-91.136107892060295,null,0,0]
[31263,31.263000000000002,38.474058005514692,1.5448018598880353,1.0000093375808523,4.3214599834328444E-3,1,0,4157.8597970457377,1.5705558184424142,5.3970944977380313,1.3844345739258639,1.0330478532056737,0.25362440132405051,1.0191100161364972,0.19396169939196048,1.0017542510097286,5.9189362991268625E-2,1.0004708098355863,5.0561418550723616E-2,-2.0752247510506319,-115.86120612230511,64.138793877694894,null,31263,977375169,null,15.672716550736855,-25.195569594711184,null,-2.3341138126923098,-91.159981330475375,null,0,0]
[31443,31.443000000000001,38.695427207004933,1.5449506025209601,1.0000094454140853,4.3463409298825249E-3,1,0,4181.799109341443,1.5705571952672015,5.4271049872734967,1.3854771025080463,1.0334233288772159,0.25502234193683637,1.0193286128852102,0.19505042182996507,1.0017744917885592,5.9529349706092353E-2,1.0004762494319281,5.085250497157659E-2,-2.128275557731953,-115.902621612749,64.097378387250998,null,31443,988662249,null,15.667857635280239,-25.216012090325741,null,-2.3839931079055567,-91.18375610576939,null,0,0]
[31623,31.623000000000001,38.916797254867561,1.5450976529744975,1.0000095538663856,4.3712218709508694E-3,1,0,4205.7384216449864,1.5705585564180524,5.4571213104643572,1.3865081635624421,1.0338008226345496,0.25641926435810336,1.0195484173420588,0.19613867612206337,1.001794848358784,5.9869322643085338E-2,1.0004817203153069,5.1143590938922734E-2,-2.1810211274692897,-115.94453869102465,64.055461308975353,null,31623,1000014129,null,15.663011249037543,-25.237052390757423,null,-2.4335885844194722,-91.2074339006505,null,0,0]
[31807,31.806999999999999,39.143087496969017,1.5452462520999151,1.0000096653685924,4.3966557162266147E-3,1,0,4230.2097186743467,1.5705599318935046,5.4878105929391223,1.3875504781402768,1.0341887886945704,0.257846172604697,1.0197743537925019,0.19725062760869636,1.0018157769695843,6.021683621278718E-2,1.0004873451125691,5.1441145011839016E-2,-2.2346273083509045,-115.98789606903705,64.012103930962951,null,31807,1011685249,null,15.658069505489722,-25.259166793768269,null,-2.4839961841514451,-91.231539343967754,null,0,0]
[31991,31.991,39.369378593480086,1.545393142963887,1.0000097775176857,4.4220895558141019E-3,1,0,4254.6810157116188,1.5705612915465397,5.5185057711635821,1.3885811986483256,1.0345788588506504,0.25927200777016574,1.0200015505692817,0.19836208511336151,1.0018368265602862,6.0564335221240266E-2,1.0004930026049583,5.1738698605294522E-2,-2.2879225244365924,-116.03175825224959,63.968241747750412,null,31991,1023424081,null,15.653139634917698,-25.281883098468658,null,-2.53411395299787,-91.255546883968591,null,0,0]
[32175,32.174999999999997,39.595670529751786,1.5455383548485089,1.0000098903136654,4.4475233896804295E-3,1,0,4279.1523127566661,1.5705626356486102,5.5492067473015432,1.389600515310683,1.0349710307237521,0.26069676527363728,1.0202300068304058,0.19947304622094608,1.0018579971232637,6.0911819585440202E-2,1.000498692793548,5.2036251716470423E-2,-2.3409107002977994,-116.07611577688816,63.923884223111841,null,32175,1035230625,null,15.648221047976199,-25.305190158909248,null,-2.5839452121673472,-91.279458198233883,null,0,0]
[32359,32.359000000000002,39.821963291468059,1.5456819163705677,1.0000100037565314,4.4729572177926932E-3,1,0,4303.6236098093559,1.570563964464994,5.5799134256517346,1.3906086142601544,1.0353653019256335,0.26212044055866152,1.02045972172997,0.20058350852339549,1.0018792886508481,6.1259289222403729E-2,1.0005044156794174,5.2333804342547106E-2,-2.3935956865266528,-116.12095937651689,63.879040623483107,null,32359,1047104881,null,15.643313172687117,-25.329077064599762,null,-2.6334932261967552,-91.303274926225072,null,0,0]
[32547.5,32.547499999999999,40.053791228377072,1.5458273067459225,1.0000101206446255,4.4990130628738247E-3,1,0,4328.6933896781902,1.5705653101996166,5.6113768977856688,1.3916299256176037,1.0357713900933918,0.26357780700845029,1.0206963589562572,0.20172060910839829,1.0019012263254206,6.1615241399459682E-2,1.0005103124348553,5.2638633564903357E-2,-2.447258711204968,-116.16739426121798,63.832605738782021,null,32547.5,1059339756.25,null,15.638295795354765,-25.354138285968858,null,-2.6839626462889061,-91.327577719100958,null,0,0]
[32736,32.735999999999997,40.285620002213051,1.5459710237891138,1.0000102382116334,4.5250689018460927E-3,1,0,4353.7631695547734,1.5705666404362575,5.6428461577420315,1.3926398466351042,1.0361796764265419,0.26503402805562076,1.020934315327835,0.20285718109828768,1.0019232909372657,6.1971177943871456E-2,1.0005162435087667,5.294346227214921E-2,-2.5006114861837951,-116.21432021175769,63.785679788242305,null,32736,1071645696,null,15.633288498210888,-25.379785611040091,null,-2.7341415567386944,-91.351784607942406,null,0,0]
[32924.5,32.924500000000002,40.517449598610057,1.5461130962171792,1.0000103564575546,4.5511247346741212E-3,1,0,4378.8329494389718,1.5705679554411047,5.6743211092246399,1.3936385647787999,1.03659015832768,0.26648909888120387,1.0211735899225316,0.20399322192717986,1.0019454824779981,6.2327098766487017E-2,1.000522208902332,5.3248290461250486E-2,-2.5536579219059368,-116.26172787638936,63.738272123610642,null,32924.5,1084022700.25,null,15.628290719360221,-25.406008037939468,null,-2.7840332907658025,-91.375897237942667,null,0,0]
[33113,33.113,40.749280003529037,1.5462535520939187,1.0000104753823893,4.577180561322532E-3,1,0,4403.9027293306563,1.5705692554742852,5.7058016580448809,1.3946262634681355,1.0370028331895595,0.26794301469332249,1.0214141818139337,0.20512872903707269,1.0019678009391837,6.2683003778178162E-2,1.0005282086167386,5.3553118129172156E-2,-2.6064018551725683,-116.30960809900105,63.690391900998947,null,33113,1096470769,null,15.62330191366561,-25.43279479785674,null,-2.833641124642257,-91.399917216867138,null,0,0]
[33305.75,33.305750000000003,40.986338175694584,1.5463955316875113,1.0000105976905995,4.6038238471314708E-3,1,0,4429.5377429940863,1.5705705696015921,5.7379976725907706,1.3956250232649212,1.0374270773484877,0.26942851176755012,1.0216615594033538,0.20628928320456405,1.0019907538380277,6.3046916730926633E-2,1.0005343790947483,5.3864818027346328E-2,-2.6600260875272275,-116.35904716937313,63.640952830626873,null,33305.75,1109272983.0625,null,15.618209356208679,-25.460758083566237,null,-2.8840772188847765,-91.424384589195753,null,0,0]
[33498.5,33.4985,41.223397164568759,1.5465358783501248,1.0000107207086815,4.6304671264041797E-3,1,0,4455.172756665077,1.570571868605952,5.7701993470333335,1.3966126365068088,1.0378536089248269,0.27091279111147049,1.0219103123871025,0.20744927393057169,1.0020138394270603,6.341081296334436E-2,1.0005405854612031,5.4176517374153209E-2,-2.7133419091006554,-116.40896158815285,63.591038411847151,null,33498.5,1122149502.25,null,15.613125079558669,-25.489289382539916,null,-2.934223218647924,-91.448758370254424,null,0,0]
[33691.25,33.691249999999997,41.460456956142437,1.5466746200861692,1.0000108444366353,4.6571103991028366E-3,1,0,4480.8077703434992,1.5705731527469227,5.8024065871402142,1.3975892868635056,1.0382824250995295,0.27239584768988973,1.022160439761032,0.20860869850588012,1.0020370576971103,6.3774692380215714E-2,1.0005468277173946,5.4488216166344874E-2,-2.7663531949928197,-116.45934216783719,63.540657832162807,null,33691.25,1135100326.5625,null,15.608048551749956,-25.518377897654943,null,-2.9840824504035761,-91.47304016439368,null,0,0]
[33884,33.884,41.697517536725044,1.5468117842634563,1.0000109688744605,4.6837536651896184E-3,1,0,4506.4427840292274,1.5705744222781566,5.8346193007436078,1.3985551540332968,1.0387135230431168,0.27387767649742162,1.0224119405164318,0.2097675542300062,1.0020604086389548,6.4138554886351659E-2,1.000553105864622,5.4799914400672486E-2,-2.8190637475279074,-116.51017991336258,63.489820086637422,null,33884,1148125456,null,15.602979256863637,-25.548013060703664,null,-3.0336581838260681,-91.497231539489704,null,0,0]
[34081.5,34.081499999999998,41.940420881562822,1.5469507202394281,1.0000110971151743,4.7110535029202504E-3,1,0,4532.7095295771733,1.5705757081998628,5.8676314257796012,1.3995338221750346,1.0391576085087872,0.27539474375559048,1.0226710625913513,0.21095437514059387,1.0020844726321305,6.4511366532299719E-2,1.0005595759562547,5.5119293332391704E-2,-2.8727652235816898,-116.56273546377624,63.437264536223765,null,34081.5,1161548642.25,null,15.597792016993656,-25.578934735690627,null,-3.0841649249872107,-91.521926883933176,null,0,0]
[34279,34.279000000000003,42.183325026661514,1.5470880561485931,1.0000112261011773,4.738353333628713E-3,1,0,4558.9762751325288,1.5705769793037783,5.9006491078953909,1.4005015387608049,1.0396040835420375,0.27691051144094037,1.0229316244123638,0.21214059310569702,1.0021086758968467,6.4884160221515982E-2,1.0005660837324528,5.5438671671503618E-2,-2.9261588174427504,-116.61575246735644,63.384247532643556,null,34279,1175049841,null,15.592611323676097,-25.610408579579687,null,-3.1343807958706926,-91.546530517750043,null,0,0]
[34476.5,34.476500000000001,42.426229958275862,1.5472238194685437,1.000011355832469,4.7656531572743176E-3,1,0,4585.2430206951649,1.5705782358445557,5.9336722543245282,1.4014584848115674,1.040052945065479,0.27842497426650925,1.0231936248795519,0.21332620524894044,1.0021330184230128,6.5256935851687209E-2,1.0005726291946391,5.5758049414509972E-2,-2.9792483934383958,-116.66922184384974,63.330778156150259,null,34476.5,1188629052.25,null,15.587436670970574,-25.642423932303746,null,-3.1843091366437832,-91.571044015092227,null,0,0]
[34674,34.673999999999999,42.669135662973531,1.5473580370514124,1.0000114863090497,4.7929529738163753E-3,1,0,4611.5097662649596,1.5705794780710465,5.9667007743390794,1.4024048374200384,1.0405041899905987,0.27993812697837617,1.0234570628880548,0.21451120870369894,1.002157500200481,6.5629693320530119E-2,1.0005792123442423,5.6077426557911376E-2,-3.0320377433693717,-116.72313470379716,63.276865296202843,null,34674,1202286276,null,15.582267568425189,-25.674970360428215,null,-3.2339532303620562,-91.595468914275472,null,0,0]
[34875.75,34.875749999999996,42.917269237021529,1.5474935741603486,1.0000116203628717,4.8208402473882365E-3,1,0,4638.3417456074421,1.5705807325022394,6.0004454906622815,1.4033607969077506,1.0409676029123245,0.28148248306973023,1.0237276529374228,0.21572108078501986,1.0021826525687592,6.6010453294538696E-2,1.0005859760706899,5.6403675751280531E-2,-3.0856569494510149,-116.7786565649548,63.221343435045199,null,34875.75,1216317938.0625,null,15.576992468257743,-25.70875487614838,null,-3.2843754825243545,-91.620329497385129,null,0,0]
[35077.5,35.077500000000001,43.165403590408793,1.5476275530139469,1.0000117551944026,4.848727513461706E-3,1,0,4665.1737249571415,1.5705819725035852,6.0341956292101173,1.4043060636088551,1.0414334963660081,0.28302546107875254,1.0239997407163128,0.21693031168348931,1.0022079502243271,6.6391194101516435E-2,1.0005927791270386,5.6729924311575926E-2,-3.1389706441977934,-116.83462303720644,63.165376962793559,null,35077.5,1230431006.25,null,15.571722172377038,-25.743072258342238,null,-3.3345078713322862,-91.645100763197604,null,0,0]
[35279.25,35.279249999999998,43.413538709772155,1.5477600003265239,1.0000118908036419,4.8766147719934124E-3,1,0,4692.0057043139304,1.5705831983226419,6.0679510995068213,1.405240814268907,1.0419018670240896,0.28456705551205896,1.0242733250311553,0.2181388983751231,1.0022333931561827,6.6771915632531847E-2,1.0005996215148394,5.7056172235063742E-2,-3.1919826465647043,-116.89102522964762,63.108974770352376,null,35279.25,1244625480.5625,null,15.56645620483512,-25.777912079671719,null,-3.3843537200581797,-91.669784242119022,null,0,0]
[35481,35.481000000000002,{"$f":"SQRT(1+(A397/pole1)^2)","v":43.661674582052179},{"$f":"ATAN(A397/pole1)","v":1.5478909422053273},{"$f":"SQRT(1+(A397/Zero1)^2)","v":1.0000120271905897},{"$f":"ATAN(A397/Zero1)","v":4.9045020229399822E-3},{"$f":"IF(VIN_nom>Vout, 1, SQRT(1+(A397/z_RHP)^2))","v":1},{"$f":"IF(VIN_nom>Vout, 0, -ATAN(A397/z_RHP))","v":0},{"$f":"SQRT(1+(A397/Pole2)^2)","v":4718.8376836776897},{"$f":"ATAN(A397/Pole2)","v":1.5705844102013371},6.1017118130645933,1.4061652217961738,{"$f":"SQRT(1+(A397/pole4)^2)","v":1.0423727115473127},{"$f":"ATAN(A397/pole4)","v":0.28610726091241723},{"$f":"SQRT(1+(A397/Zero3)^2)","v":1.0245484046830937},{"$f":"ATAN(A397/Zero3)","v":0.2193468378466861},{"$f":"SQRT(1+(A397/pole5)^2)","v":1.0022589813532623},{"$f":"ATAN(A397/pole5)","v":6.7152617778686821E-2},{"$f":"SQRT((1-(Z397/pterm2))^2+(A397/pterm1)^2)","v":1.0006065032356515},{"$f":"IF((ATAN((A397/pterm1)/(1-A397^2/pterm2))>0),ATAN((A397/pterm1)/(1-A397^2/pterm2)),PI()+ATAN((A397/pterm1)/(1-A397^2/pterm2)))","v":5.7382419518008917E-2},{"$f":"20*LOG10(((E397*K397*G397*O397)/(C397*I397*S397*M397*Q397))*Adc)","v":-3.2446967040882075},{"$f":"((F397+L397+H397+R397)-(D397+J397+T397+N397+T397))*radconv","v":-116.94785443819833},{"$f":"IF(V397>0,V397,V397+180)","v":63.052145561801666},null,{"$f":"IF(U397<0,A397,1000000000)","v":35481},{"$f":"A397^2","v":1258901361},null,{"$f":"20*LOG10((K397/(I397*M397))*AEA)","v":15.561194104449873},{"$f":"(L397-(J397+N397))*radconv","v":-25.813264134407913},null,{"$f":"20*LOG10((E397*G397/(C397*S397))*Acs*Am)","v":-3.4339162952436091},{"$f":"(F397+H397-(D397+T397))*radconv","v":-91.694381429772974},null,{"$f":"SUM((U398<0)*(U397>0))*A397","v":0},0]
[35687.75,{"$f":"A398/1000","v":35.687750000000001},43.915960810032082,1.548023594064569,1.0000121677644931,4.933080399824194E-3,1,0,4746.3346439497655,1.57058563789864,6.1363145726253432,1.4071019851799682,1.0428577881646666,0.28768419068343548,1.0248318518000612,0.2205840392405817,1.0022853544047945,6.7542734696950019E-2,1.00061359631609,5.7716751567015952E-2,-3.2984119163283387,-117.00652616140671,62.993473838593289,null,35687.75,1273615500.0625,null,15.555805137371383,-25.850013308497942,null,-3.484416654509281,-91.71950021646407,null,0,0]
[35894.5,35.894500000000001,44.170247801882297,1.5481547185793443,1.0000123091551296,4.9616587686504175E-3,1,0,4773.8316042289134,1.5705868514530292,6.1709226565676802,1.4080282421603914,1.0433454556491872,0.28925965023153266,1.0251168667247357,0.22182055456402849,1.0023118799873068,6.7932831026159504E-2,1.0006207307066348,5.80510829353914E-2,-3.3518219790029553,-117.06562840103017,62.934371598969832,null,35894.5,1288415130.25,null,15.550419296341387,-25.887279407262017,null,-3.5346262941829316,-91.744531454227612,null,0,0]
[36101.25,36.10125,44.424535544485579,1.5482843419728396,1.0000124513624993,4.990237129371973E-3,1,0,4801.3285645150099,1.5705880511074921,6.205535975809866,1.408944166942891,1.0438357103696085,0.29083363380200927,1.0254034481497822,0.22305638060950725,1.002338558088689,6.8322906649228674E-2,1.0006279064089925,5.8385413619111502E-2,-3.404930703206992,-117.12515236876202,62.874847631237984,null,36101.25,1303300251.5625,null,15.545036130198042,-25.925052133665339,null,-3.5845485526233838,-91.769476645313716,null,0,0]
[36308,36.308,44.678824025023303,1.5484124898714511,1.0000125943866016,5.0188154819421835E-3,1,0,4828.8255248079377,1.570589237099481,6.2401544432333331,1.4098499299373837,1.0443285486822367,0.29240613568019641,1.0256915947621452,0.22429151418149532,1.0023653886967641,6.8712961449108517E-2,1.0006351234248805,5.8719743614151089E-2,-3.4577418287876842,-117.18508946154411,62.814910538455891,null,36308,1318270864,null,15.539655202034822,-25.963321410117523,null,-3.6341867111133541,-91.794337257778722,null,0,0]
[36519.5,36.519500000000001,44.938955433968054,1.548542081296332,1.0000127415417204,5.0480504024487064E-3,1,0,4856.9542169646047,1.5705904364441965,6.2755734944656032,1.4107661616212663,1.0448353792589957,0.29401322610939756,1.0259879795944042,0.22555430462250867,1.0023929935173597,6.911195593643607E-2,1.0006425489988497,5.9061753992645627E-2,-3.5114621627335896,-117.2468222758007,62.753177724199304,null,36519.5,1333673880.25,null,15.534152523774786,-26.002973417899668,null,-3.6846746839704627,-91.819683013192432,null,0,0]
[36731,36.731000000000002,45.199087588927824,1.5486701810606389,1.0000128895515306,5.0772853143262169E-3,1,0,4885.0829091281767,1.5705916219770695,6.3109977547834664,1.411672108258788,1.045344905752704,0.29561875401209109,1.0262859995613238,0.2268163636795828,1.002420757906709,6.9510928385103171E-2,1.0006500178101467,5.9403763641926045E-2,-3.5648787630333874,-117.30896977607145,62.69103022392855,null,36731,1349166361,null,15.528651306266346,-26.04312439789642,null,-3.7348721218741439,-91.844943261464195,null,0,0]
[36942.5,36.942500000000003,45.459220477095819,1.5487968147674758,1.0000130384160313,5.1065202175247463E-3,1,0,4913.2116012985362,1.5705927939353226,6.3464271369592575,1.4125679406012808,1.0458571242231258,0.29722271340086548,1.0265856532388555,0.22807768797104444,1.0024486818515534,6.9909878669930231E-2,1.0006575298606413,5.9745772557678725E-2,-3.617995413116887,-117.37152332319449,62.628476676805505,null,36942.5,1364748306.25,null,15.523151125121334,-26.083764237315517,null,-3.7847823604128821,-91.870119469299539,null,0,0]
[37154,37.154000000000003,45.719354085956645,1.5489220074374317,1.0000131881352226,5.1357551119943258E-3,1,0,4941.3402934755677,1.5705939525507777,6.3818615556898459,1.4134538256735438,1.0463720307169444,0.2988250983322841,1.0268869391968101,0.22933827412850841,1.0024767653385598,7.0308806665779794E-2,1.0006650851522141,6.0087780735588507E-2,-3.6708158258251729,-117.43447446035481,62.565525539645193,null,37154,1380419716,null,15.517651569613493,-26.124883039089504,null,-3.8344086781593729,-91.89521307002822,null,0,0]
[37370.25,37.370249999999999,45.985330671400966,1.5490485472878093,1.0000133421006001,5.1656465730307568E-3,1,0,4970.1007175167815,1.5705951236274793,6.4180969034773003,1.4143494918161343,1.0469012764282217,0.30046183659241626,1.0271966778083181,0.23062640464141559,1.0025056444852549,7.0716670861645292E-2,1.0006728548359332,6.0437469180844687E-2,-3.7245200163436722,-117.499241854715,62.500758145285005,null,37370.25,1396535585.0625,null,15.512028734496413,-26.167410441540543,null,-3.8848593347118436,-91.920786286921114,null,0,0]
[37586.5,37.586500000000001,46.251307984708902,1.5491736317551925,1.0000134969594885,5.1955380248361049E-3,1,0,4998.8611415647338,1.5705962812288465,{"$f":"SQRT(1+(A407/Zero2)^2)","v":6.4543373421633392},{"$f":"ATAN(A407/Zero2)","v":1.4152351005164612},1.0474333238574842,0.30209691645520936,1.02750811979773,0.23191375641387993,1.0025346903923502,7.1124511491686068E-2,1.0006806697288222,6.078715684561526E-2,-3.7779221456202001,-117.56440758083296,62.435592419167037,null,37586.5,1412744982.25,null,15.506405726831078,-26.210418301738468,null,-3.9350199293846644,-91.946276072321112,null,0,0]
[37802.75,37.802750000000003,46.5172860133951,1.5492972858005398,1.0000136527118877,5.2254294673569571E-3,1,0,5027.6215656193081,1.5705974255861359,6.4905827864722321,1.416110818865298,1.0479681687374838,0.30373033171049341,1.0278212636166149,0.23320032588876041,1.0025639030453515,7.1532328422280758E-2,1.0006885298329267,6.1136843725282594E-2,-3.8310259645549847,-117.62996315983348,62.37003684016652,null,37802.75,1429047907.5625,null,15.500782149041095,-26.253896703520624,null,-3.9848937900535457,-91.971683856124287,null,0,0]
[38019,38.018999999999998,46.78326474525808,1.5494195338173409,1.0000138093577973,5.2553209005399013E-3,1,0,5056.3819896803916,1.5705985569253418,6.5268331530108457,1.4169768103027456,1.0485058067872648,0.30536207619626643,1.0281361077099722,0.23448610952359714,1.0025932824296835,7.1940121519855058E-2,1.0006964351503034,6.1486529815227335E-2,-3.8838351542342413,-117.69590029195136,62.304099708048639,null,38019,1445444361,null,15.495157616615199,-26.297835942350847,null,-4.0344841877511533,-91.997011035713072,null,0,0]
[38240.5,38.240499999999997,47.05570148078229,1.5495433169738975,1.0000139707329825,5.2859380119595432E-3,1,0,5085.8406436964115,1.5705997024654099,6.563968603951662,1.4178539088916016,1.0490593885427171,0.30703169679387399,1.028460356478204,0.23580229033921191,1.0026235479076113,7.2357789949176396E-2,1.0007045792639326,6.1844704570517411E-2,-3.9376247468809078,-117.76382527946967,62.236174720530329,null,38240.5,1462335840.25,null,15.489395156598064,-26.343309743286678,null,-4.0849880051816605,-92.022870958729143,null,0,{"$f":"IF(AH410>0,W410,0)","v":0}]
[38462,38.462000000000003,47.328138929005995,1.5496656750533593,1.0000141330455878,5.3165551134689406E-3,1,0,5115.2992977190279,1.5706008348113063,6.6011090477486976,1.418721138335983,1.0496158916011951,0.3086995515815269,1.0287863857563031,0.2371176392192616,1.0026539882795491,7.2775433090692843E-2,1.0007127708172152,6.2202878487458493E-2,-3.991112831506507,-117.8321335003676,62.167866499632396,null,38462,1479325444,null,15.483630918603659,-26.38924707512065,null,-4.1352011986630623,-92.048649183376071,null,0,0]
[38683.5,38.683500000000002,47.600577077692002,1.5497866325209799,1.0000142962956129,5.3471722050106958E-3,1,0,5144.7579517481281,1.5706019541896787,6.6382544005981918,1.4195786629932103,1.0501753113185772,0.3103656340947345,1.0291141938520421,0.23843215240512103,1.0026846035295676,7.3193050801018719E-2,1.0007210098123991,6.2561051561080785E-2,-4.0443031471239497,-117.90081658966726,62.099183410332742,null,38683.5,1496413172.25,null,15.477864529312733,-26.435638163469893,null,-4.1851271061387321,-92.074347111128162,null,0,0]
[38905,38.905000000000001,47.873015914881648,1.5499062132852648,1.0000144604830576,5.3777892865274138E-3,1,0,5174.2166057836021,1.5706030608220134,6.6754045805507367,1.4204266436196771,1.0507376430363176,0.31202993792209294,1.0294437790661224,0.23974582615449164,1.0027153936416491,7.3610642936821277E-2,1.0007292962517458,6.291922378641257E-2,-4.0971993631914732,-117.96986635955192,62.030133640448085,null,38905,1513599025,null,15.472095627986794,-26.482473443015365,null,-4.2347690084778975,-92.09996611156032,null,0,0]
[39131.5,39.131500000000003,48.151605312771579,1.5500270940636736,1.000014629346164,5.4090974881255667E-3,1,0,5204.3402407292879,1.5706041794794066,6.7133982733025208,1.4212840602181855,1.0513156749463706,0.31372996469482062,1.0297826400935823,0.24108828198318388,1.0027470596007884,7.4037634935395599E-2,1.0007378188089813,6.3285480281145792E-2,-4.1509892441751699,-118.04084565468008,61.959154345319917,null,39131.5,1531274292.25,null,15.466193542317031,-26.530815544175496,null,-4.2852411614829213,-92.126083193568988,null,0,0]
[39358,39.357999999999997,48.430195406165836,1.5501465841334476,1.0000147991894877,5.4404056791195893E-3,1,0,5234.463875681412,1.5706052852613541,6.7513968459469993,1.4221318259182365,1.05189674191002,0.31542811818385591,1.0301233557596721,0.24242985218761015,1.0027789083713785,7.4464599888842825E-2,1.0007463909813274,6.3651735878337515E-2,-4.2044791433961315,-118.11219160219387,61.887808397806126,null,39358,1549052164,null,15.460288105493218,-26.57960253212816,null,-4.335423104364752,-92.152120543024495,null,0,0]
[39584.5,39.584499999999998,48.708786183130599,1.5502647073536939,1.0000149700130285,5.4717138594481069E-3,1,0,5264.5875106398644,1.570606378388874,6.7894002165495575,1.4229701015523399,1.0524808389003737,0.31712439170599827,1.0304659242247252,0.24377053281950486,1.0028109399360017,7.4891537644076578E-2,1.0007550127712443,6.4017990572665218E-2,-4.25767276976564,-118.18389599200449,61.816104007995506,null,39584.5,1566932640.25,null,15.454378969966992,-26.628824821593533,null,-4.385318168387534,-92.178079526651544,null,0,0]
[39811,39.811,48.987377632003493,1.5503814870409269,1.0000151418167857,5.5030220290497502E-3,1,0,5294.711145604535,1.5706074590779533,6.8274083049896426,1.423799044425627,1.0530679608755076,0.31881877863611052,1.0308103436415237,0.2451103199486282,1.0028431542771417,7.5318448048069683E-2,1.0007636841812062,6.4384244358804146E-2,-4.3105737633452286,-118.25595078807351,61.744049211926495,null,39811,1584915721,null,15.448465800220832,-26.678473032434241,null,-4.4349296278908223,-92.203961480086406,null,0,0]
[40042.75,40.042749999999998,49.272427182127586,1.5504996067027881,1.0000153186173091,5.53505587353504E-3,1,0,5325.5330105250441,1.5706085521620288,6.8663021770300796,1.4246377019299581,1.0536718173343644,0.32055047989387586,1.0311646601584985,0.24648023285760354,1.002876304470365,7.5755225257235673E-2,1.0007726079452837,6.4758986525546833E-2,-4.3644017794297261,-118.33003020771338,61.669969792286622,null,40042.75,1603421827.5625,null,15.442411056930826,-26.729703299589261,null,-4.4854008376471102,-92.230364978688101,null,0,0]
[40274.5,40.274500000000003,49.557477411804697,1.5506163675385538,1.0000154964440149,5.5670897066604332E-3,1,0,5356.3548754518442,1.5706096326663219,6.9052008240540044,1.4254669112956189,1.0542788299078212,0.32228019224182047,1.0315209104908429,0.24784920209660763,1.0029096459739746,7.6191973508598992E-2,1.0007815836616165,6.513372773022616E-2,-4.4179309360790535,-118.40445998348277,61.595540016517234,null,40274.5,1622035350.25,null,15.436351416472755,-26.781360228307843,null,-4.5355819015450241,-92.25669056781804,null,0,0]
[40506.25,40.506250000000001,49.842528309375709,1.5507317928585134,1.0000156752969027,5.5991235283601891E-3,1,0,5387.1767403848253,1.5706107008067522,6.9441041658176346,1.426286830168112,1.0548889931475283,0.32400790877205971,1.0318790926356411,0.249217223514591,1.0029431787688907,7.6628692638437371E-2,1.0007906113329006,6.5508467967131237E-2,-4.4711649193976433,-118.47923204384948,61.520767956150522,null,40506.25,1640756289.0625,null,15.430286556031966,-26.833434402746644,null,-4.5854761501834016,-92.282939582733988,null,0,0]
[40738,40.738,50.12757986344667,1.550845905442882,1.0000158551759719,5.6311573385685728E-3,1,0,5417.9986053238836,1.5706117567943256,6.9830121238558061,1.4270976127300663,1.0555023015894884,0.32573362264030081,1.0322392045819035,0.25058429298044066,1.002976902835927,7.7065382483094816E-2,1.0007996909618473,6.5883207230548732E-2,-4.5241073471600588,-118.55433848867631,61.445661511323692,null,40738,1659584644,null,15.424216164323543,-26.885916608832414,null,-4.6350868572494477,-92.309113328322539,null,0,0]
[40975.25,40.975250000000003,50.419397063498224,1.5509613896071475,1.0000160403870164,5.6639513782551021E-3,1,0,5449.5519492644462,1.5706128254694809,7.0228481656549242,1.4279183304811554,1.0561334176879322,0.32749821036438392,1.0326098598095586,0.25198281598114491,1.0030116253732646,7.7512405549794092E-2,1.0008090398975857,6.6266838968034023E-2,-4.5780079200782966,-118.63156570417162,61.368434295828379,null,40975.25,1678971112.5625,null,15.417995664196496,-26.940057605332029,null,-4.6855845933765785,-92.335831602944054,null,0,0]
[41212.5,41.212499999999999,50.711214928233801,1.5510755446648616,1.0000162266735266,5.6967454057589243E-3,1,0,5481.1052932111606,1.570613881840448,7.0626888845229914,1.4287297894149111,1.0567678184088445,0.3292606849300998,1.0329825332326474,0.25338033261159737,1.0030465483281363,7.7959397577910344E-2,1.000818443292218,6.6650469673151316E-2,-4.6316103953477983,-118.70912713937106,61.290872860628937,null,41212.5,1698470156.25,null,15.411768742328878,-26.99460731295466,null,-4.7357919359947624,-92.362473666917225,null,0,0]
[41449.75,41.449750000000002,51.003033446244288,1.5511883934268376,1.0000164140355023,5.7295394210095081E-3,1,0,5512.6586371639223,1.5706149261185074,7.1025342017538229,1.4295321442798929,1.0574054978403018,0.33102103920115483,1.033357222667624,0.25477683850473698,1.0030816716796092,7.8406358392075118E-2,1.0008279011487029,6.7034099339762676E-2,-4.6849184426818997,-118.7870148473732,61.2129851526268,null,41449.75,1718081775.0625,null,15.405535099859161,-27.049556468486916,null,-4.7857122204062676,-92.389040826857766,null,0,0]
[41687,41.686999999999998,51.294852606380154,1.5512999581849347,1.0000166024729429,5.762333423936325E-3,1,0,5544.2119811226257,1.5706159585101291,7.1423840403885697,1.4303255464185645,1.0580464500541156,0.33277926611097869,1.0337339259223042,0.25617232931558687,1.0031169954066326,7.8853287816994383E-2,1.0008374134700171,6.7417727961727347E-2,-4.7379356638210401,-118.8652210504122,61.134778949587798,null,41687,1737805969,null,15.399294448995718,-27.104896007589591,null,-4.8353487248928237,-92.415534359647367,null,0,0]
[41929.75,41.929749999999999,51.593437458263828,1.5514128029946106,1.0000167963919464,5.7958876543547063E-3,1,0,5576.4968040832582,1.5706170027424509,7.1831622911791246,1.4311282293727923,1.0587056422801571,0.33457604355332049,1.034121444116523,0.25759911564735799,1.0031533453938557,7.931054542069671E-2,1.0008472026853066,6.7810248888742236E-2,-4.7918846157602237,-118.94556196889626,61.054438031103743,null,41929.75,1758103935.0625,null,15.39290158257611,-27.161913256365757,null,-4.8858455543132404,-92.442567167713364,null,0,0]
[42172.5,42.172499999999999,51.892022959575229,1.5515243491928374,1.0000169914368551,5.829441871721925E-3,1,0,5608.7816270499006,1.5706180349533181,7.2239451178286833,1.4319218497304271,1.0593682481811562,0.33637057911271645,1.0345110659119974,0.25902483015544031,1.0031899051096851,7.9767769791889181E-2,1.0008570489262929,6.8202768709098902E-2,-4.845536519094197,-119.02622036976869,60.973779630231306,null,42172.5,1778519756.25,null,15.386500803418974,-27.219320614469012,null,-4.9360520603297804,-92.469525508164963,null,0,0]
[42415.25,42.41525,52.190609099168121,1.5516346190651571,1.000017187607668,5.8629960759624313E-3,1,0,5641.0664500224502,1.5706190553491342,7.264732443273239,1.432706559127177,1.0600342613556553,0.3381628654460096,1.0349027889328264,0.26044946825769383,1.003226674531192,8.0224960743046192E-2,1.0008669521962192,6.8595287416210515E-2,-4.8988950215922653,-119.10718844289903,60.89281155710097,null,42415.25,1799053432.5625,null,15.380091836896028,-27.277108984907382,null,-4.9859715775040208,-92.496410657496583,null,0,0]
[42658,42.658000000000001,52.489195866149856,1.5517436343901487,1.0000173849043843,5.896550267000678E-3,1,0,5673.3512730008069,1.5706200641316033,7.3055241921613945,1.4334825058564657,1.0607036753853996,0.3399528952862399,1.035296610793901,0.26187302539637186,1.0032636536353194,8.0682118086725416E-2,1.0008769124983468,6.8987805003487043E-2,-4.9519637035398194,-119.18845854470003,60.811541455299974,null,42658,1819704964,null,15.373674418980549,-27.335269466284217,null,-5.03560738339187,-92.523223863155607,null,0,0]
[42906.5,42.906500000000001,52.794855872946421,1.5518539546980081,1.0000175880406748,5.9308992397472931E-3,1,0,5706.4008240267876,1.5706210849855748,7.3472866769046687,1.4342679073105449,1.0613924616972104,0.34178298061451895,1.0357019325841783,0.26332917781366083,1.0033017258278953,8.115006907355983E-2,1.0008871678073625,6.938961895690636E-2,-5.0059928884999971,-119.27195871999865,60.728041280001349,null,42906.5,1840967742.25,null,15.36709597327304,-27.395183933893783,null,-5.0861284006604235,-92.55059894373322,null,0,0]
[43155,43.155000000000001,53.1005165148892,1.5519630049413395,1.0000177923568374,5.9652481984985841E-3,1,0,5739.4503750586464,1.5706220940827531,7.3890536426285109,1.4350444302034049,1.0620847982200028,0.34361068611827111,1.0361094487350657,0.26478418786440744,1.0033400177049017,8.1617984444706915E-2,1.0008974828893891,6.9791431722825994E-2,-5.0597257434476628,-119.35575970788348,60.644240292116521,null,43155,1862354025,null,15.360508143671579,-27.455470078073763,null,-5.1363588801765534,-92.577901187736742,null,0,0]
[43403.5,43.403500000000001,53.40617778107277,1.5520708069245286,1.0000179978528716,5.9995971431735058E-3,1,0,5772.4999260962823,1.5706230916250734,7.4308250137732257,1.4358122233194623,1.062780678015542,0.34543600424946602,1.0365191566583696,0.2662380507389806,1.003378529241187,8.2085863999360825E-2,1.0009078577479864,7.0193243294166333E-2,-5.1131658999813157,-119.43985382273307,60.56014617726693,null,43403.5,1883863812.25,null,15.353910679211321,-27.516118953204789,null,-5.1863021606629376,-92.605131844064445,null,0,0]
[43652,43.652000000000001,53.711839660839892,1.5521773819557423,1.0000182045287767,6.0339460736910152E-3,1,0,5805.549477139597,1.5706240778098723,7.4726007164607307,1.436571432157705,1.06348009412829,0.34725892754341209,1.0369310537560774,0.26769076165472888,1.0034172604114595,8.2553707536809129E-2,1.0009182923867332,7.0595053663844193E-2,-5.1663169225577912,-119.52423354324172,60.475766456758279,null,43652,1905497104,null,15.347303339096142,-27.577121806420159,null,-5.2359615237401087,-92.632292133183185,null,0,0]
[43906,43.905999999999999,54.024267316137404,1.5522850694827144,1.0000184169983271,6.0690552273920326E-3,1,0,5839.3305071856148,1.5706250742851,7.5153054334931744,1.4373387211687454,1.0641986376029715,0.34911971461356561,1.0373543269630621,0.26917442969009842,1.0034570757638293,8.3031868329570366E-2,1.0009290197564118,7.1005755971549761E-2,-5.2203491643984812,-119.61076831771264,60.38923168228736,null,43906,1927736836,null,15.340539313731597,-27.639831724009678,null,-5.2864299326061728,-92.659982076555011,null,0,0]
[44160,44.16,54.336695590728382,1.5523915186349688,1.0000186307005523,6.1041643661307989E-3,1,0,5873.1115372373642,1.5706260592972523,7.558014525028951,1.4380973389753136,1.0649208609157705,0.35097798416021508,1.0377798818022321,0.27065688419263251,1.0034971205261243,8.3509991069428538E-2,1.0009398095893554,7.1416457008836504E-2,-5.2740866546989977,-119.69758609724991,60.302413902750089,null,44160,1950105600,null,15.333764493073218,-27.702893564761702,null,-5.3366084730778187,-92.687600994349594,null,0,0]
[44414,44.414000000000001,54.649124473991357,1.5524967506494258,1.0000188456354515,6.1392734898207697E-3,1,0,5906.8925672947462,1.5706270330429986,7.6007279173260205,1.4388474308840673,1.0656467565848504,0.35283372848124117,1.038207715467907,0.27213812014271482,1.0035373946708814,8.3988075542353144E-2,1.0009506618894528,7.1827156768129063E-2,-5.3275329928351791,-119.78467935455055,60.215320645449452,null,44414,1972603396,null,15.32697865076306,-27.766298573187395,null,-5.3865004728709165,-92.715150102923786,null,0,0]
[44668,44.667999999999999,54.961553955546329,1.5526007862802296,1.0000190618030242,6.1743825983753978E-3,1,0,5940.673597357666,1.5706279957145344,7.6434455382833502,1.4395891389921782,1.0663763171107552,0.35468693996501355,1.0386378251440178,0.27361813255036643,1.0035778981704857,8.4466121534417862E-2,1.0009615766606146,7.2237855241848198E-2,-5.3806917117729665,-119.8720407234625,60.127959276537496,null,44668,1995230224,null,15.320181570133419,-27.830038182616232,null,-5.4361092028475895,-92.74263059097315,null,0,0]
[44928.25,44.928249999999998,55.281671780355353,1.5527061621486697,1.0000192845682236,6.2103555963711476E-3,1,0,5975.2858535596688,1.5706289707839582,7.6872185941029052,1.4403405473212756,1.0671276227948743,0.35658311717083463,1.039080875977606,0.27513328832615314,1.0036196361719225,8.4955890332787373E-2,1.0009728248037633,7.2658658143755453E-2,-5.4348637742365984,-119.96182228313307,60.038177716866926,null,44928.25,2018547648.0625,null,15.313205365262609,-27.895684475208174,null,-5.4866481711192918,-92.770717312853947,null,0,0]
[45188.5,45.188499999999998,55.601790211947844,1.5528103246487721,1.0000195086275041,6.2463285782935933E-3,1,0,6009.8981097672868,1.570629934622126,7.7309959410860447,1.4410834462533233,1.0678827599167098,0.35847661947072584,1.0395263101895273,0.27664714909452731,1.0036616148950332,8.5445618278899252E-2,1.0009841385385478,7.3079459679922312E-2,-5.4887411912258655,-120.05187015521298,59.948129844787019,null,45188.5,2042000532.25,null,15.306216931486967,-27.961664416013679,null,-5.5368965322653381,-92.798734436519666,null,0,0]
[45448.75,45.448749999999997,55.9219092399034,1.552913294615651,1.0000197339808647,6.2823015440496462E-3,1,0,6044.5103659804245,1.5706308874219757,7.7747775067461573,1.4418179787164396,1.0686417203540044,0.36036743897190648,1.0399741247172882,0.27815970958511282,1.0037038343096145,8.5935305142987806E-2,1.0009955178692473,7.3500259842183294E-2,-5.5423275564405774,-120.14217691535409,59.857823084645915,null,45448.75,2065588876.5625,null,15.299216065324288,-28.027969374686325,null,-5.5868576272034653,-92.826683155271951,null,0,0]
[45709,45.709000000000003,56.242028854038878,1.5530150924101644,1.0000199606283044,6.3182744935462148E-3,1,0,6079.1226221989873,1.5706318293720518,7.8185632202133366,1.4425442844736012,1.0694044959664943,0.36225556788067687,1.0404243164873153,0.27967096456038182,1.0037462943852942,8.6424950695404706E-2,1.0010069628001654,7.3921058622368543E-2,-5.5956263972465035,-120.23273529880268,59.76726470119732,null,45709,2089312681,null,15.292202572610913,-28.094590907654101,null,-5.6365347396959109,-92.854564635239271,null,0,0]
[45975.25,45.975250000000003,56.569529343692565,1.5531180448568351,1.0000201938402196,6.3550767736584397E-3,1,0,6114.5328555116794,1.570632782002827,7.8633626226737103,1.4432789641593076,1.0701887968027102,0.36418443476149348,1.04088734418583,0.28121570471193708,1.0037899823834009,8.6925841915440477E-2,1.0010187394819237,7.4351557376591049E-2,-5.6498600962023282,-120.3256344627199,59.674365537280096,null,45975.25,2113723612.5625,null,15.285014125951847,-28.163067375683578,null,-5.6870666329417352,-92.883020522332259,null,0,0]
[46241.5,46.241500000000002,56.897030426035826,1.5532198121095835,1.0000204284065695,6.3918790365557103E-3,1,0,6149.9430888298566,1.5706337236634591,7.9081662213287327,1.4440053195996074,1.0709770734653508,0.36611046937214875,1.0413528534605248,0.28275906747303398,1.0038339222024404,8.742668941110418E-2,1.0010305848327532,7.4782054666963138E-2,-5.7038001234887448,-120.41878209695103,59.581217903048966,null,46241.5,2138276322.25,null,15.277812081232343,-28.231857882173262,null,-5.7373080739629465,-92.911408419929401,null,0,0]
[46507.75,46.507750000000001,57.224532090892616,1.5533204145152304,1.0000206643273526,6.4286812821383469E-3,1,0,6185.3533221534253,1.5706346545423553,7.9529739452597941,1.4447234907200071,1.0717693171818625,0.36803366368810614,1.041820840984925,0.28430104734248296,1.0038781138093458,8.7927492936880444E-2,1.0010424988573421,7.5212550484722335E-2,-5.7574500508917881,-120.51217091423354,59.487829085766464,null,46507.75,2162970810.0625,null,15.270596258828268,-28.300953961005025,null,-5.7872624015406906,-92.939729493321337,null,0,0]
[46774,46.774000000000001,57.552034328318513,1.5534198719575538,1.0000209016025687,6.4654835103066712E-3,1,0,6220.7635554822928,1.5706355748236334,7.9977857251311164,1.4454336143441937,1.0725655191615275,0.36995400979252069,1.0422913034208379,0.28584163885525277,1.0039225571708674,8.842825224738525E-2,1.0010544815604039,7.5643044821101221E-2,-5.8108133843334011,-120.60579378441206,59.394206215587943,null,46774,2187807076,null,15.263366488015699,-28.37034732970643,null,-5.83693289734759,-92.967984881267995,null,0,0]
[47046.25,47.046250000000001,57.886917479799742,1.5535204069813744,1.0000211456253909,6.5031150663506562E-3,1,0,6256.9717659056469,1.570636505072557,8.0436114713780622,1.4461515585725617,1.0733837476126868,0.37191467795439859,1.0427749235360773,0.28741550662798787,1.0039682623666528,8.8940250298138512E-2,1.0010668053185892,7.6083238897329306E-2,-5.8650865025772365,-120.70176122161118,59.298238778388821,null,47046.25,2213349639.0625,null,15.255959200489313,-28.441603465615096,null,-5.8874325905735372,-92.996810247255809,null,0,0]
[47318.5,47.3185,58.221801209630307,1.553619785479148,1.0000213910643765,6.5407466039758251E-3,1,0,6293.1799763343524,1.5706374246169883,8.0894413166807926,1.4468613682942943,1.0742060960914022,0.37387235168990179,1.0432611242685992,0.28898791132402957,1.004014230720689,8.9452201599870232E-2,1.001079200895548,7.6523431406101905E-2,-5.9190671744789283,-120.79795878629209,59.202041213707915,null,47318.5,2239040442.25,null,15.248536994979771,-28.513153493107144,null,-5.9376422780687133,-93.025569260428881,null,0,0]
[47590.75,47.59075,58.556685507887522,1.5537180272913302,1.0000216379195241,6.5783781230756106E-3,1,0,6329.3881867683194,1.5706383336406371,8.135275191763558,1.4475631802766675,1.0750325551428017,0.37582702288255632,1.0437499020120855,0.290558847218021,1.0040604621968314,8.9964105890660867E-2,1.0010916682964086,7.6963622338029253E-2,-5.9727589449450083,-120.89437933846453,59.105620661535468,null,47590.75,2264879485.5625,null,15.241099715912444,-28.584989121481001,null,-5.9875652914840867,-93.054263057029701,null,0,0]
[47863,47.863,58.891570364874397,1.5538151518071768,1.000021886190833,6.6160096235434425E-3,1,0,6365.5963972074578,1.5706392323230336,8.1811130288970322,1.4482571282537109,1.0758631152938771,0.37777868353254018,1.0442412531478737,0.29212830862429484,1.0041069567587362,9.0475962908737634E-2,1.0011042075263268,7.7403811683716156E-2,-6.0261652936054695,-120.99101589251373,59.00898410748627,null,47863,2290866769,null,15.233647216189718,-28.657102240271438,null,-6.0372049055226809,-93.082892747448611,null,0,0]
[48141.75,48.141750000000002,59.234451205263177,1.5539134573423237,1.0000221418569282,6.6545395609886281E-3,1,0,6402.6690828322244,1.570640141930252,8.2280492855719256,1.448959633006051,1.0767177443920943,0.37977381285595979,1.0447469978422586,0.29373370749242944,1.0041548339280257,9.0999991319498902E-2,1.0011171205591352,7.7854508947240386E-2,-6.0805545671119781,-121.09017631696008,58.909823683039917,null,48141.75,2317628093.0625,null,15.226000872076803,-28.731216289428527,null,-6.087739403054564,-93.112140687986241,null,0,0]
[48420.5,48.420499999999997,59.577332611503365,1.5540106313359614,1.0000223990076116,6.6930694786754581E-3,1,0,6439.7417684622287,1.5706410410645097,8.2749895568298388,1.4496541681147779,1.0775766526011652,0.38176576956697583,1.045255432559159,0.29533754868975465,1.004202986817694,9.1523969618395901E-2,1.0011301089028342,7.8305204527925332E-2,-6.13465180685726,-121.18954883793124,58.810451162068759,null,48420.5,2344544820.25,null,15.218338285750139,-28.805604588171981,null,-6.137983577724933,-93.141323700683472,null,0,0]
[48699.25,48.699249999999999,59.92021457388104,1.5541066932113283,1.0000226576428819,6.7315993764895483E-3,1,0,6476.8144540973808,1.5706419299056449,8.3219337747374187,1.4503408677749223,1.0784398296969766,0.38375454545713217,1.0457665533750391,0.29693982624310866,1.0042514153880802,9.2047897524937972E-2,1.0011431725630537,7.8755898415668477E-2,-6.1884605451545651,-121.28912643440157,58.710873565598433,null,48699.25,2371616950.5625,null,15.210659325100622,-28.880258987686982,null,-6.1879407671993132,-93.170442897837589,null,0,0]
[48978,48.978000000000002,60.26309708290335,1.5542016619496914,1.000022917762738,6.7701292543165138E-3,1,0,6513.8871397375897,1.5706428086294026,8.3688818728799266,1.4510198632002043,1.0793072654373894,0.38574013244481292,1.0462803563533221,0.29854053422308535,1.0043001195993027,9.2571774758799033E-2,1.001156311545456,7.9206590600361254E-2,-6.241984249274827,-121.38890223786198,58.611097762138016,null,48978,2398844484,null,15.202963866127607,-28.955171517008104,null,-6.237614252057134,-93.199499366422458,null,0,0]
[49263.25,49.263249999999999,60.613975614738855,1.5542977328887015,1.000023185485085,6.8095575658827104E-3,1,0,6551.824300563796,1.5706436975487497,8.4169286741505669,1.4517068497503669,1.080199326434413,0.38776871050727241,1.0468089129741969,0.30017693708889276,1.0043502448292927,9.3107815212877934E-2,1.0011698348909066,7.9667790425591398E-2,-6.2964645090839717,-121.49120283561274,58.508797164387261,null,49263.25,2426867800.5625,null,15.195071760441252,-29.032089979908097,null,-6.2881557014180691,-93.229169553447292,null,0,0]
[49548.5,49.548499999999997,60.964854699578957,1.5543926979690375,1.0000234547620588,6.8489858562764266E-3,1,0,6589.7614613951182,1.5706445762331052,8.4649794026999956,1.4523860373777491,1.0810958252444982,0.3897939324952121,1.0473402699212961,0.30181168390537627,1.0044006586197947,9.3643802010095034E-2,1.0011834371243797,8.012898844598243E-2,-6.3506534311542762,-121.59369691106703,58.406303088932972,null,49548.5,2455053852.25,null,15.187162140122672,-29.109262412840902,null,-6.3384068341161122,-93.258776277240713,null,0,0]
[49833.75,49.833750000000002,61.315734327929967,1.5544865761738185,1.0000237255936584,6.8884141253750912E-3,1,0,6627.6986222314699,1.5706454448582257,8.5130339920271449,1.4530575575210407,1.0819967508366672,0.39181579015845969,1.0478744229346457,0.30344476846107082,1.00445136092736,9.4179734850594221E-2,1.0011971182520476,8.0590184650681615E-2,-6.4045545295694541,-121.69637757430911,58.303622425690889,null,49833.75,2483402639.0625,null,15.179234896888731,-29.186680822294399,null,-6.3883709882951445,-93.288320624840537,null,0,0]
[50119,50.119,61.666614490514235,1.5545793860541894,1.0000239979798824,6.9278423730561294E-3,1,0,6665.6357830727657,1.5706463035958658,8.5610923771187899,1.4537215386955831,1.0829020921622721,0.39383427538425436,1.0484113677405587,0.30507618459260216,1.0045023517082998,9.4715613434703735E-2,1.0012108782801172,8.1051379028829348E-2,-6.4581712537400771,-121.79923808580101,58.200761914198992,null,50119,2511914161,null,15.171289930185923,-29.264337389895744,null,-6.4380514450006885,-93.317803658533919,null,0,0]
[50410.75,50.41075,62.025490712693802,1.554673224574169,1.0000242781811437,6.9681690510744135E-3,1,0,6704.4374191003972,1.5706471718485235,8.6102497302657817,1.4543929823878055,1.0838326198049366,0.39589525899416006,1.0489634313969916,0.30674304359209797,1.004554802780298,9.5263646662466409E-2,1.0012250334825963,8.1523080755826108E-2,-6.5127191047736845,-121.90462165388901,58.095378346110991,null,50410.75,2541243715.5625,null,15.163145490443883,-29.344001909947824,null,-6.4885738649838167,-93.347896179412601,null,0,0]
[50702.5,50.702500000000001,62.384367474765305,1.5547659834506309,1.0000245600086846,7.008495706428499E-3,1,0,6743.2390551330245,1.5706480301090622,8.6594109211555157,1.4550568025388222,1.0847677432832583,0.39795269799109567,1.0495184064424461,0.30840814437647529,1.0046075555291485,9.5811622499464955E-2,1.0012392712355052,8.1994780549077981E-2,-6.5669765724049984,-122.01017956378311,57.989820436216888,null,50702.5,2570743506.25,null,15.154982321141357,-29.423899562866755,null,-6.5388062763983683,-93.377926731777407,null,0,0]
[50994.25,50.994250000000001,62.743244767464567,1.5548576812079218,1.0000248434625036,7.0488223389872451E-3,1,0,6782.0406911705632,1.5706488785489836,8.7085758847941186,1.4557131276765281,1.0857074507220106,0.40000658413807377,1.0500762882608345,0.31007148050759131,1.0046606099073301,9.6359540625676143E-2,1.0012535915455998,8.2466478396943196E-2,-6.620947147319769,-122.11590506763544,57.884094932364562,null,50994.25,2600413533.0625,null,15.146800338081754,-29.504022522428318,null,-6.5887520126970811,-93.407896376335714,null,0,0]
[51286,51.286000000000001,{"$f":"SQRT(1+(A461/pole1)^2)","v":63.102122581738172},{"$f":"ATAN(A461/pole1)","v":1.5549483359490495},{"$f":"SQRT(1+(A461/Zero1)^2)","v":1.0000251285425996},{"$f":"ATAN(A461/Zero1)","v":7.0891489486195076E-3},{"$f":"IF(VIN_nom>Vout, 1, SQRT(1+(A461/z_RHP)^2))","v":1},{"$f":"IF(VIN_nom>Vout, 0, -ATAN(A461/z_RHP))","v":0},{"$f":"SQRT(1+(A461/Pole2)^2)","v":6820.8423272129285},{"$f":"ATAN(A461/Pole2)","v":1.5706497173358871},8.757744557642269,1.4563620834686002,{"$f":"SQRT(1+(A461/pole4)^2)","v":1.086651730228934},{"$f":"ATAN(A461/pole4)","v":0.40205690934642907},{"$f":"SQRT(1+(A461/Zero3)^2)","v":1.0506370722217209},{"$f":"ATAN(A461/Zero3)","v":0.31173304559999976},{"$f":"SQRT(1+(A461/pole5)^2)","v":1.0047139658670601},{"$f":"ATAN(A461/pole5)","v":9.690740072128283E-2},{"$f":"SQRT((1-(Z461/pterm2))^2+(A461/pterm1)^2)","v":1.0012679944196743},{"$f":"IF((ATAN((A461/pterm1)/(1-A461^2/pterm2))>0),ATAN((A461/pterm1)/(1-A461^2/pterm2)),PI()+ATAN((A461/pterm1)/(1-A461^2/pterm2)))","v":8.2938174287772198E-2},{"$f":"20*LOG10(((E461*K461*G461*O461)/(C461*I461*S461*M461*Q461))*Adc)","v":-6.6746342560236833},{"$f":"((F461+L461+H461+R461)-(D461+J461+T461+N461+T461))*radconv","v":-122.22179156559757},{"$f":"IF(V461>0,V461,V461+180)","v":57.77820843440243},null,{"$f":"IF(U461<0,A461,1000000000)","v":51286},{"$f":"A461^2","v":2630253796},null,{"$f":"20*LOG10((K461/(I461*M461))*AEA)","v":15.138599464411582},{"$f":"(L461-(J461+N461))*radconv","v":-29.584363134561336},null,{"$f":"20*LOG10((E461*G461/(C461*S461))*Acs*Am)","v":-6.6384143503397013},{"$f":"(F461+H461-(D461+T461))*radconv","v":-93.437806149653525},null,{"$f":"SUM((U462<0)*(U461>0))*A461","v":0},0]
[51584.75,{"$f":"A462/1000","v":51.58475},63.469611534634829,1.5550401034078674,1.0000254221479361,7.1304430965414226E-3,1,0,6860.5749365328611,1.5706505664158041,8.8080967204639737,1.4570191014091696,1.0876233914628912,0.4041527298898141,1.0512143137268224,0.3134326349620023,1.0047689144760601,9.7468345233837031E-2,1.0012828284303281,8.3421185606209272E-2,-6.729319251027464,-122.33037870570018,57.669621294299816,null,51584.75,2660986432.5625,null,15.130182177243604,-29.666849100045091,null,-6.6889779279255475,-93.46837256738435,null,0,0]
[51883.5,51.883499999999998,63.837101015872193,1.5551308143164613,1.0000257174585216,7.1717372201451808E-3,1,0,6900.3075458576841,1.57065140571756,8.8584526422743295,1.4576686499834293,1.0885998215026238,0.4062447998762056,1.0517945884356767,0.31513035389782434,1.0048241792097505,9.8029228219631101E-2,1.0012977490289736,8.3904194847823882E-2,-6.7837140865543439,-122.4391211103962,57.560878889603799,null,51883.5,2691897572.25,null,15.121744941494502,-29.749547577360332,null,-6.7392511204426402,-93.49887833164658,null,0,0]
[52182.25,52.182250000000003,64.204591016378018,1.555220486815563,1.0000260144743547,7.2130313192899755E-3,1,0,6940.0401551873119,1.5706522354090977,8.9088122593317305,1.4583108553067801,1.0895810075274095,0.40833311110051879,1.0523778913308148,0.31682619572311166,1.0048797600159745,9.859004933594942E-2,1.0013127562230308,8.4387202000082151E-2,-6.8378222424632229,-122.5480121509064,57.451987849093598,null,52182.25,2722987215.0625,null,15.113287696938219,-29.832450880132583,null,-6.7892372684492361,-93.529324481117541,null,0,0]
[52481,52.481000000000002,64.572081527286585,1.5553091386330036,1.0000263131954337,7.2543253938349974E-3,1,0,6979.7727645216637,1.5706530556545375,8.95917550932311,1.4589458406833757,1.0905669367003303,0.41041765551826176,1.0529642173797293,0.31852015381146959,1.004935656842288,9.9150808240307781E-2,1.0013278500199625,8.4870207050441474E-2,-6.8916471346168793,-122.65704534483491,57.342954655165087,null,52481,2754255361,null,15.104810390345573,-29.915551492042169,null,-6.8389396553477884,-93.559712030816527,null,0,0]
[52786.5,52.786499999999997,64.947875689881542,1.5553987559787872,1.0000266204293318,7.2965524469882819E-3,1,0,7020.4030980884527,1.5706538848311788,9.0106803672642037,1.4595878321383815,1.0915800338155606,0.41254539478518598,1.0535669120874775,0.32025043052643259,1.0049931433655612,9.9724172318243404E-2,1.0013433744161657,8.5364122998871458E-2,-6.946398711502094,-122.76868245285415,57.231317547145849,null,52786.5,2786414582.25,null,15.096120750807691,-30.000726079505245,null,-6.8894749370680426,-93.590726593888817,null,0,0]
[53092,53.091999999999999,65.323670368088841,1.5554873422221107,1.0000269294464001,7.3387794741198061E-3,1,0,7061.0334316600138,1.5706547044653862,9.0621888967691593,1.4602225258285562,1.0925980636354931,0.41466917860391411,1.0541727574122433,0.32197872359047508,1.0050509602388196,0.10029747061759119,1.0013589893888084,8.5858036722792214E-2,-7.0008611062101753,-122.88045495236665,57.119545047633352,null,53092,2818760464,null,15.087410041181766,-30.08609162086432,null,-6.9397202572281369,-93.62168195317777,null,0,0]
[53397.5,53.397500000000001,65.699465553060747,1.5555749150550189,1.0000272402466375,7.3810064750789994E-3,1,0,7101.6637652362633,1.5706555147209429,9.1137010355854855,1.4608500449826651,1.0936210123848609,0.41678899888892307,1.0547817479250736,0.32370502610581586,1.0051091074050555,0.10087070277288217,1.0013746949460081,8.6351948208763019E-2,-7.0550377736759762,-122.99235636208955,57.007643637910448,null,53397.5,2851293006.25,null,15.078678225668332,-30.171640601748969,null,-6.9896789497562528,-93.652579121601434,null,0,0]
[53703,53.703000000000003,66.075261236150752,1.5556614917671334,1.0000275528300417,7.4232334497152967E-3,1,0,7142.294098817124,1.5706563157579061,9.16521672285592,1.4614705100817991,1.0946488662734537,0.41890484772732489,1.0553938781813963,0.3254293312380096,1.0051675848069481,0.10144386841890554,1.0013904910959277,8.684585744333341E-2,-7.1089321053655619,-123.10438034477512,56.895619655224877,null,53703,2884012209,null,15.069925275085122,-30.257365674896693,null,-7.0393542915743694,-93.683419089020106,null,0,0]
[54015.75,54.015749999999997,66.459975654567089,1.5557491088624691,1.0000278746786899,7.4664625100730906E-3,1,0,7183.888654721698,1.5706571264187086,9.2179585728236173,1.4620985156408481,1.0957061794842398,0.42106678699851452,1.0560237819540463,0.32719248075205831,1.005227791994423,0.1020305669190585,1.0014067559652287,8.7351485581919436E-2,-7.1638164453015651,-123.21918333595518,56.780816664044821,null,54015.75,2917701248.0625,null,15.060942685945172,-30.345300050198258,null,-7.0899183539116208,-93.714932694465261,null,0,0]
[54328.5,54.328499999999998,66.844690577307659,1.5558357174234914,1.0000281983961405,7.5096915425244548E-3,1,0,7225.4832106309395,1.5706579277461352,{"$f":"SQRT(1+(A471/Zero2)^2)","v":9.2707040169050927},{"$f":"ATAN(A471/Zero2)","v":1.4627193753978618},1.096768604117244,0.42322454785723762,1.0566569646638628,0.32895352266383326,1.0052883451549977,0.10261719494199609,1.0014231157955513,8.7857111332419524E-2,-7.2184118856895685,-123.33410179250248,56.66589820749752,null,54328.5,2951585912.25,null,15.051937905033325,-30.433403909635445,null,-7.140192229837421,-93.746388379922365,null,0,0]
[54641.25,54.641249999999999,67.229405995714629,1.5559213347626839,1.0000285239823921,7.5529205469078492E-3,1,0,7267.0777665447677,1.57065871990045,9.3234529941015509,1.4633332101557601,1.0978361253328177,0.42537812237085038,1.0572934204198612,0.33071244984679671,1.0053492442261571,0.10320375209673423,1.0014395705958046,8.8362734680370605E-2,-7.2727218683482109,-123.44912936028109,56.550870639718909,null,54641.25,2985666201.5625,null,15.042910921068698,-30.521669886386206,null,-7.1901792578286923,-93.777787136504273,null,0,0]
[54954,54.954000000000001,67.614121901327138,1.556005977798566,1.0000288514374425,7.5961495230617328E-3,1,0,7308.6723224631032,1.5706595030382688,9.3762054447828369,1.4639401380202659,1.0989087282779257,0.42752750279278456,1.0579331433148182,0.33246925524385684,1.0054104891450448,0.10379023799257836,1.0014561203749481,8.8868355611298647E-2,-7.3267497718660932,-123.56425982755465,56.43574017244535,null,54954,3019942116,null,15.033861729041151,-30.61009077861884,null,-7.2398827192516162,-93.809129932750665,null,0,0]
[55274,55.274000000000001,68.007756576983894,1.5560915917845246,1.0000291884176586,7.6403805803867486E-3,1,0,7351.2311007054759,1.5706602951575579,9.4301843084149866,1.4645541068765326,1.1000114400119896,0.42972236003784864,1.0585910713612745,0.33426458252274249,1.0054735117108671,0.10439024532165693,1.0014731521184814,8.9385695054175096E-2,-7.3817416166161998,-123.68215935816723,56.317840641832774,null,55274,3055215076,null,15.024579778435704,-30.700714396373851,null,-7.290448240275488,-93.841142366594312,null,0,{"$f":"IF(AH474>0,W474,0)","v":0}]
[55594,55.594000000000001,68.401391745383535,1.5561762203912708,1.0000295273543169,7.6846116078161299E-3,1,0,7393.7898789524079,1.5706610781579431,9.4841666863636114,1.4651610867320373,1.1011194403107365,0.43191281067186538,1.0592524072134826,0.33605767377838269,1.0055368962105462,0.10499017722319511,1.0014902833145822,8.9903031935977151E-2,-7.4364451125109472,-123.80015389818192,56.199846101818082,null,55594,3090692836,null,15.015274586715757,-30.791485451686036,null,-7.340723667990928,-93.873098197341932,null,0,0]
[55914,55.914000000000001,68.79502739806783,1.5562598805321932,1.0000298682474156,7.7288426051768415E-3,1,0,7436.3486572038209,1.5706618521959892,9.5381525189595546,1.4657611958086758,1.1022327132254532,0.43409884699571083,1.0599171444925355,0.33784852167689644,1.0056006425756425,0.10559003327964393,1.0015075139730127,9.0420366241164687E-2,-7.490863682820442,-123.91823723304506,56.081762766954938,null,55914,3126375396,null,15.005946167432167,-30.882396738782916,null,-7.3907123399818087,-93.904998393178872,null,0,0]
[56234,56.234000000000002,69.188663526771066,1.5563425887358331,1.0000302110969526,7.7730735722958471E-3,1,0,7478.9074354596378,1.5706626174246965,9.5921417478731943,1.4663545496867556,1.1033512427960526,0.43628046151001881,1.0605852768027524,0.33963711896029974,1.0056647507373431,0.10618981307377832,1.0015248441035902,9.0937697954185423E-2,-7.5450006879569145,-124.03640328872554,55.963596711274462,null,56234,3162262756,null,14.996594540047889,-30.973441214484872,null,-7.4404175367405401,-93.936843900239595,null,0,0]
[56561.5,56.561500000000002,69.59152598669634,1.5564262666031046,1.0000305640077798,7.8183411712129443E-3,1,0,7522.4636850853094,1.5706633916230157,9.6473998064903785,1.4669549336697332,1.1045014141416898,0.43850862151902514,1.0612725770928315,0.34146529864182529,1.0057307359772703,0.10680357080743916,1.001542683415942,9.1467151928978266E-2,-7.600118430141106,-124.15741831833262,55.842581681667383,null,56561.5,3199203282.25,null,14.986999729794741,-31.066750269171706,null,-7.4909975447311394,-93.969380124745499,null,0,0]
[56889,56.889000000000003,69.994388928291258,1.556508981230545,1.000030918967824,7.8636087380874169E-3,1,0,7566.0199347154366,1.5706641569074868,9.7026613030076607,1.4675484788920372,1.1056570575777835,0.44073213475919343,1.0619634198134069,0.34329110583499123,1.0057971000247201,0.10741724777887779,1.0015606269388251,9.1996603155671305E-2,-7.6549481809719619,-124.27850755377899,55.721492446221006,null,56889,3236358321,null,14.97738067008639,-31.160184405013716,null,-7.5412874089227859,-94.001861004055755,null,0,0]
[57216.5,57.216500000000003,70.397252343286453,1.5565907491540543,1.0000312759770826,7.9088762727337787E-3,1,0,7609.5761843499458,1.5706649134311754,9.7579261790160654,1.468135301127641,1.1068181559638881,0.44295099383413084,1.0626577980555876,0.34511453300590783,1.0058638428047149,0.10803084354190479,1.0015786746829436,9.2526051617552507E-2,-7.7094933479321899,-124.39966491779046,55.60033508220954,null,57216.5,3273727872.25,null,14.96773739960771,-31.253736573638761,null,-7.5912904685067337,-94.034287484660723,null,0,0]
[57544,57.543999999999997,70.800116223600781,1.5566715865332152,1.0000316350355534,7.9541437749665479E-3,1,0,7653.1324339887587,1.570665661343662,9.8131943774188422,1.4687155135611092,1.1079846921506686,0.44516519156168594,1.063355704893217,0.34693557270361991,1.0059309642418679,0.1086443576506934,1.0015968266590636,9.3055497297896042E-2,-7.7637572759531723,-124.52088447194619,55.479115528053811,null,57544,3311311936,null,14.958069962603265,-31.347399887112342,null,-7.6410100055452457,-94.066660491488619,null,0,0]
[57879,57.878999999999998,71.212206467496401,1.5567533288596411,1.0000320044368776,8.0004479038268822E-3,1,0,7697.6861549977257,1.5706664176270406,9.8697316389614986,1.4693022900693475,1.1091835510411228,0.4474252661509297,1.0640732378238051,0.34879583780797213,1.00600001449591,0.10927183675594089,1.0016155021804023,9.3597064793209075E-2,-7.8189763389100788,-124.64493834013919,55.355061659860809,null,57879,3349978641,null,14.948156182631482,-31.443316136976602,null,-7.6915781847727231,-94.099720482483363,null,0,0]
[58214,58.213999999999999,71.624297181742961,1.55683413057692,1.0000323759823411,8.0467519983794325E-3,1,0,7742.2398760110445,1.5706671652061581,9.9262722600073641,1.4698823821495497,1.1103880633204757,0.44968044893026721,1.0647944481013851,0.35065358933153878,1.0060694607879039,0.10989922948176473,1.001634286785372,9.413862934268058E-2,-7.873908020240509,-124.76904513970716,55.23095486029284,null,58214,3388869796,null,14.938217227146042,-31.539334597576683,null,-7.7418564763929023,-94.132726413725138,null,0,0]
[58549,58.548999999999999,72.036388358268439,1.5569140078265267,1.0000327496719417,8.0930560584256753E-3,1,0,7786.7935970286417,1.5706679042304241,9.9828161834738331,1.4704559029922681,1.1115982106109279,0.45193073290009844,1.0655193282587798,0.35250881956832836,1.006139303035843,0.11052653535219195,1.001653180485693,9.4680190928363966E-2,-7.9285557064988632,-124.89319894288667,55.10680105711333,null,58549,3427985401,null,14.928253160195332,-31.635448391084619,null,-7.7918482159566196,-94.165679209035474,null,0,0]
[58884,58.884,72.448479989184378,1.5569929763827284,1.0000331255056767,8.1393600837670974E-3,1,0,7831.3473180504416,1.5706686348458481,10.039363353561006,1.4710229632553673,1.1128139745288317,0.45417611128964969,1.0662478708111733,0.35436152090267492,1.0062095411572758,0.11115375389165484,1.001672183293151,9.5221749532297256E-2,-7.9829227221231269,-125.017393958878,54.982606041121997,null,58884,3467325456,null,14.91826405102273,-31.731650797700798,null,-7.8415566819675631,-94.198579771195512,null,0,0]
[59227,59.226999999999997,72.870413077017375,1.5570729053515631,1.000033512536094,8.1867698407126644E-3,1,0,7876.9650085337616,1.5706693743453679,10.097264210707728,1.4715969843897778,1.1140645718323738,0.45647002112208357,1.066997598189245,0.35625583778119246,1.0062818666873237,0.11179585980392651,1.0016917529579383,9.5776237770826833E-2,-8.0383006582051379,-125.14459161938936,54.855408380610641,null,59227,3507837529,null,14.908010527118151,-31.83023553164389,null,-7.8921620797346748,-94.23221282068566,null,0,0]
[59570,59.57,73.292346625033062,1.5571519140416337,1.0000339018142701,8.2341795608548776E-3,1,0,7922.58269902134,1.570670105328912,10.155168356965897,1.4721644596428927,1.1153210182040723,0.458758774643378,1.0677511490354665,0.35814748766308346,1.0063546070476526,0.11243787315669876,1.0017114370283924,9.6330722845334185E-2,-8.0933912187454435,-125.27182062319446,54.728179376805542,null,59570,3548584900,null,14.897730913388186,-31.928899394162862,null,-7.9424772912130495,-94.265792962910169,null,0,0]
[59913,59.912999999999997,73.714280625329351,1.5572300182547267,1.000034293340202,8.2815892439806558E-3,1,0,7968.2003895131011,1.5706708279427417,10.213075736391586,1.4727254999900614,1.1165832938987619,0.46104236532186255,1.0685085152604936,0.36003646266736655,1.006427762148316,0.11307979344084704,1.0017312355173804,9.6885204736488803E-2,-8.1481977793003484,-125.39907517836073,54.600924821639268,null,59913,3589567569,null,14.887425299768628,-32.027635660981602,null,-7.9925056578976665,-94.299321102149321,null,0,0]
[60256,60.256,74.136215070184008,1.557307233432941,1.0000346871138874,8.3289988898769193E-3,1,0,8013.8180800089776,1.5706715423297877,10.270986294299414,1.473280213920213,1.117851379169061,0.46332078687068395,1.0692696887570012,0.36192275501168875,1.0065013318988807,0.11372162014770125,1.0017511484378434,9.7439683424942899E-2,-8.2027236535067729,-125.52634962861633,54.47365037138367,null,60256,3630785536,null,14.877093781042445,-32.126437764121512,null,-8.0422504641002917,-94.33279812207391,null,0,0]
[60607,60.606999999999999,74.567991004012399,1.5573853449124109,1.0000350923987993,8.377514261344518E-3,1,0,8060.499739966669,1.5706722650078082,10.330250770550933,1.473841426965145,1.1191550345746473,0.46564699176303925,1.0700525486003358,0.36385025725303916,1.0065770467365218,0.11437831916685851,1.0017716442792104,9.8007091225117679E-2,-8.2582340793242874,-125.65660741319414,54.343392586805862,null,60607,3673208449,null,14.866494579260813,-32.227605754369982,null,-8.0928653088288822,-94.367003926404365,null,0,0]
[60958,60.957999999999998,74.999767387571623,1.5574625570111014,1.0000355000375329,8.4260295933742263E-3,1,0,8107.1813999285214,1.570672979363378,10.389518463299559,1.4743962372295643,1.1204647318732823,0.46796777104528831,1.0708393781509375,0.36577493406265305,1.0066531955987312,0.1150349191163883,1.0017922599798663,9.8574495630402367E-2,-8.3134574016046816,-125.78687446745334,54.213125532546655,null,60958,3715877764,null,14.855868465404534,-32.328829255517377,null,-8.1431899924907061,-94.401158007758667,null,0,0]
[61309,61.308999999999997,75.431544213138821,1.5575388851724892,1.0000359100300857,8.4745448857377025E-3,1,0,8153.8630598944637,1.5706736855394376,10.448789317811382,1.4749447533284701,1.1217804499029347,0.47028311876523615,1.071630168664699,0.36769677742040813,1.0067297783870197,0.11569141945268467,1.0018129955539152,9.9141896620006692E-2,-8.3683969794934505,-125.91714514899029,54.082854851009714,null,61309,3758793481,null,14.845215555538893,-32.430101711536878,null,-8.1932278569837607,-94.435261249804753,null,0,0]
[61660,61.66,75.863321473166863,1.5576143444885051,1.0000363223764548,8.5230601382066153E-3,1,0,8200.544719864427,1.5706743836756722,10.508063280584519,1.4754870814415029,1.1231021675036834,0.47259302923145607,1.0724249113793505,0.36961577941350038,1.006806795002368,0.11634781963265002,1.0018338510155418,9.9709294173120938E-2,-8.4230561105513342,-126.04741394951786,53.95258605048214,null,61660,3801955600,null,14.834535970212631,-32.53141672069183,null,-8.2429821870128741,-94.469314516067342,null,0,0]
[62019,62.018999999999998,76.304940252086297,1.5576906402722013,1.0000367465559286,8.5726811099087249E-3,1,0,8248.2903492964779,1.570675089549346,10.56869137769201,1.4760354773512023,1.1244601939133296,0.47494995701371562,1.0732418470818734,0.3715755719650945,1.0068860156498389,0.11701907632844559,1.0018553058476318,0.10028962028761786,-8.4786743002445171,-126.18064428937645,53.819355710623555,null,62019,3846356361,null,14.823585511310435,-32.635078407805246,null,-8.2935805823552844,-94.504093107355544,null,0,0]
[62378,62.378,76.746559470068576,1.5577660580056529,1.0000371731977316,8.6223020393938251E-3,1,0,8296.035978732596,1.5706757872980832,10.629322616948491,1.4765776171585119,1.1258244517315379,0.47730118564886925,1.0740628985977823,0.37353237575387521,1.0069656899140955,0.11769022710276787,1.0018768861248106,0.10086994276309347,-8.5340059004387516,-126.31386142059552,53.686138579404485,null,62378,3891014884,null,14.81260741574385,-32.738771540581276,null,-8.3438891442906442,-94.538821183988773,null,0,0]
[62737,62.737000000000002,77.188179119577626,1.5578406127588611,1.0000376023018607,8.6719229264176113E-3,1,0,8343.7816081727051,1.5706764770613639,10.689956944889088,1.4771136069974069,1.1271949183324583,0.47964670988093805,1.074888056495505,0.37548618266042205,1.0070458176874719,0.11836127137619863,1.0018985918625145,0.10145026157721886,-8.5890542489345592,-126.44705986309327,53.552940136906727,null,62737,3935931169,null,14.801601825825559,-32.842489744837266,null,-8.3939112099465252,-94.57349960814912,null,0,0]
[63096,63.095999999999997,77.629799193248815,1.5579143192589451,1.0000380338683126,8.7215437707357842E-3,1,0,8391.5272376167395,1.5706771589754938,10.750594309252429,1.4776435506216394,1.1285715710974211,0.48198652473047499,1.0757173113253096,0.3774369846816864,1.0071263988617236,0.11903220856988715,1.0019204230762675,0.10203057670764339,-8.6438226224095764,-126.58023426914654,53.419765730853456,null,63096,3981105216,null,14.790568887973665,-32.946226798429528,null,-8.4436500593650994,-94.608129222371801,null,0,0]
[63463.25,63.463250000000002,78.081568349029354,1.5579888568603701,1.0000384779002258,8.7723048824922146E-3,1,0,8440.3700855687002,1.5706778485774486,10.812628239280015,1.4781795221409839,1.1299862374975878,0.48437419709733193,1.076569852213642,0.37942949962939387,1.0072093008679595,0.11971845283460665,1.0019428858329711,0.10262422393575044,-8.6995632545858257,-126.71643877787351,53.283561222126494,null,63463.25,4027584100.5625,null,14.77925426659503,-33.052360953315642,null,-8.494242240257293,-94.643504995612048,null,0,0]
[63830.5,63.830500000000001,78.533337933628658,1.558062536894647,1.0000389245089265,8.823065949040497E-3,1,0,8489.21293352463,1.5706785302441277,10.874665239964719,1.4787093786682772,1.1314073297948386,0.48675588499217681,1.0774266604350942,0.38141885342630227,1.0072926771222646,0.12040458381793025,1.0019654799321374,0.10321786726151776,-8.7550176432153712,-126.85260722117265,53.147392778827353,null,63830.5,4074332730.25,null,14.76791134824137,-33.158502131791316,null,-8.5445448050132953,-94.678831412876633,null,0,0]
[64197.75,64.197749999999999,78.985107939688575,1.5581353740760135,1.0000393736944109,8.873826970119101E-3,1,0,8538.0557814844597,1.5706792041117146,10.936705259052864,1.4792332239679382,1.1328348238061441,0.48913158396774964,1.0782877258171881,0.38340503788093627,1.0073765275068847,0.12109060090203834,1.0019882053906684,0.10381150666094693,-8.8101891070018716,-126.98873428250145,53.011265717498546,null,64197.75,4121351105.0625,null,14.756540301817287,-33.264644141586793,null,-8.5945610879291561,-94.714109315869251,null,0,0]
[64565,64.564999999999998,79.436878360018397,1.5582073827840135,1.0000398254566758,8.9245879454664997E-3,1,0,8586.8986294481219,1.5706798703132945,10.998748245467235,1.4797511594764488,1.1342686953615475,0.49150128986953517,1.0791530381694501,0.38538804492792228,1.0074608519034349,0.12177650346974524,1.0020110622255627,0.10440514211001524,-8.865080903941724,-127.12481477607807,52.875185223921932,null,64565,4168639225,null,14.74514129995187,-33.370780940408849,null,-8.6442943662792189,-94.749339527115694,null,0,0]
[64941,64.941000000000003,79.899412963068585,1.5582802635094326,1.0000402906521058,8.9765582905462857E-3,1,0,8636.905194011144,1.5706805445812713,11.062272473515678,1.4802754160492602,1.1357433120103821,0.49392124275613059,1.0800433565182757,0.38741499841316845,1.0075476763531481,0.12247862888267716,1.0020345997679847,0.1050129172403004,-8.920994136921891,-127.26408396037318,52.735916039626815,null,64941,4217333481,null,14.733441930054274,-33.479434971260687,null,-8.6949227410619674,-94.785360553556671,null,0,0]
[65317,65.316999999999993,80.361947985627182,1.5583523052837411,1.0000407585485589,9.0285285871349406E-3,1,0,8686.9117585780496,1.5706812110863457,11.125799707254162,1.4807936858551265,1.1372245624959614,0.49633490570373845,1.0809381049485118,0.38943860457236934,1.0076349974180701,0.12318063295007048,1.0020582750579905,0.105620688178701,-8.9766209406087203,-127.4032937360613,52.5967062639387,null,65317,4266310489,null,14.72171363414917,-33.588071186852417,null,-8.7452612399030052,-94.821333274240772,null,0,0]
[65693,65.692999999999998,80.824483420492044,1.5584235225094178,1.0000412291460314,9.080498834951798E-3,1,0,8736.9183231487714,1.5706818699618124,11.189329895488424,1.4813060705872816,1.1387124209301669,0.49874227519048858,1.0818372724682794,0.39145885515823137,1.0077228149691031,0.12388251501165118,1.0020820881141339,0.10622845489935601,-9.0319646231088129,-127.542438942483,52.457561057516997,null,65693,4315570249,null,14.709956608496555,-33.69668356643993,null,-8.7953132025243281,-94.857258512903613,null,0,0]
[66069,66.069000000000003,81.287019260624874,1.5584939292611657,1.0000417024445192,9.1324690337161937E-3,1,0,8786.9248877232403,1.5706825213379323,11.252862988177947,1.481812669654861,1.1402068614448193,0.50114334800463689,1.0827408480680136,0.39347574206035296,1.0078111288764602,0.12458427440785552,1.0021060389550731,0.10683621737637708,-9.0870284320406931,-127.68151454861921,52.318485451380795,null,66069,4365112761,null,14.698171052702779,-33.805266237743275,null,-8.8450819115021613,-94.893137074499052,null,0,0]
[66453.75,66.453749999999999,81.760319312578005,1.5585651498320601,1.000042189553294,9.1856485942799701E-3,1,0,8838.09516889734,1.5706831802420451,11.317877532641694,1.4823251701133249,1.1417428661573592,0.50359377564515817,1.0836700026682278,0.39553607416740355,1.0079020116420598,0.12530223697329856,1.0021306898139783,0.10745811884215456,-9.1430872532352723,-127.82374945716799,52.176250542832008,null,66453.75,4416100889.0625,null,14.686081909775917,-33.91633903883055,null,-8.8957189498329932,-94.929803077553103,null,0,0]
[66838.5,66.838499999999996,82.233619774475841,1.5586355505748926,1.0000426794902513,9.2388281028870974E-3,1,0,8889.2654500752342,1.57068383156031,11.382895015863639,1.4828318160436174,1.1432857081288561,0.50603760431745892,1.0846037495202978,0.39759286746952827,1.0079934138573141,0.12602006970275939,1.0021554849850181,0.10808001580955696,-9.198859715733553,-127.96590123167368,52.034098768326317,null,66838.5,4467385082.25,null,14.673963326263102,-34.027368752007774,null,-8.9460661743302321,-94.966421853158209,null,0,0]
[67223.25,67.223249999999993,82.706920639280497,1.5587051455636702,1.0000431722553862,9.2920075592368701E-3,1,0,8940.4357312568536,1.5706844754229787,11.447915387772486,1.4833327069387445,1.1448353597165322,0.50847483156943396,1.0855420767739206,0.39964611371900555,1.0080853353809291,0.12673777189188018,1.0021804244885248,0.10870190825075654,-9.2543491118933137,-128.10796488214098,51.892035117859024,null,67223.25,4518965340.5625,null,14.661815525815642,-34.138349543713197,null,-8.9961269246396256,-95.002994206118402,null,0,0]
[67608,67.608000000000004,83.180221900114276,1.5587739485521033,1.0000436678486953,9.3451869630285719E-3,1,0,8991.6060124421401,1.5706851119573384,11.512938599425866,1.4838279400557319,1.1463917933053978,0.51090545527590925,1.0864849725617012,0.40169580481616535,1.0081777760708597,0.12745534283709728,1.0022055083449459,0.10932379613789493,-9.3095586739406642,-128.24993554684784,51.750064453152163,null,67608,4570841664,null,14.649638735034213,-34.249275727059278,null,-9.0459044832622819,-95.039520922884293,null,0,0]
[68001.75,68.001750000000001,83.664594938490623,1.5588435549851354,1.0000441779630076,9.399610274751705E-3,1,0,9043.9732592729142,1.5706857559237353,11.57948571212318,1.4843289989288044,1.1479916277353968,0.51338609674390723,1.0874546420746183,0.40378975274009166,1.0082729164918236,0.1281895624494378,1.0022313284371205,0.10996022636591332,-9.3657732693544951,-128.39512594724522,51.604874052754781,null,68001.75,4624238003.0625,null,14.637147330935466,-34.36273435163239,null,-9.096556589971561,-95.076855617717797,null,0,0]
[68395.5,68.395499999999998,84.148968377559953,1.5589123600894261,1.0000446910393448,9.4540335307919023E-3,1,0,9096.3405061073972,1.5706863924755576,11.646035698741997,1.4848243314337113,1.1495985067388979,0.51585981864605601,1.0884290711528026,0.40587996055154729,1.0083686003482399,0.12892364311759452,1.002257299758248,0.11059665176518814,-9.4217014488127777,-128.54020905564485,51.459790944355149,null,68395.5,4677944420.25,null,14.624626053324967,-34.476124186190219,null,-9.1469188796954217,-95.114144126320127,null,0,0]
[68789.25,68.789249999999996,84.633342210442549,1.5589803776228206,1.0000452070777019,9.508456730826861E-3,1,0,9148.7077529455219,1.5706870217401288,11.712588510294145,1.485314034939728,1.1512124008171476,0.51832661974619487,1.0894082470245716,0.40796642004709943,1.0084648274854244,0.12965758409007536,1.0022834223306176,0.11123307230575948,-9.4773464904426046,-128.68518005757556,51.314819942424435,null,68789.25,4731960915.5625,null,14.612075153615256,-34.589439588352484,null,-9.1969946931729041,-95.151387235259662,null,0,0]
[69183,69.183000000000007,85.117716430415271,1.5590476210300297,1.0000457260780746,9.5628798745342747E-3,1,0,9201.0749997872299,1.5706876438418731,11.779144098896534,1.48579820462641,1.1528332805081558,0.52078649915197839,1.0903921569020147,0.41004912318325037,1.008561597747873,0.13039138461627614,1.0023096961766444,0.11186948795763317,-9.5327116125727347,-128.83003426556488,51.169965734435124,null,69183,4786287489,null,14.599494885760301,-34.702675060733739,null,-9.2467873139730301,-95.188585713161487,null,0,0]
[69586,69.585999999999999,85.613469994298043,1.5591156562169362,1.0000462603380409,9.6185814715247751E-3,1,0,9254.6724613202914,1.5706882732677594,11.847266042442193,1.4862881152078187,1.1544994410008254,0.5232969981149963,1.0914040696199534,0.41217685532366394,1.0086612035941587,0.13114227741452403,1.0023367439190505,0.11252084923275421,-9.5890908125687595,-128.97816569402778,51.02183430597222,null,69586,4842211396,null,14.586588937859513,-34.818482310712263,null,-9.2974597843517035,-95.226612627856056,null,0,0]
[69989,69.989000000000004,86.109223949904234,1.559182908010422,1.0000467977008152,9.6742830088269727E-3,1,0,9308.2699228569763,1.5706888954451173,11.915390796964692,1.486772423899583,1.1561728568488823,0.52580024554946603,1.0924209142236265,0.41430063600306266,1.0087613780514724,0.13189302150206322,1.0023639501739752,0.11317220532309957,-9.6451834229546591,-129.12616523448114,50.873834765518865,null,69989,4898460121,null,14.573652771544426,-34.934194628033659,null,-9.347842382438456,-95.264594363768012,null,0,0]
[70392,70.391999999999996,86.604978290506821,1.55924938986305,1.0000473381663928,9.7299844860953156E-3,1,0,9361.8673843972265,1.570689510498442,11.983518314523904,1.4872512260144821,1.1578534965943921,0.52829624159285282,1.0934426769538454,0.41642045711379716,1.0088621209504343,0.13264361607705508,1.0023913149658592,0.11382355619639843,-9.7009927089575267,-129.27402825395316,50.725971746046838,null,70392,4955033664,null,14.560686666339507,-35.049806566687217,null,-9.3979384510127382,-95.302531689843207,null,0,0]
[70795,70.795000000000002,87.100733009531922,1.5593151149211368,1.0000478817347682,9.7856859029842574E-3,1,0,9415.4648459409764,1.570690118549394,12.051648548261804,1.4877246147202421,1.1595413288263936,0.53078498674323282,1.094469344036378,0.41853631072076314,1.0089634321207714,0.13339406033865411,1.0024188383192822,0.11447490182034147,-9.7565218763227861,-129.42175024526549,50.578249754734514,null,70795,5011932025,null,14.547690903889388,-35.16531282406369,null,-9.447751275637092,-95.34042535747875,null,0,0]
[71207.25,71.207250000000002,87.607867098896349,1.5593815789015426,1.0000484409900265,9.8426657635058579E-3,1,0,9470.2925221763271,1.5706907334355029,12.121345327938686,1.4882033627840452,1.1612753109393616,0.53332335414364329,1.0955246361794828,0.42069661596552937,1.0090676564793473,0.13416157307543086,1.0024471575004439,0.11514119221983601,-9.8130390413120203,-129.57271238635224,50.427287613647763,null,71207.25,5070472452.5625,null,14.534366461178001,-35.283355549968618,null,-9.498417743213448,-95.379144385385885,null,0,0]
[71619.5,71.619500000000002,88.115001570810364,1.5594472778325847,1.0000490034921428,9.8996455601130101E-3,1,0,9525.1201984152158,1.5706913412429029,12.191044854057715,1.4886766366889626,1.1630167531682789,0.5358541361651753,1.0965850311927499,0.42285275323697863,1.0091724751322777,0.13492892682728749,1.0024756426580308,0.1158074770577148,-9.8692696828221429,-129.72351779927649,50.276482200723507,null,71619.5,5129352780.25,null,14.521011586507072,-35.401276906298079,null,-9.5487945924990889,-95.417819264198229,null,0,0]
[72031.75,72.031750000000002,88.62213641870666,1.5595122248475382,1.0000495692411118,9.9566252924358327E-3,1,0,9579.9478746575805,1.570691942093132,12.260747079780215,1.4891445295827672,1.164765622052266,0.53837733448469827,1.0976505142871609,0.4250047145962908,1.0092778878944011,0.13569612074021503,1.0025042938188014,0.1164737562992661,-9.9252170484934918,-129.87416204756104,50.125837952438957,null,72031.75,5188573008.0625,null,14.507626587268696,-35.519071659118929,null,-9.5988851630287115,-95.456450744429347,null,0,0]
[72444,72.444000000000003,89.129271636167331,1.5595764327807962,1.0000501382369278,1.0013604960104444E-2,1,0,9634.7755509033668,1.5706925361049617,12.330451959324803,1.4896071325164959,1.1665218841888316,0.54089295115530001,1.0987210706602384,0.42715249229007241,1.0093838945795841,0.13646315396131289,1.0025331110096636,0.11714002990973524,-9.9808843269321628,-130.02464081906695,49.975359180933054,null,72444,5248133136,null,14.494211772534413,-35.636734716029409,null,-9.6486927371934801,-95.495039559465738,null,0,0]
[72865.75,72.865750000000006,89.648093790024262,1.559641368592527,1.0000507237047722,1.0071897615284873E-2,1,0,9690.8666908866162,1.5706931368497996,12.401765836479489,1.4900750143861474,1.1683262341082643,0.54345869517200052,1.0998215317642821,0.42934542666909647,1.0094929585267911,0.13724769572522896,1.0025627641130879,0.11782165144517037,-10.037547838524299,-130.17841165373278,49.82158834626722,null,72865.75,5309417523.0625,null,14.480457293070641,-35.756967783336727,null,-9.6993586010846897,-95.534474221549445,null,0,0]
[73287.5,73.287499999999994,90.16691631754648,1.5597055571201928,1.0000513125708184,1.0130190202013774E-2,1,0,9746.9578308733217,1.5706937306803852,12.473082397502489,1.4905375459984411,1.170138251419867,0.54601650961897685,1.1009272712790499,0.43153396651540044,1.009602643688281,0.13803206750360877,1.0025925910443136,0.11850326701327765,-10.093924773690402,-130.33200055187561,49.667999448124391,null,73287.5,5371057656.25,null,14.466672267294518,-35.877052670773772,null,-9.7497350478588469,-95.573865729429372,null,0,0]
[73709.25,73.709249999999997,90.685739212320641,1.559769011189138,1.0000519048350607,1.0188482719895108E-2,1,0,9803.048970863425,1.5706943177154045,12.54440159661938,1.4909948184078765,1.1719579005589311,0.54856639788611905,1.1020382733161267,0.43371810412354722,1.0097129498616058,0.13881626838685454,1.0026225918326412,0.1191848765767026,-10.150018363976358,-130.48540328017995,49.514596719820048,null,73709.25,5433053535.5625,null,14.452857030656464,-35.996984362328597,null,-9.7998254147679305,-95.613214815826026,null,0,0]
[74131,74.131,{"$f":"SQRT(1+(A525/pole1)^2)","v":91.204562468079345},{"$f":"ATAN(A525/pole1)","v":1.5598317433329001},{"$f":"SQRT(1+(A525/Zero1)^2)","v":1.0000525004974929},{"$f":"ATAN(A525/Zero1)","v":1.024677516853284E-2},{"$f":"IF(VIN_nom>Vout, 1, SQRT(1+(A525/z_RHP)^2))","v":1},{"$f":"IF(VIN_nom>Vout, 0, -ATAN(A525/z_RHP))","v":0},{"$f":"SQRT(1+(A525/Pole2)^2)","v":9859.140110856868},{"$f":"ATAN(A525/Pole2)","v":1.5706948980708426},12.615723389089148,1.4914469206187935,{"$f":"SQRT(1+(A525/pole4)^2)","v":1.1737851460319553},{"$f":"ATAN(A525/pole4)","v":0.55110836375462235},{"$f":"SQRT(1+(A525/Zero3)^2)","v":1.1031545219756371},{"$f":"ATAN(A525/Zero3)","v":0.43589783198707133},{"$f":"SQRT(1+(A525/pole5)^2)","v":1.0098238768432606},{"$f":"ATAN(A525/pole5)","v":0.1396002974666056},{"$f":"SQRT((1-(Z525/pterm2))^2+(A525/pterm1)^2)","v":1.0026527665075364},{"$f":"IF((ATAN((A525/pterm1)/(1-A525^2/pterm2))>0),ATAN((A525/pterm1)/(1-A525^2/pterm2)),PI()+ATAN((A525/pterm1)/(1-A525^2/pterm2)))","v":0.11986648009804261},{"$f":"20*LOG10(((E525*K525*G525*O525)/(C525*I525*S525*M525*Q525))*Adc)","v":-10.205831782324035},{"$f":"((F525+L525+H525+R525)-(D525+J525+T525+N525+T525))*radconv","v":-130.63861572826548},{"$f":"IF(V525>0,V525,V525+180)","v":49.361384271734522},null,{"$f":"IF(U525<0,A525,1000000000)","v":74131},{"$f":"A525^2","v":5495405161},null,{"$f":"20*LOG10((K525/(I525*M525))*AEA)","v":14.439011919830911},{"$f":"(L525-(J525+N525))*radconv","v":-36.116757981720163},null,{"$f":"20*LOG10((E525*G525/(C525*S525))*Acs*Am)","v":-9.8496329819719648},{"$f":"(F525+H525-(D525+T525))*radconv","v":-95.652522196737934},null,{"$f":"SUM((U526<0)*(U525>0))*A525","v":0},0]
[74562.75,{"$f":"A526/1000","v":74.562749999999994},91.735687769039032,1.5598952278850384,1.0000531138035149,1.0306449701489823E-2,1,0,9916.5612126792821,1.5706954853862423,12.688738913920369,1.4919044777979884,1.1756635484888116,0.55370239944596511,1.1043026557926605,0.43812466733671979,1.0099380768335191,0.140402737538255,1.0026838367968229,0.1205642386380569,-10.262681614811131,-130.79525968842992,49.204740311570077,null,74562.75,5559603687.5625,null,14.424807938876206,-36.239202834320182,null,-9.9003319516344135,-95.692719114264861,null,0,0]
[74994.5,74.994500000000002,92.266813435463433,1.5599579815511246,1.0000537306707715,1.0366124161040732E-2,1,0,9973.9823145050796,1.570696065939188,12.761757064849606,1.492356799118125,1.1775498367404513,0.55628814184596698,1.1054562542302562,0.44034686606038131,1.0100529269857772,0.14120499564018058,1.0027150893794095,0.12126199076658516,-10.319244378845674,-130.95169590208289,49.048304097917111,null,74994.5,5624175030.25,null,14.410573367613406,-36.361472121493982,null,-9.950741330689949,-95.732873791960387,null,0,0]
[75426.25,75.426249999999996,92.797939461077405,1.5600200168802687,1.0000543510992563,1.0425798546760701E-2,1,0,10031.403416334198,1.5706966398458075,12.834777797056566,1.4928039737574319,1.1794439729515498,0.55886559625117727,1.1066153001985346,0.44256442074570451,1.0101684270782765,0.1420070708019302,1.0027465242874434,0.12195973644334222,-10.375523296775931,-131.10792033983358,48.892079660166416,null,75426.25,5689119189.0625,null,14.39630857032062,-36.483561043828985,null,-10.000864460625621,-95.772986946551782,null,0,0]
[75858,75.858000000000004,93.329065839748623,1.56008134613594,1.0000549750889625,1.048547285822486E-2,1,0,10088.824518166582,1.5706972072195846,12.907801066733608,1.4932460888844479,1.1813459193725273,0.56143476836471995,1.1077797765985962,0.44477732419398347,1.0102845768881048,0.14280896205443586,1.0027781415532526,0.12265747562798882,-10.431521532631001,-131.26392909413013,48.736070905869866,null,75858,5754436164,null,14.382013912029517,-36.605464940202928,null,-10.050704625739863,-95.813059278397105,null,0,0]
[76299.75,76.299750000000003,93.872494288732042,1.5601433775785294,1.0000556172171333,1.0546529242047879E-2,1,0,10147.575581828172,1.5706977810887273,12.982518250304896,1.4936932963031191,1.1832999621927693,0.56405488060075082,1.108976826790673,0.44703666055524788,1.0104040891383621,0.14362923499545405,1.0028106799001324,0.1233713687733865,-10.488529506018644,-131.42332406760269,48.576675932397308,null,76299.75,5821651850.0625,null,14.367357642197804,-36.729996095943442,null,-10.101409661745933,-95.854018209450615,null,0,0]
[76741.5,76.741500000000002,94.415923094769369,1.5602046949538162,1.0000562630733889,1.0607585547235648E-2,1,0,10206.326645493064,1.5706983483511006,13.057238000592786,1.4941353855406083,1.185262101536189,0.56666633579783965,1.1101795256422167,0.44929111315731612,1.0105242810756101,0.14444931336133279,1.0028434092190408,0.12408525503684473,-10.54525016511089,-131.58248535210581,48.417514647894194,null,76741.5,5889257822.25,null,14.352670887059025,-36.854324111529763,null,-10.151825251580103,-95.894935837660725,null,0,0]
[77183.25,77.183250000000001,94.959352251730607,1.5602653105206337,1.0000569126577217,1.0668641773333104E-2,1,0,10265.077709161202,1.570698909120144,13.13196027378407,1.4945724437916292,1.1872322972594047,0.56926914134809992,1.1113878548149774,0.45154067497570488,1.0106451524573512,0.14526919611863762,1.0028763295451903,0.12479913437497839,-10.601686718472997,-131.74140913843243,48.258590861567569,null,77183.25,5957254080.5625,null,14.337954039187309,-36.978444421109344,null,-10.201954735537049,-95.935812862947131,null,0,0]
[77625,77.625,95.5027817536253,1.5603252362588143,1.0000575659701245,1.0729697919885178E-2,1,0,10323.82877283253,1.5706994635067146,13.206685027055645,1.4950045562852581,1.1892105093207805,0.57186330506353955,1.1126017959647063,0.45378533921437303,1.0107667030398337,0.14608888223547892,1.0029094409139914,0.12551300674434182,-10.657842316769033,-131.9000917378271,48.099908262172903,null,77625,6025640625,null,14.323207491418691,-37.102352595362525,null,-10.251801396749684,-95.976649969240512,null,0,0]
[78077,78.076999999999998,96.058820893133301,1.5603858506519177,1.0000582383002661,1.0792170679727204E-2,1,0,10383.943047378936,1.5707000242634803,13.283146154829879,1.4954416628300058,1.1912428780162296,0.57450872524284924,1.1138496940677056,0.45607701056932626,1.0108917767484757,0.14692738305585554,1.0029435183519,0.1262434359565148,-10.715013320778562,-132.06220290559438,47.937797094405624,null,78077,6096017929,null,14.308088445315828,-37.228911775604736,null,-10.302515281988383,-96.018394003807884,null,0,0]
[78529,78.528999999999996,96.614860381509047,1.5604457673472663,1.0000589145334755,1.0854643355325719E-2,1,0,10444.057321928572,1.5707005785649986,{"$f":"SQRT(1+(A535/Zero2)^2)","v":13.359609791459622},{"$f":"ATAN(A535/Zero2)","v":1.4958737659037988},1.1932835548933189,0.57714511576452943,1.1151034287288224,0.45836354075979141,1.0110175610224292,0.14776567582378916,1.0029777958765433,0.12697385778054956,-10.771896674439725,-132.22405412359757,47.775945876402432,null,78529,6166803841,null,14.292939137452208,-37.355239902484243,null,-10.352939844005871,-96.060097644756127,null,0,0]
[78981,78.980999999999995,97.170900212763641,1.5605049983217072,1.0000595946697446,1.0917115946193254E-2,1,0,10504.171596481379,1.5707011265220978,13.436075894111786,1.4963009507697025,1.1953324974007566,0.57977248632008471,1.1163629802837671,0.46064492323854178,1.0111440555965159,0.14860375943894955,1.0030122735264955,0.1277042721697067,-10.828495573695154,-132.38564181219434,47.614358187805664,null,78981,6237998361,null,14.277759988678378,-37.481332652419596,null,-10.403078422335009,-96.101761575658031,null,0,0]
[79433,79.433000000000007,97.726940381044386,1.5605635552795274,1.0000602787090658,1.097958845184234E-2,1,0,10564.285871037304,1.5707016682430834,13.512544420921468,1.4967233007680159,1.1973896631067393,0.58239084703294064,1.1176283290658646,0.46292115170213399,1.011271260204192,0.14944163280273082,1.0030469513405467,0.12843467907717918,-10.884813157000451,-132.54696251078821,47.453037489211795,null,79433,6309601489,null,14.262551419595681,-37.607185836598347,null,-10.45293429936401,-96.143386464465877,null,0,0]
[79895.5,79.895499999999998,98.295897754536057,1.5606227867672311,1.0000609826787799,1.1043512110606822E-2,1,0,10625.796605514181,1.5707022162036062,13.590791784974389,1.4971505423245739,1.1995030847753496,0.58506071727974285,1.1189290522923352,0.46524491583488858,1.0114021544730787,0.15029875126038278,1.0030826419568282,0.12918204560844893,-10.942151023384314,-132.71175084998509,47.288249150014906,null,79895.5,6383290920.25,null,14.246959539057691,-37.735710391536443,null,-10.503659069855086,-96.185938570907069,null,0,{"$f":"IF(AH538>0,W538,0)","v":0}]
[80358,80.358000000000004,98.864855468916772,1.5606813365121328,1.0000616907349715,1.110743567911501E-2,1,0,10687.307339994215,1.570702757856562,13.669041601424658,1.4975728923821563,1.2016250266383168,0.58772117702197568,1.1202358035510127,0.46756327113627527,1.0115337915780149,0.15115564726324068,1.0031185422277462,0.12992940420702506,-10.999200821955444,-132.87625268872381,47.12374731127619,null,80358,6457408164,null,14.231337745112034,-37.863975665129161,null,-10.55409462761709,-96.228451167024375,null,0,0]
[80820.5,80.820499999999996,99.433813518334844,1.5607392162165781,1.0000624028776322,1.1171359156844682E-2,1,0,10748.818074477347,1.5707032933102369,13.747293828395023,1.4979904343188284,1.203755443638258,0.5903722384631046,1.1215485617715513,0.46987621163464982,1.0116661712290296,0.15201231964000073,1.0031546521955592,0.13067675482253943,-11.05596573712214,-133.04046468706832,46.959535312931678,null,80820.5,6531953220.25,null,14.215686486769503,-37.991977585576656,null,-10.60424431169908,-96.270924920456835,null,0,0]
[81283,81.283000000000001,100.00277189707178,1.5607964373166132,1.0000631191067528,1.1235282543273627E-2,1,0,10810.328808963524,1.5707038226704526,13.825548424955048,1.4984032496317223,1.2058942908568691,0.59301391424894667,1.1228673058855085,0.47218373161796923,1.0117992931346675,0.15286876722128329,1.0031909719027614,0.13142409740454811,-11.112448896219389,-133.20438362267916,46.79561637732084,null,81283,6606926089,null,14.200006212260112,-38.119712214052278,null,-10.654111404016366,-96.313360483581405,null,0,0]
[81756.25,81.756249999999994,100.58495504886093,1.5608543183342254,1.0000638562133899,1.1300691621468944E-2,1,0,10873.269252416536,1.5707043581350395,13.905624323251615,1.4988208505138163,1.2080915315271452,0.59570728937496142,1.1242228761229196,0.47453926919651984,1.0119362772532845,0.15374488751054241,1.003228352950909,0.13218880228351279,-11.169956455438449,-133.37180596528839,46.628194034711612,null,81756.25,6684084414.0625,null,14.183931908299565,-38.250135153363438,null,-10.704848413633496,-96.356743519669365,null,0,0]
[82229.5,82.229500000000002,101.16713853375258,1.5609115331797301,1.0000645975986415,1.1366100602963718E-2,1,0,10936.209695872631,1.5707048874361789,13.985702618787633,1.4992336693310933,1.2102975041613997,0.59839086564270416,1.1255846691304783,0.47688912007445217,1.0120740379101776,0.15462076996193122,1.0032659536925814,0.13295349864407743,-11.227175456396537,-133.5389150013259,46.461084998674096,null,82229.5,6761690670.25,null,14.167828170169219,-38.380270298443108,null,-10.755296316846682,-96.400087904379276,null,0,0]
[82702.75,82.702749999999995,101.74932234602898,1.560968093287753,1.0000653432624977,1.1431509487198477E-2,1,0,10999.150139331752,1.5707054106796776,14.065783270619729,1.499641787618748,1.2125121611003835,0.60106465798801378,1.1269526623496737,0.4792332789632357,1.0122125747882895,0.15549641332893185,1.0033037741740736,0.13371818643194897,-11.284109073002435,-133.7057076413785,46.294292358621504,null,82702.75,6839744857.5625,null,14.151695474814247,-38.51011383949151,null,-10.805458452359471,-96.443394289788202,null,0,0]
[83176,83.176000000000002,102.33150648010243,1.5610240098327213,1.0000660932049494,1.1496918273613762E-2,1,0,11062.09058279385,1.5707059279689353,14.145866238730482,1.5000452850719639,1.2147354548454694,0.6037286817975952,1.1283268332289353,0.48157174085015059,1.012351887568951,0.15637181636717343,1.0033418144419375,0.1344828655927493,-11.340760422507527,-133.87218091211153,46.127819087888469,null,83176,6918246976,null,14.135534297846348,-38.639662097828612,null,-10.855338101749417,-96.486663313060077,null,0,0]
[83660.5,83.660499999999999,102.92753050128393,1.5610806003234683,1.0000668654072353,1.1563881842097445E-2,1,0,11126.527233314338,1.5707064514923537,14.227855281093703,1.5004536688092631,1.2170204980544079,0.60644593113532996,1.1297400467588463,0.48395988546369723,1.0124953155181322,0.15726777904003814,1.0033809867295169,0.13526571355259714,-11.398469261021688,-134.04227771722427,45.957722282775734,null,83660.5,6999079260.25,null,14.118959930606705,-38.771980348030063,null,-10.906114208810401,-96.530922863635482,null,0,0]
[84145,84.144999999999996,103.52355484829361,1.5611365391885799,1.0000676420939336,1.1630845306869014E-2,1,0,11190.963883837841,1.5707069689869624,14.309846669148527,1.5008573727658334,1.2193144933478843,0.60915297603454088,1.1311596873404377,0.48634204924343577,1.012639556016407,0.15816348718970308,1.0034203894766744,0.1360485523547191,-11.45588868903949,-134.21203384158696,45.787966158413042,null,84145,7080381025,null,14.102356715635583,-38.903981713230884,null,-10.956601022487604,-96.575144560055335,null,0,0]
[84629.5,84.629499999999993,104.11957951553596,1.5611918376182479,1.0000684232650336,1.169780866732816E-2,1,0,11255.400534364309,1.5707074805563055,14.391840362804219,1.501256476794377,1.2216173902942997,0.61184983441871454,1.132585730805729,0.48871822769415663,1.0127846087166064,0.15905893948798308,1.0034600227342032,0.13683138194048672,-11.513021875827565,-134.38144645341578,45.618553546584224,null,84629.5,7162152270.25,null,14.085725158244955,-39.03566265108104,null,-11.006801886277948,-96.619329040145658,null,0,0]
[85114,85.114000000000004,104.71560449754284,1.5612465065479091,1.0000692089205252,1.1764771922874595E-2,1,0,11319.837184893688,1.5707079863015692,14.473836322877373,1.5016510589440353,1.2239291386466549,0.61453652466939779,1.1340181529995768,0.49108841661356484,1.0129304732698057,0.15995413460909283,1.0034998865531797,0.13761420225117604,-11.569871934300657,-134.55051283562827,45.449487164371732,null,85114,7244392996,null,14.06906576183502,-39.167019748676729,null,-11.056720086443281,-96.663476927130517,null,0,0]
[85609.5,85.609499999999997,105.32516184248118,1.5613017767075477,1.0000700170516517,1.1833255390874165E-2,1,0,11385.736793435981,1.5707084976083074,14.55769620861061,1.5020500020761576,1.2263024754730263,0.61727371563673872,1.1354896690932739,0.49350621874374523,1.013080488850348,0.16086938669669967,1.0035408939593951,0.13841478591737788,-11.627723049238231,-134.72305684578527,45.276943154214734,null,85609.5,7328986490.25,null,14.051999861747323,-39.301020776961636,null,-11.107482623697059,-96.708589925600066,null,0,0]
[86105,86.105000000000004,105.93471950546314,1.5613564108086637,1.0000708298730843,1.1901738747873144E-2,1,0,11451.636401981217,1.5707090030303124,14.641558384742183,1.5024443752324332,1.2286849644862499,0.62000031183306159,1.1369678057906516,0.49591774832108104,1.0132313528229124,0.16178436699966894,1.0035821426241172,0.13921535975801794,-11.685284444874393,-134.89523333251296,45.104766667487041,null,86105,7414071025,null,14.034905902629838,-39.434676272739985,null,-11.157956291238838,-96.753665923997346,null,0,0]
[86600.5,86.600499999999997,106.54427748102992,1.5614104197679262,1.0000716473848119,1.1970221993229434E-2,1,0,11517.536010529344,1.5707095026685955,14.72542281214022,1.5028342563700932,1.2310765525499454,0.6227163343469907,1.1384525373036598,0.49832300178423072,1.0133830648085946,0.16269907410770457,1.0036236326028984,0.14001592370996846,-11.742559276975832,-135.06703974235359,44.932960257646414,null,86600.5,7499646600.25,null,14.01778441611402,-39.567982983468184,null,-11.208144426879327,-96.798705544221249,null,0,0]
[87096,87.096000000000004,107.15383576384704,1.5614638142536148,1.0000724695868226,1.2038705126300946E-2,1,0,11583.435619080316,1.5707099966218696,14.809289452558225,1.5032197216859806,1.2334771867376855,0.62542180472790476,1.1399438378638431,0.500721975880834,1.0135356244265874,0.16361350661318103,1.0036653639516007,0.14081647770999514,-11.799550645501061,-135.23847363458307,44.761526365416927,null,87096,7585713216,null,14.000635931327617,-39.700937783732996,null,-11.258050311323631,-96.843709393932912,null,0,0]
[87603.25,87.603250000000003,107.77784907154178,1.561517849286612,1.0000733161444795,1.2108812111743099E-2,1,0,11650.897932781454,1.5707104965003564,14.89514711124281,1.5036098313241351,1.2359440635785699,0.62818052359751431,1.1414772799364867,0.50317133029551286,1.0136926793764527,0.16454933752722561,1.003708334975326,0.14163600520904249,-11.857603027526761,-135.41358450501323,44.586415494986767,null,87603.25,7674329410.5625,null,13.983053380815873,-39.836677737093758,null,-11.308850631315881,-96.889744005832199,null,0,0]
[88110.5,88.110500000000002,108.40186269030163,1.5615712622161275,1.0000741676174776,1.2178918978150271E-2,1,0,11718.360246485468,1.5707109906232668,14.981007010770234,1.5039954693885302,1.2384203090935197,0.63092823108495799,1.1430175517176595,0.50561409808378277,1.0138506218220842,0.16548487768405187,1.0037515590715784,0.14245552214412804,-11.915364743956241,-135.58830015378905,44.411699846210951,null,88110.5,7763460210.25,null,13.965443650169895,-39.972042657263351,null,-11.359361935132862,-96.935742375377316,null,0,0]
[88617.75,88.617750000000001,109.02587661478545,1.5616240637237553,1.0000750240058047,1.2249025724833619E-2,1,0,11785.822560192311,1.5707114790894359,15.06686911283157,1.5043767122104208,1.2409058671965651,0.6336649517446189,1.1445646256345878,0.50805027674340597,1.0140094513487716,0.16642012558227376,1.0037950363012946,0.14327502844706091,-11.972838947616502,-135.76261831023589,44.237381689764106,null,88617.75,7853105615.0625,null,13.947807298322697,-40.107029583308346,null,-11.409587564831307,-96.981705110710919,null,0,0]
[89125,89.125,109.64989083977362,1.5616762642479494,1.000075885309448,1.2319132351104307E-2,1,0,11853.284873901935,1.5707119619954486,15.152733379985218,1.504753634396089,1.2434006820401131,0.63639071059321095,1.1461184741419341,0.51047986409847379,1.0141691675397366,0.1673550797234882,1.0038387667257482,0.14409452404953094,-12.030028735851142,-135.93653681475797,44.063463185242028,null,89125,7943265625,null,13.930144881080402,-40.241635679489718,null,-11.45953080526583,-97.027632806037943,null,0,0]
[89644,89.644000000000005,110.28836011101727,1.5617290625643687,1.0000767716518428,1.2390862810349398E-2,1,0,11922.309892761925,1.5707124504311578,15.240588820083154,1.5051348917878122,1.2459628099376303,0.63916829018073296,1.1477152992824129,0.51295890668098432,1.0143335006892447,0.16831138565240941,1.0038837722514942,0.14493299140017812,-12.088252074915724,-136.11406820380995,43.88593179619005,null,89644,8036046736,null,13.912046927761416,-40.378962813124154,null,-11.510342027437781,-97.074588714662127,null,0,0]
[90163,90.162999999999997,110.92682968616843,1.5617812530907564,1.0000776631398822,1.2462593142079799E-2,1,0,11991.334911624726,1.570712933243759,15.328446450115754,1.5055117787490278,1.2485345108787942,0.64193444865453397,1.1493191582569404,0.51543104548194385,1.0144987611670522,0.16926738089348359,1.0039290429687648,0.145771447403822,-12.146184057546961,-136.29117698062421,43.708823019375785,null,90163,8129366569,null,13.89392285430684,-40.515885650186931,null,-11.560864405660906,-97.121509156653303,null,0,0]
[90682,90.682000000000002,111.56529956000945,1.5618328462616731,1.0000785597735524,1.2534323345557711E-2,1,0,12060.359930490289,1.5707134105298008,15.416306232641659,1.5058843698949076,1.2511157258306851,0.6446892142429298,1.1509300216598772,0.51789627920970505,1.0146649485200518,0.17022306385152694,1.0039745789442915,0.14660989198690202,-12.20382782975781,-136.46786117382808,43.532138826171916,null,90682,8223225124,null,13.875773245359021,-40.652401538438831,null,-11.611101280809937,-97.168394725695293,null,0,0]
[91201,91.200999999999993,112.20376972744147,1.5618838522741902,1.0000794615528397,1.2606053420045345E-2,1,0,12129.384949358569,1.5707138823836335,15.504168131067305,1.5062527381540844,1.2537063960290509,0.64743261563385379,1.1525478601219166,0.52035460691554181,1.0148320622928926,0.17117843293467941,1.004020380245175,0.14744832507572417,-12.261186482523529,-136.6441189210756,43.355881078924398,null,91201,8317622401,null,13.85759868179489,-40.788507948480358,null,-11.661055936584566,-97.215246001857167,null,0,0]
[91732,91.731999999999999,112.85700250953856,1.5619354403300079,1.000080389507954,1.2679441859097204E-2,1,0,12200.005922423099,1.5707143596214805,15.59406367102282,1.5066253274643813,1.2563666908147033,0.65022771729098583,1.154210293496402,0.5228626265515508,1.0150039982883912,0.17215556497508688,1.0040675152043568,0.14830613192773054,-12.31957943007022,-136.82400881090888,43.175991189091121,null,91732,8414759824,null,13.838978672127428,-40.927335025645462,null,-11.711876896583668,-97.263145644218184,null,0,0]
[92263,92.263000000000005,113.5102355885282,1.5619864346240957,1.0000813228493539,1.2752830161562523E-2,1,0,12270.626895490375,1.5707148313660466,15.683961350973613,1.5069936455938617,1.2590367595582412,0.65301098534089852,1.1558799661308492,0.52536341619396942,1.0151769030677291,0.17313236509789842,1.0041149280434063,0.14916392659131014,-12.377680296333537,-137.0034486994553,42.996551300544695,null,92263,8512461169,null,13.820333758307779,-41.065728492952452,null,-11.76240921209483,-97.311010576018433,null,0,0]
[92794,92.793999999999997,114.16346895931396,1.5620368453485443,1.0000822615770248,1.2826218326651173E-2,1,0,12341.247868560351,1.570715297711635,15.77386113433119,1.5073577654698043,1.2617165402081547,0.65578245192620399,1.1575568466992958,0.52785697591676695,1.0153507761359812,0.1741088316091545,1.0041626188353885,0.15002170898709913,-12.435492221495984,-137.18243692730016,42.817563072699841,null,92794,8610726436,null,13.801664549742142,-41.203686019015308,null,-11.812656222424119,-97.358841376719724,null,0,0]
[93325,93.325000000000003,114.81670261691548,1.5620866824635098,1.0000832056909514,1.2899606353573029E-2,1,0,12411.868841632981,1.570715758750403,15.863762985335596,1.5077177583708479,1.2644059710142339,0.6585421496426983,1.1592409039221927,0.53034330615311909,1.0155256169957916,0.17508496281859717,1.0042105876537717,0.15087947903558402,-12.493018291154616,-137.36097194181329,42.63902805818671,null,93325,8709555625,null,13.782971651413611,-41.341205392750581,null,-11.862621209738533,-97.406638612486475,null,0,0]
[93868.5,93.868499999999997,115.48531400661076,1.5621371089045495,1.000084177607707,1.2974721826673998E-2,1,0,12484.152266993446,1.5707162252405673,15.955783274684354,1.5080820245486093,1.2671686417908385,0.6613546587810144,1.1609720041360978,0.53288067987741172,1.0157055754065496,0.17608372363995006,1.0042599736794837,0.15175742854114596,-12.551605688771005,-137.54323890424624,42.456761095753762,null,93868.5,8811295292.25,null,13.76381480699462,-41.481506109690883,null,-11.913473704745122,-97.45552683649926,null,0,0]
[94412,94.412000000000006,116.15392568658436,1.5621869548107521,1.0000851551672609,1.30498371533516E-2,1,0,12556.435692356597,1.5707166863598594,16.047805656923124,1.5084421131755661,1.2699412924772207,0.66415490894084728,1.1627105567106477,0.5354104817906663,1.0158865466476106,0.17708212961605332,1.0043096511324663,0.15263536494219201,-12.609899985939585,-137.7250281029136,42.274971897086402,null,94412,8913625744,null,13.744634412408359,-41.621343487203937,null,-11.964037522691722,-97.504381055871974,null,0,0]
[94955.5,94.955500000000001,116.82253765185219,1.5622362301496155,1.0000861383695965,1.3124952332758618E-2,1,0,12628.71911772239,1.5707171422005033,16.139830096253633,1.5087980956149301,1.27272385784917,0.66694293646891778,1.164456528266355,0.53793271349900684,1.016068530177791,0.17808017894659356,1.0043596200928133,0.15351328815296844,-12.667904322301712,-137.9063382012701,42.093661798729897,null,94955.5,9016546980.25,null,13.725431101582446,-41.760715524276641,null,-12.014316005421385,-97.553201836835385,null,0,0]
[95499,95.498999999999995,117.49114989754365,1.5622849446617595,1.0000871272146969,1.3200067364047842E-2,1,0,12701.002543090775,1.570717592852624,16.231856557688616,1.5091500416157568,1.2755162730194076,0.66971877815541314,1.1662098854816114,0.54044737698422896,1.0162515254532691,0.17907786983538546,1.0044098806410611,0.1543911980875538,-12.725621783272846,-138.08716796728831,41.912832032711691,null,95499,9120059001,null,13.706205503336813,-41.899620337668672,null,-12.064312437580728,-97.6019897326115,null,0,0]
[96611.5,96.611500000000007,118.85974527525791,1.5623829502117159,1.0000891688959601,1.335382121747037E-2,1,0,12848.960796497631,1.5707184994891052,16.420233352123731,1.50985814418005,1.2812625626503249,0.67536285556366782,1.1698217556992456,0.5455710968301859,1.0166292545199584,0.18111893609990393,1.0045136694958197,0.15618816608050518,-12.8428828089927,-138.45580917916058,41.544190820839418,null,96611.5,9333781932.25,null,13.666785394627926,-42.182482810777564,null,-12.165785017316049,-97.701754272138075,null,0,0]
[97724,97.724000000000004,120.22834176863877,1.5624787245074476,1.0000912342194814,1.3507574439482686E-2,1,0,12996.919049914808,1.5707193854831021,16.608618193048187,1.5105501836426385,1.2870493024698999,0.68095635682632583,1.1734641471471767,0.55066314197452915,1.0170112156585041,0.18315847772027263,1.0046186811071296,0.15798507734644598,-12.958979853580647,-138.82242480651567,41.17757519348433,null,97724,9549980176,null,13.627279792052905,-42.463366649403788,null,-12.266116293224201,-97.80138775617327,null,0,0]
[98862,98.861999999999995,121.62830945400124,1.5625744640469683,1.000093371344188,1.3664851231791321E-2,1,0,13148.268706004897,1.5707202711541637,16.801329111605895,1.5112420286133594,1.2930099675187843,0.68662608592759089,1.1772213103757827,0.5558391641557795,1.017406305582512,0.18524317503038837,1.0047273655829414,0.15982311677389177,-13.076559208883216,-139.19534092498404,40.804659075015962,null,98862,9773695044,null,13.586785619619945,-42.748629146528941,null,-12.367593626466689,-97.903173833193279,null,0,0]
[100000,100,123.02827822884367,1.5626680247002032,1.0000955332070873,1.3822127348033557E-2,1,0,13299.618362105062,1.5707211366673519,16.994047889718686,1.5119181823467691,1.2990118152181229,0.69224360232177018,1.1810098116194299,0.56098211559387845,1.0178058136726038,0.1873262448210723,1.0048373310192293,0.16166109526681149,-13.19297153819412,-139.56612482756896,40.433875172431044,null,100000,10000000000,null,13.546212867133956,-43.031797962610945,null,-12.467930966654334,-98.004831616669506,null,0,0]
[101165,101.16500000000001,124.46146352173606,1.5627616248784097,1.0000977719873785,1.3983134262991441E-2,1,0,13454.558915152666,1.5707220025448616,17.191346947233637,1.5125946746310279,1.3051981284629666,0.69794069792468194,1.1849203464863642,0.56621287941330234,1.0182193716422365,0.18945703442027351,1.0049512331949004,0.1635426173756703,-13.310962492839824,-139.94349299910041,40.056507000899586,null,101165,10234357225,null,13.504601674608894,-43.319506954834779,null,-12.569495192790912,-98.108772771159849,null,0,0]
[102330,102.33,125.89464988020812,1.5628530939660705,1.0001000366933144,1.4144140452929423E-2,1,0,13609.499468210126,1.5707228487067983,17.388653693690134,1.513255815075762,1.311426403923194,0.7035838615243305,1.1888630880314985,0.57140909004869433,1.0186375488309267,0.19158608419032194,1.0050664794879243,0.16542407391853589,-13.427781379446886,-140.31861967105965,39.68138032894035,null,102330,10471428900,null,13.462919353269955,-43.605004336881805,null,-12.669918969350553,-98.212588108041899,null,0,0]
[103520,103.52,127.3585923734699,1.5629444005377415,1.0001023767640373,1.4308600954121986E-2,1,0,13767.764925849466,1.5707236933641062,17.590202159673741,1.5139158301215911,1.3178310372914881,0.70929286676592396,1.1929233564884543,0.57668119996459388,1.0190694628357546,0.19375900766130352,1.0051855874531241,0.16734583647072293,-13.545922525932273,-140.69948090723861,39.300519092761391,null,103520,10716390400,null,13.420274850979489,-43.894338561531526,null,-12.771347448734902,-98.318505580213142,null,0,0]
[104710,104.71,128.82253590437418,1.5630336318883811,1.0001047438846589,1.4473060681248573E-2,1,0,13926.030383498406,1.570724518822824,17.791758114689078,1.5145608913321378,1.3242782061166607,0.7149464668884784,1.1970165569454971,0.5819173986157139,1.0195061843851543,0.19593007976386842,1.0053060996437355,0.16926752877697515,-13.662891585161708,-141.07800252453109,38.921997475468913,null,104710,10964184100,null,13.377567620822571,-44.181353998345273,null,-12.871640057569145,-98.424300170532717,null,0,0]
[105930,105.93,130.32338661531736,1.5631230316229232,1.0001071987617787,1.4641665639025461E-2,1,0,14088.28572664392,1.5707253458380759,17.998402823490096,1.5152072158930503,1.3309314189378298,0.72068554428702203,1.2012467826875415,0.58724840693887315,1.0199589001264742,0.1981539438883094,1.0054311086981396,0.17123759320553755,-13.781618215339705,-141.46363975385796,38.536360246142038,null,105930,11221164900,null,13.333724495557203,-44.473194626861819,null,-12.973309014268573,-98.53263842277525,null,0,0]
[107150,107.15,131.82423834412836,1.5632103956817403,1.0001096820694377,1.4810269764291218E-2,1,0,14250.54106979885,1.5707261540206894,18.205054880174124,1.5158388673926522,1.3376280317425533,0.72636734379565182,1.2055109072861772,0.59254185120802538,1.0204166556571965,0.20037582375688739,1.0055575956522944,0.1732075818093527,-13.899164012752024,-141.84682323996779,38.15317676003221,null,107150,11481122500,null,13.289827253564081,-44.762593099479027,null,-13.073838367377421,-98.64085574265151,null,0,0]
[108400,108.4,133.36199728277668,1.5632978685265553,1.0001122559296196,1.4983019019149684E-2,1,0,14416.786298450634,1.5707269632085814,18.416795907292808,1.5164713485710941,1.34453365114623,0.73212996609348779,1.2099146720760547,0.59792660799389652,1.0208908875888847,0.20265026183750517,1.0056887268663228,0.17522593304941661,-14.018401254383905,-142.23688937200291,37.763110627997094,null,108400,11750560000,null,13.244800477164665,-45.056574897313794,null,-13.175685041906252,-98.751612772021204,null,0,0]
[109650,109.65,134.89975721858011,1.56338334711733,1.0001148596353027,1.5155767379690216E-2,1,0,14583.031527111638,1.5707277539471369,18.628544134244688,1.5170894513303181,1.3514834624333334,0.73783350924878066,1.2143532640375303,0.60327215510568077,1.0213703957390567,0.2049225760789109,1.0058214117352247,0.17724420252616185,-14.136450287976716,-142.6243913907162,37.375608609283802,null,109650,12023122500,null,13.199729005851458,-45.347994475288793,null,-13.276389860984475,-98.862250905598543,null,0,0]
[110925,110.925,136.46827334541061,1.5634685507124024,1.0001175461616927,1.533196977543002E-2,1,0,14752.601660355043,1.5707285421407868,18.844534491302507,1.5177056056754625,1.3586170930920711,0.74359081839807106,1.2189161122104175,0.60868434854594899,1.0218649219091991,0.20723812740897593,1.0059583520385162,0.17930275201616644,-14.255661877614072,-143.01701025314995,36.982989746850052,null,110925,12304355625,null,13.153716182573181,-45.642606107895979,null,-13.377959585311942,-98.974983256204453,null,0,0]
[112200,112.2,138.03679044043838,1.5635518179649379,1.0001202637388489,1.5508171219068324E-2,1,0,14922.171793607406,1.5707293124209449,19.060531840472894,1.5183077955028792,1.3657952860085931,0.74928779750389951,1.2235143977651661,0.61405601748838301,1.0223649217745474,0.20955142623590337,1.0060969111315046,0.18136121411621514,-14.373688421594489,-143.40697969534182,36.593020304658182,null,112200,12588840000,null,13.107669103623515,-45.93456016519319,null,-13.478395402524502,-99.087599710030901,null,0,0]
[113510,113.51,139.64836584162487,1.5636354227596165,1.000123088256923,1.5689208561924867E-2,1,0,15096.396793271786,1.5707300858226683,19.282465564322688,1.5189124640452847,1.3732162067741538,0.75507893624595368,1.2282754023333198,0.61953309006625523,1.0228843398338925,0.2119258587504865,1.0062409611400012,0.18347609075542773,-14.493746465515464,-143.80490643707469,36.195093562925308,null,113510,12884520100,null,13.06032855031707,-46.231767331197666,null,-13.580434507793726,-99.20319074198288,null,0,0]
[114820,114.82,141.2599421966481,1.5637171199296904,1.0001259455533649,1.5870244876290331E-2,1,0,15270.62179294499,1.5707308415766603,19.504406177862148,1.5195033717544837,1.3806826855283669,0.7608076305572079,1.2330729679301595,0.62496770489723719,1.0234095189704702,0.21429786767006215,1.0063867226470706,0.18559087260488197,-14.612605281874858,-144.20006156273874,35.799938437261261,null,114820,13183632400,null,13.012964369899876,-46.526184121384794,null,-13.681331142060579,-99.318667102971077,null,0,0]
[116155,116.155,142.90227477352565,1.5637984804465883,1.0001288911007229,1.6054735011754459E-2,1,0,15448.17169720088,1.5707315942155144,19.730589146745217,1.5200918794375204,1.3883377637210572,0.76658206479903979,1.2379992643103648,0.63046253356493398,1.0239506384739598,0.21671262676910735,1.0065370280598365,0.18774591402526394,-14.732524484298061,-144.59992155023403,35.400078449765971,null,116155,13491984025,null,12.964678287089486,-46.82335894943796,null,-13.783005073012166,-99.436232989282544,null,0,0]
[117490,117.49,144.54460827485374,1.5638779921077333,1.0001318706888769,1.6239224054233649E-2,1,0,15625.72160146532,1.5707323297503961,19.956778794247409,1.5206670470523638,1.3960386261923616,0.7722929815727344,1.2429626428301155,0.63591364200508926,1.0244977223690728,0.21912482094867994,1.0066891137575251,0.18990085428071735,-14.851249790423077,-144.99693510190244,35.003064898097563,null,117490,13803900100,null,12.916380243636592,-47.117657844258716,null,-13.883546604664412,-99.553687210262282,null,0,0]
[118860,118.86,146.23000013725732,1.5639577314758681,1.0001349637844326,1.6428548738584983E-2,1,0,15807.926372142285,1.5707330673909037,20.188905215551813,1.5212438945468858,1.4039881943123389,0.77808829439979321,1.248094236555515,0.64146241821875949,1.0250653402677801,0.221597564397328,1.006847039155659,0.19211218446643494,-14.971872473476065,-145.40141663910322,34.598583360896782,null,118860,14127699600,null,12.866809887400539,-47.416696147377984,null,-13.985573921278702,-99.674108321035575,null,0,0]
[120230,120.23,{"$f":"SQRT(1+(A589/pole1)^2)","v":147.91539290825642},{"$f":"ATAN(A589/pole1)","v":1.5640356536954827},{"$f":"SQRT(1+(A589/Zero1)^2)","v":1.0001380927284398},{"$f":"ATAN(A589/Zero1)","v":1.6617872245113272E-2},{"$f":"IF(VIN_nom>Vout, 1, SQRT(1+(A589/z_RHP)^2))","v":1},{"$f":"IF(VIN_nom>Vout, 0, -ATAN(A589/z_RHP))","v":0},{"$f":"SQRT(1+(A589/Pole2)^2)","v":15990.131142827659},{"$f":"ATAN(A589/Pole2)","v":1.5707337882208399},20.421038202048855,1.5218076277764889,{"$f":"SQRT(1+(A589/pole4)^2)","v":1.4119843844128943},{"$f":"ATAN(A589/pole4)","v":0.78381815914167186},{"$f":"SQRT(1+(A589/Zero3)^2)","v":1.2532639423755183},{"$f":"ATAN(A589/Zero3)","v":0.64696558537644699},{"$f":"SQRT(1+(A589/pole5)^2)","v":1.0256392189278631},{"$f":"ATAN(A589/pole5)","v":0.22406755577309442},{"$f":"SQRT((1-(Z589/pterm2))^2+(A589/pterm1)^2)","v":1.0070068425344114},{"$f":"IF((ATAN((A589/pterm1)/(1-A589^2/pterm2))>0),ATAN((A589/pterm1)/(1-A589^2/pterm2)),PI()+ATAN((A589/pterm1)/(1-A589^2/pterm2)))","v":0.19432340514951904},{"$f":"20*LOG10(((E589*K589*G589*O589)/(C589*I589*S589*M589*Q589))*Adc)","v":-15.091289869928172},{"$f":"((F589+L589+H589+R589)-(D589+J589+T589+N589+T589))*radconv","v":-145.80293979272594},{"$f":"IF(V589>0,V589,V589+180)","v":34.197060207274063},null,{"$f":"IF(U589<0,A589,1000000000)","v":120230},{"$f":"A589^2","v":14455252900},null,{"$f":"20*LOG10((K589/(I589*M589))*AEA)","v":12.817239682339283},{"$f":"(L589-(J589+N589))*radconv","v":-47.712734980292275},null,{"$f":"20*LOG10((E589*G589/(C589*S589))*Acs*Am)","v":-14.086463054640717},{"$f":"(F589+H589-(D589+T589))*radconv","v":-99.794419110313328},null,{"$f":"SUM((U590<0)*(U589>0))*A589","v":0},0]
[126030,{"$f":"A590/1000","v":126.03},155.05064176043768,1.56434677636761,1.0001517364874339,1.7419374459680278E-2,1,0,16761.509004210202,1.5707366662953353,21.403858806084614,1.5240587656630897,1.4463354800743127,0.8073677832301257,1.2755617777361501,0.66976383169975817,1.0281378938171186,0.23449338177650436,1.0077042246812997,0.20368352928431413,-15.584063871056591,-147.47055677674709,32.529443223252912,null,126030,15883560900,null,12.607520168377462,-48.933213252592367,null,-14.501561651502611,-100.30261804139498,null,0,0]
[131830,131.83000000000001,162.18590430052984,1.564630523789212,1.0001660227319344,1.8220854291998798E-2,1,0,17532.886865719367,1.5707392911219809,22.386778352708522,1.5261122351501593,1.4814512413403709,0.82981294983967546,1.2984996327741256,0.69176772747748994,1.0307477761913637,0.24486753379532725,1.0084354208087452,0.21304154695016356,-16.057427265588167,-149.08735617727771,30.912643822722288,null,131830,17379148900,null,12.398337849194725,-50.101721827643516,null,-14.898528600047689,-100.8091290767846,null,0,0]
[144540,144.54,177.82201081832849,1.5651726963664288,1.0001995757947062,1.9977117323399671E-2,1,0,19223.268352256895,1.5707443065045834,24.541015807178866,1.5300369324171779,1.5608232918012903,0.87540295915605193,1.3508425744591674,0.73731149940648855,1.0368517297795854,0.26741168415808558,1.0101566351373803,0.23354056046994975,-17.034208247457357,-152.46265706417861,27.537342935821385,null,144540,20891811600,null,11.943553098872158,-52.489255723151238,null,-15.712498004304988,-101.91407377794069,null,0,0]
[158490,158.49,194.98364119098554,1.5656676689353934,1.0002399533018922,2.1904580817360044E-2,1,0,21078.565106236674,1.5707488852354103,26.905784817622123,1.5336210361416505,1.6512919740923773,0.92029374935181452,1.4112623894084428,0.78330481257745288,1.0441501447961272,0.29183802327774344,1.0122351664534266,0.25602561656830125,-18.02344654566825,-155.92461401895758,24.075385981042416,null,158490,25119080100,null,11.452936732611057,-54.856216868282829,null,-16.530254561798788,-103.12029691167636,null,0,0]
[173780,173.78,213.79381790016237,1.5661189060153407,1.000288477569194,2.4017003844694362E-2,1,0,23112.076745967188,1.5707530593719254,29.498037571663026,1.5368892698245253,1.7538553398569683,0.96408056966261224,1.4806174427476229,0.82929761241865318,1.0528545760992771,0.31820419398637595,1.014743464344626,0.28065175836340522,-19.024275526340656,-159.46249592282336,20.537504077176635,null,173780,30199488400,null,10.928529396718627,-57.178000036956476,null,-17.35126936143325,-104.43609195995835,null,0,0]
[190550,190.55,234.42477277269219,1.5665305530842815,1.0003468308346917,2.6333652284770203E-2,1,0,25342.422737083565,1.5707568672684482,32.341509595687796,1.5398713816600591,1.8697637658517667,1.0064934281247315,1.55994673105913,0.87493397904689552,1.0632283435482646,0.34660411333478702,1.0177747540149644,0.3076360676291669,-20.038368606676684,-163.07775948040623,16.922240519593771,null,190550,36309302500,null,10.371830055049125,-59.437433580690879,null,-18.176838110831945,-105.87303045707152,null,0,0]
[208930,208.93,257.03643568285742,1.5669058179647992,1.0004169521135802,2.8872384414408505E-2,1,0,27786.892583392833,1.570760338603802,35.458243326045249,1.5425904002116901,2.0001898168247987,1.0472523405274563,1.6502429549562576,0.91980991259418754,1.0755626121772688,0.3770740157979382,1.0214387155739186,0.3371761587167949,-21.066604879974321,-166.77277448398974,13.227225516010265,null,208930,43651744900,null,9.7854421510550953,-61.617157846839952,null,-19.0072658264986,-107.44159546212758,null,0,0]
[229090,229.09,281.83794605427585,1.5672481810883796,1.0005012778659974,3.1656549273353277E-2,1,0,30468.095636030564,1.5707635055771834,38.877066031014493,1.5450713838898373,2.1465774404070621,1.0861924611793146,1.7526880250072816,0.96361825409478918,1.0902117630233277,0.40966830124017639,1.025875435927186,0.36952923272693999,-22.112071490820327,-170.56187987999346,9.4381201200065448,null,229090,52482228100,null,9.1713539399248756,-63.706293976718747,null,-19.844275539192541,-109.15538512529747,null,0,0]
[251190,251.19,309.02614127614129,1.5675603489545387,1.000602627511384,3.4708069196217453E-2,1,0,33407.311284303447,1.5707663932276112,42.625111307817406,1.5473338249180968,2.3102916771688777,1.1231491062992991,1.8684075193708303,1.0060339059563359,1.1075635686695777,0.44436758413655914,1.0312514347208595,0.40492976643127154,-23.177210114874299,-174.46140337664758,5.5385966233524186,null,251190,63096416100,null,8.5324654888235987,-65.694290897193937,null,-20.688709485305168,-111.02673298975495,null,0,0]
[275420,275.42,338.83476600015752,1.5678450314969057,1.0007244505819899,3.8052949819637853E-2,1,0,36629.80880301552,1.5707690266250949,{"$f":"SQRT(1+(A599/Zero2)^2)","v":46.734602109646978},{"$f":"ATAN(A599/Zero2)","v":1.5493972717294988},2.4929087428246079,1.1580376711113507,1.9986700085169533,1.0468133176127334,1.1280696724488892,0.48113535336737773,1.0377754329374578,0.4436509996577826,-24.265932863178392,-178.49744703656353,1.5025529634364716,null,275420,75856176400,null,7.8712720551821942,-67.5751825053609,null,-21.542283350835859,-113.0699597989921,null,0,0]
[302000,302,371.53447221994884,1.5681047832580963,1.0008709633923967,4.1721258710026118E-2,1,0,40164.847352468896,1.5707714294016282,51.242851323958412,1.551280170745025,2.6962292263259311,1.1908309168052613,2.1448985036498271,1.0857803125922123,1.1522516571925543,0.51990582778828975,1.0457096581319532,0.48600074551524425,-25.383297563784652,-182.70486002868128,-2.7048600286812814,null,302000,91204000000,null,7.189928805820367,-69.346352584296895,null,-22.407389458604747,-115.30112556489351,null,0,0]
[331130,331.13,407.37130738504538,1.5683415613605511,1.0010469956256971,4.5740199851792118E-2,1,0,44039.026169303521,1.5707736196624491,56.183781076879932,1.5529966560091799,2.9218979455684893,1.2214929859921875,2.3083962140548553,1.1227548042931115,1.180655500935968,0.56050431535680934,1.0553667728465961,0.53223618593967037,-26.533330170428027,-187.11881254936549,-7.1188125493654866,null,331130,109647076900,null,6.4914859781809495,-71.00493787320967,null,-23.285534309541799,-117.73351918833822,null,0,0]
[363080,363.08,446.67743576981803,1.5685575729307943,1.0012586544855333,5.0146499897608818E-2,1,0,48288.254222985393,1.570775617825062,61.603187803395954,1.5545626876140444,3.1720989516839895,1.25007764484241,2.4908482002264396,1.1576753792752472,1.2139346134456659,0.60277139953605519,1.0671532197067679,0.58269920765314953,-27.722601635955794,-191.78780530131243,-11.787805301312432,null,363080,131827086400,null,5.7776208223788705,-72.553105670659434,null,-24.180236776818358,-120.38475151243438,null,0,{"$f":"IF(AH602>0,W602,0)","v":0}]
[398110,398.11,489.77271945878289,1.5687545620026355,1.0015130484844541,5.4975325033986229E-2,1,0,52947.110521150142,1.5707774400229799,67.54517315326207,1.5559908790064578,3.4489437545790658,1.2766281691085517,2.6938812995073866,1.1904828083433332,1.2527726082784145,0.64644623401741974,1.0815639590667188,0.63767813248210548,-28.956810591683997,-196.75966572155448,-16.759665721554484,null,398110,158491572100,null,5.0506405747601599,-73.992613721741819,null,-25.094550288157336,-123.26942721270241,null,0,0]
[436520,436.52,537.02623024874424,1.5689342192821139,1.001818815403162,6.0267120949798927E-2,1,0,58055.493918763495,1.5707791018962256,74.060624806741558,1.5572934649012002,3.7548623224709115,1.3012218047803259,2.9193494179986268,1.2211749947854593,1.2979290616839876,0.69123683825990923,1.0992244873319694,0.69747178738688775,-30.242601007557596,-202.08687138094615,-22.08687138094615,null,436520,190549710400,null,4.3123223096614893,-75.327187794242903,null,-26.032600753891902,-126.40244731584039,null,0,0]
[478630,478.63,588.83164487321437,1.5690980476867697,1.0021862531820873,6.6064779012940431E-2,1,0,63655.963194456934,1.5707806173475825,81.203824042706742,1.5584813245301252,4.0924496679842788,1.3239445095884437,3.1692237973333786,1.2497762659034006,1.3502140797403344,0.73679881075516018,1.1209148096253205,0.76233745300021871,-31.58666968151358,-207.82056831540569,-27.820568315405694,null,478630,229086676900,null,3.5644025280592402,-76.561130365855092,null,-26.99905272046577,-129.79618153274222,null,0,0]
[524810,524.80999999999995,645.64415220510955,1.5692474853837215,1.0026279012301493,7.2417666608277698E-2,1,0,69797.726936024483,1.5707819996807637,89.037534673223632,1.5595648722376527,4.4647087634463061,1.3449012634737236,3.4457748487402022,1.276349542293298,1.4105202725604757,0.78277633507969135,1.1476240960643926,0.8325100216543575,-32.996586213694485,-214.0107328128089,-34.010732812808897,null,524810,275425536100,null,2.8080959598445876,-77.699860408391956,null,-27.999808451902652,-133.46134206080606,null,0,0]
[575440,575.44000000000005,707.93124364413939,1.5693837597673275,1.0031585653266593,7.9375990000986843E-2,1,0,76531.323693093611,1.5707832602496996,97.626217733252759,1.5605529975841033,4.8747315622525509,1.3641900894318835,3.7513378297475466,1.3009622033389763,1.4797670364139834,0.82877116111435756,1.1805771370106015,0.90810641183480134,-34.479379879322778,-220.6958821333605,-40.695882133360499,null,575440,331131193600,null,2.0448523891391215,-78.74848554205343,null,-29.041063820553163,-137.40182155321938,null,0,0]
[630960,630.96,776.2342251398178,1.5695080554919569,1.003796253390115,8.6997500541789716E-2,1,0,83915.271786286685,1.5707844100129005,107.04451317191867,1.5614542828531126,5.3261035578488478,1.3819208219362613,4.0886150941969701,1.3237081685629675,1.5589606564690295,0.87440555610742199,1.2213202103054974,0.9891604173993821,-36.042887638477829,-227.90409217845615,-47.904092178456153,null,630960,398110521600,null,1.2755977040789626,-79.712807717858922,null,-30.130281786687533,-141.61631522244579,null,0,0]
[691830,691.83,851.11900756172656,1.5696214026994528,1.0045623050375412,9.534177234267549E-2,1,0,92010.749459891682,1.570785458499552,117.37045441786832,1.5622761919462647,5.8225816666423507,1.3981954868275057,4.4604378241763234,1.3446812040285707,1.649136029918161,0.91929850675796787,1.2717611745515094,1.0755172986055828,-37.694316563024358,-235.6415257574333,-55.6415257574333,null,691830,478628748900,null,0.50141429877523624,-80.59824548180768,null,-31.275126050034775,-146.09260281189694,null,0,0]
[758580,758.58,933.23761875098751,1.5697247881307093,1.0054826303912645,0.10447676933184508,1,0,100888.24469102394,1.5707864148373334,128.69395027675904,1.5630258755713617,6.3685020312324756,1.4131210006485211,4.8700722113828636,1.3639895571381271,1.7514258847572419,0.9631175220136875,1.3342819500108454,1.1668605156196483,-39.441277148166115,-243.89283958536561,-63.892839585365607,null,758580,575443616400,null,-0.27707280310211235,-81.410515518174719,null,-32.484052074060209,-150.80871041486941,null,0,0]
[831760,831.76,1023.2666914586465,1.5698190643006507,1.0065878390985492,0.11447161132424231,1,0,110620.9053804643,1.5707872869122761,141.10830296054689,1.5637095122732971,6.9683730185648738,1.4267936296814963,5.3209157349504936,1.3817344459755547,1.8669853846352971,1.0055511984552703,1.4117774175425459,1.2626038172189136,-41.2899289882358,-252.60994699306389,-72.609946993063886,null,831760,691824697600,null,-1.058998891777545,-82.154779925935188,null,-33.764814350380171,-155.7271368823574,null,0,0]
[912010,912.01,1121.9935802422717,1.5699050559801582,1.0079151462210427,0.12540564966876583,1,0,121293.84908548587,1.5707880823537519,154.72208292173519,1.5643330802859996,7.6274486392512095,1.4393123656175206,5.8169284839304085,1.3980260563452203,1.9971007650503083,1.0463591961670502,1.5078114059711236,1.3619659384134486,-43.246158760322793,-261.71792254421405,-81.717922544214048,null,912010,831762240100,null,-1.8439936159820518,-82.836368420759158,null,-35.125015064034905,-160.79861978620025,null,0,0]
[1000000,1000,1230.2425469781872,1.5699834788629368,1.0095085705811724,0.13735962149108086,1,0,132996.18324885951,1.5707888077821281,169.64895038816246,1.5649017675376369,8.3512376093384066,1.4507655817574905,6.3622651244769814,1.4129651363293696,2.143097626001929,1.0853374121201309,1.6266497784699232,1.4638988880472195,-45.313326345182936,-271.10855120019016,-91.108551200190163,null,1000000,1000000000000,null,-2.6314551068722243,-83.460047552745777,null,-36.570242382602494,-165.95852876579448,null,0,0]
[]
[]
["Pole/Zero Locations for Chart"]
[{"$f":"Q4*1000","v":24976},null,{"$f":"SQRT(1+(A617/pole1)^2)","v":30.742795979731145},{"$f":"ATAN(A617/pole1)","v":1.538262642180855},{"$f":"SQRT(1+(A617/Zero1)^2)","v":1.0000059596338609},{"$f":"ATAN(A617/Zero1)","v":3.4524206763888823E-3},{"$f":"IF(VIN_nom>Vout, 1, SQRT(1+(A617/z_RHP)^2))","v":1},{"$f":"IF(VIN_nom>Vout, 0, -ATAN(A617/z_RHP))","v":0},{"$f":"SQRT(1+(A617/Pole2)^2)","v":3321.7128232543728},{"$f":"ATAN(A617/Pole2)","v":1.5704952772857084},{"$f":"SQRT(1+(A617/Zero2)^2)","v":4.3534853666209008},{"$f":"ATAN(A617/Zero2)","v":1.3390258559676325},{"$f":"SQRT(1+(A617/pole4)^2)","v":1.0212159560040688},{"$f":"ATAN(A617/pole4)","v":0.20419366511593531},{"$f":"SQRT(1+(A617/Zero3)^2)","v":1.0122384400845912},{"$f":"ATAN(A617/Zero3)","v":0.15565933110414437},{"$f":"SQRT(1+(A617/pole5)^2)","v":1.001119989199686},{"$f":"ATAN(A617/pole5)","v":4.7306339629507844E-2},{"$f":"SQRT((1-(A617^2/(pole3^2)))^2+(A617/(Q*pole3))^2)","v":1.0003004402635858},{"$f":"ATAN((A617/(Q*pole3))/(1-A617^2/pole3^2))","v":4.0394152502234507E-2},{"$f":"20*LOG10(((E617*K617*G617*O617)/(C617*I617*S617*M617*Q617))*Adc)","v":5.2075823866286394E-3},{"$f":"((F617+L617+H617+R617)-(D617+J617+T617+N617+T617))*radconv","v":-114.81817962504427},{"$f":"IF(V617>0,V617,V617+180)","v":65.181820374955734},"crossover",null,null,null,{"$f":"20*LOG10((K617/(I617*M617))*AEA)","v":15.856469996499934},{"$f":"(L617-(J617+N617))*radconv","v":-24.961656170834882},null,{"$f":"20*LOG10((E617*G617/(C617*S617))*Acs*Am)","v":-0.38417126268473156},{"$f":"(F617+H617-(D617+T617))*radconv","v":-90.252562604259353}]
[{"$f":"A617","v":24976},null,null,null,null,null,null,null,null,null,null,null,null,null,null,null,null,null,null,null,null,-180]
[{"$f":"A618","v":24976}]
[1000000]
[]
[{"$f":"pole1","v":812.84811098205478},null,1.4142135623730951,0.78539816339744828,1.0000000063123911,1.1236005617237433E-4,{"$f":"IF(VIN_nom>Vout, 1, SQRT(1+(A622/z_RHP)^2))","v":1},{"$f":"IF(VIN_nom>Vout, 0, -ATAN(A622/z_RHP))","v":0},108.11032132285037,1.5615463842533746,1.0094629395262644,0.13703221882301142,1.000022709806158,6.739343645649945E-3,{"$f":"SQRT(1+(A622/Zero3)^2)","v":1.000013042045458},{"$f":"ATAN(A622/Zero3)","v":5.1072308962495112E-3},{"$f":"SQRT(1+(A622/pole5)^2)","v":1.0000011869426668},{"$f":"ATAN(A622/pole5)","v":1.5407410507129395E-3},{"$f":"SQRT((1-(A622^2/(pole3^2)))^2+(A622/(Q*pole3))^2)","v":1.0000003181298529},{"$f":"ATAN((A622/(Q*pole3))/(1-A622^2/pole3^2))","v":1.3146718105805867E-3},{"$f":"20*LOG10(((E622*K622*G622*O622)/(C622*I622*S622*M622*Q622))*Adc)","v":43.89361761382996},{"$f":"((F622+L622+H622+R622)-(D622+J622+T622+N622+T622))*radconv","v":-127.06072020438189},52.939279795618106,"p1",null,null,null,{"$f":"20*LOG10((K622/(I622*M622))*AEA)","v":33.09358888443964},{"$f":"(L622-(J622+N622))*radconv","v":-82.00478557704875},null,{"$f":"20*LOG10((E622*G622/(C622*S622))*Acs*Am)","v":26.36295076568128},{"$f":"(F622+H622-(D622+T622))*radconv","v":-45.068887440685266}]
[{"$f":"Zero1","v":7234315.6033525616},null,8899.9599694931239,1.5706839667387242,1.4142135623730951,0.78539816339744828,1,0,962136.36363688309,1.5707952874411857,1227.2731346800667,1.5699815121604066,59.989131797574167,1.5541258685152286,45.46554412386746,1.5487998750978598,13.748959051001052,1.4979992679075367,43.84246711761044,-0.27015058080584403,-104.3749187406297,-17.299029258694787,162.70097074130521,"z1",null,null,null,{"$f":"20*LOG10((K623/(I623*M623))*AEA)","v":-19.7580378469933},{"$f":"(L623-(J623+N623))*radconv","v":-89.09147908888869},null,-79.442107376452626,-29.515074163538593]
[{"$f":"Pole2","v":7.5190127686378041},null,1.0000427822437219,9.2499425415220587E-3,1.00000000000054,1.0393537109648078E-6,1,0,1.4142135623730951,0.78539816339744828,1.0000008135396727,1.2755697716395444E-3,1.0000000019432165,6.2341263218653096E-5,1.0000000011159671,4.7243350463269341E-5,1.0000000001015623,1.4252183948278234E-5,1.0000000000272211,1.2160985913583589E-5,84.488885644732846,-45.460987252961999,134.53901274703799,"p2",null,null,{"$f":"Pole2","v":7.5190127686378041},{"$f":"20*LOG10((K624/(I624*M624))*AEA)","v":70.67902880699242},{"$f":"(L624-(J624+N624))*radconv","v":-44.930487178223096},null,29.372881836602282,-0.53061989156055667]
[{"$f":"Zero2","v":5894.6275286576438},null,7.3204427150628533,1.4337641079718852,1.000000331961536,8.1481463449007178E-4,1,0,783.96360074793517,1.569520757023257,1.4142135623730951,0.78539816339744828,1.0011935845448889,4.8834384391382241E-2,1.0006856360078737,3.7020115873930032E-2,1.0000624180763356,1.1172719438739298E-2,1.0000167303603327,9.5337474722219078E-3,15.328092768663623,-130.2792035863886,49.720796413611396,"z2",null,null,{"$f":"Zero2","v":5894.6275286576438},{"$f":"20*LOG10((K625/(I625*M625))*AEA)","v":18.803342530272779},{"$f":"(L625-(J625+N625))*radconv","v":-47.724919410890003},null,12.082364067641896,-82.648190352027669]
[{"$f":"pole3","v":1100000},null,1353.2667240859823,1.5700573741012331,1.0114940140371462,0.15089724670916302,1,0,146295.80157302771,1.5707894913287435,186.61328276691427,1.5654376257896143,9.1749242626427279,1.4615866447129449,6.9834722876306081,1.4271071472180874,2.312438019890668,1.1235947270448774,1.7791011821090243,{"$error":"#DIV/0!"},-47.570674249275982,{"$error":"#DIV/0!"},{"$error":"#DIV/0!"},"p3",null,null,null,{"$f":"20*LOG10((K626/(I626*M626))*AEA)","v":-3.4485142459774139},{"$f":"(L626-(J626+N626))*radconv","v":-84.049385538692704},null,-38.159161253236668,{"$error":"#DIV/0!"}]
[{"$f":"Fp2_u","v":120610.52937803368},null,{"$f":"SQRT(1+(A627/pole1)^2)","v":148.38352551998398},{"$f":"ATAN(A627/pole1)","v":1.5640569831492466},{"$f":"SQRT(1+(A627/Zero1)^2)","v":1.0001389681811816},{"$f":"ATAN(A627/Zero1)","v":1.6670458279667941E-2},1,0,{"$f":"SQRT(1+(A627/Pole2)^2)","v":16040.740097620115},{"$f":"ATAN(A627/Pole2)","v":1.570733985531678},{"$f":"SQRT(1+(A627/Zero2)^2)","v":20.48551628661583},{"$f":"ATAN(A627/Zero2)","v":1.5219619424035145},{"$f":"SQRT(1+(A627/pole4)^2)","v":1.4142135623730951},{"$f":"ATAN(A627/pole4)","v":0.78539816339744828},1.254706572755689,0.64848607516793078,1.0257997282872169,0.22475312548591267,1.0070515627802372,0.19493757123035635,-15.124248607197719,-145.91394422399037,{"$f":"IF(V627>0,V627,V627+180)","v":34.08605577600963},"p4",null,null,null,null,null,null,-14.114287455703074,-99.827817364542227]
[{"$f":"z_RHP","v":0},null,{"$f":"SQRT(1+(A628/pole1)^2)","v":1},{"$f":"ATAN(A628/pole1)","v":0},{"$f":"SQRT(1+(A628/Zero1)^2)","v":1},{"$f":"ATAN(A628/Zero1)","v":0},1,0,{"$f":"SQRT(1+(A628/Pole2)^2)","v":1},{"$f":"ATAN(A628/Pole2)","v":0},{"$f":"SQRT(1+(A628/Zero2)^2)","v":1},{"$f":"ATAN(A628/Zero2)","v":0},{"$f":"SQRT(1+(A628/pole4)^2)","v":1},{"$f":"ATAN(A628/pole4)","v":0},1,0,1,0,1,0,87.4995501372577,0,{"$f":"IF(V628>0,V628,V628+180)","v":180},"z_RHP",null,null,null,null,null,null,29.37325343073271,0]
[{"$f":"Fp2_u","v":120610.52937803368},null,null,null,null,null,null,null,null,null,null,null,null,null,null,null,null,null,null,null,-25]
[]
[null,null,null,"System","Plant"]
["p1","p-dom",{"$f":"pole1","v":812.84811098205478},{"$f":"U622","v":43.89361761382996},{"$f":"AE622","v":26.36295076568128}]
["z1","ESR zero",{"$f":"Zero1","v":7234315.6033525616},{"$f":"U623","v":-104.3749187406297},{"$f":"AE623","v":-79.442107376452626}]
["p2","EA pole",{"$f":"Pole2","v":7.5190127686378041},{"$f":"U624","v":84.488885644732846},{"$f":"AE624","v":29.372881836602282}]
["z2","EA zero",{"$f":"Zero2","v":5894.6275286576438},{"$f":"U625","v":15.328092768663623},{"$f":"AE625","v":12.082364067641896}]
["p3","p_sampling",{"$f":"pole3","v":1100000},{"$f":"U626","v":-47.570674249275982},{"$f":"AE626","v":-38.159161253236668}]
[]
[]
[{"$f":"Q4*1000","v":24976}]
[{"$f":"Q4*1000","v":24976}]
[]
[]
[]
[]
[]
[]
[]
[]
[]
[]
[]
[]
[]
[]
[]
[]
[]
[]
[]
[]
[]
[]
[]
[]
[]
[]
[]
[]
[]
[]
[]
[]
[]
[]
[]
[]
[]
[]
[]
[]
[]
[]
[]
[]
[]
[]
[null,null,null,null,null,null,null,null,null,null,null,null,null,null,null,null,null,null,null,null,null,null,null,null,null,null,null,null,null,null,null,null,null,"phase margin",{"$f":"SUM(AI689:AI1306)","v":0}]

{"sheet":"Bode Plot Management","index":7,"n_rows":6,"n_cols":14,"rows_kept":6,"cut":false,"hidden":true,"merged":[]}
[null,null,null,null,null,null,null,null,null,"Single or dual output (MODE)",null,null,null,"3.3V or 5V fixed (FB1/2)"]
[{"$f":"CHOOSE(BODE_PLOT_TYPE, \"BODE_PLOT_Ch1\", \"BODE_PLOT_Ch2\")","v":"BODE_PLOT_Ch1"},null,null,null,null,null,null,null,null,"With/without dither (DITH)",null,null,null,"With/without VOUT connected to VCCX"]
[null,null,null,null,null,null,null,null,null,"FPWM or DEM (DEMB)"]
[null,null,null,null,null,null,null,null,null,"Shunt or inductor DCR current sensing"]
[]
[null,null,null,null,null,{"$f":"INDIRECT(A2)","v":0}]

{"sheet":"Efficiency Calculations","index":8,"n_rows":109,"n_cols":57,"rows_kept":109,"cut":false,"hidden":true,"merged":[[6,24,6,26],[0,0,3,3],[5,0,6,3],[6,6,6,13],[6,17,6,20],[6,21,6,23],[6,51,6,56],[6,27,6,32],[6,33,6,36],[6,38,6,42],[6,45,6,49]]}
["BUCK CONTROLLER POWER DESIGN TOOL",null,null,null,null,null,null,null,null,null,null,null,null,null,null,null,null,null,null,null,null,null,null,null,null,null,null,null,null,null,null,null,null,null,null,null,null,null,null,null,{"$f":"Ext_VCC","v":2}]
[null,null,null,null,null,null,null,{"$f":"AV19","v":0.11308591357466379},"10% load"]
[null,null,null,null,null,null,null,{"$f":"AV59","v":0.33911685493959859},"50% load",null,null,null,null,null,null,null,null,null,null,null,null,null,null,null,null,null,null,null,null,null,null,null,null,null,null,null,null,null,null,{"$f":"IF(MODE=1, (Qg_Q1+Qg_Q2)*Fsw*Vin, (Qg_Q1+Qg_Q2+Qg_Q3+Qg_Q4)*Fsw*Vin)","v":0.5544}]
[null,null,null,null,null,null,null,{"$f":"AV109","v":0.45006309816546392},"100% load",null,null,null,null,null,null,null,null,null,null,null,3,null,null,null,null,null,null,null,null,null,null,null,1,null,null,null,2,null,"I_VCC",{"$f":"(Qg_Q1+Qg_Q2)*Fsw*1000","v":19.799999999999997},"mA",{"$f":"AN4*5/1000","v":9.8999999999999991E-2}]
[null,null,null,null,null,null,null,null,null,null,null,null,null,null,null,null,null,null,null,null,null,null,null,null,null,null,null,null,null,null,null,null,null,null,null,null,null,null,null,null,null,{"$f":"VCC","v":3.15}]
["Enter the values of your design and MOSFET datasheet specifications below. Note that thermal resistance (θJA) will change when components are placed on the PCB"]
[null,null,null,null,null,null,"Operating Point Condtions",null,null,null,null,null,null,null,null,null,null,"Filter Inductor",null,null,null,"Cout",null,null,"Cin",null,null,"High-side BUCK \"Control\" MOSFET Losses ",null,null,null,null,null,"Low-side BUCK \"Sync\" MOSFET Losses ",null,null,null,"Diode/FET","\"Controller\" Losses",null,null,null,null,null,null,"RESULTS",null,null,null,null,null,"Consolidated Buck Efficiency & Losses"]
["Input Parameters",null,null,null,null,null,"Step","Vin","Mode","Iout","Iout/ phase","Iin","Duty Cycle BUCK Leg","Ripple Current pk-pk","Peak Inductor Current","Valley Inductor Current","SW node voltage at Q1 turn-on","Irms Lf","DCR    Loss","Core Loss","Total Inductor Loss","Irms Cout","Cout ESR Loss","Total Cout Loss","Irms Cin","Cin ESR Loss","Total Cin Loss","Irms","RDS(on) Loss","Transition Loss (not including capacitive loss)","MOSFET Output Capacitance Loss","Dead Time Loss ","Total Control MOSFET Loss","Irms","RDS(on) Loss","Deadtime Loss","Total Sync MOSFET Loss","Reverse Recovery Loss","IQ Loss","Switching Current Loss","Switching Current Diss from VCC","LDO Loss Saved from Gate Drive Current (ext VCC = Vout)","Total \"Control\" Loss","Total Loss (not considering total loss)","Total Loss (considering total loss)","Total Loss","Pout","EFF, h",{"$f":"IF(Vin>Vout, \"Buck ''CONTROL'' MOSFET Temp Rise\", \"Boost ''CONTROL'' MOSFET Temp Rise\")","v":"Buck ''CONTROL'' MOSFET Temp Rise"},{"$f":"IF(Vin>Vout, \"Buck ''SYNC'' MOSFET Temp Rise\", \"Boost ''SYNC'' MOSFET Temp Rise\")","v":"Buck ''SYNC'' MOSFET Temp Rise"},null,"h","Inductor Cu & Core Loss","Total MOSFET Loss","Control MOSFET Loss","SYNC MOSFET Loss","IC Power Loss"]
["Design","Input Value","Units","Description",null,null,0,{"$f":"Vin","v":28},{"$f":"MODE","v":1},0,{"$f":"Iout*G9/100/Number_of_Phases","v":0},{"$f":"Vout*K9/(Vin*Efficiency)","v":0},{"$f":"(Vout+(Rdson2+Rs+Rdcr)*K9)/(Vin+(Rs+Rdson2-Rdson1)*K9)","v":0.11785714285714285},{"$f":"(Vin-(Rdson1+Rdcr)*K9-Vout)*M9/(Fsw*Lf)","v":0.11026785714285713},{"$f":"K9+N9/2","v":5.5133928571428563E-2},{"$f":"K9-N9/2","v":-5.5133928571428563E-2},{"$f":"IF(MIN(Vin, -P9/(Coss_Q1+Coss_Q2)*0.00000002)<0, 0, MIN(Vin, -P9/(Coss_Q1+Coss_Q2)*0.00000002))","v":7.121866378793329},{"$f":"SQRT(K9^2+(N9^2)/12)","v":3.1831588502195883E-2},{"$f":"R9^2*Rdcr","v":2.5331250664328231E-5},{"$f":"Core_Loss","v":0.1},{"$f":"(T9+S9*(1+Ltc*(Ta-25)))/(1-S9*Ltc*ThetaCa)","v":0.10002555032061634},{"$f":"N9/SQRT(12)","v":3.1831588502195883E-2},{"$f":"RCoutEsr*V9^2","v":1.0132500265731293E-6},{"$f":"W9","v":1.0132500265731293E-6},{"$f":"SQRT(M9*(1-M9))*SQRT(K9^2+(N9^2)/12)","v":1.0263742011769038E-2},{"$f":"RCinEsr*Y9^2","v":2.1068880016830548E-7},{"$f":"Z9","v":2.1068880016830548E-7},{"$f":"SQRT(M9)*SQRT(K9^2+(N9^2)/12)","v":1.0927888777427827E-2},{"$f":"Rdson1*AB9^2","v":6.6874501753826513E-5},{"$f":"(Vin*K9/2)*Fsw*(Tr_buck+Tf_buck)","v":0},{"$f":"(0.5*Coss_Q1*(Vin-Q9)^2-0.5*Coss_Q2*(Vin-Q9)^2+(Qoss_Q2*(Vin-Q9)/Vin)*Vin)*Fsw","v":6.8440891466870324E-2},{"$f":"IF(K9>N9/2,0,ABS(K9-N9/2)*Vsd_Q1*Deadtime*Fsw)","v":5.8297844196428565E-4},{"$f":"(AF9+AE9+AD9+AC9*(1+RdsonTC*(Ta-25))/(1-AC9*RdsonTC*ThetaJA_Q1))","v":6.909074482203327E-2},{"$f":"SQRT((1-M9))*SQRT(K9^2+(N9^2)/12)","v":2.9897011112171329E-2},{"$f":"Rdson2*AH9^2","v":2.5027275656356289E-4},{"$f":"IF(K9<N9/2,Deadtime*Fsw*Vsd_Q2*(K9+N9/2),2*Deadtime*Fsw*Vsd_Q2*K9)","v":5.8297844196428565E-4},{"$f":"(AJ9+AI9*(1+RdsonTC*(Ta-25)))/(1-AI9*RdsonTC*ThetaJA_Q2)","v":8.3327038465645263E-4},{"$f":"Qrr_Q2*K9/Iout*Fsw*Vin","v":0},{"$f":"Iq*Vin","v":9.7999999999999997E-4},{"$f":"IF(Ext_VCC=1,  (Qg_Q1+Qg_Q2)*Fsw*Vout, (Qg_Q1+Qg_Q2)*Fsw*Vin)","v":0.5544},{"$f":"(Vin-VCC)*Fsw*(Qg_Q1+Qg_Q2)","v":0.49202999999999997},{"$f":"(Qg_Q1+Qg_Q2)*Fsw*(Vin-Vout)","v":0.48905999999999994},{"$f":"SUM(AM9:AN9)","v":0.55537999999999998},{"$f":"SUM(S9,T9,AC9,AD9,AE9,AF9,AI9,AJ9,AQ9, AL9)","v":0.72532932685978058},{"$f":"U9 + ((AF9+AE9+AD9+AC9*(1+RdsonTC*(Ta-25))) + (AJ9+AI9*(1+RdsonTC*(Ta-25))) + AQ9 + AL9) / (1-AC9*RdsonTC*ThetaJA_Q1 -AI9*RdsonTC*ThetaJA_Q2)","v":0.7253477912992875},{"$f":"AS9","v":0.7253477912992875},{"$f":"Vout*K9","v":0},{"$f":"AU9/(AU9+AT9)","v":0},{"$f":"ThetaJA_Q1*BC9","v":1.5890871309067651},{"$f":"ThetaJA_Q2*BD9","v":1.916521884709841E-2},null,{"$f":"AV9*100","v":0},{"$f":"U9","v":0.10002555032061634},{"$f":"AG9+AK9+AL9","v":6.9924015206689727E-2},{"$f":"AG9+AL9*0.66","v":6.909074482203327E-2},{"$f":"AK9+AL9*0.33","v":8.3327038465645263E-4},{"$f":"AS9-BA9","v":0.62532224097867117}]
[null,null,null,null,null,null,1,28,1,{"$f":"Iout*G10/100","v":3.0000000000000001E-3},3.0000000000000001E-3,3.9285714285714282E-4,0.1179453380098647,0.11034253237785797,{"$f":"K10+N10/2","v":5.817126618892899E-2},{"$f":"K10-N10/2","v":-5.2171266188928984E-2},6.7391676275823773,{"$f":"SQRT(K10^2+(N10^2)/12)","v":3.1994106816150052E-2},2.5590571774080479E-5,0.1,0.10002581188496801,{"$f":"N10/SQRT(12)","v":3.185314538571065E-2},1.0146228709632198E-6,{"$f":"W10","v":1.0146228709632198E-6},{"$f":"SQRT(M10*(1-M10))*SQRT(K10^2+(N10^2)/12)","v":1.0319487514731983E-2},2.1298364513341857E-7,{"$f":"Z10","v":2.1298364513341857E-7},{"$f":"SQRT(M10)*SQRT(K10^2+(N10^2)/12)","v":1.0987790747478994E-2},6.7609665485815606E-5,1.7113630662172926E-5,6.925820690075285E-2,5.5165166470446867E-4,{"$f":"(AF10+AE10+AD10+AC10*(1+RdsonTopTc*Ta-RdsonTopTc*25))/(1-AC10*RdsonTopTc*ThetaJA_Q1)","v":6.9895016614845012E-2},3.0048150116984477E-2,2.5280957112679359E-4,6.1509482470446873E-4,{"$f":"(AJ10+AI10*(1+RdsonBotTc*Ta-RdsonBotTc*25))/(1-AI10*RdsonBotTc*ThetaJA_Q2)","v":8.6792458243827638E-4},4.3119999999999999E-3,9.7999999999999997E-4,0.5544,0.49202999999999997,0.48905999999999994,0.55537999999999998,{"$f":"SUM(S10,T10,AC10,AD10,AE10,AF10,AI10,AJ10,AQ10, AL10)","v":0.73048007682921068},0.73049888358683579,{"$f":"AS10","v":0.73049888358683579},9.8999999999999991E-3,{"$f":"AU10/(AU10+AT10)","v":1.3371170891074017E-2},1.6730415421414353,5.2690345396080356E-2,null,{"$f":"AV10*100","v":1.3371170891074016},0.10002581188496801,7.5074941197283279E-2,7.2740936614845014E-2,2.2908845824382764E-3,{"$f":"AS10-BA10","v":0.63047307170186784}]
["Vin",{"$f":"Vin","v":28},"V","Vin",null,null,2,28,1,6.0000000000000001E-3,6.0000000000000001E-3,7.8571428571428564E-4,0.11803352806016222,0.11041719111373165,6.1208595556865822E-2,-4.9208595556865825E-2,6.3564678107428563,3.2434493076361287E-2,2.6299908528013208E-5,0.1,0.10002652735785744,3.187469750633766E-2,1.0159963411205282E-6,1.0159963411205282E-6,1.0464918411669192E-2,2.1902903472578567E-7,2.1902903472578567E-7,1.1143197012026569E-2,6.9535670203349216E-5,3.4227261324345853E-5,7.0059784667542549E-2,5.203248002149212E-4,7.0684324586818406E-2,3.0460228191392304E-2,2.5979114041207335E-4,6.4721112021492132E-4,9.0702393921108116E-4,8.6239999999999997E-3,9.7999999999999997E-4,0.5544,0.49202999999999997,0.48905999999999994,0.55537999999999998,0.73562117456844012,0.73564065989707428,0.73564065989707428,1.9799999999999998E-2,2.6209868029472581E-2,1.7566517854968233,8.6317710601854863E-2,null,2.6209868029472583,0.10002652735785744,8.021534852602949E-2,7.637616458681841E-2,3.7529439392110812E-3,0.63561413253921684]
["Vout",{"$f":"Vout","v":3.3},"V","Vout",null,null,3,28,1,8.9999999999999993E-3,8.9999999999999993E-3,1.1785714285714286E-3,0.11812171300847818,0.11049183335190987,6.4245916675954931E-2,-4.6245916675954936E-2,5.9737669283672323,3.3141672203670092E-2,2.7459260911387973E-5,0.1,0.10002769673943683,3.189624486449022E-2,1.0173704364555188E-6,1.0173704364555188E-6,1.0696547169740792E-2,2.2883224270897949E-7,2.2883224270897949E-7,1.139040813456637E-2,7.2655182584317607E-5,5.1340891986518772E-5,7.0845624635567525E-2,4.8899784850321281E-4,7.1459096211020368E-2,3.1122805769781155E-2,2.7121613091538651E-4,6.7932732850321288E-4,9.505671778605976E-4,1.2936E-2,9.7999999999999997E-4,0.5544,0.49202999999999997,0.48905999999999994,0.55537999999999998,0.74075262127897146,0.74077312948306584,0.74077312948306584,2.9699999999999997E-2,3.8547742761550485E-2,1.8399276928534687,0.12004728509079375,null,3.8547742761550485,0.10002769673943683,8.5345663388880971E-2,7.9996856211020373E-2,5.2194471778605981E-3,0.64074543274362905]
["Fsw",{"$f":"Fsw/1000","v":2200},"kHz","Switching Frequency",null,null,4,28,1,1.2E-2,1.2E-2,1.5714285714285713E-3,0.11820989285525531,0.11056645909382432,6.7283229546912154E-2,-4.3283229546912161E-2,5.5910649805479755,3.4099049200510864E-2,2.9068628909471515E-5,0.1,0.10002932002996429,3.1917787460581611E-2,1.0187451563788607E-6,1.0187451563788607E-6,1.1009099387450014E-2,2.4240053864550458E-7,2.4240053864550458E-7,1.1723821064546839E-2,7.6970868997966823E-5,6.8454522648691706E-5,7.1615726673170732E-2,4.5767080957691264E-4,7.2219334282606781E-2,3.2020261960598456E-2,2.8708320928709762E-4,7.1144344957691256E-4,9.9855303230245271E-4,1.7247999999999999E-2,9.7999999999999997E-4,0.5544,0.49202999999999997,0.48905999999999994,0.55537999999999998,0.74587441816216782,0.74589630157001929,0.74589630157001929,3.9599999999999996E-2,5.0413986572373497E-2,1.9228693284999558,0.15387903974295641,null,5.0413986572373499,0.10002932002996429,9.0465887314909232E-2,8.3603014282606775E-2,6.6903930323024526E-3,0.64586698154005506]
["Iout",{"$f":"Iout","v":0.3},"A","Max Output Current",null,null,5,28,1,1.4999999999999999E-2,1.4999999999999999E-2,1.964285714285714E-3,0.11829806760093628,0.11064106834090635,7.0320534170453169E-2,-4.0320534170453178E-2,5.2083619673775328,3.5286265037567037E-2,3.1128012507535647E-5,0.1,0.10003139722980393,3.1939325295025037E-2,1.0201205003014262E-6,1.0201205003014262E-6,1.139607800732099E-2,2.5974118789789033E-7,2.5974118789789033E-7,1.2136529533436224E-2,8.2485395504943039E-5,8.5568153310864632E-5,7.2370090648710042E-2,4.26343683443588E-4,7.296504158759827E-2,3.3133444601874042E-2,3.0739104233192774E-4,7.4355948344358798E-4,1.0509802474715799E-3,2.1560000000000003E-2,9.7999999999999997E-4,0.5544,0.49202999999999997,0.48905999999999994,0.55537999999999998,0.75098656641925254,0.75101018535532293,0.75101018535532293,4.9499999999999995E-2,6.1835565500054694E-2,2.00547675651476,0.18781294569184637,null,6.183556550005469,0.10003139722980393,9.5576021835069858E-2,8.7194641587598265E-2,8.1657802474715806E-3,0.65097878812551901]
["Ta",{"$f":"Ta","v":25},"°C","Ambient Temperature",null,null,6,28,1,1.7999999999999999E-2,1.7999999999999999E-2,2.3571428571428571E-3,0.11838623724596373,0.11071566109458726,7.3357830547293626E-2,-3.7357830547293636E-2,4.8256578889483475,3.6681009632155599E-2,3.3637411690857298E-5,0.1,0.1000339283394258,3.1960858368233667E-2,1.021496467634292E-6,1.021496467634292E-6,1.1850347075714387E-2,2.8086145162978505E-7,2.8086145162978505E-7,1.2620945449171367E-2,8.9201427857337289E-5,1.0268178397303754E-4,7.3108716430558149E-2,3.9501647011080628E-4,7.3696220902847498E-2,3.4441373427947564E-2,3.3213829700893312E-4,7.7567543011080621E-4,1.1078475793117066E-3,2.5871999999999999E-2,9.7999999999999997E-4,0.5544,0.49202999999999997,0.48905999999999994,0.55537999999999998,0.75608906725130998,0.75611479000858151,0.75611479000858151,5.9399999999999994E-2,7.2837428245016794E-2,2.0877500407654925,0.22184897432416925,null,7.2837428245016795,0.1000339283394258,0.10067606848215921,9.0771740902847495E-2,9.6456075793117067E-3,0.65608086166915569]
["Vcc",{"$f":"VCC","v":3.15},"V","Subregulated VCC Voltage",null,null,7,28,1,2.1000000000000001E-2,2.1000000000000001E-2,2.7500000000000003E-3,0.11847440179078023,0.11079023735629816,7.6395118678149077E-2,-3.4395118678149081E-2,4.4429527453528479,3.8260594059537814E-2,3.6596826444718507E-5,0.1,0.100036913359406,3.1982386680620638E-2,1.0228730577887405E-6,1.0228730577887405E-6,1.2364638830290368E-2,3.0576858680704873E-7,3.0576858680704873E-7,1.3169338814806204E-2,9.7121631498730323E-5,1.197954146352105E-4,7.3831603887102595E-2,3.6368916958613343E-4,7.4412874996006489E-2,3.5922716670229428E-2,3.6132364043148219E-4,8.0779128958613348E-4,1.1691537947649078E-3,3.0184000000000006E-2,9.7999999999999997E-4,0.5544,0.49202999999999997,0.48905999999999994,0.55537999999999998,0.76118192185928502,0.76121012467165039,0.76121012467165039,6.93E-2,8.3442691354784354E-2,2.1696892449081497,0.25598709727959296,null,8.3442691354784362,0.100036913359406,0.1057660287907714,9.4334314996006502E-2,1.112987379476491E-2,0.66117321131224438]
["Components","Input Value","Units","Description",null,null,8,28,1,2.4E-2,2.4E-2,3.1428571428571426E-3,0.11856256123582827,0.11086479712746997,7.9432398563734991E-2,-3.1432398563734983E-2,4.0602465366834561,4.0003128254878471E-2,4.0006256754406408E-5,0.1,0.1000403522904265,3.200391023259902E-2,1.0242502701762564E-6,1.0242502701762564E-6,1.2931934236587452E-2,3.3446984619884535E-7,3.3446984619884535E-7,1.3774243015513525E-2,1.0624867156423695E-4,1.3690904529738341E-4,7.4538752886745829E-2,3.3236178187713474E-4,7.5115006625494085E-2,3.7556896830353716E-2,3.949457398672333E-4,8.3990706187713491E-4,1.2348976717612345E-3,3.4495999999999999E-2,9.7999999999999997E-4,0.5544,0.49202999999999997,0.48905999999999994,0.55537999999999998,0.76626513144398334,0.76629619845867014,0.76629619845867014,7.9199999999999993E-2,9.3672804377335675E-2,2.2512944323863642,0.29022728645050838,null,9.3672804377335677,0.1000403522904265,0.11084590429725531,9.7882366625494086E-2,1.2618577671761234E-2,0.66625584616824363]
["L",{"$f":"Lf*1000000","v":12},"uH","Filter Inductance",null,null,9,28,1,2.6999999999999996E-2,2.6999999999999996E-2,3.5357142857142853E-3,0.11865071558155037,0.11093934040953345,8.2469670204766726E-2,-2.8469670204766727E-2,3.6775392630325805,4.1888281227671881E-2,4.3865702605213214E-5,0.1,0.10004424513327531,3.2025429024581831E-2,1.0256281042085284E-6,1.0256281042085284E-6,1.3545709253832677E-2,3.6697247837873643E-7,3.6697247837873643E-7,1.4428717203682419E-2,1.1658521288055098E-4,1.5402267595955631E-4,7.5230163297905134E-2,3.010343069913747E-4,7.5802618540463204E-2,3.9324804183424579E-2,4.3300326273811246E-4,8.7202274699137476E-4,1.3050779992084113E-3,3.8807999999999995E-2,9.7999999999999997E-4,0.5544,0.49202999999999997,0.48905999999999994,0.55537999999999998,0.77133869720607129,0.77137302045610201,0.77137302045610201,8.9099999999999985E-2,0.10354769746618166,2.3325656664306536,0.3245695139817934,null,10.354769746618166,0.10004424513327531,0.11591569653967161,0.10141589854046321,1.411171799920841E-2,0.67132877532282675]
["Rdcr",{"$f":"Rdcr*1000","v":25},"mW","Inductor DCR at 25°C",null,null,10,28,1,0.03,0.03,3.928571428571428E-3,0.11873886482838894,0.11101386720391924,8.5506933601959628E-2,-2.5506933601959624E-2,3.2948309244926204,4.389768284656323E-2,4.8175163982436291E-5,0.1,0.10004859188884636,3.2046943056982073E-2,1.0270065592974515E-6,1.0270065592974515E-6,1.4200065628823224E-2,4.0328372772577342E-7,4.0328372772577342E-7,1.5126485757367405E-2,1.2813391996598984E-4,1.7113630662172926E-4,7.5905834989012641E-2,2.6970674493641679E-4,7.6475713480768218E-2,4.1209173589500832E-2,4.7549487662029168E-4,9.0413834493641696E-4,1.3796935769816074E-3,4.3120000000000006E-2,9.7999999999999997E-4,0.5544,0.49202999999999997,0.48905999999999994,0.55537999999999998,0.77640262034607599,0.77644059972276114,0.77644059972276114,9.8999999999999991E-2,0.11308591357466379,2.4135030100576689,0.35901375227057702,null,11.308591357466378,0.10004859188884636,0.12097540705774983,0.10493491348076822,1.560929357698161E-2,0.67639200783391473]
["LTc",3930,"ppm","Inductor Series Resistance Temp Co",null,null,11,28,1,3.3000000000000002E-2,3.3000000000000002E-2,4.3214285714285715E-3,0.1188270089767863,0.11108837751205775,8.8544188756028874E-2,-2.2544188756028871E-2,2.9121215211559606,4.6015058783566952E-2,5.2934640871378059E-5,0.1,0.10005339255813962,3.2068452330212653E-2,1.0283856348551214E-6,1.0283856348551214E-6,1.488977559309723E-2,4.4341083442558798E-7,4.4341083442558798E-7,1.5861986062288919E-2,1.4089745703053884E-4,1.8824993728390219E-4,7.6565767828515346E-2,2.3837909571982341E-4,7.713429417693235E-2,4.3194710706461206E-2,5.224192492441649E-4,9.3625385571982351E-4,1.4587432159132727E-3,4.7432000000000002E-2,9.7999999999999997E-4,0.5544,0.49202999999999997,0.48905999999999994,0.55537999999999998,0.78145690206438501,0.7814989452898512,0.7814989452898512,0.1089,0.12230472708449787,2.4941065260694444,0.39355997396600534,null,12.230472708449787,0.10005339255813962,0.12602503739284562,0.10843941417693236,1.7111303215913275E-2,0.68144555273171159]
["ThetaCa",{"$f":"ThetaCa","v":22},"°C/W","Core to Ambient Thermal Resistance",null,null,12,28,1,3.5999999999999997E-2,3.5999999999999997E-2,4.7142857142857143E-3,0.11891514802718484,0.11116287133537926,9.1581435667689629E-2,-1.9581435667689634E-2,2.5294110531149818,4.822618925743398E-2,5.8144133257346012E-5,0.1,0.100058647142261,3.2089956844686476E-2,1.0297653302938405E-6,1.0297653302938405E-6,1.5610269608041467E-2,4.8736103447148626E-7,4.8736103447148626E-7,1.6630355634453114E-2,1.5487848797589643E-4,2.0536356794607509E-4,7.7209961684875109E-2,2.0705135934915669E-4,7.7778363350115023E-2,4.5268052771965508E-2,5.7377504849432715E-4,9.6836927934915672E-4,1.5422257377830525E-3,5.1743999999999998E-2,9.7999999999999997E-4,0.5544,0.49202999999999997,0.48905999999999994,0.55537999999999998,0.78650154356124702,0.78654806616099904,0.78654806616099904,0.11879999999999999,0.13122025046538693,2.5743762770526457,0.42820815196901019,null,13.122025046538694,0.100058647142261,0.13106458908789809,0.11192940335011503,1.8617745737783051E-2,0.68648941901873806]
["Cin",{"$f":"Cin*1000000","v":20},"μF","Input Capacitance",null,null,13,28,1,3.9E-2,3.9E-2,5.1071428571428561E-3,0.1190032819800268,0.1112373486753139,9.4618674337656944E-2,-1.6618674337656951E-2,2.1466995204620485,5.0518765276143809E-2,6.3803641125652851E-5,0.1,0.10006435564242235,3.2111456600816372E-2,1.0311456450261132E-6,1.0311456450261132E-6,1.6357590893306059E-2,5.3514155966553872E-7,5.3514155966553872E-7,1.7427383849824965E-2,1.7007967639551843E-4,2.2247719860824802E-4,7.7838416426568621E-2,1.7572353583197734E-4,7.8407923712079219E-2,4.7417633188266292E-2,6.2956094240955256E-4,1.0004846158319773E-3,1.6301399753077684E-3,5.6055999999999995E-2,9.7999999999999997E-4,0.5544,0.49202999999999997,0.48905999999999994,0.55537999999999998,0.79153654603677148,0.79158797131228775,0.79158797131228775,0.12869999999999998,0.13984753035126579,2.654312325377822,0.46295825943207858,null,13.984753035126579,0.10006435564242235,0.13609406368738697,0.11540488371207921,2.0128619975307765E-2,0.69152361566986542]
["RCinEsr",{"$f":"RCinEsr*1000","v":2},"mW","Input Capacitor ESR",null,null,14,28,1,4.2000000000000003E-2,4.2000000000000003E-2,5.5000000000000005E-3,0.11909141083575436,0.11131180953329159,9.765590476664579E-2,-1.3655904766645792E-2,1.7639869232895162,5.2882195287872164E-2,6.991316446161622E-5,0.1,0.10007051805994152,3.2132951599015129E-2,1.0325265784646489E-6,1.0325265784646489E-6,1.7128333801331511E-2,5.8675963761967115E-7,5.8675963761967115E-7,1.8249446448290969E-2,1.8650368557466236E-4,2.39590829270421E-4,7.8451131922087414E-2,1.4439562517584527E-4,7.9022977965158808E-2,4.9633499602542722E-2,6.8977559918277046E-4,1.0325998651758454E-3,1.7224847721314675E-3,6.0368000000000012E-2,9.7999999999999997E-4,0.5544,0.49202999999999997,0.48905999999999994,0.55537999999999998,0.79656191069092852,0.79661866969229078,0.79661866969229078,0.1386,0.14820063423841046,2.7339147331986529,0.49781026975902387,null,14.820063423841045,0.10007051805994152,0.14111346273729028,0.11886585796515882,2.1643924772131472E-2,0.69654815163234929]
["Cout",{"$f":"Cout*1000000","v":22},"μF","Output Capcitance",null,null,15,28,1,4.4999999999999998E-2,4.4999999999999998E-2,5.8928571428571424E-3,0.11917953459480976,0.11138625391074214,0.10069312695537107,-1.0693126955371071E-2,1.3812732616897332,5.5307396702632461E-2,7.6472703250559006E-5,0.1,0.10007713439624238,3.2154441839695493E-2,1.0339081300223602E-6,1.0339081300223602E-6,1.7919577167957362E-2,6.4222249175675768E-7,6.4222249175675768E-7,1.9093434664940321E-2,2.0415317849043307E-4,2.5670445993259387E-4,7.9048108039937878E-2,1.1306762738831996E-4,7.9623528802226076E-2,5.1907117842527294E-2,7.5441768716104439E-4,1.0647150273883201E-3,1.8192589828155473E-3,6.4680000000000015E-2,9.7999999999999997E-4,0.5544,0.49202999999999997,0.48905999999999994,0.55537999999999998,0.80157763872354915,0.80164017022210454,0.80164017022210454,0.14849999999999999,0.15629272885629777,2.8131835624511998,0.53276415660475773,null,15.629272885629778,0.10007713439624238,0.14612278778504162,0.12231232880222609,2.3163658982815555E-2,0.70156303582586221]
["RCoutEsr",{"$f":"Cout_ESR*1000","v":1},"mW","Output Capacitor ESR",null,null,16,28,1,4.8000000000000001E-2,4.8000000000000001E-2,6.2857142857142851E-3,0.11926765325763504,0.11146068180909512,0.10373034090454755,-7.7303409045475571E-3,0.99855853575502884,5.7786592728005362E-2,8.348225747780905E-5,0.1,0.10008420465285471,3.2175927323270147E-2,1.0352902991123624E-6,1.0352902991123624E-6,1.8728819254182953E-2,7.0153734131170824E-7,7.0153734131170824E-7,1.995668603554001E-2,2.2303081781182589E-4,2.7381809059476682E-4,7.962934464864127E-2,8.1739542476959239E-5,8.0209578906658974E-2,5.4231180897996722E-2,8.2348587484554854E-4,1.0968301024769592E-3,1.9204614728289453E-3,6.8991999999999998E-2,9.7999999999999997E-4,0.5544,0.49202999999999997,0.48905999999999994,0.55537999999999998,0.80658373133432515,0.80665248179538285,0.80665248179538285,0.15839999999999999,0.16413615112963884,2.8921188748531566,0.56781989387506571,null,16.413615112963882,0.10008420465285471,0.1511220403794879,0.12574429890665897,2.4687821472828945E-2,0.70656827714252812]
["Top Driver","Input Value","Units","Description",null,null,17,28,1,5.0999999999999997E-2,5.0999999999999997E-2,6.6785714285714278E-3,0.11935576682467228,0.11153509322977996,0.10676754661488998,-4.7675466148899837E-3,0.61584274557772822,6.0313125314047318E-2,9.094182712869939E-5,0.1,0.1000917288314143,3.2197408050151734E-2,1.0366730851479756E-6,1.0366730851479756E-6,1.9553917783050045E-2,7.6471140133256168E-7,7.6471140133256168E-7,2.0836920610668649E-2,2.4313926589977249E-4,2.9093172125693972E-4,8.0194841616733639E-2,5.0411370449320608E-5,8.0781130952308475E-2,5.6599433076777964E-2,8.9697883089154696E-4,1.1289450904493207E-3,2.0260911185384037E-3,7.3303999999999994E-2,9.7999999999999997E-4,0.5544,0.49202999999999997,0.48905999999999994,0.55537999999999998,0.81158018972280921,0.81165561327836944,0.81165561327836944,0.16829999999999998,0.17174247253604141,2.9707207319030946,0.60297745572638328,null,17.17424725360414,0.1000917288314143,0.15611122207084688,0.12916177095230846,2.6216411118538403E-2,0.71156388444695517]
["RdsonDRT",1,"W","Drain to Source Resistance of pullup Top FET Driver",null,null,18,28,1,5.3999999999999992E-2,5.3999999999999992E-2,7.0714285714285705E-3,0.11944387529636354,0.111609488174226,0.10980474408711299,-1.8047440871130083E-3,0.23312589125014638,6.2881288850839601E-2,9.8851412188568128E-5,0.1,0.10009970693366292,3.2218884020752868E-2,1.0380564875427244E-6,1.0380564875427244E-6,2.0393036589502499E-2,8.3175188268157551E-7,8.3175188268157551E-7,2.1732184197931655E-2,2.6448118480718502E-4,3.0804535191911262E-4,8.0744598812765925E-2,1.9083111312960755E-5,8.1338187603466103E-2,5.9006513687303155E-2,9.7489522410837068E-4,1.1610599913129606E-3,2.1361468071988019E-3,7.7615999999999991E-2,9.7999999999999997E-4,0.5544,0.49202999999999997,0.48905999999999994,0.55537999999999998,0.81656701508841512,0.8166495735099305,0.8166495735099305,0.17819999999999997,0.17912255756545409,3.0489891948797201,0.63823681656557241,null,17.912255756545409,0.10009970693366292,0.16109033441066489,0.13256474760346609,2.7749426807198802E-2,0.71654986657626762]
["RdsonDRT2",1,"W","Drain to Source Resistance of pulldown Top FET Driver",null,null,19,28,1,5.7000000000000002E-2,5.7000000000000002E-2,7.4642857142857141E-3,0.11953197867315073,0.11168386664386237,0.11284193332193118,1.1580666780688156E-3,0,6.5486185609717237E-2,1.0721101264275842E-4,0.1,0.10010813896144831,3.2240355235486108E-2,1.0394405057103365E-6,1.0394405057103365E-6,2.1244599219993707E-2,9.0266599203631446E-7,9.0266599203631446E-7,2.2640798993623076E-2,2.8705923627900053E-4,3.2515898258128557E-4,8.1071760000000007E-2,0,8.1686135504750165E-2,6.1447821170816902E-2,1.0572337234593945E-3,1.2054200400000001E-3,2.2628738630229074E-3,8.1928000000000001E-2,9.7999999999999997E-4,0.5544,0.49202999999999997,0.48905999999999994,0.55537999999999998,0.8213618429949624,0.82145198310928191,0.82145198310928191,0.18809999999999999,0.18632027190980077,3.1224481566092535,0.67387961884952696,null,18.632027190980079,0.10010813896144831,0.16587700936777305,0.13575861550475016,2.9299113863022912E-2,0.72134384414783359]
["Bottom Driver","Input Value","Units","Description",null,null,20,28,1,0.06,0.06,7.8571428571428559E-3,0.11962007695547575,0.11175822864011792,0.11587911432005896,4.1208856799410387E-3,0,6.8123601923744018E-2,1.1602062847661849E-4,0.1,0.10011702491672415,3.2261821694763916E-2,1.0408251390647399E-6,1.0408251390647399E-6,2.2107249171829813E-2,9.7746093189074007E-7,9.7746093189074007E-7,2.3561321276019953E-2,3.1087608175222513E-4,3.4227261324345853E-4,8.1071760000000007E-2,0,8.172724614323261E-2,6.3919396733643455E-2,1.1439929980620149E-3,1.2688632000000001E-3,2.4131101715268752E-3,8.6240000000000011E-2,9.7999999999999997E-4,0.5544,0.49202999999999997,0.48905999999999994,0.55537999999999998,0.82587378552153423,0.82597194400657759,0.82597194400657759,0.19799999999999998,0.19336467288866277,3.1888498612943499,0.71006313394511822,null,19.336467288866277,0.10011702491672415,0.17038035631475951,0.1386456461432326,3.087231017152688E-2,0.72585491908985345]
["RdsonDRB",1,"W","Drain to Source Resistance of pullup Bottom FET Driver",null,null,21,28,1,6.3E-2,6.3E-2,8.2500000000000004E-3,0.1197081701437805,0.11183257416442156,0.11891628708221078,7.0837129177892186E-3,0,7.0789903143174807E-2,1.2528025967550174E-4,0.1,0.10012636480155022,3.2283283398998788E-2,1.0422103870200707E-6,1.0422103870200707E-6,2.2979816149790038E-2,1.0561439005563022E-6,1.0561439005563022E-6,2.4492505499349771E-2,3.3593438235598013E-4,3.5938624390563143E-4,8.1071760000000007E-2,0,8.1769607794749108E-2,6.6417825629753874E-2,1.2351717171876296E-3,1.3323063600000002E-3,2.5677698677655856E-3,9.0551999999999994E-2,9.7999999999999997E-4,0.5544,0.49202999999999997,0.48905999999999994,0.55537999999999998,0.83039183896312474,0.83049849277867793,0.83049849277867793,0.2079,0.20021215501158413,3.2552803392792296,0.74634838695860839,null,20.021215501158412,0.10012636480155022,0.17488937766251467,0.1415339277947491,3.2449929867765584E-2,0.73037212797712769]
["RdsonDRB2",1,"W","Drain to Source Resistance of pulldown Bottom FET Driver",null,null,22,28,1,6.6000000000000003E-2,6.6000000000000003E-2,8.6428571428571431E-3,0.11979625823850677,0.11190690321820183,0.12195345160910093,1.0046548390899086E-2,0,7.348194505448713E-2,1.3498990622476663E-4,0.1,0.10013615861809216,3.2304740348603117E-2,1.0435962489906664E-6,1.0435962489906664E-6,2.3861287603176674E-2,1.1387220921630258E-6,1.1387220921630258E-6,2.54332740052821E-2,3.6223679891154466E-4,3.7649987456780438E-4,8.1071760000000007E-2,0,8.1813223163405557E-2,6.8940153918909314E-2,1.3307685502616142E-3,1.3957495200000003E-3,2.7268519206691214E-3,9.4864000000000004E-2,9.7999999999999997E-4,0.5544,0.49202999999999997,0.48905999999999994,0.55537999999999998,0.83491600464996574,0.83503163810379566,0.83503163810379566,0.21779999999999999,0.20687068294439659,3.3217396527583283,0.78273535417538986,null,20.687068294439658,0.10013615861809216,0.17940407508407469,0.14442346316340557,3.4031971920669125E-2,0.73489547948570344]
["Deadtime","Input Value","Units","Description",null,null,23,28,1,6.8999999999999992E-2,6.8999999999999992E-2,9.0357142857142841E-3,0.11988434124009631,0.11198121580288718,0.12499060790144359,1.3009392098556401E-2,0,7.6196999444801405E-2,1.4514956810977666E-4,0.1,0.10014640636862165,3.2326192543989246E-2,1.044982724391066E-6,1.044982724391066E-6,2.4750784802310813E-2,1.2252026966605997E-6,1.2252026966605997E-6,2.6382691564072885E-2,3.8978599193240147E-4,3.9361350522997717E-4,8.1071760000000007E-2,0,8.1858094953926402E-2,7.1483818520180237E-2,1.4307821668632979E-3,1.4591926799999999E-3,2.8903553099959745E-3,9.9175999999999973E-2,9.7999999999999997E-4,0.5544,0.49202999999999997,0.48905999999999994,0.55537999999999998,0.83944628391213538,0.83957138868188008,0.83957138868188008,0.22769999999999996,0.21334779739689072,3.3882278639403069,0.81922401212990736,null,21.334779739689072,0.10014640636862165,0.18392445026392235,0.14731425495392639,3.561843530999597E-2,0.73942498231325837]
["Deadtime",15,"ns","Total Deadtime",null,null,24,28,1,7.1999999999999995E-2,7.1999999999999995E-2,9.4285714285714285E-3,0.11997241914899084,0.11205551191990598,0.12802775595995297,1.5972244040047004E-2,0,7.8932691659641355E-2,1.557592453159004E-4,0.1,0.10015710805551635,3.2347639985569519E-2,1.0463698126360161E-6,1.0463698126360161E-6,2.5647542765530856E-2,1.3155928998194683E-6,1.3155928998194683E-6,2.7339944012649109E-2,4.1858462162428124E-4,4.1072713589215018E-4,8.1071760000000007E-2,0,8.1904225871660866E-2,7.4046588537360916E-2,1.5352112367259443E-3,1.5226358399999999E-3,3.0582790263239596E-3,0.103488,9.7999999999999997E-4,0.5544,0.49202999999999997,0.48905999999999994,0.55537999999999998,0.84398267807955829,0.84411775323467275,0.84411775323467275,0.23759999999999998,0.21965064296070028,3.4547450350481999,0.85581433760545111,null,21.965064296070029,0.10015710805551635,0.18845050489798482,0.15020630587166087,3.7209319026323961E-2,0.74396064517915639]
["IQ","Input Value","Units","Description",null,null,25,28,1,7.4999999999999997E-2,7.4999999999999997E-2,9.8214285714285712E-3,0.120060491965632,0.11212979157068628,0.13106489578534314,1.8935104214656856E-2,0,8.1686948242301605E-2,1.6681893782851155E-4,0.1,0.10016826368125989,3.2369082673756176E-2,1.0477575131404623E-6,1.0477575131404623E-6,2.6550893424063093E-2,1.4098998832319137E-6,1.4098998832319137E-6,2.8304320337980401E-2,4.4863534788520617E-4,4.2784076655432313E-4,8.1071760000000007E-2,0,8.1951618622589137E-2,7.6626516059034352E-2,1.6440544297367261E-3,1.586079E-3,3.2306220710411823E-3,0.10779999999999999,9.7999999999999997E-4,0.5544,0.49202999999999997,0.48905999999999994,0.55537999999999998,0.84852518848200476,0.84867074050575941,0.84867074050575941,0.24749999999999997,0.22578599378214251,3.5212912283195501,0.89250630763394723,null,22.57859937821425,0.10016826368125989,0.19298224069363029,0.15309961862258914,3.8804622071041184E-2,0.74850247682449955]
["IQ ",{"$f":"Iq*1000","v":3.4999999999999996E-2},"mA","Quiescent Current Of Controller (Not Switching!)",null,null,26,28,1,7.8E-2,7.8E-2,1.0214285714285712E-2,0.12014855969046138,0.11220405475665608,0.13410202737832805,2.1897972621671959E-2,0,8.4457953002186573E-2,1.7832864563298892E-4,0.1,0.10017987324844188,3.239052060896145E-2,1.0491458253195565E-6,1.0491458253195565E-6,2.7460251494780145E-2,1.5081308243131504E-6,1.5081308243131504E-6,2.9275197641931847E-2,4.7994083030553634E-4,4.4495439721649603E-4,8.1071760000000007E-2,0,8.2000275913328688E-2,7.9221894879795599E-2,1.7573104159367078E-3,1.6495221600000001E-3,3.4073834563370878E-3,0.11211199999999999,9.7999999999999997E-4,0.5544,0.49202999999999997,0.48905999999999994,0.55537999999999998,0.85307381644909164,0.85323035926062551,0.85323035926062551,0.25739999999999996,0.2317602772639473,3.5878665060065598,0.92929989949575287,null,23.176027726394729,0.10017987324844188,0.19751965936966576,0.15599419591332869,4.0404343456337082E-2,0.75305048601218361]
["High-side FET","Input Value","Units","Description",null,null,27,28,1,8.1000000000000003E-2,8.1000000000000003E-2,1.0607142857142857E-2,0.12023662232392056,0.11227830147924313,0.13713915073962157,2.4860849260378438E-2,0,8.7244110108296996E-2,1.9028836871471625E-4,0.1,0.10019193675975799,3.2411953791597489E-2,1.0505347485886508E-6,1.0505347485886508E-6,2.8375102610408365E-2,1.6102928963024072E-6,1.6102928963024072E-6,3.0252028508373632E-2,5.1250372816801263E-4,4.6206802787866909E-4,8.1071760000000007E-2,0,8.2050200451140462E-2,8.1831225823136733E-2,1.8749778655208162E-3,1.7129653200000001E-3,3.5885622051935644E-3,0.116424,9.7999999999999997E-4,0.5544,0.49202999999999997,0.48905999999999994,0.55537999999999998,0.85762856331028214,0.85779661828670972,0.85779661828670972,0.26729999999999998,0.23757959597020459,3.6544709303762306,0.96619509071945209,null,23.757959597020459,0.10019193675975799,0.20206276265633402,0.15889004045114047,4.200848220519357E-2,0.75760468152695171]
["RdsonTop",{"$f":"Rdson1*1000","v":560},"mW","Drain-Source Resistance of Top FET ",null,null,28,28,1,8.4000000000000005E-2,8.4000000000000005E-2,1.1000000000000001E-2,0.12032467986645103,0.1123525317398751,0.14017626586993756,2.7823734130062457E-2,0,9.0044013028981018E-2,2.0269810705908259E-4,0.1,0.1002044542180098,3.243338222207643E-2,1.0519242823633035E-6,1.0519242823633035E-6,2.9294993328758588E-2,1.7163932682640205E-6,1.7163932682640205E-6,3.1234330369911713E-2,5.4632670044780195E-4,4.7918165854084199E-4,8.1071760000000007E-2,0,8.2101394943935216E-2,8.4453187557998743E-2,1.9970554488378239E-3,1.7764084800000002E-3,3.7741573513761307E-3,0.12073600000000002,9.7999999999999997E-4,0.5544,0.49202999999999997,0.48905999999999994,0.55537999999999998,0.8621894303948856,0.86236952639345932,0.86236952639345932,0.2772,0.24324974789146048,3.7211045637105107,1.0031918590816513,null,24.324974789146047,0.1002044542180098,0.20661155229531136,0.16178715494393525,4.3617037351376141E-2,0.76216507217544949]
["RdsonTopTc",{"$f":"RdsonTopTc*1000000","v":4000},"ppm","Drain to Source Resistance Temp Co",null,null,29,28,1,8.6999999999999994E-2,8.6999999999999994E-2,1.1392857142857142E-2,0.12041273231849423,0.11242674553997944,0.14321337276998972,3.0786627230010272E-2,0,9.2856418335294802E-2,2.1555786065148181E-4,0.1,0.10021742562610492,3.2454805900810346E-2,1.0533144260592741E-6,1.0533144260592741E-6,3.0219522705434265E-2,1.8264391050885142E-6,1.8264391050885142E-6,3.2221676538488286E-2,5.8141240581254124E-4,4.9629528920301484E-4,8.1071760000000007E-2,0,8.2153862100279737E-2,8.7086611985472864E-2,2.1235418363903255E-3,1.83985164E-3,3.9641679394251837E-3,0.12504799999999999,9.7999999999999997E-4,0.5544,0.49202999999999997,0.48905999999999994,0.55537999999999998,0.86675641903205736,0.86694909241238372,0.86694909241238372,0.28709999999999997,0.24877624521142011,3.7877674683064342,1.0402901826067792,null,24.87762452114201,0.10021742562610492,0.21116603003970491,0.16468554210027975,4.5230007939425179E-2,0.7667316667862788]
["QgTop",{"$f":"Qg_Q1*1000000000","v":3},"nC","Gate Charge Of Top FET",null,null,30,28,1,0.09,0.09,1.1785714285714285E-2,0.12050077968049157,0.11250094288098347,0.14625047144049175,3.374952855950826E-2,0,9.5680223552688903E-2,2.2886762947731313E-4,0.1,0.10023085098705692,3.2476224828211261E-2,1.0547051790925255E-6,1.0547051790925255E-6,3.1148335168140959E-2,1.9404375674936937E-6,1.9404375674936937E-6,3.3213688621194774E-2,6.1776350262238264E-4,5.1340891986518774E-4,8.1071760000000007E-2,0,8.2207604629403158E-2,8.9730463429466584E-2,2.2544356988347153E-3,1.9032948000000001E-3,4.1585930246473106E-3,0.12936000000000003,9.7999999999999997E-4,0.5544,0.49202999999999997,0.48905999999999994,0.55537999999999998,0.87132953055079965,0.87153532519711052,0.87153532519711052,0.29699999999999999,0.25416433170293895,3.8544597064762733,1.0774900395668885,null,25.416433170293896,0.10023085098705692,0.21572619765405049,0.16758520462940318,4.6847393024647327E-2,0.77130447421005366]
["QgdTop",{"$f":"Qgd_Q1*1000000000","v":0.26},"nC","Gate to Drain Charge",null,null,31,28,1,9.2999999999999985E-2,9.2999999999999985E-2,1.2178571428571427E-2,0.12058882195288438,0.11257512376431429,0.14928756188215714,3.671243811784284E-2,0,9.8514448386412948E-2,2.4262741352198055E-4,0.1,0.10024473030398544,3.2497639004691145E-2,1.0560965408792233E-6,1.0560965408792233E-6,3.2081114475854225E-2,2.058395812025727E-6,2.058395812025727E-6,3.4210030090656721E-2,6.5538264893003745E-4,5.3052255052736064E-4,8.1071760000000007E-2,0,8.2262625241203341E-2,9.2383820997378019E-2,2.3897357069811638E-3,1.9667379599999997E-3,4.3574316731066791E-3,0.13367199999999999,9.7999999999999997E-4,0.5544,0.49202999999999997,0.48905999999999994,0.55537999999999998,0.8759087662799605,0.8761282336234405,0.8761282336234405,0.30689999999999995,0.25941899886870046,3.921181340547677,1.1147914084814536,null,25.941899886870047,0.10024473030398544,0.22029205691431,0.17048614524120334,4.8469191673106676E-2,0.7758835033194551]
["QgsTop",{"$f":"Qgs_Q1*1000000000","v":6.2200000000000005E-2},"nC",null,null,null,32,{"$f":"Vin","v":28},{"$f":"MODE","v":1},9.6000000000000002E-2,{"$f":"Iout*G41/100/Number_of_Phases","v":9.6000000000000002E-2},{"$f":"Vout*K41/(Vin*Efficiency)","v":1.257142857142857E-2},{"$f":"(Vout+(Rdson2+Rs+Rdcr)*K41)/(Vin+(Rs+Rdson2-Rdson1)*K41)","v":0.12067685913611399},{"$f":"(Vin-(Rdson1+Rdcr)*K41-Vout)*M41/(Fsw*Lf)","v":0.11264928819139892},0.15232464409569946,3.967535590430054E-2,{"$f":"IF(MIN(Vin, -P41/(Coss_Q1+Coss_Q2)*0.00000002)<0, 0, MIN(Vin, -P41/(Coss_Q1+Coss_Q2)*0.00000002))","v":0},0.10135821876313601,{"$f":"R41^2*Rdcr","v":2.5683721277089345E-4},{"$f":"Core_Loss","v":0.1},{"$f":"(T41+S41*(1+Ltc*(Ta-25)))/(1-S41*Ltc*ThetaCa)","v":0.10025906358011605},3.2519048430661952E-2,1.0574885108357376E-6,1.0574885108357376E-6,3.3017578583689595E-2,2.1803209910602356E-6,2.1803209910602356E-6,3.5210400819340439E-2,{"$f":"Rdson1*AB41^2","v":6.942725024808215E-4},{"$f":"(Vin*K41/2)*Fsw*(Tr_buck+Tf_buck)","v":5.4763618118953365E-4},{"$f":"(0.5*Coss_Q1*(Vin-Q41)^2-0.5*Coss_Q2*(Vin-Q41)^2+(Qoss_Q2*(Vin-Q41)/Vin)*Vin)*Fsw","v":8.1071760000000007E-2},{"$f":"IF(K41>N41/2,0,ABS(K41-N41/2)*Vsd_Q1*Deadtime*Fsw)","v":0},{"$f":"(AF41+AE41+AD41+AC41*(1+RdsonTopTc*Ta-RdsonTopTc*25))/(1-AC41*RdsonTopTc*ThetaJA_Q1)","v":8.2318926646253149E-2},{"$f":"SQRT((1-M41))*SQRT(K41^2+(N41^2)/12)","v":9.5045863586886978E-2},{"$f":"Rdson2*AH41^2","v":2.5294405317935961E-3},{"$f":"IF(K41<N41/2,Deadtime*Fsw*Vsd_Q2*(K41+N41/2),2*Deadtime*Fsw*Vsd_Q2*K41)","v":2.0301811200000002E-3},{"$f":"(AJ41+AI41*(1+RdsonBotTc*Ta-RdsonBotTc*25))/(1-AI41*RdsonBotTc*ThetaJA_Q2)","v":4.5606829616164878E-3},{"$f":"Qrr_Q2*K41/Iout*Fsw*Vin","v":0.137984},{"$f":"Iq*Vin","v":9.7999999999999997E-4},{"$f":"IF(Ext_VCC=1,  (Qg_Q1+Qg_Q2)*Fsw*Vout, (Qg_Q1+Qg_Q2)*Fsw*Vin)","v":0.5544},{"$f":"(Vin-VCC)*Fsw*(Qg_Q1+Qg_Q2)","v":0.49202999999999997},{"$f":"(Qg_Q1+Qg_Q2)*Fsw*(Vin-Vout)","v":0.48905999999999994},{"$f":"SUM(AM41:AN41)","v":0.55537999999999998},0.88049412754823486,{"$f":"U41 + ((AF41+AE41+AD41+AC41*(1+RdsonTC*(Ta-25))) + (AJ41+AI41*(1+RdsonTC*(Ta-25))) + AQ41 + AL41) / (1-AC41*RdsonTC*ThetaJA_Q1 -AI41*RdsonTC*ThetaJA_Q2)","v":0.88072782658940241},0.88072782658940241,{"$f":"Vout*K41","v":0.31679999999999997},0.2645450009310068,{"$f":"ThetaJA_Q1*BC41","v":3.9879324328638224},{"$f":"ThetaJA_Q2*BD41","v":1.1521942681171793},null,26.45450009310068,{"$f":"U41","v":0.10025906358011605},{"$f":"AG41+AK41+AL41","v":0.22486360960786964},{"$f":"AG41+AL41*0.66","v":0.17338836664625315},{"$f":"AK41+AL41*0.33","v":5.0095402961616492E-2},0.78046876300928636]
["RGateTop",{"$f":"Rgate1","v":0},"W","Gate Resistance",null,null,33,28,1,{"$f":"Iout*G42/100","v":9.9000000000000005E-2},9.9000000000000005E-2,1.2964285714285715E-2,0.12076489123062162,0.11272343616366409,0.15536171808183205,4.2638281918167958E-2,0,0.10421075322815125,2.714970272094659E-4,0.1,0.10027385081878033,3.2540453106535534E-2,1.0588810883786383E-6,1.0588810883786383E-6,3.3957475265421123E-2,2.306220252803375E-6,2.306220252803375E-6,3.6214532420225043E-2,7.3443572071269728E-4,5.6474981185170665E-4,8.1071760000000007E-2,0,8.2376511555806761E-2,9.7715857106014811E-2,2.6735488443896697E-3,2.0936242800000003E-3,4.7683459777304836E-3,0.14229600000000001,9.7999999999999997E-4,0.5544,0.49202999999999997,0.48905999999999994,0.55537999999999998,0.88508561568416355,0.88533411301530862,0.88533411301530862,0.32669999999999999,0.26954686876529654,4.0547130457835561,1.1896985974878012,null,26.954686876529653,0.10027385081878033,0.22944085753353727,0.17629187155580678,5.1726025977730489E-2,0.78506026219652825]
["GfsTop",{"$f":"Gfs_Q1","v":100},"S","Transconductance of Top FET",null,null,34,28,1,0.10199999999999999,0.10199999999999999,1.3357142857142856E-2,0.12085291823684846,0.11279756768253651,0.15839878384126826,4.5601216158731736E-2,0,0.10707135131735612,2.8660685682311746E-4,0.1,0.10028909202341589,3.2561853032723749E-2,1.0602742729247009E-6,1.0602742729247009E-6,3.4900578371231381E-2,2.4361007412929272E-6,2.4361007412929272E-6,3.7222184263562157E-2,7.7587496075632158E-4,5.8186344251387944E-4,8.1071760000000007E-2,0,8.2435382681806085E-2,0.1003931435486215,2.8220593160407548E-3,2.1570674399999999E-3,4.9804198197345613E-3,0.14660799999999999,9.7999999999999997E-4,0.5544,0.49202999999999997,0.48905999999999994,0.55537999999999998,0.88968323201613397,0.88994710184381076,0.88994710184381076,0.33659999999999995,0.27442892286321902,4.1215232416815395,1.2273043758538948,null,27.4428922863219,0.10028909202341589,0.23402380250154065,0.17919666268180606,5.336105981973456E-2,0.78965800982039491]
["VthTop",{"$f":"Vth_Q1","v":1.5},"V","Threshold Voltage of Top FET",null,null,35,28,1,0.105,0.105,1.375E-2,0.12094094015523567,0.11287168274944262,0.16143584137472131,4.8564158625278686E-2,0,0.10993938358882543,3.021667015972725E-4,0.1,0.10030478719756633,3.2583248209638371E-2,1.0616680638909021E-6,1.0616680638909021E-6,3.5846684619357617E-2,2.5699695963993801E-6,2.5699695963993801E-6,3.8233140061878612E-2,8.185928794350874E-4,5.9897707317605234E-4,8.1071760000000007E-2,0,8.249554273688714E-2,0.10307713162918181,2.9749706181719086E-3,2.2205106E-3,5.1969035966384115E-3,0.15092,9.7999999999999997E-4,0.5544,0.49202999999999997,0.48905999999999994,0.55537999999999998,0.89428697787238032,0.8945668020399572,0.8945668020399572,0.34649999999999997,0.27919528540321403,4.1883630829484044,1.2650115827226835,null,27.919528540321402,0.10030478719756633,0.23861244633352555,0.18210274273688715,5.5000503596638411E-2,0.7942620148423909]
["VspTop",{"$f":"Vsp_Q1","v":1.5029999999999999},"V",null,null,null,36,28,1,0.10799999999999998,0.10799999999999998,1.4142857142857141E-2,0.12102895698622435,0.11294578136580877,0.16447289068290438,5.1527109317095601E-2,0,0.11281428305269869,3.1817656151736048E-4,0.1,0.10032093634488123,3.2604638637691155E-2,1.063062460694423E-6,1.063062460694423E-6,3.6795610837619036E-2,2.707833953827015E-6,2.707833953827015E-6,3.9247204933808663E-2,8.6259213326517008E-4,6.1609070383822524E-4,8.1071760000000007E-2,0,8.2556994434386355E-2,0.10576728873133717,3.1322814223618523E-3,2.28395376E-3,5.4177964281672446E-3,0.15523199999999998,9.7999999999999997E-4,0.5544,0.49202999999999997,0.48905999999999994,0.55537999999999998,0.89889685458098256,0.89919322259124623,0.89919322259124623,0.35639999999999994,0.28384989149947387,4.2552326319908866,1.3028201978478466,null,28.384989149947387,0.10032093634488123,0.24320679086255359,0.18501011443438636,5.6644356428167245E-2,0.79887228624636497]
["VsdTop",{"$f":"Vsd_Q1","v":0.86599999999999999},"V",null,null,null,37,28,1,0.111,0.111,1.4535714285714284E-2,0.1211169687302555,0.11301986353306105,0.16750993176653053,5.4490068233469476E-2,0,0.11569553778237364,3.3463643656881617E-4,0.1,0.10033753946911624,3.2626024317293785E-2,1.0644574627526455E-6,1.0644574627526455E-6,3.7747191585037136E-2,2.8497009451149969E-6,2.8497009451149969E-6,4.026420287248187E-2,9.078753784555714E-4,6.3320433450039825E-4,8.1071760000000007E-2,0,8.261974048834704E-2,0.1084631339663218,3.2939904003429564E-3,2.3473969200000001E-3,5.6430974447535887E-3,0.15954399999999999,9.7999999999999997E-4,0.5544,0.49202999999999997,0.48905999999999994,0.55537999999999998,0.90351286346986781,0.90382637250768483,0.90382637250768483,0.36629999999999996,0.2883964996938001,4.3221319512319818,1.3407302012293325,null,28.839649969380009,0.10033753946911624,0.24780683793310063,0.18791878048834704,5.8292617444753586E-2,0.80348883303856855]
["θJATop",{"$f":"ThetaJA_Q1","v":23},"°C/W","Junction to Ambient Resistance",null,null,38,28,1,0.114,0.114,1.4928571428571428E-2,0.12120497538777016,0.11309392925262544,0.17054696462631272,5.7453035373687282E-2,0,0.11858268452638081,3.5154632673707891E-4,0.1,0.10035459657413291,3.2647405248857897E-2,1.0658530694831541E-6,1.0658530694831541E-6,3.8701277095455414E-2,2.9955776976384439E-6,2.9955776976384439E-6,4.1283974556638146E-2,9.5444527090816184E-4,6.5031796516257115E-4,8.1071760000000007E-2,0,8.2683783613525796E-2,0.11116423217154882,3.4600962240012027E-3,2.4108400800000001E-3,5.8728057875291374E-3,0.163856,9.7999999999999997E-4,0.5544,0.49202999999999997,0.48905999999999994,0.55537999999999998,0.90813500586680895,0.90846626082184423,0.90846626082184423,0.37619999999999998,0.29283870174914706,4.3890611031110938,1.3787415731131702,null,29.283870174914707,0.10035459657413291,0.25241258940105493,0.19082874361352581,5.994528578752914E-2,0.8081116642477113]
["Low-side FET","Input Value","Units","Description",null,null,39,28,1,0.11699999999999999,0.11699999999999999,1.5321428571428569E-2,0.12129297695920922,0.11316797852592782,0.17358398926296389,6.0416010737036084E-2,0,0.12147530317024829,3.6890623200759343E-4,0.1,0.10037210766389895,3.2668781432795106E-2,1.0672492803037384E-6,1.0672492803037384E-6,3.9657731494687959E-2,3.1454713346095306E-6,3.1454713346095306E-6,4.2306375452882142E-2,1.0023044662177281E-3,6.6743159582474405E-4,8.1071760000000007E-2,0,8.2749126525398953E-2,0.11387018870777156,3.6305975653761822E-3,2.4742832400000002E-3,6.1069206083166922E-3,0.16816800000000001,9.7999999999999997E-4,0.5544,0.49202999999999997,0.48905999999999994,0.55537999999999998,0.91276328309942623,0.91311289658891726,0.91311289658891726,0.38609999999999994,0.2971799317984799,4.4560201500841758,1.416854293991284,null,29.717993179847991,0.10037210766389895,0.25702404713371563,0.19374000652539897,6.1602360608316697E-2,0.81274078892501833]
["RdsonBot",{"$f":"Rdson2*1000","v":280},"mW","Drain-Source Resistance of Low-side FET",null,null,40,28,1,0.12,0.12,1.5714285714285712E-2,0.12138097344501361,0.1132420113543938,0.17662100567719691,6.3378994322803098E-2,0,0.1243730119223314,3.867161523658097E-4,0.1,0.10039007274248797,3.2690152869516959E-2,1.0686460946323878E-6,1.0686460946323878E-6,4.0616431250656199E-2,3.2993889750785628E-6,3.2993889750785628E-6,4.3331274165928788E-2,1.0514556196720172E-3,6.8454522648691706E-4,8.1071760000000007E-2,0,8.2815771940168911E-2,0.11658064493641086,3.8054930966610603E-3,2.5377264000000003E-3,6.345441069622146E-3,0.17248000000000002,9.7999999999999997E-4,0.5544,0.49202999999999997,0.48905999999999994,0.55537999999999998,0.91739769649518577,0.91776628888677425,0.91776628888677425,0.39599999999999996,0.30142347489792293,4.5230091546238853,1.4550683446013095,null,30.142347489792293,0.10039007274248797,0.2616412130097911,0.19665257194016894,6.3263841069622156E-2,0.81737621614428624]
["RdsonBotTc",{"$f":"RdsonBotTc*1000000","v":4000},"ppm","Drain To Source Resitance Temp Co",null,null,41,28,1,0.12299999999999998,0.12299999999999998,1.6107142857142855E-2,0.12146896484562417,0.11331602773944885,0.17965801386972441,6.634198613027556E-2,0,0.12727546311794466,4.0497608779718232E-4,0.1,0.10040849181407965,3.2711519559434951E-2,1.0700435118872955E-6,1.0700435118872955E-6,4.1577263822521172E-2,3.4573377339350561E-6,3.4573377339350561E-6,4.4358551000660218E-2,1.1019013862517773E-3,7.0165885714908985E-4,8.1071760000000007E-2,0,8.2883722574770752E-2,0.11929527427777313,3.9847814902025536E-3,2.6011695599999999E-3,6.5883663446265417E-3,0.17679199999999995,9.7999999999999997E-4,0.5544,0.49202999999999997,0.48905999999999994,0.55537999999999998,0.92203824738140061,0.92242644681602093,0.92242644681602093,0.40589999999999993,0.30557247502896323,4.5900281792197273,1.4933837059264101,null,30.557247502896324,0.10040849181407965,0.26626408891939723,0.19956644257477074,6.4929726344626529E-2,0.8220179550019413]
["QgBot",{"$f":"Qg_Q2*1000000000","v":6},"nC","Gate Charge Of Top FET",null,null,42,28,1,0.126,0.126,1.6500000000000001E-2,0.12155695116148164,0.11339002768251832,0.18269501384125916,6.9304986158740839E-2,0,0.130182339552978,4.2368603828717155E-4,0.1,0.10042736488295968,3.273288150296054E-2,1.0714415314868563E-6,1.0714415314868563E-6,4.2540126480235294E-2,3.6193247219088321E-6,3.6193247219088321E-6,4.5388096705579251E-2,1.1536444206308081E-3,7.1877248781126286E-4,8.1071760000000007E-2,0,8.2952981146878546E-2,0.1220137787667108,4.1684614185009171E-3,2.6646127200000004E-3,6.8356956171782089E-3,0.18110399999999999,9.7999999999999997E-4,0.5544,0.49202999999999997,0.48905999999999994,0.55537999999999998,0.92668493708523014,0.92709337950005588,0.92709337950005588,0.4158,0.30962994259067511,4.6570772863782066,1.5318003591950988,null,30.962994259067511,0.10042736488295968,0.27089267676405676,0.20248162114687854,6.660001561717821E-2,0.82666601461709621]
["RGateBot",{"$f":"Rgate2","v":0},"W","Gate Resistance",null,null,43,28,1,0.129,0.129,1.6892857142857143E-2,0.1216449323930268,0.11346401118502734,0.18573200559251368,7.2267994407486325E-2,0,0.13309335127214156,4.4284600382124166E-4,0.1,0.10044669195351974,3.2754238700505124E-2,1.0728401528496677E-6,1.0728401528496677E-6,4.3504925270428214E-2,3.7853570455710871E-6,3.7853570455710871E-6,4.6419811372023917E-2,1.2066873771759976E-3,7.3588611847343575E-4,8.1071760000000007E-2,0,8.3023550374912033E-2,0.12473588603539634,4.3565315542099083E-3,2.7280558800000005E-3,7.0874280817849467E-3,0.185416,9.7999999999999997E-4,0.5544,0.49202999999999997,0.48905999999999994,0.55537999999999998,0.93133776693368064,0.93176709608512787,0.93176709608512787,0.42569999999999997,0.31359876141948417,4.7241565386229771,1.570318285881054,null,31.359876141948419,0.10044669195351974,0.27552697845669699,0.20539811037491204,6.8274708081784957E-2,0.83132040413160813]
["VsdBot",{"$f":"Vsd_Q2","v":0.86599999999999999},"V","Diode Forward Voltage of Bottom FET Body Diode",null,null,44,28,1,0.13200000000000001,0.13200000000000001,1.7285714285714286E-2,0.12173290854070033,0.11353797824840095,0.18876898912420048,7.5231010875799531E-2,0,0.13600823274858964,4.624559843848633E-4,0.1,0.10046647303025757,3.2775591152480084E-2,1.0742393753945308E-6,1.0742393753945308E-6,4.4471574108274452E-2,3.9554418073354937E-6,3.9554418073354937E-6,4.7453603467480572E-2,1.2610329099473753E-3,7.5299974913560876E-4,8.1071760000000007E-2,0,8.3095432978042935E-2,0.12746134666378528,4.5489905701367817E-3,2.7914990400000005E-3,7.3435629436062961E-3,0.18972800000000001,9.7999999999999997E-4,0.5544,0.49202999999999997,0.48905999999999994,0.55537999999999998,0.93599673825360463,0.9364476057403931,0.9364476057403931,0.43559999999999999,0.31748169537086779,4.7912659984949881,1.6089374677029453,null,31.748169537086778,0.10046647303025757,0.28016699592164923,0.20831591297804297,6.9953802943606314E-2,0.83598113271013552]
["QrrBot",{"$f":"Qrr_Q2*1000000000","v":7},"nC","Reverse Recovery Charge of Body Diode",null,null,45,28,1,0.13500000000000001,0.13500000000000001,1.7678571428571429E-2,0.12182087960494285,0.11361192887406393,0.19180596443703196,7.8194035562968042E-2,0,0.13892674040133687,4.8251597996351115E-4,0.1,0.10048670811777695,3.2796938859296715E-2,1.0756391985404468E-6,1.0756391985404468E-6,4.5439993978098538E-2,4.1295861054592631E-6,4.1295861054592631E-6,4.8489388984641134E-2,1.3166836726981488E-3,7.7011337979778177E-4,8.1071760000000007E-2,0,8.3168631676201532E-2,0.13018993184742286,4.7458371392422507E-3,2.8549422000000006E-3,7.6040994184458617E-3,0.19404000000000002,9.7999999999999997E-4,0.5544,0.49202999999999997,0.48905999999999994,0.55537999999999998,0.94066185237170163,0.94113491765797397,0.94113491765797397,0.44550000000000001,0.32128139449455767,4.8584057285526354,1.6476578866242551,null,32.128139449455766,0.10048670811777695,0.28481273109464744,0.21123503167620156,7.1637299418445877E-2,0.84064820954019703]
["TrrBot",{"$f":"Trr_Q2*1000000000","v":40},"ns","Reverse Recovery Time of Body Diode",null,null,46,28,1,0.13799999999999998,0.13799999999999998,1.8071428571428568E-2,0.12190884558619493,0.11368586306344095,0.19484293153172044,8.1157068468279511E-2,0,0.14184865040495315,5.030259905426654E-4,0.1,0.10050739722078765,3.2818281821366285E-2,1.0770396217066208E-6,1.0770396217066208E-6,4.6410112228070712E-2,4.3077970340442377E-6,4.3077970340442377E-6,4.9527090690614381E-2,1.3736423188747515E-3,7.8722701045995434E-4,8.1071760000000007E-2,0,8.3243149190083229E-2,0.13292143133983425,4.9470699346404762E-3,2.9183853599999998E-3,7.8690367327437089E-3,0.19835199999999995,9.7999999999999997E-4,0.5544,0.49202999999999997,0.48905999999999994,0.55537999999999998,0.94533311061451786,0.94582904105301724,0.94582904105301724,0.45539999999999992,0.32500040083223575,4.925575791371914,1.686479524853105,null,32.500040083223574,0.10050739722078765,0.28946418592282686,0.21415546919008321,7.3325196732743694E-2,0.84532164383222963]
["θJABot",{"$f":"ThetaJA_Q2","v":23},"°C/W","Junction to Ambient Resistance",null,null,47,28,1,0.14099999999999999,0.14099999999999999,1.8464285714285711E-2,0.12199680648489714,0.11375978081795653,0.19787989040897824,8.412010959102173E-2,0,0.14477375675277773,5.2398601610781142E-4,0.1,0.10052854034410549,3.2839620039100015E-2,1.0784406443124592E-6,1.0784406443124592E-6,4.7381861946519069E-2,4.4900816830379837E-6,4.4900816830379837E-6,5.056663746301384E-2,1.4319115016168899E-3,8.0434064112212735E-4,8.1071760000000007E-2,0,8.3318988241155065E-2,0.13565565163308377,5.1526876295990435E-3,2.9818285199999998E-3,8.1383741235688273E-3,0.20266399999999996,9.7999999999999997E-4,0.5544,0.49202999999999997,0.48905999999999994,0.55537999999999998,0.95001051430844585,0.95052998516375198,0.95052998516375198,0.46529999999999994,0.32864115386437753,4.9927762495465657,1.7254023648420826,null,32.864115386437753,0.10052854034410549,0.29412136236472386,0.21707722824115505,7.5017494123568812E-2,0.85000144481964646]
[null,null,null,null,null,null,48,28,1,0.14399999999999999,0.14399999999999999,1.8857142857142857E-2,0.12208476230148993,0.11383368213903497,0.20091684106951746,8.7083158930482504E-2,0,0.14770186954056325,5.4539605664443911E-4,0.1,0.10055013749265233,3.2860953512909068E-2,1.0798422657775709E-6,1.0798422657775709E-6,4.8355181409208109E-2,4.6764471382348512E-6,4.6764471382348512E-6,5.1607963701586324E-2,1.491493873757581E-3,8.2145427178430036E-4,8.1071760000000007E-2,0,8.3396151551662245E-2,0.13839241434541602,5.3626888975389277E-3,3.0452716799999999E-3,8.4121108386116424E-3,0.20697599999999999,9.7999999999999997E-4,0.5544,0.49202999999999997,0.48905999999999994,0.55537999999999998,0.95469406477972529,0.95523775925154786,0.95523775925154786,0.47519999999999996,0.33220599563076431,5.0600071656882317,1.7644263892880678,null,33.220599563076433,0.10055013749265233,0.29878426239027389,0.22000031155166225,7.671419083861164E-2,0.85468762175889557]
[null,null,null,null,null,null,49,28,1,0.14699999999999999,0.14699999999999999,1.9249999999999996E-2,0.12217271303641372,0.11390756702810045,0.20395378351405022,9.0046216485949765E-2,0,0.15063281344223031,5.67256112138044E-4,0.1,0.10057218867145608,3.2882282243204573E-2,1.0812444855217668E-6,1.0812444855217668E-6,4.9330013588468981E-2,4.866900481277069E-6,4.866900481277069E-6,5.26510088056793E-2,1.5523920878232028E-3,8.3856790244647337E-4,8.1071760000000007E-2,0,8.3474641844634781E-2,0.14113155478937386,5.5770724120344914E-3,3.1087148399999999E-3,8.6902461361766381E-3,0.21128799999999998,9.7999999999999997E-4,0.5544,0.49202999999999997,0.48905999999999994,0.55537999999999998,0.9593837633544422,0.95995237260097532,0.95995237260097532,0.48509999999999992,0.33569717554725015,5.1272686024266001,1.8035515811320628,null,33.569717554725017,0.10057218867145608,0.30345288798081138,0.2229247218446348,7.841528613617664E-2,0.8593801839295192]
[null,null,null,null,null,null,50,28,1,0.15,0.15,1.9642857142857142E-2,0.12226065869010894,0.11398143548657703,0.2069907177432885,9.3009282256711484E-2,0,0.15356642635343529,5.8956618257412663E-4,0.1,0.10059469388565065,3.2903606230397606E-2,1.0826473029650601E-6,1.0826473029650601E-6,5.0306305716360404E-2,5.0614487896558307E-6,5.0614487896558307E-6,5.3695716709222067E-2,1.6146087960335371E-3,8.5568153310864627E-4,8.1071760000000007E-2,0,8.3554461843893965E-2,0.14387292069756571,5.7958368468134496E-3,3.172158E-3,8.972779285174988E-3,0.21559999999999999,9.7999999999999997E-4,0.5544,0.49202999999999997,0.48905999999999994,0.55537999999999998,0.96407961135852982,0.96467383451986277,0.96467383451986277,0.49499999999999994,0.33911685493959859,5.1945606224095613,1.8427779235590249,null,33.911685493959858,0.10059469388565065,0.30812724112906897,0.22585046184389396,8.0120779285174998E-2,0.8640791406342121]
[null,null,null,null,null,null,51,28,1,0.153,0.153,2.0035714285714285E-2,0.12234859926301589,0.11405528751588849,0.21002764375794425,9.5972356242055745E-2,0,0.1565025581820555,6.1232626793819166E-4,0.1,0.10061765314047605,3.292492547489919E-2,1.0840507175276655E-6,1.0840507175276655E-6,5.1284008895133966E-2,5.260099136712359E-6,5.260099136712359E-6,5.4742035466061323E-2,1.6781466503018089E-3,8.7279516377081917E-4,8.1071760000000007E-2,0,8.3635614274059106E-2,0.14661637108645184,6.0189808757568422E-3,3.2356011600000001E-3,9.2597095651172929E-3,0.219912,9.7999999999999997E-4,0.5544,0.49202999999999997,0.48905999999999994,0.55537999999999998,0.96878161011776764,0.96940215433935739,0.96940215433935739,0.50490000000000002,0.34246711131358848,5.2618832883033599,1.8821053999976978,null,34.24671113135885,0.10061765314047605,0.31280732383917642,0.22877753427405911,8.1830669565117295E-2,0.86878450119888129]
["Controller","Input Value","Units","Std Units",null,null,52,28,1,0.156,0.156,2.0428571428571424E-2,0.12243653475557481,0.11412912311745847,0.21306456155872924,9.8935438441270757E-2,0,0.15944106976757902,6.3553636821575001E-4,0.1,0.10064106644127829,3.2946239977120297E-2,1.0854547286299997E-6,1.0854547286299997E-6,5.2263077749205522E-2,5.4628585916390026E-6,5.4628585916390026E-6,5.5789916879479026E-2,1.7430083022347402E-3,8.8990879443299207E-4,8.1071760000000007E-2,0,8.3718101860554034E-2,0.14936177524122704,6.2465031728990306E-3,3.2990443200000001E-3,9.5510362661063754E-3,0.22422399999999998,9.7999999999999997E-4,0.5544,0.49202999999999997,0.48905999999999994,0.55537999999999998,0.9734897609577825,0.974137341413984,0.974137341413984,0.51479999999999992,0.34574994237911655,5.3292366627927423,1.9215339941204463,null,34.574994237911653,0.10064106644127829,0.31749313812666036,0.23170594186055402,8.3544956266106363E-2,0.87349627497270577]
["θJA",23,"°C/W","Junction to Ambient Resistance",null,null,53,28,1,0.15899999999999997,0.15899999999999997,2.0821428571428567E-2,0.122524465168226,0.11420294229271058,0.21610147114635525,0.10189852885364468,0,0.1623818319138341,6.5919648339231676E-4,0.1,0.10066493379350944,3.2967549737471874E-2,1.0868593356926818E-6,1.0868593356926818E-6,5.324347011362196E-2,5.6697342194803099E-6,5.6697342194803099E-6,5.6839316170558908E-2,1.8091964031325854E-3,9.0702242509516486E-4,8.1071760000000007E-2,0,8.3801927329613779E-2,0.15210901180717698,6.478402412427654E-3,3.3624874799999998E-3,9.8467586888301307E-3,0.22853599999999996,9.7999999999999997E-4,0.5544,0.49202999999999997,0.48905999999999994,0.55537999999999998,0.97820406520404768,0.97887940512170446,0.97887940512170446,0.52469999999999983,0.34896726984467374,5.3966208085811163,1.9610636898430929,null,34.896726984467378,0.10066493379350944,0.32218468601844386,0.23463568732961376,8.5263638688830121E-2,0.87821447132819497]
["Theta JC",2,"°C/W","Junction to Ambient Resistance",null,null,54,28,1,0.16200000000000001,0.16200000000000001,2.1214285714285713E-2,0.12261239050140958,0.11427674504306809,0.21913837252153406,0.10486162747846596,0,0.16532472452158067,6.8330661345341345E-4,0.1,0.10068925520272765,3.2988854756364795E-2,1.0882645381365321E-6,1.0882645381365321E-6,5.4225146754684393E-2,5.8807330811341187E-6,5.8807330811341187E-6,5.7890191680783257E-2,1.8767136039891832E-3,9.2413605575733819E-4,8.1071760000000007E-2,0,8.3887093408291188E-2,0.15485796797484691,6.7146772686836401E-3,3.4259306400000003E-3,1.0146876144554472E-2,0.232848,9.7999999999999997E-4,0.5544,0.49202999999999997,0.48905999999999994,0.55537999999999998,0.98292452418188359,0.98362835486397782,0.98362835486397782,0.53459999999999996,0.35212094299733732,5.4640357883906976,2.0006944713247528,null,35.212094299733735,0.10068925520272765,0.32688196955284565,0.23756677340829119,8.6986716144554471E-2,0.88293909966125017]
[null,null,null,null,null,null,55,28,1,0.16500000000000001,0.16500000000000001,2.1607142857142856E-2,0.12270031075556569,0.11435053136995421,0.22217526568497711,0.1078247343150229,0,0.16826963580926468,7.0786675838456438E-4,0.1,0.1007140306745971,3.3010155034209905E-2,1.0896703353825736E-6,1.0896703353825736E-6,5.5208071118961428E-2,6.0958622333526063E-6,6.0958622333526063E-6,5.8942504604850635E-2,1.9455625554919897E-3,9.4124968641951087E-4,8.1071760000000007E-2,0,8.3973602824463561E-2,0.15760853874803146,6.9553264161611259E-3,3.4893738000000003E-3,1.0451387955116265E-2,0.23716000000000004,9.7999999999999997E-4,0.5544,0.49202999999999997,0.48905999999999994,0.55537999999999998,0.9876511392164572,0.98838420006582017,0.98838420006582017,0.54449999999999998,0.35521274208229159,5.531481664962663,2.0404263229676749,null,35.521274208229158,0.1007140306745971,0.33158499077957987,0.2404992028244636,8.8714187955116292E-2,0.88767016939122312]
[null,null,null,null,null,null,56,28,1,0.16800000000000001,0.16800000000000001,2.2000000000000002E-2,0.12278822593113442,0.11442430127479199,0.225212150637396,0.11078784936260402,0,0.17121646161176218,7.3287691817130085E-4,0.1,0.10073926021488805,3.3031450571418E-2,1.0910767268520305E-6,1.0910767268520305E-6,5.6192209107417269E-2,6.315128728743417E-6,6.315128728743417E-6,5.9996218750228321E-2,2.015745908022139E-3,9.5836331708168399E-4,8.1071760000000007E-2,0,8.4061458306839434E-2,0.16036062628502917,7.2003485295075017E-3,3.5528169600000004E-3,1.0760293452916455E-2,0.24147200000000005,9.7999999999999997E-4,0.5544,0.49202999999999997,0.48905999999999994,0.55537999999999998,0.99238391163278261,0.99314695017586563,0.99314695017586563,0.5544,0.3582443814948536,5.5989585010573073,2.080259229417079,null,35.82443814948536,0.10073926021488805,0.33629375175975595,0.24343297830683946,9.0446053452916481E-2,0.89240768996097763]
["Outputs",null,null,null,null,null,57,28,1,0.17099999999999999,0.17099999999999999,2.2392857142857141E-2,0.12287613602855577,0.11449805475900419,0.22824902737950209,0.11375097262049788,0,0.17416510474824262,7.583370927991581E-4,0.1,0.1007649438294768,3.3052741368399793E-2,1.092483711966327E-6,1.092483711966327E-6,5.7177528871798465E-2,6.5385396157706945E-6,6.5385396157706945E-6,6.105130032039903E-2,2.0872663116544708E-3,9.7547694774385656E-4,8.1071760000000007E-2,0,8.4150662584965105E-2,0.16311413930482779,7.4497422835233355E-3,3.61626012E-3,1.1073591980913119E-2,0.24578399999999997,9.7999999999999997E-4,0.5544,0.49202999999999997,0.48905999999999994,0.55537999999999998,0.99712284275572083,0.99791661466642589,0.99791661466642589,0.56429999999999991,0.3612175127970283,5.6664663594541977,2.1201931755610017,null,36.121751279702828,0.1007649438294768,0.34100825456587819,0.24636810258496511,9.2182311980913118E-2,0.89715167083694913]
["Design","Value","Units",null,null,null,58,28,1,0.17399999999999999,0.17399999999999999,2.2785714285714284E-2,0.1229640410482697,0.11457179182401354,0.23128589591200677,0.11671410408799321,0,0.17711547445140724,7.8424728225367731E-4,0.1,0.10079108152434574,3.3074027425565991E-2,1.0938912901470913E-6,1.0938912901470913E-6,5.8164000630786188E-2,6.7661019387561916E-6,6.7661019387561916E-6,6.2107717719148275E-2,2.1601264161575867E-3,9.9259057840602968E-4,8.1071760000000007E-2,0,8.4241218389231445E-2,0.1658689925509457,7.7035063531623914E-3,3.6797032800000001E-3,1.1391282892614714E-2,0.25009599999999998,9.7999999999999997E-4,0.5544,0.49202999999999997,0.48905999999999994,0.55537999999999998,1.0018679339099796,1.002693203033552,1.002693203033552,0.57419999999999993,0.36413372756974371,5.7340053029523226,2.1602281465301383,null,36.413372756974368,0.10079108152434574,0.34572850128184618,0.24930457838923142,9.3922962892614703E-2,0.90190212150920623]
["Dmax",{"$f":"D1_Vinmin","v":0.54999999999999993},"index",null,null,null,59,28,1,0.17699999999999999,0.17699999999999999,2.3178571428571427E-2,0.1230519409907162,0.11464551247124266,0.23432275623562132,0.11967724376437866,0,0.18006748585132229,8.1060748652040391E-4,0.1,0.10081767330558329,3.3095308743327279E-2,1.0952994608161551E-6,1.0952994608161551E-6,5.9151596503730745E-2,6.9978227378803425E-6,6.9978227378803425E-6,6.316544137356804E-2,2.2343288709938906E-3,1.0097042090682024E-3,8.1071760000000007E-2,0,8.4333128450880576E-2,0.1686251063065595,7.9616394135315783E-3,3.7431464400000001E-3,1.1713365552073271E-2,0.25440800000000002,9.7999999999999997E-4,0.5544,0.49202999999999997,0.48905999999999994,0.55537999999999998,1.0066191864201142,1.0074767247970944,1.0074767247970944,0.58409999999999995,0.36699456011111575,5.8015753943702535,2.2003641276976853,null,36.699456011111579,0.10081767330558329,0.35045449400295386,0.25224240845088058,9.5668005552073276E-2,0.90665905149151105]
["Dprime",{"$f":"1-B68","v":0.45000000000000007},"index",null,null,null,60,28,1,0.18,0.18,2.357142857142857E-2,0.12313983585633508,0.11471921670211378,0.23735960835105688,0.12264039164894311,0,0.18302105950790348,8.3741770558488872E-4,0.1,0.10084471917938401,3.3116585322094202E-2,1.0967082233955452E-6,1.0967082233955452E-6,6.0140290360054534E-2,7.2337090491833369E-6,7.2337090491833369E-6,6.4224443573739728E-2,2.3098763253196282E-3,1.0268178397303755E-3,8.1071760000000007E-2,0,8.4426395502012627E-2,0.17138240595533449,8.2241401398909404E-3,3.8065896000000002E-3,1.203983933387775E-2,0.25872000000000006,9.7999999999999997E-4,0.5544,0.49202999999999997,0.48905999999999994,0.55537999999999998,1.0113766016105259,1.0122671895007649,1.0122671895007649,0.59399999999999997,0.36980148999035328,5.8691766965462921,2.2406011046791892,null,36.980148999035329,0.10084471917938401,0.35518623483589046,0.25518159550201269,9.7417439333877781E-2,0.91142247032138091]
["Ipp",{"$f":"Iripple_Vinnom","v":0.11285865408726177},"A",null,null,null,61,28,1,0.183,0.183,2.3964285714285716E-2,0.12322772564556614,0.11479290451804915,0.24039645225902456,0.12560354774097543,0,0.18597612098682856,8.6467793943268735E-4,0.1,0.1008722191520485,3.3137857162277344E-2,1.0981175773074959E-6,1.0981175773074959E-6,6.1130057682641639E-2,7.473767904566189E-6,7.473767904566189E-6,6.5284698327306268E-2,2.3867714279849363E-3,1.0439314703925484E-3,8.1071760000000007E-2,0,8.452102227559237E-2,0.1741408215830513,8.4910072076536305E-3,3.8700327600000002E-3,1.2370703623147399E-2,0.26303200000000004,9.7999999999999997E-4,0.5544,0.49202999999999997,0.48905999999999994,0.55537999999999998,1.016140180805464,1.0170646067121969,1.0170646067121969,0.60389999999999999,0.37255594446623397,5.9368092723386248,2.2809390633323905,null,37.255594446623398,0.1008722191520485,0.35992372589873978,0.25812214227559238,9.9171263623147404E-2,0.91619238756014842]
["Top FET","Value","Units",null,null,null,62,28,1,0.18599999999999997,0.18599999999999997,2.4357142857142855E-2,0.12331561035884923,0.11486657592047081,0.24343328796023539,0.12856671203976455,0,0.18893260047428137,8.9238818804936073E-4,0.1,0.10090017322998342,3.3159124264287208E-2,1.0995275219744407E-6,1.0995275219744407E-6,6.2120875443734055E-2,7.7180063317918427E-6,7.7180063317918427E-6,6.6346181227357595E-2,2.4650168275338917E-3,1.0610451010547213E-3,8.1071760000000007E-2,0,8.4617011505456224E-2,0.17690028761571036,8.7622392923858931E-3,3.9334759199999994E-3,1.2705957815525203E-2,0.26734399999999997,9.7999999999999997E-4,0.5544,0.49202999999999997,0.48905999999999994,0.55537999999999998,1.0209099253290239,1.021868986023009,1.021868986023009,0.6137999999999999,0.37525930077845565,6.0044731846254926,2.3213779897570799,null,37.525930077845565,0.10090017322998342,0.36466696932098142,0.2610640515054562,0.10092947781552521,0.92096881279302556]
["Tr",{"$f":"(Qgd_Q1+Qgs_Q1/2)*(RdsonDRT+Rgate1)/(VCC-Vsp_Q1)*1000000000","v":8.8372799028536758E-2},"ns","Turn on of MOSFET -> Rise time of current",null,null,63,28,1,0.18899999999999997,0.18899999999999997,2.4749999999999998E-2,0.12340348999662401,0.11494023091080059,0.24647011545540026,0.13152988454459968,0,0.19189043242647352,9.2054845142047498E-4,0.1,0.10092858141970155,3.3180386628534238E-2,1.1009380568190136E-6,1.1009380568190136E-6,6.3112721992028775E-2,7.9664313544862245E-6,7.9664313544862245E-6,6.740886933223976E-2,2.5446151722045454E-3,1.0781587317168942E-3,8.1071760000000007E-2,0,8.4714365926318702E-2,0.17966074249030597,9.0378350698070518E-3,3.9969190799999995E-3,1.3045601317171428E-2,0.27165599999999995,9.7999999999999997E-4,0.5544,0.49202999999999997,0.48905999999999994,0.55537999999999998,1.0256858365051489,1.0266803370488649,1.0266803370488649,0.62369999999999992,0.37791288831959302,6.0721684963053306,2.3619178702949428,null,37.791288831959299,0.10092858141970155,0.36941596724349007,0.2640073259263187,0.10269208131717142,0.92575175562916334]
["Tf",{"$f":"(Qgd_Q1+Qgs_Q1/2)*(RdsonDRT2+Rgate1)/(Vsp_Q1)*1000000000","v":9.6839654025282801E-2},"ns","Turn off of MOSFET -> Fall time of current",null,null,64,{"$f":"Vin","v":28},{"$f":"MODE","v":1},0.192,{"$f":"Iout*G73/100/Number_of_Phases","v":0.192},{"$f":"Vout*K73/(Vin*Efficiency)","v":2.514285714285714E-2},{"$f":"(Vout+(Rdson2+Rs+Rdcr)*K73)/(Vin+(Rs+Rdson2-Rdson1)*K73)","v":0.12349136455933014},{"$f":"(Vin-(Rdson1+Rdcr)*K73-Vout)*M73/(Fsw*Lf)","v":0.11501386949046023},0.24950693474523011,0.13449306525476989,{"$f":"IF(MIN(Vin, -P73/(Coss_Q1+Coss_Q2)*0.00000002)<0, 0, MIN(Vin, -P73/(Coss_Q1+Coss_Q2)*0.00000002))","v":0},0.19484955525036246,{"$f":"R73^2*Rdcr","v":9.4915872953160144E-4},{"$f":"Core_Loss","v":0.1},{"$f":"(T73+S73*(1+Ltc*(Ta-25)))/(1-S73*Ltc*ThetaCa)","v":0.10095744372782176},3.3201644255428854E-2,1.1023491812640517E-6,1.1023491812640517E-6,6.4105576949822954E-2,8.2190499921393434E-6,8.2190499921393434E-6,6.8472741056060438E-2,{"$f":"Rdson1*AB73^2","v":2.6255691099289708E-3},{"$f":"(Vin*K73/2)*Fsw*(Tr_buck+Tf_buck)","v":1.0952723623790673E-3},{"$f":"(0.5*Coss_Q1*(Vin-Q73)^2-0.5*Coss_Q2*(Vin-Q73)^2+(Qoss_Q2*(Vin-Q73)/Vin)*Vin)*Fsw","v":8.1071760000000007E-2},{"$f":"IF(K73>N73/2,0,ABS(K73-N73/2)*Vsd_Q1*Deadtime*Fsw)","v":0},{"$f":"(AF73+AE73+AD73+AC73*(1+RdsonTopTc*Ta-RdsonTopTc*25))/(1-AC73*RdsonTopTc*ThetaJA_Q1)","v":8.4813088273779466E-2},{"$f":"SQRT((1-M73))*SQRT(K73^2+(N73^2)/12)","v":0.18242212835490584},{"$f":"Rdson2*AH73^2","v":9.3177932157894484E-3},{"$f":"IF(K73<N73/2,Deadtime*Fsw*Vsd_Q2*(K73+N73/2),2*Deadtime*Fsw*Vsd_Q2*K73)","v":4.0603622400000004E-3},{"$f":"(AJ73+AI73*(1+RdsonBotTc*Ta-RdsonBotTc*25))/(1-AI73*RdsonBotTc*ThetaJA_Q2)","v":1.3389633544757132E-2},{"$f":"Qrr_Q2*K73/Iout*Fsw*Vin","v":0.27596799999999999},{"$f":"Iq*Vin","v":9.7999999999999997E-4},{"$f":"IF(Ext_VCC=1,  (Qg_Q1+Qg_Q2)*Fsw*Vout, (Qg_Q1+Qg_Q2)*Fsw*Vin)","v":0.5544},{"$f":"(Vin-VCC)*Fsw*(Qg_Q1+Qg_Q2)","v":0.49202999999999997},{"$f":"(Qg_Q1+Qg_Q2)*Fsw*(Vin-Vout)","v":0.48905999999999994},0.55537999999999998,1.0304679156576291,{"$f":"U73 + ((AF73+AE73+AD73+AC73*(1+RdsonTC*(Ta-25))) + (AJ73+AI73*(1+RdsonTC*(Ta-25))) + AQ73 + AL73) / (1-AC73*RdsonTC*ThetaJA_Q1 -AI73*RdsonTC*ThetaJA_Q2)","v":1.0314986694295361},1.0314986694295361,{"$f":"Vout*K73","v":0.63359999999999994},0.38051799069485281,{"$f":"ThetaJA_Q1*BC73","v":6.1398952702969281},{"$f":"ThetaJA_Q2*BD73","v":2.4025586915294141},null,38.051799069485284,{"$f":"U73","v":0.10095744372782176},{"$f":"AG73+AK73+AL73","v":0.37417072181853661},{"$f":"AG73+AL73*0.66","v":0.26695196827377948},{"$f":"AK73+AL73*0.33","v":0.10445907354475713},0.93054122570171427]
["Part Power","Value","Units",null,null,null,65,28,1,{"$f":"Iout*G74/100","v":0.19500000000000001},0.19500000000000001,2.5535714285714287E-2,0.12357923404740728,0.11508749166087127,{"$f":"K74+N74/2","v":0.25254374583043565},{"$f":"K74-N74/2","v":0.13745625416956436},0,{"$f":"SQRT(K74^2+(N74^2)/12)","v":0.19780991101239745},9.7821902236831511E-4,0.1,0.10098676016106896,{"$f":"N74/SQRT(12)","v":3.3222897145381423E-2},{"$f":"RCoutEsr*V74^2","v":1.1037608947325932E-6},{"$f":"W74","v":1.1037608947325932E-6},{"$f":"SQRT(M74*(1-M74))*SQRT(K74^2+(N74^2)/12)","v":6.509942111918636E-2},{"$f":"RCinEsr*Y74^2","v":8.4758692601063351E-6},{"$f":"Z74","v":8.4758692601063351E-6},{"$f":"SQRT(M74)*SQRT(K74^2+(N74^2)/12)","v":6.9537776068804485E-2},2.7078812883333109E-3,1.1123859930412402E-3,8.1071760000000007E-2,0,8.4913181284329967E-2,0.18518439079505972,9.6021124063584724E-3,4.1238054000000005E-3,1.3738053925457865E-2,0.28027999999999997,9.7999999999999997E-4,0.5544,0.49202999999999997,0.48905999999999994,0.55537999999999998,{"$f":"SUM(S74,T74,AC74,AD74,AE74,AF74,AI74,AJ74,AQ74, AL74)","v":1.0352561641101015},1.0363239928289647,{"$f":"AS74","v":1.0363239928289647},0.64349999999999996,{"$f":"AU74/(AU74+AT74)","v":0.38307584767633418},6.2076535695395894,2.443300440285531,null,{"$f":"AV74*100","v":38.307584767633415},0.10098676016106896,0.37893123520978778,0.26989798128432996,0.10623045392545787,{"$f":"AS74-BA74","v":0.9353372326678957}]
["Power Dis",{"$f":"AQ9","v":0.55537999999999998},"W",null,null,null,66,28,1,0.19800000000000001,0.19800000000000001,2.5928571428571429E-2,0.12366709846129496,0.11516109742345505,0.25558054871172753,0.14041945128827249,0,0.20077144517248433,1.0077293299161972E-3,0.1,0.10101653072627423,3.324414529880225E-2,1.1051731966478758E-6,1.1051731966478758E-6,6.6094236396256861E-2,8.7368961696085713E-6,8.7368961696085713E-6,7.0603955205096297E-2,2.7915543547378172E-3,1.1294996237034133E-3,8.1071760000000007E-2,0,8.5014647695360365E-2,0.18794747858389757,9.8907913176925003E-3,4.1872485600000005E-3,1.4090861896947341E-2,0.28459200000000001,9.7999999999999997E-4,0.5544,0.49202999999999997,0.48905999999999994,{"$f":"SUM(AM75:AN75)","v":0.55537999999999998},1.0400505831860498,1.041156316935326,1.041156316935326,0.65339999999999998,0.38558765705804365,6.2754434569932886,2.4841431036297892,null,38.558765705804362,0.10101653072627423,0.38369750959230775,0.27284536769536039,0.10800622189694735,0.9401397862090517]
["Temp rise",{"$f":"B75*B62","v":12.77374},"°C",null,null,null,67,28,1,0.20099999999999998,0.20099999999999998,2.6321428571428569E-2,0.12375495780143271,0.11523468677963282,0.2586173433898164,0.14338265661018357,0,0.20373410634067465,1.0376896521608332E-3,0.1,0.10104675543037472,3.3265388716101608E-2,1.1065860864333402E-6,1.1065860864333402E-6,6.7090005692855295E-2,9.0021377277347121E-6,9.0021377277347121E-6,7.1671260380754373E-2,2.8765909561568998E-3,1.1466132543655858E-3,8.1071760000000007E-2,0,8.5117490245166294E-2,0.19071134345357499,1.0183828626122883E-2,4.2506917199999997E-3,1.4448056907391213E-2,0.28890399999999999,9.7999999999999997E-4,0.5544,0.49202999999999997,0.48905999999999994,0.55537999999999998,1.0448511742088062,1.0459956514610895,1.0459956514610895,0.66329999999999989,0.38805457641749536,6.3432649956388252,2.525086668869998,null,38.805457641749534,0.10104675543037472,0.38846954715255749,0.2757941302451663,0.10978637690739122,0.94494889603071486]
["Current (switching)",{"$f":"(Qg_Q1+Qg_Q2)*Fsw+Iq","v":1.9834999999999998E-2},"A",null,null,null,68,28,1,0.20399999999999999,0.20399999999999999,2.6714285714285711E-2,0.12384281206826001,0.11530825973082559,0.26165412986541281,0.14634587013458719,0,0.20669784605436173,1.0680999890878154E-3,0.1,0.10107743428041366,3.3286627397689721E-2,1.107999563512628E-6,1.107999563512628E-6,6.8086712864705939E-2,9.2716009374418266E-6,9.2716009374418266E-6,7.2739674516377348E-2,2.9629937392991693E-3,1.1637268850277589E-3,8.1071760000000007E-2,0,8.5221711672955752E-2,0.19347593988598194,1.0481223008133948E-2,4.3141348799999998E-3,1.4809638415440937E-2,0.29321599999999998,9.7999999999999997E-4,0.5544,0.49202999999999997,0.48905999999999994,0.55537999999999998,1.0496579385015488,1.0508420061430848,1.0508420061430848,0.67319999999999991,0.3904777247893394,6.4111182484779823,2.5661311235551412,null,39.047772478933936,0.10107743428041366,0.39324735008839667,0.27874427167295573,0.11157091841544092,0.94976457186267105]
["Qrr Current",{"$f":"Qrr_Q2*Fsw","v":1.5399999999999999E-2},"A",null,null,null,69,28,1,0.20699999999999999,0.20699999999999999,2.7107142857142854E-2,0.12393066126221623,0.11538181627845426,0.26469090813922713,0.14930909186077285,0,0.20966261857400709,1.0989603406827396E-3,0.1,0.10110856728354042,3.3307861343976758E-2,1.1094136273095813E-6,1.1094136273095813E-6,6.9084342645625574E-2,9.5452927975564006E-6,9.5452927975564006E-6,7.3809181467284227E-2,3.0507653505674769E-3,1.1808405156899316E-3,8.1071760000000007E-2,0,8.5327314718855934E-2,0.1962412249208588,1.0782973140362948E-2,4.3775780399999999E-3,1.5175605890227629E-2,0.29752800000000001,9.7999999999999997E-4,0.5544,0.49202999999999997,0.48905999999999994,0.55537999999999998,1.0544708773873031,1.0556953907425619,1.0556953907425619,0.68309999999999993,0.39285818425610064,6.4790032785336873,2.6072764554752355,null,39.285818425610067,0.10110856728354042,0.39803092060908357,0.28169579471885597,0.11335984589022763,0.95458682345902146]
["Diode Current",{"$f":"Deadtime*Fsw*(Iripple_Vinnom/2)*(Vsd_Q2)/Vin","v":2.1309850144770244E-5},null,null,null,null,70,28,1,0.21,0.21,2.75E-2,0.12401850538374078,0.11545535642393956,0.26772767821196974,0.15227232178803021,0,0.21262838069563583,1.1302707069312061E-3,0.1,0.10114015444701047,3.3329090555372851E-2,1.1108282772482438E-6,1.1108282772482438E-6,7.0082880587114371E-2,9.823220302775465E-6,9.823220302775465E-6,7.4879765959204828E-2,3.1399084360589627E-3,1.1979541463521047E-3,8.1071760000000007E-2,0,8.54343021239201E-2,0.19900715797966401,1.1089077699600026E-2,4.4410211999999999E-3,1.5545958811356024E-2,0.30184,9.7999999999999997E-4,0.5544,0.49202999999999997,0.48905999999999994,0.55537999999999998,1.0592899921889423,1.0605558150452563,1.0605558150452563,0.69299999999999995,0.39519700146078035,6.5469201488501625,2.6485226526611885,null,39.519700146078037,0.10114015444701047,0.40282026093527612,0.28464870212392013,0.11515315881135603,0.95941566059824579]
["Total",{"$f":"SUM(B77:B79)","v":3.5256309850144767E-2},"A",null,null,null,71,28,1,0.21299999999999999,0.21299999999999999,2.7892857142857143E-2,0.12410634443327294,0.11552888016870201,0.27076444008435102,0.155235559915649,0,0.21559509157852563,1.1620310878188214E-3,0.1,0.10117219577818538,3.3350315032288066E-2,1.1122435127528594E-6,1.1122435127528594E-6,7.1082313002840819E-2,1.0105390443667666E-5,1.0105390443667666E-5,7.5951413529180209E-2,3.2304256415651021E-3,1.2150677770142776E-3,8.1071760000000007E-2,0,8.5542676630134526E-2,0.20177370070371489,1.139953536278825E-2,4.50446436E-3,1.5920696668898563E-2,0.30615199999999998,9.7999999999999997E-4,0.5544,0.49202999999999997,0.48905999999999994,0.55537999999999998,1.0641152842291866,1.0654232888614528,1.0654232888614528,0.70289999999999997,0.3974951890457582,6.6148689224930939,2.6898697033846668,null,39.749518904575822,0.10117219577818538,0.40761537329903308,0.2876029966301345,0.11695085666889855,0.9642510930832674]
[null,null,null,null,null,null,72,28,1,0.21599999999999997,0.21599999999999997,2.8285714285714282E-2,0.12419417841125199,0.11560238751416206,0.27380119375708101,0.15819880624291893,0,0.21856271258668042,1.1942414833311969E-3,0.1,0.10120469128453291,3.3371534775132453E-2,1.1136593332478744E-6,1.1136593332478744E-6,7.2082626917567019E-2,1.0391810206674315E-5,1.0391810206674315E-5,7.7024110471190219E-2,3.3223196125717444E-3,1.2321814076764505E-3,8.1071760000000007E-2,0,8.5652440980425321E-2,0.20454081680527667,1.1714344807023529E-2,4.56790752E-3,1.6299818963389417E-2,0.31046399999999996,9.7999999999999997E-4,0.5544,0.49202999999999997,0.48905999999999994,0.55537999999999998,1.0689467548306029,1.0702978220260477,1.0702978220260477,0.71279999999999988,0.39975372702215506,6.6828496625497822,2.7313175961579566,null,39.975372702215509,0.10120469128453291,0.4124162599438147,0.29055868098042531,0.11875293896338941,0.96909313074151482]
[null,null,null,null,null,null,73,28,1,0.21899999999999997,0.21899999999999997,2.8678571428571425E-2,0.12428200731811713,0.11567587846173985,0.27683793923086991,0.16116206076913003,0,0.22153120714282654,1.2269018934539481E-3,0.1,0.10123764097362686,3.3392749784315973E-2,1.1150757381579344E-6,1.1150757381579344E-6,7.3083810020107984E-2,1.0682486574110473E-5,1.0682486574110473E-5,7.8097843786075247E-2,3.4155929942591592E-3,1.2492950383386236E-3,8.1071760000000007E-2,0,8.5763597918665418E-2,0.2073084719304151,1.2033504709554638E-2,4.6313506800000001E-3,1.668332520581868E-2,0.31477599999999994,9.7999999999999997E-4,0.5544,0.49202999999999997,0.48905999999999994,0.55537999999999998,1.0737844053156063,1.0751794243986155,1.0751794243986155,0.7226999999999999,0.40197356407354218,6.7508624321293027,2.7728663197338292,null,40.197356407354221,0.10123764097362686,0.41722292312448406,0.29351575791866535,0.12055940520581866,0.97394178342498861]
[null,null,null,null,null,null,74,28,1,0.222,0.222,2.9071428571428568E-2,0.12436983115430753,0.11574935301285551,0.27987467650642778,0.16412532349357226,0,0.22450054059379876,1.2600123181726972E-3,0.1,0.10127104485314721,3.3413960060248576E-2,1.1164927269078871E-6,1.1164927269078871E-6,7.4085850619960023E-2,1.0977426524166062E-5,1.0977426524166062E-5,7.9172601135363979E-2,3.5102484315020855E-3,1.2664086690007965E-3,8.1071760000000007E-2,0,8.5876150189681519E-2,0.21007663353254794,1.2357013747783165E-2,4.6947938400000002E-3,1.7071214917626584E-2,0.31908799999999998,9.7999999999999997E-4,0.5544,0.49202999999999997,0.48905999999999994,0.55537999999999998,1.0786282370064588,1.0800681058634709,1.0800681058634709,0.73259999999999992,0.40415561879764156,6.8189072943626741,2.8145158631054112,null,40.415561879764155,0.10127104485314721,0.4220353651073081,0.2964742301896815,0.12237025491762658,0.97879706101032371]
[null,null,null,null,null,null,75,28,1,0.22500000000000001,0.22500000000000001,2.9464285714285714E-2,0.1244576499202623,0.11582281116892894,0.28291140558446448,0.16708859441553553,0,0.22747068008629767,1.2935727574730695E-3,0.1,0.10130490293088004,3.3435165603340158E-2,1.1179102989227808E-6,1.1179102989227808E-6,7.5088737607269987E-2,1.1276637030906885E-5,1.1276637030906885E-5,8.024837079865775E-2,3.6062885688697651E-3,1.2835222996629694E-3,8.1071760000000007E-2,0,8.5990100539260927E-2,0.21284527075573917,1.2684870599263499E-2,4.7582370000000002E-3,1.7463487630697765E-2,0.32340000000000002,9.7999999999999997E-4,0.5544,0.49202999999999997,0.48905999999999994,0.55537999999999998,1.0834782512252694,1.0849638763297342,1.0849638763297342,0.74249999999999994,0.40630078088943228,6.8869843124030021,2.8562662155060492,null,40.630078088943229,0.10130490293088004,0.42685358816995872,0.29943410053926095,0.12418548763069778,0.98365897339885422]
[null,null,null,null,null,null,76,28,1,0.22800000000000001,0.22800000000000001,2.9857142857142856E-2,0.12454546361642047,0.11589625293137981,0.2859481264656899,0.17005187353431012,0,0.23044159445210377,1.3275832113406967E-3,0.1,0.10133921521471764,3.3456366414000543E-2,1.1193284536278636E-6,1.1193284536278636E-6,7.6092460415851076E-2,1.1580125064275726E-5,1.1580125064275726E-5,8.1325141634258066E-2,3.7037160506259957E-3,1.3006359303251423E-3,8.1071760000000007E-2,0,8.6105451714158676E-2,0.21561435432687623,1.3017073941702807E-2,4.8216801600000003E-3,1.7860142887355622E-2,0.327712,9.7999999999999997E-4,0.5544,0.49202999999999997,0.48905999999999994,0.55537999999999998,1.0883344492939946,1.0898667457313969,1.0898667457313969,0.75239999999999996,0.40840991226886109,6.9550935494256505,2.8981173664091799,null,40.840991226886111,0.10133921521471764,0.43167759460151434,0.3023953717141587,0.12600510288735564,0.98852753051667919]
[null,null,null,null,null,null,77,28,1,0.23099999999999998,0.23099999999999998,3.0249999999999996E-2,0.12463327224322107,0.11596967830162776,0.28898483915081385,0.17301516084918611,0,0.23341325410192237,1.3620436797612146E-3,0.1,0.10137398171265834,3.3477562492639543E-2,1.1207471904485861E-6,1.1207471904485861E-6,7.7097008988979046E-2,1.1887897590093433E-5,1.1887897590093433E-5,8.240290304275405E-2,3.8025335207291741E-3,1.3177495609873152E-3,8.1071760000000007E-2,0,8.622220646210442E-2,0.21838385645595476,1.3353622452961017E-2,4.8851233200000004E-3,1.8261180240356733E-2,0.33202399999999999,9.7999999999999997E-4,0.5544,0.49202999999999997,0.48905999999999994,0.55537999999999998,1.0931968325344386,1.0947767240273854,1.0947767240273854,0.76229999999999987,0.4104838481561619,7.0232350686284013,2.9400693055282048,null,41.048384815616188,0.10137398171265834,0.43650738670246114,0.3053580464621044,0.12782910024035674,0.99340274231472703]
[null,null,null,null,null,null,78,28,1,0.23399999999999999,0.23399999999999999,3.0642857142857138E-2,0.12472107580110309,0.11604308728109214,0.29202154364054606,0.17597845635945392,0,0.23638563092711576,1.3969541627202647E-3,0.1,0.1014092024328067,3.3498753839666891E-2,1.1221665088105973E-6,1.1221665088105973E-6,7.8102373747729228E-2,1.2199961570059967E-5,1.2199961570059967E-5,8.3481644933314683E-2,3.9027436228323341E-3,1.3348631916494881E-3,8.1071760000000007E-2,0,8.6340367531809389E-2,0.22115375074377228,1.3694514811050797E-2,4.9485664800000004E-3,1.8666599252885333E-2,0.33633600000000002,9.7999999999999997E-4,0.5544,0.49202999999999997,0.48905999999999994,0.55537999999999998,1.0980654022682528,1.0996938212016274,1.0996938212016274,0.77219999999999989,0.4125233980976018,7.0914089332316168,2.982122022816363,null,41.25233980976018,0.1014092024328067,0.44134296678469476,0.30832212753180943,0.12965747925288534,0.99828461876882069]
[null,null,null,null,null,null,79,28,1,0.23699999999999999,0.23699999999999999,3.1035714285714285E-2,0.12480887429050537,0.11611647987119225,0.2950582399355961,0.17894176006440388,0,0.23935869820865033,1.4323146602034937E-3,0.1,0.10144487738337341,3.3519940455492309E-2,1.1235864081397498E-6,1.1235864081397498E-6,7.9108545561638002E-2,1.2516323961755512E-5,1.2516323961755512E-5,8.4561357692455652E-2,4.0043490002832005E-3,1.351976822311661E-3,8.1071760000000007E-2,0,8.6459937672973511E-2,0.22392401209639917,1.4039749694137531E-2,5.0120096400000005E-3,1.9076399498547829E-2,0.34064800000000001,9.7999999999999997E-4,0.5544,0.49202999999999997,0.48905999999999994,0.55537999999999998,1.1029401598169359,1.1046180472631169,1.1046180472631169,0.78209999999999991,0.41452934694429744,7.1596152064783913,3.0242755084665998,null,41.452934694429743,0.10144487738337341,0.44618433717152134,0.31128761767297353,0.13149023949854782,1.0031731698797435]
[null,null,null,null,null,null,80,28,1,0.24,0.24,3.1428571428571424E-2,0.1248966677118668,0.11618985607334711,0.29809492803667353,0.18190507196332645,0,0.24233243053265094,1.4681251721965524E-3,0.1,0.10148100657267529,3.354112234052542E-2,1.1250068878620935E-6,1.1250068878620935E-6,8.0115515721492794E-2,1.2836991718641519E-5,1.2836991718641519E-5,8.5642032155072087E-2,4.1073522961242248E-3,1.3690904529738341E-3,8.1071760000000007E-2,0,8.6580919636292386E-2,0.22669461664585619,1.4389325780539277E-2,5.0754528000000005E-3,1.9490580561367418E-2,0.34496000000000004,9.7999999999999997E-4,0.5544,0.49202999999999997,0.48905999999999994,0.55537999999999998,1.107821106501834,1.1095494122459799,1.1095494122459799,0.79199999999999993,0.41650245578659134,7.2278539516347253,3.0665297529114515,null,41.650245578659131,0.10148100657267529,0.45103150019765986,0.31425451963629242,0.13332738056136745,1.0080684056733047]
[null,null,null,null,null,null,81,28,1,0.24299999999999999,0.24299999999999999,3.182142857142857E-2,0.12498445606562622,0.1162632158889757,0.30113160794448784,0.18486839205551214,0,0.24530680371201261,1.5043856986850972E-3,0.1,0.10151759000913539,3.3562299495175849E-2,1.126427947403881E-6,1.126427947403881E-6,8.1123275914073423E-2,1.3161971790061771E-5,1.3161971790061771E-5,8.6723659577548712E-2,4.211756153092632E-3,1.386204083636007E-3,8.1071760000000007E-2,0,8.6703316173464259E-2,0.22946554167648206,1.4743241748726772E-2,5.1388959600000006E-3,1.9909142035778749E-2,0.34927199999999997,9.7999999999999997E-4,0.5544,0.49202999999999997,0.48905999999999994,0.55537999999999998,1.1127082436441404,1.1144879262095408,1.1144879262095408,0.80189999999999995,0.41844346284632089,7.2961252319896781,3.1088847468229113,null,41.844346284632088,0.10151759000913539,0.45588445820924295,0.31722283617346425,0.13516890203577875,1.0129703362004054]
[null,null,null,null,null,null,82,28,1,0.24599999999999997,0.24599999999999997,3.2214285714285709E-2,0.12507223935222231,0.11633655931949667,0.3041682796597483,0.18783172034025164,0,0.24828179471357045,1.5410962396547887E-3,0.1,0.10155462770128286,3.3583471919853135E-2,1.127849586191564E-6,1.127849586191564E-6,8.2131818198684342E-2,1.3491271121243472E-5,1.3491271121243472E-5,8.7806231612776425E-2,4.3175632136204616E-3,1.4033177142981797E-3,8.1071760000000007E-2,0,8.6827130037197192E-2,0.23223676555652209,1.5101496277323403E-2,5.2023391199999998E-3,2.0332083526622653E-2,0.3535839999999999,9.7999999999999997E-4,0.5544,0.49202999999999997,0.48905999999999994,0.55537999999999998,1.1176015725648969,1.1194335992383879,1.1194335992383879,0.81179999999999986,0.42035308432918,7.364429110855534,3.1513404811123205,null,42.035308432918001,0.10155462770128286,0.46074321356381975,0.32019257003719714,0.13701480352662262,1.017878971537105]
[null,null,null,null,null,null,83,28,1,0.249,0.249,3.2607142857142855E-2,0.12516001757209386,0.11640988636632874,0.30720494318316438,0.19079505681683562,0,0.25125738159037597,1.578256795091295E-3,0.1,0.10159211965775304,3.3604639614966826E-2,1.1292718036517978E-6,1.1292718036517978E-6,8.3141134985331946E-2,1.3824896653298375E-5,1.3824896653298375E-5,8.8889740286920191E-2,4.4247761198346293E-3,1.4204313449603526E-3,8.1071760000000007E-2,0,8.6952363981216058E-2,0.23500826767451327,1.5464088045105191E-2,5.2657822800000007E-3,2.0759404649140951E-2,0.35789599999999994,9.7999999999999997E-4,0.5544,0.49202999999999997,0.48905999999999994,0.55537999999999998,1.1225010945849914,1.1243864414424405,1.1243864414424405,0.82169999999999999,0.42223201523923848,7.4327656515679692,3.1938969469302414,null,42.223201523923848,0.10159211965775304,0.46560776863035691,0.32316372398121607,0.13886508464914094,1.0227943217846875]
[null,null,null,null,null,null,84,28,1,0.252,0.252,3.3000000000000002E-2,0.12524779072567946,0.11648319703089025,0.31024159851544514,0.19375840148455487,0,0.25423354341866738,1.615867364980286E-3,0.1,0.10163006588728746,3.3625802580926352E-2,1.1306945992114334E-6,1.1306945992114334E-6,8.41512190144139E-2,1.416285532322371E-5,1.416285532322371E-5,8.9974177977796707E-2,4.5333975135569337E-3,1.4375449756225257E-3,8.1071760000000007E-2,0,8.7079020760269632E-2,0.23778002838007903,1.5831015731000733E-2,5.3292254400000008E-3,2.1191105028971261E-2,0.36220799999999997,9.7999999999999997E-4,0.5544,0.49202999999999997,0.48905999999999994,0.55537999999999998,1.1274068110251605,1.1293464629570162,1.1293464629570162,0.83160000000000001,0.42408093015756576,7.5011349174862012,3.2365541356663385,null,42.408093015756577,0.10163006588728746,0.47047812578924086,0.32613630076026962,0.14071974502897125,1.0277163970697287]
[null,null,null,null,null,null,85,28,1,0.255,0.255,3.3392857142857141E-2,0.12533555881341771,0.11655649131459946,0.31327824565729973,0.19672175434270028,0,0.25721026023916216,1.6539279493074381E-3,0.1,0.10166846639873384,3.3646960818141142E-2,1.1321179722975253E-6,1.1321179722975253E-6,8.5162063337801436E-2,1.4505154063903407E-5,1.4505154063903407E-5,9.1059537394734824E-2,4.6434300363041425E-3,1.4546586062846988E-3,8.1071760000000007E-2,0,8.7207103130137784E-2,0.24055202892878375,1.6202278014091236E-2,5.3926686000000008E-3,2.1627184302141965E-2,0.36652000000000001,9.7999999999999997E-4,0.5544,0.49202999999999997,0.48905999999999994,0.55537999999999998,1.1323187232059875,1.1343136739428958,1.1343136739428958,0.84149999999999991,0.42590048398679148,7.5695369719931689,3.2793120389492652,null,42.590048398679144,0.10166846639873384,0.47535428743227975,0.32911030313013778,0.14257878430214196,1.0326452075441619]
[null,null,null,null,null,null,86,28,1,0.25800000000000001,0.25800000000000001,3.3785714285714287E-2,0.1254233218357472,0.11662976921887448,0.31631488460943724,0.19968511539056277,0,0.2601875130023294,1.6924385480584334E-3,0.1,0.10170732120104606,3.3668114327020555E-2,1.1335419223373269E-6,1.1335419223373269E-6,8.6173661301203519E-2,1.4851799804109083E-5,1.4851799804109083E-5,9.2145811559800714E-2,4.7548763292880099E-3,1.4717722369468715E-3,8.1071760000000007E-2,0,8.7336613847638397E-2,0.2433242514307257,1.6577873573610447E-2,5.4561117600000009E-3,2.2067642115067163E-2,0.37083199999999999,9.7999999999999997E-4,0.5544,0.49202999999999997,0.48905999999999994,0.55537999999999998,1.1372368324479039,1.1392880845863922,1.1392880845863922,0.85139999999999993,0.42769131266332788,7.6379718784956836,3.3221706486465448,null,42.769131266332785,0.10170732120104606,0.48023625596270558,0.3320857338476384,0.14444220211506717,1.0375807633853462]
[null,null,null,null,null,null,87,28,1,0.26099999999999995,0.26099999999999995,3.4178571428571426E-2,0.12551107979310641,0.11670303074513323,0.31935151537256656,0.20264848462743335,0,0.26316528351733304,1.7313991612189572E-3,0.1,0.10174663030328424,3.3689263107973925E-2,1.1349664487582929E-6,1.1349664487582929E-6,8.7186006527713897E-2,1.520279946850114E-5,1.520279946850114E-5,9.3232993790282215E-2,4.8677390334153298E-3,1.4888858676090444E-3,8.1071760000000007E-2,0,8.7467555670634772E-2,0.24609667880257846,1.6957801088944652E-2,5.5195549199999992E-3,2.251247812454173E-2,0.37514399999999992,9.7999999999999997E-4,0.5544,0.49202999999999997,0.48905999999999994,0.55537999999999998,1.142161140071188,1.1442697050994184,1.1442697050994184,0.86129999999999984,0.42945403383888081,7.7064397004245988,3.3651299568644593,null,42.945403383888078,0.10174663030328424,0.48512403379517643,0.33506259567063473,0.14630999812454171,1.0425230747961343]
[null,null,null,null,null,null,88,28,1,0.26400000000000001,0.26400000000000001,3.4571428571428572E-2,0.1255988326859338,0.11677627589479352,0.32238813794739679,0.20561186205260326,0,0.26614355440436294,1.7708097887747026E-3,0.1,0.10178639371461462,3.3710407161410522E-2,1.1363915509880778E-6,1.1363915509880778E-6,8.8199092902449497E-2,1.5558159977629836E-5,1.5558159977629836E-5,9.4321077682335178E-2,4.9820207892879798E-3,1.5059994982712175E-3,8.1071760000000007E-2,0,8.759993135804249E-2,0.24886929472281424,1.7342059239632675E-2,5.582998080000001E-3,2.2961691997736434E-2,0.37945600000000002,9.7999999999999997E-4,0.5544,0.49202999999999997,0.48905999999999994,0.55537999999999998,1.1470916473959667,1.1492585457195534,1.1492585457195534,0.87119999999999997,0.43118924753278526,7.7749405012349788,3.4081899559479383,null,43.118924753278527,0.10178639371461462,0.49001762335577892,0.33804089135804255,0.14818217199773645,1.0474721520049388]
[null,null,null,null,null,null,89,28,1,0.26700000000000002,0.26700000000000002,3.4964285714285712E-2,0.12568658051466777,0.11684950466927292,0.32542475233463647,0.20857524766536356,0,0.26912230905009443,1.8106704307113636E-3,0.1,0.10182661144430975,3.3731546487739579E-2,1.1378172284545363E-6,1.1378172284545363E-6,8.9212914558197048E-2,1.5917888247936335E-5,1.5917888247936335E-5,9.5410057095702855E-2,5.0977242372029566E-3,1.5231131289333904E-3,8.1071760000000007E-2,0,8.7733743669836772E-2,0.25164208358986628,1.7730646705365793E-2,5.6464412400000011E-3,2.3415283412193053E-2,0.38376800000000005,9.7999999999999997E-4,0.5544,0.49202999999999997,0.48905999999999994,0.55537999999999998,1.1520283557422135,1.1542546167101111,1.1542546167101111,0.88109999999999999,0.43289753675660936,7.8434743444062471,3.4513506384804407,null,43.289753675660933,0.10182661144430975,0.49491702708202989,0.34102062366983682,0.15005872341219306,1.0524280052658013]
[null,null,null,null,null,null,90,28,1,0.27,0.27,3.5357142857142858E-2,0.12577432327974666,0.11692271706998887,0.32846135853499447,0.21153864146500559,0,0.27210153156604194,1.8509810870146429E-3,0.1,0.10186728350174828,3.3752681087370263E-2,1.1392434805857224E-6,1.1392434805857224E-6,9.0227465861991846E-2,1.6281991191753805E-5,1.6281991191753805E-5,9.6499926139428024E-2,5.2148520171524364E-3,1.5402267595955635E-3,8.1071760000000007E-2,0,8.7868995367059624E-2,0.25441503048300951,1.8123562165987785E-2,5.7098844000000011E-3,2.3873252055819676E-2,0.38808000000000004,9.7999999999999997E-4,0.5544,0.49202999999999997,0.48905999999999994,0.55537999999999998,1.1569712664297505,1.1592579283602078,1.1592579283602078,0.89100000000000001,0.43457946811239506,7.9120412934423721,3.4946119972838527,null,43.457946811239509,0.10186728350174828,0.49982224742287934,0.34400179536705966,0.15193965205581969,1.0573906448584596]
[null,null,null,null,null,null,91,28,1,0.27300000000000002,0.27300000000000002,3.5750000000000004E-2,0.12586206098160876,0.11699591309835866,0.33149795654917935,0.21450204345082069,0,0.27508120674958858,1.8917417576702475E-3,0.1,0.10190840989641517,3.377381096071172E-2,1.1406703068098912E-6,1.1406703068098912E-6,9.1242741402558961E-2,1.6650475717308497E-5,1.6650475717308497E-5,9.7590679158482851E-2,5.3334067688238064E-3,1.5573403902577362E-3,8.1071760000000007E-2,0,8.8005689211826985E-2,0.2571881211257549,1.8520804301494873E-2,5.7733275600000012E-3,2.433559762688596E-2,0.39239200000000007,9.7999999999999997E-4,0.5544,0.49202999999999997,0.48905999999999994,0.55537999999999998,1.1619203807782468,1.1642684909848322,1.1642684909848322,0.90090000000000003,0.43623559236582249,7.9806414118720221,3.5379740254183774,null,43.623559236582246,0.10190840989641517,0.50473328683871299,0.34698440921182705,0.15382495762688597,1.0623600810884171]
[null,null,null,null,null,null,92,28,1,0.27599999999999997,0.27599999999999997,3.6142857142857136E-2,0.12594979362069236,0.11706909275579939,0.33453454637789964,0.21746545362210026,0,0.27806132004749506,1.9329524426638873E-3,0.1,0.10194999063790151,3.3794936108173024E-2,1.1420977065554967E-6,1.1420977065554967E-6,9.2258735978553136E-2,1.7023348728720752E-5,1.7023348728720752E-5,9.8682310721249278E-2,5.453391131599707E-3,1.5744540209199087E-3,8.1071760000000007E-2,0,8.8143827967335914E-2,0.25996134185157277,1.8922371792035677E-2,5.8367707199999995E-3,2.4802319834018469E-2,0.39670399999999989,9.7999999999999997E-4,0.5544,0.49202999999999997,0.48905999999999994,0.55537999999999998,1.166875700107219,1.1692863149249124,1.1692863149249124,0.91079999999999983,0.43786644499551841,8.0492747632487234,3.5814367161824245,null,43.786644499551841,0.10194999063790151,0.50965014780135431,0.34996846796733583,0.15571463983401845,1.0673363242870109]
[null,null,null,null,null,null,93,28,1,0.27899999999999997,0.27899999999999997,3.6535714285714282E-2,0.12603752119743561,0.11714225604372802,0.33757112802186395,0.22042887197813596,0,0.28104185752170646,1.9746131419812788E-3,0.1,0.1019920257359047,3.3816056530163223E-2,1.1435256792511948E-6,1.1435256792511948E-6,9.3275444587539072E-2,1.7400617126006143E-5,1.7400617126006143E-5,9.9774815607787601E-2,5.574807744558089E-3,1.591567651582082E-3,8.1071760000000007E-2,0,8.8283414397871893E-2,0.26273467957177471,1.9328263317911279E-2,5.9002138799999996E-3,2.5273418396196175E-2,0.40101599999999993,9.7999999999999997E-4,0.5544,0.49202999999999997,0.48905999999999994,0.55537999999999998,1.1718372257360326,1.1743114105473853,1.1743114105473853,0.92069999999999985,0.43947254671965685,8.1179414111510528,3.6250000631125117,null,43.947254671965688,0.1019920257359047,0.51457283279406796,0.35295397439787185,0.15760869839619615,1.0723193848114807]
[null,null,null,null,null,null,94,28,1,0.28199999999999997,0.28199999999999997,3.6928571428571422E-2,0.12612524371227668,0.11721540296356134,0.34060770148178066,0.22339229851821929,0,0.28402280581728967,2.0167238556081462E-3,0.1,0.10203451520022835,3.3837172227091303E-2,1.144954224325839E-6,1.144954224325839E-6,9.4292862415658318E-2,1.7782287805076538E-5,1.7782287805076538E-5,0.10086818879883581,5.6976592464722496E-3,1.6086812822442547E-3,8.1071760000000007E-2,0,8.8424451268816026E-2,0.2655081217453964,1.9738477559575106E-2,5.9636570399999997E-3,2.5748893042745854E-2,0.40532799999999991,9.7999999999999997E-4,0.5544,0.49202999999999997,0.48905999999999994,0.55537999999999998,1.1768049589838996,1.1793437882452671,1.1793437882452671,0.93059999999999987,0.44105440400093915,8.1866414191827683,3.6686640599831541,null,44.105440400093912,0.10203451520022835,0.51950134431156181,0.35594093126881599,0.15950713304274583,1.0773092730450387]
[null,null,null,null,null,null,95,28,1,0.28499999999999998,0.28499999999999998,3.7321428571428568E-2,0.12621296116565367,0.11728853351671598,0.34364426675835796,0.22635573324164199,0,0.28700415213234892,2.0592845835302122E-3,0.1,0.10207745904078225,3.3858283199366207E-2,1.146383341208484E-6,1.146383341208484E-6,9.5310984827933362E-2,1.8168367657741091E-5,1.8168367657741091E-5,0.10196242546548763,5.8219482758108685E-3,1.6257949129064278E-3,8.1071760000000007E-2,0,8.8566941346652259E-2,0.26828165635093909,2.0153013197632949E-2,6.0271001999999997E-3,2.6228743513337656E-2,0.40964,9.7999999999999997E-4,0.5544,0.49202999999999997,0.48905999999999994,0.55537999999999998,1.1817789011698805,1.1843834584377193,1.1843834584377193,0.94049999999999989,0.44261250953098613,8.2553748509730021,3.712428700806766,null,44.26125095309861,0.10207745904078225,0.52443568485998993,0.35892934134665228,0.16140994351333765,1.0823059993969371]
[null,null,null,null,null,null,96,28,1,0.28799999999999998,0.28799999999999998,{"$f":"Vout*K105/(Vin*Efficiency)","v":3.7714285714285714E-2},0.12630067355800462,{"$f":"(Vin-(Rdson1+Rdcr)*K105-Vout)*M105/(Fsw*Lf)","v":0.11736164770460837},0.34668082385230414,0.22931917614769579,{"$f":"IF(MIN(Vin, -P105/(Coss_Q1+Coss_Q2)*0.00000002)<0, 0, MIN(Vin, -P105/(Coss_Q1+Coss_Q2)*0.00000002))","v":0},0.28998588418977977,{"$f":"R105^2*Rdcr","v":2.1022953257332092E-3},0.1,{"$f":"(T105+S105*(1+Ltc*(Ta-25)))/(1-S105*Ltc*ThetaCa)","v":0.10212085726758247},3.3879389447396838E-2,1.1478130293283843E-6,1.1478130293283843E-6,9.6329807359164285E-2,1.8558863571707403E-5,1.8558863571707403E-5,0.10305752095950088,{"$f":"Rdson1*AB105^2","v":5.9476774707380598E-3},1.6429085435686007E-3,8.1071760000000007E-2,0,{"$f":"(AF105+AE105+AD105+AC105*(1+RdsonTopTc*Ta-RdsonTopTc*25))/(1-AC105*RdsonTopTc*ThetaJA_Q1)","v":8.8710887398974744E-2},0.27105527185983752,{"$f":"Rdson2*AH105^2","v":2.0571868912842923E-2},6.0905433599999998E-3,{"$f":"(AJ105+AI105*(1+RdsonBotTc*Ta-RdsonBotTc*25))/(1-AI105*RdsonBotTc*ThetaJA_Q2)","v":2.671296955798072E-2},0.41395199999999999,9.7999999999999997E-4,0.5544,0.49202999999999997,0.48905999999999994,0.55537999999999998,1.1867590536128829,1.1894304315701225,1.1894304315701225,0.95039999999999991,0.44414734269510975,8.3241417701764195,3.7562939798335568,null,44.414734269510973,0.10212085726758247,0.52937585695695544,0.36191920739897476,0.16331712955798072,1.08730957430254]
[null,null,null,null,null,null,97,28,1,0.29099999999999998,0.29099999999999998,3.8107142857142853E-2,0.12638838088976753,0.11743474552865485,0.34971737276432741,0.23228262723567256,0,0.292967990210731,2.1457560822028747E-3,0.1,0.10216470989075137,3.3900490971592041E-2,1.1492432881149937E-6,1.1492432881149937E-6,9.7349325705375481E-2,1.895378243058256E-5,1.895378243058256E-5,0.10415347080419206,6.0748494691134254E-3,1.6600221742307738E-3,8.1071760000000007E-2,0,8.8856292194494993E-2,0.27382895721153244,2.0995043386115474E-2,6.1539865199999998E-3,2.7201570937018849E-2,0.41826399999999997,9.7999999999999997E-4,0.5544,0.49202999999999997,0.48905999999999994,0.55537999999999998,1.1917454176316624,1.1944847181141443,1.1944847181141443,0.96029999999999993,0.44565937001838829,8.3929422404733849,3.8002598915514341,null,44.565937001838826,0.10216470989075137,0.53432186313151386,0.36491053219449499,0.16522869093701886,1.0923200082233928]
[null,null,null,null,null,null,98,28,1,0.29399999999999998,0.29399999999999998,3.8499999999999993E-2,0.12647608316138034,0.11750782699027151,0.35275391349513574,0.23524608650486423,0,0.29595045888965599,2.1896668529249488E-3,0.1,0.10220901692051751,3.3921587772360616E-2,1.1506741169979653E-6,1.1506741169979653E-6,9.8369535715774767E-2,1.9353131113874179E-5,1.9353131113874179E-5,0.10525027068587593,6.2034669084920875E-3,1.6771358048929467E-3,8.1071760000000007E-2,0,8.9003158503049337E-2,0.27660270179003638,2.1422535298513387E-2,6.2174296799999999E-3,2.7694547421126287E-2,0.42257599999999995,9.7999999999999997E-4,0.5544,0.49202999999999997,0.48905999999999994,0.55537999999999998,1.1967379945448233,1.1995463285678083,1.1995463285678083,0.97019999999999984,0.44714904559391655,8.4617763255701348,3.8443264306859048,null,44.714904559391655,0.10220901692051751,0.53927370592417556,0.36790331850304936,0.16714462742112629,1.0973373116472909]
[null,null,null,null,null,null,99,28,1,0.29699999999999999,0.29699999999999999,3.8892857142857139E-2,0.12656378037328095,0.11758089209087437,0.35579044604543719,0.23820955395456281,0,0.29893327937084413,2.2340276378851787E-3,0.1,0.10225377836721572,3.3942679850111332E-2,1.1521055154071539E-6,1.1521055154071539E-6,9.9390433385189297E-2,1.9756916496991504E-5,1.9756916496991504E-5,0.10634791644581276,6.3335324261247217E-3,1.6942494355551192E-3,8.1071760000000007E-2,0,8.9151489095606079E-2,0.27937649540188875,2.1854343331251642E-2,6.28087284E-3,2.8191898791303387E-2,0.42688799999999999,9.7999999999999997E-4,0.5544,0.49202999999999997,0.48905999999999994,0.55537999999999998,1.2017367856708165,1.2046152734555677,1.2046152734555677,0.98009999999999986,0.4486168114940553,8.5306440891989403,3.8884935921999779,null,44.861681149405527,0.10225377836721572,0.5442313878869095,0.37089756909560612,0.16906493879130338,1.102361495088352]
[null,null,null,null,null,null,100,28,1,0.3,0.3,3.9285714285714285E-2,0.12665147252590719,0.1176539408318792,0.35882697041593958,0.24117302958406039,0,0.30191644122633104,2.2788384370693152E-3,0.1,0.10229899424128713,3.3963767205252883E-2,1.1535374827726112E-6,1.1535374827726112E-6,0.10041201484694559,2.0165145451246443E-5,2.0165145451246443E-5,0.10744640407262883,6.4650486589576334E-3,1.7113630662172925E-3,8.1071760000000007E-2,0,8.9301286744272984E-2,0.28215032825540715,2.2290466165697524E-2,6.344316E-3,2.8693624838872597E-2,0.43119999999999997,9.7999999999999997E-4,0.5544,0.49202999999999997,0.48905999999999994,0.55537999999999998,1.2067417923279418,1.2096915633283722,1.2096915633283722,0.98999999999999988,0.45006309816546392,8.5995455951182791,3.9327613712940694,null,45.006309816546391,0.10229899424128713,0.5491949115831456,0.37389328674427302,0.17098962483887259,1.1073925690870852]

{"sheet":"Efficiency Plot Management","index":9,"n_rows":3,"n_cols":1,"rows_kept":3,"cut":false,"hidden":true,"merged":[]}
[]
[{"$f":"\"EFF_Ch1\"","v":"EFF_Ch1"}]
[{"$f":"\"EFF_Ch2\"","v":"EFF_Ch2"}]

{"sheet":"Standard Value Calculator","index":10,"n_rows":159,"n_cols":16,"rows_kept":159,"cut":false,"hidden":true,"merged":[]}
[]
["Capacitors","Css","Cc1ea","Cc2ea","Cout","Cin","Cres","Cdither","Cc3ea","Cc4ea"]
["Inputs",{"$f":"Css","v":{"$error":"#NAME?"}},{"$f":"Cc1ea","v":2.4754196504072628E-11},{"$f":"Cc2ea","v":-3.3794117679831437E-13},{"$f":"Cout","v":2.1999999999999999E-5},{"$f":"Cin","v":2.0000000000000002E-5},{"$f":"Cres","v":{"$error":"#NAME?"}},{"$f":"Cdither_init","v":{"$error":"#NAME?"}},{"$f":"Cc3ea","v":{"$error":"#NAME?"}},{"$f":"Cc4ea","v":{"$error":"#NAME?"}},null,null,"Resistors","inputs","Standard Result"]
["Standard Result",{"$f":"SUM(B6:B158)/1000000000000","v":{"$error":"#NAME?"}},{"$f":"IF(C3=\"OPEN\",\"OPEN\",SUM(C6:C158)/1000000000000)","v":2.7E-11},{"$f":"SUM(D6:D158)/1000000000000","v":0},{"$f":"SUM(E6:E158)/1000000000000","v":2.1999999999999999E-5},{"$f":"SUM(F6:F158)/1000000000000","v":2.1999999999999999E-5},{"$f":"SUM(G6:G158)/1000000000000","v":{"$error":"#NAME?"}},{"$f":"IF(H3=\"OPEN\",\"OPEN\",SUM(H6:H158)/1000000000000)","v":{"$error":"#NAME?"}},{"$error":"#NAME?"},{"$error":"#NAME?"},null,null,"Rt",{"$f":"Rfadj","v":7.15},{"$f":"IF(N4>(INT(0.5+100*POWER(10,IF(96*(LOG(N4)-INT(LOG(N4)))-ROUND(96*(LOG(N4)-INT(LOG(N4))),0)<0,ROUND(96*(LOG(N4)-INT(LOG(N4))),0)-1,ROUND(96*(LOG(N4)-INT(LOG(N4))),0))/96))*POWER(10,INT(LOG(N4))-2)+INT(0.5+100*POWER(10,(IF(96*(LOG(N4)-INT(LOG(N4)))-ROUND(96*(LOG(N4)-INT(LOG(N4))),0)<0,ROUND(96*(LOG(N4)-INT(LOG(N4))),0)-1,ROUND(96*(LOG(N4)-INT(LOG(N4))),0))+1)/96))*POWER(10,INT(LOG(N4))-2))/2,INT(0.5+100*POWER(10,(IF(96*(LOG(N4)-INT(LOG(N4)))-ROUND(96*(LOG(N4)-INT(LOG(N4))),0)<0,ROUND(96*(LOG(N4)-INT(LOG(N4))),0)-1,ROUND(96*(LOG(N4)-INT(LOG(N4))),0))+1)/96))*POWER(10,INT(LOG(N4))-2),INT(0.5+100*POWER(10,IF(96*(LOG(N4)-INT(LOG(N4)))-ROUND(96*(LOG(N4)-INT(LOG(N4))),0)<0,ROUND(96*(LOG(N4)-INT(LOG(N4))),0)-1,ROUND(96*(LOG(N4)-INT(LOG(N4))),0))/96))*POWER(10,INT(LOG(N4))-2))","v":7.15},"Ω"]
["(pF)"]
[0.47,{"$f":"IF(IF((B$3*10^12-$A7)*(B$3*10^12-$A6)*-1<0,0,1)*IF(ABS(B$3*10^12-$A7)>(B$3*10^12-$A6),$A6,$A7)=B7,0,IF((B$3*10^12-$A7)*(B$3*10^12-$A6)*-1<0,0,1)*IF(ABS(B$3*10^12-$A7)>(B$3*10^12-$A6),$A6,$A7))","v":{"$error":"#NAME?"}},0,0,0,0,{"$error":"#NAME?"},{"$error":"#NAME?"},{"$error":"#NAME?"},{"$error":"#NAME?"}]
[0.56000000000000005,{"$f":"IF(IF((B$3*10^12-$A8)*(B$3*10^12-$A7)*-1<0,0,1)*IF(ABS(B$3*10^12-$A8)>(B$3*10^12-$A7),$A7,$A8)=B8,0,IF((B$3*10^12-$A8)*(B$3*10^12-$A7)*-1<0,0,1)*IF(ABS(B$3*10^12-$A8)>(B$3*10^12-$A7),$A7,$A8))","v":{"$error":"#NAME?"}},{"$f":"IF(IF((C$3*10^12-$A8)*(C$3*10^12-$A7)*-1<0,0,1)*IF(ABS(C$3*10^12-$A8)>(C$3*10^12-$A7),$A7,$A8)=C8,0,IF((C$3*10^12-$A8)*(C$3*10^12-$A7)*-1<0,0,1)*IF(ABS(C$3*10^12-$A8)>(C$3*10^12-$A7),$A7,$A8))","v":0},{"$f":"IF(IF((D$3*10^12-$A8)*(D$3*10^12-$A7)*-1<0,0,1)*IF(ABS(D$3*10^12-$A8)>(D$3*10^12-$A7),$A7,$A8)=D8,0,IF((D$3*10^12-$A8)*(D$3*10^12-$A7)*-1<0,0,1)*IF(ABS(D$3*10^12-$A8)>(D$3*10^12-$A7),$A7,$A8))","v":0},{"$f":"IF(IF((E$3*10^12-$A8)*(E$3*10^12-$A7)*-1<0,0,1)*IF(ABS(E$3*10^12-$A8)>(E$3*10^12-$A7),$A7,$A8)=E8,0,IF((E$3*10^12-$A8)*(E$3*10^12-$A7)*-1<0,0,1)*IF(ABS(E$3*10^12-$A8)>(E$3*10^12-$A7),$A7,$A8))","v":0},{"$f":"IF(IF((F$3*10^12-$A8)*(F$3*10^12-$A7)*-1<0,0,1)*IF(ABS(F$3*10^12-$A8)>(F$3*10^12-$A7),$A7,$A8)=F8,0,IF((F$3*10^12-$A8)*(F$3*10^12-$A7)*-1<0,0,1)*IF(ABS(F$3*10^12-$A8)>(F$3*10^12-$A7),$A7,$A8))","v":0},{"$f":"IF(IF((G$3*10^12-$A8)*(G$3*10^12-$A7)*-1<0,0,1)*IF(ABS(G$3*10^12-$A8)>(G$3*10^12-$A7),$A7,$A8)=G8,0,IF((G$3*10^12-$A8)*(G$3*10^12-$A7)*-1<0,0,1)*IF(ABS(G$3*10^12-$A8)>(G$3*10^12-$A7),$A7,$A8))","v":{"$error":"#NAME?"}},{"$error":"#NAME?"},{"$error":"#NAME?"},{"$error":"#NAME?"},null,null,"Renb",{"$f":"Renb","v":98804.202056325434},100000,"Ω"]
[0.68,{"$error":"#NAME?"},0,0,0,0,{"$error":"#NAME?"},{"$error":"#NAME?"},{"$error":"#NAME?"},{"$error":"#NAME?"},null,null,"Rc1ea",{"$f":"Rcea2","v":0},{"$f":"IF(N8>(INT(0.5+100*POWER(10,IF(96*(LOG(N8)-INT(LOG(N8)))-ROUND(96*(LOG(N8)-INT(LOG(N8))),0)<0,ROUND(96*(LOG(N8)-INT(LOG(N8))),0)-1,ROUND(96*(LOG(N8)-INT(LOG(N8))),0))/96))*POWER(10,INT(LOG(N8))-2)+INT(0.5+100*POWER(10,(IF(96*(LOG(N8)-INT(LOG(N8)))-ROUND(96*(LOG(N8)-INT(LOG(N8))),0)<0,ROUND(96*(LOG(N8)-INT(LOG(N8))),0)-1,ROUND(96*(LOG(N8)-INT(LOG(N8))),0))+1)/96))*POWER(10,INT(LOG(N8))-2))/2,INT(0.5+100*POWER(10,(IF(96*(LOG(N8)-INT(LOG(N8)))-ROUND(96*(LOG(N8)-INT(LOG(N8))),0)<0,ROUND(96*(LOG(N8)-INT(LOG(N8))),0)-1,ROUND(96*(LOG(N8)-INT(LOG(N8))),0))+1)/96))*POWER(10,INT(LOG(N8))-2),INT(0.5+100*POWER(10,IF(96*(LOG(N8)-INT(LOG(N8)))-ROUND(96*(LOG(N8)-INT(LOG(N8))),0)<0,ROUND(96*(LOG(N8)-INT(LOG(N8))),0)-1,ROUND(96*(LOG(N8)-INT(LOG(N8))),0))/96))*POWER(10,INT(LOG(N8))-2))","v":{"$error":"#NUM!"}},"Ω"]
[0.82,{"$error":"#NAME?"},0,0,0,0,{"$error":"#NAME?"},{"$error":"#NAME?"},{"$error":"#NAME?"},{"$error":"#NAME?"}]
[1,{"$error":"#NAME?"},0,0,0,0,{"$error":"#NAME?"},{"$error":"#NAME?"},{"$error":"#NAME?"},{"$error":"#NAME?"},null,null,"Rfb1",{"$f":"Rfb1_","v":100000},{"$f":"IF(N10>(INT(0.5+100*POWER(10,IF(96*(LOG(N10)-INT(LOG(N10)))-ROUND(96*(LOG(N10)-INT(LOG(N10))),0)<0,ROUND(96*(LOG(N10)-INT(LOG(N10))),0)-1,ROUND(96*(LOG(N10)-INT(LOG(N10))),0))/96))*POWER(10,INT(LOG(N10))-2)+INT(0.5+100*POWER(10,(IF(96*(LOG(N10)-INT(LOG(N10)))-ROUND(96*(LOG(N10)-INT(LOG(N10))),0)<0,ROUND(96*(LOG(N10)-INT(LOG(N10))),0)-1,ROUND(96*(LOG(N10)-INT(LOG(N10))),0))+1)/96))*POWER(10,INT(LOG(N10))-2))/2,INT(0.5+100*POWER(10,(IF(96*(LOG(N10)-INT(LOG(N10)))-ROUND(96*(LOG(N10)-INT(LOG(N10))),0)<0,ROUND(96*(LOG(N10)-INT(LOG(N10))),0)-1,ROUND(96*(LOG(N10)-INT(LOG(N10))),0))+1)/96))*POWER(10,INT(LOG(N10))-2),INT(0.5+100*POWER(10,IF(96*(LOG(N10)-INT(LOG(N10)))-ROUND(96*(LOG(N10)-INT(LOG(N10))),0)<0,ROUND(96*(LOG(N10)-INT(LOG(N10))),0)-1,ROUND(96*(LOG(N10)-INT(LOG(N10))),0))/96))*POWER(10,INT(LOG(N10))-2))","v":100000},"Ω"]
[1.2,{"$error":"#NAME?"},0,0,0,0,{"$error":"#NAME?"},{"$error":"#NAME?"},{"$error":"#NAME?"},{"$error":"#NAME?"},null,null,"Rfb2",{"$f":"Rfb2_","v":43478.260869565223},{"$f":"IF(N11=\"OPEN\",\"OPEN\",IF(N11>(INT(0.5+100*POWER(10,IF(96*(LOG(N11)-INT(LOG(N11)))-ROUND(96*(LOG(N11)-INT(LOG(N11))),0)<0,ROUND(96*(LOG(N11)-INT(LOG(N11))),0)-1,ROUND(96*(LOG(N11)-INT(LOG(N11))),0))/96))*POWER(10,INT(LOG(N11))-2)+INT(0.5+100*POWER(10,(IF(96*(LOG(N11)-INT(LOG(N11)))-ROUND(96*(LOG(N11)-INT(LOG(N11))),0)<0,ROUND(96*(LOG(N11)-INT(LOG(N11))),0)-1,ROUND(96*(LOG(N11)-INT(LOG(N11))),0))+1)/96))*POWER(10,INT(LOG(N11))-2))/2,INT(0.5+100*POWER(10,(IF(96*(LOG(N11)-INT(LOG(N11)))-ROUND(96*(LOG(N11)-INT(LOG(N11))),0)<0,ROUND(96*(LOG(N11)-INT(LOG(N11))),0)-1,ROUND(96*(LOG(N11)-INT(LOG(N11))),0))+1)/96))*POWER(10,INT(LOG(N11))-2),INT(0.5+100*POWER(10,IF(96*(LOG(N11)-INT(LOG(N11)))-ROUND(96*(LOG(N11)-INT(LOG(N11))),0)<0,ROUND(96*(LOG(N11)-INT(LOG(N11))),0)-1,ROUND(96*(LOG(N11)-INT(LOG(N11))),0))/96))*POWER(10,INT(LOG(N11))-2)))","v":43200},"Ω"]
[1.5,{"$error":"#NAME?"},0,0,0,0,{"$error":"#NAME?"},{"$error":"#NAME?"},{"$error":"#NAME?"},{"$error":"#NAME?"},null,null,"Rt1",{"$f":"'Variable Management'!B25*1000","v":7071.3959964895748},{"$f":"IF(N12>(INT(0.5+100*POWER(10,IF(96*(LOG(N12)-INT(LOG(N12)))-ROUND(96*(LOG(N12)-INT(LOG(N12))),0)<0,ROUND(96*(LOG(N12)-INT(LOG(N12))),0)-1,ROUND(96*(LOG(N12)-INT(LOG(N12))),0))/96))*POWER(10,INT(LOG(N12))-2)+INT(0.5+100*POWER(10,(IF(96*(LOG(N12)-INT(LOG(N12)))-ROUND(96*(LOG(N12)-INT(LOG(N12))),0)<0,ROUND(96*(LOG(N12)-INT(LOG(N12))),0)-1,ROUND(96*(LOG(N12)-INT(LOG(N12))),0))+1)/96))*POWER(10,INT(LOG(N12))-2))/2,INT(0.5+100*POWER(10,(IF(96*(LOG(N12)-INT(LOG(N12)))-ROUND(96*(LOG(N12)-INT(LOG(N12))),0)<0,ROUND(96*(LOG(N12)-INT(LOG(N12))),0)-1,ROUND(96*(LOG(N12)-INT(LOG(N12))),0))+1)/96))*POWER(10,INT(LOG(N12))-2),INT(0.5+100*POWER(10,IF(96*(LOG(N12)-INT(LOG(N12)))-ROUND(96*(LOG(N12)-INT(LOG(N12))),0)<0,ROUND(96*(LOG(N12)-INT(LOG(N12))),0)-1,ROUND(96*(LOG(N12)-INT(LOG(N12))),0))/96))*POWER(10,INT(LOG(N12))-2))","v":7150},"Ω"]
[1.8,{"$error":"#NAME?"},0,0,0,0,{"$error":"#NAME?"},{"$error":"#NAME?"},{"$error":"#NAME?"},{"$error":"#NAME?"},null,null,"Rt2",{"$f":"'Variable Management'!#REF!*1000","v":{"$error":"#REF!"}},{"$f":"IF(N13=\"OPEN\",\"OPEN\",IF(N13>(INT(0.5+100*POWER(10,IF(96*(LOG(N13)-INT(LOG(N13)))-ROUND(96*(LOG(N13)-INT(LOG(N13))),0)<0,ROUND(96*(LOG(N13)-INT(LOG(N13))),0)-1,ROUND(96*(LOG(N13)-INT(LOG(N13))),0))/96))*POWER(10,INT(LOG(N13))-2)+INT(0.5+100*POWER(10,(IF(96*(LOG(N13)-INT(LOG(N13)))-ROUND(96*(LOG(N13)-INT(LOG(N13))),0)<0,ROUND(96*(LOG(N13)-INT(LOG(N13))),0)-1,ROUND(96*(LOG(N13)-INT(LOG(N13))),0))+1)/96))*POWER(10,INT(LOG(N13))-2))/2,INT(0.5+100*POWER(10,(IF(96*(LOG(N13)-INT(LOG(N13)))-ROUND(96*(LOG(N13)-INT(LOG(N13))),0)<0,ROUND(96*(LOG(N13)-INT(LOG(N13))),0)-1,ROUND(96*(LOG(N13)-INT(LOG(N13))),0))+1)/96))*POWER(10,INT(LOG(N13))-2),INT(0.5+100*POWER(10,IF(96*(LOG(N13)-INT(LOG(N13)))-ROUND(96*(LOG(N13)-INT(LOG(N13))),0)<0,ROUND(96*(LOG(N13)-INT(LOG(N13))),0)-1,ROUND(96*(LOG(N13)-INT(LOG(N13))),0))/96))*POWER(10,INT(LOG(N13))-2)))","v":{"$error":"#REF!"}},"Ω"]
[2.2000000000000002,{"$f":"IF(IF((B$3*10^12-$A15)*(B$3*10^12-$A14)*-1<0,0,1)*IF(ABS(B$3*10^12-$A15)>(B$3*10^12-$A14),$A14,$A15)=B15,0,IF((B$3*10^12-$A15)*(B$3*10^12-$A14)*-1<0,0,1)*IF(ABS(B$3*10^12-$A15)>(B$3*10^12-$A14),$A14,$A15))","v":{"$error":"#NAME?"}},0,0,0,0,{"$error":"#NAME?"},{"$error":"#NAME?"},{"$error":"#NAME?"},{"$error":"#NAME?"}]
[2.7,{"$error":"#NAME?"},0,0,0,0,{"$error":"#NAME?"},{"$error":"#NAME?"},{"$error":"#NAME?"},{"$error":"#NAME?"}]
[3.3,{"$error":"#NAME?"},0,0,0,0,{"$error":"#NAME?"},{"$error":"#NAME?"},{"$error":"#NAME?"},{"$error":"#NAME?"},null,null,"Rs",{"$f":"Rs_ideal*1000","v":{"$error":"#NAME?"}},{"$f":"IF(N16=0,0,IF(N16>(INT(0.5+100*POWER(10,IF(96*(LOG(N16)-INT(LOG(N16)))-ROUND(96*(LOG(N16)-INT(LOG(N16))),0)<0,ROUND(96*(LOG(N16)-INT(LOG(N16))),0)-1,ROUND(96*(LOG(N16)-INT(LOG(N16))),0))/96))*POWER(10,INT(LOG(N16))-2)+INT(0.5+100*POWER(10,(IF(96*(LOG(N16)-INT(LOG(N16)))-ROUND(96*(LOG(N16)-INT(LOG(N16))),0)<0,ROUND(96*(LOG(N16)-INT(LOG(N16))),0)-1,ROUND(96*(LOG(N16)-INT(LOG(N16))),0))+1)/96))*POWER(10,INT(LOG(N16))-2))/2,INT(0.5+100*POWER(10,(IF(96*(LOG(N16)-INT(LOG(N16)))-ROUND(96*(LOG(N16)-INT(LOG(N16))),0)<0,ROUND(96*(LOG(N16)-INT(LOG(N16))),0)-1,ROUND(96*(LOG(N16)-INT(LOG(N16))),0))+1)/96))*POWER(10,INT(LOG(N16))-2),INT(0.5+100*POWER(10,IF(96*(LOG(N16)-INT(LOG(N16)))-ROUND(96*(LOG(N16)-INT(LOG(N16))),0)<0,ROUND(96*(LOG(N16)-INT(LOG(N16))),0)-1,ROUND(96*(LOG(N16)-INT(LOG(N16))),0))/96))*POWER(10,INT(LOG(N16))-2)))","v":{"$error":"#NAME?"}},"mΩ"]
[3.9,{"$error":"#NAME?"},0,0,0,0,{"$error":"#NAME?"},{"$error":"#NAME?"},{"$error":"#NAME?"},{"$error":"#NAME?"},null,null,"Cres",{"$f":"Cres","v":{"$error":"#NAME?"}},{"$f":"G4*1000000000000","v":{"$error":"#NAME?"}},"pF"]
[4.7,{"$error":"#NAME?"},0,0,0,0,{"$error":"#NAME?"},{"$error":"#NAME?"},{"$error":"#NAME?"},{"$error":"#NAME?"}]
[5.6,{"$error":"#NAME?"},0,0,0,0,{"$error":"#NAME?"},{"$error":"#NAME?"},{"$error":"#NAME?"},{"$error":"#NAME?"}]
[6.8,{"$error":"#NAME?"},0,0,0,0,{"$error":"#NAME?"},{"$error":"#NAME?"},{"$error":"#NAME?"},{"$error":"#NAME?"}]
[8.1999999999999993,{"$error":"#NAME?"},0,0,0,0,{"$error":"#NAME?"},{"$error":"#NAME?"},{"$error":"#NAME?"},{"$error":"#NAME?"}]
[10,{"$error":"#NAME?"},0,0,0,0,{"$error":"#NAME?"},{"$error":"#NAME?"},{"$error":"#NAME?"},{"$error":"#NAME?"},null,null,"Cdither",{"$f":"Cdither_init","v":{"$error":"#NAME?"}},{"$f":"H4","v":{"$error":"#NAME?"}}]
[12,{"$error":"#NAME?"},0,0,0,0,{"$error":"#NAME?"},{"$error":"#NAME?"},{"$error":"#NAME?"},{"$error":"#NAME?"}]
[15,{"$error":"#NAME?"},0,0,0,0,{"$error":"#NAME?"},{"$error":"#NAME?"},{"$error":"#NAME?"},{"$error":"#NAME?"}]
[18,{"$error":"#NAME?"},0,0,0,0,{"$error":"#NAME?"},{"$error":"#NAME?"},{"$error":"#NAME?"},{"$error":"#NAME?"}]
[22,{"$error":"#NAME?"},27,0,0,0,{"$error":"#NAME?"},{"$error":"#NAME?"},{"$error":"#NAME?"},{"$error":"#NAME?"}]
[27,{"$error":"#NAME?"},0,0,0,0,{"$error":"#NAME?"},{"$error":"#NAME?"},{"$error":"#NAME?"},{"$error":"#NAME?"}]
[33,{"$error":"#NAME?"},0,0,0,0,{"$error":"#NAME?"},{"$error":"#NAME?"},{"$error":"#NAME?"},{"$error":"#NAME?"}]
[39,{"$error":"#NAME?"},0,0,0,0,{"$error":"#NAME?"},{"$error":"#NAME?"},{"$error":"#NAME?"},{"$error":"#NAME?"}]
[47,{"$error":"#NAME?"},0,0,0,0,{"$error":"#NAME?"},{"$error":"#NAME?"},{"$error":"#NAME?"},{"$error":"#NAME?"},null,null,"Rc1",{"$f":"O7/1000&\" kΩ\"","v":"100 kΩ"},{"$f":"O7/1000","v":100},"kΩ"]
[56,{"$error":"#NAME?"},0,0,0,0,{"$error":"#NAME?"},{"$error":"#NAME?"},{"$error":"#NAME?"},{"$error":"#NAME?"},null,null,"Cc1",{"$f":"C4*1000000000&\" nF\"","v":"0.027 nF"},{"$f":"C4*1000000000","v":2.7E-2},"nF"]
[68,{"$error":"#NAME?"},0,0,0,0,{"$error":"#NAME?"},{"$error":"#NAME?"},{"$error":"#NAME?"},{"$error":"#NAME?"},null,null,"Cc2",{"$f":"D4*1000000000000&\" pF\"","v":"0 pF"},{"$f":"D4*1000000000000","v":0},"pF"]
[82,{"$error":"#NAME?"},0,0,0,0,{"$error":"#NAME?"},{"$error":"#NAME?"},{"$error":"#NAME?"},{"$error":"#NAME?"}]
[{"$f":"A22*10","v":100},{"$error":"#NAME?"},0,0,0,0,{"$error":"#NAME?"},{"$error":"#NAME?"},{"$error":"#NAME?"},{"$error":"#NAME?"},null,null,"Rc2",{"$f":"O8/1000&\" kΩ\"","v":{"$error":"#NUM!"}},{"$f":"O8/1000","v":{"$error":"#NUM!"}},"kΩ"]
[{"$f":"A23*10","v":120},{"$error":"#NAME?"},0,0,0,0,{"$error":"#NAME?"},{"$error":"#NAME?"},{"$error":"#NAME?"},{"$error":"#NAME?"},null,null,"Cc3",{"$f":"I4*1000000000&\" nF\"","v":{"$error":"#NAME?"}},{"$f":"I4*1000000000","v":{"$error":"#NAME?"}},"nF"]
[150,{"$error":"#NAME?"},0,0,0,0,{"$error":"#NAME?"},{"$error":"#NAME?"},{"$error":"#NAME?"},{"$error":"#NAME?"},null,null,"Cc4",{"$f":"J4*1000000000000&\" pF\"","v":{"$error":"#NAME?"}},{"$f":"J4*1000000000000","v":{"$error":"#NAME?"}},"pF"]
[180,{"$error":"#NAME?"},0,0,0,0,{"$error":"#NAME?"},{"$error":"#NAME?"},{"$error":"#NAME?"},{"$error":"#NAME?"}]
[220,{"$error":"#NAME?"},0,0,0,0,{"$error":"#NAME?"},{"$error":"#NAME?"},{"$error":"#NAME?"},{"$error":"#NAME?"}]
[270,{"$error":"#NAME?"},{"$f":"IF(IF((C$3*10^12-$A40)*(C$3*10^12-$A39)*-1<0,0,1)*IF(ABS(C$3*10^12-$A40)>(C$3*10^12-$A39),$A39,$A40)=C40,0,IF((C$3*10^12-$A40)*(C$3*10^12-$A39)*-1<0,0,1)*IF(ABS(C$3*10^12-$A40)>(C$3*10^12-$A39),$A39,$A40))","v":0},0,0,0,{"$error":"#NAME?"},{"$error":"#NAME?"},{"$error":"#NAME?"},{"$error":"#NAME?"}]
[330,{"$error":"#NAME?"},0,0,0,0,{"$error":"#NAME?"},{"$error":"#NAME?"},{"$error":"#NAME?"},{"$error":"#NAME?"}]
[390,{"$error":"#NAME?"},0,0,0,0,{"$error":"#NAME?"},{"$error":"#NAME?"},{"$error":"#NAME?"},{"$error":"#NAME?"}]
[470,{"$error":"#NAME?"},0,0,0,0,{"$error":"#NAME?"},{"$error":"#NAME?"},{"$error":"#NAME?"},{"$error":"#NAME?"}]
[560,{"$error":"#NAME?"},0,0,0,0,{"$error":"#NAME?"},{"$error":"#NAME?"},{"$error":"#NAME?"},{"$error":"#NAME?"}]
[680,{"$error":"#NAME?"},0,0,0,0,{"$error":"#NAME?"},{"$error":"#NAME?"},{"$error":"#NAME?"},{"$error":"#NAME?"}]
[{"$f":"A33*10","v":820},{"$error":"#NAME?"},0,0,0,0,{"$error":"#NAME?"},{"$error":"#NAME?"},{"$error":"#NAME?"},{"$error":"#NAME?"}]
[1000,{"$error":"#NAME?"},0,0,0,0,{"$error":"#NAME?"},{"$error":"#NAME?"},{"$error":"#NAME?"},{"$error":"#NAME?"}]
[1200,{"$error":"#NAME?"},0,0,0,0,{"$error":"#NAME?"},{"$error":"#NAME?"},{"$error":"#NAME?"},{"$error":"#NAME?"}]
[1500,{"$error":"#NAME?"},0,0,0,0,{"$error":"#NAME?"},{"$error":"#NAME?"},{"$error":"#NAME?"},{"$error":"#NAME?"}]
[1800,{"$error":"#NAME?"},0,0,0,0,{"$error":"#NAME?"},{"$error":"#NAME?"},{"$error":"#NAME?"},{"$error":"#NAME?"}]
[2200,{"$error":"#NAME?"},0,0,0,0,{"$error":"#NAME?"},{"$error":"#NAME?"},{"$error":"#NAME?"},{"$error":"#NAME?"}]
[2700,{"$error":"#NAME?"},0,0,0,0,{"$error":"#NAME?"},{"$error":"#NAME?"},{"$error":"#NAME?"},{"$error":"#NAME?"}]
[3300,{"$error":"#NAME?"},0,0,0,0,{"$error":"#NAME?"},{"$error":"#NAME?"},{"$error":"#NAME?"},{"$error":"#NAME?"}]
[3900,{"$error":"#NAME?"},0,0,0,0,{"$error":"#NAME?"},{"$error":"#NAME?"},{"$error":"#NAME?"},{"$error":"#NAME?"}]
[4700,{"$error":"#NAME?"},0,0,0,0,{"$error":"#NAME?"},{"$error":"#NAME?"},{"$error":"#NAME?"},{"$error":"#NAME?"}]
[5600,{"$error":"#NAME?"},0,0,0,0,{"$error":"#NAME?"},{"$error":"#NAME?"},{"$error":"#NAME?"},{"$error":"#NAME?"}]
[6800,{"$error":"#NAME?"},0,0,0,0,{"$error":"#NAME?"},{"$error":"#NAME?"},{"$error":"#NAME?"},{"$error":"#NAME?"}]
[8200,{"$error":"#NAME?"},0,0,0,0,{"$error":"#NAME?"},{"$error":"#NAME?"},{"$error":"#NAME?"},{"$error":"#NAME?"}]
[10000,{"$error":"#NAME?"},0,0,0,0,{"$error":"#NAME?"},{"$error":"#NAME?"},{"$error":"#NAME?"},{"$error":"#NAME?"}]
[12000,{"$error":"#NAME?"},0,0,0,0,{"$error":"#NAME?"},{"$error":"#NAME?"},{"$error":"#NAME?"},{"$error":"#NAME?"}]
[15000,{"$error":"#NAME?"},0,0,0,0,{"$error":"#NAME?"},{"$error":"#NAME?"},{"$error":"#NAME?"},{"$error":"#NAME?"}]
[18000,{"$error":"#NAME?"},0,0,0,0,{"$error":"#NAME?"},{"$error":"#NAME?"},{"$error":"#NAME?"},{"$error":"#NAME?"}]
[22000,{"$error":"#NAME?"},0,0,0,0,{"$error":"#NAME?"},{"$error":"#NAME?"},{"$error":"#NAME?"},{"$error":"#NAME?"}]
[27000,{"$error":"#NAME?"},0,0,0,0,{"$error":"#NAME?"},{"$error":"#NAME?"},{"$error":"#NAME?"},{"$error":"#NAME?"}]
[33000,{"$error":"#NAME?"},0,0,0,0,{"$error":"#NAME?"},{"$error":"#NAME?"},{"$error":"#NAME?"},{"$error":"#NAME?"}]
[39000,{"$error":"#NAME?"},0,0,0,0,{"$error":"#NAME?"},{"$error":"#NAME?"},{"$error":"#NAME?"},{"$error":"#NAME?"}]
[47000,{"$error":"#NAME?"},0,0,0,0,{"$error":"#NAME?"},{"$error":"#NAME?"},{"$error":"#NAME?"},{"$error":"#NAME?"}]
[56000,{"$error":"#NAME?"},0,0,0,0,{"$error":"#NAME?"},{"$error":"#NAME?"},{"$error":"#NAME?"},{"$error":"#NAME?"}]
[68000,{"$error":"#NAME?"},0,0,0,0,{"$error":"#NAME?"},{"$error":"#NAME?"},{"$error":"#NAME?"},{"$error":"#NAME?"}]
[82000,{"$error":"#NAME?"},0,0,0,0,{"$error":"#NAME?"},{"$error":"#NAME?"},{"$error":"#NAME?"},{"$f":"IF(IF((J$3*10^12-$A70)*(J$3*10^12-$A69)*-1<0,0,1)*IF(ABS(J$3*10^12-$A70)>(J$3*10^12-$A69),$A69,$A70)=J70,0,IF((J$3*10^12-$A70)*(J$3*10^12-$A69)*-1<0,0,1)*IF(ABS(J$3*10^12-$A70)>(J$3*10^12-$A69),$A69,$A70))","v":{"$error":"#NAME?"}}]
[100000,{"$error":"#NAME?"},0,{"$f":"IF(IF((D$3*10^12-$A71)*(D$3*10^12-$A70)*-1<0,0,1)*IF(ABS(D$3*10^12-$A71)>(D$3*10^12-$A70),$A70,$A71)=D71,0,IF((D$3*10^12-$A71)*(D$3*10^12-$A70)*-1<0,0,1)*IF(ABS(D$3*10^12-$A71)>(D$3*10^12-$A70),$A70,$A71))","v":0},0,0,{"$error":"#NAME?"},{"$error":"#NAME?"},{"$error":"#NAME?"},{"$error":"#NAME?"}]
[120000,{"$f":"IF(IF((B$3*10^12-$A72)*(B$3*10^12-$A71)*-1<0,0,1)*IF(ABS(B$3*10^12-$A72)>(B$3*10^12-$A71),$A71,$A72)=B72,0,IF((B$3*10^12-$A72)*(B$3*10^12-$A71)*-1<0,0,1)*IF(ABS(B$3*10^12-$A72)>(B$3*10^12-$A71),$A71,$A72))","v":{"$error":"#NAME?"}},{"$f":"IF(IF((C$3*10^12-$A72)*(C$3*10^12-$A71)*-1<0,0,1)*IF(ABS(C$3*10^12-$A72)>(C$3*10^12-$A71),$A71,$A72)=C72,0,IF((C$3*10^12-$A72)*(C$3*10^12-$A71)*-1<0,0,1)*IF(ABS(C$3*10^12-$A72)>(C$3*10^12-$A71),$A71,$A72))","v":0},0,0,{"$f":"IF(IF((F$3*10^12-$A72)*(F$3*10^12-$A71)*-1<0,0,1)*IF(ABS(F$3*10^12-$A72)>(F$3*10^12-$A71),$A71,$A72)=F72,0,IF((F$3*10^12-$A72)*(F$3*10^12-$A71)*-1<0,0,1)*IF(ABS(F$3*10^12-$A72)>(F$3*10^12-$A71),$A71,$A72))","v":0},{"$f":"IF(IF((G$3*10^12-$A72)*(G$3*10^12-$A71)*-1<0,0,1)*IF(ABS(G$3*10^12-$A72)>(G$3*10^12-$A71),$A71,$A72)=G72,0,IF((G$3*10^12-$A72)*(G$3*10^12-$A71)*-1<0,0,1)*IF(ABS(G$3*10^12-$A72)>(G$3*10^12-$A71),$A71,$A72))","v":{"$error":"#NAME?"}},{"$f":"IF(IF((H$3*10^12-$A72)*(H$3*10^12-$A71)*-1<0,0,1)*IF(ABS(H$3*10^12-$A72)>(H$3*10^12-$A71),$A71,$A72)=H72,0,IF((H$3*10^12-$A72)*(H$3*10^12-$A71)*-1<0,0,1)*IF(ABS(H$3*10^12-$A72)>(H$3*10^12-$A71),$A71,$A72))","v":{"$error":"#NAME?"}},{"$f":"IF(IF((I$3*10^12-$A72)*(I$3*10^12-$A71)*-1<0,0,1)*IF(ABS(I$3*10^12-$A72)>(I$3*10^12-$A71),$A71,$A72)=I72,0,IF((I$3*10^12-$A72)*(I$3*10^12-$A71)*-1<0,0,1)*IF(ABS(I$3*10^12-$A72)>(I$3*10^12-$A71),$A71,$A72))","v":{"$error":"#NAME?"}},{"$error":"#NAME?"}]
[150000,{"$error":"#NAME?"},0,0,0,0,{"$error":"#NAME?"},{"$error":"#NAME?"},{"$error":"#NAME?"},{"$error":"#NAME?"}]
[180000,{"$error":"#NAME?"},0,0,0,0,{"$error":"#NAME?"},{"$error":"#NAME?"},{"$error":"#NAME?"},{"$error":"#NAME?"}]
[220000,{"$error":"#NAME?"},0,0,0,0,{"$error":"#NAME?"},{"$error":"#NAME?"},{"$error":"#NAME?"},{"$error":"#NAME?"}]
[270000,{"$error":"#NAME?"},0,0,0,0,{"$error":"#NAME?"},{"$error":"#NAME?"},{"$error":"#NAME?"},{"$error":"#NAME?"}]
[330000,{"$error":"#NAME?"},0,0,0,0,{"$error":"#NAME?"},{"$error":"#NAME?"},{"$error":"#NAME?"},{"$error":"#NAME?"}]
[390000,{"$error":"#NAME?"},0,0,0,0,{"$error":"#NAME?"},{"$error":"#NAME?"},{"$error":"#NAME?"},{"$error":"#NAME?"}]
[470000,{"$error":"#NAME?"},0,0,0,0,{"$error":"#NAME?"},{"$error":"#NAME?"},{"$error":"#NAME?"},{"$error":"#NAME?"}]
[560000,{"$error":"#NAME?"},0,0,0,0,{"$error":"#NAME?"},{"$error":"#NAME?"},{"$error":"#NAME?"},{"$error":"#NAME?"}]
[680000,{"$error":"#NAME?"},0,0,0,0,{"$error":"#NAME?"},{"$error":"#NAME?"},{"$error":"#NAME?"},{"$error":"#NAME?"}]
[820000,{"$error":"#NAME?"},0,0,0,0,{"$error":"#NAME?"},{"$error":"#NAME?"},{"$error":"#NAME?"},{"$error":"#NAME?"}]
[1000000,{"$error":"#NAME?"},0,0,0,0,{"$error":"#NAME?"},{"$error":"#NAME?"},{"$error":"#NAME?"},{"$error":"#NAME?"}]
[1200000,{"$error":"#NAME?"},0,0,0,0,{"$error":"#NAME?"},{"$error":"#NAME?"},{"$error":"#NAME?"},{"$error":"#NAME?"}]
[1500000,{"$error":"#NAME?"},0,0,0,0,{"$error":"#NAME?"},{"$error":"#NAME?"},{"$error":"#NAME?"},{"$error":"#NAME?"}]
[1800000,{"$error":"#NAME?"},0,0,0,0,{"$error":"#NAME?"},{"$error":"#NAME?"},{"$error":"#NAME?"},{"$error":"#NAME?"}]
[2200000,{"$error":"#NAME?"},0,0,0,0,{"$error":"#NAME?"},{"$error":"#NAME?"},{"$error":"#NAME?"},{"$error":"#NAME?"}]
[2700000,{"$error":"#NAME?"},0,0,0,0,{"$error":"#NAME?"},{"$error":"#NAME?"},{"$error":"#NAME?"},{"$error":"#NAME?"}]
[3300000,{"$error":"#NAME?"},0,0,0,0,{"$error":"#NAME?"},{"$error":"#NAME?"},{"$error":"#NAME?"},{"$error":"#NAME?"}]
[3900000,{"$error":"#NAME?"},0,0,0,0,{"$error":"#NAME?"},{"$error":"#NAME?"},{"$error":"#NAME?"},{"$error":"#NAME?"}]
[4700000,{"$error":"#NAME?"},0,0,0,0,{"$error":"#NAME?"},{"$error":"#NAME?"},{"$error":"#NAME?"},{"$error":"#NAME?"}]
[5600000,{"$error":"#NAME?"},0,0,0,0,{"$error":"#NAME?"},{"$error":"#NAME?"},{"$error":"#NAME?"},{"$error":"#NAME?"}]
[6800000,{"$error":"#NAME?"},0,0,0,0,{"$error":"#NAME?"},{"$error":"#NAME?"},{"$error":"#NAME?"},{"$error":"#NAME?"}]
[8200000,{"$error":"#NAME?"},0,0,0,0,{"$error":"#NAME?"},{"$error":"#NAME?"},{"$error":"#NAME?"},{"$error":"#NAME?"}]
[10000000,{"$error":"#NAME?"},0,0,0,0,{"$error":"#NAME?"},{"$error":"#NAME?"},{"$error":"#NAME?"},{"$error":"#NAME?"}]
[12000000,{"$error":"#NAME?"},0,0,0,0,{"$error":"#NAME?"},{"$error":"#NAME?"},{"$error":"#NAME?"},{"$error":"#NAME?"}]
[15000000,{"$error":"#NAME?"},0,0,0,0,{"$error":"#NAME?"},{"$error":"#NAME?"},{"$error":"#NAME?"},{"$error":"#NAME?"}]
[18000000,{"$error":"#NAME?"},0,0,0,22000000,{"$error":"#NAME?"},{"$error":"#NAME?"},{"$error":"#NAME?"},{"$error":"#NAME?"}]
[22000000,{"$error":"#NAME?"},0,0,22000000,0,{"$error":"#NAME?"},{"$error":"#NAME?"},{"$error":"#NAME?"},{"$error":"#NAME?"}]
[{"$f":"A87*10","v":27000000},{"$error":"#NAME?"},0,0,0,0,{"$error":"#NAME?"},{"$error":"#NAME?"},{"$error":"#NAME?"},{"$error":"#NAME?"}]
[33000000,{"$error":"#NAME?"},0,0,0,0,{"$error":"#NAME?"},{"$error":"#NAME?"},{"$error":"#NAME?"},{"$error":"#NAME?"}]
[39000000,{"$error":"#NAME?"},0,0,0,0,{"$error":"#NAME?"},{"$error":"#NAME?"},{"$error":"#NAME?"},{"$error":"#NAME?"}]
[47000000,{"$error":"#NAME?"},0,0,0,0,{"$error":"#NAME?"},{"$error":"#NAME?"},{"$error":"#NAME?"},{"$error":"#NAME?"}]
[56000000,{"$error":"#NAME?"},0,0,0,{"$f":"IF(IF((F$3*10^12-$A104)*(F$3*10^12-$A103)*-1<0,0,1)*IF(ABS(F$3*10^12-$A104)>(F$3*10^12-$A103),$A103,$A104)=F104,0,IF((F$3*10^12-$A104)*(F$3*10^12-$A103)*-1<0,0,1)*IF(ABS(F$3*10^12-$A104)>(F$3*10^12-$A103),$A103,$A104))","v":0},{"$f":"IF(IF((G$3*10^12-$A104)*(G$3*10^12-$A103)*-1<0,0,1)*IF(ABS(G$3*10^12-$A104)>(G$3*10^12-$A103),$A103,$A104)=G104,0,IF((G$3*10^12-$A104)*(G$3*10^12-$A103)*-1<0,0,1)*IF(ABS(G$3*10^12-$A104)>(G$3*10^12-$A103),$A103,$A104))","v":{"$error":"#NAME?"}},{"$f":"IF(IF((H$3*10^12-$A104)*(H$3*10^12-$A103)*-1<0,0,1)*IF(ABS(H$3*10^12-$A104)>(H$3*10^12-$A103),$A103,$A104)=H104,0,IF((H$3*10^12-$A104)*(H$3*10^12-$A103)*-1<0,0,1)*IF(ABS(H$3*10^12-$A104)>(H$3*10^12-$A103),$A103,$A104))","v":{"$error":"#NAME?"}},{"$f":"IF(IF((I$3*10^12-$A104)*(I$3*10^12-$A103)*-1<0,0,1)*IF(ABS(I$3*10^12-$A104)>(I$3*10^12-$A103),$A103,$A104)=I104,0,IF((I$3*10^12-$A104)*(I$3*10^12-$A103)*-1<0,0,1)*IF(ABS(I$3*10^12-$A104)>(I$3*10^12-$A103),$A103,$A104))","v":{"$error":"#NAME?"}},{"$error":"#NAME?"}]
[68000000,{"$error":"#NAME?"},0,0,0,0,{"$error":"#NAME?"},{"$error":"#NAME?"},{"$error":"#NAME?"},{"$error":"#NAME?"}]
[82000000,{"$error":"#NAME?"},0,0,0,0,{"$error":"#NAME?"},{"$error":"#NAME?"},{"$error":"#NAME?"},{"$error":"#NAME?"}]
[100000000,{"$error":"#NAME?"},0,0,0,0,{"$error":"#NAME?"},{"$error":"#NAME?"},{"$error":"#NAME?"},{"$error":"#NAME?"}]
[120000000,{"$error":"#NAME?"},0,0,0,0,{"$error":"#NAME?"},{"$error":"#NAME?"},{"$error":"#NAME?"},{"$error":"#NAME?"}]
[150000000,{"$error":"#NAME?"},0,0,0,0,{"$error":"#NAME?"},{"$error":"#NAME?"},{"$error":"#NAME?"},{"$error":"#NAME?"}]
[180000000,{"$error":"#NAME?"},0,0,0,0,{"$error":"#NAME?"},{"$error":"#NAME?"},{"$error":"#NAME?"},{"$error":"#NAME?"}]
[220000000,{"$error":"#NAME?"},0,0,0,0,{"$error":"#NAME?"},{"$error":"#NAME?"},{"$error":"#NAME?"},{"$error":"#NAME?"}]
[270000000,{"$error":"#NAME?"},0,0,0,0,{"$error":"#NAME?"},{"$error":"#NAME?"},{"$error":"#NAME?"},{"$error":"#NAME?"}]
[330000000,{"$error":"#NAME?"},0,0,0,0,{"$error":"#NAME?"},{"$error":"#NAME?"},{"$error":"#NAME?"},{"$error":"#NAME?"}]
[390000000,{"$error":"#NAME?"},0,0,0,0,{"$error":"#NAME?"},{"$error":"#NAME?"},{"$error":"#NAME?"},{"$error":"#NAME?"}]
[470000000,{"$error":"#NAME?"},0,0,0,0,{"$error":"#NAME?"},{"$error":"#NAME?"},{"$error":"#NAME?"},{"$error":"#NAME?"}]
[560000000,{"$error":"#NAME?"},0,0,0,0,{"$error":"#NAME?"},{"$error":"#NAME?"},{"$error":"#NAME?"},{"$error":"#NAME?"}]
[680000000,{"$error":"#NAME?"},0,0,0,0,{"$error":"#NAME?"},{"$error":"#NAME?"},{"$error":"#NAME?"},{"$error":"#NAME?"}]
[820000000,{"$error":"#NAME?"},0,0,0,0,{"$error":"#NAME?"},{"$error":"#NAME?"},{"$error":"#NAME?"},{"$error":"#NAME?"}]
[1000000000,{"$error":"#NAME?"},0,0,0,0,{"$error":"#NAME?"},{"$error":"#NAME?"},{"$error":"#NAME?"},{"$error":"#NAME?"}]
[1200000000,{"$error":"#NAME?"},0,0,0,0,{"$error":"#NAME?"},{"$error":"#NAME?"},{"$error":"#NAME?"},{"$error":"#NAME?"}]
[1500000000,{"$error":"#NAME?"},0,0,0,0,{"$error":"#NAME?"},{"$error":"#NAME?"},{"$error":"#NAME?"},{"$error":"#NAME?"}]
[1800000000,{"$error":"#NAME?"},0,0,0,0,{"$error":"#NAME?"},{"$error":"#NAME?"},{"$error":"#NAME?"},{"$error":"#NAME?"}]
[2200000000,{"$error":"#NAME?"},0,0,0,0,{"$error":"#NAME?"},{"$error":"#NAME?"},{"$error":"#NAME?"},{"$error":"#NAME?"}]
[2700000000,{"$error":"#NAME?"},0,0,0,0,{"$error":"#NAME?"},{"$error":"#NAME?"},{"$error":"#NAME?"},{"$error":"#NAME?"}]
[3300000000,{"$error":"#NAME?"},0,0,0,0,{"$error":"#NAME?"},{"$error":"#NAME?"},{"$error":"#NAME?"},{"$error":"#NAME?"}]
[3900000000,{"$error":"#NAME?"},0,0,0,0,{"$error":"#NAME?"},{"$error":"#NAME?"},{"$error":"#NAME?"},{"$error":"#NAME?"}]
[4700000000,{"$error":"#NAME?"},0,0,0,0,{"$error":"#NAME?"},{"$error":"#NAME?"},{"$error":"#NAME?"},{"$error":"#NAME?"}]
[5600000000,{"$error":"#NAME?"},0,0,0,0,{"$error":"#NAME?"},{"$error":"#NAME?"},{"$error":"#NAME?"},{"$error":"#NAME?"}]
[6800000000,{"$error":"#NAME?"},0,0,0,0,{"$error":"#NAME?"},{"$error":"#NAME?"},{"$error":"#NAME?"},{"$error":"#NAME?"}]
[8200000000,{"$error":"#NAME?"},0,0,0,0,{"$error":"#NAME?"},{"$error":"#NAME?"},{"$error":"#NAME?"},{"$error":"#NAME?"}]
[10000000000,{"$error":"#NAME?"},0,0,0,0,{"$error":"#NAME?"},{"$error":"#NAME?"},{"$error":"#NAME?"},{"$error":"#NAME?"}]
[12000000000,{"$error":"#NAME?"},0,0,0,0,{"$error":"#NAME?"},{"$error":"#NAME?"},{"$error":"#NAME?"},{"$error":"#NAME?"}]
[15000000000,{"$error":"#NAME?"},0,0,0,0,{"$error":"#NAME?"},{"$error":"#NAME?"},{"$error":"#NAME?"},{"$error":"#NAME?"}]
[18000000000,{"$error":"#NAME?"},0,0,0,0,{"$error":"#NAME?"},{"$error":"#NAME?"},{"$error":"#NAME?"},{"$f":"IF(IF((J$3*10^12-$A134)*(J$3*10^12-$A133)*-1<0,0,1)*IF(ABS(J$3*10^12-$A134)>(J$3*10^12-$A133),$A133,$A134)=J134,0,IF((J$3*10^12-$A134)*(J$3*10^12-$A133)*-1<0,0,1)*IF(ABS(J$3*10^12-$A134)>(J$3*10^12-$A133),$A133,$A134))","v":{"$error":"#NAME?"}}]
[22000000000,{"$error":"#NAME?"},0,0,{"$f":"IF(IF((E$3*10^12-$A135)*(E$3*10^12-$A134)*-1<0,0,1)*IF(ABS(E$3*10^12-$A135)>(E$3*10^12-$A134),$A134,$A135)=E135,0,IF((E$3*10^12-$A135)*(E$3*10^12-$A134)*-1<0,0,1)*IF(ABS(E$3*10^12-$A135)>(E$3*10^12-$A134),$A134,$A135))","v":0},0,{"$error":"#NAME?"},{"$error":"#NAME?"},{"$error":"#NAME?"},{"$f":"IF(IF((J$3*10^12-$A135)*(J$3*10^12-$A134)*-1<0,0,1)*IF(ABS(J$3*10^12-$A135)>(J$3*10^12-$A134),$A134,$A135)=J135,0,IF((J$3*10^12-$A135)*(J$3*10^12-$A134)*-1<0,0,1)*IF(ABS(J$3*10^12-$A135)>(J$3*10^12-$A134),$A134,$A135))","v":{"$error":"#NAME?"}}]
[27000000000,{"$f":"IF(IF((B$3*10^12-$A136)*(B$3*10^12-$A135)*-1<0,0,1)*IF(ABS(B$3*10^12-$A136)>(B$3*10^12-$A135),$A135,$A136)=B136,0,IF((B$3*10^12-$A136)*(B$3*10^12-$A135)*-1<0,0,1)*IF(ABS(B$3*10^12-$A136)>(B$3*10^12-$A135),$A135,$A136))","v":{"$error":"#NAME?"}},{"$f":"IF(IF((C$3*10^12-$A136)*(C$3*10^12-$A135)*-1<0,0,1)*IF(ABS(C$3*10^12-$A136)>(C$3*10^12-$A135),$A135,$A136)=C136,0,IF((C$3*10^12-$A136)*(C$3*10^12-$A135)*-1<0,0,1)*IF(ABS(C$3*10^12-$A136)>(C$3*10^12-$A135),$A135,$A136))","v":0},0,0,0,{"$error":"#NAME?"},{"$error":"#NAME?"},{"$error":"#NAME?"},{"$error":"#NAME?"}]
[33000000000,{"$error":"#NAME?"},0,0,0,0,{"$error":"#NAME?"},{"$error":"#NAME?"},{"$error":"#NAME?"},{"$error":"#NAME?"}]
[39000000000,{"$error":"#NAME?"},0,0,0,0,{"$error":"#NAME?"},{"$error":"#NAME?"},{"$error":"#NAME?"},{"$error":"#NAME?"}]
[47000000000,{"$error":"#NAME?"},0,0,0,0,{"$error":"#NAME?"},{"$error":"#NAME?"},{"$error":"#NAME?"},{"$error":"#NAME?"}]
[56000000000,{"$error":"#NAME?"},0,0,0,0,{"$error":"#NAME?"},{"$error":"#NAME?"},{"$error":"#NAME?"},{"$error":"#NAME?"}]
[68000000000,{"$error":"#NAME?"},0,0,0,0,{"$error":"#NAME?"},{"$error":"#NAME?"},{"$error":"#NAME?"},{"$error":"#NAME?"}]
[82000000000,{"$error":"#NAME?"},0,0,0,0,{"$error":"#NAME?"},{"$error":"#NAME?"},{"$error":"#NAME?"},{"$error":"#NAME?"}]
[100000000000,{"$error":"#NAME?"},0,0,0,0,{"$error":"#NAME?"},{"$error":"#NAME?"},{"$error":"#NAME?"},{"$error":"#NAME?"}]
[120000000000,{"$error":"#NAME?"},0,0,0,0,{"$error":"#NAME?"},{"$error":"#NAME?"},{"$error":"#NAME?"},{"$error":"#NAME?"}]
[150000000000,{"$error":"#NAME?"},0,0,0,0,{"$error":"#NAME?"},{"$error":"#NAME?"},{"$error":"#NAME?"},{"$error":"#NAME?"}]
[180000000000,{"$error":"#NAME?"},0,0,0,0,{"$error":"#NAME?"},{"$error":"#NAME?"},{"$error":"#NAME?"},{"$error":"#NAME?"}]
[220000000000,{"$error":"#NAME?"},0,0,0,0,{"$error":"#NAME?"},{"$error":"#NAME?"},{"$error":"#NAME?"},{"$error":"#NAME?"}]
[270000000000,{"$error":"#NAME?"},0,0,0,0,{"$error":"#NAME?"},{"$error":"#NAME?"},{"$error":"#NAME?"},{"$error":"#NAME?"}]
[330000000000,{"$error":"#NAME?"},0,0,0,0,{"$error":"#NAME?"},{"$error":"#NAME?"},{"$error":"#NAME?"},{"$error":"#NAME?"}]
[390000000000,{"$error":"#NAME?"},0,0,0,0,{"$error":"#NAME?"},{"$error":"#NAME?"},{"$error":"#NAME?"},{"$error":"#NAME?"}]
[470000000000,{"$error":"#NAME?"},0,0,0,0,{"$error":"#NAME?"},{"$error":"#NAME?"},{"$error":"#NAME?"},{"$error":"#NAME?"}]
[560000000000,{"$error":"#NAME?"},0,0,0,0,{"$error":"#NAME?"},{"$error":"#NAME?"},{"$error":"#NAME?"},{"$error":"#NAME?"}]
[680000000000,{"$error":"#NAME?"},0,0,0,0,{"$error":"#NAME?"},{"$error":"#NAME?"},{"$error":"#NAME?"},{"$error":"#NAME?"}]
[820000000000,{"$error":"#NAME?"},0,0,0,0,{"$error":"#NAME?"},{"$error":"#NAME?"},{"$error":"#NAME?"},{"$error":"#NAME?"}]
[1000000000000,{"$error":"#NAME?"},0,0,0,0,{"$error":"#NAME?"},{"$error":"#NAME?"},{"$error":"#NAME?"},{"$error":"#NAME?"}]
[1200000000000,{"$error":"#NAME?"},0,0,0,0,{"$error":"#NAME?"},{"$error":"#NAME?"},{"$error":"#NAME?"},{"$error":"#NAME?"}]
[1500000000000,{"$error":"#NAME?"},0,0,0,0,{"$error":"#NAME?"},{"$error":"#NAME?"},{"$error":"#NAME?"},{"$error":"#NAME?"}]
[1800000000000,{"$error":"#NAME?"},0,0,0,0,{"$error":"#NAME?"},{"$error":"#NAME?"},{"$error":"#NAME?"},{"$error":"#NAME?"}]
[2200000000000,{"$error":"#NAME?"},0,0,0,0,{"$error":"#NAME?"},{"$error":"#NAME?"},{"$error":"#NAME?"},{"$error":"#NAME?"}]
[2700000000000,{"$error":"#NAME?"},2700000000000,0,2700000000000,2700000000000,{"$error":"#NAME?"},{"$error":"#NAME?"},{"$error":"#NAME?"},{"$error":"#NAME?"}]

{"sheet":"Snubber","index":11,"n_rows":6,"n_cols":5,"rows_kept":6,"cut":false,"hidden":true,"merged":[]}
[null,null,"UNITS","STD UNITS"]
["Frequency of Ringing",85,"MHz",{"$f":"B2*1000000","v":85000000},"Hz"]
["SW capacitance",3000,"pF",{"$f":"B3*0.000000000001","v":3E-9},"F"]
["Lpar",{"$f":"1000000000*1/((D2*2*3.14159)^2*D3)","v":1.1686430773614742},"nH",{"$f":"B4/1000000000","v":1.1686430773614743E-9},"H"]
["Csnub",{"$f":"4*B3","v":12000},"pF",{"$f":"B5*0.000000000001","v":1.2E-8},"F"]
["Rsnub",{"$f":"SQRT(D4/D3)","v":0.62413755891936573},"Ω",{"$f":"B6","v":0.62413755891936573},"Ω"]

{"sheet":"Parallel Output Caps","index":12,"n_rows":17,"n_cols":5,"rows_kept":17,"cut":false,"hidden":true,"merged":[]}
[]
[]
[]
["Fsw",{"$f":"Fsw","v":2200000}]
[]
["C1",20,"uF",{"$f":"B6/1000000","v":2.0000000000000002E-5},"F"]
["R1",0.5,"mOhms",{"$f":"B7/1000","v":5.0000000000000001E-4},"Ohms"]
[]
["C2",68,"uF",{"$f":"B9/1000000","v":6.7999999999999999E-5},"F"]
["R2",20,"mOhms",{"$f":"B10/1000","v":0.02},"Ohms"]
[]
[]
["I1 ",{"$f":"(D6/(D6+D9))*SQRT((D10*D9*B4)^2+1)/SQRT((((D7+D10)*D6*D9/(D9+D6))*B4)^2+1)","v":0.5881964665933066},"%"]
["I2 ",{"$f":"1-B13","v":0.4118035334066934},"%"]
[]
["I1 ",{"$f":"B13*(Iripple1/(2*SQRT(3)))","v":{"$error":"#NAME?"}},"A"]
["I2 ",{"$f":"B14*(Iripple1/(2*SQRT(3)))","v":{"$error":"#NAME?"}},"A"]