{"text_format":"1","workbook":"xlsx","n_sheets":13,"sheets":["Design the Power Module","Schematic & BOM","EVMs","Variable Management","MOSFET Parameters","Schematic Management","Stability Calculations","Bode Plot Management","Efficiency Calculations","Efficiency Plot Management","Standard Value Calculator","Snubber","Parallel Output Caps"],"not_rendered":{"charts":9,"images":23,"macros":1,"external_links":1,"defined_names":237,"comments":1,"pivot_tables":0},"unopened":[],"bounds":{"document_bytes":16777216,"sheet_cells":100000,"rows_first":2000,"rows_last":500,"rows_between":2000,"halvings":0,"cell_chars":16384,"cell_head_chars":4096},"cells_cut":0,"cells_raw":0,"read":"whole","date_system":"1900"}

{"sheet":"Design the Power Module","index":0,"n_rows":56,"n_cols":17,"rows_kept":56,"cut":false,"hidden":false,"merged":[[2,14,2,15],[0,0,0,16],[81,5,81,6],[39,11,40,16],[41,11,42,16]]}
["                      TLVM136x0 3V‒36VIN, 1V‒6VOUT Buck Power Module Design Tool"]
[null,null,null,null,null,null,null,null,null,null,null,null,null,null,"http://www.ti.com/product/lm5175"]
["About",null,"xx",null,null,"= Input Box",null,null,null,null,null,null,null,null,"TERMS OF USE",null,"                "]
[]
["Step 1: Operating Specifications"]
[null,null,null,"Input Voltage – Min, VIN(min) ",12,"V"]
[null,null,null,"Input Voltage – Nom, VIN(nom)",24,"V"]
[null,null,null,"Input Voltage – Max, VIN(max)",36,"V"]
[null,null,null,"Output Voltage, VOUT ",5,"V"]
[null,null,null,"Full Load Output Current, IOUT ",6,"A"]
[null,null,null,"Switching Frequency, FSW",1000,"kHz"]
[null,null,null,"Frequency Set Resistor, RT ",{"$f":"'Variable Management'!C340","v":13},{"$f":"'Variable Management'!E340","v":"kΩ"}]
[null,null,null,"Ambient Temperature, TA",25,"°C"]
[]
["Step 2: Buck Inductor"]
[null,null,null,"Inductor Pk-Pk Ripple Current at VIN(nom)",{"$f":"'Variable Management'!B60","v":6.7516905367449214},"Apk-pk"]
[null,null,null,"DIL as a % of Full Load at VIN(nom)",{"$f":"'Variable Management'!D60*100","v":112.52817561241535},"%"]
[null,null,null,"Peak Inductor Current at VIN(max) and Full Load",{"$f":"'Variable Management'!B99","v":9.7164174017851757},"Apk"]
[null,null,null,"Peak Inductor Current Limit",{"$f":"Ipk_OCP","v":6.2},"Apk"]
[]
["Step 3: Output Capacitors"]
[null,null,null,"Desired Output Voltage Ripple",50,"mVpk-pk"]
[null,null,null,"Effective COUT Value to Meet Ripple Spec",{"$f":"'Variable Management'!B113","v":16.879226341862307},"µF"]
[null,null,null,"Desired Crossover Frequency",80,{"$f":"\"     kHz \"","v":"     kHz "}]
[null,null,null,"Effective COUT Value to Meet Crossover Spec",{"$f":"'Variable Management'!B206","v":25.333115970732802},"µF"]
[null,null,null,"Output Capacitance (derated), COUT ",50,"µF"]
[null,null,null,"Output Cap ESR (Max) to Meet Ripple Spec",{"$f":"'Variable Management'!B117","v":6.9708113307063782},"mΩ"]
[null,null,null,"Output Capacitor ESR",2,"mΩ"]
[null,null,null,"Resulting Output Voltage Ripple (max) ",{"$f":"'Variable Management'!B119*1000","v":21.615956659738703},"mVpk-pk"]
[null,null,null,"Output Capacitor RMS Current (max) ",{"$f":"'Variable Management'!B106","v":2.1456745873416816},"A (rms)"]
[]
["Step 4: Input Capacitors"]
[null,null,null,"Input Voltage Ripple Spec",120,"mVpk-pk"]
[null,null,null,"Minimum Input Capacitance",{"$f":"'Variable Management'!B136","v":12.5},"µF"]
[null,null,null,"Input Capacitance (derated), CIN ",20,"µF"]
[null,null,null,"Maximum Permitted ESR",{"$f":"'Variable Management'!B141","v":4.6313366479842921},"mΩ"]
[null,null,null,"Input Capacitor ESR",1,"mΩ"]
[null,null,null,"Resulting Input Voltage Ripple (max)",{"$f":"'Variable Management'!B146*1000","v":84.716417401785179},"mVpk-pk"]
[null,null,null,"Input Capacitor RMS Current (max)",{"$f":"'Variable Management'!B129","v":3.1326432232930506},"A (rms)"]
[null,null,null,null,null,null,null,null,null,null,null,{"$f":"CHOOSE(SCH_MODE, \"\", \"** For Single-Output Operation in 2-Phase Mode, tie MODE to VDDA and use FB1 to set VOUT **\", \"** For Single-Output Operation in 3-Phase Mode, tie both MODE pins to VDDA. Use FB1 of master IC to set VOUT. Connect FB2 of master IC to AGND. Connect FB2 of slave IC to VDDA to configure it as a slave **\", \"** For Single-Output Operation in 4-Phase Mode, tie both MODE pins to VDDA. Use FB1 of master IC to set VOUT. Connect FB2 of master IC to AGND. Connect FB2 of slave IC to VDDA to configure it as a slave **\")","v":""}]
["Step 5: Feedback Network"]
[null,null,null,{"$f":"CHOOSE(TPSM63603_Fixed_Vout, \"Lower Feedback Resistance\", \"* Tie FB to VOUT for a Fixed 5V Output\", \"* Tie FB to VOUT for a Fixed 3.3V Output\")","v":"* Tie FB to VOUT for a Fixed 5V Output"},10,"kΩ",null,null,null,null,null,{"$f":"CHOOSE(SCH_MODE, \"\", \"** For Single-Output Operation in 2-Phase Mode, tie MODE to VDDA and use FB1 to set VOUT **\", \"** For Single-Output Operation in 3-Phase Mode, tie both MODE pins to VDDA. Use FB1 of master IC to set VOUT. Connect FB2 of master IC to AGND. Connect FB2 of slave IC to VDDA to configure it as a slave **\", \"** For Single-Output Operation in 4-Phase Mode, tie both MODE pins to VDDA. Use FB1 of master IC to set VOUT. Connect FB2 of master IC to AGND. Connect FB2 of slave IC to VDDA to configure it as a slave **\")","v":""}]
[null,null,null,"Upper Feedback Resistance (E96), RFBT",{"$f":"IF(Vout=Vref,\"SHORT\",Rfb2_u/1000)","v":40.200000000000003},{"$f":"IF(Vout=Vref,\"\",\"kΩ\")","v":"kΩ"}]
[null,null,null,"Feedforward Capacitance, CFF",22,"pF"]
[]
["Step 6: VIN UVLO"]
[null,null,null,"Desired VIN UVLO Turn-On Threshold",8.9,"V"]
[null,null,null,"UVLO Divider Upper Resistance, RENT",604,"kΩ"]
[null,null,null,"UVLO Divider Lower Resistance (E96), RENB",{"$f":"Renb_u/1000","v":100},{"$f":"IF(Vout=Vref,\"\",\"kΩ\")","v":"kΩ"}]
[null,null,null,"Actual VIN UVLO Turn-On Threshold",{"$f":"1.263/E49*(E48+E49)","v":8.8915199999999999},"V",null,null,null,null,null,null,null,null,null,null," "]
[null,null,null,"Actual VIN UVLO Turn-Off Threshold",{"$f":"E50*0.72","v":6.4018943999999998},"V"]
[]
["Step 7: Power Loss & Thermals"]
[null,null,null,"Total Power Dissipation",{"$f":"'Efficiency Calculations'!AT109","v":7.4811400587932875},"W"]
[null,null,null,"Junction Temperature (estimate)",{"$f":"'Variable Management'!B285","v":189.58508129345233},"°C"]
[null,null,null,null,{"$f":"CHOOSE(Ext_VCC, \"\", \"* Tie VLDOIN to GND\")","v":""}]

{"sheet":"Schematic & BOM","index":1,"n_rows":52,"n_cols":10,"rows_kept":52,"cut":false,"hidden":false,"merged":[[36,3,36,5],[44,3,44,6],[45,3,45,6],[35,3,35,6],[37,3,37,5],[40,3,40,5],[39,3,39,5],[46,3,46,6],[42,3,42,6],[43,3,43,6],[41,3,41,6],[38,3,38,5],[47,0,48,0],[47,9,48,9],[47,3,48,6],[47,2,48,2],[47,1,48,1],[47,7,48,7],[47,8,48,8]]}
[]
[]
[]
[]
[]
[]
[]
[]
[]
[]
[]
[]
[]
[]
[]
[]
[]
[]
[]
[]
[]
[]
[]
[]
[]
[]
[]
[]
[]
[]
[]
[]
[]
[{"$f":"\"VIN = \"&VIN_min&\" V to \"&VIN_max&\" V, VOUT = \"&Vout&\" V, IOUT = \"&Iout&\" A,  Fsw = \"&Fsw/1000&\" kHz\"","v":"VIN = 12 V to 36 V, VOUT = 5 V, IOUT = 6 A,  Fsw = 1000 kHz"}]
["High-Efficiency Synchronous Buck Power Module BOM"]
["Count","Ref Des","Value","Description",null,null,null,"Size","Part Number","MFR"]
[{"$f":"ROUNDUP('Design the Power Module'!E35/10,0)","v":2},"CIN1, CIN2",10,{"$f":"C37","v":10},null,null,null,1210,"Std","Std"]
[2,"COUT",22,{"$f":"C38","v":22},null,null,null,1210,"Std","Std"]
[1,"CVCC",1,{"$f":"C39","v":1},null,null,null,"0402","Std","Std"]
[1,"CSYNC",1,{"$f":"C40","v":1},null,null,null,"0402","Std","Std"]
[1,"CFF",{"$f":"'Variable Management'!D299","v":22},{"$f":"C41","v":22},null,null,null,"0402","Std","Std"]
[1,"RRT",{"$f":"'Design the Power Module'!E12","v":13},{"$f":"C42","v":13},null,null,null,"0402","Std","Std"]
[1,"RFBT",{"$f":"'Design the Power Module'!E42","v":10},10,null,null,null,"0402","Std","Std"]
[1,"RFBB",{"$f":"'Design the Power Module'!E43","v":40.200000000000003},40.200000000000003,null,null,null,"0402","Std","Std"]
[1,"RENT",{"$f":"'Variable Management'!D302","v":604},604,null,null,null,"0402","Std","Std"]
[1,"RENB",{"$f":"'Variable Management'!D303","v":100},100,null,null,null,"0402","Std","Std"]
[1,"RPGOOD",100,100,null,null,null,"0402","Std","Std"]
[1,"U1",{"$f":"'Variable Management'!N19","v":"TLVM13630"},{"$f":"CHOOSE(GPN, \"IC, TLVM13660 Synchronous Buck Power Module, 3V–36V Input, 6A Output\", \"IC, TLVM13640 Synchronous Buck Power Module, 3V–36V Input, 4A Output\", \"IC, TLVM13630 Synchronous Buck Power Module, 3V–36V Input, 3A Output\", \"IC, TLVM13620 Synchronous Buck Power Module, 3V–36V Input, 2A Output\")","v":"IC, TLVM13630 Synchronous Buck Power Module, 3V–36V Input, 3A Output"},null,null,null,{"$f":"CHOOSE(GPN, \"B3QFN\", \"B3QFN\", \"B0QFN\", \"B0QFN\")","v":"B0QFN"},{"$f":"CHOOSE(VARIANT, \"TLVM13660RDLR\", \"TLVM13640RDLR\", \"TLVM13630RDHR\", \"TLVM13620RDHR\", \"TLVM13630V5RDHR\", \"TLVM13630V3RDHR\")","v":"TLVM13630RDHR"},"TI"]
[]
[]
["NOTES:"]
["** Effective input and output capacitances should be appropriately derated for applied voltage and temperature, particularly with ceramics **"]

{"sheet":"EVMs","index":2,"n_rows":4,"n_cols":2,"rows_kept":4,"cut":false,"hidden":false,"merged":[[0,0,0,16]]}
["TLVM136x0 Quickstart Design Tool"]
[]
[]
[null,"TLVM13660EVM PCB Layout"]

{"sheet":"Variable Management","index":3,"n_rows":345,"n_cols":27,"rows_kept":345,"cut":false,"hidden":true,"merged":[[4,4,4,7],[0,0,0,8]]}
["EXCEL Variables Names/Calculations"]
[null,"Input from user ="]
[null,"Output ="]
[null,"Constant"]
["Variable Name","Value","STD Units",null,"Notes",null,null,null,"Iteration"]
["Step 1: Operational Specs"]
["VIN_min",{"$f":"'Design the Power Module'!E6","v":12},"V","Minimum input voltage",null,null,null,null,1]
["VIN_nom",{"$f":"'Design the Power Module'!E7","v":24},"V","Nominal input voltage",null,null,null,null,null,null,"Use CFF",1,null,"TLVM13630 3.3Vout",{"$f":"IF(Vout = 3.3, 1, 0)","v":0},null,null,null,null,"Dual  Outputs",1,null,"FPWM",1,null,{"$f":"CHOOSE(SCH_MODE, \"Bode Plot (Ch1)\", \"Bode Plot - 2 Ph\", \"Bode Plot - 3 Ph\", \"Bode Plot - 4 Ph\")","v":"Bode Plot (Ch1)"},1]
["VIN_max",{"$f":"'Design the Power Module'!E8","v":36},"V","Maximum input voltage",null,null,null,null,null,null,"No CFF",2,null,"TLVM13630 5Vout",{"$f":"IF(Vout = 5, 1, 0)","v":1},null,null,null,null,"Single Output – 2  Phases",2,null,"DEM",2,null,{"$f":"IF(MODE=1, \"Bode Plot (Ch2)\", \"N/A - Do Not Use\")","v":"Bode Plot (Ch2)"},2]
[null,null,null,null,null,null,null,null,null,null,null,1,null,"TLVM13630 Fixed Vout",{"$f":"IF(AND(GPN=3,Vout=3.3),3,IF(AND(GPN=3,Vout=5),2,1))","v":2},"1 = No, 2 = 5V, 3 = 3.3V",null,null,null,"Single Output – 3  Phases",3,null,"FPWM/DEM",2,null,"BODE_PLOT_TYPE",1]
["Vout",{"$f":"'Design the Power Module'!E9","v":5},"V","Output voltage",null,null,null,null,null,null,"NO_FF_CAP",{"$f":"IF(L10=2, TRUE, FALSE)","v":false},null,null,{"$f":"AND(GPN=3, OR(O8,O9))","v":true},null,null,null,null,"Single Output – 4  Phases",4]
["Iout",{"$f":"'Design the Power Module'!E10","v":6},"A","Output current",null,"Iout-max",{"$f":"CHOOSE(GPN, 6, 4, 3, 2)","v":3},"A",1,null,null,null,null,null,null,null,null,null,null,"Single/Dual Yes/No",1]
[null,null,null,null,null,null,null,null,1,null,null,null,null,null,null,null,null,null,null,"MODE (Single/Dual), DUAL = 1, SINGLE = 2",{"$f":"IF(U12=1, 1, 2)","v":1},null,"External BIAS",1]
["Rout",{"$f":"Vout/Iout","v":0.83333333333333337},"W","Load resistance",null,null,null,null,null,null,null,null,null,null,null,null,null,null,null,"SINGLE OUTPUT (1 = YES)",{"$f":"IF(U12=1, 2, 1)","v":2},null,"No External BIAS",2]
["Pout",{"$f":"Vout*Iout","v":30},"W","Output power",null,null,null,null,null,null,null,null,null,"TLVM13660 6A module",1,null,null,null,null,"Number of Phases",{"$f":"SCH_MODE","v":1},null,"Ext_VCC",1]
[null,null,null,null,null,null,null,null,null,null,null,null,null,"TLVM13640 4A module",2]
["Efficiency",0.9,null,"Estimate of efficiency",null,null,null,null,null,null,null,{"$f":"Vout","v":5},null,"TLVM13630 3A module",3]
["Pin",{"$f":"Pout/Efficiency","v":33.333333333333336},"W","Calculate input power assuming finite efficiency",null,null,null,null,null,null,null,null,null,"TLVM13620 2A module",4]
[null,null,null,null,null,null,null,null,null,null,null,"GPN",null,{"$f":"CHOOSE(GPN, \"TLVM13660\", \"TLVM13640\", \"TLVM13630\", \"TLVM13620\")","v":"TLVM13630"},3,null,null,null,null,null,null,null,"2.2 MHz Fsw Setting",1]
["Iin_Vinmin",{"$f":"Pin/VIN_min","v":2.7777777777777781},"A",null,null,null,null,null,null,null,null,null,null,null,null,null,null,null,null,null,null,null,"440 kHz Fsw Setting",2]
["Iin_Vinnom",{"$f":"Pin/VIN_nom","v":1.3888888888888891},"A","Input currents at min, nom, max Vin",null,null,null,{"$f":"AND(OSC=1, OR(Fsw/1000>2530, Fsw/1000<1800))","v":false},null,null,"Variant","VARIANT",null,{"$f":"CHOOSE(VARIANT, \"TLVM13660\", \"TLVM13640\", \"TLVM13630\", \"TLVM13620\", \"TLVM13630V5\", \"TLVM13630V3\")","v":"TLVM13630"},{"$f":"GPN","v":3},null,null,null,null,null,null,null,"OSC",2]
["Iin_Vinmax",{"$f":"Pin/VIN_max","v":0.92592592592592604},"A",null,null,null,null,{"$f":"AND(OSC=2, OR(Fsw/1000>500, Fsw/1000<300))","v":true},null,null,null,null,null,null,{"$f":"IF(AND(GPN=3,Vout=5),5,IF(AND(GPN=3,Vout=3.3),6,GPN))","v":5}]
[null,null,null,null,null,null,null,{"$f":"OR(H21,H22)","v":true}]
["Fsw",{"$f":"'Design the Power Module'!E11*1000","v":1000000},"Hz","Nominal switching frequency - determines RT resistor"]
["RT resistor to AGND",{"$f":"13.46/(Fsw/1000000)-0.44","v":13.020000000000001},"kΩ",null,null,null,null,null,1]
["Tsw",{"$f":"1/Fsw","v":9.9999999999999995E-7},"sec","Switching period"]
["Max crossover frequency = 20% Fsw",{"$f":"Fsw*0.2/1000","v":200},"kHz",null,null,"Min Crossover",10,null,null,null,"Adjustable",1]
["Vref",1,"V","Reference voltage",null,null,null,null,null,null,"5V",2]
["Rt",{"$f":"'Standard Value Calculator'!O12/1000","v":13},"kΩ","Frequency set resistor",null,{"$f":"IF(OR((Fsw=440000),(Fsw=2200000)),\"N/A\",Rfadj/1000)","v":1.2999999999999999E-2},null,null,null,null,"3.3V",3]
[null,null,null,null,null,null,null,null,null,null,"Adjustable_NoRT",4,null,null,"TPSM63603V5"]
[null,null,null,null,null,null,null,null,null,null,"5V_NoRT",5,null,null,"TPSM63603V3"]
[null,null,null,null,null,null,null,null,null,null,"3.3V_NoRT",6]
["Step 2: Buck Inductor","Channel 1",null,null,null,null,null,null,null,null,"Schematic setting",{"$f":"IF(No_RT, IF(Vout=3.3, 6, IF(Vout=5, 5, 4)),IF(Vout=3.3, 3, IF(Vout=5, 2, 1)))","v":5}]
["Don1",{"$f":"Vout/VIN_nom","v":0.20833333333333334},null,null,null,"Ideal Duty Cycle at VIN(nom)"]
["Doff1",{"$f":"1-34:34","v":0.79166666666666663},null,null,null,"Ideal 1- Duty Cycle at VIN(nom)"]
[]
["D_Vinmin",{"$f":"Vout/VIN_min","v":0.41666666666666669}]
["D_Vinnom",{"$f":"Vout/VIN_nom","v":0.20833333333333334}]
["D_Vinmax",{"$f":"Vout/VIN_max","v":0.1388888888888889},null,null,null,null,null,null,null,null,"Toko chip inductor for the TPSM63602/03"]
[]
["L_Vinnom",{"$f":"(VIN_nom-Vout)*D1_Vinnom/(Fsw*Iout*0.35)","v":1.8849206349206351E-6},"H",null,null,"Calculated inductance for 35% ripple at VIN(nom)",null,null,null,null,"Current (A)","L (uH)"]
["L_slopecomp",null,"H",null,null,"Calculated inductance based on one times inductor downslope",null,null,null,null,0,2]
[null,null,null,null,null,null,null,null,null,null,0.5,1.96]
["Lopt",{"$f":"B41","v":1.8849206349206351E-6},"H",null,null,"min of calculated inductances at VIN(min) and VIN(nom)",null,null,null,null,1,1.91]
["L_actual_TPSM63602-03",{"$f":"-0.0238*Iout^2-0.0868*Iout+2.0073","v":0.6296999999999997},"uH",null,null,"Calculate TOKO chip inductance based on entered load current value",null,null,null,null,1.5,1.82]
["L_actual_TPSM63604-06",{"$f":"-0.1304*Iout+2.32","v":1.5375999999999999},"uH",null,null,"Calculate MagLayers inductance based on entered load current value",null,null,null,null,2,1.74]
[null,null,null,null,null,null,null,null,null,null,2.5,1.64]
["Lo",{"$f":"CHOOSE(GPN, B46, B46, B45, B45)*0.000001","v":6.2969999999999966E-7},"H",null,null,"Chosen inductance",null,null,null,null,3,1.53]
["Rdcr",{"$f":"CHOOSE(GPN, 0.021, 0.021, 0.068, 0.068)","v":6.8000000000000005E-2},"W",null,null,"Chosen inductor DCR",null,null,null,null,3.5,1.4]
[null,null,null,null,null,null,null,null,null,null,4,1.29]
["Don2",{"$f":"(Vout+Iout*(Rdcr+Rdson2))/(Vin+Iout*(Rdson2-Rdson1))","v":0.23174204355108877}]
["Doff2",{"$f":"1-_Don2","v":0.76825795644891126}]
[]
["D_Vinmin_2",{"$f":"(Vout+Iout*(Rdcr+Rdson2))/(VIN_min+Iout*(Rdson2-Rdson1))","v":0.46582491582491575},null,{"$f":"Vout/VIN_min","v":0.41666666666666669},null,"Duty cycles adjusted for DCR/Rdson voltage drops"]
["D_Vinnom_2",{"$f":"(Vout+Iout*(Rdcr+Rdson2))/(VIN_nom+Iout*(Rdson2-Rdson1))","v":0.23174204355108877},null,{"$f":"Vout/VIN_nom","v":0.20833333333333334}]
["D_Vinmax_2",{"$f":"(Vout+Iout*(Rdcr+Rdson2))/(VIN_max+Iout*(Rdson2-Rdson1))","v":0.15423634336677813},null,{"$f":"Vout/VIN_max","v":0.1388888888888889},null,{"$f":"(Ts-0.000000085)/Ts","v":0.91499999999999992},"Dmax = [Ts-toff(min)]/Ts"]
[]
[]
["Iripple_Vinmin",{"$f":"(VIN_min-Vout-Iout*(Rdcr+Rdson1))*D1_Vinmin_2/(Fsw*Lf)","v":4.694497246029723},"A",{"$f":"B59/Iout","v":0.78241620767162046},null,"Ripple calculations include DCR and Rdson",null,null,null,null,"MagLayers inductor for the TPSM63604/06"]
["Iripple_Vinnom",{"$f":"(VIN_nom-Vout-Iout*(Rdcr+Rdson1))*D1_Vinnom_2/(Fsw*Lf)","v":6.7516905367449214},"A",{"$f":"B60/Iout","v":1.1252817561241535},null,"% ripple current at Vin-nom"]
["Iripple_Vinmax",{"$f":"(VIN_max-Vout-Iout*(Rdcr+Rdson1))*D1_Vinmax_2/(Fsw*Lf)","v":7.4328348035703531},"A",{"$f":"B61/Iout","v":1.2388058005950588},null,"Max inductor ripple current - it's at Vin-max",null,null,null,null,"Current (A)","L (uH)"]
[null,null,null,null,null,null,null,null,null,null,0,2.2000000000000002]
["Iinductor_rms_Vinmin",{"$f":"SQRT(Iout^2+(Iripple_Vinmin^2)/12)","v":6.1511401679755053},"A",null,null,null,null,null,null,null,1,2.1800000000000002]
["Iinductor_rms_Vinnom",{"$f":"SQRT(Iout^2+(Iripple_Vinnom^2)/12)","v":6.3086271955154851},"A",null,null,null,null,null,null,null,1.5,2.14]
["Iinudctor_rms_Vinmax",{"$f":"SQRT(Iout^2+(Iripple_Vinmax^2)/12)","v":6.3721204818148172},"A",null,null,null,null,null,null,null,2,2.0699999999999998]
[null,null,null,null,"TPSM63604/06","TPSM63602/03","=> Result based on GPN",null,null,null,2.5,2]
["Core loss estimate - Vin(min)",{"$f":"kcore*Iripple_Vinmin^kcore1*(Fsw/1000)^kcore2","v":0.70989156567544021},"W","kcore",4.1999999999999999E-8,{"$f":"0.000000042*0.5","v":2.0999999999999999E-8},{"$f":"CHOOSE(GPN, E67, E67, F67, F67)","v":2.0999999999999999E-8},"Core loss constant",null,null,3,1.93]
["Core loss estimate - Vin(nom)",{"$f":"CHOOSE(GPN, kcore*Iripple_Vinnom^kcore1*(Fsw/1000)^kcore2, kcore*Iripple_Vinnom^kcore1*(Fsw/1000)^kcore2, 0.5*kcore*Iripple_Vinnom^kcore1*(Fsw/1000)^kcore2, 0.5*kcore*Iripple_Vinnom^kcore1*(Fsw/1000)^kcore2)","v":0.88048227907349441},"W","kcore1",2.5,2.5,{"$f":"CHOOSE(GPN, E68, E68, F68, F68)","v":2.5},"Ripple current exponent",null,null,4,1.8]
["Core loss estimate - Vin(max)",{"$f":"kcore*Iripple_Vinmax^kcore1*(Fsw/1000)^kcore2","v":2.2392650216796413},"W","kcore2",1.95,1.95,{"$f":"CHOOSE(GPN, E69, E69, F69, F69)","v":1.95},"Fsw exponent",null,null,6,1.55]
[null,null,null,"Pcore = kcore*(deltaI)^kcore1*(Fsw)^kcore2",null,null,null,null,null,null,8,1.28]
[null,null,null,"Note: ** core loss for 2A/3A versions scaled by 50% for smaller 2520 core size**",null,null,null,null,null,null,10,1]
[]
[]
[]
["Inductor copper temperature",125,"°C"]
["Inductor DCR at hot",{"$f":"Rdcr*(1+Ltc*(B75-25))*1000","v":94.724000000000004},"mW"]
[]
[]
["Step 2b: Sense Resistors, Slope Comp, Current Limit"]
[]
["Ilimit_inductor_Vinmin",{"$f":"Ipk_OCP","v":6.2},"A",null,null,"Peak inductor current at current limit inception"]
["Ilimit_inductor_Vinnom",{"$f":"Ipk_OCP","v":6.2},"A"]
["Ilimit_inductor_Vinmax",{"$f":"Ipk_OCP","v":6.2},"A"]
[]
["CS threshold_min",6.8000000000000005E-2,"V","not applicable here"]
["CS threshold",7.4999999999999997E-2,"V"]
["CS threshold_max",8.2000000000000003E-2,"V"]
[]
["Rs",4.1000000000000002E-2,"W",null,null,"Current sense resistance Rs = high-side MOSFET Rdson"]
[]
["Current limit setpoint - peak",{"$f":"CHOOSE(GPN, 9.3, 7, 6.2, 4.87)","v":6.2},"A","9.3, 7, 6.2, 4.87A",null,"Peak current limit (trimmed at ATE) = min inductor sat current at hot"]
[]
["Iout_OCP_Vinmin",{"$f":"Ipk_OCP-Iripple_Vinmin/2","v":3.8527513769851387},"A",null,null,"Current limit setpoints (i.e. IOUT) assuming no CS delay"]
["Iout_OCP_Vinnom",{"$f":"Ipk_OCP-Iripple_Vinnom/2","v":2.8241547316275395},"A"]
["Iout_OCP_Vinmax",{"$f":"Ipk_OCP-Iripple_Vinmax/2","v":2.4835825982148236},"A"]
[]
["Ipk_full-load_Vinmin",{"$f":"Iout+Iripple_Vinmin/2","v":8.3472486230148615},"A"]
["Ipk_full-load_Vinnom",{"$f":"Iout+Iripple_Vinnom/2","v":9.3758452683724602},"A"]
["Ipk_full-load_Vinmax",{"$f":"Iout+Iripple_Vinmax/2","v":9.7164174017851757},"A"]
[]
[]
["Step 3: Output Capacitor"]
["Icoutrms_VINmin",{"$f":"Iripple_Vinmin/SQRT(12)","v":1.3551846243526087},"A",null,null,"Output cap RMS current"]
["Icoutrms_VINnom",{"$f":"Iripple_Vinnom/SQRT(12)","v":1.9490451744373647},"A"]
["Icoutrms_VINmax",{"$f":"Iripple_Vinmax/SQRT(12)","v":2.1456745873416816},"A"]
["Max Cout rms current",{"$f":"MAX(B103:B105)","v":2.1456745873416816},"A"]
[]
["Vripple1",{"$f":"'Design the Power Module'!E22/1000","v":0.05},"V",null,null,"Output voltage ripple spec(pk-pk)"]
[]
["Output Ripple Spec (pk-pk)",{"$f":"Vo1_ripple*1000","v":50},"mV",null,null,"Vout ripple spec at Vin(nom)"]
[]
["Coutmin",{"$f":"Iripple_Vinnom/(Fsw*8*Vo1_ripple)","v":1.6879226341862305E-5},"F",null,null,"Minimum output capacitnace",null,{"$f":"Vo2_ripple","v":0},1]
["Reported Coutmin",{"$f":"IF(Cout_min*1000000<2, 2.2,Cout_min*1000000)","v":16.879226341862307},"uF"]
["Cout",{"$f":"'Design the Power Module'!E26/1000000","v":5.0000000000000002E-5},"F",null,null,"Chosen output capacitance",null,null,1]
["Resrmax",{"$f":"SQRT((Vo1_ripple/Iripple_Vinnom)^2-(1/(Fsw*Cout*8))^2)","v":6.9708113307063784E-3},"W",null,null,"Max ESR before ripple exceeds Vripple1",null,null,1]
[]
["Reported Cout ESR max",{"$f":"IF(OR(CoutEsrMax>0.3, CoutEsrMax<0, (ISERROR(CoutEsrMax))), \"N/A\", CoutEsrMax*1000)","v":6.9708113307063782},"mΩ"]
["CoutEsr",{"$f":"'Design the Power Module'!E28/1000","v":2E-3},"W",null,null,"Chosen ESR",null,null,1,null,{"$f":"ISERROR(CoutEsrMax)","v":false},{"$f":"ISERROR(B117)","v":false}]
["Vripple",{"$f":"Iripple_Vinnom*SQRT(Cout_ESR^2+(1/(8*Fsw*Cout))^2)","v":2.1615956659738703E-2},"Vp-p",null,null,null,null,null,null,null,null,{"$f":"OR(CoutEsrMax>0.3,CoutEsrMax<0)","v":false}]
[null,null,null,null,null,null,null,null,null,null,{"$f":"OR(TRUE, FALSE, TRUE)","v":true}]
["Step 4: Input Capacitor"]
[]
["Icinrms_VINmin",{"$f":"SQRT(D1_Vinmin_2*(Iout^2*(1-D1_Vinmin_2)+Iripple_Vinmin^2/12))","v":3.1326432232930506},"A",null,null,"Calculate input cap rms current",null,null,null,null,null,null,null,"A"]
["Icinrms_VINnom",{"$f":"SQRT(D1_Vinnom_2*(Iout^2*(1-D1_Vinnom_2)+Iripple_Vinnom^2/12))","v":2.6999430444291459},"A"]
["Icinrms_VINmax",{"$f":"SQRT(D1_Vinmax_2*(Iout^2*(1-D1_Vinmax_2)+Iripple_Vinmax^2/12))","v":2.3251239695619828},"A"]
["Max Cin rms current",{"$f":"MAX(B123:B125)","v":3.1326432232930506},"A"]
[]
["Icinrms - max at D = 0.5",{"$f":"Iout/2","v":3},"A"]
["Final result",{"$f":"IF(VIN_min<2*Vout, Iout/2, B123)","v":3.1326432232930506},"A","…report this"]
[]
["Vinripple1",{"$f":"'Design the Power Module'!E33/1000","v":0.12},"Vp-p",null,null,"Input voltage ripple spec (pk-pk)"]
[null,null,null,null,null,{"$f":"Number_of_Phases","v":1}]
["Cinmin_Vinmax",{"$f":"Iout*D1_Vinmax*(1-D1_Vinmax)/(Vinripple1*Fsw)","v":5.9799382716049388E-6},"F",null,null,"Calculate cap at Vinmax and 50% duty cycle (Vin = 2*Vout)"]
["Cinmin_50%D",{"$f":"Iout*0.5*(1-0.5)/(Vinripple1*Fsw)","v":1.2500000000000001E-5},"F",null,null,"Buck 50% typically worst case"]
["Cinmin",{"$f":"IF(VIN_max<2*Vout, B133,B134)","v":1.2500000000000001E-5},"F"]
["Reported Cinmin",{"$f":"IF(Cinmin*1000000<4.7, 4.7,Cinmin*1000000)","v":12.5},"uF",null,null,"…report this"]
["Cin",{"$f":"'Design the Power Module'!E35/1000000","v":2.0000000000000002E-5},"F",null,null,"Input capacitance"]
["CinEsrMax_Vinmax",{"$f":"-(Iout*D1_Vinmax*(1-D1_Vinmax)/(Cin*Fsw)-Vinripple1)/(Iout+Iripple_Vinmax/2)","v":8.6575500919624047E-3},"W"]
["CinEsrMax_50%D",{"$f":"-(Iout*0.5*(1-0.5)/(Cin*Fsw)-Vinripple1)/(Iout+Iripple_Vinmax/2)","v":4.6313366479842919E-3},"W",null,null,"Calculate ESR at Vinmax and 50% duty cycle (Vin = 2*Vout)"]
["CinEsrMax",{"$f":"IF(VIN_max<2*Vout, B138,B139)","v":4.6313366479842919E-3},"W"]
["Reported Cin ESR max",{"$f":"IF(OR(CinEsrMax>0.3, CinEsrMax<0), \"N/A\",CinEsrMax*1000)","v":4.6313366479842921},"mΩ",null,null,"…report this"]
["RCinEsr",{"$f":"'Design the Power Module'!E37/1000","v":1E-3},"W",null,null,"Input capacitance series resistance (ESR)"]
[]
["Vinripple2_Vinmax",{"$f":"Iout*D1_Vinmax_2*(1-D1_Vinmax_2)/(Cin*Fsw)+(Iout +Iripple_Vinmax/2)*RCinEsr","v":4.8850665527272213E-2},"Vp-p"]
["Vinripple2_50%D",{"$f":"Iout*0.5*(1-0.5)/(Cin*Fsw)+(Iout +Iripple_Vinmax/2)*RCinEsr","v":8.4716417401785177E-2},"Vp-p",null,null,"Calculate ripple at Vinmax and 50% duty cycle (Vin = 2*Vout)"]
["Vinripple2",{"$f":"IF(VIN_max<2*Vout, B144,B145)","v":8.4716417401785177E-2},"Vp-p",null,null,"…report highest of these"]
[]
[null,{"$f":"Iout*D1_Vinmax_2*(1-D1_Vinmax_2)/(Cin*Fsw)","v":3.9134248125487034E-2},"Vp-p"]
[]
["Step ?: Other Components - MODE"]
[]
["RPG1/2",100,"kΩ"]
["RFB1/2",null,"W",null,"Tie to VDDA or AGND for 3.3V/5V output, respectively. "]
["R_MODE",null,"W",null,"Tie to VDDA or AGND for Single/Dual operation, respectively. "]
["R_DEMB",null,"W",null,"Tie to VDDA or AGND for FPWM/DEM, respectively. "]
[]
[]
["Step 5: Feedback Network and Internal Compensation"]
["Pi",3.1415926500000002,null,"p"]
["CS Amp Gain (effective value)",3.4140000000000001,null,null,null,"Effective CS gain - depending on control architecture"]
["Ri",{"$f":"CHOOSE(GPN, 0.139, 0.139*9.3/Ipk_OCP, 0.139*9.3/Ipk_OCP, 0.139*9.3/Ipk_OCP)","v":0.20850000000000002},"W",null,null,"Current Sense effective resistance = shunt resistor Rs * CS amp gain"]
[]
["Se_ext",{"$f":"B167/Ri*1000","v":3600000},"A/s",null,null,"Slope comp slope - referred to inductor current"]
["Sn",{"$f":"(Vin-Vout)/Lf","v":30173098.300778165},"A/s",null,null,"On-time Slope"]
["Sf",{"$f":"Vout/Lf","v":7940289.0265205698},"A/s",null,null,"Off-time Slope"]
[]
["Se_int",{"$f":"6*0.6*Ri*Fsw/1000","v":750.6},"mV/μs",null,null,"Slope comp slope - referred to IC"]
["Sn_int",{"$f":"Sn*Ri/1000","v":6291.0909957122476},"mV/μs",null,null,"Upslope"]
["Sf_int",{"$f":"Sf*Ri/1000","v":1655.5502620295388},"mV/μs",null,null,"Downslope"]
[]
["mc_buck",{"$f":"1+Se_ext/Sn","v":1.1193115789473684},null,null,null,"mc = 1 + Se/Sn for peak current-mode buck"]
["k_buck",{"$f":"mc_buck*(1-D1_Vinnom_2)","v":0.85992002627170949},null,null,null,"mc*(1-d)"]
[]
["mc",{"$f":"1+Se_ext/Sn","v":1.1193115789473684}]
["k",{"$f":"mc_buck*(1-D1_Vinnom_2)","v":0.85992002627170949}]
["Q",{"$f":"1/Pi/(k-0.5)","v":0.88439059600205583},null,null,null,"1/(Pi*(k-0.5))",null,"Q = 2/Pi = 0.636 gives ideal one-cycle damping"]
[]
["Error Amp (EA)"]
["gm",{"$f":"14.75/1000000*1","v":1.4749999999999999E-5},"S",null,null,"Error Amp Transconductance"]
["GBW",6,"MHz",null,null,"EA gain-bandwidth product"]
["Cbw",{"$f":"gm/(2*Pi*GBW*1000000)","v":3.9125590221465103E-13},"F",null,null,"EA effective bandwidth limiting capacitance = gm/(2*Pi*GBW)"]
[]
["RoEA",{"$f":"118300000","v":118300000},"W",null,null,"EA output resistance"]
["AEA",{"$f":"gm*RoEA","v":1744.925},"V/V",null,null,"EA DC gain = gm*RoEA"]
["Afb",{"$f":"Vref/Vout","v":0.2},"V/V",null,null,"Feedback gain from Vout to FB"]
["Acs",{"$f":"1/Ri","v":4.796163069544364},null,null,null,"Acs = 1/Ri"]
["Am_buck",{"$f":"(Ro/Number_of_Phases)/Ri/((1+Ro/Number_of_Phases*(k-0.5)/(Fsw*Lf)))","v":2.7072894454506828}]
["Am",{"$f":"Ro/Ri/((1+Ro*(k-0.5)/(Fsw*Lf)))","v":2.7072894454506828},null,null,null,"Buck modulator gain"]
[]
["Scaling factor to calculate Rcomp - buck",{"$f":"2*Pi*Ri/gm","v":88816.551528813579},null,null,null,"2*Pi*Ri/gm -- scaling factor to calculate Rcomp given desired buck crossover frequency"]
["DC Gain is Adc = AEA*Afb*Am"]
[]
["Rout",{"$f":"Rout","v":0.83333333333333337},"W",null,null,"Output Resistance (Load)"]
[]
["Fp_load_buck",{"$f":"1/(2*Pi*Ro*Cout)+(k-0.5)/(2*Pi*Fsw*Lf*Cout)","v":5639.0945751864101},"Hz",null,null,"Buck dominant pole frequency -- note slope comp influence"]
["Fp_dominant",{"$f":"Fload_u","v":5639.0945751864101},"Hz"]
["Cbw",{"$f":"Cbw","v":3.9125590221465103E-13},"F",null,null,"Cbw"]
["Fp_EA",{"$f":"1/(2*Pi*(RoEA+Rcea1_u)*Cc1ea_u)","v":74.177359840490496},"Hz",null,null,"Error Amp LF pole -- related to amplifier ouptut resistance and comp cap"]
["Fp_HF",{"$f":"1/(2*Pi*Rcea1_u*(Cc2ea_u+Cbw))","v":451977.40112994361},"Hz",null,null,"Error Amp HF pole cancels zero related to Output Cap ESR"]
["Fesr",{"$f":"1/(2*Pi*Cout*Cout_ESR)","v":1591549.4327375637},"Hz",null,null,"Cout ESR zero frequency"]
["F_mod",{"$f":"Fsw/2","v":500000},"Hz",null,null,"Zero-order sample-and-hold effects of current-mode control modeled as double pole at Fsw/2"]
["Fz_ff",{"$f":"IF(NO_FF_CAP=TRUE, 1000000000, 1/(2*Pi*Rfb2_u*Cff_u*0.000000000001))","v":179958.09958588463},"Hz"]
["Fp_ff",{"$f":"IF(NO_FF_CAP=TRUE, 1000000000, 1/(2*Pi*Rfb4_u*Cff_u*0.000000000001))","v":903389.65992114111},"Hz"]
[]
["Desired Crossover Frequency",{"$f":"'Design the Power Module'!E24*1000","v":80000},"Hz"]
["Cout - for the Fc spec",{"$f":"Rcea1_u/Fcross/(2*Pi*Ri/(gm*Afb))*1000000","v":25.333115970732802},"uF",null,null,"Output cap to meet the crossover frequeny spec"]
["Rcea1",{"$f":"Fcross*Cout*2*Pi*Ri/(gm*Afb)","v":1776331.0305762715},"W",null,null,"This component will largely determine the crossover frequency",null,null,null,null,{"$f":"Fcross/Fp_dominant/(gm*Afb*Am)","v":1776331.0305762715}]
["Cc1ea, Cc3ea",{"$f":"10/(Rcea1*Fcross*2*Pi)","v":1.1199696209081863E-11},"F",null,null,"This along with Rcea1 will set a zero at Fcrossover/5 to optimize phase margin"]
["Cc2ea, Cc4ea",{"$f":"MAX(1/(Rcea1*2*Pi*Fesr)-Cbw, 1/(Rcea1*2*Pi*(Fsw/2))-Cbw)","v":-2.1206076286934121E-13},"F",null,null,"This along with Rcea1 places a pole at the output cap ESR zero"]
[]
[]
["Rcea1_u",{"$f":"900000","v":900000},"W",null,null,{"$f":"1/(Rcea1*2*Pi*(Fsw/2))-Cbw","v":-2.1206076286934121E-13}]
["Cc1ea_u",{"$f":"0.000000000018","v":1.7999999999999999E-11},"F"]
["Cc2ea_u",{"$f":"0","v":0},"F"]
[]
["Resulting Pole/Zero Locations",null,null,null,null,{"$f":"Cout","v":5.0000000000000002E-5},{"$f":"Cout_ESR","v":2E-3}]
["Fz1",{"$f":"1/(2*Pi*Rcea1_u*Cc1ea_u)","v":9824.3792144294057},"Hz",null,null,"This zero is set at or close to the dominant load pole"]
["Fp2",{"$f":"1/(2*Pi*Rcea1_u*(Cc1ea_u*(Cc2ea_u+Cbw)/(Cc1ea_u+Cc2ea_u+Cbw)))","v":461801.78034437296},"Hz",null,null,"This pole cancels the zero from the Output Cap ESR"]
[]
["Rfb1",{"$f":"'Design the Power Module'!E42*1000","v":10000},"W",null,null,"Lower Feedback Resistance - chosen by user"]
["Rfb2",{"$f":"IF(Vout=Vref,0,(Vout-Vref)*B220/Vref)","v":40000},"W",{"$f":"Rfb2_u","v":40200},null,"Upper Feedback Resistance"]
["Rfb2_u",{"$f":"IF(Vout=Vref,\"N/A\",'Standard Value Calculator'!O11)","v":40200},"W",null,null,"Std Value Upper Feedback Resistance"]
["Cff",{"$f":"1/(2*Pi*200000)/Rfb2_u","v":1.979539095444731E-11},"F",{"$f":"1/(1/Rfb1_+1/Rfb2_u)","v":8007.9681274900395},"W","Based on a 200kHz zero frequency"]
["Cff_u",{"$f":"IF('Design the Power Module'!E44<0.1, 0.1, 'Design the Power Module'!E44)","v":22},"pF"]
[]
[]
["Step 6: UVLO Divider"]
["VIN UVLO turn-on voltage",{"$f":"'Design the Power Module'!E47","v":8.9},"V"]
["VIN UVLO turn-off voltage",{"$f":"'Design the Power Module'!E51","v":6.4018943999999998},"V"]
["Rent",{"$f":"'Design the Power Module'!E48*1000","v":604000},"W"]
["Renb",{"$f":"B230*(1.263/(B228-1.263))","v":99888.961634149513},"W"]
["Renb_u",{"$f":"'Standard Value Calculator'!O7","v":100000},"W"]
[]
["Step 7: Efficiency"]
["VAR",0]
["Design"]
["Ta",{"$f":"'Design the Power Module'!E13","v":25},"°C","Ambient Temperature"]
["Components"]
["LTc",{"$f":"3930/1000000","v":3.9300000000000003E-3},"%/°C","Inductor DCR Temp Co"]
["θCA",22,"°C/W","Inductor Core-to-Ambient Thermal Resistance"]
["RCinEsr",{"$f":"RCinEsr","v":1E-3},"W","Input Capacitor ESR"]
[]
["Controller Characteristics"]
["VCC",3.3,"V"]
["Top Driver"]
["RdsonDRT",0.5,"W","Drain-Source Resistance of Pullup High-side FET Driver"]
["RdsonDRT2",0.5,"W","Drain-Source Resistance of Pulldown High-side FET Driver"]
["Bottom Driver"]
["RdsonDRB",0.5,"W","Drain-Source Resistance of Pullup Low-side FET Driver"]
["RdsonDRB2",0.5,"W","Drain-Source Resistance of Pulldown Low-side FET Driver"]
["Deadtime"]
["Deadtime",8.0000000000000005E-9,"s","Total Deadtime",null,null,"8ns"]
["IQ"]
["IQ ",3.4999999999999997E-5,"A","Quiescent Current of LM5143-Q1 Controller (One channel disabled)"]
[]
["High- & low-side MOSFETs - Ch1","Q1: high-side",null,"Q2: low-side"]
["Rdson",{"$f":"'MOSFET Parameters'!E6/1000","v":4.1000000000000002E-2},"W",{"$f":"'MOSFET Parameters'!F6/1000","v":2.1000000000000001E-2},"W","Drain-Source Resistances of Channel 1 FETs"]
["RdsonTopTc",{"$f":"4000/1000000","v":4.0000000000000001E-3},"%/°C",4.0000000000000001E-3,"%/°C","Drain-Source Resistance Temp Co"]
["Qg",{"$f":"'MOSFET Parameters'!E7/1000000000","v":3E-9},"C",{"$f":"'MOSFET Parameters'!F7/1000000000","v":6E-9},"C","Gate Charge at VCC = 5V"]
["Qgd",{"$f":"'MOSFET Parameters'!E8/1000000000","v":1.0000000000000001E-9},"C",{"$f":"'MOSFET Parameters'!F8/1000000000","v":2.0000000000000001E-9},"C","Gate to Drain Charge"]
["Qgs",{"$f":"'MOSFET Parameters'!E9/1000000000","v":1.0000000000000001E-9},"C",{"$f":"'MOSFET Parameters'!F9/1000000000","v":2.0000000000000001E-9},"C","Gate to Source Charge"]
["Qoss",{"$f":"'MOSFET Parameters'!E10/1000000000","v":0},"C",{"$f":"'MOSFET Parameters'!F10/1000000000","v":2.0000000000000001E-9},"C","Output Charge"]
["Coss",{"$f":"'MOSFET Parameters'!E11/1000000000000","v":1E-10},"F",{"$f":"'MOSFET Parameters'!F11/1000000000000","v":2.0000000000000001E-10},"F","Output Capacitance"]
["Rgate",{"$f":"'MOSFET Parameters'!E12","v":1},"W",{"$f":"'MOSFET Parameters'!F12","v":1},"W","Gate Resistance"]
["Gfs",{"$f":"'MOSFET Parameters'!E13","v":100},"S",{"$f":"'MOSFET Parameters'!F13","v":100},"S","Transconductance"]
["Vth",{"$f":"'MOSFET Parameters'!E14","v":1.5},"V",{"$f":"'MOSFET Parameters'!F14","v":1.5},"V","Threshold Voltage"]
["Vsp",{"$f":"Vth_Q1+(Iout/Number_of_Phases)/Gfs_Q1","v":1.56},"V",{"$f":"Vth_Q2+Iout/Gfs_Q2","v":1.56},"V","Switch Point Voltage of FETs"]
[]
["Vsd - Buck",{"$f":"'MOSFET Parameters'!E15","v":0.7},"V",{"$f":"'MOSFET Parameters'!F15","v":0.7},"V","Diode Forward Voltage of MOSFET Body diode"]
["QrrTop",null,"C",{"$f":"'MOSFET Parameters'!F16/1000000000","v":3E-9},"C","Reverse Recovery Charge of Body Diode"]
["TrrTop",4.0000000000000001E-8,"s",4.0000000000000001E-8,"s","Reverse Recovery Time of Body Diode"]
["θJA-MOSFET",{"$f":"'MOSFET Parameters'!E17","v":22},"°C/W",{"$f":"'MOSFET Parameters'!F17","v":22},"°C/W","Junction-to-Ambient Thermal Resistance"]
[]
[]
["Controller"]
["θJACtrl",22,"°C/W",null,null,"Junction-to-ambient thermal resistance of controller"]
["Outputs"]
["Top FET"]
["Tr",{"$f":"(Qgd_Q1+Qgs_Q1/2)*(RdsonDRT+Rgate1)/(VCC-Vsp_Q1)","v":1.2931034482758624E-9},"s"]
["Tf",{"$f":"(Qgd_Q1+Qgs_Q1/2)*(RdsonDRT2+Rgate1)/(Vsp_Q1)","v":1.4423076923076925E-9},"s"]
[]
["IC Power Disipation","Value","Units"]
["Power Dis",{"$f":"'Efficiency Calculations'!AT109","v":7.4811400587932875},"W"]
["Temp rise",{"$f":"B283*ThetaJaCtrl","v":164.58508129345233},"°C"]
["Junction temperature",{"$f":"B284 + Ta","v":189.58508129345233},"°C"]
[]
["Current (switching)",{"$f":"(Qg_Q1+Qg_Q2)*Fsw+Iq","v":9.0349999999999996E-3},"A"]
["Qrr Current",{"$f":"Qrr_Q2*Fsw","v":3.0000000000000001E-3},"A"]
[]
[]
[]
["Low-side MOSFET/Diode"]
["Part Power"]
["Power Dis"]
[]
["SCHEMATIC LABELS"]
[{"$f":"\"RFBT = \"&'Design the Power Module'!E43&\"kΩ\"","v":"RFBT = 40.2kΩ"},{"$f":"IF(VARIANT<5, 'Design the Power Module'!E43&\" kΩ\", \"\")","v":"40.2 kΩ"},null,{"$f":"'Design the Power Module'!E43&\"kΩ\"","v":"40.2kΩ"}]
[{"$f":"\"RFBB = \"&'Design the Power Module'!E42&\"kΩ\"","v":"RFBB = 10kΩ"},{"$f":"IF(VARIANT<5, 'Design the Power Module'!E42&\" kΩ\", \"\")","v":"10 kΩ"},null,{"$f":"'Design the Power Module'!E42&\"kΩ\"","v":"10kΩ"}]
[{"$f":"\"CFF = \"&'Design the Power Module'!E44&\"pF\"","v":"CFF = 22pF"},{"$f":"IF(VARIANT< 5, IF(NO_FF_CAP=TRUE,\"N/A\",IF(Cff_u>0.1,ROUND(Cff_u,1)&\" pF\",\"N/A\")), \"\")","v":"22 pF"},null,{"$f":"IF(Cff_u>0, ROUND(Cff_u,1), \"N/A\")","v":22}]
[]
[{"$f":"\"RRT = \"&'Design the Power Module'!E12&\"kΩ\"","v":"RRT = 13kΩ"},{"$f":"'Design the Power Module'!E12&\" kΩ\"","v":"13 kΩ"},null,{"$f":"'Design the Power Module'!E12&\"kΩ\"","v":"13kΩ"}]
[{"$f":"\"RENT = \"&'Design the Power Module'!E48&\"kΩ\"","v":"RENT = 604kΩ"},{"$f":"'Design the Power Module'!E48&\" kΩ\"","v":"604 kΩ"},null,{"$f":"'Design the Power Module'!E48","v":604}]
[{"$f":"\"RENB = \"&Renb_u/1000&\"kΩ\"","v":"RENB = 100kΩ"},{"$f":"Renb_u/1000&\" kΩ\"","v":"100 kΩ"},null,{"$f":"Renb_u/1000","v":100}]
["RPG",{"$f":"CHOOSE(GPN, Renb_u/1000&\" kΩ\", Renb_u/1000&\" kΩ\", \"\", \"\")","v":""}]
[{"$f":"\"Rdcr = \"&Rdcr*1000&\"mΩ\"","v":"Rdcr = 68mΩ"},{"$f":"Rdcr*1000&\"mΩ\"","v":"68mΩ"},null,{"$f":"IF(MODE=1, Rdcr2*1000&\"mΩ\", Rdcr*1000&\"mΩ\")","v":"0mΩ"}]
[]
[{"$f":"\"VOUT = \"&'Design the Power Module'!E9&\" V\"","v":"VOUT = 5 V"},{"$f":"'Design the Power Module'!E9&\" V\"","v":"5 V"},null,{"$f":"IF(MODE=1, 'Design the Power Module'!J10&\"V\", \"\")","v":"V"}]
[]
[{"$f":"\"COUT = \"&'Design the Power Module'!$E$26&\" µF\"","v":"COUT = 50 µF"},{"$f":"ROUND('Design the Power Module'!$E$26, 0)&\" µF\"","v":"50 µF"},null,{"$f":"IF(MODE=1, 'Design the Power Module'!$J$40&\"µF\", ROUND('Design the Power Module'!$E$26/Number_of_Phases, 0)&\"µF\")","v":"µF"},{"$f":"ROUND('Design the Power Module'!$E$26, 0)","v":50}]
["Capacitance per component (Cout)",{"$f":"\"22µF\"","v":"22µF"}]
["# of output caps",{"$f":"ROUNDUP(Cout*1000000/22,0)&\" x\"","v":"3 x"}]
[]
["CIN",{"$f":"Cin/2*1000000&\" µF\"","v":"10 µF"},{"$f":"Cin*1000000&\" µF\"","v":"20 µF"}]
["Capacitance per component (Cin)",{"$f":"\"10 µF\"","v":"10 µF"}]
["# of input caps",{"$f":"ROUNDUP(Cin*1000000/10,0)&\" x\"","v":"2 x"}]
[]
[{"$f":"\"CVCC = 1µF\"","v":"CVCC = 1µF"},{"$f":"CHOOSE(GPN, \"\", \"\", \"1 µF\", \"1 µF\")","v":"1 µF"},null,{"$f":"IF(MODE=1, 'Design the Power Module'!$J$40&\"µF\", ROUND('Design the Power Module'!$E$26/Number_of_Phases, 0)&\"µF\")","v":"µF"}]
[]
[{"$f":"\"RC1 = \"&Rcea1_u/1000&\"kΩ\"","v":"RC1 = 900kΩ"},{"$f":"ROUND(Rcea1_u/1000,2)&\" kΩ\"","v":"900 kΩ"}]
[{"$f":"\"CC1 = \"&Cc1ea_u*10^9&\"nF\"","v":"CC1 = 0.018nF"},{"$f":"Cc1ea_u*10^9&\" nF\"","v":"0.018 nF"}]
[{"$f":"\"CC2 = \"&IF(Cc2ea_u>0, Cc2ea_u*10^12&\"pF\", \"OPEN\")","v":"CC2 = OPEN"},{"$f":"IF(Cc2ea_u>0, ROUND(Cc2ea_u*10^12,1)&\" pF\", \"N/A\")","v":"N/A"}]
[]
[{"$f":"\"gm = \"&$B$179*1000&\"mS\"","v":"gm = 0.01475mS"},{"$f":"$B$179*1000&\"mS\"","v":"0.01475mS"}]
[{"$f":"\"RoEA = \"&RoEA/1000000&\"MΩ\"","v":"RoEA = 118.3MΩ"},{"$f":"RoEA/1000000&\"MΩ\"","v":"118.3MΩ"}]
[{"$f":"\"GBW = \"&GBW&\"MHz\"","v":"GBW = 6MHz"},{"$f":"GBW&\"MHz\"","v":"6MHz"}]
[]
[{"$f":"\"RPGOOD = 100 kΩ\"","v":"RPGOOD = 100 kΩ"},{"$f":"CHOOSE(GPN, \"100 kΩ\", \"100 kΩ\", \"\", \"\")","v":""}]
[{"$f":"\"RFB2 = \"&'Design the Power Module'!E42&\"kΩ\"","v":"RFB2 = 10kΩ"},{"$f":"IF(VOUT_setting=1, 'Design the Power Module'!E42&\"kΩ\", \"\")","v":{"$error":"#NAME?"}},null,{"$f":"'Design the Power Module'!#REF!&\"kΩ\"","v":{"$error":"#REF!"}}]
[{"$f":"\"RFB1 = \"&IF(Vout=Vref,\"OPEN\",'Design the Power Module'!E43&\"kΩ\")","v":"RFB1 = 40.2kΩ"},{"$f":"IF(VOUT_setting=1, IF(Vout=Vref,\"OPEN\",Rfb2_u/1000&\"kΩ\"), \"\")","v":{"$error":"#NAME?"}},null,{"$f":"IF(Vout2=Vref,\"OPEN\",Rfb4_u/1000&\"kΩ\")","v":"8.00796812749004kΩ"}]
[{"$f":"CHOOSE(BODE_PLOT_TYPE, \"Crossover Frequency = \"&ROUND('Stability Calculations'!Q4,1)&\" kHz\",  \"Crossover Frequency = \"&ROUND(#REF!,1)&\" kHz\")","v":"Crossover Frequency = 41.9 kHz"},{"$f":"CHOOSE(BODE_PLOT_TYPE, ROUND('Stability Calculations'!Q4,1)&\" kHz\", ROUND(#REF!,1)&\" kHz\")","v":"41.9 kHz"},null,{"$f":"'Stability Calculations'!Q4","v":41.929749999999999}]
[{"$f":"CHOOSE(BODE_PLOT_TYPE, \"Phase Margin = \"&ROUND('Stability Calculations'!Q5,0)&\"°\", \"Phase Margin = \"&ROUND(#REF!,0)&\"°\")","v":"Phase Margin = 73°"},{"$f":"CHOOSE(BODE_PLOT_TYPE, ROUND('Stability Calculations'!Q5,0)&\"°\", ROUND(#REF!,0)&\"°\")","v":"73°"}]
[]
["Full-load/high line efficiency",{"$f":"ROUND('Efficiency Calculations'!AZ109,1)&\"%\"","v":"80%"}]
["Half-load/mid-line efficiency",{"$f":"ROUND('Efficiency Calculations'!AZ59,1)&\"%\"","v":"85.5%"}]
[]
[]
["Rpgood","100 kΩ"]
[]
[]
["Rt",{"$f":"IF(No_RT,\"\", Rfadj&\"kΩ\")","v":""},{"$f":"Rfadj","v":13},{"$f":"Fsw","v":1000000},{"$f":"'Design the Power Module'!K85&\"kΩ\"","v":"kΩ"},{"$f":"OR((Fsw=440000),(Fsw=2200000))","v":false},null,{"$f":"OR(OR(AND(OSC=1, OR(Fsw/1000>2530, Fsw/1000<1800)), AND(OSC=2, OR(Fsw/1000>500, Fsw/1000<300))), OR((Fsw=440000),(Fsw=2200000)))","v":true}]
[]
["Blank out",{"$f":"IF(B80=\"y\",\"\",\"|\")","v":"|"}]
["OUTPUT CURRENT",{"$f":"'Design the Power Module'!$E$10&\" A\"","v":"6 A"},null,{"$f":"IF(MODE=1,'Design the Power Module'!$J$11&\"A\",\"\")","v":"A"}]
["VIN",{"$f":"VIN_nom&\" V\"","v":"24 V"}]
["VIN range",{"$f":"VIN_min&\" V\"&\"...\"&VIN_max&\" V\"","v":"12 V...36 V"}]

{"sheet":"MOSFET Parameters","index":4,"n_rows":17,"n_cols":7,"rows_kept":17,"cut":false,"hidden":true,"merged":[]}
[]
[]
["MOSFET Parameters"]
[null,null,null,null,"Internal Power MOSFETs"]
[null,null,null,null,"High-side","  Low-side"]
[null,null,null,"On-State Resistance, RDS(on) ",41,21,"mΩ"]
[null,null,null,"Total Gate Charge, QG ",3,6,"nC"]
[null,null,null,"Gate-Drain Charge, QGD ",1,2,"nC"]
[null,null,null,"Gate-Source Charge, QGS ",1,2,"nC"]
[null,null,null,"Output Charge, QOSS ",null,2,"nC"]
[null,null,null,"Output Capacitance, COSS ",100,200,"pF"]
[null,null,null,"Gate Resistance, RGATE ",1,1,"Ω"]
[null,null,null,"Transconductance, gFS ",100,100,"S"]
[null,null,null,"Gate-Source Miller Plateau Voltage, VTH ",1.5,1.5,"V"]
[null,null,null,"Body Diode Forward Voltage, VBD ",0.7,0.7,"V"]
[null,null,null,"Body Diode Rev Recovery Charge, QRR ",null,3,"nC"]
[null,null,null,"Thermal Resistance, θJA ",22,22,"°C/W"]

{"sheet":"Schematic Management","index":5,"n_rows":15,"n_cols":2,"rows_kept":15,"cut":false,"hidden":true,"merged":[]}
[{"$f":"VARIANT","v":3}]
[{"$f":"CHOOSE(VARIANT, \"TPSM63606\", \"TPSM63604\", \"TPSM63603\", \"TPSM63602\", \"TPSM63603V5\", \"TPSM63603V3\")","v":"TPSM63603"}]
[]
[]
[]
[]
[]
[]
[]
[]
[]
[]
[]
[]
[null," "]

{"sheet":"Stability Calculations","index":6,"n_rows":687,"n_cols":35,"rows_kept":687,"cut":false,"hidden":true,"merged":[[9,1,10,1],[1,0,1,3],[1,9,1,11],[1,12,1,14],[9,0,11,0],[10,6,10,7],[1,4,1,6],[9,2,9,7],[9,8,9,13],[10,2,10,3],[10,4,10,5],[10,8,10,9],[10,10,10,11],[10,12,10,13],[9,20,9,22],[10,14,10,15],[10,16,10,17],[9,27,9,28],[9,30,9,31],[10,18,10,19],[9,18,9,19]]}
[]
["Divider Network & EA Poles/Zeros",null,null,null,"Modulator",null,null,null,null,"Power Stage Poles/Zeros",null,null,"Complex Pole Pair",null,null,"Total System"]
[null,"Afb1",{"$f":"Afb","v":0.2},"V/V","Acs",{"$f":"Acs","v":4.796163069544364},"A/V","gm",{"$f":"gm","v":1.4749999999999999E-5},"z_ESR",{"$f":"Fesr","v":1591549.4327375637},"Hz","p3",{"$f":"Fsw/2","v":500000},"Hz","Adc",{"$f":"Am*Afb*AEA","v":944.80340712060661},"V/V"]
[null,"EA zero, z1",{"$f":"Fz1_u","v":9824.3792144294057},"Hz","Am",{"$f":"Am","v":2.7072894454506828},"V/V",null,null,"p_dom",{"$f":"Fp_dominant","v":5639.0945751864101},"Hz","pterm1",{"$f":"Q*pole3","v":442195.2980010279},null,"Crossover",{"$f":"AI7","v":41.929749999999999},"kHz"]
[null,"EA pole, p1",{"$f":"Fp1_u","v":74.177359840490496},"Hz","Q",{"$f":"Q","v":0.88439059600205583},null,null,null,null,null,null,"pterm2",{"$f":"pole3^2","v":250000000000},null,"Phase Margin",{"$f":"AI9","v":72.530957607530155},"°"]
[null,"Aea",{"$f":"AEA","v":1744.925},"V/V","mc",{"$f":"mc","v":1.1193115789473684},null,"FF zero, z5",{"$f":"Fz_ff","v":179958.09958588463},null,null,null,null,null,null,"radconv",{"$f":"180/Pi","v":57.295779578552292},null,null,null,null,null,null,null,null,null,null,null,null,null,null,null,null,"XOVER SEARCH"]
[null,"EA pole, p2",{"$f":"Fp2_u","v":451977.40112994361},"Hz","k",{"$f":"k","v":0.85992002627170949},null,"FF pole, p5",{"$f":"Fp_ff","v":903389.65992114111},null,null,null,null,null,null,null,null,null,null,null,null,null,null,null,null,null,null,null,null,null,null,null,null,"xover",{"$f":"SUM(AH12:AH613)/1000","v":41.929749999999999}]
[]
[null,null,null,null,null,null,null,null,null,null,null,null,null,null,null,null,null,null,null,null,null,null,null,null,null,null,null,null,null,null,null,null,null,"phase margin",{"$f":"SUM(AI13:AI613)","v":72.530957607530155}]
["Freq (Hz)",null,"Power Stage",null,null,null,null,null,"Error Amplifier",null,null,null,null,null,null,"FF Network",null,null,"Sampling Double Pole",null,"System Response",null,null,null,null,null,null,"ERROR AMP Response",null,null,"PLANT Response"]
[null,null,"p_dom",null,"z_ESR",null,"z_RHP",null,"p1",null,"z1",null,"p2",null,"z3",null,"p3",null,"p3"]
[null,null,"Gain(V/V)","Phase(rad)","Gain(V/V)","Phase(rad)","Gain(V/V)","Phase(rad)","Gain(V/V)","Phase(rad)","Gain(V/V)","Phase(rad)","Gain(V/V)","Phase(rad)","Gain(V/V)","Phase(rad)","Gain(V/V)","Phase(rad)","Gain(V/V)","Phase(rad)","Gain (dB)","Phase (°)","Phase Margin (°)",null,null,"Fsquare",null,"Gain(dB)","Phase(Deg)",null,"Gain(dB)","Phase(Deg)"]
[1,{"$f":"A13/1000","v":1E-3},{"$f":"SQRT(1+(A13/pole1)^2)","v":1.0000000157235731},{"$f":"ATAN(A13/pole1)","v":1.7733343113589495E-4},{"$f":"SQRT(1+(A13/Zero1)^2)","v":1.0000000000001974},{"$f":"ATAN(A13/Zero1)","v":6.2831852999991738E-7},{"$f":"IF(VIN_nom>Vout, 1, SQRT(1+(A13/z_RHP)^2))","v":1},{"$f":"IF(VIN_nom>Vout, 0, -ATAN(A13/z_RHP))","v":0},{"$f":"SQRT(1+(A13/Pole2)^2)","v":1.0000908672803697},{"$f":"ATAN(A13/Pole2)","v":1.3480385764824765E-2},{"$f":"SQRT(1+(A13/Zero2)^2)","v":1.0000000051803579},{"$f":"ATAN(A13/Zero2)","v":1.0178760150846921E-4},{"$f":"SQRT(1+(A13/pole4)^2)","v":1.0000000000024476},{"$f":"ATAN(A13/pole4)","v":2.2124999999963895E-6},{"$f":"SQRT(1+(A13/Zero3)^2)","v":1.0000000000154392},{"$f":"ATAN(A13/Zero3)","v":5.5568490792628044E-6},{"$f":"SQRT(1+(A13/pole5)^2)","v":1.0000000000006126},{"$f":"ATAN(A13/pole5)","v":1.1069420476728545E-6},{"$f":"SQRT((1-(Z13/pterm2))^2+(A13/pterm1)^2)","v":0.99999999999855704},{"$f":"IF((ATAN((A13/pterm1)/(1-A13^2/pterm2))>0),ATAN((A13/pterm1)/(1-A13^2/pterm2)),PI()+ATAN((A13/pterm1)/(1-A13^2/pterm2)))","v":2.2614442182512098E-6},{"$f":"20*LOG10(((E13*K13*G13*O13)/(C13*I13*S13*M13*Q13))*Adc)","v":59.506039696182704},{"$f":"((F13+L13+H13+R13)-(D13+J13+T13+N13+T13))*radconv","v":-0.77698415484132943},{"$f":"IF(V13>0,V13,V13+180)","v":179.22301584515867},null,{"$f":"IF(U13<0,A13,1000000000)","v":1000000000},{"$f":"A13^2","v":1},null,{"$f":"20*LOG10((K13/(I13*M13))*AEA)","v":64.834746116504917},{"$f":"(L13-(J13+N13))*radconv","v":-0.76666397834771238},null,{"$f":"20*LOG10((E13*G13/(C13*S13))*Acs*Am)","v":22.268572480073839},{"$f":"(F13+H13-(D13+T13))*radconv","v":-1.0254028391728735E-2},null,{"$f":"SUM((U14<0)*(U13>0))*A13","v":0},{"$f":"IF(AH13>0,W11,0)","v":0}]
[1.0965,{"$f":"A14/1000","v":1.0965E-3},1.0000000189046445,1.9444610682814421E-4,1.0000000000002374,6.8895126814489105E-7,1,0,1.0001092498402124,1.4781061860808258E-2,1.0000000062284078,1.1161010497605451E-4,1.0000000000029428,2.4260062499952398E-6,1.0000000000185629,6.0930850153989776E-6,1.0000000000007367,1.2137619552731845E-6,0.99999999999826517,2.4796735853136033E-6,59.505880024768729,-0.85195274776134933,179.14804725223865,null,1000000000,1.2023122500000001,null,64.83458647269245,-0.84063667425972477,null,22.268572452446286,-1.1243542107903876E-2,null,0,0]
[1.2022999999999999,1.2022999999999999E-3,1.0000000227288224,2.1320798325896978E-4,1.0000000000002853,7.5542736861885632E-7,1,0,1.0001313482933727,1.620703045010868E-2,1.0000000074883384,1.2237923310533326E-4,1.0000000000035381,2.660088749993725E-6,1.0000000000223179,6.6809996479670331E-6,1.0000000000008855,1.3308764239168305E-6,0.99999999999791411,2.7189343836062099E-6,59.505688080888234,-0.93414299072722173,179.06585700927278,null,1000000000,1.4455252899999997,null,64.834394561993562,-0.92173504258599581,null,22.268572419233369,-1.2328418278325256E-2,null,0,0]
[1.3183,1.3183000000000001E-3,1.0000000273262317,2.3377866045814767E-4,1.0000000000003431,8.2831231809881071E-7,1,0,1.0001579143059665,1.7770398306901573E-2,1.0000000090030212,1.341865947266482E-4,1.0000000000042537,2.916738749991728E-6,1.0000000000268323,7.3255941411365159E-6,1.0000000000010647,1.4592817014466843E-6,0.99999999999749223,2.9812619129256194E-6,59.505457338062861,-1.0242527042498923,178.9757472957501,null,1000000000,1.7379148900000001,null,64.834163859058947,-1.0106476156819646,null,22.268572379304942,-1.3517885525208176E-2,null,0,0]
[1.4454,1.4454000000000001E-3,1.0000000328493925,2.5631773843738843E-4,1.0000000000004123,9.0817160326175039E-7,1,0,1.0001898288177595,1.9483264278506246E-2,1.0000000108227061,1.4712379866692557E-4,1.0000000000051135,3.1979474999890977E-6,1.0000000000322555,8.0318696590764145E-6,1.0000000000012799,1.5999740357056321E-6,0.99999999999698541,3.2686914730684704E-6,59.505180148200189,-1.1229792546640618,178.87702074533593,null,1000000000,2.0891811599999999,null,64.833886717119611,-1.1080624717278591,null,22.268572331336387,-1.4821172469732868E-2,null,0,0]
[1.5849,1.5849E-3,1.0000000394961688,2.8105575055299681E-4,1.0000000000004958,9.9582203819667106E-7,1,0,1.0002282345741367,2.1363107143172626E-2,1.0000000130125826,1.6132316878842662E-4,1.000000000006148,3.5065912499856265E-6,1.0000000000387821,8.8070501055865641E-6,1.000000000001539,1.7543924513556235E-6,0.99999999999637545,3.5841629415187802E-6,59.504846591094058,-1.2313301016172544,178.76866989838274,null,1000000000,2.51190801,null,64.833553217686159,-1.2149736541477307,null,22.268572273609241,-1.6251609342839975E-2,null,0,0]
[1.7378,1.7378000000000001E-3,1.0000000474843855,3.0817003010280466E-4,1.000000000000596,1.0918919414335663E-6,1,0,1.0002743893608368,2.3423348789453995E-2,1.0000000156444158,1.7688649266745079E-4,1.0000000000073914,3.8448824999810526E-6,1.0000000000466258,9.6566923297421286E-6,1.0000000000018501,1.9236438904442991E-6,0.99999999999564237,3.9299377624951727E-6,59.504445749971843,-1.3500788776147792,178.64992112238522,null,1000000000,3.0199488400000001,null,64.833152445876053,-1.3321444752780327,null,22.26857220423171,-1.7819450165283496E-2,null,0,0]
[1.9055,1.9055000000000001E-3,1.000000057091196,3.3790884371045756E-4,1.0000000000007168,1.1972609589144282E-6,1,0,1.0003298933322702,2.568278281070786E-2,1.0000000188095182,1.9395627291208064E-4,1.0000000000088871,4.2159187499750212E-6,1.0000000000560589,1.0588575920248538E-5,1.0000000000022244,2.1092780718383577E-6,0.99999999999476086,4.3091819579037027E-6,59.503963738342577,-1.4803088371515727,178.51969116284843,null,1000000000,3.63093025,null,64.832670517603091,-1.4606437413769207,null,22.268572120796726,-1.9539050566501806E-2,null,0,0]
[2.0893000000000002,2.0893000000000001E-3,1.0000000686361383,3.7050272460272579E-4,1.0000000000008615,1.3127459047282461E-6,1,0,1.0003965909133921,2.8158831205864671E-2,1.000000022613166,2.1266483336008124E-4,1.0000000000106841,4.6225762499670746E-6,1.0000000000673952,1.1609924780901644E-5,1.0000000000026743,2.3127340201997165E-6,0.99999999999370126,4.7248354052287477E-6,59.503384553722853,-1.623024186653768,178.37697581334623,null,1000000000,4.3651744900000002,null,64.832091433156435,-1.6014622426544765,null,22.268572020529099,-2.142374077001381E-2,null,0,0]
[2.2909000000000002,2.2909000000000002E-3,1.0000000825208122,4.0625313929816326E-4,1.0000000000010361,1.439414920376006E-6,1,0,1.0004767997314541,3.0874272790877361E-2,1.0000000271876723,2.3318521287456526E-4,1.0000000000128453,5.0686162499565941E-6,1.000000000081029,1.2730185555126516E-5,1.0000000000032154,2.5358935370093422E-6,0.99999999999242717,5.1807425596422137E-6,59.502688092127499,-1.7795379015284827,178.22046209847153,null,1000000000,5.2482228100000006,null,64.831395092035521,-1.7558954102357907,null,22.268571899940952,-2.3490952606073003E-2,null,0,0]
[2.5118999999999998,2.5118999999999996E-3,1.000000099210107,4.4544382087788109E-4,1.0000000000012454,1.5782733155056895E-6,1,0,1.0005732017420113,3.3850497061974988E-2,1.0000000326862015,2.5568027154065611E-4,1.0000000000154432,5.5575787499427797E-6,1.0000000000974163,1.39582492014374E-5,1.0000000000038658,2.7805277295434127E-6,0.99999999999089551,5.6805217318944425E-6,59.501851097201751,-1.9510828935274471,178.04891710647254,null,1000000000,6.309641609999999,null,64.83055824191932,-1.9251596436136198,null,22.268571754994714,-2.5757092496689078E-2,null,0,0]
[2.7542,2.7542000000000001E-3,1.0000001192730072,4.8841170231797874E-4,1.0000000000014975,1.7305148953242725E-6,1,0,1.0006890783470879,3.7112878864699328E-2,1.0000000392962138,2.8034340569852242E-4,1.0000000000185665,6.0936674999245735E-6,1.0000000001171165,1.5304673733068193E-5,1.0000000000046474,3.0487397876923755E-6,0.99999999998905442,6.2284696660016318E-6,59.500845123938753,-2.1391218025749406,177.86087819742505,null,1000000000,7.5856176399999997,null,64.829552442737935,-2.1106979744080219,null,22.268571580748777,-2.8241643064691433E-2,null,0,0]
[3.02,3.0200000000000001E-3,1.000000143405267,5.3554691644404524E-4,1.0000000000018003,1.8975219605977226E-6,1,0,1.0008284404400467,4.0690758560215368E-2,1.0000000472469355,3.0739854793477379E-4,1.000000000022323,6.6817499999005609E-6,1.0000000001408125,1.6781684217971022E-5,1.0000000000055878,3.3429649839609328E-6,0.99999999998683986,6.829561539245948E-6,59.499635417583043,-2.3453458603789783,177.65465413962102,null,1000000000,9.1204000000000001,null,64.828342945772832,-2.314178929980145,null,22.268571371160522,-3.0967163131122303E-2,null,0,0]
[3.3113000000000001,3.3113000000000001E-3,1.0000001724043694,5.8720412918454958E-4,1.0000000000021645,2.0805511483859983E-6,1,0,1.0009958825438603,4.4610688418380409E-2,1.0000000568011089,3.3704927327583644E-4,1.000000000026837,7.3262512498689221E-6,1.0000000001692873,1.8400394354275685E-5,1.0000000000067177,3.6654172024442049E-6,0.99999999998417866,7.4883202400665028E-6,59.498182190697023,-2.5712856297840814,177.42871437021591,null,1000000000,10.964707690000001,null,64.826889970505974,-2.5371124328750256,null,22.268571119303836,-3.3954160699262326E-2,null,0,0]
[3.6307999999999998,3.6308E-3,1.0000002072792631,6.4386213954457114E-4,1.0000000000026021,2.2812989187200426E-6,1,0,1.0011972146444768,4.8908515162809578E-2,1.000000068291147,3.6957040800769664E-4,1.0000000000322657,8.033144999827201E-6,1.0000000002035316,2.0175807634457446E-5,1.0000000000080767,4.0190851866706015E-6,0.99999999998097822,8.2108516678560908E-6,59.496435154923624,-2.8190074370538736,177.18099256294613,null,1000000000,13.182708639999998,null,64.825143237334757,-2.7815369449518883,null,22.268570816416016,-3.7230321573634727E-2,null,0,0]
[3.9811000000000001,3.9811000000000004E-3,1.000000249205353,7.0598201280582234E-4,1.0000000000031286,2.5013988997777836E-6,1,0,1.0014391995962415,5.3618572040883904E-2,1.000000082104304,4.0522659958428078E-4,1.0000000000387921,8.8081837497722078E-6,1.0000000002446998,2.2122371866071962E-5,1.00000000000971,4.406846985963674E-6,0.99999999997713074,9.0030355775867429E-6,59.494335823499405,-3.090490431139262,176.90950956886073,null,1000000000,15.849157210000001,null,64.823044269694464,-3.0494047827966781,null,22.268570452288703,-4.0822306134136649E-2,null,0,0]
[4.3651999999999997,4.3651999999999996E-3,1.0000002996121875,7.7409574708976552E-4,1.0000000000037614,2.7427360471491227E-6,1,0,1.0017300555170199,5.8780353016280706E-2,1.0000000987115658,4.443232103993789E-4,1.0000000000466387,9.6580049996997065E-6,1.0000000002941951,2.4256757596290185E-5,1.0000000000116742,4.832023426465911E-6,0.99999999997250488,9.8716563019192769E-6,59.491813184842457,-3.3880112942071534,176.61198870579284,null,1000000000,19.054971039999998,null,64.820522068407058,-3.3429616681712644,null,22.268570014506295,-4.4760876341500354E-2,null,0,0]
[4.7862999999999998,4.7862999999999994E-3,1.0000003602060492,8.4877080652129245E-4,1.0000000000045219,3.0073209801299339E-6,1,0,1.0020795805790506,6.4435752239928507E-2,1.0000001186750918,4.8718596023795919E-4,1.0000000000560707,1.058968874960415E-5,1.0000000003536935,2.659674674207792E-5,1.0000000000140352,5.2981567227291724E-6,0.99999999996694422,1.0823950462360068E-5,59.48878266816746,-3.7139851519811109,176.28601484801888,null,1000000000,22.908667689999998,null,64.81749207749229,-3.6645897023979943,null,22.268569488249778,-4.9078844923015098E-2,null,0,0]
[5.2481,5.2481000000000003E-3,1.0000004330672649,9.3066332100665277E-4,1.0000000000054365,3.2974784772810484E-6,1,0,1.0024997063825167,7.0633000157117709E-2,1.0000001426802763,5.341914625090759E-4,1.0000000000674125,1.161142124947816E-5,1.0000000004252374,2.9162899644911861E-5,1.0000000000168743,5.8093425603289281E-6,0.9999999999602579,1.1868285402527223E-5,59.48514141416058,-4.0711924805381106,175.92880751946188,null,1000000000,27.542553609999999,null,64.813851455686859,-4.0170311771179046,null,22.268568855451573,-5.3814151566639865E-2,null,0,0]
[5.7544000000000004,5.7544000000000007E-3,1.0000005206564215,1.0204471526235454E-3,1.0000000000065361,3.6155961490162457E-6,1,0,1.0030045222291244,7.7421170716830356E-2,1.0000001715377962,5.857265091603614E-4,1.0000000000810469,1.2731609999312092E-5,1.0000000005112428,3.1976332331140566E-5,1.0000000000202871,6.3697873190451255E-6,0.99999999995221989,1.3013254610463955E-5,59.480768164160729,-4.4624625465966208,175.53753745340339,null,1000000000,33.113119360000006,null,64.809478965679631,-4.4030761426630134,null,22.268568094741553,-5.9005761296041584E-2,null,0,0]
[6.3095999999999997,6.3095999999999994E-3,1.000000625971798,1.1189025618895225E-3,1.0000000000078584,3.9644385968672308E-6,1,0,1.0036111661351992,8.4856731221851264E-2,1.0000002062354791,6.4223896439421623E-4,1.0000000000974407,1.3959989999093149E-5,1.0000000006146541,3.5061494936510343E-5,1.0000000000243907,6.9843615438859265E-6,0.99999999994255528,1.4268808440748937E-5,59.475515681788018,-4.8910509937357887,175.1089490062642,null,1000000000,39.811052159999996,null,64.804227397106132,-4.8259348342128643,null,22.268567180079771,-6.4698791459170471E-2,null,0,0]
[6.9183000000000003,6.9183000000000005E-3,1.0000007525751351,1.2268452739589129E-3,1.0000000000094478,4.346896086071622E-6,1,0,1.0043399492905951,9.2997970236908339E-2,1.0000002479467935,7.0419704954577216E-4,1.0000000001171481,1.530673874880456E-5,1.0000000007389684,3.8443948966520312E-5,1.0000000000293237,7.6581571682685275E-6,0.99999999993093702,1.5645349536810222E-5,59.469209881217189,-5.3603187390510731,174.63968126094892,null,1000000000,47.862874890000008,null,64.7979226950455,-5.2889206965454427,null,22.268566080532636,-7.0940410092230524E-2,null,0,0]
[7.5857999999999999,7.5858000000000002E-3,1.0000009048025749,1.3452151445756794E-3,1.0000000000113589,4.766298704837907E-6,1,0,1.0052155363013227,0.10191141790548057,1.0000002981003466,7.7214023673940807E-4,1.0000000001408442,1.678358249842408E-5,1.0000000008884438,4.2153145720938525E-5,1.0000000000352551,8.3970409850428109E-6,0.99999999991696731,1.7154863553036481E-5,59.461639906332245,-5.8741021376471778,174.12589786235282,null,1000000000,57.544361639999998,null,64.790354041005457,-5.7958153884855577,null,22.268564758440927,-7.778496289017546E-2,null,0,0]
[8.3176000000000005,8.3176000000000014E-3,1.0000010877950378,1.4749874926213021E-3,1.0000000000136562,5.2261022050804225E-6,1,0,1.0062670704056851,0.11166480511460355,1.0000003583898927,8.4662835494870832E-4,1.0000000001693294,1.8402689997922586E-5,1.0000000010681278,4.6219647869239707E-5,1.0000000000423852,9.2071011754673301E-6,0.99999999990017419,1.880978843266997E-5,59.452557470860071,-6.4363072649907664,173.56369273500923,null,1000000000,69.182469760000004,null,64.781273193319436,-6.3504682253880036,null,22.268563169155993,-8.5288846150311834E-2,null,0,0]
[9.1201000000000008,9.1201000000000008E-3,1.0000013078265939,1.6172972321594589E-3,1.0000000000164184,5.7303278253902794E-6,1,0,1.0075299902777402,0.12233594145589938,1.0000004308825201,9.2831284106087235E-4,1.0000000002035803,2.0178221247261403E-5,1.0000000012841814,5.0679019244918973E-5,1.0000000000509588,1.0095422168642357E-5,0.99999999987998223,2.0624597418763037E-5,59.441661762536519,-7.0514218170060872,172.94857818299391,null,1000000000,83.176224010000013,null,64.770379394161878,-6.9573008551873956,null,22.268561258187848,-9.3517684514416485E-2,null,0,0]
[10,0.01,1.0000015723560867,1.7733324710744115E-3,1.0000000000197393,6.2831852999173176E-6,1,0,1.0090462237975963,0.13400411169763218,1.0000005180356604,1.0178756670694105E-3,1.0000000002447578,2.2124999996389819E-5,1.0000000015439285,5.5568490736004154E-5,1.0000000000612661,1.1069420476280947E-5,0.99999999985570653,2.2614442187650859E-5,59.428598640219676,-7.7240193952076774,172.27598060479232,null,1000000000,100,null,64.757318567109394,-7.6208177357114231,null,22.268558960756877,-0.10254017847704924,null,0,0]
[10.965,1.0964999999999999E-2,1.0000018904626837,1.9444586421701578E-3,1.0000000000237326,6.8895126813409956E-6,1,0,1.0108665399523455,0.14675859394881641,1.0000006228405878,1.1161005909597441E-3,1.0000000002942753,2.4260062495240568E-5,1.0000000018562842,6.0930850079340485E-5,1.0000000000736609,1.2137619552141761E-5,0.99999999982651422,2.4796735859910642E-5,59.412941589619017,-8.4592507919069373,171.54074920809308,null,1000000000,120.23122499999999,null,64.74166427664909,-8.34609019589581,null,22.268556198011112,-0.11243528207349571,null,0,0]
[12.023,1.2022999999999999E-2,1.0000022728796922,2.1320766342605955E-3,1.0000000000285336,7.5542736860463008E-6,1,0,1.0130505337405133,0.16068706376327707,1.0000007488335618,1.2237917262185839E-3,1.0000000003538037,2.6600887493725668E-5,1.0000000022317879,6.6809996381260542E-5,1.0000000000885616,1.3308764238390401E-5,0.99999999979142007,2.718934384499304E-5,59.394193600853605,-9.2621759022590346,170.73782409774097,null,1000000000,144.55252899999999,null,64.722919606030004,-9.1380966040964591,null,22.26855287673262,-0.12328399953301317,null,0,0]
[13.183,1.3183E-2,1.0000027326194703,2.3377823883240158E-3,1.000000000034305,8.2831231808005649E-6,1,0,1.015669904489686,0.17588622581540495,1.0000009003017158,1.3418651499314065E-3,1.0000000004253682,2.9167387491728741E-5,1.0000000026832163,7.3255941281634535E-5,1.0000000001064753,1.4592817013441353E-5,0.99999999974923015,2.9812619141029578E-5,59.371761441245795,-10.138377027679853,169.86162297232013,null,1000000000,173.79148899999998,null,64.700491435479137,-10.002326383572914,null,22.268548883910224,-0.13517861367900894,null,0,0]
[14.454000000000001,1.4454E-2,1.0000032849339004,2.5631718272736935E-3,1.0000000000412388,9.0817160323703215E-6,1,0,1.0188078165433943,0.1924458003965209,1.0000010822700367,1.4712369357673769E-3,1.0000000005113434,3.1979474989098333E-5,1.0000000032255465,8.0318696419776826E-5,1.0000000001279958,1.5999740355704705E-5,0.99999999969854469,3.2686914746202239E-5,59.34496454197447,-11.093036293073105,168.90696370692689,null,1000000000,208.91811600000003,null,64.67369932851139,-10.943868782107593,null,22.268544087082947,-0.14821140629984428,null,0,0]
[15.849,1.5848999999999999E-2,1.0000039496091542,2.8105501791519673E-3,1.000000000049583,9.9582203816408286E-6,1,0,1.0225713295068544,0.21049843306088473,1.0000013012574154,1.6132303023939385E-3,1.0000000006148091,3.5065912485627426E-5,1.0000000038782064,8.8070500830438958E-5,1.0000000001538947,1.754392451177429E-5,0.99999999963754804,3.5841629435645855E-5,59.312933802983579,-12.133813718191352,167.86618628180864,null,1000000000,251.19080099999999,null,64.641674356749249,-11.970249663264187,null,22.268538314410222,-0.16251567365905156,null,0,0]
[17.378,1.7378000000000001E-2,1.0000047484273995,3.081690643128496E-3,1.0000000000596114,1.0918919413906073E-5,1,0,1.0270761418315177,0.23012605779619555,1.0000015644403732,1.7688631002692771E-3,1.0000000007391561,3.8448824981053539E-5,1.0000000046625852,9.6566923000255297E-5,1.0000000001850204,1.923643890209397E-5,0.99999999956424102,3.9299377651920306E-5,59.27474857568356,-13.265449917889342,166.73455008211067,null,1000000000,301.99488400000001,null,64.603496060599653,-13.086106447875512,null,22.268531376717121,-0.17819394829752092,null,0,0]
[19.055,1.9054999999999999E-2,1.0000057091034706,3.3790757047226006E-3,1.0000000000716716,1.1972609588577937E-5,1,0,1.032467698969364,0.25144744622361237,1.0000018809500684,1.9395603212983734E-3,1.0000000008886984,4.215918747502212E-5,1.0000000056058969,1.0588575881071951E-4,1.0000000002224527,2.1092780715286762E-5,0.99999999947608031,4.3091819614590781E-5,59.229266337954847,-14.494814605521391,165.50518539447862,null,1000000000,363.09302500000001,null,64.558022158414758,-14.298164377282337,null,22.268523033304923,-0.19538977615533651,null,0,{"$f":"IF(AH45>0,W43,0)","v":0}]
[20.893000000000001,2.0893000000000002E-2,1.0000068635905206,3.7050104624471855E-3,1.0000000000861651,1.3127459046535914E-5,1,0,1.0389099629484977,0.27454991456242056,1.0000022613140789,2.1266451596527952E-3,1.0000000010684105,4.6225762467074591E-5,1.0000000067395176,1.1609924729259749E-4,1.000000000267437,2.3127340197914992E-5,0.99999999937013362,4.724835409915382E-5,59.175230871614673,-15.826970615236974,164.17302938476303,null,1000000000,436.51744900000006,null,64.503996709256754,-15.611352136866717,null,22.268513006666986,-0.21423644607456174,null,0,0]
[22.909000000000002,2.2909000000000002E-2,1.0000082520475193,4.0625092671370275E-3,1.0000000001035958,1.4394149202775887E-5,1,0,1.0466053124694097,0.29954781549239018,1.0000027187635778,2.3318479445156165E-3,1.0000000012845436,5.0686162456594274E-5,1.0000000081028813,1.2730185487046738E-4,1.0000000003215379,2.5358935364711877E-5,0.99999999924271554,5.1807425658206287E-5,59.11112232069047,-17.268548312257817,162.73145168774218,null,1000000000,524.82228100000009,null,64.439900205595407,-17.032124667040964,null,22.268500948032013,-0.23490825834681092,null,0,0]
[25.119,2.5118999999999999E-2,1.0000099209619775,4.4544090420569216E-3,1.0000000001245475,1.5782733153759537E-5,1,0,1.0557808505679351,0.32651383360472869,1.0000032686148632,2.5567971996650614E-3,1.000000001544334,5.5575787442781596E-5,1.0000000097416359,1.3958249111693121E-4,1.0000000003865666,2.7805277288340058E-5,0.99999999908955961,5.6805217400389672E-5,59.035295697909234,-18.823786036870807,161.17621396312919,null,1000000000,630.96416099999999,null,64.364088063507779,-18.564555208852795,null,22.268486453669212,-0.25756925384156315,null,0,0]
[27.542000000000002,2.7542000000000001E-2,1.0000119272303154,4.8840785758707409E-3,1.000000000149734,1.7305148951532557E-5,1,0,1.0667066852300213,0.35552225900956402,1.0000039296137408,2.8034267861728021E-3,1.0000000018566391,6.0936674924575044E-5,1.0000000117116519,1.5304673614767808E-4,1.0000000004647407,3.0487397867572389E-5,0.99999999890544466,6.2284696767376952E-5,58.94585930354134,-20.497027957384095,159.50297204261591,null,1000000000,758.56176400000004,null,64.274669076924582,-20.212791878570521,null,22.268469029452177,-0.28241422778461911,null,0,0]
[30.2,3.0199999999999998E-2,1.0000143404249038,5.3554184771489131E-3,1.0000000001800293,1.8975219603722601E-5,1,0,1.0797021438182048,0.38663976017308893,1.0000047246824999,3.0739758938001182E-3,1.000000002232289,6.6817499900562671E-5,1.0000000140812462,1.6781684062008387E-4,1.0000000005587706,3.3429649827280854E-5,0.99999999868398548,6.8295615533999553E-5,58.840666331666476,-22.292195390524469,157.70780460947555,null,1000000000,912.04,null,64.169497043564277,-21.980528990686963,null,22.268448071172315,-0.30966872715157839,null,0,0]
[33.113,3.3112999999999997E-2,1.0000172402898158,5.8719744771001427E-3,1.0000000002164346,2.0805511480887976E-5,1,0,1.0951144629563481,0.41985868037309443,1.0000056800949293,3.3704800972946571E-3,1.0000000026836977,7.3262512368923674E-5,1.0000000169287255,1.8400394148688836E-4,1.0000000006717642,3.6654172008190892E-5,0.99999999841786391,7.4883202587240367E-5,58.71753844625313,-24.208941893740349,155.79105810625964,null,1000000000,1096.470769,null,64.046394319280651,-23.867213752830224,null,22.268422886291155,-0.33953777880056124,null,0,0]
[36.308,3.6308E-2,1.0000207277136464,6.4385333145190789E-3,1.0000000002602163,2.2812989183282459E-5,1,0,1.1133670828553526,0.45519261257605237,1.0000068290916273,3.6956874228780195E-3,1.0000000032265708,8.0331449827203237E-5,1.0000000203531605,2.0175807363434094E-4,1.0000000008076522,4.019085184528226E-5,0.99999999809782081,8.210851692452156E-5,58.573940913842009,-26.248170831397061,153.75182916860294,null,1000000000,1318.2708640000001,null,63.902827045948897,-25.873470957012927,null,22.268392598647825,-0.37229816908530677,null,0,0]
[39.811,3.9810999999999999E-2,1.0000249202278919,7.0597040147636842E-3,1.0000000003128497,2.5013988992612919E-5,1,0,1.1349216046917383,0.49257488340341776,1.000008210397044,4.0522440372995541E-3,1.000000003879205,8.8081837272208297E-5,1.0000000244699665,2.2122371508791729E-4,1.000000000971015,4.4068469831394573E-5,0.99999999771306958,9.0030356100108416E-5,58.407366801706871,-28.406182012450103,151.5938179875499,null,1000000000,1584.9157210000001,null,63.736289310560437,-27.995332181786925,null,22.268356187561992,-0.40821640855851005,null,0,0]
[43.652000000000001,4.3652000000000003E-2,1.0000299607744281,7.7408044035790985E-3,1.00000000037613,2.74273604646825E-5,1,0,1.1603061719275654,0.5319069215564719,1.0000098711083447,4.4432031568425023E-3,1.0000000046638531,9.658004969970987E-5,1.0000000294195142,2.4256757125299666E-4,1.0000000011674224,4.8320234227428426E-5,0.9999999972504916,9.8716563446628759E-5,58.215202706647219,-30.677466064647067,149.32253393535294,null,1000000000,1905.497104,null,63.544168950077555,-30.226978574348021,null,22.268312411699966,-0.44759999332853928,null,0,0]
[47.863,4.7863000000000003E-2,1.0000360199626812,8.4875062905669027E-3,1.0000000004521989,3.007320979232395E-5,1,0,1.1901044413615962,0.57302933554229529,1.0000118674394525,4.8718214438097556E-3,1.0000000056070752,1.0589688710415208E-4,1.0000000353693463,2.6596746121209638E-4,1.0000000014035231,5.2981567178213568E-5,0.99999999669442807,1.0823950518705457E-4,57.994917993895079,-33.05303807345004,146.94696192654996,null,1000000000,2290.8667689999997,null,63.323936809910194,-32.559095138386624,null,22.268259789486343,-0.49077688842730577,null,0,0]
[52.481000000000002,5.2481E-2,1.0000433057981635,9.3063672176128733E-3,1.0000000005436682,3.2974784760978443E-5,1,0,1.2249759710717798,0.61574645894084201,1.0000142679268584,5.3418643216858732E-3,1.0000000067412551,1.1611421197816295E-4,1.0000000425237348,2.9162898826435712E-4,1.0000000016874231,5.809342553859068E-5,0.9999999960257886,1.1868285476806035E-4,57.744025743160698,-35.521857755376743,144.47814224462326,null,1000000000,2754.255361,null,63.073107774350284,-34.980259961330184,null,22.268196514635569,-0.53812627546464109,null,0,0]
[57.544000000000004,5.7544000000000005E-2,1.0000520643003636,1.0204120888589199E-2,1.0000000006536267,3.6155961474565005E-5,1,0,1.2656252056621693,0.6597861501223653,1.0000171536339764,5.8571987799741401E-3,1.0000000081046947,1.2731609931209458E-4,1.0000000511242901,3.1976331252194195E-4,1.0000000020287094,6.3697873105163103E-5,0.99999999522199212,1.3013254708381109E-4,57.460423889130531,-38.068507680707256,141.93149231929274,null,1000000000,3311.3119360000005,null,62.78958191240028,-37.474663731310471,null,22.268120450816326,-0.59003752296012024,null,0,0]
[63.095999999999997,6.3095999999999999E-2,1.0000625952403135,1.1188563388669545E-2,1.0000000007858385,3.9644385948110604E-5,1,0,1.3128355872406186,0.70484806237935638,1.0000206233373794,6.4223022274822001E-3,1.000000009744066,1.3959989909315289E-4,1.0000000614654194,3.506149351416454E-4,1.0000000024390652,6.9843615326426194E-5,0.99999999425552388,1.4268808569830474E-4,57.142258137716375,-40.675982002235905,139.32401799776409,null,1000000000,3981.1052159999995,null,62.471507530524015,-40.024846890692245,null,22.268028995020831,-0.646961430825716,null,0,0]
[69.183000000000007,6.9183000000000008E-2,1.0000752547101921,1.2267843421086897E-2,1.0000000009447751,4.3468960833611077E-5,1,0,1.3674331333207974,0.75057444496888592,1.000024794375046,7.0418552606430129E-3,1.0000000117148125,1.5306738630456283E-4,1.000000073896858,3.8443947091534972E-4,1.0000000029323686,7.6581571534472111E-5,0.99999999309369836,1.5645349706969961E-4,56.788269351223555,-43.323994998502755,136.67600500149723,null,1000000000,4786.2874890000012,null,62.117628580045732,-42.610049484620014,null,22.267919055312966,-0.70936918964275564,null,0,0]
[75.858000000000004,7.5858000000000009E-2,1.0000904762054434,1.3451348211267989E-2,1.0000000011358801,4.7662987012647048E-5,1,0,1.4303242437138406,0.79659932206431505,1.0000298095948021,7.721250457150019E-3,1.0000000140844321,1.6783582342408515E-4,1.000000088844381,4.2153143249192395E-4,1.0000000035255148,8.3970409655042402E-5,0.99999999169672271,1.7154863777353807E-4,56.397612805717181,-45.991821859442084,134.0081781405579,null,1000000000,5754.4361640000006,null,61.727104097337914,-45.20900038950181,null,22.267786867833898,-0.77780360708610585,null,0,0]
[83.176000000000002,8.3176E-2,1.0001087736470893,1.4748816104972013E-2,1.0000000013656072,5.2261022003701317E-5,1,0,1.5024452396956078,0.84252341090371252,1.0000358383535022,8.4660832988916312E-3,1.0000000169329497,1.8402689792258779E-4,1.0000001068127868,4.6219644610919348E-4,1.0000000042385355,9.2071011497110779E-5,0.99999999001741946,1.8809788728370926E-4,55.970223354584199,-48.656838493297577,131.34316150670242,null,1000000000,6918.2469760000004,null,61.299873393471991,-47.798508762902095,null,22.267627970688491,-0.85282779568680356,null,0,0]
[91.201000000000008,9.1201000000000004E-2,1.0001307741939671,1.6171576545442837E-2,1.0000000016418329,5.7303278191808406E-5,1,0,1.5848243217802831,0.88797440926763382,1.0000430873330395,9.2828644283693661E-3,1.0000000203580304,2.0178220976140775E-4,1.0000001284181415,5.0679014949569742E-4,1.0000000050958773,1.0095422134688635E-4,0.99999998799821177,2.0624597808577044E-4,55.50644590446116,-51.298007986235341,128.70199201376465,null,1000000000,8317.6224010000005,null,60.836286814632921,-50.356878339661456,null,22.267436919189585,-0.93509687328833779,null,0,0]
[100,0.1,1.0001572233726941,1.773148477332356E-2,1.0000000019739208,6.2831852917316603E-5,1,0,1.6785196382583363,0.93258093756758875,1.0000518022377261,1.0178408677042968E-2,1.000000024475781,2.2124999638982232E-4,1.0000001543928465,5.5568485073615641E-4,1.0000000061266034,1.10694204315211E-4,0.99999998557065051,2.2614442701527227E-4,55.007386116999513,-53.894359843969674,126.10564015603032,null,1000000000,10000,null,60.337456488111357,-52.86244866903683,null,22.267207241588881,-1.0252963644207254,null,0,0]
[109.65,0.10965000000000001,1.0001890285811661,1.9442160860590835E-2,1.0000000023732691,6.8895126705495553E-5,1,0,1.7846893733988209,0.97602230451034921,1.0000622821386487,1.1160547143081304E-2,1.0000000294275313,2.4260062024057509E-4,1.0000001856284078,6.0930842614413661E-4,1.0000000073660904,1.2137619493133272E-4,0.99999998265141643,2.4796736537372041E-4,54.474476957187541,-56.427873552065307,123.57212644793469,null,1000000000,12023.122500000001,null,59.804823247643817,-55.296406565552509,null,22.2669310617019,-1.1242138467145415,null,0,0]
[120.23,0.12023,1.0002272624034148,2.1317568885464235E-2,1.0000000028533524,7.5542736718199971E-5,1,0,1.9045047627123137,1.0179979262085976,1.0000748805806743,1.2237312481776159E-2,1.0000000353803602,2.6600886872567357E-4,1.0000002231787566,6.680998654028463E-4,1.0000000088561602,1.3308764160599801E-4,0.99999997914201078,2.7189344738087073E-4,53.909866142097187,-58.881689400292174,121.11831059970783,null,1000000000,14455.252900000001,null,59.240544110336558,-57.641079618389888,null,22.266599070703272,-1.2326567950503839,null,0,0]
[131.83000000000001,0.13183,1.0002732249944355,2.3373609007673855E-2,1.0000000034305063,8.2831231620464636E-5,1,0,2.0392487559414572,1.058274430821168,1.0000900261597476,1.3417854250360111E-2,1.0000000425368238,2.9167386672874671E-4,1.0000002683216116,7.3255928308576536E-4,1.0000000106475153,1.4592816910892375E-4,0.99999997492301951,2.9812620318368229E-4,53.315836054619865,-61.242848731885296,118.75715126811471,null,1000000000,17379.148900000004,null,58.64691273076857,-59.882583783978667,null,22.266199986247699,-1.3515446428940023,null,0,0]
[144.54,0.14454,1.0003284399931616,2.5626163361866423E-2,1.0000000041238783,9.0817160076520718E-5,1,0,2.1901910202061923,1.0966476794587658,1.0001082212063179,1.4711318592243174E-2,1.0000000511343399,3.1979473909833801E-4,1.000000322554599,8.0318679321051865E-4,1.0000000127995845,1.5999740220543288E-4,0.99999996985447637,3.2686916297955962E-4,52.695279300007229,-63.500066977687133,116.49993302231286,null,1000000000,20891.811599999997,null,58.02683492089173,-62.008710139111045,null,22.265720589142916,-1.4817957909528794,null,0,0]
[158.49,0.15849000000000002,1.0003948837288141,2.8098178883577084E-2,1.0000000049583075,9.9582203490527213E-5,1,0,2.3590702390860594,1.1330539264488133,1.0001301173609336,1.6130917749895099E-2,1.000000061480909,3.5065911062743936E-4,1.0000003878205825,8.8070478287780192E-4,1.0000000153894641,1.754392433357984E-4,0.99999996375480404,3.5841631481450884E-4,52.049715510061333,-65.650286779753742,114.34971322024626,null,1000000000,25119.080100000003,null,57.381847440626814,-64.015065799736377,null,22.265143735064434,-1.6247371660619945,null,0,0]
[173.78,0.17377999999999999,1.0004747311824835,3.0807254030641652E-2,1.00000000596114,1.0918919370947195E-4,1,0,2.5472612963635242,1.1673628387581936,1.0001564319242309,1.7686804940227521E-2,1.0000000739156045,3.8448823105354663E-4,1.000000466258425,9.656689328367172E-4,1.000000018502029,1.9236438667191293E-4,0.99999995642410677,3.9299380348777968E-4,51.38259891459137,-67.686495834883601,112.3135041651164,null,1000000000,30199.488400000002,null,56.715423363248803,-65.893614173315413,null,22.264450562705719,-1.7813864427253459,null,0,0]
[190.55,0.19055000000000002,1.0005707490994802,3.3778033380143686E-2,1.0000000071671689,1.1972609531943525E-4,1,0,2.756620202623012,1.1995650964859121,1.0001880774971545,1.9393195933829852E-2,1.0000000888698506,4.2159185002213018E-4,1.000000560589543,1.0588571963415856E-3,1.0000000222452696,2.1092780405605134E-4,0.99999994760804489,4.3091823169966539E-4,50.695972160235591,-69.608797786794199,110.3912022132058,null,1000000000,36309.302500000005,null,56.029629300299263,-67.64302451254423,null,22.263617084463583,-1.9531687511983151,null,0,0]
[208.93,0.20893,1.0006861260230426,3.7033334852978848E-2,1.0000000086165091,1.3127458971881422E-4,1,0,2.9888779017157785,1.2296434814663801,1.0002261061015738,2.1263278509422306E-2,1.0000001068410502,4.6225759207460895E-4,1.0000006739515401,1.1609919565074614E-3,1.0000000267436928,2.3127339789698082E-4,0.99999993701338163,4.7248358785788059E-4,49.99267698795429,-71.41679511703083,108.58320488296917,null,1000000000,43651.744900000005,null,55.327334599660716,-69.261571164812153,null,22.262615667244457,-2.1414036263425889,null,0,0]
[229.09,0.22909000000000002,1.0008248679531737,4.0602988708850964E-2,1.0000000103595765,1.4394149104358475E-4,1,0,3.2462698607662102,1.2576580004903095,1.0002718397789396,2.3314296579566223E-2,1.0000001284543452,5.0686158159428505E-4,1.0000008102877931,1.2730178679075449E-3,1.0000000321537796,2.535893482655738E-4,0.99999992427157414,5.1807431836620849E-4,49.274342103115075,-73.114695808748493,106.88530419125151,null,1000000000,52482.2281,null,54.610202639133419,-70.751725812899622,null,22.261411605723175,-2.34781612330015,null,0,0]
[251.19,0.25119000000000002,1.0009916094743518,4.4514958369600052E-2,1.0000000124547332,1.5782733024023515E-4,1,0,3.5309092940197759,1.283653528083879,1.0003268086185841,2.5562458417386733E-2,1.0000001544333958,5.5575781778162219E-4,1.0000009741631295,1.3958240137275609E-3,1.0000000386566716,2.7805276578932826E-4,0.99999990895599911,5.6805225544913319E-4,48.543334893984223,-74.705790341205969,105.29420965879403,null,1000000000,63096.416100000002,null,53.880640896103735,-72.115151194783095,null,22.259964772703604,-2.5740233995854331,null,0,0]
[275.42,0.27542,1.0011920196890169,4.8802393379143633E-2,1.000000014973409,1.730514878051529E-4,1,0,3.8452978079001849,1.3077141808259583,1.0003928849668839,2.8027000475621257E-2,1.0000001856639007,6.0936667457507112E-4,1.0000011711645047,1.5304661784745852E-3,1.0000000464740704,3.0487396932435927E-4,0.99999989054450633,6.2284707503440528E-4,47.801302944415234,-76.195749833276153,103.80425016672385,null,1000000000,75856.176400000011,null,53.140345964027404,-73.355588753520962,null,22.258226111981635,-2.821942562778506,null,0,0]
[302,0.30199999999999999,1.0014330259910191,5.3503584518562089E-2,1.0000000180029478,1.8975219378260079E-4,1,0,4.1923349027198133,1.3299438717721002,1.0004723578051775,3.073017882081986E-2,1.0000002232288905,6.6817490056270612E-4,1.0000014081236348,1.6781668465771142E-3,1.0000000558770727,3.3429648594433256E-4,0.99999986839861199,6.8295629688009123E-4,47.049384428896118,-77.591509813087626,102.40849018691237,null,1000000000,91204,null,52.390515863490236,-74.477744978596036,null,22.256135720474926,-3.0937880988162876,null,0,0]
[331.13,0.33112999999999998,1.0017225602360835,5.8653067901632952E-2,1.000000021643465,2.0805511183687764E-4,1,0,4.5746659656872293,1.3504217100800262,1.0005678498793542,3.3692174113885982E-2,1.0000002683697509,7.3262499392374287E-4,1.0000016928711295,1.8400373590046009E-3,1.000000067176414,3.665417038307572E-4,0.99999984178647616,7.4883221244774522E-4,46.289636389462736,-78.898482705823255,101.10151729417674,null,1000000000,109647.0769,null,51.6332760869835,-75.485021577450993,null,22.253625082411624,-3.391557495655551,null,0,0]
[363.08,0.36307999999999996,{"$f":"SQRT(1+(A77/pole1)^2)","v":1.0020706490528071},{"$f":"ATAN(A77/pole1)","v":6.429747063722227E-2},{"$f":"SQRT(1+(A77/Zero1)^2)","v":1.0000000260216233},{"$f":"ATAN(A77/Zero1)","v":2.2812988791485997E-4},{"$f":"IF(VIN_nom>Vout, 1, SQRT(1+(A77/z_RHP)^2))","v":1},{"$f":"IF(VIN_nom>Vout, 0, -ATAN(A77/z_RHP))","v":0},{"$f":"SQRT(1+(A77/Pole2)^2)","v":4.9958608986423698},{"$f":"ATAN(A77/Pole2)","v":1.369269284979862},{"$f":"SQRT(1+(A77/Zero2)^2)","v":1.0006826784696108},{"$f":"ATAN(A77/Zero2)","v":3.6940230665615567E-2},{"$f":"SQRT(1+(A77/pole4)^2)","v":1.0000003226570409},{"$f":"ATAN(A77/pole4)","v":8.0331432720331919E-4},{"$f":"SQRT(1+(A77/Zero3)^2)","v":1.0000020353139978},{"$f":"ATAN(A77/Zero3)","v":2.0175780261164926E-3},{"$f":"SQRT(1+(A77/pole5)^2)","v":1.0000000807652254},{"$f":"ATAN(A77/pole5)","v":4.019084970290706E-4},{"$f":"SQRT((1-(Z77/pterm2))^2+(A77/pterm1)^2)","v":0.99999980978220082},{"$f":"IF((ATAN((A77/pterm1)/(1-A77^2/pterm2))>0),ATAN((A77/pterm1)/(1-A77^2/pterm2)),PI()+ATAN((A77/pterm1)/(1-A77^2/pterm2)))","v":8.2108541520587114E-4},{"$f":"20*LOG10(((E77*K77*G77*O77)/(C77*I77*S77*M77*Q77))*Adc)","v":45.522599126875164},{"$f":"((F77+L77+H77+R77)-(D77+J77+T77+N77+T77))*radconv","v":-80.124822965302386},{"$f":"IF(V77>0,V77,V77+180)","v":99.875177034697614},null,{"$f":"IF(U77<0,A77,1000000000)","v":1000000000},{"$f":"A77^2","v":131827.0864},null,{"$f":"20*LOG10((K77/(I77*M77))*AEA)","v":50.869253389619089},{"$f":"(L77-(J77+N77))*radconv","v":-76.382858342713831},null,{"$f":"20*LOG10((E77*G77/(C77*S77))*Acs*Am)","v":22.250607660803947},{"$f":"(F77+H77-(D77+T77))*radconv","v":-3.7179475542802751},null,{"$f":"SUM((U78<0)*(U77>0))*A77","v":0},{"$f":"IF(AH77>0,W75,0)","v":0}]
[398.11,{"$f":"A78/1000","v":0.39811000000000002},1.0024889563881199,7.0481272817807458E-2,1.0000000312849817,2.5013988476121885E-4,1,0,5.4593685422040377,1.3865848918740724,1.000820706295523,4.0500503436887929E-2,1.0000003879204296,8.8081814720843339E-4,1.0000024469936919,2.2122335780873064E-3,1.0000000971014971,4.406846700717927E-4,0.99999977130713447,9.0030388524208035E-4,44.749533755406155,-81.277286942727358,98.722713057272642,null,1000000000,158491.57210000002,null,50.099809311215111,-77.175421576438524,null,22.2469829338376,-4.0755311250463668,null,0,0]
[436.52,0.43651999999999996,1.0029916473482834,7.7255524644161924E-2,1.0000000376130045,2.7427359783809734E-4,1,0,5.9691742528862477,1.4024752813722843,1.0009866289880378,4.4403118654381658E-2,1.0000004663851942,9.6580019971006191E-4,1.000002941947119,2.4256710026413545E-3,1.0000001167422452,4.8320230504360394E-4,0.99999972504940182,9.8716606190230017E-4,43.971186275940511,-82.363275799262382,97.636724200737618,null,1000000000,190549.71039999998,null,49.325811632454879,-77.867139562212273,null,22.242629004630277,-4.4672612407215491,null,0,0]
[478.63,0.47863,1.0035955969811667,8.4674155868225576E-2,1.0000000452198963,3.0073208894785077E-4,1,0,6.5295373599405746,1.4170410215383613,1.0011860476325551,4.8680110112393683E-2,1.0000005607073819,1.0589684791523781E-3,1.000003536928433,2.6596684034644719E-3,1.0000001403523135,5.2981562270397605E-4,0.99999966944317553,1.0823956153244915E-3,43.188329517179476,-83.38989788272572,96.61010211727428,null,1000000000,229086.67689999999,null,48.548177980702071,-78.46197958953131,null,22.23740093477117,-4.8962577917377024,null,0,0]
[524.80999999999995,0.52481,1.0043213366109127,9.2799053388488456E-2,1.0000000543668199,3.2974783577773914E-4,1,0,7.145391029910467,1.4303850522891117,1.0014257864310498,5.3368425755580401E-2,1.00000067412529,1.1611416031633982E-3,1.0000042523645396,2.9162816979238478E-3,1.0000001687422906,5.8093419068731768E-4,0.99999960257937537,1.1868292904687898E-3,42.401264162168737,-84.364586113460007,95.635413886539993,null,1000000000,275425.53609999997,null,47.76738483791236,-78.963769623221211,null,22.231122754967451,-5.366101258153984,null,0,0]
[575.44000000000005,0.57544000000000006,1.0051930815230752,0.10169274557385884,1.0000000653626755,3.6155959914819824E-4,1,0,7.8218102841184294,1.4425978193379914,1.0017139093673424,5.8505812321926608E-2,1.0000008104691376,1.2731603120952585E-3,1.0000051124160818,3.1976223358218567E-3,1.0000002028709318,6.3697864576349385E-4,0.99999952219996624,1.3013264500097656E-3,41.61060804471802,-85.294051397873858,94.705948602126142,null,1000000000,331131.19360000006,null,46.984256783049474,-79.375577263038466,null,22.223587518539382,-5.8804098094798096,null,0,0]
[630.96,0.63096000000000008,1.0062402495821319,0.11142684463551908,1.0000000785838639,3.9644383891940764E-4,1,0,8.5646790898749945,1.4537707923223937,1.0020602327245987,6.4135821497443402E-2,1.0000009744061291,1.3959980931539636E-3,1.000006146523251,3.5061351280633005E-3,1.0000002439065012,6.9843604083122315E-4,0.99999942555348786,1.4268821477985848E-3,40.816498435853688,-86.18526836523651,93.81473163476349,null,1000000000,398110.52160000004,null,46.19918148036929,-79.700203782071725,null,22.214544586695411,-6.4433276955851309,null,0,0]
[691.83,0.69183000000000006,1.0074976468287802,0.1220745592919447,1.0000000944775234,4.3468958123097008E-4,1,0,9.3801565770702009,1.4639853202322628,1.0024764019593142,7.0303659411083921E-2,1.0000011714805697,1.5306726795645113E-3,1.0000073896587645,3.8443759594662865E-3,1.0000002932368131,7.6581556713161433E-4,0.99999930937140891,1.564536672294674E-3,40.019287896154374,-87.04463418514959,92.95536581485041,null,1000000000,478628.74890000006,null,45.412806531206172,-79.939778325536182,null,22.203698626971935,-7.0590925112272309,null,0,0]
[758.58,0.75858000000000003,1.0090074626498486,0.13371885664689742,1.0000001135880103,4.7662983439444384E-4,1,0,10.275346428007037,1.4733217244735604,1.0029765739146759,7.7061135380159212E-2,1.0000014084422157,1.6783566740878116E-3,1.0000088843990151,4.2152896077214006E-3,1.0000003525514245,8.3970390116481499E-4,0.99999916967455604,1.7154886209090161E-3,39.218897854442332,-87.878687985126305,92.121312014873695,null,1000000000,575443.61640000006,null,44.625409399338444,-80.096001700967818,null,22.190693249284411,-7.7325075158977574,null,0,0]
[831.76,0.83175999999999994,1.0108194263014978,0.14644294826991827,1.0000001365607121,5.2261017293412206E-4,1,0,11.257627184642386,1.4818504269351056,1.00357750031534,8.4461439129487892E-2,1.0000016932935627,1.8402669225920279E-3,1.0000106812222167,4.6219318783059472E-3,1.0000004238534703,9.2070985740870753E-4,0.99999900174524414,1.8809818298473921E-3,38.415522741354067,-88.693342337984632,91.306657662015368,null,1000000000,691824.69759999996,null,43.837601669682122,-80.169930958769498,null,22.175110878318577,-8.4683918479468279,null,0,0]
[912.01,0.91200999999999999,1.0129938543655725,0.1603414906132915,1.0000001641832714,5.7303271982370933E-4,1,0,12.335591314997162,1.4896410326999947,1.0042995829231987,9.2566018493566854E-2,1.0000020358009918,2.0178193864143798E-3,1.0000128417325249,5.0678585421266237E-3,1.0000005095876141,1.0095418739318482E-3,0.99999879982594653,2.0624636789989014E-3,37.608860282170468,-89.494671390534236,90.505328609465764,null,1000000000,831762.24009999994,null,43.049583812246382,-80.162114603467629,null,22.156448255514299,-9.2722288114100344,null,0,0]
[1000,1,1.0156018641464337,0.17550886095430043,1.000000197392068,6.2831844731661539E-4,1,0,13.518240181395269,1.4967545677856173,1.0051670089554323,0.10143824027555305,1.0000024475751297,2.2124963898328687E-3,1.0000154391666611,5.5567918845254305E-3,1.0000006126601608,1.1069415955539718E-3,0.99999855707193508,2.2614494089181056E-3,36.79884234855664,-90.288140396957388,89.711859603042612,null,1000000000,1000000,null,42.261875391512092,-80.072503448841928,null,22.134117077203786,-10.149488522919208,null,0,0]
[1096.5,1.0965,1.0187292522616842,0.19204962142259574,1.0000002373268968,6.889511591405738E-4,1,0,14.81592440424382,1.5032500303451559,1.0062091311632062,0.11115010317167374,1.0000029427488326,2.4260014905917635E-3,1.0000185626702165,6.0930096138356437E-3,1.0000007366087706,1.2137613592289535E-3,0.99999826515160439,2.4796804283538959E-3,35.984989895448351,-91.079216051928768,88.920783948071232,null,1000000000,1202312.25,null,41.474699752912052,-79.90045022531271,null,22.107414209352825,-11.106234006667167,null,0,0]
[1202.3,1.2022999999999999,1.0224762322435448,0.21006269310214951,1.0000002853352139,7.554272249190089E-4,1,0,16.239268429316287,1.5091782136751082,1.0074605088265165,0.12177372087055433,1.00000353802982,2.6600824756999905E-3,1.0000223176291105,6.6809002469044925E-3,1.0000008856156357,1.3308756381547901E-3,0.99999791421547224,2.718943404753343E-3,35.167172018428595,-91.872570881903002,88.127429118096998,null,1000000000,1445525.2899999998,null,40.688735982984994,-79.644833505211338,null,22.075528782024367,-12.148206951896544,null,0,{"$f":"IF(AH90>0,W90,0)","v":0}]
[1318.3,1.3183,1.0269627374334802,0.2296542290921163,1.0000003430505893,8.2831212866369297E-4,1,0,17.80038058191111,1.5145881603903686,1.0089628548269152,0.13338979645373433,1.0000042536734211,2.9167304787885624E-3,1.0000268318047885,7.3254631044540842E-3,1.0000010647509752,1.4592806656007489E-3,0.99999749232275525,2.9812738052302063E-3,34.344864719739093,-92.672730851427289,87.327269148572711,null,1000000000,1737914.89,null,39.904416152557289,-79.303953360973154,null,22.037503661042631,-13.281573707005872,null,0,0]
[1445.4,1.4454,1.0323268793919933,0.25091587946807736,1.0000004123877455,9.0817135358284555E-4,1,0,19.511372850191353,1.5195217023332459,1.0107647661283683,0.14607585786661464,1.0000051134210328,3.197936598404348E-3,1.0000322549449208,8.0316969514729539E-3,1.0000012799576383,1.5999726704422285E-3,0.99999698547770677,3.2687071473437661E-3,33.517984027043845,-93.483159742138938,86.516840257861062,null,1000000000,2089181.1600000001,null,39.122736214454321,-78.875878638087073,null,21.992257672304405,-14.511669661288165,null,0,0]
[1584.9,1.5849000000000002,1.0387455603172357,0.27398743851896334,1.000000495830643,9.9582170902439348E-4,1,0,21.389746125051499,1.5240279063225353,1.0129290030596807,0.15994513775008151,1.000006148072198,3.5065768775444043E-3,1.0000387813137879,8.8068224126796272E-3,1.0000015389452526,1.75439065141674E-3,0.99999637552386456,3.5841836062127123E-3,32.684418796016466,-94.308563202097574,85.691436797902426,null,1000000000,2511908.0100000002,null,38.342949426466873,-78.357097690879698,null,21.938424793492779,-15.846626097405496,null,0,0]
[1737.8,1.7378,1.0464075561014814,0.29893528775341843,1.0000005961138283,1.0918915075062575E-3,1,0,23.448966100772079,1.5281375863287026,1.0155239199254997,0.1750755156280456,1.000007391533402,3.844863553713078E-3,1.0000466247664441,9.6563921791553986E-3,1.0000018502011971,1.9236415176975927E-3,0.99999564247351513,3.9299650034818698E-3,31.844508568070097,-95.150334470676412,84.849665529323588,null,1000000000,3019948.84,null,37.566800268178923,-77.745040613647532,null,21.874598302909529,-17.290339988824115,null,0,0]
[1905.5,1.9055,1.0555483860768695,0.32586285731667736,1.0000007167166449,1.1972603868507152E-3,1,0,25.707887780814151,1.5318879433648314,1.0186358705373608,0.19157758974738764,1.0000088869459645,4.2158937723939666E-3,1.0000560573987975,1.0588180224156044E-2,1.0000022245245179,2.1092749437524993E-3,0.99999476089531814,4.309217870797754E-3,30.996759607840904,-96.010595428771225,83.989404571228775,null,1000000000,3630930.25,null,36.794509508261349,-77.035679508026206,null,21.799061427324922,-18.848868475711637,null,0,0]
[2089.3000000000002,2.0893000000000002,1.0664296889624252,0.35482205060413669,1.000000861650534,1.3127451506439818E-3,1,0,28.184022266817983,1.5353077819905776,1.022363111967409,0.20954310242566315,1.0000106840485192,4.6225433250269479E-3,1.0000673929058133,1.1609403188317866E-2,1.000002674365748,2.3127298968137937E-3,0.99999370146944522,4.7248827449902176E-3,30.140759942356045,-96.889086339245182,83.110913660754818,null,1000000000,4365174.4900000012,null,36.027486458197544,-76.225573076824404,null,21.709990266279661,-20.525307084521895,null,0,0]
[2290.9,2.2909000000000002,1.0793709424237667,0.3858853831647952,1.0000010359571199,1.4394139262629642E-3,1,0,30.900271857896438,1.5384285004326597,1.0268278071198087,0.22909146017110549,1.0000128453528434,5.0685728449475134E-3,1.0000810255295745,1.2729497948129562E-2,1.0000032153728462,2.5358881011315333E-3,0.99999242734717253,5.1808049679172088E-3,29.274760007543286,-97.785406632000047,82.214593367999953,null,1000000000,5248222.8100000005,null,35.266130142042115,-75.309894285362006,null,21.605232944057541,-22.323969772835092,null,0,0]
[2511.9,2.5119000000000002,1.094723811655405,0.41905857539075964,1.0000012454725538,1.5782720050440781E-3,1,0,33.878194229615062,1.5412745268989589,1.032168786635276,0.25031761978815931,1.0000154432215347,5.5575215326719779E-3,1.0000974116158858,1.3957342800409729E-2,1.0000038656597559,2.7805205638538732E-3,0.99999089587418288,5.6806039999012167E-3,28.398115330276678,-98.696301541106664,81.303698458893336,null,1000000000,6309641.6100000003,null,34.51201052268577,-74.284804923969006,null,21.482571219407447,-24.245334075826481,null,0,0]
[2754.2,2.7542,1.1128998287794269,0.45433409902867744,1.0000014973397804,1.7305131678819483E-3,1,0,37.143391379143026,1.5438703836462198,1.0385530459425232,0.27332712149683297,1.0000185662194481,6.0935920767348599E-3,1.0001171096617196,1.5303478948764895E-2,1.0000046473963473,3.048730341931114E-3,0.99998905484706413,6.2285781112545891E-3,27.509573676531392,-99.617242188973506,80.382757811026494,null,1000000000,7585617.6399999987,null,33.76631662235301,-73.145903801596262,null,21.339559179341379,-26.289146530492744,null,0,0]
[3020,3.02,1.134376725145976,0.49167915963298425,1.000001800293175,1.8975196832056466E-3,1,0,40.725510354767493,1.5462392247008125,1.0461806121435893,0.29823056477101412,1.000022322642381,6.6816505653432617E-3,1.0001408025499432,1.6780109105504728E-2,1.000005587691831,3.3429525310500058E-3,0.99998684043427466,6.8297045093317901E-3,26.607595937116152,-100.54196977060539,79.458030229394609,null,1000000000,9120400,null,33.030144048935341,-71.888459469474967,null,21.173556413327429,-28.453734128337693,null,0,0]
[3311.3,3.3113000000000001,1.1596589018299399,0.53095768823988176,1.0000021643441983,2.0805481463743434E-3,1,0,44.651504675225752,1.5483987923685496,1.0552735291001154,0.32509117531421916,1.0000268366185872,7.326120177921956E-3,1.0001692729295724,1.8398318143258222E-2,1.0000067176190708,3.6654007872868083E-3,0.99998417947590157,7.4885087005090219E-3,25.692137542221339,-101.46065528549936,78.539344714500643,null,1000000000,10964707.690000001,null,32.30588111903667,-70.510119350389175,null,20.982123510452212,-30.731487986809153,null,0,0]
[3630.8,3.6308000000000002,1.1893521637056936,0.57204833446553149,1.0000026021589927,2.2812949611962113E-3,1,0,48.957763550415322,1.5503691365828167,1.0661061386707504,0.35400201850698132,1.0000322651887743,8.0329722099426494E-3,1.0002035108985636,2.0173070695929479E-2,1.0000080764902541,4.0190635467463572E-3,0.99998097941737285,8.211100113807674E-3,24.761802055084505,-102.36293618931686,77.637063810683145,null,1000000000,13182708.640000001,null,31.59483252233851,-69.007042097402419,null,20.762551091131481,-33.115708088782839,null,0,0]
[3981.1,3.9811000000000001,1.2240958982098418,0.61472954370532407,1.0000031284933342,2.5013936827212356E-3,1,0,53.679330174292453,1.552166104572946,1.0789849929387108,0.38500394925011505,1.0000387912981044,8.8079559689307335E-3,1.00024466973693,2.2118764037647645E-2,1.0000097101030359,4.4068184588939036E-3,0.99997713244406639,9.003363095150145E-3,23.816615933949898,-103.23543073868559,76.764569261314406,null,1000000000,15849157.209999999,null,30.899364696324465,-67.378124287538384,null,20.512489564231924,-35.593943842845292,null,0,0]
[4365.2,4.3651999999999997,1.2646044698016552,0.65874498023367345,1.0000037612934385,2.7427291696840426E-3,1,0,58.85664045910206,1.5538050729459187,1.094268313204553,0.41812311276652653,1.0000466374427643,9.6577047266991622E-3,1.0002941518819932,2.425200179968762E-2,1.0000116741570542,4.831985820277252E-3,0.99997250744172239,9.8720880577819869E-3,22.856621444377538,-104.06369493122098,75.936305068779021,null,1000000000,19054971.039999999,null,30.221697312574506,-65.623128983032359,null,20.229749837093024,-38.15178936133519,null,0,0]
[4786.3,4.7862999999999998,1.3116448558960105,0.70378013957257868,1.0000045219795146,3.0073119141384537E-3,1,0,64.532827409667803,1.555299717310799,1.1123624397693945,0.45334395840653813,1.0000560691820344,1.0589292928744522E-2,1.0003536309413765,2.6590478011710307E-2,1.0000140351338371,5.2981071497066531E-3,0.99996694793327656,1.082451961154304E-2,21.882604778985733,-104.83230092916993,75.167699070830068,null,1000000000,22908667.690000001,null,29.564360751456174,-63.744136061032911,null,19.912573778471351,-40.771524757863489,null,0,0]
[5248.1,5.2481,1.3660654146829982,0.74950033812813188,1.0000054366673754,3.297466525809378E-3,1,0,70.757764923946667,1.5566631317589734,1.1337374356105026,0.49062522136691833,1.0000674102796496,1.1610899455186247E-2,1.000425146983112,2.9154636433096966E-2,1.0000168740881246,5.8092772095939887E-3,0.99996026316397901,1.1869035699771765E-2,20.895519021036804,-105.52624816432279,74.473751835677206,null,1000000000,27542553.610000003,null,28.929717421122014,-61.744728672096741,null,19.559535070659663,-43.434320905473513,null,0,0]
[5370.3,5.3703000000000003,1.3809198178107598,0.760987994102726,1.0000056927957011,3.3742461957319385E-3,1,0,72.405007068704151,1.5569846881423508,1.1396509602842899,0.50025216543694673,1.0000705859607608,1.1881229652642041E-2,1.0004451717997915,2.983309284092233E-2,1.0000176690431515,5.9445408557619343E-3,0.99995839136612519,1.2145437824644814E-2,20.647035144131905,-105.68629586988057,74.313704130119433,null,1000000000,28840122.090000004,null,28.774987428768046,-61.227058009716274,null,19.465614233189203,-44.103952634245879,null,0,0]
[5432.85,5.4328500000000002,1.388592648925677,0.76677264339059259,1.0000058261800764,3.4135470670864673E-3,1,0,73.248176775013235,1.5571436857262286,1.1427184389378762,0.50514108430840354,1.0000722397618371,1.2019601764281263E-2,1.000455600000278,3.0180360878131907E-2,1.0000180830330367,6.0137776055195448E-3,0.99995741659592663,1.2286919580544299E-2,20.521772469407882,-105.76464933829425,74.235350661705752,null,1000000000,29515859.122500002,null,28.697756177229511,-60.963981620207541,null,19.417495868388116,-44.441243158220736,null,0,0]
[5495.4,5.4954000000000001,1.3963114337985716,0.77249352747890332,1.0000059611090188,3.4528479278961108E-3,1,0,74.091348290907263,1.5572990644775668,1.1458130836894782,0.51000371061964922,1.0000739127110745,1.2157973415625035E-2,1.0004661488482736,3.0527621634076886E-2,1.0000185018167325,6.0830142976196853E-3,0.99995643054439887,1.242840199846428E-2,20.397784231389902,-105.84064849218898,74.159351507811024,null,1000000000,30199421.159999996,null,28.621818905116427,-60.702204313228712,null,19.369356956004836,-44.774880243912222,null,0,0]
[5559.4,5.5593999999999992,1.4042559249278272,0.77828173990767935,1.0000061007644998,3.493059828794623E-3,1,0,74.954067558513117,1.5574544268699719,1.149007355870721,0.514951828558745,1.0000756442607377,1.2299552241206083E-2,1.0004770671050349,3.0882924776030433E-2,1.0000189352702265,6.1538559366006154E-3,0.99995540995835863,1.2573164877834279E-2,20.272217365983785,-105.91602154438111,74.08397845561889,null,1000000000,30906928.359999996,null,28.545430349760945,-60.435711517035145,null,19.320087620743429,-45.11251071720244,null,0,0]
[5623.4,5.6233999999999993,1.4122469331731524,0.78400463863945813,1.0000062420369871,3.5332717183965581E-3,1,0,75.816788594146928,1.5576062535212762,1.1522296038206319,0.51987239126473206,1.0000773958564115,1.2441130573685665E-2,1.0004881116595781,3.1238220118334884E-2,1.0000193737423491,6.2246975138141028E-3,0.99995437756236771,1.2717928466418843E-2,20.147937740824879,-105.98902867010993,74.010971329890069,null,1000000000,31622627.559999995,null,28.470335959641147,-60.170594908108576,null,19.270810308643298,-45.446399032588282,null,0,0]
[5688.9,5.6888999999999994,1.4204725766804485,0.78979480249913803,1.000006388294846,3.5744260623285142E-3,1,0,76.699731422467238,1.5577581020897242,1.1555560959551796,0.52487974111100788,1.0000792092612578,1.258602663184024E-2,1.0004995458391304,3.1601834525892956E-2,1.000019827687598,6.2971993757957104E-3,0.99995330874146338,1.2866085694473957E-2,20.022054509265182,-106.06134837083135,73.938651629168646,null,1000000000,32363583.209999997,null,28.394791118492147,-59.9006971097606,null,19.22037659407286,-45.784281798479192,null,0,0]
[5754.4,5.7543999999999995,1.4287452936704961,0.79551810401444356,1.0000065362463952,3.6155803941525541E-3,1,0,77.582675979074594,1.5579064943778873,1.1589113952327923,0.52985822046333164,1.0000810436625585,1.2730922161484909E-2,1.0005111122971342,3.1965440574359905E-2,1.0000202868894665,6.3697011715737944E-3,0.9999522275510514,1.3014243682682721E-2,19.897472262282104,-106.13129332990452,73.868706670095477,null,1000000000,33113119.359999996,null,28.320540950684968,-59.632255408315665,null,19.169948089158222,-46.118333678472048,null,0,0]
[5821.4,5.8213999999999997,1.4372553176138394,0.80130411309103677,1.0000066893384618,3.6576771789185477E-3,1,0,78.485842367332779,1.558054830647696,1.1623730775991201,0.5349208455243748,1.0000829417961408,1.2879135356222636E-2,1.0005230804881264,3.2337364730543793E-2,1.0000207620459696,6.4438632445305098E-3,0.99995110880317606,1.3165795397509178E-2,19.771359185043462,-106.20043661917369,73.799563380826314,null,1000000000,33888697.959999993,null,28.245899278618158,-59.359179391484076,null,19.118376910399157,-46.45611888471057,null,0,0]
[5888.4,5.8883999999999999,1.4458128904923426,0.80702181847953114,1.0000068442026788,3.6997739507206614E-3,1,0,79.389010443272113,1.5581997918292292,1.1658643744284174,0.53995327785842051,1.0000848618986127,1.3027347985095415E-2,1.0005351870757311,3.2709279937525051E-2,1.0000212427025945,6.5180252466036474E-3,0.99994997711333555,1.3317347926230431E-2,19.64655973045727,-106.26720299855009,73.73279700144991,null,1000000000,34673254.559999995,null,28.17255108954437,-59.087639879747847,null,19.066824718858058,-46.789990625266881,null,0,0]
[5957,5.9569999999999999,1.4546232126152889,0.81280616834098718,1.0000070046012812,3.7428760049780414E-3,1,0,80.313748401224544,1.5583448367286417,1.1694694522260756,0.54507462226546255,1.0000868506162446,1.3179099426937783E-2,1.0005477261641942,3.3090067322255681E-2,1.0000217405362881,6.5939582072673539E-3,0.99994880498912497,1.347252047288155E-2,19.520117004550816,-106.33315685075588,73.666843149244116,null,1000000000,35485849,null,28.098760682799021,-58.811213637204375,null,19.014067869533822,-47.127830626163551,null,0,0]
[6025.6,6.0256000000000007,1.4634816176062186,0.81852068253296206,1.0000071668576829,3.7859780453284278E-3,1,0,81.238488010353024,1.5584865795320149,1.1731050140749,0.55016435643291306,1.000088862364285,1.3330850261757654E-2,1.0005604103274606,3.3470845107669338E-2,1.0000222441359157,6.6698910918909539E-3,0.99994761929807296,1.3627693892640404E-2,19.395003276042132,-106.39673142141417,73.603268578585826,null,1000000000,36307855.360000007,null,28.026264668837783,-58.536409297034325,null,18.961344416868371,-47.461669388757102,null,0,0]
[6095.8,6.0958000000000006,1.4725955054374584,0.82429711109343462,1.0000073348217902,3.8300853665161768E-3,1,0,82.184797541489971,1.5586283260569449,1.1768566344450258,0.55534010871763162,1.0000909448758182,1.3486139838936623E-2,1.0005735405152798,3.3860493955029602E-2,1.000022765450524,6.7475949262590191E-3,0.99994639190758294,1.3786487431906953E-2,19.268323009879012,-106.45938368607088,73.540616313929121,null,1000000000,37158777.640000001,null,27.953386804810883,-58.256879450009208,null,18.907432559974488,-47.799205402580931,null,0,0]
[6166,6.1660000000000004,1.481757924152644,0.83000229121987978,1.0000075047313668,3.874192672801334E-3,1,0,83.131108686296415,1.5587668454818182,1.1806395800885074,0.56048283026814694,1.0000930515042965,1.3641428765646333E-2,1.0005868226124013,3.425013251690872E-2,1.0000232928031496,6.8252986791435171E-3,0.99994515031070419,1.394528190678975E-2,19.142985849949145,-106.51966141407596,73.480338585924045,null,1000000000,38019556,null,27.881802421061728,-57.979057188167637,null,18.85356906428013,-48.132659236294138,null,0,0]
[6237.8,6.2378,1.4911784431324178,0.83576478665324783,1.0000076805260121,3.9193052582218151E-3,1,0,84.098989788763205,1.5589052973188282,1.184540838241815,0.56570864401222587,1.0000952310946605,1.380025636043446E-2,1.0006005645713167,3.4648640967093566E-2,1.0000238384212115,6.9047733724663975E-3,0.99994386571992311,1.4107696608040933E-2,19.016156851069134,-106.57891689523214,73.42108310476786,null,1000000000,38910148.840000004,null,27.809893352388542,-57.696672972565878,null,18.798534582823244,-48.469546820639536,null,0,0]
[6309.6,6.3096000000000005,1.5006478560645398,0.84145474386375985,1.0000078583558174,3.9644178276895085E-3,1,0,85.066872466631779,1.5590405985750624,1.1884742322859467,0.57090000787001483,1.0000974359135215,1.3959083258925255E-2,1.0006144654302127,3.5047138408146078E-2,1.0000243903556441,6.9842479785637551E-3,0.99994256626854305,1.4270112310845283E-2,18.890683802370351,-106.63580964125653,73.364190358743471,null,1000000000,39811052.160000004,null,27.739275103926168,-57.41608203517891,null,18.743563908494188,-48.802278329255955,null,0,0]
[6383.05,6.3830499999999999,1.5103845142400596,0.84720144346658255,1.0000080423780908,4.0105670899243341E-3,1,0,86.056999148426897,1.5591758599400769,1.1925309382538758,0.5761750905581301,1.0000997175048549,1.4121559350344795E-2,1.0006288501502509,3.5454781997184354E-2,1.0000249615095638,7.0655488596553058E-3,0.99994122157874421,1.4436261456297271E-2,18.763705586944294,-106.69162733403391,73.30837266596609,null,1000000000,40743327.302500002,null,27.668338346271575,-57.130901159898137,null,18.687402545113706,-49.138415449861704,null,0,0]
[6456.5,6.4565000000000001,1.5201704122825661,0.85287434116108252,1.0000082285301353,4.0567163350760287E-3,1,0,87.047127368871728,1.5593080442135108,1.1966206026480604,0.58141426113533057,1.0001020254971802,1.4284034696142783E-2,1.0006434011432861,3.5862413798348376E-2,1.0000255392734743,7.1468496473412095E-3,0.99993986133831636,1.4602411674271764E-2,18.638096748224871,-106.74509788348136,73.254902116518636,null,1000000000,41686392.25,null,27.598689809473935,-56.847601549926637,null,18.631320953486885,-49.470324095025518,null,0,0]
[6531.7,6.5316999999999998,1.5302394936141612,0.85860704042260128,1.0000084213238771,4.1039651018612653E-3,1,0,88.060847658613625,1.5594402983197833,1.2008415003044208,0.58674113744408196,1.0001044158309405,1.4450380354519362E-2,1.000658471079358,3.6279745372052585E-2,1.0000261376511197,7.2300873878963596E-3,0.99993845257880831,1.4772521666822866E-2,18.510888783177684,-106.79747517534069,73.202524824659307,null,1000000000,42663104.890000001,null,27.528684938659488,-56.559502525395736,null,18.573992245909842,-49.805822998013859,null,0,0]
[6606.9,6.6068999999999996,1.5403582060663392,0.86426460664490545,1.000008616350083,4.1512138503226464E-3,1,0,89.074569453582185,1.559569542166853,1.2050962333152231,0.59203054864630933,1.0001068338383354,1.4616725213134698E-2,1.0006737152904885,3.6697064303222768E-2,1.000026742957459,7.3133250282622544E-3,0.99993702751974045,1.4942632809796585E-2,18.385065922144211,-106.84752187127968,73.152478128720318,null,1000000000,43651127.609999992,null,27.45996734479295,-56.273377572379431,null,18.516759914830839,-50.137017161912532,null,0,0]
[6683.85,6.6838500000000005,1.5507627573697724,0.86997721589527788,1.0000088182257931,4.1995621182897638E-3,1,0,90.11188335401522,1.5596987835077656,1.209484632474437,0.59740437356902065,1.0001093367627689,1.4786940291472761E-2,1.0006894946512159,3.7124081540369142E-2,1.0000273695224664,7.3984996098635271E-3,0.99993555242527521,1.5116703860940826E-2,18.257723370688531,-106.89638714982998,73.103612850170023,null,1000000000,44673850.822500005,null,27.390951424490204,-55.982637673104811,null,18.458301761374962,-50.471528947213187,null,0,0]
[6760.8,6.7608000000000006,1.5612172406260967,0.87561349958310397,1.0000090224390779,4.2479103666233572E-3,1,0,91.149198725357408,1.5598250832115144,1.2139077060052548,0.60273919077955473,1.0001118686633974,1.4957154512903534E-2,1.0007054564756157,3.7551085233036546E-2,1.0000280033423723,7.4836740841150483E-3,0.99993406026479448,1.5290776144736892E-2,18.131780140039751,-106.94294582908653,73.057054170913474,null,1000000000,45708416.640000001,null,27.323219937577047,-55.693964158617234,null,18.399956976763971,-50.801667671656645,null,0,0]
[6839.55,6.83955,1.5719669312826994,0.88130382080822212,1.0000092338495146,4.2973895475707184E-3,1,0,92.210780254874393,1.5599513952197053,1.2184697497217332,0.60815854016219795,1.0001144897903735,1.5131349456055647E-2,1.0007219805827396,3.7988063130950336E-2,1.0000286594999022,7.5708408312941062E-3,0.99993251553101692,1.5468921585869789E-2,18.00431384426129,-106.98827388096883,73.011726119031167,null,1000000000,46779444.202500001,null,27.255202005696283,-55.40067609097612,null,18.340370887810362,-51.135071095984955,null,0,0]
[6918.3,6.9183000000000003,1.5827668294960371,0.88691666670515168,1.000009447708162,4.3468687074763113E-3,1,0,93.272363222099898,1.5600748319799298,1.2230673115283757,0.61353730340327306,1.0001171412645424,1.5305543480854871E-2,1.0007386957710773,3.842502651474726E-2,1.0000293232556814,7.6580074634239889E-3,0.99993095292456657,1.5647068348073681E-2,17.878261352534587,-107.03132370513529,72.968676294864707,null,1000000000,47862874.890000001,null,27.188465453696544,-55.109548645764775,null,18.280915632902222,-51.464035587883998,null,0,0]
[6998.9,6.9988999999999999,1.5938713650804592,0.89258242154721978,1.0000096691259457,4.3975102129060724E-3,1,0,94.35888640191942,1.5601982924379862,1.2278092426105152,0.61900055029350287,1.0001198864520029,1.5483828720752497E-2,1.0007560014909656,3.8872239867147877E-2,1.0000300104725319,7.7472216990930876E-3,0.99992933510244864,1.5829401529189657E-2,17.75068541483158,-107.07309601090083,72.926903989099173,null,1000000000,48984601.209999993,null,27.12145587053417,-54.813816411157717,null,18.220205043955414,-51.796204805683701,null,0,0]
[7079.5,7.0795000000000003,1.6050263562517222,0.89816959927274087,1.000009893108315,4.4481516957803231E-3,1,0,95.445410987257233,1.560318942017332,1.2325875375935598,0.62442159989116985,1.0001226634287255,1.5662112976250499E-2,1.0007735073548913,3.9319437663375166E-2,1.0000307056487903,7.8364358114368302E-3,0.999927698559259,1.601173612642039E-2,17.62453792740618,-107.11262296903448,72.887377030965524,null,1000000000,50119320.25,null,27.055724323203826,-54.52034079543516,null,18.159643204094344,-52.123871968763538,null,0,0]
[7161.95,7.16195,1.6164885032495278,0.90380505175010295,1.0000101248852753,4.4999555215881511E-3,1,0,96.556875817143194,1.5604395513825444,1.2375126943515082,0.62992359624917338,1.0001255370368296,1.5844488333804727E-2,1.0007916221049713,3.9776883643658147E-2,1.0000314250168509,7.9276975131558469E-3,0.99992600508281948,1.6198257305215697E-2,17.496946375092872,-107.15080588908745,72.849194110912549,null,1000000000,51293527.802499995,null,26.989774111765698,-54.222459370756297,null,18.097850891691206,-52.45447834749406,null,0,0]
[7244.4,7.2443999999999997,1.6280012633820622,0.90936097398262927,1.0000103593458975,4.5517593232433399E-3,1,0,97.668342019637109,1.5605574156791251,1.2424750153932194,0.6353818078963529,1.0001284439096887,1.602686263727705E-2,1.000809946269922,4.0234312968594692E-2,1.0000321527138598,8.0189590828174898E-3,0.99992429201735267,1.6384780000405868E-2,17.370796247379431,-107.18678358237734,72.813216417622655,null,1000000000,52481331.359999992,null,26.92509670113834,-53.926929283976023,null,18.036225460777807,-52.780528067113508,null,0,0]
[7328.75,7.3287500000000003,1.6398305910944118,0.91496402090493278,1.0000106019866313,4.6047568803684116E-3,1,0,98.805422520683365,1.560675251985594,1.2475896858268711,0.64092069801880203,1.000131452192436,1.6213438519864974E-2,1.0008289093990614,4.0702265983919489E-2,1.0000329057991566,8.1123235704208714E-3,0.99992251920489661,1.6575602562225858E-2,17.243203676741061,-107.22138175735334,72.778618242646658,null,1000000000,53710576.5625,null,26.860213514552239,-53.627015790095577,null,17.973358040940436,-53.109455799631512,null,0,0]
[7413.1,7.4131,1.6517106615337598,0.92048663834654854,1.0000108474361342,4.6577544116261733E-3,1,0,99.942504362463623,1.5607904069614951,1.2527423182235202,0.64641419170508685,1.0001344952901092,1.6400013273563076E-2,1.0008480916814069,4.1170201164108494E-2,1.0000336676016546,8.2056879165922931E-3,0.99992072589161796,1.6766426748101682E-2,17.117065544226413,-107.25381918881521,72.746180811184786,null,1000000000,54954051.610000007,null,26.796597576841449,-53.329549626809452,null,17.910675987251174,-53.433775356886038,null,0,0]
[7499.45,7.4994499999999995,1.6639238440507846,0.92605833922946323,1.0000111016148781,4.7120085258854352E-3,1,0,101.10654858533289,1.5609056093432567,1.2580559590797462,0.6519911547670324,1.0001376466044583,1.659101066779603E-2,1.0008679557857298,4.1649212741250573E-2,1.000034456496713,8.3012658512829109E-3,0.99991886882262604,1.6961777216346643E-2,16.989415655997238,-107.28486241372558,72.715137586274423,null,1000000000,56241750.302499995,null,26.732753274496233,-53.027557135366877,null,17.846704863885602,-53.761094528148448,null,0,0]
[7585.8,7.5857999999999999,1.6761879275035296,0.93154867609424785,1.0000113587371615,4.7662626124048276E-3,1,0,102.27059411950091,1.5610181892557893,1.2634083988014839,0.65752103491708713,1.0001408344036025,1.6782006851445305E-2,1.0008880495321519,4.2128205195100514E-2,1.0000352545272131,8.3968436343038067E-3,0.9999169902706837,1.7157129426222845E-2,16.863234845273467,-107.31379136000452,72.686208639995485,null,1000000000,57544361.640000001,null,26.670171727753033,-52.728111970285681,null,17.782938152309633,-54.083751985939941,null,0,0]
[7674.15,7.67415,1.6887875925157583,0.93708347255947133,1.0000116248613891,4.8217732787166371E-3,1,0,103.46160206567862,1.561130754729986,1.2689244544632463,0.66313053536618016,1.0001441337989063,1.697742553561148E-2,1.0009088463484936,4.2618271836647362E-2,1.000036080496594,8.4946349882986643E-3,0.99991504597432901,1.7357008119957187E-2,16.7356240180825,-107.34127818185523,72.65872181814477,null,1000000000,58892578.222499996,null,26.607414820437867,-52.424357461459898,null,17.717910929754183,-54.409144142900928,null,0,0]
[7762.5,7.7625000000000002,1.7014382246673239,0.94253612872188897,1.0000118940670848,4.8772839153122796E-3,1,0,104.65261129297784,1.5612407580808829,1.2744800923725255,0.66869130432593815,1.0001474713879235,1.7172842922978139E-2,1.0009298835383988,4.3108317995787876E-2,1.0000369160294531,8.5924261798189655E-3,0.99991307919007111,1.7556888679412908E-2,16.609495012423011,-107.36670417134798,72.633295828652024,null,1000000000,60256406.25,null,26.545914208357249,-52.123248188152623,null,17.653107234385057,-54.729830115778405,null,0,0]
[7852.9,7.8529,1.7144339694601916,0.94803184482184766,1.0000121727087508,4.9340825434867437E-3,1,0,105.87125698986931,1.5613507520619534,1.2802050717007138,0.67433096553710392,1.0001509259525025,1.7372793255213174E-2,1.0009516576463848,4.3609713333927456E-2,1.0000377808482044,8.6924862667799811E-3,0.99991104349446991,1.7761409054879506E-2,16.481944743612843,-107.39066419137833,72.609335808621665,null,1000000000,61668038.409999996,null,26.484253950981781,-51.817877903556742,null,17.587035784649462,-55.053175286739759,null,0,0]
[7943.3,7.9432999999999998,{"$f":"SQRT(1+(A141/pole1)^2)","v":1.7274807151293343},{"$f":"ATAN(A141/pole1)","v":0.95344470989987651},{"$f":"SQRT(1+(A141/Zero1)^2)","v":1.0000124545765383},{"$f":"ATAN(A141/Zero1)","v":4.9908811398254376E-3},{"$f":"IF(VIN_nom>Vout, 1, SQRT(1+(A141/z_RHP)^2))","v":1},{"$f":"IF(VIN_nom>Vout, 0, -ATAN(A141/z_RHP))","v":0},{"$f":"SQRT(1+(A141/Pole2)^2)","v":107.0899039385104},{"$f":"ATAN(A141/Pole2)","v":1.5614582426555681},{"$f":"SQRT(1+(A141/Zero2)^2)","v":1.2859704056542487},{"$f":"ATAN(A141/Zero2)","v":0.67992023511275279},{"$f":"SQRT(1+(A141/pole4)^2)","v":1.0001544205029735},{"$f":"ATAN(A141/pole4)","v":1.757274219818486E-2},{"$f":"SQRT(1+(A141/Zero3)^2)","v":1.0009736833799157},{"$f":"ATAN(A141/Zero3)","v":4.4111086732391142E-2},{"$f":"SQRT(1+(A141/pole5)^2)","v":1.0000386556793377},{"$f":"ATAN(A141/pole5)","v":8.7925461796782081E-3},{"$f":"SQRT((1-(Z141/pterm2))^2+(A141/pterm1)^2)","v":0.99990898425717201},{"$f":"IF((ATAN((A141/pterm1)/(1-A141^2/pterm2))>0),ATAN((A141/pterm1)/(1-A141^2/pterm2)),PI()+ATAN((A141/pterm1)/(1-A141^2/pterm2)))","v":1.7965931429156836E-2},{"$f":"20*LOG10(((E141*K141*G141*O141)/(C141*I141*S141*M141*Q141))*Adc)","v":16.35588879315759},{"$f":"((F141+L141+H141+R141)-(D141+J141+T141+N141+T141))*radconv","v":-107.41262115326873},{"$f":"IF(V141>0,V141,V141+180)","v":72.587378846731269},null,{"$f":"IF(U141<0,A141,1000000000)","v":1000000000},{"$f":"A141^2","v":63096014.890000001},null,{"$f":"20*LOG10((K141/(I141*M141))*AEA)","v":26.423843026597975},{"$f":"(L141-(J141+N141))*radconv","v":-51.515251333867234},null,{"$f":"20*LOG10((E141*G141/(C141*S141))*Acs*Am)","v":17.521207227877987},{"$f":"(F141+H141-(D141+T141))*radconv","v":-55.371773560158218},null,{"$f":"SUM((U142<0)*(U141>0))*A141","v":0},0]
[8035.8,{"$f":"A142/1000","v":8.0358000000000001},1.7408821334901681,0.95889917204313468,1.0000127463315434,5.0489991392475685E-3,1,0,108.33686141525448,1.5615657270919023,1.2919108769126919,0.68558752478197371,1.0001580376217192,1.7777334518087082E-2,1.0009964812172212,4.4624084107766408E-2,1.0000395611968145,8.8949303109433896E-3,0.9999068528162639,1.817520696929226E-2,16.228422378123646,-107.43309283102565,72.566907168974353,null,1000000000,64574081.640000001,null,26.36328881040793,-51.208420235208671,null,17.454105069326076,-55.692951909972244,null,0,0]
[8128.3,8.1282999999999994,1.75433455291759,0.96427014118285459,1.0000130414642914,5.1071171045614016E-3,1,0,109.58382011511979,1.5616707653899726,1.2978924613783676,0.6912027558572148,1.0001616966047933,1.7981925349595407E-2,1.0010195424710346,4.5137057981507155E-2,1.0000404771971971,8.9973142557215943E-3,0.99990469672928106,1.8384484650930958E-2,16.102462442113662,-107.45162346914125,72.548376530858746,null,1000000000,66069260.890000001,null,26.303976412374443,-50.904431635598449,null,17.387265381512886,-56.009346587712557,null,0,0]
[8222.9500000000007,8.2229500000000009,1.7681512288520209,0.96968119103179085,1.0000133469532986,5.1665858841636143E-3,1,0,110.85976340240154,1.5617757991382384,1.3040550447999455,0.69689499598480364,1.0001654839692533,1.8191269977027941E-2,1.0010434123958321,4.5661930424492396E-2,1.0000414253395924,9.1020777401547223E-3,0.99990246501694457,1.8598628867092737E-2,15.975104718393332,-107.46865431104875,72.531345688951248,null,1000000000,67616906.702500015,null,26.244537565895179,-50.596302854058202,null,17.319147621499749,-56.328239156865095,null,0,0]
[8270.2750000000015,8.2702750000000016,1.7750787539406385,0.97235508836855367,1.0000135010240201,5.1963202602870323E-3,1,0,111.49773549680032,1.5618274145334241,1.3071520693698058,0.69972094319464606,1.0001673940885492,1.8295941693901804E-2,1.0010554507714737,4.5924357223244783E-2,1.000041903526725,9.1544594075889281E-3,0.99990133948464532,1.8705701833937383E-2,15.911997003701117,-107.47646184244216,72.523538157557837,null,1000000000,68397448.575625017,null,26.215282809204339,-50.443342597545971,null,17.285194362421475,-56.485873364134811,null,0,0]
[8317.6,8.3176000000000005,1.7820188716309644,0.97500817742936174,1.0000136559788864,5.2260546272218924E-3,1,0,112.13570788486568,1.5618784426190007,1.3102594834301327,0.7025335087326896,1.0001693151658053,1.840061300982563E-2,1.001067558085966,4.6186777692278198E-2,1.000042384457809,9.2068410247850511E-3,0.99990020750178632,1.8812775377693543E-2,15.849265213267934,-107.48381025694027,72.516189743059726,null,1000000000,69182469.760000005,null,26.186332425343508,-50.291115381016873,null,17.251312081702313,-56.642315378593082,null,0,0]
[8366.0499999999993,8.3660499999999995,1.7891368605174134,0.97770299311422537,1.0000138155332281,5.2564958237336515E-3,1,0,112.78884631809939,1.5619300857216885,1.3134514521820306,0.70539912425798379,1.0001712932622344,1.850777213262253E-2,1.0010800246269227,4.6455429771096651E-2,1.0000428796640517,9.2604677944836365E-3,0.99989904192742685,1.8922394852426364E-2,15.78542788051335,-107.49086757110085,72.50913242889915,null,1000000000,69990792.602499992,null,26.157005003902725,-50.136026402830701,null,17.216698304661627,-56.801253525254218,null,0,0]
[8414.5,8.4145000000000003,1.7962677391457385,0.9803764321620323,1.0000139760142488,5.2869370105032877E-3,1,0,113.44198504867832,1.5619811341573691,{"$f":"SQRT(1+(A148/Zero2)^2)","v":1.3166541543246459},{"$f":"ATAN(A148/Zero2)","v":0.70825082214368473},1.0001732828436627,1.8614930830320217E-2,1.0010925634179657,4.6724075139512065E-2,1.0000433777462452,9.3140945109176851E-3,0.99989786959249238,1.9032014938828664E-2,15.721977027593908,-107.49746349362292,72.502536506377083,null,1000000000,70803810.25,null,26.127988241991421,-49.981700750388761,null,17.182159747379188,-56.958966916434683,null,0,0]
[8462.9500000000007,8.4629500000000011,1.8034113546137511,0.9830287101587849,1.000014137421948,5.3173781874743887E-3,1,0,114.09512407149596,1.5620315981383108,1.3198675117231982,0.71108865749204631,1.0001752839100213,1.8722089100460224E-2,1.0011051744563808,4.6992713759000874E-2,1.0000438787043853,9.3677211737788323E-3,0.99989669049714236,1.9141635640443334E-2,15.658908917991516,-107.50360780495387,72.496392195046127,null,1000000000,71621522.702500015,null,26.099278014777909,-49.828135851543465,null,17.147696798215577,-57.115467904508769,null,0,0]
[8511.4,8.5114000000000001,1.8105675561614074,0.98566004048209543,1.0000142997563251,5.3478193545905403E-3,1,0,114.74826338156211,1.5620814876442843,1.3230914467432702,0.71391268576403333,1.0001772964612414,1.882924694058415E-2,1.0011178577394371,4.7261345591045292E-2,1.0000443825384677,9.4213477827587155E-3,0.99989550464153698,1.9251256960813281E-2,15.596219862809239,-107.50931012513585,72.490689874864145,null,1000000000,72443929.959999993,null,26.070870264448111,-49.675329100273494,null,17.113309826135218,-57.270768715319356,null,0,0]
[8560.9500000000007,8.5609500000000001,1.8178990938593884,0.9883296656578141,1.0000144667347877,5.3789516421839543E-3,1,0,115.41623173991687,1.5621319258089319,1.326399437593331,0.71678660757314838,1.0001793665839338,1.8938837225513764E-2,1.0011309037021918,4.7536069330932879E-2,1.000044900786129,9.4761918644771827E-3,0.99989428487042686,1.936336774740946E-2,15.532495792453751,-107.51469461176275,72.485305388237251,null,1000000000,73289864.902500018,null,26.042126245618611,-49.51983446454571,null,17.078221087324557,-57.428366697174155,null,0,0]
[8610.5,8.6105,1.8252434834044688,0.99097782557853664,1.0000146346824832,5.4100839193505041E-3,1,0,116.08420038851239,1.5621817835137879,1.3297183291816845,0.71964620665421541,1.000181448718761,1.9048427055478837E-2,1.0011440252214601,4.7810785890206549E-2,1.0000454220417954,9.5310358891876282E-3,0.99989305802895168,1.9475479188671464E-2,15.469160528484164,-107.51963665665903,72.480363343340969,null,1000000000,74140710.25,null,26.013690218411419,-49.36512717672332,null,17.043212535350531,-57.584734848617103,null,0,0]
[8660.0499999999993,8.66005,1.8326005702802166,0.99360474139883759,1.0000148035994114,5.4412161860298456E-3,1,0,116.75216932236708,1.5622310707214775,1.333048040089583,0.72249154339180111,1.0001835428656483,1.9158016427849894E-2,1.0011572222942711,4.8085495227684204E-2,1.0000459463054623,9.5858798565602223E-3,0.99989182411728617,1.9587591288389061E-2,15.406210274069924,-107.52414604239006,72.475853957609942,null,1000000000,74996466.002499983,null,25.985558051055353,-49.211204347691201,null,17.008284505205186,-57.739885841092551,null,0,0]
[8709.6,8.7096,1.8399702021765119,0.99621063191209902,1.0000149734855717,5.4723484421616382E-3,1,0,117.42013853661271,1.5622797971679399,1.3363884894456208,0.72532267849338883,1.00018564902452,1.9267605339997523E-2,1.001170494917637,4.8360197302190246E-2,1.0000464735771251,9.6407237662651298E-3,0.99989058313560608,1.9699704050352027E-2,15.343641280860234,-107.52823238474485,72.471767615255146,null,1000000000,75857132.160000011,null,25.957725679309917,-49.058063056844347,null,16.973437312829937,-57.893832210758468,null,0,{"$f":"IF(AH154>0,W154,0)","v":0}]
[8760.3250000000007,8.7603249999999999,1.8475274312948087,0.99885676387715594,1.0000151484042934,5.5042189395944404E-3,1,0,118.1039478713848,1.5623291081532793,1.3398191918598696,0.72820630241237161,1.0001878175701735,1.9379792500664322E-2,1.0011841605363088,4.8641405936239557E-2,1.0000470164680342,9.6968681525989673E-3,0.9998893054027056,1.9814476079359458E-2,15.279979629290327,-107.53198728464862,72.468012715351378,null,1000000000,76743294.105625018,null,25.929539676745804,-48.902096738570776,null,16.93784782062081,-58.050194312443963,null,0,0]
[8811.0499999999993,8.8110499999999998,1.8550974913743619,1.0014813180566973,1.0000153243387591,5.536089425845549E-3,1,0,118.78775749002898,1.562377851414809,1.3432609782928591,0.73107517288578228,1.0001899987040954,1.9491979173445612E-2,1.0011979053247531,4.8922606871467968E-2,1.0000475625112799,9.7530124777981692E-3,0.99988802026088186,1.9929248810430383E-2,15.216709737722073,-107.53531870713714,72.464681292862863,null,1000000000,77634602.102499992,null,25.901659448122313,-48.746943174330703,null,16.902343656630777,-58.205320138952686,null,0,0]
[8861.7749999999996,8.8617749999999997,1.8626802259774611,1.0040845215930823,1.0000155012889678,5.5679599008502259E-3,1,0,119.47156738767092,1.5624260367006024,1.3467137637625572,0.73392935598601883,1.0001921924262032,1.9604165355520668E-2,1.0012117292797089,4.9203800063722145E-2,1.0000481117068576,9.8091567415088884E-3,0.99988672771032627,2.0044022247630685E-2,15.153827737160784,-107.53823643969118,72.461763560308825,null,1000000000,78531056.15062499,null,25.874080844239952,-48.592599136816396,null,16.86692510112109,-58.359222704819878,null,0,0]
[8912.5,8.9124999999999996,1.8702754809435904,1.0066665991056847,1.0000156792549189,5.5998303645437338E-3,1,0,120.15537755954723,1.5624736735368356,{"$f":"SQRT(1+(A158/Zero2)^2)","v":1.3501774638860278},{"$f":"ATAN(A158/Zero2)","v":0.73676891806789613},1.0001943987364137,1.9716351044068839E-2,1.0012256323978974,4.9484985468856053E-2,1.0000486640547617,9.8653009433772691E-3,0.99988542775123201,2.0158796395026241E-2,15.091329808226906,-107.54075009633993,72.459249903660066,null,1000000000,79432656.25,null,25.846799784219087,-48.439061369825104,null,16.831592415648586,-58.511914880024335,null,0,0]
[8964.4,8.9643999999999995,1.8780594736269776,1.0092868540846187,1.0000158623946025,5.6324390677161152E-3,1,0,120.85502787145882,1.5625218558949392,1.3537326070159637,0.73965919262822966,1.0001966691826414,1.9831134901648222E-2,1.001239939501239,4.9772676180709803E-2,1.0000492324600172,9.9227456119126388E-3,0.99988409001198586,2.0276229923877495E-2,15.027777756952172,-107.54291360332742,72.45708639667258,null,1000000000,80360467.359999999,null,25.81919055847349,-48.282798112067262,null,16.795530410072033,-58.666904536251828,null,0,0]
[9016.2999999999993,9.0162999999999993,1.8858562540760206,1.0118854607059085,1.0000160465976302,5.66504775891012E-3,1,0,121.55467846071028,1.5625694835922264,1.3572989995084497,0.74253430232797424,1.0001989528067343,1.9945918236597821E-2,1.001254329470779,5.0060358647024628E-2,1.0000498041653212,9.9801902149579975E-3,0.99988274451741277,2.0393664204818661E-2,14.964619842767245,-107.54467391425013,72.455326085749874,null,1000000000,81293665.689999983,null,25.791884390791481,-48.127371927150698,null,16.75955879508988,-58.820653876729374,null,0,0]
[9068.2000000000007,9.0682000000000009,1.8936656643377106,1.0144626514873076,1.0000162318640011,5.6976564380564077E-3,1,0,122.2543293225401,1.5626165661513061,1.3608765529212818,0.74539431904645392,1.0002012496086021,2.0060701045896637E-2,1.0012688023029441,5.0348032820539165E-2,1.0000503791706685,1.0037634752134338E-2,0.9998813912677228,2.0511099242204803E-2,14.90185213043468,-107.54604077896906,72.453959221030942,null,1000000000,82232251.24000001,null,25.764877123229478,-47.972779242125732,null,16.723677793470095,-58.973176223996468,null,0,0]
[9120.1,9.1201000000000008,1.9014875488001137,1.0170186562678927,1.000016418193715,5.7302651050856364E-3,1,0,122.95398045229501,1.5626631128780482,1.3644651794644858,0.74823931489797901,1.000203559588154,2.0175483326523757E-2,1.0012833579941416,5.0635698654000277E-2,1.0000509574760528,1.009507922306265E-2,0.99988003026312688,2.0628535040391003E-2,14.839470735443339,-107.5470237679864,72.452976232013597,null,1000000000,83176224.010000005,null,25.738164666812033,-47.819016458160704,null,16.687887609739182,-59.124484747115645,null,0,0]
[9173.2000000000007,9.1732000000000014,1.9095030363730561,1.0196120699057876,1.0000166099321357,5.7636277171211779E-3,1,0,123.66980875933065,1.5627101907547856,1.3681481492854821,0.75113462060104041,1.0002059366157787,2.0292918982415555E-2,1.0012983359842478,5.0930007039799025E-2,1.0000515525680256,1.0153851820891954E-2,0.99987862976450337,2.0748686909079567E-2,14.776042815995311,-107.54764198916016,72.452358010839845,null,1000000000,84147598.24000001,null,25.711135502328162,-47.662553591888781,null,16.651364093963284,-59.278049061387463,null,0,0]
[9226.2999999999993,9.2262999999999984,1.917531259450866,1.0221837847734985,1.0000168027836382,5.7969903163260107E-3,1,0,124.38563733730415,1.5627567267734124,1.3718425263753133,0.75401435619792845,1.000208327437311,2.041035407850848E-2,1.0013134007016393,5.1224306595374379E-2,1.0000521511143905,1.0212624348571687E-2,0.99987722114867117,2.0868839583379453E-2,14.71301121724399,-107.54787808256532,72.452121917434681,null,1000000000,85124611.689999983,null,25.684406495095352,-47.506951748731211,null,16.614936021260831,-59.430370174598963,null,0,0]
[9279.4,9.279399999999999,1.9255720587404086,1.024734038468925,1.0000169967482222,5.8303529026258738E-3,1,0,125.10146618156467,1.5628027302352392,1.3755482188228048,0.75687859957011094,1.0002107320526521,2.0527788611567458E-2,1.001328552142402,5.1518597270146183E-2,1.0000527531151415,1.0271396805695955E-2,0.99987580441586055,2.0988993067954927E-2,14.650371938255734,-107.54774173258191,72.452258267418088,null,1000000000,86107264.359999999,null,25.657973481032819,-47.352206999149054,null,16.578603554846712,-59.58146170037854,null,0,0]
[9332.5,9.3324999999999996,1.9336252773507006,1.0272630657576758,1.0000171918258869,5.8637154759465047E-3,1,0,125.81729528756715,1.5628482102299086,1.3792651354245322,0.75972742878014443,1.0002131504617024,2.0645222578357519E-2,1.0013437903025992,5.1812879013543443E-2,1.0000533585702724,1.0330169191858861E-2,0.9998743795663031,2.1109147367470233E-2,14.588121030001517,-107.54724243880817,72.452757561191831,null,1000000000,87095556.25,null,25.631832365666362,-47.198315391100081,null,16.542366840234234,-59.731337090076238,null,0,0]
[9386.85,9.3868500000000008,1.9418807726982801,1.0298298878618857,1.0000173926484672,5.897863407060183E-3,1,0,126.54997562764605,1.5628942280207936,1.3830810792109438,0.76262743975212266,1.0002156400857789,2.0765420408428964E-2,1.0013594769780056,5.2114078991278526E-2,1.0000539818554204,1.0390325034859123E-2,0.99987291276972834,2.123213100683868E-2,14.524802828801482,-107.54636525519427,72.453634744805726,null,1000000000,88112952.922499999,null,25.605373960503076,-47.041680455255062,null,16.505376388876766,-59.883495074735272,null,0,0]
[9441.2000000000007,9.4412000000000003,1.9501489539027346,1.0323749611503967,1.0000175946371488,5.9320113244189319E-3,1,0,127.28265623262661,1.5629397160248593,1.386908590732838,0.76551146829668437,1.0002181441604172,2.0885617638399561E-2,1.0013752544953214,5.2415269505014565E-2,1.0000546087594846,1.0450480802657305E-2,0.99987143747025919,2.1355115509854704E-2,14.461883289582754,-107.54512739699997,72.454872603000027,null,1000000000,89136257.440000013,null,25.579212895977808,-46.885930856116367,null,16.468486504463367,-60.034406994315397,null,0,0]
[9495.5499999999993,9.4955499999999997,1.9584296602910078,1.0348985283197907,1.0000177977919305,5.9661592279431205E-3,1,0,128.01533709796044,1.5629846833384351,1.3907475744826465,0.76837959859169858,1.0002206626855086,2.1005814264800766E-2,1.0013911228502526,5.2716450500554776E-2,1.0000552392824584,1.0510636494818175E-2,0.99986995366814868,2.1478100881519826E-2,14.399358341116637,-107.54353846826355,72.456461531736451,null,1000000000,90165469.80249998,null,25.553344999020151,-46.731062291629918,null,16.431697288910058,-60.18408675459758,null,0,0]
[9549.9,9.5498999999999992,1.9667227336546813,1.0374008290781112,1.0000180021128118,6.0003071175531216E-3,1,0,128.74801821920269,1.5630291388507973,1.3945979357197416,0.77123191493581322,1.000223195660944,2.1126010284164134E-2,1.0014070820384811,5.3017621923712697E-2,1.000055873424335,1.0570792110906507E-2,0.99986846136365048,2.1601087126835589E-2,14.337223965413576,-107.54160788300949,72.45839211699051,null,1000000000,91200590.00999999,null,25.527766166916276,-46.577070440958238,null,16.395008827015829,-60.332548090132185,null,0,0]
[9605.5249999999996,9.6055250000000001,1.975222997735369,1.039940057911658,1.0000182124343222,6.0352560701195388E-3,1,0,129.49788761247981,1.5630741163614932,1.3985503057286459,0.77413485724986963,1.0002258030202993,2.1249025357169233E-2,1.0014235096643449,5.3325848577459048E-2,1.00005652618982,1.0632358842075957E-2,0.9998669252474417,2.1726959423913794E-2,14.274032261435444,-107.53928786308273,72.460712136917266,null,1000000000,92266110.52562499,null,25.501882386503762,-46.420369364049378,null,16.357564086096367,-60.483244709584284,null,0,0]
[9661.15,9.6611499999999992,1.9837358882366483,1.0424575094589359,1.0000184239772838,6.0702050079425047E-3,1,0,130.24775726471165,1.5631185759782118,1.4025143949412811,0.77702141392928059,1.0002284255157008,2.137203978697029E-2,1.0014400324259909,5.3634065089621603E-2,1.0000571827459768,1.0693925492639365E-2,0.9998653802257933,2.1852832646714355E-2,14.211241320949856,-107.53662932582397,72.463370674176034,null,1000000000,93337819.32249999,null,25.476292916257318,-46.264577404859367,null,16.320225008609835,-60.632693636327232,null,0,0]
[9716.7749999999996,9.7167750000000002,1.9922612433012341,1.044953431175595,1.0000186367416957,6.1051539309366562E-3,1,0,130.9976271714512,1.5631625265945199,1.4064901042685012,0.77989167561908901,1.0002310631470295,2.1495053569849334E-2,1.0014566503187101,5.3942271402144241E-2,1.0000578430927978,1.0755492062130155E-2,0.99986382629898241,2.1978706800599188E-2,14.148847004014462,-107.5336417658162,72.466358234183801,null,1000000000,94415716.40062499,null,25.4509935775808,-46.109689879160626,null,16.282991633291488,-60.780909048837486,null,0,0]
[9772.4,9.7723999999999993,2.0007989035955371,1.0474280673758454,1.0000188507275571,6.1401028390166259E-3,1,0,131.74749732835269,1.5632059769015132,1.4104773354495366,0.78274573301781147,1.0002337159141654,2.1618066702088511E-2,1.001473363337767,5.4250467456982449E-2,1.0000585072302757,1.0817058550081762E-2,0.99986226346728768,2.2104581890930227E-2,14.086845225309617,-107.53033448298639,72.46966551701361,null,1000000000,95499801.75999999,null,25.425980262955168,-45.955702088061038,null,16.245863982422669,-60.927904945600311,null,0,0]
[9829.2999999999993,9.8292999999999999,2.0095448266030496,1.0499376540800269,1.0000190708820282,6.1758528076720351E-3,1,0,132.51455577471245,1.5632499143603769,1.4145677787934814,0.78564853817023672,1.0002364451463583,2.1743898784121987E-2,1.0014905578587525,5.456571710738168E-2,1.0000591905126548,1.0880036140097712E-2,0.9998606556002847,2.2233343182530098E-2,14.023824217018817,-107.52663008836751,72.473369911632489,null,1000000000,96615138.48999998,null,25.400685333410319,-45.799110682082599,null,16.20799470953402,-61.077022828494101,null,0,0]
[9886.2000000000007,9.8862000000000005,2.0183032960426788,1.052425475531354,1.0000192923145834,6.211602760541027E-3,1,0,133.28161447394703,1.5632933460840024,1.4186700728849482,0.78853457974449481,1.0002391902159213,2.1869730177477405E-2,1.0015078519067919,5.4880955901640681E-2,1.0000598777614402,1.0943013643806083E-2,0.9998590384160907,2.2362105465347178E-2,13.961205471844675,-107.52261022237988,72.477389777620118,null,1000000000,97736950.440000013,null,25.375681217321016,-45.643450742430687,null,16.170236060132989,-61.22489371195492,null,0,0]
[9943.1,9.9431000000000012,2.0270741492846498,1.0548917832586679,1.000019515025222,6.2473526975322293E-3,1,0,134.04867342171539,1.5633362807540427,1.4227841152166429,0.79140395487335247,1.0002419511227243,2.1995560878175724E-2,1.0015252454767294,5.5196183777669432E-2,1.0000605689766238,1.1005991060707487E-2,0.99985741191500899,2.2490868745120667E-2,13.898984788640032,-107.51828422915251,72.481715770847487,null,1000000000,98865237.610000014,null,25.350963739691842,-45.488717201001805,null,16.132588008157033,-61.371532007857901,null,0,0]
[10000,10,2.0358572262737678,1.0573368255063287,1.0000197390139427,6.2831026185542743E-3,1,0,134.81573261377534,1.5633787268545751,1.4269098041715838,0.7942567606687605,1.0002447278666355,2.2121390882238055E-2,1.0015427385633795,5.5511400673390901E-2,1.0000612641581967,1.1068968390302556E-2,0.99985577609734488,2.2619633027589823E-2,13.837158022206221,-107.51366125449989,72.486338745500106,null,1000000000,100000000,null,25.32652879716403,-45.33490497956489,null,16.095050511855959,-61.516951939891229,null,0,0]
[10058.25,10.058249999999999,2.0448611868603042,1.0598181059199296,1.0000199696409096,6.3197007196591536E-3,1,0,135.60099117423226,1.5634216825859752,1.4311453377669974,0.79716018933365174,1.0002475868961656,2.2250205582410844E-2,1.0015607497690675,5.5834084914133976E-2,1.0000619799421895,1.1133439818656199E-2,0.99985409181809159,2.2751453394807431E-2,13.774268140717469,-107.50863030605619,72.49136969394381,null,1000000000,101168393.0625,null,25.301802574447443,-45.178392491544741,null,16.056736868960531,-61.664574669511659,null,0,0]
[10116.5,10.1165,2.0538776267224632,1.0622776159239127,1.0000202016073234,6.356298803834334E-3,1,0,136.3862499820182,1.5634641436727739,1.4353928645136054,0.80004645891285364,1.0002504625229358,2.2379019544060571E-2,1.001578865258631,5.6156757515738044E-2,1.0000626998829989,1.1197911154452416E-2,0.99985239777557733,2.2883274825037114E-2,13.711782473912603,-107.50330689293615,72.496693107063848,null,1000000000,102343572.25,null,25.277363973566096,-45.022834763353714,null,16.018538953451248,-61.810950108417387,null,0,0]
[10174.75,10.17475,2.062906382229019,1.0647156114145677,1.0000204349131836,6.3928968709817905E-3,1,0,137.17150903288558,1.5635061186098203,1.4396522782582151,0.80291567340764314,1.0002533547468031,2.2507832762918796E-2,1.0015970850264115,5.647941841164468E-2,1.0000634239806163,1.126238239715545E-2,0.99985069397013515,2.3015097324436459E-2,13.64969675075093,-107.49770020529931,72.50229979470069,null,1000000000,103525537.5625,null,25.253208815933341,-44.868226322632012,null,15.980456672971954,-61.956092918744254,null,0,0]
[10233,10.233000000000001,2.0719472923793445,1.0671323448539654,1.000020669558489,6.4294949210034922E-3,1,0,137.95676832268347,1.563547615698557,1.4439234738048623,0.80576793671710767,1.0002562635676233,2.2636645234717222E-2,1.0016154090667184,5.6802067535310037E-2,1.0000641522350322,1.1326853546229554E-2,0.99984898040210024,2.3146920899163075E-2,13.588006757692659,-107.49181923131268,72.508180768687325,null,1000000000,104714289,null,25.229332995367528,-44.714561691793484,null,15.942489920262929,-62.10001756586184,null,0,0]
[10292.5,10.2925,2.0811945974542727,1.069579247144975,1.0000209106219691,6.466878319122603E-3,1,0,138.75887891266083,1.5635895183784794,1.4482983812773718,0.80866401457476755,1.0002592519443518,2.2768221146931826E-2,1.0016342339737703,5.7131628236848545E-2,1.0000649004087743,1.1392708099135375E-2,0.99984721998348247,2.3281574422556517E-2,13.525397182218439,-107.48553801653605,72.514461983463946,null,1000000000,105935556.25,null,25.205229015560985,-44.558568244395346,null,15.903827576910725,-62.24578790783508,null,0,0]
[10352,10.352,2.0904542530436063,1.0720044867693348,1.0000211530829963,6.5042616991663063E-3,1,0,139.56098974347529,1.5636309393967507,1.4526853627904035,0.81154262465610461,1.0002622576376856,2.2899796270677973E-2,1.0016531676644769,5.7461176515174281E-2,1.0000656529196135,1.1458562553220773E-2,0.99984544937949393,2.3416229080911198E-2,13.463191795643624,-107.47898894664682,72.521011053353178,null,1000000000,107163904,null,25.181408054270172,-44.40354798450344,null,15.86528550135105,-62.390317136499,null,0,0]
[10411.5,10.4115,2.0997260957524548,1.0744083219776541,1.0000213969415694,6.5416450610301276E-3,1,0,140.36310081099796,1.5636718870106567,1.4570843092865948,0.81440387724480556,1.0002652806474688,2.3031370601407128E-2,1.0016722101326694,5.7790712299414522E-2,1.0000664097675398,1.1524416907914775E-2,0.99984366859049834,2.3550884880789782E-2,13.401386287067714,-107.47218097316288,72.527819026837122,null,1000000000,108399332.25,null,25.157865959690881,-44.249495066174944,null,15.826863534594313,-62.533620048905597,null,0,0]
[10471,10.471,2.1090099648460847,1.0767910074717117,1.0000216421976877,6.5790284046095939E-3,1,0,141.16521211119397,1.5637123692898167,1.4614951127259292,0.81724788243544366,1.0002683209735439,2.3162944134570925E-2,1.0016913613721441,5.812023551871276E-2,1.0000671709525437,1.1590271162646413E-2,0.99984187761686061,2.3685541828754975E-2,13.33997640417212,-107.46512284435215,72.534877155647848,null,1000000000,109641841,null,25.134598652531484,-44.096403643549998,null,15.788561503720857,-62.675711238773822,null,0,0]
[10532,10.532,2.118540200529651,1.0792120674008849,1.0000218950875697,6.6173541663311951E-3,1,0,141.98754494209001,1.5637533973069735,1.4660293099358424,0.82014579517941777,1.0002714559229422,2.3297833814822227E-2,1.0017111083284906,5.8458052927821427E-2,1.000067955829538,1.1657785504301868E-2,0.9998400309200004,2.3823594688430792E-2,13.277424694132115,-107.4576360334012,72.542363966598799,null,1000000000,110923024,null,25.111025844835567,-43.940444815348037,null,15.749418189687663,-62.820141696644598,null,0,0]
[10593,10.593,2.1280827428378535,1.081611428724728,1.0000221494463468,6.6556799086125353E-3,1,0,142.80987800924086,1.5637939528261373,1.4705757427306554,0.82302581360783089,1.0002746090723913,2.3432722647106739E-2,1.0017309695961973,5.8795856979702903E-2,1.0000687452650212,1.1725299739675961E-2,0.99983817351929893,2.3961648768779098E-2,13.215279941947164,-107.44990427905856,72.550095720941442,null,1000000000,112211649,null,25.087733398167138,-43.785484135180397,null,15.710400524263717,-62.963328987060429,null,0,0]
[10654,10.654,2.1376374269581566,1.0839893545924633,1.0000224052740185,6.6940056313410396E-3,1,0,143.63221130858875,1.5638340439627105,1.4751342979784405,0.82588805561736456,1.0002777804217189,2.3567610626523905E-2,1.0017509451684647,5.913364759805928E-2,1.0000695392589825,1.179281386815346E-2,0.99983630541515711,2.4099704076871641E-2,13.153537751023743,-107.44193636923126,72.558063630768743,null,1000000000,113507716,null,25.064717144505568,-43.631515312762325,null,15.671508278993713,-63.1052881877728,null,0,0]
[10715,10.715,2.1472040908037209,1.0863461044421805,1.0000226625705833,6.7323313344041322E-3,1,0,144.45454483616814,1.5638736786473078,1.4797048636415799,0.82873263881890202,1.0002809699707522,2.3702497748173342E-2,1.0017710350384554,5.9471424706610966E-2,1.0000703378114111,1.1860327889119138E-2,0.99983442660797783,2.4237760619780193E-2,13.092193785327897,-107.43374088498183,72.56625911501817,null,1000000000,114811225,null,25.041972989490713,-43.478532063596532,null,15.632741212322088,-63.246034163900958,null,0,0]
[10777.5,10.7775,2.1570182590249161,1.0887391110960869,1.0000229277176294,6.7715994522740105E-3,1,0,145.29709991266617,1.5639138226330427,1.484400161304019,0.83162897795621737,1.0002842568276455,2.3840700871466676E-2,1.0017917374626308,5.98174937176882E-2,1.000071160728349,1.1929501978774983E-2,0.99983249049998857,2.4379213283841829E-2,13.029749924239468,-107.42511659510737,72.574883404892631,null,1000000000,116154506.25,null,25.018947563766467,-43.322802591447541,null,15.593150425003744,-63.388998088908139,null,0,0]
[10840,10.84,2.1668446674372457,1.0911104271693184,1.0000231944066951,6.8108675492601686E-3,1,0,146.13965522061631,1.5639535037256145,1.4891078326861216,0.83450702811399258,1.0002875627899459,2.3978903083873737E-2,1.0018125598601848,6.0163548384311052E-2,1.0000719884306741,1.1998675954258962E-2,0.99983054315697528,2.452066725922513E-2,12.967715088911888,-107.41627099183404,72.58372900816596,null,1000000000,117505600,null,24.996199311533328,-43.168094426624407,null,15.553690495030816,-63.53071931151576,null,0,0]
[10902.5,10.9025,2.1766831502695285,1.0934603199320851,1.0000234626377791,6.8501356252415237E-3,1,0,146.98221075603817,1.5639927298853136,1.4938277608037107,0.83736691474639491,1.0002908878574637,2.41171043801243E-2,1.0018335022236367,6.0509588624493786E-2,1.0000728209183747,1.2067849814909357E-2,0.99982858457937906,2.4662122553536583E-2,12.906084806841609,-107.4072126573281,72.592787342671897,null,1000000000,118864506.25,null,24.973724059574778,-43.014400836921908,null,15.514361123245637,-63.671213145621671,null,0,0]
[10965,10.965,2.1865335445323102,1.0957890527936358,1.0000237324108803,6.8894036800969897E-3,1,0,147.82476651504223,1.5640315088909507,1.4985598298437763,0.84020876291761359,1.0002942320300081,2.4255304754948349E-2,1.0018545645454633,6.0855614356271341E-2,1.0000736581914389,1.2137023560064464E-2,0.99982661476764378,2.4803579174382733E-2,12.844854667957176,-107.39794996448522,72.602050035514779,null,1000000000,120231225,null,24.951517709273435,-42.8617151020809,null,15.475161998324209,-63.81049468390686,null,0,0]
[11028.75,11.02875,2.196593051648291,1.0981428305905825,1.0000240091680284,6.9294570741601051E-3,1,0,148.68417361561893,1.5640706107019753,1.5033989289482594,0.84308899410514893,1.0002976627678037,2.4396268182550137E-2,1.0018761716869977,6.1208545571143705E-2,1.0000745171398333,1.220758066045319E-2,0.99982459398672607,2.4947866302130365E-2,12.782807644249685,-107.38829995770749,72.611700042292512,null,1000000000,121633326.5625,null,24.929140080025061,-42.707006989046697,null,15.435312736231905,-63.951328370767442,null,0,0]
[11092.5,11.092499999999999,2.2066646174875273,1.1004751351838133,1.0000242875294882,6.9695104459893756E-3,1,0,149.54358094091367,1.5641092630871103,1.5082504197572775,0.84595071960200596,1.0003011133820652,2.4537230640424949E-2,1.0018979036172797,6.1561461519278972E-2,1.0000753810668945,1.2278137639289982E-2,0.9998225615187506,2.509215482599074E-2,12.721167855231066,-107.37845428740989,72.621545712590105,null,1000000000,123043556.25,null,24.907033832753221,-42.553333368218588,null,15.395598292278301,-64.090931814946345,null,0,0]
[11156.25,11.15625,2.2167480776873369,1.1027862340548615,1.000024567495259,7.0095637954563066E-3,1,0,150.40298848707428,1.5641474737503416,1.5131141830764443,0.84879407076470847,1.0003045838725872,2.4678192122980874E-2,1.0019197603281891,6.1914362113762285E-2,1.0000762499726097,1.2348694495872652E-2,0.99982051736419608,2.5236444754036084E-2,12.659930815037367,-107.36842119503922,72.631578804960782,null,1000000000,124461914.0625,null,24.885194847882836,-42.400687154507601,null,15.356018300314922,-64.229320342476413,null,0,0]
[11220,11.22,2.2268432706697006,1.1050763907495538,1.0000248490653389,7.0496171224324047E-3,1,0,151.2623962503362,1.5641852502205769,1.5179901009394137,0.85161917845684421,1.0003080742391628,2.4819152624626251E-2,1.0019417418115597,6.2267247267701699E-2,1.0000771238569657,1.2419251229499014E-2,0.99981846152354448,2.5380736094338649E-2,12.599092101002864,-107.35820871475444,72.64179128524556,null,1000000000,125888400,null,24.863619080009371,-42.249061281036731,null,15.316572383221756,-64.366509053891107,null,0,0]
[11285.5,11.285500000000001,2.2372276399717337,1.107407875006202,1.0000251400357658,7.0907699289415073E-3,1,0,152.14539582151195,1.5642236191903214,1.5230124044289302,0.85450297358863248,1.0003116811214723,2.4963981602690727E-2,1.0019644566567301,6.262980329162747E-2,1.0000780269158098,1.2491744685833103E-2,0.99981633707686834,2.5528989852820375E-2,12.536993599700764,-107.34753727994004,72.652462720059958,null,1000000000,127362510.25,null,24.841721015450112,-42.094328460052999,null,15.276182875694298,-64.506229694487772,null,0,0]
[11351,11.351000000000001,2.2476240580266613,1.109717803093363,1.0000254326997877,7.1319227114330251E-3,1,0,153.02839561408794,1.5642615453691973,1.5280472903877829,0.85736778831728788,1.0003153089856007,2.5108809533284544E-2,1.0019873032010109,6.2992342829758602E-2,1.0000789352303558,1.2564238010864839E-2,0.99981420029473944,2.5677245119436337E-2,12.475306328322478,-107.33669301623929,72.663306983760705,null,1000000000,128845201,null,24.820092392930299,-41.940657705999818,null,15.235934064499814,-64.64471534533476,null,0,0]
[11416.5,11.416499999999999,2.2580323584101185,1.1120064482757046,1.0000257270574033,7.1730754697675904E-3,1,0,153.91139562425357,1.5642990363780576,1.5330946348484866,0.86021376285187623,1.0003189578313196,2.5253636410343557E-2,1.0020102814353939,6.3354865787925305E-2,1.0000798488005895,1.2636731203832633E-2,0.99981205117768945,2.5825501902942104E-2,12.414025691448652,-107.32568398452689,72.67431601547311,null,1000000000,130336472.25,null,24.798729059095464,-41.788041421784726,null,15.195825507729161,-64.781981663853912,null,0,0]
[11482,11.481999999999999,2.2684523775636696,1.1142740796974218,1.0000260231086109,7.2142282038058373E-3,1,0,154.79439584828523,1.5643360996638722,1.5381543151659713,0.86304103678422206,1.0003226276583999,2.5398462227803894E-2,1.0020333913508197,6.3717372071983844E-2,1.000080767626496,1.2709224263974911E-2,0.99980988972625329,2.5973760212093293E-2,12.353147159489701,-107.31451803499434,72.685481965005664,null,1000000000,131836324,null,24.777626936465381,-41.636472035717837,null,15.155856753429582,-64.918044071381317,null,0,0]
[11548.75,11.54875,2.279083141990879,1.1165636418425593,1.0000263265520304,7.2561662702233546E-3,1,0,155.6942474378902,1.5643734377538872,1.5433231198794481,0.865903170864459,1.000326389105902,2.5546050800340853E-2,1.0020570777602495,6.4086779162997029E-2,1.0000817093943117,1.2783100642022956E-2,0.99980767433658468,2.6124849456950847E-2,12.291515889864373,-107.30298547016176,72.697014529838242,null,1000000000,133373626.5625,null,24.756386693379877,-41.483079349628099,null,15.115268588701024,-65.055480221241154,null,0,0]
[11615.5,11.615500000000001,2.2897257426147672,1.1188319321059421,1.0000266317542965,7.2981043111161291E-3,1,0,156.59409924205906,1.5644103467250039,1.5485044827444243,0.86874617445603808,1.0003301723427365,2.5693638259736147E-2,1.0020809009055152,6.4456168740087749E-2,1.0000826566202823,1.2856976880530516E-2,0.99980544613839073,2.6275940304599857E-2,12.230292925006003,-107.29130575518613,72.70869424481387,null,1000000000,134919840.25,null,24.735409410132526,-41.330758109319596,null,15.074824635945623,-65.191697675348394,null,0,0]
[11682.25,11.68225,{"$f":"SQRT(1+(A205/pole1)^2)","v":2.3003800151565081},{"$f":"ATAN(A205/pole1)","v":1.1210792225469364},{"$f":"SQRT(1+(A205/Zero1)^2)","v":1.0000269387154077},{"$f":"ATAN(A205/Zero1)","v":7.3400423263366614E-3},{"$f":"IF(VIN_nom>Vout, 1, SQRT(1+(A205/z_RHP)^2))","v":1},{"$f":"IF(VIN_nom>Vout, 0, -ATAN(A205/z_RHP))","v":0},{"$f":"SQRT(1+(A205/Pole2)^2)","v":157.49395125711399},{"$f":"ATAN(A205/Pole2)","v":1.5644468339325179},1.5536982781219546,0.87157019322203133,{"$f":"SQRT(1+(A205/pole4)^2)","v":1.0003339773686557},{"$f":"ATAN(A205/pole4)","v":2.5841224599572915E-2},{"$f":"SQRT(1+(A205/Zero3)^2)","v":1.0021048607768646},{"$f":"ATAN(A205/Zero3)","v":6.4825540703703291E-2},{"$f":"SQRT(1+(A205/pole5)^2)","v":1.0000836093043926},{"$f":"ATAN(A205/pole5)","v":1.2930852978691598E-2},{"$f":"SQRT((1-(Z205/pterm2))^2+(A205/pterm1)^2)","v":0.99980320513224707},{"$f":"IF((ATAN((A205/pterm1)/(1-A205^2/pterm2))>0),ATAN((A205/pterm1)/(1-A205^2/pterm2)),PI()+ATAN((A205/pterm1)/(1-A205^2/pterm2)))","v":2.6427032764306982E-2},{"$f":"20*LOG10(((E205*K205*G205*O205)/(C205*I205*S205*M205*Q205))*Adc)","v":12.169473674969868},{"$f":"((F205+L205+H205+R205)-(D205+J205+T205+N205+T205))*radconv","v":-107.27948655421784},{"$f":"IF(V205>0,V205,V205+180)","v":72.72051344578216},null,{"$f":"IF(U205<0,A205,1000000000)","v":1000000000},{"$f":"A205^2","v":136474965.0625},null,{"$f":"20*LOG10((K205/(I205*M205))*AEA)","v":24.714691004273391},{"$f":"(L205-(J205+N205))*radconv","v":-41.179500389972809},null,{"$f":"20*LOG10((E205*G205/(C205*S205))*Acs*Am)","v":15.034524387837136},{"$f":"(F205+H205-(D205+T205))*radconv","v":-65.326712022095933},null,{"$f":"SUM((U206<0)*(U205>0))*A205","v":0},0]
[11749,{"$f":"A206/1000","v":11.749000000000001},2.3110457981881583,1.1233057810592628,1.0000272474353622,7.3819803157374559E-3,1,0,158.39380347946084,1.564482906564584,1.5589043817479902,0.87437537209791361,1.0003378041834114,2.5988809813434606E-2,1.0021289573644907,6.5194894954319613E-2,1.0000845674466263,1.3004728935700224E-2,0.99980095131873314,2.6578126845338935E-2,12.109053616136622,-107.26753532484531,72.732464675154688,null,1000000000,138039001,null,24.694227468423367,-41.029298298879993,null,14.994367328304827,-65.460538611202665,null,0,0]
[11817.5,11.817500000000001,2.3220030092459711,1.1255694360402335,1.0000275660777125,7.4250177759890264E-3,1,0,159.31724754493652,1.5645195012668178,1.5642596426079522,0.8772346589491069,1.0003417539795703,2.6140263125195025E-2,1.0021538278272621,6.5573914129697528E-2,1.0000855563833224,1.3080541567954598E-2,0.99979862510165396,2.6733183889773474E-2,12.047459862396774,-107.255141109836,72.744858890163997,null,1000000000,139653306.25,null,24.673488290744807,-40.876247587262164,null,14.9533057808127,-65.596654737438101,null,0,0]
[11886,11.885999999999999,2.3329720067582205,1.1278118162460742,1.0000278865723358,7.4680552087345326E-3,1,0,160.2406918213064,1.5645556741889897,1.56962760478055,0.88007441196104585,1.0003457267214924,2.6291715237475494E-2,1.0021788422478204,6.5952914438853719E-2,1.0000865510680541,1.3156354049838422E-2,0.99979628539810017,2.6888242661434494E-2,11.986277062482118,-107.24262311972309,72.757376880276908,null,1000000000,141276996,null,24.653009206885482,-40.72429184724998,null,14.912393900906975,-65.731552009385851,null,0,0]
[11954.5,11.954499999999999,2.3439526252536642,1.1300331979618976,1.0000282089192301,7.5110926138145699E-3,1,0,161.16413630494529,1.5645914325811987,1.5750081383994774,0.88289478529248411,1.0003497224089046,2.6443166143342408E-2,1.0022040006153867,6.6331895774324787E-2,1.0000875515008043,1.3232166380480682E-2,0.99979393220870916,2.7043303170336968E-2,11.925500538086721,-107.22998876804088,72.770011231959117,null,1000000000,142910070.25,null,24.632786122070158,-40.573422661200283,null,14.871631105243248,-65.865246257599807,null,0,0]
[12023,12.023,2.3549447021736083,1.1322338531515472,1.0000285331183936,7.5541299910697373E-3,1,0,162.08758099231065,1.5646267835283278,1.5804011150648876,0.88569593223857801,1.0003537410415315,2.6594615835862499E-2,1.0022293029191207,6.6710858028679945E-2,1.0000885576815555,1.3307978559010366E-2,0.99979156553412118,2.7198365426495945E-2,11.865125679575472,-107.21724526074786,72.782754739252141,null,1000000000,144552529,null,24.612815017851354,-40.423631651484229,null,14.83101680282121,-65.997753065043369,null,0,0]
[12093,12.093,2.3661891528729768,1.1344615641452211,1.0000288663303611,7.5981097637329844E-3,1,0,163.0312473030522,1.5646624948625574,1.5859249087553404,0.88853871425680597,1.0003578713775167,2.6749380684300317E-2,1.0022553079750629,6.7098098902357212E-2,1.0000895918336261,1.3385450700185949E-2,0.99978913310383821,2.7356825022001447E-2,11.803838973165311,-107.20411721830462,72.795882781695383,null,1000000000,146240649,null,24.5926628043552,-40.271665720955028,null,14.789665919944126,-66.13195071379738,null,0,0]
[12163,12.163,2.3774452351394371,1.1366681916810495,1.0000292014766041,7.6420895070028472E-3,1,0,163.97491381931434,1.5646977951633438,1.5914614299249212,0.89136173949838404,1.0003620256740338,2.6904144251032238E-2,1.0022814633168833,6.7485319623373022E-2,1.0000906319881546,1.3462922680675123E-2,0.99978668659266379,2.7515286463269568E-2,11.742962197906161,-107.19088976110969,72.809110238890312,null,1000000000,147938569,null,24.572765480090858,-40.120808146428075,null,14.748468834561182,-66.264940476836443,null,0,0]
[12233,12.233000000000001,2.3887127845423306,1.1388540124686986,1.0000295385571196,7.6860692207092246E-3,1,0,164.91858053756908,1.5647326914864177,1.597010546202642,0.89416516867863438,1.0003662039307843,2.7058906528660557E-2,1.0023077689328164,6.7872520077189941E-2,1.0000916781451223,1.3540394499548429E-2,0.99978422600129335,2.7673749760987965E-2,11.682490649329225,-107.1775699402769,72.822430059723104,null,1000000000,149646289,null,24.553118993260075,-39.971050123433379,null,14.707424894205104,-66.396738209078734,null,0,0]
[12303,12.303000000000001,2.399991639572943,1.1410192988194483,1.0000298775719065,7.7300489046820114E-3,1,0,165.8622474543688,1.5647671907269409,1.6025721267518642,0.89694916152155491,1.0003704061474681,2.7213667509787948E-2,1.0023342248110305,6.8259700149306823E-2,1.0000927303045104,1.3617866155876424E-2,0.99978175133042646,2.7832214925844336E-2,11.622419692817608,-107.16416460250993,72.835835397490072,null,1000000000,151363809,null,24.53371936831001,-39.822382895099821,null,14.666533440016277,-66.527359513433382,null,0,0]
[12374.5,12.374499999999999,2.411523691035359,1.1432100635935671,1.0000302258481819,7.7749709795812139E-3,1,0,166.82613600656902,1.5648020263059605,{"$f":"SQRT(1+(A215/Zero2)^2)","v":1.6082656173474865},{"$f":"ATAN(A215/Zero2)","v":0.89977291083996846},1.0003747231469129,2.7371743451490967E-2,1.0023614027151888,6.8655155776735199E-2,1.0000938112068849,1.3696997750352055E-2,0.99977920909634543,2.7994077711499157E-2,11.561470314656038,-107.15039063283419,72.849609367165812,null,1000000000,153128250.25,null,24.514154834909036,-39.671646992536395,null,14.624922471639447,-66.659581298226968,null,0,0]
[12446,12.446,2.4230672062859782,1.1453799650510226,1.0000305761425097,7.819893023100136E-3,1,0,167.79002475888973,1.5648364616511834,1.6139718410126715,0.90257671556008845,1.0003790651435087,2.7529818024933685E-2,1.0023887373652742,6.9050589898238118E-2,1.0000948983716424,1.3776129173281358E-2,0.99977665217438372,2.8155942467709989E-2,11.500929324042675,-107.13654125180618,72.863458748193821,null,1000000000,154902916,null,24.49483970829986,-39.522030821177644,null,14.583469186550165,-66.790607817730219,null,0,0]
[12517.5,12.5175,2.4346220222616126,1.1475292796659691,1.0000309284548878,7.8648150350575045E-3,1,0,168.75391370790183,1.5648705036206958,1.619690663170352,0.90536074262686372,1.0003834321369298,2.7687891222234168E-2,1.0024162287484639,6.9446002391913383E-2,1.0000959917987629,1.3855260423673884E-2,0.99977408056530037,2.8317809205866615E-2,11.440791999921524,-107.12262312884728,72.87737687115272,null,1000000000,156687806.25,null,24.475769987589512,-39.373525208270372,null,14.542172864806924,-66.920454913408349,null,0,0]
[12589,12.589,2.4461879788219205,1.1496582794522143,1.0000312827853142,7.9097370152720493E-3,1,0,169.717802850254,1.5649041589167896,1.6254219508423771,0.9081251578647489,1.0003878241268489,2.7845963035510894E-2,1.0024438768518629,6.9841393135899196E-2,1.0000970914882252,1.3934391500539199E-2,0.99977149426985779,2.8479677937358922E-2,11.381053692107175,-107.10864273309308,72.891357266906923,null,1000000000,158482921,null,24.456941747858853,-39.226121036334625,null,14.501032781366192,-67.049138171167471,null,0,{"$f":"IF(AH218>0,W218,0)","v":0}]
[12662.25,12.66225,2.4580484067512609,1.1518186006624547,1.000031647880903,7.9557584514055955E-3,1,0,170.70528388197366,1.5649382438064579,1.6313063043221048,0.91093706807506747,1.0003923495343692,2.8007902295832512E-2,1.0024723641644013,7.024643859364961E-2,1.0000982245872714,1.4015459171027709E-2,0.99976882944433731,2.8645510569973196E-2,11.320262254491356,-107.09426214034917,72.905737859650827,null,1000000000,160332575.0625,null,24.437899070714053,-39.076241805219439,null,14.459047030994704,-67.179780134952878,null,0,0]
[12735.5,12.7355,2.4699201961584669,1.1539581644040244,1.0000320150945299,8.0017798538383009E-3,1,0,171.69276510973398,1.5649719366215344,1.6372034635008499,0.91372874338920496,1.000396901176265,2.816984008680664E-2,1.0025010159350203,7.0651460965211604E-2,1.0000993642589155,1.4096526657286298E-2,0.9997661492063824,2.881134531889441E-2,11.259879946512264,-107.07982931299779,72.920170687002212,null,1000000000,162192960.25,null,24.419101737634389,-38.927499399848827,null,14.417223705379795,-67.309232906575104,null,0,0]
[12808.75,12.80875,2.4818031839995047,1.1560772491096813,1.0000323844261925,8.0478012223752574E-3,1,0,172.68024653017176,1.5650052440882423,1.6431132904990589,0.91650035839664179,1.000401479052178,2.8331776399960124E-2,1.0025298321496197,7.1056460119687997E-2,1.0001005105031349,1.4177593958250058E-2,0.99976345355682716,2.8977182196369605E-2,11.199901991445895,-107.06535058719469,72.934649412805314,null,1000000000,164064076.5625,null,24.400545765677695,-38.779884201881138,null,14.375562010983176,-67.437512439768923,null,0,0]
[12882,12.882,2.4936972101857537,1.1581761286433114,1.0000327558758886,8.0938225568215564E-3,1,0,173.66772814000026,1.5650381727798253,1.6490356491196427,0.91925208641963307,1.0004060831617483,2.8493711226820272E-2,1.0025588127940195,7.1461435926227071E-2,1.0001016633199069,1.4258661072854093E-2,0.99976074249651126,2.9143021214645903E-2,11.14032368526944,-107.05083210116027,72.949167898839733,null,1000000000,165945924,null,24.382227248450906,-38.63338665681632,null,14.334061150419998,-67.564634426492063,null,0,0]
[12957.25,12.95725,2.505927317320086,1.1603115582815771,1.0000331396731215,8.1411004107702079E-3,1,0,174.68217189888881,1.5650716128689788,1.6551326185410924,0.92205841884766515,1.0004108402982657,2.8660065925778078E-2,1.0025887559292459,7.1877444642350616E-2,1.0001028544570667,1.4341941428853698E-2,0.99975794136729512,2.931339050287135E-2,11.079529965921392,-107.03588204889064,72.964117951109358,null,1000000000,167890327.5625,null,24.363651809605376,-38.484043050736219,null,14.291593799856015,-67.694038152037947,null,0,0]
[13032.5,13.032500000000001,2.5181687406046489,1.1624262358118584,1.0000335257056223,8.1883782283241804E-3,1,0,175.69661585085819,1.565104666802795,1.6612425272224756,0.92484413017658362,1.0004156251197749,2.8826419038045781E-2,1.0026188725653618,7.2293428438346977E-2,1.0001040525305411,1.4425221585899692E-2,0.99975512397609789,2.9483762076600886E-2,11.01914818306879,-107.0209025497678,72.979097450232203,null,1000000000,169846056.25,null,24.345318852447107,-38.335858730623876,null,14.249294469003864,-67.822253002414016,null,0,0]
[13107.75,13.107749999999999,2.5304213158069726,1.1645204436345873,1.0000339139733885,8.2356560092721673E-3,1,0,176.71105999258316,1.5651373412315999,1.6673652329195636,0.9276094040998496,1.0004204376258785,2.8992770554439117E-2,1.0026491626867322,7.2709387172502513E-2,1.0001052575403049,1.45085015428376E-2,0.99975229032384538,2.9654135949112714E-2,10.959173467959143,-107.00589964139385,72.994100358606147,null,1000000000,171813110.0625,null,24.327224383061726,-38.188823552128589,null,14.207162283295416,-67.949295158745983,null,0,0]
[13183,13.183,2.5426848817119874,1.1665944594276887,1.0000343044764173,8.2829337534028637E-3,1,0,177.72550432081437,1.565169642653885,1.6735005951740431,0.93035442287578718,1.0004252778161771,2.9159120465774346E-2,1.0026796262776347,7.3125320703155292E-2,1.0001064694863333,1.4591781298512961E-2,0.99974944041146896,2.9824512133685106E-2,10.899601027159619,-106.99087916431901,73.009120835680989,null,1000000000,173791489,null,24.309364485433495,-38.04292744442759,null,14.165196365585089,-68.075180531579974,null,0,0]
[13259.75,13.25975,2.5552040614972991,1.1686893010462238,1.0000347050660985,8.3311538728932568E-3,1,0,178.76017031949883,1.5652022103095431,1.6797711507063886,0.93313348231865245,1.0004302430057193,2.9328784659294813E-2,1.002710875790594,7.3549519158697424E-2,1.0001077127357672,1.4676720907245804E-2,0.99974651694164185,2.9998286916692426E-2,10.839250584761428,-106.97554703501676,73.02445296498324,null,1000000000,175820970.0625,null,24.291386227354458,-37.895286098607784,null,14.122564278621198,-68.202399867533472,null,0,0]
[13336.5,13.336499999999999,2.567734345071778,1.1707637064642193,1.0000351079810386,8.379373953639923E-3,1,0,179.79483650560348,1.5652344031307546,1.6860545828448354,0.93589184944992077,1.0004352369932985,2.9498447163834617E-2,1.0027423057244247,7.3973691098427899E-2,1.0001089632006974,1.4761660304186604E-2,0.99974357655895962,3.0172064132755631E-2,10.779308775227703,-106.96020829975616,73.039791700243839,null,1000000000,177862232.25,null,24.273643997383004,-37.748808761708908,null,14.080103304673024,-68.328448437069099,null,0,0]
[13413.25,13.41325,2.5802755706694209,1.172817955683175,1.0000355132212346,8.4275939954186647E-3,1,0,180.82950287591115,1.5652662275516109,1.6923507481629498,0.93862971300933107,1.0004402597784838,2.9668107969651528E-2,1.002773916062162,7.4397836372211604E-2,1.000110220881097,1.484659948811053E-2,0.99974061926442781,3.0345843795963251E-2,10.719770746154788,-106.94486855723663,73.055131442763368,null,1000000000,179915275.5625,null,24.256133879913897,-37.603484987828587,null,14.037812507235063,-68.453342283911155,null,0,0]
[13490,13.49,2.5928275795140965,1.1748523239701618,1.0000359207866838,8.4758139980052952E-3,1,0,181.86416942727789,1.5652976898597875,1.698659505072261,0.94134726017077885,1.0004453113608414,2.9837767067003904E-2,1.002805706786746,7.4821954829970658E-2,1.0001114857769384,1.4931538457792772E-2,0.99973764505905749,3.0519625920403928E-2,10.66063172087822,-106.92953321622174,73.070466783778258,null,1000000000,181980100,null,24.238852036292155,-37.459304412391667,null,13.995690948592356,-68.577097180521122,null,0,0]
[13568.5,13.5685,2.6056767829422682,1.1769127944878055,1.000036340050539,8.5251334387018343E-3,1,0,182.92242790821189,1.5653295013624833,1.7051249897013001,0.94410594786163993,1.0004505079149812,3.0011292835335313E-2,1.0028384089667108,7.5255715844638582E-2,1.0001127869781243,1.5018413923751946E-2,0.99973458554537165,3.0697373064444918E-2,10.600552102103574,-106.91385820700708,73.086141792992919,null,1000000000,184104192.25,null,24.221408362429038,-37.313008209550063,null,13.952783056320131,-68.702511810510742,null,0,0]
[13647,13.647,2.6185369402772087,1.1789530348330455,1.0000367617468879,8.5744528379242107E-3,1,0,183.98068657212866,1.5653609469050769,1.7116033528473804,0.94684377317043744,1.0004557345935652,3.0184816795791141E-2,1.00287129981701,7.5689448489064823E-2,1.0001140957274888,1.510528916299632E-2,0.9997315083430357,3.0875122813050427E-2,10.540880018912839,-106.89819866301193,73.101801336988075,null,1000000000,186240609,null,24.204195606998336,-37.167886261599669,null,13.910050221898413,-68.826767488608326,null,0,0]
[13725.5,13.7255,2.6314078909178638,1.1809733247492482,1.0000371858757273,8.6237721954325504E-3,1,0,185.03894541588872,1.5653920327664081,1.7180944488286858,0.94956093127948815,1.0004609913961213,3.0358338937950011E-2,1.0029043793190811,7.612315260285768E-2,1.0001154120250013,1.5192164174215435E-2,0.99972841345315022,3.1052875181295271E-2,10.481610597341893,-106.88255979019776,73.11744020980224,null,1000000000,188389350.25,null,24.187209901361481,-37.023927744571402,null,13.867491440322038,-68.949880243805623,null,0,0]
[13804,13.804,2.6442894772565642,1.1829739391870366,1.000037612437054,8.673091510986974E-3,1,0,186.09720443642402,1.565422765082499,1.7245981338725012,0.95225761565621858,1.0004662783221743,3.0531859251391173E-2,1.0029376474542573,7.655682802568943E-2,1.0001167358706329,1.5279038956098853E-2,0.99972530087682265,3.123063018425434E-2,10.422739040378382,-106.86694660999528,73.133053390004719,null,1000000000,190550416,null,24.170447453693825,-36.881121924569335,null,13.825105706725518,-69.071865830490381,null,0,0]
[13884.25,13.88425,2.6574690656479221,1.1849990964087334,1.0000380510221394,8.723510258111862E-3,1,0,187.17905539817161,1.5654538233030082,1.7312596709402397,0.95499345342643083,1.000471714247436,3.0709245950900008E-2,1.0029718522039845,7.7000141547565612E-2,1.0001180970311148,1.5367850198515281E-2,0.99972210063074796,3.1412350617533273E-2,10.362961411655007,-106.85101696511701,73.148983034882988,null,1000000000,192772398.0625,null,24.153538229871675,-36.736312980916196,null,13.781952899910815,-69.195421824744798,null,0,0]
[13964.5,13.964499999999999,2.6706594454176957,1.1870042572945145,1.0000384921493695,8.7739289608844643E-3,1,0,188.26090653839944,1.5654845245681714,1.7379340667607284,0.95770829785772582,1.000477181653239,3.0886630717225392E-2,1.0030062540511731,7.7443424746366563E-2,1.0001194660799437,1.5456661198487393E-2,0.99971888190323444,3.1594073836167795E-2,10.303589686126667,-106.83512421711546,73.164875782884536,null,1000000000,195007260.25,null,24.13685455342091,-36.592686304184198,null,13.738978820679053,-69.317832275474544,null,0,0]
[14044.75,14.044750000000001,2.6838604574565972,1.1889897006661789,1.0000389358187407,8.8243476190485066E-3,1,0,189.34275785404816,1.5655148749965579,1.7446211737528137,0.96040235010207042,1.0004826805390674,3.1064013539236157E-2,1.0030408529755428,7.7886677451011008E-2,1.0001208430170869,1.554547195461521E-2,0.99971564469548557,3.1775799856264005E-2,10.24461897895992,-106.81927316801496,73.180726831985041,null,1000000000,197255002.5625,null,24.120392610913967,-36.450230719145033,null,13.69618239797437,-69.439113158929416,null,0,0]
[14125,14.125,2.6970719456434202,1.1909557005107678,1.0000393820302496,8.8747662323477167E-3,1,0,190.42460934212787,1.565544880567695,1.751320846310461,0.96307580944944782,1.000488210904402,3.1241394405801877E-2,1.0030756489567003,7.8329899490489158E-2,1.0001222278425117,1.5634282465498781E-2,0.99971238900871184,3.1957528693928101E-2,10.186044483271104,-106.80346844154626,73.196531558453742,null,1000000000,199515625,null,24.104148665380968,-36.308935149287677,null,13.653562562234875,-69.559280174348089,null,0,0]
[14207.25,14.20725,2.7106234028594169,1.1929508024978381,1.0000398420002514,8.9264413374720315E-3,1,0,191.53342303693657,1.5655752821992523,1.7582003778104769,0.9657947345113882,1.0004939117636966,3.1423193938524281E-2,1.0031115165905564,7.8784135562198626E-2,1.0001236553663062,1.5725306066494801E-2,0.99970903300903258,3.214378953982238E-2,10.126416384245161,-106.78732255245846,73.212677447541537,null,1000000000,201845952.5625,null,24.087722268999052,-36.165310449383028,null,13.610062675881075,-69.681302292973569,null,0,0]
[14289.5,14.2895,2.7241855421582444,1.1949260473715984,1.0000403046406738,8.9781163949222767E-3,1,0,192.64223690673393,1.5656053338582532,1.7650928055276109,0.96849244538212875,1.0004996456900082,3.1604991393446157E-2,1.0031475911819963,7.923833905768865E-2,1.0001250911763973,1.5816329406892458E-2,0.99970565760037544,3.2330053379734179E-2,10.067194511701862,-106.77123460795852,73.228765392041481,null,1000000000,204189810.25,null,24.071517160684522,-36.022881062101639,null,13.566746019024228,-69.802186857087861,null,0,0]
[14371.75,14.37175,2.7377582047911608,1.1968817149331639,1.000040769951513,9.0297914044225411E-3,1,0,193.75105094851565,1.5656350415531952,1.7719979789770852,0.97116915056982489,1.0005054126827679,3.1786786758586379E-2,1.0031838727086932,7.9692509793078611E-2,1.0001265352727495,1.5907352485184576E-2,0.99970226278406649,3.2516320231004571E-2,10.008373935719613,-106.75520903849646,73.24479096150354,null,1000000000,206547198.0625,null,24.05552955565414,-35.881635384381291,null,13.523611446911207,-69.921949899123376,null,0,0]
[14454,14.454000000000001,2.7513412350199484,1.1988180800637285,1.000041237932765,9.081466365696917E-3,1,0,194.85986515934576,1.5656644111558189,1.7789157497345203,0.97382505655226825,1.0005112127414044,3.1968580021964704E-2,1.003220361148196,8.0146647584568506E-2,1.0001279876553268,1.5998375299864E-2,0.99969884856143953,3.2702590110974775E-2,9.9499498060647653,-106.73925010112745,73.260749898872547,null,1000000000,208918116,null,24.039755745936581,-35.741561921655482,null,13.480657817667034,-70.040607169621794,null,0,0]
[14622.5,14.6225,2.7791996031710871,1.2027258360404773,1.0000422049932871,9.1873292045103888E-3,1,0,197.13141819224214,1.5657235469304158,1.7931264414646901,0.97920193953919688,1.0005231981828702,3.2341000944701888E-2,1.0032957585853686,8.1076905245856257E-2,1.0001309889288348,1.6184846741114801E-2,0.99969179347929116,3.3084198119475931E-2,9.8314782334228141,-106.70678123739259,73.29321876260741,null,1000000000,213817506.25,null,24.008093413833397,-35.458215596622857,null,13.393221875419169,-70.280304129174638,null,0,0]
[14706.75,14.70675,2.793144464053364,1.2046504678609096,1.0000426927263222,9.2402605468419729E-3,1,0,198.26719496276371,1.5657526066774434,1.8002509973111573,0.98185850993022206,1.0005292429413823,3.2527208047206234E-2,1.0033337828539526,8.1541981445774236E-2,1.0001325026065875,1.6278082040435987E-2,0.99968823540161444,3.327500696428734E-2,9.772846347851436,-106.69066847969425,73.309331520305747,null,1000000000,216288495.5625,null,23.992583526026365,-35.318339207025126,null,13.349783840127884,-70.398477208718916,null,0,0]
[14791,14.791,2.8070995685047562,1.2065559706034177,1.0000431832612011,9.2931918373947604E-3,1,0,199.40297189880846,1.5657813353823835,1.8073881579720801,0.98449411783916618,1.0005353223909101,3.2713412893304802E-2,1.003372024123016,8.2007022295604567E-2,1.0001340249782866,1.6371317056728132E-2,0.99968465696815589,3.3465819060989679E-2,9.7146105272440106,-106.67464206354167,73.325357936458332,null,1000000000,218773681,null,23.977282905936935,-35.179644782583118,null,13.306530811534692,-70.515554462117251,null,0,0]
[14877.25,14.87725,2.8213964039105166,1.2084871742350431,1.0000436883432229,9.3473796031533982E-3,1,0,200.56571106714466,1.5658104090230069,1.8147076487006597,0.9871707975227727,1.0005415820951331,3.2904035681659019E-2,1.0034113979594239,8.2483065866249025E-2,1.0001355924953046,1.6466765072297548E-2,0.99968097250191001,3.3661164209769889E-2,9.6553975207259359,-106.65832851658362,73.341671483416377,null,1000000000,221332567.5625,null,23.961832092716921,-35.038870011597709,null,13.26244139091691,-70.634292002019649,null,0,0]
[14963.5,14.9635,2.8357036557219253,1.210398897557208,1.000044196361684,9.4015673140168121E-3,1,0,201.72845040306004,1.5658391475094855,1.8220400365946356,0.98982595271867146,1.0005478781556274,3.3094656077908902E-2,1.0034509991685208,8.2959071970624049E-2,1.000137169123853,1.6562212787805664E-2,0.99967726670510293,3.3856512806196601E-2,9.5965895073715579,-106.6421131678451,73.357886832154904,null,1000000000,223906332.25,null,23.946593057812091,-34.89930916294005,null,13.218543309489279,-70.751913603085924,null,0,0]
[15049.75,15.04975,2.8500211670663225,1.2122914200770727,1.0000447073165797,9.4557549696668575E-3,1,0,202.89118990367348,1.565867556603928,1.8293851665740111,0.99245980503148279,1.0005542105717065,3.3285274068246933E-2,1.0034908277233874,8.3435040397469462E-2,1.0001387548638887,1.6657660201514803E-2,0.99967353957933602,3.4051864870267234E-2,9.5381815040821678,-106.62599966665988,73.374000333340121,null,1000000000,226494975.0625,null,23.931562103315478,-34.760949868954071,null,13.174835282524253,-70.868435281060755,null,0,0]
[15136,15.135999999999999,2.8643487840961974,1.2141650162655533,1.0000452212079058,9.5099425697854033E-3,1,0,204.05392956616944,1.5658956419371111,1.8367428857720944,0.99507257370646618,1.0005605793426804,3.3475889638866628E-2,1.0035308835969547,8.3910970935626827E-2,1.0001403497153682,1.6753107311687308E-2,0.9996697911262199,3.4247220421979328E-2,9.4801686101687821,-106.60999150146318,73.390008498536815,null,1000000000,229098496,null,23.916735608051614,-34.623779889640396,null,13.131316030975107,-70.983872763133206,null,0,0]
[15224,15.224,2.8789773651769996,1.2160574008555243,1.0000457485524124,9.5652295708939551E-3,1,0,205.24026121189249,1.5659239691456175,1.8442627106434251,0.99771685047197245,1.0005671148032049,3.3670370263604081E-2,1.0035719864540353,8.4396518766813242E-2,1.0001419863167322,1.6850490715252138E-2,0.9996659446383821,3.4446543324778103E-2,9.4213808580597167,-106.59377055396185,73.406229446038154,null,1000000000,231770176,null,23.901815330074342,-34.485039939441172,null,13.087107018723378,-71.100551062752672,null,0,0]
[15312,15.311999999999999,2.8936161519548467,1.217930644972768,1.0000462789537077,9.620516513525617E-3,1,0,206.42659302041369,1.5659519707617116,1.8517953261829476,1.0003396330099461,1.0005736881073977,3.3864848340402473E-2,1.0036133258905198,8.4882026712439218E-2,1.0001436324029389,1.694787379918359E-2,0.99966207595237466,3.4645869900239122E-2,9.3629943599161596,-106.57766610814004,73.422333891859964,null,1000000000,234457344,null,23.887100512915591,-34.347512716707627,null,13.04309184903337,-71.216132907844255,null,0,0]
[15400,15.4,2.908264990318246,1.2197850246003963,1.0000468124117874,9.6758033973425011E-3,1,0,207.61292498894221,1.5659796523668033,1.8593405769368685,1.0029411466881459,1.0005802992545125,3.4059323854601177E-2,1.0036549018771745,8.5367494548561573E-2,1.0001452879739416,1.7045256561636187E-2,0.99965818506993809,3.4845200169602596E-2,9.3050041655642257,-106.56168138555408,73.438318614445919,null,1000000000,237160000,null,23.87258754580192,-34.211185627769574,null,12.999269183008632,-71.330634112311827,null,0,0]
[15488,15.488,2.9229237291403849,1.2216208107098672,1.0000473489266464,9.7310902220067181E-3,1,0,208.79925711475082,1.5660070194154574,1.8668983097058567,1.0055216143856522,1.0005869482437995,3.4253796791540718E-2,1.0036967143846041,8.5852922051349784E-2,1.0001469530296929,1.714263900076449E-2,0.9996542719928232,3.5044534154108943E-2,9.2474054072888876,-106.54581945593702,73.454180544062979,null,1000000000,239878144,null,23.858272893429199,-34.076046214279955,null,12.955637688745014,-71.444070202912684,null,0,0]
[15578.25,15.578250000000001,2.9379673934249362,1.2234845005131867,1.0000479023342226,9.7877905684615064E-3,1,0,210.01592175662034,1.5660347650504785,1.8746620866274648,1.0081464307979842,1.0005938065407378,3.445323935559029E-2,1.0037398416000565,8.6350718925045894E-2,1.0001486705094538,1.7242510994039006E-2,0.99965023581413637,3.5248968627265287E-2,9.1887355160900306,-106.52968256925166,73.470317430748338,null,1000000000,242681873.0625,null,23.843794601106879,-33.938672236661624,null,12.911087794970072,-71.559316305046181,null,0,0]
[15668.5,15.6685,2.9530211582768895,1.2253291954184902,1.0000484589568785,9.8444908519802459E-3,1,0,211.2325865583019,1.5660621910649726,1.8824386727464117,1.0107495781418494,1.000600704638086,3.46526791776764E-2,1.0037832175225663,8.6848472900041912E-2,1.0001503979650779,1.7342382643312698E-2,0.99964617629506913,3.5453407053224813E-2,9.1304672220303456,-106.5136809075105,73.486319092489495,null,1000000000,245501892.25,null,23.829517598170558,-33.802521335203636,null,12.866736159493662,-71.673474309774775,null,0,0]
[15758.75,15.758749999999999,2.9680848700097071,1.2271551719851637,1.0000490187946089,9.9011910721984696E-3,1,0,212.44925151704993,1.5660893029501541,1.8902279099677586,1.013331288799763,1.000607642535021,3.4852116241989972E-2,1.0038268421198935,8.7346183735268867E-2,1.0001521353965142,1.744225394659504E-2,0.99964209343754296,3.5657849454899804E-2,9.0725955339774416,-106.49781731833984,73.502182681660159,null,1000000000,248338201.5625,null,23.815438306716132,-33.667580509086235,null,12.822581369643181,-71.786560064117694,null,0,0]
[15849,15.849,2.9831583779405322,1.2289627016877569,1.0000495818474082,9.9578912287517085E-3,1,0,213.66591663018124,1.5661161060721667,1.8980296425366669,1.0158917924858244,1.0006146202307147,3.5051550532723255E-2,1.0038707153596185,8.7843851189785049E-2,1.0001538828037104,1.7542124901895551E-2,0.99963798724349051,3.5862295855202751E-2,9.0151155449384284,-106.48209450374939,73.517905496250606,null,1000000000,251190801,null,23.801553224540001,-33.533836903212709,null,12.778622021188049,-71.898589123754604,null,0,0]
[15941.25,15.94125,2.9985758952584498,1.2307915002941334,1.0000501607005567,1.0015847832293208E-2,1,0,214.90954400790596,1.5661431895261919,1.9060170207103728,1.0184873579059255,1.0006217936873989,3.5255401537012801E-2,1.0039158177941361,8.8352502201856226E-2,1.0001556792443709,1.7644208702254898E-2,0.99963376593748576,3.6071277080039515E-2,8.9567615543204191,-106.46617141590583,73.533828584094167,null,1000000000,254123451.5625,null,23.787557583486659,-33.398353528841575,null,12.733889037415969,-72.012024639011784,null,0,0]
[16033.5,16.0335,3.0140033387069836,1.2326015831670323,1.0000507429128376,1.0073804368546711E-2,1,0,216.15317154145581,1.5661699613333717,1.9140171324225399,1.0210612429203385,1.0006290087245568,3.5459249610037179E-2,1.0039611799442525,8.8861107380575038E-2,1.0001574861077187,1.77462921348332E-2,0.9996295202533072,3.6280262531102149E-2,8.8988067100320372,-106.45040067648709,73.549599323512908,null,1000000000,257073122.25,null,23.773757689454669,-33.264094326217837,null,12.689357314011019,-72.1243880677292,null,0,0]
[16125.75,16.12575,3.0294405566395062,1.2343932244649982,1.0000513284842452,1.0131760837122991E-2,1,0,217.39679922815657,1.5661964268420345,1.922029818669819,1.0236136843597419,1.0006362653412886,3.5663094734918556E-2,1.0040068017747654,8.9369666469040654E-2,1.0001593033936971,1.7848375197504828E-2,0.99962525019305482,3.6489252232861098E-2,8.8412460332262413,-106.43478473264021,73.56521526735979,null,1000000000,260039813.0625,null,23.760150035626811,-33.131046031412765,null,12.645025379549928,-72.235695119458754,null,0,0]
[16218,16.218,3.0448874003895967,1.2361666932621813,1.0000519174147735,1.0189717237632821E-2,1,0,218.64042706539485,1.5662225912788257,1.9300549228414332,1.0261449162427898,1.0006435635366899,3.5866936894780571E-2,1.0040526832502763,8.9878179210494111E-2,1.0001611311022494,1.7950457888144193E-2,0.9996209557588408,3.6698246209787046E-2,8.7840746296802283,-106.41932589434312,73.580674105656882,null,1000000000,263023524,null,23.746731190032641,-32.999195534642901,null,12.600891772390192,-72.345961212438027,null,0,0]
[16312.5,16.3125,3.0607208249279183,1.2379648506788641,1.0000525241924694,1.0249087137902999E-2,1,0,219.91438744232738,1.5662490870355055,1.9382884759607883,1.0287161353575325,1.0006510828481137,3.6075747722622106E-2,1.0040999529703938,9.0399046377075673E-2,1.0001630141959867,1.8055030012530764E-2,0.9996165313116081,3.6912342059211296E-2,8.725907403591421,-106.40365518697675,73.596344813023251,null,1000000000,266097656.25,null,23.733177316826261,-32.865357605196557,null,12.555885860487731,-72.457853187309624,null,0,0]
[16407,16.407,3.0765640440275042,1.2397444940482774,1.0000531344951311,1.0308456965919076E-2,1,0,221.18834797186693,1.5662752775812963,1.9465347349756019,1.0312655858907021,1.000658645789231,3.628455540319888E-2,1.0041474950797535,9.0919864363259245E-2,1.0001649082267947,1.8159601742000521E-2,0.9996120812914665,3.712644244687547E-2,8.6681385390634578,-106.38815382988059,73.611846170119406,null,1000000000,269189649,null,23.719814516525069,-32.732749255980963,null,12.511084995271446,-72.568684649571637,null,0,0]
[16501.5,16.5015,3.0924169071484537,1.2415058967396411,1.0000537483227525,1.0367826721262657E-2,1,0,222.46230865139177,1.5663011681596564,1.9547935390871523,1.0337935104001961,1.0006662523590526,3.6493359918374178E-2,1.0041953095396683,9.1440632893504917E-2,1.0001668131946113,1.826417307426868E-2,0.9996076057007266,3.7340547399085607E-2,8.6107630399966268,-106.37282389097159,73.627176109028412,null,1000000000,272299502.25,null,23.706639332301506,-32.601356888841138,null,12.4664876381356,-72.678471263657784,null,0,0]
[16596,16.596,3.108279266731298,1.2432493269997253,1.0000543656753267,1.0427196403515342E-2,1,0,223.73626947833972,1.5663267638946208,1.9630647299601223,1.0363001484657357,1.0006739025565834,3.6702161250012903E-2,1.0042433963112363,9.1961351692432386E-2,1.0001687290993737,1.8368744007050505E-2,0.99960310454171175,3.7554656942147983E-2,8.5537759960572259,-106.35766730846646,73.642332691533539,null,1000000000,275427216,null,23.693648381901188,-32.471167069416722,null,12.422092261670883,-72.787228400507104,null,0,0]
[16692.5,16.692499999999999,3.1244869873797532,1.2450113817876638,1.0000549997312027,1.0487822511117304E-2,1,0,225.0371925887257,1.5663526022726584,1.9715235932378317,1.0388381160047688,1.0006817596845035,3.6915378353294177E-2,1.0042927817690566,9.2493039387791604E-2,1.0001706968389197,1.8475527666634604E-2,0.99959848173680899,3.7773302669072022E-2,8.495978735828686,-106.34237073430353,73.657629265696471,null,1000000000,278639556.25,null,23.680569175489573,-32.339449110887458,null,12.376964162930079,-72.897240560519933,null,0,0]
[16789,16.789000000000001,3.1407043089088087,1.2467552448729085,1.0000556374628011,1.0548448541620029E-2,1,0,226.33811584762432,1.5663781436282971,1.9799950470964698,1.0413543821327509,1.0006896623042352,3.7128592098643484E-2,1.0043424511042496,9.3024674644642896E-2,1.0001726759831171,1.8582310904828776E-2,0.99959383227486387,3.7991953238670981E-2,8.4385764639882677,-106.32725862458278,73.672741375417218,null,1000000000,281870521,null,23.667675185009202,-32.208957341097083,null,12.332043501591617,-73.006210694627342,null,0,0]
[16885.5,16.8855,3.1569310833577777,1.248481186085205,1.0000562788701151,1.0609074494578005E-2,1,0,227.6390392524894,1.5664033930538206,1.9884789306182833,1.043849192549346,1.0006976104147001,3.7341802466755197E-2,1.0043924042746999,9.3556257170269663E-2,1.0001746665318982,1.8689093719200304E-2,0.9995891561583945,3.8210608678957862E-2,8.3815642173193261,-106.31233265589127,73.687667344108732,null,1000000000,285120110.25,null,23.654963037807946,-32.07967797315203,null,12.287328687816172,-73.114154264565528,null,0,0]
[16982,16.981999999999999,{"$f":"SQRT(1+(A269/pole1)^2)","v":3.1731671657071372},{"$f":"ATAN(A269/pole1)","v":1.250189470163706},{"$f":"SQRT(1+(A269/Zero1)^2)","v":1.0000569239531372},{"$f":"ATAN(A269/Zero1)","v":1.0669700369545718E-2},{"$f":"IF(VIN_nom>Vout, 1, SQRT(1+(A269/z_RHP)^2))","v":1},{"$f":"IF(VIN_nom>Vout, 0, -ATAN(A269/z_RHP))","v":0},{"$f":"SQRT(1+(A269/Pole2)^2)","v":228.93996280083269},{"$f":"ATAN(A269/Pole2)","v":1.5664283555257688},1.9969750853859567,1.046322789850425,{"$f":"SQRT(1+(A269/pole4)^2)","v":1.000705604014815},{"$f":"ATAN(A269/pole4)","v":3.7555009438325487E-2},{"$f":"SQRT(1+(A269/Zero3)^2)","v":1.0044426412380603},{"$f":"ATAN(A269/Zero3)","v":9.408778667213262E-2},{"$f":"SQRT(1+(A269/pole5)^2)","v":1.0001766684851949},{"$f":"ATAN(A269/pole5)","v":1.8795876107316527E-2},{"$f":"SQRT((1-(Z269/pterm2))^2+(A269/pterm1)^2)","v":0.99958445338993285},{"$f":"IF((ATAN((A269/pterm1)/(1-A269^2/pterm2))>0),ATAN((A269/pterm1)/(1-A269^2/pterm2)),PI()+ATAN((A269/pterm1)/(1-A269^2/pterm2)))","v":3.8429269017945987E-2},{"$f":"20*LOG10(((E269*K269*G269*O269)/(C269*I269*S269*M269*Q269))*Adc)","v":8.3249371183530023},{"$f":"((F269+L269+H269+R269)-(D269+J269+T269+N269+T269))*radconv","v":-106.29759438434924},{"$f":"IF(V269>0,V269,V269+180)","v":73.702405615650761},null,{"$f":"IF(U269<0,A269,1000000000)","v":1000000000},{"$f":"A269^2","v":288388324},null,{"$f":"20*LOG10((K269/(I269*M269))*AEA)","v":23.642429434530342},{"$f":"(L269-(J269+N269))*radconv","v":-31.951597391361492},null,{"$f":"20*LOG10((E269*G269/(C269*S269))*Acs*Am)","v":12.242818144219459},{"$f":"(F269+H269-(D269+T269))*radconv","v":-73.221086440401209},null,{"$f":"SUM((U270<0)*(U269>0))*A269","v":0},0]
[17081,{"$f":"A270/1000","v":17.081},3.1898333957043872,1.2519239333309407,1.0000575895679276,1.0731896781521795E-2,1,0,230.27458917832857,1.5664536715905852,2.0057039365597111,1.0488386764486539,1.0007138519745207,3.7773736356665671E-2,1.0044944745488908,9.463303095983501E-2,1.0001787341540183,1.8905424433032118E-2,0.99957960109412558,3.8653599252627721E-2,8.2672382160764748,-106.2826708553838,73.717329144616201,null,1000000000,291760561,null,23.629753285676493,-31.821430340355377,null,12.197365114239979,-73.329753443486183,null,0,0]
[17180,17.18,3.2065091221053708,1.2536403611674825,1.0000582590513289,1.0794093110464392E-2,1,0,231.60921570170729,1.5664786958924886,2.0144453731394445,1.051332743962113,1.0007221478090522,3.7992459659043937E-2,1.0045466064563533,9.5178218817654855E-2,1.0001808118257727,1.9014972304933739E-2,0.99957472075295239,3.8877934702849143E-2,8.2099345452204009,-106.26794782401096,73.73205217598904,null,1000000000,295152400,null,23.617258245443207,-31.692496506857918,null,12.152123752549391,-73.437387401825021,null,0,0]
[17279,17.279,3.2231941975164635,1.2553390235636772,1.000058932403334,1.085628935589248E-2,1,0,232.94384236846139,1.5665034334463199,2.0231992319956125,1.0538052443769894,1.0007304915172193,3.8211179324623069E-2,1.0045990369139628,9.5723349930310342E-2,1.0001829015003834,1.912451972039492E-2,0.99956981236919507,3.9102275398858598E-2,8.1530211090173648,-106.25342660584302,73.746573394156982,null,1000000000,298563841,null,23.604940979923633,-31.564781739259431,null,12.107092397087325,-73.544003780756157,null,0,0]
[17378,17.378,3.2398884774984928,1.2570201852619607,1.0000596096239347,1.0918485517325027E-2,1,0,234.2784691761405,1.5665278891526482,2.0319653525799297,1.0562564263951155,1.0007388830978241,3.842989533256793E-2,1.0046517658749772,9.6268423982720175E-2,1.0001850031777748,1.9234066676789247E-2,0.99956487594565191,3.9326621370904792E-2,8.0964929979427467,-106.2391084031713,73.760891596828699,null,1000000000,301994884,null,23.592798228522835,-31.438272067582691,null,12.062269399728599,-73.649617750664532,null,0,0]
[17479.25,17.47925,3.2569715461638804,1.2587217239860338,1.0000603062373834,1.0982095140499012E-2,1,0,235.64342855453711,1.5665526141326906,2.0409432214222418,1.0587415222213665,1.0007475149117318,3.8653578353892354E-2,1.0047060019292366,9.6825826733395987E-2,1.0001871650355492,1.9346102859165437E-2,0.99955979833066833,3.9556071603832295E-2,8.0390736906625548,-106.22467591483098,73.775324085169018,null,1000000000,305524180.5625,null,23.580556690774777,-31.310119294982105,null,12.016641509881945,-73.756610705365006,null,0,0]
[17580.5,17.580500000000001,3.2740639461057395,1.2604055016219144,1.0000610068972544,1.1045704674798389E-2,1,0,237.00838807532909,1.5665770543245412,2.0499335840720674,1.0612048354551722,1.0007561967962693,3.8877257505362708E-2,1.0047605501097105,9.7383169134729913E-2,1.0001893394477246,1.945813855581446E-2,0.99955469139285136,3.97855274193403E-2,7.9820473066029516,-106.21045797546302,73.789542024536985,null,1000000000,309073980.25,null,23.568491018054118,-31.183198034109129,null,11.971228114275469,-73.862586349621779,null,0,0]
[17681.75,17.681750000000001,3.2911655319404027,1.2620717854181391,1.0000617116035397,1.1109314119708596E-2,1,0,238.37334773607031,1.5666012146203834,2.0589362768664636,1.0636466217381113,1.0007649287501337,3.9100932764697602E-2,1.0048154103655658,9.7940450850323643E-2,1.0001915264142194,1.9570173763926953E-2,0.99954955513524679,4.0014988849788227E-2,7.9254088651013488,-106.19645553302043,73.803544466979574,null,1000000000,312644283.0625,null,23.556597948380041,-31.057493916805072,null,11.92602749510209,-73.967559997531623,null,0,0]
[17783,17.783000000000001,3.3082761612130169,1.2637208374873758,1.0000624203562303,1.1172923474715071E-2,1,0,239.73830753437036,1.5666250998009867,2.0679511387699545,1.0660671332900442,1.0007737107720145,3.9324604109617987E-2,1.0048705826456894,9.8497671544002879E-2,1.0001937259349511,1.968220848069362E-2,0.99954438956091785,4.0244455927535915E-2,7.8691534730694634,-106.18266943085953,73.817330569140466,null,1000000000,316235089,null,23.544874292112155,-30.932992764577829,null,11.881037949793345,-74.071546668927738,null,0,0]
[17886.5,17.886500000000002,3.3257762284727868,1.2653889924529518,1.0000631490412566,1.1237946277485426E-2,1,0,241.1335999123784,1.566649236274279,2.0771787437138669,1.068519703928988,1.0007827396978772,3.9553241859813126E-2,1.0049273034250903,9.9067211498917312E-2,1.0001959873096462,1.979673234706248E-2,0.99953907889806926,4.0479028144310064E-2,7.8120388684420883,-106.16880134920834,73.831198650791663,null,1000000000,319926882.25,null,23.533061965127914,-30.806953714040141,null,11.835265041742515,-74.176839373990688,null,0,0]
[17990,17.989999999999998,3.3432854536052252,1.2670396792785561,1.0000638819545085,1.1302968985224631E-2,1,0,242.52889242924712,1.5666730950285863,{"$f":"SQRT(1+(A279/Zero2)^2)","v":2.0864187325393537},{"$f":"ATAN(A279/Zero2)","v":1.0709505659975682},1.0007918209389333,3.978187547261644E-2,1.004984350141692,9.9636686980050099E-2,1.0001982618025684,1.9911255694069211E-2,0.99953373760758302,4.071360633054448E-2,7.7553144592854553,-106.15516079639332,73.844839203606682,null,1000000000,323640100,null,23.521420148072167,-30.682142323784152,null,11.789709143767684,-74.281131575825924,null,0,0]
[18093.5,18.093499999999999,3.3608036934773806,1.268673162056561,1.000064619095977,1.1367991597383074E-2,1,0,243.9241850825936,1.5666966808296976,2.0956709414417052,1.0733599781006478,1.0008009544937582,4.0010504924238022E-2,1.005041722739993,0.1002060976290471,1.0002005494136281,2.0025778518713282E-2,0.99952836569278858,4.0948190520805811E-2,7.6989752907078746,-106.14174836268656,73.858251637313444,null,1000000000,327374742.25,null,23.509945656433821,-30.558544048539144,null,11.744368486442911,-74.384438407823836,null,0,0]
[18197,18.196999999999999,3.3783308078522136,1.2702896997702744,1.0000653604656522,1.1433014113411145E-2,1,0,245.31947787008914,1.5667199983349775,2.1049352092814733,1.0757481952956047,1.0008101403609198,4.0239130190890524E-2,1.0050994211641884,0.1007754430878039,1.0002028501427356,2.0140300817994242E-2,0.99952296315703448,4.1182780749661106E-2,7.6430164954728248,-106.12856454267606,73.87143545732394,null,1000000000,331130809,null,23.498635376875583,-30.436144540078221,null,11.699241316828781,-74.486774710646969,null,0,0]
[18303,18.303000000000001,3.3962903375489377,1.2719279856872365,1.0000661241254343,1.1499607121398138E-2,1,0,246.74847351859111,1.5667436057256634,2.1144355854602366,1.0781723926958866,1.0008196023303975,4.0473273444307983E-2,1.0051588509377294,0.10135847290719656,1.000205220042081,2.0257588808702015E-2,0.99951739838941944,4.1423043704428793E-2,7.586095308983273,-106.11529965707494,73.884700342925058,null,1000000000,334999809,null,23.487218931704955,-30.312016284267557,null,11.653243589691979,-74.590592134422025,null,0,{"$f":"IF(AH282>0,W282,0)","v":0}]
[18409,18.408999999999999,3.4142588869106509,1.2735490319865461,1.0000668922201317,1.1566200027387815E-2,1,0,248.17746930302462,1.5667669412555694,2.1239482764078419,1.0805748892301485,1.0008291191668324,4.0707412257647353E-2,1.0052186223481883,0.10194143358953676,1.0002076037006571,2.0374876241990254E-2,0.99951180151087748,4.166331306642454E-2,7.5295630332113745,-106.10227532329992,73.897724676700079,null,1000000000,338891281,null,23.475968338312878,-30.189115565619964,null,11.607466119279845,-74.693422173815222,null,0,0]
[18515,18.515000000000001,3.4322363142772727,1.2751531009750132,1.0000676647497337,1.1632792830789784E-2,1,0,249.606465221055,1.5667900095938752,2.133473117397696,1.0829559476263095,1.0008386908686591,4.0941546605364212E-2,1.0052787353346262,0.10252432475096172,1.0002100011183654,2.0492163114636058E-2,0.99950617252506901,4.1903588872782636E-2,7.4734147132720974,-106.08949178775765,73.910508212242348,null,1000000000,342805225,null,23.464880472554164,-30.067427596995223,null,11.561907075900319,-74.795279860061129,null,0,0]
[18621,18.620999999999999,3.4502224808719388,1.2767404498433104,1.0000684417142305,1.169938553101366E-2,1,0,251.03546127040079,1.5668128153034462,2.1430099464232502,1.0853158269168193,1.0008483174343035,4.1175676461917089E-2,1.0053391898357711,0.10310714600788926,1.0002124122951068,2.060944942341663E-2,0.99950051143567509,4.2143871160637836E-2,7.4176454826001379,-106.07694920936547,73.923050790634534,null,1000000000,346741641,null,23.453952280769677,-29.946937796896716,null,11.516564647700642,-74.896179931261358,null,0,0]
[18729.5,18.729500000000002,3.4686417584355733,1.2783481831099626,1.0000692415963739,1.1767548706316787E-2,1,0,252.49816019042984,1.5668358915448926,2.1527839498365622,1.0877096960325505,1.0008582278599516,4.1415323571093413E-2,1.0054014237778945,0.10370364025211616,1.0002148945887388,2.0729501331391065E-2,0.99949468358563276,4.2389827234943611E-2,7.3609485567518265,-106.06436044233931,73.935639557660693,null,1000000000,350794170.25,null,23.442928600508882,-29.824832138889292,null,11.470375288734145,-74.998483044880459,null,0,0]
[18838,18.838000000000001,3.4870699070353761,1.2799389276483562,1.00007004612505,1.1835711772265839E-2,1,0,253.96085924336859,1.5668587019690388,2.1625701784576079,1.0900819127995789,1.0008681957644852,4.1654965920617598E-2,1.0054640154028995,0.10430006044322929,1.0002173912978567,2.0849552641756631E-2,0.99948882210770107,4.2635790178816024E-2,7.3046387698946011,-106.05202420586505,73.947975794134948,null,1000000000,354870244,null,23.432065958942012,-29.703951566163081,null,11.424409098564654,-75.099813175932638,null,0,0]
[18946.5,18.9465,3.505506786768521,1.281512943395527,1.0000708553002478,1.190387472822768E-2,1,0,255.42355842693368,1.5668812511425196,2.1723684670676291,1.092432743320753,1.0008782211461866,4.1894603483107674E-2,1.0055269646439911,0.10489640617078363,1.0002199024223528,2.0969603351057384E-2,0.99948292700589714,4.2881760032081266E-2,7.2487111779889482,-106.03994041154577,73.960059588454229,null,1000000000,358969862.25,null,23.421361298832963,-29.584281092227965,null,11.378664191536787,-75.200185220031145,null,0,0]
[19055,19.055,3.5239522605944016,1.2830704851815899,1.0000716691219556,1.1972037573569181E-2,1,0,256.88625773889379,1.5669035435279621,2.1821786532134984,1.0947624498681241,1.000888304003329,4.2134236231184972E-2,1.0055902714340095,0.10549267702464857,1.0002224279621184,2.1089653455837479E-2,0.99947699828426173,4.3127736834566076E-2,7.1931609257023936,-106.02810889190896,73.971891108091043,null,1000000000,363093025,null,23.410811632521185,-29.465805944123318,null,11.333138701132759,-75.299613780184274,null,0,0]
[19165.75,19.165749999999999,3.5427889681178746,1.2846435957026927,1.0000725046121823,1.2041613819394113E-2,1,0,258.37928965521706,1.5669260378957304,2.192204380709875,1.0971189511206272,1.0008986552258046,4.2378833328331381E-2,1.0056552597152437,0.10610123529792408,1.0002250207414853,2.1212192451876E-2,0.99947091194816762,4.3378821746719635E-2,7.1368429164614646,-106.01629194195287,73.983708058047128,null,1000000000,367325973.0625,null,23.400200010858939,-29.346091581484387,null,11.286893504271458,-75.400146054391627,null,0,0]
[19276.5,19.276499999999999,3.5616343501498977,1.2862000627017958,1.0000733449436059,1.2111189948630217E-2,1,0,259.87232170077715,1.566948273791875,2.2022421708529474,1.0994539834396055,1.0009090663285443,4.2623425351685632E-2,1.0057206203858233,0.10670971469746346,1.0002276285399589,2.1334730810785959E-2,0.99946479059199467,4.3629913983151136E-2,7.0809081107515768,-106.00473725015706,73.995262749842937,null,1000000000,371583452.25,null,23.389743801436925,-29.227592198088416,null,11.240873049205376,-75.499725151361361,null,0,0]
[19387.25,19.387250000000002,3.5804882697194107,1.2877401414987739,1.0000741901162142,1.2180765960604176E-2,1,0,261.36535387335925,1.5669702556458793,2.2122918594478631,1.1017678137657501,1.0009195373096791,4.2868012272140932E-2,1.0057863533731499,0.10731811478811201,1.0002302513574215,2.1457268528892362E-2,0.99945863422011527,4.3881013586218459E-2,7.0253516183296219,-105.99344440792387,74.006555592076126,null,1000000000,375865462.5625,null,23.379440039470992,-29.110292751483435,null,11.195075411722774,-75.598365702310218,null,0,0]
[19498,19.498000000000001,3.5993505926638441,1.2892640823761172,1.0000750401299949,1.2250341854642676E-2,1,0,262.85838617079895,1.5669919877865905,2.2223532850769048,1.1040607051222822,1.0009300681673299,4.3112594060594173E-2,1.0058524586042299,0.10792643513506334,1.0002328891937546,2.157980560252035E-2,0.99945244283692702,4.4132120598280047E-2,6.970168636993578,-105.98241293672336,74.017587063276636,null,1000000000,380172004,null,23.369285828033423,-28.994178417906102,null,11.14949868780322,-75.696082049834118,null,0,0]
[19611.75,19.611750000000001,3.6187324687691977,1.2908127619580074,1.0000759182086219,1.2321802299533864E-2,1,0,264.39186190879087,1.5670140531006531,2.2326993065333633,1.1063941811570683,1.0009409466146373,4.3363795716392019E-2,1.0059207419244591,0.1085511502160901,1.0002356141183975,2.1705661290063176E-2,0.99944604729923858,4.4390037363402683E-2,6.9138747285098487,-105.97135415883234,74.028645841167659,null,1000000000,384620738.0625,null,23.359009267811686,-28.87613713343638,null,11.102915371927875,-75.795498014020907,null,0,0]
[19725.5,19.7255,3.638122931585213,1.2923449368813147,1.0000768013942229,1.2393262618573991E-2,1,0,265.92533777402468,1.5670358639325705,2.2430573730954726,1.1087061184740883,1.0009518882222173,4.3614991896168388E-2,1.0059894177709188,0.10917578024605518,1.0002383548863398,2.1831516289881427E-2,0.99943961483726251,4.4647962034927213E-2,6.8579648484502318,-105.96056986940224,74.039430130597765,null,1000000000,389095350.25,null,23.348884487316948,-28.759315032086384,null,11.056561093147932,-75.893968791141702,null,0,0]
[19839.25,19.83925,3.6575218445437727,1.2938608625087464,1.000077689686784,1.2464722811033557E-2,1,0,267.45881376431191,1.567057424659545,2.2534273186642424,1.1109967895409996,1.0009628929879986,4.3866182568402669E-2,1.0060584860632251,0.10980032475501138,1.0002411114974519,2.1957370597993811E-2,0.99943314545584705,4.490589465875032E-2,6.8024340709520903,-105.95005934291008,74.04994065708992,null,1000000000,393595840.5625,null,23.338908559596554,-28.643696751598473,null,11.010433853933767,-75.991509015073404,null,0,0]
[19953,19.952999999999999,3.6769290738999181,1.2953607891139491,1.0000785830862919,1.253618287618307E-2,1,0,268.99228987751377,1.5670787395589643,2.2638089799953587,1.1132664627286994,1.000973960909898,4.4117367701578411E-2,1.0061279467205564,0.11042478327340707,1.0002438839516021,2.2083224210419174E-2,0.99942663915986896,4.5163835280769352E-2,6.7472775596483103,-105.93982179125969,74.060178208740311,null,1000000000,398122209,null,23.329078625468981,-28.529267158723389,null,10.964531678487493,-76.088133028111187,null,0,0]
[20069,20.068999999999999,3.6967286115120817,1.2968741620224011,1.0000794994168949,1.2609056305258232E-2,1,0,270.5560986096815,1.5671002272355037,2.2744078922206032,1.1155596795578491,1.0009853127978896,4.4373515594738677E-2,1.0061991853240992,0.1110615046734398,1.0002467275615743,2.2211566514367113E-2,0.99941996615595952,4.5426886309632333E-2,6.6914105619222219,-105.92966198752661,74.070338012473385,null,1000000000,402764761,null,23.319201711630143,-28.41378285915928,null,10.917951307647568,-76.185739282532225,null,0,0]
[20185,20.184999999999999,3.7165365255112257,1.2983714067725904,1.0000804210584471,1.2681929600404832E-2,1,0,272.11990746533456,1.5671214679428462,2.2850186542059565,1.1178316105800628,1.0009967303607803,4.4629657661359436E-2,1.006270831797166,0.11169813566242667,1.0002495876472637,2.2339908086472269E-2,0.99941325477302068,4.5689945752641008E-2,6.6359228999281346,-105.91978422496146,74.080215775038539,null,1000000000,407434225,null,23.309470825932131,-28.299503662368739,null,10.871600910304952,-76.282421951321012,null,0,0]
[20301,20.300999999999998,3.7363526826775244,1.2998527732101037,1.0000813480109336,1.2754802760849251E-2,1,0,273.68371644235646,1.5671424659144644,2.2956411016378699,1.1200825276602477,1.0010082135963227,4.4885793868030308E-2,1.0063428860526422,0.11233467574368164,1.0002524642085286,2.2468248922512962E-2,0.99940650501631445,4.5953013658472666E-2,6.5808097193376085,-105.91018748846004,74.089812511539961,null,1000000000,412130601,null,23.29988314237163,-28.186414232285792,null,10.825478459629759,-76.378195352408554,null,0,0]
[20417,20.417000000000002,3.7561769525475612,1.3013185061880654,1.0000822802743399,1.2827675785817878E-2,1,0,275.24752553867825,1.5671632252876233,2.3062750730507329,1.1223126985092078,1.001019762502257,4.5141924181345522E-2,1.0064153480029423,0.11297112442095518,1.0002553572452275,2.2596589018267655E-2,0.99939971689113372,4.6216090075805343E-2,6.5260662541631245,-105.90087070937197,74.099129290628028,null,1000000000,416853889,null,23.290435900661059,-28.074499465345063,null,10.779581951425177,-76.473073517678841,null,0,0]
[20536,20.536000000000001,3.7765222152830664,1.302806152383404,1.0000832421667138,1.2902433316396546E-2,1,0,276.85177809554722,1.5671842778444971,2.3171958695652477,1.124579264483897,1.0010316783243227,4.5404672395532544E-2,1.0064901075238191,0.11362393747777103,1.0002583422217679,2.2728247480753881E-2,0.99939271334683299,4.6485979089140761E-2,6.4702862870919482,-105.89160271740519,74.108397282594808,null,1000000000,421727296,null,23.280887445152565,-27.960895387281948,null,10.732731170667172,-76.569489576602706,null,0,0]
[20655,20.655000000000001,3.7968757462268279,1.3042778524552543,1.0000842096482305,1.2977190702752129E-2,1,0,278.45603077370589,1.5672050878236155,2.3281284585436497,1.1268245549042075,1.0010436632525876,4.5667414336387213E-2,1.0065652959116176,0.11427665328509205,1.0002613445366335,2.2859905155168479E-2,0.99938566943520168,4.6755877163704176E-2,6.4148855215797882,-105.88262691297568,74.117373087024319,null,1000000000,426629025,null,23.271481109365311,-27.848496050575854,null,10.686113969355562,-76.664992517383538,null,0,0]
[20774,20.774000000000001,3.8172374131204512,1.3057338551534101,1.0000851827188739,1.3051947944049463E-2,1,0,280.06028357106976,1.5672256593935916,2.3390726746355961,1.1290488456083601,1.0010557172845702,4.5930149967859581E-2,1.0066409130702381,0.11492927130860887,1.000264364189668,2.2991562036954325E-2,0.99937858516205413,4.7025784352051285E-2,6.3598590890387303,-105.87394198714084,74.126058012859161,null,1000000000,431559076,null,23.262214117358646,-27.73728588763931,null,10.639728256491718,-76.759596595393774,null,0,0]
[20893,20.893000000000001,3.8376070864601908,1.307174404215697,1.0000861613786276,1.3126705039453386E-2,1,0,281.66453648560224,1.5672459966280685,2.3500283553966996,1.1312524081301933,1.0010678404177744,4.6192879253904945E-2,1.0067169589030627,0.11558179101450536,1.0002674011807147,2.3123218121554458E-2,0.99937146053323833,4.7295700706738601E-2,6.305202210116633,-105.86554658497506,74.134453415024936,null,1000000000,436517449,null,23.253083758389579,-27.627249572066713,null,10.593571965123818,-76.853315778841264,null,0,0]
[21014.75,21.014749999999999,3.8584556414193738,1.308632498898515,1.0000871684387937,1.3203189562932538E-2,1,0,283.30586259087454,1.5672665654712385,2.361248912366368,1.133485719823998,1.0010803152197876,4.6461673410383979E-2,1.0067952056444356,0.11624928764916255,1.0002705262978069,2.3257915848913471E-2,0.99936412950044606,4.75718641655851E-2,6.2496598215682395,-105.85725535027061,74.142744649729394,null,1000000000,441619717.5625,null,23.243881048955078,-27.515869516174352,null,10.546584341479942,-76.948299210659954,null,0,0]
[21136.5,21.136500000000002,3.8793123114267667,1.3100749180686933,1.0000881813493403,1.3279673931928816E-2,1,0,284.9471888146262,1.5672868973569525,2.3724811350593766,1.1356978957806934,1.0010928623483468,4.6730460848456425E-2,1.0068739008953445,0.11691668024073437,1.0002736695631715,2.3392612732166616E-2,0.99935675623774911,4.7848037330622643E-2,6.1944944202944363,-105.84926417124784,74.150735828752161,null,1000000000,446751632.25,null,23.234815821352008,-27.40568648721813,null,10.499832564140256,-77.042385066736671,null,0,0]
[21258.25,21.25825,3.900176966293754,1.3115019072518752,1.0000892001102495,1.3356158145547845E-2,1,0,286.58851515482172,1.5673069963564439,2.3837248585674349,1.1378892132781693,1.0011054818007328,4.6999241529537619E-2,1.0069530445506338,0.1175839682191538,1.0002768309766377,2.3527308766434187E-2,0.99934934075152004,4.8124220258138936E-2,6.1397011647691748,-105.84157146647161,74.158428533528394,null,1000000000,451913193.0625,null,23.225885373008815,-27.296684829398938,null,10.453314495953341,-77.135587417930807,null,0,0]
[21380,21.38,3.9210494785534395,1.3129137070001533,1.0000902247215036,1.3432642202895258E-2,1,0,288.2298416094718,1.5673268664482116,2.3949799209117564,1.1400599451914049,1.0011181735742101,4.7268015415048749E-2,1.0070326365045821,0.1182511510149052,1.0002800105380329,2.3662003946836679E-2,0.99934188304816884,4.840041300442257E-2,6.0852753025683928,-105.83417561649883,74.165824383501175,null,1000000000,457104400,null,23.21708706527831,-27.1888491338729,null,10.407028024954876,-77.227920050138422,null,0,0]
[21504.5,21.5045,3.9424014394428788,1.3143419330611972,1.000091278525961,1.3510853663681769E-2,1,0,289.90824126259588,1.567346952680253,2.4065007645118555,1.1422586994978579,1.0011312268071673,4.7542853100876865E-2,1.007114489714438,0.11893329428193877,1.0002832806842834,2.3799740635414603E-2,0.99933421324413785,4.8682854403150726E-2,6.0299951829891176,-105.82691797846591,74.173082021534086,null,1000000000,462443520.25,null,23.208223995036938,-27.079767687573671,null,10.359933397554062,-77.32145288922797,null,0,0]
[21629,21.629000000000001,3.9637613555109659,1.3157547691299771,1.0000923384479965,1.358906495916591E-2,1,0,291.58664103133884,1.5673668076758704,2.4180331314923764,1.1444364911359743,1.0011443556593507,4.7817683599106278E-2,1.0071968114779442,0.11961532635832046,1.0002865698071792,2.3937476420799339E-2,0.99932649930798245,4.8965306188266625E-2,5.9750894660867324,-105.8199672219753,74.180032778024696,null,1000000000,467813641,null,23.199493718604248,-26.971873653008579,null,10.313076560360251,-77.414104551280374,null,0,0]
[21753.5,21.753499999999999,3.9851290988406807,1.3171524570777409,1.0000934044875907,1.3667276088391366E-2,1,0,293.26504091371567,1.5673864354052507,2.4295768577607371,1.1465935981017461,1.0011575601277856,4.8092506868503686E-2,1.0072796016802206,0.1202972466368715,1.0002898779065332,2.4075211297773805E-2,0.99931874124667719,4.9247768419962909E-2,5.9205533459597319,-105.81332150959538,74.186678490404617,null,1000000000,473214762.25,null,23.190893610589999,-26.865151327293013,null,10.266455334830944,-77.50588889800089,null,0,0]
[21878,21.878,4.0065045441974858,1.3185352338536094,1.0000944766447237,1.3745487050401838E-2,1,0,294.94344090778628,1.5674058397482102,2.4411317821681129,1.1487302939054393,1.0011708402094797,4.8367322867842337E-2,1.0073628602057709,0.12097905451102811,1.0002932049821569,2.4212945261121135E-2,0.99931093906723689,4.9530241158433241E-2,5.8663821054361618,-105.80697897371317,74.193021026286829,null,1000000000,478646884,null,23.182421108097849,-26.759585259378031,null,10.220067568669561,-77.596819509077761,null,0,0]
[22005.25,22.00525,4.0283599694076404,1.3199333866731846,1.0000955788057431,1.3825425389990511E-2,1,0,296.65891410754375,1.5674254458058074,2.4529533429857078,1.1508933734948825,1.0011844917601433,4.8648201544480831E-2,1.0074484416084406,0.12167580561163513,1.0002966251568366,2.4353720591376693E-2,0.99930291896720158,4.9818964174695578E-2,5.8113865496190247,-105.80080766403329,74.199192335966714,null,1000000000,484231027.5625,null,23.173890722182296,-26.652866435109924,null,10.172894211176953,-77.688890245659351,null,0,0]
[22132.5,22.1325,4.0502231843869625,1.3213164476381996,1.000096687357497,1.3905363552875558E-2,1,0,298.37438742002496,1.5674448264173284,2.4647862708351647,1.1530356940347901,1.0011982222949281,4.8929072539279757E-2,1.007534512005918,0.12237243800802051,1.0003000651549527,2.4494494956178853E-2,0.99929485279345986,5.0107698294169493E-2,5.7567624808491917,-105.79494904123686,74.205050958763138,null,1000000000,489847556.25,null,23.165488419728796,-26.547323659522576,null,10.125960276386838,-77.780096928960148,null,0,0]
[22259.75,22.25975,4.0720940636648297,1.3226846545856965,1.0000978022999647,1.3985301538035944E-2,1,0,300.08986084329661,1.5674639854490675,2.4766304027871291,1.1551575335501689,1.0012120318105846,4.9209935808241068E-2,1.0076210712728944,0.12306895105454342,1.0003035249763004,2.463526834995803E-2,0.99928674055363331,5.0396443581129532E-2,5.702505136598619,-105.78940102946771,74.210598970532288,null,1000000000,495496470.0625,null,23.157211655564556,-26.442941221957959,null,10.079263549090234,-77.870453189780079,null,0,0]
[22387,22.387,4.093972484408261,1.3240382404937947,1.0000989236331244,1.4065239344450645E-2,1,0,301.80533437546956,1.5674829266794159,2.4884855788613338,1.1572591655131814,1.0012259203038449,4.9490791307374035E-2,1.0077081192833919,0.12376534410624743,1.0003070046206741,2.4776040767144882E-2,0.99927858225538746,5.0685200099851328E-2,5.648609842475981,-105.78416153029636,74.215838469703641,null,1000000000,501177769,null,23.149057945444852,-26.339703667580689,null,10.032801841297944,-77.95997238052334,null,0,0]
[22517.5,22.517499999999998,4.1164173929207353,1.3254114504572632,1.0001000802430255,1.4147218597706707E-2,1,0,303.56462168466868,1.5675021293252591,2.5006548456888278,1.159393767176403,1.0012402455386276,4.977881181710446E-2,1.00779789801825,0.12447939792217443,1.0003105937248253,2.4920407530427981E-2,0.99927016776207811,5.0981343272530566E-2,5.5937092806310869,-105.77910642591651,74.22089357408349,null,1000000000,507037806.25,null,23.140821255993714,-26.235002591399912,null,9.9853953250063103,-78.050922204626247,null,0,0]
[22648,22.648,4.1388699795862944,1.326769764150459,1.0001012435741814,1.4229197660794985E-2,1,0,305.32390910451477,1.5675211106784279,2.5128353964191246,1.1615076841425953,1.0012546538297289,5.0066824061360191E-2,1.0078881905102006,0.12519332416386283,1.0003142036770623,2.5064773254733049E-2,0.99926170484408894,5.1277498394954595E-2,5.5391798164228279,-105.77437126101178,74.22562873898822,null,1000000000,512931904,null,23.132708883600962,-26.131473508347653,null,9.9382314116258854,-78.14101923087685,null,0,0]
[22778.5,22.778500000000001,4.1613301201217983,1.3281134177211682,1.0001024136265693,1.4311176532614257E-2,1,0,307.08319663310601,1.5675398745422828,2.5250270677539981,1.1636011969990572,1.0012691451735636,5.035482799271726E-2,1.0079789966211801,0.12590712213793126,1.0003178344771593,2.5209137934053792E-2,0.99925319350983322,5.1573665536454538E-2,5.4850166835800716,-105.7699537129371,74.230046287062905,null,1000000000,518860062.25,null,23.124718337445934,-26.029100557155211,null,9.8913078280695466,-78.230276993582052,null,0,0]
[22909,22.908999999999999,4.1837976928715213,1.329442642458899,1.0001035904001647,1.4393155212063309E-2,1,0,308.8424842685842,1.5675584246335232,2.5372296993862227,1.1656745816580463,1.0012837195665254,5.0642823563759924E-2,1.0080703162123892,0.12662079115177013,1.0003214861248895,2.5353501562384157E-2,0.99924463376777273,5.1869844766362867E-2,5.4312152045094875,-105.76585144358373,74.234148556416272,null,1000000000,524822281,null,23.116847186859609,-25.927868139449153,null,9.8446223297885478,-78.318708748690156,null,0,0]
[23042.25,23.042249999999999,4.2067462652733951,1.3307852249398646,1.0001047989067988,1.447686121193955E-2,1,0,310.63884512355696,1.5675771488238068,2.549700620258609,1.1677711713310688,1.0012986867716254,5.0936879331295835E-2,1.0081640898427449,0.12734936538375885,1.0003252362340522,2.5500906245453946E-2,0.99923584370816554,5.2172277866279829E-2,5.376648373508413,-105.76198559893868,74.238014401061321,null,1000000000,530945285.0625,null,23.108930900592419,-25.825663371196804,null,9.7971963984417378,-78.408165198297397,null,0,0]
[23175.5,23.1755,4.2297023381622267,1.3321132364642798,1.0001060144208449,1.4560567008932226E-2,1,0,312.43520608618599,1.5675956577028654,2.5621826396890435,1.1698473424157836,1.001313740555223,5.1230926282568902E-2,1.0082583985274676,0.12807780370619032,1.0003290080782592,2.5648309820117249E-2,0.99922700319706914,5.2474723715544264E-2,5.3224490163482354,-105.75844349345368,74.241556506546317,null,1000000000,537103800.25,null,23.101134157634963,-25.724615660320293,null,9.7500140520189156,-78.496787535698019,null,0,0]
[23308.75,23.30875,4.2526657900741638,1.3334269083494164,1.000107236942277,1.464427260186908E-2,1,0,314.23156715462483,1.5676139549632817,2.5746755962602044,1.1719033741103113,1.0013288809134133,5.1524964367129174E-2,1.0083532421164301,0.12880610538425599,1.0003328016572643,2.5795712279981124E-2,0.99921811224364965,5.2777182387968934E-2,5.2686124263488052,-105.75522260132885,74.244777398671147,null,1000000000,543297826.5625,null,23.09345455375043,-25.624709218624481,null,9.7030729906449924,-78.584589018691801,null,0,0]
[23442,23.442,4.2756365021161438,1.3347264671419459,1.0001084664710695,1.4727977989577878E-2,1,0,316.02792832706928,1.5676320442136822,2.5871793315324911,1.1739395409035409,1.0013441078422696,5.1818993534535888E-2,1.0084486204587111,0.12953426968400272,1.0003366169708205,2.5943113618652924E-2,0.99920917085712713,5.3079653957367974E-2,5.2151339844571094,-105.75232038843835,74.247679611561651,null,1000000000,549527364,null,23.08588974300903,-25.525928522923518,null,9.656370943778164,-78.671582631743306,null,0,0]
[23578.5,23.578499999999998,4.2991748816842739,1.3360433207886773,1.0001097332541538,1.4813724758086058E-2,1,0,317.86810329264478,1.5676503626696561,2.599999049651732,1.1760050547956726,1.0013597959191409,5.2120184846290198E-2,1.0085468794199504,0.13028005087709771,1.0003405478767271,2.6094108942699673E-2,0.99919995910448256,5.3389516331929628E-2,5.160717809560996,-105.74967516713677,74.250324832863228,null,1000000000,555945662.25,null,23.078257059074943,-25.425889855468451,null,9.6087753096144617,-78.759873666388202,null,0,0]
[23715,23.715,4.322720635267931,1.3373458309344213,1.0001110073905346,1.4899471308742787E-2,1,0,319.70827836365811,1.5676684702511086,2.612829751393742,1.1780502912959177,1.0013755748327231,5.2421366693479299E-2,1.0086456992149906,0.13102568635236797,1.0003445015898065,2.624510307661582E-2,0.99919069444833908,5.3699392397069973E-2,5.1066679270255797,-105.74735895773664,74.252641042263363,null,1000000000,562401225,null,23.070740033170615,-25.327000372489618,null,9.5614257605386488,-78.847343675856479,null,0,0]
[23851.5,23.851500000000001,4.3462736430218651,1.3386342263111324,1.0001122888801839,1.4985217640288004E-2,1,0,321.54845353829899,1.5676863705784412,2.6256712757396024,1.1800755306828672,1.001391444578722,5.2722539021911187E-2,1.0087450796790085,0.13177117532365548,1.0003484781097882,2.639609601353041E-2,0.99918137689878161,5.4009282232141721E-2,5.052979644193111,-105.74536902072101,74.254630979278986,null,1000000000,568894052.25,null,23.063336323191251,-25.229244219535381,null,9.5143199488155989,-78.934005770142562,null,0,0]
[23988,23.988,4.3698337876481181,1.3399087309076207,1.0001135777230732,1.5070963751461665E-2,1,0,323.38862881479849,1.5677040671896503,2.6385234646705626,1.1820810484372712,1.001407405152819,5.3023701777404168E-2,1.0088450206463113,0.13251651700576256,1.0003524774364001,2.6547087746572828E-2,0.99917200646595361,5.4319185916499216E-2,4.9996483560827327,-105.74370261498612,74.25629738501388,null,1000000000,575424144,null,23.056043644244806,-25.132605812329292,null,9.4674555571887318,-79.019872787478818,null,0,0]
[24127.75,24.127749999999999,4.3939621620032145,1.3411994190724141,1.0001149048706082,1.5158751207090711E-2,1,0,325.27261789207745,1.5677219777096505,2.651692544661099,1.1841141677689568,1.0014238398337545,5.3332025100584921E-2,1.0089479216666541,0.13327945150823337,1.0003565956124059,2.6701673266495231E-2,0.9991623581512874,5.463648269070176E-2,4.945412402414588,-105.74232884835398,74.257671151646022,null,1000000000,582148320.0625,null,23.048690030432503,-25.034808477614092,null,9.4197230692032878,-79.106973687401677,null,0,0]
[24267.5,24.267499999999998,4.4180977761964897,1.342476007550875,1.0001162397256458,1.5246538429056484E-2,1,0,327.15660707249782,1.5677396819478624,2.6648724772610053,1.1861271845403707,1.0014403697101861,5.3640338274641965E-2,1.0090514098443819,0.13404222996169701,1.0003607376934187,2.685625750996196E-2,0.99915265442682732,5.4953794149872691E-2,4.8915411495890959,-105.74128838978291,74.258711610217091,null,1000000000,588911556.25,null,23.041448127545038,-24.938150534183372,null,9.372238814659589,-79.193267589578937,null,0,0]
[24407.25,24.407250000000001,4.4422405122213178,1.3437387220352526,1.0001175822881547,1.5334325416006843E-2,1,0,329.04059635428791,1.5677571834476007,2.678063102238819,1.1881203793571493,1.0014569947774008,5.3948641241464666E-2,1.0091554849988575,0.13480485152668253,1.000364903679142,2.7010840469600943E-2,0.99914289530364953,5.5271120379175816E-2,4.8380299280224666,-105.74057830291405,74.259421697085955,null,1000000000,595713852.5625,null,23.034315659463154,-24.842616104205902,null,9.3250004031792137,-79.278767430180949,null,0,0]
[24547,24.547000000000001,{"$f":"SQRT(1+(A333/pole1)^2)","v":4.4663902545881253},{"$f":"ATAN(A333/pole1)","v":1.3449877835156689},{"$f":"SQRT(1+(A333/Zero1)^2)","v":1.0001189325581044},{"$f":"ATAN(A333/Zero1)","v":1.5422112166589666E-2},{"$f":"IF(VIN_nom>Vout, 1, SQRT(1+(A333/z_RHP)^2))","v":1},{"$f":"IF(VIN_nom>Vout, 0, -ATAN(A333/z_RHP))","v":0},{"$f":"SQRT(1+(A333/Pole2)^2)","v":330.92458573571633},{"$f":"ATAN(A333/Pole2)","v":1.5677744856714908},2.6912642623757064,1.1900940279559393,{"$f":"SQRT(1+(A333/pole4)^2)","v":1.0014737150306574},{"$f":"ATAN(A333/pole4)","v":5.4256933942953986E-2},{"$f":"SQRT(1+(A333/Zero3)^2)","v":1.0092601469484932},{"$f":"ATAN(A333/Zero3)","v":0.13556731536479424},{"$f":"SQRT(1+(A333/pole5)^2)","v":1.0003690935692771},{"$f":"ATAN(A333/pole5)","v":2.7165422138040463E-2},{"$f":"SQRT((1-(Z333/pterm2))^2+(A333/pterm1)^2)","v":0.99913308079289553},{"$f":"IF((ATAN((A333/pterm1)/(1-A333^2/pterm2))>0),ATAN((A333/pterm1)/(1-A333^2/pterm2)),PI()+ATAN((A333/pterm1)/(1-A333^2/pterm2)))","v":5.5588461463776731E-2},{"$f":"20*LOG10(((E333*K333*G333*O333)/(C333*I333*S333*M333*Q333))*Adc)","v":4.7848741556081862},{"$f":"((F333+L333+H333+R333)-(D333+J333+T333+N333+T333))*radconv","v":-105.74019565632659},{"$f":"IF(V333>0,V333,V333+180)","v":74.259804343673409},null,{"$f":"IF(U333<0,A333,1000000000)","v":1000000000},{"$f":"A333^2","v":602555209},null,{"$f":"20*LOG10((K333/(I333*M333))*AEA)","v":23.027290406028573},{"$f":"(L333-(J333+N333))*radconv","v":-24.748189584200539},null,{"$f":"20*LOG10((E333*G333/(C333*S333))*Acs*Am)","v":9.2780054759157231},{"$f":"(F333+H333-(D333+T333))*radconv","v":-79.363485875966148},null,{"$f":"SUM((U334<0)*(U333>0))*A333","v":0},0]
[24690,{"$f":"A334/1000","v":24.69},4.4911087536096872,1.346251985698284,1.000120322208037,1.551194022342431E-2,1,0,332.85238892506584,1.5677919875213422,2.704783170832938,1.1920936246465574,1.0014909226542648,5.4572385555354617E-2,1.0093678501299719,0.13634734677498239,1.0003734056431548,2.7323597384721759E-2,0.9991229807147165,5.5913198039968706E-2,4.7308454567337188,-105.74014001084406,74.259859989155942,null,1000000000,609596100,null,23.020210499295708,-24.65269796115199,null,9.2301672589438155,-79.449378592310211,null,0,0]
[24833,24.832999999999998,4.5158343517688024,1.3475023460604381,1.0001217199279979,1.5601768029905403E-2,1,0,334.78019221519861,1.5678092878053684,2.7183127864651766,1.1940733243589694,1.0015082299325229,5.4887826296369992E-2,1.0094761673290429,0.13712721126422514,1.0003777427455673,2.7481771263834033E-2,0.99911282266664891,5.6237950350862057E-2,4.6771794963609032,-105.74042102435349,74.259578975646505,null,1000000000,616677889,null,23.013238321195036,-24.558334179225433,null,9.1825790846616133,-79.534479146636343,null,0,0]
[24976,24.975999999999999,4.540566933090691,1.3487390868504505,1.0001231257179533,1.5691595584584352E-2,1,0,336.70799560438377,1.5678263899857217,2.7318529501892366,1.1960334073114911,1.0015256368602652,5.5203256103790836E-2,1.0095850983480743,0.13790690793779264,1.0003821048761894,2.7639943767480434E-2,0.99910260666083894,5.6562718487709343E-2,4.6238716362252212,-105.74103558121342,74.258964418786576,null,1000000000,623800576,null,23.006371664693983,-24.46508237789639,null,9.1352385252112427,-79.618800278146679,null,0,0]
[25119,25.119,4.5653063840813424,1.3499624256678751,1.0001245395778688,1.5781422886012593E-2,1,0,338.63579909092948,1.5678432974457166,2.7454035059374724,1.1979741487995275,1.0015431434322963,5.5518674915420889E-2,1.0096946429884004,0.13868643590215626,1.0003864920346934,2.7798114887764517E-2,0.99909233270950415,5.6887502541765077E-2,4.5709173251089261,-105.74198057697355,74.258019423026454,null,1000000000,630964161,null,22.999608377333274,-24.372926974186097,null,9.0881431852253165,-79.702354459688749,null,0,0]
[25265.25,25.265250000000002,4.5906150852077809,1.351199927352482,1.0001259939180855,1.5873291453559424E-2,1,0,340.60741639206043,1.5678603912030831,2.7592726182809852,1.1999392740745933,1.0015611509425062,5.5841250898112753E-2,1.0098073117701925,0.13948350497698156,1.0003910047885713,2.7959879367128085E-2,0.99908176533617654,5.7219684610652466E-2,4.5171205458875869,-105.74328561672255,74.256714383277455,null,1000000000,638332857.5625,null,22.992796110959532,-24.279795232137573,null,9.0402286762570139,-79.787027032840655,null,0,0]
[25411.5,25.4115,4.615930739352863,1.3524238569624794,1.0001274566991747,1.5965159753148647E-2,1,0,342.57903379157017,1.5678772882038168,2.7731522795505081,1.2018847358476137,1.0015792626666726,5.616381524797797E-2,1.0099206219584844,0.14028039570027817,1.000395543720191,2.8121642382829385E-2,0.9990711373795812,5.7551883521554499E-2,4.4636842094371758,-105.74492975888597,74.255070241114026,null,1000000000,645744332.25,null,22.986087579731624,-24.187778185931453,null,8.9925656936925886,-79.870922963726471,null,0,0]
[25557.75,25.557749999999999,4.6412532327411489,1.3536344329467431,1.0001289279210992,1.6057027783230756E-2,1,0,344.55065128776977,1.567893991825601,2.7870423321429274,1.2038108132778538,1.0015974785991426,5.648636789852525E-2,1.0100345733374085,0.1410771071201353,1.0004001088291961,2.8283403926422607E-2,0.99906044885301726,5.7884099372096681E-2,4.4106037162624583,-105.74690972649175,74.253090273508249,null,1000000000,653198585.0625,null,22.979480648100235,-24.096860030637334,null,8.9451517772687676,-79.954054774227203,null,0,0]
[25704,25.704000000000001,4.6665824540363277,1.3548318691698586,1.000130407583822,1.614889554225625E-2,1,0,346.52226887900889,1.5679105053692475,2.800942621464555,1.2057177805645523,1.0016157987342302,5.6808908783277844E-2,1.0101491656899733,0.14187363828598093,1.0004047001152288,2.8445163989462403E-2,0.99904969976986147,5.8216332259906758E-2,4.3578745532729535,-105.74922225969263,74.25077774030737,null,1000000000,660695616,null,22.972973233587027,-24.007025241109844,null,8.8979845000745392,-80.036434723563417,null,0,0]
[25853.75,25.853750000000002,4.6925247022879812,1.3560445654568445,1.0001319314034558,1.624296156345938E-2,1,0,348.54107057777225,1.5679272205219819,2.8151860160399824,1.2076508643374408,1.0016346652669932,5.7139156334244871E-2,1.0102671643623107,0.14268904396843993,1.0004094284020268,2.8610793690552298E-2,0.99903863070998322,5.855653377595621E-2,4.3042429133288831,-105.75193134897218,74.248068651027822,null,1000000000,668416389.0625,null,22.966411083192853,-23.916147197944795,null,8.8499414966074639,-80.120019627777452,null,0,0]
[26003.5,26.003499999999999,4.7184737756286843,1.3572439251340798,1.0001334640726465,1.6337027297189128E-2,1,0,350.55987237279521,1.5679437431565062,{"$f":"SQRT(1+(A343/Zero2)^2)","v":2.8294398245024164},{"$f":"ATAN(A343/Zero2)","v":1.2095644786917286},1.0016536410373613,5.7469391408515494E-2,1.01038583459042,0.14350425865335872,1.0004141841329952,2.8776421821457492E-2,0.99902749818902958,5.8896753361659823E-2,4.2509703126687723,-105.75498225403865,74.245017745961349,null,1000000000,676182012.25,null,22.95994901508061,-23.826372924953453,null,8.8021520336178884,-80.202841452324833,null,0,0]
[26153.25,26.15325,4.7444295620714874,1.3584301636079283,1.0001350055913529,1.6431092741782172E-2,1,0,352.5786742624241,1.5679600765797852,2.8437038902558629,1.2114589024828726,1.0016727260391263,5.7799613934773141E-2,1.0105051761377055,0.14431928132467678,1.0004189673077419,2.8942048373113202E-2,0.99901630222161342,5.9236991121830979E-2,4.1980521745742365,-105.75837153754118,74.24162846245882,null,1000000000,683992485.5625,null,22.953584956695931,-23.737686630283985,null,8.7546136109749195,-80.284912545181768,null,0,0]
[26303,26.303000000000001,4.7703919520380715,1.3596034917449773,1.0001365559595348,1.6525157895575213E-2,1,0,354.59747624504325,1.5679762240234747,2.8579780597190125,1.2133344095523582,1.0016919202660441,5.8129823841717589E-2,1.0106251887663453,0.14513411096783246,1.0004237779258736,2.9107673336455159E-2,0.99900504282243263,5.9577247161285568E-2,4.1454840084644289,-105.76209578498454,74.237904215015462,null,1000000000,691847809,null,22.947316887298644,-23.650072805050055,null,8.7073237628911162,-80.366244994214568,null,0,0]
[26456,26.456,4.7969245080638752,1.3607891654998807,1.0001381491147103,1.6621264228102933E-2,1,0,356.66009205456993,1.5679925331199429,2.872572297493956,1.2152313631840874,1.0017116438622493,5.8467187133548294E-2,1.010748498846906,0.14596642431543844,1.0004287212909067,2.9276891181732937E-2,0.99899347356603652,5.9924906710159875E-2,4.092131827973569,-105.76624327929922,74.233756720700782,null,1000000000,699919936,null,22.941009869953405,-23.561649303098754,null,8.6592617864182735,-80.448592033963649,null,0,{"$f":"IF(AH346>0,W346,0)","v":0}]
[26609,26.609000000000002,4.8234637335177455,1.361961793474634,1.0001397515075598,1.6717370253561167E-2,1,0,358.72270795787244,1.5680086546654126,2.8871767675050322,1.2171091324482943,1.0017314814627571,5.8804537101952201E-2,1.0108725089478425,0.14679853402912038,1.0004336933026119,2.9446107349879378E-2,0.99898183812599095,6.0272585561564396E-2,4.0391357642589911,-105.77073330509947,74.229266694900531,null,1000000000,708038881,null,22.93479894765661,-23.474313475183571,null,8.6114541945486174,-80.530192729116123,null,0,0]
[26762,26.762,4.8500095189144634,1.3631215866298707,1.0001413631380387,1.6813475970176048E-2,1,0,360.78532395334253,1.5680245918765729,2.9017913152583108,1.2189679938617828,1.0017514330607946,5.9141873670938906E-2,1.0109972188115595,0.14763043903170869,1.0004386939605616,2.9615321831228846E-2,0.99897013651824751,6.0620283827296798E-2,3.9864912932691565,-105.77556229970868,74.224437700291318,null,1000000000,716204644,null,22.928682123139144,-23.388049658007446,null,8.5638984648872878,-80.611059173333132,null,0,0]
[26915,26.914999999999999,4.87656175712599,1.3642687514714376,1.0001429840061018,1.6909581376173755E-2,1,0,362.84794003940829,1.5680403478969709,2.9164157892510736,1.2208082189233647,1.0017714986495505,5.9479196764536245E-2,1.0111226281791339,0.14846213824769708,1.0004437232643266,2.9784534616116284E-2,0.99895836875885069,6.0968001619157518E-2,3.9341939760514082,-105.78072672853018,74.219273271469817,null,1000000000,724417225,null,22.92265744924617,-23.302842471593394,null,8.5165921100456625,-80.69120320503545,null,0,0]
[27071.75,27.071750000000002,4.9037713678858719,1.3654311480604417,1.0001446541812531,1.7008041982843475E-2,1,0,364.96111053365672,1.5680563053996717,2.9314088450615179,1.2226744991266632,1.0017921742505833,5.982477352674774E-2,1.011251836464631,0.14931400771157136,1.0004489055424635,2.9957893003736261E-2,0.99894624398728238,6.1324262272676941E-2,3.8809703291466633,-105.78636193824012,74.21363806175988,null,1000000000,732879648.0625,null,22.916578693308889,-23.216626879985888,null,8.4683823391852382,-80.772574478441527,null,0,0]
[27228.5,27.2285,4.9309875313253224,1.3665807146915716,1.0001463340522652,1.7106502259713878E-2,1,0,367.07428111976952,1.5680720791743024,2.9464120070437536,1.2245217794713836,1.0018129694839955,6.0170335983537278E-2,1.0113817784091472,0.15016565889761468,1.00045411788691,3.0131249590179158E-2,0.99893404981598644,6.1680543658798992E-2,3.8281018942812799,-105.79234180861475,74.207658191385249,null,1000000000,741391212.25,null,22.910592677851326,-23.131488553604196,null,8.4204291417159389,-80.853211856195998,null,0,0]
[27385.25,27.385249999999999,4.9582101395391955,1.3677176596264267,1.0001480236190894,1.7204962204877602E-2,1,0,369.18745179616928,1.5680876723757464,2.9614251215982241,1.2263503362159769,1.0018338843423371,6.0515884053268652E-2,1.0115124537299387,0.15101709065476618,1.0004593602971958,3.0304604365053604E-2,0.99892178626251993,6.2036845897757022E-2,3.7755841626340958,-105.79866263428792,74.201337365712078,null,1000000000,749951917.5625,null,22.904697463166368,-23.047411840089094,null,8.3727299533355115,-80.933127277807657,null,0,0]
[27542,27.542000000000002,4.9854390869539023,1.3688421867089067,1.0001497228816767,1.7303421816427311E-2,1,0,371.30062256131441,1.5681030880870668,2.9764480381235061,1.2281604405478963,1.0018549188181169,6.0861417654326233E-2,1.0116438621428119,0.15186830183383077,1.000464632772849,3.0477957317968887E-2,0.99890945334454218,6.2393169109787532E-2,3.7234127103576009,-105.80532074321117,74.194679256788831,null,1000000000,758561764,null,22.898891158518097,-22.964381373514293,null,8.3252822457677684,-81.012332429670025,null,0,0]
[27702.5,27.702500000000001,5.0133259052116568,1.3699809577115829,1.0001514728428988,1.7404236573402988E-2,1,0,373.46434774136662,1.568118691831871,2.9918403568694552,1.2299950069747063,1.0018765804473113,6.121520253223061E-2,1.0117791736082784,0.1527396471617205,1.0004700625366583,3.0655455572001104E-2,0.99889675352571339,6.2758038657853621E-2,3.6703474086553065,-105.81248382053306,74.18751617946694,null,1000000000,767428506.25,null,22.89303614826612,-22.880432869007105,null,8.2769573993727903,-81.092708427136785,null,0,0]
[27863,27.863,5.0412191528155059,1.3711071284390857,1.0001532329692402,1.7505050976564254E-2,1,0,375.62807301130113,1.5681341158126019,3.0072426419561422,1.2318107871526318,1.0018983674696937,6.1568972067783882E-2,1.0119152530538957,0.15361075879883271,1.0004755238205645,3.0832951893810162E-2,0.99888398102159892,6.3122930449634351E-2,3.617636029990698,-105.81999282918876,74.180007170811237,null,1000000000,776346769,null,22.887270492137191,-22.797549558500432,null,8.228890958589405,-81.172363776757635,null,0,0]
[28023.5,28.023499999999999,5.0691187236314121,1.3722209040603659,1.000155003260647,1.7605865023863722E-2,1,0,377.79179836957366,1.5681493631179382,3.0226547410296645,1.2336080563813083,1.0019202798770843,6.192272617343926E-2,1.0120521001698786,0.15448163551763988,1.0004810166240516,3.1010446272243773E-2,0.99887113585149012,6.3487844614214001E-2,3.5652740889776808,-105.8278439384864,74.172156061513604,null,1000000000,785316552.25,null,22.881592310704292,-22.715715840439216,null,8.1810803227258191,-81.251310241360812,null,0,0]
[28184,28.184000000000001,5.0970245138253265,1.3733224853757835,1.0001567837170653,1.7706678713254043E-2,1,0,379.95552381467502,1.5681644367662024,3.0380765047315688,1.2353870848542154,1.0019423176612563,6.2276464761673034E-2,1.0121897146448617,0.15535227609270175,1.0004865409466004,3.1187938696150386E-2,0.99885821803479091,6.385278128068031E-2,3.513257184851815,-105.83603335596419,74.16396664403581,null,1000000000,794337856,null,22.875999772247027,-22.634916401799838,null,8.1335229280309491,-81.329559333473014,null,0,0]
[28348,28.347999999999999,5.1255451601013196,1.3744356971028604,1.0001586134995082,1.7809690460176331E-2,1,0,382.1664333919058,1.5681796628134985,3.053844399293792,1.2371863424872782,1.0019649655192553,6.2637901155776235E-2,1.0123311223749241,0.15624165740226179,1.0004922182942526,3.136929964083035E-2,0.99884494350130759,6.4225699445193032E-2,3.4604578684493021,-105.84474690802527,74.155253091974728,null,1000000000,803609104,null,22.870371885457523,-22.553407701268775,null,8.0851874116637212,-81.408806165820977,null,0,0]
[28512,28.512,5.1540720878585002,1.3755365872998671,1.0001604538950155,1.7912701829087833E-2,1,0,384.37734305671592,1.5681947137026326,3.0696220785665815,1.2389671096764467,1.0019877442642899,6.2999321163622807E-2,1.0124733306339624,0.15713078957654228,1.0004979285495126,3.1550658521271716E-2,0.99883159315962133,6.4598641376192284E-2,3.4080097730199768,-105.85380580149567,74.146194198504332,null,1000000000,812934144,null,22.864829697220213,-22.472947450448601,null,8.0371110049595593,-81.48734840987575,null,0,0]
[28676,28.675999999999998,5.1826051933702555,1.3766253567865585,1.0001623049035282,1.8015712817804456E-2,1,0,386.58825280760283,1.5682095924388022,3.0854093924434181,1.2407296588739372,1.0020106538874338,6.3360724691912951E-2,1.0126163390847061,0.15801967131498607,1.0005036717118174,3.173201532557976E-2,0.9988181670307984,6.4971607211407753E-2,3.3559084641718142,-105.8632061155663,74.1367938844337,null,1000000000,822312976,null,22.859371398645095,-22.393520205816639,null,7.9892910881457322,-81.565197579778228,null,0,0]
[28840,28.84,5.2111443751595363,1.3777022020998582,1.0001641665249879,1.8118723424142173E-2,1,0,388.7991626430981,1.5682243019588484,3.1012061937836362,1.2424742574386032,1.0020336943797099,6.3722111647372626E-2,1.0127601473881782,0.15890830131935157,1.0005094477806002,3.1913370041860581E-2,0.99880466513602773,6.5344597088572973E-2,3.3041495910703422,-105.87294397195365,74.127056028046354,null,1000000000,831745600,null,22.853995226905322,-22.315110811763322,null,7.9417250789715137,-81.642364944281354,null,0,0]
[29008,29.007999999999999,5.2403858311682416,1.3787931490192993,1.0001660845561688,1.8224246085527928E-2,1,0,391.0639971949563,1.568239197790458,3.1173979695856291,1.244243068720887,1.0020574325217293,6.4092295637262722E-2,1.0129082922086621,0.15981834285290192,1.0005153988486748,3.2099145866432845E-2,0.99879075538862017,6.5726709352478541E-2,3.2514789099089652,-105.88326531965984,74.116734680340159,null,1000000000,841464064,null,22.848571289213702,-22.235828838990329,null,7.8932595352011621,-81.720719015409244,null,0,0]
[29176,29.175999999999998,5.2696334548793899,1.3798719872205949,1.0001680137241884,1.8329768341015185E-2,1,0,393.32883183258673,1.5682539220780971,3.1335993979578673,1.2459935951120382,1.0020813079753608,6.4462462037969723E-2,1.0130572756493224,0.16072811747248844,1.0005213844467826,3.2284919474616675E-2,0.99877676617970157,6.6108847138020246E-2,3.1991585897549162,-105.89393277429072,74.106067225709282,null,1000000000,851238976,null,22.843229930825061,-22.157583676777808,null,7.8450550681163413,-81.798380793629605,null,0,0]
[29344,29.344000000000001,5.29888714416363,1.3809389147180673,1.0001699540289823,1.843529018825632E-2,1,0,395.59366655451629,1.5682684777681064,3.1498103299528863,1.2477261081171938,1.0021053207307902,6.4832610749311723E-2,1.0132070973402232,0.16163762379016453,1.0005274045743044,3.2470690853629185E-2,0.99876269753245095,6.6491010593270283E-2,3.147184213173059,-105.90494230604034,74.09505769395966,null,1000000000,861070336,null,22.837969398247971,-22.080359932100169,null,7.7971090200513995,-81.875361632945825,null,0,0]
[29512,29.512,5.3281467991135818,1.3819941252862609,1.0001719054704854,1.8540811624903779E-2,1,0,397.85850135930531,1.5682828677397376,3.166030619587342,1.2494408741150225,1.0021294707781474,6.520274167113578E-2,1.0133577569095671,0.16254686042057767,1.0005334592306161,3.2656459990688412E-2,0.99874854947018266,6.6873199866305244E-2,3.0955514460541718,-105.9162899320647,74.0837100679353,null,1000000000,870958144,null,22.832787982890743,-22.004142501814535,null,7.749418771796865,-81.951672644440137,null,0,0]
[29684,29.684000000000001,5.358109190876811,1.3830625192106079,1.0001739149124191,1.8648845048884085E-2,1,0,400.17726088667672,1.5682974315839813,3.1826466516870755,1.251178354909124,1.0021543380503937,6.5581666699504285E-2,1.0135128712614909,0.16347746470292202,1.0005396938165054,3.2846649866434811E-2,0.99873398229999866,6.7264515785731935E-2,3.0430387935801799,-105.92825389485191,74.071746105148094,null,1000000000,881139856,null,22.827563427355972,-21.927137436925531,null,7.7008553541025666,-82.02911799865015,null,0,0]
[29856,29.856000000000002,5.3880776307115692,1.3841190295347721,1.0001759360275564,1.8756878037506104E-2,1,0,402.49602049794993,1.5683118276250589,3.1992721918685212,1.252897782643918,1.0021793492089925,6.5960572868786607E-2,1.013668863071153,0.16440778337245893,1.0005459645936539,3.3036837365085552E-2,0.99871933193800244,6.7655859081130865E-2,2.9908752761416295,-105.94056394484704,74.059436055152958,null,1000000000,891380736,null,22.822418315315907,-21.851156041184062,null,7.6525546265126074,-82.105884066195344,null,0,0]
[30028,30.027999999999999,5.4180520182582095,1.3851638511119568,1.0001779688158265,1.8864910588250749E-2,1,0,404.81478019168327,1.5683260587464707,3.2159070926675413,1.2545994272218819,1.0022045042431722,6.6339460071599743E-2,1.013825731933524,0.16533781495103048,1.0005522715613806,3.3227022472926797E-2,0.99870459840965586,6.8047229911423604E-2,2.9390565009293286,-105.95321596024445,74.046784039755551,null,1000000000,901680784,null,22.817350950804261,-21.776183009377078,null,7.604513899050664,-82.181982020591789,null,0,0]
[30200,30.2,5.4480322553460452,1.3861971746096602,1.0001800132771581,1.8972942698598991E-2,1,0,407.13353996646782,1.568340127766026,3.2325512095732538,1.2562835534033276,1.0022298031420989,6.6718328200593258E-2,1.0139834774415495,0.16626755796337744,1.0005586147190015,3.3417205176245766E-2,0.99868978174056888,6.8438628435536553E-2,2.8875781580167965,-105.96620587027806,74.03379412972194,null,1000000000,912040000,null,22.812359681489689,-21.702203327153978,null,7.5567305210207394,-82.257422795532563,null,0,0]
[30375.75,30.37575,5.478672073642362,1.3872413442399854,1.0001821143700125,1.9083329702665876E-2,1,0,409.50285417909578,1.5683543389462662,3.2495675792890095,1.2579865721914643,1.0022558022083399,6.7105436722095776E-2,1.0141455672662449,0.16721727193177083,1.0005651335535251,3.3611531806786055E-2,0.99867455618094803,6.8838589129150793E-2,2.8353247143615063,-105.97982383356792,74.02017616643208,null,1000000000,922686188.0625,null,22.807336517854523,-21.627621463222351,null,7.5081684634767987,-82.333840658802345,null,0,0]
[30551.5,30.551500000000001,5.5093177988365252,1.3882738985436043,1.0001842276503254,1.9193716241606422E-2,1,0,411.87216847347446,1.5683683866255251,3.2665932754322227,1.2596718433360987,1.0022819514578221,6.7492525102500908E-2,1.0143085715134204,0.16816668150909181,1.0005716901717356,3.380585589786942E-2,0.99865924387028093,6.9238579072825782E-2,2.7834178673508547,-105.99378615477319,74.00621384522681,null,1000000000,933394152.25,null,22.80238944947989,-21.554045942444802,null,7.4598696262967392,-82.409594715428241,null,0,0]
[30727.25,30.727250000000002,5.5399693329020909,1.3892950280960799,1.0001863531180195,1.9304102312733419E-2,1,0,414.2414828482012,1.5683822736092996,3.2836281529296012,1.2613396334040847,1.0023082508787911,6.7879593227388915E-2,1.0144724897422903,0.16911578513092734,1.000578284572891,3.4000177434869862E-2,0.99864384483637214,6.9638598436126908E-2,2.7318532741218533,-106.00808865452369,73.991911345476311,null,1000000000,944163892.5625,null,22.797516846353115,-21.481461645853003,null,7.4118313040950241,-82.484695894455058,null,0,0]
[30903,30.902999999999999,5.570626579951738,1.3903049193742383,1.0001884907730172,1.941448791335974E-2,1,0,416.61079730190505,1.5683960026392667,3.3006720696253318,1.2629902038497729,1.0023347004594263,6.8266640982376406E-2,1.0146373215098841,0.17006458123607754,1.0005849167562437,3.4194496403162515E-2,0.99862835910718883,7.0038647388625044E-2,2.6806266735977595,-106.02272720787992,73.977272792120075,null,1000000000,954995409,null,22.792717120512705,-21.409853743748936,null,7.3640508312561774,-82.559154890087541,null,0,0]
[31083,31.082999999999998,5.6020310067799324,1.3913277733725724,1.0001906927538089,1.952754237654698E-2,1,0,419.03740678018914,1.5684099027358742,3.3181373677953747,1.2646631071982521,1.0023619452837602,6.8663027121686038E-2,1.0148070857295071,0.1710360008123967,1.0005917484825009,3.4393511729758311E-2,0.99861240906497617,7.0448401203956346E-2,2.6285072904323625,-106.03806384001687,73.961936159983125,null,1000000000,966152889,null,22.787875252979038,-21.337511111975459,null,7.3153794607853309,-82.634759727998684,null,0,0]
[31263,31.263000000000002,5.6334412292730303,1.3923392222217923,1.0001929075182934,1.9640596340497751E-2,1,0,421.46401633850434,1.5684236427708611,3.3356118548633757,1.2663184872436803,1.0023893475926036,6.9059391651261556E-2,1.0149778072570474,0.17200709451496585,1.0005986198387538,3.4592524330862157E-2,0.9985963681437523,7.0858186416905097E-2,2.5767336512940813,-106.05374439021658,73.946255609783421,null,1000000000,977375169,null,22.783106588065042,-21.266162082509208,null,7.2669730260364149,-82.709712926555227,null,0,0]
[31443,31.443000000000001,5.6648571510244752,1.393339453585573,1.0001951350663854,1.9753649802325461E-2,1,0,423.8906259754761,1.5684372254930945,3.3530953871669071,1.2679566089492618,1.0024169073730407,6.9455734448338705E-2,1.0151494856095229,0.17297786067713189,1.0006055308241857,3.4791534190766187E-2,0.99858023637409321,7.1268003209661465E-2,2.5253014322709473,-106.06976460194976,73.930235398050243,null,1000000000,988662249,null,22.778409548761299,-21.195791624541407,null,7.2188287882771531,-82.784025248697859,null,0,0]
[31623,31.623000000000001,5.6962786777372028,1.3943286510777779,1.0001973753979996,1.9866702759143578E-2,1,0,426.31723568976139,1.5684506535888554,3.370587823950701,1.2695777321526287,1.0024446246120844,6.9852055390193998E-2,1.0153221203015717,0.17394829763583525,1.0006124814379758,3.4990541293763812E-2,0.99856401378675352,7.1677851764421638E-2,2.4742063908992957,-106.08612027674056,73.913879723259441,null,1000000000,1000014129,null,22.773782598939576,-21.126384997353401,null,7.1709440493802905,-82.857707225330458,null,0,0]
[31807,31.806999999999999,5.7284041577396598,1.3953286134029315,1.0001996787274674,1.998226747891757E-2,1,0,428.79777014290698,1.5684642230012629,3.3884780414562146,1.2712175763101659,1.0024731205222788,7.0257160747223699E-2,1.0154995792659423,0.17493995787423078,1.0006196274680781,3.5193967910991157E-2,0.99854733686232289,7.2096841083138519E-2,2.4223200700891425,-106.10318182759042,73.896818172409581,null,1000000000,1011685249,null,22.769123713135045,-21.056417145264753,null,7.1222606504038772,-82.932385795239057,null,0,0]
[31991,31.991,5.7605353018235625,1.3963174215174219,1.000201995414745,2.0097831664888443E-2,1,0,431.27830467409854,1.5684776363223711,3.4063772751548931,1.2728401912621574,1.0025017809393197,7.0662243007700298E-2,1.0156780365129385,0.17593127061267264,1.0006268149056183,3.5397391614236155E-2,0.99853056510458271,7.2515863976206421E-2,2.3707773662360796,-106.12058522818107,73.879414771818929,null,1000000000,1023424081,null,22.764534945920119,-20.987426187231669,null,7.0738428369027098,-83.006427230205404,null,0,0]
[32175,32.174999999999997,5.7926720157353024,1.3972952591161156,1.000204325459739,2.0213395313973179E-2,1,0,433.75883928199687,1.5684908962300905,3.4242853836599121,1.2744458387092434,1.0025306058490984,7.1067302040669161E-2,1.0158574915164515,0.17692223408648602,1.0006340437497041,3.5600812386725952E-2,0.99851369854696437,7.2934920638259571E-2,2.3195739987807915,-106.13832617848188,73.861673821518124,null,1000000000,1035230625,null,22.760014780963434,-20.919397274841764,null,7.0256878535382663,-83.079842066498458,null,0,0]
[32359,32.359000000000002,5.8248142072851774,1.3982623059242314,1.0002066688623568,2.0328958423088853E-2,1,0,436.23937396529368,1.5685040053414239,3.4422022284573361,1.276034775257417,1.0025595952374267,7.1472337715221143E-2,1.0160379437478027,0.17791284653498329,1.0006413139994379,3.5804230211689131E-2,0.99849673722309484,7.3354011263938868E-2,2.2687057676467983,-106.15640043943334,73.843599560566659,null,1000000000,1047104881,null,22.755561741352128,-20.852315848097309,null,6.9777929860770724,-83.152640612943443,null,0,0]
[32547.5,32.547499999999999,5.8577480709970642,1.3992419972857388,1.0002090834279929,2.044734724073273E-2,1,0,438.78057397584729,1.5685172813562756,3.4605661744924028,1.2776455057668268,1.002589464152043,7.1887254794442856E-2,1.0162238427668346,0.17892732007430232,1.0006488049902371,3.6012619855041249E-2,0.99847926284852895,7.3783386811839269E-2,2.216936699108186,-106.17525800347038,73.824741996529625,null,1000000000,1059339756.25,null,22.751067899946456,-20.784561445004812,null,6.9289937175946488,-83.226591020396015,null,0,0]
[32736,32.735999999999997,5.890687494078076,1.400210733133074,1.000211512012404,2.0565735485123048E-2,1,0,441.32177406284643,1.5685304044803723,3.4789390040039283,1.2792392273273909,1.0026195056583329,7.2302147080751444E-2,1.0164107872561072,0.17994142148061384,1.0006563394348034,3.6221006369301943E-2,0.9984616890878012,7.4212798418517675E-2,2.1655106864734064,-106.19445656740223,73.805543432597773,null,1000000000,1071645696,null,22.746641491015403,-20.717771402371945,null,6.8804618056786202,-83.299915821984214,null,0,0]
[32924.5,32.924500000000002,5.9236323837865994,1.4011686944233344,1.0002139546154876,2.0684123152945391E-2,1,0,443.86297422497819,1.5685433773396957,3.4973205769865081,1.2808161999708267,1.0026497197407831,7.2717014433546459E-2,1.0165987766388591,0.18095514887398539,1.0006639173321548,3.6429389736443767E-2,0.99844401597770593,7.4642246293269765E-2,2.1144234638949135,-106.213991768195,73.786008231804999,null,1000000000,1084022700.25,null,22.742281047547745,-20.651930963880623,null,6.8321944612260062,-83.372625397967681,null,0,0]
[33113,33.113,5.9565826494175518,1.4021160581896892,1.0002164112371414,2.0802510240885429E-2,1,0,446.40417446095944,1.5685562025004329,3.5157107562968233,1.2823766786252075,1.002680106383792,7.3131856712278634E-2,1.0167878103355332,0.18196850037894594,1.0006715386813045,3.6637769938440902E-2,0.99842624355525289,7.5071730645398779E-2,2.0636708457424908,-106.23385930698544,73.766140693014563,null,1000000000,1096470769,null,22.737985140852555,-20.587025662206948,null,6.7841889370749779,-83.444729903781891,null,0,0]
[33305.75,33.305750000000003,5.9902812922223125,1.4030740034349432,1.0002189377429449,2.0923565930631969E-2,1,0,449.00266973753281,1.5685691667040846,3.5345243279169201,1.2839555448581852,1.0027113565607975,7.3556026124078688E-2,1.0169821853560919,0.18300430868601519,1.0006793767959179,3.685084507603243E-2,0.99840796777079255,7.5510936270096168E-2,2.0121156646469478,-106.2545140373055,73.745485962694502,null,1000000000,1109272983.0625,null,22.733657663063727,-20.521609201815533,null,6.735368982756329,-83.517844771948162,null,0,0]
[33498.5,33.4985,6.0239853705585533,1.4040212301721529,1.0002214789063626,2.1044621007044156E-2,1,0,451.60116508870192,1.5685819817167019,3.5533466171514156,1.2855176882535542,1.0027427871340553,7.3980169021343925E-2,1.0171776510779744,0.18403972001186553,1.000687260341677,3.7063916866029632E-2,0.99838958822417234,7.5950180478235554E-2,1.9609017429260294,-106.27550737146254,73.724492628537462,null,1000000000,1122149502.25,null,22.72939476124305,-20.457140822254122,null,6.6868171092206108,-83.590347760649991,null,0,0]
[33691.25,33.691249999999997,6.0576947936988983,1.4049579156239389,1.0002240347272828,2.1165675466578715E-2,1,0,454.19966051318642,1.5685946500988655,3.5721774861974223,1.2870633655914994,1.0027743980866033,7.440428525397047E-2,1.0173742068725196,0.18507473236587219,1.000695189317508,3.7276985289165107E-2,0.9983711049556625,7.6389463493623286E-2,1.9100248529250252,-106.29683491620725,73.703165083792754,null,1000000000,1135100326.5625,null,22.725195024633194,-20.393605949211967,null,6.6385305101660643,-83.662249037021709,null,0,0]
[33884,33.884,6.0914094729100636,1.4058842331642889,1.0002266052055933,2.1286729305692476E-2,1,0,456.79815600973518,1.5686071743528922,3.5910168000803808,1.2885928285821016,1.0028061894013831,7.4828374671911738E-2,1.0175718521080463,0.18610934376236329,1.0007031637223311,3.7490050326173294E-2,0.99835251800576963,7.6828785540074065E-2,1.8594808463389425,-106.31849234494146,73.681507655058539,null,1000000000,1148125456,null,22.721057079431979,-20.330990295538932,null,6.5905064217328881,-83.733558547687792,null,0,0]
[34081.5,34.081499999999998,6.1259603549640556,1.4068228013070549,1.000229254232557,2.1410765666096395E-2,1,0,459.46068713673895,1.5686198603038606,3.6103289985216986,1.2901434220132311,1.0028389512258631,7.5262887090353586E-2,1.0177754973576114,0.18716903344693517,1.0007113817638997,3.7708362460677276E-2,0.9983333655088793,7.7278974660227054E-2,1.8080323003037857,-106.34102120741504,73.658978792584961,null,1000000000,1161548642.25,null,22.716879856783336,-20.267770415294596,null,6.5415683077177791,-83.806021717746688,null,0,0]
[34279,34.279000000000003,6.1605165729050073,1.4077508408292982,1.0002319186479849,2.1534801367593066E-2,1,0,462.12321833683319,1.5686324000741636,3.629649785037449,1.2916775113452068,1.0028719023749906,7.5697371037457481E-2,1.0179802850522404,0.18822829796380378,1.0007196474987761,3.792667099916066E-2,0.99831410424439671,7.7729205234637333E-2,1.7569246756971246,-106.36388742686995,73.636112573130049,null,1000000000,1175049841,null,22.712764702394693,-20.205486143454841,null,6.4929000601021789,-83.877884055191444,null,0,0]
[34476.5,34.476500000000001,6.1950780374419985,1.4086685263319882,1.000234598451754,2.1658836406371229E-2,1,0,464.78574960876188,1.5686447961759906,3.6489790232100083,1.2931953515740897,1.0029050428301043,7.6131826351997306E-2,1.0181862145025937,0.18928713519315413,1.0007279609257789,3.8144975920904219E-2,0.99829473425666926,7.8179477504104658E-2,1.7061537565075948,-106.38708656070597,73.612913439294033,null,1000000000,1188629052.25,null,22.708710251761708,-20.144123004521816,null,6.4444988389818256,-83.949155577935883,null,0,0]
[34674,34.673999999999999,6.2296446612522125,1.4095760286114822,1.0002372936437405,2.1782870778619748E-2,1,0,467.44828095129748,1.568657051064295,3.66831657943797,1.2946971926221078,1.0029383725724381,7.6566252872811463E-2,1.018393285016048,0.19034554302071327,1.0007363220437191,3.8363277205190838E-2,0.99827525559030461,7.8629791709438027E-2,1.655715405853788,-106.41061423576932,73.589385764230684,null,1000000000,1202286276,null,22.704715176292169,-20.083666810431247,null,6.3963618477215221,-84.019846085906153,null,0,0]
[34875.75,34.875749999999996,6.2649603619969314,1.4104927188844503,1.0002400627218886,2.1909573552792952E-2,1,0,470.16810734374513,1.5686694263558156,3.6880787127049439,1.2962150871751339,1.0029726149584013,7.7009997915091083E-2,1.0186059889126455,0.19142628115841581,1.0007449123245782,3.8586272334798076E-2,0.99825524559764445,7.9089839770088474E-2,1.6045308319851446,-106.43498294850717,73.565017051492831,null,1000000000,1216317938.0625,null,22.700694091047495,-20.022831628804298,null,6.3474589532230876,-84.091467847785495,null,0,0]
[35077.5,35.077500000000001,6.3002812682968923,1.4113991315355681,1.0002428478573944,2.2036275623402733E-2,1,0,472.88793380736973,1.5686816592937571,3.7078492527297078,1.297716798094275,1.0030070548258565,7.745371257133174E-2,1.0188198820382861,0.19250656677270486,1.0007535523684512,3.8809263625019928E-2,0.99823512229364286,7.9549932098865003E-2,1.5536848113322932,-106.45968548660312,73.540314513396879,null,1000000000,1230431006.25,null,22.696732271095058,-19.962913803846114,null,6.2988260179599509,-84.162503321996709,null,0,0]
[35279.25,35.279249999999998,6.3356072930894411,1.4122954369804803,1.0002456490501239,2.216297698638698E-2,1,0,475.60776034095016,1.5686937523203197,3.7276280657493412,1.299202576163303,1.0030416921544612,7.7897396669952962E-2,1.0190349636441198,0.19358639762790517,1.0007622421740496,3.9032251053779596E-2,0.99821488572669237,8.0010068952489743E-2,1.5031731774508963,-106.48471740631531,73.515282593684688,null,1000000000,1244625480.5625,null,22.692828409199784,-19.903899096801915,null,6.2504601953095715,-84.232962287578871,null,0,0]
[35481,35.481000000000002,{"$f":"SQRT(1+(A397/pole1)^2)","v":6.3709383512304489},{"$f":"ATAN(A397/pole1)","v":1.4131818019203457},{"$f":"SQRT(1+(A397/Zero1)^2)","v":1.0002484662999422},{"$f":"ATAN(A397/Zero1)","v":2.228967763768373E-2},{"$f":"IF(VIN_nom>Vout, 1, SQRT(1+(A397/z_RHP)^2))","v":1},{"$f":"IF(VIN_nom>Vout, 0, -ATAN(A397/z_RHP))","v":0},{"$f":"SQRT(1+(A397/Pole2)^2)","v":478.32758694329311},{"$f":"ATAN(A397/Pole2)","v":1.5687057078221571},3.7474150207695334,1.3006726671539885,{"$f":"SQRT(1+(A397/pole4)^2)","v":1.00307652692376},{"$f":"ATAN(A397/pole4)","v":7.8341050039446011E-2},{"$f":"SQRT(1+(A397/Zero3)^2)","v":1.0192512329777701},{"$f":"ATAN(A397/Zero3)","v":0.19466577149446546},{"$f":"SQRT(1+(A397/pole5)^2)","v":1.0007709817400772},{"$f":"ATAN(A397/pole5)","v":3.925523459900257E-2},{"$f":"SQRT((1-(Z397/pterm2))^2+(A397/pterm1)^2)","v":0.9981945359454697},{"$f":"IF((ATAN((A397/pterm1)/(1-A397^2/pterm2))>0),ATAN((A397/pterm1)/(1-A397^2/pterm2)),PI()+ATAN((A397/pterm1)/(1-A397^2/pterm2)))","v":8.047025058769515E-2},{"$f":"20*LOG10(((E397*K397*G397*O397)/(C397*I397*S397*M397*Q397))*Adc)","v":1.4529918418477592},{"$f":"((F397+L397+H397+R397)-(D397+J397+T397+N397+T397))*radconv","v":-106.5100743350668},{"$f":"IF(V397>0,V397,V397+180)","v":73.489925664933196},null,{"$f":"IF(U397<0,A397,1000000000)","v":1000000000},{"$f":"A397^2","v":1258901361},null,{"$f":"20*LOG10((K397/(I397*M397))*AEA)","v":22.68898123258548},{"$f":"(L397-(J397+N397))*radconv","v":-19.845773552904959},null,{"$f":"20*LOG10((E397*G397/(C397*S397))*Acs*Am)","v":6.2023586821964027},{"$f":"(F397+H397-(D397+T397))*radconv","v":-84.302854310747207},null,{"$f":"SUM((U398<0)*(U397>0))*A397","v":0},0]
[35687.75,{"$f":"A398/1000","v":35.687750000000001},6.4071501591016666,1.4140799912539721,1.000251370028874,2.2419517587293072E-2,1,0,481.11481947950682,1.5687178193793188,3.7677006718046346,1.302163168510416,1.0031124298278971,7.8795666475573067E-2,1.0194740936015037,0.19577141919955862,1.0007799895242351,3.9483740326120509E-2,0.99817356442608551,8.094188370086644E-2,1.4019053365004341,-106.536392379075,73.463607620925004,null,1000000000,1273615500.0625,null,22.685096224520155,-19.787115659952175,null,6.1533363913023722,-84.373900074587382,null,0,0]
[35894.5,35.894500000000001,6.4433670778020078,1.4149680842007142,1.000254290620358,2.2549356780865192E-2,1,0,483.90205208548213,1.5687297914135068,3.7879946034811764,1.303637702587721,1.0031485400365381,7.9250250276107673E-2,1.0196981999426804,0.19687658226301932,1.0007890495630454,3.971224192789246E-2,0.99815247411570063,8.1413564388726295E-2,1.3511572530201401,-106.56304266781197,73.43695733218803,null,1000000000,1288415130.25,null,22.681268146191911,-19.72936276074519,null,6.104585849281591,-84.444370127216686,null,0,0]
[36101.25,36.10125,6.4795890216322967,1.4158462486690759,1.0002572280742463,2.2679195214029019E-2,1,0,486.68928476002048,1.5687416263218303,3.8082966834196865,1.3050965182874423,1.0031848575272968,7.9704801256707952E-2,1.0199235511801412,0.19798125830554986,1.0007981618550885,3.9940739380569273E-2,0.99813126506762984,8.1885292927605852E-2,1.3007434337032306,-106.5900207207772,73.409979279222796,null,1000000000,1303300251.5625,null,22.677495733559056,-19.672500721058555,null,6.0561041762539514,-84.514274105166834,null,0,0]
[36308,36.308,6.5158159067872283,1.4167146488954179,1.0002601823903905,2.2809032882413632E-2,1,0,489.47651750195075,1.568753326446799,3.8286067819959912,1.3065398595003979,1.0032213822776619,8.0159319233112966E-2,1.0201501464888931,0.19908544495470357,1.0008073263989372,4.0169232660404425E-2,0.99810993733550191,8.2357069593847601E-2,1.2506597986213541,-106.61732213104254,73.382677868957458,null,1000000000,1318270864,null,22.673777756053664,-19.616515690636252,null,6.0078885367000243,-84.583621434571825,null,0,0]
[36519.5,36.519500000000001,6.5528801178600649,1.4175930644568531,1.0002632220284429,2.2941852724310929E-2,1,0,492.32778588932007,1.5687651583005133,3.8493916618601078,1.3080005982260112,1.0032589606030775,8.0624245239078671E-2,1.0203832341443253,0.20021449100380259,1.0008167555593754,4.0402971141045324E-2,0.9980879968578954,8.2839735230359632E-2,1.199762987460099,-106.6455808476135,73.354419152386498,null,1000000000,1333673880.25,null,22.670029435857302,-19.560137739832225,null,5.9588375226244539,-84.653995626492915,null,0,0]
[36731,36.731000000000002,6.5899493283472408,1.4184615983083777,1.000266279312142,2.3074671756631613E-2,1,0,495.17905434481798,1.5687768538972895,3.8701846671596307,1.3094456440390856,1.0032967557728565,8.1089136317092705E-2,1.0206176219330789,0.20134301991355769,1.0008262393970815,4.0636705204640224E-2,0.9980659322946841,8.3322451816104731E-2,1.1492033103126689,-106.67416885121314,73.325831148786861,null,1000000000,1349166361,null,22.666335578451637,-19.504649118514262,null,5.9100590420735211,-84.723806603702457,null,0,0]
[36942.5,36.942500000000003,6.6270234543539264,1.419320414974808,1.0002693542413255,2.3207489974697033E-2,1,0,498.03032286727438,1.5687884155773741,3.8909856676302264,1.3108752425361867,1.0033347677624935,8.1553992270165659E-2,1.0208533089596223,0.20247102916663023,1.0008357779105006,4.0870434825776528E-2,0.99804374370429794,8.3805219646950563E-2,1.0989766398496785,-106.70308165519995,73.296918344800048,null,1000000000,1364748306.25,null,22.662694968534431,-19.450035877835255,null,5.8615501980270945,-84.793063809998102,null,0,0]
[37154,37.154000000000003,6.6641024138411984,1.4201696753773736,1.0002724468158313,2.3340307373828716E-2,1,0,500.88159145554584,1.5687998456277266,3.9117945357287276,1.3122896343436452,1.0033729965473461,8.2018812901398605E-2,1.0210902943242894,0.20359851625328923,1.00084537109807,4.1104159979044534E-2,0.99802143114551056,8.4288039018777516E-2,1.0490789257905404,-106.73231484818898,73.267685151811023,null,1000000000,1380419716,null,22.659106423074221,-19.396284350673657,null,5.8133081383063843,-84.861776482707896,null,0,0]
[37370.25,37.370249999999999,6.7020190298794162,1.421028292355371,1.000275627089356,2.3476106818029443E-2,1,0,503.79689569365371,1.5688113986121215,3.9330787470470217,1.3137203142222107,1.0034123080257518,8.2494036040987762E-2,1.0213339435177227,0.20475078265879584,1.0008552362636389,4.1343129632806647E-2,0.99799848936292501,8.4781755450189192E-2,0.99839655833352625,-106.76253132386404,73.237468676135961,null,1000000000,1396535585.0625,null,22.655489915735231,-19.342202649207795,null,5.7642555420715329,-84.931478744628308,null,0,0]
[37586.5,37.586500000000001,6.739940531207405,1.4218772481337507,1.0002788258093354,2.3611905396207861E-2,1,0,506.71219999823029,1.5688228186592603,{"$f":"SQRT(1+(A407/Zero2)^2)","v":3.9543709220961913},{"$f":"ATAN(A407/Zero2)","v":1.3151355900778936},1.00345184609403,8.2969221838344612E-2,1.0215789481065936,0.20590249789829876,1.0008651585834141,4.1582094562047603E-2,0.99797541810645674,8.5275526389285691E-2,0.94804976381361927,-106.79307364921419,73.206926350785807,null,1000000000,1412744982.25,null,22.651925435332988,-19.288993776945603,null,5.7154759571757277,-85.000630633264663,null,0,0]
[37802.75,37.802750000000003,6.7778668358270115,1.4227167036593358,1.0002820429755923,2.3747703103363712E-2,1,0,509.62750436813502,1.5688341080505273,3.9756709329241366,1.3165357037803374,1.0034916107253982,8.3444370083300412E-2,1.0218253071159464,0.20705365931398234,1.0008751380556959,4.1821054739616503E-2,0.99795221744004492,8.5769352152375203E-2,0.89803445053926179,-106.82393734446359,73.176062655536413,null,1000000000,1429047907.5625,null,22.648411815509917,-19.236643994449196,null,5.6669664745967179,-85.06924138860029,null,0,0]
[38019,38.018999999999998,6.8157978635549163,1.4235468163504095,1.0002852785879488,2.3883499934496927E-2,1,0,512.54280880225303,1.5688452690154013,3.9969786542596069,1.317920892282235,1.0035316018929232,8.3919480565787519E-2,1.022073019566379,0.2082042642564578,1.0008851746787746,4.206001013836571E-2,0.99792888742800512,8.6263233055780153E-2,0.84834660299928721,-106.85511800641976,73.144881993580242,null,1000000000,1445444361,null,22.644947920945349,-19.185139841033077,null,5.6187242305233607,-85.137320048448885,null,0,0]
[38240.5,38.240499999999997,6.8546545747179639,1.4243875571568165,1.000288611875829,2.4022592653903271E-2,1,0,515.5288894788165,1.5688565700760819,4.0188115382683378,1.3193244791174752,1.0035727987684793,8.4406086154218643E-2,1.0223281479439528,0.20938222329872394,1.0008955142125913,4.2304761783825737E-2,0.99790485699620135,8.6769161626575067E-2,0.79778782968825768,-106.88737973566096,73.112620264339043,null,1000000000,1462335840.25,null,22.641450327626671,-19.133248188719996,null,5.5695848901403844,-85.206509094458141,null,0,{"$f":"IF(AH410>0,W410,0)","v":0}]
[38462,38.462000000000003,6.8935160764363665,1.4252188193622628,1.0002919645159483,2.4161684443617132E-2,1,0,518.51497022046181,1.5688677409731946,4.0406522539928007,1.320712895201712,1.0036142332554778,8.4892651678564746E-2,1.0225846941822947,0.21055959292084472,1.0009059137021794,4.254950835796973E-2,0.99788069099996968,8.7275148719356169E-2,0.74756432413370666,-106.91996489770833,73.080035102291674,null,1000000000,1479325444,null,22.638002587764305,-19.082216003086362,null,5.5207199809768799,-85.275158462966317,null,0,0]
[38683.5,38.683500000000002,6.9323822881455373,1.426040761232731,1.0002953365081122,2.4300775298266009E-2,1,0,521.50105102607108,1.5688787839426603,4.0625006751189661,1.3220863799066058,1.0036559053244902,8.5379176913417218E-2,1.0228426572145346,0.21173637030342513,1.0009163731456703,4.2794249831635156E-2,0.99785638950965339,8.7781194674094468E-2,0.69767200765637849,-106.9528690016792,73.047130998320796,null,1000000000,1496413172.25,null,22.634603576327379,-19.032029684340166,null,5.4721265672039978,-85.343277241733006,null,0,0]
[38905,38.905000000000001,6.9712531310678898,1.4268535375553364,1.0002987278521249,2.4439865212477603E-2,1,0,524.48713189455179,1.5688897011694818,4.0843566779914795,1.3234451677082237,1.0036978149459241,8.5865661633481097E-2,1.0231020359689891,0.21291255263646691,1.0009268925411841,4.3038986175663124E-2,0.99783195259601043,8.828729983077678E-2,0.64810687743764772,-106.98608763495417,73.013912365045826,null,1000000000,1513599025,null,22.631252198335154,-18.982675910275336,null,5.4238017588760385,-85.410874319194249,null,0,0]
[39131.5,39.131500000000003,7.0110061286033547,1.427675340470661,1.0003022157620072,2.458209387575503E-2,1,0,527.54061871561544,1.5689007370272088,4.1067137586339353,1.3248196689331579,1.0037409162339512,8.6363085818377011E-2,1.0233687326720586,0.2141146670933764,1.0009377113901423,4.3289241707118849E-2,0.99780682408992272,8.8804891058950508E-2,0.59775715067631052,-107.02037686689292,72.979623133107083,null,1000000000,1531274292.25,null,22.627873316552986,-18.933055405587677,null,5.374660902039726,-85.479466848668025,null,0,0]
[39358,39.357999999999997,7.0507638076978907,1.4284878760041675,1.0003057239068542,2.4724321544297056E-2,1,0,530.59410560018898,1.5689116458656338,4.1290785138728845,1.3261792829971726,1.0037842658570519,8.6860467162615806E-2,1.0236369074521245,0.21531615342028468,1.0009485929243009,4.3539491813080138E-2,0.99778155412855807,8.9322544911103113E-2,0.54774131744732102,-107.05498590022904,72.945014099770958,null,1000000000,1549052164,null,22.624542019319907,-18.884278140131844,null,5.3257949450725208,-85.547532041359716,null,0,0]
[39584.5,39.584499999999998,7.0905260896008153,1.429291298982823,1.0003092522864532,2.4866548212360003E-2,1,0,533.64759254718194,1.5689224298651356,4.1514508196742437,1.3275242455148026,1.0038278637830536,8.7357805425671078E-2,1.0239065591478027,0.21651700864324913,1.0009595371416158,4.3789736462380567E-2,0.997756142788922,8.9840261750820272E-2,0.49805533178318384,-107.08991026109983,72.910089738900169,null,1000000000,1566932640.25,null,22.621257227242147,-18.836330725334726,null,5.2772009407647626,-85.61507878936213,null,0,0]
[39811,39.811,7.1302928973090527,1.4300857608272719,1.0003128009005902,2.5008773874200457E-2,1,0,536.70107955552919,1.5689330911564734,4.1738305546218522,1.3288547872617955,1.0038717099796051,8.7855100367143349E-2,1.0241776865925387,0.21771722979873134,1.0009705440400305,4.4039975623857794E-2,0.99773059014847398,9.0358041941705006E-2,0.44869522275942381,-107.12514555488281,72.874854445117194,null,1000000000,1584915721,null,22.618017889815285,-18.789200047029585,null,5.2288759881378688,-85.682115789601085,null,0,0]
[40042.75,40.042749999999998,7.1709860580570703,1.4308895167070486,1.0003164527106398,2.5154295109874159E-2,1,0,539.82534281522953,1.5689438747282431,4.196736590621776,1.330201479109351,1.0039168294139604,8.8363876922511686E-2,1.0244566246807347,0.21894461128654422,1.0009818709403209,4.429600931820149E-2,0.99770429905800428,9.088788961025393E-2,0.39852423454595776,-107.16151488556582,72.838485114434178,null,1000000000,1603421827.5625,null,22.61474944927954,-18.741808890294124,null,5.179706420811824,-85.750187891907956,null,0,0]
[40274.5,40.274500000000003,7.2116837991482008,1.4316842014140472,1.0003201257036662,2.5299815279974578E-2,1,0,542.94960613698106,1.5689545341974551,4.2196501550941159,1.3315335477258703,1.0039622086923876,8.8872607615967172E-2,1.0247371052357575,0.22017132272891071,1.0009932634567409,4.4552037201380887E-2,0.99767786020595972,9.1417804371002775E-2,0.34868622694704593,-107.19820066971602,72.801799330283984,null,1000000000,1622035350.25,null,22.611526458672881,-18.695245844733993,null,5.1308125220774423,-85.817744159451593,null,0,0]
[40506.25,40.506250000000001,7.2523860434728071,1.4324699666652196,1.0003238198794357,2.5445334378350375E-2,1,0,546.0738695197191,1.5689650716941983,4.2425711260580297,1.332851225356376,1.004007847779653,8.9381292190420306E-2,1.0250191269913902,0.22139736098543264,1.0010047215870506,4.480805924002957E-2,0.99765127367678919,9.1947786613485669E-2,0.29917717852154152,-107.23519844763121,72.764801552368795,null,1000000000,1640756289.0625,null,22.608347880798235,-18.649497711004528,null,5.0821913287638107,-85.884793307644088,null,0,0]
[40738,40.738,7.2930927156341907,1.4332469608348839,1.0003275352377134,2.5590852398850495E-2,1,0,549.19813296240272,1.5689754893000911,4.2654993841155564,1.3341547394546851,1.0040537466403283,8.9889930388923664E-2,1.0253026886758565,0.22262272292725294,1.001016245328997,4.5064075400785712E-2,0.9976245395554405,9.2477836727255999E-2,0.24999314224568445,-107.27250383983936,72.727496160160641,null,1000000000,1659584644,null,22.605212706288302,-18.604551561507925,null,5.0338399243701275,-85.951343860379893,null,0,0]
[40975.25,40.975250000000003,7.334769967423604,1.4340334607041101,1.0003313607129185,2.5739822798483171E-2,1,0,552.39654295559114,1.5689860320728402,4.2889792129157476,1.3354747500119832,1.0041010038513207,9.0410591520327932E-2,1.0255945738279189,0.22387646189931196,1.001028110521244,4.5326161333861539E-2,0.99759701816873336,9.3020536952901314E-2,0.19997447621442499,-107.31100874283476,72.688991257165242,null,1000000000,1678971112.5625,null,22.602047061476288,-18.559356269379247,null,4.9846174937071765,-86.018966040850358,null,0,0]
[41212.5,41.212499999999999,7.3764517050981473,1.4348110725808132,1.0003352083874872,2.5888792055426692E-2,1,0,555.5949530094714,1.5689964534618011,4.3124664335671374,1.3367803843329675,1.0041485332363962,9.0931203503922697E-2,1.0258880701536928,0.22512948547562961,1.0010400444715148,4.55882410359972E-2,0.9975693422830354,9.356330913584486E-2,0.15028829181210115,-107.34982699647274,72.650173003527257,null,1000000000,1698470156.25,null,22.598924849401357,-18.514974904176743,null,4.9356717695167509,-86.086083165181066,null,0,0]
[41449.75,41.449750000000002,7.4181378530406707,1.4355799453545066,1.0003390782611632,2.6037760163082471E-2,1,0,558.79336312300165,1.5690067555512937,4.3359609259482284,1.3380718716234936,1.0041963347569081,9.1451766064496648E-2,1.0261831762707538,0.22638179033706218,1.0010520471773499,4.5850314471413897E-2,0.99754151199111252,9.4106153694101718E-2,0.10093058484031162,-107.38895415294908,72.611045847050917,null,1000000000,1718081775.0625,null,22.595845072089379,-18.471394437026518,null,4.8869997685374935,-86.152703788441386,null,0,0]
[41687,41.686999999999998,7.4598283373163303,1.4363402246281893,1.0003429703336888,2.6186727114852239E-2,1,0,561.99177329516317,1.5690169403781891,4.3594625724902194,1.3393494363379419,1.0042444083739963,9.19722789269979E-2,1.0264798907906898,0.22763337317728952,1.0010641186362763,4.611238160433799E-2,0.99751352738627841,9.4649071045708369E-2,5.1897425061368199E-2,-107.42838584568848,72.571614154311519,null,1000000000,1737805969,null,22.592806758422679,-18.42860210858467,null,4.8385985547003276,-86.218836277398395,null,0,0]
[41929.75,41.929749999999999,7.5024897156736445,1.4371093828035528,1.0003469756098713,2.6339146259491502E-2,1,0,565.2643300220069,1.5690272420172113,4.3835163260230239,1.3406424367407208,1.0042938780386301,9.250480674702817E-2,1.0267851471451539,0.2289132198253141,1.001076541099104,4.6380517494758605E-2,0.99748473441155727,9.5204650248927561E-2,2.0594603044084545E-3,-107.46904239246985,72.530957607530155,null,1000000000,1758103935.0625,null,22.589739940646044,-18.385620479546692,null,4.7893525517001416,-86.28600516452633,null,41929.75,72.530957607530155]
[42172.5,42.172499999999999,7.5451554823427305,1.4378698426712335,1.0003510041255239,2.6491564180056736E-2,1,0,568.5368868081481,1.5690374250616479,4.4075773281411994,1.3419213222618065,1.0043436324787227,9.3037281955980433E-2,1.0270920843799989,0.23019230362611931,1.0010890355343982,4.6648646711332453E-2,0.99745578008574376,9.5760306545151996E-2,-4.7446830551940787E-2,-107.51000876344506,72.489991236554943,null,42172.5,1778519756.25,null,22.586714556795751,-18.343437764297008,null,4.7403839646456332,-86.352680162572682,null,0,0]
[42415.25,42.41525,7.5878255632981562,1.4386217500887883,1.0003550558803656,2.6643980869481051E-2,1,0,571.80944365256858,1.5690474915477033,4.4316454607791949,1.3431863186558988,1.0043936716519535,9.3569704259750558E-2,1.0274007009887294,0.23147062107998889,1.0011016019394638,4.6916769215756771E-2,0.99742666451057771,9.6316040382240287E-2,-9.6625428741317965E-2,-107.55128053458027,72.448719465419728,null,42415.25,1799053432.5625,null,22.583729648472371,-18.302041127859113,null,4.6916897956759867,-86.418869654625198,null,0,0]
[42658,42.658000000000001,7.6304998861629034,1.4393652476900629,1.0003591308741142,2.6796396320697923E-2,1,0,575.08200055427324,1.5690574434652342,4.4557206083878222,1.3444376469784882,1.0044439955157682,9.4102073364412842E-2,1.027710995458422,0.23274816870141726,1.0011142403115909,4.7184884969734553E-2,0.9973973877884007,9.6871852208074705E-2,-0.14548024214373756,-107.5928533637386,72.407146636261402,null,42658,1819704964,null,22.580784283128146,-18.261418001856033,null,4.6432670945259709,-86.484581839067872,null,0,0]
[42906.5,42.906500000000001,7.674189352267617,1.4401177910961951,1.0003633264627336,2.6952420734695455E-2,1,0,578.4320743101166,1.5690675144718165,4.4803731702329781,1.3457046838485125,1.0044958062378975,9.4646997242956984E-2,1.0280303762091221,0.23405517646733204,1.0011272525892587,4.7459344528153563E-2,0.99736725078047028,9.7440910753755813E-2,-0.19516090047384357,-107.63571831544783,72.364281684552168,null,42906.5,1840967742.25,null,22.577809162906995,-18.220621001238637,null,4.5939755669292603,-86.55136451275628,null,0,0]
[43155,43.155000000000001,7.7178831152255043,1.4408618140720408,1.000367546403611,2.7108443836147338E-2,1,0,581.78214812395208,1.5690774694947258,4.505032846063501,1.3469578516839924,1.0045479152062342,9.5191864749549562E-2,1.0283515120199682,0.23536137015305478,1.0011403402779258,4.7733796931346557E-2,0.99733694511993032,9.8010051976463342E-2,-0.24451031305901746,-107.67888980361481,72.321110196385192,null,43155,1862354025,null,22.574873582977936,-18.180608762517611,null,4.5449624119337981,-86.617663813997083,null,0,0]
[43403.5,43.403500000000001,7.7615811024692576,1.4415974596978354,1.0003717906964378,2.7264465617474028E-2,1,0,585.13222199478321,1.5690873105260943,4.5296995196938212,1.3481973730896928,1.0046003223743682,9.5736675569466828E-2,1.0286744012472546,0.23666674606600585,1.0011535033746346,4.8008242138249183E-2,0.99730647091853131,9.857927635674367E-2,-0.29353244485640717,-107.72236342578152,72.277636574218477,null,43403.5,1883863812.25,null,22.571976621838044,-18.141368627487811,null,4.4962246132759631,-86.683487968651463,null,0,0]
[43652,43.652000000000001,7.8052832430497068,1.4423248678860983,1.0003760593409043,2.7420486071096362E-2,1,0,588.48229592163682,1.5690970395126906,4.5543730774228184,1.3494234660162794,1.0046530276956331,9.6281429388185055E-2,1.0289990422403699,0.23797130052937576,1.0011667418764107,4.828268010780358E-2,0.99727582828868533,9.914858437516931E-2,-0.34223118792227958,-107.76613486206872,72.233865137931275,null,43652,1905497104,null,22.569117382908836,-18.102888202016686,null,4.447759202768033,-86.748845021085344,null,0,0]
[43906,43.905999999999999,7.8499568542519249,1.4430600051541287,1.0003804476281462,2.7579958313714063E-2,1,0,591.90651641081968,1.5691068700175417,4.579599728483827,1.3506630403799029,1.0047072076088142,9.683818089768402E-2,1.029332677073129,0.23930387569806869,1.0011803513070665,4.8563184635034819E-2,0.99724433350807395,9.9730579707958719E-2,-0.3916775436525039,-107.81117844421732,72.188821555782681,null,43906,1927736836,null,22.566232936676371,-18.064328580714651,null,4.3984995743065438,-86.815174073795717,null,0,0]
[44160,44.16,7.8946346597675285,1.4437868221425205,1.0003848613562356,2.773942915319464E-2,1,0,595.33073695654548,1.56911658743629,4.6048333391988789,1.351889031346738,1.004761698919699,9.739487219103983E-2,1.0296681385637474,0.24063558493565251,1.0011940395112402,4.8843681514287689E-2,0.9972126630005288,0.1003126634375146,-0.44079403435265757,-107.85652429939272,72.143475700607283,null,44160,1950105600,null,22.563386083061854,-18.026537301233667,null,4.3495184035748871,-86.881031554753363,null,0,0]
[44414,44.414000000000001,7.9393165887871282,1.4445054585547057,1.0003893005248361,2.789889858144573E-2,1,0,598.75495755784436,1.5691261937091188,4.6300737957789506,1.3531016573470971,1.0048165015776267,9.7951502933034243E-2,1.0300054249274579,0.24196642436707844,1.0012078064857006,4.9124170701738648E-2,0.99718081688823978,0.10089483607711539,-0.48958459160612749,-107.90216807062667,72.097831929373328,null,44414,1972603396,null,22.560575940277413,-17.989501940396398,null,4.3008126702366152,-86.946425498247692,null,0,0]
[44668,44.667999999999999,7.9840025720799908,1.4452160510007024,1.0003937651336092,2.8058366590375403E-2,1,0,602.17917821376841,1.5691356907320804,4.6553209868722609,1.3543011322319991,1.004871615531657,9.8508072788671977E-2,1.0303445343721274,0.24329639013468229,1.0012216522271988,4.9404652153571371E-2,0.99714879529412148,0.10147709814006828,-0.53805307497439503,-107.9481054835725,72.051894516427495,null,44668,1995230224,null,22.557801650413253,-17.953210334883991,null,4.252379402203986,-87.011363761330145,null,0,0]
[44928.25,44.928249999999998,8.0297922464089879,1.4459359248878503,1.0003983659863824,2.8221757036248726E-2,1,0,605.68765632341092,1.5691453100639636,4.681196289076941,1.3555167001916302,1.0049284084626804,9.9078274266564084E-2,1.0306938770852694,0.24465817124744579,1.0012359203558692,4.9692027146642087E-2,0.99711580388448195,0.10207378080535845,-0.58738409149636173,-107.99547343027534,72.004526569724661,null,44928.25,2018547648.0625,null,22.554995409810168,-17.916784706318165,null,4.203033916756608,-87.077435312389326,null,0,0]
[45188.5,45.188499999999998,8.0755860347339468,1.4466476348406201,1.0004029935459822,2.8385145974895026E-2,1,0,609.19613448845303,1.5691548185966686,4.7070784321903973,1.3567189021698811,1.0049855280888114,9.9648411113559848E-2,1.0310451298691019,0.2460190270289343,1.0012502711686331,4.9979393925614339E-2,0.99708262851443041,0.10267055844001058,-0.63638496816962553,-108.0431408205918,71.956859179408198,null,45188.5,2042000532.25,null,22.552225058370674,-17.881114840672456,null,4.1539683042251729,-87.143044632165271,null,0,0]
[45448.75,45.448749999999997,8.1213838674624945,1.4473513182451834,1.0004076478120381,2.8548533397611639E-2,1,0,612.70461270794306,1.5691642182335728,4.7329673039844842,1.3579079539947432,1.0050429743543483,0.10021848297005771,1.0313982907721455,0.24737895338670926,1.0012647046619356,5.0266752443381024E-2,0.99704926931854798,0.10326743159625813,-0.68505963267777448,-108.09110331506756,71.908896684932444,null,45448.75,2065588876.5625,null,22.549489746362937,-17.846188460365699,null,4.1051795187945652,-87.208199624445044,null,0,0]
[45709,45.709000000000003,8.167185676557148,1.448047109438056,1.0004123287841773,2.8711919295696376E-2,1,0,616.21309098095116,1.5691735108347062,4.7588627946443456,1.359084066947047,1.0051007472032849,0.10078848947670703,1.0317533578349982,0.24873794624767132,1.0012792208322012,5.0554102652843221E-2,0.99701572643221492,0.10386440082636658,-0.73341194085222106,-108.13935665758279,71.860643342417205,null,45709,2089312681,null,22.546788647145377,-17.8119935458806,null,4.0566645635229426,-87.27290801828515,null,0,0]
[45975.25,45.975250000000003,8.2140474807110362,1.448750911663681,1.0004171453113258,2.8879070428802767E-2,1,0,619.80245641555314,1.5691829088042093,4.7853620369663057,1.360274120808378,1.0051601898965199,0.10137156934212056,1.0321185814159508,0.25012730010183581,1.0012941572235474,5.0848069004058624E-2,0.99698122027319258,0.10447523303361234,-0.78254935723458652,-108.18901909974841,71.810980900251593,null,45975.25,2113723612.5625,null,22.544059841193857,-17.777754961589739,null,4.0073114053755479,-87.338653968498519,null,0,0]
[46241.5,46.241500000000002,8.2609133074286536,1.4494467286068726,1.0004219897893607,2.9046219947742338E-2,1,0,623.39182190426686,1.5691921985504538,4.8118679818028385,1.3614510656116101,1.0052199742857726,0.10195458004961758,1.0324857958879397,0.25151566835766087,1.0013091801403597,5.1142026559760183E-2,0.99694652214542856,0.10508616696517906,-0.83135732390214789,-108.23897720262174,71.76102279737826,null,46241.5,2138276322.25,null,22.541365164242034,-17.744257307809466,null,3.9582386556020834,-87.403948316588924,null,0,0]
[46507.75,46.507750000000001,8.3077830886337942,1.4501346947391047,1.0004268622178762,2.921336784319864E-2,1,0,626.98118744616283,1.5692013819321198,4.8383805189994309,1.3626151135674367,1.0052801003100802,0.10253752121523969,1.03285499912748,0.25290304671690716,1.0013242895787438,5.1435975269542564E-2,0.99691163219648549,0.10569720321252077,-0.87983974741832705,-108.28922666776641,71.710773332233586,null,46507.75,2162970810.0625,null,22.538703801425651,-17.711488510258036,null,3.9094432573883093,-87.468798801625908,null,0,0]
[46774,46.774000000000001,8.3546567577722115,1.4508149415441605,1.0004317625964636,2.9380514105855772E-2,1,0,630.57055304033304,1.5692104607655675,4.8648995407757374,1.3637664724009646,1.0053405679081471,0.10312039245530923,1.0332261890026297,0.25428943090270545,1.0013394855347824,5.172991508300958E-2,0.99687655057480384,0.10630834236712666,-0.92800046309212303,-108.33976328016391,71.660236719836092,null,46774,2187807076,null,22.536074960065591,-17.679436749250154,null,3.8609222031064805,-87.533212991498942,null,0,0]
[47046.25,47.046250000000001,8.4025906875035048,1.4515026695716435,1.0004368023076504,2.9551425346742526E-2,1,0,634.24080579961446,1.5692196379329051,4.8920227698667258,1.3649308679122631,1.005402751298748,0.10371632611549772,1.0336077957840577,0.25570602508396822,1.001355113394961,5.2030469640483898E-2,0.99684048033644845,0.1069333606999098,-0.97691774940847342,-108.39173136646714,71.608268633532859,null,47046.25,2213349639.0625,null,22.533419702899977,-17.64739209728706,null,3.8115883208335495,-87.598635324813969,null,0,0]
[47318.5,47.3185,8.4505285463202942,1.4521825952793208,1.0004418712419536,2.9722334860711193E-2,1,0,637.91105861169717,1.5692287094976716,4.9191525584970446,1.3660824213745222,1.0054652917007543,0.10431218585258252,1.033991475213208,0.25712157080328213,1.001370831707765,5.2331014789620024E-2,0.99680421000596509,0.10755848788123717,-1.0255065550323621,-108.44399103304983,71.556008966950174,null,47318.5,2239040442.25,null,22.530796841116999,-17.616072954471598,null,3.7625350793127428,-87.663616953640499,null,0,0]
[47590.75,47.59075,8.4984702677334543,1.452854850076909,1.0004469693989295,2.9893242637803547E-2,1,0,641.58131147567497,1.569237677272207,4.9462887987318842,1.3672213410697016,1.0055281890475514,0.10490797125727794,1.0343772249836716,0.25853606355767167,1.0013866404689351,5.2631550476567382E-2,0.99676773974490729,0.10818372454360828,-1.0737707605204401,-108.49653803198095,71.503461968019053,null,47590.75,2264879485.5625,null,22.528205594627977,-17.58546746751556,null,3.7137594158706482,-87.728165444010841,null,0,0]
[47863,47.863,8.5464157867404644,1.4535195624533752,1.0004520967781307,3.0064148668061962E-2,1,0,645.25156439066245,1.5692465430276159,4.9734313849667178,1.3683478308656816,1.0055914432721609,0.10550368192061155,1.0347650427800426,0.25994949886771196,1.0014025396741875,5.2932076647485581E-2,0.99673106971579017,0.10880907131956133,-1.1217141758987945,-108.54936819855025,71.450631801449745,null,47863,2290866769,null,22.525645204611592,-17.555564033694271,null,3.6652583172199154,-87.792288194612809,null,0,0]
[48141.75,48.141750000000002,8.5955098788287341,1.4541924614319746,1.0004573768507103,3.0239133279120985E-2,1,0,649.00944506722954,1.5692555165597248,5.0012284707347892,1.3694885455366892,1.0056565773885888,0.10611353737828168,1.0351642600202033,0.26139557983911116,1.0014189121791954,5.3239767999477342E-2,0.99669331737702749,0.10944946307062496,-1.1704737826295946,-108.60374881678875,71.396251183211248,null,48141.75,2317628093.0625,null,22.523054884458489,-17.525662186737396,null,3.6158806290967718,-87.857508331077256,null,0,0]
[48420.5,48.420499999999997,8.6446078186965725,1.4548577171109358,1.0004626875565847,3.0414116037813806E-2,1,0,652.76732579545592,1.569264386773356,5.0290319923054216,1.3706166485449236,1.005722085483983,0.10672331361637721,1.0355656402726501,0.26284054284216446,1.0014353794894002,5.3547449261424677E-2,0.99665535596525656,0.11008997159814757,-1.2189049630382611,-108.65841770845255,71.341582291547454,null,48420.5,2344544820.25,null,22.520495367182718,-17.496472476170876,null,3.5667845337832045,-87.922297335661426,null,0,0]
[48699.25,48.699249999999999,8.6937095411526908,1.4555154584035239,1.0004680288952661,3.0589096933454425E-2,1,0,656.5252065744545,1.5692731554426602,5.0568418435226485,1.3717323450668057,1.0057879674852708,0.10733301019695905,1.035969181023243,0.26428438314591401,1.0014519416001249,5.3855120375571795E-2,0.99661718565804935,0.11073059758118947,-1.2670115879007553,-108.71337066227993,71.286629337720072,null,48699.25,2371616950.5625,null,22.517965903201752,-17.467983222811018,null,3.5179669511758656,-87.986662634070839,null,0,0]
[48978,48.978000000000002,8.7428149824653527,1.4561658113530982,1.0004734008662641,3.0764075955357535E-2,1,0,660.28308740335842,1.5692818243013995,5.0846579205290272,1.3728358359140986,1.0058542233189811,0.10794262668243935,1.0363748797482355,0.26572709604547412,1.0014685985066665,5.4162781284174386E-2,0.99657880663403675,0.11137134169885364,-1.3147974578023902,-108.76860355036241,71.231396449637586,null,48978,2398844484,null,22.515465763422124,-17.440182995256631,null,3.4694248510020103,-88.050611487580014,null,0,0]
[49263.25,49.263249999999999,8.793069268338126,1.4568238092777908,1.0004789298145276,3.0943133254641122E-2,1,0,664.12859599743899,1.5692905937427455,5.1131289627844998,1.3739526275144878,1.0059224110645151,0.10856637506565367,1.0367922701113497,0.26720227865505719,1.0014857419577607,5.4477605722976601E-2,0.99653931678665941,0.11202714994230996,-1.3633694489357731,-108.8254099608257,71.174590039174305,null,49263.25,2426867800.5625,null,22.512936942424201,-17.412436151741069,null,3.4200329101637723,-88.115627808647545,null,0,0]
[49548.5,49.548499999999997,8.8433273179993641,1.4574743284656695,1.0004844908393073,3.1122188569145667E-2,1,0,667.97410464200505,1.5692992622132242,5.1416063116236996,1.3750570495348315,1.0059909901231363,0.10919003864882018,1.0372119148854519,0.2686762707841272,1.0015029846671368,5.479241935242108E-2,0.9964996087569874,0.11268308333304748,-1.4116133865493661,-108.88250102594742,71.11749897405258,null,49548.5,2455053852.25,null,22.510437347251692,-17.385387389067876,null,3.3709231839850928,-88.180222913789535,null,0,0]
[49833.75,49.833750000000002,8.8935890676410789,1.4581174951587592,1.0004900839400688,3.1301241887423059E-2,1,0,671.8196133361896,1.5693078314467124,5.1700898628348302,1.3761493037013972,1.0060599604148219,0.10981361696417447,1.0376338113353236,0.2701490674760168,1.0015203266296682,5.510722211066689E-2,0.99645968273988916,0.11333914259893103,-1.4595331260925031,-108.93987258094832,71.060127419051682,null,49833.75,2483402639.0625,null,22.507966259002444,-17.359025221716173,null,3.322092580498897,-88.244404078500779,null,0,0]
[50119,50.119,8.9438544548849706,1.4587534327857581,1.0004957091162741,3.1480293198025935E-2,1,0,675.66512207914559,1.5693163031376132,5.1985795144675944,1.3772295874359712,1.006129321859115,0.11043710954434523,1.0380579567155284,0.27162066380283978,1.0015377678401987,5.5422013935885979E-2,0.9964195389313969,0.11399532846787215,-1.5071324533062682,-108.99752054425132,71.002479455748684,null,50119,2511914161,null,22.505522978464608,-17.333338408554557,null,3.2735380578908506,-88.308178417086864,null,0,0]
[50410.75,50.41075,8.9952689402836707,1.4593965092876076,1.0005014956530958,3.1663422467272134E-2,1,0,679.59825859063517,1.5693248686970804,5.2277245671817028,1.3783223063102512,1.0062006683842986,0.11107472049332967,1.0384940906204625,0.27312454662577534,1.0015557091448104,5.5743967557539111E-2,0.99637825527815782,0.11466659858522453,-1.5554888549691157,-109.05676389216559,70.943236107834409,null,50410.75,2541243715.5625,null,22.503052079417749,-17.307753415589577,null,3.2241595920989523,-88.372992397025357,null,0,0]
[50702.5,50.702500000000001,9.0466871033684892,1.4600322760120692,1.000507315742676,3.184654961208306E-2,1,0,683.5313951514122,1.5693333356816612,5.2568757927607406,1.3794029074417813,1.0062724239199674,0.1117122407676111,1.0389325712745825,0.2746271634196743,1.0015737542610867,5.6065909611438106E-2,0.99633674421333784,0.11533800268161616,-1.6035178701923596,-109.11628801037233,70.88371198962767,null,50702.5,2570743506.25,null,22.500608850616757,-17.282851874939421,null,3.1750636521693676,-88.437395355724561,null,0,0]
[50994.25,50.994250000000001,9.0981088817858531,1.4606608563836017,1.0005131693844296,3.2029674620213347E-2,1,0,687.46453176063073,1.5693417057832602,5.2860330890790266,1.3804715888070518,1.0063445883786306,0.11234966986842397,1.0393733957078177,0.27612850900575725,1.0015919031834168,5.6387840031473555E-2,0.99629500595046028,0.11600954153601377,-1.6512233340701314,-109.17608878946908,70.823911210530923,null,50994.25,2600413533.0625,null,22.498192603798664,-17.258622511748555,null,3.126247139539295,-88.501394410218126,null,0,0]
[51286,51.286000000000001,{"$f":"SQRT(1+(A461/pole1)^2)","v":9.1495342145796048},{"$f":"ATAN(A461/pole1)","v":1.4612823710748239},{"$f":"SQRT(1+(A461/Zero1)^2)","v":1.0005190565777677},{"$f":"ATAN(A461/Zero1)","v":3.2212797479418506E-2},{"$f":"IF(VIN_nom>Vout, 1, SQRT(1+(A461/z_RHP)^2))","v":1},{"$f":"IF(VIN_nom>Vout, 0, -ATAN(A461/z_RHP))","v":0},{"$f":"SQRT(1+(A461/Pole2)^2)","v":691.39766841746427},{"$f":"ATAN(A461/Pole2)","v":1.5693499806552837},5.3151963562307465,1.381528544147816,{"$f":"SQRT(1+(A461/pole4)^2)","v":1.0064171616723234},{"$f":"ATAN(A461/pole4)","v":0.11298700729744175},{"$f":"SQRT(1+(A461/Zero3)^2)","v":1.0398165609392716},{"$f":"ATAN(A461/Zero3)","v":0.27762857823692622},{"$f":"SQRT(1+(A461/pole5)^2)","v":1.0016101559061577},{"$f":"ATAN(A461/pole5)","v":5.6709758751550467E-2},{"$f":"SQRT((1-(Z461/pterm2))^2+(A461/pterm1)^2)","v":0.99625304070432541},{"$f":"IF((ATAN((A461/pterm1)/(1-A461^2/pterm2))>0),ATAN((A461/pterm1)/(1-A461^2/pterm2)),PI()+ATAN((A461/pterm1)/(1-A461^2/pterm2)))","v":0.11668121592743536},{"$f":"20*LOG10(((E461*K461*G461*O461)/(C461*I461*S461*M461*Q461))*Adc)","v":-1.6986090125993758},{"$f":"((F461+L461+H461+R461)-(D461+J461+T461+N461+T461))*radconv","v":-109.2361622028414},{"$f":"IF(V461>0,V461,V461+180)","v":70.763837797158601},null,{"$f":"IF(U461<0,A461,1000000000)","v":51286},{"$f":"A461^2","v":2630253796},null,{"$f":"20*LOG10((K461/(I461*M461))*AEA)","v":22.495802669579632},{"$f":"(L461-(J461+N461))*radconv","v":-17.235054291613427},null,{"$f":"20*LOG10((E461*G461/(C461*S461))*Acs*Am)","v":3.0777070060040446},{"$f":"(F461+H461-(D461+T461))*radconv","v":-88.564996519873873},null,{"$f":"SUM((U462<0)*(U461>0))*A461","v":0},0]
[51584.75,{"$f":"A462/1000","v":51.58475},9.2021970239055069,1.4619115990910501,1.000525119791523,3.2400311792231504E-2,1,0,695.42517344018358,1.5693583570710234,5.3450654272270004,1.3825989057984185,1.0064918998017438,0.11363954093819596,1.0402727816899286,0.27916331084530227,1.0016289541292265,5.7039389120667396E-2,0.99620983358802295,0.11736914716756386,-1.7468040991929707,-109.29795536997274,70.70204463002726,null,51584.75,2660986432.5625,null,22.493381980455407,-17.211594443329304,null,3.0282855152059533,-88.629720407561038,null,0,0]
[51883.5,51.883499999999998,9.254863435173041,1.4625336658881414,1.0005312181849328,3.2587823825779856E-2,1,0,699.4526785111351,1.5693666370226056,5.3749405538619808,1.3836573700296233,1.0065670664318196,0.11429197739922353,1.0407314505518572,0.28069669429485183,1.0016478611813795,5.7369007081427337E-2,0.99616638892568199,0.11805722218012031,-1.7946716487261449,-109.36002612305846,70.639973876941539,null,51883.5,2691897572.25,null,22.490987519142283,-17.188805171987219,null,2.979147513079186,-88.694042355760757,null,0,0]
[52182.25,52.182250000000003,9.3075333872377577,1.463148692553359,1.0005373517573539,3.2775333566919217E-2,1,0,703.48018362949028,1.5693748221668344,5.404821635718144,1.3847041317779762,1.006642661466562,0.11494431614690678,1.0411925642897117,0.28222872316258052,1.0016668770564541,5.7698612562910305E-2,0.99612270695210414,0.11874544180171882,-1.8422154904279031,-109.42237039588559,70.577629604114406,null,52182.25,2722987215.0625,null,22.488618624519539,-17.166675372899697,null,2.9302898839365876,-88.757969350949594,null,0,0]
[52481,52.481000000000002,9.3602068203273809,1.4637567974699284,1.0005435205081392,3.2962841002506231E-2,1,0,707.50768879443967,1.5693829141227886,5.4347085745666073,1.3857393817958537,1.0067186848094631,0.11559655664812045,1.0416561196566458,0.28375939206050566,1.001686001748253,5.8028205494212538E-2,0.99607878790349746,0.11943380686902967,-1.8894393847023441,-109.4849842049186,70.515015795081396,null,52481,2754255361,null,22.486274653648614,-17.145194178981157,null,2.8817095628792462,-88.821508224677473,null,0,0]
[52786.5,52.786499999999997,9.4140739034659102,1.4643716044865935,1.0005498650154601,3.3154582609795265E-2,1,0,711.62619203139741,1.5693910941877907,5.4652767400343238,1.3867863120679345,1.0067968686668587,0.11626343180780388,1.0421326702666096,0.28532323312410357,1.0017056710719945,5.8365232242507288E-2,0.99603363161894543,0.1201378762385813,-1.9374032376038803,-109.54928739314452,70.450712606855475,null,52786.5,2786414582.25,null,22.483902846105195,-17.123887308234828,null,2.8323152469626804,-88.886088290526246,null,0,0]
[53092,53.091999999999999,9.4679445045170159,1.4649794154871358,1.0005562463073734,3.3346321778375598E-2,1,0,715.74469531542445,1.5693991801141296,5.4958508291493349,1.3878215950624209,1.0068755001998024,0.1169302031052879,1.0426117671815904,0.28688564078544615,1.0017254541720315,5.8702245717182459E-2,0.99598822792941799,0.12084209947029433,-1.9850402620842511,-109.61386426596373,70.386135734036273,null,53092,2818760464,null,22.481555797141194,-17.103236432724461,null,2.7832045873532425,-88.950276469557494,null,0,0]
[53397.5,53.397500000000001,9.5218185637719106,1.4655803487681256,1.0005626643831753,3.353805849419586E-2,1,0,719.86319864571306,1.5694071735175714,5.5264307435967659,1.3888454218883393,1.0069545793034191,0.11759686997210196,1.0430934068930042,0.28844660939686723,1.001745351041623,5.9039245842472041E-2,0.99594257709206835,0.12154647745902351,-2.032354266691871,-109.67871081922443,70.321289180775565,null,53397.5,2851293006.25,null,22.47923287445737,-17.083230662715017,null,2.734374464470938,-89.014079591741975,null,0,0]
[53703,53.703000000000003,9.5756960228617416,1.4661745199838871,1.000569119242158,3.3729792743205762E-2,1,0,723.98170202147367,1.5694150759771155,5.5570163872072946,1.3898579795445596,1.0070341058722703,0.11826343184032484,1.0435775858801402,0.29000613334915043,1.0017653616739903,5.937623254262818E-2,0.9958966793655929,0.12225101109968482,-2.0793489917847383,-109.7438231308106,70.256176869189403,null,53703,2884012209,null,22.47693346316586,-17.063859341890975,null,2.6858218096646103,-89.07750433566423,null,0,0]
[54015.75,54.015749999999997,9.6308555418336628,1.4667759051983256,1.0005757653873719,3.3926074580349179E-2,1,0,728.1979440670159,1.5694230733787731,5.5883337132015729,1.390883084343836,1.0071159831420045,0.11894570292168394,1.0440758818971403,0.29160116497262134,1.0017859650277812,5.9721202486285416E-2,0.99584943693766614,0.12297242661311547,-2.127132076709382,-109.81075194348244,70.189248056517556,null,54015.75,2917701248.0625,null,22.474603213851381,-17.044674634119659,null,2.6364011950682902,-89.142049113718329,null,0,0]
[54328.5,54.328499999999998,9.6860185042690699,1.4673704407131716,1.0005824500808149,3.4122353802414213E-2,1,0,732.41418615859618,1.5694309787041656,{"$f":"SQRT(1+(A471/Zero2)^2)","v":5.6196568461839096},{"$f":"ATAN(A471/Zero2)","v":1.3918967626345196},1.0071983291416653,0.11962786275900923,1.0445768316364326,0.29319467078211442,1.0018066875934597,6.0066158199452033E-2,0.99580193631705738,0.1236940071521194,-2.1745882694371437,-109.87795121431665,70.122048785683347,null,54328.5,2951585912.25,null,22.472296354447323,-17.026132967671014,null,2.5872650248067814,-89.206211037996212,null,0,0]
[54641.25,54.641249999999999,9.7411848516684163,1.4679582424783124,1.0005891733217143,3.4318630394329905E-2,1,0,736.63042829542428,1.5694387935343395,5.6509856895907662,1.3928992023602489,1.0072811437562963,0.12030991074478647,1.0450804312819044,0.29478664488496986,1.0018275293636278,6.0411099600918013E-2,0.99575417778635056,0.1244157536770486,-2.2217213715600019,-109.94541698971921,70.054583010280794,null,54641.25,2985666201.5625,null,22.470012278313895,-17.008223629947015,null,2.5384101653611637,-89.269996807824711,null,0,0]
[54954,54.954000000000001,9.7963545268463132,1.4685394238505309,1.0005959351092926,3.4514904341026519E-2,1,0,740.84667047672735,1.5694465194143492,5.6823201489707627,1.3938905874105805,1.0073644268703237,0.1209918462721169,1.0455866770046287,0.29637708143090569,1.0018484903308467,6.0756026609493724E-2,0.99570616162982806,0.12513766714832203,-2.2685351167952303,-110.01314539778328,69.986854602216724,null,54954,3019942116,null,22.467750395555409,-16.990936138604543,null,2.4898335344971882,-89.333412973960435,null,0,0]
[55274,55.274000000000001,9.8528065014380157,1.469127341066051,1.0006028935415179,3.4715725449727057E-2,1,0,745.16065133098073,1.569454333899309,5.7143867031067694,1.3948936998319528,1.007450125402928,0.12168947302561628,1.0461073930307883,0.29800278911796541,1.0018700605697954,6.1108934546048328E-2,0.995656766033994,0.12587648942223911,-2.3161073502583562,-110.08271172947603,69.917288270523969,null,55274,3055215076,null,22.465458451820247,-16.97388083612147,null,2.4404156423646461,-89.397923345326561,null,0,{"$f":"IF(AH474>0,W474,0)","v":0}]
[55594,55.594000000000001,9.9092618428160808,1.4697085594816619,1.0006098923266127,3.4916543757232139E-2,1,0,749.4746322302143,1.5694620584238159,5.7464589430798654,1.395885616063999,1.0075363141609217,0.12238698076286755,1.046630871085525,0.29962687488092155,1.0018917555802789,6.1461827242782409E-2,0.99560710133719921,0.12661548850677959,-2.3633529466114882,-110.1525450637976,69.847454936202396,null,55594,3090692836,null,22.463188544243589,-16.957455054551133,null,2.3912826591274881,-89.462060194728835,null,0,0]
[55914,55.914000000000001,9.9657204937624471,1.4702831925531397,1.0006169314637305,3.5117359247403501E-2,1,0,753.7886131736559,1.5694696945324176,5.7785367742168452,1.3968665205953619,1.0076229930185077,0.12308436883580016,1.0471571070265913,0.30124933259108505,1.0019135753541919,6.181470461279507E-2,0.99555716784948722,0.12735466543093066,-2.410275695227277,-110.22264150604582,69.777358493954182,null,55914,3126375396,null,22.460940091883245,-16.941648274837299,null,2.3424314428091444,-89.525830082585657,null,0,0]
[56234,56.234000000000002,10.022182398345054,1.4708513511971826,1.0006240109520197,3.5318171904104266E-2,1,0,758.10259416055089,1.5694772437345041,5.8106201039187777,1.397836593925901,1.0077101618492172,0.12378163659703148,1.0476860966982604,0.30287015616633284,1.0019355198833833,6.216756656920825E-2,0.99550696588276821,0.1280940212237523,-2.4568793180529362,-110.29299724261251,69.707002757387485,null,56234,3162262756,null,22.458712529861053,-16.926450204489186,null,2.2938589029516137,-89.589239423841107,null,0,0]
[56561.5,56.561500000000002,10.079970940677661,1.471426235390102,1.0006312981457719,3.5523688156745677E-2,1,0,762.51768412104934,1.5694848814245497,5.8434609855339517,1.3988183726703325,1.0077998809000359,0.12449512132213132,1.0482303315125576,0.30452726946240893,1.0019581079043944,6.2528682677372591E-2,0.99545530964343776,0.12885089194803898,-2.5042485954561906,-110.36526652655422,69.634733473445777,null,56561.5,3199203282.25,null,22.456453816701909,-16.911515696900651,null,2.244433322363439,-89.653768146118836,null,0,0]
[56889,56.889000000000003,10.137762776378194,1.4719945653421103,1.0006386276025017,3.5729201407345E-2,1,0,766.93277412551663,1.5694924311770602,5.8763074366406025,1.3997891767596569,1.0078901128904294,0.12520847865998991,1.0487774418009883,0.3061826583848849,1.0019808265796952,6.2889782456902563E-2,0.99540337285972291,0.12960795220493998,-2.5512912916993375,-110.43779957077642,69.56220042922358,null,56889,3236358321,null,22.454215836684167,-16.897197653531169,null,2.1952932448978277,-89.717932369477282,null,0,0]
[57216.5,57.216500000000003,10.195557849442913,1.4725564521440491,1.0006459993212802,3.5934711638608403E-2,1,0,771.34786417319788,1.5694998945020624,5.9091593643635765,1.4007491873890998,1.0079808576826466,0.12592170791889068,1.0493274230658105,0.30783631656553456,1.0020036759003981,6.3250865814742249E-2,0.99535115587206513,0.13036520309781513,-2.5980111877307954,-110.51059253823782,69.489407461762184,null,57216.5,3273727872.25,null,22.451998033178381,-16.883485739544749,null,2.1464355181330834,-89.781738523161494,null,0,0]
[57544,57.543999999999997,10.253356105127686,1.4731120043983656,1.0006534133011737,3.6140218833243587E-2,1,0,775.76295426335491,1.5695072728752066,5.9420166778663379,1.4016985818266825,1.0080721151382028,0.12663480840788666,1.0498802707951287,0.30948823768730382,1.0020266558575657,6.3611932657861359E-2,0.99529865902295966,0.13112264573010318,-2.6444119974414764,-110.58364167241666,69.416358327583339,null,57544,3311311936,null,22.449799864978971,-16.870369843192087,null,2.097857041440585,-89.84519289384653,null,0,0]
[57879,57.878999999999998,10.312481221981997,1.4736738360987094,1.0006610407898013,3.6350429139749681E-2,1,0,780.27915333006888,1.5695147338297648,5.9756319285111887,1.4026589152642008,1.0081659927223581,0.12736410549585819,1.0504487401235838,0.31117618534749947,1.0020502972221574,6.3981251024002539E-2,0.99524467076675138,0.13189763390346029,-2.6915490933115511,-110.65862488715523,69.341375112844773,null,57879,3349978641,null,22.447571123427398,-16.857559916641645,null,2.0484518170936878,-89.909742867279618,null,0,0]
[58214,58.213999999999999,10.37160955690706,1.4742292619905439,1.0006687124953371,3.65606362323566E-2,1,0,784.79535243971782,1.5695221089144051,6.0092526284659575,1.4036085037796673,1.0082604064240177,0.12809326638854732,1.0510201991137051,0.31286230227107925,1.0020740752559973,6.4350551913535975E-2,0.99519039041575719,0.13267282503454972,-2.7383599738619067,-110.73386843410985,69.266131565890149,null,58214,3388869796,null,22.445361828538978,-16.845352905377887,null,1.9993323776456575,-89.973937627684691,null,0,0]
[58549,58.548999999999999,10.430741055176417,1.4747783906711245,1.0006764284167637,3.6770840092561638E-2,1,0,789.31155159156481,1.5695293996030912,6.0428786867758442,1.4045475250189177,1.00835535609259,0.12882229034896575,1.0515946428915544,0.31454658186323958,1.0020979899493567,6.471983522697651E-2,0.99513581834322562,0.13344822030462253,-2.7848484066471451,-110.8093685414354,69.190631458564596,null,58549,3427985401,null,22.443171447933452,-16.833738673269774,null,1.9504955655398184,-90.037783465966953,null,0,0]
[58884,58.884,10.489875663294692,1.4753213283043121,1.0006841885530586,3.6981040701863782E-2,1,0,793.82775078488964,1.569536607336244,6.0765100144850024,1.4054761527704465,1.0084508415766842,0.12955117664098431,1.0521720665684084,0.3162290175852383,1.0021220412924514,6.5089100864867605E-2,0.99508095492465998,0.13422382089501503,-2.8310180926576161,-110.88512151700846,69.114878482991543,null,58884,3467325456,null,22.440999464006083,-16.822707303322954,null,1.9019382751682725,-90.101286533613248,null,0,0]
[59227,59.226999999999997,10.550425608681326,1.4758709254181792,1.0006921798162591,3.719625763960907E-2,1,0,798.45179955342974,1.5695439027137097,6.1109498471761405,1.4064163655047095,1.0085491623138998,0.13029732576587941,1.0527663618378438,0.31794971366185115,1.002146808569319,6.5467166369067645E-2,0.99502447986404963,0.13501815725799579,-2.8779638797801512,-110.96294174296186,69.03705825703814,null,59227,3507837529,null,22.438794147164884,-16.812006271875617,null,1.8525078319078989,-90.165957227644341,null,0,0]
[59570,59.57,10.610978704526856,1.4764142499826063,1.0007002174291089,3.741147113008253E-2,1,0,803.07584836397609,1.5695511140787342,6.1453950213957533,1.4073460391964476,1.0086480444396304,0.13104332900959056,1.05336377061009,0.31966846305817509,1.002171719079471,6.5845213132508851E-2,0.99496770018017711,0.13581271137144083,-2.9245831600639942,-111.04101947267391,68.958980527326091,null,59570,3548584900,null,22.436607063331856,-16.801895911151259,null,1.8033639929695957,-90.230281204762051,null,0,0]
[59913,59.912999999999997,10.671534897201683,1.4769514084557982,1.0007083013904909,3.7626681153431436E-2,1,0,807.69989721580714,1.5695582428742196,6.1798454478261338,1.4082653484792234,1.0087474877887863,0.13178918558480759,1.0539642875907533,0.32138525893841413,1.002196772812227,6.6223241048532333E-2,0.99491061628345534,0.13660748450363178,-2.9708796994656783,-111.11935099012986,68.88064900987014,null,59913,3589567569,null,22.434437701969799,-16.792366252946479,null,1.7545035869157857,-90.294264638376887,null,0,0]
[60256,60.256,10.732094134283926,1.4774825049074809,1.0007164316992825,3.7841887689805009E-2,1,0,812.32394610821814,1.5695652905102149,6.2143010391167177,1.4091744641844943,1.008847492195406,0.13253489470518254,1.0545679074699854,0.32310009452836447,1.0022219697568457,6.6601250010511384E-2,0.99485322858678316,0.137402477922942,-3.0168571976023992,-111.1979326584913,68.802067341508703,null,60256,3630785536,null,22.432285566747506,-16.783407545075121,null,1.7059234946021027,-90.357913565054702,null,0,0]
[60607,60.606999999999999,10.794068929991377,1.4780198188358222,1.0007247996165882,3.8062109989987436E-2,1,0,817.05584457876978,1.5695724199392109,6.2495655171930586,1.4100944051249591,1.0089504097311597,0.13329784298499661,1.0551888126899409,0.32485288987566502,1.0022479026351783,6.6988055774521341E-2,0.9947941883237974,0.13821624284009146,-3.0635805592752923,-111.2786023926858,68.721397607314202,null,60607,3673208449,null,22.430100566031292,-16.774821014387314,null,1.656497335248013,-90.422706872409663,null,0,0]
[60958,60.957999999999998,10.856046806432827,1.4785509977958193,1.0007332160660936,3.8282328596586146E-2,1,0,821.7877430903734,1.5695794672649277,6.2848352248668604,1.4110040216414974,1.0090539144469342,0.1340606351883811,1.0558129559387934,0.32660361826841455,1.0022739854607654,6.7374841464204929E-2,0.99473483080700487,0.13903024112770965,-3.1099774565802618,-111.35952662239855,68.640473377601452,null,60958,3715877764,null,22.427932596317881,-16.766812382924961,null,1.6073582719724446,-90.48716225474034,null,0,0]
[61309,61.308999999999997,10.918027711143486,1.4790761459685458,1.0007416810465743,3.8502543488335032E-2,1,0,826.51964164232345,1.5695864338975101,6.3201100745859904,1.4119034850893069,1.0091580061620562,0.13482327047583303,1.056440331477476,0.3283522726474743,1.0023002182219003,6.7761606965405133E-2,0.99467515648697358,0.13984447414530135,-3.1560516485978045,-111.44070169507812,68.559298304921882,null,61309,3758793481,null,22.425781168949868,-16.759371865453819,null,1.5585031250131898,-90.551285760294903,null,0,0]
[61660,61.66,10.980011592840658,1.4795953651960794,1.0007501945567985,3.8722754643970181E-2,1,0,831.25154023393122,1.5695933212149944,6.3553899807294849,1.4127929630852418,1.0092626846949027,0.13558574800892492,1.0570709335508606,0.33009884602115536,1.0023266009068112,6.8148352164001016E-2,0.99461516581700604,0.14065894325246994,-3.2018068284267791,-111.52212403658082,68.47787596341918,null,61660,3801955600,null,22.423645808895685,-16.752489889152859,null,1.5099287671213517,-90.615083303312474,null,0,0]
[62019,62.018999999999998,11.043411239871315,1.4801203890633197,1.0007589523073361,3.8947980970307834E-2,1,0,836.09128840641017,1.5696002848646842,6.3914791306304464,1.413692555550776,1.0093703559052427,0.13636543988591715,1.0577192399874986,0.3318830674267827,1.0023537399824545,6.85438909470832E-2,0.99455348106618457,0.14149222139765633,-3.2482786417550096,-111.60565429938596,68.394345700614039,null,62019,3846356361,null,22.421477919146628,-16.746019079198106,null,1.4605345572748911,-90.680003758068452,null,0,0]
[62378,62.378,11.106813896265757,1.4806394189306287,1.0007677608223811,3.9173203343295174E-2,1,0,840.93103661896669,1.569607168359618,6.4275733948561156,1.4145820453432298,1.0094786406003129,0.13714496496482909,1.0583709094848424,0.33366509730642968,1.0023810358687653,6.8939408250170281E-2,0.99449146634856034,0.14232574939428302,-3.2944243455657434,-111.6894359105565,68.310564089443503,null,62378,3891014884,null,22.41932587400666,-16.740112960418053,null,1.4114276277300259,-90.744595323868907,null,0,0]
[62737,62.737000000000002,11.170219510780145,1.4811525565873351,1.0007766201005932,3.9398421740188039E-2,1,0,845.77078487091251,1.5696139730758023,6.4636726877286792,1.415461600311958,1.0095875385827127,0.13792432235211291,1.0590259358345331,0.33544492839809176,1.0024084885529341,6.9334903951277407E-2,0.99442912215803747,0.14315952869736928,-3.3402476872488585,-111.77346528779974,68.226534712200262,null,62737,3935931169,null,22.417189206592987,-16.734761943395906,null,1.3626047956324983,-90.808863917482398,null,0,0]
[63096,63.095999999999997,11.233628033325207,1.4816599015371308,1.0007855301406239,3.9623636138244676E-2,1,0,850.6105331615754,1.569620700357927,6.4997769254619078,1.4163313846391801,1.0096970496540087,0.13870351115542001,1.0596843128116227,0.33722255351339619,1.0024360980220783,6.9730377928460083E-2,0.99436644899152327,0.14399356076203987,-3.3857523486907204,-111.85773892626119,68.142261073738808,null,63096,3981105216,null,22.415067463063309,-16.72995664710065,null,1.3140629307436911,-90.872815324726034,null,0,0]
[63463.25,63.463250000000002,11.298496673502097,1.4821730130316071,1.000794697461449,3.9854021914645113E-2,1,0,855.5615013339492,1.5696275034828002,6.5367158878687111,1.4172112144684079,1.0098097115210711,0.13950043073924506,1.0603612801248878,0.33903873932674139,1.0024645041880305,7.0134917490321275E-2,0.99430199568256894,0.1448470223602541,-3.4319767524535125,-111.94419838553591,68.055801614464087,null,63463.25,4027584100.5625,null,22.412911943085277,-16.72559603029843,null,1.2646930662018316,-90.937914062760129,null,0,0]
[63830.5,63.830500000000001,11.363368254422545,1.4826802661218681,1.0008039179010857,4.0084403458169882E-2,1,0,860.51246954546502,1.5696342283239622,6.5736598534809287,1.4180811556782242,1.0099230145555962,0.14029717201651518,1.0610417406027539,0.34085260162753467,1.0024930744002483,7.0539434060302608E-2,0.99423719916542308,0.14570075155158532,-3.4778752523015735,-112.03090628136889,67.969093718631115,null,63830.5,4074332730.25,null,22.41077111994651,-16.72178728811501,null,1.2156107676645043,-91.002692713439799,null,0,0]
[64197.75,64.197749999999999,11.428242726007806,1.4831817603134769,1.0008131914580662,4.031478074448102E-2,1,0,865.46343779545077,1.569640876224901,6.6106087384160057,1.4189413727530491,1.0100369585418105,0.14109373403586972,1.0617256875289081,0.34266413295914161,1.002521808644707,7.0943927507990404E-2,0.99417205998181712,0.14655474989413692,-3.523451587130543,-112.11785910062534,67.882140899374662,null,64197.75,4121351105.0625,null,22.408644547413395,-16.718521018754579,null,1.1668128476378457,-91.067157068681027,null,0,0]
[64565,64.564999999999998,11.493120039307632,1.4836775928769455,1.0008225181309138,4.0545153749243272E-2,1,0,870.41440608325047,1.5696474484985381,6.6475624606453074,1.4197920265781334,1.0101515432628185,0.14189011584728595,1.0624131141699655,0.34447332594527502,1.0025507069073023,7.1348397703016195E-2,0.99410657867678331,0.14740901894612413,-3.5687094307442497,-112.20505340666381,67.794946593336192,null,64565,4168639225,null,22.406531791740576,-16.71578802496381,null,1.1182961713770225,-91.131312792347131,null,0,0]
[64941,64.941000000000003,11.559545996189296,1.484179472732944,1.0008321220462464,4.0781011098238763E-2,1,0,875.48333485208343,1.5696541003496429,6.6854015601300247,1.4206532044380233,1.0102695216366033,0.14270528434802782,1.0631205172675051,0.34632319408151191,1.0025804636038091,7.1762480470056775E-2,0.99403918335888508,0.14828392367175172,-3.6147193811945533,-112.2945718561583,67.705428143841701,null,64941,4217333481,null,22.404382572441129,-16.713533005858203,null,1.0689117053886967,-91.196683107583098,null,0,0]
[65317,65.316999999999993,11.625974831456176,1.4846756174011047,1.0008417816354873,4.101686390761642E-2,1,0,880.55226365920817,1.5696606756175377,6.7232455618798612,1.4215046880771098,1.0103881711771319,0.1435202619402948,1.0638315535308369,0.34817059572880593,1.0026103921970906,7.217653858679296E-2,0.99397143058961224,0.14915911546616117,-3.6604030743274456,-112.38433638350701,67.615663616492995,null,65317,4266310489,null,22.402246954437768,-16.71181809854632,null,1.0198155588875977,-91.261741528691459,null,0,0]
[65693,65.692999999999998,11.692406496048799,1.4851661243903194,1.0008514968970252,4.1252712151268717E-2,1,0,885.62119250396688,1.5696671756172134,6.7610943835761939,1.4223466390558872,1.010507491647987,0.14433504760892787,1.0645462156799219,0.35001552323214347,1.0026404926717536,7.2590571913462895E-2,0.99390332096466227,0.15003459600197744,-3.7057642508131536,-112.47434353717479,67.525656462825211,null,65693,4315570249,null,22.400124510288862,-16.710634063472774,null,0.97100453210551696,-91.326493739850392,null,0,0]
[66069,66.069000000000003,11.75884094201427,1.485651089016871,1.0008612678292383,4.1488555803091139E-2,1,0,890.69012138571725,1.5696736016337265,6.7989479447230554,1.4231792153916081,1.0106274828115271,0.14514964034026556,1.0652644964171829,0.35185796902437161,1.0026707650123179,7.3004580310355449E-2,0.99383485508337244,0.15091036695194401,-3.7508065864129758,-112.56458994139339,67.435410058606607,null,66069,4365112761,null,22.3980148245499,-16.709971862465711,null,0.92247547832194476,-91.390945299617471,null,0,0]
[66453.75,66.453749999999999,11.826824232666057,1.4861416992576628,1.000871323770858,4.1729883057179444E-2,1,0,895.87701075115694,1.5696801019161923,6.8376872306208361,1.4240216236481786,1.0107509603595364,0.14598298890410202,1.0660032307149394,0.3537407140682175,1.0027019197244007,7.3428197258721462E-2,0.99376442775406237,0.15180682058531325,-3.796570825798729,-112.65718071730613,67.342819282693867,null,66453.75,4416100889.0625,null,22.395868829728592,-16.709825219059134,null,0.87310575541879032,-91.456591172456214,null,0,0]
[66838.5,66.838499999999996,11.894810337475327,1.4866267013398364,1.0008814380008928,4.1971205447942236E-2,1,0,901.06390015401485,1.5696865273621317,6.8764313142197802,1.4248545396779806,1.0108751396718256,0.14681613330371632,1.0667457384637682,0.35562084480172707,1.0027332543614653,7.385178780769476E-2,0.99369362867580435,0.152703581850864,-3.8420087976767809,-112.75001509163928,67.249984908360716,null,66838.5,4467385082.25,null,22.393735350685027,-16.710206454619801,null,0.82402478066274087,-91.521933626148652,null,0,0]
[67223.25,67.223249999999993,11.962799208462444,1.4871061906527725,1.0008916105175756,4.2212522947419839E-2,1,0,906.25078959364862,1.5696928792565159,6.9151801148788099,1.425678121882908,1.0110000204898058,0.14764907245793349,1.067492011789652,0.35749835340194258,1.002764768906645,7.4275351807748496E-2,0.99362245850261699,0.15360065254123648,-3.8871242393451055,-112.84308968130902,67.156910318690976,null,67223.25,4518965340.5625,null,22.391613978772792,-16.711106505064386,null,0.775229347517848,-91.586978230416364,null,0,0]
[67608,67.608000000000004,12.030790798730413,1.4875802604397654,1.0009018413191295,4.2453835527655984E-2,1,0,911.43767906943026,1.5696991588550648,6.9539335537445295,1.4264925251851304,1.0111256025535551,0.14848180528725041,1.0682420428007011,0.35937323214165584,1.0027964633429782,7.4698889109412636E-2,0.99355091789252503,0.1544980344491953,-3.931920823503559,-112.93640117807411,67.063598821925893,null,67608,4570841664,null,22.389504316843912,-16.712516504102865,null,0.72671630267048859,-91.651730432026199,null,0,0]
[68001.75,68.001750000000001,12.100375603162918,1.4880599035150157,1.0009123717817141,4.2700787724251912E-2,1,0,916.74589932996935,1.5697055117729328,6.9935982275660757,1.4273166334747531,1.011254847979568,0.14933380250163106,1.0690135007055608,0.36128923687567199,1.0028290854041766,7.5132305917997161E-2,0.99347732097264518,0.15541673184022214,-3.9774389142921662,-113.0321373089359,66.967862691064099,null,68001.75,4624238003.0625,null,22.387357027431968,-16.714478417170326,null,0.67735758802770618,-91.717700120535184,null,0,0]
[68395.5,68.395499999999998,12.169963159543034,1.4885340615231966,1.0009229632840408,4.2947734709541933E-2,1,0,922.05411962708195,1.5697117915439283,7.0332675975462697,1.4281314459631298,1.0113848272867947,0.15018558134334278,1.069788877369789,0.36320247120700527,1.0028618958346727,7.5565694447968637E-2,0.99340333749011034,0.156335758978562,-4.0226306381988302,-113.12811478103352,66.871885218966483,null,68395.5,4677944420.25,null,22.38522119589075,-16.716956237577595,null,0.62828811070055235,-91.783374729565566,null,0,0]
[68789.25,68.789249999999996,12.239553420932443,1.4890028278083751,1.0009336158241722,4.3194676453572944E-2,1,0,927.36233996014005,1.5697179994241288,7.0729415846683468,1.4289371179868879,1.0115155401923253,0.15103714066082982,1.0705681642787075,0.36511292716378718,1.0028948946159786,7.5999054539307609E-2,0.99332896816326766,0.15725511778614801,-4.0674997314918668,-113.22433027956536,66.775669720434635,null,68789.25,4731960915.5625,null,22.383096431523015,-16.719941071180155,null,0.57950465649250393,-91.848759719173344,null,0,0]
[69183,69.183000000000007,12.309146341452513,1.4894662936132417,1.0009443294001592,4.3441612926395617E-2,1,0,932.67056032852963,1.569724136641016,7.1126201116694592,1.4297338014644783,1.0116469864117992,0.15188847930440344,1.071351352899534,0.36702059687840971,1.0029280817295025,7.6432386032058361E-2,0.99325421371487588,0.1581748101850427,-4.1120498661072205,-113.32078056365663,66.679219436343374,null,69183,4786287489,null,22.380982354655721,-16.723424218149166,null,0.53100406462074756,-91.91386042902154,null,0,0]
[69586,69.585999999999999,12.380376850048231,1.4899352515433746,1.0009553578615931,4.3694344956854425E-2,1,0,938.1034817828039,1.5697303461128023,7.1532353914117364,1.4305400479704504,1.0117822796328027,0.1527595879406381,1.0721569715909911,0.36897018839664186,1.0029622434779479,7.6875867594644307E-2,0.99317730509039037,0.15911645550068951,-4.1573200553219527,-113.41973648102469,66.580263518975315,null,69586,4842211396,null,22.378829295770561,-16.72749632099444,null,0.48165375785427206,-91.980201562954932,null,0,0]
[69989,69.989000000000004,12.451610050204138,1.490398843943225,1.0009664502561171,4.3947071402062124E-2,1,0,943.53640327283244,1.5697364840758001,7.1938552684899566,1.4313371900987479,1.0119183404191709,0.15363046298205624,1.072966659322911,0.37091684488268456,1.0029966024714321,7.7319318860330319E-2,0.99309999458340725,0.16005845433980945,-4.2022637072941338,-113.51893170412173,66.481068295878273,null,69989,4898460121,null,22.376686661459896,-16.732072585107272,null,0.43259322608372164,-92.046255850062209,null,0,0]
[70392,70.391999999999996,12.52284589598935,1.4908571621767948,1.0009776065816058,4.4199792229921354E-2,1,0,948.96932479800148,1.5697425517581887,7.2344796654652885,1.4321253802014662,1.0120551684613295,0.15450110320215507,1.073780406890473,0.37286055823918418,1.0030311586896845,7.7762739657830357E-2,0.99302228298321371,0.16100080876354098,-4.2468845593650348,-113.61836298652545,66.381637013474545,null,70392,4955033664,null,22.374554078203843,-16.737144281451624,null,0.38381924674976298,-92.112028645048738,null,0,0]
[70795,70.795000000000002,12.594084342510497,1.4913102955498621,1.0009888268359215,4.4452507408339011E-2,1,0,954.40224635771074,1.5697485503601818,7.2751085066200574,1.4329047672724371,1.012192763448126,0.155371507376517,1.0745982050706537,0.37480132048220599,1.003065912112322,7.8206129815929865E-2,0.99294417108395716,0.16194352083315586,-4.2911862847700117,-113.71802715482858,66.281972845171424,null,70795,5011932025,null,22.372431183054864,-16.742702871922969,null,0.33532865091078806,-92.177525184699604,null,0,0]
[71207.25,71.207250000000002,12.666960559878721,1.4917685559029583,1.0010003707715407,4.4711017242356918E-2,1,0,959.95986900571654,1.56975461639309,7.3166744167887359,1.4336930869852391,1.0123343098584647,0.15626164430127157,1.0754389555573773,0.37678356705581922,1.0031016672497473,7.8659665162616507E-2,0.99286385294028323,0.16290824303771179,-4.3361784272904815,-113.82021663147688,66.179783368523118,null,71207.25,5070472452.5625,null,22.370269217923621,-16.748884126540737,null,0.28601502337161011,-92.244244557198201,null,0,0]
[71619.5,71.619500000000002,12.739839406907366,1.4922215733507291,1.0010119815998009,4.4969521096691861E-2,1,0,965.5174916886391,1.569760612592521,7.3582448225180004,1.4344724999530767,1.0124766581609157,0.15715153163485654,1.076283925156365,0.37876270894938269,1.0031376287047449,7.911316808502665E-2,0.99278311760735616,0.16387334385844862,-4.3808442022122502,-113.92264331559265,66.077356684407349,null,71619.5,5129352780.25,null,22.368116654806784,-16.755557398370588,null,0.23699139599906066,-92.310685569068738,null,0,0]
[72031.75,72.031750000000002,12.812720838723855,1.4926694371738498,1.0010236593183743,4.5228018937003858E-2,1,0,971.07511440587894,1.5697665401574796,7.3998196480429215,1.4352431553447249,1.0126198080173023,0.15804116807342605,1.0771331039384215,0.38073873798308683,1.0031737964551271,7.9566638400118114E-2,0.99270196595109439,0.16483882550227541,-4.4251873430954509,-114.02530403518188,65.974695964818125,null,72031.75,5188573008.0625,null,22.365973137295299,-16.762714134664325,null,0.18825454316793289,-92.376853464131273,null,0,0]
[72444,72.444000000000003,12.885604811469237,1.4931122346414047,1.0010354039249201,4.5486510728957756E-2,1,0,976.63273715685011,1.5697724002596785,7.4413988192837834,1.4360051990371516,1.0127637590877363,0.15893055231545805,1.0779864819562546,0.38271164610007002,1.0032101704785819,8.0020075924928685E-2,0.99262039884276154,0.16580469017623672,-4.4692115197396376,-114.12819569018146,65.871804309818543,null,72444,5248133136,null,22.363838319096786,-16.770345969849807,null,0.13980129295441446,-92.442753370957575,null,0,0]
[72865.75,72.865750000000006,12.960170926839069,1.4935600821785844,1.0010474883926952,4.5750952980532403E-2,1,0,982.31843129721665,1.5697783267850627,7.4839405736973301,1.4367760405681826,1.0129118561710484,0.15984016943165102,1.0788638605587966,0.38472678054571186,1.0032475961493903,8.0483928463016247E-2,0.99253652307110607,0.16679321116922149,-4.5139238885014663,-114.23369422829583,65.766305771704168,null,72865.75,5309417523.0625,null,22.361662957050456,-16.778636790080217,null,9.0521701493351231E-2,-92.509899800697951,null,0,0]
[73287.5,73.287499999999994,13.034739611856647,1.4940028057424868,1.0010596428617324,4.6015388829092778E-2,1,0,988.00412547168889,1.5697841850993737,7.5264867247713338,1.4375381676343499,1.0130607910955307,0.16074951984571198,1.079745613045713,0.38673863191208341,1.0032852376619945,8.0947746295015527E-2,0.99245221434111142,0.16778213772256848,-4.5583099954450281,-114.3394281264839,65.660571873516105,null,73287.5,5371057656.25,null,22.359495997643965,-16.787407723255413,null,4.153238502018794E-2,-92.576776252157714,null,0,0]
[73709.25,73.709249999999997,13.109310822671784,1.4944404925999339,1.0010718673294818,4.6279818237890735E-2,1,0,993.68981967968102,1.5697899763734819,7.5690371983638753,1.4382917263117587,1.0132105634917123,0.1616586021716673,1.0806317287102574,0.3887471919696322,1.0033230949921015,8.141152922528451E-2,0.99236747360307975,0.16877147219986571,-4.6023735724876049,-114.44539428705963,65.554605712940372,null,73709.25,5433053535.5625,null,22.357337100822299,-16.796650387506567,null,-7.1698858906422067E-3,-92.643387862886541,null,0,0]
[74131,74.131,{"$f":"SQRT(1+(A525/pole1)^2)","v":13.183884516424929},{"$f":"ATAN(A525/pole1)","v":1.4948732280510939},{"$f":"SQRT(1+(A525/Zero1)^2)","v":1.0010841617933794},{"$f":"ATAN(A525/Zero1)","v":4.6544241170183527E-2},{"$f":"IF(VIN_nom>Vout, 1, SQRT(1+(A525/z_RHP)^2))","v":1},{"$f":"IF(VIN_nom>Vout, 0, -ATAN(A525/z_RHP))","v":0},{"$f":"SQRT(1+(A525/Pole2)^2)","v":999.37551392062142},{"$f":"ATAN(A525/Pole2)","v":1.5697957017516113},7.6115919219834662,1.439036859449222,{"$f":"SQRT(1+(A525/pole4)^2)","v":1.0133611729882646},{"$f":"ATAN(A525/pole4)","v":0.16256741502613292},{"$f":"SQRT(1+(A525/Zero3)^2)","v":1.0815221968278785},{"$f":"ATAN(A525/Zero3)","v":0.39075245262193425},{"$f":"SQRT(1+(A525/pole5)^2)","v":1.0033611681152823},{"$f":"ATAN(A525/pole5)","v":8.1875277058270704E-2},{"$f":"SQRT((1-(Z525/pterm2))^2+(A525/pterm1)^2)","v":0.99228230181319477},{"$f":"IF((ATAN((A525/pterm1)/(1-A525^2/pterm2))>0),ATAN((A525/pterm1)/(1-A525^2/pterm2)),PI()+ATAN((A525/pterm1)/(1-A525^2/pterm2)))","v":0.16976121696483679},{"$f":"20*LOG10(((E525*K525*G525*O525)/(C525*I525*S525*M525*Q525))*Adc)","v":-4.6461182880901566},{"$f":"((F525+L525+H525+R525)-(D525+J525+T525+N525+T525))*radconv","v":-114.55158968319786},{"$f":"IF(V525>0,V525,V525+180)","v":65.448410316802139},null,{"$f":"IF(U525<0,A525,1000000000)","v":74131},{"$f":"A525^2","v":5495405161},null,{"$f":"20*LOG10((K525/(I525*M525))*AEA)","v":22.355185936214017},{"$f":"(L525-(J525+N525))*radconv","v":-16.806356584496719},null,{"$f":"20*LOG10((E525*G525/(C525*S525))*Acs*Am)","v":-5.5588286866686043E-2},{"$f":"(F525+H525-(D525+T525))*radconv","v":-92.709739657760679},null,{"$f":"SUM((U526<0)*(U525>0))*A525","v":0},0]
[74562.75,{"$f":"A526/1000","v":74.562749999999994},13.260228935037627,1.4953111821238765,1.0010968202706005,4.6814927015968337E-2,1,0,1005.1960201510274,1.5698014957918869,7.6551599775072861,1.4397910785073595,1.0135162202642316,0.16349749592314267,1.0824382758551523,0.39280183347311898,1.0034003674829763,8.2349984131007026E-2,0.99219466503869203,0.17077485676309478,-4.6905736960007722,-114.66053741497548,65.339462585024521,null,74562.75,5559603687.5625,null,22.352991440228923,-16.816764699707523,null,-0.10486393777151409,-92.777400703678282,null,0,0]
[74994.5,74.994500000000002,13.336575867893304,1.4957441220307954,1.0011095520971558,4.7085605996574416E-2,1,0,1011.0165264147901,1.5698072231186189,7.698732338353242,1.4405367607087625,1.013672144014238,0.16442729149289367,1.0833588933823326,0.39484773985612198,1.003439792946041,8.2824654007923215E-2,0.99210657857569251,0.17178893154957112,-4.7347025251395021,-114.76971918210788,65.230280817892123,null,74994.5,5624175030.25,null,22.350804376542005,-16.827641770327865,null,-0.15384866490218829,-92.844799775388609,null,0,0]
[75426.25,75.426249999999996,13.412925272058425,1.496172133233449,1.0011223572702466,4.7356278072600684E-2,1,0,1016.8370327113369,1.5698128848774375,7.7423089318325342,1.441274049362901,1.0138289438338868,0.16535680025975233,1.0842840378491021,0.39689016351562406,1.0034794444778279,8.3299286479518897E-2,0.9920180434692184,0.17280344386056162,-4.7785085141418628,-114.87913195614762,65.120868043852383,null,75426.25,5689119189.0625,null,22.348624420203858,-16.83897956642214,null,-0.20254570762925583,-92.911941917057192,null,0,0]
[75858,75.858000000000004,13.489277105570105,1.4965952992658391,1.0011352357870582,4.7626943204652168E-2,1,0,1022.6575390401077,1.5698184821878916,7.7858896868766987,1.4420030846075742,1.0139866193167593,0.16628602075097779,1.0852136976778151,0.39892909634061213,1.003519322051539,8.3773881336394157E-2,0.99192906077078147,0.17381839623249487,-4.8219953383103418,-114.9887727786077,65.011227221392303,null,75858,5754436164,null,22.346451255557405,-16.850770038449483,null,-0.25095825129584831,-92.978832062413531,null,0,0]
[76299.75,76.299750000000003,13.567399837652047,1.4970233368386408,1.0011484884988775,4.7903870133016765E-2,1,0,1028.6128573606361,1.5698241435771121,7.8304840746290969,1.4427406060020491,1.0141488527031708,0.16723646352941932,1.086169551225016,0.40101163265436979,1.0035603571794123,8.4259429396711119E-2,0.99183755493610026,0.17485731458974363,-4.8661628143155458,-115.10118607093086,64.898813929069135,null,76299.75,5821651850.0625,null,22.344234466711033,-16.86329390884168,null,-0.300200911968248,-93.047015701786208,null,0,0]
[76741.5,76.741500000000002,13.645525027037877,1.4974464731720292,1.0011618179852604,4.8180789708597259E-2,1,0,1034.5681757137534,1.5698297397886558,7.8750826734380865,1.4434697742464329,1.0143120019187628,0.1681866014138669,1.0871301071478241,0.40309049783617978,1.0036016288842029,8.4744937636520676E-2,0.99174558278339398,0.17589669900147328,-4.9100037570796013,-115.21383204836269,64.78616795163731,null,76741.5,5889257822.25,null,22.342024147736691,-16.876275175935415,null,-0.34915232044049294,-93.114945645064097,null,0,0]
[77183.25,77.183250000000001,13.723652631761217,1.4978647918202115,1.0011752242431402,4.8457701889217351E-2,1,0,1040.5234940988998,1.5698352719416337,7.9196854121617415,1.4441907296906062,1.0144760665216817,0.16913643283633964,1.088095352992658,0.4051656836639857,1.0036431371367254,8.5230405831863185E-2,0.9916531454600872,0.17693655218487109,-4.953521906965161,-115.32670775764744,64.673292242352559,null,77183.25,5957254080.5625,null,22.339819988769879,-16.8897057725565,null,-0.39781572062400661,-93.182626837650545,null,0,0]
[77625,77.625,13.801782610804644,1.4982783744522716,1.0011887072694332,4.8734606632707511E-2,1,0,1046.4788125155287,1.569840741129682,7.9642922212452802,1.4449036095747259,1.0146410460678803,0.17008595623207981,1.0890652762893898,0.40723718207156656,1.0036848819076321,8.5715833758891469E-2,0.99156024412075094,0.17797687685724958,-4.9967209412453757,-115.43981031442679,64.560189685573206,null,77625,6025640625,null,22.337621688843061,-16.90357780842989,null,-0.44619430229670409,-93.250064116946049,null,0,0]
[78077,78.076999999999998,13.881727868752373,1.4986967346504581,1.0012025826024158,4.90179287018584E-2,1,0,1052.5723132251276,1.5698462731616507,8.0099381918592769,1.4456248117092765,1.0148108002308884,0.17105719112062603,1.0900625333650458,0.4093529208037523,1.0037278400727565,8.6212483238196663E-2,0.99146470809682985,0.17904183121949824,-5.0405957928386353,-115.55576907465453,64.444230925345465,null,78077,6096017929,null,22.335378141021124,-16.918220592074544,null,-0.4954038838267828,-93.318818622222594,null,0,0]
[78529,78.528999999999996,13.961675528528191,1.4991103036732267,1.0012165383010949,4.9301242895444533E-2,1,0,1058.6658139665678,1.5698517415107454,{"$f":"SQRT(1+(A535/Zero2)^2)","v":8.0555882814865214},{"$f":"ATAN(A535/Zero2)","v":1.4463378402725815},1.0149815113413618,0.17202810021815815,1.0910646610098687,0.41146478242201484,1.0037710457968709,8.6709090085016677E-2,0.99136868874231177,0.18010728496079079,-5.0841441412319242,-115.67195943519937,64.328040564800631,null,78529,6166803841,null,22.333140117052984,-16.933309371645603,null,-0.54432186421883155,-93.387327676916712,null,0,0]
[78981,78.980999999999995,14.04162554910682,1.4995191632176743,1.0012305743621099,4.9584549168314652E-2,1,0,1064.7593147393027,1.569857147270316,8.1012424204957263,1.4470428327186546,1.0151531789165313,0.17299868185901479,1.0920716458155844,0.41357275878808014,1.0038144990480096,8.720565405992757E-2,0.99127218731730449,0.1811732409923868,-5.1273697300798666,-115.78837851854493,64.211621481455069,null,78981,6237998361,null,22.330907321570596,-16.948836238817183,null,-0.59295149220769838,-93.455596131317122,null,0,0]
[79433,79.433000000000007,14.121577890390848,1.4999233931370961,1.0012446907820813,4.9867847475325133E-2,1,0,1070.8528155427982,1.5698624915088264,8.1469005408103108,1.4477399234525097,1.0153258024712499,0.17396893438112565,1.093083474358459,0.41567684193170451,1.0038581997940286,8.7702174923631276E-2,0.99117520508978751,0.18223970222565947,-5.1702762401628464,-115.90502351501303,64.094976484986972,null,79433,6309601489,null,22.328679467725276,-16.964793458738079,null,-0.64129596228611874,-93.523628730076581,null,0,0]
[79895.5,79.895499999999998,14.203389892954423,1.500332302576546,1.0012592183049493,5.0157718534415037E-2,1,0,1077.0878689405029,1.5698678973022804,8.1936233549822042,1.4484451655764456,1.0155034251265871,0.17496138354948107,1.0941238075744595,0.41782576504172303,1.0039031718641802,8.8210185136397432E-2,0.99107547360161341,0.18333146342662091,-5.2138529641890416,-116.02460916954728,63.975390830452724,null,79895.5,6383290920.25,null,22.32640468522083,-16.981558939398724,null,-0.69047158409377318,-93.593002436001782,null,0,{"$f":"IF(AH538>0,W538,0)","v":0}]
[80358,80.358000000000004,14.285204243220605,1.5007365282633007,1.001273829956409,5.0447581157647234E-2,1,0,1083.3229223693206,1.5698732408697622,8.2403501981731395,1.4491424099036865,1.0156820476570441,0.17595348462134783,1.0951691836998783,0.41997059560060807,1.0039484029927668,8.8718149705234062E-2,0.99097524142456994,0.18442375974120501,-5.2571032145860723,-116.1444256131187,63.855574386881301,null,80358,6457408164,null,22.324134495082998,-16.998759150310661,null,-0.7393552438107347,-93.662138925756182,null,0,0]
[80820.5,80.820499999999996,14.367020901081755,1.5011361500825846,1.001288525732777,5.0737435296683384E-2,1,0,1089.5579758287172,1.569878523279546,8.2870810022300407,1.4498317910490972,1.0158616695351854,0.17694523582788446,1.0962195883076684,0.42211132561113374,1.0039938931447749,8.9226068374189796E-2,0.99087450994272974,0.18551659428875586,-5.3000307396992197,-116.2644700446953,63.735529955304699,null,80820.5,6531953220.25,null,22.321868615898467,-17.016386338470706,null,-0.7879501951495802,-93.731042957920792,null,0,0]
[81283,81.283000000000001,14.448839827337558,1.5015312461161288,1.0013033056303497,5.1027280903193688E-2,1,0,1095.7930293181705,1.5698837455755918,8.3338157005227647,1.4505134406382296,1.0160422902310005,0.17793663540424998,1.0972750069567616,0.42424794725695514,1.0040396422849984,8.9733940887454136E-2,0.99077328054883884,0.18660997018871292,-5.3426392251899149,-116.38473973002621,63.615260269973788,null,81283,6606926089,null,22.319606774412271,-17.034432920986809,null,-0.83625963747271215,-93.799719187749119,null,0,0]
[81756.25,81.756249999999994,14.53256279892601,1.5019309202760558,1.0013185161335931,5.132385457891659E-2,1,0,1102.173005703095,1.5698890280931284,8.381640627883451,1.4512030650260928,1.0162281424931243,0.17895071250063788,1.0983601320896119,0.42642997024256629,1.0040867228344499,9.025356996100857E-2,0.99066918431129947,0.18772932331763673,-5.385911601485609,-116.5080352569051,63.491964743094897,null,81756.25,6684084414.0625,null,22.317296263184751,-17.053325357818494,null,-0.88539968921858903,-93.869760620511897,null,0,0]
[82229.5,82.229500000000002,14.616288065343099,1.5023260156580427,1.0013338147060729,5.1620419218503022E-2,1,0,1108.5529821184211,1.5698942498064672,8.4294694961675241,1.4518848638680448,1.0164150394130544,0.17996441770510851,1.0994504764241155,0.42860767567864211,1.004134074476283,9.0773150166869182E-2,0.99056456972476981,0.18884924986546339,-5.4288575477021439,-116.63156104483595,63.368438955164052,null,82229.5,6761690670.25,null,22.314989425680221,-17.072641373742567,null,-0.93424741377848231,-93.939573080838642,null,0,0]
[82702.75,82.702749999999995,14.700015587377617,1.5027166103763119,1.0013492013437522,5.1916974770202289E-2,1,0,1114.9329585636278,1.5698994117594272,8.4773022386710117,1.4525589689905147,1.016602980414627,0.18097774913998646,1.1005460244478078,0.43078105577341641,1.004181697172148,9.1292681231433429E-2,0.99045943830966321,0.1899697531745034,-5.4714808181200478,-116.75531437020159,63.244685629798411,null,82702.75,6839744857.5625,null,22.312685993940736,-17.09237336788453,null,-0.98280606988056052,-94.00916123880998,null,0,0]
[83176,83.176000000000002,14.783745326705597,1.5031027807810091,1.0013646760425716,5.2213521182273251E-2,1,0,1121.3129350382046,1.5699045149720707,8.5251387901816464,1.453225509289426,1.0167919649188863,0.18199070493205105,1.1016467606360447,0.4329501029294916,1.0042295908834833,9.1812162881256654E-2,0.99035379159595227,0.19109083658713613,-5.513785104504441,-116.87929257510851,63.120707424891492,null,83176,6918246976,null,22.31038570782113,-17.11251390616961,null,-1.0310788617981377,-94.078529663435816,null,0,0]
[83660.5,83.660499999999999,14.869467729754508,1.5034936257435323,1.0013806098245095,5.2517107511492842E-2,1,0,1127.8445750088015,1.5699096796866139,8.5741163815234351,1.4539001893333106,1.0169865223222274,0.18302734940257401,1.1027790217010833,0.43516621582553938,1.0042789038294482,9.234394206411943E-2,0.99024510125968046,0.19223917460278925,-5.5567683817642362,-117.00644821768589,62.993551782314114,null,83660.5,6999079260.25,null,22.308033734757949,-17.133548856519614,null,-1.0802063360337919,-94.149324136682438,null,0,0]
[84145,84.144999999999996,14.955192378220158,1.5038799900402047,1.0013966358954083,5.2820684151669794E-2,1,0,1134.3762150091368,1.5699147849251993,8.6230978314080868,1.4545672049599079,1.0171821721928231,0.18406359619963322,1.1039166875608786,0.43737777183554899,1.0043285007466041,9.287566887546124E-2,0.99013587411049775,0.19338812771986419,-5.5994249652955377,-117.13383412429066,62.866165875709342,null,84145,7080381025,null,22.305684530825577,-17.154996752900619,null,-1.1290408205432909,-94.219897684542829,null,0,0]
[84629.5,84.629499999999993,15.040919233709769,1.5042619501683585,1.0014127542508371,5.3124251047316134E-2,1,0,1140.9078550386992,1.569919831709317,8.6720830744544095,1.455226685450594,1.0173789139004041,0.18509944332784145,1.1050597415226213,0.43958476343366593,1.0043783815928826,9.3407343022389011E-2,0.99002611182132638,0.19453769952497657,-5.6417586221947218,-117.26144764577636,62.738552354223643,null,84629.5,7162152270.25,null,22.303337840671347,-17.176850132235192,null,-1.1775855840179137,-94.290254898668465,null,0,0]
[85114,85.114000000000004,15.126648258699914,1.5046395808963644,1.0014289648863397,5.3427808142954621E-2,1,0,1147.4394950969897,1.5699248210371988,8.721072046745169,1.4558787572084468,1.0175767468116721,0.18613488879678106,1.1062081668836021,0.44178718330292621,1.0044285463259834,9.3938964212186796E-2,0.9899158160756486,0.19568789360477468,-5.6837730570645757,-117.38928619779362,62.610713802206376,null,85114,7244392996,null,22.300993416439496,-17.199101695312386,null,-1.2258438404839493,-94.360400271649837,null,0,0]
[85609.5,85.609499999999997,15.214325865626728,1.5050213834851836,1.0014456390070186,5.3738246949673441E-2,1,0,1154.119428354024,1.5699298652307307,8.7711770478534099,1.4565380993296646,1.017780199268935,0.18719342532092356,1.1073882041798688,0.44403487050453677,1.0044801435737076,9.4482600153782098E-2,0.9898024661996585,0.19686484884694891,-5.7264150011392676,-117.5202572980207,62.479742701979305,null,85609.5,7328986490.25,null,22.298597857794515,-17.22226286083211,null,-1.2749046990410398,-94.431923683308398,null,0,0]
[86105,86.105000000000004,15.302005664978951,1.5053988107054173,1.0014624096360503,5.4048675389005103E-2,1,0,1160.7993616400854,1.5699348513696543,8.8212858187552836,1.4571899510269484,1.017984791691886,0.18825153754543611,1.1085738241825538,0.44627776121317225,1.0045320376549831,9.5026180087595169E-2,0.98968856196461874,0.1980424625285338,-5.7687307070681149,-117.65145849552606,62.348541504473943,null,86105,7414071025,null,22.296204167710563,-17.245825559168392,null,-1.3236725230547446,-94.503234724619773,null,0,0]
[86600.5,86.600499999999997,15.389687619283816,1.5057719372339184,1.0014792767685867,5.4359093401642571E-2,1,0,1167.4792949546761,1.5699397804504773,8.8713982955714421,1.4578344386766098,1.0181905233933406,0.18930922335748065,1.1097650089987658,0.4485158482721055,1.0045842285238087,9.5569703701097533E-2,0.98957410520566846,0.19922073848608826,-5.8107239440429996,-117.78288722512971,62.217112774870287,null,86600.5,7499646600.25,null,22.293812103807802,-17.269782485530921,null,-1.3721505808772358,-94.57433789746915,null,0,0]
[87096,87.096000000000004,15.477371691916796,1.5061408360601238,1.0014962403997518,5.4669500928290829E-2,1,0,1174.1592282973088,1.5699446534470309,8.9215144158531086,1.4584716858400988,1.0183973936828443,0.19036648064973796,1.110961740728551,0.45074912474772333,1.0046367161339302,9.6113170681958654E-2,0.98945909776956542,0.20039968055615487,-5.8523984190246727,-117.91454098525271,62.085459014747286,null,87096,7585713216,null,22.291421430870141,-17.294126495426017,null,-1.4203420862193799,-94.645237607058235,null,0,0]
[87603.25,87.603250000000003,15.567137210761629,1.5065141779501183,1.0015137062497508,5.4987258355414854E-2,1,0,1180.9975657386758,1.5699495848976177,8.972822671133283,1.4591166703753644,1.0186103482581912,0.19144836305196414,1.1121925781443316,0.4530303697930691,1.0046907557361346,9.6669466135149623E-2,0.98934079463440228,0.20160727337458967,-5.8947347547168292,-118.04954725779966,61.950452742200341,null,87603.25,7674329410.5625,null,22.288975269430416,-17.319441450615543,null,-1.4693828503854784,-94.717612334136547,null,0,0]
[88110.5,88.110500000000002,15.656904874538425,1.5068832388368549,1.0015312732188377,5.5305004667620027E-2,1,0,1187.8359032084329,1.5699544595677632,9.0241346167058545,1.4597543203068826,1.0188244945866936,0.19252979191863587,1.1134291906840341,0.45530655940447745,1.0047451062210926,9.7225701576185763E-2,0.98922191834958262,0.2028155724082637,-5.9367446994826008,-118.18478425140086,61.815215748599144,null,88110.5,7763460210.25,null,22.286530088839637,-17.34514740869189,null,-1.5181299561669517,-94.789782877786436,null,0,0]
[88617.75,88.617750000000001,15.746674646564099,1.5072480918352782,1.0015489413016923,5.5622739801331846E-2,1,0,1194.6742407060926,1.5699592784325045,9.0754501899768751,1.46038475952844,1.0190398319170273,0.19361076500704183,1.1146715591269545,0.45757768686064754,1.004799767538356,9.7781876670637341E-2,0.98910247093433323,0.20402458177303104,-5.9784320369035875,-118.3202494784567,61.679750521543298,null,88617.75,7853105615.0625,null,22.284085658557196,-17.371237198431537,null,-1.5665866812638649,-94.861753666649278,null,0,0]
[89125,89.125,15.836446490986477,1.5076088084070103,1.0015667104929629,5.594046369298928E-2,1,0,1201.5125782311788,1.5699640424446806,9.1267693297557688,1.4610081091704661,1.0192563594943271,0.19469128008062123,1.1159196642487184,0.45984374567902475,1.0048547396371994,9.8337991084296514E-2,0.98898245442071753,0.20523430558466499,-6.0198004883259193,-118.45594051402564,61.544059485974358,null,89125,7943265625,null,22.281641754915029,-17.39770380602031,null,-1.6147562485485074,-94.933529034632627,null,0,0]
[89644,89.644000000000005,15.928299929622245,1.5079736722487205,1.0015849959349776,5.626553567711217E-2,1,0,1208.5093198569502,1.5699688610090019,9.1792808612561636,1.4616386838624715,1.0194791338742655,0.19579634795706036,1.1172025981192915,0.46215704313032574,1.0049113067265858,9.890692424526501E-2,0.98885907093804604,0.20647279533966725,-6.0618009695193482,-118.59500596287312,61.404994037126883,null,89644,8036046736,null,22.279141559157626,-17.425166346326385,null,-1.6637477142387294,-95.006769176146861,null,0,0]
[90163,90.162999999999997,16.020155464406834,1.5083343520633234,1.0016033872124057,5.6590595757746574E-2,1,0,1215.5060615104585,1.5699736240997213,9.2317960011399656,1.4622620847424059,1.0197031526717868,0.19690093163671399,1.1184914967928528,0.46446502143144763,1.0049681990539507,9.9475793174517879E-2,0.98873509603141874,0.20771204174074956,-6.1034753085392355,-118.73430286042513,61.265697139574868,null,90163,8129366569,null,22.276641462056222,-17.453008994952064,null,-1.7124452199648401,-95.079813625212907,null,0,0]
[90682,90.682000000000002,16.112013059489438,1.5086909193179254,1.0016218843194171,5.691564386685577E-2,1,0,1222.502803191227,1.5699783326693137,9.2843146881765595,1.4628784330621178,1.0199284150669132,0.19800502874410694,1.1197863396725445,0.46676767440417349,1.0050254165640611,0.10004459751480911,0.9886105319192624,0.20895204919600319,-6.1448272982969208,-118.87382880219131,61.126171197808688,null,90682,8223225124,null,22.274141244919395,-17.481224723146234,null,-1.7608520474440632,-95.152666733057544,null,0,0]
[91201,91.200999999999993,16.203872679831399,1.5090434438632843,1.001640487250149,5.7240679936418147E-2,1,0,1229.4995448987911,1.5699829876485729,9.3368368625089033,1.4634878473668718,1.0201549202358409,0.19910863691060143,1.1210871061618952,0.46906499612464997,1.0050829592013806,0.10061333690914102,0.98848538083415916,0.21019282211335519,-6.185860669577349,-119.01358144526243,60.986418554737568,null,91201,8317622401,null,22.271640695634723,-17.509806656383176,null,-1.8089714235035437,-95.225332758287351,null,0,0]
[91732,91.731999999999999,16.29785828235698,1.5094000064672615,1.0016596298224913,5.7573218759578847E-2,1,0,1236.6580610083538,1.5699876957427807,9.3905769705236395,1.4641042966949591,1.0203879478633127,0.20023725353672653,1.1224240573341133,0.47140991162083051,1.0051421687362689,0.10119515875943183,0.98835673093834897,0.21146308023333144,-6.2275168625977422,-119.15679760706821,60.843202392931786,null,91732,8414759824,null,22.269081771879144,-17.539421434926854,null,-1.8579091976789199,-95.299489648787699,null,0,0]
[92263,92.263000000000005,16.391845933180388,1.5097524801946252,1.0016788831561871,5.7905744836009937E-2,1,0,1243.8165771450128,1.5699923496441617,9.4443206064375147,1.4647137303474107,1.0206222746414624,0.20136535335639991,1.1237671655944563,0.47374923474470831,1.005201718488381,0.10177691187052867,0.98822747138607137,0.21273414895601972,-6.2688472408679194,-119.30024630328498,60.699753696715021,null,92263,8512461169,null,22.266522071393386,-17.569405466226552,null,-1.9065527371522255,-95.373459438362985,null,0,0]
[92794,92.793999999999997,16.485835597268874,1.5101009348920071,1.0016982472448497,5.8238258092911346E-2,1,0,1250.975093308303,1.5699969502830462,9.4980677103639906,1.4653162669673123,1.0208578996756725,0.2024929338552357,1.1251164088928434,0.47608295996630945,1.0052616083972552,0.10235859586090945,0.98809760461452811,0.21400603300155543,-6.3098556072404755,-119.44392521424066,60.556074785759336,null,92794,8610726436,null,22.263961386997345,-17.599751861774479,null,-1.954905327283361,-95.447246403545407,null,0,0]
[93325,93.325000000000003,16.579827240383338,1.5104454388261408,1.0017177220820561,5.8570758457499955E-2,1,0,1258.1336094977698,1.5700014985685915,9.5518182237606126,1.4659120225475022,1.0210948220671974,0.20361999252644472,1.1264717651843577,0.47841108202599419,1.0053218384020994,0.10294021034932983,0.98796713307653006,0.21527873708980255,-6.350545702538227,-119.58783208076358,60.412167919236424,null,93325,8709555625,null,22.261399517808094,-17.630453884132983,null,-2.0029701984942481,-95.520854730329148,null,0,0]
[93868.5,93.868499999999997,16.676033507328022,1.5107940308283647,1.0017377700495662,5.8911072616408322E-2,1,0,1265.460640690093,1.5700061006338277,9.6068375216369155,1.4665148985019585,1.0213386643128972,0.20477303970393132,1.1278653347658545,0.48078820144470696,1.0053838383861931,0.10353544395459059,0.98783296646232055,0.21658225540757087,-6.3918679056786925,-119.73536035726825,60.264639642731751,null,93868.5,8811295292.25,null,22.25877591073306,-17.662240052173569,null,-2.0518718973545509,-95.596015114026599,null,0,0]
[94412,94.412000000000006,16.772241777436697,1.5111386237127433,1.0017579340274094,5.925137311463638E-2,1,0,1272.7876719089088,1.5700106497138313,9.66186027144124,1.467110908106606,1.0215838637972423,0.20592553490672824,1.1292652618215793,0.48315944050227844,1.0054461945368374,0.10413060393984108,0.98769817152351691,0.21788664283571052,-6.4328644141612337,-119.88312284594097,60.116877154059026,null,94412,8913625744,null,22.256150655885936,-17.694384971428939,null,-2.1004788489965649,-95.670996944205058,null,0,0]
[94955.5,94.955500000000001,16.868452016434567,1.5114792858243649,1.0017782140085805,5.9591659874194791E-2,1,0,1280.1147031537621,1.5700151467184211,9.7168864145330236,1.4677001675855463,1.0218304195431791,0.20707747547170682,1.1306715227372466,0.48552479442450158,1.0055089067877698,0.10472568989718758,0.98756275094123191,0.21919190443427322,-6.4735390465028448,-120.03111731073722,59.968882689262784,null,94955.5,9016546980.25,null,22.253523557020287,-17.726881882291355,null,-2.1487943464988772,-95.745804431137742,null,0,0]
[95499,95.498999999999995,16.964664190823648,1.5118160839615851,1.0017986099860343,5.9931932817113266E-2,1,0,1287.4417344242088,1.5700195925367051,9.7719158935889556,1.4682827905638611,1.0220783305691956,0.20822885874418895,1.1320840939093282,0.48788425872424956,1.0055719750723664,0.10532070141904754,0.98742670741382255,0.22049804526290279,-6.5138955591632985,-120.17934157513616,59.820658424863836,null,95499,9120059001,null,22.250894423927157,-17.759724173363441,null,-2.1968216278702157,-95.820441696452079,null,0,0]
[96611.5,96.611500000000007,17.161608532646476,1.5124937058342551,1.0018407205744198,6.0628400257188388E-2,1,0,1302.4395675994815,1.5700285367775115,9.8845669000594434,1.4694551415040353,1.0225900062888307,0.21058389705057581,1.1349950900937755,0.49269550541789259,1.0057021806588688,0.10653840745449178,0.98714630630516043,0.22317437166576728,-6.5955254948788582,-120.48345226427401,59.516547735725993,null,96611.5,9333781932.25,null,22.245505690854067,-17.827999635258042,null,-2.2942441051883069,-95.972704132634789,null,0,0]
[97724,97.724000000000004,17.358560575776742,1.5131559512680597,1.0018833170815844,6.1324808812418807E-2,1,0,1317.4374008765767,1.5700372773741342,9.9972311857675109,1.4706010702572392,1.02310734781152,0.21293656671060096,1.1379322244782144,0.49748202567028194,1.0058338771212203,0.10775579641982096,0.98686333004887561,0.2258544465116902,-6.6758688994210829,-120.78849952733539,59.211500472664611,null,97724,9549980176,null,22.240106159689475,-17.897641595561176,null,-2.3904989045776865,-96.124303707585895,null,0,0]
[98862,98.861999999999995,17.560034723247959,1.5138180059112734,1.0019273926468069,6.2037118369459382E-2,1,0,1332.7790048159466,1.5700460147850175,10.112491165382467,1.471746845275673,1.0236424006361942,0.21534068863723474,1.1409635152342383,0.50235264768807419,1.0059701341603895,0.10900075789537875,0.98657122806899944,0.22859987581279226,-6.7567539859770154,-121.10149070260516,58.898509297394838,null,98862,9773695044,null,22.234570215994218,-17.970240179414805,null,-2.4877786978541065,-96.278725825204958,null,0,0]
[100000,100,17.761516392952263,1.5144650405076887,1.0019719765299895,6.2749364897807955E-2,1,0,1348.1206088547481,1.5700545533325398,10.227764121453857,1.4728667946114642,1.0241833637098388,0.21774228476772473,1.1440217292094568,0.50719734370486891,1.00610794995819,0.11024538023207998,0.98627648229205156,0.23134931916401855,-6.8363552254726914,-121.41542790247964,58.584572097520365,null,100000,10000000000,null,22.22902007014693,-18.044162354398189,null,-2.583890249490628,-96.432520956942597,null,0,0]
[101165,101.16500000000001,17.967785911322231,1.5151123947107394,1.0020181446836049,6.3478444034436601E-2,1,0,1363.8262053560038,1.5700630954743093,10.345785013697963,1.4739874620297466,1.0247432740616995,0.2201982196509496,1.1471801660056309,0.51213010824305538,1.0062506495537451,0.11151917708928979,0.98597203211410722,0.23416820183468073,-6.9165465127544206,-121.73777700407454,58.262222995925455,null,101165,10234357225,null,22.223322139278036,-18.1211569734199,null,-2.6810988715067414,-96.589348543318295,null,0,0]
[102330,102.33,18.174062788485397,1.5157450541434323,1.0020648454171206,6.4207455601805283E-2,1,0,1379.5318019545095,1.5700714431161302,10.463818606057259,1.4750828481729212,1.0253093584993094,0.22265145742094755,1.1503663625075897,0.51703566681025304,1.0063949813852224,0.11279261064984761,0.98566486705753509,0.23699138968529052,-6.9954549540290341,-122.061085014562,57.938914985438004,null,102330,10471428900,null,22.217606586672325,-18.199434425576516,null,-2.7771368753727597,-96.745584721445383,null,0,0]
[103520,103.52,18.384773547879512,1.5163766325931687,1.0021130980805295,6.4952040638591668E-2,1,0,1395.574428619929,1.5700797759144371,10.58439777817088,1.4761765163489307,1.0258939542876739,0.22515452919191062,1.1536493528052909,0.52201839686405349,1.0065440948876792,0.11409299190544527,0.98534833754150253,0.23987965744701509,-7.0747636591960692,-122.39230527423859,57.607694725761405,null,103520,10716390400,null,22.211748884582597,-18.280664737465269,null,-2.8740540726616763,-96.90459547398244,null,0,0]
[104710,104.71,18.595491474602341,1.5169938976104902,1.0021619062686511,6.5696553561211041E-2,1,0,1411.6170553800482,1.5700879193129744,10.704989325178129,1.4772455454679443,1.0264849703348149,0.22765473424098381,1.1569608224818726,0.52697272605684142,1.0066949099416518,0.11539298573314528,0.98502903654426588,0.24277252205431762,-7.1527965138793004,-122.72449513527505,57.275504864724951,null,104710,10964184100,null,22.205870234013318,-18.363131660459704,null,-2.9698034512746267,-97.063053638939266,null,0,0]
[105930,105.93,18.811528806464086,1.517612367736765,1.002212521538806,6.6459760000140797E-2,1,0,1428.0641182038803,1.5700960780672817,10.828633409197204,1.4783168055102589,1.0270975394248181,0.23021496611932762,1.1603850847084221,0.53202247151684179,1.006851292691914,0.11672534589636482,0.98469884176914901,0.24574314362095181,-7.2315036491213327,-123.06605116246764,56.933948837532355,null,105930,11221164900,null,22.199820408805326,-18.448910924763926,null,-3.066781274715733,-97.224964937565545,null,0,0]
[107150,107.15,19.02757317043935,1.5182167935258291,1.0022637205226275,6.7222888909267073E-2,1,0,1444.511181120607,1.5701040510320337,10.952289639543624,1.4793638767252244,1.0277168328692932,0.23277212919456516,1.1638387621151911,0.53704237423729873,1.0070094622311037,0.11805728987959468,0.98436580154144315,0.24871870947678459,-7.3089329606236406,-123.40859681300307,56.591403186996928,null,107150,11481122500,null,22.193746154398212,-18.535889632364466,null,-3.1625855362207949,-97.386359283977313,null,0,0]
[108400,108.4,19.248937146765346,1.5188220096724099,1.002316783824879,6.8004701953470748E-2,1,0,1461.3626801037656,1.5701120339142465,11.078998769596277,1.4804124518249688,1.0283583165536223,0.23538896126451717,1.1674076020660633,0.54215477830931891,1.0071733735401516,0.11942155019141043,0.984021656985552,0.25177263277997647,-7.3869727863486156,-123.76057792197521,56.239422078024788,null,108400,11750560000,null,22.187496043623835,-18.626201523511671,null,-3.2595555531996063,-97.551217943486336,null,0,0]
[109650,109.65,19.470308013395751,1.5194134638226711,1.0023704597097753,6.8786431744915888E-2,1,0,1478.2141791779279,1.5701198347882852,11.20571980562341,1.4814373121914877,1.0290068334323104,0.23800251277070142,1.171006767725099,0.54723588789319266,1.0073391587944451,0.12078536398805671,0.98367459990134987,0.25483186770920535,-7.4637348935712202,-124.11356991098427,55.886430089015732,null,109650,12023122500,null,22.181218025222506,-18.717673778027784,null,-3.3553477826818243,-97.715597202474001,null,0,0]
[110925,110.925,19.696113154811474,1.5200030502524047,1.0024258400929524,6.9583709388302495E-2,1,0,1495.4027083241356,1.5701276105561446,11.334987113790664,1.4824590615014701,1.029675552462979,0.24066492510718468,1.1747088691543939,0.55238640760855318,1.007510189332802,0.12217598902924903,0.98331764111214248,0.25795782292012442,-7.5407478040511577,-124.47464980243475,55.525350197565245,null,110925,12304355625,null,22.174784627653828,-18.812122363838174,null,-3.45186954529676,-97.882801413213372,null,0,0]
[112200,112.2,19.921924987628405,1.5205792711429436,1.0024818575991221,7.0380898436504219E-2,1,0,1512.5912375587041,1.5701352096020851,11.464265988496829,1.4834577679517476,1.0303515607821683,0.24332386268100961,1.1784419368124226,0.5575044307543261,1.0076831675690792,0.12356613933042383,0.98295773357182858,0.26108943307952093,-7.6164949313986874,-124.83675523494514,55.163244765054856,null,112200,12588840000,null,22.16832010481129,-18.907681993603624,null,-3.5472198371263017,-98.049568915776788,null,0,0]
[113510,113.51,20.153942309682833,1.5211578607521503,1.0025400763260144,7.1199877779734758E-2,1,0,1530.2516088611642,1.5701428394432848,11.597105335649259,1.4844606974273966,1.0310537033034533,0.24605213925510036,1.1823094254904132,0.5627291448750239,1.0078629218044717,0.12499395076426895,0.9825849190247854,0.26431296719096559,-7.6930351572224911,-125.20985641311323,54.790143586886771,null,113510,12884520100,null,22.161644710865559,-19.006974258352024,null,-3.6439946389747724,-98.220490498476494,null,0,0]
[114820,114.82,20.385966225014368,1.5217232800527152,1.0025989674054132,7.2018761461053779E-2,1,0,1547.9119802506739,1.5701502951843669,11.72995608373577,1.4854409099796122,1.0317635099869362,0.24877668222411572,1.186208977458223,0.56791964838583275,1.0080447299798436,0.12642125007471378,0.98220908199235935,0.26754260990728435,-7.768303574748475,-125.5840154950928,54.4159845049072,null,114820,13183632400,null,22.154934505768743,-19.107344211922786,null,-3.7395872408571988,-98.391012956377466,null,0,0]
[116155,116.155,20.622424630466583,1.5222863999654683,1.0026596739593798,7.2853173156290973E-2,1,0,1565.9093817150417,1.5701577201937442,11.865353484323915,1.4864172456353399,1.0324947311850452,0.25154934526329265,1.1902156090225327,0.5731740712129586,1.0082321197364095,0.12787525531255467,0.9818230113132751,0.27084024441215077,-7.8437321825829471,-125.96639173626528,54.03360826373472,null,116155,13491984025,null,22.148059513596337,-19.210691611436459,null,-3.835815048616682,-98.564409621928235,null,0,0]
[117490,117.49,20.858889427107908,1.5228367525398436,1.0027210785231915,7.3687483237060647E-2,1,0,1583.9067832637772,1.5701649764673393,12.000761940114815,1.4873715495654263,1.0332338785816551,0.25431806258682288,1.1942548801843496,0.57839309375761339,1.008421640233176,0.12932871709729354,0.98143390031455946,0.27414437028038458,-7.9179041962299781,-126.34984386212484,53.650156137875157,null,117490,13803900100,null,22.141146583097637,-19.315065595144063,null,-3.9308692348515861,-98.737452522678296,null,0,0]
[118860,118.86,21.101560094735834,1.523388709817417,1.0027848185095498,7.4543559771949375E-2,1,0,1602.3760268854153,1.5701722535136362,12.139731536113667,1.4883287383746941,1.0340006271734377,0.25715523017111092,1.1984336380952352,0.58371221882275393,1.0086183434379761,0.13081971349286198,0.98103148023719977,0.27754194794573017,-7.9927467545198656,-126.74445682693504,53.255543173064964,null,118860,14127699600,null,22.13401213093567,-19.423197388690578,null,-4.0272225487864652,-98.91469463376022,null,0,0]
[120230,120.23,{"$f":"SQRT(1+(A589/pole1)^2)","v":21.344237044915765},{"$f":"ATAN(A589/pole1)","v":1.5239281161110634},{"$f":"SQRT(1+(A589/Zero1)^2)","v":1.0028492933101096},{"$f":"ATAN(A589/Zero1)","v":7.5399526856995511E-2},{"$f":"IF(VIN_nom>Vout, 1, SQRT(1+(A589/z_RHP)^2))","v":1},{"$f":"IF(VIN_nom>Vout, 0, -ATAN(A589/z_RHP))","v":0},{"$f":"SQRT(1+(A589/Pole2)^2)","v":1620.845270589974},{"$f":"ATAN(A589/Pole2)","v":1.570179364718636},12.278712002886701,1.4892642595393368,{"$f":"SQRT(1+(A589/pole4)^2)","v":1.0347756866001276},{"$f":"ATAN(A589/pole4)","v":0.25998817038564248},{"$f":"SQRT(1+(A589/Zero3)^2)","v":1.2026460672095671},{"$f":"ATAN(A589/Zero3)","v":0.58899423056669298},{"$f":"SQRT(1+(A589/pole5)^2)","v":1.0088172879949062},{"$f":"ATAN(A589/pole5)","v":0.13231012513455023},{"$f":"SQRT((1-(Z589/pterm2))^2+(A589/pterm1)^2)","v":0.98062596743382113},{"$f":"IF((ATAN((A589/pterm1)/(1-A589^2/pterm2))>0),ATAN((A589/pterm1)/(1-A589^2/pterm2)),PI()+ATAN((A589/pterm1)/(1-A589^2/pterm2)))","v":0.28094652022613853},{"$f":"20*LOG10(((E589*K589*G589*O589)/(C589*I589*S589*M589*Q589))*Adc)","v":-8.0663308565006258},{"$f":"((F589+L589+H589+R589)-(D589+J589+T589+N589+T589))*radconv","v":-127.14018172426411},{"$f":"IF(V589>0,V589,V589+180)","v":52.85981827573589},null,{"$f":"IF(U589<0,A589,1000000000)","v":120230},{"$f":"A589^2","v":14455252900},null,{"$f":"20*LOG10((K589/(I589*M589))*AEA)","v":22.126836081368641},{"$f":"(L589-(J589+N589))*radconv","v":-19.532318934375372},null,{"$f":"20*LOG10((E589*G589/(C589*S589))*Acs*Am)","v":-4.1223944240941028},{"$f":"(F589+H589-(D589+T589))*radconv","v":-99.091624659370495},null,{"$f":"SUM((U590<0)*(U589>0))*A589","v":0},0]
[126030,{"$f":"A590/1000","v":126.03},22.371693406898707,1.5260820851510124,1.0031303895746624,7.9022088222292494E-2,1,0,1699.0362301955795,1.5702077577932689,12.867208782198654,1.4930009465786442,1.0381485984250476,0.27193398757506659,1.2208446559446144,0.61094719821766286,1.0096843347855584,0.13861327480304633,0.97887624726352196,0.29543936887934302,-8.3646167358738275,-128.82762714680055,51.172372853199448,null,126030,15883560900,null,22.095979019283064,-20.004294249333828,null,-4.5128126193499023,-99.837859579105938,null,0,0]
[131830,131.83000000000001,23.399244448671208,1.5280468844806123,1.00342464239381,8.2642572454555835E-2,1,0,1777.2271910503678,1.5702336525021541,13.45586950757132,1.4964107363443833,1.0416686850229853,0.28380075239545582,1.2396141719203342,0.63224537807576653,1.0105914262657296,0.1449053588653339,0.97707655370380986,0.31006507315033877,-8.6430816179449792,-130.53426842039272,49.465731579607279,null,131830,17379148900,null,22.064319481144597,-20.490326885498913,null,-4.8843406638003266,-100.58098694996345,null,0,0]
[144540,144.54,25.651274025905803,1.5318020269461732,1.0041154100051024,9.0568709391718114E-2,1,0,1948.5732485569647,1.5702831307707616,14.746325795443182,1.5029307411903299,1.0498898428537931,0.30951674876327717,1.2826181435765156,0.67668119533895632,1.0127187018858521,0.15865273056554338,0.97298120810782307,0.34260942591573301,-9.1931281258162372,-134.33961398195132,45.660386018048683,null,144540,20891811600,null,21.992002390405673,-21.593011080500069,null,-5.6400225930093146,-102.20666063266791,null,0,0]
[158490,158.49,28.123360232868308,1.535231201011195,1.0049460758257571,9.9254975818170832E-2,1,0,2136.6359991682152,1.5703283013395091,16.163280991023658,1.5088881624546486,1.0596989298596868,0.33726189242921689,1.3325319191911431,0.72205203533692586,1.0152728346281108,0.17367182761771424,0.96830010331157546,0.37917049643661938,-9.7176327575160766,-138.61839660125025,41.381603398749746,null,158490,25119080100,null,21.907865016809186,-22.843943703692421,null,-6.3901159693829834,-104.00024646522387,null,0,0]
[173780,173.78,30.83322452587063,1.5383580914141635,1.0059434775958762,0.10875834394662852,1,0,2342.7635629639585,1.5703694804642745,17.716893616221999,1.5143230104926213,1.0713688507643213,0.36706307781217745,1.3901500162108322,0.76793475887779805,1.0183339620048661,0.19004296208587229,0.96303704319338734,0.42034728252733167,-10.217107318532987,-143.43201422998877,36.567985770011234,null,173780,30199488400,null,21.809937321542485,-24.242391387403302,null,-7.1331945621289803,-105.99415726258336,null,0,0]
[190550,190.55,33.805679308288411,1.5412111826567494,1.0071416673127076,0.11915890139575827,1,0,2568.8433080881628,1.5704070465215114,19.421389431605242,1.5192839262510445,1.0852371671971135,0.39898039702032323,1.4564269292595748,0.81397787986465275,1.0220031995270433,0.20788064727438549,0.95724078403958368,0.46695233295703287,-10.694487564383996,-148.86473811124526,31.135261888754741,null,190550,36309302500,null,21.69589576354976,-25.789031914224211,null,-7.8698333273527989,-108.23199199910411,null,0,0]
[208930,208.93,37.063766875547707,1.5438125243137877,1.0085797033967259,0.13052820707101837,1,0,2816.6277907037907,1.5704412923014117,21.289981848673609,1.5238085897226537,1.101672415861739,0.43300048465785279,1.5322870273884928,0.85976011680870257,1.0263953363505127,0.22727747459241762,0.95105958498171517,0.51990419190391024,-11.153735942041788,-155.01077597220018,24.989224027799821,null,208930,43651744900,null,21.563402411722791,-27.480957374467355,null,-8.6003685477187233,-110.76354270385828,null,0,0]
[229090,229.09,40.63762189754349,1.5461861034530013,1.0103064649550844,0.14295955510421102,1,0,3088.4088150565603,1.5704725354585301,23.339954043329868,1.527938221763768,1.1211193990372481,0.46912182934903818,1.6188193978497423,0.90493825736053057,1.0316528293523617,0.24835401487977912,0.94478212205135526,0.58039363279679612,-11.601743939566369,-161.99327101785545,18.006728982144551,null,229090,52482228100,null,21.409802216106755,-29.3157375918498,null,-9.327563778956554,-113.65306466648549,null,0,0]
[251190,251.19,44.55560837934307,1.5483505784387224,1.0123781243114722,0.15653611059595224,1,0,3386.3433734037121,1.5705010230101748,25.587575911785322,1.5317049045067768,1.1440571732324025,0.50725309370771754,1.7170693660849419,0.94913355100714558,1.0379370619396906,0.27120212861199317,0.93894114099369053,0.64975621385556015,-12.047786018765709,-169.94925050118835,10.050749498811655,null,251190,63096416100,null,21.232543746891054,-31.286315301890202,null,-10.055387273272007,-116.97338377262227,null,0,0]
[275420,275.42,48.851410306896724,1.5503246588260327,1.01486295529468,0.17135443245853282,1,0,3712.9928940737236,1.5705270022794402,{"$f":"SQRT(1+(A599/Zero2)^2)","v":28.052170902889621},{"$f":"ATAN(A599/Zero2)","v":1.5351409074794204},1.1710370771267502,0.54727836494259408,1.8282041409871168,0.99203804030701892,1.0454416018750934,0.29592231458607993,0.93442789157749473,0.72957696440360587,-12.50554852105517,-179.04165075622518,0.95834924377481912,null,275420,75856176400,null,21.028969542711828,-33.38421445366906,null,-10.791737364580232,-120.81085507339689,null,0,0]
[302000,302,53.564032200060254,1.5521259978791944,1.0178437482784835,0.18752276574285442,1,0,4071.3232414735562,1.5705507064030131,30.756116989167378,1.5382767380560949,1.2026877527542217,0.58904610749848818,1.9535222682236635,1.0334060284033735,1.0543975288479777,0.32261715233419075,0.93267776966106908,0.82162439789121555,-12.99450611403762,-189.4516436615032,-9.4516436615031978,null,302000,91204000000,null,20.796395924679452,-35.599018113367805,null,-11.549902872304202,-125.2616163985996,null,0,0]
[331130,331.13,58.728933975802953,1.5537681217763175,1.0214141818139337,0.20512872903707269,1,0,4464.0306559898381,1.5705723139944867,33.719759966436861,1.5411357764008742,1.2396530053935519,0.63228813934313677,2.0942170672336768,1.0729829861020934,1.0650600136522554,0.35133465069350911,0.93591265004438517,0.92747670980387287,-13.540786354986674,-201.33638616268141,-21.336386162681407,null,331130,109647076900,null,20.532678667322216,-37.914031231456725,null,-12.349138415598247,-130.41184650650399,null,0,0]
[363080,363.08,64.393988019955316,1.5552663025049958,1.0256915947621452,0.22429151418149529,1,0,4894.7550621643722,1.5705920264786895,36.970569228976856,1.5437444853357949,1.2826980104101862,0.6767587136741624,2.2518064166644045,1.1106403023600127,1.077743224232419,0.38215056828615473,0.94742717462291615,1.0484426102886826,-14.180328181024443,-214.81996565586505,-34.819965655865047,null,363080,131827086400,null,20.235550340117506,-40.313668886088792,null,-13.218914645042403,-136.33057479625592,null,0,{"$f":"IF(AH602>0,W602,0)","v":0}]
[398110,398.11,70.605294986577263,1.556632609525243,1.0308103436415237,0.24511031994862817,1,0,5367.0015725362928,1.5706100030175936,40.534999073263783,1.5461237848979854,1.3326068474001025,0.72211587595807625,2.4277548005110541,1.1462546240732037,1.0927959569743499,0.41508037135781067,0.97186787892265769,1.1846415983179968,-14.957242709195082,-229.88941536002346,-49.889415360023463,null,398110,158491572100,null,19.90346338671527,-42.777149015160575,null,-14.196742034740851,-143.0196559127518,null,0,0]
[436520,436.52,77.416049049426775,1.5578787493228461,1.0369310537560774,0.26769076165472888,1,0,5884.8145477423586,1.5706263979047506,44.44357560812788,1.5482939879564113,1.3902412041801413,0.76800267982301396,2.6237192862727974,1.1797690684641207,1.1106234753249131,0.45011940606476081,1.0154040438580916,1.3344072788858106,-15.920839738148054,-246.32706001726206,-66.327060017262056,null,436520,190549710400,null,19.535256391667332,-45.28286509673481,null,-15.325827604198288,-150.37823187538552,null,0,0]
[478630,478.63,84.882991700249718,1.5590151311383174,1.0442412531478737,0.29212830862429479,1,0,6452.5079724754878,1.5706413482953321,48.728861818199661,1.5502731672925556,1.4565078366485933,0.81403033971503935,2.8414555030755451,1.2111616442115094,1.1316822197910756,0.48721466367997279,1.0856228209292575,1.4936642920543015,-17.115921723651383,-263.64075796360299,-83.640757963602994,null,478630,229086676900,null,19.130433139068387,-47.807513723718067,null,-16.64540329853558,-158.16792817563356,null,0,0]
[524810,524.80999999999995,93.071731325522904,1.5600517190916117,1.0529642173797293,0.31852015381146959,1,0,7075.06989155054,1.5706549854345062,53.428510451319717,1.5520786349495286,1.5324004158344238,0.85982384846659088,3.0829769966404306,1.2404593435770541,1.1564966968565382,0.52628259423200296,1.1911781184843317,1.6562798595458319,-18.570869550732855,-281.10506307571308,-101.10506307571308,null,524810,275425536100,null,18.688936717753254,-50.328624180885541,null,-18.179045119888954,-166.03236465703955,null,0,0]
[575440,575.44000000000005,102.04965037596122,1.5609970183121833,1.063355704893217,0.34693557270361991,1,0,7757.6231618157899,1.5706674213322427,58.581193398599957,1.5537251728229522,1.6189314166823126,0.90499260974309259,3.3503519666574291,1.2677007500932076,1.1856398715080629,0.56716689885948346,1.3411801834614043,1.8151915425184044,-20.286798208019796,-297.89293281128886,-117.89293281128886,null,575440,331131193600,null,18.211556988805935,-52.822976424212385,null,-19.92382905661249,-173.56341149539364,null,0,0]
[630960,630.96,111.89477145564486,1.5618592397528872,1.0757173113253096,0.3774369846816864,1,0,8506.0995122642398,1.5706787640975801,64.231690060878094,1.5552270587194943,1.7172108804689654,0.94919258971201692,3.6459682228324573,1.2929600279135458,1.2197594278270572,0.60967563229858679,1.544984326313305,1.964337785350341,-22.239206178183242,-313.29713224959693,-133.29713224959693,null,630960,398110521600,null,17.699440469799093,-55.270046903190476,null,-21.852141659184042,-180.41066122174607,null,0,0]
[691830,691.83,122.68866437258731,1.5626455242916935,1.0903921569020147,0.41004912318325032,1,0,9326.7002959435413,1.5706891077388334,70.426816521070194,1.5565967128547908,1.8283770157184527,0.99209981817615744,3.9723257842183806,1.3163168446609415,1.2595529810857329,0.65354656655785737,1.8122106108091096,2.0997619114201518,-24.386324713222365,-326.85900786061359,-146.85900786061359,null,691830,478628748900,null,17.15442095894204,-57.650567253152936,null,-23.92003515481121,-186.34640498511067,null,0,0]
[758580,758.58,134.52531242515582,1.5633627130622796,1.1077797765985962,0.44477732419398341,1,0,10226.570550069899,1.5706985423033413,77.220514253799763,1.5578460381070618,1.9536853419481504,1.0334557662973036,4.3323061944829853,1.3378719177484903,1.3057959155542003,0.69848631123585903,2.1534879135355647,2.2199291475032874,-26.683193484775607,-338.40409442130164,-158.40409442130164,null,758580,575443616400,null,16.578496351484091,-59.94904803741661,null,-26.081287692767901,-191.28279299573896,null,0,0]
[831760,831.76,147.50224604557368,1.56401671707797,1.1283268332289353,0.48157174085015059,1,0,11213.124935913238,1.5707071455892077,84.668761294741856,1.5589853207631152,2.0944187719653864,1.0730353243593245,4.72890669415131,1.3577223350040581,1.3593039103161684,0.74414004398641864,2.5809739290127864,2.3250446454694957,-29.088573637142101,-347.96594237825371,-167.96594237825371,null,831760,691824697600,null,15.97419576447394,-62.152006515986407,null,-28.294374077432561,-195.23477428097388,null,0,0]
[912010,912.01,161.73295577098267,1.5646132556515449,1.1525478601219166,0.52035460691554181,1,0,12294.991422958921,1.5707149928625088,92.83669672985198,1.5600245159255015,2.2520226748724164,1.1106878976294907,5.1656199976619712,1.3759787108523687,1.4209769483353356,0.79014658077359234,3.1094850135247469,2.4163992833451493,-31.570649200956268,-355.70875863217248,-175.70875863217248,null,912010,831762240100,null,15.343909101360076,-64.250248173317317,null,-30.527987841826217,-198.28109407329029,null,0,0]
[1000000,1000,177.33625251964472,1.5651572919918213,1.1810098116194299,0.56098211559387845,1,0,13481.20241676868,1.5707221494351922,101.79251393108373,1.5609722636400398,2.4279942854133734,1.1462992096526083,5.6461112006707364,1.3927439743058465,1.4917508829919199,0.83611163802820521,3.7568776866220102,2.4956545786713087,-34.104739041489786,-361.84701489189592,-181.84701489189592,null,1000000,1000000000000,null,14.690326304856281,-66.236734154759645,null,-32.758848921460462,-200.5254742089065,null,0,0]
[]
[]
["Pole/Zero Locations for Chart"]
[{"$f":"Q4*1000","v":41929.75},null,{"$f":"SQRT(1+(A617/pole1)^2)","v":7.5024897156736445},{"$f":"ATAN(A617/pole1)","v":1.4371093828035528},{"$f":"SQRT(1+(A617/Zero1)^2)","v":1.0003469756098713},{"$f":"ATAN(A617/Zero1)","v":2.6339146259491502E-2},{"$f":"IF(VIN_nom>Vout, 1, SQRT(1+(A617/z_RHP)^2))","v":1},{"$f":"IF(VIN_nom>Vout, 0, -ATAN(A617/z_RHP))","v":0},{"$f":"SQRT(1+(A617/Pole2)^2)","v":565.2643300220069},{"$f":"ATAN(A617/Pole2)","v":1.5690272420172113},{"$f":"SQRT(1+(A617/Zero2)^2)","v":4.3835163260230239},{"$f":"ATAN(A617/Zero2)","v":1.3406424367407208},{"$f":"SQRT(1+(A617/pole4)^2)","v":1.0042938780386301},{"$f":"ATAN(A617/pole4)","v":9.250480674702817E-2},{"$f":"SQRT(1+(A617/Zero3)^2)","v":1.0267851471451539},{"$f":"ATAN(A617/Zero3)","v":0.2289132198253141},{"$f":"SQRT(1+(A617/pole5)^2)","v":1.001076541099104},{"$f":"ATAN(A617/pole5)","v":4.6380517494758605E-2},{"$f":"SQRT((1-(A617^2/(pole3^2)))^2+(A617/(Q*pole3))^2)","v":0.99748473441155727},{"$f":"ATAN((A617/(Q*pole3))/(1-A617^2/pole3^2))","v":9.5204650248927561E-2},{"$f":"20*LOG10(((E617*K617*G617*O617)/(C617*I617*S617*M617*Q617))*Adc)","v":2.0594603044084545E-3},{"$f":"((F617+L617+H617+R617)-(D617+J617+T617+N617+T617))*radconv","v":-107.46904239246985},{"$f":"IF(V617>0,V617,V617+180)","v":72.530957607530155},"crossover",null,null,null,{"$f":"20*LOG10((K617/(I617*M617))*AEA)","v":22.589739940646044},{"$f":"(L617-(J617+N617))*radconv","v":-18.385620479546692},null,{"$f":"20*LOG10((E617*G617/(C617*S617))*Acs*Am)","v":4.7893525517001416},{"$f":"(F617+H617-(D617+T617))*radconv","v":-86.28600516452633}]
[{"$f":"A617","v":41929.75},null,null,null,null,null,null,null,null,null,null,null,null,null,null,null,null,null,null,null,null,-180]
[{"$f":"A618","v":41929.75}]
[1000000]
[]
[{"$f":"pole1","v":5639.0945751864101},null,1.4142135623730951,0.78539816339744828,1.0000062769278073,3.5431327873560563E-3,{"$f":"IF(VIN_nom>Vout, 1, SQRT(1+(A622/z_RHP)^2))","v":1},{"$f":"IF(VIN_nom>Vout, 0, -ATAN(A622/z_RHP))","v":0},76.028351984694723,1.5576429595357755,1.1530240330388835,0.52107484164260709,1.0000778284569121,1.2475849431872521E-2,{"$f":"SQRT(1+(A622/Zero3)^2)","v":1.0004908393736431},{"$f":"ATAN(A622/Zero3)","v":3.1325347190108925E-2},{"$f":"SQRT(1+(A622/pole5)^2)","v":1.0000194820341299},{"$f":"ATAN(A622/pole5)","v":6.2420698239880256E-3},{"$f":"SQRT((1-(A622^2/(pole3^2)))^2+(A622/(Q*pole3))^2)","v":0.99995412258709371},{"$f":"ATAN((A622/(Q*pole3))/(1-A622^2/pole3^2))","v":1.275342862290652E-2},{"$f":"20*LOG10(((E622*K622*G622*O622)/(C622*I622*S622*M622*Q622))*Adc)","v":20.117654862935375},{"$f":"((F622+L622+H622+R622)-(D622+J622+T622+N622+T622))*radconv","v":-106.00657643003223},73.993423569967774,"p1",null,null,null,{"$f":"20*LOG10((K622/(I622*M622))*AEA)","v":28.452114974144568},{"$f":"(L622-(J622+N622))*radconv","v":-60.105791920065542},null,{"$f":"20*LOG10((E622*G622/(C622*S622))*Acs*Am)","v":19.258725675810506},{"$f":"(F622+H622-(D622+T622))*radconv","v":-45.527711131466951}]
[{"$f":"Zero1","v":1591549.4327375637},null,282.23669625648074,1.5672531940075405,1.4142135623730951,0.78539816339744828,1,0,21456.000023303499,1.570749719785236,162.00308639035245,1.5646235656901157,3.6605430829921728,1.2940954523132744,8.9003559479382641,1.4582035281086676,2.0257772806741072,1.0545286746184754,9.8157948619779063,-0.37543187329974431,-47.188756411133816,-15.852837841371345,164.14716215862865,"z1",null,null,null,{"$f":"20*LOG10((K623/(I623*M623))*AEA)","v":11.124115396784283},{"$f":"(L623-(J623+N623))*radconv","v":-74.497210564046554},null,-43.571906494883798,-23.286331636872973]
[{"$f":"Pole2","v":74.177359840490496},null,1.0000865117715718,1.3153367259121036E-2,1.0000000010861065,4.6607009660511238E-5,1,0,1.4142135623730951,0.78539816339744828,1.0000285033773921,7.5501920999562393E-3,1.0000000134672618,1.6411740717361048E-4,1.0000000849512811,4.121923703918381E-4,1.0000000033710292,8.2110038408302023E-5,0.99999999206056667,1.6774796365457605E-4,56.496025902790841,-45.342289132152402,134.65771086784758,"p2",null,null,{"$f":"Pole2","v":74.177359840490496},{"$f":"20*LOG10((K624/(I624*M624))*AEA)","v":61.825482798889297},{"$f":"(L624-(J624+N624))*radconv","v":-44.5768091438716},null,22.267821295829357,-0.76057329659232487]
[{"$f":"Zero2","v":9824.3792144294057},null,2.0087879699287208,1.0497214851522896,1.0000190517922991,6.1727611047809744E-3,1,0,132.44821955842792,1.5632461346949404,1.4142135623730951,0.78539816339744828,1.0002362084932335,2.1733016690115941E-2,1.00148906692284,5.4538454337945054E-2,1.0000591312648335,1.0874589760086437E-2,0.99986079501874614,2.2222207700474592E-2,14.02925840492691,-107.5269630458539,72.473036954146096,"z2",null,null,{"$f":"Zero2","v":9824.3792144294057},{"$f":"20*LOG10((K625/(I625*M625))*AEA)","v":25.402861323892466},{"$f":"(L625-(J625+N625))*radconv","v":-45.812616042939062},null,16.211265323210643,-61.064176386660741]
[{"$f":"pole3","v":500000},null,88.672355412652706,1.5595186157940439,1.0481870271021962,0.30439579703788294,1,0,6740.6012640173585,1.570647972076304,50.903624361163807,1.551150096403465,1.4912374266024842,0.83580054310679341,2.9529041505922411,1.2253149344800141,1.1429480190397081,0.50550419799258661,1.1307221091230095,{"$error":"#DIV/0!"},-17.772755075626691,{"$error":"#DIV/0!"},{"$error":"#DIV/0!"},"p3",null,null,null,{"$f":"20*LOG10((K626/(I626*M626))*AEA)","v":18.925600758559611},{"$f":"(L626-(J626+N626))*radconv","v":-49.004989676282115},null,-17.345534354008919,{"$error":"#DIV/0!"}]
[{"$f":"Fp2_u","v":451977.40112994361},null,{"$f":"SQRT(1+(A627/pole1)^2)","v":80.156942184054543},{"$f":"ATAN(A627/pole1)","v":1.5583204773630241},{"$f":"SQRT(1+(A627/Zero1)^2)","v":1.0395421689976547},{"$f":"ATAN(A627/Zero1)","v":0.27670087448162223},1,0,{"$f":"SQRT(1+(A627/Pole2)^2)","v":6093.1988977332803},{"$f":"ATAN(A627/Pole2)","v":1.570632209387723},{"$f":"SQRT(1+(A627/Zero2)^2)","v":46.016562692006879},{"$f":"ATAN(A627/Zero2)","v":1.5490633101047806},{"$f":"SQRT(1+(A627/pole4)^2)","v":1.4142135623730951},{"$f":"ATAN(A627/pole4)","v":0.78539816339744828},2.7033284847320225,1.1918794968727706,1.1181739076487012,0.46389780961856458,1.0383509039684564,1.3937613477393227,-16.343168717493921,-252.80110050420987,{"$f":"IF(V627>0,V627,V627+180)","v":-72.80110050420987},"p4",null,null,null,null,null,null,-15.800290895222425,-153.28803723542273]
[{"$f":"z_RHP","v":0},null,{"$f":"SQRT(1+(A628/pole1)^2)","v":1},{"$f":"ATAN(A628/pole1)","v":0},{"$f":"SQRT(1+(A628/Zero1)^2)","v":1},{"$f":"ATAN(A628/Zero1)","v":0},1,0,{"$f":"SQRT(1+(A628/Pole2)^2)","v":1},{"$f":"ATAN(A628/Pole2)","v":0},{"$f":"SQRT(1+(A628/Zero2)^2)","v":1},{"$f":"ATAN(A628/Zero2)","v":0},{"$f":"SQRT(1+(A628/pole4)^2)","v":1},{"$f":"ATAN(A628/pole4)","v":0},1,0,1,0,1,0,59.506829014950206,0,{"$f":"IF(V628>0,V628,V628+180)","v":180},"z_RHP",null,null,null,null,null,null,22.26857261663281,0]
[{"$f":"Fp2_u","v":451977.40112994361},null,null,null,null,null,null,null,null,null,null,null,null,null,null,null,null,null,null,null,-25]
[]
[null,null,null,"System","Plant"]
["p1","p-dom",{"$f":"pole1","v":5639.0945751864101},{"$f":"U622","v":20.117654862935375},{"$f":"AE622","v":19.258725675810506}]
["z1","ESR zero",{"$f":"Zero1","v":1591549.4327375637},{"$f":"U623","v":-47.188756411133816},{"$f":"AE623","v":-43.571906494883798}]
["p2","EA pole",{"$f":"Pole2","v":74.177359840490496},{"$f":"U624","v":56.496025902790841},{"$f":"AE624","v":22.267821295829357}]
["z2","EA zero",{"$f":"Zero2","v":9824.3792144294057},{"$f":"U625","v":14.02925840492691},{"$f":"AE625","v":16.211265323210643}]
["p3","p_sampling",{"$f":"pole3","v":500000},{"$f":"U626","v":-17.772755075626691},{"$f":"AE626","v":-17.345534354008919}]
[]
[]
[{"$f":"Q4*1000","v":41929.75}]
[{"$f":"Q4*1000","v":41929.75}]
[]
[]
[]
[]
[]
[]
[]
[]
[]
[]
[]
[]
[]
[]
[]
[]
[]
[]
[]
[]
[]
[]
[]
[]
[]
[]
[]
[]
[]
[]
[]
[]
[]
[]
[]
[]
[]
[]
[]
[]
[]
[]
[]
[]
[]
[]
[null,null,null,null,null,null,null,null,null,null,null,null,null,null,null,null,null,null,null,null,null,null,null,null,null,null,null,null,null,null,null,null,null,"phase margin",{"$f":"SUM(AI689:AI1306)","v":0}]

{"sheet":"Bode Plot Management","index":7,"n_rows":6,"n_cols":14,"rows_kept":6,"cut":false,"hidden":true,"merged":[]}
[null,null,null,null,null,null,null,null,null,"Single or dual output (MODE)",null,null,null,"3.3V or 5V fixed (FB1/2)"]
[{"$f":"CHOOSE(BODE_PLOT_TYPE, \"BODE_PLOT_Ch1\", \"BODE_PLOT_Ch2\")","v":"BODE_PLOT_Ch1"},null,null,null,null,null,null,null,null,"With/without dither (DITH)",null,null,null,"With/without VOUT connected to VCCX"]
[null,null,null,null,null,null,null,null,null,"FPWM or DEM (DEMB)"]
[null,null,null,null,null,null,null,null,null,"Shunt or inductor DCR current sensing"]
[]
[null,null,null,null,null,{"$f":"INDIRECT(A2)","v":0}]

{"sheet":"Efficiency Calculations","index":8,"n_rows":109,"n_cols":57,"rows_kept":109,"cut":false,"hidden":true,"merged":[[6,24,6,26],[0,0,3,3],[5,0,6,3],[6,6,6,13],[6,17,6,20],[6,21,6,23],[6,51,6,56],[6,27,6,32],[6,33,6,36],[6,38,6,42],[6,45,6,49]]}
["BUCK CONTROLLER POWER DESIGN TOOL",null,null,null,null,null,null,null,null,null,null,null,null,null,null,null,null,null,null,null,null,null,null,null,null,null,null,null,null,null,null,null,null,null,null,null,null,null,null,null,{"$f":"Ext_VCC","v":1}]
[null,null,null,null,null,null,null,{"$f":"AV19","v":0.68521935167972514},"10% load"]
[null,null,null,null,null,null,null,{"$f":"AV59","v":0.85467986892688286},"50% load",null,null,null,null,null,null,null,null,null,null,null,null,null,null,null,null,null,null,null,null,null,null,null,null,null,null,null,null,null,null,{"$f":"IF(MODE=1, (Qg_Q1+Qg_Q2)*Fsw*Vin, (Qg_Q1+Qg_Q2+Qg_Q3+Qg_Q4)*Fsw*Vin)","v":0.21599999999999997}]
[null,null,null,null,null,null,null,{"$f":"AV109","v":0.8004025478665191},"100% load",null,null,null,null,null,null,null,null,null,null,null,3,null,null,null,null,null,null,null,null,null,null,null,1,null,null,null,2,null,"I_VCC",{"$f":"(Qg_Q1+Qg_Q2)*Fsw*1000","v":9},"mA",{"$f":"AN4*5/1000","v":4.4999999999999998E-2}]
[null,null,null,null,null,null,null,null,null,null,null,null,null,null,null,null,null,null,null,null,null,null,null,null,null,null,null,null,null,null,null,null,null,null,null,null,null,null,null,null,null,{"$f":"VCC","v":3.3}]
["Enter the values of your design and MOSFET datasheet specifications below. Note that thermal resistance (θJA) will change when components are placed on the PCB"]
[null,null,null,null,null,null,"Operating Point Condtions",null,null,null,null,null,null,null,null,null,null,"Filter Inductor",null,null,null,"Cout",null,null,"Cin",null,null,"High-side BUCK \"Control\" MOSFET Losses ",null,null,null,null,null,"Low-side BUCK \"Sync\" MOSFET Losses ",null,null,null,"Diode/FET","\"Controller\" Losses",null,null,null,null,null,null,"RESULTS",null,null,null,null,null,"Consolidated Buck/Boost Efficiency & Losses"]
["Input Parameters",null,null,null,null,null,"Step","Vin","Mode","Iout","Iout/ phase","Iin","Duty Cycle BUCK Leg","Ripple Current pk-pk","Peak Inductor Current","Valley Inductor Current","SW node voltage at Q1 turn-on","Irms Lf","DCR    Loss","Core Loss","Total Inductor Loss","Irms Cout","Cout ESR Loss","Total Cout Loss","Irms Cin","Cin ESR Loss","Total Cin Loss","Irms","RDS(on) Loss","Transition Loss (not including capacitive loss)","MOSFET Output Capacitance Loss","Dead Time Loss ","Total Control MOSFET Loss","Irms","RDS(on) Loss","Deadtime Loss","Total Sync MOSFET Loss","Reverse Recovery Loss","IQ Loss","Switching Current Loss","Switching Current Diss from VCC","LDO Loss Saved from Gate Drive Current (ext VCC = Vout)","Total \"Control\" Loss","Total Loss (not considering total loss)","Total Loss (considering total loss)","Total Loss","Pout","EFF, h",{"$f":"IF(Vin>Vout, \"Buck ''CONTROL'' MOSFET Temp Rise\", \"Boost ''CONTROL'' MOSFET Temp Rise\")","v":"Buck ''CONTROL'' MOSFET Temp Rise"},{"$f":"IF(Vin>Vout, \"Buck ''SYNC'' MOSFET Temp Rise\", \"Boost ''SYNC'' MOSFET Temp Rise\")","v":"Buck ''SYNC'' MOSFET Temp Rise"},null,"h","Inductor Cu & Core Loss","Total MOSFET Loss","Control MOSFET Loss","SYNC MOSFET Loss","Power Loss"]
["Design","Input Value","Units","Description",null,null,0,{"$f":"Vin","v":24},{"$f":"MODE","v":1},0,{"$f":"Iout*G9/100/Number_of_Phases","v":0},{"$f":"Vout*K9/(Vin*Efficiency)","v":0},{"$f":"(Vout+(Rdson2+Rs+Rdcr)*K9)/(Vin+(Rs+Rdson2-Rdson1)*K9)","v":0.20833333333333334},{"$f":"(Vin-(Rdson1+Rdcr)*K9-Vout)*M9/(Fsw*Lf)","v":6.2860621459954507},{"$f":"K9+N9/2","v":3.1430310729977253},{"$f":"K9-N9/2","v":-3.1430310729977253},{"$f":"IF(MIN(Vin, -P9/(Coss_Q1+Coss_Q2)*0.00000002)<0, 0, MIN(Vin, -P9/(Coss_Q1+Coss_Q2)*0.00000002))","v":24},{"$f":"SQRT(K9^2+(N9^2)/12)","v":1.8146298360665951},{"$f":"R9^2*Rdcr","v":0.22391593805212934},{"$f":"Core_Loss","v":0.88048227907349441},{"$f":"(T9+S9*(1+Ltc*(Ta-25)))/(1-S9*Ltc*ThetaCa)","v":1.1262012158959829},{"$f":"N9/SQRT(12)","v":1.8146298360665951},{"$f":"RCoutEsr*V9^2","v":6.5857628838861563E-3},{"$f":"W9","v":6.5857628838861563E-3},{"$f":"SQRT(M9*(1-M9))*SQRT(K9^2+(N9^2)/12)","v":0.73695099267064612},{"$f":"RCinEsr*Y9^2","v":5.4309676559825067E-4},{"$f":"Z9","v":5.4309676559825067E-4},{"$f":"SQRT(M9)*SQRT(K9^2+(N9^2)/12)","v":0.82826141227964656},{"$f":"Rdson1*AB9^2","v":2.812669564993046E-2},{"$f":"(Vin*K9/2)*Fsw*(Tr_buck+Tf_buck)","v":0},{"$f":"(0.5*Coss_Q1*(Vin-Q9)^2-0.5*Coss_Q2*(Vin-Q9)^2+(Qoss_Q2*(Vin-Q9)/Vin)*Vin)*Fsw","v":0},{"$f":"IF(K9>N9/2,0,ABS(K9-N9/2)*Vsd_Q1*Deadtime*Fsw)","v":1.7600974008787264E-2},{"$f":"(AF9+AE9+AD9+AC9*(1+RdsonTC*(Ta-25))/(1-AC9*RdsonTC*ThetaJA_Q1))","v":4.57974601693657E-2},{"$f":"SQRT((1-M9))*SQRT(K9^2+(N9^2)/12)","v":1.6145787298461489},{"$f":"Rdson2*AH9^2","v":5.4744153972303679E-2},{"$f":"IF(K9<N9/2,Deadtime*Fsw*Vsd_Q2*(K9+N9/2),2*Deadtime*Fsw*Vsd_Q2*K9)","v":1.7600974008787261E-2},{"$f":"(AJ9+AI9*(1+RdsonTC*(Ta-25)))/(1-AI9*RdsonTC*ThetaJA_Q2)","v":7.2695336715237188E-2},{"$f":"Qrr_Q2*K9/Iout*Fsw*Vin","v":0},{"$f":"Iq*Vin","v":8.3999999999999993E-4},{"$f":"IF(Ext_VCC=1,  (Qg_Q1+Qg_Q2)*Fsw*Vout, (Qg_Q1+Qg_Q2)*Fsw*Vin)","v":4.4999999999999998E-2},{"$f":"(Vin-VCC)*Fsw*(Qg_Q1+Qg_Q2)","v":0.18629999999999999},{"$f":"(Qg_Q1+Qg_Q2)*Fsw*(Vin-Vout)","v":0.17099999999999999},{"$f":"SUM(AM9:AN9)","v":4.5839999999999999E-2},{"$f":"SUM(S9,T9,AC9,AD9,AE9,AF9,AI9,AJ9,AQ9, AL9)","v":1.2683110147654324},{"$f":"((T9+S9*(1+Ltc*(Ta-25))) + (AF9+AE9+AD9+AC9*(1+RdsonTC*(Ta-25))) + (AJ9+AI9*(1+RdsonTC*(Ta-25))) + AQ9 + AL9) / (1-S9*Ltc*ThetaCa-AC9*RdsonTC*ThetaJA_Q1 -AI9*RdsonTC*ThetaJA_Q2)","v":1.3030401714536342},{"$f":"AS9","v":1.3030401714536342},{"$f":"Vout*K9","v":0},{"$f":"AU9/(AU9+AT9)","v":0},{"$f":"ThetaJA_Q1*BC9","v":1.0075441237260454},{"$f":"ThetaJA_Q2*BD9","v":1.5992974077352182},null,{"$f":"AV9*100","v":0},{"$f":"U9","v":1.1262012158959829},{"$f":"AG9+AK9+AL9","v":0.11849279688460289},{"$f":"AG9+AL9*0.66","v":4.57974601693657E-2},{"$f":"AK9+AL9*0.33","v":7.2695336715237188E-2},{"$f":"BA9+BB9","v":1.2446940127805857}]
[null,null,null,null,null,null,1,24,1,{"$f":"Iout*G10/100","v":0.06},0.06,1.3888888888888888E-2,0.20864737934591768,6.2933708967945297,{"$f":"K10+N10/2","v":3.2066854483972649},{"$f":"K10-N10/2","v":-3.0866854483972648},24,{"$f":"SQRT(K10^2+(N10^2)/12)","v":1.8177302065263605},0.22468173105284886,0.88048227907349441,1.1270582234134692,{"$f":"N10/SQRT(12)","v":1.8167396906872393},6.6010862074367318E-3,{"$f":"W10","v":6.6010862074367318E-3},{"$f":"SQRT(M10*(1-M10))*SQRT(K10^2+(N10^2)/12)","v":0.73861974616474824},5.4555912942447714E-4,{"$f":"Z10","v":5.4555912942447714E-4},{"$f":"SQRT(M10)*SQRT(K10^2+(N10^2)/12)","v":0.83030163168256121},2.8265432782563667E-2,1.9694960212201596E-3,0,1.7285438511024685E-2,{"$f":"(AF10+AE10+AD10+AC10*(1+RdsonTopTc*Ta-RdsonTopTc*25))/(1-AC10*RdsonTopTc*ThetaJA_Q1)","v":4.763886222391496E-2},1.6170164823351807,5.4909588387016484E-2,1.7957438511024684E-2,{"$f":"(AJ10+AI10*(1+RdsonBotTc*Ta-RdsonBotTc*25))/(1-AI10*RdsonBotTc*ThetaJA_Q2)","v":7.3220833169381466E-2},7.2000000000000005E-4,8.3999999999999993E-4,4.4999999999999998E-2,0.18629999999999999,0.17099999999999999,4.5839999999999999E-2,{"$f":"SUM(S10,T10,AC10,AD10,AE10,AF10,AI10,AJ10,AQ10, AL10)","v":1.2721114043391932},1.3070694799254901,{"$f":"AS10","v":1.3070694799254901},0.3,{"$f":"AU10/(AU10+AT10)","v":0.18667518968371494},1.0585093689261291,1.6160855297263923,null,{"$f":"AV10*100","v":18.667518968371493},1.1270582234134692,0.12157969539329642,4.8114062223914962E-2,7.3458433169381471E-2,{"$f":"BA10+BB10","v":1.2486379188067656}]
["Vin",{"$f":"Vin","v":24},"V","Vin",null,null,2,24,1,0.12,0.12,2.7777777777777776E-2,0.20896139238713268,6.3006721301303781,3.2703360650651891,-3.0303360650651889,24,1.8228016277926333,0.22593719265127621,0.88048227907349441,1.1284634749654761,1.8188473752031733,6.6164115485669462E-3,6.6164115485669462E-3,0.74109054866567714,5.4921520132159441E-4,5.4921520132159441E-4,0.83324445929619106,2.8466149486859875E-2,3.9389920424403192E-3,0,1.6969881964365059E-2,4.9499019584869366E-2,1.6212061699042697,5.5194498352049107E-2,1.8313881964365061E-2,7.3867161678565524E-2,1.4400000000000001E-3,8.3999999999999993E-4,4.4999999999999998E-2,0.18629999999999999,0.17099999999999999,4.5839999999999999E-2,1.2765828755348505,1.3118677450090683,1.3118677450090683,0.6,0.31382923926945278,1.1098872308671259,1.6355319569284414,null,31.382923926945278,1.1284634749654761,0.12480618126343489,5.0449419584869364E-2,7.4342361678565519E-2,1.253269656228911]
["Vout",{"$f":"Vout","v":5},"V","Vout",null,null,3,24,1,0.18,0.18,4.1666666666666657E-2,0.20927537246217054,6.3079658471868099,3.3339829235934051,-2.9739829235934048,24,1.8298277043043154,0.2276823210658929,0.88048227907349441,1.1304173327385783,1.8209528899561354,6.6317388548792029E-3,6.6317388548792029E-3,0.74435805625508922,5.5406891591185461E-4,5.5406891591185461E-4,0.83708442318031517,2.8729123592775959E-2,5.9084880636604787E-3,0,1.6654304372123067E-2,5.1421919015234956E-2,1.6271321691578962,5.5598741014078093E-2,1.8670304372123067E-2,7.4634207367226896E-2,2.16E-3,8.3999999999999993E-4,4.4999999999999998E-2,0.18629999999999999,0.17099999999999999,4.5839999999999999E-2,1.2817255615541479,1.3174363408745597,1.3174363408745597,0.89999999999999991,0.40587410939835084,1.1626454183351691,1.6576341620789916,null,40.587410939835081,1.1304173327385783,0.12821612638246185,5.2847519015234955E-2,7.5347007367226895E-2,1.2586334591210402]
["Fsw",{"$f":"Fsw/1000","v":1000},"kHz","Switching Frequency",null,null,4,24,1,0.24,0.24,5.5555555555555552E-2,0.20958931957622232,6.3152520491473902,3.3976260245736949,-2.9176260245736954,24,1.8387860226306085,0.22991711451747512,0.88048227907349441,1.132920301295717,1.8230562352877908,6.6470680740433859E-3,6.6470680740433859E-3,0.74841445634146198,5.6012419846088613E-4,5.6012419846088613E-4,0.84181327039634046,2.9054632870830672E-2,7.8779840848806383E-3,0,1.6338705737612692E-2,5.3407876362454726E-2,1.6347735178936289,5.612217355093254E-2,1.9026705737612691E-2,7.5521862985464913E-2,2.8800000000000002E-3,8.3999999999999993E-4,4.4999999999999998E-2,0.18629999999999999,0.17099999999999999,4.5839999999999999E-2,1.287539595572839,1.3237769200561269,1.3237769200561269,1.2,0.47547784055863096,1.2167908799740039,1.6823897856802281,null,47.547784055863097,1.132920301295717,0.13180973934791962,5.5308676362454727E-2,7.6472262985464917E-2,1.2647300406436366]
["Iout",{"$f":"Iout","v":6},"A","Max Output Current",null,null,5,24,1,0.3,0.3,6.9444444444444434E-2,0.20990323373447803,6.3225307371954385,3.461265368597719,-2.8612653685977194,24,1.8496485009045434,0.2326415712290929,0.88048227907349441,1.135973027902955,1.8251574115397349,6.6623991537968505E-3,6.6623991537968505E-3,0.75324960330720625,5.6738496488246363E-4,5.6738496488246363E-4,0.84742011684996443,2.9442955032122301E-2,9.847480106100797E-3,0,1.6023086064147228E-2,5.5457209726001253E-2,1.6441042310195595,5.6764653171584759E-2,1.9383086064147226E-2,7.6530028883850659E-2,3.5999999999999999E-3,8.3999999999999993E-4,4.4999999999999998E-2,0.18629999999999999,0.17099999999999999,4.5839999999999999E-2,1.2940251107406899,1.3308914148361199,1.3308914148361199,1.5,0.52986843371625214,1.2723306139720276,1.7097966354447145,null,52.986843371625213,1.135973027902955,0.13558723860985189,5.7833209726001256E-2,7.7718028883850654E-2,1.271560266512807]
["Ta",{"$f":"Ta","v":25},"°C","Ambient Temperature",null,null,6,24,1,0.36,0.36,8.3333333333333315E-2,0.21021711494212655,6.3298019125140188,3.5249009562570093,-2.8049009562570095,24,1.8623818139608692,0.2358556894261081,0.88048227907349441,1.1395763029490831,1.8272564190534886,6.6777320419443564E-3,6.6777320419443564E-3,0.75885118550561448,5.7585512174327649E-4,5.7585512174327649E-4,0.85389163258786449,2.9894367728346312E-2,1.1816976127320957E-2,0,1.5707445355039255E-2,5.7570239490746515E-2,1.6550936833812788,5.7526037116140787E-2,1.9739445355039253E-2,7.7658612989463388E-2,4.3200000000000001E-3,8.3999999999999993E-4,4.4999999999999998E-2,0.18629999999999999,0.17099999999999999,4.5839999999999999E-2,1.3011822401814892,1.3387820388835716,1.3387820388835716,1.7999999999999998,0.57347084878828958,1.3292716687964232,1.7398526857681946,null,57.347084878828959,1.1395763029490831,0.1395488524802099,6.0421439490746513E-2,7.9084212989463387E-2,1.2791251554292931]
["Vcc",{"$f":"VCC","v":3.3},"V","Subregulated VCC Voltage",null,null,7,24,1,0.42,0.42,9.7222222222222224E-2,0.21053096320435571,6.337065576285954,3.5885327881429769,-2.7485327881429771,24,1.8769478797183037,0.23955946733617448,0.88048227907349441,1.1437310604585933,1.8293532581705034,6.6930666863580738E-3,6.6930666863580738E-3,0.76520491782770028,5.8553856626769748E-4,5.8553856626769748E-4,0.86121225609266816,3.0409148551813162E-2,1.3786472148541118E-2,0,1.5391783613600673E-2,5.9747288360679815E-2,1.6677070465566823,5.8406182655831064E-2,2.0095783613600669E-2,7.8907530783145746E-2,5.0400000000000002E-3,8.3999999999999993E-4,4.4999999999999998E-2,0.18629999999999999,0.17099999999999999,4.5839999999999999E-2,1.3090111169930556,1.3474512891496435,1.3474512891496435,2.1,0.60914566265503078,1.3876211439349557,1.7725560772292064,null,60.914566265503076,1.1437310604585933,0.14369481914382554,6.3073688360679808E-2,8.057073078314575E-2,1.2874258796024187]
["Components","Input Value","Units","Description",null,null,8,24,1,0.48,0.48,0.1111111111111111,0.21084477852635228,6.3443217296938164,3.6521608648469082,-2.6921608648469082,24,1.8933043911343894,0.24375290318923576,0.88048227907349441,1.1484383786986321,1.8314479292321586,6.7084030349775234E-3,6.7084030349775234E-3,0.77229475353814603,5.9643918634254571E-4,5.9643918634254571E-4,0.86936443052389956,3.0987575035465915E-2,1.5755968169761277E-2,0,1.5076100843142684E-2,6.1988681392979153E-2,1.6819057656208378,5.9404947093000947E-2,2.0452100843142685E-2,8.0276705277969401E-2,5.7600000000000004E-3,8.3999999999999993E-4,4.4999999999999998E-2,0.18629999999999999,0.17099999999999999,4.5839999999999999E-2,1.3175118742472436,1.3569019480231379,1.3569019480231379,2.4,0.63882423156209001,1.4473861906455414,1.8079051161153268,null,63.882423156209001,1.1484383786986321,0.14802538667094856,6.5790281392979155E-2,8.2177505277969395E-2,1.2964637653695807]
["L",{"$f":"Lf*1000000","v":0.6296999999999997},"uH","Filter Inductance",null,null,9,24,1,0.54,0.54,0.125,0.21115856091330179,6.3515703739199285,3.7157851869599643,-2.6357851869599642,24,1.9114053777011244,0.24843599521752494,0.88048227907349441,1.1536994808806778,1.8335404325797615,6.7237410358095585E-3,6.7237410358095585E-3,0.78010310890410428,6.0856086052184883E-4,6.0856086052184883E-4,0.87832885464383348,3.1629924652897885E-2,1.7725464190981439E-2,0,1.47603970469758E-2,6.4294746032442451E-2,1.6976480615854483,6.0522187761101444E-2,2.0808397046975801E-2,8.1766066998903958E-2,6.4800000000000014E-3,8.3999999999999993E-4,4.4999999999999998E-2,0.18629999999999999,0.17099999999999999,4.5839999999999999E-2,1.3266846449899521,1.367137085749641,1.367137085749641,2.7,0.66385763328711245,1.5085740127137339,1.8458982739758871,null,66.385763328711249,1.1536994808806778,0.15254081303134642,6.8571546032442449E-2,8.3904466998903957E-2,1.3062402939120241]
["Rdcr",{"$f":"Rdcr*1000","v":68},"mW","Inductor DCR at 25°C",null,null,10,24,1,0.6,0.6,0.13888888888888887,0.21147231037038891,6.3588115101463671,3.7794057550731837,-2.5794057550731835,24,1.9312017808774307,0.25360874165556285,0.88048227907349441,1.1595157359577941,1.8356307685545481,6.7390806369283223E-3,6.7390806369283223E-3,0.78861109428640608,6.2190745803160287E-4,6.2190745803160287E-4,0.88808474131984261,3.2336474818370403E-2,1.9694960212201594E-2,0,1.4444672228409826E-2,6.6665812146284698E-2,1.7148894456200456,6.1757762024679579E-2,2.1164672228409828E-2,8.3375553963681515E-2,7.1999999999999998E-3,8.3999999999999993E-4,4.4999999999999998E-2,0.18629999999999999,0.17099999999999999,4.5839999999999999E-2,1.3365295622411286,1.3781600631183202,1.3781600631183202,3,0.68521935167972514,1.5711918672182634,1.8865341872009933,null,68.521935167972515,1.1595157359577941,0.15724136610996622,7.1417812146284704E-2,8.5751553963681518E-2,1.3167571020677604]
["LTc",3930,"ppm","Inductor Series Resistance Temp Co",null,null,11,24,1,0.66,0.66,0.15277777777777779,0.21178602690279696,6.3660451395549575,3.8430225697774789,-2.5230225697774786,24,1.9526420289540036,0.25927114074015739,0.88048227907349441,1.1658886595184321,1.8377189374976819,6.7544217864752183E-3,6.7544217864752183E-3,0.79779874578400367,6.3648283877452928E-4,6.3648283877452928E-4,0.89861007695801931,3.3107502886830398E-2,2.1664456233421756E-2,0,1.4128926390753879E-2,6.9102212059307139E-2,1.7335832321602302,6.311152727936932E-2,2.1520926390753883E-2,8.5105111664850797E-2,7.9200000000000017E-3,8.3999999999999993E-4,4.4999999999999998E-2,0.18629999999999999,0.17099999999999999,4.5839999999999999E-2,1.3470467589947812,1.3899745344208614,1.3899745344208614,3.3000000000000003,0.70362855401036806,1.6352470653047571,1.9298116566267174,null,70.362855401036811,1.1658886595184321,0.16212732372415795,7.432941205930714E-2,8.771871166485079E-2,1.3280159832425902]
["ThetaCa",{"$f":"ThetaCa","v":22},"°C/W","Core to Ambient Thermal Resistance",null,null,12,24,1,0.72,0.72,0.16666666666666663,0.21209971051570845,6.3732712633272826,3.906635631663641,-2.4666356316636415,24,1.9756725984660122,0.26542319071040227,0.88048227907349441,1.1728199147778726,1.8398049397502565,6.7697644326588898E-3,6.7697644326588898E-3,0.80764525215891148,6.5229085333483176E-4,6.5229085333483176E-4,0.90988187592928127,3.3943286153928109E-2,2.3633952254641915E-2,0,1.3813159537316393E-2,7.1604280589445068E-2,1.7536810394666575,6.4583340951881993E-2,2.1877159537316389E-2,8.6954693053013579E-2,8.6400000000000001E-3,8.3999999999999993E-4,4.4999999999999998E-2,0.18629999999999999,0.17099999999999999,4.5839999999999999E-2,1.3582363682189813,1.4025844506875254,1.4025844506875254,3.5999999999999996,0.71962803136791365,1.7007469729677913,1.9757296471662986,null,71.962803136791365,1.1728199147778726,0.16719897364245864,7.7306680589445065E-2,8.9805893053013577E-2,1.3400188884203312]
["Cin",{"$f":"Cin*1000000","v":20},"μF","Input Capacitance",null,null,13,24,1,0.78,0.78,0.18055555555555555,0.21241336121430454,6.3804898826446692,3.9702449413223349,-2.4102449413223344,24,2.0002385512427217,0.27206488980767557,0.88048227907349441,1.1803113136685266,1.8418887756532918,6.7851085237551649E-3,6.7851085237551649E-3,0.8181291725534211,6.693353429829455E-4,6.693353429829455E-4,0.92187642492370636,3.4844101856034676E-2,2.5603448275862077E-2,0,1.3497371671405071E-2,7.4172355083700403E-2,1.7751332679682017,6.6173060499996814E-2,2.2233371671405076E-2,8.8924258521237684E-2,9.3600000000000003E-3,8.3999999999999993E-4,4.4999999999999998E-2,0.18629999999999999,0.17099999999999999,4.5839999999999999E-2,1.3700985228558737,1.4159940632057759,1.4159940632057759,3.9000000000000004,0.73363513082031739,1.7676990118414091,2.0242872874672293,null,73.363513082031744,1.1803113136685266,0.17245661360493811,8.0349955083700408E-2,9.2013058521237687E-2,1.3527679272734647]
["RCinEsr",{"$f":"RCinEsr*1000","v":1},"mW","Input Capacitor ESR",null,null,14,24,1,0.84,0.84,0.19444444444444445,0.21272697900376558,6.3877009986882056,4.0338504993441031,-2.353850499344103,24,2.026284038345445,0.27919623627563972,0.88048227907349441,1.1883648180304289,1.8439704455477386,6.8004540081070515E-3,6.8004540081070515E-3,0.82922864137720875,6.8762013968029143E-4,6.8762013968029143E-4,0.93456951313660341,3.581022717025991E-2,2.7572944297082236E-2,0,1.3181562796326977E-2,7.6806775454466208E-2,1.7978895486567401,6.7880543412551869E-2,2.2589562796326977E-2,9.1013775890641538E-2,1.008E-2,8.3999999999999993E-4,4.4999999999999998E-2,0.18629999999999999,0.17099999999999999,4.5839999999999999E-2,1.3826333558216821,1.4302079273274728,1.4302079273274728,4.2,0.74597600198997294,1.8361106599982566,2.0754838695941138,null,74.597600198997299,1.1883648180304289,0.17790055134510777,8.3459575454466209E-2,9.4340175890641531E-2,1.3662653693755367]
["Cout",{"$f":"Cout*1000000","v":50},"μF","Output Capcitance",null,null,15,24,1,0.9,0.9,0.20833333333333331,0.21304056388927053,6.394904612638725,4.0974523063193624,-2.2974523063193626,24,2.0537527643468523,0.28681722836023898,0.88048227907349441,1.1969825409033967,1.8460499497744738,6.815800834124675E-3,6.815800834124675E-3,0.840921557628309,7.0714906608402141E-4,7.0714906608402141E-4,0.94793664518244558,3.6841939214469738E-2,2.9542440318302395E-2,0,1.286573291538843E-2,7.9507884216248784E-2,1.8218991557664732,6.970564720943434E-2,2.2945732915388428E-2,9.3223220397143064E-2,1.0800000000000001E-2,8.3999999999999993E-4,4.4999999999999998E-2,0.18629999999999999,0.17099999999999999,4.5839999999999999E-2,1.3958410000067167,1.445230906571116,1.445230906571116,4.5,0.75690920516245419,1.9059894527574732,2.1293188487371473,null,75.690920516245413,1.1969825409033967,0.18353110461339187,8.6635884216248779E-2,9.6787220397143062E-2,1.3805136455167886]
["RCoutEsr",{"$f":"Cout_ESR*1000","v":2},"mW","Output Capacitor ESR",null,null,16,24,1,0.96,0.96,0.22222222222222221,0.21335411587599748,6.4021007256768145,4.1610503628384077,-2.2410503628384073,24,2.0825884075214267,0.29492786430969897,0.88048227907349441,1.206166747922446,1.8481272886743039,6.8311489502852676E-3,6.8311489502852676E-3,0.85318575676798802,7.2792593555176446E-4,7.2792593555176446E-4,0.9619532345930335,3.7939515047303987E-2,3.1511936339522553E-2,0,1.254988203189508E-2,8.227602652279549E-2,1.8471113798573795,7.1648229441571287E-2,2.3301882031895083E-2,9.5552574679370089E-2,1.1520000000000001E-2,8.3999999999999993E-4,4.4999999999999998E-2,0.18629999999999999,0.17099999999999999,4.5839999999999999E-2,1.4097215882753815,1.4610681770261931,1.4610681770261931,4.8,0.76664234668657549,1.9773429835015008,2.1857918429461418,null,76.664234668657542,1.206166747922446,0.1893486012021656,8.9879226522795494E-2,9.9354174679370091E-2,1.3955153491246117]
["Top Driver","Input Value","Units","Description",null,null,17,24,1,1.02,1.02,0.23611111111111108,0.21366763496912339,6.4092893389828163,4.2246446694914077,-2.1846446694914081,24,2.1127349934543531,0.30352814237452652,0.88048227907349441,1.215919858818203,1.8502024625879638,6.8464983051331318E-3,6.8464983051331318E-3,0.86599916405639377,7.4995455214637284E-4,7.4995455214637284E-4,0.97659477664015271,3.9103231668194023E-2,3.3481432360742712E-2,0,1.2234010149151887E-2,8.511155020463422E-2,1.8734758591467722,7.3708147690920461E-2,2.3658010149151882E-2,9.8001828767726021E-2,1.2240000000000001E-2,8.3999999999999993E-4,4.4999999999999998E-2,0.18629999999999999,0.17099999999999999,4.5839999999999999E-2,1.424275253466182,1.4777252320672425,1.4777252320672425,5.0999999999999996,0.77534403157140941,2.0501789045019527,2.2449026328899726,null,77.534403157140943,1.215919858818203,0.19535337897236024,9.318995020463422E-2,0.10204102876772603,1.4112732377905632]
["RdsonDRT",1,"W","Drain to Source Resistance of pullup Top FET Driver",null,null,18,24,1,1.08,1.08,0.25,0.21398112117382403,6.4164704537368218,4.2882352268684105,-2.1282352268684108,24,2.1441372212710177,0.31261806080750648,0.88048227907349441,1.2262444490241684,1.8522754718561172,6.8618488472796035E-3,6.8618488472796035E-3,0.87933992894708135,7.7323871064065807E-4,7.7323871064065807E-4,0.99183700000062958,4.0333366017380204E-2,3.5450928381962878E-2,0,1.19181172704631E-2,8.801480580703179E-2,1.9009428684391205,7.5885259570460592E-2,2.4014117270463098E-2,0.1005709800746068,1.2960000000000003E-2,8.3999999999999993E-4,4.4999999999999998E-2,0.18629999999999999,0.17099999999999999,4.5839999999999999E-2,1.4395021283917309,1.4952078873858203,1.4952078873858203,5.4,0.78315260224116334,2.1245049277546997,2.3066511616413496,null,78.315260224116329,1.2262444490241684,0.2015457858816386,9.6568405807031799E-2,0.10484778007460679,1.4277902349058069]
["RdsonDRT2",1,"W","Drain to Source Resistance of pulldown Top FET Driver",null,null,19,24,1,1.1399999999999999,1.1399999999999999,0.26388888888888884,0.21429457449527431,6.4236440711186766,4.351822035559338,-2.0718220355593386,24,2.1767407431068846,0.32219761786370282,0.88048227907349441,1.2371432513928569,1.8543463168193559,6.8772005254030223E-3,6.8772005254030223E-3,0.89318654071931436,7.9778219652213551E-4,7.9778219652213551E-4,1.0076559974361377,4.1630194975929721E-2,3.7420424403183036E-2,0,1.1602203399132297E-2,9.0986146628378867E-2,1.929463566262005,7.8179422724182393E-2,2.4370203399132293E-2,0.10326003338576563,1.3679999999999999E-2,8.3999999999999993E-4,4.4999999999999998E-2,0.18629999999999999,0.17099999999999999,4.5839999999999999E-2,1.4554023458387568,1.5135222863491808,1.5135222863491808,5.6999999999999993,0.79018262836542974,2.200328825824335,2.371037534486844,null,79.018262836542974,1.2371432513928569,0.20792618001414451,0.10001494662837887,0.10777443338576563,1.4450694314070014]
["Bottom Driver","Input Value","Units","Description",null,null,20,24,1,1.2,1.2,0.27777777777777773,0.21460799493864774,6.4308101923079777,4.4154050961539886,-2.0154050961539891,24,2.2104923985674203,0.33226681180045564,0.88048227907349441,1.2486191580229489,1.8564149978182001,6.8925532882486958E-3,6.8925532882486958E-3,0.90751792599251435,8.2358878599775483E-4,8.2358878599775483E-4,1.0240283361856108,4.2993995365753886E-2,3.9389920424403188E-2,0,1.1286268538462339E-2,9.4025928759008059E-2,1.9589902018165577,8.0590494827078835E-2,2.4726268538462336E-2,0.10606900085282094,1.44E-2,8.3999999999999993E-4,4.4999999999999998E-2,0.18629999999999999,0.17099999999999999,4.5839999999999999E-2,1.4719760385681107,1.532674905695103,1.532674905695103,6,0.79652979520776623,2.2776584326981775,2.4380620187620607,null,79.652979520776626,1.2486191580229489,0.214494929611829,0.10352992875900806,0.11082100085282094,1.4631140876347779]
["RdsonDRB",1,"W","Drain to Source Resistance of pullup Bottom FET Driver",null,null,21,24,1,1.26,1.26,0.29166666666666663,0.21492138250911705,6.4379688184840766,4.4789844092420381,-1.9589844092420383,24,2.2453404067789897,0.34282564087738188,0.88048227907349441,1.2606752221997743,1.8584815151930993,6.9079070846288773E-3,6.9079070846288773E-3,0.92231352912046127,8.5066224599863994E-4,8.5066224599863994E-4,1.0409311491678763,4.4425043949626181E-2,4.1359416445623361E-2,0,1.0970312691755415E-2,9.7134511120453487E-2,1.9894762841025482,8.311833358513615E-2,2.5082312691755412E-2,0.10899790198690519,1.5120000000000001E-2,8.3999999999999993E-4,4.4999999999999998E-2,0.18629999999999999,0.17099999999999999,4.5839999999999999E-2,1.4892233393147731,1.5526725615729664,1.5526725615729664,6.3,0.80227463333044524,2.3565016446499767,2.5077250437119143,null,80.227463333044525,1.2606752221997743,0.22125241310735869,0.10711371112045349,0.11398750198690519,1.4819276353071331]
["RdsonDRB2",1,"W","Drain to Source Resistance of pulldown Bottom FET Driver",null,null,22,24,1,1.32,1.32,0.30555555555555558,0.21523473721185366,6.4451199508260766,4.5425599754130381,-1.9025599754130382,24,2.2812345192266754,0.35387410335637254,0.88048227907349441,1.2733146604515682,1.8605458692844314,6.9232618634227213E-3,6.9232618634227213E-3,0.93755337671239614,8.7900633418481621E-4,8.7900633418481621E-4,1.0583422083755578,4.5923617431199361E-2,4.3328912466843512E-2,0,1.0654335862313015E-2,0.10031225550515808,2.0208767161017289,8.5762796735324262E-2,2.5438335862313012E-2,0.11204676365345073,1.5840000000000003E-2,8.3999999999999993E-4,4.4999999999999998E-2,0.18629999999999999,0.17099999999999999,4.5839999999999999E-2,1.5071443807878602,1.5735224159418566,1.5735224159418566,6.6000000000000005,0.80748539786557427,2.4368664211134781,2.5800272003759162,null,80.74853978655743,1.2733146604515682,0.22819901915860882,0.11076665550515809,0.11727396365345073,1.5015136796101769]
["Deadtime","Input Value","Units","Description",null,null,23,24,1,1.38,1.38,0.31944444444444442,0.21554805905202801,6.4522635905128274,4.6061317952564131,-1.8461317952564138,24,2.318126136945124,0.36541219750159248,0.88048227907349441,1.2865408547241286,1.8626080604325013,6.9386175735762484E-3,6.9386175735762484E-3,0.95321812768638725,9.0862479894994171E-4,9.0862479894994171E-4,1.0762399820221364,4.7489992455023354E-2,4.5298408488063664E-2,0,1.0338338053435918E-2,0.10355952661663791,2.0531478972263826,8.8523742045587439E-2,2.5794338053435912E-2,0.11521562006811015,1.6559999999999998E-2,8.3999999999999993E-4,4.4999999999999998E-2,0.18629999999999999,0.17099999999999999,4.5839999999999999E-2,1.525739295670633,1.5952319833372206,1.5952319833372206,6.8999999999999995,0.81222031529378458,2.5187607855660339,2.6549692414984234,null,81.222031529378455,1.2865408547241286,0.23533514668474806,0.1144891266166379,0.12068042006811015,1.5218760014088766]
["Deadtime",15,"ns","Total Deadtime",null,null,24,24,1,1.44,1.44,0.33333333333333326,0.21586134803480947,6.4593997387229436,4.6696998693614713,-1.7896998693614719,24,2.3559683958090716,0.37743992157947964,0.88048227907349441,1.3003573546766451,1.8646680889775451,6.9539741641023401E-3,6.9539741641023401E-3,0.96928911034120024,9.3952137942603542E-4,9.3952137942603542E-4,1.0946036770978642,4.9124445606562789E-2,4.726790450928383E-2,0,1.0022319268424243E-2,0.10687669211011003,2.0862477973948841,9.1401027314835112E-2,2.6150319268424239E-2,0.11850451279380959,1.728E-2,8.3999999999999993E-4,4.4999999999999998E-2,0.18629999999999999,0.17099999999999999,4.5839999999999999E-2,1.5450082166205044,1.6178091380183302,1.6178091380183302,7.1999999999999993,0.81652935409510252,2.6021928264224208,2.7325520814638109,null,81.652935409510249,1.3003573546766451,0.2426612049039196,0.11828149211011003,0.12420691279380959,1.5430185595805648]
["IQ","Input Value","Units","Description",null,null,25,24,1,1.5,1.5,0.34722222222222221,0.2161746041653663,6.4665283966347848,4.7332641983173929,-1.7332641983173924,24,2.3947162236975674,0.38995727385874301,0.88048227907349441,1.3147678801016542,1.8667259552597262,6.9693315840806749E-3,6.9693315840806749E-3,0.98574834795103805,9.7169980548820079E-4,9.7169980548820079E-4,1.1134132690133465,5.082725341221446E-2,4.9237400530503996E-2,0,9.706279510577398E-3,0.1102641226335927,2.120136006115021,9.4394510372932408E-2,2.65062795105774E-2,0.12191349073893157,1.8000000000000002E-2,8.3999999999999993E-4,4.4999999999999998E-2,0.18629999999999999,0.17099999999999999,4.5839999999999999E-2,1.5649512762690434,1.6412621215096099,1.6412621215096099,7.5,0.8204556329647652,2.6871706979390395,2.8127767962564945,null,82.045563296476516,1.3147678801016542,0.25017761337252425,0.1221441226335927,0.12785349073893157,1.5649454934741784]
["IQ ",{"$f":"Iq*1000","v":3.4999999999999996E-2},"mA","Quiescent Current Of Controller (Not Switching!)",null,null,26,24,1,1.56,1.56,0.3611111111111111,0.21648782744886563,6.4736495654264639,4.796824782713232,-1.6768247827132319,24,2.4343263732147449,0.40296425261036206,0.88048227907349441,1.3297763234722446,1.8687816596191364,6.9846897826577083E-3,6.9846897826577083E-3,1.0025785743568167,1.005163797759347E-3,1.005163797759347E-3,1.1326495199775999,5.2598692339324987E-2,5.1206896551724154E-2,0,9.3902187831940969E-3,0.11372219186948535,2.154773759869784,9.7504049080690686E-2,2.68622187831941E-2,0.12544261015662669,1.8720000000000001E-2,8.3999999999999993E-4,4.4999999999999998E-2,0.18629999999999999,0.17099999999999999,4.5839999999999999E-2,1.5855686072219846,1.6655995505497283,1.6655995505497283,7.8000000000000007,0.8240365502834951,2.7737026211286779,2.8956446234457873,null,82.403655028349505,1.3297763234722446,0.25788480202611203,0.12607739186948536,0.1316202101566267,1.5876611254983566]
["High-side FET","Input Value","Units","Description",null,null,27,24,1,1.62,1.62,0.37500000000000006,0.2168010178904736,6.4807632462758464,4.8603816231379238,-1.6203816231379231,24,2.4747574334716771,0.41646085610758593,0.88048227907349441,1.3453867526198242,1.8708352023957966,7.0000487090466426E-3,7.0000487090466426E-3,1.0197632409608188,1.039917067614913E-3,1.039917067614913E-3,1.1522939876845071,5.4439038796208386E-2,5.3176392572944313E-2,0,9.0741370895723698E-3,0.11725127657663759,2.1901239509373571,0.10072950132985865,2.7218137089572374E-2,0.12909193464525306,1.9439999999999999E-2,8.3999999999999993E-4,4.4999999999999998E-2,0.18629999999999999,0.17099999999999999,4.5839999999999999E-2,1.6068603420592362,1.6908304254632036,1.6908304254632036,8.1000000000000014,0.8273046971515482,2.8617968846860267,2.9811569621955676,null,82.730469715154825,1.3453867526198242,0.26578321122189064,0.13008167657663758,0.13550713464525307,1.6111699638417147]
["RdsonTop",{"$f":"Rdson1*1000","v":41},"mW","Drain-Source Resistance of Top FET ",null,null,28,24,1,1.68,1.68,0.3888888888888889,0.21711417549535517,6.4878694403605541,4.9239347201802772,-1.5639347201802771,24,2.5159698241957709,0.43044708262593151,0.88048227907349441,1.3616034135459463,1.8728865839296565,7.0154083125273962E-3,7.0154083125273962E-3,1.0372865164396865,1.0759633171875799E-3,1.0759633171875799E-3,1.1723290257802685,5.6348569132163455E-2,5.5145888594164472E-2,0,8.7580344330095532E-3,0.12085175663291431,2.2261511205614015,0.10407072504311246,2.7574034433009553E-2,0.13286153514994078,2.0160000000000001E-2,8.3999999999999993E-4,4.4999999999999998E-2,0.18629999999999999,0.17099999999999999,4.5839999999999999E-2,1.6288266133348857,1.7169641389702148,1.7169641389702148,8.4,0.83028860087024281,2.9514618459241149,3.0693153732986969,null,83.028860087024285,1.3616034135459463,0.27387329178285508,0.13415735663291431,0.13951433514994077,1.6354767053288013]
["RdsonTopTc",{"$f":"RdsonTopTc*1000000","v":4000},"ppm","Drain to Source Resistance Temp Co",null,null,29,24,1,1.74,1.74,0.40277777777777773,0.2174273002686743,6.4949681488579598,4.9874840744289797,-1.5074840744289799,24,2.5579257751591,0.44492293044318326,0.88048227907349441,1.3784307333718879,1.8749358045605944,7.0307685424465674E-3,7.0307685424465674E-3,1.055133280383096,1.113306239371993E-3,1.113306239371993E-3,1.1927377774651382,5.8327559637491581E-2,5.711538461538463E-2,0,8.4419108168022859E-3,0.12452401507826692,2.2628214391398198,0.10752757817404691,2.7929910816802284E-2,0.13675148996528322,2.0879999999999999E-2,8.3999999999999993E-4,4.4999999999999998E-2,0.18629999999999999,0.17099999999999999,4.5839999999999999E-2,1.6514675535772056,1.7440104854512541,1.7440104854512541,8.6999999999999993,0.83301333449629333,3.0427059317218723,3.1601215792362307,null,83.30133344962934,1.3784307333718879,0.28215550504355014,0.13830481507826692,0.14364188996528321,1.660586238415438]
["QgTop",{"$f":"Qg_Q1*1000000000","v":3},"nC","Gate Charge Of Top FET",null,null,30,24,1,1.8,1.8,0.41666666666666663,0.21774039221559377,6.5020593729451868,5.0510296864725932,-1.4510296864725933,24,2.6005892936234081,0.45988839783939139,0.88048227907349441,1.3958733234298903,1.8769828646284166,7.0461293482173932E-3,7.0461293482173932E-3,1.0732891119495569,1.1519495178294685E-3,1.1519495178294685E-3,1.2135041634538608,6.0376286543514041E-2,5.9084880636604789E-2,0,8.1257662442465219E-3,0.12826843815831807,2.3001026758361989,0.11109991870716569,2.8285766244246523E-2,0.14076188473915188,2.1600000000000001E-2,8.3999999999999993E-4,4.4999999999999998E-2,0.18629999999999999,0.17099999999999999,4.5839999999999999E-2,1.6747832952886637,1.7719796706843047,1.7719796706843047,9,0.83550101978871105,3.1355376394829975,3.2535774642613413,null,83.550101978871112,1.3958733234298903,0.29063032289746998,0.14252443815831806,0.14788988473915188,1.6865036463273604]
["QgdTop",{"$f":"Qgd_Q1*1000000000","v":1},"nC","Gate to Drain Charge",null,null,31,24,1,1.86,1.86,0.43055555555555558,0.21805345134127541,6.5091431137991176,5.1145715568995591,-1.3945715568995587,24,2.6439261222015777,0.47534348309687136,0.88048227907349441,1.4139359825001685,1.8790277644728599,7.0614906793197473E-3,7.0614906793197473E-3,1.0917402745125377,1.1918968269927113E-3,1.1918968269927113E-3,1.2346128653874604,6.2495026022589655E-2,6.1054376657824948E-2,0,7.8096007186375278E-3,0.13208541536846996,2.3379641597508796,0.11478760465787237,2.8641600718637531E-2,0.14489281247763752,2.232E-2,8.3999999999999993E-4,4.4999999999999998E-2,0.18629999999999999,0.17099999999999999,4.5839999999999999E-2,1.6987739709459277,1.8008823220732679,1.8008823220732679,9.3000000000000007,0.83777124467914155,3.229965538106339,3.3496850745080256,null,83.777124467914149,1.4139359825001685,0.29929822784610749,0.14681661536846996,0.15225841247763752,1.7132342103462759]
["QgsTop",{"$f":"Qgs_Q1*1000000000","v":1},"nC",null,null,null,32,{"$f":"Vin","v":24},{"$f":"MODE","v":1},1.92,{"$f":"Iout*G41/100/Number_of_Phases","v":1.92},{"$f":"Vout*K41/(Vin*Efficiency)","v":0.44444444444444442},{"$f":"(Vout+(Rdson2+Rs+Rdcr)*K41)/(Vin+(Rs+Rdson2-Rdson1)*K41)","v":0.21836647765087985},{"$f":"(Vin-(Rdson1+Rdcr)*K41-Vout)*M41/(Fsw*Lf)","v":6.5162193725963844},5.1781096862981926,-1.3381096862981923,{"$f":"IF(MIN(Vin, -P41/(Coss_Q1+Coss_Q2)*0.00000002)<0, 0, MIN(Vin, -P41/(Coss_Q1+Coss_Q2)*0.00000002))","v":24},2.6879036892437265,{"$f":"R41^2*Rdcr","v":0.49128818450020245},{"$f":"Core_Loss","v":0.88048227907349441},{"$f":"(T41+S41*(1+Ltc*(Ta-25)))/(1-S41*Ltc*ThetaCa)","v":1.4326237001980322},1.8810705044335885,7.0768524853000699E-3,7.0768524853000699E-3,1.1104736971538396,1.2331518320705176E-3,1.2331518320705176E-3,1.2560493056592679,{"$f":"Rdson1*AB41^2","v":6.4684054188132278E-2},{"$f":"(Vin*K41/2)*Fsw*(Tr_buck+Tf_buck)","v":6.3023872679045106E-2},{"$f":"(0.5*Coss_Q1*(Vin-Q41)^2-0.5*Coss_Q2*(Vin-Q41)^2+(Qoss_Q2*(Vin-Q41)/Vin)*Vin)*Fsw","v":0},{"$f":"IF(K41>N41/2,0,ABS(K41-N41/2)*Vsd_Q1*Deadtime*Fsw)","v":7.4934142432698768E-3},{"$f":"(AF41+AE41+AD41+AC41*(1+RdsonTopTc*Ta-RdsonTopTc*25))/(1-AC41*RdsonTopTc*ThetaJA_Q1)","v":0.13597533949854412},{"$f":"SQRT((1-M41))*SQRT(K41^2+(N41^2)/12)","v":2.3763767345273572},{"$f":"Rdson2*AH41^2","v":0.11859049407246103},{"$f":"IF(K41<N41/2,Deadtime*Fsw*Vsd_Q2*(K41+N41/2),2*Deadtime*Fsw*Vsd_Q2*K41)","v":2.8997414243269879E-2},{"$f":"(AJ41+AI41*(1+RdsonBotTc*Ta-RdsonBotTc*25))/(1-AI41*RdsonBotTc*ThetaJA_Q2)","v":0.14914437355111571},{"$f":"Qrr_Q2*K41/Iout*Fsw*Vin","v":2.3040000000000001E-2},{"$f":"Iq*Vin","v":8.3999999999999993E-4},{"$f":"IF(Ext_VCC=1,  (Qg_Q1+Qg_Q2)*Fsw*Vout, (Qg_Q1+Qg_Q2)*Fsw*Vin)","v":4.4999999999999998E-2},{"$f":"(Vin-VCC)*Fsw*(Qg_Q1+Qg_Q2)","v":0.18629999999999999},{"$f":"(Qg_Q1+Qg_Q2)*Fsw*(Vin-Vout)","v":0.17099999999999999},{"$f":"SUM(AM41:AN41)","v":4.5839999999999999E-2},1.7234397129998751,{"$f":"((T41+S41*(1+Ltc*(Ta-25))) + (AF41+AE41+AD41+AC41*(1+RdsonTC*(Ta-25))) + (AJ41+AI41*(1+RdsonTC*(Ta-25))) + AQ41 + AL41) / (1-S41*Ltc*ThetaCa-AC41*RdsonTC*ThetaJA_Q1 -AI41*RdsonTC*ThetaJA_Q2)","v":1.8307294993875287},1.8307294993875287,{"$f":"Vout*K41","v":9.6},0.83984141174142724,{"$f":"ThetaJA_Q1*BC41","v":3.3259982689679708},{"$f":"ThetaJA_Q2*BD41","v":3.4484466181245454},null,83.984141174142721,{"$f":"U41","v":1.4326237001980322},{"$f":"AG41+AK41+AL41","v":0.30815971304965983},{"$f":"AG41+AL41*0.66","v":0.15118173949854413},{"$f":"AK41+AL41*0.33","v":0.15674757355111571},1.740783413247692]
["RGateTop",{"$f":"Rgate1","v":1},"W","Gate Resistance",null,null,33,24,1,{"$f":"Iout*G42/100","v":1.98},1.98,0.45833333333333331,0.21867947114956671,6.5232881505133706,5.2416440752566853,-1.2816440752566853,24,2.7324910535783422,0.50772250033622612,0.88048227907349441,1.4519416605156861,1.8831110848501953,7.0922147157713592E-3,7.0922147157713592E-3,1.1294769537500455,1.2757181890524826E-3,1.2757181890524826E-3,1.2777996244939145,6.6943647094628342E-2,6.4993368700265258E-2,0,7.1772068214374382E-3,0.13993860667796304,2.4153127080212387,0.12250844502810668,2.9353206821437439E-2,0.15351667570143804,2.376E-2,8.3999999999999993E-4,4.4999999999999998E-2,0.18629999999999999,0.17099999999999999,4.5839999999999999E-2,1.7487806538755959,1.861532706033721,1.861532706033721,9.9,0.84172703060386456,3.4236445469151868,3.5498644654316371,null,84.172703060386453,1.4519416605156861,0.31721528237940111,0.15562020667796303,0.16135747570143805,1.7691569428950871]
["GfsTop",{"$f":"Gfs_Q1","v":100},"S","Transconductance of Top FET",null,null,34,24,1,2.04,2.04,0.47222222222222215,0.21899243184249448,6.530349448726219,5.3051747243631091,-1.2251747243631095,24,2.7776588451799782,0.52464642889404678,0.88048227907349441,1.4718952455235292,1.8851495060622034,7.1075773204131399E-3,7.1075773204131399E-3,1.1487382402939801,1.31959954471371E-3,1.31959954471371E-3,1.299850655001813,6.9274080737654328E-2,6.6962864721485424E-2,0,6.8609784564334138E-3,0.14397561642148188,2.4547457984275947,0.12654131563285653,2.9708978456433412E-2,0.15800983405025096,2.4480000000000002E-2,8.3999999999999993E-4,4.4999999999999998E-2,0.18629999999999999,0.17099999999999999,4.5839999999999999E-2,1.7747969259724048,1.8933039008820538,1.8933039008820538,10.199999999999999,0.84344196454502718,3.5229131612726015,3.6539411491055214,null,84.344196454502722,1.4718952455235292,0.32646545047173287,0.16013241642148188,0.16608823405025097,1.798360695995262]
["VthTop",{"$f":"Vth_Q1","v":1.5},"V","Threshold Voltage of Top FET",null,null,35,24,1,2.1,2.1,0.4861111111111111,0.2193053597348206,6.5374032684108192,5.3687016342054097,-1.1687016342054095,24,2.823379203097895,0.54205996846502791,0.88048227907349441,1.4924900392360063,1.8871857684090629,7.1229402489714107E-3,7.1229402489714107E-3,1.168246350997727,1.3647995366195043E-3,1.3647995366195043E-3,1.322189896824852,7.1675631053894226E-2,6.8932360742705603E-2,0,6.5447291515502931E-3,0.14808677167548065,2.4946510780507949,0.13068896402561986,3.0064729151550295E-2,0.16262397110844085,2.5200000000000004E-2,8.3999999999999993E-4,4.4999999999999998E-2,0.18629999999999999,0.17099999999999999,4.5839999999999999E-2,1.801488661663843,1.9260555106708495,1.9260555106708495,10.5,0.84499863943011899,3.6238129768605747,3.7606793643856982,null,84.499863943011903,1.4924900392360063,0.33591074278392152,0.16471877167548066,0.17093997110844084,1.8284007820199277]
["VspTop",{"$f":"Vsp_Q1","v":1.56},"V",null,null,null,36,24,1,2.16,2.16,0.5,0.21961825483170144,6.5444496107428192,5.4322248053714102,-1.1122248053714094,24,2.869625711766139,0.5599631173427938,0.88048227907349441,1.5137318316473558,1.8892198722301543,7.1383034512586411E-3,7.1383034512586411E-3,1.1879906536375102,1.4113217931300789E-3,1.4113217931300789E-3,1.3448054888923726,7.4148573921157188E-2,7.0901856763925755E-2,0,6.2284589100798926E-3,0.15227247886482628,2.5350049157100796,0.13495124837615963,3.0420458910079898E-2,0.16735921678671034,2.5920000000000006E-2,8.3999999999999993E-4,4.4999999999999998E-2,0.18629999999999999,0.17099999999999999,4.5839999999999999E-2,1.8288559932976904,1.9598004430144276,1.9598004430144276,10.8,0.84640822152611683,3.7263529350261786,3.8700819693076274,null,84.64082215261169,1.5137318316473558,0.34555169565153659,0.1693796788648263,0.17591281678671034,1.8592835272988923]
["VsdTop",{"$f":"Vsd_Q1","v":0.7},"V",null,null,null,37,24,1,2.2200000000000002,2.2200000000000002,0.51388888888888895,0.21993111713829219,6.5514884768976165,5.4957442384488084,-1.055744238448808,24,2.9163733366249347,0.57835587382322617,0.88048227907349441,1.5356266229428506,1.8912518178647852,7.1536668771537103E-3,7.1536668771537103E-3,1.2079610645237069,1.4591699334052474E-3,1.4591699334052474E-3,1.3676861817201218,7.6693185158394808E-2,7.2871352785145907E-2,0,5.9121677353133253E-3,0.15653314794031437,2.5757849186041697,0.13932802688508247,3.0776167735313328E-2,0.17221570840728412,2.6640000000000004E-2,8.3999999999999993E-4,4.4999999999999998E-2,0.18629999999999999,0.17099999999999999,4.5839999999999999E-2,1.8568990531959706,1.9945521000409083,1.9945521000409083,11.100000000000001,0.84768076946788606,3.8305420546869158,3.9821519849602507,null,84.768076946788611,1.5356266229428506,0.35538885634759848,0.17411554794031436,0.18100690840728412,1.891015479290449]
["θJATop",{"$f":"ThetaJA_Q1","v":22},"°C/W","Junction to Ambient Resistance",null,null,38,24,1,2.2799999999999998,2.2799999999999998,0.52777777777777768,0.22024394665974714,6.5585198680503698,5.5592599340251851,-0.99925993402518509,24,2.9635983598154714,0.5972382362044647,0.88048227907349441,1.5581806278914352,1.8932816056521951,7.169030476601908E-3,7.169030476601908E-3,1.2281480234113162,1.5083475674091229E-3,1.5083475674091229E-3,1.3908213096086195,7.9309740525718861E-2,7.4840848806366073E-2,0,5.5958556305410372E-3,0.160869192426701,2.6169698743087428,0.14381915778382987,3.1131855630541036E-2,0.17719359071674956,2.7359999999999999E-2,8.3999999999999993E-4,4.4999999999999998E-2,0.18629999999999999,0.17099999999999999,4.5839999999999999E-2,1.8856179736549563,2.0303243926881565,2.0303243926881565,11.399999999999999,0.84882536465064673,3.9363894333874221,4.0968925957684901,null,84.882536465064675,1.5581806278914352,0.36542278314345056,0.17892679242670101,0.18622239071674956,1.9236034110348856]
["Low-side FET","Input Value","Units","Description",null,null,39,24,1,2.34,2.34,0.54166666666666663,0.22055674340121931,6.5655437853759784,5.6227718926879895,-0.94277189268798933,24,3.0112783165638191,0.61661020278690515,0.88048227907349441,1.5814002804259575,1.895309235931548,7.1843941996148561E-3,7.1843941996148561E-3,1.2485424686068174,1.5588582959148057E-3,1.5588582959148057E-3,1.4142007630306765,8.1998515724418464E-2,7.6810344827586224E-2,0,5.2795225990527397E-3,0.16528102947133411,2.658539693450312,0.14842449933466847,3.1487522599052742E-2,0.18229301590003211,2.8079999999999994E-2,8.3999999999999993E-4,4.4999999999999998E-2,0.18629999999999999,0.17099999999999999,4.5839999999999999E-2,1.9150128869451781,2.0671317556877433,2.0671317556877433,11.7,0.84985022353448969,4.0439042483693504,4.2143071498007068,null,84.985022353448969,1.5814002804259575,0.37565404537136621,0.18381382947133409,0.19155941590003212,1.9570543257973236]
["RdsonBot",{"$f":"Rdson2*1000","v":21},"mW","Drain-Source Resistance of Low-side FET",null,null,40,24,1,2.4,2.4,0.55555555555555547,0.22086950736786085,6.5725602300491115,5.6862801150245552,-0.88628011502455584,24,3.0593919327433792,0.63647177187319837,0.88048227907349441,1.6052922384175086,1.8973347090419417,7.1997579962705394E-3,7.1997579962705394E-3,1.2691358124759853,1.6107057105090791E-3,1.6107057105090791E-3,1.4378149614400748,8.4759786396977871E-2,7.8779840848806376E-2,0,4.9631686441375129E-3,0.16976907989339643,2.700475353487668,0.15314390983068127,3.1843168644137512E-2,0.18751414359551039,2.8799999999999999E-2,8.3999999999999993E-4,4.4999999999999998E-2,0.18629999999999999,0.17099999999999999,4.5839999999999999E-2,1.9450839253114334,2.1049891632686131,2.1049891632686131,12,0.85076279471732585,4.1530957576547216,4.3343991591012285,null,85.07627947173259,1.6052922384175086,0.38608322348890683,0.18877707989339643,0.1970181435955104,1.9913754619064155]
["RdsonBotTc",{"$f":"RdsonBotTc*1000000","v":4000},"ppm","Drain To Source Resitance Temp Co",null,null,41,24,1,2.46,2.46,0.56944444444444442,0.22118223856482255,6.5795692032441782,5.749784601622089,-0.82978460162208911,24,3.1079190639970986,0.65682294176824896,0.88048227907349441,1.6298633886507243,1.8993580253223989,7.2151218167132054E-3,7.2151218167132054E-3,1.2899199175131344,1.6638933935970914E-3,1.6638933935970914E-3,1.4616548266838303,8.7593828127093654E-2,8.0749336870026542E-2,0,4.6467937690836993E-3,0.17433376823376862,2.7427588439358761,0.15797724759575776,3.2198793769083696E-2,0.19285714091127226,2.9519999999999998E-2,8.3999999999999993E-4,4.4999999999999998E-2,0.18629999999999999,0.17099999999999999,4.5839999999999999E-2,1.9758312209727888,2.1439121456140509,2.1439121456140509,12.3,0.85156984312833428,4.2639733011429097,4.4571723000479899,null,85.15698431283343,1.6298633886507243,0.39671090914504087,0.19381696823376862,0.20259874091127225,2.026574297795765]
["QgBot",{"$f":"Qg_Q2*1000000000","v":6},"nC","Gate Charge Of Top FET",null,null,42,24,1,2.52,2.52,0.58333333333333326,0.22149493699725439,6.5865707061353493,5.8132853530676751,-0.77328535306767465,24,3.1568406367089064,0.67766371077921528,0.88048227907349441,1.655120852007254,1.9013791851118738,7.2304856111533866E-3,7.2304856111533866E-3,1.3108870730947983,1.7184249184070473E-3,1.7184249184070473E-3,1.4857117571582823,9.0500916439692394E-2,8.2718832891246721E-2,0,4.3303979771789781E-3,0.17897552280552531,2.7853731132863229,0.1629243709845852,3.2554397977178982E-2,0.19832218244251706,3.0240000000000003E-2,8.3999999999999993E-4,4.4999999999999998E-2,0.18629999999999999,0.17099999999999999,4.5839999999999999E-2,2.0072549061225917,2.1839168061075735,2.1839168061075735,12.6,0.85227752328764816,4.3765463017215573,4.5826304137353748,null,85.227752328764822,1.655120852007254,0.40753770524804239,0.19893392280552533,0.20830138244251706,2.0626585572552965]
["RGateBot",{"$f":"Rgate2","v":1},"W","Gate Resistance",null,null,43,24,1,2.58,2.58,0.59722222222222221,0.22180760267030514,6.5935647398965482,5.8767823699482742,-0.71678236994827405,24,3.2061385910365634,0.69899407721550666,0.88048227907349441,1.6810719888649486,1.9033981887492486,7.2458493298678409E-3,7.2458493298678409E-3,1.3320299730091985,1.774303848994886E-3,1.774303848994886E-3,1.509977602813608,9.348132680094795E-2,8.4688328912466873E-2,0,4.0139812717103346E-3,0.18369477574507373,2.8283020178077143,0.16798513838263895,3.2909981271710333E-2,0.20390945029010629,3.0960000000000001E-2,8.3999999999999993E-4,4.4999999999999998E-2,0.18629999999999999,0.17099999999999999,4.5839999999999999E-2,2.0393551129284755,2.2250198394055176,2.2250198394055176,12.9,0.85289144324897825,4.4908242663916216,4.7107775063823381,null,85.289144324897819,1.6810719888649486,0.41856422603518001,0.20412837574507373,0.21412625029010629,2.0996362149001286]
["VsdBot",{"$f":"Vsd_Q2","v":0.7},"V","Diode Forward Voltage of Bottom FET Body Diode",null,null,44,24,1,2.64,2.64,0.61111111111111116,0.22212023558912247,6.6005513057014511,5.9402756528507261,-0.66027565285072543,24,3.2557958261536859,0.72081403938878397,0.88048227907349441,1.7077244047207318,1.9054150365733344,7.2612129231995224E-3,7.2612129231995224E-3,1.3533416938264211,1.8315337402489667E-3,1.8315337402489667E-3,1.5344446410815469,9.6535334618298968E-2,8.6657824933687025E-2,0,3.6975436559640623E-3,0.188491963063947,2.8715302723558191,0.17315940820617359,3.3265543655964069E-2,0.20961913408026828,3.1680000000000007E-2,8.3999999999999993E-4,4.4999999999999998E-2,0.18629999999999999,0.17099999999999999,4.5839999999999999E-2,2.0721319735323664,2.2672385503764092,2.2672385503764092,13.200000000000001,0.85341672057413021,4.6068167874068342,4.8416177497659021,null,85.341672057413021,1.7077244047207318,0.42979109714421526,0.209400763063947,0.22007353408026828,2.137515501864947]
["QrrBot",{"$f":"Qrr_Q2*1000000000","v":3},"nC","Reverse Recovery Charge of Body Diode",null,null,45,24,1,2.7,2.7,0.625,0.22243283575885306,6.6075304047234864,6.0037652023617429,-0.60376520236174303,24,3.3057961477953808,0.74312359561295704,0.88048227907349441,1.7350859560455052,1.907429728922871,7.2765763415575547E-3,7.2765763415575547E-3,1.3748156741522639,1.8901181378947439E-3,1.8901181378947439E-3,1.5591055537763481,9.9663215240466368E-2,8.8627320954907204E-2,0,3.381085133225761E-3,0.19336752470126334,2.9150434032725014,0.17844703890221308,3.3621085133225759E-2,0.21545143098545963,3.2399999999999998E-2,8.3999999999999993E-4,4.4999999999999998E-2,0.18629999999999999,0.17099999999999999,4.5839999999999999E-2,2.1055856200504897,2.3105908739496153,2.3105908739496153,13.5,0.85385803146948358,4.7245335434277935,4.9751554816801118,null,85.385803146948362,1.7350859560455052,0.44121895568672298,0.21475152470126335,0.22614343098545964,2.1763049117322284]
["TrrBot",{"$f":"Trr_Q2*1000000000","v":40},"ns","Reverse Recovery Time of Body Diode",null,null,46,24,1,2.76,2.76,0.63888888888888884,0.22274540318464242,6.6145020381358419,6.0672510190679212,-0.54725101906792117,24,3.3561242181582909,0.76592274420418482,0.88048227907349441,1.763164756379866,1.9094422661365285,7.2919395354172026E-3,7.2919395354172026E-3,1.3964456947906871,1.950060578499445E-3,1.950060578499445E-3,1.5839534049985817,0.10286524395747065,9.0596816976127328E-2,0,3.0646057067803588E-3,0.19832190457686233,2.9588277034159995,0.18384788894854198,3.3976605706780356E-2,0.22140654574639024,3.3119999999999997E-2,8.3999999999999993E-4,4.4999999999999998E-2,0.18629999999999999,0.17099999999999999,4.5839999999999999E-2,2.1397161845733796,2.3550953959184322,2.3550953959184322,13.799999999999999,0.85421965403476086,4.8439843006909715,5.1113952064205854,null,85.421965403476079,1.763164756379866,0.45284845032325255,0.22018110457686232,0.23233614574639025,2.2160132067031184]
["θJABot",{"$f":"ThetaJA_Q2","v":22},"°C/W","Junction to Ambient Resistance",null,null,47,24,1,2.82,2.82,0.65277777777777768,0.22305793787163508,6.6214662071114585,6.1307331035557286,-0.49073310355572941,24,3.4067655081704578,0.78921148348087433,0.88048227907349441,1.7919691826798672,1.9114526485529055,7.3073024553198355E-3,7.3073024553198355E-3,1.4182258598251369,2.011364589476749E-3,2.011364589476749E-3,1.6089816200548657,0.10614169600064959,9.2566312997347508E-2,0,2.7481053799120847E-3,0.20335555064513175,3.0028701893331213,0.18936181685369627,3.4332105379912083E-2,0.22748469069521568,3.3839999999999995E-2,8.3999999999999993E-4,4.4999999999999998E-2,0.18629999999999999,0.17099999999999999,4.5839999999999999E-2,2.1745237991658861,2.4007713747454886,2.4007713747454886,14.1,0.8545055064262097,4.965178914192899,5.2503415952947448,null,85.450550642620968,1.7919691826798672,0.46468024134034741,0.22568995064513175,0.23865189069521567,2.2566494240202144]
[null,null,null,null,null,null,48,24,1,2.88,2.88,0.66666666666666652,0.2233704398249744,6.6284229128230265,6.1942114564115132,-0.43421145641151337,24,3.4577062521180775,0.81298981176367813,0.88048227907349441,1.8215078819225166,1.913460876510529,7.3226650518728835E-3,7.3226650518728835E-3,1.4401505786171975,2.0740336890914487E-3,2.0740336890914487E-3,1.6341839653931791,0.10949284654267519,9.453580901856766E-2,0,2.4315841559044747E-3,0.20846891494953423,3.0471585605590441,0.19498868115695359,3.468758415590447E-2,0.23368608577990199,3.456E-2,8.3999999999999993E-4,4.4999999999999998E-2,0.18629999999999999,0.17099999999999999,4.5839999999999999E-2,2.210008595867178,2.4476387644213351,2.4476387644213351,14.399999999999999,0.85471918061359242,5.0881273288897537,5.3919994871578441,null,85.471918061359247,1.8215078819225166,0.47671500072943623,0.23127851494953425,0.24509088577990198,2.2982228826519528]
[null,null,null,null,null,null,49,24,1,2.94,2.94,0.68055555555555547,0.2236829090498027,6.6353721564429939,6.2576860782214965,-0.37768607822149702,24,3.508933404593896,0.83725772737549398,0.88048227907349441,1.8517897779812054,1.9154669503478552,7.3380272757498253E-3,7.3380272757498253E-3,1.4622145487116891,2.138071386464129E-3,2.138071386464129E-3,1.6595545295428329,0.11291897069757148,9.6505305039787825E-2,0,2.115042038040383E-3,0.21366245367784947,3.0916811610107495,0.2007283404283243,3.504304203804038E-2,0.24001095858977023,3.5280000000000006E-2,8.3999999999999993E-4,4.4999999999999998E-2,0.18629999999999999,0.17099999999999999,4.5839999999999999E-2,2.2461707066907537,2.4957182384302681,2.4957182384302681,14.7,0.85486397230837086,5.2128395809126884,5.5363738889749445,null,85.486397230837085,1.8517897779812054,0.48895341226761968,0.23694725367784947,0.25165335858977023,2.3407431902488249]
[null,null,null,null,null,null,50,24,1,3,3,0.69444444444444442,0.22399534555126127,6.6423139391435662,6.3211569695717831,-0.32115696957178308,21.410464638118874,3.5604345997146298,0.86201522864146529,0.88048227907349441,1.882824078781786,1.9174708704032708,7.3533890776901539E-3,7.3533890776901539E-3,1.4844127396299962,2.2034811815758309E-3,2.2034811815758309E-3,1.6850877050398265,0.11642034352073197,9.8474801061007991E-2,4.8437860542406112E-3,1.7984790296019851E-3,0.22383055147861719,3.1364269424248805,0.20658065326854239,3.5398479029601984E-2,0.24645954438222617,3.6000000000000004E-2,8.3999999999999993E-4,4.4999999999999998E-2,0.18629999999999999,0.17099999999999999,4.5839999999999999E-2,2.2878540496786868,2.5504309219704293,2.5504309219704293,15,0.85467986892688286,5.4469921325295783,5.6834699764089756,null,85.467986892688288,1.882824078781786,0.50629009586084339,0.24759055147861719,0.25833954438222617,2.3891141746426294]
[null,null,null,null,null,null,51,24,1,3.06,3.06,0.70833333333333337,0.22430774933449024,6.6492482620966982,6.3846241310483496,-0.26462413104834903,17.641608736556602,3.6121981125416784,0.88726231388897714,0.88048227907349441,1.9146202837505526,1.9194726370150901,7.3687504084993275E-3,7.3687504084993275E-3,1.506740377527833,2.2702665652727166E-3,2.2702665652727166E-3,1.7107781713119554,0.11999724000893661,0.10044429708222814,1.0695325553935131E-2,1.4818951338707545E-3,0.23510137115715402,3.1813854297793256,0.2125454783090559,3.5753895133870756E-2,0.25303208611068073,3.6720000000000003E-2,8.3999999999999993E-4,4.4999999999999998E-2,0.18629999999999999,0.17099999999999999,4.5839999999999999E-2,2.3312227241843688,2.6075630192466432,2.6075630192466432,15.3,0.85438761173454514,5.7054045654573891,5.8332930944349766,null,85.438761173454509,1.9146202837505526,0.52485345726783472,0.25933657115715403,0.26514968611068074,2.4394737410183875]
["Controller","Input Value","Units","Std Units",null,null,52,24,1,3.12,3.12,0.72222222222222221,0.2246201204046287,6.6561751264741007,6.4480875632370509,-0.20808756323705024,13.87250421580335,3.664212822629763,0.91299898144765756,0.88048227907349441,1.947188191565973,1.9214722505215567,7.3841112190487519E-3,7.3841112190487519E-3,1.5291929306894962,2.3384310192707302E-3,2.3384310192707302E-3,1.7366208784932788,0.12364993510036947,0.10241379310344831,1.5126683025447254E-2,1.1652903541274813E-3,0.24502183173955625,3.2265466886294405,0.21862267421201778,3.6109290354127486E-2,0.25972883445366968,3.7440000000000001E-2,8.3999999999999993E-4,4.4999999999999998E-2,0.18629999999999999,0.17099999999999999,4.5839999999999999E-2,2.3738489266706897,2.6644255306002176,2.6644255306002176,15.600000000000001,0.85411939038891527,5.9341090982702376,5.9858487579807331,null,85.411939038891532,1.947188191565973,0.54219066619322598,0.26973223173955624,0.27208403445366969,2.4893788577591991]
["θJA",20,"°C/W","Junction to Ambient Resistance",null,null,53,24,1,3.18,3.18,0.73611111111111105,0.22493245876681467,6.6630945334472393,6.5115472667236194,-0.15154726672361951,10.103151114907968,3.7164681796213288,0.93922522964937549,0.88048227907349441,1.9805379082266201,1.9234697112608439,7.3994714602757484E-3,7.3994714602757484E-3,1.5517660958276749,2.4079780161602648E-3,2.4079780161602648E-3,1.7626110321341135,0.1273787036746363,0.10438328912466846,1.8137577323429882E-2,8.4866469365226936E-4,0.25359081693457974,3.2719012942839503,0.22481209967027679,3.6464664693652268E-2,0.26655004784517833,3.8159999999999999E-2,8.3999999999999993E-4,4.4999999999999998E-2,0.18629999999999999,0.17099999999999999,4.5839999999999999E-2,2.4157325079031855,2.7210268315776136,2.7210268315776136,15.9,0.85387342727183635,6.1330811725607548,6.1411426525939232,null,85.387342727183636,1.9805379082266201,0.55830086477975804,0.27877641693457977,0.27914284784517834,2.5388387730063782]
["Theta Ja",2,"°C/W","Junction to Ambient Resistance",null,null,54,24,1,3.24,3.24,0.75000000000000011,0.2252447644261851,6.6700064841873399,6.5750032420936702,-9.5003242093669726E-2,6.3335494729113151,3.7689541708001393,0.96594105682824005,0.88048227907349441,2.014679855448402,1.9254650195710552,7.414831083183528E-3,7.414831083183528E-3,1.5744557851558783,2.4789110194108131E-3,2.4789110194108131E-3,1.7887440787703912,0.13118382055278155,0.10635278514588863,1.9727727342873768E-2,5.3201815572455054E-4,0.26080715495049234,3.3174403027418036,0.23111361340736822,3.6820018155724554E-2,0.27349599250618012,3.8879999999999998E-2,8.3999999999999993E-4,4.4999999999999998E-2,0.18629999999999999,0.17099999999999999,4.5839999999999999E-2,2.4568733186620961,2.7773753141765987,2.7773753141765987,16.200000000000003,0.85364807997964687,6.3022950089108312,6.2991806351359632,null,85.364807997964689,2.014679855448402,0.57318314745667243,0.28646795495049232,0.28632639250618014,2.5878630029050744]
[null,null,null,null,null,null,55,24,1,3.3,3.3,0.76388888888888884,0.22555703738787586,6.6769109798653714,6.6384554899326851,-3.8455489932685882E-2,2.5636993288457255,3.8216612905149718,0.99314646132059814,0.88048227907349441,2.0496247794048563,1.9274581757902203,7.4301900388411271E-3,7.4301900388411271E-3,1.5972581141993378,2.5512334833756247E-3,2.5512334833756247E-3,1.8150156923147862,0.13506556049730584,0.10832228116710876,1.9896852019102091E-2,2.1535074362304094E-4,0.26666961799225158,3.3631552233091528,0.2375270741775044,3.7175350743623034E-2,0.28056694247739483,3.9599999999999996E-2,8.3999999999999993E-4,4.4999999999999998E-2,0.18629999999999999,0.17099999999999999,4.5839999999999999E-2,2.4972712097423599,2.8334793927136475,2.8334793927136475,16.5,0.85344182828355653,6.4417235958295347,6.459968734502687,null,85.344182828355656,2.0496247794048563,0.58683656046964638,0.29280561799225158,0.29363494247739486,2.6364613398745025]
[null,null,null,null,null,null,56,24,1,3.36,3.36,0.77777777777777779,0.22586927765702167,6.6838080216520659,6.7019040108260324,1.8095989173966931E-2,0,3.8745805113833556,1.020841441465036,0.88048227907349441,2.0853837598250173,1.9294491802563003,7.4455482783834185E-3,7.4455482783834185E-3,1.6201693903096572,2.6249488532963665E-3,2.6249488532963665E-3,1.8414217612313002,0.13902419821218354,0.11029177718832894,1.9200000000000005E-2,0,0.27184172221804698,3.4090379928149113,0.24405234076556592,3.7631999999999999E-2,0.28786674134632911,4.0320000000000002E-2,8.3999999999999993E-4,4.4999999999999998E-2,0.18629999999999999,0.17099999999999999,4.5839999999999999E-2,2.5376840367046087,2.8902108141382148,2.8902108141382148,16.8,0.85321585221104146,6.5659642887970335,6.6257915096192397,null,85.321585221104144,2.0853837598250173,0.60002846356437611,0.29845292221804698,0.30117234134632909,2.6854122233893936]
["Outputs",null,null,null,null,null,57,24,1,3.42,3.42,0.79166666666666663,0.22618148523875639,6.6906976107179128,6.7653488053589559,7.4651194641043528E-2,0,3.9277032571854931,1.0490259956023762,0.88048227907349441,2.1219682194640912,1.9314380333071866,7.4609057530110653E-3,7.4609057530110653E-3,1.6431861018484082,2.7000605653077674E-3,2.7000605653077674E-3,1.8679583764548402,0.14306000834287991,0.11226127320954911,1.9200000000000005E-2,0,0.278021370637484,3.4550809513436485,0.25068927198709234,3.8303999999999998E-2,0.29551247093280247,4.104E-2,8.3999999999999993E-4,4.4999999999999998E-2,0.18629999999999999,0.17099999999999999,4.5839999999999999E-2,2.5799028282153924,2.9496359289017011,2.9496359289017011,17.100000000000001,0.85288331721526289,6.7123709540246486,6.7992247605216543,null,85.288331721526291,2.1219682194640912,0.61457384157028638,0.30510777063748401,0.30905567093280245,2.7365420610343776]
["Design","Value","Units",null,null,null,58,24,1,3.48,3.48,0.80555555555555547,0.22649366013821245,6.6975797482331449,6.8287898741165725,0.13121012588342751,0,3.9810213773597383,1.0777001220756754,0.88048227907349441,2.1593899339629896,1.9334247352806961,7.47626241399046E-3,7.47626241399046E-3,1.6663049080052135,2.776572046442263E-3,2.776572046442263E-3,1.8946218200176603,0.1471732654763683,0.11423076923076926,1.9200000000000005E-2,0,0.28428589161089435,3.5012768194057715,0.25743772668827214,3.8975999999999997E-2,0.30328449124527962,4.1759999999999999E-2,8.3999999999999993E-4,4.4999999999999998E-2,0.18629999999999999,0.17099999999999999,4.5839999999999999E-2,2.6228001625445798,3.0105040761389543,3.0105040761389543,17.399999999999999,0.85250221822505567,6.8606448154396764,6.9754364073961508,null,85.250221822505566,2.1593899339629896,0.62933038285617404,0.31184749161089437,0.3170652912452796,2.7887203168191634]
["Dmax",{"$f":"D1_Vinmin","v":0.41666666666666669},"index",null,null,null,59,24,1,3.54,3.54,0.81944444444444431,0.22680580236052164,6.704454435367766,6.8922272176838835,0.18777278231611705,0,4.0345271230129161,1.1068638192302278,0.88048227907349441,2.1976610421136433,1.9354092865145802,7.4916182126537533E-3,7.4916182126537533E-3,1.6895226292165078,2.8544867146346612E-3,2.8544867146346612E-3,1.9214085543452046,0.1513642441411481,0.11620026525198944,1.9200000000000005E-2,0,0.29063579370983977,3.5476186764667861,0.26429756374593499,3.9648000000000003E-2,0.31118311847399038,4.2480000000000004E-2,8.3999999999999993E-4,4.4999999999999998E-2,0.18629999999999999,0.17099999999999999,4.5839999999999999E-2,2.6663761714427947,3.0728449932164987,3.0728449932164987,17.7,0.85207394585479479,7.0107970616164756,7.1544334064277884,null,85.207394585479477,2.1976610421136433,0.64429891218383017,0.3186725937098398,0.32520151847399037,2.8419599542974736]
["Dprime",{"$f":"1-B68","v":0.58333333333333326},"index",null,null,null,60,24,1,3.6,3.6,0.83333333333333326,0.22711791191081426,6.7113216732915193,6.9556608366457597,0.24433916335424044,0,4.0882131243612259,1.1365170854135578,0.88048227907349441,2.2367940565478479,1.9373916873465142,7.5069731003987476E-3,7.5069731003987476E-3,1.712836238152019,2.9338079787267599E-3,2.9338079787267599E-3,1.9483152121848151,0.15563321880726119,0.11816976127320958,1.9200000000000005E-2,0,0.29707159036910025,3.5940999407596634,0.27126864206754098,4.0320000000000002E-2,0.31920867684631737,4.3200000000000002E-2,8.3999999999999993E-4,4.4999999999999998E-2,0.18629999999999999,0.17099999999999999,4.5839999999999999E-2,2.7106309866350644,3.1366895006381141,3.1366895006381141,18,0.85159977391239927,7.162838988120205,7.3362228906189824,null,85.15997739123992,2.2367940565478479,0.65948026721541764,0.32558359036910023,0.33346467684631736,2.8962743237632655]
["Ipp",{"$f":"Iripple_Vinnom","v":6.7516905367449214},"A",null,null,null,61,24,1,3.66,3.66,0.84722222222222221,0.22742998879421986,6.718181463173913,7.0190907315869566,0.30090926841304366,0,4.1420723695204149,1.1666599189754236,0.88048227907349441,2.276801874868422,1.9393719381141064,7.5223270286889302E-3,7.5223270286889302E-3,1.7362428512371224,3.0145392384720126E-3,3.0145392384720126E-3,1.9753385871319482,0.1599804638863101,0.12013925729442974,1.9200000000000005E-2,0,0.30359379995228475,3.6407143503070967,0.27835082059117255,4.0992000000000001E-2,0.3273614986681862,4.3919999999999994E-2,8.3999999999999993E-4,4.4999999999999998E-2,0.18629999999999999,0.17099999999999999,4.5839999999999999E-2,2.7555647398208309,3.2020695453546772,3.2020695453546772,18.3,0.85108086742066857,7.3167819989502645,7.5208121707000961,null,85.10808674206686,2.276801874868422,0.67487529862047091,0.33258099995228474,0.3418550986681862,2.9516771734888927]
["Top FET","Value","Units",null,null,null,62,24,1,3.72,3.72,0.86111111111111116,0.22774203301586671,6.7250338061842081,7.0825169030921042,0.35748309690789615,0,4.1960981845670275,1.1972923182678159,0.88048227907349441,2.3176977912423995,1.9413500391548932,7.5376799490534108E-3,7.5376799490534108E-3,1.7597397206803498,3.0966838845401553E-3,3.0966838845401553E-3,2.002475624719799,0.16440625373147491,0.1221087533156499,1.9200000000000005E-2,0,0.31020294581834956,3.6874559450832431,0.28554395828552487,4.1664E-2,0.335641924366747,4.4639999999999999E-2,8.3999999999999993E-4,4.4999999999999998E-2,0.18629999999999999,0.17099999999999999,4.5839999999999999E-2,2.8011775626739599,3.2690182463139732,3.2690182463139732,18.600000000000001,0.85051828987042133,7.4726376080036907,7.7082087360684337,null,85.051828987042128,2.3176977912423995,0.69048487018509652,0.33966534581834956,0.350373124366747,3.008182661427496]
["Tr",{"$f":"(Qgd_Q1+Qgs_Q1/2)*(RdsonDRT+Rgate1)/(VCC-Vsp_Q1)*1000000000","v":1.2931034482758625},"ns","Turn on of MOSFET -> Rise time of current",null,null,63,24,1,3.78,3.78,0.87499999999999989,0.22805404458088205,6.731878703491418,7.1459393517457084,0.41406064825429079,0,4.2502842147959283,1.2284142816449541,0.88048227907349441,2.3594955084770595,1.9433259908063396,7.5530318130868834E-3,7.5530318130868834E-3,1.7833242269766454,3.1802452985218495E-3,3.1802452985218495E-3,2.0297234140396427,0.16891086263753047,0.12407824933687006,1.9200000000000005E-2,0,0.31689955638904344,3.7343190502476751,0.29284791414989669,4.2335999999999999E-2,0.34405030253436164,4.5359999999999998E-2,8.3999999999999993E-4,4.4999999999999998E-2,0.18629999999999999,0.17099999999999999,4.5839999999999999E-2,2.8474695868427466,3.3375699423824741,3.3375699423824741,18.899999999999999,0.84991300978343798,7.630417440558956,7.8984202557559566,null,84.991300978343801,2.3594955084770595,0.70630985892340503,0.34683715638904344,0.35901910253436164,3.0658053674004644]
["Tf",{"$f":"(Qgd_Q1+Qgs_Q1/2)*(RdsonDRT2+Rgate1)/(Vsp_Q1)*1000000000","v":1.4423076923076925},"ns","Turn off of MOSFET -> Fall time of current",null,null,64,{"$f":"Vin","v":24},{"$f":"MODE","v":1},3.84,{"$f":"Iout*G73/100/Number_of_Phases","v":3.84},{"$f":"Vout*K73/(Vin*Efficiency)","v":0.88888888888888884},{"$f":"(Vout+(Rdson2+Rs+Rdcr)*K73)/(Vin+(Rs+Rdson2-Rdson1)*K73)","v":0.2283660234943922},{"$f":"(Vin-(Rdson1+Rdcr)*K73-Vout)*M73/(Fsw*Lf)","v":6.7387161562643181},7.2093580781321585,0.47064192186784082,{"$f":"IF(MIN(Vin, -P73/(Coss_Q1+Coss_Q2)*0.00000002)<0, 0, MIN(Vin, -P73/(Coss_Q1+Coss_Q2)*0.00000002))","v":0},4.3046244071027626,{"$f":"R73^2*Rdcr","v":1.2600258074632873},{"$f":"Core_Loss","v":0.88048227907349441},{"$f":"(T73+S73*(1+Ltc*(Ta-25)))/(1-S73*Ltc*ThetaCa)","v":2.4022091506007346},1.9452997934058422,7.5683825724496253E-3,7.5683825724496253E-3,1.8069938718582632,3.2652268529333177E-3,3.2652268529333177E-3,2.0570791798606582,{"$f":"Rdson1*AB73^2","v":0.17349456484086412},{"$f":"(Vin*K73/2)*Fsw*(Tr_buck+Tf_buck)","v":0.12604774535809021},{"$f":"(0.5*Coss_Q1*(Vin-Q73)^2-0.5*Coss_Q2*(Vin-Q73)^2+(Qoss_Q2*(Vin-Q73)/Vin)*Vin)*Fsw","v":1.9200000000000005E-2},{"$f":"IF(K73>N73/2,0,ABS(K73-N73/2)*Vsd_Q1*Deadtime*Fsw)","v":0},{"$f":"(AF73+AE73+AD73+AC73*(1+RdsonTopTc*Ta-RdsonTopTc*25))/(1-AC73*RdsonTopTc*ThetaJA_Q1)","v":0.32368416521729659},{"$f":"SQRT((1-M73))*SQRT(K73^2+(N73^2)/12)","v":3.7812982603873784},{"$f":"Rdson2*AH73^2","v":0.30026254721418089},{"$f":"IF(K73<N73/2,Deadtime*Fsw*Vsd_Q2*(K73+N73/2),2*Deadtime*Fsw*Vsd_Q2*K73)","v":4.3007999999999998E-2},{"$f":"(AJ73+AI73*(1+RdsonBotTc*Ta-RdsonBotTc*25))/(1-AI73*RdsonBotTc*ThetaJA_Q2)","v":0.3525869899739057},{"$f":"Qrr_Q2*K73/Iout*Fsw*Vin","v":4.6080000000000003E-2},{"$f":"Iq*Vin","v":8.3999999999999993E-4},{"$f":"IF(Ext_VCC=1,  (Qg_Q1+Qg_Q2)*Fsw*Vout, (Qg_Q1+Qg_Q2)*Fsw*Vin)","v":4.4999999999999998E-2},{"$f":"(Vin-VCC)*Fsw*(Qg_Q1+Qg_Q2)","v":0.18629999999999999},{"$f":"(Qg_Q1+Qg_Q2)*Fsw*(Vin-Vout)","v":0.17099999999999999},4.5839999999999999E-2,2.8944409439499172,{"$f":"((T73+S73*(1+Ltc*(Ta-25))) + (AF73+AE73+AD73+AC73*(1+RdsonTC*(Ta-25))) + (AJ73+AI73*(1+RdsonTC*(Ta-25))) + AQ73 + AL73) / (1-S73*Ltc*ThetaCa-AC73*RdsonTC*ThetaJA_Q1 -AI73*RdsonTC*ThetaJA_Q2)","v":3.407760242780169},3.407760242780169,{"$f":"Vout*K73","v":19.2},0.84926590665395785,{"$f":"ThetaJA_Q1*BC73","v":7.7901332347805257},{"$f":"ThetaJA_Q2*BD73","v":8.0914545794259247},null,84.926590665395779,{"$f":"U73","v":2.4022091506007346},{"$f":"AG73+AK73+AL73","v":0.7223511551912023},{"$f":"AG73+AL73*0.66","v":0.35409696521729661},{"$f":"AK73+AL73*0.33","v":0.3677933899739057},3.1245603057919369]
["Part Power","Value","Units",null,null,null,65,24,1,{"$f":"Iout*G74/100","v":3.9},3.9,0.90277777777777768,0.2286779697615221,6.7455461656714286,{"$f":"K74+N74/2","v":7.2727730828357142},{"$f":"K74-N74/2","v":0.5272269171642856},0,{"$f":"SQRT(K74^2+(N74^2)/12)","v":4.3591129934235138},1.2921268940814923,0.88048227907349441,2.4458532759715119,{"$f":"N74/SQRT(12)","v":1.9472714472907238},{"$f":"RCoutEsr*V74^2","v":7.5837321788674202E-3},{"$f":"W74","v":7.5837321788674202E-3},{"$f":"SQRT(M74*(1-M74))*SQRT(K74^2+(N74^2)/12)","v":1.8307462716665488},{"$f":"RCinEsr*Y74^2","v":3.3516319112209688E-3},{"$f":"Z74","v":3.3516319112209688E-3},{"$f":"SQRT(M74)*SQRT(K74^2+(N74^2)/12)","v":2.0845402752194579},0.17815763451949257,0.12801724137931039,1.9200000000000005E-2,0,0.33055731105656766,3.8283884247058442,0.30778771653885562,4.3679999999999997E-2,0.36125235174540032,4.6799999999999994E-2,8.3999999999999993E-4,4.4999999999999998E-2,0.18629999999999999,0.17099999999999999,4.5839999999999999E-2,{"$f":"SUM(S74,T74,AC74,AD74,AE74,AF74,AI74,AJ74,AQ74, AL74)","v":2.9420917655926462},3.4796260801793233,{"$f":"AS74","v":3.4796260801793233},19.5,{"$f":"AU74/(AU74+AT74)","v":0.848577776329415},7.9517968432444874,8.2873197383988071,null,{"$f":"AV74*100","v":84.857777632941506},2.4458532759715119,0.73860966280196794,0.36144531105656763,0.37669635174540034,{"$f":"BA74+BB74","v":3.1844629387734797}]
["Power Dis",{"$f":"AQ9","v":4.5839999999999999E-2},"W",null,null,null,66,24,1,3.96,3.96,0.91666666666666663,0.22898988338739601,6.7523687328810391,7.33618436644052,0.58381563355948041,0,4.4137444751668387,1.324717539860474,0.88048227907349441,2.4904428909382212,1.9492409527982402,7.5990805841315819E-3,7.5990805841315819E-3,1.8545791511192089,3.4394638277660456E-3,3.4394638277660456E-3,2.1121041744510727,0.18290034579307957,0.12998673740053052,1.9200000000000005E-2,0,0.33751953793116884,3.8755846331014556,0.31542328121497504,4.4352000000000003E-2,0.37004676121398283,4.752E-2,8.3999999999999993E-4,4.4999999999999998E-2,0.18629999999999999,0.17099999999999999,{"$f":"SUM(AM75:AN75)","v":4.5839999999999999E-2},2.9904221833425537,3.5532057666286456,3.5532057666286456,19.8,0.8478493358840643,8.1154202344857147,8.4860239467076219,null,84.784933588406432,2.4904428909382212,0.75508629914515168,0.36888273793116882,0.38572836121398285,3.2455291900833729]
["Temp rise",{"$f":"B75*B62","v":0.91679999999999995},"°C",null,null,null,67,24,1,4.0199999999999996,4.0199999999999996,0.93055555555555536,0.22930176437713673,6.7591838590611815,7.3995919295305903,0.64040807046940884,0,4.4685136085782968,1.3577977431633617,0.88048227907349441,2.5359934640794202,1.9512083102655735,7.6144277400988693E-3,7.6144277400988693E-3,1.8784903374489927,3.528725947889231E-3,3.528725947889231E-3,2.1397684666345849,0.18772297272295266,0.13195623342175067,1.9200000000000005E-2,0,0.34457139520758573,3.9228822030804991,0.32316910036415991,4.5023999999999995E-2,0.37897060009923095,4.8240000000000005E-2,8.3999999999999993E-4,4.4999999999999998E-2,0.18629999999999999,0.17099999999999999,4.5839999999999999E-2,3.0394323287457197,3.6285390524757255,3.6285390524757255,20.099999999999998,0.84708122803299424,8.2810154945668852,8.687575602183081,null,84.708122803299418,2.5359934640794202,0.77178199530681679,0.37640979520758572,0.39488980009923097,3.307775459386237]
["Current (switching)",{"$f":"(Qg_Q1+Qg_Q2)*Fsw+Iq","v":9.0349999999999996E-3},"A",null,null,null,68,24,1,4.08,4.08,0.94444444444444431,0.22961361273586631,6.7659915453796531,7.4629957726898262,0.69700422731017353,0,4.5234153909790056,1.391367502355511,0.88048227907349441,2.5825209410475556,1.9531735200298375,7.6297735986914925E-3,7.6297735986914925E-3,1.9024777548910521,3.6194216078552981E-3,3.6194216078552981E-3,2.1675308494280925,0.19262578931212121,0.13392572944297085,1.9200000000000005E-2,0,0.3517134376668099,3.9702766674531991,0.33102503313858889,4.5696000000000001E-2,0.38802425852585343,4.8960000000000004E-2,8.3999999999999993E-4,4.4999999999999998E-2,0.18629999999999999,0.17099999999999999,4.5839999999999999E-2,3.0891223333226869,3.7056671884729653,3.7056671884729653,20.399999999999999,0.84627402512862326,8.4485948286698171,8.8919832875687757,null,84.627402512862332,2.5825209410475556,0.78869769619266339,0.3840270376668099,0.40418105852585345,3.3712186372402191]
["Qrr Current",{"$f":"Qrr_Q2*Fsw","v":3.0000000000000001E-3},"A",null,null,null,69,24,1,4.1399999999999997,4.1399999999999997,0.95833333333333326,0.22992542846870545,6.7727917930039983,7.5263958965019988,0.75360410349800055,0,4.5784450478244825,1.4254268158045,0.88048227907349441,2.6300417600469284,1.9551365824280733,7.6451181118970526E-3,7.6451181118970526E-3,1.9265394194974867,3.7115541348777129E-3,3.7115541348777129E-3,2.1953891232690661,0.19760906950529286,0.135895225464191,1.9200000000000005E-2,0,0.35894622557770239,4.0177637627641083,0.33899093872098857,4.6367999999999993E-2,0.39720813507575975,4.9680000000000002E-2,8.3999999999999993E-4,4.4999999999999998E-2,0.18629999999999999,0.17099999999999999,4.5839999999999999E-2,3.1394923285684673,3.7846329912655063,3.7846329912655063,20.7,0.8454282327770396,8.6181705627094534,9.099255771666714,null,84.54282327770396,2.6300417600469284,0.80583436065346215,0.3917350255777024,0.41360253507575973,3.4358761207003905]
["Diode Current",{"$f":"Deadtime*Fsw*(Iripple_Vinnom/2)*(Vsd_Q2)/Vin","v":7.8769722928690746E-4},null,null,null,null,70,24,1,4.2,4.2,0.97222222222222221,0.23023721158077398,6.7795846031015241,7.5897923015507622,0.81020769844923812,0,4.633598020532669,1.4599756818801304,0.88048227907349441,2.6785728679757566,1.9570974977972537,7.6604612317685431E-3,7.6604612317685431E-3,1.9506734342588643,3.805126847123272E-3,3.805126847123272E-3,2.2233411859175725,0.20267308718889168,0.13786472148541121,1.9200000000000005E-2,0,0.36627032477140758,4.0653394184110763,0.34706667632462507,4.7039999999999998E-2,0.40652263684152434,5.0400000000000007E-2,8.3999999999999993E-4,4.4999999999999998E-2,0.18629999999999999,0.17099999999999999,4.5839999999999999E-2,3.1905424459525533,3.8654809124741099,3.8654809124741099,21,0.84454429310736001,8.7897551449709681,9.3094020105135353,null,84.454429310736003,2.6785728679757566,0.82319296161293187,0.3995343247714076,0.42315463684152432,3.5017658295886882]
["Total",{"$f":"SUM(B77:B79)","v":1.2822697229286908E-2},"A",null,null,null,71,24,1,4.26,4.26,0.98611111111111094,0.23054896207719061,6.78636997683929,7.6531849884196443,0.86681501158035479,0,4.6888699550331037,1.4950140989544256,0.88048227907349441,2.7281317372642895,1.9590562664742794,7.6758029104242861E-3,7.6758029104242861E-3,1.9748779845136553,3.9001430537167173E-3,3.9001430537167173E-3,2.2513850273211204,0.20781811619107463,0.13983421750663133,1.9200000000000005E-2,0,0.37368630671683573,4.1129997464097201,0.35525210519329492,4.7711999999999997E-2,0.41596817948125919,5.1119999999999999E-2,8.3999999999999993E-4,4.4999999999999998E-2,0.18629999999999999,0.17099999999999999,4.5839999999999999E-2,3.2422728169189217,3.948257111601456,3.948257111601456,21.299999999999997,0.84362258772359966,8.9633611477703869,9.5224311485877013,null,84.362258772359965,2.7281317372642895,0.84077448619809503,0.40742550671683575,0.43283777948125918,3.5689062234623847]
[null,null,null,null,null,null,72,24,1,4.32,4.32,1,0.23086067996307291,6.7931479153841119,7.7165739576920558,0.92342604230794434,0,4.7442566909921684,1.5305420654016293,0.88048227907349441,2.7787363834427614,1.9610128887959812,7.6911431000479188E-3,7.6911431000479188E-3,1.9991513336276834,3.9966060547453452E-3,3.9966060547453452E-3,2.279518724781183,0.21304443028174924,0.14180371352785151,1.9200000000000005E-2,0,0.38119474859723446,4.1607410317629627,0.36354708460131446,4.8384000000000003E-2,0.42554518727490676,5.1840000000000011E-2,8.3999999999999993E-4,4.4999999999999998E-2,0.18629999999999999,0.17099999999999999,4.5839999999999999E-2,3.2946835728860391,4.0330095330072666,4.0330095330072666,21.6,0.84266344036528307,9.1390012691391576,9.7383525200479486,null,84.266344036528309,2.7787363834427614,0.85857993587214121,0.41540914859723443,0.44265238727490674,3.6373163193149027]
[null,null,null,null,null,null,73,24,1,4.38,4.38,1.0138888888888888,0.23117236524353749,6.7999184199025642,7.779959209951282,0.9800407900487178,0,4.799754251672077,1.5665595795982044,0.88048227907349441,2.8304053834748957,1.9629673650991202,7.7064817528883656E-3,7.7064817528883656E-3,2.0234918189267868,4.0945191412636367E-3,4.0945191412636367E-3,2.3077404384026385,0.21835230317259091,0.14377320954907166,1.9200000000000005E-2,0,0.38879623338786867,4.2085597233977063,0.37195147385351296,4.9055999999999995E-2,0.43525409318197628,5.2559999999999996E-2,8.3999999999999993E-4,4.4999999999999998E-2,0.18629999999999999,0.17099999999999999,4.5839999999999999E-2,3.347774845246875,4.1197879872159104,4.1197879872159104,21.9,0.8416671193001245,9.3166883345331097,9.957175650003478,null,84.166711930012454,2.8304053834748957,0.87661032656984483,0.42348583338786866,0.45259889318197627,3.7070157100447405]
[null,null,null,null,null,null,74,24,1,4.4400000000000004,4.4400000000000004,1.0277777777777779,0.23148401792369977,6.8066814915609717,7.8433407457804858,1.0366592542195145,0,4.8553588343839111,1.6030666399228328,0.88048227907349441,2.883157894894723,1.9649196957203854,7.7218188212597834E-3,7.7218188212597834E-3,2.0478978478668943,4.1938855952978575E-3,4.1938855952978575E-3,2.3360484068085317,0.22374200851705983,0.14574270557029181,1.9200000000000005E-2,0,0.39649134993482882,4.256452425633019,0.38046513228522144,4.9728000000000001E-2,0.44509533890072872,5.3280000000000008E-2,8.3999999999999993E-4,4.4999999999999998E-2,0.18629999999999999,0.17099999999999999,4.5839999999999999E-2,3.4015467653689009,4.2086442368399632,4.2086442368399632,22.200000000000003,0.84063383946954318,9.496435298566233,10.178910255816032,null,84.063383946954318,2.883157894894723,0.89486668883555753,0.43165614993482881,0.46267773890072872,3.7780245837302804]
[null,null,null,null,null,null,75,24,1,4.5,4.5,1.0416666666666665,0.23179563800867417,6.8134371315254185,7.9067185657627093,1.0932814342372907,0,4.9110668014974888,1.6400632447564127,0.88048227907349441,2.9370136757866456,1.966869880996396,7.7371542575415545E-3,7.7371542575415545E-3,2.072367894426729,4.2947086898506744E-3,4.2947086898506744E-3,2.3644409431036415,0.22921381991041836,0.14771220159151197,1.9200000000000005E-2,0,0.40428069303498948,4.3044158901465286,0.3890879192622646,5.04E-2,0.45506937492883615,5.3999999999999992E-2,8.3999999999999993E-4,4.4999999999999998E-2,0.18629999999999999,0.17099999999999999,4.5839999999999999E-2,3.4559994645941017,4.2996320874247438,4.2996320874247438,22.5,0.8395637644054722,9.6782552467697691,10.403566248434394,null,83.956376440547217,2.9370136757866456,0.91335006796382556,0.43992069303498949,0.47288937492883615,3.8503637437504712]
[null,null,null,null,null,null,76,24,1,4.5599999999999996,4.5599999999999996,1.0555555555555554,0.2321072255035741,6.820185340961749,7.9700926704808737,1.1499073295191251,0,4.9668746719732244,1.6775493924820606,0.88048227907349441,2.9919931056510407,1.9688179212637027,7.752488014178255E-3,7.752488014178255E-3,2.0969004957092654,4.3969916889057626E-3,4.3969916889057626E-3,2.3929164310713888,0.23476801088974875,0.14968169761273215,1.9200000000000005E-2,0,0.41216486351713849,4.352447008407764,0.39781969418095164,5.1071999999999992E-2,0.46517666062552598,5.4719999999999998E-2,8.3999999999999993E-4,4.4999999999999998E-2,0.18629999999999999,0.17099999999999999,4.5839999999999999E-2,3.5111330742389875,4.3928074835421738,4.3928074835421738,22.799999999999997,0.83845700793488054,9.8621613973770472,10.631153733761572,null,83.845700793488049,2.9919931056510407,0.93206152414266452,0.44828006351713851,0.48323426062552599,3.9240546297937051]
[null,null,null,null,null,null,77,24,1,4.62,4.62,1.0694444444444444,0.23241878041351172,6.8269261210355534,8.0334630605177768,1.2065369394822234,0,5.0227791133833266,1.7155250814851062,0.88048227907349441,3.0481172072001188,1.9707638168587822,7.7678200436795911E-3,7.7678200436795911E-3,2.121494248738943,4.5007378474324128E-3,4.5007378474324128E-3,2.421473321589561,0.24040485493396924,0.1516511936339523,1.9200000000000005E-2,0,0.42014446832429703,4.4005428045492092,0.40666031646806622,5.1743999999999998E-2,0.47541766427522947,5.5440000000000003E-2,8.3999999999999993E-4,4.4999999999999998E-2,0.18629999999999999,0.17099999999999999,4.5839999999999999E-2,3.5669477255945883,4.488228610487722,4.488228610487722,23.1,0.83731363568658002,10.048167103134535,10.861683014055048,null,83.731363568657997,3.0481172072001188,0.95100213259952648,0.45673486832429705,0.49371286427522948,3.9991193397996452]
[null,null,null,null,null,null,78,24,1,4.68,4.68,1.0833333333333333,0.23273030274359829,6.8336594729121884,8.0968297364560939,1.2631702635439055,0,5.0787769343918034,1.7539903101530943,0.88048227907349441,3.1054076691314485,1.9727075681180442,7.7831502986204157E-3,7.7831502986204157E-3,2.146147807442472,4.6059504113901304E-3,4.6059504113901304E-3,2.4501101292512986,0.24612462546385241,0.15362068965517245,1.9200000000000005E-2,0,0.42822012059725639,4.4487004286477179,0.41560964558085817,5.2415999999999997E-2,0.48579286315275327,5.6159999999999988E-2,8.3999999999999993E-4,4.4999999999999998E-2,0.18629999999999999,0.17099999999999999,4.5839999999999999E-2,3.6234435499264714,4.5859560019618284,4.5859560019618284,23.4,0.83613366641324127,10.236285853139639,11.095164589360571,null,83.61336664132412,3.1054076691314485,0.97017298375000971,0.46528572059725637,0.50432566315275329,4.0755806528814578]
[null,null,null,null,null,null,79,24,1,4.74,4.74,1.0972222222222223,0.23304179249894397,6.8403853977567604,8.1601926988783795,1.31980730112162,0,5.1348650776646823,1.792945076875782,0.88048227907349441,3.1638868699293314,1.9746491753778255,7.7984787316406528E-3,7.7984787316406528E-3,2.1708598798018364,4.7126326177332435E-3,4.7126326177332435E-3,2.4788254291786034,0.251927595842042,0.15559018567639263,1.9200000000000005E-2,0,0.43639243975934966,4.4969171503906802,0.42466754100703452,5.3088000000000003E-2,0.49630274358999027,5.688E-2,8.3999999999999993E-4,4.4999999999999998E-2,0.18629999999999999,0.17099999999999999,4.5839999999999999E-2,3.6806206784747459,4.6860526541472307,4.6860526541472307,23.700000000000003,0.83491707314005159,10.426531274705692,11.331609158979784,null,83.491707314005154,3.1638868699293314,0.98957518334934003,0.47393323975934964,0.51507314358999023,4.1534620532786715]
[null,null,null,null,null,null,80,24,1,4.8,4.8,1.1111111111111109,0.23335324968465776,6.8471038967341382,8.2235519483670689,1.3764480516329307,0,5.1910406131837048,1.8323893800451407,0.88048227907349441,3.22357790274725,1.9765886389743952,7.8138052954453037E-3,7.8138052954453037E-3,2.1956292251688363,4.8207876944155051E-3,4.8207876944155051E-3,2.5076178540164746,0.25781403937306979,0.15755968169761275,1.9200000000000005E-2,0,0.44466205160248312,4.5451903531029885,0.4338338622647499,5.3759999999999995E-2,0.50694780104418868,5.7599999999999998E-2,8.3999999999999993E-4,4.4999999999999998E-2,0.18629999999999999,0.17099999999999999,4.5839999999999999E-2,3.7384792424540674,4.7885841466264152,4.7885841466264152,24,0.83366378415009457,10.618917135254629,11.571027622972151,null,83.36637841500945,3.22357790274725,1.009209852646672,0.48267805160248312,0.52595580104418871,4.2327877553939217]
[null,null,null,null,null,null,81,24,1,4.8600000000000003,4.8600000000000003,1.125,0.2336646743058477,6.8538149710089389,8.2869074855044698,1.4330925144955309,0,5.2473007319384877,1.8723232180553488,0.88048227907349441,3.2845046014277783,1.978525959243949,7.8291299428043786E-3,7.8291299428043786E-3,2.2204546517311869,4.9304188603946668E-3,4.9304188603946668E-3,2.5364860910965339,0.26378422930337314,0.15952917771883296,1.9200000000000005E-2,0,0.45302958837445229,4.5935175281124181,0.44310846890259642,5.4432000000000001E-2,0.51772854016779823,5.8320000000000011E-2,8.3999999999999993E-4,4.4999999999999998E-2,0.18629999999999999,0.17099999999999999,4.5839999999999999E-2,3.7970193730536459,4.8936187706190921,4.8936187706190921,24.3,0.83237368381531018,10.81345734423795,11.81343108369156,null,83.237368381531013,3.2845046014277783,1.0290781285422506,0.49152078837445229,0.53697414016779821,4.3135827299700287]
[null,null,null,null,null,null,82,24,1,4.92,4.92,1.1388888888888888,0.23397606636762072,6.8605186217455421,8.3502593108727705,1.4897406891272289,0,5.3036427399737667,1.9127465893027982,0.88048227907349441,3.3466915677198195,1.9804611365226146,7.8444526265528929E-3,7.8444526265528929E-3,2.2453350141208577,5.0415293256371122E-3,5.0415293256371122E-3,2.565428879759712,0.26983843882131203,0.16149867374005308,1.9200000000000005E-2,0,0.46149568886756254,4.6418962694324906,0.45249122049959672,5.5104E-2,0.52864547487991687,5.9039999999999995E-2,8.3999999999999993E-4,4.4999999999999998E-2,0.18629999999999999,0.17099999999999999,4.5839999999999999E-2,3.8562412014372547,5.0012276650586127,5.0012276650586127,24.6,0.83104661328077012,11.010165955086375,12.058830847358172,null,83.104661328077015,3.3466915677198195,1.0491811637474795,0.50046208886756249,0.5481286748799169,4.395872731467299]
[null,null,null,null,null,null,83,24,1,4.9800000000000004,4.9800000000000004,1.1527777777777779,0.23428742587508269,6.867214850108085,8.4136074250540425,1.5463925749459579,0,5.3600640527698378,1.9536594921860886,0.88048227907349441,3.4101641997566419,1.9823941711464492,7.8597732995908352E-3,7.8597732995908352E-3,2.2702692111558962,5.1541222911224149E-3,5.1541222911224149E-3,2.5944450088282509,0.27597694105718679,0.16346816976127326,1.9200000000000005E-2,0,0.4700609985085844,4.6903242687432174,0.46198197666519358,5.5776000000000006E-2,0.5396991284393523,5.9760000000000001E-2,8.3999999999999993E-4,4.4999999999999998E-2,0.18629999999999999,0.17099999999999999,4.5839999999999999E-2,3.9161448587432366,5.1114849610687649,5.1114849610687649,24.900000000000002,0.82968237100898401,11.209057167188856,12.30723842566575,null,82.968237100898406,3.4101641997566419,1.0695201269479366,0.50950259850858437,0.55941992843935229,4.4796843267045787]
[null,null,null,null,null,null,84,24,1,5.04,5.04,1.1666666666666665,0.23459875283333831,6.8739036572604535,8.4769518286302272,1.6030481713697733,0,5.4165621899357488,1.995061925106026,0.88048227907349441,3.4749487218621318,1.984325063451438,7.8750919148831058E-3,7.8750919148831058E-3,2.2952561837075933,5.2682009488479453E-3,5.2682009488479453E-3,2.6235333142178825,0.28220000908325377,0.16543766578249344,1.9200000000000005E-2,0,0.47872616945006069,4.7387993106514319,0.47158059703924021,5.6447999999999998E-2,0.55089003351932098,6.0480000000000006E-2,8.3999999999999993E-4,4.4999999999999998E-2,0.18629999999999999,0.17099999999999999,4.5839999999999999E-2,3.9767304760845081,5.2244679354489563,5.2244679354489563,25.2,0.82828071319000174,11.410145327901336,12.558665537425062,null,82.828071319000173,3.4749487218621318,1.0900962029693817,0.51864296945006072,0.57084843351932102,4.565044924831513]
[null,null,null,null,null,null,85,24,1,5.0999999999999996,5.0999999999999996,1.1805555555555556,0.23491004724749143,6.880585044366299,8.5402925221831492,1.6597074778168501,0,5.4731347701961228,2.036953886465624,0.88048227907349441,3.5410722157568624,1.986253813773498,7.890408425459532E-3,7.890408425459532E-3,2.3202949126853372,5.3837684818334565E-3,5.3837684818334565E-3,2.6526926766816774,0.28850791591374469,0.16740716180371354,1.9200000000000005E-2,0,0.48749186066300026,4.7873192682135963,0.48128694129199245,5.7119999999999997E-2,0.56221873228381081,6.1199999999999991E-2,8.3999999999999993E-4,4.4999999999999998E-2,0.18629999999999999,0.17099999999999999,4.5839999999999999E-2,4.0379981845485684,5.3402571738267115,5.3402571738267115,25.5,0.82684135402220826,11.613444934586006,12.813124110243837,null,82.684135402220832,3.5410722157568624,1.110910592946811,0.5278838606630003,0.5824147322838108,4.6519828087036732]
[null,null,null,null,null,null,86,24,1,5.16,5.16,1.1944444444444444,0.23522130912264458,6.8872590125890252,8.6036295062945136,1.7163704937054876,0,5.5297795066537141,2.0793353746701029,0.88048227907349441,3.6085626532400368,1.9881804224484749,7.9057227844147922E-3,7.9057227844147922E-3,2.3453844171320122,5.5008280641256685E-3,5.5008280641256685E-3,2.6819220196775424,0.29490093450488203,0.16937665782493375,1.9200000000000005E-2,0,0.49635873803097569,4.835882098705067,0.49110086912409862,5.7792000000000003E-2,0.57368577646562191,6.1920000000000003E-2,8.3999999999999993E-4,4.4999999999999998E-2,0.18629999999999999,0.17099999999999999,4.5839999999999999E-2,4.0999481151975115,5.4589367441921421,5.4589367441921421,25.8,0.82536396586789207,11.818970636681467,13.070626282243683,null,82.536396586789209,3.6085626532400368,1.1319645144965975,0.53722593803097574,0.59411937646562196,4.7405271677366345]
[null,null,null,null,null,null,87,24,1,5.22,5.22,1.2083333333333333,0.23553253846389949,6.8939255630917939,8.6669627815458963,1.7730372184541028,0,5.5864942023109814,2.122206388126886,0.88048227907349441,3.6774489304281701,1.990104889812145,7.9210349449084193E-3,7.9210349449084193E-3,2.3705237524232605,5.6193828608028552E-3,5.6193828608028552E-3,2.7112203073519283,0.30137933775489689,0.1713461538461539,1.9200000000000005E-2,0,0.50532747444565596,4.8844858396208624,0.50102224026659115,5.8463999999999995E-2,0.5852917274461118,6.2640000000000001E-2,8.3999999999999993E-4,4.4999999999999998E-2,0.18629999999999999,0.17099999999999999,4.5839999999999999E-2,4.1625803990680224,5.580594381590199,5.580594381590199,26.099999999999998,0.82384817928690379,12.026737237804431,13.33118440381446,null,82.384817928690381,3.6774489304281701,1.1532592018917678,0.54666987444565596,0.6059629274461118,4.8307081323199377]
[null,null,null,null,null,null,88,24,1,5.28,5.28,1.2222222222222223,0.23584373527635655,6.9005846970375213,8.7302923485187609,1.8297076514812396,0,5.6432767458350268,2.1655669252456011,0.88048227907349441,3.7477609036365198,1.9920272162002126,7.9363448601647377E-3,7.9363448601647377E-3,2.395712008564348,5.7394360279794231E-3,5.7394360279794231E-3,2.7405865426327374,0.30794339850404612,0.17331564986737405,1.9200000000000005E-2,0,0.51439874990380186,4.9331286048939278,0.51105091448087692,5.9136000000000001E-2,0.59703715633666954,6.3360000000000014E-2,8.3999999999999993E-4,4.4999999999999998E-2,0.18629999999999999,0.17099999999999999,4.5839999999999999E-2,4.2258951671713927,5.7053216848135726,5.7053216848135726,26.400000000000002,0.82229358295100663,12.236759697883642,13.594811039406732,null,82.229358295100667,3.7477609036365198,1.1747959062404714,0.55621634990380187,0.6179459563366696,4.9225568098769914]
[null,null,null,null,null,null,89,24,1,5.34,5.34,1.2361111111111109,0.23615489956511534,6.9072364155888879,8.7936182077944434,1.8863817922055559,0,5.7001251075512753,2.2094169844380782,0.88048227907349441,3.8195294269947504,1.9939474019483152,7.9516524834728729E-3,7.9516524834728729E-3,2.4209483085787862,5.8609907128104859E-3,5.8609907128104859E-3,2.7700197654249008,0.31459338953462951,0.1752851458885942,1.9200000000000005E-2,0,0.52357325160574786,4.9818085813178143,0.52118675155872807,5.9808E-2,0.60892264406193697,6.4079999999999998E-2,8.3999999999999993E-4,4.4999999999999998E-2,0.18629999999999999,0.17099999999999999,4.5839999999999999E-2,4.2898925504935246,5.8332143260127385,5.8332143260127385,26.7,0.82069972344083297,12.449053135326453,13.861518969362614,null,82.069972344083297,3.8195294269947504,1.1965758956676849,0.56586605160574788,0.63006904406193698,5.016105322662435]
[null,null,null,null,null,null,90,24,1,5.4,5.4,1.25,0.23646603133527416,6.9138807199083194,8.8569403599541605,1.9430596400458406,0,5.7570373356521962,2.2537565641183472,0.88048227907349441,3.8927863918942602,1.9958654473920161,7.9669577681866655E-3,7.9669577681866655E-3,2.4462318069832314,5.9840500534964454E-3,5.9840500534964454E-3,2.7995190509024961,0.32132958357100649,0.17725464190981441,1.9200000000000005E-2,0,0.53285167405540246,5.030524025161526,0.53142961132227373,6.0480000000000006E-2,0.62094878144480803,6.4799999999999996E-2,8.3999999999999993E-4,4.4999999999999998E-2,0.18629999999999999,0.17099999999999999,4.5839999999999999E-2,4.354572679994936,5.9643722742206933,5.9643722742206933,27,0.81906610492671073,12.663632829218855,14.131321191785776,null,81.906610492671078,3.8927863918942602,1.2186004555002103,0.57561967405540249,0.64233278144480799,5.1113868473944706]
[null,null,null,null,null,null,91,24,1,5.46,5.46,1.2638888888888888,0.23677713059193037,6.920517611158008,8.9202588055790031,1.999741194420996,0,5.814011552608263,2.2985856627026395,0.88048227907349441,3.967564768370893,1.9977813528668109,7.9822606677246912E-3,7.9822606677246912E-3,2.4715616883435407,6.1086171792875737E-3,6.1086171792875737E-3,2.8290835078916867,0.328152253279614,0.17922413793103451,1.9200000000000005E-2,0,0.542234719161794,5.0792732589650669,0.54177935362398988,6.1151999999999998E-2,0.6331161692932249,6.5519999999999995E-2,8.3999999999999993E-4,4.4999999999999998E-2,0.18629999999999999,0.17099999999999999,4.5839999999999999E-2,4.4199356866107724,6.0989000338789037,6.0989000338789037,27.3,0.81739218873398978,12.880514221559469,14.404230924450948,null,81.739218873398983,3.967564768370893,1.2408708884550188,0.58547791916179404,0.65473776929322491,5.2084356568259116]
[null,null,null,null,null,null,92,24,1,5.52,5.52,1.2777777777777777,0.23708819734018027,6.9271470904999006,8.9835735452499499,2.0564264547500493,0,5.8710459517691644,2.3439042786093864,0.88048227907349441,4.0438986485335899,1.9996951187081253,7.9975611355702064E-3,7.9975611355702064E-3,2.49693716590718,6.2346952104885799E-3,6.2346952104885799E-3,2.8587122773391065,0.33506167126898301,0.18119363395225466,1.9200000000000005E-2,0,0.55172309634219152,5.1280546685049835,0.55223583834669088,6.1823999999999997E-2,0.64542541848880042,6.6239999999999993E-2,8.3999999999999993E-4,4.4999999999999998E-2,0.18629999999999999,0.17099999999999999,4.5839999999999999E-2,4.4859817012508092,6.2369068995492984,6.2369068995492984,27.599999999999998,0.81567739279288631,13.099712919528214,14.680261606753609,null,81.567739279288631,4.0438986485335899,1.263388514830992,0.59544149634219157,0.66728461848880039,5.307287163364582]
[null,null,null,null,null,null,93,24,1,5.58,5.58,1.2916666666666665,0.237399231585119,6.9337691590956991,9.0468845795478501,2.1131154204521505,0,5.92813879414404,2.389712410259218,0.88048227907349441,4.1218232921568152,2.0016067452513138,8.0128591252711153E-3,8.0128591252711153E-3,2.5223574803074933,6.362287258463167E-3,6.362287258463167E-3,2.8884045308606763,0.34205811008975584,0.18316312997347486,1.9200000000000005E-2,0,0.56131752262683043,5.1768666999198532,0.56279892540352061,6.2496000000000003E-2,0.65787715007729131,6.6959999999999992E-2,8.3999999999999993E-4,4.4999999999999998E-2,0.18629999999999999,0.17099999999999999,4.5839999999999999E-2,4.5527108547994644,6.3785072281052706,6.3785072281052706,27.9,0.81392109097226173,13.321244697790268,14.959426901700409,null,81.392109097226168,4.1218232921568152,1.2861546727041215,0.60551112262683038,0.67997395007729133,5.4079779648609367]
[null,null,null,null,null,null,94,24,1,5.64,5.64,1.3055555555555554,0.23771023333184071,6.9403838181068647,9.110191909053432,2.1698080909465673,0,5.9852884053502358,2.436010056074958,0.88048227907349441,4.2013751745624504,2.0035162328316605,8.0281545904399357E-3,8.0281545904399357E-3,2.5478218983356387,6.4913964256386181E-3,6.4913964256386181E-3,2.9181594693661452,0.3491418422347034,0.18513262599469502,1.9200000000000005E-2,0,0.57101872276527466,5.2257078569863307,0.57346847473794216,6.3168000000000002E-2,0.67047199536094704,6.767999999999999E-2,8.3999999999999993E-4,4.4999999999999998E-2,0.18629999999999999,0.17099999999999999,4.5839999999999999E-2,4.620123278115793,6.5238207298141822,6.5238207298141822,28.2,0.8121226122961529,13.545125500836042,15.241740697940834,null,81.212261229615294,4.2013751745624504,1.3091707181262218,0.61568752276527461,0.69280639536094701,5.5105458926886719]
[null,null,null,null,null,null,95,24,1,5.7,5.7,1.3194444444444444,0.23802120258543844,6.946991068694615,9.1734955343473068,2.2265044656526927,0,6.0424931727207518,2.482797214481629,0.88048227907349441,4.2825920369253314,2.0054235817843811,8.0434474847537931E-3,8.0434474847537931E-3,2.573329711776235,6.6220258055103608E-3,6.6220258055103608E-3,2.9479763217549517,0.35631314013874205,0.18710212201591517,1.9200000000000005E-2,0,0.58082742933444576,5.2745766985369587,0.5842443463237299,6.3840000000000008E-2,0.68321059599276701,6.8400000000000002E-2,8.3999999999999993E-4,4.4999999999999998E-2,0.18629999999999999,0.17099999999999999,4.5839999999999999E-2,4.6882191020335098,6.6729727798559981,6.6729727798559981,28.5,0.81028124004128277,13.771371445357806,15.527217111840875,null,81.028124004128273,4.2825920369253314,1.3324380253272128,0.62597142933444572,0.70578259599276705,5.6150300622525444]
[null,null,null,null,null,null,96,24,1,5.76,5.76,{"$f":"Vout*K105/(Vin*Efficiency)","v":1.333333333333333},0.23833213935100428,{"$f":"(Vin-(Rdson1+Rdcr)*K105-Vout)*M105/(Fsw*Lf)","v":6.9535909120199291},9.2367954560099648,2.2832045439900353,{"$f":"IF(MIN(Vin, -P105/(Coss_Q1+Coss_Q2)*0.00000002)<0, 0, MIN(Vin, -P105/(Coss_Q1+Coss_Q2)*0.00000002))","v":0},6.0997515425611537,{"$f":"R105^2*Rdcr","v":2.5300738839064478},0.88048227907349441,{"$f":"(T105+S105*(1+Ltc*(Ta-25)))/(1-S105*Ltc*ThetaCa)","v":4.3655129391456171},2.0073287924446208,8.0587377619543606E-3,8.0587377619543606E-3,2.5988802363030348,6.7541784826465178E-3,6.7541784826465178E-3,2.9778543436792759,{"$f":"Rdson1*AB105^2","v":0.36357227617895083},0.18907161803713532,1.9200000000000005E-2,0,{"$f":"(AF105+AE105+AD105+AC105*(1+RdsonTopTc*Ta-RdsonTopTc*25))/(1-AC105*RdsonTopTc*ThetaJA_Q1)","v":0.5907443828483514},5.3234718360114988,{"$f":"Rdson2*AH105^2","v":0.59512640016496043},6.4512E-2,{"$f":"(AJ105+AI105*(1+RdsonBotTc*Ta-RdsonBotTc*25))/(1-AI105*RdsonBotTc*ThetaJA_Q2)","v":0.69609360407268805},6.9120000000000001E-2,8.3999999999999993E-4,4.4999999999999998E-2,0.18629999999999999,0.17099999999999999,4.5839999999999999E-2,4.7569984573609885,6.8260947519686974,6.8260947519686974,28.799999999999997,0.80839621071317425,13.999998822663731,15.815870489599137,null,80.839621071317424,4.3655129391456171,1.3559579869210394,0.63636358284835137,0.71890320407268804,5.7214709260666563]
[null,null,null,null,null,null,97,24,1,5.82,5.82,{"$f":"Vout*K106/(Vin*Efficiency)","v":1.3472222222222221},0.23864304363362907,{"$f":"(Vin-(Rdson1+Rdcr)*K106-Vout)*M106/(Fsw*Lf)","v":6.9601833492435334},9.3000916746217666,2.3399083253782336,{"$f":"IF(MIN(Vin, -P106/(Coss_Q1+Coss_Q2)*0.00000002)<0, 0, MIN(Vin, -P106/(Coss_Q1+Coss_Q2)*0.00000002))","v":0},6.1570620175473234,{"$f":"R106^2*Rdcr","v":2.5778400627788267},0.88048227907349441,{"$f":"(T106+S106*(1+Ltc*(Ta-25)))/(1-S106*Ltc*ThetaCa)","v":4.4501783154410237},2.0092318651474526,8.0740253758478219E-3,8.0740253758478219E-3,2.6244728104311701,6.8878575326924846E-3,6.8878575326924846E-3,3.007792816370416,{"$f":"Rdson1*AB106^2","v":0.37091952267458861},0.1910411140583555,1.9200000000000005E-2,0,{"$f":"(AF106+AE106+AD106+AC106*(1+RdsonTopTc*Ta-RdsonTopTc*25))/(1-AC106*RdsonTopTc*ThetaJA_Q1)","v":0.60077033186954543},5.372391931134068,{"$f":"Rdson2*AH106^2","v":0.60611449629600334},6.5184000000000006E-2,{"$f":"(AJ106+AI106*(1+RdsonBotTc*Ta-RdsonBotTc*25))/(1-AI106*RdsonBotTc*ThetaJA_Q2)","v":0.7091216822457348},6.9840000000000013E-2,8.3999999999999993E-4,4.4999999999999998E-2,0.18629999999999999,0.17099999999999999,4.5839999999999999E-2,4.8264614748812686,6.9833243760729866,6.9833243760729866,29.1,0.80646671289789307,14.231024101129998,16.107715409406168,null,80.64667128978931,4.4501783154410237,1.3797320141152802,0.64686473186954541,0.73216888224573484,5.8299103295563039]
[null,null,null,null,null,null,98,24,1,5.88,5.88,{"$f":"Vout*K107/(Vin*Efficiency)","v":1.3611111111111109},0.23895391543840275,{"$f":"(Vin-(Rdson1+Rdcr)*K107-Vout)*M107/(Fsw*Lf)","v":6.966768381525922},9.3633841907629609,2.3966158092370389,{"$f":"IF(MIN(Vin, -P107/(Coss_Q1+Coss_Q2)*0.00000002)<0, 0, MIN(Vin, -P107/(Coss_Q1+Coss_Q2)*0.00000002))","v":0},6.2144231542559476,{"$f":"R107^2*Rdcr","v":2.6260957495303661},0.88048227907349441,{"$f":"(T107+S107*(1+Ltc*(Ta-25)))/(1-S107*Ltc*ThetaCa)","v":4.5366300328224716},2.0111328002278825,8.0893102803048875E-3,8.0893102803048875E-3,2.650106794522717,7.023066022375471E-3,7.023066022375471E-3,3.0377910455248562,{"$f":"Rdson1*AB107^2","v":0.378355151887111},0.19301061007957565,1.9200000000000005E-2,0,{"$f":"(AF107+AE107+AD107+AC107*(1+RdsonTopTc*Ta-RdsonTopTc*25))/(1-AC107*RdsonTopTc*ThetaJA_Q1)","v":0.61090603312235359},5.4213356937088335,{"$f":"Rdson2*AH107^2","v":0.6172084947815103},6.5855999999999998E-2,{"$f":"(AJ107+AI107*(1+RdsonBotTc*Ta-RdsonBotTc*25))/(1-AI107*RdsonBotTc*ThetaJA_Q2)","v":0.72229550380215846},7.0560000000000012E-2,8.3999999999999993E-4,4.4999999999999998E-2,0.18629999999999999,0.17099999999999999,4.5839999999999999E-2,4.8966082853520581,7.1448061219084016,7.1448061219084016,29.4,0.80449188598581367,14.464463928691778,16.402766683647485,null,80.449188598581372,4.5366300328224716,1.403761536924512,0.65747563312235358,0.74558030380215845,5.9403915697469838]
[null,null,null,null,null,null,99,24,1,5.94,5.94,{"$f":"Vout*K108/(Vin*Efficiency)","v":1.375},0.23926475477041412,{"$f":"(Vin-(Rdson1+Rdcr)*K108-Vout)*M108/(Fsw*Lf)","v":6.9733460100273428},9.4266730050136722,2.453326994986329,{"$f":"IF(MIN(Vin, -P108/(Coss_Q1+Coss_Q2)*0.00000002)<0, 0, MIN(Vin, -P108/(Coss_Q1+Coss_Q2)*0.00000002))","v":0},6.2718335608201814,{"$f":"R108^2*Rdcr","v":2.674840942594864},0.88048227907349441,{"$f":"(T108+S108*(1+Ltc*(Ta-25)))/(1-S108*Ltc*ThetaCa)","v":4.624911452628103},2.0130315980208446,8.1045924292607111E-3,8.1045924292607111E-3,2.6757815698425511,7.1598070095090669E-3,7.1598070095090669E-3,3.0678483602466393,{"$f":"Rdson1*AB108^2","v":0.38587943602018776},0.1949801061007958,1.9200000000000005E-2,0,{"$f":"(AF108+AE108+AD108+AC108*(1+RdsonTopTc*Ta-RdsonTopTc*25))/(1-AC108*RdsonTopTc*ThetaJA_Q1)","v":0.62115225160789866},5.4703018795275247,{"$f":"Rdson2*AH108^2","v":0.62840825571640979},6.6528000000000004E-2,{"$f":"(AJ108+AI108*(1+RdsonBotTc*Ta-RdsonBotTc*25))/(1-AI108*RdsonBotTc*ThetaJA_Q2)","v":0.73561575277960334},7.1279999999999996E-2,8.3999999999999993E-4,4.4999999999999998E-2,0.18629999999999999,0.17099999999999999,4.5839999999999999E-2,4.9674390195057514,7.3106916109121185,7.3106916109121185,29.700000000000003,0.8024708187631745,14.70033513537377,16.701039361151274,null,80.247081876317452,4.624911452628103,1.4280480043875021,0.66819705160789866,0.75913815277960328,6.0529594570156053]
[null,null,null,null,null,null,100,24,1,6,6,{"$f":"Vout*K109/(Vin*Efficiency)","v":1.3888888888888888},0.23957556163475088,{"$f":"(Vin-(Rdson1+Rdcr)*K109-Vout)*M109/(Fsw*Lf)","v":6.9799162359078002},9.4899581179539005,2.5100418820460999,{"$f":"IF(MIN(Vin, -P109/(Coss_Q1+Coss_Q2)*0.00000002)<0, 0, MIN(Vin, -P109/(Coss_Q1+Coss_Q2)*0.00000002))","v":0},6.3292918947033439,{"$f":"R109^2*Rdcr","v":2.7240756404083064},0.88048227907349441,{"$f":"(T109+S109*(1+Ltc*(Ta-25)))/(1-S109*Ltc*ThetaCa)","v":4.7150674953027822},2.0149282588612039,8.1198717767148841E-3,8.1198717767148841E-3,2.7014965376616358,7.2980835429978059E-3,7.2980835429978059E-3,3.0979641120428343,{"$f":"Rdson1*AB109^2","v":0.39349264721971922},0.19694960212201598,1.9200000000000005E-2,0,{"$f":"(AF109+AE109+AD109+AC109*(1+RdsonTopTc*Ta-RdsonTopTc*25))/(1-AC109*RdsonTopTc*ThetaJA_Q1)","v":0.6315097607209591},5.5192892883823452,{"$f":"Rdson2*AH109^2","v":0.63971363922589397},6.7199999999999996E-2,{"$f":"(AJ109+AI109*(1+RdsonBotTc*Ta-RdsonBotTc*25))/(1-AI109*RdsonBotTc*ThetaJA_Q2)","v":0.74908312406731692},7.2000000000000008E-2,8.3999999999999993E-4,4.4999999999999998E-2,0.18629999999999999,0.17099999999999999,4.5839999999999999E-2,5.0389538080494294,7.4811400587932875,7.4811400587932875,30,0.8004025478665191,14.9386547358611,17.002548729480971,null,80.040254786651914,4.7150674953027822,1.4525928847882761,0.67902976072095911,0.77284312406731692,6.1676603800910588]

{"sheet":"Efficiency Plot Management","index":9,"n_rows":3,"n_cols":1,"rows_kept":3,"cut":false,"hidden":true,"merged":[]}
[]
[{"$f":"\"EFF_Ch1\"","v":"EFF_Ch1"}]
[{"$f":"\"EFF_Ch2\"","v":"EFF_Ch2"}]

{"sheet":"Standard Value Calculator","index":10,"n_rows":159,"n_cols":16,"rows_kept":159,"cut":false,"hidden":true,"merged":[]}
[]
["Capacitors","Css","Cc1ea","Cc2ea","Cout","Cin","Cres","Cdither","Cc3ea","Cc4ea"]
["Inputs",{"$f":"Css","v":{"$error":"#NAME?"}},{"$f":"Cc1ea","v":1.1199696209081863E-11},{"$f":"Cc2ea","v":-2.1206076286934121E-13},{"$f":"Cout","v":5.0000000000000002E-5},{"$f":"Cin","v":2.0000000000000002E-5},{"$f":"Cres","v":{"$error":"#NAME?"}},{"$f":"Cdither_init","v":{"$error":"#NAME?"}},{"$f":"Cc3ea","v":{"$error":"#NAME?"}},{"$f":"Cc4ea","v":{"$error":"#NAME?"}},null,null,"Resistors","inputs","Standard Result"]
["Standard Result",{"$f":"SUM(B6:B158)/1000000000000","v":{"$error":"#NAME?"}},{"$f":"IF(C3=\"OPEN\",\"OPEN\",SUM(C6:C158)/1000000000000)","v":1.2000000000000001E-11},{"$f":"SUM(D6:D158)/1000000000000","v":0},{"$f":"SUM(E6:E158)/1000000000000","v":4.6999999999999997E-5},{"$f":"SUM(F6:F158)/1000000000000","v":2.1999999999999999E-5},{"$f":"SUM(G6:G158)/1000000000000","v":{"$error":"#NAME?"}},{"$f":"IF(H3=\"OPEN\",\"OPEN\",SUM(H6:H158)/1000000000000)","v":{"$error":"#NAME?"}},{"$f":"IF(I3=\"OPEN\",\"OPEN\",SUM(I6:I158)/1000000000000)","v":{"$error":"#NAME?"}},{"$f":"IF(J3=\"OPEN\",\"OPEN\",SUM(J6:J158)/1000000000000)","v":{"$error":"#NAME?"}},null,null,"Rt",{"$f":"Rfadj","v":13},{"$f":"IF(N4>(INT(0.5+100*POWER(10,IF(96*(LOG(N4)-INT(LOG(N4)))-ROUND(96*(LOG(N4)-INT(LOG(N4))),0)<0,ROUND(96*(LOG(N4)-INT(LOG(N4))),0)-1,ROUND(96*(LOG(N4)-INT(LOG(N4))),0))/96))*POWER(10,INT(LOG(N4))-2)+INT(0.5+100*POWER(10,(IF(96*(LOG(N4)-INT(LOG(N4)))-ROUND(96*(LOG(N4)-INT(LOG(N4))),0)<0,ROUND(96*(LOG(N4)-INT(LOG(N4))),0)-1,ROUND(96*(LOG(N4)-INT(LOG(N4))),0))+1)/96))*POWER(10,INT(LOG(N4))-2))/2,INT(0.5+100*POWER(10,(IF(96*(LOG(N4)-INT(LOG(N4)))-ROUND(96*(LOG(N4)-INT(LOG(N4))),0)<0,ROUND(96*(LOG(N4)-INT(LOG(N4))),0)-1,ROUND(96*(LOG(N4)-INT(LOG(N4))),0))+1)/96))*POWER(10,INT(LOG(N4))-2),INT(0.5+100*POWER(10,IF(96*(LOG(N4)-INT(LOG(N4)))-ROUND(96*(LOG(N4)-INT(LOG(N4))),0)<0,ROUND(96*(LOG(N4)-INT(LOG(N4))),0)-1,ROUND(96*(LOG(N4)-INT(LOG(N4))),0))/96))*POWER(10,INT(LOG(N4))-2))","v":13},"Ω"]
["(pF)"]
[0.47,{"$f":"IF(IF((B$3*10^12-$A7)*(B$3*10^12-$A6)*-1<0,0,1)*IF(ABS(B$3*10^12-$A7)>(B$3*10^12-$A6),$A6,$A7)=B7,0,IF((B$3*10^12-$A7)*(B$3*10^12-$A6)*-1<0,0,1)*IF(ABS(B$3*10^12-$A7)>(B$3*10^12-$A6),$A6,$A7))","v":{"$error":"#NAME?"}},0,0,0,0,{"$error":"#NAME?"},{"$error":"#NAME?"},{"$error":"#NAME?"},{"$error":"#NAME?"}]
[0.56000000000000005,{"$f":"IF(IF((B$3*10^12-$A8)*(B$3*10^12-$A7)*-1<0,0,1)*IF(ABS(B$3*10^12-$A8)>(B$3*10^12-$A7),$A7,$A8)=B8,0,IF((B$3*10^12-$A8)*(B$3*10^12-$A7)*-1<0,0,1)*IF(ABS(B$3*10^12-$A8)>(B$3*10^12-$A7),$A7,$A8))","v":{"$error":"#NAME?"}},{"$f":"IF(IF((C$3*10^12-$A8)*(C$3*10^12-$A7)*-1<0,0,1)*IF(ABS(C$3*10^12-$A8)>(C$3*10^12-$A7),$A7,$A8)=C8,0,IF((C$3*10^12-$A8)*(C$3*10^12-$A7)*-1<0,0,1)*IF(ABS(C$3*10^12-$A8)>(C$3*10^12-$A7),$A7,$A8))","v":0},{"$f":"IF(IF((D$3*10^12-$A8)*(D$3*10^12-$A7)*-1<0,0,1)*IF(ABS(D$3*10^12-$A8)>(D$3*10^12-$A7),$A7,$A8)=D8,0,IF((D$3*10^12-$A8)*(D$3*10^12-$A7)*-1<0,0,1)*IF(ABS(D$3*10^12-$A8)>(D$3*10^12-$A7),$A7,$A8))","v":0},{"$f":"IF(IF((E$3*10^12-$A8)*(E$3*10^12-$A7)*-1<0,0,1)*IF(ABS(E$3*10^12-$A8)>(E$3*10^12-$A7),$A7,$A8)=E8,0,IF((E$3*10^12-$A8)*(E$3*10^12-$A7)*-1<0,0,1)*IF(ABS(E$3*10^12-$A8)>(E$3*10^12-$A7),$A7,$A8))","v":0},{"$f":"IF(IF((F$3*10^12-$A8)*(F$3*10^12-$A7)*-1<0,0,1)*IF(ABS(F$3*10^12-$A8)>(F$3*10^12-$A7),$A7,$A8)=F8,0,IF((F$3*10^12-$A8)*(F$3*10^12-$A7)*-1<0,0,1)*IF(ABS(F$3*10^12-$A8)>(F$3*10^12-$A7),$A7,$A8))","v":0},{"$f":"IF(IF((G$3*10^12-$A8)*(G$3*10^12-$A7)*-1<0,0,1)*IF(ABS(G$3*10^12-$A8)>(G$3*10^12-$A7),$A7,$A8)=G8,0,IF((G$3*10^12-$A8)*(G$3*10^12-$A7)*-1<0,0,1)*IF(ABS(G$3*10^12-$A8)>(G$3*10^12-$A7),$A7,$A8))","v":{"$error":"#NAME?"}},{"$error":"#NAME?"},{"$error":"#NAME?"},{"$error":"#NAME?"},null,null,"Renb",{"$f":"Renb","v":99888.961634149513},{"$f":"IF(N7>(INT(0.5+100*POWER(10,IF(96*(LOG(N7)-INT(LOG(N7)))-ROUND(96*(LOG(N7)-INT(LOG(N7))),0)<0,ROUND(96*(LOG(N7)-INT(LOG(N7))),0)-1,ROUND(96*(LOG(N7)-INT(LOG(N7))),0))/96))*POWER(10,INT(LOG(N7))-2)+INT(0.5+100*POWER(10,(IF(96*(LOG(N7)-INT(LOG(N7)))-ROUND(96*(LOG(N7)-INT(LOG(N7))),0)<0,ROUND(96*(LOG(N7)-INT(LOG(N7))),0)-1,ROUND(96*(LOG(N7)-INT(LOG(N7))),0))+1)/96))*POWER(10,INT(LOG(N7))-2))/2,INT(0.5+100*POWER(10,(IF(96*(LOG(N7)-INT(LOG(N7)))-ROUND(96*(LOG(N7)-INT(LOG(N7))),0)<0,ROUND(96*(LOG(N7)-INT(LOG(N7))),0)-1,ROUND(96*(LOG(N7)-INT(LOG(N7))),0))+1)/96))*POWER(10,INT(LOG(N7))-2),INT(0.5+100*POWER(10,IF(96*(LOG(N7)-INT(LOG(N7)))-ROUND(96*(LOG(N7)-INT(LOG(N7))),0)<0,ROUND(96*(LOG(N7)-INT(LOG(N7))),0)-1,ROUND(96*(LOG(N7)-INT(LOG(N7))),0))/96))*POWER(10,INT(LOG(N7))-2))","v":100000},"Ω"]
[0.68,{"$error":"#NAME?"},0,0,0,0,{"$error":"#NAME?"},{"$error":"#NAME?"},{"$error":"#NAME?"},{"$error":"#NAME?"},null,null,"Rc1ea",{"$f":"Rcea2","v":0},{"$f":"IF(N8>(INT(0.5+100*POWER(10,IF(96*(LOG(N8)-INT(LOG(N8)))-ROUND(96*(LOG(N8)-INT(LOG(N8))),0)<0,ROUND(96*(LOG(N8)-INT(LOG(N8))),0)-1,ROUND(96*(LOG(N8)-INT(LOG(N8))),0))/96))*POWER(10,INT(LOG(N8))-2)+INT(0.5+100*POWER(10,(IF(96*(LOG(N8)-INT(LOG(N8)))-ROUND(96*(LOG(N8)-INT(LOG(N8))),0)<0,ROUND(96*(LOG(N8)-INT(LOG(N8))),0)-1,ROUND(96*(LOG(N8)-INT(LOG(N8))),0))+1)/96))*POWER(10,INT(LOG(N8))-2))/2,INT(0.5+100*POWER(10,(IF(96*(LOG(N8)-INT(LOG(N8)))-ROUND(96*(LOG(N8)-INT(LOG(N8))),0)<0,ROUND(96*(LOG(N8)-INT(LOG(N8))),0)-1,ROUND(96*(LOG(N8)-INT(LOG(N8))),0))+1)/96))*POWER(10,INT(LOG(N8))-2),INT(0.5+100*POWER(10,IF(96*(LOG(N8)-INT(LOG(N8)))-ROUND(96*(LOG(N8)-INT(LOG(N8))),0)<0,ROUND(96*(LOG(N8)-INT(LOG(N8))),0)-1,ROUND(96*(LOG(N8)-INT(LOG(N8))),0))/96))*POWER(10,INT(LOG(N8))-2))","v":{"$error":"#NUM!"}},"Ω"]
[0.82,{"$error":"#NAME?"},0,0,0,0,{"$error":"#NAME?"},{"$error":"#NAME?"},{"$error":"#NAME?"},{"$error":"#NAME?"}]
[1,{"$error":"#NAME?"},0,0,0,0,{"$error":"#NAME?"},{"$error":"#NAME?"},{"$error":"#NAME?"},{"$error":"#NAME?"},null,null,"Rfb1",{"$f":"Rfb1_","v":10000},{"$f":"IF(N10>(INT(0.5+100*POWER(10,IF(96*(LOG(N10)-INT(LOG(N10)))-ROUND(96*(LOG(N10)-INT(LOG(N10))),0)<0,ROUND(96*(LOG(N10)-INT(LOG(N10))),0)-1,ROUND(96*(LOG(N10)-INT(LOG(N10))),0))/96))*POWER(10,INT(LOG(N10))-2)+INT(0.5+100*POWER(10,(IF(96*(LOG(N10)-INT(LOG(N10)))-ROUND(96*(LOG(N10)-INT(LOG(N10))),0)<0,ROUND(96*(LOG(N10)-INT(LOG(N10))),0)-1,ROUND(96*(LOG(N10)-INT(LOG(N10))),0))+1)/96))*POWER(10,INT(LOG(N10))-2))/2,INT(0.5+100*POWER(10,(IF(96*(LOG(N10)-INT(LOG(N10)))-ROUND(96*(LOG(N10)-INT(LOG(N10))),0)<0,ROUND(96*(LOG(N10)-INT(LOG(N10))),0)-1,ROUND(96*(LOG(N10)-INT(LOG(N10))),0))+1)/96))*POWER(10,INT(LOG(N10))-2),INT(0.5+100*POWER(10,IF(96*(LOG(N10)-INT(LOG(N10)))-ROUND(96*(LOG(N10)-INT(LOG(N10))),0)<0,ROUND(96*(LOG(N10)-INT(LOG(N10))),0)-1,ROUND(96*(LOG(N10)-INT(LOG(N10))),0))/96))*POWER(10,INT(LOG(N10))-2))","v":10000},"Ω"]
[1.2,{"$error":"#NAME?"},0,0,0,0,{"$error":"#NAME?"},{"$error":"#NAME?"},{"$error":"#NAME?"},{"$error":"#NAME?"},null,null,"Rfb2",{"$f":"Rfb2_","v":40000},{"$f":"IF(N11=\"OPEN\",\"OPEN\",IF(N11>(INT(0.5+100*POWER(10,IF(96*(LOG(N11)-INT(LOG(N11)))-ROUND(96*(LOG(N11)-INT(LOG(N11))),0)<0,ROUND(96*(LOG(N11)-INT(LOG(N11))),0)-1,ROUND(96*(LOG(N11)-INT(LOG(N11))),0))/96))*POWER(10,INT(LOG(N11))-2)+INT(0.5+100*POWER(10,(IF(96*(LOG(N11)-INT(LOG(N11)))-ROUND(96*(LOG(N11)-INT(LOG(N11))),0)<0,ROUND(96*(LOG(N11)-INT(LOG(N11))),0)-1,ROUND(96*(LOG(N11)-INT(LOG(N11))),0))+1)/96))*POWER(10,INT(LOG(N11))-2))/2,INT(0.5+100*POWER(10,(IF(96*(LOG(N11)-INT(LOG(N11)))-ROUND(96*(LOG(N11)-INT(LOG(N11))),0)<0,ROUND(96*(LOG(N11)-INT(LOG(N11))),0)-1,ROUND(96*(LOG(N11)-INT(LOG(N11))),0))+1)/96))*POWER(10,INT(LOG(N11))-2),INT(0.5+100*POWER(10,IF(96*(LOG(N11)-INT(LOG(N11)))-ROUND(96*(LOG(N11)-INT(LOG(N11))),0)<0,ROUND(96*(LOG(N11)-INT(LOG(N11))),0)-1,ROUND(96*(LOG(N11)-INT(LOG(N11))),0))/96))*POWER(10,INT(LOG(N11))-2)))","v":40200},"Ω"]
[1.5,{"$error":"#NAME?"},0,0,0,0,{"$error":"#NAME?"},{"$error":"#NAME?"},{"$error":"#NAME?"},{"$error":"#NAME?"},null,null,"Rt1",{"$f":"'Variable Management'!B25*1000","v":13020.000000000002},{"$f":"IF(N12>(INT(0.5+100*POWER(10,IF(96*(LOG(N12)-INT(LOG(N12)))-ROUND(96*(LOG(N12)-INT(LOG(N12))),0)<0,ROUND(96*(LOG(N12)-INT(LOG(N12))),0)-1,ROUND(96*(LOG(N12)-INT(LOG(N12))),0))/96))*POWER(10,INT(LOG(N12))-2)+INT(0.5+100*POWER(10,(IF(96*(LOG(N12)-INT(LOG(N12)))-ROUND(96*(LOG(N12)-INT(LOG(N12))),0)<0,ROUND(96*(LOG(N12)-INT(LOG(N12))),0)-1,ROUND(96*(LOG(N12)-INT(LOG(N12))),0))+1)/96))*POWER(10,INT(LOG(N12))-2))/2,INT(0.5+100*POWER(10,(IF(96*(LOG(N12)-INT(LOG(N12)))-ROUND(96*(LOG(N12)-INT(LOG(N12))),0)<0,ROUND(96*(LOG(N12)-INT(LOG(N12))),0)-1,ROUND(96*(LOG(N12)-INT(LOG(N12))),0))+1)/96))*POWER(10,INT(LOG(N12))-2),INT(0.5+100*POWER(10,IF(96*(LOG(N12)-INT(LOG(N12)))-ROUND(96*(LOG(N12)-INT(LOG(N12))),0)<0,ROUND(96*(LOG(N12)-INT(LOG(N12))),0)-1,ROUND(96*(LOG(N12)-INT(LOG(N12))),0))/96))*POWER(10,INT(LOG(N12))-2))","v":13000},"Ω"]
[1.8,{"$error":"#NAME?"},0,0,0,0,{"$error":"#NAME?"},{"$error":"#NAME?"},{"$error":"#NAME?"},{"$error":"#NAME?"},null,null,"Rt2",{"$f":"'Variable Management'!#REF!*1000","v":{"$error":"#REF!"}},{"$f":"IF(N13=\"OPEN\",\"OPEN\",IF(N13>(INT(0.5+100*POWER(10,IF(96*(LOG(N13)-INT(LOG(N13)))-ROUND(96*(LOG(N13)-INT(LOG(N13))),0)<0,ROUND(96*(LOG(N13)-INT(LOG(N13))),0)-1,ROUND(96*(LOG(N13)-INT(LOG(N13))),0))/96))*POWER(10,INT(LOG(N13))-2)+INT(0.5+100*POWER(10,(IF(96*(LOG(N13)-INT(LOG(N13)))-ROUND(96*(LOG(N13)-INT(LOG(N13))),0)<0,ROUND(96*(LOG(N13)-INT(LOG(N13))),0)-1,ROUND(96*(LOG(N13)-INT(LOG(N13))),0))+1)/96))*POWER(10,INT(LOG(N13))-2))/2,INT(0.5+100*POWER(10,(IF(96*(LOG(N13)-INT(LOG(N13)))-ROUND(96*(LOG(N13)-INT(LOG(N13))),0)<0,ROUND(96*(LOG(N13)-INT(LOG(N13))),0)-1,ROUND(96*(LOG(N13)-INT(LOG(N13))),0))+1)/96))*POWER(10,INT(LOG(N13))-2),INT(0.5+100*POWER(10,IF(96*(LOG(N13)-INT(LOG(N13)))-ROUND(96*(LOG(N13)-INT(LOG(N13))),0)<0,ROUND(96*(LOG(N13)-INT(LOG(N13))),0)-1,ROUND(96*(LOG(N13)-INT(LOG(N13))),0))/96))*POWER(10,INT(LOG(N13))-2)))","v":{"$error":"#REF!"}},"Ω"]
[2.2000000000000002,{"$f":"IF(IF((B$3*10^12-$A15)*(B$3*10^12-$A14)*-1<0,0,1)*IF(ABS(B$3*10^12-$A15)>(B$3*10^12-$A14),$A14,$A15)=B15,0,IF((B$3*10^12-$A15)*(B$3*10^12-$A14)*-1<0,0,1)*IF(ABS(B$3*10^12-$A15)>(B$3*10^12-$A14),$A14,$A15))","v":{"$error":"#NAME?"}},0,0,0,0,{"$error":"#NAME?"},{"$error":"#NAME?"},{"$error":"#NAME?"},{"$error":"#NAME?"}]
[2.7,{"$error":"#NAME?"},0,0,0,0,{"$error":"#NAME?"},{"$error":"#NAME?"},{"$error":"#NAME?"},{"$error":"#NAME?"}]
[3.3,{"$error":"#NAME?"},0,0,0,0,{"$error":"#NAME?"},{"$error":"#NAME?"},{"$error":"#NAME?"},{"$error":"#NAME?"},null,null,"Rs",{"$f":"Rs_ideal*1000","v":{"$error":"#NAME?"}},{"$f":"IF(N16=0,0,IF(N16>(INT(0.5+100*POWER(10,IF(96*(LOG(N16)-INT(LOG(N16)))-ROUND(96*(LOG(N16)-INT(LOG(N16))),0)<0,ROUND(96*(LOG(N16)-INT(LOG(N16))),0)-1,ROUND(96*(LOG(N16)-INT(LOG(N16))),0))/96))*POWER(10,INT(LOG(N16))-2)+INT(0.5+100*POWER(10,(IF(96*(LOG(N16)-INT(LOG(N16)))-ROUND(96*(LOG(N16)-INT(LOG(N16))),0)<0,ROUND(96*(LOG(N16)-INT(LOG(N16))),0)-1,ROUND(96*(LOG(N16)-INT(LOG(N16))),0))+1)/96))*POWER(10,INT(LOG(N16))-2))/2,INT(0.5+100*POWER(10,(IF(96*(LOG(N16)-INT(LOG(N16)))-ROUND(96*(LOG(N16)-INT(LOG(N16))),0)<0,ROUND(96*(LOG(N16)-INT(LOG(N16))),0)-1,ROUND(96*(LOG(N16)-INT(LOG(N16))),0))+1)/96))*POWER(10,INT(LOG(N16))-2),INT(0.5+100*POWER(10,IF(96*(LOG(N16)-INT(LOG(N16)))-ROUND(96*(LOG(N16)-INT(LOG(N16))),0)<0,ROUND(96*(LOG(N16)-INT(LOG(N16))),0)-1,ROUND(96*(LOG(N16)-INT(LOG(N16))),0))/96))*POWER(10,INT(LOG(N16))-2)))","v":{"$error":"#NAME?"}},"mΩ"]
[3.9,{"$error":"#NAME?"},0,0,0,0,{"$error":"#NAME?"},{"$error":"#NAME?"},{"$error":"#NAME?"},{"$error":"#NAME?"},null,null,"Cres",{"$f":"Cres","v":{"$error":"#NAME?"}},{"$f":"G4*1000000000000","v":{"$error":"#NAME?"}},"pF"]
[4.7,{"$error":"#NAME?"},0,0,0,0,{"$error":"#NAME?"},{"$error":"#NAME?"},{"$error":"#NAME?"},{"$error":"#NAME?"}]
[5.6,{"$error":"#NAME?"},0,0,0,0,{"$error":"#NAME?"},{"$error":"#NAME?"},{"$error":"#NAME?"},{"$error":"#NAME?"}]
[6.8,{"$error":"#NAME?"},0,0,0,0,{"$error":"#NAME?"},{"$error":"#NAME?"},{"$error":"#NAME?"},{"$error":"#NAME?"}]
[8.1999999999999993,{"$error":"#NAME?"},0,0,0,0,{"$error":"#NAME?"},{"$error":"#NAME?"},{"$error":"#NAME?"},{"$error":"#NAME?"}]
[10,{"$error":"#NAME?"},12,0,0,0,{"$error":"#NAME?"},{"$error":"#NAME?"},{"$error":"#NAME?"},{"$error":"#NAME?"},null,null,"Cdither",{"$f":"Cdither_init","v":{"$error":"#NAME?"}},{"$f":"H4","v":{"$error":"#NAME?"}}]
[12,{"$error":"#NAME?"},0,0,0,0,{"$error":"#NAME?"},{"$error":"#NAME?"},{"$error":"#NAME?"},{"$error":"#NAME?"}]
[15,{"$error":"#NAME?"},0,0,0,0,{"$error":"#NAME?"},{"$error":"#NAME?"},{"$error":"#NAME?"},{"$error":"#NAME?"}]
[18,{"$error":"#NAME?"},0,0,0,0,{"$error":"#NAME?"},{"$error":"#NAME?"},{"$error":"#NAME?"},{"$error":"#NAME?"}]
[22,{"$error":"#NAME?"},0,0,0,0,{"$error":"#NAME?"},{"$error":"#NAME?"},{"$error":"#NAME?"},{"$error":"#NAME?"}]
[27,{"$error":"#NAME?"},0,0,0,0,{"$error":"#NAME?"},{"$error":"#NAME?"},{"$error":"#NAME?"},{"$error":"#NAME?"}]
[33,{"$error":"#NAME?"},0,0,0,0,{"$error":"#NAME?"},{"$error":"#NAME?"},{"$error":"#NAME?"},{"$error":"#NAME?"}]
[39,{"$error":"#NAME?"},0,0,0,0,{"$error":"#NAME?"},{"$error":"#NAME?"},{"$error":"#NAME?"},{"$error":"#NAME?"}]
[47,{"$error":"#NAME?"},0,0,0,0,{"$error":"#NAME?"},{"$error":"#NAME?"},{"$error":"#NAME?"},{"$error":"#NAME?"},null,null,"Rc1",{"$f":"O7/1000&\" kΩ\"","v":"100 kΩ"},{"$f":"O7/1000","v":100},"kΩ"]
[56,{"$error":"#NAME?"},0,0,0,0,{"$error":"#NAME?"},{"$error":"#NAME?"},{"$error":"#NAME?"},{"$error":"#NAME?"},null,null,"Cc1",{"$f":"C4*1000000000&\" nF\"","v":"0.012 nF"},{"$f":"C4*1000000000","v":1.2E-2},"nF"]
[68,{"$error":"#NAME?"},0,0,0,0,{"$error":"#NAME?"},{"$error":"#NAME?"},{"$error":"#NAME?"},{"$error":"#NAME?"},null,null,"Cc2",{"$f":"D4*1000000000000&\" pF\"","v":"0 pF"},{"$f":"D4*1000000000000","v":0},"pF"]
[82,{"$error":"#NAME?"},0,0,0,0,{"$error":"#NAME?"},{"$error":"#NAME?"},{"$error":"#NAME?"},{"$error":"#NAME?"}]
[{"$f":"A22*10","v":100},{"$error":"#NAME?"},0,0,0,0,{"$error":"#NAME?"},{"$error":"#NAME?"},{"$error":"#NAME?"},{"$error":"#NAME?"},null,null,"Rc2",{"$f":"O8/1000&\" kΩ\"","v":{"$error":"#NUM!"}},{"$f":"O8/1000","v":{"$error":"#NUM!"}},"kΩ"]
[{"$f":"A23*10","v":120},{"$error":"#NAME?"},0,0,0,0,{"$error":"#NAME?"},{"$error":"#NAME?"},{"$error":"#NAME?"},{"$error":"#NAME?"},null,null,"Cc3",{"$f":"I4*1000000000&\" nF\"","v":{"$error":"#NAME?"}},{"$f":"I4*1000000000","v":{"$error":"#NAME?"}},"nF"]
[150,{"$error":"#NAME?"},0,0,0,0,{"$error":"#NAME?"},{"$error":"#NAME?"},{"$error":"#NAME?"},{"$error":"#NAME?"},null,null,"Cc4",{"$f":"J4*1000000000000&\" pF\"","v":{"$error":"#NAME?"}},{"$f":"J4*1000000000000","v":{"$error":"#NAME?"}},"pF"]
[180,{"$error":"#NAME?"},0,0,0,0,{"$error":"#NAME?"},{"$error":"#NAME?"},{"$error":"#NAME?"},{"$error":"#NAME?"}]
[220,{"$error":"#NAME?"},0,0,0,0,{"$error":"#NAME?"},{"$error":"#NAME?"},{"$error":"#NAME?"},{"$error":"#NAME?"}]
[270,{"$error":"#NAME?"},{"$f":"IF(IF((C$3*10^12-$A40)*(C$3*10^12-$A39)*-1<0,0,1)*IF(ABS(C$3*10^12-$A40)>(C$3*10^12-$A39),$A39,$A40)=C40,0,IF((C$3*10^12-$A40)*(C$3*10^12-$A39)*-1<0,0,1)*IF(ABS(C$3*10^12-$A40)>(C$3*10^12-$A39),$A39,$A40))","v":0},0,0,0,{"$error":"#NAME?"},{"$error":"#NAME?"},{"$error":"#NAME?"},{"$error":"#NAME?"}]
[330,{"$error":"#NAME?"},0,0,0,0,{"$error":"#NAME?"},{"$error":"#NAME?"},{"$error":"#NAME?"},{"$error":"#NAME?"}]
[390,{"$error":"#NAME?"},0,0,0,0,{"$error":"#NAME?"},{"$error":"#NAME?"},{"$error":"#NAME?"},{"$error":"#NAME?"}]
[470,{"$error":"#NAME?"},0,0,0,0,{"$error":"#NAME?"},{"$error":"#NAME?"},{"$error":"#NAME?"},{"$error":"#NAME?"}]
[560,{"$error":"#NAME?"},0,0,0,0,{"$error":"#NAME?"},{"$error":"#NAME?"},{"$error":"#NAME?"},{"$error":"#NAME?"}]
[680,{"$error":"#NAME?"},0,0,0,0,{"$error":"#NAME?"},{"$error":"#NAME?"},{"$error":"#NAME?"},{"$error":"#NAME?"}]
[{"$f":"A33*10","v":820},{"$error":"#NAME?"},0,0,0,0,{"$error":"#NAME?"},{"$error":"#NAME?"},{"$error":"#NAME?"},{"$error":"#NAME?"}]
[1000,{"$error":"#NAME?"},0,0,0,0,{"$error":"#NAME?"},{"$error":"#NAME?"},{"$error":"#NAME?"},{"$error":"#NAME?"}]
[1200,{"$error":"#NAME?"},0,0,0,0,{"$error":"#NAME?"},{"$error":"#NAME?"},{"$error":"#NAME?"},{"$error":"#NAME?"}]
[1500,{"$error":"#NAME?"},0,0,0,0,{"$error":"#NAME?"},{"$error":"#NAME?"},{"$error":"#NAME?"},{"$error":"#NAME?"}]
[1800,{"$error":"#NAME?"},0,0,0,0,{"$error":"#NAME?"},{"$error":"#NAME?"},{"$error":"#NAME?"},{"$error":"#NAME?"}]
[2200,{"$error":"#NAME?"},0,0,0,0,{"$error":"#NAME?"},{"$error":"#NAME?"},{"$error":"#NAME?"},{"$error":"#NAME?"}]
[2700,{"$error":"#NAME?"},0,0,0,0,{"$error":"#NAME?"},{"$error":"#NAME?"},{"$error":"#NAME?"},{"$error":"#NAME?"}]
[3300,{"$error":"#NAME?"},0,0,0,0,{"$error":"#NAME?"},{"$error":"#NAME?"},{"$error":"#NAME?"},{"$error":"#NAME?"}]
[3900,{"$error":"#NAME?"},0,0,0,0,{"$error":"#NAME?"},{"$error":"#NAME?"},{"$error":"#NAME?"},{"$error":"#NAME?"}]
[4700,{"$error":"#NAME?"},0,0,0,0,{"$error":"#NAME?"},{"$error":"#NAME?"},{"$error":"#NAME?"},{"$error":"#NAME?"}]
[5600,{"$error":"#NAME?"},0,0,0,0,{"$error":"#NAME?"},{"$error":"#NAME?"},{"$error":"#NAME?"},{"$error":"#NAME?"}]
[6800,{"$error":"#NAME?"},0,0,0,0,{"$error":"#NAME?"},{"$error":"#NAME?"},{"$error":"#NAME?"},{"$error":"#NAME?"}]
[8200,{"$error":"#NAME?"},0,0,0,0,{"$error":"#NAME?"},{"$error":"#NAME?"},{"$error":"#NAME?"},{"$error":"#NAME?"}]
[10000,{"$error":"#NAME?"},0,0,0,0,{"$error":"#NAME?"},{"$error":"#NAME?"},{"$error":"#NAME?"},{"$error":"#NAME?"}]
[12000,{"$error":"#NAME?"},0,0,0,0,{"$error":"#NAME?"},{"$error":"#NAME?"},{"$error":"#NAME?"},{"$error":"#NAME?"}]
[15000,{"$error":"#NAME?"},0,0,0,0,{"$error":"#NAME?"},{"$error":"#NAME?"},{"$error":"#NAME?"},{"$error":"#NAME?"}]
[18000,{"$error":"#NAME?"},0,0,0,0,{"$error":"#NAME?"},{"$error":"#NAME?"},{"$error":"#NAME?"},{"$error":"#NAME?"}]
[22000,{"$error":"#NAME?"},0,0,0,0,{"$error":"#NAME?"},{"$error":"#NAME?"},{"$error":"#NAME?"},{"$error":"#NAME?"}]
[27000,{"$error":"#NAME?"},0,0,0,0,{"$error":"#NAME?"},{"$error":"#NAME?"},{"$error":"#NAME?"},{"$error":"#NAME?"}]
[33000,{"$error":"#NAME?"},0,0,0,0,{"$error":"#NAME?"},{"$error":"#NAME?"},{"$error":"#NAME?"},{"$error":"#NAME?"}]
[39000,{"$error":"#NAME?"},0,0,0,0,{"$error":"#NAME?"},{"$error":"#NAME?"},{"$error":"#NAME?"},{"$error":"#NAME?"}]
[47000,{"$error":"#NAME?"},0,0,0,0,{"$error":"#NAME?"},{"$error":"#NAME?"},{"$error":"#NAME?"},{"$error":"#NAME?"}]
[56000,{"$error":"#NAME?"},0,0,0,0,{"$error":"#NAME?"},{"$error":"#NAME?"},{"$error":"#NAME?"},{"$error":"#NAME?"}]
[68000,{"$error":"#NAME?"},0,0,0,0,{"$error":"#NAME?"},{"$error":"#NAME?"},{"$error":"#NAME?"},{"$error":"#NAME?"}]
[82000,{"$error":"#NAME?"},0,0,0,0,{"$error":"#NAME?"},{"$error":"#NAME?"},{"$error":"#NAME?"},{"$f":"IF(IF((J$3*10^12-$A70)*(J$3*10^12-$A69)*-1<0,0,1)*IF(ABS(J$3*10^12-$A70)>(J$3*10^12-$A69),$A69,$A70)=J70,0,IF((J$3*10^12-$A70)*(J$3*10^12-$A69)*-1<0,0,1)*IF(ABS(J$3*10^12-$A70)>(J$3*10^12-$A69),$A69,$A70))","v":{"$error":"#NAME?"}}]
[100000,{"$error":"#NAME?"},0,{"$f":"IF(IF((D$3*10^12-$A71)*(D$3*10^12-$A70)*-1<0,0,1)*IF(ABS(D$3*10^12-$A71)>(D$3*10^12-$A70),$A70,$A71)=D71,0,IF((D$3*10^12-$A71)*(D$3*10^12-$A70)*-1<0,0,1)*IF(ABS(D$3*10^12-$A71)>(D$3*10^12-$A70),$A70,$A71))","v":0},0,0,{"$error":"#NAME?"},{"$error":"#NAME?"},{"$error":"#NAME?"},{"$error":"#NAME?"}]
[120000,{"$f":"IF(IF((B$3*10^12-$A72)*(B$3*10^12-$A71)*-1<0,0,1)*IF(ABS(B$3*10^12-$A72)>(B$3*10^12-$A71),$A71,$A72)=B72,0,IF((B$3*10^12-$A72)*(B$3*10^12-$A71)*-1<0,0,1)*IF(ABS(B$3*10^12-$A72)>(B$3*10^12-$A71),$A71,$A72))","v":{"$error":"#NAME?"}},{"$f":"IF(IF((C$3*10^12-$A72)*(C$3*10^12-$A71)*-1<0,0,1)*IF(ABS(C$3*10^12-$A72)>(C$3*10^12-$A71),$A71,$A72)=C72,0,IF((C$3*10^12-$A72)*(C$3*10^12-$A71)*-1<0,0,1)*IF(ABS(C$3*10^12-$A72)>(C$3*10^12-$A71),$A71,$A72))","v":0},0,0,{"$f":"IF(IF((F$3*10^12-$A72)*(F$3*10^12-$A71)*-1<0,0,1)*IF(ABS(F$3*10^12-$A72)>(F$3*10^12-$A71),$A71,$A72)=F72,0,IF((F$3*10^12-$A72)*(F$3*10^12-$A71)*-1<0,0,1)*IF(ABS(F$3*10^12-$A72)>(F$3*10^12-$A71),$A71,$A72))","v":0},{"$f":"IF(IF((G$3*10^12-$A72)*(G$3*10^12-$A71)*-1<0,0,1)*IF(ABS(G$3*10^12-$A72)>(G$3*10^12-$A71),$A71,$A72)=G72,0,IF((G$3*10^12-$A72)*(G$3*10^12-$A71)*-1<0,0,1)*IF(ABS(G$3*10^12-$A72)>(G$3*10^12-$A71),$A71,$A72))","v":{"$error":"#NAME?"}},{"$f":"IF(IF((H$3*10^12-$A72)*(H$3*10^12-$A71)*-1<0,0,1)*IF(ABS(H$3*10^12-$A72)>(H$3*10^12-$A71),$A71,$A72)=H72,0,IF((H$3*10^12-$A72)*(H$3*10^12-$A71)*-1<0,0,1)*IF(ABS(H$3*10^12-$A72)>(H$3*10^12-$A71),$A71,$A72))","v":{"$error":"#NAME?"}},{"$f":"IF(IF((I$3*10^12-$A72)*(I$3*10^12-$A71)*-1<0,0,1)*IF(ABS(I$3*10^12-$A72)>(I$3*10^12-$A71),$A71,$A72)=I72,0,IF((I$3*10^12-$A72)*(I$3*10^12-$A71)*-1<0,0,1)*IF(ABS(I$3*10^12-$A72)>(I$3*10^12-$A71),$A71,$A72))","v":{"$error":"#NAME?"}},{"$error":"#NAME?"}]
[150000,{"$error":"#NAME?"},0,0,0,0,{"$error":"#NAME?"},{"$error":"#NAME?"},{"$error":"#NAME?"},{"$error":"#NAME?"}]
[180000,{"$error":"#NAME?"},0,0,0,0,{"$error":"#NAME?"},{"$error":"#NAME?"},{"$error":"#NAME?"},{"$error":"#NAME?"}]
[220000,{"$error":"#NAME?"},0,0,0,0,{"$error":"#NAME?"},{"$error":"#NAME?"},{"$error":"#NAME?"},{"$error":"#NAME?"}]
[270000,{"$error":"#NAME?"},0,0,0,0,{"$error":"#NAME?"},{"$error":"#NAME?"},{"$error":"#NAME?"},{"$error":"#NAME?"}]
[330000,{"$error":"#NAME?"},0,0,0,0,{"$error":"#NAME?"},{"$error":"#NAME?"},{"$error":"#NAME?"},{"$error":"#NAME?"}]
[390000,{"$error":"#NAME?"},0,0,0,0,{"$error":"#NAME?"},{"$error":"#NAME?"},{"$error":"#NAME?"},{"$error":"#NAME?"}]
[470000,{"$error":"#NAME?"},0,0,0,0,{"$error":"#NAME?"},{"$error":"#NAME?"},{"$error":"#NAME?"},{"$error":"#NAME?"}]
[560000,{"$error":"#NAME?"},0,0,0,0,{"$error":"#NAME?"},{"$error":"#NAME?"},{"$error":"#NAME?"},{"$error":"#NAME?"}]
[680000,{"$error":"#NAME?"},0,0,0,0,{"$error":"#NAME?"},{"$error":"#NAME?"},{"$error":"#NAME?"},{"$error":"#NAME?"}]
[820000,{"$error":"#NAME?"},0,0,0,0,{"$error":"#NAME?"},{"$error":"#NAME?"},{"$error":"#NAME?"},{"$error":"#NAME?"}]
[1000000,{"$error":"#NAME?"},0,0,0,0,{"$error":"#NAME?"},{"$error":"#NAME?"},{"$error":"#NAME?"},{"$error":"#NAME?"}]
[1200000,{"$error":"#NAME?"},0,0,0,0,{"$error":"#NAME?"},{"$error":"#NAME?"},{"$error":"#NAME?"},{"$error":"#NAME?"}]
[1500000,{"$error":"#NAME?"},0,0,0,0,{"$error":"#NAME?"},{"$error":"#NAME?"},{"$error":"#NAME?"},{"$error":"#NAME?"}]
[1800000,{"$error":"#NAME?"},0,0,0,0,{"$error":"#NAME?"},{"$error":"#NAME?"},{"$error":"#NAME?"},{"$error":"#NAME?"}]
[2200000,{"$error":"#NAME?"},0,0,0,0,{"$error":"#NAME?"},{"$error":"#NAME?"},{"$error":"#NAME?"},{"$error":"#NAME?"}]
[2700000,{"$error":"#NAME?"},0,0,0,0,{"$error":"#NAME?"},{"$error":"#NAME?"},{"$error":"#NAME?"},{"$error":"#NAME?"}]
[3300000,{"$error":"#NAME?"},0,0,0,0,{"$error":"#NAME?"},{"$error":"#NAME?"},{"$error":"#NAME?"},{"$error":"#NAME?"}]
[3900000,{"$error":"#NAME?"},0,0,0,0,{"$error":"#NAME?"},{"$error":"#NAME?"},{"$error":"#NAME?"},{"$error":"#NAME?"}]
[4700000,{"$error":"#NAME?"},0,0,0,0,{"$error":"#NAME?"},{"$error":"#NAME?"},{"$error":"#NAME?"},{"$error":"#NAME?"}]
[5600000,{"$error":"#NAME?"},0,0,0,0,{"$error":"#NAME?"},{"$error":"#NAME?"},{"$error":"#NAME?"},{"$error":"#NAME?"}]
[6800000,{"$error":"#NAME?"},0,0,0,0,{"$error":"#NAME?"},{"$error":"#NAME?"},{"$error":"#NAME?"},{"$error":"#NAME?"}]
[8200000,{"$error":"#NAME?"},0,0,0,0,{"$error":"#NAME?"},{"$error":"#NAME?"},{"$error":"#NAME?"},{"$error":"#NAME?"}]
[10000000,{"$error":"#NAME?"},0,0,0,0,{"$error":"#NAME?"},{"$error":"#NAME?"},{"$error":"#NAME?"},{"$error":"#NAME?"}]
[12000000,{"$error":"#NAME?"},0,0,0,0,{"$error":"#NAME?"},{"$error":"#NAME?"},{"$error":"#NAME?"},{"$error":"#NAME?"}]
[15000000,{"$error":"#NAME?"},0,0,0,0,{"$error":"#NAME?"},{"$error":"#NAME?"},{"$error":"#NAME?"},{"$error":"#NAME?"}]
[18000000,{"$error":"#NAME?"},0,0,0,22000000,{"$error":"#NAME?"},{"$error":"#NAME?"},{"$error":"#NAME?"},{"$error":"#NAME?"}]
[22000000,{"$error":"#NAME?"},0,0,0,0,{"$error":"#NAME?"},{"$error":"#NAME?"},{"$error":"#NAME?"},{"$error":"#NAME?"}]
[{"$f":"A87*10","v":27000000},{"$error":"#NAME?"},0,0,0,0,{"$error":"#NAME?"},{"$error":"#NAME?"},{"$error":"#NAME?"},{"$error":"#NAME?"}]
[33000000,{"$error":"#NAME?"},0,0,0,0,{"$error":"#NAME?"},{"$error":"#NAME?"},{"$error":"#NAME?"},{"$error":"#NAME?"}]
[39000000,{"$error":"#NAME?"},0,0,0,0,{"$error":"#NAME?"},{"$error":"#NAME?"},{"$error":"#NAME?"},{"$error":"#NAME?"}]
[47000000,{"$error":"#NAME?"},0,0,47000000,0,{"$error":"#NAME?"},{"$error":"#NAME?"},{"$error":"#NAME?"},{"$error":"#NAME?"}]
[56000000,{"$error":"#NAME?"},0,0,0,{"$f":"IF(IF((F$3*10^12-$A104)*(F$3*10^12-$A103)*-1<0,0,1)*IF(ABS(F$3*10^12-$A104)>(F$3*10^12-$A103),$A103,$A104)=F104,0,IF((F$3*10^12-$A104)*(F$3*10^12-$A103)*-1<0,0,1)*IF(ABS(F$3*10^12-$A104)>(F$3*10^12-$A103),$A103,$A104))","v":0},{"$f":"IF(IF((G$3*10^12-$A104)*(G$3*10^12-$A103)*-1<0,0,1)*IF(ABS(G$3*10^12-$A104)>(G$3*10^12-$A103),$A103,$A104)=G104,0,IF((G$3*10^12-$A104)*(G$3*10^12-$A103)*-1<0,0,1)*IF(ABS(G$3*10^12-$A104)>(G$3*10^12-$A103),$A103,$A104))","v":{"$error":"#NAME?"}},{"$f":"IF(IF((H$3*10^12-$A104)*(H$3*10^12-$A103)*-1<0,0,1)*IF(ABS(H$3*10^12-$A104)>(H$3*10^12-$A103),$A103,$A104)=H104,0,IF((H$3*10^12-$A104)*(H$3*10^12-$A103)*-1<0,0,1)*IF(ABS(H$3*10^12-$A104)>(H$3*10^12-$A103),$A103,$A104))","v":{"$error":"#NAME?"}},{"$f":"IF(IF((I$3*10^12-$A104)*(I$3*10^12-$A103)*-1<0,0,1)*IF(ABS(I$3*10^12-$A104)>(I$3*10^12-$A103),$A103,$A104)=I104,0,IF((I$3*10^12-$A104)*(I$3*10^12-$A103)*-1<0,0,1)*IF(ABS(I$3*10^12-$A104)>(I$3*10^12-$A103),$A103,$A104))","v":{"$error":"#NAME?"}},{"$error":"#NAME?"}]
[68000000,{"$error":"#NAME?"},0,0,0,0,{"$error":"#NAME?"},{"$error":"#NAME?"},{"$error":"#NAME?"},{"$error":"#NAME?"}]
[82000000,{"$error":"#NAME?"},0,0,0,0,{"$error":"#NAME?"},{"$error":"#NAME?"},{"$error":"#NAME?"},{"$error":"#NAME?"}]
[100000000,{"$error":"#NAME?"},0,0,0,0,{"$error":"#NAME?"},{"$error":"#NAME?"},{"$error":"#NAME?"},{"$error":"#NAME?"}]
[120000000,{"$error":"#NAME?"},0,0,0,0,{"$error":"#NAME?"},{"$error":"#NAME?"},{"$error":"#NAME?"},{"$error":"#NAME?"}]
[150000000,{"$error":"#NAME?"},0,0,0,0,{"$error":"#NAME?"},{"$error":"#NAME?"},{"$error":"#NAME?"},{"$error":"#NAME?"}]
[180000000,{"$error":"#NAME?"},0,0,0,0,{"$error":"#NAME?"},{"$error":"#NAME?"},{"$error":"#NAME?"},{"$error":"#NAME?"}]
[220000000,{"$error":"#NAME?"},0,0,0,0,{"$error":"#NAME?"},{"$error":"#NAME?"},{"$error":"#NAME?"},{"$error":"#NAME?"}]
[270000000,{"$error":"#NAME?"},0,0,0,0,{"$error":"#NAME?"},{"$error":"#NAME?"},{"$error":"#NAME?"},{"$error":"#NAME?"}]
[330000000,{"$error":"#NAME?"},0,0,0,0,{"$error":"#NAME?"},{"$error":"#NAME?"},{"$error":"#NAME?"},{"$error":"#NAME?"}]
[390000000,{"$error":"#NAME?"},0,0,0,0,{"$error":"#NAME?"},{"$error":"#NAME?"},{"$error":"#NAME?"},{"$error":"#NAME?"}]
[470000000,{"$error":"#NAME?"},0,0,0,0,{"$error":"#NAME?"},{"$error":"#NAME?"},{"$error":"#NAME?"},{"$error":"#NAME?"}]
[560000000,{"$error":"#NAME?"},0,0,0,0,{"$error":"#NAME?"},{"$error":"#NAME?"},{"$error":"#NAME?"},{"$error":"#NAME?"}]
[680000000,{"$error":"#NAME?"},0,0,0,0,{"$error":"#NAME?"},{"$error":"#NAME?"},{"$error":"#NAME?"},{"$error":"#NAME?"}]
[820000000,{"$error":"#NAME?"},0,0,0,0,{"$error":"#NAME?"},{"$error":"#NAME?"},{"$error":"#NAME?"},{"$error":"#NAME?"}]
[1000000000,{"$error":"#NAME?"},0,0,0,0,{"$error":"#NAME?"},{"$error":"#NAME?"},{"$error":"#NAME?"},{"$error":"#NAME?"}]
[1200000000,{"$error":"#NAME?"},0,0,0,0,{"$error":"#NAME?"},{"$error":"#NAME?"},{"$error":"#NAME?"},{"$error":"#NAME?"}]
[1500000000,{"$error":"#NAME?"},0,0,0,0,{"$error":"#NAME?"},{"$error":"#NAME?"},{"$error":"#NAME?"},{"$error":"#NAME?"}]
[1800000000,{"$error":"#NAME?"},0,0,0,0,{"$error":"#NAME?"},{"$error":"#NAME?"},{"$error":"#NAME?"},{"$error":"#NAME?"}]
[2200000000,{"$error":"#NAME?"},0,0,0,0,{"$error":"#NAME?"},{"$error":"#NAME?"},{"$error":"#NAME?"},{"$error":"#NAME?"}]
[2700000000,{"$error":"#NAME?"},0,0,0,0,{"$error":"#NAME?"},{"$error":"#NAME?"},{"$error":"#NAME?"},{"$error":"#NAME?"}]
[3300000000,{"$error":"#NAME?"},0,0,0,0,{"$error":"#NAME?"},{"$error":"#NAME?"},{"$error":"#NAME?"},{"$error":"#NAME?"}]
[3900000000,{"$error":"#NAME?"},0,0,0,0,{"$error":"#NAME?"},{"$error":"#NAME?"},{"$error":"#NAME?"},{"$error":"#NAME?"}]
[4700000000,{"$error":"#NAME?"},0,0,0,0,{"$error":"#NAME?"},{"$error":"#NAME?"},{"$error":"#NAME?"},{"$error":"#NAME?"}]
[5600000000,{"$error":"#NAME?"},0,0,0,0,{"$error":"#NAME?"},{"$error":"#NAME?"},{"$error":"#NAME?"},{"$error":"#NAME?"}]
[6800000000,{"$error":"#NAME?"},0,0,0,0,{"$error":"#NAME?"},{"$error":"#NAME?"},{"$error":"#NAME?"},{"$error":"#NAME?"}]
[8200000000,{"$error":"#NAME?"},0,0,0,0,{"$error":"#NAME?"},{"$error":"#NAME?"},{"$error":"#NAME?"},{"$error":"#NAME?"}]
[10000000000,{"$error":"#NAME?"},0,0,0,0,{"$error":"#NAME?"},{"$error":"#NAME?"},{"$error":"#NAME?"},{"$error":"#NAME?"}]
[12000000000,{"$error":"#NAME?"},0,0,0,0,{"$error":"#NAME?"},{"$error":"#NAME?"},{"$error":"#NAME?"},{"$error":"#NAME?"}]
[15000000000,{"$error":"#NAME?"},0,0,0,0,{"$error":"#NAME?"},{"$error":"#NAME?"},{"$error":"#NAME?"},{"$error":"#NAME?"}]
[18000000000,{"$error":"#NAME?"},0,0,0,0,{"$error":"#NAME?"},{"$error":"#NAME?"},{"$error":"#NAME?"},{"$f":"IF(IF((J$3*10^12-$A134)*(J$3*10^12-$A133)*-1<0,0,1)*IF(ABS(J$3*10^12-$A134)>(J$3*10^12-$A133),$A133,$A134)=J134,0,IF((J$3*10^12-$A134)*(J$3*10^12-$A133)*-1<0,0,1)*IF(ABS(J$3*10^12-$A134)>(J$3*10^12-$A133),$A133,$A134))","v":{"$error":"#NAME?"}}]
[22000000000,{"$error":"#NAME?"},0,0,{"$f":"IF(IF((E$3*10^12-$A135)*(E$3*10^12-$A134)*-1<0,0,1)*IF(ABS(E$3*10^12-$A135)>(E$3*10^12-$A134),$A134,$A135)=E135,0,IF((E$3*10^12-$A135)*(E$3*10^12-$A134)*-1<0,0,1)*IF(ABS(E$3*10^12-$A135)>(E$3*10^12-$A134),$A134,$A135))","v":0},0,{"$error":"#NAME?"},{"$error":"#NAME?"},{"$error":"#NAME?"},{"$f":"IF(IF((J$3*10^12-$A135)*(J$3*10^12-$A134)*-1<0,0,1)*IF(ABS(J$3*10^12-$A135)>(J$3*10^12-$A134),$A134,$A135)=J135,0,IF((J$3*10^12-$A135)*(J$3*10^12-$A134)*-1<0,0,1)*IF(ABS(J$3*10^12-$A135)>(J$3*10^12-$A134),$A134,$A135))","v":{"$error":"#NAME?"}}]
[27000000000,{"$f":"IF(IF((B$3*10^12-$A136)*(B$3*10^12-$A135)*-1<0,0,1)*IF(ABS(B$3*10^12-$A136)>(B$3*10^12-$A135),$A135,$A136)=B136,0,IF((B$3*10^12-$A136)*(B$3*10^12-$A135)*-1<0,0,1)*IF(ABS(B$3*10^12-$A136)>(B$3*10^12-$A135),$A135,$A136))","v":{"$error":"#NAME?"}},{"$f":"IF(IF((C$3*10^12-$A136)*(C$3*10^12-$A135)*-1<0,0,1)*IF(ABS(C$3*10^12-$A136)>(C$3*10^12-$A135),$A135,$A136)=C136,0,IF((C$3*10^12-$A136)*(C$3*10^12-$A135)*-1<0,0,1)*IF(ABS(C$3*10^12-$A136)>(C$3*10^12-$A135),$A135,$A136))","v":0},0,0,0,{"$error":"#NAME?"},{"$error":"#NAME?"},{"$error":"#NAME?"},{"$error":"#NAME?"}]
[33000000000,{"$error":"#NAME?"},0,0,0,0,{"$error":"#NAME?"},{"$error":"#NAME?"},{"$error":"#NAME?"},{"$error":"#NAME?"}]
[39000000000,{"$error":"#NAME?"},0,0,0,0,{"$error":"#NAME?"},{"$error":"#NAME?"},{"$error":"#NAME?"},{"$error":"#NAME?"}]
[47000000000,{"$error":"#NAME?"},0,0,0,0,{"$error":"#NAME?"},{"$error":"#NAME?"},{"$error":"#NAME?"},{"$error":"#NAME?"}]
[56000000000,{"$error":"#NAME?"},0,0,0,0,{"$error":"#NAME?"},{"$error":"#NAME?"},{"$error":"#NAME?"},{"$error":"#NAME?"}]
[68000000000,{"$error":"#NAME?"},0,0,0,0,{"$error":"#NAME?"},{"$error":"#NAME?"},{"$error":"#NAME?"},{"$error":"#NAME?"}]
[82000000000,{"$error":"#NAME?"},0,0,0,0,{"$error":"#NAME?"},{"$error":"#NAME?"},{"$error":"#NAME?"},{"$error":"#NAME?"}]
[100000000000,{"$error":"#NAME?"},0,0,0,0,{"$error":"#NAME?"},{"$error":"#NAME?"},{"$error":"#NAME?"},{"$error":"#NAME?"}]
[120000000000,{"$error":"#NAME?"},0,0,0,0,{"$error":"#NAME?"},{"$error":"#NAME?"},{"$error":"#NAME?"},{"$error":"#NAME?"}]
[150000000000,{"$error":"#NAME?"},0,0,0,0,{"$error":"#NAME?"},{"$error":"#NAME?"},{"$error":"#NAME?"},{"$error":"#NAME?"}]
[180000000000,{"$error":"#NAME?"},0,0,0,0,{"$error":"#NAME?"},{"$error":"#NAME?"},{"$error":"#NAME?"},{"$error":"#NAME?"}]
[220000000000,{"$error":"#NAME?"},0,0,0,0,{"$error":"#NAME?"},{"$error":"#NAME?"},{"$error":"#NAME?"},{"$error":"#NAME?"}]
[270000000000,{"$error":"#NAME?"},0,0,0,0,{"$error":"#NAME?"},{"$error":"#NAME?"},{"$error":"#NAME?"},{"$error":"#NAME?"}]
[330000000000,{"$error":"#NAME?"},0,0,0,0,{"$error":"#NAME?"},{"$error":"#NAME?"},{"$error":"#NAME?"},{"$error":"#NAME?"}]
[390000000000,{"$error":"#NAME?"},0,0,0,0,{"$error":"#NAME?"},{"$error":"#NAME?"},{"$error":"#NAME?"},{"$error":"#NAME?"}]
[470000000000,{"$error":"#NAME?"},0,0,0,0,{"$error":"#NAME?"},{"$error":"#NAME?"},{"$error":"#NAME?"},{"$error":"#NAME?"}]
[560000000000,{"$error":"#NAME?"},0,0,0,0,{"$error":"#NAME?"},{"$error":"#NAME?"},{"$error":"#NAME?"},{"$error":"#NAME?"}]
[680000000000,{"$error":"#NAME?"},0,0,0,0,{"$error":"#NAME?"},{"$error":"#NAME?"},{"$error":"#NAME?"},{"$error":"#NAME?"}]
[820000000000,{"$error":"#NAME?"},0,0,0,0,{"$error":"#NAME?"},{"$error":"#NAME?"},{"$error":"#NAME?"},{"$error":"#NAME?"}]
[1000000000000,{"$error":"#NAME?"},0,0,0,0,{"$error":"#NAME?"},{"$error":"#NAME?"},{"$error":"#NAME?"},{"$error":"#NAME?"}]
[1200000000000,{"$error":"#NAME?"},0,0,0,0,{"$error":"#NAME?"},{"$error":"#NAME?"},{"$error":"#NAME?"},{"$error":"#NAME?"}]
[1500000000000,{"$error":"#NAME?"},0,0,0,0,{"$error":"#NAME?"},{"$error":"#NAME?"},{"$error":"#NAME?"},{"$error":"#NAME?"}]
[1800000000000,{"$error":"#NAME?"},0,0,0,0,{"$error":"#NAME?"},{"$error":"#NAME?"},{"$error":"#NAME?"},{"$error":"#NAME?"}]
[2200000000000,{"$error":"#NAME?"},0,0,0,0,{"$error":"#NAME?"},{"$error":"#NAME?"},{"$error":"#NAME?"},{"$error":"#NAME?"}]
[2700000000000,{"$error":"#NAME?"},2700000000000,0,2700000000000,2700000000000,{"$error":"#NAME?"},{"$error":"#NAME?"},{"$error":"#NAME?"},{"$error":"#NAME?"}]

{"sheet":"Snubber","index":11,"n_rows":6,"n_cols":5,"rows_kept":6,"cut":false,"hidden":true,"merged":[]}
[null,null,"UNITS","STD UNITS"]
["Frequency of Ringing",85,"MHz",{"$f":"B2*1000000","v":85000000},"Hz"]
["SW capacitance",3000,"pF",{"$f":"B3*0.000000000001","v":3E-9},"F"]
["Lpar",{"$f":"1000000000*1/((D2*2*3.14159)^2*D3)","v":1.1686430773614742},"nH",{"$f":"B4/1000000000","v":1.1686430773614743E-9},"H"]
["Csnub",{"$f":"4*B3","v":12000},"pF",{"$f":"B5*0.000000000001","v":1.2E-8},"F"]
["Rsnub",{"$f":"SQRT(D4/D3)","v":0.62413755891936573},"Ω",{"$f":"B6","v":0.62413755891936573},"Ω"]

{"sheet":"Parallel Output Caps","index":12,"n_rows":17,"n_cols":5,"rows_kept":17,"cut":false,"hidden":true,"merged":[]}
[]
[]
[]
["Fsw",{"$f":"Fsw","v":1000000}]
[]
["C1",20,"uF",{"$f":"B6/1000000","v":2.0000000000000002E-5},"F"]
["R1",0.5,"mOhms",{"$f":"B7/1000","v":5.0000000000000001E-4},"Ohms"]
[]
["C2",68,"uF",{"$f":"B9/1000000","v":6.7999999999999999E-5},"F"]
["R2",20,"mOhms",{"$f":"B10/1000","v":0.02},"Ohms"]
[]
[]
["I1 ",{"$f":"(D6/(D6+D9))*SQRT((D10*D9*B4)^2+1)/SQRT((((D7+D10)*D6*D9/(D9+D6))*B4)^2+1)","v":0.36573722195300923},"%"]
["I2 ",{"$f":"1-B13","v":0.63426277804699072},"%"]
[]
["I1 ",{"$f":"B13*(Iripple1/(2*SQRT(3)))","v":{"$error":"#NAME?"}},"A"]
["I2 ",{"$f":"B14*(Iripple1/(2*SQRT(3)))","v":{"$error":"#NAME?"}},"A"]