{"text_format":"1","workbook":"xlsx","n_sheets":4,"sheets":["Calculation Sheet","Thermal Shutdown Limit Plot","Res EIA Tables","Cap Tables"],"not_rendered":{"charts":5,"images":1,"macros":1,"external_links":0,"defined_names":26,"comments":1,"pivot_tables":0},"unopened":[],"bounds":{"document_bytes":16777216,"sheet_cells":100000,"rows_first":2000,"rows_last":500,"rows_between":2000,"halvings":0,"cell_chars":16384,"cell_head_chars":4096},"cells_cut":0,"cells_raw":0,"read":"whole","date_system":"1900"}

{"sheet":"Calculation Sheet","index":0,"n_rows":108,"n_cols":16,"rows_kept":108,"cut":false,"hidden":false,"merged":[[0,13,0,15],[81,11,81,12],[86,11,86,12],[86,1,86,4],[26,1,26,2],[31,1,31,2],[47,1,47,2],[93,1,93,2],[0,1,0,6],[73,1,73,3],[58,1,58,3],[35,1,35,3],[84,1,84,2],[84,3,84,8],[63,1,63,5],[80,1,80,5],[56,1,56,5],[41,1,41,5]]}
[null,"TPS2596xx Design Calculation Tool",null,null,null,null,null,null,null,null,null,null,null,"Table - 1: Device Comparison Table"]
[null,null,null,null,null,null,null,null,null,null,null,null,null,"Part number","Overvoltage Response","Response to Thermal Shutdown (TSD)"]
[null,null,"Constants Cells",null,null,null,null,null,null,null,null,null,null,"TPS259620","OVC - 3.8 V, 5.7 V, 13.7 V (Pin Selectable)","Latch-off"]
[null,null,"Input/SelectCells",null,null,null,null,null,null,null,null,null,null,"TPS259621","OVC - 3.8 V, 5.7 V, 13.7 V (Pin Selectable)","Auto-retry"]
[null,null,"Calculation Cells",null,null,null,null,null,null,null,null,null,null,"TPS259630","Adjustable OVLO","Latch-off"]
[null,null,"Calculated, but can be over-ridden by user",null,null,null,null,null,null,null,null,null,null,"TPS259631","Adjustable OVLO","Auto-retry"]
[null,null,"Error Cells, Must be Fixed"]
[]
[null,"Parameter","Description","Value "," Units","Tolerance","Recommended Value"]
[null,"Select Device","Refer to Table-1 and select based on OverVoltage Clamp/Lockout and Latch-off/Auto-retry requirement","TPS259631"]
[null,"VIN (max)","Maximum Operating input voltage (magnitude)",12,"V"]
[null,"VIN (max)","Maximum Operating input voltage (magnitude)",12,"V"]
[null,"VIN (max) Selected","Maximum Operating input voltage selected from D6 and D7",{"$f":"IF(D10=N3,D11, IF(D10=N4,D11, IF(D10=N5,D12, IF(D10=N6,D12))))","v":12},"V"]
[null,"VCLAMP","Desired Over Voltage Clamp ",13.58,"V",3.5000000000000003E-2]
[null,"OVLO Set Point","Desired Over Voltage Lockout Set Point",13.2,"V",0.03,null,null,"VOVC",3.59,5.45,13.58]
[null,"UVLO Set Point","Desired Undervoltage Threshold (VIN Rising)",8,"V",0.03,null,null,"R_OVCSEL","Short to GND",400,"Open"]
[null,"UVLO Set Point","Desired Undervoltage Threshold (VIN Rising)",8,"V",0.03]
[null,"VUVP","Internal Undervoltage Protection Threshold (VIN Rising)",2.5299999999999998,"V",0.03]
[null,"Cout","Load Capacitance",100,"uF",0.1]
[null,"Rlstart","Load at start-up (assumed to be resistive), Refer to Section 9.2.3.3.2 in Datasheet",20,"Ohm",null,{"$f":"Vcc_max/Imax","v":12}]
[null,"Imax","Maximum continuous load current (magnitude)",1,"A"]
[null,"Ilimit","Current Limit, 10.5% higher than maximum continuous load current",{"$f":"IF(1.105*Imax<0.125, 0.125, IF(1.105*Imax>2, 2,1.105*Imax ))","v":1.105},"A"]
[null,"TA, MAX","Maximum Operating Ambient temperature",55,"°C"]
[null,"RθJA","Junction-to-Ambient Thermal Resistance",null,"°C/W"]
[]
[]
[null,"OVC set point calculations (TPS25962x)"]
[null,"VOVC","Over Voltage Clamp",{"$f":"D14","v":13.58},"V",3.5000000000000003E-2]
[null,"R_OVCSEL","Calculated value of Resistor at OVCSEL pin",{"$f":"INDEX(J16:L16,MATCH(D28,J15:L15))","v":"Open"},"kOhm"]
[]
[]
[null,"UVLO set point calculations (TPS25962x)"]
[null,"UVLO Set Point","Desired Undervoltage Threshold (VIN Rising)",{"$f":"D16","v":8},"V",0.03]
[null,"R1: Pullup at EN/UVLO Pin","Select a value > 100K to keep I_R12 low",1000,"kOhm",0.01,null,null,null,null,null,{"$f":"IF(D34>=100,D34,IF(D34>=10,D34*10,D34*100))","v":1000}]
[null,"R2_cal","Calculated value of Resistor at EN/UVLO pin",{"$f":"RpUVLO/(D33/OVref -1)","v":176.47058823529412},"kOhm",null,null,null,null,{"$f":"D39","v":7.2797752808988774},"Power Fail \n(VIN Falling)",{"$f":"IF(D35>=10000,D35/100,IF(D35>=1000,D35/10,IF(D35>=100,D35,IF(D35>=10,D35*10,D35*100))))","v":176.47058823529412}]
[null,"SELECT THE VALUE OF RESISTORS AS CLOSEST AVAILABLE VALUE OF R2",null,null,null,null,null,null,null,{"$f":"D38","v":7.9415730337078649},"Release UVLO (VIN Rising)",{"$f":"INDEX('Res EIA Tables'!E$5:E$197,2+MATCH(L35,'Res EIA Tables'!E$5:E$197))","v":178}]
[null,"R2","Select the closest possible value as R2_cal",{"$f":"G37","v":178},"kOhm",{"$f":"F34","v":0.01},{"$f":"L36*D35/L35","v":178},null,null,{"$f":"D28","v":13.58},"OV Clamp\n(VIN Rising)"]
[null,"UV_final_rising","Undervoltage Threshold (VIN Rising)",{"$f":"OVref*(1+RpUVLO/D37)","v":7.9415730337078649},"V",{"$f":"SQRT(F107^2+F34^2+F37^2)","v":3.3166247903553998E-2}]
[null,"UV_final_falling","Undervoltage Threshold (VIN Falling)",{"$f":"UVref*(1+RpUVLO/D37)","v":7.2797752808988774},"V",{"$f":"SQRT(F106^2+F34^2+F37^2)","v":6.4567793829431716E-2}]
[null,"I_R12","Current in R1, R2 Branch",{"$f":"D13*1000/(RpUVLO+D37)","v":10.186757215619695},"uA"]
[]
[null,"UVLO, OVLO set point calculations (TPS259563x)",null,null,null,null,null,null,null,null,null,"R2+R3"]
[null,"UVLO Set Point","Desired Undervoltage Threshold (VIN Rising)",{"$f":"D17","v":8},null,null,null,null,null,null,null,{"$f":"(OVref*D45)/(D43-OVref)","v":176.47058823529412}]
[null,"OVLO Set Point","Desired Over Voltage Lockout Set Point",{"$f":"D15","v":13.2},null,null,null,null,null,{"$f":"D52","v":7.3217194570135744},"Power Fail (VIN Falling)","R2"]
[null,"R1: Pullup at EN/OVLO Pin","Select a value > 100K to keep I_R123 low",1000,"kOhm",0.01,null,null,null,{"$f":"D51","v":7.9873303167420797},"Release UVLO (VIN Rising)",{"$f":"IF(D46>=10000,D46/100,IF(D46>=1000,D46/10,IF(D46>=100,D46,IF(D46>=10,D46*10,D46*100))))","v":695.18716577540101}]
[null,"R2_cal","Calculated value of Resistor at EN/OVLO pin",{"$f":"L43-D47","v":69.518716577540104},"kOhm",null,null,null,null,{"$f":"D54","v":12.097943925233645},"Release OVLO (VIN Falling)",{"$f":"INDEX('Res EIA Tables'!E$5:E$197,2+MATCH(L45,'Res EIA Tables'!E$5:E$197))","v":698}]
[null,"R3_cal","Calculated value of Resistor at EN/OVLO pin",{"$f":"(D45+L43)*OVref/D44","v":106.95187165775401},"kOhm",null,null,null,null,{"$f":"D53","v":13.197757009345793},"OV Cutoff (VIN Rising)","R3"]
[null,"SELECT THE VALUE OF RESISTORS AS CLOSEST AVAILABLE VALUE OF R2",null,null,null,null,null,null,null,null,null,{"$f":"IF(D47>=10000,D47/100,IF(D47>=1000,D47/10,IF(D47>=100,D47,IF(D47>=10,D47*10,D47*100))))","v":106.95187165775401}]
[null,"R2","Select the closest possible value as R2_cal",{"$f":"G49","v":69.8},"kOhm",0.01,{"$f":"L46*D46/L45","v":69.8},null,null,null,null,{"$f":"INDEX('Res EIA Tables'!E$5:E$197,2+MATCH(L48,'Res EIA Tables'!E$5:E$197))","v":107}]
[null,"R3","Select the closest possible value as R3_cal",{"$f":"G50","v":107},"kOhm",0.01,{"$f":"L49*D47/L48","v":107}]
[null,"UV_final_rising","Undervoltage Threshold (VIN Rising)",{"$f":"OVref*(D45+D49+D50)/(D49+D50)","v":7.9873303167420797},"V",{"$f":"SQRT(F107^2+F45^2+F49^2+F50^2)","v":3.4641016151377546E-2}]
[null,"UV_final_falling","Undervoltage Threshold (VIN Falling)",{"$f":"UVref*(D45+D49+D50)/(D49+D50)","v":7.3217194570135744},"V",{"$f":"SQRT(F106^2+F45^2+F49^2+F50^2)","v":6.5337584895678549E-2}]
[null,"OV_final_rising","Overvoltage Threshold (VIN Rising)",{"$f":"OVref*(D45+D49+D50)/(D50)","v":13.197757009345793},"V",{"$f":"SQRT(F107^2+F45^2+F49^2+F50^2)","v":3.4641016151377546E-2}]
[null,"OV_final_falling","Overvoltage Threshold (VIN Falling)",{"$f":"UVref*(D45+D49+D50)/(D50)","v":12.097943925233645},"V",{"$f":"SQRT(F106^2+F45^2+F49^2+F50^2)","v":6.5337584895678549E-2}]
[null,"I_R123","Current in R1, R2 and R3 Branch",{"$f":"D13*1000/(D45+D49+D50)","v":10.197144799456153},"uA"]
[]
[null,"Calculations for Ilimit (resistor on ILM Pin)"]
[null,"RILM_Cal","Calculated current limit resistor",{"$f":"903/(Ilimit-0.0112)","v":825.56226001097104},"Ohm",null,null,null,null,{"$f":"Icharge","v":0.20140909090909087},"Inrush Charging \nCurrent"]
[null,"SELECT A ILIMIT RESISTOR WITH THE CLOSEST AVAILABLE VALUE OF Rilm_Cal",null,null,null,null,null,null,null,{"$f":"Ilimit_final","v":1.079839053254438},"Overload Curr\nLimit",{"$f":"IF(D58>=10000,D58/100,IF(D58>=1000,D58/10,IF(D58>=100,D58,IF(D58>=10,D58*10,D58*100))))","v":825.56226001097104}]
[null,"RILM","Select the closest available value of RLM_cal",{"$f":"G60","v":845},"Ohm",0.01,{"$f":"L60*D58/L59","v":845},null,null,null,null,{"$f":"INDEX('Res EIA Tables'!E$5:E$197,2+MATCH(L59,'Res EIA Tables'!E$5:E$197))","v":845}]
[null,"Ilimit_final","Final current Limit Set Point",{"$f":"((903/RILM)+0.0112)","v":1.079839053254438},"A",{"$f":"SQRT(0.105^2+F60^2)","v":0.10547511554864492}]
[null,"Current Monitor Gain","Current Monitoring Voltage at ILM pin",{"$f":"GainIMON*RILM/10^3","v":553.98199999999997},"mV/A",{"$f":"SQRT(F108^2+F60^2)","v":3.8327535793473595E-2}]
[]
[null,"Calculations for SoftStart control (external cap on dVdt pin)"]
[null,"Parameter","Description","Value "," Units","Tolerance"]
[null,"I_dVdt","Internal current charging capacitor on dVdt",2.11,"uA",0.104]
[null,"Gain_dVdt","Internal Gain for dVdt Control",21,"V/V",0.03]
[null,"Icharge_fastest","Charging current when charging at fastest possible rate\nIf this current is < Ilimit, no capacitor is required at dVdT pin",{"$f":"MIN(Cout*(Vcc_max/D69)/1000, Ilimit_final)","v":1.079839053254438},"A"]
[null,"Tchg_fastest","when no external capacitor  is connected (max. slew rate)",0.21,"ms",0.15]
[null,"Tchg_req","The charging time required",5,"ms"]
[null,"Icharge_req","Charging (inrush) current desired in the system",1,"A"]
[null,"Cext_dvdt_cal1","calculated value of capacitor at dVdT pin for required Tcharge",{"$f":"IF(Tchg_req<D69,    0,  (I_dVdt*Gain_dVdt*Tchg_req/Vcc_max))","v":18.462499999999999},"nF"]
[null,"Cext_dvdt_cal2","calculated value of capacitor at dVdT pin for required Icharge",{"$f":"(I_dVdt*Gain_dVdt*Cout*0.001/Icharge_req)","v":4.4309999999999992},"nF",null,{"$f":"MAX(Cdvdt_ext_cal1,Cext_dvdt_cal2)","v":18.462499999999999}]
[null,"SELECT A CAPACITOR WITH THE CLOSEST POSSIBLE VALUE to max(Cext_dvdt_cal1, Cext_dvdt_cal2)"]
[null,"CdVdT_ext","The external capacitor connecetd across dVdT pin (OPEN, or >=1nF)",{"$f":"G75","v":22},"nF",0.1,{"$f":"IF(G73<1, \"OPEN\", IF(G73>1,    INDEX('Cap Tables'!B4:B75,1+MATCH(G73,'Cap Tables'!B4:B75)),     INDEX('Cap Tables'!A4:A75,1+MATCH(G73*10,'Cap Tables'!A4:A75))/10))","v":22}]
[null,"Icharge","Charging Current as per dVdT setting",{"$f":"IF(Cdvdt_ext=\"OPEN\",D68,Cout*0.000001*Gain_dVdt*I_dVdt*0.000001/(Cdvdt_ext*0.000000001))","v":0.20140909090909087},"A",{"$f":"SQRT(F78^2+F19^2)","v":0.17808986495586998}]
[null,"Does Device Enter Current Limit during start-up?",null,{"$f":"((Icharge+Vcc_max/Rlstart) >= Ilimit_final)","v":false},null,null,{"$f":"Cout*0.001*Rlstart*(Ilimit_final/Icharge -1+LN(Icharge/(Ilimit_final-Vcc_max/Rlstart)))","v":6.9866179797569679}]
[null,"Tchg_dVdT","Charging time set",{"$f":"IF(D77, G77, IF(Cdvdt_ext=\"OPEN\",D69,((Cdvdt_ext*Vcc_max)/(I_dVdt*Gain_dVdt))))","v":5.9580230196343944},"ms",{"$f":"SQRT(F75^2+F66^2+F67^2)","v":0.14736349615830918}]
[null,"Pd_Cout_startup","Power dissipation due to load cap at start-up",{"$f":"0.5*Vcc_max*Icharge","v":1.2084545454545452},"W"]
[]
{"$rows_left_out":29}
{"sheet":"Thermal Shutdown Limit Plot","index":1,"n_rows":74,"n_cols":13,"rows_kept":74,"cut":false,"hidden":false,"merged":[[45,0,45,1],[45,2,45,3],[45,4,45,5],[45,6,45,7],[8,0,8,1],[8,2,8,3],[8,4,8,5],[8,6,8,7]]}
[]
[null,"Pd (W)","Tstart (ms)"]
[null,{"$f":"'Calculation Sheet'!D83","v":2.4084545454545454},{"$f":"Tchg_dvdt","v":5.9580230196343944}]
[]
[]
[]
[]
["Thermal Shutdown Time (ms) Vs. Power Dissipation (W)",null,null,null,null,null,null,null,null,null,"Title of Graph",null,"Thermal Shutdown Time Vs. Power Dissipation"]
["-40 degC",null,"25 degC",null,"85 degC",null,"125 degC"]
["PD(W)","Time(ms)","PD(W)","Time(ms)","PD(W)","Time(ms)","PD(W)","Time(ms)",null,null,"Label","X-Axis "," Power Dissipation (W)"]
[4.6677672000000001,15610,3.3083904000000004,14720,1.931697,13390,0.98035890000000003,12240,null,null,null,"Y-Axis","Thermal Shutdown time (ms)"]
[4.8448399999999996,11100,3.4777304999999998,10400,2.0282184000000001,12320,1.0744271999999999,9459]
[5.12967,7707,3.6426454999999995,8109,2.1172004000000002,7698,1.3924799999999999,6395]
[5.2304863999999993,6703,4.008,4688,2.2043174999999997,5925,1.4789298,3656]
[5.6380618999999994,4820,4.2149956,4308,2.5954280000000001,4705,1.5936159999999999,2885]
[6.1074200000000003,4406,4.52956,3159,2.784465,3955,1.613016,1736]
[6.4708800000000002,3588,5.2935420000000004,2386,2.8101020000000001,3440,1.6613059999999999,1575]
[6.6616280000000003,3022,5.4131999999999998,1901,3.0081239999999996,2701,1.7863023,1023]
[7.0372570000000003,2052,5.5413559999999995,1811,3.0205350000000002,2447,1.9034899000000001,782.4]
[7.2235519999999998,1878,5.720923,1531,3.1549559999999999,1999,2.0597099999999999,616]
[7.6108510000000003,1362,5.8144589999999994,1351,3.36592,1573,2.231055,352.7]
[8.0334850000000007,1073,5.8617519999999992,1314,3.4024220000000001,1443,2.62676,241.5]
[8.4687570000000019,682.7,6.0683700000000007,1015,3.8137250000000003,954.4,3.000413,117.7]
[8.8463750000000019,627,6.2770799999999998,699.9,4.1537999999999995,717.2,3.0914520000000003,85.61]
[9.2627900000000007,487.8,6.6243239999999997,567.4,4.6304549999999995,416.1,3.3843150000000004,63.86]
[9.6714940000000009,373.4,7.0359600000000002,393.7,5.0058120000000006,287.10000000000002,3.5797500000000002,49.5]
[10.109862000000001,294.8,7.461530999999999,284.10000000000002,5.3967150000000004,182.5,3.6126450000000001,36.83]
[10.492485,231.3,7.8616999999999999,204.3,5.6366700000000005,113.4,3.85839,29.79]
[10.872640000000001,160.5,8.306855999999998,137,5.9868899999999998,70.94,4.1931449999999995,24.8]
[11.276704000000001,137.6,8.7628249999999994,103.6,6.3427559999999996,45.38,4.7593800000000002,16.079999999999998]
[11.63392,107.1,9.1480430000000013,69.180000000000007,6.8305499999999997,30.44]
[11.945050000000002,80.27,9.5026049999999991,42.12,7.2388350000000008,18.47]
[12.931856,21.37,9.9751699999999985,25.2,8.0070300000000003,12.7]
[14.02908,14.93,10.426212000000001,18.7,8.8393999999999995,7.9669999999999996]
[14.914695,12.43,11.508699999999999,12.24,10.00705,5.5789999999999997]
[16.083785000000002,9.9309999999999992,12.584540000000001,9.6120000000000001]
[16.928345000000004,8.5980000000000008,14.583699999999999,6.3479999999999999]
[]
[]
[]
[]
[]
[]
[]
["Thermal Shutdown Time (ms) Vs. Power Dissipation (W)",null,null,null,null,null,null,null,null,null,"Title of Graph",null,"Thermal Shutdown Time Vs. Power Dissipation"]
["-40 degC",null,"25 degC",null,"85 degC",null,"125 degC"]
["PD(W)","Time(ms)","PD(W)","Time(ms)","PD(W)","Time(ms)","PD(W)","Time(ms)",null,null,"Label","X-Axis "," Power Dissipation (W)"]
[4.4367456000000001,10220,3.0127229999999998,12550,1.6567191999999999,12250,0.97611998999999994,14270,null,null,null,"Y-Axis","Thermal Shutdown time (ms)"]
[4.8383284,6271,3.1977791999999998,8571,1.9570227,6781,1.1563899999999998,5134]
[5.0795795999999998,5204,3.3909883999999999,6326,2.1441411000000001,4497,1.3497736,2754]
[5.3401158999999998,3950,3.4986599999999997,5837,2.4442880000000002,2770,1.452135,2160]
[5.5776600000000007,3345,3.6847799999999999,4502,2.6650624000000001,2009,1.5454332,1665]
[5.8536960000000002,2739,3.8662080000000003,3797,2.9737149999999999,1491,1.6486350000000001,1367]
[6.1498799999999996,2244,4.1831831999999993,2905,3.2022349999999999,1204,1.7783250000000002,1098]
[6.4918946999999996,1841,4.4606718000000001,2289,3.4731099999999997,966.9,1.8389561999999999,884.8]
[6.8686199999999999,1446,4.6364831999999998,2062,3.6691250000000002,779.8,1.9777724999999999,733.5]
[7.3471349999999997,1263,4.8787313999999995,1568,3.9422410999999995,588.5,2.0649962000000004,617.79999999999995]
[7.9789079999999997,850.1,5.0785280000000004,1367,4.1498049999999997,500.9,2.1860625000000002,504.9]
[8.3596010000000014,703.1,5.3720238,1070,4.4162781999999998,395.4,2.2579199999999999,423.1]
[8.8874879999999994,507.4,5.5653324,909,4.6019199999999998,331.9,2.3589824999999998,362.5]
[9.2375860000000003,405.6,5.8613802000000002,722.5,4.8865850000000002,240.2,2.4408175000000001,302.3]
[9.7278599999999997,296.2,6.0658399999999997,646.4,5.0350884000000002,191,2.6762450000000002,226.1]
[10.187050000000001,234.5,6.3667640999999993,517.20000000000005,5.3552125000000004,141.1,2.9654885999999996,150]
[10.732150000000001,179.5,6.5465451999999997,452,5.5645625000000001,114.7,3.1980566999999995,116.6]
[11.16005,149.69999999999999,6.8925948000000004,371.1,5.8556735999999994,83.57,3.4799800000000003,81.760000000000005]
[11.739350000000002,113,6.893764,416.9,6.2304570999999997,68.45,3.6700620000000002,65.91]
[12.100409000000001,94.19,7.2891450000000004,317.5,6.3407375000000004,51.5,3.9801527999999999,47.85]
[12.70059,72.34,7.8638400000000006,209.2,6.8780928000000001,31.81,4.1687475000000003,39.369999999999997]
[13.185559,60.27,8.2324910000000013,161.6,7.8950625000000008,14.17,4.4374386000000001,30.12]
[13.743918000000001,46.93,8.7139640000000007,108.8,10.026432000000002,5.9219999999999997,4.8770609999999994,19.690000000000001]
[14.74545,37.35,9.1202280000000009,84.24,null,null,5.3843373999999997,11.66]
[15.708780000000001,26.15,9.7344299999999997,59.31,null,null,5.8052628000000004,8.3520000000000003]
[17.777279999999998,14.53,10.082848,47.06]
[19.778400000000001,9.6219999999999999,13.478809,9.9629999999999992]

{"sheet":"Res EIA Tables","index":2,"n_rows":197,"n_cols":7,"rows_kept":197,"cut":false,"hidden":false,"merged":[[176,4,177,4],[188,3,191,3],[188,4,189,4],[190,4,191,4],[192,3,195,3],[192,4,193,4],[194,4,195,4],[178,4,179,4],[180,1,195,1],[180,2,187,2],[180,3,183,3],[180,4,181,4],[182,4,183,4],[184,3,187,3],[184,4,185,4],[186,4,187,4],[188,2,195,2],[164,0,195,0],[164,1,179,1],[164,2,171,2],[164,3,167,3],[164,4,165,4],[148,1,163,1],[148,2,155,2],[148,3,151,3],[148,4,149,4],[150,4,151,4],[152,3,155,3],[152,4,153,4],[154,4,155,4],[156,2,163,2],[156,3,159,3],[166,4,167,4],[168,3,171,3],[168,4,169,4],[170,4,171,4],[172,2,179,2],[172,3,175,3],[172,4,173,4],[174,4,175,4],[176,3,179,3],[140,3,143,3],[140,4,141,4],[142,4,143,4],[144,3,147,3],[144,4,145,4],[146,4,147,4],[132,0,163,0],[132,1,147,1],[132,2,139,2],[132,3,135,3],[132,4,133,4],[134,4,135,4],[136,3,139,3],[136,4,137,4],[138,4,139,4],[140,2,147,2],[156,4,157,4],[158,4,159,4],[160,3,163,3],[160,4,161,4],[162,4,163,4],[112,4,113,4],[124,3,127,3],[124,4,125,4],[126,4,127,4],[128,3,131,3],[128,4,129,4],[130,4,131,4],[114,4,115,4],[116,1,131,1],[116,2,123,2],[116,3,119,3],[116,4,117,4],[118,4,119,4],[120,3,123,3],[120,4,121,4],[122,4,123,4],[124,2,131,2],[100,0,131,0],[100,1,115,1],[100,2,107,2],[100,3,103,3],[100,4,101,4],[84,1,99,1],[84,2,91,2],[84,3,87,3],[84,4,85,4],[86,4,87,4],[88,3,91,3],[88,4,89,4],[90,4,91,4],[92,2,99,2],[92,3,95,3],[102,4,103,4],[104,3,107,3],[104,4,105,4],[106,4,107,4],[108,2,115,2],[108,3,111,3],[108,4,109,4],[110,4,111,4],[112,3,115,3],[76,3,79,3],[76,4,77,4],[78,4,79,4],[80,3,83,3],[80,4,81,4],[82,4,83,4],[68,0,99,0],[68,1,83,1],[68,2,75,2],[68,3,71,3],[68,4,69,4],[70,4,71,4],[72,3,75,3],[72,4,73,4],[74,4,75,4],[76,2,83,2],[92,4,93,4],[94,4,95,4],[96,3,99,3],[96,4,97,4],[98,4,99,4],[48,4,49,4],[60,3,63,3],[60,4,61,4],[62,4,63,4],[64,3,67,3],[64,4,65,4],[66,4,67,4],[50,4,51,4],[52,1,67,1],[52,2,59,2],[52,3,55,3],[52,4,53,4],[54,4,55,4],[56,3,59,3],[56,4,57,4],[58,4,59,4],[60,2,67,2],[36,0,67,0],[36,1,51,1],[36,2,43,2],[36,3,39,3],[36,4,37,4],[20,1,35,1],[20,2,27,2],[20,3,23,3],[20,4,21,4],[22,4,23,4],[24,3,27,3],[24,4,25,4],[26,4,27,4],[28,2,35,2],[28,3,31,3],[38,4,39,4],[40,3,43,3],[40,4,41,4],[42,4,43,4],[44,2,51,2],[44,3,47,3],[44,4,45,4],[46,4,47,4],[48,3,51,3],[12,2,19,2],[12,3,15,3],[12,4,13,4],[14,4,15,4],[16,3,19,3],[16,4,17,4],[18,4,19,4],[0,0,0,5],[4,0,35,0],[4,1,19,1],[4,2,11,2],[4,3,7,3],[4,4,5,4],[6,4,7,4],[8,3,11,3],[8,4,9,4],[10,4,11,4],[28,4,29,4],[30,4,31,4],[32,3,35,3],[32,4,33,4],[34,4,35,4]]}
["Standard EIA Decade Resistor Values"]
[]
[0.2,0.1,0.05,0.02,0.01,"0.5%, 0.25%, 0.1%"]
["E6","E12","E24","E48","E96","E192"]
[100,100,100,100,100,100]
[null,null,null,null,null,101]
[null,null,null,null,102,102]
[null,null,null,null,null,104]
[null,null,null,105,105,105]
[null,null,null,null,null,106]
[null,null,null,null,107,107]
[null,null,null,null,null,109]
[null,null,110,110,110,110]
[null,null,null,null,null,111]
[null,null,null,null,113,113]
[null,null,null,null,null,114]
[null,null,null,115,115,115]
[null,null,null,null,null,117]
[null,null,null,null,118,118]
[null,null,null,null,null,120]
[null,120,120,121,121,121]
[null,null,null,null,null,123]
[null,null,null,null,124,124]
[null,null,null,null,null,126]
[null,null,null,127,127,127]
[null,null,null,null,null,129]
[null,null,null,null,130,130]
[null,null,null,null,null,132]
[null,null,130,133,133,133]
[null,null,null,null,null,135]
[null,null,null,null,137,137]
[null,null,null,null,null,138]
[null,null,null,140,140,140]
[null,null,null,null,null,142]
[null,null,null,null,143,143]
[null,null,null,null,null,145]
[150,150,150,147,147,147]
[null,null,null,null,null,149]
[null,null,null,null,150,150]
[null,null,null,null,null,152]
[null,null,null,154,154,154]
[null,null,null,null,null,156]
[null,null,null,null,158,158]
[null,null,null,null,null,160]
[null,null,160,162,162,162]
[null,null,null,null,null,164]
[null,null,null,null,165,165]
[null,null,null,null,null,167]
[null,null,null,169,169,169]
[null,null,null,null,null,172]
[null,null,null,null,174,174]
[null,null,null,null,null,176]
[null,180,180,178,178,178]
[null,null,null,null,null,180]
[null,null,null,null,182,182]
[null,null,null,null,null,184]
[null,null,null,187,187,187]
[null,null,null,null,null,189]
[null,null,null,null,191,191]
[null,null,null,null,null,193]
[null,null,200,196,196,196]
[null,null,null,null,null,198]
[null,null,null,null,200,200]
[null,null,null,null,null,203]
[null,null,null,205,205,205]
[null,null,null,null,null,208]
[null,null,null,null,210,210]
[null,null,null,null,null,213]
[220,220,220,215,215,215]
[null,null,null,null,null,218]
[null,null,null,null,221,221]
[null,null,null,null,null,223]
[null,null,null,226,226,226]
[null,null,null,null,null,229]
[null,null,null,null,232,232]
[null,null,null,null,null,234]
[null,null,240,237,237,237]
[null,null,null,null,null,240]
[null,null,null,null,243,243]
[null,null,null,null,null,246]
{"$rows_left_out":118}
{"sheet":"Cap Tables","index":3,"n_rows":75,"n_cols":4,"rows_kept":75,"cut":false,"hidden":false,"merged":[]}
["Standard Capacitor Values"]
[]
["pF","nF","µF","mF"]
[1,1,1,1]
[1.1000000000000001,1.1000000000000001]
[1.2,1.2]
[1.3,1.3]
[1.5,1.5,1.5,1.5]
[1.6,1.6]
[1.8,1.8]
[2,2]
[2.2000000000000002,2.2000000000000002,2.2000000000000002,2.2000000000000002]
[2.4,2.4]
[2.7,2.7]
[3,3]
[3.3,3.3,3.3,3.3]
[3.6,3.6,{"$f":"C18","v":4.7}]
[3.9,3.9,{"$f":"C19","v":4.7}]
[4.3,4.3,{"$f":"C20","v":4.7}]
[4.7,4.7,4.7,4.7]
[5.0999999999999996,5.0999999999999996,{"$f":"C22","v":6.8}]
[5.6,5.6,{"$f":"C23","v":6.8}]
[6.2,6.2,{"$f":"C24","v":6.8}]
[6.8,6.8,6.8,6.8]
[7.5,7.5,{"$f":"C26","v":10}]
[8.1999999999999993,8.1999999999999993,{"$f":"C27","v":10}]
[9.1,9.1,{"$f":"C28","v":10}]
[10,10,10,10]
[11,{"$f":"B30","v":15},15]
[12,15,15]
[13,15,15]
[15,15,15]
[16,{"$f":"B34","v":22},22]
[18,22,22]
[20,22,22]
[22,22,22]
[24,{"$f":"B38","v":33},33]
[27,33,33]
[30,33,33]
[33,33,33]
[36,{"$f":"B42","v":47},47]
[39,47,47]
[43,47,47]
[47,47,47]
[51,{"$f":"B46","v":68},68]
[56,68,68]
[62,68,68]
[68,68,68]
[75,{"$f":"B50","v":100},100]
[82,100,100]
[91,100,100]
[100,100,100]
[110,{"$f":"B54","v":150},150]
[120,150,150]
[130,150,150]
[150,150,150]
[160,{"$f":"B58","v":220},220]
[180,220,220]
[200,220,220]
[220,220,220]
[240,{"$f":"B62","v":330},330]
[270,330,330]
[300,330,330]
[330,330,330]
[360,{"$f":"B66","v":470},470]
[390,470,470]
[430,470,470]
[470,470,470]
[510,{"$f":"B70","v":680},680]
[560,680,680]
[620,680,680]
[680,680,680]
[750,{"$f":"B74","v":1000},{"$f":"C74","v":1000}]
[820,{"$f":"B75","v":1000},{"$f":"C75","v":1000}]
[910,1000,1000]