{"text_format":"1","workbook":"xlsx","n_sheets":6,"sheets":["Calculation Sheet","TSD Plot-22x23x24x Variants","TSD Plot-27x Variant","Res EIA Tables","Cap Tables","Nretry"],"not_rendered":{"charts":4,"images":1,"macros":0,"external_links":0,"defined_names":41,"comments":1,"pivot_tables":0},"unopened":[],"bounds":{"document_bytes":16777216,"sheet_cells":100000,"rows_first":2000,"rows_last":500,"rows_between":2000,"halvings":0,"cell_chars":16384,"cell_head_chars":4096},"cells_cut":0,"cells_raw":0,"read":"whole","date_system":"1900"}

{"sheet":"Calculation Sheet","index":0,"n_rows":133,"n_cols":28,"rows_kept":133,"cut":false,"hidden":false,"merged":[[106,6,106,7],[104,6,104,7],[105,6,105,7],[96,6,96,7],[97,6,97,7],[98,6,98,7],[99,6,100,7],[103,6,103,7],[95,6,95,7],[78,1,78,4],[83,1,83,4],[0,1,0,2],[40,1,40,2],[73,1,73,4],[67,1,67,4],[52,1,52,2],[46,1,46,4],[71,3,71,9],[50,1,50,2],[22,1,22,5],[28,1,28,2],[99,8,100,8],[99,9,100,9],[101,6,102,7],[101,8,102,8],[101,9,102,9]]}
[null,"TPS25983 Design Calculation Tool",null,null,null,null,null,null,null,null,null,null,null,null,null,null,null,null,null,null,null,null,null,null,null,null,"Yes",4]
[null,"Constants Cells","Input/SelectCells","Calculation Cells",null,null,"Recommended",null,null,null,null,null,null,null,null,null,null,null,null,null,null,null,null,null,null,null,"No",16]
[null,"Error Cells, Must be Fixed","Calculated, but can be over-ridden by user",null,null,null,"Value",null,null,null,null,null,null,null,null,null,null,null,null,null,null,null,null,null,null,null,"Auto-Retry",64]
[null,"Parameter","Description","Value "," Units","Tolerance",null,null,null,null,null,null,null,null,null,null,null,null,null,null,null,null,null,null,null,null,"Latch-off",256]
[null,"VIN (nom)","Nominal operating input voltage",18,"V",null,null,null,null,null,null,null,null,null,null,null,null,null,null,null,null,null,null,null,null,null,null,"Infinite"]
[null,"VIN (max)","Maximum Operating input voltage (magnitude)",25,"V",null,{"$f":"IF(RIGHT(#REF!,2)=\"7L\",24,(IF(RIGHT(#REF!,2)=\"7O\",24,#REF!)))","v":{"$error":"#REF!"}}]
[null,"OVLOset","Overvoltage Threshold (VIN Rising)",26,"V"]
[null,"UVLOset","Undervoltage Threshold (VIN Rising)",4,"V"]
[null,"VUVP","Internal IN Undervoltage Protection Threshold (VIN Rising)",2.5299999999999998,"V",2.7E-2]
[null,"Cout","Load Capacitance",1500,"uF",0.1]
[null,"Rlstart","Load at start-up (assumed to be resistive), Refer to Section 9.2.2.5.2 in Datasheet",20,"Ohm",null,{"$f":"Vcc_nom/Imax","v":1}]
[null,"Imax","Maximum continuous load current (magnitude)",18,"A"]
[null,"Ilimit","Set current Limit 20% (typical) higher than maximum continuous load current",{"$f":"Imax*1.2","v":21.599999999999998},"A"]
[null,"TA(max)","Max Ambient Temperature ",70,"degC"]
[null,null,"Do you need to be immue to line transient due to adjacent card “hot-swap events”","No"]
[null,"tITIMER","Enter the time interval to support load transient currents",2000,"us"]
[null,null,"Fault Response","Auto-Retry"]
[null,"tRETRY_DLY","Time delay between retries",100,"ms"]
[null,"NRETRY","Number of retries",4]
[null,"Rec_VIMONMax","Recommended maximum IMON voltage",{"$f":"IF(Vcc_nom<5, IF(Vcc_nom<3.3, 1, 1.8), 3.3)","v":3.3},"V"]
[null,"VIMON-Max","Enter current monitor (IMON) full-scale voltage range",2,"V"]
[]
[null,"UVLO, OVLO set point calculations ",null,null,null,null,null,null,null,null,null,{"$f":"IF(D24>=100,D24,IF(D24>=10,D24*10,D24*100))","v":400},null,null,null,{"$f":"(OVref*D26)/(D24-OVref)","v":213.85714285714286}]
[null,"UVLO Set Point","Desired Undervoltage Threshold (VIN Rising)",{"$f":"UVset","v":4},null,null,null,null,null,{"$f":"D29","v":0},"Power Fail \n(VIN Falling)",{"$f":"IF(D25>=100,D25,IF(D25>=10,D25*10,D25*100))","v":260}]
[null,"OVLO Set Point","Desired Over Voltage Lockout Set Point",{"$f":"D7","v":26},null,null,null,null,null,{"$f":"D28","v":32.901098901098905},"Release UVLO (VIN Rising)"]
[null,"R1: Pullup at EN/OVLO Pin"," Value > 350K recommended",499,"kOhm",0.01,null,null,null,{"$f":" IF(#REF!=\"No Clamp\",\"NoClamp\",#REF!)","v":{"$error":"#REF!"}},"OV Cut-off\n(VIN Rising)",{"$f":"INDEX('Res EIA Tables'!E$5:E$197,2+MATCH(L24,'Res EIA Tables'!E$5:E$197))","v":261}]
[null,"R2_cal","Calculated value of Resistor at EN/OVLO pin",{"$f":"P23-D28","v":180.95604395604397},"kOhm"]
[null,"R3_cal","Calculated value of Resistor at EN/OVLO pin",{"$f":"(D26+P23)*OVref/D25","v":32.901098901098905},"kOhm"]
[null,"SELECT THE VALUE OF RESISTORS AS CLOSEST AVAILABLE VALUE OF R2 & R3"]
[null,"R2","Select the closest possible value as R2_cal",{"$f":"G30","v":181.99999999999997},"kOhm",0.01,{"$f":"L42/L41*D27","v":181.99999999999997}]
[null,"R3","Select the closest possible value as R3_cal",{"$f":"G31","v":33.199999999999996},"kOhm",0.01,{"$f":"L44/L43*D28","v":33.199999999999996}]
[null,"UV_final_rising","Undervoltage Threshold (VIN Rising)",{"$f":"OVref*(D26+D30+D31)/(D30+D31)","v":3.9825278810408933},"V"]
[null,"UV_final_falling","Undervoltage Threshold (VIN Falling)",{"$f":"UVref*(D26+D30+D31)/(D30+D31)","v":3.650650557620819},"V"]
[null,"OV_final_rising","Overvoltage Threshold (VIN Rising)",{"$f":"OVref*(D26+D30+D31)/(D31)","v":25.814457831325306},"V"]
[null,"OV_final_falling","Overvoltage Threshold (VIN Falling)",{"$f":"UVref*(D26+D30+D31)/(D31)","v":23.663253012048198},"V"]
[null,"I_R123","Current in R1, R2 and R3 Branch",{"$f":"D6*1000/(D26+D30+D31)","v":35.004200504060485},"uA"]
[]
[]
[]
[]
[null,"Calculations for Ilimit (resistor on ILIM Pin)",null,null,null,null,null,null,null,{"$f":"Icharge","v":0.91999999999999993},"Inrush Charging \nCurrent",{"$f":"IF(D27>=10000,D27/100,IF(D27>=1000,D27/10,IF(D27>=100,D27,IF(D27>=10,D27*10,D27*100))))","v":180.95604395604397}]
[null,"RILIM_Cal","Calculated current limit resistor",{"$f":"1460/(Ilimit-0.11)","v":67.93857608189856},"Ohm",null,null,null,null,{"$f":"Ilimit_final","v":11.929499999999999},"Overload Curr\nLimit",{"$f":"INDEX('Res EIA Tables'!E$5:E$197,2+MATCH(L41,'Res EIA Tables'!E$5:E$197))","v":182}]
[null,"SELECT A ILIMIT RESISTOR WITH THE CLOSEST AVAILABLE VALUE OF Rilim_Cal",null,null,null,null,null,null,null,null,null,{"$f":"IF(D28>=10000,D28/100,IF(D28>=1000,D28/10,IF(D28>=100,D28,IF(D28>=10,D28*10,D28*100))))","v":329.01098901098908}]
[null,"RILIM","Select the closest available value of RILIM_cal",{"$f":"G44","v":123.52468378527011},"Ohm",0.01,{"$f":"L43*D42/L41","v":123.52468378527011},null,null,null,null,{"$f":"INDEX('Res EIA Tables'!E$5:E$197,2+MATCH(L43,'Res EIA Tables'!E$5:E$197))","v":332}]
[null,"Ilimit_final","Final current Limit Set Point",{"$f":"((1460/RILIM)+0.11)","v":11.929499999999999},"A",{"$f":"SQRT(((27.875*((1460/D44)+0.11)^-0.459)/100)^2+F44^2)","v":8.989777845511765E-2},{"$f":"((1460/G44)+0.11)*(100-(27.875*((1460/G44)+0.11)^-0.459))/100","v":10.863720141041618},"A"]
[]
[null,"Calculations for CURRENT MONITOR",null,null,null,null,null,null,null,null,null,{"$f":"IF(G48>=100,G48,IF(G48>=10,G48*10,G48*100))","v":681.51065013730749}]
[null,"RIMON_max","Maximum allowed resistance at IMON pin",{"$f":"Vimon_max/(Ilimit_final*246*10^-6)","v":681.51065013730749},"Ohm",null,{"$f":"D48","v":681.51065013730749},null,null,null,null,{"$f":"IF(L47>1000,INDEX('Res EIA Tables'!E$5:E$197,MATCH(L47/10,'Res EIA Tables'!E$5:E$197))*10,INDEX('Res EIA Tables'!E$5:E$197,MATCH(L47,'Res EIA Tables'!E$5:E$197)))","v":681}]
[null,"RIMON_sel","Resistor value selected at IMON pin",{"$f":"G49","v":681},"Ohm",0.01,{"$f":"L48*G48/L47","v":681}]
[null,"VIMON_final","Maximum voltage at IMON for maximum load current",{"$f":"(Ilimit_final*RMON_sel*246*10^-6)","v":1.9985014169999997},"V",{"$f":"SQRT(F129^2+F49^2)","v":3.1622776601683791E-2}]
[null,"The range of voltage output at IMON pin will be from 0V to VMON_imax",null,{"$f":"IF(D50>D21,\"VIMON is Outside limits of uC interface\", \"VIMON is Within Limits\")","v":"VIMON is Within Limits"}]
[]
[null,"Calculations for SoftStart control (external cap on dVdt pin)"]
[null,"Parameter","Description","Value "," Units","Tolerance"]
[null,"Tchg_fastest","When no external capacitor  is connected (max. slew rate)",{"$f":"Vcc_nom/7.35","v":2.4489795918367347},"ms",0.15]
[null,"Icharge_fastest","Charging current when charging at fastest possible rate\nIf this current is < Ilimit, no capacitor is required at dVdT pin",{"$f":"MIN(Cout*(Vcc_nom/D55)/1000, Ilimit_final)","v":11.025},"A"]
[null,"Tchg_req","The charging time required",20,"ms"]
[null,"Icharge_req","Charging (inrush) current desired in the system",1,"A"]
[null,"Cext_dvdt_cal1","Calculated value of capacitor at dVdT pin for required Tcharge",{"$f":"IF(Tchg_req<Tchg_fastest,    0,  (4600*Tchg_req/Vcc_nom)/1000)","v":5.1111111111111116},"nF"]
[null,"Cext_dvdt_cal2","Calculated value of capacitor at dVdT pin for required Icharge",{"$f":"(4600*(Cout/1000)/Icharge_req)/1000","v":6.9},"nF",null,{"$f":"MAX(Cdvdt_ext_cal1,Cext_dvdt_cal2)","v":6.9}]
[null,"SELECT A CAPACITOR WITH THE CLOSEST POSSIBLE VALUE to max(Cext_dvdt_cal1, Cext_dvdt_cal2)"]
[null,"CdVdT_ext","The external capacitor connecetd across dVdT pin ",{"$f":"G62","v":7.5},"nF",0.1,{"$f":"IF(G60>1,    INDEX('Cap Tables'!B4:B75,1+MATCH(G60,'Cap Tables'!B4:B75)),     INDEX('Cap Tables'!A4:A75,1+MATCH(G60*10,'Cap Tables'!A4:A75))/10)","v":7.5}]
[null,"Icharge","Charging Current as per dVdT setting",{"$f":"(Cout/1000)*(4600/(Cdvdt_ext*1000))","v":0.91999999999999993},"A",{"$f":"SQRT(F55^2+F62^2)","v":0.18027756377319948}]
[null,"Does Device Enter Current Limit during start-up?",null,{"$f":"((Icharge+Vcc_nom/Rlstart) >= Ilimit_final)","v":false},null,null,{"$f":"Cout*0.001*Rlstart*(Ilimit_final/Icharge -1+LN(Icharge/(Ilimit_final-Vcc_nom/Rlstart)))","v":284.48678147476971}]
[null,"Tchg_dVdT","Charging time set",{"$f":"IF(D64, G64, ((Cdvdt_ext*1000*Vcc_nom)/(4600)))","v":29.347826086956523},"ms",{"$f":"SQRT(F62^2+F55^2)","v":0.18027756377319948}]
[null,"Pd_Cout_startup","Power dissipation due to load cap at start-up",{"$f":"0.5*Vcc_nom*Icharge","v":8.2799999999999994},"W"]
[]
[null,"Total Power dissipation at Start-up"]
[null,"Pd_Rlstart","Power dissipation due to load resistance at start-up",{"$f":"(1/6)*(Vcc_nom^2)/Rlstart","v":2.7},"W"]
[null,"Pd_startup","Total power dissipation at start-up",{"$f":"D66+D69","v":10.98},"W",null,null,null,null,null,null,{"$f":"60.095*D65^(-0.567)","v":8.8455080758153741}]
[null,null,"Max power dissipation allowed for glitch-free startup for the programmed startup time (20% margin)",{"$f":"G71*0.8","v":5.0074963020785273},"W",0.2,{"$f":"L71","v":6.2593703775981586},null,null,null,null,{"$f":"54.239*D65^(-0.639)","v":6.2593703775981586}]
[null,null,"Will the system have glitch-free startup?\nLook at Thermal Shutdown Limit Plot Tab",{"$f":"IF(D70<(D71),\"YES\",\"NO, Increase Rlstart and/or Tchg_req; and/or Reduce Cout\")","v":"NO, Increase Rlstart and/or Tchg_req; and/or Reduce Cout"}]
[]
[null,"Steady state Voltage drop & Power dissipation"]
[null,"Parameter","Description","Value "," Units","Tolerance"]
[null,"Vdrop","Maximum voltage drop across device @ 25 degC",{"$f":"Imax*Rdson_25deg","v":57.6},"mV"]
[null,"Pdiss_Imax","Steady state power dissipation with Max current @ 25degC ",{"$f":"Imax^2*Rdson_25deg","v":1036.8},"mW"]
[]
[null,"Calculations for Transient Overcurrent Blanking Interval"]
[null,"Citimer_cal","Calculated value of capacitor at ITIMER pin",{"$f":"tITIMER/470","v":4.2553191489361701},"nF",null,{"$f":"D80","v":4.2553191489361701}]
{"$rows_left_out":54}
{"sheet":"TSD Plot-22x23x24x Variants","index":1,"n_rows":29,"n_cols":6,"rows_kept":29,"cut":false,"hidden":true,"merged":[]}
["Thermal Shutdown Time (ms) Vs. Power Dissipation (W)",null,null,"Title of Graph",null,"Thermal Shutdown Time Vs. Power Dissipation during Inrush/Overload"]
["Power Dissipation ","TSD time for 22x,23x,24x Variants"]
[3.8312999999999997,146,null,"Lable","X-Axis "," Power Dissipation (W) during Inrush/Overload"]
[4.2957000000000001,108,null,null,"Y-Axis","Time to Thermal Shutdown (ms)"]
[4.6520000000000001,95.04]
[5.43,74.319999999999993]
[7.3120000000000003,38.96]
[9.2850000000000001,24.81]
[11.321999999999999,17.16]
[13.5,13.66]
[19.389299999999999,6.93]
[20.82,6.0259999999999998]
[22.192,5.5460000000000003]
[25.722000000000001,4.2549999999999999]
[29.36,3.2909999999999999]
[40.031999999999996,1.9910000000000001]
[57.707999999999998,1.1299999999999999]
[79.844999999999999,0.76800000000000002]
[]
[]
[]
[]
[]
[]
[]
[]
[]
["Pd (W)","Tstart (ms)"]
[{"$f":"'Calculation Sheet'!D70","v":10.98},{"$f":"Tchg_dvdt","v":29.347826086956523}]

{"sheet":"TSD Plot-27x Variant","index":2,"n_rows":29,"n_cols":6,"rows_kept":29,"cut":false,"hidden":true,"merged":[]}
["Thermal Shutdown Time (ms) Vs. Power Dissipation (W)",null,null,"Title of Graph",null,"Thermal Shutdown Time Vs. Power Dissipation during Inrush/Overload"]
["Power Dissipation "," TSD time for           27x Variant"]
[2.8855,98.35,{"$f":" 54.239*B3^(-0.639)","v":2.8902063782515888},"Lable","X-Axis "," Power Dissipation (W) during Inrush/Overload"]
[3.9312450000000001,61.89,{"$f":" 54.239*B4^(-0.639)","v":3.8856724258093225},null,"Y-Axis","Time to Thermal Shutdown (ms)"]
[5.9875200000000008,29.747,6.2055672442659722]
[8.1839999999999993,18.239000000000001,8.4826592169500703]
[17.447399999999998,6.1,17.079923033253277]
[18.356249999999999,5.43,18.398168107666365]
[28.58878,3.03,26.709750687033303]
[33.062400000000004,2.4,30.999642858178749]
[37.787609999999994,1.6539999999999999,39.324887244034052]
[45.358600000000003,1.3560000000000001,44.647560277217927]
[59.327999999999996,0.78800000000000003,63.158443841845688]
[80,0.53800000000000003,80.601254201987558]
[]
[]
[]
[]
[]
[]
[]
[]
[]
[]
[]
[]
[]
["Pd (W)","Tstart (ms)"]
[{"$f":"'Calculation Sheet'!D70","v":10.98},{"$f":"Tchg_dvdt","v":29.347826086956523}]

{"sheet":"Res EIA Tables","index":3,"n_rows":197,"n_cols":7,"rows_kept":197,"cut":false,"hidden":false,"merged":[[176,4,177,4],[188,3,191,3],[188,4,189,4],[190,4,191,4],[192,3,195,3],[192,4,193,4],[194,4,195,4],[178,4,179,4],[180,1,195,1],[180,2,187,2],[180,3,183,3],[180,4,181,4],[182,4,183,4],[184,3,187,3],[184,4,185,4],[186,4,187,4],[188,2,195,2],[164,0,195,0],[164,1,179,1],[164,2,171,2],[164,3,167,3],[164,4,165,4],[148,1,163,1],[148,2,155,2],[148,3,151,3],[148,4,149,4],[150,4,151,4],[152,3,155,3],[152,4,153,4],[154,4,155,4],[156,2,163,2],[156,3,159,3],[166,4,167,4],[168,3,171,3],[168,4,169,4],[170,4,171,4],[172,2,179,2],[172,3,175,3],[172,4,173,4],[174,4,175,4],[176,3,179,3],[140,3,143,3],[140,4,141,4],[142,4,143,4],[144,3,147,3],[144,4,145,4],[146,4,147,4],[132,0,163,0],[132,1,147,1],[132,2,139,2],[132,3,135,3],[132,4,133,4],[134,4,135,4],[136,3,139,3],[136,4,137,4],[138,4,139,4],[140,2,147,2],[156,4,157,4],[158,4,159,4],[160,3,163,3],[160,4,161,4],[162,4,163,4],[112,4,113,4],[124,3,127,3],[124,4,125,4],[126,4,127,4],[128,3,131,3],[128,4,129,4],[130,4,131,4],[114,4,115,4],[116,1,131,1],[116,2,123,2],[116,3,119,3],[116,4,117,4],[118,4,119,4],[120,3,123,3],[120,4,121,4],[122,4,123,4],[124,2,131,2],[100,0,131,0],[100,1,115,1],[100,2,107,2],[100,3,103,3],[100,4,101,4],[84,1,99,1],[84,2,91,2],[84,3,87,3],[84,4,85,4],[86,4,87,4],[88,3,91,3],[88,4,89,4],[90,4,91,4],[92,2,99,2],[92,3,95,3],[102,4,103,4],[104,3,107,3],[104,4,105,4],[106,4,107,4],[108,2,115,2],[108,3,111,3],[108,4,109,4],[110,4,111,4],[112,3,115,3],[76,3,79,3],[76,4,77,4],[78,4,79,4],[80,3,83,3],[80,4,81,4],[82,4,83,4],[68,0,99,0],[68,1,83,1],[68,2,75,2],[68,3,71,3],[68,4,69,4],[70,4,71,4],[72,3,75,3],[72,4,73,4],[74,4,75,4],[76,2,83,2],[92,4,93,4],[94,4,95,4],[96,3,99,3],[96,4,97,4],[98,4,99,4],[48,4,49,4],[60,3,63,3],[60,4,61,4],[62,4,63,4],[64,3,67,3],[64,4,65,4],[66,4,67,4],[50,4,51,4],[52,1,67,1],[52,2,59,2],[52,3,55,3],[52,4,53,4],[54,4,55,4],[56,3,59,3],[56,4,57,4],[58,4,59,4],[60,2,67,2],[36,0,67,0],[36,1,51,1],[36,2,43,2],[36,3,39,3],[36,4,37,4],[20,1,35,1],[20,2,27,2],[20,3,23,3],[20,4,21,4],[22,4,23,4],[24,3,27,3],[24,4,25,4],[26,4,27,4],[28,2,35,2],[28,3,31,3],[38,4,39,4],[40,3,43,3],[40,4,41,4],[42,4,43,4],[44,2,51,2],[44,3,47,3],[44,4,45,4],[46,4,47,4],[48,3,51,3],[12,2,19,2],[12,3,15,3],[12,4,13,4],[14,4,15,4],[16,3,19,3],[16,4,17,4],[18,4,19,4],[0,0,0,5],[4,0,35,0],[4,1,19,1],[4,2,11,2],[4,3,7,3],[4,4,5,4],[6,4,7,4],[8,3,11,3],[8,4,9,4],[10,4,11,4],[28,4,29,4],[30,4,31,4],[32,3,35,3],[32,4,33,4],[34,4,35,4]]}
["Standard EIA Decade Resistor Values"]
[]
[0.2,0.1,0.05,0.02,0.01,"0.5%, 0.25%, 0.1%"]
["E6","E12","E24","E48","E96","E192"]
[100,100,100,100,100,100]
[null,null,null,null,null,101]
[null,null,null,null,102,102]
[null,null,null,null,null,104]
[null,null,null,105,105,105]
[null,null,null,null,null,106]
[null,null,null,null,107,107]
[null,null,null,null,null,109]
[null,null,110,110,110,110]
[null,null,null,null,null,111]
[null,null,null,null,113,113]
[null,null,null,null,null,114]
[null,null,null,115,115,115]
[null,null,null,null,null,117]
[null,null,null,null,118,118]
[null,null,null,null,null,120]
[null,120,120,121,121,121]
[null,null,null,null,null,123]
[null,null,null,null,124,124]
[null,null,null,null,null,126]
[null,null,null,127,127,127]
[null,null,null,null,null,129]
[null,null,null,null,130,130]
[null,null,null,null,null,132]
[null,null,130,133,133,133]
[null,null,null,null,null,135]
[null,null,null,null,137,137]
[null,null,null,null,null,138]
[null,null,null,140,140,140]
[null,null,null,null,null,142]
[null,null,null,null,143,143]
[null,null,null,null,null,145]
[150,150,150,147,147,147]
[null,null,null,null,null,149]
[null,null,null,null,150,150]
[null,null,null,null,null,152]
[null,null,null,154,154,154]
[null,null,null,null,null,156]
[null,null,null,null,158,158]
[null,null,null,null,null,160]
[null,null,160,162,162,162]
[null,null,null,null,null,164]
[null,null,null,null,165,165]
[null,null,null,null,null,167]
[null,null,null,169,169,169]
[null,null,null,null,null,172]
[null,null,null,null,174,174]
[null,null,null,null,null,176]
[null,180,180,178,178,178]
[null,null,null,null,null,180]
[null,null,null,null,182,182]
[null,null,null,null,null,184]
[null,null,null,187,187,187]
[null,null,null,null,null,189]
[null,null,null,null,191,191]
[null,null,null,null,null,193]
[null,null,200,196,196,196]
[null,null,null,null,null,198]
[null,null,null,null,200,200]
[null,null,null,null,null,203]
[null,null,null,205,205,205]
[null,null,null,null,null,208]
[null,null,null,null,210,210]
[null,null,null,null,null,213]
[220,220,220,215,215,215]
[null,null,null,null,null,218]
[null,null,null,null,221,221]
[null,null,null,null,null,223]
[null,null,null,226,226,226]
[null,null,null,null,null,229]
[null,null,null,null,232,232]
[null,null,null,null,null,234]
[null,null,240,237,237,237]
[null,null,null,null,null,240]
[null,null,null,null,243,243]
[null,null,null,null,null,246]
{"$rows_left_out":118}
{"sheet":"Cap Tables","index":4,"n_rows":75,"n_cols":4,"rows_kept":75,"cut":false,"hidden":false,"merged":[]}
["Standard Capacitor Values"]
[]
["pF","nF","µF","mF"]
[1,1,1,1]
[1.1000000000000001,1.1000000000000001,1]
[1.2,1.2,1]
[1.3,1.3,1]
[1.5,1.5,1.5,1.5]
[1.6,1.6,1.5]
[1.8,1.8,1.5]
[2,2,1.5]
[2.2000000000000002,2.2000000000000002,2.2000000000000002,2.2000000000000002]
[2.4,2.4,2.2000000000000002]
[2.7,2.7,2.2000000000000002]
[3,3,2.2000000000000002]
[3.3,3.3,3.3,3.3]
[3.6,3.6,{"$f":"C18","v":4.7}]
[3.9,3.9,4.7]
[4.3,4.3,{"$f":"C20","v":4.7}]
[4.7,4.7,4.7,4.7]
[5.0999999999999996,5.0999999999999996,{"$f":"C22","v":6.8}]
[5.6,5.6,6.8]
[6.2,6.2,{"$f":"C24","v":6.8}]
[6.8,6.8,6.8,6.8]
[7.5,7.5,{"$f":"C26","v":10}]
[8.1999999999999993,8.1999999999999993,10]
[9.1,9.1,{"$f":"C28","v":10}]
[10,10,10,10]
[11,{"$f":"B30","v":15},15]
[12,15,15]
[13,{"$f":"B32","v":15},{"$f":"C32","v":15}]
[15,15,15]
[16,{"$f":"B34","v":22},22]
[18,22,22]
[20,{"$f":"B36","v":22},{"$f":"C36","v":22}]
[22,22,22]
[24,{"$f":"B38","v":33},33]
[27,33,33]
[30,{"$f":"B40","v":33},{"$f":"C40","v":33}]
[33,33,33]
[36,{"$f":"B42","v":47},47]
[39,47,47]
[43,{"$f":"B44","v":47},{"$f":"C44","v":47}]
[47,47,47]
[51,{"$f":"B46","v":68},68]
[56,68,68]
[62,{"$f":"B48","v":68},{"$f":"C48","v":68}]
[68,68,68]
[75,{"$f":"B50","v":100},100]
[82,100,100]
[91,{"$f":"B52","v":100},{"$f":"C52","v":100}]
[100,100,100]
[110,{"$f":"B54","v":150},150]
[120,150,150]
[130,{"$f":"B56","v":150},{"$f":"C56","v":150}]
[150,150,150]
[160,{"$f":"B58","v":220},220]
[180,220,220]
[200,{"$f":"B60","v":220},{"$f":"C60","v":220}]
[220,220,220]
[240,{"$f":"B62","v":330},330]
[270,330,330]
[300,{"$f":"B64","v":330},{"$f":"C64","v":330}]
[330,330,330]
[360,{"$f":"B66","v":470},470]
[390,470,470]
[430,{"$f":"B68","v":470},{"$f":"C68","v":470}]
[470,470,470]
[510,{"$f":"B70","v":680},680]
[560,680,680]
[620,{"$f":"B72","v":680},{"$f":"C72","v":680}]
[680,680,680]
[750,{"$f":"B74","v":1000},{"$f":"C74","v":1000}]
[820,{"$f":"B75","v":1000},{"$f":"C75","v":1000}]
[910,1000,1000]

{"sheet":"Nretry","index":5,"n_rows":1024,"n_cols":6,"rows_kept":1024,"cut":false,"hidden":true,"merged":[[4,3,4,4]]}
[0,4]
[1,4]
[2,4]
[3,4]
[4,16,null,"Nretry_quantized =",null,{"$f":"IF('Calculation Sheet'!G90=\"Infinite\", \"Infinite\", VLOOKUP('Calculation Sheet'!G90,A1:B1024,2,TRUE))","v":4}]
[5,16]
[6,16]
[7,16]
[8,16]
[9,16]
[10,16]
[11,16]
[12,16]
[13,16]
[14,16]
[15,16]
[16,64]
[17,64]
[18,64]
[19,64]
[20,64]
[21,64]
[22,64]
[23,64]
[24,64]
[25,64]
[26,64]
[27,64]
[28,64]
[29,64]
[30,64]
[31,64]
[32,64]
[33,64]
[34,64]
[35,64]
[36,64]
[37,64]
[38,64]
[39,64]
[40,64]
[41,64]
[42,64]
[43,64]
[44,64]
[45,64]
[46,64]
[47,64]
[48,64]
[49,64]
[50,64]
[51,64]
[52,64]
[53,64]
[54,64]
[55,64]
[56,64]
[57,64]
[58,64]
[59,64]
[60,64]
[61,64]
[62,64]
[63,64]
[64,256]
[65,256]
[66,256]
[67,256]
[68,256]
[69,256]
[70,256]
[71,256]
[72,256]
[73,256]
[74,256]
[75,256]
[76,256]
[77,256]
[78,256]
[79,256]
{"$rows_left_out":944}