{"text_format":"1","workbook":"xlsx","n_sheets":3,"sheets":["Instructions","Input and Results","Legal"],"not_rendered":{"charts":3,"images":1,"macros":1,"external_links":0,"defined_names":35,"comments":0,"pivot_tables":0},"unopened":[],"bounds":{"document_bytes":16777216,"sheet_cells":100000,"rows_first":2000,"rows_last":500,"rows_between":2000,"halvings":0,"cell_chars":16384,"cell_head_chars":4096},"cells_cut":0,"cells_raw":0,"read":"whole","date_system":"1900"}

{"sheet":"Instructions","index":0,"n_rows":41,"n_cols":2,"rows_kept":41,"cut":false,"hidden":false,"merged":[]}
["Using this spreadsheet"]
[null,"This spreadsheet will help the engineer calculate the compensation network for a voltage mode continuous current non isolated buck converter using type III compensation network."]
[null,"Getting Started:"]
[1,"Ensure Tools => Add Ins => Analysis ToolPak is selected otherwise spreadsheet will not work"]
[2,"Green Cells show where manually entered data is placed"]
[3,"White cells are the calculated results"]
[4,"Blue cells are the final results for the design and plots"]
[5,"All data is entered and results viewed on the \"Input and Results\" worksheet"]
[]
[null,"Required Data:"]
[null,"Power Supply General Parameters"]
[null,"Input voltage in Volts"]
[null,"Output voltage Volts"]
[null,"Output current in Amps"]
[null,"Loop Requirements"]
[null,"Cross over frequency in kHz, recommend 1/5th to 1/10th the switching frequency"]
[null,"Phase margin in degrees, recommend 60°"]
[null,"Output Filter Parameters"]
[null,"Output inductor value in micro Henries"]
[null,"Output inductor DC resistance in milliohms"]
[null,"Output electrolytic capacitor value in micro Farads (set Qty. to 0 if not used)"]
[null,"Electrolytic capacitor equivalent series resistance in milliohms"]
[null,"Output ceramic capacitor value in micro Farads (set Qty. to 0 if not used)"]
[null,"Ceramic capacitor equivalent series resistance in milliohms"]
[null,"Controller part number (select from pull down list)"]
[]
[null,"Procedure:"]
[1,"Enter data in relevant cells on sheet titled \"Input and Results\""]
[2,"Select IC part number from pull down menu (Cell B18)"]
[null,"a. if using the TPS4005X or TPS4007x you should enter the RT and RKFF values in cells B21 and B22"]
[null,"b. if using the TPS40400 you need to enter the switching frequency (in kHz) is cell B21"]
[3,"Set \"Manually input R's & C's:\" to \"No\" (Cell K4)"]
[4,"Results are shown in the blue cells"]
[5,"To keep these calculated results click on green box \"Copy Std. Values to Man. Values\" this will"]
[null,"a. Copy the R's and C's from Cells G13-G19 to cells J5-J11."]
[null,"b. Sets \"Manually input R's & C's:\" to \"Yes\""]
[null,"The user can now modify the power supply parameters with a fixed compensation network"]
[6,"User can also manually input zero and pole locations by using cells J14 to J17 and selecting K13 = Yes"]
[]
[null,"Applicable Parts"]
[null,"TPS40007, TPS40009, TPS40021, TPS40040, TPS40041, TPS40055, TPS40057, TPS40075, TPS40077, TPS40101, TPS40170, TPS40190, TPS40192, TPS40193, TPS40195, TPS40200, TPS40303, TPS40304, TPS40305, TPS40322, TPS40400, TPS51113, TPS5130, TPS53311, TPS56121, TPS56221, TPS53316, TPS53313"]

{"sheet":"Input and Results","index":1,"n_rows":339,"n_cols":31,"rows_kept":339,"cut":false,"hidden":false,"merged":[[12,83,12,86],[11,0,11,2],[17,8,17,9],[18,0,18,2]]}
["See \"Instructions\" sheet for details on using this spreadsheet.",null,null,null,null,null,null,null,null,null,null,null,null,null,null,null,null,null,null,null,null,null,null,"Resistors",null,null,null,"Capacitors"]
[null,null,null,null,null,null,null,null,null,null,null,null,null,null,null,null,null,"IC Parameters (from data sheet)"]
["PSU Parameters",null,null,null,null,"Calculated Zero's, Pole's, R's and C's:",null,null,null,"Manually enter",null,null,"Power Train Poles and Zeros",null,null,null,null,"P/N","VRAMP","VREF","GBWP","DCGAIN",null,{"$f":"'Input and Results'!H6","v":"R_2"},{"$f":"'Input and Results'!I6","v":1996.5702104905511},{"$f":"IF((10^(LOG(Y3)-INT(LOG(Y3)))*100)-VLOOKUP((10^(LOG(Y3)-INT(LOG(Y3)))*100),X$7:X$75,1)<VLOOKUP((10^(LOG(Y3)-INT(LOG(Y3)))*100),X$7:Y$75,2)-(10^(LOG(Y3)-INT(LOG(Y3)))*100),VLOOKUP((10^(LOG(Y3)-INT(LOG(Y3)))*100),X$7:X$75,1),VLOOKUP((10^(LOG(Y3)-INT(LOG(Y3)))*100),X$7:Y$75,2))","v":200},{"$f":"Z3*10^INT(LOG(Y3))/100","v":2000},{"$f":"'Input and Results'!H9","v":"C_1"},{"$f":"'Input and Results'!I9","v":650.39812976252335},{"$f":"IF((10^(LOG(AC3)-INT(LOG(AC3))))-VLOOKUP((10^(LOG(AC3)-INT(LOG(AC3)))),AB$7:AB$18,1)<VLOOKUP((10^(LOG(AC3)-INT(LOG(AC3)))),AB$7:AC$18,2)-(10^(LOG(AC3)-INT(LOG(AC3)))),VLOOKUP((10^(LOG(AC3)-INT(LOG(AC3)))),AB$7:AB$18,1),VLOOKUP((10^(LOG(AC3)-INT(LOG(AC3)))),AB$7:AC$18,2))","v":6.8},{"$f":"IF(I9>10000,AD6*10^INT(LOG(AC3)),AD3*10^INT(LOG(AC3)))","v":680}]
["VIN",12,"V",null,null,null,null,null,null,"R's & C's:","Yes",null,"LC Double Pole",{"$f":"1/(2*PI()*SQRT(LOUT*10^-6*(COUT+MLCC)*10^-6))*10^-3","v":6.9460911804285672},"kHz",null,null,null,"V","V","MHz","dB",null,{"$f":"'Input and Results'!H7","v":"R_3"},{"$f":"'Input and Results'!I7","v":23211.480124068279},{"$f":"IF((10^(LOG(Y4)-INT(LOG(Y4)))*100)-VLOOKUP((10^(LOG(Y4)-INT(LOG(Y4)))*100),X$7:X$75,1)<VLOOKUP((10^(LOG(Y4)-INT(LOG(Y4)))*100),X$7:Y$75,2)-(10^(LOG(Y4)-INT(LOG(Y4)))*100),VLOOKUP((10^(LOG(Y4)-INT(LOG(Y4)))*100),X$7:X$75,1),VLOOKUP((10^(LOG(Y4)-INT(LOG(Y4)))*100),X$7:Y$75,2))","v":237},{"$f":"Z4*10^INT(LOG(Y4))/100","v":23700},{"$f":"'Input and Results'!H10","v":"C_2"},{"$f":"'Input and Results'!I10","v":336.15033538414019},{"$f":"IF((10^(LOG(AC4)-INT(LOG(AC4))))-VLOOKUP((10^(LOG(AC4)-INT(LOG(AC4)))),AB$7:AB$18,1)<VLOOKUP((10^(LOG(AC4)-INT(LOG(AC4)))),AB$7:AC$18,2)-(10^(LOG(AC4)-INT(LOG(AC4)))),VLOOKUP((10^(LOG(AC4)-INT(LOG(AC4)))),AB$7:AB$18,1),VLOOKUP((10^(LOG(AC4)-INT(LOG(AC4)))),AB$7:AC$18,2))","v":3.3},{"$f":"IF(I10>10000,AD7*10^INT(LOG(AC4)),AD4*10^INT(LOG(AC4)))","v":330}]
["VOUT",3.3,"V",null,null,"Fz_1",{"$f":"IF(K13=\"NO\",Fco/G9*1000,J14)","v":20397.819659500557},"R_1",{"$f":"J5","v":10000},10000,"W",null,"Electrolytic ESR Zero",{"$f":"IF(D13=0, \"None\",1/(2*PI()*COUT*10^-6*ESR*10^-3)*10^-3)","v":30.142981646192304},"kHz",null,null,"TPS40007",0.87,0.7,5,55,null,{"$f":"'Input and Results'!H8","v":"R_bias"},{"$f":"'Input and Results'!I8","v":2222.2222222222226},{"$f":"IF((10^(LOG(Y5)-INT(LOG(Y5)))*100)-VLOOKUP((10^(LOG(Y5)-INT(LOG(Y5)))*100),X$7:X$75,1)<VLOOKUP((10^(LOG(Y5)-INT(LOG(Y5)))*100),X$7:Y$75,2)-(10^(LOG(Y5)-INT(LOG(Y5)))*100),VLOOKUP((10^(LOG(Y5)-INT(LOG(Y5)))*100),X$7:X$75,1),VLOOKUP((10^(LOG(Y5)-INT(LOG(Y5)))*100),X$7:Y$75,2))","v":220},{"$f":"Z5*10^INT(LOG(Y5))/100","v":2200},{"$f":"'Input and Results'!H11","v":"C_3"},{"$f":"'Input and Results'!I11","v":67.114774587438305},{"$f":"IF((10^(LOG(AC5)-INT(LOG(AC5))))-VLOOKUP((10^(LOG(AC5)-INT(LOG(AC5)))),AB$7:AB$18,1)<VLOOKUP((10^(LOG(AC5)-INT(LOG(AC5)))),AB$7:AC$18,2)-(10^(LOG(AC5)-INT(LOG(AC5)))),VLOOKUP((10^(LOG(AC5)-INT(LOG(AC5)))),AB$7:AB$18,1),VLOOKUP((10^(LOG(AC5)-INT(LOG(AC5)))),AB$7:AC$18,2))","v":6.8},{"$f":"IF(I11>10000,AD8*10^INT(LOG(AC5)),AD5*10^INT(LOG(AC5)))","v":68}]
["IOUT_max",18,"A",null,null,"Fz_2",{"$f":"IF(K13=\"NO\",Fco/G9*1000,J15)","v":20397.819659500557},"R_2",{"$f":"1/(2*PI()*Fp_1*I9*10^-12)","v":1996.5702104905511},2000,"W",null,"Ceramic ESR Zero",{"$f":"IF(D16=0,\"None\",1/(2*PI()*MLCC*10^-6*MLCC_ESR*10^-3)*10^-3)","v":15915.494309189535},"kHz",null,null,"TPS40009",0.87,0.7,5,55,null,null,null,null,null,"C values up to 10nF",null,{"$f":"IF((10^(LOG(AC3)-INT(LOG(AC3))))-VLOOKUP((10^(LOG(AC3)-INT(LOG(AC3)))),AB$20:AB$25,1)<VLOOKUP((10^(LOG(AC3)-INT(LOG(AC3)))),AB$20:AC$25,2)-(10^(LOG(AC3)-INT(LOG(AC3)))),VLOOKUP((10^(LOG(AC3)-INT(LOG(AC3)))),AB$20:AB$25,1),VLOOKUP((10^(LOG(AC3)-INT(LOG(AC3)))),AB$20:AC$25,2))","v":6.8}]
["Fco",50,"kHz",null,null,"Fp_1",{"$f":"IF(K13=\"NO\",Fco*G9*1000,J16)","v":122562.11897802478},"R_3",{"$f":"1/(2*PI()*Fz_2*I10*10^-12)","v":23211.480124068279},23700,"W",null,null,null,null,null,null,"TPS40021",0.87,0.7,5,55,null,100,105,"E24",null,1,1.2,{"$f":"IF((10^(LOG(AC4)-INT(LOG(AC4))))-VLOOKUP((10^(LOG(AC4)-INT(LOG(AC4)))),AB$20:AB$25,1)<VLOOKUP((10^(LOG(AC4)-INT(LOG(AC4)))),AB$20:AC$25,2)-(10^(LOG(AC4)-INT(LOG(AC4)))),VLOOKUP((10^(LOG(AC4)-INT(LOG(AC4)))),AB$20:AB$25,1),VLOOKUP((10^(LOG(AC4)-INT(LOG(AC4)))),AB$20:AC$25,2))","v":3.3}]
["Phase Margin",60,"°",null,null,"Fp_2",{"$f":"IF(K13=\"NO\",Fco*G9*1000,J17)","v":122562.11897802478},"R_bias",{"$f":"VREF*I5/(VOUT-VREF)","v":2222.2222222222226},2200,"W",null,null,null,null,null,null,"TPS40040",0.87,0.6,5,55,null,105,110,"E48",null,1.2,1.5,{"$f":"IF((10^(LOG(AC5)-INT(LOG(AC5))))-VLOOKUP((10^(LOG(AC5)-INT(LOG(AC5)))),AB$20:AB$25,1)<VLOOKUP((10^(LOG(AC5)-INT(LOG(AC5)))),AB$20:AC$25,2)-(10^(LOG(AC5)-INT(LOG(AC5)))),VLOOKUP((10^(LOG(AC5)-INT(LOG(AC5)))),AB$20:AB$25,1),VLOOKUP((10^(LOG(AC5)-INT(LOG(AC5)))),AB$20:AC$25,2))","v":6.8}]
["Output Inductor",null,null,null,null,"kVenable",{"$f":"TAN(RADIANS((PM-'Input and Results'!F57-180)/2+45))+SQRT((TAN(RADIANS((PM-'Input and Results'!F57-180)/2+45)))^2+1)","v":2.4512423795604956},"C_1",{"$f":"(Fp_1-Fz_1)/(2*PI()*Fp_1*Fz_1*I5)*10^12","v":650.39812976252335},680,"pF",null,null,null,null,null,null,"TPS40041",0.87,0.6,5,55,null,110,115,null,null,1.5,1.8]
["LOUT",1.5,"μH",null,null,null,null,"C_2",{"$f":"((Fco*1000)/(2*PI()*I5*Fz_2*Fz_1*F58)*(1-Fz_2/Fp_2))*10^12","v":336.15033538414019},330,"pF",null,null,null,null,null,null,"TPS40055",{"$f":"VIN/((B21*10^3/(58.14*B20+1340)+3.48)/2)","v":6.8965517241379315},0.7,3,60,null,115,120,null,null,1.8,2.2000000000000002,{"$f":"IF('Input and Results'!I9<1,\"1000\",1)","v":1},{"$f":"IF('Input and Results'!I9<1,\"pF\",\"nF\")","v":"nF"}]
["DCR",4.5,"mΩ",null,null,null,null,"C_3",{"$f":"((Fco*1000)/(2*PI()*I5*Fz_2*Fz_1*F58)-I10*10^-12)*10^12","v":67.114774587438305},68,"pF",null,null,null,null,null,null,"TPS40057",{"$f":"VIN/((B21*10^3/(58.14*B20+1340)+3.48)/2)","v":6.8965517241379315},0.7,3,60,null,120,121,null,null,2.2000000000000002,2.7,{"$f":"IF('Input and Results'!I10<1,\"1000\",1)","v":1},{"$f":"IF('Input and Results'!I10<1,\"pF\",\"nF\")","v":"nF"}]
["Output Electrolytic Capacitor",null,null,"Qty:",null,"Standard R and C values for final circuit.",null,null,null,"Manually enter",null,null,null,null,null,null,null,"TPS40075",{"$f":"(VIN-0.4)/((-((0.131*B20)+1.886)+SQRT(((0.131*B20)+1.886)^2-4*(-1.61*10^-3)*(-1.363-0.02*B20-4.87*10^-5*B20^2-B21)))/(2*(-1.61*10^-3))-0.4)","v":35.89776039348682},0.7,5,50,null,121,127,null,null,2.7,3.3,{"$f":"IF('Input and Results'!I11<1,\"1000\",1)","v":1},{"$f":"IF('Input and Results'!I11<1,\"pF\",\"nF\")","v":"nF"}]
["COUT_ELEC",330,"μF",1,null,"R_1",{"$f":"I5","v":10000},null,null,"P's and Z's:","No",null,null,null,null,null,null,"TPS40077",{"$f":"(VIN-0.4)/((-((0.131*B20)+1.886)+SQRT(((0.131*B20)+1.886)^2-4*(-1.61*10^-3)*(-1.363-0.02*B20-4.87*10^-5*B20^2-B21)))/(2*(-1.61*10^-3))-0.4)","v":35.89776039348682},0.7,5,50,null,127,130,null,null,3.3,3.9]
["ESR_ELEC",16,"mΩ",null,null,"R_2",{"$f":"IF(K4=\"No\",'Input and Results'!AA3,J6)","v":2000},"Fz_1",{"$f":"1/(2*PI()*(R_1+R_2)*C_1*10^-12)","v":19504.282241653844},null,"Hz",null,null,null,null,null,null,"TPS40101",0.5,0.69599999999999995,3.5,60,null,130,133,null,null,3.9,4.7]
["Output Ceramic Capacitor",null,null,"Qty:",null,"R_3",{"$f":"IF(K4=\"No\",'Input and Results'!AA4,J7)","v":23700},"Fz_2",{"$f":"1/(2*PI()*(R_3)*C_2*10^-12)","v":20349.692250593958},null,"Hz",null,null,null,null,null,null,"TPS40170",{"$f":"VIN/15","v":0.8},0.6,7,80,null,133,140,null,null,4.7,5.6]
["COUT_CER",10,"μF",2,null,"R_bias",{"$f":"IF(K4=\"No\",'Input and Results'!AA5,J8)","v":2200},"Fp_1",{"$f":"1/(2*PI()*R_2*C_1*10^-12)","v":117025.69344992304},null,"Hz",null,null,null,null,null,null,"TPS40190",0.75,0.59099999999999997,5,60,null,140,147,null,null,5.6,6.8]
["ESR_CER",1,"mΩ",null,null,"C_1",{"$f":"IF(K4=\"No\",AE3,J9)","v":680},"Fp_2",{"$f":"(C_2*10^-12+C_3*10^-12)/(2*PI()*R_3*C_2*10^-12*C_3*10^-12)","v":119105.55170200582},null,"Hz",null,null,null,null,null,null,"TPS40192",1,0.59099999999999997,7,60,null,147,150,null,null,6.8,8.1999999999999993]
["Select IC","TPS40304",null,null,null,"C_2",{"$f":"IF(K4=\"No\",AE4,J10)","v":330},null,"Results",null,null,null,null,null,null,null,null,"TPS40193",1,0.59099999999999997,7,60,null,150,154,null,null,8.1999999999999993,10]
[{"$f":"IF(A20=\"RT\",\"Enter for circuit parameters:\",IF(A20=\"fsw = \",\"Enter for circuit parameters:\",\"\"))","v":""},null,null,null,null,"C_3",{"$f":"IF(K4=\"No\",AE5,J11)","v":68},null,"FCO actual",{"$f":"D76","v":49956.205956922968},null,null,null,null,null,null,null,"TPS40195",1,0.59099999999999997,7,60,null,154,160,null,null,"C values greater than 10nF"]
[{"$f":"IF(A21=\"RKFF\",\"RT\",IF(IC=\"TPS40400\",\"fsw = \",\"\"))","v":""},null,{"$f":"IF(A20=\"RT\",\"kΩ\",IF(A20=\"fsw = \",\"kHz\",\"\"))","v":""},null,null,null,null,null,"Phase at FCO",{"$f":"F48+F50","v":56.37040175331687},null,null,null,null,null,null,null,"TPS40200",{"$f":"VIN/10","v":1.2},0.69599999999999995,1.5,60,null,160,162,"Nancy's Values",null,1,1.5]
[{"$f":"IF(IC=\"TPS40055\",\"RKFF\",IF(IC=\"TPS40057\",\"RKFF\",IF(IC=\"TPS40075\",\"RKFF\",IF(IC=\"TPS40077\",\"RKFF\",\"\"))))","v":""},null,{"$f":"IF(A21=\"RKFF\",\"kΩ\",\"\")","v":""},null,null,null,null,null,"Vout (nom)",{"$f":"VREF/R_4*R_1+VREF","v":3.3272727272727276},null,null,null,null,null,null,null,"TPS40303",{"$f":"VIN/6","v":2},0.6,10,60,null,162,169,2000,null,1.5,2.2000000000000002]
["For two-phase operation, choose LOUT = Lx/2, where Lx is the inducance per phase.",null,null,null,null,null,null,null,null,null,null,null,null,null,null,null,null,"TPS40304",{"$f":"VIN/6","v":2},0.6,10,60,null,169,178,511,null,2.2000000000000002,3.3]
[null,null,null,null,null,null,null,null,null,null,null,null,null,null,null,null,null,"TPS40305",{"$f":"VIN/6","v":2},0.6,10,60,null,178,180,750,null,3.3,4.7]
[null,null,null,null,null,null,null,null,null,null,null,null,null,null,null,null,null,"TPS40322",{"$f":"VIN/8.15","v":1.4723926380368098},0.6,24,80,null,180,187,3010,null,4.7,6.8]
[null,null,null,null,null,null,null,null,null,null,null,null,null,null,null,null,null,"TPS40400",{"$f":"VIN*(-3*10^-5*B20+0.1615)","v":1.9380000000000002},0.6,15,60,null,187,196,4700,null,6.8,10]
[null,null,null,null,null,null,null,null,null,null,null,null,null,null,null,null,null,"TPS40422",{"$f":"VIN/8.2","v":1.4634146341463417},0.6,24,80,null,196,200,82000]
[null,null,null,null,null,null,null,null,null,null,null,null,null,null,null,null,null,"TPS51113",1.5,0.8,16,89,null,200,205,2.2000000000000002]
[null,null,null,null,null,null,null,null,null,null,null,null,null,null,null,null,null,"TPS5130",{"$f":"(S39-T39)*35000","v":0.48314255499999997},0.85,2.5,50,null,205,215]
[null,null,null,null,null,null,null,null,null,null,null,null,null,null,null,null,null,"TPS53311",{"$f":"VIN/4","v":3},0.6,14,80,null,215,220]
[null,null,null,null,null,null,null,null,null,null,null,null,null,null,null,null,null,"TPS56121",{"$f":"VIN/6","v":2},0.6,24,60,null,220,226]
[null,null,null,null,null,null,null,null,null,null,null,null,null,null,null,null,null,"TPS56221",{"$f":"VIN/6","v":2},0.6,24,60,null,226,237]
[null,null,null,null,null,null,null,null,null,null,null,null,null,null,null,null,null,"TPS53316",{"$f":"VIN/4","v":3},0.6,14,80,null,237,240]
[null,null,null,null,null,null,null,null,null,null,null,null,null,null,null,null,null,"TPS53313",{"$f":"VIN/9","v":1.3333333333333333},0.6,14,80,null,240,249]
[null,null,null,null,null,null,null,null,null,null,null,null,null,null,null,null,null,null,null,null,null,null,null,249,261]
[null,null,null,null,null,null,null,null,null,null,null,null,null,null,null,null,null,null,null,null,null,null,null,261,270]
[null,null,null,null,null,null,null,null,null,null,null,null,null,null,null,null,null,null,null,null,null,null,null,270,274]
[null,null,null,null,null,null,null,null,null,null,null,null,null,null,null,null,null,null,"TPS5130 Ramp calculations",null,null,null,null,274,287]
[null,null,null,null,null,null,null,null,null,null,null,null,null,null,null,null,null,"dVagc","I1max","I1min",null,null,null,287,300]
[null,null,null,null,null,null,null,null,null,null,null,null,null,null,null,null,null,{"$f":"IF((VIN-8*0.65)/120>0,(VIN-8*0.65)/120,0)","v":5.6666666666666664E-2},{"$f":"IF((R39*2.91223+1.185)<2.37,(R39*9.67307+1.185)*10^-5,2.37*10^-5)","v":1.7331406333333334E-5},{"$f":"IF((R39*2.96+0.085)<0.37,(R39*2.96+0.185)*10^-5,3.7*10^-6)","v":3.5273333333333339E-6},null,null,null,300,301]
[null,null,null,null,null,null,null,null,null,null,null,null,null,null,null,null,null,null,null,null,null,null,null,301,316]
[null,null,null,null,null,null,null,null,null,null,null,null,null,null,null,null,null,null,null,null,null,null,null,316,330]
[null,null,null,null,null,null,null,null,null,null,null,null,null,null,null,null,null,null,null,null,null,null,null,330,332]
["fsw = ",null,null,null,null,null,null,{"$f":"VIN","v":12},{"$f":"VRAMP","v":2},null,null,null,null,null,null,null,null,null,null,null,null,null,null,332,348]
["RT",null,null,null,null,null,null,null,null,null,null,null,null,null,null,null,null,null,null,null,null,null,null,348,360]
["RKFF",null,null,null,null,null,null,null,null,null,null,null,null,null,null,null,null,null,null,null,null,null,null,360,365]
["COUT_ELEC",{"$f":"IF(D13=0,10^-50,B13*D13)","v":330},"w",null,null,{"$f":"2*PI()*J19","v":313884.09927097574},null,null,null,null,null,null,null,null,null,null,null,null,null,null,null,null,null,365,383]
["ESR_ELEC",{"$f":"IF(D13=0,10^50,B14/D13)","v":16},"GCO_FCO",null,null,{"$f":"20*LOG(VIN/VRAMP*IMABS(IMDIV(IMDIV(IMPRODUCT(ROUT_min,COMPLEX(1,F46*COUT*10^-6*ESR*10^-3),COMPLEX(1,F46*MLCC*10^-6*MLCC_ESR*10^-3)),IMSUM(-(ROUT_min*ESR*10^-3+ROUT_min*MLCC_ESR*10^-3+MLCC_ESR*ESR*10^-6)*COUT*MLCC*10^-12*F46^2,COMPLEX(1,F46*((ROUT_min+ESR*10^-3)*COUT*10^-6+(ROUT_min+MLCC_ESR*10^-3)*MLCC*10^-6)))),IMSUM(COMPLEX(DCR*10^-3,F46*LOUT*10^-6),IMDIV(IMPRODUCT(ROUT_min,COMPLEX(1,F46*COUT*10^-6*ESR*10^-3),COMPLEX(1,F46*MLCC*10^-6*MLCC_ESR*10^-3)),IMSUM(-(ROUT_min*ESR*10^-3+ROUT_min*MLCC_ESR*10^-3+MLCC_ESR*ESR*10^-6)*COUT*MLCC*10^-12*F46^2,COMPLEX(1,F46*((ROUT_min+ESR*10^-3)*COUT*10^-6+(ROUT_min+MLCC_ESR*10^-3)*MLCC*10^-6))))))))","v":-13.510707870873002},null,{"$f":"IMDIV(IMPRODUCT(IMDIV(IMPRODUCT(IMSUM(IMDIV(1,COMPLEX(0,F46*COUT*10^-6)),ESR*10^-3),IMSUM(IMDIV(1,COMPLEX(0,F46*MLCC*10^-6)),MLCC_ESR*10^-3)),IMSUM(IMSUM(IMDIV(1,COMPLEX(0,F46*COUT*10^-6)),ESR*10^-3),IMSUM(IMDIV(1,COMPLEX(0,F46*MLCC*10^-6)),MLCC_ESR*10^-3))),VOUT/IOUT_max),IMSUM(IMDIV(IMPRODUCT(IMSUM(IMDIV(1,COMPLEX(0,F46*COUT*10^-6)),ESR*10^-3),IMSUM(IMDIV(1,COMPLEX(0,F46*MLCC*10^-6)),MLCC_ESR*10^-3)),IMSUM(IMSUM(IMDIV(1,COMPLEX(0,F46*COUT*10^-6)),ESR*10^-3),IMSUM(IMDIV(1,COMPLEX(0,F46*MLCC*10^-6)),MLCC_ESR*10^-3))),VOUT/IOUT_max))","v":"0.0135631144019085-0.00897036177111861i"},null,null,null,null,null,null,null,null,null,null,null,null,null,null,null,383,390]
[null,null,"PHCO_FCO",null,null,{"$f":"180/PI()*IMARGUMENT(IMDIV(IMDIV(IMPRODUCT(ROUT_min,COMPLEX(1,F46*COUT*10^-6*ESR*10^-3),COMPLEX(1,F46*MLCC*10^-6*MLCC_ESR*10^-3)),IMSUM(-(ROUT_min*ESR*10^-3+ROUT_min*MLCC_ESR*10^-3+MLCC_ESR*ESR*10^-6)*COUT*MLCC*10^-12*F46^2,COMPLEX(1,F46*((ROUT_min+ESR*10^-3)*COUT*10^-6+(ROUT_min+MLCC_ESR*10^-3)*MLCC*10^-6)))),IMSUM(COMPLEX(DCR*10^-3,F46*LOUT*10^-6),IMDIV(IMPRODUCT(ROUT_min,COMPLEX(1,F46*COUT*10^-6*ESR*10^-3),COMPLEX(1,F46*MLCC*10^-6*MLCC_ESR*10^-3)),IMSUM(-(ROUT_min*ESR*10^-3+ROUT_min*MLCC_ESR*10^-3+MLCC_ESR*ESR*10^-6)*COUT*MLCC*10^-12*F46^2,COMPLEX(1,F46*((ROUT_min+ESR*10^-3)*COUT*10^-6+(ROUT_min+MLCC_ESR*10^-3)*MLCC*10^-6)))))))","v":-121.24013280010492},null,{"$f":"20*LOG(VIN/VRAMP*IMABS(IMDIV(H47,IMSUM(COMPLEX(DCR*10^-3,F46*LOUT*10^-6),H47))))","v":-13.510707870873002},null,null,null,null,null,null,null,null,null,null,null,null,null,null,null,390,402]
["COUT_CER",{"$f":"IF(D16=0,10^-50,B16*D16)","v":20},"EA_Gain dB",null,null,{"$f":"20*LOG(IMABS(I49))","v":13.510488575532765},{"$f":"IMDIV(IMPRODUCT(IMDIV(1,COMPLEX(0,F46*C_3*10^-12)),IMSUM(R_3,IMDIV(1,COMPLEX(0,F46*C_2*10^-12)))),IMSUM(IMDIV(1,COMPLEX(0,F46*C_3*10^-12)),IMSUM(R_3,IMDIV(1,COMPLEX(0,F46*C_2*10^-12)))))","v":"13855.8238774762-13816.2678402959i"},{"$f":"IMDIV(IMPRODUCT(IMSUM(R_2,IMDIV(1,COMPLEX(0,F46*C_1*10^-12))),R_1),IMSUM(IMSUM(R_2,IMDIV(1,COMPLEX(0,F46*C_1*10^-12))),R_1))","v":"2768.92615856585-2823.21089866568i"},{"$f":"IMDIV(IMPRODUCT(-1,IMDIV(10^(DCGAIN/20),IMPRODUCT(COMPLEX(1,F46/(2*PI()*(GBWP*10^6/10^(DCGAIN/20)))),COMPLEX(1,F46/(2*PI()*EAP*10^6))))),IMSUM(1,IMDIV(H49,R_4),IMPRODUCT(IMDIV(H49,G49),IMSUM(1,IMDIV(10^(DCGAIN/20),IMPRODUCT(COMPLEX(1,F46/(2*PI()*(GBWP*10^6/10^(DCGAIN/20)))),COMPLEX(1,F46/(2*PI()*EAP*10^6))))))))","v":"-4.73311057877826+0.197504344989501i"},null,null,null,null,null,null,null,null,null,null,null,null,null,null,402,422]
["ESR_CER",{"$f":"IF(D16=0,10^50,B17/D16)","v":0.5},"EA_Phase",null,null,{"$f":"IF(180/PI()*IMARGUMENT(I49)<0,180/PI()*IMARGUMENT(I49)+360,180/PI()*IMARGUMENT(I49))","v":177.61053455342179},null,null,null,null,null,null,null,null,null,null,null,null,null,null,null,null,null,422,430]
["Error Amp pole",10,"GBWP limit",null,null,{"$f":"IF(20*(LOG(GBWP*10^6)-LOG(J19))>DCGAIN,DCGAIN,20*(LOG(GBWP*10^6)-LOG(J19)))","v":46.028211051491006},null,null,null,null,null,null,null,null,null,null,null,null,null,null,null,null,null,430,442]
[null,null,"No",null,null,null,null,null,null,null,null,null,null,null,null,null,null,null,null,null,null,null,null,442,464]
[null,null,"Yes",null,null,null,null,null,null,null,null,null,null,null,null,null,null,null,null,null,null,null,null,464,470]
[null,null,"ROUT_min",null,null,{"$f":"B5/B6","v":0.18333333333333332},"Ohms",null,null,null,null,null,null,null,null,null,null,null,null,null,null,null,null,470,487]
[null,null,"wCO",null,null,{"$f":"2*PI()*Fco*1000","v":314159.26535897935},null,null,null,null,null,null,null,null,null,null,null,null,null,null,null,null,null,487,510]
[null,null,"GCO_FCO",null,null,{"$f":"(IMABS(F61)*$F$62)","v":0.21084728279123083},null,null,null,null,null,null,null,null,null,null,null,null,null,null,null,null,null,510,511]
[null,null,"PHCO_FCO",null,null,{"$f":"180/PI()*IMARGUMENT(F61)","v":-121.22672974259709},null,null,null,null,null,null,null,null,null,null,null,null,null,null,null,null,null,511,536]
[null,null,"GCOMP_FCO",null,null,{"$f":"1/F56","v":4.7427692060425741},null,null,null,null,null,null,null,null,null,null,null,null,null,null,null,null,null,536,560]
[null,null,"Z2(s)",null,null,{"$f":"IMDIV(IMPRODUCT(IMDIV(IMPRODUCT(IMSUM(IMDIV(1,COMPLEX(0,wCO*COUT*10^-6)),ESR*10^-3),IMSUM(IMDIV(1,COMPLEX(0,wCO*MLCC*10^-6)),MLCC_ESR*10^-3)),IMSUM(IMSUM(IMDIV(1,COMPLEX(0,wCO*COUT*10^-6)),ESR*10^-3),IMSUM(IMDIV(1,COMPLEX(0,wCO*MLCC*10^-6)),MLCC_ESR*10^-3))),VOUT/IOUT_max),IMSUM(IMDIV(IMPRODUCT(IMSUM(IMDIV(1,COMPLEX(0,wCO*COUT*10^-6)),ESR*10^-3),IMSUM(IMDIV(1,COMPLEX(0,wCO*MLCC*10^-6)),MLCC_ESR*10^-3)),IMSUM(IMSUM(IMDIV(1,COMPLEX(0,wCO*COUT*10^-6)),ESR*10^-3),IMSUM(IMDIV(1,COMPLEX(0,wCO*MLCC*10^-6)),MLCC_ESR*10^-3))),VOUT/IOUT_max))","v":"0.0135623028420346-0.00896454213746152i"},null,null,null,null,null,null,null,null,null,null,null,null,null,null,null,null,null,560,562]
[null,null,"Z1(s)",null,null,{"$f":"COMPLEX(DCR*10^-3,wCO*LOUT*10^-6)","v":"0.0045+0.471238898038469i"},null,null,null,null,null,null,null,null,null,null,null,null,null,null,null,null,null,562,590]
{"$rows_left_out":280}
{"sheet":"Legal","index":2,"n_rows":0,"n_cols":0,"rows_kept":0,"cut":false,"hidden":false,"merged":[]}