{"text_format":"1","workbook":"xlsx","n_sheets":12,"sheets":["InputSheet","DeviceCalculator","Sheet1","6A_SchematicChecklist","6A_LayoutChecklist","12Ato20A_SchematicChecklist","12Ato20A_LayoutChecklist","Std. R and C Values","partData","Extra","revisionNotes","Disclaimer"],"not_rendered":{"charts":4,"images":13,"macros":1,"external_links":3,"defined_names":241,"comments":1,"pivot_tables":0},"unopened":[],"bounds":{"document_bytes":16777216,"sheet_cells":100000,"rows_first":2000,"rows_last":500,"rows_between":2000,"halvings":0,"cell_chars":16384,"cell_head_chars":4096},"cells_cut":0,"cells_raw":0,"read":"whole","date_system":"1900"}

{"sheet":"InputSheet","index":0,"n_rows":56,"n_cols":8,"rows_kept":56,"cut":false,"hidden":false,"merged":[]}
["Parameter","Units","Type","Default","*selected*",null,"end"]
["Rail Name",null,"Req",null,"EVM Example","charger"]
["Part Number",null,"Req",null,"TPS54J061","TPS54J061"]
["Vin_min","V","Opt","Vin_nom*0.8",9.6,9]
["Vin_nom","V","Req",null,12,12,null,"Sheet Descriptions:"]
["Vin_max","V","Opt","Vin_nom*1.1",13.2,15,null,"InputSheet = sheet with simplified input for checking component values with the macros described below"]
["Vout","V","Req",null,1.8,3.63,null,"DeviceCalculator = sheet where all calculations are done. This sheet can be used by itself to select or check component values."]
["Iout","A","Opt","Io_max_IC",6,1]
["dVo_ripple_perc",null,"Opt",0.01,0.01,0.01,null,"Macro Directions:"]
["dVo_trans_perc",null,"Opt",0.04,2.5000000000000001E-2,0.03,null,"Check/Calculate Selected Column"]
{"$rows_left_out":47}
{"sheet":"DeviceCalculator","index":1,"n_rows":163,"n_cols":20,"rows_kept":163,"cut":false,"hidden":false,"merged":[[139,1,139,7],[154,1,154,7],[19,17,19,19],[118,1,118,7],[134,1,134,7],[45,1,45,7],[71,1,71,7],[70,1,70,7],[59,1,59,7],[107,1,107,7],[108,1,108,7],[45,9,46,14],[150,1,150,7],[0,1,0,7],[35,1,35,7],[29,1,29,7],[7,1,7,7],[44,1,44,7],[1,1,6,1],[1,2,6,2],[1,3,6,3],[1,4,6,4],[1,5,6,5],[1,6,6,6],[1,7,6,7]]}
[null,"Design Calculations",null,null,null,null,null,null,null,"Key"]
[null,"Parameter","Input","Recommended","Selected Value","Calculated with Selected Value","Units","Description",null,"User Entered Value"]
[null,null,null,null,null,null,null,null,null,"Fixed IC Parameter"]
[null,null,null,null,null,null,null,null,null,"Calculated Parameter"]
[null,null,null,null,null,null,null,null,null,"Recommended Component Value"]
[null,null,null,null,null,null,null,null,null,"Design Caution"]
[null,null,null,null,null,null,null,null,null,"Design Warning"]
[null,"Choose Device"]
[null,"Part Number","TPS54J061",null,null,null,null,"Select IC part number"]
[null,"Vin_min_bias",{"$f":"VLOOKUP($C$9,partData!$A$3:$N$10,14,FALSE)","v":2.7},null,null,null,"V","IC rated minimum input voltage with external bias"]
{"$rows_left_out":154}
{"sheet":"Sheet1","index":2,"n_rows":18,"n_cols":2,"rows_kept":18,"cut":false,"hidden":true,"merged":[]}
[1,2]
["Part #","Kramp"]
[{"$f":"partData!A3","v":"TPS548A28"},{"$f":"300000*(0.000000000005+IF(OR(fsw_select=partData!E3,fsw_select=partData!F3),0.00000000000125,0))","v":1.4999999999999998E-6}]
[{"$f":"partData!A4","v":"TPS548A29"},{"$f":"300000*(0.000000000005+IF(OR(fsw_select=partData!E4,fsw_select=partData!F4),0.00000000000125,0))","v":1.4999999999999998E-6}]
[{"$f":"partData!A5","v":"TPS548B27"},{"$f":"300000*(0.000000000005+IF(OR(fsw_select=partData!E5,fsw_select=partData!F5),0.00000000000125,0))","v":1.4999999999999998E-6}]
[{"$f":"partData!A6","v":"TPS548B28"},{"$f":"300000*(0.000000000005+IF(OR(fsw_select=partData!E6,fsw_select=partData!F6),0.00000000000125,0))","v":1.4999999999999998E-6}]
[{"$f":"partData!A7","v":"TPS54J060"},{"$f":"650000*(0.000000000001125+IF(OR(fsw_select=partData!E7,fsw_select=partData!G7),0.00000000000338,0)+IF(fsw_select=partData!G7,0.000000000001745,0))","v":2.9282499999999999E-6}]
[{"$f":"partData!A8","v":"TPS54J061"},{"$f":"B7","v":2.9282499999999999E-6}]
[{"$f":"partData!A9","v":"TPS54JA20"},{"$f":"300000*(0.000000000005+IF(OR(fsw_select=partData!E9,fsw_select=partData!F9),0.00000000000125,0))","v":1.4999999999999998E-6}]
[{"$f":"partData!A10","v":"TPS54JB20"},{"$f":"300000*(0.000000000005+IF(OR(fsw_select=partData!E10,fsw_select=partData!F10),0.00000000000125,0))","v":1.4999999999999998E-6}]
{"$rows_left_out":9}
{"sheet":"6A_SchematicChecklist","index":3,"n_rows":26,"n_cols":8,"rows_kept":26,"cut":false,"hidden":false,"merged":[[1,0,1,7],[6,0,6,7],[15,0,15,7]]}
["Pin","Name","Purpose","Connection For Functional Use","Reasoning","Recommended Component Values from Design Calculations","Status","Comments"]
["Control"]
[6,"FB divider","Output feedback input","Ensure that the feedback divider network gives the appropriate Vout based on the Vref chosen. The FB pin must be connected to the AGND pin.",null,{"$f":"CONCATENATE(\"Rfb_t = \",ROUND(DeviceCalculator!D122,3),\" kΩ\",\"\nRfb_b = \",ROUND(Rfb_b,3),\" kΩ\")","v":"Rfb_t = 5.05 kΩ\nRfb_b = 1 kΩ"},"Open"]
[6,"FB Cff","Output feedback input","Add a capacitor in parallel with the top feedback resistor","Improves transient response and may be required for sufficient phase margin or minimizing output ripple",{"$f":"CONCATENATE(\"Cff = \",ROUND(DeviceCalculator!D128,0),\" pF\")","v":"Cff = 300 pF"},"Open"]
[6,"FB Rff","Output feedback input","Add a resistor in series with the Cff capacitor","In some applications, noise on FB can cause charge to accumulate on Cff resulting in the output starting to droop at high loads. Adding a small series resistance prevents the charge from accumulating.",{"$f":"CONCATENATE(\"Rff = \",ROUND(Rff_NSV*1000,0),\" Ω\")","v":"Rff = 255 Ω"},"Open"]
[]
["Configuration"]
[12,"MODE","fsw and DCM/CCM selection","Connect a resistor from MODE pin to AGND pin. 10% or better tolerance resistor is required. Use Table 1 to select the desired mode.",null,{"$f":"CONCATENATE(R_mode,\" kΩ\")","v":"Connect to VCC kΩ"},"Open"]
[12,"MODE fsw setting","fsw selection","Selected fsw should be below the maximum limits calculated in the calculator tab","When exceeding fsw_max_ton, the fsw will decrease but the output will still be regulated. \nWhen exceeding fsw_max_toff, the output will become unregulated and UVP may trip.",{"$f":"CONCATENATE(\"fsw_max_ton = \",ROUND(DeviceCalculator!D39,0),\" kHz\",\"\nfsw_max_toff = \",ROUND(DeviceCalculator!D40,0),\" kHz\")","v":"fsw_max_ton = 3457 kHz\nfsw_max_toff = 2670 kHz"},"Open"]
[4,"TRIP","OCL detection threshold setting pin","Connect the resistor from the TRIP pin to the AGND pin. Use WEBENCH or calculator to calculate the RTRIP resistor value. Recommend 1% or better resistors for RTRIP.",null,{"$f":"CONCATENATE(\"Valley ILIM = \",ROUND(I_lim_target,2),\" A\n\",\"RTRIP = \",ROUND(Rtrip,2),\" kΩ\")","v":"Valley ILIM = 0.75 A\nRTRIP = 22 kΩ"},"Open"]
{"$rows_left_out":17}
{"sheet":"6A_LayoutChecklist","index":4,"n_rows":17,"n_cols":7,"rows_kept":17,"cut":false,"hidden":false,"merged":[[10,0,10,6],[1,0,1,6]]}
["Pin","Name","Purpose","Placement or Routing?","Remarks","Status","Comments"]
["Power Stage"]
["3 (VIN), \n1, 14 (PGND)","VIN-PGND caps","Conversion power input","Placement","A 0402 sized 0.01-μF to 0.1-μF bypass capacitor must be placed as close as possible to the VIN and PGND pins to bypass high frequency noise and help reduce switch node ringing. It must be placed on the same side of the PCB as the IC.\nLarger VIN bypass capacitors should also be placed as close as possible to VIN and PGND pins behind this capacitor to minimize the input AC-current loop.","Open"]
[13,"VCC cap","Internal 3-V LDO output","Placement","Place the VCC bypass capacitor as close as possible to the IC on the same side of the PCB. If multiple capacitors are used, provide PGND vias for each capacitor and ensure the return path is as short as possible.","Open"]
["1, 14","PGND",null,"Routing","Include a large PGND pour connected to the PGND pins of the IC and include as many vias as possible for best thermal performance.","Open"]
["N/A","Cout and Lout","Output filter inductor and capacitors","Placement and Routing","Highly recommended to place output and inductor on the same side of the PCB as the IC to minimize PCB parasitic impedance. If components must be placed on the other side of the PCB due to space constraints, ensure multiple vias are used to minimize the added PCB parasitic impedance.","Open"]
[10,"BOOT cap and resistor","Supply input for high-side FET gate driver","Placement","Place the BOOT resistor (if used) as close as possible to the pin, followed by the BOOT capacitor. ","Open"]
["2, 11","SW","Switching node","Routing","The PCB trace which connects the SW pins and high-voltage side of the inductor, should be as short and wide as possible to minimize PCB resistance and radiated noise.","Open"]
["2, 11","SW snubber","Switching node","Placement and Routing","If used, keep the snubber path short for low inductance and the best possible performance. Also, to minimize inductance, avoid using vias for the RC snubber routing anduse very wide traces. To be most effective, the RC snubber should be connected between a large SW and PGND copper pour on the same side of the PCB as the IC.","Open"]
[]
{"$rows_left_out":8}
{"sheet":"12Ato20A_SchematicChecklist","index":5,"n_rows":28,"n_cols":8,"rows_kept":28,"cut":false,"hidden":false,"merged":[[1,0,1,7],[9,0,9,7],[18,0,18,7],[14,5,16,5],[14,6,16,6]]}
["Pin","Name","Purpose","Connection For Functional Use","Reasoning","Recommended Component Values from Calculator","Component units","Status"]
["Sensing and Control"]
[7,"FB","Output voltage feedback input."," A resistor divider from the VOUT to VSNS–  (tapped to FB pin) sets the output voltage. Regardless of remote sensing or single-end sensing connection, FB voltage divider, RFB_HS and RFB_LS, should be always placed as close as possible to the device.","Recommend between 1k to 20k for the RFB_LS.",null,null,"Open"]
[7,"FB Cff, FB divider","Output feedback input","The RC time constant between RfbTop and Cff should be less than 1.5*Tsw, where Tsw is the switching period. If a larger Cff is required, RfbTop and RfbBottom should be reduced accordingly while still maintaining the desired voltage divider ratio. For example, if Cff is doubled, RfbTop and RfbBottom should both be halved.\n\nTypically in general, Cff is not needed for Vout < 2.5 V. It is typically needed for Vout > 2.5V","Larger Cff helps improve transient response, but can put a low frequency zero which can cause instability"]
[6,"VSNS-","The return connection for a remote voltage sensing configuration","For single-end sensing, connect the higher FB resistor to a high-frequency local bypass capacitor of 0.1- μF or higher, and short VSNS– to AGND with shortest trace.",null,null,null,"Open"]
[6,"VSNS-","The return connection for a remote voltage sensing configuration","For remote sensing, the connections from the FB voltage divider resistors to the remote location should be a pair of PCB traces with at least 12-mil trace width, and should implement Kelvin sensing across a high bypass capacitor of 0.1-μF or higher. The ground connection of the remote sensing signal must be connected to VSNS– pin. The VOUT connection of the remote sensing signal must be connected to the feedback resistor divider with the lower feedback resistor terminated at VSNS– pin. To maintain stable output voltage and minimize the ripple, the pair of remote sensing lines should stay away from any noise sources such as inductor and SW nodes, or high frequency clock lines. And it is recommended to shield\nthe pair of remote sensing lines with ground planes above and below.",null,null,null,"Open"]
[6,"VSNS-","The return connection for a remote voltage sensing configuration","It is also used as ground for the internal reference. Short to AGND for single-end sense configuration                                                                                                                 ",null,null,null,"Open"]
[2,"AGND","Reference point for the internal control circuits. ","Use a separate ground symbol for AGND","This is expected to be a clean ground",null,null,"Open"]
[]
["Configuration"]
{"$rows_left_out":19}
{"sheet":"12Ato20A_LayoutChecklist","index":6,"n_rows":17,"n_cols":8,"rows_kept":17,"cut":false,"hidden":false,"merged":[[1,0,1,6],[5,0,5,6],[11,0,11,6]]}
["Pin","Name","Purpose","Placement or Routing?","Remarks","Reasoning","Status","Comments"]
["Sensing and Control"]
[7,"FB","Output voltage feedback input.","Placement","Place the feedback resistor near the device to minimize the FB trace distance. Avoid routing near noisy signals or power planes.",null,"Open"]
[6,"VSNS-","The return connection for a remote voltage sensing configuration",null,"The return connection for a remote voltage sensing configuration. It is also used as ground for the internal reference. Short to AGND for single-end sense configuration",null,"Open"]
[]
["Configuration"]
[8,"EN","enable pin","Routing","All routing for the EN pin should be placed away from any high voltage switch node (itself and others), such as SW and BOOT to avoid noise coupling.  The recommended operating condition for EN pin is maximum 5.5-V. DO NOT connect EN pin to VIN pin directly.",null,"Open"]
["4, 3","MODE, TRIP",null,"Placement","Place the Mode/Frequency setting resistor (MODE), OCP setting resistor (RTRIP) as close to the device as possible. Use the common GND via to connect them to the GND plane. Route all of these traces away from the switch node and other noisy sig",null,"Open"]
[9,"PGOOD","open drain power good","Placement","Keep the PGOOD resistor local to the device and place it as close as possible to the PGOOD pin. The resistor should be kept away from fast switching voltage and current paths.",null,"Open"]
[5,"SS/REFIN","Dual function:  External Soft start or external reference input pin","Placement","Soft-start function: Connect a ground of SS capacitor to VSNS– pin.    If two capacitors are used on SS pin connect larger value SS cap to VSNS-.   Connect smaller value SS cap to AGND.\n",null,"Open"]
{"$rows_left_out":8}
{"sheet":"Std. R and C Values","index":7,"n_rows":99,"n_cols":17,"rows_kept":99,"cut":false,"hidden":true,"merged":[[2,4,2,5],[2,6,2,7],[9,4,9,5],[22,4,22,5],[47,4,47,5]]}
["Hide Sheet"]
[null,null,null,null,"Std. Resistors",null,null,null,null,"Capacitors"]
[null,"Enter resistor value",100,null,"E6",null,"E96",null,null,"Cap value",8.2000000000000006E-8,"pF"]
[null,null,null,null,100,150,100,102,null,null,{"$f":"IF(K3*10^12<10000,IF((10^(LOG(K3*10^12)-INT(LOG(K3*10^12))))-VLOOKUP((10^(LOG(K3*10^12)-INT(LOG(K3*10^12)))),c_s1:C_f1,1)<VLOOKUP((10^(LOG(K3*10^12)-INT(LOG(K3*10^12)))),c_s1:C_f1,2)-(10^(LOG(K3*10^12)-INT(LOG(K3*10^12)))),VLOOKUP((10^(LOG(K3*10^12)-INT(LOG(K3*10^12)))),c_s1:C_f1,1),VLOOKUP((10^(LOG(K3*10^12)-INT(LOG(K3*10^12)))),c_s1:C_f1,2))*10^INT(LOG(K3*10^12)),IF((10^(LOG(K3*10^12)-INT(LOG(K3*10^12))))-VLOOKUP((10^(LOG(K3*10^12)-INT(LOG(K3*10^12)))),C_s2:C_f2,1)<VLOOKUP((10^(LOG(K3*10^12)-INT(LOG(K3*10^12)))),C_s2:C_f2,2)-(10^(LOG(K3*10^12)-INT(LOG(K3*10^12)))),VLOOKUP((10^(LOG(K3*10^12)-INT(LOG(K3*10^12)))),C_s2:C_f2,1),VLOOKUP((10^(LOG(K3*10^12)-INT(LOG(K3*10^12)))),C_s2:C_f2,2))*10^INT(LOG(K3*10^12)))*10^-12","v":6.8E-8},"pF"]
[null,"Closest E6 Value",{"$f":"(IF((10^(LOG(C3)-INT(LOG(C3)))*100)-VLOOKUP((10^(LOG(C3)-INT(LOG(C3)))*100),E6_s:E6_f,1)<VLOOKUP((10^(LOG(C3)-INT(LOG(C3)))*100),E6_s:E6_f,2)-(10^(LOG(C3)-INT(LOG(C3)))*100),VLOOKUP((10^(LOG(C3)-INT(LOG(C3)))*100),E6_s:E6_f,1),VLOOKUP((10^(LOG(C3)-INT(LOG(C3)))*100),E6_s:E6_f,2)))*10^INT(LOG(C3))/100","v":100},null,150,220,102,105]
[null,"Closest E12 Value",{"$f":"(IF((10^(LOG(C3)-INT(LOG(C3)))*100)-VLOOKUP((10^(LOG(C3)-INT(LOG(C3)))*100),E12_s:E12_f,1)<VLOOKUP((10^(LOG(C3)-INT(LOG(C3)))*100),E12_s:E12_f,2)-(10^(LOG(C3)-INT(LOG(C3)))*100),VLOOKUP((10^(LOG(C3)-INT(LOG(C3)))*100),E12_s:E12_f,1),VLOOKUP((10^(LOG(C3)-INT(LOG(C3)))*100),E12_s:E12_f,2)))*10^INT(LOG(C3))/100","v":100},null,220,330,105,107,null,"C values up to 10nF"]
[null,"Closest E24 Value",{"$f":"(IF((10^(LOG(C3)-INT(LOG(C3)))*100)-VLOOKUP((10^(LOG(C3)-INT(LOG(C3)))*100),E24_s:E24_f,1)<VLOOKUP((10^(LOG(C3)-INT(LOG(C3)))*100),E24_s:E24_f,2)-(10^(LOG(C3)-INT(LOG(C3)))*100),VLOOKUP((10^(LOG(C3)-INT(LOG(C3)))*100),E24_s:E24_f,1),VLOOKUP((10^(LOG(C3)-INT(LOG(C3)))*100),E24_s:E24_f,2)))*10^INT(LOG(C3))/100","v":100},null,330,470,107,110,null,1,1.2,{"$f":"IF((10^(LOG(K3)-INT(LOG(K3))))-VLOOKUP((10^(LOG(K3)-INT(LOG(K3)))),c_s1:C_f1,1)<VLOOKUP((10^(LOG(K3)-INT(LOG(K3)))),c_s1:C_f1,2)-(10^(LOG(K3)-INT(LOG(K3)))),VLOOKUP((10^(LOG(K3)-INT(LOG(K3)))),c_s1:C_f1,1),VLOOKUP((10^(LOG(K3)-INT(LOG(K3)))),c_s1:C_f1,2))","v":8.1999999999999993}]
[null,"Closest E48 Value",{"$f":"(IF((10^(LOG(C3)-INT(LOG(C3)))*100)-VLOOKUP((10^(LOG(C3)-INT(LOG(C3)))*100),E48_s:E48_f,1)<VLOOKUP((10^(LOG(C3)-INT(LOG(C3)))*100),E48_s:E48_f,2)-(10^(LOG(C3)-INT(LOG(C3)))*100),VLOOKUP((10^(LOG(C3)-INT(LOG(C3)))*100),E48_s:E48_f,1),VLOOKUP((10^(LOG(C3)-INT(LOG(C3)))*100),E48_s:E48_f,2)))*10^INT(LOG(C3))/100","v":100},null,470,680,110,113,null,1.2,1.5]
[null,"Closest E96 Value",{"$f":"(IF((10^(LOG(C3)-INT(LOG(C3)))*100)-VLOOKUP((10^(LOG(C3)-INT(LOG(C3)))*100),E96_s:E96_f,1)<VLOOKUP((10^(LOG(C3)-INT(LOG(C3)))*100),E96_s:E96_f,2)-(10^(LOG(C3)-INT(LOG(C3)))*100),VLOOKUP((10^(LOG(C3)-INT(LOG(C3)))*100),E96_s:E96_f,1),VLOOKUP((10^(LOG(C3)-INT(LOG(C3)))*100),E96_s:E96_f,2)))*10^INT(LOG(C3))/100","v":100},null,680,1000,113,115,null,1.5,1.8,null,null,null,null,"Notes:","If I use the value in column K it rounds up"]
[null,null,null,null,"E12",null,115,118,null,1.8,2.2000000000000002,null,null,null,null,null,"If I use the value in column J it rounds down"]
{"$rows_left_out":90}
{"sheet":"partData","index":8,"n_rows":578,"n_cols":29,"rows_kept":578,"cut":false,"hidden":true,"merged":[]}
[1,2,3,4,5,6,7,8,9,10,11,12,13,14,15,16,17,18,19,20,21,22,{"$f":"V1+1","v":23},{"$f":"W1+1","v":24},{"$f":"X1+1","v":25},26,27,28,0]
["Part #","VIN_min","VIN_max","Io,rated","Fsw_1","Fsw_2","Fsw_3","OC clamp","tonmin","Vref","OC Fault","OV Fault","VCC LDO Voltage","VIN_min_bias","toffmin","R_HS","R_LS","OC gain","I_ss","EN_rise","EN_fall","Ioc_neg_max","Rtrip_min","Rtrip_max","Rtrip_calc","Ilim_min","ILIM_Tol","Rboot_rec",{"$f":"AC98/10","v":1E-3}]
["TPS548A28",4,16,14,600,800,1000,15,70,0.6,"Hiccup","Latch Off",3,"2 .7",220,10.199999999999999,3.1,60000,36,{"$f":"T7","v":1.22},{"$f":"U7","v":1.02},-8,4,14.7,{"$f":"MAX(W3,MIN(X3,-5.078*LN( I_lim_target) + 17.066,R3*0.85/I_lim_target*10^-3))","v":14.7},{"$f":"MIN(I_lim_typ*0.85,28.4*EXP(-0.195*Rtrip))","v":0.38921987844516442},{"$f":"(Z3-I_lim_typ)/I_lim_typ","v":-0.71457208914021275},0,1.0200000000000001E-3]
["TPS548A29",4,16,14,600,800,1000,15,70,0.6,"Hiccup","Latch Off",4.5,"2 .7",220,8.1999999999999993,2.6,60000,36,{"$f":"T3","v":1.22},1.02,-8,4,14.7,{"$f":"Y3","v":14.7},{"$f":"Z3","v":0.38921987844516442},-0.71457208914021275,{"$f":"AB3","v":0},1.0500000000000002E-3]
["TPS548B27",4,16,20,600,800,1000,20.9,70,0.6,"Hiccup","Latch Off",3,"2 .7",220,7.2,2.2999999999999998,120000,36,{"$f":"T4","v":1.22},1.02,-8,0,20,{"$f":"MAX(W5,MIN(X5,-10.15*LN( I_lim_target) + 34.7,R5*0.9/I_lim_target*10^-3))","v":20},{"$f":"MIN(I_lim_typ*0.9,29.487*EXP(-0.097*Rtrip))","v":1.2272727272727273},-9.9999999999999922E-2,0,1.0700000000000002E-3]
["TPS548B28",4,16,20,600,800,1000,20.9,70,0.6,"Hiccup","Latch Off",3,"2 .7",220,7.2,2.2999999999999998,120000,36,1.22,1.02,-8,0,20,{"$f":"MAX(W6,MIN(X6,-10.15*LN( I_lim_target) + 34.7,R6*0.9/I_lim_target*10^-3))","v":20},{"$f":"MIN(I_lim_typ*0.9,29.487*EXP(-0.097*Rtrip))","v":1.2272727272727273},{"$f":"(Z6-I_lim_typ)/I_lim_typ","v":-9.9999999999999922E-2},0,1.1000000000000001E-3]
["TPS54J060",4,16,6,1100,2200,600,9.5,70,0.9,"Latch Off","Latch Off",3,2.7,220,25,9.1999999999999993,30000,9,1.22,1.02,-2.8,3.74,30.1,{"$f":"MAX(W7,MIN(X7,17.987*I_lim_target^(-0.787),R7*0.88/I_lim_target*10^-3))","v":22.524396397805798},{"$f":"MIN(I_lim_typ*0.88,37.996*Rtrip^(-1.254))","v":0.78766189734364378},-0.42238127528132785,0,1.1299999999999999E-3]
["TPS54J061",{"$f":"B7","v":4},16,6,1100,2200,600,9.5,70,0.6,"Hiccup","Latch Off",{"$f":"M7","v":3},2.7,220,25,9.1999999999999993,30000,9,1.22,1.02,{"$f":"V7","v":-2.8},{"$f":"W7","v":3.74},{"$f":"X7","v":30.1},{"$f":"Y7","v":22.524396397805798},{"$f":"Z7","v":0.78766189734364378},-0.42238127528132785,{"$f":"AB7","v":0},1.15E-3]
["TPS54JA20",4,16,12,600,800,1000,15,70,0.9,"Latch Off","Latch Off",3,"2 .7",220,10.199999999999999,3.1,60000,36,{"$f":"T8","v":1.22},1.02,-8,4,14.7,{"$f":"Y3","v":14.7},{"$f":"Z3","v":0.38921987844516442},-0.71457208914021275,{"$f":"AB3","v":0},1.1800000000000001E-3]
["TPS54JB20",4,16,20,600,800,1000,20.9,70,0.9,"Latch Off","Latch Off",3,"2 .7",220,7.2,2.2999999999999998,120000,36,1.22,1.02,-8,0,20,{"$f":"Y7","v":22.524396397805798},{"$f":"Z5","v":1.2272727272727273},-9.9999999999999922E-2,{"$f":"AB5","v":0},1.2099999999999999E-3]
{"$rows_left_out":569}
{"sheet":"Extra","index":9,"n_rows":6,"n_cols":2,"rows_kept":6,"cut":false,"hidden":true,"merged":[]}
[]
[]
[null,"Validation Options"]
[null,"Open"]
[null,"Complete"]
[null,"Not Applicable"]

{"sheet":"revisionNotes","index":10,"n_rows":9,"n_cols":2,"rows_kept":9,"cut":false,"hidden":false,"merged":[]}
["Date","Change"]
["2020-05-28","Added TPS54J060/1 schematic checklist (6aSchematicChecklist tab)"]
["2020-05-29","Added TPS54J060/1 layout checklist (6aLayoutChecklist tab)"]
["2020-06-29","Corrected equation for calculating Q_input. Added (1-D) term."]
["2020-08-18","Added calculation for EN max voltage"]
["2020-09-30","Added macros for design checks"]
["2020-12-22","Added Rff. Changed Rtrip selection to be based on current limit value for margin."]
["2021-04-20","Removed RC constant check on Cff and FB divider from 6A_SchematicChecklist. \nAdded check for Rff to 6A_ShematicChecklist."]
["2021-08-03","Added Simplis Export Variable "]

{"sheet":"Disclaimer","index":11,"n_rows":6,"n_cols":2,"rows_kept":6,"cut":false,"hidden":false,"merged":[]}
[]
[null,"Important notice and disclaimer"]
[null,"TI PROVIDES TECHNICAL AND RELIABILITY DATA (INCLUDING DATASHEETS), DESIGN RESOURCES (INCLUDING REFERENCE DESIGNS), APPLICATION OR OTHER DESIGN ADVICE, WEB TOOLS, SAFETY INFORMATION, AND OTHER RESOURCES “AS IS” AND WITH ALL FAULTS, AND DISCLAIMS ALL WARRANTIES, EXPRESS AND IMPLIED, INCLUDING WITHOUT LIMITATION ANY IMPLIED WARRANTIES OF MERCHANTABILITY, FITNESS FOR A PARTICULAR PURPOSE OR NON-INFRINGEMENT OF THIRD PARTY INTELLECTUAL PROPERTY RIGHTS."]
[null,"These resources are intended for skilled developers designing with TI products. You are solely responsible for (1) selecting the appropriate TI products for your application, (2) designing, validating and testing your application, and (3) ensuring your application meets applicable standards, and any other safety, security, or other requirements."]
[null,"These resources are subject to change without notice. TI grants you permission to use these resources only for development of an application that uses the TI products described in the resource. Other reproduction and display of these resources is prohibited. No license is granted to any other TI intellectual property right or to any third party intellectual property right. TI disclaims responsibility for, and you will fully indemnify TI and its representatives against, any claims, damages, costs, losses, and liabilities arising out of your use of these resources."]
[null,"TI’s products are provided subject to TI’s Terms of Sale or other applicable terms available either on ti.com or provided in conjunction with such TI products. TI’s provision of these resources does not expand or otherwise alter TI’s applicable warranties or warranty disclaimers for TI products."]