{"text_format":"1","workbook":"xlsx","n_sheets":4,"sheets":["DESIGN INPUTS AND CALCULATIONS","SCHEMATIC","data","VCOMP"],"not_rendered":{"charts":6,"images":1,"macros":1,"external_links":1,"defined_names":219,"comments":0,"pivot_tables":0},"unopened":[],"bounds":{"document_bytes":16777216,"sheet_cells":100000,"rows_first":2000,"rows_last":500,"rows_between":2000,"halvings":0,"cell_chars":16384,"cell_head_chars":4096},"cells_cut":0,"cells_raw":0,"read":"whole","date_system":"1900"}

{"sheet":"DESIGN INPUTS AND CALCULATIONS","index":0,"n_rows":267,"n_cols":12,"rows_kept":267,"cut":false,"hidden":false,"merged":[[95,0,95,3],[70,0,71,3],[17,0,19,3],[82,0,82,3],[153,0,154,3],[80,0,81,3],[114,0,114,3],[128,0,128,3],[126,0,127,3],[93,0,94,3],[112,0,113,3],[72,0,72,3],[60,0,61,3],[49,0,50,3],[21,0,21,3],[51,0,51,3],[62,0,62,3],[28,0,29,3],[43,0,43,3],[0,0,0,3],[2,0,2,3],[30,0,30,3],[3,2,3,3],[4,0,4,3],[5,0,5,3],[6,0,10,3],[11,0,15,3],[16,0,16,3],[135,0,135,3],[139,0,140,3],[141,0,141,3],[182,6,182,7],[155,0,155,3],[180,6,180,7],[181,6,181,7],[179,5,179,11],[255,0,255,3],[181,0,181,3],[183,5,184,10],[146,4,146,5],[179,0,179,3]]}
["UCC28180 DESIGN CALCULATOR TOOL"]
["TI Literature Number:","SLUC506","Rev C"]
["UCC28180 CONTINUOUS CURRENT CONDUCTION MODE PFC CONTROLLER WITH PROGRAMMABLE SWITCHING FREQUENCY"]
["Please enter design parameters into the","shaded","cells; "]
["Calculated results will be in RED"]
["Be sure to ENABLE EDITING before attempting to use this design calculator"]
["This spreadsheet guides the user through the design process of a CONTINUOUS CONDUCTION MODE PFC BOOST CONVERTER using the UCC28180.  User interaction is required in order to get the best possible results.  Enter the desired specification where prompted, the highlighted cells are for user inputs; calculations for the design are based upon the inputs."]
[]
[]
[]
[]
["WHERE APPLICABLE, A RECOMMENDED VALUE IS GIVEN THAT WILL BE THE BEST CHOICE TO MEET THE GIVEN SPECIFICATION.  IT IS IN THE BEST INTEREST OF THE USER TO USE A VALUE AS CLOSE AS POSSIBLE TO THE SUGGESTED RECOMMENDED VALUE.  FOR ACCURATE RESULTS, THE USER MUST ENTER THE ACTUAL VALUE USED IN THE APPROPRIATE CELL."]
[]
[]
[]
[]
["Disclaimer"]
["This product is designed as an aid for customers of Texas Instruments. No warranties, either expressed or implied, with respect to this software or its fitness for any particular purpose, are claimed by Texas Instruments or the author. The software is licensed solely on an \"as is\" basis. The entire risk as to its quality and performance is with the customer."]
[]
[]
[]
["INPUT:"]
["Minimum Input Voltage from AC Line:","VACIN(min)",210,"VRMS"]
["Maximum Input Voltage from AC Line:","VACIN(max)",240,"VRMS"]
["Minimum Line Frequency:","fLINE(min):",60,"Hz"]
["Maximum Line Frequency:","fLINE(max):",60,"Hz"]
["Minimum Rectified AC Line Voltage:","VIN_PEAK(min)",{"$f":"SQRT(2)*Vacin_min","v":296.98484809834997},"V"]
["Maximum Rectified AC Line Voltage:","VIN_PEAK(max)",{"$f":"SQRT(2)*Vacin_max","v":339.41125496954282},"V"]
[]
[]
["OUTPUT:"]
["Maximum Output Power of PFC Stage:","POUT(max)",3800,"W"]
["Output Voltage (Note: Must be > VIN_RECTIFIED(max)):","VOUT",475,"V",{"$f":"IF(Vout<=Vin_peak_max,\"OUTPUT VOLTAGE MUST BE GREATER THAN RECTIFIED MAXIMUM INPUT VOLTAGE\",\" \")","v":" "}]
["Target Power Factor, VIN(nom), Full Load:","PF",0.99,null,{"$f":"IF(PF>=0.999,\"ENTER VALUE LESS THAN 0.999\",\" \")","v":" "}]
["Predicted Efficiency:","h",0.95,null,{"$f":"IF(eff>=0.97,\"ENTER VALUE LESS THAN 0.97\",\" \")","v":" "}]
["Maximum Ambient Temperature:","TAMB(max)",50,"°C"]
["Maximum Average Output Current of PFC Stage:","IOUT",{"$f":"Pout/Vout","v":8},"A"]
["Desired Switching Frequency:","fSW(target)",45,"kHz",{"$f":"IF(fSW_target<18,\"fsw must not be less than 18 kHz\",IF(fSW_target>250,\"fsw must not be greater than 250 kHz\",\"\"))","v":""}]
["Recommended Resistor value on FREQ to Set the Switching Frequency, fSW:","RFREQ(recommended)",{"$f":"data!F233","v":48.7},"kΩ"]
["Actual Value For RFREQ Used: ","RFREQ =",47,"kΩ"]
["Resultant Switching Frequency, fSW:","fSW",{"$f":"((32.7*kOhms*65*kHz*(1*MegOhm+Rfreq*kOhms))/(Rfreq*kOhms*(1*MegOhm+32.7*kOhms)))/kHz","v":45.849621628080918},"kHz"]
[{"$f":"IF(Vout>=Vin_peak_max,IF(PF<1,IF(eff<0.97,\"\",\"DO NOT PROCEED. ENTER EFFICIENCY LESS < 0.97\"),\"DO NOT PROCEED. ENTER PF < 1\"),\"DO NOT PROCEED. OUTPUT VOLTAGE MUST BE > RECTIFIED MAXIMUM INPUT VOLTAGE\")","v":""}]
[]
["Line Current:"]
["Maximum Input Power Drawn from the Line:","PIN(max)",{"$f":"Pout/eff","v":4000},"W"]
["Maximum RMS AC Line Current:","IIN_RMS(max)",{"$f":"Pout/(eff*Vacin_min*PF)","v":19.24001924001924},"A"]
["Maximum Peak AC Line Current, assuming sinusoidal:","IIN_PEAK(max)",{"$f":"SQRT(2)*Iin_rms_max","v":27.2094961495545},"A"]
["Maximum Average AC Line Current, assuming sinusoidal:","IIN_AVG(max)",{"$f":"(2*Iin_peak_max)/PI()","v":17.322103244965966},"A"]
["Minimum Input Fuse Rating:","IFUSE",{"$f":"1.5*Iin_rms_max","v":28.860028860028862},"A"]
[]
[]
["BRIDGE RECTIFIER:"]
["Bridge Rectifier Forward Voltage, at IIN_PEAK(max):","VF_BRIDGE",1.05,"V"]
["Bridge Rectifier Thermal Resistance, Junction to Case:","RqJC(Bridge)",0.6,"°C/W"]
["Case to Heatsink Thermal Resistance:","RθCHS(Bridge)",0.7,"°C/W"]
["Bridge Rectifier Maximum Junction Temperature:","TJ(max)",125,"°C"]
["Bridge Rectifier Minimum Average Current Rating:","IBRIDGE(rated)",{"$f":"1.5*Iin_avg_max","v":25.983154867448949},"A"]
["Bridge Rectifier Minimum DC Blocking Voltage Rating:","VDC_BLOCKING(rated)",{"$f":"Vin_peak_max*1.1","v":373.35238046649715},"V"]
["Bridge Rectifier Power Dissipation:","PBRIDGE",{"$f":"2*Vf_bridge*Iin_avg_max","v":36.376416814428531},"W"]
["Required Heat Sink Thermal Impedance:","RqHS_AMB(Bridge)",{"$f":"((Tj_bridge-Tamb)/Pbridge)-Rjc_bridge-Rchs_bridge","v":0.76177536348911645},"°C/W"]
[]
[]
["INPUT CAPACITOR:"]
["Inductor Peak-to-Peak Current Ripple Factor (i.e. 0.2 for 20%, 0.3 for 30%). Percentage of minimum input, maximum load, inductor current at 50% duty cycle operating point, not recommended to be > 0.4:","LI_ripple_factor(target)",0.2,{"$f":"IF(L_I_ripple_factor>0.4,\"Lower ripple current factor is recommended\",\"\")","v":""}]
["Maximum High Frequency Voltage Ripple Factor (i.e. 0.03 for 3%, 0.09 for 9%):","VCin_ripple_factor",0.05]
["Target Maximum Allowable Inductor Current Ripple:","IRIPPLE(target)",{"$f":"L_I_ripple_factor*Iin_peak_max","v":5.4418992299109004},"A"]
["Maximum Inductor Voltage Ripple:","VIN_RIPPLE",{"$f":"V_ripplefactor*Vin_peak_min","v":14.849242404917499},"V"]
["Recommended Input Capacitor Value:","CIN(recommended)",{"$f":"data!F228","v":1},"mF"]
["Actual Value of Input Capacitor Used:","CIN",1,{"$f":"data!G228","v":"µF"}]
["Required Minimum Voltage Rating for CIN:","VCIN(rating)",{"$f":"Vrated","v":373.35238046649715},"V"]
[]
[]
["BOOST INDUCTOR DESIGN:"]
["Maximum Duty Cycle:","DUTY(max)",{"$f":"(Vout-Vin_peak_min)/Vout","v":0.37476874084557898}]
["Maximum Inductor Peak Current:","IL_PEAK(max)",{"$f":"Iin_peak_max+(Iripple/2)","v":29.930445764509951},"A"]
["Minimum Recommended Boost Inductor Value:","LBST(recommended)",{"$f":"((Vout*0.5*(1-0.5))/(fsw*kHz*Iripple))/mH","v":0.47593469647057529},"mH"]
["Actual Boost Inductor Value Used:","LBST(actual) =",0.79,"mH"]
["Actual Maximum Inductor Ripple Current:","IRIPPLE(actual)",{"$f":"(Vout*0.5*(1-0.5))/((fsw*kHz)*(Lbst*mH))","v":3.2784666559634199},"A"]
["Actual Maximum Inductor Peak Current:","IL_PEAK(actual)",{"$f":"Iin_peak_max+(Iripple_actual/2)","v":28.84872947753621},"A"]
["Resultant Inductor Current Ripple Factor:","LI_ripple_factor(actual)",{"$f":"Iripple_actual/(SQRT(2)*Iin_rms_max)","v":0.12048979657482919}]
[]
[]
["BOOST DIODE:"]
["Forward Voltage Drop, at IL_PEAK(max),125°C:","VF",1.8,"V"]
["Reverse Recovery Charge:","QRR",23,"nC"]
["Boost Diode Maximum Junction Temperature:","TJ(max)",125,"°C"]
["Boost Diode Thermal Resistance, Junction to Case:","RqJC(Diode)",1.2,"°C/W"]
["Boost Diode Thermal Resistance, Case to Heatsink:","RqCHS(Diode)",0.7,"°C/W"]
["Boost Diode Conduction Losses:","PDIODE(cond)",{"$f":"Vf*Iout","v":14.4},"W"]
["Reverse Recovery Losses:","PREVERSE",{"$f":"(65*10^3)*Vout*(Qrr*10^-9)","v":0.71012500000000001},"W"]
["Total Boost Diode Losses:","PDIODE(total)",{"$f":"Pdiode_cond+(Pdiode_reverse/2)","v":14.755062500000001},"W"]
["Required Heat Sink Thermal Impedance:","RqHS_AMB(Diode)",{"$f":"((Tj_diode-Tamb)/Pdiode)-Rth_diode-Rth_case_hs","v":3.1830011733261037},"°C/W"]
["Required Diode Blocking Voltage:","VBLOCKING",{"$f":"Vout*1.1","v":522.5},"V"]
[]
[]
["SWITCHING ELEMENT:"]
["VCC Bias Voltage to the UCC28180:","VCC",15,"V",{"$f":"IF(VCC<12,\"Bias voltage should be >12V\",\"\")","v":""}]
["Gate-Source Voltage:","VGS",{"$f":"IF(VCC>=15.2,15.2,VCC-1.25)","v":13.75},"V"]
["Drain-Source RMS Current:","IDS_RMS",{"$f":"(Pout/Vin_peak_min)*SQRT((2-(16*Vin_peak_min/(3*PI()*Vout))))","v":12.396059937329175},"A"]
["FET On-Resistance at  TJ = 125°C: ","RDSon",0.65,"W"]
["FET Gate Charge at VGS:","Qg",192,"nC"]
["FET Rise Time:","tr",15,"ns"]
["FET Fall Time:","tf",10,"ns"]
["FET Output Capacitance:","COSS",48,"pF"]
["FET Maximum Junction Temperature:","TJ(max)",125,"°C"]
["FET Thermal Resistance, Junction to Case:","RqJC(FET)",0.73,"°C/W"]
["FET Thermal Resistance, Case to Heatsink:","RqCHS(FET)",0.7,"°C/W"]
["Gate Drive Losses (actually dissipated in the gate drive circuitry):","PGATE",{"$f":"Vgs*Qg*(nC)*fsw*kHz","v":0.12104300109813362},"W"]
["FET Conduction Losses:","PCOND",{"$f":"(Ids_rms^2)*(Rds_on)","v":99.880496280407314},"W"]
["FET Switching Losses:","PSW",{"$f":"((fsw*kHz)/2)*(((tr_FET+tf_FET)*ns*Vout*Iin_peak_max)+(Coss*picoF*Vout^2))","v":7.6555747510561112},"W"]
["FET Losses, Total:","PFET",{"$f":"P_FETcond+P_FETsw","v":107.53607103146342},"W"]
["Required Heat Sink Thermal Impedance:","RqHS_AMB(FET)",{"$f":"((Tj_FET-Tamb)/P_FET)-Rth_jc_FET-Rth_CHS_FET","v":-0.73255960366958039},"°C/W"]
[]
[]
["CURRENT SENSE RESISTOR:"]
["Ideal Value for RSENSE, for 110% Inductor SOC Threshold:","RSENSE(ideal)",{"$f":"0.259/(Il_peak_actual*1.1)","v":8.1616954964303726E-3},"W"]
["Actual Value for RSENSE: Current Sense Resistor:","RSENSE",3.0000000000000001E-3,"W",{"$f":"IF(Rsense>0.259/I_Lpeak,\"DECREASE Rsense\",\"\")","v":""}]
["ICOMP Voltage at Vin_Min, ICOMP to be <5.7V to avoid ICOMP amp saturation","ICOMP ",{"$f":"VCOMP!Z7","v":4.2959868017841458},"V",{"$f":"IF(C118>5.7,\"DECREASE Rsense\",\"\")","v":""}]
["Inductor Current at Soft Over-Current Threshold:","IOVERCURRENT_SOC",{"$f":"0.259/Rsense","v":86.333333333333329},"A"]
["Power Dissipated in RSENSE:","PRsense",{"$f":"(Iin_rms_max^2)*Rsense","v":1.1105350210689318},"W"]
["Theoretical Output Over-Current Inception Point:","IOUT_OVERCURRENT",{"$f":"(((Isoc-((Vout*Dmax*(1-Dmax))/(fsw*kHz*Lbst*mH)/2))*Vacin_min*PF)/(SQRT(2))*eff)/Vout","v":24.93156979038649},"A"]
["Maximum ISENSE Peak Current Limit Threshold:","IPCL",{"$f":"0.438/Rsense","v":146},"A"]
["Resistance of Thermistor at 25°C:","RTHERM",60,"W"]
["Maximum Inrush Current:","IINRUSH",{"$f":"Vin_peak_max/C123","v":5.6568542494923806},"A"]
["Recommended ISENSE Series Resistor:","RISENSE",220,"W"]
["Recommended ISENSE Filter Capacitor:","CISENSE",{"$f":"data!F276","v":2200},{"$f":"data!G276","v":"pF"}]
[]
[]
["OUTPUT CAPACITOR:"]
["Required Minimum Output Voltage:","VOUT_HOLDUP(min)",400,"V",{"$f":"IF(Vout_holdup>Vout,\"ENTER A LOWER VALUE FOR THE MINIMUM HOLDUP VOLTAGE\",\"\")","v":""}]
["Desired Number of Line Cycles For Output Holdup Time  (typ one line cycle):","NHOLD_UP",1]
["Minimum Output Voltage Holdup Time:","tHold_UP(min)",{"$f":"Nholdup*((1/fline_min)/ms)","v":16.666666666666668},"ms"]
["Recommended Minimum Output Capacitor Value:","COUT(recommended)",{"$f":"data!F236","v":1800},{"$f":"data!G236","v":"µF"}]
["Actual Output Capacitor Value:","COUT",2000,{"$f":"data!G236","v":"µF"},{"$f":"IF(Cout<C133,\"INCREASE OUTPUT CAPACITANCE TO AT LEAST MINIMUM RECOMMENDED VALUE\",\"\")","v":""}]
["Output Voltage Peak to Peak Ripple:","VOUT_RIPPLEpp",{"$f":"Iout/(PI()*2*2*fline_min*Cout*uF)","v":5.3051647697298456},"V"]
[{"$f":"IF(Vout_ripplepp>=0.04*Vout,\"OUTPUT CAPACITOR must be sized larger so OVP/UVD is not triggered\",\"Good! Output voltage peak-peak ripple is less than 5% VOUT\")","v":"Good! Output voltage peak-peak ripple is less than 5% VOUT"}]
["Output Capacitor Ripple Current at Twice Line Frequency:","ICout_2fline",{"$f":"Iout/SQRT(2)","v":5.6568542494923797},"ARMS"]
["Output Capacitor High Frequency Ripple Current:","ICout_HF",{"$f":"Iout*SQRT(((16*Vout)/(3*PI()*Vin_peak_min))-1.5)","v":8.8190328128144859},"ARMS"]
["Total Output Capacitor Ripple Current:","ICout_RMS(total)",{"$f":"SQRT((Icout_2fline^2)+(Icout_HF^2))","v":10.477372750527614},"ARMS"]
[{"$f":"IF(Vout_ripplepp>0.04*Vout,\"OUTPUT CAPACITOR MUST BE INCREASED TO PREVENT OVP DURING NORMAL OPERATING RANGE\",\"\")","v":""}]
[]
["OUTPUT VOLTAGE SET POINT:"]
["Recommended Value for the Top Divider Resistor:","RFB1(recommended)",1,"MW"]
["Actual Value of the Top Divider Resistor:","RFB1(actual)",1,"MW",{"$f":"IF(R_fb1<0.953,\"RECOMMENDED VALUE IS GREATER THAN OR EQUAL TO 1M\",\"\")","v":""}]
["Recommended Value for the Bottom Divider Resistor (E48 Series):","RFB2(recommended)",{"$f":"data!F242","v":10.5},"kW"]
["Actual Value of the Bottom Divider Resistor:","RFB2(actual)",10.5,"kW"]
["Actual Nominal Output Voltage:","VOUT",{"$f":"VREF*((R_fb1*MegOhm)+(R_fb2*kOhms))/(R_fb2*kOhms)","v":481.1904761904762},"V",{"$f":"IF(Vout_min<Vin_peak_max,\"DO NOT PROCEED WITHOUT ADJUSTING THE RESISTOR DIVIDER IN ORDER TO ACHIEVE THE DESIRED OUTPUT VOLTAGE\",IF(Vout_nom>1.1*Vout,\"ADJUST BOTTOM DIVIDER RESISTOR FOR DESIRED OUTPUT VOLTAGE\",\"\"))","v":""}]
["Minimum Output Voltage with respect to VREF:","VOUT(min)",{"$f":"VREFmin*((R_fb1*MegOhm)+(R_fb2*kOhms))/(R_fb2*kOhms)","v":474.45380952380953},"V"]
["Maximum Output Voltage with respect to VREF:","VOUT(max)",{"$f":"VREFmax*((R_fb1*MegOhm)+(R_fb2*kOhms))/(R_fb2*kOhms)","v":487.92714285714288},"V"]
["OVP Set Point: Typical DC Output Voltage to Trigger OVP:","VOVP",{"$f":"(VREF*1.09)*((R_fb1*MegOhm)+(R_fb2*kOhms))/(R_fb2*kOhms)","v":524.49761904761908},"V"]
["UVD Set Point: Typical DC Output Voltage to Trigger UVD:","VUVD",{"$f":"(VREF*0.95)*((R_fb1*MegOhm)+(R_fb2*kOhms))/(R_fb2*kOhms)","v":457.13095238095241},"V"]
["Recommended Value for Filter Capacitor on VSENSE:","CVSENSE",{"$f":"data!F245","v":1000},{"$f":"data!G245","v":"pF"}]
["Power Dissipated in Voltage Divider:","PRfB1+RFB2",{"$f":"(Vout_nom^2)/((R_fb1*MegOhm)+(R_fb2*kOhms))","v":0.22913832199546486},"W"]
[{"$f":"IF(Vout_min<Vin_peak_max,\"DO NOT PROCEED UNTIL RFB2 IS DECREASED SO MINIMUM OUTPUT VOLTAGE > MAXIMUM RECTIFIED INPUT VOLTAGE\",\"\")","v":""}]
[]
["COMPENSATION:"]
[]
[]
[]
[]
[]
[]
[]
[]
[]
[]
[]
[]
[]
[]
[]
[]
[]
[]
[]
[]
[]
[]
[]
["The Loop will be Optimized at a Selected Specific Line Voltage.  For a Wide Input Range, Optimization is Recommended at the Mean of Min and Max Input.  For a Design with a Specific Nominal Line Voltage, Optimize at that Nominal Voltage. VCOMP at Any Line Voltage or as a Function of Load is Shown at Right",null,null,null,null,"To Determine VCOMP for a Specific Line Voltage at Full Load:"]
["Line Voltage for Optimized Loop Design:","VINnom",220,"V",null,null,"Enter Line Voltage for VCOMP calculation",null,"VLINE",220,"VRMS"]
["Open Loop Transfer Function for Current Loop:  ",null,null,null,null,null,"Resultant VCOMP at Full Load",null,"VCOMP at VLINE",{"$f":"VCOMP!B44","v":2.3408922604841584},"V"]
["Product of the Voltage Loop Variables:","M1M2",{"$f":"M1M2","v":9.6972842442998211E-2},"V/ms",null,null,"Resultant ICOMP at Full Load",null,"VCOMP at VLINE",{"$f":"VCOMP!B45","v":4.2690383054952452},"V",{"$f":"IF(J183>5.7,\"DECREASE Rsense\",\"\")","v":""}]
["VCOMP Voltage at VINnom:","VCOMP",{"$f":"data!H69","v":2.3408922604841584},"V",null,"To Determine VCOMP at Selected Line Voltage and at a Specific Load, enter a value from 1 to 100 for 1% to 100% load:"]
["Internal Current Loop Gain Factor M1:","M1",{"$f":"IF(Vcomp<1,(0.068),IF(Vcomp<2,(0.156*Vcomp-0.0088),IF(Vcomp<4.5,(0.313*Vcomp-0.401),IF(Vcomp<5,1.007,\"VCOMP MUST BE <5\"))))","v":0.3316992775315416}]
["Internal Voltage Loop PWM Ramp Slope M2:","M2",{"$f":"IF(Vcomp<=0.5,0,IF(Vcomp<4.6,(((fsw*kHz)/ftyp)*0.1223*(Vcomp-0.5)^2),IF(Vcomp<5,(((fsw*kHz)/ftyp)*2.056),\"VCOMP MUST BE <5\")))","v":0.29235168422631536},"V/ms",null,null,"Percentage of Full Load for VCOMP Calculation:",null,"% of Full Load:",100,"%"]
["Non-Linear Gain Voltage Loop Variable M3:","M3",{"$f":"IF(Vcomp<0.5,(0),IF(Vcomp<1,((fsw*kHz)/ftyp)*(0.0166328*Vcomp-0.0083164),IF(Vcomp<2,((fsw*kHz)/ftyp)*(0.0572364*Vcomp^2-0.0596824*Vcomp+0.0155321),IF(Vcomp<4.5,((fsw*kHz)/ftyp)*(0.1148397*Vcomp^2-0.1746444*Vcomp+0.058612275),IF(Vcomp<4.6,((fsw*kHz)/ftyp)*(0.24631222*Vcomp-0.1231561),IF(Vcomp<5,0,\"VCOMP MUST BE <5\"))))))","v":0.19686025190144327},"V/ms",null,null,"Resultant VCOMP at Selected Load",null,"VCOMP at %load selected",{"$f":"VCOMP!E45","v":2.3408922604841584},"V"]
["Maximum Recommended ICOMP Capacitor Value:","CICOMPmax(recommended)",{"$f":"data!F252","v":6800},{"$f":"data!G252","v":"pF"}]
["Minimum Recommended ICOMP Capacitor Value:","CICOMPmin(recommended)",{"$f":"data!F257","v":3300},{"$f":"data!G257","v":"pF"}]
["Actual Value Used for ICOMP Capacitor:","CICOMP(actual)",3300,"pF"]
["Resultant Actual Current Averaging Pole Frequency:","fIAVG(actual)",{"$f":"((gmi*M_1)/(K_1*2*PI()*Cicomp*picoF))/kHz","v":2.171082279532361},"kHz"]
[]
[]
[]
[]
[]
[]
[]
[]
[]
[]
[]
[]
[]
[]
[]
[]
[]
[]
[]
[]
[]
[]
[]
[]
[]
[]
[]
[]
[]
[]
[]
[]
[]
[]
[]
[]
[]
[]
[]
[]
[]
[]
[]
[]
[]
[]
[]
[]
[]
[]
[]
[]
[]
[]
[]
[]
[]
[]
[]
[]
[]
[]
[]
[]
["Open Loop Transfer Function for Voltage Loop:  "]
["PWM to Power Stage Pole:","fPWM_PS(pole)",{"$f":"1/((2*PI()*K_1*2.5*Rsense*(Vout_nom^3)*(Cout*uF))/(K_FQ*(M1M2/us)*(Vacin_nom^2)))","v":1.4566632686032948},"Hz"]
["Desired Voltage Loop Crossover Frequency ( fV < 20Hz):","fV",10,"Hz"]
["Open Loop Voltage Gain at Desired fV:","GVLdB(fV)",{"$f":"20*LOG(IMABS(IMPRODUCT((R_fb2*kOhms)/((R_fb1*MegOhm)+(R_fb2*kOhms)),IMDIV((M_3*Vout_nom)/(M1M2),COMPLEX(1,(2*PI()*fv)/(2*PI()*fPWM_PSpole))))))","v":3.3055541874371928},"dB",{"$f":"IF(fv>20,\"SET CROSSOVER FREQUENCY TO LESS THAN 20Hz\",\"\")","v":""}]
["Recommended Value for the Voltage Compensation Capacitor:","CVCOMP(recommended)",{"$f":"data!F262","v":8.1999999999999993},{"$f":"data!G262","v":"µF"}]
["Actual Value Used for CVCOMP Capacitor:","CVCOMP(actual)",8.1999999999999993,"mF"]
["Recommended Value for the Voltage Compensation Resistor:","RVCOMP(recommended)",{"$f":"data!F267","v":13.3},"kW"]
["Actual Value Used for RVCOMP Resistor:","RVCOMP(actual)",13,"kW"]
["Resultant Value of Voltage Compensation Zero:","fZERO",{"$f":"1/(2*PI()*(Rvcomp*kOhms)*(Cvcomp*uF))","v":1.4930107231885115},"Hz",{"$f":"IF(Rvcomp>1.1*C262,\"USE A SMALLER VALUE FOR VCOMP RESISTOR\",IF(Rvcomp<0.9*C262,\"USE A LARGER VALUE FOR VCOMP RESISTOR\",\"\"))","v":""}]
["Desired Voltage Compensation Pole (fPole < 50Hz):","fPOLE",40,"Hz"]
["Recommended Value for the Parallel Voltage Compensation Capacitor:","CVCOMP_P(recommended)",{"$f":"data!F271","v":0.32999999999999996},{"$f":"data!G271","v":"µF"},{"$f":"IF(fpole>50,\"POLE MUST BE < 50Hz\",\"\")","v":""}]
["Actual Value for the Parallel Voltage Compensation Capacitor:","CVCOMP_P(actual)",0.39,"mF",{"$f":"IF(Cvcomp_p<C266*0.75,\"USE LARGER PARALLEL CAPACITOR ON VCOMP\",IF(Cvcomp_p>1.25*C266,\"USE SMALLER PARALLEL CAPACITOR ON VCOMP\",\"\"))","v":""}]

{"sheet":"SCHEMATIC","index":1,"n_rows":103,"n_cols":5,"rows_kept":103,"cut":false,"hidden":false,"merged":[[99,1,100,1],[99,3,99,4],[100,3,100,4],[101,1,102,1],[101,3,101,4],[0,0,1,5],[66,1,67,1],[56,1,60,1],[64,1,65,1],[39,1,41,1],[38,2,38,4],[37,1,37,4],[39,3,39,4],[48,1,51,1],[52,1,55,1],[42,1,44,1],[73,3,73,4],[75,3,75,4],[77,3,77,4],[79,3,79,4],[45,3,45,4],[52,3,52,4],[56,3,56,4],[61,3,61,4],[64,3,64,4],[68,1,72,1],[61,1,63,1],[66,3,66,4],[68,3,68,4],[45,1,47,1],[73,1,74,1],[75,1,76,1],[77,1,78,1],[80,2,81,2],[79,1,81,1],[93,1,95,1],[96,3,96,4],[90,3,90,4],[86,3,86,4],[82,3,82,4],[84,3,84,4],[96,1,98,1],[93,3,93,4],[90,1,92,1],[91,2,92,2],[86,1,87,1],[88,1,89,1],[82,1,83,1],[84,1,85,1],[88,3,88,4]]}
["Typical Schematic for a PFC Continuous Conduction Mode Boost Converter Using the UCC28180"]
[]
[]
[]
[]
[]
[]
[]
[]
[]
[]
[]
[]
[]
[]
[]
[]
[]
[]
[]
[]
[]
[]
[]
[]
[]
[]
[]
[]
[]
[]
[]
[]
[]
[]
[]
[]
[null,"RECOMMENDED BILL OF MATERIALS"]
[null,"Reference Designator","Description/Comments"]
[null,"FUSE","Type:","Fast Acting"]
[null,null,"Voltage Rating:",{"$f":"IF(Vacin_max<270,250,350)","v":250},{"$f":"'DESIGN INPUTS AND CALCULATIONS'!D24","v":"VRMS"}]
[null,null,"Current Rating:",{"$f":"Ifuse","v":28.860028860028862},{"$f":"'DESIGN INPUTS AND CALCULATIONS'!D49","v":"A"}]
[null,"BRIDGE","DC Blocking Voltage:",{"$f":"Vrated","v":373.35238046649715},{"$f":"'DESIGN INPUTS AND CALCULATIONS'!D58","v":"V"}]
[null,null,"Current Rating:",{"$f":"Ibridge","v":25.983154867448949},{"$f":"'DESIGN INPUTS AND CALCULATIONS'!D57","v":"A"}]
[null,null,"Power Dissipation:",{"$f":"Pbridge","v":36.376416814428531},{"$f":"'DESIGN INPUTS AND CALCULATIONS'!D59","v":"W"}]
[null,"CIN","Type:","Film Capacitor, X2"]
[null,null,"Value:",{"$f":"IF(Cin=\"\",Cin_rcmd,Cin)","v":1},{"$f":"data!G228","v":"µF"}]
[null,null,"Volatge Rating:",{"$f":"Vacin_max","v":240},"VRMS"]
[null,"LBST","Inductor Value:",{"$f":"IF(Lbst=\"\",Lbst_rcmd,Lbst)","v":0.79},{"$f":"'DESIGN INPUTS AND CALCULATIONS'!D77","v":"mH"}]
[null,null,"Peak Current Rating:",{"$f":"Il_peak_actual","v":28.84872947753621},{"$f":"'DESIGN INPUTS AND CALCULATIONS'!D79","v":"A"}]
[null,null,"Ripple Current:",{"$f":"Iripple_actual","v":3.2784666559634199},{"$f":"'DESIGN INPUTS AND CALCULATIONS'!D78","v":"A"}]
[null,null,"Maximum Duty Cycle:",{"$f":"Dmax","v":0.37476874084557898}]
[null,"DBOOST","Type:","Diode, Low Reverse Recovery Charge, Schottky"]
[null,null,"Average Current Rating:",{"$f":"Iin_avg_max","v":17.322103244965966},{"$f":"'DESIGN INPUTS AND CALCULATIONS'!D48","v":"A"}]
[null,null,"Volatge Rating:",{"$f":"Vdiode_blocking","v":522.5},{"$f":"'DESIGN INPUTS AND CALCULATIONS'!D33","v":"V"}]
[null,null,"Power Dissipation:",{"$f":"Pdiode","v":14.755062500000001},{"$f":"'DESIGN INPUTS AND CALCULATIONS'!D91","v":"W"}]
[null,"QFET","Type:","MOSFET, Nchannel"]
[null,null,"RMS Drain Current Rating:",{"$f":"Ids_rms","v":12.396059937329175},{"$f":"'DESIGN INPUTS AND CALCULATIONS'!D99","v":"A"}]
[null,null,"Peak Current Rating:",{"$f":"Il_peak_actual","v":28.84872947753621},{"$f":"'DESIGN INPUTS AND CALCULATIONS'!D79","v":"A"}]
[null,null,"Voltage Rating:",{"$f":"Vin_peak_max","v":339.41125496954282},{"$f":"'DESIGN INPUTS AND CALCULATIONS'!D28","v":"V"}]
[null,null,"Power Dissipation:",{"$f":"P_FET","v":107.53607103146342},{"$f":"'DESIGN INPUTS AND CALCULATIONS'!D111","v":"W"}]
[null,"RSENSE","Type:","Resistor, Low Inductance"]
[null,null,"Value:",{"$f":"IF(Rsense=\"\",Rsense_ideal,Rsense)","v":3.0000000000000001E-3},"W"]
[null,null,"Power Dissipation:",{"$f":"P_Rsense","v":1.1105350210689318},{"$f":"'DESIGN INPUTS AND CALCULATIONS'!D120","v":"W"}]
[null,"RISENSE","Type:","Resistor, Chip, 1/16W"]
[null,null,"Value:",{"$f":"Risense","v":220},"W"]
[null,"CISENSE","Type:","Capacitor, Ceramic, 100V, X7R, ±10%"]
[null,null,"Value:",{"$f":"Cisense","v":2200},{"$f":"'DESIGN INPUTS AND CALCULATIONS'!D126","v":"pF"}]
[null,"COUT","Type:","Capacitor, Aluminum, ±20% "]
[null,null,"Value:",{"$f":"IF(Cout=\"\",Cout_rcmd,Cout)","v":2000},{"$f":"'DESIGN INPUTS AND CALCULATIONS'!D133","v":"µF"}]
[null,null,"Voltage Rating:",{"$f":"Vovp","v":524.49761904761908},"V"]
[null,null,"2 x fLINE Ripple Current Rating:",{"$f":"Icout_2fline","v":5.6568542494923797},"ARMS"]
[null,null,"HF Ripple Current Rating:",{"$f":"Icout_HF","v":8.8190328128144859},"ARMS"]
[null,"RFB1","Type:","Resistor, Chip, Total Voltage Rating 400V, ±1%"]
[null,null,"Value:",{"$f":"IF(R_fb1=\"\",Rfb1_rcmd,R_fb1)","v":1},"MW"]
[null,"RFB2","Type:","Resistor, Chip, 1/10W, ±1%"]
[null,null,"Value:",{"$f":"IF(R_fb2=\"\",R_fb2_rcmd,R_fb2)","v":10.5},"kW"]
[null,"CVSENSE","Type:","Capacitor, Ceramic, 50V, X7R, ±10%"]
[null,null,"Value:",{"$f":"Cvsense","v":1000},"pF"]
[null,"CICOMP","Type:","Capacitor, Ceramic, 50V, X7R, ±10%"]
[null,null,"Recommended Values:",{"$f":"Cicomp_minrcmd","v":3300},"pF min"]
[null,null,null,{"$f":"Cicomp_maxrcmd","v":6800},"pF min"]
[null,"CVCOMP","Type:","Capacitor, Ceramic, 10V, X5R, ±10%"]
[null,null,"Value:",{"$f":"IF(Cvcomp=\"\",Cvcomp_rcmd,Cvcomp)","v":8.1999999999999993},"mF"]
[null,"RVCOMP","Type:","Resistor, Chip, 1/10W, ±1%"]
[null,null,"Value:",{"$f":"IF(Rvcomp=\"\",Rvcomp_rcmd,Rvcomp)","v":13},"kW"]
[null,"CVCOMP_P","Type:","Capacitor, Ceramic, 10V, X5R, ±10%"]
[null,null,"Value:",{"$f":"IF(Cvcomp_p=\"\",Cvcomp_p_rcmd,Cvcomp_p)","v":0.39},"mF"]
[null,"RFREQ","Type:","Resistor, Chip, 1/10W, ±1%"]
[null,null,"Value:",{"$f":"IF(Rfreq=\"\",Rfreq_rcmd,Rfreq)","v":47},"kΩ"]
[null,"CVCC","Type:","Ceramic, Low ESR/ESL, placed close to the VCC and GND pins with short traces"]
[null,null,"Values:",0.1,"mF min"]
[null,null,null,1,"mF max"]
[null,"DSTART","Type:","Diode, Switching"]
[null,null,"Average Current Rating:",{"$f":"Iinrush","v":5.6568542494923806},"A"]
[null,null,"Volatge Rating:",{"$f":"Vovp","v":524.49761904761908},"V"]
[null,"DTURNOFF","Type:","Diode, Schottky"]
[null,null,"Average Current Rating:",2,"A"]
[null,null,"Volatge Rating:",40,"V"]
[null,"RGATE","Type:","Resistor, Chip, 1/10W, ±1%"]
[null,null,"Value:","As Needed"]
[null,"RGATE2","Type:","Resistor, Chip, 1/10W, ±1%"]
[null,null,"Value:",10,"kΩ"]

{"sheet":"data","index":2,"n_rows":278,"n_cols":25,"rows_kept":278,"cut":false,"hidden":true,"merged":[[35,9,35,10],[37,9,37,10],[47,9,47,10],[58,9,58,10],[63,9,63,10],[67,9,67,10],[110,15,110,16],[110,17,110,19],[111,12,111,13],[166,0,166,3],[111,10,111,11],[109,6,109,14],[110,0,112,0],[111,3,111,4],[110,6,112,6],[110,14,111,14],[179,0,179,2],[231,0,231,2],[232,0,232,2],[245,0,245,2],[109,0,109,5],[1,0,1,3],[67,6,67,7],[33,6,33,7],[35,6,35,7],[37,6,37,7],[47,6,47,7],[58,6,58,7],[63,6,63,7]]}
[]
["Data for M1M2 vs VCOMP table"]
[]
["VCOMP","M1","M2","M1M2"]
[0,{"$f":"IF(A5<1,(0.068),IF(A5<2,(0.156*A5-0.088),IF(A5<4.5,(0.313*A5-0.401),IF(A5<=5,1.007,\"VCOMP MUST BE < 5\"))))","v":6.8000000000000005E-2},{"$f":"IF(A5<=0.5,0,IF(A5<4.6,((fSW_target/65)*0.1223*(A5-0.5)^2),IF(A5<=5,((fSW_target/65)*2.056),\"VCOMP MUST BE < 5\")))","v":0},{"$f":"B5*C5","v":0},null,null,"mV factor",{"$f":"10^-3","v":1E-3}]
[{"$f":"A5+0.05","v":0.05},{"$f":"IF(A6<1,(0.068),IF(A6<2,(0.156*A6-0.088),IF(A6<4.5,(0.313*A6-0.401),IF(A6<=5,1.007,\"VCOMP MUST BE < 5\"))))","v":6.8000000000000005E-2},0,{"$f":"B6*C6","v":0},null,null,"uF factor",{"$f":"(10^-6)","v":9.9999999999999995E-7}]
[{"$f":"A6+0.05","v":0.1},6.8000000000000005E-2,0,0,null,null,"kHz factor",{"$f":"10^3","v":1000}]
[0.15000000000000002,6.8000000000000005E-2,0,0,null,null,"mΩ factor",{"$f":"10^-3","v":1E-3}]
[0.2,6.8000000000000005E-2,0,0,null,null,"ms factor",{"$f":"10^-3","v":1E-3}]
[0.25,6.8000000000000005E-2,0,0,null,null,"mA factor",{"$f":"10^-3","v":1E-3}]
[0.3,6.8000000000000005E-2,0,0,null,null,"us factor",{"$f":"10^-6","v":9.9999999999999995E-7}]
[0.35,6.8000000000000005E-2,0,0,null,null,"uH factor",{"$f":"10^-6","v":9.9999999999999995E-7}]
[0.39999999999999997,6.8000000000000005E-2,0,0,null,null,"ns factor",{"$f":"10^-9","v":1.0000000000000001E-9}]
[0.44999999999999996,6.8000000000000005E-2,0,0,null,null,"mW factor",{"$f":"10^-3","v":1E-3}]
[0.49999999999999994,6.8000000000000005E-2,0,0,null,null,"pF factor",{"$f":"10^-12","v":9.9999999999999998E-13}]
[0.54999999999999993,6.8000000000000005E-2,2.1167307692307639E-4,1.4393769230769196E-5,null,null,"MHz factor",{"$f":"10^6","v":1000000}]
[0.6,6.8000000000000005E-2,8.4669230769230731E-4,5.75750769230769E-5,null,null,"uA factor",{"$f":"10^-6","v":9.9999999999999995E-7}]
[0.65,6.8000000000000005E-2,1.9050576923076929E-3,1.2954392307692312E-4,null,null,"kΩ factor",{"$f":"10^3","v":1000}]
[0.70000000000000007,6.8000000000000005E-2,3.3867692307692336E-3,2.303003076923079E-4,null,null,"nC factor",{"$f":"10^-9","v":1.0000000000000001E-9}]
[0.75000000000000011,6.8000000000000005E-2,5.2918269230769277E-3,3.598442307692311E-4,null,null,"nF factor",{"$f":"10^-9","v":1.0000000000000001E-9}]
[0.80000000000000016,6.8000000000000005E-2,7.6202307692307776E-3,5.1817569230769289E-4,null,null,"uC factor",{"$f":"10^-6","v":9.9999999999999995E-7}]
[0.8500000000000002,6.8000000000000005E-2,1.0371980769230781E-2,7.0529469230769313E-4,null,null,"MΩ factor",{"$f":"10^6","v":1000000}]
[0.90000000000000024,6.8000000000000005E-2,1.3547076923076941E-2,9.2120123076923203E-4,null,null,"mH factor",{"$f":"10^-3","v":1E-3}]
[0.95000000000000029,6.8000000000000005E-2,1.7145519230769256E-2,1.1658953076923095E-3]
[1.0000000000000002,6.8000000000000033E-2,2.1167307692307711E-2,1.439376923076925E-3]
[1.0500000000000003,7.5800000000000034E-2,2.5612442307692333E-2,1.9414231269230797E-3]
[1.1000000000000003,8.3600000000000063E-2,3.048092307692311E-2,2.5482051692307739E-3]
[1.1500000000000004,9.1400000000000065E-2,3.5772750000000041E-2,3.269629350000006E-3]
[1.2000000000000004,9.9200000000000066E-2,4.1487923076923124E-2,4.1156019692307763E-3]
[1.2500000000000004,0.10700000000000007,4.762644230769237E-2,5.0960293269230869E-3]
[1.3000000000000005,0.11480000000000007,5.4188307692307765E-2,6.2208177230769351E-3,null,null,"K1",7]
[1.3500000000000005,0.1226000000000001,6.1173519230769309E-2,7.4998734576923231E-3,null,null,"KFQ",{"$f":"1/(fsw*kHz)","v":2.1810430805988223E-5}]
[1.4000000000000006,0.1304000000000001,6.8582076923077023E-2,8.9431028307692499E-3,null,null,"fTYP",{"$f":"65*kHz","v":65000},null,"VINnom",{"$f":"(Vacin_min+Vacin_max)/2","v":225}]
[{"$f":"A33+0.05","v":1.4500000000000006},0.1382000000000001,7.641398076923088E-2,1.0560412142307716E-2]
[1.5000000000000007,0.1460000000000001,8.4669230769230885E-2,1.2361707692307718E-2,null,null,"M1M2",{"$f":"(Iout*(Vout_nom^2)*2.5*Rsense*K_1)/(eff*(VINnom^2)*K_FQ)*us","v":9.6972842442998211E-2},null,"M1M2",{"$f":"(Iout*(Vout_nom^2)*2.5*Rsense*K_1)/(eff*(Vacin_nom^2)*K_FQ)*us","v":9.271082615784916E-2}]
[1.5500000000000007,0.1538000000000001,9.3347826923077068E-2,1.4356895780769263E-2]
[1.6000000000000008,0.16160000000000013,{"$f":"IF(A37<=0.5,0,IF(A37<4.6,((fSW_target/65)*0.1223*(A37-0.5)^2),IF(A37<=5,((fSW_target/65)*2.056),\"VCOMP MUST BE < 5\")))","v":0.10244976923076939},1.6555882707692347E-2,null,null,"VCOMP1",{"$f":"(1*10^-9*(5*10^8*SQRT(fsw*kHz)+(1.09655978*10^10)*SQRT(ftyp)*SQRT(M1M2)))/SQRT(fsw*kHz)","v":4.565801537941474},null,"VCOMP1",{"$f":"(1*10^-9*(5*10^8*SQRT(fsw*kHz)+(1.09655978*10^10)*SQRT(ftyp)*SQRT(M1M2)))/SQRT(fsw*kHz)","v":4.565801537941474}]
[1.6500000000000008,0.16940000000000013,0.11197505769230785,1.8968574773076965E-2]
[1.7000000000000008,0.17720000000000016,0.12192369230769248,2.1604878276923128E-2,null,null,"a1",0.156,null,"a1",0.156]
[1.7500000000000009,0.18500000000000014,0.13229567307692328,2.4474699519230824E-2,null,null,"b1",8.7999999999999995E-2,null,"b1",8.7999999999999995E-2]
[1.8000000000000009,0.19280000000000017,0.14309100000000022,2.7587944800000066E-2,null,null,"c1",0.12230000000000001,null,"c1",0.12230000000000001]
[1.850000000000001,0.20060000000000014,0.15430967307692331,3.0954520419230837E-2,null,null,"d1",0.5,null,"d1",0.5]
[1.900000000000001,0.20840000000000017,0.16595169230769255,3.4584332676923159E-2,null,null,"K1V2",{"$f":"(b_1^3/(27*a_1^3))-(d_1^3/27)+SQRT((ftyp)^2*M1M2^2/(4*a_1^2*c_1^2*(fsw*kHz)^2))+(b_1^3*(ftyp)*M1M2/(27*a_1^4*c_1*(fsw*kHz))-(d_1^3*(ftyp)*M1M2/(27*a_1*c_1*(fsw*kHz)))+(b_1*d_1^2*(ftyp)*M1M2/(9*a_1^2*c_1*(fsw*kHz)))-(b_1^2*d_1*(ftyp)*M1M2/(9*a_1^3*c_1*(fsw*kHz))))","v":3.6049430642367333},null,"K1V2",{"$f":"(b_1^3/(27*a_1^3))-(d_1^3/27)+SQRT((ftyp)^2*M1M2^2/(4*a_1^2*c_1^2*(fsw*kHz)^2))+(b_1^3*(ftyp)*M1M2/(27*a_1^4*c_1*(fsw*kHz))-(d_1^3*(ftyp)*M1M2/(27*a_1*c_1*(fsw*kHz)))+(b_1*d_1^2*(ftyp)*M1M2/(9*a_1^2*c_1*(fsw*kHz)))-(b_1^2*d_1*(ftyp)*M1M2/(9*a_1^3*c_1*(fsw*kHz))))","v":3.6049430642367333}]
[1.9500000000000011,0.2162000000000002,0.17801705769230797,3.8487287873077015E-2,null,null,"K2V2",{"$f":"(b_1*d_1^2/(9*a_1))-(b_1^2*d_1/(9*a_1^2))+(ftyp*M1M2/(2*a_1*c_1*fsw*kHz))","v":3.6008451865405688},null,"K2V2",{"$f":"(b_1*d_1^2/(9*a_1))-(b_1^2*d_1/(9*a_1^2))+(ftyp*M1M2/(2*a_1*c_1*fsw*kHz))","v":3.6008451865405688}]
[2.0000000000000009,0.22500000000000031,0.19050576923076948,4.2863798076923192E-2,null,null,"K3V2",{"$f":"(d_1^2/9)+(b_1^2/(9*a_1^2))-(2*b_1*d_1/(9*a_1))","v":4.5657096939147324E-4},null,"K3V2",{"$f":"(d_1^2/9)+(b_1^2/(9*a_1^2))-(2*b_1*d_1/(9*a_1))","v":4.5657096939147324E-4}]
[2.0500000000000007,0.24065000000000025,0.20341782692307711,4.8952500049038561E-2,null,null,"K4V2",{"$f":"((b_1*c_1*fsw*kHz)+(2*a_1*c_1*d_1*fsw*kHz))/(3*a_1*c_1*fsw*kHz)","v":0.5213675213675214},null,"K4V2",{"$f":"((b_1*c_1*fsw*kHz)+(2*a_1*c_1*d_1*fsw*kHz))/(3*a_1*c_1*fsw*kHz)","v":0.5213675213675214}]
[2.1000000000000005,0.25630000000000019,0.21675323076923095,5.5553853046153935E-2,null,null,"VCOMP2",{"$f":"(K_1V2+K_2V2)^(1/3)+(K_3V2/(K_1V2^(1/3)))+K_4V2","v":2.4531613714505833},null,"VCOMP2",{"$f":"(K_1V2+K_2V2)^(1/3)+(K_3V2/(K_1V2^(1/3)))+K_4V2","v":2.4531613714505833}]
[2.1500000000000004,0.27195000000000014,0.23051198076923088,6.268773317019237E-2]
[2.2000000000000002,0.28760000000000008,0.24469407692307699,7.0374016523076954E-2,null,null,"a2",0.313,null,"a2",0.313]
[2.25,0.30325000000000002,0.25929951923076927,7.8632579206730793E-2,null,null,"b2",0.40100000000000002,null,"b2",0.40100000000000002]
[2.2999999999999998,0.31889999999999996,0.27432830769230765,8.74832973230769E-2,null,null,"c2",0.12230000000000001,null,"c2",0.12230000000000001]
[2.3499999999999996,0.3345499999999999,0.28978044230769218,9.6946046974038386E-2,null,null,"d2",0.5,null,"d2",0.5]
[2.3999999999999995,0.35019999999999984,0.30565592307692291,0.10704070426153836,null,null,"K1V3",{"$f":"(b_2^3/(27*a_2^3))-(d_2^3/27)","v":7.3252235055858844E-2},null,"K1V3",{"$f":"(b_2^3/(27*a_2^3))-(d_2^3/27)","v":7.3252235055858844E-2}]
[2.4499999999999993,0.36584999999999979,0.32195474999999979,0.11778714528749985,null,null,"K2V3",{"$f":"(ftyp^2*M1M2^2/(4*a_2^2*c_2^2*(fsw*kHz)^2))+(b_2^3*ftyp*M1M2/(27*a_2^4*c_2*(fsw*kHz)))-(d_2^3*ftyp*M1M2/(27*a_2*c_2*(fsw*kHz)))+(b_2*d_2^2*ftyp*M1M2/(9*a_2^2*c_2*(fsw*kHz)))-(b_2^2*d_2*ftyp*M1M2/(9*a_2^3*c_2*(fsw*kHz)))","v":3.2878379164164269},null,"K2V3",{"$f":"(ftyp^2*M1M2^2/(4*a_2^2*c_2^2*(fsw*kHz)^2))+(b_2^3*ftyp*M1M2/(27*a_2^4*c_2*(fsw*kHz)))-(d_2^3*ftyp*M1M2/(27*a_2*c_2*(fsw*kHz)))+(b_2*d_2^2*ftyp*M1M2/(9*a_2^2*c_2*(fsw*kHz)))-(b_2^2*d_2*ftyp*M1M2/(9*a_2^3*c_2*(fsw*kHz)))","v":3.2878379164164269}]
[2.4999999999999991,0.38149999999999973,0.33867692307692282,0.12920524615384596,null,null,"K3V3",{"$f":"(b_2*d_2^2/(9*a_2))-(b_2^2*d_2/(9*a_2^2))+(ftyp*M1M2/(2*a_2*c_2*(fsw*kHz)))","v":1.7400733218653597},null,"K3V3",{"$f":"(b_2*d_2^2/(9*a_2))-(b_2^2*d_2/(9*a_2^2))+(ftyp*M1M2/(2*a_2*c_2*(fsw*kHz)))","v":1.7400733218653597}]
[2.5499999999999989,0.39714999999999967,0.35582244230769194,0.14131488296249975,null,null,"K4V3",{"$f":"(d_2^2/9)+(b_2^2/(9*a_2^2))-(2*b_2*d_2/(9*a_2))","v":6.7799508007635123E-2},null,"K4V3",{"$f":"(d_2^2/9)+(b_2^2/(9*a_2^2))-(2*b_2*d_2/(9*a_2))","v":6.7799508007635123E-2}]
[2.5999999999999988,0.41279999999999961,0.37339130769230727,0.15413593181538429,null,null,"K5V3",{"$f":"(b_2*c_2*(fsw*kHz)+2*a_2*c_2*d_2*(fsw*kHz))/(3*a_2*c_2*(fsw*kHz))","v":0.76038338658146953},null,"K5V3",{"$f":"(b_2*c_2*(fsw*kHz)+2*a_2*c_2*d_2*(fsw*kHz))/(3*a_2*c_2*(fsw*kHz))","v":0.76038338658146953}]
[2.6499999999999986,0.42844999999999955,0.39138351923076875,0.1676882688144227,null,null,"VCOMP3",{"$f":"((K_1V3+SQRT(K_2V3)+K_3V3)^(1/3))+(K_4V3/((K_1V3+SQRT(K_2V3)+K_3V3)^(1/3)))+K_5V3","v":2.3408922604841584},null,"VCOMP3",{"$f":"((K_1V3+SQRT(K_2V3)+K_3V3)^(1/3))+(K_4V3/((K_1V3+SQRT(K_2V3)+K_3V3)^(1/3)))+K_5V3","v":2.3408922604841584}]
[2.6999999999999984,0.4440999999999995,0.40979907692307632,0.18199177006153799]
[2.7499999999999982,0.45974999999999944,0.4286379807692301,0.19706631165865329,null,null,"a3",1.0069999999999999,null,"a3",1.0069999999999999]
[{"$f":"A60+0.05","v":2.799999999999998},0.47539999999999938,0.44790023076923002,0.21293176970769168,null,null,"b3",0.12230000000000001,null,"b3",0.12230000000000001]
[2.8499999999999979,0.49104999999999932,0.4675858269230761,0.2296080203105762,null,null,"c3",0.5,null,"c3",0.5]
[2.8999999999999977,0.50669999999999926,0.48769476923076832,0.24711493956922995,null,null,"VCOMP4",{"$f":"c_3+(SQRT(ftyp)*SQRT(M1M2)/(SQRT(a_3)*SQRT(b_3)*SQRT(fsw*kHz)))","v":1.556539891829104},null,"VCOMP4",{"$f":"c_3+(SQRT(ftyp)*SQRT(M1M2)/(SQRT(a_3)*SQRT(b_3)*SQRT(fsw*kHz)))","v":1.556539891829104}]
[2.9499999999999975,0.5223499999999992,0.50822705769230669,0.265472403585576]
[2.9999999999999973,0.53799999999999915,0.52918269230769122,0.28470028846153744,null,null,"a4",1.0069999999999999,null,"a4",1.0069999999999999]
[3.0499999999999972,0.55364999999999909,0.55056167307692183,0.30481847029903725,null,null,"b4",2.056,null,"b4",2.056]
[3.099999999999997,0.56929999999999903,0.57236399999999876,0.32584682519999875,null,null,"VCOMP5",{"$f":"(a_4*(fsw*kHz)*b_4/ftyp)","v":1.4604106126431646},null,"VCOMP5",{"$f":"(a_4*(fsw*kHz)*b_4/ftyp)","v":1.4604106126431646}]
[3.1499999999999968,0.58494999999999897,0.59458967307692168,0.34780522926634472]
[3.1999999999999966,0.60059999999999891,{"$f":"IF(A69<=0.5,0,IF(A69<4.6,((fSW_target/65)*0.1223*(A69-0.5)^2),IF(A69<=5,((fSW_target/65)*2.056),\"VCOMP MUST BE < 5\")))","v":0.61723869230769079},0.37071355859999844,null,null,"VCOMP =",{"$f":"IF(VCOMP1>=0.5,IF(VCOMP1<1,VCOMP1,IF(VCOMP2>=1,IF(VCOMP2<2,VCOMP2,IF(VCOMP3>=2,IF(VCOMP3<4.5,VCOMP3,IF(VCOMP4>=4.5,IF(VCOMP4<4.6,VCOMP4,VCOMP5))))))))","v":2.3408922604841584},null,"VCOMP =",{"$f":"IF(VCOMP1>=0.5,IF(VCOMP1<1,VCOMP1,IF(VCOMP2>=1,IF(VCOMP2<2,VCOMP2,IF(VCOMP3>=2,IF(VCOMP3<4.5,VCOMP3,IF(VCOMP4>=4.5,IF(VCOMP4<4.6,VCOMP4,VCOMP5))))))))","v":2.3408922604841584}]
[3.2499999999999964,{"$f":"IF(A70<1,(0.068),IF(A70<2,(0.156*A70-0.088),IF(A70<4.5,(0.313*A70-0.401),IF(A70<=5,1.007,\"VCOMP MUST BE < 5\"))))","v":0.61624999999999885},0.64031105769230612,{"$f":"B70*C70","v":0.39459168930288291}]
[{"$f":"A70+0.05","v":3.2999999999999963},0.6318999999999988,0.66380676923076753,0.41945949747692118]
[3.3499999999999961,0.64754999999999874,0.68772582692307505,0.44533685922403637]
[3.3999999999999959,0.66319999999999868,0.71206823076922887,0.47224365064615165]
[3.4499999999999957,0.67884999999999862,0.73683398076922879,0.50019974784518995]
[3.4999999999999956,0.69449999999999856,0.76202307692307469,0.52922502692307427]
[3.5499999999999954,0.7101499999999985,0.78763551923076691,0.5593393639817279]
[3.5999999999999952,0.72579999999999845,0.81367130769230533,0.59056263512307394]
[3.649999999999995,0.74144999999999839,0.84013044230768974,0.62291471644903518]
[3.6999999999999948,0.75709999999999833,0.86701292307692024,0.65641548406153483]
[3.7499999999999947,0.77274999999999827,0.89431874999999705,0.69108481406249622]
[3.7999999999999945,0.78839999999999821,0.92204792307692007,0.72694258255384214]
[3.8499999999999943,0.80404999999999816,0.95020044230768907,0.7640086656374957]
[3.8999999999999941,0.8196999999999981,0.97877630769230428,0.80230293941538]
[3.949999999999994,0.83534999999999804,1.0077755192307658,0.84184527998941827]
[3.9999999999999938,0.85099999999999798,1.0371980769230733,0.88265556346153329]
[4.0499999999999936,0.86664999999999792,1.0670439807692269,0.92475366593364827]
[4.0999999999999934,0.88229999999999786,1.0973132307692268,0.96815946350768645]
[{"$f":"A87+0.05","v":4.1499999999999932},0.89794999999999781,1.1280058269230728,1.0128928322855708]
[{"$f":"A88+0.05","v":4.1999999999999931},0.91359999999999775,1.1591217692307649,1.0589736483692243]
[4.2499999999999929,0.92924999999999769,1.1906610576923033,1.1064217878605702]
[4.2999999999999927,0.94489999999999763,1.2226236923076876,1.1552571268615313]
[4.3499999999999925,0.96054999999999757,1.2550096730769182,1.2054995414740308]
[4.3999999999999924,0.97619999999999751,1.2878189999999949,1.2571689077999919]
[4.4499999999999922,0.99184999999999746,1.321051673076918,1.3102851019413377]
[4.499999999999992,1.0074999999999974,1.3547076923076871,1.3648679999999911]
[4.5499999999999918,1.0069999999999999,1.388787057692302,1.3985085670961479]
[4.5999999999999917,1.0069999999999999,1.4232897692307636,1.4332527976153788]
[4.6499999999999915,1.0069999999999999,1.4233846153846155,1.4333483076923077]
[4.6999999999999913,1.0069999999999999,1.4233846153846155,1.4333483076923077]
[4.7499999999999911,1.0069999999999999,1.4233846153846155,1.4333483076923077]
[4.7999999999999909,1.0069999999999999,1.4233846153846155,1.4333483076923077]
[4.8499999999999908,1.0069999999999999,1.4233846153846155,1.4333483076923077]
[4.8999999999999906,1.0069999999999999,1.4233846153846155,1.4333483076923077]
[4.9499999999999904,1.0069999999999999,1.4233846153846155,1.4333483076923077]
[4.9999999999999902,1.0069999999999999,1.4233846153846155,1.4333483076923077]
[]
[]
[]
[]
["Data For Current Averaging Bode Plot",null,null,null,null,null,"Data For Open Loop Voltage Bode Plot",null,null,null,null,null,null,null,null,"Data for Closed Loop Voltage Bode Plot"]
["Log scale converter",null,null,null,null,null,"Log scale converter",null,null,null,null,null,null,null,"Total Open Loop Phase","EA Gain",null,"Total Closed Voltage Loop Bode Plot"]
[null,"frequency","w","Gain",null,"Phase",null,"frequency","w","Voltage Feedback Gain","PWM to Power Stage Gain",null,"Total Open Loop Gain",null,null,null,"dB",null,"dB","Phase Margin"]
[null,"Hz","rad",null,"dB","degrees",null,"Hz","rad","V/V",null,"dB",null,"dB","degrees",null,null,null,null,null,null,null,"1+sRVCOMPCVCOMP","s(CVCOMP+CVCOMP_P)","1+S(rvcompcvcompcvcomp_p/CVCOMP+CVCOMPP)"]
[1,{"$f":"10^A114","v":10},{"$f":"2*PI()*B114","v":62.831853071795862},{"$f":"IMDIV((K_1*2.5*Rsense*Vout_nom)/(K_FQ*M_1*(M_2/us)*Lbst*mH),IMPRODUCT((COMPLEX(0,C114*1)),COMPLEX(1,(C114/(2*PI()*fiavg*kHz)))))","v":"-1.10833105200573-240.62779068651i"},{"$f":"20*LOG(IMABS(D114))","v":47.627007807976938},{"$f":"IMARGUMENT(D114)*180/(PI())","v":-90.263902362787562},-2,{"$f":"10^G114","v":0.01},{"$f":"2*PI()*H114","v":6.2831853071795868E-2},{"$f":"(R_fb2*kOhms)/((R_fb1*MegOhm)+(R_fb2*kOhms))","v":1.0390895596239486E-2},{"$f":"IMDIV(((M_3/us)*Vout_nom)/(M1M2/us),COMPLEX(1,(I114/(2*PI()*fPWM_PSpole))))","v":"976.797336708604-6.70571818320918i"},{"$f":"20*LOG(IMABS(K114))","v":59.796294006945764},{"$f":"IMPRODUCT(J114,K114)","v":"10.1497991444239-0.0696784175395313i"},{"$f":"20*LOG(IMABS(M114))","v":20.129353631318079},{"$f":"180/PI()*IMARGUMENT(M114)","v":-0.39332960945376427},{"$f":"IMPRODUCT(gmv,IMDIV((COMPLEX(1,I114*(Rvcomp*kOhms)*(Cvcomp*uF))),IMPRODUCT((COMPLEX(0,data!I114*((Cvcomp*uF)+(Cvcomp_p*uF)))),(COMPLEX(1,I114*((Rvcomp*kOhms)*(Cvcomp*uF)*(Cvcomp_p*uF))/((Cvcomp*uF)+(Cvcomp_p*uF)))))))","v":"0.663395797877417-103.756625636576i"},{"$f":"20*LOG(IMABS(P114))","v":40.320494321538227},{"$f":"IMPRODUCT((M114),(P114))","v":"-0.496263381887562-1053.15513448383i"},{"$f":"20*LOG(IMABS(R114))","v":60.449847952856317},{"$f":"(180/PI()*IMARGUMENT(R114))+180","v":89.973001323097137},null,null,{"$f":"COMPLEX(1,I114*('DESIGN INPUTS AND CALCULATIONS'!C263*10^3)*('DESIGN INPUTS AND CALCULATIONS'!C261*10^-6))","v":"1+0.00669787553745344i"},{"$f":"COMPLEX(0,data!I114*(('DESIGN INPUTS AND CALCULATIONS'!C261*10^-6)+('DESIGN INPUTS AND CALCULATIONS'!C267*10^-6)))","v":"5.39725617886726E-07i"},{"$f":"COMPLEX(1,I114*(('DESIGN INPUTS AND CALCULATIONS'!C263*10^3)*('DESIGN INPUTS AND CALCULATIONS'!C261*10^-6)*('DESIGN INPUTS AND CALCULATIONS'!C267*10^-6))/(('DESIGN INPUTS AND CALCULATIONS'!C261*10^-6)+('DESIGN INPUTS AND CALCULATIONS'!C267*10^-6)))","v":"1+0.000304094465611972i"}]
[1.1000000000000001,{"$f":"10^A115","v":12.58925411794168},79.100616502201262,"-1.10831729959293-191.135076526582i",45.626953919438542,{"$f":"180/PI()*IMARGUMENT(D115)","v":-90.332232016593693},-1.9,{"$f":"10^G115","v":1.2589254117941664E-2},{"$f":"2*PI()*H115","v":7.9100616502201168E-2},1.0390895596239486E-2,"976.77041328666-8.44176633872517i",59.796174300899381,"10.1495193859574-0.0877175126735421i",20.129233925271702,-0.49516809099978243,{"$f":"IMPRODUCT(gmv,IMDIV((COMPLEX(1,I115*(Rvcomp*kOhms)*(Cvcomp*uF))),IMPRODUCT((COMPLEX(0,data!I115*((Cvcomp*uF)+(Cvcomp_p*uF)))),(COMPLEX(1,I115*((Rvcomp*kOhms)*(Cvcomp*uF)*(Cvcomp_p*uF))/((Cvcomp*uF)+(Cvcomp_p*uF)))))))","v":"0.663395761996279-82.4169110083424i"},38.320608035464033,"-0.496258288945249-836.550227436058i",58.449841960735746,89.966011004196673]
[1.2,15.848931924611136,99.581776203206175,"-1.10829550418657-151.82100226504i",43.626868513230512,-90.418252586560286,-1.8,1.5848931924611124E-2,9.9581776203206102E-2,1.0390895596239486E-2,"976.727745578547-10.6270899268272i",59.795984586359772,"10.149076030257-0.11042498192151i",20.129044210732037,-0.62337061570635255,{"$f":"IMPRODUCT(gmv,IMDIV((COMPLEX(1,I116*(Rvcomp*kOhms)*(Cvcomp*uF))),IMPRODUCT((COMPLEX(0,data!I116*((Cvcomp*uF)+(Cvcomp_p*uF)))),(COMPLEX(1,I116*((Rvcomp*kOhms)*(Cvcomp*uF)*(Cvcomp_p*uF))/((Cvcomp*uF)+(Cvcomp_p*uF)))))))","v":"0.663395705128509-65.4661974260739i"},36.32078825376712,"-0.496250217749025-664.494670547785i",56.449832464499167,89.957211037147815]
[1.3,19.952623149688804,125.36602861381597,"-1.10826096255129-120.591950183257i",41.626733156953065,-90.526543339443435,-1.7,1.9952623149688792E-2,0.12536602861381591,1.0390895596239486E-2,"976.660129453589-13.3777873914529i",59.79568392605217,"10.148373438162-0.139007192093276i",20.128743550424488,-0.7847589989844399,{"$f":"IMPRODUCT(gmv,IMDIV((COMPLEX(1,I117*(Rvcomp*kOhms)*(Cvcomp*uF))),IMPRODUCT((COMPLEX(0,data!I117*((Cvcomp*uF)+(Cvcomp_p*uF)))),(COMPLEX(1,I117*((Rvcomp*kOhms)*(Cvcomp*uF)*(Cvcomp_p*uF))/((Cvcomp*uF)+(Cvcomp_p*uF)))))))","v":"0.663395614999186-52.0017975804073i"},34.32107386514754,"-0.496237427204449-527.825878063371i",54.449817415572042,89.946133179482274]
[1.4,25.118864315095799,157.82647919764753,"-1.1082062221588-95.7848595706818i",39.626518640351463,-90.662867876228702,-1.6,2.511886431509578E-2,0.15782647919764742,1.0390895596239486E-2,"976.552984291852-16.8397888775276i",59.795207454209702,"10.1472601039727-0.174980488089104i",20.128267078581985,-0.98791691544687499,{"$f":"IMPRODUCT(gmv,IMDIV((COMPLEX(1,I118*(Rvcomp*kOhms)*(Cvcomp*uF))),IMPRODUCT((COMPLEX(0,data!I118*((Cvcomp*uF)+(Cvcomp_p*uF)))),(COMPLEX(1,I118*((Rvcomp*kOhms)*(Cvcomp*uF)*(Cvcomp_p*uF))/((Cvcomp*uF)+(Cvcomp_p*uF)))))))","v":"0.663395472153893-41.3066830813463i"},32.321526490049649,"-0.496217159172579-419.265738522303i",52.449793568631627,89.932188268548558]
[1.5,31.622776601683803,198.69176531592208,"-1.10811947555937-76.0786627719323i",37.626178676152989,-90.834479439007325,-1.5,3.1622776601683784E-2,0.19869176531592195,1.0390895596239486E-2,"976.383218801358-21.1963526995455i",59.794452404292471,"10.1454960884852-0.220249087922046i",20.127512028664807,-1.2436416320194437,{"$f":"IMPRODUCT(gmv,IMDIV((COMPLEX(1,I119*(Rvcomp*kOhms)*(Cvcomp*uF))),IMPRODUCT((COMPLEX(0,data!I119*((Cvcomp*uF)+(Cvcomp_p*uF)))),(COMPLEX(1,I119*((Rvcomp*kOhms)*(Cvcomp*uF)*(Cvcomp_p*uF))/((Cvcomp*uF)+(Cvcomp_p*uF)))))))","v":"0.663395245759484-32.8113000818175i"},30.322243755161942,"-0.496185045584334-333.033028836004i",50.44975578382676,89.914635229925565]
[1.6,39.810717055349755,250.13811247045734,"-1.1079820192791-60.4239337049087i",35.625639923715497,-91.050503929745517,-1.4,3.9810717055349727E-2,0.25013811247045714,1.0390895596239486E-2,"976.114279503234-26.677276919497i",59.79325599964681,"10.1427015683166-0.277200799262463i",20.126315624019089,-1.5655082788082708,{"$f":"IMPRODUCT(gmv,IMDIV((COMPLEX(1,I120*(Rvcomp*kOhms)*(Cvcomp*uF))),IMPRODUCT((COMPLEX(0,data!I120*((Cvcomp*uF)+(Cvcomp_p*uF)))),(COMPLEX(1,I120*((Rvcomp*kOhms)*(Cvcomp*uF)*(Cvcomp_p*uF))/((Cvcomp*uF)+(Cvcomp_p*uF)))))))","v":"0.663394886948836-26.0632384583952i"},28.323380300154739,"-0.496134171766141-264.535543180263i",48.449695924173817,89.892542376562716]
[1.7,50.118723362727238,314.90522624728607,"-1.10776423559552-47.9870024700138i",33.624786195522333,-91.322419431551651,-1.3,5.0118723362727206E-2,0.31490522624728584,1.0390895596239486E-2,"975.688342788553-33.5700468285609i",59.791360500935518,"10.1382757043838-0.348822851756447i",20.124420125307843,-1.9705714084339074,{"$f":"IMPRODUCT(gmv,IMDIV((COMPLEX(1,I121*(Rvcomp*kOhms)*(Cvcomp*uF))),IMPRODUCT((COMPLEX(0,data!I121*((Cvcomp*uF)+(Cvcomp_p*uF)))),(COMPLEX(1,I121*((Rvcomp*kOhms)*(Cvcomp*uF)*(Cvcomp_p*uF))/((Cvcomp*uF)+(Cvcomp_p*uF)))))))","v":"0.663394318273086-20.7031393224407i"},26.32518099102283,"-0.496053599390518-210.125541495112i",46.449601116330648,89.864739314146036]
[1.8,63.095734448019364,396.44219162950014,"-1.10741924703548-38.1055601346959i",31.623433471196535,-91.664654569116109,-1.2,6.3095734448019317E-2,0.39644219162949984,1.0390895596239486E-2,"975.014039496499-42.2329774115529i",59.788358031535864,"10.1312690892758-0.438838459001787i",20.121417655908136,-2.4802306751361418,{"$f":"IMPRODUCT(gmv,IMDIV((COMPLEX(1,I122*(Rvcomp*kOhms)*(Cvcomp*uF))),IMPRODUCT((COMPLEX(0,data!I122*((Cvcomp*uF)+(Cvcomp_p*uF)))),(COMPLEX(1,I122*((Rvcomp*kOhms)*(Cvcomp*uF)*(Cvcomp_p*uF))/((Cvcomp*uF)+(Cvcomp_p*uF)))))))","v":"0.663393416984754-16.4455578487448i"},24.32803335893486,"-0.495926044241221-166.905494433707i",44.449451014843007,89.829757637623885]
[1.9,79.432823472428197,499.09114934975059,"-1.10687291695206-30.2533898536675i",29.62129041031956,-92.095331207780859,-1.1000000000000001,7.9432823472428096E-2,0.49909114934974996,1.0390895596239486E-2,"973.947247869169-53.1099956173316i",59.783603686066172,"10.1201841688533-0.551860419576429i",20.116663310438465,-3.1212858614360957,{"$f":"IMPRODUCT(gmv,IMDIV((COMPLEX(1,I123*(Rvcomp*kOhms)*(Cvcomp*uF))),IMPRODUCT((COMPLEX(0,data!I123*((Cvcomp*uF)+(Cvcomp_p*uF)))),(COMPLEX(1,I123*((Rvcomp*kOhms)*(Cvcomp*uF)*(Cvcomp_p*uF))/((Cvcomp*uF)+(Cvcomp_p*uF)))))))","v":"0.663391988544034-13.0637622974478i"},22.332550207645934,"-0.495724242508834-132.573780169435i",42.44921351808437,89.785758733833305]
[2,100,628.31853071795865,"-1.10600814544161-24.0123468558674i",27.61789605243386,-92.637178400607667,-1,0.1,0.62831853071795862,1.0390895596239486E-2,"972.261270598333-66.7457806861962i",59.776079201391951,"10.1026653550544-0.693548438599763i",20.109138825764241,-3.927196216821101,{"$f":"IMPRODUCT(gmv,IMDIV((COMPLEX(1,I124*(Rvcomp*kOhms)*(Cvcomp*uF))),IMPRODUCT((COMPLEX(0,data!I124*((Cvcomp*uF)+(Cvcomp_p*uF)))),(COMPLEX(1,I124*((Rvcomp*kOhms)*(Cvcomp*uF)*(Cvcomp_p*uF))/((Cvcomp*uF)+(Cvcomp_p*uF)))))))","v":"0.663389724630657-10.3776597215966i"},20.339699281795735,"-0.495405308307756-105.302116243618i",40.448838107559951,89.730447735391479]
[2.1,125.89254117941677,791.0061650220124,"-1.10464033942072-19.0500965641407i",25.612521786130927,-93.3186412147532,-0.9,0.12589254117941667,0.79100616502201182,1.0390895596239486E-2,"969.60110066469-83.7980534856751i",59.76418033705535,"10.0750238070057-0.870736824937742i",20.097239961427668,-4.9395302664247653,{"$f":"IMPRODUCT(gmv,IMDIV((COMPLEX(1,I125*(Rvcomp*kOhms)*(Cvcomp*uF))),IMPRODUCT((COMPLEX(0,data!I125*((Cvcomp*uF)+(Cvcomp_p*uF)))),(COMPLEX(1,I125*((Rvcomp*kOhms)*(Cvcomp*uF)*(Cvcomp_p*uF))/((Cvcomp*uF)+(Cvcomp_p*uF)))))))","v":"0.663386136601412-8.24420535998024i"},18.351005650004367,"-0.494902079787147-83.638200009937i",38.448245611432043,89.660974656231502]
[2.2000000000000002,158.48931924611153,995.81776203206277,"-1.1024794294141-15.1024281266109i",23.604017747474892,-94.17519410485842,-0.8,0.15848931924611132,0.9958177620320614,1.0390895596239486E-2,"965.414704693377-105.040006592429i",59.745388433639505,"10.0315234035433-1.09145974193024i",20.078448058011848,-6.2095260314426497,{"$f":"IMPRODUCT(gmv,IMDIV((COMPLEX(1,I126*(Rvcomp*kOhms)*(Cvcomp*uF))),IMPRODUCT((COMPLEX(0,data!I126*((Cvcomp*uF)+(Cvcomp_p*uF)))),(COMPLEX(1,I126*((Rvcomp*kOhms)*(Cvcomp*uF)*(Cvcomp_p*uF))/((Cvcomp*uF)+(Cvcomp_p*uF)))))))","v":"0.663380450037782-6.54978497993406i"},16.368864710084175,"-0.494110113890295-66.4283743691847i",36.447312768096026,89.573828167363956]
[2.2999999999999998,199.52623149688802,1253.6602861381596,"-1.0990718822224-11.959206914919i",21.590573771709938,-95.250832058662894,-0.7,0.19952623149688795,1.2536602861381592,1.0390895596239486E-2,"958.853261791351-131.338780902444i",59.715770838382767,"9.96334413538762-1.36472756009467i",20.048830462755078,-7.7995438062803055,{"$f":"IMPRODUCT(gmv,IMDIV((COMPLEX(1,I127*(Rvcomp*kOhms)*(Cvcomp*uF))),IMPRODUCT((COMPLEX(0,data!I127*((Cvcomp*uF)+(Cvcomp_p*uF)))),(COMPLEX(1,I127*((Rvcomp*kOhms)*(Cvcomp*uF)*(Cvcomp_p*uF))/((Cvcomp*uF)+(Cvcomp_p*uF)))))))","v":"0.6633714376415-5.20416450106852i"},14.397019211619629,"-0.492868799065443-52.7562031448425i",34.44584967437472,89.464736299756325]
[2.4,251.18864315095806,1578.2647919764759,"-1.09371422106617-9.45322819711339i",19.569351388890691,-96.5996315782198,-0.6,0.25118864315095801,1.5782647919764756,1.0390895596239486E-2,"948.63482394203-163.583649981251i",59.669239972402089,"9.85716541453866-1.69978062820696i",20.0022995967744,-9.7839274512813148,{"$f":"IMPRODUCT(gmv,IMDIV((COMPLEX(1,I128*(Rvcomp*kOhms)*(Cvcomp*uF))),IMPRODUCT((COMPLEX(0,data!I128*((Cvcomp*uF)+(Cvcomp_p*uF)))),(COMPLEX(1,I128*((Rvcomp*kOhms)*(Cvcomp*uF)*(Cvcomp_p*uF))/((Cvcomp*uF)+(Cvcomp_p*uF)))))))","v":"0.663357154457575-4.13568469330048i"},12.441269006177416,"-0.49093552563821-41.8936897649679i",32.443568602951814,89.328604228795101]
[2.5,316.22776601683825,1986.917653159222,"-1.08532907593475-7.45139730740054i",17.535927177077518,-98.287108131541089,-0.5,0.31622776601683794,1.9869176531592203,1.0390895596239486E-2,"932.878409350636-202.519045899436i",59.596499757125414,"9.69344215554842-2.10435426219107i",19.929559381497725,-12.248315952610978,{"$f":"IMPRODUCT(gmv,IMDIV((COMPLEX(1,I129*(Rvcomp*kOhms)*(Cvcomp*uF))),IMPRODUCT((COMPLEX(0,data!I129*((Cvcomp*uF)+(Cvcomp_p*uF)))),(COMPLEX(1,I129*((Rvcomp*kOhms)*(Cvcomp*uF)*(Cvcomp_p*uF))/((Cvcomp*uF)+(Cvcomp_p*uF)))))))","v":"0.663334518396463-3.28744504528876i"},10.510485730734127,"-0.487954208917635-33.2625492070969i",30.44004511223185,89.159543926442367]
[2.6,398.10717055349761,2501.3811247045737,"-1.07229972091633-5.84779952391261i",15.483474727614649,-100.39078342858653,-0.4,0.3981071705534972,2.5013811247045714,1.0390895596239486E-2,"908.950832054473-248.41694832356i",59.483653254171585,"9.44481319799304-2.58127457436653i",19.816712878543893,-15.285697550314289,{"$f":"IMPRODUCT(gmv,IMDIV((COMPLEX(1,I130*(Rvcomp*kOhms)*(Cvcomp*uF))),IMPRODUCT((COMPLEX(0,data!I130*((Cvcomp*uF)+(Cvcomp_p*uF)))),(COMPLEX(1,I130*((Rvcomp*kOhms)*(Cvcomp*uF)*(Cvcomp_p*uF))/((Cvcomp*uF)+(Cvcomp_p*uF)))))))","v":"0.663298645821566-2.61427357229216i"},8.617966649025341,"-0.483426098329676-26.4034814684204i",28.434679527569244,88.951078450207547]
[2.7,501.18723362727269,3149.0522624728624,"-1.05227842674978-4.55834245600449i",13.401619466213337,-102.99883230591632,-0.3,0.50118723362727224,3.1490522624728596,1.0390895596239486E-2,"873.444249366822-300.521827180792i",59.310601237235957,"9.07586800430641-3.12269093062674i",19.643660861608254,-18.986560721498339,{"$f":"IMPRODUCT(gmv,IMDIV((COMPLEX(1,I131*(Rvcomp*kOhms)*(Cvcomp*uF))),IMPRODUCT((COMPLEX(0,data!I131*((Cvcomp*uF)+(Cvcomp_p*uF)))),(COMPLEX(1,I131*((Rvcomp*kOhms)*(Cvcomp*uF)*(Cvcomp_p*uF))/((Cvcomp*uF)+(Cvcomp_p*uF)))))))","v":"0.663241799568729-2.0803211785949i"},6.7830216956499987,"-0.476705049364593-20.9518195758163i",26.426682557258264,88.696606007873584]
[2.8,630.95734448019323,3964.4219162949989,"-1.0220342746092-3.51675199930795i",11.274967402066416,-106.20485823507846,-0.2,0.63095734448019325,3.9644219162949992,1.0390895596239486E-2,"822.521069411584-356.277062050556i",59.049719653836206,"8.54673055796302-3.70203775510226i",19.382779278208517,-23.419969498084569,{"$f":"IMPRODUCT(gmv,IMDIV((COMPLEX(1,I132*(Rvcomp*kOhms)*(Cvcomp*uF))),IMPRODUCT((COMPLEX(0,data!I132*((Cvcomp*uF)+(Cvcomp_p*uF)))),(COMPLEX(1,I132*((Rvcomp*kOhms)*(Cvcomp*uF)*(Cvcomp_p*uF))/((Cvcomp*uF)+(Cvcomp_p*uF)))))))","v":"0.663151724285803-1.65715243350037i"},5.0323546567919486,"-0.467061768258617-16.6182480632676i",24.415133935000462,88.390105554637728]
[2.9,794.32823472428208,4990.9114934975069,"-0.977506557804843-2.67175088710453i",9.0815095943715995,-110.09592571191342,-0.1,0.79432823472428149,4.990911493497503,1.0390895596239486E-2,"752.947391976486-410.58725485843i",58.665895672259907,"7.82379773948847-4.26636929838052i",18.998955296632218,-28.603930555980771,{"$f":"IMPRODUCT(gmv,IMDIV((COMPLEX(1,I133*(Rvcomp*kOhms)*(Cvcomp*uF))),IMPRODUCT((COMPLEX(0,data!I133*((Cvcomp*uF)+(Cvcomp_p*uF)))),(COMPLEX(1,I133*((Rvcomp*kOhms)*(Cvcomp*uF)*(Cvcomp_p*uF))/((Cvcomp*uF)+(Cvcomp_p*uF)))))))","v":"0.663009014688944-1.32223102398639i"},3.4002267141533808,"-0.453877415717933-13.1735094013647i",22.399182010785616,88.026723411566465]
[3,1000,6283.1853071795858,"-0.914369179364757-1.98517072226937i",6.7915285867816682,-114.73078653379109,0,1,6.2831853071795862,1.0390895596239486E-2,"663.939876011075-455.795028488421i",58.119536868981115,"6.89892993381127-4.73611855430818i",18.452596493353418,-34.469616211807015,{"$f":"IMPRODUCT(gmv,IMDIV((COMPLEX(1,I134*(Rvcomp*kOhms)*(Cvcomp*uF))),IMPRODUCT((COMPLEX(0,data!I134*((Cvcomp*uF)+(Cvcomp_p*uF)))),(COMPLEX(1,I134*((Rvcomp*kOhms)*(Cvcomp*uF)*(Cvcomp_p*uF))/((Cvcomp*uF)+(Cvcomp_p*uF)))))))","v":"0.662782960993535-1.05771910204985i"},1.9258165610170046,"-0.436989855246116-10.4361486537365i",20.378413054370441,87.602270957604063]
[3.1,1258.925411794168,7910.0616502201265,"-0.829458639744088-1.4304445183825i",4.3682601497717144,-120.10776294766613,0.1,1.2589254117941673,7.910061650220122,1.0390895596239486E-2,"559.176200583844-483.269636681715i",57.373736127604474,"5.81034152016859-5.02160433959229i",17.706795751976784,-40.835310201832058,{"$f":"IMPRODUCT(gmv,IMDIV((COMPLEX(1,I135*(Rvcomp*kOhms)*(Cvcomp*uF))),IMPRODUCT((COMPLEX(0,data!I135*((Cvcomp*uF)+(Cvcomp_p*uF)))),(COMPLEX(1,I135*((Rvcomp*kOhms)*(Cvcomp*uF)*(Cvcomp_p*uF))/((Cvcomp*uF)+(Cvcomp_p*uF)))))))","v":"0.662425005612222-0.849526335948825i"},0.64645849666086197,"-0.417069621091953-8.26247442507693i",18.353254248637647,87.11030098658857]
[3.2,1584.8931924611156,9958.17762032063,"-0.723043280295909-0.990468291902839i",1.7719557409984823,-126.12949800181487,0.2,1.5848931924611136,9.9581776203206172,1.0390895596239486E-2,"447.311711717163-486.688517579235i",56.404352030995028,"4.64796929542822-5.0571295740544i",16.737411655367339,-47.414120955449228,{"$f":"IMPRODUCT(gmv,IMDIV((COMPLEX(1,I136*(Rvcomp*kOhms)*(Cvcomp*uF))),IMPRODUCT((COMPLEX(0,data!I136*((Cvcomp*uF)+(Cvcomp_p*uF)))),(COMPLEX(1,I136*((Rvcomp*kOhms)*(Cvcomp*uF)*(Cvcomp_p*uF))/((Cvcomp*uF)+(Cvcomp_p*uF)))))))","v":"0.661858475894896-0.686557525965198i"},-0.41236512095464772,"-0.395712494969829-6.53820237251805i",16.325046534412685,86.536504750217645]
[3.3,1995.2623149688804,12536.602861381598,"-0.600866757948902-0.653814368544952i",-1.0319054220706541,-132.5835488030165,0.3,1.9952623149688797,12.536602861381592,1.0390895596239486E-2,"339.628558255119-465.205705381317i",55.208291353943153,"3.52904489033028-4.83390391539221i",15.541350978315457,-53.868274635379471,{"$f":"IMPRODUCT(gmv,IMDIV((COMPLEX(1,I137*(Rvcomp*kOhms)*(Cvcomp*uF))),IMPRODUCT((COMPLEX(0,data!I137*((Cvcomp*uF)+(Cvcomp_p*uF)))),(COMPLEX(1,I137*((Rvcomp*kOhms)*(Cvcomp*uF)*(Cvcomp_p*uF))/((Cvcomp*uF)+(Cvcomp_p*uF)))))))","v":"0.660962569073486-0.560117737380975i"},-1.245894741778268,"-0.37498874671816-5.17171018965971i",14.295456236537195,85.852873011128679]
[3.4,2511.8864315095811,15782.647919764762,"-0.473941465678334-0.409638710079516i",-4.0624401291455579,-139.16237590444288,0.4,2.5118864315095806,15.782647919764759,1.0390895596239486E-2,"245.833718403255-423.918413386488i",53.804663840866631,"2.55443250196356-4.40489197482249i",14.137723465238938,-59.890207385253241,{"$f":"IMPRODUCT(gmv,IMDIV((COMPLEX(1,I138*(Rvcomp*kOhms)*(Cvcomp*uF))),IMPRODUCT((COMPLEX(0,data!I138*((Cvcomp*uF)+(Cvcomp_p*uF)))),(COMPLEX(1,I138*((Rvcomp*kOhms)*(Cvcomp*uF)*(Cvcomp_p*uF))/((Cvcomp*uF)+(Cvcomp_p*uF)))))))","v":"0.659547610062079-0.463441357918689i"},-1.8723303049888202,"-0.356639266561908-4.08906564199743i",12.265393160250113,85.015402406927649]
[3.5,3162.2776601683804,19869.176531592209,"-0.355068696481635-0.243774721194751i",-7.3165633441687916,-145.52820142371195,0.5,3.1622776601683795,19.869176531592203,1.0390895596239486E-2,"170.991186568897-371.20563209572i",52.22798659930131,"1.77675156751452-3.85715896784271i",12.561046223673621,-65.26743619229012,{"$f":"IMPRODUCT(gmv,IMDIV((COMPLEX(1,I139*(Rvcomp*kOhms)*(Cvcomp*uF))),IMPRODUCT((COMPLEX(0,data!I139*((Cvcomp*uF)+(Cvcomp_p*uF)))),(COMPLEX(1,I139*((Rvcomp*kOhms)*(Cvcomp*uF)*(Cvcomp_p*uF))/((Cvcomp*uF)+(Cvcomp_p*uF)))))))","v":"0.657317418672292-0.391316310952452i"},-2.3269965733351445,"-0.341479464072784-3.23064964502982i",10.234049650338473,83.96624382116525]
[3.6,3981.0717055349769,25013.811247045742,"-0.254070783521424-0.13855780971826i",-10.770139932985401,-151.39410352150961,0.6,3.9810717055349727,25.013811247045716,1.0390895596239486E-2,"115.338916167488-315.222128269718i",50.518007999400389,"1.19847463607979-3.27544022447505i",10.851067623772696,-69.902565061357606,{"$f":"IMPRODUCT(gmv,IMDIV((COMPLEX(1,I140*(Rvcomp*kOhms)*(Cvcomp*uF))),IMPRODUCT((COMPLEX(0,data!I140*((Cvcomp*uF)+(Cvcomp_p*uF)))),(COMPLEX(1,I140*((Rvcomp*kOhms)*(Cvcomp*uF)*(Cvcomp_p*uF))/((Cvcomp*uF)+(Cvcomp_p*uF)))))))","v":"0.653813533303207-0.339776449799064i"},-2.6526402185747955,"-0.329338514611579-2.5487406033089i",8.1984274051979078,82.63725572818214]
[3.7,5011.8723362727324,31490.522624728659,"-0.175122591451889-0.0758609815927068i",-14.386265449279767,-156.57832461075566,0.7,5.0118723362727229,31.490522624728598,1.0390895596239486E-2,"76.0894588738421-261.797398363332i",48.711494294189762,"0.790637623132451-2.7203094337605i",9.0445539185620643,-73.793888330280154,{"$f":"IMPRODUCT(gmv,IMDIV((COMPLEX(1,I141*(Rvcomp*kOhms)*(Cvcomp*uF))),IMPRODUCT((COMPLEX(0,data!I141*((Cvcomp*uF)+(Cvcomp_p*uF)))),(COMPLEX(1,I141*((Rvcomp*kOhms)*(Cvcomp*uF)*(Cvcomp_p*uF))/((Cvcomp*uF)+(Cvcomp_p*uF)))))))","v":"0.648336126829625-0.305833066113314i"},-2.8914369536432605,"-0.319361640596473-2.00547801052951i",6.1531169649187891,80.951926231724201]
[3.8,6309.5734448019384,39644.21916295003,"-0.117336743278368-0.0403747933673032i",-18.125346901398391,-161.01200034300857,0.8,6.3095734448019343,39.644219162950002,1.0390895596239486E-2,"49.4301168219668-214.107789490968i",46.838165707470878,"0.513623183206978-2.22477168694227i",7.1712253318431802,-77.000142590227995,{"$f":"IMPRODUCT(gmv,IMDIV((COMPLEX(1,I142*(Rvcomp*kOhms)*(Cvcomp*uF))),IMPRODUCT((COMPLEX(0,data!I142*((Cvcomp*uF)+(Cvcomp_p*uF)))),(COMPLEX(1,I142*((Rvcomp*kOhms)*(Cvcomp*uF)*(Cvcomp_p*uF))/((Cvcomp*uF)+(Cvcomp_p*uF)))))))","v":"0.639840550902364-0.287209463671818i"},-3.0813623860729376,"-0.310338542499556-1.57101658078341i",4.089862945770232,78.82566053082013]
[3.9,7943.2823472428154,49909.114934975034,"-0.0770445298212727-0.0210580470538012i",-21.952269110504709,-164.71311299523543,0.9,7.9432823472428176,49.909114934975051,1.0390895596239486E-2,"31.7817966005982-173.30826508947i",44.920033777832373,"0.330241330337735-1.80082808851008i",5.25309340220468,-79.608386808473995,{"$f":"IMPRODUCT(gmv,IMDIV((COMPLEX(1,I143*(Rvcomp*kOhms)*(Cvcomp*uF))),IMPRODUCT((COMPLEX(0,data!I143*((Cvcomp*uF)+(Cvcomp_p*uF)))),(COMPLEX(1,I143*((Rvcomp*kOhms)*(Cvcomp*uF)*(Cvcomp_p*uF))/((Cvcomp*uF)+(Cvcomp_p*uF)))))))","v":"0.626822757962565-0.282031149904083i"},-3.256456731508151,"-0.300886835106544-1.22193837119735i",1.9966366706965413,76.166839414364361]
[4,10000,62831.853071795864,"-0.0498916878315453-0.0108318959347029i",-25.83940523861844,-167.75071435645714,1,10,62.831853071795862,1.0390895596239486E-2,"20.2966574640171-139.336646303152i",42.972494563064892,"0.210900448661237-1.4478325444662i",3.3055541874371928,-81.712224755011107,{"$f":"IMPRODUCT(gmv,IMDIV((COMPLEX(1,I144*(Rvcomp*kOhms)*(Cvcomp*uF))),IMPRODUCT((COMPLEX(0,data!I144*((Cvcomp*uF)+(Cvcomp_p*uF)))),(COMPLEX(1,I144*((Rvcomp*kOhms)*(Cvcomp*uF)*(Cvcomp_p*uF))/((Cvcomp*uF)+(Cvcomp_p*uF)))))))","v":"0.607242091657012-0.28841538326112i"},-3.4493229639862548,"-0.28950954863369-0.940011796401322i",-0.14376877654905995,72.881951774979356]
[4.0999999999999996,12589.254117941671,79100.616502201214,"-0.0320113036949269-0.00552051563545273i",-29.766653585785615,-170.2152892851488,1.1000000000000001,12.58925411794168,79.100616502201262,1.0390895596239486E-2,"12.905281437864-111.534265321735i",41.005924139437468,"0.134097432060932-1.15894090636142i",1.3389837638097521,-83.399834420393603,{"$f":"IMPRODUCT(gmv,IMDIV((COMPLEX(1,I145*(Rvcomp*kOhms)*(Cvcomp*uF))),IMPRODUCT((COMPLEX(0,data!I145*((Cvcomp*uF)+(Cvcomp_p*uF)))),(COMPLEX(1,I145*((Rvcomp*kOhms)*(Cvcomp*uF)*(Cvcomp_p*uF))/((Cvcomp*uF)+(Cvcomp_p*uF)))))))","v":"0.578596455018551-0.303922039955373i"},-3.6942725128237597,"-0.274639385631545-0.71131426510144i",-2.3552887490140026,68.888358838869024]
[4.2,15848.931924611146,{"$f":"2*PI()*B146","v":99581.776203206231},{"$f":"IMDIV((K_1*2.5*Rsense*Vout_nom)/(K_FQ*M_1*(M_2/us)*Lbst*mH),IMPRODUCT((COMPLEX(0,C146*1)),COMPLEX(1,(C146/(2*PI()*fiavg*kHz)))))","v":"-0.0204153669285316-0.00279662008642097i"},{"$f":"20*LOG(IMABS(D146))","v":-33.720115302241204},{"$f":"180/PI()*IMARGUMENT(D146)","v":-172.19982732298439},1.2,15.848931924611136,{"$f":"2*PI()*H146","v":99.581776203206175},{"$f":"(R_fb2*kOhms)/((R_fb1*MegOhm)+(R_fb2*kOhms))","v":1.0390895596239486E-2},{"$f":"IMDIV(((M_3/us)*Vout_nom)/(M1M2/us),COMPLEX(1,(I146/(2*PI()*fPWM_PSpole))))","v":"8.18257625191718-89.0288763228872i"},{"$f":"20*LOG(IMABS(K146))","v":39.027149949927924},{"$f":"IMPRODUCT(J146,K146)","v":"0.08502429554194-0.925089758921638i"},{"$f":"20*LOG(IMABS(M146))","v":-0.63979042569977673},{"$f":"180/PI()*IMARGUMENT(M146)","v":-84.748741690942197},{"$f":"IMPRODUCT(gmv,IMDIV((COMPLEX(1,I146*(Rvcomp*kOhms)*(Cvcomp*uF))),IMPRODUCT((COMPLEX(0,data!I146*((Cvcomp*uF)+(Cvcomp_p*uF)))),(COMPLEX(1,I146*((Rvcomp*kOhms)*(Cvcomp*uF)*(Cvcomp_p*uF))/((Cvcomp*uF)+(Cvcomp_p*uF)))))))","v":"0.538347094502276-0.324926162055433i"},{"$f":"20*LOG(IMABS(P146))","v":-4.0296926081314597},{"$f":"IMPRODUCT((M146),(P146))","v":"-0.254813282456087-0.525646001901184i"},{"$f":"20*LOG(IMABS(R146))","v":-4.6694830338312414},{"$f":"(180/PI()*IMARGUMENT(R146))+180","v":64.137648765417325}]
[4.3,19952.623149688792,125366.0286138159,"-0.012969386289739-0.00141122320302538i",-37.690492944026538,-173.78997102021307,1.3,19.952623149688804,125.36602861381597,1.0390895596239486E-2,"5.17886603138527-70.9374393479648i",37.040596105741002,"0.0538130562390355-0.737103526129273i",-2.6263442698866921,-85.824466262595408,{"$f":"IMPRODUCT(gmv,IMDIV((COMPLEX(1,I147*(Rvcomp*kOhms)*(Cvcomp*uF))),IMPRODUCT((COMPLEX(0,data!I147*((Cvcomp*uF)+(Cvcomp_p*uF)))),(COMPLEX(1,I147*((Rvcomp*kOhms)*(Cvcomp*uF)*(Cvcomp_p*uF))/((Cvcomp*uF)+(Cvcomp_p*uF)))))))","v":"0.484887661377511-0.346206124107919i"},-4.4980256916937398,"-0.229096467856173-0.376042814604858i",-7.1243699615804381,58.648984079083164]
[4.4000000000000004,25118.86431509586,157826.47919764792,"-0.00821862036633708-0.000710354609019278i",-41.671698001699014,-175.06006849495796,1.4,25.118864315095799,157.82647919764753,1.0390895596239486E-2,"3.27404933134073-56.4580728350025i",35.049101526883987,"0.0340203047788992-0.586649940393396i",-4.6178388487437019,-86.681088476702328,{"$f":"IMPRODUCT(gmv,IMDIV((COMPLEX(1,I148*(Rvcomp*kOhms)*(Cvcomp*uF))),IMPRODUCT((COMPLEX(0,data!I148*((Cvcomp*uF)+(Cvcomp_p*uF)))),(COMPLEX(1,I148*((Rvcomp*kOhms)*(Cvcomp*uF)*(Cvcomp_p*uF))/((Cvcomp*uF)+(Cvcomp_p*uF)))))))","v":"0.418951229068777-0.361322391939664i"},-5.1417355613366302,"-0.197716911193789-0.258070011458166i",-9.7595744100803365,52.542948859267298]
[4.5,31622.77660168384,198691.7653159223,"-0.00519982825489228-0.000356997588257546i",-45.659797206339555,-176.07248419352749,1.5,31.622776601683803,198.69176531592208,1.0390895596239486E-2,"2.0683438195957-44.9017806327077i",33.054476668269366,"0.0214919446865461-0.466569714639714i",-6.6124637073583248,-87.362606619795343,{"$f":"IMPRODUCT(gmv,IMDIV((COMPLEX(1,I149*(Rvcomp*kOhms)*(Cvcomp*uF))),IMPRODUCT((COMPLEX(0,data!I149*((Cvcomp*uF)+(Cvcomp_p*uF)))),(COMPLEX(1,I149*((Rvcomp*kOhms)*(Cvcomp*uF)*(Cvcomp_p*uF))/((Cvcomp*uF)+(Cvcomp_p*uF)))))))","v":"0.344668773718907-0.36425488627463i"},-5.994996814569201,"-0.162542696125329-0.168640557266869i",-12.607460521927528,46.054830611426212]
[4.5999999999999996,39810.717055349742,250138.11247045727,"-0.00328656003913111-0.00017923295005353i",-49.652271497810496,-176.87845983923287,1.6,39.810717055349755,250.13811247045734,1.0390895596239486E-2,"1.30605727929534-35.6946440023586i",31.057871579410822,"0.0135711048318665-0.370899319173444i",-8.6090687962168744,-87.90449789432634,{"$f":"IMPRODUCT(gmv,IMDIV((COMPLEX(1,I150*(Rvcomp*kOhms)*(Cvcomp*uF))),IMPRODUCT((COMPLEX(0,data!I150*((Cvcomp*uF)+(Cvcomp_p*uF)))),(COMPLEX(1,I150*((Rvcomp*kOhms)*(Cvcomp*uF)*(Cvcomp_p*uF))/((Cvcomp*uF)+(Cvcomp_p*uF)))))))","v":"0.269060037346885-0.351792401662056i"},-7.0740903602303007,"-0.126828120293947-0.104568396230751i",-15.683159156447164,39.505207571462847]
[4.7,50118.723362727294,314905.22624728642,"-0.00207595092367508-0.0000899276749519452i",-53.647516377954133,-177.51956710645402,1.7,50.118723362727238,314.90522624728607,1.0390895596239486E-2,"0.824473241560981-28.3672604399413i",29.060014989814004,"0.00856701537495329-0.294761241582765i",-10.606925385813678,-88.335209614853952,{"$f":"IMPRODUCT(gmv,IMDIV((COMPLEX(1,I151*(Rvcomp*kOhms)*(Cvcomp*uF))),IMPRODUCT((COMPLEX(0,data!I151*((Cvcomp*uF)+(Cvcomp_p*uF)))),(COMPLEX(1,I151*((Rvcomp*kOhms)*(Cvcomp*uF)*(Cvcomp_p*uF))/((Cvcomp*uF)+(Cvcomp_p*uF)))))))","v":"0.199647974734048-0.324982140620919i"},-8.3721848397170895,"-0.0940817519925219-0.0616326119073771i",-18.979110225530775,33.228661537025886]
[4.8,63095.734448019342,396442.19162950001,"-0.00131074249065803-0.0000451017777888327i",-57.644513419075871,-178.02926785267701,1.8,63.095734448019364,396.44219162950014,1.0390895596239486E-2,"0.520369531057289-22.5399366168632i",27.061367934853493,"0.00540710546868039-0.234210128131681i",-12.6055724407742,-88.677472652330223,{"$f":"IMPRODUCT(gmv,IMDIV((COMPLEX(1,I152*(Rvcomp*kOhms)*(Cvcomp*uF))),IMPRODUCT((COMPLEX(0,data!I152*((Cvcomp*uF)+(Cvcomp_p*uF)))),(COMPLEX(1,I152*((Rvcomp*kOhms)*(Cvcomp*uF)*(Cvcomp_p*uF))/((Cvcomp*uF)+(Cvcomp_p*uF)))))))","v":"0.141707827761548-0.288339996078985i"},-9.8623167785492107,"-0.0667659182567032-0.0347484932669323i",-22.467889219323407,27.494838692582846]
[4.9000000000000004,79432.823472428237,499091.14934975083,"-0.000827383696797083-0.0000226143048171218i",-61.642617611176085,-178.43436398601074,1.9,79.432823472428197,499.09114934975059,1.0390895596239486E-2,"0.328395537050608-17.9076285411425i",25.062221802378396,"0.00341232373976386-0.18607629854725i",-14.604718573249304,-88.94941033258101,{"$f":"IMPRODUCT(gmv,IMDIV((COMPLEX(1,I153*(Rvcomp*kOhms)*(Cvcomp*uF))),IMPRODUCT((COMPLEX(0,data!I153*((Cvcomp*uF)+(Cvcomp_p*uF)))),(COMPLEX(1,I153*((Rvcomp*kOhms)*(Cvcomp*uF)*(Cvcomp_p*uF))/((Cvcomp*uF)+(Cvcomp_p*uF)))))))","v":"0.0970631941981178-0.247519101429655i"},-11.50660638657703,"-0.045726227171952-0.0189057752074121i",-26.111324959826334,22.462933167308819]
[5,100000,628318.53071795858,"-0.00052218767734006-0.0000113371241286317i",-65.641421011306619,-178.75625687636213,2,100,628.31853071795865,1.0390895596239486E-2,"0.207229285874227-14.2262999514587i",23.062760642756448,"0.00215329787400236-0.147823997516394i",-16.604179732871255,-89.165452448688185,{"$f":"IMPRODUCT(gmv,IMDIV((COMPLEX(1,I154*(Rvcomp*kOhms)*(Cvcomp*uF))),IMPRODUCT((COMPLEX(0,data!I154*((Cvcomp*uF)+(Cvcomp_p*uF)))),(COMPLEX(1,I154*((Rvcomp*kOhms)*(Cvcomp*uF)*(Cvcomp_p*uF))/((Cvcomp*uF)+(Cvcomp_p*uF)))))))","v":"0.0647383198247374-0.207241290107362i"},-13.266103998934247,"-0.0304958350676799-0.0100161294583812i",-29.870283731805497,18.182380123604077]
[5.0999999999999996,125892.54117941685,791006.16502201289,"-0.000329535446518714-5.68300998384754E-06i",-69.640665838156195,-179.01200245287674,2.1,125.89254117941677,791.0061650220124,1.0390895596239486E-2,"0.13076307727184-11.3012364937141i",21.063100662452921,"0.00135874548377469-0.117429968514595i",-18.603839713174757,-89.337078016009002,{"$f":"IMPRODUCT(gmv,IMDIV((COMPLEX(1,I155*(Rvcomp*kOhms)*(Cvcomp*uF))),IMPRODUCT((COMPLEX(0,data!I155*((Cvcomp*uF)+(Cvcomp_p*uF)))),(COMPLEX(1,I155*((Rvcomp*kOhms)*(Cvcomp*uF)*(Cvcomp_p*uF))/((Cvcomp*uF)+(Cvcomp_p*uF)))))))","v":"0.0423731224693442-0.170459643994687i"},-15.107170751371042,"-0.0199594963385165-0.00520748570888379i",-33.711010464545808,14.622649405246619]
[5.2,158489.31924611164,995817.76203206345,"-0.000207945626787179-2.84856460720125E-06i",-73.64018928853676,-179.21517694597063,2.2000000000000002,158.48931924611153,995.81776203206277,1.0390895596239486E-2,"0.0825100000776316-8.97733472461288i",19.063315214075814,"0.000857352796452382-0.0932825478559478i",-20.603625161551879,-89.473413679110095,{"$f":"IMPRODUCT(gmv,IMDIV((COMPLEX(1,I156*(Rvcomp*kOhms)*(Cvcomp*uF))),IMPRODUCT((COMPLEX(0,data!I156*((Cvcomp*uF)+(Cvcomp_p*uF)))),(COMPLEX(1,I156*((Rvcomp*kOhms)*(Cvcomp*uF)*(Cvcomp_p*uF))/((Cvcomp*uF)+(Cvcomp_p*uF)))))))","v":"0.0273810558787593-0.138511571269606i"},-17.00379890983049,"-0.0128972370507321-0.00267292793832576i",-37.607424071382354,11.708683514899775]
[5.3,199526.23149688813,1253660.2861381602,"-0.000131213905527755-1.42776307146354E-06i",-77.639888579146458,-179.37657850004001,2.2999999999999998,199.52623149688802,1253.6602861381596,1.0390895596239486E-2,"0.0520619133919157-7.13117273394724i",17.063450592452011,"0.000540969906595858-0.0740992713571955i",-22.603489783175679,-89.581713270999046,{"$f":"IMPRODUCT(gmv,IMDIV((COMPLEX(1,I157*(Rvcomp*kOhms)*(Cvcomp*uF))),IMPRODUCT((COMPLEX(0,data!I157*((Cvcomp*uF)+(Cvcomp_p*uF)))),(COMPLEX(1,I157*((Rvcomp*kOhms)*(Cvcomp*uF)*(Cvcomp_p*uF))/((Cvcomp*uF)+(Cvcomp_p*uF)))))))","v":"0.0175434990819768-0.11164500921505i"},-18.937280858847345,"-0.00826332332844284-0.00136035708923707i",-41.54077064202302,9.348517909294543]
[5.4,251188.64315095844,1578264.7919764782,"-0.0000827939946242252-7.15607888658906E-07i",-81.639698833634213,-179.50479148843505,2.4,251.18864315095806,1578.2647919764759,1.0390895596239486E-2,"0.0328494927233389-5.66460326365239i",15.063536012604066,"0.000341335649277643-0.0588603011067294i",-24.603404363023635,-89.667740862568294,{"$f":"IMPRODUCT(gmv,IMDIV((COMPLEX(1,I158*(Rvcomp*kOhms)*(Cvcomp*uF))),IMPRODUCT((COMPLEX(0,data!I158*((Cvcomp*uF)+(Cvcomp_p*uF)))),(COMPLEX(1,I158*((Rvcomp*kOhms)*(Cvcomp*uF)*(Cvcomp_p*uF))/((Cvcomp*uF)+(Cvcomp_p*uF)))))))","v":"0.0111782922428506-0.0895160881178088i"},-20.894778184330576,"-0.00526512835087022-0.000688512679331691i",-45.498182547354212,7.4502051484540743]
[5.5,316227.7660168382,1986917.6531592219,"-0.0000522409191362446-3.58663425516987E-07i",-85.639579108044032,-179.60663828246498,2.5,316.22776601683825,1986.917653159222,1.0390895596239486E-2,"0.0207268859219391-4.49961015208771i",13.063589909940895,"0.000215370907650035-0.0467549793141227i",-26.603350465686795,-89.736076094097712,{"$f":"IMPRODUCT(gmv,IMDIV((COMPLEX(1,I159*(Rvcomp*kOhms)*(Cvcomp*uF))),IMPRODUCT((COMPLEX(0,data!I159*((Cvcomp*uF)+(Cvcomp_p*uF)))),(COMPLEX(1,I159*((Rvcomp*kOhms)*(Cvcomp*uF)*(Cvcomp_p*uF))/((Cvcomp*uF)+(Cvcomp_p*uF)))))))","v":"0.00709715862305828-0.0715295532468664i"},-22.86774428104312,"-0.00334283426091129-0.000347232889416717i",-49.471094746729918,5.9302625137294172]
[5.6,398107.17055349716,2501381.124704571,"-0.000032962364970926-1.79760656861213E-07i",-89.639503564605278,-179.68753986960033,2.6,398.10717055349761,2501.3811247045737,1.0390895596239486E-2,"0.0130778833061188-3.57419537654704i",11.063623917205579,"0.000135890920053684-0.0371390909982622i",-28.603316458422107,-89.79035724252266,{"$f":"IMPRODUCT(gmv,IMDIV((COMPLEX(1,I160*(Rvcomp*kOhms)*(Cvcomp*uF))),IMPRODUCT((COMPLEX(0,data!I160*((Cvcomp*uF)+(Cvcomp_p*uF)))),(COMPLEX(1,I160*((Rvcomp*kOhms)*(Cvcomp*uF)*(Cvcomp_p*uF))/((Cvcomp*uF)+(Cvcomp_p*uF)))))))","v":"0.00449575405200456-0.0570328254372526i"},-24.850599681926418,"-0.00211753636164767-0.000174718461965133i",-53.453916140348511,4.7168047438000258]
[5.7,501187.23362727347,3149052.2624728675,"-0.0000207980745348529-9.00947351436192E-08i",-93.63945589924171,-179.75180318818053,2.7,501.18723362727269,3149.0522624728624,1.0390895596239486E-2,"0.00825162729112251-2.83909833116501i",9.0636453744760175,"0.0000857417976811344-0.0295007743465934i",-30.603295001151668,-89.833474564278319,{"$f":"IMPRODUCT(gmv,IMDIV((COMPLEX(1,I161*(Rvcomp*kOhms)*(Cvcomp*uF))),IMPRODUCT((COMPLEX(0,data!I161*((Cvcomp*uF)+(Cvcomp_p*uF)))),(COMPLEX(1,I161*((Rvcomp*kOhms)*(Cvcomp*uF)*(Cvcomp_p*uF))/((Cvcomp*uF)+(Cvcomp_p*uF)))))))","v":"0.00284374111446151-0.0454111774722367i"},-26.839747097087148,"-0.00133942107194627-0.0000877862009091456i",-57.443042098238799,3.7498256086178685]
[5.8,630957.34448019415,3964421.9162950045,"-0.0000131227887543761-4.51546437677877E-08i",-97.639425824161279,-179.80284980951166,2.8,630.95734448019323,3964.4219162949989,1.0390895596239486E-2,"0.00520644107375796-2.25518299588947i",7.0636589131529437,"0.000054099585625392-0.0234333710607021i",-32.603281462474733,-89.867724007154251,{"$f":"IMPRODUCT(gmv,IMDIV((COMPLEX(1,I162*(Rvcomp*kOhms)*(Cvcomp*uF))),IMPRODUCT((COMPLEX(0,data!I162*((Cvcomp*uF)+(Cvcomp_p*uF)))),(COMPLEX(1,I162*((Rvcomp*kOhms)*(Cvcomp*uF)*(Cvcomp_p*uF))/((Cvcomp*uF)+(Cvcomp_p*uF)))))))","v":"0.00179712230689844-0.0361259285873118i"},-28.832885540632816,"-0.000846455065926782-0.0000440670316259222i",-61.436167003107549,2.9801671475056253]
[5.9,794328.23472428333,4990911.4934975151,"-8.27995612325805E-06-2.26310298799221E-08i",-101.63940684796123,-179.8433978091262,2.9,794.32823472428208,4990.9114934975069,1.0390895596239486E-2,"0.0032850486956066-1.79135905161286i",5.0636674555022818,"0.0000341345980246109-0.0186138248806878i",-34.60327292012542,-89.894929375216904,{"$f":"IMPRODUCT(gmv,IMDIV((COMPLEX(1,I163*(Rvcomp*kOhms)*(Cvcomp*uF))),IMPRODUCT((COMPLEX(0,data!I163*((Cvcomp*uF)+(Cvcomp_p*uF)))),(COMPLEX(1,I163*((Rvcomp*kOhms)*(Cvcomp*uF)*(Cvcomp_p*uF))/((Cvcomp*uF)+(Cvcomp_p*uF)))))))","v":"0.00113504225091319-0.0287232546378333i"},-30.828550583438368,"-0.000534610887621057-0.0000221079344417008i",-65.431823503563777,2.3680213993674784]
[6,1000000,6283185.307179586,"-5.22431353101506E-06-1.13424145299079E-08i",-105.63939487474572,-179.87560634385414,3,1000,6283.1853071795858,1.0390895596239486E-2,"0.00207272817385204-1.42292883916778i",3.0636728453689921,"0.0000215375020538807-0.0147855050086706i",-36.603267530258734,-89.916539401568059,{"$f":"IMPRODUCT(gmv,IMDIV((COMPLEX(1,I164*(Rvcomp*kOhms)*(Cvcomp*uF))),IMPRODUCT((COMPLEX(0,data!I164*((Cvcomp*uF)+(Cvcomp_p*uF)))),(COMPLEX(1,I164*((Rvcomp*kOhms)*(Cvcomp*uF)*(Cvcomp_p*uF))/((Cvcomp*uF)+(Cvcomp_p*uF)))))))","v":"0.000716615727411494-0.022829451906649i"},-32.82581317308032,"-0.000337529541398262-0.0000110872147942632i",-69.429080703339054,1.8813828295464816]
[null,null,null,null,null,null,3.1,1258.925411794168,7910.0616502201265,1.0390895596239486E-2,"0.00130780408848954-1.13027343802418i",1.0636762461484286,"0.00001358925574383-0.0117445532897119i",-38.603264129479278,-89.933704872874202,{"$f":"IMPRODUCT(gmv,IMDIV((COMPLEX(1,I165*(Rvcomp*kOhms)*(Cvcomp*uF))),IMPRODUCT((COMPLEX(0,data!I165*((Cvcomp*uF)+(Cvcomp_p*uF)))),(COMPLEX(1,I165*((Rvcomp*kOhms)*(Cvcomp*uF)*(Cvcomp_p*uF))/((Cvcomp*uF)+(Cvcomp_p*uF)))))))","v":"0.00045233427876669-0.0181409815552285i"},-34.824085092027069,"-0.000213051577716866-5.55898647953689E-06i",-73.427349221506347,1.4946343813775513]
[null,null,null,null,null,null,3.2,1584.8931924611156,9958.17762032063,1.0390895596239486E-2,"0.000825169002470426-0.897808548367724i",-0.93632160810345522,"8.57424495392328E-06-0.00932903489150035i",-40.603261983731151,-89.947339900026634,{"$f":"IMPRODUCT(gmv,IMDIV((COMPLEX(1,I166*(Rvcomp*kOhms)*(Cvcomp*uF))),IMPRODUCT((COMPLEX(0,data!I166*((Cvcomp*uF)+(Cvcomp_p*uF)))),(COMPLEX(1,I166*((Rvcomp*kOhms)*(Cvcomp*uF)*(Cvcomp_p*uF))/((Cvcomp*uF)+(Cvcomp_p*uF)))))))","v":"0.00028547546968819-0.0144133559630246i"},-36.822994391225997,"-0.000134460252946066-2.78679426202364E-06i",-77.42625637495712,1.1873300045128019]
[null,null,null,null,null,null,3.3,1995.2623149688804,12536.602861381598,1.0390895596239486E-2,"0.000520646604853238-0.713154901665244i",-2.9363202542273248,"5.40998451356655E-06-0.00741031812714999i",-42.603260629855015,-89.9581705914011,{"$f":"IMPRODUCT(gmv,IMDIV((COMPLEX(1,I167*(Rvcomp*kOhms)*(Cvcomp*uF))),IMPRODUCT((COMPLEX(0,data!I167*((Cvcomp*uF)+(Cvcomp_p*uF)))),(COMPLEX(1,I167*((Rvcomp*kOhms)*(Cvcomp*uF)*(Cvcomp_p*uF))/((Cvcomp*uF)+(Cvcomp_p*uF)))))))","v":"0.000180151453775922-0.0114506714753417i"},-38.822306063993814,"-0.0000848521437851889-1.39692753889968E-06i",-81.425566693848822,0.94317973461258475]
[null,null,null,null,null,null,3.4,2511.8864315095811,15782.647919764762,1.0390895596239486E-2,"0.000328505863826486-0.566479185548689i",-4.9363193999890997,"3.41347013377348E-06-0.0058862260744792i",-44.603259775616799,-89.966773717529591,{"$f":"IMPRODUCT(gmv,IMDIV((COMPLEX(1,I168*(Rvcomp*kOhms)*(Cvcomp*uF))),IMPRODUCT((COMPLEX(0,data!I168*((Cvcomp*uF)+(Cvcomp_p*uF)))),(COMPLEX(1,I168*((Rvcomp*kOhms)*(Cvcomp*uF)*(Cvcomp_p*uF))/((Cvcomp*uF)+(Cvcomp_p*uF)))))))","v":"0.000113679275479464-0.00909646188409325i"},-40.821871702499486,"-0.0000535434430868442-7.00192416419486E-07i",-85.425131478116299,0.74921935091080627]
[null,null,null,null,null,null,3.5,3162.2776601683804,19869.176531592209,1.0390895596239486E-2,"0.000207273213210099-0.449970467309229i",-6.9363188610010864,"2.15375431836323E-06-0.00467559614720129i",-46.60325923662878,-89.973607424606996,{"$f":"IMPRODUCT(gmv,IMDIV((COMPLEX(1,I169*(Rvcomp*kOhms)*(Cvcomp*uF))),IMPRODUCT((COMPLEX(0,data!I169*((Cvcomp*uF)+(Cvcomp_p*uF)))),(COMPLEX(1,I169*((Rvcomp*kOhms)*(Cvcomp*uF)*(Cvcomp_p*uF))/((Cvcomp*uF)+(Cvcomp_p*uF)))))))","v":"0.0000717313099964524-0.0072260127274267i"},-42.821597616477689,"-0.0000337857627763651-3.50949692769357E-07i",-89.424856853106462,0.59513864405502659]
[null,null,null,null,null,null,3.6,3981.0717055349769,25013.811247045742,1.0390895596239486E-2,"0.000130780566429818-0.357424274964251i",-8.9363185209226028,"0.0000013589272117893-0.00371395832471513i",-48.603258896550294,-89.979035631631035,{"$f":"IMPRODUCT(gmv,IMDIV((COMPLEX(1,I170*(Rvcomp*kOhms)*(Cvcomp*uF))),IMPRODUCT((COMPLEX(0,data!I170*((Cvcomp*uF)+(Cvcomp_p*uF)))),(COMPLEX(1,I170*((Rvcomp*kOhms)*(Cvcomp*uF)*(Cvcomp_p*uF))/((Cvcomp*uF)+(Cvcomp_p*uF)))))))","v":"0.0000452612029584405-0.00574004458271384i"},-44.821424670951799,"-0.0000213182248555257-1.75898524294455E-07i",-93.4246835675021,0.47274172366161338]
[null,null,null,null,null,null,3.7,5011.8723362727324,31490.522624728659,1.0390895596239486E-2,"0.0000825169629811489-0.283912207407415i",-10.936318306347598,"8.57425147255877E-07-0.00295010210566834i",-50.603258681975298,-89.983347410007113,{"$f":"IMPRODUCT(gmv,IMDIV((COMPLEX(1,I171*(Rvcomp*kOhms)*(Cvcomp*uF))),IMPRODUCT((COMPLEX(0,data!I171*((Cvcomp*uF)+(Cvcomp_p*uF)))),(COMPLEX(1,I171*((Rvcomp*kOhms)*(Cvcomp*uF)*(Cvcomp_p*uF))/((Cvcomp*uF)+(Cvcomp_p*uF)))))))","v":"0.0000285586074896167-0.00455958907176626i"},-46.821315546143637,"-0.0000134512288347318-8.81603144213593E-08i",-97.4245742281189,0.37551525399018715]
[null,null,null,null,null,null,3.8,6309.5734448019384,39644.21916295003,1.0390895596239486E-2,"0.0000520646854602295-0.225519489556989i",-12.936318170959884,"5.40998710868293E-07-0.00234334947090389i",-52.60325854658759,-89.98677237744991,{"$f":"IMPRODUCT(gmv,IMDIV((COMPLEX(1,I172*(Rvcomp*kOhms)*(Cvcomp*uF))),IMPRODUCT((COMPLEX(0,data!I172*((Cvcomp*uF)+(Cvcomp_p*uF)))),(COMPLEX(1,I172*((Rvcomp*kOhms)*(Cvcomp*uF)*(Cvcomp_p*uF))/((Cvcomp*uF)+(Cvcomp_p*uF)))))))","v":"0.0000180195494195849-0.00362186526638035i"},-48.821246691627834,"-8.48728630710456E-06-4.41855260383612E-08i",-101.42450523821543,0.29828395017574394]
[null,null,null,null,null,null,3.9,7943.2823472428154,49909.114934975034,1.0390895596239486E-2,"0.0000328505963253401-0.179136501559262i",-14.936318085536032,"3.41347116690817E-07-0.00186138868517788i",-54.603258461163747,-89.989492925861299,{"$f":"IMPRODUCT(gmv,IMDIV((COMPLEX(1,I173*(Rvcomp*kOhms)*(Cvcomp*uF))),IMPRODUCT((COMPLEX(0,data!I173*((Cvcomp*uF)+(Cvcomp_p*uF)))),(COMPLEX(1,I173*((Rvcomp*kOhms)*(Cvcomp*uF)*(Cvcomp_p*uF))/((Cvcomp*uF)+(Cvcomp_p*uF)))))))","v":"0.0000113696810219463-0.00287697737334678i"},-50.82120324680136,"-5.35516924925264E-06-2.21454435395092E-08i",-105.42446170796509,0.23693615616025454]
[null,null,null,null,null,null,4,10000,62831.853071795864,1.0390895596239486E-2,"0.0000207273252792672-0.142293182824205i",-16.936318031637185,"2.15375472966161E-07-0.00147855360678293i",-56.603258407264889,-89.991653934312765,{"$f":"IMPRODUCT(gmv,IMDIV((COMPLEX(1,I174*(Rvcomp*kOhms)*(Cvcomp*uF))),IMPRODUCT((COMPLEX(0,data!I174*((Cvcomp*uF)+(Cvcomp_p*uF)))),(COMPLEX(1,I174*((Rvcomp*kOhms)*(Cvcomp*uF)*(Cvcomp_p*uF))/((Cvcomp*uF)+(Cvcomp_p*uF)))))))","v":"0.0000071738291187817-0.00228527815616911i"},-52.821175834744395,"-3.37890471523924E-06-1.10990837817632E-08i",-109.4244342420093,0.18820547589530179]
[]
[]
[]
[]
[]
["Standard E48 Resistor Values"]
[100,105]
[105,110]
[110,115]
[115,121]
[121,127]
[127,133]
[133,140]
[140,147]
[147,154]
[154,162]
[162,169]
[169,178]
[178,187]
[187,196]
[196,205]
[205,215]
[215,226]
[226,237]
[237,249]
[249,261]
[261,274]
[274,287]
[287,301]
[301,316]
[316,332]
[332,348]
[348,365]
[365,383]
[383,402]
[402,422]
[422,442]
[442,464]
[464,487]
[487,511]
[511,536]
[536,562,null,null,"VREFnom",5]
[562,590,null,null,"VREFmin",4.93]
[590,619,null,null,"VREFmax",5.07]
[619,649]
[649,681]
[681,715]
[715,750]
[750,787]
[787,825]
[825,866,null,null,"Standard Component Value Calculations"]
[866,909]
[909,953,null,null,"CIN",{"$f":"((L_I_ripple_factor*Iin_peak_max)/(8*fsw*kHz*Vin_ripple))/picoF","v":999126.44842933759}]
[953,1000,null,null,null,{"$f":"(IF(Cin_initial<10000,F229*10^INT(LOG(Cin_initial)),F230*10^INT(LOG(Cin_initial))*uF))","v":1},{"$f":"IF(Cin_initial<10000,\"pF\",I236)","v":"µF"}]
[null,null,null,null,null,{"$f":"IF((10^(LOG(Cin_initial)-INT(LOG(Cin_initial))))-VLOOKUP((10^(LOG(Cin_initial)-INT(LOG(Cin_initial)))),C_s1:C_f1,1)<VLOOKUP((10^(LOG(Cin_initial)-INT(LOG(Cin_initial)))),C_s1:C_f1,2)-(10^(LOG(Cin_initial)-INT(LOG(Cin_initial)))),VLOOKUP((10^(LOG(Cin_initial)-INT(LOG(Cin_initial)))),C_s1:C_f1,1),VLOOKUP((10^(LOG(Cin_initial)-INT(LOG(Cin_initial)))),C_s1:C_f1,2))","v":10}]
[null,null,null,null,null,{"$f":"IF((10^(LOG(Cin_initial)-INT(LOG(Cin_initial))))-VLOOKUP((10^(LOG(Cin_initial)-INT(LOG(Cin_initial)))),C_s2:C_f2,1)<VLOOKUP((10^(LOG(Cin_initial)-INT(LOG(Cin_initial)))),C_s2:C_f2,2)-(10^(LOG(Cin_initial)-INT(LOG(Cin_initial)))),VLOOKUP((10^(LOG(Cin_initial)-INT(LOG(Cin_initial)))),C_s2:C_f2,1),VLOOKUP((10^(LOG(Cin_initial)-INT(LOG(Cin_initial)))),C_s2:C_f2,2))","v":10}]
[]
["Standard Capacitor Values",null,null,null,"RFREQ =",{"$f":"((1*MegOhm*32.7*kOhms*65*kHz)/((1*MegOhm*fSW_target*kHz)+(32.7*kOhms*fSW_target*kHz)-(32.7*kOhms*65*kHz)))/kOhms","v":47.929914761196059}]
["C values up to 10nF",null,null,null,null,{"$f":"(IF((10^(LOG(Rfreq_initial)-INT(LOG(Rfreq_initial)))*100)-VLOOKUP((10^(LOG(Rfreq_initial)-INT(LOG(Rfreq_initial)))*100),E_48s:E_48f,1)<VLOOKUP((10^(LOG(Rfreq_initial)-INT(LOG(Rfreq_initial)))*100),E_48s:E_48f,2)-(10^(LOG(Rfreq_initial)-INT(LOG(Rfreq_initial)))*100),VLOOKUP((10^(LOG(Rfreq_initial)-INT(LOG(Rfreq_initial)))*100),E_48s:E_48f,1),VLOOKUP((10^(LOG(Rfreq_initial)-INT(LOG(Rfreq_initial)))*100),E_48s:E_48f,2)))*10^INT(LOG(Rfreq_initial))/100","v":48.7},"kΩ"]
[1,1.2]
[1.2,1.5,null,null,"COUT",{"$f":"(((2*Pout*t_holdup*ms)/((Vout^2)-(Vout_holdup^2))))/picoF","v":1930158730.1587303}]
[1.5,1.8,null,null,"COUT",{"$f":"(IF(Cout_initial<10000,F237*10^INT(LOG(Cout_initial)),F238*10^INT(LOG(Cout_initial))*uF))","v":1800},{"$f":"IF(Cout_initial<10000,\"pF\",I236)","v":"µF"},null,"µF"]
[1.8,2.2000000000000002,null,null,null,{"$f":"IF((10^(LOG(Cout_initial)-INT(LOG(Cout_initial))))-VLOOKUP((10^(LOG(Cout_initial)-INT(LOG(Cout_initial)))),C_s1:C_f1,1)<VLOOKUP((10^(LOG(Cout_initial)-INT(LOG(Cout_initial)))),C_s1:C_f1,2)-(10^(LOG(Cout_initial)-INT(LOG(Cout_initial)))),VLOOKUP((10^(LOG(Cout_initial)-INT(LOG(Cout_initial)))),C_s1:C_f1,1),VLOOKUP((10^(LOG(Cout_initial)-INT(LOG(Cout_initial)))),C_s1:C_f1,2))","v":1.8}]
[2.2000000000000002,2.7,null,null,null,{"$f":"IF((10^(LOG(Cout_initial)-INT(LOG(Cout_initial))))-VLOOKUP((10^(LOG(Cout_initial)-INT(LOG(Cout_initial)))),C_s2:C_f2,1)<VLOOKUP((10^(LOG(Cout_initial)-INT(LOG(Cout_initial)))),C_s2:C_f2,2)-(10^(LOG(Cout_initial)-INT(LOG(Cout_initial)))),VLOOKUP((10^(LOG(Cout_initial)-INT(LOG(Cout_initial)))),C_s2:C_f2,1),VLOOKUP((10^(LOG(Cout_initial)-INT(LOG(Cout_initial)))),C_s2:C_f2,2))","v":1.8}]
[2.7,3.3]
[3.3,3.9]
[3.9,4.7,null,null,"RFB2 =",{"$f":"(VREF*R_fb1*kOhms)/(Vout-VREF)","v":10.638297872340425}]
[4.7,5.6,null,null,null,{"$f":"(IF((10^(LOG(Rfb2initial)-INT(LOG(Rfb2initial)))*100)-VLOOKUP((10^(LOG(Rfb2initial)-INT(LOG(Rfb2initial)))*100),E_48s:E_48f,1)<VLOOKUP((10^(LOG(Rfb2initial)-INT(LOG(Rfb2initial)))*100),E_48s:E_48f,2)-(10^(LOG(Rfb2initial)-INT(LOG(Rfb2initial)))*100),VLOOKUP((10^(LOG(Rfb2initial)-INT(LOG(Rfb2initial)))*100),E_48s:E_48f,1),VLOOKUP((10^(LOG(Rfb2initial)-INT(LOG(Rfb2initial)))*100),E_48s:E_48f,2)))*10^INT(LOG(Rfb2initial))/100","v":10.5},"kΩ"]
[5.6,6.8]
[6.8,8.1999999999999993,null,null,"CVSENSE",{"$f":"((10*us)/(R_fb2*kOhms))/picoF","v":952.38095238095241}]
[8.1999999999999993,10,null,null,"CVSENSE",{"$f":"(IF(Cvsense_initial<10000,F246*10^INT(LOG(Cvsense_initial)),F247*10^INT(LOG(Cvsense_initial))*uF))","v":1000},{"$f":"IF(Cvsense_initial<10000,\"pF\",I236)","v":"pF"}]
["C values greater than 10nF",null,null,null,null,{"$f":"IF((10^(LOG(Cvsense_initial)-INT(LOG(Cvsense_initial))))-VLOOKUP((10^(LOG(Cvsense_initial)-INT(LOG(Cvsense_initial)))),C_s1:C_f1,1)<VLOOKUP((10^(LOG(Cvsense_initial)-INT(LOG(Cvsense_initial)))),C_s1:C_f1,2)-(10^(LOG(Cvsense_initial)-INT(LOG(Cvsense_initial)))),VLOOKUP((10^(LOG(Cvsense_initial)-INT(LOG(Cvsense_initial)))),C_s1:C_f1,1),VLOOKUP((10^(LOG(Cvsense_initial)-INT(LOG(Cvsense_initial)))),C_s1:C_f1,2))","v":10}]
[1,1.2,null,null,null,{"$f":"IF((10^(LOG(Cvsense_initial)-INT(LOG(Cvsense_initial))))-VLOOKUP((10^(LOG(Cvsense_initial)-INT(LOG(Cvsense_initial)))),C_s2:C_f2,1)<VLOOKUP((10^(LOG(Cvsense_initial)-INT(LOG(Cvsense_initial)))),C_s2:C_f2,2)-(10^(LOG(Cvsense_initial)-INT(LOG(Cvsense_initial)))),VLOOKUP((10^(LOG(Cvsense_initial)-INT(LOG(Cvsense_initial)))),C_s2:C_f2,1),VLOOKUP((10^(LOG(Cvsense_initial)-INT(LOG(Cvsense_initial)))),C_s2:C_f2,2))","v":10}]
[1.2,1.5]
[1.5,1.8,null,null,"gmi",{"$f":"0.95*10^-3","v":9.5E-4},null,"gmv",{"$f":"0.056*10^-3","v":5.5999999999999999E-5}]
[1.8,2.2000000000000002]
[2.2000000000000002,2.7,null,null,"CICOMPmax",{"$f":"((gmi*M_1)/(K_1*2*PI()*((fsw*kHz)/40)))/picoF","v":6250.4956578039037}]
[2.7,3.3,null,null,"CICOMPmax",{"$f":"(IF(CICOMPmax_initial<10000,F253*10^INT(LOG(CICOMPmax_initial)),F254*10^INT(LOG(CICOMPmax_initial))*uF))","v":6800},{"$f":"IF(CICOMPmax_initial<10000,\"pF\",I236)","v":"pF"}]
[3.3,3.9,null,null,null,{"$f":"IF((10^(LOG(CICOMPmax_initial)-INT(LOG(CICOMPmax_initial))))-VLOOKUP((10^(LOG(CICOMPmax_initial)-INT(LOG(CICOMPmax_initial)))),C_s1:C_f1,1)<VLOOKUP((10^(LOG(CICOMPmax_initial)-INT(LOG(CICOMPmax_initial)))),C_s1:C_f1,2)-(10^(LOG(CICOMPmax_initial)-INT(LOG(CICOMPmax_initial)))),VLOOKUP((10^(LOG(CICOMPmax_initial)-INT(LOG(CICOMPmax_initial)))),C_s1:C_f1,1),VLOOKUP((10^(LOG(CICOMPmax_initial)-INT(LOG(CICOMPmax_initial)))),C_s1:C_f1,2))","v":6.8}]
[3.9,4.7,null,null,null,{"$f":"IF((10^(LOG(CICOMPmax_initial)-INT(LOG(CICOMPmax_initial))))-VLOOKUP((10^(LOG(CICOMPmax_initial)-INT(LOG(CICOMPmax_initial)))),C_s2:C_f2,1)<VLOOKUP((10^(LOG(CICOMPmax_initial)-INT(LOG(CICOMPmax_initial)))),C_s2:C_f2,2)-(10^(LOG(CICOMPmax_initial)-INT(LOG(CICOMPmax_initial)))),VLOOKUP((10^(LOG(CICOMPmax_initial)-INT(LOG(CICOMPmax_initial)))),C_s2:C_f2,1),VLOOKUP((10^(LOG(CICOMPmax_initial)-INT(LOG(CICOMPmax_initial)))),C_s2:C_f2,2))","v":6.8}]
[4.7,6.8]
[6.8,8.1999999999999993,null,null,"CICOMPmin",{"$f":"((gmi*M_1)/(K_1*2*PI()*((fsw*kHz)/20)))/picoF","v":3125.2478289019518}]
[8.1999999999999993,10,null,null,"CICOMPmin",{"$f":"(IF(CICOMPmin_initial<10000,F258*10^INT(LOG(CICOMPmin_initial)),F259*10^INT(LOG(CICOMPmin_initial))*uF))","v":3300},{"$f":"IF(CICOMPmax_initial<10000,\"pF\",I241)","v":"pF"}]
[null,null,null,null,null,{"$f":"IF((10^(LOG(CICOMPmin_initial)-INT(LOG(CICOMPmin_initial))))-VLOOKUP((10^(LOG(CICOMPmin_initial)-INT(LOG(CICOMPmin_initial)))),C_s1:C_f1,1)<VLOOKUP((10^(LOG(CICOMPmin_initial)-INT(LOG(CICOMPmin_initial)))),C_s1:C_f1,2)-(10^(LOG(CICOMPmin_initial)-INT(LOG(CICOMPmin_initial)))),VLOOKUP((10^(LOG(CICOMPmin_initial)-INT(LOG(CICOMPmin_initial)))),C_s1:C_f1,1),VLOOKUP((10^(LOG(CICOMPmin_initial)-INT(LOG(CICOMPmin_initial)))),C_s1:C_f1,2))","v":3.3}]
[null,null,null,null,null,{"$f":"IF((10^(LOG(CICOMPmin_initial)-INT(LOG(CICOMPmin_initial))))-VLOOKUP((10^(LOG(CICOMPmin_initial)-INT(LOG(CICOMPmin_initial)))),C_s2:C_f2,1)<VLOOKUP((10^(LOG(CICOMPmin_initial)-INT(LOG(CICOMPmin_initial)))),C_s2:C_f2,2)-(10^(LOG(CICOMPmin_initial)-INT(LOG(CICOMPmin_initial)))),VLOOKUP((10^(LOG(CICOMPmin_initial)-INT(LOG(CICOMPmin_initial)))),C_s2:C_f2,1),VLOOKUP((10^(LOG(CICOMPmin_initial)-INT(LOG(CICOMPmin_initial)))),C_s2:C_f2,2))","v":3.3}]
[]
[null,null,null,null,"CVCOMP",{"$f":"((((56*10^-6)*fv)/fPWM_PSpole)/((10^((0-GVL_dB)/20))*2*PI()*fv))/picoF","v":8952136.5678298734}]
[null,null,null,null,null,{"$f":"(IF(CVCOMPinitial<10000,F263*10^INT(LOG(CVCOMPinitial)),F264*10^INT(LOG(CVCOMPinitial))*uF))","v":8.1999999999999993},{"$f":"IF(CVCOMPinitial<10000,\"pF\",I236)","v":"µF"}]
[null,null,null,null,null,{"$f":"IF((10^(LOG(CVCOMPinitial)-INT(LOG(CVCOMPinitial))))-VLOOKUP((10^(LOG(CVCOMPinitial)-INT(LOG(CVCOMPinitial)))),C_s1:C_f1,1)<VLOOKUP((10^(LOG(CVCOMPinitial)-INT(LOG(CVCOMPinitial)))),C_s1:C_f1,2)-(10^(LOG(CVCOMPinitial)-INT(LOG(CVCOMPinitial)))),VLOOKUP((10^(LOG(CVCOMPinitial)-INT(LOG(CVCOMPinitial)))),C_s1:C_f1,1),VLOOKUP((10^(LOG(CVCOMPinitial)-INT(LOG(CVCOMPinitial)))),C_s1:C_f1,2))","v":8.1999999999999993}]
[null,null,null,null,null,{"$f":"IF((10^(LOG(CVCOMPinitial)-INT(LOG(CVCOMPinitial))))-VLOOKUP((10^(LOG(CVCOMPinitial)-INT(LOG(CVCOMPinitial)))),C_s2:C_f2,1)<VLOOKUP((10^(LOG(CVCOMPinitial)-INT(LOG(CVCOMPinitial)))),C_s2:C_f2,2)-(10^(LOG(CVCOMPinitial)-INT(LOG(CVCOMPinitial)))),VLOOKUP((10^(LOG(CVCOMPinitial)-INT(LOG(CVCOMPinitial)))),C_s2:C_f2,1),VLOOKUP((10^(LOG(CVCOMPinitial)-INT(LOG(CVCOMPinitial)))),C_s2:C_f2,2))","v":8.1999999999999993}]
[]
[null,null,null,null,"RVCOMP",{"$f":"(1/(2*PI()*fPWM_PSpole*Cvcomp*uF))/(kOhms)","v":13.324383074518579}]
[null,null,null,null,null,{"$f":"(IF((10^(LOG(Rvcomp_initial)-INT(LOG(Rvcomp_initial)))*100)-VLOOKUP((10^(LOG(Rvcomp_initial)-INT(LOG(Rvcomp_initial)))*100),E_48s:E_48f,1)<VLOOKUP((10^(LOG(Rvcomp_initial)-INT(LOG(Rvcomp_initial)))*100),E_48s:E_48f,2)-(10^(LOG(Rvcomp_initial)-INT(LOG(Rvcomp_initial)))*100),VLOOKUP((10^(LOG(Rvcomp_initial)-INT(LOG(Rvcomp_initial)))*100),E_48s:E_48f,1),VLOOKUP((10^(LOG(Rvcomp_initial)-INT(LOG(Rvcomp_initial)))*100),E_48s:E_48f,2)))*10^INT(LOG(Rvcomp_initial))/100","v":13.3},"kΩ"]
[]
[]
[null,null,null,null,"CVCOMP_P",{"$f":"((Cvcomp*uF)/((2*PI()*fpole*(Rvcomp*kOhms)*(Cvcomp*uF))-1))/picoF","v":317934.17662798724}]
[null,null,null,null,null,{"$f":"(IF(Cvcomp_p_initial<10000,F272*10^INT(LOG(Cvcomp_p_initial)),F273*10^INT(LOG(Cvcomp_p_initial))*uF))","v":0.32999999999999996},{"$f":"IF(Cvcomp_p_initial<10000,\"pF\",I236)","v":"µF"}]
[null,null,null,null,null,{"$f":"IF((10^(LOG(Cvcomp_p_initial)-INT(LOG(Cvcomp_p_initial))))-VLOOKUP((10^(LOG(Cvcomp_p_initial)-INT(LOG(Cvcomp_p_initial)))),C_s1:C_f1,1)<VLOOKUP((10^(LOG(Cvcomp_p_initial)-INT(LOG(Cvcomp_p_initial)))),C_s1:C_f1,2)-(10^(LOG(Cvcomp_p_initial)-INT(LOG(Cvcomp_p_initial)))),VLOOKUP((10^(LOG(Cvcomp_p_initial)-INT(LOG(Cvcomp_p_initial)))),C_s1:C_f1,1),VLOOKUP((10^(LOG(Cvcomp_p_initial)-INT(LOG(Cvcomp_p_initial)))),C_s1:C_f1,2))","v":3.3}]
[null,null,null,null,null,{"$f":"IF((10^(LOG(Cvcomp_p_initial)-INT(LOG(Cvcomp_p_initial))))-VLOOKUP((10^(LOG(Cvcomp_p_initial)-INT(LOG(Cvcomp_p_initial)))),C_s2:C_f2,1)<VLOOKUP((10^(LOG(Cvcomp_p_initial)-INT(LOG(Cvcomp_p_initial)))),C_s2:C_f2,2)-(10^(LOG(Cvcomp_p_initial)-INT(LOG(Cvcomp_p_initial)))),VLOOKUP((10^(LOG(Cvcomp_p_initial)-INT(LOG(Cvcomp_p_initial)))),C_s2:C_f2,1),VLOOKUP((10^(LOG(Cvcomp_p_initial)-INT(LOG(Cvcomp_p_initial)))),C_s2:C_f2,2))","v":3.3}]
[]
[null,null,null,null,"CISENSE",{"$f":"(1/(15*fsw*kHz*PI()*Risense))/picoF","v":2103.7805295374405}]
[null,null,null,null,null,{"$f":"(IF(Cisense_initial<10000,F277*10^INT(LOG(Cisense_initial)),F278*10^INT(LOG(Cisense_initial))*uF))","v":2200},{"$f":"IF(Cisense_initial<10000,\"pF\",I236)","v":"pF"}]
[null,null,null,null,null,{"$f":"IF((10^(LOG(Cisense_initial)-INT(LOG(Cisense_initial))))-VLOOKUP((10^(LOG(Cisense_initial)-INT(LOG(Cisense_initial)))),C_s1:C_f1,1)<VLOOKUP((10^(LOG(Cisense_initial)-INT(LOG(Cisense_initial)))),C_s1:C_f1,2)-(10^(LOG(Cisense_initial)-INT(LOG(Cisense_initial)))),VLOOKUP((10^(LOG(Cisense_initial)-INT(LOG(Cisense_initial)))),C_s1:C_f1,1),VLOOKUP((10^(LOG(Cisense_initial)-INT(LOG(Cisense_initial)))),C_s1:C_f1,2))","v":2.2000000000000002}]
[null,null,null,null,null,{"$f":"IF((10^(LOG(Cisense_initial)-INT(LOG(Cisense_initial))))-VLOOKUP((10^(LOG(Cisense_initial)-INT(LOG(Cisense_initial)))),C_s2:C_f2,1)<VLOOKUP((10^(LOG(Cisense_initial)-INT(LOG(Cisense_initial)))),C_s2:C_f2,2)-(10^(LOG(Cisense_initial)-INT(LOG(Cisense_initial)))),VLOOKUP((10^(LOG(Cisense_initial)-INT(LOG(Cisense_initial)))),C_s2:C_f2,1),VLOOKUP((10^(LOG(Cisense_initial)-INT(LOG(Cisense_initial)))),C_s2:C_f2,2))","v":2.2000000000000002}]

{"sheet":"VCOMP","index":3,"n_rows":290,"n_cols":26,"rows_kept":290,"cut":false,"hidden":true,"merged":[[0,0,0,4],[10,0,10,1],[12,0,12,1],[22,0,22,1],[33,0,33,1],[38,0,38,1],[1,3,3,4],[39,3,39,4],[43,3,43,4],[1,0,3,1],[9,3,9,4],[11,3,11,4],[13,3,13,4],[23,3,23,4],[34,3,34,4],[42,0,42,1],[8,0,8,1]]}
["To Calculate VCOMP "]
["At User Selectable Line Voltage, Full Load",null,null,"At User Selectable Line Voltage, % of Load"]
[]
[]
["VLINE",{"$f":"Vline","v":220},null,"VLINE",{"$f":"Vline","v":220},null,"VCOMP as a function of Line voltage at full load"]
["K1",7,null,"Percent Load",{"$f":"percent_load/100","v":1},null,"VLINE","M1M2","VCOMP1","K1V2","K2V2","K3V2","K4V2","VCOMP2","K1V3","K2V3","K3V3","K4V3","K5V3","VCOMP3","VCOMP4","VCOMP5","VCOMP","IAC RMS","ISENSE_Pk","ICOMP"]
["KFQ",{"$f":"1/(fsw*kHz)","v":2.1810430805988223E-5},null,"K1",7,null,{"$f":"Vacin_min","v":210},{"$f":"(Iout*(Vout_nom^2)*2.5*Rsense*K_1)/(eff*(G7^2)*K_FQ)*us","v":0.10642824431385746},{"$f":"(1*10^-9*(5*10^8*SQRT(fsw*kHz)+(1.09655978*10^10)*SQRT(ftyp)*SQRT(H7)))/SQRT(fsw*kHz)","v":4.7594111349863057},{"$f":"(b_1^3/(27*a_1^3))-(d_1^3/27)+SQRT((ftyp)^2*H7^2/(4*a_1^2*c_1^2*(fsw*kHz)^2))+(b_1^3*(ftyp)*H7/(27*a_1^4*c_1*(fsw*kHz))-(d_1^3*(ftyp)*H7/(27*a_1*c_1*(fsw*kHz)))+(b_1*d_1^2*(ftyp)*H7/(9*a_1^2*c_1*(fsw*kHz)))-(b_1^2*d_1*(ftyp)*H7/(9*a_1^3*c_1*(fsw*kHz))))","v":3.956248617605902},{"$f":"(b_1*d_1^2/(9*a_1))-(b_1^2*d_1/(9*a_1^2))+(ftyp*H7/(2*a_1*c_1*fsw*kHz))","v":3.9521438855171076},{"$f":"(d_1^2/9)+(b_1^2/(9*a_1^2))-(2*b_1*d_1/(9*a_1))","v":4.5657096939147324E-4},{"$f":"((b_1*c_1*fsw*kHz)+(2*a_1*c_1*d_1*fsw*kHz))/(3*a_1*c_1*fsw*kHz)","v":0.5213675213675214},{"$f":"(J7+K7)^(1/3)+(L7/(J7^(1/3)))+M7","v":2.5139929158937546},{"$f":"(b_2^3/(27*a_2^3))-(d_2^3/27)","v":7.3252235055858844E-2},{"$f":"(ftyp^2*H7^2/(4*a_2^2*c_2^2*(fsw*kHz)^2))+(b_2^3*ftyp*H7/(27*a_2^4*c_2*(fsw*kHz)))-(d_2^3*ftyp*H7/(27*a_2*c_2*(fsw*kHz)))+(b_2*d_2^2*ftyp*H7/(9*a_2^2*c_2*(fsw*kHz)))-(b_2^2*d_2*ftyp*H7/(9*a_2^3*c_2*(fsw*kHz)))","v":3.953477488285893},{"$f":"(b_2*d_2^2/(9*a_2))-(b_2^2*d_2/(9*a_2^2))+(ftyp*H7/(2*a_2*c_2*(fsw*kHz)))","v":1.915161491323315},{"$f":"(d_2^2/9)+(b_2^2/(9*a_2^2))-(2*b_2*d_2/(9*a_2))","v":6.7799508007635123E-2},{"$f":"(b_2*c_2*(fsw*kHz)+2*a_2*c_2*d_2*(fsw*kHz))/(3*a_2*c_2*(fsw*kHz))","v":0.76038338658146953},{"$f":"((O7+SQRT(P7)+Q7)^(1/3))+(R7/((O7+SQRT(P7)+Q7)^(1/3)))+S7","v":2.3874968405517887},{"$f":"c_3+(SQRT(ftyp)*SQRT(H7)/(SQRT(a_3)*SQRT(b_3)*SQRT(fsw*kHz)))","v":1.6068513152495374},{"$f":"(a_4*(fsw*kHz)*b_4/ftyp)","v":1.4604106126431646},{"$f":"IF(I7>=0.5,IF(I7<1,I7,IF(N7>=1,IF(N7<2,N7,IF(T7>=2,IF(T7<4.5,T7,IF(U7>=4.5,IF(U7<4.6,U7,V7))))))))","v":2.3874968405517887},{"$f":"Pin_max/G7","v":19.047619047619047},{"$f":"-X7*Rsense*1.414","v":-8.0799999999999997E-2},{"$f":"MIN(6,MAX(0.5,Beta*G*($Y7-Voff_trim)/(MAX(0,MIN(4.5,W7)-Alpha1_A)+MAX(0,MIN(4.5,W7)-Alpha1_B)-Alpha1_C)+Alpha2))","v":4.2959868017841458}]
["fTYP",{"$f":"65*kHz","v":65000},null,"KFQ",{"$f":"1/(fsw*kHz)","v":2.1810430805988223E-5},null,{"$f":"G7+1","v":211},0.10542183630738559,4.7392243523560396,3.9188565821897883,3.9147525796644449,4.5657096939147324E-4,0.5213675213675214,{"$f":"(J8+K8)^(1/3)+(L8/(J8^(1/3)))+M8","v":2.5076939534150045},7.3252235055858844E-2,3.8797129380589475,1.8965255689175151,6.7799508007635123E-2,0.76038338658146953,{"$f":"((O8+SQRT(P8)+Q8)^(1/3))+(R8/((O8+SQRT(P8)+Q8)^(1/3)))+S8","v":2.3826660898373673},1.6016055744189712,1.4604106126431646,{"$f":"IF(I8>=0.5,IF(I8<1,I8,IF(N8>=1,IF(N8<2,N8,IF(T8>=2,IF(T8<4.5,T8,IF(U8>=4.5,IF(U8<4.6,U8,V8))))))))","v":2.3826660898373673},18.957345971563981,-8.0417061611374407E-2,{"$f":"MIN(6,MAX(0.5,Beta*G*($Y8-Voff_trim)/(MAX(0,MIN(4.5,W8)-Alpha1_A)+MAX(0,MIN(4.5,W8)-Alpha1_B)-Alpha1_C)+Alpha2))","v":4.2931853686541146}]
[null,null,null,"fTYP",{"$f":"65*kHz","v":65000},null,{"$f":"G8+1","v":212},0.10442963630831957,4.7192280110713414,3.8819924304080402,3.8778891471465053,4.5657096939147324E-4,0.5213675213675214,2.5014445559246892,7.3252235055858844E-2,3.8076697174360019,1.8781527399309383,6.7799508007635123E-2,0.76038338658146953,2.3778744536142473,1.5964093217094479,1.4604106126431646,2.3778744536142473,18.867924528301888,-8.0037735849056602E-2,4.2904083548895766]
["M1M2",{"$f":"(Iout*(Vout_nom^2)*2.5*Rsense*K_1)/(eff*(B5^2)*K_FQ)*us","v":9.6972842442998211E-2},null,null,null,null,213,0.10345137812693941,4.6994194288597386,3.8456462722604075,3.8415436981560038,4.5657096939147324E-4,0.5213675213675214,2.4952441023945093,7.3252235055858844E-2,3.7372997649876143,1.8600380752583561,6.7799508007635123E-2,0.76038338658146953,2.3731214406316834,1.591261860105178,1.4604106126431646,2.3731214406316834,18.779342723004696,-7.9661971830985917E-2,4.2876554775323363]
[null,null,null,"M1M2",{"$f":"((E6*Iout)*(Vout_nom^2)*2.5*Rsense*K_1)/(eff*(E5^2)*K_FQ)*us","v":9.6972842442998211E-2},null,214,0.10248680177834558,4.6797959735846932,3.8098084482802435,3.8057065734147626,4.5657096939147324E-4,0.5213675213675214,2.4890919824452165,7.3252235055858844E-2,3.668556578779973,1.8421767606908364,6.7799508007635123E-2,0.76038338658146953,2.3684065680685906,1.5861625056187052,1.4604106126431646,2.3684065680685906,18.691588785046729,-7.9289719626168223E-2,4.2849264581059305]
["VCOMP1",{"$f":"(1*10^-9*(5*10^8*SQRT(fsw*kHz)+(1.09655978*10^10)*SQRT(ftyp)*SQRT(B10)))/SQRT(fsw*kHz)","v":4.565801537941474},null,null,null,null,215,0.101535653309705,4.6603550620796481,3.7744695231160135,3.770368337755341,4.5657096939147324E-4,0.5213675213675214,2.4829875961152896,7.3252235055858844E-2,3.6013951587889563,1.8245640937168115,6.7799508007635123E-2,0.76038338658146953,2.3637293613503552,1.5811105869879205,1.4604106126431646,2.3637293613503552,18.604651162790699,-7.892093023255814E-2,4.2822210225240074]
[null,null,null,"VCOMP1",{"$f":"(1*10^-9*(5*10^8*SQRT(fsw*kHz)+(1.09655978*10^10)*SQRT(ftyp)*SQRT(E11)))/SQRT(fsw*kHz)","v":4.565801537941474},null,216,0.10059768463308287,4.6410941590144654,3.7396202793203357,3.7355197739102,4.5657096939147324E-4,0.5213675213675214,2.4769303536356899,7.3252235055858844E-2,3.5357719516959096,1.8071954804265815,6.7799508007635123E-2,0.76038338658146953,2.3590893539704516,1.5761054453814949,1.4604106126431646,2.3590893539704516,18.518518518518519,-7.8555555555555559E-2,4.2795389010010023]
["a1",0.156,null,null,null,null,217,9.9672653363654246E-2,4.6220107757932007,3.7052517113389003,3.7011518765007416,4.5657096939147324E-4,0.5213675213675214,2.4709196752104914,7.3252235055858844E-2,3.4716447979561722,1.7900664325164362,6.7799508007635123E-2,0.76038338658146953,2.354486087316729,1.5711464341124559,1.4604106126431646,2.354486087316729,18.433179723502302,-7.8193548387096759E-2,4.2768798279650069]
["b1",8.7999999999999995E-2,null,"a1",0.156,null,218,9.8760322663098948E-2,4.6031024694822218,3.6713550196919775,3.6672558462189206,4.5657096939147324E-4,0.5213675213675214,2.4649549908032302,7.3252235055858844E-2,3.4089728810368647,1.7731725643887555,6.7799508007635123E-2,0.76038338658146953,2.3499191105022135,1.5662329183596464,1.4604106126431646,2.3499191105022135,18.348623853211009,-7.7834862385321099E-2,4.2742435419728118]
["c1",0.12230000000000001,null,"b1",8.7999999999999995E-2,null,219,9.7860461087990527E-2,4.5843668417676904,3.6379216053414578,3.6338230841944084,4.5657096939147324E-4,0.5213675213675214,2.4590357399287779,7.3252235055858844E-2,3.3477166787255621,1.7565095903445895,6.7799508007635123E-2,0.76038338658146953,2.3453879802002939,1.5613642748968171,1.4604106126431646,2.3453879802002939,18.264840182648403,-7.747945205479452E-2,{"$f":"MIN(6,MAX(0.5,Beta*G*($Y16-Voff_trim)/(MAX(0,MIN(4.5,W16)-Alpha1_A)+MAX(0,MIN(4.5,W16)-Alpha1_B)-Alpha1_C)+Alpha2))","v":4.2716297856270256}]
["d1",0.5,null,"c1",0.12230000000000001,null,220,9.6972842442998211E-2,4.565801537941474,3.6049430642367333,3.6008451865405688,4.5657096939147324E-4,0.5213675213675214,2.4531613714505833,7.3252235055858844E-2,3.2878379164164269,1.7400733218653597,6.7799508007635123E-2,0.76038338658146953,2.3408922604841584,1.556539891829104,1.4604106126431646,2.3408922604841584,18.181818181818183,-7.7127272727272725E-2,4.2690383054952452]
["K1V2",{"$f":"(b_1^3/(27*a_1^3))-(d_1^3/27)+SQRT((ftyp)^2*B10^2/(4*a_1^2*c_1^2*(fsw*kHz)^2))+(b_1^3*(ftyp)*B10/(27*a_1^4*c_1*(fsw*kHz))-(d_1^3*(ftyp)*B10/(27*a_1*c_1*(fsw*kHz)))+(b_1*d_1^2*(ftyp)*B10/(9*a_1^2*c_1*(fsw*kHz)))-(b_1^2*d_1*(ftyp)*B10/(9*a_1^3*c_1*(fsw*kHz))))","v":3.6049430642367333},null,"d1",0.5,null,221,9.6097245638728013E-2,4.5474042459145902,3.5724111820329298,3.5683139390727989,4.5657096939147324E-4,0.5213675213675214,2.4473313433831172,7.3252235055858844E-2,3.2292995222849461,1.7238596649804647,6.7799508007635123E-2,0.76038338658146953,2.3364315226703516,1.5517591683366647,1.4604106126431646,2.3364315226703516,18.099547511312217,-7.6778280542986424E-2,4.2664688520311662]
["K2V2",{"$f":"(b_1*d_1^2/(9*a_1))-(b_1^2*d_1/(9*a_1^2))+(ftyp*B10/(2*a_1*c_1*fsw*kHz))","v":3.6008451865405688},null,"K1V2",{"$f":"(b_1^3/(27*a_1^3))-(d_1^3/27)+SQRT((ftyp)^2*E11^2/(4*a_1^2*c_1^2*(fsw*kHz)^2))+(b_1^3*(ftyp)*E11/(27*a_1^4*c_1*(fsw*kHz))-(d_1^3*(ftyp)*E11/(27*a_1*c_1*(fsw*kHz)))+(b_1*d_1^2*(ftyp)*E11/(9*a_1^2*c_1*(fsw*kHz)))-(b_1^2*d_1*(ftyp)*E11/(9*a_1^3*c_1*(fsw*kHz))))","v":3.6049430642367333},null,222,9.523345455403609E-2,4.5291726952573166,3.5403179289753024,3.5362213121930246,4.5657096939147324E-4,0.5213675213675214,2.4415451226993596,7.3252235055858844E-2,3.1720655842667749,1.7078646177177019,6.7799508007635123E-2,0.76038338658146953,2.3320053451663272,1.5470215144252384,1.4604106126431646,2.3320053451663272,18.018018018018019,-7.6432432432432432E-2,4.2639211794976397]
["K3V2",{"$f":"(d_1^2/9)+(b_1^2/(9*a_1^2))-(2*b_1*d_1/(9*a_1))","v":4.5657096939147324E-4},null,"K2V2",{"$f":"(b_1*d_1^2/(9*a_1))-(b_1^2*d_1/(9*a_1^2))+(ftyp*E11/(2*a_1*c_1*fsw*kHz))","v":3.6008451865405688},null,223,9.4381257902654669E-2,4.5111046562651316,3.5086554549438631,3.5045594559344231,4.5657096939147324E-4,0.5213675213675214,2.4358021851431912,7.3252235055858844E-2,3.1161013087604279,1.6920842676335426,6.7799508007635123E-2,0.76038338658146953,2.3276133133218826,1.5423263506834211,1.4604106126431646,2.3276133133218826,17.937219730941703,-7.6089686098654699E-2,4.2613950458915664]
["K4V2",{"$f":"((b_1*c_1*fsw*kHz)+(2*a_1*c_1*d_1*fsw*kHz))/(3*a_1*c_1*fsw*kHz)","v":0.5213675213675214},null,"K3V2",{"$f":"(d_1^2/9)+(b_1^2/(9*a_1^2))-(2*b_1*d_1/(9*a_1))","v":4.5657096939147324E-4},null,224,9.354044910397627E-2,4.4931979390496615,3.4774160846525044,3.4733206951606408,4.5657096939147324E-4,0.5213675213675214,2.4301020150465247,7.3252235055858844E-2,3.0613729809773216,1.6765147894204115,6.7799508007635123E-2,0.76038338658146953,2.323255019284352,1.5376731080464412,1.4604106126431646,2.323255019284352,17.857142857142858,-7.5749999999999998E-2,4.2588902128706083]
["VCOMP2",{"$f":"(B18+B19)^(1/3)+(B20/(B18^(1/3)))+B21","v":2.4531613714505833},null,"K4V2",{"$f":"((b_1*c_1*fsw*kHz)+(2*a_1*c_1*d_1*fsw*kHz))/(3*a_1*c_1*fsw*kHz)","v":0.5213675213675214},null,225,9.271082615784916E-2,4.4754503926538849,3.446592312997153,3.4424975249140388,4.5657096939147324E-4,0.5213675213675214,2.4244441051510512,7.3252235055858844E-2,3.0078479268665075,1.6611524425882391,6.7799508007635123E-2,0.76038338658146953,2.3189300618574524,1.533061227566235,1.4604106126431646,2.3189300618574524,17.777777777777779,-7.5413333333333332E-2,4.2564064456816499]
[null,null,null,"VCOMP2",{"$f":"(E19+E20)^(1/3)+(E21/(E19^(1/3)))+E22","v":2.4531613714505833},null,226,9.1892191523242114E-2,4.4578599041908156,3.4161768005476905,3.4120826059076976,4.5657096939147324E-4,0.5213675213675214,2.4188279564344577,7.3252235055858844E-2,2.955494476544902,1.6459935692176668,6.7799508007635123E-2,0.76038338658146953,2.3146380463636698,1.5284901601876235,1.4604106126431646,2.3146380463636698,17.699115044247787,-7.5079646017699106E-2,4.2539435130909755]
["a2",0.313,null,null,null,null,227,9.1084352000642632E-2,4.4404243980049527,3.3861623691785767,3.3820687601561326,4.5657096939147324E-4,0.5213675213675214,2.4132530779409862,7.3252235055858844E-2,2.9042819291671407,1.6310345917823819,6.7799508007635123E-2,0.76038338658146953,2.3103785845100893,1.5239593665304092,1.4604106126431646,2.3103785845100893,17.621145374449338,-7.4748898678414083E-2,4.2515011873160908]
["b2",0.40100000000000002,null,"a2",0.313,null,228,9.0287118618057757E-2,4.4231418348558087,3.3565419978333337,3.3524489667398556,4.5657096939147324E-4,0.5213675213675214,2.4077189866162065,7.3252235055858844E-2,2.8541805191723673,1.616272011038167,6.7799508007635123E-2,0.76038338658146953,2.3061512942575555,1.5194683166772056,1.4604106126431646,2.3061512942575555,17.543859649122808,-7.4421052631578943E-2,4.2490792439591738]
["c2",0.12230000000000001,null,"b2",0.40100000000000002,null,229,8.9500306520491874E-2,4.4060102111228137,3.3273088184182082,3.3232163576991169,4.5657096939147324E-4,0.5213675213675214,{"$f":"(J26+K26)^(1/3)+(L26/(J26^(1/3)))+M26","v":2.4022252071458818},7.3252235055858844E-2,2.8051613838482279,1.6017024039763295,6.7799508007635123E-2,0.76038338658146953,2.3019557996930837,1.5150164899668248,1.4604106126431646,2.3019557996930837,17.467248908296945,-7.409606986899564E-2,4.2466774619420615]
["d2",0.5,null,"c2",0.12230000000000001,null,230,8.8723734862780984E-2,4.3890275580309757,3.2984561118205415,3.2943642140523552,4.5657096939147324E-4,0.5213675213675214,2.3967712717988059,7.3252235055858844E-2,2.7571965321552065,1.5873224218392852,6.7799508007635123E-2,0.76038338658146953,2.2977917309054074,1.5106033747930561,1.4604106126431646,2.2977917309054074,17.391304347826086,-7.3773913043478259E-2,4.2442956234428024]
["K1V3",{"$f":"(b_2^3/(27*a_2^3))-(d_2^3/27)","v":7.3252235055858844E-2},null,"d2",0.5,null,231,8.795722670566733E-2,4.3721919408966423,3.269977304047528,3.2658859619350329,4.5657096939147324E-4,0.5213675213675214,2.3913567202735,7.3252235055858844E-2,2.7102588147571023,1.5731287881961469,6.7799508007635123E-2,0.76038338658146953,2.2936587238635902,1.5062284684086706,1.4604106126431646,2.2936587238635902,17.316017316017316,-7.3454545454545453E-2,4.2419335138336525]
["K2V3",{"$f":"(ftyp^2*B10^2/(4*a_2^2*c_2^2*(fsw*kHz)^2))+(b_2^3*ftyp*B10/(27*a_2^4*c_2*(fsw*kHz)))-(d_2^3*ftyp*B10/(27*a_2*c_2*(fsw*kHz)))+(b_2*d_2^2*ftyp*B10/(9*a_2^2*c_2*(fsw*kHz)))-(b_2^2*d_2*ftyp*B10/(9*a_2^3*c_2*(fsw*kHz)))","v":3.2878379164164269},null,"K1V3",{"$f":"(b_2^3/(27*a_2^3))-(d_2^3/27)","v":7.3252235055858844E-2},null,232,8.7200608915002878E-2,4.3555014583927782,3.2418659624812305,3.2377751688547205,4.5657096939147324E-4,0.5213675213675214,2.3859810995486539,7.3252235055858844E-2,2.6643218952060344,1.5591182970762467,6.7799508007635123E-2,0.76038338658146953,2.2895564202986018,1.5018912767344954,1.4604106126431646,2.2895564202986018,17.241379310344829,-7.3137931034482767E-2,4.2395909216205299]
["K3V3",{"$f":"(b_2*d_2^2/(9*a_2))-(b_2^2*d_2/(9*a_2^2))+(ftyp*B10/(2*a_2*c_2*(fsw*kHz)))","v":1.7400733218653597},null,"K2V3",{"$f":"(ftyp^2*E11^2/(4*a_2^2*c_2^2*(fsw*kHz)^2))+(b_2^3*ftyp*E11/(27*a_2^4*c_2*(fsw*kHz)))-(d_2^3*ftyp*E11/(27*a_2*c_2*(fsw*kHz)))+(b_2*d_2^2*ftyp*E11/(9*a_2^2*c_2*(fsw*kHz)))-(b_2^2*d_2*ftyp*E11/(9*a_2^3*c_2*(fsw*kHz)))","v":3.2878379164164269},null,233,8.645371206397455E-2,4.3389542418331519,3.2141157922458583,3.2100255400584476,4.5657096939147324E-4,0.5213675213675214,2.3806439637372114,7.3252235055858844E-2,2.619360222232733,1.5452878111586157,6.7799508007635123E-2,0.76038338658146953,2.285484467587775,1.4975913141734032,1.4604106126431646,2.285484467587775,17.167381974248926,-7.2824034334763948E-2,4.2372676383838739]
["K4V3",{"$f":"(d_2^2/9)+(b_2^2/(9*a_2^2))-(2*b_2*d_2/(9*a_2))","v":6.7799508007635123E-2},null,"K3V3",{"$f":"(b_2*d_2^2/(9*a_2))-(b_2^2*d_2/(9*a_2^2))+(ftyp*E11/(2*a_2*c_2*(fsw*kHz)))","v":1.7400733218653597},null,234,8.571637033824811E-2,4.32254845447489,3.1867206326834898,3.1826309150084953,4.5657096939147324E-4,0.5213675213675214,2.3753448739439884,7.3252235055858844E-2,2.5753490030952371,1.5316342600155082,6.7799508007635123E-2,0.76038338658146953,2.2814425186420708,1.4933281034290722,1.4604106126431646,2.2814425186420708,17.094017094017094,-7.25128205128205E-2,4.2349634587208449]
["K5V3",{"$f":"(b_2*c_2*(fsw*kHz)+2*a_2*c_2*d_2*(fsw*kHz))/(3*a_2*c_2*(fsw*kHz))","v":0.76038338658146953},null,"K4V3",{"$f":"(d_2^2/9)+(b_2^2/(9*a_2^2))-(2*b_2*d_2/(9*a_2))","v":6.7799508007635123E-2},null,235,8.4988421443931456E-2,4.3062822908388272,3.1596744539345432,3.1555852639629292,4.5657096939147324E-4,0.5213675213675214,2.3700833981267277,7.3252235055858844E-2,2.5322641779412196,1.5181546384081335,6.7799508007635123E-2,0.76038338658146953,2.2774302317960546,1.4891011753293741,1.4604106126431646,2.2774302317960546,17.021276595744681,-7.2204255319148924E-2,4.2326781801888842]
["VCOMP3",{"$f":"((B28+SQRT(B29)+B30)^(1/3))+(B31/((B28+SQRT(B29)+B30)^(1/3)))+B32","v":2.3408922604841584},null,"K5V3",{"$f":"(b_2*c_2*(fsw*kHz)+2*a_2*c_2*d_2*(fsw*kHz))/(3*a_2*c_2*(fsw*kHz))","v":0.76038338658146953},null,236,8.4269706518261892E-2,4.2901539760471374,3.132971353619455,3.1288826846573499,4.5657096939147324E-4,0.5213675213675214,2.3648591109604933,7.3252235055858844E-2,2.4900823951413154,1.5048460046328287,6.7799508007635123E-2,0.76038338658146953,2.2734472707005269,1.4849100686542496,1.4604106126431646,2.2734472707005269,16.949152542372882,-7.1898305084745762E-2,4.2304116032505235]
[null,null,null,"VCOMP3",{"$f":"((E29+SQRT(E30)+E31)^(1/3))+(E32/((E29+SQRT(E30)+E31)^(1/3)))+E33","v":2.3408922604841584},null,237,8.3560070042926066E-2,4.2741617651777402,3.1066055536181758,3.1025173990844466,4.5657096939147324E-4,0.5213675213675214,2.3596715937053068,7.3252235055858844E-2,2.4487809875527518,1.4917054789159823,6.7799508007635123E-2,0.76038338658146953,2.2694933042177174,1.4807543299679446,1.4604106126431646,2.2694933042177174,16.877637130801688,-7.159493670886076E-2,4.2281635312194776]
["a3",1.0069999999999999,null,null,null,null,238,8.2859359759923631E-2,4.258303942634976,3.0805713969441699,3.0764837503680575,4.5657096939147324E-4,0.5213675213675214,2.3545204340769428,7.3252235055858844E-2,2.4083379496744257,1.4787302418560568,6.7799508007635123E-2,0.76038338658146953,2.2655680063189774,1.4766335134554744,1.4604106126431646,2.2655680063189774,16.806722689075631,-7.1294117647058827E-2,4.2259337702079574]
["b3",0.12230000000000001,null,"a3",1.0069999999999999,null,239,8.2167426589890138E-2,4.2425788215360853,3.0548633447097902,3.050776199728606,4.5657096939147324E-4,0.5213675213675214,2.3494052261207821,7.3252235055858844E-2,2.3687319156564102,1.4659175329111545,6.7799508007635123E-2,0.76038338658146953,2.2616710559849036,1.4725471807631922,1.4604106126431646,2.2616710559849036,16.736401673640167,-7.099581589958158E-2,4.2237221290751554]
["c3",0.5,null,"b3",0.12230000000000001,null,240,8.1484124552797133E-2,4.2269847431130181,3.0294759731799727,3.0253893235368512,4.5657096939147324E-4,0.5213675213675214,{"$f":"(J37+K37)^(1/3)+(L37/(J37^(1/3)))+M37","v":2.3443255700886541},7.3252235055858844E-2,2.3299421381285064,1.4532646489305994,6.7799508007635123E-2,0.76038338658146953,2.257802137107821,1.4684949008433454,1.4604106126431646,2.257802137107821,16.666666666666668,-7.0699999999999999E-2,4.2215284193768969]
["VCOMP4",{"$f":"c_3+(SQRT(ftyp)*SQRT(B10)/(SQRT(a_3)*SQRT(b_3)*SQRT(fsw*kHz)))","v":1.556539891829104},null,"c3",0.5,null,241,8.080931069095082E-2,4.2115200761291467,3.0044039709113299,3.0003178104530397,4.5657096939147324E-4,0.5213675213675214,2.3392810723185686,7.3252235055858844E-2,2.2919484678140831,1.4407689427290831,6.7799508007635123E-2,0.76038338658146953,2.2539609383965571,1.4644762498025017,1.4604106126431646,2.2539609383965571,16.597510373443985,-7.0406639004149382E-2,4.2193524553164288]
[null,null,null,"VCOMP4",{"$f":"c_3+(SQRT(ftyp)*SQRT(E11)/(SQRT(a_3)*SQRT(b_3)*SQRT(fsw*kHz)))","v":1.556539891829104},null,242,{"$f":"(Iout*(Vout_nom^2)*2.5*Rsense*K_1)/(eff*(G39^2)*K_FQ)*us","v":8.0142844994213411E-2},{"$f":"(1*10^-9*(5*10^8*SQRT(fsw*kHz)+(1.09655978*10^10)*SQRT(ftyp)*SQRT(H39)))/SQRT(fsw*kHz)","v":4.1961832163104305},{"$f":"(b_1^3/(27*a_1^3))-(d_1^3/27)+SQRT((ftyp)^2*H39^2/(4*a_1^2*c_1^2*(fsw*kHz)^2))+(b_1^3*(ftyp)*H39/(27*a_1^4*c_1*(fsw*kHz))-(d_1^3*(ftyp)*H39/(27*a_1*c_1*(fsw*kHz)))+(b_1*d_1^2*(ftyp)*H39/(9*a_1^2*c_1*(fsw*kHz)))-(b_1^2*d_1*(ftyp)*H39/(9*a_1^3*c_1*(fsw*kHz))))","v":2.979642135973835},{"$f":"(b_1*d_1^2/(9*a_1))-(b_1^2*d_1/(9*a_1^2))+(ftyp*H39/(2*a_1*c_1*fsw*kHz))","v":2.9755564586486378},{"$f":"(d_1^2/9)+(b_1^2/(9*a_1^2))-(2*b_1*d_1/(9*a_1))","v":4.5657096939147324E-4},{"$f":"((b_1*c_1*fsw*kHz)+(2*a_1*c_1*d_1*fsw*kHz))/(3*a_1*c_1*fsw*kHz)","v":0.5213675213675214},2.3342713451172741,{"$f":"(b_2^3/(27*a_2^3))-(d_2^3/27)","v":7.3252235055858844E-2},{"$f":"(ftyp^2*H39^2/(4*a_2^2*c_2^2*(fsw*kHz)^2))+(b_2^3*ftyp*H39/(27*a_2^4*c_2*(fsw*kHz)))-(d_2^3*ftyp*H39/(27*a_2*c_2*(fsw*kHz)))+(b_2*d_2^2*ftyp*H39/(9*a_2^2*c_2*(fsw*kHz)))-(b_2^2*d_2*ftyp*H39/(9*a_2^3*c_2*(fsw*kHz)))","v":2.2547313338969737},{"$f":"(b_2*d_2^2/(9*a_2))-(b_2^2*d_2/(9*a_2^2))+(ftyp*H39/(2*a_2*c_2*(fsw*kHz)))","v":1.4284278217019692},{"$f":"(d_2^2/9)+(b_2^2/(9*a_2^2))-(2*b_2*d_2/(9*a_2))","v":6.7799508007635123E-2},{"$f":"(b_2*c_2*(fsw*kHz)+2*a_2*c_2*d_2*(fsw*kHz))/(3*a_2*c_2*(fsw*kHz))","v":0.76038338658146953},2.2501471532834563,{"$f":"c_3+(SQRT(ftyp)*SQRT(H39)/(SQRT(a_3)*SQRT(b_3)*SQRT(fsw*kHz)))","v":1.4604908107537309},{"$f":"(a_4*(fsw*kHz)*b_4/ftyp)","v":1.4604106126431646},2.2501471532834563,{"$f":"Pin_max/G39","v":16.528925619834709},{"$f":"-X39*Rsense*1.414","v":-7.0115702479338834E-2},{"$f":"MIN(6,MAX(0.5,Beta*G*($Y39-Voff_trim)/(MAX(0,MIN(4.5,W39)-Alpha1_A)+MAX(0,MIN(4.5,W39)-Alpha1_B)-Alpha1_C)+Alpha2))","v":4.2171940536962751}]
["a4",1.0069999999999999,null,null,null,null,243,7.9484590327374108E-2,4.1809725857906352,2.9551853732523576,2.9511001731079296,4.5657096939147324E-4,0.5213675213675214,2.3292960066455488,7.3252235055858844E-2,2.2182717251106343,1.416238746480402,6.7799508007635123E-2,0.76038338658146953,2.2463604798335566,1.4565381736724401,1.4604106126431646,2.2463604798335566,16.460905349794238,-6.9827160493827159E-2,4.2150530338712002]
["b4",2.056,null,"a4",1.0069999999999999,null,244,7.8834412359599468E-2,4.1658866325701815,2.9310286918254733,2.9269439630068685,4.5657096939147324E-4,0.5213675213675214,2.324354680806163,7.3252235055858844E-2,2.1825511715201626,1.4041992296249213,6.7799508007635123E-2,0.76038338658146953,2.2426006206558835,1.4526179352557496,1.4604106126431646,2.2426006206558835,16.393442622950818,-6.9540983606557374E-2,4.21292921770217]
["VCOMP5",{"$f":"(a_4*(fsw*kHz)*b_4/ftyp)","v":1.4604106126431646},null,"b4",2.056,null,245,7.8192179495895284E-2,4.1509238299882618,2.9071672024189987,2.9030829391666675,4.5657096939147324E-4,0.5213675213675214,2.3194469971344329,7.3252235055858844E-2,2.1475517269690787,1.3923068343563225,6.7799508007635123E-2,0.76038338658146953,2.238867282816793,1.4487296987853178,1.4604106126431646,2.238867282816793,16.326530612244898,-6.9257142857142864E-2,4.2108224295113672]
[null,null,null,"VCOMP5",{"$f":"(a_4*(fsw*kHz)*b_4/ftyp)","v":1.4604106126431646},null,246,7.755776281051481E-2,4.1360826762078231,2.8835961149318456,2.8795123115796968,4.5657096939147324E-4,0.5213675213675214,2.3145725906912955,7.3252235055858844E-2,2.1132559521640242,1.3805591733225608,6.7799508007635123E-2,0.76038338658146953,2.2351601777553176,1.4448730739935078,1.4604106126431646,2.2351601777553176,16.260162601626018,-6.8975609756097567E-2,4.2087324960381594]
["VCOMP =",{"$f":"IF(B12>=0.5,IF(B12<1,B12,IF(B22>=1,IF(B22<2,B22,IF(B33>=2,IF(B33<4.5,B33,IF(B38>=4.5,IF(B38<4.6,B38,B42))))))))","v":2.3408922604841584},null,null,null,null,247,7.6931035982250401E-2,4.1213616937130544,2.8603107360318445,2.8562273870053621,4.5657096939147324E-4,0.5213675213675214,2.3097311019588407,7.3252235055858844E-2,2.0796468983717129,1.3689539074005281,6.7799508007635123E-2,0.76038338658146953,2.2314790212004532,1.4410476769328053,1.4604106126431646,2.2314790212004532,16.194331983805668,-6.8696356275303641E-2,4.2066592463960397]
["ICOMP =",{"$f":"MIN(6,MAX(0.5,Beta*G*((Pin_max*Rsense*-1.414/B5)-Voff_trim)/(MAX(0,MIN(4.5,B44)-Alpha1_A)+MAX(0,MIN(4.5,B44)-Alpha1_B)-Alpha1_C)+Alpha2))","v":4.2690383054952452},null,"VCOMP =",{"$f":"IF(E13>=0.5,IF(E13<1,E13,IF(E23>=1,IF(E23<2,E23,IF(E34>=2,IF(E34<4.5,E34,IF(E39>=4.5,IF(E39<4.6,E39,E43))))))))","v":2.3408922604841584},null,248,7.6311875231547768E-2,4.1067594288190499,2.8373064668192987,2.8332235666336949,4.5657096939147324E-4,0.5213675213675214,2.3049221767382329,7.3252235055858844E-2,2.0467080917036111,1.3574887445315822,6.7799508007635123E-2,0.76038338658146953,2.2278235330903371,1.4372531298483988,1.4604106126431646,2.2278235330903371,16.129032258064516,-6.8419354838709673E-2,4.204602512030517]
[null,null,null,null,null,null,249,7.5700159259384753E-2,4.0922744511932709,2.8145788005560819,2.8104963438145014,4.5657096939147324E-4,0.5213675213675214,2.300145466049953,7.3252235055858844E-2,2.0144235179648975,1.3461614385897478,6.7799508007635123E-2,0.76038338658146953,2.2241934374932706,1.4334890610538269,1.4604106126431646,2.2241934374932706,16.064257028112451,-6.8144578313253018E-2,4.2025621266778952]
[null,null,null,null,null,null,{"$f":"G46+1","v":250},7.5095769187857819E-2,4.0779053533884975,2.7921233204581948,2.7880413018499599,4.5657096939147324E-4,0.5213675213675214,2.2954006260363053,7.3252235055858844E-2,1.9827776080452628,1.3349697882815419,6.7799508007635123E-2,0.76038338658146953,2.2205884625305305,1.4297551048096118,1.4604106126431646,2.2205884625305305,16,-6.7872000000000002E-2,4.2005379263249543]
[null,null,null,null,null,null,251,7.4498588502422414E-2,4.0636507503869499,2.7699356975497675,2.7658541118486624,4.5657096939147324E-4,0.5213675213675214,2.2906873178661309,7.3252235055858844E-2,1.9517552238301223,1.3239116360764223,6.7799508007635123E-2,0.76038338658146953,2.217008340300926,1.4260509012047926,1.4604106126431646,2.217008340300926,15.936254980079681,-6.7601593625498002E-2,4.1985297491695031]
[null,null,null,null,null,null,252,7.3908502995734343E-2,4.0495092791552558,2.7480116885765411,2.7439305306391426,4.5657096939147324E-4,0.5213675213675214,2.286005207641657,7.3252235055858844E-2,1.9213416446116913,1.3129848671668853,6.7799508007635123E-2,0.76038338658146953,2.2134528068070534,1.4223760960412815,1.4604106126431646,2.2134528068070534,15.873015873015873,-6.7333333333333342E-2,4.1965374355817637]
[null,null,null,null,null,null,253,7.3325400713042152E-2,4.0354795982099771,2.7263471339769816,2.7222663987410236,4.5657096939147324E-4,0.5213675213675214,2.2813539663074414,7.3252235055858844E-2,1.8915225539803302,1.3021874084572795,6.7799508007635123E-2,0.76038338658146953,2.209921601883206,1.4187303407209604,1.4604106126431646,2.209921601883206,15.810276679841897,-6.7067193675889314E-2,4.194560828066578]
[null,null,null,null,null,null,254,7.2749171899081061E-2,4.0215603871934027,2.7049379559091791,2.7008576383919589,4.5657096939147324E-4,0.5213675213675214,2.2767332695613458,7.3252235055858844E-2,1.8622840271773236,1.2915172275804294,6.7799508007635123E-2,0.76038338658146953,2.2064144691248897,1.4151132921354446,1.4604106126431646,2.2064144691248897,15.748031496062993,-6.6803149606299211E-2,4.192599771226444]
[null,null,null,null,null,null,255,7.2179708946422366E-2,4.0077503464593107,2.6837801563318222,2.6797002516286441,4.5657096939147324E-4,0.5213675213675214,2.2721427977674904,7.3252235055858844E-2,1.8336125188911669,1.2809723319412054,6.7799508007635123E-2,0.76038338658146953,2.2029311558199129,1.4115246125584429,1.4604106126431646,2.2029311558199129,15.686274509803921,-6.6541176470588229E-2,4.1906541117252809]
[null,null,null,null,null,null,256,7.1616906345231851E-2,3.9940481966684542,2.6628698151375274,2.6587903184201815,4.5657096939147324E-4,0.5213675213675214,2.2675822358711351,7.3252235055858844E-2,1.8054948514800853,1.2705507677861889,6.7799508007635123E-2,0.76038338658146953,2.1994714128809951,1.4079639695406363,1.4604106126431646,2.1994714128809951,15.625,-6.628125E-2,4.1887236982530229]
[null,null,null,null,null,null,257,7.1060660634394382E-2,3.9804526783934802,2.6422030883369216,2.6381239948521991,4.5657096939147324E-4,0.5213675213675214,2.26305127331544,7.3252235055858844E-2,1.7779182036043557,1.2602506192986322,6.7799508007635123E-2,0.76038338658146953,2.1960349947798714,1.4044310358070153,1.4604106126431646,2.1960349947798714,15.56420233463035,-6.6023346303501942E-2,4.1868083814908985]
[null,null,null,null,null,null,258,7.0510870353961808E-2,3.9669625517330402,2.6217762062918961,2.617697511360138,4.5657096939147324E-4,0.5213675213675214,2.2585496039600566,7.3252235055858844E-2,1.7508700992526163,1.2500700077179243,6.7799508007635123E-2,0.76038338658146953,2.1926216594828389,1.4009254891566005,1.4604106126431646,2.1926216594828389,15.503875968992247,-6.5767441860465112E-2,4.184908014077469]
[null,null,null,null,null,null,259,6.9967435998883651E-2,3.9535765959348428,2.6015854719965175,2.5975071710101978,4.5657096939147324E-4,0.5213675213675214,{"$f":"(J56+K56)^(1/3)+(L56/(J56^(1/3)))+M56","v":2.2540769260014963},7.3252235055858844E-2,1.7243383971470612,1.2400070904828104,6.7799508007635123E-2,0.76038338658146953,2.1892311683877193,1.39744701236449,1.4604106126431646,2.1892311683877193,15.444015444015443,-6.5513513513513505E-2,4.1830224505753657]
[null,null,null,null,null,null,260,6.9430259973980973E-2,3.940293609027401,2.5816272594041276,2.5775493478264697,4.5657096939147324E-4,0.5213675213675214,2.2496329418952423,7.3252235055858844E-2,1.6983112805130223,1.2300600603976297,6.7799508007635123E-2,0.76038338658146953,2.1858632862621916,1.393995293086165,1.4604106126431646,2.1858632862621916,15.384615384615385,-6.5261538461538468E-2,4.1811515474387209]
[null,null,null,null,null,null,261,6.889924655012572E-2,3.927112407460247,2.5618980117992378,2.5578204851628592,4.5657096939147324E-4,0.5213675213675214,2.2452173582795485,7.3252235055858844E-2,1.6727772471990889,1.2202271448208781,6.7799508007635123E-2,0.76038338658146953,2.1825177811834742,1.390570023763996,1.4604106126431646,2.1825177811834742,15.325670498084291,-6.5011494252873558E-2,4.1792951629812443]
[null,null,null,null,null,null,262,6.8374301821588393E-2,3.914031825752383,2.5423942402128188,2.5383170941184128,4.5657096939147324E-4,0.5213675213675214,2.2408298859008888,7.3252235055858844E-2,1.6477251001344408,1.2105066048754034,6.7799508007635123E-2,0.76038338658146953,2.1791944244792996,1.3871709015358888,1.4604106126431646,2.1791944244792996,15.267175572519085,-6.4763358778625948E-2,4.1774531573450187]
[null,null,null,null,null,null,263,6.7855333664518985E-2,3.9010507161487613,2.5231125218797112,2.5190357519947528,4.5657096939147324E-4,0.5213675213675214,2.2364702395410165,7.3252235055858844E-2,1.6231439381106751,1.2008967346795854,6.7799508007635123E-2,0.76038338658146953,2.1758929906701754,1.3837976281460185,1.4604106126431646,2.1758929906701754,15.209125475285171,-6.4517110266159694E-2,4.1756253924698594]
[null,null,null,null,null,null,264,6.7342251696526551E-2,3.8881679482845626,2.5040494987368414,2.4999731007943247,4.5657096939147324E-4,0.5213675213675214,2.232138137945586,7.3252235055858844E-2,1.5990231468758902,1.1913958605988608,6.7799508007635123E-2,0.76038338658146953,2.1726132574128769,1.3804499098575866,1.4604106126431646,2.1726132574128769,15.151515151515152,-6.4272727272727273E-2,4.1738117320633563]
[null,null,null,null,null,null,265,6.6834967237324502E-2,3.8753824088570727,2.485201875961041,2.4811258457582466,4.5657096939147324E-4,0.5213675213675214,2.2278333037543057,7.3252235055858844E-2,1.5753523905293332,1.1820023405169817,6.7799508007635123E-2,0.76038338658146953,2.1693550054451536,1.3771274573675583,1.4604106126431646,2.1693550054451536,15.09433962264151,-6.4030188679245287E-2,4.1720120415715023]
[null,null,null,null,null,null,266,6.6333393270409782E-2,3.8626930013049789,2.4665664205452753,2.4624907539425638,4.5657096939147324E-4,0.5213675213675214,2.223555463432576,7.3252235055858844E-2,1.5521216032053746,1.1727145631264178,6.7799508007635123E-2,0.76038338658146953,2.1661180185316109,1.3738299857233192,1.4604106126431646,2.1661180185316109,15.037593984962406,-6.3789473684210535E-2,4.1702261881499272]
[null,null,null,null,null,null,{"$f":"G63+1","v":267},6.5837444405744419E-2,3.8500986454948469,2.4481399599121172,2.4440646528317496,4.5657096939147324E-4,0.5213675213675214,2.2193043472045826,7.3252235055858844E-2,1.5293209810360278,1.1635309472373219,6.7799508007635123E-2,0.76038338658146953,2.1629020834107475,1.3705572142412092,1.4604106126431646,2.1629020834107475,14.9812734082397,-6.35505617977528E-2,4.1684540406356927]
[null,null,null,null,null,null,268,6.5347036843410478E-2,3.8375982774146435,2.4299193805633839,2.4258444289883694,4.5657096939147324E-4,0.5213675213675214,2.2150796889878044,7.3252235055858844E-2,1.5069409743817082,1.1544499411045188,6.7799508007635123E-2,0.76038338658146953,2.1597069897431087,1.3673088664268764,1.4604106126431646,2.1597069897431087,14.925373134328359,-6.3313432835820901E-2,4.1666954695196843]
[null,null,null,null,null,null,269,6.4862088338208626E-2,3.8251908488740685,2.4119016267648345,2.4078270267378032,4.5657096939147324E-4,0.5213675213675214,2.2108812263288993,7.3252235055858844E-2,1.4849722803202932,1.1454700217719684,6.7799508007635123E-2,0.76038338658146953,2.1565325300605327,1.3640846698974087,1.4604106126431646,2.1565325300605327,14.869888475836431,-6.3078066914498132E-2,4.1649503469195324]
[null,null,null,null,null,null,270,6.4382518165173028E-2,3.8128753272115716,2.3940836992649106,2.3900094468870114,4.5657096939147324E-4,0.5213675213675214,2.2067087003409402,7.3252235055858844E-2,1.4634058353849941,1.1365896944341936,6.7799508007635123E-2,0.76038338658146953,2.1533784997164678,1.360884356305196,1.4604106126431646,2.1533784997164678,14.814814814814815,-6.2844444444444439E-2,4.1632185465530931]
[null,null,null,null,null,null,271,6.3908247085975325E-2,3.8006506950078394,2.3764626540465117,2.3723887454763362,4.5657096939147324E-4,0.5213675213675214,2.2025618556419624,7.3252235055858844E-2,1.4422328085419052,1.1278074918141765,6.7799508007635123E-2,0.76038338658146953,2.1502446968373254,1.3577076612634793,1.4604106126431646,2.1502446968373254,14.760147601476016,-6.2612546125461258E-2,4.1614999437124371]
[null,null,null,null,null,null,272,6.343919731619152E-2,3.7885159498056042,2.3590356011108327,2.3549620325633587,4.5657096939147324E-4,0.5213675213675214,2.1984404402947919,7.3252235055858844E-2,1.4214445943984688,1.1191219735572291,6.7799508007635123E-2,0.76038338658146953,2.1471309222748474,1.3545543242735403,1.4604106126431646,2.1471309222748474,14.705882352941176,-6.2382352941176458E-2,4.1597944152383768]
[null,null,null,null,null,null,273,6.2975292493406776E-2,3.7764701038356208,2.3417997032923288,2.3377264710378904,4.5657096939147324E-4,0.5213675213675214,2.1943442057481235,7.3252235055858844E-2,1.4010328066344611,1.1105317256403824,6.7799508007635123E-2,0.76038338658146953,2.144036979559468,1.3514240886534905,1.4604106126431646,2.144036979559468,14.652014652014651,-6.2153846153846143E-2,4.1581018394954699]
[null,null,null,null,null,null,274,{"$f":"(Iout*(Vout_nom^2)*2.5*Rsense*K_1)/(eff*(G71^2)*K_FQ)*us","v":6.2516457646133436E-2},{"$f":"(1*10^-9*(5*10^8*SQRT(fsw*kHz)+(1.09655978*10^10)*SQRT(ftyp)*SQRT(H71)))/SQRT(fsw*kHz)","v":3.7645121837486295},{"$f":"(b_1^3/(27*a_1^3))-(d_1^3/27)+SQRT((ftyp)^2*H71^2/(4*a_1^2*c_1^2*(fsw*kHz)^2))+(b_1^3*(ftyp)*H71/(27*a_1^4*c_1*(fsw*kHz))-(d_1^3*(ftyp)*H71/(27*a_1*c_1*(fsw*kHz)))+(b_1*d_1^2*(ftyp)*H71/(9*a_1^2*c_1*(fsw*kHz)))-(b_1^2*d_1*(ftyp)*H71/(9*a_1^3*c_1*(fsw*kHz))))","v":2.3247521751038973},{"$f":"(b_1*d_1^2/(9*a_1))-(b_1^2*d_1/(9*a_1^2))+(ftyp*H71/(2*a_1*c_1*fsw*kHz))","v":2.3206792754671772},{"$f":"(d_1^2/9)+(b_1^2/(9*a_1^2))-(2*b_1*d_1/(9*a_1))","v":4.5657096939147324E-4},{"$f":"((b_1*c_1*fsw*kHz)+(2*a_1*c_1*d_1*fsw*kHz))/(3*a_1*c_1*fsw*kHz)","v":0.5213675213675214},2.1902729067788202,{"$f":"(b_2^3/(27*a_2^3))-(d_2^3/27)","v":7.3252235055858844E-2},{"$f":"(ftyp^2*H71^2/(4*a_2^2*c_2^2*(fsw*kHz)^2))+(b_2^3*ftyp*H71/(27*a_2^4*c_2*(fsw*kHz)))-(d_2^3*ftyp*H71/(27*a_2*c_2*(fsw*kHz)))+(b_2*d_2^2*ftyp*H71/(9*a_2^2*c_2*(fsw*kHz)))-(b_2^2*d_2*ftyp*H71/(9*a_2^3*c_2*(fsw*kHz)))","v":1.3809892716474039},{"$f":"(b_2*d_2^2/(9*a_2))-(b_2^2*d_2/(9*a_2^2))+(ftyp*H71/(2*a_2*c_2*(fsw*kHz)))","v":1.1020353597968322},{"$f":"(d_2^2/9)+(b_2^2/(9*a_2^2))-(2*b_2*d_2/(9*a_2))","v":6.7799508007635123E-2},{"$f":"(b_2*c_2*(fsw*kHz)+2*a_2*c_2*d_2*(fsw*kHz))/(3*a_2*c_2*(fsw*kHz))","v":0.76038338658146953},2.1409626748546335,{"$f":"c_3+(SQRT(ftyp)*SQRT(H71)/(SQRT(a_3)*SQRT(b_3)*SQRT(fsw*kHz)))","v":1.3483167014686237},{"$f":"(a_4*(fsw*kHz)*b_4/ftyp)","v":1.4604106126431646},2.1409626748546335,{"$f":"Pin_max/G71","v":14.598540145985401},{"$f":"-X71*Rsense*1.414","v":-6.1927007299270073E-2},{"$f":"MIN(6,MAX(0.5,Beta*G*($Y71-Voff_trim)/(MAX(0,MIN(4.5,W71)-Alpha1_A)+MAX(0,MIN(4.5,W71)-Alpha1_B)-Alpha1_C)+Alpha2))","v":4.1564220963475513}]
[null,null,null,null,null,null,275,6.2062619163518865E-2,3.7526412303531793,2.3078902816114057,2.3038177109704483,4.5657096939147324E-4,0.5213675213675214,{"$f":"(J72+K72)^(1/3)+(L72/(J72^(1/3)))+M72","v":2.1862263014353971},7.3252235055858844E-2,1.3613060224046782,1.093631512955012,6.7799508007635123E-2,0.76038338658146953,{"$f":"((O72+SQRT(P72)+Q72)^(1/3))+(R72/((O72+SQRT(P72)+Q72)^(1/3)))+S72","v":2.1379078169120711},1.3452319134632833,1.4604106126431646,{"$f":"IF(I72>=0.5,IF(I72<1,I72,IF(N72>=1,IF(N72<2,N72,IF(T72>=2,IF(T72<4.5,T72,IF(U72>=4.5,IF(U72<4.6,U72,V72))))))))","v":2.1379078169120711},14.545454545454545,-6.170181818181817E-2,4.1547550671337063]
[null,null,null,null,null,null,{"$f":"G72+1","v":276},6.1613704765820121E-2,3.7408562983591462,2.2912113373367071,2.2871390921219534,4.5657096939147324E-4,0.5213675213675214,2.182204150982674,7.3252235055858844E-2,1.3419752924948707,1.0853188466918644,6.7799508007635123E-2,0.76038338658146953,2.134872217027973,1.3421694789942133,1.4604106126431646,2.134872217027973,14.492753623188406,-6.1478260869565211E-2,4.1531006346447406]
[null,null,null,null,null,null,277,6.1169643475623481E-2,3.7291564561268031,2.2747127051883331,2.2706407818816778,4.5657096939147324E-4,0.5213675213675214,2.1782062198475538,7.3252235055858844E-2,1.3229895103712208,1.0770960466999058,6.7799508007635123E-2,0.76038338658146953,2.131855689000079,1.3391291559653533,1.4604106126431646,2.131855689000079,14.440433212996389,-6.125631768953068E-2,4.1514586831001008]
[null,null,null,null,null,null,278,6.07303655897872E-2,3.7175407854213103,2.2583917954190551,2.2543201905529213,4.5657096939147324E-4,0.5213675213675214,2.17423227556591,7.3252235055858844E-2,1.3043412937802865,1.0689618222676822,6.7799508007635123E-2,0.76038338658146953,2.1288580490856361,1.3361107057640391,1.4604106126431646,2.1288580490856361,14.388489208633093,-6.1035971223021582E-2,4.149829098125231]
[null,null,null,null,null,null,279,6.029580265208713E-2,3.7060083811724884,2.2422460646095637,2.2381747747660001,4.5657096939147324E-4,0.5213675213675214,2.1702820887305574,7.3252235055858844E-2,1.2860234443692389,1.0609149057732421,6.7799508007635123E-2,0.76038338658146953,2.1258791159602084,1.3331138931985766,1.4604106126431646,2.1258791159602084,14.336917562724015,-6.0817204301075269E-2,4.1482117667293963]
[null,null,null,null,null,null,280,5.986588742654482E-2,3.69455835123973,2.2262730146774992,2.2222020364872943,4.5657096939147324E-4,0.5213675213675214,2.1663554329402666,7.3252235055858844E-2,1.268028942465435,1.0529540521902452,6.7799508007635123E-2,0.76038338658146953,2.1229187106773284,1.3301384864371533,1.4604106126431646,2.1229187106773284,14.285714285714286,-6.0599999999999994E-2,4.1466065772838938]
[null,null,null,null,null,null,281,5.9440553871418979E-2,3.6831898161819372,2.2104701919111323,2.2063995220529504,4.5657096939147324E-4,0.5213675213675214,2.1624520847498165,7.3252235055858844E-2,1.2503509420221828,1.045078038606355,6.7799508007635123E-2,0.76038338658146953,2.1199766566289551,1.327184256948053,1.4604106126431646,2.1199766566289551,14.234875444839858,-6.0384341637010674E-2,4.1450134195007227]
[null,null,null,null,null,null,282,5.9019737113841279E-2,3.6719019090323557,2.1948351860269861,2.1907648212265185,4.5657096939147324E-4,0.5213675213675214,2.1585718236210472,7.3252235055858844E-2,1.2329827657248298,1.0372856637535646,6.7799508007635123E-2,0.76038338658146953,2.117052779506734,1.324250979441145,1.4604106126431646,2.117052779506734,14.184397163120567,-6.0170212765957444E-2,4.1434321844116306]
[null,null,null,null,null,null,283,5.8603373425078514E-2,3.6606937750781774,2.1793656292507242,2.1752955662798601,4.5657096939147324E-4,0.5213675213675214,2.1547144318748939,7.3252235055858844E-2,1.2159179002515499,1.0295757475501182,6.7799508007635123E-2,0.76038338658146953,2.1141469072640287,1.3213384318106107,1.4604106126431646,2.1141469072640287,14.134275618374557,-5.9957597173144868E-2,4.1418627643475778]
[null,null,null,null,null,null,{"$f":"G80+1","v":284},5.8191400196403426E-2,3.6495645716448046,2.1640591954206587,2.1599894310966739,4.5657096939147324E-4,0.5213675213675214,2.1508796946443796,7.3252235055858844E-2,1.1991499916834139,1.021947130653706,6.7799508007635123E-2,0.76038338658146953,2.1112588700787134,1.3184463950788836,1.4604106126431646,2.1112588700787134,14.084507042253522,-5.9746478873239445E-2,4.1403050529185901]
[null,null,null,null,null,null,{"$f":"G81+1","v":285},5.7783755915556956E-2,3.6385134678846467,2.1489135991132295,2.1448441302979915,4.5657096939147324E-4,0.5213675213675214,2.147067399828539,7.3252235055858844E-2,1.182672841058523,1.0143986740256086,6.7799508007635123E-2,0.76038338658146953,2.108388500316706,1.3155746533417645,1.4604106126431646,2.108388500316706,14.035087719298245,-5.9536842105263152E-2,4.1387589449939757]
[null,null,null,null,null,null,286,5.7380380143785936E-2,3.6275396445703647,2.1339265947898629,2.1298574183890517,4.5657096939147324E-4,0.5213675213675214,2.1432773380472625,7.3252235055858844E-2,1.1664804000652242,1.0069292585054981,6.7799508007635123E-2,0.76038338658146953,2.1055356324962227,1.3127229937146954,1.4604106126431646,2.1055356324962227,13.986013986013987,-5.9328671328671326E-2,4.1372243366829462]
[null,null,null,null,null,null,287,5.6981213493439445E-2,3.616642293892419,2.1190959759645893,2.115027088926936,4.5657096939147324E-4,0.5213675213675214,2.1395093025970255,7.3252235055858844E-2,1.1505667668695541,0.99953778439658392,6.7799508007635123E-2,0.76038338658146953,2.102700103252741,1.3098912062801493,1.4604106126431646,2.102700103252741,13.937282229965156,-5.9121951219512185E-2,4.135701125315574]
[null,null,null,null,null,null,288,5.6586197606109112E-2,3.6058206192608488,2.1044195743918679,2.1003509737084087,4.5657096939147324E-4,0.5213675213675214,2.1357630894074968,7.3252235055858844E-2,1.1349261820723096,0.99222317106083235,6.7799508007635123E-2,0.76038338658146953,2.0998817513046522,1.3070790840361213,1.4604106126431646,2.0998817513046522,13.888888888888889,-5.8916666666666673E-2,4.1341892094241164]
[null,null,null,null,null,null,289,5.6195275131297691E-2,3.5950738351111569,2.0898952592740385,2.0858269419773854,4.5657096939147324E-4,0.5213675213675214,2.1320384969989887,7.3252235055858844E-2,1.1195530247912628,0.98498435652396454,6.7799508007635123E-2,0.76038338658146953,2.0970804174195861,1.304286422845685,1.4604106126431646,2.0970804174195861,13.84083044982699,-5.8712802768166095E-2,4.1326884887246944]
[null,null,null,null,null,null,290,5.5808389705601827E-2,3.5844011667142217,2.0755209364878828,2.0714528996515043,4.5657096939147324E-4,0.5213675213675214,2.1283353264407467,7.3252235055858844E-2,1.1044418088642449,0.97782029708997908,6.7799508007635123E-2,0.76038338658146953,2.0942959443813969,1.3015130213875961,1.4604106126431646,2.0942959443813969,13.793103448275861,-5.85103448275862E-2,4.1311988640993063]
[null,null,null,null,null,null,291,5.5425485932394679E-2,3.5738018499901179,2.0612945478297497,2.0572267885672746,4.5657096939147324E-4,0.5213675213675214,2.1246533813100514,7.3252235055858844E-2,1.0895871791689598,0.97072996696493175,6.7799508007635123E-2,0.76038338658146953,2.0915281769577927,1.2987586811079139,1.4604106126431646,2.0915281769577927,13.745704467353951,-5.8309278350515463E-2,4.1297202375781747]
[null,null,null,null,null,null,292,5.5046509361994678E-2,3.5632751313257685,2.0472140702787498,2.0431465857432762,4.5657096939147324E-4,0.5213675213675214,2.1209924676521092,7.3252235055858844E-2,1.074983908055555,0.9637123578897121,6.7799508007635123E-2,0.76038338658146953,2.0887769618685903,1.2960232061726127,1.4604106126431646,2.0887769618685903,13.698630136986301,-5.8109589041095887E-2,4.1282525123224261]
[null,null,null,null,null,null,293,5.4671406472307352E-2,3.5528202673963287,2.033277515277518,2.0292103026609452,4.5657096939147324E-4,0.5213675213675214,2.1173523939407244,7.3252235055858844E-2,1.0606268918881241,0.95676647878158538,6.7799508007635123E-2,0.76038338658146953,2.0860421477545898,1.2933064034211703,1.4604106126431646,2.0860421477545898,13.651877133105803,-5.7911262798634816E-2,4.1267955926070732]
[null,null,null,null,null,null,294,5.430012464992727E-2,3.5424365249902188,2.0194829280300803,2.015415984562448,4.5657096939147324E-4,0.5213675213675214,2.1137329710397279,7.3252235055858844E-2,1.0465111476914604,0.94989135538425129,6.7799508007635123E-2,0.76038338658146953,2.0833235851470455,1.2906080823210984,1.4604106126431646,2.0833235851470455,13.605442176870747,-5.7714285714285704E-2,4.1253493838043305]
[null,null,null,null,null,null,295,5.3932612171687606E-2,3.53212318083771,2.0058283868163467,2.0017617097651881,4.5657096939147324E-4,0.5213675213675214,2.1101340121651471,7.3252235055858844E-2,1.0326318098995062,0.94308602992619195,6.7799508007635123E-2,0.76038338658146953,2.0806211264377241,1.2879280549233996,1.4604106126431646,2.0806211264377241,13.559322033898304,-5.7518644067796602E-2,4.1239137923672295]
[null,null,null,null,null,null,296,5.3568818186645294E-2,3.5218795214429881,1.9923120023227867,1.9882455889924975,4.5657096939147324E-4,0.5213675213675214,2.1065553328481008,7.3252235055858844E-2,1.0189841272020834,0.93634956078708753,6.7799508007635123E-2,0.76038338658146953,2.0779346258495415,1.2852661358189288,1.4604106126431646,2.0779346258495415,13.513513513513514,-5.7324324324324327E-2,4.1224887258135112]
[null,null,null,null,null,null,297,5.3208692698490108E-2,3.5117048429196105,1.9789319169888566,1.9748657647200774,4.5657096939147324E-4,0.5213675213675214,2.1029967508984009,7.3252235055858844E-2,1.0055634594866234,0.92968102217207949,6.7799508007635123E-2,0.76038338658146953,2.0752639394077508,1.2826221420956327,1.4604106126431646,2.0752639394077508,13.468013468013469,-5.713131313131313E-2,4.1210740927098559]
[null,null,null,null,null,null,298,5.2852186548366216E-2,3.5015984508292766,1.9656863043687549,1.9616204105377619,4.5657096939147324E-4,0.5213675213675214,2.0994580863688497,7.3252235055858844E-2,0.99236527487171311,0.9230795037936731,6.7799508007635123E-2,0.76038338658146953,2.072608924911691,1.279995893296654,1.4604106126431646,2.072608924911691,13.422818791946309,-5.6939597315436248E-2,4.1196698026563441]
[null,null,null,null,null,null,299,5.2499251398095255E-2,3.4915596600238272,1.9525733685080919,1.9485077305262026,4.5657096939147324E-4,0.5213675213675214,2.0959391615202123,7.3252235055858844E-2,0.97938514682941769,0.91654411056107477,6.7799508007635123E-2,0.76038338658146953,2.0699694419070607,1.2773872113792741,1.4604106126431646,2.0699694419070607,13.377926421404682,-5.6749163879598663E-2,4.1182757662712444]
[null,null,null,null,null,null,300,5.2149839713790155E-2,3.4815877944904141,1.939591343335078,1.935525958648068,4.5657096939147324E-4,0.5213675213675214,2.0924398007868508,7.3252235055858844E-2,0.96661875139341913,0.91007396227676485,6.7799508007635123E-2,0.76038338658146953,2.0673453516587221,1.2747959206746764,1.4604106126431646,2.0673453516587221,13.333333333333334,-5.6559999999999999E-2,4.1168918951760514]
[null,null,null,null,null,null,301,5.1803904749849493E-2,3.4716821871997481,1.9267384920658519,1.9226733581533832,4.5657096939147324E-4,0.5213675213675214,2.0889598307430055,7.3252235055858844E-2,0.95406186445015795,0.90366819334011683,6.7799508007635123E-2,0.76038338658146953,2.0647365171240168,1.2722218478485146,1.4604106126431646,2.0647365171240168,13.289036544850498,-5.6372093023255805E-2,4.1155181019807934]
[null,null,null,null,null,null,302,5.1461400533322155E-2,3.4618421799573649,1.9140131066235644,1.9099482209986256,4.5657096939147324E-4,0.5213675213675214,2.0854990800697113,7.3252235055858844E-2,0.94171035911022305,0.8973259524578735,6.7799508007635123E-2,0.76038338658146953,2.06214280292658,1.2696648218622613,1.4604106126431646,2.06214280292658,13.245033112582782,-5.6185430463576158E-2,4.114154300269611]
[null,null,null,null,null,null,{"$f":"G99+1","v":303},5.1122281848632642E-2,3.4520671232578359,1.9014135070708647,1.8973488672792227,4.5657096939147324E-4,0.5213675213675214,2.0820573795223312,7.3252235055858844E-2,0.92956020315737442,0.89104640236130206,6.7799508007635123E-2,0.76038338658146953,2.0595640753306483,1.267124673935323,1.4604106126431646,2.0595640753306483,13.201320132013201,-5.5999999999999994E-2,4.1128004045865847]
[null,null,null,null,null,null,{"$f":"G100+1","v":304},5.0786504222657486E-2,3.4423563761418561,1.8889380410554293,1.88487364467509,4.5657096939147324E-4,0.5213675213675214,2.0786345618986957,7.3252235055858844E-2,0.91760745657264309,0.88482871952984932,6.7799508007635123E-2,0.76038338658146953,2.057000202215844,1.2646012375079043,1.4604106126431646,2.057000202215844,13.157894736842104,-5.5815789473684208E-2,4.1114563304218255]
[null,null,null,null,null,null,305,5.0454023910143656E-2,3.4327093060561453,1.8765850832681987,1.8725209279088795,4.5657096939147324E-4,0.5213675213675214,2.0752304620078341,7.3252235055858844E-2,0.90584826913107341,0.87867209392113099,6.7799508007635123E-2,0.76038338658146953,2.054451053052432,1.2620943482045996,1.4604106126431646,2.054451053052432,13.114754098360656,-5.5632786885245901E-2,4.1101219941977885]
[null,null,null,null,null,null,306,{"$f":"(Iout*(Vout_nom^2)*2.5*Rsense*K_1)/(eff*(G103^2)*K_FQ)*us","v":5.0124797879459976E-2},{"$f":"(1*10^-9*(5*10^8*SQRT(fsw*kHz)+(1.09655978*10^10)*SQRT(ftyp)*SQRT(H103)))/SQRT(fsw*kHz)","v":3.4231252887160926},{"$f":"(b_1^3/(27*a_1^3))-(d_1^3/27)+SQRT((ftyp)^2*H103^2/(4*a_1^2*c_1^2*(fsw*kHz)^2))+(b_1^3*(ftyp)*H103/(27*a_1^4*c_1*(fsw*kHz))-(d_1^3*(ftyp)*H103/(27*a_1*c_1*(fsw*kHz)))+(b_1*d_1^2*(ftyp)*H103/(9*a_1^2*c_1*(fsw*kHz)))-(b_1^2*d_1*(ftyp)*H103/(9*a_1^3*c_1*(fsw*kHz))))","v":1.8643530349139859},{"$f":"(b_1*d_1^2/(9*a_1))-(b_1^2*d_1/(9*a_1^2))+(ftyp*H103/(2*a_1*c_1*fsw*kHz))","v":1.8602891182165986},{"$f":"(d_1^2/9)+(b_1^2/(9*a_1^2))-(2*b_1*d_1/(9*a_1))","v":4.5657096939147324E-4},{"$f":"((b_1*c_1*fsw*kHz)+(2*a_1*c_1*d_1*fsw*kHz))/(3*a_1*c_1*fsw*kHz)","v":0.5213675213675214},2.0718449166392876,{"$f":"(b_2^3/(27*a_2^3))-(d_2^3/27)","v":7.3252235055858844E-2},{"$f":"(ftyp^2*H103^2/(4*a_2^2*c_2^2*(fsw*kHz)^2))+(b_2^3*ftyp*H103/(27*a_2^4*c_2*(fsw*kHz)))-(d_2^3*ftyp*H103/(27*a_2*c_2*(fsw*kHz)))+(b_2*d_2^2*ftyp*H103/(9*a_2^2*c_2*(fsw*kHz)))-(b_2^2*d_2*ftyp*H103/(9*a_2^3*c_2*(fsw*kHz)))","v":0.89427887806874118},{"$f":"(b_2*d_2^2/(9*a_2))-(b_2^2*d_2/(9*a_2^2))+(ftyp*H103/(2*a_2*c_2*(fsw*kHz)))","v":0.87257572870708677},{"$f":"(d_2^2/9)+(b_2^2/(9*a_2^2))-(2*b_2*d_2/(9*a_2))","v":6.7799508007635123E-2},{"$f":"(b_2*c_2*(fsw*kHz)+2*a_2*c_2*d_2*(fsw*kHz))/(3*a_2*c_2*(fsw*kHz))","v":0.76038338658146953},2.0519164988770298,{"$f":"c_3+(SQRT(ftyp)*SQRT(H103)/(SQRT(a_3)*SQRT(b_3)*SQRT(fsw*kHz)))","v":1.2596038437987023},{"$f":"(a_4*(fsw*kHz)*b_4/ftyp)","v":1.4604106126431646},2.0519164988770298,{"$f":"Pin_max/G103","v":13.071895424836601},{"$f":"-X103*Rsense*1.414","v":-5.5450980392156859E-2},{"$f":"MIN(6,MAX(0.5,Beta*G*($Y103-Voff_trim)/(MAX(0,MIN(4.5,W103)-Alpha1_A)+MAX(0,MIN(4.5,W103)-Alpha1_B)-Alpha1_C)+Alpha2))","v":4.1087973132558604}]
[null,null,null,null,null,null,307,4.9798783798672808E-2,3.413603707971089,1.8522403231941331,1.8481766428302768,4.5657096939147324E-4,0.5213675213675214,2.0684777645329855,7.3252235055858844E-2,0.88289560581776549,0.86653884001614045,6.7799508007635123E-2,0.76038338658146953,2.0493964122687736,1.257129564177208,1.4604106126431646,2.0493964122687736,13.029315960912053,-5.5270358306188927E-2,4.1074822058431497]
[null,null,null,null,null,null,308,4.9475940021937864E-2,3.4041439556724811,1.8402454008009133,1.836181954472377,4.5657096939147324E-4,0.5213675213675214,2.065128846349678,7.3252235055858844E-2,0.87169485780713307,0.86056065668121284,6.7799508007635123E-2,0.76038338658146953,2.0468906673259148,1.2546713513065029,1.4604106126431646,2.0468906673259148,12.987012987012987,-5.5090909090909086E-2,4.1061765910995414]
[null,null,null,null,null,null,309,4.9156225576199607E-2,3.3947454315440915,1.8283667454233614,1.8243035308616367,4.5657096939147324E-4,0.5213675213675214,2.0617980046419118,7.3252235055858844E-2,0.86067312032720278,0.85464041999343165,6.7799508007635123E-2,0.76038338658146953,2.0443991396428549,1.2522290491987149,1.4604106126431646,2.0443991396428549,12.944983818770227,-5.4912621359223306E-2,4.1048803890449435]
[null,null,null,null,null,null,310,4.8839600148190575E-2,3.3854075430552393,1.8166028592642474,1.8125398742300487,4.5657096939147324E-4,0.5213675213675214,2.0584850838255355,7.3252235055858844E-2,0.84982695845585232,0.8487773834613942,6.7799508007635123E-2,0.76038338658146953,2.0419217062875923,1.2498025038787191,1.4604106126431646,2.0419217062875923,12.903225806451612,-5.4735483870967744E-2,4.1035935205667897]
[null,null,null,null,null,null,311,4.8526024071722934E-2,3.3761297052962198,1.8049522685679062,1.8008895108507035,4.5657096939147324E-4,0.5213675213675214,2.0551899301517254,7.3252235055858844E-2,0.83915301404430287,0.84297081257584205,6.7799508007635123E-2,0.76038338658146953,2.0394582457795867,1.247391563351778,1.4604106126431646,2.0394582457795867,12.861736334405144,-5.4559485530546618E-2,4.1023159074077338]
[null,null,null,null,null,null,312,4.821545831526456E-2,3.3669113408561677,1.7934135231586423,1.7893509905761995,4.5657096939147324E-4,0.5213675213675214,2.0519123916795183,7.3252235055858844E-2,0.82864800376070691,0.83721998457960356,6.7799508007635123E-2,0.76038338658146953,2.0370086380680243,1.2449960775718041,1.4604106126431646,2.0370086380680243,12.820512820512821,-5.4384615384615385E-2,4.1010474721535619]
[null,null,null,null,null,null,313,4.7907864469792623E-2,3.3577518797032724,1.7819851959894397,1.7779228863873648,4.5657096939147324E-4,0.5213675213675214,2.0486523182488439,7.3252235055858844E-2,0.81830871718967146,0.83152418824267649,6.7799508007635123E-2,0.76038338658146953,2.0345727645104748,1.2426158984102327,1.4604106126431646,2.0345727645104748,12.779552715654953,-5.4210862619808314E-2,4.0997881382213226]
[null,null,null,null,null,null,314,4.7603204736917468E-2,3.3486507590672749,1.7706658827007193,1.7666037939520205,4.5657096939147324E-4,0.5213675213675214,2.0454095614540417,7.3252235055858844E-2,0.80813201498594467,0.82588272364231308,6.7799508007635123E-2,0.76038338658146953,2.0321505078519344,1.240250879625487,1.4604106126431646,2.0321505078519344,12.738853503184714,-5.4038216560509555E-2,4.0985378298476611]
[null,null,null,null,null,null,315,4.7301441917269975E-2,3.3396074233242041,1.7594542011888823,1.7553923311935349,4.5657096939147324E-4,0.5213675213675214,2.0421839746178572,7.3252235055858844E-2,0.79811482708055248,0.82029490194798804,6.7799508007635123E-2,0.76038338658146953,2.0297417522042491,1.2379008768330251,1.4604106126431646,2.0297417522042491,12.698412698412698,-5.386666666666666E-2,4.0972964720773417]
[null,null,null,null,null,null,316,4.7002539399145914E-2,3.3306213238833049,1.7483487911844029,1.7442871378689224,4.5657096939147324E-4,0.5213675213675214,2.0389754127659012,7.3252235055858844E-2,0.78825415093774143,0.81476004521112044,6.7799508007635123E-2,0.76038338658146953,2.0273463830259053,1.2355657474759587,1.4604106126431646,2.0273463830259053,12.658227848101266,-5.3696202531645566E-2,4.0960639907519694]
[null,null,null,null,null,null,{"$f":"G113+1","v":317},4.6706461147400354E-2,3.3216919190761023,1.7373483138392134,1.7332868751562376,4.5657096939147324E-4,0.5213675213675214,2.0357837326015709,7.3252235055858844E-2,0.77854704986111822,0.80927748615943085,6.7799508007635123E-2,0.76038338658146953,2.02496428710218,1.2332453507962238,1.4604106126431646,2.02496428710218,12.618296529968454,-5.352681388012618E-2,4.0948403124989161]
[null,null,null,null,null,null,{"$f":"G114+1","v":318},4.6413171692586477E-2,3.3128186740475614,1.7264514513231661,1.7223902252510452,4.5657096939147324E-4,0.5213675213675214,2.0326087924814127,7.3252235055858844E-2,0.76899065134747013,0.80384656799582066,6.7799508007635123E-2,0.76038338658146953,2.0225953525256504,1.2309395478062986,1.4604106126431646,2.0225953525256504,12.578616352201259,-5.3358490566037739E-2,4.0936253647204133]
[null,null,null,null,null,null,319,4.6122636120332093E-2,3.3040010606492927,1.7156569064293297,1.7115958909717248,4.5657096939147324E-4,0.5213675213675214,2.0294504523909267,7.3252235055858844E-2,0.75958214548675629,0.79846664420165447,6.7799508007635123E-2,0.76038338658146953,2.0202394686770422,1.2286482012614512,1.4604106126431646,2.0202394686770422,12.539184952978056,-5.3191222570532916E-2,4.0924190755828631]
[null,null,null,null,null,null,320,4.5834820060948384E-2,3.2952385573347636,1.7049634021879136,1.7009025953733998,4.5657096939147324E-4,0.5213675213675214,2.0263085739207982,7.3252235055858844E-2,0.75031878340685332,0.79313707834434233,6.7799508007635123E-2,0.76038338658146953,2.0178965262064272,1.2263711756325093,1.4604106126431646,2.0178965262064272,12.5,-5.3024999999999996E-2,4.0912213740062819]
[null,null,null,null,null,null,321,4.5549689679264697E-2,3.2865306490564614,1.6943696814885896,1.6903090813702704,4.5657096939147324E-4,0.5213675213675214,2.0231830202435495,7.3252235055858844E-2,0.74119787576165452,0.78785724388910849,6.7799508007635123E-2,0.76038338658146953,2.0155664170147438,1.2241083370791368,1.4604106126431646,2.0155664170147438,12.461059190031152,-5.2859813084112139E-2,4.0900321896539706]
[null,null,null,null,null,null,322,4.5267211664684177E-2,3.2778768271649823,1.683874506711019,1.6798141113661456,4.5657096939147324E-4,0.5213675213675214,2.0200736560906027,7.3252235055858844E-2,0.73221679126119488,0.78262652401484833,6.7799508007635123E-2,0.76038338658146953,2.013249034235649,1.2218595534236116,1.4604106126431646,2.013249034235649,12.422360248447205,-5.2695652173913039E-2,4.0888514529223254]
[null,null,null,null,null,null,323,4.4987353221454383E-2,3.2692765893099822,1.6734766593633692,1.6694164668929667,4.5657096939147324E-4,0.5213675213675214,2.0169803477297457,7.3252235055858844E-2,0.72337295524249723,0.77744431143396675,6.7799508007635123E-2,0.76038338658146953,2.0109442722176873,1.2196246941250863,1.4604106126431646,2.0109442722176873,12.383900928792571,-5.2532507739938089E-2,4.0876790949308273]
[null,null,null,null,null,null,{"$f":"G120+1","v":324},4.4710082059147942E-2,3.2607294393429758,1.6631749397286304,1.6591149482571317,4.5657096939147324E-4,0.5213675213675214,2.0139029629429901,7.3252235055858844E-2,0.71466384827989948,0.77231000821610651,6.7799508007635123E-2,0.76038338658146953,2.0086520265067707,1.2174036302543301,1.4604106126431646,2.0086520265067707,12.345679012345679,-5.2370370370370366E-2,4.0865150475122087]
[null,null,null,null,null,null,{"$f":"G121+1","v":325},4.4435366383347823E-2,3.2522348872219209,1.6529681665185378,1.6489083741934243,4.5657096939147324E-4,0.5213675213675214,2.0108413710048199,7.3252235055858844E-2,0.70608700483364639,0.76722302561566458,6.7799508007635123E-2,0.76038338658146953,2.006372193828966,1.215196234468932,1.4604106126431646,2.006372193828966,12.307692307692308,-5.2209230769230772E-2,4.0853592432027703]
[null,null,null,null,null,null,326,4.4163174886532368E-2,3.2437924489175587,1.6428551765349142,1.6387955815263628,4.5657096939147324E-4,0.5213675213675214,2.0077954426608131,7.3252235055858844E-2,0.69764001193558278,0.76218278390300764,6.7799508007635123E-2,0.76038338658146953,2.0041046720735807,1.2130023809889661,1.4604106126431646,2.0041046720735807,12.269938650306749,-5.2049079754601227E-2,4.0842116152328671]
[null,null,null,null,null,null,327,4.3893476739155092E-2,3.2354016463214821,1.6328348243382493,1.6287754248387856,4.5657096939147324E-4,0.5213675213675214,2.0047650501066392,7.3252235055858844E-2,0.68932050791081845,0.75718871219929507,6.7799508007635123E-2,0.76038338658146953,2.0018493602765437,1.2108219455730977,1.4604106126431646,2.0018493602765437,12.232415902140673,-5.1889908256880737E-2,4.0830720975175385]
[null,null,null,null,null,null,328,4.3626241580914583E-2,3.2270620071558671,1.6229059819233422,1.6188467761475005,4.5657096939147324E-4,0.5213675213675214,2.0017500669674155,7.3252235055858844E-2,0.68112618113427292,0.75224024831482073,6.7799508007635123E-2,0.76038338658146953,1.9996061586040712,1.2086548054951307,1.4604106126431646,false,12.195121951219512,-5.1731707317073175E-2,1.2994125382429553]
[null,null,null,null,null,null,329,4.3361439512209922E-2,3.2187730648848767,1.6130675384018363,1.6090085245858259,4.5657096939147324E-4,0.5213675213675214,1.9987503682774213,7.3252235055858844E-2,0.67305476882104842,0.74733683859079114,6.7799508007635123E-2,0.76038338658146953,1.9973749683366153,1.2065008395209815,1.4604106126431646,1.9987503682774213,12.158054711246201,-5.1574468085106386E-2,4.0708433735849283]
[null,null,null,null,null,null,330,4.3099041085776987E-2,3.2105343586276494,1.6033183996914744,1.5992595760928516,4.5657096939147324E-4,0.5213675213675214,1.9957658304601593,7.3252235055858844E-2,0.66510405584960686,0.74247793774445248,6.7799508007635123E-2,0.76038338658146953,1.9951556918530897,1.2043599278860695,1.4604106126431646,1.9957658304601593,12.121212121212121,-5.1418181818181814E-2,4.0660786171403069]
[null,null,null,null,null,null,331,4.2839017298501418E-2,3.2023454330728827,1.5936574882119192,1.5895988531092646,4.5657096939147324E-4,0.5213675213675214,1.992796331308762,7.3252235055858844E-2,0.65727187361676953,0.73766300871748902,6.7799508007635123E-2,0.76038338658146953,1.9929482326153625,1.2022319522731206,1.4604106126431646,1.992796331308762,12.084592145015106,-5.126283987915408E-2,4.0613304026431489]
[null,null,null,null,null,null,332,4.2581339583403925E-2,3.1942058383949532,1.5840837425869752,1.5800252942795783,4.5657096939147324E-4,0.5213675213675214,1.9898417499667267,7.3252235055858844E-2,0.64955609892358146,0.73289152252761347,6.7799508007635123E-2,0.76038338658146953,1.9907524951530184,1.2001167957903702,1.4604106126431646,1.9898417499667267,12.048192771084338,-5.1108433734939764E-2,4.0565986156688911]
[null,null,null,null,null,null,333,4.2325979801793812E-2,3.1861151301715442,1.57459611735306,1.5705378541606094,4.5657096939147324E-4,0.5213675213675214,1.9869019669089849,7.3252235055858844E-2,0.6419546528911233,0.72816295812327114,6.7799508007635123E-2,0.76038338658146953,1.9885683850483766,1.1980143429501589,1.4604106126431646,1.9869019669089849,12.012012012012011,-5.0954954954954952E-2,4.0518831429315192]
[null,null,null,null,null,null,334,4.2072910235586736E-2,3.1780728693027673,1.5651935826737813,1.5611355029360574,4.5657096939147324E-4,0.5213675213675214,1.9839768639232873,7.3252235055858844E-2,0.63446549990537549,0.72347680224138577,6.7799508007635123E-2,0.76038338658146953,1.9863958089217639,1.1959244796479127,1.4604106126431646,1.9839768639232873,11.976047904191617,-5.0802395209580832E-2,4.0471838722688416]
[null,null,null,null,null,null,{"$f":"G131+1","v":335},4.1822103579782707E-2,3.1700786219317147,1.5558751240604618,1.5518172261370402,4.5657096939147324E-4,0.5213675213675214,1.9810663240919095,7.3252235055858844E-2,0.62708664659027191,0.71883254926807372,6.7799508007635123E-2,0.76038338658146953,1.9842346744170398,1.1938470931415013,1.4604106126431646,1.9810663240919095,11.940298507462687,-5.0650746268656718E-2,4.0425006926279892]
[null,null,null,null,null,null,{"$f":"G132+1","v":336},4.1573532935100577E-2,3.1621319593664414,1.5466397420984839,1.5425820243684394,4.5657096939147324E-4,0.5213675213675214,1.9781702317736598,7.3252235055858844E-2,0.61981614080811043,0.71422970110225348,6.7799508007635123E-2,0.76038338658146953,1.9820848901873624,1.1917820720309611,1.4604106126431646,1.9781702317736598,11.904761904761905,-5.0500000000000003E-2,4.0378334940511449]
[null,null,null,null,null,null,337,4.1327171800765304E-2,3.1542324580033365,1.5374864521793061,1.5334289130409244,4.5657096939147324E-4,0.5213675213675214,1.9752884725861972,7.3252235055858844E-2,0.61265207068651084,0.70966776702208634,6.7799508007635123E-2,0.76038338658146953,1.979946365881196,1.1897293062385843,1.4604106126431646,1.9752884725861972,11.869436201780415,-5.035014836795252E-2,4.0331821676615061]
[null,null,null,null,null,null,338,{"$f":"(Iout*(Vout_nom^2)*2.5*Rsense*K_1)/(eff*(G135^2)*K_FQ)*us","v":4.1082994067444367E-2},{"$f":"(1*10^-9*(5*10^8*SQRT(fsw*kHz)+(1.09655978*10^10)*SQRT(ftyp)*SQRT(H135)))/SQRT(fsw*kHz)","v":3.1463796992518471},{"$f":"(b_1^3/(27*a_1^3))-(d_1^3/27)+SQRT((ftyp)^2*H135^2/(4*a_1^2*c_1^2*(fsw*kHz)^2))+(b_1^3*(ftyp)*H135/(27*a_1^4*c_1*(fsw*kHz))-(d_1^3*(ftyp)*H135/(27*a_1*c_1*(fsw*kHz)))+(b_1*d_1^2*(ftyp)*H135/(9*a_1^2*c_1*(fsw*kHz)))-(b_1^2*d_1*(ftyp)*H135/(9*a_1^3*c_1*(fsw*kHz))))","v":1.5284142842380248},{"$f":"(b_1*d_1^2/(9*a_1))-(b_1^2*d_1/(9*a_1^2))+(ftyp*H135/(2*a_1*c_1*fsw*kHz))","v":1.5243569221085191},{"$f":"(d_1^2/9)+(b_1^2/(9*a_1^2))-(2*b_1*d_1/(9*a_1))","v":4.5657096939147324E-4},{"$f":"((b_1*c_1*fsw*kHz)+(2*a_1*c_1*d_1*fsw*kHz))/(3*a_1*c_1*fsw*kHz)","v":0.5213675213675214},1.9724209333886393,{"$f":"(b_2^3/(27*a_2^3))-(d_2^3/27)","v":7.3252235055858844E-2},{"$f":"(ftyp^2*H135^2/(4*a_2^2*c_2^2*(fsw*kHz)^2))+(b_2^3*ftyp*H135/(27*a_2^4*c_2*(fsw*kHz)))-(d_2^3*ftyp*H135/(27*a_2*c_2*(fsw*kHz)))+(b_2*d_2^2*ftyp*H135/(9*a_2^2*c_2*(fsw*kHz)))-(b_2^2*d_2*ftyp*H135/(9*a_2^3*c_2*(fsw*kHz)))","v":0.60559256367114112},{"$f":"(b_2*d_2^2/(9*a_2))-(b_2^2*d_2/(9*a_2^2))+(ftyp*H135/(2*a_2*c_2*(fsw*kHz)))","v":0.7051462635541782},{"$f":"(d_2^2/9)+(b_2^2/(9*a_2^2))-(2*b_2*d_2/(9*a_2))","v":6.7799508007635123E-2},{"$f":"(b_2*c_2*(fsw*kHz)+2*a_2*c_2*d_2*(fsw*kHz))/(3*a_2*c_2*(fsw*kHz))","v":0.76038338658146953},1.9778190121285528,{"$f":"c_3+(SQRT(ftyp)*SQRT(H135)/(SQRT(a_3)*SQRT(b_3)*SQRT(fsw*kHz)))","v":1.1876886869893579},{"$f":"(a_4*(fsw*kHz)*b_4/ftyp)","v":1.4604106126431646},1.9724209333886393,{"$f":"Pin_max/G135","v":11.834319526627219},{"$f":"-X135*Rsense*1.414","v":-5.0201183431952665E-2},{"$f":"MIN(6,MAX(0.5,Beta*G*($Y135-Voff_trim)/(MAX(0,MIN(4.5,W135)-Alpha1_A)+MAX(0,MIN(4.5,W135)-Alpha1_B)-Alpha1_C)+Alpha2))","v":4.0285466056494617}]
[null,null,null,null,null,null,339,4.0840974010329829E-2,3.1385732694605437,1.5194222824963439,1.5153650958115752,4.5657096939147324E-4,0.5213675213675214,{"$f":"(J136+K136)^(1/3)+(L136/(J136^(1/3)))+M136","v":1.9695675022644656},7.3252235055858844E-2,0.5986357856034521,0.70066471434547772,6.7799508007635123E-2,0.76038338658146953,{"$f":"((O136+SQRT(P136)+Q136)^(1/3))+(R136/((O136+SQRT(P136)+Q136)^(1/3)))+S136","v":1.9757027405274654},1.1856601067917489,1.4604106126431646,{"$f":"IF(I136>=0.5,IF(I136<1,I136,IF(N136>=1,IF(N136<2,N136,IF(T136>=2,IF(T136<4.5,T136,IF(U136>=4.5,IF(U136<4.6,U136,V136))))))))","v":1.9695675022644656},11.799410029498524,-5.005309734513274E-2,4.0239267012589863]
[null,null,null,null,null,null,340,4.0601086282362579E-2,3.130812759844483,1.5105095052108293,1.5064524924250335,4.5657096939147324E-4,0.5213675213675214,1.9667280685047031,7.3252235055858844E-2,0.5917799398226935,0.69622265003780837,6.7799508007635123E-2,0.76038338658146953,1.9735974636306837,1.1836434594188321,1.4604106126431646,1.9667280685047031,11.764705882352942,-4.9905882352941182E-2,4.0193223487742555]
[null,null,null,null,null,null,341,4.0363305907595515E-2,3.1230977664138542,1.5016750244263251,1.4976181840118437,4.5657096939147324E-4,0.5213675213675214,1.9639025225913929,7.3252235055858844E-2,0.5850232662914987,0.69181960814497256,6.7799508007635123E-2,0.76038338658146953,1.9715030949325951,1.1816386398897447,1.4604106126431646,1.9639025225913929,11.730205278592376,-4.975953079178886E-2,4.0147334435064543]
[null,null,null,null,null,null,342,4.0127608274692333E-2,3.1154278899038719,1.4929179257344076,1.488861256181423,4.5657096939147324E-4,0.5213675213675214,1.9610907561813304,7.3252235055858844E-2,0.57836404074435499,0.68745513293236671,6.7799508007635123E-2,0.76038338658146953,1.9694195488563593,1.1796455444514704,1.4604106126431646,1.9610907561813304,11.695906432748538,-4.9614035087719291E-2,4.01015988178081]
[null,null,null,null,null,null,343,3.9893969130558815E-2,3.1078027357059019,1.4842373080367626,1.4801808078530392,4.5657096939147324E-4,0.5213675213675214,1.9582926620900749,7.3252235055858844E-2,0.57180057385829519,0.68312877529905081,6.7799508007635123E-2,0.76038338658146953,1.9673467407412577,1.1776640705609416,1.4604106126431646,1.9582926620900749,11.661807580174926,-4.946938775510204E-2,4.0056015609238198]
[null,null,null,null,null,null,344,3.966236457410352E-2,3.1002219137997802,1.475632283313371,1.471575951023999,4.5657096939147324E-4,0.5213675213675214,1.9555081342762217,7.3252235055858844E-2,0.56533121044516876,0.6788400926622129,6.7799508007635123E-2,0.76038338658146953,1.9652845868302506,1.1756941168674504,1.4604106126431646,1.9555081342762217,11.627906976744185,-4.9325581395348837E-2,4.0010583792506598]
[null,null,null,null,null,null,345,3.9432771050124889E-2,3.0926850386873173,1.4671019763953888,1.4630458105425346,4.5657096939147324E-4,0.5213675213675214,1.9527370678259337,7.3252235055858844E-2,0.55895432866486594,0.67458864884397496,6.7799508007635123E-2,0.76038338658146953,1.9632330042577391,1.1737355831953709,1.4604106126431646,1.9527370678259337,11.594202898550725,-4.918260869565217E-2,3.9965302360528132]
[null,null,null,null,null,null,346,3.9205165343321816E-2,3.0851917293269491,1.4586455247426189,1.4545895238852768,4.5657096939147324E-4,0.5213675213675214,1.9499793589377243,7.3252235055858844E-2,0.55266833925889947,0.67037401396048557,6.7799508007635123E-2,0.76038338658146953,1.9611919110375264,1.1717883705271761,1.4604106126431646,1.9499793589377243,11.560693641618498,-4.9040462427745665E-2,3.9920170315858816]
[null,null,null,null,null,null,347,3.8979524572424935E-2,3.0777416090695224,1.450262078225462,1.4462062409392149,4.5657096939147324E-4,0.5213675213675214,1.9472349049074937,7.3252235055858844E-2,0.5464716848037543,0.66619576431324701,6.7799508007635123E-2,0.76038338658146953,1.9591612260509801,1.169852380986752,1.4604106126431646,1.9472349049074937,11.527377521613833,-4.8899135446685879E-2,3.9875186670575653]
[null,null,null,null,null,null,{"$f":"G144+1","v":348},3.8755826184445716E-2,3.0703343055951851,1.4419507989112501,1.4378951237880295,4.5657096939147324E-4,0.5213675213675214,1.9445036041138022,7.3252235055858844E-2,0.5403628389834424,0.66205348228262428,6.7799508007635123E-2,0.76038338658146953,1.9571408690353811,1.1679275178229969,1.4604106126431646,1.9445036041138022,11.494252873563218,-4.8758620689655169E-2,3.9830350446158582]
[null,null,null,null,null,null,{"$f":"G145+1","v":349},3.8534047949040764E-2,3.0629694508513592,1.4337108608548581,1.4296553465027102,4.5657096939147324E-4,0.5213675213675214,1.9417853560033898,7.3252235055858844E-2,0.53434030588071479,0.65794675622348753,6.7799508007635123E-2,0.76038338658146953,1.955130760572467,1.1660136853937046,1.4604106126431646,1.9417853560033898,11.461318051575931,-4.8618911174785097E-2,3.9785660673373933]
[null,null,null,null,null,null,350,3.8314167952988677E-2,3.0556466809917828,1.4255414498934951,1.4214860949363517,4.5657096939147324E-4,0.5213675213675214,1.9390800610769228,7.3252235055858844E-2,0.5284026192864012,0.65387518036293824,6.7799508007635123E-2,0.76038338658146953,1.9531308220771593,1.1641107891497224,1.4604106126431646,1.9390800610769228,11.428571428571429,-4.8480000000000002E-2,3.9741116392159941]
[null,null,null,null,null,null,351,3.8096164594776938E-2,3.0483656363165936,1.4174417634455883,1.4133865665230405,4.5657096939147324E-4,0.5213675213675214,1.9363876208749802,7.3252235055858844E-2,0.52254834202636391,0.64983835470007389,6.7799508007635123E-2,0.76038338658146953,1.9511409757864724,1.1622187356193816,1.4604106126431646,1.9363876208749802,11.396011396011396,-4.8341880341880347E-2,3.9696716651513637]
[null,null,null,null,null,null,352,3.7880016579296183E-2,3.0411259612134214,1.4094110103136526,1.405355970080729,4.5657096939147324E-4,0.5213675213675214,1.9337079379642548,7.3252235055858844E-2,0.51677606530556386,0.64583588490773969,6.7799508007635123E-2,0.76038338658146953,1.9491611447486015,1.1603374323931901,1.4604106126431646,1.9337079379642548,11.363636363636363,-4.8204545454545451E-2,3.9652460509379877]
[null,null,null,null,null,null,353,3.7665702912639661E-2,3.0339273040995027,1.4014484104910705,1.3973935256180181,4.5657096939147324E-4,0.5213675213675214,1.9310409159239859,7.3252235055858844E-2,0.51108440806876332,0.64186738223622875,6.7799508007635123E-2,0.76038338658146953,1.9471912528121869,1.1584667881087902,1.4604106126431646,1.9310409159239859,11.331444759206798,-4.8067988668555231E-2,3.9608347032541671]
[null,null,null,null,null,null,354,3.745320289700528E-2,3.0267693173647574,1.3935531949726836,1.3894984641447539,4.5657096939147324E-4,0.5213675213675214,1.928386459332601,7.3252235055858844E-2,0.5054720163773907,0.6379324634188831,6.7799508007635123E-2,0.76038338658146953,1.9452312246157486,1.1566067124361665,1.4604106126431646,1.928386459332601,11.299435028248588,-4.7932203389830508E-2,3.9564375296512457]
[null,null,null,null,null,null,355,3.7242496125698181E-2,3.0196516573158436,1.385724605569117,1.3816700274863545,4.5657096939147324E-4,0.5213675213675214,1.9257444737545777,7.3252235055858844E-2,0.49993756280212354,0.63403075057955305,6.7799508007635123E-2,0.76038338658146953,1.9432809855772921,1.1547571160631067,1.4604106126431646,1.9257444737545777,11.267605633802816,-4.7797183098591545E-2,3.9520544385429677]
[null,null,null,null,null,null,356,3.7033562478231238E-2,3.0125739841211359,1.377961894724745,1.3739074681017802,4.5657096939147324E-4,0.5213675213675214,1.9231148657275119,7.3252235055858844E-2,0.49447974583073639,0.63016187114187383,6.7799508007635123E-2,0.76038338658146953,1.9413404618840768,1.1529179106809071,1.4604106126431646,1.9231148657275119,11.235955056179776,-4.766292134831461E-2,3.9476853391950262]
[null,null,null,null,null,null,{"$f":"G153+1","v":357},3.6826382115521611E-2,3.0055359617566508,1.3702643253392237,1.3662100489050681,4.5657096939147324E-4,0.5213675213675214,1.9204975427493878,7.3252235055858844E-2,0.48909728929080287,0.62632545774031767,6.7799508007635123E-2,0.76038338658146953,1.9394095804825489,1.1510890089703163,1.4604106126431646,1.9204975427493878,11.204481792717086,-4.7529411764705876E-2,3.9433301417147484]
[null,null,null,null,null,null,{"$f":"G154+1","v":358},3.6620935475181131E-2,2.9985372579528611,1.3626311705925083,1.3585770430903559,4.5657096939147324E-4,0.5213675213675214,1.9178924132660566,7.3252235055858844E-2,0.48378894178683102,0.62252114813298498,6.7799508007635123E-2,0.76038338658146953,1.9374882690684339,1.1492703245877176,1.4604106126431646,1.9178924132660566,11.173184357541899,-4.7396648044692735E-2,3.9389887570409425]
[null,null,null,null,null,null,359,3.6417203266898256E-2,2.9915775441424071,1.3550617137732781,1.3510077339603055,4.5657096939147324E-4,0.5213675213675214,1.9152993866589085,7.3252235055858844E-2,0.47855347615143234,0.61874858511609088,6.7799508007635123E-2,0.76038338658146953,1.9355764560769848,1.1474617721515401,1.4604106126431646,1.9152993866589085,11.142061281337048,-4.7264623955431753E-2,3.9346610969338833]
[null,null,null,null,null,null,360,3.6215166467909829E-2,2.9846564954086787,1.3475552481106912,1.3435014147578652,4.5657096939147324E-4,0.5213675213675214,1.9127183732327371,7.3252235055858844E-2,0.47338968891013961,0.61500741644011425,6.7799508007635123E-2,0.76038338658146953,1.9336740706733844,1.1456632672288969,1.4604106126431646,1.9127183732327371,11.111111111111111,-4.7133333333333333E-2,3.9303470739654687]
[null,null,null,null,null,null,361,3.6014806318560431E-2,2.9777737904352475,1.3401110766093987,1.3360573885012854,4.5657096939147324E-4,0.5213675213675214,1.9101492842038015,7.3252235055858844E-2,0.46829639975949455,0.61129729472756977,6.7799508007635123E-2,0.76038338658146953,1.9317810427432982,1.1438747263224456,1.4604106126431646,1.9101492842038015,11.0803324099723,-4.7002770083102496E-2,3.9260466015094901]
[null,null,null,null,null,null,362,3.5816104317947517E-2,2.9709291114561451,1.3327285118877432,1.3286749678223211,4.5657096939147324E-4,0.5213675213675214,1.9075920316880666,7.3252235055858844E-2,0.46327245105804088,0.60761787739236706,6.7799508007635123E-2,0.76038338658146953,1.9298973028835757,1.1420960668574667,1.4604106126431646,1.9075920316880666,11.049723756906078,-4.6872928176795572E-2,3.9217595937320788]
[null,null,null,null,null,null,363,3.5619042219650406E-2,2.9641221442069545,1.3254068760190749,1.3213534748075486,4.5657096939147324E-4,0.5213675213675214,1.905046528689633,7.3252235055858844E-2,0.45831670732987156,0.60396882656072326,6.7799508007635123E-2,0.76038338658146953,1.9280227823930967,1.1403272071691539,1.4604106126431646,1.905046528689633,11.019283746556473,-4.6743801652892561E-2,3.9174859655822716]
[null,null,null,null,null,null,364,3.5423602027541315E-2,2.9573525778767151,1.3181455003761142,1.3140922408427345,4.5657096939147324E-4,0.5213675213675214,1.9025126890893453,7.3252235055858844E-2,0.45342805478038428,0.60034980899359547,6.7799508007635123E-2,0.76038338658146953,1.9261574132637593,1.1385680664901179,1.4604106126431646,1.9025126890893453,10.989010989010989,-4.6615384615384614E-2,3.913225632782714]
[null,null,null,null,null,null,365,3.5229765991676598E-2,2.9506201050606147,1.3109437254782959,1.3068906064601806,4.5657096939147324E-4,0.5213675213675214,1.8999904276335786,7.3252235055858844E-2,0.44860540082391265,0.59676049601059733,6.7799508007635123E-2,0.76038338658146953,1.9243011281716107,1.1368185649380902,1.4604106126431646,1.8999904276335786,10.95890410958904,-4.6487671232876705E-2,3.9089785118205089]
[null,null,null,null,null,null,366,3.5037516604266433E-2,2.9439244217134544,1.3038009008420255,1.2997479211889846,4.5657096939147324E-4,0.5213675213675214,1.8974796599231945,7.3252235055858844E-2,0.44384767362291178,0.59320056341536864,6.7799508007635123E-2,0.76038338658146953,1.9224538604681121,1.135078623503833,1.4604106126431646,1.8974796599231945,10.928961748633879,-4.6360655737704919E-2,3.9047445199382014]
[null,null,null,null,null,null,367,3.484683659572136E-2,2.937265227103881,1.2967163848337937,1.2926635434081559,4.5657096939147324E-4,0.5213675213675214,1.894980302402673,7.3252235055858844E-2,0.43915382163838457,0.5896696914223678,6.7799508007635123E-2,0.76038338658146953,1.9206155441715413,1.1333481640392451,1.4604106126431646,1.894980302402673,10.899182561307901,-4.6234332425068116E-2,3.9005235751248732]
[null,null,null,null,null,null,368,3.4657708930773828E-2,2.9306422237693592,1.2896895445260772,1.2856368402025207,4.5657096939147324E-4,0.5213675213675214,1.8924922723494095,7.3252235055858844E-2,0.43452281319124325,0.58616756458505437,6.7799508007635123E-2,0.76038338658146953,1.9187861139585261,1.13162710924566,1.4604106126431646,1.8924922723494095,10.869565217391305,-4.610869565217391E-2,3.8963155961073914]
[null,null,null,null,null,null,369,3.4470116804673247E-2,2.9240551174718812,1.2827197555559682,1.2786671872213522,4.5657096939147324E-4,0.5213675213675214,1.8900154878631747,7.3252235055858844E-2,0.42995363603431208,0.58269387172543052,6.7799508007635123E-2,0.76038338658146953,1.916965505155708,1.1299153826623385,1.4604106126431646,1.8900154878631747,10.840108401084011,-4.5983739837398376E-2,3.8921205023417693]
[null,null,null,null,null,null,370,{"$f":"(Iout*(Vout_nom^2)*2.5*Rsense*K_1)/(eff*(G167^2)*K_FQ)*us","v":3.4284043639452991E-2},{"$f":"(1*10^-9*(5*10^8*SQRT(fsw*kHz)+(1.09655978*10^10)*SQRT(ftyp)*SQRT(H167)))/SQRT(fsw*kHz)","v":2.9175036171543902},{"$f":"(b_1^3/(27*a_1^3))-(d_1^3/27)+SQRT((ftyp)^2*H167^2/(4*a_1^2*c_1^2*(fsw*kHz)^2))+(b_1^3*(ftyp)*H167/(27*a_1^4*c_1*(fsw*kHz))-(d_1^3*(ftyp)*H167/(27*a_1*c_1*(fsw*kHz)))+(b_1*d_1^2*(ftyp)*H167/(9*a_1^2*c_1*(fsw*kHz)))-(b_1^2*d_1*(ftyp)*H167/(9*a_1^3*c_1*(fsw*kHz))))","v":1.2758064019864797},{"$f":"(b_1*d_1^2/(9*a_1))-(b_1^2*d_1/(9*a_1^2))+(ftyp*H167/(2*a_1*c_1*fsw*kHz))","v":1.2717539685396824},{"$f":"(d_1^2/9)+(b_1^2/(9*a_1^2))-(2*b_1*d_1/(9*a_1))","v":4.5657096939147324E-4},{"$f":"((b_1*c_1*fsw*kHz)+(2*a_1*c_1*d_1*fsw*kHz))/(3*a_1*c_1*fsw*kHz)","v":0.5213675213675214},1.8875498678557401,{"$f":"(b_2^3/(27*a_2^3))-(d_2^3/27)","v":7.3252235055858844E-2},{"$f":"(ftyp^2*H167^2/(4*a_2^2*c_2^2*(fsw*kHz)^2))+(b_2^3*ftyp*H167/(27*a_2^4*c_2*(fsw*kHz)))-(d_2^3*ftyp*H167/(27*a_2*c_2*(fsw*kHz)))+(b_2*d_2^2*ftyp*H167/(9*a_2^2*c_2*(fsw*kHz)))-(b_2^2*d_2*ftyp*H167/(9*a_2^3*c_2*(fsw*kHz)))","v":0.42544529693468724},{"$f":"(b_2*d_2^2/(9*a_2))-(b_2^2*d_2/(9*a_2^2))+(ftyp*H167/(2*a_2*c_2*(fsw*kHz)))","v":0.57924830586491771},{"$f":"(d_2^2/9)+(b_2^2/(9*a_2^2))-(2*b_2*d_2/(9*a_2))","v":6.7799508007635123E-2},{"$f":"(b_2*c_2*(fsw*kHz)+2*a_2*c_2*d_2*(fsw*kHz))/(3*a_2*c_2*(fsw*kHz))","v":0.76038338658146953},1.9151536537315355,{"$f":"c_3+(SQRT(ftyp)*SQRT(H167)/(SQRT(a_3)*SQRT(b_3)*SQRT(fsw*kHz)))","v":1.1282129086551431},{"$f":"(a_4*(fsw*kHz)*b_4/ftyp)","v":1.4604106126431646},1.8875498678557401,{"$f":"Pin_max/G167","v":10.810810810810811},{"$f":"-X167*Rsense*1.414","v":-4.5859459459459462E-2},{"$f":"MIN(6,MAX(0.5,Beta*G*($Y167-Voff_trim)/(MAX(0,MIN(4.5,W167)-Alpha1_A)+MAX(0,MIN(4.5,W167)-Alpha1_B)-Alpha1_C)+Alpha2))","v":3.8879382140046479}]
[null,null,null,null,null,null,371,3.4099473080267603E-2,2.9109874348979088,1.2689488761704577,1.2648965765222124,4.5657096939147324E-4,0.5213675213675214,1.885095332040656,7.3252235055858844E-2,0.42099682126617183,0.57583056415653011,6.7799508007635123E-2,0.76038338658146953,1.9133504962881804,1.1265196124053987,1.4604106126431646,1.885095332040656,10.781671159029649,-4.5735849056603772E-2,3.8837686519849179]
[null,null,null,null,null,null,372,3.391638899179901E-2,2.9045062858793669,1.2621465786170589,1.2580944116897963,4.5657096939147324E-4,0.5213675213675214,1.8826518009231923,7.3252235055858844E-2,0.41660725261152132,0.57244034781832909,6.7799508007635123E-2,0.76038338658146953,1.9115559700535791,1.1248354198989325,1.4604106126431646,1.8826518009231923,10.75268817204301,-4.5612903225806446E-2,3.8796117378754382]
[null,null,null,null,null,null,{"$f":"G169+1","v":373},3.373477545472988E-2,2.8980598883300916,1.2553989178607208,1.2513468825884111,4.5657096939147324E-4,0.5213675213675214,1.8802191957904255,7.3252235055858844E-2,0.41227565237423175,0.56907736206811799,6.7799508007635123E-2,0.76038338658146953,1.9097700128735935,1.1231602579152893,1.4604106126431646,1.8802191957904255,10.723860589812332,-4.5490616621983913E-2,3.8754673939648958]
[null,null,null,null,null,null,{"$f":"G170+1","v":374},3.3554616762283128E-2,2.8916479634949845,1.2487053103325914,1.2446534056605916,4.5657096939147324E-4,0.5213675213675214,1.8777974387014829,7.3252235055858844E-2,0.4080010993996247,0.56574131605936451,6.7799508007635123E-2,0.76038338658146953,1.9079925632042931,1.1214940540171201,1.4604106126431646,1.8777974387014829,10.695187165775401,-4.5368983957219257E-2,3.8713355432297556]
[null,null,null,null,null,null,375,3.3375897416825694E-2,2.8852702355923312,1.2420651802343459,1.2380134051192473,4.5657096939147324E-4,0.5213675213675214,1.875386452477926,7.3252235055858844E-2,0.40378268960497388,0.56243192281831111,6.7799508007635123E-2,0.76038338658146953,1.9062235601043498,1.119836736539741,1.4604106126431646,1.875386452477926,10.666666666666666,-4.5247999999999997E-2,3.8672161093263537]
[null,null,null,null,null,null,376,3.3198602126535727E-2,2.8789264317742669,1.235477959414359,1.2314263128238381,4.5657096939147324E-4,0.5213675213675214,1.8729861606942881,7.3252235055858844E-2,0.3996195356184411,0.55914889918226041,6.7799508007635123E-2,0.76038338658146953,1.9044629432275537,1.1181882345808587,1.4604106126431646,1.8729861606942881,10.638297872340425,-4.5127659574468078E-2,3.8631090165830755]
[null,null,null,null,null,null,377,3.3022715802131265E-2,2.8726162820878631,1.228943087246164,1.2248915681588355,4.5657096939147324E-4,0.5213675213675214,1.8705964876687449,7.3252235055858844E-2,0.3955107664265835,0.55589196573900046,6.7799508007635123E-2,0.76038338658146953,1.9027106528154336,1.1165484779904586,1.4604106126431646,1.8705964876687449,10.610079575596817,-4.5007957559681698E-2,3.8590141899926707]
[null,null,null,null,null,null,378,3.2848223553659711E-2,2.8663395194368366,1.2224600105091665,1.2184086179144398,4.5657096939147324E-4,0.5213675213675214,1.8682173584539328,7.3252235055858844E-2,0.39145552703021147,0.55266084676735261,6.7799508007635123E-2,0.76038338658146953,1.9009666296899956,1.1149173973608542,1.4604106126431646,1.8682173584539328,10.582010582010582,-4.4888888888888881E-2,3.8549315552046468]
[null,null,null,null,null,null,379,3.2675110687346333E-2,2.8600958795438638,1.2160281832715563,1.2119769161694918,4.5657096939147324E-4,0.5213675213675214,1.8658486988279006,7.3252235055858844E-2,0.3874529781083742,0.54945527017881635,6.7799508007635123E-2,0.76038338658146953,1.8992308152465662,1.1132949240168943,1.4604106126431646,1.8658486988279006,10.554089709762533,-4.4770448548812666E-2,3.8508610385177966]
[null,null,null,null,null,null,380,3.2503362702500788E-2,2.8538851009134851,1.2096470667753707,1.2055959241765413,4.5657096939147324E-4,0.5213675213675214,1.8634904352851973,7.3252235055858844E-2,0.38350229569026051,0.54627496746028514,6.7799508007635123E-2,0.76038338658146953,1.8975031514467424,1.1116809900063234,1.4604106126431646,1.8634904352851973,10.526315789473685,-4.4652631578947367E-2,3.8468025668728112]
[null,null,null,null,null,null,381,3.2332965288480474E-2,2.8477069247956019,1.2033161293236723,1.1992651102490246,4.5657096939147324E-4,0.5213675213675214,1.8611424950280901,7.3252235055858844E-2,0.37960267083481103,0.54311967361781666,6.7799508007635123E-2,0.76038338658146953,1.8957835808114487,1.1100755280902965,1.4604106126431646,1.8611424950280901,10.498687664041995,-4.4535433070866139E-2,3.8427560678450132]
[null,null,null,null,null,null,382,3.2163904321709347E-2,2.8415610951495403,1.1970348461697857,1.1929839496505046,4.5657096939147324E-4,0.5213675213675214,1.8588048059579179,7.3252235055858844E-2,0.37575330931783779,0.53998912712142977,6.7799508007635123E-2,0.76038338658146953,1.8940720464140957,1.108478471734039,1.4604106126431646,1.8588048059579179,10.471204188481675,-4.4418848167539264E-2,3.8387214696371736]
[null,null,null,null,null,null,383,3.1996165862751218E-2,2.8354473586086799,1.1908026994085583,1.1867519244859344,4.5657096939147324E-4,0.5213675213675214,1.8564772966665668,7.3252235055858844E-2,0.37195343132645586,0.53688306985090917,6.7799508007635123E-2,0.76038338658146953,1.8923684918738395,1.1068897550976575,1.4604106126431646,1.8564772966665668,10.443864229765014,-4.4302872062663187E-2,3.83469870107244]
[null,null,null,null,null,null,{"$f":"G180+1","v":384},3.1829736153436379E-2,2.8293654644456367,1.1846191778696049,1.1805685235949013,4.5657096939147324E-4,0.5213675213675214,1.8541598964280772,7.3252235055858844E-2,0.36820227116064358,0.53380124704259868,6.7799508007635123E-2,0.76038338658146953,1.8906728613489439,1.105309313027091,1.4604106126431646,1.8541598964280772,10.416666666666666,-4.4187499999999998E-2,3.8306876915873596]
[null,null,null,null,null,null,385,3.1664601614040236E-2,2.8233151645379855,1.1784837770124803,1.1744332424468054,4.5657096939147324E-4,0.5213675213675214,1.851852535190369,7.3252235055858844E-2,0.364499076941735,0.53074340723715785,6.7799508007635123E-2,0.76038338658146953,1.8889850995302357,1.1037370810452023,1.4604106126431646,1.851852535190369,10.38961038961039,-4.407272727272727E-2,3.8266883712249999]
[null,null,null,null,null,null,386,3.1500748840513265E-2,2.8172962133345187,1.1723959988237642,1.1683455830379417,4.5657096939147324E-4,0.5213675213675214,1.8495551435670916,7.3252235055858844E-2,0.36084311032768157,0.5277093022282674,6.7799508007635123E-2,0.76038338658146953,1.8873051516346591,1.1021729953430128,1.4604106126431646,1.8495551435670916,10.362694300518134,-4.3958549222797925E-2,3.8227006706281643]
[null,null,null,null,null,null,387,3.1338164601760803E-2,2.8113083678220265,1.166355351715991,1.1623050537904376,4.5657096939147324E-4,0.5213675213675214,1.8472676528295944,7.3252235055858844E-2,0.35723364623489356,0.52469868701225897,6.7799508007635123E-2,0.76038338658146953,1.8856329633989248,1.1006169927710669,1.4604106126431646,1.8472676528295944,10.335917312661499,-4.3844961240310072E-2,3.8187245210326939]
[null,null,null,null,null,null,388,3.1176835836972009E-2,2.8053513874925882,1.1603613504284136,1.1563111694530133,4.5657096939147324E-4,0.5213675213675214,1.8449899948990107,7.3252235055858844E-2,0.35366997256650512,0.52171131973865459,6.7799508007635123E-2,0.76038338658146953,1.8839684810732509,1.0990690108309353,1.4604106126431646,1.8449899948990107,10.309278350515465,-4.3731958762886596E-2,3.8147598542608745]
[null,null,null,null,null,null,389,3.1016749652996705E-2,2.7994250343113736,1.154413515929541,1.1503634510035241,4.5657096939147324E-4,0.5213675213675214,1.8427221023384606,7.3252235055858844E-2,0.35015138994688932,0.51874696166159284,6.7799508007635123E-2,0.76038338658146953,1.8823116514151947,1.0975289876668455,1.4604106126431646,1.8427221023384606,10.282776349614396,-4.361953727506427E-2,3.8108066027149228]
[null,null,null,null,null,null,390,3.085789332176932E-2,2.7935290726849344,1.1485113753214273,1.1444614255532517,4.5657096939147324E-4,0.5213675213675214,1.8404639083453644,7.3252235055858844E-2,0.34667721146226926,0.51580537709212793,6.7799508007635123E-2,0.76038338658146953,1.8806624216835752,1.0959968620574434,1.4604106126431646,1.8404639083453644,10.256410256410257,-4.350769230769231E-2,3.8068646993705637]
[]
[null,null,null,null,null,null,"VCOMP as a function of Load at Given line voltage"]
[null,null,null,null,null,null,"%Full Load","M1M2","VCOMP1","K1V2","K2V2","K3V2","K4V2","VCOMP2","K1V3","K2V3","K3V3","K4V3","K5V3","VCOMP3","VCOMP4","VCOMP5","VCOMP","IAC RMS","ISENSE_Pk","ICOMP"]
[null,null,null,null,null,null,1,{"$f":"(((G191/100)*Iout)*(Vout_nom^2)*2.5*Rsense*K_1)/(eff*(Vline^2)*K_FQ)*us","v":9.6972842442998215E-4},{"$f":"(1*10^-9*(5*10^8*SQRT(fsw*kHz)+(1.09655978*10^10)*SQRT(ftyp)*SQRT(H191)))/SQRT(fsw*kHz)","v":0.90658015379414747},{"$f":"(b_1^3/(27*a_1^3))-(d_1^3/27)+SQRT((ftyp)^2*H191^2/(4*a_1^2*c_1^2*(fsw*kHz)^2))+(b_1^3*(ftyp)*H191/(27*a_1^4*c_1*(fsw*kHz))-(d_1^3*(ftyp)*H191/(27*a_1*c_1*(fsw*kHz)))+(b_1*d_1^2*(ftyp)*H191/(9*a_1^2*c_1*(fsw*kHz)))-(b_1^2*d_1*(ftyp)*H191/(9*a_1^3*c_1*(fsw*kHz))))","v":3.8047912017081457E-2},{"$f":"(b_1*d_1^2/(9*a_1))-(b_1^2*d_1/(9*a_1^2))+(ftyp*H191/(2*a_1*c_1*fsw*kHz))","v":3.4019628722736395E-2},{"$f":"(d_1^2/9)+(b_1^2/(9*a_1^2))-(2*b_1*d_1/(9*a_1))","v":4.5657096939147324E-4},{"$f":"((b_1*c_1*fsw*kHz)+(2*a_1*c_1*d_1*fsw*kHz))/(3*a_1*c_1*fsw*kHz)","v":0.5213675213675214},{"$f":"(J191+K191)^(1/3)+(L191/(J191^(1/3)))+M191","v":0.93887180249837743},{"$f":"(b_2^3/(27*a_2^3))-(d_2^3/27)","v":7.3252235055858844E-2},{"$f":"(ftyp^2*H191^2/(4*a_2^2*c_2^2*(fsw*kHz)^2))+(b_2^3*ftyp*H191/(27*a_2^4*c_2*(fsw*kHz)))-(d_2^3*ftyp*H191/(27*a_2*c_2*(fsw*kHz)))+(b_2*d_2^2*ftyp*H191/(9*a_2^2*c_2*(fsw*kHz)))-(b_2^2*d_2*ftyp*H191/(9*a_2^3*c_2*(fsw*kHz)))","v":9.5645461291352096E-4},{"$f":"(b_2*d_2^2/(9*a_2))-(b_2^2*d_2/(9*a_2^2))+(ftyp*H191/(2*a_2*c_2*(fsw*kHz)))","v":-3.7641652638097031E-2},{"$f":"(d_2^2/9)+(b_2^2/(9*a_2^2))-(2*b_2*d_2/(9*a_2))","v":6.7799508007635123E-2},{"$f":"(b_2*c_2*(fsw*kHz)+2*a_2*c_2*d_2*(fsw*kHz))/(3*a_2*c_2*(fsw*kHz))","v":0.76038338658146953},{"$f":"((O191+SQRT(P191)+Q191)^(1/3))+(R191/((O191+SQRT(P191)+Q191)^(1/3)))+S191","v":1.3329171931685331},{"$f":"c_3+(SQRT(ftyp)*SQRT(H191)/(SQRT(a_3)*SQRT(b_3)*SQRT(fsw*kHz)))","v":0.60565398918291047},{"$f":"(a_4*(fsw*kHz)*b_4/ftyp)","v":1.4604106126431646},{"$f":"IF(I191>=0.5,IF(I191<1,I191,IF(N191>=1,IF(N191<2,N191,IF(VCOMP3>=2,IF(T191<4.5,T191,IF(U191>=4.5,IF(U191<4.6,U191,V191))))))))","v":0.90658015379414747},{"$f":"Pin_max*G191/(Vline*100)","v":0.18181818181818182},{"$f":"-Rsense*X191*1.414","v":-7.7127272727272721E-4},{"$f":"MIN(6,MAX(0.5,Beta*G*($Y191-Voff_trim)/(MAX(0,MIN(4.5,W191)-Alpha1_A)+MAX(0,MIN(4.5,W191)-Alpha1_B)-Alpha1_C)+Alpha2))","v":0.5}]
[null,null,null,null,null,null,2,1.9394568488599643E-3,1.074991167687422,7.4077155978896123E-2,7.0048169710795319E-2,4.5657096939147324E-4,0.5213675213675214,{"$f":"(J192+K192)^(1/3)+(L192/(J192^(1/3)))+M192","v":1.0467549413330175},7.3252235055858844E-2,2.5577965904987742E-3,-1.9684935723920702E-2,6.7799508007635123E-2,0.76038338658146953,{"$f":"((O192+SQRT(P192)+Q192)^(1/3))+(R192/((O192+SQRT(P192)+Q192)^(1/3)))+S192","v":1.3749710518036888},0.6494173044212922,1.4604106126431646,1.0467549413330175,0.36363636363636365,-1.5425454545454544E-3,0.5]
[null,null,null,null,null,null,3,2.9091852732899474E-3,1.2042174837206316,0.11010639994071084,0.10607671069885427,4.5657096939147324E-4,0.5213675213675214,1.1224896061746024,7.3252235055858844E-2,4.8040259327557632E-3,-1.7282188097443515E-3,6.7799508007635123E-2,0.76038338658146953,1.4109767382339338,0.68299807728713335,1.4604106126431646,1.1224896061746024,0.54545454545454541,-2.3138181818181816E-3,0.5]
[null,null,null,null,null,null,4,3.8789136977199286E-3,1.3131603075882947,0.14613564390252548,0.14210525168691315,4.5657096939147324E-4,0.5213675213675214,1.1828038527609792,7.3252235055858844E-2,7.6951426396844776E-3,1.6228498104431957E-2,6.7799508007635123E-2,0.76038338658146953,1.4427729767121131,0.71130797836582083,1.4604106126431646,1.1828038527609792,0.72727272727272729,-3.0850909090909089E-3,0.5]
[null,null,null,null,null,null,5,4.8486421221499119E-3,1.4091408621860328,0.18216488786434018,0.17813379267497209,4.5657096939147324E-4,0.5213675213675214,1.2337482796194477,7.3252235055858844E-2,1.1231146711284938E-2,3.4185215018608314E-2,6.7799508007635123E-2,0.76038338658146953,1.4714335054907188,0.73624950190701521,1.4604106126431646,1.2337482796194477,0.90909090909090906,-3.8563636363636356E-3,0.5]
[null,null,null,null,null,null,6,5.8183705465798949E-3,1.4959139163379713,0.21819413182615491,0.21416233366303106,4.5657096939147324E-4,0.5213675213675214,1.2782864116545469,7.3252235055858844E-2,1.5412038147557122E-2,5.2141931932784658E-2,6.7799508007635123E-2,0.76038338658146953,1.4976479796184305,0.75879836278766399,1.4604106126431646,1.2782864116545469,1.0909090909090908,-4.6276363636363633E-3,0.5]
[null,null,null,null,null,null,7,6.7880989710098743E-3,1.5757099749537085,0.25422337578796944,0.25019087465108986,4.5657096939147324E-4,0.5213675213675214,1.3181176611579797,7.3252235055858844E-2,2.023781694850102E-2,7.0098648846960945E-2,6.7799508007635123E-2,0.76038338658146953,1.5218895121464677,0.7795341803998892,1.4604106126431646,1.3181176611579797,1.2727272727272727,-5.3989090909090905E-3,0.5]
[null,null,null,null,null,null,8,7.7578273954398572E-3,1.649982335374844,0.29025261974978417,0.28621941563914882,4.5657096939147324E-4,0.5213675213675214,1.3543178512144787,7.3252235055858844E-2,2.5708483114116679E-2,8.8055365761137275E-2,6.7799508007635123E-2,0.76038338658146953,1.5444987789201567,0.79883460884258439,1.4604106126431646,1.3543178512144787,1.4545454545454546,-6.1701818181818177E-3,0.56119214236898318]
[null,null,null,null,null,null,9,8.7275558198698384E-3,1.7197404613824421,0.32628186371159879,0.32224795662720768,4.5657096939147324E-4,0.5213675213675214,1.3876162420535079,7.3252235055858844E-2,3.1824036644404058E-2,0.1060120826753136,6.7799508007635123E-2,0.76038338658146953,1.5657303961857827,0.81696196754873118,1.4604106126431646,1.3876162420535079,1.6363636363636365,-6.9414545454545458E-3,0.66330887829718388]
[null,null,null,null,null,null,10,9.6972842442998239E-3,1.7857193374110565,0.36231110767341357,0.3582764976152667,4.5657096939147324E-4,0.5213675213675214,1.4185326720641598,7.3252235055858844E-2,3.8584477539363192E-2,0.12396879958948999,6.7799508007635123E-2,0.76038338658146953,1.5857803655559697,0.8341072497007892,1.4604106126431646,1.4185326720641598,1.8181818181818181,-7.7127272727272713E-3,0.7582197998287451]
[null,null,null,null,null,null,11,1.0667012668729804E-2,1.8484738173401802,0.39834035163522824,0.39430503860332555,4.5657096939147324E-4,0.5213675213675214,1.4474522910870129,7.3252235055858844E-2,4.5989805798994025E-2,0.1419255165036663,6.7799508007635123E-2,0.76038338658146953,1.6048032371270293,0.8504146397239819,1.4604106126431646,1.4474522910870129,2,-8.4840000000000002E-3,0.84729596792442385]
[null,null,null,null,null,null,12,1.163674109315979E-2,1.9084349674412631,0.43436959559704302,0.43033357959138463,4.5657096939147324E-4,0.5213675213675214,1.474669334411491,7.3252235055858844E-2,5.4040021423296641E-2,0.15988223341784269,6.7799508007635123E-2,0.76038338658146953,1.6229233305521737,0.86599615457426682,1.4604106126431646,1.474669334411491,2.1818181818181817,-9.2552727272727266E-3,0.93153844897306493]
[null,null,null,null,null,null,13,1.260646951758977E-2,1.9659455920908331,0.47039883955885758,0.46636212057944343,4.5657096939147324E-4,0.5213675213675214,1.5004142519075248,7.3252235055858844E-2,6.2735124412270915E-2,0.17783895033201896,6.7799508007635123E-2,0.76038338658146953,1.6402423447897603,0.88094087545630118,1.4604106126431646,1.5004142519075248,2.3636363636363638,-1.0026545454545455E-2,1.0117012734046553]
[null,null,null,null,null,null,14,1.3576197942019749E-2,2.0212836357595569,0.50642808352067203,0.50239066156750223,4.5657096939147324E-4,0.5213675213675214,1.5248713031639189,7.3252235055858844E-2,7.2075114765916937E-2,0.19579566724619524,6.7799508007635123E-2,0.76038338658146953,1.6568446796538217,0.89532102906837085,1.4604106126431646,1.5248713031639189,2.5454545454545454,-1.0797818181818181E-2,1.0883671847411038]
[null,null,null,null,null,null,15,1.4545926366449736E-2,2.0746781645431835,0.54245732748248687,0.5384192025555613,4.5657096939147324E-4,0.5213675213675214,1.5481904043043242,7.3252235055858844E-2,8.2059992484234748E-2,0.21375238416037162,6.7799508007635123E-2,0.76038338658146953,1.672801255738539,0.90919614056579068,1.4604106126431646,1.5481904043043242,2.7272727272727271,-1.1569090909090907E-2,1.1619963720266147]
[null,null,null,null,null,null,16,1.5515654790879714E-2,2.1263206151765894,0.57848657144430149,0.57444774354362016,4.5657096939147324E-4,0.5213675213675214,1.5704953587144583,7.3252235055858844E-2,9.2689757567224237E-2,0.2317091010745479,6.7799508007635123E-2,0.76038338658146953,1.6881723189055471,0.92261595673164165,1.4604106126431646,1.5704953587144583,2.9090909090909092,-1.2340363636363635E-2,1.2329589789043136]
[null,null,null,null,null,null,17,1.6485383215309696E-2,2.1763729193731431,0.61451581540611611,0.61047628453167901,4.5657096939147324E-4,0.5213675213675214,1.5918897302238673,7.3252235055858844E-2,0.10396441001488546,0.24966581798872423,6.7799508007635123E-2,0.76038338658146953,1.7030095400664786,0.93562255716900533,1.4604106126431646,1.5918897302238673,3.0909090909090908,-1.3111636363636364E-2,1.3015574683816999]
[null,null,null,null,null,null,18,1.7455111639739677E-2,2.2249735030622659,0.65054505936793072,0.64650482551973787,4.5657096939147324E-4,0.5213675213675214,1.6124611315990429,7.3252235055858844E-2,0.11588394982721842,0.26762253490290056,6.7799508007635123E-2,0.76038338658146953,1.7173576146974572,0.94825191326387648,1.4604106126431646,1.6124611315990429,3.2727272727272729,-1.3882909090909092E-2,1.3680424217428455]
[null,null,null,null,null,null,19,1.8424840064169664E-2,2.2722418028379141,0.68657430332974556,0.68253336650779695,4.5657096939147324E-4,0.5213675213675214,1.6322844193390695,7.3252235055858844E-2,0.12844837700422318,0.28557925181707694,6.7799508007635123E-2,0.76038338658146953,1.7312555000485139,0.96053506183024595,1.4604106126431646,1.6322844193390695,3.4545454545454546,-1.465418181818182E-2,1.4326239592255594]
[null,null,null,null,null,null,20,1.9394568488599648E-2,2.3182817243720657,0.72260354729156029,0.71856190749585591,4.5657096939147324E-4,0.5213675213675214,1.6514241160194625,7.3252235055858844E-2,0.14165769154589963,0.30353596873125333,6.7799508007635123E-2,0.76038338658146953,1.7447373852650356,0.97249900381403043,1.4604106126431646,1.6514241160194625,3.6363636363636362,-1.5425454545454543E-2,1.4954801643268696]
[null,null,null,null,null,null,21,2.0364296913029625E-2,2.3631843308284672,0.75863279125337479,0.75459044848391466,4.5657096939147324E-4,0.5213675213675214,1.6699362758618865,7.3252235055858844E-2,0.15551189345224778,0.32149268564542954,6.7799508007635123E-2,0.76038338658146953,1.7578334614633633,0.98416740290473248,1.4604106126431646,1.6699362758618865,3.8181818181818183,-1.6196727272727272E-2,1.5567634099907584]
[null,null,null,null,null,null,22,2.1334025337459608E-2,2.4070299609875025,0.79466203521518963,0.79061898947197362,4.5657096939147324E-4,0.5213675213675214,1.6878699416704448,7.3252235055858844E-2,0.1700109827232677,0.33944940255960593,6.7799508007635123E-2,0.76038338658146953,1.7705705398180136,0.99556113595173712,1.4604106126431646,1.6878699416704448,4,-1.6968E-2,1.6166051855221701]
[null,null,null,null,null,null,23,2.2303753761889589E-2,2.4498899183193061,0.83069127917700414,0.82664753046003248,4.5657096939147324E-4,0.5213675213675214,1.7052682969731254,7.3252235055858844E-2,0.18515495935895931,0.3574061194737822,6.7799508007635123E-2,0.76038338658146953,1.7829725526702778,1.0066987318871428,1.4604106126431646,1.7052682969731254,4.1818181818181817,-1.7739272727272725E-2,1.6751198325414418]
[null,null,null,null,null,null,24,2.3273482186319579E-2,2.4918278326759427,0.8667205231388192,0.86267607144809177,4.5657096939147324E-4,0.5213675213675214,1.7221695874899186,7.3252235055858844E-2,0.20094382335932284,0.3753628363879587,6.7799508007635123E-2,0.76038338658146953,1.7950609635388735,1.017596725575328,1.4604106126431646,1.7221695874899186,4.3636363636363633,-1.8510545454545453E-2,1.7324074740451703]
[null,null,null,null,null,null,25,2.4243210610749553E-2,2.5329007689707375,0.90274976710063337,0.8987046124361503,4.5657096939147324E-4,0.5213675213675214,1.7386078657115598,7.3252235055858844E-2,0.21737757472435773,0.39331955330213486,6.7799508007635123E-2,0.76038338658146953,1.8068551054215298,1.0282699459145519,1.4604106126431646,1.7386078657115598,4.5454545454545459,-1.9281818181818181E-2,1.7885563378162577]
[null,null,null,null,null,null,26,2.521293903517954E-2,2.573160138035913,0.93877901106244832,0.93473315342420937,4.5657096939147324E-4,0.5213675213675214,1.7546135982000379,7.3252235055858844E-2,0.23445621345406464,0.4112762702163113,6.7799508007635123E-2,0.76038338658146953,1.8183724620911865,1.0387317525325812,1.4604106126431646,1.7546135982000379,4.7272727272727275,-2.0053090909090909E-2,1.8436446191113154]
[null,null,null,null,null,null,27,2.618266745960952E-2,2.6126524511618934,0.97480825502426294,0.97076169441226823,4.5657096939147324E-4,0.5213675213675214,1.7702141651814736,7.3252235055858844E-2,0.25217973954844319,0.42923298713048758,6.7799508007635123E-2,0.76038338658146953,1.829628903662992,1.0489942318614003,1.4604106126431646,1.7702141651814736,4.9090909090909092,-2.0824363636363637E-2,1.8977419885689459]
[null,null,null,null,null,null,28,2.7152395884039497E-2,2.6514199499074169,1.0108374989860773,1.0067902354003269,4.5657096939147324E-4,0.5213675213675214,1.7854342747815344,7.3252235055858844E-2,0.27054815300749346,0.44718970404466385,6.7799508007635123E-2,0.76038338658146953,1.8406388851694671,1.0590683607997784,1.4604106126431646,1.7854342747815344,5.0909090909090908,-2.1595636363636362E-2,1.9509108238489254]
[null,null,null,null,null,null,29,2.8122124308469477E-2,2.6895011354915765,1.0468667429478919,1.0428187763883856,4.5657096939147324E-4,0.5213675213675214,1.8002963089892243,7.3252235055858844E-2,0.28956145383121534,0.46514642095884007,6.7799508007635123E-2,0.76038338658146953,1.8514156149788679,1.0689641442811788,1.4604106126431646,1.8002963089892243,5.2727272727272725,-2.236690909090909E-2,2.003207223915942]
[null,null,null,null,null,null,30,2.9091852732899472E-2,2.7269312166697417,1.082895986909707,1.078847317376445,4.5657096939147324E-4,0.5213675213675214,1.8148206145480685,7.3252235055858844E-2,0.30921964201960939,0.48310313787301662,6.7799508007635123E-2,0.76038338658146953,1.8619711984511671,1.0786907316588685,1.4604106126431646,1.8148206145480685,5.4545454545454541,-2.3138181818181815E-2,2.0546818506891928]
[null,null,null,null,null,null,31,3.0061581157329452E-2,2.7637424909290034,1.1189252308715218,1.1148758583645038,4.5657096939147324E-4,0.5213675213675214,1.8290257490702833,7.3252235055858844E-2,0.32952271757267487,0.50105985478719295,6.7799508007635123E-2,0.76038338658146953,1.8723167611242453,1.0882565157634372,1.4604106126431646,1.8290257490702833,5.6363636363636367,-2.390945454545455E-2,2.105380632369374]
[null,null,null,null,null,null,32,3.1031309581759429E-2,2.7999646707496884,1.1549544748333362,1.1509043993525627,4.5657096939147324E-4,0.5213675213675214,1.8429286904772049,7.3252235055858844E-2,0.35047068049041197,0.51901657170136917,6.7799508007635123E-2,0.76038338658146953,1.8824625548724285,1.0976692176851688,1.4604106126431646,1.8429286904772049,5.8181818181818183,-2.4680727272727271E-2,2.1553453550289738]
[null,null,null,null,null,null,33,{"$f":"(((G223/100)*Iout)*(Vout_nom^2)*2.5*Rsense*K_1)/(eff*(Vline^2)*K_FQ)*us","v":3.200103800618942E-2},{"$f":"(1*10^-9*(5*10^8*SQRT(fsw*kHz)+(1.09655978*10^10)*SQRT(ftyp)*SQRT(H223)))/SQRT(fsw*kHz)","v":2.8356251643095467},{"$f":"(b_1^3/(27*a_1^3))-(d_1^3/27)+SQRT((ftyp)^2*H223^2/(4*a_1^2*c_1^2*(fsw*kHz)^2))+(b_1^3*(ftyp)*H223/(27*a_1^4*c_1*(fsw*kHz))-(d_1^3*(ftyp)*H223/(27*a_1*c_1*(fsw*kHz)))+(b_1*d_1^2*(ftyp)*H223/(9*a_1^2*c_1*(fsw*kHz)))-(b_1^2*d_1*(ftyp)*H223/(9*a_1^3*c_1*(fsw*kHz))))","v":1.1909837187951513},{"$f":"(b_1*d_1^2/(9*a_1))-(b_1^2*d_1/(9*a_1^2))+(ftyp*H223/(2*a_1*c_1*fsw*kHz))","v":1.1869329403406219},{"$f":"(d_1^2/9)+(b_1^2/(9*a_1^2))-(2*b_1*d_1/(9*a_1))","v":4.5657096939147324E-4},{"$f":"((b_1*c_1*fsw*kHz)+(2*a_1*c_1*d_1*fsw*kHz))/(3*a_1*c_1*fsw*kHz)","v":0.5213675213675214},1.856545016197213,{"$f":"(b_2^3/(27*a_2^3))-(d_2^3/27)","v":7.3252235055858844E-2},{"$f":"(ftyp^2*H223^2/(4*a_2^2*c_2^2*(fsw*kHz)^2))+(b_2^3*ftyp*H223/(27*a_2^4*c_2*(fsw*kHz)))-(d_2^3*ftyp*H223/(27*a_2*c_2*(fsw*kHz)))+(b_2*d_2^2*ftyp*H223/(9*a_2^2*c_2*(fsw*kHz)))-(b_2^2*d_2*ftyp*H223/(9*a_2^3*c_2*(fsw*kHz)))","v":0.37206353077282106},{"$f":"(b_2*d_2^2/(9*a_2))-(b_2^2*d_2/(9*a_2^2))+(ftyp*H223/(2*a_2*c_2*(fsw*kHz)))","v":0.53697328861554561},{"$f":"(d_2^2/9)+(b_2^2/(9*a_2^2))-(2*b_2*d_2/(9*a_2))","v":6.7799508007635123E-2},{"$f":"(b_2*c_2*(fsw*kHz)+2*a_2*c_2*d_2*(fsw*kHz))/(3*a_2*c_2*(fsw*kHz))","v":0.76038338658146953},1.8924180498173933,{"$f":"c_3+(SQRT(ftyp)*SQRT(H223)/(SQRT(a_3)*SQRT(b_3)*SQRT(fsw*kHz)))","v":1.1069359597178803},{"$f":"(a_4*(fsw*kHz)*b_4/ftyp)","v":1.4604106126431646},{"$f":"IF(I223>=0.5,IF(I223<1,I223,IF(N223>=1,IF(N223<2,N223,IF(VCOMP3>=2,IF(T223<4.5,T223,IF(U223>=4.5,IF(U223<4.6,U223,V223))))))))","v":1.856545016197213},{"$f":"Pin_max*G223/(Vline*100)","v":6},{"$f":"-Rsense*X223*1.414","v":-2.5452000000000002E-2},{"$f":"MIN(6,MAX(0.5,Beta*G*($Y223-Voff_trim)/(MAX(0,MIN(4.5,W223)-Alpha1_A)+MAX(0,MIN(4.5,W223)-Alpha1_B)-Alpha1_C)+Alpha2))","v":2.2046141632555298}]
[null,null,null,null,null,null,34,3.2970766430619393E-2,2.8707493181724777,1.2270129627569655,1.2229614813286804,4.5657096939147324E-4,0.5213675213675214,1.86988905726525,7.3252235055858844E-2,0.3943012684199016,0.55493000552972183,6.7799508007635123E-2,0.76038338658146953,1.9021920142518343,1.1160633284240564,1.4604106126431646,1.86988905726525,6.1818181818181817,-2.6223272727272727E-2,2.2532219862443643]
[null,null,null,null,null,null,35,3.3940494855049373E-2,2.9053606280710875,1.2630422067187803,1.2589900223167394,4.5657096939147324E-4,0.5213675213675214,1.8829740314685455,7.3252235055858844E-2,0.41718389343165407,0.57288672244389816,6.7799508007635123E-2,0.76038338658146953,1.9117925844254238,1.1250574294088418,1.4604106126431646,1.8829740314685455,6.3636363636363633,-2.6994545454545452E-2,2.3012009023761788]
[null,null,null,null,null,null,36,3.4910223279479353E-2,2.9394809227648842,1.2990714506805947,1.2950185633047981,4.5657096939147324E-4,0.5213675213675214,1.8958121589006622,7.3252235055858844E-2,0.44071140580807822,0.59084343935807448,6.7799508007635123E-2,0.76038338658146953,1.9212273257153896,1.1339239350974624,1.4604106126431646,1.8958121589006622,6.5454545454545459,-2.7765818181818183E-2,2.3485804527203871]
[null,null,null,null,null,null,37,3.5879951703909341E-2,2.9731305250619271,1.3351006946424095,1.3310471042928571,4.5657096939147324E-4,0.5213675213675214,1.908414762668762,7.3252235055858844E-2,0.46488380554917419,0.60880015627225081,6.7799508007635123E-2,0.76038338658146953,1.930503286441754,1.1426681265783407,1.4604106126431646,1.908414762668762,6.7272727272727275,-2.8537090909090908E-2,2.3953879118857202]
[null,null,null,null,null,null,38,3.6849680128339328E-2,3.006328393377923,1.3711299386042244,1.3670756452809163,4.5657096939147324E-4,0.5213675213675214,1.9207923570085468,7.3252235055858844E-2,0.48970109265494177,0.62675687318642725,6.7799508007635123E-2,0.76038338658146953,1.9396270453756868,1.1512949303886657,1.4604106126431646,1.9207923570085468,6.9090909090909092,-2.9308363636363639E-2,2.4416485230558083]
[null,null,null,null,null,null,39,3.7819408552769308E-2,3.039092246632964,1.407159182566039,1.4031041862689753,4.5657096939147324E-4,0.5213675213675214,1.9329547246690781,7.3252235055858844E-2,0.5151632671253813,0.64471359010060358,6.7799508007635123E-2,0.76038338658146953,1.9486047538177362,1.1598089509700815,1.4604106126431646,1.9329547246690781,7.0909090909090908,-3.0079636363636364E-2,2.4873857027958612]
[null,null,null,null,null,null,40,3.8789136977199296E-2,3.071438674822113,1.4431884265278538,1.4391327272570342,4.5657096939147324E-4,0.5213675213675214,1.9449109851138937,7.3252235055858844E-2,0.54127032896049232,0.66267030701478002,6.7799508007635123E-2,0.76038338658146953,1.9574421729825848,1.1682144994015784,1.4604106126431646,1.9449109851138937,7.2727272727272725,-3.0850909090909085E-2,2.5326212202209812]
[null,null,null,null,null,null,41,3.9758865401629269E-2,3.1033832372184804,1.4792176704896682,1.4751612682450927,4.5657096939147324E-4,0.5213675213675214,1.9566696548291338,7.3252235055858844E-2,0.56802227816027506,0.68062702392895613,6.7799508007635123E-2,0.76038338658146953,1.9661447073120382,1.1765156189185615,1.4604106126431646,1.9566696548291338,7.4545454545454541,-3.1622181818181813E-2,2.5773753543192499]
[null,null,null,null,null,null,42,4.0728593826059249E-2,3.134940549858658,1.5152469144514829,1.5111898092331517,4.5657096939147324E-4,0.5213675213675214,1.9682387008211197,7.3252235055858844E-2,0.59541911472472953,0.69858374084313246,6.7799508007635123E-2,0.76038338658146953,1.9747174342431872,1.1847161076468313,1.4604106126431646,1.9682387008211197,7.6363636363636367,-3.2393454545454545E-2,2.6216670325803819]
[null,null,null,null,null,null,43,4.169832225048923E-2,3.1661243637063738,1.5512761584132975,1.5472183502212107,4.5657096939147324E-4,0.5213675213675214,1.9796255882153027,7.3252235055858844E-2,0.62346083865385582,0.71654045775730879,6.7799508007635123E-2,0.76038338658146953,1.9831651308801586,1.1928195389142036,1.4604106126431646,1.9796255882153027,7.8181818181818183,-3.3164727272727276E-2,2.66551395356008]
[null,null,null,null,null,null,44,4.2668050674919217E-2,3.1969476346803605,1.5873054023751125,1.5832468912092696,4.5657096939147324E-4,0.5213675213675214,1.9908373227281566,7.3252235055858844E-2,0.65214744994765383,0.73449717467148523,6.7799508007635123E-2,0.76038338658146953,1.9914922979525349,1.2008292794479638,1.4604106126431646,1.9908373227281566,8,-3.3936000000000001E-2,2.7089326955860025]
[null,null,null,null,null,null,45,4.3637779099349197E-2,3.2274225865580979,1.6233346463369269,1.6192754321973284,4.5657096939147324E-4,0.5213675213675214,2.0018804886675197,7.3252235055858844E-2,0.68147894860612368,0.75245389158566145,6.7799508007635123E-2,0.76038338658146953,1.9997031813888946,1.2087485057210454,1.4604106126431646,1.9997031813888946,8.1818181818181817,-3.4707272727272725E-2,2.7553504137391926]
[null,null,null,null,null,null,46,4.4607507523779177E-2,3.2575607676217286,1.6593638902987415,1.6553039731853874,4.5657096939147324E-4,0.5213675213675214,2.0127612830204682,7.3252235055858844E-2,0.71145533462926502,0.77041060849983778,6.7799508007635123E-2,0.76038338658146953,2.0078017917880859,1.216580218672046,1.4604106126431646,2.0078017917880859,8.3636363636363633,-3.547854545454545E-2,2.7900587436828221]
[null,null,null,null,null,null,47,4.5577235948209165E-2,3.2873731017906112,1.6953931342605564,1.6913325141734465,4.5657096939147324E-4,0.5213675213675214,2.0234855461073322,7.3252235055858844E-2,0.74207660801707842,0.78836732541401422,6.7799508007635123E-2,0.76038338658146953,2.0157919220322142,1.2243272569925421,1.4604106126431646,2.0157919220322142,8.545454545454545,-3.6249818181818175E-2,2.8238893805222851]
[null,null,null,null,null,null,48,4.6546964372639159E-2,3.3168699348825261,1.7314223782223717,1.727361055161506,4.5657096939147324E-4,0.5213675213675214,2.0340587892130371,7.3252235055858844E-2,0.77334276876956376,0.80632404232819077,6.7799508007635123E-2,0.76038338658146953,2.0236771632526462,1.2319923091485336,1.4604106126431646,2.0236771632526462,8.7272727272727266,-3.7021090909090906E-2,2.8573249302031334]
[null,null,null,null,null,null,49,4.7516692797069132E-2,3.3460610765590322,1.7674516221841858,1.7633895961495645,4.5657096939147324E-4,0.5213675213675214,2.0444862195502251,7.3252235055858844E-2,0.80525381688672026,0.82428075924236688,6.7799508007635123E-2,0.76038338658146953,2.0314609193325985,1.2395779242803728,1.4604106126431646,2.0314609193325985,8.9090909090909083,-3.7792363636363631E-2,2.8903810291473255]
[null,null,null,null,null,null,50,4.8486421221499106E-2,3.3749558384371099,1.803480866146,1.799418137137623,4.5657096939147324E-4,0.5213675213675214,2.0547727628606984,7.3252235055858844E-2,0.83780975236854816,0.8422374761565431,6.7799508007635123E-2,0.76038338658146953,2.0391464201062472,1.2470865221064609,1.4604106126431646,2.0391464201062472,9.0909090909090917,-3.8563636363636362E-2,2.9230723214271643]
[null,null,null,null,null,null,51,4.9456149645929093E-2,3.4035630687868483,1.8395101101078151,1.8354466781256822,4.5657096939147324E-4,0.5213675213675214,2.064923083921117,7.3252235055858844E-2,0.87101057521504843,0.86019419307071954,6.7799508007635123E-2,0.76038338658146953,2.0467367333941029,1.2545204019397951,1.4604106126431646,2.0467367333941029,9.2727272727272734,-3.9334909090909094E-2,2.9554125430373208]
[null,null,null,null,null,null,52,5.042587807035908E-2,3.4318911841816666,1.8755393540696299,1.8714752191137412,4.5657096939147324E-4,0.5213675213675214,2.0749416051843372,7.3252235055858844E-2,0.90485628542622054,0.87815090998489598,6.7799508007635123E-2,0.76038338658146953,2.0542347759970756,1.2618817509126024,1.4604106126431646,2.0542347759970756,9.454545454545455,-4.0106181818181819E-2,2.9874145973454254]
[null,null,null,null,null,null,53,5.139560649478906E-2,3.4599481984219667,1.9115685980314445,1.9075037601018001,4.5657096939147324E-4,0.5213675213675214,2.0848325237582932,7.3252235055858844E-2,0.93934688300206437,0.8961076268990722,6.7799508007635123E-2,0.76038338658146953,2.0616433237567766,1.2691726514924431,1.4604106126431646,2.0616433237567766,9.6363636363636367,-4.087745454545455E-2,3.0190906228075001]
[null,null,null,null,null,null,54,5.2365334919219041E-2,3.4877417490139138,1.9475978419932591,1.9435323010898589,4.5657096939147324E-4,0.5213675213675214,2.0945998268990893,7.3252235055858844E-2,0.97448236794257947,0.91406434381324853,6.7799508007635123E-2,0.76038338658146953,2.0689650207767403,1.2763950883629915,1.4604106126431646,2.0689650207767403,9.8181818181818183,-4.1648727272727275E-2,3.0504520538818696]
[null,null,null,null,null,null,55,5.3335063343649021E-2,3.515279121451278,1.9836270859550738,1.9795608420779178,4.5657096939147324E-4,0.5213675213675214,2.1042473061732783,7.3252235055858844E-2,1.0102627402477662,0.93202106072742485,6.7799508007635123E-2,0.76038338658146953,2.0762023878881624,1.2835509547339217,1.4604106126431646,2.0762023878881624,10,-4.2419999999999999E-2,3.0815096759464171]
[null,null,null,null,null,null,56,5.4304791768078994E-2,3.5425672715191134,2.0196563299168879,2.0155893830659766,4.5657096939147324E-4,0.5213675213675214,2.1137785704256356,7.3252235055858844E-2,1.0466879999176251,0.94997777764160107,6.7799508007635123E-2,0.76038338658146953,2.0833578304340947,1.2906420581367417,1.4604106126431646,2.0833578304340947,10.181818181818182,-4.3191272727272724E-2,3.1122736749152415]
[null,null,null,null,null,null,57,5.5274520192508975E-2,3.5696128458127312,2.0556855738787023,2.0516179240540353,4.5657096939147324E-4,0.5213675213675214,2.1231970576725985,7.3252235055858844E-2,1.0837581469521553,0.96793449455577718,6.7799508007635123E-2,0.76038338658146953,2.0904336454376757,1.2976701257568601,1.4604106126431646,2.0904336454376757,10.363636363636363,-4.3962545454545449E-2,3.1427536821583413]
[null,null,null,null,null,null,58,5.6244248616938955E-2,3.5964222006434796,2.0917148178405172,2.0876464650420941,4.5657096939147324E-4,0.5213675213675214,2.1325060460275695,7.3252235055858844E-2,1.1214731813513574,0.98589121146995351,6.7799508007635123E-2,0.76038338658146953,2.097432028212658,1.3046368093464453,1.4604106126431646,2.097432028212658,10.545454545454545,-4.473381818181818E-2,3.1729588152493178]
[null,null,null,null,null,null,59,5.7213977041368942E-2,3.6230014194836802,2.127744061802332,2.1236750060301532,4.5657096939147324E-4,0.5213675213675214,2.1417086637521376,7.3252235055858844E-2,1.1598331031152316,1.0038479283841302,6.7799508007635123E-2,0.76038338658146953,2.1043550784681155,1.3115436897576682,1.4604106126431646,2.1043550784681155,10.727272727272727,-4.5505090909090905E-2,3.202897714998894]
[null,null,null,null,null,null,60,5.8183705465798943E-2,3.6493563290863666,2.1637733057641473,2.1597035470182129,4.5657096939147324E-4,0.5213675213675214,2.1508078985167107,7.3252235055858844E-2,1.1988379122437784,1.0218046452983067,6.7799508007635123E-2,0.76038338658146953,2.1112048059536304,1.3183922811315814,1.4604106126431646,2.1112048059536304,10.909090909090908,-4.6276363636363629E-2,3.2325785791744988]
[null,null,null,null,null,null,61,5.9153433890228924E-2,3.6754925144008186,2.1998025497259617,2.1957320880062716,4.5657096939147324E-4,0.5213675213675214,2.1598066059448162,7.3252235055858844E-2,1.2384876087369956,1.0397613622124831,6.7799508007635123E-2,0.76038338658146953,2.1179831356863259,1.3251840347740713,1.4604106126431646,2.1179831356863259,11.090909090909092,-4.7047636363636361E-2,3.2620091932567528]
[null,null,null,null,null,null,62,6.0123162314658904E-2,3.7014153323920502,2.235831793687777,2.2317606289943304,4.5657096939147324E-4,0.5213675213675214,2.1687075175072605,7.3252235055858844E-2,1.278782192594885,1.0577180791266594,6.7799508007635123E-2,0.76038338658146953,2.1246919127968265,1.3319203427469954,1.4604106126431646,2.1246919127968265,11.272727272727273,-4.7818909090909099E-2,3.2911969585410485]
[null,null,null,null,null,null,63,6.1092890739088884E-2,3.7271299248611256,2.2718610376495914,2.2677891699823896,4.5657096939147324E-4,0.5213675213675214,2.1775132478252552,7.3252235055858844E-2,1.3197216638174458,1.0756747960408357,6.7799508007635123E-2,0.76038338658146953,2.1313329070273843,1.3386025411996678,1.4604106126431646,2.1313329070273843,11.454545454545455,-4.8590181818181817E-2,3.3201489178557044]
[null,null,null,null,null,null,64,6.2062619163518858E-2,3.7526412303531789,2.3078902816114057,2.3038177109704483,4.5657096939147324E-4,0.5213675213675214,2.1862263014353971,7.3252235055858844E-2,1.3613060224046778,1.0936315129550118,6.7799508007635123E-2,0.76038338658146953,2.1379078169120711,1.3452319134632833,1.4604106126431646,2.1379078169120711,11.636363636363637,-4.9361454545454542E-2,3.3488717791362554]
[null,null,null,null,null,null,65,{"$f":"(((G255/100)*Iout)*(Vout_nom^2)*2.5*Rsense*K_1)/(eff*(Vline^2)*K_FQ)*us","v":6.3032347587948845E-2},{"$f":"(1*10^-9*(5*10^8*SQRT(fsw*kHz)+(1.09655978*10^10)*SQRT(ftyp)*SQRT(H255)))/SQRT(fsw*kHz)","v":3.7779539952312811},{"$f":"(b_1^3/(27*a_1^3))-(d_1^3/27)+SQRT((ftyp)^2*H255^2/(4*a_1^2*c_1^2*(fsw*kHz)^2))+(b_1^3*(ftyp)*H255/(27*a_1^4*c_1*(fsw*kHz))-(d_1^3*(ftyp)*H255/(27*a_1*c_1*(fsw*kHz)))+(b_1*d_1^2*(ftyp)*H255/(9*a_1^2*c_1*(fsw*kHz)))-(b_1^2*d_1*(ftyp)*H255/(9*a_1^3*c_1*(fsw*kHz))))","v":2.3439195255732206},{"$f":"(b_1*d_1^2/(9*a_1))-(b_1^2*d_1/(9*a_1^2))+(ftyp*H255/(2*a_1*c_1*fsw*kHz))","v":2.339846251958507},{"$f":"(d_1^2/9)+(b_1^2/(9*a_1^2))-(2*b_1*d_1/(9*a_1))","v":4.5657096939147324E-4},{"$f":"((b_1*c_1*fsw*kHz)+(2*a_1*c_1*d_1*fsw*kHz))/(3*a_1*c_1*fsw*kHz)","v":0.5213675213675214},2.194849079063907,{"$f":"(b_2^3/(27*a_2^3))-(d_2^3/27)","v":7.3252235055858844E-2},{"$f":"(ftyp^2*H255^2/(4*a_2^2*c_2^2*(fsw*kHz)^2))+(b_2^3*ftyp*H255/(27*a_2^4*c_2*(fsw*kHz)))-(d_2^3*ftyp*H255/(27*a_2*c_2*(fsw*kHz)))+(b_2*d_2^2*ftyp*H255/(9*a_2^2*c_2*(fsw*kHz)))-(b_2^2*d_2*ftyp*H255/(9*a_2^3*c_2*(fsw*kHz)))","v":1.4035352683565827},{"$f":"(b_2*d_2^2/(9*a_2))-(b_2^2*d_2/(9*a_2^2))+(ftyp*H255/(2*a_2*c_2*(fsw*kHz)))","v":1.1115882298691884},{"$f":"(d_2^2/9)+(b_2^2/(9*a_2^2))-(2*b_2*d_2/(9*a_2))","v":6.7799508007635123E-2},{"$f":"(b_2*c_2*(fsw*kHz)+2*a_2*c_2*d_2*(fsw*kHz))/(3*a_2*c_2*(fsw*kHz))","v":0.76038338658146953},2.1444182736659387,{"$f":"c_3+(SQRT(ftyp)*SQRT(H255)/(SQRT(a_3)*SQRT(b_3)*SQRT(fsw*kHz)))","v":1.3518096929285706},{"$f":"(a_4*(fsw*kHz)*b_4/ftyp)","v":1.4604106126431646},{"$f":"IF(I255>=0.5,IF(I255<1,I255,IF(N255>=1,IF(N255<2,N255,IF(VCOMP3>=2,IF(T255<4.5,T255,IF(U255>=4.5,IF(U255<4.6,U255,V255))))))))","v":2.1444182736659387},{"$f":"Pin_max*G255/(Vline*100)","v":11.818181818181818},{"$f":"-Rsense*X255*1.414","v":-5.0132727272727266E-2},{"$f":"MIN(6,MAX(0.5,Beta*G*($Y255-Voff_trim)/(MAX(0,MIN(4.5,W255)-Alpha1_A)+MAX(0,MIN(4.5,W255)-Alpha1_B)-Alpha1_C)+Alpha2))","v":3.3773719370678066}]
[null,null,null,null,null,null,66,6.4002076012378839E-2,3.8030727839864489,2.3799487695350359,2.3758747929465667,4.5657096939147324E-4,0.5213675213675214,{"$f":"(J256+K256)^(1/3)+(L256/(J256^(1/3)))+M256","v":2.203383883452692},7.3252235055858844E-2,1.4464094016731592,1.1295449467833647,6.7799508007635123E-2,0.76038338658146953,{"$f":"((O256+SQRT(P256)+Q256)^(1/3))+(R256/((O256+SQRT(P256)+Q256)^(1/3)))+S256","v":2.15086584480742},1.3583370657249567,1.4604106126431646,2.15086584480742,12,-5.0904000000000005E-2,3.4056554929833087]
[null,null,null,null,null,null,67,6.4971804436808819E-2,3.8280019888472516,2.4159780134968503,2.4119033339346254,4.5657096939147324E-4,0.5213675213675214,2.2118329247755222,7.3252235055858844E-2,1.4899284223544071,1.147501663697541,6.7799508007635123E-2,0.76038338658146953,2.1572520375358932,1.3648151732177176,1.4604106126431646,2.1572520375358932,12.181818181818182,-5.1675272727272729E-2,3.4337282731845966]
[null,null,null,null,null,null,68,6.5941532861238786E-2,3.8527458387462858,2.4520072574586642,2.4479318749226837,4.5657096939147324E-4,0.5213675213675214,2.2201983256788234,7.3252235055858844E-2,1.534092330400326,1.1654583806117171,6.7799508007635123E-2,0.76038338658146953,2.1635783018842258,1.3712451143380107,1.4604106126431646,2.1635783018842258,12.363636363636363,-5.2446545454545454E-2,3.4615958458347222]
[null,null,null,null,null,null,69,6.691126128566878E-2,3.8773084076953657,2.4880365014204795,2.4839604159107433,4.5657096939147324E-4,0.5213675213675214,2.2284821259782057,7.3252235055858844E-2,1.5789011258109178,1.1834150975258939,6.7799508007635123E-2,0.76038338658146953,2.1698460336642817,1.3776279477592519,1.4604106126431646,2.1698460336642817,12.545454545454545,-5.3217818181818179E-2,3.4892635365539362]
[null,null,null,null,null,null,70,6.7880989710098746E-2,3.9016936226163983,2.5240657453822939,2.5199889568988016,4.5657096939147324E-4,0.5213675213675214,2.2366862870388791,7.3252235055858844E-2,1.6243548085861805,1.2013718144400698,6.7799508007635123E-2,0.76038338658146953,2.1760565772216753,1.3839646939320476,1.4604106126431646,2.1760565772216753,12.727272727272727,-5.3989090909090903E-2,3.5167364428376553]
[null,null,null,null,null,null,71,6.8850718134528741E-2,3.9259052706705639,2.5600949893441087,2.5560174978868608,4.5657096939147324E-4,0.5213675213675214,2.2448126958654182,7.3252235055858844E-2,1.6704533787261155,1.2193285313542463,6.7799508007635123E-2,0.76038338658146953,2.1822112280145873,1.3902563369887579,1.4604106126431646,2.1822112280145873,12.909090909090908,-5.4760363636363635E-2,3.5440194474022522]
[null,null,null,null,null,null,72,6.9820446558958707E-2,3.9499470061245319,2.5961242333059227,2.5920460388749191,4.5657096939147324E-4,0.5213675213675214,2.2528631689239673,7.3252235055858844E-2,1.7171968362307215,1.2372852482684225,6.7799508007635123E-2,0.76038338658146953,2.1883112350301221,1.396503826527753,1.4604106126431646,2.1883112350301221,13.090909090909092,-5.5531636363636366E-2,3.5711172305535399]
[null,null,null,null,null,null,73,7.0790174983388715E-2,3.9738223567889737,2.6321534772677384,2.6280745798629788,4.5657096939147324E-4,0.5213675213675214,2.2608394557178504,7.3252235055858844E-2,1.7645851811000011,1.2552419651825992,6.7799508007635123E-2,0.76038338658146953,2.1943578030504729,1.4027080792865245,1.4604106126431646,2.1943578030504729,13.272727272727273,-5.6302909090909091E-2,3.5980342816632125]
[null,null,null,null,null,null,74,7.1759903407818681E-2,3.9975347300614716,2.6681827212295524,2.6641031208510371,4.5657096939147324E-4,0.5213675213675214,2.2687432421356406,7.3252235055858844E-2,1.81261841333395,1.2731986820967751,6.7799508007635123E-2,0.76038338658146953,2.2003520947800976,1.4088699807119986,1.4604106126431646,2.2003520947800976,13.454545454545455,-5.7074181818181816E-2,3.6247749098298536]
[null,null,null,null,null,null,75,7.2729631832248662E-2,4.0210874186031571,2.7042119651913672,2.7001316618390958,4.5657096939147324E-4,0.5213675213675214,2.276576153589033,7.3252235055858844E-2,1.8612965329325717,1.2911553990109514,6.7799508007635123E-2,0.76038338658146953,2.2062952328441305,1.414990386435667,1.4604106126431646,2.2062952328441305,13.636363636363637,-5.784545454545454E-2,3.6513432537935913]
[null,null,null,null,null,null,76,7.3699360256678656E-2,4.0444836056758282,2.740241209153182,2.7361602028271554,4.5657096939147324E-4,0.5213675213675214,2.2843397579563383,7.3252235055858844E-2,1.9106195398958659,1.309112115925128,6.7799508007635123E-2,0.76038338658146953,2.2121883016673847,1.4210701236604919,1.4604106126431646,2.2121883016673847,13.818181818181818,-5.8616727272727279E-2,3.6777432911666827]
[null,null,null,null,null,null,77,7.4669088681108636E-2,4.0677263701640554,2.7762704531149969,2.7721887438152142,4.5657096939147324E-4,0.5213675213675214,2.2920355683460212,7.3252235055858844E-2,1.9605874342238307,1.3270688328393043,6.7799508007635123E-2,0.76038338658146953,2.218032349242506,1.4271099924659514,1.4604106126431646,2.218032349242506,14,-5.9388000000000003E-2,3.7039788470363422]
[null,null,null,null,null,null,78,7.5638817105538617E-2,4.0908186913047091,2.8122996970768113,2.8082172848032734,4.5657096939147324E-4,0.5213675213675214,2.2996650456934749,7.3252235055858844E-2,2.0112002159164684,1.3450255497534807,6.7799508007635123E-2,0.76038338658146953,2.2238283887951287,1.433110767037054,1.4604106126431646,2.2238283887951287,14.181818181818182,-6.0159272727272728E-2,3.7300536019907722]
[null,null,null,null,null,null,79,7.6608545529968597E-2,4.1137634531444549,2.8483289410386261,2.8442458257913321,4.5657096939147324E-4,0.5213675213675214,2.3072296012030953,7.3252235055858844E-2,2.0624578849737767,1.362982266667657,6.7799508007635123E-2,0.76038338658146953,2.229577400353234,1.4390731968226662,1.4604106126431646,2.229577400353234,14.363636363636363,-6.0930545454545453E-2,3.7559710996145506]
[null,null,null,null,null,null,80,7.7578273954398591E-2,4.1365634487441305,2.8843581850004409,2.8802743667793913,4.5657096939147324E-4,0.5213675213675214,2.3147305986467028,7.3252235055858844E-2,2.1143604413957573,1.3809389835818335,6.7799508007635123E-2,0.76038338658146953,2.2352803322273345,1.4449980076280609,1.4604106126431646,2.2352803322273345,14.545454545454545,-6.170181818181817E-2,3.7817347534952792]
[null,null,null,null,null,null,81,7.8548002378828571E-2,4.1592213841473269,2.9203874289622558,2.91630290776745,4.5657096939147324E-4,0.5213675213675214,2.322169356528446,7.3252235055858844E-2,2.1669078851824093,1.3988957004960099,6.7799508007635123E-2,0.76038338658146953,2.240938102407557,1.4508859026461938,1.4604106126431646,2.240938102407557,14.727272727272727,-6.2473090909090909E-2,3.8073478537796048]
[null,null,null,null,null,null,82,7.9517730803258538E-2,4.1817398821291478,2.9564166729240697,2.9523314487555083,4.5657096939147324E-4,0.5213675213675214,2.3295471501254919,7.3252235055858844E-2,2.2201002163337322,1.4168524174101857,6.7799508007635123E-2,0.76038338658146953,2.2465515998832437,1.4567375634318585,1.4604106126431646,2.2465515998832437,14.909090909090908,-6.3244363636363626E-2,3.8328135733131954]
[null,null,null,null,null,null,83,8.0487459227688518E-2,4.2041214857398534,2.9924459168858846,2.9883599897435671,4.5657096939147324E-4,0.5213675213675214,2.3368652134130499,7.3252235055858844E-2,2.2739374348497274,1.4348091343243621,6.7799508007635123E-2,0.76038338658146953,2.2521216858902138,1.4625536508225354,1.4604106126431646,2.2521216858902138,15.090909090909092,-6.4015636363636372E-2,3.8581349733963295]
[null,null,null,null,null,null,84,8.1457187652118498E-2,4.2263686616569345,3.028475160847699,3.0243885307316263,4.5657096939147324E-4,0.5213675213675214,2.3441247408815942,7.3252235055858844E-2,2.3284195407303958,1.4527658512385384,6.7799508007635123E-2,0.76038338658146953,2.2576491950904729,1.468334805809465,1.4604106126431646,2.2576491950904729,15.272727272727273,-6.4786909090909089E-2,3.8833150091837667]
[null,null,null,null,null,null,85,8.2426916076548493E-2,4.2484838033581216,3.0645044048095142,3.0604170717196855,4.5657096939147324E-4,0.5213675213675214,2.3513268892535319,7.3252235055858844E-2,2.3835465339757347,1.470722568152715,6.7799508007635123E-2,0.76038338658146953,2.263134936688739,1.4740816503621841,1.4604106126431646,2.263134936688739,15.454545454545455,-6.5558181818181821E-2,3.9083565347553528]
[null,null,null,null,null,null,86,8.3396644500978459E-2,4.2704692341268924,3.1005336487713282,3.0964456127077442,4.5657096939147324E-4,0.5213675213675214,2.3584727791059894,7.3252235055858844E-2,2.4393184145857441,1.4886792850668911,6.7799508007635123E-2,0.76038338658146953,2.2685796954898763,1.4797947882095408,1.4604106126431646,2.2685796954898763,15.636363636363637,-6.6329454545454553E-2,3.9332623078812592]
[null,null,null,null,null,null,87,8.4366372925408453E-2,4.2923272099011598,3.1365628927331435,3.1324741536958034,4.5657096939147324E-4,0.5213675213675214,2.3655634964058847,7.3252235055858844E-2,2.4957351825604284,1.5066360019810676,6.7799508007635123E-2,0.76038338658146953,2.2739842329009798,1.4854748055799507,1.4604106126431646,2.2739842329009798,15.818181818181818,-6.710072727272727E-2,3.9580349945039637]
[null,null,null,null,null,null,88,8.5336101349838434E-2,4.314059921975006,3.1725921366949583,3.1685026946838621,4.5657096939147324E-4,0.5213675213675214,2.3726000939629692,7.3252235055858844E-2,2.5527968378997823,1.5245927188952439,6.7799508007635123E-2,0.76038338658146953,2.2793492878815971,1.4911222719034742,1.4604106126431646,2.2793492878815971,16,-6.7872000000000002E-2,3.9826771729571253]
[null,null,null,null,null,null,89,8.6305829774268414E-2,4.335669499562659,3.2086213806567723,3.2045312356719209,4.5657096939147324E-4,0.5213675213675214,2.3795835928061138,7.3252235055858844E-2,2.6105033806038076,1.5425494358094201,6.7799508007635123E-2,0.76038338658146953,2.2846755778453161,1.4967377404780893,1.4604106126431646,2.2846755778453161,16.181818181818183,-6.8643272727272733E-2,4.0071913379398332]
[null,null,null,null,null,null,90,8.7275558198698394E-2,4.3571580122331692,3.2446506246185871,3.2405597766599796,4.5657096939147324E-4,0.5213675213675214,2.3865149834876926,7.3252235055858844E-2,2.6688548106725052,1.5605061527235964,6.7799508007635123E-2,0.76038338658146953,2.2899637995157081,1.5023217491023675,1.4604106126431646,2.2899637995157081,16.363636363636363,-6.9414545454545451E-2,4.0315799042632747]
[null,null,null,null,null,null,91,8.8245286623128361E-2,4.3785274722236789,3.2806798685804015,3.2765883176480379,4.5657096939147324E-4,0.5213675213675214,2.3933952273205885,7.3252235055858844E-2,2.7278511281058742,1.5784628696377725,6.7799508007635123E-2,0.76038338658146953,2.2952146297394065,1.5078748206766015,1.4604106126431646,2.2952146297394065,16.545454545454547,-7.0185818181818183E-2,4.0558452103854172]
[null,null,null,null,null,null,92,8.9215015047558355E-2,4.3997798366386114,3.3167091125422163,3.3126168586360976,4.5657096939147324E-4,0.5213675213675214,2.4002252575519938,7.3252235055858844E-2,2.7874923329039163,1.596419586551949,6.7799508007635123E-2,0.76038338658146953,2.300428726258902,1.5133974637742855,1.4604106126431646,2.300428726258902,16.727272727272727,-7.09570909090909E-2,4.0799895217481099]
[null,null,null,null,null,null,93,9.0184743471988363E-2,4.4209170095415624,3.3527383565040321,3.3486453996241572,4.5657096939147324E-4,0.5213675213675214,2.4070059804778832,7.3252235055858844E-2,2.8477784250666307,1.6143763034661258,6.7799508007635123E-2,0.76038338658146953,2.3056067284474526,1.5188901731857154,1.4604106126431646,2.3056067284474526,16.90909090909091,-7.1728363636363646E-2,4.1040150339298531]
[null,null,null,null,null,null,94,9.1154471896418329E-2,4.4419408439462433,3.388767600465846,3.3846739406122159,4.5657096939147324E-4,0.5213675213675214,2.4137382765017708,7.3252235055858844E-2,2.9087094045940134,1.6323330203803019,6.7799508007635123E-2,0.76038338658146953,2.3107492580083466,1.5243534304353552,1.4604106126431646,2.3107492580083466,17.09090909090909,-7.2499636363636349E-2,4.1279238756264363]
[null,null,null,null,null,null,95,9.2124200320848282E-2,4.4628531437123549,3.4247968444276595,3.4207024816002738,4.5657096939147324E-4,0.5213675213675214,2.4204230011410832,7.3252235055858844E-2,2.9702852714860688,1.6502897372944778,6.7799508007635123E-2,0.76038338658146953,2.3158569196405931,1.5297877042744985,1.4604106126431646,2.3158569196405931,17.272727272727273,-7.3270909090909081E-2,4.1517181114707773]
[null,null,null,null,null,null,96,9.3093928745278318E-2,4.4836556653518853,3.4608260883894766,3.4567310225883348,4.5657096939147324E-4,0.5213675213675214,2.4270609859842809,7.3252235055858844E-2,3.0325060257428005,1.668246454208655,6.7799508007635123E-2,0.76038338658146953,2.3209303016729828,1.5351934511506558,1.4604106126431646,2.3209303016729828,17.454545454545453,-7.4042181818181813E-2,4.1753997447023172]
[null,null,null,null,null,null,97,{"$f":"(((G287/100)*Iout)*(Vout_nom^2)*2.5*Rsense*K_1)/(eff*(Vline^2)*K_FQ)*us","v":9.4063657169708284E-2},{"$f":"(1*10^-9*(5*10^8*SQRT(fsw*kHz)+(1.09655978*10^10)*SQRT(ftyp)*SQRT(H287)))/SQRT(fsw*kHz)","v":4.5043501197509492},3.4968553323512905,3.4927595635763926,4.5657096939147324E-4,0.5213675213675214,2.4336530396016038,7.3252235055858844E-2,3.0953716673641991,1.6862031711228311,6.7799508007635123E-2,0.76038338658146953,2.3259699766683242,1.5405711156549886,1.4604106126431646,{"$f":"IF(I287>=0.5,IF(I287<1,I287,IF(N287>=1,IF(N287<2,N287,IF(VCOMP3>=2,IF(T287<4.5,T287,IF(U287>=4.5,IF(U287<4.6,U287,V287))))))))","v":2.3259699766683242},17.636363636363637,{"$f":"-Rsense*X287*1.414","v":-7.4813454545454544E-2},4.1989707196956685]
[null,null,null,null,null,null,98,{"$f":"(((G288/100)*Iout)*(Vout_nom^2)*2.5*Rsense*K_1)/(eff*(Vline^2)*K_FQ)*us","v":9.5033385594138264E-2},{"$f":"(1*10^-9*(5*10^8*SQRT(fsw*kHz)+(1.09655978*10^10)*SQRT(ftyp)*SQRT(H288)))/SQRT(fsw*kHz)","v":4.5249381738119538},3.5328845763131049,3.5287881045644518,4.5657096939147324E-4,0.5213675213675214,2.4401999484121615,7.3252235055858844E-2,3.1588821963502705,1.7041598880370072,6.7799508007635123E-2,0.76038338658146953,2.3309765019995492,1.5459211309490453,1.4604106126431646,{"$f":"IF(I288>=0.5,IF(I288<1,I288,IF(N288>=1,IF(N288<2,N288,IF(VCOMP3>=2,IF(T288<4.5,T288,IF(U288>=4.5,IF(U288<4.6,U288,V288))))))))","v":2.3309765019995492},17.818181818181817,{"$f":"-Rsense*X288*1.414","v":-7.5584727272727262E-2},4.2224329243573901]
[null,null,null,null,null,null,99,{"$f":"(((G289/100)*Iout)*(Vout_nom^2)*2.5*Rsense*K_1)/(eff*(Vline^2)*K_FQ)*us","v":9.6003114018568231E-2},{"$f":"(1*10^-9*(5*10^8*SQRT(fsw*kHz)+(1.09655978*10^10)*SQRT(ftyp)*SQRT(H289)))/SQRT(fsw*kHz)","v":4.5454214520205412},3.5689138202749189,3.5648166455525097,4.5657096939147324E-4,0.5213675213675214,2.4467024775098696,7.3252235055858844E-2,3.2230376127010127,1.7221166049511833,6.7799508007635123E-2,0.76038338658146953,2.3359504203992536,1.5512439191719458,1.4604106126431646,{"$f":"IF(I289>=0.5,IF(I289<1,I289,IF(N289>=1,IF(N289<2,N289,IF(VCOMP3>=2,IF(T289<4.5,T289,IF(U289>=4.5,IF(U289<4.6,U289,V289))))))))","v":2.3359504203992536},18,{"$f":"-Rsense*X289*1.414","v":-7.6355999999999993E-2},4.2457881923992034]
[null,null,null,null,null,null,100,{"$f":"(((G290/100)*Iout)*(Vout_nom^2)*2.5*Rsense*K_1)/(eff*(Vline^2)*K_FQ)*us","v":9.6972842442998211E-2},{"$f":"(1*10^-9*(5*10^8*SQRT(fsw*kHz)+(1.09655978*10^10)*SQRT(ftyp)*SQRT(H290)))/SQRT(fsw*kHz)","v":4.565801537941474},3.6049430642367333,3.6008451865405688,4.5657096939147324E-4,0.5213675213675214,2.4531613714505833,7.3252235055858844E-2,3.2878379164164269,1.7400733218653597,6.7799508007635123E-2,0.76038338658146953,2.3408922604841584,1.556539891829104,1.4604106126431646,{"$f":"IF(I290>=0.5,IF(I290<1,I290,IF(N290>=1,IF(N290<2,N290,IF(VCOMP3>=2,IF(T290<4.5,T290,IF(U290>=4.5,IF(U290<4.6,U290,V290))))))))","v":2.3408922604841584},18.181818181818183,{"$f":"-Rsense*X290*1.414","v":-7.7127272727272725E-2},4.2690383054952452]