{"text_format":"1","workbook":"xlsx","n_sheets":4,"sheets":["Loop1","Limits","Notes 4.x.x","Interop"],"not_rendered":{"charts":0,"images":2,"macros":1,"external_links":1,"defined_names":26,"comments":1,"pivot_tables":0},"unopened":[],"bounds":{"document_bytes":16777216,"sheet_cells":100000,"rows_first":2000,"rows_last":500,"rows_between":2000,"halvings":0,"cell_chars":16384,"cell_head_chars":4096},"cells_cut":0,"cells_raw":0,"read":"whole","date_system":"1900"}

{"sheet":"Loop1","index":0,"n_rows":145,"n_cols":22,"rows_kept":145,"cut":false,"hidden":false,"merged":[[0,0,0,1],[2,4,2,5],[2,6,2,7],[3,3,3,5],[3,6,3,7],[3,8,3,9],[4,0,4,1],[4,4,4,9],[6,1,6,2]]}
["PSE Conformance Test Suite",null,null,null,null,null,{"$f":"IF(BT=\"NO\",\"802.3at Conformance Report\",\"802.3bt 2Pr Conformance Report\")","v":"802.3at Conformance Report"}]
["January 4, 2022","18:24:00",null,null,null,null,null,null," version","5.2.00"]
["Port Count………………………………",1,null,null,"Test Mode:  ",null,{"$f":"IF(PD_Pwr=\"Type-1\",\"15.4 Watt\",IF(PD_Pwr=\"Type-2\",\"30 Watt \"&HighPwrGrant,\"\"))","v":"15.4 Watt"},null," report version 5.2.00"]
["Loop Count……………………………..",1,null,"Sifos Interop Index*:  ",null,null,{"$f":"IF(Test_Count>15,Index,\"N/A\")","v":0.973568281938326},null,"DEMO MODE!"]
["PSE Tested: Unspecified Type-1 15.4W",null,null,"Error Log:","None"]
[]
["Chassis ID: 192.168.221.105",{"$f":"\"PSA-\"&PSA&\" Ports\"","v":"PSA-3000 Ports"},null,null,null,null,"Low","P/F","High","P/F",null,null,null,null,null,null,null,null,null,"Interop"]
["TestLoop:  1","    1-1","UNITS","Min","Max","Average","Limit",null,"Limit",null,null,null,null,null,null,null,null,"Info Low","Info High","Weight","Score","Sig. Dig."]
["Test: det_v                 ",null,null,{"$f":"IF(C9=\"\",\"\",MIN(B9:B9))","v":""},{"$f":"IF(C9=\"\",\"\",MAX(B9:B9))","v":""},{"$f":"IF(C9=\"\",\"\",IF(C9=\"    N/A\",\"\",IF(COUNTIF(B9:B9,\">-1\")>0,ROUND((SUM(B9:B9)+COUNTIF(B9:B9,-1))/COUNTIF(B9:B9,\">-1\"),V9),ROUND(AVERAGE(B9:B9),V9))))","v":""},{"$f":"IF(F9=\"\",\"\",IF(VLOOKUP(A9,Test_Limits,2,FALSE)=\"\",\"\",VLOOKUP(A9,Test_Limits,2,FALSE)))","v":""},{"$f":"IF(G9=\"\",\"\",IF(D9<G9,IF(VLOOKUP(A9,Test_Limits,5,FALSE)=\"PF\",\"Fail\",\"Info\"),\"Pass\"))","v":""},{"$f":"IF(F9=\"\",\"\",IF(VLOOKUP(A9,Test_Limits,3,FALSE)=\"\",\"\",VLOOKUP(A9,Test_Limits,3,FALSE)))","v":""},{"$f":"IF(I9=\"\",\"\",IF(E9>I9,IF(VLOOKUP(A9,Test_Limits,5,FALSE)=\"PF\",\"Fail\",\"Info\"),\"Pass\"))","v":""},null,null,null,null,null,null,null,{"$f":"IF(H9=\"Info\",G9,IF(J9=\"Info\",G9,-1000000))","v":-1000000},{"$f":"IF(H9=\"Info\",I9,IF(J9=\"Info\",I9,1000000))","v":1000000},{"$f":"IF(F9=\"\",0,VLOOKUP(A9,Test_Limits,7,FALSE))","v":0},{"$f":"IF(H9=\"Pass\",IF(J9=\"Pass\",T9,0),0)","v":0},{"$f":"VLOOKUP(A9,Test_Limits,6,FALSE)","v":{"$error":"#N/A"}}]
["       Open_Circuit_Det_Voc=",25.3,"  volts",25.3,25.3,{"$f":"IF(C10=\"\",\"\",IF(C10=\"    N/A\",\"\",IF(COUNTIF(B10:B10,\">-1\")>0,ROUND((SUM(B10:B10)+COUNTIF(B10:B10,-1))/COUNTIF(B10:B10,\">-1\"),V10),ROUND(AVERAGE(B10:B10),V10))))","v":25.3},2.8,"Pass",30,"Pass",null,null,null,null,null,null,null,{"$f":"IF(H10=\"Info\",G10,IF(J10=\"Info\",G10,-1000000))","v":-1000000},{"$f":"IF(H10=\"Info\",I10,IF(J10=\"Info\",I10,1000000))","v":1000000},3,{"$f":"IF(H10=\"Pass\",IF(J10=\"Pass\",T10,0),0)","v":3},2]
["            Peak_Det_Vvalid=",7.23,"  volts",7.23,7.23,{"$f":"IF(C11=\"\",\"\",IF(C11=\"    N/A\",\"\",IF(COUNTIF(B11:B11,\">-1\")>0,ROUND((SUM(B11:B11)+COUNTIF(B11:B11,-1))/COUNTIF(B11:B11,\">-1\"),V11),ROUND(AVERAGE(B11:B11),V11))))","v":7.2},3.8,"Pass",10,"Pass",null,null,null,null,null,null,null,-1000000,1000000,5,5,1]
["             Min_Det_Vvalid=",4.67,"  volts",4.67,4.67,4.7,2.8,"Pass",9,"Pass",null,null,null,null,null,null,null,-1000000,1000000,5,5,1]
["       Det_Volt_Step_dVtest=",2.56,"  volts",2.56,2.56,2.6,1,"Pass",7.2,"Pass",null,null,null,null,null,null,null,-1000000,1000000,5,5,1]
["             Detection_Slew=",0," V/usec",0,0,0,0,"Pass",0.1,"Pass",null,null,null,null,null,null,null,-1000000,1000000,1,1,4]
["         Good_Sig_Det_Pulse=",3,"  edges",3,3,3,1,"Pass",9,"Pass",null,null,null,null,null,null,null,-1000000,1000000,5,5,1]
["            Backoff_Voltage=",0.6,"  volts",0.6,0.6,0.6,0,"Pass",9,"Pass",null,null,null,null,null,null,null,-1000000,1000000,1,1,1]
["             Non_802_Step_V=",0,"  volts",0,0,0,0,"Pass",0.1,"Pass",null,null,null,null,null,null,null,-1000000,1000000,0,0,1]
["              High_Sig_MaxV=",11.66,"  volts",11.66,11.66,11.7,3.8,"Pass",11,"Info",null,null,null,null,null,null,null,3.8,11,1,0,1]
["            Non_802_Discr_?=",0,"   ****",0,0,0,0,"Pass",0,"Pass",null,null,null,null,null,null,null,-1000000,1000000,0,0,0]
["            Detect_Strategy=",0,"   ****",0,0,0,0,"Pass",2,"Pass",null,null,null,null,null,null,null,-1000000,1000000,3,3,0]
["Test: det_i                 ",null,null,"","","","","","","",null,null,null,null,null,null,null,-1000000,1000000,0,0,{"$error":"#N/A"}]
["           Init_Current_Isc=",0.2,"     mA",0.2,0.2,0.2,0,"Pass",5,"Pass",null,null,null,null,null,null,null,-1000000,1000000,1,1,2]
["            Det_Current_Isc=",0.2,"     mA",0.2,0.2,0.2,0,"Pass",5,"Pass",null,null,null,null,null,null,null,-1000000,1000000,1,1,2]
["Test: det_range             ",null,null,"","","","","","","",null,null,null,null,null,null,null,-1000000,1000000,0,0,{"$error":"#N/A"}]
["                  Rgood_Max=",29,"   Kohm",29,29,29,26,"Pass",32,"Pass",null,null,null,null,null,null,null,-1000000,1000000,5,5,1]
["                  Rgood_Min=",17,"   Kohm",17,17,17,16,"Pass",19,"Pass",null,null,null,null,null,null,null,-1000000,1000000,5,5,1]
["                   Rmid_det=",29,"   Kohm",29,29,29,26,"Pass",33,"Pass",null,null,null,null,null,null,null,-1000000,1000000,3,3,1]
["                  Cgood_Max=",0.1,"     uF",0.1,0.1,0.1,0,"Pass",10,"Pass",null,null,null,null,null,null,null,-1000000,1000000,3,3,1]
["             Rbad_Cbad_Stat=",0,"   ****",0,0,0,0,"Pass",0,"Pass",null,null,null,null,null,null,null,-1000000,1000000,3,3,1]
["Test: det_time              ",null,null,"","","","","","","",null,null,null,null,null,null,null,-1000000,1000000,0,0,{"$error":"#N/A"}]
["          Backoff_Time_Tdbo=",63,"   msec",63,63,63,-1,"Pass",1500,"Pass",null,null,null,null,null,null,null,-1000000,1000000,1,1,1]
["       Eff_Backoff_Tdbo_eff=",63,"   msec",63,63,63,-1,"Pass",1500,"Pass",null,null,null,null,null,null,null,-1000000,1000000,1,1,1]
["               Backoff_Type=",0,"   ****",0,0,0,0,"Pass",0,"Pass",null,null,null,null,null,null,null,-1000000,1000000,1,1,0]
["        Detection_Time_Tdet=",301,"   msec",301,301,301,5,"Pass",500,"Pass",null,null,null,null,null,null,null,-1000000,1000000,1,1,1]
["             Total_Det_Time=",305,"   msec",305,305,305,5,"Pass",1000,"Pass",null,null,null,null,null,null,null,-1000000,1000000,0,0,1]
["Test: det_rsource           ",null,null,"","","","","","","",null,null,null,null,null,null,null,-1000000,1000000,0,0,{"$error":"#N/A"}]
["      Output_Impedance_Zout=",450,"   KOhm",450,450,450,45,"Pass",2000,"Pass",null,null,null,null,null,null,null,-1000000,1000000,1,1,1]
["Test: class_v               ",null,null,"","","","","","","",null,null,null,null,null,null,null,-1000000,1000000,0,0,{"$error":"#N/A"}]
["       Class_Voltage_Vclass=",19,"  volts",19,19,19,15.5,"Pass",20.5,"Pass",null,null,null,null,null,null,null,-1000000,1000000,5,5,1]
["                 Vclass_Min=",18.8,"  volts",18.8,18.8,18.8,15.5,"Pass",20.5,"Pass",null,null,null,null,null,null,null,-1000000,1000000,5,5,1]
{"$rows_left_out":106}
{"sheet":"Limits","index":1,"n_rows":187,"n_cols":14,"rows_kept":187,"cut":false,"hidden":false,"merged":[[4,9,4,10],[5,9,5,10],[8,9,8,10],[12,9,12,12],[16,9,16,12],[17,9,17,12],[20,9,20,11],[21,9,21,12],[22,9,22,12],[37,9,37,10],[37,11,37,12],[47,9,47,12],[55,9,55,12],[6,9,7,10]]}
[]
[null,"802.3at Test Limits            ","Pwr'd Prs:","Alt-A","PD TYPE:","Type-1","30W_Grant:","NONE","PSA:",3000,"MinFW Ver:","4.17","BT:","NO"]
[]
[null,"Parameter","Low Limit","High Limit","Units","Type","Sig.Digs.","Intop Wt.",null,"Configuration Options:"]
[null,"Test: det_v                         ",null,null,null,null,null,null,null," Pwr'd Prs:",null,"Alt-A","Alt-B"]
[null,"       Open_Circuit_Det_Voc=",2.8,30,"Volts","PF",2,3,null," PD TYPE:",null,"Type-1","Type-2"]
[null,"            Peak_Det_Vvalid=",3.8,10,"Volts","PF",1,5,null," HighPwrGrant:",null,"NONE","PHY"]
[null,"             Min_Det_Vvalid=",2.8,9,"Volts","PF",1,5,null,null,null,"LLDP","PHY+LLDP"]
[null,"       Det_Volt_Step_dVtest=",1,7.2,"Volts","PF",1,5,null," BT:",null,"YES","NO"]
[null,"             Detection_Slew=",0,0.1,"V/msec","PF",4,1]
[null,"         Good_Sig_Det_Pulse=",1,9,"Steps","PF",1,5]
[null,"            Backoff_Voltage=",0,{"$f":"IF(ALT=\"Alt-B\",2.8,IF(HighPwrGrant=\"PHY\",IF(PD_Pwr=\"Type-2\",2.8,9),9))","v":9},"Volts","PF",1,{"$f":"IF(HighPwrGrant=\"PHY\",IF(PD_Pwr=\"Type-2\",5,1),1)","v":1},null,"Limit Logic Color Key"]
[null,"             Non_802_Step_V=",0,0.1,"Volts","Warn",1,0,null,"PSE ALT TYPE Dependence"]
[null,"              High_Sig_MaxV=",3.8,11,"Volts","Warn",1,1,null,"30W Grant (PSE Type) Dependence"]
[null,"            Non_802_Discr_?=",0,0,"****","Warn",0,0,null,"PD Pwr Type + 30W Grant Dependence"]
[null,"            Detect_Strategy=",0,2,"****","PF",0,3,null,"802.3at vs 802.3bt Dependence"]
[null,"Test: det_i                         ",null,null,null,null,null,null,null,"BT vs AT+ 30W Grant Dependence"]
[null,"           Init_Current_Isc=",0,5,"mA","PF",2,1,null,"BT vs AT + 30W Grant + PD TYPE Dependence"]
[null,"            Det_Current_Isc=",0,5,"mA","PF",2,1]
[null,"Test: det_range                     "]
[null,"                  Rgood_Max=",26,32,"KW","PF",1,5,null,"Parameter Color Key"]
[null,"                  Rgood_Min=",16,19,"KW","PF",1,5,null,"Conformance Test Suite for 802.3at, 802.3bt"]
[null,"                   Rmid_det=",26,33,"KW","PF",1,3,null,"PSA-3000 Conformance Suite for 802.3bt "]
[null,"                  Cgood_Max=",0,10,"mF","PF",1,3]
[null,"             Rbad_Cbad_Stat=",0,0,"****","PF",1,3]
[null,"Test: det_time                      "]
[null,"          Backoff_Time_Tdbo=",{"$f":"IF(ALT=\"Alt-A\",-1,2000)","v":-1},{"$f":"IF(ALT=\"Alt-A\",1500,16000)","v":1500},"msec",{"$f":"IF(ALT=\"Alt-A\",\"Warn\",\"PF\")","v":"Warn"},1,1]
[null,"       Eff_Backoff_Tdbo_eff=",{"$f":"C27","v":-1},{"$f":"IF(ALT=\"Alt-A\",1500,16000)","v":1500},"msec",{"$f":"IF(ALT=\"Alt-A\",\"Warn\",\"PF\")","v":"Warn"},1,1]
[null,"               Backoff_Type=",0,0,"****","Warn",0,1]
[null,"        Detection_Time_Tdet=",5,500,"msec","PF",1,1]
[null,"             Total_Det_Time=",5,1000,"msec","PF",1,0]
[null,"Test: det_rsource                   "]
[null,"      Output_Impedance_Zout=",45,2000,"KW","Warn",1,1]
[null,"       Regulated_Vstep_Zout=",-0.1,12,"KW","Warn",1,0]
[null,"Test: class_v                       "]
[null,"       Class_Voltage_Vclass=",15.5,20.5,"Volts","PF",1,5]
[null,"                 Vclass_Min=",15.5,20.5,"Volts","PF",1,5]
[null,"         Mark_Voltage_Vmark=",7,10,"Volts","PF",1,5,null,"802.3at",null,"802.3bt"]
[null,"           Mark_Voltage_Min=",7,10,"Volts","PF",1,5,null,"Low Limit","High Limit","Low Limit","High Limit"]
[null,"              Class_Reset_V=",-1,2.8,"Volts","PF",1,5]
{"$rows_left_out":148}
{"sheet":"Notes 4.x.x","index":2,"n_rows":152,"n_cols":5,"rows_kept":152,"cut":false,"hidden":false,"merged":[[1,1,1,2],[15,1,20,1],[15,3,20,3],[31,3,32,3],[37,3,38,3],[40,3,41,3],[42,3,43,3],[51,3,52,3],[92,3,93,3],[95,3,102,3],[103,3,104,3],[106,3,107,3],[109,3,112,3],[118,3,119,3],[130,3,131,3],[138,3,139,3],[5,4,38,4],[40,4,72,4],[76,4,86,4],[88,4,119,4],[121,4,126,4],[128,4,139,4],[141,4,151,4]]}
[]
[null,"PSE Conformance Test Suite 4.x.x (PSA-3000) Tests and Parameters"]
[]
[null,"Parameter","Description","Special Notes","PSA-3000 Reference Manual"]
[null,"Test: det_v                         "]
[null,"       Open_Circuit_Det_Voc=","Peak Open Circuit Detection Voltage",null,"Section 5.4"]
[null,"            Peak_Det_Vvalid=","Maximum Detection Voltage with Valid Detection Signature"]
[null,"             Min_Det_Vvalid=","Minimum Valid Step Voltage with Valid Detection Signature"]
[null,"       Det_Volt_Step_dVtest=","Minumum 802.3at Voltage Step Magnitude","If dVtest step size measures under 1 Volt, then it may be that the PSE is using alternate steps to make the resistance measurement.   If \"Info\" appears with this parameter, then Good_Sig_Det_Pulse must be 2 or more steps, or this is a \"FAIL\"."]
[null,"             Detection_Slew=","Maximum Step Slew Rate"]
[null,"         Good_Sig_Det_Pulse=","Number of Valid Detection Transitions (i.e. between valid step levels)"]
[null,"            Backoff_Voltage=","IDLE State voltage during detection backoff"]
[null,"             Non_802_Step_V=","Peak Non-802.3at (< 2.8 Volt) Step Voltage Level","Test is exposing that PSE may be using additional signaling and measurements prior to or as part of normal 802.3at detection measurements.   These may be beneficial in limiting detection pulse power to a non-PD device, however they are not part of the standard."]
[null,"              High_Sig_MaxV=","Maximum Detection Voltage with High Detection Signature","The 802.3at specification does not define requirements for detection signaling when detection load is slightly outside valid range."]
[null,"Non_802_Discr_?=","This binary indicator is set to \"1\" when a PSE is determined to be using means other than normal 802.3at detection measurements to resolve the valid detection range.","While not required by the standard, one would expect to see normal 802.3at detection pulses when PD signatures are somewhat out of the valid band.   Some PSE's withold 802.3at detection measurements until the signature is virtually inside the valid detection band."]
[null,"Detect_Strategy=","Type 0:  Normal 802.3at Detection Methods ","This parameter categorizes PSE port detection strategy into one of 6 categories.   Pre-Detection Only indicates PSE does not form full 802.3at detection pulses until a near valid detection signature is present.   Zero-Backoff means the PSE does not have distinct backoffs during open circuit detection.   50V Pulses refers to existance of legacy detection pulses prior to any PD connection.  Type 4 and 5 indicate that the open circuit detection signaling is entirely above the required PD signature band and thus PSE is relying on PD Detection Signature to be visible outside the minimum specified valid signature band."]
[null,null,"Type 1:  Proprietary Pre-Detection Observed with Open Circuit          "]
[null,null,"Type 2:  Zero-Backoff Type PSE Port Determined"]
[null,null,"Type 3:  Open Circuit Signaling Includes 50V Legacy Detection Pulses"]
[null,null,"Type 4:  Proprietary Pre-Detection Observed with Open Circuit  - Open Circuit Voltage outside PD Detection Voltage Band"]
[null,null,"Type 5:  Zero-Backoff Type PSE Determined - Open Circuit Voltage outside PD Detection Voltage Band"]
[null,"Test: det_i                         "]
[null,"           Init_Current_Isc=","Peak Current Flow During Detection Below 2.8 Volts"]
[null,"            Det_Current_Isc=","Peak Current Flow During Detection Above 2.8 Volts"]
[null,"Test: det_range                     "]
[null,"                  Rgood_Max=","Maximum Valid Detection Signature Resistance"]
[null,"                  Rgood_Min=","Minimum Valid Detection Signature Resistance"]
[null,"                   Rmid_det=","Maximum (or Minimum) Detection Signature producing a power-up given connections with various time alignments to the detection measurement.","Assess if detection measurement is sensitive to when the detection signature is connected."]
[null,"                  Cgood_Max=","Maximum Valid Detection Signature Capacitance"]
[null,"             Rbad_Cbad_Stat=","PSE response to marginally invalid Rdet + lowest rejected Cdet value","Determine if adding capacitance causes a high detection signature to become valid to PSE."]
[null,"Test: det_time                      "]
[null,"          Backoff_Time_Tdbo=","Backoff Time Between Detection Pulses","With ALT B PSE's, strict requirement is minimum 2 seconds.  With ALT A PSE's, IEEE recommended requirement is that a second detection cycle complete within 2 seconds of the first detection cycle completing, however this is not a strict requirement.  Report will \"Info\" ALT A PSE's with longer than 1.5 second backoff, allowing 500msec for detection time."]
[null,"Eff_Backoff_Tdbo_eff=","Effective Backoff Time Following Invalid Signature Measurement - measures time from invalid detection until valid detection producing a power-up."]
[null,"Backoff_Type=","Type 0:  Normal 802.3at Detection Backoffs                                              Type 1:  Non-802.3 Signaling Detected                                                  Type 2:  50 Volt Legacy Detection Pulses Detected                                            Type 3: PoH Double-Detection Scheme","For the most part, none of these are problems.  The 50V Legacy Detection pulse will place 50V common mode on the PD connection if an invalid PD signature is measured on the first attempt by the PSE port.  Non-802.3 signaling usually indicates proprietary detection assessments.  PoH Double Detection causes detection back-off to become ambiguous."]
[null,"        Detection_Time_Tdet=","Duration of 802.3at Detection Measurements","Measured only over 802.3at Min to Max detection levels."]
[null,"             Total_Det_Time=","Total Duration of Detection Pulse","Measured over exactly one cycle of detection."]
[null,"Test: det_rsource                   "]
[null,"      Output_Impedance_Zout=","PSE Effective Output Impedance During PD Detection given a current-sourcing detection scheme","det_rsource cannot determine if PSE output is diode protected or if reverse input resistance = Zout.  Rp (pwrdn_time) MAY be a more accurate indication of Rrev.  Maximum value reported will be 450KW as this is highest Zout that can be resolved by the measurement technique."]
[null,"       Regulated_Vstep_Zout=","PSE Effective Output Impedance During PD Detection given a regulated voltage detection scheme  (e.g. LOW or Zero effective Zout)"]
[null,"Test: class_v                       "]
{"$rows_left_out":113}
{"sheet":"Interop","index":3,"n_rows":47,"n_cols":11,"rows_kept":47,"cut":false,"hidden":false,"merged":[[0,1,0,2],[1,3,1,5],[4,1,4,2],[42,1,42,10],[43,1,43,10],[44,1,44,10],[45,1,45,10],[46,1,46,10],[1,6,3,7]]}
[null,"802.3at Conformance Report"]
[null,{"$f":"Date","v":"January 4, 2022"},{"$f":"Time","v":"18:24:00"},"Sifos PSE Interop Index*:  ",null,null,{"$f":"IF(Test_Count>15,Index,\"N/A\")","v":0.973568281938326},null,null," version",{"$f":"Version","v":"5.2.00"}]
[null,"Port Count………………………………",{"$f":"Port_Count","v":1},null,null,null,null,null,null,{"$f":"Report_Version","v":" report version 5.2.00"}]
[null,"Loop Count……………………………..",{"$f":"Loop_Count","v":1},null,"Tests Run:",{"$f":"Test_Count","v":19}]
[null,{"$f":"Loop1!A5","v":"PSE Tested: Unspecified Type-1 15.4W"},null,null,"Total Parameters:",{"$f":"Parm_Count","v":75},{"$f":"IF(G2=\"N/A\",\"Need Minimum 16 Tests!\",\"\")","v":""}]
[]
[null,null,null,null,null,null,"Low","P/F","High","P/F","Deduct"]
[null,"Interoperability Test Items","UNITS","Min","Max","Average","Limit",null,"Limit",null,"Points"]
[null,"              High_Sig_MaxV=","  volts",11.66,11.66,11.7,3.8,"Pass",11,"Info",0.00440528634361234]
[null,"            Class_Time_Tpdc=","   msec",4.9,4.9,4.9,5.6,"Fail",75,"Pass",0.0220264317180617]
[]
[]
[]
[]
[]
[]
[]
[]
[]
[]
[]
[]
[]
[]
[]
[]
[]
[]
[]
[]
[]
[]
[]
[]
[]
[]
[]
[]
[]
[]
{"$rows_left_out":7}