{"text_format":"1","workbook":"xlsx","n_sheets":7,"sheets":["Introduction","Instructions","QR Design Tool","QR Simulator","Magnetic Specification","Lookuptables","Sheet1"],"not_rendered":{"charts":4,"images":3,"macros":1,"external_links":1,"defined_names":116,"comments":0,"pivot_tables":0},"unopened":[],"bounds":{"document_bytes":16777216,"sheet_cells":100000,"rows_first":2000,"rows_last":500,"rows_between":2000,"halvings":0,"cell_chars":16384,"cell_head_chars":4096},"cells_cut":0,"cells_raw":0,"read":"whole","date_system":"1900"}

{"sheet":"Introduction","index":0,"n_rows":22,"n_cols":16,"rows_kept":22,"cut":false,"hidden":false,"merged":[]}
[]
[]
[]
[]
[]
[]
[]
[null,"Designing with the UCC28600 Quasi-Resonant Flyback Converter"]
[]
[]
[null,null,"This worksheet is designed for use with Microsoft Excel 5.0 or later.  Its use is intended to assist power supply designers in their",null,null,null,null,null,null,null,null,null,null,null,null,"© 2013"]
[null,null,"routine, day-to-day calculations."]
[null,null,null,null,null,null,null,null,null,null,null,null,null,null,null,"slvs104J"]
[]
[null," "," Component values are calculated as ideal, not to nearest production values"]
[]
[]
[null,null,null,"Disclaimer"]
[null,null,null,"This product is designed as an aid for customers of Texas Instruments.  No warranties, either express"]
[null,null,null,"or implied, with respect to this software or its fitness for any particular purpose is claimed by Texas"]
{"$rows_left_out":3}
{"sheet":"Instructions","index":1,"n_rows":18,"n_cols":2,"rows_kept":18,"cut":false,"hidden":false,"merged":[]}
[]
[null,"QR Design Tool Instructions"]
[]
[null,"Be sure to Enable the Macros and to have a check in the AnalysisT oolPak box in the Add-Ins section of the Tools menu."]
[]
[null,"Quasi-Resonant (QR) flyback converter design is an iterative process.  This design tool reduces the hardware iterations by simulating the steady state operating maps that show the converter modes under different input and load conditions.  Design adjustments can be explored in order to optimize the power system.  Although the design spreadsheet is organized around a bridge rectifier – bulk capacitor line rectifier, it can be used for fixed output Power Factor Corrector (PFC) or voltage follower PFC systems.  Systems with PFC must allow the QR flyback stage to start-up under the low ac line condition.  However, the steady state conduction losses to the QR flyback stage will only occur at the PFC bulk capacitor voltage levels."]
[]
[null,"To use this tool, enter the voltages, power levels and converter estimates into the appropriate spaces of the QR Design Tool worksheet.  This step also requires an initial selection of the power MOSFET and the output rectifier.  Enter data in the cells with the BLUE text; the calculated values are in the cells with the RED text.  The parameters for the UCC28600 are already included.  The design tool will generate a recommended design that includes transformer parameters.  Verify that the current and voltage stresses are compatible with the MOSFET and output rectifier that were initially selected.  The recommended values in the design may not be practical due to integer transformer turns, standard values, etc.  Yet the operation of the converter can be significantly altered by using the closest parameter."]
[]
[null,"At this point, design the transformer using the magnetizing inductance and approximate turns ratio that was recommended by the QR Design Tool worksheet.  The Magnetic Specification sheet can be printed and used as a guideline for the recommended transformer design.  The next step is to see how the design performs using the QR Simulator worksheet."]
[]
[null,"The QR Simulator will carry over the Converter Requirements, MOSFET Specifications, Diode Data and the UCC28600 Characteristics.  The transformer information and the programming components, RS (current sense resistance), RPL (power limit programming), ROVP1 and ROVP2 (over-voltage programming resistors) must be entered by the user.  The recommended values are shown beside the cells as a reminder for the ideal values."]
[]
[null,"After entering the final values, examine the operating maps.  They reveal the boundaries of the different modes of operation.  The operating maps portray the power levels, peak switch currents, feed back voltages and switching frequencies for the full array of line voltages and loads that the converter would experience.  These maps can be used to explore design alternatives, such as different current sense resistor values, different transformers, etc.  For example, it might be desirable to change the power level where burst mode occurs in order to avoid audio noise at a common load operating point.  The QR Simulator worksheet also shows rms currents, whether the converter is in power limit, the operational mode among other potentially useful data that can be used to optimize the converter performance in a specific power system."]
[]
[null,"For PFC systems that have a fixed bulk voltage, estimate the PFC output voltage at the peak of its ripple.  Calculate the equivalent ac voltage to achieve that maximum voltage level.  Enter that ac voltage as the VAC(max) level.  Enter the minimum operational ac line voltage as the VAC(min) level because the QR Flyback must power up correctly in order to start the PFC stage."]
[]
[null,"For voltage follower PFC systems, estimate the PFC output voltage at the peak of its ripple during maximum line conditions. Calculate the equivalent ac voltage to achieve that maximum voltage level. Enter that ac voltage as the VAC(max) level. Enter the minimum ac line voltage as the VAC(min) level because the QR Flyback must power up correctly in order to start the PFC stage. In the least, converter must be designed to operate at safe temperatures under the steady state operating rms currents that occur at the minimum PFC voltage and at the maximum PFC voltage. The data tables in the QR Simulator worksheet can assist in finding the required values."]

{"sheet":"QR Design Tool","index":2,"n_rows":195,"n_cols":29,"rows_kept":195,"cut":false,"hidden":false,"merged":[[173,7,173,12],[176,7,176,12],[179,7,179,12],[170,7,170,12],[171,7,171,12],[174,7,174,12],[175,7,175,12],[177,7,177,12],[178,7,178,12],[172,7,172,12],[192,7,192,12],[183,7,183,12],[185,7,185,12],[184,7,184,12],[189,7,189,12],[180,7,180,12],[181,7,181,12],[182,7,182,12],[191,7,191,12],[190,7,190,12],[186,7,186,12],[187,7,187,12],[188,7,188,12],[167,7,167,12],[168,7,168,12],[165,7,165,12],[169,7,169,12],[162,7,162,12],[159,7,159,12],[163,7,163,12],[0,1,0,12],[1,1,1,12],[90,8,90,12],[69,8,69,12],[158,7,158,12],[161,7,161,12],[157,7,157,12],[160,7,160,12],[143,7,143,12],[140,7,140,12],[141,7,141,12],[153,7,153,12],[155,7,155,12],[156,7,156,12],[45,8,45,12],[12,8,12,12],[29,8,29,12],[19,8,19,12],[37,8,37,12],[15,8,15,12],[16,8,16,12],[20,8,20,12],[21,8,21,12],[23,8,23,12],[24,8,24,12],[32,8,32,12],[33,8,33,12],[34,8,34,12],[27,8,27,12],[30,8,30,12],[28,8,28,12],[25,8,25,12],[127,7,127,12],[131,10,131,12],[41,8,41,12],[42,8,42,12],[43,8,43,12],[2,1,4,12],[48,6,68,6],[9,8,9,12],[10,8,10,12],[11,8,11,12],[26,8,26,12],[31,8,31,12],[35,8,35,12],[36,8,36,12],[40,8,40,12],[39,8,39,12],[38,8,38,12],[6,8,8,12],[46,8,46,12],[47,8,47,12],[48,8,68,12],[17,8,17,12],[22,8,22,12],[18,8,18,12],[137,7,137,12],[139,7,139,12],[5,8,5,12],[13,8,13,12],[14,8,14,12],[74,8,74,12],[75,8,75,12],[76,8,76,12],[77,8,80,12],[70,8,70,12],[136,7,136,12],[71,8,71,12],[72,8,72,12],[73,8,73,12],[87,8,87,12],[91,8,91,12],[92,8,92,12],[81,8,81,12],[82,8,85,12],[86,8,86,12],[123,7,123,12],[124,7,124,12],[125,7,125,12],[126,7,126,12],[164,7,164,12],[166,7,166,12],[98,12,99,12],[88,8,88,12],[89,8,89,12],[194,7,194,12],[151,7,151,12],[145,7,145,12],[93,8,93,12],[122,1,122,12],[98,4,99,4],[98,1,99,1],[150,7,150,12],[152,7,152,12],[132,10,132,12],[193,7,193,12],[149,7,149,12],[146,7,146,12],[148,7,148,12],[147,7,147,12],[154,7,154,12],[144,7,144,12],[142,7,142,12],[138,7,138,12]]}
[null,"UCC28600 Design Spreadsheet"]
[null,"TI Literature Number - SLVC104J - April 2017"]
[null,"Design Synthesis - type in the blue data and the spreadsheet responds with the calculated red data.  Bold RED results are recommended COMPONENT VALUES."]
[]
[]
[null,null,null,null,null,null,null,null,"Comments on REQUIRED USER INPUTS:"]
[null,null,null,null,null,null,null,null,"ALL CELLS WITH BLUE TEXT MUST BE VERIFIED AND UPDATED BY THE USER FOR EACH DESIGN."]
[]
[null,"Converter Requirements"]
[null,"POUT(max) limit",84,"W",null,null,null,null,"- POUT(max) limit is maximum output power of converter (enter, in W, into cell C10)"]
[null,"RLOAD  =",{"$f":"(Vout^2)/Pout","v":6.8571428571428568},"W, VOUT2/POUT ",null,null,null,null,"- POUT during SS, default: use POUT(max) if design will start into full load (enter, in W,  into cell C11)"]
[null,"efficiency ratio",0.8,null,null,null,null,null,"- efficiency ratio is the Expected converter efficiency (enter, in decimal form, in cell C12)"]
[null,"PIN =",{"$f":"Pout/eff_est","v":105},"W",null,null,null,null,"- Resultant input power from User input (calculated by spreadsheet)"]
[null,"VAC(min)",165,"VAC","VBULK(min_pk) =",{"$f":"Vac_min*SQRT(2)","v":233.34523779156069},"V, VAC(min)Ö2",null,"- VAC(min) is the minimum AC line input voltage (enter, in VAC, in cell C14)"]
[null,"VAC(max) **",550,"VAC","VBULK(min_valley) =",{"$f":"Vbulkmin*(1-(Vbulkripple/100))","v":175.0089283436705},"V, minus ripple",null,"- **For systems with a PFC front end, the VAC(max) value entered into cell C15 should be equivalent to the maximum regulated output voltage of the PFC stage divided by SQRT(2), as calculated by the USER, otherwise, for systems that DO NOT have a PFC input stage, enter the maximum AC line input voltage. (enter, in VAC, in cell C15)"]
[null,"VBULK(ripple), %pp",25,"%","VBULK(max_pk) =",{"$f":"Vacmax*SQRT(2)","v":777.81745930520231},"V, VAC(max)Ö2",null,"- VBULK(ripple), %pp is the ripple voltage on the input voltage (enter the percentage of peak to peak ripple voltage on the input bus in cell C16)"]
[null,"VAC(max) shutdown margin %",5,"%","VBULK(ov) =",{"$f":"Vbulkmax*(1+inputovp/100)","v":816.70833227046251},"V, plus ripple",null,"- VAC(max) shutdown margin % is the User programmable Line Over Voltage Protection limit (enter the percentage of margin that the line voltage can exceed VAC(max) before initiating Line OVP, in cell C17)"]
[null,"Required INPUT CAPACITOR",{"$f":"Lookuptables!O21","v":68},"uF",null,null,null,null,"INPUT CAPACITOR: required minimum input capacitor to meet required VBULK(min_valley) for power stage"]
[null,"Actual Input Capacitor Used",68,"uF",null,null,null,null,"Actual INPUT CAPACITOR used for design.  Actual value required for power stage calculations"]
[null,"Actual minimum bulk voltage",{"$f":"IF(Lookuptables!S58=Lookuptables!O58,Vbulk_valley,Lookuptables!S58)","v":175.0089283436705},"V",null,null,null,null,"Actual minimum bulk voltage resultant from selection of input capacitor value"]
{"$rows_left_out":176}
{"sheet":"QR Simulator","index":3,"n_rows":226,"n_cols":34,"rows_kept":226,"cut":false,"hidden":false,"merged":[[177,4,178,4],[52,6,58,11],[202,1,202,6],[177,1,178,1],[203,1,204,1],[85,1,86,1],[85,8,86,8],[134,4,135,4],[134,1,135,1],[7,27,8,27],[48,0,48,4],[0,0,0,11],[160,1,160,9],[117,1,117,9],[84,1,84,11],[52,3,52,4],[2,1,2,8],[3,0,3,10],[1,0,1,11],[5,6,6,11],[44,0,45,4]]}
["UCC28600 Analysis Spreadsheet"]
["TI Literature Number - SLVC104J - April 2017"]
[null,"Design Simulation - type in the blue data and it responds with the red data."]
["Note: The converter requirements and recommended component values have been carried over from the QR Designer Tool page and are shown in RED.  The USER MUST TYPE IN STANDARD COMPONENT VALUES IN THE BLUE CELLS FOR THE SIMULATOR TO GENERATE THE DESIGN SPECIFIC MODE CHARTS"]
[]
[null,null,null,null,null,null,"OPERATING MODE MAPS"]
["Converter Requirements:"]
["POUT",{"$f":"'QR Design Tool'!C10","v":84},"W",null,null,null,null,null,null,null,null,null,null,null,null,null,null,null,null,null,null,null,null,null,null,null,null,"PLOAD/PRATED","IP actual","fS actual"]
["RLOAD during SS",{"$f":"(B17^2)/B8","v":6.8571428571428568},"W",null,null,null,null,null,null,null,null,null,null,null,null,null,null,null,null,null,null,null,null,null,null,null,null,null,"A","Hz"]
["Efficiency ratio",{"$f":"'QR Design Tool'!C12","v":0.8},null,null,null,null,null,null,null,null,null,null,null,null,null,null,null,null,null,null,null,null,null,null,null,null,null,1,3.0763585567474365,72767.014180004393]
["PIN",{"$f":"'QR Design Tool'!C13","v":105},"W",null,null,null,null,null,null,null,null,null,null,null,null,null,null,null,null,null,null,null,null,null,null,null,null,0.95,2.9259185791015625,76420.098175164225]
["VAC(min)",{"$f":"'QR Design Tool'!C14","v":165},"VAC","VBULK(min_pk)",{"$f":"B12*SQRT(2)","v":233.34523779156069},"V",null,null,null,null,null,null,null,null,null,null,null,null,null,null,null,null,null,null,null,null,null,0.9,2.7754726409912109,80459.451457567411]
["VAC(max)",{"$f":"'QR Design Tool'!C15","v":550},"VAC","VBULK(min_valley)",{"$f":"'QR Design Tool'!C20","v":175.0089283436705},"V",null,null,null,null,null,null,null,null,null,null,null,null,null,null,null,null,null,null,null,null,null,0.85,2.6250209808349609,84949.69563204149]
["VBULK(ripple), %pp",{"$f":"'QR Design Tool'!C16","v":25},"%","VBULK(max_pk)",{"$f":"B13*SQRT(2)","v":777.81745930520231},"V",null,null,null,null,null,null,null,null,null,null,null,null,null,null,null,null,null,null,null,null,null,0.8,2.4745614528656006,89970.878135060018]
["VAC(max) shutdown margin %",{"$f":"'QR Design Tool'!C17","v":5},"%","VBULK(shutdown)",{"$f":"E14*(1+B15/100)","v":816.70833227046251},"V",null,null,null,null,null,null,null,null,null,null,null,null,null,null,null,null,null,null,null,null,null,0.75,2.3240931034088135,95623.06913416661]
["fS(min)",{"$f":"'QR Design Tool'!C21","v":80000},"Hz","TS(min)",{"$f":"1/B16","v":1.2500000000000001E-5},"s",null,null,null,null,null,null,null,null,null,null,null,null,null,null,null,null,null,null,null,null,null,0.7,2.1736140251159668,102033.2320875627]
["VOUT",{"$f":"'QR Design Tool'!C22","v":24},"V",null,null,null,null,null,null,null,null,null,null,null,null,null,null,null,null,null,null,null,null,null,null,null,null,0.65,2.0231220722198486,109364.81922249273]
["VOUT(ripple), max pp",{"$f":"'QR Design Tool'!C23","v":0.05},"V",null,null,null,null,null,null,null,null,null,null,null,null,null,null,null,null,null,null,null,null,null,null,null,null,0.6,1.872613787651062,117832.00736480177]
["VOUT, shut-down",{"$f":"'QR Design Tool'!C24","v":28},"V",null,null,null,null,null,null,null,null,null,null,null,null,null,null,null,null,null,null,null,null,null,null,null,null,0.55000000000000004,1.7220848798751831,127720.92099758335]
["Load step, Watts",{"$f":"'QR Design Tool'!C25","v":84},"W",null,null,null,null,null,null,null,null,null,null,null,null,null,null,null,null,null,null,null,null,null,null,null,null,0.5,1.6274871028515492,130000]
{"$rows_left_out":207}
{"sheet":"Magnetic Specification","index":4,"n_rows":58,"n_cols":7,"rows_kept":58,"cut":false,"hidden":false,"merged":[[37,0,37,5],[38,0,38,5],[39,0,39,5],[40,0,40,5],[56,0,56,5],[57,0,57,5],[41,0,41,5],[42,0,42,5],[43,0,54,5],[55,0,55,5],[36,0,36,5],[24,2,24,5],[25,0,25,5],[27,2,27,5],[28,2,28,5],[26,0,26,5],[29,2,29,5],[30,2,30,5],[31,2,31,5],[32,0,32,5],[34,0,34,5],[35,0,35,5],[0,0,0,5],[33,0,33,5],[4,1,4,5],[5,2,5,5],[7,2,7,5],[10,0,10,5],[2,0,2,5],[12,2,12,5],[13,2,13,5],[20,2,20,5],[1,0,1,5],[14,2,14,5],[15,2,15,5],[16,2,16,5],[6,2,6,5],[3,0,3,5],[11,0,11,5],[8,2,8,5],[22,2,22,5],[23,2,23,5],[17,2,17,5],[18,0,18,5],[19,0,19,5],[21,2,21,5]]}
["Flyback Inductor Specification for the UCC28600 Greenmode Quasi-Resonant Converter"]
["The flyback transformer plays a crucial role in the performance of the green mode controller.  Considerations must be given to adequate coupling for the bias windings,  minimizing leakage inductance, and minimizing audible noise.  All of these criteria can easily be met with proper transformer design from the start. "]
[]
["GENERAL:"]
["Topology:","Quasi-Resonant Flyback with Bias Winding"]
["Main Output Power:",{"$f":"'QR Design Tool'!C10","v":84},"W"]
["Anticipated Overall Efficiency of the Converter:",{"$f":"'QR Design Tool'!C12","v":0.8}]
["Maximum Switching Frequency, min input, max load:",{"$f":"'QR Design Tool'!C21","v":80000},"Hz at full load, min input"]
["Maximum Switching Frequency:",130000,"Hz, DCM mode"]
["Minimum Switching Frequency: ","Burst packets of 40kHz pulses at loads of 15% or less"]
[]
["INPUT:"]
["Minimum Input Voltage:",{"$f":"'QR Design Tool'!C20","v":175.0089283436705},"V"]
["Maximum Input Voltage:",{"$f":"'QR Design Tool'!F16","v":777.81745930520231},"V"]
["Peak PRIMARY Current:",{"$f":"'QR Simulator'!E113","v":2.7723629474639893},"A"]
["PRIMARY RMS Current:",{"$f":"'QR Simulator'!K113","v":1.0530377982197876},"A"]
["Duty Cycle at Minimum Input Voltage, Maximum Load:",{"$f":"'QR Simulator'!AE113","v":0.43282167700769264}]
["Duty Cycle at Maximum Input Voltage, Maximum Load:",{"$f":"'QR Simulator'!AE114","v":0.14630673233785232}]
[]
["OUTPUTS:"]
{"$rows_left_out":39}
{"sheet":"Lookuptables","index":5,"n_rows":98,"n_cols":20,"rows_kept":98,"cut":false,"hidden":true,"merged":[[1,4,1,5],[1,6,1,7],[5,1,6,1],[5,12,8,12],[7,1,8,1],[8,4,8,5],[46,4,46,5],[52,13,55,13],[9,1,10,1],[11,1,12,1],[19,13,22,13],[21,4,21,5],[30,13,33,13],[41,13,44,13]]}
[null,null,null,null,"Std. Resistors",null,null,null,null,"Capacitors"]
[null,null,null,null,"E6",null,"E96",null,null,"Cap value"]
[null,null,null,null,100,150,100,102]
[null,null,null,null,150,220,102,105]
[null,null,null,null,220,330,105,107,null,"C values up to 10nF"]
[null,"RCL",{"$f":"VLOOKUP(((10^(LOG(33.2*SQRT(0.54*Lp_initial2*10^6/Pin))-INT(LOG(33.2*SQRT(0.54*Lp_initial2*10^6/Pin))))*100)*0.95),E48_s:E48_f,1)*10^INT(LOG(33.2*SQRT(0.54*Lp_initial2*10^6/Pin)))/100","v":30.1},null,330,470,107,110,null,1,1.2,null,"CSNUB",{"$f":"((Lleak*10^-6)*Idrv^2)/(Vclamp*(Vclamp+(2*((Vout+0.7)*Nps+Vin_max))))*10^12","v":158.43765666045442},"pF"]
[null,null,{"$f":"IF(C6<24.9,24.9,IF(C6>100,100,C6))","v":30.1},null,470,680,110,113,null,1.2,1.5,null,null,{"$f":"(IF(N6<10000,N8*10^INT(LOG(N6)),N9*10^INT(LOG(N6))))","v":150},"pF"]
[null,"RMOT",{"$f":"(IF(FAULT=\"SHUTDOWN/RETRY\",((76*10^3)/(3.8*10^-6))*(Idrv*Lp*1.1*10^-6/(SQRT(2)*Vbrownout-Vinput_ripple)),((383*10^3)/(3.83*10^-6)*(Idrv*Lp*1.1*10^-6/Vbrownout-Vinput_ripple))))/10^3","v":89.502272922967208},null,680,1000,113,115,null,1.5,1.8,null,null,{"$f":"IF((10^(LOG(N6)-INT(LOG(N6))))-VLOOKUP((10^(LOG(N6)-INT(LOG(N6)))),c_s1:C_f1,1)<VLOOKUP((10^(LOG(N6)-INT(LOG(N6)))),c_s1:C_f1,2)-(10^(LOG(N6)-INT(LOG(N6)))),VLOOKUP((10^(LOG(N6)-INT(LOG(N6)))),c_s1:C_f1,1),VLOOKUP((10^(LOG(N6)-INT(LOG(N6)))),c_s1:C_f1,2))","v":1.5}]
[null,null,{"$f":"(IF((10^(LOG(C8)-INT(LOG(C8)))*100)-VLOOKUP((10^(LOG(C8)-INT(LOG(C8)))*100),E48_s:E48_f,1)<VLOOKUP((10^(LOG(C8)-INT(LOG(C8)))*100),E48_s:E48_f,2)-(10^(LOG(C8)-INT(LOG(C8)))*100),VLOOKUP((10^(LOG(C8)-INT(LOG(C8)))*100),E48_s:E48_f,1),VLOOKUP((10^(LOG(C8)-INT(LOG(C8)))*100),E48_s:E48_f,2)))*10^INT(LOG(C8))/100","v":90.9},null,"E12",null,115,118,null,1.8,2.2000000000000002,null,null,{"$f":"IF((10^(LOG(N6)-INT(LOG(N6))))-VLOOKUP((10^(LOG(N6)-INT(LOG(N6)))),C_s2:C_f2,1)<VLOOKUP((10^(LOG(N6)-INT(LOG(N6)))),C_s2:C_f2,2)-(10^(LOG(N6)-INT(LOG(N6)))),VLOOKUP((10^(LOG(N6)-INT(LOG(N6)))),C_s2:C_f2,1),VLOOKUP((10^(LOG(N6)-INT(LOG(N6)))),C_s2:C_f2,2))","v":1.5}]
[null,"RSNUB1",{"$f":"10/((Csnub*(10^-12))*(fswmax*10^3))/10^3","v":395.83333333333337},null,100,120,118,121,null,2.2000000000000002,2.7]
[null,null,{"$f":"(IF((10^(LOG(C10)-INT(LOG(C10)))*100)-VLOOKUP((10^(LOG(C10)-INT(LOG(C10)))*100),E48_s:E48_f,1)<VLOOKUP((10^(LOG(C10)-INT(LOG(C10)))*100),E48_s:E48_f,2)-(10^(LOG(C10)-INT(LOG(C10)))*100),VLOOKUP((10^(LOG(C10)-INT(LOG(C10)))*100),E48_s:E48_f,1),VLOOKUP((10^(LOG(C10)-INT(LOG(C10)))*100),E48_s:E48_f,2)))*10^INT(LOG(C10))/100","v":402},null,120,150,121,124,null,2.7,3.3]
[null,"RSNUB2",{"$f":"SQRT((Lleak*10^-6)/(Coss*10^-12))","v":666666666.66666663},null,150,180,124,127,null,3.3,3.9]
[null,null,{"$f":"(IF((10^(LOG(C12)-INT(LOG(C12)))*100)-VLOOKUP((10^(LOG(C12)-INT(LOG(C12)))*100),E48_s:E48_f,1)<VLOOKUP((10^(LOG(C12)-INT(LOG(C12)))*100),E48_s:E48_f,2)-(10^(LOG(C12)-INT(LOG(C12)))*100),VLOOKUP((10^(LOG(C12)-INT(LOG(C12)))*100),E48_s:E48_f,1),VLOOKUP((10^(LOG(C12)-INT(LOG(C12)))*100),E48_s:E48_f,2)))*10^INT(LOG(C12))/100","v":681000000},null,180,220,127,130,null,3.9,4.7]
[null,null,null,null,220,270,130,133,null,4.7,5.6]
[null,null,null,null,270,330,133,137,null,5.6,6.8]
[null,null,null,null,330,390,137,140,null,6.8,8.1999999999999993,null,"Cin_AC","t1",{"$f":"((1/47)/(2*PI()))*ASIN(Vbulk_valley/Vbulkmin)","v":2.8717717429508943E-3},"s"]
[null,null,null,null,390,470,140,143,null,8.1999999999999993,10,null,null,"t3",{"$f":"((1/47)/2)+O16","v":1.3510069615291319E-2},"s"]
[null,null,null,null,470,560,143,147,null,"C values greater than 10nF",null,null,null,"t2",{"$f":"((1/47)/4)","v":5.3191489361702126E-3},"s"]
[null,null,null,null,560,680,147,150,null,1,1.5,null,null,"tdischarge",{"$f":"O17-(O18)","v":8.1909206791211074E-3},"s"]
[null,null,null,null,680,820,150,154,null,1.5,2.2000000000000002,null,null,"Cin_0",{"$f":"((2*Pin_est*Lookuptables!O19)/((Vbulkmin^2)-(Vbulk_valley)^2))*10^12","v":72206463.287018001},"pF"]
{"$rows_left_out":79}
{"sheet":"Sheet1","index":6,"n_rows":0,"n_cols":0,"rows_kept":0,"cut":false,"hidden":false,"merged":[]}