{"text_format":"1","workbook":"xlsx","n_sheets":8,"sheets":["Custom_Material_Properties","DesignTool","ChartControls","Lists","parametric_table","DeviceComparison","Help_Page","About"],"not_rendered":{"charts":2,"images":17,"macros":1,"external_links":0,"defined_names":41,"comments":1,"pivot_tables":0},"unopened":[],"bounds":{"document_bytes":16777216,"sheet_cells":100000,"rows_first":2000,"rows_last":500,"rows_between":2000,"halvings":0,"cell_chars":16384,"cell_head_chars":4096},"cells_cut":0,"cells_raw":0,"read":"whole","date_system":"1900"}

{"sheet":"Custom_Material_Properties","index":0,"n_rows":14,"n_cols":5,"rows_kept":14,"cut":false,"hidden":true,"merged":[]}
["Material Name","Test the Power",null,"Folder Path","C:\\Users\\a0226740\\Desktop"]
["Relative µ_r (mu_x)",1,null,"FEMM Project Name","test"]
["Relative µ_z (mu_y)",1,null,"FEMM Accepted Folder Path","C:\\\\Users\\\\a0226740\\\\Desktop"]
["H_c",23.34432,null,"FEMM Accepted Project Path (.fem)","C:\\\\Users\\\\a0226740\\\\Desktop\\\\test.fem"]
["J",12.3423,null,"FEMM Accepted Project Path (.ans)","C:\\\\Users\\\\a0226740\\\\Desktop\\\\test.ans"]
["Cduct (Sigma)",12.222,null,"FEMM Accepted Project Path (.emf)","C:\\\\Users\\\\a0226740\\\\Desktop\\\\test.emf"]
["Lam thickness (Lam_d)",0,null,"FEMM Accepted Project Path (.bmp)","C:\\\\Users\\\\a0226740\\\\Desktop\\\\test.bmp"]
["Phi_hmax",0]
["Lam_fill",1]
["Lamtype",0]
{"$rows_left_out":5}
{"sheet":"DesignTool","index":1,"n_rows":1087,"n_cols":22,"rows_kept":1087,"cut":false,"hidden":false,"merged":[[45,5,45,9],[38,0,38,3],[36,5,36,9],[4,0,4,3],[9,0,9,3],[15,0,15,3],[33,0,33,3],[23,0,23,3],[44,5,44,9]]}
[]
[]
[null,null,null,"units"]
["Design Stage",16,"SubStage"]
["General Implementation",null,null,null,null,"Magnet Dimensions",null,null,null,null,null,null,null,null,null,null,null,null,null,null,{"$f":"IF(AND(OR(PartType=\"Omnipolar switch\",PartType=\"Unipolar switch\"),OR(Magnet_Movement=\"Head-On\",Magnet_Movement=\"Slide-By\")),\"d\",\nIF(AND(OR(PartType=\"Omnipolar switch\",PartType=\"Unipolar switch\"),Magnet_Movement=\"Hinge\"),\"a (degrees)\",\"\"))","v":"d"}]
["Magnet Movement","Slide-By",{"$f":"IF(AND(A6<>\"\", OR(Magnet_Movement=\"\",Magnet_Movement=\"Select Movement\")),\"Cue\",\"\")","v":""},null,null,null,null,null,null,null,null,null,null,null,null,null,null,null,null,{"$f":"IF(OR(PartType=\"Omnipolar switch\",PartType=\"Unipolar switch\"),\"BOP Typ\",\"\")","v":"BOP Typ"}]
["Magnet Shape","Cylinder",{"$f":"IF(AND(A7<>\"\", OR(Magnet_Shape=\"\",Magnet_Shape=\"Select Shape\")),\"Cue\",\"\")","v":""},null,null,null,null,null,null,null,null,null,null,null,null,null,null,null,null,{"$f":"IF(OR(PartType=\"Omnipolar switch\",PartType=\"Unipolar switch\"),\"BRP Typ\",\"\")","v":"BRP Typ"}]
["Magnet Orientation","South Facing DUT",{"$f":"IF(OR( Magnet_Orientation=\"\",Magnet_Orientation=\"Select Orientation\"),\"Cue\",\"\")","v":""},null,null,null,null,null,null,null,null,null,null,null,null,null,null,null,null,{"$f":"IF(OR(PartType=\"Omnipolar switch\",PartType=\"Unipolar switch\"),\"BOP Max\",\"\")","v":"BOP Max"}]
["Polarity",{"$f":"IF(Magnet_Orientation=\"North Facing DUT\", -1, IF(Magnet_Orientation=\"South Facing DUT\", 1, 0))","v":1},null,null,null,null,null,null,null,null,null,null,null,null,null,null,null,null,null,{"$f":"IF(OR(PartType=\"Omnipolar switch\",PartType=\"Unipolar switch\"),\"BRP Min\",\"\")","v":"BRP Min"}]
["Magnet Characteristics",null,null,null,null,"XZ-Plane Displacement Dimensions"]
{"$rows_left_out":1078}
{"sheet":"ChartControls","index":2,"n_rows":827,"n_cols":8,"rows_kept":827,"cut":false,"hidden":true,"merged":[[0,5,0,6],[11,5,11,6],[9,0,9,2]]}
[null,"Min","Max","step",null,"OUTPUT_CHART"]
["Vout",{"$f":"IF(OR(ChartControls!B44=\"Omnipolar Switch\", ChartControls!B44=\"Unipolar Switch\"),\nROUND(MIN(DesignTool!$L$67:$O$1087)-(MAX(DesignTool!$L$67:$O$1087)-MIN(DesignTool!$L$67:$O$1087))*0.1,1),\nROUND(MIN(DesignTool!$L$67:$M$1087)-(MAX(DesignTool!$L$67:$M$1087)-MIN(DesignTool!$L$67:$M$1087))*0.1,1))","v":0},{"$f":"ROUND(MAX(DesignTool!$L$67:$O$1087)*1.1,1)","v":0},{"$f":"(C2-B2)/1020","v":0},null,"Value Axis =>",{"$f":"IF(Processing=1,\"\",setChartAxis(\"DesignTool\",\"OUTPUT_CHART\",\"Min\",\"Value\",\"Primary\",B2))","v":"Value Primary Min: 0"}]
["Bvals",{"$f":"MIN(MIN(DesignTool!F67:H1087),MIN(DesignTool!X67:Y1087))","v":-177.11771747411765},{"$f":"MAX(MAX(DesignTool!F67:H1087),MAX(DesignTool!X67:Y1087))","v":319.7791729416054},null,null,"Value Axis =>",{"$f":"IF(Processing=1,\"\",setChartAxis(\"DesignTool\",\"OUTPUT_CHART\",\"Max\",\"Value\",\"Primary\",C2))","v":"Value Primary Max: 0"}]
["Bchart",{"$f":"ROUND(B3-(C3-B3)*0.1,2)","v":-226.81},{"$f":"ROUND(C3+(C3-B3)*0.1,2)","v":369.47},null,null,"Secondary Value Axis =>",{"$f":"IF(Processing=1,\"\",setChartAxis(\"Sheet2\",\"Chart 2\",\"Min\",\"Value\",\"Secondary\",#REF!))","v":{"$error":"#VALUE!"}}]
["dz",{"$f":"ROUND(MIN(DesignTool!D67:D1087),1)","v":0},{"$f":"ROUND(MAX(DesignTool!D67:D1087),1)","v":0},null,null,"Secondary Value Axis =>",{"$f":"IF(Processing=1,\"\",setChartAxis(\"Sheet2\",\"Chart 2\",\"Max\",\"Value\",\"Secondary\",#REF!))","v":{"$error":"#VALUE!"}}]
["dx",{"$f":"ROUND(MIN(DesignTool!A67:A1087)-0.04,1)","v":2},{"$f":"ROUND(MAX(DesignTool!A67:A1087)+0.05,1)","v":2.1},null,null,"Category Axis =>",{"$f":"IF(Processing=1,\"\",setChartAxis(\"DesignTool\",\"OUTPUT_CHART\",\"Min\",\"Category\",\"Primary\",IF(Magnet_Movement=\"Head-On\",B5,IF(Magnet_Movement=\"Slide-By\",B6,B8))))","v":"Category Primary Min: 2"}]
["dy",null,null,null,null,"Category Axis =>",{"$f":"IF(Processing=1,\"\",setChartAxis(\"DesignTool\",\"OUTPUT_CHART\",\"Max\",\"Category\",\"Primary\",IF(Magnet_Movement=\"Head-On\",C5,IF(Magnet_Movement=\"Slide-By\",C6,C8))))","v":"Category Primary Max: 2.1"}]
["angle",{"$f":"ROUND(MIN(DesignTool!I67:I1087),1)","v":0},{"$f":"ROUND(MAX(DesignTool!I67:I1087),1)","v":0},null,null,"Secondary Category Axis =>",{"$f":"IF(Processing=1,\"\",setChartAxis(\"Sheet2\",\"Chart 2\",\"Min\",\"Category\",\"Secondary\",#REF!))","v":{"$error":"#VALUE!"}}]
[null,null,null,null,null,"Secondary Category Axis =>",{"$f":"IF(Processing=1,\"\",setChartAxis(\"Sheet2\",\"Chart 2\",\"Max\",\"Category\",\"Secondary\",#REF!))","v":{"$error":"#VALUE!"}}]
["Switch and Latch Markers"]
{"$rows_left_out":818}
{"sheet":"Lists","index":3,"n_rows":200,"n_cols":21,"rows_kept":200,"cut":false,"hidden":true,"merged":[]}
[null,null,null,"Device Type",null,"Device Check","VCC Filter","Relevant Devices",null,"Packages",null,"Magnet Movement",null,"Magnet Shape",null,"Magnet Orientation",null,"Magnet Material","Br (G)",null,"units"]
[null,null,null,"Omnipolar switch",null,{"$f":"IF(DesignTool!$B$40=parametric_table!D2,parametric_table!A2,\"0\")","v":"0"},{"$f":"_xlfn.IFNA(IF(VLOOKUP(F2,ParametricTableRange,MATCH(\"Operating Region Used\",parametric_table!$A$1:$AV$1,0),FALSE)>0,F2,\"0\"),\"0\")","v":"0"},{"$f":"IF(ROWS(H$2:H2)>COUNTIF(G$2:G200,\"<>0\"),\"\",IF(ISERROR(INDEX(G$2:G200,SMALL(IF(G$2:G200<>\"0\",ROW(G$2:G200)-ROW(G$2)+1),ROWS(H$2:H2)))),\"\",IF(INDEX(G$2:G200,SMALL(IF(G$2:G200<>\"0\",ROW(G$2:G200)-ROW(G$2)+1),ROWS(H$2:H2)))=0,\"\",INDEX(G$2:G200,SMALL(IF(G$2:G200<>\"0\",ROW(G$2:G200)-ROW(G$2)+1),ROWS(H$2:H2))))))","v":"TMAG5124A"},null,null,null,"Head-On",null,"Block",null,"North Facing DUT",null,"SmCo18(1:5)",8750,null,"mm"]
[null,null,null,"Unipolar switch",null,{"$f":"IF(DesignTool!$B$40=parametric_table!D3,parametric_table!A3,\"0\")","v":"0"},{"$f":"_xlfn.IFNA(IF(VLOOKUP(F3,ParametricTableRange,MATCH(\"Operating Region Used\",parametric_table!$A$1:$AV$1,0),FALSE)>0,F3,\"0\"),\"0\")","v":"0"},{"$f":"IF(ROWS(H$2:H3)>COUNTIF(G$2:G201,\"<>0\"),\"\",IF(ISERROR(INDEX(G$2:G201,SMALL(IF(G$2:G201<>\"0\",ROW(G$2:G201)-ROW(G$2)+1),ROWS(H$2:H3)))),\"\",IF(INDEX(G$2:G201,SMALL(IF(G$2:G201<>\"0\",ROW(G$2:G201)-ROW(G$2)+1),ROWS(H$2:H3)))=0,\"\",INDEX(G$2:G201,SMALL(IF(G$2:G201<>\"0\",ROW(G$2:G201)-ROW(G$2)+1),ROWS(H$2:H3))))))","v":"TMAG5124B"},null,null,null,"Hinge",null,"Cylinder",null,"South Facing DUT",null,"SmCo20(1:5)",9200,null,"in."]
[null,null,null,"Latch",null,{"$f":"IF(DesignTool!$B$40=parametric_table!D4,parametric_table!A4,\"0\")","v":"0"},{"$f":"_xlfn.IFNA(IF(VLOOKUP(F4,ParametricTableRange,MATCH(\"Operating Region Used\",parametric_table!$A$1:$AV$1,0),FALSE)>0,F4,\"0\"),\"0\")","v":"0"},{"$f":"IF(ROWS(H$2:H4)>COUNTIF(G$2:G202,\"<>0\"),\"\",IF(ISERROR(INDEX(G$2:G202,SMALL(IF(G$2:G202<>\"0\",ROW(G$2:G202)-ROW(G$2)+1),ROWS(H$2:H4)))),\"\",IF(INDEX(G$2:G202,SMALL(IF(G$2:G202<>\"0\",ROW(G$2:G202)-ROW(G$2)+1),ROWS(H$2:H4)))=0,\"\",INDEX(G$2:G202,SMALL(IF(G$2:G202<>\"0\",ROW(G$2:G202)-ROW(G$2)+1),ROWS(H$2:H4))))))","v":"TMAG5124C"},null,null,null,"Slide-By",null,"Sphere",null,"NS Facing DUT",null,"SmCo22(1:5)",9400]
[null,null,null,"Ratiometric PWM output",null,{"$f":"IF(DesignTool!$B$40=parametric_table!D5,parametric_table!A5,\"0\")","v":"0"},{"$f":"_xlfn.IFNA(IF(VLOOKUP(F5,ParametricTableRange,MATCH(\"Operating Region Used\",parametric_table!$A$1:$AV$1,0),FALSE)>0,F5,\"0\"),\"0\")","v":"0"},{"$f":"IF(ROWS(H$2:H5)>COUNTIF(G$2:G203,\"<>0\"),\"\",IF(ISERROR(INDEX(G$2:G203,SMALL(IF(G$2:G203<>\"0\",ROW(G$2:G203)-ROW(G$2)+1),ROWS(H$2:H5)))),\"\",IF(INDEX(G$2:G203,SMALL(IF(G$2:G203<>\"0\",ROW(G$2:G203)-ROW(G$2)+1),ROWS(H$2:H5)))=0,\"\",INDEX(G$2:G203,SMALL(IF(G$2:G203<>\"0\",ROW(G$2:G203)-ROW(G$2)+1),ROWS(H$2:H5))))))","v":"TMAG5124D"},null,null,null,null,null,null,null,"SN Facing DUT",null,"SmCo24(1:5)",9800]
[null,null,null,"Ratiometric unipolar",null,{"$f":"IF(DesignTool!$B$40=parametric_table!D6,parametric_table!A6,\"0\")","v":"0"},{"$f":"_xlfn.IFNA(IF(VLOOKUP(F6,ParametricTableRange,MATCH(\"Operating Region Used\",parametric_table!$A$1:$AV$1,0),FALSE)>0,F6,\"0\"),\"0\")","v":"0"},{"$f":"IF(ROWS(H$2:H6)>COUNTIF(G$2:G204,\"<>0\"),\"\",IF(ISERROR(INDEX(G$2:G204,SMALL(IF(G$2:G204<>\"0\",ROW(G$2:G204)-ROW(G$2)+1),ROWS(H$2:H6)))),\"\",IF(INDEX(G$2:G204,SMALL(IF(G$2:G204<>\"0\",ROW(G$2:G204)-ROW(G$2)+1),ROWS(H$2:H6)))=0,\"\",INDEX(G$2:G204,SMALL(IF(G$2:G204<>\"0\",ROW(G$2:G204)-ROW(G$2)+1),ROWS(H$2:H6))))))","v":"TMAG5124E"},null,null,null,null,null,null,null,{"$f":"IF(OR(Magnet_Shape=\"Cylinder\",Magnet_Shape=\"Sphere\"),\"\",\"NS 2 Facing DUT\")","v":""},null,"SmCo24",9850]
[null,null,null,"Ratiometric bipolar",null,{"$f":"IF(DesignTool!$B$40=parametric_table!D7,parametric_table!A7,\"0\")","v":"0"},{"$f":"_xlfn.IFNA(IF(VLOOKUP(F7,ParametricTableRange,MATCH(\"Operating Region Used\",parametric_table!$A$1:$AV$1,0),FALSE)>0,F7,\"0\"),\"0\")","v":"0"},{"$f":"IF(ROWS(H$2:H7)>COUNTIF(G$2:G205,\"<>0\"),\"\",IF(ISERROR(INDEX(G$2:G205,SMALL(IF(G$2:G205<>\"0\",ROW(G$2:G205)-ROW(G$2)+1),ROWS(H$2:H7)))),\"\",IF(INDEX(G$2:G205,SMALL(IF(G$2:G205<>\"0\",ROW(G$2:G205)-ROW(G$2)+1),ROWS(H$2:H7)))=0,\"\",INDEX(G$2:G205,SMALL(IF(G$2:G205<>\"0\",ROW(G$2:G205)-ROW(G$2)+1),ROWS(H$2:H7))))))","v":"TMAG5124F"},null,null,null,null,null,null,null,{"$f":"IF(OR(Magnet_Shape=\"Cylinder\",Magnet_Shape=\"Sphere\"),\"\",\"SN 2 Facing DUT\")","v":""},null,"SmCo26",10350]
[null,null,null,"Bipolar",null,{"$f":"IF(DesignTool!$B$40=parametric_table!D8,parametric_table!A8,\"0\")","v":"0"},{"$f":"_xlfn.IFNA(IF(VLOOKUP(F8,ParametricTableRange,MATCH(\"Operating Region Used\",parametric_table!$A$1:$AV$1,0),FALSE)>0,F8,\"0\"),\"0\")","v":"0"},{"$f":"IF(ROWS(H$2:H8)>COUNTIF(G$2:G206,\"<>0\"),\"\",IF(ISERROR(INDEX(G$2:G206,SMALL(IF(G$2:G206<>\"0\",ROW(G$2:G206)-ROW(G$2)+1),ROWS(H$2:H8)))),\"\",IF(INDEX(G$2:G206,SMALL(IF(G$2:G206<>\"0\",ROW(G$2:G206)-ROW(G$2)+1),ROWS(H$2:H8)))=0,\"\",INDEX(G$2:G206,SMALL(IF(G$2:G206<>\"0\",ROW(G$2:G206)-ROW(G$2)+1),ROWS(H$2:H8))))))","v":"TMAG5124G"},null,null,null,null,null,null,null,null,null,"SmCo28",10550]
[null,null,null,"3-Axis linear",null,{"$f":"IF(DesignTool!$B$40=parametric_table!D9,parametric_table!A9,\"0\")","v":"0"},{"$f":"_xlfn.IFNA(IF(VLOOKUP(F9,ParametricTableRange,MATCH(\"Operating Region Used\",parametric_table!$A$1:$AV$1,0),FALSE)>0,F9,\"0\"),\"0\")","v":"0"},{"$f":"IF(ROWS(H$2:H9)>COUNTIF(G$2:G207,\"<>0\"),\"\",IF(ISERROR(INDEX(G$2:G207,SMALL(IF(G$2:G207<>\"0\",ROW(G$2:G207)-ROW(G$2)+1),ROWS(H$2:H9)))),\"\",IF(INDEX(G$2:G207,SMALL(IF(G$2:G207<>\"0\",ROW(G$2:G207)-ROW(G$2)+1),ROWS(H$2:H9)))=0,\"\",INDEX(G$2:G207,SMALL(IF(G$2:G207<>\"0\",ROW(G$2:G207)-ROW(G$2)+1),ROWS(H$2:H9))))))","v":"TMAG5124H"},null,null,null,null,null,null,null,null,null,"SmCo30",10900]
[null,null,null,null,null,{"$f":"IF(DesignTool!$B$40=parametric_table!D10,parametric_table!A10,\"0\")","v":"0"},{"$f":"_xlfn.IFNA(IF(VLOOKUP(F10,ParametricTableRange,MATCH(\"Operating Region Used\",parametric_table!$A$1:$AV$1,0),FALSE)>0,F10,\"0\"),\"0\")","v":"0"},{"$f":"IF(ROWS(H$2:H10)>COUNTIF(G$2:G208,\"<>0\"),\"\",IF(ISERROR(INDEX(G$2:G208,SMALL(IF(G$2:G208<>\"0\",ROW(G$2:G208)-ROW(G$2)+1),ROWS(H$2:H10)))),\"\",IF(INDEX(G$2:G208,SMALL(IF(G$2:G208<>\"0\",ROW(G$2:G208)-ROW(G$2)+1),ROWS(H$2:H10)))=0,\"\",INDEX(G$2:G208,SMALL(IF(G$2:G208<>\"0\",ROW(G$2:G208)-ROW(G$2)+1),ROWS(H$2:H10))))))","v":"DRV5021A1"},null,null,null,null,null,null,null,null,null,"SmCo32",11150]
{"$rows_left_out":191}
{"sheet":"parametric_table","index":4,"n_rows":108,"n_cols":53,"rows_kept":108,"cut":false,"hidden":true,"merged":[]}
["Part number","Datasheet","Description","Type","Auto Qual (Y/N)","X-Sensor Loc (mm)","X-tolerance (mm)","Y-Sensor Loc (mm)","Y-tolerance (mm)","Z-Sensor Loc (mm)","Z-tolerance (mm)","Supply Min (V)","Supply Max (V)","Operating Regions","Operating Region Used","ICC Min","ICC Typ (mA)","ICC Max (mA)","Sensitivity Min (mV/mT)","Sensitivity Typ (mV/mT)","Sensitivity Max (mV/mT)","Sensitivity (%D/mT)","Tolerance","Noise peak to peak (mT)","BL min","BL max","VQ (V)","VLmin-GND (V)","VCC-VLmax (V)","Vout Min (V)","Vout Max (V)","BOP Min (mT)","BOP Typ (mT)","BOP Max (mT)","BRP Min (mT)","BRP Typ (mT)","BRP Max (mT)","Bhys Min (mT)","Bhys Typ (mT)","Bhys Max (mT)","Active State","Sensor Axis","Package Group","Package size: mm2:W x L (PKG)","HBM (V)","CDM (V)","Op temp range (C)","Approx. price (USD)","Within B Range"]
["TMAG5111A2","DS","2-dimensional, dual-channel, high-sensitivity, speed and direction outputs, Hall-effect latch","2D Latch","N",null,null,null,null,null,null,2.5,38,{"$f":"LEN(M2)-LEN(SUBSTITUTE(M2,\";\",\"\"))+1","v":1},1,null,6,8,null,null,null,null,null,null,null,null,null,null,0,null,{"$f":"VSUPPLY-AC2","v":3.3},0.2,1.4,2.6,-2.6,-1.4,-0.2,0.9,null,4.5999999999999996,null,"2, 3, 6","SOT-23|5","5 mm2: 1.6 x 2.9 (SOT-23|5)",2000,500,"-40 to 125","$0.330 | 1ku",null,null,null,null,{"$f":"COUNTIF(AW2:AW21, \"below\")","v":2}]
["TMAG5111A4","DS","2-dimensional, dual-channel, high-sensitivity, speed and direction outputs, Hall-effect latch","2D Latch","N",null,null,null,null,null,null,2.5,38,{"$f":"LEN(M3)-LEN(SUBSTITUTE(M3,\";\",\"\"))+1","v":1},1,null,6,8,null,null,null,null,null,null,null,null,null,null,0,null,3.3,null,3,2.6,-2.6,-1.4,-0.2,0.9,null,4.5999999999999996,null,"2, 3, 6","SOT-23|5","5 mm2: 1.6 x 2.9 (SOT-23|5)",2000,500,"-40 to 125","$0.330 | 1ku","below"]
["TMAG5111B2","DS","2-dimensional, dual-channel, high-sensitivity, speed and direction outputs, Hall-effect latch","2D Latch","N",null,null,null,null,null,null,2.5,38,1,1,null,6,8,null,null,null,null,null,null,null,null,null,null,0,null,3.3,0.2,1.4,2.6,-2.6,-1.4,-0.2,0.9,null,4.5999999999999996,null,"2, 3, 6","SOT-23|5","5 mm2: 1.6 x 2.9 (SOT-23|5)",2000,500,"-40 to 125","$0.330 | 1ku","below"]
["TMAG5111B4","DS","2-dimensional, dual-channel, high-sensitivity, speed and direction outputs, Hall-effect latch","2D Latch","N",null,null,null,null,null,null,2.5,38,1,1,null,6,8,null,null,null,null,null,null,null,null,null,null,0,null,3.3,null,3,2.6,-2.6,-1.4,-0.2,0.9,null,4.5999999999999996,null,"2, 3, 6","SOT-23|5","5 mm2: 1.6 x 2.9 (SOT-23|5)",2000,500,"-40 to 125","$0.330 | 1ku"]
["TMAG5111C2","DS","2-dimensional, dual-channel, high-sensitivity, speed and direction outputs, Hall-effect latch","2D Latch","N",null,null,null,null,null,null,2.5,38,1,1,null,6,8,null,null,null,null,null,null,null,null,null,null,0,null,3.3,0.2,1.4,2.6,-2.6,-1.4,-0.2,0.9,null,4.5999999999999996,null,"2, 3, 6","SOT-23|5","5 mm2: 1.6 x 2.9 (SOT-23|5)",2000,500,"-40 to 125","$0.330 | 1ku"]
["TMAG5111C4","DS","2-dimensional, dual-channel, high-sensitivity, speed and direction outputs, Hall-effect latch","2D Latch","N",null,null,null,null,null,null,2.5,38,1,1,null,6,8,null,null,null,null,null,null,null,null,null,null,0,null,3.3,null,3,2.6,-2.6,-1.4,-0.2,0.9,null,4.5999999999999996,null,"2, 3, 6","SOT-23|5","5 mm2: 1.6 x 2.9 (SOT-23|5)",2000,500,"-40 to 125","$0.330 | 1ku"]
["TMAG5110A2","DS","2-dimensional, dual-channel, high-sensitivity, Hall-effect latch","2D Latch","N",null,null,null,null,null,null,2.5,38,1,1,null,6,8,null,null,null,null,null,null,null,null,null,null,0,null,3.3,0.2,1.4,2.6,-2.6,-1.4,-0.2,0.9,null,4.5999999999999996,null,2,"SOT-23|5","5 mm2: 1.6 x 2.9 (SOT-23|5)",2000,500,"-40 to 125","$0.330 | 1ku"]
["TMAG5110A4","DS","2-dimensional, dual-channel, high-sensitivity, Hall-effect latch","2D Latch","N",null,null,null,null,null,null,2.5,38,1,1,null,6,8,null,null,null,null,null,null,null,null,null,null,0,null,3.3,null,3,2.6,-2.6,-1.4,-0.2,0.9,null,4.5999999999999996,null,2,"SOT-23|5","5 mm2: 1.6 x 2.9 (SOT-23|5)",2000,500,"-40 to 125","$0.330 | 1ku"]
["TMAG5110B2","DS","2-dimensional, dual-channel, high-sensitivity, Hall-effect latch","2D Latch","N",null,null,null,null,null,null,2.5,38,1,1,null,6,8,null,null,null,null,null,null,null,null,null,null,0,null,3.3,0.2,1.4,2.6,-2.6,-1.4,-0.2,0.9,null,4.5999999999999996,null,2,"SOT-23|5","5 mm2: 1.6 x 2.9 (SOT-23|5)",2000,500,"-40 to 125","$0.330 | 1ku"]
{"$rows_left_out":99}
{"sheet":"DeviceComparison","index":5,"n_rows":1022,"n_cols":7,"rows_kept":1022,"cut":false,"hidden":true,"merged":[]}
["dx","dy","dz","Bx","By","Bz","angle"]
[0,0,3.4700000000000006,0,0,123.5621260890063,123.5621260890063]
[0,0,3.4964705882352947,0,0,122.18841032411521,122.18841032411521]
[0,0,3.5229411764705887,0,0,120.8146945592237,120.8146945592237]
[0,0,3.5494117647058827,0,0,119.44097879433261,119.44097879433261]
[0,0,3.5758823529411767,0,0,118.06726302944099,118.06726302944099]
[0,0,3.6023529411764708,0,0,116.69354726455001,116.69354726455001]
[0,0,3.6288235294117648,0,0,115.31983149965889,115.31983149965889]
[0,0,3.6552941176470588,0,0,113.9461157347673,113.9461157347673]
[0,0,3.6817647058823528,0,0,112.5723999698763,112.5723999698763]
{"$rows_left_out":1013}
{"sheet":"Help_Page","index":6,"n_rows":168,"n_cols":5,"rows_kept":168,"cut":false,"hidden":false,"merged":[[0,4,0,6],[5,1,5,8],[98,1,98,8],[69,1,69,8],[70,1,70,8],[71,1,71,8],[85,1,85,8],[86,1,86,8],[167,1,167,9],[144,1,144,8],[103,1,103,8],[2,0,2,8],[3,1,3,8],[146,1,146,9],[147,1,147,9]]}
[null,null,null,null,"Help Page"]
[]
[]
[null,"This Hall Effect Sensor Proximity tool is designed to assist with quick preliminary calculations for determing Hall and magnet sensor placement.  While intended to assist in design, it is not expected serve as a replacement to bench verification. Please exercise due diligence in verifying your setup and final design on the bench."]
[]
[null,"\nThis tool is composed of six general design stages listed below.  First pass design requires the user complete each stage sequentially."]
[null,"1-","General Implementation"]
[null,"2-","Magnet Characteristics"]
[null,"3-","Displacement Dimensions"]
[null,"4-","Sensor Operation Conditions"]
{"$rows_left_out":159}
{"sheet":"About","index":7,"n_rows":6,"n_cols":19,"rows_kept":6,"cut":false,"hidden":false,"merged":[[0,0,0,16383],[4,9,4,15],[5,9,5,15]]}
[]
[]
[null,"Version Number","1.0"]
[null,null,null,null,null,null,null,null,"Version History",null,null,null,null,null,null,null,null,null,"Relevant Citations"]
[null,null,null,null,null,null,null,null,"Version","Change List Description",null,null,null,null,null,null,null,null,"For Block Magnet Equation, see Andreev, Andrew. Universal Method for the Calculation of Magnetic Microelectronic Components: the saturated ferromagnetic Rectangular Prism and the Rectangular Coil located at IEEE"]
[null,null,null,null,null,null,null,null,"1.0","Initial Release"]