{"text_format":"1","workbook":"xlsx","n_sheets":8,"sheets":["Custom_Material_Properties","DesignTool","ChartControls","Lists","parametric_table","DeviceComparison","Help_Page","About"],"not_rendered":{"charts":2,"images":17,"macros":1,"external_links":0,"defined_names":41,"comments":1,"pivot_tables":0},"unopened":[],"bounds":{"document_bytes":16777216,"sheet_cells":100000,"rows_first":2000,"rows_last":500,"rows_between":2000,"halvings":0,"cell_chars":16384,"cell_head_chars":4096},"cells_cut":0,"cells_raw":0,"read":"whole","date_system":"1900"}

{"sheet":"Custom_Material_Properties","index":0,"n_rows":14,"n_cols":5,"rows_kept":14,"cut":false,"hidden":true,"merged":[]}
["Material Name","Test the Power",null,"Folder Path","C:\\Users\\a0226740\\Desktop"]
["Relative µ_r (mu_x)",1,null,"FEMM Project Name","test"]
["Relative µ_z (mu_y)",1,null,"FEMM Accepted Folder Path","C:\\\\Users\\\\a0226740\\\\Desktop"]
["H_c",23.34432,null,"FEMM Accepted Project Path (.fem)","C:\\\\Users\\\\a0226740\\\\Desktop\\\\test.fem"]
["J",12.3423,null,"FEMM Accepted Project Path (.ans)","C:\\\\Users\\\\a0226740\\\\Desktop\\\\test.ans"]
["Cduct (Sigma)",12.222,null,"FEMM Accepted Project Path (.emf)","C:\\\\Users\\\\a0226740\\\\Desktop\\\\test.emf"]
["Lam thickness (Lam_d)",0,null,"FEMM Accepted Project Path (.bmp)","C:\\\\Users\\\\a0226740\\\\Desktop\\\\test.bmp"]
["Phi_hmax",0]
["Lam_fill",1]
["Lamtype",0]
["Phi_hr (Phi_hx)",0]
["Phi_hz (Phi_hy)",0]
["Number of Strands (NStrands)",0]
["Strand dia (WireD)",0]

{"sheet":"DesignTool","index":1,"n_rows":1087,"n_cols":22,"rows_kept":1087,"cut":false,"hidden":false,"merged":[[45,5,45,9],[38,0,38,3],[36,5,36,9],[4,0,4,3],[9,0,9,3],[15,0,15,3],[33,0,33,3],[23,0,23,3],[44,5,44,9]]}
[]
[]
[null,null,null,"units"]
["Design Stage",16,"SubStage"]
["General Implementation",null,null,null,null,"Magnet Dimensions",null,null,null,null,null,null,null,null,null,null,null,null,null,null,{"$f":"IF(AND(OR(PartType=\"Omnipolar switch\",PartType=\"Unipolar switch\"),OR(Magnet_Movement=\"Head-On\",Magnet_Movement=\"Slide-By\")),\"d\",\nIF(AND(OR(PartType=\"Omnipolar switch\",PartType=\"Unipolar switch\"),Magnet_Movement=\"Hinge\"),\"a (degrees)\",\"\"))","v":"d"}]
["Magnet Movement","Slide-By",{"$f":"IF(AND(A6<>\"\", OR(Magnet_Movement=\"\",Magnet_Movement=\"Select Movement\")),\"Cue\",\"\")","v":""},null,null,null,null,null,null,null,null,null,null,null,null,null,null,null,null,{"$f":"IF(OR(PartType=\"Omnipolar switch\",PartType=\"Unipolar switch\"),\"BOP Typ\",\"\")","v":"BOP Typ"}]
["Magnet Shape","Cylinder",{"$f":"IF(AND(A7<>\"\", OR(Magnet_Shape=\"\",Magnet_Shape=\"Select Shape\")),\"Cue\",\"\")","v":""},null,null,null,null,null,null,null,null,null,null,null,null,null,null,null,null,{"$f":"IF(OR(PartType=\"Omnipolar switch\",PartType=\"Unipolar switch\"),\"BRP Typ\",\"\")","v":"BRP Typ"}]
["Magnet Orientation","South Facing DUT",{"$f":"IF(OR( Magnet_Orientation=\"\",Magnet_Orientation=\"Select Orientation\"),\"Cue\",\"\")","v":""},null,null,null,null,null,null,null,null,null,null,null,null,null,null,null,null,{"$f":"IF(OR(PartType=\"Omnipolar switch\",PartType=\"Unipolar switch\"),\"BOP Max\",\"\")","v":"BOP Max"}]
["Polarity",{"$f":"IF(Magnet_Orientation=\"North Facing DUT\", -1, IF(Magnet_Orientation=\"South Facing DUT\", 1, 0))","v":1},null,null,null,null,null,null,null,null,null,null,null,null,null,null,null,null,null,{"$f":"IF(OR(PartType=\"Omnipolar switch\",PartType=\"Unipolar switch\"),\"BRP Min\",\"\")","v":"BRP Min"}]
["Magnet Characteristics",null,null,null,null,"XZ-Plane Displacement Dimensions"]
[{"$f":"IF(Magnet_Shape=\"BLOCK\",\"L \",IF(Magnet_Shape=\"Ring\",\"Ri\",IF(Magnet_Shape=\"Cylinder\",\"\",\"\")))","v":""},null,{"$f":"IF(AND(A11<>\"\", OR(L=\"\",L=\"Enter Length\",ISNUMBER(L)=FALSE)),\"Cue\",\"\")","v":""}]
[{"$f":"IF(Magnet_Shape=\"BLOCK\",\"W\",IF(OR(Magnet_Shape=\"CYLINDER\",Magnet_Shape=\"Sphere\",Magnet_Shape=\"Ring\"),\"R\",\"\"))","v":"R"},1.55,{"$f":"IF(AND(A12<>\"\", OR(W=\"\",W=\"Enter Width\", W=\"Enter Radius\", ISNUMBER(W)=FALSE)),\"Cue\",\"\")","v":""},"mm"]
[{"$f":"IF(OR(Magnet_Shape=\"Select Shape\",Magnet_Shape=\"Sphere\",Magnet_Shape=\"\"),\"\",\"T\")","v":"T"},6,{"$f":"IF(AND(A13<>\"\", OR(D=\"\",D=\"Enter Thickness\", ISNUMBER(D)=FALSE)),\"Cue\",\"\")","v":""},"mm"]
["Magnet Material","N35",{"$f":"IF(AND(A14<>\"\", OR(Magnet_Material=\"\",Magnet_Material=\"Choose Material\")),\"Cue\",\"\")","v":""}]
["Br (Remanence)",{"$f":"IFERROR(IF(Magnet_Material=\"Custom\",\"Enter value\", VLOOKUP(Magnet_Material,Mag_Material_List,2,FALSE)),\"\")","v":12000},{"$f":"IF(Magnet_Material=\"Custom\",\"Cue\",\"\")","v":""},"G"]
["Displacement Dimensions"]
[{"$f":"IF(Magnet_Movement=\"Select Movement\",\"\",IF(OR(Magnet_Movement=\"Head-On\",Magnet_Movement=\"Slide-By\"),\"d1\",IF(Magnet_Movement=\"Hinge\",\"a1\")))","v":"d1"},2.0499999999999998,{"$f":"IF(AND(A17<>\"\", OR(d1MIN=\"\",d1MIN=\"Enter displacement\", ISNUMBER(d1MIN)=FALSE)),\"Cue\",\"\")","v":""},{"$f":"IF(A17=\"d1\",\"mm\",IF(A17=\"a1\",\"degrees\",\"\"))","v":"mm"}]
[{"$f":"IF(Magnet_Movement=\"Select Movement\",\"\",IF(OR(Magnet_Movement=\"Head-On\",Magnet_Movement=\"Slide-By\"),\"d2\",IF(Magnet_Movement=\"Hinge\",\"a2\")))","v":"d2"},2.0499999999999998,{"$f":"IF(AND(A18<>\"\", OR(d2MAX=\"\",d2MAX=\"Enter displacement\",ISNUMBER(d2MAX)=FALSE)),\"Cue\",\"\")","v":""},{"$f":"IF(A18=\"d2\",\"mm\",IF(A18=\"a2\",\"degrees\",\"\"))","v":"mm"}]
[{"$f":"IF(AND(Magnet_Movement<>\"Slide-By\",Magnet_Movement<>\"\"),\"X-Offset\",\"\")","v":""},null,{"$f":"IF(AND(A19<>\"\", OR(d3Text=\"\",d3Text=\"Enter Offset\",ISNUMBER(d3Text)=FALSE)),\"Cue\",\"\")","v":""}]
[{"$f":"IF(Magnet_Movement<>\"\",\"Y-Offset\",\"\")","v":"Y-Offset"},1,{"$f":"IF(AND(A20<>\"\", OR(YOffs=\"\",YOffs=\"Enter Offset\",ISNUMBER(YOffs)=FALSE)),\"Cue\",\"\")","v":""},"mm"]
[{"$f":"IF(AND(Magnet_Movement<>\"Head-On\",Magnet_Movement<>\"\"), \"Sensor Z-Offset\", \"\")","v":"Sensor Z-Offset"},0,{"$f":"IF(AND(A21<>\"\", OR(Sensor_ZOffs=\"\",Sensor_ZOffs=\"Enter Offset\",ISNUMBER(Sensor_ZOffs)=FALSE)),\"Cue\",\"\")","v":""},"mm",null,null,null,null,null,null,null,"DRV5021A1"]
[{"$f":"IF(Magnet_Movement=\"Hinge\", \"Magnet Z-Offset\", \"\")","v":""},null,{"$f":"IF(AND(A22<>\"\", OR(Mag_ZOffs=\"\",Mag_ZOffs=\"Enter Offset\",ISNUMBER(Mag_ZOffs)=FALSE)),\"Cue\",\"\")","v":""}]
[{"$f":"IF(Magnet_Movement=\"Hinge\", \"Arc Radius\", \"\")","v":""},null,{"$f":"IF(AND(A23<>\"\", OR(B23=\"\",B23=\"Enter Radius Length\",ISNUMBER(B23)=FALSE)),\"Cue\",\"\")","v":""},null,null,null,null,null,null,null,null,null,null,null,null,null,null,null,null,null,"Max","Min"]
["Hall offsets from Center of package surface"]
["x1",{"$f":"_xlfn.IFNA(VLOOKUP(B41,parametric_table!A1:AV107,MATCH(\"X-Sensor Loc (mm)\",parametric_table!$A$1:$AV$1,0),FALSE),\"\")","v":"NA"}]
["y1",{"$f":"_xlfn.IFNA(VLOOKUP(B41,parametric_table!A1:AV107,MATCH(\"Y-Sensor Loc (mm)\",parametric_table!$A$1:$AV$1,0),FALSE),\"\")","v":"NA"}]
["z1",{"$f":"_xlfn.IFNA(VLOOKUP(B41,parametric_table!A1:AV107,MATCH(\"Z-Sensor Loc (mm)\",parametric_table!$A$1:$AV$1,0),FALSE),\"\")","v":0.47000000000000008}]
["x2","NA"]
["y2","NA"]
["z2","NA"]
["x3","NA"]
["y3","NA"]
["z3","NA"]
["Sensor Operating Conditions",null,null,null,null,null,null,null,null,null,null,null,null,null,null,null,null,null,null,null,{"$f":"MAX(F67:F1087)","v":-88.558858737058799},{"$f":"MIN(F67:F1087)","v":-88.558858737058799}]
["Temperature Min",null,null,"°C",null,null,null,null,null,null,null,null,null,null,null,null,null,null,null,null,null,{"$f":"MIN(G67:G1087)","v":-177.11771747411765}]
["Temperature Nominal",null,"\"IF(AND(A36<>\"\", OR(B36=\"\",B36=\"Enter Temperature\")),\"Cue\",\"\")\"","°C",null,null,null,null,null,null,null,null,null,null,null,null,null,null,null,"Bz",{"$f":"MAX(H67:H1087)","v":319.7791729416054},{"$f":"MIN(H67:H1087)","v":319.7791729416054}]
["Temperature Max",null,null,"°C",null,"*Dimensions not to scale"]
["VSUPPLY (nominal)",3.3,{"$f":"IF(AND(A38<>\"\", OR(VSUPPLY=\"\",VSUPPLY=\"Enter Voltage\", ISNUMBER(VSUPPLY)=FALSE)),\"Cue\",\"\")","v":""},"V",null,"XY-Plane Displacement Dimensions"]
["Sensor Filters",null,null,null,null,null,null,null,null,null,null,null,null,null,null,null,null,null,null,null,{"$f":"\"True\"","v":"True"}]
["Type of Device","Unipolar switch",{"$f":"IF(AND(A40<>\"\", OR(PartType=\"\",PartType=\"Select Type\")),\"Cue\",\"\")","v":""}]
["Device","DRV5021A1",{"$f":"IF(AND(A41<>\"\", OR(PartNum=\"\",PartNum=\"Enter Temperature\")),\"Cue\",\"\")","v":""},null,null," "]
["package",{"$f":"_xlfn.IFNA(VLOOKUP(B41,parametric_table!A1:AV107,MATCH(\"Package Group\",parametric_table!$A$1:$AV$1,0),FALSE),\"\")","v":"SOT-23|3"},{"$f":"IF(AND(A42<>\"\", B42=\"\"),\"Cue\",\"\")","v":""}]
[null,null,{"$f":"IF(B42<>\"\",\"Cue\",\"\")","v":"Cue"}]
["Sensor Axis",{"$f":"_xlfn.IFNA(VLOOKUP(B41,parametric_table!A1:AV107,MATCH(\"Sensor Axis\",parametric_table!$A$1:$AV$1,0),FALSE),\"\")","v":2}]
["Operating Region",{"$f":"_xlfn.IFNA(VLOOKUP(B41,parametric_table!A1:AV107,MATCH(\"Operating Region Used\",parametric_table!$A$1:$AV$1,0),FALSE),\"\")","v":1},null,null,null,"*Dimensions not to Scale"]
["VL (MIN)",{"$f":"_xlfn.IFNA(VLOOKUP(B41,parametric_table!A1:AV107,MATCH(\"Vout Min (V)\",parametric_table!$A$1:$AV$1,0),FALSE),\"\")","v":0},null,"V",null,{"$f":"IF(Magnet_Movement=\"Hinge\", \"*Magnet Offsets when magnet oriented at 0°\", IF(Magnet_Movement=\"Slide-By\", \"*Y-Offset when Magnet x displacement = 0.\",\"\"))","v":"*Y-Offset when Magnet x displacement = 0."}]
["VL (MAX)",{"$f":"IFERROR(_xlfn.IFNA(VLOOKUP(B41,parametric_table!A1:AV107,MATCH(\"Vout Max (V)\",parametric_table!$A$1:$AV$1,0),FALSE),\"\"),\"\")","v":3.3},null,"V"]
["VQ (max)",{"$f":"_xlfn.IFNA(VLOOKUP(B41,parametric_table!A1:AV107,MATCH(\"VQ (V)\",parametric_table!$A$1:$AV$1,0),FALSE),\"\")","v":0},null,"V"]
["BIN,MIN",{"$f":"_xlfn.IFNA(_xlfn.FILTERXML(\"<t><s>\"&SUBSTITUTE(VLOOKUP(B41,parametric_table!A1:AV107,MATCH(\"BL min\",parametric_table!$A$1:$AV$1,0),FALSE),\",\",\"</s><s>\")&\"</s></t>\",\"//s[\"&B45&\"]\"),\"\")","v":{"$error":"#VALUE!"}},null,"mT"]
["BIN,MAX",{"$f":"_xlfn.IFNA(_xlfn.FILTERXML(\"<t><s>\"&SUBSTITUTE(VLOOKUP(B41,parametric_table!A1:AV107,MATCH(\"BL max\",parametric_table!$A$1:$AV$1,0),FALSE),\",\",\"</s><s>\")&\"</s></t>\",\"//s[\"&B45&\"]\"),\"\")","v":{"$error":"#VALUE!"}},null,"mT"]
["Sensitivity (min)",{"$f":"_xlfn.IFNA(IF(PartType<>\"Ratiometric PWM output\",_xlfn.FILTERXML(\"<t><s>\"&SUBSTITUTE(VLOOKUP(B41,parametric_table!A1:AV107,MATCH(\"Sensitivity Min (mV/mT)\",parametric_table!$A$1:$AV$1,0),FALSE),\",\",\"</s><s>\")&\"</s></t>\",\"//s[\"&B45&\"]\"),\n_xlfn.FILTERXML(\"<t><s>\"&SUBSTITUTE(VLOOKUP(B41,parametric_table!A1:AV107,MATCH(\"Sensitivity (%D/mT)\",parametric_table!$A$1:$AV$1,0),FALSE),\",\",\"</s><s>\")&\"</s></t>\",\"//s[\"&B45&\"]\")),\"\")","v":{"$error":"#VALUE!"}},null,"mV/mT"]
["Sensitivity (typ)",{"$f":"_xlfn.IFNA(IF(PartType<>\"Ratiometric PWM output\",_xlfn.FILTERXML(\"<t><s>\"&SUBSTITUTE(VLOOKUP(B41,parametric_table!A1:AV107,MATCH(\"Sensitivity Typ (mV/mT)\",parametric_table!$A$1:$AV$1,0),FALSE),\",\",\"</s><s>\")&\"</s></t>\",\"//s[\"&B45&\"]\"),\n_xlfn.FILTERXML(\"<t><s>\"&SUBSTITUTE(VLOOKUP(B41,parametric_table!A1:AV107,MATCH(\"Sensitivity (%D/mT)\",parametric_table!$A$1:$AV$1,0),FALSE),\",\",\"</s><s>\")&\"</s></t>\",\"//s[\"&B45&\"]\")),\"\")","v":{"$error":"#VALUE!"}},null,"mV/mT"]
["Sensitivity (max)",{"$f":"_xlfn.IFNA(_xlfn.FILTERXML(\"<t><s>\"&SUBSTITUTE(VLOOKUP(B41,parametric_table!A1:AV107,MATCH(\"Sensitivity Max (mV/mT)\",parametric_table!$A$1:$AV$1,0),FALSE),\",\",\"</s><s>\")&\"</s></t>\",\"//s[\"&B45&\"]\"),\"\")","v":{"$error":"#VALUE!"}},null,"mV/mT"]
["BOP MIN",{"$f":"_xlfn.IFNA(VLOOKUP(B41,parametric_table!A1:AV107,MATCH(\"BOP Min (mT)\",parametric_table!$A$1:$AV$1,0),FALSE),\"\")","v":1.4},null,"mT"]
["BOP TYP",{"$f":"_xlfn.IFNA(VLOOKUP(B41,parametric_table!A1:AV107,MATCH(\"BOP Typ (mT)\",parametric_table!$A$1:$AV$1,0),FALSE),\"\")","v":2.9},null,"mT"]
["BOP MAX",{"$f":"_xlfn.IFNA(VLOOKUP(B41,parametric_table!A1:AV107,MATCH(\"BOP Max (mT)\",parametric_table!$A$1:$AV$1,0),FALSE),\"\")","v":4.4000000000000004},null,"mT"]
["BRP MIN",{"$f":"_xlfn.IFNA(VLOOKUP(B41,parametric_table!A1:AV107,MATCH(\"BRP Min (mT)\",parametric_table!$A$1:$AV$1,0),FALSE),\"\")","v":0.4},null,"mT"]
["BRP TYP",{"$f":"_xlfn.IFNA(VLOOKUP(B41,parametric_table!A1:AV107,MATCH(\"BRP Typ (mT)\",parametric_table!$A$1:$AV$1,0),FALSE),\"\")","v":1.8},null,"mT"]
["BRP MAX",{"$f":"_xlfn.IFNA(VLOOKUP(B41,parametric_table!A1:AV107,MATCH(\"BRP Max (mT)\",parametric_table!$A$1:$AV$1,0),FALSE),\"\")","v":3},null,"mT"]
[]
[]
[]
[]
[null,null,null,null,null,"StepSize"]
[null,null,null,null,null,{"$f":"(MAX(B29:B30)-MIN(B29:B30))/1000","v":0}]
["dx (mm)","dy (mm)",null,"dz (mm)",null,"Bx (mT)","By (mT)","Bz (mT)","Angle (°)",null,null,{"$f":"IF(PartType<>\"Ratiometric PWM output\", \"VOUT(V)\", \"D (%)\")","v":"VOUT(V)"},"VOUT2(V)","VBOP","VBRP"]
[2.0499999999999998,1,null,0,null,-88.558858737058799,-177.11771747411765,319.7791729416054,null,null,null,{"$f":"IF($L$21=PartNum,IF(PartType=\"Omnipolar switch\",IF(ABS(H67)>BRP_Typ,0,VOH),\nIF(PartType=\"Unipolar switch\",IF(H67>BRP_Typ,0,VOH),\nIF(PartType=\"Latch\",IF(H67<BRP_Typ,VOH,0),\nIF(PartType=\"Ratiometric PWM output\", IF(50+GAIN*H67<5.3,5.3,IF(50+GAIN*H67>94.7,94.7,50+GAIN*H67)),\nIF(OR(PartType=\"Ratiometric unipolar\",PartType=\"Ratiometric bipolar\",PartType=\"Bipolar\"),IF(AND(VQ+H67*GAIN/1000<=VOH,VQ+H67*GAIN/1000>=VOL),VQ+H67*GAIN/1000,IF(VQ+H67*GAIN/1000>VOH,VOH,VOL))))))),0)","v":0},{"$f":"IF($L$21=PartNum,IF(PartType=\"Omnipolar switch\",IF(ABS(H67)>BOP_Typ,0,VOH),\nIF(PartType=\"Unipolar switch\",IF(H67>BOP_Typ,0,VOH),\nIF(PartType=\"Latch\",IF(H67<BOP_Typ,VOH,0),\"\"))),0)","v":0},{"$f":"IF(PartType=\"Omnipolar switch\",IF(ABS(H67)>BOP_Max,0,VOH),IF(PartType=\"Unipolar switch\",IF(H67>BOP_Max,0,VOH),\"\"))","v":0},{"$f":"IF(PartType=\"Omnipolar switch\",IF(ABS(H67)>BRP_Min,0,VOH),IF(PartType=\"Unipolar switch\",IF(H67>BRP_Min,0,VOH),\"\"))","v":0}]
[2.0499999999999998,1,null,0,null,-88.558858737058799,-177.11771747411765,319.7791729416054,null,null,null,{"$f":"IF($L$21=PartNum,IF(PartType=\"Omnipolar switch\",IF(ABS(H68)>BRP_Typ,0,VOH),\nIF(PartType=\"Unipolar switch\",IF(H68>BRP_Typ,0,VOH),\nIF(PartType=\"Latch\",IF(H68<BRP_Typ,VOH,0),\nIF(PartType=\"Ratiometric PWM output\", IF(50+GAIN*H68<5.3,5.3,IF(50+GAIN*H68>94.7,94.7,50+GAIN*H68)),\nIF(OR(PartType=\"Ratiometric unipolar\",PartType=\"Ratiometric bipolar\",PartType=\"Bipolar\"),IF(AND(VQ+H68*GAIN/1000<=VOH,VQ+H68*GAIN/1000>=VOL),VQ+H68*GAIN/1000,IF(VQ+H68*GAIN/1000>VOH,VOH,VOL))))))),0)","v":0},{"$f":"IF($L$21=PartNum,IF(PartType=\"Omnipolar switch\",IF(ABS(H68)>BOP_Typ,0,VOH),\nIF(PartType=\"Unipolar switch\",IF(H68>BOP_Typ,0,VOH),\nIF(PartType=\"Latch\",IF(H68<BOP_Typ,VOH,0),\"\"))),0)","v":0},0,0]
[2.0499999999999998,1,null,0,null,-88.558858737058799,-177.11771747411765,319.7791729416054,null,null,null,0,0,0,0]
[2.0499999999999998,1,null,0,null,-88.558858737058799,-177.11771747411765,319.7791729416054,null,null,null,0,0,0,0]
[2.0499999999999998,1,null,0,null,-88.558858737058799,-177.11771747411765,319.7791729416054,null,null,null,0,0,0,0]
[2.0499999999999998,1,null,0,null,-88.558858737058799,-177.11771747411765,319.7791729416054,null,null,null,0,0,0,0]
[2.0499999999999998,1,null,0,null,-88.558858737058799,-177.11771747411765,319.7791729416054,null,null,null,0,0,0,0]
[2.0499999999999998,1,null,0,null,-88.558858737058799,-177.11771747411765,319.7791729416054,null,null,null,0,0,0,0]
[2.0499999999999998,1,null,0,null,-88.558858737058799,-177.11771747411765,319.7791729416054,null,null,null,0,0,0,0]
[2.0499999999999998,1,null,0,null,-88.558858737058799,-177.11771747411765,319.7791729416054,null,null,null,0,0,0,0]
[2.0499999999999998,1,null,0,null,-88.558858737058799,-177.11771747411765,319.7791729416054,null,null,null,0,0,0,0]
[2.0499999999999998,1,null,0,null,-88.558858737058799,-177.11771747411765,319.7791729416054,null,null,null,0,0,0,0]
[2.0499999999999998,1,null,0,null,-88.558858737058799,-177.11771747411765,319.7791729416054,null,null,null,0,0,0,0]
[2.0499999999999998,1,null,0,null,-88.558858737058799,-177.11771747411765,319.7791729416054,null,null,null,0,0,0,0]
[2.0499999999999998,1,null,0,null,-88.558858737058799,-177.11771747411765,319.7791729416054,null,null,null,0,0,0,0]
[2.0499999999999998,1,null,0,null,-88.558858737058799,-177.11771747411765,319.7791729416054,null,null,null,0,0,0,0]
[2.0499999999999998,1,null,0,null,-88.558858737058799,-177.11771747411765,319.7791729416054,null,null,null,0,0,0,0]
[2.0499999999999998,1,null,0,null,-88.558858737058799,-177.11771747411765,319.7791729416054,null,null,null,0,0,0,0]
[2.0499999999999998,1,null,0,null,-88.558858737058799,-177.11771747411765,319.7791729416054,null,null,null,0,0,0,0]
[2.0499999999999998,1,null,0,null,-88.558858737058799,-177.11771747411765,319.7791729416054,null,null,null,0,0,0,0]
[2.0499999999999998,1,null,0,null,-88.558858737058799,-177.11771747411765,319.7791729416054,null,null,null,0,0,0,0]
[2.0499999999999998,1,null,0,null,-88.558858737058799,-177.11771747411765,319.7791729416054,null,null,null,0,0,0,0]
[2.0499999999999998,1,null,0,null,-88.558858737058799,-177.11771747411765,319.7791729416054,null,null,null,0,0,0,0]
[2.0499999999999998,1,null,0,null,-88.558858737058799,-177.11771747411765,319.7791729416054,null,null,null,0,0,0,0]
[2.0499999999999998,1,null,0,null,-88.558858737058799,-177.11771747411765,319.7791729416054,null,null,null,0,0,0,0]
[2.0499999999999998,1,null,0,null,-88.558858737058799,-177.11771747411765,319.7791729416054,null,null,null,0,0,0,0]
[2.0499999999999998,1,null,0,null,-88.558858737058799,-177.11771747411765,319.7791729416054,null,null,null,0,0,0,0]
[2.0499999999999998,1,null,0,null,-88.558858737058799,-177.11771747411765,319.7791729416054,null,null,null,0,0,0,0]
[2.0499999999999998,1,null,0,null,-88.558858737058799,-177.11771747411765,319.7791729416054,null,null,null,0,0,0,0]
[2.0499999999999998,1,null,0,null,-88.558858737058799,-177.11771747411765,319.7791729416054,null,null,null,0,0,0,0]
[2.0499999999999998,1,null,0,null,-88.558858737058799,-177.11771747411765,319.7791729416054,null,null,null,0,0,0,0]
[2.0499999999999998,1,null,0,null,-88.558858737058799,-177.11771747411765,319.7791729416054,null,null,null,0,0,0,0]
[2.0499999999999998,1,null,0,null,-88.558858737058799,-177.11771747411765,319.7791729416054,null,null,null,0,0,0,0]
[2.0499999999999998,1,null,0,null,-88.558858737058799,-177.11771747411765,319.7791729416054,null,null,null,0,0,0,0]
[2.0499999999999998,1,null,0,null,-88.558858737058799,-177.11771747411765,319.7791729416054,null,null,null,0,0,0,0]
[2.0499999999999998,1,null,0,null,-88.558858737058799,-177.11771747411765,319.7791729416054,null,null,null,0,0,0,0]
[2.0499999999999998,1,null,0,null,-88.558858737058799,-177.11771747411765,319.7791729416054,null,null,null,0,0,0,0]
[2.0499999999999998,1,null,0,null,-88.558858737058799,-177.11771747411765,319.7791729416054,null,null,null,0,0,0,0]
[2.0499999999999998,1,null,0,null,-88.558858737058799,-177.11771747411765,319.7791729416054,null,null,null,0,0,0,0]
[2.0499999999999998,1,null,0,null,-88.558858737058799,-177.11771747411765,319.7791729416054,null,null,null,0,0,0,0]
[2.0499999999999998,1,null,0,null,-88.558858737058799,-177.11771747411765,319.7791729416054,null,null,null,0,0,0,0]
[2.0499999999999998,1,null,0,null,-88.558858737058799,-177.11771747411765,319.7791729416054,null,null,null,0,0,0,0]
[2.0499999999999998,1,null,0,null,-88.558858737058799,-177.11771747411765,319.7791729416054,null,null,null,0,0,0,0]
[2.0499999999999998,1,null,0,null,-88.558858737058799,-177.11771747411765,319.7791729416054,null,null,null,0,0,0,0]
[2.0499999999999998,1,null,0,null,-88.558858737058799,-177.11771747411765,319.7791729416054,null,null,null,0,0,0,0]
[2.0499999999999998,1,null,0,null,-88.558858737058799,-177.11771747411765,319.7791729416054,null,null,null,0,0,0,0]
[2.0499999999999998,1,null,0,null,-88.558858737058799,-177.11771747411765,319.7791729416054,null,null,null,0,0,0,0]
[2.0499999999999998,1,null,0,null,-88.558858737058799,-177.11771747411765,319.7791729416054,null,null,null,0,0,0,0]
[2.0499999999999998,1,null,0,null,-88.558858737058799,-177.11771747411765,319.7791729416054,null,null,null,0,0,0,0]
[2.0499999999999998,1,null,0,null,-88.558858737058799,-177.11771747411765,319.7791729416054,null,null,null,0,0,0,0]
[2.0499999999999998,1,null,0,null,-88.558858737058799,-177.11771747411765,319.7791729416054,null,null,null,0,0,0,0]
[2.0499999999999998,1,null,0,null,-88.558858737058799,-177.11771747411765,319.7791729416054,null,null,null,0,0,0,0]
[2.0499999999999998,1,null,0,null,-88.558858737058799,-177.11771747411765,319.7791729416054,null,null,null,0,0,0,0]
[2.0499999999999998,1,null,0,null,-88.558858737058799,-177.11771747411765,319.7791729416054,null,null,null,0,0,0,0]
[2.0499999999999998,1,null,0,null,-88.558858737058799,-177.11771747411765,319.7791729416054,null,null,null,0,0,0,0]
[2.0499999999999998,1,null,0,null,-88.558858737058799,-177.11771747411765,319.7791729416054,null,null,null,0,0,0,0]
[2.0499999999999998,1,null,0,null,-88.558858737058799,-177.11771747411765,319.7791729416054,null,null,null,0,0,0,0]
[2.0499999999999998,1,null,0,null,-88.558858737058799,-177.11771747411765,319.7791729416054,null,null,null,0,0,0,0]
[2.0499999999999998,1,null,0,null,-88.558858737058799,-177.11771747411765,319.7791729416054,null,null,null,0,0,0,0]
[2.0499999999999998,1,null,0,null,-88.558858737058799,-177.11771747411765,319.7791729416054,null,null,null,0,0,0,0]
[2.0499999999999998,1,null,0,null,-88.558858737058799,-177.11771747411765,319.7791729416054,null,null,null,0,0,0,0]
[2.0499999999999998,1,null,0,null,-88.558858737058799,-177.11771747411765,319.7791729416054,null,null,null,0,0,0,0]
[2.0499999999999998,1,null,0,null,-88.558858737058799,-177.11771747411765,319.7791729416054,null,null,null,0,0,0,0]
[2.0499999999999998,1,null,0,null,-88.558858737058799,-177.11771747411765,319.7791729416054,null,null,null,0,0,0,0]
[2.0499999999999998,1,null,0,null,-88.558858737058799,-177.11771747411765,319.7791729416054,null,null,null,{"$f":"IF($L$21=PartNum,IF(PartType=\"Omnipolar switch\",IF(ABS(H131)>BRP_Typ,0,VOH),\nIF(PartType=\"Unipolar switch\",IF(H131>BRP_Typ,0,VOH),\nIF(PartType=\"Latch\",IF(H131<BRP_Typ,VOH,0),\nIF(PartType=\"Ratiometric PWM output\", IF(50+GAIN*H131<5.3,5.3,IF(50+GAIN*H131>94.7,94.7,50+GAIN*H131)),\nIF(OR(PartType=\"Ratiometric unipolar\",PartType=\"Ratiometric bipolar\",PartType=\"Bipolar\"),IF(AND(VQ+H131*GAIN/1000<=VOH,VQ+H131*GAIN/1000>=VOL),VQ+H131*GAIN/1000,IF(VQ+H131*GAIN/1000>VOH,VOH,VOL))))))),0)","v":0},{"$f":"IF($L$21=PartNum,IF(PartType=\"Omnipolar switch\",IF(ABS(H131)>BOP_Typ,0,VOH),\nIF(PartType=\"Unipolar switch\",IF(H131>BOP_Typ,0,VOH),\nIF(PartType=\"Latch\",IF(H131<BOP_Typ,VOH,0),\"\"))),0)","v":0},{"$f":"IF(PartType=\"Omnipolar switch\",IF(ABS(H131)>BOP_Max,0,VOH),IF(PartType=\"Unipolar switch\",IF(H131>BOP_Max,0,VOH),\"\"))","v":0},{"$f":"IF(PartType=\"Omnipolar switch\",IF(ABS(H131)>BRP_Min,0,VOH),IF(PartType=\"Unipolar switch\",IF(H131>BRP_Min,0,VOH),\"\"))","v":0}]
[2.0499999999999998,1,null,0,null,-88.558858737058799,-177.11771747411765,319.7791729416054,null,null,null,0,0,0,0]
[2.0499999999999998,1,null,0,null,-88.558858737058799,-177.11771747411765,319.7791729416054,null,null,null,0,0,0,0]
[2.0499999999999998,1,null,0,null,-88.558858737058799,-177.11771747411765,319.7791729416054,null,null,null,0,0,0,0]
[2.0499999999999998,1,null,0,null,-88.558858737058799,-177.11771747411765,319.7791729416054,null,null,null,0,0,0,0]
[2.0499999999999998,1,null,0,null,-88.558858737058799,-177.11771747411765,319.7791729416054,null,null,null,0,0,0,0]
[2.0499999999999998,1,null,0,null,-88.558858737058799,-177.11771747411765,319.7791729416054,null,null,null,0,0,0,0]
[2.0499999999999998,1,null,0,null,-88.558858737058799,-177.11771747411765,319.7791729416054,null,null,null,0,0,0,0]
[2.0499999999999998,1,null,0,null,-88.558858737058799,-177.11771747411765,319.7791729416054,null,null,null,0,0,0,0]
[2.0499999999999998,1,null,0,null,-88.558858737058799,-177.11771747411765,319.7791729416054,null,null,null,0,0,0,0]
[2.0499999999999998,1,null,0,null,-88.558858737058799,-177.11771747411765,319.7791729416054,null,null,null,0,0,0,0]
[2.0499999999999998,1,null,0,null,-88.558858737058799,-177.11771747411765,319.7791729416054,null,null,null,0,0,0,0]
[2.0499999999999998,1,null,0,null,-88.558858737058799,-177.11771747411765,319.7791729416054,null,null,null,0,0,0,0]
[2.0499999999999998,1,null,0,null,-88.558858737058799,-177.11771747411765,319.7791729416054,null,null,null,0,0,0,0]
[2.0499999999999998,1,null,0,null,-88.558858737058799,-177.11771747411765,319.7791729416054,null,null,null,0,0,0,0]
[2.0499999999999998,1,null,0,null,-88.558858737058799,-177.11771747411765,319.7791729416054,null,null,null,0,0,0,0]
[2.0499999999999998,1,null,0,null,-88.558858737058799,-177.11771747411765,319.7791729416054,null,null,null,0,0,0,0]
[2.0499999999999998,1,null,0,null,-88.558858737058799,-177.11771747411765,319.7791729416054,null,null,null,0,0,0,0]
[2.0499999999999998,1,null,0,null,-88.558858737058799,-177.11771747411765,319.7791729416054,null,null,null,0,0,0,0]
[2.0499999999999998,1,null,0,null,-88.558858737058799,-177.11771747411765,319.7791729416054,null,null,null,0,0,0,0]
[2.0499999999999998,1,null,0,null,-88.558858737058799,-177.11771747411765,319.7791729416054,null,null,null,0,0,0,0]
[2.0499999999999998,1,null,0,null,-88.558858737058799,-177.11771747411765,319.7791729416054,null,null,null,0,0,0,0]
[2.0499999999999998,1,null,0,null,-88.558858737058799,-177.11771747411765,319.7791729416054,null,null,null,0,0,0,0]
[2.0499999999999998,1,null,0,null,-88.558858737058799,-177.11771747411765,319.7791729416054,null,null,null,0,0,0,0]
[2.0499999999999998,1,null,0,null,-88.558858737058799,-177.11771747411765,319.7791729416054,null,null,null,0,0,0,0]
[2.0499999999999998,1,null,0,null,-88.558858737058799,-177.11771747411765,319.7791729416054,null,null,null,0,0,0,0]
[2.0499999999999998,1,null,0,null,-88.558858737058799,-177.11771747411765,319.7791729416054,null,null,null,0,0,0,0]
[2.0499999999999998,1,null,0,null,-88.558858737058799,-177.11771747411765,319.7791729416054,null,null,null,0,0,0,0]
[2.0499999999999998,1,null,0,null,-88.558858737058799,-177.11771747411765,319.7791729416054,null,null,null,0,0,0,0]
[2.0499999999999998,1,null,0,null,-88.558858737058799,-177.11771747411765,319.7791729416054,null,null,null,0,0,0,0]
[2.0499999999999998,1,null,0,null,-88.558858737058799,-177.11771747411765,319.7791729416054,null,null,null,0,0,0,0]
[2.0499999999999998,1,null,0,null,-88.558858737058799,-177.11771747411765,319.7791729416054,null,null,null,0,0,0,0]
[2.0499999999999998,1,null,0,null,-88.558858737058799,-177.11771747411765,319.7791729416054,null,null,null,0,0,0,0]
[2.0499999999999998,1,null,0,null,-88.558858737058799,-177.11771747411765,319.7791729416054,null,null,null,0,0,0,0]
[2.0499999999999998,1,null,0,null,-88.558858737058799,-177.11771747411765,319.7791729416054,null,null,null,0,0,0,0]
[2.0499999999999998,1,null,0,null,-88.558858737058799,-177.11771747411765,319.7791729416054,null,null,null,0,0,0,0]
[2.0499999999999998,1,null,0,null,-88.558858737058799,-177.11771747411765,319.7791729416054,null,null,null,0,0,0,0]
[2.0499999999999998,1,null,0,null,-88.558858737058799,-177.11771747411765,319.7791729416054,null,null,null,0,0,0,0]
[2.0499999999999998,1,null,0,null,-88.558858737058799,-177.11771747411765,319.7791729416054,null,null,null,0,0,0,0]
[2.0499999999999998,1,null,0,null,-88.558858737058799,-177.11771747411765,319.7791729416054,null,null,null,0,0,0,0]
[2.0499999999999998,1,null,0,null,-88.558858737058799,-177.11771747411765,319.7791729416054,null,null,null,0,0,0,0]
[2.0499999999999998,1,null,0,null,-88.558858737058799,-177.11771747411765,319.7791729416054,null,null,null,0,0,0,0]
[2.0499999999999998,1,null,0,null,-88.558858737058799,-177.11771747411765,319.7791729416054,null,null,null,0,0,0,0]
[2.0499999999999998,1,null,0,null,-88.558858737058799,-177.11771747411765,319.7791729416054,null,null,null,0,0,0,0]
[2.0499999999999998,1,null,0,null,-88.558858737058799,-177.11771747411765,319.7791729416054,null,null,null,0,0,0,0]
[2.0499999999999998,1,null,0,null,-88.558858737058799,-177.11771747411765,319.7791729416054,null,null,null,0,0,0,0]
[2.0499999999999998,1,null,0,null,-88.558858737058799,-177.11771747411765,319.7791729416054,null,null,null,0,0,0,0]
[2.0499999999999998,1,null,0,null,-88.558858737058799,-177.11771747411765,319.7791729416054,null,null,null,0,0,0,0]
[2.0499999999999998,1,null,0,null,-88.558858737058799,-177.11771747411765,319.7791729416054,null,null,null,0,0,0,0]
[2.0499999999999998,1,null,0,null,-88.558858737058799,-177.11771747411765,319.7791729416054,null,null,null,0,0,0,0]
[2.0499999999999998,1,null,0,null,-88.558858737058799,-177.11771747411765,319.7791729416054,null,null,null,0,0,0,0]
[2.0499999999999998,1,null,0,null,-88.558858737058799,-177.11771747411765,319.7791729416054,null,null,null,0,0,0,0]
[2.0499999999999998,1,null,0,null,-88.558858737058799,-177.11771747411765,319.7791729416054,null,null,null,0,0,0,0]
[2.0499999999999998,1,null,0,null,-88.558858737058799,-177.11771747411765,319.7791729416054,null,null,null,0,0,0,0]
[2.0499999999999998,1,null,0,null,-88.558858737058799,-177.11771747411765,319.7791729416054,null,null,null,0,0,0,0]
[2.0499999999999998,1,null,0,null,-88.558858737058799,-177.11771747411765,319.7791729416054,null,null,null,0,0,0,0]
[2.0499999999999998,1,null,0,null,-88.558858737058799,-177.11771747411765,319.7791729416054,null,null,null,0,0,0,0]
[2.0499999999999998,1,null,0,null,-88.558858737058799,-177.11771747411765,319.7791729416054,null,null,null,0,0,0,0]
[2.0499999999999998,1,null,0,null,-88.558858737058799,-177.11771747411765,319.7791729416054,null,null,null,0,0,0,0]
[2.0499999999999998,1,null,0,null,-88.558858737058799,-177.11771747411765,319.7791729416054,null,null,null,0,0,0,0]
[2.0499999999999998,1,null,0,null,-88.558858737058799,-177.11771747411765,319.7791729416054,null,null,null,0,0,0,0]
[2.0499999999999998,1,null,0,null,-88.558858737058799,-177.11771747411765,319.7791729416054,null,null,null,0,0,0,0]
[2.0499999999999998,1,null,0,null,-88.558858737058799,-177.11771747411765,319.7791729416054,null,null,null,0,0,0,0]
[2.0499999999999998,1,null,0,null,-88.558858737058799,-177.11771747411765,319.7791729416054,null,null,null,0,0,0,0]
[2.0499999999999998,1,null,0,null,-88.558858737058799,-177.11771747411765,319.7791729416054,null,null,null,{"$f":"IF($L$21=PartNum,IF(PartType=\"Omnipolar switch\",IF(ABS(H195)>BRP_Typ,0,VOH),\nIF(PartType=\"Unipolar switch\",IF(H195>BRP_Typ,0,VOH),\nIF(PartType=\"Latch\",IF(H195<BRP_Typ,VOH,0),\nIF(PartType=\"Ratiometric PWM output\", IF(50+GAIN*H195<5.3,5.3,IF(50+GAIN*H195>94.7,94.7,50+GAIN*H195)),\nIF(OR(PartType=\"Ratiometric unipolar\",PartType=\"Ratiometric bipolar\",PartType=\"Bipolar\"),IF(AND(VQ+H195*GAIN/1000<=VOH,VQ+H195*GAIN/1000>=VOL),VQ+H195*GAIN/1000,IF(VQ+H195*GAIN/1000>VOH,VOH,VOL))))))),0)","v":0},{"$f":"IF($L$21=PartNum,IF(PartType=\"Omnipolar switch\",IF(ABS(H195)>BOP_Typ,0,VOH),\nIF(PartType=\"Unipolar switch\",IF(H195>BOP_Typ,0,VOH),\nIF(PartType=\"Latch\",IF(H195<BOP_Typ,VOH,0),\"\"))),0)","v":0},{"$f":"IF(PartType=\"Omnipolar switch\",IF(ABS(H195)>BOP_Max,0,VOH),IF(PartType=\"Unipolar switch\",IF(H195>BOP_Max,0,VOH),\"\"))","v":0},{"$f":"IF(PartType=\"Omnipolar switch\",IF(ABS(H195)>BRP_Min,0,VOH),IF(PartType=\"Unipolar switch\",IF(H195>BRP_Min,0,VOH),\"\"))","v":0}]
[2.0499999999999998,1,null,0,null,-88.558858737058799,-177.11771747411765,319.7791729416054,null,null,null,0,0,0,0]
[2.0499999999999998,1,null,0,null,-88.558858737058799,-177.11771747411765,319.7791729416054,null,null,null,0,0,0,0]
[2.0499999999999998,1,null,0,null,-88.558858737058799,-177.11771747411765,319.7791729416054,null,null,null,0,0,0,0]
[2.0499999999999998,1,null,0,null,-88.558858737058799,-177.11771747411765,319.7791729416054,null,null,null,0,0,0,0]
[2.0499999999999998,1,null,0,null,-88.558858737058799,-177.11771747411765,319.7791729416054,null,null,null,0,0,0,0]
[2.0499999999999998,1,null,0,null,-88.558858737058799,-177.11771747411765,319.7791729416054,null,null,null,0,0,0,0]
[2.0499999999999998,1,null,0,null,-88.558858737058799,-177.11771747411765,319.7791729416054,null,null,null,0,0,0,0]
[2.0499999999999998,1,null,0,null,-88.558858737058799,-177.11771747411765,319.7791729416054,null,null,null,0,0,0,0]
[2.0499999999999998,1,null,0,null,-88.558858737058799,-177.11771747411765,319.7791729416054,null,null,null,0,0,0,0]
[2.0499999999999998,1,null,0,null,-88.558858737058799,-177.11771747411765,319.7791729416054,null,null,null,0,0,0,0]
[2.0499999999999998,1,null,0,null,-88.558858737058799,-177.11771747411765,319.7791729416054,null,null,null,0,0,0,0]
[2.0499999999999998,1,null,0,null,-88.558858737058799,-177.11771747411765,319.7791729416054,null,null,null,0,0,0,0]
[2.0499999999999998,1,null,0,null,-88.558858737058799,-177.11771747411765,319.7791729416054,null,null,null,0,0,0,0]
[2.0499999999999998,1,null,0,null,-88.558858737058799,-177.11771747411765,319.7791729416054,null,null,null,0,0,0,0]
[2.0499999999999998,1,null,0,null,-88.558858737058799,-177.11771747411765,319.7791729416054,null,null,null,0,0,0,0]
[2.0499999999999998,1,null,0,null,-88.558858737058799,-177.11771747411765,319.7791729416054,null,null,null,0,0,0,0]
[2.0499999999999998,1,null,0,null,-88.558858737058799,-177.11771747411765,319.7791729416054,null,null,null,0,0,0,0]
[2.0499999999999998,1,null,0,null,-88.558858737058799,-177.11771747411765,319.7791729416054,null,null,null,0,0,0,0]
[2.0499999999999998,1,null,0,null,-88.558858737058799,-177.11771747411765,319.7791729416054,null,null,null,0,0,0,0]
[2.0499999999999998,1,null,0,null,-88.558858737058799,-177.11771747411765,319.7791729416054,null,null,null,0,0,0,0]
[2.0499999999999998,1,null,0,null,-88.558858737058799,-177.11771747411765,319.7791729416054,null,null,null,0,0,0,0]
[2.0499999999999998,1,null,0,null,-88.558858737058799,-177.11771747411765,319.7791729416054,null,null,null,0,0,0,0]
[2.0499999999999998,1,null,0,null,-88.558858737058799,-177.11771747411765,319.7791729416054,null,null,null,0,0,0,0]
[2.0499999999999998,1,null,0,null,-88.558858737058799,-177.11771747411765,319.7791729416054,null,null,null,0,0,0,0]
[2.0499999999999998,1,null,0,null,-88.558858737058799,-177.11771747411765,319.7791729416054,null,null,null,0,0,0,0]
[2.0499999999999998,1,null,0,null,-88.558858737058799,-177.11771747411765,319.7791729416054,null,null,null,0,0,0,0]
[2.0499999999999998,1,null,0,null,-88.558858737058799,-177.11771747411765,319.7791729416054,null,null,null,0,0,0,0]
[2.0499999999999998,1,null,0,null,-88.558858737058799,-177.11771747411765,319.7791729416054,null,null,null,0,0,0,0]
[2.0499999999999998,1,null,0,null,-88.558858737058799,-177.11771747411765,319.7791729416054,null,null,null,0,0,0,0]
[2.0499999999999998,1,null,0,null,-88.558858737058799,-177.11771747411765,319.7791729416054,null,null,null,0,0,0,0]
[2.0499999999999998,1,null,0,null,-88.558858737058799,-177.11771747411765,319.7791729416054,null,null,null,0,0,0,0]
[2.0499999999999998,1,null,0,null,-88.558858737058799,-177.11771747411765,319.7791729416054,null,null,null,0,0,0,0]
[2.0499999999999998,1,null,0,null,-88.558858737058799,-177.11771747411765,319.7791729416054,null,null,null,0,0,0,0]
[2.0499999999999998,1,null,0,null,-88.558858737058799,-177.11771747411765,319.7791729416054,null,null,null,0,0,0,0]
[2.0499999999999998,1,null,0,null,-88.558858737058799,-177.11771747411765,319.7791729416054,null,null,null,0,0,0,0]
[2.0499999999999998,1,null,0,null,-88.558858737058799,-177.11771747411765,319.7791729416054,null,null,null,0,0,0,0]
[2.0499999999999998,1,null,0,null,-88.558858737058799,-177.11771747411765,319.7791729416054,null,null,null,0,0,0,0]
[2.0499999999999998,1,null,0,null,-88.558858737058799,-177.11771747411765,319.7791729416054,null,null,null,0,0,0,0]
[2.0499999999999998,1,null,0,null,-88.558858737058799,-177.11771747411765,319.7791729416054,null,null,null,0,0,0,0]
[2.0499999999999998,1,null,0,null,-88.558858737058799,-177.11771747411765,319.7791729416054,null,null,null,0,0,0,0]
[2.0499999999999998,1,null,0,null,-88.558858737058799,-177.11771747411765,319.7791729416054,null,null,null,0,0,0,0]
[2.0499999999999998,1,null,0,null,-88.558858737058799,-177.11771747411765,319.7791729416054,null,null,null,0,0,0,0]
[2.0499999999999998,1,null,0,null,-88.558858737058799,-177.11771747411765,319.7791729416054,null,null,null,0,0,0,0]
[2.0499999999999998,1,null,0,null,-88.558858737058799,-177.11771747411765,319.7791729416054,null,null,null,0,0,0,0]
[2.0499999999999998,1,null,0,null,-88.558858737058799,-177.11771747411765,319.7791729416054,null,null,null,0,0,0,0]
[2.0499999999999998,1,null,0,null,-88.558858737058799,-177.11771747411765,319.7791729416054,null,null,null,0,0,0,0]
[2.0499999999999998,1,null,0,null,-88.558858737058799,-177.11771747411765,319.7791729416054,null,null,null,0,0,0,0]
[2.0499999999999998,1,null,0,null,-88.558858737058799,-177.11771747411765,319.7791729416054,null,null,null,0,0,0,0]
[2.0499999999999998,1,null,0,null,-88.558858737058799,-177.11771747411765,319.7791729416054,null,null,null,0,0,0,0]
[2.0499999999999998,1,null,0,null,-88.558858737058799,-177.11771747411765,319.7791729416054,null,null,null,0,0,0,0]
[2.0499999999999998,1,null,0,null,-88.558858737058799,-177.11771747411765,319.7791729416054,null,null,null,0,0,0,0]
[2.0499999999999998,1,null,0,null,-88.558858737058799,-177.11771747411765,319.7791729416054,null,null,null,0,0,0,0]
[2.0499999999999998,1,null,0,null,-88.558858737058799,-177.11771747411765,319.7791729416054,null,null,null,0,0,0,0]
[2.0499999999999998,1,null,0,null,-88.558858737058799,-177.11771747411765,319.7791729416054,null,null,null,0,0,0,0]
[2.0499999999999998,1,null,0,null,-88.558858737058799,-177.11771747411765,319.7791729416054,null,null,null,0,0,0,0]
[2.0499999999999998,1,null,0,null,-88.558858737058799,-177.11771747411765,319.7791729416054,null,null,null,0,0,0,0]
[2.0499999999999998,1,null,0,null,-88.558858737058799,-177.11771747411765,319.7791729416054,null,null,null,0,0,0,0]
[2.0499999999999998,1,null,0,null,-88.558858737058799,-177.11771747411765,319.7791729416054,null,null,null,0,0,0,0]
[2.0499999999999998,1,null,0,null,-88.558858737058799,-177.11771747411765,319.7791729416054,null,null,null,0,0,0,0]
[2.0499999999999998,1,null,0,null,-88.558858737058799,-177.11771747411765,319.7791729416054,null,null,null,0,0,0,0]
[2.0499999999999998,1,null,0,null,-88.558858737058799,-177.11771747411765,319.7791729416054,null,null,null,0,0,0,0]
[2.0499999999999998,1,null,0,null,-88.558858737058799,-177.11771747411765,319.7791729416054,null,null,null,0,0,0,0]
[2.0499999999999998,1,null,0,null,-88.558858737058799,-177.11771747411765,319.7791729416054,null,null,null,0,0,0,0]
[2.0499999999999998,1,null,0,null,-88.558858737058799,-177.11771747411765,319.7791729416054,null,null,null,{"$f":"IF($L$21=PartNum,IF(PartType=\"Omnipolar switch\",IF(ABS(H259)>BRP_Typ,0,VOH),\nIF(PartType=\"Unipolar switch\",IF(H259>BRP_Typ,0,VOH),\nIF(PartType=\"Latch\",IF(H259<BRP_Typ,VOH,0),\nIF(PartType=\"Ratiometric PWM output\", IF(50+GAIN*H259<5.3,5.3,IF(50+GAIN*H259>94.7,94.7,50+GAIN*H259)),\nIF(OR(PartType=\"Ratiometric unipolar\",PartType=\"Ratiometric bipolar\",PartType=\"Bipolar\"),IF(AND(VQ+H259*GAIN/1000<=VOH,VQ+H259*GAIN/1000>=VOL),VQ+H259*GAIN/1000,IF(VQ+H259*GAIN/1000>VOH,VOH,VOL))))))),0)","v":0},{"$f":"IF($L$21=PartNum,IF(PartType=\"Omnipolar switch\",IF(ABS(H259)>BOP_Typ,0,VOH),\nIF(PartType=\"Unipolar switch\",IF(H259>BOP_Typ,0,VOH),\nIF(PartType=\"Latch\",IF(H259<BOP_Typ,VOH,0),\"\"))),0)","v":0},{"$f":"IF(PartType=\"Omnipolar switch\",IF(ABS(H259)>BOP_Max,0,VOH),IF(PartType=\"Unipolar switch\",IF(H259>BOP_Max,0,VOH),\"\"))","v":0},{"$f":"IF(PartType=\"Omnipolar switch\",IF(ABS(H259)>BRP_Min,0,VOH),IF(PartType=\"Unipolar switch\",IF(H259>BRP_Min,0,VOH),\"\"))","v":0}]
[2.0499999999999998,1,null,0,null,-88.558858737058799,-177.11771747411765,319.7791729416054,null,null,null,0,0,0,0]
[2.0499999999999998,1,null,0,null,-88.558858737058799,-177.11771747411765,319.7791729416054,null,null,null,0,0,0,0]
[2.0499999999999998,1,null,0,null,-88.558858737058799,-177.11771747411765,319.7791729416054,null,null,null,0,0,0,0]
[2.0499999999999998,1,null,0,null,-88.558858737058799,-177.11771747411765,319.7791729416054,null,null,null,0,0,0,0]
[2.0499999999999998,1,null,0,null,-88.558858737058799,-177.11771747411765,319.7791729416054,null,null,null,0,0,0,0]
[2.0499999999999998,1,null,0,null,-88.558858737058799,-177.11771747411765,319.7791729416054,null,null,null,0,0,0,0]
[2.0499999999999998,1,null,0,null,-88.558858737058799,-177.11771747411765,319.7791729416054,null,null,null,0,0,0,0]
[2.0499999999999998,1,null,0,null,-88.558858737058799,-177.11771747411765,319.7791729416054,null,null,null,0,0,0,0]
[2.0499999999999998,1,null,0,null,-88.558858737058799,-177.11771747411765,319.7791729416054,null,null,null,0,0,0,0]
[2.0499999999999998,1,null,0,null,-88.558858737058799,-177.11771747411765,319.7791729416054,null,null,null,0,0,0,0]
[2.0499999999999998,1,null,0,null,-88.558858737058799,-177.11771747411765,319.7791729416054,null,null,null,0,0,0,0]
[2.0499999999999998,1,null,0,null,-88.558858737058799,-177.11771747411765,319.7791729416054,null,null,null,0,0,0,0]
[2.0499999999999998,1,null,0,null,-88.558858737058799,-177.11771747411765,319.7791729416054,null,null,null,0,0,0,0]
[2.0499999999999998,1,null,0,null,-88.558858737058799,-177.11771747411765,319.7791729416054,null,null,null,0,0,0,0]
[2.0499999999999998,1,null,0,null,-88.558858737058799,-177.11771747411765,319.7791729416054,null,null,null,0,0,0,0]
[2.0499999999999998,1,null,0,null,-88.558858737058799,-177.11771747411765,319.7791729416054,null,null,null,0,0,0,0]
[2.0499999999999998,1,null,0,null,-88.558858737058799,-177.11771747411765,319.7791729416054,null,null,null,0,0,0,0]
[2.0499999999999998,1,null,0,null,-88.558858737058799,-177.11771747411765,319.7791729416054,null,null,null,0,0,0,0]
[2.0499999999999998,1,null,0,null,-88.558858737058799,-177.11771747411765,319.7791729416054,null,null,null,0,0,0,0]
[2.0499999999999998,1,null,0,null,-88.558858737058799,-177.11771747411765,319.7791729416054,null,null,null,0,0,0,0]
[2.0499999999999998,1,null,0,null,-88.558858737058799,-177.11771747411765,319.7791729416054,null,null,null,0,0,0,0]
[2.0499999999999998,1,null,0,null,-88.558858737058799,-177.11771747411765,319.7791729416054,null,null,null,0,0,0,0]
[2.0499999999999998,1,null,0,null,-88.558858737058799,-177.11771747411765,319.7791729416054,null,null,null,0,0,0,0]
[2.0499999999999998,1,null,0,null,-88.558858737058799,-177.11771747411765,319.7791729416054,null,null,null,0,0,0,0]
[2.0499999999999998,1,null,0,null,-88.558858737058799,-177.11771747411765,319.7791729416054,null,null,null,0,0,0,0]
[2.0499999999999998,1,null,0,null,-88.558858737058799,-177.11771747411765,319.7791729416054,null,null,null,0,0,0,0]
[2.0499999999999998,1,null,0,null,-88.558858737058799,-177.11771747411765,319.7791729416054,null,null,null,0,0,0,0]
[2.0499999999999998,1,null,0,null,-88.558858737058799,-177.11771747411765,319.7791729416054,null,null,null,0,0,0,0]
[2.0499999999999998,1,null,0,null,-88.558858737058799,-177.11771747411765,319.7791729416054,null,null,null,0,0,0,0]
[2.0499999999999998,1,null,0,null,-88.558858737058799,-177.11771747411765,319.7791729416054,null,null,null,0,0,0,0]
[2.0499999999999998,1,null,0,null,-88.558858737058799,-177.11771747411765,319.7791729416054,null,null,null,0,0,0,0]
[2.0499999999999998,1,null,0,null,-88.558858737058799,-177.11771747411765,319.7791729416054,null,null,null,0,0,0,0]
[2.0499999999999998,1,null,0,null,-88.558858737058799,-177.11771747411765,319.7791729416054,null,null,null,0,0,0,0]
[2.0499999999999998,1,null,0,null,-88.558858737058799,-177.11771747411765,319.7791729416054,null,null,null,0,0,0,0]
[2.0499999999999998,1,null,0,null,-88.558858737058799,-177.11771747411765,319.7791729416054,null,null,null,0,0,0,0]
[2.0499999999999998,1,null,0,null,-88.558858737058799,-177.11771747411765,319.7791729416054,null,null,null,0,0,0,0]
[2.0499999999999998,1,null,0,null,-88.558858737058799,-177.11771747411765,319.7791729416054,null,null,null,0,0,0,0]
[2.0499999999999998,1,null,0,null,-88.558858737058799,-177.11771747411765,319.7791729416054,null,null,null,0,0,0,0]
[2.0499999999999998,1,null,0,null,-88.558858737058799,-177.11771747411765,319.7791729416054,null,null,null,0,0,0,0]
[2.0499999999999998,1,null,0,null,-88.558858737058799,-177.11771747411765,319.7791729416054,null,null,null,0,0,0,0]
[2.0499999999999998,1,null,0,null,-88.558858737058799,-177.11771747411765,319.7791729416054,null,null,null,0,0,0,0]
[2.0499999999999998,1,null,0,null,-88.558858737058799,-177.11771747411765,319.7791729416054,null,null,null,0,0,0,0]
[2.0499999999999998,1,null,0,null,-88.558858737058799,-177.11771747411765,319.7791729416054,null,null,null,0,0,0,0]
[2.0499999999999998,1,null,0,null,-88.558858737058799,-177.11771747411765,319.7791729416054,null,null,null,0,0,0,0]
[2.0499999999999998,1,null,0,null,-88.558858737058799,-177.11771747411765,319.7791729416054,null,null,null,0,0,0,0]
[2.0499999999999998,1,null,0,null,-88.558858737058799,-177.11771747411765,319.7791729416054,null,null,null,0,0,0,0]
[2.0499999999999998,1,null,0,null,-88.558858737058799,-177.11771747411765,319.7791729416054,null,null,null,0,0,0,0]
[2.0499999999999998,1,null,0,null,-88.558858737058799,-177.11771747411765,319.7791729416054,null,null,null,0,0,0,0]
[2.0499999999999998,1,null,0,null,-88.558858737058799,-177.11771747411765,319.7791729416054,null,null,null,0,0,0,0]
[2.0499999999999998,1,null,0,null,-88.558858737058799,-177.11771747411765,319.7791729416054,null,null,null,0,0,0,0]
[2.0499999999999998,1,null,0,null,-88.558858737058799,-177.11771747411765,319.7791729416054,null,null,null,0,0,0,0]
[2.0499999999999998,1,null,0,null,-88.558858737058799,-177.11771747411765,319.7791729416054,null,null,null,0,0,0,0]
[2.0499999999999998,1,null,0,null,-88.558858737058799,-177.11771747411765,319.7791729416054,null,null,null,0,0,0,0]
[2.0499999999999998,1,null,0,null,-88.558858737058799,-177.11771747411765,319.7791729416054,null,null,null,0,0,0,0]
[2.0499999999999998,1,null,0,null,-88.558858737058799,-177.11771747411765,319.7791729416054,null,null,null,0,0,0,0]
[2.0499999999999998,1,null,0,null,-88.558858737058799,-177.11771747411765,319.7791729416054,null,null,null,0,0,0,0]
[2.0499999999999998,1,null,0,null,-88.558858737058799,-177.11771747411765,319.7791729416054,null,null,null,0,0,0,0]
[2.0499999999999998,1,null,0,null,-88.558858737058799,-177.11771747411765,319.7791729416054,null,null,null,0,0,0,0]
[2.0499999999999998,1,null,0,null,-88.558858737058799,-177.11771747411765,319.7791729416054,null,null,null,0,0,0,0]
[2.0499999999999998,1,null,0,null,-88.558858737058799,-177.11771747411765,319.7791729416054,null,null,null,0,0,0,0]
[2.0499999999999998,1,null,0,null,-88.558858737058799,-177.11771747411765,319.7791729416054,null,null,null,0,0,0,0]
[2.0499999999999998,1,null,0,null,-88.558858737058799,-177.11771747411765,319.7791729416054,null,null,null,0,0,0,0]
[2.0499999999999998,1,null,0,null,-88.558858737058799,-177.11771747411765,319.7791729416054,null,null,null,0,0,0,0]
[2.0499999999999998,1,null,0,null,-88.558858737058799,-177.11771747411765,319.7791729416054,null,null,null,{"$f":"IF($L$21=PartNum,IF(PartType=\"Omnipolar switch\",IF(ABS(H323)>BRP_Typ,0,VOH),\nIF(PartType=\"Unipolar switch\",IF(H323>BRP_Typ,0,VOH),\nIF(PartType=\"Latch\",IF(H323<BRP_Typ,VOH,0),\nIF(PartType=\"Ratiometric PWM output\", IF(50+GAIN*H323<5.3,5.3,IF(50+GAIN*H323>94.7,94.7,50+GAIN*H323)),\nIF(OR(PartType=\"Ratiometric unipolar\",PartType=\"Ratiometric bipolar\",PartType=\"Bipolar\"),IF(AND(VQ+H323*GAIN/1000<=VOH,VQ+H323*GAIN/1000>=VOL),VQ+H323*GAIN/1000,IF(VQ+H323*GAIN/1000>VOH,VOH,VOL))))))),0)","v":0},{"$f":"IF($L$21=PartNum,IF(PartType=\"Omnipolar switch\",IF(ABS(H323)>BOP_Typ,0,VOH),\nIF(PartType=\"Unipolar switch\",IF(H323>BOP_Typ,0,VOH),\nIF(PartType=\"Latch\",IF(H323<BOP_Typ,VOH,0),\"\"))),0)","v":0},{"$f":"IF(PartType=\"Omnipolar switch\",IF(ABS(H323)>BOP_Max,0,VOH),IF(PartType=\"Unipolar switch\",IF(H323>BOP_Max,0,VOH),\"\"))","v":0},{"$f":"IF(PartType=\"Omnipolar switch\",IF(ABS(H323)>BRP_Min,0,VOH),IF(PartType=\"Unipolar switch\",IF(H323>BRP_Min,0,VOH),\"\"))","v":0}]
[2.0499999999999998,1,null,0,null,-88.558858737058799,-177.11771747411765,319.7791729416054,null,null,null,0,0,0,0]
[2.0499999999999998,1,null,0,null,-88.558858737058799,-177.11771747411765,319.7791729416054,null,null,null,0,0,0,0]
[2.0499999999999998,1,null,0,null,-88.558858737058799,-177.11771747411765,319.7791729416054,null,null,null,0,0,0,0]
[2.0499999999999998,1,null,0,null,-88.558858737058799,-177.11771747411765,319.7791729416054,null,null,null,0,0,0,0]
[2.0499999999999998,1,null,0,null,-88.558858737058799,-177.11771747411765,319.7791729416054,null,null,null,0,0,0,0]
[2.0499999999999998,1,null,0,null,-88.558858737058799,-177.11771747411765,319.7791729416054,null,null,null,0,0,0,0]
[2.0499999999999998,1,null,0,null,-88.558858737058799,-177.11771747411765,319.7791729416054,null,null,null,0,0,0,0]
[2.0499999999999998,1,null,0,null,-88.558858737058799,-177.11771747411765,319.7791729416054,null,null,null,0,0,0,0]
[2.0499999999999998,1,null,0,null,-88.558858737058799,-177.11771747411765,319.7791729416054,null,null,null,0,0,0,0]
[2.0499999999999998,1,null,0,null,-88.558858737058799,-177.11771747411765,319.7791729416054,null,null,null,0,0,0,0]
[2.0499999999999998,1,null,0,null,-88.558858737058799,-177.11771747411765,319.7791729416054,null,null,null,0,0,0,0]
[2.0499999999999998,1,null,0,null,-88.558858737058799,-177.11771747411765,319.7791729416054,null,null,null,0,0,0,0]
[2.0499999999999998,1,null,0,null,-88.558858737058799,-177.11771747411765,319.7791729416054,null,null,null,0,0,0,0]
[2.0499999999999998,1,null,0,null,-88.558858737058799,-177.11771747411765,319.7791729416054,null,null,null,0,0,0,0]
[2.0499999999999998,1,null,0,null,-88.558858737058799,-177.11771747411765,319.7791729416054,null,null,null,0,0,0,0]
[2.0499999999999998,1,null,0,null,-88.558858737058799,-177.11771747411765,319.7791729416054,null,null,null,0,0,0,0]
[2.0499999999999998,1,null,0,null,-88.558858737058799,-177.11771747411765,319.7791729416054,null,null,null,0,0,0,0]
[2.0499999999999998,1,null,0,null,-88.558858737058799,-177.11771747411765,319.7791729416054,null,null,null,0,0,0,0]
[2.0499999999999998,1,null,0,null,-88.558858737058799,-177.11771747411765,319.7791729416054,null,null,null,0,0,0,0]
[2.0499999999999998,1,null,0,null,-88.558858737058799,-177.11771747411765,319.7791729416054,null,null,null,0,0,0,0]
[2.0499999999999998,1,null,0,null,-88.558858737058799,-177.11771747411765,319.7791729416054,null,null,null,0,0,0,0]
[2.0499999999999998,1,null,0,null,-88.558858737058799,-177.11771747411765,319.7791729416054,null,null,null,0,0,0,0]
[2.0499999999999998,1,null,0,null,-88.558858737058799,-177.11771747411765,319.7791729416054,null,null,null,0,0,0,0]
[2.0499999999999998,1,null,0,null,-88.558858737058799,-177.11771747411765,319.7791729416054,null,null,null,0,0,0,0]
[2.0499999999999998,1,null,0,null,-88.558858737058799,-177.11771747411765,319.7791729416054,null,null,null,0,0,0,0]
[2.0499999999999998,1,null,0,null,-88.558858737058799,-177.11771747411765,319.7791729416054,null,null,null,0,0,0,0]
[2.0499999999999998,1,null,0,null,-88.558858737058799,-177.11771747411765,319.7791729416054,null,null,null,0,0,0,0]
[2.0499999999999998,1,null,0,null,-88.558858737058799,-177.11771747411765,319.7791729416054,null,null,null,0,0,0,0]
[2.0499999999999998,1,null,0,null,-88.558858737058799,-177.11771747411765,319.7791729416054,null,null,null,0,0,0,0]
[2.0499999999999998,1,null,0,null,-88.558858737058799,-177.11771747411765,319.7791729416054,null,null,null,0,0,0,0]
[2.0499999999999998,1,null,0,null,-88.558858737058799,-177.11771747411765,319.7791729416054,null,null,null,0,0,0,0]
[2.0499999999999998,1,null,0,null,-88.558858737058799,-177.11771747411765,319.7791729416054,null,null,null,0,0,0,0]
[2.0499999999999998,1,null,0,null,-88.558858737058799,-177.11771747411765,319.7791729416054,null,null,null,0,0,0,0]
[2.0499999999999998,1,null,0,null,-88.558858737058799,-177.11771747411765,319.7791729416054,null,null,null,0,0,0,0]
[2.0499999999999998,1,null,0,null,-88.558858737058799,-177.11771747411765,319.7791729416054,null,null,null,0,0,0,0]
[2.0499999999999998,1,null,0,null,-88.558858737058799,-177.11771747411765,319.7791729416054,null,null,null,0,0,0,0]
[2.0499999999999998,1,null,0,null,-88.558858737058799,-177.11771747411765,319.7791729416054,null,null,null,0,0,0,0]
[2.0499999999999998,1,null,0,null,-88.558858737058799,-177.11771747411765,319.7791729416054,null,null,null,0,0,0,0]
[2.0499999999999998,1,null,0,null,-88.558858737058799,-177.11771747411765,319.7791729416054,null,null,null,0,0,0,0]
[2.0499999999999998,1,null,0,null,-88.558858737058799,-177.11771747411765,319.7791729416054,null,null,null,0,0,0,0]
[2.0499999999999998,1,null,0,null,-88.558858737058799,-177.11771747411765,319.7791729416054,null,null,null,0,0,0,0]
[2.0499999999999998,1,null,0,null,-88.558858737058799,-177.11771747411765,319.7791729416054,null,null,null,0,0,0,0]
[2.0499999999999998,1,null,0,null,-88.558858737058799,-177.11771747411765,319.7791729416054,null,null,null,0,0,0,0]
[2.0499999999999998,1,null,0,null,-88.558858737058799,-177.11771747411765,319.7791729416054,null,null,null,0,0,0,0]
[2.0499999999999998,1,null,0,null,-88.558858737058799,-177.11771747411765,319.7791729416054,null,null,null,0,0,0,0]
[2.0499999999999998,1,null,0,null,-88.558858737058799,-177.11771747411765,319.7791729416054,null,null,null,0,0,0,0]
[2.0499999999999998,1,null,0,null,-88.558858737058799,-177.11771747411765,319.7791729416054,null,null,null,0,0,0,0]
[2.0499999999999998,1,null,0,null,-88.558858737058799,-177.11771747411765,319.7791729416054,null,null,null,0,0,0,0]
[2.0499999999999998,1,null,0,null,-88.558858737058799,-177.11771747411765,319.7791729416054,null,null,null,0,0,0,0]
[2.0499999999999998,1,null,0,null,-88.558858737058799,-177.11771747411765,319.7791729416054,null,null,null,0,0,0,0]
[2.0499999999999998,1,null,0,null,-88.558858737058799,-177.11771747411765,319.7791729416054,null,null,null,0,0,0,0]
[2.0499999999999998,1,null,0,null,-88.558858737058799,-177.11771747411765,319.7791729416054,null,null,null,0,0,0,0]
[2.0499999999999998,1,null,0,null,-88.558858737058799,-177.11771747411765,319.7791729416054,null,null,null,0,0,0,0]
[2.0499999999999998,1,null,0,null,-88.558858737058799,-177.11771747411765,319.7791729416054,null,null,null,0,0,0,0]
[2.0499999999999998,1,null,0,null,-88.558858737058799,-177.11771747411765,319.7791729416054,null,null,null,0,0,0,0]
[2.0499999999999998,1,null,0,null,-88.558858737058799,-177.11771747411765,319.7791729416054,null,null,null,0,0,0,0]
[2.0499999999999998,1,null,0,null,-88.558858737058799,-177.11771747411765,319.7791729416054,null,null,null,0,0,0,0]
[2.0499999999999998,1,null,0,null,-88.558858737058799,-177.11771747411765,319.7791729416054,null,null,null,0,0,0,0]
[2.0499999999999998,1,null,0,null,-88.558858737058799,-177.11771747411765,319.7791729416054,null,null,null,0,0,0,0]
[2.0499999999999998,1,null,0,null,-88.558858737058799,-177.11771747411765,319.7791729416054,null,null,null,0,0,0,0]
[2.0499999999999998,1,null,0,null,-88.558858737058799,-177.11771747411765,319.7791729416054,null,null,null,0,0,0,0]
[2.0499999999999998,1,null,0,null,-88.558858737058799,-177.11771747411765,319.7791729416054,null,null,null,0,0,0,0]
[2.0499999999999998,1,null,0,null,-88.558858737058799,-177.11771747411765,319.7791729416054,null,null,null,0,0,0,0]
[2.0499999999999998,1,null,0,null,-88.558858737058799,-177.11771747411765,319.7791729416054,null,null,null,{"$f":"IF($L$21=PartNum,IF(PartType=\"Omnipolar switch\",IF(ABS(H387)>BRP_Typ,0,VOH),\nIF(PartType=\"Unipolar switch\",IF(H387>BRP_Typ,0,VOH),\nIF(PartType=\"Latch\",IF(H387<BRP_Typ,VOH,0),\nIF(PartType=\"Ratiometric PWM output\", IF(50+GAIN*H387<5.3,5.3,IF(50+GAIN*H387>94.7,94.7,50+GAIN*H387)),\nIF(OR(PartType=\"Ratiometric unipolar\",PartType=\"Ratiometric bipolar\",PartType=\"Bipolar\"),IF(AND(VQ+H387*GAIN/1000<=VOH,VQ+H387*GAIN/1000>=VOL),VQ+H387*GAIN/1000,IF(VQ+H387*GAIN/1000>VOH,VOH,VOL))))))),0)","v":0},{"$f":"IF($L$21=PartNum,IF(PartType=\"Omnipolar switch\",IF(ABS(H387)>BOP_Typ,0,VOH),\nIF(PartType=\"Unipolar switch\",IF(H387>BOP_Typ,0,VOH),\nIF(PartType=\"Latch\",IF(H387<BOP_Typ,VOH,0),\"\"))),0)","v":0},{"$f":"IF(PartType=\"Omnipolar switch\",IF(ABS(H387)>BOP_Max,0,VOH),IF(PartType=\"Unipolar switch\",IF(H387>BOP_Max,0,VOH),\"\"))","v":0},{"$f":"IF(PartType=\"Omnipolar switch\",IF(ABS(H387)>BRP_Min,0,VOH),IF(PartType=\"Unipolar switch\",IF(H387>BRP_Min,0,VOH),\"\"))","v":0}]
[2.0499999999999998,1,null,0,null,-88.558858737058799,-177.11771747411765,319.7791729416054,null,null,null,0,0,0,0]
[2.0499999999999998,1,null,0,null,-88.558858737058799,-177.11771747411765,319.7791729416054,null,null,null,0,0,0,0]
[2.0499999999999998,1,null,0,null,-88.558858737058799,-177.11771747411765,319.7791729416054,null,null,null,0,0,0,0]
[2.0499999999999998,1,null,0,null,-88.558858737058799,-177.11771747411765,319.7791729416054,null,null,null,0,0,0,0]
[2.0499999999999998,1,null,0,null,-88.558858737058799,-177.11771747411765,319.7791729416054,null,null,null,0,0,0,0]
[2.0499999999999998,1,null,0,null,-88.558858737058799,-177.11771747411765,319.7791729416054,null,null,null,0,0,0,0]
[2.0499999999999998,1,null,0,null,-88.558858737058799,-177.11771747411765,319.7791729416054,null,null,null,0,0,0,0]
[2.0499999999999998,1,null,0,null,-88.558858737058799,-177.11771747411765,319.7791729416054,null,null,null,0,0,0,0]
[2.0499999999999998,1,null,0,null,-88.558858737058799,-177.11771747411765,319.7791729416054,null,null,null,0,0,0,0]
[2.0499999999999998,1,null,0,null,-88.558858737058799,-177.11771747411765,319.7791729416054,null,null,null,0,0,0,0]
[2.0499999999999998,1,null,0,null,-88.558858737058799,-177.11771747411765,319.7791729416054,null,null,null,0,0,0,0]
[2.0499999999999998,1,null,0,null,-88.558858737058799,-177.11771747411765,319.7791729416054,null,null,null,0,0,0,0]
[2.0499999999999998,1,null,0,null,-88.558858737058799,-177.11771747411765,319.7791729416054,null,null,null,0,0,0,0]
[2.0499999999999998,1,null,0,null,-88.558858737058799,-177.11771747411765,319.7791729416054,null,null,null,0,0,0,0]
[2.0499999999999998,1,null,0,null,-88.558858737058799,-177.11771747411765,319.7791729416054,null,null,null,0,0,0,0]
[2.0499999999999998,1,null,0,null,-88.558858737058799,-177.11771747411765,319.7791729416054,null,null,null,0,0,0,0]
[2.0499999999999998,1,null,0,null,-88.558858737058799,-177.11771747411765,319.7791729416054,null,null,null,0,0,0,0]
[2.0499999999999998,1,null,0,null,-88.558858737058799,-177.11771747411765,319.7791729416054,null,null,null,0,0,0,0]
[2.0499999999999998,1,null,0,null,-88.558858737058799,-177.11771747411765,319.7791729416054,null,null,null,0,0,0,0]
[2.0499999999999998,1,null,0,null,-88.558858737058799,-177.11771747411765,319.7791729416054,null,null,null,0,0,0,0]
[2.0499999999999998,1,null,0,null,-88.558858737058799,-177.11771747411765,319.7791729416054,null,null,null,0,0,0,0]
[2.0499999999999998,1,null,0,null,-88.558858737058799,-177.11771747411765,319.7791729416054,null,null,null,0,0,0,0]
[2.0499999999999998,1,null,0,null,-88.558858737058799,-177.11771747411765,319.7791729416054,null,null,null,0,0,0,0]
[2.0499999999999998,1,null,0,null,-88.558858737058799,-177.11771747411765,319.7791729416054,null,null,null,0,0,0,0]
[2.0499999999999998,1,null,0,null,-88.558858737058799,-177.11771747411765,319.7791729416054,null,null,null,0,0,0,0]
[2.0499999999999998,1,null,0,null,-88.558858737058799,-177.11771747411765,319.7791729416054,null,null,null,0,0,0,0]
[2.0499999999999998,1,null,0,null,-88.558858737058799,-177.11771747411765,319.7791729416054,null,null,null,0,0,0,0]
[2.0499999999999998,1,null,0,null,-88.558858737058799,-177.11771747411765,319.7791729416054,null,null,null,0,0,0,0]
[2.0499999999999998,1,null,0,null,-88.558858737058799,-177.11771747411765,319.7791729416054,null,null,null,0,0,0,0]
[2.0499999999999998,1,null,0,null,-88.558858737058799,-177.11771747411765,319.7791729416054,null,null,null,0,0,0,0]
[2.0499999999999998,1,null,0,null,-88.558858737058799,-177.11771747411765,319.7791729416054,null,null,null,0,0,0,0]
[2.0499999999999998,1,null,0,null,-88.558858737058799,-177.11771747411765,319.7791729416054,null,null,null,0,0,0,0]
[2.0499999999999998,1,null,0,null,-88.558858737058799,-177.11771747411765,319.7791729416054,null,null,null,0,0,0,0]
[2.0499999999999998,1,null,0,null,-88.558858737058799,-177.11771747411765,319.7791729416054,null,null,null,0,0,0,0]
[2.0499999999999998,1,null,0,null,-88.558858737058799,-177.11771747411765,319.7791729416054,null,null,null,0,0,0,0]
[2.0499999999999998,1,null,0,null,-88.558858737058799,-177.11771747411765,319.7791729416054,null,null,null,0,0,0,0]
[2.0499999999999998,1,null,0,null,-88.558858737058799,-177.11771747411765,319.7791729416054,null,null,null,0,0,0,0]
[2.0499999999999998,1,null,0,null,-88.558858737058799,-177.11771747411765,319.7791729416054,null,null,null,0,0,0,0]
[2.0499999999999998,1,null,0,null,-88.558858737058799,-177.11771747411765,319.7791729416054,null,null,null,0,0,0,0]
[2.0499999999999998,1,null,0,null,-88.558858737058799,-177.11771747411765,319.7791729416054,null,null,null,0,0,0,0]
[2.0499999999999998,1,null,0,null,-88.558858737058799,-177.11771747411765,319.7791729416054,null,null,null,0,0,0,0]
[2.0499999999999998,1,null,0,null,-88.558858737058799,-177.11771747411765,319.7791729416054,null,null,null,0,0,0,0]
[2.0499999999999998,1,null,0,null,-88.558858737058799,-177.11771747411765,319.7791729416054,null,null,null,0,0,0,0]
[2.0499999999999998,1,null,0,null,-88.558858737058799,-177.11771747411765,319.7791729416054,null,null,null,0,0,0,0]
[2.0499999999999998,1,null,0,null,-88.558858737058799,-177.11771747411765,319.7791729416054,null,null,null,0,0,0,0]
[2.0499999999999998,1,null,0,null,-88.558858737058799,-177.11771747411765,319.7791729416054,null,null,null,0,0,0,0]
[2.0499999999999998,1,null,0,null,-88.558858737058799,-177.11771747411765,319.7791729416054,null,null,null,0,0,0,0]
[2.0499999999999998,1,null,0,null,-88.558858737058799,-177.11771747411765,319.7791729416054,null,null,null,0,0,0,0]
[2.0499999999999998,1,null,0,null,-88.558858737058799,-177.11771747411765,319.7791729416054,null,null,null,0,0,0,0]
[2.0499999999999998,1,null,0,null,-88.558858737058799,-177.11771747411765,319.7791729416054,null,null,null,0,0,0,0]
[2.0499999999999998,1,null,0,null,-88.558858737058799,-177.11771747411765,319.7791729416054,null,null,null,0,0,0,0]
[2.0499999999999998,1,null,0,null,-88.558858737058799,-177.11771747411765,319.7791729416054,null,null,null,0,0,0,0]
[2.0499999999999998,1,null,0,null,-88.558858737058799,-177.11771747411765,319.7791729416054,null,null,null,0,0,0,0]
[2.0499999999999998,1,null,0,null,-88.558858737058799,-177.11771747411765,319.7791729416054,null,null,null,0,0,0,0]
[2.0499999999999998,1,null,0,null,-88.558858737058799,-177.11771747411765,319.7791729416054,null,null,null,0,0,0,0]
[2.0499999999999998,1,null,0,null,-88.558858737058799,-177.11771747411765,319.7791729416054,null,null,null,0,0,0,0]
[2.0499999999999998,1,null,0,null,-88.558858737058799,-177.11771747411765,319.7791729416054,null,null,null,0,0,0,0]
[2.0499999999999998,1,null,0,null,-88.558858737058799,-177.11771747411765,319.7791729416054,null,null,null,0,0,0,0]
[2.0499999999999998,1,null,0,null,-88.558858737058799,-177.11771747411765,319.7791729416054,null,null,null,0,0,0,0]
[2.0499999999999998,1,null,0,null,-88.558858737058799,-177.11771747411765,319.7791729416054,null,null,null,0,0,0,0]
[2.0499999999999998,1,null,0,null,-88.558858737058799,-177.11771747411765,319.7791729416054,null,null,null,0,0,0,0]
[2.0499999999999998,1,null,0,null,-88.558858737058799,-177.11771747411765,319.7791729416054,null,null,null,0,0,0,0]
[2.0499999999999998,1,null,0,null,-88.558858737058799,-177.11771747411765,319.7791729416054,null,null,null,0,0,0,0]
[2.0499999999999998,1,null,0,null,-88.558858737058799,-177.11771747411765,319.7791729416054,null,null,null,{"$f":"IF($L$21=PartNum,IF(PartType=\"Omnipolar switch\",IF(ABS(H451)>BRP_Typ,0,VOH),\nIF(PartType=\"Unipolar switch\",IF(H451>BRP_Typ,0,VOH),\nIF(PartType=\"Latch\",IF(H451<BRP_Typ,VOH,0),\nIF(PartType=\"Ratiometric PWM output\", IF(50+GAIN*H451<5.3,5.3,IF(50+GAIN*H451>94.7,94.7,50+GAIN*H451)),\nIF(OR(PartType=\"Ratiometric unipolar\",PartType=\"Ratiometric bipolar\",PartType=\"Bipolar\"),IF(AND(VQ+H451*GAIN/1000<=VOH,VQ+H451*GAIN/1000>=VOL),VQ+H451*GAIN/1000,IF(VQ+H451*GAIN/1000>VOH,VOH,VOL))))))),0)","v":0},{"$f":"IF($L$21=PartNum,IF(PartType=\"Omnipolar switch\",IF(ABS(H451)>BOP_Typ,0,VOH),\nIF(PartType=\"Unipolar switch\",IF(H451>BOP_Typ,0,VOH),\nIF(PartType=\"Latch\",IF(H451<BOP_Typ,VOH,0),\"\"))),0)","v":0},{"$f":"IF(PartType=\"Omnipolar switch\",IF(ABS(H451)>BOP_Max,0,VOH),IF(PartType=\"Unipolar switch\",IF(H451>BOP_Max,0,VOH),\"\"))","v":0},{"$f":"IF(PartType=\"Omnipolar switch\",IF(ABS(H451)>BRP_Min,0,VOH),IF(PartType=\"Unipolar switch\",IF(H451>BRP_Min,0,VOH),\"\"))","v":0}]
[2.0499999999999998,1,null,0,null,-88.558858737058799,-177.11771747411765,319.7791729416054,null,null,null,0,0,0,0]
[2.0499999999999998,1,null,0,null,-88.558858737058799,-177.11771747411765,319.7791729416054,null,null,null,0,0,0,0]
[2.0499999999999998,1,null,0,null,-88.558858737058799,-177.11771747411765,319.7791729416054,null,null,null,0,0,0,0]
[2.0499999999999998,1,null,0,null,-88.558858737058799,-177.11771747411765,319.7791729416054,null,null,null,0,0,0,0]
[2.0499999999999998,1,null,0,null,-88.558858737058799,-177.11771747411765,319.7791729416054,null,null,null,0,0,0,0]
[2.0499999999999998,1,null,0,null,-88.558858737058799,-177.11771747411765,319.7791729416054,null,null,null,0,0,0,0]
[2.0499999999999998,1,null,0,null,-88.558858737058799,-177.11771747411765,319.7791729416054,null,null,null,0,0,0,0]
[2.0499999999999998,1,null,0,null,-88.558858737058799,-177.11771747411765,319.7791729416054,null,null,null,0,0,0,0]
[2.0499999999999998,1,null,0,null,-88.558858737058799,-177.11771747411765,319.7791729416054,null,null,null,0,0,0,0]
[2.0499999999999998,1,null,0,null,-88.558858737058799,-177.11771747411765,319.7791729416054,null,null,null,0,0,0,0]
[2.0499999999999998,1,null,0,null,-88.558858737058799,-177.11771747411765,319.7791729416054,null,null,null,0,0,0,0]
[2.0499999999999998,1,null,0,null,-88.558858737058799,-177.11771747411765,319.7791729416054,null,null,null,0,0,0,0]
[2.0499999999999998,1,null,0,null,-88.558858737058799,-177.11771747411765,319.7791729416054,null,null,null,0,0,0,0]
[2.0499999999999998,1,null,0,null,-88.558858737058799,-177.11771747411765,319.7791729416054,null,null,null,0,0,0,0]
[2.0499999999999998,1,null,0,null,-88.558858737058799,-177.11771747411765,319.7791729416054,null,null,null,0,0,0,0]
[2.0499999999999998,1,null,0,null,-88.558858737058799,-177.11771747411765,319.7791729416054,null,null,null,0,0,0,0]
[2.0499999999999998,1,null,0,null,-88.558858737058799,-177.11771747411765,319.7791729416054,null,null,null,0,0,0,0]
[2.0499999999999998,1,null,0,null,-88.558858737058799,-177.11771747411765,319.7791729416054,null,null,null,0,0,0,0]
[2.0499999999999998,1,null,0,null,-88.558858737058799,-177.11771747411765,319.7791729416054,null,null,null,0,0,0,0]
[2.0499999999999998,1,null,0,null,-88.558858737058799,-177.11771747411765,319.7791729416054,null,null,null,0,0,0,0]
[2.0499999999999998,1,null,0,null,-88.558858737058799,-177.11771747411765,319.7791729416054,null,null,null,0,0,0,0]
[2.0499999999999998,1,null,0,null,-88.558858737058799,-177.11771747411765,319.7791729416054,null,null,null,0,0,0,0]
[2.0499999999999998,1,null,0,null,-88.558858737058799,-177.11771747411765,319.7791729416054,null,null,null,0,0,0,0]
[2.0499999999999998,1,null,0,null,-88.558858737058799,-177.11771747411765,319.7791729416054,null,null,null,0,0,0,0]
[2.0499999999999998,1,null,0,null,-88.558858737058799,-177.11771747411765,319.7791729416054,null,null,null,0,0,0,0]
[2.0499999999999998,1,null,0,null,-88.558858737058799,-177.11771747411765,319.7791729416054,null,null,null,0,0,0,0]
[2.0499999999999998,1,null,0,null,-88.558858737058799,-177.11771747411765,319.7791729416054,null,null,null,0,0,0,0]
[2.0499999999999998,1,null,0,null,-88.558858737058799,-177.11771747411765,319.7791729416054,null,null,null,0,0,0,0]
[2.0499999999999998,1,null,0,null,-88.558858737058799,-177.11771747411765,319.7791729416054,null,null,null,0,0,0,0]
[2.0499999999999998,1,null,0,null,-88.558858737058799,-177.11771747411765,319.7791729416054,null,null,null,0,0,0,0]
[2.0499999999999998,1,null,0,null,-88.558858737058799,-177.11771747411765,319.7791729416054,null,null,null,0,0,0,0]
[2.0499999999999998,1,null,0,null,-88.558858737058799,-177.11771747411765,319.7791729416054,null,null,null,0,0,0,0]
[2.0499999999999998,1,null,0,null,-88.558858737058799,-177.11771747411765,319.7791729416054,null,null,null,0,0,0,0]
[2.0499999999999998,1,null,0,null,-88.558858737058799,-177.11771747411765,319.7791729416054,null,null,null,0,0,0,0]
[2.0499999999999998,1,null,0,null,-88.558858737058799,-177.11771747411765,319.7791729416054,null,null,null,0,0,0,0]
[2.0499999999999998,1,null,0,null,-88.558858737058799,-177.11771747411765,319.7791729416054,null,null,null,0,0,0,0]
[2.0499999999999998,1,null,0,null,-88.558858737058799,-177.11771747411765,319.7791729416054,null,null,null,0,0,0,0]
[2.0499999999999998,1,null,0,null,-88.558858737058799,-177.11771747411765,319.7791729416054,null,null,null,0,0,0,0]
[2.0499999999999998,1,null,0,null,-88.558858737058799,-177.11771747411765,319.7791729416054,null,null,null,0,0,0,0]
[2.0499999999999998,1,null,0,null,-88.558858737058799,-177.11771747411765,319.7791729416054,null,null,null,0,0,0,0]
[2.0499999999999998,1,null,0,null,-88.558858737058799,-177.11771747411765,319.7791729416054,null,null,null,0,0,0,0]
[2.0499999999999998,1,null,0,null,-88.558858737058799,-177.11771747411765,319.7791729416054,null,null,null,0,0,0,0]
[2.0499999999999998,1,null,0,null,-88.558858737058799,-177.11771747411765,319.7791729416054,null,null,null,0,0,0,0]
[2.0499999999999998,1,null,0,null,-88.558858737058799,-177.11771747411765,319.7791729416054,null,null,null,0,0,0,0]
[2.0499999999999998,1,null,0,null,-88.558858737058799,-177.11771747411765,319.7791729416054,null,null,null,0,0,0,0]
[2.0499999999999998,1,null,0,null,-88.558858737058799,-177.11771747411765,319.7791729416054,null,null,null,0,0,0,0]
[2.0499999999999998,1,null,0,null,-88.558858737058799,-177.11771747411765,319.7791729416054,null,null,null,0,0,0,0]
[2.0499999999999998,1,null,0,null,-88.558858737058799,-177.11771747411765,319.7791729416054,null,null,null,0,0,0,0]
[2.0499999999999998,1,null,0,null,-88.558858737058799,-177.11771747411765,319.7791729416054,null,null,null,0,0,0,0]
[2.0499999999999998,1,null,0,null,-88.558858737058799,-177.11771747411765,319.7791729416054,null,null,null,0,0,0,0]
[2.0499999999999998,1,null,0,null,-88.558858737058799,-177.11771747411765,319.7791729416054,null,null,null,0,0,0,0]
[2.0499999999999998,1,null,0,null,-88.558858737058799,-177.11771747411765,319.7791729416054,null,null,null,0,0,0,0]
[2.0499999999999998,1,null,0,null,-88.558858737058799,-177.11771747411765,319.7791729416054,null,null,null,0,0,0,0]
[2.0499999999999998,1,null,0,null,-88.558858737058799,-177.11771747411765,319.7791729416054,null,null,null,0,0,0,0]
[2.0499999999999998,1,null,0,null,-88.558858737058799,-177.11771747411765,319.7791729416054,null,null,null,0,0,0,0]
[2.0499999999999998,1,null,0,null,-88.558858737058799,-177.11771747411765,319.7791729416054,null,null,null,0,0,0,0]
[2.0499999999999998,1,null,0,null,-88.558858737058799,-177.11771747411765,319.7791729416054,null,null,null,0,0,0,0]
[2.0499999999999998,1,null,0,null,-88.558858737058799,-177.11771747411765,319.7791729416054,null,null,null,0,0,0,0]
[2.0499999999999998,1,null,0,null,-88.558858737058799,-177.11771747411765,319.7791729416054,null,null,null,0,0,0,0]
[2.0499999999999998,1,null,0,null,-88.558858737058799,-177.11771747411765,319.7791729416054,null,null,null,0,0,0,0]
[2.0499999999999998,1,null,0,null,-88.558858737058799,-177.11771747411765,319.7791729416054,null,null,null,0,0,0,0]
[2.0499999999999998,1,null,0,null,-88.558858737058799,-177.11771747411765,319.7791729416054,null,null,null,0,0,0,0]
[2.0499999999999998,1,null,0,null,-88.558858737058799,-177.11771747411765,319.7791729416054,null,null,null,0,0,0,0]
[2.0499999999999998,1,null,0,null,-88.558858737058799,-177.11771747411765,319.7791729416054,null,null,null,{"$f":"IF($L$21=PartNum,IF(PartType=\"Omnipolar switch\",IF(ABS(H515)>BRP_Typ,0,VOH),\nIF(PartType=\"Unipolar switch\",IF(H515>BRP_Typ,0,VOH),\nIF(PartType=\"Latch\",IF(H515<BRP_Typ,VOH,0),\nIF(PartType=\"Ratiometric PWM output\", IF(50+GAIN*H515<5.3,5.3,IF(50+GAIN*H515>94.7,94.7,50+GAIN*H515)),\nIF(OR(PartType=\"Ratiometric unipolar\",PartType=\"Ratiometric bipolar\",PartType=\"Bipolar\"),IF(AND(VQ+H515*GAIN/1000<=VOH,VQ+H515*GAIN/1000>=VOL),VQ+H515*GAIN/1000,IF(VQ+H515*GAIN/1000>VOH,VOH,VOL))))))),0)","v":0},{"$f":"IF($L$21=PartNum,IF(PartType=\"Omnipolar switch\",IF(ABS(H515)>BOP_Typ,0,VOH),\nIF(PartType=\"Unipolar switch\",IF(H515>BOP_Typ,0,VOH),\nIF(PartType=\"Latch\",IF(H515<BOP_Typ,VOH,0),\"\"))),0)","v":0},{"$f":"IF(PartType=\"Omnipolar switch\",IF(ABS(H515)>BOP_Max,0,VOH),IF(PartType=\"Unipolar switch\",IF(H515>BOP_Max,0,VOH),\"\"))","v":0},{"$f":"IF(PartType=\"Omnipolar switch\",IF(ABS(H515)>BRP_Min,0,VOH),IF(PartType=\"Unipolar switch\",IF(H515>BRP_Min,0,VOH),\"\"))","v":0}]
[2.0499999999999998,1,null,0,null,-88.558858737058799,-177.11771747411765,319.7791729416054,null,null,null,0,0,0,0]
[2.0499999999999998,1,null,0,null,-88.558858737058799,-177.11771747411765,319.7791729416054,null,null,null,0,0,0,0]
[2.0499999999999998,1,null,0,null,-88.558858737058799,-177.11771747411765,319.7791729416054,null,null,null,0,0,0,0]
[2.0499999999999998,1,null,0,null,-88.558858737058799,-177.11771747411765,319.7791729416054,null,null,null,0,0,0,0]
[2.0499999999999998,1,null,0,null,-88.558858737058799,-177.11771747411765,319.7791729416054,null,null,null,0,0,0,0]
[2.0499999999999998,1,null,0,null,-88.558858737058799,-177.11771747411765,319.7791729416054,null,null,null,0,0,0,0]
[2.0499999999999998,1,null,0,null,-88.558858737058799,-177.11771747411765,319.7791729416054,null,null,null,0,0,0,0]
[2.0499999999999998,1,null,0,null,-88.558858737058799,-177.11771747411765,319.7791729416054,null,null,null,0,0,0,0]
[2.0499999999999998,1,null,0,null,-88.558858737058799,-177.11771747411765,319.7791729416054,null,null,null,0,0,0,0]
[2.0499999999999998,1,null,0,null,-88.558858737058799,-177.11771747411765,319.7791729416054,null,null,null,0,0,0,0]
[2.0499999999999998,1,null,0,null,-88.558858737058799,-177.11771747411765,319.7791729416054,null,null,null,0,0,0,0]
[2.0499999999999998,1,null,0,null,-88.558858737058799,-177.11771747411765,319.7791729416054,null,null,null,0,0,0,0]
[2.0499999999999998,1,null,0,null,-88.558858737058799,-177.11771747411765,319.7791729416054,null,null,null,0,0,0,0]
[2.0499999999999998,1,null,0,null,-88.558858737058799,-177.11771747411765,319.7791729416054,null,null,null,0,0,0,0]
[2.0499999999999998,1,null,0,null,-88.558858737058799,-177.11771747411765,319.7791729416054,null,null,null,0,0,0,0]
[2.0499999999999998,1,null,0,null,-88.558858737058799,-177.11771747411765,319.7791729416054,null,null,null,0,0,0,0]
[2.0499999999999998,1,null,0,null,-88.558858737058799,-177.11771747411765,319.7791729416054,null,null,null,0,0,0,0]
[2.0499999999999998,1,null,0,null,-88.558858737058799,-177.11771747411765,319.7791729416054,null,null,null,0,0,0,0]
[2.0499999999999998,1,null,0,null,-88.558858737058799,-177.11771747411765,319.7791729416054,null,null,null,0,0,0,0]
[2.0499999999999998,1,null,0,null,-88.558858737058799,-177.11771747411765,319.7791729416054,null,null,null,0,0,0,0]
[2.0499999999999998,1,null,0,null,-88.558858737058799,-177.11771747411765,319.7791729416054,null,null,null,0,0,0,0]
[2.0499999999999998,1,null,0,null,-88.558858737058799,-177.11771747411765,319.7791729416054,null,null,null,0,0,0,0]
[2.0499999999999998,1,null,0,null,-88.558858737058799,-177.11771747411765,319.7791729416054,null,null,null,0,0,0,0]
[2.0499999999999998,1,null,0,null,-88.558858737058799,-177.11771747411765,319.7791729416054,null,null,null,0,0,0,0]
[2.0499999999999998,1,null,0,null,-88.558858737058799,-177.11771747411765,319.7791729416054,null,null,null,0,0,0,0]
[2.0499999999999998,1,null,0,null,-88.558858737058799,-177.11771747411765,319.7791729416054,null,null,null,0,0,0,0]
[2.0499999999999998,1,null,0,null,-88.558858737058799,-177.11771747411765,319.7791729416054,null,null,null,0,0,0,0]
[2.0499999999999998,1,null,0,null,-88.558858737058799,-177.11771747411765,319.7791729416054,null,null,null,0,0,0,0]
[2.0499999999999998,1,null,0,null,-88.558858737058799,-177.11771747411765,319.7791729416054,null,null,null,0,0,0,0]
[2.0499999999999998,1,null,0,null,-88.558858737058799,-177.11771747411765,319.7791729416054,null,null,null,0,0,0,0]
[2.0499999999999998,1,null,0,null,-88.558858737058799,-177.11771747411765,319.7791729416054,null,null,null,0,0,0,0]
[2.0499999999999998,1,null,0,null,-88.558858737058799,-177.11771747411765,319.7791729416054,null,null,null,0,0,0,0]
[2.0499999999999998,1,null,0,null,-88.558858737058799,-177.11771747411765,319.7791729416054,null,null,null,0,0,0,0]
[2.0499999999999998,1,null,0,null,-88.558858737058799,-177.11771747411765,319.7791729416054,null,null,null,0,0,0,0]
[2.0499999999999998,1,null,0,null,-88.558858737058799,-177.11771747411765,319.7791729416054,null,null,null,0,0,0,0]
[2.0499999999999998,1,null,0,null,-88.558858737058799,-177.11771747411765,319.7791729416054,null,null,null,0,0,0,0]
[2.0499999999999998,1,null,0,null,-88.558858737058799,-177.11771747411765,319.7791729416054,null,null,null,0,0,0,0]
[2.0499999999999998,1,null,0,null,-88.558858737058799,-177.11771747411765,319.7791729416054,null,null,null,0,0,0,0]
[2.0499999999999998,1,null,0,null,-88.558858737058799,-177.11771747411765,319.7791729416054,null,null,null,0,0,0,0]
[2.0499999999999998,1,null,0,null,-88.558858737058799,-177.11771747411765,319.7791729416054,null,null,null,0,0,0,0]
[2.0499999999999998,1,null,0,null,-88.558858737058799,-177.11771747411765,319.7791729416054,null,null,null,0,0,0,0]
[2.0499999999999998,1,null,0,null,-88.558858737058799,-177.11771747411765,319.7791729416054,null,null,null,0,0,0,0]
[2.0499999999999998,1,null,0,null,-88.558858737058799,-177.11771747411765,319.7791729416054,null,null,null,0,0,0,0]
[2.0499999999999998,1,null,0,null,-88.558858737058799,-177.11771747411765,319.7791729416054,null,null,null,0,0,0,0]
[2.0499999999999998,1,null,0,null,-88.558858737058799,-177.11771747411765,319.7791729416054,null,null,null,0,0,0,0]
[2.0499999999999998,1,null,0,null,-88.558858737058799,-177.11771747411765,319.7791729416054,null,null,null,0,0,0,0]
[2.0499999999999998,1,null,0,null,-88.558858737058799,-177.11771747411765,319.7791729416054,null,null,null,0,0,0,0]
[2.0499999999999998,1,null,0,null,-88.558858737058799,-177.11771747411765,319.7791729416054,null,null,null,0,0,0,0]
[2.0499999999999998,1,null,0,null,-88.558858737058799,-177.11771747411765,319.7791729416054,null,null,null,0,0,0,0]
[2.0499999999999998,1,null,0,null,-88.558858737058799,-177.11771747411765,319.7791729416054,null,null,null,0,0,0,0]
[2.0499999999999998,1,null,0,null,-88.558858737058799,-177.11771747411765,319.7791729416054,null,null,null,0,0,0,0]
[2.0499999999999998,1,null,0,null,-88.558858737058799,-177.11771747411765,319.7791729416054,null,null,null,0,0,0,0]
[2.0499999999999998,1,null,0,null,-88.558858737058799,-177.11771747411765,319.7791729416054,null,null,null,0,0,0,0]
[2.0499999999999998,1,null,0,null,-88.558858737058799,-177.11771747411765,319.7791729416054,null,null,null,0,0,0,0]
[2.0499999999999998,1,null,0,null,-88.558858737058799,-177.11771747411765,319.7791729416054,null,null,null,0,0,0,0]
[2.0499999999999998,1,null,0,null,-88.558858737058799,-177.11771747411765,319.7791729416054,null,null,null,0,0,0,0]
[2.0499999999999998,1,null,0,null,-88.558858737058799,-177.11771747411765,319.7791729416054,null,null,null,0,0,0,0]
[2.0499999999999998,1,null,0,null,-88.558858737058799,-177.11771747411765,319.7791729416054,null,null,null,0,0,0,0]
[2.0499999999999998,1,null,0,null,-88.558858737058799,-177.11771747411765,319.7791729416054,null,null,null,0,0,0,0]
[2.0499999999999998,1,null,0,null,-88.558858737058799,-177.11771747411765,319.7791729416054,null,null,null,0,0,0,0]
[2.0499999999999998,1,null,0,null,-88.558858737058799,-177.11771747411765,319.7791729416054,null,null,null,0,0,0,0]
[2.0499999999999998,1,null,0,null,-88.558858737058799,-177.11771747411765,319.7791729416054,null,null,null,0,0,0,0]
[2.0499999999999998,1,null,0,null,-88.558858737058799,-177.11771747411765,319.7791729416054,null,null,null,0,0,0,0]
[2.0499999999999998,1,null,0,null,-88.558858737058799,-177.11771747411765,319.7791729416054,null,null,null,{"$f":"IF($L$21=PartNum,IF(PartType=\"Omnipolar switch\",IF(ABS(H579)>BRP_Typ,0,VOH),\nIF(PartType=\"Unipolar switch\",IF(H579>BRP_Typ,0,VOH),\nIF(PartType=\"Latch\",IF(H579<BRP_Typ,VOH,0),\nIF(PartType=\"Ratiometric PWM output\", IF(50+GAIN*H579<5.3,5.3,IF(50+GAIN*H579>94.7,94.7,50+GAIN*H579)),\nIF(OR(PartType=\"Ratiometric unipolar\",PartType=\"Ratiometric bipolar\",PartType=\"Bipolar\"),IF(AND(VQ+H579*GAIN/1000<=VOH,VQ+H579*GAIN/1000>=VOL),VQ+H579*GAIN/1000,IF(VQ+H579*GAIN/1000>VOH,VOH,VOL))))))),0)","v":0},{"$f":"IF($L$21=PartNum,IF(PartType=\"Omnipolar switch\",IF(ABS(H579)>BOP_Typ,0,VOH),\nIF(PartType=\"Unipolar switch\",IF(H579>BOP_Typ,0,VOH),\nIF(PartType=\"Latch\",IF(H579<BOP_Typ,VOH,0),\"\"))),0)","v":0},{"$f":"IF(PartType=\"Omnipolar switch\",IF(ABS(H579)>BOP_Max,0,VOH),IF(PartType=\"Unipolar switch\",IF(H579>BOP_Max,0,VOH),\"\"))","v":0},{"$f":"IF(PartType=\"Omnipolar switch\",IF(ABS(H579)>BRP_Min,0,VOH),IF(PartType=\"Unipolar switch\",IF(H579>BRP_Min,0,VOH),\"\"))","v":0}]
[2.0499999999999998,1,null,0,null,-88.558858737058799,-177.11771747411765,319.7791729416054,null,null,null,0,0,0,0]
[2.0499999999999998,1,null,0,null,-88.558858737058799,-177.11771747411765,319.7791729416054,null,null,null,0,0,0,0]
[2.0499999999999998,1,null,0,null,-88.558858737058799,-177.11771747411765,319.7791729416054,null,null,null,0,0,0,0]
[2.0499999999999998,1,null,0,null,-88.558858737058799,-177.11771747411765,319.7791729416054,null,null,null,0,0,0,0]
[2.0499999999999998,1,null,0,null,-88.558858737058799,-177.11771747411765,319.7791729416054,null,null,null,0,0,0,0]
[2.0499999999999998,1,null,0,null,-88.558858737058799,-177.11771747411765,319.7791729416054,null,null,null,0,0,0,0]
[2.0499999999999998,1,null,0,null,-88.558858737058799,-177.11771747411765,319.7791729416054,null,null,null,0,0,0,0]
[2.0499999999999998,1,null,0,null,-88.558858737058799,-177.11771747411765,319.7791729416054,null,null,null,0,0,0,0]
[2.0499999999999998,1,null,0,null,-88.558858737058799,-177.11771747411765,319.7791729416054,null,null,null,0,0,0,0]
[2.0499999999999998,1,null,0,null,-88.558858737058799,-177.11771747411765,319.7791729416054,null,null,null,0,0,0,0]
[2.0499999999999998,1,null,0,null,-88.558858737058799,-177.11771747411765,319.7791729416054,null,null,null,0,0,0,0]
[2.0499999999999998,1,null,0,null,-88.558858737058799,-177.11771747411765,319.7791729416054,null,null,null,0,0,0,0]
[2.0499999999999998,1,null,0,null,-88.558858737058799,-177.11771747411765,319.7791729416054,null,null,null,0,0,0,0]
[2.0499999999999998,1,null,0,null,-88.558858737058799,-177.11771747411765,319.7791729416054,null,null,null,0,0,0,0]
[2.0499999999999998,1,null,0,null,-88.558858737058799,-177.11771747411765,319.7791729416054,null,null,null,0,0,0,0]
[2.0499999999999998,1,null,0,null,-88.558858737058799,-177.11771747411765,319.7791729416054,null,null,null,0,0,0,0]
[2.0499999999999998,1,null,0,null,-88.558858737058799,-177.11771747411765,319.7791729416054,null,null,null,0,0,0,0]
[2.0499999999999998,1,null,0,null,-88.558858737058799,-177.11771747411765,319.7791729416054,null,null,null,0,0,0,0]
[2.0499999999999998,1,null,0,null,-88.558858737058799,-177.11771747411765,319.7791729416054,null,null,null,0,0,0,0]
[2.0499999999999998,1,null,0,null,-88.558858737058799,-177.11771747411765,319.7791729416054,null,null,null,0,0,0,0]
[2.0499999999999998,1,null,0,null,-88.558858737058799,-177.11771747411765,319.7791729416054,null,null,null,0,0,0,0]
[2.0499999999999998,1,null,0,null,-88.558858737058799,-177.11771747411765,319.7791729416054,null,null,null,0,0,0,0]
[2.0499999999999998,1,null,0,null,-88.558858737058799,-177.11771747411765,319.7791729416054,null,null,null,0,0,0,0]
[2.0499999999999998,1,null,0,null,-88.558858737058799,-177.11771747411765,319.7791729416054,null,null,null,0,0,0,0]
[2.0499999999999998,1,null,0,null,-88.558858737058799,-177.11771747411765,319.7791729416054,null,null,null,0,0,0,0]
[2.0499999999999998,1,null,0,null,-88.558858737058799,-177.11771747411765,319.7791729416054,null,null,null,0,0,0,0]
[2.0499999999999998,1,null,0,null,-88.558858737058799,-177.11771747411765,319.7791729416054,null,null,null,0,0,0,0]
[2.0499999999999998,1,null,0,null,-88.558858737058799,-177.11771747411765,319.7791729416054,null,null,null,0,0,0,0]
[2.0499999999999998,1,null,0,null,-88.558858737058799,-177.11771747411765,319.7791729416054,null,null,null,0,0,0,0]
[2.0499999999999998,1,null,0,null,-88.558858737058799,-177.11771747411765,319.7791729416054,null,null,null,0,0,0,0]
[2.0499999999999998,1,null,0,null,-88.558858737058799,-177.11771747411765,319.7791729416054,null,null,null,0,0,0,0]
[2.0499999999999998,1,null,0,null,-88.558858737058799,-177.11771747411765,319.7791729416054,null,null,null,0,0,0,0]
[2.0499999999999998,1,null,0,null,-88.558858737058799,-177.11771747411765,319.7791729416054,null,null,null,0,0,0,0]
[2.0499999999999998,1,null,0,null,-88.558858737058799,-177.11771747411765,319.7791729416054,null,null,null,0,0,0,0]
[2.0499999999999998,1,null,0,null,-88.558858737058799,-177.11771747411765,319.7791729416054,null,null,null,0,0,0,0]
[2.0499999999999998,1,null,0,null,-88.558858737058799,-177.11771747411765,319.7791729416054,null,null,null,0,0,0,0]
[2.0499999999999998,1,null,0,null,-88.558858737058799,-177.11771747411765,319.7791729416054,null,null,null,0,0,0,0]
[2.0499999999999998,1,null,0,null,-88.558858737058799,-177.11771747411765,319.7791729416054,null,null,null,0,0,0,0]
[2.0499999999999998,1,null,0,null,-88.558858737058799,-177.11771747411765,319.7791729416054,null,null,null,0,0,0,0]
[2.0499999999999998,1,null,0,null,-88.558858737058799,-177.11771747411765,319.7791729416054,null,null,null,0,0,0,0]
[2.0499999999999998,1,null,0,null,-88.558858737058799,-177.11771747411765,319.7791729416054,null,null,null,0,0,0,0]
[2.0499999999999998,1,null,0,null,-88.558858737058799,-177.11771747411765,319.7791729416054,null,null,null,0,0,0,0]
[2.0499999999999998,1,null,0,null,-88.558858737058799,-177.11771747411765,319.7791729416054,null,null,null,0,0,0,0]
[2.0499999999999998,1,null,0,null,-88.558858737058799,-177.11771747411765,319.7791729416054,null,null,null,0,0,0,0]
[2.0499999999999998,1,null,0,null,-88.558858737058799,-177.11771747411765,319.7791729416054,null,null,null,0,0,0,0]
[2.0499999999999998,1,null,0,null,-88.558858737058799,-177.11771747411765,319.7791729416054,null,null,null,0,0,0,0]
[2.0499999999999998,1,null,0,null,-88.558858737058799,-177.11771747411765,319.7791729416054,null,null,null,0,0,0,0]
[2.0499999999999998,1,null,0,null,-88.558858737058799,-177.11771747411765,319.7791729416054,null,null,null,0,0,0,0]
[2.0499999999999998,1,null,0,null,-88.558858737058799,-177.11771747411765,319.7791729416054,null,null,null,0,0,0,0]
[2.0499999999999998,1,null,0,null,-88.558858737058799,-177.11771747411765,319.7791729416054,null,null,null,0,0,0,0]
[2.0499999999999998,1,null,0,null,-88.558858737058799,-177.11771747411765,319.7791729416054,null,null,null,0,0,0,0]
[2.0499999999999998,1,null,0,null,-88.558858737058799,-177.11771747411765,319.7791729416054,null,null,null,0,0,0,0]
[2.0499999999999998,1,null,0,null,-88.558858737058799,-177.11771747411765,319.7791729416054,null,null,null,0,0,0,0]
[2.0499999999999998,1,null,0,null,-88.558858737058799,-177.11771747411765,319.7791729416054,null,null,null,0,0,0,0]
[2.0499999999999998,1,null,0,null,-88.558858737058799,-177.11771747411765,319.7791729416054,null,null,null,0,0,0,0]
[2.0499999999999998,1,null,0,null,-88.558858737058799,-177.11771747411765,319.7791729416054,null,null,null,0,0,0,0]
[2.0499999999999998,1,null,0,null,-88.558858737058799,-177.11771747411765,319.7791729416054,null,null,null,0,0,0,0]
[2.0499999999999998,1,null,0,null,-88.558858737058799,-177.11771747411765,319.7791729416054,null,null,null,0,0,0,0]
[2.0499999999999998,1,null,0,null,-88.558858737058799,-177.11771747411765,319.7791729416054,null,null,null,0,0,0,0]
[2.0499999999999998,1,null,0,null,-88.558858737058799,-177.11771747411765,319.7791729416054,null,null,null,0,0,0,0]
[2.0499999999999998,1,null,0,null,-88.558858737058799,-177.11771747411765,319.7791729416054,null,null,null,0,0,0,0]
[2.0499999999999998,1,null,0,null,-88.558858737058799,-177.11771747411765,319.7791729416054,null,null,null,0,0,0,0]
[2.0499999999999998,1,null,0,null,-88.558858737058799,-177.11771747411765,319.7791729416054,null,null,null,0,0,0,0]
[2.0499999999999998,1,null,0,null,-88.558858737058799,-177.11771747411765,319.7791729416054,null,null,null,{"$f":"IF($L$21=PartNum,IF(PartType=\"Omnipolar switch\",IF(ABS(H643)>BRP_Typ,0,VOH),\nIF(PartType=\"Unipolar switch\",IF(H643>BRP_Typ,0,VOH),\nIF(PartType=\"Latch\",IF(H643<BRP_Typ,VOH,0),\nIF(PartType=\"Ratiometric PWM output\", IF(50+GAIN*H643<5.3,5.3,IF(50+GAIN*H643>94.7,94.7,50+GAIN*H643)),\nIF(OR(PartType=\"Ratiometric unipolar\",PartType=\"Ratiometric bipolar\",PartType=\"Bipolar\"),IF(AND(VQ+H643*GAIN/1000<=VOH,VQ+H643*GAIN/1000>=VOL),VQ+H643*GAIN/1000,IF(VQ+H643*GAIN/1000>VOH,VOH,VOL))))))),0)","v":0},{"$f":"IF($L$21=PartNum,IF(PartType=\"Omnipolar switch\",IF(ABS(H643)>BOP_Typ,0,VOH),\nIF(PartType=\"Unipolar switch\",IF(H643>BOP_Typ,0,VOH),\nIF(PartType=\"Latch\",IF(H643<BOP_Typ,VOH,0),\"\"))),0)","v":0},{"$f":"IF(PartType=\"Omnipolar switch\",IF(ABS(H643)>BOP_Max,0,VOH),IF(PartType=\"Unipolar switch\",IF(H643>BOP_Max,0,VOH),\"\"))","v":0},{"$f":"IF(PartType=\"Omnipolar switch\",IF(ABS(H643)>BRP_Min,0,VOH),IF(PartType=\"Unipolar switch\",IF(H643>BRP_Min,0,VOH),\"\"))","v":0}]
[2.0499999999999998,1,null,0,null,-88.558858737058799,-177.11771747411765,319.7791729416054,null,null,null,0,0,0,0]
[2.0499999999999998,1,null,0,null,-88.558858737058799,-177.11771747411765,319.7791729416054,null,null,null,0,0,0,0]
[2.0499999999999998,1,null,0,null,-88.558858737058799,-177.11771747411765,319.7791729416054,null,null,null,0,0,0,0]
[2.0499999999999998,1,null,0,null,-88.558858737058799,-177.11771747411765,319.7791729416054,null,null,null,0,0,0,0]
[2.0499999999999998,1,null,0,null,-88.558858737058799,-177.11771747411765,319.7791729416054,null,null,null,0,0,0,0]
[2.0499999999999998,1,null,0,null,-88.558858737058799,-177.11771747411765,319.7791729416054,null,null,null,0,0,0,0]
[2.0499999999999998,1,null,0,null,-88.558858737058799,-177.11771747411765,319.7791729416054,null,null,null,0,0,0,0]
[2.0499999999999998,1,null,0,null,-88.558858737058799,-177.11771747411765,319.7791729416054,null,null,null,0,0,0,0]
[2.0499999999999998,1,null,0,null,-88.558858737058799,-177.11771747411765,319.7791729416054,null,null,null,0,0,0,0]
[2.0499999999999998,1,null,0,null,-88.558858737058799,-177.11771747411765,319.7791729416054,null,null,null,0,0,0,0]
[2.0499999999999998,1,null,0,null,-88.558858737058799,-177.11771747411765,319.7791729416054,null,null,null,0,0,0,0]
[2.0499999999999998,1,null,0,null,-88.558858737058799,-177.11771747411765,319.7791729416054,null,null,null,0,0,0,0]
[2.0499999999999998,1,null,0,null,-88.558858737058799,-177.11771747411765,319.7791729416054,null,null,null,0,0,0,0]
[2.0499999999999998,1,null,0,null,-88.558858737058799,-177.11771747411765,319.7791729416054,null,null,null,0,0,0,0]
[2.0499999999999998,1,null,0,null,-88.558858737058799,-177.11771747411765,319.7791729416054,null,null,null,0,0,0,0]
[2.0499999999999998,1,null,0,null,-88.558858737058799,-177.11771747411765,319.7791729416054,null,null,null,0,0,0,0]
[2.0499999999999998,1,null,0,null,-88.558858737058799,-177.11771747411765,319.7791729416054,null,null,null,0,0,0,0]
[2.0499999999999998,1,null,0,null,-88.558858737058799,-177.11771747411765,319.7791729416054,null,null,null,0,0,0,0]
[2.0499999999999998,1,null,0,null,-88.558858737058799,-177.11771747411765,319.7791729416054,null,null,null,0,0,0,0]
[2.0499999999999998,1,null,0,null,-88.558858737058799,-177.11771747411765,319.7791729416054,null,null,null,0,0,0,0]
[2.0499999999999998,1,null,0,null,-88.558858737058799,-177.11771747411765,319.7791729416054,null,null,null,0,0,0,0]
[2.0499999999999998,1,null,0,null,-88.558858737058799,-177.11771747411765,319.7791729416054,null,null,null,0,0,0,0]
[2.0499999999999998,1,null,0,null,-88.558858737058799,-177.11771747411765,319.7791729416054,null,null,null,0,0,0,0]
[2.0499999999999998,1,null,0,null,-88.558858737058799,-177.11771747411765,319.7791729416054,null,null,null,0,0,0,0]
[2.0499999999999998,1,null,0,null,-88.558858737058799,-177.11771747411765,319.7791729416054,null,null,null,0,0,0,0]
[2.0499999999999998,1,null,0,null,-88.558858737058799,-177.11771747411765,319.7791729416054,null,null,null,0,0,0,0]
[2.0499999999999998,1,null,0,null,-88.558858737058799,-177.11771747411765,319.7791729416054,null,null,null,0,0,0,0]
[2.0499999999999998,1,null,0,null,-88.558858737058799,-177.11771747411765,319.7791729416054,null,null,null,0,0,0,0]
[2.0499999999999998,1,null,0,null,-88.558858737058799,-177.11771747411765,319.7791729416054,null,null,null,0,0,0,0]
[2.0499999999999998,1,null,0,null,-88.558858737058799,-177.11771747411765,319.7791729416054,null,null,null,0,0,0,0]
[2.0499999999999998,1,null,0,null,-88.558858737058799,-177.11771747411765,319.7791729416054,null,null,null,0,0,0,0]
[2.0499999999999998,1,null,0,null,-88.558858737058799,-177.11771747411765,319.7791729416054,null,null,null,0,0,0,0]
[2.0499999999999998,1,null,0,null,-88.558858737058799,-177.11771747411765,319.7791729416054,null,null,null,0,0,0,0]
[2.0499999999999998,1,null,0,null,-88.558858737058799,-177.11771747411765,319.7791729416054,null,null,null,0,0,0,0]
[2.0499999999999998,1,null,0,null,-88.558858737058799,-177.11771747411765,319.7791729416054,null,null,null,0,0,0,0]
[2.0499999999999998,1,null,0,null,-88.558858737058799,-177.11771747411765,319.7791729416054,null,null,null,0,0,0,0]
[2.0499999999999998,1,null,0,null,-88.558858737058799,-177.11771747411765,319.7791729416054,null,null,null,0,0,0,0]
[2.0499999999999998,1,null,0,null,-88.558858737058799,-177.11771747411765,319.7791729416054,null,null,null,0,0,0,0]
[2.0499999999999998,1,null,0,null,-88.558858737058799,-177.11771747411765,319.7791729416054,null,null,null,0,0,0,0]
[2.0499999999999998,1,null,0,null,-88.558858737058799,-177.11771747411765,319.7791729416054,null,null,null,0,0,0,0]
[2.0499999999999998,1,null,0,null,-88.558858737058799,-177.11771747411765,319.7791729416054,null,null,null,0,0,0,0]
[2.0499999999999998,1,null,0,null,-88.558858737058799,-177.11771747411765,319.7791729416054,null,null,null,0,0,0,0]
[2.0499999999999998,1,null,0,null,-88.558858737058799,-177.11771747411765,319.7791729416054,null,null,null,0,0,0,0]
[2.0499999999999998,1,null,0,null,-88.558858737058799,-177.11771747411765,319.7791729416054,null,null,null,0,0,0,0]
[2.0499999999999998,1,null,0,null,-88.558858737058799,-177.11771747411765,319.7791729416054,null,null,null,0,0,0,0]
[2.0499999999999998,1,null,0,null,-88.558858737058799,-177.11771747411765,319.7791729416054,null,null,null,0,0,0,0]
[2.0499999999999998,1,null,0,null,-88.558858737058799,-177.11771747411765,319.7791729416054,null,null,null,0,0,0,0]
[2.0499999999999998,1,null,0,null,-88.558858737058799,-177.11771747411765,319.7791729416054,null,null,null,0,0,0,0]
[2.0499999999999998,1,null,0,null,-88.558858737058799,-177.11771747411765,319.7791729416054,null,null,null,0,0,0,0]
[2.0499999999999998,1,null,0,null,-88.558858737058799,-177.11771747411765,319.7791729416054,null,null,null,0,0,0,0]
[2.0499999999999998,1,null,0,null,-88.558858737058799,-177.11771747411765,319.7791729416054,null,null,null,0,0,0,0]
[2.0499999999999998,1,null,0,null,-88.558858737058799,-177.11771747411765,319.7791729416054,null,null,null,0,0,0,0]
[2.0499999999999998,1,null,0,null,-88.558858737058799,-177.11771747411765,319.7791729416054,null,null,null,0,0,0,0]
[2.0499999999999998,1,null,0,null,-88.558858737058799,-177.11771747411765,319.7791729416054,null,null,null,0,0,0,0]
[2.0499999999999998,1,null,0,null,-88.558858737058799,-177.11771747411765,319.7791729416054,null,null,null,0,0,0,0]
[2.0499999999999998,1,null,0,null,-88.558858737058799,-177.11771747411765,319.7791729416054,null,null,null,0,0,0,0]
[2.0499999999999998,1,null,0,null,-88.558858737058799,-177.11771747411765,319.7791729416054,null,null,null,0,0,0,0]
[2.0499999999999998,1,null,0,null,-88.558858737058799,-177.11771747411765,319.7791729416054,null,null,null,0,0,0,0]
[2.0499999999999998,1,null,0,null,-88.558858737058799,-177.11771747411765,319.7791729416054,null,null,null,0,0,0,0]
[2.0499999999999998,1,null,0,null,-88.558858737058799,-177.11771747411765,319.7791729416054,null,null,null,0,0,0,0]
[2.0499999999999998,1,null,0,null,-88.558858737058799,-177.11771747411765,319.7791729416054,null,null,null,0,0,0,0]
[2.0499999999999998,1,null,0,null,-88.558858737058799,-177.11771747411765,319.7791729416054,null,null,null,0,0,0,0]
[2.0499999999999998,1,null,0,null,-88.558858737058799,-177.11771747411765,319.7791729416054,null,null,null,0,0,0,0]
[2.0499999999999998,1,null,0,null,-88.558858737058799,-177.11771747411765,319.7791729416054,null,null,null,{"$f":"IF($L$21=PartNum,IF(PartType=\"Omnipolar switch\",IF(ABS(H707)>BRP_Typ,0,VOH),\nIF(PartType=\"Unipolar switch\",IF(H707>BRP_Typ,0,VOH),\nIF(PartType=\"Latch\",IF(H707<BRP_Typ,VOH,0),\nIF(PartType=\"Ratiometric PWM output\", IF(50+GAIN*H707<5.3,5.3,IF(50+GAIN*H707>94.7,94.7,50+GAIN*H707)),\nIF(OR(PartType=\"Ratiometric unipolar\",PartType=\"Ratiometric bipolar\",PartType=\"Bipolar\"),IF(AND(VQ+H707*GAIN/1000<=VOH,VQ+H707*GAIN/1000>=VOL),VQ+H707*GAIN/1000,IF(VQ+H707*GAIN/1000>VOH,VOH,VOL))))))),0)","v":0},{"$f":"IF($L$21=PartNum,IF(PartType=\"Omnipolar switch\",IF(ABS(H707)>BOP_Typ,0,VOH),\nIF(PartType=\"Unipolar switch\",IF(H707>BOP_Typ,0,VOH),\nIF(PartType=\"Latch\",IF(H707<BOP_Typ,VOH,0),\"\"))),0)","v":0},{"$f":"IF(PartType=\"Omnipolar switch\",IF(ABS(H707)>BOP_Max,0,VOH),IF(PartType=\"Unipolar switch\",IF(H707>BOP_Max,0,VOH),\"\"))","v":0},{"$f":"IF(PartType=\"Omnipolar switch\",IF(ABS(H707)>BRP_Min,0,VOH),IF(PartType=\"Unipolar switch\",IF(H707>BRP_Min,0,VOH),\"\"))","v":0}]
[2.0499999999999998,1,null,0,null,-88.558858737058799,-177.11771747411765,319.7791729416054,null,null,null,0,0,0,0]
[2.0499999999999998,1,null,0,null,-88.558858737058799,-177.11771747411765,319.7791729416054,null,null,null,0,0,0,0]
[2.0499999999999998,1,null,0,null,-88.558858737058799,-177.11771747411765,319.7791729416054,null,null,null,0,0,0,0]
[2.0499999999999998,1,null,0,null,-88.558858737058799,-177.11771747411765,319.7791729416054,null,null,null,0,0,0,0]
[2.0499999999999998,1,null,0,null,-88.558858737058799,-177.11771747411765,319.7791729416054,null,null,null,0,0,0,0]
[2.0499999999999998,1,null,0,null,-88.558858737058799,-177.11771747411765,319.7791729416054,null,null,null,0,0,0,0]
[2.0499999999999998,1,null,0,null,-88.558858737058799,-177.11771747411765,319.7791729416054,null,null,null,0,0,0,0]
[2.0499999999999998,1,null,0,null,-88.558858737058799,-177.11771747411765,319.7791729416054,null,null,null,0,0,0,0]
[2.0499999999999998,1,null,0,null,-88.558858737058799,-177.11771747411765,319.7791729416054,null,null,null,0,0,0,0]
[2.0499999999999998,1,null,0,null,-88.558858737058799,-177.11771747411765,319.7791729416054,null,null,null,0,0,0,0]
[2.0499999999999998,1,null,0,null,-88.558858737058799,-177.11771747411765,319.7791729416054,null,null,null,0,0,0,0]
[2.0499999999999998,1,null,0,null,-88.558858737058799,-177.11771747411765,319.7791729416054,null,null,null,0,0,0,0]
[2.0499999999999998,1,null,0,null,-88.558858737058799,-177.11771747411765,319.7791729416054,null,null,null,0,0,0,0]
[2.0499999999999998,1,null,0,null,-88.558858737058799,-177.11771747411765,319.7791729416054,null,null,null,0,0,0,0]
[2.0499999999999998,1,null,0,null,-88.558858737058799,-177.11771747411765,319.7791729416054,null,null,null,0,0,0,0]
[2.0499999999999998,1,null,0,null,-88.558858737058799,-177.11771747411765,319.7791729416054,null,null,null,0,0,0,0]
[2.0499999999999998,1,null,0,null,-88.558858737058799,-177.11771747411765,319.7791729416054,null,null,null,0,0,0,0]
[2.0499999999999998,1,null,0,null,-88.558858737058799,-177.11771747411765,319.7791729416054,null,null,null,0,0,0,0]
[2.0499999999999998,1,null,0,null,-88.558858737058799,-177.11771747411765,319.7791729416054,null,null,null,0,0,0,0]
[2.0499999999999998,1,null,0,null,-88.558858737058799,-177.11771747411765,319.7791729416054,null,null,null,0,0,0,0]
[2.0499999999999998,1,null,0,null,-88.558858737058799,-177.11771747411765,319.7791729416054,null,null,null,0,0,0,0]
[2.0499999999999998,1,null,0,null,-88.558858737058799,-177.11771747411765,319.7791729416054,null,null,null,0,0,0,0]
[2.0499999999999998,1,null,0,null,-88.558858737058799,-177.11771747411765,319.7791729416054,null,null,null,0,0,0,0]
[2.0499999999999998,1,null,0,null,-88.558858737058799,-177.11771747411765,319.7791729416054,null,null,null,0,0,0,0]
[2.0499999999999998,1,null,0,null,-88.558858737058799,-177.11771747411765,319.7791729416054,null,null,null,0,0,0,0]
[2.0499999999999998,1,null,0,null,-88.558858737058799,-177.11771747411765,319.7791729416054,null,null,null,0,0,0,0]
[2.0499999999999998,1,null,0,null,-88.558858737058799,-177.11771747411765,319.7791729416054,null,null,null,0,0,0,0]
[2.0499999999999998,1,null,0,null,-88.558858737058799,-177.11771747411765,319.7791729416054,null,null,null,0,0,0,0]
[2.0499999999999998,1,null,0,null,-88.558858737058799,-177.11771747411765,319.7791729416054,null,null,null,0,0,0,0]
[2.0499999999999998,1,null,0,null,-88.558858737058799,-177.11771747411765,319.7791729416054,null,null,null,0,0,0,0]
[2.0499999999999998,1,null,0,null,-88.558858737058799,-177.11771747411765,319.7791729416054,null,null,null,0,0,0,0]
[2.0499999999999998,1,null,0,null,-88.558858737058799,-177.11771747411765,319.7791729416054,null,null,null,0,0,0,0]
[2.0499999999999998,1,null,0,null,-88.558858737058799,-177.11771747411765,319.7791729416054,null,null,null,0,0,0,0]
[2.0499999999999998,1,null,0,null,-88.558858737058799,-177.11771747411765,319.7791729416054,null,null,null,0,0,0,0]
[2.0499999999999998,1,null,0,null,-88.558858737058799,-177.11771747411765,319.7791729416054,null,null,null,0,0,0,0]
[2.0499999999999998,1,null,0,null,-88.558858737058799,-177.11771747411765,319.7791729416054,null,null,null,0,0,0,0]
[2.0499999999999998,1,null,0,null,-88.558858737058799,-177.11771747411765,319.7791729416054,null,null,null,0,0,0,0]
[2.0499999999999998,1,null,0,null,-88.558858737058799,-177.11771747411765,319.7791729416054,null,null,null,0,0,0,0]
[2.0499999999999998,1,null,0,null,-88.558858737058799,-177.11771747411765,319.7791729416054,null,null,null,0,0,0,0]
[2.0499999999999998,1,null,0,null,-88.558858737058799,-177.11771747411765,319.7791729416054,null,null,null,0,0,0,0]
[2.0499999999999998,1,null,0,null,-88.558858737058799,-177.11771747411765,319.7791729416054,null,null,null,0,0,0,0]
[2.0499999999999998,1,null,0,null,-88.558858737058799,-177.11771747411765,319.7791729416054,null,null,null,0,0,0,0]
[2.0499999999999998,1,null,0,null,-88.558858737058799,-177.11771747411765,319.7791729416054,null,null,null,0,0,0,0]
[2.0499999999999998,1,null,0,null,-88.558858737058799,-177.11771747411765,319.7791729416054,null,null,null,0,0,0,0]
[2.0499999999999998,1,null,0,null,-88.558858737058799,-177.11771747411765,319.7791729416054,null,null,null,0,0,0,0]
[2.0499999999999998,1,null,0,null,-88.558858737058799,-177.11771747411765,319.7791729416054,null,null,null,0,0,0,0]
[2.0499999999999998,1,null,0,null,-88.558858737058799,-177.11771747411765,319.7791729416054,null,null,null,0,0,0,0]
[2.0499999999999998,1,null,0,null,-88.558858737058799,-177.11771747411765,319.7791729416054,null,null,null,0,0,0,0]
[2.0499999999999998,1,null,0,null,-88.558858737058799,-177.11771747411765,319.7791729416054,null,null,null,0,0,0,0]
[2.0499999999999998,1,null,0,null,-88.558858737058799,-177.11771747411765,319.7791729416054,null,null,null,0,0,0,0]
[2.0499999999999998,1,null,0,null,-88.558858737058799,-177.11771747411765,319.7791729416054,null,null,null,0,0,0,0]
[2.0499999999999998,1,null,0,null,-88.558858737058799,-177.11771747411765,319.7791729416054,null,null,null,0,0,0,0]
[2.0499999999999998,1,null,0,null,-88.558858737058799,-177.11771747411765,319.7791729416054,null,null,null,0,0,0,0]
[2.0499999999999998,1,null,0,null,-88.558858737058799,-177.11771747411765,319.7791729416054,null,null,null,0,0,0,0]
[2.0499999999999998,1,null,0,null,-88.558858737058799,-177.11771747411765,319.7791729416054,null,null,null,0,0,0,0]
[2.0499999999999998,1,null,0,null,-88.558858737058799,-177.11771747411765,319.7791729416054,null,null,null,0,0,0,0]
[2.0499999999999998,1,null,0,null,-88.558858737058799,-177.11771747411765,319.7791729416054,null,null,null,0,0,0,0]
[2.0499999999999998,1,null,0,null,-88.558858737058799,-177.11771747411765,319.7791729416054,null,null,null,0,0,0,0]
[2.0499999999999998,1,null,0,null,-88.558858737058799,-177.11771747411765,319.7791729416054,null,null,null,0,0,0,0]
[2.0499999999999998,1,null,0,null,-88.558858737058799,-177.11771747411765,319.7791729416054,null,null,null,0,0,0,0]
[2.0499999999999998,1,null,0,null,-88.558858737058799,-177.11771747411765,319.7791729416054,null,null,null,0,0,0,0]
[2.0499999999999998,1,null,0,null,-88.558858737058799,-177.11771747411765,319.7791729416054,null,null,null,0,0,0,0]
[2.0499999999999998,1,null,0,null,-88.558858737058799,-177.11771747411765,319.7791729416054,null,null,null,0,0,0,0]
[2.0499999999999998,1,null,0,null,-88.558858737058799,-177.11771747411765,319.7791729416054,null,null,null,{"$f":"IF($L$21=PartNum,IF(PartType=\"Omnipolar switch\",IF(ABS(H771)>BRP_Typ,0,VOH),\nIF(PartType=\"Unipolar switch\",IF(H771>BRP_Typ,0,VOH),\nIF(PartType=\"Latch\",IF(H771<BRP_Typ,VOH,0),\nIF(PartType=\"Ratiometric PWM output\", IF(50+GAIN*H771<5.3,5.3,IF(50+GAIN*H771>94.7,94.7,50+GAIN*H771)),\nIF(OR(PartType=\"Ratiometric unipolar\",PartType=\"Ratiometric bipolar\",PartType=\"Bipolar\"),IF(AND(VQ+H771*GAIN/1000<=VOH,VQ+H771*GAIN/1000>=VOL),VQ+H771*GAIN/1000,IF(VQ+H771*GAIN/1000>VOH,VOH,VOL))))))),0)","v":0},{"$f":"IF($L$21=PartNum,IF(PartType=\"Omnipolar switch\",IF(ABS(H771)>BOP_Typ,0,VOH),\nIF(PartType=\"Unipolar switch\",IF(H771>BOP_Typ,0,VOH),\nIF(PartType=\"Latch\",IF(H771<BOP_Typ,VOH,0),\"\"))),0)","v":0},{"$f":"IF(PartType=\"Omnipolar switch\",IF(ABS(H771)>BOP_Max,0,VOH),IF(PartType=\"Unipolar switch\",IF(H771>BOP_Max,0,VOH),\"\"))","v":0},{"$f":"IF(PartType=\"Omnipolar switch\",IF(ABS(H771)>BRP_Min,0,VOH),IF(PartType=\"Unipolar switch\",IF(H771>BRP_Min,0,VOH),\"\"))","v":0}]
[2.0499999999999998,1,null,0,null,-88.558858737058799,-177.11771747411765,319.7791729416054,null,null,null,0,0,0,0]
[2.0499999999999998,1,null,0,null,-88.558858737058799,-177.11771747411765,319.7791729416054,null,null,null,0,0,0,0]
[2.0499999999999998,1,null,0,null,-88.558858737058799,-177.11771747411765,319.7791729416054,null,null,null,0,0,0,0]
[2.0499999999999998,1,null,0,null,-88.558858737058799,-177.11771747411765,319.7791729416054,null,null,null,0,0,0,0]
[2.0499999999999998,1,null,0,null,-88.558858737058799,-177.11771747411765,319.7791729416054,null,null,null,0,0,0,0]
[2.0499999999999998,1,null,0,null,-88.558858737058799,-177.11771747411765,319.7791729416054,null,null,null,0,0,0,0]
[2.0499999999999998,1,null,0,null,-88.558858737058799,-177.11771747411765,319.7791729416054,null,null,null,0,0,0,0]
[2.0499999999999998,1,null,0,null,-88.558858737058799,-177.11771747411765,319.7791729416054,null,null,null,0,0,0,0]
[2.0499999999999998,1,null,0,null,-88.558858737058799,-177.11771747411765,319.7791729416054,null,null,null,0,0,0,0]
[2.0499999999999998,1,null,0,null,-88.558858737058799,-177.11771747411765,319.7791729416054,null,null,null,0,0,0,0]
[2.0499999999999998,1,null,0,null,-88.558858737058799,-177.11771747411765,319.7791729416054,null,null,null,0,0,0,0]
[2.0499999999999998,1,null,0,null,-88.558858737058799,-177.11771747411765,319.7791729416054,null,null,null,0,0,0,0]
[2.0499999999999998,1,null,0,null,-88.558858737058799,-177.11771747411765,319.7791729416054,null,null,null,0,0,0,0]
[2.0499999999999998,1,null,0,null,-88.558858737058799,-177.11771747411765,319.7791729416054,null,null,null,0,0,0,0]
[2.0499999999999998,1,null,0,null,-88.558858737058799,-177.11771747411765,319.7791729416054,null,null,null,0,0,0,0]
[2.0499999999999998,1,null,0,null,-88.558858737058799,-177.11771747411765,319.7791729416054,null,null,null,0,0,0,0]
[2.0499999999999998,1,null,0,null,-88.558858737058799,-177.11771747411765,319.7791729416054,null,null,null,0,0,0,0]
[2.0499999999999998,1,null,0,null,-88.558858737058799,-177.11771747411765,319.7791729416054,null,null,null,0,0,0,0]
[2.0499999999999998,1,null,0,null,-88.558858737058799,-177.11771747411765,319.7791729416054,null,null,null,0,0,0,0]
[2.0499999999999998,1,null,0,null,-88.558858737058799,-177.11771747411765,319.7791729416054,null,null,null,0,0,0,0]
[2.0499999999999998,1,null,0,null,-88.558858737058799,-177.11771747411765,319.7791729416054,null,null,null,0,0,0,0]
[2.0499999999999998,1,null,0,null,-88.558858737058799,-177.11771747411765,319.7791729416054,null,null,null,0,0,0,0]
[2.0499999999999998,1,null,0,null,-88.558858737058799,-177.11771747411765,319.7791729416054,null,null,null,0,0,0,0]
[2.0499999999999998,1,null,0,null,-88.558858737058799,-177.11771747411765,319.7791729416054,null,null,null,0,0,0,0]
[2.0499999999999998,1,null,0,null,-88.558858737058799,-177.11771747411765,319.7791729416054,null,null,null,0,0,0,0]
[2.0499999999999998,1,null,0,null,-88.558858737058799,-177.11771747411765,319.7791729416054,null,null,null,0,0,0,0]
[2.0499999999999998,1,null,0,null,-88.558858737058799,-177.11771747411765,319.7791729416054,null,null,null,0,0,0,0]
[2.0499999999999998,1,null,0,null,-88.558858737058799,-177.11771747411765,319.7791729416054,null,null,null,0,0,0,0]
[2.0499999999999998,1,null,0,null,-88.558858737058799,-177.11771747411765,319.7791729416054,null,null,null,0,0,0,0]
[2.0499999999999998,1,null,0,null,-88.558858737058799,-177.11771747411765,319.7791729416054,null,null,null,0,0,0,0]
[2.0499999999999998,1,null,0,null,-88.558858737058799,-177.11771747411765,319.7791729416054,null,null,null,0,0,0,0]
[2.0499999999999998,1,null,0,null,-88.558858737058799,-177.11771747411765,319.7791729416054,null,null,null,0,0,0,0]
[2.0499999999999998,1,null,0,null,-88.558858737058799,-177.11771747411765,319.7791729416054,null,null,null,0,0,0,0]
[2.0499999999999998,1,null,0,null,-88.558858737058799,-177.11771747411765,319.7791729416054,null,null,null,0,0,0,0]
[2.0499999999999998,1,null,0,null,-88.558858737058799,-177.11771747411765,319.7791729416054,null,null,null,0,0,0,0]
[2.0499999999999998,1,null,0,null,-88.558858737058799,-177.11771747411765,319.7791729416054,null,null,null,0,0,0,0]
[2.0499999999999998,1,null,0,null,-88.558858737058799,-177.11771747411765,319.7791729416054,null,null,null,0,0,0,0]
[2.0499999999999998,1,null,0,null,-88.558858737058799,-177.11771747411765,319.7791729416054,null,null,null,0,0,0,0]
[2.0499999999999998,1,null,0,null,-88.558858737058799,-177.11771747411765,319.7791729416054,null,null,null,0,0,0,0]
[2.0499999999999998,1,null,0,null,-88.558858737058799,-177.11771747411765,319.7791729416054,null,null,null,0,0,0,0]
[2.0499999999999998,1,null,0,null,-88.558858737058799,-177.11771747411765,319.7791729416054,null,null,null,0,0,0,0]
[2.0499999999999998,1,null,0,null,-88.558858737058799,-177.11771747411765,319.7791729416054,null,null,null,0,0,0,0]
[2.0499999999999998,1,null,0,null,-88.558858737058799,-177.11771747411765,319.7791729416054,null,null,null,0,0,0,0]
[2.0499999999999998,1,null,0,null,-88.558858737058799,-177.11771747411765,319.7791729416054,null,null,null,0,0,0,0]
[2.0499999999999998,1,null,0,null,-88.558858737058799,-177.11771747411765,319.7791729416054,null,null,null,0,0,0,0]
[2.0499999999999998,1,null,0,null,-88.558858737058799,-177.11771747411765,319.7791729416054,null,null,null,0,0,0,0]
[2.0499999999999998,1,null,0,null,-88.558858737058799,-177.11771747411765,319.7791729416054,null,null,null,0,0,0,0]
[2.0499999999999998,1,null,0,null,-88.558858737058799,-177.11771747411765,319.7791729416054,null,null,null,0,0,0,0]
[2.0499999999999998,1,null,0,null,-88.558858737058799,-177.11771747411765,319.7791729416054,null,null,null,0,0,0,0]
[2.0499999999999998,1,null,0,null,-88.558858737058799,-177.11771747411765,319.7791729416054,null,null,null,0,0,0,0]
[2.0499999999999998,1,null,0,null,-88.558858737058799,-177.11771747411765,319.7791729416054,null,null,null,0,0,0,0]
[2.0499999999999998,1,null,0,null,-88.558858737058799,-177.11771747411765,319.7791729416054,null,null,null,0,0,0,0]
[2.0499999999999998,1,null,0,null,-88.558858737058799,-177.11771747411765,319.7791729416054,null,null,null,0,0,0,0]
[2.0499999999999998,1,null,0,null,-88.558858737058799,-177.11771747411765,319.7791729416054,null,null,null,0,0,0,0]
[2.0499999999999998,1,null,0,null,-88.558858737058799,-177.11771747411765,319.7791729416054,null,null,null,0,0,0,0]
[2.0499999999999998,1,null,0,null,-88.558858737058799,-177.11771747411765,319.7791729416054,null,null,null,0,0,0,0]
[2.0499999999999998,1,null,0,null,-88.558858737058799,-177.11771747411765,319.7791729416054,null,null,null,0,0,0,0]
[2.0499999999999998,1,null,0,null,-88.558858737058799,-177.11771747411765,319.7791729416054,null,null,null,0,0,0,0]
[2.0499999999999998,1,null,0,null,-88.558858737058799,-177.11771747411765,319.7791729416054,null,null,null,0,0,0,0]
[2.0499999999999998,1,null,0,null,-88.558858737058799,-177.11771747411765,319.7791729416054,null,null,null,0,0,0,0]
[2.0499999999999998,1,null,0,null,-88.558858737058799,-177.11771747411765,319.7791729416054,null,null,null,0,0,0,0]
[2.0499999999999998,1,null,0,null,-88.558858737058799,-177.11771747411765,319.7791729416054,null,null,null,0,0,0,0]
[2.0499999999999998,1,null,0,null,-88.558858737058799,-177.11771747411765,319.7791729416054,null,null,null,0,0,0,0]
[2.0499999999999998,1,null,0,null,-88.558858737058799,-177.11771747411765,319.7791729416054,null,null,null,{"$f":"IF($L$21=PartNum,IF(PartType=\"Omnipolar switch\",IF(ABS(H835)>BRP_Typ,0,VOH),\nIF(PartType=\"Unipolar switch\",IF(H835>BRP_Typ,0,VOH),\nIF(PartType=\"Latch\",IF(H835<BRP_Typ,VOH,0),\nIF(PartType=\"Ratiometric PWM output\", IF(50+GAIN*H835<5.3,5.3,IF(50+GAIN*H835>94.7,94.7,50+GAIN*H835)),\nIF(OR(PartType=\"Ratiometric unipolar\",PartType=\"Ratiometric bipolar\",PartType=\"Bipolar\"),IF(AND(VQ+H835*GAIN/1000<=VOH,VQ+H835*GAIN/1000>=VOL),VQ+H835*GAIN/1000,IF(VQ+H835*GAIN/1000>VOH,VOH,VOL))))))),0)","v":0},{"$f":"IF($L$21=PartNum,IF(PartType=\"Omnipolar switch\",IF(ABS(H835)>BOP_Typ,0,VOH),\nIF(PartType=\"Unipolar switch\",IF(H835>BOP_Typ,0,VOH),\nIF(PartType=\"Latch\",IF(H835<BOP_Typ,VOH,0),\"\"))),0)","v":0},{"$f":"IF(PartType=\"Omnipolar switch\",IF(ABS(H835)>BOP_Max,0,VOH),IF(PartType=\"Unipolar switch\",IF(H835>BOP_Max,0,VOH),\"\"))","v":0},{"$f":"IF(PartType=\"Omnipolar switch\",IF(ABS(H835)>BRP_Min,0,VOH),IF(PartType=\"Unipolar switch\",IF(H835>BRP_Min,0,VOH),\"\"))","v":0}]
[2.0499999999999998,1,null,0,null,-88.558858737058799,-177.11771747411765,319.7791729416054,null,null,null,0,0,0,0]
[2.0499999999999998,1,null,0,null,-88.558858737058799,-177.11771747411765,319.7791729416054,null,null,null,0,0,0,0]
[2.0499999999999998,1,null,0,null,-88.558858737058799,-177.11771747411765,319.7791729416054,null,null,null,0,0,0,0]
[2.0499999999999998,1,null,0,null,-88.558858737058799,-177.11771747411765,319.7791729416054,null,null,null,0,0,0,0]
[2.0499999999999998,1,null,0,null,-88.558858737058799,-177.11771747411765,319.7791729416054,null,null,null,0,0,0,0]
[2.0499999999999998,1,null,0,null,-88.558858737058799,-177.11771747411765,319.7791729416054,null,null,null,0,0,0,0]
[2.0499999999999998,1,null,0,null,-88.558858737058799,-177.11771747411765,319.7791729416054,null,null,null,0,0,0,0]
[2.0499999999999998,1,null,0,null,-88.558858737058799,-177.11771747411765,319.7791729416054,null,null,null,0,0,0,0]
[2.0499999999999998,1,null,0,null,-88.558858737058799,-177.11771747411765,319.7791729416054,null,null,null,0,0,0,0]
[2.0499999999999998,1,null,0,null,-88.558858737058799,-177.11771747411765,319.7791729416054,null,null,null,0,0,0,0]
[2.0499999999999998,1,null,0,null,-88.558858737058799,-177.11771747411765,319.7791729416054,null,null,null,0,0,0,0]
[2.0499999999999998,1,null,0,null,-88.558858737058799,-177.11771747411765,319.7791729416054,null,null,null,0,0,0,0]
[2.0499999999999998,1,null,0,null,-88.558858737058799,-177.11771747411765,319.7791729416054,null,null,null,0,0,0,0]
[2.0499999999999998,1,null,0,null,-88.558858737058799,-177.11771747411765,319.7791729416054,null,null,null,0,0,0,0]
[2.0499999999999998,1,null,0,null,-88.558858737058799,-177.11771747411765,319.7791729416054,null,null,null,0,0,0,0]
[2.0499999999999998,1,null,0,null,-88.558858737058799,-177.11771747411765,319.7791729416054,null,null,null,0,0,0,0]
[2.0499999999999998,1,null,0,null,-88.558858737058799,-177.11771747411765,319.7791729416054,null,null,null,0,0,0,0]
[2.0499999999999998,1,null,0,null,-88.558858737058799,-177.11771747411765,319.7791729416054,null,null,null,0,0,0,0]
[2.0499999999999998,1,null,0,null,-88.558858737058799,-177.11771747411765,319.7791729416054,null,null,null,0,0,0,0]
[2.0499999999999998,1,null,0,null,-88.558858737058799,-177.11771747411765,319.7791729416054,null,null,null,0,0,0,0]
[2.0499999999999998,1,null,0,null,-88.558858737058799,-177.11771747411765,319.7791729416054,null,null,null,0,0,0,0]
[2.0499999999999998,1,null,0,null,-88.558858737058799,-177.11771747411765,319.7791729416054,null,null,null,0,0,0,0]
[2.0499999999999998,1,null,0,null,-88.558858737058799,-177.11771747411765,319.7791729416054,null,null,null,0,0,0,0]
[2.0499999999999998,1,null,0,null,-88.558858737058799,-177.11771747411765,319.7791729416054,null,null,null,0,0,0,0]
[2.0499999999999998,1,null,0,null,-88.558858737058799,-177.11771747411765,319.7791729416054,null,null,null,0,0,0,0]
[2.0499999999999998,1,null,0,null,-88.558858737058799,-177.11771747411765,319.7791729416054,null,null,null,0,0,0,0]
[2.0499999999999998,1,null,0,null,-88.558858737058799,-177.11771747411765,319.7791729416054,null,null,null,0,0,0,0]
[2.0499999999999998,1,null,0,null,-88.558858737058799,-177.11771747411765,319.7791729416054,null,null,null,0,0,0,0]
[2.0499999999999998,1,null,0,null,-88.558858737058799,-177.11771747411765,319.7791729416054,null,null,null,0,0,0,0]
[2.0499999999999998,1,null,0,null,-88.558858737058799,-177.11771747411765,319.7791729416054,null,null,null,0,0,0,0]
[2.0499999999999998,1,null,0,null,-88.558858737058799,-177.11771747411765,319.7791729416054,null,null,null,0,0,0,0]
[2.0499999999999998,1,null,0,null,-88.558858737058799,-177.11771747411765,319.7791729416054,null,null,null,0,0,0,0]
[2.0499999999999998,1,null,0,null,-88.558858737058799,-177.11771747411765,319.7791729416054,null,null,null,0,0,0,0]
[2.0499999999999998,1,null,0,null,-88.558858737058799,-177.11771747411765,319.7791729416054,null,null,null,0,0,0,0]
[2.0499999999999998,1,null,0,null,-88.558858737058799,-177.11771747411765,319.7791729416054,null,null,null,0,0,0,0]
[2.0499999999999998,1,null,0,null,-88.558858737058799,-177.11771747411765,319.7791729416054,null,null,null,0,0,0,0]
[2.0499999999999998,1,null,0,null,-88.558858737058799,-177.11771747411765,319.7791729416054,null,null,null,0,0,0,0]
[2.0499999999999998,1,null,0,null,-88.558858737058799,-177.11771747411765,319.7791729416054,null,null,null,0,0,0,0]
[2.0499999999999998,1,null,0,null,-88.558858737058799,-177.11771747411765,319.7791729416054,null,null,null,0,0,0,0]
[2.0499999999999998,1,null,0,null,-88.558858737058799,-177.11771747411765,319.7791729416054,null,null,null,0,0,0,0]
[2.0499999999999998,1,null,0,null,-88.558858737058799,-177.11771747411765,319.7791729416054,null,null,null,0,0,0,0]
[2.0499999999999998,1,null,0,null,-88.558858737058799,-177.11771747411765,319.7791729416054,null,null,null,0,0,0,0]
[2.0499999999999998,1,null,0,null,-88.558858737058799,-177.11771747411765,319.7791729416054,null,null,null,0,0,0,0]
[2.0499999999999998,1,null,0,null,-88.558858737058799,-177.11771747411765,319.7791729416054,null,null,null,0,0,0,0]
[2.0499999999999998,1,null,0,null,-88.558858737058799,-177.11771747411765,319.7791729416054,null,null,null,0,0,0,0]
[2.0499999999999998,1,null,0,null,-88.558858737058799,-177.11771747411765,319.7791729416054,null,null,null,0,0,0,0]
[2.0499999999999998,1,null,0,null,-88.558858737058799,-177.11771747411765,319.7791729416054,null,null,null,0,0,0,0]
[2.0499999999999998,1,null,0,null,-88.558858737058799,-177.11771747411765,319.7791729416054,null,null,null,0,0,0,0]
[2.0499999999999998,1,null,0,null,-88.558858737058799,-177.11771747411765,319.7791729416054,null,null,null,0,0,0,0]
[2.0499999999999998,1,null,0,null,-88.558858737058799,-177.11771747411765,319.7791729416054,null,null,null,0,0,0,0]
[2.0499999999999998,1,null,0,null,-88.558858737058799,-177.11771747411765,319.7791729416054,null,null,null,0,0,0,0]
[2.0499999999999998,1,null,0,null,-88.558858737058799,-177.11771747411765,319.7791729416054,null,null,null,0,0,0,0]
[2.0499999999999998,1,null,0,null,-88.558858737058799,-177.11771747411765,319.7791729416054,null,null,null,0,0,0,0]
[2.0499999999999998,1,null,0,null,-88.558858737058799,-177.11771747411765,319.7791729416054,null,null,null,0,0,0,0]
[2.0499999999999998,1,null,0,null,-88.558858737058799,-177.11771747411765,319.7791729416054,null,null,null,0,0,0,0]
[2.0499999999999998,1,null,0,null,-88.558858737058799,-177.11771747411765,319.7791729416054,null,null,null,0,0,0,0]
[2.0499999999999998,1,null,0,null,-88.558858737058799,-177.11771747411765,319.7791729416054,null,null,null,0,0,0,0]
[2.0499999999999998,1,null,0,null,-88.558858737058799,-177.11771747411765,319.7791729416054,null,null,null,0,0,0,0]
[2.0499999999999998,1,null,0,null,-88.558858737058799,-177.11771747411765,319.7791729416054,null,null,null,0,0,0,0]
[2.0499999999999998,1,null,0,null,-88.558858737058799,-177.11771747411765,319.7791729416054,null,null,null,0,0,0,0]
[2.0499999999999998,1,null,0,null,-88.558858737058799,-177.11771747411765,319.7791729416054,null,null,null,0,0,0,0]
[2.0499999999999998,1,null,0,null,-88.558858737058799,-177.11771747411765,319.7791729416054,null,null,null,0,0,0,0]
[2.0499999999999998,1,null,0,null,-88.558858737058799,-177.11771747411765,319.7791729416054,null,null,null,0,0,0,0]
[2.0499999999999998,1,null,0,null,-88.558858737058799,-177.11771747411765,319.7791729416054,null,null,null,{"$f":"IF($L$21=PartNum,IF(PartType=\"Omnipolar switch\",IF(ABS(H899)>BRP_Typ,0,VOH),\nIF(PartType=\"Unipolar switch\",IF(H899>BRP_Typ,0,VOH),\nIF(PartType=\"Latch\",IF(H899<BRP_Typ,VOH,0),\nIF(PartType=\"Ratiometric PWM output\", IF(50+GAIN*H899<5.3,5.3,IF(50+GAIN*H899>94.7,94.7,50+GAIN*H899)),\nIF(OR(PartType=\"Ratiometric unipolar\",PartType=\"Ratiometric bipolar\",PartType=\"Bipolar\"),IF(AND(VQ+H899*GAIN/1000<=VOH,VQ+H899*GAIN/1000>=VOL),VQ+H899*GAIN/1000,IF(VQ+H899*GAIN/1000>VOH,VOH,VOL))))))),0)","v":0},{"$f":"IF($L$21=PartNum,IF(PartType=\"Omnipolar switch\",IF(ABS(H899)>BOP_Typ,0,VOH),\nIF(PartType=\"Unipolar switch\",IF(H899>BOP_Typ,0,VOH),\nIF(PartType=\"Latch\",IF(H899<BOP_Typ,VOH,0),\"\"))),0)","v":0},{"$f":"IF(PartType=\"Omnipolar switch\",IF(ABS(H899)>BOP_Max,0,VOH),IF(PartType=\"Unipolar switch\",IF(H899>BOP_Max,0,VOH),\"\"))","v":0},{"$f":"IF(PartType=\"Omnipolar switch\",IF(ABS(H899)>BRP_Min,0,VOH),IF(PartType=\"Unipolar switch\",IF(H899>BRP_Min,0,VOH),\"\"))","v":0}]
[2.0499999999999998,1,null,0,null,-88.558858737058799,-177.11771747411765,319.7791729416054,null,null,null,0,0,0,0]
[2.0499999999999998,1,null,0,null,-88.558858737058799,-177.11771747411765,319.7791729416054,null,null,null,0,0,0,0]
[2.0499999999999998,1,null,0,null,-88.558858737058799,-177.11771747411765,319.7791729416054,null,null,null,0,0,0,0]
[2.0499999999999998,1,null,0,null,-88.558858737058799,-177.11771747411765,319.7791729416054,null,null,null,0,0,0,0]
[2.0499999999999998,1,null,0,null,-88.558858737058799,-177.11771747411765,319.7791729416054,null,null,null,0,0,0,0]
[2.0499999999999998,1,null,0,null,-88.558858737058799,-177.11771747411765,319.7791729416054,null,null,null,0,0,0,0]
[2.0499999999999998,1,null,0,null,-88.558858737058799,-177.11771747411765,319.7791729416054,null,null,null,0,0,0,0]
[2.0499999999999998,1,null,0,null,-88.558858737058799,-177.11771747411765,319.7791729416054,null,null,null,0,0,0,0]
[2.0499999999999998,1,null,0,null,-88.558858737058799,-177.11771747411765,319.7791729416054,null,null,null,0,0,0,0]
[2.0499999999999998,1,null,0,null,-88.558858737058799,-177.11771747411765,319.7791729416054,null,null,null,0,0,0,0]
[2.0499999999999998,1,null,0,null,-88.558858737058799,-177.11771747411765,319.7791729416054,null,null,null,0,0,0,0]
[2.0499999999999998,1,null,0,null,-88.558858737058799,-177.11771747411765,319.7791729416054,null,null,null,0,0,0,0]
[2.0499999999999998,1,null,0,null,-88.558858737058799,-177.11771747411765,319.7791729416054,null,null,null,0,0,0,0]
[2.0499999999999998,1,null,0,null,-88.558858737058799,-177.11771747411765,319.7791729416054,null,null,null,0,0,0,0]
[2.0499999999999998,1,null,0,null,-88.558858737058799,-177.11771747411765,319.7791729416054,null,null,null,0,0,0,0]
[2.0499999999999998,1,null,0,null,-88.558858737058799,-177.11771747411765,319.7791729416054,null,null,null,0,0,0,0]
[2.0499999999999998,1,null,0,null,-88.558858737058799,-177.11771747411765,319.7791729416054,null,null,null,0,0,0,0]
[2.0499999999999998,1,null,0,null,-88.558858737058799,-177.11771747411765,319.7791729416054,null,null,null,0,0,0,0]
[2.0499999999999998,1,null,0,null,-88.558858737058799,-177.11771747411765,319.7791729416054,null,null,null,0,0,0,0]
[2.0499999999999998,1,null,0,null,-88.558858737058799,-177.11771747411765,319.7791729416054,null,null,null,0,0,0,0]
[2.0499999999999998,1,null,0,null,-88.558858737058799,-177.11771747411765,319.7791729416054,null,null,null,0,0,0,0]
[2.0499999999999998,1,null,0,null,-88.558858737058799,-177.11771747411765,319.7791729416054,null,null,null,0,0,0,0]
[2.0499999999999998,1,null,0,null,-88.558858737058799,-177.11771747411765,319.7791729416054,null,null,null,0,0,0,0]
[2.0499999999999998,1,null,0,null,-88.558858737058799,-177.11771747411765,319.7791729416054,null,null,null,0,0,0,0]
[2.0499999999999998,1,null,0,null,-88.558858737058799,-177.11771747411765,319.7791729416054,null,null,null,0,0,0,0]
[2.0499999999999998,1,null,0,null,-88.558858737058799,-177.11771747411765,319.7791729416054,null,null,null,0,0,0,0]
[2.0499999999999998,1,null,0,null,-88.558858737058799,-177.11771747411765,319.7791729416054,null,null,null,0,0,0,0]
[2.0499999999999998,1,null,0,null,-88.558858737058799,-177.11771747411765,319.7791729416054,null,null,null,0,0,0,0]
[2.0499999999999998,1,null,0,null,-88.558858737058799,-177.11771747411765,319.7791729416054,null,null,null,0,0,0,0]
[2.0499999999999998,1,null,0,null,-88.558858737058799,-177.11771747411765,319.7791729416054,null,null,null,0,0,0,0]
[2.0499999999999998,1,null,0,null,-88.558858737058799,-177.11771747411765,319.7791729416054,null,null,null,0,0,0,0]
[2.0499999999999998,1,null,0,null,-88.558858737058799,-177.11771747411765,319.7791729416054,null,null,null,0,0,0,0]
[2.0499999999999998,1,null,0,null,-88.558858737058799,-177.11771747411765,319.7791729416054,null,null,null,0,0,0,0]
[2.0499999999999998,1,null,0,null,-88.558858737058799,-177.11771747411765,319.7791729416054,null,null,null,0,0,0,0]
[2.0499999999999998,1,null,0,null,-88.558858737058799,-177.11771747411765,319.7791729416054,null,null,null,0,0,0,0]
[2.0499999999999998,1,null,0,null,-88.558858737058799,-177.11771747411765,319.7791729416054,null,null,null,0,0,0,0]
[2.0499999999999998,1,null,0,null,-88.558858737058799,-177.11771747411765,319.7791729416054,null,null,null,0,0,0,0]
[2.0499999999999998,1,null,0,null,-88.558858737058799,-177.11771747411765,319.7791729416054,null,null,null,0,0,0,0]
[2.0499999999999998,1,null,0,null,-88.558858737058799,-177.11771747411765,319.7791729416054,null,null,null,0,0,0,0]
[2.0499999999999998,1,null,0,null,-88.558858737058799,-177.11771747411765,319.7791729416054,null,null,null,0,0,0,0]
[2.0499999999999998,1,null,0,null,-88.558858737058799,-177.11771747411765,319.7791729416054,null,null,null,0,0,0,0]
[2.0499999999999998,1,null,0,null,-88.558858737058799,-177.11771747411765,319.7791729416054,null,null,null,0,0,0,0]
[2.0499999999999998,1,null,0,null,-88.558858737058799,-177.11771747411765,319.7791729416054,null,null,null,0,0,0,0]
[2.0499999999999998,1,null,0,null,-88.558858737058799,-177.11771747411765,319.7791729416054,null,null,null,0,0,0,0]
[2.0499999999999998,1,null,0,null,-88.558858737058799,-177.11771747411765,319.7791729416054,null,null,null,0,0,0,0]
[2.0499999999999998,1,null,0,null,-88.558858737058799,-177.11771747411765,319.7791729416054,null,null,null,0,0,0,0]
[2.0499999999999998,1,null,0,null,-88.558858737058799,-177.11771747411765,319.7791729416054,null,null,null,0,0,0,0]
[2.0499999999999998,1,null,0,null,-88.558858737058799,-177.11771747411765,319.7791729416054,null,null,null,0,0,0,0]
[2.0499999999999998,1,null,0,null,-88.558858737058799,-177.11771747411765,319.7791729416054,null,null,null,0,0,0,0]
[2.0499999999999998,1,null,0,null,-88.558858737058799,-177.11771747411765,319.7791729416054,null,null,null,0,0,0,0]
[2.0499999999999998,1,null,0,null,-88.558858737058799,-177.11771747411765,319.7791729416054,null,null,null,0,0,0,0]
[2.0499999999999998,1,null,0,null,-88.558858737058799,-177.11771747411765,319.7791729416054,null,null,null,0,0,0,0]
[2.0499999999999998,1,null,0,null,-88.558858737058799,-177.11771747411765,319.7791729416054,null,null,null,0,0,0,0]
[2.0499999999999998,1,null,0,null,-88.558858737058799,-177.11771747411765,319.7791729416054,null,null,null,0,0,0,0]
[2.0499999999999998,1,null,0,null,-88.558858737058799,-177.11771747411765,319.7791729416054,null,null,null,0,0,0,0]
[2.0499999999999998,1,null,0,null,-88.558858737058799,-177.11771747411765,319.7791729416054,null,null,null,0,0,0,0]
[2.0499999999999998,1,null,0,null,-88.558858737058799,-177.11771747411765,319.7791729416054,null,null,null,0,0,0,0]
[2.0499999999999998,1,null,0,null,-88.558858737058799,-177.11771747411765,319.7791729416054,null,null,null,0,0,0,0]
[2.0499999999999998,1,null,0,null,-88.558858737058799,-177.11771747411765,319.7791729416054,null,null,null,0,0,0,0]
[2.0499999999999998,1,null,0,null,-88.558858737058799,-177.11771747411765,319.7791729416054,null,null,null,0,0,0,0]
[2.0499999999999998,1,null,0,null,-88.558858737058799,-177.11771747411765,319.7791729416054,null,null,null,0,0,0,0]
[2.0499999999999998,1,null,0,null,-88.558858737058799,-177.11771747411765,319.7791729416054,null,null,null,0,0,0,0]
[2.0499999999999998,1,null,0,null,-88.558858737058799,-177.11771747411765,319.7791729416054,null,null,null,0,0,0,0]
[2.0499999999999998,1,null,0,null,-88.558858737058799,-177.11771747411765,319.7791729416054,null,null,null,{"$f":"IF($L$21=PartNum,IF(PartType=\"Omnipolar switch\",IF(ABS(H963)>BRP_Typ,0,VOH),\nIF(PartType=\"Unipolar switch\",IF(H963>BRP_Typ,0,VOH),\nIF(PartType=\"Latch\",IF(H963<BRP_Typ,VOH,0),\nIF(PartType=\"Ratiometric PWM output\", IF(50+GAIN*H963<5.3,5.3,IF(50+GAIN*H963>94.7,94.7,50+GAIN*H963)),\nIF(OR(PartType=\"Ratiometric unipolar\",PartType=\"Ratiometric bipolar\",PartType=\"Bipolar\"),IF(AND(VQ+H963*GAIN/1000<=VOH,VQ+H963*GAIN/1000>=VOL),VQ+H963*GAIN/1000,IF(VQ+H963*GAIN/1000>VOH,VOH,VOL))))))),0)","v":0},{"$f":"IF($L$21=PartNum,IF(PartType=\"Omnipolar switch\",IF(ABS(H963)>BOP_Typ,0,VOH),\nIF(PartType=\"Unipolar switch\",IF(H963>BOP_Typ,0,VOH),\nIF(PartType=\"Latch\",IF(H963<BOP_Typ,VOH,0),\"\"))),0)","v":0},{"$f":"IF(PartType=\"Omnipolar switch\",IF(ABS(H963)>BOP_Max,0,VOH),IF(PartType=\"Unipolar switch\",IF(H963>BOP_Max,0,VOH),\"\"))","v":0},{"$f":"IF(PartType=\"Omnipolar switch\",IF(ABS(H963)>BRP_Min,0,VOH),IF(PartType=\"Unipolar switch\",IF(H963>BRP_Min,0,VOH),\"\"))","v":0}]
[2.0499999999999998,1,null,0,null,-88.558858737058799,-177.11771747411765,319.7791729416054,null,null,null,0,0,0,0]
[2.0499999999999998,1,null,0,null,-88.558858737058799,-177.11771747411765,319.7791729416054,null,null,null,0,0,0,0]
[2.0499999999999998,1,null,0,null,-88.558858737058799,-177.11771747411765,319.7791729416054,null,null,null,0,0,0,0]
[2.0499999999999998,1,null,0,null,-88.558858737058799,-177.11771747411765,319.7791729416054,null,null,null,0,0,0,0]
[2.0499999999999998,1,null,0,null,-88.558858737058799,-177.11771747411765,319.7791729416054,null,null,null,0,0,0,0]
[2.0499999999999998,1,null,0,null,-88.558858737058799,-177.11771747411765,319.7791729416054,null,null,null,0,0,0,0]
[2.0499999999999998,1,null,0,null,-88.558858737058799,-177.11771747411765,319.7791729416054,null,null,null,0,0,0,0]
[2.0499999999999998,1,null,0,null,-88.558858737058799,-177.11771747411765,319.7791729416054,null,null,null,0,0,0,0]
[2.0499999999999998,1,null,0,null,-88.558858737058799,-177.11771747411765,319.7791729416054,null,null,null,0,0,0,0]
[2.0499999999999998,1,null,0,null,-88.558858737058799,-177.11771747411765,319.7791729416054,null,null,null,0,0,0,0]
[2.0499999999999998,1,null,0,null,-88.558858737058799,-177.11771747411765,319.7791729416054,null,null,null,0,0,0,0]
[2.0499999999999998,1,null,0,null,-88.558858737058799,-177.11771747411765,319.7791729416054,null,null,null,0,0,0,0]
[2.0499999999999998,1,null,0,null,-88.558858737058799,-177.11771747411765,319.7791729416054,null,null,null,0,0,0,0]
[2.0499999999999998,1,null,0,null,-88.558858737058799,-177.11771747411765,319.7791729416054,null,null,null,0,0,0,0]
[2.0499999999999998,1,null,0,null,-88.558858737058799,-177.11771747411765,319.7791729416054,null,null,null,0,0,0,0]
[2.0499999999999998,1,null,0,null,-88.558858737058799,-177.11771747411765,319.7791729416054,null,null,null,0,0,0,0]
[2.0499999999999998,1,null,0,null,-88.558858737058799,-177.11771747411765,319.7791729416054,null,null,null,0,0,0,0]
[2.0499999999999998,1,null,0,null,-88.558858737058799,-177.11771747411765,319.7791729416054,null,null,null,0,0,0,0]
[2.0499999999999998,1,null,0,null,-88.558858737058799,-177.11771747411765,319.7791729416054,null,null,null,0,0,0,0]
[2.0499999999999998,1,null,0,null,-88.558858737058799,-177.11771747411765,319.7791729416054,null,null,null,0,0,0,0]
[2.0499999999999998,1,null,0,null,-88.558858737058799,-177.11771747411765,319.7791729416054,null,null,null,0,0,0,0]
[2.0499999999999998,1,null,0,null,-88.558858737058799,-177.11771747411765,319.7791729416054,null,null,null,0,0,0,0]
[2.0499999999999998,1,null,0,null,-88.558858737058799,-177.11771747411765,319.7791729416054,null,null,null,0,0,0,0]
[2.0499999999999998,1,null,0,null,-88.558858737058799,-177.11771747411765,319.7791729416054,null,null,null,0,0,0,0]
[2.0499999999999998,1,null,0,null,-88.558858737058799,-177.11771747411765,319.7791729416054,null,null,null,0,0,0,0]
[2.0499999999999998,1,null,0,null,-88.558858737058799,-177.11771747411765,319.7791729416054,null,null,null,0,0,0,0]
[2.0499999999999998,1,null,0,null,-88.558858737058799,-177.11771747411765,319.7791729416054,null,null,null,0,0,0,0]
[2.0499999999999998,1,null,0,null,-88.558858737058799,-177.11771747411765,319.7791729416054,null,null,null,0,0,0,0]
[2.0499999999999998,1,null,0,null,-88.558858737058799,-177.11771747411765,319.7791729416054,null,null,null,0,0,0,0]
[2.0499999999999998,1,null,0,null,-88.558858737058799,-177.11771747411765,319.7791729416054,null,null,null,0,0,0,0]
[2.0499999999999998,1,null,0,null,-88.558858737058799,-177.11771747411765,319.7791729416054,null,null,null,0,0,0,0]
[2.0499999999999998,1,null,0,null,-88.558858737058799,-177.11771747411765,319.7791729416054,null,null,null,0,0,0,0]
[2.0499999999999998,1,null,0,null,-88.558858737058799,-177.11771747411765,319.7791729416054,null,null,null,0,0,0,0]
[2.0499999999999998,1,null,0,null,-88.558858737058799,-177.11771747411765,319.7791729416054,null,null,null,0,0,0,0]
[2.0499999999999998,1,null,0,null,-88.558858737058799,-177.11771747411765,319.7791729416054,null,null,null,0,0,0,0]
[2.0499999999999998,1,null,0,null,-88.558858737058799,-177.11771747411765,319.7791729416054,null,null,null,0,0,0,0]
[2.0499999999999998,1,null,0,null,-88.558858737058799,-177.11771747411765,319.7791729416054,null,null,null,0,0,0,0]
[2.0499999999999998,1,null,0,null,-88.558858737058799,-177.11771747411765,319.7791729416054,null,null,null,0,0,0,0]
[2.0499999999999998,1,null,0,null,-88.558858737058799,-177.11771747411765,319.7791729416054,null,null,null,0,0,0,0]
[2.0499999999999998,1,null,0,null,-88.558858737058799,-177.11771747411765,319.7791729416054,null,null,null,0,0,0,0]
[2.0499999999999998,1,null,0,null,-88.558858737058799,-177.11771747411765,319.7791729416054,null,null,null,0,0,0,0]
[2.0499999999999998,1,null,0,null,-88.558858737058799,-177.11771747411765,319.7791729416054,null,null,null,0,0,0,0]
[2.0499999999999998,1,null,0,null,-88.558858737058799,-177.11771747411765,319.7791729416054,null,null,null,0,0,0,0]
[2.0499999999999998,1,null,0,null,-88.558858737058799,-177.11771747411765,319.7791729416054,null,null,null,0,0,0,0]
[2.0499999999999998,1,null,0,null,-88.558858737058799,-177.11771747411765,319.7791729416054,null,null,null,0,0,0,0]
[2.0499999999999998,1,null,0,null,-88.558858737058799,-177.11771747411765,319.7791729416054,null,null,null,0,0,0,0]
[2.0499999999999998,1,null,0,null,-88.558858737058799,-177.11771747411765,319.7791729416054,null,null,null,0,0,0,0]
[2.0499999999999998,1,null,0,null,-88.558858737058799,-177.11771747411765,319.7791729416054,null,null,null,0,0,0,0]
[2.0499999999999998,1,null,0,null,-88.558858737058799,-177.11771747411765,319.7791729416054,null,null,null,0,0,0,0]
[2.0499999999999998,1,null,0,null,-88.558858737058799,-177.11771747411765,319.7791729416054,null,null,null,0,0,0,0]
[2.0499999999999998,1,null,0,null,-88.558858737058799,-177.11771747411765,319.7791729416054,null,null,null,0,0,0,0]
[2.0499999999999998,1,null,0,null,-88.558858737058799,-177.11771747411765,319.7791729416054,null,null,null,0,0,0,0]
[2.0499999999999998,1,null,0,null,-88.558858737058799,-177.11771747411765,319.7791729416054,null,null,null,0,0,0,0]
[2.0499999999999998,1,null,0,null,-88.558858737058799,-177.11771747411765,319.7791729416054,null,null,null,0,0,0,0]
[2.0499999999999998,1,null,0,null,-88.558858737058799,-177.11771747411765,319.7791729416054,null,null,null,0,0,0,0]
[2.0499999999999998,1,null,0,null,-88.558858737058799,-177.11771747411765,319.7791729416054,null,null,null,0,0,0,0]
[2.0499999999999998,1,null,0,null,-88.558858737058799,-177.11771747411765,319.7791729416054,null,null,null,0,0,0,0]
[2.0499999999999998,1,null,0,null,-88.558858737058799,-177.11771747411765,319.7791729416054,null,null,null,0,0,0,0]
[2.0499999999999998,1,null,0,null,-88.558858737058799,-177.11771747411765,319.7791729416054,null,null,null,0,0,0,0]
[2.0499999999999998,1,null,0,null,-88.558858737058799,-177.11771747411765,319.7791729416054,null,null,null,0,0,0,0]
[2.0499999999999998,1,null,0,null,-88.558858737058799,-177.11771747411765,319.7791729416054,null,null,null,0,0,0,0]
[2.0499999999999998,1,null,0,null,-88.558858737058799,-177.11771747411765,319.7791729416054,null,null,null,0,0,0,0]
[2.0499999999999998,1,null,0,null,-88.558858737058799,-177.11771747411765,319.7791729416054,null,null,null,0,0,0,0]
[2.0499999999999998,1,null,0,null,-88.558858737058799,-177.11771747411765,319.7791729416054,null,null,null,{"$f":"IF($L$21=PartNum,IF(PartType=\"Omnipolar switch\",IF(ABS(H1027)>BRP_Typ,0,VOH),\nIF(PartType=\"Unipolar switch\",IF(H1027>BRP_Typ,0,VOH),\nIF(PartType=\"Latch\",IF(H1027<BRP_Typ,VOH,0),\nIF(PartType=\"Ratiometric PWM output\", IF(50+GAIN*H1027<5.3,5.3,IF(50+GAIN*H1027>94.7,94.7,50+GAIN*H1027)),\nIF(OR(PartType=\"Ratiometric unipolar\",PartType=\"Ratiometric bipolar\",PartType=\"Bipolar\"),IF(AND(VQ+H1027*GAIN/1000<=VOH,VQ+H1027*GAIN/1000>=VOL),VQ+H1027*GAIN/1000,IF(VQ+H1027*GAIN/1000>VOH,VOH,VOL))))))),0)","v":0},{"$f":"IF($L$21=PartNum,IF(PartType=\"Omnipolar switch\",IF(ABS(H1027)>BOP_Typ,0,VOH),\nIF(PartType=\"Unipolar switch\",IF(H1027>BOP_Typ,0,VOH),\nIF(PartType=\"Latch\",IF(H1027<BOP_Typ,VOH,0),\"\"))),0)","v":0},{"$f":"IF(PartType=\"Omnipolar switch\",IF(ABS(H1027)>BOP_Max,0,VOH),IF(PartType=\"Unipolar switch\",IF(H1027>BOP_Max,0,VOH),\"\"))","v":0},{"$f":"IF(PartType=\"Omnipolar switch\",IF(ABS(H1027)>BRP_Min,0,VOH),IF(PartType=\"Unipolar switch\",IF(H1027>BRP_Min,0,VOH),\"\"))","v":0}]
[2.0499999999999998,1,null,0,null,-88.558858737058799,-177.11771747411765,319.7791729416054,null,null,null,0,0,0,0]
[2.0499999999999998,1,null,0,null,-88.558858737058799,-177.11771747411765,319.7791729416054,null,null,null,0,0,0,0]
[2.0499999999999998,1,null,0,null,-88.558858737058799,-177.11771747411765,319.7791729416054,null,null,null,0,0,0,0]
[2.0499999999999998,1,null,0,null,-88.558858737058799,-177.11771747411765,319.7791729416054,null,null,null,0,0,0,0]
[2.0499999999999998,1,null,0,null,-88.558858737058799,-177.11771747411765,319.7791729416054,null,null,null,0,0,0,0]
[2.0499999999999998,1,null,0,null,-88.558858737058799,-177.11771747411765,319.7791729416054,null,null,null,0,0,0,0]
[2.0499999999999998,1,null,0,null,-88.558858737058799,-177.11771747411765,319.7791729416054,null,null,null,0,0,0,0]
[2.0499999999999998,1,null,0,null,-88.558858737058799,-177.11771747411765,319.7791729416054,null,null,null,0,0,0,0]
[2.0499999999999998,1,null,0,null,-88.558858737058799,-177.11771747411765,319.7791729416054,null,null,null,0,0,0,0]
[2.0499999999999998,1,null,0,null,-88.558858737058799,-177.11771747411765,319.7791729416054,null,null,null,0,0,0,0]
[2.0499999999999998,1,null,0,null,-88.558858737058799,-177.11771747411765,319.7791729416054,null,null,null,0,0,0,0]
[2.0499999999999998,1,null,0,null,-88.558858737058799,-177.11771747411765,319.7791729416054,null,null,null,0,0,0,0]
[2.0499999999999998,1,null,0,null,-88.558858737058799,-177.11771747411765,319.7791729416054,null,null,null,0,0,0,0]
[2.0499999999999998,1,null,0,null,-88.558858737058799,-177.11771747411765,319.7791729416054,null,null,null,0,0,0,0]
[2.0499999999999998,1,null,0,null,-88.558858737058799,-177.11771747411765,319.7791729416054,null,null,null,0,0,0,0]
[2.0499999999999998,1,null,0,null,-88.558858737058799,-177.11771747411765,319.7791729416054,null,null,null,0,0,0,0]
[2.0499999999999998,1,null,0,null,-88.558858737058799,-177.11771747411765,319.7791729416054,null,null,null,0,0,0,0]
[2.0499999999999998,1,null,0,null,-88.558858737058799,-177.11771747411765,319.7791729416054,null,null,null,0,0,0,0]
[2.0499999999999998,1,null,0,null,-88.558858737058799,-177.11771747411765,319.7791729416054,null,null,null,0,0,0,0]
[2.0499999999999998,1,null,0,null,-88.558858737058799,-177.11771747411765,319.7791729416054,null,null,null,0,0,0,0]
[2.0499999999999998,1,null,0,null,-88.558858737058799,-177.11771747411765,319.7791729416054,null,null,null,0,0,0,0]
[2.0499999999999998,1,null,0,null,-88.558858737058799,-177.11771747411765,319.7791729416054,null,null,null,0,0,0,0]
[2.0499999999999998,1,null,0,null,-88.558858737058799,-177.11771747411765,319.7791729416054,null,null,null,0,0,0,0]
[2.0499999999999998,1,null,0,null,-88.558858737058799,-177.11771747411765,319.7791729416054,null,null,null,0,0,0,0]
[2.0499999999999998,1,null,0,null,-88.558858737058799,-177.11771747411765,319.7791729416054,null,null,null,0,0,0,0]
[2.0499999999999998,1,null,0,null,-88.558858737058799,-177.11771747411765,319.7791729416054,null,null,null,0,0,0,0]
[2.0499999999999998,1,null,0,null,-88.558858737058799,-177.11771747411765,319.7791729416054,null,null,null,0,0,0,0]
[2.0499999999999998,1,null,0,null,-88.558858737058799,-177.11771747411765,319.7791729416054,null,null,null,0,0,0,0]
[2.0499999999999998,1,null,0,null,-88.558858737058799,-177.11771747411765,319.7791729416054,null,null,null,0,0,0,0]
[2.0499999999999998,1,null,0,null,-88.558858737058799,-177.11771747411765,319.7791729416054,null,null,null,0,0,0,0]
[2.0499999999999998,1,null,0,null,-88.558858737058799,-177.11771747411765,319.7791729416054,null,null,null,0,0,0,0]
[2.0499999999999998,1,null,0,null,-88.558858737058799,-177.11771747411765,319.7791729416054,null,null,null,0,0,0,0]
[2.0499999999999998,1,null,0,null,-88.558858737058799,-177.11771747411765,319.7791729416054,null,null,null,0,0,0,0]
[2.0499999999999998,1,null,0,null,-88.558858737058799,-177.11771747411765,319.7791729416054,null,null,null,0,0,0,0]
[2.0499999999999998,1,null,0,null,-88.558858737058799,-177.11771747411765,319.7791729416054,null,null,null,0,0,0,0]
[2.0499999999999998,1,null,0,null,-88.558858737058799,-177.11771747411765,319.7791729416054,null,null,null,0,0,0,0]
[2.0499999999999998,1,null,0,null,-88.558858737058799,-177.11771747411765,319.7791729416054,null,null,null,0,0,0,0]
[2.0499999999999998,1,null,0,null,-88.558858737058799,-177.11771747411765,319.7791729416054,null,null,null,0,0,0,0]
[2.0499999999999998,1,null,0,null,-88.558858737058799,-177.11771747411765,319.7791729416054,null,null,null,0,0,0,0]
[2.0499999999999998,1,null,0,null,-88.558858737058799,-177.11771747411765,319.7791729416054,null,null,null,0,0,0,0]
[2.0499999999999998,1,null,0,null,-88.558858737058799,-177.11771747411765,319.7791729416054,null,null,null,0,0,0,0]
[2.0499999999999998,1,null,0,null,-88.558858737058799,-177.11771747411765,319.7791729416054,null,null,null,0,0,0,0]
[2.0499999999999998,1,null,0,null,-88.558858737058799,-177.11771747411765,319.7791729416054,null,null,null,0,0,0,0]
[2.0499999999999998,1,null,0,null,-88.558858737058799,-177.11771747411765,319.7791729416054,null,null,null,0,0,0,0]
[2.0499999999999998,1,null,0,null,-88.558858737058799,-177.11771747411765,319.7791729416054,null,null,null,0,0,0,0]
[2.0499999999999998,1,null,0,null,-88.558858737058799,-177.11771747411765,319.7791729416054,null,null,null,0,0,0,0]
[2.0499999999999998,1,null,0,null,-88.558858737058799,-177.11771747411765,319.7791729416054,null,null,null,0,0,0,0]
[2.0499999999999998,1,null,0,null,-88.558858737058799,-177.11771747411765,319.7791729416054,null,null,null,0,0,0,0]
[2.0499999999999998,1,null,0,null,-88.558858737058799,-177.11771747411765,319.7791729416054,null,null,null,0,0,0,0]
[2.0499999999999998,1,null,0,null,-88.558858737058799,-177.11771747411765,319.7791729416054,null,null,null,0,0,0,0]
[2.0499999999999998,1,null,0,null,-88.558858737058799,-177.11771747411765,319.7791729416054,null,null,null,0,0,0,0]
[2.0499999999999998,1,null,0,null,-88.558858737058799,-177.11771747411765,319.7791729416054,null,null,null,0,0,0,0]
[2.0499999999999998,1,null,0,null,-88.558858737058799,-177.11771747411765,319.7791729416054,null,null,null,0,0,0,0]
[2.0499999999999998,1,null,0,null,-88.558858737058799,-177.11771747411765,319.7791729416054,null,null,null,0,0,0,0]
[2.0499999999999998,1,null,0,null,-88.558858737058799,-177.11771747411765,319.7791729416054,null,null,null,0,0,0,0]
[2.0499999999999998,1,null,0,null,-88.558858737058799,-177.11771747411765,319.7791729416054,null,null,null,0,0,0,0]
[2.0499999999999998,1,null,0,null,-88.558858737058799,-177.11771747411765,319.7791729416054,null,null,null,0,0,0,0]
[2.0499999999999998,1,null,0,null,-88.558858737058799,-177.11771747411765,319.7791729416054,null,null,null,0,0,0,0]
[2.0499999999999998,1,null,0,null,-88.558858737058799,-177.11771747411765,319.7791729416054,null,null,null,0,0,0,0]
[2.0499999999999998,1,null,0,null,-88.558858737058799,-177.11771747411765,319.7791729416054,null,null,null,0,0,0,0]

{"sheet":"ChartControls","index":2,"n_rows":827,"n_cols":8,"rows_kept":827,"cut":false,"hidden":true,"merged":[[0,5,0,6],[11,5,11,6],[9,0,9,2]]}
[null,"Min","Max","step",null,"OUTPUT_CHART"]
["Vout",{"$f":"IF(OR(ChartControls!B44=\"Omnipolar Switch\", ChartControls!B44=\"Unipolar Switch\"),\nROUND(MIN(DesignTool!$L$67:$O$1087)-(MAX(DesignTool!$L$67:$O$1087)-MIN(DesignTool!$L$67:$O$1087))*0.1,1),\nROUND(MIN(DesignTool!$L$67:$M$1087)-(MAX(DesignTool!$L$67:$M$1087)-MIN(DesignTool!$L$67:$M$1087))*0.1,1))","v":0},{"$f":"ROUND(MAX(DesignTool!$L$67:$O$1087)*1.1,1)","v":0},{"$f":"(C2-B2)/1020","v":0},null,"Value Axis =>",{"$f":"IF(Processing=1,\"\",setChartAxis(\"DesignTool\",\"OUTPUT_CHART\",\"Min\",\"Value\",\"Primary\",B2))","v":"Value Primary Min: 0"}]
["Bvals",{"$f":"MIN(MIN(DesignTool!F67:H1087),MIN(DesignTool!X67:Y1087))","v":-177.11771747411765},{"$f":"MAX(MAX(DesignTool!F67:H1087),MAX(DesignTool!X67:Y1087))","v":319.7791729416054},null,null,"Value Axis =>",{"$f":"IF(Processing=1,\"\",setChartAxis(\"DesignTool\",\"OUTPUT_CHART\",\"Max\",\"Value\",\"Primary\",C2))","v":"Value Primary Max: 0"}]
["Bchart",{"$f":"ROUND(B3-(C3-B3)*0.1,2)","v":-226.81},{"$f":"ROUND(C3+(C3-B3)*0.1,2)","v":369.47},null,null,"Secondary Value Axis =>",{"$f":"IF(Processing=1,\"\",setChartAxis(\"Sheet2\",\"Chart 2\",\"Min\",\"Value\",\"Secondary\",#REF!))","v":{"$error":"#VALUE!"}}]
["dz",{"$f":"ROUND(MIN(DesignTool!D67:D1087),1)","v":0},{"$f":"ROUND(MAX(DesignTool!D67:D1087),1)","v":0},null,null,"Secondary Value Axis =>",{"$f":"IF(Processing=1,\"\",setChartAxis(\"Sheet2\",\"Chart 2\",\"Max\",\"Value\",\"Secondary\",#REF!))","v":{"$error":"#VALUE!"}}]
["dx",{"$f":"ROUND(MIN(DesignTool!A67:A1087)-0.04,1)","v":2},{"$f":"ROUND(MAX(DesignTool!A67:A1087)+0.05,1)","v":2.1},null,null,"Category Axis =>",{"$f":"IF(Processing=1,\"\",setChartAxis(\"DesignTool\",\"OUTPUT_CHART\",\"Min\",\"Category\",\"Primary\",IF(Magnet_Movement=\"Head-On\",B5,IF(Magnet_Movement=\"Slide-By\",B6,B8))))","v":"Category Primary Min: 2"}]
["dy",null,null,null,null,"Category Axis =>",{"$f":"IF(Processing=1,\"\",setChartAxis(\"DesignTool\",\"OUTPUT_CHART\",\"Max\",\"Category\",\"Primary\",IF(Magnet_Movement=\"Head-On\",C5,IF(Magnet_Movement=\"Slide-By\",C6,C8))))","v":"Category Primary Max: 2.1"}]
["angle",{"$f":"ROUND(MIN(DesignTool!I67:I1087),1)","v":0},{"$f":"ROUND(MAX(DesignTool!I67:I1087),1)","v":0},null,null,"Secondary Category Axis =>",{"$f":"IF(Processing=1,\"\",setChartAxis(\"Sheet2\",\"Chart 2\",\"Min\",\"Category\",\"Secondary\",#REF!))","v":{"$error":"#VALUE!"}}]
[null,null,null,null,null,"Secondary Category Axis =>",{"$f":"IF(Processing=1,\"\",setChartAxis(\"Sheet2\",\"Chart 2\",\"Max\",\"Category\",\"Secondary\",#REF!))","v":{"$error":"#VALUE!"}}]
["Switch and Latch Markers"]
["OUTPUT_CHART","x","y"]
["BOP MIN ",null,{"$f":"($C$2-$B$2)/2+$B$2","v":0},null,null,"B_FIELD_CHART"]
["BOP TYP ",null,{"$f":"($C$2-$B$2)/2+$B$2","v":0},null,null,"Value Axis =>",{"$f":"IF(Processing=1,\"\",setChartAxis(\"DesignTool\",\"B_FIELD_CHART\",\"Min\",\"Value\",\"Primary\",B4))","v":"Value Primary Min: -226.81"}]
["BOP TYP p2",{"$f":"B13","v":0},{"$f":"C13+D2","v":0},null,null,"Value Axis =>",{"$f":"IF(Processing=1,\"\",setChartAxis(\"DesignTool\",\"B_FIELD_CHART\",\"Max\",\"Value\",\"Primary\",C4))","v":"Value Primary Max: 369.47"}]
["BOP MAX ",null,{"$f":"VSUPPLY","v":3.3},null,null,"Secondary Value Axis =>",{"$f":"IF(Processing=1,\"\",setChartAxis(\"Sheet2\",\"Chart 2\",\"Min\",\"Value\",\"Secondary\",#REF!))","v":{"$error":"#VALUE!"}}]
["BRP MIN ",null,{"$f":"($C$2-$B$2)/8+$B$2","v":0},null,null,"Secondary Value Axis =>",{"$f":"IF(Processing=1,\"\",setChartAxis(\"Sheet2\",\"Chart 2\",\"Max\",\"Value\",\"Secondary\",#REF!))","v":{"$error":"#VALUE!"}}]
["BRP TYP ",null,0,null,null,"Category Axis =>",{"$f":"IF(Processing=1,\"\",setChartAxis(\"DesignTool\",\"B_FIELD_CHART\",\"Min\",\"Category\",\"Primary\",IF(Magnet_Movement=\"Head-On\",B5,IF(Magnet_Movement=\"Slide-By\",B6,B8))))","v":"Category Primary Min: 2"}]
["BRP TYP p2",{"$f":"B17","v":0},{"$f":"C17+D2","v":0},null,null,"Category Axis =>",{"$f":"IF(Processing=1,\"\",setChartAxis(\"DesignTool\",\"B_FIELD_CHART\",\"Max\",\"Category\",\"Primary\",IF(Magnet_Movement=\"Head-On\",C5,IF(Magnet_Movement=\"Slide-By\",C6,C8))))","v":"Category Primary Max: 2.1"}]
["BRP MAX",{"$f":"INDEX(DesignTool!D67:D1087,MATCH(TRUE,INDEX(DesignTool!O67:O1087<>0,),0))","v":{"$error":"#N/A"}},{"$f":"($C$2-$B$2)/8+$B$2","v":0},null,null,"Secondary Category Axis =>",{"$f":"IF(Processing=1,\"\",setChartAxis(\"Sheet2\",\"Chart 2\",\"Min\",\"Category\",\"Secondary\",#REF!))","v":{"$error":"#VALUE!"}}]
["d1",{"$f":"d1MIN","v":2.0499999999999998},{"$f":"B2","v":0},null,null,"Secondary Category Axis =>",{"$f":"IF(Processing=1,\"\",setChartAxis(\"Sheet2\",\"Chart 2\",\"Max\",\"Category\",\"Secondary\",#REF!))","v":{"$error":"#VALUE!"}}]
["d1 p2",{"$f":"B20","v":2.0499999999999998},{"$f":"C2","v":0}]
["d2",{"$f":"d2MAX","v":2.0499999999999998},{"$f":"B2","v":0}]
["d2 p2",{"$f":"B22","v":2.0499999999999998},{"$f":"C2","v":0}]
["Vcc",{"$f":"B52","v":2.0499999999999998},{"$f":"VOH","v":3.3}]
["Vcc p2",{"$f":"B53","v":2.0499999999999998},{"$f":"VOH","v":3.3}]
["VQ",{"$f":"B52","v":2.0499999999999998},{"$f":"VQ","v":0}]
["VQ p2",{"$f":"B53","v":2.0499999999999998},{"$f":"VQ","v":0}]
[]
["B_FIELD_CHART"]
["BOP MIN ",{"$f":"BOP_Min","v":1.4}]
["BOP TYP ",{"$f":"B48","v":0},{"$f":"BOP_Typ","v":2.9}]
["BOP TYP p2",{"$f":"B49","v":0},{"$f":"BOP_Typ","v":2.9}]
["BOP MAX ",{"$f":"B52","v":2.0499999999999998},{"$f":"BOP_Max","v":4.4000000000000004}]
["BOP MAX p2 ",{"$f":"B53","v":2.0499999999999998},{"$f":"C33","v":4.4000000000000004}]
["BRP MIN ",{"$f":"B52","v":2.0499999999999998},{"$f":"BRP_Min","v":0.4}]
["BRP MIN p2",{"$f":"B53","v":2.0499999999999998},{"$f":"BRP_Min","v":0.4}]
["BRP TYP ",{"$f":"BRP_Typ","v":1.8},{"$f":"DesignTool!D67","v":0}]
["BRP TYP p2",{"$f":"B37","v":1.8},{"$f":"DesignTool!D1087","v":0}]
["BRP MAX"]
["d1",{"$f":"d1MIN","v":2.0499999999999998},{"$f":"BchartMin","v":-226.81}]
["d1 p2",{"$f":"B40","v":2.0499999999999998},{"$f":"BchartMax","v":369.47}]
["d2",{"$f":"d2MAX","v":2.0499999999999998},{"$f":"BchartMin","v":-226.81}]
["d2 p2",{"$f":"B42","v":2.0499999999999998},{"$f":"BchartMax","v":369.47}]
["dx",{"$f":"MIN(DesignTool!$A$67:$A$1087)","v":2.0499999999999998}]
["dx p2",{"$f":"MAX(DesignTool!$A$67:$A$1087)","v":2.0499999999999998}]
["dy",{"$f":"MIN(DesignTool!$B$67:$B$1087)","v":1}]
["dy p2",{"$f":"MAX(DesignTool!$B$67:$B$1087)","v":1}]
["dz",{"$f":"MIN(DesignTool!$D$67:$D$1087)","v":0}]
["dz p2",{"$f":"MAX(DesignTool!$D$1087)","v":0}]
["a",{"$f":"MIN(DesignTool!I67:I1087)","v":0}]
["a p2",{"$f":"MAX(DesignTool!I67:I1087)","v":0}]
["d",{"$f":"IF(Magnet_Movement=\"Head-On\",ChartControls!B48,IF(Magnet_Movement=\"Slide-By\",ChartControls!B44,IF(Magnet_Movement=\"Hinge\",B50,\"\")))","v":2.0499999999999998}]
["d p2",{"$f":"IF(Magnet_Movement=\"Head-On\",ChartControls!B49,IF(Magnet_Movement=\"Slide-By\",ChartControls!B45,IF(Magnet_Movement=\"Hinge\",B51,\"\")))","v":2.0499999999999998}]
[]
[]
[]
[]
[]
[]
[]
[]
[]
[]
[]
[]
[]
[]
[]
[]
[]
[]
[]
[]
[]
[]
[]
[]
[]
[]
[]
[]
[]
[]
[]
[]
[]
[]
[]
[]
[]
[]
[]
[]
[]
[]
[]
[]
[]
[]
[]
[]
[]
[]
[]
[]
[]
[]
[]
[]
[]
[]
[]
[]
[]
[]
[]
[]
[]
[]
[]
[]
[]
[]
[]
[]
[]
[]
[]
[]
[]
[]
[]
[]
[]
[]
[]
[]
[]
[]
[]
[]
[]
[]
[]
[]
[]
[]
[]
[]
[]
[]
[]
[]
[]
[]
[]
[]
[]
[]
[]
[]
[]
[]
[]
[]
[]
[]
[]
[]
[]
[]
[]
[]
[]
[]
[]
[]
[]
[]
[]
[]
[]
[]
[]
[]
[]
[]
[]
[]
[]
[]
[]
[]
[]
[]
[]
[]
[]
[]
[]
[]
[]
[]
[]
[]
[]
[]
[]
[]
[]
[]
[]
[]
[]
[]
[]
[]
[]
[]
[]
[]
[]
[]
[]
[]
[]
[]
[]
[]
[]
[]
[]
[]
[]
[]
[]
[]
[]
[]
[]
[]
[]
[]
[]
[]
[]
[]
[]
[]
[]
[]
[]
[]
[]
[]
[]
[]
[]
[]
[]
[]
[]
[]
[]
[]
[]
[]
[]
[null,null,null,{"$f":"HEX2DEC(\"1d43\")","v":7491}]
[]
[]
[]
[]
[]
[]
[]
[]
[]
[]
[]
[]
[]
[]
[]
[]
[]
[]
[]
[]
[]
[]
[]
[]
[]
[]
[]
[]
[]
[]
[]
[]
[]
[]
[]
[]
[]
[]
[]
[]
[]
[]
[]
[]
[]
[]
[]
[]
[]
[]
[]
[]
[]
[]
[]
[]
[]
[]
[]
[]
[]
[]
[]
[]
[]
[]
[]
[]
[]
[]
[]
[]
[]
[]
[]
[]
[]
[]
[]
[]
[]
[]
[]
[]
[]
[]
[]
[]
[]
[]
[]
[]
[]
[]
[]
[]
[]
[]
[]
[]
[]
[]
[]
[]
[]
[]
[]
[]
[]
[]
[]
[]
[]
[]
[]
[]
[]
[]
[]
[]
[]
[]
[]
[]
[]
[]
[]
[]
[]
[]
[]
[]
[]
[]
[]
[]
[]
[]
[]
[]
[]
[]
[]
[]
[]
[]
[]
[]
[]
[]
[]
[]
[]
[]
[]
[]
[]
[]
[]
[]
[]
[]
[]
[]
[]
[]
[]
[]
[]
[]
[]
[]
[]
[]
[]
[]
[]
[]
[]
[]
[]
[]
[]
[]
[]
[]
[]
[]
[]
[]
[]
[]
[]
[]
[]
[]
[]
[]
[]
[]
[]
[]
[]
[]
[]
[]
[]
[]
[]
[]
[]
[]
[]
[]
[]
[]
[]
[]
[]
[]
[]
[]
[]
[]
[]
[]
[]
[]
[]
[]
[]
[]
[]
[]
[]
[]
[]
[]
[]
[]
[]
[]
[]
[]
[]
[]
[]
[]
[]
[]
[]
[]
[]
[]
[]
[]
[]
[]
[]
[]
[]
[]
[]
[]
[]
[]
[]
[]
[]
[]
[]
[]
[]
[]
[]
[]
[]
[]
[]
[]
[]
[]
[]
[]
[]
[]
[]
[]
[]
[]
[]
[]
[]
[]
[]
[]
[]
[]
[]
[]
[]
[]
[]
[]
[]
[]
[]
[]
[]
[]
[]
[]
[]
[]
[]
[]
[]
[]
[]
[]
[]
[]
[]
[]
[]
[]
[]
[]
[]
[]
[]
[]
[]
[]
[]
[]
[]
[]
[]
[]
[]
[]
[]
[]
[]
[]
[]
[]
[]
[]
[]
[]
[]
[]
[]
[]
[]
[]
[]
[]
[]
[]
[]
[]
[]
[]
[]
[]
[]
[]
[]
[]
[]
[]
[]
[]
[]
[]
[]
[]
[]
[]
[]
[]
[]
[]
[]
[]
[]
[]
[]
[]
[]
[]
[]
[]
[]
[]
[]
[]
[]
[]
[]
[]
[]
[]
[]
[]
[]
[]
[]
[]
[]
[]
[]
[]
[]
[]
[]
[]
[]
[]
[]
[]
[]
[]
[]
[]
[]
[]
[]
[]
[]
[]
[]
[]
[]
[]
[]
[]
[]
[]
[]
[]
[]
[]
[]
[]
[]
[]
[]
[]
[]
[]
[]
[]
[]
[]
[]
[]
[]
[]
[]
[]
[]
[]
[]
[]
[]
[]
[]
[]
[]
[]
[]
[]
[]
[]
[]
[]
[]
[]
[]
[]
[]
[]
[]
[]
[]
[]
[]
[]
[]
[]
[]
[]
[]
[]
[]
[]
[]
[]
[]
[]
[]
[]
[]
[]
[]
[]
[]
[]
[]
[]
[]
[]
[]
[]
[]
[]
[]
[]
[]
[]
[]
[]
[]
[]
[]
[]
[]
[]
[]
[]
[]
[]
[]
[]
[]
[]
[]
[]
[]
[]
[]
[]
[]
[]
[]
[]
[]
[]
[]
[]
[]
[]
[]
[null,null,null,null,null,null,null,"unichar(8346)"]

{"sheet":"Lists","index":3,"n_rows":200,"n_cols":21,"rows_kept":200,"cut":false,"hidden":true,"merged":[]}
[null,null,null,"Device Type",null,"Device Check","VCC Filter","Relevant Devices",null,"Packages",null,"Magnet Movement",null,"Magnet Shape",null,"Magnet Orientation",null,"Magnet Material","Br (G)",null,"units"]
[null,null,null,"Omnipolar switch",null,{"$f":"IF(DesignTool!$B$40=parametric_table!D2,parametric_table!A2,\"0\")","v":"0"},{"$f":"_xlfn.IFNA(IF(VLOOKUP(F2,ParametricTableRange,MATCH(\"Operating Region Used\",parametric_table!$A$1:$AV$1,0),FALSE)>0,F2,\"0\"),\"0\")","v":"0"},{"$f":"IF(ROWS(H$2:H2)>COUNTIF(G$2:G200,\"<>0\"),\"\",IF(ISERROR(INDEX(G$2:G200,SMALL(IF(G$2:G200<>\"0\",ROW(G$2:G200)-ROW(G$2)+1),ROWS(H$2:H2)))),\"\",IF(INDEX(G$2:G200,SMALL(IF(G$2:G200<>\"0\",ROW(G$2:G200)-ROW(G$2)+1),ROWS(H$2:H2)))=0,\"\",INDEX(G$2:G200,SMALL(IF(G$2:G200<>\"0\",ROW(G$2:G200)-ROW(G$2)+1),ROWS(H$2:H2))))))","v":"TMAG5124A"},null,null,null,"Head-On",null,"Block",null,"North Facing DUT",null,"SmCo18(1:5)",8750,null,"mm"]
[null,null,null,"Unipolar switch",null,{"$f":"IF(DesignTool!$B$40=parametric_table!D3,parametric_table!A3,\"0\")","v":"0"},{"$f":"_xlfn.IFNA(IF(VLOOKUP(F3,ParametricTableRange,MATCH(\"Operating Region Used\",parametric_table!$A$1:$AV$1,0),FALSE)>0,F3,\"0\"),\"0\")","v":"0"},{"$f":"IF(ROWS(H$2:H3)>COUNTIF(G$2:G201,\"<>0\"),\"\",IF(ISERROR(INDEX(G$2:G201,SMALL(IF(G$2:G201<>\"0\",ROW(G$2:G201)-ROW(G$2)+1),ROWS(H$2:H3)))),\"\",IF(INDEX(G$2:G201,SMALL(IF(G$2:G201<>\"0\",ROW(G$2:G201)-ROW(G$2)+1),ROWS(H$2:H3)))=0,\"\",INDEX(G$2:G201,SMALL(IF(G$2:G201<>\"0\",ROW(G$2:G201)-ROW(G$2)+1),ROWS(H$2:H3))))))","v":"TMAG5124B"},null,null,null,"Hinge",null,"Cylinder",null,"South Facing DUT",null,"SmCo20(1:5)",9200,null,"in."]
[null,null,null,"Latch",null,{"$f":"IF(DesignTool!$B$40=parametric_table!D4,parametric_table!A4,\"0\")","v":"0"},{"$f":"_xlfn.IFNA(IF(VLOOKUP(F4,ParametricTableRange,MATCH(\"Operating Region Used\",parametric_table!$A$1:$AV$1,0),FALSE)>0,F4,\"0\"),\"0\")","v":"0"},{"$f":"IF(ROWS(H$2:H4)>COUNTIF(G$2:G202,\"<>0\"),\"\",IF(ISERROR(INDEX(G$2:G202,SMALL(IF(G$2:G202<>\"0\",ROW(G$2:G202)-ROW(G$2)+1),ROWS(H$2:H4)))),\"\",IF(INDEX(G$2:G202,SMALL(IF(G$2:G202<>\"0\",ROW(G$2:G202)-ROW(G$2)+1),ROWS(H$2:H4)))=0,\"\",INDEX(G$2:G202,SMALL(IF(G$2:G202<>\"0\",ROW(G$2:G202)-ROW(G$2)+1),ROWS(H$2:H4))))))","v":"TMAG5124C"},null,null,null,"Slide-By",null,"Sphere",null,"NS Facing DUT",null,"SmCo22(1:5)",9400]
[null,null,null,"Ratiometric PWM output",null,{"$f":"IF(DesignTool!$B$40=parametric_table!D5,parametric_table!A5,\"0\")","v":"0"},{"$f":"_xlfn.IFNA(IF(VLOOKUP(F5,ParametricTableRange,MATCH(\"Operating Region Used\",parametric_table!$A$1:$AV$1,0),FALSE)>0,F5,\"0\"),\"0\")","v":"0"},{"$f":"IF(ROWS(H$2:H5)>COUNTIF(G$2:G203,\"<>0\"),\"\",IF(ISERROR(INDEX(G$2:G203,SMALL(IF(G$2:G203<>\"0\",ROW(G$2:G203)-ROW(G$2)+1),ROWS(H$2:H5)))),\"\",IF(INDEX(G$2:G203,SMALL(IF(G$2:G203<>\"0\",ROW(G$2:G203)-ROW(G$2)+1),ROWS(H$2:H5)))=0,\"\",INDEX(G$2:G203,SMALL(IF(G$2:G203<>\"0\",ROW(G$2:G203)-ROW(G$2)+1),ROWS(H$2:H5))))))","v":"TMAG5124D"},null,null,null,null,null,null,null,"SN Facing DUT",null,"SmCo24(1:5)",9800]
[null,null,null,"Ratiometric unipolar",null,{"$f":"IF(DesignTool!$B$40=parametric_table!D6,parametric_table!A6,\"0\")","v":"0"},{"$f":"_xlfn.IFNA(IF(VLOOKUP(F6,ParametricTableRange,MATCH(\"Operating Region Used\",parametric_table!$A$1:$AV$1,0),FALSE)>0,F6,\"0\"),\"0\")","v":"0"},{"$f":"IF(ROWS(H$2:H6)>COUNTIF(G$2:G204,\"<>0\"),\"\",IF(ISERROR(INDEX(G$2:G204,SMALL(IF(G$2:G204<>\"0\",ROW(G$2:G204)-ROW(G$2)+1),ROWS(H$2:H6)))),\"\",IF(INDEX(G$2:G204,SMALL(IF(G$2:G204<>\"0\",ROW(G$2:G204)-ROW(G$2)+1),ROWS(H$2:H6)))=0,\"\",INDEX(G$2:G204,SMALL(IF(G$2:G204<>\"0\",ROW(G$2:G204)-ROW(G$2)+1),ROWS(H$2:H6))))))","v":"TMAG5124E"},null,null,null,null,null,null,null,{"$f":"IF(OR(Magnet_Shape=\"Cylinder\",Magnet_Shape=\"Sphere\"),\"\",\"NS 2 Facing DUT\")","v":""},null,"SmCo24",9850]
[null,null,null,"Ratiometric bipolar",null,{"$f":"IF(DesignTool!$B$40=parametric_table!D7,parametric_table!A7,\"0\")","v":"0"},{"$f":"_xlfn.IFNA(IF(VLOOKUP(F7,ParametricTableRange,MATCH(\"Operating Region Used\",parametric_table!$A$1:$AV$1,0),FALSE)>0,F7,\"0\"),\"0\")","v":"0"},{"$f":"IF(ROWS(H$2:H7)>COUNTIF(G$2:G205,\"<>0\"),\"\",IF(ISERROR(INDEX(G$2:G205,SMALL(IF(G$2:G205<>\"0\",ROW(G$2:G205)-ROW(G$2)+1),ROWS(H$2:H7)))),\"\",IF(INDEX(G$2:G205,SMALL(IF(G$2:G205<>\"0\",ROW(G$2:G205)-ROW(G$2)+1),ROWS(H$2:H7)))=0,\"\",INDEX(G$2:G205,SMALL(IF(G$2:G205<>\"0\",ROW(G$2:G205)-ROW(G$2)+1),ROWS(H$2:H7))))))","v":"TMAG5124F"},null,null,null,null,null,null,null,{"$f":"IF(OR(Magnet_Shape=\"Cylinder\",Magnet_Shape=\"Sphere\"),\"\",\"SN 2 Facing DUT\")","v":""},null,"SmCo26",10350]
[null,null,null,"Bipolar",null,{"$f":"IF(DesignTool!$B$40=parametric_table!D8,parametric_table!A8,\"0\")","v":"0"},{"$f":"_xlfn.IFNA(IF(VLOOKUP(F8,ParametricTableRange,MATCH(\"Operating Region Used\",parametric_table!$A$1:$AV$1,0),FALSE)>0,F8,\"0\"),\"0\")","v":"0"},{"$f":"IF(ROWS(H$2:H8)>COUNTIF(G$2:G206,\"<>0\"),\"\",IF(ISERROR(INDEX(G$2:G206,SMALL(IF(G$2:G206<>\"0\",ROW(G$2:G206)-ROW(G$2)+1),ROWS(H$2:H8)))),\"\",IF(INDEX(G$2:G206,SMALL(IF(G$2:G206<>\"0\",ROW(G$2:G206)-ROW(G$2)+1),ROWS(H$2:H8)))=0,\"\",INDEX(G$2:G206,SMALL(IF(G$2:G206<>\"0\",ROW(G$2:G206)-ROW(G$2)+1),ROWS(H$2:H8))))))","v":"TMAG5124G"},null,null,null,null,null,null,null,null,null,"SmCo28",10550]
[null,null,null,"3-Axis linear",null,{"$f":"IF(DesignTool!$B$40=parametric_table!D9,parametric_table!A9,\"0\")","v":"0"},{"$f":"_xlfn.IFNA(IF(VLOOKUP(F9,ParametricTableRange,MATCH(\"Operating Region Used\",parametric_table!$A$1:$AV$1,0),FALSE)>0,F9,\"0\"),\"0\")","v":"0"},{"$f":"IF(ROWS(H$2:H9)>COUNTIF(G$2:G207,\"<>0\"),\"\",IF(ISERROR(INDEX(G$2:G207,SMALL(IF(G$2:G207<>\"0\",ROW(G$2:G207)-ROW(G$2)+1),ROWS(H$2:H9)))),\"\",IF(INDEX(G$2:G207,SMALL(IF(G$2:G207<>\"0\",ROW(G$2:G207)-ROW(G$2)+1),ROWS(H$2:H9)))=0,\"\",INDEX(G$2:G207,SMALL(IF(G$2:G207<>\"0\",ROW(G$2:G207)-ROW(G$2)+1),ROWS(H$2:H9))))))","v":"TMAG5124H"},null,null,null,null,null,null,null,null,null,"SmCo30",10900]
[null,null,null,null,null,{"$f":"IF(DesignTool!$B$40=parametric_table!D10,parametric_table!A10,\"0\")","v":"0"},{"$f":"_xlfn.IFNA(IF(VLOOKUP(F10,ParametricTableRange,MATCH(\"Operating Region Used\",parametric_table!$A$1:$AV$1,0),FALSE)>0,F10,\"0\"),\"0\")","v":"0"},{"$f":"IF(ROWS(H$2:H10)>COUNTIF(G$2:G208,\"<>0\"),\"\",IF(ISERROR(INDEX(G$2:G208,SMALL(IF(G$2:G208<>\"0\",ROW(G$2:G208)-ROW(G$2)+1),ROWS(H$2:H10)))),\"\",IF(INDEX(G$2:G208,SMALL(IF(G$2:G208<>\"0\",ROW(G$2:G208)-ROW(G$2)+1),ROWS(H$2:H10)))=0,\"\",INDEX(G$2:G208,SMALL(IF(G$2:G208<>\"0\",ROW(G$2:G208)-ROW(G$2)+1),ROWS(H$2:H10))))))","v":"DRV5021A1"},null,null,null,null,null,null,null,null,null,"SmCo32",11150]
[null,null,null,null,null,{"$f":"IF(DesignTool!$B$40=parametric_table!D11,parametric_table!A11,\"0\")","v":"0"},{"$f":"_xlfn.IFNA(IF(VLOOKUP(F11,ParametricTableRange,MATCH(\"Operating Region Used\",parametric_table!$A$1:$AV$1,0),FALSE)>0,F11,\"0\"),\"0\")","v":"0"},{"$f":"IF(ROWS(H$2:H11)>COUNTIF(G$2:G209,\"<>0\"),\"\",IF(ISERROR(INDEX(G$2:G209,SMALL(IF(G$2:G209<>\"0\",ROW(G$2:G209)-ROW(G$2)+1),ROWS(H$2:H11)))),\"\",IF(INDEX(G$2:G209,SMALL(IF(G$2:G209<>\"0\",ROW(G$2:G209)-ROW(G$2)+1),ROWS(H$2:H11)))=0,\"\",INDEX(G$2:G209,SMALL(IF(G$2:G209<>\"0\",ROW(G$2:G209)-ROW(G$2)+1),ROWS(H$2:H11))))))","v":"DRV5021A2"},null,null,null,null,null,null,null,null,null,"N35",12000]
[null,null,null,"2D Latch",null,{"$f":"IF(DesignTool!$B$40=parametric_table!D12,parametric_table!A12,\"0\")","v":"0"},{"$f":"_xlfn.IFNA(IF(VLOOKUP(F12,ParametricTableRange,MATCH(\"Operating Region Used\",parametric_table!$A$1:$AV$1,0),FALSE)>0,F12,\"0\"),\"0\")","v":"0"},{"$f":"IF(ROWS(H$2:H12)>COUNTIF(G$2:G210,\"<>0\"),\"\",IF(ISERROR(INDEX(G$2:G210,SMALL(IF(G$2:G210<>\"0\",ROW(G$2:G210)-ROW(G$2)+1),ROWS(H$2:H12)))),\"\",IF(INDEX(G$2:G210,SMALL(IF(G$2:G210<>\"0\",ROW(G$2:G210)-ROW(G$2)+1),ROWS(H$2:H12)))=0,\"\",INDEX(G$2:G210,SMALL(IF(G$2:G210<>\"0\",ROW(G$2:G210)-ROW(G$2)+1),ROWS(H$2:H12))))))","v":"DRV5021A3"},null,null,null,null,null,null,null,null,null,"N38",12400]
[null,null,null,"3-Axis linear",null,{"$f":"IF(DesignTool!$B$40=parametric_table!D13,parametric_table!A13,\"0\")","v":"0"},{"$f":"_xlfn.IFNA(IF(VLOOKUP(F13,ParametricTableRange,MATCH(\"Operating Region Used\",parametric_table!$A$1:$AV$1,0),FALSE)>0,F13,\"0\"),\"0\")","v":"0"},{"$f":"IF(ROWS(H$2:H13)>COUNTIF(G$2:G211,\"<>0\"),\"\",IF(ISERROR(INDEX(G$2:G211,SMALL(IF(G$2:G211<>\"0\",ROW(G$2:G211)-ROW(G$2)+1),ROWS(H$2:H13)))),\"\",IF(INDEX(G$2:G211,SMALL(IF(G$2:G211<>\"0\",ROW(G$2:G211)-ROW(G$2)+1),ROWS(H$2:H13)))=0,\"\",INDEX(G$2:G211,SMALL(IF(G$2:G211<>\"0\",ROW(G$2:G211)-ROW(G$2)+1),ROWS(H$2:H13))))))","v":"DRV5032DUDBZ"},null,null,null,null,null,null,null,null,null,"N42",13000]
[null,null,null,null,null,{"$f":"IF(DesignTool!$B$40=parametric_table!D14,parametric_table!A14,\"0\")","v":"0"},{"$f":"_xlfn.IFNA(IF(VLOOKUP(F14,ParametricTableRange,MATCH(\"Operating Region Used\",parametric_table!$A$1:$AV$1,0),FALSE)>0,F14,\"0\"),\"0\")","v":"0"},{"$f":"IF(ROWS(H$2:H14)>COUNTIF(G$2:G212,\"<>0\"),\"\",IF(ISERROR(INDEX(G$2:G212,SMALL(IF(G$2:G212<>\"0\",ROW(G$2:G212)-ROW(G$2)+1),ROWS(H$2:H14)))),\"\",IF(INDEX(G$2:G212,SMALL(IF(G$2:G212<>\"0\",ROW(G$2:G212)-ROW(G$2)+1),ROWS(H$2:H14)))=0,\"\",INDEX(G$2:G212,SMALL(IF(G$2:G212<>\"0\",ROW(G$2:G212)-ROW(G$2)+1),ROWS(H$2:H14))))))","v":"DRV5032DUDMR"},null,null,null,null,null,null,null,null,null,"N45",13500]
[null,null,null,null,null,{"$f":"IF(DesignTool!$B$40=parametric_table!D15,parametric_table!A15,\"0\")","v":"0"},{"$f":"_xlfn.IFNA(IF(VLOOKUP(F15,ParametricTableRange,MATCH(\"Operating Region Used\",parametric_table!$A$1:$AV$1,0),FALSE)>0,F15,\"0\"),\"0\")","v":"0"},{"$f":"IF(ROWS(H$2:H15)>COUNTIF(G$2:G213,\"<>0\"),\"\",IF(ISERROR(INDEX(G$2:G213,SMALL(IF(G$2:G213<>\"0\",ROW(G$2:G213)-ROW(G$2)+1),ROWS(H$2:H15)))),\"\",IF(INDEX(G$2:G213,SMALL(IF(G$2:G213<>\"0\",ROW(G$2:G213)-ROW(G$2)+1),ROWS(H$2:H15)))=0,\"\",INDEX(G$2:G213,SMALL(IF(G$2:G213<>\"0\",ROW(G$2:G213)-ROW(G$2)+1),ROWS(H$2:H15))))))","v":"DRV5032DULPG"},null,null,null,null,null,null,null,null,null,"N48",14000]
[null,null,null,null,null,{"$f":"IF(DesignTool!$B$40=parametric_table!D16,parametric_table!A16,\"0\")","v":"0"},{"$f":"_xlfn.IFNA(IF(VLOOKUP(F16,ParametricTableRange,MATCH(\"Operating Region Used\",parametric_table!$A$1:$AV$1,0),FALSE)>0,F16,\"0\"),\"0\")","v":"0"},{"$f":"IF(ROWS(H$2:H16)>COUNTIF(G$2:G214,\"<>0\"),\"\",IF(ISERROR(INDEX(G$2:G214,SMALL(IF(G$2:G214<>\"0\",ROW(G$2:G214)-ROW(G$2)+1),ROWS(H$2:H16)))),\"\",IF(INDEX(G$2:G214,SMALL(IF(G$2:G214<>\"0\",ROW(G$2:G214)-ROW(G$2)+1),ROWS(H$2:H16)))=0,\"\",INDEX(G$2:G214,SMALL(IF(G$2:G214<>\"0\",ROW(G$2:G214)-ROW(G$2)+1),ROWS(H$2:H16))))))","v":"DRV5032FDDMR"},null,null,null,null,null,null,null,null,null,"N50",14300]
[null,null,null,null,null,{"$f":"IF(DesignTool!$B$40=parametric_table!D17,parametric_table!A17,\"0\")","v":"0"},{"$f":"_xlfn.IFNA(IF(VLOOKUP(F17,ParametricTableRange,MATCH(\"Operating Region Used\",parametric_table!$A$1:$AV$1,0),FALSE)>0,F17,\"0\"),\"0\")","v":"0"},{"$f":"IF(ROWS(H$2:H17)>COUNTIF(G$2:G215,\"<>0\"),\"\",IF(ISERROR(INDEX(G$2:G215,SMALL(IF(G$2:G215<>\"0\",ROW(G$2:G215)-ROW(G$2)+1),ROWS(H$2:H17)))),\"\",IF(INDEX(G$2:G215,SMALL(IF(G$2:G215<>\"0\",ROW(G$2:G215)-ROW(G$2)+1),ROWS(H$2:H17)))=0,\"\",INDEX(G$2:G215,SMALL(IF(G$2:G215<>\"0\",ROW(G$2:G215)-ROW(G$2)+1),ROWS(H$2:H17))))))","v":"DRV5032FDLPG"},null,null,null,null,null,null,null,null,null,"N52",14600]
[null,null,null,null,null,{"$f":"IF(DesignTool!$B$40=parametric_table!D18,parametric_table!A18,\"0\")","v":"0"},{"$f":"_xlfn.IFNA(IF(VLOOKUP(F18,ParametricTableRange,MATCH(\"Operating Region Used\",parametric_table!$A$1:$AV$1,0),FALSE)>0,F18,\"0\"),\"0\")","v":"0"},{"$f":"IF(ROWS(H$2:H18)>COUNTIF(G$2:G216,\"<>0\"),\"\",IF(ISERROR(INDEX(G$2:G216,SMALL(IF(G$2:G216<>\"0\",ROW(G$2:G216)-ROW(G$2)+1),ROWS(H$2:H18)))),\"\",IF(INDEX(G$2:G216,SMALL(IF(G$2:G216<>\"0\",ROW(G$2:G216)-ROW(G$2)+1),ROWS(H$2:H18)))=0,\"\",INDEX(G$2:G216,SMALL(IF(G$2:G216<>\"0\",ROW(G$2:G216)-ROW(G$2)+1),ROWS(H$2:H18))))))","v":"DRV5023FAQDBZ"},null,null,null,null,null,null,null,null,null,"Custom"]
[null,null,null,null,null,{"$f":"IF(DesignTool!$B$40=parametric_table!D19,parametric_table!A19,\"0\")","v":"0"},{"$f":"_xlfn.IFNA(IF(VLOOKUP(F19,ParametricTableRange,MATCH(\"Operating Region Used\",parametric_table!$A$1:$AV$1,0),FALSE)>0,F19,\"0\"),\"0\")","v":"0"},{"$f":"IF(ROWS(H$2:H19)>COUNTIF(G$2:G217,\"<>0\"),\"\",IF(ISERROR(INDEX(G$2:G217,SMALL(IF(G$2:G217<>\"0\",ROW(G$2:G217)-ROW(G$2)+1),ROWS(H$2:H19)))),\"\",IF(INDEX(G$2:G217,SMALL(IF(G$2:G217<>\"0\",ROW(G$2:G217)-ROW(G$2)+1),ROWS(H$2:H19)))=0,\"\",INDEX(G$2:G217,SMALL(IF(G$2:G217<>\"0\",ROW(G$2:G217)-ROW(G$2)+1),ROWS(H$2:H19))))))","v":"DRV5023AJQDBZ"}]
[null,null,null,null,null,{"$f":"IF(DesignTool!$B$40=parametric_table!D20,parametric_table!A20,\"0\")","v":"0"},{"$f":"_xlfn.IFNA(IF(VLOOKUP(F20,ParametricTableRange,MATCH(\"Operating Region Used\",parametric_table!$A$1:$AV$1,0),FALSE)>0,F20,\"0\"),\"0\")","v":"0"},{"$f":"IF(ROWS(H$2:H20)>COUNTIF(G$2:G218,\"<>0\"),\"\",IF(ISERROR(INDEX(G$2:G218,SMALL(IF(G$2:G218<>\"0\",ROW(G$2:G218)-ROW(G$2)+1),ROWS(H$2:H20)))),\"\",IF(INDEX(G$2:G218,SMALL(IF(G$2:G218<>\"0\",ROW(G$2:G218)-ROW(G$2)+1),ROWS(H$2:H20)))=0,\"\",INDEX(G$2:G218,SMALL(IF(G$2:G218<>\"0\",ROW(G$2:G218)-ROW(G$2)+1),ROWS(H$2:H20))))))","v":"DRV5023AJQLPG"}]
[null,null,null,null,null,{"$f":"IF(DesignTool!$B$40=parametric_table!D21,parametric_table!A21,\"0\")","v":"TMAG5124A"},{"$f":"_xlfn.IFNA(IF(VLOOKUP(F21,ParametricTableRange,MATCH(\"Operating Region Used\",parametric_table!$A$1:$AV$1,0),FALSE)>0,F21,\"0\"),\"0\")","v":"TMAG5124A"},{"$f":"IF(ROWS(H$2:H21)>COUNTIF(G$2:G219,\"<>0\"),\"\",IF(ISERROR(INDEX(G$2:G219,SMALL(IF(G$2:G219<>\"0\",ROW(G$2:G219)-ROW(G$2)+1),ROWS(H$2:H21)))),\"\",IF(INDEX(G$2:G219,SMALL(IF(G$2:G219<>\"0\",ROW(G$2:G219)-ROW(G$2)+1),ROWS(H$2:H21)))=0,\"\",INDEX(G$2:G219,SMALL(IF(G$2:G219<>\"0\",ROW(G$2:G219)-ROW(G$2)+1),ROWS(H$2:H21))))))","v":"DRV5023BIQDBZ"}]
[null,null,null,null,null,{"$f":"IF(DesignTool!$B$40=parametric_table!D22,parametric_table!A22,\"0\")","v":"TMAG5124B"},{"$f":"_xlfn.IFNA(IF(VLOOKUP(F22,ParametricTableRange,MATCH(\"Operating Region Used\",parametric_table!$A$1:$AV$1,0),FALSE)>0,F22,\"0\"),\"0\")","v":"TMAG5124B"},{"$f":"IF(ROWS(H$2:H22)>COUNTIF(G$2:G220,\"<>0\"),\"\",IF(ISERROR(INDEX(G$2:G220,SMALL(IF(G$2:G220<>\"0\",ROW(G$2:G220)-ROW(G$2)+1),ROWS(H$2:H22)))),\"\",IF(INDEX(G$2:G220,SMALL(IF(G$2:G220<>\"0\",ROW(G$2:G220)-ROW(G$2)+1),ROWS(H$2:H22)))=0,\"\",INDEX(G$2:G220,SMALL(IF(G$2:G220<>\"0\",ROW(G$2:G220)-ROW(G$2)+1),ROWS(H$2:H22))))))","v":"DRV5023BIQLPG"}]
[null,null,null,null,null,{"$f":"IF(DesignTool!$B$40=parametric_table!D23,parametric_table!A23,\"0\")","v":"TMAG5124C"},{"$f":"_xlfn.IFNA(IF(VLOOKUP(F23,ParametricTableRange,MATCH(\"Operating Region Used\",parametric_table!$A$1:$AV$1,0),FALSE)>0,F23,\"0\"),\"0\")","v":"TMAG5124C"},{"$f":"IF(ROWS(H$2:H23)>COUNTIF(G$2:G221,\"<>0\"),\"\",IF(ISERROR(INDEX(G$2:G221,SMALL(IF(G$2:G221<>\"0\",ROW(G$2:G221)-ROW(G$2)+1),ROWS(H$2:H23)))),\"\",IF(INDEX(G$2:G221,SMALL(IF(G$2:G221<>\"0\",ROW(G$2:G221)-ROW(G$2)+1),ROWS(H$2:H23)))=0,\"\",INDEX(G$2:G221,SMALL(IF(G$2:G221<>\"0\",ROW(G$2:G221)-ROW(G$2)+1),ROWS(H$2:H23))))))","v":""}]
[null,null,null,null,null,{"$f":"IF(DesignTool!$B$40=parametric_table!D24,parametric_table!A24,\"0\")","v":"TMAG5124D"},{"$f":"_xlfn.IFNA(IF(VLOOKUP(F24,ParametricTableRange,MATCH(\"Operating Region Used\",parametric_table!$A$1:$AV$1,0),FALSE)>0,F24,\"0\"),\"0\")","v":"TMAG5124D"},{"$f":"IF(ROWS(H$2:H24)>COUNTIF(G$2:G222,\"<>0\"),\"\",IF(ISERROR(INDEX(G$2:G222,SMALL(IF(G$2:G222<>\"0\",ROW(G$2:G222)-ROW(G$2)+1),ROWS(H$2:H24)))),\"\",IF(INDEX(G$2:G222,SMALL(IF(G$2:G222<>\"0\",ROW(G$2:G222)-ROW(G$2)+1),ROWS(H$2:H24)))=0,\"\",INDEX(G$2:G222,SMALL(IF(G$2:G222<>\"0\",ROW(G$2:G222)-ROW(G$2)+1),ROWS(H$2:H24))))))","v":""}]
[null,null,null,null,null,{"$f":"IF(DesignTool!$B$40=parametric_table!D25,parametric_table!A25,\"0\")","v":"TMAG5124E"},{"$f":"_xlfn.IFNA(IF(VLOOKUP(F25,ParametricTableRange,MATCH(\"Operating Region Used\",parametric_table!$A$1:$AV$1,0),FALSE)>0,F25,\"0\"),\"0\")","v":"TMAG5124E"},{"$f":"IF(ROWS(H$2:H25)>COUNTIF(G$2:G223,\"<>0\"),\"\",IF(ISERROR(INDEX(G$2:G223,SMALL(IF(G$2:G223<>\"0\",ROW(G$2:G223)-ROW(G$2)+1),ROWS(H$2:H25)))),\"\",IF(INDEX(G$2:G223,SMALL(IF(G$2:G223<>\"0\",ROW(G$2:G223)-ROW(G$2)+1),ROWS(H$2:H25)))=0,\"\",INDEX(G$2:G223,SMALL(IF(G$2:G223<>\"0\",ROW(G$2:G223)-ROW(G$2)+1),ROWS(H$2:H25))))))","v":""}]
[null,null,null,null,null,{"$f":"IF(DesignTool!$B$40=parametric_table!D26,parametric_table!A26,\"0\")","v":"TMAG5124F"},{"$f":"_xlfn.IFNA(IF(VLOOKUP(F26,ParametricTableRange,MATCH(\"Operating Region Used\",parametric_table!$A$1:$AV$1,0),FALSE)>0,F26,\"0\"),\"0\")","v":"TMAG5124F"},{"$f":"IF(ROWS(H$2:H26)>COUNTIF(G$2:G224,\"<>0\"),\"\",IF(ISERROR(INDEX(G$2:G224,SMALL(IF(G$2:G224<>\"0\",ROW(G$2:G224)-ROW(G$2)+1),ROWS(H$2:H26)))),\"\",IF(INDEX(G$2:G224,SMALL(IF(G$2:G224<>\"0\",ROW(G$2:G224)-ROW(G$2)+1),ROWS(H$2:H26)))=0,\"\",INDEX(G$2:G224,SMALL(IF(G$2:G224<>\"0\",ROW(G$2:G224)-ROW(G$2)+1),ROWS(H$2:H26))))))","v":""}]
[null,null,null,null,null,{"$f":"IF(DesignTool!$B$40=parametric_table!D27,parametric_table!A27,\"0\")","v":"TMAG5124G"},{"$f":"_xlfn.IFNA(IF(VLOOKUP(F27,ParametricTableRange,MATCH(\"Operating Region Used\",parametric_table!$A$1:$AV$1,0),FALSE)>0,F27,\"0\"),\"0\")","v":"TMAG5124G"},{"$f":"IF(ROWS(H$2:H27)>COUNTIF(G$2:G225,\"<>0\"),\"\",IF(ISERROR(INDEX(G$2:G225,SMALL(IF(G$2:G225<>\"0\",ROW(G$2:G225)-ROW(G$2)+1),ROWS(H$2:H27)))),\"\",IF(INDEX(G$2:G225,SMALL(IF(G$2:G225<>\"0\",ROW(G$2:G225)-ROW(G$2)+1),ROWS(H$2:H27)))=0,\"\",INDEX(G$2:G225,SMALL(IF(G$2:G225<>\"0\",ROW(G$2:G225)-ROW(G$2)+1),ROWS(H$2:H27))))))","v":""}]
[null,null,null,null,null,{"$f":"IF(DesignTool!$B$40=parametric_table!D28,parametric_table!A28,\"0\")","v":"TMAG5124H"},{"$f":"_xlfn.IFNA(IF(VLOOKUP(F28,ParametricTableRange,MATCH(\"Operating Region Used\",parametric_table!$A$1:$AV$1,0),FALSE)>0,F28,\"0\"),\"0\")","v":"TMAG5124H"},{"$f":"IF(ROWS(H$2:H28)>COUNTIF(G$2:G226,\"<>0\"),\"\",IF(ISERROR(INDEX(G$2:G226,SMALL(IF(G$2:G226<>\"0\",ROW(G$2:G226)-ROW(G$2)+1),ROWS(H$2:H28)))),\"\",IF(INDEX(G$2:G226,SMALL(IF(G$2:G226<>\"0\",ROW(G$2:G226)-ROW(G$2)+1),ROWS(H$2:H28)))=0,\"\",INDEX(G$2:G226,SMALL(IF(G$2:G226<>\"0\",ROW(G$2:G226)-ROW(G$2)+1),ROWS(H$2:H28))))))","v":""}]
[null,null,null,null,null,{"$f":"IF(DesignTool!$B$40=parametric_table!D29,parametric_table!A29,\"0\")","v":"DRV5021A1"},{"$f":"_xlfn.IFNA(IF(VLOOKUP(F29,ParametricTableRange,MATCH(\"Operating Region Used\",parametric_table!$A$1:$AV$1,0),FALSE)>0,F29,\"0\"),\"0\")","v":"DRV5021A1"},{"$f":"IF(ROWS(H$2:H29)>COUNTIF(G$2:G227,\"<>0\"),\"\",IF(ISERROR(INDEX(G$2:G227,SMALL(IF(G$2:G227<>\"0\",ROW(G$2:G227)-ROW(G$2)+1),ROWS(H$2:H29)))),\"\",IF(INDEX(G$2:G227,SMALL(IF(G$2:G227<>\"0\",ROW(G$2:G227)-ROW(G$2)+1),ROWS(H$2:H29)))=0,\"\",INDEX(G$2:G227,SMALL(IF(G$2:G227<>\"0\",ROW(G$2:G227)-ROW(G$2)+1),ROWS(H$2:H29))))))","v":""}]
[null,null,null,null,null,{"$f":"IF(DesignTool!$B$40=parametric_table!D30,parametric_table!A30,\"0\")","v":"DRV5021A2"},{"$f":"_xlfn.IFNA(IF(VLOOKUP(F30,ParametricTableRange,MATCH(\"Operating Region Used\",parametric_table!$A$1:$AV$1,0),FALSE)>0,F30,\"0\"),\"0\")","v":"DRV5021A2"},{"$f":"IF(ROWS(H$2:H30)>COUNTIF(G$2:G228,\"<>0\"),\"\",IF(ISERROR(INDEX(G$2:G228,SMALL(IF(G$2:G228<>\"0\",ROW(G$2:G228)-ROW(G$2)+1),ROWS(H$2:H30)))),\"\",IF(INDEX(G$2:G228,SMALL(IF(G$2:G228<>\"0\",ROW(G$2:G228)-ROW(G$2)+1),ROWS(H$2:H30)))=0,\"\",INDEX(G$2:G228,SMALL(IF(G$2:G228<>\"0\",ROW(G$2:G228)-ROW(G$2)+1),ROWS(H$2:H30))))))","v":""}]
[null,null,null,null,null,{"$f":"IF(DesignTool!$B$40=parametric_table!D31,parametric_table!A31,\"0\")","v":"DRV5021A3"},{"$f":"_xlfn.IFNA(IF(VLOOKUP(F31,ParametricTableRange,MATCH(\"Operating Region Used\",parametric_table!$A$1:$AV$1,0),FALSE)>0,F31,\"0\"),\"0\")","v":"DRV5021A3"},{"$f":"IF(ROWS(H$2:H31)>COUNTIF(G$2:G229,\"<>0\"),\"\",IF(ISERROR(INDEX(G$2:G229,SMALL(IF(G$2:G229<>\"0\",ROW(G$2:G229)-ROW(G$2)+1),ROWS(H$2:H31)))),\"\",IF(INDEX(G$2:G229,SMALL(IF(G$2:G229<>\"0\",ROW(G$2:G229)-ROW(G$2)+1),ROWS(H$2:H31)))=0,\"\",INDEX(G$2:G229,SMALL(IF(G$2:G229<>\"0\",ROW(G$2:G229)-ROW(G$2)+1),ROWS(H$2:H31))))))","v":""}]
[null,null,null,null,null,{"$f":"IF(DesignTool!$B$40=parametric_table!D32,parametric_table!A32,\"0\")","v":"0"},{"$f":"_xlfn.IFNA(IF(VLOOKUP(F32,ParametricTableRange,MATCH(\"Operating Region Used\",parametric_table!$A$1:$AV$1,0),FALSE)>0,F32,\"0\"),\"0\")","v":"0"},{"$f":"IF(ROWS(H$2:H32)>COUNTIF(G$2:G230,\"<>0\"),\"\",IF(ISERROR(INDEX(G$2:G230,SMALL(IF(G$2:G230<>\"0\",ROW(G$2:G230)-ROW(G$2)+1),ROWS(H$2:H32)))),\"\",IF(INDEX(G$2:G230,SMALL(IF(G$2:G230<>\"0\",ROW(G$2:G230)-ROW(G$2)+1),ROWS(H$2:H32)))=0,\"\",INDEX(G$2:G230,SMALL(IF(G$2:G230<>\"0\",ROW(G$2:G230)-ROW(G$2)+1),ROWS(H$2:H32))))))","v":""}]
[null,null,null,null,null,{"$f":"IF(DesignTool!$B$40=parametric_table!D33,parametric_table!A33,\"0\")","v":"0"},{"$f":"_xlfn.IFNA(IF(VLOOKUP(F33,ParametricTableRange,MATCH(\"Operating Region Used\",parametric_table!$A$1:$AV$1,0),FALSE)>0,F33,\"0\"),\"0\")","v":"0"},{"$f":"IF(ROWS(H$2:H33)>COUNTIF(G$2:G231,\"<>0\"),\"\",IF(ISERROR(INDEX(G$2:G231,SMALL(IF(G$2:G231<>\"0\",ROW(G$2:G231)-ROW(G$2)+1),ROWS(H$2:H33)))),\"\",IF(INDEX(G$2:G231,SMALL(IF(G$2:G231<>\"0\",ROW(G$2:G231)-ROW(G$2)+1),ROWS(H$2:H33)))=0,\"\",INDEX(G$2:G231,SMALL(IF(G$2:G231<>\"0\",ROW(G$2:G231)-ROW(G$2)+1),ROWS(H$2:H33))))))","v":""}]
[null,null,null,null,null,{"$f":"IF(DesignTool!$B$40=parametric_table!D34,parametric_table!A34,\"0\")","v":"0"},{"$f":"_xlfn.IFNA(IF(VLOOKUP(F34,ParametricTableRange,MATCH(\"Operating Region Used\",parametric_table!$A$1:$AV$1,0),FALSE)>0,F34,\"0\"),\"0\")","v":"0"},{"$f":"IF(ROWS(H$2:H34)>COUNTIF(G$2:G232,\"<>0\"),\"\",IF(ISERROR(INDEX(G$2:G232,SMALL(IF(G$2:G232<>\"0\",ROW(G$2:G232)-ROW(G$2)+1),ROWS(H$2:H34)))),\"\",IF(INDEX(G$2:G232,SMALL(IF(G$2:G232<>\"0\",ROW(G$2:G232)-ROW(G$2)+1),ROWS(H$2:H34)))=0,\"\",INDEX(G$2:G232,SMALL(IF(G$2:G232<>\"0\",ROW(G$2:G232)-ROW(G$2)+1),ROWS(H$2:H34))))))","v":""}]
[null,null,null,null,null,{"$f":"IF(DesignTool!$B$40=parametric_table!D35,parametric_table!A35,\"0\")","v":"0"},{"$f":"_xlfn.IFNA(IF(VLOOKUP(F35,ParametricTableRange,MATCH(\"Operating Region Used\",parametric_table!$A$1:$AV$1,0),FALSE)>0,F35,\"0\"),\"0\")","v":"0"},{"$f":"IF(ROWS(H$2:H35)>COUNTIF(G$2:G233,\"<>0\"),\"\",IF(ISERROR(INDEX(G$2:G233,SMALL(IF(G$2:G233<>\"0\",ROW(G$2:G233)-ROW(G$2)+1),ROWS(H$2:H35)))),\"\",IF(INDEX(G$2:G233,SMALL(IF(G$2:G233<>\"0\",ROW(G$2:G233)-ROW(G$2)+1),ROWS(H$2:H35)))=0,\"\",INDEX(G$2:G233,SMALL(IF(G$2:G233<>\"0\",ROW(G$2:G233)-ROW(G$2)+1),ROWS(H$2:H35))))))","v":""}]
[null,null,null,null,null,{"$f":"IF(DesignTool!$B$40=parametric_table!D36,parametric_table!A36,\"0\")","v":"0"},{"$f":"_xlfn.IFNA(IF(VLOOKUP(F36,ParametricTableRange,MATCH(\"Operating Region Used\",parametric_table!$A$1:$AV$1,0),FALSE)>0,F36,\"0\"),\"0\")","v":"0"},{"$f":"IF(ROWS(H$2:H36)>COUNTIF(G$2:G234,\"<>0\"),\"\",IF(ISERROR(INDEX(G$2:G234,SMALL(IF(G$2:G234<>\"0\",ROW(G$2:G234)-ROW(G$2)+1),ROWS(H$2:H36)))),\"\",IF(INDEX(G$2:G234,SMALL(IF(G$2:G234<>\"0\",ROW(G$2:G234)-ROW(G$2)+1),ROWS(H$2:H36)))=0,\"\",INDEX(G$2:G234,SMALL(IF(G$2:G234<>\"0\",ROW(G$2:G234)-ROW(G$2)+1),ROWS(H$2:H36))))))","v":""}]
[null,null,null,null,null,{"$f":"IF(DesignTool!$B$40=parametric_table!D37,parametric_table!A37,\"0\")","v":"0"},{"$f":"_xlfn.IFNA(IF(VLOOKUP(F37,ParametricTableRange,MATCH(\"Operating Region Used\",parametric_table!$A$1:$AV$1,0),FALSE)>0,F37,\"0\"),\"0\")","v":"0"},{"$f":"IF(ROWS(H$2:H37)>COUNTIF(G$2:G235,\"<>0\"),\"\",IF(ISERROR(INDEX(G$2:G235,SMALL(IF(G$2:G235<>\"0\",ROW(G$2:G235)-ROW(G$2)+1),ROWS(H$2:H37)))),\"\",IF(INDEX(G$2:G235,SMALL(IF(G$2:G235<>\"0\",ROW(G$2:G235)-ROW(G$2)+1),ROWS(H$2:H37)))=0,\"\",INDEX(G$2:G235,SMALL(IF(G$2:G235<>\"0\",ROW(G$2:G235)-ROW(G$2)+1),ROWS(H$2:H37))))))","v":""}]
[null,null,null,null,null,{"$f":"IF(DesignTool!$B$40=parametric_table!D38,parametric_table!A38,\"0\")","v":"0"},{"$f":"_xlfn.IFNA(IF(VLOOKUP(F38,ParametricTableRange,MATCH(\"Operating Region Used\",parametric_table!$A$1:$AV$1,0),FALSE)>0,F38,\"0\"),\"0\")","v":"0"},{"$f":"IF(ROWS(H$2:H38)>COUNTIF(G$2:G236,\"<>0\"),\"\",IF(ISERROR(INDEX(G$2:G236,SMALL(IF(G$2:G236<>\"0\",ROW(G$2:G236)-ROW(G$2)+1),ROWS(H$2:H38)))),\"\",IF(INDEX(G$2:G236,SMALL(IF(G$2:G236<>\"0\",ROW(G$2:G236)-ROW(G$2)+1),ROWS(H$2:H38)))=0,\"\",INDEX(G$2:G236,SMALL(IF(G$2:G236<>\"0\",ROW(G$2:G236)-ROW(G$2)+1),ROWS(H$2:H38))))))","v":""}]
[null,null,null,null,null,{"$f":"IF(DesignTool!$B$40=parametric_table!D39,parametric_table!A39,\"0\")","v":"0"},{"$f":"_xlfn.IFNA(IF(VLOOKUP(F39,ParametricTableRange,MATCH(\"Operating Region Used\",parametric_table!$A$1:$AV$1,0),FALSE)>0,F39,\"0\"),\"0\")","v":"0"},{"$f":"IF(ROWS(H$2:H39)>COUNTIF(G$2:G237,\"<>0\"),\"\",IF(ISERROR(INDEX(G$2:G237,SMALL(IF(G$2:G237<>\"0\",ROW(G$2:G237)-ROW(G$2)+1),ROWS(H$2:H39)))),\"\",IF(INDEX(G$2:G237,SMALL(IF(G$2:G237<>\"0\",ROW(G$2:G237)-ROW(G$2)+1),ROWS(H$2:H39)))=0,\"\",INDEX(G$2:G237,SMALL(IF(G$2:G237<>\"0\",ROW(G$2:G237)-ROW(G$2)+1),ROWS(H$2:H39))))))","v":""}]
[null,null,null,null,null,{"$f":"IF(DesignTool!$B$40=parametric_table!D40,parametric_table!A40,\"0\")","v":"DRV5032DUDBZ"},{"$f":"_xlfn.IFNA(IF(VLOOKUP(F40,ParametricTableRange,MATCH(\"Operating Region Used\",parametric_table!$A$1:$AV$1,0),FALSE)>0,F40,\"0\"),\"0\")","v":"DRV5032DUDBZ"},{"$f":"IF(ROWS(H$2:H40)>COUNTIF(G$2:G238,\"<>0\"),\"\",IF(ISERROR(INDEX(G$2:G238,SMALL(IF(G$2:G238<>\"0\",ROW(G$2:G238)-ROW(G$2)+1),ROWS(H$2:H40)))),\"\",IF(INDEX(G$2:G238,SMALL(IF(G$2:G238<>\"0\",ROW(G$2:G238)-ROW(G$2)+1),ROWS(H$2:H40)))=0,\"\",INDEX(G$2:G238,SMALL(IF(G$2:G238<>\"0\",ROW(G$2:G238)-ROW(G$2)+1),ROWS(H$2:H40))))))","v":""}]
[null,null,null,null,null,{"$f":"IF(DesignTool!$B$40=parametric_table!D41,parametric_table!A41,\"0\")","v":"DRV5032DUDMR"},{"$f":"_xlfn.IFNA(IF(VLOOKUP(F41,ParametricTableRange,MATCH(\"Operating Region Used\",parametric_table!$A$1:$AV$1,0),FALSE)>0,F41,\"0\"),\"0\")","v":"DRV5032DUDMR"},{"$f":"IF(ROWS(H$2:H41)>COUNTIF(G$2:G239,\"<>0\"),\"\",IF(ISERROR(INDEX(G$2:G239,SMALL(IF(G$2:G239<>\"0\",ROW(G$2:G239)-ROW(G$2)+1),ROWS(H$2:H41)))),\"\",IF(INDEX(G$2:G239,SMALL(IF(G$2:G239<>\"0\",ROW(G$2:G239)-ROW(G$2)+1),ROWS(H$2:H41)))=0,\"\",INDEX(G$2:G239,SMALL(IF(G$2:G239<>\"0\",ROW(G$2:G239)-ROW(G$2)+1),ROWS(H$2:H41))))))","v":""}]
[null,null,null,null,null,{"$f":"IF(DesignTool!$B$40=parametric_table!D42,parametric_table!A42,\"0\")","v":"DRV5032DULPG"},{"$f":"_xlfn.IFNA(IF(VLOOKUP(F42,ParametricTableRange,MATCH(\"Operating Region Used\",parametric_table!$A$1:$AV$1,0),FALSE)>0,F42,\"0\"),\"0\")","v":"DRV5032DULPG"},{"$f":"IF(ROWS(H$2:H42)>COUNTIF(G$2:G240,\"<>0\"),\"\",IF(ISERROR(INDEX(G$2:G240,SMALL(IF(G$2:G240<>\"0\",ROW(G$2:G240)-ROW(G$2)+1),ROWS(H$2:H42)))),\"\",IF(INDEX(G$2:G240,SMALL(IF(G$2:G240<>\"0\",ROW(G$2:G240)-ROW(G$2)+1),ROWS(H$2:H42)))=0,\"\",INDEX(G$2:G240,SMALL(IF(G$2:G240<>\"0\",ROW(G$2:G240)-ROW(G$2)+1),ROWS(H$2:H42))))))","v":""}]
[null,null,null,null,null,{"$f":"IF(DesignTool!$B$40=parametric_table!D43,parametric_table!A43,\"0\")","v":"0"},{"$f":"_xlfn.IFNA(IF(VLOOKUP(F43,ParametricTableRange,MATCH(\"Operating Region Used\",parametric_table!$A$1:$AV$1,0),FALSE)>0,F43,\"0\"),\"0\")","v":"0"},{"$f":"IF(ROWS(H$2:H43)>COUNTIF(G$2:G241,\"<>0\"),\"\",IF(ISERROR(INDEX(G$2:G241,SMALL(IF(G$2:G241<>\"0\",ROW(G$2:G241)-ROW(G$2)+1),ROWS(H$2:H43)))),\"\",IF(INDEX(G$2:G241,SMALL(IF(G$2:G241<>\"0\",ROW(G$2:G241)-ROW(G$2)+1),ROWS(H$2:H43)))=0,\"\",INDEX(G$2:G241,SMALL(IF(G$2:G241<>\"0\",ROW(G$2:G241)-ROW(G$2)+1),ROWS(H$2:H43))))))","v":""}]
[null,null,null,null,null,{"$f":"IF(DesignTool!$B$40=parametric_table!D44,parametric_table!A44,\"0\")","v":"0"},{"$f":"_xlfn.IFNA(IF(VLOOKUP(F44,ParametricTableRange,MATCH(\"Operating Region Used\",parametric_table!$A$1:$AV$1,0),FALSE)>0,F44,\"0\"),\"0\")","v":"0"},{"$f":"IF(ROWS(H$2:H44)>COUNTIF(G$2:G242,\"<>0\"),\"\",IF(ISERROR(INDEX(G$2:G242,SMALL(IF(G$2:G242<>\"0\",ROW(G$2:G242)-ROW(G$2)+1),ROWS(H$2:H44)))),\"\",IF(INDEX(G$2:G242,SMALL(IF(G$2:G242<>\"0\",ROW(G$2:G242)-ROW(G$2)+1),ROWS(H$2:H44)))=0,\"\",INDEX(G$2:G242,SMALL(IF(G$2:G242<>\"0\",ROW(G$2:G242)-ROW(G$2)+1),ROWS(H$2:H44))))))","v":""}]
[null,null,null,null,null,{"$f":"IF(DesignTool!$B$40=parametric_table!D45,parametric_table!A45,\"0\")","v":"0"},{"$f":"_xlfn.IFNA(IF(VLOOKUP(F45,ParametricTableRange,MATCH(\"Operating Region Used\",parametric_table!$A$1:$AV$1,0),FALSE)>0,F45,\"0\"),\"0\")","v":"0"},{"$f":"IF(ROWS(H$2:H45)>COUNTIF(G$2:G243,\"<>0\"),\"\",IF(ISERROR(INDEX(G$2:G243,SMALL(IF(G$2:G243<>\"0\",ROW(G$2:G243)-ROW(G$2)+1),ROWS(H$2:H45)))),\"\",IF(INDEX(G$2:G243,SMALL(IF(G$2:G243<>\"0\",ROW(G$2:G243)-ROW(G$2)+1),ROWS(H$2:H45)))=0,\"\",INDEX(G$2:G243,SMALL(IF(G$2:G243<>\"0\",ROW(G$2:G243)-ROW(G$2)+1),ROWS(H$2:H45))))))","v":""}]
[null,null,null,null,null,{"$f":"IF(DesignTool!$B$40=parametric_table!D46,parametric_table!A46,\"0\")","v":"0"},{"$f":"_xlfn.IFNA(IF(VLOOKUP(F46,ParametricTableRange,MATCH(\"Operating Region Used\",parametric_table!$A$1:$AV$1,0),FALSE)>0,F46,\"0\"),\"0\")","v":"0"},{"$f":"IF(ROWS(H$2:H46)>COUNTIF(G$2:G244,\"<>0\"),\"\",IF(ISERROR(INDEX(G$2:G244,SMALL(IF(G$2:G244<>\"0\",ROW(G$2:G244)-ROW(G$2)+1),ROWS(H$2:H46)))),\"\",IF(INDEX(G$2:G244,SMALL(IF(G$2:G244<>\"0\",ROW(G$2:G244)-ROW(G$2)+1),ROWS(H$2:H46)))=0,\"\",INDEX(G$2:G244,SMALL(IF(G$2:G244<>\"0\",ROW(G$2:G244)-ROW(G$2)+1),ROWS(H$2:H46))))))","v":""}]
[null,null,null,null,null,{"$f":"IF(DesignTool!$B$40=parametric_table!D47,parametric_table!A47,\"0\")","v":"0"},{"$f":"_xlfn.IFNA(IF(VLOOKUP(F47,ParametricTableRange,MATCH(\"Operating Region Used\",parametric_table!$A$1:$AV$1,0),FALSE)>0,F47,\"0\"),\"0\")","v":"0"},{"$f":"IF(ROWS(H$2:H47)>COUNTIF(G$2:G245,\"<>0\"),\"\",IF(ISERROR(INDEX(G$2:G245,SMALL(IF(G$2:G245<>\"0\",ROW(G$2:G245)-ROW(G$2)+1),ROWS(H$2:H47)))),\"\",IF(INDEX(G$2:G245,SMALL(IF(G$2:G245<>\"0\",ROW(G$2:G245)-ROW(G$2)+1),ROWS(H$2:H47)))=0,\"\",INDEX(G$2:G245,SMALL(IF(G$2:G245<>\"0\",ROW(G$2:G245)-ROW(G$2)+1),ROWS(H$2:H47))))))","v":""}]
[null,null,null,null,null,{"$f":"IF(DesignTool!$B$40=parametric_table!D48,parametric_table!A48,\"0\")","v":"0"},{"$f":"_xlfn.IFNA(IF(VLOOKUP(F48,ParametricTableRange,MATCH(\"Operating Region Used\",parametric_table!$A$1:$AV$1,0),FALSE)>0,F48,\"0\"),\"0\")","v":"0"},{"$f":"IF(ROWS(H$2:H48)>COUNTIF(G$2:G246,\"<>0\"),\"\",IF(ISERROR(INDEX(G$2:G246,SMALL(IF(G$2:G246<>\"0\",ROW(G$2:G246)-ROW(G$2)+1),ROWS(H$2:H48)))),\"\",IF(INDEX(G$2:G246,SMALL(IF(G$2:G246<>\"0\",ROW(G$2:G246)-ROW(G$2)+1),ROWS(H$2:H48)))=0,\"\",INDEX(G$2:G246,SMALL(IF(G$2:G246<>\"0\",ROW(G$2:G246)-ROW(G$2)+1),ROWS(H$2:H48))))))","v":""}]
[null,null,null,null,null,{"$f":"IF(DesignTool!$B$40=parametric_table!D49,parametric_table!A49,\"0\")","v":"0"},{"$f":"_xlfn.IFNA(IF(VLOOKUP(F49,ParametricTableRange,MATCH(\"Operating Region Used\",parametric_table!$A$1:$AV$1,0),FALSE)>0,F49,\"0\"),\"0\")","v":"0"},{"$f":"IF(ROWS(H$2:H49)>COUNTIF(G$2:G247,\"<>0\"),\"\",IF(ISERROR(INDEX(G$2:G247,SMALL(IF(G$2:G247<>\"0\",ROW(G$2:G247)-ROW(G$2)+1),ROWS(H$2:H49)))),\"\",IF(INDEX(G$2:G247,SMALL(IF(G$2:G247<>\"0\",ROW(G$2:G247)-ROW(G$2)+1),ROWS(H$2:H49)))=0,\"\",INDEX(G$2:G247,SMALL(IF(G$2:G247<>\"0\",ROW(G$2:G247)-ROW(G$2)+1),ROWS(H$2:H49))))))","v":""}]
[null,null,null,null,null,{"$f":"IF(DesignTool!$B$40=parametric_table!D50,parametric_table!A50,\"0\")","v":"DRV5032FDDMR"},{"$f":"_xlfn.IFNA(IF(VLOOKUP(F50,ParametricTableRange,MATCH(\"Operating Region Used\",parametric_table!$A$1:$AV$1,0),FALSE)>0,F50,\"0\"),\"0\")","v":"DRV5032FDDMR"},{"$f":"IF(ROWS(H$2:H50)>COUNTIF(G$2:G248,\"<>0\"),\"\",IF(ISERROR(INDEX(G$2:G248,SMALL(IF(G$2:G248<>\"0\",ROW(G$2:G248)-ROW(G$2)+1),ROWS(H$2:H50)))),\"\",IF(INDEX(G$2:G248,SMALL(IF(G$2:G248<>\"0\",ROW(G$2:G248)-ROW(G$2)+1),ROWS(H$2:H50)))=0,\"\",INDEX(G$2:G248,SMALL(IF(G$2:G248<>\"0\",ROW(G$2:G248)-ROW(G$2)+1),ROWS(H$2:H50))))))","v":""}]
[null,null,null,null,null,{"$f":"IF(DesignTool!$B$40=parametric_table!D51,parametric_table!A51,\"0\")","v":"DRV5032FDLPG"},{"$f":"_xlfn.IFNA(IF(VLOOKUP(F51,ParametricTableRange,MATCH(\"Operating Region Used\",parametric_table!$A$1:$AV$1,0),FALSE)>0,F51,\"0\"),\"0\")","v":"DRV5032FDLPG"},{"$f":"IF(ROWS(H$2:H51)>COUNTIF(G$2:G249,\"<>0\"),\"\",IF(ISERROR(INDEX(G$2:G249,SMALL(IF(G$2:G249<>\"0\",ROW(G$2:G249)-ROW(G$2)+1),ROWS(H$2:H51)))),\"\",IF(INDEX(G$2:G249,SMALL(IF(G$2:G249<>\"0\",ROW(G$2:G249)-ROW(G$2)+1),ROWS(H$2:H51)))=0,\"\",INDEX(G$2:G249,SMALL(IF(G$2:G249<>\"0\",ROW(G$2:G249)-ROW(G$2)+1),ROWS(H$2:H51))))))","v":""}]
[null,null,null,null,null,{"$f":"IF(DesignTool!$B$40=parametric_table!D52,parametric_table!A52,\"0\")","v":"0"},{"$f":"_xlfn.IFNA(IF(VLOOKUP(F52,ParametricTableRange,MATCH(\"Operating Region Used\",parametric_table!$A$1:$AV$1,0),FALSE)>0,F52,\"0\"),\"0\")","v":"0"},{"$f":"IF(ROWS(H$2:H52)>COUNTIF(G$2:G250,\"<>0\"),\"\",IF(ISERROR(INDEX(G$2:G250,SMALL(IF(G$2:G250<>\"0\",ROW(G$2:G250)-ROW(G$2)+1),ROWS(H$2:H52)))),\"\",IF(INDEX(G$2:G250,SMALL(IF(G$2:G250<>\"0\",ROW(G$2:G250)-ROW(G$2)+1),ROWS(H$2:H52)))=0,\"\",INDEX(G$2:G250,SMALL(IF(G$2:G250<>\"0\",ROW(G$2:G250)-ROW(G$2)+1),ROWS(H$2:H52))))))","v":""}]
[null,null,null,null,null,{"$f":"IF(DesignTool!$B$40=parametric_table!D53,parametric_table!A53,\"0\")","v":"0"},{"$f":"_xlfn.IFNA(IF(VLOOKUP(F53,ParametricTableRange,MATCH(\"Operating Region Used\",parametric_table!$A$1:$AV$1,0),FALSE)>0,F53,\"0\"),\"0\")","v":"0"},{"$f":"IF(ROWS(H$2:H53)>COUNTIF(G$2:G251,\"<>0\"),\"\",IF(ISERROR(INDEX(G$2:G251,SMALL(IF(G$2:G251<>\"0\",ROW(G$2:G251)-ROW(G$2)+1),ROWS(H$2:H53)))),\"\",IF(INDEX(G$2:G251,SMALL(IF(G$2:G251<>\"0\",ROW(G$2:G251)-ROW(G$2)+1),ROWS(H$2:H53)))=0,\"\",INDEX(G$2:G251,SMALL(IF(G$2:G251<>\"0\",ROW(G$2:G251)-ROW(G$2)+1),ROWS(H$2:H53))))))","v":""}]
[null,null,null,null,null,{"$f":"IF(DesignTool!$B$40=parametric_table!D54,parametric_table!A54,\"0\")","v":"0"},{"$f":"_xlfn.IFNA(IF(VLOOKUP(F54,ParametricTableRange,MATCH(\"Operating Region Used\",parametric_table!$A$1:$AV$1,0),FALSE)>0,F54,\"0\"),\"0\")","v":"0"},{"$f":"IF(ROWS(H$2:H54)>COUNTIF(G$2:G252,\"<>0\"),\"\",IF(ISERROR(INDEX(G$2:G252,SMALL(IF(G$2:G252<>\"0\",ROW(G$2:G252)-ROW(G$2)+1),ROWS(H$2:H54)))),\"\",IF(INDEX(G$2:G252,SMALL(IF(G$2:G252<>\"0\",ROW(G$2:G252)-ROW(G$2)+1),ROWS(H$2:H54)))=0,\"\",INDEX(G$2:G252,SMALL(IF(G$2:G252<>\"0\",ROW(G$2:G252)-ROW(G$2)+1),ROWS(H$2:H54))))))","v":""}]
[null,null,null,null,null,{"$f":"IF(DesignTool!$B$40=parametric_table!D55,parametric_table!A55,\"0\")","v":"0"},{"$f":"_xlfn.IFNA(IF(VLOOKUP(F55,ParametricTableRange,MATCH(\"Operating Region Used\",parametric_table!$A$1:$AV$1,0),FALSE)>0,F55,\"0\"),\"0\")","v":"0"},{"$f":"IF(ROWS(H$2:H55)>COUNTIF(G$2:G253,\"<>0\"),\"\",IF(ISERROR(INDEX(G$2:G253,SMALL(IF(G$2:G253<>\"0\",ROW(G$2:G253)-ROW(G$2)+1),ROWS(H$2:H55)))),\"\",IF(INDEX(G$2:G253,SMALL(IF(G$2:G253<>\"0\",ROW(G$2:G253)-ROW(G$2)+1),ROWS(H$2:H55)))=0,\"\",INDEX(G$2:G253,SMALL(IF(G$2:G253<>\"0\",ROW(G$2:G253)-ROW(G$2)+1),ROWS(H$2:H55))))))","v":""}]
[null,null,null,null,null,{"$f":"IF(DesignTool!$B$40=parametric_table!D56,parametric_table!A56,\"0\")","v":"0"},{"$f":"_xlfn.IFNA(IF(VLOOKUP(F56,ParametricTableRange,MATCH(\"Operating Region Used\",parametric_table!$A$1:$AV$1,0),FALSE)>0,F56,\"0\"),\"0\")","v":"0"},{"$f":"IF(ROWS(H$2:H56)>COUNTIF(G$2:G254,\"<>0\"),\"\",IF(ISERROR(INDEX(G$2:G254,SMALL(IF(G$2:G254<>\"0\",ROW(G$2:G254)-ROW(G$2)+1),ROWS(H$2:H56)))),\"\",IF(INDEX(G$2:G254,SMALL(IF(G$2:G254<>\"0\",ROW(G$2:G254)-ROW(G$2)+1),ROWS(H$2:H56)))=0,\"\",INDEX(G$2:G254,SMALL(IF(G$2:G254<>\"0\",ROW(G$2:G254)-ROW(G$2)+1),ROWS(H$2:H56))))))","v":""}]
[null,null,null,null,null,{"$f":"IF(DesignTool!$B$40=parametric_table!D57,parametric_table!A57,\"0\")","v":"DRV5023FAQDBZ"},{"$f":"_xlfn.IFNA(IF(VLOOKUP(F57,ParametricTableRange,MATCH(\"Operating Region Used\",parametric_table!$A$1:$AV$1,0),FALSE)>0,F57,\"0\"),\"0\")","v":"DRV5023FAQDBZ"},{"$f":"IF(ROWS(H$2:H57)>COUNTIF(G$2:G255,\"<>0\"),\"\",IF(ISERROR(INDEX(G$2:G255,SMALL(IF(G$2:G255<>\"0\",ROW(G$2:G255)-ROW(G$2)+1),ROWS(H$2:H57)))),\"\",IF(INDEX(G$2:G255,SMALL(IF(G$2:G255<>\"0\",ROW(G$2:G255)-ROW(G$2)+1),ROWS(H$2:H57)))=0,\"\",INDEX(G$2:G255,SMALL(IF(G$2:G255<>\"0\",ROW(G$2:G255)-ROW(G$2)+1),ROWS(H$2:H57))))))","v":""}]
[null,null,null,null,null,{"$f":"IF(DesignTool!$B$40=parametric_table!D58,parametric_table!A58,\"0\")","v":"DRV5023AJQDBZ"},{"$f":"_xlfn.IFNA(IF(VLOOKUP(F58,ParametricTableRange,MATCH(\"Operating Region Used\",parametric_table!$A$1:$AV$1,0),FALSE)>0,F58,\"0\"),\"0\")","v":"DRV5023AJQDBZ"},{"$f":"IF(ROWS(H$2:H58)>COUNTIF(G$2:G256,\"<>0\"),\"\",IF(ISERROR(INDEX(G$2:G256,SMALL(IF(G$2:G256<>\"0\",ROW(G$2:G256)-ROW(G$2)+1),ROWS(H$2:H58)))),\"\",IF(INDEX(G$2:G256,SMALL(IF(G$2:G256<>\"0\",ROW(G$2:G256)-ROW(G$2)+1),ROWS(H$2:H58)))=0,\"\",INDEX(G$2:G256,SMALL(IF(G$2:G256<>\"0\",ROW(G$2:G256)-ROW(G$2)+1),ROWS(H$2:H58))))))","v":""}]
[null,null,null,null,null,{"$f":"IF(DesignTool!$B$40=parametric_table!D59,parametric_table!A59,\"0\")","v":"DRV5023AJQLPG"},{"$f":"_xlfn.IFNA(IF(VLOOKUP(F59,ParametricTableRange,MATCH(\"Operating Region Used\",parametric_table!$A$1:$AV$1,0),FALSE)>0,F59,\"0\"),\"0\")","v":"DRV5023AJQLPG"},{"$f":"IF(ROWS(H$2:H59)>COUNTIF(G$2:G257,\"<>0\"),\"\",IF(ISERROR(INDEX(G$2:G257,SMALL(IF(G$2:G257<>\"0\",ROW(G$2:G257)-ROW(G$2)+1),ROWS(H$2:H59)))),\"\",IF(INDEX(G$2:G257,SMALL(IF(G$2:G257<>\"0\",ROW(G$2:G257)-ROW(G$2)+1),ROWS(H$2:H59)))=0,\"\",INDEX(G$2:G257,SMALL(IF(G$2:G257<>\"0\",ROW(G$2:G257)-ROW(G$2)+1),ROWS(H$2:H59))))))","v":""}]
[null,null,null,null,null,{"$f":"IF(DesignTool!$B$40=parametric_table!D60,parametric_table!A60,\"0\")","v":"DRV5023BIQDBZ"},{"$f":"_xlfn.IFNA(IF(VLOOKUP(F60,ParametricTableRange,MATCH(\"Operating Region Used\",parametric_table!$A$1:$AV$1,0),FALSE)>0,F60,\"0\"),\"0\")","v":"DRV5023BIQDBZ"},{"$f":"IF(ROWS(H$2:H60)>COUNTIF(G$2:G258,\"<>0\"),\"\",IF(ISERROR(INDEX(G$2:G258,SMALL(IF(G$2:G258<>\"0\",ROW(G$2:G258)-ROW(G$2)+1),ROWS(H$2:H60)))),\"\",IF(INDEX(G$2:G258,SMALL(IF(G$2:G258<>\"0\",ROW(G$2:G258)-ROW(G$2)+1),ROWS(H$2:H60)))=0,\"\",INDEX(G$2:G258,SMALL(IF(G$2:G258<>\"0\",ROW(G$2:G258)-ROW(G$2)+1),ROWS(H$2:H60))))))","v":""}]
[null,null,null,null,null,{"$f":"IF(DesignTool!$B$40=parametric_table!D61,parametric_table!A61,\"0\")","v":"DRV5023BIQLPG"},{"$f":"_xlfn.IFNA(IF(VLOOKUP(F61,ParametricTableRange,MATCH(\"Operating Region Used\",parametric_table!$A$1:$AV$1,0),FALSE)>0,F61,\"0\"),\"0\")","v":"DRV5023BIQLPG"},{"$f":"IF(ROWS(H$2:H61)>COUNTIF(G$2:G259,\"<>0\"),\"\",IF(ISERROR(INDEX(G$2:G259,SMALL(IF(G$2:G259<>\"0\",ROW(G$2:G259)-ROW(G$2)+1),ROWS(H$2:H61)))),\"\",IF(INDEX(G$2:G259,SMALL(IF(G$2:G259<>\"0\",ROW(G$2:G259)-ROW(G$2)+1),ROWS(H$2:H61)))=0,\"\",INDEX(G$2:G259,SMALL(IF(G$2:G259<>\"0\",ROW(G$2:G259)-ROW(G$2)+1),ROWS(H$2:H61))))))","v":""}]
[null,null,null,null,null,{"$f":"IF(DesignTool!$B$40=parametric_table!D62,parametric_table!A62,\"0\")","v":"0"},{"$f":"_xlfn.IFNA(IF(VLOOKUP(F62,ParametricTableRange,MATCH(\"Operating Region Used\",parametric_table!$A$1:$AV$1,0),FALSE)>0,F62,\"0\"),\"0\")","v":"0"},{"$f":"IF(ROWS(H$2:H62)>COUNTIF(G$2:G260,\"<>0\"),\"\",IF(ISERROR(INDEX(G$2:G260,SMALL(IF(G$2:G260<>\"0\",ROW(G$2:G260)-ROW(G$2)+1),ROWS(H$2:H62)))),\"\",IF(INDEX(G$2:G260,SMALL(IF(G$2:G260<>\"0\",ROW(G$2:G260)-ROW(G$2)+1),ROWS(H$2:H62)))=0,\"\",INDEX(G$2:G260,SMALL(IF(G$2:G260<>\"0\",ROW(G$2:G260)-ROW(G$2)+1),ROWS(H$2:H62))))))","v":""}]
[null,null,null,null,null,{"$f":"IF(DesignTool!$B$40=parametric_table!D63,parametric_table!A63,\"0\")","v":"0"},{"$f":"_xlfn.IFNA(IF(VLOOKUP(F63,ParametricTableRange,MATCH(\"Operating Region Used\",parametric_table!$A$1:$AV$1,0),FALSE)>0,F63,\"0\"),\"0\")","v":"0"},{"$f":"IF(ROWS(H$2:H63)>COUNTIF(G$2:G261,\"<>0\"),\"\",IF(ISERROR(INDEX(G$2:G261,SMALL(IF(G$2:G261<>\"0\",ROW(G$2:G261)-ROW(G$2)+1),ROWS(H$2:H63)))),\"\",IF(INDEX(G$2:G261,SMALL(IF(G$2:G261<>\"0\",ROW(G$2:G261)-ROW(G$2)+1),ROWS(H$2:H63)))=0,\"\",INDEX(G$2:G261,SMALL(IF(G$2:G261<>\"0\",ROW(G$2:G261)-ROW(G$2)+1),ROWS(H$2:H63))))))","v":""}]
[null,null,null,null,null,{"$f":"IF(DesignTool!$B$40=parametric_table!D64,parametric_table!A64,\"0\")","v":"0"},{"$f":"_xlfn.IFNA(IF(VLOOKUP(F64,ParametricTableRange,MATCH(\"Operating Region Used\",parametric_table!$A$1:$AV$1,0),FALSE)>0,F64,\"0\"),\"0\")","v":"0"},{"$f":"IF(ROWS(H$2:H64)>COUNTIF(G$2:G262,\"<>0\"),\"\",IF(ISERROR(INDEX(G$2:G262,SMALL(IF(G$2:G262<>\"0\",ROW(G$2:G262)-ROW(G$2)+1),ROWS(H$2:H64)))),\"\",IF(INDEX(G$2:G262,SMALL(IF(G$2:G262<>\"0\",ROW(G$2:G262)-ROW(G$2)+1),ROWS(H$2:H64)))=0,\"\",INDEX(G$2:G262,SMALL(IF(G$2:G262<>\"0\",ROW(G$2:G262)-ROW(G$2)+1),ROWS(H$2:H64))))))","v":""}]
[null,null,null,null,null,{"$f":"IF(DesignTool!$B$40=parametric_table!D65,parametric_table!A65,\"0\")","v":"0"},{"$f":"_xlfn.IFNA(IF(VLOOKUP(F65,ParametricTableRange,MATCH(\"Operating Region Used\",parametric_table!$A$1:$AV$1,0),FALSE)>0,F65,\"0\"),\"0\")","v":"0"},{"$f":"IF(ROWS(H$2:H65)>COUNTIF(G$2:G263,\"<>0\"),\"\",IF(ISERROR(INDEX(G$2:G263,SMALL(IF(G$2:G263<>\"0\",ROW(G$2:G263)-ROW(G$2)+1),ROWS(H$2:H65)))),\"\",IF(INDEX(G$2:G263,SMALL(IF(G$2:G263<>\"0\",ROW(G$2:G263)-ROW(G$2)+1),ROWS(H$2:H65)))=0,\"\",INDEX(G$2:G263,SMALL(IF(G$2:G263<>\"0\",ROW(G$2:G263)-ROW(G$2)+1),ROWS(H$2:H65))))))","v":""}]
[null,null,null,null,null,{"$f":"IF(DesignTool!$B$40=parametric_table!D66,parametric_table!A66,\"0\")","v":"0"},{"$f":"_xlfn.IFNA(IF(VLOOKUP(F66,ParametricTableRange,MATCH(\"Operating Region Used\",parametric_table!$A$1:$AV$1,0),FALSE)>0,F66,\"0\"),\"0\")","v":"0"},{"$f":"IF(ROWS(H$2:H66)>COUNTIF(G$2:G264,\"<>0\"),\"\",IF(ISERROR(INDEX(G$2:G264,SMALL(IF(G$2:G264<>\"0\",ROW(G$2:G264)-ROW(G$2)+1),ROWS(H$2:H66)))),\"\",IF(INDEX(G$2:G264,SMALL(IF(G$2:G264<>\"0\",ROW(G$2:G264)-ROW(G$2)+1),ROWS(H$2:H66)))=0,\"\",INDEX(G$2:G264,SMALL(IF(G$2:G264<>\"0\",ROW(G$2:G264)-ROW(G$2)+1),ROWS(H$2:H66))))))","v":""}]
[null,null,null,null,null,{"$f":"IF(DesignTool!$B$40=parametric_table!D67,parametric_table!A67,\"0\")","v":"0"},{"$f":"_xlfn.IFNA(IF(VLOOKUP(F67,ParametricTableRange,MATCH(\"Operating Region Used\",parametric_table!$A$1:$AV$1,0),FALSE)>0,F67,\"0\"),\"0\")","v":"0"},{"$f":"IF(ROWS(H$2:H67)>COUNTIF(G$2:G265,\"<>0\"),\"\",IF(ISERROR(INDEX(G$2:G265,SMALL(IF(G$2:G265<>\"0\",ROW(G$2:G265)-ROW(G$2)+1),ROWS(H$2:H67)))),\"\",IF(INDEX(G$2:G265,SMALL(IF(G$2:G265<>\"0\",ROW(G$2:G265)-ROW(G$2)+1),ROWS(H$2:H67)))=0,\"\",INDEX(G$2:G265,SMALL(IF(G$2:G265<>\"0\",ROW(G$2:G265)-ROW(G$2)+1),ROWS(H$2:H67))))))","v":""}]
[null,null,null,null,null,{"$f":"IF(DesignTool!$B$40=parametric_table!D68,parametric_table!A68,\"0\")","v":"0"},{"$f":"_xlfn.IFNA(IF(VLOOKUP(F68,ParametricTableRange,MATCH(\"Operating Region Used\",parametric_table!$A$1:$AV$1,0),FALSE)>0,F68,\"0\"),\"0\")","v":"0"},{"$f":"IF(ROWS(H$2:H68)>COUNTIF(G$2:G266,\"<>0\"),\"\",IF(ISERROR(INDEX(G$2:G266,SMALL(IF(G$2:G266<>\"0\",ROW(G$2:G266)-ROW(G$2)+1),ROWS(H$2:H68)))),\"\",IF(INDEX(G$2:G266,SMALL(IF(G$2:G266<>\"0\",ROW(G$2:G266)-ROW(G$2)+1),ROWS(H$2:H68)))=0,\"\",INDEX(G$2:G266,SMALL(IF(G$2:G266<>\"0\",ROW(G$2:G266)-ROW(G$2)+1),ROWS(H$2:H68))))))","v":""}]
[null,null,null,null,null,{"$f":"IF(DesignTool!$B$40=parametric_table!D69,parametric_table!A69,\"0\")","v":"0"},{"$f":"_xlfn.IFNA(IF(VLOOKUP(F69,ParametricTableRange,MATCH(\"Operating Region Used\",parametric_table!$A$1:$AV$1,0),FALSE)>0,F69,\"0\"),\"0\")","v":"0"},{"$f":"IF(ROWS(H$2:H69)>COUNTIF(G$2:G267,\"<>0\"),\"\",IF(ISERROR(INDEX(G$2:G267,SMALL(IF(G$2:G267<>\"0\",ROW(G$2:G267)-ROW(G$2)+1),ROWS(H$2:H69)))),\"\",IF(INDEX(G$2:G267,SMALL(IF(G$2:G267<>\"0\",ROW(G$2:G267)-ROW(G$2)+1),ROWS(H$2:H69)))=0,\"\",INDEX(G$2:G267,SMALL(IF(G$2:G267<>\"0\",ROW(G$2:G267)-ROW(G$2)+1),ROWS(H$2:H69))))))","v":""}]
[null,null,null,null,null,{"$f":"IF(DesignTool!$B$40=parametric_table!D70,parametric_table!A70,\"0\")","v":"0"},{"$f":"_xlfn.IFNA(IF(VLOOKUP(F70,ParametricTableRange,MATCH(\"Operating Region Used\",parametric_table!$A$1:$AV$1,0),FALSE)>0,F70,\"0\"),\"0\")","v":"0"},{"$f":"IF(ROWS(H$2:H70)>COUNTIF(G$2:G268,\"<>0\"),\"\",IF(ISERROR(INDEX(G$2:G268,SMALL(IF(G$2:G268<>\"0\",ROW(G$2:G268)-ROW(G$2)+1),ROWS(H$2:H70)))),\"\",IF(INDEX(G$2:G268,SMALL(IF(G$2:G268<>\"0\",ROW(G$2:G268)-ROW(G$2)+1),ROWS(H$2:H70)))=0,\"\",INDEX(G$2:G268,SMALL(IF(G$2:G268<>\"0\",ROW(G$2:G268)-ROW(G$2)+1),ROWS(H$2:H70))))))","v":""}]
[null,null,null,null,null,{"$f":"IF(DesignTool!$B$40=parametric_table!D71,parametric_table!A71,\"0\")","v":"0"},{"$f":"_xlfn.IFNA(IF(VLOOKUP(F71,ParametricTableRange,MATCH(\"Operating Region Used\",parametric_table!$A$1:$AV$1,0),FALSE)>0,F71,\"0\"),\"0\")","v":"0"},{"$f":"IF(ROWS(H$2:H71)>COUNTIF(G$2:G269,\"<>0\"),\"\",IF(ISERROR(INDEX(G$2:G269,SMALL(IF(G$2:G269<>\"0\",ROW(G$2:G269)-ROW(G$2)+1),ROWS(H$2:H71)))),\"\",IF(INDEX(G$2:G269,SMALL(IF(G$2:G269<>\"0\",ROW(G$2:G269)-ROW(G$2)+1),ROWS(H$2:H71)))=0,\"\",INDEX(G$2:G269,SMALL(IF(G$2:G269<>\"0\",ROW(G$2:G269)-ROW(G$2)+1),ROWS(H$2:H71))))))","v":""}]
[null,null,null,null,null,{"$f":"IF(DesignTool!$B$40=parametric_table!D72,parametric_table!A72,\"0\")","v":"0"},{"$f":"_xlfn.IFNA(IF(VLOOKUP(F72,ParametricTableRange,MATCH(\"Operating Region Used\",parametric_table!$A$1:$AV$1,0),FALSE)>0,F72,\"0\"),\"0\")","v":"0"},{"$f":"IF(ROWS(H$2:H72)>COUNTIF(G$2:G270,\"<>0\"),\"\",IF(ISERROR(INDEX(G$2:G270,SMALL(IF(G$2:G270<>\"0\",ROW(G$2:G270)-ROW(G$2)+1),ROWS(H$2:H72)))),\"\",IF(INDEX(G$2:G270,SMALL(IF(G$2:G270<>\"0\",ROW(G$2:G270)-ROW(G$2)+1),ROWS(H$2:H72)))=0,\"\",INDEX(G$2:G270,SMALL(IF(G$2:G270<>\"0\",ROW(G$2:G270)-ROW(G$2)+1),ROWS(H$2:H72))))))","v":""}]
[null,null,null,null,null,{"$f":"IF(DesignTool!$B$40=parametric_table!D73,parametric_table!A73,\"0\")","v":"0"},{"$f":"_xlfn.IFNA(IF(VLOOKUP(F73,ParametricTableRange,MATCH(\"Operating Region Used\",parametric_table!$A$1:$AV$1,0),FALSE)>0,F73,\"0\"),\"0\")","v":"0"},{"$f":"IF(ROWS(H$2:H73)>COUNTIF(G$2:G271,\"<>0\"),\"\",IF(ISERROR(INDEX(G$2:G271,SMALL(IF(G$2:G271<>\"0\",ROW(G$2:G271)-ROW(G$2)+1),ROWS(H$2:H73)))),\"\",IF(INDEX(G$2:G271,SMALL(IF(G$2:G271<>\"0\",ROW(G$2:G271)-ROW(G$2)+1),ROWS(H$2:H73)))=0,\"\",INDEX(G$2:G271,SMALL(IF(G$2:G271<>\"0\",ROW(G$2:G271)-ROW(G$2)+1),ROWS(H$2:H73))))))","v":""}]
[null,null,null,null,null,{"$f":"IF(DesignTool!$B$40=parametric_table!D74,parametric_table!A74,\"0\")","v":"0"},{"$f":"_xlfn.IFNA(IF(VLOOKUP(F74,ParametricTableRange,MATCH(\"Operating Region Used\",parametric_table!$A$1:$AV$1,0),FALSE)>0,F74,\"0\"),\"0\")","v":"0"},{"$f":"IF(ROWS(H$2:H74)>COUNTIF(G$2:G272,\"<>0\"),\"\",IF(ISERROR(INDEX(G$2:G272,SMALL(IF(G$2:G272<>\"0\",ROW(G$2:G272)-ROW(G$2)+1),ROWS(H$2:H74)))),\"\",IF(INDEX(G$2:G272,SMALL(IF(G$2:G272<>\"0\",ROW(G$2:G272)-ROW(G$2)+1),ROWS(H$2:H74)))=0,\"\",INDEX(G$2:G272,SMALL(IF(G$2:G272<>\"0\",ROW(G$2:G272)-ROW(G$2)+1),ROWS(H$2:H74))))))","v":""}]
[null,null,null,null,null,{"$f":"IF(DesignTool!$B$40=parametric_table!D75,parametric_table!A75,\"0\")","v":"0"},{"$f":"_xlfn.IFNA(IF(VLOOKUP(F75,ParametricTableRange,MATCH(\"Operating Region Used\",parametric_table!$A$1:$AV$1,0),FALSE)>0,F75,\"0\"),\"0\")","v":"0"},{"$f":"IF(ROWS(H$2:H75)>COUNTIF(G$2:G273,\"<>0\"),\"\",IF(ISERROR(INDEX(G$2:G273,SMALL(IF(G$2:G273<>\"0\",ROW(G$2:G273)-ROW(G$2)+1),ROWS(H$2:H75)))),\"\",IF(INDEX(G$2:G273,SMALL(IF(G$2:G273<>\"0\",ROW(G$2:G273)-ROW(G$2)+1),ROWS(H$2:H75)))=0,\"\",INDEX(G$2:G273,SMALL(IF(G$2:G273<>\"0\",ROW(G$2:G273)-ROW(G$2)+1),ROWS(H$2:H75))))))","v":""}]
[null,null,null,null,null,{"$f":"IF(DesignTool!$B$40=parametric_table!D76,parametric_table!A76,\"0\")","v":"0"},{"$f":"_xlfn.IFNA(IF(VLOOKUP(F76,ParametricTableRange,MATCH(\"Operating Region Used\",parametric_table!$A$1:$AV$1,0),FALSE)>0,F76,\"0\"),\"0\")","v":"0"},{"$f":"IF(ROWS(H$2:H76)>COUNTIF(G$2:G274,\"<>0\"),\"\",IF(ISERROR(INDEX(G$2:G274,SMALL(IF(G$2:G274<>\"0\",ROW(G$2:G274)-ROW(G$2)+1),ROWS(H$2:H76)))),\"\",IF(INDEX(G$2:G274,SMALL(IF(G$2:G274<>\"0\",ROW(G$2:G274)-ROW(G$2)+1),ROWS(H$2:H76)))=0,\"\",INDEX(G$2:G274,SMALL(IF(G$2:G274<>\"0\",ROW(G$2:G274)-ROW(G$2)+1),ROWS(H$2:H76))))))","v":""}]
[null,null,null,null,null,{"$f":"IF(DesignTool!$B$40=parametric_table!D77,parametric_table!A77,\"0\")","v":"0"},{"$f":"_xlfn.IFNA(IF(VLOOKUP(F77,ParametricTableRange,MATCH(\"Operating Region Used\",parametric_table!$A$1:$AV$1,0),FALSE)>0,F77,\"0\"),\"0\")","v":"0"},{"$f":"IF(ROWS(H$2:H77)>COUNTIF(G$2:G275,\"<>0\"),\"\",IF(ISERROR(INDEX(G$2:G275,SMALL(IF(G$2:G275<>\"0\",ROW(G$2:G275)-ROW(G$2)+1),ROWS(H$2:H77)))),\"\",IF(INDEX(G$2:G275,SMALL(IF(G$2:G275<>\"0\",ROW(G$2:G275)-ROW(G$2)+1),ROWS(H$2:H77)))=0,\"\",INDEX(G$2:G275,SMALL(IF(G$2:G275<>\"0\",ROW(G$2:G275)-ROW(G$2)+1),ROWS(H$2:H77))))))","v":""}]
[null,null,null,null,null,{"$f":"IF(DesignTool!$B$40=parametric_table!D78,parametric_table!A78,\"0\")","v":"0"},{"$f":"_xlfn.IFNA(IF(VLOOKUP(F78,ParametricTableRange,MATCH(\"Operating Region Used\",parametric_table!$A$1:$AV$1,0),FALSE)>0,F78,\"0\"),\"0\")","v":"0"},{"$f":"IF(ROWS(H$2:H78)>COUNTIF(G$2:G276,\"<>0\"),\"\",IF(ISERROR(INDEX(G$2:G276,SMALL(IF(G$2:G276<>\"0\",ROW(G$2:G276)-ROW(G$2)+1),ROWS(H$2:H78)))),\"\",IF(INDEX(G$2:G276,SMALL(IF(G$2:G276<>\"0\",ROW(G$2:G276)-ROW(G$2)+1),ROWS(H$2:H78)))=0,\"\",INDEX(G$2:G276,SMALL(IF(G$2:G276<>\"0\",ROW(G$2:G276)-ROW(G$2)+1),ROWS(H$2:H78))))))","v":""}]
[null,null,null,null,null,{"$f":"IF(DesignTool!$B$40=parametric_table!D79,parametric_table!A79,\"0\")","v":"0"},{"$f":"_xlfn.IFNA(IF(VLOOKUP(F79,ParametricTableRange,MATCH(\"Operating Region Used\",parametric_table!$A$1:$AV$1,0),FALSE)>0,F79,\"0\"),\"0\")","v":"0"},{"$f":"IF(ROWS(H$2:H79)>COUNTIF(G$2:G277,\"<>0\"),\"\",IF(ISERROR(INDEX(G$2:G277,SMALL(IF(G$2:G277<>\"0\",ROW(G$2:G277)-ROW(G$2)+1),ROWS(H$2:H79)))),\"\",IF(INDEX(G$2:G277,SMALL(IF(G$2:G277<>\"0\",ROW(G$2:G277)-ROW(G$2)+1),ROWS(H$2:H79)))=0,\"\",INDEX(G$2:G277,SMALL(IF(G$2:G277<>\"0\",ROW(G$2:G277)-ROW(G$2)+1),ROWS(H$2:H79))))))","v":""}]
[null,null,null,null,null,{"$f":"IF(DesignTool!$B$40=parametric_table!D80,parametric_table!A80,\"0\")","v":"0"},{"$f":"_xlfn.IFNA(IF(VLOOKUP(F80,ParametricTableRange,MATCH(\"Operating Region Used\",parametric_table!$A$1:$AV$1,0),FALSE)>0,F80,\"0\"),\"0\")","v":"0"},{"$f":"IF(ROWS(H$2:H80)>COUNTIF(G$2:G278,\"<>0\"),\"\",IF(ISERROR(INDEX(G$2:G278,SMALL(IF(G$2:G278<>\"0\",ROW(G$2:G278)-ROW(G$2)+1),ROWS(H$2:H80)))),\"\",IF(INDEX(G$2:G278,SMALL(IF(G$2:G278<>\"0\",ROW(G$2:G278)-ROW(G$2)+1),ROWS(H$2:H80)))=0,\"\",INDEX(G$2:G278,SMALL(IF(G$2:G278<>\"0\",ROW(G$2:G278)-ROW(G$2)+1),ROWS(H$2:H80))))))","v":""}]
[null,null,null,null,null,{"$f":"IF(DesignTool!$B$40=parametric_table!D81,parametric_table!A81,\"0\")","v":"0"},{"$f":"_xlfn.IFNA(IF(VLOOKUP(F81,ParametricTableRange,MATCH(\"Operating Region Used\",parametric_table!$A$1:$AV$1,0),FALSE)>0,F81,\"0\"),\"0\")","v":"0"},{"$f":"IF(ROWS(H$2:H81)>COUNTIF(G$2:G279,\"<>0\"),\"\",IF(ISERROR(INDEX(G$2:G279,SMALL(IF(G$2:G279<>\"0\",ROW(G$2:G279)-ROW(G$2)+1),ROWS(H$2:H81)))),\"\",IF(INDEX(G$2:G279,SMALL(IF(G$2:G279<>\"0\",ROW(G$2:G279)-ROW(G$2)+1),ROWS(H$2:H81)))=0,\"\",INDEX(G$2:G279,SMALL(IF(G$2:G279<>\"0\",ROW(G$2:G279)-ROW(G$2)+1),ROWS(H$2:H81))))))","v":""}]
[null,null,null,null,null,{"$f":"IF(DesignTool!$B$40=parametric_table!D82,parametric_table!A82,\"0\")","v":"0"},{"$f":"_xlfn.IFNA(IF(VLOOKUP(F82,ParametricTableRange,MATCH(\"Operating Region Used\",parametric_table!$A$1:$AV$1,0),FALSE)>0,F82,\"0\"),\"0\")","v":"0"},{"$f":"IF(ROWS(H$2:H82)>COUNTIF(G$2:G280,\"<>0\"),\"\",IF(ISERROR(INDEX(G$2:G280,SMALL(IF(G$2:G280<>\"0\",ROW(G$2:G280)-ROW(G$2)+1),ROWS(H$2:H82)))),\"\",IF(INDEX(G$2:G280,SMALL(IF(G$2:G280<>\"0\",ROW(G$2:G280)-ROW(G$2)+1),ROWS(H$2:H82)))=0,\"\",INDEX(G$2:G280,SMALL(IF(G$2:G280<>\"0\",ROW(G$2:G280)-ROW(G$2)+1),ROWS(H$2:H82))))))","v":""}]
[null,null,null,null,null,{"$f":"IF(DesignTool!$B$40=parametric_table!D83,parametric_table!A83,\"0\")","v":"0"},{"$f":"_xlfn.IFNA(IF(VLOOKUP(F83,ParametricTableRange,MATCH(\"Operating Region Used\",parametric_table!$A$1:$AV$1,0),FALSE)>0,F83,\"0\"),\"0\")","v":"0"},{"$f":"IF(ROWS(H$2:H83)>COUNTIF(G$2:G281,\"<>0\"),\"\",IF(ISERROR(INDEX(G$2:G281,SMALL(IF(G$2:G281<>\"0\",ROW(G$2:G281)-ROW(G$2)+1),ROWS(H$2:H83)))),\"\",IF(INDEX(G$2:G281,SMALL(IF(G$2:G281<>\"0\",ROW(G$2:G281)-ROW(G$2)+1),ROWS(H$2:H83)))=0,\"\",INDEX(G$2:G281,SMALL(IF(G$2:G281<>\"0\",ROW(G$2:G281)-ROW(G$2)+1),ROWS(H$2:H83))))))","v":""}]
[null,null,null,null,null,{"$f":"IF(DesignTool!$B$40=parametric_table!D84,parametric_table!A84,\"0\")","v":"0"},{"$f":"_xlfn.IFNA(IF(VLOOKUP(F84,ParametricTableRange,MATCH(\"Operating Region Used\",parametric_table!$A$1:$AV$1,0),FALSE)>0,F84,\"0\"),\"0\")","v":"0"},{"$f":"IF(ROWS(H$2:H84)>COUNTIF(G$2:G282,\"<>0\"),\"\",IF(ISERROR(INDEX(G$2:G282,SMALL(IF(G$2:G282<>\"0\",ROW(G$2:G282)-ROW(G$2)+1),ROWS(H$2:H84)))),\"\",IF(INDEX(G$2:G282,SMALL(IF(G$2:G282<>\"0\",ROW(G$2:G282)-ROW(G$2)+1),ROWS(H$2:H84)))=0,\"\",INDEX(G$2:G282,SMALL(IF(G$2:G282<>\"0\",ROW(G$2:G282)-ROW(G$2)+1),ROWS(H$2:H84))))))","v":""}]
[null,null,null,null,null,{"$f":"IF(DesignTool!$B$40=parametric_table!D85,parametric_table!A85,\"0\")","v":"0"},{"$f":"_xlfn.IFNA(IF(VLOOKUP(F85,ParametricTableRange,MATCH(\"Operating Region Used\",parametric_table!$A$1:$AV$1,0),FALSE)>0,F85,\"0\"),\"0\")","v":"0"},{"$f":"IF(ROWS(H$2:H85)>COUNTIF(G$2:G283,\"<>0\"),\"\",IF(ISERROR(INDEX(G$2:G283,SMALL(IF(G$2:G283<>\"0\",ROW(G$2:G283)-ROW(G$2)+1),ROWS(H$2:H85)))),\"\",IF(INDEX(G$2:G283,SMALL(IF(G$2:G283<>\"0\",ROW(G$2:G283)-ROW(G$2)+1),ROWS(H$2:H85)))=0,\"\",INDEX(G$2:G283,SMALL(IF(G$2:G283<>\"0\",ROW(G$2:G283)-ROW(G$2)+1),ROWS(H$2:H85))))))","v":""}]
[null,null,null,null,null,{"$f":"IF(DesignTool!$B$40=parametric_table!D86,parametric_table!A86,\"0\")","v":"0"},{"$f":"_xlfn.IFNA(IF(VLOOKUP(F86,ParametricTableRange,MATCH(\"Operating Region Used\",parametric_table!$A$1:$AV$1,0),FALSE)>0,F86,\"0\"),\"0\")","v":"0"},{"$f":"IF(ROWS(H$2:H86)>COUNTIF(G$2:G284,\"<>0\"),\"\",IF(ISERROR(INDEX(G$2:G284,SMALL(IF(G$2:G284<>\"0\",ROW(G$2:G284)-ROW(G$2)+1),ROWS(H$2:H86)))),\"\",IF(INDEX(G$2:G284,SMALL(IF(G$2:G284<>\"0\",ROW(G$2:G284)-ROW(G$2)+1),ROWS(H$2:H86)))=0,\"\",INDEX(G$2:G284,SMALL(IF(G$2:G284<>\"0\",ROW(G$2:G284)-ROW(G$2)+1),ROWS(H$2:H86))))))","v":""}]
[null,null,null,null,null,{"$f":"IF(DesignTool!$B$40=parametric_table!D87,parametric_table!A87,\"0\")","v":"0"},{"$f":"_xlfn.IFNA(IF(VLOOKUP(F87,ParametricTableRange,MATCH(\"Operating Region Used\",parametric_table!$A$1:$AV$1,0),FALSE)>0,F87,\"0\"),\"0\")","v":"0"},{"$f":"IF(ROWS(H$2:H87)>COUNTIF(G$2:G285,\"<>0\"),\"\",IF(ISERROR(INDEX(G$2:G285,SMALL(IF(G$2:G285<>\"0\",ROW(G$2:G285)-ROW(G$2)+1),ROWS(H$2:H87)))),\"\",IF(INDEX(G$2:G285,SMALL(IF(G$2:G285<>\"0\",ROW(G$2:G285)-ROW(G$2)+1),ROWS(H$2:H87)))=0,\"\",INDEX(G$2:G285,SMALL(IF(G$2:G285<>\"0\",ROW(G$2:G285)-ROW(G$2)+1),ROWS(H$2:H87))))))","v":""}]
[null,null,null,null,null,{"$f":"IF(DesignTool!$B$40=parametric_table!D88,parametric_table!A88,\"0\")","v":"0"},{"$f":"_xlfn.IFNA(IF(VLOOKUP(F88,ParametricTableRange,MATCH(\"Operating Region Used\",parametric_table!$A$1:$AV$1,0),FALSE)>0,F88,\"0\"),\"0\")","v":"0"},{"$f":"IF(ROWS(H$2:H88)>COUNTIF(G$2:G286,\"<>0\"),\"\",IF(ISERROR(INDEX(G$2:G286,SMALL(IF(G$2:G286<>\"0\",ROW(G$2:G286)-ROW(G$2)+1),ROWS(H$2:H88)))),\"\",IF(INDEX(G$2:G286,SMALL(IF(G$2:G286<>\"0\",ROW(G$2:G286)-ROW(G$2)+1),ROWS(H$2:H88)))=0,\"\",INDEX(G$2:G286,SMALL(IF(G$2:G286<>\"0\",ROW(G$2:G286)-ROW(G$2)+1),ROWS(H$2:H88))))))","v":""}]
[null,null,null,null,null,{"$f":"IF(DesignTool!$B$40=parametric_table!D89,parametric_table!A89,\"0\")","v":"0"},{"$f":"_xlfn.IFNA(IF(VLOOKUP(F89,ParametricTableRange,MATCH(\"Operating Region Used\",parametric_table!$A$1:$AV$1,0),FALSE)>0,F89,\"0\"),\"0\")","v":"0"},{"$f":"IF(ROWS(H$2:H89)>COUNTIF(G$2:G287,\"<>0\"),\"\",IF(ISERROR(INDEX(G$2:G287,SMALL(IF(G$2:G287<>\"0\",ROW(G$2:G287)-ROW(G$2)+1),ROWS(H$2:H89)))),\"\",IF(INDEX(G$2:G287,SMALL(IF(G$2:G287<>\"0\",ROW(G$2:G287)-ROW(G$2)+1),ROWS(H$2:H89)))=0,\"\",INDEX(G$2:G287,SMALL(IF(G$2:G287<>\"0\",ROW(G$2:G287)-ROW(G$2)+1),ROWS(H$2:H89))))))","v":""}]
[null,null,null,null,null,{"$f":"IF(DesignTool!$B$40=parametric_table!D90,parametric_table!A90,\"0\")","v":"0"},{"$f":"_xlfn.IFNA(IF(VLOOKUP(F90,ParametricTableRange,MATCH(\"Operating Region Used\",parametric_table!$A$1:$AV$1,0),FALSE)>0,F90,\"0\"),\"0\")","v":"0"},{"$f":"IF(ROWS(H$2:H90)>COUNTIF(G$2:G288,\"<>0\"),\"\",IF(ISERROR(INDEX(G$2:G288,SMALL(IF(G$2:G288<>\"0\",ROW(G$2:G288)-ROW(G$2)+1),ROWS(H$2:H90)))),\"\",IF(INDEX(G$2:G288,SMALL(IF(G$2:G288<>\"0\",ROW(G$2:G288)-ROW(G$2)+1),ROWS(H$2:H90)))=0,\"\",INDEX(G$2:G288,SMALL(IF(G$2:G288<>\"0\",ROW(G$2:G288)-ROW(G$2)+1),ROWS(H$2:H90))))))","v":""}]
[null,null,null,null,null,{"$f":"IF(DesignTool!$B$40=parametric_table!D91,parametric_table!A91,\"0\")","v":"0"},{"$f":"_xlfn.IFNA(IF(VLOOKUP(F91,ParametricTableRange,MATCH(\"Operating Region Used\",parametric_table!$A$1:$AV$1,0),FALSE)>0,F91,\"0\"),\"0\")","v":"0"},{"$f":"IF(ROWS(H$2:H91)>COUNTIF(G$2:G289,\"<>0\"),\"\",IF(ISERROR(INDEX(G$2:G289,SMALL(IF(G$2:G289<>\"0\",ROW(G$2:G289)-ROW(G$2)+1),ROWS(H$2:H91)))),\"\",IF(INDEX(G$2:G289,SMALL(IF(G$2:G289<>\"0\",ROW(G$2:G289)-ROW(G$2)+1),ROWS(H$2:H91)))=0,\"\",INDEX(G$2:G289,SMALL(IF(G$2:G289<>\"0\",ROW(G$2:G289)-ROW(G$2)+1),ROWS(H$2:H91))))))","v":""}]
[null,null,null,null,null,{"$f":"IF(DesignTool!$B$40=parametric_table!D92,parametric_table!A92,\"0\")","v":"0"},{"$f":"_xlfn.IFNA(IF(VLOOKUP(F92,ParametricTableRange,MATCH(\"Operating Region Used\",parametric_table!$A$1:$AV$1,0),FALSE)>0,F92,\"0\"),\"0\")","v":"0"},{"$f":"IF(ROWS(H$2:H92)>COUNTIF(G$2:G290,\"<>0\"),\"\",IF(ISERROR(INDEX(G$2:G290,SMALL(IF(G$2:G290<>\"0\",ROW(G$2:G290)-ROW(G$2)+1),ROWS(H$2:H92)))),\"\",IF(INDEX(G$2:G290,SMALL(IF(G$2:G290<>\"0\",ROW(G$2:G290)-ROW(G$2)+1),ROWS(H$2:H92)))=0,\"\",INDEX(G$2:G290,SMALL(IF(G$2:G290<>\"0\",ROW(G$2:G290)-ROW(G$2)+1),ROWS(H$2:H92))))))","v":""}]
[null,null,null,null,null,{"$f":"IF(DesignTool!$B$40=parametric_table!D93,parametric_table!A93,\"0\")","v":"0"},{"$f":"_xlfn.IFNA(IF(VLOOKUP(F93,ParametricTableRange,MATCH(\"Operating Region Used\",parametric_table!$A$1:$AV$1,0),FALSE)>0,F93,\"0\"),\"0\")","v":"0"},{"$f":"IF(ROWS(H$2:H93)>COUNTIF(G$2:G291,\"<>0\"),\"\",IF(ISERROR(INDEX(G$2:G291,SMALL(IF(G$2:G291<>\"0\",ROW(G$2:G291)-ROW(G$2)+1),ROWS(H$2:H93)))),\"\",IF(INDEX(G$2:G291,SMALL(IF(G$2:G291<>\"0\",ROW(G$2:G291)-ROW(G$2)+1),ROWS(H$2:H93)))=0,\"\",INDEX(G$2:G291,SMALL(IF(G$2:G291<>\"0\",ROW(G$2:G291)-ROW(G$2)+1),ROWS(H$2:H93))))))","v":""}]
[null,null,null,null,null,{"$f":"IF(DesignTool!$B$40=parametric_table!D94,parametric_table!A94,\"0\")","v":"0"},{"$f":"_xlfn.IFNA(IF(VLOOKUP(F94,ParametricTableRange,MATCH(\"Operating Region Used\",parametric_table!$A$1:$AV$1,0),FALSE)>0,F94,\"0\"),\"0\")","v":"0"},{"$f":"IF(ROWS(H$2:H94)>COUNTIF(G$2:G292,\"<>0\"),\"\",IF(ISERROR(INDEX(G$2:G292,SMALL(IF(G$2:G292<>\"0\",ROW(G$2:G292)-ROW(G$2)+1),ROWS(H$2:H94)))),\"\",IF(INDEX(G$2:G292,SMALL(IF(G$2:G292<>\"0\",ROW(G$2:G292)-ROW(G$2)+1),ROWS(H$2:H94)))=0,\"\",INDEX(G$2:G292,SMALL(IF(G$2:G292<>\"0\",ROW(G$2:G292)-ROW(G$2)+1),ROWS(H$2:H94))))))","v":""}]
[null,null,null,null,null,{"$f":"IF(DesignTool!$B$40=parametric_table!D95,parametric_table!A95,\"0\")","v":"0"},{"$f":"_xlfn.IFNA(IF(VLOOKUP(F95,ParametricTableRange,MATCH(\"Operating Region Used\",parametric_table!$A$1:$AV$1,0),FALSE)>0,F95,\"0\"),\"0\")","v":"0"},{"$f":"IF(ROWS(H$2:H95)>COUNTIF(G$2:G293,\"<>0\"),\"\",IF(ISERROR(INDEX(G$2:G293,SMALL(IF(G$2:G293<>\"0\",ROW(G$2:G293)-ROW(G$2)+1),ROWS(H$2:H95)))),\"\",IF(INDEX(G$2:G293,SMALL(IF(G$2:G293<>\"0\",ROW(G$2:G293)-ROW(G$2)+1),ROWS(H$2:H95)))=0,\"\",INDEX(G$2:G293,SMALL(IF(G$2:G293<>\"0\",ROW(G$2:G293)-ROW(G$2)+1),ROWS(H$2:H95))))))","v":""}]
[null,null,null,null,null,{"$f":"IF(DesignTool!$B$40=parametric_table!D96,parametric_table!A96,\"0\")","v":"0"},{"$f":"_xlfn.IFNA(IF(VLOOKUP(F96,ParametricTableRange,MATCH(\"Operating Region Used\",parametric_table!$A$1:$AV$1,0),FALSE)>0,F96,\"0\"),\"0\")","v":"0"},{"$f":"IF(ROWS(H$2:H96)>COUNTIF(G$2:G294,\"<>0\"),\"\",IF(ISERROR(INDEX(G$2:G294,SMALL(IF(G$2:G294<>\"0\",ROW(G$2:G294)-ROW(G$2)+1),ROWS(H$2:H96)))),\"\",IF(INDEX(G$2:G294,SMALL(IF(G$2:G294<>\"0\",ROW(G$2:G294)-ROW(G$2)+1),ROWS(H$2:H96)))=0,\"\",INDEX(G$2:G294,SMALL(IF(G$2:G294<>\"0\",ROW(G$2:G294)-ROW(G$2)+1),ROWS(H$2:H96))))))","v":""}]
[null,null,null,null,null,{"$f":"IF(DesignTool!$B$40=parametric_table!D97,parametric_table!A97,\"0\")","v":"0"},{"$f":"_xlfn.IFNA(IF(VLOOKUP(F97,ParametricTableRange,MATCH(\"Operating Region Used\",parametric_table!$A$1:$AV$1,0),FALSE)>0,F97,\"0\"),\"0\")","v":"0"},{"$f":"IF(ROWS(H$2:H97)>COUNTIF(G$2:G295,\"<>0\"),\"\",IF(ISERROR(INDEX(G$2:G295,SMALL(IF(G$2:G295<>\"0\",ROW(G$2:G295)-ROW(G$2)+1),ROWS(H$2:H97)))),\"\",IF(INDEX(G$2:G295,SMALL(IF(G$2:G295<>\"0\",ROW(G$2:G295)-ROW(G$2)+1),ROWS(H$2:H97)))=0,\"\",INDEX(G$2:G295,SMALL(IF(G$2:G295<>\"0\",ROW(G$2:G295)-ROW(G$2)+1),ROWS(H$2:H97))))))","v":""}]
[null,null,null,null,null,{"$f":"IF(DesignTool!$B$40=parametric_table!D98,parametric_table!A98,\"0\")","v":"0"},{"$f":"_xlfn.IFNA(IF(VLOOKUP(F98,ParametricTableRange,MATCH(\"Operating Region Used\",parametric_table!$A$1:$AV$1,0),FALSE)>0,F98,\"0\"),\"0\")","v":"0"},{"$f":"IF(ROWS(H$2:H98)>COUNTIF(G$2:G296,\"<>0\"),\"\",IF(ISERROR(INDEX(G$2:G296,SMALL(IF(G$2:G296<>\"0\",ROW(G$2:G296)-ROW(G$2)+1),ROWS(H$2:H98)))),\"\",IF(INDEX(G$2:G296,SMALL(IF(G$2:G296<>\"0\",ROW(G$2:G296)-ROW(G$2)+1),ROWS(H$2:H98)))=0,\"\",INDEX(G$2:G296,SMALL(IF(G$2:G296<>\"0\",ROW(G$2:G296)-ROW(G$2)+1),ROWS(H$2:H98))))))","v":""}]
[null,null,null,null,null,{"$f":"IF(DesignTool!$B$40=parametric_table!D99,parametric_table!A99,\"0\")","v":"0"},{"$f":"_xlfn.IFNA(IF(VLOOKUP(F99,ParametricTableRange,MATCH(\"Operating Region Used\",parametric_table!$A$1:$AV$1,0),FALSE)>0,F99,\"0\"),\"0\")","v":"0"},{"$f":"IF(ROWS(H$2:H99)>COUNTIF(G$2:G297,\"<>0\"),\"\",IF(ISERROR(INDEX(G$2:G297,SMALL(IF(G$2:G297<>\"0\",ROW(G$2:G297)-ROW(G$2)+1),ROWS(H$2:H99)))),\"\",IF(INDEX(G$2:G297,SMALL(IF(G$2:G297<>\"0\",ROW(G$2:G297)-ROW(G$2)+1),ROWS(H$2:H99)))=0,\"\",INDEX(G$2:G297,SMALL(IF(G$2:G297<>\"0\",ROW(G$2:G297)-ROW(G$2)+1),ROWS(H$2:H99))))))","v":""}]
[null,null,null,null,null,{"$f":"IF(DesignTool!$B$40=parametric_table!D100,parametric_table!A100,\"0\")","v":"0"},{"$f":"_xlfn.IFNA(IF(VLOOKUP(F100,ParametricTableRange,MATCH(\"Operating Region Used\",parametric_table!$A$1:$AV$1,0),FALSE)>0,F100,\"0\"),\"0\")","v":"0"},{"$f":"IF(ROWS(H$2:H100)>COUNTIF(G$2:G298,\"<>0\"),\"\",IF(ISERROR(INDEX(G$2:G298,SMALL(IF(G$2:G298<>\"0\",ROW(G$2:G298)-ROW(G$2)+1),ROWS(H$2:H100)))),\"\",IF(INDEX(G$2:G298,SMALL(IF(G$2:G298<>\"0\",ROW(G$2:G298)-ROW(G$2)+1),ROWS(H$2:H100)))=0,\"\",INDEX(G$2:G298,SMALL(IF(G$2:G298<>\"0\",ROW(G$2:G298)-ROW(G$2)+1),ROWS(H$2:H100))))))","v":""}]
[null,null,null,null,null,{"$f":"IF(DesignTool!$B$40=parametric_table!D101,parametric_table!A101,\"0\")","v":"0"},{"$f":"_xlfn.IFNA(IF(VLOOKUP(F101,ParametricTableRange,MATCH(\"Operating Region Used\",parametric_table!$A$1:$AV$1,0),FALSE)>0,F101,\"0\"),\"0\")","v":"0"},{"$f":"IF(ROWS(H$2:H101)>COUNTIF(G$2:G299,\"<>0\"),\"\",IF(ISERROR(INDEX(G$2:G299,SMALL(IF(G$2:G299<>\"0\",ROW(G$2:G299)-ROW(G$2)+1),ROWS(H$2:H101)))),\"\",IF(INDEX(G$2:G299,SMALL(IF(G$2:G299<>\"0\",ROW(G$2:G299)-ROW(G$2)+1),ROWS(H$2:H101)))=0,\"\",INDEX(G$2:G299,SMALL(IF(G$2:G299<>\"0\",ROW(G$2:G299)-ROW(G$2)+1),ROWS(H$2:H101))))))","v":""}]
[null,null,null,null,null,{"$f":"IF(DesignTool!$B$40=parametric_table!D102,parametric_table!A102,\"0\")","v":"0"},{"$f":"_xlfn.IFNA(IF(VLOOKUP(F102,ParametricTableRange,MATCH(\"Operating Region Used\",parametric_table!$A$1:$AV$1,0),FALSE)>0,F102,\"0\"),\"0\")","v":"0"},{"$f":"IF(ROWS(H$2:H102)>COUNTIF(G$2:G300,\"<>0\"),\"\",IF(ISERROR(INDEX(G$2:G300,SMALL(IF(G$2:G300<>\"0\",ROW(G$2:G300)-ROW(G$2)+1),ROWS(H$2:H102)))),\"\",IF(INDEX(G$2:G300,SMALL(IF(G$2:G300<>\"0\",ROW(G$2:G300)-ROW(G$2)+1),ROWS(H$2:H102)))=0,\"\",INDEX(G$2:G300,SMALL(IF(G$2:G300<>\"0\",ROW(G$2:G300)-ROW(G$2)+1),ROWS(H$2:H102))))))","v":""}]
[null,null,null,null,null,{"$f":"IF(DesignTool!$B$40=parametric_table!D103,parametric_table!A103,\"0\")","v":"0"},{"$f":"_xlfn.IFNA(IF(VLOOKUP(F103,ParametricTableRange,MATCH(\"Operating Region Used\",parametric_table!$A$1:$AV$1,0),FALSE)>0,F103,\"0\"),\"0\")","v":"0"},{"$f":"IF(ROWS(H$2:H103)>COUNTIF(G$2:G301,\"<>0\"),\"\",IF(ISERROR(INDEX(G$2:G301,SMALL(IF(G$2:G301<>\"0\",ROW(G$2:G301)-ROW(G$2)+1),ROWS(H$2:H103)))),\"\",IF(INDEX(G$2:G301,SMALL(IF(G$2:G301<>\"0\",ROW(G$2:G301)-ROW(G$2)+1),ROWS(H$2:H103)))=0,\"\",INDEX(G$2:G301,SMALL(IF(G$2:G301<>\"0\",ROW(G$2:G301)-ROW(G$2)+1),ROWS(H$2:H103))))))","v":""}]
[null,null,null,null,null,{"$f":"IF(DesignTool!$B$40=parametric_table!D104,parametric_table!A104,\"0\")","v":"0"},{"$f":"_xlfn.IFNA(IF(VLOOKUP(F104,ParametricTableRange,MATCH(\"Operating Region Used\",parametric_table!$A$1:$AV$1,0),FALSE)>0,F104,\"0\"),\"0\")","v":"0"},{"$f":"IF(ROWS(H$2:H104)>COUNTIF(G$2:G302,\"<>0\"),\"\",IF(ISERROR(INDEX(G$2:G302,SMALL(IF(G$2:G302<>\"0\",ROW(G$2:G302)-ROW(G$2)+1),ROWS(H$2:H104)))),\"\",IF(INDEX(G$2:G302,SMALL(IF(G$2:G302<>\"0\",ROW(G$2:G302)-ROW(G$2)+1),ROWS(H$2:H104)))=0,\"\",INDEX(G$2:G302,SMALL(IF(G$2:G302<>\"0\",ROW(G$2:G302)-ROW(G$2)+1),ROWS(H$2:H104))))))","v":""}]
[null,null,null,null,null,{"$f":"IF(DesignTool!$B$40=parametric_table!D105,parametric_table!A105,\"0\")","v":"0"},{"$f":"_xlfn.IFNA(IF(VLOOKUP(F105,ParametricTableRange,MATCH(\"Operating Region Used\",parametric_table!$A$1:$AV$1,0),FALSE)>0,F105,\"0\"),\"0\")","v":"0"},{"$f":"IF(ROWS(H$2:H105)>COUNTIF(G$2:G303,\"<>0\"),\"\",IF(ISERROR(INDEX(G$2:G303,SMALL(IF(G$2:G303<>\"0\",ROW(G$2:G303)-ROW(G$2)+1),ROWS(H$2:H105)))),\"\",IF(INDEX(G$2:G303,SMALL(IF(G$2:G303<>\"0\",ROW(G$2:G303)-ROW(G$2)+1),ROWS(H$2:H105)))=0,\"\",INDEX(G$2:G303,SMALL(IF(G$2:G303<>\"0\",ROW(G$2:G303)-ROW(G$2)+1),ROWS(H$2:H105))))))","v":""}]
[null,null,null,null,null,{"$f":"IF(DesignTool!$B$40=parametric_table!D106,parametric_table!A106,\"0\")","v":"0"},{"$f":"_xlfn.IFNA(IF(VLOOKUP(F106,ParametricTableRange,MATCH(\"Operating Region Used\",parametric_table!$A$1:$AV$1,0),FALSE)>0,F106,\"0\"),\"0\")","v":"0"},{"$f":"IF(ROWS(H$2:H106)>COUNTIF(G$2:G304,\"<>0\"),\"\",IF(ISERROR(INDEX(G$2:G304,SMALL(IF(G$2:G304<>\"0\",ROW(G$2:G304)-ROW(G$2)+1),ROWS(H$2:H106)))),\"\",IF(INDEX(G$2:G304,SMALL(IF(G$2:G304<>\"0\",ROW(G$2:G304)-ROW(G$2)+1),ROWS(H$2:H106)))=0,\"\",INDEX(G$2:G304,SMALL(IF(G$2:G304<>\"0\",ROW(G$2:G304)-ROW(G$2)+1),ROWS(H$2:H106))))))","v":""}]
[null,null,null,null,null,{"$f":"IF(DesignTool!$B$40=parametric_table!D107,parametric_table!A107,\"0\")","v":"0"},{"$f":"_xlfn.IFNA(IF(VLOOKUP(F107,ParametricTableRange,MATCH(\"Operating Region Used\",parametric_table!$A$1:$AV$1,0),FALSE)>0,F107,\"0\"),\"0\")","v":"0"},{"$f":"IF(ROWS(H$2:H107)>COUNTIF(G$2:G305,\"<>0\"),\"\",IF(ISERROR(INDEX(G$2:G305,SMALL(IF(G$2:G305<>\"0\",ROW(G$2:G305)-ROW(G$2)+1),ROWS(H$2:H107)))),\"\",IF(INDEX(G$2:G305,SMALL(IF(G$2:G305<>\"0\",ROW(G$2:G305)-ROW(G$2)+1),ROWS(H$2:H107)))=0,\"\",INDEX(G$2:G305,SMALL(IF(G$2:G305<>\"0\",ROW(G$2:G305)-ROW(G$2)+1),ROWS(H$2:H107))))))","v":""}]
[null,null,null,null,null,{"$f":"IF(DesignTool!$B$40=parametric_table!D108,parametric_table!A108,\"0\")","v":"0"},{"$f":"_xlfn.IFNA(IF(VLOOKUP(F108,ParametricTableRange,MATCH(\"Operating Region Used\",parametric_table!$A$1:$AV$1,0),FALSE)>0,F108,\"0\"),\"0\")","v":"0"},{"$f":"IF(ROWS(H$2:H108)>COUNTIF(G$2:G306,\"<>0\"),\"\",IF(ISERROR(INDEX(G$2:G306,SMALL(IF(G$2:G306<>\"0\",ROW(G$2:G306)-ROW(G$2)+1),ROWS(H$2:H108)))),\"\",IF(INDEX(G$2:G306,SMALL(IF(G$2:G306<>\"0\",ROW(G$2:G306)-ROW(G$2)+1),ROWS(H$2:H108)))=0,\"\",INDEX(G$2:G306,SMALL(IF(G$2:G306<>\"0\",ROW(G$2:G306)-ROW(G$2)+1),ROWS(H$2:H108))))))","v":""}]
[null,null,null,null,null,{"$f":"IF(DesignTool!$B$40=parametric_table!D109,parametric_table!A109,\"0\")","v":"0"},{"$f":"_xlfn.IFNA(IF(VLOOKUP(F109,ParametricTableRange,MATCH(\"Operating Region Used\",parametric_table!$A$1:$AV$1,0),FALSE)>0,F109,\"0\"),\"0\")","v":"0"},{"$f":"IF(ROWS(H$2:H109)>COUNTIF(G$2:G307,\"<>0\"),\"\",IF(ISERROR(INDEX(G$2:G307,SMALL(IF(G$2:G307<>\"0\",ROW(G$2:G307)-ROW(G$2)+1),ROWS(H$2:H109)))),\"\",IF(INDEX(G$2:G307,SMALL(IF(G$2:G307<>\"0\",ROW(G$2:G307)-ROW(G$2)+1),ROWS(H$2:H109)))=0,\"\",INDEX(G$2:G307,SMALL(IF(G$2:G307<>\"0\",ROW(G$2:G307)-ROW(G$2)+1),ROWS(H$2:H109))))))","v":""}]
[null,null,null,null,null,{"$f":"IF(DesignTool!$B$40=parametric_table!D110,parametric_table!A110,\"0\")","v":"0"},{"$f":"_xlfn.IFNA(IF(VLOOKUP(F110,ParametricTableRange,MATCH(\"Operating Region Used\",parametric_table!$A$1:$AV$1,0),FALSE)>0,F110,\"0\"),\"0\")","v":"0"},{"$f":"IF(ROWS(H$2:H110)>COUNTIF(G$2:G308,\"<>0\"),\"\",IF(ISERROR(INDEX(G$2:G308,SMALL(IF(G$2:G308<>\"0\",ROW(G$2:G308)-ROW(G$2)+1),ROWS(H$2:H110)))),\"\",IF(INDEX(G$2:G308,SMALL(IF(G$2:G308<>\"0\",ROW(G$2:G308)-ROW(G$2)+1),ROWS(H$2:H110)))=0,\"\",INDEX(G$2:G308,SMALL(IF(G$2:G308<>\"0\",ROW(G$2:G308)-ROW(G$2)+1),ROWS(H$2:H110))))))","v":""}]
[null,null,null,null,null,{"$f":"IF(DesignTool!$B$40=parametric_table!D111,parametric_table!A111,\"0\")","v":"0"},{"$f":"_xlfn.IFNA(IF(VLOOKUP(F111,ParametricTableRange,MATCH(\"Operating Region Used\",parametric_table!$A$1:$AV$1,0),FALSE)>0,F111,\"0\"),\"0\")","v":"0"},{"$f":"IF(ROWS(H$2:H111)>COUNTIF(G$2:G309,\"<>0\"),\"\",IF(ISERROR(INDEX(G$2:G309,SMALL(IF(G$2:G309<>\"0\",ROW(G$2:G309)-ROW(G$2)+1),ROWS(H$2:H111)))),\"\",IF(INDEX(G$2:G309,SMALL(IF(G$2:G309<>\"0\",ROW(G$2:G309)-ROW(G$2)+1),ROWS(H$2:H111)))=0,\"\",INDEX(G$2:G309,SMALL(IF(G$2:G309<>\"0\",ROW(G$2:G309)-ROW(G$2)+1),ROWS(H$2:H111))))))","v":""}]
[null,null,null,null,null,{"$f":"IF(DesignTool!$B$40=parametric_table!D112,parametric_table!A112,\"0\")","v":"0"},{"$f":"_xlfn.IFNA(IF(VLOOKUP(F112,ParametricTableRange,MATCH(\"Operating Region Used\",parametric_table!$A$1:$AV$1,0),FALSE)>0,F112,\"0\"),\"0\")","v":"0"},{"$f":"IF(ROWS(H$2:H112)>COUNTIF(G$2:G310,\"<>0\"),\"\",IF(ISERROR(INDEX(G$2:G310,SMALL(IF(G$2:G310<>\"0\",ROW(G$2:G310)-ROW(G$2)+1),ROWS(H$2:H112)))),\"\",IF(INDEX(G$2:G310,SMALL(IF(G$2:G310<>\"0\",ROW(G$2:G310)-ROW(G$2)+1),ROWS(H$2:H112)))=0,\"\",INDEX(G$2:G310,SMALL(IF(G$2:G310<>\"0\",ROW(G$2:G310)-ROW(G$2)+1),ROWS(H$2:H112))))))","v":""}]
[null,null,null,null,null,{"$f":"IF(DesignTool!$B$40=parametric_table!D113,parametric_table!A113,\"0\")","v":"0"},{"$f":"_xlfn.IFNA(IF(VLOOKUP(F113,ParametricTableRange,MATCH(\"Operating Region Used\",parametric_table!$A$1:$AV$1,0),FALSE)>0,F113,\"0\"),\"0\")","v":"0"},{"$f":"IF(ROWS(H$2:H113)>COUNTIF(G$2:G311,\"<>0\"),\"\",IF(ISERROR(INDEX(G$2:G311,SMALL(IF(G$2:G311<>\"0\",ROW(G$2:G311)-ROW(G$2)+1),ROWS(H$2:H113)))),\"\",IF(INDEX(G$2:G311,SMALL(IF(G$2:G311<>\"0\",ROW(G$2:G311)-ROW(G$2)+1),ROWS(H$2:H113)))=0,\"\",INDEX(G$2:G311,SMALL(IF(G$2:G311<>\"0\",ROW(G$2:G311)-ROW(G$2)+1),ROWS(H$2:H113))))))","v":""}]
[null,null,null,null,null,{"$f":"IF(DesignTool!$B$40=parametric_table!D114,parametric_table!A114,\"0\")","v":"0"},{"$f":"_xlfn.IFNA(IF(VLOOKUP(F114,ParametricTableRange,MATCH(\"Operating Region Used\",parametric_table!$A$1:$AV$1,0),FALSE)>0,F114,\"0\"),\"0\")","v":"0"},{"$f":"IF(ROWS(H$2:H114)>COUNTIF(G$2:G312,\"<>0\"),\"\",IF(ISERROR(INDEX(G$2:G312,SMALL(IF(G$2:G312<>\"0\",ROW(G$2:G312)-ROW(G$2)+1),ROWS(H$2:H114)))),\"\",IF(INDEX(G$2:G312,SMALL(IF(G$2:G312<>\"0\",ROW(G$2:G312)-ROW(G$2)+1),ROWS(H$2:H114)))=0,\"\",INDEX(G$2:G312,SMALL(IF(G$2:G312<>\"0\",ROW(G$2:G312)-ROW(G$2)+1),ROWS(H$2:H114))))))","v":""}]
[null,null,null,null,null,{"$f":"IF(DesignTool!$B$40=parametric_table!D115,parametric_table!A115,\"0\")","v":"0"},{"$f":"_xlfn.IFNA(IF(VLOOKUP(F115,ParametricTableRange,MATCH(\"Operating Region Used\",parametric_table!$A$1:$AV$1,0),FALSE)>0,F115,\"0\"),\"0\")","v":"0"},{"$f":"IF(ROWS(H$2:H115)>COUNTIF(G$2:G313,\"<>0\"),\"\",IF(ISERROR(INDEX(G$2:G313,SMALL(IF(G$2:G313<>\"0\",ROW(G$2:G313)-ROW(G$2)+1),ROWS(H$2:H115)))),\"\",IF(INDEX(G$2:G313,SMALL(IF(G$2:G313<>\"0\",ROW(G$2:G313)-ROW(G$2)+1),ROWS(H$2:H115)))=0,\"\",INDEX(G$2:G313,SMALL(IF(G$2:G313<>\"0\",ROW(G$2:G313)-ROW(G$2)+1),ROWS(H$2:H115))))))","v":""}]
[null,null,null,null,null,{"$f":"IF(DesignTool!$B$40=parametric_table!D116,parametric_table!A116,\"0\")","v":"0"},{"$f":"_xlfn.IFNA(IF(VLOOKUP(F116,ParametricTableRange,MATCH(\"Operating Region Used\",parametric_table!$A$1:$AV$1,0),FALSE)>0,F116,\"0\"),\"0\")","v":"0"},{"$f":"IF(ROWS(H$2:H116)>COUNTIF(G$2:G314,\"<>0\"),\"\",IF(ISERROR(INDEX(G$2:G314,SMALL(IF(G$2:G314<>\"0\",ROW(G$2:G314)-ROW(G$2)+1),ROWS(H$2:H116)))),\"\",IF(INDEX(G$2:G314,SMALL(IF(G$2:G314<>\"0\",ROW(G$2:G314)-ROW(G$2)+1),ROWS(H$2:H116)))=0,\"\",INDEX(G$2:G314,SMALL(IF(G$2:G314<>\"0\",ROW(G$2:G314)-ROW(G$2)+1),ROWS(H$2:H116))))))","v":""}]
[null,null,null,null,null,{"$f":"IF(DesignTool!$B$40=parametric_table!D117,parametric_table!A117,\"0\")","v":"0"},{"$f":"_xlfn.IFNA(IF(VLOOKUP(F117,ParametricTableRange,MATCH(\"Operating Region Used\",parametric_table!$A$1:$AV$1,0),FALSE)>0,F117,\"0\"),\"0\")","v":"0"},{"$f":"IF(ROWS(H$2:H117)>COUNTIF(G$2:G315,\"<>0\"),\"\",IF(ISERROR(INDEX(G$2:G315,SMALL(IF(G$2:G315<>\"0\",ROW(G$2:G315)-ROW(G$2)+1),ROWS(H$2:H117)))),\"\",IF(INDEX(G$2:G315,SMALL(IF(G$2:G315<>\"0\",ROW(G$2:G315)-ROW(G$2)+1),ROWS(H$2:H117)))=0,\"\",INDEX(G$2:G315,SMALL(IF(G$2:G315<>\"0\",ROW(G$2:G315)-ROW(G$2)+1),ROWS(H$2:H117))))))","v":""}]
[null,null,null,null,null,{"$f":"IF(DesignTool!$B$40=parametric_table!D118,parametric_table!A118,\"0\")","v":"0"},{"$f":"_xlfn.IFNA(IF(VLOOKUP(F118,ParametricTableRange,MATCH(\"Operating Region Used\",parametric_table!$A$1:$AV$1,0),FALSE)>0,F118,\"0\"),\"0\")","v":"0"},{"$f":"IF(ROWS(H$2:H118)>COUNTIF(G$2:G316,\"<>0\"),\"\",IF(ISERROR(INDEX(G$2:G316,SMALL(IF(G$2:G316<>\"0\",ROW(G$2:G316)-ROW(G$2)+1),ROWS(H$2:H118)))),\"\",IF(INDEX(G$2:G316,SMALL(IF(G$2:G316<>\"0\",ROW(G$2:G316)-ROW(G$2)+1),ROWS(H$2:H118)))=0,\"\",INDEX(G$2:G316,SMALL(IF(G$2:G316<>\"0\",ROW(G$2:G316)-ROW(G$2)+1),ROWS(H$2:H118))))))","v":""}]
[null,null,null,null,null,{"$f":"IF(DesignTool!$B$40=parametric_table!D119,parametric_table!A119,\"0\")","v":"0"},{"$f":"_xlfn.IFNA(IF(VLOOKUP(F119,ParametricTableRange,MATCH(\"Operating Region Used\",parametric_table!$A$1:$AV$1,0),FALSE)>0,F119,\"0\"),\"0\")","v":"0"},{"$f":"IF(ROWS(H$2:H119)>COUNTIF(G$2:G317,\"<>0\"),\"\",IF(ISERROR(INDEX(G$2:G317,SMALL(IF(G$2:G317<>\"0\",ROW(G$2:G317)-ROW(G$2)+1),ROWS(H$2:H119)))),\"\",IF(INDEX(G$2:G317,SMALL(IF(G$2:G317<>\"0\",ROW(G$2:G317)-ROW(G$2)+1),ROWS(H$2:H119)))=0,\"\",INDEX(G$2:G317,SMALL(IF(G$2:G317<>\"0\",ROW(G$2:G317)-ROW(G$2)+1),ROWS(H$2:H119))))))","v":""}]
[null,null,null,null,null,{"$f":"IF(DesignTool!$B$40=parametric_table!D120,parametric_table!A120,\"0\")","v":"0"},{"$f":"_xlfn.IFNA(IF(VLOOKUP(F120,ParametricTableRange,MATCH(\"Operating Region Used\",parametric_table!$A$1:$AV$1,0),FALSE)>0,F120,\"0\"),\"0\")","v":"0"},{"$f":"IF(ROWS(H$2:H120)>COUNTIF(G$2:G318,\"<>0\"),\"\",IF(ISERROR(INDEX(G$2:G318,SMALL(IF(G$2:G318<>\"0\",ROW(G$2:G318)-ROW(G$2)+1),ROWS(H$2:H120)))),\"\",IF(INDEX(G$2:G318,SMALL(IF(G$2:G318<>\"0\",ROW(G$2:G318)-ROW(G$2)+1),ROWS(H$2:H120)))=0,\"\",INDEX(G$2:G318,SMALL(IF(G$2:G318<>\"0\",ROW(G$2:G318)-ROW(G$2)+1),ROWS(H$2:H120))))))","v":""}]
[null,null,null,null,null,{"$f":"IF(DesignTool!$B$40=parametric_table!D121,parametric_table!A121,\"0\")","v":"0"},{"$f":"_xlfn.IFNA(IF(VLOOKUP(F121,ParametricTableRange,MATCH(\"Operating Region Used\",parametric_table!$A$1:$AV$1,0),FALSE)>0,F121,\"0\"),\"0\")","v":"0"},{"$f":"IF(ROWS(H$2:H121)>COUNTIF(G$2:G319,\"<>0\"),\"\",IF(ISERROR(INDEX(G$2:G319,SMALL(IF(G$2:G319<>\"0\",ROW(G$2:G319)-ROW(G$2)+1),ROWS(H$2:H121)))),\"\",IF(INDEX(G$2:G319,SMALL(IF(G$2:G319<>\"0\",ROW(G$2:G319)-ROW(G$2)+1),ROWS(H$2:H121)))=0,\"\",INDEX(G$2:G319,SMALL(IF(G$2:G319<>\"0\",ROW(G$2:G319)-ROW(G$2)+1),ROWS(H$2:H121))))))","v":""}]
[null,null,null,null,null,{"$f":"IF(DesignTool!$B$40=parametric_table!D122,parametric_table!A122,\"0\")","v":"0"},{"$f":"_xlfn.IFNA(IF(VLOOKUP(F122,ParametricTableRange,MATCH(\"Operating Region Used\",parametric_table!$A$1:$AV$1,0),FALSE)>0,F122,\"0\"),\"0\")","v":"0"},{"$f":"IF(ROWS(H$2:H122)>COUNTIF(G$2:G320,\"<>0\"),\"\",IF(ISERROR(INDEX(G$2:G320,SMALL(IF(G$2:G320<>\"0\",ROW(G$2:G320)-ROW(G$2)+1),ROWS(H$2:H122)))),\"\",IF(INDEX(G$2:G320,SMALL(IF(G$2:G320<>\"0\",ROW(G$2:G320)-ROW(G$2)+1),ROWS(H$2:H122)))=0,\"\",INDEX(G$2:G320,SMALL(IF(G$2:G320<>\"0\",ROW(G$2:G320)-ROW(G$2)+1),ROWS(H$2:H122))))))","v":""}]
[null,null,null,null,null,{"$f":"IF(DesignTool!$B$40=parametric_table!D123,parametric_table!A123,\"0\")","v":"0"},{"$f":"_xlfn.IFNA(IF(VLOOKUP(F123,ParametricTableRange,MATCH(\"Operating Region Used\",parametric_table!$A$1:$AV$1,0),FALSE)>0,F123,\"0\"),\"0\")","v":"0"},{"$f":"IF(ROWS(H$2:H123)>COUNTIF(G$2:G321,\"<>0\"),\"\",IF(ISERROR(INDEX(G$2:G321,SMALL(IF(G$2:G321<>\"0\",ROW(G$2:G321)-ROW(G$2)+1),ROWS(H$2:H123)))),\"\",IF(INDEX(G$2:G321,SMALL(IF(G$2:G321<>\"0\",ROW(G$2:G321)-ROW(G$2)+1),ROWS(H$2:H123)))=0,\"\",INDEX(G$2:G321,SMALL(IF(G$2:G321<>\"0\",ROW(G$2:G321)-ROW(G$2)+1),ROWS(H$2:H123))))))","v":""}]
[null,null,null,null,null,{"$f":"IF(DesignTool!$B$40=parametric_table!D124,parametric_table!A124,\"0\")","v":"0"},{"$f":"_xlfn.IFNA(IF(VLOOKUP(F124,ParametricTableRange,MATCH(\"Operating Region Used\",parametric_table!$A$1:$AV$1,0),FALSE)>0,F124,\"0\"),\"0\")","v":"0"},{"$f":"IF(ROWS(H$2:H124)>COUNTIF(G$2:G322,\"<>0\"),\"\",IF(ISERROR(INDEX(G$2:G322,SMALL(IF(G$2:G322<>\"0\",ROW(G$2:G322)-ROW(G$2)+1),ROWS(H$2:H124)))),\"\",IF(INDEX(G$2:G322,SMALL(IF(G$2:G322<>\"0\",ROW(G$2:G322)-ROW(G$2)+1),ROWS(H$2:H124)))=0,\"\",INDEX(G$2:G322,SMALL(IF(G$2:G322<>\"0\",ROW(G$2:G322)-ROW(G$2)+1),ROWS(H$2:H124))))))","v":""}]
[null,null,null,null,null,{"$f":"IF(DesignTool!$B$40=parametric_table!D125,parametric_table!A125,\"0\")","v":"0"},{"$f":"_xlfn.IFNA(IF(VLOOKUP(F125,ParametricTableRange,MATCH(\"Operating Region Used\",parametric_table!$A$1:$AV$1,0),FALSE)>0,F125,\"0\"),\"0\")","v":"0"},{"$f":"IF(ROWS(H$2:H125)>COUNTIF(G$2:G323,\"<>0\"),\"\",IF(ISERROR(INDEX(G$2:G323,SMALL(IF(G$2:G323<>\"0\",ROW(G$2:G323)-ROW(G$2)+1),ROWS(H$2:H125)))),\"\",IF(INDEX(G$2:G323,SMALL(IF(G$2:G323<>\"0\",ROW(G$2:G323)-ROW(G$2)+1),ROWS(H$2:H125)))=0,\"\",INDEX(G$2:G323,SMALL(IF(G$2:G323<>\"0\",ROW(G$2:G323)-ROW(G$2)+1),ROWS(H$2:H125))))))","v":""}]
[null,null,null,null,null,{"$f":"IF(DesignTool!$B$40=parametric_table!D126,parametric_table!A126,\"0\")","v":"0"},{"$f":"_xlfn.IFNA(IF(VLOOKUP(F126,ParametricTableRange,MATCH(\"Operating Region Used\",parametric_table!$A$1:$AV$1,0),FALSE)>0,F126,\"0\"),\"0\")","v":"0"},{"$f":"IF(ROWS(H$2:H126)>COUNTIF(G$2:G324,\"<>0\"),\"\",IF(ISERROR(INDEX(G$2:G324,SMALL(IF(G$2:G324<>\"0\",ROW(G$2:G324)-ROW(G$2)+1),ROWS(H$2:H126)))),\"\",IF(INDEX(G$2:G324,SMALL(IF(G$2:G324<>\"0\",ROW(G$2:G324)-ROW(G$2)+1),ROWS(H$2:H126)))=0,\"\",INDEX(G$2:G324,SMALL(IF(G$2:G324<>\"0\",ROW(G$2:G324)-ROW(G$2)+1),ROWS(H$2:H126))))))","v":""}]
[null,null,null,null,null,{"$f":"IF(DesignTool!$B$40=parametric_table!D127,parametric_table!A127,\"0\")","v":"0"},{"$f":"_xlfn.IFNA(IF(VLOOKUP(F127,ParametricTableRange,MATCH(\"Operating Region Used\",parametric_table!$A$1:$AV$1,0),FALSE)>0,F127,\"0\"),\"0\")","v":"0"},{"$f":"IF(ROWS(H$2:H127)>COUNTIF(G$2:G325,\"<>0\"),\"\",IF(ISERROR(INDEX(G$2:G325,SMALL(IF(G$2:G325<>\"0\",ROW(G$2:G325)-ROW(G$2)+1),ROWS(H$2:H127)))),\"\",IF(INDEX(G$2:G325,SMALL(IF(G$2:G325<>\"0\",ROW(G$2:G325)-ROW(G$2)+1),ROWS(H$2:H127)))=0,\"\",INDEX(G$2:G325,SMALL(IF(G$2:G325<>\"0\",ROW(G$2:G325)-ROW(G$2)+1),ROWS(H$2:H127))))))","v":""}]
[null,null,null,null,null,{"$f":"IF(DesignTool!$B$40=parametric_table!D128,parametric_table!A128,\"0\")","v":"0"},{"$f":"_xlfn.IFNA(IF(VLOOKUP(F128,ParametricTableRange,MATCH(\"Operating Region Used\",parametric_table!$A$1:$AV$1,0),FALSE)>0,F128,\"0\"),\"0\")","v":"0"},{"$f":"IF(ROWS(H$2:H128)>COUNTIF(G$2:G326,\"<>0\"),\"\",IF(ISERROR(INDEX(G$2:G326,SMALL(IF(G$2:G326<>\"0\",ROW(G$2:G326)-ROW(G$2)+1),ROWS(H$2:H128)))),\"\",IF(INDEX(G$2:G326,SMALL(IF(G$2:G326<>\"0\",ROW(G$2:G326)-ROW(G$2)+1),ROWS(H$2:H128)))=0,\"\",INDEX(G$2:G326,SMALL(IF(G$2:G326<>\"0\",ROW(G$2:G326)-ROW(G$2)+1),ROWS(H$2:H128))))))","v":""}]
[null,null,null,null,null,{"$f":"IF(DesignTool!$B$40=parametric_table!D129,parametric_table!A129,\"0\")","v":"0"},{"$f":"_xlfn.IFNA(IF(VLOOKUP(F129,ParametricTableRange,MATCH(\"Operating Region Used\",parametric_table!$A$1:$AV$1,0),FALSE)>0,F129,\"0\"),\"0\")","v":"0"},{"$f":"IF(ROWS(H$2:H129)>COUNTIF(G$2:G327,\"<>0\"),\"\",IF(ISERROR(INDEX(G$2:G327,SMALL(IF(G$2:G327<>\"0\",ROW(G$2:G327)-ROW(G$2)+1),ROWS(H$2:H129)))),\"\",IF(INDEX(G$2:G327,SMALL(IF(G$2:G327<>\"0\",ROW(G$2:G327)-ROW(G$2)+1),ROWS(H$2:H129)))=0,\"\",INDEX(G$2:G327,SMALL(IF(G$2:G327<>\"0\",ROW(G$2:G327)-ROW(G$2)+1),ROWS(H$2:H129))))))","v":""}]
[null,null,null,null,null,{"$f":"IF(DesignTool!$B$40=parametric_table!D130,parametric_table!A130,\"0\")","v":"0"},{"$f":"_xlfn.IFNA(IF(VLOOKUP(F130,ParametricTableRange,MATCH(\"Operating Region Used\",parametric_table!$A$1:$AV$1,0),FALSE)>0,F130,\"0\"),\"0\")","v":"0"},{"$f":"IF(ROWS(H$2:H130)>COUNTIF(G$2:G328,\"<>0\"),\"\",IF(ISERROR(INDEX(G$2:G328,SMALL(IF(G$2:G328<>\"0\",ROW(G$2:G328)-ROW(G$2)+1),ROWS(H$2:H130)))),\"\",IF(INDEX(G$2:G328,SMALL(IF(G$2:G328<>\"0\",ROW(G$2:G328)-ROW(G$2)+1),ROWS(H$2:H130)))=0,\"\",INDEX(G$2:G328,SMALL(IF(G$2:G328<>\"0\",ROW(G$2:G328)-ROW(G$2)+1),ROWS(H$2:H130))))))","v":""}]
[null,null,null,null,null,{"$f":"IF(DesignTool!$B$40=parametric_table!D131,parametric_table!A131,\"0\")","v":"0"},{"$f":"_xlfn.IFNA(IF(VLOOKUP(F131,ParametricTableRange,MATCH(\"Operating Region Used\",parametric_table!$A$1:$AV$1,0),FALSE)>0,F131,\"0\"),\"0\")","v":"0"},{"$f":"IF(ROWS(H$2:H131)>COUNTIF(G$2:G329,\"<>0\"),\"\",IF(ISERROR(INDEX(G$2:G329,SMALL(IF(G$2:G329<>\"0\",ROW(G$2:G329)-ROW(G$2)+1),ROWS(H$2:H131)))),\"\",IF(INDEX(G$2:G329,SMALL(IF(G$2:G329<>\"0\",ROW(G$2:G329)-ROW(G$2)+1),ROWS(H$2:H131)))=0,\"\",INDEX(G$2:G329,SMALL(IF(G$2:G329<>\"0\",ROW(G$2:G329)-ROW(G$2)+1),ROWS(H$2:H131))))))","v":""}]
[null,null,null,null,null,{"$f":"IF(DesignTool!$B$40=parametric_table!D132,parametric_table!A132,\"0\")","v":"0"},{"$f":"_xlfn.IFNA(IF(VLOOKUP(F132,ParametricTableRange,MATCH(\"Operating Region Used\",parametric_table!$A$1:$AV$1,0),FALSE)>0,F132,\"0\"),\"0\")","v":"0"},{"$f":"IF(ROWS(H$2:H132)>COUNTIF(G$2:G330,\"<>0\"),\"\",IF(ISERROR(INDEX(G$2:G330,SMALL(IF(G$2:G330<>\"0\",ROW(G$2:G330)-ROW(G$2)+1),ROWS(H$2:H132)))),\"\",IF(INDEX(G$2:G330,SMALL(IF(G$2:G330<>\"0\",ROW(G$2:G330)-ROW(G$2)+1),ROWS(H$2:H132)))=0,\"\",INDEX(G$2:G330,SMALL(IF(G$2:G330<>\"0\",ROW(G$2:G330)-ROW(G$2)+1),ROWS(H$2:H132))))))","v":""}]
[null,null,null,null,null,{"$f":"IF(DesignTool!$B$40=parametric_table!D133,parametric_table!A133,\"0\")","v":"0"},{"$f":"_xlfn.IFNA(IF(VLOOKUP(F133,ParametricTableRange,MATCH(\"Operating Region Used\",parametric_table!$A$1:$AV$1,0),FALSE)>0,F133,\"0\"),\"0\")","v":"0"},{"$f":"IF(ROWS(H$2:H133)>COUNTIF(G$2:G331,\"<>0\"),\"\",IF(ISERROR(INDEX(G$2:G331,SMALL(IF(G$2:G331<>\"0\",ROW(G$2:G331)-ROW(G$2)+1),ROWS(H$2:H133)))),\"\",IF(INDEX(G$2:G331,SMALL(IF(G$2:G331<>\"0\",ROW(G$2:G331)-ROW(G$2)+1),ROWS(H$2:H133)))=0,\"\",INDEX(G$2:G331,SMALL(IF(G$2:G331<>\"0\",ROW(G$2:G331)-ROW(G$2)+1),ROWS(H$2:H133))))))","v":""}]
[null,null,null,null,null,{"$f":"IF(DesignTool!$B$40=parametric_table!D134,parametric_table!A134,\"0\")","v":"0"},{"$f":"_xlfn.IFNA(IF(VLOOKUP(F134,ParametricTableRange,MATCH(\"Operating Region Used\",parametric_table!$A$1:$AV$1,0),FALSE)>0,F134,\"0\"),\"0\")","v":"0"},{"$f":"IF(ROWS(H$2:H134)>COUNTIF(G$2:G332,\"<>0\"),\"\",IF(ISERROR(INDEX(G$2:G332,SMALL(IF(G$2:G332<>\"0\",ROW(G$2:G332)-ROW(G$2)+1),ROWS(H$2:H134)))),\"\",IF(INDEX(G$2:G332,SMALL(IF(G$2:G332<>\"0\",ROW(G$2:G332)-ROW(G$2)+1),ROWS(H$2:H134)))=0,\"\",INDEX(G$2:G332,SMALL(IF(G$2:G332<>\"0\",ROW(G$2:G332)-ROW(G$2)+1),ROWS(H$2:H134))))))","v":""}]
[null,null,null,null,null,{"$f":"IF(DesignTool!$B$40=parametric_table!D135,parametric_table!A135,\"0\")","v":"0"},{"$f":"_xlfn.IFNA(IF(VLOOKUP(F135,ParametricTableRange,MATCH(\"Operating Region Used\",parametric_table!$A$1:$AV$1,0),FALSE)>0,F135,\"0\"),\"0\")","v":"0"},{"$f":"IF(ROWS(H$2:H135)>COUNTIF(G$2:G333,\"<>0\"),\"\",IF(ISERROR(INDEX(G$2:G333,SMALL(IF(G$2:G333<>\"0\",ROW(G$2:G333)-ROW(G$2)+1),ROWS(H$2:H135)))),\"\",IF(INDEX(G$2:G333,SMALL(IF(G$2:G333<>\"0\",ROW(G$2:G333)-ROW(G$2)+1),ROWS(H$2:H135)))=0,\"\",INDEX(G$2:G333,SMALL(IF(G$2:G333<>\"0\",ROW(G$2:G333)-ROW(G$2)+1),ROWS(H$2:H135))))))","v":""}]
[null,null,null,null,null,{"$f":"IF(DesignTool!$B$40=parametric_table!D136,parametric_table!A136,\"0\")","v":"0"},{"$f":"_xlfn.IFNA(IF(VLOOKUP(F136,ParametricTableRange,MATCH(\"Operating Region Used\",parametric_table!$A$1:$AV$1,0),FALSE)>0,F136,\"0\"),\"0\")","v":"0"},{"$f":"IF(ROWS(H$2:H136)>COUNTIF(G$2:G334,\"<>0\"),\"\",IF(ISERROR(INDEX(G$2:G334,SMALL(IF(G$2:G334<>\"0\",ROW(G$2:G334)-ROW(G$2)+1),ROWS(H$2:H136)))),\"\",IF(INDEX(G$2:G334,SMALL(IF(G$2:G334<>\"0\",ROW(G$2:G334)-ROW(G$2)+1),ROWS(H$2:H136)))=0,\"\",INDEX(G$2:G334,SMALL(IF(G$2:G334<>\"0\",ROW(G$2:G334)-ROW(G$2)+1),ROWS(H$2:H136))))))","v":""}]
[null,null,null,null,null,{"$f":"IF(DesignTool!$B$40=parametric_table!D137,parametric_table!A137,\"0\")","v":"0"},{"$f":"_xlfn.IFNA(IF(VLOOKUP(F137,ParametricTableRange,MATCH(\"Operating Region Used\",parametric_table!$A$1:$AV$1,0),FALSE)>0,F137,\"0\"),\"0\")","v":"0"},{"$f":"IF(ROWS(H$2:H137)>COUNTIF(G$2:G335,\"<>0\"),\"\",IF(ISERROR(INDEX(G$2:G335,SMALL(IF(G$2:G335<>\"0\",ROW(G$2:G335)-ROW(G$2)+1),ROWS(H$2:H137)))),\"\",IF(INDEX(G$2:G335,SMALL(IF(G$2:G335<>\"0\",ROW(G$2:G335)-ROW(G$2)+1),ROWS(H$2:H137)))=0,\"\",INDEX(G$2:G335,SMALL(IF(G$2:G335<>\"0\",ROW(G$2:G335)-ROW(G$2)+1),ROWS(H$2:H137))))))","v":""}]
[null,null,null,null,null,{"$f":"IF(DesignTool!$B$40=parametric_table!D138,parametric_table!A138,\"0\")","v":"0"},{"$f":"_xlfn.IFNA(IF(VLOOKUP(F138,ParametricTableRange,MATCH(\"Operating Region Used\",parametric_table!$A$1:$AV$1,0),FALSE)>0,F138,\"0\"),\"0\")","v":"0"},{"$f":"IF(ROWS(H$2:H138)>COUNTIF(G$2:G336,\"<>0\"),\"\",IF(ISERROR(INDEX(G$2:G336,SMALL(IF(G$2:G336<>\"0\",ROW(G$2:G336)-ROW(G$2)+1),ROWS(H$2:H138)))),\"\",IF(INDEX(G$2:G336,SMALL(IF(G$2:G336<>\"0\",ROW(G$2:G336)-ROW(G$2)+1),ROWS(H$2:H138)))=0,\"\",INDEX(G$2:G336,SMALL(IF(G$2:G336<>\"0\",ROW(G$2:G336)-ROW(G$2)+1),ROWS(H$2:H138))))))","v":""}]
[null,null,null,null,null,{"$f":"IF(DesignTool!$B$40=parametric_table!D139,parametric_table!A139,\"0\")","v":"0"},{"$f":"_xlfn.IFNA(IF(VLOOKUP(F139,ParametricTableRange,MATCH(\"Operating Region Used\",parametric_table!$A$1:$AV$1,0),FALSE)>0,F139,\"0\"),\"0\")","v":"0"},{"$f":"IF(ROWS(H$2:H139)>COUNTIF(G$2:G337,\"<>0\"),\"\",IF(ISERROR(INDEX(G$2:G337,SMALL(IF(G$2:G337<>\"0\",ROW(G$2:G337)-ROW(G$2)+1),ROWS(H$2:H139)))),\"\",IF(INDEX(G$2:G337,SMALL(IF(G$2:G337<>\"0\",ROW(G$2:G337)-ROW(G$2)+1),ROWS(H$2:H139)))=0,\"\",INDEX(G$2:G337,SMALL(IF(G$2:G337<>\"0\",ROW(G$2:G337)-ROW(G$2)+1),ROWS(H$2:H139))))))","v":""}]
[null,null,null,null,null,{"$f":"IF(DesignTool!$B$40=parametric_table!D140,parametric_table!A140,\"0\")","v":"0"},{"$f":"_xlfn.IFNA(IF(VLOOKUP(F140,ParametricTableRange,MATCH(\"Operating Region Used\",parametric_table!$A$1:$AV$1,0),FALSE)>0,F140,\"0\"),\"0\")","v":"0"},{"$f":"IF(ROWS(H$2:H140)>COUNTIF(G$2:G338,\"<>0\"),\"\",IF(ISERROR(INDEX(G$2:G338,SMALL(IF(G$2:G338<>\"0\",ROW(G$2:G338)-ROW(G$2)+1),ROWS(H$2:H140)))),\"\",IF(INDEX(G$2:G338,SMALL(IF(G$2:G338<>\"0\",ROW(G$2:G338)-ROW(G$2)+1),ROWS(H$2:H140)))=0,\"\",INDEX(G$2:G338,SMALL(IF(G$2:G338<>\"0\",ROW(G$2:G338)-ROW(G$2)+1),ROWS(H$2:H140))))))","v":""}]
[null,null,null,null,null,{"$f":"IF(DesignTool!$B$40=parametric_table!D141,parametric_table!A141,\"0\")","v":"0"},{"$f":"_xlfn.IFNA(IF(VLOOKUP(F141,ParametricTableRange,MATCH(\"Operating Region Used\",parametric_table!$A$1:$AV$1,0),FALSE)>0,F141,\"0\"),\"0\")","v":"0"},{"$f":"IF(ROWS(H$2:H141)>COUNTIF(G$2:G339,\"<>0\"),\"\",IF(ISERROR(INDEX(G$2:G339,SMALL(IF(G$2:G339<>\"0\",ROW(G$2:G339)-ROW(G$2)+1),ROWS(H$2:H141)))),\"\",IF(INDEX(G$2:G339,SMALL(IF(G$2:G339<>\"0\",ROW(G$2:G339)-ROW(G$2)+1),ROWS(H$2:H141)))=0,\"\",INDEX(G$2:G339,SMALL(IF(G$2:G339<>\"0\",ROW(G$2:G339)-ROW(G$2)+1),ROWS(H$2:H141))))))","v":""}]
[null,null,null,null,null,{"$f":"IF(DesignTool!$B$40=parametric_table!D142,parametric_table!A142,\"0\")","v":"0"},{"$f":"_xlfn.IFNA(IF(VLOOKUP(F142,ParametricTableRange,MATCH(\"Operating Region Used\",parametric_table!$A$1:$AV$1,0),FALSE)>0,F142,\"0\"),\"0\")","v":"0"},{"$f":"IF(ROWS(H$2:H142)>COUNTIF(G$2:G340,\"<>0\"),\"\",IF(ISERROR(INDEX(G$2:G340,SMALL(IF(G$2:G340<>\"0\",ROW(G$2:G340)-ROW(G$2)+1),ROWS(H$2:H142)))),\"\",IF(INDEX(G$2:G340,SMALL(IF(G$2:G340<>\"0\",ROW(G$2:G340)-ROW(G$2)+1),ROWS(H$2:H142)))=0,\"\",INDEX(G$2:G340,SMALL(IF(G$2:G340<>\"0\",ROW(G$2:G340)-ROW(G$2)+1),ROWS(H$2:H142))))))","v":""}]
[null,null,null,null,null,{"$f":"IF(DesignTool!$B$40=parametric_table!D143,parametric_table!A143,\"0\")","v":"0"},{"$f":"_xlfn.IFNA(IF(VLOOKUP(F143,ParametricTableRange,MATCH(\"Operating Region Used\",parametric_table!$A$1:$AV$1,0),FALSE)>0,F143,\"0\"),\"0\")","v":"0"},{"$f":"IF(ROWS(H$2:H143)>COUNTIF(G$2:G341,\"<>0\"),\"\",IF(ISERROR(INDEX(G$2:G341,SMALL(IF(G$2:G341<>\"0\",ROW(G$2:G341)-ROW(G$2)+1),ROWS(H$2:H143)))),\"\",IF(INDEX(G$2:G341,SMALL(IF(G$2:G341<>\"0\",ROW(G$2:G341)-ROW(G$2)+1),ROWS(H$2:H143)))=0,\"\",INDEX(G$2:G341,SMALL(IF(G$2:G341<>\"0\",ROW(G$2:G341)-ROW(G$2)+1),ROWS(H$2:H143))))))","v":""}]
[null,null,null,null,null,{"$f":"IF(DesignTool!$B$40=parametric_table!D144,parametric_table!A144,\"0\")","v":"0"},{"$f":"_xlfn.IFNA(IF(VLOOKUP(F144,ParametricTableRange,MATCH(\"Operating Region Used\",parametric_table!$A$1:$AV$1,0),FALSE)>0,F144,\"0\"),\"0\")","v":"0"},{"$f":"IF(ROWS(H$2:H144)>COUNTIF(G$2:G342,\"<>0\"),\"\",IF(ISERROR(INDEX(G$2:G342,SMALL(IF(G$2:G342<>\"0\",ROW(G$2:G342)-ROW(G$2)+1),ROWS(H$2:H144)))),\"\",IF(INDEX(G$2:G342,SMALL(IF(G$2:G342<>\"0\",ROW(G$2:G342)-ROW(G$2)+1),ROWS(H$2:H144)))=0,\"\",INDEX(G$2:G342,SMALL(IF(G$2:G342<>\"0\",ROW(G$2:G342)-ROW(G$2)+1),ROWS(H$2:H144))))))","v":""}]
[null,null,null,null,null,{"$f":"IF(DesignTool!$B$40=parametric_table!D145,parametric_table!A145,\"0\")","v":"0"},{"$f":"_xlfn.IFNA(IF(VLOOKUP(F145,ParametricTableRange,MATCH(\"Operating Region Used\",parametric_table!$A$1:$AV$1,0),FALSE)>0,F145,\"0\"),\"0\")","v":"0"},{"$f":"IF(ROWS(H$2:H145)>COUNTIF(G$2:G343,\"<>0\"),\"\",IF(ISERROR(INDEX(G$2:G343,SMALL(IF(G$2:G343<>\"0\",ROW(G$2:G343)-ROW(G$2)+1),ROWS(H$2:H145)))),\"\",IF(INDEX(G$2:G343,SMALL(IF(G$2:G343<>\"0\",ROW(G$2:G343)-ROW(G$2)+1),ROWS(H$2:H145)))=0,\"\",INDEX(G$2:G343,SMALL(IF(G$2:G343<>\"0\",ROW(G$2:G343)-ROW(G$2)+1),ROWS(H$2:H145))))))","v":""}]
[null,null,null,null,null,{"$f":"IF(DesignTool!$B$40=parametric_table!D146,parametric_table!A146,\"0\")","v":"0"},{"$f":"_xlfn.IFNA(IF(VLOOKUP(F146,ParametricTableRange,MATCH(\"Operating Region Used\",parametric_table!$A$1:$AV$1,0),FALSE)>0,F146,\"0\"),\"0\")","v":"0"},{"$f":"IF(ROWS(H$2:H146)>COUNTIF(G$2:G344,\"<>0\"),\"\",IF(ISERROR(INDEX(G$2:G344,SMALL(IF(G$2:G344<>\"0\",ROW(G$2:G344)-ROW(G$2)+1),ROWS(H$2:H146)))),\"\",IF(INDEX(G$2:G344,SMALL(IF(G$2:G344<>\"0\",ROW(G$2:G344)-ROW(G$2)+1),ROWS(H$2:H146)))=0,\"\",INDEX(G$2:G344,SMALL(IF(G$2:G344<>\"0\",ROW(G$2:G344)-ROW(G$2)+1),ROWS(H$2:H146))))))","v":""}]
[null,null,null,null,null,{"$f":"IF(DesignTool!$B$40=parametric_table!D147,parametric_table!A147,\"0\")","v":"0"},{"$f":"_xlfn.IFNA(IF(VLOOKUP(F147,ParametricTableRange,MATCH(\"Operating Region Used\",parametric_table!$A$1:$AV$1,0),FALSE)>0,F147,\"0\"),\"0\")","v":"0"},{"$f":"IF(ROWS(H$2:H147)>COUNTIF(G$2:G345,\"<>0\"),\"\",IF(ISERROR(INDEX(G$2:G345,SMALL(IF(G$2:G345<>\"0\",ROW(G$2:G345)-ROW(G$2)+1),ROWS(H$2:H147)))),\"\",IF(INDEX(G$2:G345,SMALL(IF(G$2:G345<>\"0\",ROW(G$2:G345)-ROW(G$2)+1),ROWS(H$2:H147)))=0,\"\",INDEX(G$2:G345,SMALL(IF(G$2:G345<>\"0\",ROW(G$2:G345)-ROW(G$2)+1),ROWS(H$2:H147))))))","v":""}]
[null,null,null,null,null,{"$f":"IF(DesignTool!$B$40=parametric_table!D148,parametric_table!A148,\"0\")","v":"0"},{"$f":"_xlfn.IFNA(IF(VLOOKUP(F148,ParametricTableRange,MATCH(\"Operating Region Used\",parametric_table!$A$1:$AV$1,0),FALSE)>0,F148,\"0\"),\"0\")","v":"0"},{"$f":"IF(ROWS(H$2:H148)>COUNTIF(G$2:G346,\"<>0\"),\"\",IF(ISERROR(INDEX(G$2:G346,SMALL(IF(G$2:G346<>\"0\",ROW(G$2:G346)-ROW(G$2)+1),ROWS(H$2:H148)))),\"\",IF(INDEX(G$2:G346,SMALL(IF(G$2:G346<>\"0\",ROW(G$2:G346)-ROW(G$2)+1),ROWS(H$2:H148)))=0,\"\",INDEX(G$2:G346,SMALL(IF(G$2:G346<>\"0\",ROW(G$2:G346)-ROW(G$2)+1),ROWS(H$2:H148))))))","v":""}]
[null,null,null,null,null,{"$f":"IF(DesignTool!$B$40=parametric_table!D149,parametric_table!A149,\"0\")","v":"0"},{"$f":"_xlfn.IFNA(IF(VLOOKUP(F149,ParametricTableRange,MATCH(\"Operating Region Used\",parametric_table!$A$1:$AV$1,0),FALSE)>0,F149,\"0\"),\"0\")","v":"0"},{"$f":"IF(ROWS(H$2:H149)>COUNTIF(G$2:G347,\"<>0\"),\"\",IF(ISERROR(INDEX(G$2:G347,SMALL(IF(G$2:G347<>\"0\",ROW(G$2:G347)-ROW(G$2)+1),ROWS(H$2:H149)))),\"\",IF(INDEX(G$2:G347,SMALL(IF(G$2:G347<>\"0\",ROW(G$2:G347)-ROW(G$2)+1),ROWS(H$2:H149)))=0,\"\",INDEX(G$2:G347,SMALL(IF(G$2:G347<>\"0\",ROW(G$2:G347)-ROW(G$2)+1),ROWS(H$2:H149))))))","v":""}]
[null,null,null,null,null,{"$f":"IF(DesignTool!$B$40=parametric_table!D150,parametric_table!A150,\"0\")","v":"0"},{"$f":"_xlfn.IFNA(IF(VLOOKUP(F150,ParametricTableRange,MATCH(\"Operating Region Used\",parametric_table!$A$1:$AV$1,0),FALSE)>0,F150,\"0\"),\"0\")","v":"0"},{"$f":"IF(ROWS(H$2:H150)>COUNTIF(G$2:G348,\"<>0\"),\"\",IF(ISERROR(INDEX(G$2:G348,SMALL(IF(G$2:G348<>\"0\",ROW(G$2:G348)-ROW(G$2)+1),ROWS(H$2:H150)))),\"\",IF(INDEX(G$2:G348,SMALL(IF(G$2:G348<>\"0\",ROW(G$2:G348)-ROW(G$2)+1),ROWS(H$2:H150)))=0,\"\",INDEX(G$2:G348,SMALL(IF(G$2:G348<>\"0\",ROW(G$2:G348)-ROW(G$2)+1),ROWS(H$2:H150))))))","v":""}]
[null,null,null,null,null,{"$f":"IF(DesignTool!$B$40=parametric_table!D151,parametric_table!A151,\"0\")","v":"0"},{"$f":"_xlfn.IFNA(IF(VLOOKUP(F151,ParametricTableRange,MATCH(\"Operating Region Used\",parametric_table!$A$1:$AV$1,0),FALSE)>0,F151,\"0\"),\"0\")","v":"0"},{"$f":"IF(ROWS(H$2:H151)>COUNTIF(G$2:G349,\"<>0\"),\"\",IF(ISERROR(INDEX(G$2:G349,SMALL(IF(G$2:G349<>\"0\",ROW(G$2:G349)-ROW(G$2)+1),ROWS(H$2:H151)))),\"\",IF(INDEX(G$2:G349,SMALL(IF(G$2:G349<>\"0\",ROW(G$2:G349)-ROW(G$2)+1),ROWS(H$2:H151)))=0,\"\",INDEX(G$2:G349,SMALL(IF(G$2:G349<>\"0\",ROW(G$2:G349)-ROW(G$2)+1),ROWS(H$2:H151))))))","v":""}]
[null,null,null,null,null,{"$f":"IF(DesignTool!$B$40=parametric_table!D152,parametric_table!A152,\"0\")","v":"0"},{"$f":"_xlfn.IFNA(IF(VLOOKUP(F152,ParametricTableRange,MATCH(\"Operating Region Used\",parametric_table!$A$1:$AV$1,0),FALSE)>0,F152,\"0\"),\"0\")","v":"0"},{"$f":"IF(ROWS(H$2:H152)>COUNTIF(G$2:G350,\"<>0\"),\"\",IF(ISERROR(INDEX(G$2:G350,SMALL(IF(G$2:G350<>\"0\",ROW(G$2:G350)-ROW(G$2)+1),ROWS(H$2:H152)))),\"\",IF(INDEX(G$2:G350,SMALL(IF(G$2:G350<>\"0\",ROW(G$2:G350)-ROW(G$2)+1),ROWS(H$2:H152)))=0,\"\",INDEX(G$2:G350,SMALL(IF(G$2:G350<>\"0\",ROW(G$2:G350)-ROW(G$2)+1),ROWS(H$2:H152))))))","v":""}]
[null,null,null,null,null,{"$f":"IF(DesignTool!$B$40=parametric_table!D153,parametric_table!A153,\"0\")","v":"0"},{"$f":"_xlfn.IFNA(IF(VLOOKUP(F153,ParametricTableRange,MATCH(\"Operating Region Used\",parametric_table!$A$1:$AV$1,0),FALSE)>0,F153,\"0\"),\"0\")","v":"0"},{"$f":"IF(ROWS(H$2:H153)>COUNTIF(G$2:G351,\"<>0\"),\"\",IF(ISERROR(INDEX(G$2:G351,SMALL(IF(G$2:G351<>\"0\",ROW(G$2:G351)-ROW(G$2)+1),ROWS(H$2:H153)))),\"\",IF(INDEX(G$2:G351,SMALL(IF(G$2:G351<>\"0\",ROW(G$2:G351)-ROW(G$2)+1),ROWS(H$2:H153)))=0,\"\",INDEX(G$2:G351,SMALL(IF(G$2:G351<>\"0\",ROW(G$2:G351)-ROW(G$2)+1),ROWS(H$2:H153))))))","v":""}]
[null,null,null,null,null,{"$f":"IF(DesignTool!$B$40=parametric_table!D154,parametric_table!A154,\"0\")","v":"0"},{"$f":"_xlfn.IFNA(IF(VLOOKUP(F154,ParametricTableRange,MATCH(\"Operating Region Used\",parametric_table!$A$1:$AV$1,0),FALSE)>0,F154,\"0\"),\"0\")","v":"0"},{"$f":"IF(ROWS(H$2:H154)>COUNTIF(G$2:G352,\"<>0\"),\"\",IF(ISERROR(INDEX(G$2:G352,SMALL(IF(G$2:G352<>\"0\",ROW(G$2:G352)-ROW(G$2)+1),ROWS(H$2:H154)))),\"\",IF(INDEX(G$2:G352,SMALL(IF(G$2:G352<>\"0\",ROW(G$2:G352)-ROW(G$2)+1),ROWS(H$2:H154)))=0,\"\",INDEX(G$2:G352,SMALL(IF(G$2:G352<>\"0\",ROW(G$2:G352)-ROW(G$2)+1),ROWS(H$2:H154))))))","v":""}]
[null,null,null,null,null,{"$f":"IF(DesignTool!$B$40=parametric_table!D155,parametric_table!A155,\"0\")","v":"0"},{"$f":"_xlfn.IFNA(IF(VLOOKUP(F155,ParametricTableRange,MATCH(\"Operating Region Used\",parametric_table!$A$1:$AV$1,0),FALSE)>0,F155,\"0\"),\"0\")","v":"0"},{"$f":"IF(ROWS(H$2:H155)>COUNTIF(G$2:G353,\"<>0\"),\"\",IF(ISERROR(INDEX(G$2:G353,SMALL(IF(G$2:G353<>\"0\",ROW(G$2:G353)-ROW(G$2)+1),ROWS(H$2:H155)))),\"\",IF(INDEX(G$2:G353,SMALL(IF(G$2:G353<>\"0\",ROW(G$2:G353)-ROW(G$2)+1),ROWS(H$2:H155)))=0,\"\",INDEX(G$2:G353,SMALL(IF(G$2:G353<>\"0\",ROW(G$2:G353)-ROW(G$2)+1),ROWS(H$2:H155))))))","v":""}]
[null,null,null,null,null,{"$f":"IF(DesignTool!$B$40=parametric_table!D156,parametric_table!A156,\"0\")","v":"0"},{"$f":"_xlfn.IFNA(IF(VLOOKUP(F156,ParametricTableRange,MATCH(\"Operating Region Used\",parametric_table!$A$1:$AV$1,0),FALSE)>0,F156,\"0\"),\"0\")","v":"0"},{"$f":"IF(ROWS(H$2:H156)>COUNTIF(G$2:G354,\"<>0\"),\"\",IF(ISERROR(INDEX(G$2:G354,SMALL(IF(G$2:G354<>\"0\",ROW(G$2:G354)-ROW(G$2)+1),ROWS(H$2:H156)))),\"\",IF(INDEX(G$2:G354,SMALL(IF(G$2:G354<>\"0\",ROW(G$2:G354)-ROW(G$2)+1),ROWS(H$2:H156)))=0,\"\",INDEX(G$2:G354,SMALL(IF(G$2:G354<>\"0\",ROW(G$2:G354)-ROW(G$2)+1),ROWS(H$2:H156))))))","v":""}]
[null,null,null,null,null,{"$f":"IF(DesignTool!$B$40=parametric_table!D157,parametric_table!A157,\"0\")","v":"0"},{"$f":"_xlfn.IFNA(IF(VLOOKUP(F157,ParametricTableRange,MATCH(\"Operating Region Used\",parametric_table!$A$1:$AV$1,0),FALSE)>0,F157,\"0\"),\"0\")","v":"0"},{"$f":"IF(ROWS(H$2:H157)>COUNTIF(G$2:G355,\"<>0\"),\"\",IF(ISERROR(INDEX(G$2:G355,SMALL(IF(G$2:G355<>\"0\",ROW(G$2:G355)-ROW(G$2)+1),ROWS(H$2:H157)))),\"\",IF(INDEX(G$2:G355,SMALL(IF(G$2:G355<>\"0\",ROW(G$2:G355)-ROW(G$2)+1),ROWS(H$2:H157)))=0,\"\",INDEX(G$2:G355,SMALL(IF(G$2:G355<>\"0\",ROW(G$2:G355)-ROW(G$2)+1),ROWS(H$2:H157))))))","v":""}]
[null,null,null,null,null,{"$f":"IF(DesignTool!$B$40=parametric_table!D158,parametric_table!A158,\"0\")","v":"0"},{"$f":"_xlfn.IFNA(IF(VLOOKUP(F158,ParametricTableRange,MATCH(\"Operating Region Used\",parametric_table!$A$1:$AV$1,0),FALSE)>0,F158,\"0\"),\"0\")","v":"0"},{"$f":"IF(ROWS(H$2:H158)>COUNTIF(G$2:G356,\"<>0\"),\"\",IF(ISERROR(INDEX(G$2:G356,SMALL(IF(G$2:G356<>\"0\",ROW(G$2:G356)-ROW(G$2)+1),ROWS(H$2:H158)))),\"\",IF(INDEX(G$2:G356,SMALL(IF(G$2:G356<>\"0\",ROW(G$2:G356)-ROW(G$2)+1),ROWS(H$2:H158)))=0,\"\",INDEX(G$2:G356,SMALL(IF(G$2:G356<>\"0\",ROW(G$2:G356)-ROW(G$2)+1),ROWS(H$2:H158))))))","v":""}]
[null,null,null,null,null,{"$f":"IF(DesignTool!$B$40=parametric_table!D159,parametric_table!A159,\"0\")","v":"0"},{"$f":"_xlfn.IFNA(IF(VLOOKUP(F159,ParametricTableRange,MATCH(\"Operating Region Used\",parametric_table!$A$1:$AV$1,0),FALSE)>0,F159,\"0\"),\"0\")","v":"0"},{"$f":"IF(ROWS(H$2:H159)>COUNTIF(G$2:G357,\"<>0\"),\"\",IF(ISERROR(INDEX(G$2:G357,SMALL(IF(G$2:G357<>\"0\",ROW(G$2:G357)-ROW(G$2)+1),ROWS(H$2:H159)))),\"\",IF(INDEX(G$2:G357,SMALL(IF(G$2:G357<>\"0\",ROW(G$2:G357)-ROW(G$2)+1),ROWS(H$2:H159)))=0,\"\",INDEX(G$2:G357,SMALL(IF(G$2:G357<>\"0\",ROW(G$2:G357)-ROW(G$2)+1),ROWS(H$2:H159))))))","v":""}]
[null,null,null,null,null,{"$f":"IF(DesignTool!$B$40=parametric_table!D160,parametric_table!A160,\"0\")","v":"0"},{"$f":"_xlfn.IFNA(IF(VLOOKUP(F160,ParametricTableRange,MATCH(\"Operating Region Used\",parametric_table!$A$1:$AV$1,0),FALSE)>0,F160,\"0\"),\"0\")","v":"0"},{"$f":"IF(ROWS(H$2:H160)>COUNTIF(G$2:G358,\"<>0\"),\"\",IF(ISERROR(INDEX(G$2:G358,SMALL(IF(G$2:G358<>\"0\",ROW(G$2:G358)-ROW(G$2)+1),ROWS(H$2:H160)))),\"\",IF(INDEX(G$2:G358,SMALL(IF(G$2:G358<>\"0\",ROW(G$2:G358)-ROW(G$2)+1),ROWS(H$2:H160)))=0,\"\",INDEX(G$2:G358,SMALL(IF(G$2:G358<>\"0\",ROW(G$2:G358)-ROW(G$2)+1),ROWS(H$2:H160))))))","v":""}]
[null,null,null,null,null,{"$f":"IF(DesignTool!$B$40=parametric_table!D161,parametric_table!A161,\"0\")","v":"0"},{"$f":"_xlfn.IFNA(IF(VLOOKUP(F161,ParametricTableRange,MATCH(\"Operating Region Used\",parametric_table!$A$1:$AV$1,0),FALSE)>0,F161,\"0\"),\"0\")","v":"0"},{"$f":"IF(ROWS(H$2:H161)>COUNTIF(G$2:G359,\"<>0\"),\"\",IF(ISERROR(INDEX(G$2:G359,SMALL(IF(G$2:G359<>\"0\",ROW(G$2:G359)-ROW(G$2)+1),ROWS(H$2:H161)))),\"\",IF(INDEX(G$2:G359,SMALL(IF(G$2:G359<>\"0\",ROW(G$2:G359)-ROW(G$2)+1),ROWS(H$2:H161)))=0,\"\",INDEX(G$2:G359,SMALL(IF(G$2:G359<>\"0\",ROW(G$2:G359)-ROW(G$2)+1),ROWS(H$2:H161))))))","v":""}]
[null,null,null,null,null,{"$f":"IF(DesignTool!$B$40=parametric_table!D162,parametric_table!A162,\"0\")","v":"0"},{"$f":"_xlfn.IFNA(IF(VLOOKUP(F162,ParametricTableRange,MATCH(\"Operating Region Used\",parametric_table!$A$1:$AV$1,0),FALSE)>0,F162,\"0\"),\"0\")","v":"0"},{"$f":"IF(ROWS(H$2:H162)>COUNTIF(G$2:G360,\"<>0\"),\"\",IF(ISERROR(INDEX(G$2:G360,SMALL(IF(G$2:G360<>\"0\",ROW(G$2:G360)-ROW(G$2)+1),ROWS(H$2:H162)))),\"\",IF(INDEX(G$2:G360,SMALL(IF(G$2:G360<>\"0\",ROW(G$2:G360)-ROW(G$2)+1),ROWS(H$2:H162)))=0,\"\",INDEX(G$2:G360,SMALL(IF(G$2:G360<>\"0\",ROW(G$2:G360)-ROW(G$2)+1),ROWS(H$2:H162))))))","v":""}]
[null,null,null,null,null,{"$f":"IF(DesignTool!$B$40=parametric_table!D163,parametric_table!A163,\"0\")","v":"0"},{"$f":"_xlfn.IFNA(IF(VLOOKUP(F163,ParametricTableRange,MATCH(\"Operating Region Used\",parametric_table!$A$1:$AV$1,0),FALSE)>0,F163,\"0\"),\"0\")","v":"0"},{"$f":"IF(ROWS(H$2:H163)>COUNTIF(G$2:G361,\"<>0\"),\"\",IF(ISERROR(INDEX(G$2:G361,SMALL(IF(G$2:G361<>\"0\",ROW(G$2:G361)-ROW(G$2)+1),ROWS(H$2:H163)))),\"\",IF(INDEX(G$2:G361,SMALL(IF(G$2:G361<>\"0\",ROW(G$2:G361)-ROW(G$2)+1),ROWS(H$2:H163)))=0,\"\",INDEX(G$2:G361,SMALL(IF(G$2:G361<>\"0\",ROW(G$2:G361)-ROW(G$2)+1),ROWS(H$2:H163))))))","v":""}]
[null,null,null,null,null,{"$f":"IF(DesignTool!$B$40=parametric_table!D164,parametric_table!A164,\"0\")","v":"0"},{"$f":"_xlfn.IFNA(IF(VLOOKUP(F164,ParametricTableRange,MATCH(\"Operating Region Used\",parametric_table!$A$1:$AV$1,0),FALSE)>0,F164,\"0\"),\"0\")","v":"0"},{"$f":"IF(ROWS(H$2:H164)>COUNTIF(G$2:G362,\"<>0\"),\"\",IF(ISERROR(INDEX(G$2:G362,SMALL(IF(G$2:G362<>\"0\",ROW(G$2:G362)-ROW(G$2)+1),ROWS(H$2:H164)))),\"\",IF(INDEX(G$2:G362,SMALL(IF(G$2:G362<>\"0\",ROW(G$2:G362)-ROW(G$2)+1),ROWS(H$2:H164)))=0,\"\",INDEX(G$2:G362,SMALL(IF(G$2:G362<>\"0\",ROW(G$2:G362)-ROW(G$2)+1),ROWS(H$2:H164))))))","v":""}]
[null,null,null,null,null,{"$f":"IF(DesignTool!$B$40=parametric_table!D165,parametric_table!A165,\"0\")","v":"0"},{"$f":"_xlfn.IFNA(IF(VLOOKUP(F165,ParametricTableRange,MATCH(\"Operating Region Used\",parametric_table!$A$1:$AV$1,0),FALSE)>0,F165,\"0\"),\"0\")","v":"0"},{"$f":"IF(ROWS(H$2:H165)>COUNTIF(G$2:G363,\"<>0\"),\"\",IF(ISERROR(INDEX(G$2:G363,SMALL(IF(G$2:G363<>\"0\",ROW(G$2:G363)-ROW(G$2)+1),ROWS(H$2:H165)))),\"\",IF(INDEX(G$2:G363,SMALL(IF(G$2:G363<>\"0\",ROW(G$2:G363)-ROW(G$2)+1),ROWS(H$2:H165)))=0,\"\",INDEX(G$2:G363,SMALL(IF(G$2:G363<>\"0\",ROW(G$2:G363)-ROW(G$2)+1),ROWS(H$2:H165))))))","v":""}]
[null,null,null,null,null,{"$f":"IF(DesignTool!$B$40=parametric_table!D166,parametric_table!A166,\"0\")","v":"0"},{"$f":"_xlfn.IFNA(IF(VLOOKUP(F166,ParametricTableRange,MATCH(\"Operating Region Used\",parametric_table!$A$1:$AV$1,0),FALSE)>0,F166,\"0\"),\"0\")","v":"0"},{"$f":"IF(ROWS(H$2:H166)>COUNTIF(G$2:G364,\"<>0\"),\"\",IF(ISERROR(INDEX(G$2:G364,SMALL(IF(G$2:G364<>\"0\",ROW(G$2:G364)-ROW(G$2)+1),ROWS(H$2:H166)))),\"\",IF(INDEX(G$2:G364,SMALL(IF(G$2:G364<>\"0\",ROW(G$2:G364)-ROW(G$2)+1),ROWS(H$2:H166)))=0,\"\",INDEX(G$2:G364,SMALL(IF(G$2:G364<>\"0\",ROW(G$2:G364)-ROW(G$2)+1),ROWS(H$2:H166))))))","v":""}]
[null,null,null,null,null,{"$f":"IF(DesignTool!$B$40=parametric_table!D167,parametric_table!A167,\"0\")","v":"0"},{"$f":"_xlfn.IFNA(IF(VLOOKUP(F167,ParametricTableRange,MATCH(\"Operating Region Used\",parametric_table!$A$1:$AV$1,0),FALSE)>0,F167,\"0\"),\"0\")","v":"0"},{"$f":"IF(ROWS(H$2:H167)>COUNTIF(G$2:G365,\"<>0\"),\"\",IF(ISERROR(INDEX(G$2:G365,SMALL(IF(G$2:G365<>\"0\",ROW(G$2:G365)-ROW(G$2)+1),ROWS(H$2:H167)))),\"\",IF(INDEX(G$2:G365,SMALL(IF(G$2:G365<>\"0\",ROW(G$2:G365)-ROW(G$2)+1),ROWS(H$2:H167)))=0,\"\",INDEX(G$2:G365,SMALL(IF(G$2:G365<>\"0\",ROW(G$2:G365)-ROW(G$2)+1),ROWS(H$2:H167))))))","v":""}]
[null,null,null,null,null,{"$f":"IF(DesignTool!$B$40=parametric_table!D168,parametric_table!A168,\"0\")","v":"0"},{"$f":"_xlfn.IFNA(IF(VLOOKUP(F168,ParametricTableRange,MATCH(\"Operating Region Used\",parametric_table!$A$1:$AV$1,0),FALSE)>0,F168,\"0\"),\"0\")","v":"0"},{"$f":"IF(ROWS(H$2:H168)>COUNTIF(G$2:G366,\"<>0\"),\"\",IF(ISERROR(INDEX(G$2:G366,SMALL(IF(G$2:G366<>\"0\",ROW(G$2:G366)-ROW(G$2)+1),ROWS(H$2:H168)))),\"\",IF(INDEX(G$2:G366,SMALL(IF(G$2:G366<>\"0\",ROW(G$2:G366)-ROW(G$2)+1),ROWS(H$2:H168)))=0,\"\",INDEX(G$2:G366,SMALL(IF(G$2:G366<>\"0\",ROW(G$2:G366)-ROW(G$2)+1),ROWS(H$2:H168))))))","v":""}]
[null,null,null,null,null,{"$f":"IF(DesignTool!$B$40=parametric_table!D169,parametric_table!A169,\"0\")","v":"0"},{"$f":"_xlfn.IFNA(IF(VLOOKUP(F169,ParametricTableRange,MATCH(\"Operating Region Used\",parametric_table!$A$1:$AV$1,0),FALSE)>0,F169,\"0\"),\"0\")","v":"0"},{"$f":"IF(ROWS(H$2:H169)>COUNTIF(G$2:G367,\"<>0\"),\"\",IF(ISERROR(INDEX(G$2:G367,SMALL(IF(G$2:G367<>\"0\",ROW(G$2:G367)-ROW(G$2)+1),ROWS(H$2:H169)))),\"\",IF(INDEX(G$2:G367,SMALL(IF(G$2:G367<>\"0\",ROW(G$2:G367)-ROW(G$2)+1),ROWS(H$2:H169)))=0,\"\",INDEX(G$2:G367,SMALL(IF(G$2:G367<>\"0\",ROW(G$2:G367)-ROW(G$2)+1),ROWS(H$2:H169))))))","v":""}]
[null,null,null,null,null,{"$f":"IF(DesignTool!$B$40=parametric_table!D170,parametric_table!A170,\"0\")","v":"0"},{"$f":"_xlfn.IFNA(IF(VLOOKUP(F170,ParametricTableRange,MATCH(\"Operating Region Used\",parametric_table!$A$1:$AV$1,0),FALSE)>0,F170,\"0\"),\"0\")","v":"0"},{"$f":"IF(ROWS(H$2:H170)>COUNTIF(G$2:G368,\"<>0\"),\"\",IF(ISERROR(INDEX(G$2:G368,SMALL(IF(G$2:G368<>\"0\",ROW(G$2:G368)-ROW(G$2)+1),ROWS(H$2:H170)))),\"\",IF(INDEX(G$2:G368,SMALL(IF(G$2:G368<>\"0\",ROW(G$2:G368)-ROW(G$2)+1),ROWS(H$2:H170)))=0,\"\",INDEX(G$2:G368,SMALL(IF(G$2:G368<>\"0\",ROW(G$2:G368)-ROW(G$2)+1),ROWS(H$2:H170))))))","v":""}]
[null,null,null,null,null,{"$f":"IF(DesignTool!$B$40=parametric_table!D171,parametric_table!A171,\"0\")","v":"0"},{"$f":"_xlfn.IFNA(IF(VLOOKUP(F171,ParametricTableRange,MATCH(\"Operating Region Used\",parametric_table!$A$1:$AV$1,0),FALSE)>0,F171,\"0\"),\"0\")","v":"0"},{"$f":"IF(ROWS(H$2:H171)>COUNTIF(G$2:G369,\"<>0\"),\"\",IF(ISERROR(INDEX(G$2:G369,SMALL(IF(G$2:G369<>\"0\",ROW(G$2:G369)-ROW(G$2)+1),ROWS(H$2:H171)))),\"\",IF(INDEX(G$2:G369,SMALL(IF(G$2:G369<>\"0\",ROW(G$2:G369)-ROW(G$2)+1),ROWS(H$2:H171)))=0,\"\",INDEX(G$2:G369,SMALL(IF(G$2:G369<>\"0\",ROW(G$2:G369)-ROW(G$2)+1),ROWS(H$2:H171))))))","v":""}]
[null,null,null,null,null,{"$f":"IF(DesignTool!$B$40=parametric_table!D172,parametric_table!A172,\"0\")","v":"0"},{"$f":"_xlfn.IFNA(IF(VLOOKUP(F172,ParametricTableRange,MATCH(\"Operating Region Used\",parametric_table!$A$1:$AV$1,0),FALSE)>0,F172,\"0\"),\"0\")","v":"0"},{"$f":"IF(ROWS(H$2:H172)>COUNTIF(G$2:G370,\"<>0\"),\"\",IF(ISERROR(INDEX(G$2:G370,SMALL(IF(G$2:G370<>\"0\",ROW(G$2:G370)-ROW(G$2)+1),ROWS(H$2:H172)))),\"\",IF(INDEX(G$2:G370,SMALL(IF(G$2:G370<>\"0\",ROW(G$2:G370)-ROW(G$2)+1),ROWS(H$2:H172)))=0,\"\",INDEX(G$2:G370,SMALL(IF(G$2:G370<>\"0\",ROW(G$2:G370)-ROW(G$2)+1),ROWS(H$2:H172))))))","v":""}]
[null,null,null,null,null,{"$f":"IF(DesignTool!$B$40=parametric_table!D173,parametric_table!A173,\"0\")","v":"0"},{"$f":"_xlfn.IFNA(IF(VLOOKUP(F173,ParametricTableRange,MATCH(\"Operating Region Used\",parametric_table!$A$1:$AV$1,0),FALSE)>0,F173,\"0\"),\"0\")","v":"0"},{"$f":"IF(ROWS(H$2:H173)>COUNTIF(G$2:G371,\"<>0\"),\"\",IF(ISERROR(INDEX(G$2:G371,SMALL(IF(G$2:G371<>\"0\",ROW(G$2:G371)-ROW(G$2)+1),ROWS(H$2:H173)))),\"\",IF(INDEX(G$2:G371,SMALL(IF(G$2:G371<>\"0\",ROW(G$2:G371)-ROW(G$2)+1),ROWS(H$2:H173)))=0,\"\",INDEX(G$2:G371,SMALL(IF(G$2:G371<>\"0\",ROW(G$2:G371)-ROW(G$2)+1),ROWS(H$2:H173))))))","v":""}]
[null,null,null,null,null,{"$f":"IF(DesignTool!$B$40=parametric_table!D174,parametric_table!A174,\"0\")","v":"0"},{"$f":"_xlfn.IFNA(IF(VLOOKUP(F174,ParametricTableRange,MATCH(\"Operating Region Used\",parametric_table!$A$1:$AV$1,0),FALSE)>0,F174,\"0\"),\"0\")","v":"0"},{"$f":"IF(ROWS(H$2:H174)>COUNTIF(G$2:G372,\"<>0\"),\"\",IF(ISERROR(INDEX(G$2:G372,SMALL(IF(G$2:G372<>\"0\",ROW(G$2:G372)-ROW(G$2)+1),ROWS(H$2:H174)))),\"\",IF(INDEX(G$2:G372,SMALL(IF(G$2:G372<>\"0\",ROW(G$2:G372)-ROW(G$2)+1),ROWS(H$2:H174)))=0,\"\",INDEX(G$2:G372,SMALL(IF(G$2:G372<>\"0\",ROW(G$2:G372)-ROW(G$2)+1),ROWS(H$2:H174))))))","v":""}]
[null,null,null,null,null,{"$f":"IF(DesignTool!$B$40=parametric_table!D175,parametric_table!A175,\"0\")","v":"0"},{"$f":"_xlfn.IFNA(IF(VLOOKUP(F175,ParametricTableRange,MATCH(\"Operating Region Used\",parametric_table!$A$1:$AV$1,0),FALSE)>0,F175,\"0\"),\"0\")","v":"0"},{"$f":"IF(ROWS(H$2:H175)>COUNTIF(G$2:G373,\"<>0\"),\"\",IF(ISERROR(INDEX(G$2:G373,SMALL(IF(G$2:G373<>\"0\",ROW(G$2:G373)-ROW(G$2)+1),ROWS(H$2:H175)))),\"\",IF(INDEX(G$2:G373,SMALL(IF(G$2:G373<>\"0\",ROW(G$2:G373)-ROW(G$2)+1),ROWS(H$2:H175)))=0,\"\",INDEX(G$2:G373,SMALL(IF(G$2:G373<>\"0\",ROW(G$2:G373)-ROW(G$2)+1),ROWS(H$2:H175))))))","v":""}]
[null,null,null,null,null,{"$f":"IF(DesignTool!$B$40=parametric_table!D176,parametric_table!A176,\"0\")","v":"0"},{"$f":"_xlfn.IFNA(IF(VLOOKUP(F176,ParametricTableRange,MATCH(\"Operating Region Used\",parametric_table!$A$1:$AV$1,0),FALSE)>0,F176,\"0\"),\"0\")","v":"0"},{"$f":"IF(ROWS(H$2:H176)>COUNTIF(G$2:G374,\"<>0\"),\"\",IF(ISERROR(INDEX(G$2:G374,SMALL(IF(G$2:G374<>\"0\",ROW(G$2:G374)-ROW(G$2)+1),ROWS(H$2:H176)))),\"\",IF(INDEX(G$2:G374,SMALL(IF(G$2:G374<>\"0\",ROW(G$2:G374)-ROW(G$2)+1),ROWS(H$2:H176)))=0,\"\",INDEX(G$2:G374,SMALL(IF(G$2:G374<>\"0\",ROW(G$2:G374)-ROW(G$2)+1),ROWS(H$2:H176))))))","v":""}]
[null,null,null,null,null,{"$f":"IF(DesignTool!$B$40=parametric_table!D177,parametric_table!A177,\"0\")","v":"0"},{"$f":"_xlfn.IFNA(IF(VLOOKUP(F177,ParametricTableRange,MATCH(\"Operating Region Used\",parametric_table!$A$1:$AV$1,0),FALSE)>0,F177,\"0\"),\"0\")","v":"0"},{"$f":"IF(ROWS(H$2:H177)>COUNTIF(G$2:G375,\"<>0\"),\"\",IF(ISERROR(INDEX(G$2:G375,SMALL(IF(G$2:G375<>\"0\",ROW(G$2:G375)-ROW(G$2)+1),ROWS(H$2:H177)))),\"\",IF(INDEX(G$2:G375,SMALL(IF(G$2:G375<>\"0\",ROW(G$2:G375)-ROW(G$2)+1),ROWS(H$2:H177)))=0,\"\",INDEX(G$2:G375,SMALL(IF(G$2:G375<>\"0\",ROW(G$2:G375)-ROW(G$2)+1),ROWS(H$2:H177))))))","v":""}]
[null,null,null,null,null,{"$f":"IF(DesignTool!$B$40=parametric_table!D178,parametric_table!A178,\"0\")","v":"0"},{"$f":"_xlfn.IFNA(IF(VLOOKUP(F178,ParametricTableRange,MATCH(\"Operating Region Used\",parametric_table!$A$1:$AV$1,0),FALSE)>0,F178,\"0\"),\"0\")","v":"0"},{"$f":"IF(ROWS(H$2:H178)>COUNTIF(G$2:G376,\"<>0\"),\"\",IF(ISERROR(INDEX(G$2:G376,SMALL(IF(G$2:G376<>\"0\",ROW(G$2:G376)-ROW(G$2)+1),ROWS(H$2:H178)))),\"\",IF(INDEX(G$2:G376,SMALL(IF(G$2:G376<>\"0\",ROW(G$2:G376)-ROW(G$2)+1),ROWS(H$2:H178)))=0,\"\",INDEX(G$2:G376,SMALL(IF(G$2:G376<>\"0\",ROW(G$2:G376)-ROW(G$2)+1),ROWS(H$2:H178))))))","v":""}]
[null,null,null,null,null,{"$f":"IF(DesignTool!$B$40=parametric_table!D179,parametric_table!A179,\"0\")","v":"0"},{"$f":"_xlfn.IFNA(IF(VLOOKUP(F179,ParametricTableRange,MATCH(\"Operating Region Used\",parametric_table!$A$1:$AV$1,0),FALSE)>0,F179,\"0\"),\"0\")","v":"0"},{"$f":"IF(ROWS(H$2:H179)>COUNTIF(G$2:G377,\"<>0\"),\"\",IF(ISERROR(INDEX(G$2:G377,SMALL(IF(G$2:G377<>\"0\",ROW(G$2:G377)-ROW(G$2)+1),ROWS(H$2:H179)))),\"\",IF(INDEX(G$2:G377,SMALL(IF(G$2:G377<>\"0\",ROW(G$2:G377)-ROW(G$2)+1),ROWS(H$2:H179)))=0,\"\",INDEX(G$2:G377,SMALL(IF(G$2:G377<>\"0\",ROW(G$2:G377)-ROW(G$2)+1),ROWS(H$2:H179))))))","v":""}]
[null,null,null,null,null,{"$f":"IF(DesignTool!$B$40=parametric_table!D180,parametric_table!A180,\"0\")","v":"0"},{"$f":"_xlfn.IFNA(IF(VLOOKUP(F180,ParametricTableRange,MATCH(\"Operating Region Used\",parametric_table!$A$1:$AV$1,0),FALSE)>0,F180,\"0\"),\"0\")","v":"0"},{"$f":"IF(ROWS(H$2:H180)>COUNTIF(G$2:G378,\"<>0\"),\"\",IF(ISERROR(INDEX(G$2:G378,SMALL(IF(G$2:G378<>\"0\",ROW(G$2:G378)-ROW(G$2)+1),ROWS(H$2:H180)))),\"\",IF(INDEX(G$2:G378,SMALL(IF(G$2:G378<>\"0\",ROW(G$2:G378)-ROW(G$2)+1),ROWS(H$2:H180)))=0,\"\",INDEX(G$2:G378,SMALL(IF(G$2:G378<>\"0\",ROW(G$2:G378)-ROW(G$2)+1),ROWS(H$2:H180))))))","v":""}]
[null,null,null,null,null,{"$f":"IF(DesignTool!$B$40=parametric_table!D181,parametric_table!A181,\"0\")","v":"0"},{"$f":"_xlfn.IFNA(IF(VLOOKUP(F181,ParametricTableRange,MATCH(\"Operating Region Used\",parametric_table!$A$1:$AV$1,0),FALSE)>0,F181,\"0\"),\"0\")","v":"0"},{"$f":"IF(ROWS(H$2:H181)>COUNTIF(G$2:G379,\"<>0\"),\"\",IF(ISERROR(INDEX(G$2:G379,SMALL(IF(G$2:G379<>\"0\",ROW(G$2:G379)-ROW(G$2)+1),ROWS(H$2:H181)))),\"\",IF(INDEX(G$2:G379,SMALL(IF(G$2:G379<>\"0\",ROW(G$2:G379)-ROW(G$2)+1),ROWS(H$2:H181)))=0,\"\",INDEX(G$2:G379,SMALL(IF(G$2:G379<>\"0\",ROW(G$2:G379)-ROW(G$2)+1),ROWS(H$2:H181))))))","v":""}]
[null,null,null,null,null,{"$f":"IF(DesignTool!$B$40=parametric_table!D182,parametric_table!A182,\"0\")","v":"0"},{"$f":"_xlfn.IFNA(IF(VLOOKUP(F182,ParametricTableRange,MATCH(\"Operating Region Used\",parametric_table!$A$1:$AV$1,0),FALSE)>0,F182,\"0\"),\"0\")","v":"0"},{"$f":"IF(ROWS(H$2:H182)>COUNTIF(G$2:G380,\"<>0\"),\"\",IF(ISERROR(INDEX(G$2:G380,SMALL(IF(G$2:G380<>\"0\",ROW(G$2:G380)-ROW(G$2)+1),ROWS(H$2:H182)))),\"\",IF(INDEX(G$2:G380,SMALL(IF(G$2:G380<>\"0\",ROW(G$2:G380)-ROW(G$2)+1),ROWS(H$2:H182)))=0,\"\",INDEX(G$2:G380,SMALL(IF(G$2:G380<>\"0\",ROW(G$2:G380)-ROW(G$2)+1),ROWS(H$2:H182))))))","v":""}]
[null,null,null,null,null,{"$f":"IF(DesignTool!$B$40=parametric_table!D183,parametric_table!A183,\"0\")","v":"0"},{"$f":"_xlfn.IFNA(IF(VLOOKUP(F183,ParametricTableRange,MATCH(\"Operating Region Used\",parametric_table!$A$1:$AV$1,0),FALSE)>0,F183,\"0\"),\"0\")","v":"0"},{"$f":"IF(ROWS(H$2:H183)>COUNTIF(G$2:G381,\"<>0\"),\"\",IF(ISERROR(INDEX(G$2:G381,SMALL(IF(G$2:G381<>\"0\",ROW(G$2:G381)-ROW(G$2)+1),ROWS(H$2:H183)))),\"\",IF(INDEX(G$2:G381,SMALL(IF(G$2:G381<>\"0\",ROW(G$2:G381)-ROW(G$2)+1),ROWS(H$2:H183)))=0,\"\",INDEX(G$2:G381,SMALL(IF(G$2:G381<>\"0\",ROW(G$2:G381)-ROW(G$2)+1),ROWS(H$2:H183))))))","v":""}]
[null,null,null,null,null,{"$f":"IF(DesignTool!$B$40=parametric_table!D184,parametric_table!A184,\"0\")","v":"0"},{"$f":"_xlfn.IFNA(IF(VLOOKUP(F184,ParametricTableRange,MATCH(\"Operating Region Used\",parametric_table!$A$1:$AV$1,0),FALSE)>0,F184,\"0\"),\"0\")","v":"0"},{"$f":"IF(ROWS(H$2:H184)>COUNTIF(G$2:G382,\"<>0\"),\"\",IF(ISERROR(INDEX(G$2:G382,SMALL(IF(G$2:G382<>\"0\",ROW(G$2:G382)-ROW(G$2)+1),ROWS(H$2:H184)))),\"\",IF(INDEX(G$2:G382,SMALL(IF(G$2:G382<>\"0\",ROW(G$2:G382)-ROW(G$2)+1),ROWS(H$2:H184)))=0,\"\",INDEX(G$2:G382,SMALL(IF(G$2:G382<>\"0\",ROW(G$2:G382)-ROW(G$2)+1),ROWS(H$2:H184))))))","v":""}]
[null,null,null,null,null,{"$f":"IF(DesignTool!$B$40=parametric_table!D185,parametric_table!A185,\"0\")","v":"0"},{"$f":"_xlfn.IFNA(IF(VLOOKUP(F185,ParametricTableRange,MATCH(\"Operating Region Used\",parametric_table!$A$1:$AV$1,0),FALSE)>0,F185,\"0\"),\"0\")","v":"0"},{"$f":"IF(ROWS(H$2:H185)>COUNTIF(G$2:G383,\"<>0\"),\"\",IF(ISERROR(INDEX(G$2:G383,SMALL(IF(G$2:G383<>\"0\",ROW(G$2:G383)-ROW(G$2)+1),ROWS(H$2:H185)))),\"\",IF(INDEX(G$2:G383,SMALL(IF(G$2:G383<>\"0\",ROW(G$2:G383)-ROW(G$2)+1),ROWS(H$2:H185)))=0,\"\",INDEX(G$2:G383,SMALL(IF(G$2:G383<>\"0\",ROW(G$2:G383)-ROW(G$2)+1),ROWS(H$2:H185))))))","v":""}]
[null,null,null,null,null,{"$f":"IF(DesignTool!$B$40=parametric_table!D186,parametric_table!A186,\"0\")","v":"0"},{"$f":"_xlfn.IFNA(IF(VLOOKUP(F186,ParametricTableRange,MATCH(\"Operating Region Used\",parametric_table!$A$1:$AV$1,0),FALSE)>0,F186,\"0\"),\"0\")","v":"0"},{"$f":"IF(ROWS(H$2:H186)>COUNTIF(G$2:G384,\"<>0\"),\"\",IF(ISERROR(INDEX(G$2:G384,SMALL(IF(G$2:G384<>\"0\",ROW(G$2:G384)-ROW(G$2)+1),ROWS(H$2:H186)))),\"\",IF(INDEX(G$2:G384,SMALL(IF(G$2:G384<>\"0\",ROW(G$2:G384)-ROW(G$2)+1),ROWS(H$2:H186)))=0,\"\",INDEX(G$2:G384,SMALL(IF(G$2:G384<>\"0\",ROW(G$2:G384)-ROW(G$2)+1),ROWS(H$2:H186))))))","v":""}]
[null,null,null,null,null,{"$f":"IF(DesignTool!$B$40=parametric_table!D187,parametric_table!A187,\"0\")","v":"0"},{"$f":"_xlfn.IFNA(IF(VLOOKUP(F187,ParametricTableRange,MATCH(\"Operating Region Used\",parametric_table!$A$1:$AV$1,0),FALSE)>0,F187,\"0\"),\"0\")","v":"0"},{"$f":"IF(ROWS(H$2:H187)>COUNTIF(G$2:G385,\"<>0\"),\"\",IF(ISERROR(INDEX(G$2:G385,SMALL(IF(G$2:G385<>\"0\",ROW(G$2:G385)-ROW(G$2)+1),ROWS(H$2:H187)))),\"\",IF(INDEX(G$2:G385,SMALL(IF(G$2:G385<>\"0\",ROW(G$2:G385)-ROW(G$2)+1),ROWS(H$2:H187)))=0,\"\",INDEX(G$2:G385,SMALL(IF(G$2:G385<>\"0\",ROW(G$2:G385)-ROW(G$2)+1),ROWS(H$2:H187))))))","v":""}]
[null,null,null,null,null,{"$f":"IF(DesignTool!$B$40=parametric_table!D188,parametric_table!A188,\"0\")","v":"0"},{"$f":"_xlfn.IFNA(IF(VLOOKUP(F188,ParametricTableRange,MATCH(\"Operating Region Used\",parametric_table!$A$1:$AV$1,0),FALSE)>0,F188,\"0\"),\"0\")","v":"0"},{"$f":"IF(ROWS(H$2:H188)>COUNTIF(G$2:G386,\"<>0\"),\"\",IF(ISERROR(INDEX(G$2:G386,SMALL(IF(G$2:G386<>\"0\",ROW(G$2:G386)-ROW(G$2)+1),ROWS(H$2:H188)))),\"\",IF(INDEX(G$2:G386,SMALL(IF(G$2:G386<>\"0\",ROW(G$2:G386)-ROW(G$2)+1),ROWS(H$2:H188)))=0,\"\",INDEX(G$2:G386,SMALL(IF(G$2:G386<>\"0\",ROW(G$2:G386)-ROW(G$2)+1),ROWS(H$2:H188))))))","v":""}]
[null,null,null,null,null,{"$f":"IF(DesignTool!$B$40=parametric_table!D189,parametric_table!A189,\"0\")","v":"0"},{"$f":"_xlfn.IFNA(IF(VLOOKUP(F189,ParametricTableRange,MATCH(\"Operating Region Used\",parametric_table!$A$1:$AV$1,0),FALSE)>0,F189,\"0\"),\"0\")","v":"0"},{"$f":"IF(ROWS(H$2:H189)>COUNTIF(G$2:G387,\"<>0\"),\"\",IF(ISERROR(INDEX(G$2:G387,SMALL(IF(G$2:G387<>\"0\",ROW(G$2:G387)-ROW(G$2)+1),ROWS(H$2:H189)))),\"\",IF(INDEX(G$2:G387,SMALL(IF(G$2:G387<>\"0\",ROW(G$2:G387)-ROW(G$2)+1),ROWS(H$2:H189)))=0,\"\",INDEX(G$2:G387,SMALL(IF(G$2:G387<>\"0\",ROW(G$2:G387)-ROW(G$2)+1),ROWS(H$2:H189))))))","v":""}]
[null,null,null,null,null,{"$f":"IF(DesignTool!$B$40=parametric_table!D190,parametric_table!A190,\"0\")","v":"0"},{"$f":"_xlfn.IFNA(IF(VLOOKUP(F190,ParametricTableRange,MATCH(\"Operating Region Used\",parametric_table!$A$1:$AV$1,0),FALSE)>0,F190,\"0\"),\"0\")","v":"0"},{"$f":"IF(ROWS(H$2:H190)>COUNTIF(G$2:G388,\"<>0\"),\"\",IF(ISERROR(INDEX(G$2:G388,SMALL(IF(G$2:G388<>\"0\",ROW(G$2:G388)-ROW(G$2)+1),ROWS(H$2:H190)))),\"\",IF(INDEX(G$2:G388,SMALL(IF(G$2:G388<>\"0\",ROW(G$2:G388)-ROW(G$2)+1),ROWS(H$2:H190)))=0,\"\",INDEX(G$2:G388,SMALL(IF(G$2:G388<>\"0\",ROW(G$2:G388)-ROW(G$2)+1),ROWS(H$2:H190))))))","v":""}]
[null,null,null,null,null,{"$f":"IF(DesignTool!$B$40=parametric_table!D191,parametric_table!A191,\"0\")","v":"0"},{"$f":"_xlfn.IFNA(IF(VLOOKUP(F191,ParametricTableRange,MATCH(\"Operating Region Used\",parametric_table!$A$1:$AV$1,0),FALSE)>0,F191,\"0\"),\"0\")","v":"0"},{"$f":"IF(ROWS(H$2:H191)>COUNTIF(G$2:G389,\"<>0\"),\"\",IF(ISERROR(INDEX(G$2:G389,SMALL(IF(G$2:G389<>\"0\",ROW(G$2:G389)-ROW(G$2)+1),ROWS(H$2:H191)))),\"\",IF(INDEX(G$2:G389,SMALL(IF(G$2:G389<>\"0\",ROW(G$2:G389)-ROW(G$2)+1),ROWS(H$2:H191)))=0,\"\",INDEX(G$2:G389,SMALL(IF(G$2:G389<>\"0\",ROW(G$2:G389)-ROW(G$2)+1),ROWS(H$2:H191))))))","v":""}]
[null,null,null,null,null,{"$f":"IF(DesignTool!$B$40=parametric_table!D192,parametric_table!A192,\"0\")","v":"0"},{"$f":"_xlfn.IFNA(IF(VLOOKUP(F192,ParametricTableRange,MATCH(\"Operating Region Used\",parametric_table!$A$1:$AV$1,0),FALSE)>0,F192,\"0\"),\"0\")","v":"0"},{"$f":"IF(ROWS(H$2:H192)>COUNTIF(G$2:G390,\"<>0\"),\"\",IF(ISERROR(INDEX(G$2:G390,SMALL(IF(G$2:G390<>\"0\",ROW(G$2:G390)-ROW(G$2)+1),ROWS(H$2:H192)))),\"\",IF(INDEX(G$2:G390,SMALL(IF(G$2:G390<>\"0\",ROW(G$2:G390)-ROW(G$2)+1),ROWS(H$2:H192)))=0,\"\",INDEX(G$2:G390,SMALL(IF(G$2:G390<>\"0\",ROW(G$2:G390)-ROW(G$2)+1),ROWS(H$2:H192))))))","v":""}]
[null,null,null,null,null,{"$f":"IF(DesignTool!$B$40=parametric_table!D193,parametric_table!A193,\"0\")","v":"0"},{"$f":"_xlfn.IFNA(IF(VLOOKUP(F193,ParametricTableRange,MATCH(\"Operating Region Used\",parametric_table!$A$1:$AV$1,0),FALSE)>0,F193,\"0\"),\"0\")","v":"0"},{"$f":"IF(ROWS(H$2:H193)>COUNTIF(G$2:G391,\"<>0\"),\"\",IF(ISERROR(INDEX(G$2:G391,SMALL(IF(G$2:G391<>\"0\",ROW(G$2:G391)-ROW(G$2)+1),ROWS(H$2:H193)))),\"\",IF(INDEX(G$2:G391,SMALL(IF(G$2:G391<>\"0\",ROW(G$2:G391)-ROW(G$2)+1),ROWS(H$2:H193)))=0,\"\",INDEX(G$2:G391,SMALL(IF(G$2:G391<>\"0\",ROW(G$2:G391)-ROW(G$2)+1),ROWS(H$2:H193))))))","v":""}]
[null,null,null,null,null,{"$f":"IF(DesignTool!$B$40=parametric_table!D194,parametric_table!A194,\"0\")","v":"0"},{"$f":"_xlfn.IFNA(IF(VLOOKUP(F194,ParametricTableRange,MATCH(\"Operating Region Used\",parametric_table!$A$1:$AV$1,0),FALSE)>0,F194,\"0\"),\"0\")","v":"0"},{"$f":"IF(ROWS(H$2:H194)>COUNTIF(G$2:G392,\"<>0\"),\"\",IF(ISERROR(INDEX(G$2:G392,SMALL(IF(G$2:G392<>\"0\",ROW(G$2:G392)-ROW(G$2)+1),ROWS(H$2:H194)))),\"\",IF(INDEX(G$2:G392,SMALL(IF(G$2:G392<>\"0\",ROW(G$2:G392)-ROW(G$2)+1),ROWS(H$2:H194)))=0,\"\",INDEX(G$2:G392,SMALL(IF(G$2:G392<>\"0\",ROW(G$2:G392)-ROW(G$2)+1),ROWS(H$2:H194))))))","v":""}]
[null,null,null,null,null,{"$f":"IF(DesignTool!$B$40=parametric_table!D195,parametric_table!A195,\"0\")","v":"0"},{"$f":"_xlfn.IFNA(IF(VLOOKUP(F195,ParametricTableRange,MATCH(\"Operating Region Used\",parametric_table!$A$1:$AV$1,0),FALSE)>0,F195,\"0\"),\"0\")","v":"0"},{"$f":"IF(ROWS(H$2:H195)>COUNTIF(G$2:G393,\"<>0\"),\"\",IF(ISERROR(INDEX(G$2:G393,SMALL(IF(G$2:G393<>\"0\",ROW(G$2:G393)-ROW(G$2)+1),ROWS(H$2:H195)))),\"\",IF(INDEX(G$2:G393,SMALL(IF(G$2:G393<>\"0\",ROW(G$2:G393)-ROW(G$2)+1),ROWS(H$2:H195)))=0,\"\",INDEX(G$2:G393,SMALL(IF(G$2:G393<>\"0\",ROW(G$2:G393)-ROW(G$2)+1),ROWS(H$2:H195))))))","v":""}]
[null,null,null,null,null,{"$f":"IF(DesignTool!$B$40=parametric_table!D196,parametric_table!A196,\"0\")","v":"0"},{"$f":"_xlfn.IFNA(IF(VLOOKUP(F196,ParametricTableRange,MATCH(\"Operating Region Used\",parametric_table!$A$1:$AV$1,0),FALSE)>0,F196,\"0\"),\"0\")","v":"0"},{"$f":"IF(ROWS(H$2:H196)>COUNTIF(G$2:G394,\"<>0\"),\"\",IF(ISERROR(INDEX(G$2:G394,SMALL(IF(G$2:G394<>\"0\",ROW(G$2:G394)-ROW(G$2)+1),ROWS(H$2:H196)))),\"\",IF(INDEX(G$2:G394,SMALL(IF(G$2:G394<>\"0\",ROW(G$2:G394)-ROW(G$2)+1),ROWS(H$2:H196)))=0,\"\",INDEX(G$2:G394,SMALL(IF(G$2:G394<>\"0\",ROW(G$2:G394)-ROW(G$2)+1),ROWS(H$2:H196))))))","v":""}]
[null,null,null,null,null,{"$f":"IF(DesignTool!$B$40=parametric_table!D197,parametric_table!A197,\"0\")","v":"0"},{"$f":"_xlfn.IFNA(IF(VLOOKUP(F197,ParametricTableRange,MATCH(\"Operating Region Used\",parametric_table!$A$1:$AV$1,0),FALSE)>0,F197,\"0\"),\"0\")","v":"0"},{"$f":"IF(ROWS(H$2:H197)>COUNTIF(G$2:G395,\"<>0\"),\"\",IF(ISERROR(INDEX(G$2:G395,SMALL(IF(G$2:G395<>\"0\",ROW(G$2:G395)-ROW(G$2)+1),ROWS(H$2:H197)))),\"\",IF(INDEX(G$2:G395,SMALL(IF(G$2:G395<>\"0\",ROW(G$2:G395)-ROW(G$2)+1),ROWS(H$2:H197)))=0,\"\",INDEX(G$2:G395,SMALL(IF(G$2:G395<>\"0\",ROW(G$2:G395)-ROW(G$2)+1),ROWS(H$2:H197))))))","v":""}]
[null,null,null,null,null,{"$f":"IF(DesignTool!$B$40=parametric_table!D198,parametric_table!A198,\"0\")","v":"0"},{"$f":"_xlfn.IFNA(IF(VLOOKUP(F198,ParametricTableRange,MATCH(\"Operating Region Used\",parametric_table!$A$1:$AV$1,0),FALSE)>0,F198,\"0\"),\"0\")","v":"0"},{"$f":"IF(ROWS(H$2:H198)>COUNTIF(G$2:G396,\"<>0\"),\"\",IF(ISERROR(INDEX(G$2:G396,SMALL(IF(G$2:G396<>\"0\",ROW(G$2:G396)-ROW(G$2)+1),ROWS(H$2:H198)))),\"\",IF(INDEX(G$2:G396,SMALL(IF(G$2:G396<>\"0\",ROW(G$2:G396)-ROW(G$2)+1),ROWS(H$2:H198)))=0,\"\",INDEX(G$2:G396,SMALL(IF(G$2:G396<>\"0\",ROW(G$2:G396)-ROW(G$2)+1),ROWS(H$2:H198))))))","v":""}]
[null,null,null,null,null,{"$f":"IF(DesignTool!$B$40=parametric_table!D199,parametric_table!A199,\"0\")","v":"0"},{"$f":"_xlfn.IFNA(IF(VLOOKUP(F199,ParametricTableRange,MATCH(\"Operating Region Used\",parametric_table!$A$1:$AV$1,0),FALSE)>0,F199,\"0\"),\"0\")","v":"0"},{"$f":"IF(ROWS(H$2:H199)>COUNTIF(G$2:G397,\"<>0\"),\"\",IF(ISERROR(INDEX(G$2:G397,SMALL(IF(G$2:G397<>\"0\",ROW(G$2:G397)-ROW(G$2)+1),ROWS(H$2:H199)))),\"\",IF(INDEX(G$2:G397,SMALL(IF(G$2:G397<>\"0\",ROW(G$2:G397)-ROW(G$2)+1),ROWS(H$2:H199)))=0,\"\",INDEX(G$2:G397,SMALL(IF(G$2:G397<>\"0\",ROW(G$2:G397)-ROW(G$2)+1),ROWS(H$2:H199))))))","v":""}]
[null,null,null,null,null,{"$f":"IF(DesignTool!$B$40=parametric_table!D200,parametric_table!A200,\"0\")","v":"0"},{"$f":"_xlfn.IFNA(IF(VLOOKUP(F200,ParametricTableRange,MATCH(\"Operating Region Used\",parametric_table!$A$1:$AV$1,0),FALSE)>0,F200,\"0\"),\"0\")","v":"0"},{"$f":"IF(ROWS(H$2:H200)>COUNTIF(G$2:G398,\"<>0\"),\"\",IF(ISERROR(INDEX(G$2:G398,SMALL(IF(G$2:G398<>\"0\",ROW(G$2:G398)-ROW(G$2)+1),ROWS(H$2:H200)))),\"\",IF(INDEX(G$2:G398,SMALL(IF(G$2:G398<>\"0\",ROW(G$2:G398)-ROW(G$2)+1),ROWS(H$2:H200)))=0,\"\",INDEX(G$2:G398,SMALL(IF(G$2:G398<>\"0\",ROW(G$2:G398)-ROW(G$2)+1),ROWS(H$2:H200))))))","v":""}]

{"sheet":"parametric_table","index":4,"n_rows":108,"n_cols":53,"rows_kept":108,"cut":false,"hidden":true,"merged":[]}
["Part number","Datasheet","Description","Type","Auto Qual (Y/N)","X-Sensor Loc (mm)","X-tolerance (mm)","Y-Sensor Loc (mm)","Y-tolerance (mm)","Z-Sensor Loc (mm)","Z-tolerance (mm)","Supply Min (V)","Supply Max (V)","Operating Regions","Operating Region Used","ICC Min","ICC Typ (mA)","ICC Max (mA)","Sensitivity Min (mV/mT)","Sensitivity Typ (mV/mT)","Sensitivity Max (mV/mT)","Sensitivity (%D/mT)","Tolerance","Noise peak to peak (mT)","BL min","BL max","VQ (V)","VLmin-GND (V)","VCC-VLmax (V)","Vout Min (V)","Vout Max (V)","BOP Min (mT)","BOP Typ (mT)","BOP Max (mT)","BRP Min (mT)","BRP Typ (mT)","BRP Max (mT)","Bhys Min (mT)","Bhys Typ (mT)","Bhys Max (mT)","Active State","Sensor Axis","Package Group","Package size: mm2:W x L (PKG)","HBM (V)","CDM (V)","Op temp range (C)","Approx. price (USD)","Within B Range"]
["TMAG5111A2","DS","2-dimensional, dual-channel, high-sensitivity, speed and direction outputs, Hall-effect latch","2D Latch","N",null,null,null,null,null,null,2.5,38,{"$f":"LEN(M2)-LEN(SUBSTITUTE(M2,\";\",\"\"))+1","v":1},1,null,6,8,null,null,null,null,null,null,null,null,null,null,0,null,{"$f":"VSUPPLY-AC2","v":3.3},0.2,1.4,2.6,-2.6,-1.4,-0.2,0.9,null,4.5999999999999996,null,"2, 3, 6","SOT-23|5","5 mm2: 1.6 x 2.9 (SOT-23|5)",2000,500,"-40 to 125","$0.330 | 1ku",null,null,null,null,{"$f":"COUNTIF(AW2:AW21, \"below\")","v":2}]
["TMAG5111A4","DS","2-dimensional, dual-channel, high-sensitivity, speed and direction outputs, Hall-effect latch","2D Latch","N",null,null,null,null,null,null,2.5,38,{"$f":"LEN(M3)-LEN(SUBSTITUTE(M3,\";\",\"\"))+1","v":1},1,null,6,8,null,null,null,null,null,null,null,null,null,null,0,null,3.3,null,3,2.6,-2.6,-1.4,-0.2,0.9,null,4.5999999999999996,null,"2, 3, 6","SOT-23|5","5 mm2: 1.6 x 2.9 (SOT-23|5)",2000,500,"-40 to 125","$0.330 | 1ku","below"]
["TMAG5111B2","DS","2-dimensional, dual-channel, high-sensitivity, speed and direction outputs, Hall-effect latch","2D Latch","N",null,null,null,null,null,null,2.5,38,1,1,null,6,8,null,null,null,null,null,null,null,null,null,null,0,null,3.3,0.2,1.4,2.6,-2.6,-1.4,-0.2,0.9,null,4.5999999999999996,null,"2, 3, 6","SOT-23|5","5 mm2: 1.6 x 2.9 (SOT-23|5)",2000,500,"-40 to 125","$0.330 | 1ku","below"]
["TMAG5111B4","DS","2-dimensional, dual-channel, high-sensitivity, speed and direction outputs, Hall-effect latch","2D Latch","N",null,null,null,null,null,null,2.5,38,1,1,null,6,8,null,null,null,null,null,null,null,null,null,null,0,null,3.3,null,3,2.6,-2.6,-1.4,-0.2,0.9,null,4.5999999999999996,null,"2, 3, 6","SOT-23|5","5 mm2: 1.6 x 2.9 (SOT-23|5)",2000,500,"-40 to 125","$0.330 | 1ku"]
["TMAG5111C2","DS","2-dimensional, dual-channel, high-sensitivity, speed and direction outputs, Hall-effect latch","2D Latch","N",null,null,null,null,null,null,2.5,38,1,1,null,6,8,null,null,null,null,null,null,null,null,null,null,0,null,3.3,0.2,1.4,2.6,-2.6,-1.4,-0.2,0.9,null,4.5999999999999996,null,"2, 3, 6","SOT-23|5","5 mm2: 1.6 x 2.9 (SOT-23|5)",2000,500,"-40 to 125","$0.330 | 1ku"]
["TMAG5111C4","DS","2-dimensional, dual-channel, high-sensitivity, speed and direction outputs, Hall-effect latch","2D Latch","N",null,null,null,null,null,null,2.5,38,1,1,null,6,8,null,null,null,null,null,null,null,null,null,null,0,null,3.3,null,3,2.6,-2.6,-1.4,-0.2,0.9,null,4.5999999999999996,null,"2, 3, 6","SOT-23|5","5 mm2: 1.6 x 2.9 (SOT-23|5)",2000,500,"-40 to 125","$0.330 | 1ku"]
["TMAG5110A2","DS","2-dimensional, dual-channel, high-sensitivity, Hall-effect latch","2D Latch","N",null,null,null,null,null,null,2.5,38,1,1,null,6,8,null,null,null,null,null,null,null,null,null,null,0,null,3.3,0.2,1.4,2.6,-2.6,-1.4,-0.2,0.9,null,4.5999999999999996,null,2,"SOT-23|5","5 mm2: 1.6 x 2.9 (SOT-23|5)",2000,500,"-40 to 125","$0.330 | 1ku"]
["TMAG5110A4","DS","2-dimensional, dual-channel, high-sensitivity, Hall-effect latch","2D Latch","N",null,null,null,null,null,null,2.5,38,1,1,null,6,8,null,null,null,null,null,null,null,null,null,null,0,null,3.3,null,3,2.6,-2.6,-1.4,-0.2,0.9,null,4.5999999999999996,null,2,"SOT-23|5","5 mm2: 1.6 x 2.9 (SOT-23|5)",2000,500,"-40 to 125","$0.330 | 1ku"]
["TMAG5110B2","DS","2-dimensional, dual-channel, high-sensitivity, Hall-effect latch","2D Latch","N",null,null,null,null,null,null,2.5,38,1,1,null,6,8,null,null,null,null,null,null,null,null,null,null,0,null,3.3,0.2,1.4,2.6,-2.6,-1.4,-0.2,0.9,null,4.5999999999999996,null,2,"SOT-23|5","5 mm2: 1.6 x 2.9 (SOT-23|5)",2000,500,"-40 to 125","$0.330 | 1ku"]
["TMAG5110B4","DS","2-dimensional, dual-channel, high-sensitivity, Hall-effect latch","2D Latch","N",null,null,null,null,null,null,2.5,38,1,1,null,6,8,null,null,null,null,null,null,null,null,null,null,0,null,3.3,null,3,2.6,-2.6,-1.4,-0.2,0.9,null,4.5999999999999996,null,2,"SOT-23|5","5 mm2: 1.6 x 2.9 (SOT-23|5)",2000,500,"-40 to 125","$0.330 | 1ku"]
["TMAG5110C2","DS","2-dimensional, dual-channel, high-sensitivity, Hall-effect latch","2D Latch","N",null,null,null,null,null,null,2.5,38,1,1,null,6,8,null,null,null,null,null,null,null,null,null,null,0,null,3.3,0.2,1.4,2.6,-2.6,-1.4,-0.2,0.9,null,4.5999999999999996,null,2,"SOT-23|5","5 mm2: 1.6 x 2.9 (SOT-23|5)",2000,500,"-40 to 125","$0.330 | 1ku"]
["TMAG5110C4","DS","2-dimensional, dual-channel, high-sensitivity, Hall-effect latch","2D Latch","N",null,null,null,null,null,null,2.5,38,1,1,null,6,8,null,null,null,null,null,null,null,null,null,null,0,null,3.3,null,3,2.6,-2.6,-1.4,-0.2,0.9,null,4.5999999999999996,null,2,"SOT-23|5","5 mm2: 1.6 x 2.9 (SOT-23|5)",2000,500,"-40 to 125","$0.330 | 1ku"]
["TMAG5170A1EDGK","DS","3-Axis Linear Hall Effect Sensor With SPI Interface","3-Axis linear","Y",{"$f":"-(((3.1+2.9)/2)/2-1.77)","v":0.27},null,{"$f":"((3.1+2.9)/2)/2-1.54","v":-4.0000000000000036E-2},null,0.32,null,2.2999999999999998,5.5,1,1,null,null,null,null,null,null,null,null,null,null,null,null,null,null,null,null,null,null,null,null,null,null,null,null,null,null,2,"VSSOP|8",null,null,null,"-40 to 150"]
["TMAG5273A1QDBV","DS","Low-Power Linear 3D Hall-Effect Sensor With I2C Interface","3-Axis linear","N",{"$f":"-(((1.75+1.45)/2)/2-0.68)","v":-0.12},null,{"$f":"((3.05+2.75)/2)/2-1.85","v":-0.40000000000000013},null,0.73,null,1.7,3.6,1,1,null,null,null,null,null,null,null,null,null,null,null,null,null,null,null,null,null,null,null,null,null,null,null,null,null,null,2,"SOT-23|6",null,null,null,"-40 to 125"]
["TMAG5273A2QDBV","DS","Low-Power Linear 3D Hall-Effect Sensor With I2C Interface","3-Axis linear","N",{"$f":"-(((1.75+1.45)/2)/2-0.68)","v":-0.12},null,{"$f":"((3.05+2.75)/2)/2-1.85","v":-0.40000000000000013},null,0.73,null,1.7,3.6,1,1,null,null,null,null,null,null,null,null,null,null,null,null,null,null,null,null,null,null,null,null,null,null,null,null,null,null,2,"SOT-23|6",null,null,null,"-40 to 125"]
["TMAG5231B1DQDBZ","DS","Low-Power, Hall Effect Switch","Omnipolar switch","N","NA","NA","NA","NA",{"$f":"1.12-0.65","v":0.47000000000000008},0.08,1.65,5.5,1,1,null,null,null,null,null,null,null,null,null,null,null,null,null,0,null,3.3,2,3,4.0999999999999996,0.6,1.5,2.2000000000000002,0.8,1.5,2.2999999999999998,"Low-HighB",2,"SOT-23|3","7 mm2: 2.37 x 2.92 (SOT-23|3)",2000,500,"-40 to 85"]
["TMAG5123B","DS","Automotive, in-plane, high-precision, high-voltage switch","Omnipolar switch","Y",1.77,0.06,"NA","NA","NA","NA",2.7,38,1,1,null,3.5,5.4,null,null,null,null,null,null,null,null,null,null,0,null,{"$f":"VSUPPLY-AC18","v":3.3},2.2000000000000002,4.0999999999999996,6,0.3,2.2000000000000002,4,0.5,1.9,3,"Low-HighB",1,"SOT-23|3","7 mm2: 2.37 x 2.92 (SOT-23|3)",2000,500,"-40 to 150","$0.425 | 1ku"]
["TMAG5123C","DS","Automotive, in-plane, high-precision, high-voltage switch","Omnipolar switch","Y",1.77,0.06,"NA","NA","NA","NA",2.7,38,1,1,null,3.5,5.4,null,null,null,null,null,null,null,null,null,null,0,null,{"$f":"VSUPPLY-AC19","v":3.3},5.5,7.5,9.5,3.5,5.5,7.5,0.5,2,3,"Low-HighB",1,"SOT-23|3","7 mm2: 2.37 x 2.92 (SOT-23|3)",2000,500,"-40 to 150","$0.425 | 1ku"]
["TMAG5123D","DS","Automotive, in-plane, high-precision, high-voltage switch","Omnipolar switch","Y",1.77,0.06,"NA","NA","NA","NA",2.7,38,1,1,null,3.5,5.4,null,null,null,null,null,null,null,null,null,null,0,null,{"$f":"VSUPPLY-AC20","v":3.3},8.6999999999999993,10.9,13,6.7,8.9,11,0.5,2,3,"Low-HighB",1,"SOT-23|3","7 mm2: 2.37 x 2.92 (SOT-23|3)",2000,500,"-40 to 150","$0.425 | 1ku"]
["TMAG5124A","DS","Two-wire (current output), high-voltage (up to 38V), high-precision switch","Unipolar switch","N","NA","NA","NA","NA",{"$f":"1.12-(0.73+0.57)/2","v":0.4700000000000002},{"$f":"(0.73-0.57)/2","v":8.0000000000000016E-2},2.5,38,1,1,null,null,null,null,null,null,null,null,null,null,null,null,null,0,null,{"$f":"VSUPPLY-AC21","v":3.3},3,4,5,1,2,3,0.6,2,3.4,"High North",2,"SOT-23|3","7 mm2: 2.37 x 2.92 (SOT-23|3)",2000,500,"-40 to 125","$0.300 | 1ku"]
["TMAG5124B","DS","Two-wire (current output), high-voltage (up to 38V), high-precision switch","Unipolar switch","N","NA","NA","NA","NA",{"$f":"1.12-(0.73+0.57)/2","v":0.4700000000000002},{"$f":"(0.73-0.57)/2","v":8.0000000000000016E-2},2.5,38,1,1,null,null,null,null,null,null,null,null,null,null,null,null,null,0,null,3.3,5,6,7,3,4,5,0.6,2,3.4,"High North",2,"SOT-23|3","7 mm2: 2.37 x 2.92 (SOT-23|3)",2000,500,"-40 to 125","$0.300 | 1ku"]
["TMAG5124C","DS","Two-wire (current output), high-voltage (up to 38V), high-precision switch","Unipolar switch","N","NA","NA","NA","NA",0.4700000000000002,8.0000000000000016E-2,2.5,38,1,1,null,null,null,null,null,null,null,null,null,null,null,null,null,0,null,3.3,8.8000000000000007,10,11,6.8,8,9.4,0.6,2,3.4,"High North",2,"SOT-23|3","7 mm2: 2.37 x 2.92 (SOT-23|3)",2000,500,"-40 to 125","$0.300 | 1ku"]
["TMAG5124D","DS","Two-wire (current output), high-voltage (up to 38V), high-precision switch","Unipolar switch","N","NA","NA","NA","NA",0.4700000000000002,8.0000000000000016E-2,2.5,38,1,1,null,null,null,null,null,null,null,null,null,null,null,null,null,0,null,3.3,13.6,15,16.100000000000001,11.4,13,14.2,0.6,2,3.4,"High North",2,"SOT-23|3","7 mm2: 2.37 x 2.92 (SOT-23|3)",2000,500,"-40 to 125","$0.300 | 1ku"]
["TMAG5124E","DS","Two-wire (current output), high-voltage (up to 38V), high-precision switch","Unipolar switch","N","NA","NA","NA","NA",0.4700000000000002,8.0000000000000016E-2,2.5,38,1,1,null,null,null,null,null,null,null,null,null,null,null,null,null,0,null,3.3,3,4,5,1,2,3,0.6,2,3.4,"High North",2,"SOT-23|3","7 mm2: 2.37 x 2.92 (SOT-23|3)",2000,500,"-40 to 125","$0.300 | 1ku"]
["TMAG5124F","DS","Two-wire (current output), high-voltage (up to 38V), high-precision switch","Unipolar switch","N","NA","NA","NA","NA",0.4700000000000002,8.0000000000000016E-2,2.5,38,1,1,null,null,null,null,null,null,null,null,null,null,null,null,null,0,null,3.3,5,6,7,3,4,5,0.6,2,3.4,"High North",2,"SOT-23|3","7 mm2: 2.37 x 2.92 (SOT-23|3)",2000,500,"-40 to 125","$0.300 | 1ku"]
["TMAG5124G","DS","Two-wire (current output), high-voltage (up to 38V), high-precision switch","Unipolar switch","N","NA","NA","NA","NA",0.4700000000000002,8.0000000000000016E-2,2.5,38,1,1,null,null,null,null,null,null,null,null,null,null,null,null,null,0,null,3.3,8.8000000000000007,10,11,6.8,8,9.4,0.6,2,3.4,"High North",2,"SOT-23|3","7 mm2: 2.37 x 2.92 (SOT-23|3)",2000,500,"-40 to 125","$0.300 | 1ku"]
["TMAG5124H","DS","Two-wire (current output), high-voltage (up to 38V), high-precision switch","Unipolar switch","N","NA","NA","NA","NA",0.4700000000000002,8.0000000000000016E-2,2.5,38,1,1,null,null,null,null,null,null,null,null,null,null,null,null,null,0,null,3.3,13.6,15,16.100000000000001,11.4,13,14.2,0.6,2,3.4,"High North",2,"SOT-23|3","7 mm2: 2.37 x 2.92 (SOT-23|3)",2000,500,"-40 to 125","$0.300 | 1ku"]
["DRV5021A1","DS","Low voltage (up to 5.5V), high bandwidth (up to 30 kHz) unipolar switch","Unipolar switch","Y","NA","NA","NA","NA",{"$f":"1.12-0.65","v":0.47000000000000008},0.08,2.5,5.5,1,1,null,2.2999999999999998,2.8,null,null,null,null,null,null,null,null,null,null,0,null,3.3,1.4,2.9,4.4000000000000004,0.4,1.8,3,0.2,1.1000000000000001,2.5,"High North",2,"SOT-23|3","7 mm2: 2.37 x 2.92 (SOT-23|3)",4000,1000,"-40 to 125","$0.195 | 1ku"]
["DRV5021A2","DS","Low voltage (up to 5.5V), high bandwidth (up to 30 kHz) unipolar switch","Unipolar switch","Y","NA","NA","NA","NA",{"$f":"1.12-0.65","v":0.47000000000000008},0.08,2.5,5.5,1,1,null,2.2999999999999998,2.8,null,null,null,null,null,null,null,null,null,null,0,null,3.3,5.5,9.1999999999999993,12.5,3.6,7,9.5,1.1000000000000001,2.2000000000000002,4.5,"High North",2,"SOT-23|3","7 mm2: 2.37 x 2.92 (SOT-23|3)",4000,1000,"-40 to 125","$0.195 | 1ku"]
["DRV5021A3","DS","Low voltage (up to 5.5V), high bandwidth (up to 30 kHz) unipolar switch","Unipolar switch","Y","NA","NA","NA","NA",0.47000000000000008,0.08,2.5,5.5,1,1,null,2.2999999999999998,2.8,null,null,null,null,null,null,null,null,null,null,0,null,3.3,9.5,17.899999999999999,22.7,6.7,14.1,18.5,1.6,3.8,6,"High North",2,"SOT-23|3","7 mm2: 2.37 x 2.92 (SOT-23|3)",4000,1000,"-40 to 125","$0.195 | 1ku"]
["DRV5015A1","DS","High sensitivity (&plusmn;2-mT), low voltage (up to 5.5-V) Hall effect latch","Latch","Y","NA","NA","NA","NA",0.47000000000000008,0.08,2.5,5.5,1,1,null,2.2999999999999998,2.8,null,null,null,null,null,null,null,null,null,null,0,null,3.3,-0.2,0.7,2,-2,-0.7,0.2,0.35,1.4,null,"High North",2,"SOT-23|3","7 mm2: 2.37 x 2.92 (SOT-23|3)",5000,1500,"-40 to 125","$0.090 | 1ku"]
["DRV5015A2","DS","High sensitivity (&plusmn;2-mT), low voltage (up to 5.5-V) Hall effect latch","Latch","Y","NA","NA","NA","NA",0.47000000000000008,0.08,2.5,5.5,1,1,null,2.2999999999999998,2.8,null,null,null,null,null,null,null,null,null,null,0,null,3.3,0.5,0.7,3.7,-3.7,-1.8,-0.5,2.2999999999999998,3.6,null,"High North",2,"SOT-23|3","7 mm2: 2.37 x 2.92 (SOT-23|3)",5000,1500,"-40 to 125","$0.090 | 1ku"]
["DRV5015A3","DS","High sensitivity (&plusmn;2-mT), low voltage (up to 5.5-V) Hall effect latch","Latch","Y","NA","NA","NA","NA",0.47000000000000008,0.08,2.5,5.5,1,1,null,2.2999999999999998,2.8,null,null,null,null,null,null,null,null,null,null,0,null,3.3,0.5,0.7,3.7,-3.7,-1.8,-0.5,2.2999999999999998,3.6,null,"Low North",2,"SOT-23|3","7 mm2: 2.37 x 2.92 (SOT-23|3)",5000,1500,"-40 to 125","$0.090 | 1ku"]
["DRV5011ADDBZ","DS","Small size (available in WCSP and X2SON), low voltage (up to 5.5-V) Hall effect latch","Latch","N","NA","NA","NA","NA",0.47000000000000008,0.08,2.5,5.5,1,1,null,2.2999999999999998,3,null,null,null,null,null,null,null,null,null,null,0,null,3.3,0.6,2,3.8,-3.8,-2,-0.6,2,4,6,"High North",2,"SOT-23|3","7 mm2: 2.37 x 2.92 (SOT-23|3)",6000,750,"-40 to 125","$0.090 | 1ku"]
["DRV5011ADDMR","DS","Small size (available in WCSP and X2SON), low voltage (up to 5.5-V) Hall effect latch","Latch","N","NA","NA","NA","NA",0.47000000000000008,0.08,2.5,5.5,1,1,null,2.2999999999999998,3,null,null,null,null,null,null,null,null,null,null,0,null,{"$f":"VSUPPLY-AC36","v":3.3},0.6,2,3.8,-3.8,-2,-0.6,2,4,6,"High North",2,"X2SON|4","2 mm2: 1.1 x 1.4 (X2SON|4)",6000,750,"-40 to 125","$0.090 | 1ku"]
["DRV5011ADLPG","DS","Small size (available in WCSP and X2SON), low voltage (up to 5.5-V) Hall effect latch","Latch","N",{"$f":"(1.62+1.42)/2-1.03","v":0.49},0.115,"NA","NA","NA","NA",2.5,5.5,1,1,null,2.2999999999999998,3,null,null,null,null,null,null,null,null,null,null,0,null,{"$f":"VSUPPLY-AC37","v":3.3},0.6,2,3.8,-3.8,-2,-0.6,2,4,6,"High North",1,"TO-92|3","6 mm2: 1.52 x 4 (TO-92|3)",6000,750,"-40 to 125","$0.090 | 1ku"]
["DRV5011ADYBH","DS","Small size (available in WCSP and X2SON), low voltage (up to 5.5-V) Hall effect latch","Latch","N","NA","NA","NA","NA",0.47000000000000008,0.08,2.5,5.5,1,1,null,2.2999999999999998,3,null,null,null,null,null,null,null,null,null,null,0,null,{"$f":"VSUPPLY-AC38","v":3.3},0.6,2,3.8,-3.8,-2,-0.6,2,4,6,"High North",2,"DSBGA|4","1 mm2: .8 x .8 (DSBGA|4)",6000,750,"-40 to 125","$0.090 | 1ku"]
["DRV5012AEDMR","DS","Low power (as low as 3.3-&micro;A), low voltage (up to 5.5-V) Hall effect latch","Latch","N","NA","NA","NA","NA",0.47000000000000008,0.08,1.65,5.5,1,1,null,null,null,null,null,null,null,null,null,null,null,null,null,0,null,3.3,0.6,2,3.3,-3.3,-2,-0.6,2,4,null,"High North",2,"X2SON|4","2 mm2: 1.1 x 1.4 (X2SON|4)",6000,750,"-40 to 85","$0.120 | 1ku"]
["DRV5032DUDBZ","DS","Low power (5 Hz, <1µA), low voltage (up to 5.5V) switch","Unipolar switch","N","NA","NA","NA","NA",{"$f":"1.12-0.65","v":0.47000000000000008},0.08,1.65,5.5,1,1,null,null,null,null,null,null,null,null,null,null,null,null,null,0,null,3.3,-3.9,-2.5,-1.2,-3.5,-1.8,-0.9,0.1,0.7,1.9,"High North",2,"SOT-23|3","7 mm2: 2.37 x 2.92 (SOT-23|3)",6000,750,"-40 to 85","$0.194 | 1ku"]
["DRV5032DUDMR","DS","Low power (5 Hz, <1µA), low voltage (up to 5.5V) switch","Unipolar switch","N",null,null,null,null,null,null,1.65,5.5,1,1,null,null,null,null,null,null,null,null,null,null,null,null,null,0,null,{"$f":"VSUPPLY-AC41","v":3.3},-3.9,-2.5,-1.2,-3.5,-1.8,-0.9,0.1,0.7,1.9,"Low North, High North",2,"X2SON|4","2 mm2: 1.1 x 1.4 (X2SON|4)",6000,750,"-40 to 85","$0.194 | 1ku"]
["DRV5032DULPG","DS","Low power (5 Hz, <1µA), low voltage (up to 5.5V) switch","Unipolar switch","N",{"$f":"(1.62+1.42)/2-1.03","v":0.49},0.115,"NA","NA","NA","NA",1.65,5.5,1,1,null,null,null,null,null,null,null,null,null,null,null,null,null,0,null,{"$f":"VSUPPLY-AC42","v":3.3},-3.9,-2.5,-1.2,-3.5,-1.8,-0.9,0.1,0.7,1.9,"High North",1,"TO-92|3","6 mm2: 1.52 x 4 (TO-92|3)",6000,750,"-40 to 85","$0.194 | 1ku"]
["DRV5032FADBZ","DS","Low power (5 Hz, <1µA), low voltage (up to 5.5V) switch","Omnipolar switch","N","NA","NA","NA","NA",{"$f":"1.12-0.65","v":0.47000000000000008},0.08,1.65,5.5,1,1,null,null,null,null,null,null,null,null,null,null,null,null,null,0,null,3.3,1.5,3,4.8,0.5,1.5,3,0.8,1.5,3,"Low-HighB",2,"SOT-23|3","8 mm2: 2.37 x 2.92 (SOT-23|3)",6000,750,"-40 to 85","$0.194 | 1ku"]
["DRV5032FADMR","DS","Low power (5 Hz, <1µA), low voltage (up to 5.5V) switch","Omnipolar switch","N",null,null,null,null,null,null,1.65,5.5,1,1,null,null,null,null,null,null,null,null,null,null,null,null,null,0,null,{"$f":"VSUPPLY-AC44","v":3.3},1.5,3,4.8,0.5,1.5,3,0.8,1.5,3,"Low-HighB",2,"X2SON|4","3 mm2: 1.1 x 1.4 (X2SON|4)",6000,750,"-40 to 85","$0.194 | 1ku"]
["DRV5032FALPG","DS","Low power (5 Hz, <1µA), low voltage (up to 5.5V) switch","Omnipolar switch","N",{"$f":"(1.62+1.42)/2-1.03","v":0.49},0.115,"NA","NA","NA","NA",1.65,5.5,1,1,null,null,null,null,null,null,null,null,null,null,null,null,null,0,null,{"$f":"VSUPPLY-AC45","v":3.3},1.5,3,4.8,0.5,1.5,3,0.8,1.5,3,"Low-HighB",1,"TO-92|3","7 mm2: 1.52 x 4 (TO-92|3)",6000,750,"-40 to 85","$0.194 | 1ku"]
["DRV5032FBDBZ","DS","Low power (5 Hz, <1µA), low voltage (up to 5.5V) switch","Omnipolar switch","N","NA","NA","NA","NA",{"$f":"1.12-0.65","v":0.47000000000000008},0.08,1.65,5.5,1,1,null,null,null,null,null,null,null,null,null,null,null,null,null,0,null,3.3,1.5,3,4.8,0.5,1.5,3,0.8,1.5,3,"Low-HighB",2,"SOT-23|3","9 mm2: 2.37 x 2.92 (SOT-23|3)",6000,750,"-40 to 85","$0.194 | 1ku"]
["DRV5032FBLPG","DS","Low power (5 Hz, <1µA), low voltage (up to 5.5V) switch","Omnipolar switch","N",{"$f":"(1.62+1.42)/2-1.03","v":0.49},0.115,"NA","NA","NA","NA",1.65,5.5,1,1,null,null,null,null,null,null,null,null,null,null,null,null,null,0,null,{"$f":"VSUPPLY-AC47","v":3.3},1.5,3,4.8,0.5,1.5,3,0.8,1.5,3,"Low-HighB",1,"TO-92|3","8 mm2: 1.52 x 4 (TO-92|3)",6000,750,"-40 to 85","$0.194 | 1ku"]
["DRV5032FCDBZ","DS","Low power (5 Hz, <1µA), low voltage (up to 5.5V) switch","Omnipolar switch","N","NA","NA","NA","NA",{"$f":"1.12-0.65","v":0.47000000000000008},0.08,1.65,5.5,1,1,null,null,null,null,null,null,null,null,null,null,null,null,null,0,null,3.3,1.5,3,4.8,0.5,1.5,3,0.8,1.5,3,"Low-HighB",2,"SOT-23|3","10 mm2: 2.37 x 2.92 (SOT-23|3)",6000,750,"-40 to 85","$0.194 | 1ku"]
["DRV5032FCLPG","DS","Low power (5 Hz, <1µA), low voltage (up to 5.5V) switch","Omnipolar switch","N",{"$f":"(1.62+1.42)/2-1.03","v":0.49},0.115,"NA","NA","NA","NA",1.65,5.5,1,1,null,null,null,null,null,null,null,null,null,null,null,null,null,0,null,{"$f":"VSUPPLY-AC49","v":3.3},1.5,3,4.8,0.5,1.5,3,0.8,1.5,3,"Low-HighB",1,"TO-92|3","9 mm2: 1.52 x 4 (TO-92|3)",6000,750,"-40 to 85","$0.194 | 1ku"]
["DRV5032FDDMR","DS","Low power (5 Hz, <1µA), low voltage (up to 5.5V) switch","Unipolar switch","N",null,null,null,null,null,null,1.65,5.5,1,1,null,null,null,null,null,null,null,null,null,null,null,null,null,0,null,3.3,-4.8,-3,-1.5,-3,-1.5,-0.5,0.8,1.5,3,"Low North, High North",2,"X2SON|4","2 mm2: 1.1 x 1.4 (X2SON|4)",6000,750,"-40 to 85","$0.194 | 1ku"]
["DRV5032FDLPG","DS","Low power (5 Hz, <1µA), low voltage (up to 5.5V) switch","Unipolar switch","N",{"$f":"(1.62+1.42)/2-1.03","v":0.49},0.115,"NA","NA","NA","NA",1.65,5.5,1,1,null,null,null,null,null,null,null,null,null,null,null,null,null,0,null,{"$f":"VSUPPLY-AC51","v":3.3},-4.8,-3,-1.5,-3,-1.5,-0.5,0.8,1.5,3,"High North",1,"TO-92|3","6 mm2: 1.52 x 4 (TO-92|3)",6000,750,"-40 to 85","$0.194 | 1ku"]
["DRV5032AJDBZ","DS","Low power (5 Hz, <1µA), low voltage (up to 5.5V) switch","Omnipolar switch","N","NA","NA","NA","NA",{"$f":"1.12-0.65","v":0.47000000000000008},0.08,1.65,5.5,1,1,null,null,null,null,null,null,null,null,null,null,null,null,null,0,null,3.3,4,7,9.5,3,5.6,7.5,0.5,1.4,3,"Low-HighB",2,"SOT-23|3","7 mm2: 2.37 x 2.92 (SOT-23|3)",6000,750,"-40 to 85","$0.194 | 1ku"]
["DRV5032AJDMR","DS","Low power (5 Hz, <1µA), low voltage (up to 5.5V) switch","Omnipolar switch","N",null,null,null,null,null,null,1.65,5.5,1,1,null,null,null,null,null,null,null,null,null,null,null,null,null,0,null,{"$f":"VSUPPLY-AC53","v":3.3},4,7,9.5,3,5.6,7.5,0.5,1.4,3,"Low-HighB",2,"X2SON|4","2 mm2: 1.1 x 1.4 (X2SON|4)",6000,750,"-40 to 85","$0.194 | 1ku"]
["DRV5032AJLPG","DS","Low power (5 Hz, <1µA), low voltage (up to 5.5V) switch","Omnipolar switch","N",{"$f":"(1.62+1.42)/2-1.03","v":0.49},0.115,"NA","NA","NA","NA",1.65,5.5,1,1,null,null,null,null,null,null,null,null,null,null,null,null,null,0,null,{"$f":"VSUPPLY-AC54","v":3.3},4,7,9.5,3,5.6,7.5,0.5,1.4,3,"Low-HighB",1,"TO-92|3","6 mm2: 1.52 x 4 (TO-92|3)",6000,750,"-40 to 85","$0.194 | 1ku"]
["DRV5032ZEDBZ","DS","Low power (5 Hz, <1µA), low voltage (up to 5.5V) switch","Omnipolar switch","N","NA","NA","NA","NA",{"$f":"1.12-0.65","v":0.47000000000000008},0.08,1.65,5.5,1,1,null,null,null,null,null,null,null,null,null,null,null,null,null,0,null,3.3,33,47,63,30,43,58,1.2,4,8.5,"Low-HighB",2,"SOT-23|3","10 mm2: 2.37 x 2.92 (SOT-23|3)",6000,750,"-40 to 85","$0.194 | 1ku"]
["DRV5032ZELPG","DS","Low power (5 Hz, <1µA), low voltage (up to 5.5V) switch","Omnipolar switch","N",{"$f":"(1.62+1.42)/2-1.03","v":0.49},0.115,"NA","NA","NA","NA",1.65,5.5,1,1,null,null,null,null,null,null,null,null,null,null,null,null,null,0,null,{"$f":"VSUPPLY-AC56","v":3.3},33,47,63,30,43,58,1.2,4,8.5,"Low-HighB",1,"TO-92|3","9 mm2: 1.52 x 4 (TO-92|3)",6000,750,"-40 to 85","$0.194 | 1ku"]
["DRV5023FAQDBZ","DS","High voltage (up to 38V), high bandwidth (up to 30 kHz) unipolar switch","Unipolar switch","Y","NA","NA","NA","NA",{"$f":"1.12-0.7","v":0.42000000000000015},0.05,2.5,38,1,1,null,2.7,3.5,null,null,null,null,null,null,null,null,null,null,0,null,3.3,1.8,3.5,6.8,0.5,2,4.2,null,1.5,null,"High North",2,"SOT-23|3","7 mm2: 2.37 x 2.92 (SOT-23|3)",2500,500,"-40 to 125","$0.250 | 1ku"]
["DRV5023AJQDBZ","DS","High voltage (up to 38V), high bandwidth (up to 30 kHz) unipolar switch","Unipolar switch","Y","NA","NA","NA","NA",{"$f":"1.12-0.7","v":0.42000000000000015},0.05,2.5,38,1,1,null,2.7,3.5,null,null,null,null,null,null,null,null,null,null,0,null,3.3,3,6.9,12,1,3.2,5,null,3.7,null,"High North",2,"SOT-23|3","7 mm2: 2.37 x 2.92 (SOT-23|3)",2500,500,"-40 to 125","$0.250 | 1ku"]
["DRV5023AJQLPG","DS","High voltage (up to 38V), high bandwidth (up to 30 kHz) unipolar switch","Unipolar switch","Y",{"$f":"(1.62+1.42)/2-0.987","v":0.53300000000000003},0.05,"NA","NA","NA","NA",2.5,38,1,1,null,2.7,3.5,null,null,null,null,null,null,null,null,null,null,0,null,{"$f":"VSUPPLY-AC59","v":3.3},3,6.9,12,1,3.2,5,null,3.7,null,"High North",1,"TO-92|3","6 mm2: 1.52 x 4 (TO-92|3)",2500,500,"-40 to 125","$0.250 | 1ku"]
["DRV5023BIQDBZ","DS","High voltage (up to 38V), high bandwidth (up to 30 kHz) unipolar switch","Unipolar switch","Y","NA","NA","NA","NA",{"$f":"1.12-0.7","v":0.42000000000000015},0.05,2.5,38,1,1,null,2.7,3.5,null,null,null,null,null,null,null,null,null,null,0,null,3.3,6,14.5,24,3,6,9,null,8.5,null,"High North",2,"SOT-23|3","7 mm2: 2.37 x 2.92 (SOT-23|3)",2500,500,"-40 to 125","$0.250 | 1ku"]
["DRV5023BIQLPG","DS","High voltage (up to 38V), high bandwidth (up to 30 kHz) unipolar switch","Unipolar switch","Y",{"$f":"(1.62+1.42)/2-0.987","v":0.53300000000000003},0.05,"NA","NA","NA","NA",2.5,38,1,1,null,2.7,3.5,null,null,null,null,null,null,null,null,null,null,0,null,3.3,6,14.5,24,3,6,9,null,8.5,null,"High North",1,"TO-92|3","6 mm2: 1.52 x 4 (TO-92|3)",2500,500,"-40 to 125","$0.250 | 1ku"]
["DRV5033FAQDBZ","DS","High voltage (up to 38V), high bandwidth (up to 30 kHz) omnipolar switch","Omnipolar switch","Y","NA","NA","NA","NA",{"$f":"1.12-0.7","v":0.42000000000000015},0.05,2.5,38,1,1,null,2.7,3.6,null,null,null,null,null,null,null,null,null,null,0,null,3.3,1.8,3.5,6.8,0.5,2,4.2,null,1.5,null,"Low-HighB",2,"SOT-23|3","7 mm2: 2.37 x 2.92 (SOT-23|3)",2500,500,"-40 to 125","$0.250 | 1ku"]
["DRV5033AJQDBZ","DS","High voltage (up to 38V), high bandwidth (up to 30 kHz) omnipolar switch","Omnipolar switch","Y","NA","NA","NA","NA",{"$f":"1.12-0.7","v":0.42000000000000015},0.05,2.5,38,1,1,null,2.7,3.6,null,null,null,null,null,null,null,null,null,null,0,null,3.3,3,6.9,12,1,3.5,5,null,3.4,null,"Low-HighB",2,"SOT-23|3","7 mm2: 2.37 x 2.92 (SOT-23|3)",2500,500,"-40 to 125","$0.250 | 1ku"]
["DRV5033AJQLPG","DS","High voltage (up to 38V), high bandwidth (up to 30 kHz) omnipolar switch","Omnipolar switch","Y",{"$f":"(1.62+1.42)/2-0.987","v":0.53300000000000003},0.05,"NA","NA","NA","NA",2.5,38,1,1,null,2.7,3.6,null,null,null,null,null,null,null,null,null,null,0,null,3.3,3,6.9,12,1,3.5,5,null,3.4,null,"Low-HighB",1,"TO-92|3"," 6 mm2: 1.52 x 4 (TO-92|3)",2500,500,"-40 to 125","$0.250 | 1ku"]
["DRV5013ADQDBZ","DS","High voltage (up to 38-V), high bandwidth (30-kHz) Hall effect latch","Latch","Y","NA","NA","NA","NA",{"$f":"1.12-0.7","v":0.42000000000000015},0.05,2.5,38,1,1,null,2.7,3.5,null,null,null,null,null,null,null,null,null,null,null,null,null,null,null,null,null,null,null,null,5.4,null,"High North",2,"SOT-23|3","7 mm2: 2.37 x 2.92 (SOT-23|3)",2500,500,"-40 to 125","$0.100 | 1ku"]
["DRV5013ADQLPG","DS","High voltage (up to 38-V), high bandwidth (30-kHz) Hall effect latch","Latch","Y",{"$f":"(1.62+1.42)/2-0.987","v":0.53300000000000003},0.05,"NA","NA","NA","NA",2.5,38,1,1,null,2.7,3.5,null,null,null,null,null,null,null,null,null,null,null,null,null,null,null,null,null,null,null,null,5.4,null,"High North",1," TO-92|3","6 mm2: 1.52 x 4 (TO-92|3)",2500,500,"-40 to 125","$0.100 | 1ku"]
["DRV5013AGQDBZ","DS","High voltage (up to 38-V), high bandwidth (30-kHz) Hall effect latch","Latch","Y","NA","NA","NA","NA",{"$f":"1.12-0.7","v":0.42000000000000015},0.05,2.5,38,{"$f":"LEN(M67)-LEN(SUBSTITUTE(M67,\";\",\"\"))+1","v":1},1,null,2.7,3.5,null,null,null,null,null,null,null,null,null,null,null,null,null,null,null,null,null,null,null,null,12,null,"High North",2,"SOT-23|3","7 mm2: 2.37 x 2.92 (SOT-23|3)",2500,500,"-40 to 125","$0.100 | 1ku"]
["DRV5013AGQLPG","DS","High voltage (up to 38-V), high bandwidth (30-kHz) Hall effect latch","Latch","Y",{"$f":"(1.62+1.42)/2-0.987","v":0.53300000000000003},0.05,"NA","NA","NA","NA",2.5,38,1,1,null,2.7,3.5,null,null,null,null,null,null,null,null,null,null,null,null,null,null,null,null,null,null,null,null,12,null,"High North",1,"TO-92|3","6 mm2: 1.52 x 4 (TO-92|3)",2500,500,"-40 to 125","$0.100 | 1ku"]
["DRV5013BCELPE","DS","High voltage (up to 38-V), high bandwidth (30-kHz) Hall effect latch","Latch","Y",{"$f":"(1.62+1.42)/2-0.987","v":0.53300000000000003},0.05,"NA","NA","NA","NA",2.5,38,1,1,null,2.7,3.5,null,null,null,null,null,null,null,null,null,null,null,null,null,null,null,null,null,null,null,null,24,null,"High North",1,"TO-92|3","6 mm2: 1.52 x 4 (TO-92|3)",2500,500,"-40 to 125","$0.100 | 1ku"]
["DRV5013BCQDBZ","DS","High voltage (up to 38-V), high bandwidth (30-kHz) Hall effect latch","Latch","Y","NA","NA","NA","NA",{"$f":"1.12-0.7","v":0.42000000000000015},0.05,2.5,38,1,1,null,2.7,3.5,null,null,null,null,null,null,null,null,null,null,null,null,null,null,null,null,null,null,null,null,24,null,"High North",2,"SOT-23|3","7 mm2: 2.37 x 2.92 (SOT-23|3)",2500,500,"-40 to 125","$0.100 | 1ku"]
["DRV5013BCQLPG","DS","High voltage (up to 38-V), high bandwidth (30-kHz) Hall effect latch","Latch","Y",{"$f":"(1.62+1.42)/2-0.987","v":0.53300000000000003},0.05,"NA","NA","NA","NA",2.5,38,1,1,null,2.7,3.5,null,null,null,null,null,null,null,null,null,null,null,null,null,null,null,null,null,null,null,null,24,null,"High North",1,"TO-92|3","6 mm2: 1.52 x 4 (TO-92|3)",2500,500,"-40 to 125","$0.100 | 1ku"]
["DRV5013FAQDBZ","DS","High voltage (up to 38-V), high bandwidth (30-kHz) Hall effect latch","Latch","Y","NA","NA","NA","NA",{"$f":"1.12-0.7","v":0.42000000000000015},0.05,2.5,38,1,1,null,2.7,3.5,null,null,null,null,null,null,null,null,null,null,null,null,null,null,null,null,null,null,null,1.2,2.6,null,"High North",2,"SOT-23|3","7 mm2: 2.37 x 2.92 (SOT-23|3)",2500,500,"-40 to 125","$0.100 | 1ku"]
["DRV5057A1QDBZ","DS","Linear hall effect sensor with digital PWM output","Ratiometric PWM output","Y","NA","NA","NA","NA",{"$f":"1.12-0.65","v":0.47000000000000008},0.08,"4.5; 3","5.5; 3.63",2,2,null,6,10,null,null,null,"2, 1.2",null,null,null,null,null,null,null,null,null,null,null,null,null,null,null,null,null,null,null,2,"SOT-23|3","7 mm2: 2.37 x 2.92 (SOT-23|3)",3000,750,"-40 to 125","$0.650 | 1ku"]
["DRV5057A1QLPG","DS","Linear hall effect sensor with digital PWM output","Ratiometric PWM output","Y",{"$f":"(1.62+1.42)/2-1.03","v":0.49},0.115,"NA","NA","NA","NA","4.5; 3","5.5; 3.63",2,2,null,6,10,null,null,null,"2, 1.2",null,null,null,null,null,null,null,null,null,null,null,null,null,null,null,null,null,null,null,1,"TO-92|3","6 mm2: 1.52 x 4 (TO-92|3)",3000,750,"-40 to 125","$0.650 | 1ku"]
["DRV5057A2QDBZ","DS","Linear hall effect sensor with digital PWM output","Ratiometric PWM output","Y","NA","NA","NA","NA",{"$f":"1.12-0.65","v":0.47000000000000008},0.08,"4.5; 3","5.5; 3.63",2,2,null,6,10,null,null,null,"1, 0.6",null,null,null,null,null,null,null,null,null,null,null,null,null,null,null,null,null,null,null,2,"SOT-23|3","7 mm2: 2.37 x 2.92 (SOT-23|3)",3000,750,"-40 to 125","$0.650 | 1ku"]
["DRV5057A2QLPG","DS","Linear hall effect sensor with digital PWM output","Ratiometric PWM output","Y",{"$f":"(1.62+1.42)/2-1.03","v":0.49},0.115,"NA","NA","NA","NA","4.5; 3","5.5; 3.63",2,2,null,6,10,null,null,null,"1, 0.6",null,null,null,null,null,null,null,null,null,null,null,null,null,null,null,null,null,null,null,1,"TO-92|3","6 mm2: 1.52 x 4 (TO-92|3)",3000,750,"-40 to 125","$0.650 | 1ku"]
["DRV5057A3QDBZ","DS","Linear hall effect sensor with digital PWM output","Ratiometric PWM output","Y","NA","NA","NA","NA",{"$f":"1.12-0.65","v":0.47000000000000008},0.08,"4.5; 3","5.5; 3.63",2,2,null,6,10,null,null,null,"0.5, 0.3",null,null,null,null,null,null,null,null,null,null,null,null,null,null,null,null,null,null,null,2,"SOT-23|3","7 mm2: 2.37 x 2.92 (SOT-23|3)",3000,750,"-40 to 125","$0.650 | 1ku"]
["DRV5057A3QLPG","DS","Linear hall effect sensor with digital PWM output","Ratiometric PWM output","Y",{"$f":"(1.62+1.42)/2-1.03","v":0.49},0.115,"NA","NA","NA","NA","4.5; 3","5.5; 3.63",2,2,null,6,10,null,null,null,"0.5, 0.3",null,null,null,null,null,null,null,null,null,null,null,null,null,null,null,null,null,null,null,1,"TO-92|3","6 mm2: 1.52 x 4 (TO-92|3)",3000,750,"-40 to 125","$0.650 | 1ku"]
["DRV5057A4QDBZ","DS","Linear hall effect sensor with digital PWM output","Ratiometric PWM output","Y","NA","NA","NA","NA",{"$f":"1.12-0.65","v":0.47000000000000008},0.08,"4.5; 3","5.5; 3.63",2,2,null,6,10,null,null,null,"0.25, 0.15",null,null,null,null,null,null,null,null,null,null,null,null,null,null,null,null,null,null,null,2,"SOT-23|3","7 mm2: 2.37 x 2.92 (SOT-23|3)",3000,750,"-40 to 125","$0.650 | 1ku"]
["DRV5057A4QLPG","DS","Linear hall effect sensor with digital PWM output","Ratiometric PWM output","Y",{"$f":"(1.62+1.42)/2-1.03","v":0.49},0.115,"NA","NA","NA","NA","4.5; 3","5.5; 3.63",2,2,null,6,10,null,null,null,"0.25, 0.15",null,null,null,null,null,null,null,null,null,null,null,null,null,null,null,null,null,null,null,1,"TO-92|3","6 mm2: 1.52 x 4 (TO-92|3)",3000,750,"-40 to 125","$0.650 | 1ku"]
["DRV5056A1QDBZ","DS","Ratiometric unipolar linear hall effect sensor with analog output","Ratiometric unipolar","Y","NA","NA","NA","NA",{"$f":"1.12-0.65","v":0.47000000000000008},0.08,"4.5; 3","5.5; 3.6",2,2,null,6,10,"190, 114","200,  120","210, 126",null,null,"0.12, 0.2, z","0.06, 0.1","20, 19",0.6,{"$f":"AA81","v":0.6},{"$f":"0.2","v":0.2},{"$f":"AB81","v":0.6},{"$f":"VSUPPLY-AC81","v":3.0999999999999996},null,null,null,null,null,null,null,null,null,null,2,"SOT-23|3","7 mm2: 2.37 x 2.92 (SOT-23|3)",2500,750,"-40 to 125","$0.540 | 1ku"]
["DRV5056A1QLPG","DS","Ratiometric unipolar linear hall effect sensor with analog output","Ratiometric unipolar","Y",{"$f":"(1.62+1.42)/2-1.03","v":0.49},0.115,"NA","NA","NA","NA","4.5; 3","5.5; 3.6",2,2,null,6,10,"190, 114","200,  120","210, 126",null,null,"0.12, 0.2, z","0.06, 0.2","20, 19",0.6,0.6,0.2,{"$f":"AB82","v":0.6},{"$f":"VSUPPLY-AC82","v":3.0999999999999996},null,null,null,null,null,null,null,null,null,null,1,"TO-92|3","6 mm2: 1.52 x 4 (TO-92|3)",2500,750,"-40 to 125","$0.540 | 1ku"]
["DRV5056A2QDBZ","DS","Ratiometric unipolar linear hall effect sensor with analog output","Ratiometric unipolar","Y","NA","NA","NA","NA",{"$f":"1.12-0.65","v":0.47000000000000008},0.08,"4.5; 3","5.5; 3.6",2,2,null,6,10,"95, 57","100, 60","105, 63",null,null,"0.12, 0.2","0.06, 0.1","39, 39",0.6,0.6,0.2,0.6,3.0999999999999996,null,null,null,null,null,null,null,null,null,null,2,"SOT-23|3","7 mm2: 2.37 x 2.92 (SOT-23|3)",2500,750,"-40 to 125","$0.540 | 1ku"]
["DRV5056A2QLPG","DS","Ratiometric unipolar linear hall effect sensor with analog output","Ratiometric unipolar","Y",{"$f":"(1.62+1.42)/2-1.03","v":0.49},0.115,"NA","NA","NA","NA","4.5; 3","5.5; 3.6",2,2,null,6,10,"95, 57","100, 60","105, 63",null,null,"0.12, 0.2","0.06, 0.1","39, 39",0.6,0.6,0.2,{"$f":"AB84","v":0.6},{"$f":"VSUPPLY-AC84","v":3.0999999999999996},null,null,null,null,null,null,null,null,null,null,1,"TO-92|3","6 mm2: 1.52 x 4 (TO-92|3)",2500,750,"-40 to 125","$0.540 | 1ku"]
["DRV5056A3QDBZ","DS","Ratiometric unipolar linear hall effect sensor with analog output","Ratiometric unipolar","Y","NA","NA","NA","NA",{"$f":"1.12-0.65","v":0.47000000000000008},0.08,"4.5; 3","5.5; 3.6",2,2,null,6,10,"47.5, 28.5","50, 30","52.5, 31.5",null,null,"0.12, 0.2","0.06, 0.1","79, 78",0.6,0.6,0.2,0.6,3.0999999999999996,null,null,null,null,null,null,null,null,null,null,2,"SOT-23|3","7 mm2: 2.37 x 2.92 (SOT-23|3)",2500,750,"-40 to 125","$0.540 | 1ku"]
["DRV5056A3QLPG","DS","Ratiometric unipolar linear hall effect sensor with analog output","Ratiometric unipolar","Y",{"$f":"(1.62+1.42)/2-1.03","v":0.49},0.115,"NA","NA","NA","NA","4.5; 3","5.5; 3.6",2,2,null,6,10,"47.5, 28.5","50, 30","52.5, 31.5",null,null,"0.12, 0.2","0.06, 0.1","79, 78",0.6,0.6,0.2,{"$f":"AB86","v":0.6},{"$f":"VSUPPLY-AC86","v":3.0999999999999996},null,null,null,null,null,null,null,null,null,null,1,"TO-92|3","6 mm2: 1.52 x 4 (TO-92|3)",2500,750,"-40 to 125","$0.540 | 1ku"]
["DRV5056A4QDBZ","DS","Ratiometric unipolar linear hall effect sensor with analog output","Ratiometric unipolar","Y","NA","NA","NA","NA",{"$f":"1.12-0.65","v":0.47000000000000008},0.08,"4.5; 3","5.5; 3.6",2,2,null,6,10,"23.8, 14.3","25, 15","26.2, 15.8",null,null,"0.12, 0.2","0.06, 0.1","158,  155",0.6,0.6,0.2,0.6,3.0999999999999996,null,null,null,null,null,null,null,null,null,null,2,"SOT-23|3","7 mm2: 2.37 x 2.92 (SOT-23|3)",2500,750,"-40 to 125","$0.540 | 1ku"]
["DRV5056A4QLPG","DS","Ratiometric unipolar linear hall effect sensor with analog output","Ratiometric unipolar","Y",{"$f":"(1.62+1.42)/2-1.03","v":0.49},0.115,"NA","NA","NA","NA","4.5; 3","5.5; 3.6",2,2,null,6,10,"23.8, 14.3","25, 15","26.2, 15.8",null,null,"0.12, 0.2","0.06, 0.1","158,  155",0.6,0.6,0.2,{"$f":"AB88","v":0.6},{"$f":"VSUPPLY-AC88","v":3.0999999999999996},null,null,null,null,null,null,null,null,null,null,1,"TO-92|3","6 mm2: 1.52 x 4 (TO-92|3)",2500,750,"-40 to 125","$0.540 | 1ku"]
["DRV5055A1QDBZ","DS","Ratiometric linear hall effect sensor with analog output","Ratiometric bipolar","Y","NA","NA","NA","NA",{"$f":"1.12-0.65","v":0.47000000000000008},0.08,"4.5; 3","5.5; 3.63",2,2,null,6,10,"95, 57","100, 60","105, 63",null,null,"0.12, 0.2","0.06, 0.1","21, 22",2.5,0.2,0.2,0.2,3.0999999999999996,null,null,null,null,null,null,null,null,null,null,2,"SOT-23|3","7 mm2: 2.37 x 2.92 (SOT-23|3)",2500,750,"-40 to 125","$0.500 | 1ku"]
["DRV5055A1QLPG","DS","Ratiometric linear hall effect sensor with analog output","Ratiometric bipolar","Y",{"$f":"(1.62+1.42)/2-1.03","v":0.49},0.115,"NA","NA","NA","NA","4.5; 3","5.5; 3.63",2,2,null,6,10,"95, 57","100, 60","105, 63",null,null,"0.12, 0.2","0.06, 0.1","21, 22",2.5,0.2,0.2,{"$f":"AB90","v":0.2},{"$f":"VSUPPLY-AC90","v":3.0999999999999996},null,null,null,null,null,null,null,null,null,null,1,"TO-92|3","6 mm2: 1.52 x 4 (TO-92|3)",2500,750,"-40 to 125","$0.500 | 1ku"]
["DRV5055A2QDBZ","DS","Ratiometric linear hall effect sensor with analog output","Ratiometric bipolar","Y","NA","NA","NA","NA",{"$f":"1.12-0.65","v":0.47000000000000008},0.08,"4.5; 3","5.5; 3.63",2,2,null,6,10,"47.5, 28.5","50, 30","52.5, 31.5",null,null,"0.12, 0.2","0.06, 0.1","42, 44",2.5,0.2,0.2,0.2,3.0999999999999996,null,null,null,null,null,null,null,null,null,null,2,"SOT-23|3","7 mm2: 2.37 x 2.92 (SOT-23|3)",2500,750,"-40 to 125","$0.500 | 1ku"]
["DRV5055A2QLPG","DS","Ratiometric linear hall effect sensor with analog output","Ratiometric bipolar","Y",{"$f":"(1.62+1.42)/2-1.03","v":0.49},0.115,"NA","NA","NA","NA","4.5; 3","5.5; 3.63",2,2,null,6,10,"47.5, 28.5","50, 30","52.5, 31.5",null,null,"0.12, 0.2","0.06, 0.1","42, 44",2.5,0.2,0.2,{"$f":"AB92","v":0.2},{"$f":"VSUPPLY-AC92","v":3.0999999999999996},null,null,null,null,null,null,null,null,null,null,1,"TO-92|3","6 mm2: 1.52 x 4 (TO-92|3)",2500,750,"-40 to 125","$0.500 | 1ku"]
["DRV5055A3QDBZ","DS","Ratiometric linear hall effect sensor with analog output","Ratiometric bipolar","Y","NA","NA","NA","NA",{"$f":"1.12-0.65","v":0.47000000000000008},0.08,"4.5; 3","5.5; 3.63",2,2,null,6,10,"23.8, 14.3","25, 15","26.2, 15.8",null,null,"0.12, 0.2","0.06, 0.1","85, 88",2.5,0.2,0.2,0.2,3.0999999999999996,null,null,null,null,null,null,null,null,null,null,2,"SOT-23|3","7 mm2: 2.37 x 2.92 (SOT-23|3)",2500,750,"-40 to 125","$0.500 | 1ku"]
["DRV5055A3QLPG","DS","Ratiometric linear hall effect sensor with analog output","Ratiometric bipolar","Y",{"$f":"(1.62+1.42)/2-1.03","v":0.49},0.115,"NA","NA","NA","NA","4.5; 3","5.5; 3.63",2,2,null,6,10,"23.8, 14.3","25, 15","26.2, 15.8",null,null,"0.12, 0.2","0.06, 0.1","85, 88",2.5,0.2,0.2,{"$f":"AB94","v":0.2},{"$f":"VSUPPLY-AC94","v":3.0999999999999996},null,null,null,null,null,null,null,null,null,null,1,"TO-92|3","6 mm2: 1.52 x 4 (TO-92|3)",2500,750,"-40 to 125","$0.500 | 1ku"]
["DRV5055A4QDBZ","DS","Ratiometric linear hall effect sensor with analog output","Ratiometric bipolar","Y","NA","NA","NA","NA",{"$f":"1.12-0.65","v":0.47000000000000008},0.08,"4.5; 3","5.5; 3.63",2,2,null,6,10,"11.9, 7.1","12.5, 7.5","13.2, 7.9",null,null,"0.12, 0.2","0.06, 0.1","169, 176",2.5,0.2,0.2,0.2,3.0999999999999996,null,null,null,null,null,null,null,null,null,null,2,"SOT-23|3","7 mm2: 2.37 x 2.92 (SOT-23|3)",2500,750,"-40 to 125","$0.500 | 1ku"]
["DRV5055A4QLPG","DS","Ratiometric linear hall effect sensor with analog output","Ratiometric bipolar","Y",{"$f":"(1.62+1.42)/2-1.03","v":0.49},0.115,"NA","NA","NA","NA","4.5; 3","5.5; 3.63",2,2,null,6,10,"11.9, 7.1","12.5, 7.5","13.2, 7.9",null,null,"0.12, 0.2","0.06, 0.1","169, 176",2.5,0.2,0.2,{"$f":"AB96","v":0.2},{"$f":"VSUPPLY-AC96","v":3.0999999999999996},null,null,null,null,null,null,null,null,null,null,1,"TO-92|3","6 mm2: 1.52 x 4 (TO-92|3)",2500,750,"-40 to 125","$0.500 | 1ku"]
["DRV5053OAQDBZ","DS","Automotive, high voltage (up to 38V), linear hall effect sensor","Bipolar","Y","NA","NA","NA","NA",{"$f":"1.12-0.7","v":0.42000000000000015},0.05,2.5,3.8,1,1,null,2.7,3.6,-17.5,-11,-5,null,null,0.49,{"$f":"X97/2","v":0.245},73,1.02,0.2,null,{"$f":"AB97","v":0.2},1.8,null,null,null,null,null,null,null,null,null,null,2,"SOT-23|3","7 mm2: 2.37 x 2.92 (SOT-23|3)",2500,500,"-40 to 125","$0.366 | 1ku"]
["DRV5053OAQLPG","DS","Automotive, high voltage (up to 38V), linear hall effect sensor","Bipolar","Y",{"$f":"(1.62+1.42)/2-0.987","v":0.53300000000000003},0.05,"NA","NA","NA","NA",2.5,3.8,1,1,null,2.7,3.6,-17.5,-11,-5,null,null,0.49,{"$f":"X98/2","v":0.245},73,1.02,0.2,null,{"$f":"AB98","v":0.2},1.8,null,null,null,null,null,null,null,null,null,null,1,"TO-92|3"," 6 mm2: 1.52 x 4 (TO-92|3)",2500,500,"-40 to 125","$0.366 | 1ku"]
["DRV5053PAQDBZ","DS","Automotive, high voltage (up to 38V), linear hall effect sensor","Bipolar","Y","NA","NA","NA","NA",{"$f":"1.12-0.7","v":0.42000000000000015},0.05,2.5,3.8,1,1,null,2.7,3.6,-35,-23,-10,null,null,0.49,0.245,35,1.02,0.2,null,0.2,1.8,null,null,null,null,null,null,null,null,null,null,2,"SOT-23|3","7 mm2: 2.37 x 2.92 (SOT-23|3)",2500,500,"-40 to 125","$0.366 | 1ku"]
["DRV5053PAQLPG","DS","Automotive, high voltage (up to 38V), linear hall effect sensor","Bipolar","Y",{"$f":"(1.62+1.42)/2-0.987","v":0.53300000000000003},0.05,"NA","NA","NA","NA",2.5,3.8,1,1,null,2.7,3.6,-35,-23,-10,null,null,0.49,{"$f":"X100/2","v":0.245},35,1.02,0.2,null,{"$f":"AB100","v":0.2},1.8,null,null,null,null,null,null,null,null,null,null,1,"TO-92|3"," 6 mm2: 1.52 x 4 (TO-92|3)",2500,500,"-40 to 125","$0.366 | 1ku"]
["DRV5053RAQDBZ","DS","Automotive, high voltage (up to 38V), linear hall effect sensor","Bipolar","Y","NA","NA","NA","NA",{"$f":"1.12-0.7","v":0.42000000000000015},0.05,2.5,3.8,1,1,null,2.7,3.6,-70,-45,-20,null,null,0.49,0.245,18,1.02,0.2,null,0.2,1.8,null,null,null,null,null,null,null,null,null,null,2,"SOT-23|3","7 mm2: 2.37 x 2.92 (SOT-23|3)",2500,500,"-40 to 125","$0.366 | 1ku"]
["DRV5053RAQLPG","DS","Automotive, high voltage (up to 38V), linear hall effect sensor","Bipolar","Y",{"$f":"(1.62+1.42)/2-0.987","v":0.53300000000000003},0.05,"NA","NA","NA","NA",2.5,3.8,1,1,null,2.7,3.6,-70,-45,-20,null,null,0.49,{"$f":"X102/2","v":0.245},18,1.02,0.2,null,{"$f":"AB102","v":0.2},1.8,null,null,null,null,null,null,null,null,null,null,1,"TO-92|3"," 6 mm2: 1.52 x 4 (TO-92|3)",2500,500,"-40 to 125","$0.366 | 1ku"]
["DRV5053VAQDBZ","DS","Automotive, high voltage (up to 38V), linear hall effect sensor","Bipolar","Y","NA","NA","NA","NA",{"$f":"1.12-0.7","v":0.42000000000000015},0.05,2.5,3.8,1,1,null,2.7,3.6,-140,-90,-45,null,null,0.49,0.245,9,1.02,0.2,null,0.2,1.8,null,null,null,null,null,null,null,null,null,null,2,"SOT-23|3","7 mm2: 2.37 x 2.92 (SOT-23|3)",2500,500,"-40 to 125","$0.366 | 1ku"]
["DRV5053VAQLPG","DS","Automotive, high voltage (up to 38V), linear hall effect sensor","Bipolar","Y",{"$f":"(1.62+1.42)/2-0.987","v":0.53300000000000003},0.05,"NA","NA","NA","NA",2.5,3.8,1,1,null,2.7,3.6,-140,-90,-45,null,null,0.49,{"$f":"X104/2","v":0.245},9,1.02,0.2,null,{"$f":"AB104","v":0.2},1.8,null,null,null,null,null,null,null,null,null,null,1,"TO-92|3"," 6 mm2: 1.52 x 4 (TO-92|3)",2500,500,"-40 to 125","$0.366 | 1ku"]
["DRV5053CAQDBZ","DS","Automotive, high voltage (up to 38V), linear hall effect sensor","Bipolar","Y","NA","NA","NA","NA",{"$f":"1.12-0.7","v":0.42000000000000015},0.05,2.5,3.8,1,1,null,2.7,3.6,10,23,35,null,null,0.49,0.245,35,1.02,0.2,null,0.2,1.8,null,null,null,null,null,null,null,null,null,null,2,"SOT-23|3","7 mm2: 2.37 x 2.92 (SOT-23|3)",2500,500,"-40 to 125","$0.366 | 1ku"]
["DRV5053CAQLPG","DS","Automotive, high voltage (up to 38V), linear hall effect sensor","Bipolar","Y",{"$f":"(1.62+1.42)/2-0.987","v":0.53300000000000003},0.05,"NA","NA","NA","NA",2.5,3.8,1,1,null,2.7,3.6,10,23,35,null,null,0.49,{"$f":"X106/2","v":0.245},35,1.02,0.2,null,{"$f":"AB106","v":0.2},1.8,null,null,null,null,null,null,null,null,null,null,1,"TO-92|3"," 6 mm2: 1.52 x 4 (TO-92|3)",2500,500,"-40 to 125","$0.366 | 1ku"]
["DRV5053EAQDBZ","DS","Automotive, high voltage (up to 38V), linear hall effect sensor","Bipolar","Y","NA","NA","NA","NA",{"$f":"1.12-0.7","v":0.42000000000000015},0.05,2.5,3.8,1,1,null,2.7,3.6,20,45,70,null,null,0.49,0.245,18,1.02,0.2,null,0.2,1.8,null,null,null,null,null,null,null,null,null,null,2,"SOT-23|3","7 mm2: 2.37 x 2.92 (SOT-23|3)",2500,500,"-40 to 125","$0.366 | 1ku"]
["DRV5053EAQLPG","DS","Automotive, high voltage (up to 38V), linear hall effect sensor","Bipolar","Y",{"$f":"(1.62+1.42)/2-0.987","v":0.53300000000000003},0.05,"NA","NA","NA","NA",2.5,3.8,1,1,null,2.7,3.6,20,45,70,null,null,0.49,{"$f":"X108/2","v":0.245},18,1.02,0.2,null,{"$f":"AB108","v":0.2},1.8,null,null,null,null,null,null,null,null,null,null,1,"TO-92|3"," 6 mm2: 1.52 x 4 (TO-92|3)",2500,500,"-40 to 125","$0.366 | 1ku"]

{"sheet":"DeviceComparison","index":5,"n_rows":1022,"n_cols":7,"rows_kept":1022,"cut":false,"hidden":true,"merged":[]}
["dx","dy","dz","Bx","By","Bz","angle"]
[0,0,3.4700000000000006,0,0,123.5621260890063,123.5621260890063]
[0,0,3.4964705882352947,0,0,122.18841032411521,122.18841032411521]
[0,0,3.5229411764705887,0,0,120.8146945592237,120.8146945592237]
[0,0,3.5494117647058827,0,0,119.44097879433261,119.44097879433261]
[0,0,3.5758823529411767,0,0,118.06726302944099,118.06726302944099]
[0,0,3.6023529411764708,0,0,116.69354726455001,116.69354726455001]
[0,0,3.6288235294117648,0,0,115.31983149965889,115.31983149965889]
[0,0,3.6552941176470588,0,0,113.9461157347673,113.9461157347673]
[0,0,3.6817647058823528,0,0,112.5723999698763,112.5723999698763]
[0,0,3.7082352941176469,0,0,111.1986842049847,111.1986842049847]
[0,0,3.7347058823529409,0,0,109.82496844009371,109.82496844009371]
[0,0,3.7611764705882349,0,0,108.4512526752026,108.4512526752026]
[0,0,3.7876470588235289,0,0,107.077536910311,107.077536910311]
[0,0,3.8141176470588229,0,0,105.70382114541999,105.70382114541999]
[0,0,3.840588235294117,0,0,104.33010538052841,104.33010538052841]
[0,0,3.867058823529411,0,0,102.95638961563731,102.95638961563731]
[0,0,3.893529411764705,0,0,101.58267385074581,101.58267385074581]
[0,0,3.919999999999999,0,0,100.2089580858547,100.2089580858547]
[0,0,3.9464705882352931,0,0,98.835242320963616,98.835242320963616]
[0,0,3.9729411764705871,0,0,97.461526556072073,97.461526556072073]
[0,0,3.9994117647058811,0,0,96.087810791180985,96.087810791180985]
[0,0,4.0258823529411751,0,0,94.714095026289471,94.714095026289471]
[0,0,4.0523529411764692,0,0,93.340379261398382,93.340379261398382]
[0,0,4.0788235294117632,0,0,91.966663496507337,91.966663496507337]
[0,0,4.1052941176470572,0,0,90.592947731615752,90.592947731615752]
[0,0,4.1317647058823512,0,0,89.219231966724649,89.219231966724649]
[0,0,4.1582352941176453,0,0,87.845516201833121,87.845516201833121]
[0,0,4.1847058823529393,0,0,86.471800436942033,86.471800436942033]
[0,0,4.2111764705882333,0,0,85.098084672051016,85.098084672051016]
[0,0,4.2376470588235273,0,0,83.724368907159416,83.724368907159416]
[0,0,4.2641176470588213,0,0,82.350653142268385,82.350653142268385]
[0,0,4.2905882352941154,0,0,80.976937377376771,80.976937377376771]
[0,0,4.3170588235294094,0,0,79.603221612485683,79.603221612485683]
[0,0,4.3435294117647034,0,0,78.229505847594666,78.229505847594666]
[0,0,4.3699999999999974,0,0,76.855790082703052,76.855790082703052]
[0,0,4.3964705882352915,0,0,75.482074317812035,75.482074317812035]
[0,0,4.4229411764705855,0,0,74.108358552920507,74.108358552920507]
[0,0,4.4494117647058795,0,0,72.734642788029404,72.734642788029404]
[0,0,4.4758823529411735,0,0,71.895668481122371,71.895668481122371]
[0,0,4.5023529411764676,0,0,71.391528637786266,71.391528637786266]
[0,0,4.5288235294117616,0,0,70.887388794450374,70.887388794450374]
[0,0,4.5552941176470556,0,0,70.383248951114268,70.383248951114268]
[0,0,4.5817647058823496,0,0,69.879109107778362,69.879109107778362]
[0,0,4.6082352941176437,0,0,69.374969264442456,69.374969264442456]
[0,0,4.6347058823529377,0,0,68.870829421106365,68.870829421106365]
[0,0,4.6611764705882317,0,0,68.366689577770458,68.366689577770458]
[0,0,4.6876470588235257,0,0,67.862549734434367,67.862549734434367]
[0,0,4.7141176470588197,0,0,67.358409891098475,67.358409891098475]
[0,0,4.7405882352941138,0,0,66.854270047762569,66.854270047762569]
[0,0,4.7670588235294078,0,0,66.350130204426478,66.350130204426478]
[0,0,4.7935294117647018,0,0,65.845990361090557,65.845990361090557]
[0,0,4.8199999999999958,0,0,65.341850517754466,65.341850517754466]
[0,0,4.8464705882352899,0,0,64.837710674418574,64.837710674418574]
[0,0,4.8729411764705839,0,0,64.333570831082653,64.333570831082653]
[0,0,4.8994117647058779,0,0,63.829430987746569,63.829430987746569]
[0,0,4.9258823529411719,0,0,63.32529114441067,63.32529114441067]
[0,0,4.952352941176466,0,0,62.821151301074558,62.821151301074558]
[0,0,4.97882352941176,0,0,62.317011457738673,62.317011457738673]
[0,0,5.005294117647054,0,0,61.812871614402781,61.812871614402781]
[0,0,5.031764705882348,0,0,61.308731771066668,61.308731771066668]
[0,0,5.0582352941176421,0,0,60.804591927730769,60.804591927730769]
[0,0,5.0847058823529361,0,0,60.300452084394685,60.300452084394685]
[0,0,5.1111764705882301,0,0,59.796312241058757,59.796312241058757]
[0,0,5.1376470588235241,0,0,59.292172397722872,59.292172397722872]
[0,0,5.1641176470588182,0,0,58.788032554386767,58.788032554386767]
[0,0,5.1905882352941122,0,0,58.283892711050861,58.283892711050861]
[0,0,5.2170588235294062,0,0,57.77975286771477,57.77975286771477]
[0,0,5.2435294117647002,0,0,57.275613024378863,57.275613024378863]
[0,0,5.2699999999999942,0,0,56.771473181042985,56.771473181042985]
[0,0,5.2964705882352883,0,0,56.26733333770688,56.26733333770688]
[0,0,5.3229411764705823,0,0,55.763193494370981,55.763193494370981]
[0,0,5.3494117647058763,0,0,55.259053651034883,55.259053651034883]
[0,0,5.3758823529411703,0,0,54.754913807698969,54.754913807698969]
[0,0,5.4023529411764644,0,0,54.250773964363056,54.250773964363056]
[0,0,5.4288235294117584,0,0,53.746634121026965,53.746634121026965]
[0,0,5.4552941176470524,0,0,53.242494277691073,53.242494277691073]
[0,0,5.4817647058823464,0,0,52.738354434354967,52.738354434354967]
[0,0,5.5082352941176405,0,0,52.234214591019068,52.234214591019068]
[0,0,5.5347058823529345,0,0,51.730074747683155,51.730074747683155]
[0,0,5.5611764705882285,0,0,51.225934904347064,51.225934904347064]
[0,0,5.5876470588235225,0,0,50.721795061011171,50.721795061011171]
[0,0,5.6141176470588166,0,0,50.217655217675059,50.217655217675059]
[0,0,5.6405882352941106,0,0,49.713515374339174,49.713515374339174]
[0,0,5.6670588235294046,0,0,49.209375531003261,49.209375531003261]
[0,0,5.6935294117646986,0,0,48.705235687667155,48.705235687667155]
[0,0,5.7199999999999926,0,0,48.201095844331256,48.201095844331256]
[0,0,5.7464705882352867,0,0,47.696956000995165,47.696956000995165]
[0,0,5.7729411764705807,0,0,47.192816157659287,47.192816157659287]
[0,0,5.7994117647058747,0,0,46.688676314323374,46.688676314323374]
[0,0,5.8258823529411687,0,0,46.184536470987283,46.184536470987283]
[0,0,5.8523529411764628,0,0,45.680396627651362,45.680396627651362]
[0,0,5.8788235294117568,0,0,45.176256784315257,45.176256784315257]
[0,0,5.9052941176470508,0,0,44.672116940979372,44.672116940979372]
[0,0,5.9317647058823448,0,0,44.167977097643465,44.167977097643465]
[0,0,5.9582352941176389,0,0,43.833040093478097,43.833040093478097]
[0,0,5.9847058823529329,0,0,43.514451352683139,43.514451352683139]
[0,0,6.0111764705882269,0,0,43.195862611888089,43.195862611888089]
[0,0,6.0376470588235209,0,0,42.877273871093145,42.877273871093145]
[0,0,6.064117647058815,0,0,42.558685130298201,42.558685130298201]
[0,0,6.090588235294109,0,0,42.240096389503144,42.240096389503144]
[0,0,6.117058823529403,0,0,41.921507648708179,41.921507648708179]
[0,0,6.143529411764697,0,0,41.602918907913121,41.602918907913121]
[0,0,6.169999999999991,0,0,41.284330167118171,41.284330167118171]
[0,0,6.1964705882352851,0,0,40.965741426323099,40.965741426323099]
[0,0,6.2229411764705791,0,0,40.647152685528162,40.647152685528162]
[0,0,6.2494117647058731,0,0,40.328563944733226,40.328563944733226]
[0,0,6.2758823529411671,0,0,40.009975203938168,40.009975203938168]
[0,0,6.3023529411764612,0,0,39.691386463143211,39.691386463143211]
[0,0,6.3288235294117552,0,0,39.37279772234816,39.37279772234816]
[0,0,6.3552941176470492,0,0,39.054208981553202,39.054208981553202]
[0,0,6.3817647058823432,0,0,38.735620240758273,38.735620240758273]
[0,0,6.4082352941176373,0,0,38.417031499963208,38.417031499963208]
[0,0,6.4347058823529313,0,0,38.09844275916825,38.09844275916825]
[0,0,6.4611764705882253,0,0,37.7798540183732,37.7798540183732]
[0,0,6.4876470588235193,0,0,37.461265277578249,37.461265277578249]
[0,0,6.5141176470588142,0,0,37.142676536783299,37.142676536783299]
[0,0,6.5405882352941092,0,0,36.824087795988255,36.824087795988255]
[0,0,6.5670588235294041,0,0,36.50549905519329,36.50549905519329]
[0,0,6.593529411764699,0,0,36.186910314398233,36.186910314398233]
[0,0,6.6199999999999939,0,0,35.868321573603289,35.868321573603289]
[0,0,6.6464705882352888,0,0,35.549732832808211,35.549732832808211]
[0,0,6.6729411764705837,0,0,35.231144092013295,35.231144092013295]
[0,0,6.6994117647058786,0,0,34.912555351218217,34.912555351218217]
[0,0,6.7258823529411735,0,0,34.59396661042328,34.59396661042328]
[0,0,6.7523529411764684,0,0,34.275377869628215,34.275377869628215]
[0,0,6.7788235294117634,0,0,33.956789128833272,33.956789128833272]
[0,0,6.8052941176470583,0,0,33.6382003880382,33.6382003880382]
[0,0,6.8317647058823532,0,0,33.319611647243256,33.319611647243256]
[0,0,6.8582352941176481,0,0,33.001022906448199,33.001022906448199]
[0,0,6.884705882352943,0,0,32.68243416565327,32.68243416565327]
[0,0,6.9111764705882379,0,0,32.363845424858191,32.363845424858191]
[0,0,6.9376470588235328,0,0,32.045256684063254,32.045256684063254]
[0,0,6.9641176470588277,0,0,31.726667943268193,31.726667943268193]
[0,0,6.9905882352941227,0,0,31.408079202473232,31.408079202473232]
[0,0,7.0170588235294176,0,0,31.089490461678167,31.089490461678167]
[0,0,7.0435294117647125,0,0,30.77090172088322,30.77090172088322]
[0,0,7.0700000000000074,0,0,30.45231298008818,30.45231298008818]
[0,0,7.0964705882353023,0,0,30.133724239293212,30.133724239293212]
[0,0,7.1229411764705972,0,0,29.81513549849814,29.81513549849814]
[0,0,7.1494117647058921,0,0,29.4965467577032,29.4965467577032]
[0,0,7.175882352941187,0,0,29.17795801690815,29.17795801690815]
[0,0,7.2023529411764819,0,0,28.859369276113213,28.859369276113213]
[0,0,7.2288235294117769,0,0,28.540780535318138,28.540780535318138]
[0,0,7.2552941176470718,0,0,28.222191794523201,28.222191794523201]
[0,0,7.2817647058823667,0,0,27.90360305372813,27.90360305372813]
[0,0,7.3082352941176616,0,0,27.58501431293319,27.58501431293319]
[0,0,7.3347058823529565,0,0,27.266425572138118,27.266425572138118]
[0,0,7.3611764705882514,0,0,26.947836831343192,26.947836831343192]
[0,0,7.3876470588235463,0,0,26.629248090548117,26.629248090548117]
[0,0,7.4141176470588412,0,0,26.34897648267582,26.34897648267582]
[0,0,7.4405882352941362,0,0,26.213862151805611,26.213862151805611]
[0,0,7.4670588235294311,0,0,26.078747820935462,26.078747820935462]
[0,0,7.493529411764726,0,0,25.94363349006526,25.94363349006526]
[0,0,7.5200000000000209,0,0,25.8085191591951,25.8085191591951]
[0,0,7.5464705882353158,0,0,25.673404828324898,25.673404828324898]
[0,0,7.5729411764706107,0,0,25.538290497454739,25.538290497454739]
[0,0,7.5994117647059056,0,0,25.403176166584551,25.403176166584551]
[0,0,7.6258823529412005,0,0,25.268061835714381,25.268061835714381]
[0,0,7.6523529411764954,0,0,25.132947504844189,25.132947504844189]
[0,0,7.6788235294117904,0,0,24.99783317397403,24.99783317397403]
[0,0,7.7052941176470853,0,0,24.862718843103828,24.862718843103828]
[0,0,7.7317647058823802,0,0,24.727604512233679,24.727604512233679]
[0,0,7.7582352941176751,0,0,24.59249018136347,24.59249018136347]
[0,0,7.78470588235297,0,0,24.457375850493321,24.457375850493321]
[0,0,7.8111764705882649,0,0,24.322261519623179,24.322261519623179]
[0,0,7.8376470588235598,0,0,24.18714718875297,24.18714718875297]
[0,0,7.8641176470588547,0,0,24.052032857882821,24.052032857882821]
[0,0,7.8905882352941497,0,0,23.916918527012619,23.916918527012619]
[0,0,7.9170588235294446,0,0,23.78180419614246,23.78180419614246]
[0,0,7.9435294117647395,0,0,23.646689865272258,23.646689865272258]
[0,0,7.9700000000000344,0,0,23.511575534402098,23.511575534402098]
[0,0,7.9964705882353293,0,0,23.37646120353191,23.37646120353191]
[0,0,8.0229411764706242,0,0,23.24134687266174,23.24134687266174]
[0,0,8.0494117647059191,0,0,23.106232541791549,23.106232541791549]
[0,0,8.075882352941214,0,0,22.971118210921389,22.971118210921389]
[0,0,8.1023529411765089,0,0,22.836003880051187,22.836003880051187]
[0,0,8.1288235294118039,0,0,22.700889549181039,22.700889549181039]
[0,0,8.1552941176470988,0,0,22.565775218310829,22.565775218310829]
[0,0,8.1817647058823937,0,0,22.430660887440681,22.430660887440681]
[0,0,8.2082352941176886,0,0,22.295546556570471,22.295546556570471]
[0,0,8.2347058823529835,0,0,22.16043222570033,22.16043222570033]
[0,0,8.2611764705882784,0,0,22.02531789483012,22.02531789483012]
[0,0,8.2876470588235733,0,0,21.890203563959979,21.890203563959979]
[0,0,8.3141176470588682,0,0,21.755089233089773,21.755089233089773]
[0,0,8.3405882352941632,0,0,21.619974902219617,21.619974902219617]
[0,0,8.3670588235294581,0,0,21.484860571349412,21.484860571349412]
[0,0,8.393529411764753,0,0,21.349746240479259,21.349746240479259]
[0,0,8.4200000000000479,0,0,21.214631909609061,21.214631909609061]
[0,0,8.4464705882353428,0,0,21.079517578738908,21.079517578738908]
[0,0,8.4729411764706377,0,0,20.94440324786871,20.94440324786871]
[0,0,8.4994117647059326,0,0,20.80928891699855,20.80928891699855]
[0,0,8.5258823529412275,0,0,20.674174586128501,20.674174586128501]
[0,0,8.5523529411765224,0,0,20.539060255258299,20.539060255258299]
[0,0,8.5788235294118174,0,0,20.40394592438809,20.40394592438809]
[0,0,8.6052941176471123,0,0,20.268831593517888,20.268831593517888]
[0,0,8.6317647058824072,0,0,20.133717262647689,20.133717262647689]
[0,0,8.6582352941177021,0,0,19.998602931777491,19.998602931777491]
[0,0,8.684705882352997,0,0,19.863488600907282,19.863488600907282]
[0,0,8.7111764705882919,0,0,19.728374270037079,19.728374270037079]
[0,0,8.7376470588235868,0,0,19.593259939166881,19.593259939166881]
[0,0,8.7641176470588817,0,0,19.458145608296668,19.458145608296668]
[0,0,8.7905882352941767,0,0,19.323031277426473,19.323031277426473]
[0,0,8.8170588235294716,0,0,19.18791694655626,19.18791694655626]
[0,0,8.8435294117647665,0,0,19.052802615686069,19.052802615686069]
[0,0,8.8700000000000614,0,0,18.91768828481586,18.91768828481586]
[0,0,8.8964705882353563,0,0,18.782573953945658,18.782573953945658]
[0,0,8.9229411764706512,0,0,18.647459623075452,18.647459623075452]
[0,0,8.9494117647059461,0,0,18.512345292205758,18.512345292205758]
[0,0,8.975882352941241,0,0,18.377230961335552,18.377230961335552]
[0,0,9.0023529411765359,0,0,18.24211663046535,18.24211663046535]
[0,0,9.0288235294118309,0,0,18.107002299595141,18.107002299595141]
[0,0,9.0552941176471258,0,0,17.97188796872495,17.97188796872495]
[0,0,9.0817647058824207,0,0,17.836773637854748,17.836773637854748]
[0,0,9.1082352941177156,0,0,17.701659306984538,17.701659306984538]
[0,0,9.1347058823530105,0,0,17.56654497611434,17.56654497611434]
[0,0,9.1611764705883054,0,0,17.431430645244131,17.431430645244131]
[0,0,9.1876470588236003,0,0,17.296316314373929,17.296316314373929]
[0,0,9.2141176470588952,0,0,17.16120198350372,17.16120198350372]
[0,0,9.2405882352941902,0,0,17.026087652633517,17.026087652633517]
[0,0,9.2670588235294851,0,0,16.890973321763322,16.890973321763322]
[0,0,9.29352941176478,0,0,16.75585899089312,16.75585899089312]
[0,0,9.3200000000000749,0,0,16.620744660022922,16.620744660022922]
[0,0,9.3464705882353698,0,0,16.485630329152709,16.485630329152709]
[0,0,9.3729411764706647,0,0,16.350515998282511,16.350515998282511]
[0,0,9.3994117647059596,0,0,16.215401667412301,16.215401667412301]
[0,0,9.4258823529412545,0,0,16.080287336542099,16.080287336542099]
[0,0,9.4523529411765495,0,0,15.945173005672411,15.945173005672411]
[0,0,9.4788235294118444,0,0,15.810058674802209,15.810058674802209]
[0,0,9.5052941176471393,0,0,15.674944343932001,15.674944343932001]
[0,0,9.5317647058824342,0,0,15.539830013061799,15.539830013061799]
[0,0,9.5582352941177291,0,0,15.404715682191592,15.404715682191592]
[0,0,9.584705882353024,0,0,15.26960135132139,15.26960135132139]
[0,0,9.6111764705883189,0,0,15.1344870204512,15.1344870204512]
[0,0,9.6376470588236138,0,0,14.999372689580991,14.999372689580991]
[0,0,9.6641176470589087,0,0,14.86425835871079,14.86425835871079]
[0,0,9.6905882352942037,0,0,14.729144027840579,14.729144027840579]
[0,0,9.7170588235294986,0,0,14.594029696970381,14.594029696970381]
[0,0,9.7435294117647935,0,0,14.45891536610017,14.45891536610017]
[0,0,9.7700000000000884,0,0,14.323801035229971,14.323801035229971]
[0,0,9.7964705882353833,0,0,14.188686704359771,14.188686704359771]
[0,0,9.8229411764706782,0,0,14.05357237348956,14.05357237348956]
[0,0,9.8494117647059731,0,0,13.91845804261936,13.91845804261936]
[0,0,9.875882352941268,0,0,13.78334371174916,13.78334371174916]
[0,0,9.902352941176563,0,0,13.64822938087895,13.64822938087895]
[0,0,9.9288235294118579,0,0,13.51311505000875,13.51311505000875]
[0,0,9.9552941176471528,0,0,13.378000719138539,13.378000719138539]
[0,0,9.9817647058824477,0,0,13.24288638826885,13.24288638826885]
[0,0,10.008235294117743,0,0,13.10777205739865,13.10777205739865]
[0,0,10.034705882353038,0,0,12.972657726528441,12.972657726528441]
[0,0,10.061176470588332,0,0,12.837543395658251,12.837543395658251]
[0,0,10.087647058823627,0,0,12.70242906478804,12.70242906478804]
[0,0,10.114117647058922,0,0,12.56731473391784,12.56731473391784]
[0,0,10.140588235294217,0,0,12.43220040304764,12.43220040304764]
[0,0,10.167058823529512,0,0,12.297086072177429,12.297086072177429]
[0,0,10.193529411764807,0,0,12.16197174130723,12.16197174130723]
[0,0,10.220000000000102,0,0,12.026857410437019,12.026857410437019]
[0,0,10.246470588235397,0,0,11.891743079566821,11.891743079566821]
[0,0,10.272941176470692,0,0,11.75662874869662,11.75662874869662]
[0,0,10.299411764705987,0,0,11.621514417826409,11.621514417826409]
[0,0,10.325882352941282,0,0,11.486400086956222,11.486400086956222]
[0,0,10.352352941176576,0,0,11.351285756086011,11.351285756086011]
[0,0,10.378823529411871,0,0,11.284921252050941,11.284921252050941]
[0,0,10.405294117647166,0,0,11.235451026924611,11.235451026924611]
[0,0,10.431764705882461,0,0,11.185980801798291,11.185980801798291]
[0,0,10.458235294117756,0,0,11.136510576671979,11.136510576671979]
[0,0,10.484705882353051,0,0,11.087040351545649,11.087040351545649]
[0,0,10.511176470588346,0,0,11.037570126419521,11.037570126419521]
[0,0,10.537647058823641,0,0,10.988099901293198,10.988099901293198]
[0,0,10.564117647058936,0,0,10.93862967616688,10.93862967616688]
[0,0,10.590588235294231,0,0,10.889159451040559,10.889159451040559]
[0,0,10.617058823529526,0,0,10.839689225914229,10.839689225914229]
[0,0,10.64352941176482,0,0,10.79021900078792,10.79021900078792]
[0,0,10.670000000000115,0,0,10.740748775661601,10.740748775661601]
[0,0,10.69647058823541,0,0,10.691278550535271,10.691278550535271]
[0,0,10.722941176470705,0,0,10.641808325408959,10.641808325408959]
[0,0,10.749411764706,0,0,10.59233810028263,10.59233810028263]
[0,0,10.775882352941295,0,0,10.542867875156309,10.542867875156309]
[0,0,10.80235294117659,0,0,10.493397650029991,10.493397650029991]
[0,0,10.828823529411885,0,0,10.44392742490367,10.44392742490367]
[0,0,10.85529411764718,0,0,10.394457199777349,10.394457199777349]
[0,0,10.881764705882475,0,0,10.344986974651031,10.344986974651031]
[0,0,10.90823529411777,0,0,10.29551674952471,10.29551674952471]
[0,0,10.934705882353065,0,0,10.246046524398389,10.246046524398389]
[0,0,10.961176470588359,0,0,10.196576299272062,10.196576299272062]
[0,0,10.987647058823654,0,0,10.14710607414575,10.14710607414575]
[0,0,11.014117647058949,0,0,10.097635849019619,10.097635849019619]
[0,0,11.040588235294244,0,0,10.048165623893299,10.048165623893299]
[0,0,11.067058823529539,0,0,9.9986953987669729,9.9986953987669729]
[0,0,11.093529411764834,0,0,9.9492251736406523,9.9492251736406523]
[0,0,11.120000000000129,0,0,9.8997549485143299,9.8997549485143299]
[0,0,11.146470588235424,0,0,9.8502847233880075,9.8502847233880075]
[0,0,11.172941176470719,0,0,9.8008144982616905,9.8008144982616905]
[0,0,11.199411764706014,0,0,9.7513442731353681,9.7513442731353681]
[0,0,11.225882352941309,0,0,9.7018740480090475,9.7018740480090475]
[0,0,11.252352941176603,0,0,9.6524038228827251,9.6524038228827251]
[0,0,11.278823529411898,0,0,9.6029335977564099,9.6029335977564099]
[0,0,11.305294117647193,0,0,9.5534633726300857,9.5534633726300857]
[0,0,11.331764705882488,0,0,9.5039931475037651,9.5039931475037651]
[0,0,11.358235294117783,0,0,9.4545229223774427,9.4545229223774427]
[0,0,11.384705882353078,0,0,9.4050526972511257,9.4050526972511257]
[0,0,11.411176470588373,0,0,9.3555824721248051,9.3555824721248051]
[0,0,11.437647058823668,0,0,9.3061122469984827,9.3061122469984827]
[0,0,11.464117647058963,0,0,9.2566420218721603,9.2566420218721603]
[0,0,11.490588235294258,0,0,9.2071717967458397,9.2071717967458397]
[0,0,11.517058823529553,0,0,9.1577015716195174,9.1577015716195174]
[0,0,11.543529411764847,0,0,9.1082313464933904,9.1082313464933904]
[0,0,11.570000000000142,0,0,9.0587611213670698,9.0587611213670698]
[0,0,11.596470588235437,0,0,9.0092908962407474,9.0092908962407474]
[0,0,11.622941176470732,0,0,8.9598206711144268,8.9598206711144268]
[0,0,11.649411764706027,0,0,8.9103504459881044,8.9103504459881044]
[0,0,11.675882352941322,0,0,8.8608802208617838,8.8608802208617838]
[0,0,11.702352941176617,0,0,8.811409995735465,8.811409995735465]
[0,0,11.728823529411912,0,0,8.7619397706091444,8.7619397706091444]
[0,0,11.755294117647207,0,0,8.712469545482822,8.712469545482822]
[0,0,11.781764705882502,0,0,8.6629993203564997,8.6629993203564997]
[0,0,11.808235294117797,0,0,8.6135290952301773,8.6135290952301773]
[0,0,11.834705882353092,0,0,8.564058870103862,8.564058870103862]
[0,0,11.861176470588386,0,0,8.5145886449775396,8.5145886449775396]
[0,0,11.887647058823681,0,0,8.465118419851219,8.465118419851219]
[0,0,11.914117647058976,0,0,8.4156481947249002,8.4156481947249002]
[0,0,11.940588235294271,0,0,8.3661779695985796,8.3661779695985796]
[0,0,11.967058823529566,0,0,8.3167077444722572,8.3167077444722572]
[0,0,11.993529411764861,0,0,8.2672375193459366,8.2672375193459366]
[0,0,12.020000000000156,0,0,8.2177672942196143,8.2177672942196143]
[0,0,12.046470588235451,0,0,8.1682970690932919,8.1682970690932919]
[0,0,12.072941176470746,0,0,8.1188268439671614,8.1188268439671614]
[0,0,12.099411764706041,0,0,8.0693566188408425,8.0693566188408425]
[0,0,12.125882352941336,0,0,8.0198863937145219,8.0198863937145219]
[0,0,12.15235294117663,0,0,7.9704161685881996,7.9704161685881996]
[0,0,12.178823529411925,0,0,7.9209459434618781,7.9209459434618781]
[0,0,12.20529411764722,0,0,7.8714757183355566,7.8714757183355566]
[0,0,12.231764705882515,0,0,7.8220054932092387,7.8220054932092387]
[0,0,12.25823529411781,0,0,7.7725352680829181,7.7725352680829181]
[0,0,12.284705882353105,0,0,7.7230650429565957,7.7230650429565957]
[0,0,12.3111764705884,0,0,7.6735948178302742,7.6735948178302742]
[0,0,12.337647058823695,0,0,7.6241245927039527,7.6241245927039527]
[0,0,12.36411764705899,0,0,7.5746543675776312,7.5746543675776312]
[0,0,12.390588235294285,0,0,7.5251841424513124,7.5251841424513124]
[0,0,12.41705882352958,0,0,7.4757139173249909,7.4757139173249909]
[0,0,12.443529411764874,0,0,7.4262436921986739,7.4262436921986739]
[0,0,12.470000000000169,0,0,7.3767734670723524,7.3767734670723524]
[0,0,12.496470588235464,0,0,7.3273032419460309,7.3273032419460309]
[0,0,12.522941176470759,0,0,7.2778330168197094,7.2778330168197094]
[0,0,12.549411764706054,0,0,7.2283627916933888,7.2283627916933888]
[0,0,12.575882352941349,0,0,7.1788925665672556,7.1788925665672556]
[0,0,12.602352941176644,0,0,7.1294223414409341,7.1294223414409341]
[0,0,12.628823529411939,0,0,7.0799521163146126,7.0799521163146126]
[0,0,12.655294117647234,0,0,7.0304818911882903,7.0304818911882903]
[0,0,12.681764705882529,0,0,6.9810116660619723,6.9810116660619723]
[0,0,12.708235294117824,0,0,6.9315414409356517,6.9315414409356517]
[0,0,12.734705882353119,0,0,6.8820712158093311,6.8820712158093311]
[0,0,12.761176470588413,0,0,6.8326009906830132,6.8326009906830132]
[0,0,12.787647058823708,0,0,6.7831307655566917,6.7831307655566917]
[0,0,12.814117647059003,0,0,6.7336605404303702,6.7336605404303702]
[0,0,12.840588235294298,0,0,6.6841903153040478,6.6841903153040478]
[0,0,12.867058823529593,0,0,6.6347200901777263,6.6347200901777263]
[0,0,12.893529411764888,0,0,6.5852498650514049,6.5852498650514049]
[0,0,12.920000000000183,0,0,6.5357796399250834,6.5357796399250834]
[0,0,12.946470588235478,0,0,6.4863094147987654,6.4863094147987654]
[0,0,12.972941176470773,0,0,6.4368391896724493,6.4368391896724493]
[0,0,12.999411764706068,0,0,6.387368964546126,6.387368964546126]
[0,0,13.025882352941363,0,0,6.3378987394198045,6.3378987394198045]
[0,0,13.052352941176657,0,0,6.2884285142934839,6.2884285142934839]
[0,0,13.078823529411952,0,0,6.2389582891671624,6.2389582891671624]
[0,0,13.105294117647247,0,0,6.1894880640410301,6.1894880640410301]
[0,0,13.131764705882542,0,0,6.1400178389147086,6.1400178389147086]
[0,0,13.158235294117837,0,0,6.0905476137883872,6.0905476137883872]
[0,0,13.184705882353132,0,0,6.0410773886620657,6.0410773886620657]
[0,0,13.211176470588427,0,0,5.9916071635357442,5.9916071635357442]
[0,0,13.237647058823722,0,0,5.9421369384094263,5.9421369384094263]
[0,0,13.264117647059017,0,0,5.8926667132831048,5.8926667132831048]
[0,0,13.290588235294312,0,0,5.8431964881567868,5.8431964881567868]
[0,0,13.317058823529607,0,0,5.8051940329279681,5.8051940329279681]
[0,0,13.343529411764901,0,0,5.784636438427345,5.784636438427345]
[0,0,13.370000000000196,0,0,5.764078843926721,5.764078843926721]
[0,0,13.396470588235491,0,0,5.7435212494260988,5.7435212494260988]
[0,0,13.422941176470786,0,0,5.722963654925473,5.722963654925473]
[0,0,13.449411764706081,0,0,5.7024060604248499,5.7024060604248499]
[0,0,13.475882352941376,0,0,5.6818484659242268,5.6818484659242268]
[0,0,13.502352941176671,0,0,5.6612908714236037,5.6612908714236037]
[0,0,13.528823529411966,0,0,5.6407332769229805,5.6407332769229805]
[0,0,13.555294117647261,0,0,5.6201756824223565,5.6201756824223565]
[0,0,13.581764705882556,0,0,5.5996180879217334,5.5996180879217334]
[0,0,13.608235294117851,0,0,5.5790604934211094,5.5790604934211094]
[0,0,13.634705882353146,0,0,5.5585028989205645,5.5585028989205645]
[0,0,13.66117647058844,0,0,5.5379453044199414,5.5379453044199414]
[0,0,13.687647058823735,0,0,5.5173877099193165,5.5173877099193165]
[0,0,13.71411764705903,0,0,5.4968301154186925,5.4968301154186925]
[0,0,13.740588235294325,0,0,5.4762725209180712,5.4762725209180712]
[0,0,13.76705882352962,0,0,5.4557149264174454,5.4557149264174454]
[0,0,13.793529411764915,0,0,5.4351573319168232,5.4351573319168232]
[0,0,13.82000000000021,0,0,5.4145997374161992,5.4145997374161992]
[0,0,13.846470588235505,0,0,5.394042142915576,5.394042142915576]
[0,0,13.8729411764708,0,0,5.373484548414952,5.373484548414952]
[0,0,13.899411764706095,0,0,5.352926953914328,5.352926953914328]
[0,0,13.92588235294139,0,0,5.3323693594137058,5.3323693594137058]
[0,0,13.952352941176684,0,0,5.3118117649130818,5.3118117649130818]
[0,0,13.978823529411979,0,0,5.2912541704124569,5.2912541704124569]
[0,0,14.005294117647274,0,0,5.2706965759118356,5.2706965759118356]
[0,0,14.031764705882569,0,0,5.2501389814112125,5.2501389814112125]
[0,0,14.058235294117864,0,0,5.2295813869105876,5.2295813869105876]
[0,0,14.084705882353159,0,0,5.2090237924099636,5.2090237924099636]
[0,0,14.111176470588454,0,0,5.1884661979093405,5.1884661979093405]
[0,0,14.137647058823749,0,0,5.1679086034087938,5.1679086034087938]
[0,0,14.164117647059044,0,0,5.1473510089081733,5.1473510089081733]
[0,0,14.190588235294339,0,0,5.1267934144075484,5.1267934144075484]
[0,0,14.217058823529634,0,0,5.1062358199069244,5.1062358199069244]
[0,0,14.243529411764928,0,0,5.0856782254062995,5.0856782254062995]
[0,0,14.270000000000223,0,0,5.0651206309056773,5.0651206309056773]
[0,0,14.296470588235518,0,0,5.0445630364050551,5.0445630364050551]
[0,0,14.322941176470813,0,0,5.0240054419044302,5.0240054419044302]
[0,0,14.349411764706108,0,0,5.003447847403808,5.003447847403808]
[0,0,14.375882352941403,0,0,4.982890252903184,4.982890252903184]
[0,0,14.402352941176698,0,0,4.96233265840256,4.96233265840256]
[0,0,14.428823529411993,0,0,4.941775063901936,4.941775063901936]
[0,0,14.455294117647288,0,0,4.9212174694013129,4.9212174694013129]
[0,0,14.481764705882583,0,0,4.9006598749006889,4.9006598749006889]
[0,0,14.508235294117878,0,0,4.8801022804000675,4.8801022804000675]
[0,0,14.534705882353173,0,0,4.8595446858994418,4.8595446858994418]
[0,0,14.561176470588467,0,0,4.8389870913988196,4.8389870913988196]
[0,0,14.587647058823762,0,0,4.8184294968981947,4.8184294968981947]
[0,0,14.614117647059057,0,0,4.7978719023975716,4.7978719023975716]
[0,0,14.640588235294352,0,0,4.7773143078969484,4.7773143078969484]
[0,0,14.667058823529647,0,0,4.7567567133964017,4.7567567133964017]
[0,0,14.693529411764942,0,0,4.7361991188957804,4.7361991188957804]
[0,0,14.720000000000237,0,0,4.7156415243951555,4.7156415243951555]
[0,0,14.746470588235532,0,0,4.6950839298945324,4.6950839298945324]
[0,0,14.772941176470827,0,0,4.6745263353939102,4.6745263353939102]
[0,0,14.799411764706122,0,0,4.6539687408932853,4.6539687408932853]
[0,0,14.825882352941417,0,0,4.633411146392663,4.633411146392663]
[0,0,14.852352941176711,0,0,4.6128535518920373,4.6128535518920373]
[0,0,14.878823529412006,0,0,4.5922959573914159,4.5922959573914159]
[0,0,14.905294117647301,0,0,4.5717383628907893,4.5717383628907893]
[0,0,14.931764705882596,0,0,4.5511807683901679,4.5511807683901679]
[0,0,14.958235294117891,0,0,4.5306231738895439,4.5306231738895439]
[0,0,14.984705882353186,0,0,4.5100655793889208,4.5100655793889208]
[0,0,15.011176470588481,0,0,4.4895079848882986,4.4895079848882986]
[0,0,15.037647058823776,0,0,4.4689503903876728,4.4689503903876728]
[0,0,15.064117647059071,0,0,4.4483927958870515,4.4483927958870515]
[0,0,15.090588235294366,0,0,4.4278352013864248,4.4278352013864248]
[0,0,15.117058823529661,0,0,4.4072776068858035,4.4072776068858035]
[0,0,15.143529411764955,0,0,4.3867200123851786,4.3867200123851786]
[0,0,15.17000000000025,0,0,4.3661624178845564,4.3661624178845564]
[0,0,15.196470588235545,0,0,4.3456048233840123,4.3456048233840123]
[0,0,15.22294117647084,0,0,4.3250472288833857,4.3250472288833857]
[0,0,15.249411764706135,0,0,4.3044896343827634,4.3044896343827634]
[0,0,15.27588235294143,0,0,4.2839320398821386,4.2839320398821386]
[0,0,15.302352941176725,0,0,4.2633744453815154,4.2633744453815154]
[0,0,15.32882352941202,0,0,4.2428168508808941,4.2428168508808941]
[0,0,15.355294117647315,0,0,4.2222592563802692,4.2222592563802692]
[0,0,15.38176470588261,0,0,4.201701661879647,4.201701661879647]
[0,0,15.408235294117905,0,0,4.1811440673790221,4.1811440673790221]
[0,0,15.4347058823532,0,0,4.160586472878399,4.160586472878399]
[0,0,15.461176470588494,0,0,4.1400288783777741,4.1400288783777741]
[0,0,15.487647058823789,0,0,4.119471283877151,4.119471283877151]
[0,0,15.514117647059084,0,0,4.0989136893765288,4.0989136893765288]
[0,0,15.540588235294379,0,0,4.0783560948759048,4.0783560948759048]
[0,0,15.567058823529674,0,0,4.0577985003752834,4.0577985003752834]
[0,0,15.593529411764969,0,0,4.0372409058746568,4.0372409058746568]
[0,0,15.620000000000264,0,0,4.0166833113740346,4.0166833113740346]
[0,0,15.646470588235559,0,0,3.9961257168734083,3.9961257168734083]
[0,0,15.672941176470854,0,0,3.975568122372787,3.975568122372787]
[0,0,15.699411764706149,0,0,3.9550105278722416,3.9550105278722416]
[0,0,15.725882352941444,0,0,3.9344529333716176,3.9344529333716176]
[0,0,15.752352941176738,0,0,3.9138953388709954,3.9138953388709954]
[0,0,15.778823529412033,0,0,3.8933377443703687,3.8933377443703687]
[0,0,15.805294117647328,0,0,3.8727801498697469,3.8727801498697469]
[0,0,15.831764705882623,0,0,3.8522225553691252,3.8522225553691252]
[0,0,15.858235294117918,0,0,3.8316649608684989,3.8316649608684989]
[0,0,15.884705882353213,0,0,3.8111073663678767,3.8111073663678767]
[0,0,15.911176470588508,0,0,3.7905497718672532,3.7905497718672532]
[0,0,15.937647058823803,0,0,3.7699921773666309,3.7699921773666309]
[0,0,15.964117647059098,0,0,3.7494345828660047,3.7494345828660047]
[0,0,15.990588235294393,0,0,3.7288769883653829,3.7288769883653829]
[0,0,16.017058823529688,0,0,3.7083193938647612,3.7083193938647612]
[0,0,16.043529411764982,0,0,3.687761799364135,3.687761799364135]
[0,0,16.070000000000277,0,0,3.6672042048635132,3.6672042048635132]
[0,0,16.096470588235572,0,0,3.6466466103628892,3.6466466103628892]
[0,0,16.122941176470867,0,0,3.6260890158622656,3.6260890158622656]
[0,0,16.149411764706162,0,0,3.6055314213616407,3.6055314213616407]
[0,0,16.175882352941457,0,0,3.5849738268610181,3.5849738268610181]
[0,0,16.202352941176752,0,0,3.5644162323603941,3.5644162323603941]
[0,0,16.228823529412047,0,0,3.54385863785985,3.54385863785985]
[0,0,16.255294117647342,0,0,3.5233010433592273,3.5233010433592273]
[0,0,16.281764705882637,0,0,3.5082287262929213,3.5082287262929213]
[0,0,16.308235294117932,0,0,3.493208840083005,3.493208840083005]
[0,0,16.334705882353227,0,0,3.4781889538730879,3.4781889538730879]
[0,0,16.361176470588521,0,0,3.463169067663173,3.463169067663173]
[0,0,16.387647058823816,0,0,3.4481491814532581,3.4481491814532581]
[0,0,16.414117647059111,0,0,3.4331292952433419,3.4331292952433419]
[0,0,16.440588235294406,0,0,3.4181094090334261,3.4181094090334261]
[0,0,16.467058823529701,0,0,3.403089522823509,3.403089522823509]
[0,0,16.493529411764996,0,0,3.3880696366135941,3.3880696366135941]
[0,0,16.520000000000291,0,0,3.3730497504036769,3.3730497504036769]
[0,0,16.546470588235586,0,0,3.358029864193762,3.358029864193762]
[0,0,16.572941176470881,0,0,3.3430099779838458,3.3430099779838458]
[0,0,16.599411764706176,0,0,3.32799009177393,3.32799009177393]
[0,0,16.625882352941471,0,0,3.3129702055640151,3.3129702055640151]
[0,0,16.652352941176765,0,0,3.2979503193540971,3.2979503193540971]
[0,0,16.67882352941206,0,0,3.2829304331441831,3.2829304331441831]
[0,0,16.705294117647355,0,0,3.267910546934266,3.267910546934266]
[0,0,16.73176470588265,0,0,3.252890660724352,3.252890660724352]
[0,0,16.758235294117945,0,0,3.2378707745144921,3.2378707745144921]
[0,0,16.78470588235324,0,0,3.2228508883045759,3.2228508883045759]
[0,0,16.811176470588535,0,0,3.2078310020946601,3.2078310020946601]
[0,0,16.83764705882383,0,0,3.1928111158847421,3.1928111158847421]
[0,0,16.864117647059125,0,0,3.1777912296748281,3.1777912296748281]
[0,0,16.89058823529442,0,0,3.1627713434649118,3.1627713434649118]
[0,0,16.917058823529715,0,0,3.1477514572549974,3.1477514572549974]
[0,0,16.943529411765009,0,0,3.1327315710450812,3.1327315710450812]
[0,0,16.970000000000304,0,0,3.1177116848351631,3.1177116848351631]
[0,0,16.996470588235599,0,0,3.1026917986252491,3.1026917986252491]
[0,0,17.022941176470894,0,0,3.0876719124153311,3.0876719124153311]
[0,0,17.049411764706189,0,0,3.0726520262054171,3.0726520262054171]
[0,0,17.075882352941484,0,0,3.0576321399955013,3.0576321399955013]
[0,0,17.102352941176779,0,0,3.0426122537855829,3.0426122537855829]
[0,0,17.128823529412074,0,0,3.0275923675756697,3.0275923675756697]
[0,0,17.155294117647369,0,0,3.0125724813657522,3.0125724813657522]
[0,0,17.181764705882664,0,0,2.9975525951558377,2.9975525951558377]
[0,0,17.208235294117959,0,0,2.9825327089459202,2.9825327089459202]
[0,0,17.234705882353254,0,0,2.9675128227360053,2.9675128227360053]
[0,0,17.261176470588548,0,0,2.9524929365261459,2.9524929365261459]
[0,0,17.287647058823843,0,0,2.9374730503162283,2.9374730503162283]
[0,0,17.314117647059138,0,0,2.9224531641063138,2.9224531641063138]
[0,0,17.340588235294433,0,0,2.9074332778963967,2.9074332778963967]
[0,0,17.367058823529728,0,0,2.8924133916864831,2.8924133916864831]
[0,0,17.393529411765023,0,0,2.8773935054765647,2.8773935054765647]
[0,0,17.420000000000318,0,0,2.8623736192666489,2.8623736192666489]
[0,0,17.446470588235613,0,0,2.8473537330567349,2.8473537330567349]
[0,0,17.472941176470908,0,0,2.8323338468468169,2.8323338468468169]
[0,0,17.499411764706203,0,0,2.8173139606369029,2.8173139606369029]
[0,0,17.525882352941498,0,0,2.8022940744269862,2.8022940744269862]
[0,0,17.552352941176792,0,0,2.78727418821707,2.78727418821707]
[0,0,17.578823529412087,0,0,2.7722543020071542,2.7722543020071542]
[0,0,17.605294117647382,0,0,2.7572344157972388,2.7572344157972388]
[0,0,17.631764705882677,0,0,2.742214529587323,2.742214529587323]
[0,0,17.658235294117972,0,0,2.7271946433774068,2.7271946433774068]
[0,0,17.684705882353267,0,0,2.712174757167491,2.712174757167491]
[0,0,17.711176470588562,0,0,2.6971548709575748,2.6971548709575748]
[0,0,17.737647058823857,0,0,2.6831038969183831,2.6831038969183831]
[0,0,17.764117647059152,0,0,2.6714543698234521,2.6714543698234521]
[0,0,17.790588235294447,0,0,2.6598048427285681,2.6598048427285681]
[0,0,17.817058823529742,0,0,2.6481553156336393,2.6481553156336393]
[0,0,17.843529411765036,0,0,2.63650578853871,2.63650578853871]
[0,0,17.870000000000331,0,0,2.6248562614437798,2.6248562614437798]
[0,0,17.896470588235626,0,0,2.613206734348851,2.613206734348851]
[0,0,17.922941176470921,0,0,2.6015572072539221,2.6015572072539221]
[0,0,17.949411764706216,0,0,2.5899076801589942,2.5899076801589942]
[0,0,17.975882352941511,0,0,2.5782581530640631,2.5782581530640631]
[0,0,18.002352941176806,0,0,2.566608625969133,2.566608625969133]
[0,0,18.028823529412101,0,0,2.5549590988742037,2.5549590988742037]
[0,0,18.055294117647396,0,0,2.5433095717792744,2.5433095717792744]
[0,0,18.081764705882691,0,0,2.5316600446843451,2.5316600446843451]
[0,0,18.108235294117986,0,0,2.520010517589415,2.520010517589415]
[0,0,18.134705882353281,0,0,2.5083609904944879,2.5083609904944879]
[0,0,18.161176470588575,0,0,2.4967114633995569,2.4967114633995569]
[0,0,18.18764705882387,0,0,2.4850619363046289,2.4850619363046289]
[0,0,18.214117647059165,0,0,2.4734124092096983,2.4734124092096983]
[0,0,18.24058823529446,0,0,2.4617628821147699,2.4617628821147699]
[0,0,18.267058823529755,0,0,2.4501133550198388,2.4501133550198388]
[0,0,18.29352941176505,0,0,2.438463827924954,2.438463827924954]
[0,0,18.320000000000345,0,0,2.426814300830026,2.426814300830026]
[0,0,18.34647058823564,0,0,2.415164773735095,2.415164773735095]
[0,0,18.372941176470935,0,0,2.4035152466401679,2.4035152466401679]
[0,0,18.39941176470623,0,0,2.391865719545236,2.391865719545236]
[0,0,18.425882352941525,0,0,2.380216192450308,2.380216192450308]
[0,0,18.452352941176819,0,0,2.3685666653553779,2.3685666653553779]
[0,0,18.478823529412114,0,0,2.3569171382604499,2.3569171382604499]
[0,0,18.505294117647409,0,0,2.3452676111655197,2.3452676111655197]
[0,0,18.531764705882704,0,0,2.3336180840705913,2.3336180840705913]
[0,0,18.558235294117999,0,0,2.3219685569756621,2.3219685569756621]
[0,0,18.584705882353294,0,0,2.3103190298807319,2.3103190298807319]
[0,0,18.611176470588589,0,0,2.2986695027858031,2.2986695027858031]
[0,0,18.637647058823884,0,0,2.2870199756908729,2.2870199756908729]
[0,0,18.664117647059179,0,0,2.2753704485959441,2.2753704485959441]
[0,0,18.690588235294474,0,0,2.2637209215010152,2.2637209215010152]
[0,0,18.717058823529769,0,0,2.2520713944060859,2.2520713944060859]
[0,0,18.743529411765063,0,0,2.2404218673111558,2.2404218673111558]
[0,0,18.770000000000358,0,0,2.2287723402162256,2.2287723402162256]
[0,0,18.796470588235653,0,0,2.2171228131212972,2.2171228131212972]
[0,0,18.822941176470948,0,0,2.2054732860264128,2.2054732860264128]
[0,0,18.849411764706243,0,0,2.1938237589314822,2.1938237589314822]
[0,0,18.875882352941538,0,0,2.1821742318365551,2.1821742318365551]
[0,0,18.902352941176833,0,0,2.1705247047416232,2.1705247047416232]
[0,0,18.928823529412128,0,0,2.1588751776466939,2.1588751776466939]
[0,0,18.955294117647423,0,0,2.1472256505517646,2.1472256505517646]
[0,0,18.981764705882718,0,0,2.1355761234568353,2.1355761234568353]
[0,0,19.008235294118013,0,0,2.1239265963619083,2.1239265963619083]
[0,0,19.034705882353308,0,0,2.1122770692669759,2.1122770692669759]
[0,0,19.061176470588602,0,0,2.1006275421720488,2.1006275421720488]
[0,0,19.087647058823897,0,0,2.0889780150771178,2.0889780150771178]
[0,0,19.114117647059192,0,0,2.0773284879821903,2.0773284879821903]
[0,0,19.140588235294487,0,0,2.0656789608872592,2.0656789608872592]
[0,0,19.167058823529782,0,0,2.0540294337923308,2.0540294337923308]
[0,0,19.193529411765077,0,0,2.042379906697402,2.042379906697402]
[0,0,19.220000000000372,0,0,2.034647865236348,2.034647865236348]
[0,0,19.246470588235667,0,0,2.0297014402084601,2.0297014402084601]
[0,0,19.272941176470962,0,0,2.0247550151805722,2.0247550151805722]
[0,0,19.299411764706257,0,0,2.0198085901526843,2.0198085901526843]
[0,0,19.325882352941552,0,0,2.0148621651247951,2.0148621651247951]
[0,0,19.352352941176846,0,0,2.0099157400969272,2.0099157400969272]
[0,0,19.378823529412141,0,0,2.0049693150690393,2.0049693150690393]
[0,0,19.405294117647436,0,0,2.0000228900411501,2.0000228900411501]
[0,0,19.431764705882731,0,0,1.995076465013262,1.995076465013262]
[0,0,19.458235294118026,0,0,1.9901300399853741,1.9901300399853741]
[0,0,19.484705882353321,0,0,1.9851836149574862,1.9851836149574862]
[0,0,19.511176470588616,0,0,1.9802371899295979,1.9802371899295979]
[0,0,19.537647058823911,0,0,1.9752907649017113,1.9752907649017113]
[0,0,19.564117647059206,0,0,1.9703443398738221,1.9703443398738221]
[0,0,19.590588235294501,0,0,1.965397914845934,1.965397914845934]
[0,0,19.617058823529796,0,0,1.960451489818047,1.960451489818047]
[0,0,19.64352941176509,0,0,1.9555050647901577,1.9555050647901577]
[0,0,19.670000000000385,0,0,1.950558639762271,1.950558639762271]
[0,0,19.69647058823568,0,0,1.945612214734382,1.945612214734382]
[0,0,19.722941176470975,0,0,1.9406657897064941,1.9406657897064941]
[0,0,19.74941176470627,0,0,1.9357193646786071,1.9357193646786071]
[0,0,19.775882352941565,0,0,1.9307729396507192,1.9307729396507192]
[0,0,19.80235294117686,0,0,1.9258265146228302,1.9258265146228302]
[0,0,19.828823529412155,0,0,1.9208800895949421,1.9208800895949421]
[0,0,19.85529411764745,0,0,1.9159336645670728,1.9159336645670728]
[0,0,19.881764705882745,0,0,1.9109872395391849,1.9109872395391849]
[0,0,19.90823529411804,0,0,1.906040814511297,1.906040814511297]
[0,0,19.934705882353335,0,0,1.9010943894834089,1.9010943894834089]
[0,0,19.961176470588629,0,0,1.896147964455521,1.896147964455521]
[0,0,19.987647058823924,0,0,1.8912015394276329,1.8912015394276329]
[0,0,20.014117647059219,0,0,1.886255114399745,1.886255114399745]
[0,0,20.040588235294514,0,0,1.8813086893718571,1.8813086893718571]
[0,0,20.067058823529809,0,0,1.876362264343969,1.876362264343969]
[0,0,20.093529411765104,0,0,1.8714158393160809,1.8714158393160809]
[0,0,20.120000000000399,0,0,1.866469414288193,1.866469414288193]
[0,0,20.146470588235694,0,0,1.8615229892603049,1.8615229892603049]
[0,0,20.172941176470989,0,0,1.856576564232417,1.856576564232417]
[0,0,20.199411764706284,0,0,1.8516301392045289,1.8516301392045289]
[0,0,20.225882352941579,0,0,1.846683714176641,1.846683714176641]
[0,0,20.252352941176873,0,0,1.8417372891487531,1.8417372891487531]
[0,0,20.278823529412168,0,0,1.836790864120865,1.836790864120865]
[0,0,20.305294117647463,0,0,1.8318444390929771,1.8318444390929771]
[0,0,20.331764705882758,0,0,1.826898014065089,1.826898014065089]
[0,0,20.358235294118053,0,0,1.8219515890372009,1.8219515890372009]
[0,0,20.384705882353348,0,0,1.8170051640093319,1.8170051640093319]
[0,0,20.411176470588643,0,0,1.812058738981444,1.812058738981444]
[0,0,20.437647058823938,0,0,1.807112313953555,1.807112313953555]
[0,0,20.464117647059233,0,0,1.8021658889256669,1.8021658889256669]
[0,0,20.490588235294528,0,0,1.7972194638977801,1.7972194638977801]
[0,0,20.517058823529823,0,0,1.7922730388698911,1.7922730388698911]
[0,0,20.543529411765117,0,0,1.787326613842003,1.787326613842003]
[0,0,20.570000000000412,0,0,1.7823801888141151,1.7823801888141151]
[0,0,20.596470588235707,0,0,1.777433763786227,1.777433763786227]
[0,0,20.622941176471002,0,0,1.77248733875834,1.77248733875834]
[0,0,20.649411764706297,0,0,1.767540913730451,1.767540913730451]
[0,0,20.675882352941592,0,0,1.7625944887025629,1.7625944887025629]
[0,0,20.702352941176887,0,0,1.757648063674675,1.757648063674675]
[0,0,20.728823529412182,0,0,1.7527016386467871,1.7527016386467871]
[0,0,20.755294117647477,0,0,1.747755213618899,1.747755213618899]
[0,0,20.781764705882772,0,0,1.7428087885910111,1.7428087885910111]
[0,0,20.808235294118067,0,0,1.737862363563123,1.737862363563123]
[0,0,20.834705882353362,0,0,1.7329159385352351,1.7329159385352351]
[0,0,20.861176470588656,0,0,1.7279695135073481,1.7279695135073481]
[0,0,20.887647058823951,0,0,1.7230230884794591,1.7230230884794591]
[0,0,20.914117647059246,0,0,1.7180766634515898,1.7180766634515898]
[0,0,20.940588235294541,0,0,1.7131302384237019,1.7131302384237019]
[0,0,20.967058823529836,0,0,1.708183813395814,1.708183813395814]
[0,0,20.993529411765131,0,0,1.7032373883679259,1.7032373883679259]
[0,0,21.020000000000426,0,0,1.698290963340038,1.698290963340038]
[0,0,21.046470588235721,0,0,1.6933445383121499,1.6933445383121499]
[0,0,21.072941176471016,0,0,1.6883981132842609,1.6883981132842609]
[0,0,21.099411764706311,0,0,1.6834516882563741,1.6834516882563741]
[0,0,21.125882352941606,0,0,1.678505263228486,1.678505263228486]
[0,0,21.1523529411769,0,0,1.673558838200597,1.673558838200597]
[0,0,21.178823529412195,0,0,1.6686124131727098,1.6686124131727098]
[0,0,21.20529411764749,0,0,1.6636659881448219,1.6636659881448219]
[0,0,21.231764705882785,0,0,1.658719563116934,1.658719563116934]
[0,0,21.25823529411808,0,0,1.6537731380890459,1.6537731380890459]
[0,0,21.284705882353375,0,0,1.6488267130611569,1.6488267130611569]
[0,0,21.31117647058867,0,0,1.6438802880332701,1.6438802880332701]
[0,0,21.337647058823965,0,0,1.638933863005382,1.638933863005382]
[0,0,21.36411764705926,0,0,1.6339874379774941,1.6339874379774941]
[0,0,21.390588235294555,0,0,1.629041012949606,1.629041012949606]
[0,0,21.41705882352985,0,0,1.6240945879217361,1.6240945879217361]
[0,0,21.443529411765144,0,0,1.6191481628938489,1.6191481628938489]
[0,0,21.470000000000439,0,0,1.6142017378659599,1.6142017378659599]
[0,0,21.496470588235734,0,0,1.6092553128380729,1.6092553128380729]
[0,0,21.522941176471029,0,0,1.6043088878101839,1.6043088878101839]
[0,0,21.549411764706324,0,0,1.599362462782296,1.599362462782296]
[0,0,21.575882352941619,0,0,1.5944160377544081,1.5944160377544081]
[0,0,21.602352941176914,0,0,1.58946961272652,1.58946961272652]
[0,0,21.628823529412209,0,0,1.5845231876986321,1.5845231876986321]
[0,0,21.655294117647504,0,0,1.579576762670744,1.579576762670744]
[0,0,21.681764705882799,0,0,1.5746303376428561,1.5746303376428561]
[0,0,21.708235294118094,0,0,1.569683912614968,1.569683912614968]
[0,0,21.734705882353389,0,0,1.564737487587081,1.564737487587081]
[0,0,21.761176470588683,0,0,1.559791062559192,1.559791062559192]
[0,0,21.787647058823978,0,0,1.5548446375313039,1.5548446375313039]
[0,0,21.814117647059273,0,0,1.549898212503416,1.549898212503416]
[0,0,21.840588235294568,0,0,1.5449517874755281,1.5449517874755281]
[0,0,21.867058823529863,0,0,1.5400053624476411,1.5400053624476411]
[0,0,21.893529411765158,0,0,1.5350589374197521,1.5350589374197521]
[0,0,21.920000000000453,0,0,1.5301125123918642,1.5301125123918642]
[0,0,21.946470588235748,0,0,1.5251660873639941,1.5251660873639941]
[0,0,21.972941176471043,0,0,1.5202196623361068,1.5202196623361068]
[0,0,21.999411764706338,0,0,1.5152732373082178,1.5152732373082178]
[0,0,22.025882352941633,0,0,1.5103268122803299,1.5103268122803299]
[0,0,22.052352941176927,0,0,1.5053803872524429,1.5053803872524429]
[0,0,22.078823529412222,0,0,1.5004339622245539,1.5004339622245539]
[0,0,22.105294117647517,0,0,1.4954875371966669,1.4954875371966669]
[0,0,22.131764705882812,0,0,1.490541112168779,1.490541112168779]
[0,0,22.158235294118107,0,0,1.4855699883604241,1.4855699883604241]
[0,0,22.184705882353402,0,0,1.4804850594076939,1.4804850594076939]
[0,0,22.211176470588697,0,0,1.475400130454964,1.475400130454964]
[0,0,22.237647058823992,0,0,1.470315201502234,1.470315201502234]
[0,0,22.264117647059287,0,0,1.465230272549505,1.465230272549505]
[0,0,22.290588235294582,0,0,1.4601453435967751,1.4601453435967751]
[0,0,22.317058823529877,0,0,1.4550604146440449,1.4550604146440449]
[0,0,22.343529411765171,0,0,1.4499754856913161,1.4499754856913161]
[0,0,22.370000000000466,0,0,1.4448905567385859,1.4448905567385859]
[0,0,22.396470588235761,0,0,1.439805627785856,1.439805627785856]
[0,0,22.422941176471056,0,0,1.4347206988331269,1.4347206988331269]
[0,0,22.449411764706351,0,0,1.429635769880397,1.429635769880397]
[0,0,22.475882352941646,0,0,1.4245508409276859,1.4245508409276859]
[0,0,22.502352941176941,0,0,1.4194659119749571,1.4194659119749571]
[0,0,22.528823529412236,0,0,1.4143809830222269,1.4143809830222269]
[0,0,22.555294117647531,0,0,1.409296054069497,1.409296054069497]
[0,0,22.581764705882826,0,0,1.404211125116767,1.404211125116767]
[0,0,22.608235294118121,0,0,1.399126196164038,1.399126196164038]
[0,0,22.634705882353416,0,0,1.3940412672113078,1.3940412672113078]
[0,0,22.66117647058871,0,0,1.3889563382585781,1.3889563382585781]
[0,0,22.687647058824005,0,0,1.3838714093058491,1.3838714093058491]
[0,0,22.7141176470593,0,0,1.378786480353118,1.378786480353118]
[0,0,22.740588235294595,0,0,1.373701551400389,1.373701551400389]
[0,0,22.76705882352989,0,0,1.368616622447659,1.368616622447659]
[0,0,22.793529411765185,0,0,1.36353169349493,1.36353169349493]
[0,0,22.82000000000048,0,0,1.3584467645422,1.3584467645422]
[0,0,22.846470588235775,0,0,1.3533618355894701,1.3533618355894701]
[0,0,22.87294117647107,0,0,1.3482769066367402,1.3482769066367402]
[0,0,22.899411764706365,0,0,1.34319197768401,1.34319197768401]
[0,0,22.92588235294166,0,0,1.3381070487312809,1.3381070487312809]
[0,0,22.952352941176954,0,0,1.333022119778551,1.333022119778551]
[0,0,22.978823529412249,0,0,1.3279371908258399,1.3279371908258399]
[0,0,23.005294117647544,0,0,1.3228522618731111,1.3228522618731111]
[0,0,23.031764705882839,0,0,1.317767332920381,1.317767332920381]
[0,0,23.058235294118134,0,0,1.3126824039676519,1.3126824039676519]
[0,0,23.084705882353429,0,0,1.3075974750149211,1.3075974750149211]
[0,0,23.111176470588724,0,0,1.302512546062192,1.302512546062192]
[0,0,23.137647058824019,0,0,1.2974276171094619,1.2974276171094619]
[0,0,23.164117647059314,0,0,1.2923426881567328,1.2923426881567328]
[0,0,23.190588235294609,0,0,1.287257759204002,1.287257759204002]
[0,0,23.217058823529904,0,0,1.2821728302512729,1.2821728302512729]
[0,0,23.243529411765198,0,0,1.2770879012985439,1.2770879012985439]
[0,0,23.270000000000493,0,0,1.2720029723458131,1.2720029723458131]
[0,0,23.296470588235788,0,0,1.266918043393084,1.266918043393084]
[0,0,23.322941176471083,0,0,1.2618331144403541,1.2618331144403541]
[0,0,23.349411764706378,0,0,1.2567481854876239,1.2567481854876239]
[0,0,23.375882352941673,0,0,1.2516632565348951,1.2516632565348951]
[0,0,23.402352941176968,0,0,1.2465783275821651,1.2465783275821651]
[0,0,23.428823529412263,0,0,1.2414933986294361,1.2414933986294361]
[0,0,23.455294117647558,0,0,1.2364084696767048,1.2364084696767048]
[0,0,23.481764705882853,0,0,1.2313235407239762,1.2313235407239762]
[0,0,23.508235294118148,0,0,1.2262386117712651,1.2262386117712651]
[0,0,23.534705882353443,0,0,1.2211536828185361,1.2211536828185361]
[0,0,23.561176470588737,0,0,1.2160687538658059,1.2160687538658059]
[0,0,23.587647058824032,0,0,1.210983824913076,1.210983824913076]
[0,0,23.614117647059327,0,0,1.2058988959603461,1.2058988959603461]
[0,0,23.640588235294622,0,0,1.2016152116991661,1.2016152116991661]
[0,0,23.667058823529917,0,0,1.1982161417096329,1.1982161417096329]
[0,0,23.693529411765212,0,0,1.1948170717201001,1.1948170717201001]
[0,0,23.720000000000507,0,0,1.1914180017305669,1.1914180017305669]
[0,0,23.746470588235802,0,0,1.188018931741035,1.188018931741035]
[0,0,23.772941176471097,0,0,1.1846198617515009,1.1846198617515009]
[0,0,23.799411764706392,0,0,1.1812207917619688,1.1812207917619688]
[0,0,23.825882352941687,0,0,1.1778217217724349,1.1778217217724349]
[0,0,23.852352941176981,0,0,1.1744226517829031,1.1744226517829031]
[0,0,23.878823529412276,0,0,1.171023581793369,1.171023581793369]
[0,0,23.905294117647571,0,0,1.167624511803836,1.167624511803836]
[0,0,23.931764705882866,0,0,1.164225441814303,1.164225441814303]
[0,0,23.958235294118161,0,0,1.16082637182477,1.16082637182477]
[0,0,23.984705882353456,0,0,1.1574273018352379,1.1574273018352379]
[0,0,24.011176470588751,0,0,1.154028231845704,1.154028231845704]
[0,0,24.037647058824046,0,0,1.1506291618561841,1.1506291618561841]
[0,0,24.064117647059341,0,0,1.1472300918666509,1.1472300918666509]
[0,0,24.090588235294636,0,0,1.1438310218771182,1.1438310218771182]
[0,0,24.117058823529931,0,0,1.1404319518875861,1.1404319518875861]
[0,0,24.143529411765225,0,0,1.137032881898052,1.137032881898052]
[0,0,24.17000000000052,0,0,1.133633811908519,1.133633811908519]
[0,0,24.196470588235815,0,0,1.130234741918986,1.130234741918986]
[0,0,24.22294117647111,0,0,1.126835671929453,1.126835671929453]
[0,0,24.249411764706405,0,0,1.12343660193992,1.12343660193992]
[0,0,24.2758823529417,0,0,1.1200375319503868,1.1200375319503868]
[0,0,24.302352941176995,0,0,1.1166384619608551,1.1166384619608551]
[0,0,24.32882352941229,0,0,1.113239391971321,1.113239391971321]
[0,0,24.355294117647585,0,0,1.1098403219817881,1.1098403219817881]
[0,0,24.38176470588288,0,0,1.1064412519922551,1.1064412519922551]
[0,0,24.408235294118175,0,0,1.1030421820027219,1.1030421820027219]
[0,0,24.43470588235347,0,0,1.0996431120131891,1.0996431120131891]
[0,0,24.461176470588764,0,0,1.0962440420236559,1.0962440420236559]
[0,0,24.487647058824059,0,0,1.0928449720341231,1.0928449720341231]
[0,0,24.514117647059354,0,0,1.0894459020445899,1.0894459020445899]
[0,0,24.540588235294649,0,0,1.0860468320550709,1.0860468320550709]
[0,0,24.567058823529944,0,0,1.082647762065537,1.082647762065537]
[0,0,24.593529411765239,0,0,1.079248692076004,1.079248692076004]
[0,0,24.620000000000534,0,0,1.0758496220864708,1.0758496220864708]
[0,0,24.646470588235829,0,0,1.0724505520969381,1.0724505520969381]
[0,0,24.672941176471124,0,0,1.069051482107406,1.069051482107406]
[0,0,24.699411764706419,0,0,1.0656524121178721,1.0656524121178721]
[0,0,24.725882352941714,0,0,1.0622533421283391,1.0622533421283391]
[0,0,24.752352941177008,0,0,1.0588542721388059,1.0588542721388059]
[0,0,24.778823529412303,0,0,1.0554552021492731,1.0554552021492731]
[0,0,24.805294117647598,0,0,1.052056132159741,1.052056132159741]
[0,0,24.831764705882893,0,0,1.0486570621702072,1.0486570621702072]
[0,0,24.858235294118188,0,0,1.0452579921806739,1.0452579921806739]
[0,0,24.884705882353483,0,0,1.041858922191141,1.041858922191141]
[0,0,24.911176470588778,0,0,1.038459852201608,1.038459852201608]
[0,0,24.937647058824073,0,0,1.035060782212075,1.035060782212075]
[0,0,24.964117647059368,0,0,1.031661712222542,1.031661712222542]
[0,0,24.990588235294663,0,0,1.028262642233009,1.028262642233009]
[0,0,25.017058823529958,0,0,1.0248635722434758,1.0248635722434758]
[0,0,25.043529411765252,0,0,1.021464502253943,1.021464502253943]
[0,0,25.070000000000547,0,0,1.0180654322644229,1.0180654322644229]
[0,0,25.096470588235842,0,0,1.0146663622748899,1.0146663622748899]
[0,0,25.122941176471137,0,0,1.011843043209437,1.011843043209437]
[0,0,25.149411764706432,0,0,1.009189549956103,1.009189549956103]
[0,0,25.175882352941727,0,0,1.0065360567027699,1.0065360567027699]
[0,0,25.202352941177022,0,0,1.0038825634494359,1.0038825634494359]
[0,0,25.228823529412317,0,0,1.001229070196102,1.001229070196102]
[0,0,25.255294117647612,0,0,0.99857557694276877,0.99857557694276877]
[0,0,25.281764705882907,0,0,0.99592208368943536,0.99592208368943536]
[0,0,25.308235294118202,0,0,0.99326859043610138,0.99326859043610138]
[0,0,25.334705882353497,0,0,0.99061509718276819,0.99061509718276819]
[0,0,25.361176470588791,0,0,0.98796160392943455,0.98796160392943455]
[0,0,25.387647058824086,0,0,0.98530811067610069,0.98530811067610069]
[0,0,25.414117647059381,0,0,0.9826546174227675,0.9826546174227675]
[0,0,25.440588235294676,0,0,0.98000112416943375,0.98000112416943375]
[0,0,25.467058823529971,0,0,0.97734763091610011,0.97734763091610011]
[0,0,25.493529411765266,0,0,0.97469413766276647,0.97469413766276647]
[0,0,25.520000000000561,0,0,0.97204064440943316,0.97204064440943316]
[0,0,25.546470588235856,0,0,0.96938715115609997,0.96938715115609997]
[0,0,25.572941176471151,0,0,0.966733657902766,0.966733657902766]
[0,0,25.599411764706446,0,0,0.96408016464944235,0.96408016464944235]
[0,0,25.625882352941741,0,0,0.96142667139610871,0.96142667139610871]
[0,0,25.652352941177035,0,0,0.95877317814277541,0.95877317814277541]
[0,0,25.67882352941233,0,0,0.95611968488944188,0.95611968488944188]
[0,0,25.705294117647625,0,0,0.95346619163610824,0.95346619163610824]
[0,0,25.73176470588292,0,0,0.95081269838277471,0.95081269838277471]
[0,0,25.758235294118215,0,0,0.94815920512944096,0.94815920512944096]
[0,0,25.78470588235351,0,0,0.94550571187610766,0.94550571187610766]
[0,0,25.811176470588805,0,0,0.9428522186227738,0.9428522186227738]
[0,0,25.8376470588241,0,0,0.9401987253694406,0.9401987253694406]
[0,0,25.864117647059395,0,0,0.93754523211610674,0.93754523211610674]
[0,0,25.89058823529469,0,0,0.93489173886277355,0.93489173886277355]
[0,0,25.917058823529985,0,0,0.93223824560943969,0.93223824560943969]
[0,0,25.943529411765279,0,0,0.92958475235610583,0.92958475235610583]
[0,0,25.970000000000574,0,0,0.92693125910277263,0.92693125910277263]
[0,0,25.996470588235869,0,0,0.92427776584943877,0.92427776584943877]
[0,0,26.022941176471164,0,0,0.92162427259610546,0.92162427259610546]
[0,0,26.049411764706459,0,0,0.91897077934277183,0.91897077934277183]
[0,0,26.075882352941754,0,0,0.91631728608943841,0.91631728608943841]
[0,0,26.102352941177049,0,0,0.91366379283611487,0.91366379283611487]
[0,0,26.128823529412344,0,0,0.91101029958278124,0.91101029958278124]
[0,0,26.155294117647639,0,0,0.90835680632944793,0.90835680632944793]
[0,0,26.181764705882934,0,0,0.90570331307611396,0.90570331307611396]
[0,0,26.208235294118229,0,0,0.90304981982278076,0.90304981982278076]
[0,0,26.234705882353524,0,0,0.90039632656944701,0.90039632656944701]
[0,0,26.261176470588818,0,0,0.89774283331611315,0.89774283331611315]
[0,0,26.287647058824113,0,0,0.89508934006277974,0.89508934006277974]
[0,0,26.314117647059408,0,0,0.89243584680944599,0.89243584680944599]
[0,0,26.340588235294703,0,0,0.88978235355611279,0.88978235355611279]
[0,0,26.367058823529998,0,0,0.88712886030277893,0.88712886030277893]
[0,0,26.393529411765293,0,0,0.88447536704944574,0.88447536704944574]
[0,0,26.420000000000588,0,0,0.88182187379611232,0.88182187379611232]
[0,0,26.446470588235883,0,0,0.87916838054277868,0.87916838054277868]
[0,0,26.472941176471178,0,0,0.87651488728944482,0.87651488728944482]
[0,0,26.499411764706473,0,0,0.87386139403611152,0.87386139403611152]
[0,0,26.525882352941768,0,0,0.87120790078277766,0.87120790078277766]
[0,0,26.552352941177062,0,0,0.86855440752944391,0.86855440752944391]
[0,0,26.578823529412357,0,0,0.86593329025736709,0.86593329025736709]
[0,0,26.605294117647652,0,0,0.86374785694632328,0.86374785694632328]
[0,0,26.631764705882947,0,0,0.86156242363528701,0.86156242363528701]
[0,0,26.658235294118242,0,0,0.85937699032424286,0.85937699032424286]
[0,0,26.684705882353537,0,0,0.8571915570131986,0.8571915570131986]
[0,0,26.711176470588832,0,0,0.85500612370215445,0.85500612370215445]
[0,0,26.737647058824127,0,0,0.85282069039111064,0.85282069039111064]
[0,0,26.764117647059422,0,0,0.85063525708006615,0.85063525708006615]
[0,0,26.790588235294717,0,0,0.84844982376902189,0.84844982376902189]
[0,0,26.817058823530012,0,0,0.84626439045797786,0.84626439045797786]
[0,0,26.843529411765306,0,0,0.8440789571469336,0.8440789571469336]
[0,0,26.870000000000601,0,0,0.84189352383588933,0.84189352383588933]
[0,0,26.896470588235896,0,0,0.83970809052484519,0.83970809052484519]
[0,0,26.922941176471191,0,0,0.83752265721380137,0.83752265721380137]
[0,0,26.949411764706486,0,0,0.83533722390275689,0.83533722390275689]
[0,0,26.975882352941781,0,0,0.83315179059171274,0.83315179059171274]
[0,0,27.002352941177076,0,0,0.83096635728066848,0.83096635728066848]
[0,0,27.028823529412371,0,0,0.82878092396962433,0.82878092396962433]
[0,0,27.055294117647666,0,0,0.82659549065858029,0.82659549065858029]
[0,0,27.081764705882961,0,0,0.82441005734753603,0.82441005734753603]
[0,0,27.108235294118256,0,0,0.8222246240364921,0.8222246240364921]
[0,0,27.134705882353551,0,0,0.82003919072544762,0.82003919072544762]
[0,0,27.161176470588845,0,0,0.8178537574144118,0.8178537574144118]
[0,0,27.18764705882414,0,0,0.81566832410336765,0.81566832410336765]
[0,0,27.214117647059435,0,0,0.8134828907923235,0.8134828907923235]
[0,0,27.24058823529473,0,0,0.81129745748127935,0.81129745748127935]
[0,0,27.267058823530025,0,0,0.80911202417023509,0.80911202417023509]
[0,0,27.29352941176532,0,0,0.80692659085919094,0.80692659085919094]
[0,0,27.320000000000615,0,0,0.80474115754814668,0.80474115754814668]
[0,0,27.34647058823591,0,0,0.80255572423710253,0.80255572423710253]
[0,0,27.372941176471205,0,0,0.80037029092605838,0.80037029092605838]
[0,0,27.3994117647065,0,0,0.79818485761501412,0.79818485761501412]
[0,0,27.425882352941795,0,0,0.79599942430397008,0.79599942430397008]
[0,0,27.452352941177089,0,0,0.79381399099292571,0.79381399099292571]
[0,0,27.478823529412384,0,0,0.79162855768188201,0.79162855768188201]
[0,0,27.505294117647679,0,0,0.78944312437083752,0.78944312437083752]
[0,0,27.531764705882974,0,0,0.78725769105979337,0.78725769105979337]
[0,0,27.558235294118269,0,0,0.785072257748749,0.785072257748749]
[0,0,27.584705882353564,0,0,0.78288682443770508,0.78288682443770508]
[0,0,27.611176470588859,0,0,0.7807013911266607,0.7807013911266607]
[0,0,27.637647058824154,0,0,0.77851595781561655,0.77851595781561655]
[0,0,27.664117647059449,0,0,0.77633052450458073,0.77633052450458073]
[0,0,27.690588235294744,0,0,0.77414509119353658,0.77414509119353658]
[0,0,27.717058823530039,0,0,0.77195965788249232,0.77195965788249232]
[0,0,27.743529411765333,0,0,0.76977422457144817,0.76977422457144817]
[0,0,27.770000000000628,0,0,0.76758879126040402,0.76758879126040402]
[0,0,27.796470588235923,0,0,0.7654033579493601,0.7654033579493601]
[0,0,27.822941176471218,0,0,0.76321792463831561,0.76321792463831561]
[0,0,27.849411764706513,0,0,0.76103249132727147,0.76103249132727147]
[0,0,27.875882352941808,0,0,0.75884705801622732,0.75884705801622732]
[0,0,27.902352941177103,0,0,0.75666162470518317,0.75666162470518317]
[0,0,27.928823529412398,0,0,0.75447619139413902,0.75447619139413902]
[0,0,27.955294117647693,0,0,0.75229075808309476,0.75229075808309476]
[0,0,27.981764705882988,0,0,0.75010532477205083,0.75010532477205083]
[0,0,28.008235294118283,0,0,0.74791989146100646,0.74791989146100646]
[0,0,28.034705882353578,0,0,0.74573445814996242,0.74573445814996242]
[0,0,28.061176470588872,0,0,0.743751835100952,0.743751835100952]
[0,0,28.087647058824167,0,0,0.74212034815177064,0.74212034815177064]
[0,0,28.114117647059462,0,0,0.7404888612025895,0.7404888612025895]
[0,0,28.140588235294757,0,0,0.73885737425340814,0.73885737425340814]
[0,0,28.167058823530052,0,0,0.73722588730422711,0.73722588730422711]
[0,0,28.193529411765347,0,0,0.73559440035505186,0.73559440035505186]
[0,0,28.220000000000642,0,0,0.7339629134058705,0.7339629134058705]
[0,0,28.246470588235937,0,0,0.73233142645668936,0.73233142645668936]
[0,0,28.272941176471232,0,0,0.73069993950750811,0.73069993950750811]
[0,0,28.299411764706527,0,0,0.72906845255832675,0.72906845255832675]
[0,0,28.325882352941822,0,0,0.7274369656091455,0.7274369656091455]
[0,0,28.352352941177116,0,0,0.72580547865996459,0.72580547865996459]
[0,0,28.378823529412411,0,0,0.72417399171078323,0.72417399171078323]
[0,0,28.405294117647706,0,0,0.72254250476160209,0.72254250476160209]
[0,0,28.431764705883001,0,0,0.72091101781242062,0.72091101781242062]
[0,0,28.458235294118296,0,0,0.71927953086323948,0.71927953086323948]
[0,0,28.484705882353591,0,0,0.71764804391405812,0.71764804391405812]
[0,0,28.511176470588886,0,0,0.71601655696487687,0.71601655696487687]
[0,0,28.537647058824181,0,0,0.71438507001569584,0.71438507001569584]
[0,0,28.564117647059476,0,0,0.71275358306651437,0.71275358306651437]
[0,0,28.590588235294771,0,0,0.71112209611733324,0.71112209611733324]
[0,0,28.617058823530066,0,0,0.70949060916815176,0.70949060916815176]
[0,0,28.64352941176536,0,0,0.70785912221897074,0.70785912221897074]
[0,0,28.670000000000655,0,0,0.70622763526978949,0.70622763526978949]
[0,0,28.69647058823595,0,0,0.70459614832060824,0.70459614832060824]
[0,0,28.722941176471245,0,0,0.70296466137143321,0.70296466137143321]
[0,0,28.74941176470654,0,0,0.70133317442225196,0.70133317442225196]
[0,0,28.775882352941835,0,0,0.69970168747307071,0.69970168747307071]
[0,0,28.80235294117713,0,0,0.69807020052388935,0.69807020052388935]
[0,0,28.828823529412425,0,0,0.69643871357470821,0.69643871357470821]
[0,0,28.85529411764772,0,0,0.69480722662552719,0.69480722662552719]
[0,0,28.881764705883015,0,0,0.6931757396763456,0.6931757396763456]
[0,0,28.90823529411831,0,0,0.69154425272716458,0.69154425272716458]
[0,0,28.934705882353605,0,0,0.68991276577798311,0.68991276577798311]
[0,0,28.961176470588899,0,0,0.68828127882880208,0.68828127882880208]
[0,0,28.987647058824194,0,0,0.6866497918796205,0.6866497918796205]
[0,0,29.014117647059489,0,0,0.68501830493043947,0.68501830493043947]
[0,0,29.040588235294784,0,0,0.68338681798125822,0.68338681798125822]
[0,0,29.067058823530079,0,0,0.68175533103207697,0.68175533103207697]
[0,0,29.093529411765374,0,0,0.68012384408289595,0.68012384408289595]
[0,0,29.120000000000669,0,0,0.67849235713371447,0.67849235713371447]
[0,0,29.146470588235964,0,0,0.67686087018453345,0.67686087018453345]
[0,0,29.172941176471259,0,0,0.67522938323535198,0.67522938323535198]
[0,0,29.199411764706554,0,0,0.67359789628617084,0.67359789628617084]
[0,0,29.225882352941849,0,0,0.67196640933699592,0.67196640933699592]
[0,0,29.252352941177143,0,0,0.67033492238781434,0.67033492238781434]
[0,0,29.278823529412438,0,0,0.66870343543863342,0.66870343543863342]
[0,0,29.305294117647733,0,0,0.66707194848945184,0.66707194848945184]
[0,0,29.331764705883028,0,0,0.66544046154027081,0.66544046154027081]
[0,0,29.358235294118323,0,0,0.66380897459108956,0.66380897459108956]
[0,0,29.384705882353618,0,0,0.66217748764190831,0.66217748764190831]
[0,0,29.411176470588913,0,0,0.66054600069272718,0.66054600069272718]
[0,0,29.437647058824208,0,0,0.6589145137435457,0.6589145137435457]
[0,0,29.464117647059503,0,0,0.65728302679436468,0.65728302679436468]
[0,0,29.490588235294798,0,0,0.6556515398451831,0.6556515398451831]
[0,0,29.517058823530093,0,0,0.65402005289600218,0.65402005289600218]
[0,0,29.543529411765387,0,0,0.6523885659468206,0.6523885659468206]
[0,0,29.570000000000682,0,0,0.65075707899763968,0.65075707899763968]
[0,0,29.596470588235977,0,0,0.64912559204845843,0.64912559204845843]
[0,0,29.622941176471272,0,0,0.64749410509927718,0.64749410509927718]
[0,0,29.649411764706567,0,0,0.64586261815009582,0.64586261815009582]
[0,0,29.675882352941862,0,0,0.64423113120091446,0.64423113120091446]
[0,0,29.702352941177157,0,0,0.64259964425173322,0.64259964425173322]
[0,0,29.728823529412452,0,0,0.64096815730255197,0.64096815730255197]
[0,0,29.755294117647747,0,0,0.63933667035337705,0.63933667035337705]
[0,0,29.781764705883042,0,0,0.63770518340419569,0.63770518340419569]
[0,0,29.808235294118337,0,0,0.63607369645501444,0.63607369645501444]
[0,0,29.834705882353632,0,0,0.63444220950583319,0.63444220950583319]
[0,0,29.861176470588926,0,0,0.63281072255665194,0.63281072255665194]
[0,0,29.887647058824221,0,0,0.63117923560747102,0.63117923560747102]
[0,0,29.914117647059516,0,0,0.62954774865828966,0.62954774865828966]
[0,0,29.940588235294811,0,0,0.62791626170910841,0.62791626170910841]
[0,0,29.967058823530106,0,0,0.62628477475992705,0.62628477475992705]
[0,0,29.993529411765401,0,0,0.62465328781074592,0.62465328781074592]
[0,0,30.020000000000696,0,0,0.62302180086156456,0.62302180086156456]
[0,0,30.046470588235991,0,0,0.62139031391238331,0.62139031391238331]
[0,0,30.072941176471286,0,0,0.61975882696320195,0.61975882696320195]
[0,0,30.099411764706581,0,0,0.61812734001402092,0.61812734001402092]
[0,0,30.125882352941876,0,0,0.61649585306483945,0.61649585306483945]
[0,0,30.15235294117717,0,0,0.61486436611565842,0.61486436611565842]
[0,0,30.178823529412465,0,0,0.61323287916647717,0.61323287916647717]
[0,0,30.20529411764776,0,0,0.61160139221729604,0.61160139221729604]
[0,0,30.231764705883055,0,0,0.60996990526811468,0.60996990526811468]
[0,0,30.25823529411835,0,0,0.60833841831893332,0.60833841831893332]
[0,0,30.284705882353645,0,0,0.6067069313697584,0.6067069313697584]
[0,0,30.31117647058894,0,0,0.60507544442057715,0.60507544442057715]
[0,0,30.337647058824235,0,0,0.6034439574713959,0.6034439574713959]
[0,0,30.36411764705953,0,0,0.60181247052221443,0.60181247052221443]
[0,0,30.390588235294825,0,0,0.60018098357303329,0.60018098357303329]
[0,0,30.41705882353012,0,0,0.59854949662385215,0.59854949662385215]
[0,0,30.443529411765414,0,0,0.59691800967467068,0.59691800967467068]
[0,0,30.470000000000709,0,0,0.59528652272548976,0.59528652272548976]

{"sheet":"Help_Page","index":6,"n_rows":168,"n_cols":5,"rows_kept":168,"cut":false,"hidden":false,"merged":[[0,4,0,6],[5,1,5,8],[98,1,98,8],[69,1,69,8],[70,1,70,8],[71,1,71,8],[85,1,85,8],[86,1,86,8],[167,1,167,9],[144,1,144,8],[103,1,103,8],[2,0,2,8],[3,1,3,8],[146,1,146,9],[147,1,147,9]]}
[null,null,null,null,"Help Page"]
[]
[]
[null,"This Hall Effect Sensor Proximity tool is designed to assist with quick preliminary calculations for determing Hall and magnet sensor placement.  While intended to assist in design, it is not expected serve as a replacement to bench verification. Please exercise due diligence in verifying your setup and final design on the bench."]
[]
[null,"\nThis tool is composed of six general design stages listed below.  First pass design requires the user complete each stage sequentially."]
[null,"1-","General Implementation"]
[null,"2-","Magnet Characteristics"]
[null,"3-","Displacement Dimensions"]
[null,"4-","Sensor Operation Conditions"]
[null,"5-","Sensor Filters"]
[null,"6-","Calculation"]
[]
[]
[null,"General Implementation"]
[]
[null,"Magnet Movement"]
[]
[]
[]
[]
[]
[]
[]
[]
[]
[]
[]
[]
[]
[]
[null,"Magnet Shapes"]
[]
[]
[]
[]
[]
[]
[null,"L  = Length"]
[null,"W = Width"]
[null,"T = Thickness"]
[null,"R = Radius"]
[null,"Ri = Inner Radius"]
[]
[null,"Magnet Orientation"]
[]
[]
[]
[]
[]
[]
[]
[]
[]
[]
[]
[null,"Magnet Characteristics"]
[]
[]
[]
[]
[]
[]
[]
[]
[]
[]
[]
[]
[null,"L  = Length"]
[null,"W = Width"]
[null,"T = Thickness"]
[]
[]
[]
[]
[]
[]
[]
[]
[]
[]
[]
[]
[]
[null,"R = Radius"]
[null,"T = Thickness"]
[]
[]
[]
[]
[]
[]
[]
[]
[]
[]
[]
[null,"R = Radius"]
[]
[null,"Displacement Dimensions"]
[]
[null,"Head-On"]
[null,"For Head-On displacement, all measurements are made relative to the bottom face of the magnet and the top face of the sensor."]
[]
[]
[null,"Slide-By"]
[]
[]
[]
[]
[]
[null,"Hinge"]
[]
[]
[]
[]
[]
[]
[]
[]
[]
[]
[]
[null,"Calculation"]
[]
[]
[]
[]
[]
[]
[]
[]
[]
[]
[]
[]
[]
[]
[]
[]
[]
[]
[]
[null,"The chart range is bounded by the values entered in d1 and d2.  If the range is sufficiently large and appropriately chosen, both BOP max and BRP min should be visible.  These are the key specifications that need to be within your design range to guarantee the your system will adequately trigger for all units."]
[null,"FEMM"]
[null,"In order to get calculation results for the cylinder or sphere magnet, you will need to have FEMM installed on your computer.  FEMM can be found at the link below."]
[null,"https://www.femm.info/wiki/HomePage"]
[]
[]
[]
[]
[]
[]
[]
[]
[]
[]
[]
[]
[]
[]
[]
[]
[]
[]
[null,"Error"]
[null,"It is possible through some combinations of choices and entries that the tool might run into an error or issue.  In those cases, you may be able to resolve the issue by hitting clear."]

{"sheet":"About","index":7,"n_rows":6,"n_cols":19,"rows_kept":6,"cut":false,"hidden":false,"merged":[[0,0,0,16383],[4,9,4,15],[5,9,5,15]]}
[]
[]
[null,"Version Number","1.0"]
[null,null,null,null,null,null,null,null,"Version History",null,null,null,null,null,null,null,null,null,"Relevant Citations"]
[null,null,null,null,null,null,null,null,"Version","Change List Description",null,null,null,null,null,null,null,null,"For Block Magnet Equation, see Andreev, Andrew. Universal Method for the Calculation of Magnetic Microelectronic Components: the saturated ferromagnetic Rectangular Prism and the Rectangular Coil located at IEEE"]
[null,null,null,null,null,null,null,null,"1.0","Initial Release"]