{"text_format":"1","workbook":"xlsx","n_sheets":16,"sheets":["Revision","Instructions","Clocking Diagram","Main_PLL","PASS_PLL","DDR3_PLL","PCIe","SRIO","SGMII","MDIO","HYPERLINK","EMIF16","TIMER","I2C","SPI","UART"],"not_rendered":{"charts":0,"images":1,"macros":1,"external_links":1,"defined_names":7,"comments":0,"pivot_tables":0},"unopened":[],"bounds":{"document_bytes":16777216,"sheet_cells":100000,"rows_first":2000,"rows_last":500,"rows_between":2000,"halvings":0,"cell_chars":16384,"cell_head_chars":4096},"cells_cut":0,"cells_raw":0,"read":"whole","date_system":"1900"}

{"sheet":"Revision","index":0,"n_rows":25,"n_cols":3,"rows_kept":25,"cut":false,"hidden":false,"merged":[]}
[]
["PLL, System and Peripheral Clock Generation Tool "]
[]
["Version","Date","Comments"]
["1.0.0","2015-09-25","Initial Release"]
[]
[]
[]
[]
[]
[]
[]
[]
[]
[]
[]
[]
[]
[]
["Applicable Devices"]
["Key stone multicore C667x DSP"]
[]
["GEL File Details"]
["File Name: EVMC6678L.gel"]
["Revision: 2.0005"]

{"sheet":"Instructions","index":1,"n_rows":83,"n_cols":4,"rows_kept":83,"cut":false,"hidden":false,"merged":[[0,1,1,1]]}
[null,"INSTRUCTIONS"]
[]
["SL. No","Usability"]
[1,"The yellow highlighted fields are user accessible.",null,"INPUTS"]
[2,"The orange highlighted fields are fixed ratios. User do not have access to change this.",null,"FIXED RATIOS"]
[3,"The blue highlighted fields are output. User do not have access to change this.",null,"OUTPUTS"]
[4,"The user need to work on the Main_PLL tab first to get the desired SYSCLKs and then move on to other tabs."]
[]
["SL. No","Main_PLL"]
[1,"Excel macros need to be enabled in order to have the GEL default button operational."]
[2,"The user could load the GEL default values on PLLM, PLLD etc., by clicking \"GEL DEFAULT\" button in Main_PLL section. This will load the default values in Main_PLL, PASS_PLL and DDR3_PLL sections."]
[3,"Device speed can be selected from drop down menu."]
[4,"Standard SYSCLK values are available in the drop down menu. Do not use 100.00001 as this is used for internal calculations. When SYSCLK value is selected, the PLLD, PLLM and CLKOD fields are updated with predefined value."]
[5,"When the user want to use custom clock, they need to select \"CUSTOM\" in SYSCLK field and value can be entered in CUSTOMCLK field. In this case, the PLLD, PLLM and CLKOD values could be entered manually in user input fields."]
[6,"In order to minimize the output jitter, choose a configuration that maximizes VCO frequency. Then divide that frequency through the output divide (CLKOD) to their desired output frequency."]
[7,"The PLLEN and PLLENSRC fields must be selected accordingly to enable the PLL output."]
[8,"The user field values are decimal equivalent of register values. Hence the value would added by 1 for calculation."]
[9,"When \"OUT OF RANGE\" message is shown in PLLM output/SYSCLKs, the user inputs need to be changed to set these value under the limits."]
[10,"Putting the PLL in bypass mode changes the SYSCLK outputs to INVALID."]
[]
["SL. No","PASS_PLL"]
[1,"The PACLKSEL is available to choose the input either from CORECLK or PASSCLK."]
[2,"When CORECLK is selected as input and standard input clock is selected, the PLL fields are updated with predefined values."]
[3,"When CORECLK is selected as input and set into custom value, the user need to enter PLL fields manually."]
[4,"When PASSCLK is selected as input, the user need to enter PLLD, PLLM and CLKOD fields manually."]
[5,"There is another mux available where user can select either PASS PLL output or SYSCLK1 (Test Mode) to the PASS by changing PLLSELECT field."]
[6,"The user field values are decimal equivalent of register values. Hence the value would added by 1 for calculation."]
[7,"When \"OUT OF RANGE\" message is shown in PLLM output/PLL output, the user inputs need to be changed to set these value under the limits."]
[8,"Putting the PLL in bypass mode changes the output clock to INVALID."]
[]
["SL. No","DDR3_PLL"]
[1,"The user want to enter the DDR3CLK and all PLL fields manually."]
[2,"The user field values are decimal equivalent of register values. Hence the value would added by 1 for calculation."]
[3,"When \"OUT OF RANGE\" message is shown in PLLM output/PLL output/DDR3 data rate, the user inputs need to be changed to set these value under the limits."]
[4,"Putting the PLL in bypass mode changes the DDR3 data rate to INVALID."]
[]
["SL. No","PCIe"]
[1,"The user has to select the PCIe0CLK and PCIe mode from drop down menu."]
[2,"The PLL fields would be loaded internally and outputs line rate."]
[]
{"$rows_left_out":44}
{"sheet":"Clocking Diagram","index":2,"n_rows":0,"n_cols":0,"rows_kept":0,"cut":false,"hidden":false,"merged":[]}

{"sheet":"Main_PLL","index":3,"n_rows":4527,"n_cols":24,"rows_kept":4527,"cut":false,"hidden":false,"merged":[[1,5,2,12],[11,15,12,15],[27,5,29,10],[4,8,5,9],[7,3,7,4],[12,1,14,2],[23,0,24,0],[23,1,24,1],[23,2,24,2]]}
[]
[null,null,null,null,null,"C667x SYSTEM PLL CALCULATOR"]
[]
[]
[null,null,null,null,null,null,null,null,"SYSTEM PLL",null,null,null,null,null,"Main PLL output clock (PLLOUT) = (CLKIN × (PLLM+1)) ÷ ((CLKOD+1) × (PLLD+1))"]
[null,"Device Speed"]
[null,1000,null,null,null,null,null,null,null,{"$f":"IF(J8<415,\"OUT OF RANGE\",IF(J8>3400,\"OUT OF RANGE\",\"\"))","v":""}]
[null,"CORECLK (P/N)",null,{"$f":"(J434)","v":100},null,null,"PLLD",{"$f":"IF(J432,SUM(D8/G432),SUM(D8/G433))","v":100},null,{"$f":"IF(J432,SUM(H8*H432),SUM(H8*H433))","v":2000},"CLKOD",{"$f":"SUM(J8/(K9+1))","v":1000}]
[null,100,null,null,null,null,{"$f":"IF(J432,L448,\"CUSTOM\")","v":0},null,null,null,1,null,null,null,null,null,null,null,null,null,null,"          1/6",{"$f":"IF(J16=1,\"\",IF(W10<125,\"OUT OF RANGE\",IF(W10>(B7/6*1.01),\"OUT OF RANGE\",\"\")))","v":""}]
[null,"CUSTOM CLK",null,null,null,null,0,null,"PLLM",null,null,null,null,{"$f":"IF(J16,G12,L8)","v":1000},null,null,null,null,null,null,null,null,{"$f":"SUM(P12/6)","v":166.66666666666666},"SYSCLKOUT"]
[null,50,null,null,null,null,null,null,{"$f":"IF(J432,L449,\"CUSTOM\")","v":19}]
[null,null,null,null,null,null,{"$f":"IF(J432,B9,B11)","v":100},null,13,null,null,null,null,null,null,{"$f":"IF(O26,N10,D8)","v":1000},null,null,null,null,null,null,{"$f":"IF(J16=1,\"\",IF(W13<750,\"OUT OF RANGE\",IF(W13>(B7*1.01),\"OUT OF RANGE\",\"\")))","v":""}]
[null,"Note: Do not use 100.00001 in CORECLK drop down list",null,null,null,null,null,null,null,null,null,null,null,null,null,null,null,null,null,"PLLLDIV1",1,null,{"$f":"IF(J16,\"INVALID\",SUM(P12/U13))","v":1000},"SYSCLK1"]
[]
[null,null,null,null,null,null,null,null,null,"BYPASS",null,null,null,null,null,null,null,null,null,null,null,null,{"$f":"IF(J16=1,\"\",IF(W16>350,\"OUT OF RANGE\",\"\"))","v":""}]
[null,null,null,null,null,null,null,null,null,0,null,null,null,null,null,null,null,null,null,"PLLLDIV2",3,null,{"$f":"IF(J16,\"INVALID\",SUM(P12/(U16+1)))","v":250},"SYSCLK2"]
[null,"FIXED RATIOS"]
[null,"INPUTS"]
[null,"OUTPUTS",null,null,null,null,null,null,null,null,null,null,null,null,null,null,null,null,null,"PLLLDIV3",2,null,{"$f":"IF(J16,\"INVALID\",SUM(P12/(U19)))","v":500},"SYSCLK3"]
[]
["Registers:"]
["Name","Bit Position","Value",null,null,null,null,null,null,null,null,null,null,null,null,null,null,null,null,"PLLLDIV4",3,null,{"$f":"IF(J16,\"INVALID\",SUM(P12/(U22)))","v":333.33333333333331},"SYSCLK4"]
["MAINPLLCTL0.PLLD","5 : 0",{"$f":"IF(J432,CONCATENATE(\"0x\",DEC2HEX(G9,2)),CONCATENATE(\"0x\",DEC2HEX(G10,2)))","v":"0x00"}]
["MAINPLLCTL0.PLLM[12:6] & PLLM[5:0]","18 : 12 & 5 : 0",{"$f":"IF(J432,CONCATENATE(\"0x\",DEC2HEX(I11,4)),CONCATENATE(\"0x\",DEC2HEX(I12,4)))","v":"0x0013"},null,null,null,null,null,null,null,null,null,null,null,null,null,null,null,null,null,null,null,{"$f":"IF(J16=1,\"\",IF(W25>210,\"OUT OF RANGE\",IF(W25<32,\"OUT OF RANGE\",\"\")))","v":""}]
[null,null,null,null,null,"Note:",null,null,null,null,null,null,0,null,null,null,null,null,null,"PLLLDIV5",5,null,{"$f":"IF(J16,\"INVALID\",SUM(P12/(U25+1)))","v":166.66666666666666},"SYSCLK5"]
["SECCTL.OUTPUT DIVIDE","22 :19",{"$f":"IF(J432,CONCATENATE(\"0x\",DEC2HEX(K9,1)),CONCATENATE(\"0x\",DEC2HEX(K10,1)))","v":"0x1"},null,null,"1. Please refer instructions for clarification on actual PLLD/PLLM and its register value.",null,null,null,null,null,null,null,null,{"$f":"IF(M33,M25,M29)","v":1}]
["SECCTL.BYPASS",23,{"$f":"CONCATENATE(\"0x\",DEC2HEX(J16,1))","v":"0x0"},null,null,"2. Initial silicon V1.0 may support only 800 MHz, 1000 MHz, and 1200 MHz frequencies by default."]
["PLLCTL.PLLEN",0,{"$f":"CONCATENATE(\"0x\",DEC2HEX(M29,1))","v":"0x1"},null,null,"3. In case any of the other programmable SYSCLKs are set slower than 1/64 rate, then SYSCLK8 (SLOW_SYSCLK) must be programmed to either match, or be slower than, the slowest SYSCLK in the system.",null,null,null,null,null,null,"PLLEN",null,null,null,null,null,null,"PLLLDIV6",64,null,{"$f":"IF(J16,\"INVALID\",SUM(P12/(U28)))","v":15.625},"SYSCLK6"]
["PLLCTL.PLLENSRC",5,{"$f":"CONCATENATE(\"0x\",DEC2HEX(M33,1))","v":"0x0"},null,null,null,null,null,null,null,null,null,1]
["PLLDIV2.RATIO","7 : 0",{"$f":"CONCATENATE(\"0x\",DEC2HEX(U16,2))","v":"0x03"}]
["PLLDIV5.RATIO","7 : 0",{"$f":"CONCATENATE(\"0x\",DEC2HEX(U25,2))","v":"0x05"},null,null,null,null,null,null,null,null,null,null,null,null," ",null,null,null,"PLLLDIV7",6,null,{"$f":"IF(J16,\"INVALID\",SUM(P12/(U31)))","v":166.66666666666666},"SYSCLK7"]
["PLLDIV8.RATIO","7 : 0",{"$f":"CONCATENATE(\"0x\",DEC2HEX(U34,2))","v":"0x40"},null,null,null,null,null,null,null,null,null,"PLLENSRC"]
[null,null,null,null,null,null,null,null,null,null,null,null,0]
[null,null,null,null,null,null,null,null,null,null,null,null,null,null,null,null,null,null,null,"PLLLDIV8",64,null,{"$f":"IF(J16,\"INVALID\",SUM(P12/(U34+1)))","v":15.384615384615385},"SYSCLK8"]
[]
[]
[null,null,null,null,null,null,null,null,null,null,null,null,null,null,null,null,null,null,null,"PLLLDIV9",12,null,{"$f":"IF(J16,\"INVALID\",SUM(P12/(U37)))","v":83.333333333333329},"SYSCLK9"]
[]
[]
[null,null,null,null,null,null,null,null,null,null,null,null,null,null,null,null,null,null,null,"PLLLDIV10",3,null,{"$f":"IF(J16,\"INVALID\",SUM(P12/(U40)))","v":333.33333333333331},"SYSCLK10"]
{"$rows_left_out":4488}
{"sheet":"PASS_PLL","index":4,"n_rows":4291,"n_cols":20,"rows_kept":4291,"cut":false,"hidden":false,"merged":[[0,5,2,12],[9,5,10,12],[24,14,26,19],[13,14,13,15],[13,17,13,18],[13,19,14,19]]}
[null,null,null,null,null,"PASS PLL CLOCKING SECTION"]
[]
[]
[]
[]
[]
[]
[]
[]
[null,null,null,null,null,"NETCP PLL"]
[null,null,null,null,null,null,null,null,null,null,null,null,null,null,null,"SYSCLK1"]
[null,null,{"$f":"IF(Main_PLL!B9=\"CUSTOM\",\"CUSTOM\",\"\")","v":""},null,null,null,null,null,null,{"$f":"IF(J13<700,\"OUT OF RANGE\",IF(J13>4000,\"OUT OF RANGE\",\"\"))","v":""},null,null,null,null,null,{"$f":"(Main_PLL!W13)","v":1000}]
[null,"CORECLK (P/N)",{"$f":"(Main_PLL!G12)","v":100},null,null,{"$f":"IF(C19,C15,C13)","v":100},"PLLD",{"$f":"IF(Main_PLL!B9=\"CUSTOM\",SUM(F13/(G15+1)),IF(C19,SUM(F13/(G15+1)),SUM(F13/(G14+1))))","v":100},null,{"$f":"IF(Main_PLL!B9=\"CUSTOM\",SUM(H13*D197),IF(C19,SUM(H13*D197),SUM(H13*D196)))","v":2100},"÷",{"$f":"SUM(J13/(K14))","v":1050}]
[null,null,null,null,null,null,{"$f":"IF(C19,\"EXTERNAL\",IF(Main_PLL!B9=\"CUSTOM\",\"CUSTOM\",K211))","v":0},null,19,null,2,null,null,{"$f":"IF(J22,\"\",(IF(N16<1040,\"OUT OF RANGE\",IF(N16>1051,\"OUT OF RANGE\",\"\"))))","v":""},null,null,null,null,null,{"$f":"IF(P22,\"\",\"TEST MODE\")","v":""}]
[null,"PASSCLK (P/N)",200,null,null,null,0,null,null,null,null,null,null,{"$f":"IF(J22,\"\",(IF(N16<1040,\"AFFECTS THROUGHPUT\",IF(N16>1051,\"AFFECTS THROUGHPUT\",\"\"))))","v":""}]
[null,null,null,null,null,null,null,null,"PLLM",null,null,null,null,{"$f":"IF(J22,K18,L13)","v":1050},null,null,null,"     ÷",null,{"$f":"IF(J22,IF(P22,\"INVALID\",IF(P22,M196,M197)),IF(P22,M196,M197))","v":350}]
[null,null,null,null,null,null,null,null,{"$f":"IF(C19,\"EXTERNAL\",IF(Main_PLL!B9=\"CUSTOM\",\"CUSTOM\",Q211))","v":20},null,null,null,null,null,null,null,null,3]
[null,null,"PACLKSEL",null,null,null,null,null,19,0,{"$f":"SUM(F13)","v":100}]
[null,null,0]
[]
[null,null,null,null,null,null,null,null,null,"BYPASS",null,null,null,null,null,"PLLSELECT"]
[null,null,null,null,null,null,null,null,null,0,null,null,null,null,null,1]
[]
[null,"Registers:"]
[null,"Name","Bit Position","Value",null,null,null,null,null,null,null,null,null,null,"Note: SYSCLK is for test mode and it is not meant for operational use. The PLL SELECT must never be toggled during operation as this can corrupt the PASS."]
[null,"PASSPLLCTL0.PLLD","5 : 0",{"$f":"IF(G14=\"EXTERNAL\",CONCATENATE(\"0x\",DEC2HEX(G15,2)),IF(G14=\"CUSTOM\",CONCATENATE(\"0x\",DEC2HEX(G15,2)),CONCATENATE(\"0x\",DEC2HEX(G14,2))))","v":"0x00"}]
[null,"PASSPLLCTL0.PLLM","18 : 6",{"$f":"IF(I17=\"EXTERNAL\",CONCATENATE(\"0x\",DEC2HEX(I18,2)),IF(I17=\"CUSTOM\",CONCATENATE(\"0x\",DEC2HEX(I18,2)),CONCATENATE(\"0x\",DEC2HEX(I17,2))))","v":"0x14"},null,"Note:"]
[null,"PASSPLLCTL0.BYPASS",23,{"$f":"CONCATENATE(\"0x\",DEC2HEX(J22,1))","v":"0x0"},null,"Please refer instructions for clarification on actual PLLD/PLLM and its register value."]
[null,"PASSPLLCTL1.PLLSELECT",13,{"$f":"CONCATENATE(\"0x\",DEC2HEX(O22,1))","v":"0x0"}]
[]
[]
[]
[]
[]
[]
[]
[]
[]
[]
[]
{"$rows_left_out":4252}
{"sheet":"DDR3_PLL","index":5,"n_rows":4282,"n_cols":15,"rows_kept":4282,"cut":false,"hidden":false,"merged":[[0,5,1,11]]}
[null,null,null,null,null,"DDR3 CLOCKING SECTION"]
[]
[]
[null,null,null,null,null,null,null,null,"DDR3 PLL"]
[]
[null,null,null,null,null,null,null,null,{"$f":"IF(I7<700,\"OUT OF RANGE\",IF(I7>4000,\"OUT OF RANGE\",\"\"))","v":""}]
[null,null,"DDR3CLK (P/N)",null,null,"PLLD",{"$f":"SUM(C8/E187)","v":66.667000000000002},null,{"$f":"SUM(G7*F187)","v":1133.3389999999999},null,"÷",{"$f":"SUM(I7/(K8))","v":566.66949999999997}]
[null,null,66.667000000000002,null,null,0,null,null,null,null,2,null,null,{"$f":"IF(I14,\"\",IF(N9<400,\"OUT OF RANGE\",IF(N9>800,\"OUT OF RANGE\",\"\")))","v":""}]
[null,null,null,null,null,null,null,null,null,null,null,null,null,{"$f":"IF(I14,K11,L7)","v":566.66949999999997},"DDR3 CLKOUT"]
[null,null,null,null,null,null,null,"PLLM",null,null,null,null,null,null,{"$f":"IF(I14,\"INVALID\",(N9))","v":566.66949999999997}]
[null,null,null,null,null,null,null,16,null,null,{"$f":"SUM(C8)","v":66.667000000000002},null,null,null,{"$f":"IF(I14,\"\",IF(O10<400,\"OUT OF RANGE\",IF(O10>800,\"OUT OF RANGE\",\"\")))","v":""}]
[]
[null,null,null,null,null,null,null,null,"BYPASS",null,null,null,null,null,"DDR3 Data Rate"]
[null,null,null,null,null,null,null,null,0,null,null,null,null,null,{"$f":"IF(I14,\"INVALID\",(O10*2))","v":1133.3389999999999}]
["Registers:",null,null,null,null,null,null,null,null,null,null,null,null,null,{"$f":"IF(I18,\"\",IF(O14<800,\"OUT OF RANGE\",IF(O14>1600,\"OUT OF RANGE\",\"\")))","v":""}]
["Name","Bit Position","Value"]
["DDR3PLLCTL0.PLLD","5 : 0",{"$f":"CONCATENATE(\"0x\",DEC2HEX(F8,2))","v":"0x00"},null,null,"Note: "]
["DDR3PLLCTL0.PLLM","18 : 6",{"$f":"CONCATENATE(\"0x\",DEC2HEX(H11,4))","v":"0x0010"},null,null,"1. The DDR3 device can operate  800/1066/1333/1600 MT/Sec."]
["DDR3PLLCTL0.BYPASS",23,{"$f":"CONCATENATE(\"0x\",DEC2HEX(I14,1))","v":"0x0"},null,null,"2. The DDR3 CLKOUT frequency will be twice of the PLLOUT and DDR3 data rate will be twice of the DDR3 frequency."]
[null,null,null,null,null,"3. Please refer instructions for clarification on actual PLLD/PLLM and its register value."]
[]
[]
[]
[]
[]
[]
[]
[]
[]
[]
[]
[]
[]
[]
[]
[]
[]
[]
[]
[]
{"$rows_left_out":4243}
{"sheet":"PCIe","index":6,"n_rows":129,"n_cols":9,"rows_kept":129,"cut":false,"hidden":false,"merged":[[1,2,2,7],[1,8,2,8]]}
[]
[null,null,"PCIe Clocking Section"]
[]
[]
[null,"PCIe Mode","GEN 1"]
[]
[null,null,null,null,null,null,null,"Configured Line Rate"]
[null,"PCIECLK (P/N)",250,null,null,null,null,{"$f":"IF(C5=\"GEN 1\",2.5,5)","v":2.5}]
[]
[]
[]
[null,null,null,null,null,null,"Rate Scale","PCIe Line Rate"]
[null,null,null,null,null,null,0.5,5,{"$f":"IF(C5=\"GEN 1\",\"INVALID\",\"GEN 2\")","v":"INVALID"}]
[null,null,null,null,null,null,1,2.5,{"$f":"IF(C5=\"GEN 2\",\"INVALID\",\"GEN 1\")","v":"GEN 1"}]
[]
[]
[]
[]
[]
[]
[]
[]
[]
[]
[]
[]
[]
[]
[]
[]
[]
[]
[]
[]
[]
[]
[]
[]
[]
[]
{"$rows_left_out":90}
{"sheet":"SRIO","index":7,"n_rows":143,"n_cols":9,"rows_kept":143,"cut":false,"hidden":false,"merged":[[1,3,2,6],[6,5,7,5]]}
[]
[null,null,null,"SRIO CLOCKING SECTION"]
[]
[]
[]
[null,"Line Rate",5]
[null,null,null,null,null,null,null,null,"Configured Line Rate"]
[null,"SRIOSGMIICLKP/N",156.25,null,null,null,null,null,{"$f":"C6","v":5}]
[]
[]
[]
[]
[null,null,null,null,"Rate Scale","SGMII Line Rate"]
[null,null,null,null,2,1.25]
[null,null,null,null,1,2.5]
[null,null,null,null,"0.5 & 1",3.125]
[null,null,null,null,0.5,5]
[]
[]
[]
[]
[]
[]
[]
[]
[]
[]
[]
[]
[]
[]
[]
[]
[]
[]
[]
[]
[]
[]
[]
{"$rows_left_out":104}
{"sheet":"SGMII","index":8,"n_rows":141,"n_cols":9,"rows_kept":141,"cut":false,"hidden":false,"merged":[[6,5,7,5],[1,3,2,6]]}
[]
[null,null,null,"SGMII CLOCKING SECTION"]
[]
[]
[]
[null,"Line Rate",1.25]
[null,null,null,null,null,null,null,null,"Configured Line Rate"]
[null,"SRIOSGMIICLKP/N",156.25,null,null,null,null,null,{"$f":"C6","v":1.25}]
[]
[]
[]
[]
[null,null,null,null,"Rate Scale","SGMII Line Rate"]
[null,null,null,null,2,1.25]
[]
[]
[]
[]
[]
[]
[]
[]
[]
[]
[]
[]
[]
[]
[]
[]
[]
[]
[]
[]
[]
[]
[]
[]
[]
[]
{"$rows_left_out":102}
{"sheet":"MDIO","index":9,"n_rows":12,"n_cols":10,"rows_kept":12,"cut":false,"hidden":false,"merged":[[5,4,5,5],[1,2,2,6]]}
[]
[null,null,"MDIO CLOCKING SECTION"]
[]
[]
[]
[null,"SGMII PLL OUTPUT",null,"÷",{"$f":"B7/D7","v":250},null,"CLKDIV",null,"MDIO Clock"]
[null,2500,null,10,null,null,100,null,{"$f":"E6/(G7+1)","v":2.4752475247524752},{"$f":"IF(I7>2.5,\"OUT OF RANGE\",\"\")","v":""}]
[]
[]
["Registers:"]
["Name","Bit Position","Value"]
["MDIO_CONTROL.CLKDIV","15 : 0",{"$f":"CONCATENATE(\"0x\",DEC2HEX(G7,4))","v":"0x0064"}]

{"sheet":"HYPERLINK","index":10,"n_rows":143,"n_cols":9,"rows_kept":143,"cut":false,"hidden":false,"merged":[[6,7,7,7],[1,2,2,8]]}
[]
[null,null,"HYPERLINK CLOCKING SECTION"]
[]
[]
[]
[null,"Config Baud Rate",10]
[null,null,null,null,null,null,null,null,"Configured Line Rate"]
[null,"MCMCLKP/N",156.25,null,null,null,null,null,{"$f":"C6","v":10}]
[]
[]
[]
[]
[null,null,null,null,null,"Rate Scale","HyperLink Line Rate"]
[null,null,null,null,null,0.25,{"$f":"C6","v":10}]
[]
[]
[]
[]
[]
[]
[]
[]
[]
[]
[]
[]
[]
[]
[]
[]
[]
[]
[]
[]
[]
[]
[]
[]
[]
[]
{"$rows_left_out":104}
{"sheet":"EMIF16","index":11,"n_rows":12,"n_cols":3,"rows_kept":12,"cut":false,"hidden":false,"merged":[[5,5,6,5],[1,0,2,7],[11,2,13,5]]}
[]
["EMIF16 CLOCKING SECTION"]
[]
[]
[]
[]
[null,"EMIF Clock",{"$f":"(Main_PLL!W31)","v":166.66666666666666}]
[null,null,"SYSCLK7"]
[]
[null,"Clock Period, E",{"$f":"(1/C7)*1000","v":6}]
[]
[null,null,"The clock period, E is used to calculate the setup, hold and strobe timing cycles to be programmed in the Async Config Registers."]

{"sheet":"TIMER","index":12,"n_rows":192,"n_cols":14,"rows_kept":192,"cut":false,"hidden":false,"merged":[[7,0,7,1],[0,5,1,9]]}
[null,null,null,null,null,"TIMER CLOCKING SECTION"]
[]
[]
[]
[]
["SYSCLK7",{"$f":"(Main_PLL!W31)","v":166.66666666666666},null,null,null,null,{"$f":"IF(F11,B14,B6)","v":166.66666666666666},{"$f":"IF(F11,\"Timer counts when low to high\",\" \")","v":" "}]
[]
[null,null,null,null,null,null,null,null,null,null,null,null,null,"Timer Clock"]
[null,null,null,null,null,null,null,null,null,{"$f":"B14","v":50},{"$f":"IF(B16,\"Inverted\",\"Not Inverted\")","v":"Inverted"},null,null,{"$f":"IF(K15,J9,G6)","v":166.66666666666666}]
[null,null,null,null,null,"TIEN_LO",null,null,null,null,null,null,null,{"$f":"IF(K15,K9,H6)","v":" "}]
[null,null,null,null,null,0]
[]
[]
["External Clock",50,null,null,null,null,null,null,null,null,"CLKSRC_LO"]
[null,null,null,null,null,null,null,null,null,null,0]
["INVINP_LO",1]
[]
[]
[null,"Registers"]
[null,"TIEN_LO",{"$f":"CONCATENATE(\"0x\",DEC2HEX(F11,1))","v":"0x0"}]
[null,"CLKSRC_LO",{"$f":"CONCATENATE(\"0x\",DEC2HEX(K15,1))","v":"0x0"}]
[null,"INVINP_LO",{"$f":"CONCATENATE(\"0x\",DEC2HEX(B16,1))","v":"0x1"}]
[]
[]
[]
[]
[]
[]
[]
[]
[]
[]
[]
[]
[]
[]
[]
[]
[]
[]
{"$rows_left_out":153}
{"sheet":"I2C","index":13,"n_rows":6757,"n_cols":19,"rows_kept":6757,"cut":false,"hidden":false,"merged":[]}
[]
[null,"I2C CLOCK GENERATION"]
[null,null,null,null,null,null,null,"SYSCLK7"]
[null,null,null,null,null,null,null,{"$f":"(Main_PLL!W31)","v":166.66666666666666}]
[]
[]
[]
[]
[null,null,"Prescaler",null,"IPSC"]
[null,null,null,null,64]
[]
[null,null,null,null,{"$f":"SUM(H4/(E10+1))","v":2.5641025641025639},"MHz"]
[]
[null,null,"Clock Divider",null,"ICCL","ICCH"]
[null,null,null,null,1,1]
[]
[null,null,null,null,{"$f":"SUM((E12/(E15+1+6+F15+1+6))*1000)","v":160.25641025641025},"KHz"]
[]
[null,null,null,null,null,null,null,"Standard Mode"]
[]
[]
[null,null,null,null,{"$f":"E12","v":2.5641025641025639},"Prescaled module clock must be set to 6.7-13.2 MHz"]
[null,null,null,null,{"$f":"E17","v":160.25641025641025},"I2C Clock Frequency"]
[]
[null,null,null,"ICPSC [7:0]",{"$f":"CONCATENATE(\"0x\",DEC2HEX(E10,2))","v":"0x40"}]
[null,null,null,"ICCL [15:0]",{"$f":"CONCATENATE(\"0x\",DEC2HEX(E15,4))","v":"0x0001"}]
[null,null,null,"ICCH [15:0]",{"$f":"CONCATENATE(\"0x\",DEC2HEX(F15,4))","v":"0x0001"}]
[]
[]
[]
[]
[]
[]
[]
[]
[]
[]
[]
[]
[]
{"$rows_left_out":6718}
{"sheet":"SPI","index":14,"n_rows":301,"n_cols":19,"rows_kept":301,"cut":false,"hidden":false,"merged":[]}
[null,null,null,null,"SPI CLOCK GENERATION"]
[]
[]
[]
[]
[]
[null,null,null,"SYSCLK7",null,"Prescale",null,"SPI_CLK"]
[null,null,null,{"$f":"(Main_PLL!W31)","v":166.66666666666666},null,0,null,{"$f":"IF(F8=0,SUM(D8/2),SUM(D8/(F8+1)))","v":83.333333333333329}]
[]
[]
[null,null,null,null,"SPIFMTn [15:8]",null,{"$f":"CONCATENATE(\"0x\",DEC2HEX(F8,2))","v":"0x00"},null,null,null,null,{"$f":"3*M15","v":18},null,null,{"$f":"3*M15","v":18},null,null,{"$f":"3*M15","v":18}]
[]
[null,null,null,null,null,null,null,null,null,null,null,{"$f":"LARGE(L10:L11,1)","v":18},null,null,{"$f":"LARGE(O10:O11,1)","v":18},null,null,{"$f":"LARGE(R10:R11,1)","v":18}]
[null,null,null,null,null,null,null,null,null,null,null,{"$f":"(1/L13)*1000","v":55.55555555555555},{"$f":"(1/#REF!)*1000","v":{"$error":"#REF!"}},null,{"$f":"(1/O13)*1000","v":55.55555555555555},{"$f":"(1/#REF!)*1000","v":{"$error":"#REF!"}},null,{"$f":"(1/R13)*1000","v":55.55555555555555},{"$f":"(1/#REF!)*1000","v":{"$error":"#REF!"}}]
[null,null,null,null,null,null,null,null,null,null,null,"p",{"$f":"(1/D8)*1000","v":6}]
[]
[]
[]
[]
[]
[]
[]
[]
[]
[]
[]
[]
[]
[]
[]
[]
[]
[]
[]
[]
[]
[]
[]
[]
[]
{"$rows_left_out":262}
{"sheet":"UART","index":15,"n_rows":403,"n_cols":12,"rows_kept":403,"cut":false,"hidden":false,"merged":[[0,2,2,4]]}
[null,null,"UART CLOCK GENERATION"]
[]
[]
[]
[]
[null,null,null,null,null,null,null,"DLH:DLL"]
[]
[]
[]
[null,null,"SYSCLK7"]
[null,null,{"$f":"(Main_PLL!W31)","v":166.66666666666666},null,null,null,null,null,null,"BCLK"]
[]
[]
[]
[]
[]
[]
[]
[]
[]
[]
[]
[]
[]
[]
[]
[]
[]
[]
[null,null,"x16 Over-sampling Mode ",null,null,null,null,null,"x13 Over-sampling Mode"]
[]
[null,"Baud Rate","Divisor Value","Register ","Actual Baud Rate","Error (%)",null,"Baud Rate","Divisor Value","Register","Actual Baud Rate","Error (%)"]
[null,300,{"$f":"TRUNC(G372)","v":34722},{"$f":"DEC2HEX(C33,5)","v":"087A2"},{"$f":"SUM(F372/H372)","v":300.00192001228805},{"$f":"SUM(I372/bps)","v":-6.4000409601779515E-6},null,300,{"$f":"TRUNC(G389)","v":42735},{"$f":"DEC2HEX(I33,5)","v":"0A6EF"},{"$f":"SUM(F372/H389)","v":300.0003000003},{"$f":"SUM(I389/H33)","v":-1.0000010000036734E-6}]
[null,1200,8680,{"$f":"DEC2HEX(C34,4)","v":"21E8"},1200.0768049155145,{"$f":"SUM(I373/B34)","v":-6.4004096262048428E-5},null,1200,10683,{"$f":"DEC2HEX(I34,4)","v":"29BB"},1200.0854460837611,-7.1205069800915529E-5]
[null,2400,4340,"10F4",2400.1536098310289,-6.4004096262048428E-5,null,2400,5341,"14DD",2400.3955851924397,-1.6482716351655805E-4]
[null,4800,2170,"087A",4800.3072196620578,-6.4004096262048428E-5,null,4800,2670,"0A6E",4801.6901949486219,-3.5212394762955531E-4]
[null,9600,1085,"043D",9600.6144393241157,-6.4004096262048428E-5,null,9600,1335,"0537",9603.3803898972437,-3.5212394762955531E-4]
[null,19200,542,"021E",19218.942189421894,-9.8657236572364583E-4,null,19200,667,"029B",19221.158651443508,-1.1020130960160183E-3]
[null,28800,361,"0169",28855.032317636193,-1.9108443623677986E-3,null,28800,445,"01BD",28810.141169691731,-3.5212394762955531E-4]
[null,38400,271,"010F",38437.884378843788,-9.8657236572364583E-4,null,38400,333,"014D",38500.038500038499,-2.6051692718359241E-3]
{"$rows_left_out":363}