{"text_format":"1","workbook":"xlsx","n_sheets":16,"sheets":["Revision","Instructions","Clocking Diagram","Main_PLL","PASS_PLL","DDR3_PLL","PCIe","SRIO","SGMII","MDIO","HYPERLINK","EMIF16","TIMER","I2C","SPI","UART"],"not_rendered":{"charts":0,"images":1,"macros":1,"external_links":1,"defined_names":7,"comments":0,"pivot_tables":0},"unopened":[],"bounds":{"document_bytes":16777216,"sheet_cells":100000,"rows_first":2000,"rows_last":500,"rows_between":2000,"halvings":0,"cell_chars":16384,"cell_head_chars":4096},"cells_cut":0,"cells_raw":0,"read":"whole","date_system":"1900"}

{"sheet":"Revision","index":0,"n_rows":25,"n_cols":3,"rows_kept":25,"cut":false,"hidden":false,"merged":[]}
[]
["PLL, System and Peripheral Clock Generation Tool "]
[]
["Version","Date","Comments"]
["1.0.0","2015-09-25","Initial Release"]
[]
[]
[]
[]
[]
[]
[]
[]
[]
[]
[]
[]
[]
[]
["Applicable Devices"]
["Key stone multicore C667x DSP"]
[]
["GEL File Details"]
["File Name: EVMC6678L.gel"]
["Revision: 2.0005"]

{"sheet":"Instructions","index":1,"n_rows":83,"n_cols":4,"rows_kept":83,"cut":false,"hidden":false,"merged":[[0,1,1,1]]}
[null,"INSTRUCTIONS"]
[]
["SL. No","Usability"]
[1,"The yellow highlighted fields are user accessible.",null,"INPUTS"]
[2,"The orange highlighted fields are fixed ratios. User do not have access to change this.",null,"FIXED RATIOS"]
[3,"The blue highlighted fields are output. User do not have access to change this.",null,"OUTPUTS"]
[4,"The user need to work on the Main_PLL tab first to get the desired SYSCLKs and then move on to other tabs."]
[]
["SL. No","Main_PLL"]
[1,"Excel macros need to be enabled in order to have the GEL default button operational."]
[2,"The user could load the GEL default values on PLLM, PLLD etc., by clicking \"GEL DEFAULT\" button in Main_PLL section. This will load the default values in Main_PLL, PASS_PLL and DDR3_PLL sections."]
[3,"Device speed can be selected from drop down menu."]
[4,"Standard SYSCLK values are available in the drop down menu. Do not use 100.00001 as this is used for internal calculations. When SYSCLK value is selected, the PLLD, PLLM and CLKOD fields are updated with predefined value."]
[5,"When the user want to use custom clock, they need to select \"CUSTOM\" in SYSCLK field and value can be entered in CUSTOMCLK field. In this case, the PLLD, PLLM and CLKOD values could be entered manually in user input fields."]
[6,"In order to minimize the output jitter, choose a configuration that maximizes VCO frequency. Then divide that frequency through the output divide (CLKOD) to their desired output frequency."]
[7,"The PLLEN and PLLENSRC fields must be selected accordingly to enable the PLL output."]
[8,"The user field values are decimal equivalent of register values. Hence the value would added by 1 for calculation."]
[9,"When \"OUT OF RANGE\" message is shown in PLLM output/SYSCLKs, the user inputs need to be changed to set these value under the limits."]
[10,"Putting the PLL in bypass mode changes the SYSCLK outputs to INVALID."]
[]
["SL. No","PASS_PLL"]
[1,"The PACLKSEL is available to choose the input either from CORECLK or PASSCLK."]
[2,"When CORECLK is selected as input and standard input clock is selected, the PLL fields are updated with predefined values."]
[3,"When CORECLK is selected as input and set into custom value, the user need to enter PLL fields manually."]
[4,"When PASSCLK is selected as input, the user need to enter PLLD, PLLM and CLKOD fields manually."]
[5,"There is another mux available where user can select either PASS PLL output or SYSCLK1 (Test Mode) to the PASS by changing PLLSELECT field."]
[6,"The user field values are decimal equivalent of register values. Hence the value would added by 1 for calculation."]
[7,"When \"OUT OF RANGE\" message is shown in PLLM output/PLL output, the user inputs need to be changed to set these value under the limits."]
[8,"Putting the PLL in bypass mode changes the output clock to INVALID."]
[]
["SL. No","DDR3_PLL"]
[1,"The user want to enter the DDR3CLK and all PLL fields manually."]
[2,"The user field values are decimal equivalent of register values. Hence the value would added by 1 for calculation."]
[3,"When \"OUT OF RANGE\" message is shown in PLLM output/PLL output/DDR3 data rate, the user inputs need to be changed to set these value under the limits."]
[4,"Putting the PLL in bypass mode changes the DDR3 data rate to INVALID."]
[]
["SL. No","PCIe"]
[1,"The user has to select the PCIe0CLK and PCIe mode from drop down menu."]
[2,"The PLL fields would be loaded internally and outputs line rate."]
[]
["SL. No","SRIO"]
[1,"The user has to select the SRIOSGMIICLK and line rate from drop down menu."]
[2,"The PLL fields would be loaded internally and outputs line rate."]
[]
["SL. No","SGMII"]
[1,"The user has to select the SRIOSGMIICLK from drop down menu."]
[2,"The PLL fields would be loaded internally and outputs line rate."]
[]
["SL. No","MDIO"]
[1,"The SGMII PLL OUTPUT is considered as an input clock to the MDIO module."]
[2,"The user could enter the CLKDIV field manually."]
[3,"The CLKDIV value is decimal equivalent of register values. Hence the value would added by 1 for calculation."]
[4,"When \"OUT OF RANGE\" message is shown in MDIO clock, the CLKDIV need to be changed."]
[]
["SL. No","HYPERLINK"]
[1,"The user need to select the MCMCLK and PLL MPY fields from drop down menu."]
[2,"The PLL MPY value is decimal value and corresponding register value is predefined. "]
[3,"When \"OUT OF RANGE\" message is shown in Hyperlink PLL output, the CLKDIV can be changed."]
[]
["SL. No","EMIF16"]
[1,"EMIF clock is derived from SYSCLK7. i.e. SYSCLK1/6."]
[2,"The clock period is calculated and shown."]
[]
["SL. No","TIMER"]
[1,"The timer source clock can be selected among SYSCLK1 and external clock through TIEN_LO."]
[2,"The user need to enter the external clock manually."]
[3,"The INVINP_LO could be used for clock inversion."]
[4,"The CLKSRC_LO controls the second mux."]
[]
["SL. No","I2C"]
[1,"The input clock source to the I2C controller is SYSCLK7."]
[2,"The user need to select IPSC field from the drop down menu."]
[3,"The ICCL and ICCH needs to be entered manually."]
[4,"The user fields are decimal equivalent of register value. Hence the value would added by 1 for calculation."]
[]
["SL. No","SPI"]
[1,"The input clock source to the SPI controller is SYSCLK7."]
[2,"The user need to select Prescal field from the drop down menu."]
[3,"The prescale is decimal equivalent of register value. Hence the value would added by 1 for calculation."]
[]
["SL. No","UART"]
[1,"The input clock source to the UART controller is SYSCLK7."]
[2,"The register values are available for both x16 and x13 over sampling mode."]

{"sheet":"Clocking Diagram","index":2,"n_rows":0,"n_cols":0,"rows_kept":0,"cut":false,"hidden":false,"merged":[]}

{"sheet":"Main_PLL","index":3,"n_rows":4527,"n_cols":24,"rows_kept":4527,"cut":false,"hidden":false,"merged":[[1,5,2,12],[11,15,12,15],[27,5,29,10],[4,8,5,9],[7,3,7,4],[12,1,14,2],[23,0,24,0],[23,1,24,1],[23,2,24,2]]}
[]
[null,null,null,null,null,"C667x SYSTEM PLL CALCULATOR"]
[]
[]
[null,null,null,null,null,null,null,null,"SYSTEM PLL",null,null,null,null,null,"Main PLL output clock (PLLOUT) = (CLKIN × (PLLM+1)) ÷ ((CLKOD+1) × (PLLD+1))"]
[null,"Device Speed"]
[null,1000,null,null,null,null,null,null,null,{"$f":"IF(J8<415,\"OUT OF RANGE\",IF(J8>3400,\"OUT OF RANGE\",\"\"))","v":""}]
[null,"CORECLK (P/N)",null,{"$f":"(J434)","v":100},null,null,"PLLD",{"$f":"IF(J432,SUM(D8/G432),SUM(D8/G433))","v":100},null,{"$f":"IF(J432,SUM(H8*H432),SUM(H8*H433))","v":2000},"CLKOD",{"$f":"SUM(J8/(K9+1))","v":1000}]
[null,100,null,null,null,null,{"$f":"IF(J432,L448,\"CUSTOM\")","v":0},null,null,null,1,null,null,null,null,null,null,null,null,null,null,"          1/6",{"$f":"IF(J16=1,\"\",IF(W10<125,\"OUT OF RANGE\",IF(W10>(B7/6*1.01),\"OUT OF RANGE\",\"\")))","v":""}]
[null,"CUSTOM CLK",null,null,null,null,0,null,"PLLM",null,null,null,null,{"$f":"IF(J16,G12,L8)","v":1000},null,null,null,null,null,null,null,null,{"$f":"SUM(P12/6)","v":166.66666666666666},"SYSCLKOUT"]
[null,50,null,null,null,null,null,null,{"$f":"IF(J432,L449,\"CUSTOM\")","v":19}]
[null,null,null,null,null,null,{"$f":"IF(J432,B9,B11)","v":100},null,13,null,null,null,null,null,null,{"$f":"IF(O26,N10,D8)","v":1000},null,null,null,null,null,null,{"$f":"IF(J16=1,\"\",IF(W13<750,\"OUT OF RANGE\",IF(W13>(B7*1.01),\"OUT OF RANGE\",\"\")))","v":""}]
[null,"Note: Do not use 100.00001 in CORECLK drop down list",null,null,null,null,null,null,null,null,null,null,null,null,null,null,null,null,null,"PLLLDIV1",1,null,{"$f":"IF(J16,\"INVALID\",SUM(P12/U13))","v":1000},"SYSCLK1"]
[]
[null,null,null,null,null,null,null,null,null,"BYPASS",null,null,null,null,null,null,null,null,null,null,null,null,{"$f":"IF(J16=1,\"\",IF(W16>350,\"OUT OF RANGE\",\"\"))","v":""}]
[null,null,null,null,null,null,null,null,null,0,null,null,null,null,null,null,null,null,null,"PLLLDIV2",3,null,{"$f":"IF(J16,\"INVALID\",SUM(P12/(U16+1)))","v":250},"SYSCLK2"]
[null,"FIXED RATIOS"]
[null,"INPUTS"]
[null,"OUTPUTS",null,null,null,null,null,null,null,null,null,null,null,null,null,null,null,null,null,"PLLLDIV3",2,null,{"$f":"IF(J16,\"INVALID\",SUM(P12/(U19)))","v":500},"SYSCLK3"]
[]
["Registers:"]
["Name","Bit Position","Value",null,null,null,null,null,null,null,null,null,null,null,null,null,null,null,null,"PLLLDIV4",3,null,{"$f":"IF(J16,\"INVALID\",SUM(P12/(U22)))","v":333.33333333333331},"SYSCLK4"]
["MAINPLLCTL0.PLLD","5 : 0",{"$f":"IF(J432,CONCATENATE(\"0x\",DEC2HEX(G9,2)),CONCATENATE(\"0x\",DEC2HEX(G10,2)))","v":"0x00"}]
["MAINPLLCTL0.PLLM[12:6] & PLLM[5:0]","18 : 12 & 5 : 0",{"$f":"IF(J432,CONCATENATE(\"0x\",DEC2HEX(I11,4)),CONCATENATE(\"0x\",DEC2HEX(I12,4)))","v":"0x0013"},null,null,null,null,null,null,null,null,null,null,null,null,null,null,null,null,null,null,null,{"$f":"IF(J16=1,\"\",IF(W25>210,\"OUT OF RANGE\",IF(W25<32,\"OUT OF RANGE\",\"\")))","v":""}]
[null,null,null,null,null,"Note:",null,null,null,null,null,null,0,null,null,null,null,null,null,"PLLLDIV5",5,null,{"$f":"IF(J16,\"INVALID\",SUM(P12/(U25+1)))","v":166.66666666666666},"SYSCLK5"]
["SECCTL.OUTPUT DIVIDE","22 :19",{"$f":"IF(J432,CONCATENATE(\"0x\",DEC2HEX(K9,1)),CONCATENATE(\"0x\",DEC2HEX(K10,1)))","v":"0x1"},null,null,"1. Please refer instructions for clarification on actual PLLD/PLLM and its register value.",null,null,null,null,null,null,null,null,{"$f":"IF(M33,M25,M29)","v":1}]
["SECCTL.BYPASS",23,{"$f":"CONCATENATE(\"0x\",DEC2HEX(J16,1))","v":"0x0"},null,null,"2. Initial silicon V1.0 may support only 800 MHz, 1000 MHz, and 1200 MHz frequencies by default."]
["PLLCTL.PLLEN",0,{"$f":"CONCATENATE(\"0x\",DEC2HEX(M29,1))","v":"0x1"},null,null,"3. In case any of the other programmable SYSCLKs are set slower than 1/64 rate, then SYSCLK8 (SLOW_SYSCLK) must be programmed to either match, or be slower than, the slowest SYSCLK in the system.",null,null,null,null,null,null,"PLLEN",null,null,null,null,null,null,"PLLLDIV6",64,null,{"$f":"IF(J16,\"INVALID\",SUM(P12/(U28)))","v":15.625},"SYSCLK6"]
["PLLCTL.PLLENSRC",5,{"$f":"CONCATENATE(\"0x\",DEC2HEX(M33,1))","v":"0x0"},null,null,null,null,null,null,null,null,null,1]
["PLLDIV2.RATIO","7 : 0",{"$f":"CONCATENATE(\"0x\",DEC2HEX(U16,2))","v":"0x03"}]
["PLLDIV5.RATIO","7 : 0",{"$f":"CONCATENATE(\"0x\",DEC2HEX(U25,2))","v":"0x05"},null,null,null,null,null,null,null,null,null,null,null,null," ",null,null,null,"PLLLDIV7",6,null,{"$f":"IF(J16,\"INVALID\",SUM(P12/(U31)))","v":166.66666666666666},"SYSCLK7"]
["PLLDIV8.RATIO","7 : 0",{"$f":"CONCATENATE(\"0x\",DEC2HEX(U34,2))","v":"0x40"},null,null,null,null,null,null,null,null,null,"PLLENSRC"]
[null,null,null,null,null,null,null,null,null,null,null,null,0]
[null,null,null,null,null,null,null,null,null,null,null,null,null,null,null,null,null,null,null,"PLLLDIV8",64,null,{"$f":"IF(J16,\"INVALID\",SUM(P12/(U34+1)))","v":15.384615384615385},"SYSCLK8"]
[]
[]
[null,null,null,null,null,null,null,null,null,null,null,null,null,null,null,null,null,null,null,"PLLLDIV9",12,null,{"$f":"IF(J16,\"INVALID\",SUM(P12/(U37)))","v":83.333333333333329},"SYSCLK9"]
[]
[]
[null,null,null,null,null,null,null,null,null,null,null,null,null,null,null,null,null,null,null,"PLLLDIV10",3,null,{"$f":"IF(J16,\"INVALID\",SUM(P12/(U40)))","v":333.33333333333331},"SYSCLK10"]
[]
[]
[null,null,null,null,null,null,null,null,null,null,null,null,null,null,null,null,null,null,null,"PLLLDIV11",6,null,{"$f":"IF(J16,\"INVALID\",SUM(P12/(U43)))","v":166.66666666666666},"SYSCLK11"]
[]
[]
[null,null,null,null,null,null,null,"                                          "]
[]
[]
[]
[]
[]
[]
[]
[]
[]
[]
[]
[]
[]
[]
[]
[]
[]
[]
[]
[]
[]
[null,null,null,null,null,null,null,null,null,"                                                                      "]
[]
[]
[]
[]
[]
[]
[]
[]
[]
[]
[]
[]
[]
[]
[]
[]
[]
[]
[]
[]
[]
[]
[]
[]
[]
[]
[]
[]
[]
[]
[]
[]
[]
[]
[]
[]
[]
[]
[]
[]
[]
[]
[]
[]
[]
[]
[]
[]
[]
[]
[]
[]
[]
[]
[]
[]
[]
[]
[]
[]
[]
[]
[]
[]
[]
[]
[]
[]
[]
[]
[]
[]
[]
[]
[]
[]
[]
[]
[]
[]
[]
[]
[]
[]
[]
[]
[]
[]
[]
[]
[]
[]
[]
[]
[]
[]
[]
[]
[]
[]
[]
[]
[]
[]
[]
[]
[]
[]
[]
[]
[]
[]
[]
[]
[]
[]
[]
[]
[]
[]
[]
[]
[]
[]
[]
[]
[]
[]
[]
[]
[]
[]
[]
[]
[]
[]
[]
[]
[]
[]
[]
[]
[]
[]
[]
[]
[]
[]
[]
[]
[]
[]
[]
[]
[]
[]
[]
[]
[]
[]
[]
[]
[]
[]
[]
[]
[]
[]
[]
[]
[]
[]
[]
[]
[]
[]
[]
[]
[]
[]
[]
[]
[]
[]
[]
[]
[]
[]
[]
[]
[]
[]
[]
[]
[]
[]
[]
[]
[]
[]
[]
[]
[]
[]
[]
[]
[]
[]
[]
[]
[]
[]
[]
[]
[]
[]
[]
[]
[]
[]
[]
[]
[]
[]
[]
[]
[]
[]
[]
[]
[]
[]
[]
[]
[]
[]
[]
[]
[]
[]
[]
[]
[]
[]
[]
[]
[]
[]
[]
[]
[]
[]
[]
[]
[]
[]
[]
[]
[]
[]
[]
[]
[]
[]
[]
[]
[]
[]
[]
[]
[]
[]
[]
[]
[]
[]
[]
[]
[]
[]
[]
[]
[]
[]
[]
[]
[]
[]
[]
[]
[]
[]
[]
[]
[]
[]
[]
[]
[]
[]
[]
[]
[]
[]
[]
[]
[]
[]
[]
[]
[]
[]
[]
[]
[]
[]
[]
[]
[]
[]
[]
[]
[]
[]
[]
[]
[]
[]
[]
[]
[]
[]
[]
[]
[]
[]
[]
[]
[]
[]
[]
[]
[]
[]
[]
[]
[]
[]
[]
[]
[]
[]
[]
[]
[]
[]
[]
[]
[]
[]
[]
[]
["PLLDIVx","PREDIV",null,"CLKOD","PLLM","PLLEN","PREDIVPLUS1","PLLMPLUS1","OUTPUTDIV",null,null,"Device Speed",null,null,null,null,null,null,null,"Device Speed"]
[0,0,null,0,0,0,{"$f":"G9+1","v":1},{"$f":"I11+1","v":20},{"$f":"SUM(K9+1)","v":2},{"$f":"IF(B9<>\"CUSTOM\",1,0)","v":1},null,800,1000,1200,1250,null,null,null,null,800,1000,1200,1250]
[1,1,null,1,1,1,{"$f":"G10+1","v":1},{"$f":"I12+1","v":14},null,{"$f":"IF(J432,1,(IF(J16,1,(IF(R10=B7,1,0)))))","v":1},"Input Clock freq","PLLD","PLLD","PLLD","PLLD",null,null,null,"Input Clock freq","PLLM","PLLM","PLLM","PLLM"]
[2,2,null,3,2,null,null,null,null,{"$f":"IF(J432,B9,B11)","v":100},50,0,0,0,0,null,null,null,50,31,39,47,49]
[3,3,null,5,3,null,"PLLDIV1",{"$f":"SUM(U13+1)","v":2},null,null,66.67,0,0,0,1,null,null,null,66.67,23,29,35,74]
[4,4,null,7,4,null,"PLLDIV2",{"$f":"SUM(U16+1)","v":4},null,null,80,0,0,0,3,null,null,null,80,19,24,29,124]
[5,5,null,9,5,null,"PLLDIV3",{"$f":"SUM(U19+1)","v":3},null,{"$f":"IF(J16=1,0,IF(W13<750,1,IF(W13>B7*1.01,1,0)))","v":0},100,0,0,0,0,null,null,null,100,15,19,23,24]
[6,6,null,11,6,null,"PLLDIV4",{"$f":"SUM(U22+1)","v":4},null,{"$f":"IF(J16=1,0,IF(W16>350,1,0))","v":0},100.00001,null,1,null,null,null,null,null,100.00001,null,39]
[7,7,null,13,7,null,"PLLDIV5",{"$f":"SUM(U31+1)","v":7},null,{"$f":"IF(J16=1,0,IF(W25<32,1,IF(W25>210,1,0)))","v":0},156.25,24,4,24,0,null,null,null,156.25,255,63,383,15]
[8,8,null,15,8,null,"PLLDIV6",{"$f":"SUM(U32+1)","v":1},null,null,250,4,0,4,0,null,null,null,250,31,7,47,9]
[9,9,null,null,9,null,"PLLDIV7",{"$f":"SUM(U45+1)","v":1},null,null,312.5,24,4,24,0,null,null,null,312.5,127,31,191,7]
[10,10,null,null,10,null,"PLLDIV8",{"$f":"SUM(U46+1)","v":1},null,null,122.88,47,28,31,2,null,null,null,122.88,624,471,624,60]
[11,11,null,null,11,null,"PLLDIV9",{"$f":"SUM(U48+1)","v":1},null,null,"CUSTOM"]
[12,12,null,null,12,null,"PLLDIV10",{"$f":"SUM(U50+1)","v":1}]
[13,13,null,null,13,null,"PLLDIV11",{"$f":"SUM(U52+1)","v":1}]
[14,14,null,null,14,null,"PLLDIV12",{"$f":"SUM(T54+1)","v":1},null,null,"Input Freq",{"$f":"B9","v":100}]
[15,15,null,null,15,null,"PLLDIV13",{"$f":"SUM(T56+1)","v":1},null,null,"Device Speed",{"$f":"B7","v":1000}]
[16,16,null,null,16,null,"PLLDIV14",{"$f":"SUM(T58+1)","v":1},null,null,"PLLD",{"$f":"VLOOKUP(B9,K434:O442,MATCH(B7,L432:O432)+1,FALSE)","v":0}]
[17,17,null,null,17,null,"PLLDIV15",{"$f":"SUM(T60+1)","v":1},null,null,"PLLM",{"$f":"VLOOKUP(B9,S434:W442,MATCH(B7,T432:W432)+1,FALSE)","v":19}]
[18,18,null,null,18,null,"PLLDIV16",{"$f":"SUM(T62+1)","v":1}]
[19,19,null,null,19]
[20,20,null,null,20]
[21,21,null,null,21]
[22,22,null,null,22]
[23,23,null,null,23]
[24,24,null,null,24]
[25,25,null,null,25]
[26,26,null,null,26]
[27,27,null,null,27]
[28,28,null,null,28]
[29,29,null,null,29]
[30,30,null,null,30]
[31,31,null,null,31]
[32,32,null,null,32]
[33,33,null,null,33]
[34,34,null,null,34]
[35,35,null,null,35]
[36,36,null,null,36]
[37,37,null,null,37]
[38,38,null,null,38]
[39,39,null,null,39]
[40,40,null,null,40]
[41,41,null,null,41]
[42,42,null,null,42]
[43,43,null,null,43]
[44,44,null,null,44]
[45,45,null,null,45]
[46,46,null,null,46]
[47,47,null,null,47]
[48,48,null,null,48]
[49,49,null,null,49]
[50,50,null,null,50]
[51,51,null,null,51]
[52,52,null,null,52]
[53,53,null,null,53]
[54,54,null,null,54]
[55,55,null,null,55]
[56,56,null,null,56]
[57,57,null,null,57]
[58,58,null,null,58]
[59,59,null,null,59]
[60,60,null,null,60]
[61,61,null,null,61]
[62,62,null,null,62]
[63,63,null,null,63]
[64,64,null,null,64]
[65,65,null,null,65]
[66,66,null,null,66]
[67,67,null,null,67]
[68,68,null,null,68]
[69,69,null,null,69]
[70,70,null,null,70]
[71,71,null,null,71]
[72,72,null,null,72]
[73,73,null,null,73]
[74,74,null,null,74]
[75,75,null,null,75]
[76,76,null,null,76]
[77,77,null,null,77]
[78,78,null,null,78]
[79,79,null,null,79]
[80,80,null,null,80]
[81,null,null,null,81]
[82,null,null,null,82]
[83,null,null,null,83]
[84,null,null,null,84]
[85,null,null,null,85]
[86,null,null,null,86]
[87,null,null,null,87]
[88,null,null,null,88]
[89,null,null,null,89]
[90,null,null,null,90]
[91,null,null,null,91]
[92,null,null,null,92]
[93,null,null,null,93]
[94,null,null,null,94]
[95,null,null,null,95]
[96,null,null,null,96]
[97,null,null,null,97]
[98,null,null,null,98]
[99,null,null,null,99]
[100,null,null,null,100]
[101,null,null,null,101]
[102,null,null,null,102]
[103,null,null,null,103]
[104,null,null,null,104]
[105,null,null,null,105]
[106,null,null,null,106]
[107,null,null,null,107]
[108,null,null,null,108]
[109,null,null,null,109]
[110,null,null,null,110]
[111,null,null,null,111]
[112,null,null,null,112]
[113,null,null,null,113]
[114,null,null,null,114]
[115,null,null,null,115]
[116,null,null,null,116]
[117,null,null,null,117]
[118,null,null,null,118]
[119,null,null,null,119]
[120,null,null,null,120]
[121,null,null,null,121]
[122,null,null,null,122]
[123,null,null,null,123]
[124,null,null,null,124]
[125,null,null,null,125]
[126,null,null,null,126]
[127,null,null,null,127]
[128,null,null,null,128]
[129,null,null,null,129]
[130,null,null,null,130]
[131,null,null,null,131]
[132,null,null,null,132]
[133,null,null,null,133]
[134,null,null,null,134]
[135,null,null,null,135]
[136,null,null,null,136]
[137,null,null,null,137]
[138,null,null,null,138]
[139,null,null,null,139]
[140,null,null,null,140]
[141,null,null,null,141]
[142,null,null,null,142]
[143,null,null,null,143]
[144,null,null,null,144]
[145,null,null,null,145]
[146,null,null,null,146]
[147,null,null,null,147]
[148,null,null,null,148]
[149,null,null,null,149]
[150,null,null,null,150]
[151,null,null,null,151]
[152,null,null,null,152]
[153,null,null,null,153]
[154,null,null,null,154]
[155,null,null,null,155]
[156,null,null,null,156]
[157,null,null,null,157]
[158,null,null,null,158]
[159,null,null,null,159]
[160,null,null,null,160]
[161,null,null,null,161]
[162,null,null,null,162]
[163,null,null,null,163]
[164,null,null,null,164]
[165,null,null,null,165]
[166,null,null,null,166]
[167,null,null,null,167]
[168,null,null,null,168]
[169,null,null,null,169]
[170,null,null,null,170]
[171,null,null,null,171]
[172,null,null,null,172]
[173,null,null,null,173]
[174,null,null,null,174]
[175,null,null,null,175]
[176,null,null,null,176]
[177,null,null,null,177]
[178,null,null,null,178]
[179,null,null,null,179]
[180,null,null,null,180]
[181,null,null,null,181]
[182,null,null,null,182]
[183,null,null,null,183]
[184,null,null,null,184]
[185,null,null,null,185]
[186,null,null,null,186]
[187,null,null,null,187]
[188,null,null,null,188]
[189,null,null,null,189]
[190,null,null,null,190]
[191,null,null,null,191]
[192,null,null,null,192]
[193,null,null,null,193]
[194,null,null,null,194]
[195,null,null,null,195]
[196,null,null,null,196]
[197,null,null,null,197]
[198,null,null,null,198]
[199,null,null,null,199]
[200,null,null,null,200]
[201,null,null,null,201]
[202,null,null,null,202]
[203,null,null,null,203]
[204,null,null,null,204]
[205,null,null,null,205]
[206,null,null,null,206]
[207,null,null,null,207]
[208,null,null,null,208]
[209,null,null,null,209]
[210,null,null,null,210]
[211,null,null,null,211]
[212,null,null,null,212]
[213,null,null,null,213]
[214,null,null,null,214]
[215,null,null,null,215]
[216,null,null,null,216]
[217,null,null,null,217]
[218,null,null,null,218]
[219,null,null,null,219]
[220,null,null,null,220]
[221,null,null,null,221]
[222,null,null,null,222]
[223,null,null,null,223]
[224,null,null,null,224]
[225,null,null,null,225]
[226,null,null,null,226]
[227,null,null,null,227]
[228,null,null,null,228]
[229,null,null,null,229]
[230,null,null,null,230]
[231,null,null,null,231]
[232,null,null,null,232]
[233,null,null,null,233]
[234,null,null,null,234]
[235,null,null,null,235]
[236,null,null,null,236]
[237,null,null,null,237]
[238,null,null,null,238]
[239,null,null,null,239]
[240,null,null,null,240]
[241,null,null,null,241]
[242,null,null,null,242]
[243,null,null,null,243]
[244,null,null,null,244]
[245,null,null,null,245]
[246,null,null,null,246]
[247,null,null,null,247]
[248,null,null,null,248]
[249,null,null,null,249]
[250,null,null,null,250]
[251,null,null,null,251]
[252,null,null,null,252]
[253,null,null,null,253]
[254,null,null,null,254]
[255,null,null,null,255]
[256,null,null,null,256]
[null,null,null,null,257]
[null,null,null,null,258]
[null,null,null,null,259]
[null,null,null,null,260]
[null,null,null,null,261]
[null,null,null,null,262]
[null,null,null,null,263]
[null,null,null,null,264]
[null,null,null,null,265]
[null,null,null,null,266]
[null,null,null,null,267]
[null,null,null,null,268]
[null,null,null,null,269]
[null,null,null,null,270]
[null,null,null,null,271]
[null,null,null,null,272]
[null,null,null,null,273]
[null,null,null,null,274]
[null,null,null,null,275]
[null,null,null,null,276]
[null,null,null,null,277]
[null,null,null,null,278]
[null,null,null,null,279]
[null,null,null,null,280]
[null,null,null,null,281]
[null,null,null,null,282]
[null,null,null,null,283]
[null,null,null,null,284]
[null,null,null,null,285]
[null,null,null,null,286]
[null,null,null,null,287]
[null,null,null,null,288]
[null,null,null,null,289]
[null,null,null,null,290]
[null,null,null,null,291]
[null,null,null,null,292]
[null,null,null,null,293]
[null,null,null,null,294]
[null,null,null,null,295]
[null,null,null,null,296]
[null,null,null,null,297]
[null,null,null,null,298]
[null,null,null,null,299]
[null,null,null,null,300]
[null,null,null,null,301]
[null,null,null,null,302]
[null,null,null,null,303]
[null,null,null,null,304]
[null,null,null,null,305]
[null,null,null,null,306]
[null,null,null,null,307]
[null,null,null,null,308]
[null,null,null,null,309]
[null,null,null,null,310]
[null,null,null,null,311]
[null,null,null,null,312]
[null,null,null,null,313]
[null,null,null,null,314]
[null,null,null,null,315]
[null,null,null,null,316]
[null,null,null,null,317]
[null,null,null,null,318]
[null,null,null,null,319]
[null,null,null,null,320]
[null,null,null,null,321]
[null,null,null,null,322]
[null,null,null,null,323]
[null,null,null,null,324]
[null,null,null,null,325]
[null,null,null,null,326]
[null,null,null,null,327]
[null,null,null,null,328]
[null,null,null,null,329]
[null,null,null,null,330]
[null,null,null,null,331]
[null,null,null,null,332]
[null,null,null,null,333]
[null,null,null,null,334]
[null,null,null,null,335]
[null,null,null,null,336]
[null,null,null,null,337]
[null,null,null,null,338]
[null,null,null,null,339]
[null,null,null,null,340]
[null,null,null,null,341]
[null,null,null,null,342]
[null,null,null,null,343]
[null,null,null,null,344]
[null,null,null,null,345]
[null,null,null,null,346]
[null,null,null,null,347]
[null,null,null,null,348]
[null,null,null,null,349]
[null,null,null,null,350]
[null,null,null,null,351]
[null,null,null,null,352]
[null,null,null,null,353]
[null,null,null,null,354]
[null,null,null,null,355]
[null,null,null,null,356]
[null,null,null,null,357]
[null,null,null,null,358]
[null,null,null,null,359]
[null,null,null,null,360]
[null,null,null,null,361]
[null,null,null,null,362]
[null,null,null,null,363]
[null,null,null,null,364]
[null,null,null,null,365]
[null,null,null,null,366]
[null,null,null,null,367]
[null,null,null,null,368]
[null,null,null,null,369]
[null,null,null,null,370]
[null,null,null,null,371]
[null,null,null,null,372]
[null,null,null,null,373]
[null,null,null,null,374]
[null,null,null,null,375]
[null,null,null,null,376]
[null,null,null,null,377]
[null,null,null,null,378]
[null,null,null,null,379]
[null,null,null,null,380]
[null,null,null,null,381]
[null,null,null,null,382]
[null,null,null,null,383]
[null,null,null,null,384]
[null,null,null,null,385]
[null,null,null,null,386]
[null,null,null,null,387]
[null,null,null,null,388]
[null,null,null,null,389]
[null,null,null,null,390]
[null,null,null,null,391]
[null,null,null,null,392]
[null,null,null,null,393]
[null,null,null,null,394]
[null,null,null,null,395]
[null,null,null,null,396]
[null,null,null,null,397]
[null,null,null,null,398]
[null,null,null,null,399]
[null,null,null,null,400]
[null,null,null,null,401]
[null,null,null,null,402]
[null,null,null,null,403]
[null,null,null,null,404]
[null,null,null,null,405]
[null,null,null,null,406]
[null,null,null,null,407]
[null,null,null,null,408]
[null,null,null,null,409]
[null,null,null,null,410]
[null,null,null,null,411]
[null,null,null,null,412]
[null,null,null,null,413]
[null,null,null,null,414]
[null,null,null,null,415]
[null,null,null,null,416]
[null,null,null,null,417]
[null,null,null,null,418]
[null,null,null,null,419]
[null,null,null,null,420]
[null,null,null,null,421]
[null,null,null,null,422]
[null,null,null,null,423]
[null,null,null,null,424]
[null,null,null,null,425]
[null,null,null,null,426]
[null,null,null,null,427]
[null,null,null,null,428]
[null,null,null,null,429]
[null,null,null,null,430]
[null,null,null,null,431]
[null,null,null,null,432]
[null,null,null,null,433]
[null,null,null,null,434]
[null,null,null,null,435]
[null,null,null,null,436]
[null,null,null,null,437]
[null,null,null,null,438]
[null,null,null,null,439]
[null,null,null,null,440]
[null,null,null,null,441]
[null,null,null,null,442]
[null,null,null,null,443]
[null,null,null,null,444]
[null,null,null,null,445]
[null,null,null,null,446]
[null,null,null,null,447]
[null,null,null,null,448]
[null,null,null,null,449]
[null,null,null,null,450]
[null,null,null,null,451]
[null,null,null,null,452]
[null,null,null,null,453]
[null,null,null,null,454]
[null,null,null,null,455]
[null,null,null,null,456]
[null,null,null,null,457]
[null,null,null,null,458]
[null,null,null,null,459]
[null,null,null,null,460]
[null,null,null,null,461]
[null,null,null,null,462]
[null,null,null,null,463]
[null,null,null,null,464]
[null,null,null,null,465]
[null,null,null,null,466]
[null,null,null,null,467]
[null,null,null,null,468]
[null,null,null,null,469]
[null,null,null,null,470]
[null,null,null,null,471]
[null,null,null,null,472]
[null,null,null,null,473]
[null,null,null,null,474]
[null,null,null,null,475]
[null,null,null,null,476]
[null,null,null,null,477]
[null,null,null,null,478]
[null,null,null,null,479]
[null,null,null,null,480]
[null,null,null,null,481]
[null,null,null,null,482]
[null,null,null,null,483]
[null,null,null,null,484]
[null,null,null,null,485]
[null,null,null,null,486]
[null,null,null,null,487]
[null,null,null,null,488]
[null,null,null,null,489]
[null,null,null,null,490]
[null,null,null,null,491]
[null,null,null,null,492]
[null,null,null,null,493]
[null,null,null,null,494]
[null,null,null,null,495]
[null,null,null,null,496]
[null,null,null,null,497]
[null,null,null,null,498]
[null,null,null,null,499]
[null,null,null,null,500]
[null,null,null,null,501]
[null,null,null,null,502]
[null,null,null,null,503]
[null,null,null,null,504]
[null,null,null,null,505]
[null,null,null,null,506]
[null,null,null,null,507]
[null,null,null,null,508]
[null,null,null,null,509]
[null,null,null,null,510]
[null,null,null,null,511]
[null,null,null,null,512]
[null,null,null,null,513]
[null,null,null,null,514]
[null,null,null,null,515]
[null,null,null,null,516]
[null,null,null,null,517]
[null,null,null,null,518]
[null,null,null,null,519]
[null,null,null,null,520]
[null,null,null,null,521]
[null,null,null,null,522]
[null,null,null,null,523]
[null,null,null,null,524]
[null,null,null,null,525]
[null,null,null,null,526]
[null,null,null,null,527]
[null,null,null,null,528]
[null,null,null,null,529]
[null,null,null,null,530]
[null,null,null,null,531]
[null,null,null,null,532]
[null,null,null,null,533]
[null,null,null,null,534]
[null,null,null,null,535]
[null,null,null,null,536]
[null,null,null,null,537]
[null,null,null,null,538]
[null,null,null,null,539]
[null,null,null,null,540]
[null,null,null,null,541]
[null,null,null,null,542]
[null,null,null,null,543]
[null,null,null,null,544]
[null,null,null,null,545]
[null,null,null,null,546]
[null,null,null,null,547]
[null,null,null,null,548]
[null,null,null,null,549]
[null,null,null,null,550]
[null,null,null,null,551]
[null,null,null,null,552]
[null,null,null,null,553]
[null,null,null,null,554]
[null,null,null,null,555]
[null,null,null,null,556]
[null,null,null,null,557]
[null,null,null,null,558]
[null,null,null,null,559]
[null,null,null,null,560]
[null,null,null,null,561]
[null,null,null,null,562]
[null,null,null,null,563]
[null,null,null,null,564]
[null,null,null,null,565]
[null,null,null,null,566]
[null,null,null,null,567]
[null,null,null,null,568]
[null,null,null,null,569]
[null,null,null,null,570]
[null,null,null,null,571]
[null,null,null,null,572]
[null,null,null,null,573]
[null,null,null,null,574]
[null,null,null,null,575]
[null,null,null,null,576]
[null,null,null,null,577]
[null,null,null,null,578]
[null,null,null,null,579]
[null,null,null,null,580]
[null,null,null,null,581]
[null,null,null,null,582]
[null,null,null,null,583]
[null,null,null,null,584]
[null,null,null,null,585]
[null,null,null,null,586]
[null,null,null,null,587]
[null,null,null,null,588]
[null,null,null,null,589]
[null,null,null,null,590]
[null,null,null,null,591]
[null,null,null,null,592]
[null,null,null,null,593]
[null,null,null,null,594]
[null,null,null,null,595]
[null,null,null,null,596]
[null,null,null,null,597]
[null,null,null,null,598]
[null,null,null,null,599]
[null,null,null,null,600]
[null,null,null,null,601]
[null,null,null,null,602]
[null,null,null,null,603]
[null,null,null,null,604]
[null,null,null,null,605]
[null,null,null,null,606]
[null,null,null,null,607]
[null,null,null,null,608]
[null,null,null,null,609]
[null,null,null,null,610]
[null,null,null,null,611]
[null,null,null,null,612]
[null,null,null,null,613]
[null,null,null,null,614]
[null,null,null,null,615]
[null,null,null,null,616]
[null,null,null,null,617]
[null,null,null,null,618]
[null,null,null,null,619]
[null,null,null,null,620]
[null,null,null,null,621]
[null,null,null,null,622]
[null,null,null,null,623]
[null,null,null,null,624]
[null,null,null,null,625]
[null,null,null,null,626]
[null,null,null,null,627]
[null,null,null,null,628]
[null,null,null,null,629]
[null,null,null,null,630]
[null,null,null,null,631]
[null,null,null,null,632]
[null,null,null,null,633]
[null,null,null,null,634]
[null,null,null,null,635]
[null,null,null,null,636]
[null,null,null,null,637]
[null,null,null,null,638]
[null,null,null,null,639]
[null,null,null,null,640]
[null,null,null,null,641]
[null,null,null,null,642]
[null,null,null,null,643]
[null,null,null,null,644]
[null,null,null,null,645]
[null,null,null,null,646]
[null,null,null,null,647]
[null,null,null,null,648]
[null,null,null,null,649]
[null,null,null,null,650]
[null,null,null,null,651]
[null,null,null,null,652]
[null,null,null,null,653]
[null,null,null,null,654]
[null,null,null,null,655]
[null,null,null,null,656]
[null,null,null,null,657]
[null,null,null,null,658]
[null,null,null,null,659]
[null,null,null,null,660]
[null,null,null,null,661]
[null,null,null,null,662]
[null,null,null,null,663]
[null,null,null,null,664]
[null,null,null,null,665]
[null,null,null,null,666]
[null,null,null,null,667]
[null,null,null,null,668]
[null,null,null,null,669]
[null,null,null,null,670]
[null,null,null,null,671]
[null,null,null,null,672]
[null,null,null,null,673]
[null,null,null,null,674]
[null,null,null,null,675]
[null,null,null,null,676]
[null,null,null,null,677]
[null,null,null,null,678]
[null,null,null,null,679]
[null,null,null,null,680]
[null,null,null,null,681]
[null,null,null,null,682]
[null,null,null,null,683]
[null,null,null,null,684]
[null,null,null,null,685]
[null,null,null,null,686]
[null,null,null,null,687]
[null,null,null,null,688]
[null,null,null,null,689]
[null,null,null,null,690]
[null,null,null,null,691]
[null,null,null,null,692]
[null,null,null,null,693]
[null,null,null,null,694]
[null,null,null,null,695]
[null,null,null,null,696]
[null,null,null,null,697]
[null,null,null,null,698]
[null,null,null,null,699]
[null,null,null,null,700]
[null,null,null,null,701]
[null,null,null,null,702]
[null,null,null,null,703]
[null,null,null,null,704]
[null,null,null,null,705]
[null,null,null,null,706]
[null,null,null,null,707]
[null,null,null,null,708]
[null,null,null,null,709]
[null,null,null,null,710]
[null,null,null,null,711]
[null,null,null,null,712]
[null,null,null,null,713]
[null,null,null,null,714]
[null,null,null,null,715]
[null,null,null,null,716]
[null,null,null,null,717]
[null,null,null,null,718]
[null,null,null,null,719]
[null,null,null,null,720]
[null,null,null,null,721]
[null,null,null,null,722]
[null,null,null,null,723]
[null,null,null,null,724]
[null,null,null,null,725]
[null,null,null,null,726]
[null,null,null,null,727]
[null,null,null,null,728]
[null,null,null,null,729]
[null,null,null,null,730]
[null,null,null,null,731]
[null,null,null,null,732]
[null,null,null,null,733]
[null,null,null,null,734]
[null,null,null,null,735]
[null,null,null,null,736]
[null,null,null,null,737]
[null,null,null,null,738]
[null,null,null,null,739]
[null,null,null,null,740]
[null,null,null,null,741]
[null,null,null,null,742]
[null,null,null,null,743]
[null,null,null,null,744]
[null,null,null,null,745]
[null,null,null,null,746]
[null,null,null,null,747]
[null,null,null,null,748]
[null,null,null,null,749]
[null,null,null,null,750]
[null,null,null,null,751]
[null,null,null,null,752]
[null,null,null,null,753]
[null,null,null,null,754]
[null,null,null,null,755]
[null,null,null,null,756]
[null,null,null,null,757]
[null,null,null,null,758]
[null,null,null,null,759]
[null,null,null,null,760]
[null,null,null,null,761]
[null,null,null,null,762]
[null,null,null,null,763]
[null,null,null,null,764]
[null,null,null,null,765]
[null,null,null,null,766]
[null,null,null,null,767]
[null,null,null,null,768]
[null,null,null,null,769]
[null,null,null,null,770]
[null,null,null,null,771]
[null,null,null,null,772]
[null,null,null,null,773]
[null,null,null,null,774]
[null,null,null,null,775]
[null,null,null,null,776]
[null,null,null,null,777]
[null,null,null,null,778]
[null,null,null,null,779]
[null,null,null,null,780]
[null,null,null,null,781]
[null,null,null,null,782]
[null,null,null,null,783]
[null,null,null,null,784]
[null,null,null,null,785]
[null,null,null,null,786]
[null,null,null,null,787]
[null,null,null,null,788]
[null,null,null,null,789]
[null,null,null,null,790]
[null,null,null,null,791]
[null,null,null,null,792]
[null,null,null,null,793]
[null,null,null,null,794]
[null,null,null,null,795]
[null,null,null,null,796]
[null,null,null,null,797]
[null,null,null,null,798]
[null,null,null,null,799]
[null,null,null,null,800]
[null,null,null,null,801]
[null,null,null,null,802]
[null,null,null,null,803]
[null,null,null,null,804]
[null,null,null,null,805]
[null,null,null,null,806]
[null,null,null,null,807]
[null,null,null,null,808]
[null,null,null,null,809]
[null,null,null,null,810]
[null,null,null,null,811]
[null,null,null,null,812]
[null,null,null,null,813]
[null,null,null,null,814]
[null,null,null,null,815]
[null,null,null,null,816]
[null,null,null,null,817]
[null,null,null,null,818]
[null,null,null,null,819]
[null,null,null,null,820]
[null,null,null,null,821]
[null,null,null,null,822]
[null,null,null,null,823]
[null,null,null,null,824]
[null,null,null,null,825]
[null,null,null,null,826]
[null,null,null,null,827]
[null,null,null,null,828]
[null,null,null,null,829]
[null,null,null,null,830]
[null,null,null,null,831]
[null,null,null,null,832]
[null,null,null,null,833]
[null,null,null,null,834]
[null,null,null,null,835]
[null,null,null,null,836]
[null,null,null,null,837]
[null,null,null,null,838]
[null,null,null,null,839]
[null,null,null,null,840]
[null,null,null,null,841]
[null,null,null,null,842]
[null,null,null,null,843]
[null,null,null,null,844]
[null,null,null,null,845]
[null,null,null,null,846]
[null,null,null,null,847]
[null,null,null,null,848]
[null,null,null,null,849]
[null,null,null,null,850]
[null,null,null,null,851]
[null,null,null,null,852]
[null,null,null,null,853]
[null,null,null,null,854]
[null,null,null,null,855]
[null,null,null,null,856]
[null,null,null,null,857]
[null,null,null,null,858]
[null,null,null,null,859]
[null,null,null,null,860]
[null,null,null,null,861]
[null,null,null,null,862]
[null,null,null,null,863]
[null,null,null,null,864]
[null,null,null,null,865]
[null,null,null,null,866]
[null,null,null,null,867]
[null,null,null,null,868]
[null,null,null,null,869]
[null,null,null,null,870]
[null,null,null,null,871]
[null,null,null,null,872]
[null,null,null,null,873]
[null,null,null,null,874]
[null,null,null,null,875]
[null,null,null,null,876]
[null,null,null,null,877]
[null,null,null,null,878]
[null,null,null,null,879]
[null,null,null,null,880]
[null,null,null,null,881]
[null,null,null,null,882]
[null,null,null,null,883]
[null,null,null,null,884]
[null,null,null,null,885]
[null,null,null,null,886]
[null,null,null,null,887]
[null,null,null,null,888]
[null,null,null,null,889]
[null,null,null,null,890]
[null,null,null,null,891]
[null,null,null,null,892]
[null,null,null,null,893]
[null,null,null,null,894]
[null,null,null,null,895]
[null,null,null,null,896]
[null,null,null,null,897]
[null,null,null,null,898]
[null,null,null,null,899]
[null,null,null,null,900]
[null,null,null,null,901]
[null,null,null,null,902]
[null,null,null,null,903]
[null,null,null,null,904]
[null,null,null,null,905]
[null,null,null,null,906]
[null,null,null,null,907]
[null,null,null,null,908]
[null,null,null,null,909]
[null,null,null,null,910]
[null,null,null,null,911]
[null,null,null,null,912]
[null,null,null,null,913]
[null,null,null,null,914]
[null,null,null,null,915]
[null,null,null,null,916]
[null,null,null,null,917]
[null,null,null,null,918]
[null,null,null,null,919]
[null,null,null,null,920]
[null,null,null,null,921]
[null,null,null,null,922]
[null,null,null,null,923]
[null,null,null,null,924]
[null,null,null,null,925]
[null,null,null,null,926]
[null,null,null,null,927]
[null,null,null,null,928]
[null,null,null,null,929]
[null,null,null,null,930]
[null,null,null,null,931]
[null,null,null,null,932]
[null,null,null,null,933]
[null,null,null,null,934]
[null,null,null,null,935]
[null,null,null,null,936]
[null,null,null,null,937]
[null,null,null,null,938]
[null,null,null,null,939]
[null,null,null,null,940]
[null,null,null,null,941]
[null,null,null,null,942]
[null,null,null,null,943]
[null,null,null,null,944]
[null,null,null,null,945]
[null,null,null,null,946]
[null,null,null,null,947]
[null,null,null,null,948]
[null,null,null,null,949]
[null,null,null,null,950]
[null,null,null,null,951]
[null,null,null,null,952]
[null,null,null,null,953]
[null,null,null,null,954]
[null,null,null,null,955]
[null,null,null,null,956]
[null,null,null,null,957]
[null,null,null,null,958]
[null,null,null,null,959]
[null,null,null,null,960]
[null,null,null,null,961]
[null,null,null,null,962]
[null,null,null,null,963]
[null,null,null,null,964]
[null,null,null,null,965]
[null,null,null,null,966]
[null,null,null,null,967]
[null,null,null,null,968]
[null,null,null,null,969]
[null,null,null,null,970]
[null,null,null,null,971]
[null,null,null,null,972]
[null,null,null,null,973]
[null,null,null,null,974]
[null,null,null,null,975]
[null,null,null,null,976]
[null,null,null,null,977]
[null,null,null,null,978]
[null,null,null,null,979]
[null,null,null,null,980]
[null,null,null,null,981]
[null,null,null,null,982]
[null,null,null,null,983]
[null,null,null,null,984]
[null,null,null,null,985]
[null,null,null,null,986]
[null,null,null,null,987]
[null,null,null,null,988]
[null,null,null,null,989]
[null,null,null,null,990]
[null,null,null,null,991]
[null,null,null,null,992]
[null,null,null,null,993]
[null,null,null,null,994]
[null,null,null,null,995]
[null,null,null,null,996]
[null,null,null,null,997]
[null,null,null,null,998]
[null,null,null,null,999]
[null,null,null,null,1000]
[null,null,null,null,1001]
[null,null,null,null,1002]
[null,null,null,null,1003]
[null,null,null,null,1004]
[null,null,null,null,1005]
[null,null,null,null,1006]
[null,null,null,null,1007]
[null,null,null,null,1008]
[null,null,null,null,1009]
[null,null,null,null,1010]
[null,null,null,null,1011]
[null,null,null,null,1012]
[null,null,null,null,1013]
[null,null,null,null,1014]
[null,null,null,null,1015]
[null,null,null,null,1016]
[null,null,null,null,1017]
[null,null,null,null,1018]
[null,null,null,null,1019]
[null,null,null,null,1020]
[null,null,null,null,1021]
[null,null,null,null,1022]
[null,null,null,null,1023]
[null,null,null,null,1024]
[null,null,null,null,1025]
[null,null,null,null,1026]
[null,null,null,null,1027]
[null,null,null,null,1028]
[null,null,null,null,1029]
[null,null,null,null,1030]
[null,null,null,null,1031]
[null,null,null,null,1032]
[null,null,null,null,1033]
[null,null,null,null,1034]
[null,null,null,null,1035]
[null,null,null,null,1036]
[null,null,null,null,1037]
[null,null,null,null,1038]
[null,null,null,null,1039]
[null,null,null,null,1040]
[null,null,null,null,1041]
[null,null,null,null,1042]
[null,null,null,null,1043]
[null,null,null,null,1044]
[null,null,null,null,1045]
[null,null,null,null,1046]
[null,null,null,null,1047]
[null,null,null,null,1048]
[null,null,null,null,1049]
[null,null,null,null,1050]
[null,null,null,null,1051]
[null,null,null,null,1052]
[null,null,null,null,1053]
[null,null,null,null,1054]
[null,null,null,null,1055]
[null,null,null,null,1056]
[null,null,null,null,1057]
[null,null,null,null,1058]
[null,null,null,null,1059]
[null,null,null,null,1060]
[null,null,null,null,1061]
[null,null,null,null,1062]
[null,null,null,null,1063]
[null,null,null,null,1064]
[null,null,null,null,1065]
[null,null,null,null,1066]
[null,null,null,null,1067]
[null,null,null,null,1068]
[null,null,null,null,1069]
[null,null,null,null,1070]
[null,null,null,null,1071]
[null,null,null,null,1072]
[null,null,null,null,1073]
[null,null,null,null,1074]
[null,null,null,null,1075]
[null,null,null,null,1076]
[null,null,null,null,1077]
[null,null,null,null,1078]
[null,null,null,null,1079]
[null,null,null,null,1080]
[null,null,null,null,1081]
[null,null,null,null,1082]
[null,null,null,null,1083]
[null,null,null,null,1084]
[null,null,null,null,1085]
[null,null,null,null,1086]
[null,null,null,null,1087]
[null,null,null,null,1088]
[null,null,null,null,1089]
[null,null,null,null,1090]
[null,null,null,null,1091]
[null,null,null,null,1092]
[null,null,null,null,1093]
[null,null,null,null,1094]
[null,null,null,null,1095]
[null,null,null,null,1096]
[null,null,null,null,1097]
[null,null,null,null,1098]
[null,null,null,null,1099]
[null,null,null,null,1100]
[null,null,null,null,1101]
[null,null,null,null,1102]
[null,null,null,null,1103]
[null,null,null,null,1104]
[null,null,null,null,1105]
[null,null,null,null,1106]
[null,null,null,null,1107]
[null,null,null,null,1108]
[null,null,null,null,1109]
[null,null,null,null,1110]
[null,null,null,null,1111]
[null,null,null,null,1112]
[null,null,null,null,1113]
[null,null,null,null,1114]
[null,null,null,null,1115]
[null,null,null,null,1116]
[null,null,null,null,1117]
[null,null,null,null,1118]
[null,null,null,null,1119]
[null,null,null,null,1120]
[null,null,null,null,1121]
[null,null,null,null,1122]
[null,null,null,null,1123]
[null,null,null,null,1124]
[null,null,null,null,1125]
[null,null,null,null,1126]
[null,null,null,null,1127]
[null,null,null,null,1128]
[null,null,null,null,1129]
[null,null,null,null,1130]
[null,null,null,null,1131]
[null,null,null,null,1132]
[null,null,null,null,1133]
[null,null,null,null,1134]
[null,null,null,null,1135]
[null,null,null,null,1136]
[null,null,null,null,1137]
[null,null,null,null,1138]
[null,null,null,null,1139]
[null,null,null,null,1140]
[null,null,null,null,1141]
[null,null,null,null,1142]
[null,null,null,null,1143]
[null,null,null,null,1144]
[null,null,null,null,1145]
[null,null,null,null,1146]
[null,null,null,null,1147]
[null,null,null,null,1148]
[null,null,null,null,1149]
[null,null,null,null,1150]
[null,null,null,null,1151]
[null,null,null,null,1152]
[null,null,null,null,1153]
[null,null,null,null,1154]
[null,null,null,null,1155]
[null,null,null,null,1156]
[null,null,null,null,1157]
[null,null,null,null,1158]
[null,null,null,null,1159]
[null,null,null,null,1160]
[null,null,null,null,1161]
[null,null,null,null,1162]
[null,null,null,null,1163]
[null,null,null,null,1164]
[null,null,null,null,1165]
[null,null,null,null,1166]
[null,null,null,null,1167]
[null,null,null,null,1168]
[null,null,null,null,1169]
[null,null,null,null,1170]
[null,null,null,null,1171]
[null,null,null,null,1172]
[null,null,null,null,1173]
[null,null,null,null,1174]
[null,null,null,null,1175]
[null,null,null,null,1176]
[null,null,null,null,1177]
[null,null,null,null,1178]
[null,null,null,null,1179]
[null,null,null,null,1180]
[null,null,null,null,1181]
[null,null,null,null,1182]
[null,null,null,null,1183]
[null,null,null,null,1184]
[null,null,null,null,1185]
[null,null,null,null,1186]
[null,null,null,null,1187]
[null,null,null,null,1188]
[null,null,null,null,1189]
[null,null,null,null,1190]
[null,null,null,null,1191]
[null,null,null,null,1192]
[null,null,null,null,1193]
[null,null,null,null,1194]
[null,null,null,null,1195]
[null,null,null,null,1196]
[null,null,null,null,1197]
[null,null,null,null,1198]
[null,null,null,null,1199]
[null,null,null,null,1200]
[null,null,null,null,1201]
[null,null,null,null,1202]
[null,null,null,null,1203]
[null,null,null,null,1204]
[null,null,null,null,1205]
[null,null,null,null,1206]
[null,null,null,null,1207]
[null,null,null,null,1208]
[null,null,null,null,1209]
[null,null,null,null,1210]
[null,null,null,null,1211]
[null,null,null,null,1212]
[null,null,null,null,1213]
[null,null,null,null,1214]
[null,null,null,null,1215]
[null,null,null,null,1216]
[null,null,null,null,1217]
[null,null,null,null,1218]
[null,null,null,null,1219]
[null,null,null,null,1220]
[null,null,null,null,1221]
[null,null,null,null,1222]
[null,null,null,null,1223]
[null,null,null,null,1224]
[null,null,null,null,1225]
[null,null,null,null,1226]
[null,null,null,null,1227]
[null,null,null,null,1228]
[null,null,null,null,1229]
[null,null,null,null,1230]
[null,null,null,null,1231]
[null,null,null,null,1232]
[null,null,null,null,1233]
[null,null,null,null,1234]
[null,null,null,null,1235]
[null,null,null,null,1236]
[null,null,null,null,1237]
[null,null,null,null,1238]
[null,null,null,null,1239]
[null,null,null,null,1240]
[null,null,null,null,1241]
[null,null,null,null,1242]
[null,null,null,null,1243]
[null,null,null,null,1244]
[null,null,null,null,1245]
[null,null,null,null,1246]
[null,null,null,null,1247]
[null,null,null,null,1248]
[null,null,null,null,1249]
[null,null,null,null,1250]
[null,null,null,null,1251]
[null,null,null,null,1252]
[null,null,null,null,1253]
[null,null,null,null,1254]
[null,null,null,null,1255]
[null,null,null,null,1256]
[null,null,null,null,1257]
[null,null,null,null,1258]
[null,null,null,null,1259]
[null,null,null,null,1260]
[null,null,null,null,1261]
[null,null,null,null,1262]
[null,null,null,null,1263]
[null,null,null,null,1264]
[null,null,null,null,1265]
[null,null,null,null,1266]
[null,null,null,null,1267]
[null,null,null,null,1268]
[null,null,null,null,1269]
[null,null,null,null,1270]
[null,null,null,null,1271]
[null,null,null,null,1272]
[null,null,null,null,1273]
[null,null,null,null,1274]
[null,null,null,null,1275]
[null,null,null,null,1276]
[null,null,null,null,1277]
[null,null,null,null,1278]
[null,null,null,null,1279]
[null,null,null,null,1280]
[null,null,null,null,1281]
[null,null,null,null,1282]
[null,null,null,null,1283]
[null,null,null,null,1284]
[null,null,null,null,1285]
[null,null,null,null,1286]
[null,null,null,null,1287]
[null,null,null,null,1288]
[null,null,null,null,1289]
[null,null,null,null,1290]
[null,null,null,null,1291]
[null,null,null,null,1292]
[null,null,null,null,1293]
[null,null,null,null,1294]
[null,null,null,null,1295]
[null,null,null,null,1296]
[null,null,null,null,1297]
[null,null,null,null,1298]
[null,null,null,null,1299]
[null,null,null,null,1300]
[null,null,null,null,1301]
[null,null,null,null,1302]
[null,null,null,null,1303]
[null,null,null,null,1304]
[null,null,null,null,1305]
[null,null,null,null,1306]
[null,null,null,null,1307]
[null,null,null,null,1308]
[null,null,null,null,1309]
[null,null,null,null,1310]
[null,null,null,null,1311]
[null,null,null,null,1312]
[null,null,null,null,1313]
[null,null,null,null,1314]
[null,null,null,null,1315]
[null,null,null,null,1316]
[null,null,null,null,1317]
[null,null,null,null,1318]
[null,null,null,null,1319]
[null,null,null,null,1320]
[null,null,null,null,1321]
[null,null,null,null,1322]
[null,null,null,null,1323]
[null,null,null,null,1324]
[null,null,null,null,1325]
[null,null,null,null,1326]
[null,null,null,null,1327]
[null,null,null,null,1328]
[null,null,null,null,1329]
[null,null,null,null,1330]
[null,null,null,null,1331]
[null,null,null,null,1332]
[null,null,null,null,1333]
[null,null,null,null,1334]
[null,null,null,null,1335]
[null,null,null,null,1336]
[null,null,null,null,1337]
[null,null,null,null,1338]
[null,null,null,null,1339]
[null,null,null,null,1340]
[null,null,null,null,1341]
[null,null,null,null,1342]
[null,null,null,null,1343]
[null,null,null,null,1344]
[null,null,null,null,1345]
[null,null,null,null,1346]
[null,null,null,null,1347]
[null,null,null,null,1348]
[null,null,null,null,1349]
[null,null,null,null,1350]
[null,null,null,null,1351]
[null,null,null,null,1352]
[null,null,null,null,1353]
[null,null,null,null,1354]
[null,null,null,null,1355]
[null,null,null,null,1356]
[null,null,null,null,1357]
[null,null,null,null,1358]
[null,null,null,null,1359]
[null,null,null,null,1360]
[null,null,null,null,1361]
[null,null,null,null,1362]
[null,null,null,null,1363]
[null,null,null,null,1364]
[null,null,null,null,1365]
[null,null,null,null,1366]
[null,null,null,null,1367]
[null,null,null,null,1368]
[null,null,null,null,1369]
[null,null,null,null,1370]
[null,null,null,null,1371]
[null,null,null,null,1372]
[null,null,null,null,1373]
[null,null,null,null,1374]
[null,null,null,null,1375]
[null,null,null,null,1376]
[null,null,null,null,1377]
[null,null,null,null,1378]
[null,null,null,null,1379]
[null,null,null,null,1380]
[null,null,null,null,1381]
[null,null,null,null,1382]
[null,null,null,null,1383]
[null,null,null,null,1384]
[null,null,null,null,1385]
[null,null,null,null,1386]
[null,null,null,null,1387]
[null,null,null,null,1388]
[null,null,null,null,1389]
[null,null,null,null,1390]
[null,null,null,null,1391]
[null,null,null,null,1392]
[null,null,null,null,1393]
[null,null,null,null,1394]
[null,null,null,null,1395]
[null,null,null,null,1396]
[null,null,null,null,1397]
[null,null,null,null,1398]
[null,null,null,null,1399]
[null,null,null,null,1400]
[null,null,null,null,1401]
[null,null,null,null,1402]
[null,null,null,null,1403]
[null,null,null,null,1404]
[null,null,null,null,1405]
[null,null,null,null,1406]
[null,null,null,null,1407]
[null,null,null,null,1408]
[null,null,null,null,1409]
[null,null,null,null,1410]
[null,null,null,null,1411]
[null,null,null,null,1412]
[null,null,null,null,1413]
[null,null,null,null,1414]
[null,null,null,null,1415]
[null,null,null,null,1416]
[null,null,null,null,1417]
[null,null,null,null,1418]
[null,null,null,null,1419]
[null,null,null,null,1420]
[null,null,null,null,1421]
[null,null,null,null,1422]
[null,null,null,null,1423]
[null,null,null,null,1424]
[null,null,null,null,1425]
[null,null,null,null,1426]
[null,null,null,null,1427]
[null,null,null,null,1428]
[null,null,null,null,1429]
[null,null,null,null,1430]
[null,null,null,null,1431]
[null,null,null,null,1432]
[null,null,null,null,1433]
[null,null,null,null,1434]
[null,null,null,null,1435]
[null,null,null,null,1436]
[null,null,null,null,1437]
[null,null,null,null,1438]
[null,null,null,null,1439]
[null,null,null,null,1440]
[null,null,null,null,1441]
[null,null,null,null,1442]
[null,null,null,null,1443]
[null,null,null,null,1444]
[null,null,null,null,1445]
[null,null,null,null,1446]
[null,null,null,null,1447]
[null,null,null,null,1448]
[null,null,null,null,1449]
[null,null,null,null,1450]
[null,null,null,null,1451]
[null,null,null,null,1452]
[null,null,null,null,1453]
[null,null,null,null,1454]
[null,null,null,null,1455]
[null,null,null,null,1456]
[null,null,null,null,1457]
[null,null,null,null,1458]
[null,null,null,null,1459]
[null,null,null,null,1460]
[null,null,null,null,1461]
[null,null,null,null,1462]
[null,null,null,null,1463]
[null,null,null,null,1464]
[null,null,null,null,1465]
[null,null,null,null,1466]
[null,null,null,null,1467]
[null,null,null,null,1468]
[null,null,null,null,1469]
[null,null,null,null,1470]
[null,null,null,null,1471]
[null,null,null,null,1472]
[null,null,null,null,1473]
[null,null,null,null,1474]
[null,null,null,null,1475]
[null,null,null,null,1476]
[null,null,null,null,1477]
[null,null,null,null,1478]
[null,null,null,null,1479]
[null,null,null,null,1480]
[null,null,null,null,1481]
[null,null,null,null,1482]
[null,null,null,null,1483]
[null,null,null,null,1484]
[null,null,null,null,1485]
[null,null,null,null,1486]
[null,null,null,null,1487]
[null,null,null,null,1488]
[null,null,null,null,1489]
[null,null,null,null,1490]
[null,null,null,null,1491]
[null,null,null,null,1492]
[null,null,null,null,1493]
[null,null,null,null,1494]
[null,null,null,null,1495]
[null,null,null,null,1496]
[null,null,null,null,1497]
[null,null,null,null,1498]
[null,null,null,null,1499]
[null,null,null,null,1500]
[null,null,null,null,1501]
[null,null,null,null,1502]
[null,null,null,null,1503]
[null,null,null,null,1504]
[null,null,null,null,1505]
[null,null,null,null,1506]
[null,null,null,null,1507]
[null,null,null,null,1508]
[null,null,null,null,1509]
[null,null,null,null,1510]
[null,null,null,null,1511]
[null,null,null,null,1512]
[null,null,null,null,1513]
[null,null,null,null,1514]
[null,null,null,null,1515]
[null,null,null,null,1516]
[null,null,null,null,1517]
[null,null,null,null,1518]
[null,null,null,null,1519]
[null,null,null,null,1520]
[null,null,null,null,1521]
[null,null,null,null,1522]
[null,null,null,null,1523]
[null,null,null,null,1524]
[null,null,null,null,1525]
[null,null,null,null,1526]
[null,null,null,null,1527]
[null,null,null,null,1528]
[null,null,null,null,1529]
[null,null,null,null,1530]
[null,null,null,null,1531]
[null,null,null,null,1532]
[null,null,null,null,1533]
[null,null,null,null,1534]
[null,null,null,null,1535]
[null,null,null,null,1536]
[null,null,null,null,1537]
[null,null,null,null,1538]
[null,null,null,null,1539]
[null,null,null,null,1540]
[null,null,null,null,1541]
[null,null,null,null,1542]
[null,null,null,null,1543]
[null,null,null,null,1544]
[null,null,null,null,1545]
[null,null,null,null,1546]
[null,null,null,null,1547]
[null,null,null,null,1548]
[null,null,null,null,1549]
[null,null,null,null,1550]
[null,null,null,null,1551]
[null,null,null,null,1552]
[null,null,null,null,1553]
[null,null,null,null,1554]
[null,null,null,null,1555]
[null,null,null,null,1556]
[null,null,null,null,1557]
[null,null,null,null,1558]
[null,null,null,null,1559]
[null,null,null,null,1560]
[null,null,null,null,1561]
[null,null,null,null,1562]
[null,null,null,null,1563]
[null,null,null,null,1564]
[null,null,null,null,1565]
[null,null,null,null,1566]
[null,null,null,null,1567]
[null,null,null,null,1568]
[null,null,null,null,1569]
[null,null,null,null,1570]
[null,null,null,null,1571]
[null,null,null,null,1572]
[null,null,null,null,1573]
[null,null,null,null,1574]
[null,null,null,null,1575]
[null,null,null,null,1576]
[null,null,null,null,1577]
[null,null,null,null,1578]
[null,null,null,null,1579]
[null,null,null,null,1580]
[null,null,null,null,1581]
[null,null,null,null,1582]
[null,null,null,null,1583]
[null,null,null,null,1584]
[null,null,null,null,1585]
[null,null,null,null,1586]
[null,null,null,null,1587]
[null,null,null,null,1588]
[null,null,null,null,1589]
[null,null,null,null,1590]
[null,null,null,null,1591]
[null,null,null,null,1592]
[null,null,null,null,1593]
[null,null,null,null,1594]
[null,null,null,null,1595]
[null,null,null,null,1596]
[null,null,null,null,1597]
[null,null,null,null,1598]
[null,null,null,null,1599]
[null,null,null,null,1600]
[null,null,null,null,1601]
[null,null,null,null,1602]
[null,null,null,null,1603]
[null,null,null,null,1604]
[null,null,null,null,1605]
[null,null,null,null,1606]
[null,null,null,null,1607]
[null,null,null,null,1608]
[null,null,null,null,1609]
[null,null,null,null,1610]
[null,null,null,null,1611]
[null,null,null,null,1612]
[null,null,null,null,1613]
[null,null,null,null,1614]
[null,null,null,null,1615]
[null,null,null,null,1616]
[null,null,null,null,1617]
[null,null,null,null,1618]
[null,null,null,null,1619]
[null,null,null,null,1620]
[null,null,null,null,1621]
[null,null,null,null,1622]
[null,null,null,null,1623]
[null,null,null,null,1624]
[null,null,null,null,1625]
[null,null,null,null,1626]
[null,null,null,null,1627]
[null,null,null,null,1628]
[null,null,null,null,1629]
[null,null,null,null,1630]
[null,null,null,null,1631]
[null,null,null,null,1632]
[null,null,null,null,1633]
[null,null,null,null,1634]
[null,null,null,null,1635]
[null,null,null,null,1636]
[null,null,null,null,1637]
[null,null,null,null,1638]
[null,null,null,null,1639]
[null,null,null,null,1640]
[null,null,null,null,1641]
[null,null,null,null,1642]
[null,null,null,null,1643]
[null,null,null,null,1644]
[null,null,null,null,1645]
[null,null,null,null,1646]
[null,null,null,null,1647]
[null,null,null,null,1648]
[null,null,null,null,1649]
[null,null,null,null,1650]
[null,null,null,null,1651]
[null,null,null,null,1652]
[null,null,null,null,1653]
[null,null,null,null,1654]
[null,null,null,null,1655]
[null,null,null,null,1656]
[null,null,null,null,1657]
[null,null,null,null,1658]
[null,null,null,null,1659]
[null,null,null,null,1660]
[null,null,null,null,1661]
[null,null,null,null,1662]
[null,null,null,null,1663]
[null,null,null,null,1664]
[null,null,null,null,1665]
[null,null,null,null,1666]
[null,null,null,null,1667]
[null,null,null,null,1668]
[null,null,null,null,1669]
[null,null,null,null,1670]
[null,null,null,null,1671]
[null,null,null,null,1672]
[null,null,null,null,1673]
[null,null,null,null,1674]
[null,null,null,null,1675]
[null,null,null,null,1676]
[null,null,null,null,1677]
[null,null,null,null,1678]
[null,null,null,null,1679]
[null,null,null,null,1680]
[null,null,null,null,1681]
[null,null,null,null,1682]
[null,null,null,null,1683]
[null,null,null,null,1684]
[null,null,null,null,1685]
[null,null,null,null,1686]
[null,null,null,null,1687]
[null,null,null,null,1688]
[null,null,null,null,1689]
[null,null,null,null,1690]
[null,null,null,null,1691]
[null,null,null,null,1692]
[null,null,null,null,1693]
[null,null,null,null,1694]
[null,null,null,null,1695]
[null,null,null,null,1696]
[null,null,null,null,1697]
[null,null,null,null,1698]
[null,null,null,null,1699]
[null,null,null,null,1700]
[null,null,null,null,1701]
[null,null,null,null,1702]
[null,null,null,null,1703]
[null,null,null,null,1704]
[null,null,null,null,1705]
[null,null,null,null,1706]
[null,null,null,null,1707]
[null,null,null,null,1708]
[null,null,null,null,1709]
[null,null,null,null,1710]
[null,null,null,null,1711]
[null,null,null,null,1712]
[null,null,null,null,1713]
[null,null,null,null,1714]
[null,null,null,null,1715]
[null,null,null,null,1716]
[null,null,null,null,1717]
[null,null,null,null,1718]
[null,null,null,null,1719]
[null,null,null,null,1720]
[null,null,null,null,1721]
[null,null,null,null,1722]
[null,null,null,null,1723]
[null,null,null,null,1724]
[null,null,null,null,1725]
[null,null,null,null,1726]
[null,null,null,null,1727]
[null,null,null,null,1728]
[null,null,null,null,1729]
[null,null,null,null,1730]
[null,null,null,null,1731]
[null,null,null,null,1732]
[null,null,null,null,1733]
[null,null,null,null,1734]
[null,null,null,null,1735]
[null,null,null,null,1736]
[null,null,null,null,1737]
[null,null,null,null,1738]
[null,null,null,null,1739]
[null,null,null,null,1740]
[null,null,null,null,1741]
[null,null,null,null,1742]
[null,null,null,null,1743]
[null,null,null,null,1744]
[null,null,null,null,1745]
[null,null,null,null,1746]
[null,null,null,null,1747]
[null,null,null,null,1748]
[null,null,null,null,1749]
[null,null,null,null,1750]
[null,null,null,null,1751]
[null,null,null,null,1752]
[null,null,null,null,1753]
[null,null,null,null,1754]
[null,null,null,null,1755]
[null,null,null,null,1756]
[null,null,null,null,1757]
[null,null,null,null,1758]
[null,null,null,null,1759]
[null,null,null,null,1760]
[null,null,null,null,1761]
[null,null,null,null,1762]
[null,null,null,null,1763]
[null,null,null,null,1764]
[null,null,null,null,1765]
[null,null,null,null,1766]
[null,null,null,null,1767]
[null,null,null,null,1768]
[null,null,null,null,1769]
[null,null,null,null,1770]
[null,null,null,null,1771]
[null,null,null,null,1772]
[null,null,null,null,1773]
[null,null,null,null,1774]
[null,null,null,null,1775]
[null,null,null,null,1776]
[null,null,null,null,1777]
[null,null,null,null,1778]
[null,null,null,null,1779]
[null,null,null,null,1780]
[null,null,null,null,1781]
[null,null,null,null,1782]
[null,null,null,null,1783]
[null,null,null,null,1784]
[null,null,null,null,1785]
[null,null,null,null,1786]
[null,null,null,null,1787]
[null,null,null,null,1788]
[null,null,null,null,1789]
[null,null,null,null,1790]
[null,null,null,null,1791]
[null,null,null,null,1792]
[null,null,null,null,1793]
[null,null,null,null,1794]
[null,null,null,null,1795]
[null,null,null,null,1796]
[null,null,null,null,1797]
[null,null,null,null,1798]
[null,null,null,null,1799]
[null,null,null,null,1800]
[null,null,null,null,1801]
[null,null,null,null,1802]
[null,null,null,null,1803]
[null,null,null,null,1804]
[null,null,null,null,1805]
[null,null,null,null,1806]
[null,null,null,null,1807]
[null,null,null,null,1808]
[null,null,null,null,1809]
[null,null,null,null,1810]
[null,null,null,null,1811]
[null,null,null,null,1812]
[null,null,null,null,1813]
[null,null,null,null,1814]
[null,null,null,null,1815]
[null,null,null,null,1816]
[null,null,null,null,1817]
[null,null,null,null,1818]
[null,null,null,null,1819]
[null,null,null,null,1820]
[null,null,null,null,1821]
[null,null,null,null,1822]
[null,null,null,null,1823]
[null,null,null,null,1824]
[null,null,null,null,1825]
[null,null,null,null,1826]
[null,null,null,null,1827]
[null,null,null,null,1828]
[null,null,null,null,1829]
[null,null,null,null,1830]
[null,null,null,null,1831]
[null,null,null,null,1832]
[null,null,null,null,1833]
[null,null,null,null,1834]
[null,null,null,null,1835]
[null,null,null,null,1836]
[null,null,null,null,1837]
[null,null,null,null,1838]
[null,null,null,null,1839]
[null,null,null,null,1840]
[null,null,null,null,1841]
[null,null,null,null,1842]
[null,null,null,null,1843]
[null,null,null,null,1844]
[null,null,null,null,1845]
[null,null,null,null,1846]
[null,null,null,null,1847]
[null,null,null,null,1848]
[null,null,null,null,1849]
[null,null,null,null,1850]
[null,null,null,null,1851]
[null,null,null,null,1852]
[null,null,null,null,1853]
[null,null,null,null,1854]
[null,null,null,null,1855]
[null,null,null,null,1856]
[null,null,null,null,1857]
[null,null,null,null,1858]
[null,null,null,null,1859]
[null,null,null,null,1860]
[null,null,null,null,1861]
[null,null,null,null,1862]
[null,null,null,null,1863]
[null,null,null,null,1864]
[null,null,null,null,1865]
[null,null,null,null,1866]
[null,null,null,null,1867]
[null,null,null,null,1868]
[null,null,null,null,1869]
[null,null,null,null,1870]
[null,null,null,null,1871]
[null,null,null,null,1872]
[null,null,null,null,1873]
[null,null,null,null,1874]
[null,null,null,null,1875]
[null,null,null,null,1876]
[null,null,null,null,1877]
[null,null,null,null,1878]
[null,null,null,null,1879]
[null,null,null,null,1880]
[null,null,null,null,1881]
[null,null,null,null,1882]
[null,null,null,null,1883]
[null,null,null,null,1884]
[null,null,null,null,1885]
[null,null,null,null,1886]
[null,null,null,null,1887]
[null,null,null,null,1888]
[null,null,null,null,1889]
[null,null,null,null,1890]
[null,null,null,null,1891]
[null,null,null,null,1892]
[null,null,null,null,1893]
[null,null,null,null,1894]
[null,null,null,null,1895]
[null,null,null,null,1896]
[null,null,null,null,1897]
[null,null,null,null,1898]
[null,null,null,null,1899]
[null,null,null,null,1900]
[null,null,null,null,1901]
[null,null,null,null,1902]
[null,null,null,null,1903]
[null,null,null,null,1904]
[null,null,null,null,1905]
[null,null,null,null,1906]
[null,null,null,null,1907]
[null,null,null,null,1908]
[null,null,null,null,1909]
[null,null,null,null,1910]
[null,null,null,null,1911]
[null,null,null,null,1912]
[null,null,null,null,1913]
[null,null,null,null,1914]
[null,null,null,null,1915]
[null,null,null,null,1916]
[null,null,null,null,1917]
[null,null,null,null,1918]
[null,null,null,null,1919]
[null,null,null,null,1920]
[null,null,null,null,1921]
[null,null,null,null,1922]
[null,null,null,null,1923]
[null,null,null,null,1924]
[null,null,null,null,1925]
[null,null,null,null,1926]
[null,null,null,null,1927]
[null,null,null,null,1928]
[null,null,null,null,1929]
[null,null,null,null,1930]
[null,null,null,null,1931]
[null,null,null,null,1932]
[null,null,null,null,1933]
[null,null,null,null,1934]
[null,null,null,null,1935]
[null,null,null,null,1936]
[null,null,null,null,1937]
[null,null,null,null,1938]
[null,null,null,null,1939]
[null,null,null,null,1940]
[null,null,null,null,1941]
[null,null,null,null,1942]
[null,null,null,null,1943]
[null,null,null,null,1944]
[null,null,null,null,1945]
[null,null,null,null,1946]
[null,null,null,null,1947]
[null,null,null,null,1948]
[null,null,null,null,1949]
[null,null,null,null,1950]
[null,null,null,null,1951]
[null,null,null,null,1952]
[null,null,null,null,1953]
[null,null,null,null,1954]
[null,null,null,null,1955]
[null,null,null,null,1956]
[null,null,null,null,1957]
[null,null,null,null,1958]
[null,null,null,null,1959]
[null,null,null,null,1960]
[null,null,null,null,1961]
[null,null,null,null,1962]
[null,null,null,null,1963]
[null,null,null,null,1964]
[null,null,null,null,1965]
[null,null,null,null,1966]
[null,null,null,null,1967]
[null,null,null,null,1968]
[null,null,null,null,1969]
[null,null,null,null,1970]
[null,null,null,null,1971]
[null,null,null,null,1972]
[null,null,null,null,1973]
[null,null,null,null,1974]
[null,null,null,null,1975]
[null,null,null,null,1976]
[null,null,null,null,1977]
[null,null,null,null,1978]
[null,null,null,null,1979]
[null,null,null,null,1980]
[null,null,null,null,1981]
[null,null,null,null,1982]
[null,null,null,null,1983]
[null,null,null,null,1984]
[null,null,null,null,1985]
[null,null,null,null,1986]
[null,null,null,null,1987]
[null,null,null,null,1988]
[null,null,null,null,1989]
[null,null,null,null,1990]
[null,null,null,null,1991]
[null,null,null,null,1992]
[null,null,null,null,1993]
[null,null,null,null,1994]
[null,null,null,null,1995]
[null,null,null,null,1996]
[null,null,null,null,1997]
[null,null,null,null,1998]
[null,null,null,null,1999]
[null,null,null,null,2000]
[null,null,null,null,2001]
[null,null,null,null,2002]
[null,null,null,null,2003]
[null,null,null,null,2004]
[null,null,null,null,2005]
[null,null,null,null,2006]
[null,null,null,null,2007]
[null,null,null,null,2008]
[null,null,null,null,2009]
[null,null,null,null,2010]
[null,null,null,null,2011]
[null,null,null,null,2012]
[null,null,null,null,2013]
[null,null,null,null,2014]
[null,null,null,null,2015]
[null,null,null,null,2016]
[null,null,null,null,2017]
[null,null,null,null,2018]
[null,null,null,null,2019]
[null,null,null,null,2020]
[null,null,null,null,2021]
[null,null,null,null,2022]
[null,null,null,null,2023]
[null,null,null,null,2024]
[null,null,null,null,2025]
[null,null,null,null,2026]
[null,null,null,null,2027]
[null,null,null,null,2028]
[null,null,null,null,2029]
[null,null,null,null,2030]
[null,null,null,null,2031]
[null,null,null,null,2032]
[null,null,null,null,2033]
[null,null,null,null,2034]
[null,null,null,null,2035]
[null,null,null,null,2036]
[null,null,null,null,2037]
[null,null,null,null,2038]
[null,null,null,null,2039]
[null,null,null,null,2040]
[null,null,null,null,2041]
[null,null,null,null,2042]
[null,null,null,null,2043]
[null,null,null,null,2044]
[null,null,null,null,2045]
[null,null,null,null,2046]
[null,null,null,null,2047]
[null,null,null,null,2048]
[null,null,null,null,2049]
[null,null,null,null,2050]
[null,null,null,null,2051]
[null,null,null,null,2052]
[null,null,null,null,2053]
[null,null,null,null,2054]
[null,null,null,null,2055]
[null,null,null,null,2056]
[null,null,null,null,2057]
[null,null,null,null,2058]
[null,null,null,null,2059]
[null,null,null,null,2060]
[null,null,null,null,2061]
[null,null,null,null,2062]
[null,null,null,null,2063]
[null,null,null,null,2064]
[null,null,null,null,2065]
[null,null,null,null,2066]
[null,null,null,null,2067]
[null,null,null,null,2068]
[null,null,null,null,2069]
[null,null,null,null,2070]
[null,null,null,null,2071]
[null,null,null,null,2072]
[null,null,null,null,2073]
[null,null,null,null,2074]
[null,null,null,null,2075]
[null,null,null,null,2076]
[null,null,null,null,2077]
[null,null,null,null,2078]
[null,null,null,null,2079]
[null,null,null,null,2080]
[null,null,null,null,2081]
[null,null,null,null,2082]
[null,null,null,null,2083]
[null,null,null,null,2084]
[null,null,null,null,2085]
[null,null,null,null,2086]
[null,null,null,null,2087]
[null,null,null,null,2088]
[null,null,null,null,2089]
[null,null,null,null,2090]
[null,null,null,null,2091]
[null,null,null,null,2092]
[null,null,null,null,2093]
[null,null,null,null,2094]
[null,null,null,null,2095]
[null,null,null,null,2096]
[null,null,null,null,2097]
[null,null,null,null,2098]
[null,null,null,null,2099]
[null,null,null,null,2100]
[null,null,null,null,2101]
[null,null,null,null,2102]
[null,null,null,null,2103]
[null,null,null,null,2104]
[null,null,null,null,2105]
[null,null,null,null,2106]
[null,null,null,null,2107]
[null,null,null,null,2108]
[null,null,null,null,2109]
[null,null,null,null,2110]
[null,null,null,null,2111]
[null,null,null,null,2112]
[null,null,null,null,2113]
[null,null,null,null,2114]
[null,null,null,null,2115]
[null,null,null,null,2116]
[null,null,null,null,2117]
[null,null,null,null,2118]
[null,null,null,null,2119]
[null,null,null,null,2120]
[null,null,null,null,2121]
[null,null,null,null,2122]
[null,null,null,null,2123]
[null,null,null,null,2124]
[null,null,null,null,2125]
[null,null,null,null,2126]
[null,null,null,null,2127]
[null,null,null,null,2128]
[null,null,null,null,2129]
[null,null,null,null,2130]
[null,null,null,null,2131]
[null,null,null,null,2132]
[null,null,null,null,2133]
[null,null,null,null,2134]
[null,null,null,null,2135]
[null,null,null,null,2136]
[null,null,null,null,2137]
[null,null,null,null,2138]
[null,null,null,null,2139]
[null,null,null,null,2140]
[null,null,null,null,2141]
[null,null,null,null,2142]
[null,null,null,null,2143]
[null,null,null,null,2144]
[null,null,null,null,2145]
[null,null,null,null,2146]
[null,null,null,null,2147]
[null,null,null,null,2148]
[null,null,null,null,2149]
[null,null,null,null,2150]
[null,null,null,null,2151]
[null,null,null,null,2152]
[null,null,null,null,2153]
[null,null,null,null,2154]
[null,null,null,null,2155]
[null,null,null,null,2156]
[null,null,null,null,2157]
[null,null,null,null,2158]
[null,null,null,null,2159]
[null,null,null,null,2160]
[null,null,null,null,2161]
[null,null,null,null,2162]
[null,null,null,null,2163]
[null,null,null,null,2164]
[null,null,null,null,2165]
[null,null,null,null,2166]
[null,null,null,null,2167]
[null,null,null,null,2168]
[null,null,null,null,2169]
[null,null,null,null,2170]
[null,null,null,null,2171]
[null,null,null,null,2172]
[null,null,null,null,2173]
[null,null,null,null,2174]
[null,null,null,null,2175]
[null,null,null,null,2176]
[null,null,null,null,2177]
[null,null,null,null,2178]
[null,null,null,null,2179]
[null,null,null,null,2180]
[null,null,null,null,2181]
[null,null,null,null,2182]
[null,null,null,null,2183]
[null,null,null,null,2184]
[null,null,null,null,2185]
[null,null,null,null,2186]
[null,null,null,null,2187]
[null,null,null,null,2188]
[null,null,null,null,2189]
[null,null,null,null,2190]
[null,null,null,null,2191]
[null,null,null,null,2192]
[null,null,null,null,2193]
[null,null,null,null,2194]
[null,null,null,null,2195]
[null,null,null,null,2196]
[null,null,null,null,2197]
[null,null,null,null,2198]
[null,null,null,null,2199]
[null,null,null,null,2200]
[null,null,null,null,2201]
[null,null,null,null,2202]
[null,null,null,null,2203]
[null,null,null,null,2204]
[null,null,null,null,2205]
[null,null,null,null,2206]
[null,null,null,null,2207]
[null,null,null,null,2208]
[null,null,null,null,2209]
[null,null,null,null,2210]
[null,null,null,null,2211]
[null,null,null,null,2212]
[null,null,null,null,2213]
[null,null,null,null,2214]
[null,null,null,null,2215]
[null,null,null,null,2216]
[null,null,null,null,2217]
[null,null,null,null,2218]
[null,null,null,null,2219]
[null,null,null,null,2220]
[null,null,null,null,2221]
[null,null,null,null,2222]
[null,null,null,null,2223]
[null,null,null,null,2224]
[null,null,null,null,2225]
[null,null,null,null,2226]
[null,null,null,null,2227]
[null,null,null,null,2228]
[null,null,null,null,2229]
[null,null,null,null,2230]
[null,null,null,null,2231]
[null,null,null,null,2232]
[null,null,null,null,2233]
[null,null,null,null,2234]
[null,null,null,null,2235]
[null,null,null,null,2236]
[null,null,null,null,2237]
[null,null,null,null,2238]
[null,null,null,null,2239]
[null,null,null,null,2240]
[null,null,null,null,2241]
[null,null,null,null,2242]
[null,null,null,null,2243]
[null,null,null,null,2244]
[null,null,null,null,2245]
[null,null,null,null,2246]
[null,null,null,null,2247]
[null,null,null,null,2248]
[null,null,null,null,2249]
[null,null,null,null,2250]
[null,null,null,null,2251]
[null,null,null,null,2252]
[null,null,null,null,2253]
[null,null,null,null,2254]
[null,null,null,null,2255]
[null,null,null,null,2256]
[null,null,null,null,2257]
[null,null,null,null,2258]
[null,null,null,null,2259]
[null,null,null,null,2260]
[null,null,null,null,2261]
[null,null,null,null,2262]
[null,null,null,null,2263]
[null,null,null,null,2264]
[null,null,null,null,2265]
[null,null,null,null,2266]
[null,null,null,null,2267]
[null,null,null,null,2268]
[null,null,null,null,2269]
[null,null,null,null,2270]
[null,null,null,null,2271]
[null,null,null,null,2272]
[null,null,null,null,2273]
[null,null,null,null,2274]
[null,null,null,null,2275]
[null,null,null,null,2276]
[null,null,null,null,2277]
[null,null,null,null,2278]
[null,null,null,null,2279]
[null,null,null,null,2280]
[null,null,null,null,2281]
[null,null,null,null,2282]
[null,null,null,null,2283]
[null,null,null,null,2284]
[null,null,null,null,2285]
[null,null,null,null,2286]
[null,null,null,null,2287]
[null,null,null,null,2288]
[null,null,null,null,2289]
[null,null,null,null,2290]
[null,null,null,null,2291]
[null,null,null,null,2292]
[null,null,null,null,2293]
[null,null,null,null,2294]
[null,null,null,null,2295]
[null,null,null,null,2296]
[null,null,null,null,2297]
[null,null,null,null,2298]
[null,null,null,null,2299]
[null,null,null,null,2300]
[null,null,null,null,2301]
[null,null,null,null,2302]
[null,null,null,null,2303]
[null,null,null,null,2304]
[null,null,null,null,2305]
[null,null,null,null,2306]
[null,null,null,null,2307]
[null,null,null,null,2308]
[null,null,null,null,2309]
[null,null,null,null,2310]
[null,null,null,null,2311]
[null,null,null,null,2312]
[null,null,null,null,2313]
[null,null,null,null,2314]
[null,null,null,null,2315]
[null,null,null,null,2316]
[null,null,null,null,2317]
[null,null,null,null,2318]
[null,null,null,null,2319]
[null,null,null,null,2320]
[null,null,null,null,2321]
[null,null,null,null,2322]
[null,null,null,null,2323]
[null,null,null,null,2324]
[null,null,null,null,2325]
[null,null,null,null,2326]
[null,null,null,null,2327]
[null,null,null,null,2328]
[null,null,null,null,2329]
[null,null,null,null,2330]
[null,null,null,null,2331]
[null,null,null,null,2332]
[null,null,null,null,2333]
[null,null,null,null,2334]
[null,null,null,null,2335]
[null,null,null,null,2336]
[null,null,null,null,2337]
[null,null,null,null,2338]
[null,null,null,null,2339]
[null,null,null,null,2340]
[null,null,null,null,2341]
[null,null,null,null,2342]
[null,null,null,null,2343]
[null,null,null,null,2344]
[null,null,null,null,2345]
[null,null,null,null,2346]
[null,null,null,null,2347]
[null,null,null,null,2348]
[null,null,null,null,2349]
[null,null,null,null,2350]
[null,null,null,null,2351]
[null,null,null,null,2352]
[null,null,null,null,2353]
[null,null,null,null,2354]
[null,null,null,null,2355]
[null,null,null,null,2356]
[null,null,null,null,2357]
[null,null,null,null,2358]
[null,null,null,null,2359]
[null,null,null,null,2360]
[null,null,null,null,2361]
[null,null,null,null,2362]
[null,null,null,null,2363]
[null,null,null,null,2364]
[null,null,null,null,2365]
[null,null,null,null,2366]
[null,null,null,null,2367]
[null,null,null,null,2368]
[null,null,null,null,2369]
[null,null,null,null,2370]
[null,null,null,null,2371]
[null,null,null,null,2372]
[null,null,null,null,2373]
[null,null,null,null,2374]
[null,null,null,null,2375]
[null,null,null,null,2376]
[null,null,null,null,2377]
[null,null,null,null,2378]
[null,null,null,null,2379]
[null,null,null,null,2380]
[null,null,null,null,2381]
[null,null,null,null,2382]
[null,null,null,null,2383]
[null,null,null,null,2384]
[null,null,null,null,2385]
[null,null,null,null,2386]
[null,null,null,null,2387]
[null,null,null,null,2388]
[null,null,null,null,2389]
[null,null,null,null,2390]
[null,null,null,null,2391]
[null,null,null,null,2392]
[null,null,null,null,2393]
[null,null,null,null,2394]
[null,null,null,null,2395]
[null,null,null,null,2396]
[null,null,null,null,2397]
[null,null,null,null,2398]
[null,null,null,null,2399]
[null,null,null,null,2400]
[null,null,null,null,2401]
[null,null,null,null,2402]
[null,null,null,null,2403]
[null,null,null,null,2404]
[null,null,null,null,2405]
[null,null,null,null,2406]
[null,null,null,null,2407]
[null,null,null,null,2408]
[null,null,null,null,2409]
[null,null,null,null,2410]
[null,null,null,null,2411]
[null,null,null,null,2412]
[null,null,null,null,2413]
[null,null,null,null,2414]
[null,null,null,null,2415]
[null,null,null,null,2416]
[null,null,null,null,2417]
[null,null,null,null,2418]
[null,null,null,null,2419]
[null,null,null,null,2420]
[null,null,null,null,2421]
[null,null,null,null,2422]
[null,null,null,null,2423]
[null,null,null,null,2424]
[null,null,null,null,2425]
[null,null,null,null,2426]
[null,null,null,null,2427]
[null,null,null,null,2428]
[null,null,null,null,2429]
[null,null,null,null,2430]
[null,null,null,null,2431]
[null,null,null,null,2432]
[null,null,null,null,2433]
[null,null,null,null,2434]
[null,null,null,null,2435]
[null,null,null,null,2436]
[null,null,null,null,2437]
[null,null,null,null,2438]
[null,null,null,null,2439]
[null,null,null,null,2440]
[null,null,null,null,2441]
[null,null,null,null,2442]
[null,null,null,null,2443]
[null,null,null,null,2444]
[null,null,null,null,2445]
[null,null,null,null,2446]
[null,null,null,null,2447]
[null,null,null,null,2448]
[null,null,null,null,2449]
[null,null,null,null,2450]
[null,null,null,null,2451]
[null,null,null,null,2452]
[null,null,null,null,2453]
[null,null,null,null,2454]
[null,null,null,null,2455]
[null,null,null,null,2456]
[null,null,null,null,2457]
[null,null,null,null,2458]
[null,null,null,null,2459]
[null,null,null,null,2460]
[null,null,null,null,2461]
[null,null,null,null,2462]
[null,null,null,null,2463]
[null,null,null,null,2464]
[null,null,null,null,2465]
[null,null,null,null,2466]
[null,null,null,null,2467]
[null,null,null,null,2468]
[null,null,null,null,2469]
[null,null,null,null,2470]
[null,null,null,null,2471]
[null,null,null,null,2472]
[null,null,null,null,2473]
[null,null,null,null,2474]
[null,null,null,null,2475]
[null,null,null,null,2476]
[null,null,null,null,2477]
[null,null,null,null,2478]
[null,null,null,null,2479]
[null,null,null,null,2480]
[null,null,null,null,2481]
[null,null,null,null,2482]
[null,null,null,null,2483]
[null,null,null,null,2484]
[null,null,null,null,2485]
[null,null,null,null,2486]
[null,null,null,null,2487]
[null,null,null,null,2488]
[null,null,null,null,2489]
[null,null,null,null,2490]
[null,null,null,null,2491]
[null,null,null,null,2492]
[null,null,null,null,2493]
[null,null,null,null,2494]
[null,null,null,null,2495]
[null,null,null,null,2496]
[null,null,null,null,2497]
[null,null,null,null,2498]
[null,null,null,null,2499]
[null,null,null,null,2500]
[null,null,null,null,2501]
[null,null,null,null,2502]
[null,null,null,null,2503]
[null,null,null,null,2504]
[null,null,null,null,2505]
[null,null,null,null,2506]
[null,null,null,null,2507]
[null,null,null,null,2508]
[null,null,null,null,2509]
[null,null,null,null,2510]
[null,null,null,null,2511]
[null,null,null,null,2512]
[null,null,null,null,2513]
[null,null,null,null,2514]
[null,null,null,null,2515]
[null,null,null,null,2516]
[null,null,null,null,2517]
[null,null,null,null,2518]
[null,null,null,null,2519]
[null,null,null,null,2520]
[null,null,null,null,2521]
[null,null,null,null,2522]
[null,null,null,null,2523]
[null,null,null,null,2524]
[null,null,null,null,2525]
[null,null,null,null,2526]
[null,null,null,null,2527]
[null,null,null,null,2528]
[null,null,null,null,2529]
[null,null,null,null,2530]
[null,null,null,null,2531]
[null,null,null,null,2532]
[null,null,null,null,2533]
[null,null,null,null,2534]
[null,null,null,null,2535]
[null,null,null,null,2536]
[null,null,null,null,2537]
[null,null,null,null,2538]
[null,null,null,null,2539]
[null,null,null,null,2540]
[null,null,null,null,2541]
[null,null,null,null,2542]
[null,null,null,null,2543]
[null,null,null,null,2544]
[null,null,null,null,2545]
[null,null,null,null,2546]
[null,null,null,null,2547]
[null,null,null,null,2548]
[null,null,null,null,2549]
[null,null,null,null,2550]
[null,null,null,null,2551]
[null,null,null,null,2552]
[null,null,null,null,2553]
[null,null,null,null,2554]
[null,null,null,null,2555]
[null,null,null,null,2556]
[null,null,null,null,2557]
[null,null,null,null,2558]
[null,null,null,null,2559]
[null,null,null,null,2560]
[null,null,null,null,2561]
[null,null,null,null,2562]
[null,null,null,null,2563]
[null,null,null,null,2564]
[null,null,null,null,2565]
[null,null,null,null,2566]
[null,null,null,null,2567]
[null,null,null,null,2568]
[null,null,null,null,2569]
[null,null,null,null,2570]
[null,null,null,null,2571]
[null,null,null,null,2572]
[null,null,null,null,2573]
[null,null,null,null,2574]
[null,null,null,null,2575]
[null,null,null,null,2576]
[null,null,null,null,2577]
[null,null,null,null,2578]
[null,null,null,null,2579]
[null,null,null,null,2580]
[null,null,null,null,2581]
[null,null,null,null,2582]
[null,null,null,null,2583]
[null,null,null,null,2584]
[null,null,null,null,2585]
[null,null,null,null,2586]
[null,null,null,null,2587]
[null,null,null,null,2588]
[null,null,null,null,2589]
[null,null,null,null,2590]
[null,null,null,null,2591]
[null,null,null,null,2592]
[null,null,null,null,2593]
[null,null,null,null,2594]
[null,null,null,null,2595]
[null,null,null,null,2596]
[null,null,null,null,2597]
[null,null,null,null,2598]
[null,null,null,null,2599]
[null,null,null,null,2600]
[null,null,null,null,2601]
[null,null,null,null,2602]
[null,null,null,null,2603]
[null,null,null,null,2604]
[null,null,null,null,2605]
[null,null,null,null,2606]
[null,null,null,null,2607]
[null,null,null,null,2608]
[null,null,null,null,2609]
[null,null,null,null,2610]
[null,null,null,null,2611]
[null,null,null,null,2612]
[null,null,null,null,2613]
[null,null,null,null,2614]
[null,null,null,null,2615]
[null,null,null,null,2616]
[null,null,null,null,2617]
[null,null,null,null,2618]
[null,null,null,null,2619]
[null,null,null,null,2620]
[null,null,null,null,2621]
[null,null,null,null,2622]
[null,null,null,null,2623]
[null,null,null,null,2624]
[null,null,null,null,2625]
[null,null,null,null,2626]
[null,null,null,null,2627]
[null,null,null,null,2628]
[null,null,null,null,2629]
[null,null,null,null,2630]
[null,null,null,null,2631]
[null,null,null,null,2632]
[null,null,null,null,2633]
[null,null,null,null,2634]
[null,null,null,null,2635]
[null,null,null,null,2636]
[null,null,null,null,2637]
[null,null,null,null,2638]
[null,null,null,null,2639]
[null,null,null,null,2640]
[null,null,null,null,2641]
[null,null,null,null,2642]
[null,null,null,null,2643]
[null,null,null,null,2644]
[null,null,null,null,2645]
[null,null,null,null,2646]
[null,null,null,null,2647]
[null,null,null,null,2648]
[null,null,null,null,2649]
[null,null,null,null,2650]
[null,null,null,null,2651]
[null,null,null,null,2652]
[null,null,null,null,2653]
[null,null,null,null,2654]
[null,null,null,null,2655]
[null,null,null,null,2656]
[null,null,null,null,2657]
[null,null,null,null,2658]
[null,null,null,null,2659]
[null,null,null,null,2660]
[null,null,null,null,2661]
[null,null,null,null,2662]
[null,null,null,null,2663]
[null,null,null,null,2664]
[null,null,null,null,2665]
[null,null,null,null,2666]
[null,null,null,null,2667]
[null,null,null,null,2668]
[null,null,null,null,2669]
[null,null,null,null,2670]
[null,null,null,null,2671]
[null,null,null,null,2672]
[null,null,null,null,2673]
[null,null,null,null,2674]
[null,null,null,null,2675]
[null,null,null,null,2676]
[null,null,null,null,2677]
[null,null,null,null,2678]
[null,null,null,null,2679]
[null,null,null,null,2680]
[null,null,null,null,2681]
[null,null,null,null,2682]
[null,null,null,null,2683]
[null,null,null,null,2684]
[null,null,null,null,2685]
[null,null,null,null,2686]
[null,null,null,null,2687]
[null,null,null,null,2688]
[null,null,null,null,2689]
[null,null,null,null,2690]
[null,null,null,null,2691]
[null,null,null,null,2692]
[null,null,null,null,2693]
[null,null,null,null,2694]
[null,null,null,null,2695]
[null,null,null,null,2696]
[null,null,null,null,2697]
[null,null,null,null,2698]
[null,null,null,null,2699]
[null,null,null,null,2700]
[null,null,null,null,2701]
[null,null,null,null,2702]
[null,null,null,null,2703]
[null,null,null,null,2704]
[null,null,null,null,2705]
[null,null,null,null,2706]
[null,null,null,null,2707]
[null,null,null,null,2708]
[null,null,null,null,2709]
[null,null,null,null,2710]
[null,null,null,null,2711]
[null,null,null,null,2712]
[null,null,null,null,2713]
[null,null,null,null,2714]
[null,null,null,null,2715]
[null,null,null,null,2716]
[null,null,null,null,2717]
[null,null,null,null,2718]
[null,null,null,null,2719]
[null,null,null,null,2720]
[null,null,null,null,2721]
[null,null,null,null,2722]
[null,null,null,null,2723]
[null,null,null,null,2724]
[null,null,null,null,2725]
[null,null,null,null,2726]
[null,null,null,null,2727]
[null,null,null,null,2728]
[null,null,null,null,2729]
[null,null,null,null,2730]
[null,null,null,null,2731]
[null,null,null,null,2732]
[null,null,null,null,2733]
[null,null,null,null,2734]
[null,null,null,null,2735]
[null,null,null,null,2736]
[null,null,null,null,2737]
[null,null,null,null,2738]
[null,null,null,null,2739]
[null,null,null,null,2740]
[null,null,null,null,2741]
[null,null,null,null,2742]
[null,null,null,null,2743]
[null,null,null,null,2744]
[null,null,null,null,2745]
[null,null,null,null,2746]
[null,null,null,null,2747]
[null,null,null,null,2748]
[null,null,null,null,2749]
[null,null,null,null,2750]
[null,null,null,null,2751]
[null,null,null,null,2752]
[null,null,null,null,2753]
[null,null,null,null,2754]
[null,null,null,null,2755]
[null,null,null,null,2756]
[null,null,null,null,2757]
[null,null,null,null,2758]
[null,null,null,null,2759]
[null,null,null,null,2760]
[null,null,null,null,2761]
[null,null,null,null,2762]
[null,null,null,null,2763]
[null,null,null,null,2764]
[null,null,null,null,2765]
[null,null,null,null,2766]
[null,null,null,null,2767]
[null,null,null,null,2768]
[null,null,null,null,2769]
[null,null,null,null,2770]
[null,null,null,null,2771]
[null,null,null,null,2772]
[null,null,null,null,2773]
[null,null,null,null,2774]
[null,null,null,null,2775]
[null,null,null,null,2776]
[null,null,null,null,2777]
[null,null,null,null,2778]
[null,null,null,null,2779]
[null,null,null,null,2780]
[null,null,null,null,2781]
[null,null,null,null,2782]
[null,null,null,null,2783]
[null,null,null,null,2784]
[null,null,null,null,2785]
[null,null,null,null,2786]
[null,null,null,null,2787]
[null,null,null,null,2788]
[null,null,null,null,2789]
[null,null,null,null,2790]
[null,null,null,null,2791]
[null,null,null,null,2792]
[null,null,null,null,2793]
[null,null,null,null,2794]
[null,null,null,null,2795]
[null,null,null,null,2796]
[null,null,null,null,2797]
[null,null,null,null,2798]
[null,null,null,null,2799]
[null,null,null,null,2800]
[null,null,null,null,2801]
[null,null,null,null,2802]
[null,null,null,null,2803]
[null,null,null,null,2804]
[null,null,null,null,2805]
[null,null,null,null,2806]
[null,null,null,null,2807]
[null,null,null,null,2808]
[null,null,null,null,2809]
[null,null,null,null,2810]
[null,null,null,null,2811]
[null,null,null,null,2812]
[null,null,null,null,2813]
[null,null,null,null,2814]
[null,null,null,null,2815]
[null,null,null,null,2816]
[null,null,null,null,2817]
[null,null,null,null,2818]
[null,null,null,null,2819]
[null,null,null,null,2820]
[null,null,null,null,2821]
[null,null,null,null,2822]
[null,null,null,null,2823]
[null,null,null,null,2824]
[null,null,null,null,2825]
[null,null,null,null,2826]
[null,null,null,null,2827]
[null,null,null,null,2828]
[null,null,null,null,2829]
[null,null,null,null,2830]
[null,null,null,null,2831]
[null,null,null,null,2832]
[null,null,null,null,2833]
[null,null,null,null,2834]
[null,null,null,null,2835]
[null,null,null,null,2836]
[null,null,null,null,2837]
[null,null,null,null,2838]
[null,null,null,null,2839]
[null,null,null,null,2840]
[null,null,null,null,2841]
[null,null,null,null,2842]
[null,null,null,null,2843]
[null,null,null,null,2844]
[null,null,null,null,2845]
[null,null,null,null,2846]
[null,null,null,null,2847]
[null,null,null,null,2848]
[null,null,null,null,2849]
[null,null,null,null,2850]
[null,null,null,null,2851]
[null,null,null,null,2852]
[null,null,null,null,2853]
[null,null,null,null,2854]
[null,null,null,null,2855]
[null,null,null,null,2856]
[null,null,null,null,2857]
[null,null,null,null,2858]
[null,null,null,null,2859]
[null,null,null,null,2860]
[null,null,null,null,2861]
[null,null,null,null,2862]
[null,null,null,null,2863]
[null,null,null,null,2864]
[null,null,null,null,2865]
[null,null,null,null,2866]
[null,null,null,null,2867]
[null,null,null,null,2868]
[null,null,null,null,2869]
[null,null,null,null,2870]
[null,null,null,null,2871]
[null,null,null,null,2872]
[null,null,null,null,2873]
[null,null,null,null,2874]
[null,null,null,null,2875]
[null,null,null,null,2876]
[null,null,null,null,2877]
[null,null,null,null,2878]
[null,null,null,null,2879]
[null,null,null,null,2880]
[null,null,null,null,2881]
[null,null,null,null,2882]
[null,null,null,null,2883]
[null,null,null,null,2884]
[null,null,null,null,2885]
[null,null,null,null,2886]
[null,null,null,null,2887]
[null,null,null,null,2888]
[null,null,null,null,2889]
[null,null,null,null,2890]
[null,null,null,null,2891]
[null,null,null,null,2892]
[null,null,null,null,2893]
[null,null,null,null,2894]
[null,null,null,null,2895]
[null,null,null,null,2896]
[null,null,null,null,2897]
[null,null,null,null,2898]
[null,null,null,null,2899]
[null,null,null,null,2900]
[null,null,null,null,2901]
[null,null,null,null,2902]
[null,null,null,null,2903]
[null,null,null,null,2904]
[null,null,null,null,2905]
[null,null,null,null,2906]
[null,null,null,null,2907]
[null,null,null,null,2908]
[null,null,null,null,2909]
[null,null,null,null,2910]
[null,null,null,null,2911]
[null,null,null,null,2912]
[null,null,null,null,2913]
[null,null,null,null,2914]
[null,null,null,null,2915]
[null,null,null,null,2916]
[null,null,null,null,2917]
[null,null,null,null,2918]
[null,null,null,null,2919]
[null,null,null,null,2920]
[null,null,null,null,2921]
[null,null,null,null,2922]
[null,null,null,null,2923]
[null,null,null,null,2924]
[null,null,null,null,2925]
[null,null,null,null,2926]
[null,null,null,null,2927]
[null,null,null,null,2928]
[null,null,null,null,2929]
[null,null,null,null,2930]
[null,null,null,null,2931]
[null,null,null,null,2932]
[null,null,null,null,2933]
[null,null,null,null,2934]
[null,null,null,null,2935]
[null,null,null,null,2936]
[null,null,null,null,2937]
[null,null,null,null,2938]
[null,null,null,null,2939]
[null,null,null,null,2940]
[null,null,null,null,2941]
[null,null,null,null,2942]
[null,null,null,null,2943]
[null,null,null,null,2944]
[null,null,null,null,2945]
[null,null,null,null,2946]
[null,null,null,null,2947]
[null,null,null,null,2948]
[null,null,null,null,2949]
[null,null,null,null,2950]
[null,null,null,null,2951]
[null,null,null,null,2952]
[null,null,null,null,2953]
[null,null,null,null,2954]
[null,null,null,null,2955]
[null,null,null,null,2956]
[null,null,null,null,2957]
[null,null,null,null,2958]
[null,null,null,null,2959]
[null,null,null,null,2960]
[null,null,null,null,2961]
[null,null,null,null,2962]
[null,null,null,null,2963]
[null,null,null,null,2964]
[null,null,null,null,2965]
[null,null,null,null,2966]
[null,null,null,null,2967]
[null,null,null,null,2968]
[null,null,null,null,2969]
[null,null,null,null,2970]
[null,null,null,null,2971]
[null,null,null,null,2972]
[null,null,null,null,2973]
[null,null,null,null,2974]
[null,null,null,null,2975]
[null,null,null,null,2976]
[null,null,null,null,2977]
[null,null,null,null,2978]
[null,null,null,null,2979]
[null,null,null,null,2980]
[null,null,null,null,2981]
[null,null,null,null,2982]
[null,null,null,null,2983]
[null,null,null,null,2984]
[null,null,null,null,2985]
[null,null,null,null,2986]
[null,null,null,null,2987]
[null,null,null,null,2988]
[null,null,null,null,2989]
[null,null,null,null,2990]
[null,null,null,null,2991]
[null,null,null,null,2992]
[null,null,null,null,2993]
[null,null,null,null,2994]
[null,null,null,null,2995]
[null,null,null,null,2996]
[null,null,null,null,2997]
[null,null,null,null,2998]
[null,null,null,null,2999]
[null,null,null,null,3000]
[null,null,null,null,3001]
[null,null,null,null,3002]
[null,null,null,null,3003]
[null,null,null,null,3004]
[null,null,null,null,3005]
[null,null,null,null,3006]
[null,null,null,null,3007]
[null,null,null,null,3008]
[null,null,null,null,3009]
[null,null,null,null,3010]
[null,null,null,null,3011]
[null,null,null,null,3012]
[null,null,null,null,3013]
[null,null,null,null,3014]
[null,null,null,null,3015]
[null,null,null,null,3016]
[null,null,null,null,3017]
[null,null,null,null,3018]
[null,null,null,null,3019]
[null,null,null,null,3020]
[null,null,null,null,3021]
[null,null,null,null,3022]
[null,null,null,null,3023]
[null,null,null,null,3024]
[null,null,null,null,3025]
[null,null,null,null,3026]
[null,null,null,null,3027]
[null,null,null,null,3028]
[null,null,null,null,3029]
[null,null,null,null,3030]
[null,null,null,null,3031]
[null,null,null,null,3032]
[null,null,null,null,3033]
[null,null,null,null,3034]
[null,null,null,null,3035]
[null,null,null,null,3036]
[null,null,null,null,3037]
[null,null,null,null,3038]
[null,null,null,null,3039]
[null,null,null,null,3040]
[null,null,null,null,3041]
[null,null,null,null,3042]
[null,null,null,null,3043]
[null,null,null,null,3044]
[null,null,null,null,3045]
[null,null,null,null,3046]
[null,null,null,null,3047]
[null,null,null,null,3048]
[null,null,null,null,3049]
[null,null,null,null,3050]
[null,null,null,null,3051]
[null,null,null,null,3052]
[null,null,null,null,3053]
[null,null,null,null,3054]
[null,null,null,null,3055]
[null,null,null,null,3056]
[null,null,null,null,3057]
[null,null,null,null,3058]
[null,null,null,null,3059]
[null,null,null,null,3060]
[null,null,null,null,3061]
[null,null,null,null,3062]
[null,null,null,null,3063]
[null,null,null,null,3064]
[null,null,null,null,3065]
[null,null,null,null,3066]
[null,null,null,null,3067]
[null,null,null,null,3068]
[null,null,null,null,3069]
[null,null,null,null,3070]
[null,null,null,null,3071]
[null,null,null,null,3072]
[null,null,null,null,3073]
[null,null,null,null,3074]
[null,null,null,null,3075]
[null,null,null,null,3076]
[null,null,null,null,3077]
[null,null,null,null,3078]
[null,null,null,null,3079]
[null,null,null,null,3080]
[null,null,null,null,3081]
[null,null,null,null,3082]
[null,null,null,null,3083]
[null,null,null,null,3084]
[null,null,null,null,3085]
[null,null,null,null,3086]
[null,null,null,null,3087]
[null,null,null,null,3088]
[null,null,null,null,3089]
[null,null,null,null,3090]
[null,null,null,null,3091]
[null,null,null,null,3092]
[null,null,null,null,3093]
[null,null,null,null,3094]
[null,null,null,null,3095]
[null,null,null,null,3096]
[null,null,null,null,3097]
[null,null,null,null,3098]
[null,null,null,null,3099]
[null,null,null,null,3100]
[null,null,null,null,3101]
[null,null,null,null,3102]
[null,null,null,null,3103]
[null,null,null,null,3104]
[null,null,null,null,3105]
[null,null,null,null,3106]
[null,null,null,null,3107]
[null,null,null,null,3108]
[null,null,null,null,3109]
[null,null,null,null,3110]
[null,null,null,null,3111]
[null,null,null,null,3112]
[null,null,null,null,3113]
[null,null,null,null,3114]
[null,null,null,null,3115]
[null,null,null,null,3116]
[null,null,null,null,3117]
[null,null,null,null,3118]
[null,null,null,null,3119]
[null,null,null,null,3120]
[null,null,null,null,3121]
[null,null,null,null,3122]
[null,null,null,null,3123]
[null,null,null,null,3124]
[null,null,null,null,3125]
[null,null,null,null,3126]
[null,null,null,null,3127]
[null,null,null,null,3128]
[null,null,null,null,3129]
[null,null,null,null,3130]
[null,null,null,null,3131]
[null,null,null,null,3132]
[null,null,null,null,3133]
[null,null,null,null,3134]
[null,null,null,null,3135]
[null,null,null,null,3136]
[null,null,null,null,3137]
[null,null,null,null,3138]
[null,null,null,null,3139]
[null,null,null,null,3140]
[null,null,null,null,3141]
[null,null,null,null,3142]
[null,null,null,null,3143]
[null,null,null,null,3144]
[null,null,null,null,3145]
[null,null,null,null,3146]
[null,null,null,null,3147]
[null,null,null,null,3148]
[null,null,null,null,3149]
[null,null,null,null,3150]
[null,null,null,null,3151]
[null,null,null,null,3152]
[null,null,null,null,3153]
[null,null,null,null,3154]
[null,null,null,null,3155]
[null,null,null,null,3156]
[null,null,null,null,3157]
[null,null,null,null,3158]
[null,null,null,null,3159]
[null,null,null,null,3160]
[null,null,null,null,3161]
[null,null,null,null,3162]
[null,null,null,null,3163]
[null,null,null,null,3164]
[null,null,null,null,3165]
[null,null,null,null,3166]
[null,null,null,null,3167]
[null,null,null,null,3168]
[null,null,null,null,3169]
[null,null,null,null,3170]
[null,null,null,null,3171]
[null,null,null,null,3172]
[null,null,null,null,3173]
[null,null,null,null,3174]
[null,null,null,null,3175]
[null,null,null,null,3176]
[null,null,null,null,3177]
[null,null,null,null,3178]
[null,null,null,null,3179]
[null,null,null,null,3180]
[null,null,null,null,3181]
[null,null,null,null,3182]
[null,null,null,null,3183]
[null,null,null,null,3184]
[null,null,null,null,3185]
[null,null,null,null,3186]
[null,null,null,null,3187]
[null,null,null,null,3188]
[null,null,null,null,3189]
[null,null,null,null,3190]
[null,null,null,null,3191]
[null,null,null,null,3192]
[null,null,null,null,3193]
[null,null,null,null,3194]
[null,null,null,null,3195]
[null,null,null,null,3196]
[null,null,null,null,3197]
[null,null,null,null,3198]
[null,null,null,null,3199]
[null,null,null,null,3200]
[null,null,null,null,3201]
[null,null,null,null,3202]
[null,null,null,null,3203]
[null,null,null,null,3204]
[null,null,null,null,3205]
[null,null,null,null,3206]
[null,null,null,null,3207]
[null,null,null,null,3208]
[null,null,null,null,3209]
[null,null,null,null,3210]
[null,null,null,null,3211]
[null,null,null,null,3212]
[null,null,null,null,3213]
[null,null,null,null,3214]
[null,null,null,null,3215]
[null,null,null,null,3216]
[null,null,null,null,3217]
[null,null,null,null,3218]
[null,null,null,null,3219]
[null,null,null,null,3220]
[null,null,null,null,3221]
[null,null,null,null,3222]
[null,null,null,null,3223]
[null,null,null,null,3224]
[null,null,null,null,3225]
[null,null,null,null,3226]
[null,null,null,null,3227]
[null,null,null,null,3228]
[null,null,null,null,3229]
[null,null,null,null,3230]
[null,null,null,null,3231]
[null,null,null,null,3232]
[null,null,null,null,3233]
[null,null,null,null,3234]
[null,null,null,null,3235]
[null,null,null,null,3236]
[null,null,null,null,3237]
[null,null,null,null,3238]
[null,null,null,null,3239]
[null,null,null,null,3240]
[null,null,null,null,3241]
[null,null,null,null,3242]
[null,null,null,null,3243]
[null,null,null,null,3244]
[null,null,null,null,3245]
[null,null,null,null,3246]
[null,null,null,null,3247]
[null,null,null,null,3248]
[null,null,null,null,3249]
[null,null,null,null,3250]
[null,null,null,null,3251]
[null,null,null,null,3252]
[null,null,null,null,3253]
[null,null,null,null,3254]
[null,null,null,null,3255]
[null,null,null,null,3256]
[null,null,null,null,3257]
[null,null,null,null,3258]
[null,null,null,null,3259]
[null,null,null,null,3260]
[null,null,null,null,3261]
[null,null,null,null,3262]
[null,null,null,null,3263]
[null,null,null,null,3264]
[null,null,null,null,3265]
[null,null,null,null,3266]
[null,null,null,null,3267]
[null,null,null,null,3268]
[null,null,null,null,3269]
[null,null,null,null,3270]
[null,null,null,null,3271]
[null,null,null,null,3272]
[null,null,null,null,3273]
[null,null,null,null,3274]
[null,null,null,null,3275]
[null,null,null,null,3276]
[null,null,null,null,3277]
[null,null,null,null,3278]
[null,null,null,null,3279]
[null,null,null,null,3280]
[null,null,null,null,3281]
[null,null,null,null,3282]
[null,null,null,null,3283]
[null,null,null,null,3284]
[null,null,null,null,3285]
[null,null,null,null,3286]
[null,null,null,null,3287]
[null,null,null,null,3288]
[null,null,null,null,3289]
[null,null,null,null,3290]
[null,null,null,null,3291]
[null,null,null,null,3292]
[null,null,null,null,3293]
[null,null,null,null,3294]
[null,null,null,null,3295]
[null,null,null,null,3296]
[null,null,null,null,3297]
[null,null,null,null,3298]
[null,null,null,null,3299]
[null,null,null,null,3300]
[null,null,null,null,3301]
[null,null,null,null,3302]
[null,null,null,null,3303]
[null,null,null,null,3304]
[null,null,null,null,3305]
[null,null,null,null,3306]
[null,null,null,null,3307]
[null,null,null,null,3308]
[null,null,null,null,3309]
[null,null,null,null,3310]
[null,null,null,null,3311]
[null,null,null,null,3312]
[null,null,null,null,3313]
[null,null,null,null,3314]
[null,null,null,null,3315]
[null,null,null,null,3316]
[null,null,null,null,3317]
[null,null,null,null,3318]
[null,null,null,null,3319]
[null,null,null,null,3320]
[null,null,null,null,3321]
[null,null,null,null,3322]
[null,null,null,null,3323]
[null,null,null,null,3324]
[null,null,null,null,3325]
[null,null,null,null,3326]
[null,null,null,null,3327]
[null,null,null,null,3328]
[null,null,null,null,3329]
[null,null,null,null,3330]
[null,null,null,null,3331]
[null,null,null,null,3332]
[null,null,null,null,3333]
[null,null,null,null,3334]
[null,null,null,null,3335]
[null,null,null,null,3336]
[null,null,null,null,3337]
[null,null,null,null,3338]
[null,null,null,null,3339]
[null,null,null,null,3340]
[null,null,null,null,3341]
[null,null,null,null,3342]
[null,null,null,null,3343]
[null,null,null,null,3344]
[null,null,null,null,3345]
[null,null,null,null,3346]
[null,null,null,null,3347]
[null,null,null,null,3348]
[null,null,null,null,3349]
[null,null,null,null,3350]
[null,null,null,null,3351]
[null,null,null,null,3352]
[null,null,null,null,3353]
[null,null,null,null,3354]
[null,null,null,null,3355]
[null,null,null,null,3356]
[null,null,null,null,3357]
[null,null,null,null,3358]
[null,null,null,null,3359]
[null,null,null,null,3360]
[null,null,null,null,3361]
[null,null,null,null,3362]
[null,null,null,null,3363]
[null,null,null,null,3364]
[null,null,null,null,3365]
[null,null,null,null,3366]
[null,null,null,null,3367]
[null,null,null,null,3368]
[null,null,null,null,3369]
[null,null,null,null,3370]
[null,null,null,null,3371]
[null,null,null,null,3372]
[null,null,null,null,3373]
[null,null,null,null,3374]
[null,null,null,null,3375]
[null,null,null,null,3376]
[null,null,null,null,3377]
[null,null,null,null,3378]
[null,null,null,null,3379]
[null,null,null,null,3380]
[null,null,null,null,3381]
[null,null,null,null,3382]
[null,null,null,null,3383]
[null,null,null,null,3384]
[null,null,null,null,3385]
[null,null,null,null,3386]
[null,null,null,null,3387]
[null,null,null,null,3388]
[null,null,null,null,3389]
[null,null,null,null,3390]
[null,null,null,null,3391]
[null,null,null,null,3392]
[null,null,null,null,3393]
[null,null,null,null,3394]
[null,null,null,null,3395]
[null,null,null,null,3396]
[null,null,null,null,3397]
[null,null,null,null,3398]
[null,null,null,null,3399]
[null,null,null,null,3400]
[null,null,null,null,3401]
[null,null,null,null,3402]
[null,null,null,null,3403]
[null,null,null,null,3404]
[null,null,null,null,3405]
[null,null,null,null,3406]
[null,null,null,null,3407]
[null,null,null,null,3408]
[null,null,null,null,3409]
[null,null,null,null,3410]
[null,null,null,null,3411]
[null,null,null,null,3412]
[null,null,null,null,3413]
[null,null,null,null,3414]
[null,null,null,null,3415]
[null,null,null,null,3416]
[null,null,null,null,3417]
[null,null,null,null,3418]
[null,null,null,null,3419]
[null,null,null,null,3420]
[null,null,null,null,3421]
[null,null,null,null,3422]
[null,null,null,null,3423]
[null,null,null,null,3424]
[null,null,null,null,3425]
[null,null,null,null,3426]
[null,null,null,null,3427]
[null,null,null,null,3428]
[null,null,null,null,3429]
[null,null,null,null,3430]
[null,null,null,null,3431]
[null,null,null,null,3432]
[null,null,null,null,3433]
[null,null,null,null,3434]
[null,null,null,null,3435]
[null,null,null,null,3436]
[null,null,null,null,3437]
[null,null,null,null,3438]
[null,null,null,null,3439]
[null,null,null,null,3440]
[null,null,null,null,3441]
[null,null,null,null,3442]
[null,null,null,null,3443]
[null,null,null,null,3444]
[null,null,null,null,3445]
[null,null,null,null,3446]
[null,null,null,null,3447]
[null,null,null,null,3448]
[null,null,null,null,3449]
[null,null,null,null,3450]
[null,null,null,null,3451]
[null,null,null,null,3452]
[null,null,null,null,3453]
[null,null,null,null,3454]
[null,null,null,null,3455]
[null,null,null,null,3456]
[null,null,null,null,3457]
[null,null,null,null,3458]
[null,null,null,null,3459]
[null,null,null,null,3460]
[null,null,null,null,3461]
[null,null,null,null,3462]
[null,null,null,null,3463]
[null,null,null,null,3464]
[null,null,null,null,3465]
[null,null,null,null,3466]
[null,null,null,null,3467]
[null,null,null,null,3468]
[null,null,null,null,3469]
[null,null,null,null,3470]
[null,null,null,null,3471]
[null,null,null,null,3472]
[null,null,null,null,3473]
[null,null,null,null,3474]
[null,null,null,null,3475]
[null,null,null,null,3476]
[null,null,null,null,3477]
[null,null,null,null,3478]
[null,null,null,null,3479]
[null,null,null,null,3480]
[null,null,null,null,3481]
[null,null,null,null,3482]
[null,null,null,null,3483]
[null,null,null,null,3484]
[null,null,null,null,3485]
[null,null,null,null,3486]
[null,null,null,null,3487]
[null,null,null,null,3488]
[null,null,null,null,3489]
[null,null,null,null,3490]
[null,null,null,null,3491]
[null,null,null,null,3492]
[null,null,null,null,3493]
[null,null,null,null,3494]
[null,null,null,null,3495]
[null,null,null,null,3496]
[null,null,null,null,3497]
[null,null,null,null,3498]
[null,null,null,null,3499]
[null,null,null,null,3500]
[null,null,null,null,3501]
[null,null,null,null,3502]
[null,null,null,null,3503]
[null,null,null,null,3504]
[null,null,null,null,3505]
[null,null,null,null,3506]
[null,null,null,null,3507]
[null,null,null,null,3508]
[null,null,null,null,3509]
[null,null,null,null,3510]
[null,null,null,null,3511]
[null,null,null,null,3512]
[null,null,null,null,3513]
[null,null,null,null,3514]
[null,null,null,null,3515]
[null,null,null,null,3516]
[null,null,null,null,3517]
[null,null,null,null,3518]
[null,null,null,null,3519]
[null,null,null,null,3520]
[null,null,null,null,3521]
[null,null,null,null,3522]
[null,null,null,null,3523]
[null,null,null,null,3524]
[null,null,null,null,3525]
[null,null,null,null,3526]
[null,null,null,null,3527]
[null,null,null,null,3528]
[null,null,null,null,3529]
[null,null,null,null,3530]
[null,null,null,null,3531]
[null,null,null,null,3532]
[null,null,null,null,3533]
[null,null,null,null,3534]
[null,null,null,null,3535]
[null,null,null,null,3536]
[null,null,null,null,3537]
[null,null,null,null,3538]
[null,null,null,null,3539]
[null,null,null,null,3540]
[null,null,null,null,3541]
[null,null,null,null,3542]
[null,null,null,null,3543]
[null,null,null,null,3544]
[null,null,null,null,3545]
[null,null,null,null,3546]
[null,null,null,null,3547]
[null,null,null,null,3548]
[null,null,null,null,3549]
[null,null,null,null,3550]
[null,null,null,null,3551]
[null,null,null,null,3552]
[null,null,null,null,3553]
[null,null,null,null,3554]
[null,null,null,null,3555]
[null,null,null,null,3556]
[null,null,null,null,3557]
[null,null,null,null,3558]
[null,null,null,null,3559]
[null,null,null,null,3560]
[null,null,null,null,3561]
[null,null,null,null,3562]
[null,null,null,null,3563]
[null,null,null,null,3564]
[null,null,null,null,3565]
[null,null,null,null,3566]
[null,null,null,null,3567]
[null,null,null,null,3568]
[null,null,null,null,3569]
[null,null,null,null,3570]
[null,null,null,null,3571]
[null,null,null,null,3572]
[null,null,null,null,3573]
[null,null,null,null,3574]
[null,null,null,null,3575]
[null,null,null,null,3576]
[null,null,null,null,3577]
[null,null,null,null,3578]
[null,null,null,null,3579]
[null,null,null,null,3580]
[null,null,null,null,3581]
[null,null,null,null,3582]
[null,null,null,null,3583]
[null,null,null,null,3584]
[null,null,null,null,3585]
[null,null,null,null,3586]
[null,null,null,null,3587]
[null,null,null,null,3588]
[null,null,null,null,3589]
[null,null,null,null,3590]
[null,null,null,null,3591]
[null,null,null,null,3592]
[null,null,null,null,3593]
[null,null,null,null,3594]
[null,null,null,null,3595]
[null,null,null,null,3596]
[null,null,null,null,3597]
[null,null,null,null,3598]
[null,null,null,null,3599]
[null,null,null,null,3600]
[null,null,null,null,3601]
[null,null,null,null,3602]
[null,null,null,null,3603]
[null,null,null,null,3604]
[null,null,null,null,3605]
[null,null,null,null,3606]
[null,null,null,null,3607]
[null,null,null,null,3608]
[null,null,null,null,3609]
[null,null,null,null,3610]
[null,null,null,null,3611]
[null,null,null,null,3612]
[null,null,null,null,3613]
[null,null,null,null,3614]
[null,null,null,null,3615]
[null,null,null,null,3616]
[null,null,null,null,3617]
[null,null,null,null,3618]
[null,null,null,null,3619]
[null,null,null,null,3620]
[null,null,null,null,3621]
[null,null,null,null,3622]
[null,null,null,null,3623]
[null,null,null,null,3624]
[null,null,null,null,3625]
[null,null,null,null,3626]
[null,null,null,null,3627]
[null,null,null,null,3628]
[null,null,null,null,3629]
[null,null,null,null,3630]
[null,null,null,null,3631]
[null,null,null,null,3632]
[null,null,null,null,3633]
[null,null,null,null,3634]
[null,null,null,null,3635]
[null,null,null,null,3636]
[null,null,null,null,3637]
[null,null,null,null,3638]
[null,null,null,null,3639]
[null,null,null,null,3640]
[null,null,null,null,3641]
[null,null,null,null,3642]
[null,null,null,null,3643]
[null,null,null,null,3644]
[null,null,null,null,3645]
[null,null,null,null,3646]
[null,null,null,null,3647]
[null,null,null,null,3648]
[null,null,null,null,3649]
[null,null,null,null,3650]
[null,null,null,null,3651]
[null,null,null,null,3652]
[null,null,null,null,3653]
[null,null,null,null,3654]
[null,null,null,null,3655]
[null,null,null,null,3656]
[null,null,null,null,3657]
[null,null,null,null,3658]
[null,null,null,null,3659]
[null,null,null,null,3660]
[null,null,null,null,3661]
[null,null,null,null,3662]
[null,null,null,null,3663]
[null,null,null,null,3664]
[null,null,null,null,3665]
[null,null,null,null,3666]
[null,null,null,null,3667]
[null,null,null,null,3668]
[null,null,null,null,3669]
[null,null,null,null,3670]
[null,null,null,null,3671]
[null,null,null,null,3672]
[null,null,null,null,3673]
[null,null,null,null,3674]
[null,null,null,null,3675]
[null,null,null,null,3676]
[null,null,null,null,3677]
[null,null,null,null,3678]
[null,null,null,null,3679]
[null,null,null,null,3680]
[null,null,null,null,3681]
[null,null,null,null,3682]
[null,null,null,null,3683]
[null,null,null,null,3684]
[null,null,null,null,3685]
[null,null,null,null,3686]
[null,null,null,null,3687]
[null,null,null,null,3688]
[null,null,null,null,3689]
[null,null,null,null,3690]
[null,null,null,null,3691]
[null,null,null,null,3692]
[null,null,null,null,3693]
[null,null,null,null,3694]
[null,null,null,null,3695]
[null,null,null,null,3696]
[null,null,null,null,3697]
[null,null,null,null,3698]
[null,null,null,null,3699]
[null,null,null,null,3700]
[null,null,null,null,3701]
[null,null,null,null,3702]
[null,null,null,null,3703]
[null,null,null,null,3704]
[null,null,null,null,3705]
[null,null,null,null,3706]
[null,null,null,null,3707]
[null,null,null,null,3708]
[null,null,null,null,3709]
[null,null,null,null,3710]
[null,null,null,null,3711]
[null,null,null,null,3712]
[null,null,null,null,3713]
[null,null,null,null,3714]
[null,null,null,null,3715]
[null,null,null,null,3716]
[null,null,null,null,3717]
[null,null,null,null,3718]
[null,null,null,null,3719]
[null,null,null,null,3720]
[null,null,null,null,3721]
[null,null,null,null,3722]
[null,null,null,null,3723]
[null,null,null,null,3724]
[null,null,null,null,3725]
[null,null,null,null,3726]
[null,null,null,null,3727]
[null,null,null,null,3728]
[null,null,null,null,3729]
[null,null,null,null,3730]
[null,null,null,null,3731]
[null,null,null,null,3732]
[null,null,null,null,3733]
[null,null,null,null,3734]
[null,null,null,null,3735]
[null,null,null,null,3736]
[null,null,null,null,3737]
[null,null,null,null,3738]
[null,null,null,null,3739]
[null,null,null,null,3740]
[null,null,null,null,3741]
[null,null,null,null,3742]
[null,null,null,null,3743]
[null,null,null,null,3744]
[null,null,null,null,3745]
[null,null,null,null,3746]
[null,null,null,null,3747]
[null,null,null,null,3748]
[null,null,null,null,3749]
[null,null,null,null,3750]
[null,null,null,null,3751]
[null,null,null,null,3752]
[null,null,null,null,3753]
[null,null,null,null,3754]
[null,null,null,null,3755]
[null,null,null,null,3756]
[null,null,null,null,3757]
[null,null,null,null,3758]
[null,null,null,null,3759]
[null,null,null,null,3760]
[null,null,null,null,3761]
[null,null,null,null,3762]
[null,null,null,null,3763]
[null,null,null,null,3764]
[null,null,null,null,3765]
[null,null,null,null,3766]
[null,null,null,null,3767]
[null,null,null,null,3768]
[null,null,null,null,3769]
[null,null,null,null,3770]
[null,null,null,null,3771]
[null,null,null,null,3772]
[null,null,null,null,3773]
[null,null,null,null,3774]
[null,null,null,null,3775]
[null,null,null,null,3776]
[null,null,null,null,3777]
[null,null,null,null,3778]
[null,null,null,null,3779]
[null,null,null,null,3780]
[null,null,null,null,3781]
[null,null,null,null,3782]
[null,null,null,null,3783]
[null,null,null,null,3784]
[null,null,null,null,3785]
[null,null,null,null,3786]
[null,null,null,null,3787]
[null,null,null,null,3788]
[null,null,null,null,3789]
[null,null,null,null,3790]
[null,null,null,null,3791]
[null,null,null,null,3792]
[null,null,null,null,3793]
[null,null,null,null,3794]
[null,null,null,null,3795]
[null,null,null,null,3796]
[null,null,null,null,3797]
[null,null,null,null,3798]
[null,null,null,null,3799]
[null,null,null,null,3800]
[null,null,null,null,3801]
[null,null,null,null,3802]
[null,null,null,null,3803]
[null,null,null,null,3804]
[null,null,null,null,3805]
[null,null,null,null,3806]
[null,null,null,null,3807]
[null,null,null,null,3808]
[null,null,null,null,3809]
[null,null,null,null,3810]
[null,null,null,null,3811]
[null,null,null,null,3812]
[null,null,null,null,3813]
[null,null,null,null,3814]
[null,null,null,null,3815]
[null,null,null,null,3816]
[null,null,null,null,3817]
[null,null,null,null,3818]
[null,null,null,null,3819]
[null,null,null,null,3820]
[null,null,null,null,3821]
[null,null,null,null,3822]
[null,null,null,null,3823]
[null,null,null,null,3824]
[null,null,null,null,3825]
[null,null,null,null,3826]
[null,null,null,null,3827]
[null,null,null,null,3828]
[null,null,null,null,3829]
[null,null,null,null,3830]
[null,null,null,null,3831]
[null,null,null,null,3832]
[null,null,null,null,3833]
[null,null,null,null,3834]
[null,null,null,null,3835]
[null,null,null,null,3836]
[null,null,null,null,3837]
[null,null,null,null,3838]
[null,null,null,null,3839]
[null,null,null,null,3840]
[null,null,null,null,3841]
[null,null,null,null,3842]
[null,null,null,null,3843]
[null,null,null,null,3844]
[null,null,null,null,3845]
[null,null,null,null,3846]
[null,null,null,null,3847]
[null,null,null,null,3848]
[null,null,null,null,3849]
[null,null,null,null,3850]
[null,null,null,null,3851]
[null,null,null,null,3852]
[null,null,null,null,3853]
[null,null,null,null,3854]
[null,null,null,null,3855]
[null,null,null,null,3856]
[null,null,null,null,3857]
[null,null,null,null,3858]
[null,null,null,null,3859]
[null,null,null,null,3860]
[null,null,null,null,3861]
[null,null,null,null,3862]
[null,null,null,null,3863]
[null,null,null,null,3864]
[null,null,null,null,3865]
[null,null,null,null,3866]
[null,null,null,null,3867]
[null,null,null,null,3868]
[null,null,null,null,3869]
[null,null,null,null,3870]
[null,null,null,null,3871]
[null,null,null,null,3872]
[null,null,null,null,3873]
[null,null,null,null,3874]
[null,null,null,null,3875]
[null,null,null,null,3876]
[null,null,null,null,3877]
[null,null,null,null,3878]
[null,null,null,null,3879]
[null,null,null,null,3880]
[null,null,null,null,3881]
[null,null,null,null,3882]
[null,null,null,null,3883]
[null,null,null,null,3884]
[null,null,null,null,3885]
[null,null,null,null,3886]
[null,null,null,null,3887]
[null,null,null,null,3888]
[null,null,null,null,3889]
[null,null,null,null,3890]
[null,null,null,null,3891]
[null,null,null,null,3892]
[null,null,null,null,3893]
[null,null,null,null,3894]
[null,null,null,null,3895]
[null,null,null,null,3896]
[null,null,null,null,3897]
[null,null,null,null,3898]
[null,null,null,null,3899]
[null,null,null,null,3900]
[null,null,null,null,3901]
[null,null,null,null,3902]
[null,null,null,null,3903]
[null,null,null,null,3904]
[null,null,null,null,3905]
[null,null,null,null,3906]
[null,null,null,null,3907]
[null,null,null,null,3908]
[null,null,null,null,3909]
[null,null,null,null,3910]
[null,null,null,null,3911]
[null,null,null,null,3912]
[null,null,null,null,3913]
[null,null,null,null,3914]
[null,null,null,null,3915]
[null,null,null,null,3916]
[null,null,null,null,3917]
[null,null,null,null,3918]
[null,null,null,null,3919]
[null,null,null,null,3920]
[null,null,null,null,3921]
[null,null,null,null,3922]
[null,null,null,null,3923]
[null,null,null,null,3924]
[null,null,null,null,3925]
[null,null,null,null,3926]
[null,null,null,null,3927]
[null,null,null,null,3928]
[null,null,null,null,3929]
[null,null,null,null,3930]
[null,null,null,null,3931]
[null,null,null,null,3932]
[null,null,null,null,3933]
[null,null,null,null,3934]
[null,null,null,null,3935]
[null,null,null,null,3936]
[null,null,null,null,3937]
[null,null,null,null,3938]
[null,null,null,null,3939]
[null,null,null,null,3940]
[null,null,null,null,3941]
[null,null,null,null,3942]
[null,null,null,null,3943]
[null,null,null,null,3944]
[null,null,null,null,3945]
[null,null,null,null,3946]
[null,null,null,null,3947]
[null,null,null,null,3948]
[null,null,null,null,3949]
[null,null,null,null,3950]
[null,null,null,null,3951]
[null,null,null,null,3952]
[null,null,null,null,3953]
[null,null,null,null,3954]
[null,null,null,null,3955]
[null,null,null,null,3956]
[null,null,null,null,3957]
[null,null,null,null,3958]
[null,null,null,null,3959]
[null,null,null,null,3960]
[null,null,null,null,3961]
[null,null,null,null,3962]
[null,null,null,null,3963]
[null,null,null,null,3964]
[null,null,null,null,3965]
[null,null,null,null,3966]
[null,null,null,null,3967]
[null,null,null,null,3968]
[null,null,null,null,3969]
[null,null,null,null,3970]
[null,null,null,null,3971]
[null,null,null,null,3972]
[null,null,null,null,3973]
[null,null,null,null,3974]
[null,null,null,null,3975]
[null,null,null,null,3976]
[null,null,null,null,3977]
[null,null,null,null,3978]
[null,null,null,null,3979]
[null,null,null,null,3980]
[null,null,null,null,3981]
[null,null,null,null,3982]
[null,null,null,null,3983]
[null,null,null,null,3984]
[null,null,null,null,3985]
[null,null,null,null,3986]
[null,null,null,null,3987]
[null,null,null,null,3988]
[null,null,null,null,3989]
[null,null,null,null,3990]
[null,null,null,null,3991]
[null,null,null,null,3992]
[null,null,null,null,3993]
[null,null,null,null,3994]
[null,null,null,null,3995]
[null,null,null,null,3996]
[null,null,null,null,3997]
[null,null,null,null,3998]
[null,null,null,null,3999]
[null,null,null,null,4000]
[null,null,null,null,4001]
[null,null,null,null,4002]
[null,null,null,null,4003]
[null,null,null,null,4004]
[null,null,null,null,4005]
[null,null,null,null,4006]
[null,null,null,null,4007]
[null,null,null,null,4008]
[null,null,null,null,4009]
[null,null,null,null,4010]
[null,null,null,null,4011]
[null,null,null,null,4012]
[null,null,null,null,4013]
[null,null,null,null,4014]
[null,null,null,null,4015]
[null,null,null,null,4016]
[null,null,null,null,4017]
[null,null,null,null,4018]
[null,null,null,null,4019]
[null,null,null,null,4020]
[null,null,null,null,4021]
[null,null,null,null,4022]
[null,null,null,null,4023]
[null,null,null,null,4024]
[null,null,null,null,4025]
[null,null,null,null,4026]
[null,null,null,null,4027]
[null,null,null,null,4028]
[null,null,null,null,4029]
[null,null,null,null,4030]
[null,null,null,null,4031]
[null,null,null,null,4032]
[null,null,null,null,4033]
[null,null,null,null,4034]
[null,null,null,null,4035]
[null,null,null,null,4036]
[null,null,null,null,4037]
[null,null,null,null,4038]
[null,null,null,null,4039]
[null,null,null,null,4040]
[null,null,null,null,4041]
[null,null,null,null,4042]
[null,null,null,null,4043]
[null,null,null,null,4044]
[null,null,null,null,4045]
[null,null,null,null,4046]
[null,null,null,null,4047]
[null,null,null,null,4048]
[null,null,null,null,4049]
[null,null,null,null,4050]
[null,null,null,null,4051]
[null,null,null,null,4052]
[null,null,null,null,4053]
[null,null,null,null,4054]
[null,null,null,null,4055]
[null,null,null,null,4056]
[null,null,null,null,4057]
[null,null,null,null,4058]
[null,null,null,null,4059]
[null,null,null,null,4060]
[null,null,null,null,4061]
[null,null,null,null,4062]
[null,null,null,null,4063]
[null,null,null,null,4064]
[null,null,null,null,4065]
[null,null,null,null,4066]
[null,null,null,null,4067]
[null,null,null,null,4068]
[null,null,null,null,4069]
[null,null,null,null,4070]
[null,null,null,null,4071]
[null,null,null,null,4072]
[null,null,null,null,4073]
[null,null,null,null,4074]
[null,null,null,null,4075]
[null,null,null,null,4076]
[null,null,null,null,4077]
[null,null,null,null,4078]
[null,null,null,null,4079]
[null,null,null,null,4080]
[null,null,null,null,4081]
[null,null,null,null,4082]
[null,null,null,null,4083]
[null,null,null,null,4084]
[null,null,null,null,4085]
[null,null,null,null,4086]
[null,null,null,null,4087]
[null,null,null,null,4088]
[null,null,null,null,4089]
[null,null,null,null,4090]
[null,null,null,null,4091]
[null,null,null,null,4092]
[null,null,null,null,4093]
[null,null,null,null,4094]
[null,null,null,null,4095]

{"sheet":"PASS_PLL","index":4,"n_rows":4291,"n_cols":20,"rows_kept":4291,"cut":false,"hidden":false,"merged":[[0,5,2,12],[9,5,10,12],[24,14,26,19],[13,14,13,15],[13,17,13,18],[13,19,14,19]]}
[null,null,null,null,null,"PASS PLL CLOCKING SECTION"]
[]
[]
[]
[]
[]
[]
[]
[]
[null,null,null,null,null,"NETCP PLL"]
[null,null,null,null,null,null,null,null,null,null,null,null,null,null,null,"SYSCLK1"]
[null,null,{"$f":"IF(Main_PLL!B9=\"CUSTOM\",\"CUSTOM\",\"\")","v":""},null,null,null,null,null,null,{"$f":"IF(J13<700,\"OUT OF RANGE\",IF(J13>4000,\"OUT OF RANGE\",\"\"))","v":""},null,null,null,null,null,{"$f":"(Main_PLL!W13)","v":1000}]
[null,"CORECLK (P/N)",{"$f":"(Main_PLL!G12)","v":100},null,null,{"$f":"IF(C19,C15,C13)","v":100},"PLLD",{"$f":"IF(Main_PLL!B9=\"CUSTOM\",SUM(F13/(G15+1)),IF(C19,SUM(F13/(G15+1)),SUM(F13/(G14+1))))","v":100},null,{"$f":"IF(Main_PLL!B9=\"CUSTOM\",SUM(H13*D197),IF(C19,SUM(H13*D197),SUM(H13*D196)))","v":2100},"÷",{"$f":"SUM(J13/(K14))","v":1050}]
[null,null,null,null,null,null,{"$f":"IF(C19,\"EXTERNAL\",IF(Main_PLL!B9=\"CUSTOM\",\"CUSTOM\",K211))","v":0},null,19,null,2,null,null,{"$f":"IF(J22,\"\",(IF(N16<1040,\"OUT OF RANGE\",IF(N16>1051,\"OUT OF RANGE\",\"\"))))","v":""},null,null,null,null,null,{"$f":"IF(P22,\"\",\"TEST MODE\")","v":""}]
[null,"PASSCLK (P/N)",200,null,null,null,0,null,null,null,null,null,null,{"$f":"IF(J22,\"\",(IF(N16<1040,\"AFFECTS THROUGHPUT\",IF(N16>1051,\"AFFECTS THROUGHPUT\",\"\"))))","v":""}]
[null,null,null,null,null,null,null,null,"PLLM",null,null,null,null,{"$f":"IF(J22,K18,L13)","v":1050},null,null,null,"     ÷",null,{"$f":"IF(J22,IF(P22,\"INVALID\",IF(P22,M196,M197)),IF(P22,M196,M197))","v":350}]
[null,null,null,null,null,null,null,null,{"$f":"IF(C19,\"EXTERNAL\",IF(Main_PLL!B9=\"CUSTOM\",\"CUSTOM\",Q211))","v":20},null,null,null,null,null,null,null,null,3]
[null,null,"PACLKSEL",null,null,null,null,null,19,0,{"$f":"SUM(F13)","v":100}]
[null,null,0]
[]
[null,null,null,null,null,null,null,null,null,"BYPASS",null,null,null,null,null,"PLLSELECT"]
[null,null,null,null,null,null,null,null,null,0,null,null,null,null,null,1]
[]
[null,"Registers:"]
[null,"Name","Bit Position","Value",null,null,null,null,null,null,null,null,null,null,"Note: SYSCLK is for test mode and it is not meant for operational use. The PLL SELECT must never be toggled during operation as this can corrupt the PASS."]
[null,"PASSPLLCTL0.PLLD","5 : 0",{"$f":"IF(G14=\"EXTERNAL\",CONCATENATE(\"0x\",DEC2HEX(G15,2)),IF(G14=\"CUSTOM\",CONCATENATE(\"0x\",DEC2HEX(G15,2)),CONCATENATE(\"0x\",DEC2HEX(G14,2))))","v":"0x00"}]
[null,"PASSPLLCTL0.PLLM","18 : 6",{"$f":"IF(I17=\"EXTERNAL\",CONCATENATE(\"0x\",DEC2HEX(I18,2)),IF(I17=\"CUSTOM\",CONCATENATE(\"0x\",DEC2HEX(I18,2)),CONCATENATE(\"0x\",DEC2HEX(I17,2))))","v":"0x14"},null,"Note:"]
[null,"PASSPLLCTL0.BYPASS",23,{"$f":"CONCATENATE(\"0x\",DEC2HEX(J22,1))","v":"0x0"},null,"Please refer instructions for clarification on actual PLLD/PLLM and its register value."]
[null,"PASSPLLCTL1.PLLSELECT",13,{"$f":"CONCATENATE(\"0x\",DEC2HEX(O22,1))","v":"0x0"}]
[]
[]
[]
[]
[]
[]
[]
[]
[]
[]
[]
[]
[]
[]
[]
[]
[]
[]
[]
[]
[]
[]
[]
[]
[]
[]
[]
[]
[]
[]
[]
[]
[]
[]
[]
[]
[]
[]
[]
[]
[]
[]
[]
[]
[]
[]
[]
[]
[]
[]
[]
[]
[]
[]
[]
[]
[]
[]
[]
[]
[]
[]
[]
[]
[]
[]
[]
[]
[]
[]
[]
[]
[]
[]
[]
[]
[]
[]
[]
[]
[]
[]
[]
[]
[]
[]
[]
[]
[]
[]
[]
[]
[]
[]
[]
[]
[]
[]
[]
[]
[]
[]
[]
[]
[]
[]
[]
[]
[]
[]
[]
[]
[]
[]
[]
[]
[]
[]
[]
[]
[]
[]
[]
[]
[]
[]
[]
[]
[]
[]
[]
[]
[]
[]
[]
[]
[]
[]
[]
[]
[]
[]
[]
[]
[]
[]
[]
[]
[]
[]
[]
[]
[]
[]
[]
[]
[]
[]
[]
[]
[]
[]
[]
[]
[]
["PLLD","PACLKSEL","PLLM","PLLMPLUS",null,"BYPASS","CLKOD",null,"PAPLL",null,"Device Speed","NETCPPLLCTL1.PAPLL","Divide by 3 ",null,null,null,"Device Speed"]
[0,0,0,{"$f":"SUM(I17+1)","v":21},null,0,0,156.25,"NETCP_PLL",null,350,0,{"$f":"N16/R17","v":350},null,null,null,350]
[1,1,1,{"$f":"SUM(I18+1)","v":20},null,1,1,312.5,"SYSCLK1","Input Clock freq","PLLD",1,{"$f":"IF(P12=\"INVALID\",\"INVALID\",SUM(P12/R17))","v":333.33333333333331},null,null,"Input Clock freq","PLLM"]
[2,null,2,null,null,null,3,null,null,50,0,null,null,null,null,50,41]
[3,null,3,null,null,null,5,null,null,66.67,1,null,null,null,null,66.67,62]
[4,null,4,null,null,null,7,{"$f":"IF(J22=1,0,IF(N16<1040,1,IF(N16>1051,1,0)))","v":0},null,80,3,null,null,null,null,80,104]
[5,null,5,null,null,null,9,null,null,100,0,null,null,null,null,100,20]
[6,null,6,null,null,null,11,null,null,100.00001,0,null,null,null,null,100.00001,20]
[7,null,7,null,null,null,13,null,null,156.25,24,null,null,null,null,156.25,335]
[8,null,8,null,null,null,15,null,null,250,4,null,null,null,null,250,41]
[9,null,9,null,null,null,null,null,null,312.5,24,null,null,null,null,312.5,167]
[10,null,10,null,null,null,null,null,null,122.88,11,null,null,null,null,122.88,204]
[11,null,11,null,null,null,{"$f":"IF(G14=\"EXTERNAL\",1,IF(G14=\"CUSTOM\",1,0))","v":0}]
[12,null,12,null,null,null,{"$f":"IF(I17=\"EXTERNAL\",1,IF(I17=\"CUSTOM\",1,0))","v":0}]
[13,null,13,null,null,null,{"$f":"IF(K14=\"EXTERNAL\",1,IF(K14=\"CUSTOM\",1,0))","v":0},null,null,"Input Freq",{"$f":"C13","v":100}]
[14,null,14,null,null,null,null,null,null,"Devcie Speed",350]
[15,null,15,null,null,null,null,null,null,"PLLD",{"$f":"VLOOKUP(K209,J198:K206,MATCH(K210,K196)+1,FALSE)","v":0},null,null,null,null,"PLLM",{"$f":"VLOOKUP(K209,P198:Q206,MATCH(K210,Q196)+1,FALSE)","v":20}]
[16,null,16]
[17,null,17]
[18,null,18]
[19,null,19]
[20,null,20]
[21,null,21]
[22,null,22]
[23,null,23]
[24,null,24]
[25,null,25]
[26,null,26]
[27,null,27]
[28,null,28]
[29,null,29]
[30,null,30]
[31,null,31]
[32,null,32]
[33,null,33]
[34,null,34]
[35,null,35]
[36,null,36]
[37,null,37]
[38,null,38]
[39,null,39]
[40,null,40]
[41,null,41]
[42,null,42]
[43,null,43]
[44,null,44]
[45,null,45]
[46,null,46]
[47,null,47]
[48,null,48]
[49,null,49]
[50,null,50]
[51,null,51]
[52,null,52]
[53,null,53]
[54,null,54]
[55,null,55]
[56,null,56]
[57,null,57]
[58,null,58]
[59,null,59]
[60,null,60]
[61,null,61]
[62,null,62]
[63,null,63]
[null,null,64]
[null,null,65]
[null,null,66]
[null,null,67]
[null,null,68]
[null,null,69]
[null,null,70]
[null,null,71]
[null,null,72]
[null,null,73]
[null,null,74]
[null,null,75]
[null,null,76]
[null,null,77]
[null,null,78]
[null,null,79]
[null,null,80]
[null,null,81]
[null,null,82]
[null,null,83]
[null,null,84]
[null,null,85]
[null,null,86]
[null,null,87]
[null,null,88]
[null,null,89]
[null,null,90]
[null,null,91]
[null,null,92]
[null,null,93]
[null,null,94]
[null,null,95]
[null,null,96]
[null,null,97]
[null,null,98]
[null,null,99]
[null,null,100]
[null,null,101]
[null,null,102]
[null,null,103]
[null,null,104]
[null,null,105]
[null,null,106]
[null,null,107]
[null,null,108]
[null,null,109]
[null,null,110]
[null,null,111]
[null,null,112]
[null,null,113]
[null,null,114]
[null,null,115]
[null,null,116]
[null,null,117]
[null,null,118]
[null,null,119]
[null,null,120]
[null,null,121]
[null,null,122]
[null,null,123]
[null,null,124]
[null,null,125]
[null,null,126]
[null,null,127]
[null,null,128]
[null,null,129]
[null,null,130]
[null,null,131]
[null,null,132]
[null,null,133]
[null,null,134]
[null,null,135]
[null,null,136]
[null,null,137]
[null,null,138]
[null,null,139]
[null,null,140]
[null,null,141]
[null,null,142]
[null,null,143]
[null,null,144]
[null,null,145]
[null,null,146]
[null,null,147]
[null,null,148]
[null,null,149]
[null,null,150]
[null,null,151]
[null,null,152]
[null,null,153]
[null,null,154]
[null,null,155]
[null,null,156]
[null,null,157]
[null,null,158]
[null,null,159]
[null,null,160]
[null,null,161]
[null,null,162]
[null,null,163]
[null,null,164]
[null,null,165]
[null,null,166]
[null,null,167]
[null,null,168]
[null,null,169]
[null,null,170]
[null,null,171]
[null,null,172]
[null,null,173]
[null,null,174]
[null,null,175]
[null,null,176]
[null,null,177]
[null,null,178]
[null,null,179]
[null,null,180]
[null,null,181]
[null,null,182]
[null,null,183]
[null,null,184]
[null,null,185]
[null,null,186]
[null,null,187]
[null,null,188]
[null,null,189]
[null,null,190]
[null,null,191]
[null,null,192]
[null,null,193]
[null,null,194]
[null,null,195]
[null,null,196]
[null,null,197]
[null,null,198]
[null,null,199]
[null,null,200]
[null,null,201]
[null,null,202]
[null,null,203]
[null,null,204]
[null,null,205]
[null,null,206]
[null,null,207]
[null,null,208]
[null,null,209]
[null,null,210]
[null,null,211]
[null,null,212]
[null,null,213]
[null,null,214]
[null,null,215]
[null,null,216]
[null,null,217]
[null,null,218]
[null,null,219]
[null,null,220]
[null,null,221]
[null,null,222]
[null,null,223]
[null,null,224]
[null,null,225]
[null,null,226]
[null,null,227]
[null,null,228]
[null,null,229]
[null,null,230]
[null,null,231]
[null,null,232]
[null,null,233]
[null,null,234]
[null,null,235]
[null,null,236]
[null,null,237]
[null,null,238]
[null,null,239]
[null,null,240]
[null,null,241]
[null,null,242]
[null,null,243]
[null,null,244]
[null,null,245]
[null,null,246]
[null,null,247]
[null,null,248]
[null,null,249]
[null,null,250]
[null,null,251]
[null,null,252]
[null,null,253]
[null,null,254]
[null,null,255]
[null,null,256]
[null,null,257]
[null,null,258]
[null,null,259]
[null,null,260]
[null,null,261]
[null,null,262]
[null,null,263]
[null,null,264]
[null,null,265]
[null,null,266]
[null,null,267]
[null,null,268]
[null,null,269]
[null,null,270]
[null,null,271]
[null,null,272]
[null,null,273]
[null,null,274]
[null,null,275]
[null,null,276]
[null,null,277]
[null,null,278]
[null,null,279]
[null,null,280]
[null,null,281]
[null,null,282]
[null,null,283]
[null,null,284]
[null,null,285]
[null,null,286]
[null,null,287]
[null,null,288]
[null,null,289]
[null,null,290]
[null,null,291]
[null,null,292]
[null,null,293]
[null,null,294]
[null,null,295]
[null,null,296]
[null,null,297]
[null,null,298]
[null,null,299]
[null,null,300]
[null,null,301]
[null,null,302]
[null,null,303]
[null,null,304]
[null,null,305]
[null,null,306]
[null,null,307]
[null,null,308]
[null,null,309]
[null,null,310]
[null,null,311]
[null,null,312]
[null,null,313]
[null,null,314]
[null,null,315]
[null,null,316]
[null,null,317]
[null,null,318]
[null,null,319]
[null,null,320]
[null,null,321]
[null,null,322]
[null,null,323]
[null,null,324]
[null,null,325]
[null,null,326]
[null,null,327]
[null,null,328]
[null,null,329]
[null,null,330]
[null,null,331]
[null,null,332]
[null,null,333]
[null,null,334]
[null,null,335]
[null,null,336]
[null,null,337]
[null,null,338]
[null,null,339]
[null,null,340]
[null,null,341]
[null,null,342]
[null,null,343]
[null,null,344]
[null,null,345]
[null,null,346]
[null,null,347]
[null,null,348]
[null,null,349]
[null,null,350]
[null,null,351]
[null,null,352]
[null,null,353]
[null,null,354]
[null,null,355]
[null,null,356]
[null,null,357]
[null,null,358]
[null,null,359]
[null,null,360]
[null,null,361]
[null,null,362]
[null,null,363]
[null,null,364]
[null,null,365]
[null,null,366]
[null,null,367]
[null,null,368]
[null,null,369]
[null,null,370]
[null,null,371]
[null,null,372]
[null,null,373]
[null,null,374]
[null,null,375]
[null,null,376]
[null,null,377]
[null,null,378]
[null,null,379]
[null,null,380]
[null,null,381]
[null,null,382]
[null,null,383]
[null,null,384]
[null,null,385]
[null,null,386]
[null,null,387]
[null,null,388]
[null,null,389]
[null,null,390]
[null,null,391]
[null,null,392]
[null,null,393]
[null,null,394]
[null,null,395]
[null,null,396]
[null,null,397]
[null,null,398]
[null,null,399]
[null,null,400]
[null,null,401]
[null,null,402]
[null,null,403]
[null,null,404]
[null,null,405]
[null,null,406]
[null,null,407]
[null,null,408]
[null,null,409]
[null,null,410]
[null,null,411]
[null,null,412]
[null,null,413]
[null,null,414]
[null,null,415]
[null,null,416]
[null,null,417]
[null,null,418]
[null,null,419]
[null,null,420]
[null,null,421]
[null,null,422]
[null,null,423]
[null,null,424]
[null,null,425]
[null,null,426]
[null,null,427]
[null,null,428]
[null,null,429]
[null,null,430]
[null,null,431]
[null,null,432]
[null,null,433]
[null,null,434]
[null,null,435]
[null,null,436]
[null,null,437]
[null,null,438]
[null,null,439]
[null,null,440]
[null,null,441]
[null,null,442]
[null,null,443]
[null,null,444]
[null,null,445]
[null,null,446]
[null,null,447]
[null,null,448]
[null,null,449]
[null,null,450]
[null,null,451]
[null,null,452]
[null,null,453]
[null,null,454]
[null,null,455]
[null,null,456]
[null,null,457]
[null,null,458]
[null,null,459]
[null,null,460]
[null,null,461]
[null,null,462]
[null,null,463]
[null,null,464]
[null,null,465]
[null,null,466]
[null,null,467]
[null,null,468]
[null,null,469]
[null,null,470]
[null,null,471]
[null,null,472]
[null,null,473]
[null,null,474]
[null,null,475]
[null,null,476]
[null,null,477]
[null,null,478]
[null,null,479]
[null,null,480]
[null,null,481]
[null,null,482]
[null,null,483]
[null,null,484]
[null,null,485]
[null,null,486]
[null,null,487]
[null,null,488]
[null,null,489]
[null,null,490]
[null,null,491]
[null,null,492]
[null,null,493]
[null,null,494]
[null,null,495]
[null,null,496]
[null,null,497]
[null,null,498]
[null,null,499]
[null,null,500]
[null,null,501]
[null,null,502]
[null,null,503]
[null,null,504]
[null,null,505]
[null,null,506]
[null,null,507]
[null,null,508]
[null,null,509]
[null,null,510]
[null,null,511]
[null,null,512]
[null,null,513]
[null,null,514]
[null,null,515]
[null,null,516]
[null,null,517]
[null,null,518]
[null,null,519]
[null,null,520]
[null,null,521]
[null,null,522]
[null,null,523]
[null,null,524]
[null,null,525]
[null,null,526]
[null,null,527]
[null,null,528]
[null,null,529]
[null,null,530]
[null,null,531]
[null,null,532]
[null,null,533]
[null,null,534]
[null,null,535]
[null,null,536]
[null,null,537]
[null,null,538]
[null,null,539]
[null,null,540]
[null,null,541]
[null,null,542]
[null,null,543]
[null,null,544]
[null,null,545]
[null,null,546]
[null,null,547]
[null,null,548]
[null,null,549]
[null,null,550]
[null,null,551]
[null,null,552]
[null,null,553]
[null,null,554]
[null,null,555]
[null,null,556]
[null,null,557]
[null,null,558]
[null,null,559]
[null,null,560]
[null,null,561]
[null,null,562]
[null,null,563]
[null,null,564]
[null,null,565]
[null,null,566]
[null,null,567]
[null,null,568]
[null,null,569]
[null,null,570]
[null,null,571]
[null,null,572]
[null,null,573]
[null,null,574]
[null,null,575]
[null,null,576]
[null,null,577]
[null,null,578]
[null,null,579]
[null,null,580]
[null,null,581]
[null,null,582]
[null,null,583]
[null,null,584]
[null,null,585]
[null,null,586]
[null,null,587]
[null,null,588]
[null,null,589]
[null,null,590]
[null,null,591]
[null,null,592]
[null,null,593]
[null,null,594]
[null,null,595]
[null,null,596]
[null,null,597]
[null,null,598]
[null,null,599]
[null,null,600]
[null,null,601]
[null,null,602]
[null,null,603]
[null,null,604]
[null,null,605]
[null,null,606]
[null,null,607]
[null,null,608]
[null,null,609]
[null,null,610]
[null,null,611]
[null,null,612]
[null,null,613]
[null,null,614]
[null,null,615]
[null,null,616]
[null,null,617]
[null,null,618]
[null,null,619]
[null,null,620]
[null,null,621]
[null,null,622]
[null,null,623]
[null,null,624]
[null,null,625]
[null,null,626]
[null,null,627]
[null,null,628]
[null,null,629]
[null,null,630]
[null,null,631]
[null,null,632]
[null,null,633]
[null,null,634]
[null,null,635]
[null,null,636]
[null,null,637]
[null,null,638]
[null,null,639]
[null,null,640]
[null,null,641]
[null,null,642]
[null,null,643]
[null,null,644]
[null,null,645]
[null,null,646]
[null,null,647]
[null,null,648]
[null,null,649]
[null,null,650]
[null,null,651]
[null,null,652]
[null,null,653]
[null,null,654]
[null,null,655]
[null,null,656]
[null,null,657]
[null,null,658]
[null,null,659]
[null,null,660]
[null,null,661]
[null,null,662]
[null,null,663]
[null,null,664]
[null,null,665]
[null,null,666]
[null,null,667]
[null,null,668]
[null,null,669]
[null,null,670]
[null,null,671]
[null,null,672]
[null,null,673]
[null,null,674]
[null,null,675]
[null,null,676]
[null,null,677]
[null,null,678]
[null,null,679]
[null,null,680]
[null,null,681]
[null,null,682]
[null,null,683]
[null,null,684]
[null,null,685]
[null,null,686]
[null,null,687]
[null,null,688]
[null,null,689]
[null,null,690]
[null,null,691]
[null,null,692]
[null,null,693]
[null,null,694]
[null,null,695]
[null,null,696]
[null,null,697]
[null,null,698]
[null,null,699]
[null,null,700]
[null,null,701]
[null,null,702]
[null,null,703]
[null,null,704]
[null,null,705]
[null,null,706]
[null,null,707]
[null,null,708]
[null,null,709]
[null,null,710]
[null,null,711]
[null,null,712]
[null,null,713]
[null,null,714]
[null,null,715]
[null,null,716]
[null,null,717]
[null,null,718]
[null,null,719]
[null,null,720]
[null,null,721]
[null,null,722]
[null,null,723]
[null,null,724]
[null,null,725]
[null,null,726]
[null,null,727]
[null,null,728]
[null,null,729]
[null,null,730]
[null,null,731]
[null,null,732]
[null,null,733]
[null,null,734]
[null,null,735]
[null,null,736]
[null,null,737]
[null,null,738]
[null,null,739]
[null,null,740]
[null,null,741]
[null,null,742]
[null,null,743]
[null,null,744]
[null,null,745]
[null,null,746]
[null,null,747]
[null,null,748]
[null,null,749]
[null,null,750]
[null,null,751]
[null,null,752]
[null,null,753]
[null,null,754]
[null,null,755]
[null,null,756]
[null,null,757]
[null,null,758]
[null,null,759]
[null,null,760]
[null,null,761]
[null,null,762]
[null,null,763]
[null,null,764]
[null,null,765]
[null,null,766]
[null,null,767]
[null,null,768]
[null,null,769]
[null,null,770]
[null,null,771]
[null,null,772]
[null,null,773]
[null,null,774]
[null,null,775]
[null,null,776]
[null,null,777]
[null,null,778]
[null,null,779]
[null,null,780]
[null,null,781]
[null,null,782]
[null,null,783]
[null,null,784]
[null,null,785]
[null,null,786]
[null,null,787]
[null,null,788]
[null,null,789]
[null,null,790]
[null,null,791]
[null,null,792]
[null,null,793]
[null,null,794]
[null,null,795]
[null,null,796]
[null,null,797]
[null,null,798]
[null,null,799]
[null,null,800]
[null,null,801]
[null,null,802]
[null,null,803]
[null,null,804]
[null,null,805]
[null,null,806]
[null,null,807]
[null,null,808]
[null,null,809]
[null,null,810]
[null,null,811]
[null,null,812]
[null,null,813]
[null,null,814]
[null,null,815]
[null,null,816]
[null,null,817]
[null,null,818]
[null,null,819]
[null,null,820]
[null,null,821]
[null,null,822]
[null,null,823]
[null,null,824]
[null,null,825]
[null,null,826]
[null,null,827]
[null,null,828]
[null,null,829]
[null,null,830]
[null,null,831]
[null,null,832]
[null,null,833]
[null,null,834]
[null,null,835]
[null,null,836]
[null,null,837]
[null,null,838]
[null,null,839]
[null,null,840]
[null,null,841]
[null,null,842]
[null,null,843]
[null,null,844]
[null,null,845]
[null,null,846]
[null,null,847]
[null,null,848]
[null,null,849]
[null,null,850]
[null,null,851]
[null,null,852]
[null,null,853]
[null,null,854]
[null,null,855]
[null,null,856]
[null,null,857]
[null,null,858]
[null,null,859]
[null,null,860]
[null,null,861]
[null,null,862]
[null,null,863]
[null,null,864]
[null,null,865]
[null,null,866]
[null,null,867]
[null,null,868]
[null,null,869]
[null,null,870]
[null,null,871]
[null,null,872]
[null,null,873]
[null,null,874]
[null,null,875]
[null,null,876]
[null,null,877]
[null,null,878]
[null,null,879]
[null,null,880]
[null,null,881]
[null,null,882]
[null,null,883]
[null,null,884]
[null,null,885]
[null,null,886]
[null,null,887]
[null,null,888]
[null,null,889]
[null,null,890]
[null,null,891]
[null,null,892]
[null,null,893]
[null,null,894]
[null,null,895]
[null,null,896]
[null,null,897]
[null,null,898]
[null,null,899]
[null,null,900]
[null,null,901]
[null,null,902]
[null,null,903]
[null,null,904]
[null,null,905]
[null,null,906]
[null,null,907]
[null,null,908]
[null,null,909]
[null,null,910]
[null,null,911]
[null,null,912]
[null,null,913]
[null,null,914]
[null,null,915]
[null,null,916]
[null,null,917]
[null,null,918]
[null,null,919]
[null,null,920]
[null,null,921]
[null,null,922]
[null,null,923]
[null,null,924]
[null,null,925]
[null,null,926]
[null,null,927]
[null,null,928]
[null,null,929]
[null,null,930]
[null,null,931]
[null,null,932]
[null,null,933]
[null,null,934]
[null,null,935]
[null,null,936]
[null,null,937]
[null,null,938]
[null,null,939]
[null,null,940]
[null,null,941]
[null,null,942]
[null,null,943]
[null,null,944]
[null,null,945]
[null,null,946]
[null,null,947]
[null,null,948]
[null,null,949]
[null,null,950]
[null,null,951]
[null,null,952]
[null,null,953]
[null,null,954]
[null,null,955]
[null,null,956]
[null,null,957]
[null,null,958]
[null,null,959]
[null,null,960]
[null,null,961]
[null,null,962]
[null,null,963]
[null,null,964]
[null,null,965]
[null,null,966]
[null,null,967]
[null,null,968]
[null,null,969]
[null,null,970]
[null,null,971]
[null,null,972]
[null,null,973]
[null,null,974]
[null,null,975]
[null,null,976]
[null,null,977]
[null,null,978]
[null,null,979]
[null,null,980]
[null,null,981]
[null,null,982]
[null,null,983]
[null,null,984]
[null,null,985]
[null,null,986]
[null,null,987]
[null,null,988]
[null,null,989]
[null,null,990]
[null,null,991]
[null,null,992]
[null,null,993]
[null,null,994]
[null,null,995]
[null,null,996]
[null,null,997]
[null,null,998]
[null,null,999]
[null,null,1000]
[null,null,1001]
[null,null,1002]
[null,null,1003]
[null,null,1004]
[null,null,1005]
[null,null,1006]
[null,null,1007]
[null,null,1008]
[null,null,1009]
[null,null,1010]
[null,null,1011]
[null,null,1012]
[null,null,1013]
[null,null,1014]
[null,null,1015]
[null,null,1016]
[null,null,1017]
[null,null,1018]
[null,null,1019]
[null,null,1020]
[null,null,1021]
[null,null,1022]
[null,null,1023]
[null,null,1024]
[null,null,1025]
[null,null,1026]
[null,null,1027]
[null,null,1028]
[null,null,1029]
[null,null,1030]
[null,null,1031]
[null,null,1032]
[null,null,1033]
[null,null,1034]
[null,null,1035]
[null,null,1036]
[null,null,1037]
[null,null,1038]
[null,null,1039]
[null,null,1040]
[null,null,1041]
[null,null,1042]
[null,null,1043]
[null,null,1044]
[null,null,1045]
[null,null,1046]
[null,null,1047]
[null,null,1048]
[null,null,1049]
[null,null,1050]
[null,null,1051]
[null,null,1052]
[null,null,1053]
[null,null,1054]
[null,null,1055]
[null,null,1056]
[null,null,1057]
[null,null,1058]
[null,null,1059]
[null,null,1060]
[null,null,1061]
[null,null,1062]
[null,null,1063]
[null,null,1064]
[null,null,1065]
[null,null,1066]
[null,null,1067]
[null,null,1068]
[null,null,1069]
[null,null,1070]
[null,null,1071]
[null,null,1072]
[null,null,1073]
[null,null,1074]
[null,null,1075]
[null,null,1076]
[null,null,1077]
[null,null,1078]
[null,null,1079]
[null,null,1080]
[null,null,1081]
[null,null,1082]
[null,null,1083]
[null,null,1084]
[null,null,1085]
[null,null,1086]
[null,null,1087]
[null,null,1088]
[null,null,1089]
[null,null,1090]
[null,null,1091]
[null,null,1092]
[null,null,1093]
[null,null,1094]
[null,null,1095]
[null,null,1096]
[null,null,1097]
[null,null,1098]
[null,null,1099]
[null,null,1100]
[null,null,1101]
[null,null,1102]
[null,null,1103]
[null,null,1104]
[null,null,1105]
[null,null,1106]
[null,null,1107]
[null,null,1108]
[null,null,1109]
[null,null,1110]
[null,null,1111]
[null,null,1112]
[null,null,1113]
[null,null,1114]
[null,null,1115]
[null,null,1116]
[null,null,1117]
[null,null,1118]
[null,null,1119]
[null,null,1120]
[null,null,1121]
[null,null,1122]
[null,null,1123]
[null,null,1124]
[null,null,1125]
[null,null,1126]
[null,null,1127]
[null,null,1128]
[null,null,1129]
[null,null,1130]
[null,null,1131]
[null,null,1132]
[null,null,1133]
[null,null,1134]
[null,null,1135]
[null,null,1136]
[null,null,1137]
[null,null,1138]
[null,null,1139]
[null,null,1140]
[null,null,1141]
[null,null,1142]
[null,null,1143]
[null,null,1144]
[null,null,1145]
[null,null,1146]
[null,null,1147]
[null,null,1148]
[null,null,1149]
[null,null,1150]
[null,null,1151]
[null,null,1152]
[null,null,1153]
[null,null,1154]
[null,null,1155]
[null,null,1156]
[null,null,1157]
[null,null,1158]
[null,null,1159]
[null,null,1160]
[null,null,1161]
[null,null,1162]
[null,null,1163]
[null,null,1164]
[null,null,1165]
[null,null,1166]
[null,null,1167]
[null,null,1168]
[null,null,1169]
[null,null,1170]
[null,null,1171]
[null,null,1172]
[null,null,1173]
[null,null,1174]
[null,null,1175]
[null,null,1176]
[null,null,1177]
[null,null,1178]
[null,null,1179]
[null,null,1180]
[null,null,1181]
[null,null,1182]
[null,null,1183]
[null,null,1184]
[null,null,1185]
[null,null,1186]
[null,null,1187]
[null,null,1188]
[null,null,1189]
[null,null,1190]
[null,null,1191]
[null,null,1192]
[null,null,1193]
[null,null,1194]
[null,null,1195]
[null,null,1196]
[null,null,1197]
[null,null,1198]
[null,null,1199]
[null,null,1200]
[null,null,1201]
[null,null,1202]
[null,null,1203]
[null,null,1204]
[null,null,1205]
[null,null,1206]
[null,null,1207]
[null,null,1208]
[null,null,1209]
[null,null,1210]
[null,null,1211]
[null,null,1212]
[null,null,1213]
[null,null,1214]
[null,null,1215]
[null,null,1216]
[null,null,1217]
[null,null,1218]
[null,null,1219]
[null,null,1220]
[null,null,1221]
[null,null,1222]
[null,null,1223]
[null,null,1224]
[null,null,1225]
[null,null,1226]
[null,null,1227]
[null,null,1228]
[null,null,1229]
[null,null,1230]
[null,null,1231]
[null,null,1232]
[null,null,1233]
[null,null,1234]
[null,null,1235]
[null,null,1236]
[null,null,1237]
[null,null,1238]
[null,null,1239]
[null,null,1240]
[null,null,1241]
[null,null,1242]
[null,null,1243]
[null,null,1244]
[null,null,1245]
[null,null,1246]
[null,null,1247]
[null,null,1248]
[null,null,1249]
[null,null,1250]
[null,null,1251]
[null,null,1252]
[null,null,1253]
[null,null,1254]
[null,null,1255]
[null,null,1256]
[null,null,1257]
[null,null,1258]
[null,null,1259]
[null,null,1260]
[null,null,1261]
[null,null,1262]
[null,null,1263]
[null,null,1264]
[null,null,1265]
[null,null,1266]
[null,null,1267]
[null,null,1268]
[null,null,1269]
[null,null,1270]
[null,null,1271]
[null,null,1272]
[null,null,1273]
[null,null,1274]
[null,null,1275]
[null,null,1276]
[null,null,1277]
[null,null,1278]
[null,null,1279]
[null,null,1280]
[null,null,1281]
[null,null,1282]
[null,null,1283]
[null,null,1284]
[null,null,1285]
[null,null,1286]
[null,null,1287]
[null,null,1288]
[null,null,1289]
[null,null,1290]
[null,null,1291]
[null,null,1292]
[null,null,1293]
[null,null,1294]
[null,null,1295]
[null,null,1296]
[null,null,1297]
[null,null,1298]
[null,null,1299]
[null,null,1300]
[null,null,1301]
[null,null,1302]
[null,null,1303]
[null,null,1304]
[null,null,1305]
[null,null,1306]
[null,null,1307]
[null,null,1308]
[null,null,1309]
[null,null,1310]
[null,null,1311]
[null,null,1312]
[null,null,1313]
[null,null,1314]
[null,null,1315]
[null,null,1316]
[null,null,1317]
[null,null,1318]
[null,null,1319]
[null,null,1320]
[null,null,1321]
[null,null,1322]
[null,null,1323]
[null,null,1324]
[null,null,1325]
[null,null,1326]
[null,null,1327]
[null,null,1328]
[null,null,1329]
[null,null,1330]
[null,null,1331]
[null,null,1332]
[null,null,1333]
[null,null,1334]
[null,null,1335]
[null,null,1336]
[null,null,1337]
[null,null,1338]
[null,null,1339]
[null,null,1340]
[null,null,1341]
[null,null,1342]
[null,null,1343]
[null,null,1344]
[null,null,1345]
[null,null,1346]
[null,null,1347]
[null,null,1348]
[null,null,1349]
[null,null,1350]
[null,null,1351]
[null,null,1352]
[null,null,1353]
[null,null,1354]
[null,null,1355]
[null,null,1356]
[null,null,1357]
[null,null,1358]
[null,null,1359]
[null,null,1360]
[null,null,1361]
[null,null,1362]
[null,null,1363]
[null,null,1364]
[null,null,1365]
[null,null,1366]
[null,null,1367]
[null,null,1368]
[null,null,1369]
[null,null,1370]
[null,null,1371]
[null,null,1372]
[null,null,1373]
[null,null,1374]
[null,null,1375]
[null,null,1376]
[null,null,1377]
[null,null,1378]
[null,null,1379]
[null,null,1380]
[null,null,1381]
[null,null,1382]
[null,null,1383]
[null,null,1384]
[null,null,1385]
[null,null,1386]
[null,null,1387]
[null,null,1388]
[null,null,1389]
[null,null,1390]
[null,null,1391]
[null,null,1392]
[null,null,1393]
[null,null,1394]
[null,null,1395]
[null,null,1396]
[null,null,1397]
[null,null,1398]
[null,null,1399]
[null,null,1400]
[null,null,1401]
[null,null,1402]
[null,null,1403]
[null,null,1404]
[null,null,1405]
[null,null,1406]
[null,null,1407]
[null,null,1408]
[null,null,1409]
[null,null,1410]
[null,null,1411]
[null,null,1412]
[null,null,1413]
[null,null,1414]
[null,null,1415]
[null,null,1416]
[null,null,1417]
[null,null,1418]
[null,null,1419]
[null,null,1420]
[null,null,1421]
[null,null,1422]
[null,null,1423]
[null,null,1424]
[null,null,1425]
[null,null,1426]
[null,null,1427]
[null,null,1428]
[null,null,1429]
[null,null,1430]
[null,null,1431]
[null,null,1432]
[null,null,1433]
[null,null,1434]
[null,null,1435]
[null,null,1436]
[null,null,1437]
[null,null,1438]
[null,null,1439]
[null,null,1440]
[null,null,1441]
[null,null,1442]
[null,null,1443]
[null,null,1444]
[null,null,1445]
[null,null,1446]
[null,null,1447]
[null,null,1448]
[null,null,1449]
[null,null,1450]
[null,null,1451]
[null,null,1452]
[null,null,1453]
[null,null,1454]
[null,null,1455]
[null,null,1456]
[null,null,1457]
[null,null,1458]
[null,null,1459]
[null,null,1460]
[null,null,1461]
[null,null,1462]
[null,null,1463]
[null,null,1464]
[null,null,1465]
[null,null,1466]
[null,null,1467]
[null,null,1468]
[null,null,1469]
[null,null,1470]
[null,null,1471]
[null,null,1472]
[null,null,1473]
[null,null,1474]
[null,null,1475]
[null,null,1476]
[null,null,1477]
[null,null,1478]
[null,null,1479]
[null,null,1480]
[null,null,1481]
[null,null,1482]
[null,null,1483]
[null,null,1484]
[null,null,1485]
[null,null,1486]
[null,null,1487]
[null,null,1488]
[null,null,1489]
[null,null,1490]
[null,null,1491]
[null,null,1492]
[null,null,1493]
[null,null,1494]
[null,null,1495]
[null,null,1496]
[null,null,1497]
[null,null,1498]
[null,null,1499]
[null,null,1500]
[null,null,1501]
[null,null,1502]
[null,null,1503]
[null,null,1504]
[null,null,1505]
[null,null,1506]
[null,null,1507]
[null,null,1508]
[null,null,1509]
[null,null,1510]
[null,null,1511]
[null,null,1512]
[null,null,1513]
[null,null,1514]
[null,null,1515]
[null,null,1516]
[null,null,1517]
[null,null,1518]
[null,null,1519]
[null,null,1520]
[null,null,1521]
[null,null,1522]
[null,null,1523]
[null,null,1524]
[null,null,1525]
[null,null,1526]
[null,null,1527]
[null,null,1528]
[null,null,1529]
[null,null,1530]
[null,null,1531]
[null,null,1532]
[null,null,1533]
[null,null,1534]
[null,null,1535]
[null,null,1536]
[null,null,1537]
[null,null,1538]
[null,null,1539]
[null,null,1540]
[null,null,1541]
[null,null,1542]
[null,null,1543]
[null,null,1544]
[null,null,1545]
[null,null,1546]
[null,null,1547]
[null,null,1548]
[null,null,1549]
[null,null,1550]
[null,null,1551]
[null,null,1552]
[null,null,1553]
[null,null,1554]
[null,null,1555]
[null,null,1556]
[null,null,1557]
[null,null,1558]
[null,null,1559]
[null,null,1560]
[null,null,1561]
[null,null,1562]
[null,null,1563]
[null,null,1564]
[null,null,1565]
[null,null,1566]
[null,null,1567]
[null,null,1568]
[null,null,1569]
[null,null,1570]
[null,null,1571]
[null,null,1572]
[null,null,1573]
[null,null,1574]
[null,null,1575]
[null,null,1576]
[null,null,1577]
[null,null,1578]
[null,null,1579]
[null,null,1580]
[null,null,1581]
[null,null,1582]
[null,null,1583]
[null,null,1584]
[null,null,1585]
[null,null,1586]
[null,null,1587]
[null,null,1588]
[null,null,1589]
[null,null,1590]
[null,null,1591]
[null,null,1592]
[null,null,1593]
[null,null,1594]
[null,null,1595]
[null,null,1596]
[null,null,1597]
[null,null,1598]
[null,null,1599]
[null,null,1600]
[null,null,1601]
[null,null,1602]
[null,null,1603]
[null,null,1604]
[null,null,1605]
[null,null,1606]
[null,null,1607]
[null,null,1608]
[null,null,1609]
[null,null,1610]
[null,null,1611]
[null,null,1612]
[null,null,1613]
[null,null,1614]
[null,null,1615]
[null,null,1616]
[null,null,1617]
[null,null,1618]
[null,null,1619]
[null,null,1620]
[null,null,1621]
[null,null,1622]
[null,null,1623]
[null,null,1624]
[null,null,1625]
[null,null,1626]
[null,null,1627]
[null,null,1628]
[null,null,1629]
[null,null,1630]
[null,null,1631]
[null,null,1632]
[null,null,1633]
[null,null,1634]
[null,null,1635]
[null,null,1636]
[null,null,1637]
[null,null,1638]
[null,null,1639]
[null,null,1640]
[null,null,1641]
[null,null,1642]
[null,null,1643]
[null,null,1644]
[null,null,1645]
[null,null,1646]
[null,null,1647]
[null,null,1648]
[null,null,1649]
[null,null,1650]
[null,null,1651]
[null,null,1652]
[null,null,1653]
[null,null,1654]
[null,null,1655]
[null,null,1656]
[null,null,1657]
[null,null,1658]
[null,null,1659]
[null,null,1660]
[null,null,1661]
[null,null,1662]
[null,null,1663]
[null,null,1664]
[null,null,1665]
[null,null,1666]
[null,null,1667]
[null,null,1668]
[null,null,1669]
[null,null,1670]
[null,null,1671]
[null,null,1672]
[null,null,1673]
[null,null,1674]
[null,null,1675]
[null,null,1676]
[null,null,1677]
[null,null,1678]
[null,null,1679]
[null,null,1680]
[null,null,1681]
[null,null,1682]
[null,null,1683]
[null,null,1684]
[null,null,1685]
[null,null,1686]
[null,null,1687]
[null,null,1688]
[null,null,1689]
[null,null,1690]
[null,null,1691]
[null,null,1692]
[null,null,1693]
[null,null,1694]
[null,null,1695]
[null,null,1696]
[null,null,1697]
[null,null,1698]
[null,null,1699]
[null,null,1700]
[null,null,1701]
[null,null,1702]
[null,null,1703]
[null,null,1704]
[null,null,1705]
[null,null,1706]
[null,null,1707]
[null,null,1708]
[null,null,1709]
[null,null,1710]
[null,null,1711]
[null,null,1712]
[null,null,1713]
[null,null,1714]
[null,null,1715]
[null,null,1716]
[null,null,1717]
[null,null,1718]
[null,null,1719]
[null,null,1720]
[null,null,1721]
[null,null,1722]
[null,null,1723]
[null,null,1724]
[null,null,1725]
[null,null,1726]
[null,null,1727]
[null,null,1728]
[null,null,1729]
[null,null,1730]
[null,null,1731]
[null,null,1732]
[null,null,1733]
[null,null,1734]
[null,null,1735]
[null,null,1736]
[null,null,1737]
[null,null,1738]
[null,null,1739]
[null,null,1740]
[null,null,1741]
[null,null,1742]
[null,null,1743]
[null,null,1744]
[null,null,1745]
[null,null,1746]
[null,null,1747]
[null,null,1748]
[null,null,1749]
[null,null,1750]
[null,null,1751]
[null,null,1752]
[null,null,1753]
[null,null,1754]
[null,null,1755]
[null,null,1756]
[null,null,1757]
[null,null,1758]
[null,null,1759]
[null,null,1760]
[null,null,1761]
[null,null,1762]
[null,null,1763]
[null,null,1764]
[null,null,1765]
[null,null,1766]
[null,null,1767]
[null,null,1768]
[null,null,1769]
[null,null,1770]
[null,null,1771]
[null,null,1772]
[null,null,1773]
[null,null,1774]
[null,null,1775]
[null,null,1776]
[null,null,1777]
[null,null,1778]
[null,null,1779]
[null,null,1780]
[null,null,1781]
[null,null,1782]
[null,null,1783]
[null,null,1784]
[null,null,1785]
[null,null,1786]
[null,null,1787]
[null,null,1788]
[null,null,1789]
[null,null,1790]
[null,null,1791]
[null,null,1792]
[null,null,1793]
[null,null,1794]
[null,null,1795]
[null,null,1796]
[null,null,1797]
[null,null,1798]
[null,null,1799]
[null,null,1800]
[null,null,1801]
[null,null,1802]
[null,null,1803]
[null,null,1804]
[null,null,1805]
[null,null,1806]
[null,null,1807]
[null,null,1808]
[null,null,1809]
[null,null,1810]
[null,null,1811]
[null,null,1812]
[null,null,1813]
[null,null,1814]
[null,null,1815]
[null,null,1816]
[null,null,1817]
[null,null,1818]
[null,null,1819]
[null,null,1820]
[null,null,1821]
[null,null,1822]
[null,null,1823]
[null,null,1824]
[null,null,1825]
[null,null,1826]
[null,null,1827]
[null,null,1828]
[null,null,1829]
[null,null,1830]
[null,null,1831]
[null,null,1832]
[null,null,1833]
[null,null,1834]
[null,null,1835]
[null,null,1836]
[null,null,1837]
[null,null,1838]
[null,null,1839]
[null,null,1840]
[null,null,1841]
[null,null,1842]
[null,null,1843]
[null,null,1844]
[null,null,1845]
[null,null,1846]
[null,null,1847]
[null,null,1848]
[null,null,1849]
[null,null,1850]
[null,null,1851]
[null,null,1852]
[null,null,1853]
[null,null,1854]
[null,null,1855]
[null,null,1856]
[null,null,1857]
[null,null,1858]
[null,null,1859]
[null,null,1860]
[null,null,1861]
[null,null,1862]
[null,null,1863]
[null,null,1864]
[null,null,1865]
[null,null,1866]
[null,null,1867]
[null,null,1868]
[null,null,1869]
[null,null,1870]
[null,null,1871]
[null,null,1872]
[null,null,1873]
[null,null,1874]
[null,null,1875]
[null,null,1876]
[null,null,1877]
[null,null,1878]
[null,null,1879]
[null,null,1880]
[null,null,1881]
[null,null,1882]
[null,null,1883]
[null,null,1884]
[null,null,1885]
[null,null,1886]
[null,null,1887]
[null,null,1888]
[null,null,1889]
[null,null,1890]
[null,null,1891]
[null,null,1892]
[null,null,1893]
[null,null,1894]
[null,null,1895]
[null,null,1896]
[null,null,1897]
[null,null,1898]
[null,null,1899]
[null,null,1900]
[null,null,1901]
[null,null,1902]
[null,null,1903]
[null,null,1904]
[null,null,1905]
[null,null,1906]
[null,null,1907]
[null,null,1908]
[null,null,1909]
[null,null,1910]
[null,null,1911]
[null,null,1912]
[null,null,1913]
[null,null,1914]
[null,null,1915]
[null,null,1916]
[null,null,1917]
[null,null,1918]
[null,null,1919]
[null,null,1920]
[null,null,1921]
[null,null,1922]
[null,null,1923]
[null,null,1924]
[null,null,1925]
[null,null,1926]
[null,null,1927]
[null,null,1928]
[null,null,1929]
[null,null,1930]
[null,null,1931]
[null,null,1932]
[null,null,1933]
[null,null,1934]
[null,null,1935]
[null,null,1936]
[null,null,1937]
[null,null,1938]
[null,null,1939]
[null,null,1940]
[null,null,1941]
[null,null,1942]
[null,null,1943]
[null,null,1944]
[null,null,1945]
[null,null,1946]
[null,null,1947]
[null,null,1948]
[null,null,1949]
[null,null,1950]
[null,null,1951]
[null,null,1952]
[null,null,1953]
[null,null,1954]
[null,null,1955]
[null,null,1956]
[null,null,1957]
[null,null,1958]
[null,null,1959]
[null,null,1960]
[null,null,1961]
[null,null,1962]
[null,null,1963]
[null,null,1964]
[null,null,1965]
[null,null,1966]
[null,null,1967]
[null,null,1968]
[null,null,1969]
[null,null,1970]
[null,null,1971]
[null,null,1972]
[null,null,1973]
[null,null,1974]
[null,null,1975]
[null,null,1976]
[null,null,1977]
[null,null,1978]
[null,null,1979]
[null,null,1980]
[null,null,1981]
[null,null,1982]
[null,null,1983]
[null,null,1984]
[null,null,1985]
[null,null,1986]
[null,null,1987]
[null,null,1988]
[null,null,1989]
[null,null,1990]
[null,null,1991]
[null,null,1992]
[null,null,1993]
[null,null,1994]
[null,null,1995]
[null,null,1996]
[null,null,1997]
[null,null,1998]
[null,null,1999]
[null,null,2000]
[null,null,2001]
[null,null,2002]
[null,null,2003]
[null,null,2004]
[null,null,2005]
[null,null,2006]
[null,null,2007]
[null,null,2008]
[null,null,2009]
[null,null,2010]
[null,null,2011]
[null,null,2012]
[null,null,2013]
[null,null,2014]
[null,null,2015]
[null,null,2016]
[null,null,2017]
[null,null,2018]
[null,null,2019]
[null,null,2020]
[null,null,2021]
[null,null,2022]
[null,null,2023]
[null,null,2024]
[null,null,2025]
[null,null,2026]
[null,null,2027]
[null,null,2028]
[null,null,2029]
[null,null,2030]
[null,null,2031]
[null,null,2032]
[null,null,2033]
[null,null,2034]
[null,null,2035]
[null,null,2036]
[null,null,2037]
[null,null,2038]
[null,null,2039]
[null,null,2040]
[null,null,2041]
[null,null,2042]
[null,null,2043]
[null,null,2044]
[null,null,2045]
[null,null,2046]
[null,null,2047]
[null,null,2048]
[null,null,2049]
[null,null,2050]
[null,null,2051]
[null,null,2052]
[null,null,2053]
[null,null,2054]
[null,null,2055]
[null,null,2056]
[null,null,2057]
[null,null,2058]
[null,null,2059]
[null,null,2060]
[null,null,2061]
[null,null,2062]
[null,null,2063]
[null,null,2064]
[null,null,2065]
[null,null,2066]
[null,null,2067]
[null,null,2068]
[null,null,2069]
[null,null,2070]
[null,null,2071]
[null,null,2072]
[null,null,2073]
[null,null,2074]
[null,null,2075]
[null,null,2076]
[null,null,2077]
[null,null,2078]
[null,null,2079]
[null,null,2080]
[null,null,2081]
[null,null,2082]
[null,null,2083]
[null,null,2084]
[null,null,2085]
[null,null,2086]
[null,null,2087]
[null,null,2088]
[null,null,2089]
[null,null,2090]
[null,null,2091]
[null,null,2092]
[null,null,2093]
[null,null,2094]
[null,null,2095]
[null,null,2096]
[null,null,2097]
[null,null,2098]
[null,null,2099]
[null,null,2100]
[null,null,2101]
[null,null,2102]
[null,null,2103]
[null,null,2104]
[null,null,2105]
[null,null,2106]
[null,null,2107]
[null,null,2108]
[null,null,2109]
[null,null,2110]
[null,null,2111]
[null,null,2112]
[null,null,2113]
[null,null,2114]
[null,null,2115]
[null,null,2116]
[null,null,2117]
[null,null,2118]
[null,null,2119]
[null,null,2120]
[null,null,2121]
[null,null,2122]
[null,null,2123]
[null,null,2124]
[null,null,2125]
[null,null,2126]
[null,null,2127]
[null,null,2128]
[null,null,2129]
[null,null,2130]
[null,null,2131]
[null,null,2132]
[null,null,2133]
[null,null,2134]
[null,null,2135]
[null,null,2136]
[null,null,2137]
[null,null,2138]
[null,null,2139]
[null,null,2140]
[null,null,2141]
[null,null,2142]
[null,null,2143]
[null,null,2144]
[null,null,2145]
[null,null,2146]
[null,null,2147]
[null,null,2148]
[null,null,2149]
[null,null,2150]
[null,null,2151]
[null,null,2152]
[null,null,2153]
[null,null,2154]
[null,null,2155]
[null,null,2156]
[null,null,2157]
[null,null,2158]
[null,null,2159]
[null,null,2160]
[null,null,2161]
[null,null,2162]
[null,null,2163]
[null,null,2164]
[null,null,2165]
[null,null,2166]
[null,null,2167]
[null,null,2168]
[null,null,2169]
[null,null,2170]
[null,null,2171]
[null,null,2172]
[null,null,2173]
[null,null,2174]
[null,null,2175]
[null,null,2176]
[null,null,2177]
[null,null,2178]
[null,null,2179]
[null,null,2180]
[null,null,2181]
[null,null,2182]
[null,null,2183]
[null,null,2184]
[null,null,2185]
[null,null,2186]
[null,null,2187]
[null,null,2188]
[null,null,2189]
[null,null,2190]
[null,null,2191]
[null,null,2192]
[null,null,2193]
[null,null,2194]
[null,null,2195]
[null,null,2196]
[null,null,2197]
[null,null,2198]
[null,null,2199]
[null,null,2200]
[null,null,2201]
[null,null,2202]
[null,null,2203]
[null,null,2204]
[null,null,2205]
[null,null,2206]
[null,null,2207]
[null,null,2208]
[null,null,2209]
[null,null,2210]
[null,null,2211]
[null,null,2212]
[null,null,2213]
[null,null,2214]
[null,null,2215]
[null,null,2216]
[null,null,2217]
[null,null,2218]
[null,null,2219]
[null,null,2220]
[null,null,2221]
[null,null,2222]
[null,null,2223]
[null,null,2224]
[null,null,2225]
[null,null,2226]
[null,null,2227]
[null,null,2228]
[null,null,2229]
[null,null,2230]
[null,null,2231]
[null,null,2232]
[null,null,2233]
[null,null,2234]
[null,null,2235]
[null,null,2236]
[null,null,2237]
[null,null,2238]
[null,null,2239]
[null,null,2240]
[null,null,2241]
[null,null,2242]
[null,null,2243]
[null,null,2244]
[null,null,2245]
[null,null,2246]
[null,null,2247]
[null,null,2248]
[null,null,2249]
[null,null,2250]
[null,null,2251]
[null,null,2252]
[null,null,2253]
[null,null,2254]
[null,null,2255]
[null,null,2256]
[null,null,2257]
[null,null,2258]
[null,null,2259]
[null,null,2260]
[null,null,2261]
[null,null,2262]
[null,null,2263]
[null,null,2264]
[null,null,2265]
[null,null,2266]
[null,null,2267]
[null,null,2268]
[null,null,2269]
[null,null,2270]
[null,null,2271]
[null,null,2272]
[null,null,2273]
[null,null,2274]
[null,null,2275]
[null,null,2276]
[null,null,2277]
[null,null,2278]
[null,null,2279]
[null,null,2280]
[null,null,2281]
[null,null,2282]
[null,null,2283]
[null,null,2284]
[null,null,2285]
[null,null,2286]
[null,null,2287]
[null,null,2288]
[null,null,2289]
[null,null,2290]
[null,null,2291]
[null,null,2292]
[null,null,2293]
[null,null,2294]
[null,null,2295]
[null,null,2296]
[null,null,2297]
[null,null,2298]
[null,null,2299]
[null,null,2300]
[null,null,2301]
[null,null,2302]
[null,null,2303]
[null,null,2304]
[null,null,2305]
[null,null,2306]
[null,null,2307]
[null,null,2308]
[null,null,2309]
[null,null,2310]
[null,null,2311]
[null,null,2312]
[null,null,2313]
[null,null,2314]
[null,null,2315]
[null,null,2316]
[null,null,2317]
[null,null,2318]
[null,null,2319]
[null,null,2320]
[null,null,2321]
[null,null,2322]
[null,null,2323]
[null,null,2324]
[null,null,2325]
[null,null,2326]
[null,null,2327]
[null,null,2328]
[null,null,2329]
[null,null,2330]
[null,null,2331]
[null,null,2332]
[null,null,2333]
[null,null,2334]
[null,null,2335]
[null,null,2336]
[null,null,2337]
[null,null,2338]
[null,null,2339]
[null,null,2340]
[null,null,2341]
[null,null,2342]
[null,null,2343]
[null,null,2344]
[null,null,2345]
[null,null,2346]
[null,null,2347]
[null,null,2348]
[null,null,2349]
[null,null,2350]
[null,null,2351]
[null,null,2352]
[null,null,2353]
[null,null,2354]
[null,null,2355]
[null,null,2356]
[null,null,2357]
[null,null,2358]
[null,null,2359]
[null,null,2360]
[null,null,2361]
[null,null,2362]
[null,null,2363]
[null,null,2364]
[null,null,2365]
[null,null,2366]
[null,null,2367]
[null,null,2368]
[null,null,2369]
[null,null,2370]
[null,null,2371]
[null,null,2372]
[null,null,2373]
[null,null,2374]
[null,null,2375]
[null,null,2376]
[null,null,2377]
[null,null,2378]
[null,null,2379]
[null,null,2380]
[null,null,2381]
[null,null,2382]
[null,null,2383]
[null,null,2384]
[null,null,2385]
[null,null,2386]
[null,null,2387]
[null,null,2388]
[null,null,2389]
[null,null,2390]
[null,null,2391]
[null,null,2392]
[null,null,2393]
[null,null,2394]
[null,null,2395]
[null,null,2396]
[null,null,2397]
[null,null,2398]
[null,null,2399]
[null,null,2400]
[null,null,2401]
[null,null,2402]
[null,null,2403]
[null,null,2404]
[null,null,2405]
[null,null,2406]
[null,null,2407]
[null,null,2408]
[null,null,2409]
[null,null,2410]
[null,null,2411]
[null,null,2412]
[null,null,2413]
[null,null,2414]
[null,null,2415]
[null,null,2416]
[null,null,2417]
[null,null,2418]
[null,null,2419]
[null,null,2420]
[null,null,2421]
[null,null,2422]
[null,null,2423]
[null,null,2424]
[null,null,2425]
[null,null,2426]
[null,null,2427]
[null,null,2428]
[null,null,2429]
[null,null,2430]
[null,null,2431]
[null,null,2432]
[null,null,2433]
[null,null,2434]
[null,null,2435]
[null,null,2436]
[null,null,2437]
[null,null,2438]
[null,null,2439]
[null,null,2440]
[null,null,2441]
[null,null,2442]
[null,null,2443]
[null,null,2444]
[null,null,2445]
[null,null,2446]
[null,null,2447]
[null,null,2448]
[null,null,2449]
[null,null,2450]
[null,null,2451]
[null,null,2452]
[null,null,2453]
[null,null,2454]
[null,null,2455]
[null,null,2456]
[null,null,2457]
[null,null,2458]
[null,null,2459]
[null,null,2460]
[null,null,2461]
[null,null,2462]
[null,null,2463]
[null,null,2464]
[null,null,2465]
[null,null,2466]
[null,null,2467]
[null,null,2468]
[null,null,2469]
[null,null,2470]
[null,null,2471]
[null,null,2472]
[null,null,2473]
[null,null,2474]
[null,null,2475]
[null,null,2476]
[null,null,2477]
[null,null,2478]
[null,null,2479]
[null,null,2480]
[null,null,2481]
[null,null,2482]
[null,null,2483]
[null,null,2484]
[null,null,2485]
[null,null,2486]
[null,null,2487]
[null,null,2488]
[null,null,2489]
[null,null,2490]
[null,null,2491]
[null,null,2492]
[null,null,2493]
[null,null,2494]
[null,null,2495]
[null,null,2496]
[null,null,2497]
[null,null,2498]
[null,null,2499]
[null,null,2500]
[null,null,2501]
[null,null,2502]
[null,null,2503]
[null,null,2504]
[null,null,2505]
[null,null,2506]
[null,null,2507]
[null,null,2508]
[null,null,2509]
[null,null,2510]
[null,null,2511]
[null,null,2512]
[null,null,2513]
[null,null,2514]
[null,null,2515]
[null,null,2516]
[null,null,2517]
[null,null,2518]
[null,null,2519]
[null,null,2520]
[null,null,2521]
[null,null,2522]
[null,null,2523]
[null,null,2524]
[null,null,2525]
[null,null,2526]
[null,null,2527]
[null,null,2528]
[null,null,2529]
[null,null,2530]
[null,null,2531]
[null,null,2532]
[null,null,2533]
[null,null,2534]
[null,null,2535]
[null,null,2536]
[null,null,2537]
[null,null,2538]
[null,null,2539]
[null,null,2540]
[null,null,2541]
[null,null,2542]
[null,null,2543]
[null,null,2544]
[null,null,2545]
[null,null,2546]
[null,null,2547]
[null,null,2548]
[null,null,2549]
[null,null,2550]
[null,null,2551]
[null,null,2552]
[null,null,2553]
[null,null,2554]
[null,null,2555]
[null,null,2556]
[null,null,2557]
[null,null,2558]
[null,null,2559]
[null,null,2560]
[null,null,2561]
[null,null,2562]
[null,null,2563]
[null,null,2564]
[null,null,2565]
[null,null,2566]
[null,null,2567]
[null,null,2568]
[null,null,2569]
[null,null,2570]
[null,null,2571]
[null,null,2572]
[null,null,2573]
[null,null,2574]
[null,null,2575]
[null,null,2576]
[null,null,2577]
[null,null,2578]
[null,null,2579]
[null,null,2580]
[null,null,2581]
[null,null,2582]
[null,null,2583]
[null,null,2584]
[null,null,2585]
[null,null,2586]
[null,null,2587]
[null,null,2588]
[null,null,2589]
[null,null,2590]
[null,null,2591]
[null,null,2592]
[null,null,2593]
[null,null,2594]
[null,null,2595]
[null,null,2596]
[null,null,2597]
[null,null,2598]
[null,null,2599]
[null,null,2600]
[null,null,2601]
[null,null,2602]
[null,null,2603]
[null,null,2604]
[null,null,2605]
[null,null,2606]
[null,null,2607]
[null,null,2608]
[null,null,2609]
[null,null,2610]
[null,null,2611]
[null,null,2612]
[null,null,2613]
[null,null,2614]
[null,null,2615]
[null,null,2616]
[null,null,2617]
[null,null,2618]
[null,null,2619]
[null,null,2620]
[null,null,2621]
[null,null,2622]
[null,null,2623]
[null,null,2624]
[null,null,2625]
[null,null,2626]
[null,null,2627]
[null,null,2628]
[null,null,2629]
[null,null,2630]
[null,null,2631]
[null,null,2632]
[null,null,2633]
[null,null,2634]
[null,null,2635]
[null,null,2636]
[null,null,2637]
[null,null,2638]
[null,null,2639]
[null,null,2640]
[null,null,2641]
[null,null,2642]
[null,null,2643]
[null,null,2644]
[null,null,2645]
[null,null,2646]
[null,null,2647]
[null,null,2648]
[null,null,2649]
[null,null,2650]
[null,null,2651]
[null,null,2652]
[null,null,2653]
[null,null,2654]
[null,null,2655]
[null,null,2656]
[null,null,2657]
[null,null,2658]
[null,null,2659]
[null,null,2660]
[null,null,2661]
[null,null,2662]
[null,null,2663]
[null,null,2664]
[null,null,2665]
[null,null,2666]
[null,null,2667]
[null,null,2668]
[null,null,2669]
[null,null,2670]
[null,null,2671]
[null,null,2672]
[null,null,2673]
[null,null,2674]
[null,null,2675]
[null,null,2676]
[null,null,2677]
[null,null,2678]
[null,null,2679]
[null,null,2680]
[null,null,2681]
[null,null,2682]
[null,null,2683]
[null,null,2684]
[null,null,2685]
[null,null,2686]
[null,null,2687]
[null,null,2688]
[null,null,2689]
[null,null,2690]
[null,null,2691]
[null,null,2692]
[null,null,2693]
[null,null,2694]
[null,null,2695]
[null,null,2696]
[null,null,2697]
[null,null,2698]
[null,null,2699]
[null,null,2700]
[null,null,2701]
[null,null,2702]
[null,null,2703]
[null,null,2704]
[null,null,2705]
[null,null,2706]
[null,null,2707]
[null,null,2708]
[null,null,2709]
[null,null,2710]
[null,null,2711]
[null,null,2712]
[null,null,2713]
[null,null,2714]
[null,null,2715]
[null,null,2716]
[null,null,2717]
[null,null,2718]
[null,null,2719]
[null,null,2720]
[null,null,2721]
[null,null,2722]
[null,null,2723]
[null,null,2724]
[null,null,2725]
[null,null,2726]
[null,null,2727]
[null,null,2728]
[null,null,2729]
[null,null,2730]
[null,null,2731]
[null,null,2732]
[null,null,2733]
[null,null,2734]
[null,null,2735]
[null,null,2736]
[null,null,2737]
[null,null,2738]
[null,null,2739]
[null,null,2740]
[null,null,2741]
[null,null,2742]
[null,null,2743]
[null,null,2744]
[null,null,2745]
[null,null,2746]
[null,null,2747]
[null,null,2748]
[null,null,2749]
[null,null,2750]
[null,null,2751]
[null,null,2752]
[null,null,2753]
[null,null,2754]
[null,null,2755]
[null,null,2756]
[null,null,2757]
[null,null,2758]
[null,null,2759]
[null,null,2760]
[null,null,2761]
[null,null,2762]
[null,null,2763]
[null,null,2764]
[null,null,2765]
[null,null,2766]
[null,null,2767]
[null,null,2768]
[null,null,2769]
[null,null,2770]
[null,null,2771]
[null,null,2772]
[null,null,2773]
[null,null,2774]
[null,null,2775]
[null,null,2776]
[null,null,2777]
[null,null,2778]
[null,null,2779]
[null,null,2780]
[null,null,2781]
[null,null,2782]
[null,null,2783]
[null,null,2784]
[null,null,2785]
[null,null,2786]
[null,null,2787]
[null,null,2788]
[null,null,2789]
[null,null,2790]
[null,null,2791]
[null,null,2792]
[null,null,2793]
[null,null,2794]
[null,null,2795]
[null,null,2796]
[null,null,2797]
[null,null,2798]
[null,null,2799]
[null,null,2800]
[null,null,2801]
[null,null,2802]
[null,null,2803]
[null,null,2804]
[null,null,2805]
[null,null,2806]
[null,null,2807]
[null,null,2808]
[null,null,2809]
[null,null,2810]
[null,null,2811]
[null,null,2812]
[null,null,2813]
[null,null,2814]
[null,null,2815]
[null,null,2816]
[null,null,2817]
[null,null,2818]
[null,null,2819]
[null,null,2820]
[null,null,2821]
[null,null,2822]
[null,null,2823]
[null,null,2824]
[null,null,2825]
[null,null,2826]
[null,null,2827]
[null,null,2828]
[null,null,2829]
[null,null,2830]
[null,null,2831]
[null,null,2832]
[null,null,2833]
[null,null,2834]
[null,null,2835]
[null,null,2836]
[null,null,2837]
[null,null,2838]
[null,null,2839]
[null,null,2840]
[null,null,2841]
[null,null,2842]
[null,null,2843]
[null,null,2844]
[null,null,2845]
[null,null,2846]
[null,null,2847]
[null,null,2848]
[null,null,2849]
[null,null,2850]
[null,null,2851]
[null,null,2852]
[null,null,2853]
[null,null,2854]
[null,null,2855]
[null,null,2856]
[null,null,2857]
[null,null,2858]
[null,null,2859]
[null,null,2860]
[null,null,2861]
[null,null,2862]
[null,null,2863]
[null,null,2864]
[null,null,2865]
[null,null,2866]
[null,null,2867]
[null,null,2868]
[null,null,2869]
[null,null,2870]
[null,null,2871]
[null,null,2872]
[null,null,2873]
[null,null,2874]
[null,null,2875]
[null,null,2876]
[null,null,2877]
[null,null,2878]
[null,null,2879]
[null,null,2880]
[null,null,2881]
[null,null,2882]
[null,null,2883]
[null,null,2884]
[null,null,2885]
[null,null,2886]
[null,null,2887]
[null,null,2888]
[null,null,2889]
[null,null,2890]
[null,null,2891]
[null,null,2892]
[null,null,2893]
[null,null,2894]
[null,null,2895]
[null,null,2896]
[null,null,2897]
[null,null,2898]
[null,null,2899]
[null,null,2900]
[null,null,2901]
[null,null,2902]
[null,null,2903]
[null,null,2904]
[null,null,2905]
[null,null,2906]
[null,null,2907]
[null,null,2908]
[null,null,2909]
[null,null,2910]
[null,null,2911]
[null,null,2912]
[null,null,2913]
[null,null,2914]
[null,null,2915]
[null,null,2916]
[null,null,2917]
[null,null,2918]
[null,null,2919]
[null,null,2920]
[null,null,2921]
[null,null,2922]
[null,null,2923]
[null,null,2924]
[null,null,2925]
[null,null,2926]
[null,null,2927]
[null,null,2928]
[null,null,2929]
[null,null,2930]
[null,null,2931]
[null,null,2932]
[null,null,2933]
[null,null,2934]
[null,null,2935]
[null,null,2936]
[null,null,2937]
[null,null,2938]
[null,null,2939]
[null,null,2940]
[null,null,2941]
[null,null,2942]
[null,null,2943]
[null,null,2944]
[null,null,2945]
[null,null,2946]
[null,null,2947]
[null,null,2948]
[null,null,2949]
[null,null,2950]
[null,null,2951]
[null,null,2952]
[null,null,2953]
[null,null,2954]
[null,null,2955]
[null,null,2956]
[null,null,2957]
[null,null,2958]
[null,null,2959]
[null,null,2960]
[null,null,2961]
[null,null,2962]
[null,null,2963]
[null,null,2964]
[null,null,2965]
[null,null,2966]
[null,null,2967]
[null,null,2968]
[null,null,2969]
[null,null,2970]
[null,null,2971]
[null,null,2972]
[null,null,2973]
[null,null,2974]
[null,null,2975]
[null,null,2976]
[null,null,2977]
[null,null,2978]
[null,null,2979]
[null,null,2980]
[null,null,2981]
[null,null,2982]
[null,null,2983]
[null,null,2984]
[null,null,2985]
[null,null,2986]
[null,null,2987]
[null,null,2988]
[null,null,2989]
[null,null,2990]
[null,null,2991]
[null,null,2992]
[null,null,2993]
[null,null,2994]
[null,null,2995]
[null,null,2996]
[null,null,2997]
[null,null,2998]
[null,null,2999]
[null,null,3000]
[null,null,3001]
[null,null,3002]
[null,null,3003]
[null,null,3004]
[null,null,3005]
[null,null,3006]
[null,null,3007]
[null,null,3008]
[null,null,3009]
[null,null,3010]
[null,null,3011]
[null,null,3012]
[null,null,3013]
[null,null,3014]
[null,null,3015]
[null,null,3016]
[null,null,3017]
[null,null,3018]
[null,null,3019]
[null,null,3020]
[null,null,3021]
[null,null,3022]
[null,null,3023]
[null,null,3024]
[null,null,3025]
[null,null,3026]
[null,null,3027]
[null,null,3028]
[null,null,3029]
[null,null,3030]
[null,null,3031]
[null,null,3032]
[null,null,3033]
[null,null,3034]
[null,null,3035]
[null,null,3036]
[null,null,3037]
[null,null,3038]
[null,null,3039]
[null,null,3040]
[null,null,3041]
[null,null,3042]
[null,null,3043]
[null,null,3044]
[null,null,3045]
[null,null,3046]
[null,null,3047]
[null,null,3048]
[null,null,3049]
[null,null,3050]
[null,null,3051]
[null,null,3052]
[null,null,3053]
[null,null,3054]
[null,null,3055]
[null,null,3056]
[null,null,3057]
[null,null,3058]
[null,null,3059]
[null,null,3060]
[null,null,3061]
[null,null,3062]
[null,null,3063]
[null,null,3064]
[null,null,3065]
[null,null,3066]
[null,null,3067]
[null,null,3068]
[null,null,3069]
[null,null,3070]
[null,null,3071]
[null,null,3072]
[null,null,3073]
[null,null,3074]
[null,null,3075]
[null,null,3076]
[null,null,3077]
[null,null,3078]
[null,null,3079]
[null,null,3080]
[null,null,3081]
[null,null,3082]
[null,null,3083]
[null,null,3084]
[null,null,3085]
[null,null,3086]
[null,null,3087]
[null,null,3088]
[null,null,3089]
[null,null,3090]
[null,null,3091]
[null,null,3092]
[null,null,3093]
[null,null,3094]
[null,null,3095]
[null,null,3096]
[null,null,3097]
[null,null,3098]
[null,null,3099]
[null,null,3100]
[null,null,3101]
[null,null,3102]
[null,null,3103]
[null,null,3104]
[null,null,3105]
[null,null,3106]
[null,null,3107]
[null,null,3108]
[null,null,3109]
[null,null,3110]
[null,null,3111]
[null,null,3112]
[null,null,3113]
[null,null,3114]
[null,null,3115]
[null,null,3116]
[null,null,3117]
[null,null,3118]
[null,null,3119]
[null,null,3120]
[null,null,3121]
[null,null,3122]
[null,null,3123]
[null,null,3124]
[null,null,3125]
[null,null,3126]
[null,null,3127]
[null,null,3128]
[null,null,3129]
[null,null,3130]
[null,null,3131]
[null,null,3132]
[null,null,3133]
[null,null,3134]
[null,null,3135]
[null,null,3136]
[null,null,3137]
[null,null,3138]
[null,null,3139]
[null,null,3140]
[null,null,3141]
[null,null,3142]
[null,null,3143]
[null,null,3144]
[null,null,3145]
[null,null,3146]
[null,null,3147]
[null,null,3148]
[null,null,3149]
[null,null,3150]
[null,null,3151]
[null,null,3152]
[null,null,3153]
[null,null,3154]
[null,null,3155]
[null,null,3156]
[null,null,3157]
[null,null,3158]
[null,null,3159]
[null,null,3160]
[null,null,3161]
[null,null,3162]
[null,null,3163]
[null,null,3164]
[null,null,3165]
[null,null,3166]
[null,null,3167]
[null,null,3168]
[null,null,3169]
[null,null,3170]
[null,null,3171]
[null,null,3172]
[null,null,3173]
[null,null,3174]
[null,null,3175]
[null,null,3176]
[null,null,3177]
[null,null,3178]
[null,null,3179]
[null,null,3180]
[null,null,3181]
[null,null,3182]
[null,null,3183]
[null,null,3184]
[null,null,3185]
[null,null,3186]
[null,null,3187]
[null,null,3188]
[null,null,3189]
[null,null,3190]
[null,null,3191]
[null,null,3192]
[null,null,3193]
[null,null,3194]
[null,null,3195]
[null,null,3196]
[null,null,3197]
[null,null,3198]
[null,null,3199]
[null,null,3200]
[null,null,3201]
[null,null,3202]
[null,null,3203]
[null,null,3204]
[null,null,3205]
[null,null,3206]
[null,null,3207]
[null,null,3208]
[null,null,3209]
[null,null,3210]
[null,null,3211]
[null,null,3212]
[null,null,3213]
[null,null,3214]
[null,null,3215]
[null,null,3216]
[null,null,3217]
[null,null,3218]
[null,null,3219]
[null,null,3220]
[null,null,3221]
[null,null,3222]
[null,null,3223]
[null,null,3224]
[null,null,3225]
[null,null,3226]
[null,null,3227]
[null,null,3228]
[null,null,3229]
[null,null,3230]
[null,null,3231]
[null,null,3232]
[null,null,3233]
[null,null,3234]
[null,null,3235]
[null,null,3236]
[null,null,3237]
[null,null,3238]
[null,null,3239]
[null,null,3240]
[null,null,3241]
[null,null,3242]
[null,null,3243]
[null,null,3244]
[null,null,3245]
[null,null,3246]
[null,null,3247]
[null,null,3248]
[null,null,3249]
[null,null,3250]
[null,null,3251]
[null,null,3252]
[null,null,3253]
[null,null,3254]
[null,null,3255]
[null,null,3256]
[null,null,3257]
[null,null,3258]
[null,null,3259]
[null,null,3260]
[null,null,3261]
[null,null,3262]
[null,null,3263]
[null,null,3264]
[null,null,3265]
[null,null,3266]
[null,null,3267]
[null,null,3268]
[null,null,3269]
[null,null,3270]
[null,null,3271]
[null,null,3272]
[null,null,3273]
[null,null,3274]
[null,null,3275]
[null,null,3276]
[null,null,3277]
[null,null,3278]
[null,null,3279]
[null,null,3280]
[null,null,3281]
[null,null,3282]
[null,null,3283]
[null,null,3284]
[null,null,3285]
[null,null,3286]
[null,null,3287]
[null,null,3288]
[null,null,3289]
[null,null,3290]
[null,null,3291]
[null,null,3292]
[null,null,3293]
[null,null,3294]
[null,null,3295]
[null,null,3296]
[null,null,3297]
[null,null,3298]
[null,null,3299]
[null,null,3300]
[null,null,3301]
[null,null,3302]
[null,null,3303]
[null,null,3304]
[null,null,3305]
[null,null,3306]
[null,null,3307]
[null,null,3308]
[null,null,3309]
[null,null,3310]
[null,null,3311]
[null,null,3312]
[null,null,3313]
[null,null,3314]
[null,null,3315]
[null,null,3316]
[null,null,3317]
[null,null,3318]
[null,null,3319]
[null,null,3320]
[null,null,3321]
[null,null,3322]
[null,null,3323]
[null,null,3324]
[null,null,3325]
[null,null,3326]
[null,null,3327]
[null,null,3328]
[null,null,3329]
[null,null,3330]
[null,null,3331]
[null,null,3332]
[null,null,3333]
[null,null,3334]
[null,null,3335]
[null,null,3336]
[null,null,3337]
[null,null,3338]
[null,null,3339]
[null,null,3340]
[null,null,3341]
[null,null,3342]
[null,null,3343]
[null,null,3344]
[null,null,3345]
[null,null,3346]
[null,null,3347]
[null,null,3348]
[null,null,3349]
[null,null,3350]
[null,null,3351]
[null,null,3352]
[null,null,3353]
[null,null,3354]
[null,null,3355]
[null,null,3356]
[null,null,3357]
[null,null,3358]
[null,null,3359]
[null,null,3360]
[null,null,3361]
[null,null,3362]
[null,null,3363]
[null,null,3364]
[null,null,3365]
[null,null,3366]
[null,null,3367]
[null,null,3368]
[null,null,3369]
[null,null,3370]
[null,null,3371]
[null,null,3372]
[null,null,3373]
[null,null,3374]
[null,null,3375]
[null,null,3376]
[null,null,3377]
[null,null,3378]
[null,null,3379]
[null,null,3380]
[null,null,3381]
[null,null,3382]
[null,null,3383]
[null,null,3384]
[null,null,3385]
[null,null,3386]
[null,null,3387]
[null,null,3388]
[null,null,3389]
[null,null,3390]
[null,null,3391]
[null,null,3392]
[null,null,3393]
[null,null,3394]
[null,null,3395]
[null,null,3396]
[null,null,3397]
[null,null,3398]
[null,null,3399]
[null,null,3400]
[null,null,3401]
[null,null,3402]
[null,null,3403]
[null,null,3404]
[null,null,3405]
[null,null,3406]
[null,null,3407]
[null,null,3408]
[null,null,3409]
[null,null,3410]
[null,null,3411]
[null,null,3412]
[null,null,3413]
[null,null,3414]
[null,null,3415]
[null,null,3416]
[null,null,3417]
[null,null,3418]
[null,null,3419]
[null,null,3420]
[null,null,3421]
[null,null,3422]
[null,null,3423]
[null,null,3424]
[null,null,3425]
[null,null,3426]
[null,null,3427]
[null,null,3428]
[null,null,3429]
[null,null,3430]
[null,null,3431]
[null,null,3432]
[null,null,3433]
[null,null,3434]
[null,null,3435]
[null,null,3436]
[null,null,3437]
[null,null,3438]
[null,null,3439]
[null,null,3440]
[null,null,3441]
[null,null,3442]
[null,null,3443]
[null,null,3444]
[null,null,3445]
[null,null,3446]
[null,null,3447]
[null,null,3448]
[null,null,3449]
[null,null,3450]
[null,null,3451]
[null,null,3452]
[null,null,3453]
[null,null,3454]
[null,null,3455]
[null,null,3456]
[null,null,3457]
[null,null,3458]
[null,null,3459]
[null,null,3460]
[null,null,3461]
[null,null,3462]
[null,null,3463]
[null,null,3464]
[null,null,3465]
[null,null,3466]
[null,null,3467]
[null,null,3468]
[null,null,3469]
[null,null,3470]
[null,null,3471]
[null,null,3472]
[null,null,3473]
[null,null,3474]
[null,null,3475]
[null,null,3476]
[null,null,3477]
[null,null,3478]
[null,null,3479]
[null,null,3480]
[null,null,3481]
[null,null,3482]
[null,null,3483]
[null,null,3484]
[null,null,3485]
[null,null,3486]
[null,null,3487]
[null,null,3488]
[null,null,3489]
[null,null,3490]
[null,null,3491]
[null,null,3492]
[null,null,3493]
[null,null,3494]
[null,null,3495]
[null,null,3496]
[null,null,3497]
[null,null,3498]
[null,null,3499]
[null,null,3500]
[null,null,3501]
[null,null,3502]
[null,null,3503]
[null,null,3504]
[null,null,3505]
[null,null,3506]
[null,null,3507]
[null,null,3508]
[null,null,3509]
[null,null,3510]
[null,null,3511]
[null,null,3512]
[null,null,3513]
[null,null,3514]
[null,null,3515]
[null,null,3516]
[null,null,3517]
[null,null,3518]
[null,null,3519]
[null,null,3520]
[null,null,3521]
[null,null,3522]
[null,null,3523]
[null,null,3524]
[null,null,3525]
[null,null,3526]
[null,null,3527]
[null,null,3528]
[null,null,3529]
[null,null,3530]
[null,null,3531]
[null,null,3532]
[null,null,3533]
[null,null,3534]
[null,null,3535]
[null,null,3536]
[null,null,3537]
[null,null,3538]
[null,null,3539]
[null,null,3540]
[null,null,3541]
[null,null,3542]
[null,null,3543]
[null,null,3544]
[null,null,3545]
[null,null,3546]
[null,null,3547]
[null,null,3548]
[null,null,3549]
[null,null,3550]
[null,null,3551]
[null,null,3552]
[null,null,3553]
[null,null,3554]
[null,null,3555]
[null,null,3556]
[null,null,3557]
[null,null,3558]
[null,null,3559]
[null,null,3560]
[null,null,3561]
[null,null,3562]
[null,null,3563]
[null,null,3564]
[null,null,3565]
[null,null,3566]
[null,null,3567]
[null,null,3568]
[null,null,3569]
[null,null,3570]
[null,null,3571]
[null,null,3572]
[null,null,3573]
[null,null,3574]
[null,null,3575]
[null,null,3576]
[null,null,3577]
[null,null,3578]
[null,null,3579]
[null,null,3580]
[null,null,3581]
[null,null,3582]
[null,null,3583]
[null,null,3584]
[null,null,3585]
[null,null,3586]
[null,null,3587]
[null,null,3588]
[null,null,3589]
[null,null,3590]
[null,null,3591]
[null,null,3592]
[null,null,3593]
[null,null,3594]
[null,null,3595]
[null,null,3596]
[null,null,3597]
[null,null,3598]
[null,null,3599]
[null,null,3600]
[null,null,3601]
[null,null,3602]
[null,null,3603]
[null,null,3604]
[null,null,3605]
[null,null,3606]
[null,null,3607]
[null,null,3608]
[null,null,3609]
[null,null,3610]
[null,null,3611]
[null,null,3612]
[null,null,3613]
[null,null,3614]
[null,null,3615]
[null,null,3616]
[null,null,3617]
[null,null,3618]
[null,null,3619]
[null,null,3620]
[null,null,3621]
[null,null,3622]
[null,null,3623]
[null,null,3624]
[null,null,3625]
[null,null,3626]
[null,null,3627]
[null,null,3628]
[null,null,3629]
[null,null,3630]
[null,null,3631]
[null,null,3632]
[null,null,3633]
[null,null,3634]
[null,null,3635]
[null,null,3636]
[null,null,3637]
[null,null,3638]
[null,null,3639]
[null,null,3640]
[null,null,3641]
[null,null,3642]
[null,null,3643]
[null,null,3644]
[null,null,3645]
[null,null,3646]
[null,null,3647]
[null,null,3648]
[null,null,3649]
[null,null,3650]
[null,null,3651]
[null,null,3652]
[null,null,3653]
[null,null,3654]
[null,null,3655]
[null,null,3656]
[null,null,3657]
[null,null,3658]
[null,null,3659]
[null,null,3660]
[null,null,3661]
[null,null,3662]
[null,null,3663]
[null,null,3664]
[null,null,3665]
[null,null,3666]
[null,null,3667]
[null,null,3668]
[null,null,3669]
[null,null,3670]
[null,null,3671]
[null,null,3672]
[null,null,3673]
[null,null,3674]
[null,null,3675]
[null,null,3676]
[null,null,3677]
[null,null,3678]
[null,null,3679]
[null,null,3680]
[null,null,3681]
[null,null,3682]
[null,null,3683]
[null,null,3684]
[null,null,3685]
[null,null,3686]
[null,null,3687]
[null,null,3688]
[null,null,3689]
[null,null,3690]
[null,null,3691]
[null,null,3692]
[null,null,3693]
[null,null,3694]
[null,null,3695]
[null,null,3696]
[null,null,3697]
[null,null,3698]
[null,null,3699]
[null,null,3700]
[null,null,3701]
[null,null,3702]
[null,null,3703]
[null,null,3704]
[null,null,3705]
[null,null,3706]
[null,null,3707]
[null,null,3708]
[null,null,3709]
[null,null,3710]
[null,null,3711]
[null,null,3712]
[null,null,3713]
[null,null,3714]
[null,null,3715]
[null,null,3716]
[null,null,3717]
[null,null,3718]
[null,null,3719]
[null,null,3720]
[null,null,3721]
[null,null,3722]
[null,null,3723]
[null,null,3724]
[null,null,3725]
[null,null,3726]
[null,null,3727]
[null,null,3728]
[null,null,3729]
[null,null,3730]
[null,null,3731]
[null,null,3732]
[null,null,3733]
[null,null,3734]
[null,null,3735]
[null,null,3736]
[null,null,3737]
[null,null,3738]
[null,null,3739]
[null,null,3740]
[null,null,3741]
[null,null,3742]
[null,null,3743]
[null,null,3744]
[null,null,3745]
[null,null,3746]
[null,null,3747]
[null,null,3748]
[null,null,3749]
[null,null,3750]
[null,null,3751]
[null,null,3752]
[null,null,3753]
[null,null,3754]
[null,null,3755]
[null,null,3756]
[null,null,3757]
[null,null,3758]
[null,null,3759]
[null,null,3760]
[null,null,3761]
[null,null,3762]
[null,null,3763]
[null,null,3764]
[null,null,3765]
[null,null,3766]
[null,null,3767]
[null,null,3768]
[null,null,3769]
[null,null,3770]
[null,null,3771]
[null,null,3772]
[null,null,3773]
[null,null,3774]
[null,null,3775]
[null,null,3776]
[null,null,3777]
[null,null,3778]
[null,null,3779]
[null,null,3780]
[null,null,3781]
[null,null,3782]
[null,null,3783]
[null,null,3784]
[null,null,3785]
[null,null,3786]
[null,null,3787]
[null,null,3788]
[null,null,3789]
[null,null,3790]
[null,null,3791]
[null,null,3792]
[null,null,3793]
[null,null,3794]
[null,null,3795]
[null,null,3796]
[null,null,3797]
[null,null,3798]
[null,null,3799]
[null,null,3800]
[null,null,3801]
[null,null,3802]
[null,null,3803]
[null,null,3804]
[null,null,3805]
[null,null,3806]
[null,null,3807]
[null,null,3808]
[null,null,3809]
[null,null,3810]
[null,null,3811]
[null,null,3812]
[null,null,3813]
[null,null,3814]
[null,null,3815]
[null,null,3816]
[null,null,3817]
[null,null,3818]
[null,null,3819]
[null,null,3820]
[null,null,3821]
[null,null,3822]
[null,null,3823]
[null,null,3824]
[null,null,3825]
[null,null,3826]
[null,null,3827]
[null,null,3828]
[null,null,3829]
[null,null,3830]
[null,null,3831]
[null,null,3832]
[null,null,3833]
[null,null,3834]
[null,null,3835]
[null,null,3836]
[null,null,3837]
[null,null,3838]
[null,null,3839]
[null,null,3840]
[null,null,3841]
[null,null,3842]
[null,null,3843]
[null,null,3844]
[null,null,3845]
[null,null,3846]
[null,null,3847]
[null,null,3848]
[null,null,3849]
[null,null,3850]
[null,null,3851]
[null,null,3852]
[null,null,3853]
[null,null,3854]
[null,null,3855]
[null,null,3856]
[null,null,3857]
[null,null,3858]
[null,null,3859]
[null,null,3860]
[null,null,3861]
[null,null,3862]
[null,null,3863]
[null,null,3864]
[null,null,3865]
[null,null,3866]
[null,null,3867]
[null,null,3868]
[null,null,3869]
[null,null,3870]
[null,null,3871]
[null,null,3872]
[null,null,3873]
[null,null,3874]
[null,null,3875]
[null,null,3876]
[null,null,3877]
[null,null,3878]
[null,null,3879]
[null,null,3880]
[null,null,3881]
[null,null,3882]
[null,null,3883]
[null,null,3884]
[null,null,3885]
[null,null,3886]
[null,null,3887]
[null,null,3888]
[null,null,3889]
[null,null,3890]
[null,null,3891]
[null,null,3892]
[null,null,3893]
[null,null,3894]
[null,null,3895]
[null,null,3896]
[null,null,3897]
[null,null,3898]
[null,null,3899]
[null,null,3900]
[null,null,3901]
[null,null,3902]
[null,null,3903]
[null,null,3904]
[null,null,3905]
[null,null,3906]
[null,null,3907]
[null,null,3908]
[null,null,3909]
[null,null,3910]
[null,null,3911]
[null,null,3912]
[null,null,3913]
[null,null,3914]
[null,null,3915]
[null,null,3916]
[null,null,3917]
[null,null,3918]
[null,null,3919]
[null,null,3920]
[null,null,3921]
[null,null,3922]
[null,null,3923]
[null,null,3924]
[null,null,3925]
[null,null,3926]
[null,null,3927]
[null,null,3928]
[null,null,3929]
[null,null,3930]
[null,null,3931]
[null,null,3932]
[null,null,3933]
[null,null,3934]
[null,null,3935]
[null,null,3936]
[null,null,3937]
[null,null,3938]
[null,null,3939]
[null,null,3940]
[null,null,3941]
[null,null,3942]
[null,null,3943]
[null,null,3944]
[null,null,3945]
[null,null,3946]
[null,null,3947]
[null,null,3948]
[null,null,3949]
[null,null,3950]
[null,null,3951]
[null,null,3952]
[null,null,3953]
[null,null,3954]
[null,null,3955]
[null,null,3956]
[null,null,3957]
[null,null,3958]
[null,null,3959]
[null,null,3960]
[null,null,3961]
[null,null,3962]
[null,null,3963]
[null,null,3964]
[null,null,3965]
[null,null,3966]
[null,null,3967]
[null,null,3968]
[null,null,3969]
[null,null,3970]
[null,null,3971]
[null,null,3972]
[null,null,3973]
[null,null,3974]
[null,null,3975]
[null,null,3976]
[null,null,3977]
[null,null,3978]
[null,null,3979]
[null,null,3980]
[null,null,3981]
[null,null,3982]
[null,null,3983]
[null,null,3984]
[null,null,3985]
[null,null,3986]
[null,null,3987]
[null,null,3988]
[null,null,3989]
[null,null,3990]
[null,null,3991]
[null,null,3992]
[null,null,3993]
[null,null,3994]
[null,null,3995]
[null,null,3996]
[null,null,3997]
[null,null,3998]
[null,null,3999]
[null,null,4000]
[null,null,4001]
[null,null,4002]
[null,null,4003]
[null,null,4004]
[null,null,4005]
[null,null,4006]
[null,null,4007]
[null,null,4008]
[null,null,4009]
[null,null,4010]
[null,null,4011]
[null,null,4012]
[null,null,4013]
[null,null,4014]
[null,null,4015]
[null,null,4016]
[null,null,4017]
[null,null,4018]
[null,null,4019]
[null,null,4020]
[null,null,4021]
[null,null,4022]
[null,null,4023]
[null,null,4024]
[null,null,4025]
[null,null,4026]
[null,null,4027]
[null,null,4028]
[null,null,4029]
[null,null,4030]
[null,null,4031]
[null,null,4032]
[null,null,4033]
[null,null,4034]
[null,null,4035]
[null,null,4036]
[null,null,4037]
[null,null,4038]
[null,null,4039]
[null,null,4040]
[null,null,4041]
[null,null,4042]
[null,null,4043]
[null,null,4044]
[null,null,4045]
[null,null,4046]
[null,null,4047]
[null,null,4048]
[null,null,4049]
[null,null,4050]
[null,null,4051]
[null,null,4052]
[null,null,4053]
[null,null,4054]
[null,null,4055]
[null,null,4056]
[null,null,4057]
[null,null,4058]
[null,null,4059]
[null,null,4060]
[null,null,4061]
[null,null,4062]
[null,null,4063]
[null,null,4064]
[null,null,4065]
[null,null,4066]
[null,null,4067]
[null,null,4068]
[null,null,4069]
[null,null,4070]
[null,null,4071]
[null,null,4072]
[null,null,4073]
[null,null,4074]
[null,null,4075]
[null,null,4076]
[null,null,4077]
[null,null,4078]
[null,null,4079]
[null,null,4080]
[null,null,4081]
[null,null,4082]
[null,null,4083]
[null,null,4084]
[null,null,4085]
[null,null,4086]
[null,null,4087]
[null,null,4088]
[null,null,4089]
[null,null,4090]
[null,null,4091]
[null,null,4092]
[null,null,4093]
[null,null,4094]
[null,null,4095]

{"sheet":"DDR3_PLL","index":5,"n_rows":4282,"n_cols":15,"rows_kept":4282,"cut":false,"hidden":false,"merged":[[0,5,1,11]]}
[null,null,null,null,null,"DDR3 CLOCKING SECTION"]
[]
[]
[null,null,null,null,null,null,null,null,"DDR3 PLL"]
[]
[null,null,null,null,null,null,null,null,{"$f":"IF(I7<700,\"OUT OF RANGE\",IF(I7>4000,\"OUT OF RANGE\",\"\"))","v":""}]
[null,null,"DDR3CLK (P/N)",null,null,"PLLD",{"$f":"SUM(C8/E187)","v":66.667000000000002},null,{"$f":"SUM(G7*F187)","v":1133.3389999999999},null,"÷",{"$f":"SUM(I7/(K8))","v":566.66949999999997}]
[null,null,66.667000000000002,null,null,0,null,null,null,null,2,null,null,{"$f":"IF(I14,\"\",IF(N9<400,\"OUT OF RANGE\",IF(N9>800,\"OUT OF RANGE\",\"\")))","v":""}]
[null,null,null,null,null,null,null,null,null,null,null,null,null,{"$f":"IF(I14,K11,L7)","v":566.66949999999997},"DDR3 CLKOUT"]
[null,null,null,null,null,null,null,"PLLM",null,null,null,null,null,null,{"$f":"IF(I14,\"INVALID\",(N9))","v":566.66949999999997}]
[null,null,null,null,null,null,null,16,null,null,{"$f":"SUM(C8)","v":66.667000000000002},null,null,null,{"$f":"IF(I14,\"\",IF(O10<400,\"OUT OF RANGE\",IF(O10>800,\"OUT OF RANGE\",\"\")))","v":""}]
[]
[null,null,null,null,null,null,null,null,"BYPASS",null,null,null,null,null,"DDR3 Data Rate"]
[null,null,null,null,null,null,null,null,0,null,null,null,null,null,{"$f":"IF(I14,\"INVALID\",(O10*2))","v":1133.3389999999999}]
["Registers:",null,null,null,null,null,null,null,null,null,null,null,null,null,{"$f":"IF(I18,\"\",IF(O14<800,\"OUT OF RANGE\",IF(O14>1600,\"OUT OF RANGE\",\"\")))","v":""}]
["Name","Bit Position","Value"]
["DDR3PLLCTL0.PLLD","5 : 0",{"$f":"CONCATENATE(\"0x\",DEC2HEX(F8,2))","v":"0x00"},null,null,"Note: "]
["DDR3PLLCTL0.PLLM","18 : 6",{"$f":"CONCATENATE(\"0x\",DEC2HEX(H11,4))","v":"0x0010"},null,null,"1. The DDR3 device can operate  800/1066/1333/1600 MT/Sec."]
["DDR3PLLCTL0.BYPASS",23,{"$f":"CONCATENATE(\"0x\",DEC2HEX(I14,1))","v":"0x0"},null,null,"2. The DDR3 CLKOUT frequency will be twice of the PLLOUT and DDR3 data rate will be twice of the DDR3 frequency."]
[null,null,null,null,null,"3. Please refer instructions for clarification on actual PLLD/PLLM and its register value."]
[]
[]
[]
[]
[]
[]
[]
[]
[]
[]
[]
[]
[]
[]
[]
[]
[]
[]
[]
[]
[]
[]
[]
[]
[]
[]
[]
[]
[]
[]
[]
[]
[]
[]
[]
[]
[]
[]
[]
[]
[]
[]
[]
[]
[]
[]
[]
[]
[]
[]
[]
[]
[]
[]
[]
[]
[]
[]
[]
[]
[]
[]
[]
[]
[]
[]
[]
[]
[]
[]
[]
[]
[]
[]
[]
[]
[]
[]
[]
[]
[]
[]
[]
[]
[]
[]
[]
[]
[]
[]
[]
[]
[]
[]
[]
[]
[]
[]
[]
[]
[]
[]
[]
[]
[]
[]
[]
[]
[]
[]
[]
[]
[]
[]
[]
[]
[]
[]
[]
[]
[]
[]
[]
[]
[]
[]
[]
[]
[]
[]
[]
[]
[]
[]
[]
[]
[]
[]
[]
[]
[]
[]
[]
[]
[]
[]
[]
[]
[]
[]
[]
[]
[]
[]
[]
[]
[]
[]
[]
[]
[]
[]
[]
[]
[]
["PLLM","PRED","BYPASS",null,"PREDV_PLUS","PLLM_PLUS","DIVIEDBYTWO","CLKOD"]
[0,0,0,{"$f":"IF(I14=1,0,IF(O10<400,1,IF(O10>800,1,0)))","v":0},{"$f":"SUM(F8+1)","v":1},{"$f":"SUM(H11+1)","v":17},{"$f":"SUM(K8+1)","v":3},0]
[1,1,1,{"$f":"IF(I14=1,0,IF(N9<200,1,IF(N9>400,1,0)))","v":1},null,null,null,1]
[2,2,null,{"$f":"IF(I14=1,0,IF(O14<800,1,IF(O14>1600,1,0)))","v":0},null,null,null,3]
[3,3,null,null,null,null,null,5]
[4,4,null,null,null,null,null,7]
[5,5,null,null,null,null,null,9]
[6,6,null,null,null,null,null,11]
[7,7,null,null,null,null,null,13]
[8,8,null,null,null,null,null,15]
[9,9]
[10,10]
[11,11]
[12,12]
[13,13]
[14,14]
[15,15]
[16,16]
[17,17]
[18,18]
[19,19]
[20,20]
[21,21]
[22,22]
[23,23]
[24,24]
[25,25]
[26,26]
[27,27]
[28,28]
[29,29]
[30,30]
[31,31]
[32,32]
[33,33]
[34,34]
[35,35]
[36,36]
[37,37]
[38,38]
[39,39]
[40,40]
[41,41]
[42,42]
[43,43]
[44,44]
[45,45]
[46,46]
[47,47]
[48,48]
[49,49]
[50,50]
[51,51]
[52,52]
[53,53]
[54,54]
[55,55]
[56,56]
[57,57]
[58,58]
[59,59]
[60,60]
[61,61]
[62,62]
[63,63]
[64]
[65]
[66]
[67]
[68]
[69]
[70]
[71]
[72]
[73]
[74]
[75]
[76]
[77]
[78]
[79]
[80]
[81]
[82]
[83]
[84]
[85]
[86]
[87]
[88]
[89]
[90]
[91]
[92]
[93]
[94]
[95]
[96]
[97]
[98]
[99]
[100]
[101]
[102]
[103]
[104]
[105]
[106]
[107]
[108]
[109]
[110]
[111]
[112]
[113]
[114]
[115]
[116]
[117]
[118]
[119]
[120]
[121]
[122]
[123]
[124]
[125]
[126]
[127]
[128]
[129]
[130]
[131]
[132]
[133]
[134]
[135]
[136]
[137]
[138]
[139]
[140]
[141]
[142]
[143]
[144]
[145]
[146]
[147]
[148]
[149]
[150]
[151]
[152]
[153]
[154]
[155]
[156]
[157]
[158]
[159]
[160]
[161]
[162]
[163]
[164]
[165]
[166]
[167]
[168]
[169]
[170]
[171]
[172]
[173]
[174]
[175]
[176]
[177]
[178]
[179]
[180]
[181]
[182]
[183]
[184]
[185]
[186]
[187]
[188]
[189]
[190]
[191]
[192]
[193]
[194]
[195]
[196]
[197]
[198]
[199]
[200]
[201]
[202]
[203]
[204]
[205]
[206]
[207]
[208]
[209]
[210]
[211]
[212]
[213]
[214]
[215]
[216]
[217]
[218]
[219]
[220]
[221]
[222]
[223]
[224]
[225]
[226]
[227]
[228]
[229]
[230]
[231]
[232]
[233]
[234]
[235]
[236]
[237]
[238]
[239]
[240]
[241]
[242]
[243]
[244]
[245]
[246]
[247]
[248]
[249]
[250]
[251]
[252]
[253]
[254]
[255]
[256]
[257]
[258]
[259]
[260]
[261]
[262]
[263]
[264]
[265]
[266]
[267]
[268]
[269]
[270]
[271]
[272]
[273]
[274]
[275]
[276]
[277]
[278]
[279]
[280]
[281]
[282]
[283]
[284]
[285]
[286]
[287]
[288]
[289]
[290]
[291]
[292]
[293]
[294]
[295]
[296]
[297]
[298]
[299]
[300]
[301]
[302]
[303]
[304]
[305]
[306]
[307]
[308]
[309]
[310]
[311]
[312]
[313]
[314]
[315]
[316]
[317]
[318]
[319]
[320]
[321]
[322]
[323]
[324]
[325]
[326]
[327]
[328]
[329]
[330]
[331]
[332]
[333]
[334]
[335]
[336]
[337]
[338]
[339]
[340]
[341]
[342]
[343]
[344]
[345]
[346]
[347]
[348]
[349]
[350]
[351]
[352]
[353]
[354]
[355]
[356]
[357]
[358]
[359]
[360]
[361]
[362]
[363]
[364]
[365]
[366]
[367]
[368]
[369]
[370]
[371]
[372]
[373]
[374]
[375]
[376]
[377]
[378]
[379]
[380]
[381]
[382]
[383]
[384]
[385]
[386]
[387]
[388]
[389]
[390]
[391]
[392]
[393]
[394]
[395]
[396]
[397]
[398]
[399]
[400]
[401]
[402]
[403]
[404]
[405]
[406]
[407]
[408]
[409]
[410]
[411]
[412]
[413]
[414]
[415]
[416]
[417]
[418]
[419]
[420]
[421]
[422]
[423]
[424]
[425]
[426]
[427]
[428]
[429]
[430]
[431]
[432]
[433]
[434]
[435]
[436]
[437]
[438]
[439]
[440]
[441]
[442]
[443]
[444]
[445]
[446]
[447]
[448]
[449]
[450]
[451]
[452]
[453]
[454]
[455]
[456]
[457]
[458]
[459]
[460]
[461]
[462]
[463]
[464]
[465]
[466]
[467]
[468]
[469]
[470]
[471]
[472]
[473]
[474]
[475]
[476]
[477]
[478]
[479]
[480]
[481]
[482]
[483]
[484]
[485]
[486]
[487]
[488]
[489]
[490]
[491]
[492]
[493]
[494]
[495]
[496]
[497]
[498]
[499]
[500]
[501]
[502]
[503]
[504]
[505]
[506]
[507]
[508]
[509]
[510]
[511]
[512]
[513]
[514]
[515]
[516]
[517]
[518]
[519]
[520]
[521]
[522]
[523]
[524]
[525]
[526]
[527]
[528]
[529]
[530]
[531]
[532]
[533]
[534]
[535]
[536]
[537]
[538]
[539]
[540]
[541]
[542]
[543]
[544]
[545]
[546]
[547]
[548]
[549]
[550]
[551]
[552]
[553]
[554]
[555]
[556]
[557]
[558]
[559]
[560]
[561]
[562]
[563]
[564]
[565]
[566]
[567]
[568]
[569]
[570]
[571]
[572]
[573]
[574]
[575]
[576]
[577]
[578]
[579]
[580]
[581]
[582]
[583]
[584]
[585]
[586]
[587]
[588]
[589]
[590]
[591]
[592]
[593]
[594]
[595]
[596]
[597]
[598]
[599]
[600]
[601]
[602]
[603]
[604]
[605]
[606]
[607]
[608]
[609]
[610]
[611]
[612]
[613]
[614]
[615]
[616]
[617]
[618]
[619]
[620]
[621]
[622]
[623]
[624]
[625]
[626]
[627]
[628]
[629]
[630]
[631]
[632]
[633]
[634]
[635]
[636]
[637]
[638]
[639]
[640]
[641]
[642]
[643]
[644]
[645]
[646]
[647]
[648]
[649]
[650]
[651]
[652]
[653]
[654]
[655]
[656]
[657]
[658]
[659]
[660]
[661]
[662]
[663]
[664]
[665]
[666]
[667]
[668]
[669]
[670]
[671]
[672]
[673]
[674]
[675]
[676]
[677]
[678]
[679]
[680]
[681]
[682]
[683]
[684]
[685]
[686]
[687]
[688]
[689]
[690]
[691]
[692]
[693]
[694]
[695]
[696]
[697]
[698]
[699]
[700]
[701]
[702]
[703]
[704]
[705]
[706]
[707]
[708]
[709]
[710]
[711]
[712]
[713]
[714]
[715]
[716]
[717]
[718]
[719]
[720]
[721]
[722]
[723]
[724]
[725]
[726]
[727]
[728]
[729]
[730]
[731]
[732]
[733]
[734]
[735]
[736]
[737]
[738]
[739]
[740]
[741]
[742]
[743]
[744]
[745]
[746]
[747]
[748]
[749]
[750]
[751]
[752]
[753]
[754]
[755]
[756]
[757]
[758]
[759]
[760]
[761]
[762]
[763]
[764]
[765]
[766]
[767]
[768]
[769]
[770]
[771]
[772]
[773]
[774]
[775]
[776]
[777]
[778]
[779]
[780]
[781]
[782]
[783]
[784]
[785]
[786]
[787]
[788]
[789]
[790]
[791]
[792]
[793]
[794]
[795]
[796]
[797]
[798]
[799]
[800]
[801]
[802]
[803]
[804]
[805]
[806]
[807]
[808]
[809]
[810]
[811]
[812]
[813]
[814]
[815]
[816]
[817]
[818]
[819]
[820]
[821]
[822]
[823]
[824]
[825]
[826]
[827]
[828]
[829]
[830]
[831]
[832]
[833]
[834]
[835]
[836]
[837]
[838]
[839]
[840]
[841]
[842]
[843]
[844]
[845]
[846]
[847]
[848]
[849]
[850]
[851]
[852]
[853]
[854]
[855]
[856]
[857]
[858]
[859]
[860]
[861]
[862]
[863]
[864]
[865]
[866]
[867]
[868]
[869]
[870]
[871]
[872]
[873]
[874]
[875]
[876]
[877]
[878]
[879]
[880]
[881]
[882]
[883]
[884]
[885]
[886]
[887]
[888]
[889]
[890]
[891]
[892]
[893]
[894]
[895]
[896]
[897]
[898]
[899]
[900]
[901]
[902]
[903]
[904]
[905]
[906]
[907]
[908]
[909]
[910]
[911]
[912]
[913]
[914]
[915]
[916]
[917]
[918]
[919]
[920]
[921]
[922]
[923]
[924]
[925]
[926]
[927]
[928]
[929]
[930]
[931]
[932]
[933]
[934]
[935]
[936]
[937]
[938]
[939]
[940]
[941]
[942]
[943]
[944]
[945]
[946]
[947]
[948]
[949]
[950]
[951]
[952]
[953]
[954]
[955]
[956]
[957]
[958]
[959]
[960]
[961]
[962]
[963]
[964]
[965]
[966]
[967]
[968]
[969]
[970]
[971]
[972]
[973]
[974]
[975]
[976]
[977]
[978]
[979]
[980]
[981]
[982]
[983]
[984]
[985]
[986]
[987]
[988]
[989]
[990]
[991]
[992]
[993]
[994]
[995]
[996]
[997]
[998]
[999]
[1000]
[1001]
[1002]
[1003]
[1004]
[1005]
[1006]
[1007]
[1008]
[1009]
[1010]
[1011]
[1012]
[1013]
[1014]
[1015]
[1016]
[1017]
[1018]
[1019]
[1020]
[1021]
[1022]
[1023]
[1024]
[1025]
[1026]
[1027]
[1028]
[1029]
[1030]
[1031]
[1032]
[1033]
[1034]
[1035]
[1036]
[1037]
[1038]
[1039]
[1040]
[1041]
[1042]
[1043]
[1044]
[1045]
[1046]
[1047]
[1048]
[1049]
[1050]
[1051]
[1052]
[1053]
[1054]
[1055]
[1056]
[1057]
[1058]
[1059]
[1060]
[1061]
[1062]
[1063]
[1064]
[1065]
[1066]
[1067]
[1068]
[1069]
[1070]
[1071]
[1072]
[1073]
[1074]
[1075]
[1076]
[1077]
[1078]
[1079]
[1080]
[1081]
[1082]
[1083]
[1084]
[1085]
[1086]
[1087]
[1088]
[1089]
[1090]
[1091]
[1092]
[1093]
[1094]
[1095]
[1096]
[1097]
[1098]
[1099]
[1100]
[1101]
[1102]
[1103]
[1104]
[1105]
[1106]
[1107]
[1108]
[1109]
[1110]
[1111]
[1112]
[1113]
[1114]
[1115]
[1116]
[1117]
[1118]
[1119]
[1120]
[1121]
[1122]
[1123]
[1124]
[1125]
[1126]
[1127]
[1128]
[1129]
[1130]
[1131]
[1132]
[1133]
[1134]
[1135]
[1136]
[1137]
[1138]
[1139]
[1140]
[1141]
[1142]
[1143]
[1144]
[1145]
[1146]
[1147]
[1148]
[1149]
[1150]
[1151]
[1152]
[1153]
[1154]
[1155]
[1156]
[1157]
[1158]
[1159]
[1160]
[1161]
[1162]
[1163]
[1164]
[1165]
[1166]
[1167]
[1168]
[1169]
[1170]
[1171]
[1172]
[1173]
[1174]
[1175]
[1176]
[1177]
[1178]
[1179]
[1180]
[1181]
[1182]
[1183]
[1184]
[1185]
[1186]
[1187]
[1188]
[1189]
[1190]
[1191]
[1192]
[1193]
[1194]
[1195]
[1196]
[1197]
[1198]
[1199]
[1200]
[1201]
[1202]
[1203]
[1204]
[1205]
[1206]
[1207]
[1208]
[1209]
[1210]
[1211]
[1212]
[1213]
[1214]
[1215]
[1216]
[1217]
[1218]
[1219]
[1220]
[1221]
[1222]
[1223]
[1224]
[1225]
[1226]
[1227]
[1228]
[1229]
[1230]
[1231]
[1232]
[1233]
[1234]
[1235]
[1236]
[1237]
[1238]
[1239]
[1240]
[1241]
[1242]
[1243]
[1244]
[1245]
[1246]
[1247]
[1248]
[1249]
[1250]
[1251]
[1252]
[1253]
[1254]
[1255]
[1256]
[1257]
[1258]
[1259]
[1260]
[1261]
[1262]
[1263]
[1264]
[1265]
[1266]
[1267]
[1268]
[1269]
[1270]
[1271]
[1272]
[1273]
[1274]
[1275]
[1276]
[1277]
[1278]
[1279]
[1280]
[1281]
[1282]
[1283]
[1284]
[1285]
[1286]
[1287]
[1288]
[1289]
[1290]
[1291]
[1292]
[1293]
[1294]
[1295]
[1296]
[1297]
[1298]
[1299]
[1300]
[1301]
[1302]
[1303]
[1304]
[1305]
[1306]
[1307]
[1308]
[1309]
[1310]
[1311]
[1312]
[1313]
[1314]
[1315]
[1316]
[1317]
[1318]
[1319]
[1320]
[1321]
[1322]
[1323]
[1324]
[1325]
[1326]
[1327]
[1328]
[1329]
[1330]
[1331]
[1332]
[1333]
[1334]
[1335]
[1336]
[1337]
[1338]
[1339]
[1340]
[1341]
[1342]
[1343]
[1344]
[1345]
[1346]
[1347]
[1348]
[1349]
[1350]
[1351]
[1352]
[1353]
[1354]
[1355]
[1356]
[1357]
[1358]
[1359]
[1360]
[1361]
[1362]
[1363]
[1364]
[1365]
[1366]
[1367]
[1368]
[1369]
[1370]
[1371]
[1372]
[1373]
[1374]
[1375]
[1376]
[1377]
[1378]
[1379]
[1380]
[1381]
[1382]
[1383]
[1384]
[1385]
[1386]
[1387]
[1388]
[1389]
[1390]
[1391]
[1392]
[1393]
[1394]
[1395]
[1396]
[1397]
[1398]
[1399]
[1400]
[1401]
[1402]
[1403]
[1404]
[1405]
[1406]
[1407]
[1408]
[1409]
[1410]
[1411]
[1412]
[1413]
[1414]
[1415]
[1416]
[1417]
[1418]
[1419]
[1420]
[1421]
[1422]
[1423]
[1424]
[1425]
[1426]
[1427]
[1428]
[1429]
[1430]
[1431]
[1432]
[1433]
[1434]
[1435]
[1436]
[1437]
[1438]
[1439]
[1440]
[1441]
[1442]
[1443]
[1444]
[1445]
[1446]
[1447]
[1448]
[1449]
[1450]
[1451]
[1452]
[1453]
[1454]
[1455]
[1456]
[1457]
[1458]
[1459]
[1460]
[1461]
[1462]
[1463]
[1464]
[1465]
[1466]
[1467]
[1468]
[1469]
[1470]
[1471]
[1472]
[1473]
[1474]
[1475]
[1476]
[1477]
[1478]
[1479]
[1480]
[1481]
[1482]
[1483]
[1484]
[1485]
[1486]
[1487]
[1488]
[1489]
[1490]
[1491]
[1492]
[1493]
[1494]
[1495]
[1496]
[1497]
[1498]
[1499]
[1500]
[1501]
[1502]
[1503]
[1504]
[1505]
[1506]
[1507]
[1508]
[1509]
[1510]
[1511]
[1512]
[1513]
[1514]
[1515]
[1516]
[1517]
[1518]
[1519]
[1520]
[1521]
[1522]
[1523]
[1524]
[1525]
[1526]
[1527]
[1528]
[1529]
[1530]
[1531]
[1532]
[1533]
[1534]
[1535]
[1536]
[1537]
[1538]
[1539]
[1540]
[1541]
[1542]
[1543]
[1544]
[1545]
[1546]
[1547]
[1548]
[1549]
[1550]
[1551]
[1552]
[1553]
[1554]
[1555]
[1556]
[1557]
[1558]
[1559]
[1560]
[1561]
[1562]
[1563]
[1564]
[1565]
[1566]
[1567]
[1568]
[1569]
[1570]
[1571]
[1572]
[1573]
[1574]
[1575]
[1576]
[1577]
[1578]
[1579]
[1580]
[1581]
[1582]
[1583]
[1584]
[1585]
[1586]
[1587]
[1588]
[1589]
[1590]
[1591]
[1592]
[1593]
[1594]
[1595]
[1596]
[1597]
[1598]
[1599]
[1600]
[1601]
[1602]
[1603]
[1604]
[1605]
[1606]
[1607]
[1608]
[1609]
[1610]
[1611]
[1612]
[1613]
[1614]
[1615]
[1616]
[1617]
[1618]
[1619]
[1620]
[1621]
[1622]
[1623]
[1624]
[1625]
[1626]
[1627]
[1628]
[1629]
[1630]
[1631]
[1632]
[1633]
[1634]
[1635]
[1636]
[1637]
[1638]
[1639]
[1640]
[1641]
[1642]
[1643]
[1644]
[1645]
[1646]
[1647]
[1648]
[1649]
[1650]
[1651]
[1652]
[1653]
[1654]
[1655]
[1656]
[1657]
[1658]
[1659]
[1660]
[1661]
[1662]
[1663]
[1664]
[1665]
[1666]
[1667]
[1668]
[1669]
[1670]
[1671]
[1672]
[1673]
[1674]
[1675]
[1676]
[1677]
[1678]
[1679]
[1680]
[1681]
[1682]
[1683]
[1684]
[1685]
[1686]
[1687]
[1688]
[1689]
[1690]
[1691]
[1692]
[1693]
[1694]
[1695]
[1696]
[1697]
[1698]
[1699]
[1700]
[1701]
[1702]
[1703]
[1704]
[1705]
[1706]
[1707]
[1708]
[1709]
[1710]
[1711]
[1712]
[1713]
[1714]
[1715]
[1716]
[1717]
[1718]
[1719]
[1720]
[1721]
[1722]
[1723]
[1724]
[1725]
[1726]
[1727]
[1728]
[1729]
[1730]
[1731]
[1732]
[1733]
[1734]
[1735]
[1736]
[1737]
[1738]
[1739]
[1740]
[1741]
[1742]
[1743]
[1744]
[1745]
[1746]
[1747]
[1748]
[1749]
[1750]
[1751]
[1752]
[1753]
[1754]
[1755]
[1756]
[1757]
[1758]
[1759]
[1760]
[1761]
[1762]
[1763]
[1764]
[1765]
[1766]
[1767]
[1768]
[1769]
[1770]
[1771]
[1772]
[1773]
[1774]
[1775]
[1776]
[1777]
[1778]
[1779]
[1780]
[1781]
[1782]
[1783]
[1784]
[1785]
[1786]
[1787]
[1788]
[1789]
[1790]
[1791]
[1792]
[1793]
[1794]
[1795]
[1796]
[1797]
[1798]
[1799]
[1800]
[1801]
[1802]
[1803]
[1804]
[1805]
[1806]
[1807]
[1808]
[1809]
[1810]
[1811]
[1812]
[1813]
[1814]
[1815]
[1816]
[1817]
[1818]
[1819]
[1820]
[1821]
[1822]
[1823]
[1824]
[1825]
[1826]
[1827]
[1828]
[1829]
[1830]
[1831]
[1832]
[1833]
[1834]
[1835]
[1836]
[1837]
[1838]
[1839]
[1840]
[1841]
[1842]
[1843]
[1844]
[1845]
[1846]
[1847]
[1848]
[1849]
[1850]
[1851]
[1852]
[1853]
[1854]
[1855]
[1856]
[1857]
[1858]
[1859]
[1860]
[1861]
[1862]
[1863]
[1864]
[1865]
[1866]
[1867]
[1868]
[1869]
[1870]
[1871]
[1872]
[1873]
[1874]
[1875]
[1876]
[1877]
[1878]
[1879]
[1880]
[1881]
[1882]
[1883]
[1884]
[1885]
[1886]
[1887]
[1888]
[1889]
[1890]
[1891]
[1892]
[1893]
[1894]
[1895]
[1896]
[1897]
[1898]
[1899]
[1900]
[1901]
[1902]
[1903]
[1904]
[1905]
[1906]
[1907]
[1908]
[1909]
[1910]
[1911]
[1912]
[1913]
[1914]
[1915]
[1916]
[1917]
[1918]
[1919]
[1920]
[1921]
[1922]
[1923]
[1924]
[1925]
[1926]
[1927]
[1928]
[1929]
[1930]
[1931]
[1932]
[1933]
[1934]
[1935]
[1936]
[1937]
[1938]
[1939]
[1940]
[1941]
[1942]
[1943]
[1944]
[1945]
[1946]
[1947]
[1948]
[1949]
[1950]
[1951]
[1952]
[1953]
[1954]
[1955]
[1956]
[1957]
[1958]
[1959]
[1960]
[1961]
[1962]
[1963]
[1964]
[1965]
[1966]
[1967]
[1968]
[1969]
[1970]
[1971]
[1972]
[1973]
[1974]
[1975]
[1976]
[1977]
[1978]
[1979]
[1980]
[1981]
[1982]
[1983]
[1984]
[1985]
[1986]
[1987]
[1988]
[1989]
[1990]
[1991]
[1992]
[1993]
[1994]
[1995]
[1996]
[1997]
[1998]
[1999]
[2000]
[2001]
[2002]
[2003]
[2004]
[2005]
[2006]
[2007]
[2008]
[2009]
[2010]
[2011]
[2012]
[2013]
[2014]
[2015]
[2016]
[2017]
[2018]
[2019]
[2020]
[2021]
[2022]
[2023]
[2024]
[2025]
[2026]
[2027]
[2028]
[2029]
[2030]
[2031]
[2032]
[2033]
[2034]
[2035]
[2036]
[2037]
[2038]
[2039]
[2040]
[2041]
[2042]
[2043]
[2044]
[2045]
[2046]
[2047]
[2048]
[2049]
[2050]
[2051]
[2052]
[2053]
[2054]
[2055]
[2056]
[2057]
[2058]
[2059]
[2060]
[2061]
[2062]
[2063]
[2064]
[2065]
[2066]
[2067]
[2068]
[2069]
[2070]
[2071]
[2072]
[2073]
[2074]
[2075]
[2076]
[2077]
[2078]
[2079]
[2080]
[2081]
[2082]
[2083]
[2084]
[2085]
[2086]
[2087]
[2088]
[2089]
[2090]
[2091]
[2092]
[2093]
[2094]
[2095]
[2096]
[2097]
[2098]
[2099]
[2100]
[2101]
[2102]
[2103]
[2104]
[2105]
[2106]
[2107]
[2108]
[2109]
[2110]
[2111]
[2112]
[2113]
[2114]
[2115]
[2116]
[2117]
[2118]
[2119]
[2120]
[2121]
[2122]
[2123]
[2124]
[2125]
[2126]
[2127]
[2128]
[2129]
[2130]
[2131]
[2132]
[2133]
[2134]
[2135]
[2136]
[2137]
[2138]
[2139]
[2140]
[2141]
[2142]
[2143]
[2144]
[2145]
[2146]
[2147]
[2148]
[2149]
[2150]
[2151]
[2152]
[2153]
[2154]
[2155]
[2156]
[2157]
[2158]
[2159]
[2160]
[2161]
[2162]
[2163]
[2164]
[2165]
[2166]
[2167]
[2168]
[2169]
[2170]
[2171]
[2172]
[2173]
[2174]
[2175]
[2176]
[2177]
[2178]
[2179]
[2180]
[2181]
[2182]
[2183]
[2184]
[2185]
[2186]
[2187]
[2188]
[2189]
[2190]
[2191]
[2192]
[2193]
[2194]
[2195]
[2196]
[2197]
[2198]
[2199]
[2200]
[2201]
[2202]
[2203]
[2204]
[2205]
[2206]
[2207]
[2208]
[2209]
[2210]
[2211]
[2212]
[2213]
[2214]
[2215]
[2216]
[2217]
[2218]
[2219]
[2220]
[2221]
[2222]
[2223]
[2224]
[2225]
[2226]
[2227]
[2228]
[2229]
[2230]
[2231]
[2232]
[2233]
[2234]
[2235]
[2236]
[2237]
[2238]
[2239]
[2240]
[2241]
[2242]
[2243]
[2244]
[2245]
[2246]
[2247]
[2248]
[2249]
[2250]
[2251]
[2252]
[2253]
[2254]
[2255]
[2256]
[2257]
[2258]
[2259]
[2260]
[2261]
[2262]
[2263]
[2264]
[2265]
[2266]
[2267]
[2268]
[2269]
[2270]
[2271]
[2272]
[2273]
[2274]
[2275]
[2276]
[2277]
[2278]
[2279]
[2280]
[2281]
[2282]
[2283]
[2284]
[2285]
[2286]
[2287]
[2288]
[2289]
[2290]
[2291]
[2292]
[2293]
[2294]
[2295]
[2296]
[2297]
[2298]
[2299]
[2300]
[2301]
[2302]
[2303]
[2304]
[2305]
[2306]
[2307]
[2308]
[2309]
[2310]
[2311]
[2312]
[2313]
[2314]
[2315]
[2316]
[2317]
[2318]
[2319]
[2320]
[2321]
[2322]
[2323]
[2324]
[2325]
[2326]
[2327]
[2328]
[2329]
[2330]
[2331]
[2332]
[2333]
[2334]
[2335]
[2336]
[2337]
[2338]
[2339]
[2340]
[2341]
[2342]
[2343]
[2344]
[2345]
[2346]
[2347]
[2348]
[2349]
[2350]
[2351]
[2352]
[2353]
[2354]
[2355]
[2356]
[2357]
[2358]
[2359]
[2360]
[2361]
[2362]
[2363]
[2364]
[2365]
[2366]
[2367]
[2368]
[2369]
[2370]
[2371]
[2372]
[2373]
[2374]
[2375]
[2376]
[2377]
[2378]
[2379]
[2380]
[2381]
[2382]
[2383]
[2384]
[2385]
[2386]
[2387]
[2388]
[2389]
[2390]
[2391]
[2392]
[2393]
[2394]
[2395]
[2396]
[2397]
[2398]
[2399]
[2400]
[2401]
[2402]
[2403]
[2404]
[2405]
[2406]
[2407]
[2408]
[2409]
[2410]
[2411]
[2412]
[2413]
[2414]
[2415]
[2416]
[2417]
[2418]
[2419]
[2420]
[2421]
[2422]
[2423]
[2424]
[2425]
[2426]
[2427]
[2428]
[2429]
[2430]
[2431]
[2432]
[2433]
[2434]
[2435]
[2436]
[2437]
[2438]
[2439]
[2440]
[2441]
[2442]
[2443]
[2444]
[2445]
[2446]
[2447]
[2448]
[2449]
[2450]
[2451]
[2452]
[2453]
[2454]
[2455]
[2456]
[2457]
[2458]
[2459]
[2460]
[2461]
[2462]
[2463]
[2464]
[2465]
[2466]
[2467]
[2468]
[2469]
[2470]
[2471]
[2472]
[2473]
[2474]
[2475]
[2476]
[2477]
[2478]
[2479]
[2480]
[2481]
[2482]
[2483]
[2484]
[2485]
[2486]
[2487]
[2488]
[2489]
[2490]
[2491]
[2492]
[2493]
[2494]
[2495]
[2496]
[2497]
[2498]
[2499]
[2500]
[2501]
[2502]
[2503]
[2504]
[2505]
[2506]
[2507]
[2508]
[2509]
[2510]
[2511]
[2512]
[2513]
[2514]
[2515]
[2516]
[2517]
[2518]
[2519]
[2520]
[2521]
[2522]
[2523]
[2524]
[2525]
[2526]
[2527]
[2528]
[2529]
[2530]
[2531]
[2532]
[2533]
[2534]
[2535]
[2536]
[2537]
[2538]
[2539]
[2540]
[2541]
[2542]
[2543]
[2544]
[2545]
[2546]
[2547]
[2548]
[2549]
[2550]
[2551]
[2552]
[2553]
[2554]
[2555]
[2556]
[2557]
[2558]
[2559]
[2560]
[2561]
[2562]
[2563]
[2564]
[2565]
[2566]
[2567]
[2568]
[2569]
[2570]
[2571]
[2572]
[2573]
[2574]
[2575]
[2576]
[2577]
[2578]
[2579]
[2580]
[2581]
[2582]
[2583]
[2584]
[2585]
[2586]
[2587]
[2588]
[2589]
[2590]
[2591]
[2592]
[2593]
[2594]
[2595]
[2596]
[2597]
[2598]
[2599]
[2600]
[2601]
[2602]
[2603]
[2604]
[2605]
[2606]
[2607]
[2608]
[2609]
[2610]
[2611]
[2612]
[2613]
[2614]
[2615]
[2616]
[2617]
[2618]
[2619]
[2620]
[2621]
[2622]
[2623]
[2624]
[2625]
[2626]
[2627]
[2628]
[2629]
[2630]
[2631]
[2632]
[2633]
[2634]
[2635]
[2636]
[2637]
[2638]
[2639]
[2640]
[2641]
[2642]
[2643]
[2644]
[2645]
[2646]
[2647]
[2648]
[2649]
[2650]
[2651]
[2652]
[2653]
[2654]
[2655]
[2656]
[2657]
[2658]
[2659]
[2660]
[2661]
[2662]
[2663]
[2664]
[2665]
[2666]
[2667]
[2668]
[2669]
[2670]
[2671]
[2672]
[2673]
[2674]
[2675]
[2676]
[2677]
[2678]
[2679]
[2680]
[2681]
[2682]
[2683]
[2684]
[2685]
[2686]
[2687]
[2688]
[2689]
[2690]
[2691]
[2692]
[2693]
[2694]
[2695]
[2696]
[2697]
[2698]
[2699]
[2700]
[2701]
[2702]
[2703]
[2704]
[2705]
[2706]
[2707]
[2708]
[2709]
[2710]
[2711]
[2712]
[2713]
[2714]
[2715]
[2716]
[2717]
[2718]
[2719]
[2720]
[2721]
[2722]
[2723]
[2724]
[2725]
[2726]
[2727]
[2728]
[2729]
[2730]
[2731]
[2732]
[2733]
[2734]
[2735]
[2736]
[2737]
[2738]
[2739]
[2740]
[2741]
[2742]
[2743]
[2744]
[2745]
[2746]
[2747]
[2748]
[2749]
[2750]
[2751]
[2752]
[2753]
[2754]
[2755]
[2756]
[2757]
[2758]
[2759]
[2760]
[2761]
[2762]
[2763]
[2764]
[2765]
[2766]
[2767]
[2768]
[2769]
[2770]
[2771]
[2772]
[2773]
[2774]
[2775]
[2776]
[2777]
[2778]
[2779]
[2780]
[2781]
[2782]
[2783]
[2784]
[2785]
[2786]
[2787]
[2788]
[2789]
[2790]
[2791]
[2792]
[2793]
[2794]
[2795]
[2796]
[2797]
[2798]
[2799]
[2800]
[2801]
[2802]
[2803]
[2804]
[2805]
[2806]
[2807]
[2808]
[2809]
[2810]
[2811]
[2812]
[2813]
[2814]
[2815]
[2816]
[2817]
[2818]
[2819]
[2820]
[2821]
[2822]
[2823]
[2824]
[2825]
[2826]
[2827]
[2828]
[2829]
[2830]
[2831]
[2832]
[2833]
[2834]
[2835]
[2836]
[2837]
[2838]
[2839]
[2840]
[2841]
[2842]
[2843]
[2844]
[2845]
[2846]
[2847]
[2848]
[2849]
[2850]
[2851]
[2852]
[2853]
[2854]
[2855]
[2856]
[2857]
[2858]
[2859]
[2860]
[2861]
[2862]
[2863]
[2864]
[2865]
[2866]
[2867]
[2868]
[2869]
[2870]
[2871]
[2872]
[2873]
[2874]
[2875]
[2876]
[2877]
[2878]
[2879]
[2880]
[2881]
[2882]
[2883]
[2884]
[2885]
[2886]
[2887]
[2888]
[2889]
[2890]
[2891]
[2892]
[2893]
[2894]
[2895]
[2896]
[2897]
[2898]
[2899]
[2900]
[2901]
[2902]
[2903]
[2904]
[2905]
[2906]
[2907]
[2908]
[2909]
[2910]
[2911]
[2912]
[2913]
[2914]
[2915]
[2916]
[2917]
[2918]
[2919]
[2920]
[2921]
[2922]
[2923]
[2924]
[2925]
[2926]
[2927]
[2928]
[2929]
[2930]
[2931]
[2932]
[2933]
[2934]
[2935]
[2936]
[2937]
[2938]
[2939]
[2940]
[2941]
[2942]
[2943]
[2944]
[2945]
[2946]
[2947]
[2948]
[2949]
[2950]
[2951]
[2952]
[2953]
[2954]
[2955]
[2956]
[2957]
[2958]
[2959]
[2960]
[2961]
[2962]
[2963]
[2964]
[2965]
[2966]
[2967]
[2968]
[2969]
[2970]
[2971]
[2972]
[2973]
[2974]
[2975]
[2976]
[2977]
[2978]
[2979]
[2980]
[2981]
[2982]
[2983]
[2984]
[2985]
[2986]
[2987]
[2988]
[2989]
[2990]
[2991]
[2992]
[2993]
[2994]
[2995]
[2996]
[2997]
[2998]
[2999]
[3000]
[3001]
[3002]
[3003]
[3004]
[3005]
[3006]
[3007]
[3008]
[3009]
[3010]
[3011]
[3012]
[3013]
[3014]
[3015]
[3016]
[3017]
[3018]
[3019]
[3020]
[3021]
[3022]
[3023]
[3024]
[3025]
[3026]
[3027]
[3028]
[3029]
[3030]
[3031]
[3032]
[3033]
[3034]
[3035]
[3036]
[3037]
[3038]
[3039]
[3040]
[3041]
[3042]
[3043]
[3044]
[3045]
[3046]
[3047]
[3048]
[3049]
[3050]
[3051]
[3052]
[3053]
[3054]
[3055]
[3056]
[3057]
[3058]
[3059]
[3060]
[3061]
[3062]
[3063]
[3064]
[3065]
[3066]
[3067]
[3068]
[3069]
[3070]
[3071]
[3072]
[3073]
[3074]
[3075]
[3076]
[3077]
[3078]
[3079]
[3080]
[3081]
[3082]
[3083]
[3084]
[3085]
[3086]
[3087]
[3088]
[3089]
[3090]
[3091]
[3092]
[3093]
[3094]
[3095]
[3096]
[3097]
[3098]
[3099]
[3100]
[3101]
[3102]
[3103]
[3104]
[3105]
[3106]
[3107]
[3108]
[3109]
[3110]
[3111]
[3112]
[3113]
[3114]
[3115]
[3116]
[3117]
[3118]
[3119]
[3120]
[3121]
[3122]
[3123]
[3124]
[3125]
[3126]
[3127]
[3128]
[3129]
[3130]
[3131]
[3132]
[3133]
[3134]
[3135]
[3136]
[3137]
[3138]
[3139]
[3140]
[3141]
[3142]
[3143]
[3144]
[3145]
[3146]
[3147]
[3148]
[3149]
[3150]
[3151]
[3152]
[3153]
[3154]
[3155]
[3156]
[3157]
[3158]
[3159]
[3160]
[3161]
[3162]
[3163]
[3164]
[3165]
[3166]
[3167]
[3168]
[3169]
[3170]
[3171]
[3172]
[3173]
[3174]
[3175]
[3176]
[3177]
[3178]
[3179]
[3180]
[3181]
[3182]
[3183]
[3184]
[3185]
[3186]
[3187]
[3188]
[3189]
[3190]
[3191]
[3192]
[3193]
[3194]
[3195]
[3196]
[3197]
[3198]
[3199]
[3200]
[3201]
[3202]
[3203]
[3204]
[3205]
[3206]
[3207]
[3208]
[3209]
[3210]
[3211]
[3212]
[3213]
[3214]
[3215]
[3216]
[3217]
[3218]
[3219]
[3220]
[3221]
[3222]
[3223]
[3224]
[3225]
[3226]
[3227]
[3228]
[3229]
[3230]
[3231]
[3232]
[3233]
[3234]
[3235]
[3236]
[3237]
[3238]
[3239]
[3240]
[3241]
[3242]
[3243]
[3244]
[3245]
[3246]
[3247]
[3248]
[3249]
[3250]
[3251]
[3252]
[3253]
[3254]
[3255]
[3256]
[3257]
[3258]
[3259]
[3260]
[3261]
[3262]
[3263]
[3264]
[3265]
[3266]
[3267]
[3268]
[3269]
[3270]
[3271]
[3272]
[3273]
[3274]
[3275]
[3276]
[3277]
[3278]
[3279]
[3280]
[3281]
[3282]
[3283]
[3284]
[3285]
[3286]
[3287]
[3288]
[3289]
[3290]
[3291]
[3292]
[3293]
[3294]
[3295]
[3296]
[3297]
[3298]
[3299]
[3300]
[3301]
[3302]
[3303]
[3304]
[3305]
[3306]
[3307]
[3308]
[3309]
[3310]
[3311]
[3312]
[3313]
[3314]
[3315]
[3316]
[3317]
[3318]
[3319]
[3320]
[3321]
[3322]
[3323]
[3324]
[3325]
[3326]
[3327]
[3328]
[3329]
[3330]
[3331]
[3332]
[3333]
[3334]
[3335]
[3336]
[3337]
[3338]
[3339]
[3340]
[3341]
[3342]
[3343]
[3344]
[3345]
[3346]
[3347]
[3348]
[3349]
[3350]
[3351]
[3352]
[3353]
[3354]
[3355]
[3356]
[3357]
[3358]
[3359]
[3360]
[3361]
[3362]
[3363]
[3364]
[3365]
[3366]
[3367]
[3368]
[3369]
[3370]
[3371]
[3372]
[3373]
[3374]
[3375]
[3376]
[3377]
[3378]
[3379]
[3380]
[3381]
[3382]
[3383]
[3384]
[3385]
[3386]
[3387]
[3388]
[3389]
[3390]
[3391]
[3392]
[3393]
[3394]
[3395]
[3396]
[3397]
[3398]
[3399]
[3400]
[3401]
[3402]
[3403]
[3404]
[3405]
[3406]
[3407]
[3408]
[3409]
[3410]
[3411]
[3412]
[3413]
[3414]
[3415]
[3416]
[3417]
[3418]
[3419]
[3420]
[3421]
[3422]
[3423]
[3424]
[3425]
[3426]
[3427]
[3428]
[3429]
[3430]
[3431]
[3432]
[3433]
[3434]
[3435]
[3436]
[3437]
[3438]
[3439]
[3440]
[3441]
[3442]
[3443]
[3444]
[3445]
[3446]
[3447]
[3448]
[3449]
[3450]
[3451]
[3452]
[3453]
[3454]
[3455]
[3456]
[3457]
[3458]
[3459]
[3460]
[3461]
[3462]
[3463]
[3464]
[3465]
[3466]
[3467]
[3468]
[3469]
[3470]
[3471]
[3472]
[3473]
[3474]
[3475]
[3476]
[3477]
[3478]
[3479]
[3480]
[3481]
[3482]
[3483]
[3484]
[3485]
[3486]
[3487]
[3488]
[3489]
[3490]
[3491]
[3492]
[3493]
[3494]
[3495]
[3496]
[3497]
[3498]
[3499]
[3500]
[3501]
[3502]
[3503]
[3504]
[3505]
[3506]
[3507]
[3508]
[3509]
[3510]
[3511]
[3512]
[3513]
[3514]
[3515]
[3516]
[3517]
[3518]
[3519]
[3520]
[3521]
[3522]
[3523]
[3524]
[3525]
[3526]
[3527]
[3528]
[3529]
[3530]
[3531]
[3532]
[3533]
[3534]
[3535]
[3536]
[3537]
[3538]
[3539]
[3540]
[3541]
[3542]
[3543]
[3544]
[3545]
[3546]
[3547]
[3548]
[3549]
[3550]
[3551]
[3552]
[3553]
[3554]
[3555]
[3556]
[3557]
[3558]
[3559]
[3560]
[3561]
[3562]
[3563]
[3564]
[3565]
[3566]
[3567]
[3568]
[3569]
[3570]
[3571]
[3572]
[3573]
[3574]
[3575]
[3576]
[3577]
[3578]
[3579]
[3580]
[3581]
[3582]
[3583]
[3584]
[3585]
[3586]
[3587]
[3588]
[3589]
[3590]
[3591]
[3592]
[3593]
[3594]
[3595]
[3596]
[3597]
[3598]
[3599]
[3600]
[3601]
[3602]
[3603]
[3604]
[3605]
[3606]
[3607]
[3608]
[3609]
[3610]
[3611]
[3612]
[3613]
[3614]
[3615]
[3616]
[3617]
[3618]
[3619]
[3620]
[3621]
[3622]
[3623]
[3624]
[3625]
[3626]
[3627]
[3628]
[3629]
[3630]
[3631]
[3632]
[3633]
[3634]
[3635]
[3636]
[3637]
[3638]
[3639]
[3640]
[3641]
[3642]
[3643]
[3644]
[3645]
[3646]
[3647]
[3648]
[3649]
[3650]
[3651]
[3652]
[3653]
[3654]
[3655]
[3656]
[3657]
[3658]
[3659]
[3660]
[3661]
[3662]
[3663]
[3664]
[3665]
[3666]
[3667]
[3668]
[3669]
[3670]
[3671]
[3672]
[3673]
[3674]
[3675]
[3676]
[3677]
[3678]
[3679]
[3680]
[3681]
[3682]
[3683]
[3684]
[3685]
[3686]
[3687]
[3688]
[3689]
[3690]
[3691]
[3692]
[3693]
[3694]
[3695]
[3696]
[3697]
[3698]
[3699]
[3700]
[3701]
[3702]
[3703]
[3704]
[3705]
[3706]
[3707]
[3708]
[3709]
[3710]
[3711]
[3712]
[3713]
[3714]
[3715]
[3716]
[3717]
[3718]
[3719]
[3720]
[3721]
[3722]
[3723]
[3724]
[3725]
[3726]
[3727]
[3728]
[3729]
[3730]
[3731]
[3732]
[3733]
[3734]
[3735]
[3736]
[3737]
[3738]
[3739]
[3740]
[3741]
[3742]
[3743]
[3744]
[3745]
[3746]
[3747]
[3748]
[3749]
[3750]
[3751]
[3752]
[3753]
[3754]
[3755]
[3756]
[3757]
[3758]
[3759]
[3760]
[3761]
[3762]
[3763]
[3764]
[3765]
[3766]
[3767]
[3768]
[3769]
[3770]
[3771]
[3772]
[3773]
[3774]
[3775]
[3776]
[3777]
[3778]
[3779]
[3780]
[3781]
[3782]
[3783]
[3784]
[3785]
[3786]
[3787]
[3788]
[3789]
[3790]
[3791]
[3792]
[3793]
[3794]
[3795]
[3796]
[3797]
[3798]
[3799]
[3800]
[3801]
[3802]
[3803]
[3804]
[3805]
[3806]
[3807]
[3808]
[3809]
[3810]
[3811]
[3812]
[3813]
[3814]
[3815]
[3816]
[3817]
[3818]
[3819]
[3820]
[3821]
[3822]
[3823]
[3824]
[3825]
[3826]
[3827]
[3828]
[3829]
[3830]
[3831]
[3832]
[3833]
[3834]
[3835]
[3836]
[3837]
[3838]
[3839]
[3840]
[3841]
[3842]
[3843]
[3844]
[3845]
[3846]
[3847]
[3848]
[3849]
[3850]
[3851]
[3852]
[3853]
[3854]
[3855]
[3856]
[3857]
[3858]
[3859]
[3860]
[3861]
[3862]
[3863]
[3864]
[3865]
[3866]
[3867]
[3868]
[3869]
[3870]
[3871]
[3872]
[3873]
[3874]
[3875]
[3876]
[3877]
[3878]
[3879]
[3880]
[3881]
[3882]
[3883]
[3884]
[3885]
[3886]
[3887]
[3888]
[3889]
[3890]
[3891]
[3892]
[3893]
[3894]
[3895]
[3896]
[3897]
[3898]
[3899]
[3900]
[3901]
[3902]
[3903]
[3904]
[3905]
[3906]
[3907]
[3908]
[3909]
[3910]
[3911]
[3912]
[3913]
[3914]
[3915]
[3916]
[3917]
[3918]
[3919]
[3920]
[3921]
[3922]
[3923]
[3924]
[3925]
[3926]
[3927]
[3928]
[3929]
[3930]
[3931]
[3932]
[3933]
[3934]
[3935]
[3936]
[3937]
[3938]
[3939]
[3940]
[3941]
[3942]
[3943]
[3944]
[3945]
[3946]
[3947]
[3948]
[3949]
[3950]
[3951]
[3952]
[3953]
[3954]
[3955]
[3956]
[3957]
[3958]
[3959]
[3960]
[3961]
[3962]
[3963]
[3964]
[3965]
[3966]
[3967]
[3968]
[3969]
[3970]
[3971]
[3972]
[3973]
[3974]
[3975]
[3976]
[3977]
[3978]
[3979]
[3980]
[3981]
[3982]
[3983]
[3984]
[3985]
[3986]
[3987]
[3988]
[3989]
[3990]
[3991]
[3992]
[3993]
[3994]
[3995]
[3996]
[3997]
[3998]
[3999]
[4000]
[4001]
[4002]
[4003]
[4004]
[4005]
[4006]
[4007]
[4008]
[4009]
[4010]
[4011]
[4012]
[4013]
[4014]
[4015]
[4016]
[4017]
[4018]
[4019]
[4020]
[4021]
[4022]
[4023]
[4024]
[4025]
[4026]
[4027]
[4028]
[4029]
[4030]
[4031]
[4032]
[4033]
[4034]
[4035]
[4036]
[4037]
[4038]
[4039]
[4040]
[4041]
[4042]
[4043]
[4044]
[4045]
[4046]
[4047]
[4048]
[4049]
[4050]
[4051]
[4052]
[4053]
[4054]
[4055]
[4056]
[4057]
[4058]
[4059]
[4060]
[4061]
[4062]
[4063]
[4064]
[4065]
[4066]
[4067]
[4068]
[4069]
[4070]
[4071]
[4072]
[4073]
[4074]
[4075]
[4076]
[4077]
[4078]
[4079]
[4080]
[4081]
[4082]
[4083]
[4084]
[4085]
[4086]
[4087]
[4088]
[4089]
[4090]
[4091]
[4092]
[4093]
[4094]
[4095]

{"sheet":"PCIe","index":6,"n_rows":129,"n_cols":9,"rows_kept":129,"cut":false,"hidden":false,"merged":[[1,2,2,7],[1,8,2,8]]}
[]
[null,null,"PCIe Clocking Section"]
[]
[]
[null,"PCIe Mode","GEN 1"]
[]
[null,null,null,null,null,null,null,"Configured Line Rate"]
[null,"PCIECLK (P/N)",250,null,null,null,null,{"$f":"IF(C5=\"GEN 1\",2.5,5)","v":2.5}]
[]
[]
[]
[null,null,null,null,null,null,"Rate Scale","PCIe Line Rate"]
[null,null,null,null,null,null,0.5,5,{"$f":"IF(C5=\"GEN 1\",\"INVALID\",\"GEN 2\")","v":"INVALID"}]
[null,null,null,null,null,null,1,2.5,{"$f":"IF(C5=\"GEN 2\",\"INVALID\",\"GEN 1\")","v":"GEN 1"}]
[]
[]
[]
[]
[]
[]
[]
[]
[]
[]
[]
[]
[]
[]
[]
[]
[]
[]
[]
[]
[]
[]
[]
[]
[]
[]
[]
[]
[]
[]
[]
[]
[]
[]
[]
[]
[]
[]
[]
[]
[]
[]
[]
[]
[]
[]
[]
[]
[]
[]
[]
[]
[]
[]
[]
[]
[]
[]
[]
[]
[]
[]
[]
[]
[]
[]
[]
[]
[]
[]
[]
[]
[]
[]
[]
[]
[]
[]
[]
[]
[]
[]
[]
[]
[]
[]
[]
[]
[]
[]
[]
[]
[]
[]
[]
[]
[]
[]
[]
[]
[]
[]
[]
[]
[]
[]
[]
[]
[]
[]
[]
[null,null,null,"GEN 1",100]
[null,null,null,"GEN 2",156.25]
[null,null,null,null,250]
[null,null,null,null,312.5]

{"sheet":"SRIO","index":7,"n_rows":143,"n_cols":9,"rows_kept":143,"cut":false,"hidden":false,"merged":[[1,3,2,6],[6,5,7,5]]}
[]
[null,null,null,"SRIO CLOCKING SECTION"]
[]
[]
[]
[null,"Line Rate",5]
[null,null,null,null,null,null,null,null,"Configured Line Rate"]
[null,"SRIOSGMIICLKP/N",156.25,null,null,null,null,null,{"$f":"C6","v":5}]
[]
[]
[]
[]
[null,null,null,null,"Rate Scale","SGMII Line Rate"]
[null,null,null,null,2,1.25]
[null,null,null,null,1,2.5]
[null,null,null,null,"0.5 & 1",3.125]
[null,null,null,null,0.5,5]
[]
[]
[]
[]
[]
[]
[]
[]
[]
[]
[]
[]
[]
[]
[]
[]
[]
[]
[]
[]
[]
[]
[]
[]
[]
[]
[]
[]
[]
[]
[]
[]
[]
[]
[]
[]
[]
[]
[]
[]
[]
[]
[]
[]
[]
[]
[]
[]
[]
[]
[]
[]
[]
[]
[]
[]
[]
[]
[]
[]
[]
[]
[]
[]
[]
[]
[]
[]
[]
[]
[]
[]
[]
[]
[]
[]
[]
[]
[]
[]
[]
[]
[]
[]
[]
[]
[]
[]
[]
[]
[]
[]
[]
[]
[]
[]
[]
[]
[]
[]
[]
[]
[]
[]
[]
[]
[]
[]
[]
[null,null,100]
[0,4,10,{"$f":"VLOOKUP(E12,B128:C141,MATCH(C143,C127)+1,FALSE)","v":{"$error":"#N/A"}},{"$f":"IF(F14=1.25,\"True\",\"False\")","v":"True"},1.25,156.25]
[1,5,14,null,{"$f":"IF(F16=1.25,\"True\",\"False\")","v":"False"},2.5,250]
[null,6,18,null,{"$f":"IF(#REF!=1.25,\"True\",\"False\")","v":{"$error":"#REF!"}},3.125,312.5]
[null,8,20,null,{"$f":"IF(#REF!=1.25,\"True\",\"False\")","v":{"$error":"#REF!"}},5]
[null,8.25,21]
[null,10,28]
[null,12,30]
[null,12.5,32]
[null,15,"3C"]
[null,16,40]
[null,16.5,42]
[null,20,50]
[null,22,58]
[null,25,64]
[]
[null,null,100]

{"sheet":"SGMII","index":8,"n_rows":141,"n_cols":9,"rows_kept":141,"cut":false,"hidden":false,"merged":[[6,5,7,5],[1,3,2,6]]}
[]
[null,null,null,"SGMII CLOCKING SECTION"]
[]
[]
[]
[null,"Line Rate",1.25]
[null,null,null,null,null,null,null,null,"Configured Line Rate"]
[null,"SRIOSGMIICLKP/N",156.25,null,null,null,null,null,{"$f":"C6","v":1.25}]
[]
[]
[]
[]
[null,null,null,null,"Rate Scale","SGMII Line Rate"]
[null,null,null,null,2,1.25]
[]
[]
[]
[]
[]
[]
[]
[]
[]
[]
[]
[]
[]
[]
[]
[]
[]
[]
[]
[]
[]
[]
[]
[]
[]
[]
[]
[]
[]
[]
[]
[]
[]
[]
[]
[]
[]
[]
[]
[]
[]
[]
[]
[]
[]
[]
[]
[]
[]
[]
[]
[]
[]
[]
[]
[]
[]
[]
[]
[]
[]
[]
[]
[]
[]
[]
[]
[]
[]
[]
[]
[]
[]
[]
[]
[]
[]
[]
[]
[]
[]
[]
[]
[]
[]
[]
[]
[]
[]
[]
[]
[]
[]
[]
[]
[]
[]
[]
[]
[]
[]
[]
[]
[]
[]
[]
[]
[]
[]
[]
[null,null,100]
[0,4,10,{"$f":"VLOOKUP(E12,B126:C139,MATCH(C141,C125)+1,FALSE)","v":{"$error":"#N/A"}},{"$f":"IF(F14=1.25,\"True\",\"False\")","v":"True"},1.25,156.25]
[1,5,14,null,{"$f":"IF(F15=1.25,\"True\",\"False\")","v":"False"},null,250]
[null,6,18,null,{"$f":"IF(#REF!=1.25,\"True\",\"False\")","v":{"$error":"#REF!"}},null,312.5]
[null,8,20,null,{"$f":"IF(#REF!=1.25,\"True\",\"False\")","v":{"$error":"#REF!"}}]
[null,8.25,21]
[null,10,28]
[null,12,30]
[null,12.5,32]
[null,15,"3C"]
[null,16,40]
[null,16.5,42]
[null,20,50]
[null,22,58]
[null,25,64]
[]
[null,null,100]

{"sheet":"MDIO","index":9,"n_rows":12,"n_cols":10,"rows_kept":12,"cut":false,"hidden":false,"merged":[[5,4,5,5],[1,2,2,6]]}
[]
[null,null,"MDIO CLOCKING SECTION"]
[]
[]
[]
[null,"SGMII PLL OUTPUT",null,"÷",{"$f":"B7/D7","v":250},null,"CLKDIV",null,"MDIO Clock"]
[null,2500,null,10,null,null,100,null,{"$f":"E6/(G7+1)","v":2.4752475247524752},{"$f":"IF(I7>2.5,\"OUT OF RANGE\",\"\")","v":""}]
[]
[]
["Registers:"]
["Name","Bit Position","Value"]
["MDIO_CONTROL.CLKDIV","15 : 0",{"$f":"CONCATENATE(\"0x\",DEC2HEX(G7,4))","v":"0x0064"}]

{"sheet":"HYPERLINK","index":10,"n_rows":143,"n_cols":9,"rows_kept":143,"cut":false,"hidden":false,"merged":[[6,7,7,7],[1,2,2,8]]}
[]
[null,null,"HYPERLINK CLOCKING SECTION"]
[]
[]
[]
[null,"Config Baud Rate",10]
[null,null,null,null,null,null,null,null,"Configured Line Rate"]
[null,"MCMCLKP/N",156.25,null,null,null,null,null,{"$f":"C6","v":10}]
[]
[]
[]
[]
[null,null,null,null,null,"Rate Scale","HyperLink Line Rate"]
[null,null,null,null,null,0.25,{"$f":"C6","v":10}]
[]
[]
[]
[]
[]
[]
[]
[]
[]
[]
[]
[]
[]
[]
[]
[]
[]
[]
[]
[]
[]
[]
[]
[]
[]
[]
[]
[]
[]
[]
[]
[]
[]
[]
[]
[]
[]
[]
[]
[]
[]
[]
[]
[]
[]
[]
[]
[]
[]
[]
[]
[]
[]
[]
[]
[]
[]
[]
[]
[]
[]
[]
[]
[]
[]
[]
[]
[]
[]
[]
[]
[]
[]
[]
[]
[]
[]
[]
[]
[]
[]
[]
[]
[]
[]
[]
[]
[]
[]
[]
[]
[]
[]
[]
[]
[]
[]
[]
[]
[]
[]
[]
[]
[]
[]
[]
[]
[]
[]
[]
[]
[]
[null,null,100]
[0,4,10,{"$f":"VLOOKUP(G12,B128:C141,MATCH(C143,C127)+1,FALSE)","v":{"$error":"#N/A"}},156.25,null,{"$f":"IF(G14=12.5,\"True\",IF(G14=6.25,\"True\",IF(G14=3.125,\"True\",IF(G14=1.25,\"True\",\"False\"))))","v":"False"}]
[1,5,14,null,250,null,{"$f":"IF(#REF!=12.5,\"True\",IF(#REF!=6.25,\"True\",IF(#REF!=3.125,\"True\",IF(#REF!=1.25,\"True\",\"False\"))))","v":{"$error":"#REF!"}}]
[null,6,18,null,312.5,null,{"$f":"IF(#REF!=12.5,\"True\",IF(#REF!=6.25,\"True\",IF(#REF!=3.125,\"True\",IF(#REF!=1.25,\"True\",\"False\"))))","v":{"$error":"#REF!"}},10]
[null,8,20,null,null,null,{"$f":"IF(#REF!=12.5,\"True\",IF(#REF!=6.25,\"True\",IF(#REF!=3.125,\"True\",IF(#REF!=1.25,\"True\",\"False\"))))","v":{"$error":"#REF!"}}]
[null,8.25,21]
[null,10,28]
[null,12,30]
[null,12.5,32]
[null,15,"3C"]
[null,16,40]
[null,16.5,42]
[null,20,50]
[null,22,58]
[null,25,64]
[]
[null,null,100]

{"sheet":"EMIF16","index":11,"n_rows":12,"n_cols":3,"rows_kept":12,"cut":false,"hidden":false,"merged":[[5,5,6,5],[1,0,2,7],[11,2,13,5]]}
[]
["EMIF16 CLOCKING SECTION"]
[]
[]
[]
[]
[null,"EMIF Clock",{"$f":"(Main_PLL!W31)","v":166.66666666666666}]
[null,null,"SYSCLK7"]
[]
[null,"Clock Period, E",{"$f":"(1/C7)*1000","v":6}]
[]
[null,null,"The clock period, E is used to calculate the setup, hold and strobe timing cycles to be programmed in the Async Config Registers."]

{"sheet":"TIMER","index":12,"n_rows":192,"n_cols":14,"rows_kept":192,"cut":false,"hidden":false,"merged":[[7,0,7,1],[0,5,1,9]]}
[null,null,null,null,null,"TIMER CLOCKING SECTION"]
[]
[]
[]
[]
["SYSCLK7",{"$f":"(Main_PLL!W31)","v":166.66666666666666},null,null,null,null,{"$f":"IF(F11,B14,B6)","v":166.66666666666666},{"$f":"IF(F11,\"Timer counts when low to high\",\" \")","v":" "}]
[]
[null,null,null,null,null,null,null,null,null,null,null,null,null,"Timer Clock"]
[null,null,null,null,null,null,null,null,null,{"$f":"B14","v":50},{"$f":"IF(B16,\"Inverted\",\"Not Inverted\")","v":"Inverted"},null,null,{"$f":"IF(K15,J9,G6)","v":166.66666666666666}]
[null,null,null,null,null,"TIEN_LO",null,null,null,null,null,null,null,{"$f":"IF(K15,K9,H6)","v":" "}]
[null,null,null,null,null,0]
[]
[]
["External Clock",50,null,null,null,null,null,null,null,null,"CLKSRC_LO"]
[null,null,null,null,null,null,null,null,null,null,0]
["INVINP_LO",1]
[]
[]
[null,"Registers"]
[null,"TIEN_LO",{"$f":"CONCATENATE(\"0x\",DEC2HEX(F11,1))","v":"0x0"}]
[null,"CLKSRC_LO",{"$f":"CONCATENATE(\"0x\",DEC2HEX(K15,1))","v":"0x0"}]
[null,"INVINP_LO",{"$f":"CONCATENATE(\"0x\",DEC2HEX(B16,1))","v":"0x1"}]
[]
[]
[]
[]
[]
[]
[]
[]
[]
[]
[]
[]
[]
[]
[]
[]
[]
[]
[]
[]
[]
[]
[]
[]
[]
[]
[]
[]
[]
[]
[]
[]
[]
[]
[]
[]
[]
[]
[]
[]
[]
[]
[]
[]
[]
[]
[]
[]
[]
[]
[]
[]
[]
[]
[]
[]
[]
[]
[]
[]
[]
[]
[]
[]
[]
[]
[]
[]
[]
[]
[]
[]
[]
[]
[]
[]
[]
[]
[]
[]
[]
[]
[]
[]
[]
[]
[]
[]
[]
[]
[]
[]
[]
[]
[]
[]
[]
[]
[]
[]
[]
[]
[]
[]
[]
[]
[]
[]
[]
[]
[]
[]
[]
[]
[]
[]
[]
[]
[]
[]
[]
[]
[]
[]
[]
[]
[]
[]
[]
[]
[]
[]
[]
[]
[]
[]
[]
[]
[]
[]
[]
[]
[]
[]
[]
[]
[]
[]
[]
[]
[]
[]
[]
[]
[]
[]
[]
[]
[]
[]
[]
[]
[]
[]
[]
[]
[]
[]
[0]
[1]

{"sheet":"I2C","index":13,"n_rows":6757,"n_cols":19,"rows_kept":6757,"cut":false,"hidden":false,"merged":[]}
[]
[null,"I2C CLOCK GENERATION"]
[null,null,null,null,null,null,null,"SYSCLK7"]
[null,null,null,null,null,null,null,{"$f":"(Main_PLL!W31)","v":166.66666666666666}]
[]
[]
[]
[]
[null,null,"Prescaler",null,"IPSC"]
[null,null,null,null,64]
[]
[null,null,null,null,{"$f":"SUM(H4/(E10+1))","v":2.5641025641025639},"MHz"]
[]
[null,null,"Clock Divider",null,"ICCL","ICCH"]
[null,null,null,null,1,1]
[]
[null,null,null,null,{"$f":"SUM((E12/(E15+1+6+F15+1+6))*1000)","v":160.25641025641025},"KHz"]
[]
[null,null,null,null,null,null,null,"Standard Mode"]
[]
[]
[null,null,null,null,{"$f":"E12","v":2.5641025641025639},"Prescaled module clock must be set to 6.7-13.2 MHz"]
[null,null,null,null,{"$f":"E17","v":160.25641025641025},"I2C Clock Frequency"]
[]
[null,null,null,"ICPSC [7:0]",{"$f":"CONCATENATE(\"0x\",DEC2HEX(E10,2))","v":"0x40"}]
[null,null,null,"ICCL [15:0]",{"$f":"CONCATENATE(\"0x\",DEC2HEX(E15,4))","v":"0x0001"}]
[null,null,null,"ICCH [15:0]",{"$f":"CONCATENATE(\"0x\",DEC2HEX(F15,4))","v":"0x0001"}]
[]
[]
[]
[]
[]
[]
[]
[]
[]
[]
[]
[]
[]
[]
[]
[]
[]
[]
[]
[]
[]
[]
[]
[]
[]
[]
[]
[]
[]
[]
[]
[]
[]
[]
[]
[]
[]
[]
[]
[]
[]
[]
[]
[]
[]
[]
[]
[]
[]
[]
[]
[]
[]
[]
[]
[]
[]
[]
[]
[]
[]
[]
[]
[]
[]
[]
[]
[]
[]
[]
[]
[]
[]
[]
[]
[]
[]
[]
[]
[]
[]
[]
[]
[]
[]
[]
[]
[]
[]
[]
[]
[]
[]
[]
[]
[]
[]
[]
[]
[]
[]
[]
[]
[]
[]
[]
[]
[]
[]
[]
[]
[]
[]
[]
[]
[]
[]
[]
[]
[]
[]
[]
[]
[]
[]
[]
[]
[]
[]
[]
[]
[]
[]
[]
[]
[]
[]
[]
[]
[]
[]
[]
[]
[]
[]
[]
[]
[]
[]
[]
[]
[]
[]
[]
[]
[]
[]
[]
[]
[]
[]
[]
[]
[]
[]
[]
[]
[]
[]
[]
[]
[]
[]
[]
[]
[]
[]
[]
[]
[]
[]
[]
[]
[]
[]
[]
[]
[]
[]
[]
[]
[]
[]
[]
[]
[]
[]
[]
[]
[]
[]
[]
[]
[]
[]
[]
[]
[]
[]
[]
[]
[]
[]
[null,"IPSC","ICCH","ICCL","IPSC","D",{"$f":"IF(E10>=2,F244,IF(E10=1,F243,F242))","v":5},null,null,null,null,null,null,null,null,null,"IPSC","D",{"$f":"IF(Q10>=2,R244,IF(Q10=1,R243,R242))","v":7}]
[null,0,1,1,0,7,null,null,null,null,null,null,null,null,null,null,0,7]
[null,1,2,2,1,6,null,null,null,null,null,null,null,null,null,null,1,6]
[null,2,3,3,2,5,null,null,null,null,null,null,null,null,null,null,2,5]
[null,3,4,4]
[null,4,5,5]
[null,5,6,6]
[null,6,7,7]
[null,7,8,8]
[null,8,9,9]
[null,9,10,10]
[null,10,11,11]
[null,11,12,12]
[null,12,13,13]
[null,13,14,14]
[null,14,15,15]
[null,15,16,16]
[null,16,17,17]
[null,17,18,18]
[null,18,19,19]
[null,19,20,20]
[null,20,21,21]
[null,21,22,22]
[null,22,23,23]
[null,23,24,24]
[null,24,25,25]
[null,25,26,26]
[null,26,27,27]
[null,27,28,28]
[null,28,29,29]
[null,29,30,30]
[null,30,31,31]
[null,31,32,32]
[null,32,33,33]
[null,33,34,34]
[null,34,35,35]
[null,35,36,36]
[null,36,37,37]
[null,37,38,38]
[null,38,39,39]
[null,39,40,40]
[null,40,41,41]
[null,41,42,42]
[null,42,43,43]
[null,43,44,44]
[null,44,45,45]
[null,45,46,46]
[null,46,47,47]
[null,47,48,48]
[null,48,49,49]
[null,49,50,50]
[null,50,51,51]
[null,51,52,52]
[null,52,53,53]
[null,53,54,54]
[null,54,55,55]
[null,55,56,56]
[null,56,57,57]
[null,57,58,58]
[null,58,59,59]
[null,59,60,60]
[null,60,61,61]
[null,61,62,62]
[null,62,63,63]
[null,63,64,64]
[null,64,65,65]
[null,65,66,66]
[null,66,67,67]
[null,67,68,68]
[null,68,69,69]
[null,69,70,70]
[null,70,71,71]
[null,71,72,72]
[null,72,73,73]
[null,73,74,74]
[null,74,75,75]
[null,75,76,76]
[null,76,77,77]
[null,77,78,78]
[null,78,79,79]
[null,79,80,80]
[null,80,81,81]
[null,81,82,82]
[null,82,83,83]
[null,83,84,84]
[null,84,85,85]
[null,85,86,86]
[null,86,87,87]
[null,87,88,88]
[null,88,89,89]
[null,89,90,90]
[null,90,91,91]
[null,91,92,92]
[null,92,93,93]
[null,93,94,94]
[null,94,95,95]
[null,95,96,96]
[null,96,97,97]
[null,97,98,98]
[null,98,99,99]
[null,99,100,100]
[null,100,101,101]
[null,101,102,102]
[null,102,103,103]
[null,103,104,104]
[null,104,105,105]
[null,105,106,106]
[null,106,107,107]
[null,107,108,108]
[null,108,109,109]
[null,109,110,110]
[null,110,111,111]
[null,111,112,112]
[null,112,113,113]
[null,113,114,114]
[null,114,115,115]
[null,115,116,116]
[null,116,117,117]
[null,117,118,118]
[null,118,119,119]
[null,119,120,120]
[null,120,121,121]
[null,121,122,122]
[null,122,123,123]
[null,123,124,124]
[null,124,125,125]
[null,125,126,126]
[null,126,127,127]
[null,127,128,128]
[null,128,129,129]
[null,129,130,130]
[null,130,131,131]
[null,131,132,132]
[null,132,133,133]
[null,133,134,134]
[null,134,135,135]
[null,135,136,136]
[null,136,137,137]
[null,137,138,138]
[null,138,139,139]
[null,139,140,140]
[null,140,141,141]
[null,141,142,142]
[null,142,143,143]
[null,143,144,144]
[null,144,145,145]
[null,145,146,146]
[null,146,147,147]
[null,147,148,148]
[null,148,149,149]
[null,149,150,150]
[null,150,151,151]
[null,151,152,152]
[null,152,153,153]
[null,153,154,154]
[null,154,155,155]
[null,155,156,156]
[null,156,157,157]
[null,157,158,158]
[null,158,159,159]
[null,159,160,160]
[null,160,161,161]
[null,161,162,162]
[null,162,163,163]
[null,163,164,164]
[null,164,165,165]
[null,165,166,166]
[null,166,167,167]
[null,167,168,168]
[null,168,169,169]
[null,169,170,170]
[null,170,171,171]
[null,171,172,172]
[null,172,173,173]
[null,173,174,174]
[null,174,175,175]
[null,175,176,176]
[null,176,177,177]
[null,177,178,178]
[null,178,179,179]
[null,179,180,180]
[null,180,181,181]
[null,181,182,182]
[null,182,183,183]
[null,183,184,184]
[null,184,185,185]
[null,185,186,186]
[null,186,187,187]
[null,187,188,188]
[null,188,189,189]
[null,189,190,190]
[null,190,191,191]
[null,191,192,192]
[null,192,193,193]
[null,193,194,194]
[null,194,195,195]
[null,195,196,196]
[null,196,197,197]
[null,197,198,198]
[null,198,199,199]
[null,199,200,200]
[null,200,201,201]
[null,201,202,202]
[null,202,203,203]
[null,203,204,204]
[null,204,205,205]
[null,205,206,206]
[null,206,207,207]
[null,207,208,208]
[null,208,209,209]
[null,209,210,210]
[null,210,211,211]
[null,211,212,212]
[null,212,213,213]
[null,213,214,214]
[null,214,215,215]
[null,215,216,216]
[null,216,217,217]
[null,217,218,218]
[null,218,219,219]
[null,219,220,220]
[null,220,221,221]
[null,221,222,222]
[null,222,223,223]
[null,223,224,224]
[null,224,225,225]
[null,225,226,226]
[null,226,227,227]
[null,227,228,228]
[null,228,229,229]
[null,229,230,230]
[null,230,231,231]
[null,231,232,232]
[null,232,233,233]
[null,233,234,234]
[null,234,235,235]
[null,235,236,236]
[null,236,237,237]
[null,237,238,238]
[null,238,239,239]
[null,239,240,240]
[null,240,241,241]
[null,241,242,242]
[null,242,243,243]
[null,243,244,244]
[null,244,245,245]
[null,245,246,246]
[null,246,247,247]
[null,247,248,248]
[null,248,249,249]
[null,249,250,250]
[null,250,251,251]
[null,251,252,252]
[null,252,253,253]
[null,253,254,254]
[null,254,255,255]
[null,255,256,256]
[null,null,257,257]
[null,null,258,258]
[null,null,259,259]
[null,null,260,260]
[null,null,261,261]
[null,null,262,262]
[null,null,263,263]
[null,null,264,264]
[null,null,265,265]
[null,null,266,266]
[null,null,267,267]
[null,null,268,268]
[null,null,269,269]
[null,null,270,270]
[null,null,271,271]
[null,null,272,272]
[null,null,273,273]
[null,null,274,274]
[null,null,275,275]
[null,null,276,276]
[null,null,277,277]
[null,null,278,278]
[null,null,279,279]
[null,null,280,280]
[null,null,281,281]
[null,null,282,282]
[null,null,283,283]
[null,null,284,284]
[null,null,285,285]
[null,null,286,286]
[null,null,287,287]
[null,null,288,288]
[null,null,289,289]
[null,null,290,290]
[null,null,291,291]
[null,null,292,292]
[null,null,293,293]
[null,null,294,294]
[null,null,295,295]
[null,null,296,296]
[null,null,297,297]
[null,null,298,298]
[null,null,299,299]
[null,null,300,300]
[null,null,301,301]
[null,null,302,302]
[null,null,303,303]
[null,null,304,304]
[null,null,305,305]
[null,null,306,306]
[null,null,307,307]
[null,null,308,308]
[null,null,309,309]
[null,null,310,310]
[null,null,311,311]
[null,null,312,312]
[null,null,313,313]
[null,null,314,314]
[null,null,315,315]
[null,null,316,316]
[null,null,317,317]
[null,null,318,318]
[null,null,319,319]
[null,null,320,320]
[null,null,321,321]
[null,null,322,322]
[null,null,323,323]
[null,null,324,324]
[null,null,325,325]
[null,null,326,326]
[null,null,327,327]
[null,null,328,328]
[null,null,329,329]
[null,null,330,330]
[null,null,331,331]
[null,null,332,332]
[null,null,333,333]
[null,null,334,334]
[null,null,335,335]
[null,null,336,336]
[null,null,337,337]
[null,null,338,338]
[null,null,339,339]
[null,null,340,340]
[null,null,341,341]
[null,null,342,342]
[null,null,343,343]
[null,null,344,344]
[null,null,345,345]
[null,null,346,346]
[null,null,347,347]
[null,null,348,348]
[null,null,349,349]
[null,null,350,350]
[null,null,351,351]
[null,null,352,352]
[null,null,353,353]
[null,null,354,354]
[null,null,355,355]
[null,null,356,356]
[null,null,357,357]
[null,null,358,358]
[null,null,359,359]
[null,null,360,360]
[null,null,361,361]
[null,null,362,362]
[null,null,363,363]
[null,null,364,364]
[null,null,365,365]
[null,null,366,366]
[null,null,367,367]
[null,null,368,368]
[null,null,369,369]
[null,null,370,370]
[null,null,371,371]
[null,null,372,372]
[null,null,373,373]
[null,null,374,374]
[null,null,375,375]
[null,null,376,376]
[null,null,377,377]
[null,null,378,378]
[null,null,379,379]
[null,null,380,380]
[null,null,381,381]
[null,null,382,382]
[null,null,383,383]
[null,null,384,384]
[null,null,385,385]
[null,null,386,386]
[null,null,387,387]
[null,null,388,388]
[null,null,389,389]
[null,null,390,390]
[null,null,391,391]
[null,null,392,392]
[null,null,393,393]
[null,null,394,394]
[null,null,395,395]
[null,null,396,396]
[null,null,397,397]
[null,null,398,398]
[null,null,399,399]
[null,null,400,400]
[null,null,401,401]
[null,null,402,402]
[null,null,403,403]
[null,null,404,404]
[null,null,405,405]
[null,null,406,406]
[null,null,407,407]
[null,null,408,408]
[null,null,409,409]
[null,null,410,410]
[null,null,411,411]
[null,null,412,412]
[null,null,413,413]
[null,null,414,414]
[null,null,415,415]
[null,null,416,416]
[null,null,417,417]
[null,null,418,418]
[null,null,419,419]
[null,null,420,420]
[null,null,421,421]
[null,null,422,422]
[null,null,423,423]
[null,null,424,424]
[null,null,425,425]
[null,null,426,426]
[null,null,427,427]
[null,null,428,428]
[null,null,429,429]
[null,null,430,430]
[null,null,431,431]
[null,null,432,432]
[null,null,433,433]
[null,null,434,434]
[null,null,435,435]
[null,null,436,436]
[null,null,437,437]
[null,null,438,438]
[null,null,439,439]
[null,null,440,440]
[null,null,441,441]
[null,null,442,442]
[null,null,443,443]
[null,null,444,444]
[null,null,445,445]
[null,null,446,446]
[null,null,447,447]
[null,null,448,448]
[null,null,449,449]
[null,null,450,450]
[null,null,451,451]
[null,null,452,452]
[null,null,453,453]
[null,null,454,454]
[null,null,455,455]
[null,null,456,456]
[null,null,457,457]
[null,null,458,458]
[null,null,459,459]
[null,null,460,460]
[null,null,461,461]
[null,null,462,462]
[null,null,463,463]
[null,null,464,464]
[null,null,465,465]
[null,null,466,466]
[null,null,467,467]
[null,null,468,468]
[null,null,469,469]
[null,null,470,470]
[null,null,471,471]
[null,null,472,472]
[null,null,473,473]
[null,null,474,474]
[null,null,475,475]
[null,null,476,476]
[null,null,477,477]
[null,null,478,478]
[null,null,479,479]
[null,null,480,480]
[null,null,481,481]
[null,null,482,482]
[null,null,483,483]
[null,null,484,484]
[null,null,485,485]
[null,null,486,486]
[null,null,487,487]
[null,null,488,488]
[null,null,489,489]
[null,null,490,490]
[null,null,491,491]
[null,null,492,492]
[null,null,493,493]
[null,null,494,494]
[null,null,495,495]
[null,null,496,496]
[null,null,497,497]
[null,null,498,498]
[null,null,499,499]
[null,null,500,500]
[null,null,501,501]
[null,null,502,502]
[null,null,503,503]
[null,null,504,504]
[null,null,505,505]
[null,null,506,506]
[null,null,507,507]
[null,null,508,508]
[null,null,509,509]
[null,null,510,510]
[null,null,511,511]
[null,null,512,512]
[null,null,513,513]
[null,null,514,514]
[null,null,515,515]
[null,null,516,516]
[null,null,517,517]
[null,null,518,518]
[null,null,519,519]
[null,null,520,520]
[null,null,521,521]
[null,null,522,522]
[null,null,523,523]
[null,null,524,524]
[null,null,525,525]
[null,null,526,526]
[null,null,527,527]
[null,null,528,528]
[null,null,529,529]
[null,null,530,530]
[null,null,531,531]
[null,null,532,532]
[null,null,533,533]
[null,null,534,534]
[null,null,535,535]
[null,null,536,536]
[null,null,537,537]
[null,null,538,538]
[null,null,539,539]
[null,null,540,540]
[null,null,541,541]
[null,null,542,542]
[null,null,543,543]
[null,null,544,544]
[null,null,545,545]
[null,null,546,546]
[null,null,547,547]
[null,null,548,548]
[null,null,549,549]
[null,null,550,550]
[null,null,551,551]
[null,null,552,552]
[null,null,553,553]
[null,null,554,554]
[null,null,555,555]
[null,null,556,556]
[null,null,557,557]
[null,null,558,558]
[null,null,559,559]
[null,null,560,560]
[null,null,561,561]
[null,null,562,562]
[null,null,563,563]
[null,null,564,564]
[null,null,565,565]
[null,null,566,566]
[null,null,567,567]
[null,null,568,568]
[null,null,569,569]
[null,null,570,570]
[null,null,571,571]
[null,null,572,572]
[null,null,573,573]
[null,null,574,574]
[null,null,575,575]
[null,null,576,576]
[null,null,577,577]
[null,null,578,578]
[null,null,579,579]
[null,null,580,580]
[null,null,581,581]
[null,null,582,582]
[null,null,583,583]
[null,null,584,584]
[null,null,585,585]
[null,null,586,586]
[null,null,587,587]
[null,null,588,588]
[null,null,589,589]
[null,null,590,590]
[null,null,591,591]
[null,null,592,592]
[null,null,593,593]
[null,null,594,594]
[null,null,595,595]
[null,null,596,596]
[null,null,597,597]
[null,null,598,598]
[null,null,599,599]
[null,null,600,600]
[null,null,601,601]
[null,null,602,602]
[null,null,603,603]
[null,null,604,604]
[null,null,605,605]
[null,null,606,606]
[null,null,607,607]
[null,null,608,608]
[null,null,609,609]
[null,null,610,610]
[null,null,611,611]
[null,null,612,612]
[null,null,613,613]
[null,null,614,614]
[null,null,615,615]
[null,null,616,616]
[null,null,617,617]
[null,null,618,618]
[null,null,619,619]
[null,null,620,620]
[null,null,621,621]
[null,null,622,622]
[null,null,623,623]
[null,null,624,624]
[null,null,625,625]
[null,null,626,626]
[null,null,627,627]
[null,null,628,628]
[null,null,629,629]
[null,null,630,630]
[null,null,631,631]
[null,null,632,632]
[null,null,633,633]
[null,null,634,634]
[null,null,635,635]
[null,null,636,636]
[null,null,637,637]
[null,null,638,638]
[null,null,639,639]
[null,null,640,640]
[null,null,641,641]
[null,null,642,642]
[null,null,643,643]
[null,null,644,644]
[null,null,645,645]
[null,null,646,646]
[null,null,647,647]
[null,null,648,648]
[null,null,649,649]
[null,null,650,650]
[null,null,651,651]
[null,null,652,652]
[null,null,653,653]
[null,null,654,654]
[null,null,655,655]
[null,null,656,656]
[null,null,657,657]
[null,null,658,658]
[null,null,659,659]
[null,null,660,660]
[null,null,661,661]
[null,null,662,662]
[null,null,663,663]
[null,null,664,664]
[null,null,665,665]
[null,null,666,666]
[null,null,667,667]
[null,null,668,668]
[null,null,669,669]
[null,null,670,670]
[null,null,671,671]
[null,null,672,672]
[null,null,673,673]
[null,null,674,674]
[null,null,675,675]
[null,null,676,676]
[null,null,677,677]
[null,null,678,678]
[null,null,679,679]
[null,null,680,680]
[null,null,681,681]
[null,null,682,682]
[null,null,683,683]
[null,null,684,684]
[null,null,685,685]
[null,null,686,686]
[null,null,687,687]
[null,null,688,688]
[null,null,689,689]
[null,null,690,690]
[null,null,691,691]
[null,null,692,692]
[null,null,693,693]
[null,null,694,694]
[null,null,695,695]
[null,null,696,696]
[null,null,697,697]
[null,null,698,698]
[null,null,699,699]
[null,null,700,700]
[null,null,701,701]
[null,null,702,702]
[null,null,703,703]
[null,null,704,704]
[null,null,705,705]
[null,null,706,706]
[null,null,707,707]
[null,null,708,708]
[null,null,709,709]
[null,null,710,710]
[null,null,711,711]
[null,null,712,712]
[null,null,713,713]
[null,null,714,714]
[null,null,715,715]
[null,null,716,716]
[null,null,717,717]
[null,null,718,718]
[null,null,719,719]
[null,null,720,720]
[null,null,721,721]
[null,null,722,722]
[null,null,723,723]
[null,null,724,724]
[null,null,725,725]
[null,null,726,726]
[null,null,727,727]
[null,null,728,728]
[null,null,729,729]
[null,null,730,730]
[null,null,731,731]
[null,null,732,732]
[null,null,733,733]
[null,null,734,734]
[null,null,735,735]
[null,null,736,736]
[null,null,737,737]
[null,null,738,738]
[null,null,739,739]
[null,null,740,740]
[null,null,741,741]
[null,null,742,742]
[null,null,743,743]
[null,null,744,744]
[null,null,745,745]
[null,null,746,746]
[null,null,747,747]
[null,null,748,748]
[null,null,749,749]
[null,null,750,750]
[null,null,751,751]
[null,null,752,752]
[null,null,753,753]
[null,null,754,754]
[null,null,755,755]
[null,null,756,756]
[null,null,757,757]
[null,null,758,758]
[null,null,759,759]
[null,null,760,760]
[null,null,761,761]
[null,null,762,762]
[null,null,763,763]
[null,null,764,764]
[null,null,765,765]
[null,null,766,766]
[null,null,767,767]
[null,null,768,768]
[null,null,769,769]
[null,null,770,770]
[null,null,771,771]
[null,null,772,772]
[null,null,773,773]
[null,null,774,774]
[null,null,775,775]
[null,null,776,776]
[null,null,777,777]
[null,null,778,778]
[null,null,779,779]
[null,null,780,780]
[null,null,781,781]
[null,null,782,782]
[null,null,783,783]
[null,null,784,784]
[null,null,785,785]
[null,null,786,786]
[null,null,787,787]
[null,null,788,788]
[null,null,789,789]
[null,null,790,790]
[null,null,791,791]
[null,null,792,792]
[null,null,793,793]
[null,null,794,794]
[null,null,795,795]
[null,null,796,796]
[null,null,797,797]
[null,null,798,798]
[null,null,799,799]
[null,null,800,800]
[null,null,801,801]
[null,null,802,802]
[null,null,803,803]
[null,null,804,804]
[null,null,805,805]
[null,null,806,806]
[null,null,807,807]
[null,null,808,808]
[null,null,809,809]
[null,null,810,810]
[null,null,811,811]
[null,null,812,812]
[null,null,813,813]
[null,null,814,814]
[null,null,815,815]
[null,null,816,816]
[null,null,817,817]
[null,null,818,818]
[null,null,819,819]
[null,null,820,820]
[null,null,821,821]
[null,null,822,822]
[null,null,823,823]
[null,null,824,824]
[null,null,825,825]
[null,null,826,826]
[null,null,827,827]
[null,null,828,828]
[null,null,829,829]
[null,null,830,830]
[null,null,831,831]
[null,null,832,832]
[null,null,833,833]
[null,null,834,834]
[null,null,835,835]
[null,null,836,836]
[null,null,837,837]
[null,null,838,838]
[null,null,839,839]
[null,null,840,840]
[null,null,841,841]
[null,null,842,842]
[null,null,843,843]
[null,null,844,844]
[null,null,845,845]
[null,null,846,846]
[null,null,847,847]
[null,null,848,848]
[null,null,849,849]
[null,null,850,850]
[null,null,851,851]
[null,null,852,852]
[null,null,853,853]
[null,null,854,854]
[null,null,855,855]
[null,null,856,856]
[null,null,857,857]
[null,null,858,858]
[null,null,859,859]
[null,null,860,860]
[null,null,861,861]
[null,null,862,862]
[null,null,863,863]
[null,null,864,864]
[null,null,865,865]
[null,null,866,866]
[null,null,867,867]
[null,null,868,868]
[null,null,869,869]
[null,null,870,870]
[null,null,871,871]
[null,null,872,872]
[null,null,873,873]
[null,null,874,874]
[null,null,875,875]
[null,null,876,876]
[null,null,877,877]
[null,null,878,878]
[null,null,879,879]
[null,null,880,880]
[null,null,881,881]
[null,null,882,882]
[null,null,883,883]
[null,null,884,884]
[null,null,885,885]
[null,null,886,886]
[null,null,887,887]
[null,null,888,888]
[null,null,889,889]
[null,null,890,890]
[null,null,891,891]
[null,null,892,892]
[null,null,893,893]
[null,null,894,894]
[null,null,895,895]
[null,null,896,896]
[null,null,897,897]
[null,null,898,898]
[null,null,899,899]
[null,null,900,900]
[null,null,901,901]
[null,null,902,902]
[null,null,903,903]
[null,null,904,904]
[null,null,905,905]
[null,null,906,906]
[null,null,907,907]
[null,null,908,908]
[null,null,909,909]
[null,null,910,910]
[null,null,911,911]
[null,null,912,912]
[null,null,913,913]
[null,null,914,914]
[null,null,915,915]
[null,null,916,916]
[null,null,917,917]
[null,null,918,918]
[null,null,919,919]
[null,null,920,920]
[null,null,921,921]
[null,null,922,922]
[null,null,923,923]
[null,null,924,924]
[null,null,925,925]
[null,null,926,926]
[null,null,927,927]
[null,null,928,928]
[null,null,929,929]
[null,null,930,930]
[null,null,931,931]
[null,null,932,932]
[null,null,933,933]
[null,null,934,934]
[null,null,935,935]
[null,null,936,936]
[null,null,937,937]
[null,null,938,938]
[null,null,939,939]
[null,null,940,940]
[null,null,941,941]
[null,null,942,942]
[null,null,943,943]
[null,null,944,944]
[null,null,945,945]
[null,null,946,946]
[null,null,947,947]
[null,null,948,948]
[null,null,949,949]
[null,null,950,950]
[null,null,951,951]
[null,null,952,952]
[null,null,953,953]
[null,null,954,954]
[null,null,955,955]
[null,null,956,956]
[null,null,957,957]
[null,null,958,958]
[null,null,959,959]
[null,null,960,960]
[null,null,961,961]
[null,null,962,962]
[null,null,963,963]
[null,null,964,964]
[null,null,965,965]
[null,null,966,966]
[null,null,967,967]
[null,null,968,968]
[null,null,969,969]
[null,null,970,970]
[null,null,971,971]
[null,null,972,972]
[null,null,973,973]
[null,null,974,974]
[null,null,975,975]
[null,null,976,976]
[null,null,977,977]
[null,null,978,978]
[null,null,979,979]
[null,null,980,980]
[null,null,981,981]
[null,null,982,982]
[null,null,983,983]
[null,null,984,984]
[null,null,985,985]
[null,null,986,986]
[null,null,987,987]
[null,null,988,988]
[null,null,989,989]
[null,null,990,990]
[null,null,991,991]
[null,null,992,992]
[null,null,993,993]
[null,null,994,994]
[null,null,995,995]
[null,null,996,996]
[null,null,997,997]
[null,null,998,998]
[null,null,999,999]
[null,null,1000,1000]
[null,null,1001,1001]
[null,null,1002,1002]
[null,null,1003,1003]
[null,null,1004,1004]
[null,null,1005,1005]
[null,null,1006,1006]
[null,null,1007,1007]
[null,null,1008,1008]
[null,null,1009,1009]
[null,null,1010,1010]
[null,null,1011,1011]
[null,null,1012,1012]
[null,null,1013,1013]
[null,null,1014,1014]
[null,null,1015,1015]
[null,null,1016,1016]
[null,null,1017,1017]
[null,null,1018,1018]
[null,null,1019,1019]
[null,null,1020,1020]
[null,null,1021,1021]
[null,null,1022,1022]
[null,null,1023,1023]
[null,null,1024,1024]
[null,null,1025,1025]
[null,null,1026,1026]
[null,null,1027,1027]
[null,null,1028,1028]
[null,null,1029,1029]
[null,null,1030,1030]
[null,null,1031,1031]
[null,null,1032,1032]
[null,null,1033,1033]
[null,null,1034,1034]
[null,null,1035,1035]
[null,null,1036,1036]
[null,null,1037,1037]
[null,null,1038,1038]
[null,null,1039,1039]
[null,null,1040,1040]
[null,null,1041,1041]
[null,null,1042,1042]
[null,null,1043,1043]
[null,null,1044,1044]
[null,null,1045,1045]
[null,null,1046,1046]
[null,null,1047,1047]
[null,null,1048,1048]
[null,null,1049,1049]
[null,null,1050,1050]
[null,null,1051,1051]
[null,null,1052,1052]
[null,null,1053,1053]
[null,null,1054,1054]
[null,null,1055,1055]
[null,null,1056,1056]
[null,null,1057,1057]
[null,null,1058,1058]
[null,null,1059,1059]
[null,null,1060,1060]
[null,null,1061,1061]
[null,null,1062,1062]
[null,null,1063,1063]
[null,null,1064,1064]
[null,null,1065,1065]
[null,null,1066,1066]
[null,null,1067,1067]
[null,null,1068,1068]
[null,null,1069,1069]
[null,null,1070,1070]
[null,null,1071,1071]
[null,null,1072,1072]
[null,null,1073,1073]
[null,null,1074,1074]
[null,null,1075,1075]
[null,null,1076,1076]
[null,null,1077,1077]
[null,null,1078,1078]
[null,null,1079,1079]
[null,null,1080,1080]
[null,null,1081,1081]
[null,null,1082,1082]
[null,null,1083,1083]
[null,null,1084,1084]
[null,null,1085,1085]
[null,null,1086,1086]
[null,null,1087,1087]
[null,null,1088,1088]
[null,null,1089,1089]
[null,null,1090,1090]
[null,null,1091,1091]
[null,null,1092,1092]
[null,null,1093,1093]
[null,null,1094,1094]
[null,null,1095,1095]
[null,null,1096,1096]
[null,null,1097,1097]
[null,null,1098,1098]
[null,null,1099,1099]
[null,null,1100,1100]
[null,null,1101,1101]
[null,null,1102,1102]
[null,null,1103,1103]
[null,null,1104,1104]
[null,null,1105,1105]
[null,null,1106,1106]
[null,null,1107,1107]
[null,null,1108,1108]
[null,null,1109,1109]
[null,null,1110,1110]
[null,null,1111,1111]
[null,null,1112,1112]
[null,null,1113,1113]
[null,null,1114,1114]
[null,null,1115,1115]
[null,null,1116,1116]
[null,null,1117,1117]
[null,null,1118,1118]
[null,null,1119,1119]
[null,null,1120,1120]
[null,null,1121,1121]
[null,null,1122,1122]
[null,null,1123,1123]
[null,null,1124,1124]
[null,null,1125,1125]
[null,null,1126,1126]
[null,null,1127,1127]
[null,null,1128,1128]
[null,null,1129,1129]
[null,null,1130,1130]
[null,null,1131,1131]
[null,null,1132,1132]
[null,null,1133,1133]
[null,null,1134,1134]
[null,null,1135,1135]
[null,null,1136,1136]
[null,null,1137,1137]
[null,null,1138,1138]
[null,null,1139,1139]
[null,null,1140,1140]
[null,null,1141,1141]
[null,null,1142,1142]
[null,null,1143,1143]
[null,null,1144,1144]
[null,null,1145,1145]
[null,null,1146,1146]
[null,null,1147,1147]
[null,null,1148,1148]
[null,null,1149,1149]
[null,null,1150,1150]
[null,null,1151,1151]
[null,null,1152,1152]
[null,null,1153,1153]
[null,null,1154,1154]
[null,null,1155,1155]
[null,null,1156,1156]
[null,null,1157,1157]
[null,null,1158,1158]
[null,null,1159,1159]
[null,null,1160,1160]
[null,null,1161,1161]
[null,null,1162,1162]
[null,null,1163,1163]
[null,null,1164,1164]
[null,null,1165,1165]
[null,null,1166,1166]
[null,null,1167,1167]
[null,null,1168,1168]
[null,null,1169,1169]
[null,null,1170,1170]
[null,null,1171,1171]
[null,null,1172,1172]
[null,null,1173,1173]
[null,null,1174,1174]
[null,null,1175,1175]
[null,null,1176,1176]
[null,null,1177,1177]
[null,null,1178,1178]
[null,null,1179,1179]
[null,null,1180,1180]
[null,null,1181,1181]
[null,null,1182,1182]
[null,null,1183,1183]
[null,null,1184,1184]
[null,null,1185,1185]
[null,null,1186,1186]
[null,null,1187,1187]
[null,null,1188,1188]
[null,null,1189,1189]
[null,null,1190,1190]
[null,null,1191,1191]
[null,null,1192,1192]
[null,null,1193,1193]
[null,null,1194,1194]
[null,null,1195,1195]
[null,null,1196,1196]
[null,null,1197,1197]
[null,null,1198,1198]
[null,null,1199,1199]
[null,null,1200,1200]
[null,null,1201,1201]
[null,null,1202,1202]
[null,null,1203,1203]
[null,null,1204,1204]
[null,null,1205,1205]
[null,null,1206,1206]
[null,null,1207,1207]
[null,null,1208,1208]
[null,null,1209,1209]
[null,null,1210,1210]
[null,null,1211,1211]
[null,null,1212,1212]
[null,null,1213,1213]
[null,null,1214,1214]
[null,null,1215,1215]
[null,null,1216,1216]
[null,null,1217,1217]
[null,null,1218,1218]
[null,null,1219,1219]
[null,null,1220,1220]
[null,null,1221,1221]
[null,null,1222,1222]
[null,null,1223,1223]
[null,null,1224,1224]
[null,null,1225,1225]
[null,null,1226,1226]
[null,null,1227,1227]
[null,null,1228,1228]
[null,null,1229,1229]
[null,null,1230,1230]
[null,null,1231,1231]
[null,null,1232,1232]
[null,null,1233,1233]
[null,null,1234,1234]
[null,null,1235,1235]
[null,null,1236,1236]
[null,null,1237,1237]
[null,null,1238,1238]
[null,null,1239,1239]
[null,null,1240,1240]
[null,null,1241,1241]
[null,null,1242,1242]
[null,null,1243,1243]
[null,null,1244,1244]
[null,null,1245,1245]
[null,null,1246,1246]
[null,null,1247,1247]
[null,null,1248,1248]
[null,null,1249,1249]
[null,null,1250,1250]
[null,null,1251,1251]
[null,null,1252,1252]
[null,null,1253,1253]
[null,null,1254,1254]
[null,null,1255,1255]
[null,null,1256,1256]
[null,null,1257,1257]
[null,null,1258,1258]
[null,null,1259,1259]
[null,null,1260,1260]
[null,null,1261,1261]
[null,null,1262,1262]
[null,null,1263,1263]
[null,null,1264,1264]
[null,null,1265,1265]
[null,null,1266,1266]
[null,null,1267,1267]
[null,null,1268,1268]
[null,null,1269,1269]
[null,null,1270,1270]
[null,null,1271,1271]
[null,null,1272,1272]
[null,null,1273,1273]
[null,null,1274,1274]
[null,null,1275,1275]
[null,null,1276,1276]
[null,null,1277,1277]
[null,null,1278,1278]
[null,null,1279,1279]
[null,null,1280,1280]
[null,null,1281,1281]
[null,null,1282,1282]
[null,null,1283,1283]
[null,null,1284,1284]
[null,null,1285,1285]
[null,null,1286,1286]
[null,null,1287,1287]
[null,null,1288,1288]
[null,null,1289,1289]
[null,null,1290,1290]
[null,null,1291,1291]
[null,null,1292,1292]
[null,null,1293,1293]
[null,null,1294,1294]
[null,null,1295,1295]
[null,null,1296,1296]
[null,null,1297,1297]
[null,null,1298,1298]
[null,null,1299,1299]
[null,null,1300,1300]
[null,null,1301,1301]
[null,null,1302,1302]
[null,null,1303,1303]
[null,null,1304,1304]
[null,null,1305,1305]
[null,null,1306,1306]
[null,null,1307,1307]
[null,null,1308,1308]
[null,null,1309,1309]
[null,null,1310,1310]
[null,null,1311,1311]
[null,null,1312,1312]
[null,null,1313,1313]
[null,null,1314,1314]
[null,null,1315,1315]
[null,null,1316,1316]
[null,null,1317,1317]
[null,null,1318,1318]
[null,null,1319,1319]
[null,null,1320,1320]
[null,null,1321,1321]
[null,null,1322,1322]
[null,null,1323,1323]
[null,null,1324,1324]
[null,null,1325,1325]
[null,null,1326,1326]
[null,null,1327,1327]
[null,null,1328,1328]
[null,null,1329,1329]
[null,null,1330,1330]
[null,null,1331,1331]
[null,null,1332,1332]
[null,null,1333,1333]
[null,null,1334,1334]
[null,null,1335,1335]
[null,null,1336,1336]
[null,null,1337,1337]
[null,null,1338,1338]
[null,null,1339,1339]
[null,null,1340,1340]
[null,null,1341,1341]
[null,null,1342,1342]
[null,null,1343,1343]
[null,null,1344,1344]
[null,null,1345,1345]
[null,null,1346,1346]
[null,null,1347,1347]
[null,null,1348,1348]
[null,null,1349,1349]
[null,null,1350,1350]
[null,null,1351,1351]
[null,null,1352,1352]
[null,null,1353,1353]
[null,null,1354,1354]
[null,null,1355,1355]
[null,null,1356,1356]
[null,null,1357,1357]
[null,null,1358,1358]
[null,null,1359,1359]
[null,null,1360,1360]
[null,null,1361,1361]
[null,null,1362,1362]
[null,null,1363,1363]
[null,null,1364,1364]
[null,null,1365,1365]
[null,null,1366,1366]
[null,null,1367,1367]
[null,null,1368,1368]
[null,null,1369,1369]
[null,null,1370,1370]
[null,null,1371,1371]
[null,null,1372,1372]
[null,null,1373,1373]
[null,null,1374,1374]
[null,null,1375,1375]
[null,null,1376,1376]
[null,null,1377,1377]
[null,null,1378,1378]
[null,null,1379,1379]
[null,null,1380,1380]
[null,null,1381,1381]
[null,null,1382,1382]
[null,null,1383,1383]
[null,null,1384,1384]
[null,null,1385,1385]
[null,null,1386,1386]
[null,null,1387,1387]
[null,null,1388,1388]
[null,null,1389,1389]
[null,null,1390,1390]
[null,null,1391,1391]
[null,null,1392,1392]
[null,null,1393,1393]
[null,null,1394,1394]
[null,null,1395,1395]
[null,null,1396,1396]
[null,null,1397,1397]
[null,null,1398,1398]
[null,null,1399,1399]
[null,null,1400,1400]
[null,null,1401,1401]
[null,null,1402,1402]
[null,null,1403,1403]
[null,null,1404,1404]
[null,null,1405,1405]
[null,null,1406,1406]
[null,null,1407,1407]
[null,null,1408,1408]
[null,null,1409,1409]
[null,null,1410,1410]
[null,null,1411,1411]
[null,null,1412,1412]
[null,null,1413,1413]
[null,null,1414,1414]
[null,null,1415,1415]
[null,null,1416,1416]
[null,null,1417,1417]
[null,null,1418,1418]
[null,null,1419,1419]
[null,null,1420,1420]
[null,null,1421,1421]
[null,null,1422,1422]
[null,null,1423,1423]
[null,null,1424,1424]
[null,null,1425,1425]
[null,null,1426,1426]
[null,null,1427,1427]
[null,null,1428,1428]
[null,null,1429,1429]
[null,null,1430,1430]
[null,null,1431,1431]
[null,null,1432,1432]
[null,null,1433,1433]
[null,null,1434,1434]
[null,null,1435,1435]
[null,null,1436,1436]
[null,null,1437,1437]
[null,null,1438,1438]
[null,null,1439,1439]
[null,null,1440,1440]
[null,null,1441,1441]
[null,null,1442,1442]
[null,null,1443,1443]
[null,null,1444,1444]
[null,null,1445,1445]
[null,null,1446,1446]
[null,null,1447,1447]
[null,null,1448,1448]
[null,null,1449,1449]
[null,null,1450,1450]
[null,null,1451,1451]
[null,null,1452,1452]
[null,null,1453,1453]
[null,null,1454,1454]
[null,null,1455,1455]
[null,null,1456,1456]
[null,null,1457,1457]
[null,null,1458,1458]
[null,null,1459,1459]
[null,null,1460,1460]
[null,null,1461,1461]
[null,null,1462,1462]
[null,null,1463,1463]
[null,null,1464,1464]
[null,null,1465,1465]
[null,null,1466,1466]
[null,null,1467,1467]
[null,null,1468,1468]
[null,null,1469,1469]
[null,null,1470,1470]
[null,null,1471,1471]
[null,null,1472,1472]
[null,null,1473,1473]
[null,null,1474,1474]
[null,null,1475,1475]
[null,null,1476,1476]
[null,null,1477,1477]
[null,null,1478,1478]
[null,null,1479,1479]
[null,null,1480,1480]
[null,null,1481,1481]
[null,null,1482,1482]
[null,null,1483,1483]
[null,null,1484,1484]
[null,null,1485,1485]
[null,null,1486,1486]
[null,null,1487,1487]
[null,null,1488,1488]
[null,null,1489,1489]
[null,null,1490,1490]
[null,null,1491,1491]
[null,null,1492,1492]
[null,null,1493,1493]
[null,null,1494,1494]
[null,null,1495,1495]
[null,null,1496,1496]
[null,null,1497,1497]
[null,null,1498,1498]
[null,null,1499,1499]
[null,null,1500,1500]
[null,null,1501,1501]
[null,null,1502,1502]
[null,null,1503,1503]
[null,null,1504,1504]
[null,null,1505,1505]
[null,null,1506,1506]
[null,null,1507,1507]
[null,null,1508,1508]
[null,null,1509,1509]
[null,null,1510,1510]
[null,null,1511,1511]
[null,null,1512,1512]
[null,null,1513,1513]
[null,null,1514,1514]
[null,null,1515,1515]
[null,null,1516,1516]
[null,null,1517,1517]
[null,null,1518,1518]
[null,null,1519,1519]
[null,null,1520,1520]
[null,null,1521,1521]
[null,null,1522,1522]
[null,null,1523,1523]
[null,null,1524,1524]
[null,null,1525,1525]
[null,null,1526,1526]
[null,null,1527,1527]
[null,null,1528,1528]
[null,null,1529,1529]
[null,null,1530,1530]
[null,null,1531,1531]
[null,null,1532,1532]
[null,null,1533,1533]
[null,null,1534,1534]
[null,null,1535,1535]
[null,null,1536,1536]
[null,null,1537,1537]
[null,null,1538,1538]
[null,null,1539,1539]
[null,null,1540,1540]
[null,null,1541,1541]
[null,null,1542,1542]
[null,null,1543,1543]
[null,null,1544,1544]
[null,null,1545,1545]
[null,null,1546,1546]
[null,null,1547,1547]
[null,null,1548,1548]
[null,null,1549,1549]
[null,null,1550,1550]
[null,null,1551,1551]
[null,null,1552,1552]
[null,null,1553,1553]
[null,null,1554,1554]
[null,null,1555,1555]
[null,null,1556,1556]
[null,null,1557,1557]
[null,null,1558,1558]
[null,null,1559,1559]
[null,null,1560,1560]
[null,null,1561,1561]
[null,null,1562,1562]
[null,null,1563,1563]
[null,null,1564,1564]
[null,null,1565,1565]
[null,null,1566,1566]
[null,null,1567,1567]
[null,null,1568,1568]
[null,null,1569,1569]
[null,null,1570,1570]
[null,null,1571,1571]
[null,null,1572,1572]
[null,null,1573,1573]
[null,null,1574,1574]
[null,null,1575,1575]
[null,null,1576,1576]
[null,null,1577,1577]
[null,null,1578,1578]
[null,null,1579,1579]
[null,null,1580,1580]
[null,null,1581,1581]
[null,null,1582,1582]
[null,null,1583,1583]
[null,null,1584,1584]
[null,null,1585,1585]
[null,null,1586,1586]
[null,null,1587,1587]
[null,null,1588,1588]
[null,null,1589,1589]
[null,null,1590,1590]
[null,null,1591,1591]
[null,null,1592,1592]
[null,null,1593,1593]
[null,null,1594,1594]
[null,null,1595,1595]
[null,null,1596,1596]
[null,null,1597,1597]
[null,null,1598,1598]
[null,null,1599,1599]
[null,null,1600,1600]
[null,null,1601,1601]
[null,null,1602,1602]
[null,null,1603,1603]
[null,null,1604,1604]
[null,null,1605,1605]
[null,null,1606,1606]
[null,null,1607,1607]
[null,null,1608,1608]
[null,null,1609,1609]
[null,null,1610,1610]
[null,null,1611,1611]
[null,null,1612,1612]
[null,null,1613,1613]
[null,null,1614,1614]
[null,null,1615,1615]
[null,null,1616,1616]
[null,null,1617,1617]
[null,null,1618,1618]
[null,null,1619,1619]
[null,null,1620,1620]
[null,null,1621,1621]
[null,null,1622,1622]
[null,null,1623,1623]
[null,null,1624,1624]
[null,null,1625,1625]
[null,null,1626,1626]
[null,null,1627,1627]
[null,null,1628,1628]
[null,null,1629,1629]
[null,null,1630,1630]
[null,null,1631,1631]
[null,null,1632,1632]
[null,null,1633,1633]
[null,null,1634,1634]
[null,null,1635,1635]
[null,null,1636,1636]
[null,null,1637,1637]
[null,null,1638,1638]
[null,null,1639,1639]
[null,null,1640,1640]
[null,null,1641,1641]
[null,null,1642,1642]
[null,null,1643,1643]
[null,null,1644,1644]
[null,null,1645,1645]
[null,null,1646,1646]
[null,null,1647,1647]
[null,null,1648,1648]
[null,null,1649,1649]
[null,null,1650,1650]
[null,null,1651,1651]
[null,null,1652,1652]
[null,null,1653,1653]
[null,null,1654,1654]
[null,null,1655,1655]
[null,null,1656,1656]
[null,null,1657,1657]
[null,null,1658,1658]
[null,null,1659,1659]
[null,null,1660,1660]
[null,null,1661,1661]
[null,null,1662,1662]
[null,null,1663,1663]
[null,null,1664,1664]
[null,null,1665,1665]
[null,null,1666,1666]
[null,null,1667,1667]
[null,null,1668,1668]
[null,null,1669,1669]
[null,null,1670,1670]
[null,null,1671,1671]
[null,null,1672,1672]
[null,null,1673,1673]
[null,null,1674,1674]
[null,null,1675,1675]
[null,null,1676,1676]
[null,null,1677,1677]
[null,null,1678,1678]
[null,null,1679,1679]
[null,null,1680,1680]
[null,null,1681,1681]
[null,null,1682,1682]
[null,null,1683,1683]
[null,null,1684,1684]
[null,null,1685,1685]
[null,null,1686,1686]
[null,null,1687,1687]
[null,null,1688,1688]
[null,null,1689,1689]
[null,null,1690,1690]
[null,null,1691,1691]
[null,null,1692,1692]
[null,null,1693,1693]
[null,null,1694,1694]
[null,null,1695,1695]
[null,null,1696,1696]
[null,null,1697,1697]
[null,null,1698,1698]
[null,null,1699,1699]
[null,null,1700,1700]
[null,null,1701,1701]
[null,null,1702,1702]
[null,null,1703,1703]
[null,null,1704,1704]
[null,null,1705,1705]
[null,null,1706,1706]
[null,null,1707,1707]
[null,null,1708,1708]
[null,null,1709,1709]
[null,null,1710,1710]
[null,null,1711,1711]
[null,null,1712,1712]
[null,null,1713,1713]
[null,null,1714,1714]
[null,null,1715,1715]
[null,null,1716,1716]
[null,null,1717,1717]
[null,null,1718,1718]
[null,null,1719,1719]
[null,null,1720,1720]
[null,null,1721,1721]
[null,null,1722,1722]
[null,null,1723,1723]
[null,null,1724,1724]
[null,null,1725,1725]
[null,null,1726,1726]
[null,null,1727,1727]
[null,null,1728,1728]
[null,null,1729,1729]
[null,null,1730,1730]
[null,null,1731,1731]
[null,null,1732,1732]
[null,null,1733,1733]
[null,null,1734,1734]
[null,null,1735,1735]
[null,null,1736,1736]
[null,null,1737,1737]
[null,null,1738,1738]
[null,null,1739,1739]
[null,null,1740,1740]
[null,null,1741,1741]
[null,null,1742,1742]
[null,null,1743,1743]
[null,null,1744,1744]
[null,null,1745,1745]
[null,null,1746,1746]
[null,null,1747,1747]
[null,null,1748,1748]
[null,null,1749,1749]
[null,null,1750,1750]
[null,null,1751,1751]
[null,null,1752,1752]
[null,null,1753,1753]
[null,null,1754,1754]
[null,null,1755,1755]
[null,null,1756,1756]
[null,null,1757,1757]
[null,null,1758,1758]
[null,null,1759,1759]
[null,null,1760,1760]
[null,null,1761,1761]
[null,null,1762,1762]
[null,null,1763,1763]
[null,null,1764,1764]
[null,null,1765,1765]
[null,null,1766,1766]
[null,null,1767,1767]
[null,null,1768,1768]
[null,null,1769,1769]
[null,null,1770,1770]
[null,null,1771,1771]
[null,null,1772,1772]
[null,null,1773,1773]
[null,null,1774,1774]
[null,null,1775,1775]
[null,null,1776,1776]
[null,null,1777,1777]
[null,null,1778,1778]
[null,null,1779,1779]
[null,null,1780,1780]
[null,null,1781,1781]
[null,null,1782,1782]
[null,null,1783,1783]
[null,null,1784,1784]
[null,null,1785,1785]
[null,null,1786,1786]
[null,null,1787,1787]
[null,null,1788,1788]
[null,null,1789,1789]
[null,null,1790,1790]
[null,null,1791,1791]
[null,null,1792,1792]
[null,null,1793,1793]
[null,null,1794,1794]
[null,null,1795,1795]
[null,null,1796,1796]
[null,null,1797,1797]
[null,null,1798,1798]
[null,null,1799,1799]
[null,null,1800,1800]
[null,null,1801,1801]
[null,null,1802,1802]
[null,null,1803,1803]
[null,null,1804,1804]
[null,null,1805,1805]
[null,null,1806,1806]
[null,null,1807,1807]
[null,null,1808,1808]
[null,null,1809,1809]
[null,null,1810,1810]
[null,null,1811,1811]
[null,null,1812,1812]
[null,null,1813,1813]
[null,null,1814,1814]
[null,null,1815,1815]
[null,null,1816,1816]
[null,null,1817,1817]
[null,null,1818,1818]
[null,null,1819,1819]
[null,null,1820,1820]
[null,null,1821,1821]
[null,null,1822,1822]
[null,null,1823,1823]
[null,null,1824,1824]
[null,null,1825,1825]
[null,null,1826,1826]
[null,null,1827,1827]
[null,null,1828,1828]
[null,null,1829,1829]
[null,null,1830,1830]
[null,null,1831,1831]
[null,null,1832,1832]
[null,null,1833,1833]
[null,null,1834,1834]
[null,null,1835,1835]
[null,null,1836,1836]
[null,null,1837,1837]
[null,null,1838,1838]
[null,null,1839,1839]
[null,null,1840,1840]
[null,null,1841,1841]
[null,null,1842,1842]
[null,null,1843,1843]
[null,null,1844,1844]
[null,null,1845,1845]
[null,null,1846,1846]
[null,null,1847,1847]
[null,null,1848,1848]
[null,null,1849,1849]
[null,null,1850,1850]
[null,null,1851,1851]
[null,null,1852,1852]
[null,null,1853,1853]
[null,null,1854,1854]
[null,null,1855,1855]
[null,null,1856,1856]
[null,null,1857,1857]
[null,null,1858,1858]
[null,null,1859,1859]
[null,null,1860,1860]
[null,null,1861,1861]
[null,null,1862,1862]
[null,null,1863,1863]
[null,null,1864,1864]
[null,null,1865,1865]
[null,null,1866,1866]
[null,null,1867,1867]
[null,null,1868,1868]
[null,null,1869,1869]
[null,null,1870,1870]
[null,null,1871,1871]
[null,null,1872,1872]
[null,null,1873,1873]
[null,null,1874,1874]
[null,null,1875,1875]
[null,null,1876,1876]
[null,null,1877,1877]
[null,null,1878,1878]
[null,null,1879,1879]
[null,null,1880,1880]
[null,null,1881,1881]
[null,null,1882,1882]
[null,null,1883,1883]
[null,null,1884,1884]
[null,null,1885,1885]
[null,null,1886,1886]
[null,null,1887,1887]
[null,null,1888,1888]
[null,null,1889,1889]
[null,null,1890,1890]
[null,null,1891,1891]
[null,null,1892,1892]
[null,null,1893,1893]
[null,null,1894,1894]
[null,null,1895,1895]
[null,null,1896,1896]
[null,null,1897,1897]
[null,null,1898,1898]
[null,null,1899,1899]
[null,null,1900,1900]
[null,null,1901,1901]
[null,null,1902,1902]
[null,null,1903,1903]
[null,null,1904,1904]
[null,null,1905,1905]
[null,null,1906,1906]
[null,null,1907,1907]
[null,null,1908,1908]
[null,null,1909,1909]
[null,null,1910,1910]
[null,null,1911,1911]
[null,null,1912,1912]
[null,null,1913,1913]
[null,null,1914,1914]
[null,null,1915,1915]
[null,null,1916,1916]
[null,null,1917,1917]
[null,null,1918,1918]
[null,null,1919,1919]
[null,null,1920,1920]
[null,null,1921,1921]
[null,null,1922,1922]
[null,null,1923,1923]
[null,null,1924,1924]
[null,null,1925,1925]
[null,null,1926,1926]
[null,null,1927,1927]
[null,null,1928,1928]
[null,null,1929,1929]
[null,null,1930,1930]
[null,null,1931,1931]
[null,null,1932,1932]
[null,null,1933,1933]
[null,null,1934,1934]
[null,null,1935,1935]
[null,null,1936,1936]
[null,null,1937,1937]
[null,null,1938,1938]
[null,null,1939,1939]
[null,null,1940,1940]
[null,null,1941,1941]
[null,null,1942,1942]
[null,null,1943,1943]
[null,null,1944,1944]
[null,null,1945,1945]
[null,null,1946,1946]
[null,null,1947,1947]
[null,null,1948,1948]
[null,null,1949,1949]
[null,null,1950,1950]
[null,null,1951,1951]
[null,null,1952,1952]
[null,null,1953,1953]
[null,null,1954,1954]
[null,null,1955,1955]
[null,null,1956,1956]
[null,null,1957,1957]
[null,null,1958,1958]
[null,null,1959,1959]
[null,null,1960,1960]
[null,null,1961,1961]
[null,null,1962,1962]
[null,null,1963,1963]
[null,null,1964,1964]
[null,null,1965,1965]
[null,null,1966,1966]
[null,null,1967,1967]
[null,null,1968,1968]
[null,null,1969,1969]
[null,null,1970,1970]
[null,null,1971,1971]
[null,null,1972,1972]
[null,null,1973,1973]
[null,null,1974,1974]
[null,null,1975,1975]
[null,null,1976,1976]
[null,null,1977,1977]
[null,null,1978,1978]
[null,null,1979,1979]
[null,null,1980,1980]
[null,null,1981,1981]
[null,null,1982,1982]
[null,null,1983,1983]
[null,null,1984,1984]
[null,null,1985,1985]
[null,null,1986,1986]
[null,null,1987,1987]
[null,null,1988,1988]
[null,null,1989,1989]
[null,null,1990,1990]
[null,null,1991,1991]
[null,null,1992,1992]
[null,null,1993,1993]
[null,null,1994,1994]
[null,null,1995,1995]
[null,null,1996,1996]
[null,null,1997,1997]
[null,null,1998,1998]
[null,null,1999,1999]
[null,null,2000,2000]
[null,null,2001,2001]
[null,null,2002,2002]
[null,null,2003,2003]
[null,null,2004,2004]
[null,null,2005,2005]
[null,null,2006,2006]
[null,null,2007,2007]
[null,null,2008,2008]
[null,null,2009,2009]
[null,null,2010,2010]
[null,null,2011,2011]
[null,null,2012,2012]
[null,null,2013,2013]
[null,null,2014,2014]
[null,null,2015,2015]
[null,null,2016,2016]
[null,null,2017,2017]
[null,null,2018,2018]
[null,null,2019,2019]
[null,null,2020,2020]
[null,null,2021,2021]
[null,null,2022,2022]
[null,null,2023,2023]
[null,null,2024,2024]
[null,null,2025,2025]
[null,null,2026,2026]
[null,null,2027,2027]
[null,null,2028,2028]
[null,null,2029,2029]
[null,null,2030,2030]
[null,null,2031,2031]
[null,null,2032,2032]
[null,null,2033,2033]
[null,null,2034,2034]
[null,null,2035,2035]
[null,null,2036,2036]
[null,null,2037,2037]
[null,null,2038,2038]
[null,null,2039,2039]
[null,null,2040,2040]
[null,null,2041,2041]
[null,null,2042,2042]
[null,null,2043,2043]
[null,null,2044,2044]
[null,null,2045,2045]
[null,null,2046,2046]
[null,null,2047,2047]
[null,null,2048,2048]
[null,null,2049,2049]
[null,null,2050,2050]
[null,null,2051,2051]
[null,null,2052,2052]
[null,null,2053,2053]
[null,null,2054,2054]
[null,null,2055,2055]
[null,null,2056,2056]
[null,null,2057,2057]
[null,null,2058,2058]
[null,null,2059,2059]
[null,null,2060,2060]
[null,null,2061,2061]
[null,null,2062,2062]
[null,null,2063,2063]
[null,null,2064,2064]
[null,null,2065,2065]
[null,null,2066,2066]
[null,null,2067,2067]
[null,null,2068,2068]
[null,null,2069,2069]
[null,null,2070,2070]
[null,null,2071,2071]
[null,null,2072,2072]
[null,null,2073,2073]
[null,null,2074,2074]
[null,null,2075,2075]
[null,null,2076,2076]
[null,null,2077,2077]
[null,null,2078,2078]
[null,null,2079,2079]
[null,null,2080,2080]
[null,null,2081,2081]
[null,null,2082,2082]
[null,null,2083,2083]
[null,null,2084,2084]
[null,null,2085,2085]
[null,null,2086,2086]
[null,null,2087,2087]
[null,null,2088,2088]
[null,null,2089,2089]
[null,null,2090,2090]
[null,null,2091,2091]
[null,null,2092,2092]
[null,null,2093,2093]
[null,null,2094,2094]
[null,null,2095,2095]
[null,null,2096,2096]
[null,null,2097,2097]
[null,null,2098,2098]
[null,null,2099,2099]
[null,null,2100,2100]
[null,null,2101,2101]
[null,null,2102,2102]
[null,null,2103,2103]
[null,null,2104,2104]
[null,null,2105,2105]
[null,null,2106,2106]
[null,null,2107,2107]
[null,null,2108,2108]
[null,null,2109,2109]
[null,null,2110,2110]
[null,null,2111,2111]
[null,null,2112,2112]
[null,null,2113,2113]
[null,null,2114,2114]
[null,null,2115,2115]
[null,null,2116,2116]
[null,null,2117,2117]
[null,null,2118,2118]
[null,null,2119,2119]
[null,null,2120,2120]
[null,null,2121,2121]
[null,null,2122,2122]
[null,null,2123,2123]
[null,null,2124,2124]
[null,null,2125,2125]
[null,null,2126,2126]
[null,null,2127,2127]
[null,null,2128,2128]
[null,null,2129,2129]
[null,null,2130,2130]
[null,null,2131,2131]
[null,null,2132,2132]
[null,null,2133,2133]
[null,null,2134,2134]
[null,null,2135,2135]
[null,null,2136,2136]
[null,null,2137,2137]
[null,null,2138,2138]
[null,null,2139,2139]
[null,null,2140,2140]
[null,null,2141,2141]
[null,null,2142,2142]
[null,null,2143,2143]
[null,null,2144,2144]
[null,null,2145,2145]
[null,null,2146,2146]
[null,null,2147,2147]
[null,null,2148,2148]
[null,null,2149,2149]
[null,null,2150,2150]
[null,null,2151,2151]
[null,null,2152,2152]
[null,null,2153,2153]
[null,null,2154,2154]
[null,null,2155,2155]
[null,null,2156,2156]
[null,null,2157,2157]
[null,null,2158,2158]
[null,null,2159,2159]
[null,null,2160,2160]
[null,null,2161,2161]
[null,null,2162,2162]
[null,null,2163,2163]
[null,null,2164,2164]
[null,null,2165,2165]
[null,null,2166,2166]
[null,null,2167,2167]
[null,null,2168,2168]
[null,null,2169,2169]
[null,null,2170,2170]
[null,null,2171,2171]
[null,null,2172,2172]
[null,null,2173,2173]
[null,null,2174,2174]
[null,null,2175,2175]
[null,null,2176,2176]
[null,null,2177,2177]
[null,null,2178,2178]
[null,null,2179,2179]
[null,null,2180,2180]
[null,null,2181,2181]
[null,null,2182,2182]
[null,null,2183,2183]
[null,null,2184,2184]
[null,null,2185,2185]
[null,null,2186,2186]
[null,null,2187,2187]
[null,null,2188,2188]
[null,null,2189,2189]
[null,null,2190,2190]
[null,null,2191,2191]
[null,null,2192,2192]
[null,null,2193,2193]
[null,null,2194,2194]
[null,null,2195,2195]
[null,null,2196,2196]
[null,null,2197,2197]
[null,null,2198,2198]
[null,null,2199,2199]
[null,null,2200,2200]
[null,null,2201,2201]
[null,null,2202,2202]
[null,null,2203,2203]
[null,null,2204,2204]
[null,null,2205,2205]
[null,null,2206,2206]
[null,null,2207,2207]
[null,null,2208,2208]
[null,null,2209,2209]
[null,null,2210,2210]
[null,null,2211,2211]
[null,null,2212,2212]
[null,null,2213,2213]
[null,null,2214,2214]
[null,null,2215,2215]
[null,null,2216,2216]
[null,null,2217,2217]
[null,null,2218,2218]
[null,null,2219,2219]
[null,null,2220,2220]
[null,null,2221,2221]
[null,null,2222,2222]
[null,null,2223,2223]
[null,null,2224,2224]
[null,null,2225,2225]
[null,null,2226,2226]
[null,null,2227,2227]
[null,null,2228,2228]
[null,null,2229,2229]
[null,null,2230,2230]
[null,null,2231,2231]
[null,null,2232,2232]
[null,null,2233,2233]
[null,null,2234,2234]
[null,null,2235,2235]
[null,null,2236,2236]
[null,null,2237,2237]
[null,null,2238,2238]
[null,null,2239,2239]
[null,null,2240,2240]
[null,null,2241,2241]
[null,null,2242,2242]
[null,null,2243,2243]
[null,null,2244,2244]
[null,null,2245,2245]
[null,null,2246,2246]
[null,null,2247,2247]
[null,null,2248,2248]
[null,null,2249,2249]
[null,null,2250,2250]
[null,null,2251,2251]
[null,null,2252,2252]
[null,null,2253,2253]
[null,null,2254,2254]
[null,null,2255,2255]
[null,null,2256,2256]
[null,null,2257,2257]
[null,null,2258,2258]
[null,null,2259,2259]
[null,null,2260,2260]
[null,null,2261,2261]
[null,null,2262,2262]
[null,null,2263,2263]
[null,null,2264,2264]
[null,null,2265,2265]
[null,null,2266,2266]
[null,null,2267,2267]
[null,null,2268,2268]
[null,null,2269,2269]
[null,null,2270,2270]
[null,null,2271,2271]
[null,null,2272,2272]
[null,null,2273,2273]
[null,null,2274,2274]
[null,null,2275,2275]
[null,null,2276,2276]
[null,null,2277,2277]
[null,null,2278,2278]
[null,null,2279,2279]
[null,null,2280,2280]
[null,null,2281,2281]
[null,null,2282,2282]
[null,null,2283,2283]
[null,null,2284,2284]
[null,null,2285,2285]
[null,null,2286,2286]
[null,null,2287,2287]
[null,null,2288,2288]
[null,null,2289,2289]
[null,null,2290,2290]
[null,null,2291,2291]
[null,null,2292,2292]
[null,null,2293,2293]
[null,null,2294,2294]
[null,null,2295,2295]
[null,null,2296,2296]
[null,null,2297,2297]
[null,null,2298,2298]
[null,null,2299,2299]
[null,null,2300,2300]
[null,null,2301,2301]
[null,null,2302,2302]
[null,null,2303,2303]
[null,null,2304,2304]
[null,null,2305,2305]
[null,null,2306,2306]
[null,null,2307,2307]
[null,null,2308,2308]
[null,null,2309,2309]
[null,null,2310,2310]
[null,null,2311,2311]
[null,null,2312,2312]
[null,null,2313,2313]
[null,null,2314,2314]
[null,null,2315,2315]
[null,null,2316,2316]
[null,null,2317,2317]
[null,null,2318,2318]
[null,null,2319,2319]
[null,null,2320,2320]
[null,null,2321,2321]
[null,null,2322,2322]
[null,null,2323,2323]
[null,null,2324,2324]
[null,null,2325,2325]
[null,null,2326,2326]
[null,null,2327,2327]
[null,null,2328,2328]
[null,null,2329,2329]
[null,null,2330,2330]
[null,null,2331,2331]
[null,null,2332,2332]
[null,null,2333,2333]
[null,null,2334,2334]
[null,null,2335,2335]
[null,null,2336,2336]
[null,null,2337,2337]
[null,null,2338,2338]
[null,null,2339,2339]
[null,null,2340,2340]
[null,null,2341,2341]
[null,null,2342,2342]
[null,null,2343,2343]
[null,null,2344,2344]
[null,null,2345,2345]
[null,null,2346,2346]
[null,null,2347,2347]
[null,null,2348,2348]
[null,null,2349,2349]
[null,null,2350,2350]
[null,null,2351,2351]
[null,null,2352,2352]
[null,null,2353,2353]
[null,null,2354,2354]
[null,null,2355,2355]
[null,null,2356,2356]
[null,null,2357,2357]
[null,null,2358,2358]
[null,null,2359,2359]
[null,null,2360,2360]
[null,null,2361,2361]
[null,null,2362,2362]
[null,null,2363,2363]
[null,null,2364,2364]
[null,null,2365,2365]
[null,null,2366,2366]
[null,null,2367,2367]
[null,null,2368,2368]
[null,null,2369,2369]
[null,null,2370,2370]
[null,null,2371,2371]
[null,null,2372,2372]
[null,null,2373,2373]
[null,null,2374,2374]
[null,null,2375,2375]
[null,null,2376,2376]
[null,null,2377,2377]
[null,null,2378,2378]
[null,null,2379,2379]
[null,null,2380,2380]
[null,null,2381,2381]
[null,null,2382,2382]
[null,null,2383,2383]
[null,null,2384,2384]
[null,null,2385,2385]
[null,null,2386,2386]
[null,null,2387,2387]
[null,null,2388,2388]
[null,null,2389,2389]
[null,null,2390,2390]
[null,null,2391,2391]
[null,null,2392,2392]
[null,null,2393,2393]
[null,null,2394,2394]
[null,null,2395,2395]
[null,null,2396,2396]
[null,null,2397,2397]
[null,null,2398,2398]
[null,null,2399,2399]
[null,null,2400,2400]
[null,null,2401,2401]
[null,null,2402,2402]
[null,null,2403,2403]
[null,null,2404,2404]
[null,null,2405,2405]
[null,null,2406,2406]
[null,null,2407,2407]
[null,null,2408,2408]
[null,null,2409,2409]
[null,null,2410,2410]
[null,null,2411,2411]
[null,null,2412,2412]
[null,null,2413,2413]
[null,null,2414,2414]
[null,null,2415,2415]
[null,null,2416,2416]
[null,null,2417,2417]
[null,null,2418,2418]
[null,null,2419,2419]
[null,null,2420,2420]
[null,null,2421,2421]
[null,null,2422,2422]
[null,null,2423,2423]
[null,null,2424,2424]
[null,null,2425,2425]
[null,null,2426,2426]
[null,null,2427,2427]
[null,null,2428,2428]
[null,null,2429,2429]
[null,null,2430,2430]
[null,null,2431,2431]
[null,null,2432,2432]
[null,null,2433,2433]
[null,null,2434,2434]
[null,null,2435,2435]
[null,null,2436,2436]
[null,null,2437,2437]
[null,null,2438,2438]
[null,null,2439,2439]
[null,null,2440,2440]
[null,null,2441,2441]
[null,null,2442,2442]
[null,null,2443,2443]
[null,null,2444,2444]
[null,null,2445,2445]
[null,null,2446,2446]
[null,null,2447,2447]
[null,null,2448,2448]
[null,null,2449,2449]
[null,null,2450,2450]
[null,null,2451,2451]
[null,null,2452,2452]
[null,null,2453,2453]
[null,null,2454,2454]
[null,null,2455,2455]
[null,null,2456,2456]
[null,null,2457,2457]
[null,null,2458,2458]
[null,null,2459,2459]
[null,null,2460,2460]
[null,null,2461,2461]
[null,null,2462,2462]
[null,null,2463,2463]
[null,null,2464,2464]
[null,null,2465,2465]
[null,null,2466,2466]
[null,null,2467,2467]
[null,null,2468,2468]
[null,null,2469,2469]
[null,null,2470,2470]
[null,null,2471,2471]
[null,null,2472,2472]
[null,null,2473,2473]
[null,null,2474,2474]
[null,null,2475,2475]
[null,null,2476,2476]
[null,null,2477,2477]
[null,null,2478,2478]
[null,null,2479,2479]
[null,null,2480,2480]
[null,null,2481,2481]
[null,null,2482,2482]
[null,null,2483,2483]
[null,null,2484,2484]
[null,null,2485,2485]
[null,null,2486,2486]
[null,null,2487,2487]
[null,null,2488,2488]
[null,null,2489,2489]
[null,null,2490,2490]
[null,null,2491,2491]
[null,null,2492,2492]
[null,null,2493,2493]
[null,null,2494,2494]
[null,null,2495,2495]
[null,null,2496,2496]
[null,null,2497,2497]
[null,null,2498,2498]
[null,null,2499,2499]
[null,null,2500,2500]
[null,null,2501,2501]
[null,null,2502,2502]
[null,null,2503,2503]
[null,null,2504,2504]
[null,null,2505,2505]
[null,null,2506,2506]
[null,null,2507,2507]
[null,null,2508,2508]
[null,null,2509,2509]
[null,null,2510,2510]
[null,null,2511,2511]
[null,null,2512,2512]
[null,null,2513,2513]
[null,null,2514,2514]
[null,null,2515,2515]
[null,null,2516,2516]
[null,null,2517,2517]
[null,null,2518,2518]
[null,null,2519,2519]
[null,null,2520,2520]
[null,null,2521,2521]
[null,null,2522,2522]
[null,null,2523,2523]
[null,null,2524,2524]
[null,null,2525,2525]
[null,null,2526,2526]
[null,null,2527,2527]
[null,null,2528,2528]
[null,null,2529,2529]
[null,null,2530,2530]
[null,null,2531,2531]
[null,null,2532,2532]
[null,null,2533,2533]
[null,null,2534,2534]
[null,null,2535,2535]
[null,null,2536,2536]
[null,null,2537,2537]
[null,null,2538,2538]
[null,null,2539,2539]
[null,null,2540,2540]
[null,null,2541,2541]
[null,null,2542,2542]
[null,null,2543,2543]
[null,null,2544,2544]
[null,null,2545,2545]
[null,null,2546,2546]
[null,null,2547,2547]
[null,null,2548,2548]
[null,null,2549,2549]
[null,null,2550,2550]
[null,null,2551,2551]
[null,null,2552,2552]
[null,null,2553,2553]
[null,null,2554,2554]
[null,null,2555,2555]
[null,null,2556,2556]
[null,null,2557,2557]
[null,null,2558,2558]
[null,null,2559,2559]
[null,null,2560,2560]
[null,null,2561,2561]
[null,null,2562,2562]
[null,null,2563,2563]
[null,null,2564,2564]
[null,null,2565,2565]
[null,null,2566,2566]
[null,null,2567,2567]
[null,null,2568,2568]
[null,null,2569,2569]
[null,null,2570,2570]
[null,null,2571,2571]
[null,null,2572,2572]
[null,null,2573,2573]
[null,null,2574,2574]
[null,null,2575,2575]
[null,null,2576,2576]
[null,null,2577,2577]
[null,null,2578,2578]
[null,null,2579,2579]
[null,null,2580,2580]
[null,null,2581,2581]
[null,null,2582,2582]
[null,null,2583,2583]
[null,null,2584,2584]
[null,null,2585,2585]
[null,null,2586,2586]
[null,null,2587,2587]
[null,null,2588,2588]
[null,null,2589,2589]
[null,null,2590,2590]
[null,null,2591,2591]
[null,null,2592,2592]
[null,null,2593,2593]
[null,null,2594,2594]
[null,null,2595,2595]
[null,null,2596,2596]
[null,null,2597,2597]
[null,null,2598,2598]
[null,null,2599,2599]
[null,null,2600,2600]
[null,null,2601,2601]
[null,null,2602,2602]
[null,null,2603,2603]
[null,null,2604,2604]
[null,null,2605,2605]
[null,null,2606,2606]
[null,null,2607,2607]
[null,null,2608,2608]
[null,null,2609,2609]
[null,null,2610,2610]
[null,null,2611,2611]
[null,null,2612,2612]
[null,null,2613,2613]
[null,null,2614,2614]
[null,null,2615,2615]
[null,null,2616,2616]
[null,null,2617,2617]
[null,null,2618,2618]
[null,null,2619,2619]
[null,null,2620,2620]
[null,null,2621,2621]
[null,null,2622,2622]
[null,null,2623,2623]
[null,null,2624,2624]
[null,null,2625,2625]
[null,null,2626,2626]
[null,null,2627,2627]
[null,null,2628,2628]
[null,null,2629,2629]
[null,null,2630,2630]
[null,null,2631,2631]
[null,null,2632,2632]
[null,null,2633,2633]
[null,null,2634,2634]
[null,null,2635,2635]
[null,null,2636,2636]
[null,null,2637,2637]
[null,null,2638,2638]
[null,null,2639,2639]
[null,null,2640,2640]
[null,null,2641,2641]
[null,null,2642,2642]
[null,null,2643,2643]
[null,null,2644,2644]
[null,null,2645,2645]
[null,null,2646,2646]
[null,null,2647,2647]
[null,null,2648,2648]
[null,null,2649,2649]
[null,null,2650,2650]
[null,null,2651,2651]
[null,null,2652,2652]
[null,null,2653,2653]
[null,null,2654,2654]
[null,null,2655,2655]
[null,null,2656,2656]
[null,null,2657,2657]
[null,null,2658,2658]
[null,null,2659,2659]
[null,null,2660,2660]
[null,null,2661,2661]
[null,null,2662,2662]
[null,null,2663,2663]
[null,null,2664,2664]
[null,null,2665,2665]
[null,null,2666,2666]
[null,null,2667,2667]
[null,null,2668,2668]
[null,null,2669,2669]
[null,null,2670,2670]
[null,null,2671,2671]
[null,null,2672,2672]
[null,null,2673,2673]
[null,null,2674,2674]
[null,null,2675,2675]
[null,null,2676,2676]
[null,null,2677,2677]
[null,null,2678,2678]
[null,null,2679,2679]
[null,null,2680,2680]
[null,null,2681,2681]
[null,null,2682,2682]
[null,null,2683,2683]
[null,null,2684,2684]
[null,null,2685,2685]
[null,null,2686,2686]
[null,null,2687,2687]
[null,null,2688,2688]
[null,null,2689,2689]
[null,null,2690,2690]
[null,null,2691,2691]
[null,null,2692,2692]
[null,null,2693,2693]
[null,null,2694,2694]
[null,null,2695,2695]
[null,null,2696,2696]
[null,null,2697,2697]
[null,null,2698,2698]
[null,null,2699,2699]
[null,null,2700,2700]
[null,null,2701,2701]
[null,null,2702,2702]
[null,null,2703,2703]
[null,null,2704,2704]
[null,null,2705,2705]
[null,null,2706,2706]
[null,null,2707,2707]
[null,null,2708,2708]
[null,null,2709,2709]
[null,null,2710,2710]
[null,null,2711,2711]
[null,null,2712,2712]
[null,null,2713,2713]
[null,null,2714,2714]
[null,null,2715,2715]
[null,null,2716,2716]
[null,null,2717,2717]
[null,null,2718,2718]
[null,null,2719,2719]
[null,null,2720,2720]
[null,null,2721,2721]
[null,null,2722,2722]
[null,null,2723,2723]
[null,null,2724,2724]
[null,null,2725,2725]
[null,null,2726,2726]
[null,null,2727,2727]
[null,null,2728,2728]
[null,null,2729,2729]
[null,null,2730,2730]
[null,null,2731,2731]
[null,null,2732,2732]
[null,null,2733,2733]
[null,null,2734,2734]
[null,null,2735,2735]
[null,null,2736,2736]
[null,null,2737,2737]
[null,null,2738,2738]
[null,null,2739,2739]
[null,null,2740,2740]
[null,null,2741,2741]
[null,null,2742,2742]
[null,null,2743,2743]
[null,null,2744,2744]
[null,null,2745,2745]
[null,null,2746,2746]
[null,null,2747,2747]
[null,null,2748,2748]
[null,null,2749,2749]
[null,null,2750,2750]
[null,null,2751,2751]
[null,null,2752,2752]
[null,null,2753,2753]
[null,null,2754,2754]
[null,null,2755,2755]
[null,null,2756,2756]
[null,null,2757,2757]
[null,null,2758,2758]
[null,null,2759,2759]
[null,null,2760,2760]
[null,null,2761,2761]
[null,null,2762,2762]
[null,null,2763,2763]
[null,null,2764,2764]
[null,null,2765,2765]
[null,null,2766,2766]
[null,null,2767,2767]
[null,null,2768,2768]
[null,null,2769,2769]
[null,null,2770,2770]
[null,null,2771,2771]
[null,null,2772,2772]
[null,null,2773,2773]
[null,null,2774,2774]
[null,null,2775,2775]
[null,null,2776,2776]
[null,null,2777,2777]
[null,null,2778,2778]
[null,null,2779,2779]
[null,null,2780,2780]
[null,null,2781,2781]
[null,null,2782,2782]
[null,null,2783,2783]
[null,null,2784,2784]
[null,null,2785,2785]
[null,null,2786,2786]
[null,null,2787,2787]
[null,null,2788,2788]
[null,null,2789,2789]
[null,null,2790,2790]
[null,null,2791,2791]
[null,null,2792,2792]
[null,null,2793,2793]
[null,null,2794,2794]
[null,null,2795,2795]
[null,null,2796,2796]
[null,null,2797,2797]
[null,null,2798,2798]
[null,null,2799,2799]
[null,null,2800,2800]
[null,null,2801,2801]
[null,null,2802,2802]
[null,null,2803,2803]
[null,null,2804,2804]
[null,null,2805,2805]
[null,null,2806,2806]
[null,null,2807,2807]
[null,null,2808,2808]
[null,null,2809,2809]
[null,null,2810,2810]
[null,null,2811,2811]
[null,null,2812,2812]
[null,null,2813,2813]
[null,null,2814,2814]
[null,null,2815,2815]
[null,null,2816,2816]
[null,null,2817,2817]
[null,null,2818,2818]
[null,null,2819,2819]
[null,null,2820,2820]
[null,null,2821,2821]
[null,null,2822,2822]
[null,null,2823,2823]
[null,null,2824,2824]
[null,null,2825,2825]
[null,null,2826,2826]
[null,null,2827,2827]
[null,null,2828,2828]
[null,null,2829,2829]
[null,null,2830,2830]
[null,null,2831,2831]
[null,null,2832,2832]
[null,null,2833,2833]
[null,null,2834,2834]
[null,null,2835,2835]
[null,null,2836,2836]
[null,null,2837,2837]
[null,null,2838,2838]
[null,null,2839,2839]
[null,null,2840,2840]
[null,null,2841,2841]
[null,null,2842,2842]
[null,null,2843,2843]
[null,null,2844,2844]
[null,null,2845,2845]
[null,null,2846,2846]
[null,null,2847,2847]
[null,null,2848,2848]
[null,null,2849,2849]
[null,null,2850,2850]
[null,null,2851,2851]
[null,null,2852,2852]
[null,null,2853,2853]
[null,null,2854,2854]
[null,null,2855,2855]
[null,null,2856,2856]
[null,null,2857,2857]
[null,null,2858,2858]
[null,null,2859,2859]
[null,null,2860,2860]
[null,null,2861,2861]
[null,null,2862,2862]
[null,null,2863,2863]
[null,null,2864,2864]
[null,null,2865,2865]
[null,null,2866,2866]
[null,null,2867,2867]
[null,null,2868,2868]
[null,null,2869,2869]
[null,null,2870,2870]
[null,null,2871,2871]
[null,null,2872,2872]
[null,null,2873,2873]
[null,null,2874,2874]
[null,null,2875,2875]
[null,null,2876,2876]
[null,null,2877,2877]
[null,null,2878,2878]
[null,null,2879,2879]
[null,null,2880,2880]
[null,null,2881,2881]
[null,null,2882,2882]
[null,null,2883,2883]
[null,null,2884,2884]
[null,null,2885,2885]
[null,null,2886,2886]
[null,null,2887,2887]
[null,null,2888,2888]
[null,null,2889,2889]
[null,null,2890,2890]
[null,null,2891,2891]
[null,null,2892,2892]
[null,null,2893,2893]
[null,null,2894,2894]
[null,null,2895,2895]
[null,null,2896,2896]
[null,null,2897,2897]
[null,null,2898,2898]
[null,null,2899,2899]
[null,null,2900,2900]
[null,null,2901,2901]
[null,null,2902,2902]
[null,null,2903,2903]
[null,null,2904,2904]
[null,null,2905,2905]
[null,null,2906,2906]
[null,null,2907,2907]
[null,null,2908,2908]
[null,null,2909,2909]
[null,null,2910,2910]
[null,null,2911,2911]
[null,null,2912,2912]
[null,null,2913,2913]
[null,null,2914,2914]
[null,null,2915,2915]
[null,null,2916,2916]
[null,null,2917,2917]
[null,null,2918,2918]
[null,null,2919,2919]
[null,null,2920,2920]
[null,null,2921,2921]
[null,null,2922,2922]
[null,null,2923,2923]
[null,null,2924,2924]
[null,null,2925,2925]
[null,null,2926,2926]
[null,null,2927,2927]
[null,null,2928,2928]
[null,null,2929,2929]
[null,null,2930,2930]
[null,null,2931,2931]
[null,null,2932,2932]
[null,null,2933,2933]
[null,null,2934,2934]
[null,null,2935,2935]
[null,null,2936,2936]
[null,null,2937,2937]
[null,null,2938,2938]
[null,null,2939,2939]
[null,null,2940,2940]
[null,null,2941,2941]
[null,null,2942,2942]
[null,null,2943,2943]
[null,null,2944,2944]
[null,null,2945,2945]
[null,null,2946,2946]
[null,null,2947,2947]
[null,null,2948,2948]
[null,null,2949,2949]
[null,null,2950,2950]
[null,null,2951,2951]
[null,null,2952,2952]
[null,null,2953,2953]
[null,null,2954,2954]
[null,null,2955,2955]
[null,null,2956,2956]
[null,null,2957,2957]
[null,null,2958,2958]
[null,null,2959,2959]
[null,null,2960,2960]
[null,null,2961,2961]
[null,null,2962,2962]
[null,null,2963,2963]
[null,null,2964,2964]
[null,null,2965,2965]
[null,null,2966,2966]
[null,null,2967,2967]
[null,null,2968,2968]
[null,null,2969,2969]
[null,null,2970,2970]
[null,null,2971,2971]
[null,null,2972,2972]
[null,null,2973,2973]
[null,null,2974,2974]
[null,null,2975,2975]
[null,null,2976,2976]
[null,null,2977,2977]
[null,null,2978,2978]
[null,null,2979,2979]
[null,null,2980,2980]
[null,null,2981,2981]
[null,null,2982,2982]
[null,null,2983,2983]
[null,null,2984,2984]
[null,null,2985,2985]
[null,null,2986,2986]
[null,null,2987,2987]
[null,null,2988,2988]
[null,null,2989,2989]
[null,null,2990,2990]
[null,null,2991,2991]
[null,null,2992,2992]
[null,null,2993,2993]
[null,null,2994,2994]
[null,null,2995,2995]
[null,null,2996,2996]
[null,null,2997,2997]
[null,null,2998,2998]
[null,null,2999,2999]
[null,null,3000,3000]
[null,null,3001,3001]
[null,null,3002,3002]
[null,null,3003,3003]
[null,null,3004,3004]
[null,null,3005,3005]
[null,null,3006,3006]
[null,null,3007,3007]
[null,null,3008,3008]
[null,null,3009,3009]
[null,null,3010,3010]
[null,null,3011,3011]
[null,null,3012,3012]
[null,null,3013,3013]
[null,null,3014,3014]
[null,null,3015,3015]
[null,null,3016,3016]
[null,null,3017,3017]
[null,null,3018,3018]
[null,null,3019,3019]
[null,null,3020,3020]
[null,null,3021,3021]
[null,null,3022,3022]
[null,null,3023,3023]
[null,null,3024,3024]
[null,null,3025,3025]
[null,null,3026,3026]
[null,null,3027,3027]
[null,null,3028,3028]
[null,null,3029,3029]
[null,null,3030,3030]
[null,null,3031,3031]
[null,null,3032,3032]
[null,null,3033,3033]
[null,null,3034,3034]
[null,null,3035,3035]
[null,null,3036,3036]
[null,null,3037,3037]
[null,null,3038,3038]
[null,null,3039,3039]
[null,null,3040,3040]
[null,null,3041,3041]
[null,null,3042,3042]
[null,null,3043,3043]
[null,null,3044,3044]
[null,null,3045,3045]
[null,null,3046,3046]
[null,null,3047,3047]
[null,null,3048,3048]
[null,null,3049,3049]
[null,null,3050,3050]
[null,null,3051,3051]
[null,null,3052,3052]
[null,null,3053,3053]
[null,null,3054,3054]
[null,null,3055,3055]
[null,null,3056,3056]
[null,null,3057,3057]
[null,null,3058,3058]
[null,null,3059,3059]
[null,null,3060,3060]
[null,null,3061,3061]
[null,null,3062,3062]
[null,null,3063,3063]
[null,null,3064,3064]
[null,null,3065,3065]
[null,null,3066,3066]
[null,null,3067,3067]
[null,null,3068,3068]
[null,null,3069,3069]
[null,null,3070,3070]
[null,null,3071,3071]
[null,null,3072,3072]
[null,null,3073,3073]
[null,null,3074,3074]
[null,null,3075,3075]
[null,null,3076,3076]
[null,null,3077,3077]
[null,null,3078,3078]
[null,null,3079,3079]
[null,null,3080,3080]
[null,null,3081,3081]
[null,null,3082,3082]
[null,null,3083,3083]
[null,null,3084,3084]
[null,null,3085,3085]
[null,null,3086,3086]
[null,null,3087,3087]
[null,null,3088,3088]
[null,null,3089,3089]
[null,null,3090,3090]
[null,null,3091,3091]
[null,null,3092,3092]
[null,null,3093,3093]
[null,null,3094,3094]
[null,null,3095,3095]
[null,null,3096,3096]
[null,null,3097,3097]
[null,null,3098,3098]
[null,null,3099,3099]
[null,null,3100,3100]
[null,null,3101,3101]
[null,null,3102,3102]
[null,null,3103,3103]
[null,null,3104,3104]
[null,null,3105,3105]
[null,null,3106,3106]
[null,null,3107,3107]
[null,null,3108,3108]
[null,null,3109,3109]
[null,null,3110,3110]
[null,null,3111,3111]
[null,null,3112,3112]
[null,null,3113,3113]
[null,null,3114,3114]
[null,null,3115,3115]
[null,null,3116,3116]
[null,null,3117,3117]
[null,null,3118,3118]
[null,null,3119,3119]
[null,null,3120,3120]
[null,null,3121,3121]
[null,null,3122,3122]
[null,null,3123,3123]
[null,null,3124,3124]
[null,null,3125,3125]
[null,null,3126,3126]
[null,null,3127,3127]
[null,null,3128,3128]
[null,null,3129,3129]
[null,null,3130,3130]
[null,null,3131,3131]
[null,null,3132,3132]
[null,null,3133,3133]
[null,null,3134,3134]
[null,null,3135,3135]
[null,null,3136,3136]
[null,null,3137,3137]
[null,null,3138,3138]
[null,null,3139,3139]
[null,null,3140,3140]
[null,null,3141,3141]
[null,null,3142,3142]
[null,null,3143,3143]
[null,null,3144,3144]
[null,null,3145,3145]
[null,null,3146,3146]
[null,null,3147,3147]
[null,null,3148,3148]
[null,null,3149,3149]
[null,null,3150,3150]
[null,null,3151,3151]
[null,null,3152,3152]
[null,null,3153,3153]
[null,null,3154,3154]
[null,null,3155,3155]
[null,null,3156,3156]
[null,null,3157,3157]
[null,null,3158,3158]
[null,null,3159,3159]
[null,null,3160,3160]
[null,null,3161,3161]
[null,null,3162,3162]
[null,null,3163,3163]
[null,null,3164,3164]
[null,null,3165,3165]
[null,null,3166,3166]
[null,null,3167,3167]
[null,null,3168,3168]
[null,null,3169,3169]
[null,null,3170,3170]
[null,null,3171,3171]
[null,null,3172,3172]
[null,null,3173,3173]
[null,null,3174,3174]
[null,null,3175,3175]
[null,null,3176,3176]
[null,null,3177,3177]
[null,null,3178,3178]
[null,null,3179,3179]
[null,null,3180,3180]
[null,null,3181,3181]
[null,null,3182,3182]
[null,null,3183,3183]
[null,null,3184,3184]
[null,null,3185,3185]
[null,null,3186,3186]
[null,null,3187,3187]
[null,null,3188,3188]
[null,null,3189,3189]
[null,null,3190,3190]
[null,null,3191,3191]
[null,null,3192,3192]
[null,null,3193,3193]
[null,null,3194,3194]
[null,null,3195,3195]
[null,null,3196,3196]
[null,null,3197,3197]
[null,null,3198,3198]
[null,null,3199,3199]
[null,null,3200,3200]
[null,null,3201,3201]
[null,null,3202,3202]
[null,null,3203,3203]
[null,null,3204,3204]
[null,null,3205,3205]
[null,null,3206,3206]
[null,null,3207,3207]
[null,null,3208,3208]
[null,null,3209,3209]
[null,null,3210,3210]
[null,null,3211,3211]
[null,null,3212,3212]
[null,null,3213,3213]
[null,null,3214,3214]
[null,null,3215,3215]
[null,null,3216,3216]
[null,null,3217,3217]
[null,null,3218,3218]
[null,null,3219,3219]
[null,null,3220,3220]
[null,null,3221,3221]
[null,null,3222,3222]
[null,null,3223,3223]
[null,null,3224,3224]
[null,null,3225,3225]
[null,null,3226,3226]
[null,null,3227,3227]
[null,null,3228,3228]
[null,null,3229,3229]
[null,null,3230,3230]
[null,null,3231,3231]
[null,null,3232,3232]
[null,null,3233,3233]
[null,null,3234,3234]
[null,null,3235,3235]
[null,null,3236,3236]
[null,null,3237,3237]
[null,null,3238,3238]
[null,null,3239,3239]
[null,null,3240,3240]
[null,null,3241,3241]
[null,null,3242,3242]
[null,null,3243,3243]
[null,null,3244,3244]
[null,null,3245,3245]
[null,null,3246,3246]
[null,null,3247,3247]
[null,null,3248,3248]
[null,null,3249,3249]
[null,null,3250,3250]
[null,null,3251,3251]
[null,null,3252,3252]
[null,null,3253,3253]
[null,null,3254,3254]
[null,null,3255,3255]
[null,null,3256,3256]
[null,null,3257,3257]
[null,null,3258,3258]
[null,null,3259,3259]
[null,null,3260,3260]
[null,null,3261,3261]
[null,null,3262,3262]
[null,null,3263,3263]
[null,null,3264,3264]
[null,null,3265,3265]
[null,null,3266,3266]
[null,null,3267,3267]
[null,null,3268,3268]
[null,null,3269,3269]
[null,null,3270,3270]
[null,null,3271,3271]
[null,null,3272,3272]
[null,null,3273,3273]
[null,null,3274,3274]
[null,null,3275,3275]
[null,null,3276,3276]
[null,null,3277,3277]
[null,null,3278,3278]
[null,null,3279,3279]
[null,null,3280,3280]
[null,null,3281,3281]
[null,null,3282,3282]
[null,null,3283,3283]
[null,null,3284,3284]
[null,null,3285,3285]
[null,null,3286,3286]
[null,null,3287,3287]
[null,null,3288,3288]
[null,null,3289,3289]
[null,null,3290,3290]
[null,null,3291,3291]
[null,null,3292,3292]
[null,null,3293,3293]
[null,null,3294,3294]
[null,null,3295,3295]
[null,null,3296,3296]
[null,null,3297,3297]
[null,null,3298,3298]
[null,null,3299,3299]
[null,null,3300,3300]
[null,null,3301,3301]
[null,null,3302,3302]
[null,null,3303,3303]
[null,null,3304,3304]
[null,null,3305,3305]
[null,null,3306,3306]
[null,null,3307,3307]
[null,null,3308,3308]
[null,null,3309,3309]
[null,null,3310,3310]
[null,null,3311,3311]
[null,null,3312,3312]
[null,null,3313,3313]
[null,null,3314,3314]
[null,null,3315,3315]
[null,null,3316,3316]
[null,null,3317,3317]
[null,null,3318,3318]
[null,null,3319,3319]
[null,null,3320,3320]
[null,null,3321,3321]
[null,null,3322,3322]
[null,null,3323,3323]
[null,null,3324,3324]
[null,null,3325,3325]
[null,null,3326,3326]
[null,null,3327,3327]
[null,null,3328,3328]
[null,null,3329,3329]
[null,null,3330,3330]
[null,null,3331,3331]
[null,null,3332,3332]
[null,null,3333,3333]
[null,null,3334,3334]
[null,null,3335,3335]
[null,null,3336,3336]
[null,null,3337,3337]
[null,null,3338,3338]
[null,null,3339,3339]
[null,null,3340,3340]
[null,null,3341,3341]
[null,null,3342,3342]
[null,null,3343,3343]
[null,null,3344,3344]
[null,null,3345,3345]
[null,null,3346,3346]
[null,null,3347,3347]
[null,null,3348,3348]
[null,null,3349,3349]
[null,null,3350,3350]
[null,null,3351,3351]
[null,null,3352,3352]
[null,null,3353,3353]
[null,null,3354,3354]
[null,null,3355,3355]
[null,null,3356,3356]
[null,null,3357,3357]
[null,null,3358,3358]
[null,null,3359,3359]
[null,null,3360,3360]
[null,null,3361,3361]
[null,null,3362,3362]
[null,null,3363,3363]
[null,null,3364,3364]
[null,null,3365,3365]
[null,null,3366,3366]
[null,null,3367,3367]
[null,null,3368,3368]
[null,null,3369,3369]
[null,null,3370,3370]
[null,null,3371,3371]
[null,null,3372,3372]
[null,null,3373,3373]
[null,null,3374,3374]
[null,null,3375,3375]
[null,null,3376,3376]
[null,null,3377,3377]
[null,null,3378,3378]
[null,null,3379,3379]
[null,null,3380,3380]
[null,null,3381,3381]
[null,null,3382,3382]
[null,null,3383,3383]
[null,null,3384,3384]
[null,null,3385,3385]
[null,null,3386,3386]
[null,null,3387,3387]
[null,null,3388,3388]
[null,null,3389,3389]
[null,null,3390,3390]
[null,null,3391,3391]
[null,null,3392,3392]
[null,null,3393,3393]
[null,null,3394,3394]
[null,null,3395,3395]
[null,null,3396,3396]
[null,null,3397,3397]
[null,null,3398,3398]
[null,null,3399,3399]
[null,null,3400,3400]
[null,null,3401,3401]
[null,null,3402,3402]
[null,null,3403,3403]
[null,null,3404,3404]
[null,null,3405,3405]
[null,null,3406,3406]
[null,null,3407,3407]
[null,null,3408,3408]
[null,null,3409,3409]
[null,null,3410,3410]
[null,null,3411,3411]
[null,null,3412,3412]
[null,null,3413,3413]
[null,null,3414,3414]
[null,null,3415,3415]
[null,null,3416,3416]
[null,null,3417,3417]
[null,null,3418,3418]
[null,null,3419,3419]
[null,null,3420,3420]
[null,null,3421,3421]
[null,null,3422,3422]
[null,null,3423,3423]
[null,null,3424,3424]
[null,null,3425,3425]
[null,null,3426,3426]
[null,null,3427,3427]
[null,null,3428,3428]
[null,null,3429,3429]
[null,null,3430,3430]
[null,null,3431,3431]
[null,null,3432,3432]
[null,null,3433,3433]
[null,null,3434,3434]
[null,null,3435,3435]
[null,null,3436,3436]
[null,null,3437,3437]
[null,null,3438,3438]
[null,null,3439,3439]
[null,null,3440,3440]
[null,null,3441,3441]
[null,null,3442,3442]
[null,null,3443,3443]
[null,null,3444,3444]
[null,null,3445,3445]
[null,null,3446,3446]
[null,null,3447,3447]
[null,null,3448,3448]
[null,null,3449,3449]
[null,null,3450,3450]
[null,null,3451,3451]
[null,null,3452,3452]
[null,null,3453,3453]
[null,null,3454,3454]
[null,null,3455,3455]
[null,null,3456,3456]
[null,null,3457,3457]
[null,null,3458,3458]
[null,null,3459,3459]
[null,null,3460,3460]
[null,null,3461,3461]
[null,null,3462,3462]
[null,null,3463,3463]
[null,null,3464,3464]
[null,null,3465,3465]
[null,null,3466,3466]
[null,null,3467,3467]
[null,null,3468,3468]
[null,null,3469,3469]
[null,null,3470,3470]
[null,null,3471,3471]
[null,null,3472,3472]
[null,null,3473,3473]
[null,null,3474,3474]
[null,null,3475,3475]
[null,null,3476,3476]
[null,null,3477,3477]
[null,null,3478,3478]
[null,null,3479,3479]
[null,null,3480,3480]
[null,null,3481,3481]
[null,null,3482,3482]
[null,null,3483,3483]
[null,null,3484,3484]
[null,null,3485,3485]
[null,null,3486,3486]
[null,null,3487,3487]
[null,null,3488,3488]
[null,null,3489,3489]
[null,null,3490,3490]
[null,null,3491,3491]
[null,null,3492,3492]
[null,null,3493,3493]
[null,null,3494,3494]
[null,null,3495,3495]
[null,null,3496,3496]
[null,null,3497,3497]
[null,null,3498,3498]
[null,null,3499,3499]
[null,null,3500,3500]
[null,null,3501,3501]
[null,null,3502,3502]
[null,null,3503,3503]
[null,null,3504,3504]
[null,null,3505,3505]
[null,null,3506,3506]
[null,null,3507,3507]
[null,null,3508,3508]
[null,null,3509,3509]
[null,null,3510,3510]
[null,null,3511,3511]
[null,null,3512,3512]
[null,null,3513,3513]
[null,null,3514,3514]
[null,null,3515,3515]
[null,null,3516,3516]
[null,null,3517,3517]
[null,null,3518,3518]
[null,null,3519,3519]
[null,null,3520,3520]
[null,null,3521,3521]
[null,null,3522,3522]
[null,null,3523,3523]
[null,null,3524,3524]
[null,null,3525,3525]
[null,null,3526,3526]
[null,null,3527,3527]
[null,null,3528,3528]
[null,null,3529,3529]
[null,null,3530,3530]
[null,null,3531,3531]
[null,null,3532,3532]
[null,null,3533,3533]
[null,null,3534,3534]
[null,null,3535,3535]
[null,null,3536,3536]
[null,null,3537,3537]
[null,null,3538,3538]
[null,null,3539,3539]
[null,null,3540,3540]
[null,null,3541,3541]
[null,null,3542,3542]
[null,null,3543,3543]
[null,null,3544,3544]
[null,null,3545,3545]
[null,null,3546,3546]
[null,null,3547,3547]
[null,null,3548,3548]
[null,null,3549,3549]
[null,null,3550,3550]
[null,null,3551,3551]
[null,null,3552,3552]
[null,null,3553,3553]
[null,null,3554,3554]
[null,null,3555,3555]
[null,null,3556,3556]
[null,null,3557,3557]
[null,null,3558,3558]
[null,null,3559,3559]
[null,null,3560,3560]
[null,null,3561,3561]
[null,null,3562,3562]
[null,null,3563,3563]
[null,null,3564,3564]
[null,null,3565,3565]
[null,null,3566,3566]
[null,null,3567,3567]
[null,null,3568,3568]
[null,null,3569,3569]
[null,null,3570,3570]
[null,null,3571,3571]
[null,null,3572,3572]
[null,null,3573,3573]
[null,null,3574,3574]
[null,null,3575,3575]
[null,null,3576,3576]
[null,null,3577,3577]
[null,null,3578,3578]
[null,null,3579,3579]
[null,null,3580,3580]
[null,null,3581,3581]
[null,null,3582,3582]
[null,null,3583,3583]
[null,null,3584,3584]
[null,null,3585,3585]
[null,null,3586,3586]
[null,null,3587,3587]
[null,null,3588,3588]
[null,null,3589,3589]
[null,null,3590,3590]
[null,null,3591,3591]
[null,null,3592,3592]
[null,null,3593,3593]
[null,null,3594,3594]
[null,null,3595,3595]
[null,null,3596,3596]
[null,null,3597,3597]
[null,null,3598,3598]
[null,null,3599,3599]
[null,null,3600,3600]
[null,null,3601,3601]
[null,null,3602,3602]
[null,null,3603,3603]
[null,null,3604,3604]
[null,null,3605,3605]
[null,null,3606,3606]
[null,null,3607,3607]
[null,null,3608,3608]
[null,null,3609,3609]
[null,null,3610,3610]
[null,null,3611,3611]
[null,null,3612,3612]
[null,null,3613,3613]
[null,null,3614,3614]
[null,null,3615,3615]
[null,null,3616,3616]
[null,null,3617,3617]
[null,null,3618,3618]
[null,null,3619,3619]
[null,null,3620,3620]
[null,null,3621,3621]
[null,null,3622,3622]
[null,null,3623,3623]
[null,null,3624,3624]
[null,null,3625,3625]
[null,null,3626,3626]
[null,null,3627,3627]
[null,null,3628,3628]
[null,null,3629,3629]
[null,null,3630,3630]
[null,null,3631,3631]
[null,null,3632,3632]
[null,null,3633,3633]
[null,null,3634,3634]
[null,null,3635,3635]
[null,null,3636,3636]
[null,null,3637,3637]
[null,null,3638,3638]
[null,null,3639,3639]
[null,null,3640,3640]
[null,null,3641,3641]
[null,null,3642,3642]
[null,null,3643,3643]
[null,null,3644,3644]
[null,null,3645,3645]
[null,null,3646,3646]
[null,null,3647,3647]
[null,null,3648,3648]
[null,null,3649,3649]
[null,null,3650,3650]
[null,null,3651,3651]
[null,null,3652,3652]
[null,null,3653,3653]
[null,null,3654,3654]
[null,null,3655,3655]
[null,null,3656,3656]
[null,null,3657,3657]
[null,null,3658,3658]
[null,null,3659,3659]
[null,null,3660,3660]
[null,null,3661,3661]
[null,null,3662,3662]
[null,null,3663,3663]
[null,null,3664,3664]
[null,null,3665,3665]
[null,null,3666,3666]
[null,null,3667,3667]
[null,null,3668,3668]
[null,null,3669,3669]
[null,null,3670,3670]
[null,null,3671,3671]
[null,null,3672,3672]
[null,null,3673,3673]
[null,null,3674,3674]
[null,null,3675,3675]
[null,null,3676,3676]
[null,null,3677,3677]
[null,null,3678,3678]
[null,null,3679,3679]
[null,null,3680,3680]
[null,null,3681,3681]
[null,null,3682,3682]
[null,null,3683,3683]
[null,null,3684,3684]
[null,null,3685,3685]
[null,null,3686,3686]
[null,null,3687,3687]
[null,null,3688,3688]
[null,null,3689,3689]
[null,null,3690,3690]
[null,null,3691,3691]
[null,null,3692,3692]
[null,null,3693,3693]
[null,null,3694,3694]
[null,null,3695,3695]
[null,null,3696,3696]
[null,null,3697,3697]
[null,null,3698,3698]
[null,null,3699,3699]
[null,null,3700,3700]
[null,null,3701,3701]
[null,null,3702,3702]
[null,null,3703,3703]
[null,null,3704,3704]
[null,null,3705,3705]
[null,null,3706,3706]
[null,null,3707,3707]
[null,null,3708,3708]
[null,null,3709,3709]
[null,null,3710,3710]
[null,null,3711,3711]
[null,null,3712,3712]
[null,null,3713,3713]
[null,null,3714,3714]
[null,null,3715,3715]
[null,null,3716,3716]
[null,null,3717,3717]
[null,null,3718,3718]
[null,null,3719,3719]
[null,null,3720,3720]
[null,null,3721,3721]
[null,null,3722,3722]
[null,null,3723,3723]
[null,null,3724,3724]
[null,null,3725,3725]
[null,null,3726,3726]
[null,null,3727,3727]
[null,null,3728,3728]
[null,null,3729,3729]
[null,null,3730,3730]
[null,null,3731,3731]
[null,null,3732,3732]
[null,null,3733,3733]
[null,null,3734,3734]
[null,null,3735,3735]
[null,null,3736,3736]
[null,null,3737,3737]
[null,null,3738,3738]
[null,null,3739,3739]
[null,null,3740,3740]
[null,null,3741,3741]
[null,null,3742,3742]
[null,null,3743,3743]
[null,null,3744,3744]
[null,null,3745,3745]
[null,null,3746,3746]
[null,null,3747,3747]
[null,null,3748,3748]
[null,null,3749,3749]
[null,null,3750,3750]
[null,null,3751,3751]
[null,null,3752,3752]
[null,null,3753,3753]
[null,null,3754,3754]
[null,null,3755,3755]
[null,null,3756,3756]
[null,null,3757,3757]
[null,null,3758,3758]
[null,null,3759,3759]
[null,null,3760,3760]
[null,null,3761,3761]
[null,null,3762,3762]
[null,null,3763,3763]
[null,null,3764,3764]
[null,null,3765,3765]
[null,null,3766,3766]
[null,null,3767,3767]
[null,null,3768,3768]
[null,null,3769,3769]
[null,null,3770,3770]
[null,null,3771,3771]
[null,null,3772,3772]
[null,null,3773,3773]
[null,null,3774,3774]
[null,null,3775,3775]
[null,null,3776,3776]
[null,null,3777,3777]
[null,null,3778,3778]
[null,null,3779,3779]
[null,null,3780,3780]
[null,null,3781,3781]
[null,null,3782,3782]
[null,null,3783,3783]
[null,null,3784,3784]
[null,null,3785,3785]
[null,null,3786,3786]
[null,null,3787,3787]
[null,null,3788,3788]
[null,null,3789,3789]
[null,null,3790,3790]
[null,null,3791,3791]
[null,null,3792,3792]
[null,null,3793,3793]
[null,null,3794,3794]
[null,null,3795,3795]
[null,null,3796,3796]
[null,null,3797,3797]
[null,null,3798,3798]
[null,null,3799,3799]
[null,null,3800,3800]
[null,null,3801,3801]
[null,null,3802,3802]
[null,null,3803,3803]
[null,null,3804,3804]
[null,null,3805,3805]
[null,null,3806,3806]
[null,null,3807,3807]
[null,null,3808,3808]
[null,null,3809,3809]
[null,null,3810,3810]
[null,null,3811,3811]
[null,null,3812,3812]
[null,null,3813,3813]
[null,null,3814,3814]
[null,null,3815,3815]
[null,null,3816,3816]
[null,null,3817,3817]
[null,null,3818,3818]
[null,null,3819,3819]
[null,null,3820,3820]
[null,null,3821,3821]
[null,null,3822,3822]
[null,null,3823,3823]
[null,null,3824,3824]
[null,null,3825,3825]
[null,null,3826,3826]
[null,null,3827,3827]
[null,null,3828,3828]
[null,null,3829,3829]
[null,null,3830,3830]
[null,null,3831,3831]
[null,null,3832,3832]
[null,null,3833,3833]
[null,null,3834,3834]
[null,null,3835,3835]
[null,null,3836,3836]
[null,null,3837,3837]
[null,null,3838,3838]
[null,null,3839,3839]
[null,null,3840,3840]
[null,null,3841,3841]
[null,null,3842,3842]
[null,null,3843,3843]
[null,null,3844,3844]
[null,null,3845,3845]
[null,null,3846,3846]
[null,null,3847,3847]
[null,null,3848,3848]
[null,null,3849,3849]
[null,null,3850,3850]
[null,null,3851,3851]
[null,null,3852,3852]
[null,null,3853,3853]
[null,null,3854,3854]
[null,null,3855,3855]
[null,null,3856,3856]
[null,null,3857,3857]
[null,null,3858,3858]
[null,null,3859,3859]
[null,null,3860,3860]
[null,null,3861,3861]
[null,null,3862,3862]
[null,null,3863,3863]
[null,null,3864,3864]
[null,null,3865,3865]
[null,null,3866,3866]
[null,null,3867,3867]
[null,null,3868,3868]
[null,null,3869,3869]
[null,null,3870,3870]
[null,null,3871,3871]
[null,null,3872,3872]
[null,null,3873,3873]
[null,null,3874,3874]
[null,null,3875,3875]
[null,null,3876,3876]
[null,null,3877,3877]
[null,null,3878,3878]
[null,null,3879,3879]
[null,null,3880,3880]
[null,null,3881,3881]
[null,null,3882,3882]
[null,null,3883,3883]
[null,null,3884,3884]
[null,null,3885,3885]
[null,null,3886,3886]
[null,null,3887,3887]
[null,null,3888,3888]
[null,null,3889,3889]
[null,null,3890,3890]
[null,null,3891,3891]
[null,null,3892,3892]
[null,null,3893,3893]
[null,null,3894,3894]
[null,null,3895,3895]
[null,null,3896,3896]
[null,null,3897,3897]
[null,null,3898,3898]
[null,null,3899,3899]
[null,null,3900,3900]
[null,null,3901,3901]
[null,null,3902,3902]
[null,null,3903,3903]
[null,null,3904,3904]
[null,null,3905,3905]
[null,null,3906,3906]
[null,null,3907,3907]
[null,null,3908,3908]
[null,null,3909,3909]
[null,null,3910,3910]
[null,null,3911,3911]
[null,null,3912,3912]
[null,null,3913,3913]
[null,null,3914,3914]
[null,null,3915,3915]
[null,null,3916,3916]
[null,null,3917,3917]
[null,null,3918,3918]
[null,null,3919,3919]
[null,null,3920,3920]
[null,null,3921,3921]
[null,null,3922,3922]
[null,null,3923,3923]
[null,null,3924,3924]
[null,null,3925,3925]
[null,null,3926,3926]
[null,null,3927,3927]
[null,null,3928,3928]
[null,null,3929,3929]
[null,null,3930,3930]
[null,null,3931,3931]
[null,null,3932,3932]
[null,null,3933,3933]
[null,null,3934,3934]
[null,null,3935,3935]
[null,null,3936,3936]
[null,null,3937,3937]
[null,null,3938,3938]
[null,null,3939,3939]
[null,null,3940,3940]
[null,null,3941,3941]
[null,null,3942,3942]
[null,null,3943,3943]
[null,null,3944,3944]
[null,null,3945,3945]
[null,null,3946,3946]
[null,null,3947,3947]
[null,null,3948,3948]
[null,null,3949,3949]
[null,null,3950,3950]
[null,null,3951,3951]
[null,null,3952,3952]
[null,null,3953,3953]
[null,null,3954,3954]
[null,null,3955,3955]
[null,null,3956,3956]
[null,null,3957,3957]
[null,null,3958,3958]
[null,null,3959,3959]
[null,null,3960,3960]
[null,null,3961,3961]
[null,null,3962,3962]
[null,null,3963,3963]
[null,null,3964,3964]
[null,null,3965,3965]
[null,null,3966,3966]
[null,null,3967,3967]
[null,null,3968,3968]
[null,null,3969,3969]
[null,null,3970,3970]
[null,null,3971,3971]
[null,null,3972,3972]
[null,null,3973,3973]
[null,null,3974,3974]
[null,null,3975,3975]
[null,null,3976,3976]
[null,null,3977,3977]
[null,null,3978,3978]
[null,null,3979,3979]
[null,null,3980,3980]
[null,null,3981,3981]
[null,null,3982,3982]
[null,null,3983,3983]
[null,null,3984,3984]
[null,null,3985,3985]
[null,null,3986,3986]
[null,null,3987,3987]
[null,null,3988,3988]
[null,null,3989,3989]
[null,null,3990,3990]
[null,null,3991,3991]
[null,null,3992,3992]
[null,null,3993,3993]
[null,null,3994,3994]
[null,null,3995,3995]
[null,null,3996,3996]
[null,null,3997,3997]
[null,null,3998,3998]
[null,null,3999,3999]
[null,null,4000,4000]
[null,null,4001,4001]
[null,null,4002,4002]
[null,null,4003,4003]
[null,null,4004,4004]
[null,null,4005,4005]
[null,null,4006,4006]
[null,null,4007,4007]
[null,null,4008,4008]
[null,null,4009,4009]
[null,null,4010,4010]
[null,null,4011,4011]
[null,null,4012,4012]
[null,null,4013,4013]
[null,null,4014,4014]
[null,null,4015,4015]
[null,null,4016,4016]
[null,null,4017,4017]
[null,null,4018,4018]
[null,null,4019,4019]
[null,null,4020,4020]
[null,null,4021,4021]
[null,null,4022,4022]
[null,null,4023,4023]
[null,null,4024,4024]
[null,null,4025,4025]
[null,null,4026,4026]
[null,null,4027,4027]
[null,null,4028,4028]
[null,null,4029,4029]
[null,null,4030,4030]
[null,null,4031,4031]
[null,null,4032,4032]
[null,null,4033,4033]
[null,null,4034,4034]
[null,null,4035,4035]
[null,null,4036,4036]
[null,null,4037,4037]
[null,null,4038,4038]
[null,null,4039,4039]
[null,null,4040,4040]
[null,null,4041,4041]
[null,null,4042,4042]
[null,null,4043,4043]
[null,null,4044,4044]
[null,null,4045,4045]
[null,null,4046,4046]
[null,null,4047,4047]
[null,null,4048,4048]
[null,null,4049,4049]
[null,null,4050,4050]
[null,null,4051,4051]
[null,null,4052,4052]
[null,null,4053,4053]
[null,null,4054,4054]
[null,null,4055,4055]
[null,null,4056,4056]
[null,null,4057,4057]
[null,null,4058,4058]
[null,null,4059,4059]
[null,null,4060,4060]
[null,null,4061,4061]
[null,null,4062,4062]
[null,null,4063,4063]
[null,null,4064,4064]
[null,null,4065,4065]
[null,null,4066,4066]
[null,null,4067,4067]
[null,null,4068,4068]
[null,null,4069,4069]
[null,null,4070,4070]
[null,null,4071,4071]
[null,null,4072,4072]
[null,null,4073,4073]
[null,null,4074,4074]
[null,null,4075,4075]
[null,null,4076,4076]
[null,null,4077,4077]
[null,null,4078,4078]
[null,null,4079,4079]
[null,null,4080,4080]
[null,null,4081,4081]
[null,null,4082,4082]
[null,null,4083,4083]
[null,null,4084,4084]
[null,null,4085,4085]
[null,null,4086,4086]
[null,null,4087,4087]
[null,null,4088,4088]
[null,null,4089,4089]
[null,null,4090,4090]
[null,null,4091,4091]
[null,null,4092,4092]
[null,null,4093,4093]
[null,null,4094,4094]
[null,null,4095,4095]
[null,null,4096,4096]
[null,null,4097,4097]
[null,null,4098,4098]
[null,null,4099,4099]
[null,null,4100,4100]
[null,null,4101,4101]
[null,null,4102,4102]
[null,null,4103,4103]
[null,null,4104,4104]
[null,null,4105,4105]
[null,null,4106,4106]
[null,null,4107,4107]
[null,null,4108,4108]
[null,null,4109,4109]
[null,null,4110,4110]
[null,null,4111,4111]
[null,null,4112,4112]
[null,null,4113,4113]
[null,null,4114,4114]
[null,null,4115,4115]
[null,null,4116,4116]
[null,null,4117,4117]
[null,null,4118,4118]
[null,null,4119,4119]
[null,null,4120,4120]
[null,null,4121,4121]
[null,null,4122,4122]
[null,null,4123,4123]
[null,null,4124,4124]
[null,null,4125,4125]
[null,null,4126,4126]
[null,null,4127,4127]
[null,null,4128,4128]
[null,null,4129,4129]
[null,null,4130,4130]
[null,null,4131,4131]
[null,null,4132,4132]
[null,null,4133,4133]
[null,null,4134,4134]
[null,null,4135,4135]
[null,null,4136,4136]
[null,null,4137,4137]
[null,null,4138,4138]
[null,null,4139,4139]
[null,null,4140,4140]
[null,null,4141,4141]
[null,null,4142,4142]
[null,null,4143,4143]
[null,null,4144,4144]
[null,null,4145,4145]
[null,null,4146,4146]
[null,null,4147,4147]
[null,null,4148,4148]
[null,null,4149,4149]
[null,null,4150,4150]
[null,null,4151,4151]
[null,null,4152,4152]
[null,null,4153,4153]
[null,null,4154,4154]
[null,null,4155,4155]
[null,null,4156,4156]
[null,null,4157,4157]
[null,null,4158,4158]
[null,null,4159,4159]
[null,null,4160,4160]
[null,null,4161,4161]
[null,null,4162,4162]
[null,null,4163,4163]
[null,null,4164,4164]
[null,null,4165,4165]
[null,null,4166,4166]
[null,null,4167,4167]
[null,null,4168,4168]
[null,null,4169,4169]
[null,null,4170,4170]
[null,null,4171,4171]
[null,null,4172,4172]
[null,null,4173,4173]
[null,null,4174,4174]
[null,null,4175,4175]
[null,null,4176,4176]
[null,null,4177,4177]
[null,null,4178,4178]
[null,null,4179,4179]
[null,null,4180,4180]
[null,null,4181,4181]
[null,null,4182,4182]
[null,null,4183,4183]
[null,null,4184,4184]
[null,null,4185,4185]
[null,null,4186,4186]
[null,null,4187,4187]
[null,null,4188,4188]
[null,null,4189,4189]
[null,null,4190,4190]
[null,null,4191,4191]
[null,null,4192,4192]
[null,null,4193,4193]
[null,null,4194,4194]
[null,null,4195,4195]
[null,null,4196,4196]
[null,null,4197,4197]
[null,null,4198,4198]
[null,null,4199,4199]
[null,null,4200,4200]
[null,null,4201,4201]
[null,null,4202,4202]
[null,null,4203,4203]
[null,null,4204,4204]
[null,null,4205,4205]
[null,null,4206,4206]
[null,null,4207,4207]
[null,null,4208,4208]
[null,null,4209,4209]
[null,null,4210,4210]
[null,null,4211,4211]
[null,null,4212,4212]
[null,null,4213,4213]
[null,null,4214,4214]
[null,null,4215,4215]
[null,null,4216,4216]
[null,null,4217,4217]
[null,null,4218,4218]
[null,null,4219,4219]
[null,null,4220,4220]
[null,null,4221,4221]
[null,null,4222,4222]
[null,null,4223,4223]
[null,null,4224,4224]
[null,null,4225,4225]
[null,null,4226,4226]
[null,null,4227,4227]
[null,null,4228,4228]
[null,null,4229,4229]
[null,null,4230,4230]
[null,null,4231,4231]
[null,null,4232,4232]
[null,null,4233,4233]
[null,null,4234,4234]
[null,null,4235,4235]
[null,null,4236,4236]
[null,null,4237,4237]
[null,null,4238,4238]
[null,null,4239,4239]
[null,null,4240,4240]
[null,null,4241,4241]
[null,null,4242,4242]
[null,null,4243,4243]
[null,null,4244,4244]
[null,null,4245,4245]
[null,null,4246,4246]
[null,null,4247,4247]
[null,null,4248,4248]
[null,null,4249,4249]
[null,null,4250,4250]
[null,null,4251,4251]
[null,null,4252,4252]
[null,null,4253,4253]
[null,null,4254,4254]
[null,null,4255,4255]
[null,null,4256,4256]
[null,null,4257,4257]
[null,null,4258,4258]
[null,null,4259,4259]
[null,null,4260,4260]
[null,null,4261,4261]
[null,null,4262,4262]
[null,null,4263,4263]
[null,null,4264,4264]
[null,null,4265,4265]
[null,null,4266,4266]
[null,null,4267,4267]
[null,null,4268,4268]
[null,null,4269,4269]
[null,null,4270,4270]
[null,null,4271,4271]
[null,null,4272,4272]
[null,null,4273,4273]
[null,null,4274,4274]
[null,null,4275,4275]
[null,null,4276,4276]
[null,null,4277,4277]
[null,null,4278,4278]
[null,null,4279,4279]
[null,null,4280,4280]
[null,null,4281,4281]
[null,null,4282,4282]
[null,null,4283,4283]
[null,null,4284,4284]
[null,null,4285,4285]
[null,null,4286,4286]
[null,null,4287,4287]
[null,null,4288,4288]
[null,null,4289,4289]
[null,null,4290,4290]
[null,null,4291,4291]
[null,null,4292,4292]
[null,null,4293,4293]
[null,null,4294,4294]
[null,null,4295,4295]
[null,null,4296,4296]
[null,null,4297,4297]
[null,null,4298,4298]
[null,null,4299,4299]
[null,null,4300,4300]
[null,null,4301,4301]
[null,null,4302,4302]
[null,null,4303,4303]
[null,null,4304,4304]
[null,null,4305,4305]
[null,null,4306,4306]
[null,null,4307,4307]
[null,null,4308,4308]
[null,null,4309,4309]
[null,null,4310,4310]
[null,null,4311,4311]
[null,null,4312,4312]
[null,null,4313,4313]
[null,null,4314,4314]
[null,null,4315,4315]
[null,null,4316,4316]
[null,null,4317,4317]
[null,null,4318,4318]
[null,null,4319,4319]
[null,null,4320,4320]
[null,null,4321,4321]
[null,null,4322,4322]
[null,null,4323,4323]
[null,null,4324,4324]
[null,null,4325,4325]
[null,null,4326,4326]
[null,null,4327,4327]
[null,null,4328,4328]
[null,null,4329,4329]
[null,null,4330,4330]
[null,null,4331,4331]
[null,null,4332,4332]
[null,null,4333,4333]
[null,null,4334,4334]
[null,null,4335,4335]
[null,null,4336,4336]
[null,null,4337,4337]
[null,null,4338,4338]
[null,null,4339,4339]
[null,null,4340,4340]
[null,null,4341,4341]
[null,null,4342,4342]
[null,null,4343,4343]
[null,null,4344,4344]
[null,null,4345,4345]
[null,null,4346,4346]
[null,null,4347,4347]
[null,null,4348,4348]
[null,null,4349,4349]
[null,null,4350,4350]
[null,null,4351,4351]
[null,null,4352,4352]
[null,null,4353,4353]
[null,null,4354,4354]
[null,null,4355,4355]
[null,null,4356,4356]
[null,null,4357,4357]
[null,null,4358,4358]
[null,null,4359,4359]
[null,null,4360,4360]
[null,null,4361,4361]
[null,null,4362,4362]
[null,null,4363,4363]
[null,null,4364,4364]
[null,null,4365,4365]
[null,null,4366,4366]
[null,null,4367,4367]
[null,null,4368,4368]
[null,null,4369,4369]
[null,null,4370,4370]
[null,null,4371,4371]
[null,null,4372,4372]
[null,null,4373,4373]
[null,null,4374,4374]
[null,null,4375,4375]
[null,null,4376,4376]
[null,null,4377,4377]
[null,null,4378,4378]
[null,null,4379,4379]
[null,null,4380,4380]
[null,null,4381,4381]
[null,null,4382,4382]
[null,null,4383,4383]
[null,null,4384,4384]
[null,null,4385,4385]
[null,null,4386,4386]
[null,null,4387,4387]
[null,null,4388,4388]
[null,null,4389,4389]
[null,null,4390,4390]
[null,null,4391,4391]
[null,null,4392,4392]
[null,null,4393,4393]
[null,null,4394,4394]
[null,null,4395,4395]
[null,null,4396,4396]
[null,null,4397,4397]
[null,null,4398,4398]
[null,null,4399,4399]
[null,null,4400,4400]
[null,null,4401,4401]
[null,null,4402,4402]
[null,null,4403,4403]
[null,null,4404,4404]
[null,null,4405,4405]
[null,null,4406,4406]
[null,null,4407,4407]
[null,null,4408,4408]
[null,null,4409,4409]
[null,null,4410,4410]
[null,null,4411,4411]
[null,null,4412,4412]
[null,null,4413,4413]
[null,null,4414,4414]
[null,null,4415,4415]
[null,null,4416,4416]
[null,null,4417,4417]
[null,null,4418,4418]
[null,null,4419,4419]
[null,null,4420,4420]
[null,null,4421,4421]
[null,null,4422,4422]
[null,null,4423,4423]
[null,null,4424,4424]
[null,null,4425,4425]
[null,null,4426,4426]
[null,null,4427,4427]
[null,null,4428,4428]
[null,null,4429,4429]
[null,null,4430,4430]
[null,null,4431,4431]
[null,null,4432,4432]
[null,null,4433,4433]
[null,null,4434,4434]
[null,null,4435,4435]
[null,null,4436,4436]
[null,null,4437,4437]
[null,null,4438,4438]
[null,null,4439,4439]
[null,null,4440,4440]
[null,null,4441,4441]
[null,null,4442,4442]
[null,null,4443,4443]
[null,null,4444,4444]
[null,null,4445,4445]
[null,null,4446,4446]
[null,null,4447,4447]
[null,null,4448,4448]
[null,null,4449,4449]
[null,null,4450,4450]
[null,null,4451,4451]
[null,null,4452,4452]
[null,null,4453,4453]
[null,null,4454,4454]
[null,null,4455,4455]
[null,null,4456,4456]
[null,null,4457,4457]
[null,null,4458,4458]
[null,null,4459,4459]
[null,null,4460,4460]
[null,null,4461,4461]
[null,null,4462,4462]
[null,null,4463,4463]
[null,null,4464,4464]
[null,null,4465,4465]
[null,null,4466,4466]
[null,null,4467,4467]
[null,null,4468,4468]
[null,null,4469,4469]
[null,null,4470,4470]
[null,null,4471,4471]
[null,null,4472,4472]
[null,null,4473,4473]
[null,null,4474,4474]
[null,null,4475,4475]
[null,null,4476,4476]
[null,null,4477,4477]
[null,null,4478,4478]
[null,null,4479,4479]
[null,null,4480,4480]
[null,null,4481,4481]
[null,null,4482,4482]
[null,null,4483,4483]
[null,null,4484,4484]
[null,null,4485,4485]
[null,null,4486,4486]
[null,null,4487,4487]
[null,null,4488,4488]
[null,null,4489,4489]
[null,null,4490,4490]
[null,null,4491,4491]
[null,null,4492,4492]
[null,null,4493,4493]
[null,null,4494,4494]
[null,null,4495,4495]
[null,null,4496,4496]
[null,null,4497,4497]
[null,null,4498,4498]
[null,null,4499,4499]
[null,null,4500,4500]
[null,null,4501,4501]
[null,null,4502,4502]
[null,null,4503,4503]
[null,null,4504,4504]
[null,null,4505,4505]
[null,null,4506,4506]
[null,null,4507,4507]
[null,null,4508,4508]
[null,null,4509,4509]
[null,null,4510,4510]
[null,null,4511,4511]
[null,null,4512,4512]
[null,null,4513,4513]
[null,null,4514,4514]
[null,null,4515,4515]
[null,null,4516,4516]
[null,null,4517,4517]
[null,null,4518,4518]
[null,null,4519,4519]
[null,null,4520,4520]
[null,null,4521,4521]
[null,null,4522,4522]
[null,null,4523,4523]
[null,null,4524,4524]
[null,null,4525,4525]
[null,null,4526,4526]
[null,null,4527,4527]
[null,null,4528,4528]
[null,null,4529,4529]
[null,null,4530,4530]
[null,null,4531,4531]
[null,null,4532,4532]
[null,null,4533,4533]
[null,null,4534,4534]
[null,null,4535,4535]
[null,null,4536,4536]
[null,null,4537,4537]
[null,null,4538,4538]
[null,null,4539,4539]
[null,null,4540,4540]
[null,null,4541,4541]
[null,null,4542,4542]
[null,null,4543,4543]
[null,null,4544,4544]
[null,null,4545,4545]
[null,null,4546,4546]
[null,null,4547,4547]
[null,null,4548,4548]
[null,null,4549,4549]
[null,null,4550,4550]
[null,null,4551,4551]
[null,null,4552,4552]
[null,null,4553,4553]
[null,null,4554,4554]
[null,null,4555,4555]
[null,null,4556,4556]
[null,null,4557,4557]
[null,null,4558,4558]
[null,null,4559,4559]
[null,null,4560,4560]
[null,null,4561,4561]
[null,null,4562,4562]
[null,null,4563,4563]
[null,null,4564,4564]
[null,null,4565,4565]
[null,null,4566,4566]
[null,null,4567,4567]
[null,null,4568,4568]
[null,null,4569,4569]
[null,null,4570,4570]
[null,null,4571,4571]
[null,null,4572,4572]
[null,null,4573,4573]
[null,null,4574,4574]
[null,null,4575,4575]
[null,null,4576,4576]
[null,null,4577,4577]
[null,null,4578,4578]
[null,null,4579,4579]
[null,null,4580,4580]
[null,null,4581,4581]
[null,null,4582,4582]
[null,null,4583,4583]
[null,null,4584,4584]
[null,null,4585,4585]
[null,null,4586,4586]
[null,null,4587,4587]
[null,null,4588,4588]
[null,null,4589,4589]
[null,null,4590,4590]
[null,null,4591,4591]
[null,null,4592,4592]
[null,null,4593,4593]
[null,null,4594,4594]
[null,null,4595,4595]
[null,null,4596,4596]
[null,null,4597,4597]
[null,null,4598,4598]
[null,null,4599,4599]
[null,null,4600,4600]
[null,null,4601,4601]
[null,null,4602,4602]
[null,null,4603,4603]
[null,null,4604,4604]
[null,null,4605,4605]
[null,null,4606,4606]
[null,null,4607,4607]
[null,null,4608,4608]
[null,null,4609,4609]
[null,null,4610,4610]
[null,null,4611,4611]
[null,null,4612,4612]
[null,null,4613,4613]
[null,null,4614,4614]
[null,null,4615,4615]
[null,null,4616,4616]
[null,null,4617,4617]
[null,null,4618,4618]
[null,null,4619,4619]
[null,null,4620,4620]
[null,null,4621,4621]
[null,null,4622,4622]
[null,null,4623,4623]
[null,null,4624,4624]
[null,null,4625,4625]
[null,null,4626,4626]
[null,null,4627,4627]
[null,null,4628,4628]
[null,null,4629,4629]
[null,null,4630,4630]
[null,null,4631,4631]
[null,null,4632,4632]
[null,null,4633,4633]
[null,null,4634,4634]
[null,null,4635,4635]
[null,null,4636,4636]
[null,null,4637,4637]
[null,null,4638,4638]
[null,null,4639,4639]
[null,null,4640,4640]
[null,null,4641,4641]
[null,null,4642,4642]
[null,null,4643,4643]
[null,null,4644,4644]
[null,null,4645,4645]
[null,null,4646,4646]
[null,null,4647,4647]
[null,null,4648,4648]
[null,null,4649,4649]
[null,null,4650,4650]
[null,null,4651,4651]
[null,null,4652,4652]
[null,null,4653,4653]
[null,null,4654,4654]
[null,null,4655,4655]
[null,null,4656,4656]
[null,null,4657,4657]
[null,null,4658,4658]
[null,null,4659,4659]
[null,null,4660,4660]
[null,null,4661,4661]
[null,null,4662,4662]
[null,null,4663,4663]
[null,null,4664,4664]
[null,null,4665,4665]
[null,null,4666,4666]
[null,null,4667,4667]
[null,null,4668,4668]
[null,null,4669,4669]
[null,null,4670,4670]
[null,null,4671,4671]
[null,null,4672,4672]
[null,null,4673,4673]
[null,null,4674,4674]
[null,null,4675,4675]
[null,null,4676,4676]
[null,null,4677,4677]
[null,null,4678,4678]
[null,null,4679,4679]
[null,null,4680,4680]
[null,null,4681,4681]
[null,null,4682,4682]
[null,null,4683,4683]
[null,null,4684,4684]
[null,null,4685,4685]
[null,null,4686,4686]
[null,null,4687,4687]
[null,null,4688,4688]
[null,null,4689,4689]
[null,null,4690,4690]
[null,null,4691,4691]
[null,null,4692,4692]
[null,null,4693,4693]
[null,null,4694,4694]
[null,null,4695,4695]
[null,null,4696,4696]
[null,null,4697,4697]
[null,null,4698,4698]
[null,null,4699,4699]
[null,null,4700,4700]
[null,null,4701,4701]
[null,null,4702,4702]
[null,null,4703,4703]
[null,null,4704,4704]
[null,null,4705,4705]
[null,null,4706,4706]
[null,null,4707,4707]
[null,null,4708,4708]
[null,null,4709,4709]
[null,null,4710,4710]
[null,null,4711,4711]
[null,null,4712,4712]
[null,null,4713,4713]
[null,null,4714,4714]
[null,null,4715,4715]
[null,null,4716,4716]
[null,null,4717,4717]
[null,null,4718,4718]
[null,null,4719,4719]
[null,null,4720,4720]
[null,null,4721,4721]
[null,null,4722,4722]
[null,null,4723,4723]
[null,null,4724,4724]
[null,null,4725,4725]
[null,null,4726,4726]
[null,null,4727,4727]
[null,null,4728,4728]
[null,null,4729,4729]
[null,null,4730,4730]
[null,null,4731,4731]
[null,null,4732,4732]
[null,null,4733,4733]
[null,null,4734,4734]
[null,null,4735,4735]
[null,null,4736,4736]
[null,null,4737,4737]
[null,null,4738,4738]
[null,null,4739,4739]
[null,null,4740,4740]
[null,null,4741,4741]
[null,null,4742,4742]
[null,null,4743,4743]
[null,null,4744,4744]
[null,null,4745,4745]
[null,null,4746,4746]
[null,null,4747,4747]
[null,null,4748,4748]
[null,null,4749,4749]
[null,null,4750,4750]
[null,null,4751,4751]
[null,null,4752,4752]
[null,null,4753,4753]
[null,null,4754,4754]
[null,null,4755,4755]
[null,null,4756,4756]
[null,null,4757,4757]
[null,null,4758,4758]
[null,null,4759,4759]
[null,null,4760,4760]
[null,null,4761,4761]
[null,null,4762,4762]
[null,null,4763,4763]
[null,null,4764,4764]
[null,null,4765,4765]
[null,null,4766,4766]
[null,null,4767,4767]
[null,null,4768,4768]
[null,null,4769,4769]
[null,null,4770,4770]
[null,null,4771,4771]
[null,null,4772,4772]
[null,null,4773,4773]
[null,null,4774,4774]
[null,null,4775,4775]
[null,null,4776,4776]
[null,null,4777,4777]
[null,null,4778,4778]
[null,null,4779,4779]
[null,null,4780,4780]
[null,null,4781,4781]
[null,null,4782,4782]
[null,null,4783,4783]
[null,null,4784,4784]
[null,null,4785,4785]
[null,null,4786,4786]
[null,null,4787,4787]
[null,null,4788,4788]
[null,null,4789,4789]
[null,null,4790,4790]
[null,null,4791,4791]
[null,null,4792,4792]
[null,null,4793,4793]
[null,null,4794,4794]
[null,null,4795,4795]
[null,null,4796,4796]
[null,null,4797,4797]
[null,null,4798,4798]
[null,null,4799,4799]
[null,null,4800,4800]
[null,null,4801,4801]
[null,null,4802,4802]
[null,null,4803,4803]
[null,null,4804,4804]
[null,null,4805,4805]
[null,null,4806,4806]
[null,null,4807,4807]
[null,null,4808,4808]
[null,null,4809,4809]
[null,null,4810,4810]
[null,null,4811,4811]
[null,null,4812,4812]
[null,null,4813,4813]
[null,null,4814,4814]
[null,null,4815,4815]
[null,null,4816,4816]
[null,null,4817,4817]
[null,null,4818,4818]
[null,null,4819,4819]
[null,null,4820,4820]
[null,null,4821,4821]
[null,null,4822,4822]
[null,null,4823,4823]
[null,null,4824,4824]
[null,null,4825,4825]
[null,null,4826,4826]
[null,null,4827,4827]
[null,null,4828,4828]
[null,null,4829,4829]
[null,null,4830,4830]
[null,null,4831,4831]
[null,null,4832,4832]
[null,null,4833,4833]
[null,null,4834,4834]
[null,null,4835,4835]
[null,null,4836,4836]
[null,null,4837,4837]
[null,null,4838,4838]
[null,null,4839,4839]
[null,null,4840,4840]
[null,null,4841,4841]
[null,null,4842,4842]
[null,null,4843,4843]
[null,null,4844,4844]
[null,null,4845,4845]
[null,null,4846,4846]
[null,null,4847,4847]
[null,null,4848,4848]
[null,null,4849,4849]
[null,null,4850,4850]
[null,null,4851,4851]
[null,null,4852,4852]
[null,null,4853,4853]
[null,null,4854,4854]
[null,null,4855,4855]
[null,null,4856,4856]
[null,null,4857,4857]
[null,null,4858,4858]
[null,null,4859,4859]
[null,null,4860,4860]
[null,null,4861,4861]
[null,null,4862,4862]
[null,null,4863,4863]
[null,null,4864,4864]
[null,null,4865,4865]
[null,null,4866,4866]
[null,null,4867,4867]
[null,null,4868,4868]
[null,null,4869,4869]
[null,null,4870,4870]
[null,null,4871,4871]
[null,null,4872,4872]
[null,null,4873,4873]
[null,null,4874,4874]
[null,null,4875,4875]
[null,null,4876,4876]
[null,null,4877,4877]
[null,null,4878,4878]
[null,null,4879,4879]
[null,null,4880,4880]
[null,null,4881,4881]
[null,null,4882,4882]
[null,null,4883,4883]
[null,null,4884,4884]
[null,null,4885,4885]
[null,null,4886,4886]
[null,null,4887,4887]
[null,null,4888,4888]
[null,null,4889,4889]
[null,null,4890,4890]
[null,null,4891,4891]
[null,null,4892,4892]
[null,null,4893,4893]
[null,null,4894,4894]
[null,null,4895,4895]
[null,null,4896,4896]
[null,null,4897,4897]
[null,null,4898,4898]
[null,null,4899,4899]
[null,null,4900,4900]
[null,null,4901,4901]
[null,null,4902,4902]
[null,null,4903,4903]
[null,null,4904,4904]
[null,null,4905,4905]
[null,null,4906,4906]
[null,null,4907,4907]
[null,null,4908,4908]
[null,null,4909,4909]
[null,null,4910,4910]
[null,null,4911,4911]
[null,null,4912,4912]
[null,null,4913,4913]
[null,null,4914,4914]
[null,null,4915,4915]
[null,null,4916,4916]
[null,null,4917,4917]
[null,null,4918,4918]
[null,null,4919,4919]
[null,null,4920,4920]
[null,null,4921,4921]
[null,null,4922,4922]
[null,null,4923,4923]
[null,null,4924,4924]
[null,null,4925,4925]
[null,null,4926,4926]
[null,null,4927,4927]
[null,null,4928,4928]
[null,null,4929,4929]
[null,null,4930,4930]
[null,null,4931,4931]
[null,null,4932,4932]
[null,null,4933,4933]
[null,null,4934,4934]
[null,null,4935,4935]
[null,null,4936,4936]
[null,null,4937,4937]
[null,null,4938,4938]
[null,null,4939,4939]
[null,null,4940,4940]
[null,null,4941,4941]
[null,null,4942,4942]
[null,null,4943,4943]
[null,null,4944,4944]
[null,null,4945,4945]
[null,null,4946,4946]
[null,null,4947,4947]
[null,null,4948,4948]
[null,null,4949,4949]
[null,null,4950,4950]
[null,null,4951,4951]
[null,null,4952,4952]
[null,null,4953,4953]
[null,null,4954,4954]
[null,null,4955,4955]
[null,null,4956,4956]
[null,null,4957,4957]
[null,null,4958,4958]
[null,null,4959,4959]
[null,null,4960,4960]
[null,null,4961,4961]
[null,null,4962,4962]
[null,null,4963,4963]
[null,null,4964,4964]
[null,null,4965,4965]
[null,null,4966,4966]
[null,null,4967,4967]
[null,null,4968,4968]
[null,null,4969,4969]
[null,null,4970,4970]
[null,null,4971,4971]
[null,null,4972,4972]
[null,null,4973,4973]
[null,null,4974,4974]
[null,null,4975,4975]
[null,null,4976,4976]
[null,null,4977,4977]
[null,null,4978,4978]
[null,null,4979,4979]
[null,null,4980,4980]
[null,null,4981,4981]
[null,null,4982,4982]
[null,null,4983,4983]
[null,null,4984,4984]
[null,null,4985,4985]
[null,null,4986,4986]
[null,null,4987,4987]
[null,null,4988,4988]
[null,null,4989,4989]
[null,null,4990,4990]
[null,null,4991,4991]
[null,null,4992,4992]
[null,null,4993,4993]
[null,null,4994,4994]
[null,null,4995,4995]
[null,null,4996,4996]
[null,null,4997,4997]
[null,null,4998,4998]
[null,null,4999,4999]
[null,null,5000,5000]
[null,null,5001,5001]
[null,null,5002,5002]
[null,null,5003,5003]
[null,null,5004,5004]
[null,null,5005,5005]
[null,null,5006,5006]
[null,null,5007,5007]
[null,null,5008,5008]
[null,null,5009,5009]
[null,null,5010,5010]
[null,null,5011,5011]
[null,null,5012,5012]
[null,null,5013,5013]
[null,null,5014,5014]
[null,null,5015,5015]
[null,null,5016,5016]
[null,null,5017,5017]
[null,null,5018,5018]
[null,null,5019,5019]
[null,null,5020,5020]
[null,null,5021,5021]
[null,null,5022,5022]
[null,null,5023,5023]
[null,null,5024,5024]
[null,null,5025,5025]
[null,null,5026,5026]
[null,null,5027,5027]
[null,null,5028,5028]
[null,null,5029,5029]
[null,null,5030,5030]
[null,null,5031,5031]
[null,null,5032,5032]
[null,null,5033,5033]
[null,null,5034,5034]
[null,null,5035,5035]
[null,null,5036,5036]
[null,null,5037,5037]
[null,null,5038,5038]
[null,null,5039,5039]
[null,null,5040,5040]
[null,null,5041,5041]
[null,null,5042,5042]
[null,null,5043,5043]
[null,null,5044,5044]
[null,null,5045,5045]
[null,null,5046,5046]
[null,null,5047,5047]
[null,null,5048,5048]
[null,null,5049,5049]
[null,null,5050,5050]
[null,null,5051,5051]
[null,null,5052,5052]
[null,null,5053,5053]
[null,null,5054,5054]
[null,null,5055,5055]
[null,null,5056,5056]
[null,null,5057,5057]
[null,null,5058,5058]
[null,null,5059,5059]
[null,null,5060,5060]
[null,null,5061,5061]
[null,null,5062,5062]
[null,null,5063,5063]
[null,null,5064,5064]
[null,null,5065,5065]
[null,null,5066,5066]
[null,null,5067,5067]
[null,null,5068,5068]
[null,null,5069,5069]
[null,null,5070,5070]
[null,null,5071,5071]
[null,null,5072,5072]
[null,null,5073,5073]
[null,null,5074,5074]
[null,null,5075,5075]
[null,null,5076,5076]
[null,null,5077,5077]
[null,null,5078,5078]
[null,null,5079,5079]
[null,null,5080,5080]
[null,null,5081,5081]
[null,null,5082,5082]
[null,null,5083,5083]
[null,null,5084,5084]
[null,null,5085,5085]
[null,null,5086,5086]
[null,null,5087,5087]
[null,null,5088,5088]
[null,null,5089,5089]
[null,null,5090,5090]
[null,null,5091,5091]
[null,null,5092,5092]
[null,null,5093,5093]
[null,null,5094,5094]
[null,null,5095,5095]
[null,null,5096,5096]
[null,null,5097,5097]
[null,null,5098,5098]
[null,null,5099,5099]
[null,null,5100,5100]
[null,null,5101,5101]
[null,null,5102,5102]
[null,null,5103,5103]
[null,null,5104,5104]
[null,null,5105,5105]
[null,null,5106,5106]
[null,null,5107,5107]
[null,null,5108,5108]
[null,null,5109,5109]
[null,null,5110,5110]
[null,null,5111,5111]
[null,null,5112,5112]
[null,null,5113,5113]
[null,null,5114,5114]
[null,null,5115,5115]
[null,null,5116,5116]
[null,null,5117,5117]
[null,null,5118,5118]
[null,null,5119,5119]
[null,null,5120,5120]
[null,null,5121,5121]
[null,null,5122,5122]
[null,null,5123,5123]
[null,null,5124,5124]
[null,null,5125,5125]
[null,null,5126,5126]
[null,null,5127,5127]
[null,null,5128,5128]
[null,null,5129,5129]
[null,null,5130,5130]
[null,null,5131,5131]
[null,null,5132,5132]
[null,null,5133,5133]
[null,null,5134,5134]
[null,null,5135,5135]
[null,null,5136,5136]
[null,null,5137,5137]
[null,null,5138,5138]
[null,null,5139,5139]
[null,null,5140,5140]
[null,null,5141,5141]
[null,null,5142,5142]
[null,null,5143,5143]
[null,null,5144,5144]
[null,null,5145,5145]
[null,null,5146,5146]
[null,null,5147,5147]
[null,null,5148,5148]
[null,null,5149,5149]
[null,null,5150,5150]
[null,null,5151,5151]
[null,null,5152,5152]
[null,null,5153,5153]
[null,null,5154,5154]
[null,null,5155,5155]
[null,null,5156,5156]
[null,null,5157,5157]
[null,null,5158,5158]
[null,null,5159,5159]
[null,null,5160,5160]
[null,null,5161,5161]
[null,null,5162,5162]
[null,null,5163,5163]
[null,null,5164,5164]
[null,null,5165,5165]
[null,null,5166,5166]
[null,null,5167,5167]
[null,null,5168,5168]
[null,null,5169,5169]
[null,null,5170,5170]
[null,null,5171,5171]
[null,null,5172,5172]
[null,null,5173,5173]
[null,null,5174,5174]
[null,null,5175,5175]
[null,null,5176,5176]
[null,null,5177,5177]
[null,null,5178,5178]
[null,null,5179,5179]
[null,null,5180,5180]
[null,null,5181,5181]
[null,null,5182,5182]
[null,null,5183,5183]
[null,null,5184,5184]
[null,null,5185,5185]
[null,null,5186,5186]
[null,null,5187,5187]
[null,null,5188,5188]
[null,null,5189,5189]
[null,null,5190,5190]
[null,null,5191,5191]
[null,null,5192,5192]
[null,null,5193,5193]
[null,null,5194,5194]
[null,null,5195,5195]
[null,null,5196,5196]
[null,null,5197,5197]
[null,null,5198,5198]
[null,null,5199,5199]
[null,null,5200,5200]
[null,null,5201,5201]
[null,null,5202,5202]
[null,null,5203,5203]
[null,null,5204,5204]
[null,null,5205,5205]
[null,null,5206,5206]
[null,null,5207,5207]
[null,null,5208,5208]
[null,null,5209,5209]
[null,null,5210,5210]
[null,null,5211,5211]
[null,null,5212,5212]
[null,null,5213,5213]
[null,null,5214,5214]
[null,null,5215,5215]
[null,null,5216,5216]
[null,null,5217,5217]
[null,null,5218,5218]
[null,null,5219,5219]
[null,null,5220,5220]
[null,null,5221,5221]
[null,null,5222,5222]
[null,null,5223,5223]
[null,null,5224,5224]
[null,null,5225,5225]
[null,null,5226,5226]
[null,null,5227,5227]
[null,null,5228,5228]
[null,null,5229,5229]
[null,null,5230,5230]
[null,null,5231,5231]
[null,null,5232,5232]
[null,null,5233,5233]
[null,null,5234,5234]
[null,null,5235,5235]
[null,null,5236,5236]
[null,null,5237,5237]
[null,null,5238,5238]
[null,null,5239,5239]
[null,null,5240,5240]
[null,null,5241,5241]
[null,null,5242,5242]
[null,null,5243,5243]
[null,null,5244,5244]
[null,null,5245,5245]
[null,null,5246,5246]
[null,null,5247,5247]
[null,null,5248,5248]
[null,null,5249,5249]
[null,null,5250,5250]
[null,null,5251,5251]
[null,null,5252,5252]
[null,null,5253,5253]
[null,null,5254,5254]
[null,null,5255,5255]
[null,null,5256,5256]
[null,null,5257,5257]
[null,null,5258,5258]
[null,null,5259,5259]
[null,null,5260,5260]
[null,null,5261,5261]
[null,null,5262,5262]
[null,null,5263,5263]
[null,null,5264,5264]
[null,null,5265,5265]
[null,null,5266,5266]
[null,null,5267,5267]
[null,null,5268,5268]
[null,null,5269,5269]
[null,null,5270,5270]
[null,null,5271,5271]
[null,null,5272,5272]
[null,null,5273,5273]
[null,null,5274,5274]
[null,null,5275,5275]
[null,null,5276,5276]
[null,null,5277,5277]
[null,null,5278,5278]
[null,null,5279,5279]
[null,null,5280,5280]
[null,null,5281,5281]
[null,null,5282,5282]
[null,null,5283,5283]
[null,null,5284,5284]
[null,null,5285,5285]
[null,null,5286,5286]
[null,null,5287,5287]
[null,null,5288,5288]
[null,null,5289,5289]
[null,null,5290,5290]
[null,null,5291,5291]
[null,null,5292,5292]
[null,null,5293,5293]
[null,null,5294,5294]
[null,null,5295,5295]
[null,null,5296,5296]
[null,null,5297,5297]
[null,null,5298,5298]
[null,null,5299,5299]
[null,null,5300,5300]
[null,null,5301,5301]
[null,null,5302,5302]
[null,null,5303,5303]
[null,null,5304,5304]
[null,null,5305,5305]
[null,null,5306,5306]
[null,null,5307,5307]
[null,null,5308,5308]
[null,null,5309,5309]
[null,null,5310,5310]
[null,null,5311,5311]
[null,null,5312,5312]
[null,null,5313,5313]
[null,null,5314,5314]
[null,null,5315,5315]
[null,null,5316,5316]
[null,null,5317,5317]
[null,null,5318,5318]
[null,null,5319,5319]
[null,null,5320,5320]
[null,null,5321,5321]
[null,null,5322,5322]
[null,null,5323,5323]
[null,null,5324,5324]
[null,null,5325,5325]
[null,null,5326,5326]
[null,null,5327,5327]
[null,null,5328,5328]
[null,null,5329,5329]
[null,null,5330,5330]
[null,null,5331,5331]
[null,null,5332,5332]
[null,null,5333,5333]
[null,null,5334,5334]
[null,null,5335,5335]
[null,null,5336,5336]
[null,null,5337,5337]
[null,null,5338,5338]
[null,null,5339,5339]
[null,null,5340,5340]
[null,null,5341,5341]
[null,null,5342,5342]
[null,null,5343,5343]
[null,null,5344,5344]
[null,null,5345,5345]
[null,null,5346,5346]
[null,null,5347,5347]
[null,null,5348,5348]
[null,null,5349,5349]
[null,null,5350,5350]
[null,null,5351,5351]
[null,null,5352,5352]
[null,null,5353,5353]
[null,null,5354,5354]
[null,null,5355,5355]
[null,null,5356,5356]
[null,null,5357,5357]
[null,null,5358,5358]
[null,null,5359,5359]
[null,null,5360,5360]
[null,null,5361,5361]
[null,null,5362,5362]
[null,null,5363,5363]
[null,null,5364,5364]
[null,null,5365,5365]
[null,null,5366,5366]
[null,null,5367,5367]
[null,null,5368,5368]
[null,null,5369,5369]
[null,null,5370,5370]
[null,null,5371,5371]
[null,null,5372,5372]
[null,null,5373,5373]
[null,null,5374,5374]
[null,null,5375,5375]
[null,null,5376,5376]
[null,null,5377,5377]
[null,null,5378,5378]
[null,null,5379,5379]
[null,null,5380,5380]
[null,null,5381,5381]
[null,null,5382,5382]
[null,null,5383,5383]
[null,null,5384,5384]
[null,null,5385,5385]
[null,null,5386,5386]
[null,null,5387,5387]
[null,null,5388,5388]
[null,null,5389,5389]
[null,null,5390,5390]
[null,null,5391,5391]
[null,null,5392,5392]
[null,null,5393,5393]
[null,null,5394,5394]
[null,null,5395,5395]
[null,null,5396,5396]
[null,null,5397,5397]
[null,null,5398,5398]
[null,null,5399,5399]
[null,null,5400,5400]
[null,null,5401,5401]
[null,null,5402,5402]
[null,null,5403,5403]
[null,null,5404,5404]
[null,null,5405,5405]
[null,null,5406,5406]
[null,null,5407,5407]
[null,null,5408,5408]
[null,null,5409,5409]
[null,null,5410,5410]
[null,null,5411,5411]
[null,null,5412,5412]
[null,null,5413,5413]
[null,null,5414,5414]
[null,null,5415,5415]
[null,null,5416,5416]
[null,null,5417,5417]
[null,null,5418,5418]
[null,null,5419,5419]
[null,null,5420,5420]
[null,null,5421,5421]
[null,null,5422,5422]
[null,null,5423,5423]
[null,null,5424,5424]
[null,null,5425,5425]
[null,null,5426,5426]
[null,null,5427,5427]
[null,null,5428,5428]
[null,null,5429,5429]
[null,null,5430,5430]
[null,null,5431,5431]
[null,null,5432,5432]
[null,null,5433,5433]
[null,null,5434,5434]
[null,null,5435,5435]
[null,null,5436,5436]
[null,null,5437,5437]
[null,null,5438,5438]
[null,null,5439,5439]
[null,null,5440,5440]
[null,null,5441,5441]
[null,null,5442,5442]
[null,null,5443,5443]
[null,null,5444,5444]
[null,null,5445,5445]
[null,null,5446,5446]
[null,null,5447,5447]
[null,null,5448,5448]
[null,null,5449,5449]
[null,null,5450,5450]
[null,null,5451,5451]
[null,null,5452,5452]
[null,null,5453,5453]
[null,null,5454,5454]
[null,null,5455,5455]
[null,null,5456,5456]
[null,null,5457,5457]
[null,null,5458,5458]
[null,null,5459,5459]
[null,null,5460,5460]
[null,null,5461,5461]
[null,null,5462,5462]
[null,null,5463,5463]
[null,null,5464,5464]
[null,null,5465,5465]
[null,null,5466,5466]
[null,null,5467,5467]
[null,null,5468,5468]
[null,null,5469,5469]
[null,null,5470,5470]
[null,null,5471,5471]
[null,null,5472,5472]
[null,null,5473,5473]
[null,null,5474,5474]
[null,null,5475,5475]
[null,null,5476,5476]
[null,null,5477,5477]
[null,null,5478,5478]
[null,null,5479,5479]
[null,null,5480,5480]
[null,null,5481,5481]
[null,null,5482,5482]
[null,null,5483,5483]
[null,null,5484,5484]
[null,null,5485,5485]
[null,null,5486,5486]
[null,null,5487,5487]
[null,null,5488,5488]
[null,null,5489,5489]
[null,null,5490,5490]
[null,null,5491,5491]
[null,null,5492,5492]
[null,null,5493,5493]
[null,null,5494,5494]
[null,null,5495,5495]
[null,null,5496,5496]
[null,null,5497,5497]
[null,null,5498,5498]
[null,null,5499,5499]
[null,null,5500,5500]
[null,null,5501,5501]
[null,null,5502,5502]
[null,null,5503,5503]
[null,null,5504,5504]
[null,null,5505,5505]
[null,null,5506,5506]
[null,null,5507,5507]
[null,null,5508,5508]
[null,null,5509,5509]
[null,null,5510,5510]
[null,null,5511,5511]
[null,null,5512,5512]
[null,null,5513,5513]
[null,null,5514,5514]
[null,null,5515,5515]
[null,null,5516,5516]
[null,null,5517,5517]
[null,null,5518,5518]
[null,null,5519,5519]
[null,null,5520,5520]
[null,null,5521,5521]
[null,null,5522,5522]
[null,null,5523,5523]
[null,null,5524,5524]
[null,null,5525,5525]
[null,null,5526,5526]
[null,null,5527,5527]
[null,null,5528,5528]
[null,null,5529,5529]
[null,null,5530,5530]
[null,null,5531,5531]
[null,null,5532,5532]
[null,null,5533,5533]
[null,null,5534,5534]
[null,null,5535,5535]
[null,null,5536,5536]
[null,null,5537,5537]
[null,null,5538,5538]
[null,null,5539,5539]
[null,null,5540,5540]
[null,null,5541,5541]
[null,null,5542,5542]
[null,null,5543,5543]
[null,null,5544,5544]
[null,null,5545,5545]
[null,null,5546,5546]
[null,null,5547,5547]
[null,null,5548,5548]
[null,null,5549,5549]
[null,null,5550,5550]
[null,null,5551,5551]
[null,null,5552,5552]
[null,null,5553,5553]
[null,null,5554,5554]
[null,null,5555,5555]
[null,null,5556,5556]
[null,null,5557,5557]
[null,null,5558,5558]
[null,null,5559,5559]
[null,null,5560,5560]
[null,null,5561,5561]
[null,null,5562,5562]
[null,null,5563,5563]
[null,null,5564,5564]
[null,null,5565,5565]
[null,null,5566,5566]
[null,null,5567,5567]
[null,null,5568,5568]
[null,null,5569,5569]
[null,null,5570,5570]
[null,null,5571,5571]
[null,null,5572,5572]
[null,null,5573,5573]
[null,null,5574,5574]
[null,null,5575,5575]
[null,null,5576,5576]
[null,null,5577,5577]
[null,null,5578,5578]
[null,null,5579,5579]
[null,null,5580,5580]
[null,null,5581,5581]
[null,null,5582,5582]
[null,null,5583,5583]
[null,null,5584,5584]
[null,null,5585,5585]
[null,null,5586,5586]
[null,null,5587,5587]
[null,null,5588,5588]
[null,null,5589,5589]
[null,null,5590,5590]
[null,null,5591,5591]
[null,null,5592,5592]
[null,null,5593,5593]
[null,null,5594,5594]
[null,null,5595,5595]
[null,null,5596,5596]
[null,null,5597,5597]
[null,null,5598,5598]
[null,null,5599,5599]
[null,null,5600,5600]
[null,null,5601,5601]
[null,null,5602,5602]
[null,null,5603,5603]
[null,null,5604,5604]
[null,null,5605,5605]
[null,null,5606,5606]
[null,null,5607,5607]
[null,null,5608,5608]
[null,null,5609,5609]
[null,null,5610,5610]
[null,null,5611,5611]
[null,null,5612,5612]
[null,null,5613,5613]
[null,null,5614,5614]
[null,null,5615,5615]
[null,null,5616,5616]
[null,null,5617,5617]
[null,null,5618,5618]
[null,null,5619,5619]
[null,null,5620,5620]
[null,null,5621,5621]
[null,null,5622,5622]
[null,null,5623,5623]
[null,null,5624,5624]
[null,null,5625,5625]
[null,null,5626,5626]
[null,null,5627,5627]
[null,null,5628,5628]
[null,null,5629,5629]
[null,null,5630,5630]
[null,null,5631,5631]
[null,null,5632,5632]
[null,null,5633,5633]
[null,null,5634,5634]
[null,null,5635,5635]
[null,null,5636,5636]
[null,null,5637,5637]
[null,null,5638,5638]
[null,null,5639,5639]
[null,null,5640,5640]
[null,null,5641,5641]
[null,null,5642,5642]
[null,null,5643,5643]
[null,null,5644,5644]
[null,null,5645,5645]
[null,null,5646,5646]
[null,null,5647,5647]
[null,null,5648,5648]
[null,null,5649,5649]
[null,null,5650,5650]
[null,null,5651,5651]
[null,null,5652,5652]
[null,null,5653,5653]
[null,null,5654,5654]
[null,null,5655,5655]
[null,null,5656,5656]
[null,null,5657,5657]
[null,null,5658,5658]
[null,null,5659,5659]
[null,null,5660,5660]
[null,null,5661,5661]
[null,null,5662,5662]
[null,null,5663,5663]
[null,null,5664,5664]
[null,null,5665,5665]
[null,null,5666,5666]
[null,null,5667,5667]
[null,null,5668,5668]
[null,null,5669,5669]
[null,null,5670,5670]
[null,null,5671,5671]
[null,null,5672,5672]
[null,null,5673,5673]
[null,null,5674,5674]
[null,null,5675,5675]
[null,null,5676,5676]
[null,null,5677,5677]
[null,null,5678,5678]
[null,null,5679,5679]
[null,null,5680,5680]
[null,null,5681,5681]
[null,null,5682,5682]
[null,null,5683,5683]
[null,null,5684,5684]
[null,null,5685,5685]
[null,null,5686,5686]
[null,null,5687,5687]
[null,null,5688,5688]
[null,null,5689,5689]
[null,null,5690,5690]
[null,null,5691,5691]
[null,null,5692,5692]
[null,null,5693,5693]
[null,null,5694,5694]
[null,null,5695,5695]
[null,null,5696,5696]
[null,null,5697,5697]
[null,null,5698,5698]
[null,null,5699,5699]
[null,null,5700,5700]
[null,null,5701,5701]
[null,null,5702,5702]
[null,null,5703,5703]
[null,null,5704,5704]
[null,null,5705,5705]
[null,null,5706,5706]
[null,null,5707,5707]
[null,null,5708,5708]
[null,null,5709,5709]
[null,null,5710,5710]
[null,null,5711,5711]
[null,null,5712,5712]
[null,null,5713,5713]
[null,null,5714,5714]
[null,null,5715,5715]
[null,null,5716,5716]
[null,null,5717,5717]
[null,null,5718,5718]
[null,null,5719,5719]
[null,null,5720,5720]
[null,null,5721,5721]
[null,null,5722,5722]
[null,null,5723,5723]
[null,null,5724,5724]
[null,null,5725,5725]
[null,null,5726,5726]
[null,null,5727,5727]
[null,null,5728,5728]
[null,null,5729,5729]
[null,null,5730,5730]
[null,null,5731,5731]
[null,null,5732,5732]
[null,null,5733,5733]
[null,null,5734,5734]
[null,null,5735,5735]
[null,null,5736,5736]
[null,null,5737,5737]
[null,null,5738,5738]
[null,null,5739,5739]
[null,null,5740,5740]
[null,null,5741,5741]
[null,null,5742,5742]
[null,null,5743,5743]
[null,null,5744,5744]
[null,null,5745,5745]
[null,null,5746,5746]
[null,null,5747,5747]
[null,null,5748,5748]
[null,null,5749,5749]
[null,null,5750,5750]
[null,null,5751,5751]
[null,null,5752,5752]
[null,null,5753,5753]
[null,null,5754,5754]
[null,null,5755,5755]
[null,null,5756,5756]
[null,null,5757,5757]
[null,null,5758,5758]
[null,null,5759,5759]
[null,null,5760,5760]
[null,null,5761,5761]
[null,null,5762,5762]
[null,null,5763,5763]
[null,null,5764,5764]
[null,null,5765,5765]
[null,null,5766,5766]
[null,null,5767,5767]
[null,null,5768,5768]
[null,null,5769,5769]
[null,null,5770,5770]
[null,null,5771,5771]
[null,null,5772,5772]
[null,null,5773,5773]
[null,null,5774,5774]
[null,null,5775,5775]
[null,null,5776,5776]
[null,null,5777,5777]
[null,null,5778,5778]
[null,null,5779,5779]
[null,null,5780,5780]
[null,null,5781,5781]
[null,null,5782,5782]
[null,null,5783,5783]
[null,null,5784,5784]
[null,null,5785,5785]
[null,null,5786,5786]
[null,null,5787,5787]
[null,null,5788,5788]
[null,null,5789,5789]
[null,null,5790,5790]
[null,null,5791,5791]
[null,null,5792,5792]
[null,null,5793,5793]
[null,null,5794,5794]
[null,null,5795,5795]
[null,null,5796,5796]
[null,null,5797,5797]
[null,null,5798,5798]
[null,null,5799,5799]
[null,null,5800,5800]
[null,null,5801,5801]
[null,null,5802,5802]
[null,null,5803,5803]
[null,null,5804,5804]
[null,null,5805,5805]
[null,null,5806,5806]
[null,null,5807,5807]
[null,null,5808,5808]
[null,null,5809,5809]
[null,null,5810,5810]
[null,null,5811,5811]
[null,null,5812,5812]
[null,null,5813,5813]
[null,null,5814,5814]
[null,null,5815,5815]
[null,null,5816,5816]
[null,null,5817,5817]
[null,null,5818,5818]
[null,null,5819,5819]
[null,null,5820,5820]
[null,null,5821,5821]
[null,null,5822,5822]
[null,null,5823,5823]
[null,null,5824,5824]
[null,null,5825,5825]
[null,null,5826,5826]
[null,null,5827,5827]
[null,null,5828,5828]
[null,null,5829,5829]
[null,null,5830,5830]
[null,null,5831,5831]
[null,null,5832,5832]
[null,null,5833,5833]
[null,null,5834,5834]
[null,null,5835,5835]
[null,null,5836,5836]
[null,null,5837,5837]
[null,null,5838,5838]
[null,null,5839,5839]
[null,null,5840,5840]
[null,null,5841,5841]
[null,null,5842,5842]
[null,null,5843,5843]
[null,null,5844,5844]
[null,null,5845,5845]
[null,null,5846,5846]
[null,null,5847,5847]
[null,null,5848,5848]
[null,null,5849,5849]
[null,null,5850,5850]
[null,null,5851,5851]
[null,null,5852,5852]
[null,null,5853,5853]
[null,null,5854,5854]
[null,null,5855,5855]
[null,null,5856,5856]
[null,null,5857,5857]
[null,null,5858,5858]
[null,null,5859,5859]
[null,null,5860,5860]
[null,null,5861,5861]
[null,null,5862,5862]
[null,null,5863,5863]
[null,null,5864,5864]
[null,null,5865,5865]
[null,null,5866,5866]
[null,null,5867,5867]
[null,null,5868,5868]
[null,null,5869,5869]
[null,null,5870,5870]
[null,null,5871,5871]
[null,null,5872,5872]
[null,null,5873,5873]
[null,null,5874,5874]
[null,null,5875,5875]
[null,null,5876,5876]
[null,null,5877,5877]
[null,null,5878,5878]
[null,null,5879,5879]
[null,null,5880,5880]
[null,null,5881,5881]
[null,null,5882,5882]
[null,null,5883,5883]
[null,null,5884,5884]
[null,null,5885,5885]
[null,null,5886,5886]
[null,null,5887,5887]
[null,null,5888,5888]
[null,null,5889,5889]
[null,null,5890,5890]
[null,null,5891,5891]
[null,null,5892,5892]
[null,null,5893,5893]
[null,null,5894,5894]
[null,null,5895,5895]
[null,null,5896,5896]
[null,null,5897,5897]
[null,null,5898,5898]
[null,null,5899,5899]
[null,null,5900,5900]
[null,null,5901,5901]
[null,null,5902,5902]
[null,null,5903,5903]
[null,null,5904,5904]
[null,null,5905,5905]
[null,null,5906,5906]
[null,null,5907,5907]
[null,null,5908,5908]
[null,null,5909,5909]
[null,null,5910,5910]
[null,null,5911,5911]
[null,null,5912,5912]
[null,null,5913,5913]
[null,null,5914,5914]
[null,null,5915,5915]
[null,null,5916,5916]
[null,null,5917,5917]
[null,null,5918,5918]
[null,null,5919,5919]
[null,null,5920,5920]
[null,null,5921,5921]
[null,null,5922,5922]
[null,null,5923,5923]
[null,null,5924,5924]
[null,null,5925,5925]
[null,null,5926,5926]
[null,null,5927,5927]
[null,null,5928,5928]
[null,null,5929,5929]
[null,null,5930,5930]
[null,null,5931,5931]
[null,null,5932,5932]
[null,null,5933,5933]
[null,null,5934,5934]
[null,null,5935,5935]
[null,null,5936,5936]
[null,null,5937,5937]
[null,null,5938,5938]
[null,null,5939,5939]
[null,null,5940,5940]
[null,null,5941,5941]
[null,null,5942,5942]
[null,null,5943,5943]
[null,null,5944,5944]
[null,null,5945,5945]
[null,null,5946,5946]
[null,null,5947,5947]
[null,null,5948,5948]
[null,null,5949,5949]
[null,null,5950,5950]
[null,null,5951,5951]
[null,null,5952,5952]
[null,null,5953,5953]
[null,null,5954,5954]
[null,null,5955,5955]
[null,null,5956,5956]
[null,null,5957,5957]
[null,null,5958,5958]
[null,null,5959,5959]
[null,null,5960,5960]
[null,null,5961,5961]
[null,null,5962,5962]
[null,null,5963,5963]
[null,null,5964,5964]
[null,null,5965,5965]
[null,null,5966,5966]
[null,null,5967,5967]
[null,null,5968,5968]
[null,null,5969,5969]
[null,null,5970,5970]
[null,null,5971,5971]
[null,null,5972,5972]
[null,null,5973,5973]
[null,null,5974,5974]
[null,null,5975,5975]
[null,null,5976,5976]
[null,null,5977,5977]
[null,null,5978,5978]
[null,null,5979,5979]
[null,null,5980,5980]
[null,null,5981,5981]
[null,null,5982,5982]
[null,null,5983,5983]
[null,null,5984,5984]
[null,null,5985,5985]
[null,null,5986,5986]
[null,null,5987,5987]
[null,null,5988,5988]
[null,null,5989,5989]
[null,null,5990,5990]
[null,null,5991,5991]
[null,null,5992,5992]
[null,null,5993,5993]
[null,null,5994,5994]
[null,null,5995,5995]
[null,null,5996,5996]
[null,null,5997,5997]
[null,null,5998,5998]
[null,null,5999,5999]
[null,null,6000,6000]
[null,null,6001,6001]
[null,null,6002,6002]
[null,null,6003,6003]
[null,null,6004,6004]
[null,null,6005,6005]
[null,null,6006,6006]
[null,null,6007,6007]
[null,null,6008,6008]
[null,null,6009,6009]
[null,null,6010,6010]
[null,null,6011,6011]
[null,null,6012,6012]
[null,null,6013,6013]
[null,null,6014,6014]
[null,null,6015,6015]
[null,null,6016,6016]
[null,null,6017,6017]
[null,null,6018,6018]
[null,null,6019,6019]
[null,null,6020,6020]
[null,null,6021,6021]
[null,null,6022,6022]
[null,null,6023,6023]
[null,null,6024,6024]
[null,null,6025,6025]
[null,null,6026,6026]
[null,null,6027,6027]
[null,null,6028,6028]
[null,null,6029,6029]
[null,null,6030,6030]
[null,null,6031,6031]
[null,null,6032,6032]
[null,null,6033,6033]
[null,null,6034,6034]
[null,null,6035,6035]
[null,null,6036,6036]
[null,null,6037,6037]
[null,null,6038,6038]
[null,null,6039,6039]
[null,null,6040,6040]
[null,null,6041,6041]
[null,null,6042,6042]
[null,null,6043,6043]
[null,null,6044,6044]
[null,null,6045,6045]
[null,null,6046,6046]
[null,null,6047,6047]
[null,null,6048,6048]
[null,null,6049,6049]
[null,null,6050,6050]
[null,null,6051,6051]
[null,null,6052,6052]
[null,null,6053,6053]
[null,null,6054,6054]
[null,null,6055,6055]
[null,null,6056,6056]
[null,null,6057,6057]
[null,null,6058,6058]
[null,null,6059,6059]
[null,null,6060,6060]
[null,null,6061,6061]
[null,null,6062,6062]
[null,null,6063,6063]
[null,null,6064,6064]
[null,null,6065,6065]
[null,null,6066,6066]
[null,null,6067,6067]
[null,null,6068,6068]
[null,null,6069,6069]
[null,null,6070,6070]
[null,null,6071,6071]
[null,null,6072,6072]
[null,null,6073,6073]
[null,null,6074,6074]
[null,null,6075,6075]
[null,null,6076,6076]
[null,null,6077,6077]
[null,null,6078,6078]
[null,null,6079,6079]
[null,null,6080,6080]
[null,null,6081,6081]
[null,null,6082,6082]
[null,null,6083,6083]
[null,null,6084,6084]
[null,null,6085,6085]
[null,null,6086,6086]
[null,null,6087,6087]
[null,null,6088,6088]
[null,null,6089,6089]
[null,null,6090,6090]
[null,null,6091,6091]
[null,null,6092,6092]
[null,null,6093,6093]
[null,null,6094,6094]
[null,null,6095,6095]
[null,null,6096,6096]
[null,null,6097,6097]
[null,null,6098,6098]
[null,null,6099,6099]
[null,null,6100,6100]
[null,null,6101,6101]
[null,null,6102,6102]
[null,null,6103,6103]
[null,null,6104,6104]
[null,null,6105,6105]
[null,null,6106,6106]
[null,null,6107,6107]
[null,null,6108,6108]
[null,null,6109,6109]
[null,null,6110,6110]
[null,null,6111,6111]
[null,null,6112,6112]
[null,null,6113,6113]
[null,null,6114,6114]
[null,null,6115,6115]
[null,null,6116,6116]
[null,null,6117,6117]
[null,null,6118,6118]
[null,null,6119,6119]
[null,null,6120,6120]
[null,null,6121,6121]
[null,null,6122,6122]
[null,null,6123,6123]
[null,null,6124,6124]
[null,null,6125,6125]
[null,null,6126,6126]
[null,null,6127,6127]
[null,null,6128,6128]
[null,null,6129,6129]
[null,null,6130,6130]
[null,null,6131,6131]
[null,null,6132,6132]
[null,null,6133,6133]
[null,null,6134,6134]
[null,null,6135,6135]
[null,null,6136,6136]
[null,null,6137,6137]
[null,null,6138,6138]
[null,null,6139,6139]
[null,null,6140,6140]
[null,null,6141,6141]
[null,null,6142,6142]
[null,null,6143,6143]
[null,null,6144,6144]
[null,null,6145,6145]
[null,null,6146,6146]
[null,null,6147,6147]
[null,null,6148,6148]
[null,null,6149,6149]
[null,null,6150,6150]
[null,null,6151,6151]
[null,null,6152,6152]
[null,null,6153,6153]
[null,null,6154,6154]
[null,null,6155,6155]
[null,null,6156,6156]
[null,null,6157,6157]
[null,null,6158,6158]
[null,null,6159,6159]
[null,null,6160,6160]
[null,null,6161,6161]
[null,null,6162,6162]
[null,null,6163,6163]
[null,null,6164,6164]
[null,null,6165,6165]
[null,null,6166,6166]
[null,null,6167,6167]
[null,null,6168,6168]
[null,null,6169,6169]
[null,null,6170,6170]
[null,null,6171,6171]
[null,null,6172,6172]
[null,null,6173,6173]
[null,null,6174,6174]
[null,null,6175,6175]
[null,null,6176,6176]
[null,null,6177,6177]
[null,null,6178,6178]
[null,null,6179,6179]
[null,null,6180,6180]
[null,null,6181,6181]
[null,null,6182,6182]
[null,null,6183,6183]
[null,null,6184,6184]
[null,null,6185,6185]
[null,null,6186,6186]
[null,null,6187,6187]
[null,null,6188,6188]
[null,null,6189,6189]
[null,null,6190,6190]
[null,null,6191,6191]
[null,null,6192,6192]
[null,null,6193,6193]
[null,null,6194,6194]
[null,null,6195,6195]
[null,null,6196,6196]
[null,null,6197,6197]
[null,null,6198,6198]
[null,null,6199,6199]
[null,null,6200,6200]
[null,null,6201,6201]
[null,null,6202,6202]
[null,null,6203,6203]
[null,null,6204,6204]
[null,null,6205,6205]
[null,null,6206,6206]
[null,null,6207,6207]
[null,null,6208,6208]
[null,null,6209,6209]
[null,null,6210,6210]
[null,null,6211,6211]
[null,null,6212,6212]
[null,null,6213,6213]
[null,null,6214,6214]
[null,null,6215,6215]
[null,null,6216,6216]
[null,null,6217,6217]
[null,null,6218,6218]
[null,null,6219,6219]
[null,null,6220,6220]
[null,null,6221,6221]
[null,null,6222,6222]
[null,null,6223,6223]
[null,null,6224,6224]
[null,null,6225,6225]
[null,null,6226,6226]
[null,null,6227,6227]
[null,null,6228,6228]
[null,null,6229,6229]
[null,null,6230,6230]
[null,null,6231,6231]
[null,null,6232,6232]
[null,null,6233,6233]
[null,null,6234,6234]
[null,null,6235,6235]
[null,null,6236,6236]
[null,null,6237,6237]
[null,null,6238,6238]
[null,null,6239,6239]
[null,null,6240,6240]
[null,null,6241,6241]
[null,null,6242,6242]
[null,null,6243,6243]
[null,null,6244,6244]
[null,null,6245,6245]
[null,null,6246,6246]
[null,null,6247,6247]
[null,null,6248,6248]
[null,null,6249,6249]
[null,null,6250,6250]
[null,null,6251,6251]
[null,null,6252,6252]
[null,null,6253,6253]
[null,null,6254,6254]
[null,null,6255,6255]
[null,null,6256,6256]
[null,null,6257,6257]
[null,null,6258,6258]
[null,null,6259,6259]
[null,null,6260,6260]
[null,null,6261,6261]
[null,null,6262,6262]
[null,null,6263,6263]
[null,null,6264,6264]
[null,null,6265,6265]
[null,null,6266,6266]
[null,null,6267,6267]
[null,null,6268,6268]
[null,null,6269,6269]
[null,null,6270,6270]
[null,null,6271,6271]
[null,null,6272,6272]
[null,null,6273,6273]
[null,null,6274,6274]
[null,null,6275,6275]
[null,null,6276,6276]
[null,null,6277,6277]
[null,null,6278,6278]
[null,null,6279,6279]
[null,null,6280,6280]
[null,null,6281,6281]
[null,null,6282,6282]
[null,null,6283,6283]
[null,null,6284,6284]
[null,null,6285,6285]
[null,null,6286,6286]
[null,null,6287,6287]
[null,null,6288,6288]
[null,null,6289,6289]
[null,null,6290,6290]
[null,null,6291,6291]
[null,null,6292,6292]
[null,null,6293,6293]
[null,null,6294,6294]
[null,null,6295,6295]
[null,null,6296,6296]
[null,null,6297,6297]
[null,null,6298,6298]
[null,null,6299,6299]
[null,null,6300,6300]
[null,null,6301,6301]
[null,null,6302,6302]
[null,null,6303,6303]
[null,null,6304,6304]
[null,null,6305,6305]
[null,null,6306,6306]
[null,null,6307,6307]
[null,null,6308,6308]
[null,null,6309,6309]
[null,null,6310,6310]
[null,null,6311,6311]
[null,null,6312,6312]
[null,null,6313,6313]
[null,null,6314,6314]
[null,null,6315,6315]
[null,null,6316,6316]
[null,null,6317,6317]
[null,null,6318,6318]
[null,null,6319,6319]
[null,null,6320,6320]
[null,null,6321,6321]
[null,null,6322,6322]
[null,null,6323,6323]
[null,null,6324,6324]
[null,null,6325,6325]
[null,null,6326,6326]
[null,null,6327,6327]
[null,null,6328,6328]
[null,null,6329,6329]
[null,null,6330,6330]
[null,null,6331,6331]
[null,null,6332,6332]
[null,null,6333,6333]
[null,null,6334,6334]
[null,null,6335,6335]
[null,null,6336,6336]
[null,null,6337,6337]
[null,null,6338,6338]
[null,null,6339,6339]
[null,null,6340,6340]
[null,null,6341,6341]
[null,null,6342,6342]
[null,null,6343,6343]
[null,null,6344,6344]
[null,null,6345,6345]
[null,null,6346,6346]
[null,null,6347,6347]
[null,null,6348,6348]
[null,null,6349,6349]
[null,null,6350,6350]
[null,null,6351,6351]
[null,null,6352,6352]
[null,null,6353,6353]
[null,null,6354,6354]
[null,null,6355,6355]
[null,null,6356,6356]
[null,null,6357,6357]
[null,null,6358,6358]
[null,null,6359,6359]
[null,null,6360,6360]
[null,null,6361,6361]
[null,null,6362,6362]
[null,null,6363,6363]
[null,null,6364,6364]
[null,null,6365,6365]
[null,null,6366,6366]
[null,null,6367,6367]
[null,null,6368,6368]
[null,null,6369,6369]
[null,null,6370,6370]
[null,null,6371,6371]
[null,null,6372,6372]
[null,null,6373,6373]
[null,null,6374,6374]
[null,null,6375,6375]
[null,null,6376,6376]
[null,null,6377,6377]
[null,null,6378,6378]
[null,null,6379,6379]
[null,null,6380,6380]
[null,null,6381,6381]
[null,null,6382,6382]
[null,null,6383,6383]
[null,null,6384,6384]
[null,null,6385,6385]
[null,null,6386,6386]
[null,null,6387,6387]
[null,null,6388,6388]
[null,null,6389,6389]
[null,null,6390,6390]
[null,null,6391,6391]
[null,null,6392,6392]
[null,null,6393,6393]
[null,null,6394,6394]
[null,null,6395,6395]
[null,null,6396,6396]
[null,null,6397,6397]
[null,null,6398,6398]
[null,null,6399,6399]
[null,null,6400,6400]
[null,null,6401,6401]
[null,null,6402,6402]
[null,null,6403,6403]
[null,null,6404,6404]
[null,null,6405,6405]
[null,null,6406,6406]
[null,null,6407,6407]
[null,null,6408,6408]
[null,null,6409,6409]
[null,null,6410,6410]
[null,null,6411,6411]
[null,null,6412,6412]
[null,null,6413,6413]
[null,null,6414,6414]
[null,null,6415,6415]
[null,null,6416,6416]
[null,null,6417,6417]
[null,null,6418,6418]
[null,null,6419,6419]
[null,null,6420,6420]
[null,null,6421,6421]
[null,null,6422,6422]
[null,null,6423,6423]
[null,null,6424,6424]
[null,null,6425,6425]
[null,null,6426,6426]
[null,null,6427,6427]
[null,null,6428,6428]
[null,null,6429,6429]
[null,null,6430,6430]
[null,null,6431,6431]
[null,null,6432,6432]
[null,null,6433,6433]
[null,null,6434,6434]
[null,null,6435,6435]
[null,null,6436,6436]
[null,null,6437,6437]
[null,null,6438,6438]
[null,null,6439,6439]
[null,null,6440,6440]
[null,null,6441,6441]
[null,null,6442,6442]
[null,null,6443,6443]
[null,null,6444,6444]
[null,null,6445,6445]
[null,null,6446,6446]
[null,null,6447,6447]
[null,null,6448,6448]
[null,null,6449,6449]
[null,null,6450,6450]
[null,null,6451,6451]
[null,null,6452,6452]
[null,null,6453,6453]
[null,null,6454,6454]
[null,null,6455,6455]
[null,null,6456,6456]
[null,null,6457,6457]
[null,null,6458,6458]
[null,null,6459,6459]
[null,null,6460,6460]
[null,null,6461,6461]
[null,null,6462,6462]
[null,null,6463,6463]
[null,null,6464,6464]
[null,null,6465,6465]
[null,null,6466,6466]
[null,null,6467,6467]
[null,null,6468,6468]
[null,null,6469,6469]
[null,null,6470,6470]
[null,null,6471,6471]
[null,null,6472,6472]
[null,null,6473,6473]
[null,null,6474,6474]
[null,null,6475,6475]
[null,null,6476,6476]
[null,null,6477,6477]
[null,null,6478,6478]
[null,null,6479,6479]
[null,null,6480,6480]
[null,null,6481,6481]
[null,null,6482,6482]
[null,null,6483,6483]
[null,null,6484,6484]
[null,null,6485,6485]
[null,null,6486,6486]
[null,null,6487,6487]
[null,null,6488,6488]
[null,null,6489,6489]
[null,null,6490,6490]
[null,null,6491,6491]
[null,null,6492,6492]
[null,null,6493,6493]
[null,null,6494,6494]
[null,null,6495,6495]
[null,null,6496,6496]
[null,null,6497,6497]
[null,null,6498,6498]
[null,null,6499,6499]
[null,null,6500,6500]
[null,null,6501,6501]
[null,null,6502,6502]
[null,null,6503,6503]
[null,null,6504,6504]
[null,null,6505,6505]
[null,null,6506,6506]
[null,null,6507,6507]
[null,null,6508,6508]
[null,null,6509,6509]
[null,null,6510,6510]
[null,null,6511,6511]
[null,null,6512,6512]
[null,null,6513,6513]
[null,null,6514,6514]
[null,null,6515,6515]
[null,null,6516,6516]

{"sheet":"SPI","index":14,"n_rows":301,"n_cols":19,"rows_kept":301,"cut":false,"hidden":false,"merged":[]}
[null,null,null,null,"SPI CLOCK GENERATION"]
[]
[]
[]
[]
[]
[null,null,null,"SYSCLK7",null,"Prescale",null,"SPI_CLK"]
[null,null,null,{"$f":"(Main_PLL!W31)","v":166.66666666666666},null,0,null,{"$f":"IF(F8=0,SUM(D8/2),SUM(D8/(F8+1)))","v":83.333333333333329}]
[]
[]
[null,null,null,null,"SPIFMTn [15:8]",null,{"$f":"CONCATENATE(\"0x\",DEC2HEX(F8,2))","v":"0x00"},null,null,null,null,{"$f":"3*M15","v":18},null,null,{"$f":"3*M15","v":18},null,null,{"$f":"3*M15","v":18}]
[]
[null,null,null,null,null,null,null,null,null,null,null,{"$f":"LARGE(L10:L11,1)","v":18},null,null,{"$f":"LARGE(O10:O11,1)","v":18},null,null,{"$f":"LARGE(R10:R11,1)","v":18}]
[null,null,null,null,null,null,null,null,null,null,null,{"$f":"(1/L13)*1000","v":55.55555555555555},{"$f":"(1/#REF!)*1000","v":{"$error":"#REF!"}},null,{"$f":"(1/O13)*1000","v":55.55555555555555},{"$f":"(1/#REF!)*1000","v":{"$error":"#REF!"}},null,{"$f":"(1/R13)*1000","v":55.55555555555555},{"$f":"(1/#REF!)*1000","v":{"$error":"#REF!"}}]
[null,null,null,null,null,null,null,null,null,null,null,"p",{"$f":"(1/D8)*1000","v":6}]
[]
[]
[]
[]
[]
[]
[]
[]
[]
[]
[]
[]
[]
[]
[]
[]
[]
[]
[]
[]
[]
[]
[]
[]
[]
[]
[]
[]
[]
["prescale"]
[0]
[1]
[2]
[3]
[4]
[5]
[6]
[7]
[8]
[9]
[10]
[11]
[12]
[13]
[14]
[15]
[16]
[17]
[18]
[19]
[20]
[21]
[22]
[23]
[24]
[25]
[26]
[27]
[28]
[29]
[30]
[31]
[32]
[33]
[34]
[35]
[36]
[37]
[38]
[39]
[40]
[41]
[42]
[43]
[44]
[45]
[46]
[47]
[48]
[49]
[50]
[51]
[52]
[53]
[54]
[55]
[56]
[57]
[58]
[59]
[60]
[61]
[62]
[63]
[64]
[65]
[66]
[67]
[68]
[69]
[70]
[71]
[72]
[73]
[74]
[75]
[76]
[77]
[78]
[79]
[80]
[81]
[82]
[83]
[84]
[85]
[86]
[87]
[88]
[89]
[90]
[91]
[92]
[93]
[94]
[95]
[96]
[97]
[98]
[99]
[100]
[101]
[102]
[103]
[104]
[105]
[106]
[107]
[108]
[109]
[110]
[111]
[112]
[113]
[114]
[115]
[116]
[117]
[118]
[119]
[120]
[121]
[122]
[123]
[124]
[125]
[126]
[127]
[128]
[129]
[130]
[131]
[132]
[133]
[134]
[135]
[136]
[137]
[138]
[139]
[140]
[141]
[142]
[143]
[144]
[145]
[146]
[147]
[148]
[149]
[150]
[151]
[152]
[153]
[154]
[155]
[156]
[157]
[158]
[159]
[160]
[161]
[162]
[163]
[164]
[165]
[166]
[167]
[168]
[169]
[170]
[171]
[172]
[173]
[174]
[175]
[176]
[177]
[178]
[179]
[180]
[181]
[182]
[183]
[184]
[185]
[186]
[187]
[188]
[189]
[190]
[191]
[192]
[193]
[194]
[195]
[196]
[197]
[198]
[199]
[200]
[201]
[202]
[203]
[204]
[205]
[206]
[207]
[208]
[209]
[210]
[211]
[212]
[213]
[214]
[215]
[216]
[217]
[218]
[219]
[220]
[221]
[222]
[223]
[224]
[225]
[226]
[227]
[228]
[229]
[230]
[231]
[232]
[233]
[234]
[235]
[236]
[237]
[238]
[239]
[240]
[241]
[242]
[243]
[244]
[245]
[246]
[247]
[248]
[249]
[250]
[251]
[252]
[253]
[254]
[255]

{"sheet":"UART","index":15,"n_rows":403,"n_cols":12,"rows_kept":403,"cut":false,"hidden":false,"merged":[[0,2,2,4]]}
[null,null,"UART CLOCK GENERATION"]
[]
[]
[]
[]
[null,null,null,null,null,null,null,"DLH:DLL"]
[]
[]
[]
[null,null,"SYSCLK7"]
[null,null,{"$f":"(Main_PLL!W31)","v":166.66666666666666},null,null,null,null,null,null,"BCLK"]
[]
[]
[]
[]
[]
[]
[]
[]
[]
[]
[]
[]
[]
[]
[]
[]
[]
[]
[null,null,"x16 Over-sampling Mode ",null,null,null,null,null,"x13 Over-sampling Mode"]
[]
[null,"Baud Rate","Divisor Value","Register ","Actual Baud Rate","Error (%)",null,"Baud Rate","Divisor Value","Register","Actual Baud Rate","Error (%)"]
[null,300,{"$f":"TRUNC(G372)","v":34722},{"$f":"DEC2HEX(C33,5)","v":"087A2"},{"$f":"SUM(F372/H372)","v":300.00192001228805},{"$f":"SUM(I372/bps)","v":-6.4000409601779515E-6},null,300,{"$f":"TRUNC(G389)","v":42735},{"$f":"DEC2HEX(I33,5)","v":"0A6EF"},{"$f":"SUM(F372/H389)","v":300.0003000003},{"$f":"SUM(I389/H33)","v":-1.0000010000036734E-6}]
[null,1200,8680,{"$f":"DEC2HEX(C34,4)","v":"21E8"},1200.0768049155145,{"$f":"SUM(I373/B34)","v":-6.4004096262048428E-5},null,1200,10683,{"$f":"DEC2HEX(I34,4)","v":"29BB"},1200.0854460837611,-7.1205069800915529E-5]
[null,2400,4340,"10F4",2400.1536098310289,-6.4004096262048428E-5,null,2400,5341,"14DD",2400.3955851924397,-1.6482716351655805E-4]
[null,4800,2170,"087A",4800.3072196620578,-6.4004096262048428E-5,null,4800,2670,"0A6E",4801.6901949486219,-3.5212394762955531E-4]
[null,9600,1085,"043D",9600.6144393241157,-6.4004096262048428E-5,null,9600,1335,"0537",9603.3803898972437,-3.5212394762955531E-4]
[null,19200,542,"021E",19218.942189421894,-9.8657236572364583E-4,null,19200,667,"029B",19221.158651443508,-1.1020130960160183E-3]
[null,28800,361,"0169",28855.032317636193,-1.9108443623677986E-3,null,28800,445,"01BD",28810.141169691731,-3.5212394762955531E-4]
[null,38400,271,"010F",38437.884378843788,-9.8657236572364583E-4,null,38400,333,"014D",38500.038500038499,-2.6051692718359241E-3]
[null,57600,180,"00B4",57870.370370370365,-4.69393004115217E-3,null,57600,222,"00DE",57750.057750057749,-2.6051692718359241E-3]
[null,128000,81,"0051",128600.82304526748,-4.693930041152157E-3,null,128000,100,"0064",128205.1282051282,-1.602564102564088E-3]
[null,115200,90,"005A",115740.74074074073,-4.69393004115217E-3,null,115200,111,"006F",115500.1155001155,-2.6051692718359241E-3]
[null,230400,45,"002D",231481.48148148146,-4.69393004115217E-3,null,230400,55,"0037",233100.23310023308,-1.1719761719761614E-2]
[null,460800,22,"0016",473484.84848484845,-2.7527882996632926E-2,null,460800,27,"001B",474833.80816714145,-3.0455312862720171E-2]
[null,921600,11,"000B",946969.6969696969,-2.7527882996632926E-2,null,921600,13,"000D",986193.29388560157,-7.0088209511286428E-2]
[null,3000000,3,"0003",3472222.222222222,-0.15740740740740733,null,3000000,4,"0004",3205128.205128205,-6.8376068376068341E-2]
[]
[]
[]
[]
[]
[]
[]
[]
[]
[]
[]
[]
[]
[]
[]
[]
[]
[]
[]
[]
[]
[]
[]
[]
[]
[]
[]
[]
[]
[]
[]
[]
[]
[]
[]
[]
[]
[]
[]
[]
[]
[]
[]
[]
[]
[]
[]
[]
[]
[]
[]
[]
[]
[]
[]
[]
[]
[]
[]
[]
[]
[]
[]
[]
[]
[]
[]
[]
[]
[]
[]
[]
[]
[]
[]
[]
[]
[]
[]
[]
[]
[]
[]
[]
[]
[]
[]
[]
[]
[]
[]
[]
[]
[]
[]
[]
[]
[]
[]
[]
[]
[]
[]
[]
[]
[]
[]
[]
[]
[]
[]
[]
[]
[]
[]
[]
[]
[]
[]
[]
[]
[]
[]
[]
[]
[]
[]
[]
[]
[]
[]
[]
[]
[]
[]
[]
[]
[]
[]
[]
[]
[]
[]
[]
[]
[]
[]
[]
[]
[]
[]
[]
[]
[]
[]
[]
[]
[]
[]
[]
[]
[]
[]
[]
[]
[]
[]
[]
[]
[]
[]
[]
[]
[]
[]
[]
[]
[]
[]
[]
[]
[]
[]
[]
[]
[]
[]
[]
[]
[]
[]
[]
[]
[]
[]
[]
[]
[]
[]
[]
[]
[]
[]
[]
[]
[]
[]
[]
[]
[]
[]
[]
[]
[]
[]
[]
[]
[]
[]
[]
[]
[]
[]
[]
[]
[]
[]
[]
[]
[]
[]
[]
[]
[]
[]
[]
[]
[]
[]
[]
[]
[]
[]
[]
[]
[]
[]
[]
[]
[]
[]
[]
[]
[]
[]
[]
[]
[]
[]
[]
[]
[]
[]
[]
[]
[]
[]
[]
[]
[]
[]
[]
[]
[]
[]
[]
[]
[]
[]
[]
[]
[]
[]
[]
[]
[]
[]
[]
[]
[]
[]
[]
[]
[]
[]
[]
[]
[]
[]
[]
[]
[]
[]
[]
[]
[]
[]
[]
[]
[]
[]
[]
[]
[]
[]
[]
[]
[]
[]
[]
[]
[]
[]
[]
[null,{"$f":"SUM(B33/1000)","v":0.3},{"$f":"SUM(B372*16)","v":4.8},null,{"$f":"SUM(C372*1000)","v":4800},{"$f":"SUM(C11*1000000)","v":166666666.66666666},{"$f":"SUM(F372/E372)","v":34722.222222222219},{"$f":"SUM(C33*16)","v":555552},{"$f":"SUM(bps-E33)","v":-1.9200122880533854E-3}]
[null,1.2,{"$f":"SUM(B373*16)","v":19.2},null,19200,{"$f":"SUM(C11*1000000)","v":166666666.66666666},8680.5555555555547,138880,{"$f":"SUM(B34-E34)","v":-7.6804915514458116E-2}]
[null,2.4,{"$f":"SUM(B374*16)","v":38.4},null,38400,{"$f":"SUM(C11*1000000)","v":166666666.66666666},4340.2777777777774,69440,-0.15360983102891623]
[null,4.8,{"$f":"SUM(B375*16)","v":76.8},null,76800,{"$f":"SUM(C11*1000000)","v":166666666.66666666},2170.1388888888887,34720,-0.30721966205783247]
[null,9.6,153.6,null,153600,{"$f":"SUM(C11*1000000)","v":166666666.66666666},1085.0694444444443,17360,-0.61443932411566493]
[null,19.2,307.2,null,307200,{"$f":"SUM(C11*1000000)","v":166666666.66666666},542.53472222222217,8672,-18.942189421894]
[null,28.8,460.8,null,460800,{"$f":"SUM(C11*1000000)","v":166666666.66666666},361.68981481481478,5776,-55.032317636192602]
[null,38.4,614.4,null,614400,{"$f":"SUM(C11*1000000)","v":166666666.66666666},271.26736111111109,4336,-37.884378843787999]
[null,57.6,921.6,null,921600,{"$f":"SUM(C11*1000000)","v":166666666.66666666},180.84490740740739,2880,-270.37037037036498]
[null,128,{"$f":"SUM(B381*16)","v":2048},null,2048000,{"$f":"SUM(C11*1000000)","v":166666666.66666666},81.380208333333329,1296,-600.82304526747612]
[null,115.2,1843.2,null,1843200,{"$f":"SUM(C11*1000000)","v":166666666.66666666},90.422453703703695,1440,-540.74074074072996]
[null,230.4,3686.4,null,3686400,{"$f":"SUM(C11*1000000)","v":166666666.66666666},45.211226851851848,720,-1081.4814814814599]
[null,460.8,7372.8,null,7372800,{"$f":"SUM(C11*1000000)","v":166666666.66666666},22.605613425925924,352,-12684.848484848451]
[null,921.6,14745.6,null,14745600,{"$f":"SUM(C11*1000000)","v":166666666.66666666},11.302806712962962,176,-25369.696969696903]
[null,3000,48000,null,48000000,{"$f":"SUM(C11*1000000)","v":166666666.66666666},3.4722222222222219,48,-472222.22222222202]
[]
[]
[null,{"$f":"SUM(H33/1000)","v":0.3},{"$f":"SUM(B389*13)","v":3.9},null,{"$f":"SUM(C389*1000)","v":3900},{"$f":"SUM(C11*1000000)","v":166666666.66666666},{"$f":"SUM(F389/E389)","v":42735.042735042734},{"$f":"I33*13","v":555555},{"$f":"SUM(H33-K33)","v":-3.00000300001102E-4}]
[null,1.2,{"$f":"SUM(B390*13)","v":15.6},null,15600,{"$f":"SUM(C11*1000000)","v":166666666.66666666},10683.760683760684,138879,-8.5446083761098635E-2]
[null,2.4,31.2,null,31200,{"$f":"SUM(C11*1000000)","v":166666666.66666666},5341.8803418803418,69433,-0.39558519243973933]
[null,4.8,62.4,null,62400,{"$f":"SUM(C11*1000000)","v":166666666.66666666},2670.9401709401709,34710,-1.6901949486218655]
[null,9.6,124.8,null,124800,{"$f":"SUM(C11*1000000)","v":166666666.66666666},1335.4700854700855,17355,-3.380389897243731]
[null,19.2,249.6,null,249600,{"$f":"SUM(C11*1000000)","v":166666666.66666666},667.73504273504273,8671,-21.158651443507551]
[null,28.8,374.40000000000003,null,374400.00000000006,{"$f":"SUM(C11*1000000)","v":166666666.66666666},445.15669515669504,5785,-10.141169691731193]
[null,38.4,499.2,null,499200,{"$f":"SUM(C11*1000000)","v":166666666.66666666},333.86752136752136,4329,-100.03850003849948]
[null,57.6,748.80000000000007,null,748800.00000000012,{"$f":"SUM(C11*1000000)","v":166666666.66666666},222.57834757834752,2886,-150.05775005774922]
[null,128,1664,null,1664000,{"$f":"SUM(C11*1000000)","v":166666666.66666666},100.16025641025641,1300,-205.12820512820326]
[null,115.2,1497.6000000000001,null,1497600.0000000002,{"$f":"SUM(C11*1000000)","v":166666666.66666666},111.28917378917376,1443,-300.11550011549843]
[null,230.4,2995.2000000000003,null,2995200.0000000005,{"$f":"SUM(C11*1000000)","v":166666666.66666666},55.64458689458688,715,-2700.2331002330757]
[null,460.8,5990.4000000000005,null,5990400.0000000009,{"$f":"SUM(C11*1000000)","v":166666666.66666666},27.82229344729344,351,-14033.808167141455]
[null,921.6,11980.800000000001,null,11980800.000000002,{"$f":"SUM(C11*1000000)","v":166666666.66666666},13.91114672364672,169,-64593.293885601568]
[null,3000,39000,null,39000000,{"$f":"SUM(C11*1000000)","v":166666666.66666666},4.2735042735042734,52,-205128.20512820501]