This thread has been locked.

If you have a related question, please click the "Ask a related question" button in the top right corner. The newly created question will be automatically linked to this question.

SK-AM62A-LP: SK-AM62A-LP: RPC

Part Number: SK-AM62A-LP

I tried to build the ti-rpcmsg-char and I got  following errors in make install.

How can i resolve them?

[linux-devkit]:~/ti-processor-sdk-linux-am62axx-evm-08.06.00.45/ti-rpmsg-char> sudo make install
[sudo] password for oem:
Making install in src
make[1]: Entering directory '/home/oem/ti-processor-sdk-linux-am62axx-evm-08.06.00.45/ti-rpmsg-char/src'
make[2]: Entering directory '/home/oem/ti-processor-sdk-linux-am62axx-evm-08.06.00.45/ti-rpmsg-char/src'
/usr/bin/mkdir -p '/home/oem/ti-processor-sdk-linux-am62axx-evm-08.06.00.45/ti-rpmsg-char/res/lib'
../aarch64-none-linux-gnu-libtool --mode=install /usr/bin/install -c libti_rpmsg_char.la '/home/oem/ti-processor-sdk-linux-am62axx-evm-08.06.00.45/ti-rpmsg-char/res/lib'
aarch64-none-linux-gnu-libtool: install: /usr/bin/install -c .libs/libti_rpmsg_char.so.0.6.3 /home/oem/ti-processor-sdk-linux-am62axx-evm-08.06.00.45/ti-rpmsg-char/res/lib/libti_rpmsg_char.so.0.6.3
aarch64-none-linux-gnu-libtool: install: (cd /home/oem/ti-processor-sdk-linux-am62axx-evm-08.06.00.45/ti-rpmsg-char/res/lib && { ln -s -f libti_rpmsg_char.so.0.6.3 libti_rpmsg_char.so.0 || { rm -f libti_rpmsg_char.so.0 && ln -s libti_rpmsg_char.so.0.6.3 libti_rpmsg_char.so.0; }; })
aarch64-none-linux-gnu-libtool: install: (cd /home/oem/ti-processor-sdk-linux-am62axx-evm-08.06.00.45/ti-rpmsg-char/res/lib && { ln -s -f libti_rpmsg_char.so.0.6.3 libti_rpmsg_char.so || { rm -f libti_rpmsg_char.so && ln -s libti_rpmsg_char.so.0.6.3 libti_rpmsg_char.so; }; })
aarch64-none-linux-gnu-libtool: install: /usr/bin/install -c .libs/libti_rpmsg_char.lai /home/oem/ti-processor-sdk-linux-am62axx-evm-08.06.00.45/ti-rpmsg-char/res/lib/libti_rpmsg_char.la
aarch64-none-linux-gnu-libtool: install: /usr/bin/install -c .libs/libti_rpmsg_char.a /home/oem/ti-processor-sdk-linux-am62axx-evm-08.06.00.45/ti-rpmsg-char/res/lib/libti_rpmsg_char.a
aarch64-none-linux-gnu-libtool: install: chmod 644 /home/oem/ti-processor-sdk-linux-am62axx-evm-08.06.00.45/ti-rpmsg-char/res/lib/libti_rpmsg_char.a
aarch64-none-linux-gnu-libtool: install: aarch64-none-linux-gnu-ranlib /home/oem/ti-processor-sdk-linux-am62axx-evm-08.06.00.45/ti-rpmsg-char/res/lib/libti_rpmsg_char.a
../aarch64-none-linux-gnu-libtool: line 1719: aarch64-none-linux-gnu-ranlib: command not found
make[2]: *** [Makefile:375: install-libLTLIBRARIES] Error 127
make[2]: Leaving directory '/home/oem/ti-processor-sdk-linux-am62axx-evm-08.06.00.45/ti-rpmsg-char/src'
make[1]: *** [Makefile:594: install-am] Error 2
make[1]: Leaving directory '/home/oem/ti-processor-sdk-linux-am62axx-evm-08.06.00.45/ti-rpmsg-char/src'
make: *** [Makefile:399: install-recursive] Error 1