This thread has been locked.

If you have a related question, please click the "Ask a related question" button in the top right corner. The newly created question will be automatically linked to this question.

TIDEP-01017: TIDEP-01017 Software for Real-Time Demo on TIDEP-01012

Part Number: TIDEP-01017
Other Parts Discussed in Thread: TIDEP-01012, AWR2243, AWR1243

Dear TIDEP-01017 Team,

I would like to develop a real-time demo on the TIDEP-01012. Cesar from this  thread

Is it possible to "install" the TIDEP-01017 Software on the TIDEP-01012? Recording to Cesar it is the same HW but different SW. I would appreciate your help.

Thank you,

Jens

  • Hi,

    I will check with the team & get back

    Thanks

    Gaviraju

  • Hi,

    We have tested only AWR1243 cascade radar board, not AWR2243, with TIDEP-01017.

    Regards,

    Stanley

  • Hi Stanley,

    the website regarding TIDEP-01012 was updated. Before the update it was the AWR1243, not AWR2243. So we bought the TIDEP-01012 Version with the AWR1243.

    Please answer the above asked question in the origin post. If it is possible I would appreciate a hint on how to do it. Compling the Processor SDK that is used for TIDEP-01017 and flashing it onto a SD card didn't work for me.

    Thanks and best regards,

    Jens

  • Hi Jens,

    If you have AWR1243 on RF board, you can download Radar SDK at below link and run real-time demo.

    http://software-dl.ti.com/processor-sdk-vision/esd/TDAx/radar-sdk/latest/index_FDS.html

    Regards,
    Stanley

  • Hi Stanley,

    I have problems to build the processor_sdk. But once it is built, do I need to flash it onto the SD card for the RF board?

    Then boot the radar from the sd card?

    I would appreciate your help.

    Thanks and best regards,

    Jens

  • Jens,

    Please follow the user's guide to build once you download the Radar SDK release.

    ~/vision_sdk/docs/Radar/ProcessorSDKRadar_UserGuide.pdf

    You should use "MAKECONFIG= tda2xx_cascade_bios_radar" for cascade radar EVM.

    After the build, please keep following the user's guide for instructions to run real-time demo.

    Regards,
    Stanley

  • Dear Stanley,

    thank you for your help.
    I was able to build the SDK more precisely I finished step 3.2 5) of
    ~/vision_sdk/docs/Radar/ProcessorSDKRadar_UserGuide.pdf

    Can you help me, how to continue?
    The executables are now in /vision_sdk/binaries/apps/$(MAKECONFIG)/vision_sdk/bin/tda3xx-evm

    Question 1) What do I have to do with them now?

    I think I have to continue with 3.7. So I take a look at the referred document, section 3.5. The radar still boots from SD card
    since factory configuration so I go further to 3.6. I decided to go
    for 3.6.1. My SD card is F32 formatted with sector size 512 and it
    has only 1 partition that is marked as active recording to pcdisk.

    I go to step 3.6.3. The generation of the MLO fails with the following
    output:

    ==============================================================

    C:\Users\jeset>cd C:\ti_SDK\PROCESSOR_SDK_RADAR_03_08_00_00\vision_sdk\build

    C:\ti_SDK\PROCESSOR_SDK_RADAR_03_08_00_00\vision_sdk\build>gmake -s sbl
    C:/ti_SDK/PROCESSOR_SDK_RADAR_03_08_00_00/vision_sdk/apps/configs/autorules_footer_cfg.mk:67: ipc_PATH does not exist! ()
    # Compiling tda2xx:a15_0:release:csl_init: a15/src/csl_a15_init.asm
    process_begin: CreateProcess(NULL, C:/ti_SDK/PROCESSOR_SDK_RADAR_03_08_00_00/ti_components/cg_tools/windows/gcc-arm-none-eabi-4_9-2015q3/bin/arm-none-eabi-gcc -c -x assembler-with-cpp -DMAKEFILE_BUILD -Wimplicit -Wall -Wunused -Wunknown-pragmas -ffunction-sections -fdata-sections -c -mcpu=cortex-a15 -g -mfpu=neon -mfloat-abi=hard -mabi=aapcs -mapcs-frame -D__ARMv7 -Werror -O2 -s -DNDEBUG -DBUILD_A15_0 -DSOC_TDA2XX -IC:/ti_SDK/PROCESSOR_SDK_RADAR_03_08_00_00/ti_components/cg_tools/windows/gcc-arm-none-eabi-4_9-2015q3/arm-none-eabi/include -I. -Ia15/src -Ia15 -IC:/ti_SDK/PROCESSOR_SDK_RADAR_03_08_00_00/ti_components/drivers/pdk_01_10_04_05/packages -IC:/ti_SDK/PROCESSOR_SDK_RADAR_03_08_00_00/ti_components/drivers/pdk_01_10_04_05/packages/ti/csl -IC:/ti_SDK/PROCESSOR_SDK_RADAR_03_08_00_00/ti_components/drivers/pdk_01_10_04_05/packages/ti/csl -I/apps/apps_nonbam/inc -I/ -I/common -o C:/ti_SDK/PROCESSOR_SDK_RADAR_03_08_00_00/vision_sdk/binaries/apps/tda2xx_cascade_bios_radar/ti/csl/arch/obj/tda2xx/a15/release/csl_a15_init.oa15fg a15/src/csl_a15_init.asm, ...) failed.
    make (e=2): Das System kann die angegebene Datei nicht finden.
    gmake[6]: *** [C:/ti_SDK/PROCESSOR_SDK_RADAR_03_08_00_00/vision_sdk/binaries/apps/tda2xx_cascade_bios_radar/ti/csl/arch/obj/tda2xx/a15/release/csl_a15_init.oa15fg] Error 2
    gmake[5]: *** [csl_init] Error 2
    gmake[4]: *** [a15_0] Error 2
    # Compiling tda2xx-cascade-radar:tda2xx:a15_0:release:sbl_qspi_opp_nom: sbl_tda2xx_init.asm
    process_begin: CreateProcess(NULL, C:/ti_SDK/PROCESSOR_SDK_RADAR_03_08_00_00/ti_components/cg_tools/windows/gcc-arm-none-eabi-4_9-2015q3/bin/arm-none-eabi-gcc -c -x assembler-with-cpp -DMAKEFILE_BUILD -Wimplicit -Wall -Wunused -Wunknown-pragmas -ffunction-sections -fdata-sections -c -mcpu=cortex-a15 -g -mfpu=neon -mfloat-abi=hard -mabi=aapcs -mapcs-frame -D__ARMv7 -Werror -O2 -s -DNDEBUG -DBUILD_A15_0 -DBOOTMODE_QSPI -DSBL_CONFIG_DISABLE_SAFETY_FEATURES -DSBL_OPT_LEVEL=0 -DSBL_PROD_BUILD -DTRACE_LEVEL=3 -DTDA2XX_EMIF_MODE=0 -DBOARD_TYPE_TDA2XX_CASCADE_RADAR -DOPP_MODE=1 -DFORCE_OPP_MODE=0 -DSOC_TDA2XX -DBOARD_TYPE_TDA2XX_CASCADE_RADAR -IC:/ti_SDK/PROCESSOR_SDK_RADAR_03_08_00_00/ti_components/cg_tools/windows/gcc-arm-none-eabi-4_9-2015q3/arm-none-eabi/include -I. -IC:/ti_SDK/PROCESSOR_SDK_RADAR_03_08_00_00/ti_components/drivers/pdk_01_10_04_05/packages -I/apps/apps_nonbam/inc -I/ -I/common -o C:/ti_SDK/PROCESSOR_SDK_RADAR_03_08_00_00/vision_sdk/binaries/apps/tda2xx_cascade_bios_radar/sbl/qspi/opp_nom/obj/tda2xx-cascade-radar/a15_0/release/sbl_tda2xx_init.oa15fg sbl_tda2xx_init.asm, ...) failed.
    make (e=2): Das System kann die angegebene Datei nicht finden.
    gmake[4]: *** [C:/ti_SDK/PROCESSOR_SDK_RADAR_03_08_00_00/vision_sdk/binaries/apps/tda2xx_cascade_bios_radar/sbl/qspi/opp_nom/obj/tda2xx-cascade-radar/a15_0/release/sbl_tda2xx_init.oa15fg] Error 2
    # Compiling tda2xx:a15_0:release:csl_init: a15/src/csl_a15_init.asm
    process_begin: CreateProcess(NULL, C:/ti_SDK/PROCESSOR_SDK_RADAR_03_08_00_00/ti_components/cg_tools/windows/gcc-arm-none-eabi-4_9-2015q3/bin/arm-none-eabi-gcc -c -x assembler-with-cpp -DMAKEFILE_BUILD -Wimplicit -Wall -Wunused -Wunknown-pragmas -ffunction-sections -fdata-sections -c -mcpu=cortex-a15 -g -mfpu=neon -mfloat-abi=hard -mabi=aapcs -mapcs-frame -D__ARMv7 -Werror -O2 -s -DNDEBUG -DBUILD_A15_0 -DSOC_TDA2XX -IC:/ti_SDK/PROCESSOR_SDK_RADAR_03_08_00_00/ti_components/cg_tools/windows/gcc-arm-none-eabi-4_9-2015q3/arm-none-eabi/include -I. -Ia15/src -Ia15 -IC:/ti_SDK/PROCESSOR_SDK_RADAR_03_08_00_00/ti_components/drivers/pdk_01_10_04_05/packages -IC:/ti_SDK/PROCESSOR_SDK_RADAR_03_08_00_00/ti_components/drivers/pdk_01_10_04_05/packages/ti/csl -IC:/ti_SDK/PROCESSOR_SDK_RADAR_03_08_00_00/ti_components/drivers/pdk_01_10_04_05/packages/ti/csl -I/apps/apps_nonbam/inc -I/ -I/common -o C:/ti_SDK/PROCESSOR_SDK_RADAR_03_08_00_00/vision_sdk/binaries/apps/tda2xx_cascade_bios_radar/ti/csl/arch/obj/tda2xx/a15/release/csl_a15_init.oa15fg a15/src/csl_a15_init.asm, ...) failed.
    make (e=2): Das System kann die angegebene Datei nicht finden.
    gmake[6]: *** [C:/ti_SDK/PROCESSOR_SDK_RADAR_03_08_00_00/vision_sdk/binaries/apps/tda2xx_cascade_bios_radar/ti/csl/arch/obj/tda2xx/a15/release/csl_a15_init.oa15fg] Error 2
    gmake[5]: *** [csl_init] Error 2
    gmake[4]: *** [a15_0] Error 2
    # Compiling tda2xx-cascade-radar:tda2xx:a15_0:release:sbl_qspi_opp_od: sbl_tda2xx_init.asm
    process_begin: CreateProcess(NULL, C:/ti_SDK/PROCESSOR_SDK_RADAR_03_08_00_00/ti_components/cg_tools/windows/gcc-arm-none-eabi-4_9-2015q3/bin/arm-none-eabi-gcc -c -x assembler-with-cpp -DMAKEFILE_BUILD -Wimplicit -Wall -Wunused -Wunknown-pragmas -ffunction-sections -fdata-sections -c -mcpu=cortex-a15 -g -mfpu=neon -mfloat-abi=hard -mabi=aapcs -mapcs-frame -D__ARMv7 -Werror -O2 -s -DNDEBUG -DBUILD_A15_0 -DBOOTMODE_QSPI -DSBL_CONFIG_DISABLE_SAFETY_FEATURES -DSBL_OPT_LEVEL=0 -DSBL_PROD_BUILD -DTRACE_LEVEL=3 -DTDA2XX_EMIF_MODE=0 -DBOARD_TYPE_TDA2XX_CASCADE_RADAR -DOPP_MODE=2 -DFORCE_OPP_MODE=0 -DSOC_TDA2XX -DBOARD_TYPE_TDA2XX_CASCADE_RADAR -IC:/ti_SDK/PROCESSOR_SDK_RADAR_03_08_00_00/ti_components/cg_tools/windows/gcc-arm-none-eabi-4_9-2015q3/arm-none-eabi/include -I. -IC:/ti_SDK/PROCESSOR_SDK_RADAR_03_08_00_00/ti_components/drivers/pdk_01_10_04_05/packages -I/apps/apps_nonbam/inc -I/ -I/common -o C:/ti_SDK/PROCESSOR_SDK_RADAR_03_08_00_00/vision_sdk/binaries/apps/tda2xx_cascade_bios_radar/sbl/qspi/opp_od/obj/tda2xx-cascade-radar/a15_0/release/sbl_tda2xx_init.oa15fg sbl_tda2xx_init.asm, ...) failed.
    make (e=2): Das System kann die angegebene Datei nicht finden.
    gmake[4]: *** [C:/ti_SDK/PROCESSOR_SDK_RADAR_03_08_00_00/vision_sdk/binaries/apps/tda2xx_cascade_bios_radar/sbl/qspi/opp_od/obj/tda2xx-cascade-radar/a15_0/release/sbl_tda2xx_init.oa15fg] Error 2
    # Compiling tda2xx:a15_0:release:csl_init: a15/src/csl_a15_init.asm
    process_begin: CreateProcess(NULL, C:/ti_SDK/PROCESSOR_SDK_RADAR_03_08_00_00/ti_components/cg_tools/windows/gcc-arm-none-eabi-4_9-2015q3/bin/arm-none-eabi-gcc -c -x assembler-with-cpp -DMAKEFILE_BUILD -Wimplicit -Wall -Wunused -Wunknown-pragmas -ffunction-sections -fdata-sections -c -mcpu=cortex-a15 -g -mfpu=neon -mfloat-abi=hard -mabi=aapcs -mapcs-frame -D__ARMv7 -Werror -O2 -s -DNDEBUG -DBUILD_A15_0 -DSOC_TDA2XX -IC:/ti_SDK/PROCESSOR_SDK_RADAR_03_08_00_00/ti_components/cg_tools/windows/gcc-arm-none-eabi-4_9-2015q3/arm-none-eabi/include -I. -Ia15/src -Ia15 -IC:/ti_SDK/PROCESSOR_SDK_RADAR_03_08_00_00/ti_components/drivers/pdk_01_10_04_05/packages -IC:/ti_SDK/PROCESSOR_SDK_RADAR_03_08_00_00/ti_components/drivers/pdk_01_10_04_05/packages/ti/csl -IC:/ti_SDK/PROCESSOR_SDK_RADAR_03_08_00_00/ti_components/drivers/pdk_01_10_04_05/packages/ti/csl -I/apps/apps_nonbam/inc -I/ -I/common -o C:/ti_SDK/PROCESSOR_SDK_RADAR_03_08_00_00/vision_sdk/binaries/apps/tda2xx_cascade_bios_radar/ti/csl/arch/obj/tda2xx/a15/release/csl_a15_init.oa15fg a15/src/csl_a15_init.asm, ...) failed.
    make (e=2): Das System kann die angegebene Datei nicht finden.
    gmake[6]: *** [C:/ti_SDK/PROCESSOR_SDK_RADAR_03_08_00_00/vision_sdk/binaries/apps/tda2xx_cascade_bios_radar/ti/csl/arch/obj/tda2xx/a15/release/csl_a15_init.oa15fg] Error 2
    gmake[5]: *** [csl_init] Error 2
    gmake[4]: *** [a15_0] Error 2
    # Compiling tda2xx-cascade-radar:tda2xx:a15_0:release:sbl_qspi_opp_high: sbl_tda2xx_init.asm
    process_begin: CreateProcess(NULL, C:/ti_SDK/PROCESSOR_SDK_RADAR_03_08_00_00/ti_components/cg_tools/windows/gcc-arm-none-eabi-4_9-2015q3/bin/arm-none-eabi-gcc -c -x assembler-with-cpp -DMAKEFILE_BUILD -Wimplicit -Wall -Wunused -Wunknown-pragmas -ffunction-sections -fdata-sections -c -mcpu=cortex-a15 -g -mfpu=neon -mfloat-abi=hard -mabi=aapcs -mapcs-frame -D__ARMv7 -Werror -O2 -s -DNDEBUG -DBUILD_A15_0 -DBOOTMODE_QSPI -DSBL_CONFIG_DISABLE_SAFETY_FEATURES -DSBL_OPT_LEVEL=0 -DSBL_PROD_BUILD -DTRACE_LEVEL=3 -DTDA2XX_EMIF_MODE=0 -DBOARD_TYPE_TDA2XX_CASCADE_RADAR -DOPP_MODE=3 -DFORCE_OPP_MODE=0 -DSOC_TDA2XX -DBOARD_TYPE_TDA2XX_CASCADE_RADAR -IC:/ti_SDK/PROCESSOR_SDK_RADAR_03_08_00_00/ti_components/cg_tools/windows/gcc-arm-none-eabi-4_9-2015q3/arm-none-eabi/include -I. -IC:/ti_SDK/PROCESSOR_SDK_RADAR_03_08_00_00/ti_components/drivers/pdk_01_10_04_05/packages -I/apps/apps_nonbam/inc -I/ -I/common -o C:/ti_SDK/PROCESSOR_SDK_RADAR_03_08_00_00/vision_sdk/binaries/apps/tda2xx_cascade_bios_radar/sbl/qspi/opp_high/obj/tda2xx-cascade-radar/a15_0/release/sbl_tda2xx_init.oa15fg sbl_tda2xx_init.asm, ...) failed.
    make (e=2): Das System kann die angegebene Datei nicht finden.
    gmake[4]: *** [C:/ti_SDK/PROCESSOR_SDK_RADAR_03_08_00_00/vision_sdk/binaries/apps/tda2xx_cascade_bios_radar/sbl/qspi/opp_high/obj/tda2xx-cascade-radar/a15_0/release/sbl_tda2xx_init.oa15fg] Error 2
    # Compiling tda2xx:a15_0:release:csl_init: a15/src/csl_a15_init.asm
    process_begin: CreateProcess(NULL, C:/ti_SDK/PROCESSOR_SDK_RADAR_03_08_00_00/ti_components/cg_tools/windows/gcc-arm-none-eabi-4_9-2015q3/bin/arm-none-eabi-gcc -c -x assembler-with-cpp -DMAKEFILE_BUILD -Wimplicit -Wall -Wunused -Wunknown-pragmas -ffunction-sections -fdata-sections -c -mcpu=cortex-a15 -g -mfpu=neon -mfloat-abi=hard -mabi=aapcs -mapcs-frame -D__ARMv7 -Werror -O2 -s -DNDEBUG -DBUILD_A15_0 -DSOC_TDA2XX -IC:/ti_SDK/PROCESSOR_SDK_RADAR_03_08_00_00/ti_components/cg_tools/windows/gcc-arm-none-eabi-4_9-2015q3/arm-none-eabi/include -I. -Ia15/src -Ia15 -IC:/ti_SDK/PROCESSOR_SDK_RADAR_03_08_00_00/ti_components/drivers/pdk_01_10_04_05/packages -IC:/ti_SDK/PROCESSOR_SDK_RADAR_03_08_00_00/ti_components/drivers/pdk_01_10_04_05/packages/ti/csl -IC:/ti_SDK/PROCESSOR_SDK_RADAR_03_08_00_00/ti_components/drivers/pdk_01_10_04_05/packages/ti/csl -I/apps/apps_nonbam/inc -I/ -I/common -o C:/ti_SDK/PROCESSOR_SDK_RADAR_03_08_00_00/vision_sdk/binaries/apps/tda2xx_cascade_bios_radar/ti/csl/arch/obj/tda2xx/a15/release/csl_a15_init.oa15fg a15/src/csl_a15_init.asm, ...) failed.
    make (e=2): Das System kann die angegebene Datei nicht finden.
    gmake[6]: *** [C:/ti_SDK/PROCESSOR_SDK_RADAR_03_08_00_00/vision_sdk/binaries/apps/tda2xx_cascade_bios_radar/ti/csl/arch/obj/tda2xx/a15/release/csl_a15_init.oa15fg] Error 2
    gmake[5]: *** [csl_init] Error 2
    gmake[4]: *** [a15_0] Error 2
    # Compiling tda2xx-cascade-radar:tda2xx:a15_0:release:sbl_qspi_opp_low: sbl_tda2xx_init.asm
    process_begin: CreateProcess(NULL, C:/ti_SDK/PROCESSOR_SDK_RADAR_03_08_00_00/ti_components/cg_tools/windows/gcc-arm-none-eabi-4_9-2015q3/bin/arm-none-eabi-gcc -c -x assembler-with-cpp -DMAKEFILE_BUILD -Wimplicit -Wall -Wunused -Wunknown-pragmas -ffunction-sections -fdata-sections -c -mcpu=cortex-a15 -g -mfpu=neon -mfloat-abi=hard -mabi=aapcs -mapcs-frame -D__ARMv7 -Werror -O2 -s -DNDEBUG -DBUILD_A15_0 -DBOOTMODE_QSPI -DSBL_CONFIG_DISABLE_SAFETY_FEATURES -DSBL_OPT_LEVEL=0 -DSBL_PROD_BUILD -DTRACE_LEVEL=3 -DTDA2XX_EMIF_MODE=0 -DBOARD_TYPE_TDA2XX_CASCADE_RADAR -DOPP_MODE=0 -DFORCE_OPP_MODE=0 -DSOC_TDA2XX -DBOARD_TYPE_TDA2XX_CASCADE_RADAR -IC:/ti_SDK/PROCESSOR_SDK_RADAR_03_08_00_00/ti_components/cg_tools/windows/gcc-arm-none-eabi-4_9-2015q3/arm-none-eabi/include -I. -IC:/ti_SDK/PROCESSOR_SDK_RADAR_03_08_00_00/ti_components/drivers/pdk_01_10_04_05/packages -I/apps/apps_nonbam/inc -I/ -I/common -o C:/ti_SDK/PROCESSOR_SDK_RADAR_03_08_00_00/vision_sdk/binaries/apps/tda2xx_cascade_bios_radar/sbl/qspi/opp_low/obj/tda2xx-cascade-radar/a15_0/release/sbl_tda2xx_init.oa15fg sbl_tda2xx_init.asm, ...) failed.
    make (e=2): Das System kann die angegebene Datei nicht finden.
    gmake[4]: *** [C:/ti_SDK/PROCESSOR_SDK_RADAR_03_08_00_00/vision_sdk/binaries/apps/tda2xx_cascade_bios_radar/sbl/qspi/opp_low/obj/tda2xx-cascade-radar/a15_0/release/sbl_tda2xx_init.oa15fg] Error 2
    # Compiling tda2xx:a15_0:release:csl_init: a15/src/csl_a15_init.asm
    process_begin: CreateProcess(NULL, C:/ti_SDK/PROCESSOR_SDK_RADAR_03_08_00_00/ti_components/cg_tools/windows/gcc-arm-none-eabi-4_9-2015q3/bin/arm-none-eabi-gcc -c -x assembler-with-cpp -DMAKEFILE_BUILD -Wimplicit -Wall -Wunused -Wunknown-pragmas -ffunction-sections -fdata-sections -c -mcpu=cortex-a15 -g -mfpu=neon -mfloat-abi=hard -mabi=aapcs -mapcs-frame -D__ARMv7 -Werror -O2 -s -DNDEBUG -DBUILD_A15_0 -DSOC_TDA2XX -IC:/ti_SDK/PROCESSOR_SDK_RADAR_03_08_00_00/ti_components/cg_tools/windows/gcc-arm-none-eabi-4_9-2015q3/arm-none-eabi/include -I. -Ia15/src -Ia15 -IC:/ti_SDK/PROCESSOR_SDK_RADAR_03_08_00_00/ti_components/drivers/pdk_01_10_04_05/packages -IC:/ti_SDK/PROCESSOR_SDK_RADAR_03_08_00_00/ti_components/drivers/pdk_01_10_04_05/packages/ti/csl -IC:/ti_SDK/PROCESSOR_SDK_RADAR_03_08_00_00/ti_components/drivers/pdk_01_10_04_05/packages/ti/csl -I/apps/apps_nonbam/inc -I/ -I/common -o C:/ti_SDK/PROCESSOR_SDK_RADAR_03_08_00_00/vision_sdk/binaries/apps/tda2xx_cascade_bios_radar/ti/csl/arch/obj/tda2xx/a15/release/csl_a15_init.oa15fg a15/src/csl_a15_init.asm, ...) failed.
    make (e=2): Das System kann die angegebene Datei nicht finden.
    gmake[6]: *** [C:/ti_SDK/PROCESSOR_SDK_RADAR_03_08_00_00/vision_sdk/binaries/apps/tda2xx_cascade_bios_radar/ti/csl/arch/obj/tda2xx/a15/release/csl_a15_init.oa15fg] Error 2
    gmake[5]: *** [csl_init] Error 2
    gmake[4]: *** [a15_0] Error 2
    # Compiling tda2xx-cascade-radar:tda2xx:a15_0:release:sbl_sd_opp_nom: sbl_tda2xx_init.asm
    process_begin: CreateProcess(NULL, C:/ti_SDK/PROCESSOR_SDK_RADAR_03_08_00_00/ti_components/cg_tools/windows/gcc-arm-none-eabi-4_9-2015q3/bin/arm-none-eabi-gcc -c -x assembler-with-cpp -DMAKEFILE_BUILD -Wimplicit -Wall -Wunused -Wunknown-pragmas -ffunction-sections -fdata-sections -c -mcpu=cortex-a15 -g -mfpu=neon -mfloat-abi=hard -mabi=aapcs -mapcs-frame -D__ARMv7 -Werror -O2 -s -DNDEBUG -DBUILD_A15_0 -DBOOTMODE_SD -DSBL_CONFIG_DISABLE_SAFETY_FEATURES -DSBL_OPT_LEVEL=0 -DSBL_PROD_BUILD -DTRACE_LEVEL=3 -DTDA2XX_EMIF_MODE=0 -DBOARD_TYPE_TDA2XX_CASCADE_RADAR -DOPP_MODE=1 -DFORCE_OPP_MODE=0 -DSOC_TDA2XX -DBOARD_TYPE_TDA2XX_CASCADE_RADAR -IC:/ti_SDK/PROCESSOR_SDK_RADAR_03_08_00_00/ti_components/cg_tools/windows/gcc-arm-none-eabi-4_9-2015q3/arm-none-eabi/include -I. -IC:/ti_SDK/PROCESSOR_SDK_RADAR_03_08_00_00/ti_components/drivers/pdk_01_10_04_05/packages -I/apps/apps_nonbam/inc -I/ -I/common -o C:/ti_SDK/PROCESSOR_SDK_RADAR_03_08_00_00/vision_sdk/binaries/apps/tda2xx_cascade_bios_radar/sbl/sd/opp_nom/obj/tda2xx-cascade-radar/a15_0/release/sbl_tda2xx_init.oa15fg sbl_tda2xx_init.asm, ...) failed.
    make (e=2): Das System kann die angegebene Datei nicht finden.
    gmake[4]: *** [C:/ti_SDK/PROCESSOR_SDK_RADAR_03_08_00_00/vision_sdk/binaries/apps/tda2xx_cascade_bios_radar/sbl/sd/opp_nom/obj/tda2xx-cascade-radar/a15_0/release/sbl_tda2xx_init.oa15fg] Error 2
    # Compiling tda2xx:a15_0:release:csl_init: a15/src/csl_a15_init.asm
    process_begin: CreateProcess(NULL, C:/ti_SDK/PROCESSOR_SDK_RADAR_03_08_00_00/ti_components/cg_tools/windows/gcc-arm-none-eabi-4_9-2015q3/bin/arm-none-eabi-gcc -c -x assembler-with-cpp -DMAKEFILE_BUILD -Wimplicit -Wall -Wunused -Wunknown-pragmas -ffunction-sections -fdata-sections -c -mcpu=cortex-a15 -g -mfpu=neon -mfloat-abi=hard -mabi=aapcs -mapcs-frame -D__ARMv7 -Werror -O2 -s -DNDEBUG -DBUILD_A15_0 -DSOC_TDA2XX -IC:/ti_SDK/PROCESSOR_SDK_RADAR_03_08_00_00/ti_components/cg_tools/windows/gcc-arm-none-eabi-4_9-2015q3/arm-none-eabi/include -I. -Ia15/src -Ia15 -IC:/ti_SDK/PROCESSOR_SDK_RADAR_03_08_00_00/ti_components/drivers/pdk_01_10_04_05/packages -IC:/ti_SDK/PROCESSOR_SDK_RADAR_03_08_00_00/ti_components/drivers/pdk_01_10_04_05/packages/ti/csl -IC:/ti_SDK/PROCESSOR_SDK_RADAR_03_08_00_00/ti_components/drivers/pdk_01_10_04_05/packages/ti/csl -I/apps/apps_nonbam/inc -I/ -I/common -o C:/ti_SDK/PROCESSOR_SDK_RADAR_03_08_00_00/vision_sdk/binaries/apps/tda2xx_cascade_bios_radar/ti/csl/arch/obj/tda2xx/a15/release/csl_a15_init.oa15fg a15/src/csl_a15_init.asm, ...) failed.
    make (e=2): Das System kann die angegebene Datei nicht finden.
    gmake[6]: *** [C:/ti_SDK/PROCESSOR_SDK_RADAR_03_08_00_00/vision_sdk/binaries/apps/tda2xx_cascade_bios_radar/ti/csl/arch/obj/tda2xx/a15/release/csl_a15_init.oa15fg] Error 2
    gmake[5]: *** [csl_init] Error 2
    gmake[4]: *** [a15_0] Error 2
    # Compiling tda2xx-cascade-radar:tda2xx:a15_0:release:sbl_sd_opp_od: sbl_tda2xx_init.asm
    process_begin: CreateProcess(NULL, C:/ti_SDK/PROCESSOR_SDK_RADAR_03_08_00_00/ti_components/cg_tools/windows/gcc-arm-none-eabi-4_9-2015q3/bin/arm-none-eabi-gcc -c -x assembler-with-cpp -DMAKEFILE_BUILD -Wimplicit -Wall -Wunused -Wunknown-pragmas -ffunction-sections -fdata-sections -c -mcpu=cortex-a15 -g -mfpu=neon -mfloat-abi=hard -mabi=aapcs -mapcs-frame -D__ARMv7 -Werror -O2 -s -DNDEBUG -DBUILD_A15_0 -DBOOTMODE_SD -DSBL_CONFIG_DISABLE_SAFETY_FEATURES -DSBL_OPT_LEVEL=0 -DSBL_PROD_BUILD -DTRACE_LEVEL=3 -DTDA2XX_EMIF_MODE=0 -DBOARD_TYPE_TDA2XX_CASCADE_RADAR -DOPP_MODE=2 -DFORCE_OPP_MODE=0 -DSOC_TDA2XX -DBOARD_TYPE_TDA2XX_CASCADE_RADAR -IC:/ti_SDK/PROCESSOR_SDK_RADAR_03_08_00_00/ti_components/cg_tools/windows/gcc-arm-none-eabi-4_9-2015q3/arm-none-eabi/include -I. -IC:/ti_SDK/PROCESSOR_SDK_RADAR_03_08_00_00/ti_components/drivers/pdk_01_10_04_05/packages -I/apps/apps_nonbam/inc -I/ -I/common -o C:/ti_SDK/PROCESSOR_SDK_RADAR_03_08_00_00/vision_sdk/binaries/apps/tda2xx_cascade_bios_radar/sbl/sd/opp_od/obj/tda2xx-cascade-radar/a15_0/release/sbl_tda2xx_init.oa15fg sbl_tda2xx_init.asm, ...) failed.
    make (e=2): Das System kann die angegebene Datei nicht finden.
    gmake[4]: *** [C:/ti_SDK/PROCESSOR_SDK_RADAR_03_08_00_00/vision_sdk/binaries/apps/tda2xx_cascade_bios_radar/sbl/sd/opp_od/obj/tda2xx-cascade-radar/a15_0/release/sbl_tda2xx_init.oa15fg] Error 2
    # Compiling tda2xx:a15_0:release:csl_init: a15/src/csl_a15_init.asm
    process_begin: CreateProcess(NULL, C:/ti_SDK/PROCESSOR_SDK_RADAR_03_08_00_00/ti_components/cg_tools/windows/gcc-arm-none-eabi-4_9-2015q3/bin/arm-none-eabi-gcc -c -x assembler-with-cpp -DMAKEFILE_BUILD -Wimplicit -Wall -Wunused -Wunknown-pragmas -ffunction-sections -fdata-sections -c -mcpu=cortex-a15 -g -mfpu=neon -mfloat-abi=hard -mabi=aapcs -mapcs-frame -D__ARMv7 -Werror -O2 -s -DNDEBUG -DBUILD_A15_0 -DSOC_TDA2XX -IC:/ti_SDK/PROCESSOR_SDK_RADAR_03_08_00_00/ti_components/cg_tools/windows/gcc-arm-none-eabi-4_9-2015q3/arm-none-eabi/include -I. -Ia15/src -Ia15 -IC:/ti_SDK/PROCESSOR_SDK_RADAR_03_08_00_00/ti_components/drivers/pdk_01_10_04_05/packages -IC:/ti_SDK/PROCESSOR_SDK_RADAR_03_08_00_00/ti_components/drivers/pdk_01_10_04_05/packages/ti/csl -IC:/ti_SDK/PROCESSOR_SDK_RADAR_03_08_00_00/ti_components/drivers/pdk_01_10_04_05/packages/ti/csl -I/apps/apps_nonbam/inc -I/ -I/common -o C:/ti_SDK/PROCESSOR_SDK_RADAR_03_08_00_00/vision_sdk/binaries/apps/tda2xx_cascade_bios_radar/ti/csl/arch/obj/tda2xx/a15/release/csl_a15_init.oa15fg a15/src/csl_a15_init.asm, ...) failed.
    make (e=2): Das System kann die angegebene Datei nicht finden.
    gmake[6]: *** [C:/ti_SDK/PROCESSOR_SDK_RADAR_03_08_00_00/vision_sdk/binaries/apps/tda2xx_cascade_bios_radar/ti/csl/arch/obj/tda2xx/a15/release/csl_a15_init.oa15fg] Error 2
    gmake[5]: *** [csl_init] Error 2
    gmake[4]: *** [a15_0] Error 2
    # Compiling tda2xx-cascade-radar:tda2xx:a15_0:release:sbl_sd_opp_high: sbl_tda2xx_init.asm
    process_begin: CreateProcess(NULL, C:/ti_SDK/PROCESSOR_SDK_RADAR_03_08_00_00/ti_components/cg_tools/windows/gcc-arm-none-eabi-4_9-2015q3/bin/arm-none-eabi-gcc -c -x assembler-with-cpp -DMAKEFILE_BUILD -Wimplicit -Wall -Wunused -Wunknown-pragmas -ffunction-sections -fdata-sections -c -mcpu=cortex-a15 -g -mfpu=neon -mfloat-abi=hard -mabi=aapcs -mapcs-frame -D__ARMv7 -Werror -O2 -s -DNDEBUG -DBUILD_A15_0 -DBOOTMODE_SD -DSBL_CONFIG_DISABLE_SAFETY_FEATURES -DSBL_OPT_LEVEL=0 -DSBL_PROD_BUILD -DTRACE_LEVEL=3 -DTDA2XX_EMIF_MODE=0 -DBOARD_TYPE_TDA2XX_CASCADE_RADAR -DOPP_MODE=3 -DFORCE_OPP_MODE=0 -DSOC_TDA2XX -DBOARD_TYPE_TDA2XX_CASCADE_RADAR -IC:/ti_SDK/PROCESSOR_SDK_RADAR_03_08_00_00/ti_components/cg_tools/windows/gcc-arm-none-eabi-4_9-2015q3/arm-none-eabi/include -I. -IC:/ti_SDK/PROCESSOR_SDK_RADAR_03_08_00_00/ti_components/drivers/pdk_01_10_04_05/packages -I/apps/apps_nonbam/inc -I/ -I/common -o C:/ti_SDK/PROCESSOR_SDK_RADAR_03_08_00_00/vision_sdk/binaries/apps/tda2xx_cascade_bios_radar/sbl/sd/opp_high/obj/tda2xx-cascade-radar/a15_0/release/sbl_tda2xx_init.oa15fg sbl_tda2xx_init.asm, ...) failed.
    make (e=2): Das System kann die angegebene Datei nicht finden.
    gmake[4]: *** [C:/ti_SDK/PROCESSOR_SDK_RADAR_03_08_00_00/vision_sdk/binaries/apps/tda2xx_cascade_bios_radar/sbl/sd/opp_high/obj/tda2xx-cascade-radar/a15_0/release/sbl_tda2xx_init.oa15fg] Error 2
    # Compiling tda2xx:a15_0:release:csl_init: a15/src/csl_a15_init.asm
    process_begin: CreateProcess(NULL, C:/ti_SDK/PROCESSOR_SDK_RADAR_03_08_00_00/ti_components/cg_tools/windows/gcc-arm-none-eabi-4_9-2015q3/bin/arm-none-eabi-gcc -c -x assembler-with-cpp -DMAKEFILE_BUILD -Wimplicit -Wall -Wunused -Wunknown-pragmas -ffunction-sections -fdata-sections -c -mcpu=cortex-a15 -g -mfpu=neon -mfloat-abi=hard -mabi=aapcs -mapcs-frame -D__ARMv7 -Werror -O2 -s -DNDEBUG -DBUILD_A15_0 -DSOC_TDA2XX -IC:/ti_SDK/PROCESSOR_SDK_RADAR_03_08_00_00/ti_components/cg_tools/windows/gcc-arm-none-eabi-4_9-2015q3/arm-none-eabi/include -I. -Ia15/src -Ia15 -IC:/ti_SDK/PROCESSOR_SDK_RADAR_03_08_00_00/ti_components/drivers/pdk_01_10_04_05/packages -IC:/ti_SDK/PROCESSOR_SDK_RADAR_03_08_00_00/ti_components/drivers/pdk_01_10_04_05/packages/ti/csl -IC:/ti_SDK/PROCESSOR_SDK_RADAR_03_08_00_00/ti_components/drivers/pdk_01_10_04_05/packages/ti/csl -I/apps/apps_nonbam/inc -I/ -I/common -o C:/ti_SDK/PROCESSOR_SDK_RADAR_03_08_00_00/vision_sdk/binaries/apps/tda2xx_cascade_bios_radar/ti/csl/arch/obj/tda2xx/a15/release/csl_a15_init.oa15fg a15/src/csl_a15_init.asm, ...) failed.
    make (e=2): Das System kann die angegebene Datei nicht finden.
    gmake[6]: *** [C:/ti_SDK/PROCESSOR_SDK_RADAR_03_08_00_00/vision_sdk/binaries/apps/tda2xx_cascade_bios_radar/ti/csl/arch/obj/tda2xx/a15/release/csl_a15_init.oa15fg] Error 2
    gmake[5]: *** [csl_init] Error 2
    gmake[4]: *** [a15_0] Error 2
    # Compiling tda2xx-cascade-radar:tda2xx:a15_0:release:sbl_sd_opp_low: sbl_tda2xx_init.asm
    process_begin: CreateProcess(NULL, C:/ti_SDK/PROCESSOR_SDK_RADAR_03_08_00_00/ti_components/cg_tools/windows/gcc-arm-none-eabi-4_9-2015q3/bin/arm-none-eabi-gcc -c -x assembler-with-cpp -DMAKEFILE_BUILD -Wimplicit -Wall -Wunused -Wunknown-pragmas -ffunction-sections -fdata-sections -c -mcpu=cortex-a15 -g -mfpu=neon -mfloat-abi=hard -mabi=aapcs -mapcs-frame -D__ARMv7 -Werror -O2 -s -DNDEBUG -DBUILD_A15_0 -DBOOTMODE_SD -DSBL_CONFIG_DISABLE_SAFETY_FEATURES -DSBL_OPT_LEVEL=0 -DSBL_PROD_BUILD -DTRACE_LEVEL=3 -DTDA2XX_EMIF_MODE=0 -DBOARD_TYPE_TDA2XX_CASCADE_RADAR -DOPP_MODE=0 -DFORCE_OPP_MODE=0 -DSOC_TDA2XX -DBOARD_TYPE_TDA2XX_CASCADE_RADAR -IC:/ti_SDK/PROCESSOR_SDK_RADAR_03_08_00_00/ti_components/cg_tools/windows/gcc-arm-none-eabi-4_9-2015q3/arm-none-eabi/include -I. -IC:/ti_SDK/PROCESSOR_SDK_RADAR_03_08_00_00/ti_components/drivers/pdk_01_10_04_05/packages -I/apps/apps_nonbam/inc -I/ -I/common -o C:/ti_SDK/PROCESSOR_SDK_RADAR_03_08_00_00/vision_sdk/binaries/apps/tda2xx_cascade_bios_radar/sbl/sd/opp_low/obj/tda2xx-cascade-radar/a15_0/release/sbl_tda2xx_init.oa15fg sbl_tda2xx_init.asm, ...) failed.
    make (e=2): Das System kann die angegebene Datei nicht finden.
    gmake[4]: *** [C:/ti_SDK/PROCESSOR_SDK_RADAR_03_08_00_00/vision_sdk/binaries/apps/tda2xx_cascade_bios_radar/sbl/sd/opp_low/obj/tda2xx-cascade-radar/a15_0/release/sbl_tda2xx_init.oa15fg] Error 2
    # Compiling tda2xx:a15_0:release:csl_init: a15/src/csl_a15_init.asm
    process_begin: CreateProcess(NULL, C:/ti_SDK/PROCESSOR_SDK_RADAR_03_08_00_00/ti_components/cg_tools/windows/gcc-arm-none-eabi-4_9-2015q3/bin/arm-none-eabi-gcc -c -x assembler-with-cpp -DMAKEFILE_BUILD -Wimplicit -Wall -Wunused -Wunknown-pragmas -ffunction-sections -fdata-sections -c -mcpu=cortex-a15 -g -mfpu=neon -mfloat-abi=hard -mabi=aapcs -mapcs-frame -D__ARMv7 -Werror -O2 -s -DNDEBUG -DBUILD_A15_0 -DSOC_TDA2XX -IC:/ti_SDK/PROCESSOR_SDK_RADAR_03_08_00_00/ti_components/cg_tools/windows/gcc-arm-none-eabi-4_9-2015q3/arm-none-eabi/include -I. -Ia15/src -Ia15 -IC:/ti_SDK/PROCESSOR_SDK_RADAR_03_08_00_00/ti_components/drivers/pdk_01_10_04_05/packages -IC:/ti_SDK/PROCESSOR_SDK_RADAR_03_08_00_00/ti_components/drivers/pdk_01_10_04_05/packages/ti/csl -IC:/ti_SDK/PROCESSOR_SDK_RADAR_03_08_00_00/ti_components/drivers/pdk_01_10_04_05/packages/ti/csl -I/apps/apps_nonbam/inc -I/ -I/common -o C:/ti_SDK/PROCESSOR_SDK_RADAR_03_08_00_00/vision_sdk/binaries/apps/tda2xx_cascade_bios_radar/ti/csl/arch/obj/tda2xx/a15/release/csl_a15_init.oa15fg a15/src/csl_a15_init.asm, ...) failed.
    make (e=2): Das System kann die angegebene Datei nicht finden.
    gmake[6]: *** [C:/ti_SDK/PROCESSOR_SDK_RADAR_03_08_00_00/vision_sdk/binaries/apps/tda2xx_cascade_bios_radar/ti/csl/arch/obj/tda2xx/a15/release/csl_a15_init.oa15fg] Error 2
    gmake[5]: *** [csl_init] Error 2
    gmake[4]: *** [a15_0] Error 2
    # Compiling tda2xx-cascade-radar:tda2xx:a15_0:release:sbl_nor_opp_nom: sbl_tda2xx_nor_init.asm
    process_begin: CreateProcess(NULL, C:/ti_SDK/PROCESSOR_SDK_RADAR_03_08_00_00/ti_components/cg_tools/windows/gcc-arm-none-eabi-4_9-2015q3/bin/arm-none-eabi-gcc -c -x assembler-with-cpp -DMAKEFILE_BUILD -Wimplicit -Wall -Wunused -Wunknown-pragmas -ffunction-sections -fdata-sections -c -mcpu=cortex-a15 -g -mfpu=neon -mfloat-abi=hard -mabi=aapcs -mapcs-frame -D__ARMv7 -Werror -O2 -s -DNDEBUG -DBUILD_A15_0 -DBOOTMODE_NOR -DSBL_CONFIG_DISABLE_SAFETY_FEATURES -DSBL_OPT_LEVEL=0 -DSBL_PROD_BUILD -DTRACE_LEVEL=3 -DTDA2XX_EMIF_MODE=0 -DBOARD_TYPE_TDA2XX_CASCADE_RADAR -DOPP_MODE=1 -DFORCE_OPP_MODE=0 -DSOC_TDA2XX -DBOARD_TYPE_TDA2XX_CASCADE_RADAR -IC:/ti_SDK/PROCESSOR_SDK_RADAR_03_08_00_00/ti_components/cg_tools/windows/gcc-arm-none-eabi-4_9-2015q3/arm-none-eabi/include -I. -IC:/ti_SDK/PROCESSOR_SDK_RADAR_03_08_00_00/ti_components/drivers/pdk_01_10_04_05/packages -I/apps/apps_nonbam/inc -I/ -I/common -o C:/ti_SDK/PROCESSOR_SDK_RADAR_03_08_00_00/vision_sdk/binaries/apps/tda2xx_cascade_bios_radar/sbl/nor/opp_nom/obj/tda2xx-cascade-radar/a15_0/release/sbl_tda2xx_nor_init.oa15fg sbl_tda2xx_nor_init.asm, ...) failed.
    make (e=2): Das System kann die angegebene Datei nicht finden.
    gmake[4]: *** [C:/ti_SDK/PROCESSOR_SDK_RADAR_03_08_00_00/vision_sdk/binaries/apps/tda2xx_cascade_bios_radar/sbl/nor/opp_nom/obj/tda2xx-cascade-radar/a15_0/release/sbl_tda2xx_nor_init.oa15fg] Error 2
    # Compiling tda2xx:a15_0:release:csl_init: a15/src/csl_a15_init.asm
    process_begin: CreateProcess(NULL, C:/ti_SDK/PROCESSOR_SDK_RADAR_03_08_00_00/ti_components/cg_tools/windows/gcc-arm-none-eabi-4_9-2015q3/bin/arm-none-eabi-gcc -c -x assembler-with-cpp -DMAKEFILE_BUILD -Wimplicit -Wall -Wunused -Wunknown-pragmas -ffunction-sections -fdata-sections -c -mcpu=cortex-a15 -g -mfpu=neon -mfloat-abi=hard -mabi=aapcs -mapcs-frame -D__ARMv7 -Werror -O2 -s -DNDEBUG -DBUILD_A15_0 -DSOC_TDA2XX -IC:/ti_SDK/PROCESSOR_SDK_RADAR_03_08_00_00/ti_components/cg_tools/windows/gcc-arm-none-eabi-4_9-2015q3/arm-none-eabi/include -I. -Ia15/src -Ia15 -IC:/ti_SDK/PROCESSOR_SDK_RADAR_03_08_00_00/ti_components/drivers/pdk_01_10_04_05/packages -IC:/ti_SDK/PROCESSOR_SDK_RADAR_03_08_00_00/ti_components/drivers/pdk_01_10_04_05/packages/ti/csl -IC:/ti_SDK/PROCESSOR_SDK_RADAR_03_08_00_00/ti_components/drivers/pdk_01_10_04_05/packages/ti/csl -I/apps/apps_nonbam/inc -I/ -I/common -o C:/ti_SDK/PROCESSOR_SDK_RADAR_03_08_00_00/vision_sdk/binaries/apps/tda2xx_cascade_bios_radar/ti/csl/arch/obj/tda2xx/a15/release/csl_a15_init.oa15fg a15/src/csl_a15_init.asm, ...) failed.
    make (e=2): Das System kann die angegebene Datei nicht finden.
    gmake[6]: *** [C:/ti_SDK/PROCESSOR_SDK_RADAR_03_08_00_00/vision_sdk/binaries/apps/tda2xx_cascade_bios_radar/ti/csl/arch/obj/tda2xx/a15/release/csl_a15_init.oa15fg] Error 2
    gmake[5]: *** [csl_init] Error 2
    gmake[4]: *** [a15_0] Error 2
    # Compiling tda2xx-cascade-radar:tda2xx:a15_0:release:sbl_nor_opp_od: sbl_tda2xx_nor_init.asm
    process_begin: CreateProcess(NULL, C:/ti_SDK/PROCESSOR_SDK_RADAR_03_08_00_00/ti_components/cg_tools/windows/gcc-arm-none-eabi-4_9-2015q3/bin/arm-none-eabi-gcc -c -x assembler-with-cpp -DMAKEFILE_BUILD -Wimplicit -Wall -Wunused -Wunknown-pragmas -ffunction-sections -fdata-sections -c -mcpu=cortex-a15 -g -mfpu=neon -mfloat-abi=hard -mabi=aapcs -mapcs-frame -D__ARMv7 -Werror -O2 -s -DNDEBUG -DBUILD_A15_0 -DBOOTMODE_NOR -DSBL_CONFIG_DISABLE_SAFETY_FEATURES -DSBL_OPT_LEVEL=0 -DSBL_PROD_BUILD -DTRACE_LEVEL=3 -DTDA2XX_EMIF_MODE=0 -DBOARD_TYPE_TDA2XX_CASCADE_RADAR -DOPP_MODE=2 -DFORCE_OPP_MODE=0 -DSOC_TDA2XX -DBOARD_TYPE_TDA2XX_CASCADE_RADAR -IC:/ti_SDK/PROCESSOR_SDK_RADAR_03_08_00_00/ti_components/cg_tools/windows/gcc-arm-none-eabi-4_9-2015q3/arm-none-eabi/include -I. -IC:/ti_SDK/PROCESSOR_SDK_RADAR_03_08_00_00/ti_components/drivers/pdk_01_10_04_05/packages -I/apps/apps_nonbam/inc -I/ -I/common -o C:/ti_SDK/PROCESSOR_SDK_RADAR_03_08_00_00/vision_sdk/binaries/apps/tda2xx_cascade_bios_radar/sbl/nor/opp_od/obj/tda2xx-cascade-radar/a15_0/release/sbl_tda2xx_nor_init.oa15fg sbl_tda2xx_nor_init.asm, ...) failed.
    make (e=2): Das System kann die angegebene Datei nicht finden.
    gmake[4]: *** [C:/ti_SDK/PROCESSOR_SDK_RADAR_03_08_00_00/vision_sdk/binaries/apps/tda2xx_cascade_bios_radar/sbl/nor/opp_od/obj/tda2xx-cascade-radar/a15_0/release/sbl_tda2xx_nor_init.oa15fg] Error 2
    # Compiling tda2xx:a15_0:release:csl_init: a15/src/csl_a15_init.asm
    process_begin: CreateProcess(NULL, C:/ti_SDK/PROCESSOR_SDK_RADAR_03_08_00_00/ti_components/cg_tools/windows/gcc-arm-none-eabi-4_9-2015q3/bin/arm-none-eabi-gcc -c -x assembler-with-cpp -DMAKEFILE_BUILD -Wimplicit -Wall -Wunused -Wunknown-pragmas -ffunction-sections -fdata-sections -c -mcpu=cortex-a15 -g -mfpu=neon -mfloat-abi=hard -mabi=aapcs -mapcs-frame -D__ARMv7 -Werror -O2 -s -DNDEBUG -DBUILD_A15_0 -DSOC_TDA2XX -IC:/ti_SDK/PROCESSOR_SDK_RADAR_03_08_00_00/ti_components/cg_tools/windows/gcc-arm-none-eabi-4_9-2015q3/arm-none-eabi/include -I. -Ia15/src -Ia15 -IC:/ti_SDK/PROCESSOR_SDK_RADAR_03_08_00_00/ti_components/drivers/pdk_01_10_04_05/packages -IC:/ti_SDK/PROCESSOR_SDK_RADAR_03_08_00_00/ti_components/drivers/pdk_01_10_04_05/packages/ti/csl -IC:/ti_SDK/PROCESSOR_SDK_RADAR_03_08_00_00/ti_components/drivers/pdk_01_10_04_05/packages/ti/csl -I/apps/apps_nonbam/inc -I/ -I/common -o C:/ti_SDK/PROCESSOR_SDK_RADAR_03_08_00_00/vision_sdk/binaries/apps/tda2xx_cascade_bios_radar/ti/csl/arch/obj/tda2xx/a15/release/csl_a15_init.oa15fg a15/src/csl_a15_init.asm, ...) failed.
    make (e=2): Das System kann die angegebene Datei nicht finden.
    gmake[6]: *** [C:/ti_SDK/PROCESSOR_SDK_RADAR_03_08_00_00/vision_sdk/binaries/apps/tda2xx_cascade_bios_radar/ti/csl/arch/obj/tda2xx/a15/release/csl_a15_init.oa15fg] Error 2
    gmake[5]: *** [csl_init] Error 2
    gmake[4]: *** [a15_0] Error 2
    # Compiling tda2xx-cascade-radar:tda2xx:a15_0:release:sbl_nor_opp_high: sbl_tda2xx_nor_init.asm
    process_begin: CreateProcess(NULL, C:/ti_SDK/PROCESSOR_SDK_RADAR_03_08_00_00/ti_components/cg_tools/windows/gcc-arm-none-eabi-4_9-2015q3/bin/arm-none-eabi-gcc -c -x assembler-with-cpp -DMAKEFILE_BUILD -Wimplicit -Wall -Wunused -Wunknown-pragmas -ffunction-sections -fdata-sections -c -mcpu=cortex-a15 -g -mfpu=neon -mfloat-abi=hard -mabi=aapcs -mapcs-frame -D__ARMv7 -Werror -O2 -s -DNDEBUG -DBUILD_A15_0 -DBOOTMODE_NOR -DSBL_CONFIG_DISABLE_SAFETY_FEATURES -DSBL_OPT_LEVEL=0 -DSBL_PROD_BUILD -DTRACE_LEVEL=3 -DTDA2XX_EMIF_MODE=0 -DBOARD_TYPE_TDA2XX_CASCADE_RADAR -DOPP_MODE=3 -DFORCE_OPP_MODE=0 -DSOC_TDA2XX -DBOARD_TYPE_TDA2XX_CASCADE_RADAR -IC:/ti_SDK/PROCESSOR_SDK_RADAR_03_08_00_00/ti_components/cg_tools/windows/gcc-arm-none-eabi-4_9-2015q3/arm-none-eabi/include -I. -IC:/ti_SDK/PROCESSOR_SDK_RADAR_03_08_00_00/ti_components/drivers/pdk_01_10_04_05/packages -I/apps/apps_nonbam/inc -I/ -I/common -o C:/ti_SDK/PROCESSOR_SDK_RADAR_03_08_00_00/vision_sdk/binaries/apps/tda2xx_cascade_bios_radar/sbl/nor/opp_high/obj/tda2xx-cascade-radar/a15_0/release/sbl_tda2xx_nor_init.oa15fg sbl_tda2xx_nor_init.asm, ...) failed.
    make (e=2): Das System kann die angegebene Datei nicht finden.
    gmake[4]: *** [C:/ti_SDK/PROCESSOR_SDK_RADAR_03_08_00_00/vision_sdk/binaries/apps/tda2xx_cascade_bios_radar/sbl/nor/opp_high/obj/tda2xx-cascade-radar/a15_0/release/sbl_tda2xx_nor_init.oa15fg] Error 2
    # Compiling tda2xx:a15_0:release:csl_init: a15/src/csl_a15_init.asm
    process_begin: CreateProcess(NULL, C:/ti_SDK/PROCESSOR_SDK_RADAR_03_08_00_00/ti_components/cg_tools/windows/gcc-arm-none-eabi-4_9-2015q3/bin/arm-none-eabi-gcc -c -x assembler-with-cpp -DMAKEFILE_BUILD -Wimplicit -Wall -Wunused -Wunknown-pragmas -ffunction-sections -fdata-sections -c -mcpu=cortex-a15 -g -mfpu=neon -mfloat-abi=hard -mabi=aapcs -mapcs-frame -D__ARMv7 -Werror -O2 -s -DNDEBUG -DBUILD_A15_0 -DSOC_TDA2XX -IC:/ti_SDK/PROCESSOR_SDK_RADAR_03_08_00_00/ti_components/cg_tools/windows/gcc-arm-none-eabi-4_9-2015q3/arm-none-eabi/include -I. -Ia15/src -Ia15 -IC:/ti_SDK/PROCESSOR_SDK_RADAR_03_08_00_00/ti_components/drivers/pdk_01_10_04_05/packages -IC:/ti_SDK/PROCESSOR_SDK_RADAR_03_08_00_00/ti_components/drivers/pdk_01_10_04_05/packages/ti/csl -IC:/ti_SDK/PROCESSOR_SDK_RADAR_03_08_00_00/ti_components/drivers/pdk_01_10_04_05/packages/ti/csl -I/apps/apps_nonbam/inc -I/ -I/common -o C:/ti_SDK/PROCESSOR_SDK_RADAR_03_08_00_00/vision_sdk/binaries/apps/tda2xx_cascade_bios_radar/ti/csl/arch/obj/tda2xx/a15/release/csl_a15_init.oa15fg a15/src/csl_a15_init.asm, ...) failed.
    make (e=2): Das System kann die angegebene Datei nicht finden.
    gmake[6]: *** [C:/ti_SDK/PROCESSOR_SDK_RADAR_03_08_00_00/vision_sdk/binaries/apps/tda2xx_cascade_bios_radar/ti/csl/arch/obj/tda2xx/a15/release/csl_a15_init.oa15fg] Error 2
    gmake[5]: *** [csl_init] Error 2
    gmake[4]: *** [a15_0] Error 2
    # Compiling tda2xx-cascade-radar:tda2xx:a15_0:release:sbl_nor_opp_low: sbl_tda2xx_nor_init.asm
    process_begin: CreateProcess(NULL, C:/ti_SDK/PROCESSOR_SDK_RADAR_03_08_00_00/ti_components/cg_tools/windows/gcc-arm-none-eabi-4_9-2015q3/bin/arm-none-eabi-gcc -c -x assembler-with-cpp -DMAKEFILE_BUILD -Wimplicit -Wall -Wunused -Wunknown-pragmas -ffunction-sections -fdata-sections -c -mcpu=cortex-a15 -g -mfpu=neon -mfloat-abi=hard -mabi=aapcs -mapcs-frame -D__ARMv7 -Werror -O2 -s -DNDEBUG -DBUILD_A15_0 -DBOOTMODE_NOR -DSBL_CONFIG_DISABLE_SAFETY_FEATURES -DSBL_OPT_LEVEL=0 -DSBL_PROD_BUILD -DTRACE_LEVEL=3 -DTDA2XX_EMIF_MODE=0 -DBOARD_TYPE_TDA2XX_CASCADE_RADAR -DOPP_MODE=0 -DFORCE_OPP_MODE=0 -DSOC_TDA2XX -DBOARD_TYPE_TDA2XX_CASCADE_RADAR -IC:/ti_SDK/PROCESSOR_SDK_RADAR_03_08_00_00/ti_components/cg_tools/windows/gcc-arm-none-eabi-4_9-2015q3/arm-none-eabi/include -I. -IC:/ti_SDK/PROCESSOR_SDK_RADAR_03_08_00_00/ti_components/drivers/pdk_01_10_04_05/packages -I/apps/apps_nonbam/inc -I/ -I/common -o C:/ti_SDK/PROCESSOR_SDK_RADAR_03_08_00_00/vision_sdk/binaries/apps/tda2xx_cascade_bios_radar/sbl/nor/opp_low/obj/tda2xx-cascade-radar/a15_0/release/sbl_tda2xx_nor_init.oa15fg sbl_tda2xx_nor_init.asm, ...) failed.
    make (e=2): Das System kann die angegebene Datei nicht finden.
    gmake[4]: *** [C:/ti_SDK/PROCESSOR_SDK_RADAR_03_08_00_00/vision_sdk/binaries/apps/tda2xx_cascade_bios_radar/sbl/nor/opp_low/obj/tda2xx-cascade-radar/a15_0/release/sbl_tda2xx_nor_init.oa15fg] Error 2
    gmake[3]: *** [all] Error 2
    gmake[2]: *** [sbl_all_opps] Error 2
    gmake[1]: *** [sbl] Error 2
    gmake: *** [sbl] Error 2

    C:\ti_SDK\PROCESSOR_SDK_RADAR_03_08_00_00\vision_sdk\build>

    =======================================================================



    I try 3.6.4 and it worked.

    Question 2) Can you help me with the build of MLO? Some files doesn't
    exist.

    Question 3) Let's assume the build of MLO worked. So I have to
    copy the AppImage (not the AppImage_LE or AppImage_BE) and MLO file,
    so in total 2 files to my prepared SD Card? What is with the SDK executable (Question 1)

    Thanks for your help. I appreciate it.

    Best regards,
    Jens


  • The binary should be under \tda2xx_cascade_bios_radar folder, not \tda3xx-evm.

    For the build error, do you have linaro gcc compiler installed at C:/ti_SDK/PROCESSOR_SDK_RADAR_03_08_00_00/ti_components/cg_tools/windows/gcc-arm-none-eabi-4_9-2015q3/?

    Once the build is completed, you should put MLO and AppImage to SD card and boot the board.

    Regards,

    Stanley

  • Hi Stanley

    you are right, the binary is under C:\ti_SDK\PROCESSOR_SDK_RADAR_03_08_00_00\vision_sdk\binaries\apps\tda2xx_cascade_bios_radar\vision_sdk\bin\tda2xx-evm.

    The linaro gcc compiler is installed at  C:/ti_SDK/PROCESSOR_SDK_RADAR_03_08_00_00/ti_components/cg_tools/windows/gcc-arm-none-eabi-4_9-2015q3/.
    I downloaded the  gcc-arm-none-eabi-4_9-2015q3-20150921-win32.exe from launchpad.net/.../4.9-2015-q3-update.

    In the following the corresponding folder tree:
    ==============================================================================
    C:\ti_SDK\PROCESSOR_SDK_RADAR_03_08_00_00\ti_components\cg_tools\windows\gcc-arm-none-eabi-4_9-2015q3> tree                                                                                                                                                Auflistung der Ordnerpfade für Volume System

    C:.
    └───4.9 2015q3
        ├───arm-none-eabi
        │   ├───bin
        │   ├───include
        │   │   ├───bits
        │   │   ├───c++
        │   │   │   └───4.9.3
        │   │   │       ├───arm-none-eabi
        │   │   │       │   ├───armv6-m
        │   │   │       │   │   ├───bits
        │   │   │       │   │   └───ext
        │   │   │       │   ├───armv7-ar
        │   │   │       │   │   └───thumb
        │   │   │       │   │       ├───bits
        │   │   │       │   │       ├───ext
        │   │   │       │   │       ├───fpu
        │   │   │       │   │       │   ├───bits
        │   │   │       │   │       │   └───ext
        │   │   │       │   │       └───softfp
        │   │   │       │   │           ├───bits
        │   │   │       │   │           └───ext
        │   │   │       │   ├───armv7-m
        │   │   │       │   │   ├───bits
        │   │   │       │   │   └───ext
        │   │   │       │   ├───armv7e-m
        │   │   │       │   │   ├───bits
        │   │   │       │   │   ├───ext
        │   │   │       │   │   ├───fpu
        │   │   │       │   │   │   ├───bits
        │   │   │       │   │   │   └───ext
        │   │   │       │   │   └───softfp
        │   │   │       │   │       ├───bits
        │   │   │       │   │       └───ext
        │   │   │       │   ├───bits
        │   │   │       │   ├───cortex-m7
        │   │   │       │   │   ├───bits
        │   │   │       │   │   ├───ext
        │   │   │       │   │   ├───fpu
        │   │   │       │   │   │   ├───fpv5-d16
        │   │   │       │   │   │   │   ├───bits
        │   │   │       │   │   │   │   └───ext
        │   │   │       │   │   │   └───fpv5-sp-d16
        │   │   │       │   │   │       ├───bits
        │   │   │       │   │   │       └───ext
        │   │   │       │   │   └───softfp
        │   │   │       │   │       ├───fpv5-d16
        │   │   │       │   │       │   ├───bits
        │   │   │       │   │       │   └───ext
        │   │   │       │   │       └───fpv5-sp-d16
        │   │   │       │   │           ├───bits
        │   │   │       │   │           └───ext
        │   │   │       │   ├───ext
        │   │   │       │   ├───fpu
        │   │   │       │   │   ├───bits
        │   │   │       │   │   └───ext
        │   │   │       │   └───thumb
        │   │   │       │       ├───bits
        │   │   │       │       └───ext
        │   │   │       ├───backward
        │   │   │       ├───bits
        │   │   │       ├───debug
        │   │   │       ├───decimal
        │   │   │       ├───experimental
        │   │   │       ├───ext
        │   │   │       │   └───pb_ds
        │   │   │       │       └───detail
        │   │   │       │           ├───binary_heap_
        │   │   │       │           ├───binomial_heap_
        │   │   │       │           ├───binomial_heap_base_
        │   │   │       │           ├───bin_search_tree_
        │   │   │       │           ├───branch_policy
        │   │   │       │           ├───cc_hash_table_map_
        │   │   │       │           ├───eq_fn
        │   │   │       │           ├───gp_hash_table_map_
        │   │   │       │           ├───hash_fn
        │   │   │       │           ├───left_child_next_sibling_heap_
        │   │   │       │           ├───list_update_map_
        │   │   │       │           ├───list_update_policy
        │   │   │       │           ├───ov_tree_map_
        │   │   │       │           ├───pairing_heap_
        │   │   │       │           ├───pat_trie_
        │   │   │       │           ├───rb_tree_map_
        │   │   │       │           ├───rc_binomial_heap_
        │   │   │       │           ├───resize_policy
        │   │   │       │           ├───splay_tree_
        │   │   │       │           ├───thin_heap_
        │   │   │       │           ├───tree_policy
        │   │   │       │           ├───trie_policy
        │   │   │       │           └───unordered_iterator
        │   │   │       ├───parallel
        │   │   │       ├───profile
        │   │   │       │   └───impl
        │   │   │       ├───tr1
        │   │   │       └───tr2
        │   │   ├───machine
        │   │   ├───newlib-nano
        │   │   ├───rpc
        │   │   └───sys
        │   ├───lib
        │   │   ├───armv6-m
        │   │   │   └───cpu-init
        │   │   ├───armv7-ar
        │   │   │   └───thumb
        │   │   │       ├───cpu-init
        │   │   │       ├───fpu
        │   │   │       │   └───cpu-init
        │   │   │       └───softfp
        │   │   │           └───cpu-init
        │   │   ├───armv7-m
        │   │   │   └───cpu-init
        │   │   ├───armv7e-m
        │   │   │   ├───cpu-init
        │   │   │   ├───fpu
        │   │   │   │   └───cpu-init
        │   │   │   └───softfp
        │   │   │       └───cpu-init
        │   │   ├───cortex-m7
        │   │   │   ├───cpu-init
        │   │   │   ├───fpu
        │   │   │   │   ├───fpv5-d16
        │   │   │   │   │   └───cpu-init
        │   │   │   │   └───fpv5-sp-d16
        │   │   │   │       └───cpu-init
        │   │   │   └───softfp
        │   │   │       ├───fpv5-d16
        │   │   │       │   └───cpu-init
        │   │   │       └───fpv5-sp-d16
        │   │   │           └───cpu-init
        │   │   ├───cpu-init
        │   │   ├───fpu
        │   │   │   └───cpu-init
        │   │   ├───ldscripts
        │   │   └───thumb
        │   │       └───cpu-init
        │   └───share
        │       └───gdb
        │           ├───python
        │           │   └───gdb
        │           │       ├───command
        │           │       ├───function
        │           │       └───printer
        │           ├───syscalls
        │           └───system-gdbinit
        ├───bin
        ├───lib
        │   └───gcc
        │       └───arm-none-eabi
        │           └───4.9.3
        │               ├───armv6-m
        │               ├───armv7-ar
        │               │   └───thumb
        │               │       ├───fpu
        │               │       └───softfp
        │               ├───armv7-m
        │               ├───armv7e-m
        │               │   ├───fpu
        │               │   └───softfp
        │               ├───cortex-m7
        │               │   ├───fpu
        │               │   │   ├───fpv5-d16
        │               │   │   └───fpv5-sp-d16
        │               │   └───softfp
        │               │       ├───fpv5-d16
        │               │       └───fpv5-sp-d16
        │               ├───fpu
        │               ├───include
        │               ├───include-fixed
        │               ├───install-tools
        │               │   └───include
        │               └───thumb
        └───share
            ├───doc
            │   └───gcc-arm-none-eabi
            │       ├───html
            │       │   ├───annotate
            │       │   ├───as.html
            │       │   ├───bfd.html
            │       │   ├───binutils.html
            │       │   ├───cpp
            │       │   ├───cppinternals
            │       │   ├───gcc
            │       │   ├───gccinstall
            │       │   ├───gccint
            │       │   ├───gdb
            │       │   ├───gprof.html
            │       │   ├───ld.html
            │       │   ├───libc
            │       │   ├───libm
            │       │   └───stabs
            │       └───pdf
            │           ├───etc
            │           └───gcc
            └───gcc-arm-none-eabi
                └───samples
                    ├───ldscripts
                    ├───src
                    │   ├───cpp
                    │   ├───fpin
                    │   ├───fpout
                    │   ├───minimum
                    │   ├───multiram
                    │   ├───qemu
                    │   ├───retarget
                    │   └───semihost
                    └───startup
    ==============================================================================
    Just for understanding. The binaries under C:\ti_SDK\PROCESSOR_SDK_RADAR_03_08_00_00\vision_sdk\binaries\apps\tda2xx_cascade_bios_radar\vision_sdk\bin\tda2xx-evm.
    are used during building of MLO and AppImage or why are they needed?

    Thanks for your help!

    Best regards,
    Jens

  • Hi Stanley,

    I'm looking to do the same thing as Jens, except I have the version with the AWR2243 chips on board. Am I out of luck for getting a real time demo with this RF board?

  • Hi Jake,

    There is no Radar SDK release planned for AWR2243.

    Regards,
    Stanley

  • Jens,

    It is expected to be like the following.

    ~\ti_components\cg_tools\windows\gcc-arm-none-eabi-4_9-2015q3\

    -> 

    /arm-none-eabi

    /bin

    /lib

    /share

  • Hi Stanley,


    the compile error was solved by shifting the files from the folder "4.9 2015q3" to the parent folder "gcc-arm-none-eabi-4_9-2015q3".
    In the manual in section 2 "System Requirements" it is described to install the A15 Compiler, Linker into “<install dir>/ti_components/cg_tools/windows/gcc-arm-none-eabi-4_9-2015q3”
    If you chose this folder as the destination in the installer of the program it will create the folder "4.9 2015q3" and install everything into this folder. That's how this error came up.

    After the build process of MLO from section 3.6.3 in the VisionSDK_UserGuid there exist 4 folders under "vision_sdk\binaries\$(MAKEAPPNAME)\$(MAKECONFIG)\sbl\sd"
    So after the build process there exist 4 MLO files.

    Question 1)  How do they distinguish from each other and which one should I use?

    In the following the corresponding file tree:
    PS C:\ti_SDK\PROCESSOR_SDK_RADAR_03_08_00_00\vision_sdk\binaries\apps\tda2xx_cascade_bios_radar\sbl\sd> tree
    C:.
    ├───opp_high
    │   ├───obj
    │   │   └───tda2xx-cascade-radar
    │   │       └───a15_0
    │   │           └───release
    │   │               ├───.deps
    │   │               └───configuro
    │   └───tda2xx-cascade-radar
    ├───opp_low
    │   ├───obj
    │   │   └───tda2xx-cascade-radar
    │   │       └───a15_0
    │   │           └───release
    │   │               ├───.deps
    │   │               └───configuro
    │   └───tda2xx-cascade-radar
    ├───opp_nom
    │   ├───obj
    │   │   └───tda2xx-cascade-radar
    │   │       └───a15_0
    │   │           └───release
    │   │               ├───.deps
    │   │               └───configuro
    │   └───tda2xx-cascade-radar
    └───opp_od
        ├───obj
        │   └───tda2xx-cascade-radar
        │       └───a15_0
        │           └───release
        │               ├───.deps
        │               └───configuro
        └───tda2xx-cascade-radar

    I randomly decided to take the one from "opp_nom" -> "C:\ti_SDK\PROCESSOR_SDK_RADAR_03_08_00_00\vision_sdk\binaries\apps\tda2xx_cascade_bios_radar\sbl\sd\opp_nom\tda2xx-cascade-radar".

    So that MLO and the AppImage are now on the SD card. I booted the radar from the SD card and followed the section 3.9.1.6 except of flashing the FPGA from
    section 2.3.2.2. However, the live observation works partly now! Thanks for your help.
    Question 2) Could you please shortly explain why flashing the FPGA should be done? Can it somehow influence the "detection quality"?   

    Thank you for your help and best regards,
    Jens

  • Hi Jens,

    "opp" is operating performances point. TDA2 has 4 different OPPs, low/nominal/over drive/high.

    Please refer to datasheet chapter 5.5 for the specifications.

    http://www.ti.com/lit/ds/symlink/tda2hg.pdf

    It is ok to use the binary under "opp_nom".

    FPGA is pre-programmed by EVM manufacturer so you don't have to do it.

    It doesn't affect the quality of the detection. It bridges the data from radar to TDA2 so if it is not working correctly, radar processing won't work at all.

    To get good quality, the radar board requires calibration.

    Please refer to mmWave Studio user guide for RF calibration steps. Without proper calibration, the result will not look good.

    http://software-dl.ti.com/ra-processors/esd/MMWAVE-STUDIO/latest/index_FDS.html

    Regards,
    Stanley

  • Hi Stanley,

    I followed the calibration guide of "mmwave_studio_cascade_user_guide.pdf" section 8.3.1 and was able to update the "calibrateResults_high.mat".

    Question 1) How is this matrix related to the "CC.mat" calibration matrix in section 3.9.1.6.1 (page 34 of 42, under the figure) in "ProcessorSDKRadar_UserGuide.pdf"?

    Question 2) Is there a way to use the "calibrateResults_high.mat" and transform it to a useable .bin file with the "vision_sdk\apps\src\rtos\radar\src\usecases\cascade_radar_object_detect\create_calib_coefs.m"  function, that is mentioned in section 3.9.1.6.1 in "ProcessorSDKRadar_UserGuide.pdf"?

    Question: 3) I boot the radar and press: 1, a, 1, 1, c, "1 <space> 1 <space> 1 <enter>"

    The Output of the console tells me "Calibration Complete".  Where and how can I find the CC.mat file that is sent out over Ethernet to the Matlab tool?

    Question 4) Is there a more detailed documentation about the SDK functions and their parameters?

    Question 5) Does there exist a phyton workaround or any other official workaround, such that a matlab licence is not needed?

    Question 6) My output without proper calibration is shown below. The range scale in the right top corner is an index? not in m. The other plots don't show any obstacle, whereas I use a corner reflector in ~3m distance and with a RCS of 1.3 - 1.8sqm. So the Range Doppler Plot in the left bottom corner doesn't show the reflector, same with the azimuth-range heatmap in the right bottom corner. Is that an issue of calibration?

    Thanks for your help, I really appreciate it.

    Best Regards,

    Jens

  • Jens,

    I am checking with the team member who has experience with calibration to answer your question.

    Regards,
    Stanley

  • Hi Jens, 

    To help keep this forum more searchable, please open up a new ticket with this second calibration topic. 

    Thank you,

    -Randy

  • Where is the new ticket located?

    I am interested in Jens' question #5. Users need to be able to use the board without Matlab or mmWave Studio. Is there an answer to this question?

  • Hi Thomas, 

    I did not see a separate ticket from Jens on that topic. But I did post a response on a related question yesterday here: https://e2e.ti.com/support/sensors/f/1023/t/898978

    Please open up a new ticket if you need more info. 

    Thank you,

    -Randy

  • Thanks Randy! The linked post is in line with what I am looking for.