Due to the U.S. Thanksgiving holiday, please expect delayed responses during the week of 11/22.

This thread has been locked.

If you have a related question, please click the "Ask a related question" button in the top right corner. The newly created question will be automatically linked to this question.

Compiler/TM4C129CNCPDT: Compile time error

Part Number: TM4C129CNCPDT
Other Parts Discussed in Thread: TM4C1294NCPDT, EK-TM4C1294XL

Tool/software: TI C/C++ Compiler

Dear All, 

I have created a simple project and try to compile in Code composer Studio 7.4.0. It shows following error. Could someone please review the error? Please let me know. 

"C:/ti/TivaWare_C_Series-2.1.4.178/driverlib/sysctl.h", line 595: error #20: identifier "uint32_t" is undefined
"C:/ti/TivaWare_C_Series-2.1.4.178/driverlib/sysctl.h", line 596: error #20: identifier "uint32_t" is undefined
"C:/ti/TivaWare_C_Series-2.1.4.178/driverlib/sysctl.h", line 597: error #20: identifier "bool" is undefined
"C:/ti/TivaWare_C_Series-2.1.4.178/driverlib/sysctl.h", line 600: error #20: identifier "uint32_t" is undefined
"C:/ti/TivaWare_C_Series-2.1.4.178/driverlib/sysctl.h", line 601: error #20: identifier "uint32_t" is undefined
"C:/ti/TivaWare_C_Series-2.1.4.178/driverlib/sysctl.h", line 602: error #20: identifier "uint32_t" is undefined
"C:/ti/TivaWare_C_Series-2.1.4.178/driverlib/sysctl.h", line 603: error #20: identifier "uint32_t" is undefined
"C:/ti/TivaWare_C_Series-2.1.4.178/driverlib/sysctl.h", line 603: error #20: identifier "bool" is undefined
"C:/ti/TivaWare_C_Series-2.1.4.178/driverlib/sysctl.h", line 604: error #20: identifier "uint32_t" is undefined
"C:/ti/TivaWare_C_Series-2.1.4.178/driverlib/sysctl.h", line 605: error #20: identifier "uint32_t" is undefined
"C:/ti/TivaWare_C_Series-2.1.4.178/driverlib/sysctl.h", line 606: error #20: identifier "uint32_t" is undefined
"C:/ti/TivaWare_C_Series-2.1.4.178/driverlib/sysctl.h", line 607: error #20: identifier "uint32_t" is undefined
"C:/ti/TivaWare_C_Series-2.1.4.178/driverlib/sysctl.h", line 608: error #20: identifier "uint32_t" is undefined
"C:/ti/TivaWare_C_Series-2.1.4.178/driverlib/sysctl.h", line 609: error #20: identifier "uint32_t" is undefined
"C:/ti/TivaWare_C_Series-2.1.4.178/driverlib/sysctl.h", line 613: error #20: identifier "uint32_t" is undefined
"C:/ti/TivaWare_C_Series-2.1.4.178/driverlib/sysctl.h", line 614: error #20: identifier "uint32_t" is undefined
"C:/ti/TivaWare_C_Series-2.1.4.178/driverlib/sysctl.h", line 615: error #20: identifier "uint32_t" is undefined
"C:/ti/TivaWare_C_Series-2.1.4.178/driverlib/sysctl.h", line 616: error #20: identifier "uint32_t" is undefined
"C:/ti/TivaWare_C_Series-2.1.4.178/driverlib/sysctl.h", line 617: error #20: identifier "uint32_t" is undefined
"C:/ti/TivaWare_C_Series-2.1.4.178/driverlib/sysctl.h", line 618: error #20: identifier "uint32_t" is undefined
"C:/ti/TivaWare_C_Series-2.1.4.178/driverlib/sysctl.h", line 619: error #20: identifier "uint32_t" is undefined
"C:/ti/TivaWare_C_Series-2.1.4.178/driverlib/sysctl.h", line 619: error #20: identifier "uint32_t" is undefined
"C:/ti/TivaWare_C_Series-2.1.4.178/driverlib/sysctl.h", line 620: error #20: identifier "uint32_t" is undefined
"C:/ti/TivaWare_C_Series-2.1.4.178/driverlib/sysctl.h", line 621: error #20: identifier "uint32_t" is undefined
"C:/ti/TivaWare_C_Series-2.1.4.178/driverlib/sysctl.h", line 622: error #20: identifier "uint32_t" is undefined
"C:/ti/TivaWare_C_Series-2.1.4.178/driverlib/sysctl.h", line 623: error #20: identifier "uint32_t" is undefined
"C:/ti/TivaWare_C_Series-2.1.4.178/driverlib/sysctl.h", line 624: error #20: identifier "uint32_t" is undefined
"C:/ti/TivaWare_C_Series-2.1.4.178/driverlib/sysctl.h", line 625: error #20: identifier "uint32_t" is undefined
"C:/ti/TivaWare_C_Series-2.1.4.178/driverlib/sysctl.h", line 626: error #20: identifier "uint32_t" is undefined
"C:/ti/TivaWare_C_Series-2.1.4.178/driverlib/sysctl.h", line 627: error #20: identifier "bool" is undefined
"C:/ti/TivaWare_C_Series-2.1.4.178/driverlib/sysctl.h", line 628: error #20: identifier "bool" is undefined
"C:/ti/TivaWare_C_Series-2.1.4.178/driverlib/sysctl.h", line 629: error #20: identifier "bool" is undefined
"C:/ti/TivaWare_C_Series-2.1.4.178/driverlib/sysctl.h", line 631: error #20: identifier "uint32_t" is undefined
"C:/ti/TivaWare_C_Series-2.1.4.178/driverlib/sysctl.h", line 632: error #20: identifier "uint32_t" is undefined
"C:/ti/TivaWare_C_Series-2.1.4.178/driverlib/sysctl.h", line 635: error #20: identifier "uint32_t" is undefined
"C:/ti/TivaWare_C_Series-2.1.4.178/driverlib/sysctl.h", line 635: error #20: identifier "uint32_t" is undefined
"C:/ti/TivaWare_C_Series-2.1.4.178/driverlib/sysctl.h", line 636: error #20: identifier "uint32_t" is undefined
"C:/ti/TivaWare_C_Series-2.1.4.178/driverlib/sysctl.h", line 637: error #20: identifier "uint32_t" is undefined
"C:/ti/TivaWare_C_Series-2.1.4.178/driverlib/sysctl.h", line 638: error #20: identifier "uint32_t" is undefined
"C:/ti/TivaWare_C_Series-2.1.4.178/driverlib/sysctl.h", line 639: error #20: identifier "uint32_t" is undefined
"C:/ti/TivaWare_C_Series-2.1.4.178/driverlib/sysctl.h", line 639: error #20: identifier "uint32_t" is undefined
"C:/ti/TivaWare_C_Series-2.1.4.178/driverlib/sysctl.h", line 640: error #20: identifier "uint32_t" is undefined
"C:/ti/TivaWare_C_Series-2.1.4.178/driverlib/sysctl.h", line 641: error #20: identifier "uint32_t" is undefined
"C:/ti/TivaWare_C_Series-2.1.4.178/driverlib/sysctl.h", line 642: error #20: identifier "uint32_t" is undefined
"C:/ti/TivaWare_C_Series-2.1.4.178/driverlib/sysctl.h", line 643: error #20: identifier "uint32_t" is undefined
"C:/ti/TivaWare_C_Series-2.1.4.178/driverlib/sysctl.h", line 644: error #20: identifier "uint32_t" is undefined
"C:/ti/TivaWare_C_Series-2.1.4.178/driverlib/sysctl.h", line 645: error #20: identifier "uint32_t" is undefined
"C:/ti/TivaWare_C_Series-2.1.4.178/driverlib/sysctl.h", line 646: error #20: identifier "bool" is undefined
"C:/ti/TivaWare_C_Series-2.1.4.178/driverlib/sysctl.h", line 646: error #20: identifier "uint32_t" is undefined
"C:/ti/TivaWare_C_Series-2.1.4.178/driverlib/sysctl.h", line 646: error #20: identifier "uint32_t" is undefined
"C:/ti/TivaWare_C_Series-2.1.4.178/driverlib/systick.h", line 65: error #20: identifier "uint32_t" is undefined
"C:/ti/TivaWare_C_Series-2.1.4.178/driverlib/systick.h", line 66: error #20: identifier "uint32_t" is undefined
"C:/ti/TivaWare_C_Series-2.1.4.178/driverlib/systick.h", line 67: error #20: identifier "uint32_t" is undefined
"C:/ti/TivaWare_C_Series-2.1.4.178/driverlib/timer.h", line 243: error #20: identifier "uint32_t" is undefined
"C:/ti/TivaWare_C_Series-2.1.4.178/driverlib/timer.h", line 243: error #20: identifier "uint32_t" is undefined
"C:/ti/TivaWare_C_Series-2.1.4.178/driverlib/timer.h", line 244: error #20: identifier "uint32_t" is undefined
"C:/ti/TivaWare_C_Series-2.1.4.178/driverlib/timer.h", line 244: error #20: identifier "uint32_t" is undefined
"C:/ti/TivaWare_C_Series-2.1.4.178/driverlib/timer.h", line 245: error #20: identifier "uint32_t" is undefined
"C:/ti/TivaWare_C_Series-2.1.4.178/driverlib/timer.h", line 245: error #20: identifier "uint32_t" is undefined
"C:/ti/TivaWare_C_Series-2.1.4.178/driverlib/timer.h", line 246: error #20: identifier "uint32_t" is undefined
"C:/ti/TivaWare_C_Series-2.1.4.178/driverlib/timer.h", line 246: error #20: identifier "uint32_t" is undefined
"C:/ti/TivaWare_C_Series-2.1.4.178/driverlib/timer.h", line 246: error #20: identifier "bool" is undefined
"C:/ti/TivaWare_C_Series-2.1.4.178/driverlib/timer.h", line 247: error #20: identifier "uint32_t" is undefined
"C:/ti/TivaWare_C_Series-2.1.4.178/driverlib/timer.h", line 247: error #20: identifier "uint32_t" is undefined
"C:/ti/TivaWare_C_Series-2.1.4.178/driverlib/timer.h", line 247: error #20: identifier "bool" is undefined
"C:/ti/TivaWare_C_Series-2.1.4.178/driverlib/timer.h", line 248: error #20: identifier "uint32_t" is undefined
"C:/ti/TivaWare_C_Series-2.1.4.178/driverlib/timer.h", line 248: error #20: identifier "uint32_t" is undefined
"C:/ti/TivaWare_C_Series-2.1.4.178/driverlib/timer.h", line 248: error #20: identifier "uint32_t" is undefined
"C:/ti/TivaWare_C_Series-2.1.4.178/driverlib/timer.h", line 249: error #20: identifier "uint32_t" is undefined
"C:/ti/TivaWare_C_Series-2.1.4.178/driverlib/timer.h", line 249: error #20: identifier "uint32_t" is undefined
"C:/ti/TivaWare_C_Series-2.1.4.178/driverlib/timer.h", line 249: error #20: identifier "bool" is undefined
"C:/ti/TivaWare_C_Series-2.1.4.178/driverlib/timer.h", line 250: error #20: identifier "uint32_t" is undefined
"C:/ti/TivaWare_C_Series-2.1.4.178/driverlib/timer.h", line 250: error #20: identifier "uint32_t" is undefined
"C:/ti/TivaWare_C_Series-2.1.4.178/driverlib/timer.h", line 250: error #20: identifier "bool" is undefined
"C:/ti/TivaWare_C_Series-2.1.4.178/driverlib/timer.h", line 251: error #20: identifier "uint32_t" is undefined
"C:/ti/TivaWare_C_Series-2.1.4.178/driverlib/timer.h", line 252: error #20: identifier "uint32_t" is undefined
"C:/ti/TivaWare_C_Series-2.1.4.178/driverlib/timer.h", line 253: error #20: identifier "uint32_t" is undefined
"C:/ti/TivaWare_C_Series-2.1.4.178/driverlib/timer.h", line 253: error #20: identifier "uint32_t" is undefined
"C:/ti/TivaWare_C_Series-2.1.4.178/driverlib/timer.h", line 253: error #20: identifier "uint32_t" is undefined
"C:/ti/TivaWare_C_Series-2.1.4.178/driverlib/timer.h", line 254: error #20: identifier "uint32_t" is undefined
"C:/ti/TivaWare_C_Series-2.1.4.178/driverlib/timer.h", line 254: error #20: identifier "uint32_t" is undefined
"C:/ti/TivaWare_C_Series-2.1.4.178/driverlib/timer.h", line 254: error #20: identifier "uint32_t" is undefined
"C:/ti/TivaWare_C_Series-2.1.4.178/driverlib/timer.h", line 255: error #20: identifier "uint32_t" is undefined
"C:/ti/TivaWare_C_Series-2.1.4.178/driverlib/timer.h", line 255: error #20: identifier "uint32_t" is undefined
"C:/ti/TivaWare_C_Series-2.1.4.178/driverlib/timer.h", line 255: error #20: identifier "uint32_t" is undefined
"C:/ti/TivaWare_C_Series-2.1.4.178/driverlib/timer.h", line 256: error #20: identifier "uint32_t" is undefined
Error limit reached.
100 errors detected in the compilation of "../led_task.c".
Compilation terminated.
gmake: *** [led_task.obj] Error 1
'Building file: "../sample_task.c"'
'Invoking: ARM Compiler'
"C:/ti/ccsv7/tools/compiler/arm_4.9.9/bin/cl470" -mv7M4 --code_state=16 --float_support=FPv4SPD16 --abi=eabi -me -O2 -g --include_path="C:/ti/TivaWare_C_Series-2.1.4.178" --include_path="C:/Users/Sai/workspace_v7/ScaleArm" --include_path="C:/Scale/BCS_110" --include_path="C:/ti/ccsv7/tools/compiler/arm_4.9.9/include" --relaxed_ansi --gcc --define=ccs="ccs" --define=PART_TM4C1294NCPDT --define=TARGET_IS_TM4C129_RA1 --diag_warning=225 --display_error_number --preproc_with_compile --preproc_dependency="sample_task.d_raw" "../sample_task.c"

>> Compilation failure
subdir_rules.mk:51: recipe for target 'sample_task.obj' failed
"C:/ti/TivaWare_C_Series-2.1.4.178/driverlib/sysctl.h", line 583: error #20: identifier "uint32_t" is undefined
"C:/ti/TivaWare_C_Series-2.1.4.178/driverlib/sysctl.h", line 584: error #20: identifier "uint32_t" is undefined
"C:/ti/TivaWare_C_Series-2.1.4.178/driverlib/sysctl.h", line 585: error #20: identifier "uint32_t" is undefined
"C:/ti/TivaWare_C_Series-2.1.4.178/driverlib/sysctl.h", line 586: error #20: identifier "bool" is undefined
"C:/ti/TivaWare_C_Series-2.1.4.178/driverlib/sysctl.h", line 586: error #20: identifier "uint32_t" is undefined
"C:/ti/TivaWare_C_Series-2.1.4.178/driverlib/sysctl.h", line 587: error #20: identifier "bool" is undefined
"C:/ti/TivaWare_C_Series-2.1.4.178/driverlib/sysctl.h", line 587: error #20: identifier "uint32_t" is undefined
"C:/ti/TivaWare_C_Series-2.1.4.178/driverlib/sysctl.h", line 588: error #20: identifier "uint32_t" is undefined
"C:/ti/TivaWare_C_Series-2.1.4.178/driverlib/sysctl.h", line 589: error #20: identifier "uint32_t" is undefined
"C:/ti/TivaWare_C_Series-2.1.4.178/driverlib/sysctl.h", line 590: error #20: identifier "uint32_t" is undefined
"C:/ti/TivaWare_C_Series-2.1.4.178/driverlib/sysctl.h", line 591: error #20: identifier "uint32_t" is undefined
"C:/ti/TivaWare_C_Series-2.1.4.178/driverlib/sysctl.h", line 592: error #20: identifier "uint32_t" is undefined
"C:/ti/TivaWare_C_Series-2.1.4.178/driverlib/sysctl.h", line 593: error #20: identifier "uint32_t" is undefined
"C:/ti/TivaWare_C_Series-2.1.4.178/driverlib/sysctl.h", line 594: error #20: identifier "uint32_t" is undefined
"C:/ti/TivaWare_C_Series-2.1.4.178/driverlib/sysctl.h", line 595: error #20: identifier "uint32_t" is undefined
"C:/ti/TivaWare_C_Series-2.1.4.178/driverlib/sysctl.h", line 596: error #20: identifier "uint32_t" is undefined
"C:/ti/TivaWare_C_Series-2.1.4.178/driverlib/sysctl.h", line 597: error #20: identifier "bool" is undefined
"C:/ti/TivaWare_C_Series-2.1.4.178/driverlib/sysctl.h", line 600: error #20: identifier "uint32_t" is undefined
"C:/ti/TivaWare_C_Series-2.1.4.178/driverlib/sysctl.h", line 601: error #20: identifier "uint32_t" is undefined
"C:/ti/TivaWare_C_Series-2.1.4.178/driverlib/sysctl.h", line 602: error #20: identifier "uint32_t" is undefined
"C:/ti/TivaWare_C_Series-2.1.4.178/driverlib/sysctl.h", line 603: error #20: identifier "uint32_t" is undefined
"C:/ti/TivaWare_C_Series-2.1.4.178/driverlib/sysctl.h", line 603: error #20: identifier "bool" is undefined
"C:/ti/TivaWare_C_Series-2.1.4.178/driverlib/sysctl.h", line 604: error #20: identifier "uint32_t" is undefined
"C:/ti/TivaWare_C_Series-2.1.4.178/driverlib/sysctl.h", line 605: error #20: identifier "uint32_t" is undefined
"C:/ti/TivaWare_C_Series-2.1.4.178/driverlib/sysctl.h", line 606: error #20: identifier "uint32_t" is undefined
"C:/ti/TivaWare_C_Series-2.1.4.178/driverlib/sysctl.h", line 607: error #20: identifier "uint32_t" is undefined
"C:/ti/TivaWare_C_Series-2.1.4.178/driverlib/sysctl.h", line 608: error #20: identifier "uint32_t" is undefined
"C:/ti/TivaWare_C_Series-2.1.4.178/driverlib/sysctl.h", line 609: error #20: identifier "uint32_t" is undefined
"C:/ti/TivaWare_C_Series-2.1.4.178/driverlib/sysctl.h", line 613: error #20: identifier "uint32_t" is undefined
"C:/ti/TivaWare_C_Series-2.1.4.178/driverlib/sysctl.h", line 614: error #20: identifier "uint32_t" is undefined
"C:/ti/TivaWare_C_Series-2.1.4.178/driverlib/sysctl.h", line 615: error #20: identifier "uint32_t" is undefined
"C:/ti/TivaWare_C_Series-2.1.4.178/driverlib/sysctl.h", line 616: error #20: identifier "uint32_t" is undefined
"C:/ti/TivaWare_C_Series-2.1.4.178/driverlib/sysctl.h", line 617: error #20: identifier "uint32_t" is undefined
"C:/ti/TivaWare_C_Series-2.1.4.178/driverlib/sysctl.h", line 618: error #20: identifier "uint32_t" is undefined
"C:/ti/TivaWare_C_Series-2.1.4.178/driverlib/sysctl.h", line 619: error #20: identifier "uint32_t" is undefined
"C:/ti/TivaWare_C_Series-2.1.4.178/driverlib/sysctl.h", line 619: error #20: identifier "uint32_t" is undefined
"C:/ti/TivaWare_C_Series-2.1.4.178/driverlib/sysctl.h", line 620: error #20: identifier "uint32_t" is undefined
"C:/ti/TivaWare_C_Series-2.1.4.178/driverlib/sysctl.h", line 621: error #20: identifier "uint32_t" is undefined
"C:/ti/TivaWare_C_Series-2.1.4.178/driverlib/sysctl.h", line 622: error #20: identifier "uint32_t" is undefined
"C:/ti/TivaWare_C_Series-2.1.4.178/driverlib/sysctl.h", line 623: error #20: identifier "uint32_t" is undefined
"C:/ti/TivaWare_C_Series-2.1.4.178/driverlib/sysctl.h", line 624: error #20: identifier "uint32_t" is undefined
"C:/ti/TivaWare_C_Series-2.1.4.178/driverlib/sysctl.h", line 625: error #20: identifier "uint32_t" is undefined
"C:/ti/TivaWare_C_Series-2.1.4.178/driverlib/sysctl.h", line 626: error #20: identifier "uint32_t" is undefined
"C:/ti/TivaWare_C_Series-2.1.4.178/driverlib/sysctl.h", line 627: error #20: identifier "bool" is undefined
"C:/ti/TivaWare_C_Series-2.1.4.178/driverlib/sysctl.h", line 628: error #20: identifier "bool" is undefined
"C:/ti/TivaWare_C_Series-2.1.4.178/driverlib/sysctl.h", line 629: error #20: identifier "bool" is undefined
"C:/ti/TivaWare_C_Series-2.1.4.178/driverlib/sysctl.h", line 631: error #20: identifier "uint32_t" is undefined
"C:/ti/TivaWare_C_Series-2.1.4.178/driverlib/sysctl.h", line 632: error #20: identifier "uint32_t" is undefined
"C:/ti/TivaWare_C_Series-2.1.4.178/driverlib/sysctl.h", line 635: error #20: identifier "uint32_t" is undefined
"C:/ti/TivaWare_C_Series-2.1.4.178/driverlib/sysctl.h", line 635: error #20: identifier "uint32_t" is undefined
"C:/ti/TivaWare_C_Series-2.1.4.178/driverlib/sysctl.h", line 636: error #20: identifier "uint32_t" is undefined
"C:/ti/TivaWare_C_Series-2.1.4.178/driverlib/sysctl.h", line 637: error #20: identifier "uint32_t" is undefined
"C:/ti/TivaWare_C_Series-2.1.4.178/driverlib/sysctl.h", line 638: error #20: identifier "uint32_t" is undefined
"C:/ti/TivaWare_C_Series-2.1.4.178/driverlib/sysctl.h", line 639: error #20: identifier "uint32_t" is undefined
"C:/ti/TivaWare_C_Series-2.1.4.178/driverlib/sysctl.h", line 639: error #20: identifier "uint32_t" is undefined
"C:/ti/TivaWare_C_Series-2.1.4.178/driverlib/sysctl.h", line 640: error #20: identifier "uint32_t" is undefined
"C:/ti/TivaWare_C_Series-2.1.4.178/driverlib/sysctl.h", line 641: error #20: identifier "uint32_t" is undefined
"C:/ti/TivaWare_C_Series-2.1.4.178/driverlib/sysctl.h", line 642: error #20: identifier "uint32_t" is undefined
"C:/ti/TivaWare_C_Series-2.1.4.178/driverlib/sysctl.h", line 643: error #20: identifier "uint32_t" is undefined
"C:/ti/TivaWare_C_Series-2.1.4.178/driverlib/sysctl.h", line 644: error #20: identifier "uint32_t" is undefined
"C:/ti/TivaWare_C_Series-2.1.4.178/driverlib/sysctl.h", line 645: error #20: identifier "uint32_t" is undefined
"C:/ti/TivaWare_C_Series-2.1.4.178/driverlib/sysctl.h", line 646: error #20: identifier "bool" is undefined
"C:/ti/TivaWare_C_Series-2.1.4.178/driverlib/sysctl.h", line 646: error #20: identifier "uint32_t" is undefined
"C:/ti/TivaWare_C_Series-2.1.4.178/driverlib/sysctl.h", line 646: error #20: identifier "uint32_t" is undefined
"C:/ti/TivaWare_C_Series-2.1.4.178/driverlib/systick.h", line 65: error #20: identifier "uint32_t" is undefined
"C:/ti/TivaWare_C_Series-2.1.4.178/driverlib/systick.h", line 66: error #20: identifier "uint32_t" is undefined
"C:/ti/TivaWare_C_Series-2.1.4.178/driverlib/systick.h", line 67: error #20: identifier "uint32_t" is undefined
"C:/ti/TivaWare_C_Series-2.1.4.178/driverlib/timer.h", line 243: error #20: identifier "uint32_t" is undefined
"C:/ti/TivaWare_C_Series-2.1.4.178/driverlib/timer.h", line 243: error #20: identifier "uint32_t" is undefined
"C:/ti/TivaWare_C_Series-2.1.4.178/driverlib/timer.h", line 244: error #20: identifier "uint32_t" is undefined
"C:/ti/TivaWare_C_Series-2.1.4.178/driverlib/timer.h", line 244: error #20: identifier "uint32_t" is undefined
"C:/ti/TivaWare_C_Series-2.1.4.178/driverlib/timer.h", line 245: error #20: identifier "uint32_t" is undefined
"C:/ti/TivaWare_C_Series-2.1.4.178/driverlib/timer.h", line 245: error #20: identifier "uint32_t" is undefined
"C:/ti/TivaWare_C_Series-2.1.4.178/driverlib/timer.h", line 246: error #20: identifier "uint32_t" is undefined
"C:/ti/TivaWare_C_Series-2.1.4.178/driverlib/timer.h", line 246: error #20: identifier "uint32_t" is undefined
"C:/ti/TivaWare_C_Series-2.1.4.178/driverlib/timer.h", line 246: error #20: identifier "bool" is undefined
"C:/ti/TivaWare_C_Series-2.1.4.178/driverlib/timer.h", line 247: error #20: identifier "uint32_t" is undefined
"C:/ti/TivaWare_C_Series-2.1.4.178/driverlib/timer.h", line 247: error #20: identifier "uint32_t" is undefined
"C:/ti/TivaWare_C_Series-2.1.4.178/driverlib/timer.h", line 247: error #20: identifier "bool" is undefined
"C:/ti/TivaWare_C_Series-2.1.4.178/driverlib/timer.h", line 248: error #20: identifier "uint32_t" is undefined
"C:/ti/TivaWare_C_Series-2.1.4.178/driverlib/timer.h", line 248: error #20: identifier "uint32_t" is undefined
"C:/ti/TivaWare_C_Series-2.1.4.178/driverlib/timer.h", line 248: error #20: identifier "uint32_t" is undefined
"C:/ti/TivaWare_C_Series-2.1.4.178/driverlib/timer.h", line 249: error #20: identifier "uint32_t" is undefined
"C:/ti/TivaWare_C_Series-2.1.4.178/driverlib/timer.h", line 249: error #20: identifier "uint32_t" is undefined
"C:/ti/TivaWare_C_Series-2.1.4.178/driverlib/timer.h", line 249: error #20: identifier "bool" is undefined
"C:/ti/TivaWare_C_Series-2.1.4.178/driverlib/timer.h", line 250: error #20: identifier "uint32_t" is undefined
"C:/ti/TivaWare_C_Series-2.1.4.178/driverlib/timer.h", line 250: error #20: identifier "uint32_t" is undefined
"C:/ti/TivaWare_C_Series-2.1.4.178/driverlib/timer.h", line 250: error #20: identifier "bool" is undefined
"C:/ti/TivaWare_C_Series-2.1.4.178/driverlib/timer.h", line 251: error #20: identifier "uint32_t" is undefined
"C:/ti/TivaWare_C_Series-2.1.4.178/driverlib/timer.h", line 252: error #20: identifier "uint32_t" is undefined
"C:/ti/TivaWare_C_Series-2.1.4.178/driverlib/timer.h", line 253: error #20: identifier "uint32_t" is undefined
"C:/ti/TivaWare_C_Series-2.1.4.178/driverlib/timer.h", line 253: error #20: identifier "uint32_t" is undefined
"C:/ti/TivaWare_C_Series-2.1.4.178/driverlib/timer.h", line 253: error #20: identifier "uint32_t" is undefined
"C:/ti/TivaWare_C_Series-2.1.4.178/driverlib/timer.h", line 254: error #20: identifier "uint32_t" is undefined
"C:/ti/TivaWare_C_Series-2.1.4.178/driverlib/timer.h", line 254: error #20: identifier "uint32_t" is undefined
"C:/ti/TivaWare_C_Series-2.1.4.178/driverlib/timer.h", line 254: error #20: identifier "uint32_t" is undefined
"C:/ti/TivaWare_C_Series-2.1.4.178/driverlib/timer.h", line 255: error #20: identifier "uint32_t" is undefined
"C:/ti/TivaWare_C_Series-2.1.4.178/driverlib/timer.h", line 255: error #20: identifier "uint32_t" is undefined
"C:/ti/TivaWare_C_Series-2.1.4.178/driverlib/timer.h", line 255: error #20: identifier "uint32_t" is undefined
"C:/ti/TivaWare_C_Series-2.1.4.178/driverlib/timer.h", line 256: error #20: identifier "uint32_t" is undefined
Error limit reached.
100 errors detected in the compilation of "../sample_task.c".
Compilation terminated.
gmake: *** [sample_task.obj] Error 1
'Building file: "../state.c"'
'Invoking: ARM Compiler'
"C:/ti/ccsv7/tools/compiler/arm_4.9.9/bin/cl470" -mv7M4 --code_state=16 --float_support=FPv4SPD16 --abi=eabi -me -O2 -g --include_path="C:/ti/TivaWare_C_Series-2.1.4.178" --include_path="C:/Users/Sai/workspace_v7/ScaleArm" --include_path="C:/Scale/BCS_110" --include_path="C:/ti/ccsv7/tools/compiler/arm_4.9.9/include" --relaxed_ansi --gcc --define=ccs="ccs" --define=PART_TM4C1294NCPDT --define=TARGET_IS_TM4C129_RA1 --diag_warning=225 --display_error_number --preproc_with_compile --preproc_dependency="state.d_raw" "../state.c"

>> Compilation failure
subdir_rules.mk:65: recipe for target 'state.obj' failed
"C:/ti/TivaWare_C_Series-2.1.4.178/driverlib/sysctl.h", line 583: error #20: identifier "uint32_t" is undefined
"C:/ti/TivaWare_C_Series-2.1.4.178/driverlib/sysctl.h", line 584: error #20: identifier "uint32_t" is undefined
"C:/ti/TivaWare_C_Series-2.1.4.178/driverlib/sysctl.h", line 585: error #20: identifier "uint32_t" is undefined
"C:/ti/TivaWare_C_Series-2.1.4.178/driverlib/sysctl.h", line 586: error #20: identifier "bool" is undefined
"C:/ti/TivaWare_C_Series-2.1.4.178/driverlib/sysctl.h", line 586: error #20: identifier "uint32_t" is undefined
"C:/ti/TivaWare_C_Series-2.1.4.178/driverlib/sysctl.h", line 587: error #20: identifier "bool" is undefined
"C:/ti/TivaWare_C_Series-2.1.4.178/driverlib/sysctl.h", line 587: error #20: identifier "uint32_t" is undefined
"C:/ti/TivaWare_C_Series-2.1.4.178/driverlib/sysctl.h", line 588: error #20: identifier "uint32_t" is undefined
"C:/ti/TivaWare_C_Series-2.1.4.178/driverlib/sysctl.h", line 589: error #20: identifier "uint32_t" is undefined
"C:/ti/TivaWare_C_Series-2.1.4.178/driverlib/sysctl.h", line 590: error #20: identifier "uint32_t" is undefined
"C:/ti/TivaWare_C_Series-2.1.4.178/driverlib/sysctl.h", line 591: error #20: identifier "uint32_t" is undefined
"C:/ti/TivaWare_C_Series-2.1.4.178/driverlib/sysctl.h", line 592: error #20: identifier "uint32_t" is undefined
"C:/ti/TivaWare_C_Series-2.1.4.178/driverlib/sysctl.h", line 593: error #20: identifier "uint32_t" is undefined
"C:/ti/TivaWare_C_Series-2.1.4.178/driverlib/sysctl.h", line 594: error #20: identifier "uint32_t" is undefined
"C:/ti/TivaWare_C_Series-2.1.4.178/driverlib/sysctl.h", line 595: error #20: identifier "uint32_t" is undefined
"C:/ti/TivaWare_C_Series-2.1.4.178/driverlib/sysctl.h", line 596: error #20: identifier "uint32_t" is undefined
"C:/ti/TivaWare_C_Series-2.1.4.178/driverlib/sysctl.h", line 597: error #20: identifier "bool" is undefined
"C:/ti/TivaWare_C_Series-2.1.4.178/driverlib/sysctl.h", line 600: error #20: identifier "uint32_t" is undefined
"C:/ti/TivaWare_C_Series-2.1.4.178/driverlib/sysctl.h", line 601: error #20: identifier "uint32_t" is undefined
"C:/ti/TivaWare_C_Series-2.1.4.178/driverlib/sysctl.h", line 602: error #20: identifier "uint32_t" is undefined
"C:/ti/TivaWare_C_Series-2.1.4.178/driverlib/sysctl.h", line 603: error #20: identifier "uint32_t" is undefined
"C:/ti/TivaWare_C_Series-2.1.4.178/driverlib/sysctl.h", line 603: error #20: identifier "bool" is undefined
"C:/ti/TivaWare_C_Series-2.1.4.178/driverlib/sysctl.h", line 604: error #20: identifier "uint32_t" is undefined
"C:/ti/TivaWare_C_Series-2.1.4.178/driverlib/sysctl.h", line 605: error #20: identifier "uint32_t" is undefined
"C:/ti/TivaWare_C_Series-2.1.4.178/driverlib/sysctl.h", line 606: error #20: identifier "uint32_t" is undefined
"C:/ti/TivaWare_C_Series-2.1.4.178/driverlib/sysctl.h", line 607: error #20: identifier "uint32_t" is undefined
"C:/ti/TivaWare_C_Series-2.1.4.178/driverlib/sysctl.h", line 608: error #20: identifier "uint32_t" is undefined
"C:/ti/TivaWare_C_Series-2.1.4.178/driverlib/sysctl.h", line 609: error #20: identifier "uint32_t" is undefined
"C:/ti/TivaWare_C_Series-2.1.4.178/driverlib/sysctl.h", line 613: error #20: identifier "uint32_t" is undefined
"C:/ti/TivaWare_C_Series-2.1.4.178/driverlib/sysctl.h", line 614: error #20: identifier "uint32_t" is undefined
"C:/ti/TivaWare_C_Series-2.1.4.178/driverlib/sysctl.h", line 615: error #20: identifier "uint32_t" is undefined
"C:/ti/TivaWare_C_Series-2.1.4.178/driverlib/sysctl.h", line 616: error #20: identifier "uint32_t" is undefined
"C:/ti/TivaWare_C_Series-2.1.4.178/driverlib/sysctl.h", line 617: error #20: identifier "uint32_t" is undefined
"C:/ti/TivaWare_C_Series-2.1.4.178/driverlib/sysctl.h", line 618: error #20: identifier "uint32_t" is undefined
"C:/ti/TivaWare_C_Series-2.1.4.178/driverlib/sysctl.h", line 619: error #20: identifier "uint32_t" is undefined
"C:/ti/TivaWare_C_Series-2.1.4.178/driverlib/sysctl.h", line 619: error #20: identifier "uint32_t" is undefined
"C:/ti/TivaWare_C_Series-2.1.4.178/driverlib/sysctl.h", line 620: error #20: identifier "uint32_t" is undefined
"C:/ti/TivaWare_C_Series-2.1.4.178/driverlib/sysctl.h", line 621: error #20: identifier "uint32_t" is undefined
"C:/ti/TivaWare_C_Series-2.1.4.178/driverlib/sysctl.h", line 622: error #20: identifier "uint32_t" is undefined
"C:/ti/TivaWare_C_Series-2.1.4.178/driverlib/sysctl.h", line 623: error #20: identifier "uint32_t" is undefined
"C:/ti/TivaWare_C_Series-2.1.4.178/driverlib/sysctl.h", line 624: error #20: identifier "uint32_t" is undefined
"C:/ti/TivaWare_C_Series-2.1.4.178/driverlib/sysctl.h", line 625: error #20: identifier "uint32_t" is undefined
"C:/ti/TivaWare_C_Series-2.1.4.178/driverlib/sysctl.h", line 626: error #20: identifier "uint32_t" is undefined
"C:/ti/TivaWare_C_Series-2.1.4.178/driverlib/sysctl.h", line 627: error #20: identifier "bool" is undefined
"C:/ti/TivaWare_C_Series-2.1.4.178/driverlib/sysctl.h", line 628: error #20: identifier "bool" is undefined
"C:/ti/TivaWare_C_Series-2.1.4.178/driverlib/sysctl.h", line 629: error #20: identifier "bool" is undefined
"C:/ti/TivaWare_C_Series-2.1.4.178/driverlib/sysctl.h", line 631: error #20: identifier "uint32_t" is undefined
"C:/ti/TivaWare_C_Series-2.1.4.178/driverlib/sysctl.h", line 632: error #20: identifier "uint32_t" is undefined
"C:/ti/TivaWare_C_Series-2.1.4.178/driverlib/sysctl.h", line 635: error #20: identifier "uint32_t" is undefined
"C:/ti/TivaWare_C_Series-2.1.4.178/driverlib/sysctl.h", line 635: error #20: identifier "uint32_t" is undefined
"C:/ti/TivaWare_C_Series-2.1.4.178/driverlib/sysctl.h", line 636: error #20: identifier "uint32_t" is undefined
"C:/ti/TivaWare_C_Series-2.1.4.178/driverlib/sysctl.h", line 637: error #20: identifier "uint32_t" is undefined
"C:/ti/TivaWare_C_Series-2.1.4.178/driverlib/sysctl.h", line 638: error #20: identifier "uint32_t" is undefined
"C:/ti/TivaWare_C_Series-2.1.4.178/driverlib/sysctl.h", line 639: error #20: identifier "uint32_t" is undefined
"C:/ti/TivaWare_C_Series-2.1.4.178/driverlib/sysctl.h", line 639: error #20: identifier "uint32_t" is undefined
"C:/ti/TivaWare_C_Series-2.1.4.178/driverlib/sysctl.h", line 640: error #20: identifier "uint32_t" is undefined
"C:/ti/TivaWare_C_Series-2.1.4.178/driverlib/sysctl.h", line 641: error #20: identifier "uint32_t" is undefined
"C:/ti/TivaWare_C_Series-2.1.4.178/driverlib/sysctl.h", line 642: error #20: identifier "uint32_t" is undefined
"C:/ti/TivaWare_C_Series-2.1.4.178/driverlib/sysctl.h", line 643: error #20: identifier "uint32_t" is undefined
"C:/ti/TivaWare_C_Series-2.1.4.178/driverlib/sysctl.h", line 644: error #20: identifier "uint32_t" is undefined
"C:/ti/TivaWare_C_Series-2.1.4.178/driverlib/sysctl.h", line 645: error #20: identifier "uint32_t" is undefined
"C:/ti/TivaWare_C_Series-2.1.4.178/driverlib/sysctl.h", line 646: error #20: identifier "bool" is undefined
"C:/ti/TivaWare_C_Series-2.1.4.178/driverlib/sysctl.h", line 646: error #20: identifier "uint32_t" is undefined
"C:/ti/TivaWare_C_Series-2.1.4.178/driverlib/sysctl.h", line 646: error #20: identifier "uint32_t" is undefined
"C:/ti/TivaWare_C_Series-2.1.4.178/driverlib/systick.h", line 65: error #20: identifier "uint32_t" is undefined
"C:/ti/TivaWare_C_Series-2.1.4.178/driverlib/systick.h", line 66: error #20: identifier "uint32_t" is undefined
"C:/ti/TivaWare_C_Series-2.1.4.178/driverlib/systick.h", line 67: error #20: identifier "uint32_t" is undefined
"C:/ti/TivaWare_C_Series-2.1.4.178/driverlib/timer.h", line 243: error #20: identifier "uint32_t" is undefined
"C:/ti/TivaWare_C_Series-2.1.4.178/driverlib/timer.h", line 243: error #20: identifier "uint32_t" is undefined
"C:/ti/TivaWare_C_Series-2.1.4.178/driverlib/timer.h", line 244: error #20: identifier "uint32_t" is undefined
"C:/ti/TivaWare_C_Series-2.1.4.178/driverlib/timer.h", line 244: error #20: identifier "uint32_t" is undefined
"C:/ti/TivaWare_C_Series-2.1.4.178/driverlib/timer.h", line 245: error #20: identifier "uint32_t" is undefined
"C:/ti/TivaWare_C_Series-2.1.4.178/driverlib/timer.h", line 245: error #20: identifier "uint32_t" is undefined
"C:/ti/TivaWare_C_Series-2.1.4.178/driverlib/timer.h", line 246: error #20: identifier "uint32_t" is undefined
"C:/ti/TivaWare_C_Series-2.1.4.178/driverlib/timer.h", line 246: error #20: identifier "uint32_t" is undefined
"C:/ti/TivaWare_C_Series-2.1.4.178/driverlib/timer.h", line 246: error #20: identifier "bool" is undefined
"C:/ti/TivaWare_C_Series-2.1.4.178/driverlib/timer.h", line 247: error #20: identifier "uint32_t" is undefined
"C:/ti/TivaWare_C_Series-2.1.4.178/driverlib/timer.h", line 247: error #20: identifier "uint32_t" is undefined
"C:/ti/TivaWare_C_Series-2.1.4.178/driverlib/timer.h", line 247: error #20: identifier "bool" is undefined
"C:/ti/TivaWare_C_Series-2.1.4.178/driverlib/timer.h", line 248: error #20: identifier "uint32_t" is undefined
"C:/ti/TivaWare_C_Series-2.1.4.178/driverlib/timer.h", line 248: error #20: identifier "uint32_t" is undefined
"C:/ti/TivaWare_C_Series-2.1.4.178/driverlib/timer.h", line 248: error #20: identifier "uint32_t" is undefined
"C:/ti/TivaWare_C_Series-2.1.4.178/driverlib/timer.h", line 249: error #20: identifier "uint32_t" is undefined
"C:/ti/TivaWare_C_Series-2.1.4.178/driverlib/timer.h", line 249: error #20: identifier "uint32_t" is undefined
"C:/ti/TivaWare_C_Series-2.1.4.178/driverlib/timer.h", line 249: error #20: identifier "bool" is undefined
"C:/ti/TivaWare_C_Series-2.1.4.178/driverlib/timer.h", line 250: error #20: identifier "uint32_t" is undefined
"C:/ti/TivaWare_C_Series-2.1.4.178/driverlib/timer.h", line 250: error #20: identifier "uint32_t" is undefined
"C:/ti/TivaWare_C_Series-2.1.4.178/driverlib/timer.h", line 250: error #20: identifier "bool" is undefined
"C:/ti/TivaWare_C_Series-2.1.4.178/driverlib/timer.h", line 251: error #20: identifier "uint32_t" is undefined
"C:/ti/TivaWare_C_Series-2.1.4.178/driverlib/timer.h", line 252: error #20: identifier "uint32_t" is undefined
"C:/ti/TivaWare_C_Series-2.1.4.178/driverlib/timer.h", line 253: error #20: identifier "uint32_t" is undefined
"C:/ti/TivaWare_C_Series-2.1.4.178/driverlib/timer.h", line 253: error #20: identifier "uint32_t" is undefined
"C:/ti/TivaWare_C_Series-2.1.4.178/driverlib/timer.h", line 253: error #20: identifier "uint32_t" is undefined
"C:/ti/TivaWare_C_Series-2.1.4.178/driverlib/timer.h", line 254: error #20: identifier "uint32_t" is undefined
"C:/ti/TivaWare_C_Series-2.1.4.178/driverlib/timer.h", line 254: error #20: identifier "uint32_t" is undefined
"C:/ti/TivaWare_C_Series-2.1.4.178/driverlib/timer.h", line 254: error #20: identifier "uint32_t" is undefined
"C:/ti/TivaWare_C_Series-2.1.4.178/driverlib/timer.h", line 255: error #20: identifier "uint32_t" is undefined
"C:/ti/TivaWare_C_Series-2.1.4.178/driverlib/timer.h", line 255: error #20: identifier "uint32_t" is undefined
"C:/ti/TivaWare_C_Series-2.1.4.178/driverlib/timer.h", line 255: error #20: identifier "uint32_t" is undefined
"C:/ti/TivaWare_C_Series-2.1.4.178/driverlib/timer.h", line 256: error #20: identifier "uint32_t" is undefined
Error limit reached.
100 errors detected in the compilation of "../state.c".
Compilation terminated.
gmake: *** [state.obj] Error 1
'Building file: "../utils.c"'
'Invoking: ARM Compiler'
"C:/ti/ccsv7/tools/compiler/arm_4.9.9/bin/cl470" -mv7M4 --code_state=16 --float_support=FPv4SPD16 --abi=eabi -me -O2 -g --include_path="C:/ti/TivaWare_C_Series-2.1.4.178" --include_path="C:/Users/Sai/workspace_v7/ScaleArm" --include_path="C:/Scale/BCS_110" --include_path="C:/ti/ccsv7/tools/compiler/arm_4.9.9/include" --relaxed_ansi --gcc --define=ccs="ccs" --define=PART_TM4C1294NCPDT --define=TARGET_IS_TM4C129_RA1 --diag_warning=225 --display_error_number --preproc_with_compile --preproc_dependency="utils.d_raw" "../utils.c"

>> Compilation failure
subdir_rules.mk:79: recipe for target 'utils.obj' failed
"C:/ti/TivaWare_C_Series-2.1.4.178/driverlib/sysctl.h", line 583: error #20: identifier "uint32_t" is undefined
"C:/ti/TivaWare_C_Series-2.1.4.178/driverlib/sysctl.h", line 584: error #20: identifier "uint32_t" is undefined
"C:/ti/TivaWare_C_Series-2.1.4.178/driverlib/sysctl.h", line 585: error #20: identifier "uint32_t" is undefined
"C:/ti/TivaWare_C_Series-2.1.4.178/driverlib/sysctl.h", line 586: error #20: identifier "bool" is undefined
"C:/ti/TivaWare_C_Series-2.1.4.178/driverlib/sysctl.h", line 586: error #20: identifier "uint32_t" is undefined
"C:/ti/TivaWare_C_Series-2.1.4.178/driverlib/sysctl.h", line 587: error #20: identifier "bool" is undefined
"C:/ti/TivaWare_C_Series-2.1.4.178/driverlib/sysctl.h", line 587: error #20: identifier "uint32_t" is undefined
"C:/ti/TivaWare_C_Series-2.1.4.178/driverlib/sysctl.h", line 588: error #20: identifier "uint32_t" is undefined
"C:/ti/TivaWare_C_Series-2.1.4.178/driverlib/sysctl.h", line 589: error #20: identifier "uint32_t" is undefined
"C:/ti/TivaWare_C_Series-2.1.4.178/driverlib/sysctl.h", line 590: error #20: identifier "uint32_t" is undefined
"C:/ti/TivaWare_C_Series-2.1.4.178/driverlib/sysctl.h", line 591: error #20: identifier "uint32_t" is undefined
"C:/ti/TivaWare_C_Series-2.1.4.178/driverlib/sysctl.h", line 592: error #20: identifier "uint32_t" is undefined
"C:/ti/TivaWare_C_Series-2.1.4.178/driverlib/sysctl.h", line 593: error #20: identifier "uint32_t" is undefined
"C:/ti/TivaWare_C_Series-2.1.4.178/driverlib/sysctl.h", line 594: error #20: identifier "uint32_t" is undefined
"C:/ti/TivaWare_C_Series-2.1.4.178/driverlib/sysctl.h", line 595: error #20: identifier "uint32_t" is undefined
"C:/ti/TivaWare_C_Series-2.1.4.178/driverlib/sysctl.h", line 596: error #20: identifier "uint32_t" is undefined
"C:/ti/TivaWare_C_Series-2.1.4.178/driverlib/sysctl.h", line 597: error #20: identifier "bool" is undefined
"C:/ti/TivaWare_C_Series-2.1.4.178/driverlib/sysctl.h", line 600: error #20: identifier "uint32_t" is undefined
"C:/ti/TivaWare_C_Series-2.1.4.178/driverlib/sysctl.h", line 601: error #20: identifier "uint32_t" is undefined
"C:/ti/TivaWare_C_Series-2.1.4.178/driverlib/sysctl.h", line 602: error #20: identifier "uint32_t" is undefined
"C:/ti/TivaWare_C_Series-2.1.4.178/driverlib/sysctl.h", line 603: error #20: identifier "uint32_t" is undefined
"C:/ti/TivaWare_C_Series-2.1.4.178/driverlib/sysctl.h", line 603: error #20: identifier "bool" is undefined
"C:/ti/TivaWare_C_Series-2.1.4.178/driverlib/sysctl.h", line 604: error #20: identifier "uint32_t" is undefined
"C:/ti/TivaWare_C_Series-2.1.4.178/driverlib/sysctl.h", line 605: error #20: identifier "uint32_t" is undefined
"C:/ti/TivaWare_C_Series-2.1.4.178/driverlib/sysctl.h", line 606: error #20: identifier "uint32_t" is undefined
"C:/ti/TivaWare_C_Series-2.1.4.178/driverlib/sysctl.h", line 607: error #20: identifier "uint32_t" is undefined
"C:/ti/TivaWare_C_Series-2.1.4.178/driverlib/sysctl.h", line 608: error #20: identifier "uint32_t" is undefined
"C:/ti/TivaWare_C_Series-2.1.4.178/driverlib/sysctl.h", line 609: error #20: identifier "uint32_t" is undefined
"C:/ti/TivaWare_C_Series-2.1.4.178/driverlib/sysctl.h", line 613: error #20: identifier "uint32_t" is undefined
"C:/ti/TivaWare_C_Series-2.1.4.178/driverlib/sysctl.h", line 614: error #20: identifier "uint32_t" is undefined
"C:/ti/TivaWare_C_Series-2.1.4.178/driverlib/sysctl.h", line 615: error #20: identifier "uint32_t" is undefined
"C:/ti/TivaWare_C_Series-2.1.4.178/driverlib/sysctl.h", line 616: error #20: identifier "uint32_t" is undefined
"C:/ti/TivaWare_C_Series-2.1.4.178/driverlib/sysctl.h", line 617: error #20: identifier "uint32_t" is undefined
"C:/ti/TivaWare_C_Series-2.1.4.178/driverlib/sysctl.h", line 618: error #20: identifier "uint32_t" is undefined
"C:/ti/TivaWare_C_Series-2.1.4.178/driverlib/sysctl.h", line 619: error #20: identifier "uint32_t" is undefined
"C:/ti/TivaWare_C_Series-2.1.4.178/driverlib/sysctl.h", line 619: error #20: identifier "uint32_t" is undefined
"C:/ti/TivaWare_C_Series-2.1.4.178/driverlib/sysctl.h", line 620: error #20: identifier "uint32_t" is undefined
"C:/ti/TivaWare_C_Series-2.1.4.178/driverlib/sysctl.h", line 621: error #20: identifier "uint32_t" is undefined
"C:/ti/TivaWare_C_Series-2.1.4.178/driverlib/sysctl.h", line 622: error #20: identifier "uint32_t" is undefined
"C:/ti/TivaWare_C_Series-2.1.4.178/driverlib/sysctl.h", line 623: error #20: identifier "uint32_t" is undefined
"C:/ti/TivaWare_C_Series-2.1.4.178/driverlib/sysctl.h", line 624: error #20: identifier "uint32_t" is undefined
"C:/ti/TivaWare_C_Series-2.1.4.178/driverlib/sysctl.h", line 625: error #20: identifier "uint32_t" is undefined
"C:/ti/TivaWare_C_Series-2.1.4.178/driverlib/sysctl.h", line 626: error #20: identifier "uint32_t" is undefined
"C:/ti/TivaWare_C_Series-2.1.4.178/driverlib/sysctl.h", line 627: error #20: identifier "bool" is undefined
"C:/ti/TivaWare_C_Series-2.1.4.178/driverlib/sysctl.h", line 628: error #20: identifier "bool" is undefined
"C:/ti/TivaWare_C_Series-2.1.4.178/driverlib/sysctl.h", line 629: error #20: identifier "bool" is undefined
"C:/ti/TivaWare_C_Series-2.1.4.178/driverlib/sysctl.h", line 631: error #20: identifier "uint32_t" is undefined
"C:/ti/TivaWare_C_Series-2.1.4.178/driverlib/sysctl.h", line 632: error #20: identifier "uint32_t" is undefined
"C:/ti/TivaWare_C_Series-2.1.4.178/driverlib/sysctl.h", line 635: error #20: identifier "uint32_t" is undefined
"C:/ti/TivaWare_C_Series-2.1.4.178/driverlib/sysctl.h", line 635: error #20: identifier "uint32_t" is undefined
"C:/ti/TivaWare_C_Series-2.1.4.178/driverlib/sysctl.h", line 636: error #20: identifier "uint32_t" is undefined
"C:/ti/TivaWare_C_Series-2.1.4.178/driverlib/sysctl.h", line 637: error #20: identifier "uint32_t" is undefined
"C:/ti/TivaWare_C_Series-2.1.4.178/driverlib/sysctl.h", line 638: error #20: identifier "uint32_t" is undefined
"C:/ti/TivaWare_C_Series-2.1.4.178/driverlib/sysctl.h", line 639: error #20: identifier "uint32_t" is undefined
"C:/ti/TivaWare_C_Series-2.1.4.178/driverlib/sysctl.h", line 639: error #20: identifier "uint32_t" is undefined
"C:/ti/TivaWare_C_Series-2.1.4.178/driverlib/sysctl.h", line 640: error #20: identifier "uint32_t" is undefined
"C:/ti/TivaWare_C_Series-2.1.4.178/driverlib/sysctl.h", line 641: error #20: identifier "uint32_t" is undefined
"C:/ti/TivaWare_C_Series-2.1.4.178/driverlib/sysctl.h", line 642: error #20: identifier "uint32_t" is undefined
"C:/ti/TivaWare_C_Series-2.1.4.178/driverlib/sysctl.h", line 643: error #20: identifier "uint32_t" is undefined
"C:/ti/TivaWare_C_Series-2.1.4.178/driverlib/sysctl.h", line 644: error #20: identifier "uint32_t" is undefined
"C:/ti/TivaWare_C_Series-2.1.4.178/driverlib/sysctl.h", line 645: error #20: identifier "uint32_t" is undefined
"C:/ti/TivaWare_C_Series-2.1.4.178/driverlib/sysctl.h", line 646: error #20: identifier "bool" is undefined
"C:/ti/TivaWare_C_Series-2.1.4.178/driverlib/sysctl.h", line 646: error #20: identifier "uint32_t" is undefined
"C:/ti/TivaWare_C_Series-2.1.4.178/driverlib/sysctl.h", line 646: error #20: identifier "uint32_t" is undefined
"C:/ti/TivaWare_C_Series-2.1.4.178/driverlib/systick.h", line 65: error #20: identifier "uint32_t" is undefined
"C:/ti/TivaWare_C_Series-2.1.4.178/driverlib/systick.h", line 66: error #20: identifier "uint32_t" is undefined
"C:/ti/TivaWare_C_Series-2.1.4.178/driverlib/systick.h", line 67: error #20: identifier "uint32_t" is undefined
"C:/ti/TivaWare_C_Series-2.1.4.178/driverlib/timer.h", line 243: error #20: identifier "uint32_t" is undefined
"C:/ti/TivaWare_C_Series-2.1.4.178/driverlib/timer.h", line 243: error #20: identifier "uint32_t" is undefined
"C:/ti/TivaWare_C_Series-2.1.4.178/driverlib/timer.h", line 244: error #20: identifier "uint32_t" is undefined
"C:/ti/TivaWare_C_Series-2.1.4.178/driverlib/timer.h", line 244: error #20: identifier "uint32_t" is undefined
"C:/ti/TivaWare_C_Series-2.1.4.178/driverlib/timer.h", line 245: error #20: identifier "uint32_t" is undefined
"C:/ti/TivaWare_C_Series-2.1.4.178/driverlib/timer.h", line 245: error #20: identifier "uint32_t" is undefined
"C:/ti/TivaWare_C_Series-2.1.4.178/driverlib/timer.h", line 246: error #20: identifier "uint32_t" is undefined
"C:/ti/TivaWare_C_Series-2.1.4.178/driverlib/timer.h", line 246: error #20: identifier "uint32_t" is undefined
"C:/ti/TivaWare_C_Series-2.1.4.178/driverlib/timer.h", line 246: error #20: identifier "bool" is undefined
"C:/ti/TivaWare_C_Series-2.1.4.178/driverlib/timer.h", line 247: error #20: identifier "uint32_t" is undefined
"C:/ti/TivaWare_C_Series-2.1.4.178/driverlib/timer.h", line 247: error #20: identifier "uint32_t" is undefined
"C:/ti/TivaWare_C_Series-2.1.4.178/driverlib/timer.h", line 247: error #20: identifier "bool" is undefined
"C:/ti/TivaWare_C_Series-2.1.4.178/driverlib/timer.h", line 248: error #20: identifier "uint32_t" is undefined
"C:/ti/TivaWare_C_Series-2.1.4.178/driverlib/timer.h", line 248: error #20: identifier "uint32_t" is undefined
"C:/ti/TivaWare_C_Series-2.1.4.178/driverlib/timer.h", line 248: error #20: identifier "uint32_t" is undefined
"C:/ti/TivaWare_C_Series-2.1.4.178/driverlib/timer.h", line 249: error #20: identifier "uint32_t" is undefined
"C:/ti/TivaWare_C_Series-2.1.4.178/driverlib/timer.h", line 249: error #20: identifier "uint32_t" is undefined
"C:/ti/TivaWare_C_Series-2.1.4.178/driverlib/timer.h", line 249: error #20: identifier "bool" is undefined
"C:/ti/TivaWare_C_Series-2.1.4.178/driverlib/timer.h", line 250: error #20: identifier "uint32_t" is undefined
"C:/ti/TivaWare_C_Series-2.1.4.178/driverlib/timer.h", line 250: error #20: identifier "uint32_t" is undefined
"C:/ti/TivaWare_C_Series-2.1.4.178/driverlib/timer.h", line 250: error #20: identifier "bool" is undefined
"C:/ti/TivaWare_C_Series-2.1.4.178/driverlib/timer.h", line 251: error #20: identifier "uint32_t" is undefined
"C:/ti/TivaWare_C_Series-2.1.4.178/driverlib/timer.h", line 252: error #20: identifier "uint32_t" is undefined
"C:/ti/TivaWare_C_Series-2.1.4.178/driverlib/timer.h", line 253: error #20: identifier "uint32_t" is undefined
"C:/ti/TivaWare_C_Series-2.1.4.178/driverlib/timer.h", line 253: error #20: identifier "uint32_t" is undefined
"C:/ti/TivaWare_C_Series-2.1.4.178/driverlib/timer.h", line 253: error #20: identifier "uint32_t" is undefined
"C:/ti/TivaWare_C_Series-2.1.4.178/driverlib/timer.h", line 254: error #20: identifier "uint32_t" is undefined
"C:/ti/TivaWare_C_Series-2.1.4.178/driverlib/timer.h", line 254: error #20: identifier "uint32_t" is undefined
"C:/ti/TivaWare_C_Series-2.1.4.178/driverlib/timer.h", line 254: error #20: identifier "uint32_t" is undefined
"C:/ti/TivaWare_C_Series-2.1.4.178/driverlib/timer.h", line 255: error #20: identifier "uint32_t" is undefined
"C:/ti/TivaWare_C_Series-2.1.4.178/driverlib/timer.h", line 255: error #20: identifier "uint32_t" is undefined
"C:/ti/TivaWare_C_Series-2.1.4.178/driverlib/timer.h", line 255: error #20: identifier "uint32_t" is undefined
"C:/ti/TivaWare_C_Series-2.1.4.178/driverlib/timer.h", line 256: error #20: identifier "uint32_t" is undefined
Error limit reached.
100 errors detected in the compilation of "../utils.c".
Compilation terminated.
gmake: *** [utils.obj] Error 1
'Building file: "../scale2.c"'
'Invoking: ARM Compiler'
"C:/ti/ccsv7/tools/compiler/arm_4.9.9/bin/cl470" -mv7M4 --code_state=16 --float_support=FPv4SPD16 --abi=eabi -me -O2 -g --include_path="C:/ti/TivaWare_C_Series-2.1.4.178" --include_path="C:/Users/Sai/workspace_v7/ScaleArm" --include_path="C:/Scale/BCS_110" --include_path="C:/ti/ccsv7/tools/compiler/arm_4.9.9/include" --relaxed_ansi --gcc --define=ccs="ccs" --define=PART_TM4C1294NCPDT --define=TARGET_IS_TM4C129_RA1 --diag_warning=225 --display_error_number --preproc_with_compile --preproc_dependency="scale2.d_raw" "../scale2.c"
"../scale2.c", line 225: warning #225-D: function declared implicitly
'Finished building: "../scale2.c"'

'Building file: "../prt_task.c"'
'Invoking: ARM Compiler'
"C:/ti/ccsv7/tools/compiler/arm_4.9.9/bin/cl470" -mv7M4 --code_state=16 --float_support=FPv4SPD16 --abi=eabi -me -O2 -g --include_path="C:/ti/TivaWare_C_Series-2.1.4.178" --include_path="C:/Users/Sai/workspace_v7/ScaleArm" --include_path="C:/Scale/BCS_110" --include_path="C:/ti/ccsv7/tools/compiler/arm_4.9.9/include" --relaxed_ansi --gcc --define=ccs="ccs" --define=PART_TM4C1294NCPDT --define=TARGET_IS_TM4C129_RA1 --diag_warning=225 --display_error_number --preproc_with_compile --preproc_dependency="prt_task.d_raw" "../prt_task.c"
'Finished building: "../prt_task.c"'

'Building file: "../tm4c1294ncpdt_startup_ccs.c"'
'Invoking: ARM Compiler'
"C:/ti/ccsv7/tools/compiler/arm_4.9.9/bin/cl470" -mv7M4 --code_state=16 --float_support=FPv4SPD16 --abi=eabi -me -O2 -g --include_path="C:/ti/TivaWare_C_Series-2.1.4.178" --include_path="C:/Users/Sai/workspace_v7/ScaleArm" --include_path="C:/Scale/BCS_110" --include_path="C:/ti/ccsv7/tools/compiler/arm_4.9.9/include" --relaxed_ansi --gcc --define=ccs="ccs" --define=PART_TM4C1294NCPDT --define=TARGET_IS_TM4C129_RA1 --diag_warning=225 --display_error_number --preproc_with_compile --preproc_dependency="tm4c1294ncpdt_startup_ccs.d_raw" "../tm4c1294ncpdt_startup_ccs.c"
'Finished building: "../tm4c1294ncpdt_startup_ccs.c"'

'Building file: "C:/ti/TivaWare_C_Series-2.1.4.178/driverlib/adc.c"'
'Invoking: ARM Compiler'
"C:/ti/ccsv7/tools/compiler/arm_4.9.9/bin/cl470" -mv7M4 --code_state=16 --float_support=FPv4SPD16 --abi=eabi -me -O2 -g --include_path="C:/ti/TivaWare_C_Series-2.1.4.178" --include_path="C:/Users/Sai/workspace_v7/ScaleArm" --include_path="C:/Scale/BCS_110" --include_path="C:/ti/ccsv7/tools/compiler/arm_4.9.9/include" --relaxed_ansi --gcc --define=ccs="ccs" --define=PART_TM4C1294NCPDT --define=TARGET_IS_TM4C129_RA1 --diag_warning=225 --display_error_number --preproc_with_compile --preproc_dependency="utils/adc.d_raw" --obj_directory="utils" "C:/ti/TivaWare_C_Series-2.1.4.178/driverlib/adc.c"
'Finished building: "C:/ti/TivaWare_C_Series-2.1.4.178/driverlib/adc.c"'

'Building file: "C:/ti/TivaWare_C_Series-2.1.4.178/utils/cmdline.c"'
'Invoking: ARM Compiler'
"C:/ti/ccsv7/tools/compiler/arm_4.9.9/bin/cl470" -mv7M4 --code_state=16 --float_support=FPv4SPD16 --abi=eabi -me -O2 -g --include_path="C:/ti/TivaWare_C_Series-2.1.4.178" --include_path="C:/Users/Sai/workspace_v7/ScaleArm" --include_path="C:/Scale/BCS_110" --include_path="C:/ti/ccsv7/tools/compiler/arm_4.9.9/include" --relaxed_ansi --gcc --define=ccs="ccs" --define=PART_TM4C1294NCPDT --define=TARGET_IS_TM4C129_RA1 --diag_warning=225 --display_error_number --preproc_with_compile --preproc_dependency="utils/cmdline.d_raw" --obj_directory="utils" "C:/ti/TivaWare_C_Series-2.1.4.178/utils/cmdline.c"
'Finished building: "C:/ti/TivaWare_C_Series-2.1.4.178/utils/cmdline.c"'

'Building file: "C:/ti/TivaWare_C_Series-2.1.4.178/driverlib/cpu.c"'
'Invoking: ARM Compiler'
"C:/ti/ccsv7/tools/compiler/arm_4.9.9/bin/cl470" -mv7M4 --code_state=16 --float_support=FPv4SPD16 --abi=eabi -me -O2 -g --include_path="C:/ti/TivaWare_C_Series-2.1.4.178" --include_path="C:/Users/Sai/workspace_v7/ScaleArm" --include_path="C:/Scale/BCS_110" --include_path="C:/ti/ccsv7/tools/compiler/arm_4.9.9/include" --relaxed_ansi --gcc --define=ccs="ccs" --define=PART_TM4C1294NCPDT --define=TARGET_IS_TM4C129_RA1 --diag_warning=225 --display_error_number --preproc_with_compile --preproc_dependency="utils/cpu.d_raw" --obj_directory="utils" "C:/ti/TivaWare_C_Series-2.1.4.178/driverlib/cpu.c"
'Finished building: "C:/ti/TivaWare_C_Series-2.1.4.178/driverlib/cpu.c"'

'Building file: "C:/ti/TivaWare_C_Series-2.1.4.178/driverlib/flash.c"'
'Invoking: ARM Compiler'
"C:/ti/ccsv7/tools/compiler/arm_4.9.9/bin/cl470" -mv7M4 --code_state=16 --float_support=FPv4SPD16 --abi=eabi -me -O2 -g --include_path="C:/ti/TivaWare_C_Series-2.1.4.178" --include_path="C:/Users/Sai/workspace_v7/ScaleArm" --include_path="C:/Scale/BCS_110" --include_path="C:/ti/ccsv7/tools/compiler/arm_4.9.9/include" --relaxed_ansi --gcc --define=ccs="ccs" --define=PART_TM4C1294NCPDT --define=TARGET_IS_TM4C129_RA1 --diag_warning=225 --display_error_number --preproc_with_compile --preproc_dependency="utils/flash.d_raw" --obj_directory="utils" "C:/ti/TivaWare_C_Series-2.1.4.178/driverlib/flash.c"
'Finished building: "C:/ti/TivaWare_C_Series-2.1.4.178/driverlib/flash.c"'

'Building file: "C:/ti/TivaWare_C_Series-2.1.4.178/driverlib/ssi.c"'
'Invoking: ARM Compiler'
"C:/ti/ccsv7/tools/compiler/arm_4.9.9/bin/cl470" -mv7M4 --code_state=16 --float_support=FPv4SPD16 --abi=eabi -me -O2 -g --include_path="C:/ti/TivaWare_C_Series-2.1.4.178" --include_path="C:/Users/Sai/workspace_v7/ScaleArm" --include_path="C:/Scale/BCS_110" --include_path="C:/ti/ccsv7/tools/compiler/arm_4.9.9/include" --relaxed_ansi --gcc --define=ccs="ccs" --define=PART_TM4C1294NCPDT --define=TARGET_IS_TM4C129_RA1 --diag_warning=225 --display_error_number --preproc_with_compile --preproc_dependency="utils/ssi.d_raw" --obj_directory="utils" "C:/ti/TivaWare_C_Series-2.1.4.178/driverlib/ssi.c"
'Finished building: "C:/ti/TivaWare_C_Series-2.1.4.178/driverlib/ssi.c"'

'Building file: "C:/ti/TivaWare_C_Series-2.1.4.178/driverlib/gpio.c"'
'Invoking: ARM Compiler'
"C:/ti/ccsv7/tools/compiler/arm_4.9.9/bin/cl470" -mv7M4 --code_state=16 --float_support=FPv4SPD16 --abi=eabi -me -O2 -g --include_path="C:/ti/TivaWare_C_Series-2.1.4.178" --include_path="C:/Users/Sai/workspace_v7/ScaleArm" --include_path="C:/Scale/BCS_110" --include_path="C:/ti/ccsv7/tools/compiler/arm_4.9.9/include" --relaxed_ansi --gcc --define=ccs="ccs" --define=PART_TM4C1294NCPDT --define=TARGET_IS_TM4C129_RA1 --diag_warning=225 --display_error_number --preproc_with_compile --preproc_dependency="utils/gpio.d_raw" --obj_directory="utils" "C:/ti/TivaWare_C_Series-2.1.4.178/driverlib/gpio.c"
'Finished building: "C:/ti/TivaWare_C_Series-2.1.4.178/driverlib/gpio.c"'

'Building file: "C:/ti/TivaWare_C_Series-2.1.4.178/driverlib/systick.c"'
'Invoking: ARM Compiler'
"C:/ti/ccsv7/tools/compiler/arm_4.9.9/bin/cl470" -mv7M4 --code_state=16 --float_support=FPv4SPD16 --abi=eabi -me -O2 -g --include_path="C:/ti/TivaWare_C_Series-2.1.4.178" --include_path="C:/Users/Sai/workspace_v7/ScaleArm" --include_path="C:/Scale/BCS_110" --include_path="C:/ti/ccsv7/tools/compiler/arm_4.9.9/include" --relaxed_ansi --gcc --define=ccs="ccs" --define=PART_TM4C1294NCPDT --define=TARGET_IS_TM4C129_RA1 --diag_warning=225 --display_error_number --preproc_with_compile --preproc_dependency="utils/systick.d_raw" --obj_directory="utils" "C:/ti/TivaWare_C_Series-2.1.4.178/driverlib/systick.c"
'Finished building: "C:/ti/TivaWare_C_Series-2.1.4.178/driverlib/systick.c"'

'Building file: "C:/ti/TivaWare_C_Series-2.2.0.295/driverlib/sysctl.c"'
'Invoking: ARM Compiler'
"C:/ti/ccsv7/tools/compiler/arm_4.9.9/bin/cl470" -mv7M4 --code_state=16 --float_support=FPv4SPD16 --abi=eabi -me -O2 -g --include_path="C:/ti/TivaWare_C_Series-2.1.4.178" --include_path="C:/Users/Sai/workspace_v7/ScaleArm" --include_path="C:/Scale/BCS_110" --include_path="C:/ti/ccsv7/tools/compiler/arm_4.9.9/include" --relaxed_ansi --gcc --define=ccs="ccs" --define=PART_TM4C1294NCPDT --define=TARGET_IS_TM4C129_RA1 --diag_warning=225 --display_error_number --preproc_with_compile --preproc_dependency="utils/sysctl.d_raw" --obj_directory="utils" "C:/ti/TivaWare_C_Series-2.2.0.295/driverlib/sysctl.c"
'Finished building: "C:/ti/TivaWare_C_Series-2.2.0.295/driverlib/sysctl.c"'

'Building file: "C:/ti/TivaWare_C_Series-2.1.4.178/driverlib/uart.c"'
'Invoking: ARM Compiler'
"C:/ti/ccsv7/tools/compiler/arm_4.9.9/bin/cl470" -mv7M4 --code_state=16 --float_support=FPv4SPD16 --abi=eabi -me -O2 -g --include_path="C:/ti/TivaWare_C_Series-2.1.4.178" --include_path="C:/Users/Sai/workspace_v7/ScaleArm" --include_path="C:/Scale/BCS_110" --include_path="C:/ti/ccsv7/tools/compiler/arm_4.9.9/include" --relaxed_ansi --gcc --define=ccs="ccs" --define=PART_TM4C1294NCPDT --define=TARGET_IS_TM4C129_RA1 --diag_warning=225 --display_error_number --preproc_with_compile --preproc_dependency="utils/uart.d_raw" --obj_directory="utils" "C:/ti/TivaWare_C_Series-2.1.4.178/driverlib/uart.c"
'Finished building: "C:/ti/TivaWare_C_Series-2.1.4.178/driverlib/uart.c"'

'Building file: "C:/ti/TivaWare_C_Series-2.2.0.295/driverlib/timer.c"'
'Invoking: ARM Compiler'
"C:/ti/ccsv7/tools/compiler/arm_4.9.9/bin/cl470" -mv7M4 --code_state=16 --float_support=FPv4SPD16 --abi=eabi -me -O2 -g --include_path="C:/ti/TivaWare_C_Series-2.1.4.178" --include_path="C:/Users/Sai/workspace_v7/ScaleArm" --include_path="C:/Scale/BCS_110" --include_path="C:/ti/ccsv7/tools/compiler/arm_4.9.9/include" --relaxed_ansi --gcc --define=ccs="ccs" --define=PART_TM4C1294NCPDT --define=TARGET_IS_TM4C129_RA1 --diag_warning=225 --display_error_number --preproc_with_compile --preproc_dependency="utils/timer.d_raw" --obj_directory="utils" "C:/ti/TivaWare_C_Series-2.2.0.295/driverlib/timer.c"
'Finished building: "C:/ti/TivaWare_C_Series-2.2.0.295/driverlib/timer.c"'

'Building file: "C:/ti/TivaWare_C_Series-2.1.4.178/utils/uartstdio.c"'
'Invoking: ARM Compiler'
"C:/ti/ccsv7/tools/compiler/arm_4.9.9/bin/cl470" -mv7M4 --code_state=16 --float_support=FPv4SPD16 --abi=eabi -me -O2 -g --include_path="C:/ti/TivaWare_C_Series-2.1.4.178" --include_path="C:/Users/Sai/workspace_v7/ScaleArm" --include_path="C:/Scale/BCS_110" --include_path="C:/ti/ccsv7/tools/compiler/arm_4.9.9/include" --relaxed_ansi --gcc --define=ccs="ccs" --define=PART_TM4C1294NCPDT --define=TARGET_IS_TM4C129_RA1 --diag_warning=225 --display_error_number --preproc_with_compile --preproc_dependency="utils/uartstdio.d_raw" --obj_directory="utils" "C:/ti/TivaWare_C_Series-2.1.4.178/utils/uartstdio.c"
'Finished building: "C:/ti/TivaWare_C_Series-2.1.4.178/utils/uartstdio.c"'

'Building file: "C:/ti/TivaWare_C_Series-2.1.4.178/utils/ustdlib.c"'
'Invoking: ARM Compiler'
"C:/ti/ccsv7/tools/compiler/arm_4.9.9/bin/cl470" -mv7M4 --code_state=16 --float_support=FPv4SPD16 --abi=eabi -me -O2 -g --include_path="C:/ti/TivaWare_C_Series-2.1.4.178" --include_path="C:/Users/Sai/workspace_v7/ScaleArm" --include_path="C:/Scale/BCS_110" --include_path="C:/ti/ccsv7/tools/compiler/arm_4.9.9/include" --relaxed_ansi --gcc --define=ccs="ccs" --define=PART_TM4C1294NCPDT --define=TARGET_IS_TM4C129_RA1 --diag_warning=225 --display_error_number --preproc_with_compile --preproc_dependency="utils/ustdlib.d_raw" --obj_directory="utils" "C:/ti/TivaWare_C_Series-2.1.4.178/utils/ustdlib.c"
'Finished building: "C:/ti/TivaWare_C_Series-2.1.4.178/utils/ustdlib.c"'

gmake: Target 'all' not remade because of errors.

**** Build Finished ****

Thanks,

Sai

  • HI,

      There are many examples in the TivaWare library? Can you try to build one of the examples? I will suggest you start with the hello or the blinky.examples. You can find them under C:\ti\TivaWare_C_Series-2.2.0.295\examples\boards\ek-tm4c1294xl. Import the example into your workspace in CCS first. Do you have any problem compiling these examples? If they are compiled successfully then you can copy your own application files over these example projects and rebuild your application.

      

  • Hi Charles, 

    I have tried the wat you have suggested me. Examples projects are compiles well and generating binary file. However, I used the example project and replaced with my source files but it still shows all the errors. Please let me know. 

    "C:/ti/TivaWare_C_Series-2.1.4.178/driverlib/systick.h", line 65: error #20: identifier "uint32_t" is undefined
    "C:/ti/TivaWare_C_Series-2.1.4.178/driverlib/systick.h", line 66: error #20: identifier "uint32_t" is undefined
    "C:/ti/TivaWare_C_Series-2.1.4.178/driverlib/systick.h", line 67: error #20: identifier "uint32_t" is undefined
    "C:/ti/TivaWare_C_Series-2.1.4.178/driverlib/timer.h", line 243: error #20: identifier "uint32_t" is undefined
    "C:/ti/TivaWare_C_Series-2.1.4.178/driverlib/timer.h", line 243: error #20: identifier "uint32_t" is undefined
    "C:/ti/TivaWare_C_Series-2.1.4.178/driverlib/timer.h", line 244: error #20: identifier "uint32_t" is undefined
    "C:/ti/TivaWare_C_Series-2.1.4.178/driverlib/timer.h", line 244: error #20: identifier "uint32_t" is undefined
    "C:/ti/TivaWare_C_Series-2.1.4.178/driverlib/timer.h", line 245: error #20: identifier "uint32_t" is undefined
    "C:/ti/TivaWare_C_Series-2.1.4.178/driverlib/timer.h", line 245: error #20: identifier "uint32_t" is undefined
    "C:/ti/TivaWare_C_Series-2.1.4.178/driverlib/timer.h", line 246: error #20: identifier "uint32_t" is undefined
    "C:/ti/TivaWare_C_Series-2.1.4.178/driverlib/timer.h", line 246: error #20: identifier "uint32_t" is undefined
    "C:/ti/TivaWare_C_Series-2.1.4.178/driverlib/timer.h", line 246: error #20: identifier "bool" is undefined
    "C:/ti/TivaWare_C_Series-2.1.4.178/driverlib/timer.h", line 247: error #20: identifier "uint32_t" is undefined
    "C:/ti/TivaWare_C_Series-2.1.4.178/driverlib/timer.h", line 247: error #20: identifier "uint32_t" is undefined
    "C:/ti/TivaWare_C_Series-2.1.4.178/driverlib/timer.h", line 247: error #20: identifier "bool" is undefined
    "C:/ti/TivaWare_C_Series-2.1.4.178/driverlib/timer.h", line 248: error #20: identifier "uint32_t" is undefined
    "C:/ti/TivaWare_C_Series-2.1.4.178/driverlib/timer.h", line 248: error #20: identifier "uint32_t" is undefined
    "C:/ti/TivaWare_C_Series-2.1.4.178/driverlib/timer.h", line 248: error #20: identifier "uint32_t" is undefined
    "C:/ti/TivaWare_C_Series-2.1.4.178/driverlib/timer.h", line 249: error #20: identifier "uint32_t" is undefined
    "C:/ti/TivaWare_C_Series-2.1.4.178/driverlib/timer.h", line 249: error #20: identifier "uint32_t" is undefined
    "C:/ti/TivaWare_C_Series-2.1.4.178/driverlib/timer.h", line 249: error #20: identifier "bool" is undefined
    "C:/ti/TivaWare_C_Series-2.1.4.178/driverlib/timer.h", line 250: error #20: identifier "uint32_t" is undefined
    "C:/ti/TivaWare_C_Series-2.1.4.178/driverlib/timer.h", line 250: error #20: identifier "uint32_t" is undefined
    "C:/ti/TivaWare_C_Series-2.1.4.178/driverlib/timer.h", line 250: error #20: identifier "bool" is undefined
    "C:/ti/TivaWare_C_Series-2.1.4.178/driverlib/timer.h", line 251: error #20: identifier "uint32_t" is undefined
    "C:/ti/TivaWare_C_Series-2.1.4.178/driverlib/timer.h", line 252: error #20: identifier "uint32_t" is undefined
    "C:/ti/TivaWare_C_Series-2.1.4.178/driverlib/timer.h", line 253: error #20: identifier "uint32_t" is undefined
    "C:/ti/TivaWare_C_Series-2.1.4.178/driverlib/timer.h", line 253: error #20: identifier "uint32_t" is undefined
    "C:/ti/TivaWare_C_Series-2.1.4.178/driverlib/timer.h", line 253: error #20: identifier "uint32_t" is undefined
    "C:/ti/TivaWare_C_Series-2.1.4.178/driverlib/timer.h", line 254: error #20: identifier "uint32_t" is undefined
    "C:/ti/TivaWare_C_Series-2.1.4.178/driverlib/timer.h", line 254: error #20: identifier "uint32_t" is undefined
    "C:/ti/TivaWare_C_Series-2.1.4.178/driverlib/timer.h", line 254: error #20: identifier "uint32_t" is undefined
    "C:/ti/TivaWare_C_Series-2.1.4.178/driverlib/timer.h", line 255: error #20: identifier "uint32_t" is undefined
    "C:/ti/TivaWare_C_Series-2.1.4.178/driverlib/timer.h", line 255: error #20: identifier "uint32_t" is undefined
    "C:/ti/TivaWare_C_Series-2.1.4.178/driverlib/timer.h", line 255: error #20: identifier "uint32_t" is undefined
    "C:/ti/TivaWare_C_Series-2.1.4.178/driverlib/timer.h", line 256: error #20: identifier "uint32_t" is undefined
    Error limit reached.
    100 errors detected in the compilation of "../led_task.c".
    Compilation terminated.
    gmake: *** [led_task.obj] Error 1
    'Building file: "../prt_task.c"'
    'Invoking: ARM Compiler'
    "C:/ti/ccsv7/tools/compiler/ti-cgt-arm_16.9.6.LTS/bin/armcl" -mv7M4 --code_state=16 --float_support=FPv4SPD16 --abi=eabi -me -O2 --include_path="C:/ti/ccsv7/tools/compiler/ti-cgt-arm_16.9.6.LTS/include" --include_path="C:/Scale/BCS_110" --include_path="C:/ti/TivaWare_C_Series-2.1.4.178/examples/boards/ek-tm4c1294xl" --include_path="C:/ti/TivaWare_C_Series-2.1.4.178" --advice:power=all -g --gcc --define=ccs="ccs" --define=PART_TM4C1294NCPDT --define=TARGET_IS_TM4C129_RA0 --diag_warning=225 --diag_wrap=off --display_error_number --gen_func_subsections=on --ual --preproc_with_compile --preproc_dependency="prt_task.d_raw" "../prt_task.c"
    "../prt_task.c", line 46 (col. 10): remark #1531-D: (ULP 5.2) Detected floating point operation(s). Recommend moving them to RAM during run time or not using as these are processing/power intensive
    'Finished building: "../prt_task.c"'

    'Building file: "../sample_task.c"'
    'Invoking: ARM Compiler'
    "C:/ti/ccsv7/tools/compiler/ti-cgt-arm_16.9.6.LTS/bin/armcl" -mv7M4 --code_state=16 --float_support=FPv4SPD16 --abi=eabi -me -O2 --include_path="C:/ti/ccsv7/tools/compiler/ti-cgt-arm_16.9.6.LTS/include" --include_path="C:/Scale/BCS_110" --include_path="C:/ti/TivaWare_C_Series-2.1.4.178/examples/boards/ek-tm4c1294xl" --include_path="C:/ti/TivaWare_C_Series-2.1.4.178" --advice:power=all -g --gcc --define=ccs="ccs" --define=PART_TM4C1294NCPDT --define=TARGET_IS_TM4C129_RA0 --diag_warning=225 --diag_wrap=off --display_error_number --gen_func_subsections=on --ual --preproc_with_compile --preproc_dependency="sample_task.d_raw" "../sample_task.c"

    >> Compilation failure
    subdir_rules.mk:51: recipe for target 'sample_task.obj' failed
    "C:/ti/TivaWare_C_Series-2.1.4.178/driverlib/sysctl.h", line 583: error #20: identifier "uint32_t" is undefined
    "C:/ti/TivaWare_C_Series-2.1.4.178/driverlib/sysctl.h", line 584: error #20: identifier "uint32_t" is undefined
    "C:/ti/TivaWare_C_Series-2.1.4.178/driverlib/sysctl.h", line 585: error #20: identifier "uint32_t" is undefined
    "C:/ti/TivaWare_C_Series-2.1.4.178/driverlib/sysctl.h", line 586: error #20: identifier "bool" is undefined
    "C:/ti/TivaWare_C_Series-2.1.4.178/driverlib/sysctl.h", line 586: error #20: identifier "uint32_t" is undefined
    "C:/ti/TivaWare_C_Series-2.1.4.178/driverlib/sysctl.h", line 587: error #20: identifier "bool" is undefined
    "C:/ti/TivaWare_C_Series-2.1.4.178/driverlib/sysctl.h", line 587: error #20: identifier "uint32_t" is undefined
    "C:/ti/TivaWare_C_Series-2.1.4.178/driverlib/sysctl.h", line 588: error #20: identifier "uint32_t" is undefined
    "C:/ti/TivaWare_C_Series-2.1.4.178/driverlib/sysctl.h", line 589: error #20: identifier "uint32_t" is undefined
    "C:/ti/TivaWare_C_Series-2.1.4.178/driverlib/sysctl.h", line 590: error #20: identifier "uint32_t" is undefined
    "C:/ti/TivaWare_C_Series-2.1.4.178/driverlib/sysctl.h", line 591: error #20: identifier "uint32_t" is undefined
    "C:/ti/TivaWare_C_Series-2.1.4.178/driverlib/sysctl.h", line 592: error #20: identifier "uint32_t" is undefined
    "C:/ti/TivaWare_C_Series-2.1.4.178/driverlib/sysctl.h", line 593: error #20: identifier "uint32_t" is undefined
    "C:/ti/TivaWare_C_Series-2.1.4.178/driverlib/sysctl.h", line 594: error #20: identifier "uint32_t" is undefined
    "C:/ti/TivaWare_C_Series-2.1.4.178/driverlib/sysctl.h", line 595: error #20: identifier "uint32_t" is undefined
    "C:/ti/TivaWare_C_Series-2.1.4.178/driverlib/sysctl.h", line 596: error #20: identifier "uint32_t" is undefined
    "C:/ti/TivaWare_C_Series-2.1.4.178/driverlib/sysctl.h", line 597: error #20: identifier "bool" is undefined
    "C:/ti/TivaWare_C_Series-2.1.4.178/driverlib/sysctl.h", line 600: error #20: identifier "uint32_t" is undefined
    "C:/ti/TivaWare_C_Series-2.1.4.178/driverlib/sysctl.h", line 601: error #20: identifier "uint32_t" is undefined
    "C:/ti/TivaWare_C_Series-2.1.4.178/driverlib/sysctl.h", line 602: error #20: identifier "uint32_t" is undefined
    "C:/ti/TivaWare_C_Series-2.1.4.178/driverlib/sysctl.h", line 603: error #20: identifier "uint32_t" is undefined
    "C:/ti/TivaWare_C_Series-2.1.4.178/driverlib/sysctl.h", line 603: error #20: identifier "bool" is undefined
    "C:/ti/TivaWare_C_Series-2.1.4.178/driverlib/sysctl.h", line 604: error #20: identifier "uint32_t" is undefined
    "C:/ti/TivaWare_C_Series-2.1.4.178/driverlib/sysctl.h", line 605: error #20: identifier "uint32_t" is undefined
    "C:/ti/TivaWare_C_Series-2.1.4.178/driverlib/sysctl.h", line 606: error #20: identifier "uint32_t" is undefined
    "C:/ti/TivaWare_C_Series-2.1.4.178/driverlib/sysctl.h", line 607: error #20: identifier "uint32_t" is undefined
    "C:/ti/TivaWare_C_Series-2.1.4.178/driverlib/sysctl.h", line 608: error #20: identifier "uint32_t" is undefined
    "C:/ti/TivaWare_C_Series-2.1.4.178/driverlib/sysctl.h", line 609: error #20: identifier "uint32_t" is undefined
    "C:/ti/TivaWare_C_Series-2.1.4.178/driverlib/sysctl.h", line 613: error #20: identifier "uint32_t" is undefined
    "C:/ti/TivaWare_C_Series-2.1.4.178/driverlib/sysctl.h", line 614: error #20: identifier "uint32_t" is undefined
    "C:/ti/TivaWare_C_Series-2.1.4.178/driverlib/sysctl.h", line 615: error #20: identifier "uint32_t" is undefined
    "C:/ti/TivaWare_C_Series-2.1.4.178/driverlib/sysctl.h", line 616: error #20: identifier "uint32_t" is undefined
    "C:/ti/TivaWare_C_Series-2.1.4.178/driverlib/sysctl.h", line 617: error #20: identifier "uint32_t" is undefined
    "C:/ti/TivaWare_C_Series-2.1.4.178/driverlib/sysctl.h", line 618: error #20: identifier "uint32_t" is undefined
    "C:/ti/TivaWare_C_Series-2.1.4.178/driverlib/sysctl.h", line 619: error #20: identifier "uint32_t" is undefined
    "C:/ti/TivaWare_C_Series-2.1.4.178/driverlib/sysctl.h", line 619: error #20: identifier "uint32_t" is undefined
    "C:/ti/TivaWare_C_Series-2.1.4.178/driverlib/sysctl.h", line 620: error #20: identifier "uint32_t" is undefined
    "C:/ti/TivaWare_C_Series-2.1.4.178/driverlib/sysctl.h", line 621: error #20: identifier "uint32_t" is undefined
    "C:/ti/TivaWare_C_Series-2.1.4.178/driverlib/sysctl.h", line 622: error #20: identifier "uint32_t" is undefined
    "C:/ti/TivaWare_C_Series-2.1.4.178/driverlib/sysctl.h", line 623: error #20: identifier "uint32_t" is undefined
    "C:/ti/TivaWare_C_Series-2.1.4.178/driverlib/sysctl.h", line 624: error #20: identifier "uint32_t" is undefined
    "C:/ti/TivaWare_C_Series-2.1.4.178/driverlib/sysctl.h", line 625: error #20: identifier "uint32_t" is undefined
    "C:/ti/TivaWare_C_Series-2.1.4.178/driverlib/sysctl.h", line 626: error #20: identifier "uint32_t" is undefined
    "C:/ti/TivaWare_C_Series-2.1.4.178/driverlib/sysctl.h", line 627: error #20: identifier "bool" is undefined
    "C:/ti/TivaWare_C_Series-2.1.4.178/driverlib/sysctl.h", line 628: error #20: identifier "bool" is undefined
    "C:/ti/TivaWare_C_Series-2.1.4.178/driverlib/sysctl.h", line 629: error #20: identifier "bool" is undefined
    "C:/ti/TivaWare_C_Series-2.1.4.178/driverlib/sysctl.h", line 631: error #20: identifier "uint32_t" is undefined
    "C:/ti/TivaWare_C_Series-2.1.4.178/driverlib/sysctl.h", line 632: error #20: identifier "uint32_t" is undefined
    "C:/ti/TivaWare_C_Series-2.1.4.178/driverlib/sysctl.h", line 635: error #20: identifier "uint32_t" is undefined
    "C:/ti/TivaWare_C_Series-2.1.4.178/driverlib/sysctl.h", line 635: error #20: identifier "uint32_t" is undefined
    "C:/ti/TivaWare_C_Series-2.1.4.178/driverlib/sysctl.h", line 636: error #20: identifier "uint32_t" is undefined
    "C:/ti/TivaWare_C_Series-2.1.4.178/driverlib/sysctl.h", line 637: error #20: identifier "uint32_t" is undefined
    "C:/ti/TivaWare_C_Series-2.1.4.178/driverlib/sysctl.h", line 638: error #20: identifier "uint32_t" is undefined
    "C:/ti/TivaWare_C_Series-2.1.4.178/driverlib/sysctl.h", line 639: error #20: identifier "uint32_t" is undefined
    "C:/ti/TivaWare_C_Series-2.1.4.178/driverlib/sysctl.h", line 639: error #20: identifier "uint32_t" is undefined
    "C:/ti/TivaWare_C_Series-2.1.4.178/driverlib/sysctl.h", line 640: error #20: identifier "uint32_t" is undefined
    "C:/ti/TivaWare_C_Series-2.1.4.178/driverlib/sysctl.h", line 641: error #20: identifier "uint32_t" is undefined
    "C:/ti/TivaWare_C_Series-2.1.4.178/driverlib/sysctl.h", line 642: error #20: identifier "uint32_t" is undefined
    "C:/ti/TivaWare_C_Series-2.1.4.178/driverlib/sysctl.h", line 643: error #20: identifier "uint32_t" is undefined
    "C:/ti/TivaWare_C_Series-2.1.4.178/driverlib/sysctl.h", line 644: error #20: identifier "uint32_t" is undefined
    "C:/ti/TivaWare_C_Series-2.1.4.178/driverlib/sysctl.h", line 645: error #20: identifier "uint32_t" is undefined
    "C:/ti/TivaWare_C_Series-2.1.4.178/driverlib/sysctl.h", line 646: error #20: identifier "bool" is undefined
    "C:/ti/TivaWare_C_Series-2.1.4.178/driverlib/sysctl.h", line 646: error #20: identifier "uint32_t" is undefined
    "C:/ti/TivaWare_C_Series-2.1.4.178/driverlib/sysctl.h", line 646: error #20: identifier "uint32_t" is undefined
    "C:/ti/TivaWare_C_Series-2.1.4.178/driverlib/systick.h", line 65: error #20: identifier "uint32_t" is undefined
    "C:/ti/TivaWare_C_Series-2.1.4.178/driverlib/systick.h", line 66: error #20: identifier "uint32_t" is undefined
    "C:/ti/TivaWare_C_Series-2.1.4.178/driverlib/systick.h", line 67: error #20: identifier "uint32_t" is undefined
    "C:/ti/TivaWare_C_Series-2.1.4.178/driverlib/timer.h", line 243: error #20: identifier "uint32_t" is undefined
    "C:/ti/TivaWare_C_Series-2.1.4.178/driverlib/timer.h", line 243: error #20: identifier "uint32_t" is undefined
    "C:/ti/TivaWare_C_Series-2.1.4.178/driverlib/timer.h", line 244: error #20: identifier "uint32_t" is undefined
    "C:/ti/TivaWare_C_Series-2.1.4.178/driverlib/timer.h", line 244: error #20: identifier "uint32_t" is undefined
    "C:/ti/TivaWare_C_Series-2.1.4.178/driverlib/timer.h", line 245: error #20: identifier "uint32_t" is undefined
    "C:/ti/TivaWare_C_Series-2.1.4.178/driverlib/timer.h", line 245: error #20: identifier "uint32_t" is undefined
    "C:/ti/TivaWare_C_Series-2.1.4.178/driverlib/timer.h", line 246: error #20: identifier "uint32_t" is undefined
    "C:/ti/TivaWare_C_Series-2.1.4.178/driverlib/timer.h", line 246: error #20: identifier "uint32_t" is undefined
    "C:/ti/TivaWare_C_Series-2.1.4.178/driverlib/timer.h", line 246: error #20: identifier "bool" is undefined
    "C:/ti/TivaWare_C_Series-2.1.4.178/driverlib/timer.h", line 247: error #20: identifier "uint32_t" is undefined
    "C:/ti/TivaWare_C_Series-2.1.4.178/driverlib/timer.h", line 247: error #20: identifier "uint32_t" is undefined
    "C:/ti/TivaWare_C_Series-2.1.4.178/driverlib/timer.h", line 247: error #20: identifier "bool" is undefined
    "C:/ti/TivaWare_C_Series-2.1.4.178/driverlib/timer.h", line 248: error #20: identifier "uint32_t" is undefined
    "C:/ti/TivaWare_C_Series-2.1.4.178/driverlib/timer.h", line 248: error #20: identifier "uint32_t" is undefined
    "C:/ti/TivaWare_C_Series-2.1.4.178/driverlib/timer.h", line 248: error #20: identifier "uint32_t" is undefined
    "C:/ti/TivaWare_C_Series-2.1.4.178/driverlib/timer.h", line 249: error #20: identifier "uint32_t" is undefined
    "C:/ti/TivaWare_C_Series-2.1.4.178/driverlib/timer.h", line 249: error #20: identifier "uint32_t" is undefined
    "C:/ti/TivaWare_C_Series-2.1.4.178/driverlib/timer.h", line 249: error #20: identifier "bool" is undefined
    "C:/ti/TivaWare_C_Series-2.1.4.178/driverlib/timer.h", line 250: error #20: identifier "uint32_t" is undefined
    "C:/ti/TivaWare_C_Series-2.1.4.178/driverlib/timer.h", line 250: error #20: identifier "uint32_t" is undefined
    "C:/ti/TivaWare_C_Series-2.1.4.178/driverlib/timer.h", line 250: error #20: identifier "bool" is undefined
    "C:/ti/TivaWare_C_Series-2.1.4.178/driverlib/timer.h", line 251: error #20: identifier "uint32_t" is undefined
    "C:/ti/TivaWare_C_Series-2.1.4.178/driverlib/timer.h", line 252: error #20: identifier "uint32_t" is undefined
    "C:/ti/TivaWare_C_Series-2.1.4.178/driverlib/timer.h", line 253: error #20: identifier "uint32_t" is undefined
    "C:/ti/TivaWare_C_Series-2.1.4.178/driverlib/timer.h", line 253: error #20: identifier "uint32_t" is undefined
    "C:/ti/TivaWare_C_Series-2.1.4.178/driverlib/timer.h", line 253: error #20: identifier "uint32_t" is undefined
    "C:/ti/TivaWare_C_Series-2.1.4.178/driverlib/timer.h", line 254: error #20: identifier "uint32_t" is undefined
    "C:/ti/TivaWare_C_Series-2.1.4.178/driverlib/timer.h", line 254: error #20: identifier "uint32_t" is undefined
    "C:/ti/TivaWare_C_Series-2.1.4.178/driverlib/timer.h", line 254: error #20: identifier "uint32_t" is undefined
    "C:/ti/TivaWare_C_Series-2.1.4.178/driverlib/timer.h", line 255: error #20: identifier "uint32_t" is undefined
    "C:/ti/TivaWare_C_Series-2.1.4.178/driverlib/timer.h", line 255: error #20: identifier "uint32_t" is undefined
    "C:/ti/TivaWare_C_Series-2.1.4.178/driverlib/timer.h", line 255: error #20: identifier "uint32_t" is undefined
    "C:/ti/TivaWare_C_Series-2.1.4.178/driverlib/timer.h", line 256: error #20: identifier "uint32_t" is undefined
    Error limit reached.
    100 errors detected in the compilation of "../sample_task.c".
    Compilation terminated.
    gmake: *** [sample_task.obj] Error 1
    'Building file: "../scale2.c"'
    'Invoking: ARM Compiler'
    "C:/ti/ccsv7/tools/compiler/ti-cgt-arm_16.9.6.LTS/bin/armcl" -mv7M4 --code_state=16 --float_support=FPv4SPD16 --abi=eabi -me -O2 --include_path="C:/ti/ccsv7/tools/compiler/ti-cgt-arm_16.9.6.LTS/include" --include_path="C:/Scale/BCS_110" --include_path="C:/ti/TivaWare_C_Series-2.1.4.178/examples/boards/ek-tm4c1294xl" --include_path="C:/ti/TivaWare_C_Series-2.1.4.178" --advice:power=all -g --gcc --define=ccs="ccs" --define=PART_TM4C1294NCPDT --define=TARGET_IS_TM4C129_RA0 --diag_warning=225 --diag_wrap=off --display_error_number --gen_func_subsections=on --ual --preproc_with_compile --preproc_dependency="scale2.d_raw" "../scale2.c"
    "../scale2.c", line 133: remark #2623-D: (ULP 5.4) Detected an assignment to a type with size less than int. To avoid unnecessary sign extension, use int-sized types for local varaibles and convert to smaller types for static storage.
    "../scale2.c", line 140: remark #1542-D: (ULP 12.1) Detected memcpy() and recommend using DMA instead if greater than 100 words being transferred
    "../scale2.c", line 225: warning #225-D: function "UARTStdioInit" declared implicitly
    "../scale2.c", line 262: remark #1527-D: (ULP 2.1) Detected SW delay loop using empty loop. Recommend using a timer module instead
    "../scale2.c", line 22: remark #1534-D: (ULP 7.1) Detected use of global variable "ohmBptr" within one function "UART2IntHandler". Recommend placing variable in the function locally
    'Finished building: "../scale2.c"'

    'Building file: "../state.c"'
    'Invoking: ARM Compiler'
    "C:/ti/ccsv7/tools/compiler/ti-cgt-arm_16.9.6.LTS/bin/armcl" -mv7M4 --code_state=16 --float_support=FPv4SPD16 --abi=eabi -me -O2 --include_path="C:/ti/ccsv7/tools/compiler/ti-cgt-arm_16.9.6.LTS/include" --include_path="C:/Scale/BCS_110" --include_path="C:/ti/TivaWare_C_Series-2.1.4.178/examples/boards/ek-tm4c1294xl" --include_path="C:/ti/TivaWare_C_Series-2.1.4.178" --advice:power=all -g --gcc --define=ccs="ccs" --define=PART_TM4C1294NCPDT --define=TARGET_IS_TM4C129_RA0 --diag_warning=225 --diag_wrap=off --display_error_number --gen_func_subsections=on --ual --preproc_with_compile --preproc_dependency="state.d_raw" "../state.c"

    >> Compilation failure
    subdir_rules.mk:65: recipe for target 'state.obj' failed
    "C:/ti/TivaWare_C_Series-2.1.4.178/driverlib/sysctl.h", line 583: error #20: identifier "uint32_t" is undefined
    "C:/ti/TivaWare_C_Series-2.1.4.178/driverlib/sysctl.h", line 584: error #20: identifier "uint32_t" is undefined
    "C:/ti/TivaWare_C_Series-2.1.4.178/driverlib/sysctl.h", line 585: error #20: identifier "uint32_t" is undefined
    "C:/ti/TivaWare_C_Series-2.1.4.178/driverlib/sysctl.h", line 586: error #20: identifier "bool" is undefined
    "C:/ti/TivaWare_C_Series-2.1.4.178/driverlib/sysctl.h", line 586: error #20: identifier "uint32_t" is undefined
    "C:/ti/TivaWare_C_Series-2.1.4.178/driverlib/sysctl.h", line 587: error #20: identifier "bool" is undefined
    "C:/ti/TivaWare_C_Series-2.1.4.178/driverlib/sysctl.h", line 587: error #20: identifier "uint32_t" is undefined
    "C:/ti/TivaWare_C_Series-2.1.4.178/driverlib/sysctl.h", line 588: error #20: identifier "uint32_t" is undefined
    "C:/ti/TivaWare_C_Series-2.1.4.178/driverlib/sysctl.h", line 589: error #20: identifier "uint32_t" is undefined
    "C:/ti/TivaWare_C_Series-2.1.4.178/driverlib/sysctl.h", line 590: error #20: identifier "uint32_t" is undefined
    "C:/ti/TivaWare_C_Series-2.1.4.178/driverlib/sysctl.h", line 591: error #20: identifier "uint32_t" is undefined
    "C:/ti/TivaWare_C_Series-2.1.4.178/driverlib/sysctl.h", line 592: error #20: identifier "uint32_t" is undefined
    "C:/ti/TivaWare_C_Series-2.1.4.178/driverlib/sysctl.h", line 593: error #20: identifier "uint32_t" is undefined
    "C:/ti/TivaWare_C_Series-2.1.4.178/driverlib/sysctl.h", line 594: error #20: identifier "uint32_t" is undefined
    "C:/ti/TivaWare_C_Series-2.1.4.178/driverlib/sysctl.h", line 595: error #20: identifier "uint32_t" is undefined
    "C:/ti/TivaWare_C_Series-2.1.4.178/driverlib/sysctl.h", line 596: error #20: identifier "uint32_t" is undefined
    "C:/ti/TivaWare_C_Series-2.1.4.178/driverlib/sysctl.h", line 597: error #20: identifier "bool" is undefined
    "C:/ti/TivaWare_C_Series-2.1.4.178/driverlib/sysctl.h", line 600: error #20: identifier "uint32_t" is undefined
    "C:/ti/TivaWare_C_Series-2.1.4.178/driverlib/sysctl.h", line 601: error #20: identifier "uint32_t" is undefined
    "C:/ti/TivaWare_C_Series-2.1.4.178/driverlib/sysctl.h", line 602: error #20: identifier "uint32_t" is undefined
    "C:/ti/TivaWare_C_Series-2.1.4.178/driverlib/sysctl.h", line 603: error #20: identifier "uint32_t" is undefined
    "C:/ti/TivaWare_C_Series-2.1.4.178/driverlib/sysctl.h", line 603: error #20: identifier "bool" is undefined
    "C:/ti/TivaWare_C_Series-2.1.4.178/driverlib/sysctl.h", line 604: error #20: identifier "uint32_t" is undefined
    "C:/ti/TivaWare_C_Series-2.1.4.178/driverlib/sysctl.h", line 605: error #20: identifier "uint32_t" is undefined
    "C:/ti/TivaWare_C_Series-2.1.4.178/driverlib/sysctl.h", line 606: error #20: identifier "uint32_t" is undefined
    "C:/ti/TivaWare_C_Series-2.1.4.178/driverlib/sysctl.h", line 607: error #20: identifier "uint32_t" is undefined
    "C:/ti/TivaWare_C_Series-2.1.4.178/driverlib/sysctl.h", line 608: error #20: identifier "uint32_t" is undefined
    "C:/ti/TivaWare_C_Series-2.1.4.178/driverlib/sysctl.h", line 609: error #20: identifier "uint32_t" is undefined
    "C:/ti/TivaWare_C_Series-2.1.4.178/driverlib/sysctl.h", line 613: error #20: identifier "uint32_t" is undefined
    "C:/ti/TivaWare_C_Series-2.1.4.178/driverlib/sysctl.h", line 614: error #20: identifier "uint32_t" is undefined
    "C:/ti/TivaWare_C_Series-2.1.4.178/driverlib/sysctl.h", line 615: error #20: identifier "uint32_t" is undefined
    "C:/ti/TivaWare_C_Series-2.1.4.178/driverlib/sysctl.h", line 616: error #20: identifier "uint32_t" is undefined
    "C:/ti/TivaWare_C_Series-2.1.4.178/driverlib/sysctl.h", line 617: error #20: identifier "uint32_t" is undefined
    "C:/ti/TivaWare_C_Series-2.1.4.178/driverlib/sysctl.h", line 618: error #20: identifier "uint32_t" is undefined
    "C:/ti/TivaWare_C_Series-2.1.4.178/driverlib/sysctl.h", line 619: error #20: identifier "uint32_t" is undefined
    "C:/ti/TivaWare_C_Series-2.1.4.178/driverlib/sysctl.h", line 619: error #20: identifier "uint32_t" is undefined
    "C:/ti/TivaWare_C_Series-2.1.4.178/driverlib/sysctl.h", line 620: error #20: identifier "uint32_t" is undefined
    "C:/ti/TivaWare_C_Series-2.1.4.178/driverlib/sysctl.h", line 621: error #20: identifier "uint32_t" is undefined
    "C:/ti/TivaWare_C_Series-2.1.4.178/driverlib/sysctl.h", line 622: error #20: identifier "uint32_t" is undefined
    "C:/ti/TivaWare_C_Series-2.1.4.178/driverlib/sysctl.h", line 623: error #20: identifier "uint32_t" is undefined
    "C:/ti/TivaWare_C_Series-2.1.4.178/driverlib/sysctl.h", line 624: error #20: identifier "uint32_t" is undefined
    "C:/ti/TivaWare_C_Series-2.1.4.178/driverlib/sysctl.h", line 625: error #20: identifier "uint32_t" is undefined
    "C:/ti/TivaWare_C_Series-2.1.4.178/driverlib/sysctl.h", line 626: error #20: identifier "uint32_t" is undefined
    "C:/ti/TivaWare_C_Series-2.1.4.178/driverlib/sysctl.h", line 627: error #20: identifier "bool" is undefined
    "C:/ti/TivaWare_C_Series-2.1.4.178/driverlib/sysctl.h", line 628: error #20: identifier "bool" is undefined
    "C:/ti/TivaWare_C_Series-2.1.4.178/driverlib/sysctl.h", line 629: error #20: identifier "bool" is undefined
    "C:/ti/TivaWare_C_Series-2.1.4.178/driverlib/sysctl.h", line 631: error #20: identifier "uint32_t" is undefined
    "C:/ti/TivaWare_C_Series-2.1.4.178/driverlib/sysctl.h", line 632: error #20: identifier "uint32_t" is undefined
    "C:/ti/TivaWare_C_Series-2.1.4.178/driverlib/sysctl.h", line 635: error #20: identifier "uint32_t" is undefined
    "C:/ti/TivaWare_C_Series-2.1.4.178/driverlib/sysctl.h", line 635: error #20: identifier "uint32_t" is undefined
    "C:/ti/TivaWare_C_Series-2.1.4.178/driverlib/sysctl.h", line 636: error #20: identifier "uint32_t" is undefined
    "C:/ti/TivaWare_C_Series-2.1.4.178/driverlib/sysctl.h", line 637: error #20: identifier "uint32_t" is undefined
    "C:/ti/TivaWare_C_Series-2.1.4.178/driverlib/sysctl.h", line 638: error #20: identifier "uint32_t" is undefined
    "C:/ti/TivaWare_C_Series-2.1.4.178/driverlib/sysctl.h", line 639: error #20: identifier "uint32_t" is undefined
    "C:/ti/TivaWare_C_Series-2.1.4.178/driverlib/sysctl.h", line 639: error #20: identifier "uint32_t" is undefined
    "C:/ti/TivaWare_C_Series-2.1.4.178/driverlib/sysctl.h", line 640: error #20: identifier "uint32_t" is undefined
    "C:/ti/TivaWare_C_Series-2.1.4.178/driverlib/sysctl.h", line 641: error #20: identifier "uint32_t" is undefined
    "C:/ti/TivaWare_C_Series-2.1.4.178/driverlib/sysctl.h", line 642: error #20: identifier "uint32_t" is undefined
    "C:/ti/TivaWare_C_Series-2.1.4.178/driverlib/sysctl.h", line 643: error #20: identifier "uint32_t" is undefined
    "C:/ti/TivaWare_C_Series-2.1.4.178/driverlib/sysctl.h", line 644: error #20: identifier "uint32_t" is undefined
    "C:/ti/TivaWare_C_Series-2.1.4.178/driverlib/sysctl.h", line 645: error #20: identifier "uint32_t" is undefined
    "C:/ti/TivaWare_C_Series-2.1.4.178/driverlib/sysctl.h", line 646: error #20: identifier "bool" is undefined
    "C:/ti/TivaWare_C_Series-2.1.4.178/driverlib/sysctl.h", line 646: error #20: identifier "uint32_t" is undefined
    "C:/ti/TivaWare_C_Series-2.1.4.178/driverlib/sysctl.h", line 646: error #20: identifier "uint32_t" is undefined
    "C:/ti/TivaWare_C_Series-2.1.4.178/driverlib/systick.h", line 65: error #20: identifier "uint32_t" is undefined
    "C:/ti/TivaWare_C_Series-2.1.4.178/driverlib/systick.h", line 66: error #20: identifier "uint32_t" is undefined
    "C:/ti/TivaWare_C_Series-2.1.4.178/driverlib/systick.h", line 67: error #20: identifier "uint32_t" is undefined
    "C:/ti/TivaWare_C_Series-2.1.4.178/driverlib/timer.h", line 243: error #20: identifier "uint32_t" is undefined
    "C:/ti/TivaWare_C_Series-2.1.4.178/driverlib/timer.h", line 243: error #20: identifier "uint32_t" is undefined
    "C:/ti/TivaWare_C_Series-2.1.4.178/driverlib/timer.h", line 244: error #20: identifier "uint32_t" is undefined
    "C:/ti/TivaWare_C_Series-2.1.4.178/driverlib/timer.h", line 244: error #20: identifier "uint32_t" is undefined
    "C:/ti/TivaWare_C_Series-2.1.4.178/driverlib/timer.h", line 245: error #20: identifier "uint32_t" is undefined
    "C:/ti/TivaWare_C_Series-2.1.4.178/driverlib/timer.h", line 245: error #20: identifier "uint32_t" is undefined
    "C:/ti/TivaWare_C_Series-2.1.4.178/driverlib/timer.h", line 246: error #20: identifier "uint32_t" is undefined
    "C:/ti/TivaWare_C_Series-2.1.4.178/driverlib/timer.h", line 246: error #20: identifier "uint32_t" is undefined
    "C:/ti/TivaWare_C_Series-2.1.4.178/driverlib/timer.h", line 246: error #20: identifier "bool" is undefined
    "C:/ti/TivaWare_C_Series-2.1.4.178/driverlib/timer.h", line 247: error #20: identifier "uint32_t" is undefined
    "C:/ti/TivaWare_C_Series-2.1.4.178/driverlib/timer.h", line 247: error #20: identifier "uint32_t" is undefined
    "C:/ti/TivaWare_C_Series-2.1.4.178/driverlib/timer.h", line 247: error #20: identifier "bool" is undefined
    "C:/ti/TivaWare_C_Series-2.1.4.178/driverlib/timer.h", line 248: error #20: identifier "uint32_t" is undefined
    "C:/ti/TivaWare_C_Series-2.1.4.178/driverlib/timer.h", line 248: error #20: identifier "uint32_t" is undefined
    "C:/ti/TivaWare_C_Series-2.1.4.178/driverlib/timer.h", line 248: error #20: identifier "uint32_t" is undefined
    "C:/ti/TivaWare_C_Series-2.1.4.178/driverlib/timer.h", line 249: error #20: identifier "uint32_t" is undefined
    "C:/ti/TivaWare_C_Series-2.1.4.178/driverlib/timer.h", line 249: error #20: identifier "uint32_t" is undefined
    "C:/ti/TivaWare_C_Series-2.1.4.178/driverlib/timer.h", line 249: error #20: identifier "bool" is undefined
    "C:/ti/TivaWare_C_Series-2.1.4.178/driverlib/timer.h", line 250: error #20: identifier "uint32_t" is undefined
    "C:/ti/TivaWare_C_Series-2.1.4.178/driverlib/timer.h", line 250: error #20: identifier "uint32_t" is undefined
    "C:/ti/TivaWare_C_Series-2.1.4.178/driverlib/timer.h", line 250: error #20: identifier "bool" is undefined
    "C:/ti/TivaWare_C_Series-2.1.4.178/driverlib/timer.h", line 251: error #20: identifier "uint32_t" is undefined
    "C:/ti/TivaWare_C_Series-2.1.4.178/driverlib/timer.h", line 252: error #20: identifier "uint32_t" is undefined
    "C:/ti/TivaWare_C_Series-2.1.4.178/driverlib/timer.h", line 253: error #20: identifier "uint32_t" is undefined
    "C:/ti/TivaWare_C_Series-2.1.4.178/driverlib/timer.h", line 253: error #20: identifier "uint32_t" is undefined
    "C:/ti/TivaWare_C_Series-2.1.4.178/driverlib/timer.h", line 253: error #20: identifier "uint32_t" is undefined
    "C:/ti/TivaWare_C_Series-2.1.4.178/driverlib/timer.h", line 254: error #20: identifier "uint32_t" is undefined
    "C:/ti/TivaWare_C_Series-2.1.4.178/driverlib/timer.h", line 254: error #20: identifier "uint32_t" is undefined
    "C:/ti/TivaWare_C_Series-2.1.4.178/driverlib/timer.h", line 254: error #20: identifier "uint32_t" is undefined
    "C:/ti/TivaWare_C_Series-2.1.4.178/driverlib/timer.h", line 255: error #20: identifier "uint32_t" is undefined
    "C:/ti/TivaWare_C_Series-2.1.4.178/driverlib/timer.h", line 255: error #20: identifier "uint32_t" is undefined
    "C:/ti/TivaWare_C_Series-2.1.4.178/driverlib/timer.h", line 255: error #20: identifier "uint32_t" is undefined
    "C:/ti/TivaWare_C_Series-2.1.4.178/driverlib/timer.h", line 256: error #20: identifier "uint32_t" is undefined
    Error limit reached.
    100 errors detected in the compilation of "../state.c".
    Compilation terminated.
    gmake: *** [state.obj] Error 1
    'Building file: "../tm4c1294ncpdt_startup_ccs.c"'
    'Invoking: ARM Compiler'
    "C:/ti/ccsv7/tools/compiler/ti-cgt-arm_16.9.6.LTS/bin/armcl" -mv7M4 --code_state=16 --float_support=FPv4SPD16 --abi=eabi -me -O2 --include_path="C:/ti/ccsv7/tools/compiler/ti-cgt-arm_16.9.6.LTS/include" --include_path="C:/Scale/BCS_110" --include_path="C:/ti/TivaWare_C_Series-2.1.4.178/examples/boards/ek-tm4c1294xl" --include_path="C:/ti/TivaWare_C_Series-2.1.4.178" --advice:power=all -g --gcc --define=ccs="ccs" --define=PART_TM4C1294NCPDT --define=TARGET_IS_TM4C129_RA0 --diag_warning=225 --diag_wrap=off --display_error_number --gen_func_subsections=on --ual --preproc_with_compile --preproc_dependency="tm4c1294ncpdt_startup_ccs.d_raw" "../tm4c1294ncpdt_startup_ccs.c"
    "../tm4c1294ncpdt_startup_ccs.c", line 236: remark #1527-D: (ULP 2.1) Detected SW delay loop using empty loop. Recommend using a timer module instead
    "../tm4c1294ncpdt_startup_ccs.c", line 254: remark #1527-D: (ULP 2.1) Detected SW delay loop using empty loop. Recommend using a timer module instead
    "../tm4c1294ncpdt_startup_ccs.c", line 272: remark #1527-D: (ULP 2.1) Detected SW delay loop using empty loop. Recommend using a timer module instead
    'Finished building: "../tm4c1294ncpdt_startup_ccs.c"'

    'Building file: "../utils.c"'
    'Invoking: ARM Compiler'
    "C:/ti/ccsv7/tools/compiler/ti-cgt-arm_16.9.6.LTS/bin/armcl" -mv7M4 --code_state=16 --float_support=FPv4SPD16 --abi=eabi -me -O2 --include_path="C:/ti/ccsv7/tools/compiler/ti-cgt-arm_16.9.6.LTS/include" --include_path="C:/Scale/BCS_110" --include_path="C:/ti/TivaWare_C_Series-2.1.4.178/examples/boards/ek-tm4c1294xl" --include_path="C:/ti/TivaWare_C_Series-2.1.4.178" --advice:power=all -g --gcc --define=ccs="ccs" --define=PART_TM4C1294NCPDT --define=TARGET_IS_TM4C129_RA0 --diag_warning=225 --diag_wrap=off --display_error_number --gen_func_subsections=on --ual --preproc_with_compile --preproc_dependency="utils.d_raw" "../utils.c"

    >> Compilation failure
    subdir_rules.mk:79: recipe for target 'utils.obj' failed
    "C:/ti/TivaWare_C_Series-2.1.4.178/driverlib/sysctl.h", line 583: error #20: identifier "uint32_t" is undefined
    "C:/ti/TivaWare_C_Series-2.1.4.178/driverlib/sysctl.h", line 584: error #20: identifier "uint32_t" is undefined
    "C:/ti/TivaWare_C_Series-2.1.4.178/driverlib/sysctl.h", line 585: error #20: identifier "uint32_t" is undefined
    "C:/ti/TivaWare_C_Series-2.1.4.178/driverlib/sysctl.h", line 586: error #20: identifier "bool" is undefined
    "C:/ti/TivaWare_C_Series-2.1.4.178/driverlib/sysctl.h", line 586: error #20: identifier "uint32_t" is undefined
    "C:/ti/TivaWare_C_Series-2.1.4.178/driverlib/sysctl.h", line 587: error #20: identifier "bool" is undefined
    "C:/ti/TivaWare_C_Series-2.1.4.178/driverlib/sysctl.h", line 587: error #20: identifier "uint32_t" is undefined
    "C:/ti/TivaWare_C_Series-2.1.4.178/driverlib/sysctl.h", line 588: error #20: identifier "uint32_t" is undefined
    "C:/ti/TivaWare_C_Series-2.1.4.178/driverlib/sysctl.h", line 589: error #20: identifier "uint32_t" is undefined
    "C:/ti/TivaWare_C_Series-2.1.4.178/driverlib/sysctl.h", line 590: error #20: identifier "uint32_t" is undefined
    "C:/ti/TivaWare_C_Series-2.1.4.178/driverlib/sysctl.h", line 591: error #20: identifier "uint32_t" is undefined
    "C:/ti/TivaWare_C_Series-2.1.4.178/driverlib/sysctl.h", line 592: error #20: identifier "uint32_t" is undefined
    "C:/ti/TivaWare_C_Series-2.1.4.178/driverlib/sysctl.h", line 593: error #20: identifier "uint32_t" is undefined
    "C:/ti/TivaWare_C_Series-2.1.4.178/driverlib/sysctl.h", line 594: error #20: identifier "uint32_t" is undefined
    "C:/ti/TivaWare_C_Series-2.1.4.178/driverlib/sysctl.h", line 595: error #20: identifier "uint32_t" is undefined
    "C:/ti/TivaWare_C_Series-2.1.4.178/driverlib/sysctl.h", line 596: error #20: identifier "uint32_t" is undefined
    "C:/ti/TivaWare_C_Series-2.1.4.178/driverlib/sysctl.h", line 597: error #20: identifier "bool" is undefined
    "C:/ti/TivaWare_C_Series-2.1.4.178/driverlib/sysctl.h", line 600: error #20: identifier "uint32_t" is undefined
    "C:/ti/TivaWare_C_Series-2.1.4.178/driverlib/sysctl.h", line 601: error #20: identifier "uint32_t" is undefined
    "C:/ti/TivaWare_C_Series-2.1.4.178/driverlib/sysctl.h", line 602: error #20: identifier "uint32_t" is undefined
    "C:/ti/TivaWare_C_Series-2.1.4.178/driverlib/sysctl.h", line 603: error #20: identifier "uint32_t" is undefined
    "C:/ti/TivaWare_C_Series-2.1.4.178/driverlib/sysctl.h", line 603: error #20: identifier "bool" is undefined
    "C:/ti/TivaWare_C_Series-2.1.4.178/driverlib/sysctl.h", line 604: error #20: identifier "uint32_t" is undefined
    "C:/ti/TivaWare_C_Series-2.1.4.178/driverlib/sysctl.h", line 605: error #20: identifier "uint32_t" is undefined
    "C:/ti/TivaWare_C_Series-2.1.4.178/driverlib/sysctl.h", line 606: error #20: identifier "uint32_t" is undefined
    "C:/ti/TivaWare_C_Series-2.1.4.178/driverlib/sysctl.h", line 607: error #20: identifier "uint32_t" is undefined
    "C:/ti/TivaWare_C_Series-2.1.4.178/driverlib/sysctl.h", line 608: error #20: identifier "uint32_t" is undefined
    "C:/ti/TivaWare_C_Series-2.1.4.178/driverlib/sysctl.h", line 609: error #20: identifier "uint32_t" is undefined
    "C:/ti/TivaWare_C_Series-2.1.4.178/driverlib/sysctl.h", line 613: error #20: identifier "uint32_t" is undefined
    "C:/ti/TivaWare_C_Series-2.1.4.178/driverlib/sysctl.h", line 614: error #20: identifier "uint32_t" is undefined
    "C:/ti/TivaWare_C_Series-2.1.4.178/driverlib/sysctl.h", line 615: error #20: identifier "uint32_t" is undefined
    "C:/ti/TivaWare_C_Series-2.1.4.178/driverlib/sysctl.h", line 616: error #20: identifier "uint32_t" is undefined
    "C:/ti/TivaWare_C_Series-2.1.4.178/driverlib/sysctl.h", line 617: error #20: identifier "uint32_t" is undefined
    "C:/ti/TivaWare_C_Series-2.1.4.178/driverlib/sysctl.h", line 618: error #20: identifier "uint32_t" is undefined
    "C:/ti/TivaWare_C_Series-2.1.4.178/driverlib/sysctl.h", line 619: error #20: identifier "uint32_t" is undefined
    "C:/ti/TivaWare_C_Series-2.1.4.178/driverlib/sysctl.h", line 619: error #20: identifier "uint32_t" is undefined
    "C:/ti/TivaWare_C_Series-2.1.4.178/driverlib/sysctl.h", line 620: error #20: identifier "uint32_t" is undefined
    "C:/ti/TivaWare_C_Series-2.1.4.178/driverlib/sysctl.h", line 621: error #20: identifier "uint32_t" is undefined
    "C:/ti/TivaWare_C_Series-2.1.4.178/driverlib/sysctl.h", line 622: error #20: identifier "uint32_t" is undefined
    "C:/ti/TivaWare_C_Series-2.1.4.178/driverlib/sysctl.h", line 623: error #20: identifier "uint32_t" is undefined
    "C:/ti/TivaWare_C_Series-2.1.4.178/driverlib/sysctl.h", line 624: error #20: identifier "uint32_t" is undefined
    "C:/ti/TivaWare_C_Series-2.1.4.178/driverlib/sysctl.h", line 625: error #20: identifier "uint32_t" is undefined
    "C:/ti/TivaWare_C_Series-2.1.4.178/driverlib/sysctl.h", line 626: error #20: identifier "uint32_t" is undefined
    "C:/ti/TivaWare_C_Series-2.1.4.178/driverlib/sysctl.h", line 627: error #20: identifier "bool" is undefined
    "C:/ti/TivaWare_C_Series-2.1.4.178/driverlib/sysctl.h", line 628: error #20: identifier "bool" is undefined
    "C:/ti/TivaWare_C_Series-2.1.4.178/driverlib/sysctl.h", line 629: error #20: identifier "bool" is undefined
    "C:/ti/TivaWare_C_Series-2.1.4.178/driverlib/sysctl.h", line 631: error #20: identifier "uint32_t" is undefined
    "C:/ti/TivaWare_C_Series-2.1.4.178/driverlib/sysctl.h", line 632: error #20: identifier "uint32_t" is undefined
    "C:/ti/TivaWare_C_Series-2.1.4.178/driverlib/sysctl.h", line 635: error #20: identifier "uint32_t" is undefined
    "C:/ti/TivaWare_C_Series-2.1.4.178/driverlib/sysctl.h", line 635: error #20: identifier "uint32_t" is undefined
    "C:/ti/TivaWare_C_Series-2.1.4.178/driverlib/sysctl.h", line 636: error #20: identifier "uint32_t" is undefined
    "C:/ti/TivaWare_C_Series-2.1.4.178/driverlib/sysctl.h", line 637: error #20: identifier "uint32_t" is undefined
    "C:/ti/TivaWare_C_Series-2.1.4.178/driverlib/sysctl.h", line 638: error #20: identifier "uint32_t" is undefined
    "C:/ti/TivaWare_C_Series-2.1.4.178/driverlib/sysctl.h", line 639: error #20: identifier "uint32_t" is undefined
    "C:/ti/TivaWare_C_Series-2.1.4.178/driverlib/sysctl.h", line 639: error #20: identifier "uint32_t" is undefined
    "C:/ti/TivaWare_C_Series-2.1.4.178/driverlib/sysctl.h", line 640: error #20: identifier "uint32_t" is undefined
    "C:/ti/TivaWare_C_Series-2.1.4.178/driverlib/sysctl.h", line 641: error #20: identifier "uint32_t" is undefined
    "C:/ti/TivaWare_C_Series-2.1.4.178/driverlib/sysctl.h", line 642: error #20: identifier "uint32_t" is undefined
    "C:/ti/TivaWare_C_Series-2.1.4.178/driverlib/sysctl.h", line 643: error #20: identifier "uint32_t" is undefined
    "C:/ti/TivaWare_C_Series-2.1.4.178/driverlib/sysctl.h", line 644: error #20: identifier "uint32_t" is undefined
    "C:/ti/TivaWare_C_Series-2.1.4.178/driverlib/sysctl.h", line 645: error #20: identifier "uint32_t" is undefined
    "C:/ti/TivaWare_C_Series-2.1.4.178/driverlib/sysctl.h", line 646: error #20: identifier "bool" is undefined
    "C:/ti/TivaWare_C_Series-2.1.4.178/driverlib/sysctl.h", line 646: error #20: identifier "uint32_t" is undefined
    "C:/ti/TivaWare_C_Series-2.1.4.178/driverlib/sysctl.h", line 646: error #20: identifier "uint32_t" is undefined
    "C:/ti/TivaWare_C_Series-2.1.4.178/driverlib/systick.h", line 65: error #20: identifier "uint32_t" is undefined
    "C:/ti/TivaWare_C_Series-2.1.4.178/driverlib/systick.h", line 66: error #20: identifier "uint32_t" is undefined
    "C:/ti/TivaWare_C_Series-2.1.4.178/driverlib/systick.h", line 67: error #20: identifier "uint32_t" is undefined
    "C:/ti/TivaWare_C_Series-2.1.4.178/driverlib/timer.h", line 243: error #20: identifier "uint32_t" is undefined
    "C:/ti/TivaWare_C_Series-2.1.4.178/driverlib/timer.h", line 243: error #20: identifier "uint32_t" is undefined
    "C:/ti/TivaWare_C_Series-2.1.4.178/driverlib/timer.h", line 244: error #20: identifier "uint32_t" is undefined
    "C:/ti/TivaWare_C_Series-2.1.4.178/driverlib/timer.h", line 244: error #20: identifier "uint32_t" is undefined
    "C:/ti/TivaWare_C_Series-2.1.4.178/driverlib/timer.h", line 245: error #20: identifier "uint32_t" is undefined
    "C:/ti/TivaWare_C_Series-2.1.4.178/driverlib/timer.h", line 245: error #20: identifier "uint32_t" is undefined
    "C:/ti/TivaWare_C_Series-2.1.4.178/driverlib/timer.h", line 246: error #20: identifier "uint32_t" is undefined
    "C:/ti/TivaWare_C_Series-2.1.4.178/driverlib/timer.h", line 246: error #20: identifier "uint32_t" is undefined
    "C:/ti/TivaWare_C_Series-2.1.4.178/driverlib/timer.h", line 246: error #20: identifier "bool" is undefined
    "C:/ti/TivaWare_C_Series-2.1.4.178/driverlib/timer.h", line 247: error #20: identifier "uint32_t" is undefined
    "C:/ti/TivaWare_C_Series-2.1.4.178/driverlib/timer.h", line 247: error #20: identifier "uint32_t" is undefined
    "C:/ti/TivaWare_C_Series-2.1.4.178/driverlib/timer.h", line 247: error #20: identifier "bool" is undefined
    "C:/ti/TivaWare_C_Series-2.1.4.178/driverlib/timer.h", line 248: error #20: identifier "uint32_t" is undefined
    "C:/ti/TivaWare_C_Series-2.1.4.178/driverlib/timer.h", line 248: error #20: identifier "uint32_t" is undefined
    "C:/ti/TivaWare_C_Series-2.1.4.178/driverlib/timer.h", line 248: error #20: identifier "uint32_t" is undefined
    "C:/ti/TivaWare_C_Series-2.1.4.178/driverlib/timer.h", line 249: error #20: identifier "uint32_t" is undefined
    "C:/ti/TivaWare_C_Series-2.1.4.178/driverlib/timer.h", line 249: error #20: identifier "uint32_t" is undefined
    "C:/ti/TivaWare_C_Series-2.1.4.178/driverlib/timer.h", line 249: error #20: identifier "bool" is undefined
    "C:/ti/TivaWare_C_Series-2.1.4.178/driverlib/timer.h", line 250: error #20: identifier "uint32_t" is undefined
    "C:/ti/TivaWare_C_Series-2.1.4.178/driverlib/timer.h", line 250: error #20: identifier "uint32_t" is undefined
    "C:/ti/TivaWare_C_Series-2.1.4.178/driverlib/timer.h", line 250: error #20: identifier "bool" is undefined
    "C:/ti/TivaWare_C_Series-2.1.4.178/driverlib/timer.h", line 251: error #20: identifier "uint32_t" is undefined
    "C:/ti/TivaWare_C_Series-2.1.4.178/driverlib/timer.h", line 252: error #20: identifier "uint32_t" is undefined
    "C:/ti/TivaWare_C_Series-2.1.4.178/driverlib/timer.h", line 253: error #20: identifier "uint32_t" is undefined
    "C:/ti/TivaWare_C_Series-2.1.4.178/driverlib/timer.h", line 253: error #20: identifier "uint32_t" is undefined
    "C:/ti/TivaWare_C_Series-2.1.4.178/driverlib/timer.h", line 253: error #20: identifier "uint32_t" is undefined
    "C:/ti/TivaWare_C_Series-2.1.4.178/driverlib/timer.h", line 254: error #20: identifier "uint32_t" is undefined
    "C:/ti/TivaWare_C_Series-2.1.4.178/driverlib/timer.h", line 254: error #20: identifier "uint32_t" is undefined
    "C:/ti/TivaWare_C_Series-2.1.4.178/driverlib/timer.h", line 254: error #20: identifier "uint32_t" is undefined
    "C:/ti/TivaWare_C_Series-2.1.4.178/driverlib/timer.h", line 255: error #20: identifier "uint32_t" is undefined
    "C:/ti/TivaWare_C_Series-2.1.4.178/driverlib/timer.h", line 255: error #20: identifier "uint32_t" is undefined
    "C:/ti/TivaWare_C_Series-2.1.4.178/driverlib/timer.h", line 255: error #20: identifier "uint32_t" is undefined
    "C:/ti/TivaWare_C_Series-2.1.4.178/driverlib/timer.h", line 256: error #20: identifier "uint32_t" is undefined
    Error limit reached.
    100 errors detected in the compilation of "../utils.c".
    Compilation terminated.
    gmake: *** [utils.obj] Error 1
    'Building file: "C:/ti/TivaWare_C_Series-2.1.4.178/driverlib/adc.c"'
    'Invoking: ARM Compiler'
    "C:/ti/ccsv7/tools/compiler/ti-cgt-arm_16.9.6.LTS/bin/armcl" -mv7M4 --code_state=16 --float_support=FPv4SPD16 --abi=eabi -me -O2 --include_path="C:/ti/ccsv7/tools/compiler/ti-cgt-arm_16.9.6.LTS/include" --include_path="C:/Scale/BCS_110" --include_path="C:/ti/TivaWare_C_Series-2.1.4.178/examples/boards/ek-tm4c1294xl" --include_path="C:/ti/TivaWare_C_Series-2.1.4.178" --advice:power=all -g --gcc --define=ccs="ccs" --define=PART_TM4C1294NCPDT --define=TARGET_IS_TM4C129_RA0 --diag_warning=225 --diag_wrap=off --display_error_number --gen_func_subsections=on --ual --preproc_with_compile --preproc_dependency="utils/adc.d_raw" --obj_directory="utils" "C:/ti/TivaWare_C_Series-2.1.4.178/driverlib/adc.c"
    "C:/ti/TivaWare_C_Series-2.1.4.178/driverlib/adc.c", line 949: remark #1527-D: (ULP 2.1) Detected SW delay loop using empty loop. Recommend using a timer module instead
    "C:/ti/TivaWare_C_Series-2.1.4.178/driverlib/adc.c", line 1195: remark #1527-D: (ULP 2.1) Detected SW delay loop using empty loop. Recommend using a timer module instead
    'Finished building: "C:/ti/TivaWare_C_Series-2.1.4.178/driverlib/adc.c"'

    'Building file: "C:/ti/TivaWare_C_Series-2.1.4.178/utils/cmdline.c"'
    'Invoking: ARM Compiler'
    "C:/ti/ccsv7/tools/compiler/ti-cgt-arm_16.9.6.LTS/bin/armcl" -mv7M4 --code_state=16 --float_support=FPv4SPD16 --abi=eabi -me -O2 --include_path="C:/ti/ccsv7/tools/compiler/ti-cgt-arm_16.9.6.LTS/include" --include_path="C:/Scale/BCS_110" --include_path="C:/ti/TivaWare_C_Series-2.1.4.178/examples/boards/ek-tm4c1294xl" --include_path="C:/ti/TivaWare_C_Series-2.1.4.178" --advice:power=all -g --gcc --define=ccs="ccs" --define=PART_TM4C1294NCPDT --define=TARGET_IS_TM4C129_RA0 --diag_warning=225 --diag_wrap=off --display_error_number --gen_func_subsections=on --ual --preproc_with_compile --preproc_dependency="utils/cmdline.d_raw" --obj_directory="utils" "C:/ti/TivaWare_C_Series-2.1.4.178/utils/cmdline.c"
    'Finished building: "C:/ti/TivaWare_C_Series-2.1.4.178/utils/cmdline.c"'

    'Building file: "C:/ti/TivaWare_C_Series-2.1.4.178/driverlib/cpu.c"'
    'Invoking: ARM Compiler'
    "C:/ti/ccsv7/tools/compiler/ti-cgt-arm_16.9.6.LTS/bin/armcl" -mv7M4 --code_state=16 --float_support=FPv4SPD16 --abi=eabi -me -O2 --include_path="C:/ti/ccsv7/tools/compiler/ti-cgt-arm_16.9.6.LTS/include" --include_path="C:/Scale/BCS_110" --include_path="C:/ti/TivaWare_C_Series-2.1.4.178/examples/boards/ek-tm4c1294xl" --include_path="C:/ti/TivaWare_C_Series-2.1.4.178" --advice:power=all -g --gcc --define=ccs="ccs" --define=PART_TM4C1294NCPDT --define=TARGET_IS_TM4C129_RA0 --diag_warning=225 --diag_wrap=off --display_error_number --gen_func_subsections=on --ual --preproc_with_compile --preproc_dependency="utils/cpu.d_raw" --obj_directory="utils" "C:/ti/TivaWare_C_Series-2.1.4.178/driverlib/cpu.c"
    'Finished building: "C:/ti/TivaWare_C_Series-2.1.4.178/driverlib/cpu.c"'

    'Building file: "C:/ti/TivaWare_C_Series-2.1.4.178/driverlib/flash.c"'
    'Invoking: ARM Compiler'
    "C:/ti/ccsv7/tools/compiler/ti-cgt-arm_16.9.6.LTS/bin/armcl" -mv7M4 --code_state=16 --float_support=FPv4SPD16 --abi=eabi -me -O2 --include_path="C:/ti/ccsv7/tools/compiler/ti-cgt-arm_16.9.6.LTS/include" --include_path="C:/Scale/BCS_110" --include_path="C:/ti/TivaWare_C_Series-2.1.4.178/examples/boards/ek-tm4c1294xl" --include_path="C:/ti/TivaWare_C_Series-2.1.4.178" --advice:power=all -g --gcc --define=ccs="ccs" --define=PART_TM4C1294NCPDT --define=TARGET_IS_TM4C129_RA0 --diag_warning=225 --diag_wrap=off --display_error_number --gen_func_subsections=on --ual --preproc_with_compile --preproc_dependency="utils/flash.d_raw" --obj_directory="utils" "C:/ti/TivaWare_C_Series-2.1.4.178/driverlib/flash.c"
    "C:/ti/TivaWare_C_Series-2.1.4.178/driverlib/flash.c", line 152: remark #1527-D: (ULP 2.1) Detected SW delay loop using empty loop. Recommend using a timer module instead
    "C:/ti/TivaWare_C_Series-2.1.4.178/driverlib/flash.c", line 238: remark #1527-D: (ULP 2.1) Detected SW delay loop using empty loop. Recommend using a timer module instead
    "C:/ti/TivaWare_C_Series-2.1.4.178/driverlib/flash.c", line 509: remark #1527-D: (ULP 2.1) Detected SW delay loop using empty loop. Recommend using a timer module instead
    "C:/ti/TivaWare_C_Series-2.1.4.178/driverlib/flash.c", line 682: remark #1527-D: (ULP 2.1) Detected SW delay loop using empty loop. Recommend using a timer module instead
    "C:/ti/TivaWare_C_Series-2.1.4.178/driverlib/flash.c", line 695: remark #1527-D: (ULP 2.1) Detected SW delay loop using empty loop. Recommend using a timer module instead
    "C:/ti/TivaWare_C_Series-2.1.4.178/driverlib/flash.c", line 746: remark #1527-D: (ULP 2.1) Detected SW delay loop using empty loop. Recommend using a timer module instead
    'Finished building: "C:/ti/TivaWare_C_Series-2.1.4.178/driverlib/flash.c"'

    'Building file: "C:/ti/TivaWare_C_Series-2.1.4.178/driverlib/gpio.c"'
    'Invoking: ARM Compiler'
    "C:/ti/ccsv7/tools/compiler/ti-cgt-arm_16.9.6.LTS/bin/armcl" -mv7M4 --code_state=16 --float_support=FPv4SPD16 --abi=eabi -me -O2 --include_path="C:/ti/ccsv7/tools/compiler/ti-cgt-arm_16.9.6.LTS/include" --include_path="C:/Scale/BCS_110" --include_path="C:/ti/TivaWare_C_Series-2.1.4.178/examples/boards/ek-tm4c1294xl" --include_path="C:/ti/TivaWare_C_Series-2.1.4.178" --advice:power=all -g --gcc --define=ccs="ccs" --define=PART_TM4C1294NCPDT --define=TARGET_IS_TM4C129_RA0 --diag_warning=225 --diag_wrap=off --display_error_number --gen_func_subsections=on --ual --preproc_with_compile --preproc_dependency="utils/gpio.d_raw" --obj_directory="utils" "C:/ti/TivaWare_C_Series-2.1.4.178/driverlib/gpio.c"
    "C:/ti/TivaWare_C_Series-2.1.4.178/driverlib/gpio.c", line 354: remark #2623-D: (ULP 5.4) Detected an assignment to a type with size less than int. To avoid unnecessary sign extension, use int-sized types for local varaibles and convert to smaller types for static storage.
    "C:/ti/TivaWare_C_Series-2.1.4.178/driverlib/gpio.c", line 473: remark #2623-D: (ULP 5.4) Detected an assignment to a type with size less than int. To avoid unnecessary sign extension, use int-sized types for local varaibles and convert to smaller types for static storage.
    "C:/ti/TivaWare_C_Series-2.1.4.178/driverlib/gpio.c", line 583: remark #2623-D: (ULP 5.4) Detected an assignment to a type with size less than int. To avoid unnecessary sign extension, use int-sized types for local varaibles and convert to smaller types for static storage.
    "C:/ti/TivaWare_C_Series-2.1.4.178/driverlib/gpio.c", line 704: remark #2623-D: (ULP 5.4) Detected an assignment to a type with size less than int. To avoid unnecessary sign extension, use int-sized types for local varaibles and convert to smaller types for static storage.
    "C:/ti/TivaWare_C_Series-2.1.4.178/driverlib/gpio.c", line 90: remark #1534-D: (ULP 7.1) Detected use of global variable "g_ui32GPIOIntMapBlizzardRows" within one function "_GPIOIntNumberGet". Recommend placing variable in the function locally
    "C:/ti/TivaWare_C_Series-2.1.4.178/driverlib/gpio.c", line 123: remark #1534-D: (ULP 7.1) Detected use of global variable "g_ui32GPIOIntMapSnowflakeRows" within one function "_GPIOIntNumberGet". Recommend placing variable in the function locally
    'Finished building: "C:/ti/TivaWare_C_Series-2.1.4.178/driverlib/gpio.c"'

    'Building file: "C:/ti/TivaWare_C_Series-2.1.4.178/driverlib/ssi.c"'
    'Invoking: ARM Compiler'
    "C:/ti/ccsv7/tools/compiler/ti-cgt-arm_16.9.6.LTS/bin/armcl" -mv7M4 --code_state=16 --float_support=FPv4SPD16 --abi=eabi -me -O2 --include_path="C:/ti/ccsv7/tools/compiler/ti-cgt-arm_16.9.6.LTS/include" --include_path="C:/Scale/BCS_110" --include_path="C:/ti/TivaWare_C_Series-2.1.4.178/examples/boards/ek-tm4c1294xl" --include_path="C:/ti/TivaWare_C_Series-2.1.4.178" --advice:power=all -g --gcc --define=ccs="ccs" --define=PART_TM4C1294NCPDT --define=TARGET_IS_TM4C129_RA0 --diag_warning=225 --diag_wrap=off --display_error_number --gen_func_subsections=on --ual --preproc_with_compile --preproc_dependency="utils/ssi.d_raw" --obj_directory="utils" "C:/ti/TivaWare_C_Series-2.1.4.178/driverlib/ssi.c"
    "C:/ti/TivaWare_C_Series-2.1.4.178/driverlib/ssi.c", line 591: remark #1527-D: (ULP 2.1) Detected SW delay loop using empty loop. Recommend using a timer module instead
    "C:/ti/TivaWare_C_Series-2.1.4.178/driverlib/ssi.c", line 677: remark #1527-D: (ULP 2.1) Detected SW delay loop using empty loop. Recommend using a timer module instead
    "C:/ti/TivaWare_C_Series-2.1.4.178/driverlib/ssi.c", line 1021: remark #1527-D: (ULP 2.1) Detected SW delay loop using empty loop. Recommend using a timer module instead
    "C:/ti/TivaWare_C_Series-2.1.4.178/driverlib/ssi.c", line 70: remark #1534-D: (ULP 7.1) Detected use of global variable "g_ui8SSIIntMapRows" within one function "_SSIIntNumberGet". Recommend placing variable in the function locally
    "C:/ti/TivaWare_C_Series-2.1.4.178/driverlib/ssi.c", line 80: remark #1534-D: (ULP 7.1) Detected use of global variable "g_ui8SSIIntMapSnowflakeRows" within one function "_SSIIntNumberGet". Recommend placing variable in the function locally
    'Finished building: "C:/ti/TivaWare_C_Series-2.1.4.178/driverlib/ssi.c"'

    'Building file: "C:/ti/TivaWare_C_Series-2.2.0.295/driverlib/sysctl.c"'
    'Invoking: ARM Compiler'
    "C:/ti/ccsv7/tools/compiler/ti-cgt-arm_16.9.6.LTS/bin/armcl" -mv7M4 --code_state=16 --float_support=FPv4SPD16 --abi=eabi -me -O2 --include_path="C:/ti/ccsv7/tools/compiler/ti-cgt-arm_16.9.6.LTS/include" --include_path="C:/Scale/BCS_110" --include_path="C:/ti/TivaWare_C_Series-2.1.4.178/examples/boards/ek-tm4c1294xl" --include_path="C:/ti/TivaWare_C_Series-2.1.4.178" --advice:power=all -g --gcc --define=ccs="ccs" --define=PART_TM4C1294NCPDT --define=TARGET_IS_TM4C129_RA0 --diag_warning=225 --diag_wrap=off --display_error_number --gen_func_subsections=on --ual --preproc_with_compile --preproc_dependency="utils/sysctl.d_raw" --obj_directory="utils" "C:/ti/TivaWare_C_Series-2.2.0.295/driverlib/sysctl.c"
    "C:/ti/TivaWare_C_Series-2.2.0.295/driverlib/sysctl.c", line 784: remark #1527-D: (ULP 2.1) Detected SW delay loop using empty loop. Recommend using a timer module instead
    "C:/ti/TivaWare_C_Series-2.2.0.295/driverlib/sysctl.c", line 1687: remark #1527-D: (ULP 2.1) Detected SW delay loop using empty loop. Recommend using a timer module instead
    "C:/ti/TivaWare_C_Series-2.2.0.295/driverlib/sysctl.c", line 1965: remark #1527-D: (ULP 2.1) Detected SW delay loop using empty loop. Recommend using a timer module instead
    'Finished building: "C:/ti/TivaWare_C_Series-2.2.0.295/driverlib/sysctl.c"'

    'Building file: "C:/ti/TivaWare_C_Series-2.1.4.178/driverlib/systick.c"'
    'Invoking: ARM Compiler'
    "C:/ti/ccsv7/tools/compiler/ti-cgt-arm_16.9.6.LTS/bin/armcl" -mv7M4 --code_state=16 --float_support=FPv4SPD16 --abi=eabi -me -O2 --include_path="C:/ti/ccsv7/tools/compiler/ti-cgt-arm_16.9.6.LTS/include" --include_path="C:/Scale/BCS_110" --include_path="C:/ti/TivaWare_C_Series-2.1.4.178/examples/boards/ek-tm4c1294xl" --include_path="C:/ti/TivaWare_C_Series-2.1.4.178" --advice:power=all -g --gcc --define=ccs="ccs" --define=PART_TM4C1294NCPDT --define=TARGET_IS_TM4C129_RA0 --diag_warning=225 --diag_wrap=off --display_error_number --gen_func_subsections=on --ual --preproc_with_compile --preproc_dependency="utils/systick.d_raw" --obj_directory="utils" "C:/ti/TivaWare_C_Series-2.1.4.178/driverlib/systick.c"
    'Finished building: "C:/ti/TivaWare_C_Series-2.1.4.178/driverlib/systick.c"'

    'Building file: "C:/ti/TivaWare_C_Series-2.2.0.295/driverlib/timer.c"'
    'Invoking: ARM Compiler'
    "C:/ti/ccsv7/tools/compiler/ti-cgt-arm_16.9.6.LTS/bin/armcl" -mv7M4 --code_state=16 --float_support=FPv4SPD16 --abi=eabi -me -O2 --include_path="C:/ti/ccsv7/tools/compiler/ti-cgt-arm_16.9.6.LTS/include" --include_path="C:/Scale/BCS_110" --include_path="C:/ti/TivaWare_C_Series-2.1.4.178/examples/boards/ek-tm4c1294xl" --include_path="C:/ti/TivaWare_C_Series-2.1.4.178" --advice:power=all -g --gcc --define=ccs="ccs" --define=PART_TM4C1294NCPDT --define=TARGET_IS_TM4C129_RA0 --diag_warning=225 --diag_wrap=off --display_error_number --gen_func_subsections=on --ual --preproc_with_compile --preproc_dependency="utils/timer.d_raw" --obj_directory="utils" "C:/ti/TivaWare_C_Series-2.2.0.295/driverlib/timer.c"
    "C:/ti/TivaWare_C_Series-2.2.0.295/driverlib/timer.c", line 86: remark #1534-D: (ULP 7.1) Detected use of global variable "g_ui8TimerIntMapRows" within one function "_TimerIntNumberGet". Recommend placing variable in the function locally
    "C:/ti/TivaWare_C_Series-2.2.0.295/driverlib/timer.c", line 100: remark #1534-D: (ULP 7.1) Detected use of global variable "g_ui8TimerIntMapRowsSnowflake" within one function "_TimerIntNumberGet". Recommend placing variable in the function locally
    'Finished building: "C:/ti/TivaWare_C_Series-2.2.0.295/driverlib/timer.c"'

    'Building file: "C:/ti/TivaWare_C_Series-2.1.4.178/driverlib/uart.c"'
    'Invoking: ARM Compiler'
    "C:/ti/ccsv7/tools/compiler/ti-cgt-arm_16.9.6.LTS/bin/armcl" -mv7M4 --code_state=16 --float_support=FPv4SPD16 --abi=eabi -me -O2 --include_path="C:/ti/ccsv7/tools/compiler/ti-cgt-arm_16.9.6.LTS/include" --include_path="C:/Scale/BCS_110" --include_path="C:/ti/TivaWare_C_Series-2.1.4.178/examples/boards/ek-tm4c1294xl" --include_path="C:/ti/TivaWare_C_Series-2.1.4.178" --advice:power=all -g --gcc --define=ccs="ccs" --define=PART_TM4C1294NCPDT --define=TARGET_IS_TM4C129_RA0 --diag_warning=225 --diag_wrap=off --display_error_number --gen_func_subsections=on --ual --preproc_with_compile --preproc_dependency="utils/uart.d_raw" --obj_directory="utils" "C:/ti/TivaWare_C_Series-2.1.4.178/driverlib/uart.c"
    "C:/ti/TivaWare_C_Series-2.1.4.178/driverlib/uart.c", line 565: remark #1528-D: (ULP 3.1) Detected flag polling using UART_FR_BUSY. Recommend using an interrupt combined with enter LPMx and ISR
    "C:/ti/TivaWare_C_Series-2.1.4.178/driverlib/uart.c", line 1201: remark #1527-D: (ULP 2.1) Detected SW delay loop using empty loop. Recommend using a timer module instead
    "C:/ti/TivaWare_C_Series-2.1.4.178/driverlib/uart.c", line 1285: remark #1527-D: (ULP 2.1) Detected SW delay loop using empty loop. Recommend using a timer module instead
    "C:/ti/TivaWare_C_Series-2.1.4.178/driverlib/uart.c", line 1929: remark #1527-D: (ULP 2.1) Detected SW delay loop using empty loop. Recommend using a timer module instead
    "C:/ti/TivaWare_C_Series-2.1.4.178/driverlib/uart.c", line 1949: remark #1527-D: (ULP 2.1) Detected SW delay loop using empty loop. Recommend using a timer module instead
    "C:/ti/TivaWare_C_Series-2.1.4.178/driverlib/uart.c", line 82: remark #1534-D: (ULP 7.1) Detected use of global variable "g_ui8UARTIntMapRows" within one function "_UARTIntNumberGet". Recommend placing variable in the function locally
    "C:/ti/TivaWare_C_Series-2.1.4.178/driverlib/uart.c", line 95: remark #1534-D: (ULP 7.1) Detected use of global variable "g_ui8UARTIntMapRowsSnowflake" within one function "_UARTIntNumberGet". Recommend placing variable in the function locally
    'Finished building: "C:/ti/TivaWare_C_Series-2.1.4.178/driverlib/uart.c"'

    'Building file: "C:/ti/TivaWare_C_Series-2.1.4.178/utils/uartstdio.c"'
    'Invoking: ARM Compiler'
    "C:/ti/ccsv7/tools/compiler/ti-cgt-arm_16.9.6.LTS/bin/armcl" -mv7M4 --code_state=16 --float_support=FPv4SPD16 --abi=eabi -me -O2 --include_path="C:/ti/ccsv7/tools/compiler/ti-cgt-arm_16.9.6.LTS/include" --include_path="C:/Scale/BCS_110" --include_path="C:/ti/TivaWare_C_Series-2.1.4.178/examples/boards/ek-tm4c1294xl" --include_path="C:/ti/TivaWare_C_Series-2.1.4.178" --advice:power=all -g --gcc --define=ccs="ccs" --define=PART_TM4C1294NCPDT --define=TARGET_IS_TM4C129_RA0 --diag_warning=225 --diag_wrap=off --display_error_number --gen_func_subsections=on --ual --preproc_with_compile --preproc_dependency="utils/uartstdio.d_raw" --obj_directory="utils" "C:/ti/TivaWare_C_Series-2.1.4.178/utils/uartstdio.c"
    "C:/ti/TivaWare_C_Series-2.1.4.178/utils/uartstdio.c", line 668: remark #2623-D: (ULP 5.4) Detected an assignment to a type with size less than int. To avoid unnecessary sign extension, use int-sized types for local varaibles and convert to smaller types for static storage.
    "C:/ti/TivaWare_C_Series-2.1.4.178/utils/uartstdio.c", line 878: remark #1527-D: (ULP 2.1) Detected SW delay loop using empty loop. Recommend using a timer module instead
    "C:/ti/TivaWare_C_Series-2.1.4.178/utils/uartstdio.c", line 1044: remark #1527-D: (ULP 2.1) Detected SW delay loop using empty loop. Recommend using a timer module instead
    "C:/ti/TivaWare_C_Series-2.1.4.178/utils/uartstdio.c", line 1139: remark #1527-D: (ULP 2.1) Detected SW delay loop using empty loop. Recommend using a timer module instead
    "C:/ti/TivaWare_C_Series-2.1.4.178/utils/uartstdio.c", line 134: remark #1534-D: (ULP 7.1) Detected use of global variable "g_pcHex" within one function "UARTvprintf". Recommend placing variable in the function locally
    'Finished building: "C:/ti/TivaWare_C_Series-2.1.4.178/utils/uartstdio.c"'

    'Building file: "C:/ti/TivaWare_C_Series-2.1.4.178/utils/ustdlib.c"'
    'Invoking: ARM Compiler'
    "C:/ti/ccsv7/tools/compiler/ti-cgt-arm_16.9.6.LTS/bin/armcl" -mv7M4 --code_state=16 --float_support=FPv4SPD16 --abi=eabi -me -O2 --include_path="C:/ti/ccsv7/tools/compiler/ti-cgt-arm_16.9.6.LTS/include" --include_path="C:/Scale/BCS_110" --include_path="C:/ti/TivaWare_C_Series-2.1.4.178/examples/boards/ek-tm4c1294xl" --include_path="C:/ti/TivaWare_C_Series-2.1.4.178" --advice:power=all -g --gcc --define=ccs="ccs" --define=PART_TM4C1294NCPDT --define=TARGET_IS_TM4C129_RA0 --diag_warning=225 --diag_wrap=off --display_error_number --gen_func_subsections=on --ual --preproc_with_compile --preproc_dependency="utils/ustdlib.d_raw" --obj_directory="utils" "C:/ti/TivaWare_C_Series-2.1.4.178/utils/ustdlib.c"
    "C:/ti/TivaWare_C_Series-2.1.4.178/utils/ustdlib.c", line 193: remark #1527-D: (ULP 2.1) Detected SW delay loop using empty loop. Recommend using a timer module instead
    "C:/ti/TivaWare_C_Series-2.1.4.178/utils/ustdlib.c", line 383: remark #1527-D: (ULP 2.1) Detected SW delay loop using empty loop. Recommend using a timer module instead
    "C:/ti/TivaWare_C_Series-2.1.4.178/utils/ustdlib.c", line 505: remark #1527-D: (ULP 2.1) Detected SW delay loop using empty loop. Recommend using a timer module instead
    "C:/ti/TivaWare_C_Series-2.1.4.178/utils/ustdlib.c", line 1625: remark #2623-D: (ULP 5.4) Detected an assignment to a type with size less than int. To avoid unnecessary sign extension, use int-sized types for local varaibles and convert to smaller types for static storage.
    "C:/ti/TivaWare_C_Series-2.1.4.178/utils/ustdlib.c", line 1626: remark #2623-D: (ULP 5.4) Detected an assignment to a type with size less than int. To avoid unnecessary sign extension, use int-sized types for local varaibles and convert to smaller types for static storage.
    "C:/ti/TivaWare_C_Series-2.1.4.178/utils/ustdlib.c", line 42: remark #1534-D: (ULP 7.1) Detected use of global variable "g_pcHex" within one function "uvsnprintf". Recommend placing variable in the function locally
    'Finished building: "C:/ti/TivaWare_C_Series-2.1.4.178/utils/ustdlib.c"'

    gmake: Target 'all' not remade because of errors.

    **** Build Finished ****

    Thanks,

    Sai 

  • Which source code are you trying to replace? Looking at the below error, are you replacing what is the existing systick.h file in the library with your own systick.h file?

    "C:/ti/TivaWare_C_Series-2.1.4.178/driverlib/systick.h", line 65: error #20: identifier "uint32_t" is undefined

  • Dear Charles, 

    Yes, I've imported the example projects from ek-tm4c1294xl. They got compiled and generated the binary file. 

    Now, After adding the source file of my personal project. I have to add the two commands 1) #include <stdbool.h> and #include <stdint.h>.  There upon my files are getting compiled and generating binary file. Thank you very much for your quick response. 

    I hope this helps for others as well. 

    Thanks,

    Sai