This thread has been locked.

If you have a related question, please click the "Ask a related question" button in the top right corner. The newly created question will be automatically linked to this question.

SIMPLELINK-CC13X2-26X2-SDK: Issue with new SDK -

Part Number: SIMPLELINK-CC13X2-26X2-SDK
Other Parts Discussed in Thread: LAUNCHXL-CC1352R1, CC1352P7

From customer:

I just download "simplelink cc13x2 26x2 sdk_5_20_00_52", I think that's the latest version, I already installed in mi PC but I can't added to my IDE.
Just give me this options: 
  • Rogerio,

    Resource Explorer will be updated with the new 5.20 SDK in the next day or 2. In the meantime, the customer can import examples from the 5.20 SDK by navigating to File > Import > Code Composer Studio > CCS Project and then navigating to the example they want to import. 

    Regards,

    Daniel

  • Thanks Daniel. I sent the link to this post to our customer, so in case they still have issues, they will be posting here. It looks good from my side.

  • Hi,

    When I try to import the example it shows this message.:

  • Christian,

    Which version of CCS are you using? If you go to CCS Preferences > Code Composter Studio > Products, do you see TI Arm Clang listed as an installed product?

    Are you intending to use a project with the TI Clang compiler?

    Regards,

    Daniel

  • Hi Daniel, 

    I'm trying to build the Wi-sun example that comes with the SDK (simplelink_cc13x2_26x2_sdk_5_20_00_52).

    I can't see any TI Arm Clang installed.

    Regards, Christian

  • Christian,

    It looks like you don't have the required compiler installed. You can download it here: https://www.ti.com/tool/download/ARM-CGT-CLANG-1 

    Regards,

    Daniel

  • Daniel,

    I installed(on my laptop) the package, but it still does not appear in the products section.

    Also, I have installed CCS on my desktop PC, in that installation I have TI Arm Clang installed but when I try to build the project I get many errors.

    Regards, Christian.

  • Christian,

    From the project properties, please verify you have the compiler selected. If not, click "more..."

    then click "refresh" to let CCS discover newly installed products.

    If that doesn't work, I'll reach our to the Wi-SUN experts for more help.

    Regards,

    Daniel

  • Hi Daniel,

    The compile version it's right, I already managed to load the example on my laptop, but when compiling it also generates errors.

    Regards, Christian.

  • Christian,

    I let our Wi-SUN expert know you're seeing compile errors. Can you share those errors so they can take a look?

    Regards,

    Daniel

  • Daniel,

    Ok, I send the files from my PC and my laptop, my Desktop has Windows 10 Pro and my Laptop Windows 7 Professonal.

    Regards, Christian.

    Log_laptop.txt

    Log_PC.txt
    **** Build of configuration Release for project ns_node_CC1352R1_LAUNCHXL_tirtos_ticlang ****
    
    "C:\\ti\\ccs1040\\ccs\\utils\\bin\\gmake" -k -j 16 all -O 
     
    making ../src/sysbios/rom_sysbios.am4f ...
    Building file: "../release.cfg"
    gmake[1]: Entering directory 'C:/Users/PCB CHRISTIAN/workspace_v10/ns_node_CC1352R1_LAUNCHXL_tirtos_ticlang/src/sysbios'
    gmake[1]: Leaving directory 'C:/Users/PCB CHRISTIAN/workspace_v10/ns_node_CC1352R1_LAUNCHXL_tirtos_ticlang/src/sysbios'
    Invoking: XDCtools
    "C:/ti/ccs1040/xdctools_3_62_01_15_core/xs" --xdcpath="C:/ti/simplelink_cc13x2_26x2_sdk_5_20_00_52/source;C:/ti/simplelink_cc13x2_26x2_sdk_5_20_00_52/kernel/tirtos/packages;" xdc.tools.configuro -o configPkg -t ti.targets.arm.clang.M4F -p ti.platforms.simplelink:CC1352R1F3 -r release -c "C:/ti/ccs1040/ccs/tools/compiler/ti-cgt-armllvm_1.3.0.LTS" --compileOptions "-mcpu=cortex-m4 -mfloat-abi=hard -mfpu=fpv4-sp-d16 -mlittle-endian -mthumb -Oz -I\"C:/Users/PCB CHRISTIAN/workspace_v10/ns_node_CC1352R1_LAUNCHXL_tirtos_ticlang\" -I\"C:/Users/PCB CHRISTIAN/workspace_v10/ns_node_CC1352R1_LAUNCHXL_tirtos_ticlang/Release\" -I\"C:/ti/simplelink_cc13x2_26x2_sdk_5_20_00_52/source/ti/ti_wisunfan/mbed_port/ti-rf-driver/source\" -I\"C:/ti/simplelink_cc13x2_26x2_sdk_5_20_00_52/source/ti/ti_wisunfan/mbed_port/mbednanostack2tirtos\" -I\"C:/ti/simplelink_cc13x2_26x2_sdk_5_20_00_52/source/ti/ti_wisunfan/mbed_port/mbednanostack2tirtos/platform\" -I\"C:/ti/simplelink_cc13x2_26x2_sdk_5_20_00_52/source/ti/ti_wisunfan/mbed_port/mbedtls2tirtos\" -I\"C:/ti/simplelink_cc13x2_26x2_sdk_5_20_00_52/source/ti/ti_wisunfan/mbed_port/mbedtls2tirtos/platform\" -I\"C:/ti/simplelink_cc13x2_26x2_sdk_5_20_00_52/source/ti/ti_wisunfan/mbed_port/mbedtls2tirtos/mbedtls/mbed-crypto\" -I\"C:/ti/simplelink_cc13x2_26x2_sdk_5_20_00_52/source/third_party/mbed/frameworks/nanostack-libservice/mbed-client-libservice\" -I\"C:/ti/simplelink_cc13x2_26x2_sdk_5_20_00_52/source/third_party/mbed/frameworks/nanostack-libservice\" -I\"C:/ti/simplelink_cc13x2_26x2_sdk_5_20_00_52/source/third_party/mbed/frameworks/nanostack-libservice/mbed-client-libservice/platform\" -I\"C:/ti/simplelink_cc13x2_26x2_sdk_5_20_00_52/source/third_party/mbed/frameworks/mbed-client-randlib/mbed-client-randlib/platform\" -I\"C:/ti/simplelink_cc13x2_26x2_sdk_5_20_00_52/source/third_party/mbed/frameworks/mbed-client-randlib/mbed-client-randlib\" -I\"C:/ti/simplelink_cc13x2_26x2_sdk_5_20_00_52/source/third_party/mbed/frameworks/mbed-client-randlib\" -I\"C:/ti/simplelink_cc13x2_26x2_sdk_5_20_00_52/source/third_party/mbed/frameworks/mbed-trace\" -I\"C:/ti/simplelink_cc13x2_26x2_sdk_5_20_00_52/source/third_party/mbed/frameworks/mbed-coap\" -I\"C:/ti/simplelink_cc13x2_26x2_sdk_5_20_00_52/source/third_party/mbed/frameworks/mbed-coap/source/include\" -I\"C:/ti/simplelink_cc13x2_26x2_sdk_5_20_00_52/source/third_party/mbed/nanostack/sal-stack-nanostack\" -I\"C:/ti/simplelink_cc13x2_26x2_sdk_5_20_00_52/source/third_party/mbed/nanostack/sal-stack-nanostack/source\" -I\"C:/ti/simplelink_cc13x2_26x2_sdk_5_20_00_52/source/third_party/mbed/nanostack/sal-stack-nanostack/nanostack\" -I\"C:/ti/simplelink_cc13x2_26x2_sdk_5_20_00_52/source/third_party/mbed/nanostack/sal-stack-nanostack/source/Service_Libs/mdns\" -I\"C:/ti/simplelink_cc13x2_26x2_sdk_5_20_00_52/source/third_party/mbed/nanostack/sal-stack-nanostack/source/Service_Libs/mdns/fnet\" -I\"C:/ti/simplelink_cc13x2_26x2_sdk_5_20_00_52/source/third_party/mbed/nanostack/sal-stack-nanostack/source/Service_Libs/mdns/fnet/fnet_stack\" -I\"C:/ti/simplelink_cc13x2_26x2_sdk_5_20_00_52/source/third_party/mbed/nanostack/sal-stack-nanostack/source/Service_Libs/mdns/fnet/fnet_stack/stack\" -I\"C:/ti/simplelink_cc13x2_26x2_sdk_5_20_00_52/source/third_party/mbed/nanostack/sal-stack-nanostack/source/Service_Libs/mdns/fnet/fnet_stack/services/serial\" -I\"C:/ti/simplelink_cc13x2_26x2_sdk_5_20_00_52/source/third_party/mbed/nanostack/sal-stack-nanostack/source/Core/include\" -I\"C:/ti/simplelink_cc13x2_26x2_sdk_5_20_00_52/source/third_party/mbed/nanostack/sal-stack-nanostack/source/6LowPAN\" -I\"C:/ti/simplelink_cc13x2_26x2_sdk_5_20_00_52/source/third_party/mbed/nanostack/sal-stack-nanostack-eventloop\" -I\"C:/ti/simplelink_cc13x2_26x2_sdk_5_20_00_52/source/third_party/mbed/nanostack/sal-stack-nanostack-eventloop/nanostack-event-loop\" -I\"C:/ti/simplelink_cc13x2_26x2_sdk_5_20_00_52/source/third_party/mbed/nanostack/sal-stack-nanostack-eventloop/nanostack-event-loop/platform\" -I\"C:/ti/simplelink_cc13x2_26x2_sdk_5_20_00_52/source/third_party/mbed/nanostack/nanostack-hal-mbed-cmsis-rtos\" -I\"C:/ti/simplelink_cc13x2_26x2_sdk_5_20_00_52/source/third_party/mbed/nanostack/mbed-mesh-api/source/include\" -I\"C:/ti/simplelink_cc13x2_26x2_sdk_5_20_00_52/source/third_party/mbed/nanostack/mbed-mesh-api/mbed-mesh-api\" -I\"C:/ti/simplelink_cc13x2_26x2_sdk_5_20_00_52/source/third_party/mbed/nanostack/mbed-mesh-api\" -I\"C:/ti/simplelink_cc13x2_26x2_sdk_5_20_00_52/source/third_party/mbed/nanostack/coap-service/coap-service\" -I\"C:/ti/simplelink_cc13x2_26x2_sdk_5_20_00_52/source/third_party/mbed/nanostack/coap-service/source/include\" -I\"C:/ti/simplelink_cc13x2_26x2_sdk_5_20_00_52/source/third_party/ti_wisunfan/mbedtls/inc\" -I\"C:/ti/simplelink_cc13x2_26x2_sdk_5_20_00_52/source/third_party/ti_wisunfan/mbedtls\" -I\"C:/ti/simplelink_cc13x2_26x2_sdk_5_20_00_52/source/third_party/ti_wisunfan/mbedtls/platform/inc\" -I\"C:/ti/simplelink_cc13x2_26x2_sdk_5_20_00_52/source/third_party/ti_wisunfan/mbedtls/platform/COMPONENT_PSA_SRV_IMPL/COMPONENT_NSPE\" -I\"C:/ti/simplelink_cc13x2_26x2_sdk_5_20_00_52/source/ti/ti_wisunfan\" -I\"C:/ti/simplelink_cc13x2_26x2_sdk_5_20_00_52/source/ti/ti_wisunfan/shell\" -I\"C:/ti/simplelink_cc13x2_26x2_sdk_5_20_00_52/source/ti/ti_wisunfan/config\" -I\"C:/ti/simplelink_cc13x2_26x2_sdk_5_20_00_52/source/ti/ti_wisunfan/uip\" -I\"C:/ti/simplelink_cc13x2_26x2_sdk_5_20_00_52/source/ti/ti_wisunfan/uip/conf\" -I\"C:/ti/simplelink_cc13x2_26x2_sdk_5_20_00_52/source/ti/ti_wisunfan/uip/inc\" -I\"C:/ti/simplelink_cc13x2_26x2_sdk_5_20_00_52/source/ti/ti_wisunfan/uip/pltfrm/sysbios\" -I\"C:/ti/simplelink_cc13x2_26x2_sdk_5_20_00_52/source/ti/ti_wisunfan/uip/net\" -I\"C:/ti/simplelink_cc13x2_26x2_sdk_5_20_00_52/source/ti/ti_wisunfan/wisunfan_mac/services\" -I\"C:/ti/simplelink_cc13x2_26x2_sdk_5_20_00_52/source/ti/ti_wisunfan/wisunfan_mac/hal/assert\" -I\"C:/ti/simplelink_cc13x2_26x2_sdk_5_20_00_52/source/ti/ti_wisunfan/wisunfan_mac/hal/appasrt\" -I\"C:/ti/simplelink_cc13x2_26x2_sdk_5_20_00_52/source/ti/ti_wisunfan/wisunfan_mac/hal/crypto\" -I\"C:/ti/simplelink_cc13x2_26x2_sdk_5_20_00_52/source/ti/ti_wisunfan/wisunfan_mac/hal/platform\" -I\"C:/ti/simplelink_cc13x2_26x2_sdk_5_20_00_52/source/ti/ti_wisunfan/wisunfan_mac/hal/rf\" -I\"C:/ti/simplelink_cc13x2_26x2_sdk_5_20_00_52/source/ti/ti_wisunfan/wisunfan_mac/high_level\" -I\"C:/ti/simplelink_cc13x2_26x2_sdk_5_20_00_52/source/ti/ti_wisunfan/wisunfan_mac/low_level\" -I\"C:/ti/simplelink_cc13x2_26x2_sdk_5_20_00_52/source/ti/ti_wisunfan/wisunfan_mac/common/osal_port\" -I\"C:/ti/simplelink_cc13x2_26x2_sdk_5_20_00_52/source/ti/ti_wisunfan/wisunfan_mac/common\" -I\"C:/ti/simplelink_cc13x2_26x2_sdk_5_20_00_52/source/ti/ti_wisunfan/wisunfan_mac/common/boards\" -I\"C:/ti/simplelink_cc13x2_26x2_sdk_5_20_00_52/source/ti/ti_wisunfan/wisunfan_mac/common/util\" -I\"C:/ti/simplelink_cc13x2_26x2_sdk_5_20_00_52/source/ti/ti_wisunfan/wisunfan_mac/common/inc\" -I\"C:/ti/simplelink_cc13x2_26x2_sdk_5_20_00_52/source/ti/ti_wisunfan/wisunfan_mac/common/stack/src\" -I\"C:/ti/simplelink_cc13x2_26x2_sdk_5_20_00_52/source/ti/ti_wisunfan/wisunfan_mac/common/stack/tirtos/inc\" -I\"C:/ti/simplelink_cc13x2_26x2_sdk_5_20_00_52/source/ti/ti_wisunfan/wisunfan_mac/common/heapmgr\" -I\"C:/ti/simplelink_cc13x2_26x2_sdk_5_20_00_52/source/ti/ti_wisunfan/wisunfan_mac/services/saddr\" -I\"C:/ti/simplelink_cc13x2_26x2_sdk_5_20_00_52/source/ti/ti_wisunfan/wisunfan_mac/services/sdata\" -I\"C:/ti/simplelink_cc13x2_26x2_sdk_5_20_00_52/source/ti/ti_wisunfan/wisunfan_mac/fh\" -I\"C:/ti/simplelink_cc13x2_26x2_sdk_5_20_00_52/source/ti/ti_wisunfan/wisunfan_mac/inc\" -I\"C:/ti/simplelink_cc13x2_26x2_sdk_5_20_00_52/source/ti/ti_wisunfan/wisunfan_mac/rom\" -I\"C:/ti/simplelink_cc13x2_26x2_sdk_5_20_00_52/source/ti/ti_wisunfan/wisunfan_mac/inc/cc13xx\" -I\"C:/ti/simplelink_cc13x2_26x2_sdk_5_20_00_52/source/ti/ti_wisunfan/wisunfan_mac/low_level/cc13xx\" -I\"C:/ti/simplelink_cc13x2_26x2_sdk_5_20_00_52/source/ti/ti_wisunfan/wisunfan_mac/tracer\" -I\"C:/ti/simplelink_cc13x2_26x2_sdk_5_20_00_52/source/third_party/mbed/nanostack/mbed-mesh-api/source\" -I\"C:/ti/simplelink_cc13x2_26x2_sdk_5_20_00_52/source/third_party/mbed/nanostack/sal-stack-nanostack/source/6LoWPAN/MAC\" -I\"C:/ti/simplelink_cc13x2_26x2_sdk_5_20_00_52/source/third_party/mbed/nanostack/sal-stack-nanostack/source/6LoWPAN/Thread\" -I\"C:/ti/simplelink_cc13x2_26x2_sdk_5_20_00_52/source/third_party/mbed/nanostack/sal-stack-nanostack/source/Security/PANA\" -I\"C:/ti/simplelink_cc13x2_26x2_sdk_5_20_00_52/source/third_party/mbed/nanostack/sal-stack-nanostack/source/Service_Libs/mdns/fnet/fnet_stack/services/mdns\" -I\"C:/ti/simplelink_cc13x2_26x2_sdk_5_20_00_52/source/third_party/mbed/nanostack/sal-stack-nanostack/source/Service_Libs/fnv_hash\" -I\"C:/ti/simplelink_cc13x2_26x2_sdk_5_20_00_52/source/third_party/mbed/nanostack/sal-stack-nanostack/source/Service_Libs/hmac\" -I\"C:/ti/simplelink_cc13x2_26x2_sdk_5_20_00_52/source/third_party/mbed/nanostack/sal-stack-nanostack/source/Service_Libs/load_balance\" -I\"C:/ti/simplelink_cc13x2_26x2_sdk_5_20_00_52/source/third_party/mbed/nanostack/sal-stack-nanostack/source/libNET/src\" -I\"C:/ti/simplelink_cc13x2_26x2_sdk_5_20_00_52/source/third_party/mbed/nanostack/sal-stack-nanostack-eventloop/source\" -I\"C:/ti/simplelink_cc13x2_26x2_sdk_5_20_00_52/source/third_party/ti_wisunfan/mbedtls/platform/COMPONENT_PSA_SRV_IMPL\" -I\"C:/ti/simplelink_cc13x2_26x2_sdk_5_20_00_52/source/third_party/mbed/nanostack/sal-stack-nanostack/source/Service_Libs/whiteboard\" -I\"C:/ti/simplelink_cc13x2_26x2_sdk_5_20_00_52/source/third_party/mbed/nanostack/sal-stack-nanostack/source/6LoWPAN/ws\" -I\"C:/ti/simplelink_cc13x2_26x2_sdk_5_20_00_52/source/third_party/mbed/nanostack/sal-stack-nanostack/source/DHCPv6_client\" -I\"C:/ti/simplelink_cc13x2_26x2_sdk_5_20_00_52/source/third_party/mbed/nanostack/sal-stack-nanostack/source/libDHCPv6\" -I\"C:/ti/simplelink_cc13x2_26x2_sdk_5_20_00_52/source/third_party/mbed/nanostack/sal-stack-nanostack/source/Service_Libs/utils\" -I\"C:/ti/simplelink_cc13x2_26x2_sdk_5_20_00_52/source/third_party/mbed/nanostack/sal-stack-nanostack/source/Service_Libs/pan_blacklist\" -I\"C:/ti/simplelink_cc13x2_26x2_sdk_5_20_00_52/source/third_party/mbed/nanostack/sal-stack-nanostack/source/Common_Protocols\" -I\"C:/ti/simplelink_cc13x2_26x2_sdk_5_20_00_52/source/ti/posix/ticlang\" -I\"C:/ti/simplelink_cc13x2_26x2_sdk_5_20_00_52/source/ti/ti_wisunfan/ncp_interface/config\" -I\"C:/ti/simplelink_cc13x2_26x2_sdk_5_20_00_52/source/ti/ti_wisunfan/ncp_interface/include\" -I\"C:/ti/simplelink_cc13x2_26x2_sdk_5_20_00_52/source/ti/ti_wisunfan/ncp_interface/src\" -I\"C:/ti/simplelink_cc13x2_26x2_sdk_5_20_00_52/source/ti/ti_wisunfan/ncp_interface/src/core\" -I\"C:/ti/simplelink_cc13x2_26x2_sdk_5_20_00_52/source/ti/ti_wisunfan/ncp_interface/src/core/utils\" -I\"C:/ti/simplelink_cc13x2_26x2_sdk_5_20_00_52/source/ti/ti_wisunfan/ncp_interface/examples/platforms\" -I\"C:/ti/simplelink_cc13x2_26x2_sdk_5_20_00_52/source/ti/ti_wisunfan/ncp_interface/examples/ncp_ftd\" -I\"C:/ti/simplelink_cc13x2_26x2_sdk_5_20_00_52/source/ti/ti_wisunfan/ncp_interface/examples/ncp_ftd/platform\" -I\"C:/ti/simplelink_cc13x2_26x2_sdk_5_20_00_52/source/ti/ti_wisunfan/ncp_interface/src/core/thread\" -I\"C:/ti/simplelink_cc13x2_26x2_sdk_5_20_00_52/source/ti/ti_wisunfan/ncp_interface/src/ncp\" -I\"C:/ti/simplelink_cc13x2_26x2_sdk_5_20_00_52/source/ti/ti_wisunfan/ncp_interface/examples/ncp_ftd/platform/nv\" -I\"C:/ti/simplelink_cc13x2_26x2_sdk_5_20_00_52/source/ti/ti_wisunfan/wisunfan_mac/low_level/cc13xx/combo\" -I\"C:/ti/simplelink_cc13x2_26x2_sdk_5_20_00_52/source/ti/ti_wisunfan/mbed_port/ti-rf-driver/ti-rf-driver\" -I\"C:/ti/simplelink_cc13x2_26x2_sdk_5_20_00_52/source/ti/ti_wisunfan/apps/udp_nanostack_mesh_tirf\" -I\"C:/ti/simplelink_cc13x2_26x2_sdk_5_20_00_52/source/ti/ti_wisunfan/apps/common/include\" -I\"C:/ti/simplelink_cc13x2_26x2_sdk_5_20_00_52/source/ti/common/nv\" -I\"C:/ti/simplelink_cc13x2_26x2_sdk_5_20_00_52/source/ti/ti_wisunfan/mbed_config/ws_router\" -I\"C:/ti/simplelink_cc13x2_26x2_sdk_5_20_00_52/source/ti/devices/cc13x2_cc26x2\" -I\"C:/ti/simplelink_cc13x2_26x2_sdk_5_20_00_52/source/ti/devices/cc13x2_cc26x2/inc\" -I\"C:/ti/simplelink_cc13x2_26x2_sdk_5_20_00_52/source/ti/devices/cc13x2_cc26x2/driverlib\" -DEXCLUDE_TRACE -DxSWITCH_NCP_TO_TRACE -DTLS_SEC_PROT_LIB_USE_MBEDTLS_PLATFORM_MEMORY -DxWISUN_AUTO_START -DTI_WISUN_FAN_DEBUG -DWISUN_NCP_ENABLE -DBoard_EXCLUDE_NVS_EXTERNAL_FLASH -DDeviceFamily_CC13X2 -gdwarf-3 -fdiagnostics-show-option -fshort-enums -munaligned-access -funsigned-char -fcommon -ffunction-sections -include mbed_config.h -fshort-wchar -fno-strict-aliasing -march=armv7e-m  " "../release.cfg"
    gmake[1]: Entering directory 'C:/Users/PCB CHRISTIAN/workspace_v10/ns_node_CC1352R1_LAUNCHXL_tirtos_ticlang/src/sysbios'
    clm4f C:/Users/PCB ...
    gmake[1]: Leaving directory 'C:/Users/PCB CHRISTIAN/workspace_v10/ns_node_CC1352R1_LAUNCHXL_tirtos_ticlang/src/sysbios'
    ../src/makefile.libs:56: recipe for target '../src/sysbios/rom_sysbios.am4f' failed
    makefile:82: warning: overriding recipe for target 'Users_PCB.o'
    makefile:67: warning: ignoring old recipe for target 'Users_PCB.o'
    makefile:91: warning: overriding recipe for target 'Users_PCB.o'
    makefile:82: warning: ignoring old recipe for target 'Users_PCB.o'
    makefile:100: warning: overriding recipe for target 'Users_PCB.o'
    makefile:91: warning: ignoring old recipe for target 'Users_PCB.o'
    makefile:109: warning: overriding recipe for target 'Users_PCB.o'
    makefile:100: warning: ignoring old recipe for target 'Users_PCB.o'
    makefile:118: warning: overriding recipe for target 'Users_PCB.o'
    makefile:109: warning: ignoring old recipe for target 'Users_PCB.o'
    makefile:127: warning: overriding recipe for target 'Users_PCB.o'
    makefile:118: warning: ignoring old recipe for target 'Users_PCB.o'
    makefile:133: warning: overriding recipe for target 'Users_PCB.o'
    makefile:127: warning: ignoring old recipe for target 'Users_PCB.o'
    makefile:139: warning: overriding recipe for target 'Users_PCB.o'
    makefile:133: warning: ignoring old recipe for target 'Users_PCB.o'
    makefile:145: warning: overriding recipe for target 'Users_PCB.o'
    makefile:139: warning: ignoring old recipe for target 'Users_PCB.o'
    makefile:151: warning: overriding recipe for target 'Users_PCB.o'
    makefile:145: warning: ignoring old recipe for target 'Users_PCB.o'
    makefile:160: warning: overriding recipe for target 'Users_PCB.o'
    makefile:151: warning: ignoring old recipe for target 'Users_PCB.o'
    makefile:169: warning: overriding recipe for target 'Users_PCB.o'
    makefile:160: warning: ignoring old recipe for target 'Users_PCB.o'
    makefile:184: warning: overriding recipe for target 'Users_PCB.o'
    makefile:169: warning: ignoring old recipe for target 'Users_PCB.o'
    makefile:193: warning: overriding recipe for target 'Users_PCB.o'
    makefile:184: warning: ignoring old recipe for target 'Users_PCB.o'
    makefile:208: warning: overriding recipe for target 'Users_PCB.o'
    makefile:193: warning: ignoring old recipe for target 'Users_PCB.o'
    makefile:217: warning: overriding recipe for target 'Users_PCB.o'
    makefile:208: warning: ignoring old recipe for target 'Users_PCB.o'
    makefile:226: warning: overriding recipe for target 'Users_PCB.o'
    makefile:217: warning: ignoring old recipe for target 'Users_PCB.o'
    makefile:235: warning: overriding recipe for target 'Users_PCB.o'
    makefile:226: warning: ignoring old recipe for target 'Users_PCB.o'
    makefile:244: warning: overriding recipe for target 'Users_PCB.o'
    makefile:235: warning: ignoring old recipe for target 'Users_PCB.o'
    makefile:253: warning: overriding recipe for target 'Users_PCB.o'
    makefile:244: warning: ignoring old recipe for target 'Users_PCB.o'
    makefile:265: warning: overriding recipe for target 'Users_PCB.o'
    makefile:253: warning: ignoring old recipe for target 'Users_PCB.o'
    makefile:301: warning: overriding recipe for target 'Users_PCB.o'
    makefile:265: warning: ignoring old recipe for target 'Users_PCB.o'
    makefile:316: warning: overriding recipe for target 'Users_PCB.o'
    makefile:301: warning: ignoring old recipe for target 'Users_PCB.o'
    makefile:334: warning: overriding recipe for target 'Users_PCB.o'
    makefile:316: warning: ignoring old recipe for target 'Users_PCB.o'
    makefile:343: warning: overriding recipe for target 'Users_PCB.o'
    makefile:334: warning: ignoring old recipe for target 'Users_PCB.o'
    makefile:355: warning: overriding recipe for target 'Users_PCB.o'
    makefile:343: warning: ignoring old recipe for target 'Users_PCB.o'
    makefile:361: warning: overriding recipe for target 'Users_PCB.o'
    makefile:355: warning: ignoring old recipe for target 'Users_PCB.o'
    makefile:367: warning: overriding recipe for target 'Users_PCB.o'
    makefile:361: warning: ignoring old recipe for target 'Users_PCB.o'
    makefile:373: warning: overriding recipe for target 'Users_PCB.o'
    makefile:367: warning: ignoring old recipe for target 'Users_PCB.o'
    gmake[1]: *** No rule to make target 'CHRISTIAN/workspace_v10/ns_node_CC1352R1_LAUNCHXL_tirtos_ticlang/Release/configPkg/package/cfg/release_pm4f_ti_sysbios_knl_Clock_config.c', needed by 'cfg_release_pm4f_ti_sysbios_knl_Clock_config.o'.
    gmake[1]: *** No rule to make target 'CHRISTIAN/workspace_v10/ns_node_CC1352R1_LAUNCHXL_tirtos_ticlang/Release/configPkg/package/cfg/release_pm4f_ti_sysbios_knl_Event_config.c', needed by 'cfg_release_pm4f_ti_sysbios_knl_Event_config.o'.
    gmake[1]: *** No rule to make target 'CHRISTIAN/workspace_v10/ns_node_CC1352R1_LAUNCHXL_tirtos_ticlang/Release/configPkg/package/cfg/release_pm4f_ti_sysbios_knl_Mailbox_config.c', needed by 'cfg_release_pm4f_ti_sysbios_knl_Mailbox_config.o'.
    gmake[1]: *** No rule to make target 'CHRISTIAN/workspace_v10/ns_node_CC1352R1_LAUNCHXL_tirtos_ticlang/Release/configPkg/package/cfg/release_pm4f_ti_sysbios_knl_Queue_config.c', needed by 'cfg_release_pm4f_ti_sysbios_knl_Queue_config.o'.
    gmake[1]: *** No rule to make target 'CHRISTIAN/workspace_v10/ns_node_CC1352R1_LAUNCHXL_tirtos_ticlang/Release/configPkg/package/cfg/release_pm4f_ti_sysbios_knl_Semaphore_config.c', needed by 'cfg_release_pm4f_ti_sysbios_knl_Semaphore_config.o'.
    gmake[1]: *** No rule to make target 'CHRISTIAN/workspace_v10/ns_node_CC1352R1_LAUNCHXL_tirtos_ticlang/Release/configPkg/package/cfg/release_pm4f_ti_sysbios_knl_Swi_config.c', needed by 'cfg_release_pm4f_ti_sysbios_knl_Swi_config.o'.
    gmake[1]: *** No rule to make target 'CHRISTIAN/workspace_v10/ns_node_CC1352R1_LAUNCHXL_tirtos_ticlang/Release/configPkg/package/cfg/release_pm4f_ti_sysbios_knl_Task_config.c', needed by 'cfg_release_pm4f_ti_sysbios_knl_Task_config.o'.
    gmake[1]: *** No rule to make target 'CHRISTIAN/workspace_v10/ns_node_CC1352R1_LAUNCHXL_tirtos_ticlang/Release/configPkg/package/cfg/release_pm4f_ti_sysbios_knl_Clock_TimerProxy_config.c', needed by 'cfg_release_pm4f_ti_sysbios_knl_Clock_TimerProxy_config.o'.
    gmake[1]: *** No rule to make target 'CHRISTIAN/workspace_v10/ns_node_CC1352R1_LAUNCHXL_tirtos_ticlang/Release/configPkg/package/cfg/release_pm4f_ti_sysbios_knl_Task_SupportProxy_config.c', needed by 'cfg_release_pm4f_ti_sysbios_knl_Task_SupportProxy_config.o'.
    gmake[1]: *** No rule to make target 'CHRISTIAN/workspace_v10/ns_node_CC1352R1_LAUNCHXL_tirtos_ticlang/Release/configPkg/package/cfg/release_pm4f_ti_sysbios_BIOS_config.c', needed by 'cfg_release_pm4f_ti_sysbios_BIOS_config.o'.
    gmake[1]: *** No rule to make target 'CHRISTIAN/workspace_v10/ns_node_CC1352R1_LAUNCHXL_tirtos_ticlang/Release/configPkg/package/cfg/release_pm4f_ti_sysbios_BIOS_RtsGateProxy_config.c', needed by 'cfg_release_pm4f_ti_sysbios_BIOS_RtsGateProxy_config.o'.
    gmake[1]: *** No rule to make target 'CHRISTIAN/workspace_v10/ns_node_CC1352R1_LAUNCHXL_tirtos_ticlang/Release/configPkg/package/cfg/release_pm4f_ti_sysbios_family_arm_m3_Hwi_config.c', needed by 'cfg_release_pm4f_ti_sysbios_family_arm_m3_Hwi_config.o'.
    gmake[1]: *** No rule to make target 'CHRISTIAN/workspace_v10/ns_node_CC1352R1_LAUNCHXL_tirtos_ticlang/Release/configPkg/package/cfg/release_pm4f_ti_sysbios_family_arm_m3_TaskSupport_config.c', needed by 'cfg_release_pm4f_ti_sysbios_family_arm_m3_TaskSupport_config.o'.
    gmake[1]: *** No rule to make target 'CHRISTIAN/workspace_v10/ns_node_CC1352R1_LAUNCHXL_tirtos_ticlang/Release/configPkg/package/cfg/release_pm4f_ti_sysbios_family_arm_cc26xx_Timer_config.c', needed by 'cfg_release_pm4f_ti_sysbios_family_arm_cc26xx_Timer_config.o'.
    gmake[1]: *** No rule to make target 'CHRISTIAN/workspace_v10/ns_node_CC1352R1_LAUNCHXL_tirtos_ticlang/Release/configPkg/package/cfg/release_pm4f_ti_sysbios_family_arm_cc26xx_TimestampProvider_config.c', needed by 'cfg_release_pm4f_ti_sysbios_family_arm_cc26xx_TimestampProvider_config.o'.
    gmake[1]: *** No rule to make target 'CHRISTIAN/workspace_v10/ns_node_CC1352R1_LAUNCHXL_tirtos_ticlang/Release/configPkg/package/cfg/release_pm4f_ti_sysbios_hal_Hwi_config.c', needed by 'cfg_release_pm4f_ti_sysbios_hal_Hwi_config.o'.
    gmake[1]: *** No rule to make target 'CHRISTIAN/workspace_v10/ns_node_CC1352R1_LAUNCHXL_tirtos_ticlang/Release/configPkg/package/cfg/release_pm4f_ti_sysbios_hal_Hwi_HwiProxy_config.c', needed by 'cfg_release_pm4f_ti_sysbios_hal_Hwi_HwiProxy_config.o'.
    gmake[1]: *** No rule to make target 'CHRISTIAN/workspace_v10/ns_node_CC1352R1_LAUNCHXL_tirtos_ticlang/Release/configPkg/package/cfg/release_pm4f_ti_sysbios_heaps_HeapMem_config.c', needed by 'cfg_release_pm4f_ti_sysbios_heaps_HeapMem_config.o'.
    gmake[1]: *** No rule to make target 'CHRISTIAN/workspace_v10/ns_node_CC1352R1_LAUNCHXL_tirtos_ticlang/Release/configPkg/package/cfg/release_pm4f_ti_sysbios_heaps_HeapTrack_config.c', needed by 'cfg_release_pm4f_ti_sysbios_heaps_HeapTrack_config.o'.
    gmake[1]: *** No rule to make target 'CHRISTIAN/workspace_v10/ns_node_CC1352R1_LAUNCHXL_tirtos_ticlang/Release/configPkg/package/cfg/release_pm4f_ti_sysbios_heaps_HeapMem_Module_GateProxy_config.c', needed by 'cfg_release_pm4f_ti_sysbios_heaps_HeapMem_Module_GateProxy_config.o'.
    gmake[1]: *** No rule to make target 'CHRISTIAN/workspace_v10/ns_node_CC1352R1_LAUNCHXL_tirtos_ticlang/Release/configPkg/package/cfg/release_pm4f_ti_sysbios_gates_GateHwi_config.c', needed by 'cfg_release_pm4f_ti_sysbios_gates_GateHwi_config.o'.
    gmake[1]: *** No rule to make target 'CHRISTIAN/workspace_v10/ns_node_CC1352R1_LAUNCHXL_tirtos_ticlang/Release/configPkg/package/cfg/release_pm4f_ti_sysbios_gates_GateMutex_config.c', needed by 'cfg_release_pm4f_ti_sysbios_gates_GateMutex_config.o'.
    gmake[1]: *** No rule to make target 'CHRISTIAN/workspace_v10/ns_node_CC1352R1_LAUNCHXL_tirtos_ticlang/Release/configPkg/package/cfg/release_pm4f_xdc_runtime_Error_config.c', needed by 'cfg_release_pm4f_xdc_runtime_Error_config.o'.
    gmake[1]: *** No rule to make target 'CHRISTIAN/workspace_v10/ns_node_CC1352R1_LAUNCHXL_tirtos_ticlang/Release/configPkg/package/cfg/release_pm4f_xdc_runtime_Memory_config.c', needed by 'cfg_release_pm4f_xdc_runtime_Memory_config.o'.
    gmake[1]: *** No rule to make target 'CHRISTIAN/workspace_v10/ns_node_CC1352R1_LAUNCHXL_tirtos_ticlang/Release/configPkg/package/cfg/release_pm4f_xdc_runtime_System_config.c', needed by 'cfg_release_pm4f_xdc_runtime_System_config.o'.
    gmake[1]: *** No rule to make target 'CHRISTIAN/workspace_v10/ns_node_CC1352R1_LAUNCHXL_tirtos_ticlang/Release/configPkg/package/cfg/release_pm4f_xdc_runtime_SysCallback_config.c', needed by 'cfg_release_pm4f_xdc_runtime_SysCallback_config.o'.
    gmake[1]: *** No rule to make target 'CHRISTIAN/workspace_v10/ns_node_CC1352R1_LAUNCHXL_tirtos_ticlang/Release/configPkg/package/cfg/release_pm4f_xdc_runtime_Timestamp_config.c', needed by 'cfg_release_pm4f_xdc_runtime_Timestamp_config.o'.
    gmake[1]: *** No rule to make target 'CHRISTIAN/workspace_v10/ns_node_CC1352R1_LAUNCHXL_tirtos_ticlang/Release/configPkg/package/cfg/release_pm4f_xdc_runtime_Memory_HeapProxy_config.c', needed by 'cfg_release_pm4f_xdc_runtime_Memory_HeapProxy_config.o'.
    gmake[1]: *** No rule to make target 'CHRISTIAN/workspace_v10/ns_node_CC1352R1_LAUNCHXL_tirtos_ticlang/Release/configPkg/package/cfg/release_pm4f_xdc_runtime_System_Module_GateProxy_config.c', needed by 'cfg_release_pm4f_xdc_runtime_System_Module_GateProxy_config.o'.
    gmake[1]: *** No rule to make target 'CHRISTIAN/workspace_v10/ns_node_CC1352R1_LAUNCHXL_tirtos_ticlang/Release/configPkg/package/cfg/release_pm4f_xdc_runtime_Timestamp_SupportProxy_config.c', needed by 'cfg_release_pm4f_xdc_runtime_Timestamp_SupportProxy_config.o'.
    tiarmclang: warning: C:/Users/PCB: 'linker' input unused [-Wunused-command-line-argument]
    tiarmclang: warning: argument unused during compilation: '-mcpu=cortex-m4' [-Wunused-command-line-argument]
    tiarmclang: warning: argument unused during compilation: '-mfloat-abi=hard' [-Wunused-command-line-argument]
    tiarmclang: warning: argument unused during compilation: '-mfpu=fpv4-sp-d16' [-Wunused-command-line-argument]
    tiarmclang: warning: argument unused during compilation: '-mthumb' [-Wunused-command-line-argument]
    tiarmclang: warning: argument unused during compilation: '-Oz' [-Wunused-command-line-argument]
    tiarmclang: warning: argument unused during compilation: '-I C:/Users/PCB CHRISTIAN/workspace_v10/ns_node_CC1352R1_LAUNCHXL_tirtos_ticlang' [-Wunused-command-line-argument]
    tiarmclang: warning: argument unused during compilation: '-I C:/Users/PCB CHRISTIAN/workspace_v10/ns_node_CC1352R1_LAUNCHXL_tirtos_ticlang/Release' [-Wunused-command-line-argument]
    tiarmclang: warning: argument unused during compilation: '-I C:/ti/simplelink_cc13x2_26x2_sdk_5_20_00_52/source/ti/ti_wisunfan/mbed_port/ti-rf-driver/source' [-Wunused-command-line-argument]
    tiarmclang: warning: argument unused during compilation: '-I C:/ti/simplelink_cc13x2_26x2_sdk_5_20_00_52/source/ti/ti_wisunfan/mbed_port/mbednanostack2tirtos' [-Wunused-command-line-argument]
    tiarmclang: warning: argument unused during compilation: '-I C:/ti/simplelink_cc13x2_26x2_sdk_5_20_00_52/source/ti/ti_wisunfan/mbed_port/mbednanostack2tirtos/platform' [-Wunused-command-line-argument]
    tiarmclang: warning: argument unused during compilation: '-I C:/ti/simplelink_cc13x2_26x2_sdk_5_20_00_52/source/ti/ti_wisunfan/mbed_port/mbedtls2tirtos' [-Wunused-command-line-argument]
    tiarmclang: warning: argument unused during compilation: '-I C:/ti/simplelink_cc13x2_26x2_sdk_5_20_00_52/source/ti/ti_wisunfan/mbed_port/mbedtls2tirtos/platform' [-Wunused-command-line-argument]
    tiarmclang: warning: argument unused during compilation: '-I C:/ti/simplelink_cc13x2_26x2_sdk_5_20_00_52/source/ti/ti_wisunfan/mbed_port/mbedtls2tirtos/mbedtls/mbed-crypto' [-Wunused-command-line-argument]
    tiarmclang: warning: argument unused during compilation: '-I C:/ti/simplelink_cc13x2_26x2_sdk_5_20_00_52/source/third_party/mbed/frameworks/nanostack-libservice/mbed-client-libservice' [-Wunused-command-line-argument]
    tiarmclang: warning: argument unused during compilation: '-I C:/ti/simplelink_cc13x2_26x2_sdk_5_20_00_52/source/third_party/mbed/frameworks/nanostack-libservice' [-Wunused-command-line-argument]
    tiarmclang: warning: argument unused during compilation: '-I C:/ti/simplelink_cc13x2_26x2_sdk_5_20_00_52/source/third_party/mbed/frameworks/nanostack-libservice/mbed-client-libservice/platform' [-Wunused-command-line-argument]
    tiarmclang: warning: argument unused during compilation: '-I C:/ti/simplelink_cc13x2_26x2_sdk_5_20_00_52/source/third_party/mbed/frameworks/mbed-client-randlib/mbed-client-randlib/platform' [-Wunused-command-line-argument]
    tiarmclang: warning: argument unused during compilation: '-I C:/ti/simplelink_cc13x2_26x2_sdk_5_20_00_52/source/third_party/mbed/frameworks/mbed-client-randlib/mbed-client-randlib' [-Wunused-command-line-argument]
    tiarmclang: warning: argument unused during compilation: '-I C:/ti/simplelink_cc13x2_26x2_sdk_5_20_00_52/source/third_party/mbed/frameworks/mbed-client-randlib' [-Wunused-command-line-argument]
    tiarmclang: warning: argument unused during compilation: '-I C:/ti/simplelink_cc13x2_26x2_sdk_5_20_00_52/source/third_party/mbed/frameworks/mbed-trace' [-Wunused-command-line-argument]
    tiarmclang: warning: argument unused during compilation: '-I C:/ti/simplelink_cc13x2_26x2_sdk_5_20_00_52/source/third_party/mbed/frameworks/mbed-coap' [-Wunused-command-line-argument]
    tiarmclang: warning: argument unused during compilation: '-I C:/ti/simplelink_cc13x2_26x2_sdk_5_20_00_52/source/third_party/mbed/frameworks/mbed-coap/source/include' [-Wunused-command-line-argument]
    tiarmclang: warning: argument unused during compilation: '-I C:/ti/simplelink_cc13x2_26x2_sdk_5_20_00_52/source/third_party/mbed/nanostack/sal-stack-nanostack' [-Wunused-command-line-argument]
    tiarmclang: warning: argument unused during compilation: '-I C:/ti/simplelink_cc13x2_26x2_sdk_5_20_00_52/source/third_party/mbed/nanostack/sal-stack-nanostack/source' [-Wunused-command-line-argument]
    tiarmclang: warning: argument unused during compilation: '-I C:/ti/simplelink_cc13x2_26x2_sdk_5_20_00_52/source/third_party/mbed/nanostack/sal-stack-nanostack/nanostack' [-Wunused-command-line-argument]
    tiarmclang: warning: argument unused during compilation: '-I C:/ti/simplelink_cc13x2_26x2_sdk_5_20_00_52/source/third_party/mbed/nanostack/sal-stack-nanostack/source/Service_Libs/mdns' [-Wunused-command-line-argument]
    tiarmclang: warning: argument unused during compilation: '-I C:/ti/simplelink_cc13x2_26x2_sdk_5_20_00_52/source/third_party/mbed/nanostack/sal-stack-nanostack/source/Service_Libs/mdns/fnet' [-Wunused-command-line-argument]
    tiarmclang: warning: argument unused during compilation: '-I C:/ti/simplelink_cc13x2_26x2_sdk_5_20_00_52/source/third_party/mbed/nanostack/sal-stack-nanostack/source/Service_Libs/mdns/fnet/fnet_stack' [-Wunused-command-line-argument]
    tiarmclang: warning: argument unused during compilation: '-I C:/ti/simplelink_cc13x2_26x2_sdk_5_20_00_52/source/third_party/mbed/nanostack/sal-stack-nanostack/source/Service_Libs/mdns/fnet/fnet_stack/stack' [-Wunused-command-line-argument]
    tiarmclang: warning: argument unused during compilation: '-I C:/ti/simplelink_cc13x2_26x2_sdk_5_20_00_52/source/third_party/mbed/nanostack/sal-stack-nanostack/source/Service_Libs/mdns/fnet/fnet_stack/services/serial' [-Wunused-command-line-argument]
    tiarmclang: warning: argument unused during compilation: '-I C:/ti/simplelink_cc13x2_26x2_sdk_5_20_00_52/source/third_party/mbed/nanostack/sal-stack-nanostack/source/Core/include' [-Wunused-command-line-argument]
    tiarmclang: warning: argument unused during compilation: '-I C:/ti/simplelink_cc13x2_26x2_sdk_5_20_00_52/source/third_party/mbed/nanostack/sal-stack-nanostack/source/6LowPAN' [-Wunused-command-line-argument]
    tiarmclang: warning: argument unused during compilation: '-I C:/ti/simplelink_cc13x2_26x2_sdk_5_20_00_52/source/third_party/mbed/nanostack/sal-stack-nanostack-eventloop' [-Wunused-command-line-argument]
    tiarmclang: warning: argument unused during compilation: '-I C:/ti/simplelink_cc13x2_26x2_sdk_5_20_00_52/source/third_party/mbed/nanostack/sal-stack-nanostack-eventloop/nanostack-event-loop' [-Wunused-command-line-argument]
    tiarmclang: warning: argument unused during compilation: '-I C:/ti/simplelink_cc13x2_26x2_sdk_5_20_00_52/source/third_party/mbed/nanostack/sal-stack-nanostack-eventloop/nanostack-event-loop/platform' [-Wunused-command-line-argument]
    tiarmclang: warning: argument unused during compilation: '-I C:/ti/simplelink_cc13x2_26x2_sdk_5_20_00_52/source/third_party/mbed/nanostack/nanostack-hal-mbed-cmsis-rtos' [-Wunused-command-line-argument]
    tiarmclang: warning: argument unused during compilation: '-I C:/ti/simplelink_cc13x2_26x2_sdk_5_20_00_52/source/third_party/mbed/nanostack/mbed-mesh-api/source/include' [-Wunused-command-line-argument]
    tiarmclang: warning: argument unused during compilation: '-I C:/ti/simplelink_cc13x2_26x2_sdk_5_20_00_52/source/third_party/mbed/nanostack/mbed-mesh-api/mbed-mesh-api' [-Wunused-command-line-argument]
    tiarmclang: warning: argument unused during compilation: '-I C:/ti/simplelink_cc13x2_26x2_sdk_5_20_00_52/source/third_party/mbed/nanostack/mbed-mesh-api' [-Wunused-command-line-argument]
    tiarmclang: warning: argument unused during compilation: '-I C:/ti/simplelink_cc13x2_26x2_sdk_5_20_00_52/source/third_party/mbed/nanostack/coap-service/coap-service' [-Wunused-command-line-argument]
    tiarmclang: warning: argument unused during compilation: '-I C:/ti/simplelink_cc13x2_26x2_sdk_5_20_00_52/source/third_party/mbed/nanostack/coap-service/source/include' [-Wunused-command-line-argument]
    tiarmclang: warning: argument unused during compilation: '-I C:/ti/simplelink_cc13x2_26x2_sdk_5_20_00_52/source/third_party/ti_wisunfan/mbedtls/inc' [-Wunused-command-line-argument]
    tiarmclang: warning: argument unused during compilation: '-I C:/ti/simplelink_cc13x2_26x2_sdk_5_20_00_52/source/third_party/ti_wisunfan/mbedtls' [-Wunused-command-line-argument]
    tiarmclang: warning: argument unused during compilation: '-I C:/ti/simplelink_cc13x2_26x2_sdk_5_20_00_52/source/third_party/ti_wisunfan/mbedtls/platform/inc' [-Wunused-command-line-argument]
    tiarmclang: warning: argument unused during compilation: '-I C:/ti/simplelink_cc13x2_26x2_sdk_5_20_00_52/source/third_party/ti_wisunfan/mbedtls/platform/COMPONENT_PSA_SRV_IMPL/COMPONENT_NSPE' [-Wunused-command-line-argument]
    tiarmclang: warning: argument unused during compilation: '-I C:/ti/simplelink_cc13x2_26x2_sdk_5_20_00_52/source/ti/ti_wisunfan' [-Wunused-command-line-argument]
    tiarmclang: warning: argument unused during compilation: '-I C:/ti/simplelink_cc13x2_26x2_sdk_5_20_00_52/source/ti/ti_wisunfan/shell' [-Wunused-command-line-argument]
    tiarmclang: warning: argument unused during compilation: '-I C:/ti/simplelink_cc13x2_26x2_sdk_5_20_00_52/source/ti/ti_wisunfan/config' [-Wunused-command-line-argument]
    tiarmclang: warning: argument unused during compilation: '-I C:/ti/simplelink_cc13x2_26x2_sdk_5_20_00_52/source/ti/ti_wisunfan/uip' [-Wunused-command-line-argument]
    tiarmclang: warning: argument unused during compilation: '-I C:/ti/simplelink_cc13x2_26x2_sdk_5_20_00_52/source/ti/ti_wisunfan/uip/conf' [-Wunused-command-line-argument]
    tiarmclang: warning: argument unused during compilation: '-I C:/ti/simplelink_cc13x2_26x2_sdk_5_20_00_52/source/ti/ti_wisunfan/uip/inc' [-Wunused-command-line-argument]
    tiarmclang: warning: argument unused during compilation: '-I C:/ti/simplelink_cc13x2_26x2_sdk_5_20_00_52/source/ti/ti_wisunfan/uip/pltfrm/sysbios' [-Wunused-command-line-argument]
    tiarmclang: warning: argument unused during compilation: '-I C:/ti/simplelink_cc13x2_26x2_sdk_5_20_00_52/source/ti/ti_wisunfan/uip/net' [-Wunused-command-line-argument]
    tiarmclang: warning: argument unused during compilation: '-I C:/ti/simplelink_cc13x2_26x2_sdk_5_20_00_52/source/ti/ti_wisunfan/wisunfan_mac/services' [-Wunused-command-line-argument]
    tiarmclang: warning: argument unused during compilation: '-I C:/ti/simplelink_cc13x2_26x2_sdk_5_20_00_52/source/ti/ti_wisunfan/wisunfan_mac/hal/assert' [-Wunused-command-line-argument]
    tiarmclang: warning: argument unused during compilation: '-I C:/ti/simplelink_cc13x2_26x2_sdk_5_20_00_52/source/ti/ti_wisunfan/wisunfan_mac/hal/appasrt' [-Wunused-command-line-argument]
    tiarmclang: warning: argument unused during compilation: '-I C:/ti/simplelink_cc13x2_26x2_sdk_5_20_00_52/source/ti/ti_wisunfan/wisunfan_mac/hal/crypto' [-Wunused-command-line-argument]
    tiarmclang: warning: argument unused during compilation: '-I C:/ti/simplelink_cc13x2_26x2_sdk_5_20_00_52/source/ti/ti_wisunfan/wisunfan_mac/hal/platform' [-Wunused-command-line-argument]
    tiarmclang: warning: argument unused during compilation: '-I C:/ti/simplelink_cc13x2_26x2_sdk_5_20_00_52/source/ti/ti_wisunfan/wisunfan_mac/hal/rf' [-Wunused-command-line-argument]
    tiarmclang: warning: argument unused during compilation: '-I C:/ti/simplelink_cc13x2_26x2_sdk_5_20_00_52/source/ti/ti_wisunfan/wisunfan_mac/high_level' [-Wunused-command-line-argument]
    tiarmclang: warning: argument unused during compilation: '-I C:/ti/simplelink_cc13x2_26x2_sdk_5_20_00_52/source/ti/ti_wisunfan/wisunfan_mac/low_level' [-Wunused-command-line-argument]
    tiarmclang: warning: argument unused during compilation: '-I C:/ti/simplelink_cc13x2_26x2_sdk_5_20_00_52/source/ti/ti_wisunfan/wisunfan_mac/common/osal_port' [-Wunused-command-line-argument]
    tiarmclang: warning: argument unused during compilation: '-I C:/ti/simplelink_cc13x2_26x2_sdk_5_20_00_52/source/ti/ti_wisunfan/wisunfan_mac/common' [-Wunused-command-line-argument]
    tiarmclang: warning: argument unused during compilation: '-I C:/ti/simplelink_cc13x2_26x2_sdk_5_20_00_52/source/ti/ti_wisunfan/wisunfan_mac/common/boards' [-Wunused-command-line-argument]
    tiarmclang: warning: argument unused during compilation: '-I C:/ti/simplelink_cc13x2_26x2_sdk_5_20_00_52/source/ti/ti_wisunfan/wisunfan_mac/common/util' [-Wunused-command-line-argument]
    tiarmclang: warning: argument unused during compilation: '-I C:/ti/simplelink_cc13x2_26x2_sdk_5_20_00_52/source/ti/ti_wisunfan/wisunfan_mac/common/inc' [-Wunused-command-line-argument]
    tiarmclang: warning: argument unused during compilation: '-I C:/ti/simplelink_cc13x2_26x2_sdk_5_20_00_52/source/ti/ti_wisunfan/wisunfan_mac/common/stack/src' [-Wunused-command-line-argument]
    tiarmclang: warning: argument unused during compilation: '-I C:/ti/simplelink_cc13x2_26x2_sdk_5_20_00_52/source/ti/ti_wisunfan/wisunfan_mac/common/stack/tirtos/inc' [-Wunused-command-line-argument]
    tiarmclang: warning: argument unused during compilation: '-I C:/ti/simplelink_cc13x2_26x2_sdk_5_20_00_52/source/ti/ti_wisunfan/wisunfan_mac/common/heapmgr' [-Wunused-command-line-argument]
    tiarmclang: warning: argument unused during compilation: '-I C:/ti/simplelink_cc13x2_26x2_sdk_5_20_00_52/source/ti/ti_wisunfan/wisunfan_mac/services/saddr' [-Wunused-command-line-argument]
    tiarmclang: warning: argument unused during compilation: '-I C:/ti/simplelink_cc13x2_26x2_sdk_5_20_00_52/source/ti/ti_wisunfan/wisunfan_mac/services/sdata' [-Wunused-command-line-argument]
    tiarmclang: warning: argument unused during compilation: '-I C:/ti/simplelink_cc13x2_26x2_sdk_5_20_00_52/source/ti/ti_wisunfan/wisunfan_mac/fh' [-Wunused-command-line-argument]
    tiarmclang: warning: argument unused during compilation: '-I C:/ti/simplelink_cc13x2_26x2_sdk_5_20_00_52/source/ti/ti_wisunfan/wisunfan_mac/inc' [-Wunused-command-line-argument]
    tiarmclang: warning: argument unused during compilation: '-I C:/ti/simplelink_cc13x2_26x2_sdk_5_20_00_52/source/ti/ti_wisunfan/wisunfan_mac/rom' [-Wunused-command-line-argument]
    tiarmclang: warning: argument unused during compilation: '-I C:/ti/simplelink_cc13x2_26x2_sdk_5_20_00_52/source/ti/ti_wisunfan/wisunfan_mac/inc/cc13xx' [-Wunused-command-line-argument]
    tiarmclang: warning: argument unused during compilation: '-I C:/ti/simplelink_cc13x2_26x2_sdk_5_20_00_52/source/ti/ti_wisunfan/wisunfan_mac/low_level/cc13xx' [-Wunused-command-line-argument]
    tiarmclang: warning: argument unused during compilation: '-I C:/ti/simplelink_cc13x2_26x2_sdk_5_20_00_52/source/ti/ti_wisunfan/wisunfan_mac/tracer' [-Wunused-command-line-argument]
    tiarmclang: warning: argument unused during compilation: '-I C:/ti/simplelink_cc13x2_26x2_sdk_5_20_00_52/source/third_party/mbed/nanostack/mbed-mesh-api/source' [-Wunused-command-line-argument]
    tiarmclang: warning: argument unused during compilation: '-I C:/ti/simplelink_cc13x2_26x2_sdk_5_20_00_52/source/third_party/mbed/nanostack/sal-stack-nanostack/source/6LoWPAN/MAC' [-Wunused-command-line-argument]
    tiarmclang: warning: argument unused during compilation: '-I C:/ti/simplelink_cc13x2_26x2_sdk_5_20_00_52/source/third_party/mbed/nanostack/sal-stack-nanostack/source/6LoWPAN/Thread' [-Wunused-command-line-argument]
    tiarmclang: warning: argument unused during compilation: '-I C:/ti/simplelink_cc13x2_26x2_sdk_5_20_00_52/source/third_party/mbed/nanostack/sal-stack-nanostack/source/Security/PANA' [-Wunused-command-line-argument]
    tiarmclang: warning: argument unused during compilation: '-I C:/ti/simplelink_cc13x2_26x2_sdk_5_20_00_52/source/third_party/mbed/nanostack/sal-stack-nanostack/source/Service_Libs/mdns/fnet/fnet_stack/services/mdns' [-Wunused-command-line-argument]
    tiarmclang: warning: argument unused during compilation: '-I C:/ti/simplelink_cc13x2_26x2_sdk_5_20_00_52/source/third_party/mbed/nanostack/sal-stack-nanostack/source/Service_Libs/fnv_hash' [-Wunused-command-line-argument]
    tiarmclang: warning: argument unused during compilation: '-I C:/ti/simplelink_cc13x2_26x2_sdk_5_20_00_52/source/third_party/mbed/nanostack/sal-stack-nanostack/source/Service_Libs/hmac' [-Wunused-command-line-argument]
    tiarmclang: warning: argument unused during compilation: '-I C:/ti/simplelink_cc13x2_26x2_sdk_5_20_00_52/source/third_party/mbed/nanostack/sal-stack-nanostack/source/Service_Libs/load_balance' [-Wunused-command-line-argument]
    tiarmclang: warning: argument unused during compilation: '-I C:/ti/simplelink_cc13x2_26x2_sdk_5_20_00_52/source/third_party/mbed/nanostack/sal-stack-nanostack/source/libNET/src' [-Wunused-command-line-argument]
    tiarmclang: warning: argument unused during compilation: '-I C:/ti/simplelink_cc13x2_26x2_sdk_5_20_00_52/source/third_party/mbed/nanostack/sal-stack-nanostack-eventloop/source' [-Wunused-command-line-argument]
    tiarmclang: warning: argument unused during compilation: '-I C:/ti/simplelink_cc13x2_26x2_sdk_5_20_00_52/source/third_party/ti_wisunfan/mbedtls/platform/COMPONENT_PSA_SRV_IMPL' [-Wunused-command-line-argument]
    tiarmclang: warning: argument unused during compilation: '-I C:/ti/simplelink_cc13x2_26x2_sdk_5_20_00_52/source/third_party/mbed/nanostack/sal-stack-nanostack/source/Service_Libs/whiteboard' [-Wunused-command-line-argument]
    tiarmclang: warning: argument unused during compilation: '-I C:/ti/simplelink_cc13x2_26x2_sdk_5_20_00_52/source/third_party/mbed/nanostack/sal-stack-nanostack/source/6LoWPAN/ws' [-Wunused-command-line-argument]
    tiarmclang: warning: argument unused during compilation: '-I C:/ti/simplelink_cc13x2_26x2_sdk_5_20_00_52/source/third_party/mbed/nanostack/sal-stack-nanostack/source/DHCPv6_client' [-Wunused-command-line-argument]
    tiarmclang: warning: argument unused during compilation: '-I C:/ti/simplelink_cc13x2_26x2_sdk_5_20_00_52/source/third_party/mbed/nanostack/sal-stack-nanostack/source/libDHCPv6' [-Wunused-command-line-argument]
    tiarmclang: warning: argument unused during compilation: '-I C:/ti/simplelink_cc13x2_26x2_sdk_5_20_00_52/source/third_party/mbed/nanostack/sal-stack-nanostack/source/Service_Libs/utils' [-Wunused-command-line-argument]
    tiarmclang: warning: argument unused during compilation: '-I C:/ti/simplelink_cc13x2_26x2_sdk_5_20_00_52/source/third_party/mbed/nanostack/sal-stack-nanostack/source/Service_Libs/pan_blacklist' [-Wunused-command-line-argument]
    tiarmclang: warning: argument unused during compilation: '-I C:/ti/simplelink_cc13x2_26x2_sdk_5_20_00_52/source/third_party/mbed/nanostack/sal-stack-nanostack/source/Common_Protocols' [-Wunused-command-line-argument]
    tiarmclang: warning: argument unused during compilation: '-I C:/ti/simplelink_cc13x2_26x2_sdk_5_20_00_52/source/ti/posix/ticlang' [-Wunused-command-line-argument]
    tiarmclang: warning: argument unused during compilation: '-I C:/ti/simplelink_cc13x2_26x2_sdk_5_20_00_52/source/ti/ti_wisunfan/ncp_interface/config' [-Wunused-command-line-argument]
    tiarmclang: warning: argument unused during compilation: '-I C:/ti/simplelink_cc13x2_26x2_sdk_5_20_00_52/source/ti/ti_wisunfan/ncp_interface/include' [-Wunused-command-line-argument]
    tiarmclang: warning: argument unused during compilation: '-I C:/ti/simplelink_cc13x2_26x2_sdk_5_20_00_52/source/ti/ti_wisunfan/ncp_interface/src' [-Wunused-command-line-argument]
    tiarmclang: warning: argument unused during compilation: '-I C:/ti/simplelink_cc13x2_26x2_sdk_5_20_00_52/source/ti/ti_wisunfan/ncp_interface/src/core' [-Wunused-command-line-argument]
    tiarmclang: warning: argument unused during compilation: '-I C:/ti/simplelink_cc13x2_26x2_sdk_5_20_00_52/source/ti/ti_wisunfan/ncp_interface/src/core/utils' [-Wunused-command-line-argument]
    tiarmclang: warning: argument unused during compilation: '-I C:/ti/simplelink_cc13x2_26x2_sdk_5_20_00_52/source/ti/ti_wisunfan/ncp_interface/examples/platforms' [-Wunused-command-line-argument]
    tiarmclang: warning: argument unused during compilation: '-I C:/ti/simplelink_cc13x2_26x2_sdk_5_20_00_52/source/ti/ti_wisunfan/ncp_interface/examples/ncp_ftd' [-Wunused-command-line-argument]
    tiarmclang: warning: argument unused during compilation: '-I C:/ti/simplelink_cc13x2_26x2_sdk_5_20_00_52/source/ti/ti_wisunfan/ncp_interface/examples/ncp_ftd/platform' [-Wunused-command-line-argument]
    tiarmclang: warning: argument unused during compilation: '-I C:/ti/simplelink_cc13x2_26x2_sdk_5_20_00_52/source/ti/ti_wisunfan/ncp_interface/src/core/thread' [-Wunused-command-line-argument]
    tiarmclang: warning: argument unused during compilation: '-I C:/ti/simplelink_cc13x2_26x2_sdk_5_20_00_52/source/ti/ti_wisunfan/ncp_interface/src/ncp' [-Wunused-command-line-argument]
    tiarmclang: warning: argument unused during compilation: '-I C:/ti/simplelink_cc13x2_26x2_sdk_5_20_00_52/source/ti/ti_wisunfan/ncp_interface/examples/ncp_ftd/platform/nv' [-Wunused-command-line-argument]
    tiarmclang: warning: argument unused during compilation: '-I C:/ti/simplelink_cc13x2_26x2_sdk_5_20_00_52/source/ti/ti_wisunfan/wisunfan_mac/low_level/cc13xx/combo' [-Wunused-command-line-argument]
    tiarmclang: warning: argument unused during compilation: '-I C:/ti/simplelink_cc13x2_26x2_sdk_5_20_00_52/source/ti/ti_wisunfan/mbed_port/ti-rf-driver/ti-rf-driver' [-Wunused-command-line-argument]
    tiarmclang: warning: argument unused during compilation: '-I C:/ti/simplelink_cc13x2_26x2_sdk_5_20_00_52/source/ti/ti_wisunfan/apps/udp_nanostack_mesh_tirf' [-Wunused-command-line-argument]
    tiarmclang: warning: argument unused during compilation: '-I C:/ti/simplelink_cc13x2_26x2_sdk_5_20_00_52/source/ti/ti_wisunfan/apps/common/include' [-Wunused-command-line-argument]
    tiarmclang: warning: argument unused during compilation: '-I C:/ti/simplelink_cc13x2_26x2_sdk_5_20_00_52/source/ti/common/nv' [-Wunused-command-line-argument]
    tiarmclang: warning: argument unused during compilation: '-I C:/ti/simplelink_cc13x2_26x2_sdk_5_20_00_52/source/ti/ti_wisunfan/mbed_config/ws_router' [-Wunused-command-line-argument]
    tiarmclang: warning: argument unused during compilation: '-I C:/ti/simplelink_cc13x2_26x2_sdk_5_20_00_52/source/ti/devices/cc13x2_cc26x2' [-Wunused-command-line-argument]
    tiarmclang: warning: argument unused during compilation: '-I C:/ti/simplelink_cc13x2_26x2_sdk_5_20_00_52/source/ti/devices/cc13x2_cc26x2/inc' [-Wunused-command-line-argument]
    tiarmclang: warning: argument unused during compilation: '-I C:/ti/simplelink_cc13x2_26x2_sdk_5_20_00_52/source/ti/devices/cc13x2_cc26x2/driverlib' [-Wunused-command-line-argument]
    tiarmclang: warning: argument unused during compilation: '-D EXCLUDE_TRACE' [-Wunused-command-line-argument]
    tiarmclang: warning: argument unused during compilation: '-D xSWITCH_NCP_TO_TRACE' [-Wunused-command-line-argument]
    tiarmclang: warning: argument unused during compilation: '-D TLS_SEC_PROT_LIB_USE_MBEDTLS_PLATFORM_MEMORY' [-Wunused-command-line-argument]
    tiarmclang: warning: argument unused during compilation: '-D xWISUN_AUTO_START' [-Wunused-command-line-argument]
    tiarmclang: warning: argument unused during compilation: '-D TI_WISUN_FAN_DEBUG' [-Wunused-command-line-argument]
    tiarmclang: warning: argument unused during compilation: '-D WISUN_NCP_ENABLE' [-Wunused-command-line-argument]
    tiarmclang: warning: argument unused during compilation: '-D Board_EXCLUDE_NVS_EXTERNAL_FLASH' [-Wunused-command-line-argument]
    tiarmclang: warning: argument unused during compilation: '-D DeviceFamily_CC13X2' [-Wunused-command-line-argument]
    tiarmclang: warning: argument unused during compilation: '-gdwarf-3' [-Wunused-command-line-argument]
    tiarmclang: warning: argument unused during compilation: '-fdiagnostics-show-option' [-Wunused-command-line-argument]
    tiarmclang: warning: argument unused during compilation: '-fshort-enums' [-Wunused-command-line-argument]
    tiarmclang: warning: argument unused during compilation: '-munaligned-access' [-Wunused-command-line-argument]
    tiarmclang: warning: argument unused during compilation: '-funsigned-char' [-Wunused-command-line-argument]
    tiarmclang: warning: argument unused during compilation: '-fcommon' [-Wunused-command-line-argument]
    tiarmclang: warning: argument unused during compilation: '-ffunction-sections' [-Wunused-command-line-argument]
    tiarmclang: warning: argument unused during compilation: '-include mbed_config.h' [-Wunused-command-line-argument]
    tiarmclang: warning: argument unused during compilation: '-fshort-wchar' [-Wunused-command-line-argument]
    tiarmclang: warning: argument unused during compilation: '-fno-strict-aliasing' [-Wunused-command-line-argument]
    tiarmclang: warning: argument unused during compilation: '-mcpu=cortex-m4' [-Wunused-command-line-argument]
    tiarmclang: warning: argument unused during compilation: '-mfloat-abi=hard' [-Wunused-command-line-argument]
    tiarmclang: warning: argument unused during compilation: '-mfpu=fpv4-sp-d16' [-Wunused-command-line-argument]
    tiarmclang: warning: argument unused during compilation: '-Oz' [-Wunused-command-line-argument]
    tiarmclang: warning: argument unused during compilation: '-g' [-Wunused-command-line-argument]
    tiarmclang: warning: argument unused during compilation: '-D ti_sysbios_family_arm_cc26xx_Boot_driverlibVersion=2' [-Wunused-command-line-argument]
    tiarmclang: warning: argument unused during compilation: '-D ti_posix_tirtos_Settings_debug__D=FALSE' [-Wunused-command-line-argument]
    tiarmclang: warning: argument unused during compilation: '-D ti_sysbios_knl_Clock_stopCheckNext__D=TRUE' [-Wunused-command-line-argument]
    tiarmclang: warning: argument unused during compilation: '-D ti_sysbios_family_arm_m3_Hwi_enableException__D=FALSE' [-Wunused-command-line-argument]
    tiarmclang: warning: argument unused during compilation: '-D ti_sysbios_family_arm_m3_Hwi_disablePriority__D=32U' [-Wunused-command-line-argument]
    tiarmclang: warning: argument unused during compilation: '-D ti_sysbios_family_arm_m3_Hwi_numSparseInterrupts__D=0U' [-Wunused-command-line-argument]
    tiarmclang: warning: argument unused during compilation: '-D ti_sysbios_knl_Task_minimizeLatency__D=FALSE' [-Wunused-command-line-argument]
    tiarmclang: warning: argument unused during compilation: '-D ti_sysbios_BIOS_swiEnabled__D=TRUE' [-Wunused-command-line-argument]
    tiarmclang: warning: argument unused during compilation: '-D ti_sysbios_BIOS_taskEnabled__D=TRUE' [-Wunused-command-line-argument]
    tiarmclang: warning: argument unused during compilation: '-D ti_sysbios_BIOS_clockEnabled__D=TRUE' [-Wunused-command-line-argument]
    tiarmclang: warning: argument unused during compilation: '-D ti_sysbios_BIOS_runtimeCreatesEnabled__D=TRUE' [-Wunused-command-line-argument]
    tiarmclang: warning: argument unused during compilation: '-D ti_sysbios_knl_Task_moduleStateCheckFlag__D=FALSE' [-Wunused-command-line-argument]
    tiarmclang: warning: argument unused during compilation: '-D ti_sysbios_knl_Task_objectCheckFlag__D=FALSE' [-Wunused-command-line-argument]
    tiarmclang: warning: argument unused during compilation: '-D ti_sysbios_hal_Hwi_DISABLE_ALL_HOOKS' [-Wunused-command-line-argument]
    tiarmclang: warning: argument unused during compilation: '-D ti_sysbios_knl_Swi_DISABLE_ALL_HOOKS' [-Wunused-command-line-argument]
    tiarmclang: warning: argument unused during compilation: '-D ti_sysbios_BIOS_smpEnabled__D=FALSE' [-Wunused-command-line-argument]
    tiarmclang: warning: argument unused during compilation: '-D ti_sysbios_Build_useHwiMacros' [-Wunused-command-line-argument]
    tiarmclang: warning: argument unused during compilation: '-D ti_sysbios_Build_useIndirectReferences=FALSE' [-Wunused-command-line-argument]
    tiarmclang: warning: argument unused during compilation: '-D ti_sysbios_knl_Swi_numPriorities__D=6' [-Wunused-command-line-argument]
    tiarmclang: warning: argument unused during compilation: '-D ti_sysbios_knl_Task_deleteTerminatedTasks__D=FALSE' [-Wunused-command-line-argument]
    tiarmclang: warning: argument unused during compilation: '-D ti_sysbios_knl_Task_numPriorities__D=6' [-Wunused-command-line-argument]
    tiarmclang: warning: argument unused during compilation: '-D ti_sysbios_knl_Task_checkStackFlag__D=FALSE' [-Wunused-command-line-argument]
    tiarmclang: warning: argument unused during compilation: '-D ti_sysbios_knl_Task_initStackFlag__D=TRUE' [-Wunused-command-line-argument]
    tiarmclang: warning: argument unused during compilation: '-D ti_sysbios_knl_Task_DISABLE_ALL_HOOKS' [-Wunused-command-line-argument]
    tiarmclang: warning: argument unused during compilation: '-D ti_sysbios_knl_Clock_TICK_SOURCE=ti_sysbios_knl_Clock_TickSource_TIMER' [-Wunused-command-line-argument]
    tiarmclang: warning: argument unused during compilation: '-D ti_sysbios_knl_Clock_TICK_MODE=ti_sysbios_knl_Clock_TickMode_DYNAMIC' [-Wunused-command-line-argument]
    tiarmclang: warning: argument unused during compilation: '-D ti_sysbios_hal_Core_delegate_getId=ti_sysbios_hal_CoreNull_getId__E' [-Wunused-command-line-argument]
    tiarmclang: warning: argument unused during compilation: '-D ti_sysbios_hal_Core_delegate_interruptCore=ti_sysbios_hal_CoreNull_interruptCore__E' [-Wunused-command-line-argument]
    tiarmclang: warning: argument unused during compilation: '-D ti_sysbios_hal_Core_delegate_lock=ti_sysbios_hal_CoreNull_lock__E' [-Wunused-command-line-argument]
    tiarmclang: warning: argument unused during compilation: '-D ti_sysbios_hal_Core_delegate_unlock=ti_sysbios_hal_CoreNull_unlock__E' [-Wunused-command-line-argument]
    tiarmclang: warning: argument unused during compilation: '-D ti_sysbios_hal_Core_numCores__D=1' [-Wunused-command-line-argument]
    tiarmclang: warning: argument unused during compilation: '-D ti_sysbios_hal_CoreNull_numCores__D=1' [-Wunused-command-line-argument]
    tiarmclang: warning: argument unused during compilation: '-D ti_sysbios_utils_Load_taskEnabled__D=TRUE' [-Wunused-command-line-argument]
    tiarmclang: warning: argument unused during compilation: '-D ti_sysbios_utils_Load_swiEnabled__D=FALSE' [-Wunused-command-line-argument]
    tiarmclang: warning: argument unused during compilation: '-D ti_sysbios_utils_Load_hwiEnabled__D=FALSE' [-Wunused-command-line-argument]
    tiarmclang: warning: argument unused during compilation: '-D ti_sysbios_family_arm_m3_Hwi_dispatcherSwiSupport__D=TRUE' [-Wunused-command-line-argument]
    tiarmclang: warning: argument unused during compilation: '-D ti_sysbios_family_arm_m3_Hwi_dispatcherTaskSupport__D=TRUE' [-Wunused-command-line-argument]
    tiarmclang: warning: argument unused during compilation: '-D ti_sysbios_family_arm_m3_Hwi_dispatcherAutoNestingSupport__D=TRUE' [-Wunused-command-line-argument]
    tiarmclang: warning: argument unused during compilation: '-D ti_sysbios_family_arm_m3_Hwi_dispatcherIrpTrackingSupport__D=TRUE' [-Wunused-command-line-argument]
    tiarmclang: warning: argument unused during compilation: '-D ti_sysbios_knl_Semaphore_supportsEvents__D=FALSE' [-Wunused-command-line-argument]
    tiarmclang: warning: argument unused during compilation: '-D ti_sysbios_knl_Semaphore_supportsPriority__D=FALSE' [-Wunused-command-line-argument]
    tiarmclang: warning: argument unused during compilation: '-D xdc_runtime_Assert_DISABLE_ALL' [-Wunused-command-line-argument]
    tiarmclang: warning: argument unused during compilation: '-D xdc_runtime_Log_DISABLE_ALL' [-Wunused-command-line-argument]
    tiarmclang: warning: argument unused during compilation: '-D EXCLUDE_TRACE' [-Wunused-command-line-argument]
    tiarmclang: warning: argument unused during compilation: '-D xSWITCH_NCP_TO_TRACE' [-Wunused-command-line-argument]
    tiarmclang: warning: argument unused during compilation: '-D TLS_SEC_PROT_LIB_USE_MBEDTLS_PLATFORM_MEMORY' [-Wunused-command-line-argument]
    tiarmclang: warning: argument unused during compilation: '-D xWISUN_AUTO_START' [-Wunused-command-line-argument]
    tiarmclang: warning: argument unused during compilation: '-D TI_WISUN_FAN_DEBUG' [-Wunused-command-line-argument]
    tiarmclang: warning: argument unused during compilation: '-D WISUN_NCP_ENABLE' [-Wunused-command-line-argument]
    tiarmclang: warning: argument unused during compilation: '-D Board_EXCLUDE_NVS_EXTERNAL_FLASH' [-Wunused-command-line-argument]
    tiarmclang: warning: argument unused during compilation: '-D DeviceFamily_CC13X2' [-Wunused-command-line-argument]
    tiarmclang: warning: argument unused during compilation: '-I C:/ti/ccs1040/xdctools_3_62_01_15_core/packages/' [-Wunused-command-line-argument]
    tiarmclang: warning: argument unused during compilation: '-D xdc_target_types__=C:/ti/simplelink_cc13x2_26x2_sdk_5_20_00_52/kernel/tirtos/packages/ti/targets/arm/clang/std.h' [-Wunused-command-line-argument]
    tiarmclang: warning: argument unused during compilation: '-D xdc_target_name__=M4F' [-Wunused-command-line-argument]
    tiarmclang: warning: argument unused during compilation: '-I C:/ti/simplelink_cc13x2_26x2_sdk_5_20_00_52/kernel/tirtos/packages/' [-Wunused-command-line-argument]
    tiarmclang: warning: argument unused during compilation: '-I C:/ti/simplelink_cc13x2_26x2_sdk_5_20_00_52/source/ti/posix/ticlang' [-Wunused-command-line-argument]
    tiarmclang: warning: argument unused during compilation: '-I C:/ti/simplelink_cc13x2_26x2_sdk_5_20_00_52/source/' [-Wunused-command-line-argument]
    tiarmclang: warning: argument unused during compilation: '-I C:/ti/simplelink_cc13x2_26x2_sdk_5_20_00_52/kernel/tirtos/packages/' [-Wunused-command-line-argument]
    tiarmclang: warning: argument unused during compilation: '-I C:/ti/ccs1040/xdctools_3_62_01_15_core/packages/' [-Wunused-command-line-argument]
    tiarmclang: warning: argument unused during compilation: '-I ../' [-Wunused-command-line-argument]
    tiarmclang: warning: argument unused during compilation: '-I /packages//' [-Wunused-command-line-argument]
    gmake[1]: Target 'all' not remade because of errors.
    gmake: *** [../src/sysbios/rom_sysbios.am4f] Error 2
    configuring release.xm4f from package/cfg/release_pm4f.cfg ...
    generating custom ROM library makefile ... 
    Starting build of library sources ...
    Build of libraries failed.
    subdir_rules.mk:24: recipe for target 'build-1796804607-inproc' failed
    C:/Users/PCB:1: *** missing separator.  Stop.
    error: xdc.cfg.SourceDir: "C:/ti/ccs1040/xdctools_3_62_01_15_core/packages/xdc/cfg/SourceDir.xs", line 211: xdc.cfg.SourceDir : Build of generated source libraries failed: exit status = 2:
     
    js: "C:/ti/ccs1040/xdctools_3_62_01_15_core/packages/xdc/cfg/Main.xs", line 160: Error: Configuration failed!
    xdctools_3_62_01_15_core\gmake.exe: *** [package.mak:206: package/cfg/release_pm4f.xdl] Error 1
    xdctools_3_62_01_15_core\gmake.exe: *** Deleting file 'package/cfg/release_pm4f.xdl'
    xdctools_3_62_01_15_core\gmake.exe: *** [package/cfg/release_pm4f.xdl] Deleting file 'package/cfg/release_pm4f.h'
    xdctools_3_62_01_15_core\gmake.exe: *** [package/cfg/release_pm4f.xdl] Deleting file 'package/cfg/release_pm4f.c'
    js: "C:/ti/ccs1040/xdctools_3_62_01_15_core/packages/xdc/tools/Cmdr.xs", line 52: Error: xdc.tools.configuro: configuration failed due to earlier errors (status = 2); 'linker.cmd' deleted.
    gmake[1]: *** [build-1796804607-inproc] Error 1
    gmake: *** [build-1796804607] Error 2
    subdir_rules.mk:21: recipe for target 'build-1796804607' failed
    gmake: Target 'all' not remade because of errors.
    
    **** Build Finished ****
    

  • 5873.Log_PC.txt
    **** Build of configuration Release for project ns_node_CC1352R1_LAUNCHXL_tirtos_ticlang ****
    
    "C:\\ti\\ccs1040\\ccs\\utils\\bin\\gmake" -k -j 16 all -O 
     
    making ../src/sysbios/rom_sysbios.am4f ...
    Building file: "../release.cfg"
    gmake[1]: Entering directory 'C:/Users/PCB CHRISTIAN/workspace_v10/ns_node_CC1352R1_LAUNCHXL_tirtos_ticlang/src/sysbios'
    gmake[1]: Leaving directory 'C:/Users/PCB CHRISTIAN/workspace_v10/ns_node_CC1352R1_LAUNCHXL_tirtos_ticlang/src/sysbios'
    Invoking: XDCtools
    "C:/ti/ccs1040/xdctools_3_62_01_15_core/xs" --xdcpath="C:/ti/simplelink_cc13x2_26x2_sdk_5_20_00_52/source;C:/ti/simplelink_cc13x2_26x2_sdk_5_20_00_52/kernel/tirtos/packages;" xdc.tools.configuro -o configPkg -t ti.targets.arm.clang.M4F -p ti.platforms.simplelink:CC1352R1F3 -r release -c "C:/ti/ccs1040/ccs/tools/compiler/ti-cgt-armllvm_1.3.0.LTS" --compileOptions "-mcpu=cortex-m4 -mfloat-abi=hard -mfpu=fpv4-sp-d16 -mlittle-endian -mthumb -Oz -I\"C:/Users/PCB CHRISTIAN/workspace_v10/ns_node_CC1352R1_LAUNCHXL_tirtos_ticlang\" -I\"C:/Users/PCB CHRISTIAN/workspace_v10/ns_node_CC1352R1_LAUNCHXL_tirtos_ticlang/Release\" -I\"C:/ti/simplelink_cc13x2_26x2_sdk_5_20_00_52/source/ti/ti_wisunfan/mbed_port/ti-rf-driver/source\" -I\"C:/ti/simplelink_cc13x2_26x2_sdk_5_20_00_52/source/ti/ti_wisunfan/mbed_port/mbednanostack2tirtos\" -I\"C:/ti/simplelink_cc13x2_26x2_sdk_5_20_00_52/source/ti/ti_wisunfan/mbed_port/mbednanostack2tirtos/platform\" -I\"C:/ti/simplelink_cc13x2_26x2_sdk_5_20_00_52/source/ti/ti_wisunfan/mbed_port/mbedtls2tirtos\" -I\"C:/ti/simplelink_cc13x2_26x2_sdk_5_20_00_52/source/ti/ti_wisunfan/mbed_port/mbedtls2tirtos/platform\" -I\"C:/ti/simplelink_cc13x2_26x2_sdk_5_20_00_52/source/ti/ti_wisunfan/mbed_port/mbedtls2tirtos/mbedtls/mbed-crypto\" -I\"C:/ti/simplelink_cc13x2_26x2_sdk_5_20_00_52/source/third_party/mbed/frameworks/nanostack-libservice/mbed-client-libservice\" -I\"C:/ti/simplelink_cc13x2_26x2_sdk_5_20_00_52/source/third_party/mbed/frameworks/nanostack-libservice\" -I\"C:/ti/simplelink_cc13x2_26x2_sdk_5_20_00_52/source/third_party/mbed/frameworks/nanostack-libservice/mbed-client-libservice/platform\" -I\"C:/ti/simplelink_cc13x2_26x2_sdk_5_20_00_52/source/third_party/mbed/frameworks/mbed-client-randlib/mbed-client-randlib/platform\" -I\"C:/ti/simplelink_cc13x2_26x2_sdk_5_20_00_52/source/third_party/mbed/frameworks/mbed-client-randlib/mbed-client-randlib\" -I\"C:/ti/simplelink_cc13x2_26x2_sdk_5_20_00_52/source/third_party/mbed/frameworks/mbed-client-randlib\" -I\"C:/ti/simplelink_cc13x2_26x2_sdk_5_20_00_52/source/third_party/mbed/frameworks/mbed-trace\" -I\"C:/ti/simplelink_cc13x2_26x2_sdk_5_20_00_52/source/third_party/mbed/frameworks/mbed-coap\" -I\"C:/ti/simplelink_cc13x2_26x2_sdk_5_20_00_52/source/third_party/mbed/frameworks/mbed-coap/source/include\" -I\"C:/ti/simplelink_cc13x2_26x2_sdk_5_20_00_52/source/third_party/mbed/nanostack/sal-stack-nanostack\" -I\"C:/ti/simplelink_cc13x2_26x2_sdk_5_20_00_52/source/third_party/mbed/nanostack/sal-stack-nanostack/source\" -I\"C:/ti/simplelink_cc13x2_26x2_sdk_5_20_00_52/source/third_party/mbed/nanostack/sal-stack-nanostack/nanostack\" -I\"C:/ti/simplelink_cc13x2_26x2_sdk_5_20_00_52/source/third_party/mbed/nanostack/sal-stack-nanostack/source/Service_Libs/mdns\" -I\"C:/ti/simplelink_cc13x2_26x2_sdk_5_20_00_52/source/third_party/mbed/nanostack/sal-stack-nanostack/source/Service_Libs/mdns/fnet\" -I\"C:/ti/simplelink_cc13x2_26x2_sdk_5_20_00_52/source/third_party/mbed/nanostack/sal-stack-nanostack/source/Service_Libs/mdns/fnet/fnet_stack\" -I\"C:/ti/simplelink_cc13x2_26x2_sdk_5_20_00_52/source/third_party/mbed/nanostack/sal-stack-nanostack/source/Service_Libs/mdns/fnet/fnet_stack/stack\" -I\"C:/ti/simplelink_cc13x2_26x2_sdk_5_20_00_52/source/third_party/mbed/nanostack/sal-stack-nanostack/source/Service_Libs/mdns/fnet/fnet_stack/services/serial\" -I\"C:/ti/simplelink_cc13x2_26x2_sdk_5_20_00_52/source/third_party/mbed/nanostack/sal-stack-nanostack/source/Core/include\" -I\"C:/ti/simplelink_cc13x2_26x2_sdk_5_20_00_52/source/third_party/mbed/nanostack/sal-stack-nanostack/source/6LowPAN\" -I\"C:/ti/simplelink_cc13x2_26x2_sdk_5_20_00_52/source/third_party/mbed/nanostack/sal-stack-nanostack-eventloop\" -I\"C:/ti/simplelink_cc13x2_26x2_sdk_5_20_00_52/source/third_party/mbed/nanostack/sal-stack-nanostack-eventloop/nanostack-event-loop\" -I\"C:/ti/simplelink_cc13x2_26x2_sdk_5_20_00_52/source/third_party/mbed/nanostack/sal-stack-nanostack-eventloop/nanostack-event-loop/platform\" -I\"C:/ti/simplelink_cc13x2_26x2_sdk_5_20_00_52/source/third_party/mbed/nanostack/nanostack-hal-mbed-cmsis-rtos\" -I\"C:/ti/simplelink_cc13x2_26x2_sdk_5_20_00_52/source/third_party/mbed/nanostack/mbed-mesh-api/source/include\" -I\"C:/ti/simplelink_cc13x2_26x2_sdk_5_20_00_52/source/third_party/mbed/nanostack/mbed-mesh-api/mbed-mesh-api\" -I\"C:/ti/simplelink_cc13x2_26x2_sdk_5_20_00_52/source/third_party/mbed/nanostack/mbed-mesh-api\" -I\"C:/ti/simplelink_cc13x2_26x2_sdk_5_20_00_52/source/third_party/mbed/nanostack/coap-service/coap-service\" -I\"C:/ti/simplelink_cc13x2_26x2_sdk_5_20_00_52/source/third_party/mbed/nanostack/coap-service/source/include\" -I\"C:/ti/simplelink_cc13x2_26x2_sdk_5_20_00_52/source/third_party/ti_wisunfan/mbedtls/inc\" -I\"C:/ti/simplelink_cc13x2_26x2_sdk_5_20_00_52/source/third_party/ti_wisunfan/mbedtls\" -I\"C:/ti/simplelink_cc13x2_26x2_sdk_5_20_00_52/source/third_party/ti_wisunfan/mbedtls/platform/inc\" -I\"C:/ti/simplelink_cc13x2_26x2_sdk_5_20_00_52/source/third_party/ti_wisunfan/mbedtls/platform/COMPONENT_PSA_SRV_IMPL/COMPONENT_NSPE\" -I\"C:/ti/simplelink_cc13x2_26x2_sdk_5_20_00_52/source/ti/ti_wisunfan\" -I\"C:/ti/simplelink_cc13x2_26x2_sdk_5_20_00_52/source/ti/ti_wisunfan/shell\" -I\"C:/ti/simplelink_cc13x2_26x2_sdk_5_20_00_52/source/ti/ti_wisunfan/config\" -I\"C:/ti/simplelink_cc13x2_26x2_sdk_5_20_00_52/source/ti/ti_wisunfan/uip\" -I\"C:/ti/simplelink_cc13x2_26x2_sdk_5_20_00_52/source/ti/ti_wisunfan/uip/conf\" -I\"C:/ti/simplelink_cc13x2_26x2_sdk_5_20_00_52/source/ti/ti_wisunfan/uip/inc\" -I\"C:/ti/simplelink_cc13x2_26x2_sdk_5_20_00_52/source/ti/ti_wisunfan/uip/pltfrm/sysbios\" -I\"C:/ti/simplelink_cc13x2_26x2_sdk_5_20_00_52/source/ti/ti_wisunfan/uip/net\" -I\"C:/ti/simplelink_cc13x2_26x2_sdk_5_20_00_52/source/ti/ti_wisunfan/wisunfan_mac/services\" -I\"C:/ti/simplelink_cc13x2_26x2_sdk_5_20_00_52/source/ti/ti_wisunfan/wisunfan_mac/hal/assert\" -I\"C:/ti/simplelink_cc13x2_26x2_sdk_5_20_00_52/source/ti/ti_wisunfan/wisunfan_mac/hal/appasrt\" -I\"C:/ti/simplelink_cc13x2_26x2_sdk_5_20_00_52/source/ti/ti_wisunfan/wisunfan_mac/hal/crypto\" -I\"C:/ti/simplelink_cc13x2_26x2_sdk_5_20_00_52/source/ti/ti_wisunfan/wisunfan_mac/hal/platform\" -I\"C:/ti/simplelink_cc13x2_26x2_sdk_5_20_00_52/source/ti/ti_wisunfan/wisunfan_mac/hal/rf\" -I\"C:/ti/simplelink_cc13x2_26x2_sdk_5_20_00_52/source/ti/ti_wisunfan/wisunfan_mac/high_level\" -I\"C:/ti/simplelink_cc13x2_26x2_sdk_5_20_00_52/source/ti/ti_wisunfan/wisunfan_mac/low_level\" -I\"C:/ti/simplelink_cc13x2_26x2_sdk_5_20_00_52/source/ti/ti_wisunfan/wisunfan_mac/common/osal_port\" -I\"C:/ti/simplelink_cc13x2_26x2_sdk_5_20_00_52/source/ti/ti_wisunfan/wisunfan_mac/common\" -I\"C:/ti/simplelink_cc13x2_26x2_sdk_5_20_00_52/source/ti/ti_wisunfan/wisunfan_mac/common/boards\" -I\"C:/ti/simplelink_cc13x2_26x2_sdk_5_20_00_52/source/ti/ti_wisunfan/wisunfan_mac/common/util\" -I\"C:/ti/simplelink_cc13x2_26x2_sdk_5_20_00_52/source/ti/ti_wisunfan/wisunfan_mac/common/inc\" -I\"C:/ti/simplelink_cc13x2_26x2_sdk_5_20_00_52/source/ti/ti_wisunfan/wisunfan_mac/common/stack/src\" -I\"C:/ti/simplelink_cc13x2_26x2_sdk_5_20_00_52/source/ti/ti_wisunfan/wisunfan_mac/common/stack/tirtos/inc\" -I\"C:/ti/simplelink_cc13x2_26x2_sdk_5_20_00_52/source/ti/ti_wisunfan/wisunfan_mac/common/heapmgr\" -I\"C:/ti/simplelink_cc13x2_26x2_sdk_5_20_00_52/source/ti/ti_wisunfan/wisunfan_mac/services/saddr\" -I\"C:/ti/simplelink_cc13x2_26x2_sdk_5_20_00_52/source/ti/ti_wisunfan/wisunfan_mac/services/sdata\" -I\"C:/ti/simplelink_cc13x2_26x2_sdk_5_20_00_52/source/ti/ti_wisunfan/wisunfan_mac/fh\" -I\"C:/ti/simplelink_cc13x2_26x2_sdk_5_20_00_52/source/ti/ti_wisunfan/wisunfan_mac/inc\" -I\"C:/ti/simplelink_cc13x2_26x2_sdk_5_20_00_52/source/ti/ti_wisunfan/wisunfan_mac/rom\" -I\"C:/ti/simplelink_cc13x2_26x2_sdk_5_20_00_52/source/ti/ti_wisunfan/wisunfan_mac/inc/cc13xx\" -I\"C:/ti/simplelink_cc13x2_26x2_sdk_5_20_00_52/source/ti/ti_wisunfan/wisunfan_mac/low_level/cc13xx\" -I\"C:/ti/simplelink_cc13x2_26x2_sdk_5_20_00_52/source/ti/ti_wisunfan/wisunfan_mac/tracer\" -I\"C:/ti/simplelink_cc13x2_26x2_sdk_5_20_00_52/source/third_party/mbed/nanostack/mbed-mesh-api/source\" -I\"C:/ti/simplelink_cc13x2_26x2_sdk_5_20_00_52/source/third_party/mbed/nanostack/sal-stack-nanostack/source/6LoWPAN/MAC\" -I\"C:/ti/simplelink_cc13x2_26x2_sdk_5_20_00_52/source/third_party/mbed/nanostack/sal-stack-nanostack/source/6LoWPAN/Thread\" -I\"C:/ti/simplelink_cc13x2_26x2_sdk_5_20_00_52/source/third_party/mbed/nanostack/sal-stack-nanostack/source/Security/PANA\" -I\"C:/ti/simplelink_cc13x2_26x2_sdk_5_20_00_52/source/third_party/mbed/nanostack/sal-stack-nanostack/source/Service_Libs/mdns/fnet/fnet_stack/services/mdns\" -I\"C:/ti/simplelink_cc13x2_26x2_sdk_5_20_00_52/source/third_party/mbed/nanostack/sal-stack-nanostack/source/Service_Libs/fnv_hash\" -I\"C:/ti/simplelink_cc13x2_26x2_sdk_5_20_00_52/source/third_party/mbed/nanostack/sal-stack-nanostack/source/Service_Libs/hmac\" -I\"C:/ti/simplelink_cc13x2_26x2_sdk_5_20_00_52/source/third_party/mbed/nanostack/sal-stack-nanostack/source/Service_Libs/load_balance\" -I\"C:/ti/simplelink_cc13x2_26x2_sdk_5_20_00_52/source/third_party/mbed/nanostack/sal-stack-nanostack/source/libNET/src\" -I\"C:/ti/simplelink_cc13x2_26x2_sdk_5_20_00_52/source/third_party/mbed/nanostack/sal-stack-nanostack-eventloop/source\" -I\"C:/ti/simplelink_cc13x2_26x2_sdk_5_20_00_52/source/third_party/ti_wisunfan/mbedtls/platform/COMPONENT_PSA_SRV_IMPL\" -I\"C:/ti/simplelink_cc13x2_26x2_sdk_5_20_00_52/source/third_party/mbed/nanostack/sal-stack-nanostack/source/Service_Libs/whiteboard\" -I\"C:/ti/simplelink_cc13x2_26x2_sdk_5_20_00_52/source/third_party/mbed/nanostack/sal-stack-nanostack/source/6LoWPAN/ws\" -I\"C:/ti/simplelink_cc13x2_26x2_sdk_5_20_00_52/source/third_party/mbed/nanostack/sal-stack-nanostack/source/DHCPv6_client\" -I\"C:/ti/simplelink_cc13x2_26x2_sdk_5_20_00_52/source/third_party/mbed/nanostack/sal-stack-nanostack/source/libDHCPv6\" -I\"C:/ti/simplelink_cc13x2_26x2_sdk_5_20_00_52/source/third_party/mbed/nanostack/sal-stack-nanostack/source/Service_Libs/utils\" -I\"C:/ti/simplelink_cc13x2_26x2_sdk_5_20_00_52/source/third_party/mbed/nanostack/sal-stack-nanostack/source/Service_Libs/pan_blacklist\" -I\"C:/ti/simplelink_cc13x2_26x2_sdk_5_20_00_52/source/third_party/mbed/nanostack/sal-stack-nanostack/source/Common_Protocols\" -I\"C:/ti/simplelink_cc13x2_26x2_sdk_5_20_00_52/source/ti/posix/ticlang\" -I\"C:/ti/simplelink_cc13x2_26x2_sdk_5_20_00_52/source/ti/ti_wisunfan/ncp_interface/config\" -I\"C:/ti/simplelink_cc13x2_26x2_sdk_5_20_00_52/source/ti/ti_wisunfan/ncp_interface/include\" -I\"C:/ti/simplelink_cc13x2_26x2_sdk_5_20_00_52/source/ti/ti_wisunfan/ncp_interface/src\" -I\"C:/ti/simplelink_cc13x2_26x2_sdk_5_20_00_52/source/ti/ti_wisunfan/ncp_interface/src/core\" -I\"C:/ti/simplelink_cc13x2_26x2_sdk_5_20_00_52/source/ti/ti_wisunfan/ncp_interface/src/core/utils\" -I\"C:/ti/simplelink_cc13x2_26x2_sdk_5_20_00_52/source/ti/ti_wisunfan/ncp_interface/examples/platforms\" -I\"C:/ti/simplelink_cc13x2_26x2_sdk_5_20_00_52/source/ti/ti_wisunfan/ncp_interface/examples/ncp_ftd\" -I\"C:/ti/simplelink_cc13x2_26x2_sdk_5_20_00_52/source/ti/ti_wisunfan/ncp_interface/examples/ncp_ftd/platform\" -I\"C:/ti/simplelink_cc13x2_26x2_sdk_5_20_00_52/source/ti/ti_wisunfan/ncp_interface/src/core/thread\" -I\"C:/ti/simplelink_cc13x2_26x2_sdk_5_20_00_52/source/ti/ti_wisunfan/ncp_interface/src/ncp\" -I\"C:/ti/simplelink_cc13x2_26x2_sdk_5_20_00_52/source/ti/ti_wisunfan/ncp_interface/examples/ncp_ftd/platform/nv\" -I\"C:/ti/simplelink_cc13x2_26x2_sdk_5_20_00_52/source/ti/ti_wisunfan/wisunfan_mac/low_level/cc13xx/combo\" -I\"C:/ti/simplelink_cc13x2_26x2_sdk_5_20_00_52/source/ti/ti_wisunfan/mbed_port/ti-rf-driver/ti-rf-driver\" -I\"C:/ti/simplelink_cc13x2_26x2_sdk_5_20_00_52/source/ti/ti_wisunfan/apps/udp_nanostack_mesh_tirf\" -I\"C:/ti/simplelink_cc13x2_26x2_sdk_5_20_00_52/source/ti/ti_wisunfan/apps/common/include\" -I\"C:/ti/simplelink_cc13x2_26x2_sdk_5_20_00_52/source/ti/common/nv\" -I\"C:/ti/simplelink_cc13x2_26x2_sdk_5_20_00_52/source/ti/ti_wisunfan/mbed_config/ws_router\" -I\"C:/ti/simplelink_cc13x2_26x2_sdk_5_20_00_52/source/ti/devices/cc13x2_cc26x2\" -I\"C:/ti/simplelink_cc13x2_26x2_sdk_5_20_00_52/source/ti/devices/cc13x2_cc26x2/inc\" -I\"C:/ti/simplelink_cc13x2_26x2_sdk_5_20_00_52/source/ti/devices/cc13x2_cc26x2/driverlib\" -DEXCLUDE_TRACE -DxSWITCH_NCP_TO_TRACE -DTLS_SEC_PROT_LIB_USE_MBEDTLS_PLATFORM_MEMORY -DxWISUN_AUTO_START -DTI_WISUN_FAN_DEBUG -DWISUN_NCP_ENABLE -DBoard_EXCLUDE_NVS_EXTERNAL_FLASH -DDeviceFamily_CC13X2 -gdwarf-3 -fdiagnostics-show-option -fshort-enums -munaligned-access -funsigned-char -fcommon -ffunction-sections -include mbed_config.h -fshort-wchar -fno-strict-aliasing -march=armv7e-m  " "../release.cfg"
    gmake[1]: Entering directory 'C:/Users/PCB CHRISTIAN/workspace_v10/ns_node_CC1352R1_LAUNCHXL_tirtos_ticlang/src/sysbios'
    clm4f C:/Users/PCB ...
    gmake[1]: Leaving directory 'C:/Users/PCB CHRISTIAN/workspace_v10/ns_node_CC1352R1_LAUNCHXL_tirtos_ticlang/src/sysbios'
    ../src/makefile.libs:56: recipe for target '../src/sysbios/rom_sysbios.am4f' failed
    makefile:82: warning: overriding recipe for target 'Users_PCB.o'
    makefile:67: warning: ignoring old recipe for target 'Users_PCB.o'
    makefile:91: warning: overriding recipe for target 'Users_PCB.o'
    makefile:82: warning: ignoring old recipe for target 'Users_PCB.o'
    makefile:100: warning: overriding recipe for target 'Users_PCB.o'
    makefile:91: warning: ignoring old recipe for target 'Users_PCB.o'
    makefile:109: warning: overriding recipe for target 'Users_PCB.o'
    makefile:100: warning: ignoring old recipe for target 'Users_PCB.o'
    makefile:118: warning: overriding recipe for target 'Users_PCB.o'
    makefile:109: warning: ignoring old recipe for target 'Users_PCB.o'
    makefile:127: warning: overriding recipe for target 'Users_PCB.o'
    makefile:118: warning: ignoring old recipe for target 'Users_PCB.o'
    makefile:133: warning: overriding recipe for target 'Users_PCB.o'
    makefile:127: warning: ignoring old recipe for target 'Users_PCB.o'
    makefile:139: warning: overriding recipe for target 'Users_PCB.o'
    makefile:133: warning: ignoring old recipe for target 'Users_PCB.o'
    makefile:145: warning: overriding recipe for target 'Users_PCB.o'
    makefile:139: warning: ignoring old recipe for target 'Users_PCB.o'
    makefile:151: warning: overriding recipe for target 'Users_PCB.o'
    makefile:145: warning: ignoring old recipe for target 'Users_PCB.o'
    makefile:160: warning: overriding recipe for target 'Users_PCB.o'
    makefile:151: warning: ignoring old recipe for target 'Users_PCB.o'
    makefile:169: warning: overriding recipe for target 'Users_PCB.o'
    makefile:160: warning: ignoring old recipe for target 'Users_PCB.o'
    makefile:184: warning: overriding recipe for target 'Users_PCB.o'
    makefile:169: warning: ignoring old recipe for target 'Users_PCB.o'
    makefile:193: warning: overriding recipe for target 'Users_PCB.o'
    makefile:184: warning: ignoring old recipe for target 'Users_PCB.o'
    makefile:208: warning: overriding recipe for target 'Users_PCB.o'
    makefile:193: warning: ignoring old recipe for target 'Users_PCB.o'
    makefile:217: warning: overriding recipe for target 'Users_PCB.o'
    makefile:208: warning: ignoring old recipe for target 'Users_PCB.o'
    makefile:226: warning: overriding recipe for target 'Users_PCB.o'
    makefile:217: warning: ignoring old recipe for target 'Users_PCB.o'
    makefile:235: warning: overriding recipe for target 'Users_PCB.o'
    makefile:226: warning: ignoring old recipe for target 'Users_PCB.o'
    makefile:244: warning: overriding recipe for target 'Users_PCB.o'
    makefile:235: warning: ignoring old recipe for target 'Users_PCB.o'
    makefile:253: warning: overriding recipe for target 'Users_PCB.o'
    makefile:244: warning: ignoring old recipe for target 'Users_PCB.o'
    makefile:265: warning: overriding recipe for target 'Users_PCB.o'
    makefile:253: warning: ignoring old recipe for target 'Users_PCB.o'
    makefile:301: warning: overriding recipe for target 'Users_PCB.o'
    makefile:265: warning: ignoring old recipe for target 'Users_PCB.o'
    makefile:316: warning: overriding recipe for target 'Users_PCB.o'
    makefile:301: warning: ignoring old recipe for target 'Users_PCB.o'
    makefile:334: warning: overriding recipe for target 'Users_PCB.o'
    makefile:316: warning: ignoring old recipe for target 'Users_PCB.o'
    makefile:343: warning: overriding recipe for target 'Users_PCB.o'
    makefile:334: warning: ignoring old recipe for target 'Users_PCB.o'
    makefile:355: warning: overriding recipe for target 'Users_PCB.o'
    makefile:343: warning: ignoring old recipe for target 'Users_PCB.o'
    makefile:361: warning: overriding recipe for target 'Users_PCB.o'
    makefile:355: warning: ignoring old recipe for target 'Users_PCB.o'
    makefile:367: warning: overriding recipe for target 'Users_PCB.o'
    makefile:361: warning: ignoring old recipe for target 'Users_PCB.o'
    makefile:373: warning: overriding recipe for target 'Users_PCB.o'
    makefile:367: warning: ignoring old recipe for target 'Users_PCB.o'
    gmake[1]: *** No rule to make target 'CHRISTIAN/workspace_v10/ns_node_CC1352R1_LAUNCHXL_tirtos_ticlang/Release/configPkg/package/cfg/release_pm4f_ti_sysbios_knl_Clock_config.c', needed by 'cfg_release_pm4f_ti_sysbios_knl_Clock_config.o'.
    gmake[1]: *** No rule to make target 'CHRISTIAN/workspace_v10/ns_node_CC1352R1_LAUNCHXL_tirtos_ticlang/Release/configPkg/package/cfg/release_pm4f_ti_sysbios_knl_Event_config.c', needed by 'cfg_release_pm4f_ti_sysbios_knl_Event_config.o'.
    gmake[1]: *** No rule to make target 'CHRISTIAN/workspace_v10/ns_node_CC1352R1_LAUNCHXL_tirtos_ticlang/Release/configPkg/package/cfg/release_pm4f_ti_sysbios_knl_Mailbox_config.c', needed by 'cfg_release_pm4f_ti_sysbios_knl_Mailbox_config.o'.
    gmake[1]: *** No rule to make target 'CHRISTIAN/workspace_v10/ns_node_CC1352R1_LAUNCHXL_tirtos_ticlang/Release/configPkg/package/cfg/release_pm4f_ti_sysbios_knl_Queue_config.c', needed by 'cfg_release_pm4f_ti_sysbios_knl_Queue_config.o'.
    gmake[1]: *** No rule to make target 'CHRISTIAN/workspace_v10/ns_node_CC1352R1_LAUNCHXL_tirtos_ticlang/Release/configPkg/package/cfg/release_pm4f_ti_sysbios_knl_Semaphore_config.c', needed by 'cfg_release_pm4f_ti_sysbios_knl_Semaphore_config.o'.
    gmake[1]: *** No rule to make target 'CHRISTIAN/workspace_v10/ns_node_CC1352R1_LAUNCHXL_tirtos_ticlang/Release/configPkg/package/cfg/release_pm4f_ti_sysbios_knl_Swi_config.c', needed by 'cfg_release_pm4f_ti_sysbios_knl_Swi_config.o'.
    gmake[1]: *** No rule to make target 'CHRISTIAN/workspace_v10/ns_node_CC1352R1_LAUNCHXL_tirtos_ticlang/Release/configPkg/package/cfg/release_pm4f_ti_sysbios_knl_Task_config.c', needed by 'cfg_release_pm4f_ti_sysbios_knl_Task_config.o'.
    gmake[1]: *** No rule to make target 'CHRISTIAN/workspace_v10/ns_node_CC1352R1_LAUNCHXL_tirtos_ticlang/Release/configPkg/package/cfg/release_pm4f_ti_sysbios_knl_Clock_TimerProxy_config.c', needed by 'cfg_release_pm4f_ti_sysbios_knl_Clock_TimerProxy_config.o'.
    gmake[1]: *** No rule to make target 'CHRISTIAN/workspace_v10/ns_node_CC1352R1_LAUNCHXL_tirtos_ticlang/Release/configPkg/package/cfg/release_pm4f_ti_sysbios_knl_Task_SupportProxy_config.c', needed by 'cfg_release_pm4f_ti_sysbios_knl_Task_SupportProxy_config.o'.
    gmake[1]: *** No rule to make target 'CHRISTIAN/workspace_v10/ns_node_CC1352R1_LAUNCHXL_tirtos_ticlang/Release/configPkg/package/cfg/release_pm4f_ti_sysbios_BIOS_config.c', needed by 'cfg_release_pm4f_ti_sysbios_BIOS_config.o'.
    gmake[1]: *** No rule to make target 'CHRISTIAN/workspace_v10/ns_node_CC1352R1_LAUNCHXL_tirtos_ticlang/Release/configPkg/package/cfg/release_pm4f_ti_sysbios_BIOS_RtsGateProxy_config.c', needed by 'cfg_release_pm4f_ti_sysbios_BIOS_RtsGateProxy_config.o'.
    gmake[1]: *** No rule to make target 'CHRISTIAN/workspace_v10/ns_node_CC1352R1_LAUNCHXL_tirtos_ticlang/Release/configPkg/package/cfg/release_pm4f_ti_sysbios_family_arm_m3_Hwi_config.c', needed by 'cfg_release_pm4f_ti_sysbios_family_arm_m3_Hwi_config.o'.
    gmake[1]: *** No rule to make target 'CHRISTIAN/workspace_v10/ns_node_CC1352R1_LAUNCHXL_tirtos_ticlang/Release/configPkg/package/cfg/release_pm4f_ti_sysbios_family_arm_m3_TaskSupport_config.c', needed by 'cfg_release_pm4f_ti_sysbios_family_arm_m3_TaskSupport_config.o'.
    gmake[1]: *** No rule to make target 'CHRISTIAN/workspace_v10/ns_node_CC1352R1_LAUNCHXL_tirtos_ticlang/Release/configPkg/package/cfg/release_pm4f_ti_sysbios_family_arm_cc26xx_Timer_config.c', needed by 'cfg_release_pm4f_ti_sysbios_family_arm_cc26xx_Timer_config.o'.
    gmake[1]: *** No rule to make target 'CHRISTIAN/workspace_v10/ns_node_CC1352R1_LAUNCHXL_tirtos_ticlang/Release/configPkg/package/cfg/release_pm4f_ti_sysbios_family_arm_cc26xx_TimestampProvider_config.c', needed by 'cfg_release_pm4f_ti_sysbios_family_arm_cc26xx_TimestampProvider_config.o'.
    gmake[1]: *** No rule to make target 'CHRISTIAN/workspace_v10/ns_node_CC1352R1_LAUNCHXL_tirtos_ticlang/Release/configPkg/package/cfg/release_pm4f_ti_sysbios_hal_Hwi_config.c', needed by 'cfg_release_pm4f_ti_sysbios_hal_Hwi_config.o'.
    gmake[1]: *** No rule to make target 'CHRISTIAN/workspace_v10/ns_node_CC1352R1_LAUNCHXL_tirtos_ticlang/Release/configPkg/package/cfg/release_pm4f_ti_sysbios_hal_Hwi_HwiProxy_config.c', needed by 'cfg_release_pm4f_ti_sysbios_hal_Hwi_HwiProxy_config.o'.
    gmake[1]: *** No rule to make target 'CHRISTIAN/workspace_v10/ns_node_CC1352R1_LAUNCHXL_tirtos_ticlang/Release/configPkg/package/cfg/release_pm4f_ti_sysbios_heaps_HeapMem_config.c', needed by 'cfg_release_pm4f_ti_sysbios_heaps_HeapMem_config.o'.
    gmake[1]: *** No rule to make target 'CHRISTIAN/workspace_v10/ns_node_CC1352R1_LAUNCHXL_tirtos_ticlang/Release/configPkg/package/cfg/release_pm4f_ti_sysbios_heaps_HeapTrack_config.c', needed by 'cfg_release_pm4f_ti_sysbios_heaps_HeapTrack_config.o'.
    gmake[1]: *** No rule to make target 'CHRISTIAN/workspace_v10/ns_node_CC1352R1_LAUNCHXL_tirtos_ticlang/Release/configPkg/package/cfg/release_pm4f_ti_sysbios_heaps_HeapMem_Module_GateProxy_config.c', needed by 'cfg_release_pm4f_ti_sysbios_heaps_HeapMem_Module_GateProxy_config.o'.
    gmake[1]: *** No rule to make target 'CHRISTIAN/workspace_v10/ns_node_CC1352R1_LAUNCHXL_tirtos_ticlang/Release/configPkg/package/cfg/release_pm4f_ti_sysbios_gates_GateHwi_config.c', needed by 'cfg_release_pm4f_ti_sysbios_gates_GateHwi_config.o'.
    gmake[1]: *** No rule to make target 'CHRISTIAN/workspace_v10/ns_node_CC1352R1_LAUNCHXL_tirtos_ticlang/Release/configPkg/package/cfg/release_pm4f_ti_sysbios_gates_GateMutex_config.c', needed by 'cfg_release_pm4f_ti_sysbios_gates_GateMutex_config.o'.
    gmake[1]: *** No rule to make target 'CHRISTIAN/workspace_v10/ns_node_CC1352R1_LAUNCHXL_tirtos_ticlang/Release/configPkg/package/cfg/release_pm4f_xdc_runtime_Error_config.c', needed by 'cfg_release_pm4f_xdc_runtime_Error_config.o'.
    gmake[1]: *** No rule to make target 'CHRISTIAN/workspace_v10/ns_node_CC1352R1_LAUNCHXL_tirtos_ticlang/Release/configPkg/package/cfg/release_pm4f_xdc_runtime_Memory_config.c', needed by 'cfg_release_pm4f_xdc_runtime_Memory_config.o'.
    gmake[1]: *** No rule to make target 'CHRISTIAN/workspace_v10/ns_node_CC1352R1_LAUNCHXL_tirtos_ticlang/Release/configPkg/package/cfg/release_pm4f_xdc_runtime_System_config.c', needed by 'cfg_release_pm4f_xdc_runtime_System_config.o'.
    gmake[1]: *** No rule to make target 'CHRISTIAN/workspace_v10/ns_node_CC1352R1_LAUNCHXL_tirtos_ticlang/Release/configPkg/package/cfg/release_pm4f_xdc_runtime_SysCallback_config.c', needed by 'cfg_release_pm4f_xdc_runtime_SysCallback_config.o'.
    gmake[1]: *** No rule to make target 'CHRISTIAN/workspace_v10/ns_node_CC1352R1_LAUNCHXL_tirtos_ticlang/Release/configPkg/package/cfg/release_pm4f_xdc_runtime_Timestamp_config.c', needed by 'cfg_release_pm4f_xdc_runtime_Timestamp_config.o'.
    gmake[1]: *** No rule to make target 'CHRISTIAN/workspace_v10/ns_node_CC1352R1_LAUNCHXL_tirtos_ticlang/Release/configPkg/package/cfg/release_pm4f_xdc_runtime_Memory_HeapProxy_config.c', needed by 'cfg_release_pm4f_xdc_runtime_Memory_HeapProxy_config.o'.
    gmake[1]: *** No rule to make target 'CHRISTIAN/workspace_v10/ns_node_CC1352R1_LAUNCHXL_tirtos_ticlang/Release/configPkg/package/cfg/release_pm4f_xdc_runtime_System_Module_GateProxy_config.c', needed by 'cfg_release_pm4f_xdc_runtime_System_Module_GateProxy_config.o'.
    gmake[1]: *** No rule to make target 'CHRISTIAN/workspace_v10/ns_node_CC1352R1_LAUNCHXL_tirtos_ticlang/Release/configPkg/package/cfg/release_pm4f_xdc_runtime_Timestamp_SupportProxy_config.c', needed by 'cfg_release_pm4f_xdc_runtime_Timestamp_SupportProxy_config.o'.
    tiarmclang: warning: C:/Users/PCB: 'linker' input unused [-Wunused-command-line-argument]
    tiarmclang: warning: argument unused during compilation: '-mcpu=cortex-m4' [-Wunused-command-line-argument]
    tiarmclang: warning: argument unused during compilation: '-mfloat-abi=hard' [-Wunused-command-line-argument]
    tiarmclang: warning: argument unused during compilation: '-mfpu=fpv4-sp-d16' [-Wunused-command-line-argument]
    tiarmclang: warning: argument unused during compilation: '-mthumb' [-Wunused-command-line-argument]
    tiarmclang: warning: argument unused during compilation: '-Oz' [-Wunused-command-line-argument]
    tiarmclang: warning: argument unused during compilation: '-I C:/Users/PCB CHRISTIAN/workspace_v10/ns_node_CC1352R1_LAUNCHXL_tirtos_ticlang' [-Wunused-command-line-argument]
    tiarmclang: warning: argument unused during compilation: '-I C:/Users/PCB CHRISTIAN/workspace_v10/ns_node_CC1352R1_LAUNCHXL_tirtos_ticlang/Release' [-Wunused-command-line-argument]
    tiarmclang: warning: argument unused during compilation: '-I C:/ti/simplelink_cc13x2_26x2_sdk_5_20_00_52/source/ti/ti_wisunfan/mbed_port/ti-rf-driver/source' [-Wunused-command-line-argument]
    tiarmclang: warning: argument unused during compilation: '-I C:/ti/simplelink_cc13x2_26x2_sdk_5_20_00_52/source/ti/ti_wisunfan/mbed_port/mbednanostack2tirtos' [-Wunused-command-line-argument]
    tiarmclang: warning: argument unused during compilation: '-I C:/ti/simplelink_cc13x2_26x2_sdk_5_20_00_52/source/ti/ti_wisunfan/mbed_port/mbednanostack2tirtos/platform' [-Wunused-command-line-argument]
    tiarmclang: warning: argument unused during compilation: '-I C:/ti/simplelink_cc13x2_26x2_sdk_5_20_00_52/source/ti/ti_wisunfan/mbed_port/mbedtls2tirtos' [-Wunused-command-line-argument]
    tiarmclang: warning: argument unused during compilation: '-I C:/ti/simplelink_cc13x2_26x2_sdk_5_20_00_52/source/ti/ti_wisunfan/mbed_port/mbedtls2tirtos/platform' [-Wunused-command-line-argument]
    tiarmclang: warning: argument unused during compilation: '-I C:/ti/simplelink_cc13x2_26x2_sdk_5_20_00_52/source/ti/ti_wisunfan/mbed_port/mbedtls2tirtos/mbedtls/mbed-crypto' [-Wunused-command-line-argument]
    tiarmclang: warning: argument unused during compilation: '-I C:/ti/simplelink_cc13x2_26x2_sdk_5_20_00_52/source/third_party/mbed/frameworks/nanostack-libservice/mbed-client-libservice' [-Wunused-command-line-argument]
    tiarmclang: warning: argument unused during compilation: '-I C:/ti/simplelink_cc13x2_26x2_sdk_5_20_00_52/source/third_party/mbed/frameworks/nanostack-libservice' [-Wunused-command-line-argument]
    tiarmclang: warning: argument unused during compilation: '-I C:/ti/simplelink_cc13x2_26x2_sdk_5_20_00_52/source/third_party/mbed/frameworks/nanostack-libservice/mbed-client-libservice/platform' [-Wunused-command-line-argument]
    tiarmclang: warning: argument unused during compilation: '-I C:/ti/simplelink_cc13x2_26x2_sdk_5_20_00_52/source/third_party/mbed/frameworks/mbed-client-randlib/mbed-client-randlib/platform' [-Wunused-command-line-argument]
    tiarmclang: warning: argument unused during compilation: '-I C:/ti/simplelink_cc13x2_26x2_sdk_5_20_00_52/source/third_party/mbed/frameworks/mbed-client-randlib/mbed-client-randlib' [-Wunused-command-line-argument]
    tiarmclang: warning: argument unused during compilation: '-I C:/ti/simplelink_cc13x2_26x2_sdk_5_20_00_52/source/third_party/mbed/frameworks/mbed-client-randlib' [-Wunused-command-line-argument]
    tiarmclang: warning: argument unused during compilation: '-I C:/ti/simplelink_cc13x2_26x2_sdk_5_20_00_52/source/third_party/mbed/frameworks/mbed-trace' [-Wunused-command-line-argument]
    tiarmclang: warning: argument unused during compilation: '-I C:/ti/simplelink_cc13x2_26x2_sdk_5_20_00_52/source/third_party/mbed/frameworks/mbed-coap' [-Wunused-command-line-argument]
    tiarmclang: warning: argument unused during compilation: '-I C:/ti/simplelink_cc13x2_26x2_sdk_5_20_00_52/source/third_party/mbed/frameworks/mbed-coap/source/include' [-Wunused-command-line-argument]
    tiarmclang: warning: argument unused during compilation: '-I C:/ti/simplelink_cc13x2_26x2_sdk_5_20_00_52/source/third_party/mbed/nanostack/sal-stack-nanostack' [-Wunused-command-line-argument]
    tiarmclang: warning: argument unused during compilation: '-I C:/ti/simplelink_cc13x2_26x2_sdk_5_20_00_52/source/third_party/mbed/nanostack/sal-stack-nanostack/source' [-Wunused-command-line-argument]
    tiarmclang: warning: argument unused during compilation: '-I C:/ti/simplelink_cc13x2_26x2_sdk_5_20_00_52/source/third_party/mbed/nanostack/sal-stack-nanostack/nanostack' [-Wunused-command-line-argument]
    tiarmclang: warning: argument unused during compilation: '-I C:/ti/simplelink_cc13x2_26x2_sdk_5_20_00_52/source/third_party/mbed/nanostack/sal-stack-nanostack/source/Service_Libs/mdns' [-Wunused-command-line-argument]
    tiarmclang: warning: argument unused during compilation: '-I C:/ti/simplelink_cc13x2_26x2_sdk_5_20_00_52/source/third_party/mbed/nanostack/sal-stack-nanostack/source/Service_Libs/mdns/fnet' [-Wunused-command-line-argument]
    tiarmclang: warning: argument unused during compilation: '-I C:/ti/simplelink_cc13x2_26x2_sdk_5_20_00_52/source/third_party/mbed/nanostack/sal-stack-nanostack/source/Service_Libs/mdns/fnet/fnet_stack' [-Wunused-command-line-argument]
    tiarmclang: warning: argument unused during compilation: '-I C:/ti/simplelink_cc13x2_26x2_sdk_5_20_00_52/source/third_party/mbed/nanostack/sal-stack-nanostack/source/Service_Libs/mdns/fnet/fnet_stack/stack' [-Wunused-command-line-argument]
    tiarmclang: warning: argument unused during compilation: '-I C:/ti/simplelink_cc13x2_26x2_sdk_5_20_00_52/source/third_party/mbed/nanostack/sal-stack-nanostack/source/Service_Libs/mdns/fnet/fnet_stack/services/serial' [-Wunused-command-line-argument]
    tiarmclang: warning: argument unused during compilation: '-I C:/ti/simplelink_cc13x2_26x2_sdk_5_20_00_52/source/third_party/mbed/nanostack/sal-stack-nanostack/source/Core/include' [-Wunused-command-line-argument]
    tiarmclang: warning: argument unused during compilation: '-I C:/ti/simplelink_cc13x2_26x2_sdk_5_20_00_52/source/third_party/mbed/nanostack/sal-stack-nanostack/source/6LowPAN' [-Wunused-command-line-argument]
    tiarmclang: warning: argument unused during compilation: '-I C:/ti/simplelink_cc13x2_26x2_sdk_5_20_00_52/source/third_party/mbed/nanostack/sal-stack-nanostack-eventloop' [-Wunused-command-line-argument]
    tiarmclang: warning: argument unused during compilation: '-I C:/ti/simplelink_cc13x2_26x2_sdk_5_20_00_52/source/third_party/mbed/nanostack/sal-stack-nanostack-eventloop/nanostack-event-loop' [-Wunused-command-line-argument]
    tiarmclang: warning: argument unused during compilation: '-I C:/ti/simplelink_cc13x2_26x2_sdk_5_20_00_52/source/third_party/mbed/nanostack/sal-stack-nanostack-eventloop/nanostack-event-loop/platform' [-Wunused-command-line-argument]
    tiarmclang: warning: argument unused during compilation: '-I C:/ti/simplelink_cc13x2_26x2_sdk_5_20_00_52/source/third_party/mbed/nanostack/nanostack-hal-mbed-cmsis-rtos' [-Wunused-command-line-argument]
    tiarmclang: warning: argument unused during compilation: '-I C:/ti/simplelink_cc13x2_26x2_sdk_5_20_00_52/source/third_party/mbed/nanostack/mbed-mesh-api/source/include' [-Wunused-command-line-argument]
    tiarmclang: warning: argument unused during compilation: '-I C:/ti/simplelink_cc13x2_26x2_sdk_5_20_00_52/source/third_party/mbed/nanostack/mbed-mesh-api/mbed-mesh-api' [-Wunused-command-line-argument]
    tiarmclang: warning: argument unused during compilation: '-I C:/ti/simplelink_cc13x2_26x2_sdk_5_20_00_52/source/third_party/mbed/nanostack/mbed-mesh-api' [-Wunused-command-line-argument]
    tiarmclang: warning: argument unused during compilation: '-I C:/ti/simplelink_cc13x2_26x2_sdk_5_20_00_52/source/third_party/mbed/nanostack/coap-service/coap-service' [-Wunused-command-line-argument]
    tiarmclang: warning: argument unused during compilation: '-I C:/ti/simplelink_cc13x2_26x2_sdk_5_20_00_52/source/third_party/mbed/nanostack/coap-service/source/include' [-Wunused-command-line-argument]
    tiarmclang: warning: argument unused during compilation: '-I C:/ti/simplelink_cc13x2_26x2_sdk_5_20_00_52/source/third_party/ti_wisunfan/mbedtls/inc' [-Wunused-command-line-argument]
    tiarmclang: warning: argument unused during compilation: '-I C:/ti/simplelink_cc13x2_26x2_sdk_5_20_00_52/source/third_party/ti_wisunfan/mbedtls' [-Wunused-command-line-argument]
    tiarmclang: warning: argument unused during compilation: '-I C:/ti/simplelink_cc13x2_26x2_sdk_5_20_00_52/source/third_party/ti_wisunfan/mbedtls/platform/inc' [-Wunused-command-line-argument]
    tiarmclang: warning: argument unused during compilation: '-I C:/ti/simplelink_cc13x2_26x2_sdk_5_20_00_52/source/third_party/ti_wisunfan/mbedtls/platform/COMPONENT_PSA_SRV_IMPL/COMPONENT_NSPE' [-Wunused-command-line-argument]
    tiarmclang: warning: argument unused during compilation: '-I C:/ti/simplelink_cc13x2_26x2_sdk_5_20_00_52/source/ti/ti_wisunfan' [-Wunused-command-line-argument]
    tiarmclang: warning: argument unused during compilation: '-I C:/ti/simplelink_cc13x2_26x2_sdk_5_20_00_52/source/ti/ti_wisunfan/shell' [-Wunused-command-line-argument]
    tiarmclang: warning: argument unused during compilation: '-I C:/ti/simplelink_cc13x2_26x2_sdk_5_20_00_52/source/ti/ti_wisunfan/config' [-Wunused-command-line-argument]
    tiarmclang: warning: argument unused during compilation: '-I C:/ti/simplelink_cc13x2_26x2_sdk_5_20_00_52/source/ti/ti_wisunfan/uip' [-Wunused-command-line-argument]
    tiarmclang: warning: argument unused during compilation: '-I C:/ti/simplelink_cc13x2_26x2_sdk_5_20_00_52/source/ti/ti_wisunfan/uip/conf' [-Wunused-command-line-argument]
    tiarmclang: warning: argument unused during compilation: '-I C:/ti/simplelink_cc13x2_26x2_sdk_5_20_00_52/source/ti/ti_wisunfan/uip/inc' [-Wunused-command-line-argument]
    tiarmclang: warning: argument unused during compilation: '-I C:/ti/simplelink_cc13x2_26x2_sdk_5_20_00_52/source/ti/ti_wisunfan/uip/pltfrm/sysbios' [-Wunused-command-line-argument]
    tiarmclang: warning: argument unused during compilation: '-I C:/ti/simplelink_cc13x2_26x2_sdk_5_20_00_52/source/ti/ti_wisunfan/uip/net' [-Wunused-command-line-argument]
    tiarmclang: warning: argument unused during compilation: '-I C:/ti/simplelink_cc13x2_26x2_sdk_5_20_00_52/source/ti/ti_wisunfan/wisunfan_mac/services' [-Wunused-command-line-argument]
    tiarmclang: warning: argument unused during compilation: '-I C:/ti/simplelink_cc13x2_26x2_sdk_5_20_00_52/source/ti/ti_wisunfan/wisunfan_mac/hal/assert' [-Wunused-command-line-argument]
    tiarmclang: warning: argument unused during compilation: '-I C:/ti/simplelink_cc13x2_26x2_sdk_5_20_00_52/source/ti/ti_wisunfan/wisunfan_mac/hal/appasrt' [-Wunused-command-line-argument]
    tiarmclang: warning: argument unused during compilation: '-I C:/ti/simplelink_cc13x2_26x2_sdk_5_20_00_52/source/ti/ti_wisunfan/wisunfan_mac/hal/crypto' [-Wunused-command-line-argument]
    tiarmclang: warning: argument unused during compilation: '-I C:/ti/simplelink_cc13x2_26x2_sdk_5_20_00_52/source/ti/ti_wisunfan/wisunfan_mac/hal/platform' [-Wunused-command-line-argument]
    tiarmclang: warning: argument unused during compilation: '-I C:/ti/simplelink_cc13x2_26x2_sdk_5_20_00_52/source/ti/ti_wisunfan/wisunfan_mac/hal/rf' [-Wunused-command-line-argument]
    tiarmclang: warning: argument unused during compilation: '-I C:/ti/simplelink_cc13x2_26x2_sdk_5_20_00_52/source/ti/ti_wisunfan/wisunfan_mac/high_level' [-Wunused-command-line-argument]
    tiarmclang: warning: argument unused during compilation: '-I C:/ti/simplelink_cc13x2_26x2_sdk_5_20_00_52/source/ti/ti_wisunfan/wisunfan_mac/low_level' [-Wunused-command-line-argument]
    tiarmclang: warning: argument unused during compilation: '-I C:/ti/simplelink_cc13x2_26x2_sdk_5_20_00_52/source/ti/ti_wisunfan/wisunfan_mac/common/osal_port' [-Wunused-command-line-argument]
    tiarmclang: warning: argument unused during compilation: '-I C:/ti/simplelink_cc13x2_26x2_sdk_5_20_00_52/source/ti/ti_wisunfan/wisunfan_mac/common' [-Wunused-command-line-argument]
    tiarmclang: warning: argument unused during compilation: '-I C:/ti/simplelink_cc13x2_26x2_sdk_5_20_00_52/source/ti/ti_wisunfan/wisunfan_mac/common/boards' [-Wunused-command-line-argument]
    tiarmclang: warning: argument unused during compilation: '-I C:/ti/simplelink_cc13x2_26x2_sdk_5_20_00_52/source/ti/ti_wisunfan/wisunfan_mac/common/util' [-Wunused-command-line-argument]
    tiarmclang: warning: argument unused during compilation: '-I C:/ti/simplelink_cc13x2_26x2_sdk_5_20_00_52/source/ti/ti_wisunfan/wisunfan_mac/common/inc' [-Wunused-command-line-argument]
    tiarmclang: warning: argument unused during compilation: '-I C:/ti/simplelink_cc13x2_26x2_sdk_5_20_00_52/source/ti/ti_wisunfan/wisunfan_mac/common/stack/src' [-Wunused-command-line-argument]
    tiarmclang: warning: argument unused during compilation: '-I C:/ti/simplelink_cc13x2_26x2_sdk_5_20_00_52/source/ti/ti_wisunfan/wisunfan_mac/common/stack/tirtos/inc' [-Wunused-command-line-argument]
    tiarmclang: warning: argument unused during compilation: '-I C:/ti/simplelink_cc13x2_26x2_sdk_5_20_00_52/source/ti/ti_wisunfan/wisunfan_mac/common/heapmgr' [-Wunused-command-line-argument]
    tiarmclang: warning: argument unused during compilation: '-I C:/ti/simplelink_cc13x2_26x2_sdk_5_20_00_52/source/ti/ti_wisunfan/wisunfan_mac/services/saddr' [-Wunused-command-line-argument]
    tiarmclang: warning: argument unused during compilation: '-I C:/ti/simplelink_cc13x2_26x2_sdk_5_20_00_52/source/ti/ti_wisunfan/wisunfan_mac/services/sdata' [-Wunused-command-line-argument]
    tiarmclang: warning: argument unused during compilation: '-I C:/ti/simplelink_cc13x2_26x2_sdk_5_20_00_52/source/ti/ti_wisunfan/wisunfan_mac/fh' [-Wunused-command-line-argument]
    tiarmclang: warning: argument unused during compilation: '-I C:/ti/simplelink_cc13x2_26x2_sdk_5_20_00_52/source/ti/ti_wisunfan/wisunfan_mac/inc' [-Wunused-command-line-argument]
    tiarmclang: warning: argument unused during compilation: '-I C:/ti/simplelink_cc13x2_26x2_sdk_5_20_00_52/source/ti/ti_wisunfan/wisunfan_mac/rom' [-Wunused-command-line-argument]
    tiarmclang: warning: argument unused during compilation: '-I C:/ti/simplelink_cc13x2_26x2_sdk_5_20_00_52/source/ti/ti_wisunfan/wisunfan_mac/inc/cc13xx' [-Wunused-command-line-argument]
    tiarmclang: warning: argument unused during compilation: '-I C:/ti/simplelink_cc13x2_26x2_sdk_5_20_00_52/source/ti/ti_wisunfan/wisunfan_mac/low_level/cc13xx' [-Wunused-command-line-argument]
    tiarmclang: warning: argument unused during compilation: '-I C:/ti/simplelink_cc13x2_26x2_sdk_5_20_00_52/source/ti/ti_wisunfan/wisunfan_mac/tracer' [-Wunused-command-line-argument]
    tiarmclang: warning: argument unused during compilation: '-I C:/ti/simplelink_cc13x2_26x2_sdk_5_20_00_52/source/third_party/mbed/nanostack/mbed-mesh-api/source' [-Wunused-command-line-argument]
    tiarmclang: warning: argument unused during compilation: '-I C:/ti/simplelink_cc13x2_26x2_sdk_5_20_00_52/source/third_party/mbed/nanostack/sal-stack-nanostack/source/6LoWPAN/MAC' [-Wunused-command-line-argument]
    tiarmclang: warning: argument unused during compilation: '-I C:/ti/simplelink_cc13x2_26x2_sdk_5_20_00_52/source/third_party/mbed/nanostack/sal-stack-nanostack/source/6LoWPAN/Thread' [-Wunused-command-line-argument]
    tiarmclang: warning: argument unused during compilation: '-I C:/ti/simplelink_cc13x2_26x2_sdk_5_20_00_52/source/third_party/mbed/nanostack/sal-stack-nanostack/source/Security/PANA' [-Wunused-command-line-argument]
    tiarmclang: warning: argument unused during compilation: '-I C:/ti/simplelink_cc13x2_26x2_sdk_5_20_00_52/source/third_party/mbed/nanostack/sal-stack-nanostack/source/Service_Libs/mdns/fnet/fnet_stack/services/mdns' [-Wunused-command-line-argument]
    tiarmclang: warning: argument unused during compilation: '-I C:/ti/simplelink_cc13x2_26x2_sdk_5_20_00_52/source/third_party/mbed/nanostack/sal-stack-nanostack/source/Service_Libs/fnv_hash' [-Wunused-command-line-argument]
    tiarmclang: warning: argument unused during compilation: '-I C:/ti/simplelink_cc13x2_26x2_sdk_5_20_00_52/source/third_party/mbed/nanostack/sal-stack-nanostack/source/Service_Libs/hmac' [-Wunused-command-line-argument]
    tiarmclang: warning: argument unused during compilation: '-I C:/ti/simplelink_cc13x2_26x2_sdk_5_20_00_52/source/third_party/mbed/nanostack/sal-stack-nanostack/source/Service_Libs/load_balance' [-Wunused-command-line-argument]
    tiarmclang: warning: argument unused during compilation: '-I C:/ti/simplelink_cc13x2_26x2_sdk_5_20_00_52/source/third_party/mbed/nanostack/sal-stack-nanostack/source/libNET/src' [-Wunused-command-line-argument]
    tiarmclang: warning: argument unused during compilation: '-I C:/ti/simplelink_cc13x2_26x2_sdk_5_20_00_52/source/third_party/mbed/nanostack/sal-stack-nanostack-eventloop/source' [-Wunused-command-line-argument]
    tiarmclang: warning: argument unused during compilation: '-I C:/ti/simplelink_cc13x2_26x2_sdk_5_20_00_52/source/third_party/ti_wisunfan/mbedtls/platform/COMPONENT_PSA_SRV_IMPL' [-Wunused-command-line-argument]
    tiarmclang: warning: argument unused during compilation: '-I C:/ti/simplelink_cc13x2_26x2_sdk_5_20_00_52/source/third_party/mbed/nanostack/sal-stack-nanostack/source/Service_Libs/whiteboard' [-Wunused-command-line-argument]
    tiarmclang: warning: argument unused during compilation: '-I C:/ti/simplelink_cc13x2_26x2_sdk_5_20_00_52/source/third_party/mbed/nanostack/sal-stack-nanostack/source/6LoWPAN/ws' [-Wunused-command-line-argument]
    tiarmclang: warning: argument unused during compilation: '-I C:/ti/simplelink_cc13x2_26x2_sdk_5_20_00_52/source/third_party/mbed/nanostack/sal-stack-nanostack/source/DHCPv6_client' [-Wunused-command-line-argument]
    tiarmclang: warning: argument unused during compilation: '-I C:/ti/simplelink_cc13x2_26x2_sdk_5_20_00_52/source/third_party/mbed/nanostack/sal-stack-nanostack/source/libDHCPv6' [-Wunused-command-line-argument]
    tiarmclang: warning: argument unused during compilation: '-I C:/ti/simplelink_cc13x2_26x2_sdk_5_20_00_52/source/third_party/mbed/nanostack/sal-stack-nanostack/source/Service_Libs/utils' [-Wunused-command-line-argument]
    tiarmclang: warning: argument unused during compilation: '-I C:/ti/simplelink_cc13x2_26x2_sdk_5_20_00_52/source/third_party/mbed/nanostack/sal-stack-nanostack/source/Service_Libs/pan_blacklist' [-Wunused-command-line-argument]
    tiarmclang: warning: argument unused during compilation: '-I C:/ti/simplelink_cc13x2_26x2_sdk_5_20_00_52/source/third_party/mbed/nanostack/sal-stack-nanostack/source/Common_Protocols' [-Wunused-command-line-argument]
    tiarmclang: warning: argument unused during compilation: '-I C:/ti/simplelink_cc13x2_26x2_sdk_5_20_00_52/source/ti/posix/ticlang' [-Wunused-command-line-argument]
    tiarmclang: warning: argument unused during compilation: '-I C:/ti/simplelink_cc13x2_26x2_sdk_5_20_00_52/source/ti/ti_wisunfan/ncp_interface/config' [-Wunused-command-line-argument]
    tiarmclang: warning: argument unused during compilation: '-I C:/ti/simplelink_cc13x2_26x2_sdk_5_20_00_52/source/ti/ti_wisunfan/ncp_interface/include' [-Wunused-command-line-argument]
    tiarmclang: warning: argument unused during compilation: '-I C:/ti/simplelink_cc13x2_26x2_sdk_5_20_00_52/source/ti/ti_wisunfan/ncp_interface/src' [-Wunused-command-line-argument]
    tiarmclang: warning: argument unused during compilation: '-I C:/ti/simplelink_cc13x2_26x2_sdk_5_20_00_52/source/ti/ti_wisunfan/ncp_interface/src/core' [-Wunused-command-line-argument]
    tiarmclang: warning: argument unused during compilation: '-I C:/ti/simplelink_cc13x2_26x2_sdk_5_20_00_52/source/ti/ti_wisunfan/ncp_interface/src/core/utils' [-Wunused-command-line-argument]
    tiarmclang: warning: argument unused during compilation: '-I C:/ti/simplelink_cc13x2_26x2_sdk_5_20_00_52/source/ti/ti_wisunfan/ncp_interface/examples/platforms' [-Wunused-command-line-argument]
    tiarmclang: warning: argument unused during compilation: '-I C:/ti/simplelink_cc13x2_26x2_sdk_5_20_00_52/source/ti/ti_wisunfan/ncp_interface/examples/ncp_ftd' [-Wunused-command-line-argument]
    tiarmclang: warning: argument unused during compilation: '-I C:/ti/simplelink_cc13x2_26x2_sdk_5_20_00_52/source/ti/ti_wisunfan/ncp_interface/examples/ncp_ftd/platform' [-Wunused-command-line-argument]
    tiarmclang: warning: argument unused during compilation: '-I C:/ti/simplelink_cc13x2_26x2_sdk_5_20_00_52/source/ti/ti_wisunfan/ncp_interface/src/core/thread' [-Wunused-command-line-argument]
    tiarmclang: warning: argument unused during compilation: '-I C:/ti/simplelink_cc13x2_26x2_sdk_5_20_00_52/source/ti/ti_wisunfan/ncp_interface/src/ncp' [-Wunused-command-line-argument]
    tiarmclang: warning: argument unused during compilation: '-I C:/ti/simplelink_cc13x2_26x2_sdk_5_20_00_52/source/ti/ti_wisunfan/ncp_interface/examples/ncp_ftd/platform/nv' [-Wunused-command-line-argument]
    tiarmclang: warning: argument unused during compilation: '-I C:/ti/simplelink_cc13x2_26x2_sdk_5_20_00_52/source/ti/ti_wisunfan/wisunfan_mac/low_level/cc13xx/combo' [-Wunused-command-line-argument]
    tiarmclang: warning: argument unused during compilation: '-I C:/ti/simplelink_cc13x2_26x2_sdk_5_20_00_52/source/ti/ti_wisunfan/mbed_port/ti-rf-driver/ti-rf-driver' [-Wunused-command-line-argument]
    tiarmclang: warning: argument unused during compilation: '-I C:/ti/simplelink_cc13x2_26x2_sdk_5_20_00_52/source/ti/ti_wisunfan/apps/udp_nanostack_mesh_tirf' [-Wunused-command-line-argument]
    tiarmclang: warning: argument unused during compilation: '-I C:/ti/simplelink_cc13x2_26x2_sdk_5_20_00_52/source/ti/ti_wisunfan/apps/common/include' [-Wunused-command-line-argument]
    tiarmclang: warning: argument unused during compilation: '-I C:/ti/simplelink_cc13x2_26x2_sdk_5_20_00_52/source/ti/common/nv' [-Wunused-command-line-argument]
    tiarmclang: warning: argument unused during compilation: '-I C:/ti/simplelink_cc13x2_26x2_sdk_5_20_00_52/source/ti/ti_wisunfan/mbed_config/ws_router' [-Wunused-command-line-argument]
    tiarmclang: warning: argument unused during compilation: '-I C:/ti/simplelink_cc13x2_26x2_sdk_5_20_00_52/source/ti/devices/cc13x2_cc26x2' [-Wunused-command-line-argument]
    tiarmclang: warning: argument unused during compilation: '-I C:/ti/simplelink_cc13x2_26x2_sdk_5_20_00_52/source/ti/devices/cc13x2_cc26x2/inc' [-Wunused-command-line-argument]
    tiarmclang: warning: argument unused during compilation: '-I C:/ti/simplelink_cc13x2_26x2_sdk_5_20_00_52/source/ti/devices/cc13x2_cc26x2/driverlib' [-Wunused-command-line-argument]
    tiarmclang: warning: argument unused during compilation: '-D EXCLUDE_TRACE' [-Wunused-command-line-argument]
    tiarmclang: warning: argument unused during compilation: '-D xSWITCH_NCP_TO_TRACE' [-Wunused-command-line-argument]
    tiarmclang: warning: argument unused during compilation: '-D TLS_SEC_PROT_LIB_USE_MBEDTLS_PLATFORM_MEMORY' [-Wunused-command-line-argument]
    tiarmclang: warning: argument unused during compilation: '-D xWISUN_AUTO_START' [-Wunused-command-line-argument]
    tiarmclang: warning: argument unused during compilation: '-D TI_WISUN_FAN_DEBUG' [-Wunused-command-line-argument]
    tiarmclang: warning: argument unused during compilation: '-D WISUN_NCP_ENABLE' [-Wunused-command-line-argument]
    tiarmclang: warning: argument unused during compilation: '-D Board_EXCLUDE_NVS_EXTERNAL_FLASH' [-Wunused-command-line-argument]
    tiarmclang: warning: argument unused during compilation: '-D DeviceFamily_CC13X2' [-Wunused-command-line-argument]
    tiarmclang: warning: argument unused during compilation: '-gdwarf-3' [-Wunused-command-line-argument]
    tiarmclang: warning: argument unused during compilation: '-fdiagnostics-show-option' [-Wunused-command-line-argument]
    tiarmclang: warning: argument unused during compilation: '-fshort-enums' [-Wunused-command-line-argument]
    tiarmclang: warning: argument unused during compilation: '-munaligned-access' [-Wunused-command-line-argument]
    tiarmclang: warning: argument unused during compilation: '-funsigned-char' [-Wunused-command-line-argument]
    tiarmclang: warning: argument unused during compilation: '-fcommon' [-Wunused-command-line-argument]
    tiarmclang: warning: argument unused during compilation: '-ffunction-sections' [-Wunused-command-line-argument]
    tiarmclang: warning: argument unused during compilation: '-include mbed_config.h' [-Wunused-command-line-argument]
    tiarmclang: warning: argument unused during compilation: '-fshort-wchar' [-Wunused-command-line-argument]
    tiarmclang: warning: argument unused during compilation: '-fno-strict-aliasing' [-Wunused-command-line-argument]
    tiarmclang: warning: argument unused during compilation: '-mcpu=cortex-m4' [-Wunused-command-line-argument]
    tiarmclang: warning: argument unused during compilation: '-mfloat-abi=hard' [-Wunused-command-line-argument]
    tiarmclang: warning: argument unused during compilation: '-mfpu=fpv4-sp-d16' [-Wunused-command-line-argument]
    tiarmclang: warning: argument unused during compilation: '-Oz' [-Wunused-command-line-argument]
    tiarmclang: warning: argument unused during compilation: '-g' [-Wunused-command-line-argument]
    tiarmclang: warning: argument unused during compilation: '-D ti_sysbios_family_arm_cc26xx_Boot_driverlibVersion=2' [-Wunused-command-line-argument]
    tiarmclang: warning: argument unused during compilation: '-D ti_posix_tirtos_Settings_debug__D=FALSE' [-Wunused-command-line-argument]
    tiarmclang: warning: argument unused during compilation: '-D ti_sysbios_knl_Clock_stopCheckNext__D=TRUE' [-Wunused-command-line-argument]
    tiarmclang: warning: argument unused during compilation: '-D ti_sysbios_family_arm_m3_Hwi_enableException__D=FALSE' [-Wunused-command-line-argument]
    tiarmclang: warning: argument unused during compilation: '-D ti_sysbios_family_arm_m3_Hwi_disablePriority__D=32U' [-Wunused-command-line-argument]
    tiarmclang: warning: argument unused during compilation: '-D ti_sysbios_family_arm_m3_Hwi_numSparseInterrupts__D=0U' [-Wunused-command-line-argument]
    tiarmclang: warning: argument unused during compilation: '-D ti_sysbios_knl_Task_minimizeLatency__D=FALSE' [-Wunused-command-line-argument]
    tiarmclang: warning: argument unused during compilation: '-D ti_sysbios_BIOS_swiEnabled__D=TRUE' [-Wunused-command-line-argument]
    tiarmclang: warning: argument unused during compilation: '-D ti_sysbios_BIOS_taskEnabled__D=TRUE' [-Wunused-command-line-argument]
    tiarmclang: warning: argument unused during compilation: '-D ti_sysbios_BIOS_clockEnabled__D=TRUE' [-Wunused-command-line-argument]
    tiarmclang: warning: argument unused during compilation: '-D ti_sysbios_BIOS_runtimeCreatesEnabled__D=TRUE' [-Wunused-command-line-argument]
    tiarmclang: warning: argument unused during compilation: '-D ti_sysbios_knl_Task_moduleStateCheckFlag__D=FALSE' [-Wunused-command-line-argument]
    tiarmclang: warning: argument unused during compilation: '-D ti_sysbios_knl_Task_objectCheckFlag__D=FALSE' [-Wunused-command-line-argument]
    tiarmclang: warning: argument unused during compilation: '-D ti_sysbios_hal_Hwi_DISABLE_ALL_HOOKS' [-Wunused-command-line-argument]
    tiarmclang: warning: argument unused during compilation: '-D ti_sysbios_knl_Swi_DISABLE_ALL_HOOKS' [-Wunused-command-line-argument]
    tiarmclang: warning: argument unused during compilation: '-D ti_sysbios_BIOS_smpEnabled__D=FALSE' [-Wunused-command-line-argument]
    tiarmclang: warning: argument unused during compilation: '-D ti_sysbios_Build_useHwiMacros' [-Wunused-command-line-argument]
    tiarmclang: warning: argument unused during compilation: '-D ti_sysbios_Build_useIndirectReferences=FALSE' [-Wunused-command-line-argument]
    tiarmclang: warning: argument unused during compilation: '-D ti_sysbios_knl_Swi_numPriorities__D=6' [-Wunused-command-line-argument]
    tiarmclang: warning: argument unused during compilation: '-D ti_sysbios_knl_Task_deleteTerminatedTasks__D=FALSE' [-Wunused-command-line-argument]
    tiarmclang: warning: argument unused during compilation: '-D ti_sysbios_knl_Task_numPriorities__D=6' [-Wunused-command-line-argument]
    tiarmclang: warning: argument unused during compilation: '-D ti_sysbios_knl_Task_checkStackFlag__D=FALSE' [-Wunused-command-line-argument]
    tiarmclang: warning: argument unused during compilation: '-D ti_sysbios_knl_Task_initStackFlag__D=TRUE' [-Wunused-command-line-argument]
    tiarmclang: warning: argument unused during compilation: '-D ti_sysbios_knl_Task_DISABLE_ALL_HOOKS' [-Wunused-command-line-argument]
    tiarmclang: warning: argument unused during compilation: '-D ti_sysbios_knl_Clock_TICK_SOURCE=ti_sysbios_knl_Clock_TickSource_TIMER' [-Wunused-command-line-argument]
    tiarmclang: warning: argument unused during compilation: '-D ti_sysbios_knl_Clock_TICK_MODE=ti_sysbios_knl_Clock_TickMode_DYNAMIC' [-Wunused-command-line-argument]
    tiarmclang: warning: argument unused during compilation: '-D ti_sysbios_hal_Core_delegate_getId=ti_sysbios_hal_CoreNull_getId__E' [-Wunused-command-line-argument]
    tiarmclang: warning: argument unused during compilation: '-D ti_sysbios_hal_Core_delegate_interruptCore=ti_sysbios_hal_CoreNull_interruptCore__E' [-Wunused-command-line-argument]
    tiarmclang: warning: argument unused during compilation: '-D ti_sysbios_hal_Core_delegate_lock=ti_sysbios_hal_CoreNull_lock__E' [-Wunused-command-line-argument]
    tiarmclang: warning: argument unused during compilation: '-D ti_sysbios_hal_Core_delegate_unlock=ti_sysbios_hal_CoreNull_unlock__E' [-Wunused-command-line-argument]
    tiarmclang: warning: argument unused during compilation: '-D ti_sysbios_hal_Core_numCores__D=1' [-Wunused-command-line-argument]
    tiarmclang: warning: argument unused during compilation: '-D ti_sysbios_hal_CoreNull_numCores__D=1' [-Wunused-command-line-argument]
    tiarmclang: warning: argument unused during compilation: '-D ti_sysbios_utils_Load_taskEnabled__D=TRUE' [-Wunused-command-line-argument]
    tiarmclang: warning: argument unused during compilation: '-D ti_sysbios_utils_Load_swiEnabled__D=FALSE' [-Wunused-command-line-argument]
    tiarmclang: warning: argument unused during compilation: '-D ti_sysbios_utils_Load_hwiEnabled__D=FALSE' [-Wunused-command-line-argument]
    tiarmclang: warning: argument unused during compilation: '-D ti_sysbios_family_arm_m3_Hwi_dispatcherSwiSupport__D=TRUE' [-Wunused-command-line-argument]
    tiarmclang: warning: argument unused during compilation: '-D ti_sysbios_family_arm_m3_Hwi_dispatcherTaskSupport__D=TRUE' [-Wunused-command-line-argument]
    tiarmclang: warning: argument unused during compilation: '-D ti_sysbios_family_arm_m3_Hwi_dispatcherAutoNestingSupport__D=TRUE' [-Wunused-command-line-argument]
    tiarmclang: warning: argument unused during compilation: '-D ti_sysbios_family_arm_m3_Hwi_dispatcherIrpTrackingSupport__D=TRUE' [-Wunused-command-line-argument]
    tiarmclang: warning: argument unused during compilation: '-D ti_sysbios_knl_Semaphore_supportsEvents__D=FALSE' [-Wunused-command-line-argument]
    tiarmclang: warning: argument unused during compilation: '-D ti_sysbios_knl_Semaphore_supportsPriority__D=FALSE' [-Wunused-command-line-argument]
    tiarmclang: warning: argument unused during compilation: '-D xdc_runtime_Assert_DISABLE_ALL' [-Wunused-command-line-argument]
    tiarmclang: warning: argument unused during compilation: '-D xdc_runtime_Log_DISABLE_ALL' [-Wunused-command-line-argument]
    tiarmclang: warning: argument unused during compilation: '-D EXCLUDE_TRACE' [-Wunused-command-line-argument]
    tiarmclang: warning: argument unused during compilation: '-D xSWITCH_NCP_TO_TRACE' [-Wunused-command-line-argument]
    tiarmclang: warning: argument unused during compilation: '-D TLS_SEC_PROT_LIB_USE_MBEDTLS_PLATFORM_MEMORY' [-Wunused-command-line-argument]
    tiarmclang: warning: argument unused during compilation: '-D xWISUN_AUTO_START' [-Wunused-command-line-argument]
    tiarmclang: warning: argument unused during compilation: '-D TI_WISUN_FAN_DEBUG' [-Wunused-command-line-argument]
    tiarmclang: warning: argument unused during compilation: '-D WISUN_NCP_ENABLE' [-Wunused-command-line-argument]
    tiarmclang: warning: argument unused during compilation: '-D Board_EXCLUDE_NVS_EXTERNAL_FLASH' [-Wunused-command-line-argument]
    tiarmclang: warning: argument unused during compilation: '-D DeviceFamily_CC13X2' [-Wunused-command-line-argument]
    tiarmclang: warning: argument unused during compilation: '-I C:/ti/ccs1040/xdctools_3_62_01_15_core/packages/' [-Wunused-command-line-argument]
    tiarmclang: warning: argument unused during compilation: '-D xdc_target_types__=C:/ti/simplelink_cc13x2_26x2_sdk_5_20_00_52/kernel/tirtos/packages/ti/targets/arm/clang/std.h' [-Wunused-command-line-argument]
    tiarmclang: warning: argument unused during compilation: '-D xdc_target_name__=M4F' [-Wunused-command-line-argument]
    tiarmclang: warning: argument unused during compilation: '-I C:/ti/simplelink_cc13x2_26x2_sdk_5_20_00_52/kernel/tirtos/packages/' [-Wunused-command-line-argument]
    tiarmclang: warning: argument unused during compilation: '-I C:/ti/simplelink_cc13x2_26x2_sdk_5_20_00_52/source/ti/posix/ticlang' [-Wunused-command-line-argument]
    tiarmclang: warning: argument unused during compilation: '-I C:/ti/simplelink_cc13x2_26x2_sdk_5_20_00_52/source/' [-Wunused-command-line-argument]
    tiarmclang: warning: argument unused during compilation: '-I C:/ti/simplelink_cc13x2_26x2_sdk_5_20_00_52/kernel/tirtos/packages/' [-Wunused-command-line-argument]
    tiarmclang: warning: argument unused during compilation: '-I C:/ti/ccs1040/xdctools_3_62_01_15_core/packages/' [-Wunused-command-line-argument]
    tiarmclang: warning: argument unused during compilation: '-I ../' [-Wunused-command-line-argument]
    tiarmclang: warning: argument unused during compilation: '-I /packages//' [-Wunused-command-line-argument]
    gmake[1]: Target 'all' not remade because of errors.
    gmake: *** [../src/sysbios/rom_sysbios.am4f] Error 2
    configuring release.xm4f from package/cfg/release_pm4f.cfg ...
    generating custom ROM library makefile ... 
    Starting build of library sources ...
    Build of libraries failed.
    subdir_rules.mk:24: recipe for target 'build-1796804607-inproc' failed
    C:/Users/PCB:1: *** missing separator.  Stop.
    error: xdc.cfg.SourceDir: "C:/ti/ccs1040/xdctools_3_62_01_15_core/packages/xdc/cfg/SourceDir.xs", line 211: xdc.cfg.SourceDir : Build of generated source libraries failed: exit status = 2:
     
    js: "C:/ti/ccs1040/xdctools_3_62_01_15_core/packages/xdc/cfg/Main.xs", line 160: Error: Configuration failed!
    xdctools_3_62_01_15_core\gmake.exe: *** [package.mak:206: package/cfg/release_pm4f.xdl] Error 1
    xdctools_3_62_01_15_core\gmake.exe: *** Deleting file 'package/cfg/release_pm4f.xdl'
    xdctools_3_62_01_15_core\gmake.exe: *** [package/cfg/release_pm4f.xdl] Deleting file 'package/cfg/release_pm4f.h'
    xdctools_3_62_01_15_core\gmake.exe: *** [package/cfg/release_pm4f.xdl] Deleting file 'package/cfg/release_pm4f.c'
    js: "C:/ti/ccs1040/xdctools_3_62_01_15_core/packages/xdc/tools/Cmdr.xs", line 52: Error: xdc.tools.configuro: configuration failed due to earlier errors (status = 2); 'linker.cmd' deleted.
    gmake[1]: *** [build-1796804607-inproc] Error 1
    gmake: *** [build-1796804607] Error 2
    subdir_rules.mk:21: recipe for target 'build-1796804607' failed
    gmake: Target 'all' not remade because of errors.
    
    **** Build Finished ****
    

  • Hi Christian,

    I'm not able to reproduce what you are seeing.

    Did you follow these steps Daniel posted, can you verify that TI Clang compiler is found in CCS Preferences > Code Composter Studio > Products?

    "From the project properties, please verify you have the compiler selected. If not, click "more..."

    then click "refresh" to let CCS discover newly installed products."

    Cheers,

    Marie H

  • Hi Marie,

    I have already compiled the project on my laptop, only a few warnings remain. On my desktop PC the errors still remain and the compiler versión it's the right one "TI Clang v1.3.0LTS".

    Will you release an example for the router?

    Regards, Christian.

  • Hi Christian,

    Yes, I'm sorry the example does contain some warnings.

    It sounds like the SDK install on your desktop might have gone wrong? Can you try uninstalling and reinstalling it?

    We have two examples for router node in the SDK:

    - node_ns

    - node_coap_node

    Please see the Examples guide for more information: 

    https://dev.ti.com/tirex/explore/content/simplelink_cc13x2_26x2_sdk_5_20_00_52/docs/ti_wisunfan/html/wisun-guide/example-applications.html

    Cheers,

    Marie H.

  • Hi,

    I have already reinstalled the SDK and the errors persist.

    About the examples, in my installation I only see one example("ns_node...").

    Regards, Christian Salgado.

  • Hi Christian,

    Can you test using a workspace with no whitespace in the workspace path?

    Cheers,

    Marie H.

  • Hi, 

    Right now I only have access to my laptop, I can't do that test at the moment. About the examples, in my SDK and I want to see the "border router" example, How can I get the example?

    I have two "LAUNCHXL-CC1352R1" boards, I would like to test a Wi-sun network implementing one card as "Border router" and another as "ns_node", is that possible?

    Regards, Christian Salgado.

  • Hi Christian,

    Sorry, no the Border router example is only implemented for CC1312R7 and CC1352P7 (because of code size). 

    You can open the example and look at the code but you won't be able to set up a network without one of these devices.

    https://dev.ti.com/tirex/explore/node?node=APvmPbmt9euZ0KVCoZ3yiQ__pTTHBmu__LATEST

    Cheers,

    Marie H.

  • Hi Marie,

    Is there a development kit with that microcontroller? Because on your web page, when I click on the 

    "Featured Wi-SUN® products" >> "CC1352P7" >> "https://www.ti.com/tool/LAUNCHXL-CC1352R1" directs me to the evaluation card I already have, the LAUNCHXL-CC1352R1.

    Regards.

  • Hi Christian,

    We sent you a separate email on this topic.

    I will close the thread for now.

    Cheers,

    Marie H.