This thread has been locked.

If you have a related question, please click the "Ask a related question" button in the top right corner. The newly created question will be automatically linked to this question.

C:\TI\controlSUITE\development_kits\TemplateProjects\FlashingLeds-F28069_v1.0 won't compile

Other Parts Discussed in Thread: CONTROLSUITE

I am trying to run C:\TI\controlSUITE\development_kits\TemplateProjects\FlashingLeds-F28069_v1.0 project from controlSuite ver 1.9 and I have set my project for target = F28069.

When I Rebuild Active Project, I get 6 errors:

"../FlashingLeds-Main.c", line 110: error: declaration is incompatible with "Uint16 RamfuncsLoadStart" (declared at line 222 of "C:/TI/controlSUITE/device_support/f2806x/v100/F2806x_common/include/F2806x_GlobalPrototypes.h")

"../FlashingLeds-Main.c", line 110: error: declaration is incompatible with "Uint16 RamfuncsLoadEnd" (declared at line 223 of "C:/TI/controlSUITE/device_support/f2806x/v100/F2806x_common/include/F2806x_GlobalPrototypes.h")

.../FlashingLeds-Main.c", line 110: error: declaration is incompatible with "Uint16 RamfuncsRunStart" (declared at line 224 of "C:/TI/controlSUITE/device_support/f2806x/v100/F2806x_common/include/F2806x_GlobalPrototypes.h")

>> Compilation failure

"../FlashingLeds-Main.c", line 155: error: argument of type "Uint16 **" is incompatible with parameter of type "Uint16 *"

"../FlashingLeds-Main.c", line 155: error: argument of type "Uint16 **" is incompatible with parameter of type "Uint16 *"

"../FlashingLeds-Main.c", line 155: error: argument of type "Uint16 **" is incompatible with parameter of type "Uint16 *"

6 errors detected in the compilation of "../FlashingLeds-Main.c".

gmake: *** [FlashingLeds-Main.obj] Error 1