Other Parts Discussed in Thread: CONTROLSUITE
OS: Windows XP SP3
CCS: v4 Downloaded today
I open the C28346 FlashingLeds example from ControlSuite. I setup the target configuration. I then try to rebuild the example, and I get these errors:
**** Build of configuration C2834x_RAM for project FlashingLeds-C28346_168 ****
C:\Program Files\Texas Instruments\ccsv4\utils\gmake\gmake -k all
'Building file: C:/TI/controlSUITE/device_support/c2834x/v111/DSP2834x_common/source/DSP2834x_CodeStartBranch.asm'
'Invoking: Compiler'
"C:/Program Files/Texas Instruments/ccsv4/tools/compiler/c2000/bin/cl2000" --silicon_version=28 -g --define="_DEBUG" --define="LARGE_MODEL" --include_path="C:/Program Files/Texas Instruments/ccsv4/tools/compiler/c2000/include" --include_path="C:/TI/controlSUITE/device_support/c2834x/v111/DSP2834x_headers/include" --include_path="C:/TI/controlSUITE/device_support/c2834x/v111/DSP2834x_common/include" --include_path="/development_kits/~SupportFiles/C2834x_headers" --diag_warning=225 --large_memory_model --preproc_with_compile --preproc_dependency="DSP2834x_CodeStartBranch.pp" "C:/TI/controlSUITE/device_support/c2834x/v111/DSP2834x_common/source/DSP2834x_CodeStartBranch.asm"
'Finished building: C:/TI/controlSUITE/device_support/c2834x/v111/DSP2834x_common/source/DSP2834x_CodeStartBranch.asm'
' '
'Building file: C:/TI/controlSUITE/device_support/c2834x/v111/DSP2834x_headers/source/DSP2834x_GlobalVariableDefs.c'
'Invoking: Compiler'
"C:/Program Files/Texas Instruments/ccsv4/tools/compiler/c2000/bin/cl2000" --silicon_version=28 -g --define="_DEBUG" --define="LARGE_MODEL" --include_path="C:/Program Files/Texas Instruments/ccsv4/tools/compiler/c2000/include" --include_path="C:/TI/controlSUITE/device_support/c2834x/v111/DSP2834x_headers/include" --include_path="C:/TI/controlSUITE/device_support/c2834x/v111/DSP2834x_common/include" --include_path="/development_kits/~SupportFiles/C2834x_headers" --diag_warning=225 --large_memory_model --preproc_with_compile --preproc_dependency="DSP2834x_GlobalVariableDefs.pp" "C:/TI/controlSUITE/device_support/c2834x/v111/DSP2834x_headers/source/DSP2834x_GlobalVariableDefs.c"
'Finished building: C:/TI/controlSUITE/device_support/c2834x/v111/DSP2834x_headers/source/DSP2834x_GlobalVariableDefs.c'
' '
'Building file: ../FlashingLeds-DevInit_C2834x.c'
'Invoking: Compiler'
"C:/Program Files/Texas Instruments/ccsv4/tools/compiler/c2000/bin/cl2000" --silicon_version=28 -g --define="_DEBUG" --define="LARGE_MODEL" --include_path="C:/Program Files/Texas Instruments/ccsv4/tools/compiler/c2000/include" --include_path="C:/TI/controlSUITE/device_support/c2834x/v111/DSP2834x_headers/include" --include_path="C:/TI/controlSUITE/device_support/c2834x/v111/DSP2834x_common/include" --include_path="/development_kits/~SupportFiles/C2834x_headers" --diag_warning=225 --large_memory_model --preproc_with_compile --preproc_dependency="FlashingLeds-DevInit_C2834x.pp" "../FlashingLeds-DevInit_C2834x.c"
"../FlashingLeds-DevInit_C2834x.c", line 11: fatal error: could not open source file "PeripheralHeaderIncludes.h"
1 fatal error detected in the compilation of "../FlashingLeds-DevInit_C2834x.c".
Compilation terminated.
>> Compilation failure
gmake: *** [FlashingLeds-DevInit_C2834x.obj] Error 1
'Building file: ../FlashingLeds-Main.c'
'Invoking: Compiler'
"C:/Program Files/Texas Instruments/ccsv4/tools/compiler/c2000/bin/cl2000" --silicon_version=28 -g --define="_DEBUG" --define="LARGE_MODEL" --include_path="C:/Program Files/Texas Instruments/ccsv4/tools/compiler/c2000/include" --include_path="C:/TI/controlSUITE/device_support/c2834x/v111/DSP2834x_headers/include" --include_path="C:/TI/controlSUITE/device_support/c2834x/v111/DSP2834x_common/include" --include_path="/development_kits/~SupportFiles/C2834x_headers" --diag_warning=225 --large_memory_model --preproc_with_compile --preproc_dependency="FlashingLeds-Main.pp" "../FlashingLeds-Main.c"
"../FlashingLeds-Main.c", line 53: fatal error: could not open source file "PeripheralHeaderIncludes.h"
1 fatal error detected in the compilation of "../FlashingLeds-Main.c".
Compilation terminated.
>> Compilation failure
gmake: *** [FlashingLeds-Main.obj] Error 1
'Building file: C:/TI/controlSUITE/development_kits/~SupportFiles/source/SciCommsGui.c'
'Invoking: Compiler'
"C:/Program Files/Texas Instruments/ccsv4/tools/compiler/c2000/bin/cl2000" --silicon_version=28 -g --define="_DEBUG" --define="LARGE_MODEL" --include_path="C:/Program Files/Texas Instruments/ccsv4/tools/compiler/c2000/include" --include_path="C:/TI/controlSUITE/device_support/c2834x/v111/DSP2834x_headers/include" --include_path="C:/TI/controlSUITE/device_support/c2834x/v111/DSP2834x_common/include" --include_path="/development_kits/~SupportFiles/C2834x_headers" --diag_warning=225 --large_memory_model --preproc_with_compile --preproc_dependency="SciCommsGui.pp" "C:/TI/controlSUITE/development_kits/~SupportFiles/source/SciCommsGui.c"
"C:/TI/controlSUITE/development_kits/~SupportFiles/source/SciCommsGui.c", line 11: fatal error: could not open source file "PeripheralHeaderIncludes.h"
1 fatal error detected in the compilation of "C:/TI/controlSUITE/development_kits/~SupportFiles/source/SciCommsGui.c".
Compilation terminated.
>> Compilation failure
gmake: *** [SciCommsGui.obj] Error 1
gmake: Target `all' not remade because of errors.
Build complete for project FlashingLeds-C28346_168