This thread has been locked.

If you have a related question, please click the "Ask a related question" button in the top right corner. The newly created question will be automatically linked to this question.

CCS/CC2650: error #10234-D: unresolved symbols remain when biulding sample Eddystone Beacon app for CC2650 dev kit

Part Number: CC2650

Tool/software: Code Composer Studio

Hi, I'm new to using the CCS development environment, and I'm trying to build and load the TI simple_eddystone demo app so I can load onto the CC2650STK dev kit.

I'm getting a compiler error as below, there must be some file or folder path problem, but I don't know what, as far as I can tell the paths are okay ?

Please help.

Thanks

Chris

undefined                       first referenced          
  symbol                             in file               
 ---------                       ----------------          
 GAP_EndDiscoverable             ./ICallBLE/ble_dispatch.obj
 GAP_MakeDiscoverable            ./ICallBLE/ble_dispatch.obj
 GAP_PeriConnRegister            ./PROFILES/gap.obj        
 GAP_PeriDevMgrInit              ./PROFILES/gap.obj        
 GAP_RemoveAdvToken              ./ICallBLE/ble_dispatch.obj
 GAP_SendSlaveSecurityRequest    ./ICallBLE/ble_dispatch.obj
 GAP_SetAdvToken                 ./ICallBLE/ble_dispatch.obj
 GAP_UpdateAdvTokens             ./ICallBLE/ble_dispatch.obj
 GAP_UpdateAdvertisingData       ./ICallBLE/ble_dispatch.obj
 LL_EncLtkNegReply               ./Startup/rom_jt.obj      
 LL_EncLtkReply                  ./Startup/rom_jt.obj      
 LL_SetAdvControl                ./Startup/rom_jt.obj      
 LL_SetAdvParam                  ./Startup/rom_jt.obj      
 SM_ResponderInit                ./PROFILES/gap.obj        
 llAdv_TaskConnect               ./Startup/rom_jt.obj      
 llAdv_TaskEnd                   ./Startup/rom_jt.obj      
 llDirAdv_TaskEnd                ./Startup/rom_jt.obj      
 llProcessSlaveControlPacket     ./Startup/rom_jt.obj      
 llProcessSlaveControlProcedures ./Startup/rom_jt.obj      
 llSetupNextSlaveEvent           ./Startup/rom_jt.obj      
 llSetupStartEncReq              ./Startup/rom_jt.obj      
 llSlave_TaskEnd                 ./Startup/rom_jt.obj      

error #10234-D: unresolved symbols remain

error #10010: errors encountered during linking; "simple_eddystone_cc2650lp_stack.out" not built
>> Compilation failure
makefile:191: recipe for target 'simple_eddystone_cc2650lp_stack.out' failed
gmake[2]: *** [simple_eddystone_cc2650lp_stack.out] Error 1
gmake[1]: *** [main-build] Error 2
makefile:187: recipe for target 'main-build' failed
makefile:182: recipe for target 'all' failed
gmake: *** [all] Error 2

Description Resource Path Location Type
gmake[2]: *** [simple_eddystone_cc2650lp_stack.out] Error 1 simple_eddystone_cc2650lp_stack    C/C++ Problem
unresolved symbol GAP_EndDiscoverable, first referenced in ./ICallBLE/ble_dispatch.obj simple_eddystone_cc2650lp_stack    C/C++ Problem
unresolved symbol GAP_MakeDiscoverable, first referenced in ./ICallBLE/ble_dispatch.obj simple_eddystone_cc2650lp_stack    C/C++ Problem
unresolved symbol GAP_PeriConnRegister, first referenced in ./PROFILES/gap.obj simple_eddystone_cc2650lp_stack    C/C++ Problem
unresolved symbol GAP_PeriDevMgrInit, first referenced in ./PROFILES/gap.obj simple_eddystone_cc2650lp_stack    C/C++ Problem
unresolved symbol GAP_RemoveAdvToken, first referenced in ./ICallBLE/ble_dispatch.obj simple_eddystone_cc2650lp_stack    C/C++ Problem
unresolved symbol GAP_SendSlaveSecurityRequest, first referenced in ./ICallBLE/ble_dispatch.obj simple_eddystone_cc2650lp_stack    C/C++ Problem
unresolved symbol GAP_SetAdvToken, first referenced in ./ICallBLE/ble_dispatch.obj simple_eddystone_cc2650lp_stack    C/C++ Problem
unresolved symbol GAP_UpdateAdvertisingData, first referenced in ./ICallBLE/ble_dispatch.obj simple_eddystone_cc2650lp_stack    C/C++ Problem
unresolved symbol GAP_UpdateAdvTokens, first referenced in ./ICallBLE/ble_dispatch.obj simple_eddystone_cc2650lp_stack    C/C++ Problem
unresolved symbol LL_EncLtkNegReply, first referenced in ./Startup/rom_jt.obj simple_eddystone_cc2650lp_stack    C/C++ Problem
unresolved symbol LL_EncLtkReply, first referenced in ./Startup/rom_jt.obj simple_eddystone_cc2650lp_stack    C/C++ Problem
unresolved symbol LL_SetAdvControl, first referenced in ./Startup/rom_jt.obj simple_eddystone_cc2650lp_stack    C/C++ Problem
unresolved symbol LL_SetAdvParam, first referenced in ./Startup/rom_jt.obj simple_eddystone_cc2650lp_stack    C/C++ Problem
unresolved symbol llAdv_TaskConnect, first referenced in ./Startup/rom_jt.obj simple_eddystone_cc2650lp_stack    C/C++ Problem
unresolved symbol llAdv_TaskEnd, first referenced in ./Startup/rom_jt.obj simple_eddystone_cc2650lp_stack    C/C++ Problem
unresolved symbol llDirAdv_TaskEnd, first referenced in ./Startup/rom_jt.obj simple_eddystone_cc2650lp_stack    C/C++ Problem
unresolved symbol llProcessSlaveControlPacket, first referenced in ./Startup/rom_jt.obj simple_eddystone_cc2650lp_stack    C/C++ Problem
unresolved symbol llProcessSlaveControlProcedures, first referenced in ./Startup/rom_jt.obj simple_eddystone_cc2650lp_stack    C/C++ Problem
unresolved symbol llSetupNextSlaveEvent, first referenced in ./Startup/rom_jt.obj simple_eddystone_cc2650lp_stack    C/C++ Problem
unresolved symbol llSetupStartEncReq, first referenced in ./Startup/rom_jt.obj simple_eddystone_cc2650lp_stack    C/C++ Problem
unresolved symbol llSlave_TaskEnd, first referenced in ./Startup/rom_jt.obj simple_eddystone_cc2650lp_stack    C/C++ Problem
unresolved symbol SM_ResponderInit, first referenced in ./PROFILES/gap.obj simple_eddystone_cc2650lp_stack    C/C++ Problem