This thread has been locked.

If you have a related question, please click the "Ask a related question" button in the top right corner. The newly created question will be automatically linked to this question.

CC2640 BLE sample application is not working in ccsv6.2

Other Parts Discussed in Thread: CC2640, CC2650STK, CC2650, SYSBIOS

HI all,

Currently i am working with our own customized cc2640 ble device,the problem is i can't able to use the example BLE periheral or sensor tag code,

whenever i tried compile the project i was kick of with below two errors,

 TI_BLE_SDK_BASE\Projects\ble\SimpleBLEPeripheral\CC26xx\IAR\Lib\CC2640Stack.a is not found in path

TI_BLE_SDK_BASE\Projects\ble\SimpleBLEPeripheral\CC26xx\IAR\Lib\CC2640Stack_HCI_TL.a is not found in path

The puzzling thing in this error is i am using ccs but this error is related to IAR work bench i don't know what to do,and how to solve this ,and i searched the particular library file in my drive but i didn't found anything related to that and i  searched a lot in google also but i didn't get a good solution to solve this issue.

Expecting a TI resource to give a solution ASAP.

Thanks.

  • Which BLE Stack version do you use?
  • I am having two version of ble stack,

    ble_cc26xx_2_01_00_44423 - this version only i am getting the below error,
    TI_BLE_SDK_BASE\Projects\ble\SimpleBLEPeripheral\CC26xx\IAR\Lib\CC2640Stack.a is not found in path

    TI_BLE_SDK_BASE\Projects\ble\SimpleBLEPeripheral\CC26xx\IAR\Lib\CC2640Stack_HCI_TL.a is not found in path


    ble_sdk_2_02_00_31 - this version i don't know which example i need to use,

    Please guide me to wrap this problem soon.
  • You can try simple_peripheral example in BLE Stack v2.2
  • simple peripheral example in which folder i need to select, because few folders are available they are,
    1.cc2650bp
    2.cc2650em
    3.cc2650lp
    4.cc2650rc
    5.cc2650stk

    and the path is C:\TI\ble_sdk_2_02_01_18\examples
  • Since you are using custom board, I suggest you to use CC2650lp example for testing.
  • Hi,
    Thanks for your quick reply ,i triedd as you suggest but i am getting bunch of errors in app program,all errors are comes under the folder drivers
    RF,UART and in my driver folder GPT is not listed ,but in the code GPT is added how can i add the folder and i just list out the errors what i had got in console please review it and get and back to me ASAP

    **** Build of configuration FlashROM for project simple_peripheral_cc2650lp_app ****

    "C:\\TI\\bluetooth\\ccsv6\\utils\\bin\\gmake" -k -j 4 all -O
    'Building file: C:/TI/dog/ble_sdk_2_02_01_18/examples/cc2650lp/simple_peripheral/ccs/config/app_ble.cfg'
    'Invoking: XDCtools'
    "C:/TI/bluetooth/xdctools_3_32_01_22_core/xs" --xdcpath="C:/TI/tirtos_cc13xx_cc26xx_2_18_00_03/packages;C:/TI/tirtos_cc13xx_cc26xx_2_18_00_03/products/tidrivers_cc13xx_cc26xx_2_16_01_13/packages;C:/TI/tirtos_cc13xx_cc26xx_2_18_00_03/products/bios_6_45_02_31/packages;C:/TI/tirtos_cc13xx_cc26xx_2_18_00_03/products/uia_2_00_05_50/packages;C:/TI/bluetooth/ccsv6/ccs_base;" xdc.tools.configuro -o configPkg -t ti.targets.arm.elf.M3 -p ti.platforms.simplelink:CC2640F128 -r release -c "C:/TI/bluetooth/ccsv6/tools/compiler/arm_15.12.3.LTS" --compileOptions "-mv7M3 --code_state=16 -me -O4 --opt_for_speed=0 --include_path=\"C:/TI/bluetooth/ccsv6/tools/compiler/arm_15.12.3.LTS/include\" --include_path=\"C:/TI/dog/ble_sdk_2_02_01_18/src/examples/simple_peripheral/cc26xx/app\" --include_path=\"C:/TI/dog/ble_sdk_2_02_01_18/src/inc\" --include_path=\"C:/TI/dog/ble_sdk_2_02_01_18/src/icall/inc\" --include_path=\"C:/TI/dog/ble_sdk_2_02_01_18/src/profiles/roles/cc26xx\" --include_path=\"C:/TI/dog/ble_sdk_2_02_01_18/src/profiles/roles\" --include_path=\"C:/TI/dog/ble_sdk_2_02_01_18/src/profiles/dev_info\" --include_path=\"C:/TI/dog/ble_sdk_2_02_01_18/src/profiles/simple_profile/cc26xx\" --include_path=\"C:/TI/dog/ble_sdk_2_02_01_18/src/profiles/simple_profile\" --include_path=\"C:/TI/dog/ble_sdk_2_02_01_18/src/common/cc26xx\" --include_path=\"C:/TI/dog/ble_sdk_2_02_01_18/src/components/heapmgr\" --include_path=\"C:/TI/dog/ble_sdk_2_02_01_18/src/controller/cc26xx/inc\" --include_path=\"C:/TI/dog/ble_sdk_2_02_01_18/src/components/hal/src/target/_common\" --include_path=\"C:/TI/dog/ble_sdk_2_02_01_18/src/target\" --include_path=\"C:/TI/dog/ble_sdk_2_02_01_18/src/components/hal/src/target/_common/cc26xx\" --include_path=\"C:/TI/dog/ble_sdk_2_02_01_18/src/components/hal/src/inc\" --include_path=\"C:/TI/dog/ble_sdk_2_02_01_18/src/components/osal/src/inc\" --include_path=\"C:/TI/dog/ble_sdk_2_02_01_18/src/components/services/src/sdata\" --include_path=\"C:/TI/dog/ble_sdk_2_02_01_18/src/components/services/src/saddr\" --include_path=\"C:/TI/dog/ble_sdk_2_02_01_18/src/components/icall/src/inc\" --include_path=\"C:/TI/dog/ble_sdk_2_02_01_18/src/inc\" --include_path=\"C:/TI/dog/ble_sdk_2_02_01_18/src/rom\" --include_path=\"C:/TI/dog/tirtos_cc13xx_cc26xx_2_21_00_06/products/cc26xxware_2_24_03_17272\" -g --c99 --gcc --define=BOARD_DISPLAY_EXCLUDE_LCD --define=BOARD_DISPLAY_EXCLUDE_UART --define=CC2650_LAUNCHXL --define=CC26XX --define=Display_DISABLE_ALL --define=HEAPMGR_SIZE=0 --define=ICALL_MAX_NUM_ENTITIES=6 --define=ICALL_MAX_NUM_TASKS=3 --define=POWER_MEASURE --define=POWER_SAVING --define=USE_ICALL --define=xdc_runtime_Assert_DISABLE_ALL --define=xdc_runtime_Log_DISABLE_ALL --diag_suppress=48 --diag_wrap=off --diag_warning=225 --display_error_number --gen_func_subsections=on --abi=eabi " "C:/TI/dog/ble_sdk_2_02_01_18/examples/cc2650lp/simple_peripheral/ccs/config/app_ble.cfg"
    making package.mak (because of package.bld) ...
    generating interfaces for package configPkg (because package/package.xdc.inc is older than package.xdc) ...
    configuring app_ble.xem3 from package/cfg/app_ble_pem3.cfg ...
    generating custom ROM library makefile ...
    Starting build of library sources ...
    making C:/TI/dog/ble_sdk_2_02_01_18/examples/cc2650lp/simple_peripheral/ccs/config/src/sysbios/rom_sysbios.aem3 ...
    gmake[1]: Entering directory `C:/TI/dog/ble_sdk_2_02_01_18/examples/cc2650lp/simple_peripheral/ccs/config/src/sysbios'
    gmake[1]: Nothing to be done for `all'.
    gmake[1]: Leaving directory `C:/TI/dog/ble_sdk_2_02_01_18/examples/cc2650lp/simple_peripheral/ccs/config/src/sysbios'
    Build of libraries done.
    clem3 package/cfg/app_ble_pem3.c ...
    'Finished building: C:/TI/dog/ble_sdk_2_02_01_18/examples/cc2650lp/simple_peripheral/ccs/config/app_ble.cfg'
    ' '
    'Building file: C:/TI/dog/tirtos_cc13xx_cc26xx_2_21_00_06/products/tidrivers_cc13xx_cc26xx_2_21_00_04/packages/ti/mw/display/Display.c'
    'Invoking: ARM Compiler'
    "C:/TI/bluetooth/ccsv6/tools/compiler/arm_15.12.3.LTS/bin/armcl" --cmd_file="C:/TI/dog/ble_sdk_2_02_01_18/examples/cc2650lp/simple_peripheral/ccs/app/../../iar/stack/../../../../../src/config/build_components.opt" --cmd_file="C:/TI/dog/ble_sdk_2_02_01_18/examples/cc2650lp/simple_peripheral/ccs/app/../../iar/stack/build_config.opt" --cmd_file="C:/TI/dog/ble_sdk_2_02_01_18/examples/cc2650lp/simple_peripheral/ccs/app/../../iar/stack/../../ccs/config/ccs_compiler_defines.bcfg" -mv7M3 --code_state=16 -me -O4 --opt_for_speed=0 --include_path="C:/TI/bluetooth/ccsv6/tools/compiler/arm_15.12.3.LTS/include" --include_path="C:/TI/dog/ble_sdk_2_02_01_18/src/examples/simple_peripheral/cc26xx/app" --include_path="C:/TI/dog/ble_sdk_2_02_01_18/src/inc" --include_path="C:/TI/dog/ble_sdk_2_02_01_18/src/icall/inc" --include_path="C:/TI/dog/ble_sdk_2_02_01_18/src/profiles/roles/cc26xx" --include_path="C:/TI/dog/ble_sdk_2_02_01_18/src/profiles/roles" --include_path="C:/TI/dog/ble_sdk_2_02_01_18/src/profiles/dev_info" --include_path="C:/TI/dog/ble_sdk_2_02_01_18/src/profiles/simple_profile/cc26xx" --include_path="C:/TI/dog/ble_sdk_2_02_01_18/src/profiles/simple_profile" --include_path="C:/TI/dog/ble_sdk_2_02_01_18/src/common/cc26xx" --include_path="C:/TI/dog/ble_sdk_2_02_01_18/src/components/heapmgr" --include_path="C:/TI/dog/ble_sdk_2_02_01_18/src/controller/cc26xx/inc" --include_path="C:/TI/dog/ble_sdk_2_02_01_18/src/components/hal/src/target/_common" --include_path="C:/TI/dog/ble_sdk_2_02_01_18/src/target" --include_path="C:/TI/dog/ble_sdk_2_02_01_18/src/components/hal/src/target/_common/cc26xx" --include_path="C:/TI/dog/ble_sdk_2_02_01_18/src/components/hal/src/inc" --include_path="C:/TI/dog/ble_sdk_2_02_01_18/src/components/osal/src/inc" --include_path="C:/TI/dog/ble_sdk_2_02_01_18/src/components/services/src/sdata" --include_path="C:/TI/dog/ble_sdk_2_02_01_18/src/components/services/src/saddr" --include_path="C:/TI/dog/ble_sdk_2_02_01_18/src/components/icall/src/inc" --include_path="C:/TI/dog/ble_sdk_2_02_01_18/src/inc" --include_path="C:/TI/dog/ble_sdk_2_02_01_18/src/rom" --include_path="C:/TI/dog/tirtos_cc13xx_cc26xx_2_21_00_06/products/cc26xxware_2_24_03_17272" -g --c99 --gcc --define=BOARD_DISPLAY_EXCLUDE_LCD --define=BOARD_DISPLAY_EXCLUDE_UART --define=CC2650_LAUNCHXL --define=CC26XX --define=Display_DISABLE_ALL --define=HEAPMGR_SIZE=0 --define=ICALL_MAX_NUM_ENTITIES=6 --define=ICALL_MAX_NUM_TASKS=3 --define=POWER_MEASURE --define=POWER_SAVING --define=USE_ICALL --define=xdc_runtime_Assert_DISABLE_ALL --define=xdc_runtime_Log_DISABLE_ALL --diag_suppress=48 --diag_wrap=off --diag_warning=225 --display_error_number --gen_func_subsections=on --abi=eabi --preproc_with_compile --preproc_dependency="Drivers/Display/Display.d" --obj_directory="Drivers/Display" --cmd_file="configPkg/compiler.opt" "C:/TI/dog/tirtos_cc13xx_cc26xx_2_21_00_06/products/tidrivers_cc13xx_cc26xx_2_21_00_04/packages/ti/mw/display/Display.c"
    'Finished building: C:/TI/dog/tirtos_cc13xx_cc26xx_2_21_00_06/products/tidrivers_cc13xx_cc26xx_2_21_00_04/packages/ti/mw/display/Display.c'
    ' '
    'Building file: C:/TI/dog/tirtos_cc13xx_cc26xx_2_21_00_06/products/tidrivers_cc13xx_cc26xx_2_21_00_04/packages/ti/mw/display/DisplayDogm1286.c'
    'Invoking: ARM Compiler'
    "C:/TI/bluetooth/ccsv6/tools/compiler/arm_15.12.3.LTS/bin/armcl" --cmd_file="C:/TI/dog/ble_sdk_2_02_01_18/examples/cc2650lp/simple_peripheral/ccs/app/../../iar/stack/../../../../../src/config/build_components.opt" --cmd_file="C:/TI/dog/ble_sdk_2_02_01_18/examples/cc2650lp/simple_peripheral/ccs/app/../../iar/stack/build_config.opt" --cmd_file="C:/TI/dog/ble_sdk_2_02_01_18/examples/cc2650lp/simple_peripheral/ccs/app/../../iar/stack/../../ccs/config/ccs_compiler_defines.bcfg" -mv7M3 --code_state=16 -me -O4 --opt_for_speed=0 --include_path="C:/TI/bluetooth/ccsv6/tools/compiler/arm_15.12.3.LTS/include" --include_path="C:/TI/dog/ble_sdk_2_02_01_18/src/examples/simple_peripheral/cc26xx/app" --include_path="C:/TI/dog/ble_sdk_2_02_01_18/src/inc" --include_path="C:/TI/dog/ble_sdk_2_02_01_18/src/icall/inc" --include_path="C:/TI/dog/ble_sdk_2_02_01_18/src/profiles/roles/cc26xx" --include_path="C:/TI/dog/ble_sdk_2_02_01_18/src/profiles/roles" --include_path="C:/TI/dog/ble_sdk_2_02_01_18/src/profiles/dev_info" --include_path="C:/TI/dog/ble_sdk_2_02_01_18/src/profiles/simple_profile/cc26xx" --include_path="C:/TI/dog/ble_sdk_2_02_01_18/src/profiles/simple_profile" --include_path="C:/TI/dog/ble_sdk_2_02_01_18/src/common/cc26xx" --include_path="C:/TI/dog/ble_sdk_2_02_01_18/src/components/heapmgr" --include_path="C:/TI/dog/ble_sdk_2_02_01_18/src/controller/cc26xx/inc" --include_path="C:/TI/dog/ble_sdk_2_02_01_18/src/components/hal/src/target/_common" --include_path="C:/TI/dog/ble_sdk_2_02_01_18/src/target" --include_path="C:/TI/dog/ble_sdk_2_02_01_18/src/components/hal/src/target/_common/cc26xx" --include_path="C:/TI/dog/ble_sdk_2_02_01_18/src/components/hal/src/inc" --include_path="C:/TI/dog/ble_sdk_2_02_01_18/src/components/osal/src/inc" --include_path="C:/TI/dog/ble_sdk_2_02_01_18/src/components/services/src/sdata" --include_path="C:/TI/dog/ble_sdk_2_02_01_18/src/components/services/src/saddr" --include_path="C:/TI/dog/ble_sdk_2_02_01_18/src/components/icall/src/inc" --include_path="C:/TI/dog/ble_sdk_2_02_01_18/src/inc" --include_path="C:/TI/dog/ble_sdk_2_02_01_18/src/rom" --include_path="C:/TI/dog/tirtos_cc13xx_cc26xx_2_21_00_06/products/cc26xxware_2_24_03_17272" -g --c99 --gcc --define=BOARD_DISPLAY_EXCLUDE_LCD --define=BOARD_DISPLAY_EXCLUDE_UART --define=CC2650_LAUNCHXL --define=CC26XX --define=Display_DISABLE_ALL --define=HEAPMGR_SIZE=0 --define=ICALL_MAX_NUM_ENTITIES=6 --define=ICALL_MAX_NUM_TASKS=3 --define=POWER_MEASURE --define=POWER_SAVING --define=USE_ICALL --define=xdc_runtime_Assert_DISABLE_ALL --define=xdc_runtime_Log_DISABLE_ALL --diag_suppress=48 --diag_wrap=off --diag_warning=225 --display_error_number --gen_func_subsections=on --abi=eabi --preproc_with_compile --preproc_dependency="Drivers/Display/DisplayDogm1286.d" --obj_directory="Drivers/Display" --cmd_file="configPkg/compiler.opt" "C:/TI/dog/tirtos_cc13xx_cc26xx_2_21_00_06/products/tidrivers_cc13xx_cc26xx_2_21_00_04/packages/ti/mw/display/DisplayDogm1286.c"
    'Finished building: C:/TI/dog/tirtos_cc13xx_cc26xx_2_21_00_06/products/tidrivers_cc13xx_cc26xx_2_21_00_04/packages/ti/mw/display/DisplayDogm1286.c'
    ' '
    'Building file: C:/TI/dog/ble_sdk_2_02_01_18/src/common/cc26xx/util.c'
    'Invoking: ARM Compiler'
    "C:/TI/bluetooth/ccsv6/tools/compiler/arm_15.12.3.LTS/bin/armcl" --cmd_file="C:/TI/dog/ble_sdk_2_02_01_18/examples/cc2650lp/simple_peripheral/ccs/app/../../iar/stack/../../../../../src/config/build_components.opt" --cmd_file="C:/TI/dog/ble_sdk_2_02_01_18/examples/cc2650lp/simple_peripheral/ccs/app/../../iar/stack/build_config.opt" --cmd_file="C:/TI/dog/ble_sdk_2_02_01_18/examples/cc2650lp/simple_peripheral/ccs/app/../../iar/stack/../../ccs/config/ccs_compiler_defines.bcfg" -mv7M3 --code_state=16 -me -O4 --opt_for_speed=0 --include_path="C:/TI/bluetooth/ccsv6/tools/compiler/arm_15.12.3.LTS/include" --include_path="C:/TI/dog/ble_sdk_2_02_01_18/src/examples/simple_peripheral/cc26xx/app" --include_path="C:/TI/dog/ble_sdk_2_02_01_18/src/inc" --include_path="C:/TI/dog/ble_sdk_2_02_01_18/src/icall/inc" --include_path="C:/TI/dog/ble_sdk_2_02_01_18/src/profiles/roles/cc26xx" --include_path="C:/TI/dog/ble_sdk_2_02_01_18/src/profiles/roles" --include_path="C:/TI/dog/ble_sdk_2_02_01_18/src/profiles/dev_info" --include_path="C:/TI/dog/ble_sdk_2_02_01_18/src/profiles/simple_profile/cc26xx" --include_path="C:/TI/dog/ble_sdk_2_02_01_18/src/profiles/simple_profile" --include_path="C:/TI/dog/ble_sdk_2_02_01_18/src/common/cc26xx" --include_path="C:/TI/dog/ble_sdk_2_02_01_18/src/components/heapmgr" --include_path="C:/TI/dog/ble_sdk_2_02_01_18/src/controller/cc26xx/inc" --include_path="C:/TI/dog/ble_sdk_2_02_01_18/src/components/hal/src/target/_common" --include_path="C:/TI/dog/ble_sdk_2_02_01_18/src/target" --include_path="C:/TI/dog/ble_sdk_2_02_01_18/src/components/hal/src/target/_common/cc26xx" --include_path="C:/TI/dog/ble_sdk_2_02_01_18/src/components/hal/src/inc" --include_path="C:/TI/dog/ble_sdk_2_02_01_18/src/components/osal/src/inc" --include_path="C:/TI/dog/ble_sdk_2_02_01_18/src/components/services/src/sdata" --include_path="C:/TI/dog/ble_sdk_2_02_01_18/src/components/services/src/saddr" --include_path="C:/TI/dog/ble_sdk_2_02_01_18/src/components/icall/src/inc" --include_path="C:/TI/dog/ble_sdk_2_02_01_18/src/inc" --include_path="C:/TI/dog/ble_sdk_2_02_01_18/src/rom" --include_path="C:/TI/dog/tirtos_cc13xx_cc26xx_2_21_00_06/products/cc26xxware_2_24_03_17272" -g --c99 --gcc --define=BOARD_DISPLAY_EXCLUDE_LCD --define=BOARD_DISPLAY_EXCLUDE_UART --define=CC2650_LAUNCHXL --define=CC26XX --define=Display_DISABLE_ALL --define=HEAPMGR_SIZE=0 --define=ICALL_MAX_NUM_ENTITIES=6 --define=ICALL_MAX_NUM_TASKS=3 --define=POWER_MEASURE --define=POWER_SAVING --define=USE_ICALL --define=xdc_runtime_Assert_DISABLE_ALL --define=xdc_runtime_Log_DISABLE_ALL --diag_suppress=48 --diag_wrap=off --diag_warning=225 --display_error_number --gen_func_subsections=on --abi=eabi --preproc_with_compile --preproc_dependency="Application/util.d" --obj_directory="Application" --cmd_file="configPkg/compiler.opt" "C:/TI/dog/ble_sdk_2_02_01_18/src/common/cc26xx/util.c"
    'Finished building: C:/TI/dog/ble_sdk_2_02_01_18/src/common/cc26xx/util.c'
    ' '
    'Building file: C:/TI/dog/tirtos_cc13xx_cc26xx_2_21_00_06/products/tidrivers_cc13xx_cc26xx_2_21_00_04/packages/ti/mw/display/DisplayUart.c'
    'Invoking: ARM Compiler'
    "C:/TI/bluetooth/ccsv6/tools/compiler/arm_15.12.3.LTS/bin/armcl" --cmd_file="C:/TI/dog/ble_sdk_2_02_01_18/examples/cc2650lp/simple_peripheral/ccs/app/../../iar/stack/../../../../../src/config/build_components.opt" --cmd_file="C:/TI/dog/ble_sdk_2_02_01_18/examples/cc2650lp/simple_peripheral/ccs/app/../../iar/stack/build_config.opt" --cmd_file="C:/TI/dog/ble_sdk_2_02_01_18/examples/cc2650lp/simple_peripheral/ccs/app/../../iar/stack/../../ccs/config/ccs_compiler_defines.bcfg" -mv7M3 --code_state=16 -me -O4 --opt_for_speed=0 --include_path="C:/TI/bluetooth/ccsv6/tools/compiler/arm_15.12.3.LTS/include" --include_path="C:/TI/dog/ble_sdk_2_02_01_18/src/examples/simple_peripheral/cc26xx/app" --include_path="C:/TI/dog/ble_sdk_2_02_01_18/src/inc" --include_path="C:/TI/dog/ble_sdk_2_02_01_18/src/icall/inc" --include_path="C:/TI/dog/ble_sdk_2_02_01_18/src/profiles/roles/cc26xx" --include_path="C:/TI/dog/ble_sdk_2_02_01_18/src/profiles/roles" --include_path="C:/TI/dog/ble_sdk_2_02_01_18/src/profiles/dev_info" --include_path="C:/TI/dog/ble_sdk_2_02_01_18/src/profiles/simple_profile/cc26xx" --include_path="C:/TI/dog/ble_sdk_2_02_01_18/src/profiles/simple_profile" --include_path="C:/TI/dog/ble_sdk_2_02_01_18/src/common/cc26xx" --include_path="C:/TI/dog/ble_sdk_2_02_01_18/src/components/heapmgr" --include_path="C:/TI/dog/ble_sdk_2_02_01_18/src/controller/cc26xx/inc" --include_path="C:/TI/dog/ble_sdk_2_02_01_18/src/components/hal/src/target/_common" --include_path="C:/TI/dog/ble_sdk_2_02_01_18/src/target" --include_path="C:/TI/dog/ble_sdk_2_02_01_18/src/components/hal/src/target/_common/cc26xx" --include_path="C:/TI/dog/ble_sdk_2_02_01_18/src/components/hal/src/inc" --include_path="C:/TI/dog/ble_sdk_2_02_01_18/src/components/osal/src/inc" --include_path="C:/TI/dog/ble_sdk_2_02_01_18/src/components/services/src/sdata" --include_path="C:/TI/dog/ble_sdk_2_02_01_18/src/components/services/src/saddr" --include_path="C:/TI/dog/ble_sdk_2_02_01_18/src/components/icall/src/inc" --include_path="C:/TI/dog/ble_sdk_2_02_01_18/src/inc" --include_path="C:/TI/dog/ble_sdk_2_02_01_18/src/rom" --include_path="C:/TI/dog/tirtos_cc13xx_cc26xx_2_21_00_06/products/cc26xxware_2_24_03_17272" -g --c99 --gcc --define=BOARD_DISPLAY_EXCLUDE_LCD --define=BOARD_DISPLAY_EXCLUDE_UART --define=CC2650_LAUNCHXL --define=CC26XX --define=Display_DISABLE_ALL --define=HEAPMGR_SIZE=0 --define=ICALL_MAX_NUM_ENTITIES=6 --define=ICALL_MAX_NUM_TASKS=3 --define=POWER_MEASURE --define=POWER_SAVING --define=USE_ICALL --define=xdc_runtime_Assert_DISABLE_ALL --define=xdc_runtime_Log_DISABLE_ALL --diag_suppress=48 --diag_wrap=off --diag_warning=225 --display_error_number --gen_func_subsections=on --abi=eabi --preproc_with_compile --preproc_dependency="Drivers/Display/DisplayUART.d" --obj_directory="Drivers/Display" --cmd_file="configPkg/compiler.opt" "C:/TI/dog/tirtos_cc13xx_cc26xx_2_21_00_06/products/tidrivers_cc13xx_cc26xx_2_21_00_04/packages/ti/mw/display/DisplayUart.c"
    'Finished building: C:/TI/dog/tirtos_cc13xx_cc26xx_2_21_00_06/products/tidrivers_cc13xx_cc26xx_2_21_00_04/packages/ti/mw/display/DisplayUart.c'
    ' '
    'Building file: C:/TI/dog/ble_sdk_2_02_01_18/src/examples/simple_peripheral/cc26xx/app/simple_peripheral.c'
    'Invoking: ARM Compiler'
    "C:/TI/bluetooth/ccsv6/tools/compiler/arm_15.12.3.LTS/bin/armcl" --cmd_file="C:/TI/dog/ble_sdk_2_02_01_18/examples/cc2650lp/simple_peripheral/ccs/app/../../iar/stack/../../../../../src/config/build_components.opt" --cmd_file="C:/TI/dog/ble_sdk_2_02_01_18/examples/cc2650lp/simple_peripheral/ccs/app/../../iar/stack/build_config.opt" --cmd_file="C:/TI/dog/ble_sdk_2_02_01_18/examples/cc2650lp/simple_peripheral/ccs/app/../../iar/stack/../../ccs/config/ccs_compiler_defines.bcfg" -mv7M3 --code_state=16 -me -O4 --opt_for_speed=0 --include_path="C:/TI/bluetooth/ccsv6/tools/compiler/arm_15.12.3.LTS/include" --include_path="C:/TI/dog/ble_sdk_2_02_01_18/src/examples/simple_peripheral/cc26xx/app" --include_path="C:/TI/dog/ble_sdk_2_02_01_18/src/inc" --include_path="C:/TI/dog/ble_sdk_2_02_01_18/src/icall/inc" --include_path="C:/TI/dog/ble_sdk_2_02_01_18/src/profiles/roles/cc26xx" --include_path="C:/TI/dog/ble_sdk_2_02_01_18/src/profiles/roles" --include_path="C:/TI/dog/ble_sdk_2_02_01_18/src/profiles/dev_info" --include_path="C:/TI/dog/ble_sdk_2_02_01_18/src/profiles/simple_profile/cc26xx" --include_path="C:/TI/dog/ble_sdk_2_02_01_18/src/profiles/simple_profile" --include_path="C:/TI/dog/ble_sdk_2_02_01_18/src/common/cc26xx" --include_path="C:/TI/dog/ble_sdk_2_02_01_18/src/components/heapmgr" --include_path="C:/TI/dog/ble_sdk_2_02_01_18/src/controller/cc26xx/inc" --include_path="C:/TI/dog/ble_sdk_2_02_01_18/src/components/hal/src/target/_common" --include_path="C:/TI/dog/ble_sdk_2_02_01_18/src/target" --include_path="C:/TI/dog/ble_sdk_2_02_01_18/src/components/hal/src/target/_common/cc26xx" --include_path="C:/TI/dog/ble_sdk_2_02_01_18/src/components/hal/src/inc" --include_path="C:/TI/dog/ble_sdk_2_02_01_18/src/components/osal/src/inc" --include_path="C:/TI/dog/ble_sdk_2_02_01_18/src/components/services/src/sdata" --include_path="C:/TI/dog/ble_sdk_2_02_01_18/src/components/services/src/saddr" --include_path="C:/TI/dog/ble_sdk_2_02_01_18/src/components/icall/src/inc" --include_path="C:/TI/dog/ble_sdk_2_02_01_18/src/inc" --include_path="C:/TI/dog/ble_sdk_2_02_01_18/src/rom" --include_path="C:/TI/dog/tirtos_cc13xx_cc26xx_2_21_00_06/products/cc26xxware_2_24_03_17272" -g --c99 --gcc --define=BOARD_DISPLAY_EXCLUDE_LCD --define=BOARD_DISPLAY_EXCLUDE_UART --define=CC2650_LAUNCHXL --define=CC26XX --define=Display_DISABLE_ALL --define=HEAPMGR_SIZE=0 --define=ICALL_MAX_NUM_ENTITIES=6 --define=ICALL_MAX_NUM_TASKS=3 --define=POWER_MEASURE --define=POWER_SAVING --define=USE_ICALL --define=xdc_runtime_Assert_DISABLE_ALL --define=xdc_runtime_Log_DISABLE_ALL --diag_suppress=48 --diag_wrap=off --diag_warning=225 --display_error_number --gen_func_subsections=on --abi=eabi --preproc_with_compile --preproc_dependency="Application/simple_peripheral.d" --obj_directory="Application" --cmd_file="configPkg/compiler.opt" "C:/TI/dog/ble_sdk_2_02_01_18/src/examples/simple_peripheral/cc26xx/app/simple_peripheral.c"
    'Finished building: C:/TI/dog/ble_sdk_2_02_01_18/src/examples/simple_peripheral/cc26xx/app/simple_peripheral.c'
    ' '
    'Building file: C:/TI/dog/tirtos_cc13xx_cc26xx_2_21_00_06/products/tidrivers_cc13xx_cc26xx_2_21_00_04/packages/ti/drivers/rf/RFCC26XX_singleMode.c'
    'Invoking: ARM Compiler'
    "C:/TI/bluetooth/ccsv6/tools/compiler/arm_15.12.3.LTS/bin/armcl" --cmd_file="C:/TI/dog/ble_sdk_2_02_01_18/examples/cc2650lp/simple_peripheral/ccs/app/../../iar/stack/../../../../../src/config/build_components.opt" --cmd_file="C:/TI/dog/ble_sdk_2_02_01_18/examples/cc2650lp/simple_peripheral/ccs/app/../../iar/stack/build_config.opt" --cmd_file="C:/TI/dog/ble_sdk_2_02_01_18/examples/cc2650lp/simple_peripheral/ccs/app/../../iar/stack/../../ccs/config/ccs_compiler_defines.bcfg" -mv7M3 --code_state=16 -me -O4 --opt_for_speed=0 --include_path="C:/TI/bluetooth/ccsv6/tools/compiler/arm_15.12.3.LTS/include" --include_path="C:/TI/dog/ble_sdk_2_02_01_18/src/examples/simple_peripheral/cc26xx/app" --include_path="C:/TI/dog/ble_sdk_2_02_01_18/src/inc" --include_path="C:/TI/dog/ble_sdk_2_02_01_18/src/icall/inc" --include_path="C:/TI/dog/ble_sdk_2_02_01_18/src/profiles/roles/cc26xx" --include_path="C:/TI/dog/ble_sdk_2_02_01_18/src/profiles/roles" --include_path="C:/TI/dog/ble_sdk_2_02_01_18/src/profiles/dev_info" --include_path="C:/TI/dog/ble_sdk_2_02_01_18/src/profiles/simple_profile/cc26xx" --include_path="C:/TI/dog/ble_sdk_2_02_01_18/src/profiles/simple_profile" --include_path="C:/TI/dog/ble_sdk_2_02_01_18/src/common/cc26xx" --include_path="C:/TI/dog/ble_sdk_2_02_01_18/src/components/heapmgr" --include_path="C:/TI/dog/ble_sdk_2_02_01_18/src/controller/cc26xx/inc" --include_path="C:/TI/dog/ble_sdk_2_02_01_18/src/components/hal/src/target/_common" --include_path="C:/TI/dog/ble_sdk_2_02_01_18/src/target" --include_path="C:/TI/dog/ble_sdk_2_02_01_18/src/components/hal/src/target/_common/cc26xx" --include_path="C:/TI/dog/ble_sdk_2_02_01_18/src/components/hal/src/inc" --include_path="C:/TI/dog/ble_sdk_2_02_01_18/src/components/osal/src/inc" --include_path="C:/TI/dog/ble_sdk_2_02_01_18/src/components/services/src/sdata" --include_path="C:/TI/dog/ble_sdk_2_02_01_18/src/components/services/src/saddr" --include_path="C:/TI/dog/ble_sdk_2_02_01_18/src/components/icall/src/inc" --include_path="C:/TI/dog/ble_sdk_2_02_01_18/src/inc" --include_path="C:/TI/dog/ble_sdk_2_02_01_18/src/rom" --include_path="C:/TI/dog/tirtos_cc13xx_cc26xx_2_21_00_06/products/cc26xxware_2_24_03_17272" -g --c99 --gcc --define=BOARD_DISPLAY_EXCLUDE_LCD --define=BOARD_DISPLAY_EXCLUDE_UART --define=CC2650_LAUNCHXL --define=CC26XX --define=Display_DISABLE_ALL --define=HEAPMGR_SIZE=0 --define=ICALL_MAX_NUM_ENTITIES=6 --define=ICALL_MAX_NUM_TASKS=3 --define=POWER_MEASURE --define=POWER_SAVING --define=USE_ICALL --define=xdc_runtime_Assert_DISABLE_ALL --define=xdc_runtime_Log_DISABLE_ALL --diag_suppress=48 --diag_wrap=off --diag_warning=225 --display_error_number --gen_func_subsections=on --abi=eabi --preproc_with_compile --preproc_dependency="Drivers/RF/RFCC26XX_singleMode.d" --obj_directory="Drivers/RF" --cmd_file="configPkg/compiler.opt" "C:/TI/dog/tirtos_cc13xx_cc26xx_2_21_00_06/products/tidrivers_cc13xx_cc26xx_2_21_00_04/packages/ti/drivers/rf/RFCC26XX_singleMode.c"

    >> Compilation failure
    Drivers/RF/subdir_rules.mk:7: recipe for target 'Drivers/RF/RFCC26XX_singleMode.obj' failed
    "C:/TI/dog/tirtos_cc13xx_cc26xx_2_21_00_06/products/tidrivers_cc13xx_cc26xx_2_21_00_04/packages/ti/drivers/rf/RFCC26XX_singleMode.c", line 247: error #137: struct "<unnamed>" has no field "pPowerCb"
    "C:/TI/dog/tirtos_cc13xx_cc26xx_2_21_00_06/products/tidrivers_cc13xx_cc26xx_2_21_00_04/packages/ti/drivers/rf/RFCC26XX_singleMode.c", line 745: error #137: struct "<unnamed>" has no field "pErrCb"
    "C:/TI/dog/tirtos_cc13xx_cc26xx_2_21_00_06/products/tidrivers_cc13xx_cc26xx_2_21_00_04/packages/ti/drivers/rf/RFCC26XX_singleMode.c", line 747: error #137: struct "<unnamed>" has no field "pErrCb"
    "C:/TI/dog/tirtos_cc13xx_cc26xx_2_21_00_06/products/tidrivers_cc13xx_cc26xx_2_21_00_04/packages/ti/drivers/rf/RFCC26XX_singleMode.c", line 748: error #20: identifier "RF_ERROR_INVALID_RFMODE" is undefined
    "C:/TI/dog/tirtos_cc13xx_cc26xx_2_21_00_06/products/tidrivers_cc13xx_cc26xx_2_21_00_04/packages/ti/drivers/rf/RFCC26XX_singleMode.c", line 748: error #20: identifier "RF_EventError" is undefined
    "C:/TI/dog/tirtos_cc13xx_cc26xx_2_21_00_06/products/tidrivers_cc13xx_cc26xx_2_21_00_04/packages/ti/drivers/rf/RFCC26XX_singleMode.c", line 818: error #137: struct "<unnamed>" has no field "bUpdateSetup"
    "C:/TI/dog/tirtos_cc13xx_cc26xx_2_21_00_06/products/tidrivers_cc13xx_cc26xx_2_21_00_04/packages/ti/drivers/rf/RFCC26XX_singleMode.c", line 831: error #137: struct "<unnamed>" has no field "bUpdateSetup"
    "C:/TI/dog/tirtos_cc13xx_cc26xx_2_21_00_06/products/tidrivers_cc13xx_cc26xx_2_21_00_04/packages/ti/drivers/rf/RFCC26XX_singleMode.c", line 1030: error #137: struct "<unnamed>" has no field "nPowerUpDurationMargin"
    "C:/TI/dog/tirtos_cc13xx_cc26xx_2_21_00_06/products/tidrivers_cc13xx_cc26xx_2_21_00_04/packages/ti/drivers/rf/RFCC26XX_singleMode.c", line 1044: error #137: struct "<unnamed>" has no field "pErrCb"
    "C:/TI/dog/tirtos_cc13xx_cc26xx_2_21_00_06/products/tidrivers_cc13xx_cc26xx_2_21_00_04/packages/ti/drivers/rf/RFCC26XX_singleMode.c", line 1044: error #137: struct "<unnamed>" has no field "pErrCb"
    "C:/TI/dog/tirtos_cc13xx_cc26xx_2_21_00_06/products/tidrivers_cc13xx_cc26xx_2_21_00_04/packages/ti/drivers/rf/RFCC26XX_singleMode.c", line 1049: error #137: struct "<unnamed>" has no field "pErrCb"
    "C:/TI/dog/tirtos_cc13xx_cc26xx_2_21_00_06/products/tidrivers_cc13xx_cc26xx_2_21_00_04/packages/ti/drivers/rf/RFCC26XX_singleMode.c", line 1050: error #20: identifier "RF_ERROR_CMDFS_SYNTH_PROG" is undefined
    "C:/TI/dog/tirtos_cc13xx_cc26xx_2_21_00_06/products/tidrivers_cc13xx_cc26xx_2_21_00_04/packages/ti/drivers/rf/RFCC26XX_singleMode.c", line 1050: error #20: identifier "RF_EventError" is undefined
    "C:/TI/dog/tirtos_cc13xx_cc26xx_2_21_00_06/products/tidrivers_cc13xx_cc26xx_2_21_00_04/packages/ti/drivers/rf/RFCC26XX_singleMode.c", line 1077: error #137: struct "<unnamed>" has no field "pPowerCb"
    "C:/TI/dog/tirtos_cc13xx_cc26xx_2_21_00_06/products/tidrivers_cc13xx_cc26xx_2_21_00_04/packages/ti/drivers/rf/RFCC26XX_singleMode.c", line 1079: error #137: struct "<unnamed>" has no field "pPowerCb"
    "C:/TI/dog/tirtos_cc13xx_cc26xx_2_21_00_06/products/tidrivers_cc13xx_cc26xx_2_21_00_04/packages/ti/drivers/rf/RFCC26XX_singleMode.c", line 1080: error #20: identifier "RF_EventPowerUp" is undefined
    "C:/TI/dog/tirtos_cc13xx_cc26xx_2_21_00_06/products/tidrivers_cc13xx_cc26xx_2_21_00_04/packages/ti/drivers/rf/RFCC26XX_singleMode.c", line 1332: error #137: struct "<unnamed>" has no field "pPowerCb"
    "C:/TI/dog/tirtos_cc13xx_cc26xx_2_21_00_06/products/tidrivers_cc13xx_cc26xx_2_21_00_04/packages/ti/drivers/rf/RFCC26XX_singleMode.c", line 1332: error #137: struct "<unnamed>" has no field "pPowerCb"
    "C:/TI/dog/tirtos_cc13xx_cc26xx_2_21_00_06/products/tidrivers_cc13xx_cc26xx_2_21_00_04/packages/ti/drivers/rf/RFCC26XX_singleMode.c", line 1333: error #137: struct "<unnamed>" has no field "bUpdateSetup"
    "C:/TI/dog/tirtos_cc13xx_cc26xx_2_21_00_06/products/tidrivers_cc13xx_cc26xx_2_21_00_04/packages/ti/drivers/rf/RFCC26XX_singleMode.c", line 1334: error #137: struct "<unnamed>" has no field "nPowerUpDurationMargin"
    "C:/TI/dog/tirtos_cc13xx_cc26xx_2_21_00_06/products/tidrivers_cc13xx_cc26xx_2_21_00_04/packages/ti/drivers/rf/RFCC26XX_singleMode.c", line 1336: error #137: struct "<unnamed>" has no field "pErrCb"
    "C:/TI/dog/tirtos_cc13xx_cc26xx_2_21_00_06/products/tidrivers_cc13xx_cc26xx_2_21_00_04/packages/ti/drivers/rf/RFCC26XX_singleMode.c", line 1338: error #137: struct "<unnamed>" has no field "pErrCb"
    "C:/TI/dog/tirtos_cc13xx_cc26xx_2_21_00_06/products/tidrivers_cc13xx_cc26xx_2_21_00_04/packages/ti/drivers/rf/RFCC26XX_singleMode.c", line 1338: error #137: struct "<unnamed>" has no field "pErrCb"
    "C:/TI/dog/tirtos_cc13xx_cc26xx_2_21_00_06/products/tidrivers_cc13xx_cc26xx_2_21_00_04/packages/ti/drivers/rf/RFCC26XX_singleMode.c", line 2151: error #20: identifier "RF_CTRL_SET_INACTIVITY_TIMEOUT" is undefined
    "C:/TI/dog/tirtos_cc13xx_cc26xx_2_21_00_06/products/tidrivers_cc13xx_cc26xx_2_21_00_04/packages/ti/drivers/rf/RFCC26XX_singleMode.c", line 2157: error #20: identifier "RF_CTRL_UPDATE_SETUP_CMD" is undefined
    "C:/TI/dog/tirtos_cc13xx_cc26xx_2_21_00_06/products/tidrivers_cc13xx_cc26xx_2_21_00_04/packages/ti/drivers/rf/RFCC26XX_singleMode.c", line 2159: error #137: struct "<unnamed>" has no field "bUpdateSetup"
    "C:/TI/dog/tirtos_cc13xx_cc26xx_2_21_00_06/products/tidrivers_cc13xx_cc26xx_2_21_00_04/packages/ti/drivers/rf/RFCC26XX_singleMode.c", line 2166: error #20: identifier "RF_CTRL_SET_POWERUP_DURATION_MARGIN" is undefined
    "C:/TI/dog/tirtos_cc13xx_cc26xx_2_21_00_06/products/tidrivers_cc13xx_cc26xx_2_21_00_04/packages/ti/drivers/rf/RFCC26XX_singleMode.c", line 2167: error #137: struct "<unnamed>" has no field "nPowerUpDurationMargin"
    28 errors detected in the compilation of "C:/TI/dog/tirtos_cc13xx_cc26xx_2_21_00_06/products/tidrivers_cc13xx_cc26xx_2_21_00_04/packages/ti/drivers/rf/RFCC26XX_singleMode.c".
    gmake: *** [Drivers/RF/RFCC26XX_singleMode.obj] Error 1
    'Building file: C:/TI/dog/tirtos_cc13xx_cc26xx_2_21_00_06/products/tidrivers_cc13xx_cc26xx_2_21_00_04/packages/ti/drivers/SPI.c'
    'Invoking: ARM Compiler'
    "C:/TI/bluetooth/ccsv6/tools/compiler/arm_15.12.3.LTS/bin/armcl" --cmd_file="C:/TI/dog/ble_sdk_2_02_01_18/examples/cc2650lp/simple_peripheral/ccs/app/../../iar/stack/../../../../../src/config/build_components.opt" --cmd_file="C:/TI/dog/ble_sdk_2_02_01_18/examples/cc2650lp/simple_peripheral/ccs/app/../../iar/stack/build_config.opt" --cmd_file="C:/TI/dog/ble_sdk_2_02_01_18/examples/cc2650lp/simple_peripheral/ccs/app/../../iar/stack/../../ccs/config/ccs_compiler_defines.bcfg" -mv7M3 --code_state=16 -me -O4 --opt_for_speed=0 --include_path="C:/TI/bluetooth/ccsv6/tools/compiler/arm_15.12.3.LTS/include" --include_path="C:/TI/dog/ble_sdk_2_02_01_18/src/examples/simple_peripheral/cc26xx/app" --include_path="C:/TI/dog/ble_sdk_2_02_01_18/src/inc" --include_path="C:/TI/dog/ble_sdk_2_02_01_18/src/icall/inc" --include_path="C:/TI/dog/ble_sdk_2_02_01_18/src/profiles/roles/cc26xx" --include_path="C:/TI/dog/ble_sdk_2_02_01_18/src/profiles/roles" --include_path="C:/TI/dog/ble_sdk_2_02_01_18/src/profiles/dev_info" --include_path="C:/TI/dog/ble_sdk_2_02_01_18/src/profiles/simple_profile/cc26xx" --include_path="C:/TI/dog/ble_sdk_2_02_01_18/src/profiles/simple_profile" --include_path="C:/TI/dog/ble_sdk_2_02_01_18/src/common/cc26xx" --include_path="C:/TI/dog/ble_sdk_2_02_01_18/src/components/heapmgr" --include_path="C:/TI/dog/ble_sdk_2_02_01_18/src/controller/cc26xx/inc" --include_path="C:/TI/dog/ble_sdk_2_02_01_18/src/components/hal/src/target/_common" --include_path="C:/TI/dog/ble_sdk_2_02_01_18/src/target" --include_path="C:/TI/dog/ble_sdk_2_02_01_18/src/components/hal/src/target/_common/cc26xx" --include_path="C:/TI/dog/ble_sdk_2_02_01_18/src/components/hal/src/inc" --include_path="C:/TI/dog/ble_sdk_2_02_01_18/src/components/osal/src/inc" --include_path="C:/TI/dog/ble_sdk_2_02_01_18/src/components/services/src/sdata" --include_path="C:/TI/dog/ble_sdk_2_02_01_18/src/components/services/src/saddr" --include_path="C:/TI/dog/ble_sdk_2_02_01_18/src/components/icall/src/inc" --include_path="C:/TI/dog/ble_sdk_2_02_01_18/src/inc" --include_path="C:/TI/dog/ble_sdk_2_02_01_18/src/rom" --include_path="C:/TI/dog/tirtos_cc13xx_cc26xx_2_21_00_06/products/cc26xxware_2_24_03_17272" -g --c99 --gcc --define=BOARD_DISPLAY_EXCLUDE_LCD --define=BOARD_DISPLAY_EXCLUDE_UART --define=CC2650_LAUNCHXL --define=CC26XX --define=Display_DISABLE_ALL --define=HEAPMGR_SIZE=0 --define=ICALL_MAX_NUM_ENTITIES=6 --define=ICALL_MAX_NUM_TASKS=3 --define=POWER_MEASURE --define=POWER_SAVING --define=USE_ICALL --define=xdc_runtime_Assert_DISABLE_ALL --define=xdc_runtime_Log_DISABLE_ALL --diag_suppress=48 --diag_wrap=off --diag_warning=225 --display_error_number --gen_func_subsections=on --abi=eabi --preproc_with_compile --preproc_dependency="Drivers/SPI/SPI.d" --obj_directory="Drivers/SPI" --cmd_file="configPkg/compiler.opt" "C:/TI/dog/tirtos_cc13xx_cc26xx_2_21_00_06/products/tidrivers_cc13xx_cc26xx_2_21_00_04/packages/ti/drivers/SPI.c"
    'Finished building: C:/TI/dog/tirtos_cc13xx_cc26xx_2_21_00_06/products/tidrivers_cc13xx_cc26xx_2_21_00_04/packages/ti/drivers/SPI.c'
    ' '
    'Building file: C:/TI/dog/ble_sdk_2_02_01_18/src/common/cc26xx/ecc/ECCROMCC26XX.c'
    'Invoking: ARM Compiler'
    "C:/TI/bluetooth/ccsv6/tools/compiler/arm_15.12.3.LTS/bin/armcl" --cmd_file="C:/TI/dog/ble_sdk_2_02_01_18/examples/cc2650lp/simple_peripheral/ccs/app/../../iar/stack/../../../../../src/config/build_components.opt" --cmd_file="C:/TI/dog/ble_sdk_2_02_01_18/examples/cc2650lp/simple_peripheral/ccs/app/../../iar/stack/build_config.opt" --cmd_file="C:/TI/dog/ble_sdk_2_02_01_18/examples/cc2650lp/simple_peripheral/ccs/app/../../iar/stack/../../ccs/config/ccs_compiler_defines.bcfg" -mv7M3 --code_state=16 -me -O4 --opt_for_speed=0 --include_path="C:/TI/bluetooth/ccsv6/tools/compiler/arm_15.12.3.LTS/include" --include_path="C:/TI/dog/ble_sdk_2_02_01_18/src/examples/simple_peripheral/cc26xx/app" --include_path="C:/TI/dog/ble_sdk_2_02_01_18/src/inc" --include_path="C:/TI/dog/ble_sdk_2_02_01_18/src/icall/inc" --include_path="C:/TI/dog/ble_sdk_2_02_01_18/src/profiles/roles/cc26xx" --include_path="C:/TI/dog/ble_sdk_2_02_01_18/src/profiles/roles" --include_path="C:/TI/dog/ble_sdk_2_02_01_18/src/profiles/dev_info" --include_path="C:/TI/dog/ble_sdk_2_02_01_18/src/profiles/simple_profile/cc26xx" --include_path="C:/TI/dog/ble_sdk_2_02_01_18/src/profiles/simple_profile" --include_path="C:/TI/dog/ble_sdk_2_02_01_18/src/common/cc26xx" --include_path="C:/TI/dog/ble_sdk_2_02_01_18/src/components/heapmgr" --include_path="C:/TI/dog/ble_sdk_2_02_01_18/src/controller/cc26xx/inc" --include_path="C:/TI/dog/ble_sdk_2_02_01_18/src/components/hal/src/target/_common" --include_path="C:/TI/dog/ble_sdk_2_02_01_18/src/target" --include_path="C:/TI/dog/ble_sdk_2_02_01_18/src/components/hal/src/target/_common/cc26xx" --include_path="C:/TI/dog/ble_sdk_2_02_01_18/src/components/hal/src/inc" --include_path="C:/TI/dog/ble_sdk_2_02_01_18/src/components/osal/src/inc" --include_path="C:/TI/dog/ble_sdk_2_02_01_18/src/components/services/src/sdata" --include_path="C:/TI/dog/ble_sdk_2_02_01_18/src/components/services/src/saddr" --include_path="C:/TI/dog/ble_sdk_2_02_01_18/src/components/icall/src/inc" --include_path="C:/TI/dog/ble_sdk_2_02_01_18/src/inc" --include_path="C:/TI/dog/ble_sdk_2_02_01_18/src/rom" --include_path="C:/TI/dog/tirtos_cc13xx_cc26xx_2_21_00_06/products/cc26xxware_2_24_03_17272" -g --c99 --gcc --define=BOARD_DISPLAY_EXCLUDE_LCD --define=BOARD_DISPLAY_EXCLUDE_UART --define=CC2650_LAUNCHXL --define=CC26XX --define=Display_DISABLE_ALL --define=HEAPMGR_SIZE=0 --define=ICALL_MAX_NUM_ENTITIES=6 --define=ICALL_MAX_NUM_TASKS=3 --define=POWER_MEASURE --define=POWER_SAVING --define=USE_ICALL --define=xdc_runtime_Assert_DISABLE_ALL --define=xdc_runtime_Log_DISABLE_ALL --diag_suppress=48 --diag_wrap=off --diag_warning=225 --display_error_number --gen_func_subsections=on --abi=eabi --preproc_with_compile --preproc_dependency="Drivers/ECC/ECCROMCC26XX.d" --obj_directory="Drivers/ECC" --cmd_file="configPkg/compiler.opt" "C:/TI/dog/ble_sdk_2_02_01_18/src/common/cc26xx/ecc/ECCROMCC26XX.c"
    'Finished building: C:/TI/dog/ble_sdk_2_02_01_18/src/common/cc26xx/ecc/ECCROMCC26XX.c'
    ' '
    'Building file: C:/TI/dog/tirtos_cc13xx_cc26xx_2_21_00_06/products/tidrivers_cc13xx_cc26xx_2_21_00_04/packages/ti/drivers/UART.c'
    'Invoking: ARM Compiler'
    "C:/TI/bluetooth/ccsv6/tools/compiler/arm_15.12.3.LTS/bin/armcl" --cmd_file="C:/TI/dog/ble_sdk_2_02_01_18/examples/cc2650lp/simple_peripheral/ccs/app/../../iar/stack/../../../../../src/config/build_components.opt" --cmd_file="C:/TI/dog/ble_sdk_2_02_01_18/examples/cc2650lp/simple_peripheral/ccs/app/../../iar/stack/build_config.opt" --cmd_file="C:/TI/dog/ble_sdk_2_02_01_18/examples/cc2650lp/simple_peripheral/ccs/app/../../iar/stack/../../ccs/config/ccs_compiler_defines.bcfg" -mv7M3 --code_state=16 -me -O4 --opt_for_speed=0 --include_path="C:/TI/bluetooth/ccsv6/tools/compiler/arm_15.12.3.LTS/include" --include_path="C:/TI/dog/ble_sdk_2_02_01_18/src/examples/simple_peripheral/cc26xx/app" --include_path="C:/TI/dog/ble_sdk_2_02_01_18/src/inc" --include_path="C:/TI/dog/ble_sdk_2_02_01_18/src/icall/inc" --include_path="C:/TI/dog/ble_sdk_2_02_01_18/src/profiles/roles/cc26xx" --include_path="C:/TI/dog/ble_sdk_2_02_01_18/src/profiles/roles" --include_path="C:/TI/dog/ble_sdk_2_02_01_18/src/profiles/dev_info" --include_path="C:/TI/dog/ble_sdk_2_02_01_18/src/profiles/simple_profile/cc26xx" --include_path="C:/TI/dog/ble_sdk_2_02_01_18/src/profiles/simple_profile" --include_path="C:/TI/dog/ble_sdk_2_02_01_18/src/common/cc26xx" --include_path="C:/TI/dog/ble_sdk_2_02_01_18/src/components/heapmgr" --include_path="C:/TI/dog/ble_sdk_2_02_01_18/src/controller/cc26xx/inc" --include_path="C:/TI/dog/ble_sdk_2_02_01_18/src/components/hal/src/target/_common" --include_path="C:/TI/dog/ble_sdk_2_02_01_18/src/target" --include_path="C:/TI/dog/ble_sdk_2_02_01_18/src/components/hal/src/target/_common/cc26xx" --include_path="C:/TI/dog/ble_sdk_2_02_01_18/src/components/hal/src/inc" --include_path="C:/TI/dog/ble_sdk_2_02_01_18/src/components/osal/src/inc" --include_path="C:/TI/dog/ble_sdk_2_02_01_18/src/components/services/src/sdata" --include_path="C:/TI/dog/ble_sdk_2_02_01_18/src/components/services/src/saddr" --include_path="C:/TI/dog/ble_sdk_2_02_01_18/src/components/icall/src/inc" --include_path="C:/TI/dog/ble_sdk_2_02_01_18/src/inc" --include_path="C:/TI/dog/ble_sdk_2_02_01_18/src/rom" --include_path="C:/TI/dog/tirtos_cc13xx_cc26xx_2_21_00_06/products/cc26xxware_2_24_03_17272" -g --c99 --gcc --define=BOARD_DISPLAY_EXCLUDE_LCD --define=BOARD_DISPLAY_EXCLUDE_UART --define=CC2650_LAUNCHXL --define=CC26XX --define=Display_DISABLE_ALL --define=HEAPMGR_SIZE=0 --define=ICALL_MAX_NUM_ENTITIES=6 --define=ICALL_MAX_NUM_TASKS=3 --define=POWER_MEASURE --define=POWER_SAVING --define=USE_ICALL --define=xdc_runtime_Assert_DISABLE_ALL --define=xdc_runtime_Log_DISABLE_ALL --diag_suppress=48 --diag_wrap=off --diag_warning=225 --display_error_number --gen_func_subsections=on --abi=eabi --preproc_with_compile --preproc_dependency="Drivers/UART/UART.d" --obj_directory="Drivers/UART" --cmd_file="configPkg/compiler.opt" "C:/TI/dog/tirtos_cc13xx_cc26xx_2_21_00_06/products/tidrivers_cc13xx_cc26xx_2_21_00_04/packages/ti/drivers/UART.c"
    'Finished building: C:/TI/dog/tirtos_cc13xx_cc26xx_2_21_00_06/products/tidrivers_cc13xx_cc26xx_2_21_00_04/packages/ti/drivers/UART.c'
    ' '
    'Building file: C:/TI/dog/tirtos_cc13xx_cc26xx_2_21_00_06/products/tidrivers_cc13xx_cc26xx_2_21_00_04/packages/ti/drivers/pin/PINCC26XX.c'
    'Invoking: ARM Compiler'
    "C:/TI/bluetooth/ccsv6/tools/compiler/arm_15.12.3.LTS/bin/armcl" --cmd_file="C:/TI/dog/ble_sdk_2_02_01_18/examples/cc2650lp/simple_peripheral/ccs/app/../../iar/stack/../../../../../src/config/build_components.opt" --cmd_file="C:/TI/dog/ble_sdk_2_02_01_18/examples/cc2650lp/simple_peripheral/ccs/app/../../iar/stack/build_config.opt" --cmd_file="C:/TI/dog/ble_sdk_2_02_01_18/examples/cc2650lp/simple_peripheral/ccs/app/../../iar/stack/../../ccs/config/ccs_compiler_defines.bcfg" -mv7M3 --code_state=16 -me -O4 --opt_for_speed=0 --include_path="C:/TI/bluetooth/ccsv6/tools/compiler/arm_15.12.3.LTS/include" --include_path="C:/TI/dog/ble_sdk_2_02_01_18/src/examples/simple_peripheral/cc26xx/app" --include_path="C:/TI/dog/ble_sdk_2_02_01_18/src/inc" --include_path="C:/TI/dog/ble_sdk_2_02_01_18/src/icall/inc" --include_path="C:/TI/dog/ble_sdk_2_02_01_18/src/profiles/roles/cc26xx" --include_path="C:/TI/dog/ble_sdk_2_02_01_18/src/profiles/roles" --include_path="C:/TI/dog/ble_sdk_2_02_01_18/src/profiles/dev_info" --include_path="C:/TI/dog/ble_sdk_2_02_01_18/src/profiles/simple_profile/cc26xx" --include_path="C:/TI/dog/ble_sdk_2_02_01_18/src/profiles/simple_profile" --include_path="C:/TI/dog/ble_sdk_2_02_01_18/src/common/cc26xx" --include_path="C:/TI/dog/ble_sdk_2_02_01_18/src/components/heapmgr" --include_path="C:/TI/dog/ble_sdk_2_02_01_18/src/controller/cc26xx/inc" --include_path="C:/TI/dog/ble_sdk_2_02_01_18/src/components/hal/src/target/_common" --include_path="C:/TI/dog/ble_sdk_2_02_01_18/src/target" --include_path="C:/TI/dog/ble_sdk_2_02_01_18/src/components/hal/src/target/_common/cc26xx" --include_path="C:/TI/dog/ble_sdk_2_02_01_18/src/components/hal/src/inc" --include_path="C:/TI/dog/ble_sdk_2_02_01_18/src/components/osal/src/inc" --include_path="C:/TI/dog/ble_sdk_2_02_01_18/src/components/services/src/sdata" --include_path="C:/TI/dog/ble_sdk_2_02_01_18/src/components/services/src/saddr" --include_path="C:/TI/dog/ble_sdk_2_02_01_18/src/components/icall/src/inc" --include_path="C:/TI/dog/ble_sdk_2_02_01_18/src/inc" --include_path="C:/TI/dog/ble_sdk_2_02_01_18/src/rom" --include_path="C:/TI/dog/tirtos_cc13xx_cc26xx_2_21_00_06/products/cc26xxware_2_24_03_17272" -g --c99 --gcc --define=BOARD_DISPLAY_EXCLUDE_LCD --define=BOARD_DISPLAY_EXCLUDE_UART --define=CC2650_LAUNCHXL --define=CC26XX --define=Display_DISABLE_ALL --define=HEAPMGR_SIZE=0 --define=ICALL_MAX_NUM_ENTITIES=6 --define=ICALL_MAX_NUM_TASKS=3 --define=POWER_MEASURE --define=POWER_SAVING --define=USE_ICALL --define=xdc_runtime_Assert_DISABLE_ALL --define=xdc_runtime_Log_DISABLE_ALL --diag_suppress=48 --diag_wrap=off --diag_warning=225 --display_error_number --gen_func_subsections=on --abi=eabi --preproc_with_compile --preproc_dependency="Drivers/PIN/PINCC26XX.d" --obj_directory="Drivers/PIN" --cmd_file="configPkg/compiler.opt" "C:/TI/dog/tirtos_cc13xx_cc26xx_2_21_00_06/products/tidrivers_cc13xx_cc26xx_2_21_00_04/packages/ti/drivers/pin/PINCC26XX.c"
    'Finished building: C:/TI/dog/tirtos_cc13xx_cc26xx_2_21_00_06/products/tidrivers_cc13xx_cc26xx_2_21_00_04/packages/ti/drivers/pin/PINCC26XX.c'
    ' '
    'Building file: C:/TI/dog/tirtos_cc13xx_cc26xx_2_21_00_06/products/tidrivers_cc13xx_cc26xx_2_21_00_04/packages/ti/drivers/uart/UARTCC26XX.c'
    'Invoking: ARM Compiler'
    "C:/TI/bluetooth/ccsv6/tools/compiler/arm_15.12.3.LTS/bin/armcl" --cmd_file="C:/TI/dog/ble_sdk_2_02_01_18/examples/cc2650lp/simple_peripheral/ccs/app/../../iar/stack/../../../../../src/config/build_components.opt" --cmd_file="C:/TI/dog/ble_sdk_2_02_01_18/examples/cc2650lp/simple_peripheral/ccs/app/../../iar/stack/build_config.opt" --cmd_file="C:/TI/dog/ble_sdk_2_02_01_18/examples/cc2650lp/simple_peripheral/ccs/app/../../iar/stack/../../ccs/config/ccs_compiler_defines.bcfg" -mv7M3 --code_state=16 -me -O4 --opt_for_speed=0 --include_path="C:/TI/bluetooth/ccsv6/tools/compiler/arm_15.12.3.LTS/include" --include_path="C:/TI/dog/ble_sdk_2_02_01_18/src/examples/simple_peripheral/cc26xx/app" --include_path="C:/TI/dog/ble_sdk_2_02_01_18/src/inc" --include_path="C:/TI/dog/ble_sdk_2_02_01_18/src/icall/inc" --include_path="C:/TI/dog/ble_sdk_2_02_01_18/src/profiles/roles/cc26xx" --include_path="C:/TI/dog/ble_sdk_2_02_01_18/src/profiles/roles" --include_path="C:/TI/dog/ble_sdk_2_02_01_18/src/profiles/dev_info" --include_path="C:/TI/dog/ble_sdk_2_02_01_18/src/profiles/simple_profile/cc26xx" --include_path="C:/TI/dog/ble_sdk_2_02_01_18/src/profiles/simple_profile" --include_path="C:/TI/dog/ble_sdk_2_02_01_18/src/common/cc26xx" --include_path="C:/TI/dog/ble_sdk_2_02_01_18/src/components/heapmgr" --include_path="C:/TI/dog/ble_sdk_2_02_01_18/src/controller/cc26xx/inc" --include_path="C:/TI/dog/ble_sdk_2_02_01_18/src/components/hal/src/target/_common" --include_path="C:/TI/dog/ble_sdk_2_02_01_18/src/target" --include_path="C:/TI/dog/ble_sdk_2_02_01_18/src/components/hal/src/target/_common/cc26xx" --include_path="C:/TI/dog/ble_sdk_2_02_01_18/src/components/hal/src/inc" --include_path="C:/TI/dog/ble_sdk_2_02_01_18/src/components/osal/src/inc" --include_path="C:/TI/dog/ble_sdk_2_02_01_18/src/components/services/src/sdata" --include_path="C:/TI/dog/ble_sdk_2_02_01_18/src/components/services/src/saddr" --include_path="C:/TI/dog/ble_sdk_2_02_01_18/src/components/icall/src/inc" --include_path="C:/TI/dog/ble_sdk_2_02_01_18/src/inc" --include_path="C:/TI/dog/ble_sdk_2_02_01_18/src/rom" --include_path="C:/TI/dog/tirtos_cc13xx_cc26xx_2_21_00_06/products/cc26xxware_2_24_03_17272" -g --c99 --gcc --define=BOARD_DISPLAY_EXCLUDE_LCD --define=BOARD_DISPLAY_EXCLUDE_UART --define=CC2650_LAUNCHXL --define=CC26XX --define=Display_DISABLE_ALL --define=HEAPMGR_SIZE=0 --define=ICALL_MAX_NUM_ENTITIES=6 --define=ICALL_MAX_NUM_TASKS=3 --define=POWER_MEASURE --define=POWER_SAVING --define=USE_ICALL --define=xdc_runtime_Assert_DISABLE_ALL --define=xdc_runtime_Log_DISABLE_ALL --diag_suppress=48 --diag_wrap=off --diag_warning=225 --display_error_number --gen_func_subsections=on --abi=eabi --preproc_with_compile --preproc_dependency="Drivers/UART/UARTCC26XX.d" --obj_directory="Drivers/UART" --cmd_file="configPkg/compiler.opt" "C:/TI/dog/tirtos_cc13xx_cc26xx_2_21_00_06/products/tidrivers_cc13xx_cc26xx_2_21_00_04/packages/ti/drivers/uart/UARTCC26XX.c"

    >> Compilation failure
    Drivers/UART/subdir_rules.mk:14: recipe for target 'Drivers/UART/UARTCC26XX.obj' failed
    "C:/TI/dog/tirtos_cc13xx_cc26xx_2_21_00_06/products/tidrivers_cc13xx_cc26xx_2_21_00_04/packages/ti/drivers/uart/UARTCC26XX.c", line 129: error #20: identifier "UARTCC26XX_HWAttrsV2" is undefined
    "C:/TI/dog/tirtos_cc13xx_cc26xx_2_21_00_06/products/tidrivers_cc13xx_cc26xx_2_21_00_04/packages/ti/drivers/uart/UARTCC26XX.c", line 207: error #20: identifier "UARTCC26XX_HWAttrsV2" is undefined
    "C:/TI/dog/tirtos_cc13xx_cc26xx_2_21_00_06/products/tidrivers_cc13xx_cc26xx_2_21_00_04/packages/ti/drivers/uart/UARTCC26XX.c", line 207: error #66: expected a ";"
    "C:/TI/dog/tirtos_cc13xx_cc26xx_2_21_00_06/products/tidrivers_cc13xx_cc26xx_2_21_00_04/packages/ti/drivers/uart/UARTCC26XX.c", line 211: error #20: identifier "hwAttrs" is undefined
    "C:/TI/dog/tirtos_cc13xx_cc26xx_2_21_00_06/products/tidrivers_cc13xx_cc26xx_2_21_00_04/packages/ti/drivers/uart/UARTCC26XX.c", line 238: error #20: identifier "UARTCC26XX_HWAttrsV2" is undefined
    "C:/TI/dog/tirtos_cc13xx_cc26xx_2_21_00_06/products/tidrivers_cc13xx_cc26xx_2_21_00_04/packages/ti/drivers/uart/UARTCC26XX.c", line 238: error #66: expected a ";"
    "C:/TI/dog/tirtos_cc13xx_cc26xx_2_21_00_06/products/tidrivers_cc13xx_cc26xx_2_21_00_04/packages/ti/drivers/uart/UARTCC26XX.c", line 242: error #20: identifier "hwAttrs" is undefined
    "C:/TI/dog/tirtos_cc13xx_cc26xx_2_21_00_06/products/tidrivers_cc13xx_cc26xx_2_21_00_04/packages/ti/drivers/uart/UARTCC26XX.c", line 268: error #20: identifier "UARTCC26XX_HWAttrsV2" is undefined
    "C:/TI/dog/tirtos_cc13xx_cc26xx_2_21_00_06/products/tidrivers_cc13xx_cc26xx_2_21_00_04/packages/ti/drivers/uart/UARTCC26XX.c", line 268: error #66: expected a ";"
    "C:/TI/dog/tirtos_cc13xx_cc26xx_2_21_00_06/products/tidrivers_cc13xx_cc26xx_2_21_00_04/packages/ti/drivers/uart/UARTCC26XX.c", line 272: error #20: identifier "hwAttrs" is undefined
    "C:/TI/dog/tirtos_cc13xx_cc26xx_2_21_00_06/products/tidrivers_cc13xx_cc26xx_2_21_00_04/packages/ti/drivers/uart/UARTCC26XX.c", line 281: warning #225-D: function "RingBuf_put" declared implicitly
    "C:/TI/dog/tirtos_cc13xx_cc26xx_2_21_00_06/products/tidrivers_cc13xx_cc26xx_2_21_00_04/packages/ti/drivers/uart/UARTCC26XX.c", line 281: error #137: struct "UARTCC26XX_Object" has no field "ringBuffer"
    "C:/TI/dog/tirtos_cc13xx_cc26xx_2_21_00_06/products/tidrivers_cc13xx_cc26xx_2_21_00_04/packages/ti/drivers/uart/UARTCC26XX.c", line 338: error #20: identifier "UARTCC26XX_HWAttrsV2" is undefined
    "C:/TI/dog/tirtos_cc13xx_cc26xx_2_21_00_06/products/tidrivers_cc13xx_cc26xx_2_21_00_04/packages/ti/drivers/uart/UARTCC26XX.c", line 338: error #66: expected a ";"
    "C:/TI/dog/tirtos_cc13xx_cc26xx_2_21_00_06/products/tidrivers_cc13xx_cc26xx_2_21_00_04/packages/ti/drivers/uart/UARTCC26XX.c", line 342: error #20: identifier "hwAttrs" is undefined
    "C:/TI/dog/tirtos_cc13xx_cc26xx_2_21_00_06/products/tidrivers_cc13xx_cc26xx_2_21_00_04/packages/ti/drivers/uart/UARTCC26XX.c", line 392: error #20: identifier "UARTCC26XX_HWAttrsV2" is undefined
    "C:/TI/dog/tirtos_cc13xx_cc26xx_2_21_00_06/products/tidrivers_cc13xx_cc26xx_2_21_00_04/packages/ti/drivers/uart/UARTCC26XX.c", line 451: error #20: identifier "UARTCC26XX_HWAttrsV2" is undefined
    "C:/TI/dog/tirtos_cc13xx_cc26xx_2_21_00_06/products/tidrivers_cc13xx_cc26xx_2_21_00_04/packages/ti/drivers/uart/UARTCC26XX.c", line 451: error #66: expected a ";"
    "C:/TI/dog/tirtos_cc13xx_cc26xx_2_21_00_06/products/tidrivers_cc13xx_cc26xx_2_21_00_04/packages/ti/drivers/uart/UARTCC26XX.c", line 455: error #20: identifier "hwAttrs" is undefined
    "C:/TI/dog/tirtos_cc13xx_cc26xx_2_21_00_06/products/tidrivers_cc13xx_cc26xx_2_21_00_04/packages/ti/drivers/uart/UARTCC26XX.c", line 466: error #137: struct "UARTCC26XX_Object" has no field "ringBuffer"
    "C:/TI/dog/tirtos_cc13xx_cc26xx_2_21_00_06/products/tidrivers_cc13xx_cc26xx_2_21_00_04/packages/ti/drivers/uart/UARTCC26XX.c", line 466: error #137: struct "UARTCC26XX_Object" has no field "ringBuffer"
    "C:/TI/dog/tirtos_cc13xx_cc26xx_2_21_00_06/products/tidrivers_cc13xx_cc26xx_2_21_00_04/packages/ti/drivers/uart/UARTCC26XX.c", line 682: error #20: identifier "UARTCC26XX_HWAttrsV2" is undefined
    "C:/TI/dog/tirtos_cc13xx_cc26xx_2_21_00_06/products/tidrivers_cc13xx_cc26xx_2_21_00_04/packages/ti/drivers/uart/UARTCC26XX.c", line 682: error #66: expected a ";"
    "C:/TI/dog/tirtos_cc13xx_cc26xx_2_21_00_06/products/tidrivers_cc13xx_cc26xx_2_21_00_04/packages/ti/drivers/uart/UARTCC26XX.c", line 686: error #20: identifier "hwAttrs" is undefined
    "C:/TI/dog/tirtos_cc13xx_cc26xx_2_21_00_06/products/tidrivers_cc13xx_cc26xx_2_21_00_04/packages/ti/drivers/uart/UARTCC26XX.c", line 798: warning #225-D: function "RingBuf_construct" declared implicitly
    "C:/TI/dog/tirtos_cc13xx_cc26xx_2_21_00_06/products/tidrivers_cc13xx_cc26xx_2_21_00_04/packages/ti/drivers/uart/UARTCC26XX.c", line 798: error #137: struct "UARTCC26XX_Object" has no field "ringBuffer"
    "C:/TI/dog/tirtos_cc13xx_cc26xx_2_21_00_06/products/tidrivers_cc13xx_cc26xx_2_21_00_04/packages/ti/drivers/uart/UARTCC26XX.c", line 828: error #20: identifier "UARTCC26XX_HWAttrsV2" is undefined
    "C:/TI/dog/tirtos_cc13xx_cc26xx_2_21_00_06/products/tidrivers_cc13xx_cc26xx_2_21_00_04/packages/ti/drivers/uart/UARTCC26XX.c", line 828: error #66: expected a ";"
    "C:/TI/dog/tirtos_cc13xx_cc26xx_2_21_00_06/products/tidrivers_cc13xx_cc26xx_2_21_00_04/packages/ti/drivers/uart/UARTCC26XX.c", line 832: error #20: identifier "hwAttrs" is undefined
    "C:/TI/dog/tirtos_cc13xx_cc26xx_2_21_00_06/products/tidrivers_cc13xx_cc26xx_2_21_00_04/packages/ti/drivers/uart/UARTCC26XX.c", line 893: error #20: identifier "UARTCC26XX_HWAttrsV2" is undefined
    "C:/TI/dog/tirtos_cc13xx_cc26xx_2_21_00_06/products/tidrivers_cc13xx_cc26xx_2_21_00_04/packages/ti/drivers/uart/UARTCC26XX.c", line 893: error #66: expected a ";"
    "C:/TI/dog/tirtos_cc13xx_cc26xx_2_21_00_06/products/tidrivers_cc13xx_cc26xx_2_21_00_04/packages/ti/drivers/uart/UARTCC26XX.c", line 918: error #20: identifier "hwAttrs" is undefined
    "C:/TI/dog/tirtos_cc13xx_cc26xx_2_21_00_06/products/tidrivers_cc13xx_cc26xx_2_21_00_04/packages/ti/drivers/uart/UARTCC26XX.c", line 927: error #137: struct "UARTCC26XX_Object" has no field "ringBuffer"
    "C:/TI/dog/tirtos_cc13xx_cc26xx_2_21_00_06/products/tidrivers_cc13xx_cc26xx_2_21_00_04/packages/ti/drivers/uart/UARTCC26XX.c", line 928: error #137: struct "UARTCC26XX_Object" has no field "ringBuffer"
    "C:/TI/dog/tirtos_cc13xx_cc26xx_2_21_00_06/products/tidrivers_cc13xx_cc26xx_2_21_00_04/packages/ti/drivers/uart/UARTCC26XX.c", line 928: error #137: struct "UARTCC26XX_Object" has no field "ringBuffer"
    "C:/TI/dog/tirtos_cc13xx_cc26xx_2_21_00_06/products/tidrivers_cc13xx_cc26xx_2_21_00_04/packages/ti/drivers/uart/UARTCC26XX.c", line 929: error #137: struct "UARTCC26XX_Object" has no field "ringBuffer"
    "C:/TI/dog/tirtos_cc13xx_cc26xx_2_21_00_06/products/tidrivers_cc13xx_cc26xx_2_21_00_04/packages/ti/drivers/uart/UARTCC26XX.c", line 981: error #20: identifier "UARTCC26XX_HWAttrsV2" is undefined
    "C:/TI/dog/tirtos_cc13xx_cc26xx_2_21_00_06/products/tidrivers_cc13xx_cc26xx_2_21_00_04/packages/ti/drivers/uart/UARTCC26XX.c", line 981: error #66: expected a ";"
    "C:/TI/dog/tirtos_cc13xx_cc26xx_2_21_00_06/products/tidrivers_cc13xx_cc26xx_2_21_00_04/packages/ti/drivers/uart/UARTCC26XX.c", line 985: error #20: identifier "hwAttrs" is undefined
    "C:/TI/dog/tirtos_cc13xx_cc26xx_2_21_00_06/products/tidrivers_cc13xx_cc26xx_2_21_00_04/packages/ti/drivers/uart/UARTCC26XX.c", line 1129: error #20: identifier "UARTCC26XX_HWAttrsV2" is undefined
    "C:/TI/dog/tirtos_cc13xx_cc26xx_2_21_00_06/products/tidrivers_cc13xx_cc26xx_2_21_00_04/packages/ti/drivers/uart/UARTCC26XX.c", line 1129: error #66: expected a ";"
    "C:/TI/dog/tirtos_cc13xx_cc26xx_2_21_00_06/products/tidrivers_cc13xx_cc26xx_2_21_00_04/packages/ti/drivers/uart/UARTCC26XX.c", line 1133: error #20: identifier "hwAttrs" is undefined
    "C:/TI/dog/tirtos_cc13xx_cc26xx_2_21_00_06/products/tidrivers_cc13xx_cc26xx_2_21_00_04/packages/ti/drivers/uart/UARTCC26XX.c", line 1199: error #20: identifier "UARTCC26XX_HWAttrsV2" is undefined
    "C:/TI/dog/tirtos_cc13xx_cc26xx_2_21_00_06/products/tidrivers_cc13xx_cc26xx_2_21_00_04/packages/ti/drivers/uart/UARTCC26XX.c", line 1199: error #66: expected a ";"
    "C:/TI/dog/tirtos_cc13xx_cc26xx_2_21_00_06/products/tidrivers_cc13xx_cc26xx_2_21_00_04/packages/ti/drivers/uart/UARTCC26XX.c", line 1203: error #20: identifier "hwAttrs" is undefined
    "C:/TI/dog/tirtos_cc13xx_cc26xx_2_21_00_06/products/tidrivers_cc13xx_cc26xx_2_21_00_04/packages/ti/drivers/uart/UARTCC26XX.c", line 1232: warning #225-D: function "RingBuf_get" declared implicitly
    "C:/TI/dog/tirtos_cc13xx_cc26xx_2_21_00_06/products/tidrivers_cc13xx_cc26xx_2_21_00_04/packages/ti/drivers/uart/UARTCC26XX.c", line 1232: error #137: struct "UARTCC26XX_Object" has no field "ringBuffer"
    "C:/TI/dog/tirtos_cc13xx_cc26xx_2_21_00_06/products/tidrivers_cc13xx_cc26xx_2_21_00_04/packages/ti/drivers/uart/UARTCC26XX.c", line 1330: error #20: identifier "UARTCC26XX_HWAttrsV2" is undefined
    "C:/TI/dog/tirtos_cc13xx_cc26xx_2_21_00_06/products/tidrivers_cc13xx_cc26xx_2_21_00_04/packages/ti/drivers/uart/UARTCC26XX.c", line 1330: error #66: expected a ";"
    "C:/TI/dog/tirtos_cc13xx_cc26xx_2_21_00_06/products/tidrivers_cc13xx_cc26xx_2_21_00_04/packages/ti/drivers/uart/UARTCC26XX.c", line 1334: error #20: identifier "hwAttrs" is undefined
    "C:/TI/dog/tirtos_cc13xx_cc26xx_2_21_00_06/products/tidrivers_cc13xx_cc26xx_2_21_00_04/packages/ti/drivers/uart/UARTCC26XX.c", line 1378: error #20: identifier "UARTCC26XX_HWAttrsV2" is undefined
    "C:/TI/dog/tirtos_cc13xx_cc26xx_2_21_00_06/products/tidrivers_cc13xx_cc26xx_2_21_00_04/packages/ti/drivers/uart/UARTCC26XX.c", line 1378: error #66: expected a ";"
    "C:/TI/dog/tirtos_cc13xx_cc26xx_2_21_00_06/products/tidrivers_cc13xx_cc26xx_2_21_00_04/packages/ti/drivers/uart/UARTCC26XX.c", line 1390: error #20: identifier "hwAttrs" is undefined
    "C:/TI/dog/tirtos_cc13xx_cc26xx_2_21_00_06/products/tidrivers_cc13xx_cc26xx_2_21_00_04/packages/ti/drivers/uart/UARTCC26XX.c", line 1447: error #20: identifier "UARTCC26XX_HWAttrsV2" is undefined
    "C:/TI/dog/tirtos_cc13xx_cc26xx_2_21_00_06/products/tidrivers_cc13xx_cc26xx_2_21_00_04/packages/ti/drivers/uart/UARTCC26XX.c", line 1447: error #66: expected a ";"
    "C:/TI/dog/tirtos_cc13xx_cc26xx_2_21_00_06/products/tidrivers_cc13xx_cc26xx_2_21_00_04/packages/ti/drivers/uart/UARTCC26XX.c", line 1453: error #20: identifier "hwAttrs" is undefined
    53 errors detected in the compilation of "C:/TI/dog/tirtos_cc13xx_cc26xx_2_21_00_06/products/tidrivers_cc13xx_cc26xx_2_21_00_04/packages/ti/drivers/uart/UARTCC26XX.c".
    gmake: *** [Drivers/UART/UARTCC26XX.obj] Error 1
    'Building file: C:/TI/dog/ble_sdk_2_02_01_18/src/components/hal/src/target/_common/TRNGCC26XX.c'
    'Invoking: ARM Compiler'
    "C:/TI/bluetooth/ccsv6/tools/compiler/arm_15.12.3.LTS/bin/armcl" --cmd_file="C:/TI/dog/ble_sdk_2_02_01_18/examples/cc2650lp/simple_peripheral/ccs/app/../../iar/stack/../../../../../src/config/build_components.opt" --cmd_file="C:/TI/dog/ble_sdk_2_02_01_18/examples/cc2650lp/simple_peripheral/ccs/app/../../iar/stack/build_config.opt" --cmd_file="C:/TI/dog/ble_sdk_2_02_01_18/examples/cc2650lp/simple_peripheral/ccs/app/../../iar/stack/../../ccs/config/ccs_compiler_defines.bcfg" -mv7M3 --code_state=16 -me -O4 --opt_for_speed=0 --include_path="C:/TI/bluetooth/ccsv6/tools/compiler/arm_15.12.3.LTS/include" --include_path="C:/TI/dog/ble_sdk_2_02_01_18/src/examples/simple_peripheral/cc26xx/app" --include_path="C:/TI/dog/ble_sdk_2_02_01_18/src/inc" --include_path="C:/TI/dog/ble_sdk_2_02_01_18/src/icall/inc" --include_path="C:/TI/dog/ble_sdk_2_02_01_18/src/profiles/roles/cc26xx" --include_path="C:/TI/dog/ble_sdk_2_02_01_18/src/profiles/roles" --include_path="C:/TI/dog/ble_sdk_2_02_01_18/src/profiles/dev_info" --include_path="C:/TI/dog/ble_sdk_2_02_01_18/src/profiles/simple_profile/cc26xx" --include_path="C:/TI/dog/ble_sdk_2_02_01_18/src/profiles/simple_profile" --include_path="C:/TI/dog/ble_sdk_2_02_01_18/src/common/cc26xx" --include_path="C:/TI/dog/ble_sdk_2_02_01_18/src/components/heapmgr" --include_path="C:/TI/dog/ble_sdk_2_02_01_18/src/controller/cc26xx/inc" --include_path="C:/TI/dog/ble_sdk_2_02_01_18/src/components/hal/src/target/_common" --include_path="C:/TI/dog/ble_sdk_2_02_01_18/src/target" --include_path="C:/TI/dog/ble_sdk_2_02_01_18/src/components/hal/src/target/_common/cc26xx" --include_path="C:/TI/dog/ble_sdk_2_02_01_18/src/components/hal/src/inc" --include_path="C:/TI/dog/ble_sdk_2_02_01_18/src/components/osal/src/inc" --include_path="C:/TI/dog/ble_sdk_2_02_01_18/src/components/services/src/sdata" --include_path="C:/TI/dog/ble_sdk_2_02_01_18/src/components/services/src/saddr" --include_path="C:/TI/dog/ble_sdk_2_02_01_18/src/components/icall/src/inc" --include_path="C:/TI/dog/ble_sdk_2_02_01_18/src/inc" --include_path="C:/TI/dog/ble_sdk_2_02_01_18/src/rom" --include_path="C:/TI/dog/tirtos_cc13xx_cc26xx_2_21_00_06/products/cc26xxware_2_24_03_17272" -g --c99 --gcc --define=BOARD_DISPLAY_EXCLUDE_LCD --define=BOARD_DISPLAY_EXCLUDE_UART --define=CC2650_LAUNCHXL --define=CC26XX --define=Display_DISABLE_ALL --define=HEAPMGR_SIZE=0 --define=ICALL_MAX_NUM_ENTITIES=6 --define=ICALL_MAX_NUM_TASKS=3 --define=POWER_MEASURE --define=POWER_SAVING --define=USE_ICALL --define=xdc_runtime_Assert_DISABLE_ALL --define=xdc_runtime_Log_DISABLE_ALL --diag_suppress=48 --diag_wrap=off --diag_warning=225 --display_error_number --gen_func_subsections=on --abi=eabi --preproc_with_compile --preproc_dependency="Drivers/TRNG/TRNGCC26XX.d" --obj_directory="Drivers/TRNG" --cmd_file="configPkg/compiler.opt" "C:/TI/dog/ble_sdk_2_02_01_18/src/components/hal/src/target/_common/TRNGCC26XX.c"
    'Finished building: C:/TI/dog/ble_sdk_2_02_01_18/src/components/hal/src/target/_common/TRNGCC26XX.c'
    ' '
    'Building file: C:/TI/dog/tirtos_cc13xx_cc26xx_2_21_00_06/products/tidrivers_cc13xx_cc26xx_2_21_00_04/packages/ti/drivers/dma/UDMACC26XX.c'
    'Invoking: ARM Compiler'
    "C:/TI/bluetooth/ccsv6/tools/compiler/arm_15.12.3.LTS/bin/armcl" --cmd_file="C:/TI/dog/ble_sdk_2_02_01_18/examples/cc2650lp/simple_peripheral/ccs/app/../../iar/stack/../../../../../src/config/build_components.opt" --cmd_file="C:/TI/dog/ble_sdk_2_02_01_18/examples/cc2650lp/simple_peripheral/ccs/app/../../iar/stack/build_config.opt" --cmd_file="C:/TI/dog/ble_sdk_2_02_01_18/examples/cc2650lp/simple_peripheral/ccs/app/../../iar/stack/../../ccs/config/ccs_compiler_defines.bcfg" -mv7M3 --code_state=16 -me -O4 --opt_for_speed=0 --include_path="C:/TI/bluetooth/ccsv6/tools/compiler/arm_15.12.3.LTS/include" --include_path="C:/TI/dog/ble_sdk_2_02_01_18/src/examples/simple_peripheral/cc26xx/app" --include_path="C:/TI/dog/ble_sdk_2_02_01_18/src/inc" --include_path="C:/TI/dog/ble_sdk_2_02_01_18/src/icall/inc" --include_path="C:/TI/dog/ble_sdk_2_02_01_18/src/profiles/roles/cc26xx" --include_path="C:/TI/dog/ble_sdk_2_02_01_18/src/profiles/roles" --include_path="C:/TI/dog/ble_sdk_2_02_01_18/src/profiles/dev_info" --include_path="C:/TI/dog/ble_sdk_2_02_01_18/src/profiles/simple_profile/cc26xx" --include_path="C:/TI/dog/ble_sdk_2_02_01_18/src/profiles/simple_profile" --include_path="C:/TI/dog/ble_sdk_2_02_01_18/src/common/cc26xx" --include_path="C:/TI/dog/ble_sdk_2_02_01_18/src/components/heapmgr" --include_path="C:/TI/dog/ble_sdk_2_02_01_18/src/controller/cc26xx/inc" --include_path="C:/TI/dog/ble_sdk_2_02_01_18/src/components/hal/src/target/_common" --include_path="C:/TI/dog/ble_sdk_2_02_01_18/src/target" --include_path="C:/TI/dog/ble_sdk_2_02_01_18/src/components/hal/src/target/_common/cc26xx" --include_path="C:/TI/dog/ble_sdk_2_02_01_18/src/components/hal/src/inc" --include_path="C:/TI/dog/ble_sdk_2_02_01_18/src/components/osal/src/inc" --include_path="C:/TI/dog/ble_sdk_2_02_01_18/src/components/services/src/sdata" --include_path="C:/TI/dog/ble_sdk_2_02_01_18/src/components/services/src/saddr" --include_path="C:/TI/dog/ble_sdk_2_02_01_18/src/components/icall/src/inc" --include_path="C:/TI/dog/ble_sdk_2_02_01_18/src/inc" --include_path="C:/TI/dog/ble_sdk_2_02_01_18/src/rom" --include_path="C:/TI/dog/tirtos_cc13xx_cc26xx_2_21_00_06/products/cc26xxware_2_24_03_17272" -g --c99 --gcc --define=BOARD_DISPLAY_EXCLUDE_LCD --define=BOARD_DISPLAY_EXCLUDE_UART --define=CC2650_LAUNCHXL --define=CC26XX --define=Display_DISABLE_ALL --define=HEAPMGR_SIZE=0 --define=ICALL_MAX_NUM_ENTITIES=6 --define=ICALL_MAX_NUM_TASKS=3 --define=POWER_MEASURE --define=POWER_SAVING --define=USE_ICALL --define=xdc_runtime_Assert_DISABLE_ALL --define=xdc_runtime_Log_DISABLE_ALL --diag_suppress=48 --diag_wrap=off --diag_warning=225 --display_error_number --gen_func_subsections=on --abi=eabi --preproc_with_compile --preproc_dependency="Drivers/UDMA/UDMACC26XX.d" --obj_directory="Drivers/UDMA" --cmd_file="configPkg/compiler.opt" "C:/TI/dog/tirtos_cc13xx_cc26xx_2_21_00_06/products/tidrivers_cc13xx_cc26xx_2_21_00_04/packages/ti/drivers/dma/UDMACC26XX.c"
    'Finished building: C:/TI/dog/tirtos_cc13xx_cc26xx_2_21_00_06/products/tidrivers_cc13xx_cc26xx_2_21_00_04/packages/ti/drivers/dma/UDMACC26XX.c'
    ' '
    'Building file: C:/TI/dog/tirtos_cc13xx_cc26xx_2_21_00_06/products/tidrivers_cc13xx_cc26xx_2_21_00_04/packages/ti/drivers/spi/SPICC26XXDMA.c'
    'Invoking: ARM Compiler'
    "C:/TI/bluetooth/ccsv6/tools/compiler/arm_15.12.3.LTS/bin/armcl" --cmd_file="C:/TI/dog/ble_sdk_2_02_01_18/examples/cc2650lp/simple_peripheral/ccs/app/../../iar/stack/../../../../../src/config/build_components.opt" --cmd_file="C:/TI/dog/ble_sdk_2_02_01_18/examples/cc2650lp/simple_peripheral/ccs/app/../../iar/stack/build_config.opt" --cmd_file="C:/TI/dog/ble_sdk_2_02_01_18/examples/cc2650lp/simple_peripheral/ccs/app/../../iar/stack/../../ccs/config/ccs_compiler_defines.bcfg" -mv7M3 --code_state=16 -me -O4 --opt_for_speed=0 --include_path="C:/TI/bluetooth/ccsv6/tools/compiler/arm_15.12.3.LTS/include" --include_path="C:/TI/dog/ble_sdk_2_02_01_18/src/examples/simple_peripheral/cc26xx/app" --include_path="C:/TI/dog/ble_sdk_2_02_01_18/src/inc" --include_path="C:/TI/dog/ble_sdk_2_02_01_18/src/icall/inc" --include_path="C:/TI/dog/ble_sdk_2_02_01_18/src/profiles/roles/cc26xx" --include_path="C:/TI/dog/ble_sdk_2_02_01_18/src/profiles/roles" --include_path="C:/TI/dog/ble_sdk_2_02_01_18/src/profiles/dev_info" --include_path="C:/TI/dog/ble_sdk_2_02_01_18/src/profiles/simple_profile/cc26xx" --include_path="C:/TI/dog/ble_sdk_2_02_01_18/src/profiles/simple_profile" --include_path="C:/TI/dog/ble_sdk_2_02_01_18/src/common/cc26xx" --include_path="C:/TI/dog/ble_sdk_2_02_01_18/src/components/heapmgr" --include_path="C:/TI/dog/ble_sdk_2_02_01_18/src/controller/cc26xx/inc" --include_path="C:/TI/dog/ble_sdk_2_02_01_18/src/components/hal/src/target/_common" --include_path="C:/TI/dog/ble_sdk_2_02_01_18/src/target" --include_path="C:/TI/dog/ble_sdk_2_02_01_18/src/components/hal/src/target/_common/cc26xx" --include_path="C:/TI/dog/ble_sdk_2_02_01_18/src/components/hal/src/inc" --include_path="C:/TI/dog/ble_sdk_2_02_01_18/src/components/osal/src/inc" --include_path="C:/TI/dog/ble_sdk_2_02_01_18/src/components/services/src/sdata" --include_path="C:/TI/dog/ble_sdk_2_02_01_18/src/components/services/src/saddr" --include_path="C:/TI/dog/ble_sdk_2_02_01_18/src/components/icall/src/inc" --include_path="C:/TI/dog/ble_sdk_2_02_01_18/src/inc" --include_path="C:/TI/dog/ble_sdk_2_02_01_18/src/rom" --include_path="C:/TI/dog/tirtos_cc13xx_cc26xx_2_21_00_06/products/cc26xxware_2_24_03_17272" -g --c99 --gcc --define=BOARD_DISPLAY_EXCLUDE_LCD --define=BOARD_DISPLAY_EXCLUDE_UART --define=CC2650_LAUNCHXL --define=CC26XX --define=Display_DISABLE_ALL --define=HEAPMGR_SIZE=0 --define=ICALL_MAX_NUM_ENTITIES=6 --define=ICALL_MAX_NUM_TASKS=3 --define=POWER_MEASURE --define=POWER_SAVING --define=USE_ICALL --define=xdc_runtime_Assert_DISABLE_ALL --define=xdc_runtime_Log_DISABLE_ALL --diag_suppress=48 --diag_wrap=off --diag_warning=225 --display_error_number --gen_func_subsections=on --abi=eabi --preproc_with_compile --preproc_dependency="Drivers/SPI/SPICC26XXDMA.d" --obj_directory="Drivers/SPI" --cmd_file="configPkg/compiler.opt" "C:/TI/dog/tirtos_cc13xx_cc26xx_2_21_00_06/products/tidrivers_cc13xx_cc26xx_2_21_00_04/packages/ti/drivers/spi/SPICC26XXDMA.c"
    'Finished building: C:/TI/dog/tirtos_cc13xx_cc26xx_2_21_00_06/products/tidrivers_cc13xx_cc26xx_2_21_00_04/packages/ti/drivers/spi/SPICC26XXDMA.c'
    ' '
    'Building file: C:/TI/dog/ble_sdk_2_02_01_18/src/components/icall/src/icall_cc2650.c'
    'Invoking: ARM Compiler'
    "C:/TI/bluetooth/ccsv6/tools/compiler/arm_15.12.3.LTS/bin/armcl" --cmd_file="C:/TI/dog/ble_sdk_2_02_01_18/examples/cc2650lp/simple_peripheral/ccs/app/../../iar/stack/../../../../../src/config/build_components.opt" --cmd_file="C:/TI/dog/ble_sdk_2_02_01_18/examples/cc2650lp/simple_peripheral/ccs/app/../../iar/stack/build_config.opt" --cmd_file="C:/TI/dog/ble_sdk_2_02_01_18/examples/cc2650lp/simple_peripheral/ccs/app/../../iar/stack/../../ccs/config/ccs_compiler_defines.bcfg" -mv7M3 --code_state=16 -me -O4 --opt_for_speed=0 --include_path="C:/TI/bluetooth/ccsv6/tools/compiler/arm_15.12.3.LTS/include" --include_path="C:/TI/dog/ble_sdk_2_02_01_18/src/examples/simple_peripheral/cc26xx/app" --include_path="C:/TI/dog/ble_sdk_2_02_01_18/src/inc" --include_path="C:/TI/dog/ble_sdk_2_02_01_18/src/icall/inc" --include_path="C:/TI/dog/ble_sdk_2_02_01_18/src/profiles/roles/cc26xx" --include_path="C:/TI/dog/ble_sdk_2_02_01_18/src/profiles/roles" --include_path="C:/TI/dog/ble_sdk_2_02_01_18/src/profiles/dev_info" --include_path="C:/TI/dog/ble_sdk_2_02_01_18/src/profiles/simple_profile/cc26xx" --include_path="C:/TI/dog/ble_sdk_2_02_01_18/src/profiles/simple_profile" --include_path="C:/TI/dog/ble_sdk_2_02_01_18/src/common/cc26xx" --include_path="C:/TI/dog/ble_sdk_2_02_01_18/src/components/heapmgr" --include_path="C:/TI/dog/ble_sdk_2_02_01_18/src/controller/cc26xx/inc" --include_path="C:/TI/dog/ble_sdk_2_02_01_18/src/components/hal/src/target/_common" --include_path="C:/TI/dog/ble_sdk_2_02_01_18/src/target" --include_path="C:/TI/dog/ble_sdk_2_02_01_18/src/components/hal/src/target/_common/cc26xx" --include_path="C:/TI/dog/ble_sdk_2_02_01_18/src/components/hal/src/inc" --include_path="C:/TI/dog/ble_sdk_2_02_01_18/src/components/osal/src/inc" --include_path="C:/TI/dog/ble_sdk_2_02_01_18/src/components/services/src/sdata" --include_path="C:/TI/dog/ble_sdk_2_02_01_18/src/components/services/src/saddr" --include_path="C:/TI/dog/ble_sdk_2_02_01_18/src/components/icall/src/inc" --include_path="C:/TI/dog/ble_sdk_2_02_01_18/src/inc" --include_path="C:/TI/dog/ble_sdk_2_02_01_18/src/rom" --include_path="C:/TI/dog/tirtos_cc13xx_cc26xx_2_21_00_06/products/cc26xxware_2_24_03_17272" -g --c99 --gcc --define=BOARD_DISPLAY_EXCLUDE_LCD --define=BOARD_DISPLAY_EXCLUDE_UART --define=CC2650_LAUNCHXL --define=CC26XX --define=Display_DISABLE_ALL --define=HEAPMGR_SIZE=0 --define=ICALL_MAX_NUM_ENTITIES=6 --define=ICALL_MAX_NUM_TASKS=3 --define=POWER_MEASURE --define=POWER_SAVING --define=USE_ICALL --define=xdc_runtime_Assert_DISABLE_ALL --define=xdc_runtime_Log_DISABLE_ALL --diag_suppress=48 --diag_wrap=off --diag_warning=225 --display_error_number --gen_func_subsections=on --abi=eabi --preproc_with_compile --preproc_dependency="ICall/icall_cc2650.d" --obj_directory="ICall" --cmd_file="configPkg/compiler.opt" "C:/TI/dog/ble_sdk_2_02_01_18/src/components/icall/src/icall_cc2650.c"
    'Finished building: C:/TI/dog/ble_sdk_2_02_01_18/src/components/icall/src/icall_cc2650.c'
    ' '
    'Building file: C:/TI/dog/ble_sdk_2_02_01_18/src/icall/app/ble_user_config.c'
    'Invoking: ARM Compiler'
    "C:/TI/bluetooth/ccsv6/tools/compiler/arm_15.12.3.LTS/bin/armcl" --cmd_file="C:/TI/dog/ble_sdk_2_02_01_18/examples/cc2650lp/simple_peripheral/ccs/app/../../iar/stack/../../../../../src/config/build_components.opt" --cmd_file="C:/TI/dog/ble_sdk_2_02_01_18/examples/cc2650lp/simple_peripheral/ccs/app/../../iar/stack/build_config.opt" --cmd_file="C:/TI/dog/ble_sdk_2_02_01_18/examples/cc2650lp/simple_peripheral/ccs/app/../../iar/stack/../../ccs/config/ccs_compiler_defines.bcfg" -mv7M3 --code_state=16 -me -O4 --opt_for_speed=0 --include_path="C:/TI/bluetooth/ccsv6/tools/compiler/arm_15.12.3.LTS/include" --include_path="C:/TI/dog/ble_sdk_2_02_01_18/src/examples/simple_peripheral/cc26xx/app" --include_path="C:/TI/dog/ble_sdk_2_02_01_18/src/inc" --include_path="C:/TI/dog/ble_sdk_2_02_01_18/src/icall/inc" --include_path="C:/TI/dog/ble_sdk_2_02_01_18/src/profiles/roles/cc26xx" --include_path="C:/TI/dog/ble_sdk_2_02_01_18/src/profiles/roles" --include_path="C:/TI/dog/ble_sdk_2_02_01_18/src/profiles/dev_info" --include_path="C:/TI/dog/ble_sdk_2_02_01_18/src/profiles/simple_profile/cc26xx" --include_path="C:/TI/dog/ble_sdk_2_02_01_18/src/profiles/simple_profile" --include_path="C:/TI/dog/ble_sdk_2_02_01_18/src/common/cc26xx" --include_path="C:/TI/dog/ble_sdk_2_02_01_18/src/components/heapmgr" --include_path="C:/TI/dog/ble_sdk_2_02_01_18/src/controller/cc26xx/inc" --include_path="C:/TI/dog/ble_sdk_2_02_01_18/src/components/hal/src/target/_common" --include_path="C:/TI/dog/ble_sdk_2_02_01_18/src/target" --include_path="C:/TI/dog/ble_sdk_2_02_01_18/src/components/hal/src/target/_common/cc26xx" --include_path="C:/TI/dog/ble_sdk_2_02_01_18/src/components/hal/src/inc" --include_path="C:/TI/dog/ble_sdk_2_02_01_18/src/components/osal/src/inc" --include_path="C:/TI/dog/ble_sdk_2_02_01_18/src/components/services/src/sdata" --include_path="C:/TI/dog/ble_sdk_2_02_01_18/src/components/services/src/saddr" --include_path="C:/TI/dog/ble_sdk_2_02_01_18/src/components/icall/src/inc" --include_path="C:/TI/dog/ble_sdk_2_02_01_18/src/inc" --include_path="C:/TI/dog/ble_sdk_2_02_01_18/src/rom" --include_path="C:/TI/dog/tirtos_cc13xx_cc26xx_2_21_00_06/products/cc26xxware_2_24_03_17272" -g --c99 --gcc --define=BOARD_DISPLAY_EXCLUDE_LCD --define=BOARD_DISPLAY_EXCLUDE_UART --define=CC2650_LAUNCHXL --define=CC26XX --define=Display_DISABLE_ALL --define=HEAPMGR_SIZE=0 --define=ICALL_MAX_NUM_ENTITIES=6 --define=ICALL_MAX_NUM_TASKS=3 --define=POWER_MEASURE --define=POWER_SAVING --define=USE_ICALL --define=xdc_runtime_Assert_DISABLE_ALL --define=xdc_runtime_Log_DISABLE_ALL --diag_suppress=48 --diag_wrap=off --diag_warning=225 --display_error_number --gen_func_subsections=on --abi=eabi --preproc_with_compile --preproc_dependency="ICallBLE/ble_user_config.d" --obj_directory="ICallBLE" --cmd_file="configPkg/compiler.opt" "C:/TI/dog/ble_sdk_2_02_01_18/src/icall/app/ble_user_config.c"
    'Finished building: C:/TI/dog/ble_sdk_2_02_01_18/src/icall/app/ble_user_config.c'
    ' '
    'Building file: C:/TI/dog/ble_sdk_2_02_01_18/src/components/icall/src/icall.c'
    'Invoking: ARM Compiler'
    "C:/TI/bluetooth/ccsv6/tools/compiler/arm_15.12.3.LTS/bin/armcl" --cmd_file="C:/TI/dog/ble_sdk_2_02_01_18/examples/cc2650lp/simple_peripheral/ccs/app/../../iar/stack/../../../../../src/config/build_components.opt" --cmd_file="C:/TI/dog/ble_sdk_2_02_01_18/examples/cc2650lp/simple_peripheral/ccs/app/../../iar/stack/build_config.opt" --cmd_file="C:/TI/dog/ble_sdk_2_02_01_18/examples/cc2650lp/simple_peripheral/ccs/app/../../iar/stack/../../ccs/config/ccs_compiler_defines.bcfg" -mv7M3 --code_state=16 -me -O4 --opt_for_speed=0 --include_path="C:/TI/bluetooth/ccsv6/tools/compiler/arm_15.12.3.LTS/include" --include_path="C:/TI/dog/ble_sdk_2_02_01_18/src/examples/simple_peripheral/cc26xx/app" --include_path="C:/TI/dog/ble_sdk_2_02_01_18/src/inc" --include_path="C:/TI/dog/ble_sdk_2_02_01_18/src/icall/inc" --include_path="C:/TI/dog/ble_sdk_2_02_01_18/src/profiles/roles/cc26xx" --include_path="C:/TI/dog/ble_sdk_2_02_01_18/src/profiles/roles" --include_path="C:/TI/dog/ble_sdk_2_02_01_18/src/profiles/dev_info" --include_path="C:/TI/dog/ble_sdk_2_02_01_18/src/profiles/simple_profile/cc26xx" --include_path="C:/TI/dog/ble_sdk_2_02_01_18/src/profiles/simple_profile" --include_path="C:/TI/dog/ble_sdk_2_02_01_18/src/common/cc26xx" --include_path="C:/TI/dog/ble_sdk_2_02_01_18/src/components/heapmgr" --include_path="C:/TI/dog/ble_sdk_2_02_01_18/src/controller/cc26xx/inc" --include_path="C:/TI/dog/ble_sdk_2_02_01_18/src/components/hal/src/target/_common" --include_path="C:/TI/dog/ble_sdk_2_02_01_18/src/target" --include_path="C:/TI/dog/ble_sdk_2_02_01_18/src/components/hal/src/target/_common/cc26xx" --include_path="C:/TI/dog/ble_sdk_2_02_01_18/src/components/hal/src/inc" --include_path="C:/TI/dog/ble_sdk_2_02_01_18/src/components/osal/src/inc" --include_path="C:/TI/dog/ble_sdk_2_02_01_18/src/components/services/src/sdata" --include_path="C:/TI/dog/ble_sdk_2_02_01_18/src/components/services/src/saddr" --include_path="C:/TI/dog/ble_sdk_2_02_01_18/src/components/icall/src/inc" --include_path="C:/TI/dog/ble_sdk_2_02_01_18/src/inc" --include_path="C:/TI/dog/ble_sdk_2_02_01_18/src/rom" --include_path="C:/TI/dog/tirtos_cc13xx_cc26xx_2_21_00_06/products/cc26xxware_2_24_03_17272" -g --c99 --gcc --define=BOARD_DISPLAY_EXCLUDE_LCD --define=BOARD_DISPLAY_EXCLUDE_UART --define=CC2650_LAUNCHXL --define=CC26XX --define=Display_DISABLE_ALL --define=HEAPMGR_SIZE=0 --define=ICALL_MAX_NUM_ENTITIES=6 --define=ICALL_MAX_NUM_TASKS=3 --define=POWER_MEASURE --define=POWER_SAVING --define=USE_ICALL --define=xdc_runtime_Assert_DISABLE_ALL --define=xdc_runtime_Log_DISABLE_ALL --diag_suppress=48 --diag_wrap=off --diag_warning=225 --display_error_number --gen_func_subsections=on --abi=eabi --preproc_with_compile --preproc_dependency="ICall/icall.d" --obj_directory="ICall" --cmd_file="configPkg/compiler.opt" "C:/TI/dog/ble_sdk_2_02_01_18/src/components/icall/src/icall.c"
    'Finished building: C:/TI/dog/ble_sdk_2_02_01_18/src/components/icall/src/icall.c'
    ' '
    'Building file: C:/TI/dog/tirtos_cc13xx_cc26xx_2_21_00_06/products/tidrivers_cc13xx_cc26xx_2_21_00_04/packages/ti/mw/extflash/ExtFlash.c'
    'Invoking: ARM Compiler'
    "C:/TI/bluetooth/ccsv6/tools/compiler/arm_15.12.3.LTS/bin/armcl" --cmd_file="C:/TI/dog/ble_sdk_2_02_01_18/examples/cc2650lp/simple_peripheral/ccs/app/../../iar/stack/../../../../../src/config/build_components.opt" --cmd_file="C:/TI/dog/ble_sdk_2_02_01_18/examples/cc2650lp/simple_peripheral/ccs/app/../../iar/stack/build_config.opt" --cmd_file="C:/TI/dog/ble_sdk_2_02_01_18/examples/cc2650lp/simple_peripheral/ccs/app/../../iar/stack/../../ccs/config/ccs_compiler_defines.bcfg" -mv7M3 --code_state=16 -me -O4 --opt_for_speed=0 --include_path="C:/TI/bluetooth/ccsv6/tools/compiler/arm_15.12.3.LTS/include" --include_path="C:/TI/dog/ble_sdk_2_02_01_18/src/examples/simple_peripheral/cc26xx/app" --include_path="C:/TI/dog/ble_sdk_2_02_01_18/src/inc" --include_path="C:/TI/dog/ble_sdk_2_02_01_18/src/icall/inc" --include_path="C:/TI/dog/ble_sdk_2_02_01_18/src/profiles/roles/cc26xx" --include_path="C:/TI/dog/ble_sdk_2_02_01_18/src/profiles/roles" --include_path="C:/TI/dog/ble_sdk_2_02_01_18/src/profiles/dev_info" --include_path="C:/TI/dog/ble_sdk_2_02_01_18/src/profiles/simple_profile/cc26xx" --include_path="C:/TI/dog/ble_sdk_2_02_01_18/src/profiles/simple_profile" --include_path="C:/TI/dog/ble_sdk_2_02_01_18/src/common/cc26xx" --include_path="C:/TI/dog/ble_sdk_2_02_01_18/src/components/heapmgr" --include_path="C:/TI/dog/ble_sdk_2_02_01_18/src/controller/cc26xx/inc" --include_path="C:/TI/dog/ble_sdk_2_02_01_18/src/components/hal/src/target/_common" --include_path="C:/TI/dog/ble_sdk_2_02_01_18/src/target" --include_path="C:/TI/dog/ble_sdk_2_02_01_18/src/components/hal/src/target/_common/cc26xx" --include_path="C:/TI/dog/ble_sdk_2_02_01_18/src/components/hal/src/inc" --include_path="C:/TI/dog/ble_sdk_2_02_01_18/src/components/osal/src/inc" --include_path="C:/TI/dog/ble_sdk_2_02_01_18/src/components/services/src/sdata" --include_path="C:/TI/dog/ble_sdk_2_02_01_18/src/components/services/src/saddr" --include_path="C:/TI/dog/ble_sdk_2_02_01_18/src/components/icall/src/inc" --include_path="C:/TI/dog/ble_sdk_2_02_01_18/src/inc" --include_path="C:/TI/dog/ble_sdk_2_02_01_18/src/rom" --include_path="C:/TI/dog/tirtos_cc13xx_cc26xx_2_21_00_06/products/cc26xxware_2_24_03_17272" -g --c99 --gcc --define=BOARD_DISPLAY_EXCLUDE_LCD --define=BOARD_DISPLAY_EXCLUDE_UART --define=CC2650_LAUNCHXL --define=CC26XX --define=Display_DISABLE_ALL --define=HEAPMGR_SIZE=0 --define=ICALL_MAX_NUM_ENTITIES=6 --define=ICALL_MAX_NUM_TASKS=3 --define=POWER_MEASURE --define=POWER_SAVING --define=USE_ICALL --define=xdc_runtime_Assert_DISABLE_ALL --define=xdc_runtime_Log_DISABLE_ALL --diag_suppress=48 --diag_wrap=off --diag_warning=225 --display_error_number --gen_func_subsections=on --abi=eabi --preproc_with_compile --preproc_dependency="Middleware/extflash/ExtFlash.d" --obj_directory="Middleware/extflash" --cmd_file="configPkg/compiler.opt" "C:/TI/dog/tirtos_cc13xx_cc26xx_2_21_00_06/products/tidrivers_cc13xx_cc26xx_2_21_00_04/packages/ti/mw/extflash/ExtFlash.c"
    'Finished building: C:/TI/dog/tirtos_cc13xx_cc26xx_2_21_00_06/products/tidrivers_cc13xx_cc26xx_2_21_00_04/packages/ti/mw/extflash/ExtFlash.c'
    ' '
    'Building file: C:/TI/dog/ble_sdk_2_02_01_18/src/profiles/dev_info/cc26xx/devinfoservice.c'
    'Invoking: ARM Compiler'
    "C:/TI/bluetooth/ccsv6/tools/compiler/arm_15.12.3.LTS/bin/armcl" --cmd_file="C:/TI/dog/ble_sdk_2_02_01_18/examples/cc2650lp/simple_peripheral/ccs/app/../../iar/stack/../../../../../src/config/build_components.opt" --cmd_file="C:/TI/dog/ble_sdk_2_02_01_18/examples/cc2650lp/simple_peripheral/ccs/app/../../iar/stack/build_config.opt" --cmd_file="C:/TI/dog/ble_sdk_2_02_01_18/examples/cc2650lp/simple_peripheral/ccs/app/../../iar/stack/../../ccs/config/ccs_compiler_defines.bcfg" -mv7M3 --code_state=16 -me -O4 --opt_for_speed=0 --include_path="C:/TI/bluetooth/ccsv6/tools/compiler/arm_15.12.3.LTS/include" --include_path="C:/TI/dog/ble_sdk_2_02_01_18/src/examples/simple_peripheral/cc26xx/app" --include_path="C:/TI/dog/ble_sdk_2_02_01_18/src/inc" --include_path="C:/TI/dog/ble_sdk_2_02_01_18/src/icall/inc" --include_path="C:/TI/dog/ble_sdk_2_02_01_18/src/profiles/roles/cc26xx" --include_path="C:/TI/dog/ble_sdk_2_02_01_18/src/profiles/roles" --include_path="C:/TI/dog/ble_sdk_2_02_01_18/src/profiles/dev_info" --include_path="C:/TI/dog/ble_sdk_2_02_01_18/src/profiles/simple_profile/cc26xx" --include_path="C:/TI/dog/ble_sdk_2_02_01_18/src/profiles/simple_profile" --include_path="C:/TI/dog/ble_sdk_2_02_01_18/src/common/cc26xx" --include_path="C:/TI/dog/ble_sdk_2_02_01_18/src/components/heapmgr" --include_path="C:/TI/dog/ble_sdk_2_02_01_18/src/controller/cc26xx/inc" --include_path="C:/TI/dog/ble_sdk_2_02_01_18/src/components/hal/src/target/_common" --include_path="C:/TI/dog/ble_sdk_2_02_01_18/src/target" --include_path="C:/TI/dog/ble_sdk_2_02_01_18/src/components/hal/src/target/_common/cc26xx" --include_path="C:/TI/dog/ble_sdk_2_02_01_18/src/components/hal/src/inc" --include_path="C:/TI/dog/ble_sdk_2_02_01_18/src/components/osal/src/inc" --include_path="C:/TI/dog/ble_sdk_2_02_01_18/src/components/services/src/sdata" --include_path="C:/TI/dog/ble_sdk_2_02_01_18/src/components/services/src/saddr" --include_path="C:/TI/dog/ble_sdk_2_02_01_18/src/components/icall/src/inc" --include_path="C:/TI/dog/ble_sdk_2_02_01_18/src/inc" --include_path="C:/TI/dog/ble_sdk_2_02_01_18/src/rom" --include_path="C:/TI/dog/tirtos_cc13xx_cc26xx_2_21_00_06/products/cc26xxware_2_24_03_17272" -g --c99 --gcc --define=BOARD_DISPLAY_EXCLUDE_LCD --define=BOARD_DISPLAY_EXCLUDE_UART --define=CC2650_LAUNCHXL --define=CC26XX --define=Display_DISABLE_ALL --define=HEAPMGR_SIZE=0 --define=ICALL_MAX_NUM_ENTITIES=6 --define=ICALL_MAX_NUM_TASKS=3 --define=POWER_MEASURE --define=POWER_SAVING --define=USE_ICALL --define=xdc_runtime_Assert_DISABLE_ALL --define=xdc_runtime_Log_DISABLE_ALL --diag_suppress=48 --diag_wrap=off --diag_warning=225 --display_error_number --gen_func_subsections=on --abi=eabi --preproc_with_compile --preproc_dependency="PROFILES/devinfoservice.d" --obj_directory="PROFILES" --cmd_file="configPkg/compiler.opt" "C:/TI/dog/ble_sdk_2_02_01_18/src/profiles/dev_info/cc26xx/devinfoservice.c"
    'Finished building: C:/TI/dog/ble_sdk_2_02_01_18/src/profiles/dev_info/cc26xx/devinfoservice.c'
    ' '
    'Building file: C:/TI/dog/ble_sdk_2_02_01_18/src/host/gatt_uuid.c'
    'Invoking: ARM Compiler'
    "C:/TI/bluetooth/ccsv6/tools/compiler/arm_15.12.3.LTS/bin/armcl" --cmd_file="C:/TI/dog/ble_sdk_2_02_01_18/examples/cc2650lp/simple_peripheral/ccs/app/../../iar/stack/../../../../../src/config/build_components.opt" --cmd_file="C:/TI/dog/ble_sdk_2_02_01_18/examples/cc2650lp/simple_peripheral/ccs/app/../../iar/stack/build_config.opt" --cmd_file="C:/TI/dog/ble_sdk_2_02_01_18/examples/cc2650lp/simple_peripheral/ccs/app/../../iar/stack/../../ccs/config/ccs_compiler_defines.bcfg" -mv7M3 --code_state=16 -me -O4 --opt_for_speed=0 --include_path="C:/TI/bluetooth/ccsv6/tools/compiler/arm_15.12.3.LTS/include" --include_path="C:/TI/dog/ble_sdk_2_02_01_18/src/examples/simple_peripheral/cc26xx/app" --include_path="C:/TI/dog/ble_sdk_2_02_01_18/src/inc" --include_path="C:/TI/dog/ble_sdk_2_02_01_18/src/icall/inc" --include_path="C:/TI/dog/ble_sdk_2_02_01_18/src/profiles/roles/cc26xx" --include_path="C:/TI/dog/ble_sdk_2_02_01_18/src/profiles/roles" --include_path="C:/TI/dog/ble_sdk_2_02_01_18/src/profiles/dev_info" --include_path="C:/TI/dog/ble_sdk_2_02_01_18/src/profiles/simple_profile/cc26xx" --include_path="C:/TI/dog/ble_sdk_2_02_01_18/src/profiles/simple_profile" --include_path="C:/TI/dog/ble_sdk_2_02_01_18/src/common/cc26xx" --include_path="C:/TI/dog/ble_sdk_2_02_01_18/src/components/heapmgr" --include_path="C:/TI/dog/ble_sdk_2_02_01_18/src/controller/cc26xx/inc" --include_path="C:/TI/dog/ble_sdk_2_02_01_18/src/components/hal/src/target/_common" --include_path="C:/TI/dog/ble_sdk_2_02_01_18/src/target" --include_path="C:/TI/dog/ble_sdk_2_02_01_18/src/components/hal/src/target/_common/cc26xx" --include_path="C:/TI/dog/ble_sdk_2_02_01_18/src/components/hal/src/inc" --include_path="C:/TI/dog/ble_sdk_2_02_01_18/src/components/osal/src/inc" --include_path="C:/TI/dog/ble_sdk_2_02_01_18/src/components/services/src/sdata" --include_path="C:/TI/dog/ble_sdk_2_02_01_18/src/components/services/src/saddr" --include_path="C:/TI/dog/ble_sdk_2_02_01_18/src/components/icall/src/inc" --include_path="C:/TI/dog/ble_sdk_2_02_01_18/src/inc" --include_path="C:/TI/dog/ble_sdk_2_02_01_18/src/rom" --include_path="C:/TI/dog/tirtos_cc13xx_cc26xx_2_21_00_06/products/cc26xxware_2_24_03_17272" -g --c99 --gcc --define=BOARD_DISPLAY_EXCLUDE_LCD --define=BOARD_DISPLAY_EXCLUDE_UART --define=CC2650_LAUNCHXL --define=CC26XX --define=Display_DISABLE_ALL --define=HEAPMGR_SIZE=0 --define=ICALL_MAX_NUM_ENTITIES=6 --define=ICALL_MAX_NUM_TASKS=3 --define=POWER_MEASURE --define=POWER_SAVING --define=USE_ICALL --define=xdc_runtime_Assert_DISABLE_ALL --define=xdc_runtime_Log_DISABLE_ALL --diag_suppress=48 --diag_wrap=off --diag_warning=225 --display_error_number --gen_func_subsections=on --abi=eabi --preproc_with_compile --preproc_dependency="PROFILES/gatt_uuid.d" --obj_directory="PROFILES" --cmd_file="configPkg/compiler.opt" "C:/TI/dog/ble_sdk_2_02_01_18/src/host/gatt_uuid.c"
    'Finished building: C:/TI/dog/ble_sdk_2_02_01_18/src/host/gatt_uuid.c'
    ' '
    'Building file: C:/TI/dog/ble_sdk_2_02_01_18/src/host/gattservapp_util.c'
    'Invoking: ARM Compiler'
    "C:/TI/bluetooth/ccsv6/tools/compiler/arm_15.12.3.LTS/bin/armcl" --cmd_file="C:/TI/dog/ble_sdk_2_02_01_18/examples/cc2650lp/simple_peripheral/ccs/app/../../iar/stack/../../../../../src/config/build_components.opt" --cmd_file="C:/TI/dog/ble_sdk_2_02_01_18/examples/cc2650lp/simple_peripheral/ccs/app/../../iar/stack/build_config.opt" --cmd_file="C:/TI/dog/ble_sdk_2_02_01_18/examples/cc2650lp/simple_peripheral/ccs/app/../../iar/stack/../../ccs/config/ccs_compiler_defines.bcfg" -mv7M3 --code_state=16 -me -O4 --opt_for_speed=0 --include_path="C:/TI/bluetooth/ccsv6/tools/compiler/arm_15.12.3.LTS/include" --include_path="C:/TI/dog/ble_sdk_2_02_01_18/src/examples/simple_peripheral/cc26xx/app" --include_path="C:/TI/dog/ble_sdk_2_02_01_18/src/inc" --include_path="C:/TI/dog/ble_sdk_2_02_01_18/src/icall/inc" --include_path="C:/TI/dog/ble_sdk_2_02_01_18/src/profiles/roles/cc26xx" --include_path="C:/TI/dog/ble_sdk_2_02_01_18/src/profiles/roles" --include_path="C:/TI/dog/ble_sdk_2_02_01_18/src/profiles/dev_info" --include_path="C:/TI/dog/ble_sdk_2_02_01_18/src/profiles/simple_profile/cc26xx" --include_path="C:/TI/dog/ble_sdk_2_02_01_18/src/profiles/simple_profile" --include_path="C:/TI/dog/ble_sdk_2_02_01_18/src/common/cc26xx" --include_path="C:/TI/dog/ble_sdk_2_02_01_18/src/components/heapmgr" --include_path="C:/TI/dog/ble_sdk_2_02_01_18/src/controller/cc26xx/inc" --include_path="C:/TI/dog/ble_sdk_2_02_01_18/src/components/hal/src/target/_common" --include_path="C:/TI/dog/ble_sdk_2_02_01_18/src/target" --include_path="C:/TI/dog/ble_sdk_2_02_01_18/src/components/hal/src/target/_common/cc26xx" --include_path="C:/TI/dog/ble_sdk_2_02_01_18/src/components/hal/src/inc" --include_path="C:/TI/dog/ble_sdk_2_02_01_18/src/components/osal/src/inc" --include_path="C:/TI/dog/ble_sdk_2_02_01_18/src/components/services/src/sdata" --include_path="C:/TI/dog/ble_sdk_2_02_01_18/src/components/services/src/saddr" --include_path="C:/TI/dog/ble_sdk_2_02_01_18/src/components/icall/src/inc" --include_path="C:/TI/dog/ble_sdk_2_02_01_18/src/inc" --include_path="C:/TI/dog/ble_sdk_2_02_01_18/src/rom" --include_path="C:/TI/dog/tirtos_cc13xx_cc26xx_2_21_00_06/products/cc26xxware_2_24_03_17272" -g --c99 --gcc --define=BOARD_DISPLAY_EXCLUDE_LCD --define=BOARD_DISPLAY_EXCLUDE_UART --define=CC2650_LAUNCHXL --define=CC26XX --define=Display_DISABLE_ALL --define=HEAPMGR_SIZE=0 --define=ICALL_MAX_NUM_ENTITIES=6 --define=ICALL_MAX_NUM_TASKS=3 --define=POWER_MEASURE --define=POWER_SAVING --define=USE_ICALL --define=xdc_runtime_Assert_DISABLE_ALL --define=xdc_runtime_Log_DISABLE_ALL --diag_suppress=48 --diag_wrap=off --diag_warning=225 --display_error_number --gen_func_subsections=on --abi=eabi --preproc_with_compile --preproc_dependency="PROFILES/gattservapp_util.d" --obj_directory="PROFILES" --cmd_file="configPkg/compiler.opt" "C:/TI/dog/ble_sdk_2_02_01_18/src/host/gattservapp_util.c"
    'Finished building: C:/TI/dog/ble_sdk_2_02_01_18/src/host/gattservapp_util.c'
    ' '
    'Building file: C:/TI/dog/ble_sdk_2_02_01_18/src/target/board.c'
    'Invoking: ARM Compiler'
    "C:/TI/bluetooth/ccsv6/tools/compiler/arm_15.12.3.LTS/bin/armcl" --cmd_file="C:/TI/dog/ble_sdk_2_02_01_18/examples/cc2650lp/simple_peripheral/ccs/app/../../iar/stack/../../../../../src/config/build_components.opt" --cmd_file="C:/TI/dog/ble_sdk_2_02_01_18/examples/cc2650lp/simple_peripheral/ccs/app/../../iar/stack/build_config.opt" --cmd_file="C:/TI/dog/ble_sdk_2_02_01_18/examples/cc2650lp/simple_peripheral/ccs/app/../../iar/stack/../../ccs/config/ccs_compiler_defines.bcfg" -mv7M3 --code_state=16 -me -O4 --opt_for_speed=0 --include_path="C:/TI/bluetooth/ccsv6/tools/compiler/arm_15.12.3.LTS/include" --include_path="C:/TI/dog/ble_sdk_2_02_01_18/src/examples/simple_peripheral/cc26xx/app" --include_path="C:/TI/dog/ble_sdk_2_02_01_18/src/inc" --include_path="C:/TI/dog/ble_sdk_2_02_01_18/src/icall/inc" --include_path="C:/TI/dog/ble_sdk_2_02_01_18/src/profiles/roles/cc26xx" --include_path="C:/TI/dog/ble_sdk_2_02_01_18/src/profiles/roles" --include_path="C:/TI/dog/ble_sdk_2_02_01_18/src/profiles/dev_info" --include_path="C:/TI/dog/ble_sdk_2_02_01_18/src/profiles/simple_profile/cc26xx" --include_path="C:/TI/dog/ble_sdk_2_02_01_18/src/profiles/simple_profile" --include_path="C:/TI/dog/ble_sdk_2_02_01_18/src/common/cc26xx" --include_path="C:/TI/dog/ble_sdk_2_02_01_18/src/components/heapmgr" --include_path="C:/TI/dog/ble_sdk_2_02_01_18/src/controller/cc26xx/inc" --include_path="C:/TI/dog/ble_sdk_2_02_01_18/src/components/hal/src/target/_common" --include_path="C:/TI/dog/ble_sdk_2_02_01_18/src/target" --include_path="C:/TI/dog/ble_sdk_2_02_01_18/src/components/hal/src/target/_common/cc26xx" --include_path="C:/TI/dog/ble_sdk_2_02_01_18/src/components/hal/src/inc" --include_path="C:/TI/dog/ble_sdk_2_02_01_18/src/components/osal/src/inc" --include_path="C:/TI/dog/ble_sdk_2_02_01_18/src/components/services/src/sdata" --include_path="C:/TI/dog/ble_sdk_2_02_01_18/src/components/services/src/saddr" --include_path="C:/TI/dog/ble_sdk_2_02_01_18/src/components/icall/src/inc" --include_path="C:/TI/dog/ble_sdk_2_02_01_18/src/inc" --include_path="C:/TI/dog/ble_sdk_2_02_01_18/src/rom" --include_path="C:/TI/dog/tirtos_cc13xx_cc26xx_2_21_00_06/products/cc26xxware_2_24_03_17272" -g --c99 --gcc --define=BOARD_DISPLAY_EXCLUDE_LCD --define=BOARD_DISPLAY_EXCLUDE_UART --define=CC2650_LAUNCHXL --define=CC26XX --define=Display_DISABLE_ALL --define=HEAPMGR_SIZE=0 --define=ICALL_MAX_NUM_ENTITIES=6 --define=ICALL_MAX_NUM_TASKS=3 --define=POWER_MEASURE --define=POWER_SAVING --define=USE_ICALL --define=xdc_runtime_Assert_DISABLE_ALL --define=xdc_runtime_Log_DISABLE_ALL --diag_suppress=48 --diag_wrap=off --diag_warning=225 --display_error_number --gen_func_subsections=on --abi=eabi --preproc_with_compile --preproc_dependency="Startup/board.d" --obj_directory="Startup" --cmd_file="configPkg/compiler.opt" "C:/TI/dog/ble_sdk_2_02_01_18/src/target/board.c"

    >> Compilation failure
    Startup/subdir_rules.mk:7: recipe for target 'Startup/board.obj' failed
    "C:/TI/dog/ble_sdk_2_02_01_18/src/icall/inc/../../boards/CC2650_LAUNCHXL/CC2650_LAUNCHXL.c", line 450: error #20: identifier "GPTimerCC26XX_HWAttrs" is undefined
    "C:/TI/dog/ble_sdk_2_02_01_18/src/icall/inc/../../boards/CC2650_LAUNCHXL/CC2650_LAUNCHXL.c", line 451: error #20: identifier "GPT_PIN_0A" is undefined
    "C:/TI/dog/ble_sdk_2_02_01_18/src/icall/inc/../../boards/CC2650_LAUNCHXL/CC2650_LAUNCHXL.c", line 452: error #20: identifier "GPT_PIN_0B" is undefined
    "C:/TI/dog/ble_sdk_2_02_01_18/src/icall/inc/../../boards/CC2650_LAUNCHXL/CC2650_LAUNCHXL.c", line 453: error #20: identifier "GPT_PIN_1A" is undefined
    "C:/TI/dog/ble_sdk_2_02_01_18/src/icall/inc/../../boards/CC2650_LAUNCHXL/CC2650_LAUNCHXL.c", line 454: error #20: identifier "GPT_PIN_1B" is undefined
    "C:/TI/dog/ble_sdk_2_02_01_18/src/icall/inc/../../boards/CC2650_LAUNCHXL/CC2650_LAUNCHXL.c", line 455: error #20: identifier "GPT_PIN_2A" is undefined
    "C:/TI/dog/ble_sdk_2_02_01_18/src/icall/inc/../../boards/CC2650_LAUNCHXL/CC2650_LAUNCHXL.c", line 456: error #20: identifier "GPT_PIN_2B" is undefined
    "C:/TI/dog/ble_sdk_2_02_01_18/src/icall/inc/../../boards/CC2650_LAUNCHXL/CC2650_LAUNCHXL.c", line 457: error #20: identifier "GPT_PIN_3A" is undefined
    "C:/TI/dog/ble_sdk_2_02_01_18/src/icall/inc/../../boards/CC2650_LAUNCHXL/CC2650_LAUNCHXL.c", line 458: error #20: identifier "GPT_PIN_3B" is undefined
    "C:/TI/dog/ble_sdk_2_02_01_18/src/icall/inc/../../boards/CC2650_LAUNCHXL/CC2650_LAUNCHXL.c", line 462: error #20: identifier "GPTimerCC26XX_Object" is undefined
    "C:/TI/dog/ble_sdk_2_02_01_18/src/icall/inc/../../boards/CC2650_LAUNCHXL/CC2650_LAUNCHXL.c", line 465: error #20: identifier "GPTimerCC26XX_Config" is undefined
    "C:/TI/dog/ble_sdk_2_02_01_18/src/icall/inc/../../boards/CC2650_LAUNCHXL/CC2650_LAUNCHXL.c", line 466: error #20: identifier "GPT_A" is undefined
    "C:/TI/dog/ble_sdk_2_02_01_18/src/icall/inc/../../boards/CC2650_LAUNCHXL/CC2650_LAUNCHXL.c", line 467: error #20: identifier "GPT_B" is undefined
    "C:/TI/dog/ble_sdk_2_02_01_18/src/icall/inc/../../boards/CC2650_LAUNCHXL/CC2650_LAUNCHXL.c", line 493: error #20: identifier "PWMTimerCC26XX_HwAttrs" is undefined
    "C:/TI/dog/ble_sdk_2_02_01_18/src/icall/inc/../../boards/CC2650_LAUNCHXL/CC2650_LAUNCHXL.c", line 538: fatal error #1965: cannot open source file "ti/drivers/ADCBuf.h"
    14 errors and 1 catastrophic error detected in the compilation of "C:/TI/dog/ble_sdk_2_02_01_18/src/target/board.c".
    Compilation terminated.
    gmake: *** [Startup/board.obj] Error 1
    'Building file: C:/TI/dog/ble_sdk_2_02_01_18/src/profiles/simple_profile/cc26xx/simple_gatt_profile.c'
    'Invoking: ARM Compiler'
    "C:/TI/bluetooth/ccsv6/tools/compiler/arm_15.12.3.LTS/bin/armcl" --cmd_file="C:/TI/dog/ble_sdk_2_02_01_18/examples/cc2650lp/simple_peripheral/ccs/app/../../iar/stack/../../../../../src/config/build_components.opt" --cmd_file="C:/TI/dog/ble_sdk_2_02_01_18/examples/cc2650lp/simple_peripheral/ccs/app/../../iar/stack/build_config.opt" --cmd_file="C:/TI/dog/ble_sdk_2_02_01_18/examples/cc2650lp/simple_peripheral/ccs/app/../../iar/stack/../../ccs/config/ccs_compiler_defines.bcfg" -mv7M3 --code_state=16 -me -O4 --opt_for_speed=0 --include_path="C:/TI/bluetooth/ccsv6/tools/compiler/arm_15.12.3.LTS/include" --include_path="C:/TI/dog/ble_sdk_2_02_01_18/src/examples/simple_peripheral/cc26xx/app" --include_path="C:/TI/dog/ble_sdk_2_02_01_18/src/inc" --include_path="C:/TI/dog/ble_sdk_2_02_01_18/src/icall/inc" --include_path="C:/TI/dog/ble_sdk_2_02_01_18/src/profiles/roles/cc26xx" --include_path="C:/TI/dog/ble_sdk_2_02_01_18/src/profiles/roles" --include_path="C:/TI/dog/ble_sdk_2_02_01_18/src/profiles/dev_info" --include_path="C:/TI/dog/ble_sdk_2_02_01_18/src/profiles/simple_profile/cc26xx" --include_path="C:/TI/dog/ble_sdk_2_02_01_18/src/profiles/simple_profile" --include_path="C:/TI/dog/ble_sdk_2_02_01_18/src/common/cc26xx" --include_path="C:/TI/dog/ble_sdk_2_02_01_18/src/components/heapmgr" --include_path="C:/TI/dog/ble_sdk_2_02_01_18/src/controller/cc26xx/inc" --include_path="C:/TI/dog/ble_sdk_2_02_01_18/src/components/hal/src/target/_common" --include_path="C:/TI/dog/ble_sdk_2_02_01_18/src/target" --include_path="C:/TI/dog/ble_sdk_2_02_01_18/src/components/hal/src/target/_common/cc26xx" --include_path="C:/TI/dog/ble_sdk_2_02_01_18/src/components/hal/src/inc" --include_path="C:/TI/dog/ble_sdk_2_02_01_18/src/components/osal/src/inc" --include_path="C:/TI/dog/ble_sdk_2_02_01_18/src/components/services/src/sdata" --include_path="C:/TI/dog/ble_sdk_2_02_01_18/src/components/services/src/saddr" --include_path="C:/TI/dog/ble_sdk_2_02_01_18/src/components/icall/src/inc" --include_path="C:/TI/dog/ble_sdk_2_02_01_18/src/inc" --include_path="C:/TI/dog/ble_sdk_2_02_01_18/src/rom" --include_path="C:/TI/dog/tirtos_cc13xx_cc26xx_2_21_00_06/products/cc26xxware_2_24_03_17272" -g --c99 --gcc --define=BOARD_DISPLAY_EXCLUDE_LCD --define=BOARD_DISPLAY_EXCLUDE_UART --define=CC2650_LAUNCHXL --define=CC26XX --define=Display_DISABLE_ALL --define=HEAPMGR_SIZE=0 --define=ICALL_MAX_NUM_ENTITIES=6 --define=ICALL_MAX_NUM_TASKS=3 --define=POWER_MEASURE --define=POWER_SAVING --define=USE_ICALL --define=xdc_runtime_Assert_DISABLE_ALL --define=xdc_runtime_Log_DISABLE_ALL --diag_suppress=48 --diag_wrap=off --diag_warning=225 --display_error_number --gen_func_subsections=on --abi=eabi --preproc_with_compile --preproc_dependency="PROFILES/simple_gatt_profile.d" --obj_directory="PROFILES" --cmd_file="configPkg/compiler.opt" "C:/TI/dog/ble_sdk_2_02_01_18/src/profiles/simple_profile/cc26xx/simple_gatt_profile.c"
    'Finished building: C:/TI/dog/ble_sdk_2_02_01_18/src/profiles/simple_profile/cc26xx/simple_gatt_profile.c'
    ' '
    'Building file: C:/TI/dog/ble_sdk_2_02_01_18/examples/cc2650lp/simple_peripheral/iar/config/ccfg_app_ble.c'
    'Invoking: ARM Compiler'
    "C:/TI/bluetooth/ccsv6/tools/compiler/arm_15.12.3.LTS/bin/armcl" --cmd_file="C:/TI/dog/ble_sdk_2_02_01_18/examples/cc2650lp/simple_peripheral/ccs/app/../../iar/stack/../../../../../src/config/build_components.opt" --cmd_file="C:/TI/dog/ble_sdk_2_02_01_18/examples/cc2650lp/simple_peripheral/ccs/app/../../iar/stack/build_config.opt" --cmd_file="C:/TI/dog/ble_sdk_2_02_01_18/examples/cc2650lp/simple_peripheral/ccs/app/../../iar/stack/../../ccs/config/ccs_compiler_defines.bcfg" -mv7M3 --code_state=16 -me -O4 --opt_for_speed=0 --include_path="C:/TI/bluetooth/ccsv6/tools/compiler/arm_15.12.3.LTS/include" --include_path="C:/TI/dog/ble_sdk_2_02_01_18/src/examples/simple_peripheral/cc26xx/app" --include_path="C:/TI/dog/ble_sdk_2_02_01_18/src/inc" --include_path="C:/TI/dog/ble_sdk_2_02_01_18/src/icall/inc" --include_path="C:/TI/dog/ble_sdk_2_02_01_18/src/profiles/roles/cc26xx" --include_path="C:/TI/dog/ble_sdk_2_02_01_18/src/profiles/roles" --include_path="C:/TI/dog/ble_sdk_2_02_01_18/src/profiles/dev_info" --include_path="C:/TI/dog/ble_sdk_2_02_01_18/src/profiles/simple_profile/cc26xx" --include_path="C:/TI/dog/ble_sdk_2_02_01_18/src/profiles/simple_profile" --include_path="C:/TI/dog/ble_sdk_2_02_01_18/src/common/cc26xx" --include_path="C:/TI/dog/ble_sdk_2_02_01_18/src/components/heapmgr" --include_path="C:/TI/dog/ble_sdk_2_02_01_18/src/controller/cc26xx/inc" --include_path="C:/TI/dog/ble_sdk_2_02_01_18/src/components/hal/src/target/_common" --include_path="C:/TI/dog/ble_sdk_2_02_01_18/src/target" --include_path="C:/TI/dog/ble_sdk_2_02_01_18/src/components/hal/src/target/_common/cc26xx" --include_path="C:/TI/dog/ble_sdk_2_02_01_18/src/components/hal/src/inc" --include_path="C:/TI/dog/ble_sdk_2_02_01_18/src/components/osal/src/inc" --include_path="C:/TI/dog/ble_sdk_2_02_01_18/src/components/services/src/sdata" --include_path="C:/TI/dog/ble_sdk_2_02_01_18/src/components/services/src/saddr" --include_path="C:/TI/dog/ble_sdk_2_02_01_18/src/components/icall/src/inc" --include_path="C:/TI/dog/ble_sdk_2_02_01_18/src/inc" --include_path="C:/TI/dog/ble_sdk_2_02_01_18/src/rom" --include_path="C:/TI/dog/tirtos_cc13xx_cc26xx_2_21_00_06/products/cc26xxware_2_24_03_17272" -g --c99 --gcc --define=BOARD_DISPLAY_EXCLUDE_LCD --define=BOARD_DISPLAY_EXCLUDE_UART --define=CC2650_LAUNCHXL --define=CC26XX --define=Display_DISABLE_ALL --define=HEAPMGR_SIZE=0 --define=ICALL_MAX_NUM_ENTITIES=6 --define=ICALL_MAX_NUM_TASKS=3 --define=POWER_MEASURE --define=POWER_SAVING --define=USE_ICALL --define=xdc_runtime_Assert_DISABLE_ALL --define=xdc_runtime_Log_DISABLE_ALL --diag_suppress=48 --diag_wrap=off --diag_warning=225 --display_error_number --gen_func_subsections=on --abi=eabi --preproc_with_compile --preproc_dependency="Startup/ccfg_app_ble.d" --obj_directory="Startup" --cmd_file="configPkg/compiler.opt" "C:/TI/dog/ble_sdk_2_02_01_18/examples/cc2650lp/simple_peripheral/iar/config/ccfg_app_ble.c"
    'Finished building: C:/TI/dog/ble_sdk_2_02_01_18/examples/cc2650lp/simple_peripheral/iar/config/ccfg_app_ble.c'
    ' '
    'Building file: C:/TI/dog/ble_sdk_2_02_01_18/src/examples/simple_peripheral/cc26xx/app/main.c'
    'Invoking: ARM Compiler'
    "C:/TI/bluetooth/ccsv6/tools/compiler/arm_15.12.3.LTS/bin/armcl" --cmd_file="C:/TI/dog/ble_sdk_2_02_01_18/examples/cc2650lp/simple_peripheral/ccs/app/../../iar/stack/../../../../../src/config/build_components.opt" --cmd_file="C:/TI/dog/ble_sdk_2_02_01_18/examples/cc2650lp/simple_peripheral/ccs/app/../../iar/stack/build_config.opt" --cmd_file="C:/TI/dog/ble_sdk_2_02_01_18/examples/cc2650lp/simple_peripheral/ccs/app/../../iar/stack/../../ccs/config/ccs_compiler_defines.bcfg" -mv7M3 --code_state=16 -me -O4 --opt_for_speed=0 --include_path="C:/TI/bluetooth/ccsv6/tools/compiler/arm_15.12.3.LTS/include" --include_path="C:/TI/dog/ble_sdk_2_02_01_18/src/examples/simple_peripheral/cc26xx/app" --include_path="C:/TI/dog/ble_sdk_2_02_01_18/src/inc" --include_path="C:/TI/dog/ble_sdk_2_02_01_18/src/icall/inc" --include_path="C:/TI/dog/ble_sdk_2_02_01_18/src/profiles/roles/cc26xx" --include_path="C:/TI/dog/ble_sdk_2_02_01_18/src/profiles/roles" --include_path="C:/TI/dog/ble_sdk_2_02_01_18/src/profiles/dev_info" --include_path="C:/TI/dog/ble_sdk_2_02_01_18/src/profiles/simple_profile/cc26xx" --include_path="C:/TI/dog/ble_sdk_2_02_01_18/src/profiles/simple_profile" --include_path="C:/TI/dog/ble_sdk_2_02_01_18/src/common/cc26xx" --include_path="C:/TI/dog/ble_sdk_2_02_01_18/src/components/heapmgr" --include_path="C:/TI/dog/ble_sdk_2_02_01_18/src/controller/cc26xx/inc" --include_path="C:/TI/dog/ble_sdk_2_02_01_18/src/components/hal/src/target/_common" --include_path="C:/TI/dog/ble_sdk_2_02_01_18/src/target" --include_path="C:/TI/dog/ble_sdk_2_02_01_18/src/components/hal/src/target/_common/cc26xx" --include_path="C:/TI/dog/ble_sdk_2_02_01_18/src/components/hal/src/inc" --include_path="C:/TI/dog/ble_sdk_2_02_01_18/src/components/osal/src/inc" --include_path="C:/TI/dog/ble_sdk_2_02_01_18/src/components/services/src/sdata" --include_path="C:/TI/dog/ble_sdk_2_02_01_18/src/components/services/src/saddr" --include_path="C:/TI/dog/ble_sdk_2_02_01_18/src/components/icall/src/inc" --include_path="C:/TI/dog/ble_sdk_2_02_01_18/src/inc" --include_path="C:/TI/dog/ble_sdk_2_02_01_18/src/rom" --include_path="C:/TI/dog/tirtos_cc13xx_cc26xx_2_21_00_06/products/cc26xxware_2_24_03_17272" -g --c99 --gcc --define=BOARD_DISPLAY_EXCLUDE_LCD --define=BOARD_DISPLAY_EXCLUDE_UART --define=CC2650_LAUNCHXL --define=CC26XX --define=Display_DISABLE_ALL --define=HEAPMGR_SIZE=0 --define=ICALL_MAX_NUM_ENTITIES=6 --define=ICALL_MAX_NUM_TASKS=3 --define=POWER_MEASURE --define=POWER_SAVING --define=USE_ICALL --define=xdc_runtime_Assert_DISABLE_ALL --define=xdc_runtime_Log_DISABLE_ALL --diag_suppress=48 --diag_wrap=off --diag_warning=225 --display_error_number --gen_func_subsections=on --abi=eabi --preproc_with_compile --preproc_dependency="Startup/main.d" --obj_directory="Startup" --cmd_file="configPkg/compiler.opt" "C:/TI/dog/ble_sdk_2_02_01_18/src/examples/simple_peripheral/cc26xx/app/main.c"
    'Finished building: C:/TI/dog/ble_sdk_2_02_01_18/src/examples/simple_peripheral/cc26xx/app/main.c'
    ' '
    'Building file: C:/TI/dog/ble_sdk_2_02_01_18/src/profiles/roles/cc26xx/peripheral.c'
    'Invoking: ARM Compiler'
    "C:/TI/bluetooth/ccsv6/tools/compiler/arm_15.12.3.LTS/bin/armcl" --cmd_file="C:/TI/dog/ble_sdk_2_02_01_18/examples/cc2650lp/simple_peripheral/ccs/app/../../iar/stack/../../../../../src/config/build_components.opt" --cmd_file="C:/TI/dog/ble_sdk_2_02_01_18/examples/cc2650lp/simple_peripheral/ccs/app/../../iar/stack/build_config.opt" --cmd_file="C:/TI/dog/ble_sdk_2_02_01_18/examples/cc2650lp/simple_peripheral/ccs/app/../../iar/stack/../../ccs/config/ccs_compiler_defines.bcfg" -mv7M3 --code_state=16 -me -O4 --opt_for_speed=0 --include_path="C:/TI/bluetooth/ccsv6/tools/compiler/arm_15.12.3.LTS/include" --include_path="C:/TI/dog/ble_sdk_2_02_01_18/src/examples/simple_peripheral/cc26xx/app" --include_path="C:/TI/dog/ble_sdk_2_02_01_18/src/inc" --include_path="C:/TI/dog/ble_sdk_2_02_01_18/src/icall/inc" --include_path="C:/TI/dog/ble_sdk_2_02_01_18/src/profiles/roles/cc26xx" --include_path="C:/TI/dog/ble_sdk_2_02_01_18/src/profiles/roles" --include_path="C:/TI/dog/ble_sdk_2_02_01_18/src/profiles/dev_info" --include_path="C:/TI/dog/ble_sdk_2_02_01_18/src/profiles/simple_profile/cc26xx" --include_path="C:/TI/dog/ble_sdk_2_02_01_18/src/profiles/simple_profile" --include_path="C:/TI/dog/ble_sdk_2_02_01_18/src/common/cc26xx" --include_path="C:/TI/dog/ble_sdk_2_02_01_18/src/components/heapmgr" --include_path="C:/TI/dog/ble_sdk_2_02_01_18/src/controller/cc26xx/inc" --include_path="C:/TI/dog/ble_sdk_2_02_01_18/src/components/hal/src/target/_common" --include_path="C:/TI/dog/ble_sdk_2_02_01_18/src/target" --include_path="C:/TI/dog/ble_sdk_2_02_01_18/src/components/hal/src/target/_common/cc26xx" --include_path="C:/TI/dog/ble_sdk_2_02_01_18/src/components/hal/src/inc" --include_path="C:/TI/dog/ble_sdk_2_02_01_18/src/components/osal/src/inc" --include_path="C:/TI/dog/ble_sdk_2_02_01_18/src/components/services/src/sdata" --include_path="C:/TI/dog/ble_sdk_2_02_01_18/src/components/services/src/saddr" --include_path="C:/TI/dog/ble_sdk_2_02_01_18/src/components/icall/src/inc" --include_path="C:/TI/dog/ble_sdk_2_02_01_18/src/inc" --include_path="C:/TI/dog/ble_sdk_2_02_01_18/src/rom" --include_path="C:/TI/dog/tirtos_cc13xx_cc26xx_2_21_00_06/products/cc26xxware_2_24_03_17272" -g --c99 --gcc --define=BOARD_DISPLAY_EXCLUDE_LCD --define=BOARD_DISPLAY_EXCLUDE_UART --define=CC2650_LAUNCHXL --define=CC26XX --define=Display_DISABLE_ALL --define=HEAPMGR_SIZE=0 --define=ICALL_MAX_NUM_ENTITIES=6 --define=ICALL_MAX_NUM_TASKS=3 --define=POWER_MEASURE --define=POWER_SAVING --define=USE_ICALL --define=xdc_runtime_Assert_DISABLE_ALL --define=xdc_runtime_Log_DISABLE_ALL --diag_suppress=48 --diag_wrap=off --diag_warning=225 --display_error_number --gen_func_subsections=on --abi=eabi --preproc_with_compile --preproc_dependency="PROFILES/peripheral.d" --obj_directory="PROFILES" --cmd_file="configPkg/compiler.opt" "C:/TI/dog/ble_sdk_2_02_01_18/src/profiles/roles/cc26xx/peripheral.c"
    'Finished building: C:/TI/dog/ble_sdk_2_02_01_18/src/profiles/roles/cc26xx/peripheral.c'
    ' '
    'Building file: C:/TI/dog/ble_sdk_2_02_01_18/src/icall/app/icall_api.c'
    'Invoking: ARM Compiler'
    "C:/TI/bluetooth/ccsv6/tools/compiler/arm_15.12.3.LTS/bin/armcl" --cmd_file="C:/TI/dog/ble_sdk_2_02_01_18/examples/cc2650lp/simple_peripheral/ccs/app/../../iar/stack/../../../../../src/config/build_components.opt" --cmd_file="C:/TI/dog/ble_sdk_2_02_01_18/examples/cc2650lp/simple_peripheral/ccs/app/../../iar/stack/build_config.opt" --cmd_file="C:/TI/dog/ble_sdk_2_02_01_18/examples/cc2650lp/simple_peripheral/ccs/app/../../iar/stack/../../ccs/config/ccs_compiler_defines.bcfg" -mv7M3 --code_state=16 -me -O4 --opt_for_speed=0 --include_path="C:/TI/bluetooth/ccsv6/tools/compiler/arm_15.12.3.LTS/include" --include_path="C:/TI/dog/ble_sdk_2_02_01_18/src/examples/simple_peripheral/cc26xx/app" --include_path="C:/TI/dog/ble_sdk_2_02_01_18/src/inc" --include_path="C:/TI/dog/ble_sdk_2_02_01_18/src/icall/inc" --include_path="C:/TI/dog/ble_sdk_2_02_01_18/src/profiles/roles/cc26xx" --include_path="C:/TI/dog/ble_sdk_2_02_01_18/src/profiles/roles" --include_path="C:/TI/dog/ble_sdk_2_02_01_18/src/profiles/dev_info" --include_path="C:/TI/dog/ble_sdk_2_02_01_18/src/profiles/simple_profile/cc26xx" --include_path="C:/TI/dog/ble_sdk_2_02_01_18/src/profiles/simple_profile" --include_path="C:/TI/dog/ble_sdk_2_02_01_18/src/common/cc26xx" --include_path="C:/TI/dog/ble_sdk_2_02_01_18/src/components/heapmgr" --include_path="C:/TI/dog/ble_sdk_2_02_01_18/src/controller/cc26xx/inc" --include_path="C:/TI/dog/ble_sdk_2_02_01_18/src/components/hal/src/target/_common" --include_path="C:/TI/dog/ble_sdk_2_02_01_18/src/target" --include_path="C:/TI/dog/ble_sdk_2_02_01_18/src/components/hal/src/target/_common/cc26xx" --include_path="C:/TI/dog/ble_sdk_2_02_01_18/src/components/hal/src/inc" --include_path="C:/TI/dog/ble_sdk_2_02_01_18/src/components/osal/src/inc" --include_path="C:/TI/dog/ble_sdk_2_02_01_18/src/components/services/src/sdata" --include_path="C:/TI/dog/ble_sdk_2_02_01_18/src/components/services/src/saddr" --include_path="C:/TI/dog/ble_sdk_2_02_01_18/src/components/icall/src/inc" --include_path="C:/TI/dog/ble_sdk_2_02_01_18/src/inc" --include_path="C:/TI/dog/ble_sdk_2_02_01_18/src/rom" --include_path="C:/TI/dog/tirtos_cc13xx_cc26xx_2_21_00_06/products/cc26xxware_2_24_03_17272" -g --c99 --gcc --define=BOARD_DISPLAY_EXCLUDE_LCD --define=BOARD_DISPLAY_EXCLUDE_UART --define=CC2650_LAUNCHXL --define=CC26XX --define=Display_DISABLE_ALL --define=HEAPMGR_SIZE=0 --define=ICALL_MAX_NUM_ENTITIES=6 --define=ICALL_MAX_NUM_TASKS=3 --define=POWER_MEASURE --define=POWER_SAVING --define=USE_ICALL --define=xdc_runtime_Assert_DISABLE_ALL --define=xdc_runtime_Log_DISABLE_ALL --diag_suppress=48 --diag_wrap=off --diag_warning=225 --display_error_number --gen_func_subsections=on --abi=eabi --preproc_with_compile --preproc_dependency="ICallBLE/icall_api.d" --obj_directory="ICallBLE" --cmd_file="configPkg/compiler.opt" "C:/TI/dog/ble_sdk_2_02_01_18/src/icall/app/icall_api.c"
    'Finished building: C:/TI/dog/ble_sdk_2_02_01_18/src/icall/app/icall_api.c'
    ' '
    gmake: Target 'all' not remade because of errors.

    **** Build Finished ****
  • It seems that you change default installation folder of your BLE stack. Please remove it and install it to default one which should be C:/ti
  • i tried as you said still, few more errors are there still errors are coming under the driver folder RF and my code unable to find the GPTTimercc26XX.h driver,what should i need to do to add driver in virtual folder,please find the below log for your reference.


    **** Build of configuration FlashROM for project simple_peripheral_cc2650lp_app ****

    "C:\\TI\\bluetooth\\ccsv6\\utils\\bin\\gmake" -k -j 4 all -O
    'Building file: C:/TI/ble_sdk_2_02_01_18/examples/cc2650lp/simple_peripheral/ccs/config/app_ble.cfg'
    'Invoking: XDCtools'
    "C:/TI/bluetooth/xdctools_3_32_01_22_core/xs" --xdcpath="C:/TI/tirtos_cc13xx_cc26xx_2_18_00_03/packages;C:/TI/tirtos_cc13xx_cc26xx_2_18_00_03/products/tidrivers_cc13xx_cc26xx_2_16_01_13/packages;C:/TI/tirtos_cc13xx_cc26xx_2_18_00_03/products/bios_6_45_02_31/packages;C:/TI/tirtos_cc13xx_cc26xx_2_18_00_03/products/uia_2_00_05_50/packages;C:/TI/bluetooth/ccsv6/ccs_base;" xdc.tools.configuro -o configPkg -t ti.targets.arm.elf.M3 -p ti.platforms.simplelink:CC2640F128 -r release -c "C:/TI/bluetooth/ccsv6/tools/compiler/arm_15.12.3.LTS" --compileOptions "-mv7M3 --code_state=16 -me -O4 --opt_for_speed=0 --include_path=\"C:/TI/bluetooth/ccsv6/tools/compiler/arm_15.12.3.LTS/include\" --include_path=\"C:/TI/ble_sdk_2_02_01_18/src/examples/simple_peripheral/cc26xx/app\" --include_path=\"C:/TI/ble_sdk_2_02_01_18/src/inc\" --include_path=\"C:/TI/ble_sdk_2_02_01_18/src/icall/inc\" --include_path=\"C:/TI/ble_sdk_2_02_01_18/src/profiles/roles/cc26xx\" --include_path=\"C:/TI/ble_sdk_2_02_01_18/src/profiles/roles\" --include_path=\"C:/TI/ble_sdk_2_02_01_18/src/profiles/dev_info\" --include_path=\"C:/TI/ble_sdk_2_02_01_18/src/profiles/simple_profile/cc26xx\" --include_path=\"C:/TI/ble_sdk_2_02_01_18/src/profiles/simple_profile\" --include_path=\"C:/TI/ble_sdk_2_02_01_18/src/common/cc26xx\" --include_path=\"C:/TI/ble_sdk_2_02_01_18/src/components/heapmgr\" --include_path=\"C:/TI/ble_sdk_2_02_01_18/src/controller/cc26xx/inc\" --include_path=\"C:/TI/ble_sdk_2_02_01_18/src/components/hal/src/target/_common\" --include_path=\"C:/TI/ble_sdk_2_02_01_18/src/target\" --include_path=\"C:/TI/ble_sdk_2_02_01_18/src/components/hal/src/target/_common/cc26xx\" --include_path=\"C:/TI/ble_sdk_2_02_01_18/src/components/hal/src/inc\" --include_path=\"C:/TI/ble_sdk_2_02_01_18/src/components/osal/src/inc\" --include_path=\"C:/TI/ble_sdk_2_02_01_18/src/components/services/src/sdata\" --include_path=\"C:/TI/ble_sdk_2_02_01_18/src/components/services/src/saddr\" --include_path=\"C:/TI/ble_sdk_2_02_01_18/src/components/icall/src/inc\" --include_path=\"C:/TI/ble_sdk_2_02_01_18/src/inc\" --include_path=\"C:/TI/ble_sdk_2_02_01_18/src/rom\" --include_path=\"C:/ti/tirtos_cc13xx_cc26xx_2_20_01_08/products/cc26xxware_2_24_02_17393\" -g --c99 --gcc --define=BOARD_DISPLAY_EXCLUDE_LCD --define=BOARD_DISPLAY_EXCLUDE_UART --define=CC2650_LAUNCHXL --define=CC26XX --define=Display_DISABLE_ALL --define=HEAPMGR_SIZE=0 --define=ICALL_MAX_NUM_ENTITIES=6 --define=ICALL_MAX_NUM_TASKS=3 --define=POWER_MEASURE --define=POWER_SAVING --define=USE_ICALL --define=xdc_runtime_Assert_DISABLE_ALL --define=xdc_runtime_Log_DISABLE_ALL --diag_suppress=48 --diag_wrap=off --diag_warning=225 --display_error_number --gen_func_subsections=on --abi=eabi " "C:/TI/ble_sdk_2_02_01_18/examples/cc2650lp/simple_peripheral/ccs/config/app_ble.cfg"
    making package.mak (because of package.bld) ...
    generating interfaces for package configPkg (because package/package.xdc.inc is older than package.xdc) ...
    configuring app_ble.xem3 from package/cfg/app_ble_pem3.cfg ...
    generating custom ROM library makefile ...
    Starting build of library sources ...
    making C:/TI/ble_sdk_2_02_01_18/examples/cc2650lp/simple_peripheral/ccs/config/src/sysbios/rom_sysbios.aem3 ...
    gmake[1]: Entering directory `C:/TI/ble_sdk_2_02_01_18/examples/cc2650lp/simple_peripheral/ccs/config/src/sysbios'
    gmake[1]: Nothing to be done for `all'.
    gmake[1]: Leaving directory `C:/TI/ble_sdk_2_02_01_18/examples/cc2650lp/simple_peripheral/ccs/config/src/sysbios'
    Build of libraries done.
    clem3 package/cfg/app_ble_pem3.c ...
    'Finished building: C:/TI/ble_sdk_2_02_01_18/examples/cc2650lp/simple_peripheral/ccs/config/app_ble.cfg'
    ' '
    'Building file: C:/TI/tirtos_cc13xx_cc26xx_2_20_01_08/products/tidrivers_cc13xx_cc26xx_2_20_01_10/packages/ti/mw/display/Display.c'
    'Invoking: ARM Compiler'
    "C:/TI/bluetooth/ccsv6/tools/compiler/arm_15.12.3.LTS/bin/armcl" --cmd_file="C:/TI/ble_sdk_2_02_01_18/examples/cc2650lp/simple_peripheral/ccs/app/../../iar/stack/../../../../../src/config/build_components.opt" --cmd_file="C:/TI/ble_sdk_2_02_01_18/examples/cc2650lp/simple_peripheral/ccs/app/../../iar/stack/build_config.opt" --cmd_file="C:/TI/ble_sdk_2_02_01_18/examples/cc2650lp/simple_peripheral/ccs/app/../../iar/stack/../../ccs/config/ccs_compiler_defines.bcfg" -mv7M3 --code_state=16 -me -O4 --opt_for_speed=0 --include_path="C:/TI/bluetooth/ccsv6/tools/compiler/arm_15.12.3.LTS/include" --include_path="C:/TI/ble_sdk_2_02_01_18/src/examples/simple_peripheral/cc26xx/app" --include_path="C:/TI/ble_sdk_2_02_01_18/src/inc" --include_path="C:/TI/ble_sdk_2_02_01_18/src/icall/inc" --include_path="C:/TI/ble_sdk_2_02_01_18/src/profiles/roles/cc26xx" --include_path="C:/TI/ble_sdk_2_02_01_18/src/profiles/roles" --include_path="C:/TI/ble_sdk_2_02_01_18/src/profiles/dev_info" --include_path="C:/TI/ble_sdk_2_02_01_18/src/profiles/simple_profile/cc26xx" --include_path="C:/TI/ble_sdk_2_02_01_18/src/profiles/simple_profile" --include_path="C:/TI/ble_sdk_2_02_01_18/src/common/cc26xx" --include_path="C:/TI/ble_sdk_2_02_01_18/src/components/heapmgr" --include_path="C:/TI/ble_sdk_2_02_01_18/src/controller/cc26xx/inc" --include_path="C:/TI/ble_sdk_2_02_01_18/src/components/hal/src/target/_common" --include_path="C:/TI/ble_sdk_2_02_01_18/src/target" --include_path="C:/TI/ble_sdk_2_02_01_18/src/components/hal/src/target/_common/cc26xx" --include_path="C:/TI/ble_sdk_2_02_01_18/src/components/hal/src/inc" --include_path="C:/TI/ble_sdk_2_02_01_18/src/components/osal/src/inc" --include_path="C:/TI/ble_sdk_2_02_01_18/src/components/services/src/sdata" --include_path="C:/TI/ble_sdk_2_02_01_18/src/components/services/src/saddr" --include_path="C:/TI/ble_sdk_2_02_01_18/src/components/icall/src/inc" --include_path="C:/TI/ble_sdk_2_02_01_18/src/inc" --include_path="C:/TI/ble_sdk_2_02_01_18/src/rom" --include_path="C:/ti/tirtos_cc13xx_cc26xx_2_20_01_08/products/cc26xxware_2_24_02_17393" -g --c99 --gcc --define=BOARD_DISPLAY_EXCLUDE_LCD --define=BOARD_DISPLAY_EXCLUDE_UART --define=CC2650_LAUNCHXL --define=CC26XX --define=Display_DISABLE_ALL --define=HEAPMGR_SIZE=0 --define=ICALL_MAX_NUM_ENTITIES=6 --define=ICALL_MAX_NUM_TASKS=3 --define=POWER_MEASURE --define=POWER_SAVING --define=USE_ICALL --define=xdc_runtime_Assert_DISABLE_ALL --define=xdc_runtime_Log_DISABLE_ALL --diag_suppress=48 --diag_wrap=off --diag_warning=225 --display_error_number --gen_func_subsections=on --abi=eabi --preproc_with_compile --preproc_dependency="Drivers/Display/Display.d" --obj_directory="Drivers/Display" --cmd_file="configPkg/compiler.opt" "C:/TI/tirtos_cc13xx_cc26xx_2_20_01_08/products/tidrivers_cc13xx_cc26xx_2_20_01_10/packages/ti/mw/display/Display.c"
    'Finished building: C:/TI/tirtos_cc13xx_cc26xx_2_20_01_08/products/tidrivers_cc13xx_cc26xx_2_20_01_10/packages/ti/mw/display/Display.c'
    ' '
    'Building file: C:/TI/tirtos_cc13xx_cc26xx_2_20_01_08/products/tidrivers_cc13xx_cc26xx_2_20_01_10/packages/ti/mw/display/DisplayDogm1286.c'
    'Invoking: ARM Compiler'
    "C:/TI/bluetooth/ccsv6/tools/compiler/arm_15.12.3.LTS/bin/armcl" --cmd_file="C:/TI/ble_sdk_2_02_01_18/examples/cc2650lp/simple_peripheral/ccs/app/../../iar/stack/../../../../../src/config/build_components.opt" --cmd_file="C:/TI/ble_sdk_2_02_01_18/examples/cc2650lp/simple_peripheral/ccs/app/../../iar/stack/build_config.opt" --cmd_file="C:/TI/ble_sdk_2_02_01_18/examples/cc2650lp/simple_peripheral/ccs/app/../../iar/stack/../../ccs/config/ccs_compiler_defines.bcfg" -mv7M3 --code_state=16 -me -O4 --opt_for_speed=0 --include_path="C:/TI/bluetooth/ccsv6/tools/compiler/arm_15.12.3.LTS/include" --include_path="C:/TI/ble_sdk_2_02_01_18/src/examples/simple_peripheral/cc26xx/app" --include_path="C:/TI/ble_sdk_2_02_01_18/src/inc" --include_path="C:/TI/ble_sdk_2_02_01_18/src/icall/inc" --include_path="C:/TI/ble_sdk_2_02_01_18/src/profiles/roles/cc26xx" --include_path="C:/TI/ble_sdk_2_02_01_18/src/profiles/roles" --include_path="C:/TI/ble_sdk_2_02_01_18/src/profiles/dev_info" --include_path="C:/TI/ble_sdk_2_02_01_18/src/profiles/simple_profile/cc26xx" --include_path="C:/TI/ble_sdk_2_02_01_18/src/profiles/simple_profile" --include_path="C:/TI/ble_sdk_2_02_01_18/src/common/cc26xx" --include_path="C:/TI/ble_sdk_2_02_01_18/src/components/heapmgr" --include_path="C:/TI/ble_sdk_2_02_01_18/src/controller/cc26xx/inc" --include_path="C:/TI/ble_sdk_2_02_01_18/src/components/hal/src/target/_common" --include_path="C:/TI/ble_sdk_2_02_01_18/src/target" --include_path="C:/TI/ble_sdk_2_02_01_18/src/components/hal/src/target/_common/cc26xx" --include_path="C:/TI/ble_sdk_2_02_01_18/src/components/hal/src/inc" --include_path="C:/TI/ble_sdk_2_02_01_18/src/components/osal/src/inc" --include_path="C:/TI/ble_sdk_2_02_01_18/src/components/services/src/sdata" --include_path="C:/TI/ble_sdk_2_02_01_18/src/components/services/src/saddr" --include_path="C:/TI/ble_sdk_2_02_01_18/src/components/icall/src/inc" --include_path="C:/TI/ble_sdk_2_02_01_18/src/inc" --include_path="C:/TI/ble_sdk_2_02_01_18/src/rom" --include_path="C:/ti/tirtos_cc13xx_cc26xx_2_20_01_08/products/cc26xxware_2_24_02_17393" -g --c99 --gcc --define=BOARD_DISPLAY_EXCLUDE_LCD --define=BOARD_DISPLAY_EXCLUDE_UART --define=CC2650_LAUNCHXL --define=CC26XX --define=Display_DISABLE_ALL --define=HEAPMGR_SIZE=0 --define=ICALL_MAX_NUM_ENTITIES=6 --define=ICALL_MAX_NUM_TASKS=3 --define=POWER_MEASURE --define=POWER_SAVING --define=USE_ICALL --define=xdc_runtime_Assert_DISABLE_ALL --define=xdc_runtime_Log_DISABLE_ALL --diag_suppress=48 --diag_wrap=off --diag_warning=225 --display_error_number --gen_func_subsections=on --abi=eabi --preproc_with_compile --preproc_dependency="Drivers/Display/DisplayDogm1286.d" --obj_directory="Drivers/Display" --cmd_file="configPkg/compiler.opt" "C:/TI/tirtos_cc13xx_cc26xx_2_20_01_08/products/tidrivers_cc13xx_cc26xx_2_20_01_10/packages/ti/mw/display/DisplayDogm1286.c"
    'Finished building: C:/TI/tirtos_cc13xx_cc26xx_2_20_01_08/products/tidrivers_cc13xx_cc26xx_2_20_01_10/packages/ti/mw/display/DisplayDogm1286.c'
    ' '
    'Building file: C:/TI/ble_sdk_2_02_01_18/src/common/cc26xx/util.c'
    'Invoking: ARM Compiler'
    "C:/TI/bluetooth/ccsv6/tools/compiler/arm_15.12.3.LTS/bin/armcl" --cmd_file="C:/TI/ble_sdk_2_02_01_18/examples/cc2650lp/simple_peripheral/ccs/app/../../iar/stack/../../../../../src/config/build_components.opt" --cmd_file="C:/TI/ble_sdk_2_02_01_18/examples/cc2650lp/simple_peripheral/ccs/app/../../iar/stack/build_config.opt" --cmd_file="C:/TI/ble_sdk_2_02_01_18/examples/cc2650lp/simple_peripheral/ccs/app/../../iar/stack/../../ccs/config/ccs_compiler_defines.bcfg" -mv7M3 --code_state=16 -me -O4 --opt_for_speed=0 --include_path="C:/TI/bluetooth/ccsv6/tools/compiler/arm_15.12.3.LTS/include" --include_path="C:/TI/ble_sdk_2_02_01_18/src/examples/simple_peripheral/cc26xx/app" --include_path="C:/TI/ble_sdk_2_02_01_18/src/inc" --include_path="C:/TI/ble_sdk_2_02_01_18/src/icall/inc" --include_path="C:/TI/ble_sdk_2_02_01_18/src/profiles/roles/cc26xx" --include_path="C:/TI/ble_sdk_2_02_01_18/src/profiles/roles" --include_path="C:/TI/ble_sdk_2_02_01_18/src/profiles/dev_info" --include_path="C:/TI/ble_sdk_2_02_01_18/src/profiles/simple_profile/cc26xx" --include_path="C:/TI/ble_sdk_2_02_01_18/src/profiles/simple_profile" --include_path="C:/TI/ble_sdk_2_02_01_18/src/common/cc26xx" --include_path="C:/TI/ble_sdk_2_02_01_18/src/components/heapmgr" --include_path="C:/TI/ble_sdk_2_02_01_18/src/controller/cc26xx/inc" --include_path="C:/TI/ble_sdk_2_02_01_18/src/components/hal/src/target/_common" --include_path="C:/TI/ble_sdk_2_02_01_18/src/target" --include_path="C:/TI/ble_sdk_2_02_01_18/src/components/hal/src/target/_common/cc26xx" --include_path="C:/TI/ble_sdk_2_02_01_18/src/components/hal/src/inc" --include_path="C:/TI/ble_sdk_2_02_01_18/src/components/osal/src/inc" --include_path="C:/TI/ble_sdk_2_02_01_18/src/components/services/src/sdata" --include_path="C:/TI/ble_sdk_2_02_01_18/src/components/services/src/saddr" --include_path="C:/TI/ble_sdk_2_02_01_18/src/components/icall/src/inc" --include_path="C:/TI/ble_sdk_2_02_01_18/src/inc" --include_path="C:/TI/ble_sdk_2_02_01_18/src/rom" --include_path="C:/ti/tirtos_cc13xx_cc26xx_2_20_01_08/products/cc26xxware_2_24_02_17393" -g --c99 --gcc --define=BOARD_DISPLAY_EXCLUDE_LCD --define=BOARD_DISPLAY_EXCLUDE_UART --define=CC2650_LAUNCHXL --define=CC26XX --define=Display_DISABLE_ALL --define=HEAPMGR_SIZE=0 --define=ICALL_MAX_NUM_ENTITIES=6 --define=ICALL_MAX_NUM_TASKS=3 --define=POWER_MEASURE --define=POWER_SAVING --define=USE_ICALL --define=xdc_runtime_Assert_DISABLE_ALL --define=xdc_runtime_Log_DISABLE_ALL --diag_suppress=48 --diag_wrap=off --diag_warning=225 --display_error_number --gen_func_subsections=on --abi=eabi --preproc_with_compile --preproc_dependency="Application/util.d" --obj_directory="Application" --cmd_file="configPkg/compiler.opt" "C:/TI/ble_sdk_2_02_01_18/src/common/cc26xx/util.c"
    'Finished building: C:/TI/ble_sdk_2_02_01_18/src/common/cc26xx/util.c'
    ' '
    'Building file: C:/TI/tirtos_cc13xx_cc26xx_2_20_01_08/products/tidrivers_cc13xx_cc26xx_2_20_01_10/packages/ti/mw/display/DisplayUart.c'
    'Invoking: ARM Compiler'
    "C:/TI/bluetooth/ccsv6/tools/compiler/arm_15.12.3.LTS/bin/armcl" --cmd_file="C:/TI/ble_sdk_2_02_01_18/examples/cc2650lp/simple_peripheral/ccs/app/../../iar/stack/../../../../../src/config/build_components.opt" --cmd_file="C:/TI/ble_sdk_2_02_01_18/examples/cc2650lp/simple_peripheral/ccs/app/../../iar/stack/build_config.opt" --cmd_file="C:/TI/ble_sdk_2_02_01_18/examples/cc2650lp/simple_peripheral/ccs/app/../../iar/stack/../../ccs/config/ccs_compiler_defines.bcfg" -mv7M3 --code_state=16 -me -O4 --opt_for_speed=0 --include_path="C:/TI/bluetooth/ccsv6/tools/compiler/arm_15.12.3.LTS/include" --include_path="C:/TI/ble_sdk_2_02_01_18/src/examples/simple_peripheral/cc26xx/app" --include_path="C:/TI/ble_sdk_2_02_01_18/src/inc" --include_path="C:/TI/ble_sdk_2_02_01_18/src/icall/inc" --include_path="C:/TI/ble_sdk_2_02_01_18/src/profiles/roles/cc26xx" --include_path="C:/TI/ble_sdk_2_02_01_18/src/profiles/roles" --include_path="C:/TI/ble_sdk_2_02_01_18/src/profiles/dev_info" --include_path="C:/TI/ble_sdk_2_02_01_18/src/profiles/simple_profile/cc26xx" --include_path="C:/TI/ble_sdk_2_02_01_18/src/profiles/simple_profile" --include_path="C:/TI/ble_sdk_2_02_01_18/src/common/cc26xx" --include_path="C:/TI/ble_sdk_2_02_01_18/src/components/heapmgr" --include_path="C:/TI/ble_sdk_2_02_01_18/src/controller/cc26xx/inc" --include_path="C:/TI/ble_sdk_2_02_01_18/src/components/hal/src/target/_common" --include_path="C:/TI/ble_sdk_2_02_01_18/src/target" --include_path="C:/TI/ble_sdk_2_02_01_18/src/components/hal/src/target/_common/cc26xx" --include_path="C:/TI/ble_sdk_2_02_01_18/src/components/hal/src/inc" --include_path="C:/TI/ble_sdk_2_02_01_18/src/components/osal/src/inc" --include_path="C:/TI/ble_sdk_2_02_01_18/src/components/services/src/sdata" --include_path="C:/TI/ble_sdk_2_02_01_18/src/components/services/src/saddr" --include_path="C:/TI/ble_sdk_2_02_01_18/src/components/icall/src/inc" --include_path="C:/TI/ble_sdk_2_02_01_18/src/inc" --include_path="C:/TI/ble_sdk_2_02_01_18/src/rom" --include_path="C:/ti/tirtos_cc13xx_cc26xx_2_20_01_08/products/cc26xxware_2_24_02_17393" -g --c99 --gcc --define=BOARD_DISPLAY_EXCLUDE_LCD --define=BOARD_DISPLAY_EXCLUDE_UART --define=CC2650_LAUNCHXL --define=CC26XX --define=Display_DISABLE_ALL --define=HEAPMGR_SIZE=0 --define=ICALL_MAX_NUM_ENTITIES=6 --define=ICALL_MAX_NUM_TASKS=3 --define=POWER_MEASURE --define=POWER_SAVING --define=USE_ICALL --define=xdc_runtime_Assert_DISABLE_ALL --define=xdc_runtime_Log_DISABLE_ALL --diag_suppress=48 --diag_wrap=off --diag_warning=225 --display_error_number --gen_func_subsections=on --abi=eabi --preproc_with_compile --preproc_dependency="Drivers/Display/DisplayUART.d" --obj_directory="Drivers/Display" --cmd_file="configPkg/compiler.opt" "C:/TI/tirtos_cc13xx_cc26xx_2_20_01_08/products/tidrivers_cc13xx_cc26xx_2_20_01_10/packages/ti/mw/display/DisplayUart.c"
    'Finished building: C:/TI/tirtos_cc13xx_cc26xx_2_20_01_08/products/tidrivers_cc13xx_cc26xx_2_20_01_10/packages/ti/mw/display/DisplayUart.c'
    ' '
    'Building file: C:/TI/ble_sdk_2_02_01_18/src/examples/simple_peripheral/cc26xx/app/simple_peripheral.c'
    'Invoking: ARM Compiler'
    "C:/TI/bluetooth/ccsv6/tools/compiler/arm_15.12.3.LTS/bin/armcl" --cmd_file="C:/TI/ble_sdk_2_02_01_18/examples/cc2650lp/simple_peripheral/ccs/app/../../iar/stack/../../../../../src/config/build_components.opt" --cmd_file="C:/TI/ble_sdk_2_02_01_18/examples/cc2650lp/simple_peripheral/ccs/app/../../iar/stack/build_config.opt" --cmd_file="C:/TI/ble_sdk_2_02_01_18/examples/cc2650lp/simple_peripheral/ccs/app/../../iar/stack/../../ccs/config/ccs_compiler_defines.bcfg" -mv7M3 --code_state=16 -me -O4 --opt_for_speed=0 --include_path="C:/TI/bluetooth/ccsv6/tools/compiler/arm_15.12.3.LTS/include" --include_path="C:/TI/ble_sdk_2_02_01_18/src/examples/simple_peripheral/cc26xx/app" --include_path="C:/TI/ble_sdk_2_02_01_18/src/inc" --include_path="C:/TI/ble_sdk_2_02_01_18/src/icall/inc" --include_path="C:/TI/ble_sdk_2_02_01_18/src/profiles/roles/cc26xx" --include_path="C:/TI/ble_sdk_2_02_01_18/src/profiles/roles" --include_path="C:/TI/ble_sdk_2_02_01_18/src/profiles/dev_info" --include_path="C:/TI/ble_sdk_2_02_01_18/src/profiles/simple_profile/cc26xx" --include_path="C:/TI/ble_sdk_2_02_01_18/src/profiles/simple_profile" --include_path="C:/TI/ble_sdk_2_02_01_18/src/common/cc26xx" --include_path="C:/TI/ble_sdk_2_02_01_18/src/components/heapmgr" --include_path="C:/TI/ble_sdk_2_02_01_18/src/controller/cc26xx/inc" --include_path="C:/TI/ble_sdk_2_02_01_18/src/components/hal/src/target/_common" --include_path="C:/TI/ble_sdk_2_02_01_18/src/target" --include_path="C:/TI/ble_sdk_2_02_01_18/src/components/hal/src/target/_common/cc26xx" --include_path="C:/TI/ble_sdk_2_02_01_18/src/components/hal/src/inc" --include_path="C:/TI/ble_sdk_2_02_01_18/src/components/osal/src/inc" --include_path="C:/TI/ble_sdk_2_02_01_18/src/components/services/src/sdata" --include_path="C:/TI/ble_sdk_2_02_01_18/src/components/services/src/saddr" --include_path="C:/TI/ble_sdk_2_02_01_18/src/components/icall/src/inc" --include_path="C:/TI/ble_sdk_2_02_01_18/src/inc" --include_path="C:/TI/ble_sdk_2_02_01_18/src/rom" --include_path="C:/ti/tirtos_cc13xx_cc26xx_2_20_01_08/products/cc26xxware_2_24_02_17393" -g --c99 --gcc --define=BOARD_DISPLAY_EXCLUDE_LCD --define=BOARD_DISPLAY_EXCLUDE_UART --define=CC2650_LAUNCHXL --define=CC26XX --define=Display_DISABLE_ALL --define=HEAPMGR_SIZE=0 --define=ICALL_MAX_NUM_ENTITIES=6 --define=ICALL_MAX_NUM_TASKS=3 --define=POWER_MEASURE --define=POWER_SAVING --define=USE_ICALL --define=xdc_runtime_Assert_DISABLE_ALL --define=xdc_runtime_Log_DISABLE_ALL --diag_suppress=48 --diag_wrap=off --diag_warning=225 --display_error_number --gen_func_subsections=on --abi=eabi --preproc_with_compile --preproc_dependency="Application/simple_peripheral.d" --obj_directory="Application" --cmd_file="configPkg/compiler.opt" "C:/TI/ble_sdk_2_02_01_18/src/examples/simple_peripheral/cc26xx/app/simple_peripheral.c"
    'Finished building: C:/TI/ble_sdk_2_02_01_18/src/examples/simple_peripheral/cc26xx/app/simple_peripheral.c'
    ' '
    'Building file: C:/TI/tirtos_cc13xx_cc26xx_2_20_01_08/products/tidrivers_cc13xx_cc26xx_2_20_01_10/packages/ti/drivers/rf/RFCC26XX_singleMode.c'
    'Invoking: ARM Compiler'
    "C:/TI/bluetooth/ccsv6/tools/compiler/arm_15.12.3.LTS/bin/armcl" --cmd_file="C:/TI/ble_sdk_2_02_01_18/examples/cc2650lp/simple_peripheral/ccs/app/../../iar/stack/../../../../../src/config/build_components.opt" --cmd_file="C:/TI/ble_sdk_2_02_01_18/examples/cc2650lp/simple_peripheral/ccs/app/../../iar/stack/build_config.opt" --cmd_file="C:/TI/ble_sdk_2_02_01_18/examples/cc2650lp/simple_peripheral/ccs/app/../../iar/stack/../../ccs/config/ccs_compiler_defines.bcfg" -mv7M3 --code_state=16 -me -O4 --opt_for_speed=0 --include_path="C:/TI/bluetooth/ccsv6/tools/compiler/arm_15.12.3.LTS/include" --include_path="C:/TI/ble_sdk_2_02_01_18/src/examples/simple_peripheral/cc26xx/app" --include_path="C:/TI/ble_sdk_2_02_01_18/src/inc" --include_path="C:/TI/ble_sdk_2_02_01_18/src/icall/inc" --include_path="C:/TI/ble_sdk_2_02_01_18/src/profiles/roles/cc26xx" --include_path="C:/TI/ble_sdk_2_02_01_18/src/profiles/roles" --include_path="C:/TI/ble_sdk_2_02_01_18/src/profiles/dev_info" --include_path="C:/TI/ble_sdk_2_02_01_18/src/profiles/simple_profile/cc26xx" --include_path="C:/TI/ble_sdk_2_02_01_18/src/profiles/simple_profile" --include_path="C:/TI/ble_sdk_2_02_01_18/src/common/cc26xx" --include_path="C:/TI/ble_sdk_2_02_01_18/src/components/heapmgr" --include_path="C:/TI/ble_sdk_2_02_01_18/src/controller/cc26xx/inc" --include_path="C:/TI/ble_sdk_2_02_01_18/src/components/hal/src/target/_common" --include_path="C:/TI/ble_sdk_2_02_01_18/src/target" --include_path="C:/TI/ble_sdk_2_02_01_18/src/components/hal/src/target/_common/cc26xx" --include_path="C:/TI/ble_sdk_2_02_01_18/src/components/hal/src/inc" --include_path="C:/TI/ble_sdk_2_02_01_18/src/components/osal/src/inc" --include_path="C:/TI/ble_sdk_2_02_01_18/src/components/services/src/sdata" --include_path="C:/TI/ble_sdk_2_02_01_18/src/components/services/src/saddr" --include_path="C:/TI/ble_sdk_2_02_01_18/src/components/icall/src/inc" --include_path="C:/TI/ble_sdk_2_02_01_18/src/inc" --include_path="C:/TI/ble_sdk_2_02_01_18/src/rom" --include_path="C:/ti/tirtos_cc13xx_cc26xx_2_20_01_08/products/cc26xxware_2_24_02_17393" -g --c99 --gcc --define=BOARD_DISPLAY_EXCLUDE_LCD --define=BOARD_DISPLAY_EXCLUDE_UART --define=CC2650_LAUNCHXL --define=CC26XX --define=Display_DISABLE_ALL --define=HEAPMGR_SIZE=0 --define=ICALL_MAX_NUM_ENTITIES=6 --define=ICALL_MAX_NUM_TASKS=3 --define=POWER_MEASURE --define=POWER_SAVING --define=USE_ICALL --define=xdc_runtime_Assert_DISABLE_ALL --define=xdc_runtime_Log_DISABLE_ALL --diag_suppress=48 --diag_wrap=off --diag_warning=225 --display_error_number --gen_func_subsections=on --abi=eabi --preproc_with_compile --preproc_dependency="Drivers/RF/RFCC26XX_singleMode.d" --obj_directory="Drivers/RF" --cmd_file="configPkg/compiler.opt" "C:/TI/tirtos_cc13xx_cc26xx_2_20_01_08/products/tidrivers_cc13xx_cc26xx_2_20_01_10/packages/ti/drivers/rf/RFCC26XX_singleMode.c"

    >> Compilation failure
    Drivers/RF/subdir_rules.mk:7: recipe for target 'Drivers/RF/RFCC26XX_singleMode.obj' failed
    "C:/TI/tirtos_cc13xx_cc26xx_2_20_01_08/products/tidrivers_cc13xx_cc26xx_2_20_01_10/packages/ti/drivers/rf/RFCC26XX_singleMode.c", line 246: error #137: struct "<unnamed>" has no field "pPowerCb"
    "C:/TI/tirtos_cc13xx_cc26xx_2_20_01_08/products/tidrivers_cc13xx_cc26xx_2_20_01_10/packages/ti/drivers/rf/RFCC26XX_singleMode.c", line 758: error #137: struct "<unnamed>" has no field "pErrCb"
    "C:/TI/tirtos_cc13xx_cc26xx_2_20_01_08/products/tidrivers_cc13xx_cc26xx_2_20_01_10/packages/ti/drivers/rf/RFCC26XX_singleMode.c", line 760: error #137: struct "<unnamed>" has no field "pErrCb"
    "C:/TI/tirtos_cc13xx_cc26xx_2_20_01_08/products/tidrivers_cc13xx_cc26xx_2_20_01_10/packages/ti/drivers/rf/RFCC26XX_singleMode.c", line 761: error #20: identifier "RF_ERROR_INVALID_RFMODE" is undefined
    "C:/TI/tirtos_cc13xx_cc26xx_2_20_01_08/products/tidrivers_cc13xx_cc26xx_2_20_01_10/packages/ti/drivers/rf/RFCC26XX_singleMode.c", line 761: error #20: identifier "RF_EventError" is undefined
    "C:/TI/tirtos_cc13xx_cc26xx_2_20_01_08/products/tidrivers_cc13xx_cc26xx_2_20_01_10/packages/ti/drivers/rf/RFCC26XX_singleMode.c", line 1022: error #137: struct "<unnamed>" has no field "pErrCb"
    "C:/TI/tirtos_cc13xx_cc26xx_2_20_01_08/products/tidrivers_cc13xx_cc26xx_2_20_01_10/packages/ti/drivers/rf/RFCC26XX_singleMode.c", line 1027: error #137: struct "<unnamed>" has no field "pErrCb"
    "C:/TI/tirtos_cc13xx_cc26xx_2_20_01_08/products/tidrivers_cc13xx_cc26xx_2_20_01_10/packages/ti/drivers/rf/RFCC26XX_singleMode.c", line 1028: error #20: identifier "RF_ERROR_CMDFS_SYNTH_PROG" is undefined
    "C:/TI/tirtos_cc13xx_cc26xx_2_20_01_08/products/tidrivers_cc13xx_cc26xx_2_20_01_10/packages/ti/drivers/rf/RFCC26XX_singleMode.c", line 1028: error #20: identifier "RF_EventError" is undefined
    "C:/TI/tirtos_cc13xx_cc26xx_2_20_01_08/products/tidrivers_cc13xx_cc26xx_2_20_01_10/packages/ti/drivers/rf/RFCC26XX_singleMode.c", line 1054: error #137: struct "<unnamed>" has no field "pPowerCb"
    "C:/TI/tirtos_cc13xx_cc26xx_2_20_01_08/products/tidrivers_cc13xx_cc26xx_2_20_01_10/packages/ti/drivers/rf/RFCC26XX_singleMode.c", line 1056: error #137: struct "<unnamed>" has no field "pPowerCb"
    "C:/TI/tirtos_cc13xx_cc26xx_2_20_01_08/products/tidrivers_cc13xx_cc26xx_2_20_01_10/packages/ti/drivers/rf/RFCC26XX_singleMode.c", line 1057: error #20: identifier "RF_EventPowerUp" is undefined
    "C:/TI/tirtos_cc13xx_cc26xx_2_20_01_08/products/tidrivers_cc13xx_cc26xx_2_20_01_10/packages/ti/drivers/rf/RFCC26XX_singleMode.c", line 1306: error #137: struct "<unnamed>" has no field "pPowerCb"
    "C:/TI/tirtos_cc13xx_cc26xx_2_20_01_08/products/tidrivers_cc13xx_cc26xx_2_20_01_10/packages/ti/drivers/rf/RFCC26XX_singleMode.c", line 1306: error #137: struct "<unnamed>" has no field "pPowerCb"
    "C:/TI/tirtos_cc13xx_cc26xx_2_20_01_08/products/tidrivers_cc13xx_cc26xx_2_20_01_10/packages/ti/drivers/rf/RFCC26XX_singleMode.c", line 1308: error #137: struct "<unnamed>" has no field "pErrCb"
    "C:/TI/tirtos_cc13xx_cc26xx_2_20_01_08/products/tidrivers_cc13xx_cc26xx_2_20_01_10/packages/ti/drivers/rf/RFCC26XX_singleMode.c", line 1310: error #137: struct "<unnamed>" has no field "pErrCb"
    "C:/TI/tirtos_cc13xx_cc26xx_2_20_01_08/products/tidrivers_cc13xx_cc26xx_2_20_01_10/packages/ti/drivers/rf/RFCC26XX_singleMode.c", line 1310: error #137: struct "<unnamed>" has no field "pErrCb"
    17 errors detected in the compilation of "C:/TI/tirtos_cc13xx_cc26xx_2_20_01_08/products/tidrivers_cc13xx_cc26xx_2_20_01_10/packages/ti/drivers/rf/RFCC26XX_singleMode.c".
    gmake: *** [Drivers/RF/RFCC26XX_singleMode.obj] Error 1
    'Building file: C:/TI/tirtos_cc13xx_cc26xx_2_20_01_08/products/tidrivers_cc13xx_cc26xx_2_20_01_10/packages/ti/drivers/SPI.c'
    'Invoking: ARM Compiler'
    "C:/TI/bluetooth/ccsv6/tools/compiler/arm_15.12.3.LTS/bin/armcl" --cmd_file="C:/TI/ble_sdk_2_02_01_18/examples/cc2650lp/simple_peripheral/ccs/app/../../iar/stack/../../../../../src/config/build_components.opt" --cmd_file="C:/TI/ble_sdk_2_02_01_18/examples/cc2650lp/simple_peripheral/ccs/app/../../iar/stack/build_config.opt" --cmd_file="C:/TI/ble_sdk_2_02_01_18/examples/cc2650lp/simple_peripheral/ccs/app/../../iar/stack/../../ccs/config/ccs_compiler_defines.bcfg" -mv7M3 --code_state=16 -me -O4 --opt_for_speed=0 --include_path="C:/TI/bluetooth/ccsv6/tools/compiler/arm_15.12.3.LTS/include" --include_path="C:/TI/ble_sdk_2_02_01_18/src/examples/simple_peripheral/cc26xx/app" --include_path="C:/TI/ble_sdk_2_02_01_18/src/inc" --include_path="C:/TI/ble_sdk_2_02_01_18/src/icall/inc" --include_path="C:/TI/ble_sdk_2_02_01_18/src/profiles/roles/cc26xx" --include_path="C:/TI/ble_sdk_2_02_01_18/src/profiles/roles" --include_path="C:/TI/ble_sdk_2_02_01_18/src/profiles/dev_info" --include_path="C:/TI/ble_sdk_2_02_01_18/src/profiles/simple_profile/cc26xx" --include_path="C:/TI/ble_sdk_2_02_01_18/src/profiles/simple_profile" --include_path="C:/TI/ble_sdk_2_02_01_18/src/common/cc26xx" --include_path="C:/TI/ble_sdk_2_02_01_18/src/components/heapmgr" --include_path="C:/TI/ble_sdk_2_02_01_18/src/controller/cc26xx/inc" --include_path="C:/TI/ble_sdk_2_02_01_18/src/components/hal/src/target/_common" --include_path="C:/TI/ble_sdk_2_02_01_18/src/target" --include_path="C:/TI/ble_sdk_2_02_01_18/src/components/hal/src/target/_common/cc26xx" --include_path="C:/TI/ble_sdk_2_02_01_18/src/components/hal/src/inc" --include_path="C:/TI/ble_sdk_2_02_01_18/src/components/osal/src/inc" --include_path="C:/TI/ble_sdk_2_02_01_18/src/components/services/src/sdata" --include_path="C:/TI/ble_sdk_2_02_01_18/src/components/services/src/saddr" --include_path="C:/TI/ble_sdk_2_02_01_18/src/components/icall/src/inc" --include_path="C:/TI/ble_sdk_2_02_01_18/src/inc" --include_path="C:/TI/ble_sdk_2_02_01_18/src/rom" --include_path="C:/ti/tirtos_cc13xx_cc26xx_2_20_01_08/products/cc26xxware_2_24_02_17393" -g --c99 --gcc --define=BOARD_DISPLAY_EXCLUDE_LCD --define=BOARD_DISPLAY_EXCLUDE_UART --define=CC2650_LAUNCHXL --define=CC26XX --define=Display_DISABLE_ALL --define=HEAPMGR_SIZE=0 --define=ICALL_MAX_NUM_ENTITIES=6 --define=ICALL_MAX_NUM_TASKS=3 --define=POWER_MEASURE --define=POWER_SAVING --define=USE_ICALL --define=xdc_runtime_Assert_DISABLE_ALL --define=xdc_runtime_Log_DISABLE_ALL --diag_suppress=48 --diag_wrap=off --diag_warning=225 --display_error_number --gen_func_subsections=on --abi=eabi --preproc_with_compile --preproc_dependency="Drivers/SPI/SPI.d" --obj_directory="Drivers/SPI" --cmd_file="configPkg/compiler.opt" "C:/TI/tirtos_cc13xx_cc26xx_2_20_01_08/products/tidrivers_cc13xx_cc26xx_2_20_01_10/packages/ti/drivers/SPI.c"
    'Finished building: C:/TI/tirtos_cc13xx_cc26xx_2_20_01_08/products/tidrivers_cc13xx_cc26xx_2_20_01_10/packages/ti/drivers/SPI.c'
    ' '
    'Building file: C:/TI/ble_sdk_2_02_01_18/src/common/cc26xx/ecc/ECCROMCC26XX.c'
    'Invoking: ARM Compiler'
    "C:/TI/bluetooth/ccsv6/tools/compiler/arm_15.12.3.LTS/bin/armcl" --cmd_file="C:/TI/ble_sdk_2_02_01_18/examples/cc2650lp/simple_peripheral/ccs/app/../../iar/stack/../../../../../src/config/build_components.opt" --cmd_file="C:/TI/ble_sdk_2_02_01_18/examples/cc2650lp/simple_peripheral/ccs/app/../../iar/stack/build_config.opt" --cmd_file="C:/TI/ble_sdk_2_02_01_18/examples/cc2650lp/simple_peripheral/ccs/app/../../iar/stack/../../ccs/config/ccs_compiler_defines.bcfg" -mv7M3 --code_state=16 -me -O4 --opt_for_speed=0 --include_path="C:/TI/bluetooth/ccsv6/tools/compiler/arm_15.12.3.LTS/include" --include_path="C:/TI/ble_sdk_2_02_01_18/src/examples/simple_peripheral/cc26xx/app" --include_path="C:/TI/ble_sdk_2_02_01_18/src/inc" --include_path="C:/TI/ble_sdk_2_02_01_18/src/icall/inc" --include_path="C:/TI/ble_sdk_2_02_01_18/src/profiles/roles/cc26xx" --include_path="C:/TI/ble_sdk_2_02_01_18/src/profiles/roles" --include_path="C:/TI/ble_sdk_2_02_01_18/src/profiles/dev_info" --include_path="C:/TI/ble_sdk_2_02_01_18/src/profiles/simple_profile/cc26xx" --include_path="C:/TI/ble_sdk_2_02_01_18/src/profiles/simple_profile" --include_path="C:/TI/ble_sdk_2_02_01_18/src/common/cc26xx" --include_path="C:/TI/ble_sdk_2_02_01_18/src/components/heapmgr" --include_path="C:/TI/ble_sdk_2_02_01_18/src/controller/cc26xx/inc" --include_path="C:/TI/ble_sdk_2_02_01_18/src/components/hal/src/target/_common" --include_path="C:/TI/ble_sdk_2_02_01_18/src/target" --include_path="C:/TI/ble_sdk_2_02_01_18/src/components/hal/src/target/_common/cc26xx" --include_path="C:/TI/ble_sdk_2_02_01_18/src/components/hal/src/inc" --include_path="C:/TI/ble_sdk_2_02_01_18/src/components/osal/src/inc" --include_path="C:/TI/ble_sdk_2_02_01_18/src/components/services/src/sdata" --include_path="C:/TI/ble_sdk_2_02_01_18/src/components/services/src/saddr" --include_path="C:/TI/ble_sdk_2_02_01_18/src/components/icall/src/inc" --include_path="C:/TI/ble_sdk_2_02_01_18/src/inc" --include_path="C:/TI/ble_sdk_2_02_01_18/src/rom" --include_path="C:/ti/tirtos_cc13xx_cc26xx_2_20_01_08/products/cc26xxware_2_24_02_17393" -g --c99 --gcc --define=BOARD_DISPLAY_EXCLUDE_LCD --define=BOARD_DISPLAY_EXCLUDE_UART --define=CC2650_LAUNCHXL --define=CC26XX --define=Display_DISABLE_ALL --define=HEAPMGR_SIZE=0 --define=ICALL_MAX_NUM_ENTITIES=6 --define=ICALL_MAX_NUM_TASKS=3 --define=POWER_MEASURE --define=POWER_SAVING --define=USE_ICALL --define=xdc_runtime_Assert_DISABLE_ALL --define=xdc_runtime_Log_DISABLE_ALL --diag_suppress=48 --diag_wrap=off --diag_warning=225 --display_error_number --gen_func_subsections=on --abi=eabi --preproc_with_compile --preproc_dependency="Drivers/ECC/ECCROMCC26XX.d" --obj_directory="Drivers/ECC" --cmd_file="configPkg/compiler.opt" "C:/TI/ble_sdk_2_02_01_18/src/common/cc26xx/ecc/ECCROMCC26XX.c"
    'Finished building: C:/TI/ble_sdk_2_02_01_18/src/common/cc26xx/ecc/ECCROMCC26XX.c'
    ' '
    'Building file: C:/TI/tirtos_cc13xx_cc26xx_2_20_01_08/products/tidrivers_cc13xx_cc26xx_2_20_01_10/packages/ti/drivers/UART.c'
    'Invoking: ARM Compiler'
    "C:/TI/bluetooth/ccsv6/tools/compiler/arm_15.12.3.LTS/bin/armcl" --cmd_file="C:/TI/ble_sdk_2_02_01_18/examples/cc2650lp/simple_peripheral/ccs/app/../../iar/stack/../../../../../src/config/build_components.opt" --cmd_file="C:/TI/ble_sdk_2_02_01_18/examples/cc2650lp/simple_peripheral/ccs/app/../../iar/stack/build_config.opt" --cmd_file="C:/TI/ble_sdk_2_02_01_18/examples/cc2650lp/simple_peripheral/ccs/app/../../iar/stack/../../ccs/config/ccs_compiler_defines.bcfg" -mv7M3 --code_state=16 -me -O4 --opt_for_speed=0 --include_path="C:/TI/bluetooth/ccsv6/tools/compiler/arm_15.12.3.LTS/include" --include_path="C:/TI/ble_sdk_2_02_01_18/src/examples/simple_peripheral/cc26xx/app" --include_path="C:/TI/ble_sdk_2_02_01_18/src/inc" --include_path="C:/TI/ble_sdk_2_02_01_18/src/icall/inc" --include_path="C:/TI/ble_sdk_2_02_01_18/src/profiles/roles/cc26xx" --include_path="C:/TI/ble_sdk_2_02_01_18/src/profiles/roles" --include_path="C:/TI/ble_sdk_2_02_01_18/src/profiles/dev_info" --include_path="C:/TI/ble_sdk_2_02_01_18/src/profiles/simple_profile/cc26xx" --include_path="C:/TI/ble_sdk_2_02_01_18/src/profiles/simple_profile" --include_path="C:/TI/ble_sdk_2_02_01_18/src/common/cc26xx" --include_path="C:/TI/ble_sdk_2_02_01_18/src/components/heapmgr" --include_path="C:/TI/ble_sdk_2_02_01_18/src/controller/cc26xx/inc" --include_path="C:/TI/ble_sdk_2_02_01_18/src/components/hal/src/target/_common" --include_path="C:/TI/ble_sdk_2_02_01_18/src/target" --include_path="C:/TI/ble_sdk_2_02_01_18/src/components/hal/src/target/_common/cc26xx" --include_path="C:/TI/ble_sdk_2_02_01_18/src/components/hal/src/inc" --include_path="C:/TI/ble_sdk_2_02_01_18/src/components/osal/src/inc" --include_path="C:/TI/ble_sdk_2_02_01_18/src/components/services/src/sdata" --include_path="C:/TI/ble_sdk_2_02_01_18/src/components/services/src/saddr" --include_path="C:/TI/ble_sdk_2_02_01_18/src/components/icall/src/inc" --include_path="C:/TI/ble_sdk_2_02_01_18/src/inc" --include_path="C:/TI/ble_sdk_2_02_01_18/src/rom" --include_path="C:/ti/tirtos_cc13xx_cc26xx_2_20_01_08/products/cc26xxware_2_24_02_17393" -g --c99 --gcc --define=BOARD_DISPLAY_EXCLUDE_LCD --define=BOARD_DISPLAY_EXCLUDE_UART --define=CC2650_LAUNCHXL --define=CC26XX --define=Display_DISABLE_ALL --define=HEAPMGR_SIZE=0 --define=ICALL_MAX_NUM_ENTITIES=6 --define=ICALL_MAX_NUM_TASKS=3 --define=POWER_MEASURE --define=POWER_SAVING --define=USE_ICALL --define=xdc_runtime_Assert_DISABLE_ALL --define=xdc_runtime_Log_DISABLE_ALL --diag_suppress=48 --diag_wrap=off --diag_warning=225 --display_error_number --gen_func_subsections=on --abi=eabi --preproc_with_compile --preproc_dependency="Drivers/UART/UART.d" --obj_directory="Drivers/UART" --cmd_file="configPkg/compiler.opt" "C:/TI/tirtos_cc13xx_cc26xx_2_20_01_08/products/tidrivers_cc13xx_cc26xx_2_20_01_10/packages/ti/drivers/UART.c"
    'Finished building: C:/TI/tirtos_cc13xx_cc26xx_2_20_01_08/products/tidrivers_cc13xx_cc26xx_2_20_01_10/packages/ti/drivers/UART.c'
    ' '
    'Building file: C:/TI/tirtos_cc13xx_cc26xx_2_20_01_08/products/tidrivers_cc13xx_cc26xx_2_20_01_10/packages/ti/drivers/pin/PINCC26XX.c'
    'Invoking: ARM Compiler'
    "C:/TI/bluetooth/ccsv6/tools/compiler/arm_15.12.3.LTS/bin/armcl" --cmd_file="C:/TI/ble_sdk_2_02_01_18/examples/cc2650lp/simple_peripheral/ccs/app/../../iar/stack/../../../../../src/config/build_components.opt" --cmd_file="C:/TI/ble_sdk_2_02_01_18/examples/cc2650lp/simple_peripheral/ccs/app/../../iar/stack/build_config.opt" --cmd_file="C:/TI/ble_sdk_2_02_01_18/examples/cc2650lp/simple_peripheral/ccs/app/../../iar/stack/../../ccs/config/ccs_compiler_defines.bcfg" -mv7M3 --code_state=16 -me -O4 --opt_for_speed=0 --include_path="C:/TI/bluetooth/ccsv6/tools/compiler/arm_15.12.3.LTS/include" --include_path="C:/TI/ble_sdk_2_02_01_18/src/examples/simple_peripheral/cc26xx/app" --include_path="C:/TI/ble_sdk_2_02_01_18/src/inc" --include_path="C:/TI/ble_sdk_2_02_01_18/src/icall/inc" --include_path="C:/TI/ble_sdk_2_02_01_18/src/profiles/roles/cc26xx" --include_path="C:/TI/ble_sdk_2_02_01_18/src/profiles/roles" --include_path="C:/TI/ble_sdk_2_02_01_18/src/profiles/dev_info" --include_path="C:/TI/ble_sdk_2_02_01_18/src/profiles/simple_profile/cc26xx" --include_path="C:/TI/ble_sdk_2_02_01_18/src/profiles/simple_profile" --include_path="C:/TI/ble_sdk_2_02_01_18/src/common/cc26xx" --include_path="C:/TI/ble_sdk_2_02_01_18/src/components/heapmgr" --include_path="C:/TI/ble_sdk_2_02_01_18/src/controller/cc26xx/inc" --include_path="C:/TI/ble_sdk_2_02_01_18/src/components/hal/src/target/_common" --include_path="C:/TI/ble_sdk_2_02_01_18/src/target" --include_path="C:/TI/ble_sdk_2_02_01_18/src/components/hal/src/target/_common/cc26xx" --include_path="C:/TI/ble_sdk_2_02_01_18/src/components/hal/src/inc" --include_path="C:/TI/ble_sdk_2_02_01_18/src/components/osal/src/inc" --include_path="C:/TI/ble_sdk_2_02_01_18/src/components/services/src/sdata" --include_path="C:/TI/ble_sdk_2_02_01_18/src/components/services/src/saddr" --include_path="C:/TI/ble_sdk_2_02_01_18/src/components/icall/src/inc" --include_path="C:/TI/ble_sdk_2_02_01_18/src/inc" --include_path="C:/TI/ble_sdk_2_02_01_18/src/rom" --include_path="C:/ti/tirtos_cc13xx_cc26xx_2_20_01_08/products/cc26xxware_2_24_02_17393" -g --c99 --gcc --define=BOARD_DISPLAY_EXCLUDE_LCD --define=BOARD_DISPLAY_EXCLUDE_UART --define=CC2650_LAUNCHXL --define=CC26XX --define=Display_DISABLE_ALL --define=HEAPMGR_SIZE=0 --define=ICALL_MAX_NUM_ENTITIES=6 --define=ICALL_MAX_NUM_TASKS=3 --define=POWER_MEASURE --define=POWER_SAVING --define=USE_ICALL --define=xdc_runtime_Assert_DISABLE_ALL --define=xdc_runtime_Log_DISABLE_ALL --diag_suppress=48 --diag_wrap=off --diag_warning=225 --display_error_number --gen_func_subsections=on --abi=eabi --preproc_with_compile --preproc_dependency="Drivers/PIN/PINCC26XX.d" --obj_directory="Drivers/PIN" --cmd_file="configPkg/compiler.opt" "C:/TI/tirtos_cc13xx_cc26xx_2_20_01_08/products/tidrivers_cc13xx_cc26xx_2_20_01_10/packages/ti/drivers/pin/PINCC26XX.c"
    'Finished building: C:/TI/tirtos_cc13xx_cc26xx_2_20_01_08/products/tidrivers_cc13xx_cc26xx_2_20_01_10/packages/ti/drivers/pin/PINCC26XX.c'
    ' '
    'Building file: C:/TI/ble_sdk_2_02_01_18/src/components/hal/src/target/_common/TRNGCC26XX.c'
    'Invoking: ARM Compiler'
    "C:/TI/bluetooth/ccsv6/tools/compiler/arm_15.12.3.LTS/bin/armcl" --cmd_file="C:/TI/ble_sdk_2_02_01_18/examples/cc2650lp/simple_peripheral/ccs/app/../../iar/stack/../../../../../src/config/build_components.opt" --cmd_file="C:/TI/ble_sdk_2_02_01_18/examples/cc2650lp/simple_peripheral/ccs/app/../../iar/stack/build_config.opt" --cmd_file="C:/TI/ble_sdk_2_02_01_18/examples/cc2650lp/simple_peripheral/ccs/app/../../iar/stack/../../ccs/config/ccs_compiler_defines.bcfg" -mv7M3 --code_state=16 -me -O4 --opt_for_speed=0 --include_path="C:/TI/bluetooth/ccsv6/tools/compiler/arm_15.12.3.LTS/include" --include_path="C:/TI/ble_sdk_2_02_01_18/src/examples/simple_peripheral/cc26xx/app" --include_path="C:/TI/ble_sdk_2_02_01_18/src/inc" --include_path="C:/TI/ble_sdk_2_02_01_18/src/icall/inc" --include_path="C:/TI/ble_sdk_2_02_01_18/src/profiles/roles/cc26xx" --include_path="C:/TI/ble_sdk_2_02_01_18/src/profiles/roles" --include_path="C:/TI/ble_sdk_2_02_01_18/src/profiles/dev_info" --include_path="C:/TI/ble_sdk_2_02_01_18/src/profiles/simple_profile/cc26xx" --include_path="C:/TI/ble_sdk_2_02_01_18/src/profiles/simple_profile" --include_path="C:/TI/ble_sdk_2_02_01_18/src/common/cc26xx" --include_path="C:/TI/ble_sdk_2_02_01_18/src/components/heapmgr" --include_path="C:/TI/ble_sdk_2_02_01_18/src/controller/cc26xx/inc" --include_path="C:/TI/ble_sdk_2_02_01_18/src/components/hal/src/target/_common" --include_path="C:/TI/ble_sdk_2_02_01_18/src/target" --include_path="C:/TI/ble_sdk_2_02_01_18/src/components/hal/src/target/_common/cc26xx" --include_path="C:/TI/ble_sdk_2_02_01_18/src/components/hal/src/inc" --include_path="C:/TI/ble_sdk_2_02_01_18/src/components/osal/src/inc" --include_path="C:/TI/ble_sdk_2_02_01_18/src/components/services/src/sdata" --include_path="C:/TI/ble_sdk_2_02_01_18/src/components/services/src/saddr" --include_path="C:/TI/ble_sdk_2_02_01_18/src/components/icall/src/inc" --include_path="C:/TI/ble_sdk_2_02_01_18/src/inc" --include_path="C:/TI/ble_sdk_2_02_01_18/src/rom" --include_path="C:/ti/tirtos_cc13xx_cc26xx_2_20_01_08/products/cc26xxware_2_24_02_17393" -g --c99 --gcc --define=BOARD_DISPLAY_EXCLUDE_LCD --define=BOARD_DISPLAY_EXCLUDE_UART --define=CC2650_LAUNCHXL --define=CC26XX --define=Display_DISABLE_ALL --define=HEAPMGR_SIZE=0 --define=ICALL_MAX_NUM_ENTITIES=6 --define=ICALL_MAX_NUM_TASKS=3 --define=POWER_MEASURE --define=POWER_SAVING --define=USE_ICALL --define=xdc_runtime_Assert_DISABLE_ALL --define=xdc_runtime_Log_DISABLE_ALL --diag_suppress=48 --diag_wrap=off --diag_warning=225 --display_error_number --gen_func_subsections=on --abi=eabi --preproc_with_compile --preproc_dependency="Drivers/TRNG/TRNGCC26XX.d" --obj_directory="Drivers/TRNG" --cmd_file="configPkg/compiler.opt" "C:/TI/ble_sdk_2_02_01_18/src/components/hal/src/target/_common/TRNGCC26XX.c"
    'Finished building: C:/TI/ble_sdk_2_02_01_18/src/components/hal/src/target/_common/TRNGCC26XX.c'
    ' '
    'Building file: C:/TI/tirtos_cc13xx_cc26xx_2_20_01_08/products/tidrivers_cc13xx_cc26xx_2_20_01_10/packages/ti/drivers/dma/UDMACC26XX.c'
    'Invoking: ARM Compiler'
    "C:/TI/bluetooth/ccsv6/tools/compiler/arm_15.12.3.LTS/bin/armcl" --cmd_file="C:/TI/ble_sdk_2_02_01_18/examples/cc2650lp/simple_peripheral/ccs/app/../../iar/stack/../../../../../src/config/build_components.opt" --cmd_file="C:/TI/ble_sdk_2_02_01_18/examples/cc2650lp/simple_peripheral/ccs/app/../../iar/stack/build_config.opt" --cmd_file="C:/TI/ble_sdk_2_02_01_18/examples/cc2650lp/simple_peripheral/ccs/app/../../iar/stack/../../ccs/config/ccs_compiler_defines.bcfg" -mv7M3 --code_state=16 -me -O4 --opt_for_speed=0 --include_path="C:/TI/bluetooth/ccsv6/tools/compiler/arm_15.12.3.LTS/include" --include_path="C:/TI/ble_sdk_2_02_01_18/src/examples/simple_peripheral/cc26xx/app" --include_path="C:/TI/ble_sdk_2_02_01_18/src/inc" --include_path="C:/TI/ble_sdk_2_02_01_18/src/icall/inc" --include_path="C:/TI/ble_sdk_2_02_01_18/src/profiles/roles/cc26xx" --include_path="C:/TI/ble_sdk_2_02_01_18/src/profiles/roles" --include_path="C:/TI/ble_sdk_2_02_01_18/src/profiles/dev_info" --include_path="C:/TI/ble_sdk_2_02_01_18/src/profiles/simple_profile/cc26xx" --include_path="C:/TI/ble_sdk_2_02_01_18/src/profiles/simple_profile" --include_path="C:/TI/ble_sdk_2_02_01_18/src/common/cc26xx" --include_path="C:/TI/ble_sdk_2_02_01_18/src/components/heapmgr" --include_path="C:/TI/ble_sdk_2_02_01_18/src/controller/cc26xx/inc" --include_path="C:/TI/ble_sdk_2_02_01_18/src/components/hal/src/target/_common" --include_path="C:/TI/ble_sdk_2_02_01_18/src/target" --include_path="C:/TI/ble_sdk_2_02_01_18/src/components/hal/src/target/_common/cc26xx" --include_path="C:/TI/ble_sdk_2_02_01_18/src/components/hal/src/inc" --include_path="C:/TI/ble_sdk_2_02_01_18/src/components/osal/src/inc" --include_path="C:/TI/ble_sdk_2_02_01_18/src/components/services/src/sdata" --include_path="C:/TI/ble_sdk_2_02_01_18/src/components/services/src/saddr" --include_path="C:/TI/ble_sdk_2_02_01_18/src/components/icall/src/inc" --include_path="C:/TI/ble_sdk_2_02_01_18/src/inc" --include_path="C:/TI/ble_sdk_2_02_01_18/src/rom" --include_path="C:/ti/tirtos_cc13xx_cc26xx_2_20_01_08/products/cc26xxware_2_24_02_17393" -g --c99 --gcc --define=BOARD_DISPLAY_EXCLUDE_LCD --define=BOARD_DISPLAY_EXCLUDE_UART --define=CC2650_LAUNCHXL --define=CC26XX --define=Display_DISABLE_ALL --define=HEAPMGR_SIZE=0 --define=ICALL_MAX_NUM_ENTITIES=6 --define=ICALL_MAX_NUM_TASKS=3 --define=POWER_MEASURE --define=POWER_SAVING --define=USE_ICALL --define=xdc_runtime_Assert_DISABLE_ALL --define=xdc_runtime_Log_DISABLE_ALL --diag_suppress=48 --diag_wrap=off --diag_warning=225 --display_error_number --gen_func_subsections=on --abi=eabi --preproc_with_compile --preproc_dependency="Drivers/UDMA/UDMACC26XX.d" --obj_directory="Drivers/UDMA" --cmd_file="configPkg/compiler.opt" "C:/TI/tirtos_cc13xx_cc26xx_2_20_01_08/products/tidrivers_cc13xx_cc26xx_2_20_01_10/packages/ti/drivers/dma/UDMACC26XX.c"
    'Finished building: C:/TI/tirtos_cc13xx_cc26xx_2_20_01_08/products/tidrivers_cc13xx_cc26xx_2_20_01_10/packages/ti/drivers/dma/UDMACC26XX.c'
    ' '
    'Building file: C:/TI/tirtos_cc13xx_cc26xx_2_20_01_08/products/tidrivers_cc13xx_cc26xx_2_20_01_10/packages/ti/drivers/spi/SPICC26XXDMA.c'
    'Invoking: ARM Compiler'
    "C:/TI/bluetooth/ccsv6/tools/compiler/arm_15.12.3.LTS/bin/armcl" --cmd_file="C:/TI/ble_sdk_2_02_01_18/examples/cc2650lp/simple_peripheral/ccs/app/../../iar/stack/../../../../../src/config/build_components.opt" --cmd_file="C:/TI/ble_sdk_2_02_01_18/examples/cc2650lp/simple_peripheral/ccs/app/../../iar/stack/build_config.opt" --cmd_file="C:/TI/ble_sdk_2_02_01_18/examples/cc2650lp/simple_peripheral/ccs/app/../../iar/stack/../../ccs/config/ccs_compiler_defines.bcfg" -mv7M3 --code_state=16 -me -O4 --opt_for_speed=0 --include_path="C:/TI/bluetooth/ccsv6/tools/compiler/arm_15.12.3.LTS/include" --include_path="C:/TI/ble_sdk_2_02_01_18/src/examples/simple_peripheral/cc26xx/app" --include_path="C:/TI/ble_sdk_2_02_01_18/src/inc" --include_path="C:/TI/ble_sdk_2_02_01_18/src/icall/inc" --include_path="C:/TI/ble_sdk_2_02_01_18/src/profiles/roles/cc26xx" --include_path="C:/TI/ble_sdk_2_02_01_18/src/profiles/roles" --include_path="C:/TI/ble_sdk_2_02_01_18/src/profiles/dev_info" --include_path="C:/TI/ble_sdk_2_02_01_18/src/profiles/simple_profile/cc26xx" --include_path="C:/TI/ble_sdk_2_02_01_18/src/profiles/simple_profile" --include_path="C:/TI/ble_sdk_2_02_01_18/src/common/cc26xx" --include_path="C:/TI/ble_sdk_2_02_01_18/src/components/heapmgr" --include_path="C:/TI/ble_sdk_2_02_01_18/src/controller/cc26xx/inc" --include_path="C:/TI/ble_sdk_2_02_01_18/src/components/hal/src/target/_common" --include_path="C:/TI/ble_sdk_2_02_01_18/src/target" --include_path="C:/TI/ble_sdk_2_02_01_18/src/components/hal/src/target/_common/cc26xx" --include_path="C:/TI/ble_sdk_2_02_01_18/src/components/hal/src/inc" --include_path="C:/TI/ble_sdk_2_02_01_18/src/components/osal/src/inc" --include_path="C:/TI/ble_sdk_2_02_01_18/src/components/services/src/sdata" --include_path="C:/TI/ble_sdk_2_02_01_18/src/components/services/src/saddr" --include_path="C:/TI/ble_sdk_2_02_01_18/src/components/icall/src/inc" --include_path="C:/TI/ble_sdk_2_02_01_18/src/inc" --include_path="C:/TI/ble_sdk_2_02_01_18/src/rom" --include_path="C:/ti/tirtos_cc13xx_cc26xx_2_20_01_08/products/cc26xxware_2_24_02_17393" -g --c99 --gcc --define=BOARD_DISPLAY_EXCLUDE_LCD --define=BOARD_DISPLAY_EXCLUDE_UART --define=CC2650_LAUNCHXL --define=CC26XX --define=Display_DISABLE_ALL --define=HEAPMGR_SIZE=0 --define=ICALL_MAX_NUM_ENTITIES=6 --define=ICALL_MAX_NUM_TASKS=3 --define=POWER_MEASURE --define=POWER_SAVING --define=USE_ICALL --define=xdc_runtime_Assert_DISABLE_ALL --define=xdc_runtime_Log_DISABLE_ALL --diag_suppress=48 --diag_wrap=off --diag_warning=225 --display_error_number --gen_func_subsections=on --abi=eabi --preproc_with_compile --preproc_dependency="Drivers/SPI/SPICC26XXDMA.d" --obj_directory="Drivers/SPI" --cmd_file="configPkg/compiler.opt" "C:/TI/tirtos_cc13xx_cc26xx_2_20_01_08/products/tidrivers_cc13xx_cc26xx_2_20_01_10/packages/ti/drivers/spi/SPICC26XXDMA.c"
    'Finished building: C:/TI/tirtos_cc13xx_cc26xx_2_20_01_08/products/tidrivers_cc13xx_cc26xx_2_20_01_10/packages/ti/drivers/spi/SPICC26XXDMA.c'
    ' '
    'Building file: C:/TI/ble_sdk_2_02_01_18/src/components/icall/src/icall_cc2650.c'
    'Invoking: ARM Compiler'
    "C:/TI/bluetooth/ccsv6/tools/compiler/arm_15.12.3.LTS/bin/armcl" --cmd_file="C:/TI/ble_sdk_2_02_01_18/examples/cc2650lp/simple_peripheral/ccs/app/../../iar/stack/../../../../../src/config/build_components.opt" --cmd_file="C:/TI/ble_sdk_2_02_01_18/examples/cc2650lp/simple_peripheral/ccs/app/../../iar/stack/build_config.opt" --cmd_file="C:/TI/ble_sdk_2_02_01_18/examples/cc2650lp/simple_peripheral/ccs/app/../../iar/stack/../../ccs/config/ccs_compiler_defines.bcfg" -mv7M3 --code_state=16 -me -O4 --opt_for_speed=0 --include_path="C:/TI/bluetooth/ccsv6/tools/compiler/arm_15.12.3.LTS/include" --include_path="C:/TI/ble_sdk_2_02_01_18/src/examples/simple_peripheral/cc26xx/app" --include_path="C:/TI/ble_sdk_2_02_01_18/src/inc" --include_path="C:/TI/ble_sdk_2_02_01_18/src/icall/inc" --include_path="C:/TI/ble_sdk_2_02_01_18/src/profiles/roles/cc26xx" --include_path="C:/TI/ble_sdk_2_02_01_18/src/profiles/roles" --include_path="C:/TI/ble_sdk_2_02_01_18/src/profiles/dev_info" --include_path="C:/TI/ble_sdk_2_02_01_18/src/profiles/simple_profile/cc26xx" --include_path="C:/TI/ble_sdk_2_02_01_18/src/profiles/simple_profile" --include_path="C:/TI/ble_sdk_2_02_01_18/src/common/cc26xx" --include_path="C:/TI/ble_sdk_2_02_01_18/src/components/heapmgr" --include_path="C:/TI/ble_sdk_2_02_01_18/src/controller/cc26xx/inc" --include_path="C:/TI/ble_sdk_2_02_01_18/src/components/hal/src/target/_common" --include_path="C:/TI/ble_sdk_2_02_01_18/src/target" --include_path="C:/TI/ble_sdk_2_02_01_18/src/components/hal/src/target/_common/cc26xx" --include_path="C:/TI/ble_sdk_2_02_01_18/src/components/hal/src/inc" --include_path="C:/TI/ble_sdk_2_02_01_18/src/components/osal/src/inc" --include_path="C:/TI/ble_sdk_2_02_01_18/src/components/services/src/sdata" --include_path="C:/TI/ble_sdk_2_02_01_18/src/components/services/src/saddr" --include_path="C:/TI/ble_sdk_2_02_01_18/src/components/icall/src/inc" --include_path="C:/TI/ble_sdk_2_02_01_18/src/inc" --include_path="C:/TI/ble_sdk_2_02_01_18/src/rom" --include_path="C:/ti/tirtos_cc13xx_cc26xx_2_20_01_08/products/cc26xxware_2_24_02_17393" -g --c99 --gcc --define=BOARD_DISPLAY_EXCLUDE_LCD --define=BOARD_DISPLAY_EXCLUDE_UART --define=CC2650_LAUNCHXL --define=CC26XX --define=Display_DISABLE_ALL --define=HEAPMGR_SIZE=0 --define=ICALL_MAX_NUM_ENTITIES=6 --define=ICALL_MAX_NUM_TASKS=3 --define=POWER_MEASURE --define=POWER_SAVING --define=USE_ICALL --define=xdc_runtime_Assert_DISABLE_ALL --define=xdc_runtime_Log_DISABLE_ALL --diag_suppress=48 --diag_wrap=off --diag_warning=225 --display_error_number --gen_func_subsections=on --abi=eabi --preproc_with_compile --preproc_dependency="ICall/icall_cc2650.d" --obj_directory="ICall" --cmd_file="configPkg/compiler.opt" "C:/TI/ble_sdk_2_02_01_18/src/components/icall/src/icall_cc2650.c"
    'Finished building: C:/TI/ble_sdk_2_02_01_18/src/components/icall/src/icall_cc2650.c'
    ' '
    'Building file: C:/TI/tirtos_cc13xx_cc26xx_2_20_01_08/products/tidrivers_cc13xx_cc26xx_2_20_01_10/packages/ti/drivers/uart/UARTCC26XX.c'
    'Invoking: ARM Compiler'
    "C:/TI/bluetooth/ccsv6/tools/compiler/arm_15.12.3.LTS/bin/armcl" --cmd_file="C:/TI/ble_sdk_2_02_01_18/examples/cc2650lp/simple_peripheral/ccs/app/../../iar/stack/../../../../../src/config/build_components.opt" --cmd_file="C:/TI/ble_sdk_2_02_01_18/examples/cc2650lp/simple_peripheral/ccs/app/../../iar/stack/build_config.opt" --cmd_file="C:/TI/ble_sdk_2_02_01_18/examples/cc2650lp/simple_peripheral/ccs/app/../../iar/stack/../../ccs/config/ccs_compiler_defines.bcfg" -mv7M3 --code_state=16 -me -O4 --opt_for_speed=0 --include_path="C:/TI/bluetooth/ccsv6/tools/compiler/arm_15.12.3.LTS/include" --include_path="C:/TI/ble_sdk_2_02_01_18/src/examples/simple_peripheral/cc26xx/app" --include_path="C:/TI/ble_sdk_2_02_01_18/src/inc" --include_path="C:/TI/ble_sdk_2_02_01_18/src/icall/inc" --include_path="C:/TI/ble_sdk_2_02_01_18/src/profiles/roles/cc26xx" --include_path="C:/TI/ble_sdk_2_02_01_18/src/profiles/roles" --include_path="C:/TI/ble_sdk_2_02_01_18/src/profiles/dev_info" --include_path="C:/TI/ble_sdk_2_02_01_18/src/profiles/simple_profile/cc26xx" --include_path="C:/TI/ble_sdk_2_02_01_18/src/profiles/simple_profile" --include_path="C:/TI/ble_sdk_2_02_01_18/src/common/cc26xx" --include_path="C:/TI/ble_sdk_2_02_01_18/src/components/heapmgr" --include_path="C:/TI/ble_sdk_2_02_01_18/src/controller/cc26xx/inc" --include_path="C:/TI/ble_sdk_2_02_01_18/src/components/hal/src/target/_common" --include_path="C:/TI/ble_sdk_2_02_01_18/src/target" --include_path="C:/TI/ble_sdk_2_02_01_18/src/components/hal/src/target/_common/cc26xx" --include_path="C:/TI/ble_sdk_2_02_01_18/src/components/hal/src/inc" --include_path="C:/TI/ble_sdk_2_02_01_18/src/components/osal/src/inc" --include_path="C:/TI/ble_sdk_2_02_01_18/src/components/services/src/sdata" --include_path="C:/TI/ble_sdk_2_02_01_18/src/components/services/src/saddr" --include_path="C:/TI/ble_sdk_2_02_01_18/src/components/icall/src/inc" --include_path="C:/TI/ble_sdk_2_02_01_18/src/inc" --include_path="C:/TI/ble_sdk_2_02_01_18/src/rom" --include_path="C:/ti/tirtos_cc13xx_cc26xx_2_20_01_08/products/cc26xxware_2_24_02_17393" -g --c99 --gcc --define=BOARD_DISPLAY_EXCLUDE_LCD --define=BOARD_DISPLAY_EXCLUDE_UART --define=CC2650_LAUNCHXL --define=CC26XX --define=Display_DISABLE_ALL --define=HEAPMGR_SIZE=0 --define=ICALL_MAX_NUM_ENTITIES=6 --define=ICALL_MAX_NUM_TASKS=3 --define=POWER_MEASURE --define=POWER_SAVING --define=USE_ICALL --define=xdc_runtime_Assert_DISABLE_ALL --define=xdc_runtime_Log_DISABLE_ALL --diag_suppress=48 --diag_wrap=off --diag_warning=225 --display_error_number --gen_func_subsections=on --abi=eabi --preproc_with_compile --preproc_dependency="Drivers/UART/UARTCC26XX.d" --obj_directory="Drivers/UART" --cmd_file="configPkg/compiler.opt" "C:/TI/tirtos_cc13xx_cc26xx_2_20_01_08/products/tidrivers_cc13xx_cc26xx_2_20_01_10/packages/ti/drivers/uart/UARTCC26XX.c"
    'Finished building: C:/TI/tirtos_cc13xx_cc26xx_2_20_01_08/products/tidrivers_cc13xx_cc26xx_2_20_01_10/packages/ti/drivers/uart/UARTCC26XX.c'
    ' '
    'Building file: C:/TI/ble_sdk_2_02_01_18/src/icall/app/ble_user_config.c'
    'Invoking: ARM Compiler'
    "C:/TI/bluetooth/ccsv6/tools/compiler/arm_15.12.3.LTS/bin/armcl" --cmd_file="C:/TI/ble_sdk_2_02_01_18/examples/cc2650lp/simple_peripheral/ccs/app/../../iar/stack/../../../../../src/config/build_components.opt" --cmd_file="C:/TI/ble_sdk_2_02_01_18/examples/cc2650lp/simple_peripheral/ccs/app/../../iar/stack/build_config.opt" --cmd_file="C:/TI/ble_sdk_2_02_01_18/examples/cc2650lp/simple_peripheral/ccs/app/../../iar/stack/../../ccs/config/ccs_compiler_defines.bcfg" -mv7M3 --code_state=16 -me -O4 --opt_for_speed=0 --include_path="C:/TI/bluetooth/ccsv6/tools/compiler/arm_15.12.3.LTS/include" --include_path="C:/TI/ble_sdk_2_02_01_18/src/examples/simple_peripheral/cc26xx/app" --include_path="C:/TI/ble_sdk_2_02_01_18/src/inc" --include_path="C:/TI/ble_sdk_2_02_01_18/src/icall/inc" --include_path="C:/TI/ble_sdk_2_02_01_18/src/profiles/roles/cc26xx" --include_path="C:/TI/ble_sdk_2_02_01_18/src/profiles/roles" --include_path="C:/TI/ble_sdk_2_02_01_18/src/profiles/dev_info" --include_path="C:/TI/ble_sdk_2_02_01_18/src/profiles/simple_profile/cc26xx" --include_path="C:/TI/ble_sdk_2_02_01_18/src/profiles/simple_profile" --include_path="C:/TI/ble_sdk_2_02_01_18/src/common/cc26xx" --include_path="C:/TI/ble_sdk_2_02_01_18/src/components/heapmgr" --include_path="C:/TI/ble_sdk_2_02_01_18/src/controller/cc26xx/inc" --include_path="C:/TI/ble_sdk_2_02_01_18/src/components/hal/src/target/_common" --include_path="C:/TI/ble_sdk_2_02_01_18/src/target" --include_path="C:/TI/ble_sdk_2_02_01_18/src/components/hal/src/target/_common/cc26xx" --include_path="C:/TI/ble_sdk_2_02_01_18/src/components/hal/src/inc" --include_path="C:/TI/ble_sdk_2_02_01_18/src/components/osal/src/inc" --include_path="C:/TI/ble_sdk_2_02_01_18/src/components/services/src/sdata" --include_path="C:/TI/ble_sdk_2_02_01_18/src/components/services/src/saddr" --include_path="C:/TI/ble_sdk_2_02_01_18/src/components/icall/src/inc" --include_path="C:/TI/ble_sdk_2_02_01_18/src/inc" --include_path="C:/TI/ble_sdk_2_02_01_18/src/rom" --include_path="C:/ti/tirtos_cc13xx_cc26xx_2_20_01_08/products/cc26xxware_2_24_02_17393" -g --c99 --gcc --define=BOARD_DISPLAY_EXCLUDE_LCD --define=BOARD_DISPLAY_EXCLUDE_UART --define=CC2650_LAUNCHXL --define=CC26XX --define=Display_DISABLE_ALL --define=HEAPMGR_SIZE=0 --define=ICALL_MAX_NUM_ENTITIES=6 --define=ICALL_MAX_NUM_TASKS=3 --define=POWER_MEASURE --define=POWER_SAVING --define=USE_ICALL --define=xdc_runtime_Assert_DISABLE_ALL --define=xdc_runtime_Log_DISABLE_ALL --diag_suppress=48 --diag_wrap=off --diag_warning=225 --display_error_number --gen_func_subsections=on --abi=eabi --preproc_with_compile --preproc_dependency="ICallBLE/ble_user_config.d" --obj_directory="ICallBLE" --cmd_file="configPkg/compiler.opt" "C:/TI/ble_sdk_2_02_01_18/src/icall/app/ble_user_config.c"
    'Finished building: C:/TI/ble_sdk_2_02_01_18/src/icall/app/ble_user_config.c'
    ' '
    'Building file: C:/TI/ble_sdk_2_02_01_18/src/components/icall/src/icall.c'
    'Invoking: ARM Compiler'
    "C:/TI/bluetooth/ccsv6/tools/compiler/arm_15.12.3.LTS/bin/armcl" --cmd_file="C:/TI/ble_sdk_2_02_01_18/examples/cc2650lp/simple_peripheral/ccs/app/../../iar/stack/../../../../../src/config/build_components.opt" --cmd_file="C:/TI/ble_sdk_2_02_01_18/examples/cc2650lp/simple_peripheral/ccs/app/../../iar/stack/build_config.opt" --cmd_file="C:/TI/ble_sdk_2_02_01_18/examples/cc2650lp/simple_peripheral/ccs/app/../../iar/stack/../../ccs/config/ccs_compiler_defines.bcfg" -mv7M3 --code_state=16 -me -O4 --opt_for_speed=0 --include_path="C:/TI/bluetooth/ccsv6/tools/compiler/arm_15.12.3.LTS/include" --include_path="C:/TI/ble_sdk_2_02_01_18/src/examples/simple_peripheral/cc26xx/app" --include_path="C:/TI/ble_sdk_2_02_01_18/src/inc" --include_path="C:/TI/ble_sdk_2_02_01_18/src/icall/inc" --include_path="C:/TI/ble_sdk_2_02_01_18/src/profiles/roles/cc26xx" --include_path="C:/TI/ble_sdk_2_02_01_18/src/profiles/roles" --include_path="C:/TI/ble_sdk_2_02_01_18/src/profiles/dev_info" --include_path="C:/TI/ble_sdk_2_02_01_18/src/profiles/simple_profile/cc26xx" --include_path="C:/TI/ble_sdk_2_02_01_18/src/profiles/simple_profile" --include_path="C:/TI/ble_sdk_2_02_01_18/src/common/cc26xx" --include_path="C:/TI/ble_sdk_2_02_01_18/src/components/heapmgr" --include_path="C:/TI/ble_sdk_2_02_01_18/src/controller/cc26xx/inc" --include_path="C:/TI/ble_sdk_2_02_01_18/src/components/hal/src/target/_common" --include_path="C:/TI/ble_sdk_2_02_01_18/src/target" --include_path="C:/TI/ble_sdk_2_02_01_18/src/components/hal/src/target/_common/cc26xx" --include_path="C:/TI/ble_sdk_2_02_01_18/src/components/hal/src/inc" --include_path="C:/TI/ble_sdk_2_02_01_18/src/components/osal/src/inc" --include_path="C:/TI/ble_sdk_2_02_01_18/src/components/services/src/sdata" --include_path="C:/TI/ble_sdk_2_02_01_18/src/components/services/src/saddr" --include_path="C:/TI/ble_sdk_2_02_01_18/src/components/icall/src/inc" --include_path="C:/TI/ble_sdk_2_02_01_18/src/inc" --include_path="C:/TI/ble_sdk_2_02_01_18/src/rom" --include_path="C:/ti/tirtos_cc13xx_cc26xx_2_20_01_08/products/cc26xxware_2_24_02_17393" -g --c99 --gcc --define=BOARD_DISPLAY_EXCLUDE_LCD --define=BOARD_DISPLAY_EXCLUDE_UART --define=CC2650_LAUNCHXL --define=CC26XX --define=Display_DISABLE_ALL --define=HEAPMGR_SIZE=0 --define=ICALL_MAX_NUM_ENTITIES=6 --define=ICALL_MAX_NUM_TASKS=3 --define=POWER_MEASURE --define=POWER_SAVING --define=USE_ICALL --define=xdc_runtime_Assert_DISABLE_ALL --define=xdc_runtime_Log_DISABLE_ALL --diag_suppress=48 --diag_wrap=off --diag_warning=225 --display_error_number --gen_func_subsections=on --abi=eabi --preproc_with_compile --preproc_dependency="ICall/icall.d" --obj_directory="ICall" --cmd_file="configPkg/compiler.opt" "C:/TI/ble_sdk_2_02_01_18/src/components/icall/src/icall.c"
    'Finished building: C:/TI/ble_sdk_2_02_01_18/src/components/icall/src/icall.c'
    ' '
    'Building file: C:/TI/ble_sdk_2_02_01_18/src/host/gatt_uuid.c'
    'Invoking: ARM Compiler'
    "C:/TI/bluetooth/ccsv6/tools/compiler/arm_15.12.3.LTS/bin/armcl" --cmd_file="C:/TI/ble_sdk_2_02_01_18/examples/cc2650lp/simple_peripheral/ccs/app/../../iar/stack/../../../../../src/config/build_components.opt" --cmd_file="C:/TI/ble_sdk_2_02_01_18/examples/cc2650lp/simple_peripheral/ccs/app/../../iar/stack/build_config.opt" --cmd_file="C:/TI/ble_sdk_2_02_01_18/examples/cc2650lp/simple_peripheral/ccs/app/../../iar/stack/../../ccs/config/ccs_compiler_defines.bcfg" -mv7M3 --code_state=16 -me -O4 --opt_for_speed=0 --include_path="C:/TI/bluetooth/ccsv6/tools/compiler/arm_15.12.3.LTS/include" --include_path="C:/TI/ble_sdk_2_02_01_18/src/examples/simple_peripheral/cc26xx/app" --include_path="C:/TI/ble_sdk_2_02_01_18/src/inc" --include_path="C:/TI/ble_sdk_2_02_01_18/src/icall/inc" --include_path="C:/TI/ble_sdk_2_02_01_18/src/profiles/roles/cc26xx" --include_path="C:/TI/ble_sdk_2_02_01_18/src/profiles/roles" --include_path="C:/TI/ble_sdk_2_02_01_18/src/profiles/dev_info" --include_path="C:/TI/ble_sdk_2_02_01_18/src/profiles/simple_profile/cc26xx" --include_path="C:/TI/ble_sdk_2_02_01_18/src/profiles/simple_profile" --include_path="C:/TI/ble_sdk_2_02_01_18/src/common/cc26xx" --include_path="C:/TI/ble_sdk_2_02_01_18/src/components/heapmgr" --include_path="C:/TI/ble_sdk_2_02_01_18/src/controller/cc26xx/inc" --include_path="C:/TI/ble_sdk_2_02_01_18/src/components/hal/src/target/_common" --include_path="C:/TI/ble_sdk_2_02_01_18/src/target" --include_path="C:/TI/ble_sdk_2_02_01_18/src/components/hal/src/target/_common/cc26xx" --include_path="C:/TI/ble_sdk_2_02_01_18/src/components/hal/src/inc" --include_path="C:/TI/ble_sdk_2_02_01_18/src/components/osal/src/inc" --include_path="C:/TI/ble_sdk_2_02_01_18/src/components/services/src/sdata" --include_path="C:/TI/ble_sdk_2_02_01_18/src/components/services/src/saddr" --include_path="C:/TI/ble_sdk_2_02_01_18/src/components/icall/src/inc" --include_path="C:/TI/ble_sdk_2_02_01_18/src/inc" --include_path="C:/TI/ble_sdk_2_02_01_18/src/rom" --include_path="C:/ti/tirtos_cc13xx_cc26xx_2_20_01_08/products/cc26xxware_2_24_02_17393" -g --c99 --gcc --define=BOARD_DISPLAY_EXCLUDE_LCD --define=BOARD_DISPLAY_EXCLUDE_UART --define=CC2650_LAUNCHXL --define=CC26XX --define=Display_DISABLE_ALL --define=HEAPMGR_SIZE=0 --define=ICALL_MAX_NUM_ENTITIES=6 --define=ICALL_MAX_NUM_TASKS=3 --define=POWER_MEASURE --define=POWER_SAVING --define=USE_ICALL --define=xdc_runtime_Assert_DISABLE_ALL --define=xdc_runtime_Log_DISABLE_ALL --diag_suppress=48 --diag_wrap=off --diag_warning=225 --display_error_number --gen_func_subsections=on --abi=eabi --preproc_with_compile --preproc_dependency="PROFILES/gatt_uuid.d" --obj_directory="PROFILES" --cmd_file="configPkg/compiler.opt" "C:/TI/ble_sdk_2_02_01_18/src/host/gatt_uuid.c"
    'Finished building: C:/TI/ble_sdk_2_02_01_18/src/host/gatt_uuid.c'
    ' '
    'Building file: C:/TI/ble_sdk_2_02_01_18/src/profiles/dev_info/cc26xx/devinfoservice.c'
    'Invoking: ARM Compiler'
    "C:/TI/bluetooth/ccsv6/tools/compiler/arm_15.12.3.LTS/bin/armcl" --cmd_file="C:/TI/ble_sdk_2_02_01_18/examples/cc2650lp/simple_peripheral/ccs/app/../../iar/stack/../../../../../src/config/build_components.opt" --cmd_file="C:/TI/ble_sdk_2_02_01_18/examples/cc2650lp/simple_peripheral/ccs/app/../../iar/stack/build_config.opt" --cmd_file="C:/TI/ble_sdk_2_02_01_18/examples/cc2650lp/simple_peripheral/ccs/app/../../iar/stack/../../ccs/config/ccs_compiler_defines.bcfg" -mv7M3 --code_state=16 -me -O4 --opt_for_speed=0 --include_path="C:/TI/bluetooth/ccsv6/tools/compiler/arm_15.12.3.LTS/include" --include_path="C:/TI/ble_sdk_2_02_01_18/src/examples/simple_peripheral/cc26xx/app" --include_path="C:/TI/ble_sdk_2_02_01_18/src/inc" --include_path="C:/TI/ble_sdk_2_02_01_18/src/icall/inc" --include_path="C:/TI/ble_sdk_2_02_01_18/src/profiles/roles/cc26xx" --include_path="C:/TI/ble_sdk_2_02_01_18/src/profiles/roles" --include_path="C:/TI/ble_sdk_2_02_01_18/src/profiles/dev_info" --include_path="C:/TI/ble_sdk_2_02_01_18/src/profiles/simple_profile/cc26xx" --include_path="C:/TI/ble_sdk_2_02_01_18/src/profiles/simple_profile" --include_path="C:/TI/ble_sdk_2_02_01_18/src/common/cc26xx" --include_path="C:/TI/ble_sdk_2_02_01_18/src/components/heapmgr" --include_path="C:/TI/ble_sdk_2_02_01_18/src/controller/cc26xx/inc" --include_path="C:/TI/ble_sdk_2_02_01_18/src/components/hal/src/target/_common" --include_path="C:/TI/ble_sdk_2_02_01_18/src/target" --include_path="C:/TI/ble_sdk_2_02_01_18/src/components/hal/src/target/_common/cc26xx" --include_path="C:/TI/ble_sdk_2_02_01_18/src/components/hal/src/inc" --include_path="C:/TI/ble_sdk_2_02_01_18/src/components/osal/src/inc" --include_path="C:/TI/ble_sdk_2_02_01_18/src/components/services/src/sdata" --include_path="C:/TI/ble_sdk_2_02_01_18/src/components/services/src/saddr" --include_path="C:/TI/ble_sdk_2_02_01_18/src/components/icall/src/inc" --include_path="C:/TI/ble_sdk_2_02_01_18/src/inc" --include_path="C:/TI/ble_sdk_2_02_01_18/src/rom" --include_path="C:/ti/tirtos_cc13xx_cc26xx_2_20_01_08/products/cc26xxware_2_24_02_17393" -g --c99 --gcc --define=BOARD_DISPLAY_EXCLUDE_LCD --define=BOARD_DISPLAY_EXCLUDE_UART --define=CC2650_LAUNCHXL --define=CC26XX --define=Display_DISABLE_ALL --define=HEAPMGR_SIZE=0 --define=ICALL_MAX_NUM_ENTITIES=6 --define=ICALL_MAX_NUM_TASKS=3 --define=POWER_MEASURE --define=POWER_SAVING --define=USE_ICALL --define=xdc_runtime_Assert_DISABLE_ALL --define=xdc_runtime_Log_DISABLE_ALL --diag_suppress=48 --diag_wrap=off --diag_warning=225 --display_error_number --gen_func_subsections=on --abi=eabi --preproc_with_compile --preproc_dependency="PROFILES/devinfoservice.d" --obj_directory="PROFILES" --cmd_file="configPkg/compiler.opt" "C:/TI/ble_sdk_2_02_01_18/src/profiles/dev_info/cc26xx/devinfoservice.c"
    'Finished building: C:/TI/ble_sdk_2_02_01_18/src/profiles/dev_info/cc26xx/devinfoservice.c'
    ' '
    'Building file: C:/TI/tirtos_cc13xx_cc26xx_2_20_01_08/products/tidrivers_cc13xx_cc26xx_2_20_01_10/packages/ti/mw/extflash/ExtFlash.c'
    'Invoking: ARM Compiler'
    "C:/TI/bluetooth/ccsv6/tools/compiler/arm_15.12.3.LTS/bin/armcl" --cmd_file="C:/TI/ble_sdk_2_02_01_18/examples/cc2650lp/simple_peripheral/ccs/app/../../iar/stack/../../../../../src/config/build_components.opt" --cmd_file="C:/TI/ble_sdk_2_02_01_18/examples/cc2650lp/simple_peripheral/ccs/app/../../iar/stack/build_config.opt" --cmd_file="C:/TI/ble_sdk_2_02_01_18/examples/cc2650lp/simple_peripheral/ccs/app/../../iar/stack/../../ccs/config/ccs_compiler_defines.bcfg" -mv7M3 --code_state=16 -me -O4 --opt_for_speed=0 --include_path="C:/TI/bluetooth/ccsv6/tools/compiler/arm_15.12.3.LTS/include" --include_path="C:/TI/ble_sdk_2_02_01_18/src/examples/simple_peripheral/cc26xx/app" --include_path="C:/TI/ble_sdk_2_02_01_18/src/inc" --include_path="C:/TI/ble_sdk_2_02_01_18/src/icall/inc" --include_path="C:/TI/ble_sdk_2_02_01_18/src/profiles/roles/cc26xx" --include_path="C:/TI/ble_sdk_2_02_01_18/src/profiles/roles" --include_path="C:/TI/ble_sdk_2_02_01_18/src/profiles/dev_info" --include_path="C:/TI/ble_sdk_2_02_01_18/src/profiles/simple_profile/cc26xx" --include_path="C:/TI/ble_sdk_2_02_01_18/src/profiles/simple_profile" --include_path="C:/TI/ble_sdk_2_02_01_18/src/common/cc26xx" --include_path="C:/TI/ble_sdk_2_02_01_18/src/components/heapmgr" --include_path="C:/TI/ble_sdk_2_02_01_18/src/controller/cc26xx/inc" --include_path="C:/TI/ble_sdk_2_02_01_18/src/components/hal/src/target/_common" --include_path="C:/TI/ble_sdk_2_02_01_18/src/target" --include_path="C:/TI/ble_sdk_2_02_01_18/src/components/hal/src/target/_common/cc26xx" --include_path="C:/TI/ble_sdk_2_02_01_18/src/components/hal/src/inc" --include_path="C:/TI/ble_sdk_2_02_01_18/src/components/osal/src/inc" --include_path="C:/TI/ble_sdk_2_02_01_18/src/components/services/src/sdata" --include_path="C:/TI/ble_sdk_2_02_01_18/src/components/services/src/saddr" --include_path="C:/TI/ble_sdk_2_02_01_18/src/components/icall/src/inc" --include_path="C:/TI/ble_sdk_2_02_01_18/src/inc" --include_path="C:/TI/ble_sdk_2_02_01_18/src/rom" --include_path="C:/ti/tirtos_cc13xx_cc26xx_2_20_01_08/products/cc26xxware_2_24_02_17393" -g --c99 --gcc --define=BOARD_DISPLAY_EXCLUDE_LCD --define=BOARD_DISPLAY_EXCLUDE_UART --define=CC2650_LAUNCHXL --define=CC26XX --define=Display_DISABLE_ALL --define=HEAPMGR_SIZE=0 --define=ICALL_MAX_NUM_ENTITIES=6 --define=ICALL_MAX_NUM_TASKS=3 --define=POWER_MEASURE --define=POWER_SAVING --define=USE_ICALL --define=xdc_runtime_Assert_DISABLE_ALL --define=xdc_runtime_Log_DISABLE_ALL --diag_suppress=48 --diag_wrap=off --diag_warning=225 --display_error_number --gen_func_subsections=on --abi=eabi --preproc_with_compile --preproc_dependency="Middleware/extflash/ExtFlash.d" --obj_directory="Middleware/extflash" --cmd_file="configPkg/compiler.opt" "C:/TI/tirtos_cc13xx_cc26xx_2_20_01_08/products/tidrivers_cc13xx_cc26xx_2_20_01_10/packages/ti/mw/extflash/ExtFlash.c"
    'Finished building: C:/TI/tirtos_cc13xx_cc26xx_2_20_01_08/products/tidrivers_cc13xx_cc26xx_2_20_01_10/packages/ti/mw/extflash/ExtFlash.c'
    ' '
    'Building file: C:/TI/ble_sdk_2_02_01_18/src/host/gattservapp_util.c'
    'Invoking: ARM Compiler'
    "C:/TI/bluetooth/ccsv6/tools/compiler/arm_15.12.3.LTS/bin/armcl" --cmd_file="C:/TI/ble_sdk_2_02_01_18/examples/cc2650lp/simple_peripheral/ccs/app/../../iar/stack/../../../../../src/config/build_components.opt" --cmd_file="C:/TI/ble_sdk_2_02_01_18/examples/cc2650lp/simple_peripheral/ccs/app/../../iar/stack/build_config.opt" --cmd_file="C:/TI/ble_sdk_2_02_01_18/examples/cc2650lp/simple_peripheral/ccs/app/../../iar/stack/../../ccs/config/ccs_compiler_defines.bcfg" -mv7M3 --code_state=16 -me -O4 --opt_for_speed=0 --include_path="C:/TI/bluetooth/ccsv6/tools/compiler/arm_15.12.3.LTS/include" --include_path="C:/TI/ble_sdk_2_02_01_18/src/examples/simple_peripheral/cc26xx/app" --include_path="C:/TI/ble_sdk_2_02_01_18/src/inc" --include_path="C:/TI/ble_sdk_2_02_01_18/src/icall/inc" --include_path="C:/TI/ble_sdk_2_02_01_18/src/profiles/roles/cc26xx" --include_path="C:/TI/ble_sdk_2_02_01_18/src/profiles/roles" --include_path="C:/TI/ble_sdk_2_02_01_18/src/profiles/dev_info" --include_path="C:/TI/ble_sdk_2_02_01_18/src/profiles/simple_profile/cc26xx" --include_path="C:/TI/ble_sdk_2_02_01_18/src/profiles/simple_profile" --include_path="C:/TI/ble_sdk_2_02_01_18/src/common/cc26xx" --include_path="C:/TI/ble_sdk_2_02_01_18/src/components/heapmgr" --include_path="C:/TI/ble_sdk_2_02_01_18/src/controller/cc26xx/inc" --include_path="C:/TI/ble_sdk_2_02_01_18/src/components/hal/src/target/_common" --include_path="C:/TI/ble_sdk_2_02_01_18/src/target" --include_path="C:/TI/ble_sdk_2_02_01_18/src/components/hal/src/target/_common/cc26xx" --include_path="C:/TI/ble_sdk_2_02_01_18/src/components/hal/src/inc" --include_path="C:/TI/ble_sdk_2_02_01_18/src/components/osal/src/inc" --include_path="C:/TI/ble_sdk_2_02_01_18/src/components/services/src/sdata" --include_path="C:/TI/ble_sdk_2_02_01_18/src/components/services/src/saddr" --include_path="C:/TI/ble_sdk_2_02_01_18/src/components/icall/src/inc" --include_path="C:/TI/ble_sdk_2_02_01_18/src/inc" --include_path="C:/TI/ble_sdk_2_02_01_18/src/rom" --include_path="C:/ti/tirtos_cc13xx_cc26xx_2_20_01_08/products/cc26xxware_2_24_02_17393" -g --c99 --gcc --define=BOARD_DISPLAY_EXCLUDE_LCD --define=BOARD_DISPLAY_EXCLUDE_UART --define=CC2650_LAUNCHXL --define=CC26XX --define=Display_DISABLE_ALL --define=HEAPMGR_SIZE=0 --define=ICALL_MAX_NUM_ENTITIES=6 --define=ICALL_MAX_NUM_TASKS=3 --define=POWER_MEASURE --define=POWER_SAVING --define=USE_ICALL --define=xdc_runtime_Assert_DISABLE_ALL --define=xdc_runtime_Log_DISABLE_ALL --diag_suppress=48 --diag_wrap=off --diag_warning=225 --display_error_number --gen_func_subsections=on --abi=eabi --preproc_with_compile --preproc_dependency="PROFILES/gattservapp_util.d" --obj_directory="PROFILES" --cmd_file="configPkg/compiler.opt" "C:/TI/ble_sdk_2_02_01_18/src/host/gattservapp_util.c"
    'Finished building: C:/TI/ble_sdk_2_02_01_18/src/host/gattservapp_util.c'
    ' '
    'Building file: C:/TI/ble_sdk_2_02_01_18/src/target/board.c'
    'Invoking: ARM Compiler'
    "C:/TI/bluetooth/ccsv6/tools/compiler/arm_15.12.3.LTS/bin/armcl" --cmd_file="C:/TI/ble_sdk_2_02_01_18/examples/cc2650lp/simple_peripheral/ccs/app/../../iar/stack/../../../../../src/config/build_components.opt" --cmd_file="C:/TI/ble_sdk_2_02_01_18/examples/cc2650lp/simple_peripheral/ccs/app/../../iar/stack/build_config.opt" --cmd_file="C:/TI/ble_sdk_2_02_01_18/examples/cc2650lp/simple_peripheral/ccs/app/../../iar/stack/../../ccs/config/ccs_compiler_defines.bcfg" -mv7M3 --code_state=16 -me -O4 --opt_for_speed=0 --include_path="C:/TI/bluetooth/ccsv6/tools/compiler/arm_15.12.3.LTS/include" --include_path="C:/TI/ble_sdk_2_02_01_18/src/examples/simple_peripheral/cc26xx/app" --include_path="C:/TI/ble_sdk_2_02_01_18/src/inc" --include_path="C:/TI/ble_sdk_2_02_01_18/src/icall/inc" --include_path="C:/TI/ble_sdk_2_02_01_18/src/profiles/roles/cc26xx" --include_path="C:/TI/ble_sdk_2_02_01_18/src/profiles/roles" --include_path="C:/TI/ble_sdk_2_02_01_18/src/profiles/dev_info" --include_path="C:/TI/ble_sdk_2_02_01_18/src/profiles/simple_profile/cc26xx" --include_path="C:/TI/ble_sdk_2_02_01_18/src/profiles/simple_profile" --include_path="C:/TI/ble_sdk_2_02_01_18/src/common/cc26xx" --include_path="C:/TI/ble_sdk_2_02_01_18/src/components/heapmgr" --include_path="C:/TI/ble_sdk_2_02_01_18/src/controller/cc26xx/inc" --include_path="C:/TI/ble_sdk_2_02_01_18/src/components/hal/src/target/_common" --include_path="C:/TI/ble_sdk_2_02_01_18/src/target" --include_path="C:/TI/ble_sdk_2_02_01_18/src/components/hal/src/target/_common/cc26xx" --include_path="C:/TI/ble_sdk_2_02_01_18/src/components/hal/src/inc" --include_path="C:/TI/ble_sdk_2_02_01_18/src/components/osal/src/inc" --include_path="C:/TI/ble_sdk_2_02_01_18/src/components/services/src/sdata" --include_path="C:/TI/ble_sdk_2_02_01_18/src/components/services/src/saddr" --include_path="C:/TI/ble_sdk_2_02_01_18/src/components/icall/src/inc" --include_path="C:/TI/ble_sdk_2_02_01_18/src/inc" --include_path="C:/TI/ble_sdk_2_02_01_18/src/rom" --include_path="C:/ti/tirtos_cc13xx_cc26xx_2_20_01_08/products/cc26xxware_2_24_02_17393" -g --c99 --gcc --define=BOARD_DISPLAY_EXCLUDE_LCD --define=BOARD_DISPLAY_EXCLUDE_UART --define=CC2650_LAUNCHXL --define=CC26XX --define=Display_DISABLE_ALL --define=HEAPMGR_SIZE=0 --define=ICALL_MAX_NUM_ENTITIES=6 --define=ICALL_MAX_NUM_TASKS=3 --define=POWER_MEASURE --define=POWER_SAVING --define=USE_ICALL --define=xdc_runtime_Assert_DISABLE_ALL --define=xdc_runtime_Log_DISABLE_ALL --diag_suppress=48 --diag_wrap=off --diag_warning=225 --display_error_number --gen_func_subsections=on --abi=eabi --preproc_with_compile --preproc_dependency="Startup/board.d" --obj_directory="Startup" --cmd_file="configPkg/compiler.opt" "C:/TI/ble_sdk_2_02_01_18/src/target/board.c"

    >> Compilation failure
    Startup/subdir_rules.mk:7: recipe for target 'Startup/board.obj' failed
    "C:/TI/ble_sdk_2_02_01_18/src/icall/inc/../../boards/CC2650_LAUNCHXL/CC2650_LAUNCHXL.c", line 51: fatal error #1965: cannot open source file "ti/drivers/timer/GPTimerCC26XX.h"
    1 catastrophic error detected in the compilation of "C:/TI/ble_sdk_2_02_01_18/src/target/board.c".
    Compilation terminated.
    gmake: *** [Startup/board.obj] Error 1
    'Building file: C:/TI/ble_sdk_2_02_01_18/examples/cc2650lp/simple_peripheral/iar/config/ccfg_app_ble.c'
    'Invoking: ARM Compiler'
    "C:/TI/bluetooth/ccsv6/tools/compiler/arm_15.12.3.LTS/bin/armcl" --cmd_file="C:/TI/ble_sdk_2_02_01_18/examples/cc2650lp/simple_peripheral/ccs/app/../../iar/stack/../../../../../src/config/build_components.opt" --cmd_file="C:/TI/ble_sdk_2_02_01_18/examples/cc2650lp/simple_peripheral/ccs/app/../../iar/stack/build_config.opt" --cmd_file="C:/TI/ble_sdk_2_02_01_18/examples/cc2650lp/simple_peripheral/ccs/app/../../iar/stack/../../ccs/config/ccs_compiler_defines.bcfg" -mv7M3 --code_state=16 -me -O4 --opt_for_speed=0 --include_path="C:/TI/bluetooth/ccsv6/tools/compiler/arm_15.12.3.LTS/include" --include_path="C:/TI/ble_sdk_2_02_01_18/src/examples/simple_peripheral/cc26xx/app" --include_path="C:/TI/ble_sdk_2_02_01_18/src/inc" --include_path="C:/TI/ble_sdk_2_02_01_18/src/icall/inc" --include_path="C:/TI/ble_sdk_2_02_01_18/src/profiles/roles/cc26xx" --include_path="C:/TI/ble_sdk_2_02_01_18/src/profiles/roles" --include_path="C:/TI/ble_sdk_2_02_01_18/src/profiles/dev_info" --include_path="C:/TI/ble_sdk_2_02_01_18/src/profiles/simple_profile/cc26xx" --include_path="C:/TI/ble_sdk_2_02_01_18/src/profiles/simple_profile" --include_path="C:/TI/ble_sdk_2_02_01_18/src/common/cc26xx" --include_path="C:/TI/ble_sdk_2_02_01_18/src/components/heapmgr" --include_path="C:/TI/ble_sdk_2_02_01_18/src/controller/cc26xx/inc" --include_path="C:/TI/ble_sdk_2_02_01_18/src/components/hal/src/target/_common" --include_path="C:/TI/ble_sdk_2_02_01_18/src/target" --include_path="C:/TI/ble_sdk_2_02_01_18/src/components/hal/src/target/_common/cc26xx" --include_path="C:/TI/ble_sdk_2_02_01_18/src/components/hal/src/inc" --include_path="C:/TI/ble_sdk_2_02_01_18/src/components/osal/src/inc" --include_path="C:/TI/ble_sdk_2_02_01_18/src/components/services/src/sdata" --include_path="C:/TI/ble_sdk_2_02_01_18/src/components/services/src/saddr" --include_path="C:/TI/ble_sdk_2_02_01_18/src/components/icall/src/inc" --include_path="C:/TI/ble_sdk_2_02_01_18/src/inc" --include_path="C:/TI/ble_sdk_2_02_01_18/src/rom" --include_path="C:/ti/tirtos_cc13xx_cc26xx_2_20_01_08/products/cc26xxware_2_24_02_17393" -g --c99 --gcc --define=BOARD_DISPLAY_EXCLUDE_LCD --define=BOARD_DISPLAY_EXCLUDE_UART --define=CC2650_LAUNCHXL --define=CC26XX --define=Display_DISABLE_ALL --define=HEAPMGR_SIZE=0 --define=ICALL_MAX_NUM_ENTITIES=6 --define=ICALL_MAX_NUM_TASKS=3 --define=POWER_MEASURE --define=POWER_SAVING --define=USE_ICALL --define=xdc_runtime_Assert_DISABLE_ALL --define=xdc_runtime_Log_DISABLE_ALL --diag_suppress=48 --diag_wrap=off --diag_warning=225 --display_error_number --gen_func_subsections=on --abi=eabi --preproc_with_compile --preproc_dependency="Startup/ccfg_app_ble.d" --obj_directory="Startup" --cmd_file="configPkg/compiler.opt" "C:/TI/ble_sdk_2_02_01_18/examples/cc2650lp/simple_peripheral/iar/config/ccfg_app_ble.c"
    'Finished building: C:/TI/ble_sdk_2_02_01_18/examples/cc2650lp/simple_peripheral/iar/config/ccfg_app_ble.c'
    ' '
    'Building file: C:/TI/ble_sdk_2_02_01_18/src/profiles/simple_profile/cc26xx/simple_gatt_profile.c'
    'Invoking: ARM Compiler'
    "C:/TI/bluetooth/ccsv6/tools/compiler/arm_15.12.3.LTS/bin/armcl" --cmd_file="C:/TI/ble_sdk_2_02_01_18/examples/cc2650lp/simple_peripheral/ccs/app/../../iar/stack/../../../../../src/config/build_components.opt" --cmd_file="C:/TI/ble_sdk_2_02_01_18/examples/cc2650lp/simple_peripheral/ccs/app/../../iar/stack/build_config.opt" --cmd_file="C:/TI/ble_sdk_2_02_01_18/examples/cc2650lp/simple_peripheral/ccs/app/../../iar/stack/../../ccs/config/ccs_compiler_defines.bcfg" -mv7M3 --code_state=16 -me -O4 --opt_for_speed=0 --include_path="C:/TI/bluetooth/ccsv6/tools/compiler/arm_15.12.3.LTS/include" --include_path="C:/TI/ble_sdk_2_02_01_18/src/examples/simple_peripheral/cc26xx/app" --include_path="C:/TI/ble_sdk_2_02_01_18/src/inc" --include_path="C:/TI/ble_sdk_2_02_01_18/src/icall/inc" --include_path="C:/TI/ble_sdk_2_02_01_18/src/profiles/roles/cc26xx" --include_path="C:/TI/ble_sdk_2_02_01_18/src/profiles/roles" --include_path="C:/TI/ble_sdk_2_02_01_18/src/profiles/dev_info" --include_path="C:/TI/ble_sdk_2_02_01_18/src/profiles/simple_profile/cc26xx" --include_path="C:/TI/ble_sdk_2_02_01_18/src/profiles/simple_profile" --include_path="C:/TI/ble_sdk_2_02_01_18/src/common/cc26xx" --include_path="C:/TI/ble_sdk_2_02_01_18/src/components/heapmgr" --include_path="C:/TI/ble_sdk_2_02_01_18/src/controller/cc26xx/inc" --include_path="C:/TI/ble_sdk_2_02_01_18/src/components/hal/src/target/_common" --include_path="C:/TI/ble_sdk_2_02_01_18/src/target" --include_path="C:/TI/ble_sdk_2_02_01_18/src/components/hal/src/target/_common/cc26xx" --include_path="C:/TI/ble_sdk_2_02_01_18/src/components/hal/src/inc" --include_path="C:/TI/ble_sdk_2_02_01_18/src/components/osal/src/inc" --include_path="C:/TI/ble_sdk_2_02_01_18/src/components/services/src/sdata" --include_path="C:/TI/ble_sdk_2_02_01_18/src/components/services/src/saddr" --include_path="C:/TI/ble_sdk_2_02_01_18/src/components/icall/src/inc" --include_path="C:/TI/ble_sdk_2_02_01_18/src/inc" --include_path="C:/TI/ble_sdk_2_02_01_18/src/rom" --include_path="C:/ti/tirtos_cc13xx_cc26xx_2_20_01_08/products/cc26xxware_2_24_02_17393" -g --c99 --gcc --define=BOARD_DISPLAY_EXCLUDE_LCD --define=BOARD_DISPLAY_EXCLUDE_UART --define=CC2650_LAUNCHXL --define=CC26XX --define=Display_DISABLE_ALL --define=HEAPMGR_SIZE=0 --define=ICALL_MAX_NUM_ENTITIES=6 --define=ICALL_MAX_NUM_TASKS=3 --define=POWER_MEASURE --define=POWER_SAVING --define=USE_ICALL --define=xdc_runtime_Assert_DISABLE_ALL --define=xdc_runtime_Log_DISABLE_ALL --diag_suppress=48 --diag_wrap=off --diag_warning=225 --display_error_number --gen_func_subsections=on --abi=eabi --preproc_with_compile --preproc_dependency="PROFILES/simple_gatt_profile.d" --obj_directory="PROFILES" --cmd_file="configPkg/compiler.opt" "C:/TI/ble_sdk_2_02_01_18/src/profiles/simple_profile/cc26xx/simple_gatt_profile.c"
    'Finished building: C:/TI/ble_sdk_2_02_01_18/src/profiles/simple_profile/cc26xx/simple_gatt_profile.c'
    ' '
    'Building file: C:/TI/ble_sdk_2_02_01_18/src/examples/simple_peripheral/cc26xx/app/main.c'
    'Invoking: ARM Compiler'
    "C:/TI/bluetooth/ccsv6/tools/compiler/arm_15.12.3.LTS/bin/armcl" --cmd_file="C:/TI/ble_sdk_2_02_01_18/examples/cc2650lp/simple_peripheral/ccs/app/../../iar/stack/../../../../../src/config/build_components.opt" --cmd_file="C:/TI/ble_sdk_2_02_01_18/examples/cc2650lp/simple_peripheral/ccs/app/../../iar/stack/build_config.opt" --cmd_file="C:/TI/ble_sdk_2_02_01_18/examples/cc2650lp/simple_peripheral/ccs/app/../../iar/stack/../../ccs/config/ccs_compiler_defines.bcfg" -mv7M3 --code_state=16 -me -O4 --opt_for_speed=0 --include_path="C:/TI/bluetooth/ccsv6/tools/compiler/arm_15.12.3.LTS/include" --include_path="C:/TI/ble_sdk_2_02_01_18/src/examples/simple_peripheral/cc26xx/app" --include_path="C:/TI/ble_sdk_2_02_01_18/src/inc" --include_path="C:/TI/ble_sdk_2_02_01_18/src/icall/inc" --include_path="C:/TI/ble_sdk_2_02_01_18/src/profiles/roles/cc26xx" --include_path="C:/TI/ble_sdk_2_02_01_18/src/profiles/roles" --include_path="C:/TI/ble_sdk_2_02_01_18/src/profiles/dev_info" --include_path="C:/TI/ble_sdk_2_02_01_18/src/profiles/simple_profile/cc26xx" --include_path="C:/TI/ble_sdk_2_02_01_18/src/profiles/simple_profile" --include_path="C:/TI/ble_sdk_2_02_01_18/src/common/cc26xx" --include_path="C:/TI/ble_sdk_2_02_01_18/src/components/heapmgr" --include_path="C:/TI/ble_sdk_2_02_01_18/src/controller/cc26xx/inc" --include_path="C:/TI/ble_sdk_2_02_01_18/src/components/hal/src/target/_common" --include_path="C:/TI/ble_sdk_2_02_01_18/src/target" --include_path="C:/TI/ble_sdk_2_02_01_18/src/components/hal/src/target/_common/cc26xx" --include_path="C:/TI/ble_sdk_2_02_01_18/src/components/hal/src/inc" --include_path="C:/TI/ble_sdk_2_02_01_18/src/components/osal/src/inc" --include_path="C:/TI/ble_sdk_2_02_01_18/src/components/services/src/sdata" --include_path="C:/TI/ble_sdk_2_02_01_18/src/components/services/src/saddr" --include_path="C:/TI/ble_sdk_2_02_01_18/src/components/icall/src/inc" --include_path="C:/TI/ble_sdk_2_02_01_18/src/inc" --include_path="C:/TI/ble_sdk_2_02_01_18/src/rom" --include_path="C:/ti/tirtos_cc13xx_cc26xx_2_20_01_08/products/cc26xxware_2_24_02_17393" -g --c99 --gcc --define=BOARD_DISPLAY_EXCLUDE_LCD --define=BOARD_DISPLAY_EXCLUDE_UART --define=CC2650_LAUNCHXL --define=CC26XX --define=Display_DISABLE_ALL --define=HEAPMGR_SIZE=0 --define=ICALL_MAX_NUM_ENTITIES=6 --define=ICALL_MAX_NUM_TASKS=3 --define=POWER_MEASURE --define=POWER_SAVING --define=USE_ICALL --define=xdc_runtime_Assert_DISABLE_ALL --define=xdc_runtime_Log_DISABLE_ALL --diag_suppress=48 --diag_wrap=off --diag_warning=225 --display_error_number --gen_func_subsections=on --abi=eabi --preproc_with_compile --preproc_dependency="Startup/main.d" --obj_directory="Startup" --cmd_file="configPkg/compiler.opt" "C:/TI/ble_sdk_2_02_01_18/src/examples/simple_peripheral/cc26xx/app/main.c"
    'Finished building: C:/TI/ble_sdk_2_02_01_18/src/examples/simple_peripheral/cc26xx/app/main.c'
    ' '
    'Building file: C:/TI/ble_sdk_2_02_01_18/src/profiles/roles/cc26xx/peripheral.c'
    'Invoking: ARM Compiler'
    "C:/TI/bluetooth/ccsv6/tools/compiler/arm_15.12.3.LTS/bin/armcl" --cmd_file="C:/TI/ble_sdk_2_02_01_18/examples/cc2650lp/simple_peripheral/ccs/app/../../iar/stack/../../../../../src/config/build_components.opt" --cmd_file="C:/TI/ble_sdk_2_02_01_18/examples/cc2650lp/simple_peripheral/ccs/app/../../iar/stack/build_config.opt" --cmd_file="C:/TI/ble_sdk_2_02_01_18/examples/cc2650lp/simple_peripheral/ccs/app/../../iar/stack/../../ccs/config/ccs_compiler_defines.bcfg" -mv7M3 --code_state=16 -me -O4 --opt_for_speed=0 --include_path="C:/TI/bluetooth/ccsv6/tools/compiler/arm_15.12.3.LTS/include" --include_path="C:/TI/ble_sdk_2_02_01_18/src/examples/simple_peripheral/cc26xx/app" --include_path="C:/TI/ble_sdk_2_02_01_18/src/inc" --include_path="C:/TI/ble_sdk_2_02_01_18/src/icall/inc" --include_path="C:/TI/ble_sdk_2_02_01_18/src/profiles/roles/cc26xx" --include_path="C:/TI/ble_sdk_2_02_01_18/src/profiles/roles" --include_path="C:/TI/ble_sdk_2_02_01_18/src/profiles/dev_info" --include_path="C:/TI/ble_sdk_2_02_01_18/src/profiles/simple_profile/cc26xx" --include_path="C:/TI/ble_sdk_2_02_01_18/src/profiles/simple_profile" --include_path="C:/TI/ble_sdk_2_02_01_18/src/common/cc26xx" --include_path="C:/TI/ble_sdk_2_02_01_18/src/components/heapmgr" --include_path="C:/TI/ble_sdk_2_02_01_18/src/controller/cc26xx/inc" --include_path="C:/TI/ble_sdk_2_02_01_18/src/components/hal/src/target/_common" --include_path="C:/TI/ble_sdk_2_02_01_18/src/target" --include_path="C:/TI/ble_sdk_2_02_01_18/src/components/hal/src/target/_common/cc26xx" --include_path="C:/TI/ble_sdk_2_02_01_18/src/components/hal/src/inc" --include_path="C:/TI/ble_sdk_2_02_01_18/src/components/osal/src/inc" --include_path="C:/TI/ble_sdk_2_02_01_18/src/components/services/src/sdata" --include_path="C:/TI/ble_sdk_2_02_01_18/src/components/services/src/saddr" --include_path="C:/TI/ble_sdk_2_02_01_18/src/components/icall/src/inc" --include_path="C:/TI/ble_sdk_2_02_01_18/src/inc" --include_path="C:/TI/ble_sdk_2_02_01_18/src/rom" --include_path="C:/ti/tirtos_cc13xx_cc26xx_2_20_01_08/products/cc26xxware_2_24_02_17393" -g --c99 --gcc --define=BOARD_DISPLAY_EXCLUDE_LCD --define=BOARD_DISPLAY_EXCLUDE_UART --define=CC2650_LAUNCHXL --define=CC26XX --define=Display_DISABLE_ALL --define=HEAPMGR_SIZE=0 --define=ICALL_MAX_NUM_ENTITIES=6 --define=ICALL_MAX_NUM_TASKS=3 --define=POWER_MEASURE --define=POWER_SAVING --define=USE_ICALL --define=xdc_runtime_Assert_DISABLE_ALL --define=xdc_runtime_Log_DISABLE_ALL --diag_suppress=48 --diag_wrap=off --diag_warning=225 --display_error_number --gen_func_subsections=on --abi=eabi --preproc_with_compile --preproc_dependency="PROFILES/peripheral.d" --obj_directory="PROFILES" --cmd_file="configPkg/compiler.opt" "C:/TI/ble_sdk_2_02_01_18/src/profiles/roles/cc26xx/peripheral.c"
    'Finished building: C:/TI/ble_sdk_2_02_01_18/src/profiles/roles/cc26xx/peripheral.c'
    ' '
    'Building file: C:/TI/ble_sdk_2_02_01_18/src/icall/app/icall_api.c'
    'Invoking: ARM Compiler'
    "C:/TI/bluetooth/ccsv6/tools/compiler/arm_15.12.3.LTS/bin/armcl" --cmd_file="C:/TI/ble_sdk_2_02_01_18/examples/cc2650lp/simple_peripheral/ccs/app/../../iar/stack/../../../../../src/config/build_components.opt" --cmd_file="C:/TI/ble_sdk_2_02_01_18/examples/cc2650lp/simple_peripheral/ccs/app/../../iar/stack/build_config.opt" --cmd_file="C:/TI/ble_sdk_2_02_01_18/examples/cc2650lp/simple_peripheral/ccs/app/../../iar/stack/../../ccs/config/ccs_compiler_defines.bcfg" -mv7M3 --code_state=16 -me -O4 --opt_for_speed=0 --include_path="C:/TI/bluetooth/ccsv6/tools/compiler/arm_15.12.3.LTS/include" --include_path="C:/TI/ble_sdk_2_02_01_18/src/examples/simple_peripheral/cc26xx/app" --include_path="C:/TI/ble_sdk_2_02_01_18/src/inc" --include_path="C:/TI/ble_sdk_2_02_01_18/src/icall/inc" --include_path="C:/TI/ble_sdk_2_02_01_18/src/profiles/roles/cc26xx" --include_path="C:/TI/ble_sdk_2_02_01_18/src/profiles/roles" --include_path="C:/TI/ble_sdk_2_02_01_18/src/profiles/dev_info" --include_path="C:/TI/ble_sdk_2_02_01_18/src/profiles/simple_profile/cc26xx" --include_path="C:/TI/ble_sdk_2_02_01_18/src/profiles/simple_profile" --include_path="C:/TI/ble_sdk_2_02_01_18/src/common/cc26xx" --include_path="C:/TI/ble_sdk_2_02_01_18/src/components/heapmgr" --include_path="C:/TI/ble_sdk_2_02_01_18/src/controller/cc26xx/inc" --include_path="C:/TI/ble_sdk_2_02_01_18/src/components/hal/src/target/_common" --include_path="C:/TI/ble_sdk_2_02_01_18/src/target" --include_path="C:/TI/ble_sdk_2_02_01_18/src/components/hal/src/target/_common/cc26xx" --include_path="C:/TI/ble_sdk_2_02_01_18/src/components/hal/src/inc" --include_path="C:/TI/ble_sdk_2_02_01_18/src/components/osal/src/inc" --include_path="C:/TI/ble_sdk_2_02_01_18/src/components/services/src/sdata" --include_path="C:/TI/ble_sdk_2_02_01_18/src/components/services/src/saddr" --include_path="C:/TI/ble_sdk_2_02_01_18/src/components/icall/src/inc" --include_path="C:/TI/ble_sdk_2_02_01_18/src/inc" --include_path="C:/TI/ble_sdk_2_02_01_18/src/rom" --include_path="C:/ti/tirtos_cc13xx_cc26xx_2_20_01_08/products/cc26xxware_2_24_02_17393" -g --c99 --gcc --define=BOARD_DISPLAY_EXCLUDE_LCD --define=BOARD_DISPLAY_EXCLUDE_UART --define=CC2650_LAUNCHXL --define=CC26XX --define=Display_DISABLE_ALL --define=HEAPMGR_SIZE=0 --define=ICALL_MAX_NUM_ENTITIES=6 --define=ICALL_MAX_NUM_TASKS=3 --define=POWER_MEASURE --define=POWER_SAVING --define=USE_ICALL --define=xdc_runtime_Assert_DISABLE_ALL --define=xdc_runtime_Log_DISABLE_ALL --diag_suppress=48 --diag_wrap=off --diag_warning=225 --display_error_number --gen_func_subsections=on --abi=eabi --preproc_with_compile --preproc_dependency="ICallBLE/icall_api.d" --obj_directory="ICallBLE" --cmd_file="configPkg/compiler.opt" "C:/TI/ble_sdk_2_02_01_18/src/icall/app/icall_api.c"
    'Finished building: C:/TI/ble_sdk_2_02_01_18/src/icall/app/icall_api.c'
    ' '
    gmake: Target 'all' not remade because of errors.

    **** Build Finished ****
  • Try to uninstall CCS and reinstall it to default folder too.
  • Wow!!!,now its working fine for me, thanks for your support YK Chen.....
  • You are welcome and it's good to know it works now.
  • HI,

    How can i transmit some data to mobile by using this example or,any sensor data transmission code is available for customized cc2640 ble board