This thread has been locked.

If you have a related question, please click the "Ask a related question" button in the top right corner. The newly created question will be automatically linked to this question.

MCU-PLUS-SDK-AM243X: an2434

Part Number: MCU-PLUS-SDK-AM243X

Tool/software:

 

To your attention the following mistake in mcu_plus_sdk_am243x_10_00_00_20

Awaiting your response:

AM243X compilation and link problem

I am using ccs version 12.8. I imported a project  “ipc_notify_echo_am243x-lp_m4fss0-0_nortos_ti-arm-clang” from “mcu_plus_sdk_am243x_10_00_00_20” and try to build it in my workspace.

Note: the same problem happens on any other project from the IPC group.

This was the error message:

makefile:150: recipe for target 'ipc_notify_echo_am243x-lp_m4fss0-0_nortos_ti-arm-clang.out' failed

"syscfg/linker.cmd", line 60: warning #10097: memory range not found: LOG_SHM_MEM on page 0

"syscfg/linker.cmd", line 59: error #10265: no valid memory range available for placement of ".bss.log_shared_mem"

"syscfg/linker.cmd", line 59: error #10099-D: program will not fit into available memory, or the section contains a call site that requires a trampoline that can't be generated for this section. run placement with alignment fails for section ".bss.log_shared_mem" size 0x3800

"syscfg/linker.cmd", line 57: warning #10097: memory range not found: USER_SHM_MEM on page 0

"syscfg/linker.cmd", line 56: error #10099-D: program will not fit into available memory, or the section contains a call site that requires a trampoline that can't be generated for this section. run placement with alignment fails for section ".bss.user_shared_mem" size 0

"syscfg/linker.cmd", line 63: warning #10097: memory range not found: IPC_VRING_MEM on page 0

"syscfg/linker.cmd", line 62: error #10099-D: program will not fit into available memory, or the section contains a call site that requires a trampoline that can't be generated for this section. run placement with alignment fails for section ".bss.ipc_vring_mem" size 0

error #10010: errors encountered during linking; "ipc_notify_echo_am243x-lp_m4fss0-0_nortos_ti-arm-clang.out" not built

tiarmclang: error: tiarmlnk command failed with exit code 1 (use -v to see invocation)

gmake[1]: *** [ipc_notify_echo_am243x-lp_m4fss0-0_nortos_ti-arm-clang.out] Error 1

gmake: *** [all] Error 2

makefile:146: recipe for target 'all' failed

 

**** Build Finished ****

Please let me know what happens. What can I do to solve this problem.