Part Number: SK-AM62A-LP
Dear ti team.
I downloaded to ti edgeai-github link and follow the manual as below.
git clone github.com/.../edgeai-tidl-tools.git
cd edgeai-tidl-tools
git checkout 08_06_00_03
git switch -c 08_06_00_03
export SOC=am62a
source ./setup.sh
During the downloading , there is some error of as below.
Installing python osrt packages...
Downloading tidl tools for AM62A SOC ...
Installing:onnxruntime
Installing:tflite_2.8
Installing:opencv
Installing:dlr
Traceback (most recent call last):
File "<stdin>", line 1, in <module>
ModuleNotFoundError: No module named 'dlr'
cp: cannot stat '/libdlr.so': No such file or directory
And I build the example code as below , but some error and failed to compile.
(tisdk) skilove13@skilove13-HP-Z800-Workstation:~/ti_am62a/edgeai-tidl-tools$
(tisdk) skilove13@skilove13-HP-Z800-Workstation:~/ti_am62a/edgeai-tidl-tools/build$ cmake ../examples && make -j && cd ..
-- Detected processor: x86_64
-- TARGET_DEVICE setting to: am62a
-- TARGET_CPU not specicfied using x86
-- CMAKE_BUILD_TYPE = Release PROJECT_NAME = edgeai_tidl_examples
-- setting TENSORFLOW_INSTALL_DIR path:/home/skilove13/ti_am62a/edgeai-tidl-tools/tidl_tools/osrt_deps/tflite_2.8_x86_u18/
-- setting DLR_INSTALL_DIR path:/home/skilove13/ti_am62a/edgeai-tidl-tools/tidl_tools/osrt_deps/dlr_1.10.0_x86_u18/
-- setting OPENCV_INSTALL_DIR path:/home/skilove13/ti_am62a/edgeai-tidl-tools/tidl_tools/osrt_deps/opencv_4.2.0_x86_u18/
-- Compiling for x86 with am62a config
-- CMAKE_BUILD_TYPE = Release PROJECT_NAME = edgeai_tidl_examples
-- setting TENSORFLOW_INSTALL_DIR path:/home/skilove13/ti_am62a/edgeai-tidl-tools/tidl_tools/osrt_deps/tflite_2.8_x86_u18/
-- setting DLR_INSTALL_DIR path:/home/skilove13/ti_am62a/edgeai-tidl-tools/tidl_tools/osrt_deps/dlr_1.10.0_x86_u18/
-- setting OPENCV_INSTALL_DIR path:/home/skilove13/ti_am62a/edgeai-tidl-tools/tidl_tools/osrt_deps/opencv_4.2.0_x86_u18/
-- Compiling for x86 with am62a config
-- CMAKE_BUILD_TYPE = Release PROJECT_NAME = edgeai_tidl_examples
-- setting TENSORFLOW_INSTALL_DIR path:/home/skilove13/ti_am62a/edgeai-tidl-tools/tidl_tools/osrt_deps/tflite_2.8_x86_u18/
-- setting DLR_INSTALL_DIR path:/home/skilove13/ti_am62a/edgeai-tidl-tools/tidl_tools/osrt_deps/dlr_1.10.0_x86_u18/
-- setting OPENCV_INSTALL_DIR path:/home/skilove13/ti_am62a/edgeai-tidl-tools/tidl_tools/osrt_deps/opencv_4.2.0_x86_u18/
-- Compiling for x86 with am62a config
-- CMAKE_BUILD_TYPE = Release PROJECT_NAME = tfl_main
-- setting TENSORFLOW_INSTALL_DIR path:/home/skilove13/ti_am62a/edgeai-tidl-tools/tidl_tools/osrt_deps/tflite_2.8_x86_u18/
-- setting DLR_INSTALL_DIR path:/home/skilove13/ti_am62a/edgeai-tidl-tools/tidl_tools/osrt_deps/dlr_1.10.0_x86_u18/
-- setting OPENCV_INSTALL_DIR path:/home/skilove13/ti_am62a/edgeai-tidl-tools/tidl_tools/osrt_deps/opencv_4.2.0_x86_u18/
-- Compiling for x86 with am62a config
-- CMAKE_BUILD_TYPE = Release PROJECT_NAME = tfl_priority_scheduling
-- setting TENSORFLOW_INSTALL_DIR path:/home/skilove13/ti_am62a/edgeai-tidl-tools/tidl_tools/osrt_deps/tflite_2.8_x86_u18/
-- setting DLR_INSTALL_DIR path:/home/skilove13/ti_am62a/edgeai-tidl-tools/tidl_tools/osrt_deps/dlr_1.10.0_x86_u18/
-- setting OPENCV_INSTALL_DIR path:/home/skilove13/ti_am62a/edgeai-tidl-tools/tidl_tools/osrt_deps/opencv_4.2.0_x86_u18/
-- Compiling for x86 with am62a config
-- CMAKE_BUILD_TYPE = Release PROJECT_NAME = ort_priority_scheduling
-- setting TENSORFLOW_INSTALL_DIR path:/home/skilove13/ti_am62a/edgeai-tidl-tools/tidl_tools/osrt_deps/tflite_2.8_x86_u18/
-- setting DLR_INSTALL_DIR path:/home/skilove13/ti_am62a/edgeai-tidl-tools/tidl_tools/osrt_deps/dlr_1.10.0_x86_u18/
-- setting OPENCV_INSTALL_DIR path:/home/skilove13/ti_am62a/edgeai-tidl-tools/tidl_tools/osrt_deps/opencv_4.2.0_x86_u18/
-- Compiling for x86 with am62a config
-- CMAKE_BUILD_TYPE = Release PROJECT_NAME = edgeai_tidl_examples
-- setting TENSORFLOW_INSTALL_DIR path:/home/skilove13/ti_am62a/edgeai-tidl-tools/tidl_tools/osrt_deps/tflite_2.8_x86_u18/
-- setting DLR_INSTALL_DIR path:/home/skilove13/ti_am62a/edgeai-tidl-tools/tidl_tools/osrt_deps/dlr_1.10.0_x86_u18/
-- setting OPENCV_INSTALL_DIR path:/home/skilove13/ti_am62a/edgeai-tidl-tools/tidl_tools/osrt_deps/opencv_4.2.0_x86_u18/
-- Compiling for x86 with am62a config
-- CMAKE_BUILD_TYPE = Release PROJECT_NAME = tidlrt_clasification
-- setting TENSORFLOW_INSTALL_DIR path:/home/skilove13/ti_am62a/edgeai-tidl-tools/tidl_tools/osrt_deps/tflite_2.8_x86_u18/
-- setting DLR_INSTALL_DIR path:/home/skilove13/ti_am62a/edgeai-tidl-tools/tidl_tools/osrt_deps/dlr_1.10.0_x86_u18/
-- setting OPENCV_INSTALL_DIR path:/home/skilove13/ti_am62a/edgeai-tidl-tools/tidl_tools/osrt_deps/opencv_4.2.0_x86_u18/
-- Compiling for x86 with am62a config
-- CMAKE_BUILD_TYPE = Release PROJECT_NAME = dlr_main
-- setting TENSORFLOW_INSTALL_DIR path:/home/skilove13/ti_am62a/edgeai-tidl-tools/tidl_tools/osrt_deps/tflite_2.8_x86_u18/
-- setting DLR_INSTALL_DIR path:/home/skilove13/ti_am62a/edgeai-tidl-tools/tidl_tools/osrt_deps/dlr_1.10.0_x86_u18/
-- setting OPENCV_INSTALL_DIR path:/home/skilove13/ti_am62a/edgeai-tidl-tools/tidl_tools/osrt_deps/opencv_4.2.0_x86_u18/
-- Compiling for x86 with am62a config
-- CMAKE_BUILD_TYPE = Release PROJECT_NAME = ort_main
-- setting TENSORFLOW_INSTALL_DIR path:/home/skilove13/ti_am62a/edgeai-tidl-tools/tidl_tools/osrt_deps/tflite_2.8_x86_u18/
-- setting DLR_INSTALL_DIR path:/home/skilove13/ti_am62a/edgeai-tidl-tools/tidl_tools/osrt_deps/dlr_1.10.0_x86_u18/
-- setting OPENCV_INSTALL_DIR path:/home/skilove13/ti_am62a/edgeai-tidl-tools/tidl_tools/osrt_deps/opencv_4.2.0_x86_u18/
-- Compiling for x86 with am62a config
-- Configuring done
-- Generating done
-- Build files have been written to: /home/skilove13/ti_am62a/edgeai-tidl-tools/build
osrt_cpp/post_process/CMakeFiles/post_process.dir/flags.make:6: *** missing separator. Stop.
osrt_cpp/pre_process/CMakeFiles/pre_process.dir/flags.make:6: *** missing separator. Stop.
CMakeFiles/Makefile2:282: recipe for target 'osrt_cpp/post_process/CMakeFiles/post_process.dir/all' failed
make[1]: *** [osrt_cpp/post_process/CMakeFiles/post_process.dir/all] Error 2
make[1]: *** Waiting for unfinished jobs....
CMakeFiles/Makefile2:309: recipe for target 'osrt_cpp/pre_process/CMakeFiles/pre_process.dir/all' failed
make[1]: *** [osrt_cpp/pre_process/CMakeFiles/pre_process.dir/all] Error 2
osrt_cpp/utils/CMakeFiles/utils.dir/flags.make:6: *** missing separator. Stop.
osrt_cpp/advanced_examples/utils/CMakeFiles/utils_adv.dir/flags.make:6: *** missing separator. Stop.
CMakeFiles/Makefile2:336: recipe for target 'osrt_cpp/utils/CMakeFiles/utils.dir/all' failed
make[1]: *** [osrt_cpp/utils/CMakeFiles/utils.dir/all] Error 2
CMakeFiles/Makefile2:453: recipe for target 'osrt_cpp/advanced_examples/utils/CMakeFiles/utils_adv.dir/all' failed
make[1]: *** [osrt_cpp/advanced_examples/utils/CMakeFiles/utils_adv.dir/all] Error 2
Makefile:129: recipe for target 'all' failed
make: *** [all] Error 2
Can you guide what is wrong of my compile and setup error?
Regards,