Part Number: TDA3XEVM
Tool/software: TI C/C++ Compiler
I bulid the C:\PROCESSOR_SDK_VISION_03_02_00_00\ti_components\algorithms\eve_sw_01_18_00_00\kernels\imgsiglib\BlockAverage2x2 Project
1. Use Gmake,It failed like error followed:
"C:\PROCESSOR_SDK_VISION_03_02_00_00\ti_components\algorithms\eve_sw_01_18_00_00\kernels\imgsiglib\BlockAverage2x2>cd test
C:\PROCESSOR_SDK_VISION_03_02_00_00\ti_components\algorithms\eve_sw_01_18_00_00\kernels\imgsiglib\BlockAverage2x2\test>gmake
C:/ti/ccsv5/utils/cygwin/\mkdir -p ".\elf_out" || cd ".\elf_out"
"g++" -g -fpermissive -I"C:\Program Files\Texas Instruments\ARP32_tools"\include\vcop -I"..\..\..\..\common" -I"..\..\..\common" -DVCOP_HOST_EMULATION -o ".\elf_out"\a.exe -I"..\inc" vcop_blockAverage2x2_tb.c "..\..\..\..\common\eve_profile.c" "..\..\..\..\common\curve_fitting.c" "..\..\..\..\common\configparser.c"
C:/Users/shibe/AppData/Local/Temp/make20376-1.sh: line 1: g++: command not found
gmake: *** [a.out] Error 127"
2. Then I move the code to CCS to build a project?
I build it , there are errors followed:
**** Build of configuration Debug for project vcop_example ****
"C:\\ti_ccs7_4\\ccsv7\\utils\\bin\\gmake" -k -j 4 all -O
'Building file: "../main.c"'
'Invoking: EVE Compiler'
"C:/ti_ccs7_4/ccsv7/tools/compiler/arp32_1.0.9/bin/cl-arp32" -v210 -g --include_path="C:/ti_ccs7_4/ccsv7/tools/compiler/arp32_1.0.9/include/vcop" --include_path="C:/PROCESSOR_SDK_VISION_03_02_00_00/ti_components/algorithms/eve_sw_01_18_00_00/kernels/imgsiglib/BlockAverage2x2/inc" --include_path="C:/PROCESSOR_SDK_VISION_03_02_00_00/ti_components/algorithms/eve_sw_01_18_00_00/kernels/imgsiglib" --include_path="C:/PROCESSOR_SDK_VISION_03_02_00_00/ti_components/algorithms/eve_sw_01_18_00_00/starterware/inc/baseaddress/vayu/eve" --include_path="C:/PROCESSOR_SDK_VISION_03_02_00_00/ti_components/algorithms/eve_sw_01_18_00_00/starterware/inc" --include_path="E:/Code/CCS/CCS_7_4_workspace/vcop_example" --include_path="C:/ti_ccs7_4/ccsv7/tools/compiler/arp32_1.0.9/include" --diag_warning=225 --display_error_number --diag_wrap=off --preproc_with_compile --preproc_dependency="main.d_raw" "../main.c"
"../main.c", line 101: warning #552-D: variable "ok" was set but never used
'Finished building: "../main.c"'
'Building target: "vcop_example.out"'
'Invoking: EVE Linker'
"C:/ti_ccs7_4/ccsv7/tools/compiler/arp32_1.0.9/bin/cl-arp32" -v210 -g --diag_warning=225 --display_error_number --diag_wrap=off -z -m"vcop_example.map" -i"C:/ti_ccs7_4/ccsv7/tools/compiler/arp32_1.0.9/lib" -i"C:/ti_ccs7_4/ccsv7/tools/compiler/arp32_1.0.9/include" --reread_libs --warn_sections --xml_link_info="vcop_example_linkInfo.xml" --rom_model -o "vcop_example.out" "./boot_arp32.obj" "./main.obj" "../linker.cmd" -llibc.a
<Linking>
undefined first referenced
symbol in file
--------- ----------------
vcop_blockAverage2x2_uchar ./main.obj
vcop_blockAverage2x2_uchar_cn ./main.obj
error #10234-D: unresolved symbols remain
warning #10063-D: entry-point symbol other than "_c_int00" specified: "_reset_handler"
error #10010: errors encountered during linking; "vcop_example.out" not built
>> Compilation failure
makefile:142: recipe for target 'vcop_example.out' failed
gmake[1]: *** [vcop_example.out] Error 1
makefile:138: recipe for target 'all' failed
gmake: *** [all] Error 2
**** Build Finished ****
How Can I build the "C:\PROCESSOR_SDK_VISION_03_02_00_00\ti_components\algorithms\eve_sw_01_18_00_00\kernels\imgsiglib" example?