This thread has been locked.

If you have a related question, please click the "Ask a related question" button in the top right corner. The newly created question will be automatically linked to this question.

CCS/AM5728: Creating a CCS Project for SBL IN MMCSD,compilation failed

Part Number: AM5728
Other Parts Discussed in Thread: TEST2,

Tool/software: Code Composer Studio

when i compile the project for SBL without MMCSD,there was no problem. But when i set the boot mode to MMCSD, there were many problems.

And the console is below:


**** Build of configuration Debug for project test2 ****
"C:\\ti\\ccsv8\\utils\\bin\\gmake" -k -j 4 all -O
 
Building file: "../MMCSD_soc.c"
Invoking: GNU Compiler
"C:/ti/ccsv8/tools/compiler/gcc-arm-none-eabi-7-2017-q4-major-win32/bin/arm-none-eabi-gcc.exe" -c -mcpu=cortex-a15 -march=armv7-a -mtune=cortex-a15 -marm -mfloat-abi=hard -mfpu=neon -Dam5728 -Dcore0 -D__ARMv7 -DSOC_AM572x -DAM572x_BUILD -DevmAM572x -DOPP_NOM -I"C:/TI_WORKSPACE/test2" -I"C:/ti/pdk_am57xx_1_0_13/packages" -I"C:/ti/pdk_am57xx_1_0_13/packages/ti/csl" -I"C:/ti/pdk_am57xx_1_0_13/packages/ti/board" -I"C:/ti/pdk_am57xx_1_0_13/packages/ti/boot/sbl/board/src" -I"C:/ti/pdk_am57xx_1_0_13/packages/ti/boot/sbl/src/rprc" -I"C:/ti/ccsv8/tools/compiler/gcc-arm-none-eabi-7-2017-q4-major-win32/arm-none-eabi/include" -I"C:/ti/pdk_am57xx_1_0_13/packages/ti/boot/sbl/src/mmcsd" -I"C:/ti/pdk_am57xx_1_0_13/packages/ti/boot/sbl/soc/am57xx" -Og -g -gdwarf-3 -gstrict-dwarf -Wall -specs="\"/\"/\"nosys.specs/\" -g -gdwarf-3 -gstrict-dwarf -Wall -D__ARMv7 -DSOC_AM572x -mtune=cortex-a15 -march=armv7-a -marm -mfloat-abi=hard -mfpu=neon -DAM572x_BUILD -DevmAM572x -DOPP_NOM -DBOOT_MMCSD" -MMD -MP -MF"MMCSD_soc.d" -MT"MMCSD_soc.o"   -o"MMCSD_soc.o" "../MMCSD_soc.c"
subdir_rules.mk:9: recipe for target 'MMCSD_soc.o' failed
arm-none-eabi-gcc.exe: error: "/"/"nosys.specs/" -g -gdwarf-3 -gstrict-dwarf -Wall -D__ARMv7 -DSOC_AM572x -mtune=cortex-a15 -march=armv7-a -marm -mfloat-abi=hard -mfpu=neon -DAM572x_BUILD -DevmAM572x -DOPP_NOM -DBOOT_MMCSD: Invalid argument
gmake: *** [MMCSD_soc.o] Error 1
Building file: "../UART_soc.c"
Invoking: GNU Compiler
"C:/ti/ccsv8/tools/compiler/gcc-arm-none-eabi-7-2017-q4-major-win32/bin/arm-none-eabi-gcc.exe" -c -mcpu=cortex-a15 -march=armv7-a -mtune=cortex-a15 -marm -mfloat-abi=hard -mfpu=neon -Dam5728 -Dcore0 -D__ARMv7 -DSOC_AM572x -DAM572x_BUILD -DevmAM572x -DOPP_NOM -I"C:/TI_WORKSPACE/test2" -I"C:/ti/pdk_am57xx_1_0_13/packages" -I"C:/ti/pdk_am57xx_1_0_13/packages/ti/csl" -I"C:/ti/pdk_am57xx_1_0_13/packages/ti/board" -I"C:/ti/pdk_am57xx_1_0_13/packages/ti/boot/sbl/board/src" -I"C:/ti/pdk_am57xx_1_0_13/packages/ti/boot/sbl/src/rprc" -I"C:/ti/ccsv8/tools/compiler/gcc-arm-none-eabi-7-2017-q4-major-win32/arm-none-eabi/include" -I"C:/ti/pdk_am57xx_1_0_13/packages/ti/boot/sbl/src/mmcsd" -I"C:/ti/pdk_am57xx_1_0_13/packages/ti/boot/sbl/soc/am57xx" -Og -g -gdwarf-3 -gstrict-dwarf -Wall -specs="\"/\"/\"nosys.specs/\" -g -gdwarf-3 -gstrict-dwarf -Wall -D__ARMv7 -DSOC_AM572x -mtune=cortex-a15 -march=armv7-a -marm -mfloat-abi=hard -mfpu=neon -DAM572x_BUILD -DevmAM572x -DOPP_NOM -DBOOT_MMCSD" -MMD -MP -MF"UART_soc.d" -MT"UART_soc.o"   -o"UART_soc.o" "../UART_soc.c"
subdir_rules.mk:9: recipe for target 'UART_soc.o' failed
arm-none-eabi-gcc.exe: error: "/"/"nosys.specs/" -g -gdwarf-3 -gstrict-dwarf -Wall -D__ARMv7 -DSOC_AM572x -mtune=cortex-a15 -march=armv7-a -marm -mfloat-abi=hard -mfpu=neon -DAM572x_BUILD -DevmAM572x -DOPP_NOM -DBOOT_MMCSD: Invalid argument
gmake: *** [UART_soc.o] Error 1
Building file: "../sbl_avs_config.c"
Invoking: GNU Compiler
"C:/ti/ccsv8/tools/compiler/gcc-arm-none-eabi-7-2017-q4-major-win32/bin/arm-none-eabi-gcc.exe" -c -mcpu=cortex-a15 -march=armv7-a -mtune=cortex-a15 -marm -mfloat-abi=hard -mfpu=neon -Dam5728 -Dcore0 -D__ARMv7 -DSOC_AM572x -DAM572x_BUILD -DevmAM572x -DOPP_NOM -I"C:/TI_WORKSPACE/test2" -I"C:/ti/pdk_am57xx_1_0_13/packages" -I"C:/ti/pdk_am57xx_1_0_13/packages/ti/csl" -I"C:/ti/pdk_am57xx_1_0_13/packages/ti/board" -I"C:/ti/pdk_am57xx_1_0_13/packages/ti/boot/sbl/board/src" -I"C:/ti/pdk_am57xx_1_0_13/packages/ti/boot/sbl/src/rprc" -I"C:/ti/ccsv8/tools/compiler/gcc-arm-none-eabi-7-2017-q4-major-win32/arm-none-eabi/include" -I"C:/ti/pdk_am57xx_1_0_13/packages/ti/boot/sbl/src/mmcsd" -I"C:/ti/pdk_am57xx_1_0_13/packages/ti/boot/sbl/soc/am57xx" -Og -g -gdwarf-3 -gstrict-dwarf -Wall -specs="\"/\"/\"nosys.specs/\" -g -gdwarf-3 -gstrict-dwarf -Wall -D__ARMv7 -DSOC_AM572x -mtune=cortex-a15 -march=armv7-a -marm -mfloat-abi=hard -mfpu=neon -DAM572x_BUILD -DevmAM572x -DOPP_NOM -DBOOT_MMCSD" -MMD -MP -MF"sbl_avs_config.d" -MT"sbl_avs_config.o"   -o"sbl_avs_config.o" "../sbl_avs_config.c"
subdir_rules.mk:9: recipe for target 'sbl_avs_config.o' failed
arm-none-eabi-gcc.exe: error: "/"/"nosys.specs/" -g -gdwarf-3 -gstrict-dwarf -Wall -D__ARMv7 -DSOC_AM572x -mtune=cortex-a15 -march=armv7-a -marm -mfloat-abi=hard -mfpu=neon -DAM572x_BUILD -DevmAM572x -DOPP_NOM -DBOOT_MMCSD: Invalid argument
gmake: *** [sbl_avs_config.o] Error 1
Building file: "../sbl_init.S"
Invoking: GNU Compiler
"C:/ti/ccsv8/tools/compiler/gcc-arm-none-eabi-7-2017-q4-major-win32/bin/arm-none-eabi-gcc.exe" -c -mcpu=cortex-a15 -march=armv7-a -mtune=cortex-a15 -marm -mfloat-abi=hard -mfpu=neon -Dam5728 -Dcore0 -D__ARMv7 -DSOC_AM572x -DAM572x_BUILD -DevmAM572x -DOPP_NOM -I"C:/TI_WORKSPACE/test2" -I"C:/ti/pdk_am57xx_1_0_13/packages" -I"C:/ti/pdk_am57xx_1_0_13/packages/ti/csl" -I"C:/ti/pdk_am57xx_1_0_13/packages/ti/board" -I"C:/ti/pdk_am57xx_1_0_13/packages/ti/boot/sbl/board/src" -I"C:/ti/pdk_am57xx_1_0_13/packages/ti/boot/sbl/src/rprc" -I"C:/ti/ccsv8/tools/compiler/gcc-arm-none-eabi-7-2017-q4-major-win32/arm-none-eabi/include" -I"C:/ti/pdk_am57xx_1_0_13/packages/ti/boot/sbl/src/mmcsd" -I"C:/ti/pdk_am57xx_1_0_13/packages/ti/boot/sbl/soc/am57xx" -Og -g -gdwarf-3 -gstrict-dwarf -Wall -specs="\"/\"/\"nosys.specs/\" -g -gdwarf-3 -gstrict-dwarf -Wall -D__ARMv7 -DSOC_AM572x -mtune=cortex-a15 -march=armv7-a -marm -mfloat-abi=hard -mfpu=neon -DAM572x_BUILD -DevmAM572x -DOPP_NOM -DBOOT_MMCSD" -MMD -MP -MF"sbl_init.d" -MT"sbl_init.o" -x assembler-with-cpp  -o"sbl_init.o" "../sbl_init.S"
subdir_rules.mk:16: recipe for target 'sbl_init.o' failed
arm-none-eabi-gcc.exe: error: "/"/"nosys.specs/" -g -gdwarf-3 -gstrict-dwarf -Wall -D__ARMv7 -DSOC_AM572x -mtune=cortex-a15 -march=armv7-a -marm -mfloat-abi=hard -mfpu=neon -DAM572x_BUILD -DevmAM572x -DOPP_NOM -DBOOT_MMCSD: Invalid argument
gmake: *** [sbl_init.o] Error 1
Building file: "../sbl_main.c"
Invoking: GNU Compiler
"C:/ti/ccsv8/tools/compiler/gcc-arm-none-eabi-7-2017-q4-major-win32/bin/arm-none-eabi-gcc.exe" -c -mcpu=cortex-a15 -march=armv7-a -mtune=cortex-a15 -marm -mfloat-abi=hard -mfpu=neon -Dam5728 -Dcore0 -D__ARMv7 -DSOC_AM572x -DAM572x_BUILD -DevmAM572x -DOPP_NOM -I"C:/TI_WORKSPACE/test2" -I"C:/ti/pdk_am57xx_1_0_13/packages" -I"C:/ti/pdk_am57xx_1_0_13/packages/ti/csl" -I"C:/ti/pdk_am57xx_1_0_13/packages/ti/board" -I"C:/ti/pdk_am57xx_1_0_13/packages/ti/boot/sbl/board/src" -I"C:/ti/pdk_am57xx_1_0_13/packages/ti/boot/sbl/src/rprc" -I"C:/ti/ccsv8/tools/compiler/gcc-arm-none-eabi-7-2017-q4-major-win32/arm-none-eabi/include" -I"C:/ti/pdk_am57xx_1_0_13/packages/ti/boot/sbl/src/mmcsd" -I"C:/ti/pdk_am57xx_1_0_13/packages/ti/boot/sbl/soc/am57xx" -Og -g -gdwarf-3 -gstrict-dwarf -Wall -specs="\"/\"/\"nosys.specs/\" -g -gdwarf-3 -gstrict-dwarf -Wall -D__ARMv7 -DSOC_AM572x -mtune=cortex-a15 -march=armv7-a -marm -mfloat-abi=hard -mfpu=neon -DAM572x_BUILD -DevmAM572x -DOPP_NOM -DBOOT_MMCSD" -MMD -MP -MF"sbl_main.d" -MT"sbl_main.o"   -o"sbl_main.o" "../sbl_main.c"
subdir_rules.mk:9: recipe for target 'sbl_main.o' failed
arm-none-eabi-gcc.exe: error: "/"/"nosys.specs/" -g -gdwarf-3 -gstrict-dwarf -Wall -D__ARMv7 -DSOC_AM572x -mtune=cortex-a15 -march=armv7-a -marm -mfloat-abi=hard -mfpu=neon -DAM572x_BUILD -DevmAM572x -DOPP_NOM -DBOOT_MMCSD: Invalid argument
gmake: *** [sbl_main.o] Error 1
Building file: "../sbl_mmcsd.c"
Invoking: GNU Compiler
"C:/ti/ccsv8/tools/compiler/gcc-arm-none-eabi-7-2017-q4-major-win32/bin/arm-none-eabi-gcc.exe" -c -mcpu=cortex-a15 -march=armv7-a -mtune=cortex-a15 -marm -mfloat-abi=hard -mfpu=neon -Dam5728 -Dcore0 -D__ARMv7 -DSOC_AM572x -DAM572x_BUILD -DevmAM572x -DOPP_NOM -I"C:/TI_WORKSPACE/test2" -I"C:/ti/pdk_am57xx_1_0_13/packages" -I"C:/ti/pdk_am57xx_1_0_13/packages/ti/csl" -I"C:/ti/pdk_am57xx_1_0_13/packages/ti/board" -I"C:/ti/pdk_am57xx_1_0_13/packages/ti/boot/sbl/board/src" -I"C:/ti/pdk_am57xx_1_0_13/packages/ti/boot/sbl/src/rprc" -I"C:/ti/ccsv8/tools/compiler/gcc-arm-none-eabi-7-2017-q4-major-win32/arm-none-eabi/include" -I"C:/ti/pdk_am57xx_1_0_13/packages/ti/boot/sbl/src/mmcsd" -I"C:/ti/pdk_am57xx_1_0_13/packages/ti/boot/sbl/soc/am57xx" -Og -g -gdwarf-3 -gstrict-dwarf -Wall -specs="\"/\"/\"nosys.specs/\" -g -gdwarf-3 -gstrict-dwarf -Wall -D__ARMv7 -DSOC_AM572x -mtune=cortex-a15 -march=armv7-a -marm -mfloat-abi=hard -mfpu=neon -DAM572x_BUILD -DevmAM572x -DOPP_NOM -DBOOT_MMCSD" -MMD -MP -MF"sbl_mmcsd.d" -MT"sbl_mmcsd.o"   -o"sbl_mmcsd.o" "../sbl_mmcsd.c"
subdir_rules.mk:9: recipe for target 'sbl_mmcsd.o' failed
arm-none-eabi-gcc.exe: error: "/"/"nosys.specs/" -g -gdwarf-3 -gstrict-dwarf -Wall -D__ARMv7 -DSOC_AM572x -mtune=cortex-a15 -march=armv7-a -marm -mfloat-abi=hard -mfpu=neon -DAM572x_BUILD -DevmAM572x -DOPP_NOM -DBOOT_MMCSD: Invalid argument
gmake: *** [sbl_mmcsd.o] Error 1
Building file: "../sbl_prcm.c"
Invoking: GNU Compiler
"C:/ti/ccsv8/tools/compiler/gcc-arm-none-eabi-7-2017-q4-major-win32/bin/arm-none-eabi-gcc.exe" -c -mcpu=cortex-a15 -march=armv7-a -mtune=cortex-a15 -marm -mfloat-abi=hard -mfpu=neon -Dam5728 -Dcore0 -D__ARMv7 -DSOC_AM572x -DAM572x_BUILD -DevmAM572x -DOPP_NOM -I"C:/TI_WORKSPACE/test2" -I"C:/ti/pdk_am57xx_1_0_13/packages" -I"C:/ti/pdk_am57xx_1_0_13/packages/ti/csl" -I"C:/ti/pdk_am57xx_1_0_13/packages/ti/board" -I"C:/ti/pdk_am57xx_1_0_13/packages/ti/boot/sbl/board/src" -I"C:/ti/pdk_am57xx_1_0_13/packages/ti/boot/sbl/src/rprc" -I"C:/ti/ccsv8/tools/compiler/gcc-arm-none-eabi-7-2017-q4-major-win32/arm-none-eabi/include" -I"C:/ti/pdk_am57xx_1_0_13/packages/ti/boot/sbl/src/mmcsd" -I"C:/ti/pdk_am57xx_1_0_13/packages/ti/boot/sbl/soc/am57xx" -Og -g -gdwarf-3 -gstrict-dwarf -Wall -specs="\"/\"/\"nosys.specs/\" -g -gdwarf-3 -gstrict-dwarf -Wall -D__ARMv7 -DSOC_AM572x -mtune=cortex-a15 -march=armv7-a -marm -mfloat-abi=hard -mfpu=neon -DAM572x_BUILD -DevmAM572x -DOPP_NOM -DBOOT_MMCSD" -MMD -MP -MF"sbl_prcm.d" -MT"sbl_prcm.o"   -o"sbl_prcm.o" "../sbl_prcm.c"
subdir_rules.mk:9: recipe for target 'sbl_prcm.o' failed
arm-none-eabi-gcc.exe: error: "/"/"nosys.specs/" -g -gdwarf-3 -gstrict-dwarf -Wall -D__ARMv7 -DSOC_AM572x -mtune=cortex-a15 -march=armv7-a -marm -mfloat-abi=hard -mfpu=neon -DAM572x_BUILD -DevmAM572x -DOPP_NOM -DBOOT_MMCSD: Invalid argument
gmake: *** [sbl_prcm.o] Error 1
Building file: "../sbl_rprc.c"
Invoking: GNU Compiler
"C:/ti/ccsv8/tools/compiler/gcc-arm-none-eabi-7-2017-q4-major-win32/bin/arm-none-eabi-gcc.exe" -c -mcpu=cortex-a15 -march=armv7-a -mtune=cortex-a15 -marm -mfloat-abi=hard -mfpu=neon -Dam5728 -Dcore0 -D__ARMv7 -DSOC_AM572x -DAM572x_BUILD -DevmAM572x -DOPP_NOM -I"C:/TI_WORKSPACE/test2" -I"C:/ti/pdk_am57xx_1_0_13/packages" -I"C:/ti/pdk_am57xx_1_0_13/packages/ti/csl" -I"C:/ti/pdk_am57xx_1_0_13/packages/ti/board" -I"C:/ti/pdk_am57xx_1_0_13/packages/ti/boot/sbl/board/src" -I"C:/ti/pdk_am57xx_1_0_13/packages/ti/boot/sbl/src/rprc" -I"C:/ti/ccsv8/tools/compiler/gcc-arm-none-eabi-7-2017-q4-major-win32/arm-none-eabi/include" -I"C:/ti/pdk_am57xx_1_0_13/packages/ti/boot/sbl/src/mmcsd" -I"C:/ti/pdk_am57xx_1_0_13/packages/ti/boot/sbl/soc/am57xx" -Og -g -gdwarf-3 -gstrict-dwarf -Wall -specs="\"/\"/\"nosys.specs/\" -g -gdwarf-3 -gstrict-dwarf -Wall -D__ARMv7 -DSOC_AM572x -mtune=cortex-a15 -march=armv7-a -marm -mfloat-abi=hard -mfpu=neon -DAM572x_BUILD -DevmAM572x -DOPP_NOM -DBOOT_MMCSD" -MMD -MP -MF"sbl_rprc.d" -MT"sbl_rprc.o"   -o"sbl_rprc.o" "../sbl_rprc.c"
subdir_rules.mk:9: recipe for target 'sbl_rprc.o' failed
arm-none-eabi-gcc.exe: error: "/"/"nosys.specs/" -g -gdwarf-3 -gstrict-dwarf -Wall -D__ARMv7 -DSOC_AM572x -mtune=cortex-a15 -march=armv7-a -marm -mfloat-abi=hard -mfpu=neon -DAM572x_BUILD -DevmAM572x -DOPP_NOM -DBOOT_MMCSD: Invalid argument
gmake: *** [sbl_rprc.o] Error 1
Building file: "../sbl_slave_core_boot.c"
Invoking: GNU Compiler
"C:/ti/ccsv8/tools/compiler/gcc-arm-none-eabi-7-2017-q4-major-win32/bin/arm-none-eabi-gcc.exe" -c -mcpu=cortex-a15 -march=armv7-a -mtune=cortex-a15 -marm -mfloat-abi=hard -mfpu=neon -Dam5728 -Dcore0 -D__ARMv7 -DSOC_AM572x -DAM572x_BUILD -DevmAM572x -DOPP_NOM -I"C:/TI_WORKSPACE/test2" -I"C:/ti/pdk_am57xx_1_0_13/packages" -I"C:/ti/pdk_am57xx_1_0_13/packages/ti/csl" -I"C:/ti/pdk_am57xx_1_0_13/packages/ti/board" -I"C:/ti/pdk_am57xx_1_0_13/packages/ti/boot/sbl/board/src" -I"C:/ti/pdk_am57xx_1_0_13/packages/ti/boot/sbl/src/rprc" -I"C:/ti/ccsv8/tools/compiler/gcc-arm-none-eabi-7-2017-q4-major-win32/arm-none-eabi/include" -I"C:/ti/pdk_am57xx_1_0_13/packages/ti/boot/sbl/src/mmcsd" -I"C:/ti/pdk_am57xx_1_0_13/packages/ti/boot/sbl/soc/am57xx" -Og -g -gdwarf-3 -gstrict-dwarf -Wall -specs="\"/\"/\"nosys.specs/\" -g -gdwarf-3 -gstrict-dwarf -Wall -D__ARMv7 -DSOC_AM572x -mtune=cortex-a15 -march=armv7-a -marm -mfloat-abi=hard -mfpu=neon -DAM572x_BUILD -DevmAM572x -DOPP_NOM -DBOOT_MMCSD" -MMD -MP -MF"sbl_slave_core_boot.d" -MT"sbl_slave_core_boot.o"   -o"sbl_slave_core_boot.o" "../sbl_slave_core_boot.c"
subdir_rules.mk:9: recipe for target 'sbl_slave_core_boot.o' failed
arm-none-eabi-gcc.exe: error: "/"/"nosys.specs/" -g -gdwarf-3 -gstrict-dwarf -Wall -D__ARMv7 -DSOC_AM572x -mtune=cortex-a15 -march=armv7-a -marm -mfloat-abi=hard -mfpu=neon -DAM572x_BUILD -DevmAM572x -DOPP_NOM -DBOOT_MMCSD: Invalid argument
gmake: *** [sbl_slave_core_boot.o] Error 1
Building file: "../sbl_startup.c"
Invoking: GNU Compiler
"C:/ti/ccsv8/tools/compiler/gcc-arm-none-eabi-7-2017-q4-major-win32/bin/arm-none-eabi-gcc.exe" -c -mcpu=cortex-a15 -march=armv7-a -mtune=cortex-a15 -marm -mfloat-abi=hard -mfpu=neon -Dam5728 -Dcore0 -D__ARMv7 -DSOC_AM572x -DAM572x_BUILD -DevmAM572x -DOPP_NOM -I"C:/TI_WORKSPACE/test2" -I"C:/ti/pdk_am57xx_1_0_13/packages" -I"C:/ti/pdk_am57xx_1_0_13/packages/ti/csl" -I"C:/ti/pdk_am57xx_1_0_13/packages/ti/board" -I"C:/ti/pdk_am57xx_1_0_13/packages/ti/boot/sbl/board/src" -I"C:/ti/pdk_am57xx_1_0_13/packages/ti/boot/sbl/src/rprc" -I"C:/ti/ccsv8/tools/compiler/gcc-arm-none-eabi-7-2017-q4-major-win32/arm-none-eabi/include" -I"C:/ti/pdk_am57xx_1_0_13/packages/ti/boot/sbl/src/mmcsd" -I"C:/ti/pdk_am57xx_1_0_13/packages/ti/boot/sbl/soc/am57xx" -Og -g -gdwarf-3 -gstrict-dwarf -Wall -specs="\"/\"/\"nosys.specs/\" -g -gdwarf-3 -gstrict-dwarf -Wall -D__ARMv7 -DSOC_AM572x -mtune=cortex-a15 -march=armv7-a -marm -mfloat-abi=hard -mfpu=neon -DAM572x_BUILD -DevmAM572x -DOPP_NOM -DBOOT_MMCSD" -MMD -MP -MF"sbl_startup.d" -MT"sbl_startup.o"   -o"sbl_startup.o" "../sbl_startup.c"
subdir_rules.mk:9: recipe for target 'sbl_startup.o' failed
arm-none-eabi-gcc.exe: error: "/"/"nosys.specs/" -g -gdwarf-3 -gstrict-dwarf -Wall -D__ARMv7 -DSOC_AM572x -mtune=cortex-a15 -march=armv7-a -marm -mfloat-abi=hard -mfpu=neon -DAM572x_BUILD -DevmAM572x -DOPP_NOM -DBOOT_MMCSD: Invalid argument
gmake: *** [sbl_startup.o] Error 1
gmake: Target 'all' not remade because of errors.
**** Build Finished ****