Part Number: TDA2EVM5777
Other Parts Discussed in Thread: MATHLIB, PGA460
Tool/software: TI C/C++ Compiler
Hello, I'm using processor radar sdk and changed usecase on "UC_radar_objectdetect_null". I added it to uc_cfg.mk from path "vision_sdk\my_apps\configs\tda2xx_evm_bios_radar". But i get error when compiling:
=============================================
...
undefined first referenced
symbol in file
--------- ----------------
ChainsCommon_ar12xxChangeParameters C:/PROCESSOR_SDK_RADAR_03_08_00_00/vision_sdk/binaries/my_apps/tda2xx_evm_bios_radar/lib/tda2xx-evm/m4/release/app_alg_plugins.aem4<chains_radarobjectdetectnull.oem4>
ChainsCommon_ar12xxCheckParameters C:/PROCESSOR_SDK_RADAR_03_08_00_00/vision_sdk/binaries/my_apps/tda2xx_evm_bios_radar/lib/tda2xx-evm/m4/release/app_alg_plugins.aem4<chains_radarobjectdetectnull.oem4>
ChainsCommon_ar12xxConfig C:/PROCESSOR_SDK_RADAR_03_08_00_00/vision_sdk/binaries/my_apps/tda2xx_evm_bios_radar/lib/tda2xx-evm/m4/release/app_alg_plugins.aem4<chains_radarobjectdetectnull.oem4>
ChainsCommon_ar12xxRunTimeMenu C:/PROCESSOR_SDK_RADAR_03_08_00_00/vision_sdk/binaries/my_apps/tda2xx_evm_bios_radar/lib/tda2xx-evm/m4/release/app_alg_plugins.aem4<chains_common_sample_ar12xx_config.oem4>
ChainsCommon_ar12xxSetIssCaptureParams C:/PROCESSOR_SDK_RADAR_03_08_00_00/vision_sdk/binaries/my_apps/tda2xx_evm_bios_radar/lib/tda2xx-evm/m4/release/app_alg_plugins.aem4<chains_radarobjectdetectnull.oem4>
ChainsCommon_ar12xxStart C:/PROCESSOR_SDK_RADAR_03_08_00_00/vision_sdk/binaries/my_apps/tda2xx_evm_bios_radar/lib/tda2xx-evm/m4/release/app_alg_plugins.aem4<chains_radarobjectdetectnull.oem4>
ChainsCommon_ar12xxStop C:/PROCESSOR_SDK_RADAR_03_08_00_00/vision_sdk/binaries/my_apps/tda2xx_evm_bios_radar/lib/tda2xx-evm/m4/release/app_alg_plugins.aem4<chains_radarobjectdetectnull.oem4>
error: unresolved symbols remain
error: errors encountered during linking;
"C:/PROCESSOR_SDK_RADAR_03_08_00_00/vision_sdk/binaries/my_apps/tda2xx_evm_b
ios_radar/vision_sdk/bin/tda2xx-evm/vision_sdk_ipu1_0_release.xem4" not
built
gmake[7]: *** [C:/PROCESSOR_SDK_RADAR_03_08_00_00/vision_sdk/binaries/my_apps/tda2xx_evm_bios_radar/vision_sdk/bin/tda2xx-evm/vision_sdk_ipu1_0_release.xem4] Error 1
gmake[7]: Leaving directory `C:/PROCESSOR_SDK_RADAR_03_08_00_00/vision_sdk/links_fw/src/rtos/bios_app_common/tda2xx/ipu1_0'
gmake[6]: *** [ipu1_0] Error 2
gmake[6]: Leaving directory `C:/PROCESSOR_SDK_RADAR_03_08_00_00/vision_sdk/links_fw/src/rtos/bios_app_common/tda2xx/ipu1_0'
gmake[5]: *** [apps_ipu1_0] Error 2
gmake[5]: Leaving directory `C:/PROCESSOR_SDK_RADAR_03_08_00_00/vision_sdk/links_fw/src/rtos'
gmake[4]: *** [apps] Error 2
gmake[4]: Leaving directory `C:/PROCESSOR_SDK_RADAR_03_08_00_00/vision_sdk/links_fw/src/rtos'
gmake[3]: *** [apps] Error 2
gmake[3]: Leaving directory `C:/PROCESSOR_SDK_RADAR_03_08_00_00/vision_sdk/my_apps'
gmake[2]: *** [apps_exe] Error 2
gmake[2]: Leaving directory `C:/PROCESSOR_SDK_RADAR_03_08_00_00/vision_sdk/build'
gmake[1]: *** [my_apps] Error 2
gmake[1]: Leaving directory `C:/PROCESSOR_SDK_RADAR_03_08_00_00/vision_sdk/build'
gmake: *** [vision_sdk] Error 2
=============================================
Log from gmake -s showconfig command:
=============================================
...
# Alg plugins included in build,
# ALG_radarprocess
#
# Use-cases included in build,
# UC_radar_read_fft_write UC_radar_objectdetect_null
#
C:/PROCESSOR_SDK_RADAR_03_08_00_00/vision_sdk/my_apps/configs/autorules_footer_cfg.mk:67: ipc_PATH does not exist! ()
#
# CPUs that are NOT required but included in config [ tda2xx_evm_bios_radar ],
#
# WARNING: A15_0 can be excluded from application
#
# CPUs that are required but not included in config [ tda2xx_evm_bios_radar ],
#
#
# Edit C:/PROCESSOR_SDK_RADAR_03_08_00_00/vision_sdk/apps/configs/tda2xx_evm_bios_radar/cfg.mk to include or exclude CPUs in an application
#