Part Number: TDA4VMXEVM
Other Parts Discussed in Thread: INA226
Hi,
as the subject says: I have tried with PSDKRA 6.2.0 to (re)build all with a "make all" (as explained in docs!) in pdk/packages/ti/build. Following snipped shows the problem:
xxxxx@HOST:~/xxxxx/psdk/pdk/packages/ti/build$ make -s all BOARD=j721e_evm
....
Nothing to be done for j721e pm_cpuidle_testapp
Nothing to be done for j721e pm_baremetal_junction_temp_testapp
Nothing to be done for j721e pm_ina226_testapp
Nothing to be done for j721e pm_core_loading_testapp
Nothing to be done for j721e pm_rtos_testapp
Nothing to be done for j721e pm_rtos_thermal_testapp
make[3]: /home/xxxxx/xxxxxx/psdk/gcc-linaro-7.2.1-2017.11-x86_64_aarch64-elf/bin/aarch64-elf-objcopy: Command not found
/home/xxxxx/xxxxxx/psdk/pdk/packages/ti/build/makerules/common.mk:559: recipe for target 'sbl_img_bin' failed
make[3]: *** [sbl_img_bin] Error 127
/home/xxxxx/xxxxxx/psdk/pdk/packages/ti/build/makefile:327: recipe for target 'sbl_mmcsd_img' failed
make[2]: *** [sbl_mmcsd_img] Error 2
/home/xxxxx/xxxxxx/psdk/pdk/packages/ti/build/makefile:102: recipe for target 'sbl_mmcsd_img_has_dep' failed
make[1]: *** [sbl_mmcsd_img_has_dep] Error 2
makefile:120: recipe for target 'all_apps' failed
make: *** [all_apps] Error 2
This shows in my opinion 2 errors: one is the path gcc-linaro-7.2.1-2017.11-x86_64_aarch64-elf. This could be (maybe temporary) fixed with setting of environment variable TOOLCHAIN_PATH_GCC_ARCH64 (set by default in pdk_tools_path.mk). The other one, name of objcopy command is to fix in makerules/rules_a72.mk or similar. (e.g. without "-elf")
Is this problem known? And how will this be fixed in future?
Thanks for answer, Thomas
